ltx/en_us_holycross/eo.e02:eo.Doxasticon.incipit	…
ltx/en_us_holycross/eo.e02:eo.Doxasticon.mode	@ltx/en_us_holycross/miscellanea:misc.Mode2
ltx/en_us_holycross/eo.e02:eo.Doxasticon.text	
ltx/en_us_holycross/eo.e02:eo.Exaposteilarion.greekmelody	@ltx/en_us_holycross/he.a.m2:heAU.ToisMathitaisSynelthomen.greekname
ltx/en_us_holycross/eo.e02:eo.Exaposteilarion.incipit	…
ltx/en_us_holycross/eo.e02:eo.Exaposteilarion.melody	@ltx/en_us_holycross/he.a.m2:heAU.ToisMathitaisSynelthomen.name
ltx/en_us_holycross/eo.e02:eo.Exaposteilarion.mode	@ltx/en_us_holycross/miscellanea:misc.Mode2
ltx/en_us_holycross/eo.e02:eo.Exaposteilarion.text	
ltx/en_us_holycross/eo.e02:eo.Theotokion.incipit	…
ltx/en_us_holycross/eo.e02:eo.Theotokion.melody	@ltx/en_us_holycross/he.a.m2:heAU.ToisMathitaisSynelthomen.name
ltx/en_us_holycross/eo.e02:eo.Theotokion.mode	@ltx/en_us_holycross/miscellanea:misc.Mode2
ltx/en_us_holycross/eo.e02:eo.Theotokion.text	
ltx/en_us_holycross/eo.e02:eo.title	
