ltx/en_us_holycross/he.h.m1:heHE.AftiIKliti.greekname	
ltx/en_us_holycross/he.h.m1:heHE.AftiIKliti.incipit	…
ltx/en_us_holycross/he.h.m1:heHE.AftiIKliti.melody	@ltx/en_us_holycross/miscellanea:misc.HeirmosNotMetered
ltx/en_us_holycross/he.h.m1:heHE.AftiIKliti.mode	@ltx/en_us_holycross/miscellanea:misc.Mode1
ltx/en_us_holycross/he.h.m1:heHE.AftiIKliti.name	
ltx/en_us_holycross/he.h.m1:heHE.AftiIKliti.notmetered	N/M (This is it.)
ltx/en_us_holycross/he.h.m1:heHE.AftiIKliti.ode	@ltx/en_us_holycross/miscellanea:misc.Ode8
ltx/en_us_holycross/he.h.m1:heHE.AftiIKliti.text	
ltx/en_us_holycross/he.h.m1:heHE.AlionPontogenes.greekname	
ltx/en_us_holycross/he.h.m1:heHE.AlionPontogenes.incipit	…
ltx/en_us_holycross/he.h.m1:heHE.AlionPontogenes.melody	@ltx/en_us_holycross/miscellanea:misc.HeirmosNotMetered
ltx/en_us_holycross/he.h.m1:heHE.AlionPontogenes.mode	@ltx/en_us_holycross/miscellanea:misc.Mode1
ltx/en_us_holycross/he.h.m1:heHE.AlionPontogenes.name	
ltx/en_us_holycross/he.h.m1:heHE.AlionPontogenes.notmetered	N/M (Briny and born.)
ltx/en_us_holycross/he.h.m1:heHE.AlionPontogenes.ode	@ltx/en_us_holycross/miscellanea:misc.Ode6
ltx/en_us_holycross/he.h.m1:heHE.AlionPontogenes.text	
ltx/en_us_holycross/he.h.m1:heHE.AnastaseosImera.greekname	
ltx/en_us_holycross/he.h.m1:heHE.AnastaseosImera.incipit	…
ltx/en_us_holycross/he.h.m1:heHE.AnastaseosImera.melody	@ltx/en_us_holycross/miscellanea:misc.HeirmosNotMetered
ltx/en_us_holycross/he.h.m1:heHE.AnastaseosImera.mode	@ltx/en_us_holycross/miscellanea:misc.Mode1
ltx/en_us_holycross/he.h.m1:heHE.AnastaseosImera.name	
ltx/en_us_holycross/he.h.m1:heHE.AnastaseosImera.notmetered	N/M (Resurrection Day.)
ltx/en_us_holycross/he.h.m1:heHE.AnastaseosImera.ode	@ltx/en_us_holycross/miscellanea:misc.Ode1
ltx/en_us_holycross/he.h.m1:heHE.AnastaseosImera.text	
ltx/en_us_holycross/he.h.m1:heHE.AnthrakaPyrosTonIsaiou.greekname	
ltx/en_us_holycross/he.h.m1:heHE.AnthrakaPyrosTonIsaiou.incipit	…
ltx/en_us_holycross/he.h.m1:heHE.AnthrakaPyrosTonIsaiou.melody	@ltx/en_us_holycross/miscellanea:misc.HeirmosNotMetered
ltx/en_us_holycross/he.h.m1:heHE.AnthrakaPyrosTonIsaiou.mode	@ltx/en_us_holycross/miscellanea:misc.Mode1
ltx/en_us_holycross/he.h.m1:heHE.AnthrakaPyrosTonIsaiou.name	
ltx/en_us_holycross/he.h.m1:heHE.AnthrakaPyrosTonIsaiou.notmetered	N/M ()
ltx/en_us_holycross/he.h.m1:heHE.AnthrakaPyrosTonIsaiou.ode	@ltx/en_us_holycross/miscellanea:misc.Ode5
ltx/en_us_holycross/he.h.m1:heHE.AnthrakaPyrosTonIsaiou.text	
ltx/en_us_holycross/he.h.m1:heHE.AperripsasMe.greekname	
ltx/en_us_holycross/he.h.m1:heHE.AperripsasMe.incipit	…
ltx/en_us_holycross/he.h.m1:heHE.AperripsasMe.melody	@ltx/en_us_holycross/miscellanea:misc.HeirmosNotMetered
ltx/en_us_holycross/he.h.m1:heHE.AperripsasMe.mode	@ltx/en_us_holycross/miscellanea:misc.Mode1
ltx/en_us_holycross/he.h.m1:heHE.AperripsasMe.name	
ltx/en_us_holycross/he.h.m1:heHE.AperripsasMe.notmetered	N/M ()
ltx/en_us_holycross/he.h.m1:heHE.AperripsasMe.ode	@ltx/en_us_holycross/miscellanea:misc.Ode6
ltx/en_us_holycross/he.h.m1:heHE.AperripsasMe.text	
ltx/en_us_holycross/he.h.m1:heHE.AsomenPantesLaoi.greekname	
ltx/en_us_holycross/he.h.m1:heHE.AsomenPantesLaoi.incipit	…
ltx/en_us_holycross/he.h.m1:heHE.AsomenPantesLaoi.melody	@ltx/en_us_holycross/miscellanea:misc.HeirmosNotMetered
ltx/en_us_holycross/he.h.m1:heHE.AsomenPantesLaoi.mode	@ltx/en_us_holycross/miscellanea:misc.Mode1
ltx/en_us_holycross/he.h.m1:heHE.AsomenPantesLaoi.name	All people, sing to the Lord.
ltx/en_us_holycross/he.h.m1:heHE.AsomenPantesLaoi.notmetered	N/M (All people, sing to the Lord.)
ltx/en_us_holycross/he.h.m1:heHE.AsomenPantesLaoi.ode	@ltx/en_us_holycross/miscellanea:misc.Ode1
ltx/en_us_holycross/he.h.m1:heHE.AsomenPantesLaoi.text	
ltx/en_us_holycross/he.h.m1:heHE.AvramiaioiPaides.greekname	
ltx/en_us_holycross/he.h.m1:heHE.AvramiaioiPaides.incipit	…
ltx/en_us_holycross/he.h.m1:heHE.AvramiaioiPaides.melody	@ltx/en_us_holycross/miscellanea:misc.HeirmosNotMetered
ltx/en_us_holycross/he.h.m1:heHE.AvramiaioiPaides.mode	@ltx/en_us_holycross/miscellanea:misc.Mode1
ltx/en_us_holycross/he.h.m1:heHE.AvramiaioiPaides.name	
ltx/en_us_holycross/he.h.m1:heHE.AvramiaioiPaides.notmetered	N/M ()
ltx/en_us_holycross/he.h.m1:heHE.AvramiaioiPaides.ode	@ltx/en_us_holycross/miscellanea:misc.Ode7
ltx/en_us_holycross/he.h.m1:heHE.AvramiaioiPaides.text	
ltx/en_us_holycross/he.h.m1:heHE.ChaireParthenias.greekname	
ltx/en_us_holycross/he.h.m1:heHE.ChaireParthenias.incipit	…
ltx/en_us_holycross/he.h.m1:heHE.ChaireParthenias.melody	@ltx/en_us_holycross/miscellanea:misc.HeirmosNotMetered
ltx/en_us_holycross/he.h.m1:heHE.ChaireParthenias.mode	@ltx/en_us_holycross/miscellanea:misc.Mode1
ltx/en_us_holycross/he.h.m1:heHE.ChaireParthenias.name	
ltx/en_us_holycross/he.h.m1:heHE.ChaireParthenias.notmetered	N/M ()
ltx/en_us_holycross/he.h.m1:heHE.ChaireParthenias.ode	@ltx/en_us_holycross/miscellanea:misc.Ode9
ltx/en_us_holycross/he.h.m1:heHE.ChaireParthenias.text	
ltx/en_us_holycross/he.h.m1:heHE.CheirasEnToLakko.greekname	
ltx/en_us_holycross/he.h.m1:heHE.CheirasEnToLakko.incipit	…
ltx/en_us_holycross/he.h.m1:heHE.CheirasEnToLakko.melody	@ltx/en_us_holycross/miscellanea:misc.HeirmosNotMetered
ltx/en_us_holycross/he.h.m1:heHE.CheirasEnToLakko.mode	@ltx/en_us_holycross/miscellanea:misc.Mode1
ltx/en_us_holycross/he.h.m1:heHE.CheirasEnToLakko.name	
ltx/en_us_holycross/he.h.m1:heHE.CheirasEnToLakko.notmetered	N/M (Daniel, who is known.)
ltx/en_us_holycross/he.h.m1:heHE.CheirasEnToLakko.ode	@ltx/en_us_holycross/miscellanea:misc.Ode8
ltx/en_us_holycross/he.h.m1:heHE.CheirasEnToLakko.text	
ltx/en_us_holycross/he.h.m1:heHE.ChristosGennatai.greekname	
ltx/en_us_holycross/he.h.m1:heHE.ChristosGennatai.incipit	…
ltx/en_us_holycross/he.h.m1:heHE.ChristosGennatai.melody	@ltx/en_us_holycross/miscellanea:misc.HeirmosNotMetered
ltx/en_us_holycross/he.h.m1:heHE.ChristosGennatai.mode	@ltx/en_us_holycross/miscellanea:misc.Mode1
ltx/en_us_holycross/he.h.m1:heHE.ChristosGennatai.name	
ltx/en_us_holycross/he.h.m1:heHE.ChristosGennatai.notmetered	N/M (Christ is born.)
ltx/en_us_holycross/he.h.m1:heHE.ChristosGennatai.ode	@ltx/en_us_holycross/miscellanea:misc.Ode1
ltx/en_us_holycross/he.h.m1:heHE.ChristosGennatai.text	
ltx/en_us_holycross/he.h.m1:heHE.DeftePomaPiomen.greekname	
ltx/en_us_holycross/he.h.m1:heHE.DeftePomaPiomen.incipit	…
ltx/en_us_holycross/he.h.m1:heHE.DeftePomaPiomen.melody	@ltx/en_us_holycross/miscellanea:misc.HeirmosNotMetered
ltx/en_us_holycross/he.h.m1:heHE.DeftePomaPiomen.mode	@ltx/en_us_holycross/miscellanea:misc.Mode1
ltx/en_us_holycross/he.h.m1:heHE.DeftePomaPiomen.name	
ltx/en_us_holycross/he.h.m1:heHE.DeftePomaPiomen.notmetered	N/M (Come and let us drink.)
ltx/en_us_holycross/he.h.m1:heHE.DeftePomaPiomen.ode	@ltx/en_us_holycross/miscellanea:misc.Ode3
ltx/en_us_holycross/he.h.m1:heHE.DeftePomaPiomen.text	
ltx/en_us_holycross/he.h.m1:heHE.EikoniLatrevein.greekname	
ltx/en_us_holycross/he.h.m1:heHE.EikoniLatrevein.incipit	…
ltx/en_us_holycross/he.h.m1:heHE.EikoniLatrevein.melody	@ltx/en_us_holycross/miscellanea:misc.HeirmosNotMetered
ltx/en_us_holycross/he.h.m1:heHE.EikoniLatrevein.mode	@ltx/en_us_holycross/miscellanea:misc.Mode1
ltx/en_us_holycross/he.h.m1:heHE.EikoniLatrevein.name	
ltx/en_us_holycross/he.h.m1:heHE.EikoniLatrevein.notmetered	N/M ()
ltx/en_us_holycross/he.h.m1:heHE.EikoniLatrevein.ode	@ltx/en_us_holycross/miscellanea:misc.Ode7
ltx/en_us_holycross/he.h.m1:heHE.EikoniLatrevein.text	
ltx/en_us_holycross/he.h.m1:heHE.EisakikoaKyrieTinAkoin.greekname	
ltx/en_us_holycross/he.h.m1:heHE.EisakikoaKyrieTinAkoin.incipit	…
ltx/en_us_holycross/he.h.m1:heHE.EisakikoaKyrieTinAkoin.melody	@ltx/en_us_holycross/miscellanea:misc.HeirmosNotMetered
ltx/en_us_holycross/he.h.m1:heHE.EisakikoaKyrieTinAkoin.mode	@ltx/en_us_holycross/miscellanea:misc.Mode1
ltx/en_us_holycross/he.h.m1:heHE.EisakikoaKyrieTinAkoin.name	
ltx/en_us_holycross/he.h.m1:heHE.EisakikoaKyrieTinAkoin.notmetered	N/M ()
ltx/en_us_holycross/he.h.m1:heHE.EisakikoaKyrieTinAkoin.ode	@ltx/en_us_holycross/miscellanea:misc.Ode4
ltx/en_us_holycross/he.h.m1:heHE.EisakikoaKyrieTinAkoin.text	
ltx/en_us_holycross/he.h.m1:heHE.EkNyktosErgon.greekname	
ltx/en_us_holycross/he.h.m1:heHE.EkNyktosErgon.incipit	…
ltx/en_us_holycross/he.h.m1:heHE.EkNyktosErgon.melody	@ltx/en_us_holycross/miscellanea:misc.HeirmosNotMetered
ltx/en_us_holycross/he.h.m1:heHE.EkNyktosErgon.mode	@ltx/en_us_holycross/miscellanea:misc.Mode1
ltx/en_us_holycross/he.h.m1:heHE.EkNyktosErgon.name	
ltx/en_us_holycross/he.h.m1:heHE.EkNyktosErgon.notmetered	N/M (Now rising.)
ltx/en_us_holycross/he.h.m1:heHE.EkNyktosErgon.ode	@ltx/en_us_holycross/miscellanea:misc.Ode5
ltx/en_us_holycross/he.h.m1:heHE.EkNyktosErgon.text	
ltx/en_us_holycross/he.h.m1:heHE.EkNyktosErgon1.text	
ltx/en_us_holycross/he.h.m1:heHE.EkNyktosErgon2.text	
ltx/en_us_holycross/he.h.m1:heHE.EkNyktosErgon3.text	
ltx/en_us_holycross/he.h.m1:heHE.EkNyktosErgon4.text	
ltx/en_us_holycross/he.h.m1:heHE.EkNyktosErgon5.text	
ltx/en_us_holycross/he.h.m1:heHE.EkNyktosOrthrizontes.greekname	
ltx/en_us_holycross/he.h.m1:heHE.EkNyktosOrthrizontes.incipit	…
ltx/en_us_holycross/he.h.m1:heHE.EkNyktosOrthrizontes.melody	@ltx/en_us_holycross/miscellanea:misc.HeirmosNotMetered
ltx/en_us_holycross/he.h.m1:heHE.EkNyktosOrthrizontes.mode	@ltx/en_us_holycross/miscellanea:misc.Mode1
ltx/en_us_holycross/he.h.m1:heHE.EkNyktosOrthrizontes.name	
ltx/en_us_holycross/he.h.m1:heHE.EkNyktosOrthrizontes.notmetered	N/M ()
ltx/en_us_holycross/he.h.m1:heHE.EkNyktosOrthrizontes.ode	@ltx/en_us_holycross/miscellanea:misc.Ode5
ltx/en_us_holycross/he.h.m1:heHE.EkNyktosOrthrizontes.text	
ltx/en_us_holycross/he.h.m1:heHE.EkNyktosOrthrizontesYmnoumenSe.greekname	
ltx/en_us_holycross/he.h.m1:heHE.EkNyktosOrthrizontesYmnoumenSe.incipit	…
ltx/en_us_holycross/he.h.m1:heHE.EkNyktosOrthrizontesYmnoumenSe.melody	@ltx/en_us_holycross/miscellanea:misc.Heirmos
ltx/en_us_holycross/he.h.m1:heHE.EkNyktosOrthrizontesYmnoumenSe.mode	@ltx/en_us_holycross/miscellanea:misc.Mode1
ltx/en_us_holycross/he.h.m1:heHE.EkNyktosOrthrizontesYmnoumenSe.name	Rising from the night, we sing.
ltx/en_us_holycross/he.h.m1:heHE.EkNyktosOrthrizontesYmnoumenSe.notmetered	N/M (Rising from the night, we sing.)
ltx/en_us_holycross/he.h.m1:heHE.EkNyktosOrthrizontesYmnoumenSe.ode	@ltx/en_us_holycross/miscellanea:misc.Ode5
ltx/en_us_holycross/he.h.m1:heHE.EkNyktosOrthrizontesYmnoumenSe.text	
ltx/en_us_holycross/he.h.m1:heHE.EkyklosenImas.greekname	
ltx/en_us_holycross/he.h.m1:heHE.EkyklosenImas.incipit	…
ltx/en_us_holycross/he.h.m1:heHE.EkyklosenImas.melody	@ltx/en_us_holycross/miscellanea:misc.HeirmosNotMetered
ltx/en_us_holycross/he.h.m1:heHE.EkyklosenImas.mode	@ltx/en_us_holycross/miscellanea:misc.Mode1
ltx/en_us_holycross/he.h.m1:heHE.EkyklosenImas.name	
ltx/en_us_holycross/he.h.m1:heHE.EkyklosenImas.notmetered	N/M ()
ltx/en_us_holycross/he.h.m1:heHE.EkyklosenImas.ode	@ltx/en_us_holycross/miscellanea:misc.Ode6
ltx/en_us_holycross/he.h.m1:heHE.EkyklosenImas.text	
ltx/en_us_holycross/he.h.m1:heHE.EnKaminoPaides.greekname	
ltx/en_us_holycross/he.h.m1:heHE.EnKaminoPaides.incipit	…
ltx/en_us_holycross/he.h.m1:heHE.EnKaminoPaides.melody	@ltx/en_us_holycross/miscellanea:misc.HeirmosNotMetered
ltx/en_us_holycross/he.h.m1:heHE.EnKaminoPaides.mode	@ltx/en_us_holycross/miscellanea:misc.Mode1
ltx/en_us_holycross/he.h.m1:heHE.EnKaminoPaides.name	
ltx/en_us_holycross/he.h.m1:heHE.EnKaminoPaides.notmetered	N/M ()
ltx/en_us_holycross/he.h.m1:heHE.EnKaminoPaides.ode	@ltx/en_us_holycross/miscellanea:misc.Ode8
ltx/en_us_holycross/he.h.m1:heHE.EnKaminoPaides.text	
ltx/en_us_holycross/he.h.m1:heHE.EnPnevmatiProvlepon.greekname	
ltx/en_us_holycross/he.h.m1:heHE.EnPnevmatiProvlepon.incipit	…
ltx/en_us_holycross/he.h.m1:heHE.EnPnevmatiProvlepon.melody	@ltx/en_us_holycross/miscellanea:misc.HeirmosNotMetered
ltx/en_us_holycross/he.h.m1:heHE.EnPnevmatiProvlepon.mode	@ltx/en_us_holycross/miscellanea:misc.Mode1
ltx/en_us_holycross/he.h.m1:heHE.EnPnevmatiProvlepon.name	
ltx/en_us_holycross/he.h.m1:heHE.EnPnevmatiProvlepon.notmetered	N/M ()
ltx/en_us_holycross/he.h.m1:heHE.EnPnevmatiProvlepon.ode	@ltx/en_us_holycross/miscellanea:misc.Ode4
ltx/en_us_holycross/he.h.m1:heHE.EnPnevmatiProvlepon.text	
ltx/en_us_holycross/he.h.m1:heHE.EpainonOTheoptis.greekname	
ltx/en_us_holycross/he.h.m1:heHE.EpainonOTheoptis.incipit	…
ltx/en_us_holycross/he.h.m1:heHE.EpainonOTheoptis.melody	@ltx/en_us_holycross/miscellanea:misc.HeirmosNotMetered
ltx/en_us_holycross/he.h.m1:heHE.EpainonOTheoptis.mode	@ltx/en_us_holycross/miscellanea:misc.Mode1
ltx/en_us_holycross/he.h.m1:heHE.EpainonOTheoptis.name	
ltx/en_us_holycross/he.h.m1:heHE.EpainonOTheoptis.notmetered	N/M ()
ltx/en_us_holycross/he.h.m1:heHE.EpainonOTheoptis.ode	@ltx/en_us_holycross/miscellanea:misc.Ode1
ltx/en_us_holycross/he.h.m1:heHE.EpainonOTheoptis.text	
ltx/en_us_holycross/he.h.m1:heHE.EpiStavrouSeDynate.greekname	
ltx/en_us_holycross/he.h.m1:heHE.EpiStavrouSeDynate.incipit	…
ltx/en_us_holycross/he.h.m1:heHE.EpiStavrouSeDynate.melody	@ltx/en_us_holycross/miscellanea:misc.HeirmosNotMetered
ltx/en_us_holycross/he.h.m1:heHE.EpiStavrouSeDynate.mode	@ltx/en_us_holycross/miscellanea:misc.Mode1
ltx/en_us_holycross/he.h.m1:heHE.EpiStavrouSeDynate.name	
ltx/en_us_holycross/he.h.m1:heHE.EpiStavrouSeDynate.notmetered	N/M (O mighty Lord.)
ltx/en_us_holycross/he.h.m1:heHE.EpiStavrouSeDynate.ode	@ltx/en_us_holycross/miscellanea:misc.Ode4
ltx/en_us_holycross/he.h.m1:heHE.EpiStavrouSeDynate.text	
ltx/en_us_holycross/he.h.m1:heHE.EpiTisTheiasFylakis.greekname	
ltx/en_us_holycross/he.h.m1:heHE.EpiTisTheiasFylakis.incipit	…
ltx/en_us_holycross/he.h.m1:heHE.EpiTisTheiasFylakis.melody	@ltx/en_us_holycross/miscellanea:misc.HeirmosNotMetered
ltx/en_us_holycross/he.h.m1:heHE.EpiTisTheiasFylakis.mode	@ltx/en_us_holycross/miscellanea:misc.Mode1
ltx/en_us_holycross/he.h.m1:heHE.EpiTisTheiasFylakis.name	
ltx/en_us_holycross/he.h.m1:heHE.EpiTisTheiasFylakis.notmetered	N/M (Now let Habakkuk.)
ltx/en_us_holycross/he.h.m1:heHE.EpiTisTheiasFylakis.ode	@ltx/en_us_holycross/miscellanea:misc.Ode4
ltx/en_us_holycross/he.h.m1:heHE.EpiTisTheiasFylakis.text	
ltx/en_us_holycross/he.h.m1:heHE.EpirthiOIlios.greekname	
ltx/en_us_holycross/he.h.m1:heHE.EpirthiOIlios.incipit	…
ltx/en_us_holycross/he.h.m1:heHE.EpirthiOIlios.melody	@ltx/en_us_holycross/miscellanea:misc.HeirmosNotMetered
ltx/en_us_holycross/he.h.m1:heHE.EpirthiOIlios.mode	@ltx/en_us_holycross/miscellanea:misc.Mode1
ltx/en_us_holycross/he.h.m1:heHE.EpirthiOIlios.name	
ltx/en_us_holycross/he.h.m1:heHE.EpirthiOIlios.notmetered	N/M ()
ltx/en_us_holycross/he.h.m1:heHE.EpirthiOIlios.ode	@ltx/en_us_holycross/miscellanea:misc.Ode4
ltx/en_us_holycross/he.h.m1:heHE.EpirthiOIlios.text	
ltx/en_us_holycross/he.h.m1:heHE.EpoiiseKratos.greekname	
ltx/en_us_holycross/he.h.m1:heHE.EpoiiseKratos.incipit	…
ltx/en_us_holycross/he.h.m1:heHE.EpoiiseKratos.melody	@ltx/en_us_holycross/miscellanea:misc.HeirmosNotMetered
ltx/en_us_holycross/he.h.m1:heHE.EpoiiseKratos.mode	@ltx/en_us_holycross/miscellanea:misc.Mode1
ltx/en_us_holycross/he.h.m1:heHE.EpoiiseKratos.name	
ltx/en_us_holycross/he.h.m1:heHE.EpoiiseKratos.notmetered	N/M ()
ltx/en_us_holycross/he.h.m1:heHE.EpoiiseKratos.ode	@ltx/en_us_holycross/miscellanea:misc.Ode9
ltx/en_us_holycross/he.h.m1:heHE.EpoiiseKratos.text	
ltx/en_us_holycross/he.h.m1:heHE.EsoseLaon.greekname	
ltx/en_us_holycross/he.h.m1:heHE.EsoseLaon.incipit	…
ltx/en_us_holycross/he.h.m1:heHE.EsoseLaon.melody	@ltx/en_us_holycross/miscellanea:misc.HeirmosNotMetered
ltx/en_us_holycross/he.h.m1:heHE.EsoseLaon.mode	@ltx/en_us_holycross/miscellanea:misc.Mode1
ltx/en_us_holycross/he.h.m1:heHE.EsoseLaon.name	
ltx/en_us_holycross/he.h.m1:heHE.EsoseLaon.notmetered	N/M (Working signs of old.)
ltx/en_us_holycross/he.h.m1:heHE.EsoseLaon.ode	@ltx/en_us_holycross/miscellanea:misc.Ode1
ltx/en_us_holycross/he.h.m1:heHE.EsoseLaon.text	
ltx/en_us_holycross/he.h.m1:heHE.EsoseLaon1.text	
ltx/en_us_holycross/he.h.m1:heHE.EsoseLaon2.text	
ltx/en_us_holycross/he.h.m1:heHE.EsoseLaon3.text	
ltx/en_us_holycross/he.h.m1:heHE.EsoseLaon4.text	
ltx/en_us_holycross/he.h.m1:heHE.EsoseLaon5.text	
ltx/en_us_holycross/he.h.m1:heHE.FlogaDrosizousanOsious.greekname	
ltx/en_us_holycross/he.h.m1:heHE.FlogaDrosizousanOsious.incipit	…
ltx/en_us_holycross/he.h.m1:heHE.FlogaDrosizousanOsious.melody	@ltx/en_us_holycross/miscellanea:misc.HeirmosNotMetered
ltx/en_us_holycross/he.h.m1:heHE.FlogaDrosizousanOsious.mode	@ltx/en_us_holycross/miscellanea:misc.Mode1
ltx/en_us_holycross/he.h.m1:heHE.FlogaDrosizousanOsious.name	
ltx/en_us_holycross/he.h.m1:heHE.FlogaDrosizousanOsious.notmetered	N/M (Unto the Servants.)
ltx/en_us_holycross/he.h.m1:heHE.FlogaDrosizousanOsious.ode	@ltx/en_us_holycross/miscellanea:misc.Ode8
ltx/en_us_holycross/he.h.m1:heHE.FlogaDrosizousanOsious.text	
ltx/en_us_holycross/he.h.m1:heHE.FlogoseosOPaidas.greekname	
ltx/en_us_holycross/he.h.m1:heHE.FlogoseosOPaidas.incipit	…
ltx/en_us_holycross/he.h.m1:heHE.FlogoseosOPaidas.melody	@ltx/en_us_holycross/miscellanea:misc.HeirmosNotMetered
ltx/en_us_holycross/he.h.m1:heHE.FlogoseosOPaidas.mode	@ltx/en_us_holycross/miscellanea:misc.Mode1
ltx/en_us_holycross/he.h.m1:heHE.FlogoseosOPaidas.name	
ltx/en_us_holycross/he.h.m1:heHE.FlogoseosOPaidas.notmetered	N/M (The same One.)
ltx/en_us_holycross/he.h.m1:heHE.FlogoseosOPaidas.ode	@ltx/en_us_holycross/miscellanea:misc.Ode7
ltx/en_us_holycross/he.h.m1:heHE.FlogoseosOPaidas.text	
ltx/en_us_holycross/he.h.m1:heHE.FotizouFotizou.greekname	
ltx/en_us_holycross/he.h.m1:heHE.FotizouFotizou.incipit	…
ltx/en_us_holycross/he.h.m1:heHE.FotizouFotizou.melody	@ltx/en_us_holycross/miscellanea:misc.HeirmosNotMetered
ltx/en_us_holycross/he.h.m1:heHE.FotizouFotizou.mode	@ltx/en_us_holycross/miscellanea:misc.Mode1
ltx/en_us_holycross/he.h.m1:heHE.FotizouFotizou.name	
ltx/en_us_holycross/he.h.m1:heHE.FotizouFotizou.notmetered	N/M (Arise, shine.)
ltx/en_us_holycross/he.h.m1:heHE.FotizouFotizou.ode	@ltx/en_us_holycross/miscellanea:misc.Ode9
ltx/en_us_holycross/he.h.m1:heHE.FotizouFotizou.text	
ltx/en_us_holycross/he.h.m1:heHE.GenousVroteiou.greekname	
ltx/en_us_holycross/he.h.m1:heHE.GenousVroteiou.incipit	…
ltx/en_us_holycross/he.h.m1:heHE.GenousVroteiou.melody	@ltx/en_us_holycross/miscellanea:misc.HeirmosNotMetered
ltx/en_us_holycross/he.h.m1:heHE.GenousVroteiou.mode	@ltx/en_us_holycross/miscellanea:misc.Mode1
ltx/en_us_holycross/he.h.m1:heHE.GenousVroteiou.name	
ltx/en_us_holycross/he.h.m1:heHE.GenousVroteiou.notmetered	N/M (Of old, Habakkuk''s ode.)
ltx/en_us_holycross/he.h.m1:heHE.GenousVroteiou.ode	@ltx/en_us_holycross/miscellanea:misc.Ode4
ltx/en_us_holycross/he.h.m1:heHE.GenousVroteiou.text	
ltx/en_us_holycross/he.h.m1:heHE.GenousVroteiou1.text	
ltx/en_us_holycross/he.h.m1:heHE.GenousVroteiou2.text	
ltx/en_us_holycross/he.h.m1:heHE.GenousVroteiou3.text	
ltx/en_us_holycross/he.h.m1:heHE.GenousVroteiou4.text	
ltx/en_us_holycross/he.h.m1:heHE.GenousVroteiou5.text	
ltx/en_us_holycross/he.h.m1:heHE.IDimiourgiki.greekname	
ltx/en_us_holycross/he.h.m1:heHE.IDimiourgiki.incipit	…
ltx/en_us_holycross/he.h.m1:heHE.IDimiourgiki.melody	@ltx/en_us_holycross/miscellanea:misc.HeirmosNotMetered
ltx/en_us_holycross/he.h.m1:heHE.IDimiourgiki.mode	@ltx/en_us_holycross/miscellanea:misc.Mode1
ltx/en_us_holycross/he.h.m1:heHE.IDimiourgiki.name	
ltx/en_us_holycross/he.h.m1:heHE.IDimiourgiki.notmetered	N/M (O Wisdom of our God.)
ltx/en_us_holycross/he.h.m1:heHE.IDimiourgiki.ode	@ltx/en_us_holycross/miscellanea:misc.Ode3
ltx/en_us_holycross/he.h.m1:heHE.IDimiourgiki.text	
ltx/en_us_holycross/he.h.m1:heHE.IKaminosSotirEdrosizeto.greekname	
ltx/en_us_holycross/he.h.m1:heHE.IKaminosSotirEdrosizeto.incipit	…
ltx/en_us_holycross/he.h.m1:heHE.IKaminosSotirEdrosizeto.melody	@ltx/en_us_holycross/miscellanea:misc.HeirmosNotMetered
ltx/en_us_holycross/he.h.m1:heHE.IKaminosSotirEdrosizeto.mode	@ltx/en_us_holycross/miscellanea:misc.Mode1
ltx/en_us_holycross/he.h.m1:heHE.IKaminosSotirEdrosizeto.name	
ltx/en_us_holycross/he.h.m1:heHE.IKaminosSotirEdrosizeto.notmetered	N/M ()
ltx/en_us_holycross/he.h.m1:heHE.IKaminosSotirEdrosizeto.ode	@ltx/en_us_holycross/miscellanea:misc.Ode7
ltx/en_us_holycross/he.h.m1:heHE.IKaminosSotirEdrosizeto.text	
ltx/en_us_holycross/he.h.m1:heHE.ITonProSyllipseos.greekname	
ltx/en_us_holycross/he.h.m1:heHE.ITonProSyllipseos.incipit	…
ltx/en_us_holycross/he.h.m1:heHE.ITonProSyllipseos.melody	@ltx/en_us_holycross/miscellanea:misc.HeirmosNotMetered
ltx/en_us_holycross/he.h.m1:heHE.ITonProSyllipseos.mode	@ltx/en_us_holycross/miscellanea:misc.Mode1
ltx/en_us_holycross/he.h.m1:heHE.ITonProSyllipseos.name	
ltx/en_us_holycross/he.h.m1:heHE.ITonProSyllipseos.notmetered	N/M ()
ltx/en_us_holycross/he.h.m1:heHE.ITonProSyllipseos.ode	@ltx/en_us_holycross/miscellanea:misc.Ode3
ltx/en_us_holycross/he.h.m1:heHE.ITonProSyllipseos.text	
ltx/en_us_holycross/he.h.m1:heHE.IdeteIdete.greekname	
ltx/en_us_holycross/he.h.m1:heHE.IdeteIdete.incipit	…
ltx/en_us_holycross/he.h.m1:heHE.IdeteIdete.melody	@ltx/en_us_holycross/miscellanea:misc.HeirmosNotMetered
ltx/en_us_holycross/he.h.m1:heHE.IdeteIdete.mode	@ltx/en_us_holycross/miscellanea:misc.Mode1
ltx/en_us_holycross/he.h.m1:heHE.IdeteIdete.name	
ltx/en_us_holycross/he.h.m1:heHE.IdeteIdete.notmetered	N/M ()
ltx/en_us_holycross/he.h.m1:heHE.IdeteIdete.ode	@ltx/en_us_holycross/miscellanea:misc.Ode2
ltx/en_us_holycross/he.h.m1:heHE.IdeteIdete.text	
ltx/en_us_holycross/he.h.m1:heHE.ItamoThymo.greekname	
ltx/en_us_holycross/he.h.m1:heHE.ItamoThymo.incipit	…
ltx/en_us_holycross/he.h.m1:heHE.ItamoThymo.melody	@ltx/en_us_holycross/miscellanea:misc.HeirmosNotMetered
ltx/en_us_holycross/he.h.m1:heHE.ItamoThymo.mode	@ltx/en_us_holycross/miscellanea:misc.Mode1
ltx/en_us_holycross/he.h.m1:heHE.ItamoThymo.name	
ltx/en_us_holycross/he.h.m1:heHE.ItamoThymo.notmetered	N/M (Counterposed.)
ltx/en_us_holycross/he.h.m1:heHE.ItamoThymo.ode	@ltx/en_us_holycross/miscellanea:misc.Ode7
ltx/en_us_holycross/he.h.m1:heHE.ItamoThymo.text	
ltx/en_us_holycross/he.h.m1:heHE.KatavgasonImon.greekname	
ltx/en_us_holycross/he.h.m1:heHE.KatavgasonImon.incipit	…
ltx/en_us_holycross/he.h.m1:heHE.KatavgasonImon.melody	@ltx/en_us_holycross/miscellanea:misc.HeirmosNotMetered
ltx/en_us_holycross/he.h.m1:heHE.KatavgasonImon.mode	@ltx/en_us_holycross/miscellanea:misc.Mode1
ltx/en_us_holycross/he.h.m1:heHE.KatavgasonImon.name	
ltx/en_us_holycross/he.h.m1:heHE.KatavgasonImon.notmetered	N/M ()
ltx/en_us_holycross/he.h.m1:heHE.KatavgasonImon.ode	@ltx/en_us_holycross/miscellanea:misc.Ode5
ltx/en_us_holycross/he.h.m1:heHE.KatavgasonImon.text	
ltx/en_us_holycross/he.h.m1:heHE.KatenoisaPantodyname.greekname	
ltx/en_us_holycross/he.h.m1:heHE.KatenoisaPantodyname.incipit	…
ltx/en_us_holycross/he.h.m1:heHE.KatenoisaPantodyname.melody	@ltx/en_us_holycross/miscellanea:misc.HeirmosNotMetered
ltx/en_us_holycross/he.h.m1:heHE.KatenoisaPantodyname.mode	@ltx/en_us_holycross/miscellanea:misc.Mode1
ltx/en_us_holycross/he.h.m1:heHE.KatenoisaPantodyname.name	
ltx/en_us_holycross/he.h.m1:heHE.KatenoisaPantodyname.notmetered	N/M ()
ltx/en_us_holycross/he.h.m1:heHE.KatenoisaPantodyname.ode	@ltx/en_us_holycross/miscellanea:misc.Ode4
ltx/en_us_holycross/he.h.m1:heHE.KatenoisaPantodyname.text	
ltx/en_us_holycross/he.h.m1:heHE.KatilthesEnToisKatotatois.greekname	
ltx/en_us_holycross/he.h.m1:heHE.KatilthesEnToisKatotatois.incipit	…
ltx/en_us_holycross/he.h.m1:heHE.KatilthesEnToisKatotatois.melody	@ltx/en_us_holycross/miscellanea:misc.HeirmosNotMetered
ltx/en_us_holycross/he.h.m1:heHE.KatilthesEnToisKatotatois.mode	@ltx/en_us_holycross/miscellanea:misc.Mode1
ltx/en_us_holycross/he.h.m1:heHE.KatilthesEnToisKatotatois.name	
ltx/en_us_holycross/he.h.m1:heHE.KatilthesEnToisKatotatois.notmetered	N/M (You went down.)
ltx/en_us_holycross/he.h.m1:heHE.KatilthesEnToisKatotatois.ode	@ltx/en_us_holycross/miscellanea:misc.Ode6
ltx/en_us_holycross/he.h.m1:heHE.KatilthesEnToisKatotatois.text	
ltx/en_us_holycross/he.h.m1:heHE.LithonOnApedokimasan.greekname	
ltx/en_us_holycross/he.h.m1:heHE.LithonOnApedokimasan.incipit	…
ltx/en_us_holycross/he.h.m1:heHE.LithonOnApedokimasan.melody	@ltx/en_us_holycross/miscellanea:misc.HeirmosNotMetered
ltx/en_us_holycross/he.h.m1:heHE.LithonOnApedokimasan.mode	@ltx/en_us_holycross/miscellanea:misc.Mode1
ltx/en_us_holycross/he.h.m1:heHE.LithonOnApedokimasan.name	
ltx/en_us_holycross/he.h.m1:heHE.LithonOnApedokimasan.notmetered	N/M (As the Psalmist said.)
ltx/en_us_holycross/he.h.m1:heHE.LithonOnApedokimasan.ode	@ltx/en_us_holycross/miscellanea:misc.Ode3
ltx/en_us_holycross/he.h.m1:heHE.LithonOnApedokimasan.text	
ltx/en_us_holycross/he.h.m1:heHE.MegaToMystirion.greekname	
ltx/en_us_holycross/he.h.m1:heHE.MegaToMystirion.incipit	…
ltx/en_us_holycross/he.h.m1:heHE.MegaToMystirion.melody	@ltx/en_us_holycross/miscellanea:misc.HeirmosNotMetered
ltx/en_us_holycross/he.h.m1:heHE.MegaToMystirion.mode	@ltx/en_us_holycross/miscellanea:misc.Mode1
ltx/en_us_holycross/he.h.m1:heHE.MegaToMystirion.name	God-inspired Habakkuk.
ltx/en_us_holycross/he.h.m1:heHE.MegaToMystirion.notmetered	N/M (God-inspired Habakkuk.)
ltx/en_us_holycross/he.h.m1:heHE.MegaToMystirion.ode	@ltx/en_us_holycross/miscellanea:misc.Ode4
ltx/en_us_holycross/he.h.m1:heHE.MegaToMystirion.text	
ltx/en_us_holycross/he.h.m1:heHE.MitranAflektos.greekname	
ltx/en_us_holycross/he.h.m1:heHE.MitranAflektos.incipit	…
ltx/en_us_holycross/he.h.m1:heHE.MitranAflektos.melody	@ltx/en_us_holycross/miscellanea:misc.HeirmosNotMetered
ltx/en_us_holycross/he.h.m1:heHE.MitranAflektos.mode	@ltx/en_us_holycross/miscellanea:misc.Mode1
ltx/en_us_holycross/he.h.m1:heHE.MitranAflektos.name	
ltx/en_us_holycross/he.h.m1:heHE.MitranAflektos.notmetered	N/M (As the Young Men of old.)
ltx/en_us_holycross/he.h.m1:heHE.MitranAflektos.ode	@ltx/en_us_holycross/miscellanea:misc.Ode8
ltx/en_us_holycross/he.h.m1:heHE.MitranAflektos.text	
ltx/en_us_holycross/he.h.m1:heHE.MitranAflektos1.text	
ltx/en_us_holycross/he.h.m1:heHE.MitranAflektos2.text	
ltx/en_us_holycross/he.h.m1:heHE.MitranAflektos3.text	
ltx/en_us_holycross/he.h.m1:heHE.MitranAflektos4.text	
ltx/en_us_holycross/he.h.m1:heHE.MitranAflektos5.text	
ltx/en_us_holycross/he.h.m1:heHE.MystirionXenon.greekname	
ltx/en_us_holycross/he.h.m1:heHE.MystirionXenon.incipit	…
ltx/en_us_holycross/he.h.m1:heHE.MystirionXenon.melody	@ltx/en_us_holycross/miscellanea:misc.HeirmosNotMetered
ltx/en_us_holycross/he.h.m1:heHE.MystirionXenon.mode	@ltx/en_us_holycross/miscellanea:misc.Mode1
ltx/en_us_holycross/he.h.m1:heHE.MystirionXenon.name	
ltx/en_us_holycross/he.h.m1:heHE.MystirionXenon.notmetered	N/M (I see here.)
ltx/en_us_holycross/he.h.m1:heHE.MystirionXenon.ode	@ltx/en_us_holycross/miscellanea:misc.Ode9
ltx/en_us_holycross/he.h.m1:heHE.MystirionXenon.text	
ltx/en_us_holycross/he.h.m1:heHE.NaionIonas.greekname	
ltx/en_us_holycross/he.h.m1:heHE.NaionIonas.incipit	…
ltx/en_us_holycross/he.h.m1:heHE.NaionIonas.melody	@ltx/en_us_holycross/miscellanea:misc.HeirmosNotMetered
ltx/en_us_holycross/he.h.m1:heHE.NaionIonas.mode	@ltx/en_us_holycross/miscellanea:misc.Mode1
ltx/en_us_holycross/he.h.m1:heHE.NaionIonas.name	
ltx/en_us_holycross/he.h.m1:heHE.NaionIonas.notmetered	N/M (Gripped in the gorges.)
ltx/en_us_holycross/he.h.m1:heHE.NaionIonas.ode	@ltx/en_us_holycross/miscellanea:misc.Ode6
ltx/en_us_holycross/he.h.m1:heHE.NaionIonas.text	
ltx/en_us_holycross/he.h.m1:heHE.NaionIonas1.text	
ltx/en_us_holycross/he.h.m1:heHE.NaionIonas2.text	
ltx/en_us_holycross/he.h.m1:heHE.NaionIonas3.text	
ltx/en_us_holycross/he.h.m1:heHE.NaionIonas4.text	
ltx/en_us_holycross/he.h.m1:heHE.NaionIonas5.text	
ltx/en_us_holycross/he.h.m1:heHE.NefsonProsYmnous.greekname	
ltx/en_us_holycross/he.h.m1:heHE.NefsonProsYmnous.incipit	…
ltx/en_us_holycross/he.h.m1:heHE.NefsonProsYmnous.melody	@ltx/en_us_holycross/miscellanea:misc.HeirmosNotMetered
ltx/en_us_holycross/he.h.m1:heHE.NefsonProsYmnous.mode	@ltx/en_us_holycross/miscellanea:misc.Mode1
ltx/en_us_holycross/he.h.m1:heHE.NefsonProsYmnous.name	
ltx/en_us_holycross/he.h.m1:heHE.NefsonProsYmnous.notmetered	N/M (Incline Your ear.)
ltx/en_us_holycross/he.h.m1:heHE.NefsonProsYmnous.ode	@ltx/en_us_holycross/miscellanea:misc.Ode3
ltx/en_us_holycross/he.h.m1:heHE.NefsonProsYmnous.text	
ltx/en_us_holycross/he.h.m1:heHE.NefsonProsYmnous1.text	
ltx/en_us_holycross/he.h.m1:heHE.NefsonProsYmnous2.text	
ltx/en_us_holycross/he.h.m1:heHE.NefsonProsYmnous3.text	
ltx/en_us_holycross/he.h.m1:heHE.NefsonProsYmnous4.text	
ltx/en_us_holycross/he.h.m1:heHE.NefsonProsYmnous5.text	
ltx/en_us_holycross/he.h.m1:heHE.NenikintaiTisFyseos.greekname	
ltx/en_us_holycross/he.h.m1:heHE.NenikintaiTisFyseos.incipit	…
ltx/en_us_holycross/he.h.m1:heHE.NenikintaiTisFyseos.melody	@ltx/en_us_holycross/miscellanea:misc.HeirmosNotMetered
ltx/en_us_holycross/he.h.m1:heHE.NenikintaiTisFyseos.mode	@ltx/en_us_holycross/miscellanea:misc.Mode1
ltx/en_us_holycross/he.h.m1:heHE.NenikintaiTisFyseos.name	
ltx/en_us_holycross/he.h.m1:heHE.NenikintaiTisFyseos.notmetered	N/M (In you the laws.)
ltx/en_us_holycross/he.h.m1:heHE.NenikintaiTisFyseos.ode	@ltx/en_us_holycross/miscellanea:misc.Ode9
ltx/en_us_holycross/he.h.m1:heHE.NenikintaiTisFyseos.text	
ltx/en_us_holycross/he.h.m1:heHE.NyxPeriescheMeSotir.greekname	
ltx/en_us_holycross/he.h.m1:heHE.NyxPeriescheMeSotir.incipit	…
ltx/en_us_holycross/he.h.m1:heHE.NyxPeriescheMeSotir.melody	@ltx/en_us_holycross/miscellanea:misc.HeirmosNotMetered
ltx/en_us_holycross/he.h.m1:heHE.NyxPeriescheMeSotir.mode	@ltx/en_us_holycross/miscellanea:misc.Mode1
ltx/en_us_holycross/he.h.m1:heHE.NyxPeriescheMeSotir.name	
ltx/en_us_holycross/he.h.m1:heHE.NyxPeriescheMeSotir.notmetered	N/M ()
ltx/en_us_holycross/he.h.m1:heHE.NyxPeriescheMeSotir.ode	@ltx/en_us_holycross/miscellanea:misc.Ode5
ltx/en_us_holycross/he.h.m1:heHE.NyxPeriescheMeSotir.text	
ltx/en_us_holycross/he.h.m1:heHE.ODiaStylouPyros.greekname	
ltx/en_us_holycross/he.h.m1:heHE.ODiaStylouPyros.incipit	…
ltx/en_us_holycross/he.h.m1:heHE.ODiaStylouPyros.melody	@ltx/en_us_holycross/miscellanea:misc.HeirmosNotMetered
ltx/en_us_holycross/he.h.m1:heHE.ODiaStylouPyros.mode	@ltx/en_us_holycross/miscellanea:misc.Mode1
ltx/en_us_holycross/he.h.m1:heHE.ODiaStylouPyros.name	
ltx/en_us_holycross/he.h.m1:heHE.ODiaStylouPyros.notmetered	N/M ()
ltx/en_us_holycross/he.h.m1:heHE.ODiaStylouPyros.ode	@ltx/en_us_holycross/miscellanea:misc.Ode1
ltx/en_us_holycross/he.h.m1:heHE.ODiaStylouPyros.text	
ltx/en_us_holycross/he.h.m1:heHE.ODiapontion.greekname	
ltx/en_us_holycross/he.h.m1:heHE.ODiapontion.incipit	…
ltx/en_us_holycross/he.h.m1:heHE.ODiapontion.melody	@ltx/en_us_holycross/miscellanea:misc.HeirmosNotMetered
ltx/en_us_holycross/he.h.m1:heHE.ODiapontion.mode	@ltx/en_us_holycross/miscellanea:misc.Mode1
ltx/en_us_holycross/he.h.m1:heHE.ODiapontion.name	
ltx/en_us_holycross/he.h.m1:heHE.ODiapontion.notmetered	N/M ()
ltx/en_us_holycross/he.h.m1:heHE.ODiapontion.ode	@ltx/en_us_holycross/miscellanea:misc.Ode6
ltx/en_us_holycross/he.h.m1:heHE.ODiapontion.text	
ltx/en_us_holycross/he.h.m1:heHE.OEnTiVatoOftheis.greekname	
ltx/en_us_holycross/he.h.m1:heHE.OEnTiVatoOftheis.incipit	…
ltx/en_us_holycross/he.h.m1:heHE.OEnTiVatoOftheis.melody	@ltx/en_us_holycross/miscellanea:misc.HeirmosNotMetered
ltx/en_us_holycross/he.h.m1:heHE.OEnTiVatoOftheis.mode	@ltx/en_us_holycross/miscellanea:misc.Mode1
ltx/en_us_holycross/he.h.m1:heHE.OEnTiVatoOftheis.name	
ltx/en_us_holycross/he.h.m1:heHE.OEnTiVatoOftheis.notmetered	N/M ()
ltx/en_us_holycross/he.h.m1:heHE.OEnTiVatoOftheis.ode	@ltx/en_us_holycross/miscellanea:misc.Ode7
ltx/en_us_holycross/he.h.m1:heHE.OEnTiVatoOftheis.text	
ltx/en_us_holycross/he.h.m1:heHE.OFotisasTiEllampsei.greekname	
ltx/en_us_holycross/he.h.m1:heHE.OFotisasTiEllampsei.incipit	…
ltx/en_us_holycross/he.h.m1:heHE.OFotisasTiEllampsei.melody	@ltx/en_us_holycross/miscellanea:misc.HeirmosNotMetered
ltx/en_us_holycross/he.h.m1:heHE.OFotisasTiEllampsei.mode	@ltx/en_us_holycross/miscellanea:misc.Mode1
ltx/en_us_holycross/he.h.m1:heHE.OFotisasTiEllampsei.name	
ltx/en_us_holycross/he.h.m1:heHE.OFotisasTiEllampsei.notmetered	N/M ()
ltx/en_us_holycross/he.h.m1:heHE.OFotisasTiEllampsei.ode	@ltx/en_us_holycross/miscellanea:misc.Ode5
ltx/en_us_holycross/he.h.m1:heHE.OFotisasTiEllampsei.text	
ltx/en_us_holycross/he.h.m1:heHE.OMiterParthene.greekname	
ltx/en_us_holycross/he.h.m1:heHE.OMiterParthene.incipit	…
ltx/en_us_holycross/he.h.m1:heHE.OMiterParthene.melody	@ltx/en_us_holycross/miscellanea:misc.HeirmosNotMetered
ltx/en_us_holycross/he.h.m1:heHE.OMiterParthene.mode	@ltx/en_us_holycross/miscellanea:misc.Mode1
ltx/en_us_holycross/he.h.m1:heHE.OMiterParthene.name	
ltx/en_us_holycross/he.h.m1:heHE.OMiterParthene.notmetered	N/M (O true Theotokos.)
ltx/en_us_holycross/he.h.m1:heHE.OMiterParthene.ode	@ltx/en_us_holycross/miscellanea:misc.Ode9
ltx/en_us_holycross/he.h.m1:heHE.OMiterParthene.text	
ltx/en_us_holycross/he.h.m1:heHE.OMonosEidos.greekname	
ltx/en_us_holycross/he.h.m1:heHE.OMonosEidos.incipit	…
ltx/en_us_holycross/he.h.m1:heHE.OMonosEidos.melody	@ltx/en_us_holycross/miscellanea:misc.HeirmosNotMetered
ltx/en_us_holycross/he.h.m1:heHE.OMonosEidos.mode	@ltx/en_us_holycross/miscellanea:misc.Mode1
ltx/en_us_holycross/he.h.m1:heHE.OMonosEidos.name	
ltx/en_us_holycross/he.h.m1:heHE.OMonosEidos.notmetered	N/M (As You are the only One.)
ltx/en_us_holycross/he.h.m1:heHE.OMonosEidos.ode	@ltx/en_us_holycross/miscellanea:misc.Ode3
ltx/en_us_holycross/he.h.m1:heHE.OMonosEidos.text	
ltx/en_us_holycross/he.h.m1:heHE.OPaidasEkKaminou.greekname	
ltx/en_us_holycross/he.h.m1:heHE.OPaidasEkKaminou.incipit	…
ltx/en_us_holycross/he.h.m1:heHE.OPaidasEkKaminou.melody	@ltx/en_us_holycross/miscellanea:misc.HeirmosNotMetered
ltx/en_us_holycross/he.h.m1:heHE.OPaidasEkKaminou.mode	@ltx/en_us_holycross/miscellanea:misc.Mode1
ltx/en_us_holycross/he.h.m1:heHE.OPaidasEkKaminou.name	
ltx/en_us_holycross/he.h.m1:heHE.OPaidasEkKaminou.notmetered	N/M (The same One.)
ltx/en_us_holycross/he.h.m1:heHE.OPaidasEkKaminou.ode	@ltx/en_us_holycross/miscellanea:misc.Ode7
ltx/en_us_holycross/he.h.m1:heHE.OPaidasEkKaminou.text	
ltx/en_us_holycross/he.h.m1:heHE.OTheiotatosProetypose.greekname	
ltx/en_us_holycross/he.h.m1:heHE.OTheiotatosProetypose.incipit	…
ltx/en_us_holycross/he.h.m1:heHE.OTheiotatosProetypose.melody	@ltx/en_us_holycross/miscellanea:misc.HeirmosNotMetered
ltx/en_us_holycross/he.h.m1:heHE.OTheiotatosProetypose.mode	@ltx/en_us_holycross/miscellanea:misc.Mode1
ltx/en_us_holycross/he.h.m1:heHE.OTheiotatosProetypose.name	
ltx/en_us_holycross/he.h.m1:heHE.OTheiotatosProetypose.notmetered	N/M (That most godly prophet.)
ltx/en_us_holycross/he.h.m1:heHE.OTheiotatosProetypose.ode	@ltx/en_us_holycross/miscellanea:misc.Ode1
ltx/en_us_holycross/he.h.m1:heHE.OTheiotatosProetypose.text	
ltx/en_us_holycross/he.h.m1:heHE.OTonAnoVython.greekname	
ltx/en_us_holycross/he.h.m1:heHE.OTonAnoVython.incipit	…
ltx/en_us_holycross/he.h.m1:heHE.OTonAnoVython.melody	@ltx/en_us_holycross/miscellanea:misc.HeirmosNotMetered
ltx/en_us_holycross/he.h.m1:heHE.OTonAnoVython.mode	@ltx/en_us_holycross/miscellanea:misc.Mode1
ltx/en_us_holycross/he.h.m1:heHE.OTonAnoVython.name	
ltx/en_us_holycross/he.h.m1:heHE.OTonAnoVython.notmetered	N/M ()
ltx/en_us_holycross/he.h.m1:heHE.OTonAnoVython.ode	@ltx/en_us_holycross/miscellanea:misc.Ode9
ltx/en_us_holycross/he.h.m1:heHE.OTonAnoVython.text	
ltx/en_us_holycross/he.h.m1:heHE.OdinEpinikion.greekname	
ltx/en_us_holycross/he.h.m1:heHE.OdinEpinikion.incipit	…
ltx/en_us_holycross/he.h.m1:heHE.OdinEpinikion.melody	@ltx/en_us_holycross/miscellanea:misc.HeirmosNotMetered
ltx/en_us_holycross/he.h.m1:heHE.OdinEpinikion.mode	@ltx/en_us_holycross/miscellanea:misc.Mode1
ltx/en_us_holycross/he.h.m1:heHE.OdinEpinikion.name	
ltx/en_us_holycross/he.h.m1:heHE.OdinEpinikion.notmetered	N/M (An anthem of victory.)
ltx/en_us_holycross/he.h.m1:heHE.OdinEpinikion.ode	@ltx/en_us_holycross/miscellanea:misc.Ode1
ltx/en_us_holycross/he.h.m1:heHE.OdinEpinikion.text	
ltx/en_us_holycross/he.h.m1:heHE.OiMiTiTrofiChranthentes.greekname	
ltx/en_us_holycross/he.h.m1:heHE.OiMiTiTrofiChranthentes.incipit	…
ltx/en_us_holycross/he.h.m1:heHE.OiMiTiTrofiChranthentes.melody	@ltx/en_us_holycross/miscellanea:misc.HeirmosNotMetered
ltx/en_us_holycross/he.h.m1:heHE.OiMiTiTrofiChranthentes.mode	@ltx/en_us_holycross/miscellanea:misc.Mode1
ltx/en_us_holycross/he.h.m1:heHE.OiMiTiTrofiChranthentes.name	
ltx/en_us_holycross/he.h.m1:heHE.OiMiTiTrofiChranthentes.notmetered	N/M ()
ltx/en_us_holycross/he.h.m1:heHE.OiMiTiTrofiChranthentes.ode	@ltx/en_us_holycross/miscellanea:misc.Ode8
ltx/en_us_holycross/he.h.m1:heHE.OiMiTiTrofiChranthentes.text	
ltx/en_us_holycross/he.h.m1:heHE.OiOuranoiTonOuranon.greekname	
ltx/en_us_holycross/he.h.m1:heHE.OiOuranoiTonOuranon.incipit	…
ltx/en_us_holycross/he.h.m1:heHE.OiOuranoiTonOuranon.melody	@ltx/en_us_holycross/miscellanea:misc.HeirmosNotMetered
ltx/en_us_holycross/he.h.m1:heHE.OiOuranoiTonOuranon.mode	@ltx/en_us_holycross/miscellanea:misc.Mode1
ltx/en_us_holycross/he.h.m1:heHE.OiOuranoiTonOuranon.name	
ltx/en_us_holycross/he.h.m1:heHE.OiOuranoiTonOuranon.notmetered	N/M ()
ltx/en_us_holycross/he.h.m1:heHE.OiOuranoiTonOuranon.ode	@ltx/en_us_holycross/miscellanea:misc.Ode8
ltx/en_us_holycross/he.h.m1:heHE.OiOuranoiTonOuranon.text	
ltx/en_us_holycross/he.h.m1:heHE.OiPaidesEfseveia.greekname	
ltx/en_us_holycross/he.h.m1:heHE.OiPaidesEfseveia.incipit	…
ltx/en_us_holycross/he.h.m1:heHE.OiPaidesEfseveia.melody	@ltx/en_us_holycross/miscellanea:misc.HeirmosNotMetered
ltx/en_us_holycross/he.h.m1:heHE.OiPaidesEfseveia.mode	@ltx/en_us_holycross/miscellanea:misc.Mode1
ltx/en_us_holycross/he.h.m1:heHE.OiPaidesEfseveia.name	
ltx/en_us_holycross/he.h.m1:heHE.OiPaidesEfseveia.notmetered	N/M (Brought up together.)
ltx/en_us_holycross/he.h.m1:heHE.OiPaidesEfseveia.ode	@ltx/en_us_holycross/miscellanea:misc.Ode7
ltx/en_us_holycross/he.h.m1:heHE.OiPaidesEfseveia.text	
ltx/en_us_holycross/he.h.m1:heHE.OnFrittousinAngeloi.greekname	
ltx/en_us_holycross/he.h.m1:heHE.OnFrittousinAngeloi.incipit	…
ltx/en_us_holycross/he.h.m1:heHE.OnFrittousinAngeloi.melody	@ltx/en_us_holycross/miscellanea:misc.HeirmosNotMetered
ltx/en_us_holycross/he.h.m1:heHE.OnFrittousinAngeloi.mode	@ltx/en_us_holycross/miscellanea:misc.Mode1
ltx/en_us_holycross/he.h.m1:heHE.OnFrittousinAngeloi.name	
ltx/en_us_holycross/he.h.m1:heHE.OnFrittousinAngeloi.notmetered	N/M ()
ltx/en_us_holycross/he.h.m1:heHE.OnFrittousinAngeloi.ode	@ltx/en_us_holycross/miscellanea:misc.Ode8
ltx/en_us_holycross/he.h.m1:heHE.OnFrittousinAngeloi.text	
ltx/en_us_holycross/he.h.m1:heHE.OrosSeTiChariti.greekname	
ltx/en_us_holycross/he.h.m1:heHE.OrosSeTiChariti.incipit	…
ltx/en_us_holycross/he.h.m1:heHE.OrosSeTiChariti.melody	@ltx/en_us_holycross/miscellanea:misc.HeirmosNotMetered
ltx/en_us_holycross/he.h.m1:heHE.OrosSeTiChariti.mode	@ltx/en_us_holycross/miscellanea:misc.Mode1
ltx/en_us_holycross/he.h.m1:heHE.OrosSeTiChariti.name	
ltx/en_us_holycross/he.h.m1:heHE.OrosSeTiChariti.notmetered	N/M ()
ltx/en_us_holycross/he.h.m1:heHE.OrosSeTiChariti.ode	@ltx/en_us_holycross/miscellanea:misc.Ode4
ltx/en_us_holycross/he.h.m1:heHE.OrosSeTiChariti.text	
ltx/en_us_holycross/he.h.m1:heHE.OrthrisomenOrthrouVatheos.greekname	
ltx/en_us_holycross/he.h.m1:heHE.OrthrisomenOrthrouVatheos.incipit	…
ltx/en_us_holycross/he.h.m1:heHE.OrthrisomenOrthrouVatheos.melody	@ltx/en_us_holycross/miscellanea:misc.HeirmosNotMetered
ltx/en_us_holycross/he.h.m1:heHE.OrthrisomenOrthrouVatheos.mode	@ltx/en_us_holycross/miscellanea:misc.Mode1
ltx/en_us_holycross/he.h.m1:heHE.OrthrisomenOrthrouVatheos.name	
ltx/en_us_holycross/he.h.m1:heHE.OrthrisomenOrthrouVatheos.notmetered	N/M (Arising at dawn.)
ltx/en_us_holycross/he.h.m1:heHE.OrthrisomenOrthrouVatheos.ode	@ltx/en_us_holycross/miscellanea:misc.Ode5
ltx/en_us_holycross/he.h.m1:heHE.OrthrisomenOrthrouVatheos.text	
ltx/en_us_holycross/he.h.m1:heHE.OrthrizontesSeAnymnoumen.greekname	
ltx/en_us_holycross/he.h.m1:heHE.OrthrizontesSeAnymnoumen.incipit	…
ltx/en_us_holycross/he.h.m1:heHE.OrthrizontesSeAnymnoumen.melody	@ltx/en_us_holycross/miscellanea:misc.HeirmosNotMetered
ltx/en_us_holycross/he.h.m1:heHE.OrthrizontesSeAnymnoumen.mode	@ltx/en_us_holycross/miscellanea:misc.Mode1
ltx/en_us_holycross/he.h.m1:heHE.OrthrizontesSeAnymnoumen.name	
ltx/en_us_holycross/he.h.m1:heHE.OrthrizontesSeAnymnoumen.notmetered	N/M (We rise early.)
ltx/en_us_holycross/he.h.m1:heHE.OrthrizontesSeAnymnoumen.ode	@ltx/en_us_holycross/miscellanea:misc.Ode5
ltx/en_us_holycross/he.h.m1:heHE.OrthrizontesSeAnymnoumen.text	
ltx/en_us_holycross/he.h.m1:heHE.PepoikilmeniTiTheiaDoxi.greekname	
ltx/en_us_holycross/he.h.m1:heHE.PepoikilmeniTiTheiaDoxi.incipit	…
ltx/en_us_holycross/he.h.m1:heHE.PepoikilmeniTiTheiaDoxi.melody	@ltx/en_us_holycross/miscellanea:misc.HeirmosNotMetered
ltx/en_us_holycross/he.h.m1:heHE.PepoikilmeniTiTheiaDoxi.mode	@ltx/en_us_holycross/miscellanea:misc.Mode1
ltx/en_us_holycross/he.h.m1:heHE.PepoikilmeniTiTheiaDoxi.name	
ltx/en_us_holycross/he.h.m1:heHE.PepoikilmeniTiTheiaDoxi.notmetered	N/M ()
ltx/en_us_holycross/he.h.m1:heHE.PepoikilmeniTiTheiaDoxi.ode	@ltx/en_us_holycross/miscellanea:misc.Ode1
ltx/en_us_holycross/he.h.m1:heHE.PepoikilmeniTiTheiaDoxi.text	
ltx/en_us_holycross/he.h.m1:heHE.ProsecheOuraneKaiLaliso.greekname	
ltx/en_us_holycross/he.h.m1:heHE.ProsecheOuraneKaiLaliso.incipit	…
ltx/en_us_holycross/he.h.m1:heHE.ProsecheOuraneKaiLaliso.melody	@ltx/en_us_holycross/miscellanea:misc.HeirmosNotMetered
ltx/en_us_holycross/he.h.m1:heHE.ProsecheOuraneKaiLaliso.mode	@ltx/en_us_holycross/miscellanea:misc.Mode1
ltx/en_us_holycross/he.h.m1:heHE.ProsecheOuraneKaiLaliso.name	
ltx/en_us_holycross/he.h.m1:heHE.ProsecheOuraneKaiLaliso.notmetered	N/M ()
ltx/en_us_holycross/he.h.m1:heHE.ProsecheOuraneKaiLaliso.ode	@ltx/en_us_holycross/miscellanea:misc.Ode2
ltx/en_us_holycross/he.h.m1:heHE.ProsecheOuraneKaiLaliso.text	
ltx/en_us_holycross/he.h.m1:heHE.RavdosEkTisRizis.greekname	
ltx/en_us_holycross/he.h.m1:heHE.RavdosEkTisRizis.incipit	…
ltx/en_us_holycross/he.h.m1:heHE.RavdosEkTisRizis.melody	@ltx/en_us_holycross/miscellanea:misc.HeirmosNotMetered
ltx/en_us_holycross/he.h.m1:heHE.RavdosEkTisRizis.mode	@ltx/en_us_holycross/miscellanea:misc.Mode1
ltx/en_us_holycross/he.h.m1:heHE.RavdosEkTisRizis.name	
ltx/en_us_holycross/he.h.m1:heHE.RavdosEkTisRizis.notmetered	N/M (A rod has come forth.)
ltx/en_us_holycross/he.h.m1:heHE.RavdosEkTisRizis.ode	@ltx/en_us_holycross/miscellanea:misc.Ode4
ltx/en_us_holycross/he.h.m1:heHE.RavdosEkTisRizis.text	
ltx/en_us_holycross/he.h.m1:heHE.RiseisProfitonKaiAinigmata.greekname	
ltx/en_us_holycross/he.h.m1:heHE.RiseisProfitonKaiAinigmata.incipit	…
ltx/en_us_holycross/he.h.m1:heHE.RiseisProfitonKaiAinigmata.melody	@ltx/en_us_holycross/miscellanea:misc.HeirmosNotMetered
ltx/en_us_holycross/he.h.m1:heHE.RiseisProfitonKaiAinigmata.mode	@ltx/en_us_holycross/miscellanea:misc.Mode1
ltx/en_us_holycross/he.h.m1:heHE.RiseisProfitonKaiAinigmata.name	
ltx/en_us_holycross/he.h.m1:heHE.RiseisProfitonKaiAinigmata.notmetered	N/M (Sayings of the Prophets.)
ltx/en_us_holycross/he.h.m1:heHE.RiseisProfitonKaiAinigmata.ode	@ltx/en_us_holycross/miscellanea:misc.Ode4
ltx/en_us_holycross/he.h.m1:heHE.RiseisProfitonKaiAinigmata.text	
ltx/en_us_holycross/he.h.m1:heHE.SeInPerEideMoysis.greekname	
ltx/en_us_holycross/he.h.m1:heHE.SeInPerEideMoysis.incipit	…
ltx/en_us_holycross/he.h.m1:heHE.SeInPerEideMoysis.melody	@ltx/en_us_holycross/miscellanea:misc.HeirmosNotMetered
ltx/en_us_holycross/he.h.m1:heHE.SeInPerEideMoysis.mode	@ltx/en_us_holycross/miscellanea:misc.Mode1
ltx/en_us_holycross/he.h.m1:heHE.SeInPerEideMoysis.name	
ltx/en_us_holycross/he.h.m1:heHE.SeInPerEideMoysis.notmetered	N/M ()
ltx/en_us_holycross/he.h.m1:heHE.SeInPerEideMoysis.ode	@ltx/en_us_holycross/miscellanea:misc.Ode9
ltx/en_us_holycross/he.h.m1:heHE.SeInPerEideMoysis.text	
ltx/en_us_holycross/he.h.m1:heHE.SeNoitin.greekname	
ltx/en_us_holycross/he.h.m1:heHE.SeNoitin.incipit	…
ltx/en_us_holycross/he.h.m1:heHE.SeNoitin.melody	@ltx/en_us_holycross/miscellanea:misc.HeirmosNotMetered
ltx/en_us_holycross/he.h.m1:heHE.SeNoitin.mode	@ltx/en_us_holycross/miscellanea:misc.Mode1
ltx/en_us_holycross/he.h.m1:heHE.SeNoitin.name	
ltx/en_us_holycross/he.h.m1:heHE.SeNoitin.notmetered	N/M ()
ltx/en_us_holycross/he.h.m1:heHE.SeNoitin.ode	@ltx/en_us_holycross/miscellanea:misc.Ode7
ltx/en_us_holycross/he.h.m1:heHE.SeNoitin.text	
ltx/en_us_holycross/he.h.m1:heHE.SeTinFaeinin.greekname	
ltx/en_us_holycross/he.h.m1:heHE.SeTinFaeinin.incipit	…
ltx/en_us_holycross/he.h.m1:heHE.SeTinFaeinin.melody	@ltx/en_us_holycross/miscellanea:misc.HeirmosNotMetered
ltx/en_us_holycross/he.h.m1:heHE.SeTinFaeinin.mode	@ltx/en_us_holycross/miscellanea:misc.Mode1
ltx/en_us_holycross/he.h.m1:heHE.SeTinFaeinin.name	
ltx/en_us_holycross/he.h.m1:heHE.SeTinFaeinin.notmetered	N/M (Mother of our God, we praise you.)
ltx/en_us_holycross/he.h.m1:heHE.SeTinFaeinin.ode	@ltx/en_us_holycross/miscellanea:misc.Ode9
ltx/en_us_holycross/he.h.m1:heHE.SeTinFaeinin.text	
ltx/en_us_holycross/he.h.m1:heHE.SeTinOratheisan.greekname	
ltx/en_us_holycross/he.h.m1:heHE.SeTinOratheisan.incipit	…
ltx/en_us_holycross/he.h.m1:heHE.SeTinOratheisan.melody	@ltx/en_us_holycross/miscellanea:misc.HeirmosNotMetered
ltx/en_us_holycross/he.h.m1:heHE.SeTinOratheisan.mode	@ltx/en_us_holycross/miscellanea:misc.Mode1
ltx/en_us_holycross/he.h.m1:heHE.SeTinOratheisan.name	
ltx/en_us_holycross/he.h.m1:heHE.SeTinOratheisan.notmetered	N/M ()
ltx/en_us_holycross/he.h.m1:heHE.SeTinOratheisan.ode	@ltx/en_us_holycross/miscellanea:misc.Ode9
ltx/en_us_holycross/he.h.m1:heHE.SeTinOratheisan.text	
ltx/en_us_holycross/he.h.m1:heHE.SouITropaiouchos.greekname	
ltx/en_us_holycross/he.h.m1:heHE.SouITropaiouchos.incipit	…
ltx/en_us_holycross/he.h.m1:heHE.SouITropaiouchos.melody	@ltx/en_us_holycross/miscellanea:misc.HeirmosNotMetered
ltx/en_us_holycross/he.h.m1:heHE.SouITropaiouchos.mode	@ltx/en_us_holycross/miscellanea:misc.Mode1
ltx/en_us_holycross/he.h.m1:heHE.SouITropaiouchos.name	
ltx/en_us_holycross/he.h.m1:heHE.SouITropaiouchos.notmetered	N/M (Glorified in strength.)
ltx/en_us_holycross/he.h.m1:heHE.SouITropaiouchos.ode	@ltx/en_us_holycross/miscellanea:misc.Ode1
ltx/en_us_holycross/he.h.m1:heHE.SouITropaiouchos.text	
ltx/en_us_holycross/he.h.m1:heHE.SplanchnonIonan.greekname	
ltx/en_us_holycross/he.h.m1:heHE.SplanchnonIonan.incipit	…
ltx/en_us_holycross/he.h.m1:heHE.SplanchnonIonan.melody	@ltx/en_us_holycross/miscellanea:misc.HeirmosNotMetered
ltx/en_us_holycross/he.h.m1:heHE.SplanchnonIonan.mode	@ltx/en_us_holycross/miscellanea:misc.Mode1
ltx/en_us_holycross/he.h.m1:heHE.SplanchnonIonan.name	
ltx/en_us_holycross/he.h.m1:heHE.SplanchnonIonan.notmetered	N/M (Jonah long ago.)
ltx/en_us_holycross/he.h.m1:heHE.SplanchnonIonan.ode	@ltx/en_us_holycross/miscellanea:misc.Ode6
ltx/en_us_holycross/he.h.m1:heHE.SplanchnonIonan.text	
ltx/en_us_holycross/he.h.m1:heHE.StereomaMouGenou.greekname	
ltx/en_us_holycross/he.h.m1:heHE.StereomaMouGenou.incipit	…
ltx/en_us_holycross/he.h.m1:heHE.StereomaMouGenou.melody	@ltx/en_us_holycross/miscellanea:misc.HeirmosNotMetered
ltx/en_us_holycross/he.h.m1:heHE.StereomaMouGenou.mode	@ltx/en_us_holycross/miscellanea:misc.Mode1
ltx/en_us_holycross/he.h.m1:heHE.StereomaMouGenou.name	
ltx/en_us_holycross/he.h.m1:heHE.StereomaMouGenou.notmetered	N/M ()
ltx/en_us_holycross/he.h.m1:heHE.StereomaMouGenou.ode	@ltx/en_us_holycross/miscellanea:misc.Ode3
ltx/en_us_holycross/he.h.m1:heHE.StereomaMouGenou.text	
ltx/en_us_holycross/he.h.m1:heHE.StereosonDespotaChriste.greekname	
ltx/en_us_holycross/he.h.m1:heHE.StereosonDespotaChriste.incipit	…
ltx/en_us_holycross/he.h.m1:heHE.StereosonDespotaChriste.melody	@ltx/en_us_holycross/miscellanea:misc.HeirmosNotMetered
ltx/en_us_holycross/he.h.m1:heHE.StereosonDespotaChriste.mode	@ltx/en_us_holycross/miscellanea:misc.Mode1
ltx/en_us_holycross/he.h.m1:heHE.StereosonDespotaChriste.name	
ltx/en_us_holycross/he.h.m1:heHE.StereosonDespotaChriste.notmetered	N/M (O Christ, set me firmly.)
ltx/en_us_holycross/he.h.m1:heHE.StereosonDespotaChriste.ode	@ltx/en_us_holycross/miscellanea:misc.Ode3
ltx/en_us_holycross/he.h.m1:heHE.StereosonDespotaChriste.text	
ltx/en_us_holycross/he.h.m1:heHE.StereosonKyrie.greekname	
ltx/en_us_holycross/he.h.m1:heHE.StereosonKyrie.incipit	…
ltx/en_us_holycross/he.h.m1:heHE.StereosonKyrie.melody	@ltx/en_us_holycross/miscellanea:misc.HeirmosNotMetered
ltx/en_us_holycross/he.h.m1:heHE.StereosonKyrie.mode	@ltx/en_us_holycross/miscellanea:misc.Mode1
ltx/en_us_holycross/he.h.m1:heHE.StereosonKyrie.name	
ltx/en_us_holycross/he.h.m1:heHE.StereosonKyrie.notmetered	N/M ()
ltx/en_us_holycross/he.h.m1:heHE.StereosonKyrie.ode	@ltx/en_us_holycross/miscellanea:misc.Ode3
ltx/en_us_holycross/he.h.m1:heHE.StereosonKyrie.text	
ltx/en_us_holycross/he.h.m1:heHE.StereosonMeChriste.greekname	
ltx/en_us_holycross/he.h.m1:heHE.StereosonMeChriste.incipit	…
ltx/en_us_holycross/he.h.m1:heHE.StereosonMeChriste.melody	@ltx/en_us_holycross/miscellanea:misc.HeirmosNotMetered
ltx/en_us_holycross/he.h.m1:heHE.StereosonMeChriste.mode	@ltx/en_us_holycross/miscellanea:misc.Mode1
ltx/en_us_holycross/he.h.m1:heHE.StereosonMeChriste.name	Establish me, O my Christ.
ltx/en_us_holycross/he.h.m1:heHE.StereosonMeChriste.notmetered	N/M (Establish me, O my Christ.)
ltx/en_us_holycross/he.h.m1:heHE.StereosonMeChriste.ode	@ltx/en_us_holycross/miscellanea:misc.Ode3
ltx/en_us_holycross/he.h.m1:heHE.StereosonMeChriste.text	
ltx/en_us_holycross/he.h.m1:heHE.StereothitoIKardiaMou.greekname	
ltx/en_us_holycross/he.h.m1:heHE.StereothitoIKardiaMou.incipit	Firmly established be my hear…
ltx/en_us_holycross/he.h.m1:heHE.StereothitoIKardiaMou.melody	@ltx/en_us_holycross/miscellanea:misc.HeirmosNotMetered
ltx/en_us_holycross/he.h.m1:heHE.StereothitoIKardiaMou.mode	@ltx/en_us_holycross/miscellanea:misc.Mode1
ltx/en_us_holycross/he.h.m1:heHE.StereothitoIKardiaMou.name	Firmly established be my hear.
ltx/en_us_holycross/he.h.m1:heHE.StereothitoIKardiaMou.notmetered	N/M (Firmly established be.)
ltx/en_us_holycross/he.h.m1:heHE.StereothitoIKardiaMou.ode	@ltx/en_us_holycross/miscellanea:misc.Ode3
ltx/en_us_holycross/he.h.m1:heHE.StereothitoIKardiaMou.text	
ltx/en_us_holycross/he.h.m1:heHE.StergeinMenImas.greekname	
ltx/en_us_holycross/he.h.m1:heHE.StergeinMenImas.incipit	…
ltx/en_us_holycross/he.h.m1:heHE.StergeinMenImas.melody	@ltx/en_us_holycross/miscellanea:misc.HeirmosNotMetered
ltx/en_us_holycross/he.h.m1:heHE.StergeinMenImas.mode	@ltx/en_us_holycross/miscellanea:misc.Mode1
ltx/en_us_holycross/he.h.m1:heHE.StergeinMenImas.name	
ltx/en_us_holycross/he.h.m1:heHE.StergeinMenImas.notmetered	N/M (To favor being silent.)
ltx/en_us_holycross/he.h.m1:heHE.StergeinMenImas.ode	@ltx/en_us_holycross/miscellanea:misc.Ode9
ltx/en_us_holycross/he.h.m1:heHE.StergeinMenImas.text	
ltx/en_us_holycross/he.h.m1:heHE.StergeinMenImas1.text	
ltx/en_us_holycross/he.h.m1:heHE.StergeinMenImas2.text	
ltx/en_us_holycross/he.h.m1:heHE.StergeinMenImas3.text	
ltx/en_us_holycross/he.h.m1:heHE.StergeinMenImas4.text	
ltx/en_us_holycross/he.h.m1:heHE.StergeinMenImas5.text	
ltx/en_us_holycross/he.h.m1:heHE.SynToIonaVoomen.greekname	
ltx/en_us_holycross/he.h.m1:heHE.SynToIonaVoomen.incipit	…
ltx/en_us_holycross/he.h.m1:heHE.SynToIonaVoomen.melody	@ltx/en_us_holycross/miscellanea:misc.HeirmosNotMetered
ltx/en_us_holycross/he.h.m1:heHE.SynToIonaVoomen.mode	@ltx/en_us_holycross/miscellanea:misc.Mode1
ltx/en_us_holycross/he.h.m1:heHE.SynToIonaVoomen.name	
ltx/en_us_holycross/he.h.m1:heHE.SynToIonaVoomen.notmetered	N/M ()
ltx/en_us_holycross/he.h.m1:heHE.SynToIonaVoomen.ode	@ltx/en_us_holycross/miscellanea:misc.Ode6
ltx/en_us_holycross/he.h.m1:heHE.SynToIonaVoomen.text	
ltx/en_us_holycross/he.h.m1:heHE.SynToThavmasioStas.greekname	
ltx/en_us_holycross/he.h.m1:heHE.SynToThavmasioStas.incipit	…
ltx/en_us_holycross/he.h.m1:heHE.SynToThavmasioStas.melody	@ltx/en_us_holycross/miscellanea:misc.HeirmosNotMetered
ltx/en_us_holycross/he.h.m1:heHE.SynToThavmasioStas.mode	@ltx/en_us_holycross/miscellanea:misc.Mode1
ltx/en_us_holycross/he.h.m1:heHE.SynToThavmasioStas.name	
ltx/en_us_holycross/he.h.m1:heHE.SynToThavmasioStas.notmetered	N/M ()
ltx/en_us_holycross/he.h.m1:heHE.SynToThavmasioStas.ode	@ltx/en_us_holycross/miscellanea:misc.Ode4
ltx/en_us_holycross/he.h.m1:heHE.SynToThavmasioStas.text	
ltx/en_us_holycross/he.h.m1:heHE.ThavmatosYperfyous.greekname	
ltx/en_us_holycross/he.h.m1:heHE.ThavmatosYperfyous.incipit	…
ltx/en_us_holycross/he.h.m1:heHE.ThavmatosYperfyous.melody	@ltx/en_us_holycross/miscellanea:misc.HeirmosNotMetered
ltx/en_us_holycross/he.h.m1:heHE.ThavmatosYperfyous.mode	@ltx/en_us_holycross/miscellanea:misc.Mode1
ltx/en_us_holycross/he.h.m1:heHE.ThavmatosYperfyous.name	
ltx/en_us_holycross/he.h.m1:heHE.ThavmatosYperfyous.notmetered	N/M (Babylon’s bedewing furnace.)
ltx/en_us_holycross/he.h.m1:heHE.ThavmatosYperfyous.ode	@ltx/en_us_holycross/miscellanea:misc.Ode8
ltx/en_us_holycross/he.h.m1:heHE.ThavmatosYperfyous.text	
ltx/en_us_holycross/he.h.m1:heHE.TheosOnEirinis.greekname	
ltx/en_us_holycross/he.h.m1:heHE.TheosOnEirinis.incipit	…
ltx/en_us_holycross/he.h.m1:heHE.TheosOnEirinis.melody	@ltx/en_us_holycross/miscellanea:misc.HeirmosNotMetered
ltx/en_us_holycross/he.h.m1:heHE.TheosOnEirinis.mode	@ltx/en_us_holycross/miscellanea:misc.Mode1
ltx/en_us_holycross/he.h.m1:heHE.TheosOnEirinis.name	
ltx/en_us_holycross/he.h.m1:heHE.TheosOnEirinis.notmetered	N/M (O God of peace.)
ltx/en_us_holycross/he.h.m1:heHE.TheosOnEirinis.ode	@ltx/en_us_holycross/miscellanea:misc.Ode5
ltx/en_us_holycross/he.h.m1:heHE.TheosOnEirinis.text	
ltx/en_us_holycross/he.h.m1:heHE.TinFotoforonNefelin.greekname	
ltx/en_us_holycross/he.h.m1:heHE.TinFotoforonNefelin.incipit	…
ltx/en_us_holycross/he.h.m1:heHE.TinFotoforonNefelin.melody	@ltx/en_us_holycross/miscellanea:misc.HeirmosNotMetered
ltx/en_us_holycross/he.h.m1:heHE.TinFotoforonNefelin.mode	@ltx/en_us_holycross/miscellanea:misc.Mode1
ltx/en_us_holycross/he.h.m1:heHE.TinFotoforonNefelin.name	
ltx/en_us_holycross/he.h.m1:heHE.TinFotoforonNefelin.notmetered	N/M (The cloud that radiates.)
ltx/en_us_holycross/he.h.m1:heHE.TinFotoforonNefelin.ode	@ltx/en_us_holycross/miscellanea:misc.Ode9
ltx/en_us_holycross/he.h.m1:heHE.TinFotoforonNefelin.text	
ltx/en_us_holycross/he.h.m1:heHE.TinSinEirinin.greekname	
ltx/en_us_holycross/he.h.m1:heHE.TinSinEirinin.incipit	…
ltx/en_us_holycross/he.h.m1:heHE.TinSinEirinin.melody	@ltx/en_us_holycross/miscellanea:misc.HeirmosNotMetered
ltx/en_us_holycross/he.h.m1:heHE.TinSinEirinin.mode	@ltx/en_us_holycross/miscellanea:misc.Mode1
ltx/en_us_holycross/he.h.m1:heHE.TinSinEirinin.name	O Son and Word.
ltx/en_us_holycross/he.h.m1:heHE.TinSinEirinin.notmetered	N/M (O Son and Word.)
ltx/en_us_holycross/he.h.m1:heHE.TinSinEirinin.ode	@ltx/en_us_holycross/miscellanea:misc.Ode5
ltx/en_us_holycross/he.h.m1:heHE.TinSinEirinin.text	
ltx/en_us_holycross/he.h.m1:heHE.TinZoodochonPigin.greekname	
ltx/en_us_holycross/he.h.m1:heHE.TinZoodochonPigin.incipit	…
ltx/en_us_holycross/he.h.m1:heHE.TinZoodochonPigin.melody	@ltx/en_us_holycross/miscellanea:misc.HeirmosNotMetered
ltx/en_us_holycross/he.h.m1:heHE.TinZoodochonPigin.mode	@ltx/en_us_holycross/miscellanea:misc.Mode1
ltx/en_us_holycross/he.h.m1:heHE.TinZoodochonPigin.name	
ltx/en_us_holycross/he.h.m1:heHE.TinZoodochonPigin.notmetered	N/M ()
ltx/en_us_holycross/he.h.m1:heHE.TinZoodochonPigin.ode	@ltx/en_us_holycross/miscellanea:misc.Ode9
ltx/en_us_holycross/he.h.m1:heHE.TinZoodochonPigin.text	
ltx/en_us_holycross/he.h.m1:heHE.ToFaeinonIminExanateilon.greekname	
ltx/en_us_holycross/he.h.m1:heHE.ToFaeinonIminExanateilon.incipit	…
ltx/en_us_holycross/he.h.m1:heHE.ToFaeinonIminExanateilon.melody	@ltx/en_us_holycross/miscellanea:misc.HeirmosNotMetered
ltx/en_us_holycross/he.h.m1:heHE.ToFaeinonIminExanateilon.mode	@ltx/en_us_holycross/miscellanea:misc.Mode1
ltx/en_us_holycross/he.h.m1:heHE.ToFaeinonIminExanateilon.name	
ltx/en_us_holycross/he.h.m1:heHE.ToFaeinonIminExanateilon.notmetered	N/M ()
ltx/en_us_holycross/he.h.m1:heHE.ToFaeinonIminExanateilon.ode	@ltx/en_us_holycross/miscellanea:misc.Ode5
ltx/en_us_holycross/he.h.m1:heHE.ToFaeinonIminExanateilon.text	
ltx/en_us_holycross/he.h.m1:heHE.ToPantanaktos.greekname	
ltx/en_us_holycross/he.h.m1:heHE.ToPantanaktos.incipit	…
ltx/en_us_holycross/he.h.m1:heHE.ToPantanaktos.melody	@ltx/en_us_holycross/miscellanea:misc.HeirmosNotMetered
ltx/en_us_holycross/he.h.m1:heHE.ToPantanaktos.mode	@ltx/en_us_holycross/miscellanea:misc.Mode1
ltx/en_us_holycross/he.h.m1:heHE.ToPantanaktos.name	
ltx/en_us_holycross/he.h.m1:heHE.ToPantanaktos.notmetered	N/M (In Babylon, the three Servants.)
ltx/en_us_holycross/he.h.m1:heHE.ToPantanaktos.ode	@ltx/en_us_holycross/miscellanea:misc.Ode7
ltx/en_us_holycross/he.h.m1:heHE.ToPantanaktos.text	
ltx/en_us_holycross/he.h.m1:heHE.ToPantanaktos1.text	
ltx/en_us_holycross/he.h.m1:heHE.ToPantanaktos2.text	
ltx/en_us_holycross/he.h.m1:heHE.ToPantanaktos3.text	
ltx/en_us_holycross/he.h.m1:heHE.ToPantanaktos4.text	
ltx/en_us_holycross/he.h.m1:heHE.ToPantanaktos5.text	
ltx/en_us_holycross/he.h.m1:heHE.ToProTonAionon.greekname	
ltx/en_us_holycross/he.h.m1:heHE.ToProTonAionon.incipit	…
ltx/en_us_holycross/he.h.m1:heHE.ToProTonAionon.melody	@ltx/en_us_holycross/miscellanea:misc.HeirmosNotMetered
ltx/en_us_holycross/he.h.m1:heHE.ToProTonAionon.mode	@ltx/en_us_holycross/miscellanea:misc.Mode1
ltx/en_us_holycross/he.h.m1:heHE.ToProTonAionon.name	
ltx/en_us_holycross/he.h.m1:heHE.ToProTonAionon.notmetered	N/M (To the Son.)
ltx/en_us_holycross/he.h.m1:heHE.ToProTonAionon.ode	@ltx/en_us_holycross/miscellanea:misc.Ode3
ltx/en_us_holycross/he.h.m1:heHE.ToProTonAionon.text	
ltx/en_us_holycross/he.h.m1:heHE.ToTheionKaiArriton.greekname	
ltx/en_us_holycross/he.h.m1:heHE.ToTheionKaiArriton.incipit	…
ltx/en_us_holycross/he.h.m1:heHE.ToTheionKaiArriton.melody	@ltx/en_us_holycross/miscellanea:misc.HeirmosNotMetered
ltx/en_us_holycross/he.h.m1:heHE.ToTheionKaiArriton.mode	@ltx/en_us_holycross/miscellanea:misc.Mode1
ltx/en_us_holycross/he.h.m1:heHE.ToTheionKaiArriton.name	
ltx/en_us_holycross/he.h.m1:heHE.ToTheionKaiArriton.notmetered	N/M (O Christ, I shall tell.)
ltx/en_us_holycross/he.h.m1:heHE.ToTheionKaiArriton.ode	@ltx/en_us_holycross/miscellanea:misc.Ode5
ltx/en_us_holycross/he.h.m1:heHE.ToTheionKaiArriton.text	
ltx/en_us_holycross/he.h.m1:heHE.ToVoithisantiTheo.greekname	
ltx/en_us_holycross/he.h.m1:heHE.ToVoithisantiTheo.incipit	…
ltx/en_us_holycross/he.h.m1:heHE.ToVoithisantiTheo.melody	@ltx/en_us_holycross/miscellanea:misc.HeirmosNotMetered
ltx/en_us_holycross/he.h.m1:heHE.ToVoithisantiTheo.mode	@ltx/en_us_holycross/miscellanea:misc.Mode1
ltx/en_us_holycross/he.h.m1:heHE.ToVoithisantiTheo.name	
ltx/en_us_holycross/he.h.m1:heHE.ToVoithisantiTheo.notmetered	N/M ()
ltx/en_us_holycross/he.h.m1:heHE.ToVoithisantiTheo.ode	@ltx/en_us_holycross/miscellanea:misc.Ode1
ltx/en_us_holycross/he.h.m1:heHE.ToVoithisantiTheo.text	
ltx/en_us_holycross/he.h.m1:heHE.TonEnFlogiPyros.greekname	
ltx/en_us_holycross/he.h.m1:heHE.TonEnFlogiPyros.incipit	…
ltx/en_us_holycross/he.h.m1:heHE.TonEnFlogiPyros.melody	@ltx/en_us_holycross/miscellanea:misc.HeirmosNotMetered
ltx/en_us_holycross/he.h.m1:heHE.TonEnFlogiPyros.mode	@ltx/en_us_holycross/miscellanea:misc.Mode1
ltx/en_us_holycross/he.h.m1:heHE.TonEnFlogiPyros.name	
ltx/en_us_holycross/he.h.m1:heHE.TonEnFlogiPyros.notmetered	N/M ()
ltx/en_us_holycross/he.h.m1:heHE.TonEnFlogiPyros.ode	@ltx/en_us_holycross/miscellanea:misc.Ode8
ltx/en_us_holycross/he.h.m1:heHE.TonEnFlogiPyros.text	
ltx/en_us_holycross/he.h.m1:heHE.TonEnSinaTinVaton.greekname	
ltx/en_us_holycross/he.h.m1:heHE.TonEnSinaTinVaton.incipit	…
ltx/en_us_holycross/he.h.m1:heHE.TonEnSinaTinVaton.melody	@ltx/en_us_holycross/miscellanea:misc.HeirmosNotMetered
ltx/en_us_holycross/he.h.m1:heHE.TonEnSinaTinVaton.mode	@ltx/en_us_holycross/miscellanea:misc.Mode1
ltx/en_us_holycross/he.h.m1:heHE.TonEnSinaTinVaton.name	
ltx/en_us_holycross/he.h.m1:heHE.TonEnSinaTinVaton.notmetered	N/M ()
ltx/en_us_holycross/he.h.m1:heHE.TonEnSinaTinVaton.ode	@ltx/en_us_holycross/miscellanea:misc.Ode8
ltx/en_us_holycross/he.h.m1:heHE.TonEnSinaTinVaton.text	
ltx/en_us_holycross/he.h.m1:heHE.TonEnSofiaTousOuranous.greekname	
ltx/en_us_holycross/he.h.m1:heHE.TonEnSofiaTousOuranous.incipit	…
ltx/en_us_holycross/he.h.m1:heHE.TonEnSofiaTousOuranous.melody	@ltx/en_us_holycross/miscellanea:misc.HeirmosNotMetered
ltx/en_us_holycross/he.h.m1:heHE.TonEnSofiaTousOuranous.mode	@ltx/en_us_holycross/miscellanea:misc.Mode1
ltx/en_us_holycross/he.h.m1:heHE.TonEnSofiaTousOuranous.name	
ltx/en_us_holycross/he.h.m1:heHE.TonEnSofiaTousOuranous.notmetered	N/M ()
ltx/en_us_holycross/he.h.m1:heHE.TonEnSofiaTousOuranous.ode	@ltx/en_us_holycross/miscellanea:misc.Ode8
ltx/en_us_holycross/he.h.m1:heHE.TonEnSofiaTousOuranous.text	
ltx/en_us_holycross/he.h.m1:heHE.TonProfitinDiesosas.greekname	
ltx/en_us_holycross/he.h.m1:heHE.TonProfitinDiesosas.incipit	…
ltx/en_us_holycross/he.h.m1:heHE.TonProfitinDiesosas.melody	@ltx/en_us_holycross/miscellanea:misc.HeirmosNotMetered
ltx/en_us_holycross/he.h.m1:heHE.TonProfitinDiesosas.mode	@ltx/en_us_holycross/miscellanea:misc.Mode1
ltx/en_us_holycross/he.h.m1:heHE.TonProfitinDiesosas.name	
ltx/en_us_holycross/he.h.m1:heHE.TonProfitinDiesosas.notmetered	N/M ()
ltx/en_us_holycross/he.h.m1:heHE.TonProfitinDiesosas.ode	@ltx/en_us_holycross/miscellanea:misc.Ode6
ltx/en_us_holycross/he.h.m1:heHE.TonProfitinDiesosas.text	
ltx/en_us_holycross/he.h.m1:heHE.TonProfitinIonan.greekname	
ltx/en_us_holycross/he.h.m1:heHE.TonProfitinIonan.incipit	…
ltx/en_us_holycross/he.h.m1:heHE.TonProfitinIonan.melody	@ltx/en_us_holycross/miscellanea:misc.HeirmosNotMetered
ltx/en_us_holycross/he.h.m1:heHE.TonProfitinIonan.mode	@ltx/en_us_holycross/miscellanea:misc.Mode1
ltx/en_us_holycross/he.h.m1:heHE.TonProfitinIonan.name	
ltx/en_us_holycross/he.h.m1:heHE.TonProfitinIonan.notmetered	N/M ()
ltx/en_us_holycross/he.h.m1:heHE.TonProfitinIonan.ode	@ltx/en_us_holycross/miscellanea:misc.Ode6
ltx/en_us_holycross/he.h.m1:heHE.TonProfitinIonan.text	
ltx/en_us_holycross/he.h.m1:heHE.TonTousYmnologousEnKamino.greekname	
ltx/en_us_holycross/he.h.m1:heHE.TonTousYmnologousEnKamino.incipit	…
ltx/en_us_holycross/he.h.m1:heHE.TonTousYmnologousEnKamino.melody	@ltx/en_us_holycross/miscellanea:misc.HeirmosNotMetered
ltx/en_us_holycross/he.h.m1:heHE.TonTousYmnologousEnKamino.mode	@ltx/en_us_holycross/miscellanea:misc.Mode1
ltx/en_us_holycross/he.h.m1:heHE.TonTousYmnologousEnKamino.name	
ltx/en_us_holycross/he.h.m1:heHE.TonTousYmnologousEnKamino.notmetered	N/M ()
ltx/en_us_holycross/he.h.m1:heHE.TonTousYmnologousEnKamino.ode	@ltx/en_us_holycross/miscellanea:misc.Ode8
ltx/en_us_holycross/he.h.m1:heHE.TonTousYmnologousEnKamino.text	
ltx/en_us_holycross/he.h.m1:heHE.TonTyponTouTheiouStavrou.greekname	
ltx/en_us_holycross/he.h.m1:heHE.TonTyponTouTheiouStavrou.incipit	…
ltx/en_us_holycross/he.h.m1:heHE.TonTyponTouTheiouStavrou.melody	@ltx/en_us_holycross/miscellanea:misc.HeirmosNotMetered
ltx/en_us_holycross/he.h.m1:heHE.TonTyponTouTheiouStavrou.mode	@ltx/en_us_holycross/miscellanea:misc.Mode1
ltx/en_us_holycross/he.h.m1:heHE.TonTyponTouTheiouStavrou.name	
ltx/en_us_holycross/he.h.m1:heHE.TonTyponTouTheiouStavrou.notmetered	N/M (When Jonah was in.)
ltx/en_us_holycross/he.h.m1:heHE.TonTyponTouTheiouStavrou.ode	@ltx/en_us_holycross/miscellanea:misc.Ode6
ltx/en_us_holycross/he.h.m1:heHE.TonTyponTouTheiouStavrou.text	
ltx/en_us_holycross/he.h.m1:heHE.TousEnKaminoPaidas.greekname	
ltx/en_us_holycross/he.h.m1:heHE.TousEnKaminoPaidas.incipit	…
ltx/en_us_holycross/he.h.m1:heHE.TousEnKaminoPaidas.melody	@ltx/en_us_holycross/miscellanea:misc.HeirmosNotMetered
ltx/en_us_holycross/he.h.m1:heHE.TousEnKaminoPaidas.mode	@ltx/en_us_holycross/miscellanea:misc.Mode1
ltx/en_us_holycross/he.h.m1:heHE.TousEnKaminoPaidas.name	O Lord and Savior.
ltx/en_us_holycross/he.h.m1:heHE.TousEnKaminoPaidas.notmetered	N/M (O Lord and Savior.)
ltx/en_us_holycross/he.h.m1:heHE.TousEnKaminoPaidas.ode	@ltx/en_us_holycross/miscellanea:misc.Ode7
ltx/en_us_holycross/he.h.m1:heHE.TousEnKaminoPaidas.text	
ltx/en_us_holycross/he.h.m1:heHE.TyponTisAgnis.greekname	
ltx/en_us_holycross/he.h.m1:heHE.TyponTisAgnis.incipit	…
ltx/en_us_holycross/he.h.m1:heHE.TyponTisAgnis.melody	@ltx/en_us_holycross/miscellanea:misc.HeirmosNotMetered
ltx/en_us_holycross/he.h.m1:heHE.TyponTisAgnis.mode	@ltx/en_us_holycross/miscellanea:misc.Mode1
ltx/en_us_holycross/he.h.m1:heHE.TyponTisAgnis.name	
ltx/en_us_holycross/he.h.m1:heHE.TyponTisAgnis.notmetered	N/M (Burning, yet remaining unconsumed.)
ltx/en_us_holycross/he.h.m1:heHE.TyponTisAgnis.ode	@ltx/en_us_holycross/miscellanea:misc.Ode9
ltx/en_us_holycross/he.h.m1:heHE.TyponTisAgnis.text	
ltx/en_us_holycross/he.h.m1:heHE.YmnonSoiProsferomen.greekname	
ltx/en_us_holycross/he.h.m1:heHE.YmnonSoiProsferomen.incipit	…
ltx/en_us_holycross/he.h.m1:heHE.YmnonSoiProsferomen.melody	@ltx/en_us_holycross/miscellanea:misc.HeirmosNotMetered
ltx/en_us_holycross/he.h.m1:heHE.YmnonSoiProsferomen.mode	@ltx/en_us_holycross/miscellanea:misc.Mode1
ltx/en_us_holycross/he.h.m1:heHE.YmnonSoiProsferomen.name	
ltx/en_us_holycross/he.h.m1:heHE.YmnonSoiProsferomen.notmetered	N/M ()
ltx/en_us_holycross/he.h.m1:heHE.YmnonSoiProsferomen.ode	@ltx/en_us_holycross/miscellanea:misc.Ode8
ltx/en_us_holycross/he.h.m1:heHE.YmnonSoiProsferomen.text	
ltx/en_us_holycross/he.h.m1:heHE.YpilthonOsNymfona.greekname	
ltx/en_us_holycross/he.h.m1:heHE.YpilthonOsNymfona.incipit	…
ltx/en_us_holycross/he.h.m1:heHE.YpilthonOsNymfona.melody	@ltx/en_us_holycross/miscellanea:misc.HeirmosNotMetered
ltx/en_us_holycross/he.h.m1:heHE.YpilthonOsNymfona.mode	@ltx/en_us_holycross/miscellanea:misc.Mode1
ltx/en_us_holycross/he.h.m1:heHE.YpilthonOsNymfona.name	
ltx/en_us_holycross/he.h.m1:heHE.YpilthonOsNymfona.notmetered	N/M ()
ltx/en_us_holycross/he.h.m1:heHE.YpilthonOsNymfona.ode	@ltx/en_us_holycross/miscellanea:misc.Ode7
ltx/en_us_holycross/he.h.m1:heHE.YpilthonOsNymfona.text	
