ltx/en_us_holycross/eu.footwashing:euFW.Idiomelon1.incipit	…
ltx/en_us_holycross/eu.footwashing:euFW.Idiomelon1.melody	@ltx/en_us_holycross/miscellanea:misc.Idiomelon
ltx/en_us_holycross/eu.footwashing:euFW.Idiomelon1.mode	@ltx/en_us_holycross/miscellanea:misc.Mode1
ltx/en_us_holycross/eu.footwashing:euFW.Idiomelon1.text	
ltx/en_us_holycross/eu.footwashing:euFW.Idiomelon2.incipit	…
ltx/en_us_holycross/eu.footwashing:euFW.Idiomelon2.melody	@ltx/en_us_holycross/miscellanea:misc.Idiomelon
ltx/en_us_holycross/eu.footwashing:euFW.Idiomelon2.mode	@ltx/en_us_holycross/miscellanea:misc.Mode2
ltx/en_us_holycross/eu.footwashing:euFW.Idiomelon2.text	
ltx/en_us_holycross/eu.footwashing:euFW.Idiomelon3.incipit	…
ltx/en_us_holycross/eu.footwashing:euFW.Idiomelon3.melody	@ltx/en_us_holycross/miscellanea:misc.Idiomelon
ltx/en_us_holycross/eu.footwashing:euFW.Idiomelon3.mode	@ltx/en_us_holycross/miscellanea:misc.Mode2
ltx/en_us_holycross/eu.footwashing:euFW.Idiomelon3.text	
ltx/en_us_holycross/eu.footwashing:euFW.Idiomelon4.incipit	…
ltx/en_us_holycross/eu.footwashing:euFW.Idiomelon4.melody	@ltx/en_us_holycross/miscellanea:misc.Idiomelon
ltx/en_us_holycross/eu.footwashing:euFW.Idiomelon4.mode	@ltx/en_us_holycross/miscellanea:misc.Mode8
ltx/en_us_holycross/eu.footwashing:euFW.Idiomelon4.text	
ltx/en_us_holycross/eu.footwashing:euFW.Idiomelon5.incipit	…
ltx/en_us_holycross/eu.footwashing:euFW.Idiomelon5.melody	@ltx/en_us_holycross/miscellanea:misc.Idiomelon
ltx/en_us_holycross/eu.footwashing:euFW.Idiomelon5.mode	@ltx/en_us_holycross/miscellanea:misc.Mode8
ltx/en_us_holycross/eu.footwashing:euFW.Idiomelon5.text	
ltx/en_us_holycross/eu.footwashing:euFW.Idiomelon6.incipit	…
ltx/en_us_holycross/eu.footwashing:euFW.Idiomelon6.melody	@ltx/en_us_holycross/miscellanea:misc.Idiomelon
ltx/en_us_holycross/eu.footwashing:euFW.Idiomelon6.mode	@ltx/en_us_holycross/miscellanea:misc.Mode8
ltx/en_us_holycross/eu.footwashing:euFW.Idiomelon6.text	
ltx/en_us_holycross/eu.footwashing:euFW.title	
