ltx/en_us_holycross/he.h.m7:heHE.AflektosPyri.greekname	
ltx/en_us_holycross/he.h.m7:heHE.AflektosPyri.incipit	…
ltx/en_us_holycross/he.h.m7:heHE.AflektosPyri.melody	@ltx/en_us_holycross/miscellanea:misc.HeirmosNotMetered
ltx/en_us_holycross/he.h.m7:heHE.AflektosPyri.mode	@ltx/en_us_holycross/miscellanea:misc.Mode7
ltx/en_us_holycross/he.h.m7:heHE.AflektosPyri.name	
ltx/en_us_holycross/he.h.m7:heHE.AflektosPyri.notmetered	N/M (Unconsumed by fire.)
ltx/en_us_holycross/he.h.m7:heHE.AflektosPyri.ode	@ltx/en_us_holycross/miscellanea:misc.Ode8
ltx/en_us_holycross/he.h.m7:heHE.AflektosPyri.text	
ltx/en_us_holycross/he.h.m7:heHE.AkikoaTinAkoinSou.greekname	
ltx/en_us_holycross/he.h.m7:heHE.AkikoaTinAkoinSou.incipit	…
ltx/en_us_holycross/he.h.m7:heHE.AkikoaTinAkoinSou.melody	@ltx/en_us_holycross/miscellanea:misc.HeirmosNotMetered
ltx/en_us_holycross/he.h.m7:heHE.AkikoaTinAkoinSou.mode	@ltx/en_us_holycross/miscellanea:misc.Mode7
ltx/en_us_holycross/he.h.m7:heHE.AkikoaTinAkoinSou.name	
ltx/en_us_holycross/he.h.m7:heHE.AkikoaTinAkoinSou.notmetered	N/M ()
ltx/en_us_holycross/he.h.m7:heHE.AkikoaTinAkoinSou.ode	@ltx/en_us_holycross/miscellanea:misc.Ode4
ltx/en_us_holycross/he.h.m7:heHE.AkikoaTinAkoinSou.text	
ltx/en_us_holycross/he.h.m7:heHE.AsomenToKyrio.greekname	
ltx/en_us_holycross/he.h.m7:heHE.AsomenToKyrio.incipit	…
ltx/en_us_holycross/he.h.m7:heHE.AsomenToKyrio.melody	@ltx/en_us_holycross/miscellanea:misc.HeirmosNotMetered
ltx/en_us_holycross/he.h.m7:heHE.AsomenToKyrio.mode	@ltx/en_us_holycross/miscellanea:misc.Mode7
ltx/en_us_holycross/he.h.m7:heHE.AsomenToKyrio.name	
ltx/en_us_holycross/he.h.m7:heHE.AsomenToKyrio.notmetered	N/M ()
ltx/en_us_holycross/he.h.m7:heHE.AsomenToKyrio.ode	@ltx/en_us_holycross/miscellanea:misc.Ode1
ltx/en_us_holycross/he.h.m7:heHE.AsomenToKyrio.text	
ltx/en_us_holycross/he.h.m7:heHE.AsporouTokouSyllipsin.greekname	
ltx/en_us_holycross/he.h.m7:heHE.AsporouTokouSyllipsin.incipit	…
ltx/en_us_holycross/he.h.m7:heHE.AsporouTokouSyllipsin.melody	@ltx/en_us_holycross/miscellanea:misc.HeirmosNotMetered
ltx/en_us_holycross/he.h.m7:heHE.AsporouTokouSyllipsin.mode	@ltx/en_us_holycross/miscellanea:misc.Mode7
ltx/en_us_holycross/he.h.m7:heHE.AsporouTokouSyllipsin.name	
ltx/en_us_holycross/he.h.m7:heHE.AsporouTokouSyllipsin.notmetered	N/M ()
ltx/en_us_holycross/he.h.m7:heHE.AsporouTokouSyllipsin.ode	@ltx/en_us_holycross/miscellanea:misc.Ode9
ltx/en_us_holycross/he.h.m7:heHE.AsporouTokouSyllipsin.text	
ltx/en_us_holycross/he.h.m7:heHE.DiaskedasasTinNykta.greekname	
ltx/en_us_holycross/he.h.m7:heHE.DiaskedasasTinNykta.incipit	…
ltx/en_us_holycross/he.h.m7:heHE.DiaskedasasTinNykta.melody	@ltx/en_us_holycross/miscellanea:misc.HeirmosNotMetered
ltx/en_us_holycross/he.h.m7:heHE.DiaskedasasTinNykta.mode	@ltx/en_us_holycross/miscellanea:misc.Mode7
ltx/en_us_holycross/he.h.m7:heHE.DiaskedasasTinNykta.name	
ltx/en_us_holycross/he.h.m7:heHE.DiaskedasasTinNykta.notmetered	N/M ()
ltx/en_us_holycross/he.h.m7:heHE.DiaskedasasTinNykta.ode	@ltx/en_us_holycross/miscellanea:misc.Ode5
ltx/en_us_holycross/he.h.m7:heHE.DiaskedasasTinNykta.text	
ltx/en_us_holycross/he.h.m7:heHE.EisakikoaTinAkoin.greekname	
ltx/en_us_holycross/he.h.m7:heHE.EisakikoaTinAkoin.incipit	…
ltx/en_us_holycross/he.h.m7:heHE.EisakikoaTinAkoin.melody	@ltx/en_us_holycross/miscellanea:misc.HeirmosNotMetered
ltx/en_us_holycross/he.h.m7:heHE.EisakikoaTinAkoin.mode	@ltx/en_us_holycross/miscellanea:misc.Mode7
ltx/en_us_holycross/he.h.m7:heHE.EisakikoaTinAkoin.name	
ltx/en_us_holycross/he.h.m7:heHE.EisakikoaTinAkoin.notmetered	N/M ()
ltx/en_us_holycross/he.h.m7:heHE.EisakikoaTinAkoin.ode	@ltx/en_us_holycross/miscellanea:misc.Ode4
ltx/en_us_holycross/he.h.m7:heHE.EisakikoaTinAkoin.text	
ltx/en_us_holycross/he.h.m7:heHE.EkalypsenOuranous.greekname	
ltx/en_us_holycross/he.h.m7:heHE.EkalypsenOuranous.incipit	…
ltx/en_us_holycross/he.h.m7:heHE.EkalypsenOuranous.melody	@ltx/en_us_holycross/miscellanea:misc.HeirmosNotMetered
ltx/en_us_holycross/he.h.m7:heHE.EkalypsenOuranous.mode	@ltx/en_us_holycross/miscellanea:misc.Mode7
ltx/en_us_holycross/he.h.m7:heHE.EkalypsenOuranous.name	
ltx/en_us_holycross/he.h.m7:heHE.EkalypsenOuranous.notmetered	N/M ()
ltx/en_us_holycross/he.h.m7:heHE.EkalypsenOuranous.ode	@ltx/en_us_holycross/miscellanea:misc.Ode4
ltx/en_us_holycross/he.h.m7:heHE.EkalypsenOuranous.text	
ltx/en_us_holycross/he.h.m7:heHE.EstereothiIKardiaMou.greekname	
ltx/en_us_holycross/he.h.m7:heHE.EstereothiIKardiaMou.incipit	…
ltx/en_us_holycross/he.h.m7:heHE.EstereothiIKardiaMou.melody	@ltx/en_us_holycross/miscellanea:misc.HeirmosNotMetered
ltx/en_us_holycross/he.h.m7:heHE.EstereothiIKardiaMou.mode	@ltx/en_us_holycross/miscellanea:misc.Mode7
ltx/en_us_holycross/he.h.m7:heHE.EstereothiIKardiaMou.name	
ltx/en_us_holycross/he.h.m7:heHE.EstereothiIKardiaMou.notmetered	N/M ()
ltx/en_us_holycross/he.h.m7:heHE.EstereothiIKardiaMou.ode	@ltx/en_us_holycross/miscellanea:misc.Ode3
ltx/en_us_holycross/he.h.m7:heHE.EstereothiIKardiaMou.text	
ltx/en_us_holycross/he.h.m7:heHE.EstereothiTiPistei.greekname	
ltx/en_us_holycross/he.h.m7:heHE.EstereothiTiPistei.incipit	…
ltx/en_us_holycross/he.h.m7:heHE.EstereothiTiPistei.melody	@ltx/en_us_holycross/miscellanea:misc.HeirmosNotMetered
ltx/en_us_holycross/he.h.m7:heHE.EstereothiTiPistei.mode	@ltx/en_us_holycross/miscellanea:misc.Mode7
ltx/en_us_holycross/he.h.m7:heHE.EstereothiTiPistei.name	
ltx/en_us_holycross/he.h.m7:heHE.EstereothiTiPistei.notmetered	N/M ()
ltx/en_us_holycross/he.h.m7:heHE.EstereothiTiPistei.ode	@ltx/en_us_holycross/miscellanea:misc.Ode3
ltx/en_us_holycross/he.h.m7:heHE.EstereothiTiPistei.text	
ltx/en_us_holycross/he.h.m7:heHE.KaminonKaiomenin.greekname	
ltx/en_us_holycross/he.h.m7:heHE.KaminonKaiomenin.incipit	…
ltx/en_us_holycross/he.h.m7:heHE.KaminonKaiomenin.melody	@ltx/en_us_holycross/miscellanea:misc.HeirmosNotMetered
ltx/en_us_holycross/he.h.m7:heHE.KaminonKaiomenin.mode	@ltx/en_us_holycross/miscellanea:misc.Mode7
ltx/en_us_holycross/he.h.m7:heHE.KaminonKaiomenin.name	
ltx/en_us_holycross/he.h.m7:heHE.KaminonKaiomenin.notmetered	N/M ()
ltx/en_us_holycross/he.h.m7:heHE.KaminonKaiomenin.ode	@ltx/en_us_holycross/miscellanea:misc.Ode7
ltx/en_us_holycross/he.h.m7:heHE.KaminonKaiomenin.text	
ltx/en_us_holycross/he.h.m7:heHE.KaminonPaides.greekname	
ltx/en_us_holycross/he.h.m7:heHE.KaminonPaides.incipit	…
ltx/en_us_holycross/he.h.m7:heHE.KaminonPaides.melody	@ltx/en_us_holycross/miscellanea:misc.HeirmosNotMetered
ltx/en_us_holycross/he.h.m7:heHE.KaminonPaides.mode	@ltx/en_us_holycross/miscellanea:misc.Mode7
ltx/en_us_holycross/he.h.m7:heHE.KaminonPaides.name	
ltx/en_us_holycross/he.h.m7:heHE.KaminonPaides.notmetered	N/M (The fiery furnace.)
ltx/en_us_holycross/he.h.m7:heHE.KaminonPaides.ode	@ltx/en_us_holycross/miscellanea:misc.Ode7
ltx/en_us_holycross/he.h.m7:heHE.KaminonPaides.text	
ltx/en_us_holycross/he.h.m7:heHE.KatanoonOProfitis.greekname	
ltx/en_us_holycross/he.h.m7:heHE.KatanoonOProfitis.incipit	…
ltx/en_us_holycross/he.h.m7:heHE.KatanoonOProfitis.melody	@ltx/en_us_holycross/miscellanea:misc.HeirmosNotMetered
ltx/en_us_holycross/he.h.m7:heHE.KatanoonOProfitis.mode	@ltx/en_us_holycross/miscellanea:misc.Mode7
ltx/en_us_holycross/he.h.m7:heHE.KatanoonOProfitis.name	
ltx/en_us_holycross/he.h.m7:heHE.KatanoonOProfitis.notmetered	N/M (Prophet Habakkuk considered.)
ltx/en_us_holycross/he.h.m7:heHE.KatanoonOProfitis.ode	@ltx/en_us_holycross/miscellanea:misc.Ode4
ltx/en_us_holycross/he.h.m7:heHE.KatanoonOProfitis.text	
ltx/en_us_holycross/he.h.m7:heHE.KyrieOTheosMou.greekname	
ltx/en_us_holycross/he.h.m7:heHE.KyrieOTheosMou.incipit	…
ltx/en_us_holycross/he.h.m7:heHE.KyrieOTheosMou.melody	@ltx/en_us_holycross/miscellanea:misc.HeirmosNotMetered
ltx/en_us_holycross/he.h.m7:heHE.KyrieOTheosMou.mode	@ltx/en_us_holycross/miscellanea:misc.Mode7
ltx/en_us_holycross/he.h.m7:heHE.KyrieOTheosMou.name	
ltx/en_us_holycross/he.h.m7:heHE.KyrieOTheosMou.notmetered	N/M ()
ltx/en_us_holycross/he.h.m7:heHE.KyrieOTheosMou.ode	@ltx/en_us_holycross/miscellanea:misc.Ode5
ltx/en_us_holycross/he.h.m7:heHE.KyrieOTheosMou.text	
ltx/en_us_holycross/he.h.m7:heHE.MiTisFthoras.greekname	
ltx/en_us_holycross/he.h.m7:heHE.MiTisFthoras.incipit	…
ltx/en_us_holycross/he.h.m7:heHE.MiTisFthoras.melody	@ltx/en_us_holycross/miscellanea:misc.HeirmosNotMetered
ltx/en_us_holycross/he.h.m7:heHE.MiTisFthoras.mode	@ltx/en_us_holycross/miscellanea:misc.Mode7
ltx/en_us_holycross/he.h.m7:heHE.MiTisFthoras.name	
ltx/en_us_holycross/he.h.m7:heHE.MiTisFthoras.notmetered	N/M (When you conceived.)
ltx/en_us_holycross/he.h.m7:heHE.MiTisFthoras.ode	@ltx/en_us_holycross/miscellanea:misc.Ode9
ltx/en_us_holycross/he.h.m7:heHE.MiTisFthoras.text	
ltx/en_us_holycross/he.h.m7:heHE.MitirTheouKaiParthenos.greekname	
ltx/en_us_holycross/he.h.m7:heHE.MitirTheouKaiParthenos.incipit	…
ltx/en_us_holycross/he.h.m7:heHE.MitirTheouKaiParthenos.melody	@ltx/en_us_holycross/miscellanea:misc.HeirmosNotMetered
ltx/en_us_holycross/he.h.m7:heHE.MitirTheouKaiParthenos.mode	@ltx/en_us_holycross/miscellanea:misc.Mode7
ltx/en_us_holycross/he.h.m7:heHE.MitirTheouKaiParthenos.name	
ltx/en_us_holycross/he.h.m7:heHE.MitirTheouKaiParthenos.notmetered	N/M (You as the Mother of God.)
ltx/en_us_holycross/he.h.m7:heHE.MitirTheouKaiParthenos.ode	@ltx/en_us_holycross/miscellanea:misc.Ode9
ltx/en_us_holycross/he.h.m7:heHE.MitirTheouKaiParthenos.text	
ltx/en_us_holycross/he.h.m7:heHE.NaftionToSalo.greekname	
ltx/en_us_holycross/he.h.m7:heHE.NaftionToSalo.incipit	…
ltx/en_us_holycross/he.h.m7:heHE.NaftionToSalo.melody	@ltx/en_us_holycross/miscellanea:misc.HeirmosNotMetered
ltx/en_us_holycross/he.h.m7:heHE.NaftionToSalo.mode	@ltx/en_us_holycross/miscellanea:misc.Mode7
ltx/en_us_holycross/he.h.m7:heHE.NaftionToSalo.name	
ltx/en_us_holycross/he.h.m7:heHE.NaftionToSalo.notmetered	N/M (I was feeling nauseous.)
ltx/en_us_holycross/he.h.m7:heHE.NaftionToSalo.ode	@ltx/en_us_holycross/miscellanea:misc.Ode6
ltx/en_us_holycross/he.h.m7:heHE.NaftionToSalo.text	
ltx/en_us_holycross/he.h.m7:heHE.NefseiSouProsGeodi.greekname	
ltx/en_us_holycross/he.h.m7:heHE.NefseiSouProsGeodi.incipit	…
ltx/en_us_holycross/he.h.m7:heHE.NefseiSouProsGeodi.melody	@ltx/en_us_holycross/miscellanea:misc.HeirmosNotMetered
ltx/en_us_holycross/he.h.m7:heHE.NefseiSouProsGeodi.mode	@ltx/en_us_holycross/miscellanea:misc.Mode7
ltx/en_us_holycross/he.h.m7:heHE.NefseiSouProsGeodi.name	
ltx/en_us_holycross/he.h.m7:heHE.NefseiSouProsGeodi.notmetered	N/M (Lord, at Your divine signal.)
ltx/en_us_holycross/he.h.m7:heHE.NefseiSouProsGeodi.ode	@ltx/en_us_holycross/miscellanea:misc.Ode1
ltx/en_us_holycross/he.h.m7:heHE.NefseiSouProsGeodi.text	
ltx/en_us_holycross/he.h.m7:heHE.NyxAfengis.greekname	
ltx/en_us_holycross/he.h.m7:heHE.NyxAfengis.incipit	…
ltx/en_us_holycross/he.h.m7:heHE.NyxAfengis.melody	@ltx/en_us_holycross/miscellanea:misc.HeirmosNotMetered
ltx/en_us_holycross/he.h.m7:heHE.NyxAfengis.mode	@ltx/en_us_holycross/miscellanea:misc.Mode7
ltx/en_us_holycross/he.h.m7:heHE.NyxAfengis.name	
ltx/en_us_holycross/he.h.m7:heHE.NyxAfengis.notmetered	N/M (For unbelievers, delight.)
ltx/en_us_holycross/he.h.m7:heHE.NyxAfengis.ode	@ltx/en_us_holycross/miscellanea:misc.Ode5
ltx/en_us_holycross/he.h.m7:heHE.NyxAfengis.text	
ltx/en_us_holycross/he.h.m7:heHE.OIonasEkKoilias.greekname	
ltx/en_us_holycross/he.h.m7:heHE.OIonasEkKoilias.incipit	…
ltx/en_us_holycross/he.h.m7:heHE.OIonasEkKoilias.melody	@ltx/en_us_holycross/miscellanea:misc.HeirmosNotMetered
ltx/en_us_holycross/he.h.m7:heHE.OIonasEkKoilias.mode	@ltx/en_us_holycross/miscellanea:misc.Mode7
ltx/en_us_holycross/he.h.m7:heHE.OIonasEkKoilias.name	
ltx/en_us_holycross/he.h.m7:heHE.OIonasEkKoilias.notmetered	N/M ()
ltx/en_us_holycross/he.h.m7:heHE.OIonasEkKoilias.ode	@ltx/en_us_holycross/miscellanea:misc.Ode6
ltx/en_us_holycross/he.h.m7:heHE.OIonasEkKoilias.text	
ltx/en_us_holycross/he.h.m7:heHE.OKatArchasTousOuranous.greekname	
ltx/en_us_holycross/he.h.m7:heHE.OKatArchasTousOuranous.incipit	…
ltx/en_us_holycross/he.h.m7:heHE.OKatArchasTousOuranous.melody	@ltx/en_us_holycross/miscellanea:misc.HeirmosNotMetered
ltx/en_us_holycross/he.h.m7:heHE.OKatArchasTousOuranous.mode	@ltx/en_us_holycross/miscellanea:misc.Mode7
ltx/en_us_holycross/he.h.m7:heHE.OKatArchasTousOuranous.name	
ltx/en_us_holycross/he.h.m7:heHE.OKatArchasTousOuranous.notmetered	N/M (First You established.)
ltx/en_us_holycross/he.h.m7:heHE.OKatArchasTousOuranous.ode	@ltx/en_us_holycross/miscellanea:misc.Ode3
ltx/en_us_holycross/he.h.m7:heHE.OKatArchasTousOuranous.text	
ltx/en_us_holycross/he.h.m7:heHE.OOuranousToLogo.greekname	
ltx/en_us_holycross/he.h.m7:heHE.OOuranousToLogo.incipit	…
ltx/en_us_holycross/he.h.m7:heHE.OOuranousToLogo.melody	@ltx/en_us_holycross/miscellanea:misc.HeirmosNotMetered
ltx/en_us_holycross/he.h.m7:heHE.OOuranousToLogo.mode	@ltx/en_us_holycross/miscellanea:misc.Mode7
ltx/en_us_holycross/he.h.m7:heHE.OOuranousToLogo.name	
ltx/en_us_holycross/he.h.m7:heHE.OOuranousToLogo.notmetered	N/M ()
ltx/en_us_holycross/he.h.m7:heHE.OOuranousToLogo.ode	@ltx/en_us_holycross/miscellanea:misc.Ode1
ltx/en_us_holycross/he.h.m7:heHE.OOuranousToLogo.text	
ltx/en_us_holycross/he.h.m7:heHE.OPatrikousKolpous.greekname	
ltx/en_us_holycross/he.h.m7:heHE.OPatrikousKolpous.incipit	…
ltx/en_us_holycross/he.h.m7:heHE.OPatrikousKolpous.melody	@ltx/en_us_holycross/miscellanea:misc.HeirmosNotMetered
ltx/en_us_holycross/he.h.m7:heHE.OPatrikousKolpous.mode	@ltx/en_us_holycross/miscellanea:misc.Mode7
ltx/en_us_holycross/he.h.m7:heHE.OPatrikousKolpous.name	
ltx/en_us_holycross/he.h.m7:heHE.OPatrikousKolpous.notmetered	N/M (O Christ our God, You did not depart.)
ltx/en_us_holycross/he.h.m7:heHE.OPatrikousKolpous.ode	@ltx/en_us_holycross/miscellanea:misc.Ode4
ltx/en_us_holycross/he.h.m7:heHE.OPatrikousKolpous.text	
ltx/en_us_holycross/he.h.m7:heHE.OStereosasToLogo.greekname	
ltx/en_us_holycross/he.h.m7:heHE.OStereosasToLogo.incipit	…
ltx/en_us_holycross/he.h.m7:heHE.OStereosasToLogo.melody	@ltx/en_us_holycross/miscellanea:misc.HeirmosNotMetered
ltx/en_us_holycross/he.h.m7:heHE.OStereosasToLogo.mode	@ltx/en_us_holycross/miscellanea:misc.Mode7
ltx/en_us_holycross/he.h.m7:heHE.OStereosasToLogo.name	
ltx/en_us_holycross/he.h.m7:heHE.OStereosasToLogo.notmetered	N/M ()
ltx/en_us_holycross/he.h.m7:heHE.OStereosasToLogo.ode	@ltx/en_us_holycross/miscellanea:misc.Ode3
ltx/en_us_holycross/he.h.m7:heHE.OStereosasToLogo.text	
ltx/en_us_holycross/he.h.m7:heHE.OTonPateron.greekname	
ltx/en_us_holycross/he.h.m7:heHE.OTonPateron.incipit	…
ltx/en_us_holycross/he.h.m7:heHE.OTonPateron.melody	@ltx/en_us_holycross/miscellanea:misc.HeirmosNotMetered
ltx/en_us_holycross/he.h.m7:heHE.OTonPateron.mode	@ltx/en_us_holycross/miscellanea:misc.Mode7
ltx/en_us_holycross/he.h.m7:heHE.OTonPateron.name	
ltx/en_us_holycross/he.h.m7:heHE.OTonPateron.notmetered	N/M ()
ltx/en_us_holycross/he.h.m7:heHE.OTonPateron.ode	@ltx/en_us_holycross/miscellanea:misc.Ode7
ltx/en_us_holycross/he.h.m7:heHE.OTonPateron.text	
ltx/en_us_holycross/he.h.m7:heHE.OiEnKaminoTouPyros.greekname	
ltx/en_us_holycross/he.h.m7:heHE.OiEnKaminoTouPyros.incipit	…
ltx/en_us_holycross/he.h.m7:heHE.OiEnKaminoTouPyros.melody	@ltx/en_us_holycross/miscellanea:misc.HeirmosNotMetered
ltx/en_us_holycross/he.h.m7:heHE.OiEnKaminoTouPyros.mode	@ltx/en_us_holycross/miscellanea:misc.Mode7
ltx/en_us_holycross/he.h.m7:heHE.OiEnKaminoTouPyros.name	
ltx/en_us_holycross/he.h.m7:heHE.OiEnKaminoTouPyros.notmetered	N/M (Those godly Servants.)
ltx/en_us_holycross/he.h.m7:heHE.OiEnKaminoTouPyros.ode	@ltx/en_us_holycross/miscellanea:misc.Ode7
ltx/en_us_holycross/he.h.m7:heHE.OiEnKaminoTouPyros.text	
ltx/en_us_holycross/he.h.m7:heHE.OiOrthrizontesLoge.greekname	
ltx/en_us_holycross/he.h.m7:heHE.OiOrthrizontesLoge.incipit	…
ltx/en_us_holycross/he.h.m7:heHE.OiOrthrizontesLoge.melody	@ltx/en_us_holycross/miscellanea:misc.HeirmosNotMetered
ltx/en_us_holycross/he.h.m7:heHE.OiOrthrizontesLoge.mode	@ltx/en_us_holycross/miscellanea:misc.Mode7
ltx/en_us_holycross/he.h.m7:heHE.OiOrthrizontesLoge.name	
ltx/en_us_holycross/he.h.m7:heHE.OiOrthrizontesLoge.notmetered	N/M ()
ltx/en_us_holycross/he.h.m7:heHE.OiOrthrizontesLoge.ode	@ltx/en_us_holycross/miscellanea:misc.Ode5
ltx/en_us_holycross/he.h.m7:heHE.OiOrthrizontesLoge.text	
ltx/en_us_holycross/he.h.m7:heHE.OrthrizeiToPnevmaMou.greekname	
ltx/en_us_holycross/he.h.m7:heHE.OrthrizeiToPnevmaMou.incipit	…
ltx/en_us_holycross/he.h.m7:heHE.OrthrizeiToPnevmaMou.melody	@ltx/en_us_holycross/miscellanea:misc.HeirmosNotMetered
ltx/en_us_holycross/he.h.m7:heHE.OrthrizeiToPnevmaMou.mode	@ltx/en_us_holycross/miscellanea:misc.Mode7
ltx/en_us_holycross/he.h.m7:heHE.OrthrizeiToPnevmaMou.name	
ltx/en_us_holycross/he.h.m7:heHE.OrthrizeiToPnevmaMou.notmetered	N/M ()
ltx/en_us_holycross/he.h.m7:heHE.OrthrizeiToPnevmaMou.ode	@ltx/en_us_holycross/miscellanea:misc.Ode5
ltx/en_us_holycross/he.h.m7:heHE.OrthrizeiToPnevmaMou.text	
ltx/en_us_holycross/he.h.m7:heHE.PanymniteTonOuranonYpsilotera.greekname	
ltx/en_us_holycross/he.h.m7:heHE.PanymniteTonOuranonYpsilotera.incipit	…
ltx/en_us_holycross/he.h.m7:heHE.PanymniteTonOuranonYpsilotera.melody	@ltx/en_us_holycross/miscellanea:misc.HeirmosNotMetered
ltx/en_us_holycross/he.h.m7:heHE.PanymniteTonOuranonYpsilotera.mode	@ltx/en_us_holycross/miscellanea:misc.Mode7
ltx/en_us_holycross/he.h.m7:heHE.PanymniteTonOuranonYpsilotera.name	
ltx/en_us_holycross/he.h.m7:heHE.PanymniteTonOuranonYpsilotera.notmetered	N/M ()
ltx/en_us_holycross/he.h.m7:heHE.PanymniteTonOuranonYpsilotera.ode	@ltx/en_us_holycross/miscellanea:misc.Ode9
ltx/en_us_holycross/he.h.m7:heHE.PanymniteTonOuranonYpsilotera.text	
ltx/en_us_holycross/he.h.m7:heHE.PontoEkalypse.greekname	
ltx/en_us_holycross/he.h.m7:heHE.PontoEkalypse.incipit	…
ltx/en_us_holycross/he.h.m7:heHE.PontoEkalypse.melody	@ltx/en_us_holycross/miscellanea:misc.HeirmosNotMetered
ltx/en_us_holycross/he.h.m7:heHE.PontoEkalypse.mode	@ltx/en_us_holycross/miscellanea:misc.Mode7
ltx/en_us_holycross/he.h.m7:heHE.PontoEkalypse.name	
ltx/en_us_holycross/he.h.m7:heHE.PontoEkalypse.notmetered	N/M (The Lord is a warrior.)
ltx/en_us_holycross/he.h.m7:heHE.PontoEkalypse.ode	@ltx/en_us_holycross/miscellanea:misc.Ode1
ltx/en_us_holycross/he.h.m7:heHE.PontoEkalypse.text	
ltx/en_us_holycross/he.h.m7:heHE.ProsSeOrthrizo.greekname	
ltx/en_us_holycross/he.h.m7:heHE.ProsSeOrthrizo.incipit	…
ltx/en_us_holycross/he.h.m7:heHE.ProsSeOrthrizo.melody	@ltx/en_us_holycross/miscellanea:misc.HeirmosNotMetered
ltx/en_us_holycross/he.h.m7:heHE.ProsSeOrthrizo.mode	@ltx/en_us_holycross/miscellanea:misc.Mode7
ltx/en_us_holycross/he.h.m7:heHE.ProsSeOrthrizo.name	
ltx/en_us_holycross/he.h.m7:heHE.ProsSeOrthrizo.notmetered	N/M ()
ltx/en_us_holycross/he.h.m7:heHE.ProsSeOrthrizo.ode	@ltx/en_us_holycross/miscellanea:misc.Ode5
ltx/en_us_holycross/he.h.m7:heHE.ProsSeOrthrizo.text	
ltx/en_us_holycross/he.h.m7:heHE.SeTinAchranton.greekname	
ltx/en_us_holycross/he.h.m7:heHE.SeTinAchranton.incipit	…
ltx/en_us_holycross/he.h.m7:heHE.SeTinAchranton.melody	@ltx/en_us_holycross/miscellanea:misc.HeirmosNotMetered
ltx/en_us_holycross/he.h.m7:heHE.SeTinAchranton.mode	@ltx/en_us_holycross/miscellanea:misc.Mode7
ltx/en_us_holycross/he.h.m7:heHE.SeTinAchranton.name	
ltx/en_us_holycross/he.h.m7:heHE.SeTinAchranton.notmetered	N/M ()
ltx/en_us_holycross/he.h.m7:heHE.SeTinAchranton.ode	@ltx/en_us_holycross/miscellanea:misc.Ode9
ltx/en_us_holycross/he.h.m7:heHE.SeTinAchranton.text	
ltx/en_us_holycross/he.h.m7:heHE.StereomaMouGenou.greekname	
ltx/en_us_holycross/he.h.m7:heHE.StereomaMouGenou.incipit	…
ltx/en_us_holycross/he.h.m7:heHE.StereomaMouGenou.melody	@ltx/en_us_holycross/miscellanea:misc.HeirmosNotMetered
ltx/en_us_holycross/he.h.m7:heHE.StereomaMouGenou.mode	@ltx/en_us_holycross/miscellanea:misc.Mode7
ltx/en_us_holycross/he.h.m7:heHE.StereomaMouGenou.name	
ltx/en_us_holycross/he.h.m7:heHE.StereomaMouGenou.notmetered	N/M ()
ltx/en_us_holycross/he.h.m7:heHE.StereomaMouGenou.ode	@ltx/en_us_holycross/miscellanea:misc.Ode3
ltx/en_us_holycross/he.h.m7:heHE.StereomaMouGenou.text	
ltx/en_us_holycross/he.h.m7:heHE.TinEnsarkonParousianSou.greekname	
ltx/en_us_holycross/he.h.m7:heHE.TinEnsarkonParousianSou.incipit	…
ltx/en_us_holycross/he.h.m7:heHE.TinEnsarkonParousianSou.melody	@ltx/en_us_holycross/miscellanea:misc.HeirmosNotMetered
ltx/en_us_holycross/he.h.m7:heHE.TinEnsarkonParousianSou.mode	@ltx/en_us_holycross/miscellanea:misc.Mode7
ltx/en_us_holycross/he.h.m7:heHE.TinEnsarkonParousianSou.name	
ltx/en_us_holycross/he.h.m7:heHE.TinEnsarkonParousianSou.notmetered	N/M ()
ltx/en_us_holycross/he.h.m7:heHE.TinEnsarkonParousianSou.ode	@ltx/en_us_holycross/miscellanea:misc.Ode4
ltx/en_us_holycross/he.h.m7:heHE.TinEnsarkonParousianSou.text	
ltx/en_us_holycross/he.h.m7:heHE.TinExYpsousDynamin.greekname	
ltx/en_us_holycross/he.h.m7:heHE.TinExYpsousDynamin.incipit	…
ltx/en_us_holycross/he.h.m7:heHE.TinExYpsousDynamin.melody	@ltx/en_us_holycross/miscellanea:misc.HeirmosNotMetered
ltx/en_us_holycross/he.h.m7:heHE.TinExYpsousDynamin.mode	@ltx/en_us_holycross/miscellanea:misc.Mode7
ltx/en_us_holycross/he.h.m7:heHE.TinExYpsousDynamin.name	
ltx/en_us_holycross/he.h.m7:heHE.TinExYpsousDynamin.notmetered	N/M (Do not leave Jerusalem.)
ltx/en_us_holycross/he.h.m7:heHE.TinExYpsousDynamin.ode	@ltx/en_us_holycross/miscellanea:misc.Ode3
ltx/en_us_holycross/he.h.m7:heHE.TinExYpsousDynamin.text	
ltx/en_us_holycross/he.h.m7:heHE.TinYperFysinMitera.greekname	
ltx/en_us_holycross/he.h.m7:heHE.TinYperFysinMitera.incipit	…
ltx/en_us_holycross/he.h.m7:heHE.TinYperFysinMitera.melody	@ltx/en_us_holycross/miscellanea:misc.HeirmosNotMetered
ltx/en_us_holycross/he.h.m7:heHE.TinYperFysinMitera.mode	@ltx/en_us_holycross/miscellanea:misc.Mode7
ltx/en_us_holycross/he.h.m7:heHE.TinYperFysinMitera.name	
ltx/en_us_holycross/he.h.m7:heHE.TinYperFysinMitera.notmetered	N/M ()
ltx/en_us_holycross/he.h.m7:heHE.TinYperFysinMitera.ode	@ltx/en_us_holycross/miscellanea:misc.Ode9
ltx/en_us_holycross/he.h.m7:heHE.TinYperFysinMitera.text	
ltx/en_us_holycross/he.h.m7:heHE.ToDiaTonFovonSou.greekname	
ltx/en_us_holycross/he.h.m7:heHE.ToDiaTonFovonSou.incipit	…
ltx/en_us_holycross/he.h.m7:heHE.ToDiaTonFovonSou.melody	@ltx/en_us_holycross/miscellanea:misc.HeirmosNotMetered
ltx/en_us_holycross/he.h.m7:heHE.ToDiaTonFovonSou.mode	@ltx/en_us_holycross/miscellanea:misc.Mode7
ltx/en_us_holycross/he.h.m7:heHE.ToDiaTonFovonSou.name	
ltx/en_us_holycross/he.h.m7:heHE.ToDiaTonFovonSou.notmetered	N/M (That which for the fear of You.)
ltx/en_us_holycross/he.h.m7:heHE.ToDiaTonFovonSou.ode	@ltx/en_us_holycross/miscellanea:misc.Ode5
ltx/en_us_holycross/he.h.m7:heHE.ToDiaTonFovonSou.text	
ltx/en_us_holycross/he.h.m7:heHE.ToEktinaxantiTheo.greekname	
ltx/en_us_holycross/he.h.m7:heHE.ToEktinaxantiTheo.incipit	…
ltx/en_us_holycross/he.h.m7:heHE.ToEktinaxantiTheo.melody	@ltx/en_us_holycross/miscellanea:misc.HeirmosNotMetered
ltx/en_us_holycross/he.h.m7:heHE.ToEktinaxantiTheo.mode	@ltx/en_us_holycross/miscellanea:misc.Mode7
ltx/en_us_holycross/he.h.m7:heHE.ToEktinaxantiTheo.name	
ltx/en_us_holycross/he.h.m7:heHE.ToEktinaxantiTheo.notmetered	N/M ()
ltx/en_us_holycross/he.h.m7:heHE.ToEktinaxantiTheo.ode	@ltx/en_us_holycross/miscellanea:misc.Ode1
ltx/en_us_holycross/he.h.m7:heHE.ToEktinaxantiTheo.text	
ltx/en_us_holycross/he.h.m7:heHE.ToSynergisantiTheo.greekname	
ltx/en_us_holycross/he.h.m7:heHE.ToSynergisantiTheo.incipit	…
ltx/en_us_holycross/he.h.m7:heHE.ToSynergisantiTheo.melody	@ltx/en_us_holycross/miscellanea:misc.HeirmosNotMetered
ltx/en_us_holycross/he.h.m7:heHE.ToSynergisantiTheo.mode	@ltx/en_us_holycross/miscellanea:misc.Mode7
ltx/en_us_holycross/he.h.m7:heHE.ToSynergisantiTheo.name	
ltx/en_us_holycross/he.h.m7:heHE.ToSynergisantiTheo.notmetered	N/M ()
ltx/en_us_holycross/he.h.m7:heHE.ToSynergisantiTheo.ode	@ltx/en_us_holycross/miscellanea:misc.Ode1
ltx/en_us_holycross/he.h.m7:heHE.ToSynergisantiTheo.text	
ltx/en_us_holycross/he.h.m7:heHE.ToSyntripsantiPolemous.greekname	
ltx/en_us_holycross/he.h.m7:heHE.ToSyntripsantiPolemous.incipit	…
ltx/en_us_holycross/he.h.m7:heHE.ToSyntripsantiPolemous.melody	@ltx/en_us_holycross/miscellanea:misc.HeirmosNotMetered
ltx/en_us_holycross/he.h.m7:heHE.ToSyntripsantiPolemous.mode	@ltx/en_us_holycross/miscellanea:misc.Mode7
ltx/en_us_holycross/he.h.m7:heHE.ToSyntripsantiPolemous.name	
ltx/en_us_holycross/he.h.m7:heHE.ToSyntripsantiPolemous.notmetered	N/M ()
ltx/en_us_holycross/he.h.m7:heHE.ToSyntripsantiPolemous.ode	@ltx/en_us_holycross/miscellanea:misc.Ode1
ltx/en_us_holycross/he.h.m7:heHE.ToSyntripsantiPolemous.text	
ltx/en_us_holycross/he.h.m7:heHE.TonFoveronToisCherouvim.greekname	
ltx/en_us_holycross/he.h.m7:heHE.TonFoveronToisCherouvim.incipit	…
ltx/en_us_holycross/he.h.m7:heHE.TonFoveronToisCherouvim.melody	@ltx/en_us_holycross/miscellanea:misc.HeirmosNotMetered
ltx/en_us_holycross/he.h.m7:heHE.TonFoveronToisCherouvim.mode	@ltx/en_us_holycross/miscellanea:misc.Mode7
ltx/en_us_holycross/he.h.m7:heHE.TonFoveronToisCherouvim.name	
ltx/en_us_holycross/he.h.m7:heHE.TonFoveronToisCherouvim.notmetered	N/M ()
ltx/en_us_holycross/he.h.m7:heHE.TonFoveronToisCherouvim.ode	@ltx/en_us_holycross/miscellanea:misc.Ode8
ltx/en_us_holycross/he.h.m7:heHE.TonFoveronToisCherouvim.text	
ltx/en_us_holycross/he.h.m7:heHE.TonMononAnarchon.greekname	
ltx/en_us_holycross/he.h.m7:heHE.TonMononAnarchon.incipit	…
ltx/en_us_holycross/he.h.m7:heHE.TonMononAnarchon.melody	@ltx/en_us_holycross/miscellanea:misc.HeirmosNotMetered
ltx/en_us_holycross/he.h.m7:heHE.TonMononAnarchon.mode	@ltx/en_us_holycross/miscellanea:misc.Mode7
ltx/en_us_holycross/he.h.m7:heHE.TonMononAnarchon.name	
ltx/en_us_holycross/he.h.m7:heHE.TonMononAnarchon.notmetered	N/M ()
ltx/en_us_holycross/he.h.m7:heHE.TonMononAnarchon.ode	@ltx/en_us_holycross/miscellanea:misc.Ode8
ltx/en_us_holycross/he.h.m7:heHE.TonMononAnarchon.text	
ltx/en_us_holycross/he.h.m7:heHE.TonYpAngelonAsigitos.greekname	
ltx/en_us_holycross/he.h.m7:heHE.TonYpAngelonAsigitos.incipit	…
ltx/en_us_holycross/he.h.m7:heHE.TonYpAngelonAsigitos.melody	@ltx/en_us_holycross/miscellanea:misc.HeirmosNotMetered
ltx/en_us_holycross/he.h.m7:heHE.TonYpAngelonAsigitos.mode	@ltx/en_us_holycross/miscellanea:misc.Mode7
ltx/en_us_holycross/he.h.m7:heHE.TonYpAngelonAsigitos.name	
ltx/en_us_holycross/he.h.m7:heHE.TonYpAngelonAsigitos.notmetered	N/M ()
ltx/en_us_holycross/he.h.m7:heHE.TonYpAngelonAsigitos.ode	@ltx/en_us_holycross/miscellanea:misc.Ode8
ltx/en_us_holycross/he.h.m7:heHE.TonYpAngelonAsigitos.text	
ltx/en_us_holycross/he.h.m7:heHE.TousEnKaminoPaidasMimoumenoi.greekname	
ltx/en_us_holycross/he.h.m7:heHE.TousEnKaminoPaidasMimoumenoi.incipit	…
ltx/en_us_holycross/he.h.m7:heHE.TousEnKaminoPaidasMimoumenoi.melody	@ltx/en_us_holycross/miscellanea:misc.HeirmosNotMetered
ltx/en_us_holycross/he.h.m7:heHE.TousEnKaminoPaidasMimoumenoi.mode	@ltx/en_us_holycross/miscellanea:misc.Mode7
ltx/en_us_holycross/he.h.m7:heHE.TousEnKaminoPaidasMimoumenoi.name	
ltx/en_us_holycross/he.h.m7:heHE.TousEnKaminoPaidasMimoumenoi.notmetered	N/M ()
ltx/en_us_holycross/he.h.m7:heHE.TousEnKaminoPaidasMimoumenoi.ode	@ltx/en_us_holycross/miscellanea:misc.Ode8
ltx/en_us_holycross/he.h.m7:heHE.TousEnKaminoPaidasMimoumenoi.text	
ltx/en_us_holycross/he.h.m7:heHE.TousEnKaminoPaidasOukEflexen.greekname	
ltx/en_us_holycross/he.h.m7:heHE.TousEnKaminoPaidasOukEflexen.incipit	…
ltx/en_us_holycross/he.h.m7:heHE.TousEnKaminoPaidasOukEflexen.melody	@ltx/en_us_holycross/miscellanea:misc.HeirmosNotMetered
ltx/en_us_holycross/he.h.m7:heHE.TousEnKaminoPaidasOukEflexen.mode	@ltx/en_us_holycross/miscellanea:misc.Mode7
ltx/en_us_holycross/he.h.m7:heHE.TousEnKaminoPaidasOukEflexen.name	
ltx/en_us_holycross/he.h.m7:heHE.TousEnKaminoPaidasOukEflexen.notmetered	N/M ()
ltx/en_us_holycross/he.h.m7:heHE.TousEnKaminoPaidasOukEflexen.ode	@ltx/en_us_holycross/miscellanea:misc.Ode7
ltx/en_us_holycross/he.h.m7:heHE.TousEnKaminoPaidasOukEflexen.text	
ltx/en_us_holycross/he.h.m7:heHE.VythoAmartimaton.greekname	
ltx/en_us_holycross/he.h.m7:heHE.VythoAmartimaton.incipit	…
ltx/en_us_holycross/he.h.m7:heHE.VythoAmartimaton.melody	@ltx/en_us_holycross/miscellanea:misc.HeirmosNotMetered
ltx/en_us_holycross/he.h.m7:heHE.VythoAmartimaton.mode	@ltx/en_us_holycross/miscellanea:misc.Mode7
ltx/en_us_holycross/he.h.m7:heHE.VythoAmartimaton.name	
ltx/en_us_holycross/he.h.m7:heHE.VythoAmartimaton.notmetered	N/M ()
ltx/en_us_holycross/he.h.m7:heHE.VythoAmartimaton.ode	@ltx/en_us_holycross/miscellanea:misc.Ode6
ltx/en_us_holycross/he.h.m7:heHE.VythoAmartimaton.text	
