ltx/en_us_holycross/he.a.m5:heAU.ChairoisAskitikon.greekname	
ltx/en_us_holycross/he.a.m5:heAU.ChairoisAskitikon.incipit	…
ltx/en_us_holycross/he.a.m5:heAU.ChairoisAskitikon.melody	@ltx/en_us_holycross/miscellanea:misc.Automelon
ltx/en_us_holycross/he.a.m5:heAU.ChairoisAskitikon.mode	@ltx/en_us_holycross/miscellanea:misc.Mode5
ltx/en_us_holycross/he.a.m5:heAU.ChairoisAskitikon.name	N/M (Rejoice.)
ltx/en_us_holycross/he.a.m5:heAU.ChairoisAskitikon.notmetered	N/M (Rejoice.)
ltx/en_us_holycross/he.a.m5:heAU.ChairoisAskitikon.text	
ltx/en_us_holycross/he.a.m5:heAU.LampeiSimeron.greekname	
ltx/en_us_holycross/he.a.m5:heAU.LampeiSimeron.incipit	…
ltx/en_us_holycross/he.a.m5:heAU.LampeiSimeron.melody	@ltx/en_us_holycross/miscellanea:misc.Automelon
ltx/en_us_holycross/he.a.m5:heAU.LampeiSimeron.mode	@ltx/en_us_holycross/miscellanea:misc.Mode5
ltx/en_us_holycross/he.a.m5:heAU.LampeiSimeron.name	
ltx/en_us_holycross/he.a.m5:heAU.LampeiSimeron.notmetered	N/M ()
ltx/en_us_holycross/he.a.m5:heAU.LampeiSimeron.text	
ltx/en_us_holycross/he.a.m5:heAU.OsiePater.greekname	
ltx/en_us_holycross/he.a.m5:heAU.OsiePater.incipit	…
ltx/en_us_holycross/he.a.m5:heAU.OsiePater.melody	@ltx/en_us_holycross/miscellanea:misc.Automelon
ltx/en_us_holycross/he.a.m5:heAU.OsiePater.mode	@ltx/en_us_holycross/miscellanea:misc.Mode5
ltx/en_us_holycross/he.a.m5:heAU.OsiePater.name	N/M (God-bearing Father.)
ltx/en_us_holycross/he.a.m5:heAU.OsiePater.notmetered	N/M (God-bearing Father.)
ltx/en_us_holycross/he.a.m5:heAU.OsiePater.text	
ltx/en_us_holycross/he.a.m5:heAU.TonSynanarchonLogon.greekname	
ltx/en_us_holycross/he.a.m5:heAU.TonSynanarchonLogon.incipit	…
ltx/en_us_holycross/he.a.m5:heAU.TonSynanarchonLogon.melody	@ltx/en_us_holycross/miscellanea:misc.Automelon
ltx/en_us_holycross/he.a.m5:heAU.TonSynanarchonLogon.mode	@ltx/en_us_holycross/miscellanea:misc.Mode5
ltx/en_us_holycross/he.a.m5:heAU.TonSynanarchonLogon.name	N/M (Let us worship the Word.)
ltx/en_us_holycross/he.a.m5:heAU.TonSynanarchonLogon.notmetered	N/M (Let us worship the Word.)
ltx/en_us_holycross/he.a.m5:heAU.TonSynanarchonLogon.text	
ltx/en_us_holycross/he.a.m5:heAU.title	
