ltx/en_us_holycross/oc.m8.d1:ocBK.ModeNaked	@ltx/en_us_holycross/miscellanea:misc.Mode8.naked
ltx/en_us_holycross/oc.m8.d1:ocBK.mode.title	
ltx/en_us_holycross/oc.m8.d1:ocGE.MM.BothHeirmologic.text	@ltx/en_us_holycross/properties:media.key
ltx/en_us_holycross/oc.m8.d1:ocGE.MM.BothSticheraric.text	@ltx/en_us_holycross/properties:media.key
ltx/en_us_holycross/oc.m8.d1:ocGE.MM.GloryHeirmologic.text	@ltx/en_us_holycross/properties:media.key
ltx/en_us_holycross/oc.m8.d1:ocGE.MM.GlorySticheraric.text	@ltx/en_us_holycross/properties:media.key
ltx/en_us_holycross/oc.m8.d1:ocLI.Beatitudes1.incipit	…
ltx/en_us_holycross/oc.m8.d1:ocLI.Beatitudes1.melody	
ltx/en_us_holycross/oc.m8.d1:ocLI.Beatitudes1.mode	@ltx/en_us_holycross/miscellanea:misc.Mode8
ltx/en_us_holycross/oc.m8.d1:ocLI.Beatitudes1.text	
ltx/en_us_holycross/oc.m8.d1:ocLI.Beatitudes2.incipit	…
ltx/en_us_holycross/oc.m8.d1:ocLI.Beatitudes2.melody	
ltx/en_us_holycross/oc.m8.d1:ocLI.Beatitudes2.mode	@ltx/en_us_holycross/miscellanea:misc.Mode8
ltx/en_us_holycross/oc.m8.d1:ocLI.Beatitudes2.text	
ltx/en_us_holycross/oc.m8.d1:ocLI.Beatitudes3.incipit	…
ltx/en_us_holycross/oc.m8.d1:ocLI.Beatitudes3.melody	
ltx/en_us_holycross/oc.m8.d1:ocLI.Beatitudes3.mode	@ltx/en_us_holycross/miscellanea:misc.Mode8
ltx/en_us_holycross/oc.m8.d1:ocLI.Beatitudes3.text	
ltx/en_us_holycross/oc.m8.d1:ocLI.Beatitudes4.incipit	…
ltx/en_us_holycross/oc.m8.d1:ocLI.Beatitudes4.melody	
ltx/en_us_holycross/oc.m8.d1:ocLI.Beatitudes4.mode	@ltx/en_us_holycross/miscellanea:misc.Mode8
ltx/en_us_holycross/oc.m8.d1:ocLI.Beatitudes4.text	
ltx/en_us_holycross/oc.m8.d1:ocLI.Beatitudes5.incipit	…
ltx/en_us_holycross/oc.m8.d1:ocLI.Beatitudes5.melody	
ltx/en_us_holycross/oc.m8.d1:ocLI.Beatitudes5.mode	@ltx/en_us_holycross/miscellanea:misc.Mode8
ltx/en_us_holycross/oc.m8.d1:ocLI.Beatitudes5.text	
ltx/en_us_holycross/oc.m8.d1:ocLI.Beatitudes6.incipit	…
ltx/en_us_holycross/oc.m8.d1:ocLI.Beatitudes6.melody	
ltx/en_us_holycross/oc.m8.d1:ocLI.Beatitudes6.mode	@ltx/en_us_holycross/miscellanea:misc.Mode8
ltx/en_us_holycross/oc.m8.d1:ocLI.Beatitudes6.text	
ltx/en_us_holycross/oc.m8.d1:ocLI.BeatitudesT.incipit	…
ltx/en_us_holycross/oc.m8.d1:ocLI.BeatitudesT.melody	
ltx/en_us_holycross/oc.m8.d1:ocLI.BeatitudesT.mode	@ltx/en_us_holycross/miscellanea:misc.Mode8
ltx/en_us_holycross/oc.m8.d1:ocLI.BeatitudesT.text	
ltx/en_us_holycross/oc.m8.d1:ocLI.BeatitudesTr.incipit	…
ltx/en_us_holycross/oc.m8.d1:ocLI.BeatitudesTr.melody	
ltx/en_us_holycross/oc.m8.d1:ocLI.BeatitudesTr.mode	@ltx/en_us_holycross/miscellanea:misc.Mode8
ltx/en_us_holycross/oc.m8.d1:ocLI.BeatitudesTr.text	
ltx/en_us_holycross/oc.m8.d1:ocMA.Antiphon11.incipit	…
ltx/en_us_holycross/oc.m8.d1:ocMA.Antiphon11.melody	
ltx/en_us_holycross/oc.m8.d1:ocMA.Antiphon11.mode	@ltx/en_us_holycross/miscellanea:misc.Mode8
ltx/en_us_holycross/oc.m8.d1:ocMA.Antiphon11.text	
ltx/en_us_holycross/oc.m8.d1:ocMA.Antiphon12.incipit	…
ltx/en_us_holycross/oc.m8.d1:ocMA.Antiphon12.melody	
ltx/en_us_holycross/oc.m8.d1:ocMA.Antiphon12.mode	@ltx/en_us_holycross/miscellanea:misc.Mode8
ltx/en_us_holycross/oc.m8.d1:ocMA.Antiphon12.text	
ltx/en_us_holycross/oc.m8.d1:ocMA.Antiphon13.incipit	…
ltx/en_us_holycross/oc.m8.d1:ocMA.Antiphon13.melody	
ltx/en_us_holycross/oc.m8.d1:ocMA.Antiphon13.mode	@ltx/en_us_holycross/miscellanea:misc.Mode8
ltx/en_us_holycross/oc.m8.d1:ocMA.Antiphon13.text	
ltx/en_us_holycross/oc.m8.d1:ocMA.Antiphon21.incipit	…
ltx/en_us_holycross/oc.m8.d1:ocMA.Antiphon21.melody	
ltx/en_us_holycross/oc.m8.d1:ocMA.Antiphon21.mode	@ltx/en_us_holycross/miscellanea:misc.Mode8
ltx/en_us_holycross/oc.m8.d1:ocMA.Antiphon21.text	
ltx/en_us_holycross/oc.m8.d1:ocMA.Antiphon22.incipit	…
ltx/en_us_holycross/oc.m8.d1:ocMA.Antiphon22.melody	
ltx/en_us_holycross/oc.m8.d1:ocMA.Antiphon22.mode	@ltx/en_us_holycross/miscellanea:misc.Mode8
ltx/en_us_holycross/oc.m8.d1:ocMA.Antiphon22.text	
ltx/en_us_holycross/oc.m8.d1:ocMA.Antiphon23.incipit	…
ltx/en_us_holycross/oc.m8.d1:ocMA.Antiphon23.melody	
ltx/en_us_holycross/oc.m8.d1:ocMA.Antiphon23.mode	@ltx/en_us_holycross/miscellanea:misc.Mode8
ltx/en_us_holycross/oc.m8.d1:ocMA.Antiphon23.text	
ltx/en_us_holycross/oc.m8.d1:ocMA.Antiphon31.incipit	…
ltx/en_us_holycross/oc.m8.d1:ocMA.Antiphon31.melody	
ltx/en_us_holycross/oc.m8.d1:ocMA.Antiphon31.mode	@ltx/en_us_holycross/miscellanea:misc.Mode8
ltx/en_us_holycross/oc.m8.d1:ocMA.Antiphon31.text	
ltx/en_us_holycross/oc.m8.d1:ocMA.Antiphon32.incipit	…
ltx/en_us_holycross/oc.m8.d1:ocMA.Antiphon32.melody	
ltx/en_us_holycross/oc.m8.d1:ocMA.Antiphon32.mode	@ltx/en_us_holycross/miscellanea:misc.Mode8
ltx/en_us_holycross/oc.m8.d1:ocMA.Antiphon32.text	
ltx/en_us_holycross/oc.m8.d1:ocMA.Antiphon33.incipit	…
ltx/en_us_holycross/oc.m8.d1:ocMA.Antiphon33.melody	
ltx/en_us_holycross/oc.m8.d1:ocMA.Antiphon33.mode	@ltx/en_us_holycross/miscellanea:misc.Mode8
ltx/en_us_holycross/oc.m8.d1:ocMA.Antiphon33.text	
ltx/en_us_holycross/oc.m8.d1:ocMA.Antiphon41.incipit	…
ltx/en_us_holycross/oc.m8.d1:ocMA.Antiphon41.melody	
ltx/en_us_holycross/oc.m8.d1:ocMA.Antiphon41.mode	@ltx/en_us_holycross/miscellanea:misc.Mode8
ltx/en_us_holycross/oc.m8.d1:ocMA.Antiphon41.text	
ltx/en_us_holycross/oc.m8.d1:ocMA.Antiphon42.incipit	…
ltx/en_us_holycross/oc.m8.d1:ocMA.Antiphon42.melody	
ltx/en_us_holycross/oc.m8.d1:ocMA.Antiphon42.mode	@ltx/en_us_holycross/miscellanea:misc.Mode8
ltx/en_us_holycross/oc.m8.d1:ocMA.Antiphon42.text	
ltx/en_us_holycross/oc.m8.d1:ocMA.Antiphon43.incipit	…
ltx/en_us_holycross/oc.m8.d1:ocMA.Antiphon43.melody	
ltx/en_us_holycross/oc.m8.d1:ocMA.Antiphon43.mode	@ltx/en_us_holycross/miscellanea:misc.Mode8
ltx/en_us_holycross/oc.m8.d1:ocMA.Antiphon43.text	
ltx/en_us_holycross/oc.m8.d1:ocMA.ApolTheotokion.incipit	…
ltx/en_us_holycross/oc.m8.d1:ocMA.ApolTheotokion.melody	
ltx/en_us_holycross/oc.m8.d1:ocMA.ApolTheotokion.mode	@ltx/en_us_holycross/miscellanea:misc.Mode8
ltx/en_us_holycross/oc.m8.d1:ocMA.ApolTheotokion.text	
ltx/en_us_holycross/oc.m8.d1:ocMA.C3.acrostic.notice1	
ltx/en_us_holycross/oc.m8.d1:ocMA.C3.acrostic.title	
ltx/en_us_holycross/oc.m8.d1:ocMA.Hypakoe.incipit	…
ltx/en_us_holycross/oc.m8.d1:ocMA.Hypakoe.melody	
ltx/en_us_holycross/oc.m8.d1:ocMA.Hypakoe.mode	@ltx/en_us_holycross/miscellanea:misc.Mode8
ltx/en_us_holycross/oc.m8.d1:ocMA.Hypakoe.text	
ltx/en_us_holycross/oc.m8.d1:ocMA.Kathisma11.greekmelody	@ltx/en_us_holycross/he.a.m8:heAU.AnestisEkNekron.greekname
ltx/en_us_holycross/oc.m8.d1:ocMA.Kathisma11.incipit	@ltx/en_us_holycross/he.a.m8:heAU.AnestisEkNekron.incipit
ltx/en_us_holycross/oc.m8.d1:ocMA.Kathisma11.melody	@ltx/en_us_holycross/he.a.m8:heAU.AnestisEkNekron.melody
ltx/en_us_holycross/oc.m8.d1:ocMA.Kathisma11.mode	@ltx/en_us_holycross/miscellanea:misc.Mode8
ltx/en_us_holycross/oc.m8.d1:ocMA.Kathisma11.text	@ltx/en_us_holycross/he.a.m8:heAU.AnestisEkNekron.text
ltx/en_us_holycross/oc.m8.d1:ocMA.Kathisma12.greekmelody	@ltx/en_us_holycross/he.a.m8:heAU.TinSofianKaiLogon.greekname
ltx/en_us_holycross/oc.m8.d1:ocMA.Kathisma12.incipit	…
ltx/en_us_holycross/oc.m8.d1:ocMA.Kathisma12.melody	@ltx/en_us_holycross/he.a.m8:heAU.TinSofianKaiLogon.notmetered
ltx/en_us_holycross/oc.m8.d1:ocMA.Kathisma12.mode	@ltx/en_us_holycross/miscellanea:misc.Mode8
ltx/en_us_holycross/oc.m8.d1:ocMA.Kathisma12.text	
ltx/en_us_holycross/oc.m8.d1:ocMA.Kathisma13.greekmelody	@ltx/en_us_holycross/he.a.m8:heAU.TinSofianKaiLogon.greekname
ltx/en_us_holycross/oc.m8.d1:ocMA.Kathisma13.incipit	…
ltx/en_us_holycross/oc.m8.d1:ocMA.Kathisma13.melody	@ltx/en_us_holycross/he.a.m8:heAU.TinSofianKaiLogon.notmetered
ltx/en_us_holycross/oc.m8.d1:ocMA.Kathisma13.mode	@ltx/en_us_holycross/miscellanea:misc.Mode8
ltx/en_us_holycross/oc.m8.d1:ocMA.Kathisma13.text	
ltx/en_us_holycross/oc.m8.d1:ocMA.Kathisma21.incipit	…
ltx/en_us_holycross/oc.m8.d1:ocMA.Kathisma21.melody	
ltx/en_us_holycross/oc.m8.d1:ocMA.Kathisma21.mode	@ltx/en_us_holycross/miscellanea:misc.Mode8
ltx/en_us_holycross/oc.m8.d1:ocMA.Kathisma21.text	
ltx/en_us_holycross/oc.m8.d1:ocMA.Kathisma22.greekmelody	@ltx/en_us_holycross/he.a.m8:heAU.AnestisEkNekron.greekname
ltx/en_us_holycross/oc.m8.d1:ocMA.Kathisma22.incipit	…
ltx/en_us_holycross/oc.m8.d1:ocMA.Kathisma22.melody	@ltx/en_us_holycross/he.a.m8:heAU.AnestisEkNekron.melody
ltx/en_us_holycross/oc.m8.d1:ocMA.Kathisma22.mode	@ltx/en_us_holycross/miscellanea:misc.Mode8
ltx/en_us_holycross/oc.m8.d1:ocMA.Kathisma22.text	
ltx/en_us_holycross/oc.m8.d1:ocMA.Kathisma23.incipit	…
ltx/en_us_holycross/oc.m8.d1:ocMA.Kathisma23.melody	
ltx/en_us_holycross/oc.m8.d1:ocMA.Kathisma23.mode	@ltx/en_us_holycross/miscellanea:misc.Mode8
ltx/en_us_holycross/oc.m8.d1:ocMA.Kathisma23.text	
ltx/en_us_holycross/oc.m8.d1:ocMA.Kontakion.incipit	…
ltx/en_us_holycross/oc.m8.d1:ocMA.Kontakion.melody	@ltx/en_us_holycross/he.a.m8:heAU.OsAparchas.name
ltx/en_us_holycross/oc.m8.d1:ocMA.Kontakion.mode	@ltx/en_us_holycross/miscellanea:misc.Mode8
ltx/en_us_holycross/oc.m8.d1:ocMA.Kontakion.text	
ltx/en_us_holycross/oc.m8.d1:ocMA.Lauds1.greekmelody	@ltx/en_us_holycross/he.a.m8:heAU.KyrieEiKaiKritirio.greekname
ltx/en_us_holycross/oc.m8.d1:ocMA.Lauds1.incipit	@ltx/en_us_holycross/he.a.m8:heAU.KyrieEiKaiKritirio.incipit
ltx/en_us_holycross/oc.m8.d1:ocMA.Lauds1.melody	@ltx/en_us_holycross/he.a.m8:heAU.KyrieEiKaiKritirio.melody
ltx/en_us_holycross/oc.m8.d1:ocMA.Lauds1.mode	@ltx/en_us_holycross/miscellanea:misc.Mode8
ltx/en_us_holycross/oc.m8.d1:ocMA.Lauds1.text	@ltx/en_us_holycross/he.a.m8:heAU.KyrieEiKaiKritirio.text
ltx/en_us_holycross/oc.m8.d1:ocMA.Lauds2.incipit	…
ltx/en_us_holycross/oc.m8.d1:ocMA.Lauds2.melody	@ltx/en_us_holycross/he.a.m8:heAU.KyrieEiKaiKritirio.notmetered
ltx/en_us_holycross/oc.m8.d1:ocMA.Lauds2.mode	@ltx/en_us_holycross/miscellanea:misc.Mode8
ltx/en_us_holycross/oc.m8.d1:ocMA.Lauds2.text	
ltx/en_us_holycross/oc.m8.d1:ocMA.Lauds3.incipit	…
ltx/en_us_holycross/oc.m8.d1:ocMA.Lauds3.melody	@ltx/en_us_holycross/he.a.m8:heAU.KyrieEiKaiKritirio.notmetered
ltx/en_us_holycross/oc.m8.d1:ocMA.Lauds3.mode	@ltx/en_us_holycross/miscellanea:misc.Mode8
ltx/en_us_holycross/oc.m8.d1:ocMA.Lauds3.text	
ltx/en_us_holycross/oc.m8.d1:ocMA.Lauds4.greekmelody	@ltx/en_us_holycross/he.a.m8:heAU.OAngelosSouKyrie.greekname
ltx/en_us_holycross/oc.m8.d1:ocMA.Lauds4.incipit	@ltx/en_us_holycross/he.a.m8:heAU.OAngelosSouKyrie.incipit
ltx/en_us_holycross/oc.m8.d1:ocMA.Lauds4.melody	@ltx/en_us_holycross/he.a.m8:heAU.OAngelosSouKyrie.melody
ltx/en_us_holycross/oc.m8.d1:ocMA.Lauds4.mode	@ltx/en_us_holycross/miscellanea:misc.Mode8
ltx/en_us_holycross/oc.m8.d1:ocMA.Lauds4.text	@ltx/en_us_holycross/he.a.m8:heAU.OAngelosSouKyrie.text
ltx/en_us_holycross/oc.m8.d1:ocMA.Lauds5.incipit	…
ltx/en_us_holycross/oc.m8.d1:ocMA.Lauds5.melody	
ltx/en_us_holycross/oc.m8.d1:ocMA.Lauds5.mode	@ltx/en_us_holycross/miscellanea:misc.Mode8
ltx/en_us_holycross/oc.m8.d1:ocMA.Lauds5.text	
ltx/en_us_holycross/oc.m8.d1:ocMA.Lauds6.incipit	…
ltx/en_us_holycross/oc.m8.d1:ocMA.Lauds6.melody	
ltx/en_us_holycross/oc.m8.d1:ocMA.Lauds6.mode	@ltx/en_us_holycross/miscellanea:misc.Mode8
ltx/en_us_holycross/oc.m8.d1:ocMA.Lauds6.text	
ltx/en_us_holycross/oc.m8.d1:ocMA.Lauds7.incipit	…
ltx/en_us_holycross/oc.m8.d1:ocMA.Lauds7.melody	
ltx/en_us_holycross/oc.m8.d1:ocMA.Lauds7.mode	@ltx/en_us_holycross/miscellanea:misc.Mode8
ltx/en_us_holycross/oc.m8.d1:ocMA.Lauds7.text	
ltx/en_us_holycross/oc.m8.d1:ocMA.Lauds8.incipit	…
ltx/en_us_holycross/oc.m8.d1:ocMA.Lauds8.melody	
ltx/en_us_holycross/oc.m8.d1:ocMA.Lauds8.mode	@ltx/en_us_holycross/miscellanea:misc.Mode8
ltx/en_us_holycross/oc.m8.d1:ocMA.Lauds8.text	
ltx/en_us_holycross/oc.m8.d1:ocMA.MM.GodIsTheLord.text	@ltx/en_us_holycross/properties:media.key
ltx/en_us_holycross/oc.m8.d1:ocMA.MM.Lauds01.text	@ltx/en_us_holycross/properties:media.key
ltx/en_us_holycross/oc.m8.d1:ocMA.MM.Lauds02.text	@ltx/en_us_holycross/properties:media.key
ltx/en_us_holycross/oc.m8.d1:ocMA.MM.LaudsStichologia.text	
ltx/en_us_holycross/oc.m8.d1:ocMA.MM.Prokeimenon.text	@ltx/en_us_holycross/properties:media.key
ltx/en_us_holycross/oc.m8.d1:ocMA.Magnificat.incipit	@ltx/en_us_holycross/he.h.m6:heHE.TinTimioteran.incipit
ltx/en_us_holycross/oc.m8.d1:ocMA.Magnificat.mode	@ltx/en_us_holycross/miscellanea:misc.Mode8
ltx/en_us_holycross/oc.m8.d1:ocMA.Magnificat.text	@ltx/en_us_holycross/he.h.m6:heHE.TinTimioteran.text
ltx/en_us_holycross/oc.m8.d1:ocMA.OdeS1C11.incipit	…
ltx/en_us_holycross/oc.m8.d1:ocMA.OdeS1C11.melody	@ltx/en_us_holycross/he.h.m8:heHE.ArmatilatinFarao.notmetered
ltx/en_us_holycross/oc.m8.d1:ocMA.OdeS1C11.mode	@ltx/en_us_holycross/miscellanea:misc.Mode8
ltx/en_us_holycross/oc.m8.d1:ocMA.OdeS1C11.ode	@ltx/en_us_holycross/miscellanea:misc.Ode1
ltx/en_us_holycross/oc.m8.d1:ocMA.OdeS1C11.text	
ltx/en_us_holycross/oc.m8.d1:ocMA.OdeS1C12.incipit	…
ltx/en_us_holycross/oc.m8.d1:ocMA.OdeS1C12.melody	@ltx/en_us_holycross/he.h.m8:heHE.ArmatilatinFarao.notmetered
ltx/en_us_holycross/oc.m8.d1:ocMA.OdeS1C12.mode	@ltx/en_us_holycross/miscellanea:misc.Mode8
ltx/en_us_holycross/oc.m8.d1:ocMA.OdeS1C12.ode	@ltx/en_us_holycross/miscellanea:misc.Ode1
ltx/en_us_holycross/oc.m8.d1:ocMA.OdeS1C12.text	
ltx/en_us_holycross/oc.m8.d1:ocMA.OdeS1C1H.greekmelody	@ltx/en_us_holycross/he.h.m8:heHE.ArmatilatinFarao.greekname
ltx/en_us_holycross/oc.m8.d1:ocMA.OdeS1C1H.incipit	@ltx/en_us_holycross/he.h.m8:heHE.ArmatilatinFarao.incipit
ltx/en_us_holycross/oc.m8.d1:ocMA.OdeS1C1H.melody	@ltx/en_us_holycross/he.h.m8:heHE.ArmatilatinFarao.melody
ltx/en_us_holycross/oc.m8.d1:ocMA.OdeS1C1H.mode	@ltx/en_us_holycross/miscellanea:misc.Mode8
ltx/en_us_holycross/oc.m8.d1:ocMA.OdeS1C1H.ode	@ltx/en_us_holycross/miscellanea:misc.Ode1
ltx/en_us_holycross/oc.m8.d1:ocMA.OdeS1C1H.text	@ltx/en_us_holycross/he.h.m8:heHE.ArmatilatinFarao.text
ltx/en_us_holycross/oc.m8.d1:ocMA.OdeS1C1T.incipit	…
ltx/en_us_holycross/oc.m8.d1:ocMA.OdeS1C1T.melody	@ltx/en_us_holycross/he.h.m8:heHE.ArmatilatinFarao.notmetered
ltx/en_us_holycross/oc.m8.d1:ocMA.OdeS1C1T.mode	@ltx/en_us_holycross/miscellanea:misc.Mode8
ltx/en_us_holycross/oc.m8.d1:ocMA.OdeS1C1T.ode	@ltx/en_us_holycross/miscellanea:misc.Ode1
ltx/en_us_holycross/oc.m8.d1:ocMA.OdeS1C1T.text	
ltx/en_us_holycross/oc.m8.d1:ocMA.OdeS1C21.greekmelody	@ltx/en_us_holycross/he.h.m8:heHE.YgranDiodefsas.greekname
ltx/en_us_holycross/oc.m8.d1:ocMA.OdeS1C21.incipit	…
ltx/en_us_holycross/oc.m8.d1:ocMA.OdeS1C21.melody	@ltx/en_us_holycross/he.h.m8:heHE.YgranDiodefsas.notmetered
ltx/en_us_holycross/oc.m8.d1:ocMA.OdeS1C21.mode	@ltx/en_us_holycross/miscellanea:misc.Mode8
ltx/en_us_holycross/oc.m8.d1:ocMA.OdeS1C21.ode	@ltx/en_us_holycross/miscellanea:misc.Ode1
ltx/en_us_holycross/oc.m8.d1:ocMA.OdeS1C21.text	
ltx/en_us_holycross/oc.m8.d1:ocMA.OdeS1C22.incipit	…
ltx/en_us_holycross/oc.m8.d1:ocMA.OdeS1C22.melody	@ltx/en_us_holycross/he.h.m8:heHE.YgranDiodefsas.notmetered
ltx/en_us_holycross/oc.m8.d1:ocMA.OdeS1C22.mode	@ltx/en_us_holycross/miscellanea:misc.Mode8
ltx/en_us_holycross/oc.m8.d1:ocMA.OdeS1C22.ode	@ltx/en_us_holycross/miscellanea:misc.Ode1
ltx/en_us_holycross/oc.m8.d1:ocMA.OdeS1C22.text	
ltx/en_us_holycross/oc.m8.d1:ocMA.OdeS1C2T.incipit	…
ltx/en_us_holycross/oc.m8.d1:ocMA.OdeS1C2T.melody	@ltx/en_us_holycross/he.h.m8:heHE.YgranDiodefsas.notmetered
ltx/en_us_holycross/oc.m8.d1:ocMA.OdeS1C2T.mode	@ltx/en_us_holycross/miscellanea:misc.Mode8
ltx/en_us_holycross/oc.m8.d1:ocMA.OdeS1C2T.ode	@ltx/en_us_holycross/miscellanea:misc.Ode1
ltx/en_us_holycross/oc.m8.d1:ocMA.OdeS1C2T.text	
ltx/en_us_holycross/oc.m8.d1:ocMA.OdeS1C31.greekmelody	@ltx/en_us_holycross/he.h.m8:heHE.AsomenToKyrio.greekname
ltx/en_us_holycross/oc.m8.d1:ocMA.OdeS1C31.incipit	…
ltx/en_us_holycross/oc.m8.d1:ocMA.OdeS1C31.melody	@ltx/en_us_holycross/he.h.m8:heHE.AsomenToKyrio.notmetered
ltx/en_us_holycross/oc.m8.d1:ocMA.OdeS1C31.mode	@ltx/en_us_holycross/miscellanea:misc.Mode8
ltx/en_us_holycross/oc.m8.d1:ocMA.OdeS1C31.ode	@ltx/en_us_holycross/miscellanea:misc.Ode1
ltx/en_us_holycross/oc.m8.d1:ocMA.OdeS1C31.text	
ltx/en_us_holycross/oc.m8.d1:ocMA.OdeS1C32.incipit	…
ltx/en_us_holycross/oc.m8.d1:ocMA.OdeS1C32.melody	@ltx/en_us_holycross/he.h.m8:heHE.AsomenToKyrio.notmetered
ltx/en_us_holycross/oc.m8.d1:ocMA.OdeS1C32.mode	@ltx/en_us_holycross/miscellanea:misc.Mode8
ltx/en_us_holycross/oc.m8.d1:ocMA.OdeS1C32.ode	@ltx/en_us_holycross/miscellanea:misc.Ode1
ltx/en_us_holycross/oc.m8.d1:ocMA.OdeS1C32.text	
ltx/en_us_holycross/oc.m8.d1:ocMA.OdeS1C33.incipit	…
ltx/en_us_holycross/oc.m8.d1:ocMA.OdeS1C33.melody	@ltx/en_us_holycross/he.h.m8:heHE.AsomenToKyrio.notmetered
ltx/en_us_holycross/oc.m8.d1:ocMA.OdeS1C33.mode	@ltx/en_us_holycross/miscellanea:misc.Mode8
ltx/en_us_holycross/oc.m8.d1:ocMA.OdeS1C33.ode	@ltx/en_us_holycross/miscellanea:misc.Ode1
ltx/en_us_holycross/oc.m8.d1:ocMA.OdeS1C33.text	
ltx/en_us_holycross/oc.m8.d1:ocMA.OdeS3C11.incipit	…
ltx/en_us_holycross/oc.m8.d1:ocMA.OdeS3C11.melody	@ltx/en_us_holycross/he.h.m8:heHE.OStereosasKatArchas.notmetered
ltx/en_us_holycross/oc.m8.d1:ocMA.OdeS3C11.mode	@ltx/en_us_holycross/miscellanea:misc.Mode8
ltx/en_us_holycross/oc.m8.d1:ocMA.OdeS3C11.ode	@ltx/en_us_holycross/miscellanea:misc.Ode3
ltx/en_us_holycross/oc.m8.d1:ocMA.OdeS3C11.text	
ltx/en_us_holycross/oc.m8.d1:ocMA.OdeS3C12.incipit	…
ltx/en_us_holycross/oc.m8.d1:ocMA.OdeS3C12.melody	@ltx/en_us_holycross/he.h.m8:heHE.OStereosasKatArchas.notmetered
ltx/en_us_holycross/oc.m8.d1:ocMA.OdeS3C12.mode	@ltx/en_us_holycross/miscellanea:misc.Mode8
ltx/en_us_holycross/oc.m8.d1:ocMA.OdeS3C12.ode	@ltx/en_us_holycross/miscellanea:misc.Ode3
ltx/en_us_holycross/oc.m8.d1:ocMA.OdeS3C12.text	
ltx/en_us_holycross/oc.m8.d1:ocMA.OdeS3C1H.greekmelody	@ltx/en_us_holycross/he.h.m8:heHE.OStereosasKatArchas.greekname
ltx/en_us_holycross/oc.m8.d1:ocMA.OdeS3C1H.incipit	@ltx/en_us_holycross/he.h.m8:heHE.OStereosasKatArchas.incipit
ltx/en_us_holycross/oc.m8.d1:ocMA.OdeS3C1H.melody	@ltx/en_us_holycross/he.h.m8:heHE.OStereosasKatArchas.melody
ltx/en_us_holycross/oc.m8.d1:ocMA.OdeS3C1H.mode	@ltx/en_us_holycross/miscellanea:misc.Mode8
ltx/en_us_holycross/oc.m8.d1:ocMA.OdeS3C1H.ode	@ltx/en_us_holycross/miscellanea:misc.Ode3
ltx/en_us_holycross/oc.m8.d1:ocMA.OdeS3C1H.text	@ltx/en_us_holycross/he.h.m8:heHE.OStereosasKatArchas.text
ltx/en_us_holycross/oc.m8.d1:ocMA.OdeS3C1T.incipit	…
ltx/en_us_holycross/oc.m8.d1:ocMA.OdeS3C1T.melody	@ltx/en_us_holycross/he.h.m8:heHE.OStereosasKatArchas.notmetered
ltx/en_us_holycross/oc.m8.d1:ocMA.OdeS3C1T.mode	@ltx/en_us_holycross/miscellanea:misc.Mode8
ltx/en_us_holycross/oc.m8.d1:ocMA.OdeS3C1T.ode	@ltx/en_us_holycross/miscellanea:misc.Ode3
ltx/en_us_holycross/oc.m8.d1:ocMA.OdeS3C1T.text	
ltx/en_us_holycross/oc.m8.d1:ocMA.OdeS3C21.greekmelody	@ltx/en_us_holycross/he.h.m8:heHE.OuraniasApsidos.greekname
ltx/en_us_holycross/oc.m8.d1:ocMA.OdeS3C21.incipit	…
ltx/en_us_holycross/oc.m8.d1:ocMA.OdeS3C21.melody	@ltx/en_us_holycross/he.h.m8:heHE.OuraniasApsidos.notmetered
ltx/en_us_holycross/oc.m8.d1:ocMA.OdeS3C21.mode	@ltx/en_us_holycross/miscellanea:misc.Mode8
ltx/en_us_holycross/oc.m8.d1:ocMA.OdeS3C21.ode	@ltx/en_us_holycross/miscellanea:misc.Ode3
ltx/en_us_holycross/oc.m8.d1:ocMA.OdeS3C21.text	
ltx/en_us_holycross/oc.m8.d1:ocMA.OdeS3C22.incipit	…
ltx/en_us_holycross/oc.m8.d1:ocMA.OdeS3C22.melody	@ltx/en_us_holycross/he.h.m8:heHE.OuraniasApsidos.notmetered
ltx/en_us_holycross/oc.m8.d1:ocMA.OdeS3C22.mode	@ltx/en_us_holycross/miscellanea:misc.Mode8
ltx/en_us_holycross/oc.m8.d1:ocMA.OdeS3C22.ode	@ltx/en_us_holycross/miscellanea:misc.Ode3
ltx/en_us_holycross/oc.m8.d1:ocMA.OdeS3C22.text	
ltx/en_us_holycross/oc.m8.d1:ocMA.OdeS3C2T.incipit	…
ltx/en_us_holycross/oc.m8.d1:ocMA.OdeS3C2T.melody	@ltx/en_us_holycross/he.h.m8:heHE.OuraniasApsidos.notmetered
ltx/en_us_holycross/oc.m8.d1:ocMA.OdeS3C2T.mode	@ltx/en_us_holycross/miscellanea:misc.Mode8
ltx/en_us_holycross/oc.m8.d1:ocMA.OdeS3C2T.ode	@ltx/en_us_holycross/miscellanea:misc.Ode3
ltx/en_us_holycross/oc.m8.d1:ocMA.OdeS3C2T.text	
ltx/en_us_holycross/oc.m8.d1:ocMA.OdeS3C31.greekmelody	@ltx/en_us_holycross/he.h.m8:heHE.SyEiToStereoma.greekname
ltx/en_us_holycross/oc.m8.d1:ocMA.OdeS3C31.incipit	…
ltx/en_us_holycross/oc.m8.d1:ocMA.OdeS3C31.melody	@ltx/en_us_holycross/he.h.m8:heHE.SyEiToStereoma.notmetered
ltx/en_us_holycross/oc.m8.d1:ocMA.OdeS3C31.mode	@ltx/en_us_holycross/miscellanea:misc.Mode8
ltx/en_us_holycross/oc.m8.d1:ocMA.OdeS3C31.ode	@ltx/en_us_holycross/miscellanea:misc.Ode3
ltx/en_us_holycross/oc.m8.d1:ocMA.OdeS3C31.text	
ltx/en_us_holycross/oc.m8.d1:ocMA.OdeS3C32.incipit	…
ltx/en_us_holycross/oc.m8.d1:ocMA.OdeS3C32.melody	@ltx/en_us_holycross/he.h.m8:heHE.SyEiToStereoma.notmetered
ltx/en_us_holycross/oc.m8.d1:ocMA.OdeS3C32.mode	@ltx/en_us_holycross/miscellanea:misc.Mode8
ltx/en_us_holycross/oc.m8.d1:ocMA.OdeS3C32.ode	@ltx/en_us_holycross/miscellanea:misc.Ode3
ltx/en_us_holycross/oc.m8.d1:ocMA.OdeS3C32.text	
ltx/en_us_holycross/oc.m8.d1:ocMA.OdeS3C33.incipit	…
ltx/en_us_holycross/oc.m8.d1:ocMA.OdeS3C33.melody	@ltx/en_us_holycross/he.h.m8:heHE.SyEiToStereoma.notmetered
ltx/en_us_holycross/oc.m8.d1:ocMA.OdeS3C33.mode	@ltx/en_us_holycross/miscellanea:misc.Mode8
ltx/en_us_holycross/oc.m8.d1:ocMA.OdeS3C33.ode	@ltx/en_us_holycross/miscellanea:misc.Ode3
ltx/en_us_holycross/oc.m8.d1:ocMA.OdeS3C33.text	
ltx/en_us_holycross/oc.m8.d1:ocMA.OdeS4C11.incipit	…
ltx/en_us_holycross/oc.m8.d1:ocMA.OdeS4C11.melody	@ltx/en_us_holycross/he.h.m8:heHE.SyMouIschys.notmetered
ltx/en_us_holycross/oc.m8.d1:ocMA.OdeS4C11.mode	@ltx/en_us_holycross/miscellanea:misc.Mode8
ltx/en_us_holycross/oc.m8.d1:ocMA.OdeS4C11.ode	@ltx/en_us_holycross/miscellanea:misc.Ode4
ltx/en_us_holycross/oc.m8.d1:ocMA.OdeS4C11.text	
ltx/en_us_holycross/oc.m8.d1:ocMA.OdeS4C12.incipit	…
ltx/en_us_holycross/oc.m8.d1:ocMA.OdeS4C12.melody	@ltx/en_us_holycross/he.h.m8:heHE.SyMouIschys.notmetered
ltx/en_us_holycross/oc.m8.d1:ocMA.OdeS4C12.mode	@ltx/en_us_holycross/miscellanea:misc.Mode8
ltx/en_us_holycross/oc.m8.d1:ocMA.OdeS4C12.ode	@ltx/en_us_holycross/miscellanea:misc.Ode4
ltx/en_us_holycross/oc.m8.d1:ocMA.OdeS4C12.text	
ltx/en_us_holycross/oc.m8.d1:ocMA.OdeS4C1H.greekmelody	@ltx/en_us_holycross/he.h.m8:heHE.SyMouIschys.greekname
ltx/en_us_holycross/oc.m8.d1:ocMA.OdeS4C1H.incipit	@ltx/en_us_holycross/he.h.m8:heHE.SyMouIschys.incipit
ltx/en_us_holycross/oc.m8.d1:ocMA.OdeS4C1H.melody	@ltx/en_us_holycross/he.h.m8:heHE.SyMouIschys.melody
ltx/en_us_holycross/oc.m8.d1:ocMA.OdeS4C1H.mode	@ltx/en_us_holycross/miscellanea:misc.Mode8
ltx/en_us_holycross/oc.m8.d1:ocMA.OdeS4C1H.ode	@ltx/en_us_holycross/miscellanea:misc.Ode4
ltx/en_us_holycross/oc.m8.d1:ocMA.OdeS4C1H.text	@ltx/en_us_holycross/he.h.m8:heHE.SyMouIschys.text
ltx/en_us_holycross/oc.m8.d1:ocMA.OdeS4C1T.incipit	…
ltx/en_us_holycross/oc.m8.d1:ocMA.OdeS4C1T.melody	@ltx/en_us_holycross/he.h.m8:heHE.SyMouIschys.notmetered
ltx/en_us_holycross/oc.m8.d1:ocMA.OdeS4C1T.mode	@ltx/en_us_holycross/miscellanea:misc.Mode8
ltx/en_us_holycross/oc.m8.d1:ocMA.OdeS4C1T.ode	@ltx/en_us_holycross/miscellanea:misc.Ode4
ltx/en_us_holycross/oc.m8.d1:ocMA.OdeS4C1T.text	
ltx/en_us_holycross/oc.m8.d1:ocMA.OdeS4C21.greekmelody	@ltx/en_us_holycross/he.h.m8:heHE.EisakikoaKyrie.greekname
ltx/en_us_holycross/oc.m8.d1:ocMA.OdeS4C21.incipit	…
ltx/en_us_holycross/oc.m8.d1:ocMA.OdeS4C21.melody	@ltx/en_us_holycross/he.h.m8:heHE.EisakikoaKyrie.notmetered
ltx/en_us_holycross/oc.m8.d1:ocMA.OdeS4C21.mode	@ltx/en_us_holycross/miscellanea:misc.Mode8
ltx/en_us_holycross/oc.m8.d1:ocMA.OdeS4C21.ode	@ltx/en_us_holycross/miscellanea:misc.Ode4
ltx/en_us_holycross/oc.m8.d1:ocMA.OdeS4C21.text	
ltx/en_us_holycross/oc.m8.d1:ocMA.OdeS4C22.incipit	…
ltx/en_us_holycross/oc.m8.d1:ocMA.OdeS4C22.melody	@ltx/en_us_holycross/he.h.m8:heHE.EisakikoaKyrie.notmetered
ltx/en_us_holycross/oc.m8.d1:ocMA.OdeS4C22.mode	@ltx/en_us_holycross/miscellanea:misc.Mode8
ltx/en_us_holycross/oc.m8.d1:ocMA.OdeS4C22.ode	@ltx/en_us_holycross/miscellanea:misc.Ode4
ltx/en_us_holycross/oc.m8.d1:ocMA.OdeS4C22.text	
ltx/en_us_holycross/oc.m8.d1:ocMA.OdeS4C2T.incipit	…
ltx/en_us_holycross/oc.m8.d1:ocMA.OdeS4C2T.melody	@ltx/en_us_holycross/he.h.m8:heHE.EisakikoaKyrie.notmetered
ltx/en_us_holycross/oc.m8.d1:ocMA.OdeS4C2T.mode	@ltx/en_us_holycross/miscellanea:misc.Mode8
ltx/en_us_holycross/oc.m8.d1:ocMA.OdeS4C2T.ode	@ltx/en_us_holycross/miscellanea:misc.Ode4
ltx/en_us_holycross/oc.m8.d1:ocMA.OdeS4C2T.text	
ltx/en_us_holycross/oc.m8.d1:ocMA.OdeS4C31.greekmelody	@ltx/en_us_holycross/he.h.m8:heHE.EisakikoaKyrie.greekname
ltx/en_us_holycross/oc.m8.d1:ocMA.OdeS4C31.incipit	…
ltx/en_us_holycross/oc.m8.d1:ocMA.OdeS4C31.melody	@ltx/en_us_holycross/he.h.m8:heHE.EisakikoaKyrie.notmetered
ltx/en_us_holycross/oc.m8.d1:ocMA.OdeS4C31.mode	@ltx/en_us_holycross/miscellanea:misc.Mode8
ltx/en_us_holycross/oc.m8.d1:ocMA.OdeS4C31.ode	@ltx/en_us_holycross/miscellanea:misc.Ode4
ltx/en_us_holycross/oc.m8.d1:ocMA.OdeS4C31.text	
ltx/en_us_holycross/oc.m8.d1:ocMA.OdeS4C32.incipit	…
ltx/en_us_holycross/oc.m8.d1:ocMA.OdeS4C32.melody	@ltx/en_us_holycross/he.h.m8:heHE.EisakikoaKyrie.notmetered
ltx/en_us_holycross/oc.m8.d1:ocMA.OdeS4C32.mode	@ltx/en_us_holycross/miscellanea:misc.Mode8
ltx/en_us_holycross/oc.m8.d1:ocMA.OdeS4C32.ode	@ltx/en_us_holycross/miscellanea:misc.Ode4
ltx/en_us_holycross/oc.m8.d1:ocMA.OdeS4C32.text	
ltx/en_us_holycross/oc.m8.d1:ocMA.OdeS4C33.incipit	…
ltx/en_us_holycross/oc.m8.d1:ocMA.OdeS4C33.melody	@ltx/en_us_holycross/he.h.m8:heHE.EisakikoaKyrie.notmetered
ltx/en_us_holycross/oc.m8.d1:ocMA.OdeS4C33.mode	@ltx/en_us_holycross/miscellanea:misc.Mode8
ltx/en_us_holycross/oc.m8.d1:ocMA.OdeS4C33.ode	@ltx/en_us_holycross/miscellanea:misc.Ode4
ltx/en_us_holycross/oc.m8.d1:ocMA.OdeS4C33.text	
ltx/en_us_holycross/oc.m8.d1:ocMA.OdeS5C11.incipit	…
ltx/en_us_holycross/oc.m8.d1:ocMA.OdeS5C11.melody	@ltx/en_us_holycross/he.h.m8:heHE.InaTiMeAposo.notmetered
ltx/en_us_holycross/oc.m8.d1:ocMA.OdeS5C11.mode	@ltx/en_us_holycross/miscellanea:misc.Mode8
ltx/en_us_holycross/oc.m8.d1:ocMA.OdeS5C11.ode	@ltx/en_us_holycross/miscellanea:misc.Ode5
ltx/en_us_holycross/oc.m8.d1:ocMA.OdeS5C11.text	
ltx/en_us_holycross/oc.m8.d1:ocMA.OdeS5C12.incipit	…
ltx/en_us_holycross/oc.m8.d1:ocMA.OdeS5C12.melody	@ltx/en_us_holycross/he.h.m8:heHE.InaTiMeAposo.notmetered
ltx/en_us_holycross/oc.m8.d1:ocMA.OdeS5C12.mode	@ltx/en_us_holycross/miscellanea:misc.Mode8
ltx/en_us_holycross/oc.m8.d1:ocMA.OdeS5C12.ode	@ltx/en_us_holycross/miscellanea:misc.Ode5
ltx/en_us_holycross/oc.m8.d1:ocMA.OdeS5C12.text	
ltx/en_us_holycross/oc.m8.d1:ocMA.OdeS5C1H.greekmelody	@ltx/en_us_holycross/he.h.m8:heHE.InaTiMeAposo.greekname
ltx/en_us_holycross/oc.m8.d1:ocMA.OdeS5C1H.incipit	@ltx/en_us_holycross/he.h.m8:heHE.InaTiMeAposo.incipit
ltx/en_us_holycross/oc.m8.d1:ocMA.OdeS5C1H.melody	@ltx/en_us_holycross/he.h.m8:heHE.InaTiMeAposo.melody
ltx/en_us_holycross/oc.m8.d1:ocMA.OdeS5C1H.mode	@ltx/en_us_holycross/miscellanea:misc.Mode8
ltx/en_us_holycross/oc.m8.d1:ocMA.OdeS5C1H.ode	@ltx/en_us_holycross/miscellanea:misc.Ode5
ltx/en_us_holycross/oc.m8.d1:ocMA.OdeS5C1H.text	@ltx/en_us_holycross/he.h.m8:heHE.InaTiMeAposo.text
ltx/en_us_holycross/oc.m8.d1:ocMA.OdeS5C1T.incipit	…
ltx/en_us_holycross/oc.m8.d1:ocMA.OdeS5C1T.melody	@ltx/en_us_holycross/he.h.m8:heHE.InaTiMeAposo.notmetered
ltx/en_us_holycross/oc.m8.d1:ocMA.OdeS5C1T.mode	@ltx/en_us_holycross/miscellanea:misc.Mode8
ltx/en_us_holycross/oc.m8.d1:ocMA.OdeS5C1T.ode	@ltx/en_us_holycross/miscellanea:misc.Ode5
ltx/en_us_holycross/oc.m8.d1:ocMA.OdeS5C1T.text	
ltx/en_us_holycross/oc.m8.d1:ocMA.OdeS5C21.greekmelody	@ltx/en_us_holycross/he.h.m8:heHE.FotisonImas.greekname
ltx/en_us_holycross/oc.m8.d1:ocMA.OdeS5C21.incipit	…
ltx/en_us_holycross/oc.m8.d1:ocMA.OdeS5C21.melody	@ltx/en_us_holycross/he.h.m8:heHE.FotisonImas.notmetered
ltx/en_us_holycross/oc.m8.d1:ocMA.OdeS5C21.mode	@ltx/en_us_holycross/miscellanea:misc.Mode8
ltx/en_us_holycross/oc.m8.d1:ocMA.OdeS5C21.ode	@ltx/en_us_holycross/miscellanea:misc.Ode5
ltx/en_us_holycross/oc.m8.d1:ocMA.OdeS5C21.text	
ltx/en_us_holycross/oc.m8.d1:ocMA.OdeS5C22.incipit	…
ltx/en_us_holycross/oc.m8.d1:ocMA.OdeS5C22.melody	@ltx/en_us_holycross/he.h.m8:heHE.FotisonImas.notmetered
ltx/en_us_holycross/oc.m8.d1:ocMA.OdeS5C22.mode	@ltx/en_us_holycross/miscellanea:misc.Mode8
ltx/en_us_holycross/oc.m8.d1:ocMA.OdeS5C22.ode	@ltx/en_us_holycross/miscellanea:misc.Ode5
ltx/en_us_holycross/oc.m8.d1:ocMA.OdeS5C22.text	
ltx/en_us_holycross/oc.m8.d1:ocMA.OdeS5C2T.incipit	…
ltx/en_us_holycross/oc.m8.d1:ocMA.OdeS5C2T.melody	@ltx/en_us_holycross/he.h.m8:heHE.FotisonImas.notmetered
ltx/en_us_holycross/oc.m8.d1:ocMA.OdeS5C2T.mode	@ltx/en_us_holycross/miscellanea:misc.Mode8
ltx/en_us_holycross/oc.m8.d1:ocMA.OdeS5C2T.ode	@ltx/en_us_holycross/miscellanea:misc.Ode5
ltx/en_us_holycross/oc.m8.d1:ocMA.OdeS5C2T.text	
ltx/en_us_holycross/oc.m8.d1:ocMA.OdeS5C31.greekmelody	@ltx/en_us_holycross/he.h.m8:heHE.OrthrizontesVoomenSoi.greekname
ltx/en_us_holycross/oc.m8.d1:ocMA.OdeS5C31.incipit	…
ltx/en_us_holycross/oc.m8.d1:ocMA.OdeS5C31.melody	@ltx/en_us_holycross/he.h.m8:heHE.OrthrizontesVoomenSoi.notmetered
ltx/en_us_holycross/oc.m8.d1:ocMA.OdeS5C31.mode	@ltx/en_us_holycross/miscellanea:misc.Mode8
ltx/en_us_holycross/oc.m8.d1:ocMA.OdeS5C31.ode	@ltx/en_us_holycross/miscellanea:misc.Ode5
ltx/en_us_holycross/oc.m8.d1:ocMA.OdeS5C31.text	
ltx/en_us_holycross/oc.m8.d1:ocMA.OdeS5C32.incipit	…
ltx/en_us_holycross/oc.m8.d1:ocMA.OdeS5C32.melody	@ltx/en_us_holycross/he.h.m8:heHE.OrthrizontesVoomenSoi.notmetered
ltx/en_us_holycross/oc.m8.d1:ocMA.OdeS5C32.mode	@ltx/en_us_holycross/miscellanea:misc.Mode8
ltx/en_us_holycross/oc.m8.d1:ocMA.OdeS5C32.ode	@ltx/en_us_holycross/miscellanea:misc.Ode5
ltx/en_us_holycross/oc.m8.d1:ocMA.OdeS5C32.text	
ltx/en_us_holycross/oc.m8.d1:ocMA.OdeS5C33.incipit	…
ltx/en_us_holycross/oc.m8.d1:ocMA.OdeS5C33.melody	@ltx/en_us_holycross/he.h.m8:heHE.OrthrizontesVoomenSoi.notmetered
ltx/en_us_holycross/oc.m8.d1:ocMA.OdeS5C33.mode	@ltx/en_us_holycross/miscellanea:misc.Mode8
ltx/en_us_holycross/oc.m8.d1:ocMA.OdeS5C33.ode	@ltx/en_us_holycross/miscellanea:misc.Ode5
ltx/en_us_holycross/oc.m8.d1:ocMA.OdeS5C33.text	
ltx/en_us_holycross/oc.m8.d1:ocMA.OdeS6C11.incipit	…
ltx/en_us_holycross/oc.m8.d1:ocMA.OdeS6C11.melody	@ltx/en_us_holycross/he.h.m8:heHE.IlasthitiMoiSotir.notmetered
ltx/en_us_holycross/oc.m8.d1:ocMA.OdeS6C11.mode	@ltx/en_us_holycross/miscellanea:misc.Mode8
ltx/en_us_holycross/oc.m8.d1:ocMA.OdeS6C11.ode	@ltx/en_us_holycross/miscellanea:misc.Ode6
ltx/en_us_holycross/oc.m8.d1:ocMA.OdeS6C11.text	
ltx/en_us_holycross/oc.m8.d1:ocMA.OdeS6C12.incipit	…
ltx/en_us_holycross/oc.m8.d1:ocMA.OdeS6C12.melody	@ltx/en_us_holycross/he.h.m8:heHE.IlasthitiMoiSotir.notmetered
ltx/en_us_holycross/oc.m8.d1:ocMA.OdeS6C12.mode	@ltx/en_us_holycross/miscellanea:misc.Mode8
ltx/en_us_holycross/oc.m8.d1:ocMA.OdeS6C12.ode	@ltx/en_us_holycross/miscellanea:misc.Ode6
ltx/en_us_holycross/oc.m8.d1:ocMA.OdeS6C12.text	
ltx/en_us_holycross/oc.m8.d1:ocMA.OdeS6C1H.greekmelody	@ltx/en_us_holycross/he.h.m8:heHE.IlasthitiMoiSotir.greekname
ltx/en_us_holycross/oc.m8.d1:ocMA.OdeS6C1H.incipit	@ltx/en_us_holycross/he.h.m8:heHE.IlasthitiMoiSotir.incipit
ltx/en_us_holycross/oc.m8.d1:ocMA.OdeS6C1H.melody	@ltx/en_us_holycross/he.h.m8:heHE.IlasthitiMoiSotir.melody
ltx/en_us_holycross/oc.m8.d1:ocMA.OdeS6C1H.mode	@ltx/en_us_holycross/miscellanea:misc.Mode8
ltx/en_us_holycross/oc.m8.d1:ocMA.OdeS6C1H.ode	@ltx/en_us_holycross/miscellanea:misc.Ode6
ltx/en_us_holycross/oc.m8.d1:ocMA.OdeS6C1H.text	@ltx/en_us_holycross/he.h.m8:heHE.IlasthitiMoiSotir.text
ltx/en_us_holycross/oc.m8.d1:ocMA.OdeS6C1T.incipit	…
ltx/en_us_holycross/oc.m8.d1:ocMA.OdeS6C1T.melody	@ltx/en_us_holycross/he.h.m8:heHE.IlasthitiMoiSotir.notmetered
ltx/en_us_holycross/oc.m8.d1:ocMA.OdeS6C1T.mode	@ltx/en_us_holycross/miscellanea:misc.Mode8
ltx/en_us_holycross/oc.m8.d1:ocMA.OdeS6C1T.ode	@ltx/en_us_holycross/miscellanea:misc.Ode6
ltx/en_us_holycross/oc.m8.d1:ocMA.OdeS6C1T.text	
ltx/en_us_holycross/oc.m8.d1:ocMA.OdeS6C21.greekmelody	@ltx/en_us_holycross/he.h.m8:heHE.TinDeisinEkcheo.greekname
ltx/en_us_holycross/oc.m8.d1:ocMA.OdeS6C21.incipit	…
ltx/en_us_holycross/oc.m8.d1:ocMA.OdeS6C21.melody	@ltx/en_us_holycross/he.h.m8:heHE.TinDeisinEkcheo.notmetered
ltx/en_us_holycross/oc.m8.d1:ocMA.OdeS6C21.mode	@ltx/en_us_holycross/miscellanea:misc.Mode8
ltx/en_us_holycross/oc.m8.d1:ocMA.OdeS6C21.ode	@ltx/en_us_holycross/miscellanea:misc.Ode6
ltx/en_us_holycross/oc.m8.d1:ocMA.OdeS6C21.text	
ltx/en_us_holycross/oc.m8.d1:ocMA.OdeS6C22.incipit	…
ltx/en_us_holycross/oc.m8.d1:ocMA.OdeS6C22.melody	@ltx/en_us_holycross/he.h.m8:heHE.TinDeisinEkcheo.notmetered
ltx/en_us_holycross/oc.m8.d1:ocMA.OdeS6C22.mode	@ltx/en_us_holycross/miscellanea:misc.Mode8
ltx/en_us_holycross/oc.m8.d1:ocMA.OdeS6C22.ode	@ltx/en_us_holycross/miscellanea:misc.Ode6
ltx/en_us_holycross/oc.m8.d1:ocMA.OdeS6C22.text	
ltx/en_us_holycross/oc.m8.d1:ocMA.OdeS6C2T.incipit	…
ltx/en_us_holycross/oc.m8.d1:ocMA.OdeS6C2T.melody	@ltx/en_us_holycross/he.h.m8:heHE.TinDeisinEkcheo.notmetered
ltx/en_us_holycross/oc.m8.d1:ocMA.OdeS6C2T.mode	@ltx/en_us_holycross/miscellanea:misc.Mode8
ltx/en_us_holycross/oc.m8.d1:ocMA.OdeS6C2T.ode	@ltx/en_us_holycross/miscellanea:misc.Ode6
ltx/en_us_holycross/oc.m8.d1:ocMA.OdeS6C2T.text	
ltx/en_us_holycross/oc.m8.d1:ocMA.OdeS6C31.greekmelody	@ltx/en_us_holycross/he.h.m8:heHE.ChitonaMoiParaschou.greekname
ltx/en_us_holycross/oc.m8.d1:ocMA.OdeS6C31.incipit	…
ltx/en_us_holycross/oc.m8.d1:ocMA.OdeS6C31.melody	@ltx/en_us_holycross/he.h.m8:heHE.ChitonaMoiParaschou.notmetered
ltx/en_us_holycross/oc.m8.d1:ocMA.OdeS6C31.mode	@ltx/en_us_holycross/miscellanea:misc.Mode8
ltx/en_us_holycross/oc.m8.d1:ocMA.OdeS6C31.ode	@ltx/en_us_holycross/miscellanea:misc.Ode6
ltx/en_us_holycross/oc.m8.d1:ocMA.OdeS6C31.text	
ltx/en_us_holycross/oc.m8.d1:ocMA.OdeS6C32.incipit	…
ltx/en_us_holycross/oc.m8.d1:ocMA.OdeS6C32.melody	@ltx/en_us_holycross/he.h.m8:heHE.ChitonaMoiParaschou.notmetered
ltx/en_us_holycross/oc.m8.d1:ocMA.OdeS6C32.mode	@ltx/en_us_holycross/miscellanea:misc.Mode8
ltx/en_us_holycross/oc.m8.d1:ocMA.OdeS6C32.ode	@ltx/en_us_holycross/miscellanea:misc.Ode6
ltx/en_us_holycross/oc.m8.d1:ocMA.OdeS6C32.text	
ltx/en_us_holycross/oc.m8.d1:ocMA.OdeS6C33.incipit	…
ltx/en_us_holycross/oc.m8.d1:ocMA.OdeS6C33.melody	@ltx/en_us_holycross/he.h.m8:heHE.ChitonaMoiParaschou.notmetered
ltx/en_us_holycross/oc.m8.d1:ocMA.OdeS6C33.mode	@ltx/en_us_holycross/miscellanea:misc.Mode8
ltx/en_us_holycross/oc.m8.d1:ocMA.OdeS6C33.ode	@ltx/en_us_holycross/miscellanea:misc.Ode6
ltx/en_us_holycross/oc.m8.d1:ocMA.OdeS6C33.text	
ltx/en_us_holycross/oc.m8.d1:ocMA.OdeS7C11.incipit	…
ltx/en_us_holycross/oc.m8.d1:ocMA.OdeS7C11.melody	@ltx/en_us_holycross/he.h.m8:heHE.TheouSynkatavasin.notmetered
ltx/en_us_holycross/oc.m8.d1:ocMA.OdeS7C11.mode	@ltx/en_us_holycross/miscellanea:misc.Mode8
ltx/en_us_holycross/oc.m8.d1:ocMA.OdeS7C11.ode	@ltx/en_us_holycross/miscellanea:misc.Ode7
ltx/en_us_holycross/oc.m8.d1:ocMA.OdeS7C11.text	
ltx/en_us_holycross/oc.m8.d1:ocMA.OdeS7C12.incipit	…
ltx/en_us_holycross/oc.m8.d1:ocMA.OdeS7C12.melody	@ltx/en_us_holycross/he.h.m8:heHE.TheouSynkatavasin.notmetered
ltx/en_us_holycross/oc.m8.d1:ocMA.OdeS7C12.mode	@ltx/en_us_holycross/miscellanea:misc.Mode8
ltx/en_us_holycross/oc.m8.d1:ocMA.OdeS7C12.ode	@ltx/en_us_holycross/miscellanea:misc.Ode7
ltx/en_us_holycross/oc.m8.d1:ocMA.OdeS7C12.text	
ltx/en_us_holycross/oc.m8.d1:ocMA.OdeS7C1H.greekmelody	@ltx/en_us_holycross/he.h.m8:heHE.TheouSynkatavasin.greekname
ltx/en_us_holycross/oc.m8.d1:ocMA.OdeS7C1H.incipit	@ltx/en_us_holycross/he.h.m8:heHE.TheouSynkatavasin.incipit
ltx/en_us_holycross/oc.m8.d1:ocMA.OdeS7C1H.melody	@ltx/en_us_holycross/he.h.m8:heHE.TheouSynkatavasin.melody
ltx/en_us_holycross/oc.m8.d1:ocMA.OdeS7C1H.mode	@ltx/en_us_holycross/miscellanea:misc.Mode8
ltx/en_us_holycross/oc.m8.d1:ocMA.OdeS7C1H.ode	@ltx/en_us_holycross/miscellanea:misc.Ode7
ltx/en_us_holycross/oc.m8.d1:ocMA.OdeS7C1H.text	@ltx/en_us_holycross/he.h.m8:heHE.TheouSynkatavasin.text
ltx/en_us_holycross/oc.m8.d1:ocMA.OdeS7C1Tr.incipit	…
ltx/en_us_holycross/oc.m8.d1:ocMA.OdeS7C1Tr.melody	@ltx/en_us_holycross/he.h.m8:heHE.TheouSynkatavasin.notmetered
ltx/en_us_holycross/oc.m8.d1:ocMA.OdeS7C1Tr.mode	@ltx/en_us_holycross/miscellanea:misc.Mode8
ltx/en_us_holycross/oc.m8.d1:ocMA.OdeS7C1Tr.ode	@ltx/en_us_holycross/miscellanea:misc.Ode7
ltx/en_us_holycross/oc.m8.d1:ocMA.OdeS7C1Tr.text	
ltx/en_us_holycross/oc.m8.d1:ocMA.OdeS7C21.greekmelody	@ltx/en_us_holycross/he.h.m8:heHE.OiEkTisIoudaias.greekname
ltx/en_us_holycross/oc.m8.d1:ocMA.OdeS7C21.incipit	…
ltx/en_us_holycross/oc.m8.d1:ocMA.OdeS7C21.melody	@ltx/en_us_holycross/he.h.m8:heHE.OiEkTisIoudaias.notmetered
ltx/en_us_holycross/oc.m8.d1:ocMA.OdeS7C21.mode	@ltx/en_us_holycross/miscellanea:misc.Mode8
ltx/en_us_holycross/oc.m8.d1:ocMA.OdeS7C21.ode	@ltx/en_us_holycross/miscellanea:misc.Ode7
ltx/en_us_holycross/oc.m8.d1:ocMA.OdeS7C21.text	
ltx/en_us_holycross/oc.m8.d1:ocMA.OdeS7C22.incipit	…
ltx/en_us_holycross/oc.m8.d1:ocMA.OdeS7C22.melody	@ltx/en_us_holycross/he.h.m8:heHE.OiEkTisIoudaias.notmetered
ltx/en_us_holycross/oc.m8.d1:ocMA.OdeS7C22.mode	@ltx/en_us_holycross/miscellanea:misc.Mode8
ltx/en_us_holycross/oc.m8.d1:ocMA.OdeS7C22.ode	@ltx/en_us_holycross/miscellanea:misc.Ode7
ltx/en_us_holycross/oc.m8.d1:ocMA.OdeS7C22.text	
ltx/en_us_holycross/oc.m8.d1:ocMA.OdeS7C2T.incipit	…
ltx/en_us_holycross/oc.m8.d1:ocMA.OdeS7C2T.melody	@ltx/en_us_holycross/he.h.m8:heHE.OiEkTisIoudaias.notmetered
ltx/en_us_holycross/oc.m8.d1:ocMA.OdeS7C2T.mode	@ltx/en_us_holycross/miscellanea:misc.Mode8
ltx/en_us_holycross/oc.m8.d1:ocMA.OdeS7C2T.ode	@ltx/en_us_holycross/miscellanea:misc.Ode7
ltx/en_us_holycross/oc.m8.d1:ocMA.OdeS7C2T.text	
ltx/en_us_holycross/oc.m8.d1:ocMA.OdeS7C31.greekmelody	@ltx/en_us_holycross/he.h.m8:heHE.OiEkTisIoudaias.greekname
ltx/en_us_holycross/oc.m8.d1:ocMA.OdeS7C31.incipit	…
ltx/en_us_holycross/oc.m8.d1:ocMA.OdeS7C31.melody	@ltx/en_us_holycross/he.h.m8:heHE.OiEkTisIoudaias.notmetered
ltx/en_us_holycross/oc.m8.d1:ocMA.OdeS7C31.mode	@ltx/en_us_holycross/miscellanea:misc.Mode8
ltx/en_us_holycross/oc.m8.d1:ocMA.OdeS7C31.ode	@ltx/en_us_holycross/miscellanea:misc.Ode7
ltx/en_us_holycross/oc.m8.d1:ocMA.OdeS7C31.text	
ltx/en_us_holycross/oc.m8.d1:ocMA.OdeS7C32.incipit	…
ltx/en_us_holycross/oc.m8.d1:ocMA.OdeS7C32.melody	@ltx/en_us_holycross/he.h.m8:heHE.OiEkTisIoudaias.notmetered
ltx/en_us_holycross/oc.m8.d1:ocMA.OdeS7C32.mode	@ltx/en_us_holycross/miscellanea:misc.Mode8
ltx/en_us_holycross/oc.m8.d1:ocMA.OdeS7C32.ode	@ltx/en_us_holycross/miscellanea:misc.Ode7
ltx/en_us_holycross/oc.m8.d1:ocMA.OdeS7C32.text	
ltx/en_us_holycross/oc.m8.d1:ocMA.OdeS7C33.incipit	…
ltx/en_us_holycross/oc.m8.d1:ocMA.OdeS7C33.melody	@ltx/en_us_holycross/he.h.m8:heHE.OiEkTisIoudaias.notmetered
ltx/en_us_holycross/oc.m8.d1:ocMA.OdeS7C33.mode	@ltx/en_us_holycross/miscellanea:misc.Mode8
ltx/en_us_holycross/oc.m8.d1:ocMA.OdeS7C33.ode	@ltx/en_us_holycross/miscellanea:misc.Ode7
ltx/en_us_holycross/oc.m8.d1:ocMA.OdeS7C33.text	
ltx/en_us_holycross/oc.m8.d1:ocMA.OdeS8C11.incipit	…
ltx/en_us_holycross/oc.m8.d1:ocMA.OdeS8C11.melody	@ltx/en_us_holycross/he.h.m8:heHE.EptaplasiosKaminon.notmetered
ltx/en_us_holycross/oc.m8.d1:ocMA.OdeS8C11.mode	@ltx/en_us_holycross/miscellanea:misc.Mode8
ltx/en_us_holycross/oc.m8.d1:ocMA.OdeS8C11.ode	@ltx/en_us_holycross/miscellanea:misc.Ode8
ltx/en_us_holycross/oc.m8.d1:ocMA.OdeS8C11.text	
ltx/en_us_holycross/oc.m8.d1:ocMA.OdeS8C12.incipit	…
ltx/en_us_holycross/oc.m8.d1:ocMA.OdeS8C12.melody	@ltx/en_us_holycross/he.h.m8:heHE.EptaplasiosKaminon.notmetered
ltx/en_us_holycross/oc.m8.d1:ocMA.OdeS8C12.mode	@ltx/en_us_holycross/miscellanea:misc.Mode8
ltx/en_us_holycross/oc.m8.d1:ocMA.OdeS8C12.ode	@ltx/en_us_holycross/miscellanea:misc.Ode8
ltx/en_us_holycross/oc.m8.d1:ocMA.OdeS8C12.text	
ltx/en_us_holycross/oc.m8.d1:ocMA.OdeS8C1H.greekmelody	@ltx/en_us_holycross/he.h.m8:heHE.EptaplasiosKaminon.greekname
ltx/en_us_holycross/oc.m8.d1:ocMA.OdeS8C1H.incipit	@ltx/en_us_holycross/he.h.m8:heHE.EptaplasiosKaminon.incipit
ltx/en_us_holycross/oc.m8.d1:ocMA.OdeS8C1H.melody	@ltx/en_us_holycross/he.h.m8:heHE.EptaplasiosKaminon.melody
ltx/en_us_holycross/oc.m8.d1:ocMA.OdeS8C1H.mode	@ltx/en_us_holycross/miscellanea:misc.Mode8
ltx/en_us_holycross/oc.m8.d1:ocMA.OdeS8C1H.ode	@ltx/en_us_holycross/miscellanea:misc.Ode8
ltx/en_us_holycross/oc.m8.d1:ocMA.OdeS8C1H.text	@ltx/en_us_holycross/he.h.m8:heHE.EptaplasiosKaminon.text
ltx/en_us_holycross/oc.m8.d1:ocMA.OdeS8C1Tr.incipit	…
ltx/en_us_holycross/oc.m8.d1:ocMA.OdeS8C1Tr.melody	@ltx/en_us_holycross/he.h.m8:heHE.EptaplasiosKaminon.notmetered
ltx/en_us_holycross/oc.m8.d1:ocMA.OdeS8C1Tr.mode	@ltx/en_us_holycross/miscellanea:misc.Mode8
ltx/en_us_holycross/oc.m8.d1:ocMA.OdeS8C1Tr.ode	@ltx/en_us_holycross/miscellanea:misc.Ode8
ltx/en_us_holycross/oc.m8.d1:ocMA.OdeS8C1Tr.text	
ltx/en_us_holycross/oc.m8.d1:ocMA.OdeS8C21.greekmelody	@ltx/en_us_holycross/he.h.m8:heHE.NikitaiTyrannou.greekname
ltx/en_us_holycross/oc.m8.d1:ocMA.OdeS8C21.incipit	…
ltx/en_us_holycross/oc.m8.d1:ocMA.OdeS8C21.melody	@ltx/en_us_holycross/he.h.m8:heHE.NikitaiTyrannou.notmetered
ltx/en_us_holycross/oc.m8.d1:ocMA.OdeS8C21.mode	@ltx/en_us_holycross/miscellanea:misc.Mode8
ltx/en_us_holycross/oc.m8.d1:ocMA.OdeS8C21.ode	@ltx/en_us_holycross/miscellanea:misc.Ode8
ltx/en_us_holycross/oc.m8.d1:ocMA.OdeS8C21.text	
ltx/en_us_holycross/oc.m8.d1:ocMA.OdeS8C22.incipit	…
ltx/en_us_holycross/oc.m8.d1:ocMA.OdeS8C22.melody	@ltx/en_us_holycross/he.h.m8:heHE.NikitaiTyrannou.notmetered
ltx/en_us_holycross/oc.m8.d1:ocMA.OdeS8C22.mode	@ltx/en_us_holycross/miscellanea:misc.Mode8
ltx/en_us_holycross/oc.m8.d1:ocMA.OdeS8C22.ode	@ltx/en_us_holycross/miscellanea:misc.Ode8
ltx/en_us_holycross/oc.m8.d1:ocMA.OdeS8C22.text	
ltx/en_us_holycross/oc.m8.d1:ocMA.OdeS8C2T.incipit	…
ltx/en_us_holycross/oc.m8.d1:ocMA.OdeS8C2T.melody	@ltx/en_us_holycross/he.h.m8:heHE.NikitaiTyrannou.notmetered
ltx/en_us_holycross/oc.m8.d1:ocMA.OdeS8C2T.mode	@ltx/en_us_holycross/miscellanea:misc.Mode8
ltx/en_us_holycross/oc.m8.d1:ocMA.OdeS8C2T.ode	@ltx/en_us_holycross/miscellanea:misc.Ode8
ltx/en_us_holycross/oc.m8.d1:ocMA.OdeS8C2T.text	
ltx/en_us_holycross/oc.m8.d1:ocMA.OdeS8C31.greekmelody	@ltx/en_us_holycross/he.h.m8:heHE.TonVasileaTonOuranon.greekname
ltx/en_us_holycross/oc.m8.d1:ocMA.OdeS8C31.incipit	…
ltx/en_us_holycross/oc.m8.d1:ocMA.OdeS8C31.melody	@ltx/en_us_holycross/he.h.m8:heHE.TonVasileaTonOuranon.notmetered
ltx/en_us_holycross/oc.m8.d1:ocMA.OdeS8C31.mode	@ltx/en_us_holycross/miscellanea:misc.Mode8
ltx/en_us_holycross/oc.m8.d1:ocMA.OdeS8C31.ode	@ltx/en_us_holycross/miscellanea:misc.Ode8
ltx/en_us_holycross/oc.m8.d1:ocMA.OdeS8C31.text	
ltx/en_us_holycross/oc.m8.d1:ocMA.OdeS8C32.incipit	…
ltx/en_us_holycross/oc.m8.d1:ocMA.OdeS8C32.melody	@ltx/en_us_holycross/he.h.m8:heHE.TonVasileaTonOuranon.notmetered
ltx/en_us_holycross/oc.m8.d1:ocMA.OdeS8C32.mode	@ltx/en_us_holycross/miscellanea:misc.Mode8
ltx/en_us_holycross/oc.m8.d1:ocMA.OdeS8C32.ode	@ltx/en_us_holycross/miscellanea:misc.Ode8
ltx/en_us_holycross/oc.m8.d1:ocMA.OdeS8C32.text	
ltx/en_us_holycross/oc.m8.d1:ocMA.OdeS8C33.incipit	…
ltx/en_us_holycross/oc.m8.d1:ocMA.OdeS8C33.melody	@ltx/en_us_holycross/he.h.m8:heHE.TonVasileaTonOuranon.notmetered
ltx/en_us_holycross/oc.m8.d1:ocMA.OdeS8C33.mode	@ltx/en_us_holycross/miscellanea:misc.Mode8
ltx/en_us_holycross/oc.m8.d1:ocMA.OdeS8C33.ode	@ltx/en_us_holycross/miscellanea:misc.Ode8
ltx/en_us_holycross/oc.m8.d1:ocMA.OdeS8C33.text	
ltx/en_us_holycross/oc.m8.d1:ocMA.OdeS9C11.incipit	…
ltx/en_us_holycross/oc.m8.d1:ocMA.OdeS9C11.melody	@ltx/en_us_holycross/he.h.m8:heHE.ExestiEpiTouto.notmetered
ltx/en_us_holycross/oc.m8.d1:ocMA.OdeS9C11.mode	@ltx/en_us_holycross/miscellanea:misc.Mode8
ltx/en_us_holycross/oc.m8.d1:ocMA.OdeS9C11.ode	@ltx/en_us_holycross/miscellanea:misc.Ode9
ltx/en_us_holycross/oc.m8.d1:ocMA.OdeS9C11.text	
ltx/en_us_holycross/oc.m8.d1:ocMA.OdeS9C12.incipit	…
ltx/en_us_holycross/oc.m8.d1:ocMA.OdeS9C12.melody	@ltx/en_us_holycross/he.h.m8:heHE.ExestiEpiTouto.notmetered
ltx/en_us_holycross/oc.m8.d1:ocMA.OdeS9C12.mode	@ltx/en_us_holycross/miscellanea:misc.Mode8
ltx/en_us_holycross/oc.m8.d1:ocMA.OdeS9C12.ode	@ltx/en_us_holycross/miscellanea:misc.Ode9
ltx/en_us_holycross/oc.m8.d1:ocMA.OdeS9C12.text	
ltx/en_us_holycross/oc.m8.d1:ocMA.OdeS9C1H.greekmelody	@ltx/en_us_holycross/he.h.m8:heHE.ExestiEpiTouto.greekname
ltx/en_us_holycross/oc.m8.d1:ocMA.OdeS9C1H.incipit	@ltx/en_us_holycross/he.h.m8:heHE.ExestiEpiTouto.incipit
ltx/en_us_holycross/oc.m8.d1:ocMA.OdeS9C1H.melody	@ltx/en_us_holycross/he.h.m8:heHE.ExestiEpiTouto.melody
ltx/en_us_holycross/oc.m8.d1:ocMA.OdeS9C1H.mode	@ltx/en_us_holycross/miscellanea:misc.Mode8
ltx/en_us_holycross/oc.m8.d1:ocMA.OdeS9C1H.ode	@ltx/en_us_holycross/miscellanea:misc.Ode9
ltx/en_us_holycross/oc.m8.d1:ocMA.OdeS9C1H.text	@ltx/en_us_holycross/he.h.m8:heHE.ExestiEpiTouto.text
ltx/en_us_holycross/oc.m8.d1:ocMA.OdeS9C1T.incipit	…
ltx/en_us_holycross/oc.m8.d1:ocMA.OdeS9C1T.melody	@ltx/en_us_holycross/he.h.m8:heHE.ExestiEpiTouto.notmetered
ltx/en_us_holycross/oc.m8.d1:ocMA.OdeS9C1T.mode	@ltx/en_us_holycross/miscellanea:misc.Mode8
ltx/en_us_holycross/oc.m8.d1:ocMA.OdeS9C1T.ode	@ltx/en_us_holycross/miscellanea:misc.Ode9
ltx/en_us_holycross/oc.m8.d1:ocMA.OdeS9C1T.text	
ltx/en_us_holycross/oc.m8.d1:ocMA.OdeS9C21.greekmelody	@ltx/en_us_holycross/he.h.m8:heHE.EfrixePasaAkoi.greekname
ltx/en_us_holycross/oc.m8.d1:ocMA.OdeS9C21.incipit	…
ltx/en_us_holycross/oc.m8.d1:ocMA.OdeS9C21.melody	@ltx/en_us_holycross/he.h.m8:heHE.EfrixePasaAkoi.notmetered
ltx/en_us_holycross/oc.m8.d1:ocMA.OdeS9C21.mode	@ltx/en_us_holycross/miscellanea:misc.Mode8
ltx/en_us_holycross/oc.m8.d1:ocMA.OdeS9C21.ode	@ltx/en_us_holycross/miscellanea:misc.Ode9
ltx/en_us_holycross/oc.m8.d1:ocMA.OdeS9C21.text	
ltx/en_us_holycross/oc.m8.d1:ocMA.OdeS9C22.incipit	…
ltx/en_us_holycross/oc.m8.d1:ocMA.OdeS9C22.melody	@ltx/en_us_holycross/he.h.m8:heHE.EfrixePasaAkoi.notmetered
ltx/en_us_holycross/oc.m8.d1:ocMA.OdeS9C22.mode	@ltx/en_us_holycross/miscellanea:misc.Mode8
ltx/en_us_holycross/oc.m8.d1:ocMA.OdeS9C22.ode	@ltx/en_us_holycross/miscellanea:misc.Ode9
ltx/en_us_holycross/oc.m8.d1:ocMA.OdeS9C22.text	
ltx/en_us_holycross/oc.m8.d1:ocMA.OdeS9C2T.incipit	…
ltx/en_us_holycross/oc.m8.d1:ocMA.OdeS9C2T.melody	@ltx/en_us_holycross/he.h.m8:heHE.EfrixePasaAkoi.notmetered
ltx/en_us_holycross/oc.m8.d1:ocMA.OdeS9C2T.mode	@ltx/en_us_holycross/miscellanea:misc.Mode8
ltx/en_us_holycross/oc.m8.d1:ocMA.OdeS9C2T.ode	@ltx/en_us_holycross/miscellanea:misc.Ode9
ltx/en_us_holycross/oc.m8.d1:ocMA.OdeS9C2T.text	
ltx/en_us_holycross/oc.m8.d1:ocMA.OdeS9C31.greekmelody	@ltx/en_us_holycross/he.h.m8:heHE.KyriosTheotokon.greekname
ltx/en_us_holycross/oc.m8.d1:ocMA.OdeS9C31.incipit	…
ltx/en_us_holycross/oc.m8.d1:ocMA.OdeS9C31.melody	@ltx/en_us_holycross/he.h.m8:heHE.KyriosTheotokon.notmetered
ltx/en_us_holycross/oc.m8.d1:ocMA.OdeS9C31.mode	@ltx/en_us_holycross/miscellanea:misc.Mode8
ltx/en_us_holycross/oc.m8.d1:ocMA.OdeS9C31.ode	@ltx/en_us_holycross/miscellanea:misc.Ode9
ltx/en_us_holycross/oc.m8.d1:ocMA.OdeS9C31.text	
ltx/en_us_holycross/oc.m8.d1:ocMA.OdeS9C32.incipit	…
ltx/en_us_holycross/oc.m8.d1:ocMA.OdeS9C32.melody	@ltx/en_us_holycross/he.h.m8:heHE.KyriosTheotokon.notmetered
ltx/en_us_holycross/oc.m8.d1:ocMA.OdeS9C32.mode	@ltx/en_us_holycross/miscellanea:misc.Mode8
ltx/en_us_holycross/oc.m8.d1:ocMA.OdeS9C32.ode	@ltx/en_us_holycross/miscellanea:misc.Ode9
ltx/en_us_holycross/oc.m8.d1:ocMA.OdeS9C32.text	
ltx/en_us_holycross/oc.m8.d1:ocMA.OdeS9C33.incipit	…
ltx/en_us_holycross/oc.m8.d1:ocMA.OdeS9C33.melody	@ltx/en_us_holycross/he.h.m8:heHE.KyriosTheotokon.notmetered
ltx/en_us_holycross/oc.m8.d1:ocMA.OdeS9C33.mode	@ltx/en_us_holycross/miscellanea:misc.Mode8
ltx/en_us_holycross/oc.m8.d1:ocMA.OdeS9C33.ode	@ltx/en_us_holycross/miscellanea:misc.Ode9
ltx/en_us_holycross/oc.m8.d1:ocMA.OdeS9C33.text	
ltx/en_us_holycross/oc.m8.d1:ocMA.Oikos.incipit	…
ltx/en_us_holycross/oc.m8.d1:ocMA.Oikos.mode	@ltx/en_us_holycross/miscellanea:misc.Mode8
ltx/en_us_holycross/oc.m8.d1:ocMA.Oikos.text	
ltx/en_us_holycross/oc.m8.d1:ocMO.Kathisma11.greekmelody	@ltx/en_us_holycross/he.a.m8:heAU.ToProstachthen.greekname
ltx/en_us_holycross/oc.m8.d1:ocMO.Kathisma11.incipit	…
ltx/en_us_holycross/oc.m8.d1:ocMO.Kathisma11.melody	@ltx/en_us_holycross/he.a.m8:heAU.ToProstachthen.notmetered
ltx/en_us_holycross/oc.m8.d1:ocMO.Kathisma11.mode	@ltx/en_us_holycross/miscellanea:misc.Mode8
ltx/en_us_holycross/oc.m8.d1:ocMO.Kathisma11.text	
ltx/en_us_holycross/oc.m8.d1:ocMO.Kathisma12.incipit	…
ltx/en_us_holycross/oc.m8.d1:ocMO.Kathisma12.melody	@ltx/en_us_holycross/he.a.m8:heAU.ToProstachthen.notmetered
ltx/en_us_holycross/oc.m8.d1:ocMO.Kathisma12.mode	@ltx/en_us_holycross/miscellanea:misc.Mode8
ltx/en_us_holycross/oc.m8.d1:ocMO.Kathisma12.text	
ltx/en_us_holycross/oc.m8.d1:ocMO.Kathisma21.greekmelody	@ltx/en_us_holycross/he.a.m8:heAU.ToProstachthen.greekname
ltx/en_us_holycross/oc.m8.d1:ocMO.Kathisma21.incipit	…
ltx/en_us_holycross/oc.m8.d1:ocMO.Kathisma21.melody	@ltx/en_us_holycross/he.a.m8:heAU.ToProstachthen.notmetered
ltx/en_us_holycross/oc.m8.d1:ocMO.Kathisma21.mode	@ltx/en_us_holycross/miscellanea:misc.Mode8
ltx/en_us_holycross/oc.m8.d1:ocMO.Kathisma21.text	
ltx/en_us_holycross/oc.m8.d1:ocMO.Kathisma22.incipit	…
ltx/en_us_holycross/oc.m8.d1:ocMO.Kathisma22.melody	@ltx/en_us_holycross/he.a.m8:heAU.ToProstachthen.notmetered
ltx/en_us_holycross/oc.m8.d1:ocMO.Kathisma22.mode	@ltx/en_us_holycross/miscellanea:misc.Mode8
ltx/en_us_holycross/oc.m8.d1:ocMO.Kathisma22.text	
ltx/en_us_holycross/oc.m8.d1:ocMO.Ode11.greekmelody	@ltx/en_us_holycross/he.h.m8:heHE.ArmatilatinFarao.greekname
ltx/en_us_holycross/oc.m8.d1:ocMO.Ode11.incipit	…
ltx/en_us_holycross/oc.m8.d1:ocMO.Ode11.melody	@ltx/en_us_holycross/he.h.m8:heHE.ArmatilatinFarao.notmetered
ltx/en_us_holycross/oc.m8.d1:ocMO.Ode11.mode	@ltx/en_us_holycross/miscellanea:misc.Mode8
ltx/en_us_holycross/oc.m8.d1:ocMO.Ode11.ode	@ltx/en_us_holycross/miscellanea:misc.Ode1
ltx/en_us_holycross/oc.m8.d1:ocMO.Ode11.text	
ltx/en_us_holycross/oc.m8.d1:ocMO.Ode12.incipit	…
ltx/en_us_holycross/oc.m8.d1:ocMO.Ode12.melody	@ltx/en_us_holycross/he.h.m8:heHE.ArmatilatinFarao.notmetered
ltx/en_us_holycross/oc.m8.d1:ocMO.Ode12.mode	@ltx/en_us_holycross/miscellanea:misc.Mode8
ltx/en_us_holycross/oc.m8.d1:ocMO.Ode12.ode	@ltx/en_us_holycross/miscellanea:misc.Ode1
ltx/en_us_holycross/oc.m8.d1:ocMO.Ode12.text	
ltx/en_us_holycross/oc.m8.d1:ocMO.Ode13.incipit	…
ltx/en_us_holycross/oc.m8.d1:ocMO.Ode13.melody	@ltx/en_us_holycross/he.h.m8:heHE.ArmatilatinFarao.notmetered
ltx/en_us_holycross/oc.m8.d1:ocMO.Ode13.mode	@ltx/en_us_holycross/miscellanea:misc.Mode8
ltx/en_us_holycross/oc.m8.d1:ocMO.Ode13.ode	@ltx/en_us_holycross/miscellanea:misc.Ode1
ltx/en_us_holycross/oc.m8.d1:ocMO.Ode13.text	
ltx/en_us_holycross/oc.m8.d1:ocMO.Ode1T.incipit	…
ltx/en_us_holycross/oc.m8.d1:ocMO.Ode1T.melody	@ltx/en_us_holycross/he.h.m8:heHE.ArmatilatinFarao.notmetered
ltx/en_us_holycross/oc.m8.d1:ocMO.Ode1T.mode	@ltx/en_us_holycross/miscellanea:misc.Mode8
ltx/en_us_holycross/oc.m8.d1:ocMO.Ode1T.ode	@ltx/en_us_holycross/miscellanea:misc.Ode1
ltx/en_us_holycross/oc.m8.d1:ocMO.Ode1T.text	
ltx/en_us_holycross/oc.m8.d1:ocMO.Ode31.greekmelody	@ltx/en_us_holycross/he.h.m8:heHE.OStereosasKatArchas.greekname
ltx/en_us_holycross/oc.m8.d1:ocMO.Ode31.incipit	…
ltx/en_us_holycross/oc.m8.d1:ocMO.Ode31.melody	@ltx/en_us_holycross/he.h.m8:heHE.OStereosasKatArchas.notmetered
ltx/en_us_holycross/oc.m8.d1:ocMO.Ode31.mode	@ltx/en_us_holycross/miscellanea:misc.Mode8
ltx/en_us_holycross/oc.m8.d1:ocMO.Ode31.ode	@ltx/en_us_holycross/miscellanea:misc.Ode3
ltx/en_us_holycross/oc.m8.d1:ocMO.Ode31.text	
ltx/en_us_holycross/oc.m8.d1:ocMO.Ode32.incipit	…
ltx/en_us_holycross/oc.m8.d1:ocMO.Ode32.melody	@ltx/en_us_holycross/he.h.m8:heHE.OStereosasKatArchas.notmetered
ltx/en_us_holycross/oc.m8.d1:ocMO.Ode32.mode	@ltx/en_us_holycross/miscellanea:misc.Mode8
ltx/en_us_holycross/oc.m8.d1:ocMO.Ode32.ode	@ltx/en_us_holycross/miscellanea:misc.Ode3
ltx/en_us_holycross/oc.m8.d1:ocMO.Ode32.text	
ltx/en_us_holycross/oc.m8.d1:ocMO.Ode33.incipit	…
ltx/en_us_holycross/oc.m8.d1:ocMO.Ode33.melody	@ltx/en_us_holycross/he.h.m8:heHE.OStereosasKatArchas.notmetered
ltx/en_us_holycross/oc.m8.d1:ocMO.Ode33.mode	@ltx/en_us_holycross/miscellanea:misc.Mode8
ltx/en_us_holycross/oc.m8.d1:ocMO.Ode33.ode	@ltx/en_us_holycross/miscellanea:misc.Ode3
ltx/en_us_holycross/oc.m8.d1:ocMO.Ode33.text	
ltx/en_us_holycross/oc.m8.d1:ocMO.Ode3T.incipit	…
ltx/en_us_holycross/oc.m8.d1:ocMO.Ode3T.melody	@ltx/en_us_holycross/he.h.m8:heHE.OStereosasKatArchas.notmetered
ltx/en_us_holycross/oc.m8.d1:ocMO.Ode3T.mode	@ltx/en_us_holycross/miscellanea:misc.Mode8
ltx/en_us_holycross/oc.m8.d1:ocMO.Ode3T.ode	@ltx/en_us_holycross/miscellanea:misc.Ode3
ltx/en_us_holycross/oc.m8.d1:ocMO.Ode3T.text	
ltx/en_us_holycross/oc.m8.d1:ocMO.Ode41.greekmelody	@ltx/en_us_holycross/he.h.m8:heHE.SyMouIschys.greekname
ltx/en_us_holycross/oc.m8.d1:ocMO.Ode41.incipit	…
ltx/en_us_holycross/oc.m8.d1:ocMO.Ode41.melody	@ltx/en_us_holycross/he.h.m8:heHE.SyMouIschys.notmetered
ltx/en_us_holycross/oc.m8.d1:ocMO.Ode41.mode	@ltx/en_us_holycross/miscellanea:misc.Mode8
ltx/en_us_holycross/oc.m8.d1:ocMO.Ode41.ode	@ltx/en_us_holycross/miscellanea:misc.Ode4
ltx/en_us_holycross/oc.m8.d1:ocMO.Ode41.text	
ltx/en_us_holycross/oc.m8.d1:ocMO.Ode42.incipit	…
ltx/en_us_holycross/oc.m8.d1:ocMO.Ode42.melody	@ltx/en_us_holycross/he.h.m8:heHE.SyMouIschys.notmetered
ltx/en_us_holycross/oc.m8.d1:ocMO.Ode42.mode	@ltx/en_us_holycross/miscellanea:misc.Mode8
ltx/en_us_holycross/oc.m8.d1:ocMO.Ode42.ode	@ltx/en_us_holycross/miscellanea:misc.Ode4
ltx/en_us_holycross/oc.m8.d1:ocMO.Ode42.text	
ltx/en_us_holycross/oc.m8.d1:ocMO.Ode43.incipit	…
ltx/en_us_holycross/oc.m8.d1:ocMO.Ode43.melody	@ltx/en_us_holycross/he.h.m8:heHE.SyMouIschys.notmetered
ltx/en_us_holycross/oc.m8.d1:ocMO.Ode43.mode	@ltx/en_us_holycross/miscellanea:misc.Mode8
ltx/en_us_holycross/oc.m8.d1:ocMO.Ode43.ode	@ltx/en_us_holycross/miscellanea:misc.Ode4
ltx/en_us_holycross/oc.m8.d1:ocMO.Ode43.text	
ltx/en_us_holycross/oc.m8.d1:ocMO.Ode4T.incipit	…
ltx/en_us_holycross/oc.m8.d1:ocMO.Ode4T.melody	@ltx/en_us_holycross/he.h.m8:heHE.SyMouIschys.notmetered
ltx/en_us_holycross/oc.m8.d1:ocMO.Ode4T.mode	@ltx/en_us_holycross/miscellanea:misc.Mode8
ltx/en_us_holycross/oc.m8.d1:ocMO.Ode4T.ode	@ltx/en_us_holycross/miscellanea:misc.Ode4
ltx/en_us_holycross/oc.m8.d1:ocMO.Ode4T.text	
ltx/en_us_holycross/oc.m8.d1:ocMO.Ode51.greekmelody	@ltx/en_us_holycross/he.h.m8:heHE.InaTiMeAposo.greekname
ltx/en_us_holycross/oc.m8.d1:ocMO.Ode51.incipit	…
ltx/en_us_holycross/oc.m8.d1:ocMO.Ode51.melody	@ltx/en_us_holycross/he.h.m8:heHE.InaTiMeAposo.notmetered
ltx/en_us_holycross/oc.m8.d1:ocMO.Ode51.mode	@ltx/en_us_holycross/miscellanea:misc.Mode8
ltx/en_us_holycross/oc.m8.d1:ocMO.Ode51.ode	@ltx/en_us_holycross/miscellanea:misc.Ode5
ltx/en_us_holycross/oc.m8.d1:ocMO.Ode51.text	
ltx/en_us_holycross/oc.m8.d1:ocMO.Ode52.incipit	…
ltx/en_us_holycross/oc.m8.d1:ocMO.Ode52.melody	@ltx/en_us_holycross/he.h.m8:heHE.InaTiMeAposo.notmetered
ltx/en_us_holycross/oc.m8.d1:ocMO.Ode52.mode	@ltx/en_us_holycross/miscellanea:misc.Mode8
ltx/en_us_holycross/oc.m8.d1:ocMO.Ode52.ode	@ltx/en_us_holycross/miscellanea:misc.Ode5
ltx/en_us_holycross/oc.m8.d1:ocMO.Ode52.text	
ltx/en_us_holycross/oc.m8.d1:ocMO.Ode53.incipit	…
ltx/en_us_holycross/oc.m8.d1:ocMO.Ode53.melody	@ltx/en_us_holycross/he.h.m8:heHE.InaTiMeAposo.notmetered
ltx/en_us_holycross/oc.m8.d1:ocMO.Ode53.mode	@ltx/en_us_holycross/miscellanea:misc.Mode8
ltx/en_us_holycross/oc.m8.d1:ocMO.Ode53.ode	@ltx/en_us_holycross/miscellanea:misc.Ode5
ltx/en_us_holycross/oc.m8.d1:ocMO.Ode53.text	
ltx/en_us_holycross/oc.m8.d1:ocMO.Ode5T.incipit	…
ltx/en_us_holycross/oc.m8.d1:ocMO.Ode5T.melody	@ltx/en_us_holycross/he.h.m8:heHE.InaTiMeAposo.notmetered
ltx/en_us_holycross/oc.m8.d1:ocMO.Ode5T.mode	@ltx/en_us_holycross/miscellanea:misc.Mode8
ltx/en_us_holycross/oc.m8.d1:ocMO.Ode5T.ode	@ltx/en_us_holycross/miscellanea:misc.Ode5
ltx/en_us_holycross/oc.m8.d1:ocMO.Ode5T.text	
ltx/en_us_holycross/oc.m8.d1:ocMO.Ode61.greekmelody	@ltx/en_us_holycross/he.h.m8:heHE.IlasthitiMoiSotir.greekname
ltx/en_us_holycross/oc.m8.d1:ocMO.Ode61.incipit	…
ltx/en_us_holycross/oc.m8.d1:ocMO.Ode61.melody	@ltx/en_us_holycross/he.h.m8:heHE.IlasthitiMoiSotir.notmetered
ltx/en_us_holycross/oc.m8.d1:ocMO.Ode61.mode	@ltx/en_us_holycross/miscellanea:misc.Mode8
ltx/en_us_holycross/oc.m8.d1:ocMO.Ode61.ode	@ltx/en_us_holycross/miscellanea:misc.Ode6
ltx/en_us_holycross/oc.m8.d1:ocMO.Ode61.text	
ltx/en_us_holycross/oc.m8.d1:ocMO.Ode62.incipit	…
ltx/en_us_holycross/oc.m8.d1:ocMO.Ode62.melody	@ltx/en_us_holycross/he.h.m8:heHE.IlasthitiMoiSotir.notmetered
ltx/en_us_holycross/oc.m8.d1:ocMO.Ode62.mode	@ltx/en_us_holycross/miscellanea:misc.Mode8
ltx/en_us_holycross/oc.m8.d1:ocMO.Ode62.ode	@ltx/en_us_holycross/miscellanea:misc.Ode6
ltx/en_us_holycross/oc.m8.d1:ocMO.Ode62.text	
ltx/en_us_holycross/oc.m8.d1:ocMO.Ode63.incipit	…
ltx/en_us_holycross/oc.m8.d1:ocMO.Ode63.melody	@ltx/en_us_holycross/he.h.m8:heHE.IlasthitiMoiSotir.notmetered
ltx/en_us_holycross/oc.m8.d1:ocMO.Ode63.mode	@ltx/en_us_holycross/miscellanea:misc.Mode8
ltx/en_us_holycross/oc.m8.d1:ocMO.Ode63.ode	@ltx/en_us_holycross/miscellanea:misc.Ode6
ltx/en_us_holycross/oc.m8.d1:ocMO.Ode63.text	
ltx/en_us_holycross/oc.m8.d1:ocMO.Ode6T.incipit	…
ltx/en_us_holycross/oc.m8.d1:ocMO.Ode6T.melody	@ltx/en_us_holycross/he.h.m8:heHE.IlasthitiMoiSotir.notmetered
ltx/en_us_holycross/oc.m8.d1:ocMO.Ode6T.mode	@ltx/en_us_holycross/miscellanea:misc.Mode8
ltx/en_us_holycross/oc.m8.d1:ocMO.Ode6T.ode	@ltx/en_us_holycross/miscellanea:misc.Ode6
ltx/en_us_holycross/oc.m8.d1:ocMO.Ode6T.text	
ltx/en_us_holycross/oc.m8.d1:ocMO.Ode71.greekmelody	@ltx/en_us_holycross/he.h.m8:heHE.TheouSynkatavasin.greekname
ltx/en_us_holycross/oc.m8.d1:ocMO.Ode71.incipit	…
ltx/en_us_holycross/oc.m8.d1:ocMO.Ode71.melody	@ltx/en_us_holycross/he.h.m8:heHE.TheouSynkatavasin.notmetered
ltx/en_us_holycross/oc.m8.d1:ocMO.Ode71.mode	@ltx/en_us_holycross/miscellanea:misc.Mode8
ltx/en_us_holycross/oc.m8.d1:ocMO.Ode71.ode	@ltx/en_us_holycross/miscellanea:misc.Ode7
ltx/en_us_holycross/oc.m8.d1:ocMO.Ode71.text	
ltx/en_us_holycross/oc.m8.d1:ocMO.Ode72.incipit	…
ltx/en_us_holycross/oc.m8.d1:ocMO.Ode72.melody	@ltx/en_us_holycross/he.h.m8:heHE.TheouSynkatavasin.notmetered
ltx/en_us_holycross/oc.m8.d1:ocMO.Ode72.mode	@ltx/en_us_holycross/miscellanea:misc.Mode8
ltx/en_us_holycross/oc.m8.d1:ocMO.Ode72.ode	@ltx/en_us_holycross/miscellanea:misc.Ode7
ltx/en_us_holycross/oc.m8.d1:ocMO.Ode72.text	
ltx/en_us_holycross/oc.m8.d1:ocMO.Ode7T.incipit	…
ltx/en_us_holycross/oc.m8.d1:ocMO.Ode7T.melody	@ltx/en_us_holycross/he.h.m8:heHE.TheouSynkatavasin.notmetered
ltx/en_us_holycross/oc.m8.d1:ocMO.Ode7T.mode	@ltx/en_us_holycross/miscellanea:misc.Mode8
ltx/en_us_holycross/oc.m8.d1:ocMO.Ode7T.ode	@ltx/en_us_holycross/miscellanea:misc.Ode7
ltx/en_us_holycross/oc.m8.d1:ocMO.Ode7T.text	
ltx/en_us_holycross/oc.m8.d1:ocMO.Ode81.greekmelody	@ltx/en_us_holycross/he.h.m8:heHE.EptaplasiosKaminon.greekname
ltx/en_us_holycross/oc.m8.d1:ocMO.Ode81.incipit	…
ltx/en_us_holycross/oc.m8.d1:ocMO.Ode81.melody	@ltx/en_us_holycross/he.h.m8:heHE.EptaplasiosKaminon.notmetered
ltx/en_us_holycross/oc.m8.d1:ocMO.Ode81.mode	@ltx/en_us_holycross/miscellanea:misc.Mode8
ltx/en_us_holycross/oc.m8.d1:ocMO.Ode81.ode	@ltx/en_us_holycross/miscellanea:misc.Ode8
ltx/en_us_holycross/oc.m8.d1:ocMO.Ode81.text	
ltx/en_us_holycross/oc.m8.d1:ocMO.Ode82.incipit	…
ltx/en_us_holycross/oc.m8.d1:ocMO.Ode82.melody	@ltx/en_us_holycross/he.h.m8:heHE.EptaplasiosKaminon.notmetered
ltx/en_us_holycross/oc.m8.d1:ocMO.Ode82.mode	@ltx/en_us_holycross/miscellanea:misc.Mode8
ltx/en_us_holycross/oc.m8.d1:ocMO.Ode82.ode	@ltx/en_us_holycross/miscellanea:misc.Ode8
ltx/en_us_holycross/oc.m8.d1:ocMO.Ode82.text	
ltx/en_us_holycross/oc.m8.d1:ocMO.Ode83.incipit	…
ltx/en_us_holycross/oc.m8.d1:ocMO.Ode83.melody	@ltx/en_us_holycross/he.h.m8:heHE.EptaplasiosKaminon.notmetered
ltx/en_us_holycross/oc.m8.d1:ocMO.Ode83.mode	@ltx/en_us_holycross/miscellanea:misc.Mode8
ltx/en_us_holycross/oc.m8.d1:ocMO.Ode83.ode	@ltx/en_us_holycross/miscellanea:misc.Ode8
ltx/en_us_holycross/oc.m8.d1:ocMO.Ode83.text	
ltx/en_us_holycross/oc.m8.d1:ocMO.Ode8T.incipit	…
ltx/en_us_holycross/oc.m8.d1:ocMO.Ode8T.melody	@ltx/en_us_holycross/he.h.m8:heHE.EptaplasiosKaminon.notmetered
ltx/en_us_holycross/oc.m8.d1:ocMO.Ode8T.mode	@ltx/en_us_holycross/miscellanea:misc.Mode8
ltx/en_us_holycross/oc.m8.d1:ocMO.Ode8T.ode	@ltx/en_us_holycross/miscellanea:misc.Ode8
ltx/en_us_holycross/oc.m8.d1:ocMO.Ode8T.text	
ltx/en_us_holycross/oc.m8.d1:ocMO.Ode91.greekmelody	@ltx/en_us_holycross/he.h.m8:heHE.ExestiEpiTouto.greekname
ltx/en_us_holycross/oc.m8.d1:ocMO.Ode91.incipit	…
ltx/en_us_holycross/oc.m8.d1:ocMO.Ode91.melody	@ltx/en_us_holycross/he.h.m8:heHE.ExestiEpiTouto.notmetered
ltx/en_us_holycross/oc.m8.d1:ocMO.Ode91.mode	@ltx/en_us_holycross/miscellanea:misc.Mode8
ltx/en_us_holycross/oc.m8.d1:ocMO.Ode91.ode	@ltx/en_us_holycross/miscellanea:misc.Ode9
ltx/en_us_holycross/oc.m8.d1:ocMO.Ode91.text	
ltx/en_us_holycross/oc.m8.d1:ocMO.Ode92.incipit	…
ltx/en_us_holycross/oc.m8.d1:ocMO.Ode92.melody	@ltx/en_us_holycross/he.h.m8:heHE.ExestiEpiTouto.notmetered
ltx/en_us_holycross/oc.m8.d1:ocMO.Ode92.mode	@ltx/en_us_holycross/miscellanea:misc.Mode8
ltx/en_us_holycross/oc.m8.d1:ocMO.Ode92.ode	@ltx/en_us_holycross/miscellanea:misc.Ode9
ltx/en_us_holycross/oc.m8.d1:ocMO.Ode92.text	
ltx/en_us_holycross/oc.m8.d1:ocMO.Ode9T.incipit	…
ltx/en_us_holycross/oc.m8.d1:ocMO.Ode9T.melody	@ltx/en_us_holycross/he.h.m8:heHE.ExestiEpiTouto.notmetered
ltx/en_us_holycross/oc.m8.d1:ocMO.Ode9T.mode	@ltx/en_us_holycross/miscellanea:misc.Mode8
ltx/en_us_holycross/oc.m8.d1:ocMO.Ode9T.ode	@ltx/en_us_holycross/miscellanea:misc.Ode9
ltx/en_us_holycross/oc.m8.d1:ocMO.Ode9T.text	
ltx/en_us_holycross/oc.m8.d1:ocMO.acrostic.notice	
ltx/en_us_holycross/oc.m8.d1:ocMO.acrostic.text	
ltx/en_us_holycross/oc.m8.d1:ocMO.poet	@ltx/en_us_holycross/poets:po.MitrofanousSmirnis
ltx/en_us_holycross/oc.m8.d1:ocMO.title	
ltx/en_us_holycross/oc.m8.d1:ocSV.AposDogmatic.incipit	…
ltx/en_us_holycross/oc.m8.d1:ocSV.AposDogmatic.melody	
ltx/en_us_holycross/oc.m8.d1:ocSV.AposDogmatic.mode	@ltx/en_us_holycross/miscellanea:misc.Mode8
ltx/en_us_holycross/oc.m8.d1:ocSV.AposDogmatic.text	
ltx/en_us_holycross/oc.m8.d1:ocSV.Aposticha1.incipit	…
ltx/en_us_holycross/oc.m8.d1:ocSV.Aposticha1.melody	@ltx/en_us_holycross/he.a.m8:heAU.OTouParadoxou.notmetered
ltx/en_us_holycross/oc.m8.d1:ocSV.Aposticha1.mode	@ltx/en_us_holycross/miscellanea:misc.Mode8
ltx/en_us_holycross/oc.m8.d1:ocSV.Aposticha1.text	
ltx/en_us_holycross/oc.m8.d1:ocSV.Aposticha2.incipit	…
ltx/en_us_holycross/oc.m8.d1:ocSV.Aposticha2.melody	@ltx/en_us_holycross/he.a.m8:heAU.OTouParadoxou.notmetered
ltx/en_us_holycross/oc.m8.d1:ocSV.Aposticha2.mode	@ltx/en_us_holycross/miscellanea:misc.Mode8
ltx/en_us_holycross/oc.m8.d1:ocSV.Aposticha2.text	
ltx/en_us_holycross/oc.m8.d1:ocSV.Aposticha3.incipit	…
ltx/en_us_holycross/oc.m8.d1:ocSV.Aposticha3.melody	@ltx/en_us_holycross/he.a.m8:heAU.OTouParadoxou.notmetered
ltx/en_us_holycross/oc.m8.d1:ocSV.Aposticha3.mode	@ltx/en_us_holycross/miscellanea:misc.Mode8
ltx/en_us_holycross/oc.m8.d1:ocSV.Aposticha3.text	
ltx/en_us_holycross/oc.m8.d1:ocSV.Dogmatic.incipit	…
ltx/en_us_holycross/oc.m8.d1:ocSV.Dogmatic.melody	
ltx/en_us_holycross/oc.m8.d1:ocSV.Dogmatic.mode	@ltx/en_us_holycross/miscellanea:misc.Mode8
ltx/en_us_holycross/oc.m8.d1:ocSV.Dogmatic.text	
ltx/en_us_holycross/oc.m8.d1:ocVE.ApolTheotokionVM.incipit	…
ltx/en_us_holycross/oc.m8.d1:ocVE.ApolTheotokionVM.melody	
ltx/en_us_holycross/oc.m8.d1:ocVE.ApolTheotokionVM.mode	@ltx/en_us_holycross/miscellanea:misc.Mode8
ltx/en_us_holycross/oc.m8.d1:ocVE.ApolTheotokionVM.text	
ltx/en_us_holycross/oc.m8.d1:ocVE.Apolytikion.incipit	…
ltx/en_us_holycross/oc.m8.d1:ocVE.Apolytikion.melody	
ltx/en_us_holycross/oc.m8.d1:ocVE.Apolytikion.mode	@ltx/en_us_holycross/miscellanea:misc.Mode8
ltx/en_us_holycross/oc.m8.d1:ocVE.Apolytikion.text	
ltx/en_us_holycross/oc.m8.d1:ocVE.AposTheotokion.incipit	O Virgin unwedded…
ltx/en_us_holycross/oc.m8.d1:ocVE.AposTheotokion.melody	
ltx/en_us_holycross/oc.m8.d1:ocVE.AposTheotokion.mode	@ltx/en_us_holycross/miscellanea:misc.Mode8
ltx/en_us_holycross/oc.m8.d1:ocVE.AposTheotokion.text	O Virgin unwedded, O Mother of God on high, you ineffably conceived God in the flesh. Receive the petitions of your suppliants, all-blameless Lady, and grant us all purification of our transgressions. Accept now our supplication and pray that we may all be saved.
ltx/en_us_holycross/oc.m8.d1:ocVE.Aposticha1.incipit	You ascended the cross…
ltx/en_us_holycross/oc.m8.d1:ocVE.Aposticha1.melody	
ltx/en_us_holycross/oc.m8.d1:ocVE.Aposticha1.mode	@ltx/en_us_holycross/miscellanea:misc.Mode8
ltx/en_us_holycross/oc.m8.d1:ocVE.Aposticha1.text	You ascended the cross, Jesus, and came down from heaven and went to your death, O life eternal. You are the true light to those in darkness and the resurrection of all those who have fallen. Our enlightener and Savior, glory to you.
ltx/en_us_holycross/oc.m8.d1:ocVE.Aposticha2.incipit	Let us praise Christ…
ltx/en_us_holycross/oc.m8.d1:ocVE.Aposticha2.melody	
ltx/en_us_holycross/oc.m8.d1:ocVE.Aposticha2.mode	@ltx/en_us_holycross/miscellanea:misc.Mode8
ltx/en_us_holycross/oc.m8.d1:ocVE.Aposticha2.text	Let us praise Christ who has risen from the dead. For he took upon himself soul and body, and by his passion separated them one from the other. He despoiled Hades when his pure soul descended there. But the holy body of our Redeemer lay uncorrupted.
ltx/en_us_holycross/oc.m8.d1:ocVE.Aposticha3.incipit	We glorify your resurrection…
ltx/en_us_holycross/oc.m8.d1:ocVE.Aposticha3.melody	
ltx/en_us_holycross/oc.m8.d1:ocVE.Aposticha3.mode	@ltx/en_us_holycross/miscellanea:misc.Mode8
ltx/en_us_holycross/oc.m8.d1:ocVE.Aposticha3.text	We glorify your resurrection from the dead, O Christ, in psalms and hymns, for by it you have freed us from the torments of Hades, and have, since you are God, granted us eternal life and great mercy.
ltx/en_us_holycross/oc.m8.d1:ocVE.Aposticha4.incipit	O Lord of all, incomprehensible…
ltx/en_us_holycross/oc.m8.d1:ocVE.Aposticha4.melody	
ltx/en_us_holycross/oc.m8.d1:ocVE.Aposticha4.mode	@ltx/en_us_holycross/miscellanea:misc.Mode8
ltx/en_us_holycross/oc.m8.d1:ocVE.Aposticha4.text	O Lord of all, incomprehensible creator of heaven and earth, through your passion on the cross you have freed me from passion. After enduring burial, you rose in glory, raising up Adam with your almighty arm. Glory to your resurrection on the third day, by which you have endowed us with eternal life and granted us pardon of our sins, for you alone are compassionate.
ltx/en_us_holycross/oc.m8.d1:ocVE.MM.LIHC1.text	@ltx/en_us_holycross/properties:media.key
ltx/en_us_holycross/oc.m8.d1:ocVE.MM.LIHC2.text	@ltx/en_us_holycross/properties:media.key
ltx/en_us_holycross/oc.m8.d1:ocVE.MM.Stichologia.text	@ltx/en_us_holycross/properties:media.key
ltx/en_us_holycross/oc.m8.d1:ocVE.SticTheotokion.incipit	In his love for mankind…
ltx/en_us_holycross/oc.m8.d1:ocVE.SticTheotokion.melody	
ltx/en_us_holycross/oc.m8.d1:ocVE.SticTheotokion.mode	@ltx/en_us_holycross/miscellanea:misc.Mode8
ltx/en_us_holycross/oc.m8.d1:ocVE.SticTheotokion.text	In his love for mankind, the King of heaven appeared upon earth and dwelled among us. For he took flesh from the pure Virgin, and thus incarnate he came forth from her. The only Son is he: twofold in nature, but not in person. For this reason proclaiming him to be truly perfect man and perfect God, we confess Christ to be our God. Therefore, beseech him, O virgin Mother, to have mercy on our souls.
ltx/en_us_holycross/oc.m8.d1:ocVE.Stichera1.incipit	We offer up to you, O Christ…
ltx/en_us_holycross/oc.m8.d1:ocVE.Stichera1.melody	
ltx/en_us_holycross/oc.m8.d1:ocVE.Stichera1.mode	@ltx/en_us_holycross/miscellanea:misc.Mode8
ltx/en_us_holycross/oc.m8.d1:ocVE.Stichera1.text	We offer up to you, O Christ, our evening hymn and spiritual worship, for it has pleased you to have mercy on us by your resurrection.
ltx/en_us_holycross/oc.m8.d1:ocVE.Stichera2.incipit	Lord, Lord, cast us not away…
ltx/en_us_holycross/oc.m8.d1:ocVE.Stichera2.melody	
ltx/en_us_holycross/oc.m8.d1:ocVE.Stichera2.mode	@ltx/en_us_holycross/miscellanea:misc.Mode8
ltx/en_us_holycross/oc.m8.d1:ocVE.Stichera2.text	Lord, Lord, cast us not away from your presence, but be pleased to have mercy on us by the resurrection.
ltx/en_us_holycross/oc.m8.d1:ocVE.Stichera3.incipit	Rejoice, O holy Zion…
ltx/en_us_holycross/oc.m8.d1:ocVE.Stichera3.melody	
ltx/en_us_holycross/oc.m8.d1:ocVE.Stichera3.mode	@ltx/en_us_holycross/miscellanea:misc.Mode8
ltx/en_us_holycross/oc.m8.d1:ocVE.Stichera3.text	Rejoice, O holy Zion, mother of churches and dwelling place of God, for you were the first to receive remission of sins by the resurrection.
ltx/en_us_holycross/oc.m8.d1:ocVE.Stichera4.incipit	Begotten before all ages…
ltx/en_us_holycross/oc.m8.d1:ocVE.Stichera4.melody	
ltx/en_us_holycross/oc.m8.d1:ocVE.Stichera4.mode	@ltx/en_us_holycross/miscellanea:misc.Mode8
ltx/en_us_holycross/oc.m8.d1:ocVE.Stichera4.text	Begotten before all ages of God the Father, the Word, who in latter times took flesh of a virgin, willingly endured death by the cross and by his resurrection saved us who had been subject to death.
ltx/en_us_holycross/oc.m8.d1:ocVE.Stichera5.incipit	We glorify your resurrection…
ltx/en_us_holycross/oc.m8.d1:ocVE.Stichera5.melody	
ltx/en_us_holycross/oc.m8.d1:ocVE.Stichera5.mode	@ltx/en_us_holycross/miscellanea:misc.Mode8
ltx/en_us_holycross/oc.m8.d1:ocVE.Stichera5.text	We glorify your resurrection from the dead, O Christ, by which you have set free the race of Adam from the torment of Hades and, as God, have granted to the world eternal life and your great mercy.
ltx/en_us_holycross/oc.m8.d1:ocVE.Stichera6.incipit	Glory to you, O Christ…
ltx/en_us_holycross/oc.m8.d1:ocVE.Stichera6.melody	
ltx/en_us_holycross/oc.m8.d1:ocVE.Stichera6.mode	@ltx/en_us_holycross/miscellanea:misc.Mode8
ltx/en_us_holycross/oc.m8.d1:ocVE.Stichera6.text	Glory to you, O Christ, Savior, only-begotten Son of God who were nailed to the cross and on the third day rose from the tomb.
ltx/en_us_holycross/oc.m8.d1:ocVE.Stichera7.incipit	We offer you glory, O Lord…
ltx/en_us_holycross/oc.m8.d1:ocVE.Stichera7.melody	
ltx/en_us_holycross/oc.m8.d1:ocVE.Stichera7.mode	@ltx/en_us_holycross/miscellanea:misc.Mode8
ltx/en_us_holycross/oc.m8.d1:ocVE.Stichera7.text	We offer you glory, O Lord, who of your own will have endured the cross for our sake; and we worship you, almighty Savior, who love mankind. Cast us not away from your presence, but hear us and save us by your resurrection.
