ltx/en_us_holycross/actors:ac.Archbishop	
ltx/en_us_holycross/actors:ac.Bishop_Elect	
ltx/en_us_holycross/actors:ac.Candidate_Sponsor	CATECHUMEN/SPONSOR
ltx/en_us_holycross/actors:ac.Choir	CHOIR
ltx/en_us_holycross/actors:ac.People	PEOPLE
ltx/en_us_holycross/actors:ac.Priest	PRIEST
