ltx/en_us_holycross/eu.wedding:euWED.Key0100.title	The Service of Betrothal
ltx/en_us_holycross/eu.wedding:euWED.Key0101.text	O God eternal, Who has brought together into unity the things which before had been separate, and in so doing impose on them an indissoluble bond of love, Who did bless Isaac and Rebecca, declaring them to be the inheritors of Your promise: do You Yourself (+) bless these Your servants (Name) and (Name), directing them into every good work.
ltx/en_us_holycross/eu.wedding:euWED.Key0102.text	For You are a merciful and loving God, and to You do we send up all Glory: to the Father, and to the Son, and to the Holy Spirit, both now and ever, and to the ages of ages.
ltx/en_us_holycross/eu.wedding:euWED.Key0103.text	O Lord our God, Who espoused the Church as a pure virgin called from out of the Gentiles, bless this Betrothal (+), uniting these Your servants, keeping them in peace and oneness of mind.
ltx/en_us_holycross/eu.wedding:euWED.Key0104.text	For to You are due all glory, honor, and worship: to the Father, and to the Son, and to the Holy Spirit, both now and ever, and to the ages of ages.
ltx/en_us_holycross/eu.wedding:euWED.Key0105.text	The servant of God (Name) is betrothed to the servant of God (Name), in the Name of the Father, and of the Son, and of the Holy Spirit.
ltx/en_us_holycross/eu.wedding:euWED.Key0106.text	The servant of God (Name) is betrothed to the servant of God (Name), in the Name of the Father, and of the Son, and of the Holy Spirit.
ltx/en_us_holycross/eu.wedding:euWED.Key0107.text	O Lord our God, Who accompanied the servant of the patriarch Abraham to Mesopotamia, when he was sent to espouse a wife for his lord Isaac, and did reveal to him a sign by the drawing of water to betroth Rebecca; do You Yourself bless the betrothal of these Your servants (Name) and (Name) and confirm the word that has been spoken by them; for You, O Lord, from the beginning have created male and female, and by You is a woman joined to a man for assistance and for the continuation of the human race. Therefore, O Lord God, Who have sent forth Your truth to Your inheritance and Your promise to Your servants, our fathers, who were Your elect, do You give regard unto this Your servant (Name) and Your servant (Name), and seal their betrothal in faith, in oneness of mind, in truth and in love. For You, O Lord, have declared that a pledge is to be given and held inviolate in all things. By a ring Joseph was given might in Egypt; by a ring Daniel was exalted in Babylon; by a ring the truth of Thamar was made manifest; by a ring our heavenly Father showed compassion upon His prodigal son, for He said, “Put a ring upon his right hand, kill the fatted calf, and let us eat and rejoice.” Your own right hand, O Lord, armed Moses in the Red Sea. Yea, by the word of Your truth were the Heavens established and the earth set upon her sure foundations; and the right hands of Your servants shall be blessed by Your mighty word, and by Your uplifted arm. Wherefore, O Sovereign Lord, do You Yourself bless this putting on of rings with Your heavenly benediction; and may Your Angel go before them all the days of their life.
ltx/en_us_holycross/eu.wedding:euWED.Key0108.text	For You are He that blesses and sanctifies all things, and to You do we send up Glory: to the Father, and to the Son, and to the Holy Spirit, both now and ever, and to the ages of ages.
ltx/en_us_holycross/eu.wedding:euWED.Key0200.text	@ltx/en_us_holycross/prayers:pr.GloryToYouOurGod.text
ltx/en_us_holycross/eu.wedding:euWED.Key0200.title	The Service of the Crowning - The Service of Marriage
ltx/en_us_holycross/eu.wedding:euWED.Key0210.text	O God most pure, Author of all creation, Who through Your manbefriending love transformed a rib of Adam the forefather into a woman, and blessed them and said, “Increase and multiply, and have dominion over the earth,” and, by the conjoining, declared them both to be one member, for because of this a man shall forsake his father and his mother, and shall cleave unto his wife, and the two shall be one flesh-and whom God has joined together let not man put asunder; Who did also bless Your servant Abraham, and opened the womb of Sara, and made him the father of many nations; Who bestowed Isaac upon Rebecca, and blessed her offspring; Who joined Jacob and Rachel, and from them made manifest the twelve patriarchs; Who yoked Joseph and Asenath together, and as the fruit of generation did bestow upon them Ephrem and Manasse; Who accepted Zacharias and Elizabeth, and declared their offspring the Forerunner; Who out of the root of Jesse, according to the flesh, produced the Ever-Virgin Mary, and from her were Incarnate-born for the salvation of the human race; Who through Your unspeakable Grace and plentiful goodness were present in Cana of Galilee, and blessed the marriage there, that You might show a lawful union, and a generation there from, is according to Your Will; do You Yourself, O Most Holy Master, accept the prayer of us, Your servants; and as You were present there, be present also here with Your invisible protection. Bless (+) this marriage and grant unto these Your servants (Name) and (Name) a peaceful life, length of days, chastity, love for one another in a bond of peace, offspring long-lived, fair fame by reason of their children, and a crown of glory that does not fade away. Account them worthy to see their children’s children. Keep their wedlock safe against every hostile scheme; give them of the dew from the Heavens above, and of the fatness of the earth. Fill their houses with bountiful food, and with every good thing, that they may have to give to them that are in need, bestowing also on them that are here assembled with us all their supplications that are unto salvation.
ltx/en_us_holycross/eu.wedding:euWED.Key0211.text	For a God of mercy and of compassion, and of manbefriending love are You, and to You do we send up Glory: as to Your eternal Father and Your All-Holy, Good, and Life-creating Spirit, both now and ever, and to the ages of ages.
ltx/en_us_holycross/eu.wedding:euWED.Key0212.text	Blessed are You, O Lord our God, Holy Celebrant of mystical and pure marriage, Maker of the laws that govern earthly bodies, Guardian of incorruption, Kindly protector of the means of life: do You Yourself now, O Master, Who in the beginning created man, and appointed him as the king of creation, and said, “It is not good for man to be alone upon the earth; let us make a helpmate for him”; then, taking one of his ribs, made woman, whom when Adam saw, he said, “This is now bone of my bones, and flesh of my flesh, for she was taken out of her man. For this cause shall a man forsake his father and his mother, and cleave unto his wife, and two shall be one flesh,” and “whom God has joined together, let no man put asunder.” And now, O Master, Lord our God, send down Your heavenly Grace upon these Your servants, (Name) and (Name), and grant unto this woman to be in all things subject unto the man, and to this Your servant to be at the head of the woman that they live according to Your Will. (+) Bless them. O Lord our God, as you blessed Abraham and Sarah. (+) Bless them, O Lord our God, as You blessed Isaac and Rebecca. (+) Bless them, O Lord our God, as you blessed Jacob and all the Prophets. (+) Bless them, O Lord our God, as You blessed Joseph and Asenath. (+) Bless them O Lord our God, as You blessed Moses and Zipporah. (+) Bless them, O Lord our God, as You blessed Joakim and Anna. (+) Bless them, O Lord our God, as You blessed Zacharias and Elizabeth. Preserve them, O Lord our God, as You preserved Noah in the Ark. Preserve them, O Lord our God, as You preserved Jonah in the jaw of the sea beast. Preserve them, O Lord our God, as You preserved the holy Three Children from the fire, when You sent down upon them the dew of the Heavens. And may that joy come upon them which the blessed Helen had when she found the Precious Cross. Remember them, O Lord our God, as You remembered Enoch, Shem, and Elias. Remember them, O Lord our God, as You remembered Your holy Forty Martyrs, sending down upon them the crowns from the Heavens. Remember them, O Lord our God, and the parents who have reared them, for the prayers of parents confirm the foundation of houses. Remember, O Lord our God, the wedding company that here have come together, to be present at this rejoicing. Remember, O Lord our God, Your servant (Name) and Your servant (Name), and bless them. Give to them fruit of the womb, fair children, concord of soul and body. Exalt them as the cedars of Lebanon, and as well-cultured vine; bestow on them a rich store of sustenance, so that having a sufficiency of all things for themselves, they may abound in every good work that is good and acceptable before You. Let them behold their children’s children as newly planted olive trees round about their table; and, being accepted before You, let them shine as stars in the Heavens, in You, our Lord, to Whom are due all Glory, honor, and worship as to Your eternal Father, and Your All-Holy, Good, and Life-creating Spirit, both now and ever, and to the ages of ages.
ltx/en_us_holycross/eu.wedding:euWED.Key0213.text	Holy God, Who fashioned man from the dust, and from his rib fashioned woman, and joined her to him as a helpmate for him, for it was seemly unto Your Majesty for man not to be alone upon the earth, do You Yourself, O Sovereign Lord, stretch forth Your hand from Your holy dwelling place, and join together this Your servant (Name) and Your servant (Name), for by You is a wife joined to her husband. Join them together in oneness of mind; crown them with wedlock into one flesh; grant to them the fruit of the womb, and the gain of well favored children.
ltx/en_us_holycross/eu.wedding:euWED.Key0214.text	For Yours is the dominion, and Yours is the Kingdom, and the Power, and the Glory: of the Father, and of the Son, and of the Holy Spirit, both now and ever, and to the ages of ages.
ltx/en_us_holycross/eu.wedding:euWED.Key0215.text	The servant of God (Name) is crowned for the servant of God, (Name), in the Name of the Father, and of the Son, and of the Holy Spirit.
ltx/en_us_holycross/eu.wedding:euWED.Key0216.text	The servant of God (Name) is crowned for the servant of God (Name), in the Name of the Father, and of the Son, and of the Holy Spirit.
ltx/en_us_holycross/eu.wedding:euWED.Key0217.text	O Lord, our God, crown them with glory and honor.
ltx/en_us_holycross/eu.wedding:euWED.Key0220.title	THE READINGS
ltx/en_us_holycross/eu.wedding:euWED.Key0301.text	O Lord our God, Who in Your saving Providence did promise in Cana of Galilee to declare marriage honorable by Your presence, do You Yourself preserve in peace and oneness of mind these Your servants (Name) and (Name), whom You are well pleased should be joined to one another. Declare their marriage honorable. Preserve their bed undefiled. Grant that their life together be with be without spot of sin. And assure that they may be worthy to attain unto a ripe old age, keeping Your commandments in a pure heart.
ltx/en_us_holycross/eu.wedding:euWED.Key0302.text	For You are our God, the God to have mercy and save, and to You do we send up all Glory, as to Your Eternal Father, and Your All-Holy, Good, and Life-creating Spirit, both now and ever, and to the ages of ages.
ltx/en_us_holycross/eu.wedding:euWED.Key0303.text	O God, Who by Your might create all things, and confirm the universe, and adorn the crown of all things created by You, do You, with Your spiritual blessing (+), bless also this common cup given to them that are joined in the community of marriage.
ltx/en_us_holycross/eu.wedding:euWED.Key0303.title	
ltx/en_us_holycross/eu.wedding:euWED.Key0304.text	For blessed is Your Holy Name, and glorified is the Kingdom of the Father, and of the Son, and of the Holy Spirit, both now and ever, and to the ages of ages.
ltx/en_us_holycross/eu.wedding:euWED.Key0306.incipit	O Isaiah, dance your joy…
ltx/en_us_holycross/eu.wedding:euWED.Key0306.mode	Tone 5.
ltx/en_us_holycross/eu.wedding:euWED.Key0306.text	O Isaiah, dance your joy, for the Virgin was indeed with child; and brought to birth a Son, that Emmanuel, Who came as both God and man; Day-at-the-Dawn is the Name He bears, and by extolling Him, We hail the Virgin as blessed.
ltx/en_us_holycross/eu.wedding:euWED.Key0306.title	The Dance of Isaiah
ltx/en_us_holycross/eu.wedding:euWED.Key0307.incipit	Hear us, you martyred Saints…
ltx/en_us_holycross/eu.wedding:euWED.Key0307.mode	
ltx/en_us_holycross/eu.wedding:euWED.Key0307.text	Hear us, you martyred Saints, who fought the good fight, gaining crowns: entreat the Lord to shed His tender mercy on our souls.
ltx/en_us_holycross/eu.wedding:euWED.Key0308.incipit	Glory to You, O Christ…
ltx/en_us_holycross/eu.wedding:euWED.Key0308.mode	
ltx/en_us_holycross/eu.wedding:euWED.Key0308.text	Glory to You, O Christ our God, Your Apostles’ proudest boast and treasure of Your Martyrs’ joy, Who to all proclaimed the Consubstantial Trinity.
ltx/en_us_holycross/eu.wedding:euWED.Key0309.text	Be magnified, O Bridegroom, as Abraham, and blessed as Isaac, and increased as was Jacob. Go your way in peace, performing in righteousness the commandments of God.
ltx/en_us_holycross/eu.wedding:euWED.Key0310.text	And you, O Bride, be magnified as was Sarah, and rejoiced as was Rebecca, and increased as Rachel, being glad in your husband, keeping the paths of the Law, for so God is well pleased.
ltx/en_us_holycross/eu.wedding:euWED.Key0311.text	O God our God, Who was present in Cana of Galilee and blessed the marriage there, do You (+) also bless these’ Your servants, who, by Your Providence, are joined in the community of marriage. Bless their comings-in and their goings-out. Replenish their life with all good things. (Here the priest lifts the crowns from the heads of the bride and groom and places them on the table.) Accept their crowns in Your Kingdom unsoiled and undefiled; and preserve them without offense to the ages of ages.
ltx/en_us_holycross/eu.wedding:euWED.Key0311.title	
ltx/en_us_holycross/eu.wedding:euWED.Key0312.text	The Father, the Son, and the Holy Spirit; the All-Holy, Consubstantial and Life-creating Trinity; One Godhead and Kingdom; bless (+) you; grant to you long life, well-favored children, progress in life and in Faith; replenish you with all the good things of the earth, and count you worthy of the promised blessings, through the intercessions of the holy Theotokos, and of all the Saints.
ltx/en_us_holycross/eu.wedding:euWED.Key0312.title	
ltx/en_us_holycross/eu.wedding:euWED.Key0313.text	May He, who by His presence in Cana of Galilee declared marriage to be honorable, Christ our true God, through the intercessions of His all-pure Mother, of the holy, glorious, and all-praiseworthy Apostles, of the holy, God-crowned and Equal-to-the-Apostles Constantine and Helen, of the Holy, great Martyr Procopios, and of all the holy Saints, have mercy on us and save us, as our good and loving Lord.
ltx/en_us_holycross/eu.wedding:euWED.Key0313.title	DISMISSAL
ltx/en_us_holycross/eu.wedding:euWED.MM.Alleluia.text	@ltx/en_us_holycross/properties:media.key
ltx/en_us_holycross/eu.wedding:euWED.MM.CommunionHymn.text	@ltx/en_us_holycross/properties:media.key
ltx/en_us_holycross/eu.wedding:euWED.MM.Prokeimenon.text	@ltx/en_us_holycross/properties:media.key
ltx/en_us_holycross/eu.wedding:euWED.title	Holy Matrimony
ltx/en_us_holycross/eu.wedding:euWED.translator1	Prayers by Holy Cross Press, 1977.
ltx/en_us_holycross/eu.wedding:euWED.translator2	Hymns by Holy Cross Press.
