ltx/en_us_holycross/oc.m1.d5:ocBK.ModeNaked	@ltx/en_us_holycross/miscellanea:misc.Mode1.naked
ltx/en_us_holycross/oc.m1.d5:ocLI.Beatitudes1.incipit	@ltx/en_us_holycross/oc.m1.d1:ocLI.Beatitudes1.incipit
ltx/en_us_holycross/oc.m1.d5:ocLI.Beatitudes1.melody	
ltx/en_us_holycross/oc.m1.d5:ocLI.Beatitudes1.mode	@ltx/en_us_holycross/miscellanea:misc.Mode1
ltx/en_us_holycross/oc.m1.d5:ocLI.Beatitudes1.text	@ltx/en_us_holycross/oc.m1.d1:ocLI.Beatitudes1.text
ltx/en_us_holycross/oc.m1.d5:ocLI.Beatitudes2.incipit	…
ltx/en_us_holycross/oc.m1.d5:ocLI.Beatitudes2.melody	
ltx/en_us_holycross/oc.m1.d5:ocLI.Beatitudes2.mode	@ltx/en_us_holycross/miscellanea:misc.Mode1
ltx/en_us_holycross/oc.m1.d5:ocLI.Beatitudes2.text	
ltx/en_us_holycross/oc.m1.d5:ocLI.Beatitudes3.incipit	…
ltx/en_us_holycross/oc.m1.d5:ocLI.Beatitudes3.melody	
ltx/en_us_holycross/oc.m1.d5:ocLI.Beatitudes3.mode	@ltx/en_us_holycross/miscellanea:misc.Mode1
ltx/en_us_holycross/oc.m1.d5:ocLI.Beatitudes3.text	
ltx/en_us_holycross/oc.m1.d5:ocLI.Beatitudes4.incipit	…
ltx/en_us_holycross/oc.m1.d5:ocLI.Beatitudes4.melody	
ltx/en_us_holycross/oc.m1.d5:ocLI.Beatitudes4.mode	@ltx/en_us_holycross/miscellanea:misc.Mode1
ltx/en_us_holycross/oc.m1.d5:ocLI.Beatitudes4.text	
ltx/en_us_holycross/oc.m1.d5:ocLI.BeatitudesT.incipit	…
ltx/en_us_holycross/oc.m1.d5:ocLI.BeatitudesT.melody	
ltx/en_us_holycross/oc.m1.d5:ocLI.BeatitudesT.mode	@ltx/en_us_holycross/miscellanea:misc.Mode1
ltx/en_us_holycross/oc.m1.d5:ocLI.BeatitudesT.text	
ltx/en_us_holycross/oc.m1.d5:ocLI.BeatitudesTr.incipit	…
ltx/en_us_holycross/oc.m1.d5:ocLI.BeatitudesTr.melody	
ltx/en_us_holycross/oc.m1.d5:ocLI.BeatitudesTr.mode	@ltx/en_us_holycross/miscellanea:misc.Mode1
ltx/en_us_holycross/oc.m1.d5:ocLI.BeatitudesTr.text	
ltx/en_us_holycross/oc.m1.d5:ocMA.ApolTheotokion.incipit	@ltx/en_us_holycross/oc.m1.d3:ocMA.ApolTheotokion.incipit
ltx/en_us_holycross/oc.m1.d5:ocMA.ApolTheotokion.melody	
ltx/en_us_holycross/oc.m1.d5:ocMA.ApolTheotokion.mode	@ltx/en_us_holycross/miscellanea:misc.Mode1
ltx/en_us_holycross/oc.m1.d5:ocMA.ApolTheotokion.text	@ltx/en_us_holycross/oc.m1.d3:ocMA.ApolTheotokion.text
ltx/en_us_holycross/oc.m1.d5:ocMA.AposTheotokion.greekmelody	@ltx/en_us_holycross/he.a.m1:heAU.TonOuranionTagmaton.greekname
ltx/en_us_holycross/oc.m1.d5:ocMA.AposTheotokion.incipit	…
ltx/en_us_holycross/oc.m1.d5:ocMA.AposTheotokion.melody	@ltx/en_us_holycross/he.a.m1:heAU.TonOuranionTagmaton.notmetered
ltx/en_us_holycross/oc.m1.d5:ocMA.AposTheotokion.mode	@ltx/en_us_holycross/miscellanea:misc.Mode1
ltx/en_us_holycross/oc.m1.d5:ocMA.AposTheotokion.text	
ltx/en_us_holycross/oc.m1.d5:ocMA.Aposticha1.incipit	@ltx/en_us_holycross/oc.m1.d5:ocVE.Aposticha1.incipit
ltx/en_us_holycross/oc.m1.d5:ocMA.Aposticha1.melody	
ltx/en_us_holycross/oc.m1.d5:ocMA.Aposticha1.mode	@ltx/en_us_holycross/miscellanea:misc.Mode1
ltx/en_us_holycross/oc.m1.d5:ocMA.Aposticha1.text	@ltx/en_us_holycross/oc.m1.d5:ocVE.Aposticha1.text
ltx/en_us_holycross/oc.m1.d5:ocMA.Aposticha2.greekmelody	@ltx/en_us_holycross/he.a.m1:heAU.TonOuranionTagmaton.greekname
ltx/en_us_holycross/oc.m1.d5:ocMA.Aposticha2.incipit	@ltx/en_us_holycross/oc.m1.d5:ocVE.Aposticha2.incipit
ltx/en_us_holycross/oc.m1.d5:ocMA.Aposticha2.melody	@ltx/en_us_holycross/he.a.m1:heAU.TonOuranionTagmaton.notmetered
ltx/en_us_holycross/oc.m1.d5:ocMA.Aposticha2.mode	@ltx/en_us_holycross/miscellanea:misc.Mode1
ltx/en_us_holycross/oc.m1.d5:ocMA.Aposticha2.text	@ltx/en_us_holycross/oc.m1.d5:ocVE.Aposticha2.text
ltx/en_us_holycross/oc.m1.d5:ocMA.Aposticha3.incipit	…
ltx/en_us_holycross/oc.m1.d5:ocMA.Aposticha3.melody	
ltx/en_us_holycross/oc.m1.d5:ocMA.Aposticha3.mode	@ltx/en_us_holycross/miscellanea:misc.Mode1
ltx/en_us_holycross/oc.m1.d5:ocMA.Aposticha3.text	
ltx/en_us_holycross/oc.m1.d5:ocMA.C2.acrostic.notice1	
ltx/en_us_holycross/oc.m1.d5:ocMA.C2.acrostic.text	
ltx/en_us_holycross/oc.m1.d5:ocMA.C2.acrostic.title	
ltx/en_us_holycross/oc.m1.d5:ocMA.Kathisma11.incipit	…
ltx/en_us_holycross/oc.m1.d5:ocMA.Kathisma11.melody	
ltx/en_us_holycross/oc.m1.d5:ocMA.Kathisma11.mode	@ltx/en_us_holycross/miscellanea:misc.Mode1
ltx/en_us_holycross/oc.m1.d5:ocMA.Kathisma11.text	
ltx/en_us_holycross/oc.m1.d5:ocMA.Kathisma12.greekmelody	@ltx/en_us_holycross/he.a.m1:heAU.TouLithouSfragisthentos.greekname
ltx/en_us_holycross/oc.m1.d5:ocMA.Kathisma12.incipit	…
ltx/en_us_holycross/oc.m1.d5:ocMA.Kathisma12.melody	@ltx/en_us_holycross/he.a.m1:heAU.TouLithouSfragisthentos.notmetered
ltx/en_us_holycross/oc.m1.d5:ocMA.Kathisma12.mode	@ltx/en_us_holycross/miscellanea:misc.Mode1
ltx/en_us_holycross/oc.m1.d5:ocMA.Kathisma12.text	
ltx/en_us_holycross/oc.m1.d5:ocMA.Kathisma13.incipit	…
ltx/en_us_holycross/oc.m1.d5:ocMA.Kathisma13.melody	
ltx/en_us_holycross/oc.m1.d5:ocMA.Kathisma13.mode	@ltx/en_us_holycross/miscellanea:misc.Mode1
ltx/en_us_holycross/oc.m1.d5:ocMA.Kathisma13.text	
ltx/en_us_holycross/oc.m1.d5:ocMA.Kathisma21.greekmelody	@ltx/en_us_holycross/he.a.m1:heAU.TonTafonSouSotir.greekname
ltx/en_us_holycross/oc.m1.d5:ocMA.Kathisma21.incipit	…
ltx/en_us_holycross/oc.m1.d5:ocMA.Kathisma21.melody	@ltx/en_us_holycross/he.a.m1:heAU.TonTafonSouSotir.notmetered
ltx/en_us_holycross/oc.m1.d5:ocMA.Kathisma21.mode	@ltx/en_us_holycross/miscellanea:misc.Mode1
ltx/en_us_holycross/oc.m1.d5:ocMA.Kathisma21.text	
ltx/en_us_holycross/oc.m1.d5:ocMA.Kathisma22.greekmelody	@ltx/en_us_holycross/he.a.m1:heAU.TonTafonSouSotir.greekname
ltx/en_us_holycross/oc.m1.d5:ocMA.Kathisma22.incipit	…
ltx/en_us_holycross/oc.m1.d5:ocMA.Kathisma22.melody	@ltx/en_us_holycross/he.a.m1:heAU.TonTafonSouSotir.notmetered
ltx/en_us_holycross/oc.m1.d5:ocMA.Kathisma22.mode	@ltx/en_us_holycross/miscellanea:misc.Mode1
ltx/en_us_holycross/oc.m1.d5:ocMA.Kathisma22.text	
ltx/en_us_holycross/oc.m1.d5:ocMA.Kathisma23.greekmelody	@ltx/en_us_holycross/he.a.m1:heAU.TonTafonSouSotir.greekname
ltx/en_us_holycross/oc.m1.d5:ocMA.Kathisma23.incipit	…
ltx/en_us_holycross/oc.m1.d5:ocMA.Kathisma23.melody	@ltx/en_us_holycross/he.a.m1:heAU.TonTafonSouSotir.notmetered
ltx/en_us_holycross/oc.m1.d5:ocMA.Kathisma23.mode	@ltx/en_us_holycross/miscellanea:misc.Mode1
ltx/en_us_holycross/oc.m1.d5:ocMA.Kathisma23.text	
ltx/en_us_holycross/oc.m1.d5:ocMA.Kathisma31.greekmelody	@ltx/en_us_holycross/he.a.m1:heAU.TonTafonSouSotir.greekname
ltx/en_us_holycross/oc.m1.d5:ocMA.Kathisma31.incipit	…
ltx/en_us_holycross/oc.m1.d5:ocMA.Kathisma31.melody	@ltx/en_us_holycross/he.a.m1:heAU.TonTafonSouSotir.notmetered
ltx/en_us_holycross/oc.m1.d5:ocMA.Kathisma31.mode	@ltx/en_us_holycross/miscellanea:misc.Mode1
ltx/en_us_holycross/oc.m1.d5:ocMA.Kathisma31.text	
ltx/en_us_holycross/oc.m1.d5:ocMA.Kathisma32.greekmelody	@ltx/en_us_holycross/he.a.m1:heAU.TonTafonSouSotir.greekname
ltx/en_us_holycross/oc.m1.d5:ocMA.Kathisma32.incipit	…
ltx/en_us_holycross/oc.m1.d5:ocMA.Kathisma32.melody	@ltx/en_us_holycross/he.a.m1:heAU.TonTafonSouSotir.notmetered
ltx/en_us_holycross/oc.m1.d5:ocMA.Kathisma32.mode	@ltx/en_us_holycross/miscellanea:misc.Mode1
ltx/en_us_holycross/oc.m1.d5:ocMA.Kathisma32.text	
ltx/en_us_holycross/oc.m1.d5:ocMA.Kathisma33.greekmelody	@ltx/en_us_holycross/he.a.m1:heAU.TonTafonSouSotir.greekname
ltx/en_us_holycross/oc.m1.d5:ocMA.Kathisma33.incipit	…
ltx/en_us_holycross/oc.m1.d5:ocMA.Kathisma33.melody	@ltx/en_us_holycross/he.a.m1:heAU.TonTafonSouSotir.notmetered
ltx/en_us_holycross/oc.m1.d5:ocMA.Kathisma33.mode	@ltx/en_us_holycross/miscellanea:misc.Mode1
ltx/en_us_holycross/oc.m1.d5:ocMA.Kathisma33.text	
ltx/en_us_holycross/oc.m1.d5:ocMA.OdeW1C11.incipit	…
ltx/en_us_holycross/oc.m1.d5:ocMA.OdeW1C11.melody	@ltx/en_us_holycross/he.h.m1:heHE.SouITropaiouchos.notmetered
ltx/en_us_holycross/oc.m1.d5:ocMA.OdeW1C11.mode	@ltx/en_us_holycross/miscellanea:misc.Mode1
ltx/en_us_holycross/oc.m1.d5:ocMA.OdeW1C11.ode	@ltx/en_us_holycross/miscellanea:misc.Ode1
ltx/en_us_holycross/oc.m1.d5:ocMA.OdeW1C11.text	
ltx/en_us_holycross/oc.m1.d5:ocMA.OdeW1C12.incipit	…
ltx/en_us_holycross/oc.m1.d5:ocMA.OdeW1C12.melody	@ltx/en_us_holycross/he.h.m1:heHE.SouITropaiouchos.notmetered
ltx/en_us_holycross/oc.m1.d5:ocMA.OdeW1C12.mode	@ltx/en_us_holycross/miscellanea:misc.Mode1
ltx/en_us_holycross/oc.m1.d5:ocMA.OdeW1C12.ode	@ltx/en_us_holycross/miscellanea:misc.Ode1
ltx/en_us_holycross/oc.m1.d5:ocMA.OdeW1C12.text	
ltx/en_us_holycross/oc.m1.d5:ocMA.OdeW1C13.incipit	…
ltx/en_us_holycross/oc.m1.d5:ocMA.OdeW1C13.melody	@ltx/en_us_holycross/he.h.m1:heHE.SouITropaiouchos.notmetered
ltx/en_us_holycross/oc.m1.d5:ocMA.OdeW1C13.mode	@ltx/en_us_holycross/miscellanea:misc.Mode1
ltx/en_us_holycross/oc.m1.d5:ocMA.OdeW1C13.ode	@ltx/en_us_holycross/miscellanea:misc.Ode1
ltx/en_us_holycross/oc.m1.d5:ocMA.OdeW1C13.text	
ltx/en_us_holycross/oc.m1.d5:ocMA.OdeW1C1H.greekmelody	@ltx/en_us_holycross/he.h.m1:heHE.SouITropaiouchos.greekname
ltx/en_us_holycross/oc.m1.d5:ocMA.OdeW1C1H.incipit	@ltx/en_us_holycross/he.h.m1:heHE.SouITropaiouchos.incipit
ltx/en_us_holycross/oc.m1.d5:ocMA.OdeW1C1H.melody	@ltx/en_us_holycross/he.h.m1:heHE.SouITropaiouchos.melody
ltx/en_us_holycross/oc.m1.d5:ocMA.OdeW1C1H.mode	@ltx/en_us_holycross/miscellanea:misc.Mode1
ltx/en_us_holycross/oc.m1.d5:ocMA.OdeW1C1H.ode	@ltx/en_us_holycross/miscellanea:misc.Ode2
ltx/en_us_holycross/oc.m1.d5:ocMA.OdeW1C1H.text	@ltx/en_us_holycross/he.h.m1:heHE.SouITropaiouchos.text
ltx/en_us_holycross/oc.m1.d5:ocMA.OdeW1C1T.incipit	…
ltx/en_us_holycross/oc.m1.d5:ocMA.OdeW1C1T.melody	@ltx/en_us_holycross/he.h.m1:heHE.SouITropaiouchos.notmetered
ltx/en_us_holycross/oc.m1.d5:ocMA.OdeW1C1T.mode	@ltx/en_us_holycross/miscellanea:misc.Mode1
ltx/en_us_holycross/oc.m1.d5:ocMA.OdeW1C1T.ode	@ltx/en_us_holycross/miscellanea:misc.Ode1
ltx/en_us_holycross/oc.m1.d5:ocMA.OdeW1C1T.text	
ltx/en_us_holycross/oc.m1.d5:ocMA.OdeW1C21.greekmelody	@ltx/en_us_holycross/he.h.m1:heHE.OdinEpinikion.greekname
ltx/en_us_holycross/oc.m1.d5:ocMA.OdeW1C21.incipit	…
ltx/en_us_holycross/oc.m1.d5:ocMA.OdeW1C21.melody	@ltx/en_us_holycross/he.h.m1:heHE.OdinEpinikion.notmetered
ltx/en_us_holycross/oc.m1.d5:ocMA.OdeW1C21.mode	@ltx/en_us_holycross/miscellanea:misc.Mode1
ltx/en_us_holycross/oc.m1.d5:ocMA.OdeW1C21.ode	@ltx/en_us_holycross/miscellanea:misc.Ode1
ltx/en_us_holycross/oc.m1.d5:ocMA.OdeW1C21.text	
ltx/en_us_holycross/oc.m1.d5:ocMA.OdeW1C22.incipit	…
ltx/en_us_holycross/oc.m1.d5:ocMA.OdeW1C22.melody	@ltx/en_us_holycross/he.h.m1:heHE.OdinEpinikion.notmetered
ltx/en_us_holycross/oc.m1.d5:ocMA.OdeW1C22.mode	@ltx/en_us_holycross/miscellanea:misc.Mode1
ltx/en_us_holycross/oc.m1.d5:ocMA.OdeW1C22.ode	@ltx/en_us_holycross/miscellanea:misc.Ode1
ltx/en_us_holycross/oc.m1.d5:ocMA.OdeW1C22.text	
ltx/en_us_holycross/oc.m1.d5:ocMA.OdeW1C23.incipit	…
ltx/en_us_holycross/oc.m1.d5:ocMA.OdeW1C23.melody	@ltx/en_us_holycross/he.h.m1:heHE.OdinEpinikion.notmetered
ltx/en_us_holycross/oc.m1.d5:ocMA.OdeW1C23.mode	@ltx/en_us_holycross/miscellanea:misc.Mode1
ltx/en_us_holycross/oc.m1.d5:ocMA.OdeW1C23.ode	@ltx/en_us_holycross/miscellanea:misc.Ode1
ltx/en_us_holycross/oc.m1.d5:ocMA.OdeW1C23.text	
ltx/en_us_holycross/oc.m1.d5:ocMA.OdeW1C2T.incipit	…
ltx/en_us_holycross/oc.m1.d5:ocMA.OdeW1C2T.melody	@ltx/en_us_holycross/he.h.m1:heHE.OdinEpinikion.notmetered
ltx/en_us_holycross/oc.m1.d5:ocMA.OdeW1C2T.mode	@ltx/en_us_holycross/miscellanea:misc.Mode1
ltx/en_us_holycross/oc.m1.d5:ocMA.OdeW1C2T.ode	@ltx/en_us_holycross/miscellanea:misc.Ode1
ltx/en_us_holycross/oc.m1.d5:ocMA.OdeW1C2T.text	
ltx/en_us_holycross/oc.m1.d5:ocMA.OdeW3C11.incipit	…
ltx/en_us_holycross/oc.m1.d5:ocMA.OdeW3C11.melody	@ltx/en_us_holycross/he.h.m1:heHE.OMonosEidos.notmetered
ltx/en_us_holycross/oc.m1.d5:ocMA.OdeW3C11.mode	@ltx/en_us_holycross/miscellanea:misc.Mode1
ltx/en_us_holycross/oc.m1.d5:ocMA.OdeW3C11.ode	@ltx/en_us_holycross/miscellanea:misc.Ode3
ltx/en_us_holycross/oc.m1.d5:ocMA.OdeW3C11.text	
ltx/en_us_holycross/oc.m1.d5:ocMA.OdeW3C12.incipit	…
ltx/en_us_holycross/oc.m1.d5:ocMA.OdeW3C12.melody	@ltx/en_us_holycross/he.h.m1:heHE.OMonosEidos.notmetered
ltx/en_us_holycross/oc.m1.d5:ocMA.OdeW3C12.mode	@ltx/en_us_holycross/miscellanea:misc.Mode1
ltx/en_us_holycross/oc.m1.d5:ocMA.OdeW3C12.ode	@ltx/en_us_holycross/miscellanea:misc.Ode3
ltx/en_us_holycross/oc.m1.d5:ocMA.OdeW3C12.text	
ltx/en_us_holycross/oc.m1.d5:ocMA.OdeW3C13.incipit	…
ltx/en_us_holycross/oc.m1.d5:ocMA.OdeW3C13.melody	@ltx/en_us_holycross/he.h.m1:heHE.OMonosEidos.notmetered
ltx/en_us_holycross/oc.m1.d5:ocMA.OdeW3C13.mode	@ltx/en_us_holycross/miscellanea:misc.Mode1
ltx/en_us_holycross/oc.m1.d5:ocMA.OdeW3C13.ode	@ltx/en_us_holycross/miscellanea:misc.Ode3
ltx/en_us_holycross/oc.m1.d5:ocMA.OdeW3C13.text	
ltx/en_us_holycross/oc.m1.d5:ocMA.OdeW3C1H.greekmelody	@ltx/en_us_holycross/he.h.m1:heHE.OMonosEidos.greekname
ltx/en_us_holycross/oc.m1.d5:ocMA.OdeW3C1H.incipit	@ltx/en_us_holycross/he.h.m1:heHE.OMonosEidos.incipit
ltx/en_us_holycross/oc.m1.d5:ocMA.OdeW3C1H.melody	@ltx/en_us_holycross/he.h.m1:heHE.OMonosEidos.melody
ltx/en_us_holycross/oc.m1.d5:ocMA.OdeW3C1H.mode	@ltx/en_us_holycross/miscellanea:misc.Mode1
ltx/en_us_holycross/oc.m1.d5:ocMA.OdeW3C1H.ode	@ltx/en_us_holycross/miscellanea:misc.Ode3
ltx/en_us_holycross/oc.m1.d5:ocMA.OdeW3C1H.text	@ltx/en_us_holycross/he.h.m1:heHE.OMonosEidos.text
ltx/en_us_holycross/oc.m1.d5:ocMA.OdeW3C1T.incipit	…
ltx/en_us_holycross/oc.m1.d5:ocMA.OdeW3C1T.melody	@ltx/en_us_holycross/he.h.m1:heHE.OMonosEidos.notmetered
ltx/en_us_holycross/oc.m1.d5:ocMA.OdeW3C1T.mode	@ltx/en_us_holycross/miscellanea:misc.Mode1
ltx/en_us_holycross/oc.m1.d5:ocMA.OdeW3C1T.ode	@ltx/en_us_holycross/miscellanea:misc.Ode3
ltx/en_us_holycross/oc.m1.d5:ocMA.OdeW3C1T.text	
ltx/en_us_holycross/oc.m1.d5:ocMA.OdeW3C21.greekmelody	@ltx/en_us_holycross/he.h.m1:heHE.StereothitoIKardiaMou.greekname
ltx/en_us_holycross/oc.m1.d5:ocMA.OdeW3C21.incipit	…
ltx/en_us_holycross/oc.m1.d5:ocMA.OdeW3C21.melody	@ltx/en_us_holycross/he.h.m1:heHE.StereothitoIKardiaMou.notmetered
ltx/en_us_holycross/oc.m1.d5:ocMA.OdeW3C21.mode	@ltx/en_us_holycross/miscellanea:misc.Mode1
ltx/en_us_holycross/oc.m1.d5:ocMA.OdeW3C21.ode	@ltx/en_us_holycross/miscellanea:misc.Ode3
ltx/en_us_holycross/oc.m1.d5:ocMA.OdeW3C21.text	
ltx/en_us_holycross/oc.m1.d5:ocMA.OdeW3C22.incipit	…
ltx/en_us_holycross/oc.m1.d5:ocMA.OdeW3C22.melody	@ltx/en_us_holycross/he.h.m1:heHE.StereothitoIKardiaMou.notmetered
ltx/en_us_holycross/oc.m1.d5:ocMA.OdeW3C22.mode	@ltx/en_us_holycross/miscellanea:misc.Mode1
ltx/en_us_holycross/oc.m1.d5:ocMA.OdeW3C22.ode	@ltx/en_us_holycross/miscellanea:misc.Ode3
ltx/en_us_holycross/oc.m1.d5:ocMA.OdeW3C22.text	
ltx/en_us_holycross/oc.m1.d5:ocMA.OdeW3C23.incipit	…
ltx/en_us_holycross/oc.m1.d5:ocMA.OdeW3C23.melody	@ltx/en_us_holycross/he.h.m1:heHE.StereothitoIKardiaMou.notmetered
ltx/en_us_holycross/oc.m1.d5:ocMA.OdeW3C23.mode	@ltx/en_us_holycross/miscellanea:misc.Mode1
ltx/en_us_holycross/oc.m1.d5:ocMA.OdeW3C23.ode	@ltx/en_us_holycross/miscellanea:misc.Ode3
ltx/en_us_holycross/oc.m1.d5:ocMA.OdeW3C23.text	
ltx/en_us_holycross/oc.m1.d5:ocMA.OdeW3C2T.incipit	…
ltx/en_us_holycross/oc.m1.d5:ocMA.OdeW3C2T.melody	@ltx/en_us_holycross/he.h.m1:heHE.StereothitoIKardiaMou.notmetered
ltx/en_us_holycross/oc.m1.d5:ocMA.OdeW3C2T.mode	@ltx/en_us_holycross/miscellanea:misc.Mode1
ltx/en_us_holycross/oc.m1.d5:ocMA.OdeW3C2T.ode	@ltx/en_us_holycross/miscellanea:misc.Ode3
ltx/en_us_holycross/oc.m1.d5:ocMA.OdeW3C2T.text	
ltx/en_us_holycross/oc.m1.d5:ocMA.OdeW4C11.incipit	…
ltx/en_us_holycross/oc.m1.d5:ocMA.OdeW4C11.melody	@ltx/en_us_holycross/he.h.m1:heHE.OrosSeTiChariti.notmetered
ltx/en_us_holycross/oc.m1.d5:ocMA.OdeW4C11.mode	@ltx/en_us_holycross/miscellanea:misc.Mode1
ltx/en_us_holycross/oc.m1.d5:ocMA.OdeW4C11.ode	@ltx/en_us_holycross/miscellanea:misc.Ode4
ltx/en_us_holycross/oc.m1.d5:ocMA.OdeW4C11.text	
ltx/en_us_holycross/oc.m1.d5:ocMA.OdeW4C12.incipit	…
ltx/en_us_holycross/oc.m1.d5:ocMA.OdeW4C12.melody	@ltx/en_us_holycross/he.h.m1:heHE.OrosSeTiChariti.notmetered
ltx/en_us_holycross/oc.m1.d5:ocMA.OdeW4C12.mode	@ltx/en_us_holycross/miscellanea:misc.Mode1
ltx/en_us_holycross/oc.m1.d5:ocMA.OdeW4C12.ode	@ltx/en_us_holycross/miscellanea:misc.Ode4
ltx/en_us_holycross/oc.m1.d5:ocMA.OdeW4C12.text	
ltx/en_us_holycross/oc.m1.d5:ocMA.OdeW4C13.incipit	…
ltx/en_us_holycross/oc.m1.d5:ocMA.OdeW4C13.melody	@ltx/en_us_holycross/he.h.m1:heHE.OrosSeTiChariti.notmetered
ltx/en_us_holycross/oc.m1.d5:ocMA.OdeW4C13.mode	@ltx/en_us_holycross/miscellanea:misc.Mode1
ltx/en_us_holycross/oc.m1.d5:ocMA.OdeW4C13.ode	@ltx/en_us_holycross/miscellanea:misc.Ode4
ltx/en_us_holycross/oc.m1.d5:ocMA.OdeW4C13.text	
ltx/en_us_holycross/oc.m1.d5:ocMA.OdeW4C1H.greekmelody	@ltx/en_us_holycross/he.h.m1:heHE.OrosSeTiChariti.greekname
ltx/en_us_holycross/oc.m1.d5:ocMA.OdeW4C1H.incipit	@ltx/en_us_holycross/he.h.m1:heHE.OrosSeTiChariti.incipit
ltx/en_us_holycross/oc.m1.d5:ocMA.OdeW4C1H.melody	@ltx/en_us_holycross/he.h.m1:heHE.OrosSeTiChariti.melody
ltx/en_us_holycross/oc.m1.d5:ocMA.OdeW4C1H.mode	@ltx/en_us_holycross/miscellanea:misc.Mode1
ltx/en_us_holycross/oc.m1.d5:ocMA.OdeW4C1H.ode	@ltx/en_us_holycross/miscellanea:misc.Ode4
ltx/en_us_holycross/oc.m1.d5:ocMA.OdeW4C1H.text	@ltx/en_us_holycross/he.h.m1:heHE.OrosSeTiChariti.text
ltx/en_us_holycross/oc.m1.d5:ocMA.OdeW4C1T.incipit	…
ltx/en_us_holycross/oc.m1.d5:ocMA.OdeW4C1T.melody	@ltx/en_us_holycross/he.h.m1:heHE.OrosSeTiChariti.notmetered
ltx/en_us_holycross/oc.m1.d5:ocMA.OdeW4C1T.mode	@ltx/en_us_holycross/miscellanea:misc.Mode1
ltx/en_us_holycross/oc.m1.d5:ocMA.OdeW4C1T.ode	@ltx/en_us_holycross/miscellanea:misc.Ode4
ltx/en_us_holycross/oc.m1.d5:ocMA.OdeW4C1T.text	
ltx/en_us_holycross/oc.m1.d5:ocMA.OdeW4C21.greekmelody	@ltx/en_us_holycross/he.h.m1:heHE.EnPnevmatiProvlepon.greekname
ltx/en_us_holycross/oc.m1.d5:ocMA.OdeW4C21.incipit	…
ltx/en_us_holycross/oc.m1.d5:ocMA.OdeW4C21.melody	@ltx/en_us_holycross/he.h.m1:heHE.EnPnevmatiProvlepon.notmetered
ltx/en_us_holycross/oc.m1.d5:ocMA.OdeW4C21.mode	@ltx/en_us_holycross/miscellanea:misc.Mode1
ltx/en_us_holycross/oc.m1.d5:ocMA.OdeW4C21.ode	@ltx/en_us_holycross/miscellanea:misc.Ode4
ltx/en_us_holycross/oc.m1.d5:ocMA.OdeW4C21.text	
ltx/en_us_holycross/oc.m1.d5:ocMA.OdeW4C22.incipit	…
ltx/en_us_holycross/oc.m1.d5:ocMA.OdeW4C22.melody	@ltx/en_us_holycross/he.h.m1:heHE.EnPnevmatiProvlepon.notmetered
ltx/en_us_holycross/oc.m1.d5:ocMA.OdeW4C22.mode	@ltx/en_us_holycross/miscellanea:misc.Mode1
ltx/en_us_holycross/oc.m1.d5:ocMA.OdeW4C22.ode	@ltx/en_us_holycross/miscellanea:misc.Ode4
ltx/en_us_holycross/oc.m1.d5:ocMA.OdeW4C22.text	
ltx/en_us_holycross/oc.m1.d5:ocMA.OdeW4C23.incipit	…
ltx/en_us_holycross/oc.m1.d5:ocMA.OdeW4C23.melody	@ltx/en_us_holycross/he.h.m1:heHE.EnPnevmatiProvlepon.notmetered
ltx/en_us_holycross/oc.m1.d5:ocMA.OdeW4C23.mode	@ltx/en_us_holycross/miscellanea:misc.Mode1
ltx/en_us_holycross/oc.m1.d5:ocMA.OdeW4C23.ode	@ltx/en_us_holycross/miscellanea:misc.Ode4
ltx/en_us_holycross/oc.m1.d5:ocMA.OdeW4C23.text	
ltx/en_us_holycross/oc.m1.d5:ocMA.OdeW4C2T.incipit	…
ltx/en_us_holycross/oc.m1.d5:ocMA.OdeW4C2T.melody	@ltx/en_us_holycross/he.h.m1:heHE.EnPnevmatiProvlepon.notmetered
ltx/en_us_holycross/oc.m1.d5:ocMA.OdeW4C2T.mode	@ltx/en_us_holycross/miscellanea:misc.Mode1
ltx/en_us_holycross/oc.m1.d5:ocMA.OdeW4C2T.ode	@ltx/en_us_holycross/miscellanea:misc.Ode4
ltx/en_us_holycross/oc.m1.d5:ocMA.OdeW4C2T.text	
ltx/en_us_holycross/oc.m1.d5:ocMA.OdeW5C11.incipit	…
ltx/en_us_holycross/oc.m1.d5:ocMA.OdeW5C11.melody	@ltx/en_us_holycross/he.h.m1:heHE.OFotisasTiEllampsei.notmetered
ltx/en_us_holycross/oc.m1.d5:ocMA.OdeW5C11.mode	@ltx/en_us_holycross/miscellanea:misc.Mode1
ltx/en_us_holycross/oc.m1.d5:ocMA.OdeW5C11.ode	@ltx/en_us_holycross/miscellanea:misc.Ode5
ltx/en_us_holycross/oc.m1.d5:ocMA.OdeW5C11.text	
ltx/en_us_holycross/oc.m1.d5:ocMA.OdeW5C12.incipit	…
ltx/en_us_holycross/oc.m1.d5:ocMA.OdeW5C12.melody	@ltx/en_us_holycross/he.h.m1:heHE.OFotisasTiEllampsei.notmetered
ltx/en_us_holycross/oc.m1.d5:ocMA.OdeW5C12.mode	@ltx/en_us_holycross/miscellanea:misc.Mode1
ltx/en_us_holycross/oc.m1.d5:ocMA.OdeW5C12.ode	@ltx/en_us_holycross/miscellanea:misc.Ode5
ltx/en_us_holycross/oc.m1.d5:ocMA.OdeW5C12.text	
ltx/en_us_holycross/oc.m1.d5:ocMA.OdeW5C13.incipit	…
ltx/en_us_holycross/oc.m1.d5:ocMA.OdeW5C13.melody	@ltx/en_us_holycross/he.h.m1:heHE.OFotisasTiEllampsei.notmetered
ltx/en_us_holycross/oc.m1.d5:ocMA.OdeW5C13.mode	@ltx/en_us_holycross/miscellanea:misc.Mode1
ltx/en_us_holycross/oc.m1.d5:ocMA.OdeW5C13.ode	@ltx/en_us_holycross/miscellanea:misc.Ode5
ltx/en_us_holycross/oc.m1.d5:ocMA.OdeW5C13.text	
ltx/en_us_holycross/oc.m1.d5:ocMA.OdeW5C1H.greekmelody	@ltx/en_us_holycross/he.h.m1:heHE.OFotisasTiEllampsei.greekname
ltx/en_us_holycross/oc.m1.d5:ocMA.OdeW5C1H.incipit	@ltx/en_us_holycross/he.h.m1:heHE.OFotisasTiEllampsei.incipit
ltx/en_us_holycross/oc.m1.d5:ocMA.OdeW5C1H.melody	@ltx/en_us_holycross/he.h.m1:heHE.OFotisasTiEllampsei.melody
ltx/en_us_holycross/oc.m1.d5:ocMA.OdeW5C1H.mode	@ltx/en_us_holycross/miscellanea:misc.Mode1
ltx/en_us_holycross/oc.m1.d5:ocMA.OdeW5C1H.ode	@ltx/en_us_holycross/miscellanea:misc.Ode5
ltx/en_us_holycross/oc.m1.d5:ocMA.OdeW5C1H.text	@ltx/en_us_holycross/he.h.m1:heHE.OFotisasTiEllampsei.text
ltx/en_us_holycross/oc.m1.d5:ocMA.OdeW5C1T.incipit	…
ltx/en_us_holycross/oc.m1.d5:ocMA.OdeW5C1T.melody	@ltx/en_us_holycross/he.h.m1:heHE.OFotisasTiEllampsei.notmetered
ltx/en_us_holycross/oc.m1.d5:ocMA.OdeW5C1T.mode	@ltx/en_us_holycross/miscellanea:misc.Mode1
ltx/en_us_holycross/oc.m1.d5:ocMA.OdeW5C1T.ode	@ltx/en_us_holycross/miscellanea:misc.Ode5
ltx/en_us_holycross/oc.m1.d5:ocMA.OdeW5C1T.text	
ltx/en_us_holycross/oc.m1.d5:ocMA.OdeW5C21.greekmelody	@ltx/en_us_holycross/he.h.m1:heHE.ToFaeinonIminExanateilon.greekname
ltx/en_us_holycross/oc.m1.d5:ocMA.OdeW5C21.incipit	…
ltx/en_us_holycross/oc.m1.d5:ocMA.OdeW5C21.melody	@ltx/en_us_holycross/he.h.m1:heHE.ToFaeinonIminExanateilon.notmetered
ltx/en_us_holycross/oc.m1.d5:ocMA.OdeW5C21.mode	@ltx/en_us_holycross/miscellanea:misc.Mode1
ltx/en_us_holycross/oc.m1.d5:ocMA.OdeW5C21.ode	@ltx/en_us_holycross/miscellanea:misc.Ode5
ltx/en_us_holycross/oc.m1.d5:ocMA.OdeW5C21.text	
ltx/en_us_holycross/oc.m1.d5:ocMA.OdeW5C22.incipit	…
ltx/en_us_holycross/oc.m1.d5:ocMA.OdeW5C22.melody	@ltx/en_us_holycross/he.h.m1:heHE.ToFaeinonIminExanateilon.notmetered
ltx/en_us_holycross/oc.m1.d5:ocMA.OdeW5C22.mode	@ltx/en_us_holycross/miscellanea:misc.Mode1
ltx/en_us_holycross/oc.m1.d5:ocMA.OdeW5C22.ode	@ltx/en_us_holycross/miscellanea:misc.Ode5
ltx/en_us_holycross/oc.m1.d5:ocMA.OdeW5C22.text	
ltx/en_us_holycross/oc.m1.d5:ocMA.OdeW5C23.incipit	…
ltx/en_us_holycross/oc.m1.d5:ocMA.OdeW5C23.melody	@ltx/en_us_holycross/he.h.m1:heHE.ToFaeinonIminExanateilon.notmetered
ltx/en_us_holycross/oc.m1.d5:ocMA.OdeW5C23.mode	@ltx/en_us_holycross/miscellanea:misc.Mode1
ltx/en_us_holycross/oc.m1.d5:ocMA.OdeW5C23.ode	@ltx/en_us_holycross/miscellanea:misc.Ode5
ltx/en_us_holycross/oc.m1.d5:ocMA.OdeW5C23.text	
ltx/en_us_holycross/oc.m1.d5:ocMA.OdeW5C2T.incipit	…
ltx/en_us_holycross/oc.m1.d5:ocMA.OdeW5C2T.melody	@ltx/en_us_holycross/he.h.m1:heHE.ToFaeinonIminExanateilon.notmetered
ltx/en_us_holycross/oc.m1.d5:ocMA.OdeW5C2T.mode	@ltx/en_us_holycross/miscellanea:misc.Mode1
ltx/en_us_holycross/oc.m1.d5:ocMA.OdeW5C2T.ode	@ltx/en_us_holycross/miscellanea:misc.Ode5
ltx/en_us_holycross/oc.m1.d5:ocMA.OdeW5C2T.text	
ltx/en_us_holycross/oc.m1.d5:ocMA.OdeW6C11.incipit	…
ltx/en_us_holycross/oc.m1.d5:ocMA.OdeW6C11.melody	@ltx/en_us_holycross/he.h.m1:heHE.EkyklosenImas.notmetered
ltx/en_us_holycross/oc.m1.d5:ocMA.OdeW6C11.mode	@ltx/en_us_holycross/miscellanea:misc.Mode1
ltx/en_us_holycross/oc.m1.d5:ocMA.OdeW6C11.ode	@ltx/en_us_holycross/miscellanea:misc.Ode6
ltx/en_us_holycross/oc.m1.d5:ocMA.OdeW6C11.text	
ltx/en_us_holycross/oc.m1.d5:ocMA.OdeW6C12.incipit	…
ltx/en_us_holycross/oc.m1.d5:ocMA.OdeW6C12.melody	@ltx/en_us_holycross/he.h.m1:heHE.EkyklosenImas.notmetered
ltx/en_us_holycross/oc.m1.d5:ocMA.OdeW6C12.mode	@ltx/en_us_holycross/miscellanea:misc.Mode1
ltx/en_us_holycross/oc.m1.d5:ocMA.OdeW6C12.ode	@ltx/en_us_holycross/miscellanea:misc.Ode6
ltx/en_us_holycross/oc.m1.d5:ocMA.OdeW6C12.text	
ltx/en_us_holycross/oc.m1.d5:ocMA.OdeW6C13.incipit	…
ltx/en_us_holycross/oc.m1.d5:ocMA.OdeW6C13.melody	@ltx/en_us_holycross/he.h.m1:heHE.EkyklosenImas.notmetered
ltx/en_us_holycross/oc.m1.d5:ocMA.OdeW6C13.mode	@ltx/en_us_holycross/miscellanea:misc.Mode1
ltx/en_us_holycross/oc.m1.d5:ocMA.OdeW6C13.ode	@ltx/en_us_holycross/miscellanea:misc.Ode6
ltx/en_us_holycross/oc.m1.d5:ocMA.OdeW6C13.text	
ltx/en_us_holycross/oc.m1.d5:ocMA.OdeW6C1H.greekmelody	@ltx/en_us_holycross/he.h.m1:heHE.EkyklosenImas.greekname
ltx/en_us_holycross/oc.m1.d5:ocMA.OdeW6C1H.incipit	@ltx/en_us_holycross/he.h.m1:heHE.EkyklosenImas.incipit
ltx/en_us_holycross/oc.m1.d5:ocMA.OdeW6C1H.melody	@ltx/en_us_holycross/he.h.m1:heHE.EkyklosenImas.melody
ltx/en_us_holycross/oc.m1.d5:ocMA.OdeW6C1H.mode	@ltx/en_us_holycross/miscellanea:misc.Mode1
ltx/en_us_holycross/oc.m1.d5:ocMA.OdeW6C1H.ode	@ltx/en_us_holycross/miscellanea:misc.Ode6
ltx/en_us_holycross/oc.m1.d5:ocMA.OdeW6C1H.text	@ltx/en_us_holycross/he.h.m1:heHE.EkyklosenImas.text
ltx/en_us_holycross/oc.m1.d5:ocMA.OdeW6C1T.incipit	…
ltx/en_us_holycross/oc.m1.d5:ocMA.OdeW6C1T.melody	@ltx/en_us_holycross/he.h.m1:heHE.EkyklosenImas.notmetered
ltx/en_us_holycross/oc.m1.d5:ocMA.OdeW6C1T.mode	@ltx/en_us_holycross/miscellanea:misc.Mode1
ltx/en_us_holycross/oc.m1.d5:ocMA.OdeW6C1T.ode	@ltx/en_us_holycross/miscellanea:misc.Ode6
ltx/en_us_holycross/oc.m1.d5:ocMA.OdeW6C1T.text	
ltx/en_us_holycross/oc.m1.d5:ocMA.OdeW6C21.greekmelody	@ltx/en_us_holycross/he.h.m1:heHE.TonProfitinIonan.greekname
ltx/en_us_holycross/oc.m1.d5:ocMA.OdeW6C21.incipit	…
ltx/en_us_holycross/oc.m1.d5:ocMA.OdeW6C21.melody	@ltx/en_us_holycross/he.h.m1:heHE.TonProfitinIonan.notmetered
ltx/en_us_holycross/oc.m1.d5:ocMA.OdeW6C21.mode	@ltx/en_us_holycross/miscellanea:misc.Mode1
ltx/en_us_holycross/oc.m1.d5:ocMA.OdeW6C21.ode	@ltx/en_us_holycross/miscellanea:misc.Ode6
ltx/en_us_holycross/oc.m1.d5:ocMA.OdeW6C21.text	
ltx/en_us_holycross/oc.m1.d5:ocMA.OdeW6C22.incipit	…
ltx/en_us_holycross/oc.m1.d5:ocMA.OdeW6C22.melody	@ltx/en_us_holycross/he.h.m1:heHE.TonProfitinIonan.notmetered
ltx/en_us_holycross/oc.m1.d5:ocMA.OdeW6C22.mode	@ltx/en_us_holycross/miscellanea:misc.Mode1
ltx/en_us_holycross/oc.m1.d5:ocMA.OdeW6C22.ode	@ltx/en_us_holycross/miscellanea:misc.Ode6
ltx/en_us_holycross/oc.m1.d5:ocMA.OdeW6C22.text	
ltx/en_us_holycross/oc.m1.d5:ocMA.OdeW6C23.incipit	…
ltx/en_us_holycross/oc.m1.d5:ocMA.OdeW6C23.melody	@ltx/en_us_holycross/he.h.m1:heHE.TonProfitinIonan.notmetered
ltx/en_us_holycross/oc.m1.d5:ocMA.OdeW6C23.mode	@ltx/en_us_holycross/miscellanea:misc.Mode1
ltx/en_us_holycross/oc.m1.d5:ocMA.OdeW6C23.ode	@ltx/en_us_holycross/miscellanea:misc.Ode6
ltx/en_us_holycross/oc.m1.d5:ocMA.OdeW6C23.text	
ltx/en_us_holycross/oc.m1.d5:ocMA.OdeW6C2T.incipit	…
ltx/en_us_holycross/oc.m1.d5:ocMA.OdeW6C2T.melody	@ltx/en_us_holycross/he.h.m1:heHE.TonProfitinIonan.notmetered
ltx/en_us_holycross/oc.m1.d5:ocMA.OdeW6C2T.mode	@ltx/en_us_holycross/miscellanea:misc.Mode1
ltx/en_us_holycross/oc.m1.d5:ocMA.OdeW6C2T.ode	@ltx/en_us_holycross/miscellanea:misc.Ode6
ltx/en_us_holycross/oc.m1.d5:ocMA.OdeW6C2T.text	
ltx/en_us_holycross/oc.m1.d5:ocMA.OdeW7C11.incipit	…
ltx/en_us_holycross/oc.m1.d5:ocMA.OdeW7C11.melody	@ltx/en_us_holycross/he.h.m1:heHE.SeNoitin.notmetered
ltx/en_us_holycross/oc.m1.d5:ocMA.OdeW7C11.mode	@ltx/en_us_holycross/miscellanea:misc.Mode1
ltx/en_us_holycross/oc.m1.d5:ocMA.OdeW7C11.ode	@ltx/en_us_holycross/miscellanea:misc.Ode7
ltx/en_us_holycross/oc.m1.d5:ocMA.OdeW7C11.text	
ltx/en_us_holycross/oc.m1.d5:ocMA.OdeW7C12.incipit	…
ltx/en_us_holycross/oc.m1.d5:ocMA.OdeW7C12.melody	@ltx/en_us_holycross/he.h.m1:heHE.SeNoitin.notmetered
ltx/en_us_holycross/oc.m1.d5:ocMA.OdeW7C12.mode	@ltx/en_us_holycross/miscellanea:misc.Mode1
ltx/en_us_holycross/oc.m1.d5:ocMA.OdeW7C12.ode	@ltx/en_us_holycross/miscellanea:misc.Ode7
ltx/en_us_holycross/oc.m1.d5:ocMA.OdeW7C12.text	
ltx/en_us_holycross/oc.m1.d5:ocMA.OdeW7C13.incipit	…
ltx/en_us_holycross/oc.m1.d5:ocMA.OdeW7C13.melody	@ltx/en_us_holycross/he.h.m1:heHE.SeNoitin.notmetered
ltx/en_us_holycross/oc.m1.d5:ocMA.OdeW7C13.mode	@ltx/en_us_holycross/miscellanea:misc.Mode1
ltx/en_us_holycross/oc.m1.d5:ocMA.OdeW7C13.ode	@ltx/en_us_holycross/miscellanea:misc.Ode7
ltx/en_us_holycross/oc.m1.d5:ocMA.OdeW7C13.text	
ltx/en_us_holycross/oc.m1.d5:ocMA.OdeW7C1H.greekmelody	@ltx/en_us_holycross/he.h.m1:heHE.SeNoitin.greekname
ltx/en_us_holycross/oc.m1.d5:ocMA.OdeW7C1H.incipit	@ltx/en_us_holycross/he.h.m1:heHE.SeNoitin.incipit
ltx/en_us_holycross/oc.m1.d5:ocMA.OdeW7C1H.melody	@ltx/en_us_holycross/he.h.m1:heHE.SeNoitin.melody
ltx/en_us_holycross/oc.m1.d5:ocMA.OdeW7C1H.mode	@ltx/en_us_holycross/miscellanea:misc.Mode1
ltx/en_us_holycross/oc.m1.d5:ocMA.OdeW7C1H.ode	@ltx/en_us_holycross/miscellanea:misc.Ode7
ltx/en_us_holycross/oc.m1.d5:ocMA.OdeW7C1H.text	@ltx/en_us_holycross/he.h.m1:heHE.SeNoitin.text
ltx/en_us_holycross/oc.m1.d5:ocMA.OdeW7C1T.incipit	…
ltx/en_us_holycross/oc.m1.d5:ocMA.OdeW7C1T.melody	@ltx/en_us_holycross/he.h.m1:heHE.SeNoitin.notmetered
ltx/en_us_holycross/oc.m1.d5:ocMA.OdeW7C1T.mode	@ltx/en_us_holycross/miscellanea:misc.Mode1
ltx/en_us_holycross/oc.m1.d5:ocMA.OdeW7C1T.ode	@ltx/en_us_holycross/miscellanea:misc.Ode7
ltx/en_us_holycross/oc.m1.d5:ocMA.OdeW7C1T.text	
ltx/en_us_holycross/oc.m1.d5:ocMA.OdeW7C21.greekmelody	@ltx/en_us_holycross/he.h.m1:heHE.TousEnKaminoPaidas.greekname
ltx/en_us_holycross/oc.m1.d5:ocMA.OdeW7C21.incipit	…
ltx/en_us_holycross/oc.m1.d5:ocMA.OdeW7C21.melody	@ltx/en_us_holycross/he.h.m1:heHE.TousEnKaminoPaidas.notmetered
ltx/en_us_holycross/oc.m1.d5:ocMA.OdeW7C21.mode	@ltx/en_us_holycross/miscellanea:misc.Mode1
ltx/en_us_holycross/oc.m1.d5:ocMA.OdeW7C21.ode	@ltx/en_us_holycross/miscellanea:misc.Ode7
ltx/en_us_holycross/oc.m1.d5:ocMA.OdeW7C21.text	
ltx/en_us_holycross/oc.m1.d5:ocMA.OdeW7C22.incipit	…
ltx/en_us_holycross/oc.m1.d5:ocMA.OdeW7C22.melody	@ltx/en_us_holycross/he.h.m1:heHE.TousEnKaminoPaidas.notmetered
ltx/en_us_holycross/oc.m1.d5:ocMA.OdeW7C22.mode	@ltx/en_us_holycross/miscellanea:misc.Mode1
ltx/en_us_holycross/oc.m1.d5:ocMA.OdeW7C22.ode	@ltx/en_us_holycross/miscellanea:misc.Ode7
ltx/en_us_holycross/oc.m1.d5:ocMA.OdeW7C22.text	
ltx/en_us_holycross/oc.m1.d5:ocMA.OdeW7C23.incipit	…
ltx/en_us_holycross/oc.m1.d5:ocMA.OdeW7C23.melody	@ltx/en_us_holycross/he.h.m1:heHE.TousEnKaminoPaidas.notmetered
ltx/en_us_holycross/oc.m1.d5:ocMA.OdeW7C23.mode	@ltx/en_us_holycross/miscellanea:misc.Mode1
ltx/en_us_holycross/oc.m1.d5:ocMA.OdeW7C23.ode	@ltx/en_us_holycross/miscellanea:misc.Ode7
ltx/en_us_holycross/oc.m1.d5:ocMA.OdeW7C23.text	
ltx/en_us_holycross/oc.m1.d5:ocMA.OdeW7C2T.incipit	…
ltx/en_us_holycross/oc.m1.d5:ocMA.OdeW7C2T.melody	@ltx/en_us_holycross/he.h.m1:heHE.TousEnKaminoPaidas.notmetered
ltx/en_us_holycross/oc.m1.d5:ocMA.OdeW7C2T.mode	@ltx/en_us_holycross/miscellanea:misc.Mode1
ltx/en_us_holycross/oc.m1.d5:ocMA.OdeW7C2T.ode	@ltx/en_us_holycross/miscellanea:misc.Ode7
ltx/en_us_holycross/oc.m1.d5:ocMA.OdeW7C2T.text	
ltx/en_us_holycross/oc.m1.d5:ocMA.OdeW8C11.incipit	…
ltx/en_us_holycross/oc.m1.d5:ocMA.OdeW8C11.melody	@ltx/en_us_holycross/he.h.m1:heHE.EnKaminoPaides.notmetered
ltx/en_us_holycross/oc.m1.d5:ocMA.OdeW8C11.mode	@ltx/en_us_holycross/miscellanea:misc.Mode1
ltx/en_us_holycross/oc.m1.d5:ocMA.OdeW8C11.ode	@ltx/en_us_holycross/miscellanea:misc.Ode8
ltx/en_us_holycross/oc.m1.d5:ocMA.OdeW8C11.text	
ltx/en_us_holycross/oc.m1.d5:ocMA.OdeW8C12.incipit	…
ltx/en_us_holycross/oc.m1.d5:ocMA.OdeW8C12.melody	@ltx/en_us_holycross/he.h.m1:heHE.EnKaminoPaides.notmetered
ltx/en_us_holycross/oc.m1.d5:ocMA.OdeW8C12.mode	@ltx/en_us_holycross/miscellanea:misc.Mode1
ltx/en_us_holycross/oc.m1.d5:ocMA.OdeW8C12.ode	@ltx/en_us_holycross/miscellanea:misc.Ode8
ltx/en_us_holycross/oc.m1.d5:ocMA.OdeW8C12.text	
ltx/en_us_holycross/oc.m1.d5:ocMA.OdeW8C13.incipit	…
ltx/en_us_holycross/oc.m1.d5:ocMA.OdeW8C13.melody	@ltx/en_us_holycross/he.h.m1:heHE.EnKaminoPaides.notmetered
ltx/en_us_holycross/oc.m1.d5:ocMA.OdeW8C13.mode	@ltx/en_us_holycross/miscellanea:misc.Mode1
ltx/en_us_holycross/oc.m1.d5:ocMA.OdeW8C13.ode	@ltx/en_us_holycross/miscellanea:misc.Ode8
ltx/en_us_holycross/oc.m1.d5:ocMA.OdeW8C13.text	
ltx/en_us_holycross/oc.m1.d5:ocMA.OdeW8C1H.greekmelody	@ltx/en_us_holycross/he.h.m1:heHE.EnKaminoPaides.greekname
ltx/en_us_holycross/oc.m1.d5:ocMA.OdeW8C1H.incipit	@ltx/en_us_holycross/he.h.m1:heHE.EnKaminoPaides.incipit
ltx/en_us_holycross/oc.m1.d5:ocMA.OdeW8C1H.melody	@ltx/en_us_holycross/he.h.m1:heHE.EnKaminoPaides.melody
ltx/en_us_holycross/oc.m1.d5:ocMA.OdeW8C1H.mode	@ltx/en_us_holycross/miscellanea:misc.Mode1
ltx/en_us_holycross/oc.m1.d5:ocMA.OdeW8C1H.ode	@ltx/en_us_holycross/miscellanea:misc.Ode8
ltx/en_us_holycross/oc.m1.d5:ocMA.OdeW8C1H.text	@ltx/en_us_holycross/he.h.m1:heHE.EnKaminoPaides.text
ltx/en_us_holycross/oc.m1.d5:ocMA.OdeW8C1T.incipit	…
ltx/en_us_holycross/oc.m1.d5:ocMA.OdeW8C1T.melody	@ltx/en_us_holycross/he.h.m1:heHE.EnKaminoPaides.notmetered
ltx/en_us_holycross/oc.m1.d5:ocMA.OdeW8C1T.mode	@ltx/en_us_holycross/miscellanea:misc.Mode1
ltx/en_us_holycross/oc.m1.d5:ocMA.OdeW8C1T.ode	@ltx/en_us_holycross/miscellanea:misc.Ode8
ltx/en_us_holycross/oc.m1.d5:ocMA.OdeW8C1T.text	
ltx/en_us_holycross/oc.m1.d5:ocMA.OdeW8C21.greekmelody	@ltx/en_us_holycross/he.h.m1:heHE.OnFrittousinAngeloi.greekname
ltx/en_us_holycross/oc.m1.d5:ocMA.OdeW8C21.incipit	…
ltx/en_us_holycross/oc.m1.d5:ocMA.OdeW8C21.melody	@ltx/en_us_holycross/he.h.m1:heHE.OnFrittousinAngeloi.notmetered
ltx/en_us_holycross/oc.m1.d5:ocMA.OdeW8C21.mode	@ltx/en_us_holycross/miscellanea:misc.Mode1
ltx/en_us_holycross/oc.m1.d5:ocMA.OdeW8C21.ode	@ltx/en_us_holycross/miscellanea:misc.Ode8
ltx/en_us_holycross/oc.m1.d5:ocMA.OdeW8C21.text	
ltx/en_us_holycross/oc.m1.d5:ocMA.OdeW8C22.incipit	…
ltx/en_us_holycross/oc.m1.d5:ocMA.OdeW8C22.melody	@ltx/en_us_holycross/he.h.m1:heHE.OnFrittousinAngeloi.notmetered
ltx/en_us_holycross/oc.m1.d5:ocMA.OdeW8C22.mode	@ltx/en_us_holycross/miscellanea:misc.Mode1
ltx/en_us_holycross/oc.m1.d5:ocMA.OdeW8C22.ode	@ltx/en_us_holycross/miscellanea:misc.Ode8
ltx/en_us_holycross/oc.m1.d5:ocMA.OdeW8C22.text	
ltx/en_us_holycross/oc.m1.d5:ocMA.OdeW8C23.incipit	…
ltx/en_us_holycross/oc.m1.d5:ocMA.OdeW8C23.melody	@ltx/en_us_holycross/he.h.m1:heHE.OnFrittousinAngeloi.notmetered
ltx/en_us_holycross/oc.m1.d5:ocMA.OdeW8C23.mode	@ltx/en_us_holycross/miscellanea:misc.Mode1
ltx/en_us_holycross/oc.m1.d5:ocMA.OdeW8C23.ode	@ltx/en_us_holycross/miscellanea:misc.Ode8
ltx/en_us_holycross/oc.m1.d5:ocMA.OdeW8C23.text	
ltx/en_us_holycross/oc.m1.d5:ocMA.OdeW8C2T.incipit	…
ltx/en_us_holycross/oc.m1.d5:ocMA.OdeW8C2T.melody	@ltx/en_us_holycross/he.h.m1:heHE.OnFrittousinAngeloi.notmetered
ltx/en_us_holycross/oc.m1.d5:ocMA.OdeW8C2T.mode	@ltx/en_us_holycross/miscellanea:misc.Mode1
ltx/en_us_holycross/oc.m1.d5:ocMA.OdeW8C2T.ode	@ltx/en_us_holycross/miscellanea:misc.Ode8
ltx/en_us_holycross/oc.m1.d5:ocMA.OdeW8C2T.text	
ltx/en_us_holycross/oc.m1.d5:ocMA.OdeW9C11.incipit	…
ltx/en_us_holycross/oc.m1.d5:ocMA.OdeW9C11.melody	@ltx/en_us_holycross/he.h.m1:heHE.TyponTisAgnis.notmetered
ltx/en_us_holycross/oc.m1.d5:ocMA.OdeW9C11.mode	@ltx/en_us_holycross/miscellanea:misc.Mode1
ltx/en_us_holycross/oc.m1.d5:ocMA.OdeW9C11.ode	@ltx/en_us_holycross/miscellanea:misc.Ode9
ltx/en_us_holycross/oc.m1.d5:ocMA.OdeW9C11.text	
ltx/en_us_holycross/oc.m1.d5:ocMA.OdeW9C12.incipit	…
ltx/en_us_holycross/oc.m1.d5:ocMA.OdeW9C12.melody	@ltx/en_us_holycross/he.h.m1:heHE.TyponTisAgnis.notmetered
ltx/en_us_holycross/oc.m1.d5:ocMA.OdeW9C12.mode	@ltx/en_us_holycross/miscellanea:misc.Mode1
ltx/en_us_holycross/oc.m1.d5:ocMA.OdeW9C12.ode	@ltx/en_us_holycross/miscellanea:misc.Ode9
ltx/en_us_holycross/oc.m1.d5:ocMA.OdeW9C12.text	
ltx/en_us_holycross/oc.m1.d5:ocMA.OdeW9C13.incipit	…
ltx/en_us_holycross/oc.m1.d5:ocMA.OdeW9C13.melody	@ltx/en_us_holycross/he.h.m1:heHE.TyponTisAgnis.notmetered
ltx/en_us_holycross/oc.m1.d5:ocMA.OdeW9C13.mode	@ltx/en_us_holycross/miscellanea:misc.Mode1
ltx/en_us_holycross/oc.m1.d5:ocMA.OdeW9C13.ode	@ltx/en_us_holycross/miscellanea:misc.Ode9
ltx/en_us_holycross/oc.m1.d5:ocMA.OdeW9C13.text	
ltx/en_us_holycross/oc.m1.d5:ocMA.OdeW9C1H.greekmelody	@ltx/en_us_holycross/he.h.m1:heHE.TyponTisAgnis.greekname
ltx/en_us_holycross/oc.m1.d5:ocMA.OdeW9C1H.incipit	@ltx/en_us_holycross/he.h.m1:heHE.TyponTisAgnis.incipit
ltx/en_us_holycross/oc.m1.d5:ocMA.OdeW9C1H.melody	@ltx/en_us_holycross/he.h.m1:heHE.TyponTisAgnis.melody
ltx/en_us_holycross/oc.m1.d5:ocMA.OdeW9C1H.mode	@ltx/en_us_holycross/miscellanea:misc.Mode1
ltx/en_us_holycross/oc.m1.d5:ocMA.OdeW9C1H.ode	@ltx/en_us_holycross/miscellanea:misc.Ode9
ltx/en_us_holycross/oc.m1.d5:ocMA.OdeW9C1H.text	@ltx/en_us_holycross/he.h.m1:heHE.TyponTisAgnis.text
ltx/en_us_holycross/oc.m1.d5:ocMA.OdeW9C1T.incipit	…
ltx/en_us_holycross/oc.m1.d5:ocMA.OdeW9C1T.melody	@ltx/en_us_holycross/he.h.m1:heHE.TyponTisAgnis.notmetered
ltx/en_us_holycross/oc.m1.d5:ocMA.OdeW9C1T.mode	@ltx/en_us_holycross/miscellanea:misc.Mode1
ltx/en_us_holycross/oc.m1.d5:ocMA.OdeW9C1T.ode	@ltx/en_us_holycross/miscellanea:misc.Ode9
ltx/en_us_holycross/oc.m1.d5:ocMA.OdeW9C1T.text	
ltx/en_us_holycross/oc.m1.d5:ocMA.OdeW9C21.greekmelody	@ltx/en_us_holycross/he.h.m1:heHE.TinFotoforonNefelin.greekname
ltx/en_us_holycross/oc.m1.d5:ocMA.OdeW9C21.incipit	…
ltx/en_us_holycross/oc.m1.d5:ocMA.OdeW9C21.melody	@ltx/en_us_holycross/he.h.m1:heHE.TinFotoforonNefelin.notmetered
ltx/en_us_holycross/oc.m1.d5:ocMA.OdeW9C21.mode	@ltx/en_us_holycross/miscellanea:misc.Mode1
ltx/en_us_holycross/oc.m1.d5:ocMA.OdeW9C21.ode	@ltx/en_us_holycross/miscellanea:misc.Ode9
ltx/en_us_holycross/oc.m1.d5:ocMA.OdeW9C21.text	
ltx/en_us_holycross/oc.m1.d5:ocMA.OdeW9C22.incipit	…
ltx/en_us_holycross/oc.m1.d5:ocMA.OdeW9C22.melody	@ltx/en_us_holycross/he.h.m1:heHE.TinFotoforonNefelin.notmetered
ltx/en_us_holycross/oc.m1.d5:ocMA.OdeW9C22.mode	@ltx/en_us_holycross/miscellanea:misc.Mode1
ltx/en_us_holycross/oc.m1.d5:ocMA.OdeW9C22.ode	@ltx/en_us_holycross/miscellanea:misc.Ode9
ltx/en_us_holycross/oc.m1.d5:ocMA.OdeW9C22.text	
ltx/en_us_holycross/oc.m1.d5:ocMA.OdeW9C23.incipit	…
ltx/en_us_holycross/oc.m1.d5:ocMA.OdeW9C23.melody	@ltx/en_us_holycross/he.h.m1:heHE.TinFotoforonNefelin.notmetered
ltx/en_us_holycross/oc.m1.d5:ocMA.OdeW9C23.mode	@ltx/en_us_holycross/miscellanea:misc.Mode1
ltx/en_us_holycross/oc.m1.d5:ocMA.OdeW9C23.ode	@ltx/en_us_holycross/miscellanea:misc.Ode9
ltx/en_us_holycross/oc.m1.d5:ocMA.OdeW9C23.text	
ltx/en_us_holycross/oc.m1.d5:ocMA.OdeW9C2T.incipit	…
ltx/en_us_holycross/oc.m1.d5:ocMA.OdeW9C2T.melody	@ltx/en_us_holycross/he.h.m1:heHE.TinFotoforonNefelin.notmetered
ltx/en_us_holycross/oc.m1.d5:ocMA.OdeW9C2T.mode	@ltx/en_us_holycross/miscellanea:misc.Mode1
ltx/en_us_holycross/oc.m1.d5:ocMA.OdeW9C2T.ode	@ltx/en_us_holycross/miscellanea:misc.Ode9
ltx/en_us_holycross/oc.m1.d5:ocMA.OdeW9C2T.text	
ltx/en_us_holycross/oc.m1.d5:ocVE.ApolTheotokionVM.incipit	@ltx/en_us_holycross/oc.m1.d5:ocMA.Kathisma13.incipit
ltx/en_us_holycross/oc.m1.d5:ocVE.ApolTheotokionVM.melody	
ltx/en_us_holycross/oc.m1.d5:ocVE.ApolTheotokionVM.mode	@ltx/en_us_holycross/miscellanea:misc.Mode1
ltx/en_us_holycross/oc.m1.d5:ocVE.ApolTheotokionVM.text	@ltx/en_us_holycross/oc.m1.d5:ocMA.Kathisma13.text
ltx/en_us_holycross/oc.m1.d5:ocVE.AposTheotokion.greekmelody	@ltx/en_us_holycross/he.a.m1:heAU.PaneffimoiMartyres.greekname
ltx/en_us_holycross/oc.m1.d5:ocVE.AposTheotokion.incipit	@ltx/en_us_holycross/oc.m1.d3:ocMA.AposTheotokion.incipit
ltx/en_us_holycross/oc.m1.d5:ocVE.AposTheotokion.melody	@ltx/en_us_holycross/he.a.m1:heAU.PaneffimoiMartyres.notmetered
ltx/en_us_holycross/oc.m1.d5:ocVE.AposTheotokion.mode	@ltx/en_us_holycross/miscellanea:misc.Mode1
ltx/en_us_holycross/oc.m1.d5:ocVE.AposTheotokion.text	@ltx/en_us_holycross/oc.m1.d3:ocMA.AposTheotokion.text
ltx/en_us_holycross/oc.m1.d5:ocVE.Aposticha1.incipit	…
ltx/en_us_holycross/oc.m1.d5:ocVE.Aposticha1.melody	
ltx/en_us_holycross/oc.m1.d5:ocVE.Aposticha1.mode	@ltx/en_us_holycross/miscellanea:misc.Mode1
ltx/en_us_holycross/oc.m1.d5:ocVE.Aposticha1.text	
ltx/en_us_holycross/oc.m1.d5:ocVE.Aposticha2.greekmelody	@ltx/en_us_holycross/he.a.m1:heAU.TonOuranionTagmaton.greekname
ltx/en_us_holycross/oc.m1.d5:ocVE.Aposticha2.incipit	…
ltx/en_us_holycross/oc.m1.d5:ocVE.Aposticha2.melody	@ltx/en_us_holycross/he.a.m1:heAU.TonOuranionTagmaton.notmetered
ltx/en_us_holycross/oc.m1.d5:ocVE.Aposticha2.mode	@ltx/en_us_holycross/miscellanea:misc.Mode1
ltx/en_us_holycross/oc.m1.d5:ocVE.Aposticha2.text	
ltx/en_us_holycross/oc.m1.d5:ocVE.Aposticha3.greekmelody	@ltx/en_us_holycross/he.a.m1:heAU.PaneffimoiMartyres.greekname
ltx/en_us_holycross/oc.m1.d5:ocVE.Aposticha3.incipit	@ltx/en_us_holycross/he.a.m1:heAU.PaneffimoiMartyres.incipit
ltx/en_us_holycross/oc.m1.d5:ocVE.Aposticha3.melody	@ltx/en_us_holycross/he.a.m1:heAU.PaneffimoiMartyres.melody
ltx/en_us_holycross/oc.m1.d5:ocVE.Aposticha3.mode	@ltx/en_us_holycross/miscellanea:misc.Mode1
ltx/en_us_holycross/oc.m1.d5:ocVE.Aposticha3.text	@ltx/en_us_holycross/he.a.m1:heAU.PaneffimoiMartyres.text
ltx/en_us_holycross/oc.m1.d5:ocVE.SticTheotokion.greekmelody	@ltx/en_us_holycross/he.a.m1:heAU.TonOuranionTagmaton.greekname
ltx/en_us_holycross/oc.m1.d5:ocVE.SticTheotokion.incipit	…
ltx/en_us_holycross/oc.m1.d5:ocVE.SticTheotokion.melody	@ltx/en_us_holycross/he.a.m1:heAU.TonOuranionTagmaton.notmetered
ltx/en_us_holycross/oc.m1.d5:ocVE.SticTheotokion.mode	@ltx/en_us_holycross/miscellanea:misc.Mode1
ltx/en_us_holycross/oc.m1.d5:ocVE.SticTheotokion.text	
ltx/en_us_holycross/oc.m1.d5:ocVE.Stichera1.greekmelody	@ltx/en_us_holycross/he.a.m1:heAU.PaneffimoiMartyres.greekname
ltx/en_us_holycross/oc.m1.d5:ocVE.Stichera1.incipit	…
ltx/en_us_holycross/oc.m1.d5:ocVE.Stichera1.melody	@ltx/en_us_holycross/he.a.m1:heAU.PaneffimoiMartyres.notmetered
ltx/en_us_holycross/oc.m1.d5:ocVE.Stichera1.mode	@ltx/en_us_holycross/miscellanea:misc.Mode1
ltx/en_us_holycross/oc.m1.d5:ocVE.Stichera1.text	
ltx/en_us_holycross/oc.m1.d5:ocVE.Stichera2.incipit	…
ltx/en_us_holycross/oc.m1.d5:ocVE.Stichera2.melody	@ltx/en_us_holycross/he.a.m1:heAU.PaneffimoiMartyres.notmetered
ltx/en_us_holycross/oc.m1.d5:ocVE.Stichera2.mode	@ltx/en_us_holycross/miscellanea:misc.Mode1
ltx/en_us_holycross/oc.m1.d5:ocVE.Stichera2.text	
ltx/en_us_holycross/oc.m1.d5:ocVE.Stichera3.incipit	…
ltx/en_us_holycross/oc.m1.d5:ocVE.Stichera3.melody	@ltx/en_us_holycross/he.a.m1:heAU.PaneffimoiMartyres.notmetered
ltx/en_us_holycross/oc.m1.d5:ocVE.Stichera3.mode	@ltx/en_us_holycross/miscellanea:misc.Mode1
ltx/en_us_holycross/oc.m1.d5:ocVE.Stichera3.text	
ltx/en_us_holycross/oc.m1.d5:ocVE.Stichera4.greekmelody	@ltx/en_us_holycross/he.a.m1:heAU.TonOuranionTagmaton.greekname
ltx/en_us_holycross/oc.m1.d5:ocVE.Stichera4.incipit	…
ltx/en_us_holycross/oc.m1.d5:ocVE.Stichera4.melody	@ltx/en_us_holycross/he.a.m1:heAU.TonOuranionTagmaton.notmetered
ltx/en_us_holycross/oc.m1.d5:ocVE.Stichera4.mode	@ltx/en_us_holycross/miscellanea:misc.Mode1
ltx/en_us_holycross/oc.m1.d5:ocVE.Stichera4.text	
ltx/en_us_holycross/oc.m1.d5:ocVE.Stichera5.incipit	…
ltx/en_us_holycross/oc.m1.d5:ocVE.Stichera5.melody	@ltx/en_us_holycross/he.a.m1:heAU.TonOuranionTagmaton.notmetered
ltx/en_us_holycross/oc.m1.d5:ocVE.Stichera5.mode	@ltx/en_us_holycross/miscellanea:misc.Mode1
ltx/en_us_holycross/oc.m1.d5:ocVE.Stichera5.text	
ltx/en_us_holycross/oc.m1.d5:ocVE.Stichera6.incipit	…
ltx/en_us_holycross/oc.m1.d5:ocVE.Stichera6.melody	@ltx/en_us_holycross/he.a.m1:heAU.TonOuranionTagmaton.notmetered
ltx/en_us_holycross/oc.m1.d5:ocVE.Stichera6.mode	@ltx/en_us_holycross/miscellanea:misc.Mode1
ltx/en_us_holycross/oc.m1.d5:ocVE.Stichera6.text	
ltx/en_us_holycross/oc.m1.d5:octrMA.Kathisma11.greekmelody	@ltx/en_us_holycross/he.a.m1:heAU.TouLithouSfragisthentos.greekname
ltx/en_us_holycross/oc.m1.d5:octrMA.Kathisma11.incipit	@ltx/en_us_holycross/oc.m1.d5:ocMA.Kathisma12.incipit
ltx/en_us_holycross/oc.m1.d5:octrMA.Kathisma11.melody	@ltx/en_us_holycross/he.a.m1:heAU.TouLithouSfragisthentos.notmetered
ltx/en_us_holycross/oc.m1.d5:octrMA.Kathisma11.mode	@ltx/en_us_holycross/miscellanea:misc.Mode1
ltx/en_us_holycross/oc.m1.d5:octrMA.Kathisma11.text	@ltx/en_us_holycross/oc.m1.d5:ocMA.Kathisma12.text
ltx/en_us_holycross/oc.m1.d5:octrMA.Kathisma12.incipit	@ltx/en_us_holycross/oc.m1.d5:ocMA.Kathisma11.incipit
ltx/en_us_holycross/oc.m1.d5:octrMA.Kathisma12.melody	
ltx/en_us_holycross/oc.m1.d5:octrMA.Kathisma12.mode	@ltx/en_us_holycross/miscellanea:misc.Mode1
ltx/en_us_holycross/oc.m1.d5:octrMA.Kathisma12.text	@ltx/en_us_holycross/oc.m1.d5:ocMA.Kathisma11.text
ltx/en_us_holycross/oc.m1.d5:octrMA.Kathisma1T.incipit	@ltx/en_us_holycross/oc.m1.d4:ocMA.Kathisma13.incipit
ltx/en_us_holycross/oc.m1.d5:octrMA.Kathisma1T.melody	
ltx/en_us_holycross/oc.m1.d5:octrMA.Kathisma1T.mode	@ltx/en_us_holycross/miscellanea:misc.Mode1
ltx/en_us_holycross/oc.m1.d5:octrMA.Kathisma1T.text	@ltx/en_us_holycross/oc.m1.d4:ocMA.Kathisma13.text
ltx/en_us_holycross/oc.m1.d5:octrMA.Ode7Martyricon.greekmelody	@ltx/en_us_holycross/he.a.m1:heAU.TonTafonSouSotir.greekname
ltx/en_us_holycross/oc.m1.d5:octrMA.Ode7Martyricon.incipit	@ltx/en_us_holycross/oc.m1.d5:ocMA.Kathisma32.incipit
ltx/en_us_holycross/oc.m1.d5:octrMA.Ode7Martyricon.melody	@ltx/en_us_holycross/he.a.m1:heAU.TonTafonSouSotir.notmetered
ltx/en_us_holycross/oc.m1.d5:octrMA.Ode7Martyricon.mode	@ltx/en_us_holycross/miscellanea:misc.Mode1
ltx/en_us_holycross/oc.m1.d5:octrMA.Ode7Martyricon.text	@ltx/en_us_holycross/oc.m1.d5:ocMA.Kathisma32.text
ltx/en_us_holycross/oc.m1.d5:octrMA.Photogogic.incipit	@ltx/en_us_holycross/oc.m1.d2:octrMA.Photagogic.incipit
ltx/en_us_holycross/oc.m1.d5:octrMA.Photogogic.mode	@ltx/en_us_holycross/miscellanea:misc.Mode1
ltx/en_us_holycross/oc.m1.d5:octrMA.Photogogic.text	@ltx/en_us_holycross/oc.m1.d2:octrMA.Photagogic.text
ltx/en_us_holycross/oc.m1.d5:octrMA.Triadic1.incipit	@ltx/en_us_holycross/oc.m1.d2:octrMA.Triadic1.incipit
ltx/en_us_holycross/oc.m1.d5:octrMA.Triadic1.mode	@ltx/en_us_holycross/miscellanea:misc.Mode1
ltx/en_us_holycross/oc.m1.d5:octrMA.Triadic1.text	@ltx/en_us_holycross/oc.m1.d2:octrMA.Triadic1.text
ltx/en_us_holycross/oc.m1.d5:octrMA.Triadic2.incipit	@ltx/en_us_holycross/oc.m1.d2:octrMA.Triadic2.incipit
ltx/en_us_holycross/oc.m1.d5:octrMA.Triadic2.mode	@ltx/en_us_holycross/miscellanea:misc.Mode1
ltx/en_us_holycross/oc.m1.d5:octrMA.Triadic2.text	@ltx/en_us_holycross/oc.m1.d2:octrMA.Triadic2.text
ltx/en_us_holycross/oc.m1.d5:octrMA.Triadic3.incipit	@ltx/en_us_holycross/oc.m1.d2:octrMA.Triadic3.incipit
ltx/en_us_holycross/oc.m1.d5:octrMA.Triadic3.mode	@ltx/en_us_holycross/miscellanea:misc.Mode1
ltx/en_us_holycross/oc.m1.d5:octrMA.Triadic3.text	@ltx/en_us_holycross/oc.m1.d2:octrMA.Triadic3.text
