ltx/en_us_holycross/oc.m8.d7:ocBK.ModeNaked	@ltx/en_us_holycross/miscellanea:misc.Mode8.naked
ltx/en_us_holycross/oc.m8.d7:ocBK.end.title	
ltx/en_us_holycross/oc.m8.d7:ocBK.end.verse1.text	
ltx/en_us_holycross/oc.m8.d7:ocBK.end.verse2.text	
ltx/en_us_holycross/oc.m8.d7:ocBK.end.verse3.text	
ltx/en_us_holycross/oc.m8.d7:ocBK.end.verse4.text	
ltx/en_us_holycross/oc.m8.d7:ocBK.end.verse5.text	
ltx/en_us_holycross/oc.m8.d7:ocBK.end.verse6.text	
ltx/en_us_holycross/oc.m8.d7:ocLI.Beatitudes1.incipit	@ltx/en_us_holycross/oc.m8.d1:ocLI.Beatitudes1.incipit
ltx/en_us_holycross/oc.m8.d7:ocLI.Beatitudes1.melody	
ltx/en_us_holycross/oc.m8.d7:ocLI.Beatitudes1.mode	@ltx/en_us_holycross/miscellanea:misc.Mode8
ltx/en_us_holycross/oc.m8.d7:ocLI.Beatitudes1.text	@ltx/en_us_holycross/oc.m8.d1:ocLI.Beatitudes1.text
ltx/en_us_holycross/oc.m8.d7:ocLI.Beatitudes2.incipit	…
ltx/en_us_holycross/oc.m8.d7:ocLI.Beatitudes2.melody	
ltx/en_us_holycross/oc.m8.d7:ocLI.Beatitudes2.mode	@ltx/en_us_holycross/miscellanea:misc.Mode8
ltx/en_us_holycross/oc.m8.d7:ocLI.Beatitudes2.text	
ltx/en_us_holycross/oc.m8.d7:ocLI.Beatitudes3.incipit	…
ltx/en_us_holycross/oc.m8.d7:ocLI.Beatitudes3.melody	
ltx/en_us_holycross/oc.m8.d7:ocLI.Beatitudes3.mode	@ltx/en_us_holycross/miscellanea:misc.Mode8
ltx/en_us_holycross/oc.m8.d7:ocLI.Beatitudes3.text	
ltx/en_us_holycross/oc.m8.d7:ocLI.Beatitudes4.incipit	…
ltx/en_us_holycross/oc.m8.d7:ocLI.Beatitudes4.melody	
ltx/en_us_holycross/oc.m8.d7:ocLI.Beatitudes4.mode	@ltx/en_us_holycross/miscellanea:misc.Mode8
ltx/en_us_holycross/oc.m8.d7:ocLI.Beatitudes4.text	
ltx/en_us_holycross/oc.m8.d7:ocLI.BeatitudesT.incipit	…
ltx/en_us_holycross/oc.m8.d7:ocLI.BeatitudesT.melody	
ltx/en_us_holycross/oc.m8.d7:ocLI.BeatitudesT.mode	@ltx/en_us_holycross/miscellanea:misc.Mode8
ltx/en_us_holycross/oc.m8.d7:ocLI.BeatitudesT.text	
ltx/en_us_holycross/oc.m8.d7:ocLI.BeatitudesTr.incipit	…
ltx/en_us_holycross/oc.m8.d7:ocLI.BeatitudesTr.melody	
ltx/en_us_holycross/oc.m8.d7:ocLI.BeatitudesTr.mode	@ltx/en_us_holycross/miscellanea:misc.Mode8
ltx/en_us_holycross/oc.m8.d7:ocLI.BeatitudesTr.text	
ltx/en_us_holycross/oc.m8.d7:ocMA.ApolTheotokion.incipit	@ltx/en_us_holycross/oc.m8.d3:ocMA.ApolTheotokion.incipit
ltx/en_us_holycross/oc.m8.d7:ocMA.ApolTheotokion.melody	
ltx/en_us_holycross/oc.m8.d7:ocMA.ApolTheotokion.mode	@ltx/en_us_holycross/miscellanea:misc.Mode8
ltx/en_us_holycross/oc.m8.d7:ocMA.ApolTheotokion.text	@ltx/en_us_holycross/oc.m8.d3:ocMA.ApolTheotokion.text
ltx/en_us_holycross/oc.m8.d7:ocMA.AposTheotokion.greekmelody	@ltx/en_us_holycross/he.a.m8:heAU.OTouParadoxou.greekname
ltx/en_us_holycross/oc.m8.d7:ocMA.AposTheotokion.incipit	…
ltx/en_us_holycross/oc.m8.d7:ocMA.AposTheotokion.melody	@ltx/en_us_holycross/he.a.m8:heAU.OTouParadoxou.notmetered
ltx/en_us_holycross/oc.m8.d7:ocMA.AposTheotokion.mode	@ltx/en_us_holycross/miscellanea:misc.Mode8
ltx/en_us_holycross/oc.m8.d7:ocMA.AposTheotokion.text	
ltx/en_us_holycross/oc.m8.d7:ocMA.Aposticha1.greekmelody	@ltx/en_us_holycross/he.a.m8:heAU.OTouParadoxou.greekname
ltx/en_us_holycross/oc.m8.d7:ocMA.Aposticha1.incipit	…
ltx/en_us_holycross/oc.m8.d7:ocMA.Aposticha1.melody	@ltx/en_us_holycross/he.a.m8:heAU.OTouParadoxou.notmetered
ltx/en_us_holycross/oc.m8.d7:ocMA.Aposticha1.mode	@ltx/en_us_holycross/miscellanea:misc.Mode8
ltx/en_us_holycross/oc.m8.d7:ocMA.Aposticha1.text	
ltx/en_us_holycross/oc.m8.d7:ocMA.Aposticha2.greekmelody	@ltx/en_us_holycross/he.a.m8:heAU.OTouParadoxou.greekname
ltx/en_us_holycross/oc.m8.d7:ocMA.Aposticha2.incipit	…
ltx/en_us_holycross/oc.m8.d7:ocMA.Aposticha2.melody	@ltx/en_us_holycross/he.a.m8:heAU.OTouParadoxou.notmetered
ltx/en_us_holycross/oc.m8.d7:ocMA.Aposticha2.mode	@ltx/en_us_holycross/miscellanea:misc.Mode8
ltx/en_us_holycross/oc.m8.d7:ocMA.Aposticha2.text	
ltx/en_us_holycross/oc.m8.d7:ocMA.Aposticha3.greekmelody	@ltx/en_us_holycross/he.a.m8:heAU.OTouParadoxou.greekname
ltx/en_us_holycross/oc.m8.d7:ocMA.Aposticha3.incipit	…
ltx/en_us_holycross/oc.m8.d7:ocMA.Aposticha3.melody	@ltx/en_us_holycross/he.a.m8:heAU.OTouParadoxou.notmetered
ltx/en_us_holycross/oc.m8.d7:ocMA.Aposticha3.mode	@ltx/en_us_holycross/miscellanea:misc.Mode8
ltx/en_us_holycross/oc.m8.d7:ocMA.Aposticha3.text	
ltx/en_us_holycross/oc.m8.d7:ocMA.Aposticha4.greekmelody	@ltx/en_us_holycross/he.a.m8:heAU.OTouParadoxou.greekname
ltx/en_us_holycross/oc.m8.d7:ocMA.Aposticha4.incipit	…
ltx/en_us_holycross/oc.m8.d7:ocMA.Aposticha4.melody	@ltx/en_us_holycross/he.a.m8:heAU.OTouParadoxou.notmetered
ltx/en_us_holycross/oc.m8.d7:ocMA.Aposticha4.mode	@ltx/en_us_holycross/miscellanea:misc.Mode8
ltx/en_us_holycross/oc.m8.d7:ocMA.Aposticha4.text	
ltx/en_us_holycross/oc.m8.d7:ocMA.C1.acrostic.notice1	
ltx/en_us_holycross/oc.m8.d7:ocMA.C1.acrostic.text	
ltx/en_us_holycross/oc.m8.d7:ocMA.C1.acrostic.title	
ltx/en_us_holycross/oc.m8.d7:ocMA.C2.acrostic.notice1	
ltx/en_us_holycross/oc.m8.d7:ocMA.C2.acrostic.text	
ltx/en_us_holycross/oc.m8.d7:ocMA.C2.acrostic.title	
ltx/en_us_holycross/oc.m8.d7:ocMA.C2.poet	@ltx/en_us_holycross/poets:po.Theofanous
ltx/en_us_holycross/oc.m8.d7:ocMA.Kathisma11.incipit	@ltx/en_us_holycross/oc.m8.d3:ocMA.Kathisma32.incipit
ltx/en_us_holycross/oc.m8.d7:ocMA.Kathisma11.melody	
ltx/en_us_holycross/oc.m8.d7:ocMA.Kathisma11.mode	@ltx/en_us_holycross/miscellanea:misc.Mode8
ltx/en_us_holycross/oc.m8.d7:ocMA.Kathisma11.text	@ltx/en_us_holycross/oc.m8.d3:ocMA.Kathisma32.text
ltx/en_us_holycross/oc.m8.d7:ocMA.Kathisma12.greekmelody	@ltx/en_us_holycross/he.a.m8:heAU.ToProstachthen.greekname
ltx/en_us_holycross/oc.m8.d7:ocMA.Kathisma12.incipit	@ltx/en_us_holycross/oc.m8.d4:ocMA.Kathisma32.incipit
ltx/en_us_holycross/oc.m8.d7:ocMA.Kathisma12.melody	@ltx/en_us_holycross/he.a.m8:heAU.ToProstachthen.notmetered
ltx/en_us_holycross/oc.m8.d7:ocMA.Kathisma12.mode	@ltx/en_us_holycross/miscellanea:misc.Mode8
ltx/en_us_holycross/oc.m8.d7:ocMA.Kathisma12.text	@ltx/en_us_holycross/oc.m8.d4:ocMA.Kathisma32.text
ltx/en_us_holycross/oc.m8.d7:ocMA.Kathisma13.greekmelody	@ltx/en_us_holycross/he.a.m8:heAU.TinSofianKaiLogon.greekname
ltx/en_us_holycross/oc.m8.d7:ocMA.Kathisma13.incipit	@ltx/en_us_holycross/oc.m8.d5:ocMA.Kathisma32.incipit
ltx/en_us_holycross/oc.m8.d7:ocMA.Kathisma13.melody	@ltx/en_us_holycross/he.a.m8:heAU.TinSofianKaiLogon.notmetered
ltx/en_us_holycross/oc.m8.d7:ocMA.Kathisma13.mode	@ltx/en_us_holycross/miscellanea:misc.Mode8
ltx/en_us_holycross/oc.m8.d7:ocMA.Kathisma13.text	@ltx/en_us_holycross/oc.m8.d5:ocMA.Kathisma32.text
ltx/en_us_holycross/oc.m8.d7:ocMA.Kathisma14.incipit	@ltx/en_us_holycross/oc.m8.d1:ocVE.ApolTheotokionVM.incipit
ltx/en_us_holycross/oc.m8.d7:ocMA.Kathisma14.melody	
ltx/en_us_holycross/oc.m8.d7:ocMA.Kathisma14.mode	@ltx/en_us_holycross/miscellanea:misc.Mode8
ltx/en_us_holycross/oc.m8.d7:ocMA.Kathisma14.text	@ltx/en_us_holycross/oc.m8.d1:ocVE.ApolTheotokionVM.text
ltx/en_us_holycross/oc.m8.d7:ocMA.Kathisma21.incipit	@ltx/en_us_holycross/oc.m8.d2:ocMA.Kathisma32.incipit
ltx/en_us_holycross/oc.m8.d7:ocMA.Kathisma21.melody	
ltx/en_us_holycross/oc.m8.d7:ocMA.Kathisma21.mode	@ltx/en_us_holycross/miscellanea:misc.Mode8
ltx/en_us_holycross/oc.m8.d7:ocMA.Kathisma21.text	@ltx/en_us_holycross/oc.m8.d2:ocMA.Kathisma32.text
ltx/en_us_holycross/oc.m8.d7:ocMA.Kathisma22.greekmelody	@ltx/en_us_holycross/he.a.m8:heAU.ToProstachthen.greekname
ltx/en_us_holycross/oc.m8.d7:ocMA.Kathisma22.incipit	…
ltx/en_us_holycross/oc.m8.d7:ocMA.Kathisma22.melody	@ltx/en_us_holycross/he.a.m8:heAU.ToProstachthen.notmetered
ltx/en_us_holycross/oc.m8.d7:ocMA.Kathisma22.mode	@ltx/en_us_holycross/miscellanea:misc.Mode8
ltx/en_us_holycross/oc.m8.d7:ocMA.Kathisma22.text	
ltx/en_us_holycross/oc.m8.d7:ocMA.Kathisma23.incipit	…
ltx/en_us_holycross/oc.m8.d7:ocMA.Kathisma23.melody	
ltx/en_us_holycross/oc.m8.d7:ocMA.Kathisma23.mode	@ltx/en_us_holycross/miscellanea:misc.Mode8
ltx/en_us_holycross/oc.m8.d7:ocMA.Kathisma23.text	
ltx/en_us_holycross/oc.m8.d7:ocMA.Kathisma24.incipit	…
ltx/en_us_holycross/oc.m8.d7:ocMA.Kathisma24.melody	
ltx/en_us_holycross/oc.m8.d7:ocMA.Kathisma24.mode	@ltx/en_us_holycross/miscellanea:misc.Mode8
ltx/en_us_holycross/oc.m8.d7:ocMA.Kathisma24.text	
ltx/en_us_holycross/oc.m8.d7:ocMA.Lauds1.greekmelody	@ltx/en_us_holycross/oc.m8.d3:ocMA.Aposticha3.greekmelody
ltx/en_us_holycross/oc.m8.d7:ocMA.Lauds1.incipit	@ltx/en_us_holycross/oc.m8.d3:ocMA.Aposticha3.incipit
ltx/en_us_holycross/oc.m8.d7:ocMA.Lauds1.melody	@ltx/en_us_holycross/oc.m8.d3:ocMA.Aposticha3.melody
ltx/en_us_holycross/oc.m8.d7:ocMA.Lauds1.mode	@ltx/en_us_holycross/miscellanea:misc.Mode8
ltx/en_us_holycross/oc.m8.d7:ocMA.Lauds1.text	@ltx/en_us_holycross/oc.m8.d3:ocMA.Aposticha3.text
ltx/en_us_holycross/oc.m8.d7:ocMA.Lauds2.greekmelody	@ltx/en_us_holycross/oc.m8.d4:ocMA.Aposticha3.greekmelody
ltx/en_us_holycross/oc.m8.d7:ocMA.Lauds2.incipit	@ltx/en_us_holycross/oc.m8.d4:ocMA.Aposticha3.incipit
ltx/en_us_holycross/oc.m8.d7:ocMA.Lauds2.melody	@ltx/en_us_holycross/oc.m8.d4:ocMA.Aposticha3.melody
ltx/en_us_holycross/oc.m8.d7:ocMA.Lauds2.mode	@ltx/en_us_holycross/miscellanea:misc.Mode8
ltx/en_us_holycross/oc.m8.d7:ocMA.Lauds2.text	@ltx/en_us_holycross/oc.m8.d4:ocMA.Aposticha3.text
ltx/en_us_holycross/oc.m8.d7:ocMA.Lauds3.incipit	@ltx/en_us_holycross/oc.m8.d5:ocMA.Aposticha3.incipit
ltx/en_us_holycross/oc.m8.d7:ocMA.Lauds3.melody	
ltx/en_us_holycross/oc.m8.d7:ocMA.Lauds3.mode	@ltx/en_us_holycross/miscellanea:misc.Mode8
ltx/en_us_holycross/oc.m8.d7:ocMA.Lauds3.text	@ltx/en_us_holycross/oc.m8.d5:ocMA.Aposticha3.text
ltx/en_us_holycross/oc.m8.d7:ocMA.Lauds4.greekmelody	@ltx/en_us_holycross/he.a.m8:heAU.TiYmasKalesomen.greekname
ltx/en_us_holycross/oc.m8.d7:ocMA.Lauds4.incipit	@ltx/en_us_holycross/he.a.m8:heAU.TiYmasKalesomen.incipit
ltx/en_us_holycross/oc.m8.d7:ocMA.Lauds4.melody	@ltx/en_us_holycross/he.a.m8:heAU.TiYmasKalesomen.melody
ltx/en_us_holycross/oc.m8.d7:ocMA.Lauds4.mode	@ltx/en_us_holycross/miscellanea:misc.Mode8
ltx/en_us_holycross/oc.m8.d7:ocMA.Lauds4.text	@ltx/en_us_holycross/he.a.m8:heAU.TiYmasKalesomen.text
ltx/en_us_holycross/oc.m8.d7:ocMA.LaudsGlory.incipit	…
ltx/en_us_holycross/oc.m8.d7:ocMA.LaudsGlory.melody	
ltx/en_us_holycross/oc.m8.d7:ocMA.LaudsGlory.mode	@ltx/en_us_holycross/miscellanea:misc.Mode8
ltx/en_us_holycross/oc.m8.d7:ocMA.LaudsGlory.text	
ltx/en_us_holycross/oc.m8.d7:ocMA.LaudsTheotokion.incipit	@ltx/en_us_holycross/oc.m8.d3:ocMA.AposTheotokion.incipit
ltx/en_us_holycross/oc.m8.d7:ocMA.LaudsTheotokion.melody	
ltx/en_us_holycross/oc.m8.d7:ocMA.LaudsTheotokion.mode	@ltx/en_us_holycross/miscellanea:misc.Mode8
ltx/en_us_holycross/oc.m8.d7:ocMA.LaudsTheotokion.text	@ltx/en_us_holycross/oc.m8.d3:ocMA.AposTheotokion.text
ltx/en_us_holycross/oc.m8.d7:ocMA.MM.Alleluia.text	@ltx/en_us_holycross/properties:media.key
ltx/en_us_holycross/oc.m8.d7:ocMA.OdeW1C11.incipit	…
ltx/en_us_holycross/oc.m8.d7:ocMA.OdeW1C11.melody	@ltx/en_us_holycross/he.h.m8:heHE.AsomenToKyrio.notmetered
ltx/en_us_holycross/oc.m8.d7:ocMA.OdeW1C11.mode	@ltx/en_us_holycross/miscellanea:misc.Mode8
ltx/en_us_holycross/oc.m8.d7:ocMA.OdeW1C11.ode	@ltx/en_us_holycross/miscellanea:misc.Ode1
ltx/en_us_holycross/oc.m8.d7:ocMA.OdeW1C11.text	
ltx/en_us_holycross/oc.m8.d7:ocMA.OdeW1C12.incipit	…
ltx/en_us_holycross/oc.m8.d7:ocMA.OdeW1C12.melody	@ltx/en_us_holycross/he.h.m8:heHE.AsomenToKyrio.notmetered
ltx/en_us_holycross/oc.m8.d7:ocMA.OdeW1C12.mode	@ltx/en_us_holycross/miscellanea:misc.Mode8
ltx/en_us_holycross/oc.m8.d7:ocMA.OdeW1C12.ode	@ltx/en_us_holycross/miscellanea:misc.Ode1
ltx/en_us_holycross/oc.m8.d7:ocMA.OdeW1C12.text	
ltx/en_us_holycross/oc.m8.d7:ocMA.OdeW1C13.incipit	…
ltx/en_us_holycross/oc.m8.d7:ocMA.OdeW1C13.melody	@ltx/en_us_holycross/he.h.m8:heHE.AsomenToKyrio.notmetered
ltx/en_us_holycross/oc.m8.d7:ocMA.OdeW1C13.mode	@ltx/en_us_holycross/miscellanea:misc.Mode8
ltx/en_us_holycross/oc.m8.d7:ocMA.OdeW1C13.ode	@ltx/en_us_holycross/miscellanea:misc.Ode1
ltx/en_us_holycross/oc.m8.d7:ocMA.OdeW1C13.text	
ltx/en_us_holycross/oc.m8.d7:ocMA.OdeW1C14.incipit	…
ltx/en_us_holycross/oc.m8.d7:ocMA.OdeW1C14.melody	@ltx/en_us_holycross/he.h.m8:heHE.AsomenToKyrio.notmetered
ltx/en_us_holycross/oc.m8.d7:ocMA.OdeW1C14.mode	@ltx/en_us_holycross/miscellanea:misc.Mode8
ltx/en_us_holycross/oc.m8.d7:ocMA.OdeW1C14.ode	@ltx/en_us_holycross/miscellanea:misc.Ode1
ltx/en_us_holycross/oc.m8.d7:ocMA.OdeW1C14.text	
ltx/en_us_holycross/oc.m8.d7:ocMA.OdeW1C1H.greekmelody	@ltx/en_us_holycross/he.h.m8:heHE.AsomenToKyrio.greekname
ltx/en_us_holycross/oc.m8.d7:ocMA.OdeW1C1H.incipit	@ltx/en_us_holycross/he.h.m8:heHE.AsomenToKyrio.incipit
ltx/en_us_holycross/oc.m8.d7:ocMA.OdeW1C1H.melody	@ltx/en_us_holycross/he.h.m8:heHE.AsomenToKyrio.melody
ltx/en_us_holycross/oc.m8.d7:ocMA.OdeW1C1H.mode	@ltx/en_us_holycross/miscellanea:misc.Mode8
ltx/en_us_holycross/oc.m8.d7:ocMA.OdeW1C1H.ode	@ltx/en_us_holycross/miscellanea:misc.Ode1
ltx/en_us_holycross/oc.m8.d7:ocMA.OdeW1C1H.text	@ltx/en_us_holycross/he.h.m8:heHE.AsomenToKyrio.text
ltx/en_us_holycross/oc.m8.d7:ocMA.OdeW1C1T.incipit	…
ltx/en_us_holycross/oc.m8.d7:ocMA.OdeW1C1T.melody	@ltx/en_us_holycross/he.h.m8:heHE.AsomenToKyrio.notmetered
ltx/en_us_holycross/oc.m8.d7:ocMA.OdeW1C1T.mode	@ltx/en_us_holycross/miscellanea:misc.Mode8
ltx/en_us_holycross/oc.m8.d7:ocMA.OdeW1C1T.ode	@ltx/en_us_holycross/miscellanea:misc.Ode1
ltx/en_us_holycross/oc.m8.d7:ocMA.OdeW1C1T.text	
ltx/en_us_holycross/oc.m8.d7:ocMA.OdeW1C21.greekmelody	@ltx/en_us_holycross/he.h.m8:heHE.YgranDiodefsas.greekname
ltx/en_us_holycross/oc.m8.d7:ocMA.OdeW1C21.incipit	…
ltx/en_us_holycross/oc.m8.d7:ocMA.OdeW1C21.melody	@ltx/en_us_holycross/he.h.m8:heHE.YgranDiodefsas.notmetered
ltx/en_us_holycross/oc.m8.d7:ocMA.OdeW1C21.mode	@ltx/en_us_holycross/miscellanea:misc.Mode8
ltx/en_us_holycross/oc.m8.d7:ocMA.OdeW1C21.ode	@ltx/en_us_holycross/miscellanea:misc.Ode1
ltx/en_us_holycross/oc.m8.d7:ocMA.OdeW1C21.text	
ltx/en_us_holycross/oc.m8.d7:ocMA.OdeW1C22.incipit	…
ltx/en_us_holycross/oc.m8.d7:ocMA.OdeW1C22.melody	@ltx/en_us_holycross/he.h.m8:heHE.YgranDiodefsas.notmetered
ltx/en_us_holycross/oc.m8.d7:ocMA.OdeW1C22.mode	@ltx/en_us_holycross/miscellanea:misc.Mode8
ltx/en_us_holycross/oc.m8.d7:ocMA.OdeW1C22.ode	@ltx/en_us_holycross/miscellanea:misc.Ode1
ltx/en_us_holycross/oc.m8.d7:ocMA.OdeW1C22.text	
ltx/en_us_holycross/oc.m8.d7:ocMA.OdeW1C23.incipit	…
ltx/en_us_holycross/oc.m8.d7:ocMA.OdeW1C23.melody	@ltx/en_us_holycross/he.h.m8:heHE.YgranDiodefsas.notmetered
ltx/en_us_holycross/oc.m8.d7:ocMA.OdeW1C23.mode	@ltx/en_us_holycross/miscellanea:misc.Mode8
ltx/en_us_holycross/oc.m8.d7:ocMA.OdeW1C23.ode	@ltx/en_us_holycross/miscellanea:misc.Ode1
ltx/en_us_holycross/oc.m8.d7:ocMA.OdeW1C23.text	
ltx/en_us_holycross/oc.m8.d7:ocMA.OdeW1C2T.incipit	…
ltx/en_us_holycross/oc.m8.d7:ocMA.OdeW1C2T.melody	@ltx/en_us_holycross/he.h.m8:heHE.YgranDiodefsas.notmetered
ltx/en_us_holycross/oc.m8.d7:ocMA.OdeW1C2T.mode	@ltx/en_us_holycross/miscellanea:misc.Mode8
ltx/en_us_holycross/oc.m8.d7:ocMA.OdeW1C2T.ode	@ltx/en_us_holycross/miscellanea:misc.Ode1
ltx/en_us_holycross/oc.m8.d7:ocMA.OdeW1C2T.text	
ltx/en_us_holycross/oc.m8.d7:ocMA.OdeW3C11.incipit	…
ltx/en_us_holycross/oc.m8.d7:ocMA.OdeW3C11.melody	@ltx/en_us_holycross/he.h.m8:heHE.OStereosasLogo.notmetered
ltx/en_us_holycross/oc.m8.d7:ocMA.OdeW3C11.mode	@ltx/en_us_holycross/miscellanea:misc.Mode8
ltx/en_us_holycross/oc.m8.d7:ocMA.OdeW3C11.ode	@ltx/en_us_holycross/miscellanea:misc.Ode3
ltx/en_us_holycross/oc.m8.d7:ocMA.OdeW3C11.text	
ltx/en_us_holycross/oc.m8.d7:ocMA.OdeW3C12.incipit	…
ltx/en_us_holycross/oc.m8.d7:ocMA.OdeW3C12.melody	@ltx/en_us_holycross/he.h.m8:heHE.OStereosasLogo.notmetered
ltx/en_us_holycross/oc.m8.d7:ocMA.OdeW3C12.mode	@ltx/en_us_holycross/miscellanea:misc.Mode8
ltx/en_us_holycross/oc.m8.d7:ocMA.OdeW3C12.ode	@ltx/en_us_holycross/miscellanea:misc.Ode3
ltx/en_us_holycross/oc.m8.d7:ocMA.OdeW3C12.text	
ltx/en_us_holycross/oc.m8.d7:ocMA.OdeW3C13.incipit	…
ltx/en_us_holycross/oc.m8.d7:ocMA.OdeW3C13.melody	@ltx/en_us_holycross/he.h.m8:heHE.OStereosasLogo.notmetered
ltx/en_us_holycross/oc.m8.d7:ocMA.OdeW3C13.mode	@ltx/en_us_holycross/miscellanea:misc.Mode8
ltx/en_us_holycross/oc.m8.d7:ocMA.OdeW3C13.ode	@ltx/en_us_holycross/miscellanea:misc.Ode3
ltx/en_us_holycross/oc.m8.d7:ocMA.OdeW3C13.text	
ltx/en_us_holycross/oc.m8.d7:ocMA.OdeW3C14.incipit	…
ltx/en_us_holycross/oc.m8.d7:ocMA.OdeW3C14.melody	@ltx/en_us_holycross/he.h.m8:heHE.OStereosasLogo.notmetered
ltx/en_us_holycross/oc.m8.d7:ocMA.OdeW3C14.mode	@ltx/en_us_holycross/miscellanea:misc.Mode8
ltx/en_us_holycross/oc.m8.d7:ocMA.OdeW3C14.ode	@ltx/en_us_holycross/miscellanea:misc.Ode3
ltx/en_us_holycross/oc.m8.d7:ocMA.OdeW3C14.text	
ltx/en_us_holycross/oc.m8.d7:ocMA.OdeW3C1H.greekmelody	@ltx/en_us_holycross/he.h.m8:heHE.OStereosasLogo.greekname
ltx/en_us_holycross/oc.m8.d7:ocMA.OdeW3C1H.incipit	@ltx/en_us_holycross/he.h.m8:heHE.OStereosasLogo.incipit
ltx/en_us_holycross/oc.m8.d7:ocMA.OdeW3C1H.melody	@ltx/en_us_holycross/he.h.m8:heHE.OStereosasLogo.melody
ltx/en_us_holycross/oc.m8.d7:ocMA.OdeW3C1H.mode	@ltx/en_us_holycross/miscellanea:misc.Mode8
ltx/en_us_holycross/oc.m8.d7:ocMA.OdeW3C1H.ode	@ltx/en_us_holycross/miscellanea:misc.Ode3
ltx/en_us_holycross/oc.m8.d7:ocMA.OdeW3C1H.text	@ltx/en_us_holycross/he.h.m8:heHE.OStereosasLogo.text
ltx/en_us_holycross/oc.m8.d7:ocMA.OdeW3C1T.incipit	…
ltx/en_us_holycross/oc.m8.d7:ocMA.OdeW3C1T.melody	@ltx/en_us_holycross/he.h.m8:heHE.OStereosasLogo.notmetered
ltx/en_us_holycross/oc.m8.d7:ocMA.OdeW3C1T.mode	@ltx/en_us_holycross/miscellanea:misc.Mode8
ltx/en_us_holycross/oc.m8.d7:ocMA.OdeW3C1T.ode	@ltx/en_us_holycross/miscellanea:misc.Ode3
ltx/en_us_holycross/oc.m8.d7:ocMA.OdeW3C1T.text	
ltx/en_us_holycross/oc.m8.d7:ocMA.OdeW3C21.greekmelody	@ltx/en_us_holycross/he.h.m8:heHE.OuraniasApsidos.greekname
ltx/en_us_holycross/oc.m8.d7:ocMA.OdeW3C21.incipit	…
ltx/en_us_holycross/oc.m8.d7:ocMA.OdeW3C21.melody	@ltx/en_us_holycross/he.h.m8:heHE.OuraniasApsidos.notmetered
ltx/en_us_holycross/oc.m8.d7:ocMA.OdeW3C21.mode	@ltx/en_us_holycross/miscellanea:misc.Mode8
ltx/en_us_holycross/oc.m8.d7:ocMA.OdeW3C21.ode	@ltx/en_us_holycross/miscellanea:misc.Ode3
ltx/en_us_holycross/oc.m8.d7:ocMA.OdeW3C21.text	
ltx/en_us_holycross/oc.m8.d7:ocMA.OdeW3C22.incipit	…
ltx/en_us_holycross/oc.m8.d7:ocMA.OdeW3C22.melody	@ltx/en_us_holycross/he.h.m8:heHE.OuraniasApsidos.notmetered
ltx/en_us_holycross/oc.m8.d7:ocMA.OdeW3C22.mode	@ltx/en_us_holycross/miscellanea:misc.Mode8
ltx/en_us_holycross/oc.m8.d7:ocMA.OdeW3C22.ode	@ltx/en_us_holycross/miscellanea:misc.Ode3
ltx/en_us_holycross/oc.m8.d7:ocMA.OdeW3C22.text	
ltx/en_us_holycross/oc.m8.d7:ocMA.OdeW3C23.incipit	…
ltx/en_us_holycross/oc.m8.d7:ocMA.OdeW3C23.melody	@ltx/en_us_holycross/he.h.m8:heHE.OuraniasApsidos.notmetered
ltx/en_us_holycross/oc.m8.d7:ocMA.OdeW3C23.mode	@ltx/en_us_holycross/miscellanea:misc.Mode8
ltx/en_us_holycross/oc.m8.d7:ocMA.OdeW3C23.ode	@ltx/en_us_holycross/miscellanea:misc.Ode3
ltx/en_us_holycross/oc.m8.d7:ocMA.OdeW3C23.text	
ltx/en_us_holycross/oc.m8.d7:ocMA.OdeW3C2T.incipit	…
ltx/en_us_holycross/oc.m8.d7:ocMA.OdeW3C2T.melody	@ltx/en_us_holycross/he.h.m8:heHE.OuraniasApsidos.notmetered
ltx/en_us_holycross/oc.m8.d7:ocMA.OdeW3C2T.mode	@ltx/en_us_holycross/miscellanea:misc.Mode8
ltx/en_us_holycross/oc.m8.d7:ocMA.OdeW3C2T.ode	@ltx/en_us_holycross/miscellanea:misc.Ode3
ltx/en_us_holycross/oc.m8.d7:ocMA.OdeW3C2T.text	
ltx/en_us_holycross/oc.m8.d7:ocMA.OdeW4C11.incipit	…
ltx/en_us_holycross/oc.m8.d7:ocMA.OdeW4C11.melody	@ltx/en_us_holycross/he.h.m8:heHE.EisakikoaKyrie.notmetered
ltx/en_us_holycross/oc.m8.d7:ocMA.OdeW4C11.mode	@ltx/en_us_holycross/miscellanea:misc.Mode8
ltx/en_us_holycross/oc.m8.d7:ocMA.OdeW4C11.ode	@ltx/en_us_holycross/miscellanea:misc.Ode4
ltx/en_us_holycross/oc.m8.d7:ocMA.OdeW4C11.text	
ltx/en_us_holycross/oc.m8.d7:ocMA.OdeW4C12.incipit	…
ltx/en_us_holycross/oc.m8.d7:ocMA.OdeW4C12.melody	@ltx/en_us_holycross/he.h.m8:heHE.EisakikoaKyrie.notmetered
ltx/en_us_holycross/oc.m8.d7:ocMA.OdeW4C12.mode	@ltx/en_us_holycross/miscellanea:misc.Mode8
ltx/en_us_holycross/oc.m8.d7:ocMA.OdeW4C12.ode	@ltx/en_us_holycross/miscellanea:misc.Ode4
ltx/en_us_holycross/oc.m8.d7:ocMA.OdeW4C12.text	
ltx/en_us_holycross/oc.m8.d7:ocMA.OdeW4C13.incipit	…
ltx/en_us_holycross/oc.m8.d7:ocMA.OdeW4C13.melody	@ltx/en_us_holycross/he.h.m8:heHE.EisakikoaKyrie.notmetered
ltx/en_us_holycross/oc.m8.d7:ocMA.OdeW4C13.mode	@ltx/en_us_holycross/miscellanea:misc.Mode8
ltx/en_us_holycross/oc.m8.d7:ocMA.OdeW4C13.ode	@ltx/en_us_holycross/miscellanea:misc.Ode4
ltx/en_us_holycross/oc.m8.d7:ocMA.OdeW4C13.text	
ltx/en_us_holycross/oc.m8.d7:ocMA.OdeW4C14.incipit	…
ltx/en_us_holycross/oc.m8.d7:ocMA.OdeW4C14.melody	@ltx/en_us_holycross/he.h.m8:heHE.EisakikoaKyrie.notmetered
ltx/en_us_holycross/oc.m8.d7:ocMA.OdeW4C14.mode	@ltx/en_us_holycross/miscellanea:misc.Mode8
ltx/en_us_holycross/oc.m8.d7:ocMA.OdeW4C14.ode	@ltx/en_us_holycross/miscellanea:misc.Ode4
ltx/en_us_holycross/oc.m8.d7:ocMA.OdeW4C14.text	
ltx/en_us_holycross/oc.m8.d7:ocMA.OdeW4C1H.greekmelody	@ltx/en_us_holycross/he.h.m8:heHE.EisakikoaKyrie.greekname
ltx/en_us_holycross/oc.m8.d7:ocMA.OdeW4C1H.incipit	@ltx/en_us_holycross/he.h.m8:heHE.EisakikoaKyrie.incipit
ltx/en_us_holycross/oc.m8.d7:ocMA.OdeW4C1H.melody	@ltx/en_us_holycross/he.h.m8:heHE.EisakikoaKyrie.melody
ltx/en_us_holycross/oc.m8.d7:ocMA.OdeW4C1H.mode	@ltx/en_us_holycross/miscellanea:misc.Mode8
ltx/en_us_holycross/oc.m8.d7:ocMA.OdeW4C1H.ode	@ltx/en_us_holycross/miscellanea:misc.Ode4
ltx/en_us_holycross/oc.m8.d7:ocMA.OdeW4C1H.text	@ltx/en_us_holycross/he.h.m8:heHE.EisakikoaKyrie.text
ltx/en_us_holycross/oc.m8.d7:ocMA.OdeW4C1T.incipit	…
ltx/en_us_holycross/oc.m8.d7:ocMA.OdeW4C1T.melody	@ltx/en_us_holycross/he.h.m8:heHE.EisakikoaKyrie.notmetered
ltx/en_us_holycross/oc.m8.d7:ocMA.OdeW4C1T.mode	@ltx/en_us_holycross/miscellanea:misc.Mode8
ltx/en_us_holycross/oc.m8.d7:ocMA.OdeW4C1T.ode	@ltx/en_us_holycross/miscellanea:misc.Ode4
ltx/en_us_holycross/oc.m8.d7:ocMA.OdeW4C1T.text	
ltx/en_us_holycross/oc.m8.d7:ocMA.OdeW4C21.greekmelody	@ltx/en_us_holycross/he.h.m8:heHE.SyMouIschys.greekname
ltx/en_us_holycross/oc.m8.d7:ocMA.OdeW4C21.incipit	…
ltx/en_us_holycross/oc.m8.d7:ocMA.OdeW4C21.melody	@ltx/en_us_holycross/he.h.m8:heHE.SyMouIschys.notmetered
ltx/en_us_holycross/oc.m8.d7:ocMA.OdeW4C21.mode	@ltx/en_us_holycross/miscellanea:misc.Mode8
ltx/en_us_holycross/oc.m8.d7:ocMA.OdeW4C21.ode	@ltx/en_us_holycross/miscellanea:misc.Ode4
ltx/en_us_holycross/oc.m8.d7:ocMA.OdeW4C21.text	
ltx/en_us_holycross/oc.m8.d7:ocMA.OdeW4C22.incipit	…
ltx/en_us_holycross/oc.m8.d7:ocMA.OdeW4C22.melody	@ltx/en_us_holycross/he.h.m8:heHE.SyMouIschys.notmetered
ltx/en_us_holycross/oc.m8.d7:ocMA.OdeW4C22.mode	@ltx/en_us_holycross/miscellanea:misc.Mode8
ltx/en_us_holycross/oc.m8.d7:ocMA.OdeW4C22.ode	@ltx/en_us_holycross/miscellanea:misc.Ode4
ltx/en_us_holycross/oc.m8.d7:ocMA.OdeW4C22.text	
ltx/en_us_holycross/oc.m8.d7:ocMA.OdeW4C23.incipit	…
ltx/en_us_holycross/oc.m8.d7:ocMA.OdeW4C23.melody	@ltx/en_us_holycross/he.h.m8:heHE.SyMouIschys.notmetered
ltx/en_us_holycross/oc.m8.d7:ocMA.OdeW4C23.mode	@ltx/en_us_holycross/miscellanea:misc.Mode8
ltx/en_us_holycross/oc.m8.d7:ocMA.OdeW4C23.ode	@ltx/en_us_holycross/miscellanea:misc.Ode4
ltx/en_us_holycross/oc.m8.d7:ocMA.OdeW4C23.text	
ltx/en_us_holycross/oc.m8.d7:ocMA.OdeW4C2T.incipit	…
ltx/en_us_holycross/oc.m8.d7:ocMA.OdeW4C2T.melody	@ltx/en_us_holycross/he.h.m8:heHE.SyMouIschys.notmetered
ltx/en_us_holycross/oc.m8.d7:ocMA.OdeW4C2T.mode	@ltx/en_us_holycross/miscellanea:misc.Mode8
ltx/en_us_holycross/oc.m8.d7:ocMA.OdeW4C2T.ode	@ltx/en_us_holycross/miscellanea:misc.Ode4
ltx/en_us_holycross/oc.m8.d7:ocMA.OdeW4C2T.text	
ltx/en_us_holycross/oc.m8.d7:ocMA.OdeW5C11.incipit	…
ltx/en_us_holycross/oc.m8.d7:ocMA.OdeW5C11.melody	@ltx/en_us_holycross/he.h.m8:heHE.FotisonImas.notmetered
ltx/en_us_holycross/oc.m8.d7:ocMA.OdeW5C11.mode	@ltx/en_us_holycross/miscellanea:misc.Mode8
ltx/en_us_holycross/oc.m8.d7:ocMA.OdeW5C11.ode	@ltx/en_us_holycross/miscellanea:misc.Ode5
ltx/en_us_holycross/oc.m8.d7:ocMA.OdeW5C11.text	
ltx/en_us_holycross/oc.m8.d7:ocMA.OdeW5C12.incipit	…
ltx/en_us_holycross/oc.m8.d7:ocMA.OdeW5C12.melody	@ltx/en_us_holycross/he.h.m8:heHE.FotisonImas.notmetered
ltx/en_us_holycross/oc.m8.d7:ocMA.OdeW5C12.mode	@ltx/en_us_holycross/miscellanea:misc.Mode8
ltx/en_us_holycross/oc.m8.d7:ocMA.OdeW5C12.ode	@ltx/en_us_holycross/miscellanea:misc.Ode5
ltx/en_us_holycross/oc.m8.d7:ocMA.OdeW5C12.text	
ltx/en_us_holycross/oc.m8.d7:ocMA.OdeW5C13.incipit	…
ltx/en_us_holycross/oc.m8.d7:ocMA.OdeW5C13.melody	@ltx/en_us_holycross/he.h.m8:heHE.FotisonImas.notmetered
ltx/en_us_holycross/oc.m8.d7:ocMA.OdeW5C13.mode	@ltx/en_us_holycross/miscellanea:misc.Mode8
ltx/en_us_holycross/oc.m8.d7:ocMA.OdeW5C13.ode	@ltx/en_us_holycross/miscellanea:misc.Ode5
ltx/en_us_holycross/oc.m8.d7:ocMA.OdeW5C13.text	
ltx/en_us_holycross/oc.m8.d7:ocMA.OdeW5C14.incipit	…
ltx/en_us_holycross/oc.m8.d7:ocMA.OdeW5C14.melody	@ltx/en_us_holycross/he.h.m8:heHE.FotisonImas.notmetered
ltx/en_us_holycross/oc.m8.d7:ocMA.OdeW5C14.mode	@ltx/en_us_holycross/miscellanea:misc.Mode8
ltx/en_us_holycross/oc.m8.d7:ocMA.OdeW5C14.ode	@ltx/en_us_holycross/miscellanea:misc.Ode5
ltx/en_us_holycross/oc.m8.d7:ocMA.OdeW5C14.text	
ltx/en_us_holycross/oc.m8.d7:ocMA.OdeW5C1H.greekmelody	@ltx/en_us_holycross/he.h.m8:heHE.FotisonImas.greekname
ltx/en_us_holycross/oc.m8.d7:ocMA.OdeW5C1H.incipit	@ltx/en_us_holycross/he.h.m8:heHE.FotisonImas.incipit
ltx/en_us_holycross/oc.m8.d7:ocMA.OdeW5C1H.melody	@ltx/en_us_holycross/he.h.m8:heHE.FotisonImas.melody
ltx/en_us_holycross/oc.m8.d7:ocMA.OdeW5C1H.mode	@ltx/en_us_holycross/miscellanea:misc.Mode8
ltx/en_us_holycross/oc.m8.d7:ocMA.OdeW5C1H.ode	@ltx/en_us_holycross/miscellanea:misc.Ode5
ltx/en_us_holycross/oc.m8.d7:ocMA.OdeW5C1H.text	@ltx/en_us_holycross/he.h.m8:heHE.FotisonImas.text
ltx/en_us_holycross/oc.m8.d7:ocMA.OdeW5C1T.incipit	…
ltx/en_us_holycross/oc.m8.d7:ocMA.OdeW5C1T.melody	@ltx/en_us_holycross/he.h.m8:heHE.FotisonImas.notmetered
ltx/en_us_holycross/oc.m8.d7:ocMA.OdeW5C1T.mode	@ltx/en_us_holycross/miscellanea:misc.Mode8
ltx/en_us_holycross/oc.m8.d7:ocMA.OdeW5C1T.ode	@ltx/en_us_holycross/miscellanea:misc.Ode5
ltx/en_us_holycross/oc.m8.d7:ocMA.OdeW5C1T.text	
ltx/en_us_holycross/oc.m8.d7:ocMA.OdeW5C21.greekmelody	@ltx/en_us_holycross/he.h.m8:heHE.InaTiMeAposo.greekname
ltx/en_us_holycross/oc.m8.d7:ocMA.OdeW5C21.incipit	…
ltx/en_us_holycross/oc.m8.d7:ocMA.OdeW5C21.melody	@ltx/en_us_holycross/he.h.m8:heHE.InaTiMeAposo.notmetered
ltx/en_us_holycross/oc.m8.d7:ocMA.OdeW5C21.mode	@ltx/en_us_holycross/miscellanea:misc.Mode8
ltx/en_us_holycross/oc.m8.d7:ocMA.OdeW5C21.ode	@ltx/en_us_holycross/miscellanea:misc.Ode5
ltx/en_us_holycross/oc.m8.d7:ocMA.OdeW5C21.text	
ltx/en_us_holycross/oc.m8.d7:ocMA.OdeW5C22.incipit	…
ltx/en_us_holycross/oc.m8.d7:ocMA.OdeW5C22.melody	@ltx/en_us_holycross/he.h.m8:heHE.InaTiMeAposo.notmetered
ltx/en_us_holycross/oc.m8.d7:ocMA.OdeW5C22.mode	@ltx/en_us_holycross/miscellanea:misc.Mode8
ltx/en_us_holycross/oc.m8.d7:ocMA.OdeW5C22.ode	@ltx/en_us_holycross/miscellanea:misc.Ode5
ltx/en_us_holycross/oc.m8.d7:ocMA.OdeW5C22.text	
ltx/en_us_holycross/oc.m8.d7:ocMA.OdeW5C23.incipit	…
ltx/en_us_holycross/oc.m8.d7:ocMA.OdeW5C23.melody	@ltx/en_us_holycross/he.h.m8:heHE.InaTiMeAposo.notmetered
ltx/en_us_holycross/oc.m8.d7:ocMA.OdeW5C23.mode	@ltx/en_us_holycross/miscellanea:misc.Mode8
ltx/en_us_holycross/oc.m8.d7:ocMA.OdeW5C23.ode	@ltx/en_us_holycross/miscellanea:misc.Ode5
ltx/en_us_holycross/oc.m8.d7:ocMA.OdeW5C23.text	
ltx/en_us_holycross/oc.m8.d7:ocMA.OdeW5C2T.incipit	…
ltx/en_us_holycross/oc.m8.d7:ocMA.OdeW5C2T.melody	@ltx/en_us_holycross/he.h.m8:heHE.InaTiMeAposo.notmetered
ltx/en_us_holycross/oc.m8.d7:ocMA.OdeW5C2T.mode	@ltx/en_us_holycross/miscellanea:misc.Mode8
ltx/en_us_holycross/oc.m8.d7:ocMA.OdeW5C2T.ode	@ltx/en_us_holycross/miscellanea:misc.Ode5
ltx/en_us_holycross/oc.m8.d7:ocMA.OdeW5C2T.text	
ltx/en_us_holycross/oc.m8.d7:ocMA.OdeW6C11.incipit	…
ltx/en_us_holycross/oc.m8.d7:ocMA.OdeW6C11.melody	@ltx/en_us_holycross/he.h.m8:heHE.IlasthitiMoiSotir.notmetered
ltx/en_us_holycross/oc.m8.d7:ocMA.OdeW6C11.mode	@ltx/en_us_holycross/miscellanea:misc.Mode8
ltx/en_us_holycross/oc.m8.d7:ocMA.OdeW6C11.ode	@ltx/en_us_holycross/miscellanea:misc.Ode6
ltx/en_us_holycross/oc.m8.d7:ocMA.OdeW6C11.text	
ltx/en_us_holycross/oc.m8.d7:ocMA.OdeW6C12.incipit	…
ltx/en_us_holycross/oc.m8.d7:ocMA.OdeW6C12.melody	@ltx/en_us_holycross/he.h.m8:heHE.IlasthitiMoiSotir.notmetered
ltx/en_us_holycross/oc.m8.d7:ocMA.OdeW6C12.mode	@ltx/en_us_holycross/miscellanea:misc.Mode8
ltx/en_us_holycross/oc.m8.d7:ocMA.OdeW6C12.ode	@ltx/en_us_holycross/miscellanea:misc.Ode6
ltx/en_us_holycross/oc.m8.d7:ocMA.OdeW6C12.text	
ltx/en_us_holycross/oc.m8.d7:ocMA.OdeW6C13.incipit	…
ltx/en_us_holycross/oc.m8.d7:ocMA.OdeW6C13.melody	@ltx/en_us_holycross/he.h.m8:heHE.IlasthitiMoiSotir.notmetered
ltx/en_us_holycross/oc.m8.d7:ocMA.OdeW6C13.mode	@ltx/en_us_holycross/miscellanea:misc.Mode8
ltx/en_us_holycross/oc.m8.d7:ocMA.OdeW6C13.ode	@ltx/en_us_holycross/miscellanea:misc.Ode6
ltx/en_us_holycross/oc.m8.d7:ocMA.OdeW6C13.text	
ltx/en_us_holycross/oc.m8.d7:ocMA.OdeW6C14.incipit	…
ltx/en_us_holycross/oc.m8.d7:ocMA.OdeW6C14.melody	@ltx/en_us_holycross/he.h.m8:heHE.IlasthitiMoiSotir.notmetered
ltx/en_us_holycross/oc.m8.d7:ocMA.OdeW6C14.mode	@ltx/en_us_holycross/miscellanea:misc.Mode8
ltx/en_us_holycross/oc.m8.d7:ocMA.OdeW6C14.ode	@ltx/en_us_holycross/miscellanea:misc.Ode6
ltx/en_us_holycross/oc.m8.d7:ocMA.OdeW6C14.text	
ltx/en_us_holycross/oc.m8.d7:ocMA.OdeW6C1H.greekmelody	@ltx/en_us_holycross/he.h.m8:heHE.IlasthitiMoiSotir.greekname
ltx/en_us_holycross/oc.m8.d7:ocMA.OdeW6C1H.incipit	@ltx/en_us_holycross/he.h.m8:heHE.IlasthitiMoiSotir.incipit
ltx/en_us_holycross/oc.m8.d7:ocMA.OdeW6C1H.melody	@ltx/en_us_holycross/he.h.m8:heHE.IlasthitiMoiSotir.melody
ltx/en_us_holycross/oc.m8.d7:ocMA.OdeW6C1H.mode	@ltx/en_us_holycross/miscellanea:misc.Mode8
ltx/en_us_holycross/oc.m8.d7:ocMA.OdeW6C1H.ode	@ltx/en_us_holycross/miscellanea:misc.Ode6
ltx/en_us_holycross/oc.m8.d7:ocMA.OdeW6C1H.text	@ltx/en_us_holycross/he.h.m8:heHE.IlasthitiMoiSotir.text
ltx/en_us_holycross/oc.m8.d7:ocMA.OdeW6C1T.incipit	…
ltx/en_us_holycross/oc.m8.d7:ocMA.OdeW6C1T.melody	@ltx/en_us_holycross/he.h.m8:heHE.IlasthitiMoiSotir.notmetered
ltx/en_us_holycross/oc.m8.d7:ocMA.OdeW6C1T.mode	@ltx/en_us_holycross/miscellanea:misc.Mode8
ltx/en_us_holycross/oc.m8.d7:ocMA.OdeW6C1T.ode	@ltx/en_us_holycross/miscellanea:misc.Ode6
ltx/en_us_holycross/oc.m8.d7:ocMA.OdeW6C1T.text	
ltx/en_us_holycross/oc.m8.d7:ocMA.OdeW6C21.greekmelody	@ltx/en_us_holycross/he.h.m8:heHE.IlasthitiMoiSotir.greekname
ltx/en_us_holycross/oc.m8.d7:ocMA.OdeW6C21.incipit	…
ltx/en_us_holycross/oc.m8.d7:ocMA.OdeW6C21.melody	@ltx/en_us_holycross/he.h.m8:heHE.IlasthitiMoiSotir.notmetered
ltx/en_us_holycross/oc.m8.d7:ocMA.OdeW6C21.mode	@ltx/en_us_holycross/miscellanea:misc.Mode8
ltx/en_us_holycross/oc.m8.d7:ocMA.OdeW6C21.ode	@ltx/en_us_holycross/miscellanea:misc.Ode6
ltx/en_us_holycross/oc.m8.d7:ocMA.OdeW6C21.text	
ltx/en_us_holycross/oc.m8.d7:ocMA.OdeW6C22.incipit	…
ltx/en_us_holycross/oc.m8.d7:ocMA.OdeW6C22.melody	@ltx/en_us_holycross/he.h.m8:heHE.IlasthitiMoiSotir.notmetered
ltx/en_us_holycross/oc.m8.d7:ocMA.OdeW6C22.mode	@ltx/en_us_holycross/miscellanea:misc.Mode8
ltx/en_us_holycross/oc.m8.d7:ocMA.OdeW6C22.ode	@ltx/en_us_holycross/miscellanea:misc.Ode6
ltx/en_us_holycross/oc.m8.d7:ocMA.OdeW6C22.text	
ltx/en_us_holycross/oc.m8.d7:ocMA.OdeW6C23.incipit	…
ltx/en_us_holycross/oc.m8.d7:ocMA.OdeW6C23.melody	@ltx/en_us_holycross/he.h.m8:heHE.IlasthitiMoiSotir.notmetered
ltx/en_us_holycross/oc.m8.d7:ocMA.OdeW6C23.mode	@ltx/en_us_holycross/miscellanea:misc.Mode8
ltx/en_us_holycross/oc.m8.d7:ocMA.OdeW6C23.ode	@ltx/en_us_holycross/miscellanea:misc.Ode6
ltx/en_us_holycross/oc.m8.d7:ocMA.OdeW6C23.text	
ltx/en_us_holycross/oc.m8.d7:ocMA.OdeW6C2T.incipit	…
ltx/en_us_holycross/oc.m8.d7:ocMA.OdeW6C2T.melody	@ltx/en_us_holycross/he.h.m8:heHE.IlasthitiMoiSotir.notmetered
ltx/en_us_holycross/oc.m8.d7:ocMA.OdeW6C2T.mode	@ltx/en_us_holycross/miscellanea:misc.Mode8
ltx/en_us_holycross/oc.m8.d7:ocMA.OdeW6C2T.ode	@ltx/en_us_holycross/miscellanea:misc.Ode6
ltx/en_us_holycross/oc.m8.d7:ocMA.OdeW6C2T.text	
ltx/en_us_holycross/oc.m8.d7:ocMA.OdeW7C11.incipit	…
ltx/en_us_holycross/oc.m8.d7:ocMA.OdeW7C11.melody	@ltx/en_us_holycross/he.h.m8:heHE.PaidesTheoseveis.notmetered
ltx/en_us_holycross/oc.m8.d7:ocMA.OdeW7C11.mode	@ltx/en_us_holycross/miscellanea:misc.Mode8
ltx/en_us_holycross/oc.m8.d7:ocMA.OdeW7C11.ode	@ltx/en_us_holycross/miscellanea:misc.Ode7
ltx/en_us_holycross/oc.m8.d7:ocMA.OdeW7C11.text	
ltx/en_us_holycross/oc.m8.d7:ocMA.OdeW7C12.incipit	…
ltx/en_us_holycross/oc.m8.d7:ocMA.OdeW7C12.melody	@ltx/en_us_holycross/he.h.m8:heHE.PaidesTheoseveis.notmetered
ltx/en_us_holycross/oc.m8.d7:ocMA.OdeW7C12.mode	@ltx/en_us_holycross/miscellanea:misc.Mode8
ltx/en_us_holycross/oc.m8.d7:ocMA.OdeW7C12.ode	@ltx/en_us_holycross/miscellanea:misc.Ode7
ltx/en_us_holycross/oc.m8.d7:ocMA.OdeW7C12.text	
ltx/en_us_holycross/oc.m8.d7:ocMA.OdeW7C13.incipit	…
ltx/en_us_holycross/oc.m8.d7:ocMA.OdeW7C13.melody	@ltx/en_us_holycross/he.h.m8:heHE.PaidesTheoseveis.notmetered
ltx/en_us_holycross/oc.m8.d7:ocMA.OdeW7C13.mode	@ltx/en_us_holycross/miscellanea:misc.Mode8
ltx/en_us_holycross/oc.m8.d7:ocMA.OdeW7C13.ode	@ltx/en_us_holycross/miscellanea:misc.Ode7
ltx/en_us_holycross/oc.m8.d7:ocMA.OdeW7C13.text	
ltx/en_us_holycross/oc.m8.d7:ocMA.OdeW7C14.incipit	…
ltx/en_us_holycross/oc.m8.d7:ocMA.OdeW7C14.melody	@ltx/en_us_holycross/he.h.m8:heHE.PaidesTheoseveis.notmetered
ltx/en_us_holycross/oc.m8.d7:ocMA.OdeW7C14.mode	@ltx/en_us_holycross/miscellanea:misc.Mode8
ltx/en_us_holycross/oc.m8.d7:ocMA.OdeW7C14.ode	@ltx/en_us_holycross/miscellanea:misc.Ode7
ltx/en_us_holycross/oc.m8.d7:ocMA.OdeW7C14.text	
ltx/en_us_holycross/oc.m8.d7:ocMA.OdeW7C1H.greekmelody	@ltx/en_us_holycross/he.h.m8:heHE.PaidesTheoseveis.greekname
ltx/en_us_holycross/oc.m8.d7:ocMA.OdeW7C1H.incipit	@ltx/en_us_holycross/he.h.m8:heHE.PaidesTheoseveis.incipit
ltx/en_us_holycross/oc.m8.d7:ocMA.OdeW7C1H.melody	@ltx/en_us_holycross/he.h.m8:heHE.PaidesTheoseveis.melody
ltx/en_us_holycross/oc.m8.d7:ocMA.OdeW7C1H.mode	@ltx/en_us_holycross/miscellanea:misc.Mode8
ltx/en_us_holycross/oc.m8.d7:ocMA.OdeW7C1H.ode	@ltx/en_us_holycross/miscellanea:misc.Ode7
ltx/en_us_holycross/oc.m8.d7:ocMA.OdeW7C1H.text	@ltx/en_us_holycross/he.h.m8:heHE.PaidesTheoseveis.text
ltx/en_us_holycross/oc.m8.d7:ocMA.OdeW7C1T.incipit	…
ltx/en_us_holycross/oc.m8.d7:ocMA.OdeW7C1T.melody	@ltx/en_us_holycross/he.h.m8:heHE.PaidesTheoseveis.notmetered
ltx/en_us_holycross/oc.m8.d7:ocMA.OdeW7C1T.mode	@ltx/en_us_holycross/miscellanea:misc.Mode8
ltx/en_us_holycross/oc.m8.d7:ocMA.OdeW7C1T.ode	@ltx/en_us_holycross/miscellanea:misc.Ode7
ltx/en_us_holycross/oc.m8.d7:ocMA.OdeW7C1T.text	
ltx/en_us_holycross/oc.m8.d7:ocMA.OdeW7C21.greekmelody	@ltx/en_us_holycross/he.h.m8:heHE.PaidesEvraion.greekname
ltx/en_us_holycross/oc.m8.d7:ocMA.OdeW7C21.incipit	…
ltx/en_us_holycross/oc.m8.d7:ocMA.OdeW7C21.melody	@ltx/en_us_holycross/he.h.m8:heHE.PaidesEvraion.notmetered
ltx/en_us_holycross/oc.m8.d7:ocMA.OdeW7C21.mode	@ltx/en_us_holycross/miscellanea:misc.Mode8
ltx/en_us_holycross/oc.m8.d7:ocMA.OdeW7C21.ode	@ltx/en_us_holycross/miscellanea:misc.Ode7
ltx/en_us_holycross/oc.m8.d7:ocMA.OdeW7C21.text	
ltx/en_us_holycross/oc.m8.d7:ocMA.OdeW7C22.incipit	…
ltx/en_us_holycross/oc.m8.d7:ocMA.OdeW7C22.melody	@ltx/en_us_holycross/he.h.m8:heHE.PaidesEvraion.notmetered
ltx/en_us_holycross/oc.m8.d7:ocMA.OdeW7C22.mode	@ltx/en_us_holycross/miscellanea:misc.Mode8
ltx/en_us_holycross/oc.m8.d7:ocMA.OdeW7C22.ode	@ltx/en_us_holycross/miscellanea:misc.Ode7
ltx/en_us_holycross/oc.m8.d7:ocMA.OdeW7C22.text	
ltx/en_us_holycross/oc.m8.d7:ocMA.OdeW7C23.incipit	…
ltx/en_us_holycross/oc.m8.d7:ocMA.OdeW7C23.melody	@ltx/en_us_holycross/he.h.m8:heHE.PaidesEvraion.notmetered
ltx/en_us_holycross/oc.m8.d7:ocMA.OdeW7C23.mode	@ltx/en_us_holycross/miscellanea:misc.Mode8
ltx/en_us_holycross/oc.m8.d7:ocMA.OdeW7C23.ode	@ltx/en_us_holycross/miscellanea:misc.Ode7
ltx/en_us_holycross/oc.m8.d7:ocMA.OdeW7C23.text	
ltx/en_us_holycross/oc.m8.d7:ocMA.OdeW7C2T.incipit	…
ltx/en_us_holycross/oc.m8.d7:ocMA.OdeW7C2T.melody	@ltx/en_us_holycross/he.h.m8:heHE.PaidesEvraion.notmetered
ltx/en_us_holycross/oc.m8.d7:ocMA.OdeW7C2T.mode	@ltx/en_us_holycross/miscellanea:misc.Mode8
ltx/en_us_holycross/oc.m8.d7:ocMA.OdeW7C2T.ode	@ltx/en_us_holycross/miscellanea:misc.Ode7
ltx/en_us_holycross/oc.m8.d7:ocMA.OdeW7C2T.text	
ltx/en_us_holycross/oc.m8.d7:ocMA.OdeW8C11.incipit	…
ltx/en_us_holycross/oc.m8.d7:ocMA.OdeW8C11.melody	@ltx/en_us_holycross/he.h.m8:heHE.OiTheorrimonesPaides.notmetered
ltx/en_us_holycross/oc.m8.d7:ocMA.OdeW8C11.mode	@ltx/en_us_holycross/miscellanea:misc.Mode8
ltx/en_us_holycross/oc.m8.d7:ocMA.OdeW8C11.ode	@ltx/en_us_holycross/miscellanea:misc.Ode8
ltx/en_us_holycross/oc.m8.d7:ocMA.OdeW8C11.text	
ltx/en_us_holycross/oc.m8.d7:ocMA.OdeW8C12.incipit	…
ltx/en_us_holycross/oc.m8.d7:ocMA.OdeW8C12.melody	@ltx/en_us_holycross/he.h.m8:heHE.OiTheorrimonesPaides.notmetered
ltx/en_us_holycross/oc.m8.d7:ocMA.OdeW8C12.mode	@ltx/en_us_holycross/miscellanea:misc.Mode8
ltx/en_us_holycross/oc.m8.d7:ocMA.OdeW8C12.ode	@ltx/en_us_holycross/miscellanea:misc.Ode8
ltx/en_us_holycross/oc.m8.d7:ocMA.OdeW8C12.text	
ltx/en_us_holycross/oc.m8.d7:ocMA.OdeW8C13.incipit	…
ltx/en_us_holycross/oc.m8.d7:ocMA.OdeW8C13.melody	@ltx/en_us_holycross/he.h.m8:heHE.OiTheorrimonesPaides.notmetered
ltx/en_us_holycross/oc.m8.d7:ocMA.OdeW8C13.mode	@ltx/en_us_holycross/miscellanea:misc.Mode8
ltx/en_us_holycross/oc.m8.d7:ocMA.OdeW8C13.ode	@ltx/en_us_holycross/miscellanea:misc.Ode8
ltx/en_us_holycross/oc.m8.d7:ocMA.OdeW8C13.text	
ltx/en_us_holycross/oc.m8.d7:ocMA.OdeW8C14.incipit	…
ltx/en_us_holycross/oc.m8.d7:ocMA.OdeW8C14.melody	@ltx/en_us_holycross/he.h.m8:heHE.OiTheorrimonesPaides.notmetered
ltx/en_us_holycross/oc.m8.d7:ocMA.OdeW8C14.mode	@ltx/en_us_holycross/miscellanea:misc.Mode8
ltx/en_us_holycross/oc.m8.d7:ocMA.OdeW8C14.ode	@ltx/en_us_holycross/miscellanea:misc.Ode8
ltx/en_us_holycross/oc.m8.d7:ocMA.OdeW8C14.text	
ltx/en_us_holycross/oc.m8.d7:ocMA.OdeW8C1H.greekmelody	@ltx/en_us_holycross/he.h.m8:heHE.OiTheorrimonesPaides.greekname
ltx/en_us_holycross/oc.m8.d7:ocMA.OdeW8C1H.incipit	@ltx/en_us_holycross/he.h.m8:heHE.OiTheorrimonesPaides.incipit
ltx/en_us_holycross/oc.m8.d7:ocMA.OdeW8C1H.melody	@ltx/en_us_holycross/he.h.m8:heHE.OiTheorrimonesPaides.melody
ltx/en_us_holycross/oc.m8.d7:ocMA.OdeW8C1H.mode	@ltx/en_us_holycross/miscellanea:misc.Mode8
ltx/en_us_holycross/oc.m8.d7:ocMA.OdeW8C1H.ode	@ltx/en_us_holycross/miscellanea:misc.Ode8
ltx/en_us_holycross/oc.m8.d7:ocMA.OdeW8C1H.text	@ltx/en_us_holycross/he.h.m8:heHE.OiTheorrimonesPaides.text
ltx/en_us_holycross/oc.m8.d7:ocMA.OdeW8C1T.incipit	…
ltx/en_us_holycross/oc.m8.d7:ocMA.OdeW8C1T.melody	@ltx/en_us_holycross/he.h.m8:heHE.OiTheorrimonesPaides.notmetered
ltx/en_us_holycross/oc.m8.d7:ocMA.OdeW8C1T.mode	@ltx/en_us_holycross/miscellanea:misc.Mode8
ltx/en_us_holycross/oc.m8.d7:ocMA.OdeW8C1T.ode	@ltx/en_us_holycross/miscellanea:misc.Ode8
ltx/en_us_holycross/oc.m8.d7:ocMA.OdeW8C1T.text	
ltx/en_us_holycross/oc.m8.d7:ocMA.OdeW8C21.greekmelody	@ltx/en_us_holycross/he.h.m8:heHE.MousikonOrganon.greekname
ltx/en_us_holycross/oc.m8.d7:ocMA.OdeW8C21.incipit	…
ltx/en_us_holycross/oc.m8.d7:ocMA.OdeW8C21.melody	@ltx/en_us_holycross/he.h.m8:heHE.MousikonOrganon.notmetered
ltx/en_us_holycross/oc.m8.d7:ocMA.OdeW8C21.mode	@ltx/en_us_holycross/miscellanea:misc.Mode8
ltx/en_us_holycross/oc.m8.d7:ocMA.OdeW8C21.ode	@ltx/en_us_holycross/miscellanea:misc.Ode8
ltx/en_us_holycross/oc.m8.d7:ocMA.OdeW8C21.text	
ltx/en_us_holycross/oc.m8.d7:ocMA.OdeW8C22.incipit	…
ltx/en_us_holycross/oc.m8.d7:ocMA.OdeW8C22.melody	@ltx/en_us_holycross/he.h.m8:heHE.MousikonOrganon.notmetered
ltx/en_us_holycross/oc.m8.d7:ocMA.OdeW8C22.mode	@ltx/en_us_holycross/miscellanea:misc.Mode8
ltx/en_us_holycross/oc.m8.d7:ocMA.OdeW8C22.ode	@ltx/en_us_holycross/miscellanea:misc.Ode8
ltx/en_us_holycross/oc.m8.d7:ocMA.OdeW8C22.text	
ltx/en_us_holycross/oc.m8.d7:ocMA.OdeW8C23.incipit	…
ltx/en_us_holycross/oc.m8.d7:ocMA.OdeW8C23.melody	@ltx/en_us_holycross/he.h.m8:heHE.MousikonOrganon.notmetered
ltx/en_us_holycross/oc.m8.d7:ocMA.OdeW8C23.mode	@ltx/en_us_holycross/miscellanea:misc.Mode8
ltx/en_us_holycross/oc.m8.d7:ocMA.OdeW8C23.ode	@ltx/en_us_holycross/miscellanea:misc.Ode8
ltx/en_us_holycross/oc.m8.d7:ocMA.OdeW8C23.text	
ltx/en_us_holycross/oc.m8.d7:ocMA.OdeW8C2T.incipit	…
ltx/en_us_holycross/oc.m8.d7:ocMA.OdeW8C2T.melody	@ltx/en_us_holycross/he.h.m8:heHE.MousikonOrganon.notmetered
ltx/en_us_holycross/oc.m8.d7:ocMA.OdeW8C2T.mode	@ltx/en_us_holycross/miscellanea:misc.Mode8
ltx/en_us_holycross/oc.m8.d7:ocMA.OdeW8C2T.ode	@ltx/en_us_holycross/miscellanea:misc.Ode8
ltx/en_us_holycross/oc.m8.d7:ocMA.OdeW8C2T.text	
ltx/en_us_holycross/oc.m8.d7:ocMA.OdeW9C11.incipit	…
ltx/en_us_holycross/oc.m8.d7:ocMA.OdeW9C11.melody	@ltx/en_us_holycross/he.h.m8:heHE.SeTinApeirogamon.notmetered
ltx/en_us_holycross/oc.m8.d7:ocMA.OdeW9C11.mode	@ltx/en_us_holycross/miscellanea:misc.Mode8
ltx/en_us_holycross/oc.m8.d7:ocMA.OdeW9C11.ode	@ltx/en_us_holycross/miscellanea:misc.Ode9
ltx/en_us_holycross/oc.m8.d7:ocMA.OdeW9C11.text	
ltx/en_us_holycross/oc.m8.d7:ocMA.OdeW9C12.incipit	…
ltx/en_us_holycross/oc.m8.d7:ocMA.OdeW9C12.melody	@ltx/en_us_holycross/he.h.m8:heHE.SeTinApeirogamon.notmetered
ltx/en_us_holycross/oc.m8.d7:ocMA.OdeW9C12.mode	@ltx/en_us_holycross/miscellanea:misc.Mode8
ltx/en_us_holycross/oc.m8.d7:ocMA.OdeW9C12.ode	@ltx/en_us_holycross/miscellanea:misc.Ode9
ltx/en_us_holycross/oc.m8.d7:ocMA.OdeW9C12.text	
ltx/en_us_holycross/oc.m8.d7:ocMA.OdeW9C13.incipit	…
ltx/en_us_holycross/oc.m8.d7:ocMA.OdeW9C13.melody	@ltx/en_us_holycross/he.h.m8:heHE.SeTinApeirogamon.notmetered
ltx/en_us_holycross/oc.m8.d7:ocMA.OdeW9C13.mode	@ltx/en_us_holycross/miscellanea:misc.Mode8
ltx/en_us_holycross/oc.m8.d7:ocMA.OdeW9C13.ode	@ltx/en_us_holycross/miscellanea:misc.Ode9
ltx/en_us_holycross/oc.m8.d7:ocMA.OdeW9C13.text	
ltx/en_us_holycross/oc.m8.d7:ocMA.OdeW9C14.incipit	…
ltx/en_us_holycross/oc.m8.d7:ocMA.OdeW9C14.melody	@ltx/en_us_holycross/he.h.m8:heHE.SeTinApeirogamon.notmetered
ltx/en_us_holycross/oc.m8.d7:ocMA.OdeW9C14.mode	@ltx/en_us_holycross/miscellanea:misc.Mode8
ltx/en_us_holycross/oc.m8.d7:ocMA.OdeW9C14.ode	@ltx/en_us_holycross/miscellanea:misc.Ode9
ltx/en_us_holycross/oc.m8.d7:ocMA.OdeW9C14.text	
ltx/en_us_holycross/oc.m8.d7:ocMA.OdeW9C1H.greekmelody	@ltx/en_us_holycross/he.h.m8:heHE.SeTinApeirogamon.greekname
ltx/en_us_holycross/oc.m8.d7:ocMA.OdeW9C1H.incipit	@ltx/en_us_holycross/he.h.m8:heHE.SeTinApeirogamon.incipit
ltx/en_us_holycross/oc.m8.d7:ocMA.OdeW9C1H.melody	@ltx/en_us_holycross/he.h.m8:heHE.SeTinApeirogamon.melody
ltx/en_us_holycross/oc.m8.d7:ocMA.OdeW9C1H.mode	@ltx/en_us_holycross/miscellanea:misc.Mode8
ltx/en_us_holycross/oc.m8.d7:ocMA.OdeW9C1H.ode	@ltx/en_us_holycross/miscellanea:misc.Ode9
ltx/en_us_holycross/oc.m8.d7:ocMA.OdeW9C1H.text	@ltx/en_us_holycross/he.h.m8:heHE.SeTinApeirogamon.text
ltx/en_us_holycross/oc.m8.d7:ocMA.OdeW9C1T.incipit	…
ltx/en_us_holycross/oc.m8.d7:ocMA.OdeW9C1T.melody	@ltx/en_us_holycross/he.h.m8:heHE.SeTinApeirogamon.notmetered
ltx/en_us_holycross/oc.m8.d7:ocMA.OdeW9C1T.mode	@ltx/en_us_holycross/miscellanea:misc.Mode8
ltx/en_us_holycross/oc.m8.d7:ocMA.OdeW9C1T.ode	@ltx/en_us_holycross/miscellanea:misc.Ode9
ltx/en_us_holycross/oc.m8.d7:ocMA.OdeW9C1T.text	
ltx/en_us_holycross/oc.m8.d7:ocMA.OdeW9C21.greekmelody	@ltx/en_us_holycross/he.h.m8:heHE.EfrixePasaAkoi.greekname
ltx/en_us_holycross/oc.m8.d7:ocMA.OdeW9C21.incipit	…
ltx/en_us_holycross/oc.m8.d7:ocMA.OdeW9C21.melody	@ltx/en_us_holycross/he.h.m8:heHE.EfrixePasaAkoi.notmetered
ltx/en_us_holycross/oc.m8.d7:ocMA.OdeW9C21.mode	@ltx/en_us_holycross/miscellanea:misc.Mode8
ltx/en_us_holycross/oc.m8.d7:ocMA.OdeW9C21.ode	@ltx/en_us_holycross/miscellanea:misc.Ode9
ltx/en_us_holycross/oc.m8.d7:ocMA.OdeW9C21.text	
ltx/en_us_holycross/oc.m8.d7:ocMA.OdeW9C22.incipit	…
ltx/en_us_holycross/oc.m8.d7:ocMA.OdeW9C22.melody	@ltx/en_us_holycross/he.h.m8:heHE.EfrixePasaAkoi.notmetered
ltx/en_us_holycross/oc.m8.d7:ocMA.OdeW9C22.mode	@ltx/en_us_holycross/miscellanea:misc.Mode8
ltx/en_us_holycross/oc.m8.d7:ocMA.OdeW9C22.ode	@ltx/en_us_holycross/miscellanea:misc.Ode9
ltx/en_us_holycross/oc.m8.d7:ocMA.OdeW9C22.text	
ltx/en_us_holycross/oc.m8.d7:ocMA.OdeW9C23.incipit	…
ltx/en_us_holycross/oc.m8.d7:ocMA.OdeW9C23.melody	@ltx/en_us_holycross/he.h.m8:heHE.EfrixePasaAkoi.notmetered
ltx/en_us_holycross/oc.m8.d7:ocMA.OdeW9C23.mode	@ltx/en_us_holycross/miscellanea:misc.Mode8
ltx/en_us_holycross/oc.m8.d7:ocMA.OdeW9C23.ode	@ltx/en_us_holycross/miscellanea:misc.Ode9
ltx/en_us_holycross/oc.m8.d7:ocMA.OdeW9C23.text	
ltx/en_us_holycross/oc.m8.d7:ocMA.OdeW9C2T.incipit	…
ltx/en_us_holycross/oc.m8.d7:ocMA.OdeW9C2T.melody	@ltx/en_us_holycross/he.h.m8:heHE.EfrixePasaAkoi.notmetered
ltx/en_us_holycross/oc.m8.d7:ocMA.OdeW9C2T.mode	@ltx/en_us_holycross/miscellanea:misc.Mode8
ltx/en_us_holycross/oc.m8.d7:ocMA.OdeW9C2T.ode	@ltx/en_us_holycross/miscellanea:misc.Ode9
ltx/en_us_holycross/oc.m8.d7:ocMA.OdeW9C2T.text	
ltx/en_us_holycross/oc.m8.d7:ocVE.ApolTheotokionVM.incipit	@ltx/en_us_holycross/oc.m8.d1:ocVE.ApolTheotokionVM.incipit
ltx/en_us_holycross/oc.m8.d7:ocVE.ApolTheotokionVM.melody	
ltx/en_us_holycross/oc.m8.d7:ocVE.ApolTheotokionVM.mode	@ltx/en_us_holycross/miscellanea:misc.Mode8
ltx/en_us_holycross/oc.m8.d7:ocVE.ApolTheotokionVM.text	@ltx/en_us_holycross/oc.m8.d1:ocVE.ApolTheotokionVM.text
ltx/en_us_holycross/oc.m8.d7:ocVE.AposTheotokion.incipit	…
ltx/en_us_holycross/oc.m8.d7:ocVE.AposTheotokion.melody	
ltx/en_us_holycross/oc.m8.d7:ocVE.AposTheotokion.mode	@ltx/en_us_holycross/miscellanea:misc.Mode8
ltx/en_us_holycross/oc.m8.d7:ocVE.AposTheotokion.text	
ltx/en_us_holycross/oc.m8.d7:ocVE.Aposticha1.incipit	@ltx/en_us_holycross/oc.m8.d2:ocVE.Aposticha3.incipit
ltx/en_us_holycross/oc.m8.d7:ocVE.Aposticha1.melody	
ltx/en_us_holycross/oc.m8.d7:ocVE.Aposticha1.mode	@ltx/en_us_holycross/miscellanea:misc.Mode8
ltx/en_us_holycross/oc.m8.d7:ocVE.Aposticha1.text	@ltx/en_us_holycross/oc.m8.d2:ocVE.Aposticha3.text
ltx/en_us_holycross/oc.m8.d7:ocVE.Aposticha2.incipit	…
ltx/en_us_holycross/oc.m8.d7:ocVE.Aposticha2.melody	
ltx/en_us_holycross/oc.m8.d7:ocVE.Aposticha2.mode	@ltx/en_us_holycross/miscellanea:misc.Mode8
ltx/en_us_holycross/oc.m8.d7:ocVE.Aposticha2.text	
ltx/en_us_holycross/oc.m8.d7:ocVE.Aposticha3.incipit	…
ltx/en_us_holycross/oc.m8.d7:ocVE.Aposticha3.melody	
ltx/en_us_holycross/oc.m8.d7:ocVE.Aposticha3.mode	@ltx/en_us_holycross/miscellanea:misc.Mode8
ltx/en_us_holycross/oc.m8.d7:ocVE.Aposticha3.text	
ltx/en_us_holycross/oc.m8.d7:ocVE.SticTheotokion.incipit	@ltx/en_us_holycross/oc.m8.d1:ocVE.SticTheotokion.incipit
ltx/en_us_holycross/oc.m8.d7:ocVE.SticTheotokion.melody	
ltx/en_us_holycross/oc.m8.d7:ocVE.SticTheotokion.mode	@ltx/en_us_holycross/miscellanea:misc.Mode8
ltx/en_us_holycross/oc.m8.d7:ocVE.SticTheotokion.text	@ltx/en_us_holycross/oc.m8.d1:ocVE.SticTheotokion.text
ltx/en_us_holycross/oc.m8.d7:ocVE.Stichera1.incipit	@ltx/en_us_holycross/oc.m8.d3:ocVE.Aposticha3.incipit
ltx/en_us_holycross/oc.m8.d7:ocVE.Stichera1.melody	
ltx/en_us_holycross/oc.m8.d7:ocVE.Stichera1.mode	@ltx/en_us_holycross/miscellanea:misc.Mode8
ltx/en_us_holycross/oc.m8.d7:ocVE.Stichera1.text	@ltx/en_us_holycross/oc.m8.d3:ocVE.Aposticha3.text
ltx/en_us_holycross/oc.m8.d7:ocVE.Stichera2.incipit	@ltx/en_us_holycross/he.a.m8:heAU.OiMartyresSouKyrie.incipit
ltx/en_us_holycross/oc.m8.d7:ocVE.Stichera2.melody	@ltx/en_us_holycross/he.a.m8:heAU.OiMartyresSouKyrie.melody
ltx/en_us_holycross/oc.m8.d7:ocVE.Stichera2.mode	@ltx/en_us_holycross/miscellanea:misc.Mode8
ltx/en_us_holycross/oc.m8.d7:ocVE.Stichera2.text	@ltx/en_us_holycross/he.a.m8:heAU.OiMartyresSouKyrie.text
ltx/en_us_holycross/oc.m8.d7:ocVE.Stichera3.incipit	@ltx/en_us_holycross/oc.m8.d5:ocVE.Aposticha3.incipit
ltx/en_us_holycross/oc.m8.d7:ocVE.Stichera3.melody	
ltx/en_us_holycross/oc.m8.d7:ocVE.Stichera3.mode	@ltx/en_us_holycross/miscellanea:misc.Mode8
ltx/en_us_holycross/oc.m8.d7:ocVE.Stichera3.text	@ltx/en_us_holycross/oc.m8.d5:ocVE.Aposticha3.text
ltx/en_us_holycross/oc.m8.d7:ocVE.Stichera4.greekmelody	@ltx/en_us_holycross/he.a.m8:heAU.OTouParadoxou.greekname
ltx/en_us_holycross/oc.m8.d7:ocVE.Stichera4.incipit	…
ltx/en_us_holycross/oc.m8.d7:ocVE.Stichera4.melody	@ltx/en_us_holycross/he.a.m8:heAU.OTouParadoxou.notmetered
ltx/en_us_holycross/oc.m8.d7:ocVE.Stichera4.mode	@ltx/en_us_holycross/miscellanea:misc.Mode8
ltx/en_us_holycross/oc.m8.d7:ocVE.Stichera4.text	
ltx/en_us_holycross/oc.m8.d7:ocVE.Stichera5.incipit	…
ltx/en_us_holycross/oc.m8.d7:ocVE.Stichera5.melody	@ltx/en_us_holycross/he.a.m8:heAU.OTouParadoxou.notmetered
ltx/en_us_holycross/oc.m8.d7:ocVE.Stichera5.mode	@ltx/en_us_holycross/miscellanea:misc.Mode8
ltx/en_us_holycross/oc.m8.d7:ocVE.Stichera5.text	
ltx/en_us_holycross/oc.m8.d7:ocVE.Stichera6.incipit	…
ltx/en_us_holycross/oc.m8.d7:ocVE.Stichera6.melody	@ltx/en_us_holycross/he.a.m8:heAU.OTouParadoxou.notmetered
ltx/en_us_holycross/oc.m8.d7:ocVE.Stichera6.mode	@ltx/en_us_holycross/miscellanea:misc.Mode8
ltx/en_us_holycross/oc.m8.d7:ocVE.Stichera6.text	
ltx/en_us_holycross/oc.m8.d7:octrMA.AposGlory.incipit	@ltx/en_us_holycross/oc.m8.d7:ocMA.Aposticha4.incipit
ltx/en_us_holycross/oc.m8.d7:octrMA.AposGlory.melody	@ltx/en_us_holycross/oc.m8.d7:ocMA.Aposticha4.melody
ltx/en_us_holycross/oc.m8.d7:octrMA.AposGlory.mode	@ltx/en_us_holycross/miscellanea:misc.Mode8
ltx/en_us_holycross/oc.m8.d7:octrMA.AposGlory.text	@ltx/en_us_holycross/oc.m8.d7:ocMA.Aposticha4.text
ltx/en_us_holycross/oc.m8.d7:octrMA.AposTheotokion.incipit	@ltx/en_us_holycross/oc.m8.d7:ocMA.AposTheotokion.incipit
ltx/en_us_holycross/oc.m8.d7:octrMA.AposTheotokion.melody	@ltx/en_us_holycross/oc.m8.d7:ocMA.AposTheotokion.melody
ltx/en_us_holycross/oc.m8.d7:octrMA.AposTheotokion.mode	@ltx/en_us_holycross/miscellanea:misc.Mode8
ltx/en_us_holycross/oc.m8.d7:octrMA.AposTheotokion.text	@ltx/en_us_holycross/oc.m8.d7:ocMA.AposTheotokion.text
ltx/en_us_holycross/oc.m8.d7:octrMA.Aposticha1.greekmelody	@ltx/en_us_holycross/oc.m8.d7:ocMA.Aposticha1.greekmelody
ltx/en_us_holycross/oc.m8.d7:octrMA.Aposticha1.incipit	@ltx/en_us_holycross/oc.m8.d7:ocMA.Aposticha1.incipit
ltx/en_us_holycross/oc.m8.d7:octrMA.Aposticha1.melody	@ltx/en_us_holycross/oc.m8.d7:ocMA.Aposticha1.melody
ltx/en_us_holycross/oc.m8.d7:octrMA.Aposticha1.mode	@ltx/en_us_holycross/miscellanea:misc.Mode8
ltx/en_us_holycross/oc.m8.d7:octrMA.Aposticha1.text	@ltx/en_us_holycross/oc.m8.d7:ocMA.Aposticha1.text
ltx/en_us_holycross/oc.m8.d7:octrMA.Aposticha2.incipit	@ltx/en_us_holycross/oc.m8.d7:ocMA.Aposticha2.incipit
ltx/en_us_holycross/oc.m8.d7:octrMA.Aposticha2.melody	@ltx/en_us_holycross/oc.m8.d7:ocMA.Aposticha2.melody
ltx/en_us_holycross/oc.m8.d7:octrMA.Aposticha2.mode	@ltx/en_us_holycross/miscellanea:misc.Mode8
ltx/en_us_holycross/oc.m8.d7:octrMA.Aposticha2.text	@ltx/en_us_holycross/oc.m8.d7:ocMA.Aposticha2.text
ltx/en_us_holycross/oc.m8.d7:octrMA.Aposticha3.incipit	@ltx/en_us_holycross/oc.m8.d7:ocMA.Aposticha3.incipit
ltx/en_us_holycross/oc.m8.d7:octrMA.Aposticha3.melody	@ltx/en_us_holycross/oc.m8.d7:ocMA.Aposticha3.melody
ltx/en_us_holycross/oc.m8.d7:octrMA.Aposticha3.mode	@ltx/en_us_holycross/miscellanea:misc.Mode8
ltx/en_us_holycross/oc.m8.d7:octrMA.Aposticha3.text	@ltx/en_us_holycross/oc.m8.d7:ocMA.Aposticha3.text
ltx/en_us_holycross/oc.m8.d7:octrMA.Kathisma11.incipit	@ltx/en_us_holycross/oc.m8.d7:ocMA.Kathisma11.incipit
ltx/en_us_holycross/oc.m8.d7:octrMA.Kathisma11.melody	
ltx/en_us_holycross/oc.m8.d7:octrMA.Kathisma11.mode	@ltx/en_us_holycross/miscellanea:misc.Mode8
ltx/en_us_holycross/oc.m8.d7:octrMA.Kathisma11.text	@ltx/en_us_holycross/oc.m8.d7:ocMA.Kathisma11.text
ltx/en_us_holycross/oc.m8.d7:octrMA.Kathisma12.greekmelody	@ltx/en_us_holycross/oc.m8.d7:ocMA.Kathisma13.greekmelody
ltx/en_us_holycross/oc.m8.d7:octrMA.Kathisma12.incipit	@ltx/en_us_holycross/oc.m8.d7:ocMA.Kathisma13.incipit
ltx/en_us_holycross/oc.m8.d7:octrMA.Kathisma12.melody	@ltx/en_us_holycross/oc.m8.d7:ocMA.Kathisma13.melody
ltx/en_us_holycross/oc.m8.d7:octrMA.Kathisma12.mode	@ltx/en_us_holycross/miscellanea:misc.Mode8
ltx/en_us_holycross/oc.m8.d7:octrMA.Kathisma12.text	@ltx/en_us_holycross/oc.m8.d7:ocMA.Kathisma13.text
ltx/en_us_holycross/oc.m8.d7:octrMA.Kathisma13.greekmelody	@ltx/en_us_holycross/oc.m8.d7:ocMA.Kathisma12.greekmelody
ltx/en_us_holycross/oc.m8.d7:octrMA.Kathisma13.incipit	@ltx/en_us_holycross/oc.m8.d7:ocMA.Kathisma12.incipit
ltx/en_us_holycross/oc.m8.d7:octrMA.Kathisma13.melody	@ltx/en_us_holycross/oc.m8.d7:ocMA.Kathisma12.melody
ltx/en_us_holycross/oc.m8.d7:octrMA.Kathisma13.mode	@ltx/en_us_holycross/miscellanea:misc.Mode8
ltx/en_us_holycross/oc.m8.d7:octrMA.Kathisma13.text	@ltx/en_us_holycross/oc.m8.d7:ocMA.Kathisma12.text
ltx/en_us_holycross/oc.m8.d7:octrMA.Kathisma14.incipit	@ltx/en_us_holycross/oc.m8.d7:ocMA.Kathisma23.incipit
ltx/en_us_holycross/oc.m8.d7:octrMA.Kathisma14.melody	
ltx/en_us_holycross/oc.m8.d7:octrMA.Kathisma14.mode	@ltx/en_us_holycross/miscellanea:misc.Mode8
ltx/en_us_holycross/oc.m8.d7:octrMA.Kathisma14.text	@ltx/en_us_holycross/oc.m8.d7:ocMA.Kathisma23.text
ltx/en_us_holycross/oc.m8.d7:octrMA.Kathisma1T.incipit	@ltx/en_us_holycross/oc.m8.d7:ocMA.Kathisma24.incipit
ltx/en_us_holycross/oc.m8.d7:octrMA.Kathisma1T.melody	
ltx/en_us_holycross/oc.m8.d7:octrMA.Kathisma1T.mode	@ltx/en_us_holycross/miscellanea:misc.Mode8
ltx/en_us_holycross/oc.m8.d7:octrMA.Kathisma1T.text	@ltx/en_us_holycross/oc.m8.d7:ocMA.Kathisma24.text
ltx/en_us_holycross/oc.m8.d7:octrMA.Lauds1.greekmelody	@ltx/en_us_holycross/oc.m8.d7:ocMA.Lauds4.greekmelody
ltx/en_us_holycross/oc.m8.d7:octrMA.Lauds1.incipit	@ltx/en_us_holycross/oc.m8.d7:ocMA.Lauds4.incipit
ltx/en_us_holycross/oc.m8.d7:octrMA.Lauds1.melody	@ltx/en_us_holycross/oc.m8.d7:ocMA.Lauds4.melody
ltx/en_us_holycross/oc.m8.d7:octrMA.Lauds1.mode	@ltx/en_us_holycross/miscellanea:misc.Mode8
ltx/en_us_holycross/oc.m8.d7:octrMA.Lauds1.text	@ltx/en_us_holycross/oc.m8.d7:ocMA.Lauds4.text
ltx/en_us_holycross/oc.m8.d7:octrMA.Lauds2.greekmelody	@ltx/en_us_holycross/oc.m8.d7:ocMA.Lauds1.greekmelody
ltx/en_us_holycross/oc.m8.d7:octrMA.Lauds2.incipit	@ltx/en_us_holycross/oc.m8.d7:ocMA.Lauds1.incipit
ltx/en_us_holycross/oc.m8.d7:octrMA.Lauds2.melody	@ltx/en_us_holycross/oc.m8.d7:ocMA.Lauds1.melody
ltx/en_us_holycross/oc.m8.d7:octrMA.Lauds2.mode	@ltx/en_us_holycross/miscellanea:misc.Mode8
ltx/en_us_holycross/oc.m8.d7:octrMA.Lauds2.text	@ltx/en_us_holycross/oc.m8.d7:ocMA.Lauds1.text
ltx/en_us_holycross/oc.m8.d7:octrMA.Lauds3.greekmelody	@ltx/en_us_holycross/oc.m8.d7:ocMA.Lauds2.greekmelody
ltx/en_us_holycross/oc.m8.d7:octrMA.Lauds3.incipit	@ltx/en_us_holycross/oc.m8.d7:ocMA.Lauds2.incipit
ltx/en_us_holycross/oc.m8.d7:octrMA.Lauds3.melody	@ltx/en_us_holycross/oc.m8.d7:ocMA.Lauds2.melody
ltx/en_us_holycross/oc.m8.d7:octrMA.Lauds3.mode	@ltx/en_us_holycross/miscellanea:misc.Mode8
ltx/en_us_holycross/oc.m8.d7:octrMA.Lauds3.text	@ltx/en_us_holycross/oc.m8.d7:ocMA.Lauds2.text
ltx/en_us_holycross/oc.m8.d7:octrMA.Lauds4.incipit	@ltx/en_us_holycross/oc.m8.d7:ocMA.Lauds3.incipit
ltx/en_us_holycross/oc.m8.d7:octrMA.Lauds4.melody	
ltx/en_us_holycross/oc.m8.d7:octrMA.Lauds4.mode	@ltx/en_us_holycross/miscellanea:misc.Mode8
ltx/en_us_holycross/oc.m8.d7:octrMA.Lauds4.text	@ltx/en_us_holycross/oc.m8.d7:ocMA.Lauds3.text
ltx/en_us_holycross/oc.m8.d7:octrMA.LaudsGlory.incipit	@ltx/en_us_holycross/oc.m8.d7:ocVE.Aposticha3.incipit
ltx/en_us_holycross/oc.m8.d7:octrMA.LaudsGlory.melody	
ltx/en_us_holycross/oc.m8.d7:octrMA.LaudsGlory.mode	@ltx/en_us_holycross/miscellanea:misc.Mode8
ltx/en_us_holycross/oc.m8.d7:octrMA.LaudsGlory.text	@ltx/en_us_holycross/oc.m8.d7:ocVE.Aposticha3.text
ltx/en_us_holycross/oc.m8.d7:octrMA.LaudsTheotokion.incipit	@ltx/en_us_holycross/oc.m8.d3:ocVE.AposTheotokion.incipit
ltx/en_us_holycross/oc.m8.d7:octrMA.LaudsTheotokion.melody	
ltx/en_us_holycross/oc.m8.d7:octrMA.LaudsTheotokion.mode	@ltx/en_us_holycross/miscellanea:misc.Mode8
ltx/en_us_holycross/oc.m8.d7:octrMA.LaudsTheotokion.text	@ltx/en_us_holycross/oc.m8.d3:ocVE.AposTheotokion.text
ltx/en_us_holycross/oc.m8.d7:octrMA.Photogogic.incipit	@ltx/en_us_holycross/oc.m8.d2:octrMA.Photagogic.incipit
ltx/en_us_holycross/oc.m8.d7:octrMA.Photogogic.mode	@ltx/en_us_holycross/miscellanea:misc.Mode8
ltx/en_us_holycross/oc.m8.d7:octrMA.Photogogic.text	@ltx/en_us_holycross/oc.m8.d2:octrMA.Photagogic.text
ltx/en_us_holycross/oc.m8.d7:octrVE.SticBoth.incipit	@ltx/en_us_holycross/oc.m8.d7:ocVE.SticTheotokion.incipit
ltx/en_us_holycross/oc.m8.d7:octrVE.SticBoth.melody	
ltx/en_us_holycross/oc.m8.d7:octrVE.SticBoth.mode	@ltx/en_us_holycross/miscellanea:misc.Mode8
ltx/en_us_holycross/oc.m8.d7:octrVE.SticBoth.text	@ltx/en_us_holycross/oc.m8.d7:ocVE.SticTheotokion.text
ltx/en_us_holycross/oc.m8.d7:octrVE.SticGlory.incipit	@ltx/en_us_holycross/oc.m8.d7:ocVE.Aposticha2.incipit
ltx/en_us_holycross/oc.m8.d7:octrVE.SticGlory.melody	
ltx/en_us_holycross/oc.m8.d7:octrVE.SticGlory.mode	@ltx/en_us_holycross/miscellanea:misc.Mode8
ltx/en_us_holycross/oc.m8.d7:octrVE.SticGlory.text	@ltx/en_us_holycross/oc.m8.d7:ocVE.Aposticha2.text
ltx/en_us_holycross/oc.m8.d7:octrVE.Stichera1.incipit	@ltx/en_us_holycross/oc.m8.d7:ocVE.Aposticha1.incipit
ltx/en_us_holycross/oc.m8.d7:octrVE.Stichera1.melody	
ltx/en_us_holycross/oc.m8.d7:octrVE.Stichera1.mode	@ltx/en_us_holycross/miscellanea:misc.Mode8
ltx/en_us_holycross/oc.m8.d7:octrVE.Stichera1.text	@ltx/en_us_holycross/oc.m8.d7:ocVE.Aposticha1.text
ltx/en_us_holycross/oc.m8.d7:octrVE.Stichera2.incipit	@ltx/en_us_holycross/oc.m8.d7:ocVE.Stichera1.incipit
ltx/en_us_holycross/oc.m8.d7:octrVE.Stichera2.melody	
ltx/en_us_holycross/oc.m8.d7:octrVE.Stichera2.mode	@ltx/en_us_holycross/miscellanea:misc.Mode8
ltx/en_us_holycross/oc.m8.d7:octrVE.Stichera2.text	@ltx/en_us_holycross/oc.m8.d7:ocVE.Stichera1.text
ltx/en_us_holycross/oc.m8.d7:octrVE.Stichera3.incipit	@ltx/en_us_holycross/oc.m8.d7:ocVE.Stichera2.incipit
ltx/en_us_holycross/oc.m8.d7:octrVE.Stichera3.melody	
ltx/en_us_holycross/oc.m8.d7:octrVE.Stichera3.mode	@ltx/en_us_holycross/miscellanea:misc.Mode8
ltx/en_us_holycross/oc.m8.d7:octrVE.Stichera3.text	@ltx/en_us_holycross/oc.m8.d7:ocVE.Stichera2.text
ltx/en_us_holycross/oc.m8.d7:octrVE.Stichera4.incipit	@ltx/en_us_holycross/oc.m8.d7:ocVE.Stichera3.incipit
ltx/en_us_holycross/oc.m8.d7:octrVE.Stichera4.melody	
ltx/en_us_holycross/oc.m8.d7:octrVE.Stichera4.mode	@ltx/en_us_holycross/miscellanea:misc.Mode8
ltx/en_us_holycross/oc.m8.d7:octrVE.Stichera4.text	@ltx/en_us_holycross/oc.m8.d7:ocVE.Stichera3.text
