ltx/en_us_holycross/eu.smallwaterblessing:euSWB.Key0100.title	The Order for the Lesser Sanctification of the Water
ltx/en_us_holycross/eu.smallwaterblessing:euSWB.Key0201.incipit	O Virgin who from the…
ltx/en_us_holycross/eu.smallwaterblessing:euSWB.Key0201.melody	@ltx/en_us_holycross/miscellanea:misc.Heirmos
ltx/en_us_holycross/eu.smallwaterblessing:euSWB.Key0201.mode	@ltx/en_us_holycross/miscellanea:misc.Mode6
ltx/en_us_holycross/eu.smallwaterblessing:euSWB.Key0201.text	O Virgin who from the Angel received, hail! And gave birth to the Life-giver Himself, your Creator, save them that magnify you.
ltx/en_us_holycross/eu.smallwaterblessing:euSWB.Key0202.incipit	We sing of your Son…
ltx/en_us_holycross/eu.smallwaterblessing:euSWB.Key0202.melody	@ltx/en_us_holycross/miscellanea:misc.NotMetered
ltx/en_us_holycross/eu.smallwaterblessing:euSWB.Key0202.mode	@ltx/en_us_holycross/miscellanea:misc.Mode6
ltx/en_us_holycross/eu.smallwaterblessing:euSWB.Key0202.text	We sing of your Son, O Theotokos, and cry aloud: from all adversities save your servants, O Immaculate.
ltx/en_us_holycross/eu.smallwaterblessing:euSWB.Key0203.incipit	The praise of Kings, Prophets…
ltx/en_us_holycross/eu.smallwaterblessing:euSWB.Key0203.melody	@ltx/en_us_holycross/miscellanea:misc.NotMetered
ltx/en_us_holycross/eu.smallwaterblessing:euSWB.Key0203.mode	@ltx/en_us_holycross/miscellanea:misc.Mode6
ltx/en_us_holycross/eu.smallwaterblessing:euSWB.Key0203.text	The praise of Kings, Prophets, Apostles, and Martyrs are you, and Intercessor of the world, O All-Immaculate One.
ltx/en_us_holycross/eu.smallwaterblessing:euSWB.Key0204.incipit	Every Orthodox tongue praises, blesses…
ltx/en_us_holycross/eu.smallwaterblessing:euSWB.Key0204.melody	@ltx/en_us_holycross/miscellanea:misc.NotMetered
ltx/en_us_holycross/eu.smallwaterblessing:euSWB.Key0204.mode	@ltx/en_us_holycross/miscellanea:misc.Mode6
ltx/en_us_holycross/eu.smallwaterblessing:euSWB.Key0204.text	Every Orthodox tongue praises, blesses, and glorifies your immaculate Birth-giving, O Mary, Bride of God.
ltx/en_us_holycross/eu.smallwaterblessing:euSWB.Key0205.incipit	I beseech You, O my…
ltx/en_us_holycross/eu.smallwaterblessing:euSWB.Key0205.melody	@ltx/en_us_holycross/miscellanea:misc.NotMetered
ltx/en_us_holycross/eu.smallwaterblessing:euSWB.Key0205.mode	@ltx/en_us_holycross/miscellanea:misc.Mode6
ltx/en_us_holycross/eu.smallwaterblessing:euSWB.Key0205.text	I beseech You, O my Christ, give to me also, though unworthy, remission of offenses, I beseech You; through the intercessions of her that bore You, in that You are compassionate.
ltx/en_us_holycross/eu.smallwaterblessing:euSWB.Key0206.incipit	In you, O Theotokos, have…
ltx/en_us_holycross/eu.smallwaterblessing:euSWB.Key0206.melody	@ltx/en_us_holycross/miscellanea:misc.NotMetered
ltx/en_us_holycross/eu.smallwaterblessing:euSWB.Key0206.mode	@ltx/en_us_holycross/miscellanea:misc.Mode6
ltx/en_us_holycross/eu.smallwaterblessing:euSWB.Key0206.text	In you, O Theotokos, have I put my hope. Save me by your prayers; grant for me remission of sins.
ltx/en_us_holycross/eu.smallwaterblessing:euSWB.Key0207.incipit	Give me life, you that…
ltx/en_us_holycross/eu.smallwaterblessing:euSWB.Key0207.melody	@ltx/en_us_holycross/miscellanea:misc.NotMetered
ltx/en_us_holycross/eu.smallwaterblessing:euSWB.Key0207.mode	@ltx/en_us_holycross/miscellanea:misc.Mode6
ltx/en_us_holycross/eu.smallwaterblessing:euSWB.Key0207.text	Give me life, you that have borne the Life-giver and Savior: save me through your prayers, O blessed Hope of our souls.
ltx/en_us_holycross/eu.smallwaterblessing:euSWB.Key0208.incipit	O Virgin immaculate, who did…
ltx/en_us_holycross/eu.smallwaterblessing:euSWB.Key0208.melody	@ltx/en_us_holycross/miscellanea:misc.NotMetered
ltx/en_us_holycross/eu.smallwaterblessing:euSWB.Key0208.mode	@ltx/en_us_holycross/miscellanea:misc.Mode6
ltx/en_us_holycross/eu.smallwaterblessing:euSWB.Key0208.text	O Virgin immaculate, who did conceive in your Womb the Creator of all people: through your prayers save our souls.
ltx/en_us_holycross/eu.smallwaterblessing:euSWB.Key0209.incipit	All-praised Theotokos, who through the…
ltx/en_us_holycross/eu.smallwaterblessing:euSWB.Key0209.melody	@ltx/en_us_holycross/miscellanea:misc.NotMetered
ltx/en_us_holycross/eu.smallwaterblessing:euSWB.Key0209.mode	@ltx/en_us_holycross/miscellanea:misc.Mode6
ltx/en_us_holycross/eu.smallwaterblessing:euSWB.Key0209.text	All-praised Theotokos, who through the word of an Angel, in a manner beyond reason, gave birth to the Word, pray that He will save our souls.
ltx/en_us_holycross/eu.smallwaterblessing:euSWB.Key0210.incipit	Through your intercessions, O Lady…
ltx/en_us_holycross/eu.smallwaterblessing:euSWB.Key0210.melody	@ltx/en_us_holycross/miscellanea:misc.NotMetered
ltx/en_us_holycross/eu.smallwaterblessing:euSWB.Key0210.mode	@ltx/en_us_holycross/miscellanea:misc.Mode6
ltx/en_us_holycross/eu.smallwaterblessing:euSWB.Key0210.text	Through your intercessions, O Lady, make your Son a merciful Judge unto me, who am a sinner above all people.
ltx/en_us_holycross/eu.smallwaterblessing:euSWB.Key0211.incipit	With binding duty we cry…
ltx/en_us_holycross/eu.smallwaterblessing:euSWB.Key0211.melody	@ltx/en_us_holycross/miscellanea:misc.NotMetered
ltx/en_us_holycross/eu.smallwaterblessing:euSWB.Key0211.mode	@ltx/en_us_holycross/miscellanea:misc.Mode6
ltx/en_us_holycross/eu.smallwaterblessing:euSWB.Key0211.text	With binding duty we cry to you, Hail! O immaculate Theotokos Ever-Virgin; through your intercessions are saved those that pray to you.
ltx/en_us_holycross/eu.smallwaterblessing:euSWB.Key0212.incipit	Deliver me from the fire…
ltx/en_us_holycross/eu.smallwaterblessing:euSWB.Key0212.melody	@ltx/en_us_holycross/miscellanea:misc.NotMetered
ltx/en_us_holycross/eu.smallwaterblessing:euSWB.Key0212.mode	@ltx/en_us_holycross/miscellanea:misc.Mode6
ltx/en_us_holycross/eu.smallwaterblessing:euSWB.Key0212.text	Deliver me from the fire eternal, and the torments that await me, O all-praised Lady, that I may be delivered from all tribulation.
ltx/en_us_holycross/eu.smallwaterblessing:euSWB.Key0213.incipit	All-praised Sovereign Lady, we pray…
ltx/en_us_holycross/eu.smallwaterblessing:euSWB.Key0213.melody	@ltx/en_us_holycross/miscellanea:misc.NotMetered
ltx/en_us_holycross/eu.smallwaterblessing:euSWB.Key0213.mode	@ltx/en_us_holycross/miscellanea:misc.Mode6
ltx/en_us_holycross/eu.smallwaterblessing:euSWB.Key0213.text	All-praised Sovereign Lady, we pray You: do not overlook the prayers of Your servants, so that we might be delivered from all tribulation.
ltx/en_us_holycross/eu.smallwaterblessing:euSWB.Key0214.incipit	From every sickness and infirmity…
ltx/en_us_holycross/eu.smallwaterblessing:euSWB.Key0214.melody	@ltx/en_us_holycross/miscellanea:misc.NotMetered
ltx/en_us_holycross/eu.smallwaterblessing:euSWB.Key0214.mode	@ltx/en_us_holycross/miscellanea:misc.Mode6
ltx/en_us_holycross/eu.smallwaterblessing:euSWB.Key0214.text	From every sickness and infirmity. Deliver us, who have recourse unto you and your holy Protection.
ltx/en_us_holycross/eu.smallwaterblessing:euSWB.Key0215.incipit	Marvelous wonder shown to you…
ltx/en_us_holycross/eu.smallwaterblessing:euSWB.Key0215.melody	@ltx/en_us_holycross/miscellanea:misc.NotMetered
ltx/en_us_holycross/eu.smallwaterblessing:euSWB.Key0215.mode	@ltx/en_us_holycross/miscellanea:misc.Mode6
ltx/en_us_holycross/eu.smallwaterblessing:euSWB.Key0215.text	Marvelous wonder shown to you, O Theotokos: for our sake the Creator of All and our God was in our likeness born to you.
ltx/en_us_holycross/eu.smallwaterblessing:euSWB.Key0216.incipit	Your Temple, O Theotokos, was…
ltx/en_us_holycross/eu.smallwaterblessing:euSWB.Key0216.melody	@ltx/en_us_holycross/miscellanea:misc.NotMetered
ltx/en_us_holycross/eu.smallwaterblessing:euSWB.Key0216.mode	@ltx/en_us_holycross/miscellanea:misc.Mode6
ltx/en_us_holycross/eu.smallwaterblessing:euSWB.Key0216.text	Your Temple, O Theotokos, was shown forth as remedy without price of ills -- the consolation of our wounded souls.
ltx/en_us_holycross/eu.smallwaterblessing:euSWB.Key0217.incipit	O All-Holy Theotokos, who has…
ltx/en_us_holycross/eu.smallwaterblessing:euSWB.Key0217.melody	@ltx/en_us_holycross/miscellanea:misc.NotMetered
ltx/en_us_holycross/eu.smallwaterblessing:euSWB.Key0217.mode	@ltx/en_us_holycross/miscellanea:misc.Mode6
ltx/en_us_holycross/eu.smallwaterblessing:euSWB.Key0217.text	O All-Holy Theotokos, who has borne the Savior, save your servants from adversity and from all other necessity.
ltx/en_us_holycross/eu.smallwaterblessing:euSWB.Key0218.incipit	From every ban under which…
ltx/en_us_holycross/eu.smallwaterblessing:euSWB.Key0218.melody	@ltx/en_us_holycross/miscellanea:misc.NotMetered
ltx/en_us_holycross/eu.smallwaterblessing:euSWB.Key0218.mode	@ltx/en_us_holycross/miscellanea:misc.Mode6
ltx/en_us_holycross/eu.smallwaterblessing:euSWB.Key0218.text	From every ban under which they labor deliver your servants from every ailment of body and spirit, O you most Holy.
ltx/en_us_holycross/eu.smallwaterblessing:euSWB.Key0219.incipit	Through your intercessions, O Virgin…
ltx/en_us_holycross/eu.smallwaterblessing:euSWB.Key0219.melody	@ltx/en_us_holycross/miscellanea:misc.NotMetered
ltx/en_us_holycross/eu.smallwaterblessing:euSWB.Key0219.mode	@ltx/en_us_holycross/miscellanea:misc.Mode6
ltx/en_us_holycross/eu.smallwaterblessing:euSWB.Key0219.text	Through your intercessions, O Virgin Theotokos, save all that have recourse unto you; deliver all from sorrow and necessity.
ltx/en_us_holycross/eu.smallwaterblessing:euSWB.Key0220.incipit	Who, having recourse unto your…
ltx/en_us_holycross/eu.smallwaterblessing:euSWB.Key0220.melody	@ltx/en_us_holycross/miscellanea:misc.NotMetered
ltx/en_us_holycross/eu.smallwaterblessing:euSWB.Key0220.mode	@ltx/en_us_holycross/miscellanea:misc.Mode6
ltx/en_us_holycross/eu.smallwaterblessing:euSWB.Key0220.text	Who, having recourse unto your Temple, O Theotokos, does not receive speedy healing both of soul and body, O All-immaculate?
ltx/en_us_holycross/eu.smallwaterblessing:euSWB.Key0221.incipit	Entreated by the Saints and…
ltx/en_us_holycross/eu.smallwaterblessing:euSWB.Key0221.melody	@ltx/en_us_holycross/miscellanea:misc.NotMetered
ltx/en_us_holycross/eu.smallwaterblessing:euSWB.Key0221.mode	@ltx/en_us_holycross/miscellanea:misc.Mode6
ltx/en_us_holycross/eu.smallwaterblessing:euSWB.Key0221.text	Entreated by the Saints and heavenly Hosts, O Merciful One, through her that bore You, do You cleanse me.
ltx/en_us_holycross/eu.smallwaterblessing:euSWB.Key0222.incipit	Spare, O Savior, the souls…
ltx/en_us_holycross/eu.smallwaterblessing:euSWB.Key0222.melody	@ltx/en_us_holycross/miscellanea:misc.NotMetered
ltx/en_us_holycross/eu.smallwaterblessing:euSWB.Key0222.mode	@ltx/en_us_holycross/miscellanea:misc.Mode6
ltx/en_us_holycross/eu.smallwaterblessing:euSWB.Key0222.text	Spare, O Savior, the souls of our brethren, who died in the Hope of Life; loose, and remit their sins.
ltx/en_us_holycross/eu.smallwaterblessing:euSWB.Key0223.incipit	Hail! O Virgin, Mercy-Seat of…
ltx/en_us_holycross/eu.smallwaterblessing:euSWB.Key0223.melody	@ltx/en_us_holycross/miscellanea:misc.NotMetered
ltx/en_us_holycross/eu.smallwaterblessing:euSWB.Key0223.mode	@ltx/en_us_holycross/miscellanea:misc.Mode6
ltx/en_us_holycross/eu.smallwaterblessing:euSWB.Key0223.text	Hail! O Virgin, Mercy-Seat of the world; Hail! O Receptacle of the Manna and Candelabrum all-golden of the light divine, O Bride of God unwedded.
ltx/en_us_holycross/eu.smallwaterblessing:euSWB.Key0224.incipit	We sing unto You, O…
ltx/en_us_holycross/eu.smallwaterblessing:euSWB.Key0224.melody	@ltx/en_us_holycross/miscellanea:misc.NotMetered
ltx/en_us_holycross/eu.smallwaterblessing:euSWB.Key0224.mode	@ltx/en_us_holycross/miscellanea:misc.Mode6
ltx/en_us_holycross/eu.smallwaterblessing:euSWB.Key0224.text	We sing unto You, O God in Three Persons, crying aloud the thrice-Holy Hymn, entreating that we may receive salvation.
ltx/en_us_holycross/eu.smallwaterblessing:euSWB.Key0225.incipit	O Virgin, who has borne…
ltx/en_us_holycross/eu.smallwaterblessing:euSWB.Key0225.melody	@ltx/en_us_holycross/miscellanea:misc.NotMetered
ltx/en_us_holycross/eu.smallwaterblessing:euSWB.Key0225.mode	@ltx/en_us_holycross/miscellanea:misc.Mode6
ltx/en_us_holycross/eu.smallwaterblessing:euSWB.Key0225.text	O Virgin, who has borne the Savior, the Sovereign of the world: pray unto Him that He will save our souls.
ltx/en_us_holycross/eu.smallwaterblessing:euSWB.Key0226.incipit	Hail! O Mount, Hail! O…
ltx/en_us_holycross/eu.smallwaterblessing:euSWB.Key0226.melody	@ltx/en_us_holycross/miscellanea:misc.NotMetered
ltx/en_us_holycross/eu.smallwaterblessing:euSWB.Key0226.mode	@ltx/en_us_holycross/miscellanea:misc.Mode6
ltx/en_us_holycross/eu.smallwaterblessing:euSWB.Key0226.text	Hail! O Mount, Hail! O Bush that burned and yet was not consumed; Hail! O Gate, Hail! O Ladder and Altar Divine, Hail! Sovereign Lady, the Helper of all.
ltx/en_us_holycross/eu.smallwaterblessing:euSWB.Key0227.incipit	Through the prayers of Your…
ltx/en_us_holycross/eu.smallwaterblessing:euSWB.Key0227.melody	@ltx/en_us_holycross/miscellanea:misc.NotMetered
ltx/en_us_holycross/eu.smallwaterblessing:euSWB.Key0227.mode	@ltx/en_us_holycross/miscellanea:misc.Mode6
ltx/en_us_holycross/eu.smallwaterblessing:euSWB.Key0227.text	Through the prayers of Your Holy Mother, and of Your Holy Saints, O Merciful God, to Your people grant Your great mercies.
ltx/en_us_holycross/eu.smallwaterblessing:euSWB.Key0228.melody	@ltx/en_us_holycross/miscellanea:misc.NotMetered
ltx/en_us_holycross/eu.smallwaterblessing:euSWB.Key0228.mode	@ltx/en_us_holycross/miscellanea:misc.Mode6
ltx/en_us_holycross/eu.smallwaterblessing:euSWB.Key0228.text	(Cross)
ltx/en_us_holycross/eu.smallwaterblessing:euSWB.Key0229.incipit	Through the prayers of the…
ltx/en_us_holycross/eu.smallwaterblessing:euSWB.Key0229.melody	@ltx/en_us_holycross/miscellanea:misc.NotMetered
ltx/en_us_holycross/eu.smallwaterblessing:euSWB.Key0229.mode	@ltx/en_us_holycross/miscellanea:misc.Mode6
ltx/en_us_holycross/eu.smallwaterblessing:euSWB.Key0229.text	Through the prayers of the glorious Archangels, the Angels, and all the heavenly Hosts, mightily preserve Your servants, O Savior.
ltx/en_us_holycross/eu.smallwaterblessing:euSWB.Key0230.incipit	Through the prayers of the…
ltx/en_us_holycross/eu.smallwaterblessing:euSWB.Key0230.melody	@ltx/en_us_holycross/miscellanea:misc.NotMetered
ltx/en_us_holycross/eu.smallwaterblessing:euSWB.Key0230.mode	@ltx/en_us_holycross/miscellanea:misc.Mode6
ltx/en_us_holycross/eu.smallwaterblessing:euSWB.Key0230.text	Through the prayers of the glorious Prophet and Forerunner John the Baptist, and of all Your Saints, mightily preserve Your servants, O my Christ and Savior.
ltx/en_us_holycross/eu.smallwaterblessing:euSWB.Key0231.incipit	Through the prayers of the…
ltx/en_us_holycross/eu.smallwaterblessing:euSWB.Key0231.melody	@ltx/en_us_holycross/miscellanea:misc.NotMetered
ltx/en_us_holycross/eu.smallwaterblessing:euSWB.Key0231.mode	@ltx/en_us_holycross/miscellanea:misc.Mode6
ltx/en_us_holycross/eu.smallwaterblessing:euSWB.Key0231.text	Through the prayers of the glorious Apostles, and the victorious Martyrs, and of all Your Saints, grant Your mercies to Your servants.
ltx/en_us_holycross/eu.smallwaterblessing:euSWB.Key0232.melody	@ltx/en_us_holycross/miscellanea:misc.NotMetered
ltx/en_us_holycross/eu.smallwaterblessing:euSWB.Key0232.mode	@ltx/en_us_holycross/miscellanea:misc.Mode6
ltx/en_us_holycross/eu.smallwaterblessing:euSWB.Key0232.text	(Hierarchs)
ltx/en_us_holycross/eu.smallwaterblessing:euSWB.Key0233.melody	@ltx/en_us_holycross/miscellanea:misc.NotMetered
ltx/en_us_holycross/eu.smallwaterblessing:euSWB.Key0233.mode	@ltx/en_us_holycross/miscellanea:misc.Mode6
ltx/en_us_holycross/eu.smallwaterblessing:euSWB.Key0233.text	(Nicholas)
ltx/en_us_holycross/eu.smallwaterblessing:euSWB.Key0234.melody	@ltx/en_us_holycross/miscellanea:misc.NotMetered
ltx/en_us_holycross/eu.smallwaterblessing:euSWB.Key0234.mode	@ltx/en_us_holycross/miscellanea:misc.Mode6
ltx/en_us_holycross/eu.smallwaterblessing:euSWB.Key0234.text	(Great Martyrs)
ltx/en_us_holycross/eu.smallwaterblessing:euSWB.Key0235.melody	@ltx/en_us_holycross/miscellanea:misc.NotMetered
ltx/en_us_holycross/eu.smallwaterblessing:euSWB.Key0235.mode	@ltx/en_us_holycross/miscellanea:misc.Mode6
ltx/en_us_holycross/eu.smallwaterblessing:euSWB.Key0235.text	(Unmercenaries)
ltx/en_us_holycross/eu.smallwaterblessing:euSWB.Key0236.melody	@ltx/en_us_holycross/miscellanea:misc.NotMetered
ltx/en_us_holycross/eu.smallwaterblessing:euSWB.Key0236.mode	@ltx/en_us_holycross/miscellanea:misc.Mode6
ltx/en_us_holycross/eu.smallwaterblessing:euSWB.Key0236.text	(Panteleimon)
ltx/en_us_holycross/eu.smallwaterblessing:euSWB.Key0237.melody	@ltx/en_us_holycross/miscellanea:misc.NotMetered
ltx/en_us_holycross/eu.smallwaterblessing:euSWB.Key0237.mode	@ltx/en_us_holycross/miscellanea:misc.Mode6
ltx/en_us_holycross/eu.smallwaterblessing:euSWB.Key0237.text	(Righteous)
ltx/en_us_holycross/eu.smallwaterblessing:euSWB.Key0238.incipit	The Father and the Son…
ltx/en_us_holycross/eu.smallwaterblessing:euSWB.Key0238.melody	@ltx/en_us_holycross/miscellanea:misc.NotMetered
ltx/en_us_holycross/eu.smallwaterblessing:euSWB.Key0238.mode	@ltx/en_us_holycross/miscellanea:misc.Mode6
ltx/en_us_holycross/eu.smallwaterblessing:euSWB.Key0238.text	The Father and the Son and the Holy Spirit we glorify saying: O Holy Trinity, save our souls.
ltx/en_us_holycross/eu.smallwaterblessing:euSWB.Key0239.incipit	O Virgin who in mystery…
ltx/en_us_holycross/eu.smallwaterblessing:euSWB.Key0239.melody	@ltx/en_us_holycross/miscellanea:misc.NotMetered
ltx/en_us_holycross/eu.smallwaterblessing:euSWB.Key0239.mode	@ltx/en_us_holycross/miscellanea:misc.Mode6
ltx/en_us_holycross/eu.smallwaterblessing:euSWB.Key0239.text	O Virgin who in mystery did conceive and bring forth in these latter days Your Creator: save us who magnify you.
ltx/en_us_holycross/eu.smallwaterblessing:euSWB.Key0240.text	Open for us the door of your tender compassion, O blessed Theotokos; and as we set our hope in you, let us never be confounded; through you may we be delivered from all adversity; you, who are the salvation of all good Christian folk.
ltx/en_us_holycross/eu.smallwaterblessing:euSWB.Key0301.incipit	Now draws nigh the time…
ltx/en_us_holycross/eu.smallwaterblessing:euSWB.Key0301.mode	@ltx/en_us_holycross/miscellanea:misc.Mode8
ltx/en_us_holycross/eu.smallwaterblessing:euSWB.Key0301.text	Now draws nigh the time that sanctifies all men, and a just Judge awaits us; turn then, O my soul, to repentance, like the Adulteress tearfully crying: have mercy on me, O Lord.
ltx/en_us_holycross/eu.smallwaterblessing:euSWB.Key0302.incipit	O Christ, the Fountain, Who…
ltx/en_us_holycross/eu.smallwaterblessing:euSWB.Key0302.mode	@ltx/en_us_holycross/miscellanea:misc.Mode8
ltx/en_us_holycross/eu.smallwaterblessing:euSWB.Key0302.text	O Christ, the Fountain, Who did sprinkle the waters of healing in the all-holy Temple of the Virgin, You, today, through the sprinkling of blessing did expel the maladies of ailing, O You Physician of our souls and bodies.
ltx/en_us_holycross/eu.smallwaterblessing:euSWB.Key0303.incipit	As a Virgin you knew…
ltx/en_us_holycross/eu.smallwaterblessing:euSWB.Key0303.melody	
ltx/en_us_holycross/eu.smallwaterblessing:euSWB.Key0303.mode	@ltx/en_us_holycross/miscellanea:misc.Mode8
ltx/en_us_holycross/eu.smallwaterblessing:euSWB.Key0303.text	As a Virgin you knew not man, but gave birth; and as a Mother unwedded, a Virgin did you remain; entreat then, O Mary Theotokos, Christ our God that He will save us.
ltx/en_us_holycross/eu.smallwaterblessing:euSWB.Key0304.incipit	O All-Holy Theotokos Virgin, guide…
ltx/en_us_holycross/eu.smallwaterblessing:euSWB.Key0304.mode	@ltx/en_us_holycross/miscellanea:misc.Mode8
ltx/en_us_holycross/eu.smallwaterblessing:euSWB.Key0304.text	O All-Holy Theotokos Virgin, guide aright the works of our hands, and entreat pardon for our transgressions, when we chant the angelic Hymn:
ltx/en_us_holycross/eu.smallwaterblessing:euSWB.Key0401a.text	O Lord our God, Who are mighty in counsel and wondrous in all Your deeds: the Creator of all things: Who keep Your Covenant and Your mercy upon all those who love You and keep Your commandments: Who receive the devout tears of all that are in distress: for this cause did You come in the similitude of a servant, scorning not our image but giving true health to the body and saying, “Lo! You are healed, sin no more.” And with clay did make man’s eyes whole, and having commanded him to wash, made him by Your word rejoice in the light, putting to confusion the floods of passions of enemies; and drying up the bitter sea of life of the same, subduing the waves of sensual desires heavy to be endured: do You, the same Lord and King Who loves mankind, Who has granted to us to clothe ourselves in the garment of snowy whiteness, by water and by Spirit: send down on us Your blessing, and through the partaking of this water, through sprinkling with it, wash away the defilement of passions.
ltx/en_us_holycross/eu.smallwaterblessing:euSWB.Key0401b.text	Yea, we beseech You visit our weaknesses, O Good One, and heal our infirmities both of spirit and of body through Your mercy;
ltx/en_us_holycross/eu.smallwaterblessing:euSWB.Key0402.text	of Saint (Name of the Saint of the Day), whose memory we commemorate; and of all Your Saints.
ltx/en_us_holycross/eu.smallwaterblessing:euSWB.Key0403.text	Preserve, Lord, the president of the United States, and all the other Civil Authorities enabled by the American people.
ltx/en_us_holycross/eu.smallwaterblessing:euSWB.Key0404.text	Save, O God, all Orthodox Bishops who rightly divide the word of Your truth, granting unto them spiritual and bodily health; be merciful unto this Christian habitation which labors for You; have in remembrance, O God, every priestly and monastic order and their salvation; have in remembrance, O God, both those that hate us and those who love us, the brethren who serve with us; the people here present; and who for any cause are worthy of blessing and have gone forth having empowered us, unworthy though we are, to pray, for them; have in remembrance, O God, our brethren who are in captivity and affliction, and show mercy unto them according to Your great Mercy, delivering them from every tribulation.
ltx/en_us_holycross/eu.smallwaterblessing:euSWB.Key0405.text	For You are the Fountain of healing, O Christ our God, and to You do we send up all glory, together with Your Eternal Father and Your All-Holy, Good, and Life-creating Spirit, both now and ever, and to the ages of ages.
ltx/en_us_holycross/eu.smallwaterblessing:euSWB.Key0501.incipit	…
ltx/en_us_holycross/eu.smallwaterblessing:euSWB.Key0501.text	
ltx/en_us_holycross/eu.smallwaterblessing:euSWB.Key0501a.text	
ltx/en_us_holycross/eu.smallwaterblessing:euSWB.Key0501b.text	
ltx/en_us_holycross/eu.smallwaterblessing:euSWB.Key0501c.text	
ltx/en_us_holycross/eu.smallwaterblessing:euSWB.Key0502.incipit	…
ltx/en_us_holycross/eu.smallwaterblessing:euSWB.Key0502.text	
ltx/en_us_holycross/eu.smallwaterblessing:euSWB.Key0502.title	
ltx/en_us_holycross/eu.smallwaterblessing:euSWB.Key0503.inicpit	…
ltx/en_us_holycross/eu.smallwaterblessing:euSWB.Key0503.text	
ltx/en_us_holycross/eu.smallwaterblessing:euSWB.Key0503.title	
ltx/en_us_holycross/eu.smallwaterblessing:euSWB.Key0503a.text	
ltx/en_us_holycross/eu.smallwaterblessing:euSWB.Key0503b.text	
ltx/en_us_holycross/eu.smallwaterblessing:euSWB.Key0503c.text	
ltx/en_us_holycross/eu.smallwaterblessing:euSWB.Key0504.text	
ltx/en_us_holycross/eu.smallwaterblessing:euSWB.Key0601.text	@ltx/en_us_holycross/eu.greatblessingofwater:euGW.Prayer41.text
ltx/en_us_holycross/eu.smallwaterblessing:euSWB.Key0602.incipit	Make us worthy of your…
ltx/en_us_holycross/eu.smallwaterblessing:euSWB.Key0602.mode	@ltx/en_us_holycross/miscellanea:misc.Mode2
ltx/en_us_holycross/eu.smallwaterblessing:euSWB.Key0602.text	Make us worthy of your gifts, O Virgin Theotokos, overlooking our transgressions; give healing through faith to them that accept your blessing, O Immaculate One.
ltx/en_us_holycross/eu.smallwaterblessing:euSWB.R101	Items needed for the celebration of the Lesser Sanctification of Water are a small table, upon which the Priest places the Gospel; a wooden, silver-bound Cross; a censer; a bowl of water; two candlesticks with their candles; a few branches of basil and a clean white towel. The Priest wears his cassock and stole.
ltx/en_us_holycross/eu.smallwaterblessing:euSWB.R102	
ltx/en_us_holycross/eu.smallwaterblessing:euSWB.R201	Then is chanted the following verse: “All-Holy Theotokos, guard, protect and keep your servants.”
ltx/en_us_holycross/eu.smallwaterblessing:euSWB.R301	And the following:
ltx/en_us_holycross/eu.smallwaterblessing:euSWB.R401	
ltx/en_us_holycross/eu.smallwaterblessing:euSWB.R501	
ltx/en_us_holycross/eu.smallwaterblessing:euSWB.R601	
ltx/en_us_holycross/eu.smallwaterblessing:euSWB.R602	Then the Priest, taking up the venerable Cross, dips it crosswise in the Water thrice, singing the Troparion:
ltx/en_us_holycross/eu.smallwaterblessing:euSWB.R603	Then the Priest sprinkles the Holy Water in the form of the Cross and sings:
ltx/en_us_holycross/eu.smallwaterblessing:euSWB.R604	Then the Priest kisses the Precious Cross and blesses all the people, and he sprinkles all with the Holy Water, the Altar, and all the Temple.
ltx/en_us_holycross/eu.smallwaterblessing:euSWB.R605	Meanwhile the Choir sings the following Troparia:
ltx/en_us_holycross/eu.smallwaterblessing:euSWB.translator1	Prayers by Holy Cross.
ltx/en_us_holycross/eu.smallwaterblessing:euSWB.translator2	Hymns by Holy Cross.
