ltx/en_us_goadedes/ho.ho15.m01:ho.Days	
ltx/en_us_goadedes/ho.ho15.m01:ho.Hours	
ltx/en_us_goadedes/ho.ho15.m01:ho.Month	
ltx/en_us_goadedes/ho.ho15.m01:hoD02.Apolytikion1.greekmelody	@ltx/en_us_goadedes/he.a.m4:heAU.TachyProkatalave.greekname
ltx/en_us_goadedes/ho.ho15.m01:hoD02.Apolytikion1.melody	@ltx/en_us_goadedes/he.a.m4:heAU.TachyProkatalave.name
ltx/en_us_goadedes/ho.ho15.m01:hoD02.Apolytikion1.mode	@ltx/en_us_goadedes/miscellanea:misc.Mode4
ltx/en_us_goadedes/ho.ho15.m01:hoD02.Apolytikion1.poet	
ltx/en_us_goadedes/ho.ho15.m01:hoD02.Apolytikion1.text	
ltx/en_us_goadedes/ho.ho15.m01:hoD02.Apolytikion1.title	@ltx/en_us_goadedes/titles:ti.SaintM
ltx/en_us_goadedes/ho.ho15.m01:hoD02.GeneralApolytikion1.name	
ltx/en_us_goadedes/ho.ho15.m01:hoD02.Kontakion1.greekmelody	@ltx/en_us_goadedes/he.a.m4:heAU.OYpsotheisEnToStavro.greekname
ltx/en_us_goadedes/ho.ho15.m01:hoD02.Kontakion1.melody	@ltx/en_us_goadedes/he.a.m4:heAU.OYpsotheisEnToStavro.name
ltx/en_us_goadedes/ho.ho15.m01:hoD02.Kontakion1.mode	@ltx/en_us_goadedes/miscellanea:misc.Mode4
ltx/en_us_goadedes/ho.ho15.m01:hoD02.Kontakion1.poet	
ltx/en_us_goadedes/ho.ho15.m01:hoD02.Kontakion1.text	
ltx/en_us_goadedes/ho.ho15.m01:hoD02.Kontakion1.title	@ltx/en_us_goadedes/titles:ti.SaintM
ltx/en_us_goadedes/ho.ho15.m01:hoD03.Kontakion1.greekmelody	@ltx/en_us_goadedes/he.a.m8:heAU.OsAparchas.greekname
ltx/en_us_goadedes/ho.ho15.m01:hoD03.Kontakion1.melody	@ltx/en_us_goadedes/he.a.m8:heAU.OsAparchas.name
ltx/en_us_goadedes/ho.ho15.m01:hoD03.Kontakion1.mode	@ltx/en_us_goadedes/miscellanea:misc.Mode8
ltx/en_us_goadedes/ho.ho15.m01:hoD03.Kontakion1.poet	
ltx/en_us_goadedes/ho.ho15.m01:hoD03.Kontakion1.text	
ltx/en_us_goadedes/ho.ho15.m01:hoD03.Kontakion1.title	@ltx/en_us_goadedes/titles:ti.Martyr
ltx/en_us_goadedes/ho.ho15.m01:hoD03.Kontakion2.greekmelody	@ltx/en_us_goadedes/he.a.m4:heAU.EpefanisSimeron.greekname
ltx/en_us_goadedes/ho.ho15.m01:hoD03.Kontakion2.melody	@ltx/en_us_goadedes/he.a.m4:heAU.EpefanisSimeron.name
ltx/en_us_goadedes/ho.ho15.m01:hoD03.Kontakion2.mode	@ltx/en_us_goadedes/miscellanea:misc.Mode4
ltx/en_us_goadedes/ho.ho15.m01:hoD03.Kontakion2.poet	
ltx/en_us_goadedes/ho.ho15.m01:hoD03.Kontakion2.text	
ltx/en_us_goadedes/ho.ho15.m01:hoD03.Kontakion2.title	@ltx/en_us_goadedes/titles:ti.Prophet
ltx/en_us_goadedes/ho.ho15.m01:hoD08.Apolytikion1.greekmelody	@ltx/en_us_goadedes/he.a.m5:heAU.TonSynanarchonLogon.greekname
ltx/en_us_goadedes/ho.ho15.m01:hoD08.Apolytikion1.incipit	…
ltx/en_us_goadedes/ho.ho15.m01:hoD08.Apolytikion1.melody	@ltx/en_us_goadedes/he.a.m5:heAU.TonSynanarchonLogon.name
ltx/en_us_goadedes/ho.ho15.m01:hoD08.Apolytikion1.mode	@ltx/en_us_goadedes/miscellanea:misc.Mode5
ltx/en_us_goadedes/ho.ho15.m01:hoD08.Apolytikion1.poet	
ltx/en_us_goadedes/ho.ho15.m01:hoD08.Apolytikion1.text	
ltx/en_us_goadedes/ho.ho15.m01:hoD08.Apolytikion1.title	@ltx/en_us_goadedes/titles:ti.DevoutSaintM
ltx/en_us_goadedes/ho.ho15.m01:hoD08.Apolytikion2.greekmelody	@ltx/en_us_goadedes/he.a.m4:heAU.TachyProkatalave.greekname
ltx/en_us_goadedes/ho.ho15.m01:hoD08.Apolytikion2.incipit	…
ltx/en_us_goadedes/ho.ho15.m01:hoD08.Apolytikion2.melody	@ltx/en_us_goadedes/he.a.m4:heAU.TachyProkatalave.name
ltx/en_us_goadedes/ho.ho15.m01:hoD08.Apolytikion2.mode	@ltx/en_us_goadedes/miscellanea:misc.Mode4
ltx/en_us_goadedes/ho.ho15.m01:hoD08.Apolytikion2.poet	
ltx/en_us_goadedes/ho.ho15.m01:hoD08.Apolytikion2.text	
ltx/en_us_goadedes/ho.ho15.m01:hoD08.Apolytikion2.title	@ltx/en_us_goadedes/titles:ti.DevoutW
ltx/en_us_goadedes/ho.ho15.m01:hoD09.Apolytikion1.greekmelody	@ltx/en_us_goadedes/he.ga:heGA.TisErimouPolitis.greekmelody
ltx/en_us_goadedes/ho.ho15.m01:hoD09.Apolytikion1.melody	@ltx/en_us_goadedes/he.ga:heGA.TisErimouPolitis.name
ltx/en_us_goadedes/ho.ho15.m01:hoD09.Apolytikion1.mode	@ltx/en_us_goadedes/miscellanea:misc.Mode1
ltx/en_us_goadedes/ho.ho15.m01:hoD09.Apolytikion1.poet	
ltx/en_us_goadedes/ho.ho15.m01:hoD09.Apolytikion1.text	
ltx/en_us_goadedes/ho.ho15.m01:hoD09.Apolytikion1.title	@ltx/en_us_goadedes/titles:ti.Martyr
ltx/en_us_goadedes/ho.ho15.m01:hoD09.Kontakion1.greekmelody	@ltx/en_us_goadedes/he.a.m4:heAU.EpefanisSimeron.greekname
ltx/en_us_goadedes/ho.ho15.m01:hoD09.Kontakion1.incipit	…
ltx/en_us_goadedes/ho.ho15.m01:hoD09.Kontakion1.melody	@ltx/en_us_goadedes/he.a.m4:heAU.EpefanisSimeron.name
ltx/en_us_goadedes/ho.ho15.m01:hoD09.Kontakion1.mode	@ltx/en_us_goadedes/miscellanea:misc.Mode4
ltx/en_us_goadedes/ho.ho15.m01:hoD09.Kontakion1.poet	
ltx/en_us_goadedes/ho.ho15.m01:hoD09.Kontakion1.text	
ltx/en_us_goadedes/ho.ho15.m01:hoD09.Kontakion1.title	@ltx/en_us_goadedes/titles:ti.Martyr
ltx/en_us_goadedes/ho.ho15.m01:hoD15.Apolytikion1.greekmelody	@ltx/en_us_goadedes/he.a.m3:heAU.TheiasPisteos.greekname
ltx/en_us_goadedes/ho.ho15.m01:hoD15.Apolytikion1.incipit	…
ltx/en_us_goadedes/ho.ho15.m01:hoD15.Apolytikion1.melody	@ltx/en_us_goadedes/he.a.m3:heAU.TheiasPisteos.name
ltx/en_us_goadedes/ho.ho15.m01:hoD15.Apolytikion1.mode	@ltx/en_us_goadedes/miscellanea:misc.Mode3
ltx/en_us_goadedes/ho.ho15.m01:hoD15.Apolytikion1.poet	
ltx/en_us_goadedes/ho.ho15.m01:hoD15.Apolytikion1.text	
ltx/en_us_goadedes/ho.ho15.m01:hoD15.Apolytikion1.title	
ltx/en_us_goadedes/ho.ho15.m01:hoD15.Apolytikion2.title	
ltx/en_us_goadedes/ho.ho15.m01:hoD15.Kontakion1.title	
ltx/en_us_goadedes/ho.ho15.m01:hoD15.Kontakion2.greekmelody	@ltx/en_us_goadedes/he.a.m4:heAU.EpefanisSimeron.greekname
ltx/en_us_goadedes/ho.ho15.m01:hoD15.Kontakion2.incipit	…
ltx/en_us_goadedes/ho.ho15.m01:hoD15.Kontakion2.melody	@ltx/en_us_goadedes/he.a.m4:heAU.EpefanisSimeron.name
ltx/en_us_goadedes/ho.ho15.m01:hoD15.Kontakion2.mode	@ltx/en_us_goadedes/miscellanea:misc.Mode4
ltx/en_us_goadedes/ho.ho15.m01:hoD15.Kontakion2.poet	
ltx/en_us_goadedes/ho.ho15.m01:hoD15.Kontakion2.text	
ltx/en_us_goadedes/ho.ho15.m01:hoD15.Kontakion2.title	
ltx/en_us_goadedes/ho.ho15.m01:hoD16.Kontakion1.greekmelody	@ltx/en_us_goadedes/he.a.m2:heAU.TaAnoZiton.greekname
ltx/en_us_goadedes/ho.ho15.m01:hoD16.Kontakion1.incipit	…
ltx/en_us_goadedes/ho.ho15.m01:hoD16.Kontakion1.melody	@ltx/en_us_goadedes/he.a.m2:heAU.TaAnoZiton.name
ltx/en_us_goadedes/ho.ho15.m01:hoD16.Kontakion1.mode	@ltx/en_us_goadedes/miscellanea:misc.Mode2
ltx/en_us_goadedes/ho.ho15.m01:hoD16.Kontakion1.poet	
ltx/en_us_goadedes/ho.ho15.m01:hoD16.Kontakion1.text	
ltx/en_us_goadedes/ho.ho15.m01:hoD16.Kontakion1.title	@ltx/en_us_goadedes/titles:ti.Apostle
ltx/en_us_goadedes/ho.ho15.m01:hoD17.Apolytikion1.greekmelody	@ltx/en_us_goadedes/he.a.m5:heAU.TonSynanarchonLogon.greekname
ltx/en_us_goadedes/ho.ho15.m01:hoD17.Apolytikion1.melody	@ltx/en_us_goadedes/he.a.m5:heAU.TonSynanarchonLogon.name
ltx/en_us_goadedes/ho.ho15.m01:hoD17.Apolytikion1.mode	@ltx/en_us_goadedes/miscellanea:misc.Mode5
ltx/en_us_goadedes/ho.ho15.m01:hoD17.Apolytikion1.poet	
ltx/en_us_goadedes/ho.ho15.m01:hoD17.Apolytikion1.text	
ltx/en_us_goadedes/ho.ho15.m01:hoD17.Apolytikion1.title	@ltx/en_us_goadedes/titles:ti.Martyr
ltx/en_us_goadedes/ho.ho15.m01:hoD19.Apolytikion2.greekmelody	@ltx/en_us_goadedes/he.a.m1:heAU.TisErimouPolitis.greekname
ltx/en_us_goadedes/ho.ho15.m01:hoD19.Apolytikion2.melody	@ltx/en_us_goadedes/he.a.m1:heAU.TisErimouPolitis.name
ltx/en_us_goadedes/ho.ho15.m01:hoD19.Apolytikion2.mode	@ltx/en_us_goadedes/miscellanea:misc.Mode1
ltx/en_us_goadedes/ho.ho15.m01:hoD19.Apolytikion2.poet	
ltx/en_us_goadedes/ho.ho15.m01:hoD19.Apolytikion2.text	
ltx/en_us_goadedes/ho.ho15.m01:hoD19.Apolytikion2.title	@ltx/en_us_goadedes/titles:ti.DevoutSaints
ltx/en_us_goadedes/ho.ho15.m01:hoD19.Apolytikion3.title	
ltx/en_us_goadedes/ho.ho15.m01:hoD19.Apolytikion4.greekmelody	@ltx/en_us_goadedes/he.a.m4:heAU.TachyProkatalave.greekname
ltx/en_us_goadedes/ho.ho15.m01:hoD19.Apolytikion4.melody	@ltx/en_us_goadedes/he.a.m4:heAU.TachyProkatalave.name
ltx/en_us_goadedes/ho.ho15.m01:hoD19.Apolytikion4.mode	@ltx/en_us_goadedes/miscellanea:misc.Mode4
ltx/en_us_goadedes/ho.ho15.m01:hoD19.Apolytikion4.poet	
ltx/en_us_goadedes/ho.ho15.m01:hoD19.Apolytikion4.text	
ltx/en_us_goadedes/ho.ho15.m01:hoD19.Apolytikion4.title	
ltx/en_us_goadedes/ho.ho15.m01:hoD19.Apolytikion5.greekmelody	@ltx/en_us_goadedes/he.a.m3:heAU.TheiasPisteos.greekname
ltx/en_us_goadedes/ho.ho15.m01:hoD19.Apolytikion5.melody	@ltx/en_us_goadedes/he.a.m3:heAU.TheiasPisteos.name
ltx/en_us_goadedes/ho.ho15.m01:hoD19.Apolytikion5.mode	@ltx/en_us_goadedes/miscellanea:misc.Mode3
ltx/en_us_goadedes/ho.ho15.m01:hoD19.Apolytikion5.poet	
ltx/en_us_goadedes/ho.ho15.m01:hoD19.Apolytikion5.text	
ltx/en_us_goadedes/ho.ho15.m01:hoD19.Apolytikion5.title	
ltx/en_us_goadedes/ho.ho15.m01:hoD19.GeneralApolytikion1.title	
ltx/en_us_goadedes/ho.ho15.m01:hoD19.GeneralApolytikion3.name	
ltx/en_us_goadedes/ho.ho15.m01:hoD19.Kontakion1.title	
ltx/en_us_goadedes/ho.ho15.m01:hoD19.Kontakion2.greekmelody	@ltx/en_us_goadedes/he.a.m3:heAU.IParthenosSimeron.greekname
ltx/en_us_goadedes/ho.ho15.m01:hoD19.Kontakion2.melody	@ltx/en_us_goadedes/he.a.m3:heAU.IParthenosSimeron.name
ltx/en_us_goadedes/ho.ho15.m01:hoD19.Kontakion2.mode	@ltx/en_us_goadedes/miscellanea:misc.Mode3
ltx/en_us_goadedes/ho.ho15.m01:hoD19.Kontakion2.poet	
ltx/en_us_goadedes/ho.ho15.m01:hoD19.Kontakion2.text	
ltx/en_us_goadedes/ho.ho15.m01:hoD19.Kontakion2.title	
ltx/en_us_goadedes/ho.ho15.m01:hoD22.Apolytikion1.greekmelody	@ltx/en_us_goadedes/he.a.m4:heAU.TachyProkatalave.greekname
ltx/en_us_goadedes/ho.ho15.m01:hoD22.Apolytikion1.incipit	…
ltx/en_us_goadedes/ho.ho15.m01:hoD22.Apolytikion1.melody	@ltx/en_us_goadedes/he.a.m4:heAU.TachyProkatalave.name
ltx/en_us_goadedes/ho.ho15.m01:hoD22.Apolytikion1.mode	@ltx/en_us_goadedes/miscellanea:misc.Mode4
ltx/en_us_goadedes/ho.ho15.m01:hoD22.Apolytikion1.poet	
ltx/en_us_goadedes/ho.ho15.m01:hoD22.Apolytikion1.text	
ltx/en_us_goadedes/ho.ho15.m01:hoD22.Apolytikion1.title	@ltx/en_us_goadedes/titles:ti.DevoutMartyrM
ltx/en_us_goadedes/ho.ho15.m01:hoD24.Apolytikion1.greekmelody	@ltx/en_us_goadedes/he.a.m3:heAU.TheiasPisteos.greekname
ltx/en_us_goadedes/ho.ho15.m01:hoD24.Apolytikion1.melody	@ltx/en_us_goadedes/he.a.m3:heAU.TheiasPisteos.name
ltx/en_us_goadedes/ho.ho15.m01:hoD24.Apolytikion1.mode	@ltx/en_us_goadedes/miscellanea:misc.Mode3
ltx/en_us_goadedes/ho.ho15.m01:hoD24.Apolytikion1.poet	
ltx/en_us_goadedes/ho.ho15.m01:hoD24.Apolytikion1.text	
ltx/en_us_goadedes/ho.ho15.m01:hoD24.Apolytikion1.title	@ltx/en_us_goadedes/titles:ti.DevoutW
ltx/en_us_goadedes/ho.ho15.m01:hoD26.Kontakion1.greekmelody	@ltx/en_us_goadedes/he.a.m4:heAU.EpefanisSimeron.greekname
ltx/en_us_goadedes/ho.ho15.m01:hoD26.Kontakion1.melody	@ltx/en_us_goadedes/he.a.m4:heAU.EpefanisSimeron.name
ltx/en_us_goadedes/ho.ho15.m01:hoD26.Kontakion1.mode	@ltx/en_us_goadedes/miscellanea:misc.Mode4
ltx/en_us_goadedes/ho.ho15.m01:hoD26.Kontakion1.poet	
ltx/en_us_goadedes/ho.ho15.m01:hoD26.Kontakion1.text	
ltx/en_us_goadedes/ho.ho15.m01:hoD26.Kontakion1.title	@ltx/en_us_goadedes/titles:ti.DevoutSaintM
