ltx/en_us_goadedes/oc.m3.d7:ocBK.ModeNaked	@ltx/en_us_goadedes/miscellanea:misc.Mode3.naked
ltx/en_us_goadedes/oc.m3.d7:ocBK.end.title	
ltx/en_us_goadedes/oc.m3.d7:ocBK.end.verse1.text	
ltx/en_us_goadedes/oc.m3.d7:ocBK.end.verse2.text	
ltx/en_us_goadedes/oc.m3.d7:ocBK.end.verse3.text	
ltx/en_us_goadedes/oc.m3.d7:ocBK.end.verse4.text	
ltx/en_us_goadedes/oc.m3.d7:ocBK.end.verse5.text	
ltx/en_us_goadedes/oc.m3.d7:ocBK.end.verse6.text	
ltx/en_us_goadedes/oc.m3.d7:ocLI.Beatitudes1.incipit	@ltx/en_us_goadedes/oc.m3.d1:ocLI.Beatitudes1.incipit
ltx/en_us_goadedes/oc.m3.d7:ocLI.Beatitudes1.melody	
ltx/en_us_goadedes/oc.m3.d7:ocLI.Beatitudes1.mode	@ltx/en_us_goadedes/miscellanea:misc.Mode3
ltx/en_us_goadedes/oc.m3.d7:ocLI.Beatitudes1.text	@ltx/en_us_goadedes/oc.m3.d1:ocLI.Beatitudes1.text
ltx/en_us_goadedes/oc.m3.d7:ocLI.Beatitudes2.incipit	…
ltx/en_us_goadedes/oc.m3.d7:ocLI.Beatitudes2.melody	
ltx/en_us_goadedes/oc.m3.d7:ocLI.Beatitudes2.mode	@ltx/en_us_goadedes/miscellanea:misc.Mode3
ltx/en_us_goadedes/oc.m3.d7:ocLI.Beatitudes2.text	
ltx/en_us_goadedes/oc.m3.d7:ocLI.Beatitudes3.incipit	…
ltx/en_us_goadedes/oc.m3.d7:ocLI.Beatitudes3.melody	
ltx/en_us_goadedes/oc.m3.d7:ocLI.Beatitudes3.mode	@ltx/en_us_goadedes/miscellanea:misc.Mode3
ltx/en_us_goadedes/oc.m3.d7:ocLI.Beatitudes3.text	
ltx/en_us_goadedes/oc.m3.d7:ocLI.Beatitudes4.incipit	…
ltx/en_us_goadedes/oc.m3.d7:ocLI.Beatitudes4.melody	
ltx/en_us_goadedes/oc.m3.d7:ocLI.Beatitudes4.mode	@ltx/en_us_goadedes/miscellanea:misc.Mode3
ltx/en_us_goadedes/oc.m3.d7:ocLI.Beatitudes4.text	
ltx/en_us_goadedes/oc.m3.d7:ocLI.BeatitudesT.incipit	…
ltx/en_us_goadedes/oc.m3.d7:ocLI.BeatitudesT.melody	
ltx/en_us_goadedes/oc.m3.d7:ocLI.BeatitudesT.mode	@ltx/en_us_goadedes/miscellanea:misc.Mode3
ltx/en_us_goadedes/oc.m3.d7:ocLI.BeatitudesT.text	
ltx/en_us_goadedes/oc.m3.d7:ocLI.BeatitudesTr.incipit	…
ltx/en_us_goadedes/oc.m3.d7:ocLI.BeatitudesTr.melody	
ltx/en_us_goadedes/oc.m3.d7:ocLI.BeatitudesTr.mode	@ltx/en_us_goadedes/miscellanea:misc.Mode3
ltx/en_us_goadedes/oc.m3.d7:ocLI.BeatitudesTr.text	
ltx/en_us_goadedes/oc.m3.d7:ocLI.MM.Beatitudes1234TrTas78910GB.text	@ltx/en_us_goadedes/properties:media.key
ltx/en_us_goadedes/oc.m3.d7:ocMA.ApolTheotokion.incipit	@ltx/en_us_goadedes/oc.m3.d5:ocVE.ApolTheotokionVM.incipit
ltx/en_us_goadedes/oc.m3.d7:ocMA.ApolTheotokion.melody	
ltx/en_us_goadedes/oc.m3.d7:ocMA.ApolTheotokion.mode	@ltx/en_us_goadedes/miscellanea:misc.Mode3
ltx/en_us_goadedes/oc.m3.d7:ocMA.ApolTheotokion.text	@ltx/en_us_goadedes/oc.m3.d5:ocVE.ApolTheotokionVM.text
ltx/en_us_goadedes/oc.m3.d7:ocMA.AposTheotokion.greekmelody	@ltx/en_us_goadedes/he.a.m3:heAU.ToTypoTouStavrou.greekname
ltx/en_us_goadedes/oc.m3.d7:ocMA.AposTheotokion.incipit	When God became incarnate…
ltx/en_us_goadedes/oc.m3.d7:ocMA.AposTheotokion.melody	@ltx/en_us_goadedes/he.a.m3:heAU.ToTypoTouStavrou.name
ltx/en_us_goadedes/oc.m3.d7:ocMA.AposTheotokion.mode	@ltx/en_us_goadedes/miscellanea:misc.Mode3
ltx/en_us_goadedes/oc.m3.d7:ocMA.AposTheotokion.text	When God became incarnate and He assumed * the essence of humanity in your womb, then you held the light * of the Godhead; and therefore we call you the lampstand metaphorically. * O Theotokos, earnestly pray your Son and God, * that He give rest to those who passed away from us, * and put them in the place, wherein glad are all who have their dwelling in Him, * to glorify you, all-blameless one.
ltx/en_us_goadedes/oc.m3.d7:ocMA.Aposticha1.greekmelody	@ltx/en_us_goadedes/he.a.m3:heAU.ToTypoTouStavrou.greekname
ltx/en_us_goadedes/oc.m3.d7:ocMA.Aposticha1.incipit	I glorify Your honorable cross…
ltx/en_us_goadedes/oc.m3.d7:ocMA.Aposticha1.melody	@ltx/en_us_goadedes/he.a.m3:heAU.ToTypoTouStavrou.name
ltx/en_us_goadedes/oc.m3.d7:ocMA.Aposticha1.mode	@ltx/en_us_goadedes/miscellanea:misc.Mode3
ltx/en_us_goadedes/oc.m3.d7:ocMA.Aposticha1.text	I glorify Your honorable cross, O Lord, * and Savior very merciful, for through it everlasting life * and delight have been given to us all who extol You with faith and love. * And now we sing to You, O Christ God, and pray * that You give rest to those who passed away from us, * and put them in the place, wherein glad are all who have their dwelling in you, * to glorify Your divinity.
ltx/en_us_goadedes/oc.m3.d7:ocMA.Aposticha2.greekmelody	@ltx/en_us_goadedes/he.a.m3:heAU.ToTypoTouStavrou.greekname
ltx/en_us_goadedes/oc.m3.d7:ocMA.Aposticha2.incipit	O Lord, supremely caring…
ltx/en_us_goadedes/oc.m3.d7:ocMA.Aposticha2.melody	@ltx/en_us_goadedes/he.a.m3:heAU.ToTypoTouStavrou.name
ltx/en_us_goadedes/oc.m3.d7:ocMA.Aposticha2.mode	@ltx/en_us_goadedes/miscellanea:misc.Mode3
ltx/en_us_goadedes/oc.m3.d7:ocMA.Aposticha2.text	O Lord, supremely caring and merciful, * You have an inconceivable abundance of benevolence, * and You know well the nature of humanity, for You created it. * As we entreat You now, O Christ God, we pray * that You give rest to those who passed away from us, * and put them in the place, wherein glad are all who have their dwelling in you, * to glorify Your divinity.
ltx/en_us_goadedes/oc.m3.d7:ocMA.Aposticha3.greekmelody	@ltx/en_us_goadedes/he.a.m3:heAU.ToTypoTouStavrou.greekname
ltx/en_us_goadedes/oc.m3.d7:ocMA.Aposticha3.incipit	While You, as man…
ltx/en_us_goadedes/oc.m3.d7:ocMA.Aposticha3.melody	@ltx/en_us_goadedes/he.a.m3:heAU.ToTypoTouStavrou.name
ltx/en_us_goadedes/oc.m3.d7:ocMA.Aposticha3.mode	@ltx/en_us_goadedes/miscellanea:misc.Mode3
ltx/en_us_goadedes/oc.m3.d7:ocMA.Aposticha3.text	While You, as man, lay dead in the sepulcher, * as God, by Your invincible might and power You raised the dead, * in their graves as if sleeping. And they sang extolling You unceasingly. * And now we sing to You, O Christ God, and pray * that You give rest to those who passed away from us, * and put them in the place, wherein glad are all who have their dwelling in you, * to glorify Your divinity.
ltx/en_us_goadedes/oc.m3.d7:ocMA.C1.acrostic.notice1	
ltx/en_us_goadedes/oc.m3.d7:ocMA.C1.acrostic.text	
ltx/en_us_goadedes/oc.m3.d7:ocMA.C1.acrostic.title	Canon for all the Saints.
ltx/en_us_goadedes/oc.m3.d7:ocMA.C2.acrostic.notice1	
ltx/en_us_goadedes/oc.m3.d7:ocMA.C2.acrostic.text	
ltx/en_us_goadedes/oc.m3.d7:ocMA.C2.acrostic.title	Canon for the Deceased.
ltx/en_us_goadedes/oc.m3.d7:ocMA.C2.poet	@ltx/en_us_goadedes/poets:po.Theofanous
ltx/en_us_goadedes/oc.m3.d7:ocMA.CA.notice	
ltx/en_us_goadedes/oc.m3.d7:ocMA.Kathisma11.greekmelody	@ltx/en_us_goadedes/he.a.m3:heAU.TinOraiotita.greekname
ltx/en_us_goadedes/oc.m3.d7:ocMA.Kathisma11.incipit	@ltx/en_us_goadedes/oc.m3.d3:ocMA.Kathisma32.incipit
ltx/en_us_goadedes/oc.m3.d7:ocMA.Kathisma11.melody	@ltx/en_us_goadedes/he.a.m3:heAU.TinOraiotita.name
ltx/en_us_goadedes/oc.m3.d7:ocMA.Kathisma11.mode	@ltx/en_us_goadedes/miscellanea:misc.Mode3
ltx/en_us_goadedes/oc.m3.d7:ocMA.Kathisma11.text	@ltx/en_us_goadedes/oc.m3.d3:ocMA.Kathisma32.text
ltx/en_us_goadedes/oc.m3.d7:ocMA.Kathisma12.greekmelody	@ltx/en_us_goadedes/he.a.m3:heAU.TinOraiotita.greekname
ltx/en_us_goadedes/oc.m3.d7:ocMA.Kathisma12.incipit	@ltx/en_us_goadedes/oc.m3.d4:ocMA.Kathisma32.incipit
ltx/en_us_goadedes/oc.m3.d7:ocMA.Kathisma12.melody	@ltx/en_us_goadedes/he.a.m3:heAU.TinOraiotita.name
ltx/en_us_goadedes/oc.m3.d7:ocMA.Kathisma12.mode	@ltx/en_us_goadedes/miscellanea:misc.Mode3
ltx/en_us_goadedes/oc.m3.d7:ocMA.Kathisma12.text	@ltx/en_us_goadedes/oc.m3.d4:ocMA.Kathisma32.text
ltx/en_us_goadedes/oc.m3.d7:ocMA.Kathisma13.incipit	@ltx/en_us_goadedes/oc.m3.d5:ocMA.Kathisma32.incipit
ltx/en_us_goadedes/oc.m3.d7:ocMA.Kathisma13.melody	
ltx/en_us_goadedes/oc.m3.d7:ocMA.Kathisma13.mode	@ltx/en_us_goadedes/miscellanea:misc.Mode3
ltx/en_us_goadedes/oc.m3.d7:ocMA.Kathisma13.text	@ltx/en_us_goadedes/oc.m3.d5:ocMA.Kathisma32.text
ltx/en_us_goadedes/oc.m3.d7:ocMA.Kathisma14.incipit	@ltx/en_us_goadedes/oc.m3.d1:ocVE.ApolTheotokionVM.incipit
ltx/en_us_goadedes/oc.m3.d7:ocMA.Kathisma14.melody	
ltx/en_us_goadedes/oc.m3.d7:ocMA.Kathisma14.mode	@ltx/en_us_goadedes/miscellanea:misc.Mode3
ltx/en_us_goadedes/oc.m3.d7:ocMA.Kathisma14.text	@ltx/en_us_goadedes/oc.m3.d1:ocVE.ApolTheotokionVM.text
ltx/en_us_goadedes/oc.m3.d7:ocMA.Kathisma21.incipit	@ltx/en_us_goadedes/oc.m3.d6:ocMA.Kathisma32.incipit
ltx/en_us_goadedes/oc.m3.d7:ocMA.Kathisma21.melody	
ltx/en_us_goadedes/oc.m3.d7:ocMA.Kathisma21.mode	@ltx/en_us_goadedes/miscellanea:misc.Mode3
ltx/en_us_goadedes/oc.m3.d7:ocMA.Kathisma21.text	@ltx/en_us_goadedes/oc.m3.d6:ocMA.Kathisma32.text
ltx/en_us_goadedes/oc.m3.d7:ocMA.Kathisma22.greekmelody	@ltx/en_us_goadedes/he.a.m3:heAU.TinOraiotita.greekname
ltx/en_us_goadedes/oc.m3.d7:ocMA.Kathisma22.incipit	When You command it…
ltx/en_us_goadedes/oc.m3.d7:ocMA.Kathisma22.melody	@ltx/en_us_goadedes/he.a.m3:heAU.TinOraiotita.name
ltx/en_us_goadedes/oc.m3.d7:ocMA.Kathisma22.mode	@ltx/en_us_goadedes/miscellanea:misc.Mode3
ltx/en_us_goadedes/oc.m3.d7:ocMA.Kathisma22.text	When You command it, Lord, and we shall all be brought * to You on Judgment Day and judged impartially, * O Christ, may we who have believed in You not be put to shame. * Even though we all have sinned, we have not run away from You. * Therefore we implore You to grant repose where the saints now dwell * to those whom You have taken, O Savior, * for You are singularly merciful.
ltx/en_us_goadedes/oc.m3.d7:ocMA.Kathisma23.greekmelody	@ltx/en_us_goadedes/he.a.m3:heAU.TinOraiotita.greekname
ltx/en_us_goadedes/oc.m3.d7:ocMA.Kathisma23.incipit	Our bitter fall to death…
ltx/en_us_goadedes/oc.m3.d7:ocMA.Kathisma23.melody	@ltx/en_us_goadedes/he.a.m3:heAU.TinOraiotita.name
ltx/en_us_goadedes/oc.m3.d7:ocMA.Kathisma23.mode	@ltx/en_us_goadedes/miscellanea:misc.Mode3
ltx/en_us_goadedes/oc.m3.d7:ocMA.Kathisma23.text	Our bitter fall to death involved a tree of old. * Now we are raised again through Your all-holy tree. * For You have killed the force of death, O Savior, by the tree of Your cross. * You became the well of life everlasting for everyone. * We implore You grant this life to the departed who had faith in You, * and give to these Your servants Your kingdom, * O Master, who are singularly merciful.
ltx/en_us_goadedes/oc.m3.d7:ocMA.Kathisma24.greekmelody	@ltx/en_us_goadedes/he.a.m3:heAU.TinOraiotita.greekname
ltx/en_us_goadedes/oc.m3.d7:ocMA.Kathisma24.incipit	O all-immaculate…
ltx/en_us_goadedes/oc.m3.d7:ocMA.Kathisma24.melody	@ltx/en_us_goadedes/he.a.m3:heAU.TinOraiotita.name
ltx/en_us_goadedes/oc.m3.d7:ocMA.Kathisma24.mode	@ltx/en_us_goadedes/miscellanea:misc.Mode3
ltx/en_us_goadedes/oc.m3.d7:ocMA.Kathisma24.text	O all-immaculate, all-blameless Virgin pure, * receive your supplicants who have reposed in faith * and by the will of God have passed away from the turbulent * storm of life; and usher them to the throne of our Judge and God, * earnestly entreating Him to release them and pardon them. * For since you are the Mother of our Maker, * you are able to accomplish whatever you wish.
ltx/en_us_goadedes/oc.m3.d7:ocMA.Lauds1.incipit	@ltx/en_us_goadedes/oc.m3.d3:ocMA.Aposticha3.incipit
ltx/en_us_goadedes/oc.m3.d7:ocMA.Lauds1.melody	
ltx/en_us_goadedes/oc.m3.d7:ocMA.Lauds1.mode	@ltx/en_us_goadedes/miscellanea:misc.Mode3
ltx/en_us_goadedes/oc.m3.d7:ocMA.Lauds1.text	@ltx/en_us_goadedes/oc.m3.d3:ocMA.Aposticha3.text
ltx/en_us_goadedes/oc.m3.d7:ocMA.Lauds2.incipit	@ltx/en_us_goadedes/oc.m3.d4:ocMA.Aposticha3.incipit
ltx/en_us_goadedes/oc.m3.d7:ocMA.Lauds2.melody	
ltx/en_us_goadedes/oc.m3.d7:ocMA.Lauds2.mode	@ltx/en_us_goadedes/miscellanea:misc.Mode3
ltx/en_us_goadedes/oc.m3.d7:ocMA.Lauds2.text	@ltx/en_us_goadedes/oc.m3.d4:ocMA.Aposticha3.text
ltx/en_us_goadedes/oc.m3.d7:ocMA.Lauds3.incipit	@ltx/en_us_goadedes/oc.m3.d5:ocMA.Aposticha3.incipit
ltx/en_us_goadedes/oc.m3.d7:ocMA.Lauds3.melody	
ltx/en_us_goadedes/oc.m3.d7:ocMA.Lauds3.mode	@ltx/en_us_goadedes/miscellanea:misc.Mode3
ltx/en_us_goadedes/oc.m3.d7:ocMA.Lauds3.text	@ltx/en_us_goadedes/oc.m3.d5:ocMA.Aposticha3.text
ltx/en_us_goadedes/oc.m3.d7:ocMA.Lauds4.incipit	O people, why be troubled…
ltx/en_us_goadedes/oc.m3.d7:ocMA.Lauds4.melody	
ltx/en_us_goadedes/oc.m3.d7:ocMA.Lauds4.mode	@ltx/en_us_goadedes/miscellanea:misc.Mode3
ltx/en_us_goadedes/oc.m3.d7:ocMA.Lauds4.text	O people, why be troubled about useless things? The race we are running is short. Our life here is like a puff of smoke, a mist, dust and ashes; it is here for a short time, then it quickly loses its purpose. So let us pray to Christ our immortal King, “To those who have passed away from us grant repose, where glad are all who have their dwelling in You.”
ltx/en_us_goadedes/oc.m3.d7:ocMA.LaudsRubric1.text	@ltx/en_us_goadedes/oc.m1.d7:ocMA.LaudsRubric1.text
ltx/en_us_goadedes/oc.m3.d7:ocMA.LaudsTheotokion.incipit	@ltx/en_us_goadedes/oc.m3.d2:ocVE.AposTheotokion.incipit
ltx/en_us_goadedes/oc.m3.d7:ocMA.LaudsTheotokion.melody	
ltx/en_us_goadedes/oc.m3.d7:ocMA.LaudsTheotokion.mode	@ltx/en_us_goadedes/miscellanea:misc.Mode3
ltx/en_us_goadedes/oc.m3.d7:ocMA.LaudsTheotokion.text	@ltx/en_us_goadedes/oc.m3.d2:ocVE.AposTheotokion.text
ltx/en_us_goadedes/oc.m3.d7:ocMA.MM.Alleluia.text	@ltx/en_us_goadedes/properties:media.key
ltx/en_us_goadedes/oc.m3.d7:ocMA.OdeW1C11.incipit	…
ltx/en_us_goadedes/oc.m3.d7:ocMA.OdeW1C11.melody	@ltx/en_us_goadedes/he.h.m3:heHE.ThavmastosEndoxos.name
ltx/en_us_goadedes/oc.m3.d7:ocMA.OdeW1C11.mode	@ltx/en_us_goadedes/miscellanea:misc.Mode3
ltx/en_us_goadedes/oc.m3.d7:ocMA.OdeW1C11.ode	@ltx/en_us_goadedes/miscellanea:misc.Ode1
ltx/en_us_goadedes/oc.m3.d7:ocMA.OdeW1C11.text	
ltx/en_us_goadedes/oc.m3.d7:ocMA.OdeW1C12.incipit	…
ltx/en_us_goadedes/oc.m3.d7:ocMA.OdeW1C12.melody	@ltx/en_us_goadedes/he.h.m3:heHE.ThavmastosEndoxos.name
ltx/en_us_goadedes/oc.m3.d7:ocMA.OdeW1C12.mode	@ltx/en_us_goadedes/miscellanea:misc.Mode3
ltx/en_us_goadedes/oc.m3.d7:ocMA.OdeW1C12.ode	@ltx/en_us_goadedes/miscellanea:misc.Ode1
ltx/en_us_goadedes/oc.m3.d7:ocMA.OdeW1C12.text	
ltx/en_us_goadedes/oc.m3.d7:ocMA.OdeW1C13.incipit	…
ltx/en_us_goadedes/oc.m3.d7:ocMA.OdeW1C13.melody	@ltx/en_us_goadedes/he.h.m3:heHE.ThavmastosEndoxos.name
ltx/en_us_goadedes/oc.m3.d7:ocMA.OdeW1C13.mode	@ltx/en_us_goadedes/miscellanea:misc.Mode3
ltx/en_us_goadedes/oc.m3.d7:ocMA.OdeW1C13.ode	@ltx/en_us_goadedes/miscellanea:misc.Ode1
ltx/en_us_goadedes/oc.m3.d7:ocMA.OdeW1C13.text	
ltx/en_us_goadedes/oc.m3.d7:ocMA.OdeW1C14.incipit	…
ltx/en_us_goadedes/oc.m3.d7:ocMA.OdeW1C14.melody	@ltx/en_us_goadedes/he.h.m3:heHE.ThavmastosEndoxos.name
ltx/en_us_goadedes/oc.m3.d7:ocMA.OdeW1C14.mode	@ltx/en_us_goadedes/miscellanea:misc.Mode3
ltx/en_us_goadedes/oc.m3.d7:ocMA.OdeW1C14.ode	@ltx/en_us_goadedes/miscellanea:misc.Ode1
ltx/en_us_goadedes/oc.m3.d7:ocMA.OdeW1C14.text	
ltx/en_us_goadedes/oc.m3.d7:ocMA.OdeW1C1H.greekmelody	@ltx/en_us_goadedes/he.h.m3:heHE.ThavmastosEndoxos.greekname
ltx/en_us_goadedes/oc.m3.d7:ocMA.OdeW1C1H.incipit	@ltx/en_us_goadedes/he.h.m3:heHE.ThavmastosEndoxos.incipit
ltx/en_us_goadedes/oc.m3.d7:ocMA.OdeW1C1H.melody	@ltx/en_us_goadedes/he.h.m3:heHE.ThavmastosEndoxos.melody
ltx/en_us_goadedes/oc.m3.d7:ocMA.OdeW1C1H.mode	@ltx/en_us_goadedes/miscellanea:misc.Mode3
ltx/en_us_goadedes/oc.m3.d7:ocMA.OdeW1C1H.ode	@ltx/en_us_goadedes/miscellanea:misc.Ode1
ltx/en_us_goadedes/oc.m3.d7:ocMA.OdeW1C1H.text	@ltx/en_us_goadedes/he.h.m3:heHE.ThavmastosEndoxos.text
ltx/en_us_goadedes/oc.m3.d7:ocMA.OdeW1C1T.incipit	…
ltx/en_us_goadedes/oc.m3.d7:ocMA.OdeW1C1T.melody	@ltx/en_us_goadedes/he.h.m3:heHE.ThavmastosEndoxos.name
ltx/en_us_goadedes/oc.m3.d7:ocMA.OdeW1C1T.mode	@ltx/en_us_goadedes/miscellanea:misc.Mode3
ltx/en_us_goadedes/oc.m3.d7:ocMA.OdeW1C1T.ode	@ltx/en_us_goadedes/miscellanea:misc.Ode1
ltx/en_us_goadedes/oc.m3.d7:ocMA.OdeW1C1T.text	
ltx/en_us_goadedes/oc.m3.d7:ocMA.OdeW1C21.greekmelody	@ltx/en_us_goadedes/he.h.m3:heHE.TemnomeninThalassan.greekname
ltx/en_us_goadedes/oc.m3.d7:ocMA.OdeW1C21.incipit	…
ltx/en_us_goadedes/oc.m3.d7:ocMA.OdeW1C21.melody	@ltx/en_us_goadedes/he.h.m3:heHE.TemnomeninThalassan.name
ltx/en_us_goadedes/oc.m3.d7:ocMA.OdeW1C21.mode	@ltx/en_us_goadedes/miscellanea:misc.Mode3
ltx/en_us_goadedes/oc.m3.d7:ocMA.OdeW1C21.ode	@ltx/en_us_goadedes/miscellanea:misc.Ode1
ltx/en_us_goadedes/oc.m3.d7:ocMA.OdeW1C21.text	
ltx/en_us_goadedes/oc.m3.d7:ocMA.OdeW1C22.incipit	…
ltx/en_us_goadedes/oc.m3.d7:ocMA.OdeW1C22.melody	@ltx/en_us_goadedes/he.h.m3:heHE.TemnomeninThalassan.name
ltx/en_us_goadedes/oc.m3.d7:ocMA.OdeW1C22.mode	@ltx/en_us_goadedes/miscellanea:misc.Mode3
ltx/en_us_goadedes/oc.m3.d7:ocMA.OdeW1C22.ode	@ltx/en_us_goadedes/miscellanea:misc.Ode1
ltx/en_us_goadedes/oc.m3.d7:ocMA.OdeW1C22.text	
ltx/en_us_goadedes/oc.m3.d7:ocMA.OdeW1C23.incipit	…
ltx/en_us_goadedes/oc.m3.d7:ocMA.OdeW1C23.melody	@ltx/en_us_goadedes/he.h.m3:heHE.TemnomeninThalassan.name
ltx/en_us_goadedes/oc.m3.d7:ocMA.OdeW1C23.mode	@ltx/en_us_goadedes/miscellanea:misc.Mode3
ltx/en_us_goadedes/oc.m3.d7:ocMA.OdeW1C23.ode	@ltx/en_us_goadedes/miscellanea:misc.Ode1
ltx/en_us_goadedes/oc.m3.d7:ocMA.OdeW1C23.text	
ltx/en_us_goadedes/oc.m3.d7:ocMA.OdeW1C2T.incipit	…
ltx/en_us_goadedes/oc.m3.d7:ocMA.OdeW1C2T.melody	@ltx/en_us_goadedes/he.h.m3:heHE.TemnomeninThalassan.name
ltx/en_us_goadedes/oc.m3.d7:ocMA.OdeW1C2T.mode	@ltx/en_us_goadedes/miscellanea:misc.Mode3
ltx/en_us_goadedes/oc.m3.d7:ocMA.OdeW1C2T.ode	@ltx/en_us_goadedes/miscellanea:misc.Ode1
ltx/en_us_goadedes/oc.m3.d7:ocMA.OdeW1C2T.text	
ltx/en_us_goadedes/oc.m3.d7:ocMA.OdeW3C11.incipit	…
ltx/en_us_goadedes/oc.m3.d7:ocMA.OdeW3C11.melody	@ltx/en_us_goadedes/he.h.m3:heHE.SteiraPsychi.name
ltx/en_us_goadedes/oc.m3.d7:ocMA.OdeW3C11.mode	@ltx/en_us_goadedes/miscellanea:misc.Mode3
ltx/en_us_goadedes/oc.m3.d7:ocMA.OdeW3C11.ode	@ltx/en_us_goadedes/miscellanea:misc.Ode3
ltx/en_us_goadedes/oc.m3.d7:ocMA.OdeW3C11.text	
ltx/en_us_goadedes/oc.m3.d7:ocMA.OdeW3C12.incipit	…
ltx/en_us_goadedes/oc.m3.d7:ocMA.OdeW3C12.melody	@ltx/en_us_goadedes/he.h.m3:heHE.SteiraPsychi.name
ltx/en_us_goadedes/oc.m3.d7:ocMA.OdeW3C12.mode	@ltx/en_us_goadedes/miscellanea:misc.Mode3
ltx/en_us_goadedes/oc.m3.d7:ocMA.OdeW3C12.ode	@ltx/en_us_goadedes/miscellanea:misc.Ode3
ltx/en_us_goadedes/oc.m3.d7:ocMA.OdeW3C12.text	
ltx/en_us_goadedes/oc.m3.d7:ocMA.OdeW3C13.incipit	…
ltx/en_us_goadedes/oc.m3.d7:ocMA.OdeW3C13.melody	@ltx/en_us_goadedes/he.h.m3:heHE.SteiraPsychi.name
ltx/en_us_goadedes/oc.m3.d7:ocMA.OdeW3C13.mode	@ltx/en_us_goadedes/miscellanea:misc.Mode3
ltx/en_us_goadedes/oc.m3.d7:ocMA.OdeW3C13.ode	@ltx/en_us_goadedes/miscellanea:misc.Ode3
ltx/en_us_goadedes/oc.m3.d7:ocMA.OdeW3C13.text	
ltx/en_us_goadedes/oc.m3.d7:ocMA.OdeW3C14.incipit	…
ltx/en_us_goadedes/oc.m3.d7:ocMA.OdeW3C14.melody	@ltx/en_us_goadedes/he.h.m3:heHE.SteiraPsychi.name
ltx/en_us_goadedes/oc.m3.d7:ocMA.OdeW3C14.mode	@ltx/en_us_goadedes/miscellanea:misc.Mode3
ltx/en_us_goadedes/oc.m3.d7:ocMA.OdeW3C14.ode	@ltx/en_us_goadedes/miscellanea:misc.Ode3
ltx/en_us_goadedes/oc.m3.d7:ocMA.OdeW3C14.text	
ltx/en_us_goadedes/oc.m3.d7:ocMA.OdeW3C1H.greekmelody	@ltx/en_us_goadedes/he.h.m3:heHE.SteiraPsychi.greekname
ltx/en_us_goadedes/oc.m3.d7:ocMA.OdeW3C1H.incipit	@ltx/en_us_goadedes/he.h.m3:heHE.SteiraPsychi.incipit
ltx/en_us_goadedes/oc.m3.d7:ocMA.OdeW3C1H.melody	@ltx/en_us_goadedes/he.h.m3:heHE.SteiraPsychi.melody
ltx/en_us_goadedes/oc.m3.d7:ocMA.OdeW3C1H.mode	@ltx/en_us_goadedes/miscellanea:misc.Mode3
ltx/en_us_goadedes/oc.m3.d7:ocMA.OdeW3C1H.ode	@ltx/en_us_goadedes/miscellanea:misc.Ode3
ltx/en_us_goadedes/oc.m3.d7:ocMA.OdeW3C1H.text	@ltx/en_us_goadedes/he.h.m3:heHE.SteiraPsychi.text
ltx/en_us_goadedes/oc.m3.d7:ocMA.OdeW3C1T.incipit	…
ltx/en_us_goadedes/oc.m3.d7:ocMA.OdeW3C1T.melody	@ltx/en_us_goadedes/he.h.m3:heHE.SteiraPsychi.name
ltx/en_us_goadedes/oc.m3.d7:ocMA.OdeW3C1T.mode	@ltx/en_us_goadedes/miscellanea:misc.Mode3
ltx/en_us_goadedes/oc.m3.d7:ocMA.OdeW3C1T.ode	@ltx/en_us_goadedes/miscellanea:misc.Ode3
ltx/en_us_goadedes/oc.m3.d7:ocMA.OdeW3C1T.text	
ltx/en_us_goadedes/oc.m3.d7:ocMA.OdeW3C21.greekmelody	@ltx/en_us_goadedes/he.h.m3:heHE.OEkMiOnton.greekname
ltx/en_us_goadedes/oc.m3.d7:ocMA.OdeW3C21.incipit	…
ltx/en_us_goadedes/oc.m3.d7:ocMA.OdeW3C21.melody	@ltx/en_us_goadedes/he.h.m3:heHE.OEkMiOnton.name
ltx/en_us_goadedes/oc.m3.d7:ocMA.OdeW3C21.mode	@ltx/en_us_goadedes/miscellanea:misc.Mode3
ltx/en_us_goadedes/oc.m3.d7:ocMA.OdeW3C21.ode	@ltx/en_us_goadedes/miscellanea:misc.Ode3
ltx/en_us_goadedes/oc.m3.d7:ocMA.OdeW3C21.text	
ltx/en_us_goadedes/oc.m3.d7:ocMA.OdeW3C22.incipit	…
ltx/en_us_goadedes/oc.m3.d7:ocMA.OdeW3C22.melody	@ltx/en_us_goadedes/he.h.m3:heHE.OEkMiOnton.name
ltx/en_us_goadedes/oc.m3.d7:ocMA.OdeW3C22.mode	@ltx/en_us_goadedes/miscellanea:misc.Mode3
ltx/en_us_goadedes/oc.m3.d7:ocMA.OdeW3C22.ode	@ltx/en_us_goadedes/miscellanea:misc.Ode3
ltx/en_us_goadedes/oc.m3.d7:ocMA.OdeW3C22.text	
ltx/en_us_goadedes/oc.m3.d7:ocMA.OdeW3C23.incipit	…
ltx/en_us_goadedes/oc.m3.d7:ocMA.OdeW3C23.melody	@ltx/en_us_goadedes/he.h.m3:heHE.OEkMiOnton.name
ltx/en_us_goadedes/oc.m3.d7:ocMA.OdeW3C23.mode	@ltx/en_us_goadedes/miscellanea:misc.Mode3
ltx/en_us_goadedes/oc.m3.d7:ocMA.OdeW3C23.ode	@ltx/en_us_goadedes/miscellanea:misc.Ode3
ltx/en_us_goadedes/oc.m3.d7:ocMA.OdeW3C23.text	
ltx/en_us_goadedes/oc.m3.d7:ocMA.OdeW3C2T.incipit	…
ltx/en_us_goadedes/oc.m3.d7:ocMA.OdeW3C2T.melody	@ltx/en_us_goadedes/he.h.m3:heHE.OEkMiOnton.name
ltx/en_us_goadedes/oc.m3.d7:ocMA.OdeW3C2T.mode	@ltx/en_us_goadedes/miscellanea:misc.Mode3
ltx/en_us_goadedes/oc.m3.d7:ocMA.OdeW3C2T.ode	@ltx/en_us_goadedes/miscellanea:misc.Ode3
ltx/en_us_goadedes/oc.m3.d7:ocMA.OdeW3C2T.text	
ltx/en_us_goadedes/oc.m3.d7:ocMA.OdeW4C11.incipit	…
ltx/en_us_goadedes/oc.m3.d7:ocMA.OdeW4C11.melody	@ltx/en_us_goadedes/he.h.m3:heHE.ToKataskionOros.name
ltx/en_us_goadedes/oc.m3.d7:ocMA.OdeW4C11.mode	@ltx/en_us_goadedes/miscellanea:misc.Mode3
ltx/en_us_goadedes/oc.m3.d7:ocMA.OdeW4C11.ode	@ltx/en_us_goadedes/miscellanea:misc.Ode4
ltx/en_us_goadedes/oc.m3.d7:ocMA.OdeW4C11.text	
ltx/en_us_goadedes/oc.m3.d7:ocMA.OdeW4C12.incipit	…
ltx/en_us_goadedes/oc.m3.d7:ocMA.OdeW4C12.melody	@ltx/en_us_goadedes/he.h.m3:heHE.ToKataskionOros.name
ltx/en_us_goadedes/oc.m3.d7:ocMA.OdeW4C12.mode	@ltx/en_us_goadedes/miscellanea:misc.Mode3
ltx/en_us_goadedes/oc.m3.d7:ocMA.OdeW4C12.ode	@ltx/en_us_goadedes/miscellanea:misc.Ode4
ltx/en_us_goadedes/oc.m3.d7:ocMA.OdeW4C12.text	
ltx/en_us_goadedes/oc.m3.d7:ocMA.OdeW4C13.incipit	…
ltx/en_us_goadedes/oc.m3.d7:ocMA.OdeW4C13.melody	@ltx/en_us_goadedes/he.h.m3:heHE.ToKataskionOros.name
ltx/en_us_goadedes/oc.m3.d7:ocMA.OdeW4C13.mode	@ltx/en_us_goadedes/miscellanea:misc.Mode3
ltx/en_us_goadedes/oc.m3.d7:ocMA.OdeW4C13.ode	@ltx/en_us_goadedes/miscellanea:misc.Ode4
ltx/en_us_goadedes/oc.m3.d7:ocMA.OdeW4C13.text	
ltx/en_us_goadedes/oc.m3.d7:ocMA.OdeW4C14.incipit	…
ltx/en_us_goadedes/oc.m3.d7:ocMA.OdeW4C14.melody	@ltx/en_us_goadedes/he.h.m3:heHE.ToKataskionOros.name
ltx/en_us_goadedes/oc.m3.d7:ocMA.OdeW4C14.mode	@ltx/en_us_goadedes/miscellanea:misc.Mode3
ltx/en_us_goadedes/oc.m3.d7:ocMA.OdeW4C14.ode	@ltx/en_us_goadedes/miscellanea:misc.Ode4
ltx/en_us_goadedes/oc.m3.d7:ocMA.OdeW4C14.text	
ltx/en_us_goadedes/oc.m3.d7:ocMA.OdeW4C1H.greekmelody	@ltx/en_us_goadedes/he.h.m3:heHE.ToKataskionOros.greekname
ltx/en_us_goadedes/oc.m3.d7:ocMA.OdeW4C1H.incipit	@ltx/en_us_goadedes/he.h.m3:heHE.ToKataskionOros.incipit
ltx/en_us_goadedes/oc.m3.d7:ocMA.OdeW4C1H.melody	@ltx/en_us_goadedes/he.h.m3:heHE.ToKataskionOros.melody
ltx/en_us_goadedes/oc.m3.d7:ocMA.OdeW4C1H.mode	@ltx/en_us_goadedes/miscellanea:misc.Mode3
ltx/en_us_goadedes/oc.m3.d7:ocMA.OdeW4C1H.ode	@ltx/en_us_goadedes/miscellanea:misc.Ode4
ltx/en_us_goadedes/oc.m3.d7:ocMA.OdeW4C1H.text	@ltx/en_us_goadedes/he.h.m3:heHE.ToKataskionOros.text
ltx/en_us_goadedes/oc.m3.d7:ocMA.OdeW4C1T.incipit	…
ltx/en_us_goadedes/oc.m3.d7:ocMA.OdeW4C1T.melody	@ltx/en_us_goadedes/he.h.m3:heHE.ToKataskionOros.name
ltx/en_us_goadedes/oc.m3.d7:ocMA.OdeW4C1T.mode	@ltx/en_us_goadedes/miscellanea:misc.Mode3
ltx/en_us_goadedes/oc.m3.d7:ocMA.OdeW4C1T.ode	@ltx/en_us_goadedes/miscellanea:misc.Ode4
ltx/en_us_goadedes/oc.m3.d7:ocMA.OdeW4C1T.text	
ltx/en_us_goadedes/oc.m3.d7:ocMA.OdeW4C21.greekmelody	@ltx/en_us_goadedes/he.h.m3:heHE.EthouProsImas.greekname
ltx/en_us_goadedes/oc.m3.d7:ocMA.OdeW4C21.incipit	…
ltx/en_us_goadedes/oc.m3.d7:ocMA.OdeW4C21.melody	@ltx/en_us_goadedes/he.h.m3:heHE.EthouProsImas.name
ltx/en_us_goadedes/oc.m3.d7:ocMA.OdeW4C21.mode	@ltx/en_us_goadedes/miscellanea:misc.Mode3
ltx/en_us_goadedes/oc.m3.d7:ocMA.OdeW4C21.ode	@ltx/en_us_goadedes/miscellanea:misc.Ode4
ltx/en_us_goadedes/oc.m3.d7:ocMA.OdeW4C21.text	
ltx/en_us_goadedes/oc.m3.d7:ocMA.OdeW4C22.incipit	…
ltx/en_us_goadedes/oc.m3.d7:ocMA.OdeW4C22.melody	@ltx/en_us_goadedes/he.h.m3:heHE.EthouProsImas.name
ltx/en_us_goadedes/oc.m3.d7:ocMA.OdeW4C22.mode	@ltx/en_us_goadedes/miscellanea:misc.Mode3
ltx/en_us_goadedes/oc.m3.d7:ocMA.OdeW4C22.ode	@ltx/en_us_goadedes/miscellanea:misc.Ode4
ltx/en_us_goadedes/oc.m3.d7:ocMA.OdeW4C22.text	
ltx/en_us_goadedes/oc.m3.d7:ocMA.OdeW4C23.incipit	…
ltx/en_us_goadedes/oc.m3.d7:ocMA.OdeW4C23.melody	@ltx/en_us_goadedes/he.h.m3:heHE.EthouProsImas.name
ltx/en_us_goadedes/oc.m3.d7:ocMA.OdeW4C23.mode	@ltx/en_us_goadedes/miscellanea:misc.Mode3
ltx/en_us_goadedes/oc.m3.d7:ocMA.OdeW4C23.ode	@ltx/en_us_goadedes/miscellanea:misc.Ode4
ltx/en_us_goadedes/oc.m3.d7:ocMA.OdeW4C23.text	
ltx/en_us_goadedes/oc.m3.d7:ocMA.OdeW4C2T.incipit	…
ltx/en_us_goadedes/oc.m3.d7:ocMA.OdeW4C2T.melody	@ltx/en_us_goadedes/he.h.m3:heHE.EthouProsImas.name
ltx/en_us_goadedes/oc.m3.d7:ocMA.OdeW4C2T.mode	@ltx/en_us_goadedes/miscellanea:misc.Mode3
ltx/en_us_goadedes/oc.m3.d7:ocMA.OdeW4C2T.ode	@ltx/en_us_goadedes/miscellanea:misc.Ode4
ltx/en_us_goadedes/oc.m3.d7:ocMA.OdeW4C2T.text	
ltx/en_us_goadedes/oc.m3.d7:ocMA.OdeW5C11.incipit	…
ltx/en_us_goadedes/oc.m3.d7:ocMA.OdeW5C11.melody	@ltx/en_us_goadedes/he.h.m3:heHE.ToFosSouToAnesperon.name
ltx/en_us_goadedes/oc.m3.d7:ocMA.OdeW5C11.mode	@ltx/en_us_goadedes/miscellanea:misc.Mode3
ltx/en_us_goadedes/oc.m3.d7:ocMA.OdeW5C11.ode	@ltx/en_us_goadedes/miscellanea:misc.Ode5
ltx/en_us_goadedes/oc.m3.d7:ocMA.OdeW5C11.text	
ltx/en_us_goadedes/oc.m3.d7:ocMA.OdeW5C12.incipit	…
ltx/en_us_goadedes/oc.m3.d7:ocMA.OdeW5C12.melody	@ltx/en_us_goadedes/he.h.m3:heHE.ToFosSouToAnesperon.name
ltx/en_us_goadedes/oc.m3.d7:ocMA.OdeW5C12.mode	@ltx/en_us_goadedes/miscellanea:misc.Mode3
ltx/en_us_goadedes/oc.m3.d7:ocMA.OdeW5C12.ode	@ltx/en_us_goadedes/miscellanea:misc.Ode5
ltx/en_us_goadedes/oc.m3.d7:ocMA.OdeW5C12.text	
ltx/en_us_goadedes/oc.m3.d7:ocMA.OdeW5C13.incipit	…
ltx/en_us_goadedes/oc.m3.d7:ocMA.OdeW5C13.melody	@ltx/en_us_goadedes/he.h.m3:heHE.ToFosSouToAnesperon.name
ltx/en_us_goadedes/oc.m3.d7:ocMA.OdeW5C13.mode	@ltx/en_us_goadedes/miscellanea:misc.Mode3
ltx/en_us_goadedes/oc.m3.d7:ocMA.OdeW5C13.ode	@ltx/en_us_goadedes/miscellanea:misc.Ode5
ltx/en_us_goadedes/oc.m3.d7:ocMA.OdeW5C13.text	
ltx/en_us_goadedes/oc.m3.d7:ocMA.OdeW5C14.incipit	…
ltx/en_us_goadedes/oc.m3.d7:ocMA.OdeW5C14.melody	@ltx/en_us_goadedes/he.h.m3:heHE.ToFosSouToAnesperon.name
ltx/en_us_goadedes/oc.m3.d7:ocMA.OdeW5C14.mode	@ltx/en_us_goadedes/miscellanea:misc.Mode3
ltx/en_us_goadedes/oc.m3.d7:ocMA.OdeW5C14.ode	@ltx/en_us_goadedes/miscellanea:misc.Ode5
ltx/en_us_goadedes/oc.m3.d7:ocMA.OdeW5C14.text	
ltx/en_us_goadedes/oc.m3.d7:ocMA.OdeW5C1H.greekmelody	@ltx/en_us_goadedes/he.h.m3:heHE.ToFosSouToAnesperon.greekname
ltx/en_us_goadedes/oc.m3.d7:ocMA.OdeW5C1H.incipit	@ltx/en_us_goadedes/he.h.m3:heHE.ToFosSouToAnesperon.incipit
ltx/en_us_goadedes/oc.m3.d7:ocMA.OdeW5C1H.melody	@ltx/en_us_goadedes/he.h.m3:heHE.ToFosSouToAnesperon.melody
ltx/en_us_goadedes/oc.m3.d7:ocMA.OdeW5C1H.mode	@ltx/en_us_goadedes/miscellanea:misc.Mode3
ltx/en_us_goadedes/oc.m3.d7:ocMA.OdeW5C1H.ode	@ltx/en_us_goadedes/miscellanea:misc.Ode5
ltx/en_us_goadedes/oc.m3.d7:ocMA.OdeW5C1H.text	@ltx/en_us_goadedes/he.h.m3:heHE.ToFosSouToAnesperon.text
ltx/en_us_goadedes/oc.m3.d7:ocMA.OdeW5C1T.incipit	…
ltx/en_us_goadedes/oc.m3.d7:ocMA.OdeW5C1T.melody	@ltx/en_us_goadedes/he.h.m3:heHE.ToFosSouToAnesperon.name
ltx/en_us_goadedes/oc.m3.d7:ocMA.OdeW5C1T.mode	@ltx/en_us_goadedes/miscellanea:misc.Mode3
ltx/en_us_goadedes/oc.m3.d7:ocMA.OdeW5C1T.ode	@ltx/en_us_goadedes/miscellanea:misc.Ode5
ltx/en_us_goadedes/oc.m3.d7:ocMA.OdeW5C1T.text	
ltx/en_us_goadedes/oc.m3.d7:ocMA.OdeW5C21.greekmelody	@ltx/en_us_goadedes/he.h.m3:heHE.ProsSeOrthrizo.greekname
ltx/en_us_goadedes/oc.m3.d7:ocMA.OdeW5C21.incipit	…
ltx/en_us_goadedes/oc.m3.d7:ocMA.OdeW5C21.melody	@ltx/en_us_goadedes/he.h.m3:heHE.ProsSeOrthrizo.name
ltx/en_us_goadedes/oc.m3.d7:ocMA.OdeW5C21.mode	@ltx/en_us_goadedes/miscellanea:misc.Mode3
ltx/en_us_goadedes/oc.m3.d7:ocMA.OdeW5C21.ode	@ltx/en_us_goadedes/miscellanea:misc.Ode5
ltx/en_us_goadedes/oc.m3.d7:ocMA.OdeW5C21.text	
ltx/en_us_goadedes/oc.m3.d7:ocMA.OdeW5C22.incipit	…
ltx/en_us_goadedes/oc.m3.d7:ocMA.OdeW5C22.melody	@ltx/en_us_goadedes/he.h.m3:heHE.ProsSeOrthrizo.name
ltx/en_us_goadedes/oc.m3.d7:ocMA.OdeW5C22.mode	@ltx/en_us_goadedes/miscellanea:misc.Mode3
ltx/en_us_goadedes/oc.m3.d7:ocMA.OdeW5C22.ode	@ltx/en_us_goadedes/miscellanea:misc.Ode5
ltx/en_us_goadedes/oc.m3.d7:ocMA.OdeW5C22.text	
ltx/en_us_goadedes/oc.m3.d7:ocMA.OdeW5C23.incipit	…
ltx/en_us_goadedes/oc.m3.d7:ocMA.OdeW5C23.melody	@ltx/en_us_goadedes/he.h.m3:heHE.ProsSeOrthrizo.name
ltx/en_us_goadedes/oc.m3.d7:ocMA.OdeW5C23.mode	@ltx/en_us_goadedes/miscellanea:misc.Mode3
ltx/en_us_goadedes/oc.m3.d7:ocMA.OdeW5C23.ode	@ltx/en_us_goadedes/miscellanea:misc.Ode5
ltx/en_us_goadedes/oc.m3.d7:ocMA.OdeW5C23.text	
ltx/en_us_goadedes/oc.m3.d7:ocMA.OdeW5C2T.incipit	…
ltx/en_us_goadedes/oc.m3.d7:ocMA.OdeW5C2T.melody	@ltx/en_us_goadedes/he.h.m3:heHE.ProsSeOrthrizo.name
ltx/en_us_goadedes/oc.m3.d7:ocMA.OdeW5C2T.mode	@ltx/en_us_goadedes/miscellanea:misc.Mode3
ltx/en_us_goadedes/oc.m3.d7:ocMA.OdeW5C2T.ode	@ltx/en_us_goadedes/miscellanea:misc.Ode5
ltx/en_us_goadedes/oc.m3.d7:ocMA.OdeW5C2T.text	
ltx/en_us_goadedes/oc.m3.d7:ocMA.OdeW6C11.incipit	…
ltx/en_us_goadedes/oc.m3.d7:ocMA.OdeW6C11.melody	@ltx/en_us_goadedes/he.h.m3:heHE.VythosMoiTonPathon.name
ltx/en_us_goadedes/oc.m3.d7:ocMA.OdeW6C11.mode	@ltx/en_us_goadedes/miscellanea:misc.Mode3
ltx/en_us_goadedes/oc.m3.d7:ocMA.OdeW6C11.ode	@ltx/en_us_goadedes/miscellanea:misc.Ode6
ltx/en_us_goadedes/oc.m3.d7:ocMA.OdeW6C11.text	
ltx/en_us_goadedes/oc.m3.d7:ocMA.OdeW6C12.incipit	…
ltx/en_us_goadedes/oc.m3.d7:ocMA.OdeW6C12.melody	@ltx/en_us_goadedes/he.h.m3:heHE.VythosMoiTonPathon.name
ltx/en_us_goadedes/oc.m3.d7:ocMA.OdeW6C12.mode	@ltx/en_us_goadedes/miscellanea:misc.Mode3
ltx/en_us_goadedes/oc.m3.d7:ocMA.OdeW6C12.ode	@ltx/en_us_goadedes/miscellanea:misc.Ode6
ltx/en_us_goadedes/oc.m3.d7:ocMA.OdeW6C12.text	
ltx/en_us_goadedes/oc.m3.d7:ocMA.OdeW6C13.incipit	…
ltx/en_us_goadedes/oc.m3.d7:ocMA.OdeW6C13.melody	@ltx/en_us_goadedes/he.h.m3:heHE.VythosMoiTonPathon.name
ltx/en_us_goadedes/oc.m3.d7:ocMA.OdeW6C13.mode	@ltx/en_us_goadedes/miscellanea:misc.Mode3
ltx/en_us_goadedes/oc.m3.d7:ocMA.OdeW6C13.ode	@ltx/en_us_goadedes/miscellanea:misc.Ode6
ltx/en_us_goadedes/oc.m3.d7:ocMA.OdeW6C13.text	
ltx/en_us_goadedes/oc.m3.d7:ocMA.OdeW6C14.incipit	…
ltx/en_us_goadedes/oc.m3.d7:ocMA.OdeW6C14.melody	@ltx/en_us_goadedes/he.h.m3:heHE.VythosMoiTonPathon.name
ltx/en_us_goadedes/oc.m3.d7:ocMA.OdeW6C14.mode	@ltx/en_us_goadedes/miscellanea:misc.Mode3
ltx/en_us_goadedes/oc.m3.d7:ocMA.OdeW6C14.ode	@ltx/en_us_goadedes/miscellanea:misc.Ode6
ltx/en_us_goadedes/oc.m3.d7:ocMA.OdeW6C14.text	
ltx/en_us_goadedes/oc.m3.d7:ocMA.OdeW6C1H.greekmelody	@ltx/en_us_goadedes/he.h.m3:heHE.VythosMoiTonPathon.greekname
ltx/en_us_goadedes/oc.m3.d7:ocMA.OdeW6C1H.incipit	@ltx/en_us_goadedes/he.h.m3:heHE.VythosMoiTonPathon.incipit
ltx/en_us_goadedes/oc.m3.d7:ocMA.OdeW6C1H.melody	@ltx/en_us_goadedes/he.h.m3:heHE.VythosMoiTonPathon.melody
ltx/en_us_goadedes/oc.m3.d7:ocMA.OdeW6C1H.mode	@ltx/en_us_goadedes/miscellanea:misc.Mode3
ltx/en_us_goadedes/oc.m3.d7:ocMA.OdeW6C1H.ode	@ltx/en_us_goadedes/miscellanea:misc.Ode6
ltx/en_us_goadedes/oc.m3.d7:ocMA.OdeW6C1H.text	@ltx/en_us_goadedes/he.h.m3:heHE.VythosMoiTonPathon.text
ltx/en_us_goadedes/oc.m3.d7:ocMA.OdeW6C1T.incipit	…
ltx/en_us_goadedes/oc.m3.d7:ocMA.OdeW6C1T.melody	@ltx/en_us_goadedes/he.h.m3:heHE.VythosMoiTonPathon.name
ltx/en_us_goadedes/oc.m3.d7:ocMA.OdeW6C1T.mode	@ltx/en_us_goadedes/miscellanea:misc.Mode3
ltx/en_us_goadedes/oc.m3.d7:ocMA.OdeW6C1T.ode	@ltx/en_us_goadedes/miscellanea:misc.Ode6
ltx/en_us_goadedes/oc.m3.d7:ocMA.OdeW6C1T.text	
ltx/en_us_goadedes/oc.m3.d7:ocMA.OdeW6C21.greekmelody	@ltx/en_us_goadedes/he.h.m3:heHE.AnagageEkFthoras.greekname
ltx/en_us_goadedes/oc.m3.d7:ocMA.OdeW6C21.incipit	…
ltx/en_us_goadedes/oc.m3.d7:ocMA.OdeW6C21.melody	@ltx/en_us_goadedes/he.h.m3:heHE.AnagageEkFthoras.name
ltx/en_us_goadedes/oc.m3.d7:ocMA.OdeW6C21.mode	@ltx/en_us_goadedes/miscellanea:misc.Mode3
ltx/en_us_goadedes/oc.m3.d7:ocMA.OdeW6C21.ode	@ltx/en_us_goadedes/miscellanea:misc.Ode6
ltx/en_us_goadedes/oc.m3.d7:ocMA.OdeW6C21.text	
ltx/en_us_goadedes/oc.m3.d7:ocMA.OdeW6C22.incipit	…
ltx/en_us_goadedes/oc.m3.d7:ocMA.OdeW6C22.melody	@ltx/en_us_goadedes/he.h.m3:heHE.AnagageEkFthoras.name
ltx/en_us_goadedes/oc.m3.d7:ocMA.OdeW6C22.mode	@ltx/en_us_goadedes/miscellanea:misc.Mode3
ltx/en_us_goadedes/oc.m3.d7:ocMA.OdeW6C22.ode	@ltx/en_us_goadedes/miscellanea:misc.Ode6
ltx/en_us_goadedes/oc.m3.d7:ocMA.OdeW6C22.text	
ltx/en_us_goadedes/oc.m3.d7:ocMA.OdeW6C23.incipit	…
ltx/en_us_goadedes/oc.m3.d7:ocMA.OdeW6C23.melody	@ltx/en_us_goadedes/he.h.m3:heHE.AnagageEkFthoras.name
ltx/en_us_goadedes/oc.m3.d7:ocMA.OdeW6C23.mode	@ltx/en_us_goadedes/miscellanea:misc.Mode3
ltx/en_us_goadedes/oc.m3.d7:ocMA.OdeW6C23.ode	@ltx/en_us_goadedes/miscellanea:misc.Ode6
ltx/en_us_goadedes/oc.m3.d7:ocMA.OdeW6C23.text	
ltx/en_us_goadedes/oc.m3.d7:ocMA.OdeW6C2T.incipit	…
ltx/en_us_goadedes/oc.m3.d7:ocMA.OdeW6C2T.melody	@ltx/en_us_goadedes/he.h.m3:heHE.AnagageEkFthoras.name
ltx/en_us_goadedes/oc.m3.d7:ocMA.OdeW6C2T.mode	@ltx/en_us_goadedes/miscellanea:misc.Mode3
ltx/en_us_goadedes/oc.m3.d7:ocMA.OdeW6C2T.ode	@ltx/en_us_goadedes/miscellanea:misc.Ode6
ltx/en_us_goadedes/oc.m3.d7:ocMA.OdeW6C2T.text	
ltx/en_us_goadedes/oc.m3.d7:ocMA.OdeW7C11.incipit	…
ltx/en_us_goadedes/oc.m3.d7:ocMA.OdeW7C11.melody	@ltx/en_us_goadedes/he.h.m3:heHE.TreisPaidesEnKamino.name
ltx/en_us_goadedes/oc.m3.d7:ocMA.OdeW7C11.mode	@ltx/en_us_goadedes/miscellanea:misc.Mode3
ltx/en_us_goadedes/oc.m3.d7:ocMA.OdeW7C11.ode	@ltx/en_us_goadedes/miscellanea:misc.Ode7
ltx/en_us_goadedes/oc.m3.d7:ocMA.OdeW7C11.text	
ltx/en_us_goadedes/oc.m3.d7:ocMA.OdeW7C12.incipit	…
ltx/en_us_goadedes/oc.m3.d7:ocMA.OdeW7C12.melody	@ltx/en_us_goadedes/he.h.m3:heHE.TreisPaidesEnKamino.name
ltx/en_us_goadedes/oc.m3.d7:ocMA.OdeW7C12.mode	@ltx/en_us_goadedes/miscellanea:misc.Mode3
ltx/en_us_goadedes/oc.m3.d7:ocMA.OdeW7C12.ode	@ltx/en_us_goadedes/miscellanea:misc.Ode7
ltx/en_us_goadedes/oc.m3.d7:ocMA.OdeW7C12.text	
ltx/en_us_goadedes/oc.m3.d7:ocMA.OdeW7C13.incipit	…
ltx/en_us_goadedes/oc.m3.d7:ocMA.OdeW7C13.melody	@ltx/en_us_goadedes/he.h.m3:heHE.TreisPaidesEnKamino.name
ltx/en_us_goadedes/oc.m3.d7:ocMA.OdeW7C13.mode	@ltx/en_us_goadedes/miscellanea:misc.Mode3
ltx/en_us_goadedes/oc.m3.d7:ocMA.OdeW7C13.ode	@ltx/en_us_goadedes/miscellanea:misc.Ode7
ltx/en_us_goadedes/oc.m3.d7:ocMA.OdeW7C13.text	
ltx/en_us_goadedes/oc.m3.d7:ocMA.OdeW7C14.incipit	…
ltx/en_us_goadedes/oc.m3.d7:ocMA.OdeW7C14.melody	@ltx/en_us_goadedes/he.h.m3:heHE.TreisPaidesEnKamino.name
ltx/en_us_goadedes/oc.m3.d7:ocMA.OdeW7C14.mode	@ltx/en_us_goadedes/miscellanea:misc.Mode3
ltx/en_us_goadedes/oc.m3.d7:ocMA.OdeW7C14.ode	@ltx/en_us_goadedes/miscellanea:misc.Ode7
ltx/en_us_goadedes/oc.m3.d7:ocMA.OdeW7C14.text	
ltx/en_us_goadedes/oc.m3.d7:ocMA.OdeW7C1H.greekmelody	@ltx/en_us_goadedes/he.h.m3:heHE.TreisPaidesEnKamino.greekname
ltx/en_us_goadedes/oc.m3.d7:ocMA.OdeW7C1H.incipit	@ltx/en_us_goadedes/he.h.m3:heHE.TreisPaidesEnKamino.incipit
ltx/en_us_goadedes/oc.m3.d7:ocMA.OdeW7C1H.melody	@ltx/en_us_goadedes/he.h.m3:heHE.TreisPaidesEnKamino.melody
ltx/en_us_goadedes/oc.m3.d7:ocMA.OdeW7C1H.mode	@ltx/en_us_goadedes/miscellanea:misc.Mode3
ltx/en_us_goadedes/oc.m3.d7:ocMA.OdeW7C1H.ode	@ltx/en_us_goadedes/miscellanea:misc.Ode7
ltx/en_us_goadedes/oc.m3.d7:ocMA.OdeW7C1H.text	@ltx/en_us_goadedes/he.h.m3:heHE.TreisPaidesEnKamino.text
ltx/en_us_goadedes/oc.m3.d7:ocMA.OdeW7C1T.incipit	…
ltx/en_us_goadedes/oc.m3.d7:ocMA.OdeW7C1T.melody	@ltx/en_us_goadedes/he.h.m3:heHE.TreisPaidesEnKamino.name
ltx/en_us_goadedes/oc.m3.d7:ocMA.OdeW7C1T.mode	@ltx/en_us_goadedes/miscellanea:misc.Mode3
ltx/en_us_goadedes/oc.m3.d7:ocMA.OdeW7C1T.ode	@ltx/en_us_goadedes/miscellanea:misc.Ode7
ltx/en_us_goadedes/oc.m3.d7:ocMA.OdeW7C1T.text	
ltx/en_us_goadedes/oc.m3.d7:ocMA.OdeW7C21.greekmelody	@ltx/en_us_goadedes/he.h.m3:heHE.OsPalaiTousEfseveis.greekname
ltx/en_us_goadedes/oc.m3.d7:ocMA.OdeW7C21.incipit	…
ltx/en_us_goadedes/oc.m3.d7:ocMA.OdeW7C21.melody	@ltx/en_us_goadedes/he.h.m3:heHE.OsPalaiTousEfseveis.name
ltx/en_us_goadedes/oc.m3.d7:ocMA.OdeW7C21.mode	@ltx/en_us_goadedes/miscellanea:misc.Mode3
ltx/en_us_goadedes/oc.m3.d7:ocMA.OdeW7C21.ode	@ltx/en_us_goadedes/miscellanea:misc.Ode7
ltx/en_us_goadedes/oc.m3.d7:ocMA.OdeW7C21.text	
ltx/en_us_goadedes/oc.m3.d7:ocMA.OdeW7C22.incipit	…
ltx/en_us_goadedes/oc.m3.d7:ocMA.OdeW7C22.melody	@ltx/en_us_goadedes/he.h.m3:heHE.OsPalaiTousEfseveis.name
ltx/en_us_goadedes/oc.m3.d7:ocMA.OdeW7C22.mode	@ltx/en_us_goadedes/miscellanea:misc.Mode3
ltx/en_us_goadedes/oc.m3.d7:ocMA.OdeW7C22.ode	@ltx/en_us_goadedes/miscellanea:misc.Ode7
ltx/en_us_goadedes/oc.m3.d7:ocMA.OdeW7C22.text	
ltx/en_us_goadedes/oc.m3.d7:ocMA.OdeW7C23.incipit	…
ltx/en_us_goadedes/oc.m3.d7:ocMA.OdeW7C23.melody	@ltx/en_us_goadedes/he.h.m3:heHE.OsPalaiTousEfseveis.name
ltx/en_us_goadedes/oc.m3.d7:ocMA.OdeW7C23.mode	@ltx/en_us_goadedes/miscellanea:misc.Mode3
ltx/en_us_goadedes/oc.m3.d7:ocMA.OdeW7C23.ode	@ltx/en_us_goadedes/miscellanea:misc.Ode7
ltx/en_us_goadedes/oc.m3.d7:ocMA.OdeW7C23.text	
ltx/en_us_goadedes/oc.m3.d7:ocMA.OdeW7C2T.incipit	…
ltx/en_us_goadedes/oc.m3.d7:ocMA.OdeW7C2T.melody	@ltx/en_us_goadedes/he.h.m3:heHE.OsPalaiTousEfseveis.name
ltx/en_us_goadedes/oc.m3.d7:ocMA.OdeW7C2T.mode	@ltx/en_us_goadedes/miscellanea:misc.Mode3
ltx/en_us_goadedes/oc.m3.d7:ocMA.OdeW7C2T.ode	@ltx/en_us_goadedes/miscellanea:misc.Ode7
ltx/en_us_goadedes/oc.m3.d7:ocMA.OdeW7C2T.text	
ltx/en_us_goadedes/oc.m3.d7:ocMA.OdeW8C11.incipit	…
ltx/en_us_goadedes/oc.m3.d7:ocMA.OdeW8C11.melody	@ltx/en_us_goadedes/he.h.m3:heHE.TonYpAngelon.name
ltx/en_us_goadedes/oc.m3.d7:ocMA.OdeW8C11.mode	@ltx/en_us_goadedes/miscellanea:misc.Mode3
ltx/en_us_goadedes/oc.m3.d7:ocMA.OdeW8C11.ode	@ltx/en_us_goadedes/miscellanea:misc.Ode8
ltx/en_us_goadedes/oc.m3.d7:ocMA.OdeW8C11.text	
ltx/en_us_goadedes/oc.m3.d7:ocMA.OdeW8C12.incipit	…
ltx/en_us_goadedes/oc.m3.d7:ocMA.OdeW8C12.melody	@ltx/en_us_goadedes/he.h.m3:heHE.TonYpAngelon.name
ltx/en_us_goadedes/oc.m3.d7:ocMA.OdeW8C12.mode	@ltx/en_us_goadedes/miscellanea:misc.Mode3
ltx/en_us_goadedes/oc.m3.d7:ocMA.OdeW8C12.ode	@ltx/en_us_goadedes/miscellanea:misc.Ode8
ltx/en_us_goadedes/oc.m3.d7:ocMA.OdeW8C12.text	
ltx/en_us_goadedes/oc.m3.d7:ocMA.OdeW8C13.incipit	…
ltx/en_us_goadedes/oc.m3.d7:ocMA.OdeW8C13.melody	@ltx/en_us_goadedes/he.h.m3:heHE.TonYpAngelon.name
ltx/en_us_goadedes/oc.m3.d7:ocMA.OdeW8C13.mode	@ltx/en_us_goadedes/miscellanea:misc.Mode3
ltx/en_us_goadedes/oc.m3.d7:ocMA.OdeW8C13.ode	@ltx/en_us_goadedes/miscellanea:misc.Ode8
ltx/en_us_goadedes/oc.m3.d7:ocMA.OdeW8C13.text	
ltx/en_us_goadedes/oc.m3.d7:ocMA.OdeW8C14.incipit	…
ltx/en_us_goadedes/oc.m3.d7:ocMA.OdeW8C14.melody	@ltx/en_us_goadedes/he.h.m3:heHE.TonYpAngelon.name
ltx/en_us_goadedes/oc.m3.d7:ocMA.OdeW8C14.mode	@ltx/en_us_goadedes/miscellanea:misc.Mode3
ltx/en_us_goadedes/oc.m3.d7:ocMA.OdeW8C14.ode	@ltx/en_us_goadedes/miscellanea:misc.Ode8
ltx/en_us_goadedes/oc.m3.d7:ocMA.OdeW8C14.text	
ltx/en_us_goadedes/oc.m3.d7:ocMA.OdeW8C1H.greekmelody	@ltx/en_us_goadedes/he.h.m3:heHE.TonYpAngelon.greekname
ltx/en_us_goadedes/oc.m3.d7:ocMA.OdeW8C1H.incipit	@ltx/en_us_goadedes/he.h.m3:heHE.TonYpAngelon.incipit
ltx/en_us_goadedes/oc.m3.d7:ocMA.OdeW8C1H.melody	@ltx/en_us_goadedes/he.h.m3:heHE.TonYpAngelon.melody
ltx/en_us_goadedes/oc.m3.d7:ocMA.OdeW8C1H.mode	@ltx/en_us_goadedes/miscellanea:misc.Mode3
ltx/en_us_goadedes/oc.m3.d7:ocMA.OdeW8C1H.ode	@ltx/en_us_goadedes/miscellanea:misc.Ode8
ltx/en_us_goadedes/oc.m3.d7:ocMA.OdeW8C1H.text	@ltx/en_us_goadedes/he.h.m3:heHE.TonYpAngelon.text
ltx/en_us_goadedes/oc.m3.d7:ocMA.OdeW8C1T.incipit	…
ltx/en_us_goadedes/oc.m3.d7:ocMA.OdeW8C1T.melody	@ltx/en_us_goadedes/he.h.m3:heHE.TonYpAngelon.name
ltx/en_us_goadedes/oc.m3.d7:ocMA.OdeW8C1T.mode	@ltx/en_us_goadedes/miscellanea:misc.Mode3
ltx/en_us_goadedes/oc.m3.d7:ocMA.OdeW8C1T.ode	@ltx/en_us_goadedes/miscellanea:misc.Ode8
ltx/en_us_goadedes/oc.m3.d7:ocMA.OdeW8C1T.text	
ltx/en_us_goadedes/oc.m3.d7:ocMA.OdeW8C21.greekmelody	@ltx/en_us_goadedes/he.h.m3:heHE.LatreveinZontiTheo.greekname
ltx/en_us_goadedes/oc.m3.d7:ocMA.OdeW8C21.incipit	…
ltx/en_us_goadedes/oc.m3.d7:ocMA.OdeW8C21.melody	@ltx/en_us_goadedes/he.h.m3:heHE.LatreveinZontiTheo.name
ltx/en_us_goadedes/oc.m3.d7:ocMA.OdeW8C21.mode	@ltx/en_us_goadedes/miscellanea:misc.Mode3
ltx/en_us_goadedes/oc.m3.d7:ocMA.OdeW8C21.ode	@ltx/en_us_goadedes/miscellanea:misc.Ode8
ltx/en_us_goadedes/oc.m3.d7:ocMA.OdeW8C21.text	
ltx/en_us_goadedes/oc.m3.d7:ocMA.OdeW8C22.incipit	…
ltx/en_us_goadedes/oc.m3.d7:ocMA.OdeW8C22.melody	@ltx/en_us_goadedes/he.h.m3:heHE.LatreveinZontiTheo.name
ltx/en_us_goadedes/oc.m3.d7:ocMA.OdeW8C22.mode	@ltx/en_us_goadedes/miscellanea:misc.Mode3
ltx/en_us_goadedes/oc.m3.d7:ocMA.OdeW8C22.ode	@ltx/en_us_goadedes/miscellanea:misc.Ode8
ltx/en_us_goadedes/oc.m3.d7:ocMA.OdeW8C22.text	
ltx/en_us_goadedes/oc.m3.d7:ocMA.OdeW8C23.incipit	…
ltx/en_us_goadedes/oc.m3.d7:ocMA.OdeW8C23.melody	@ltx/en_us_goadedes/he.h.m3:heHE.LatreveinZontiTheo.name
ltx/en_us_goadedes/oc.m3.d7:ocMA.OdeW8C23.mode	@ltx/en_us_goadedes/miscellanea:misc.Mode3
ltx/en_us_goadedes/oc.m3.d7:ocMA.OdeW8C23.ode	@ltx/en_us_goadedes/miscellanea:misc.Ode8
ltx/en_us_goadedes/oc.m3.d7:ocMA.OdeW8C23.text	
ltx/en_us_goadedes/oc.m3.d7:ocMA.OdeW8C2T.incipit	…
ltx/en_us_goadedes/oc.m3.d7:ocMA.OdeW8C2T.melody	@ltx/en_us_goadedes/he.h.m3:heHE.LatreveinZontiTheo.name
ltx/en_us_goadedes/oc.m3.d7:ocMA.OdeW8C2T.mode	@ltx/en_us_goadedes/miscellanea:misc.Mode3
ltx/en_us_goadedes/oc.m3.d7:ocMA.OdeW8C2T.ode	@ltx/en_us_goadedes/miscellanea:misc.Ode8
ltx/en_us_goadedes/oc.m3.d7:ocMA.OdeW8C2T.text	
ltx/en_us_goadedes/oc.m3.d7:ocMA.OdeW9C11.incipit	…
ltx/en_us_goadedes/oc.m3.d7:ocMA.OdeW9C11.melody	@ltx/en_us_goadedes/he.h.m3:heHE.EnSinaioToOrei.name
ltx/en_us_goadedes/oc.m3.d7:ocMA.OdeW9C11.mode	@ltx/en_us_goadedes/miscellanea:misc.Mode3
ltx/en_us_goadedes/oc.m3.d7:ocMA.OdeW9C11.ode	@ltx/en_us_goadedes/miscellanea:misc.Ode9
ltx/en_us_goadedes/oc.m3.d7:ocMA.OdeW9C11.text	
ltx/en_us_goadedes/oc.m3.d7:ocMA.OdeW9C12.incipit	…
ltx/en_us_goadedes/oc.m3.d7:ocMA.OdeW9C12.melody	@ltx/en_us_goadedes/he.h.m3:heHE.EnSinaioToOrei.name
ltx/en_us_goadedes/oc.m3.d7:ocMA.OdeW9C12.mode	@ltx/en_us_goadedes/miscellanea:misc.Mode3
ltx/en_us_goadedes/oc.m3.d7:ocMA.OdeW9C12.ode	@ltx/en_us_goadedes/miscellanea:misc.Ode9
ltx/en_us_goadedes/oc.m3.d7:ocMA.OdeW9C12.text	
ltx/en_us_goadedes/oc.m3.d7:ocMA.OdeW9C13.incipit	…
ltx/en_us_goadedes/oc.m3.d7:ocMA.OdeW9C13.melody	@ltx/en_us_goadedes/he.h.m3:heHE.EnSinaioToOrei.name
ltx/en_us_goadedes/oc.m3.d7:ocMA.OdeW9C13.mode	@ltx/en_us_goadedes/miscellanea:misc.Mode3
ltx/en_us_goadedes/oc.m3.d7:ocMA.OdeW9C13.ode	@ltx/en_us_goadedes/miscellanea:misc.Ode9
ltx/en_us_goadedes/oc.m3.d7:ocMA.OdeW9C13.text	
ltx/en_us_goadedes/oc.m3.d7:ocMA.OdeW9C14.incipit	…
ltx/en_us_goadedes/oc.m3.d7:ocMA.OdeW9C14.melody	@ltx/en_us_goadedes/he.h.m3:heHE.EnSinaioToOrei.name
ltx/en_us_goadedes/oc.m3.d7:ocMA.OdeW9C14.mode	@ltx/en_us_goadedes/miscellanea:misc.Mode3
ltx/en_us_goadedes/oc.m3.d7:ocMA.OdeW9C14.ode	@ltx/en_us_goadedes/miscellanea:misc.Ode9
ltx/en_us_goadedes/oc.m3.d7:ocMA.OdeW9C14.text	
ltx/en_us_goadedes/oc.m3.d7:ocMA.OdeW9C1H.greekmelody	@ltx/en_us_goadedes/he.h.m3:heHE.EnSinaioToOrei.greekname
ltx/en_us_goadedes/oc.m3.d7:ocMA.OdeW9C1H.incipit	@ltx/en_us_goadedes/he.h.m3:heHE.EnSinaioToOrei.incipit
ltx/en_us_goadedes/oc.m3.d7:ocMA.OdeW9C1H.melody	@ltx/en_us_goadedes/he.h.m3:heHE.EnSinaioToOrei.melody
ltx/en_us_goadedes/oc.m3.d7:ocMA.OdeW9C1H.mode	@ltx/en_us_goadedes/miscellanea:misc.Mode3
ltx/en_us_goadedes/oc.m3.d7:ocMA.OdeW9C1H.ode	@ltx/en_us_goadedes/miscellanea:misc.Ode9
ltx/en_us_goadedes/oc.m3.d7:ocMA.OdeW9C1H.text	@ltx/en_us_goadedes/he.h.m3:heHE.EnSinaioToOrei.text
ltx/en_us_goadedes/oc.m3.d7:ocMA.OdeW9C1T.incipit	…
ltx/en_us_goadedes/oc.m3.d7:ocMA.OdeW9C1T.melody	@ltx/en_us_goadedes/he.h.m3:heHE.EnSinaioToOrei.name
ltx/en_us_goadedes/oc.m3.d7:ocMA.OdeW9C1T.mode	@ltx/en_us_goadedes/miscellanea:misc.Mode3
ltx/en_us_goadedes/oc.m3.d7:ocMA.OdeW9C1T.ode	@ltx/en_us_goadedes/miscellanea:misc.Ode9
ltx/en_us_goadedes/oc.m3.d7:ocMA.OdeW9C1T.text	
ltx/en_us_goadedes/oc.m3.d7:ocMA.OdeW9C21.greekmelody	@ltx/en_us_goadedes/he.h.m3:heHE.TinEnVatoKaiPyri.greekname
ltx/en_us_goadedes/oc.m3.d7:ocMA.OdeW9C21.incipit	…
ltx/en_us_goadedes/oc.m3.d7:ocMA.OdeW9C21.melody	@ltx/en_us_goadedes/he.h.m3:heHE.TinEnVatoKaiPyri.name
ltx/en_us_goadedes/oc.m3.d7:ocMA.OdeW9C21.mode	@ltx/en_us_goadedes/miscellanea:misc.Mode3
ltx/en_us_goadedes/oc.m3.d7:ocMA.OdeW9C21.ode	@ltx/en_us_goadedes/miscellanea:misc.Ode9
ltx/en_us_goadedes/oc.m3.d7:ocMA.OdeW9C21.text	
ltx/en_us_goadedes/oc.m3.d7:ocMA.OdeW9C22.incipit	…
ltx/en_us_goadedes/oc.m3.d7:ocMA.OdeW9C22.melody	@ltx/en_us_goadedes/he.h.m3:heHE.TinEnVatoKaiPyri.name
ltx/en_us_goadedes/oc.m3.d7:ocMA.OdeW9C22.mode	@ltx/en_us_goadedes/miscellanea:misc.Mode3
ltx/en_us_goadedes/oc.m3.d7:ocMA.OdeW9C22.ode	@ltx/en_us_goadedes/miscellanea:misc.Ode9
ltx/en_us_goadedes/oc.m3.d7:ocMA.OdeW9C22.text	
ltx/en_us_goadedes/oc.m3.d7:ocMA.OdeW9C23.incipit	…
ltx/en_us_goadedes/oc.m3.d7:ocMA.OdeW9C23.melody	@ltx/en_us_goadedes/he.h.m3:heHE.TinEnVatoKaiPyri.name
ltx/en_us_goadedes/oc.m3.d7:ocMA.OdeW9C23.mode	@ltx/en_us_goadedes/miscellanea:misc.Mode3
ltx/en_us_goadedes/oc.m3.d7:ocMA.OdeW9C23.ode	@ltx/en_us_goadedes/miscellanea:misc.Ode9
ltx/en_us_goadedes/oc.m3.d7:ocMA.OdeW9C23.text	
ltx/en_us_goadedes/oc.m3.d7:ocMA.OdeW9C2T.incipit	…
ltx/en_us_goadedes/oc.m3.d7:ocMA.OdeW9C2T.melody	@ltx/en_us_goadedes/he.h.m3:heHE.TinEnVatoKaiPyri.name
ltx/en_us_goadedes/oc.m3.d7:ocMA.OdeW9C2T.mode	@ltx/en_us_goadedes/miscellanea:misc.Mode3
ltx/en_us_goadedes/oc.m3.d7:ocMA.OdeW9C2T.ode	@ltx/en_us_goadedes/miscellanea:misc.Ode9
ltx/en_us_goadedes/oc.m3.d7:ocMA.OdeW9C2T.text	
ltx/en_us_goadedes/oc.m3.d7:ocVE.ApolTheotokionVM.incipit	@ltx/en_us_goadedes/oc.m3.d1:ocVE.ApolTheotokionVM.incipit
ltx/en_us_goadedes/oc.m3.d7:ocVE.ApolTheotokionVM.melody	
ltx/en_us_goadedes/oc.m3.d7:ocVE.ApolTheotokionVM.mode	@ltx/en_us_goadedes/miscellanea:misc.Mode3
ltx/en_us_goadedes/oc.m3.d7:ocVE.ApolTheotokionVM.text	@ltx/en_us_goadedes/oc.m3.d1:ocVE.ApolTheotokionVM.text
ltx/en_us_goadedes/oc.m3.d7:ocVE.AposTheotokion.incipit	…
ltx/en_us_goadedes/oc.m3.d7:ocVE.AposTheotokion.melody	
ltx/en_us_goadedes/oc.m3.d7:ocVE.AposTheotokion.mode	@ltx/en_us_goadedes/miscellanea:misc.Mode3
ltx/en_us_goadedes/oc.m3.d7:ocVE.AposTheotokion.text	
ltx/en_us_goadedes/oc.m3.d7:ocVE.Aposticha1.greekmelody	@ltx/en_us_goadedes/he.a.m3:heAU.MegaliTonMartyronSou.greekname
ltx/en_us_goadedes/oc.m3.d7:ocVE.Aposticha1.incipit	@ltx/en_us_goadedes/he.a.m3:heAU.MegaliTonMartyronSou.incipit
ltx/en_us_goadedes/oc.m3.d7:ocVE.Aposticha1.melody	@ltx/en_us_goadedes/he.a.m3:heAU.MegaliTonMartyronSou.melody
ltx/en_us_goadedes/oc.m3.d7:ocVE.Aposticha1.mode	@ltx/en_us_goadedes/miscellanea:misc.Mode3
ltx/en_us_goadedes/oc.m3.d7:ocVE.Aposticha1.text	@ltx/en_us_goadedes/he.a.m3:heAU.MegaliTonMartyronSou.text
ltx/en_us_goadedes/oc.m3.d7:ocVE.Aposticha2.incipit	@ltx/en_us_goadedes/oc.m3.d4:ocVE.Aposticha3.incipit
ltx/en_us_goadedes/oc.m3.d7:ocVE.Aposticha2.melody	
ltx/en_us_goadedes/oc.m3.d7:ocVE.Aposticha2.mode	@ltx/en_us_goadedes/miscellanea:misc.Mode3
ltx/en_us_goadedes/oc.m3.d7:ocVE.Aposticha2.text	@ltx/en_us_goadedes/oc.m3.d4:ocVE.Aposticha3.text
ltx/en_us_goadedes/oc.m3.d7:ocVE.Aposticha3.incipit	…
ltx/en_us_goadedes/oc.m3.d7:ocVE.Aposticha3.melody	
ltx/en_us_goadedes/oc.m3.d7:ocVE.Aposticha3.mode	@ltx/en_us_goadedes/miscellanea:misc.Mode3
ltx/en_us_goadedes/oc.m3.d7:ocVE.Aposticha3.text	
ltx/en_us_goadedes/oc.m3.d7:ocVE.Aposticha4.incipit	…
ltx/en_us_goadedes/oc.m3.d7:ocVE.Aposticha4.melody	
ltx/en_us_goadedes/oc.m3.d7:ocVE.Aposticha4.mode	@ltx/en_us_goadedes/miscellanea:misc.Mode3
ltx/en_us_goadedes/oc.m3.d7:ocVE.Aposticha4.text	
ltx/en_us_goadedes/oc.m3.d7:ocVE.SticTheotokion.incipit	@ltx/en_us_goadedes/oc.m3.d1:ocVE.SticTheotokion.incipit
ltx/en_us_goadedes/oc.m3.d7:ocVE.SticTheotokion.melody	
ltx/en_us_goadedes/oc.m3.d7:ocVE.SticTheotokion.mode	@ltx/en_us_goadedes/miscellanea:misc.Mode3
ltx/en_us_goadedes/oc.m3.d7:ocVE.SticTheotokion.text	@ltx/en_us_goadedes/oc.m3.d1:ocVE.SticTheotokion.text
ltx/en_us_goadedes/oc.m3.d7:ocVE.Stichera1.greekmelody	@ltx/en_us_goadedes/he.a.m3:heAU.MegaliTouStavrouSou.greekname
ltx/en_us_goadedes/oc.m3.d7:ocVE.Stichera1.incipit	O Christ, I have become…
ltx/en_us_goadedes/oc.m3.d7:ocVE.Stichera1.melody	@ltx/en_us_goadedes/he.a.m3:heAU.MegaliTouStavrouSou.name
ltx/en_us_goadedes/oc.m3.d7:ocVE.Stichera1.mode	@ltx/en_us_goadedes/miscellanea:misc.Mode3
ltx/en_us_goadedes/oc.m3.d7:ocVE.Stichera1.text	O Christ, I have become the unclean demons’ dwelling place. * I pray You drive them out from me, as of old You drove out * from Your Temple those defiling it. Now cleanse me of stains * of all my sins, and make me * a holy temple of Your divine Holy Spirit.
ltx/en_us_goadedes/oc.m3.d7:ocVE.Stichera2.incipit	…
ltx/en_us_goadedes/oc.m3.d7:ocVE.Stichera2.melody	@ltx/en_us_goadedes/he.a.m3:heAU.MegaliTouStavrouSou.name
ltx/en_us_goadedes/oc.m3.d7:ocVE.Stichera2.mode	@ltx/en_us_goadedes/miscellanea:misc.Mode3
ltx/en_us_goadedes/oc.m3.d7:ocVE.Stichera2.text	
ltx/en_us_goadedes/oc.m3.d7:ocVE.Stichera3.incipit	…
ltx/en_us_goadedes/oc.m3.d7:ocVE.Stichera3.melody	@ltx/en_us_goadedes/he.a.m3:heAU.MegaliTouStavrouSou.name
ltx/en_us_goadedes/oc.m3.d7:ocVE.Stichera3.mode	@ltx/en_us_goadedes/miscellanea:misc.Mode3
ltx/en_us_goadedes/oc.m3.d7:ocVE.Stichera3.text	
ltx/en_us_goadedes/oc.m3.d7:ocVE.Stichera4.greekmelody	@ltx/en_us_goadedes/he.a.m3:heAU.MegaliTouStavrouSou.greekname
ltx/en_us_goadedes/oc.m3.d7:ocVE.Stichera4.incipit	O Virgin, I am often shaken…
ltx/en_us_goadedes/oc.m3.d7:ocVE.Stichera4.melody	@ltx/en_us_goadedes/he.a.m3:heAU.MegaliTouStavrouSou.name
ltx/en_us_goadedes/oc.m3.d7:ocVE.Stichera4.mode	@ltx/en_us_goadedes/miscellanea:misc.Mode3
ltx/en_us_goadedes/oc.m3.d7:ocVE.Stichera4.text	O Virgin, I am often shaken by the enemy, * like a reed by the wind. Please take pity on your servant, * and prevent me from completely succumbing * to his storms of temptations; * but rather reinforce * my faith in Christ the Master.
ltx/en_us_goadedes/oc.m3.d7:ocVE.Stichera5.incipit	…
ltx/en_us_goadedes/oc.m3.d7:ocVE.Stichera5.melody	@ltx/en_us_goadedes/he.a.m3:heAU.MegaliTouStavrouSou.name
ltx/en_us_goadedes/oc.m3.d7:ocVE.Stichera5.mode	@ltx/en_us_goadedes/miscellanea:misc.Mode3
ltx/en_us_goadedes/oc.m3.d7:ocVE.Stichera5.text	
ltx/en_us_goadedes/oc.m3.d7:ocVE.Stichera6.incipit	…
ltx/en_us_goadedes/oc.m3.d7:ocVE.Stichera6.melody	@ltx/en_us_goadedes/he.a.m3:heAU.MegaliTouStavrouSou.name
ltx/en_us_goadedes/oc.m3.d7:ocVE.Stichera6.mode	@ltx/en_us_goadedes/miscellanea:misc.Mode3
ltx/en_us_goadedes/oc.m3.d7:ocVE.Stichera6.text	
ltx/en_us_goadedes/oc.m3.d7:octrMA.AposTheotokion.incipit	@ltx/en_us_goadedes/oc.m3.d7:ocMA.AposTheotokion.incipit
ltx/en_us_goadedes/oc.m3.d7:octrMA.AposTheotokion.melody	@ltx/en_us_goadedes/he.a.m3:heAU.ToTypoTouStavrou.name
ltx/en_us_goadedes/oc.m3.d7:octrMA.AposTheotokion.mode	@ltx/en_us_goadedes/miscellanea:misc.Mode3
ltx/en_us_goadedes/oc.m3.d7:octrMA.AposTheotokion.text	@ltx/en_us_goadedes/oc.m3.d7:ocMA.AposTheotokion.text
ltx/en_us_goadedes/oc.m3.d7:octrMA.Aposticha1.greekmelody	@ltx/en_us_goadedes/he.a.m3:heAU.ToTypoTouStavrou.greekname
ltx/en_us_goadedes/oc.m3.d7:octrMA.Aposticha1.incipit	@ltx/en_us_goadedes/oc.m3.d7:ocMA.Aposticha1.incipit
ltx/en_us_goadedes/oc.m3.d7:octrMA.Aposticha1.melody	@ltx/en_us_goadedes/he.a.m3:heAU.ToTypoTouStavrou.name
ltx/en_us_goadedes/oc.m3.d7:octrMA.Aposticha1.mode	@ltx/en_us_goadedes/miscellanea:misc.Mode3
ltx/en_us_goadedes/oc.m3.d7:octrMA.Aposticha1.text	@ltx/en_us_goadedes/oc.m3.d7:ocMA.Aposticha1.text
ltx/en_us_goadedes/oc.m3.d7:octrMA.Aposticha2.incipit	@ltx/en_us_goadedes/oc.m3.d7:ocMA.Aposticha2.incipit
ltx/en_us_goadedes/oc.m3.d7:octrMA.Aposticha2.melody	@ltx/en_us_goadedes/he.a.m3:heAU.ToTypoTouStavrou.name
ltx/en_us_goadedes/oc.m3.d7:octrMA.Aposticha2.mode	@ltx/en_us_goadedes/miscellanea:misc.Mode3
ltx/en_us_goadedes/oc.m3.d7:octrMA.Aposticha2.text	@ltx/en_us_goadedes/oc.m3.d7:ocMA.Aposticha2.text
ltx/en_us_goadedes/oc.m3.d7:octrMA.Aposticha3.incipit	@ltx/en_us_goadedes/oc.m3.d7:ocMA.Aposticha3.incipit
ltx/en_us_goadedes/oc.m3.d7:octrMA.Aposticha3.melody	@ltx/en_us_goadedes/he.a.m3:heAU.ToTypoTouStavrou.name
ltx/en_us_goadedes/oc.m3.d7:octrMA.Aposticha3.mode	@ltx/en_us_goadedes/miscellanea:misc.Mode3
ltx/en_us_goadedes/oc.m3.d7:octrMA.Aposticha3.text	@ltx/en_us_goadedes/oc.m3.d7:ocMA.Aposticha3.text
ltx/en_us_goadedes/oc.m3.d7:octrMA.Kathisma11.incipit	…
ltx/en_us_goadedes/oc.m3.d7:octrMA.Kathisma11.melody	
ltx/en_us_goadedes/oc.m3.d7:octrMA.Kathisma11.mode	@ltx/en_us_goadedes/miscellanea:misc.Mode3
ltx/en_us_goadedes/oc.m3.d7:octrMA.Kathisma11.text	
ltx/en_us_goadedes/oc.m3.d7:octrMA.Kathisma12.incipit	@ltx/en_us_goadedes/oc.m3.d7:ocMA.Kathisma21.incipit
ltx/en_us_goadedes/oc.m3.d7:octrMA.Kathisma12.melody	
ltx/en_us_goadedes/oc.m3.d7:octrMA.Kathisma12.mode	@ltx/en_us_goadedes/miscellanea:misc.Mode3
ltx/en_us_goadedes/oc.m3.d7:octrMA.Kathisma12.text	@ltx/en_us_goadedes/oc.m3.d7:ocMA.Kathisma21.text
ltx/en_us_goadedes/oc.m3.d7:octrMA.Kathisma13.incipit	@ltx/en_us_goadedes/oc.m3.d7:ocMA.Kathisma13.incipit
ltx/en_us_goadedes/oc.m3.d7:octrMA.Kathisma13.melody	
ltx/en_us_goadedes/oc.m3.d7:octrMA.Kathisma13.mode	@ltx/en_us_goadedes/miscellanea:misc.Mode3
ltx/en_us_goadedes/oc.m3.d7:octrMA.Kathisma13.text	@ltx/en_us_goadedes/oc.m3.d7:ocMA.Kathisma13.text
ltx/en_us_goadedes/oc.m3.d7:octrMA.Kathisma14.greekmelody	@ltx/en_us_goadedes/he.a.m3:heAU.TinOraiotita.greekname
ltx/en_us_goadedes/oc.m3.d7:octrMA.Kathisma14.incipit	@ltx/en_us_goadedes/oc.m3.d7:ocMA.Kathisma22.incipit
ltx/en_us_goadedes/oc.m3.d7:octrMA.Kathisma14.melody	@ltx/en_us_goadedes/he.a.m3:heAU.TinOraiotita.name
ltx/en_us_goadedes/oc.m3.d7:octrMA.Kathisma14.mode	@ltx/en_us_goadedes/miscellanea:misc.Mode3
ltx/en_us_goadedes/oc.m3.d7:octrMA.Kathisma14.text	@ltx/en_us_goadedes/oc.m3.d7:ocMA.Kathisma22.text
ltx/en_us_goadedes/oc.m3.d7:octrMA.Kathisma1T.incipit	@ltx/en_us_goadedes/oc.m3.d7:ocVE.ApolTheotokionVM.incipit
ltx/en_us_goadedes/oc.m3.d7:octrMA.Kathisma1T.melody	
ltx/en_us_goadedes/oc.m3.d7:octrMA.Kathisma1T.mode	@ltx/en_us_goadedes/miscellanea:misc.Mode3
ltx/en_us_goadedes/oc.m3.d7:octrMA.Kathisma1T.text	@ltx/en_us_goadedes/oc.m3.d7:ocVE.ApolTheotokionVM.text
ltx/en_us_goadedes/oc.m3.d7:octrMA.Lauds1.incipit	@ltx/en_us_goadedes/oc.m3.d2:ocMA.Aposticha3.incipit
ltx/en_us_goadedes/oc.m3.d7:octrMA.Lauds1.melody	
ltx/en_us_goadedes/oc.m3.d7:octrMA.Lauds1.mode	@ltx/en_us_goadedes/miscellanea:misc.Mode3
ltx/en_us_goadedes/oc.m3.d7:octrMA.Lauds1.text	@ltx/en_us_goadedes/oc.m3.d2:ocMA.Aposticha3.text
ltx/en_us_goadedes/oc.m3.d7:octrMA.Lauds2.incipit	@ltx/en_us_goadedes/oc.m3.d7:ocMA.Lauds1.incipit
ltx/en_us_goadedes/oc.m3.d7:octrMA.Lauds2.melody	
ltx/en_us_goadedes/oc.m3.d7:octrMA.Lauds2.mode	@ltx/en_us_goadedes/miscellanea:misc.Mode3
ltx/en_us_goadedes/oc.m3.d7:octrMA.Lauds2.text	@ltx/en_us_goadedes/oc.m3.d7:ocMA.Lauds1.text
ltx/en_us_goadedes/oc.m3.d7:octrMA.Lauds3.incipit	@ltx/en_us_goadedes/oc.m3.d7:ocMA.Lauds3.incipit
ltx/en_us_goadedes/oc.m3.d7:octrMA.Lauds3.melody	
ltx/en_us_goadedes/oc.m3.d7:octrMA.Lauds3.mode	@ltx/en_us_goadedes/miscellanea:misc.Mode3
ltx/en_us_goadedes/oc.m3.d7:octrMA.Lauds3.text	@ltx/en_us_goadedes/oc.m3.d7:ocMA.Lauds3.text
ltx/en_us_goadedes/oc.m3.d7:octrMA.Lauds4.incipit	@ltx/en_us_goadedes/oc.m3.d7:ocMA.Lauds2.incipit
ltx/en_us_goadedes/oc.m3.d7:octrMA.Lauds4.melody	
ltx/en_us_goadedes/oc.m3.d7:octrMA.Lauds4.mode	@ltx/en_us_goadedes/miscellanea:misc.Mode3
ltx/en_us_goadedes/oc.m3.d7:octrMA.Lauds4.text	@ltx/en_us_goadedes/oc.m3.d7:ocMA.Lauds2.text
ltx/en_us_goadedes/oc.m3.d7:octrMA.LaudsGlory.incipit	@ltx/en_us_goadedes/oc.m3.d7:ocMA.Lauds4.incipit
ltx/en_us_goadedes/oc.m3.d7:octrMA.LaudsGlory.melody	
ltx/en_us_goadedes/oc.m3.d7:octrMA.LaudsGlory.mode	@ltx/en_us_goadedes/miscellanea:misc.Mode3
ltx/en_us_goadedes/oc.m3.d7:octrMA.LaudsGlory.text	@ltx/en_us_goadedes/oc.m3.d7:ocMA.Lauds4.text
ltx/en_us_goadedes/oc.m3.d7:octrMA.LaudsTheotokion.incipit	@ltx/en_us_goadedes/oc.m3.d3:ocVE.AposTheotokion.incipit
ltx/en_us_goadedes/oc.m3.d7:octrMA.LaudsTheotokion.melody	
ltx/en_us_goadedes/oc.m3.d7:octrMA.LaudsTheotokion.mode	@ltx/en_us_goadedes/miscellanea:misc.Mode3
ltx/en_us_goadedes/oc.m3.d7:octrMA.LaudsTheotokion.text	@ltx/en_us_goadedes/oc.m3.d3:ocVE.AposTheotokion.text
ltx/en_us_goadedes/oc.m3.d7:octrMA.Photogogic.incipit	@ltx/en_us_goadedes/oc.m3.d2:octrMA.Photagogic.incipit
ltx/en_us_goadedes/oc.m3.d7:octrMA.Photogogic.mode	@ltx/en_us_goadedes/miscellanea:misc.Mode3
ltx/en_us_goadedes/oc.m3.d7:octrMA.Photogogic.text	@ltx/en_us_goadedes/oc.m3.d2:octrMA.Photagogic.text
ltx/en_us_goadedes/oc.m3.d7:octrVE.SticBoth.incipit	@ltx/en_us_goadedes/oc.m3.d7:ocVE.SticTheotokion.incipit
ltx/en_us_goadedes/oc.m3.d7:octrVE.SticBoth.melody	
ltx/en_us_goadedes/oc.m3.d7:octrVE.SticBoth.mode	@ltx/en_us_goadedes/miscellanea:misc.Mode3
ltx/en_us_goadedes/oc.m3.d7:octrVE.SticBoth.text	@ltx/en_us_goadedes/oc.m3.d7:ocVE.SticTheotokion.text
ltx/en_us_goadedes/oc.m3.d7:octrVE.SticGlory.incipit	@ltx/en_us_goadedes/oc.m3.d7:ocVE.Aposticha4.incipit
ltx/en_us_goadedes/oc.m3.d7:octrVE.SticGlory.melody	
ltx/en_us_goadedes/oc.m3.d7:octrVE.SticGlory.mode	@ltx/en_us_goadedes/miscellanea:misc.Mode3
ltx/en_us_goadedes/oc.m3.d7:octrVE.SticGlory.text	@ltx/en_us_goadedes/oc.m3.d7:ocVE.Aposticha4.text
ltx/en_us_goadedes/oc.m3.d7:octrVE.Stichera1.incipit	@ltx/en_us_goadedes/oc.m3.d7:ocVE.Aposticha1.incipit
ltx/en_us_goadedes/oc.m3.d7:octrVE.Stichera1.melody	
ltx/en_us_goadedes/oc.m3.d7:octrVE.Stichera1.mode	@ltx/en_us_goadedes/miscellanea:misc.Mode3
ltx/en_us_goadedes/oc.m3.d7:octrVE.Stichera1.text	@ltx/en_us_goadedes/oc.m3.d7:ocVE.Aposticha1.text
ltx/en_us_goadedes/oc.m3.d7:octrVE.Stichera2.incipit	@ltx/en_us_goadedes/oc.m3.d7:ocVE.Aposticha2.incipit
ltx/en_us_goadedes/oc.m3.d7:octrVE.Stichera2.melody	
ltx/en_us_goadedes/oc.m3.d7:octrVE.Stichera2.mode	@ltx/en_us_goadedes/miscellanea:misc.Mode3
ltx/en_us_goadedes/oc.m3.d7:octrVE.Stichera2.text	@ltx/en_us_goadedes/oc.m3.d7:ocVE.Aposticha2.text
ltx/en_us_goadedes/oc.m3.d7:octrVE.Stichera3.incipit	@ltx/en_us_goadedes/oc.m3.d5:ocVE.Aposticha3.incipit
ltx/en_us_goadedes/oc.m3.d7:octrVE.Stichera3.melody	
ltx/en_us_goadedes/oc.m3.d7:octrVE.Stichera3.mode	@ltx/en_us_goadedes/miscellanea:misc.Mode3
ltx/en_us_goadedes/oc.m3.d7:octrVE.Stichera3.text	@ltx/en_us_goadedes/oc.m3.d5:ocVE.Aposticha3.text
ltx/en_us_goadedes/oc.m3.d7:octrVE.Stichera4.incipit	@ltx/en_us_goadedes/oc.m3.d2:ocVE.Aposticha3.incipit
ltx/en_us_goadedes/oc.m3.d7:octrVE.Stichera4.melody	@ltx/en_us_goadedes/miscellanea:misc.Automelon
ltx/en_us_goadedes/oc.m3.d7:octrVE.Stichera4.mode	@ltx/en_us_goadedes/miscellanea:misc.Mode3
ltx/en_us_goadedes/oc.m3.d7:octrVE.Stichera4.text	@ltx/en_us_goadedes/oc.m3.d2:ocVE.Aposticha3.text
