ltx/en_us_goadedes/me.m11.d07:alt1.meDA.commemoration.first_name	
ltx/en_us_goadedes/me.m11.d07:alt1.meDA.commemoration.first_short	
ltx/en_us_goadedes/me.m11.d07:alt1.meDA.commemoration.first_title	
ltx/en_us_goadedes/me.m11.d07:alt1.meDA.commemoration.full	
ltx/en_us_goadedes/me.m11.d07:alt1.meDA.commemoration.second_name	
ltx/en_us_goadedes/me.m11.d07:alt1.meDA.commemoration.second_title	
ltx/en_us_goadedes/me.m11.d07:alt1.meDA.date	
ltx/en_us_goadedes/me.m11.d07:alt1.meDA.insert1	
ltx/en_us_goadedes/me.m11.d07:alt1.meDA.insert2	
ltx/en_us_goadedes/me.m11.d07:alt1.meDA.note	
ltx/en_us_goadedes/me.m11.d07:alt1.meHO.commemorations	
ltx/en_us_goadedes/me.m11.d07:alt1.meHO.note1	
ltx/en_us_goadedes/me.m11.d07:alt1.meHO.note2	
ltx/en_us_goadedes/me.m11.d07:alt1.meHO.number	
ltx/en_us_goadedes/me.m11.d07:alt1.meHO.rank	
ltx/en_us_goadedes/me.m11.d07:alt1.meLE.commemoration1	
ltx/en_us_goadedes/me.m11.d07:alt1.meLE.commemoration2	
ltx/en_us_goadedes/me.m11.d07:alt1.meLI.Kontakion1.incipit	@ltx/en_us_goadedes/me.m11.d07:alt1.meMA.Kontakion1.incipit
ltx/en_us_goadedes/me.m11.d07:alt1.meLI.Kontakion1.melody	@ltx/en_us_goadedes/me.m11.d07:alt1.meMA.Kontakion1.melody
ltx/en_us_goadedes/me.m11.d07:alt1.meLI.Kontakion1.mode	@ltx/en_us_goadedes/me.m11.d07:alt1.meMA.Kontakion1.mode
ltx/en_us_goadedes/me.m11.d07:alt1.meLI.Kontakion1.text	@ltx/en_us_goadedes/me.m11.d07:alt1.meMA.Kontakion1.text
ltx/en_us_goadedes/me.m11.d07:alt1.meLI.MM.CommunionHymn.text	@ltx/en_us_goadedes/properties:media.key
ltx/en_us_goadedes/me.m11.d07:alt1.meLI.Megalynarion.text	
ltx/en_us_goadedes/me.m11.d07:alt1.meMA.C1.title	
ltx/en_us_goadedes/me.m11.d07:alt1.meMA.C1.verse	
ltx/en_us_goadedes/me.m11.d07:alt1.meMA.ExapTheotokion.incipit	…
ltx/en_us_goadedes/me.m11.d07:alt1.meMA.ExapTheotokion.melody	@ltx/en_us_goadedes/he.a.m3:heAU.TonNymfonaSouVlepo.name
ltx/en_us_goadedes/me.m11.d07:alt1.meMA.ExapTheotokion.mode	@ltx/en_us_goadedes/miscellanea:misc.Mode3
ltx/en_us_goadedes/me.m11.d07:alt1.meMA.ExapTheotokion.text	
ltx/en_us_goadedes/me.m11.d07:alt1.meMA.Exaposteilarion1.greekmelody	@ltx/en_us_goadedes/he.a.m3:heAU.TonNymfonaSouVlepo.greekname
ltx/en_us_goadedes/me.m11.d07:alt1.meMA.Exaposteilarion1.incipit	…
ltx/en_us_goadedes/me.m11.d07:alt1.meMA.Exaposteilarion1.melody	@ltx/en_us_goadedes/he.a.m3:heAU.TonNymfonaSouVlepo.name
ltx/en_us_goadedes/me.m11.d07:alt1.meMA.Exaposteilarion1.mode	@ltx/en_us_goadedes/miscellanea:misc.Mode3
ltx/en_us_goadedes/me.m11.d07:alt1.meMA.Exaposteilarion1.text	
ltx/en_us_goadedes/me.m11.d07:alt1.meMA.Kathisma11.greekmelody	@ltx/en_us_goadedes/he.a.m1:heAU.TonTafonSouSotir.greekname
ltx/en_us_goadedes/me.m11.d07:alt1.meMA.Kathisma11.incipit	…
ltx/en_us_goadedes/me.m11.d07:alt1.meMA.Kathisma11.melody	@ltx/en_us_goadedes/he.a.m1:heAU.TonTafonSouSotir.name
ltx/en_us_goadedes/me.m11.d07:alt1.meMA.Kathisma11.mode	@ltx/en_us_goadedes/miscellanea:misc.Mode1
ltx/en_us_goadedes/me.m11.d07:alt1.meMA.Kathisma11.text	
ltx/en_us_goadedes/me.m11.d07:alt1.meMA.Kathisma1T.greekmelody	@ltx/en_us_goadedes/he.a.m1:heAU.TonTafonSouSotir.greekname
ltx/en_us_goadedes/me.m11.d07:alt1.meMA.Kathisma1T.incipit	…
ltx/en_us_goadedes/me.m11.d07:alt1.meMA.Kathisma1T.melody	@ltx/en_us_goadedes/he.a.m1:heAU.TonTafonSouSotir.name
ltx/en_us_goadedes/me.m11.d07:alt1.meMA.Kathisma1T.mode	@ltx/en_us_goadedes/miscellanea:misc.Mode1
ltx/en_us_goadedes/me.m11.d07:alt1.meMA.Kathisma1T.text	
ltx/en_us_goadedes/me.m11.d07:alt1.meMA.Kathisma21.greekmelody	@ltx/en_us_goadedes/he.a.m3:heAU.TinOraiotita.greekname
ltx/en_us_goadedes/me.m11.d07:alt1.meMA.Kathisma21.incipit	…
ltx/en_us_goadedes/me.m11.d07:alt1.meMA.Kathisma21.melody	@ltx/en_us_goadedes/he.a.m3:heAU.TinOraiotita.name
ltx/en_us_goadedes/me.m11.d07:alt1.meMA.Kathisma21.mode	@ltx/en_us_goadedes/miscellanea:misc.Mode3
ltx/en_us_goadedes/me.m11.d07:alt1.meMA.Kathisma21.text	
ltx/en_us_goadedes/me.m11.d07:alt1.meMA.Kathisma2T.greekmelody	@ltx/en_us_goadedes/he.a.m3:heAU.TinOraiotita.greekname
ltx/en_us_goadedes/me.m11.d07:alt1.meMA.Kathisma2T.incipit	@ltx/en_us_goadedes/he.a.m3:heAU.TinOraiotita.incipit
ltx/en_us_goadedes/me.m11.d07:alt1.meMA.Kathisma2T.melody	@ltx/en_us_goadedes/he.a.m3:heAU.TinOraiotita.melody
ltx/en_us_goadedes/me.m11.d07:alt1.meMA.Kathisma2T.mode	@ltx/en_us_goadedes/miscellanea:misc.Mode3
ltx/en_us_goadedes/me.m11.d07:alt1.meMA.Kathisma2T.text	@ltx/en_us_goadedes/he.a.m3:heAU.TinOraiotita.text
ltx/en_us_goadedes/me.m11.d07:alt1.meMA.Kathisma31.greekmelody	@ltx/en_us_goadedes/he.a.m4:heAU.KateplagiIosif.greekname
ltx/en_us_goadedes/me.m11.d07:alt1.meMA.Kathisma31.incipit	…
ltx/en_us_goadedes/me.m11.d07:alt1.meMA.Kathisma31.melody	@ltx/en_us_goadedes/he.a.m4:heAU.KateplagiIosif.name
ltx/en_us_goadedes/me.m11.d07:alt1.meMA.Kathisma31.mode	@ltx/en_us_goadedes/miscellanea:misc.Mode4
ltx/en_us_goadedes/me.m11.d07:alt1.meMA.Kathisma31.text	
ltx/en_us_goadedes/me.m11.d07:alt1.meMA.Kathisma3T.greekmelody	@ltx/en_us_goadedes/he.a.m4:heAU.KateplagiIosif.greekname
ltx/en_us_goadedes/me.m11.d07:alt1.meMA.Kathisma3T.incipit	…
ltx/en_us_goadedes/me.m11.d07:alt1.meMA.Kathisma3T.melody	@ltx/en_us_goadedes/he.a.m4:heAU.KateplagiIosif.name
ltx/en_us_goadedes/me.m11.d07:alt1.meMA.Kathisma3T.mode	@ltx/en_us_goadedes/miscellanea:misc.Mode4
ltx/en_us_goadedes/me.m11.d07:alt1.meMA.Kathisma3T.text	
ltx/en_us_goadedes/me.m11.d07:alt1.meMA.Kontakion1.incipit	…
ltx/en_us_goadedes/me.m11.d07:alt1.meMA.Kontakion1.melody	
ltx/en_us_goadedes/me.m11.d07:alt1.meMA.Kontakion1.mode	@ltx/en_us_goadedes/miscellanea:misc.Mode8
ltx/en_us_goadedes/me.m11.d07:alt1.meMA.Kontakion1.text	
ltx/en_us_goadedes/me.m11.d07:alt1.meMA.Lauds1.greekmelody	@ltx/en_us_goadedes/he.a.m4:heAU.EdokasSimeiosin.greekname
ltx/en_us_goadedes/me.m11.d07:alt1.meMA.Lauds1.incipit	…
ltx/en_us_goadedes/me.m11.d07:alt1.meMA.Lauds1.melody	@ltx/en_us_goadedes/he.a.m4:heAU.EdokasSimeiosin.name
ltx/en_us_goadedes/me.m11.d07:alt1.meMA.Lauds1.mode	@ltx/en_us_goadedes/miscellanea:misc.Mode4
ltx/en_us_goadedes/me.m11.d07:alt1.meMA.Lauds1.text	
ltx/en_us_goadedes/me.m11.d07:alt1.meMA.Lauds2.incipit	…
ltx/en_us_goadedes/me.m11.d07:alt1.meMA.Lauds2.melody	@ltx/en_us_goadedes/he.a.m4:heAU.EdokasSimeiosin.name
ltx/en_us_goadedes/me.m11.d07:alt1.meMA.Lauds2.mode	@ltx/en_us_goadedes/miscellanea:misc.Mode4
ltx/en_us_goadedes/me.m11.d07:alt1.meMA.Lauds2.text	
ltx/en_us_goadedes/me.m11.d07:alt1.meMA.Lauds3.incipit	…
ltx/en_us_goadedes/me.m11.d07:alt1.meMA.Lauds3.melody	@ltx/en_us_goadedes/he.a.m4:heAU.EdokasSimeiosin.name
ltx/en_us_goadedes/me.m11.d07:alt1.meMA.Lauds3.mode	@ltx/en_us_goadedes/miscellanea:misc.Mode4
ltx/en_us_goadedes/me.m11.d07:alt1.meMA.Lauds3.text	
ltx/en_us_goadedes/me.m11.d07:alt1.meMA.LaudsGlory.incipit	…
ltx/en_us_goadedes/me.m11.d07:alt1.meMA.LaudsGlory.melody	
ltx/en_us_goadedes/me.m11.d07:alt1.meMA.LaudsGlory.mode	@ltx/en_us_goadedes/miscellanea:misc.Mode5
ltx/en_us_goadedes/me.m11.d07:alt1.meMA.LaudsGlory.text	
ltx/en_us_goadedes/me.m11.d07:alt1.meMA.LaudsTheotokion.incipit	…
ltx/en_us_goadedes/me.m11.d07:alt1.meMA.LaudsTheotokion.melody	
ltx/en_us_goadedes/me.m11.d07:alt1.meMA.LaudsTheotokion.mode	@ltx/en_us_goadedes/miscellanea:misc.Mode5
ltx/en_us_goadedes/me.m11.d07:alt1.meMA.LaudsTheotokion.text	
ltx/en_us_goadedes/me.m11.d07:alt1.meMA.Ode1C11.greekmelody	@ltx/en_us_goadedes/he.h.m6:heHE.OsEnIpeiroPezefsas.greekname
ltx/en_us_goadedes/me.m11.d07:alt1.meMA.Ode1C11.incipit	…
ltx/en_us_goadedes/me.m11.d07:alt1.meMA.Ode1C11.melody	@ltx/en_us_goadedes/he.h.m6:heHE.OsEnIpeiroPezefsas.name
ltx/en_us_goadedes/me.m11.d07:alt1.meMA.Ode1C11.mode	@ltx/en_us_goadedes/miscellanea:misc.Mode6
ltx/en_us_goadedes/me.m11.d07:alt1.meMA.Ode1C11.ode	@ltx/en_us_goadedes/miscellanea:misc.Ode1
ltx/en_us_goadedes/me.m11.d07:alt1.meMA.Ode1C11.text	
ltx/en_us_goadedes/me.m11.d07:alt1.meMA.Ode1C12.incipit	…
ltx/en_us_goadedes/me.m11.d07:alt1.meMA.Ode1C12.melody	@ltx/en_us_goadedes/he.h.m6:heHE.OsEnIpeiroPezefsas.name
ltx/en_us_goadedes/me.m11.d07:alt1.meMA.Ode1C12.mode	@ltx/en_us_goadedes/miscellanea:misc.Mode6
ltx/en_us_goadedes/me.m11.d07:alt1.meMA.Ode1C12.ode	@ltx/en_us_goadedes/miscellanea:misc.Ode1
ltx/en_us_goadedes/me.m11.d07:alt1.meMA.Ode1C12.text	
ltx/en_us_goadedes/me.m11.d07:alt1.meMA.Ode1C13.incipit	…
ltx/en_us_goadedes/me.m11.d07:alt1.meMA.Ode1C13.melody	@ltx/en_us_goadedes/he.h.m6:heHE.OsEnIpeiroPezefsas.name
ltx/en_us_goadedes/me.m11.d07:alt1.meMA.Ode1C13.mode	@ltx/en_us_goadedes/miscellanea:misc.Mode6
ltx/en_us_goadedes/me.m11.d07:alt1.meMA.Ode1C13.ode	@ltx/en_us_goadedes/miscellanea:misc.Ode1
ltx/en_us_goadedes/me.m11.d07:alt1.meMA.Ode1C13.text	
ltx/en_us_goadedes/me.m11.d07:alt1.meMA.Ode1C14.incipit	…
ltx/en_us_goadedes/me.m11.d07:alt1.meMA.Ode1C14.melody	@ltx/en_us_goadedes/he.h.m6:heHE.OsEnIpeiroPezefsas.name
ltx/en_us_goadedes/me.m11.d07:alt1.meMA.Ode1C14.mode	@ltx/en_us_goadedes/miscellanea:misc.Mode6
ltx/en_us_goadedes/me.m11.d07:alt1.meMA.Ode1C14.ode	@ltx/en_us_goadedes/miscellanea:misc.Ode1
ltx/en_us_goadedes/me.m11.d07:alt1.meMA.Ode1C14.text	
ltx/en_us_goadedes/me.m11.d07:alt1.meMA.Ode1C1T.incipit	…
ltx/en_us_goadedes/me.m11.d07:alt1.meMA.Ode1C1T.melody	@ltx/en_us_goadedes/he.h.m6:heHE.OsEnIpeiroPezefsas.name
ltx/en_us_goadedes/me.m11.d07:alt1.meMA.Ode1C1T.mode	@ltx/en_us_goadedes/miscellanea:misc.Mode6
ltx/en_us_goadedes/me.m11.d07:alt1.meMA.Ode1C1T.ode	@ltx/en_us_goadedes/miscellanea:misc.Ode1
ltx/en_us_goadedes/me.m11.d07:alt1.meMA.Ode1C1T.text	
ltx/en_us_goadedes/me.m11.d07:alt1.meMA.Ode3C11.greekmelody	@ltx/en_us_goadedes/he.h.m6:heHE.OukEstinAgios.greekname
ltx/en_us_goadedes/me.m11.d07:alt1.meMA.Ode3C11.incipit	…
ltx/en_us_goadedes/me.m11.d07:alt1.meMA.Ode3C11.melody	@ltx/en_us_goadedes/he.h.m6:heHE.OukEstinAgios.name
ltx/en_us_goadedes/me.m11.d07:alt1.meMA.Ode3C11.mode	@ltx/en_us_goadedes/miscellanea:misc.Mode6
ltx/en_us_goadedes/me.m11.d07:alt1.meMA.Ode3C11.ode	@ltx/en_us_goadedes/miscellanea:misc.Ode3
ltx/en_us_goadedes/me.m11.d07:alt1.meMA.Ode3C11.text	
ltx/en_us_goadedes/me.m11.d07:alt1.meMA.Ode3C12.incipit	…
ltx/en_us_goadedes/me.m11.d07:alt1.meMA.Ode3C12.melody	@ltx/en_us_goadedes/he.h.m6:heHE.OukEstinAgios.name
ltx/en_us_goadedes/me.m11.d07:alt1.meMA.Ode3C12.mode	@ltx/en_us_goadedes/miscellanea:misc.Mode6
ltx/en_us_goadedes/me.m11.d07:alt1.meMA.Ode3C12.ode	@ltx/en_us_goadedes/miscellanea:misc.Ode3
ltx/en_us_goadedes/me.m11.d07:alt1.meMA.Ode3C12.text	
ltx/en_us_goadedes/me.m11.d07:alt1.meMA.Ode3C13.incipit	…
ltx/en_us_goadedes/me.m11.d07:alt1.meMA.Ode3C13.melody	@ltx/en_us_goadedes/he.h.m6:heHE.OukEstinAgios.name
ltx/en_us_goadedes/me.m11.d07:alt1.meMA.Ode3C13.mode	@ltx/en_us_goadedes/miscellanea:misc.Mode6
ltx/en_us_goadedes/me.m11.d07:alt1.meMA.Ode3C13.ode	@ltx/en_us_goadedes/miscellanea:misc.Ode3
ltx/en_us_goadedes/me.m11.d07:alt1.meMA.Ode3C13.text	
ltx/en_us_goadedes/me.m11.d07:alt1.meMA.Ode3C14.incipit	…
ltx/en_us_goadedes/me.m11.d07:alt1.meMA.Ode3C14.melody	@ltx/en_us_goadedes/he.h.m6:heHE.OukEstinAgios.name
ltx/en_us_goadedes/me.m11.d07:alt1.meMA.Ode3C14.mode	@ltx/en_us_goadedes/miscellanea:misc.Mode6
ltx/en_us_goadedes/me.m11.d07:alt1.meMA.Ode3C14.ode	@ltx/en_us_goadedes/miscellanea:misc.Ode3
ltx/en_us_goadedes/me.m11.d07:alt1.meMA.Ode3C14.text	
ltx/en_us_goadedes/me.m11.d07:alt1.meMA.Ode3C1T.incipit	…
ltx/en_us_goadedes/me.m11.d07:alt1.meMA.Ode3C1T.melody	@ltx/en_us_goadedes/he.h.m6:heHE.OukEstinAgios.name
ltx/en_us_goadedes/me.m11.d07:alt1.meMA.Ode3C1T.mode	@ltx/en_us_goadedes/miscellanea:misc.Mode6
ltx/en_us_goadedes/me.m11.d07:alt1.meMA.Ode3C1T.ode	@ltx/en_us_goadedes/miscellanea:misc.Ode3
ltx/en_us_goadedes/me.m11.d07:alt1.meMA.Ode3C1T.text	
ltx/en_us_goadedes/me.m11.d07:alt1.meMA.Ode3Kathisma1.greekmelody	@ltx/en_us_goadedes/he.a.m4:heAU.KateplagiIosif.greekname
ltx/en_us_goadedes/me.m11.d07:alt1.meMA.Ode3Kathisma1.incipit	…
ltx/en_us_goadedes/me.m11.d07:alt1.meMA.Ode3Kathisma1.melody	@ltx/en_us_goadedes/he.a.m4:heAU.KateplagiIosif.name
ltx/en_us_goadedes/me.m11.d07:alt1.meMA.Ode3Kathisma1.mode	@ltx/en_us_goadedes/miscellanea:misc.Mode4
ltx/en_us_goadedes/me.m11.d07:alt1.meMA.Ode3Kathisma1.text	
ltx/en_us_goadedes/me.m11.d07:alt1.meMA.Ode3KathismaT.incipit	…
ltx/en_us_goadedes/me.m11.d07:alt1.meMA.Ode3KathismaT.melody	
ltx/en_us_goadedes/me.m11.d07:alt1.meMA.Ode3KathismaT.mode	@ltx/en_us_goadedes/miscellanea:misc.Mode4
ltx/en_us_goadedes/me.m11.d07:alt1.meMA.Ode3KathismaT.text	
ltx/en_us_goadedes/me.m11.d07:alt1.meMA.Ode4C11.greekmelody	@ltx/en_us_goadedes/he.h.m6:heHE.ChristosMouDynamis.greekname
ltx/en_us_goadedes/me.m11.d07:alt1.meMA.Ode4C11.incipit	…
ltx/en_us_goadedes/me.m11.d07:alt1.meMA.Ode4C11.melody	@ltx/en_us_goadedes/he.h.m6:heHE.ChristosMouDynamis.name
ltx/en_us_goadedes/me.m11.d07:alt1.meMA.Ode4C11.mode	@ltx/en_us_goadedes/miscellanea:misc.Mode6
ltx/en_us_goadedes/me.m11.d07:alt1.meMA.Ode4C11.ode	@ltx/en_us_goadedes/miscellanea:misc.Ode4
ltx/en_us_goadedes/me.m11.d07:alt1.meMA.Ode4C11.text	
ltx/en_us_goadedes/me.m11.d07:alt1.meMA.Ode4C12.incipit	…
ltx/en_us_goadedes/me.m11.d07:alt1.meMA.Ode4C12.melody	@ltx/en_us_goadedes/he.h.m6:heHE.ChristosMouDynamis.name
ltx/en_us_goadedes/me.m11.d07:alt1.meMA.Ode4C12.mode	@ltx/en_us_goadedes/miscellanea:misc.Mode6
ltx/en_us_goadedes/me.m11.d07:alt1.meMA.Ode4C12.ode	@ltx/en_us_goadedes/miscellanea:misc.Ode4
ltx/en_us_goadedes/me.m11.d07:alt1.meMA.Ode4C12.text	
ltx/en_us_goadedes/me.m11.d07:alt1.meMA.Ode4C13.incipit	…
ltx/en_us_goadedes/me.m11.d07:alt1.meMA.Ode4C13.melody	@ltx/en_us_goadedes/he.h.m6:heHE.ChristosMouDynamis.name
ltx/en_us_goadedes/me.m11.d07:alt1.meMA.Ode4C13.mode	@ltx/en_us_goadedes/miscellanea:misc.Mode6
ltx/en_us_goadedes/me.m11.d07:alt1.meMA.Ode4C13.ode	@ltx/en_us_goadedes/miscellanea:misc.Ode4
ltx/en_us_goadedes/me.m11.d07:alt1.meMA.Ode4C13.text	
ltx/en_us_goadedes/me.m11.d07:alt1.meMA.Ode4C14.incipit	…
ltx/en_us_goadedes/me.m11.d07:alt1.meMA.Ode4C14.melody	@ltx/en_us_goadedes/he.h.m6:heHE.ChristosMouDynamis.name
ltx/en_us_goadedes/me.m11.d07:alt1.meMA.Ode4C14.mode	@ltx/en_us_goadedes/miscellanea:misc.Mode6
ltx/en_us_goadedes/me.m11.d07:alt1.meMA.Ode4C14.ode	@ltx/en_us_goadedes/miscellanea:misc.Ode4
ltx/en_us_goadedes/me.m11.d07:alt1.meMA.Ode4C14.text	
ltx/en_us_goadedes/me.m11.d07:alt1.meMA.Ode4C1T.incipit	…
ltx/en_us_goadedes/me.m11.d07:alt1.meMA.Ode4C1T.melody	@ltx/en_us_goadedes/he.h.m6:heHE.ChristosMouDynamis.name
ltx/en_us_goadedes/me.m11.d07:alt1.meMA.Ode4C1T.mode	@ltx/en_us_goadedes/miscellanea:misc.Mode6
ltx/en_us_goadedes/me.m11.d07:alt1.meMA.Ode4C1T.ode	@ltx/en_us_goadedes/miscellanea:misc.Ode4
ltx/en_us_goadedes/me.m11.d07:alt1.meMA.Ode4C1T.text	
ltx/en_us_goadedes/me.m11.d07:alt1.meMA.Ode5C11.greekmelody	@ltx/en_us_goadedes/he.h.m6:heHE.ToTheioFengeiSou.greekname
ltx/en_us_goadedes/me.m11.d07:alt1.meMA.Ode5C11.incipit	…
ltx/en_us_goadedes/me.m11.d07:alt1.meMA.Ode5C11.melody	@ltx/en_us_goadedes/he.h.m6:heHE.ToTheioFengeiSou.name
ltx/en_us_goadedes/me.m11.d07:alt1.meMA.Ode5C11.mode	@ltx/en_us_goadedes/miscellanea:misc.Mode6
ltx/en_us_goadedes/me.m11.d07:alt1.meMA.Ode5C11.ode	@ltx/en_us_goadedes/miscellanea:misc.Ode5
ltx/en_us_goadedes/me.m11.d07:alt1.meMA.Ode5C11.text	
ltx/en_us_goadedes/me.m11.d07:alt1.meMA.Ode5C12.incipit	…
ltx/en_us_goadedes/me.m11.d07:alt1.meMA.Ode5C12.melody	@ltx/en_us_goadedes/he.h.m6:heHE.ToTheioFengeiSou.name
ltx/en_us_goadedes/me.m11.d07:alt1.meMA.Ode5C12.mode	@ltx/en_us_goadedes/miscellanea:misc.Mode6
ltx/en_us_goadedes/me.m11.d07:alt1.meMA.Ode5C12.ode	@ltx/en_us_goadedes/miscellanea:misc.Ode5
ltx/en_us_goadedes/me.m11.d07:alt1.meMA.Ode5C12.text	
ltx/en_us_goadedes/me.m11.d07:alt1.meMA.Ode5C13.incipit	…
ltx/en_us_goadedes/me.m11.d07:alt1.meMA.Ode5C13.melody	@ltx/en_us_goadedes/he.h.m6:heHE.ToTheioFengeiSou.name
ltx/en_us_goadedes/me.m11.d07:alt1.meMA.Ode5C13.mode	@ltx/en_us_goadedes/miscellanea:misc.Mode6
ltx/en_us_goadedes/me.m11.d07:alt1.meMA.Ode5C13.ode	@ltx/en_us_goadedes/miscellanea:misc.Ode5
ltx/en_us_goadedes/me.m11.d07:alt1.meMA.Ode5C13.text	
ltx/en_us_goadedes/me.m11.d07:alt1.meMA.Ode5C14.incipit	…
ltx/en_us_goadedes/me.m11.d07:alt1.meMA.Ode5C14.melody	@ltx/en_us_goadedes/he.h.m6:heHE.ToTheioFengeiSou.name
ltx/en_us_goadedes/me.m11.d07:alt1.meMA.Ode5C14.mode	@ltx/en_us_goadedes/miscellanea:misc.Mode6
ltx/en_us_goadedes/me.m11.d07:alt1.meMA.Ode5C14.ode	@ltx/en_us_goadedes/miscellanea:misc.Ode5
ltx/en_us_goadedes/me.m11.d07:alt1.meMA.Ode5C14.text	
ltx/en_us_goadedes/me.m11.d07:alt1.meMA.Ode5C1T.incipit	…
ltx/en_us_goadedes/me.m11.d07:alt1.meMA.Ode5C1T.melody	@ltx/en_us_goadedes/he.h.m6:heHE.ToTheioFengeiSou.name
ltx/en_us_goadedes/me.m11.d07:alt1.meMA.Ode5C1T.mode	@ltx/en_us_goadedes/miscellanea:misc.Mode6
ltx/en_us_goadedes/me.m11.d07:alt1.meMA.Ode5C1T.ode	@ltx/en_us_goadedes/miscellanea:misc.Ode5
ltx/en_us_goadedes/me.m11.d07:alt1.meMA.Ode5C1T.text	
ltx/en_us_goadedes/me.m11.d07:alt1.meMA.Ode6C11.greekmelody	@ltx/en_us_goadedes/he.h.m6:heHE.TouViouTinThalassan.greekname
ltx/en_us_goadedes/me.m11.d07:alt1.meMA.Ode6C11.incipit	…
ltx/en_us_goadedes/me.m11.d07:alt1.meMA.Ode6C11.melody	@ltx/en_us_goadedes/he.h.m6:heHE.TouViouTinThalassan.name
ltx/en_us_goadedes/me.m11.d07:alt1.meMA.Ode6C11.mode	@ltx/en_us_goadedes/miscellanea:misc.Mode6
ltx/en_us_goadedes/me.m11.d07:alt1.meMA.Ode6C11.ode	@ltx/en_us_goadedes/miscellanea:misc.Ode6
ltx/en_us_goadedes/me.m11.d07:alt1.meMA.Ode6C11.text	
ltx/en_us_goadedes/me.m11.d07:alt1.meMA.Ode6C12.incipit	…
ltx/en_us_goadedes/me.m11.d07:alt1.meMA.Ode6C12.melody	@ltx/en_us_goadedes/he.h.m6:heHE.TouViouTinThalassan.name
ltx/en_us_goadedes/me.m11.d07:alt1.meMA.Ode6C12.mode	@ltx/en_us_goadedes/miscellanea:misc.Mode6
ltx/en_us_goadedes/me.m11.d07:alt1.meMA.Ode6C12.ode	@ltx/en_us_goadedes/miscellanea:misc.Ode6
ltx/en_us_goadedes/me.m11.d07:alt1.meMA.Ode6C12.text	
ltx/en_us_goadedes/me.m11.d07:alt1.meMA.Ode6C13.incipit	…
ltx/en_us_goadedes/me.m11.d07:alt1.meMA.Ode6C13.melody	@ltx/en_us_goadedes/he.h.m6:heHE.TouViouTinThalassan.name
ltx/en_us_goadedes/me.m11.d07:alt1.meMA.Ode6C13.mode	@ltx/en_us_goadedes/miscellanea:misc.Mode6
ltx/en_us_goadedes/me.m11.d07:alt1.meMA.Ode6C13.ode	@ltx/en_us_goadedes/miscellanea:misc.Ode6
ltx/en_us_goadedes/me.m11.d07:alt1.meMA.Ode6C13.text	
ltx/en_us_goadedes/me.m11.d07:alt1.meMA.Ode6C14.incipit	…
ltx/en_us_goadedes/me.m11.d07:alt1.meMA.Ode6C14.melody	@ltx/en_us_goadedes/he.h.m6:heHE.TouViouTinThalassan.name
ltx/en_us_goadedes/me.m11.d07:alt1.meMA.Ode6C14.mode	@ltx/en_us_goadedes/miscellanea:misc.Mode6
ltx/en_us_goadedes/me.m11.d07:alt1.meMA.Ode6C14.ode	@ltx/en_us_goadedes/miscellanea:misc.Ode6
ltx/en_us_goadedes/me.m11.d07:alt1.meMA.Ode6C14.text	
ltx/en_us_goadedes/me.m11.d07:alt1.meMA.Ode6C1T.incipit	…
ltx/en_us_goadedes/me.m11.d07:alt1.meMA.Ode6C1T.melody	@ltx/en_us_goadedes/he.h.m6:heHE.TouViouTinThalassan.name
ltx/en_us_goadedes/me.m11.d07:alt1.meMA.Ode6C1T.mode	@ltx/en_us_goadedes/miscellanea:misc.Mode6
ltx/en_us_goadedes/me.m11.d07:alt1.meMA.Ode6C1T.ode	@ltx/en_us_goadedes/miscellanea:misc.Ode6
ltx/en_us_goadedes/me.m11.d07:alt1.meMA.Ode6C1T.text	
ltx/en_us_goadedes/me.m11.d07:alt1.meMA.Ode7C11.greekmelody	@ltx/en_us_goadedes/he.h.m6:heHE.DrosovolonMenTinKaminon.greekname
ltx/en_us_goadedes/me.m11.d07:alt1.meMA.Ode7C11.incipit	…
ltx/en_us_goadedes/me.m11.d07:alt1.meMA.Ode7C11.melody	@ltx/en_us_goadedes/he.h.m6:heHE.DrosovolonMenTinKaminon.name
ltx/en_us_goadedes/me.m11.d07:alt1.meMA.Ode7C11.mode	@ltx/en_us_goadedes/miscellanea:misc.Mode6
ltx/en_us_goadedes/me.m11.d07:alt1.meMA.Ode7C11.ode	@ltx/en_us_goadedes/miscellanea:misc.Ode7
ltx/en_us_goadedes/me.m11.d07:alt1.meMA.Ode7C11.text	
ltx/en_us_goadedes/me.m11.d07:alt1.meMA.Ode7C12.incipit	…
ltx/en_us_goadedes/me.m11.d07:alt1.meMA.Ode7C12.melody	@ltx/en_us_goadedes/he.h.m6:heHE.DrosovolonMenTinKaminon.name
ltx/en_us_goadedes/me.m11.d07:alt1.meMA.Ode7C12.mode	@ltx/en_us_goadedes/miscellanea:misc.Mode6
ltx/en_us_goadedes/me.m11.d07:alt1.meMA.Ode7C12.ode	@ltx/en_us_goadedes/miscellanea:misc.Ode7
ltx/en_us_goadedes/me.m11.d07:alt1.meMA.Ode7C12.text	
ltx/en_us_goadedes/me.m11.d07:alt1.meMA.Ode7C13.incipit	…
ltx/en_us_goadedes/me.m11.d07:alt1.meMA.Ode7C13.melody	@ltx/en_us_goadedes/he.h.m6:heHE.DrosovolonMenTinKaminon.name
ltx/en_us_goadedes/me.m11.d07:alt1.meMA.Ode7C13.mode	@ltx/en_us_goadedes/miscellanea:misc.Mode6
ltx/en_us_goadedes/me.m11.d07:alt1.meMA.Ode7C13.ode	@ltx/en_us_goadedes/miscellanea:misc.Ode7
ltx/en_us_goadedes/me.m11.d07:alt1.meMA.Ode7C13.text	
ltx/en_us_goadedes/me.m11.d07:alt1.meMA.Ode7C14.incipit	…
ltx/en_us_goadedes/me.m11.d07:alt1.meMA.Ode7C14.melody	@ltx/en_us_goadedes/he.h.m6:heHE.DrosovolonMenTinKaminon.name
ltx/en_us_goadedes/me.m11.d07:alt1.meMA.Ode7C14.mode	@ltx/en_us_goadedes/miscellanea:misc.Mode6
ltx/en_us_goadedes/me.m11.d07:alt1.meMA.Ode7C14.ode	@ltx/en_us_goadedes/miscellanea:misc.Ode7
ltx/en_us_goadedes/me.m11.d07:alt1.meMA.Ode7C14.text	
ltx/en_us_goadedes/me.m11.d07:alt1.meMA.Ode7C1T.incipit	…
ltx/en_us_goadedes/me.m11.d07:alt1.meMA.Ode7C1T.melody	@ltx/en_us_goadedes/he.h.m6:heHE.DrosovolonMenTinKaminon.name
ltx/en_us_goadedes/me.m11.d07:alt1.meMA.Ode7C1T.mode	@ltx/en_us_goadedes/miscellanea:misc.Mode6
ltx/en_us_goadedes/me.m11.d07:alt1.meMA.Ode7C1T.ode	@ltx/en_us_goadedes/miscellanea:misc.Ode7
ltx/en_us_goadedes/me.m11.d07:alt1.meMA.Ode7C1T.text	
ltx/en_us_goadedes/me.m11.d07:alt1.meMA.Ode8C11.greekmelody	@ltx/en_us_goadedes/he.h.m6:heHE.EkFlogosToisOsiois.greekname
ltx/en_us_goadedes/me.m11.d07:alt1.meMA.Ode8C11.incipit	…
ltx/en_us_goadedes/me.m11.d07:alt1.meMA.Ode8C11.melody	@ltx/en_us_goadedes/he.h.m6:heHE.EkFlogosToisOsiois.name
ltx/en_us_goadedes/me.m11.d07:alt1.meMA.Ode8C11.mode	@ltx/en_us_goadedes/miscellanea:misc.Mode6
ltx/en_us_goadedes/me.m11.d07:alt1.meMA.Ode8C11.ode	@ltx/en_us_goadedes/miscellanea:misc.Ode8
ltx/en_us_goadedes/me.m11.d07:alt1.meMA.Ode8C11.text	
ltx/en_us_goadedes/me.m11.d07:alt1.meMA.Ode8C12.incipit	…
ltx/en_us_goadedes/me.m11.d07:alt1.meMA.Ode8C12.melody	@ltx/en_us_goadedes/he.h.m6:heHE.EkFlogosToisOsiois.name
ltx/en_us_goadedes/me.m11.d07:alt1.meMA.Ode8C12.mode	@ltx/en_us_goadedes/miscellanea:misc.Mode6
ltx/en_us_goadedes/me.m11.d07:alt1.meMA.Ode8C12.ode	@ltx/en_us_goadedes/miscellanea:misc.Ode8
ltx/en_us_goadedes/me.m11.d07:alt1.meMA.Ode8C12.text	
ltx/en_us_goadedes/me.m11.d07:alt1.meMA.Ode8C13.incipit	…
ltx/en_us_goadedes/me.m11.d07:alt1.meMA.Ode8C13.melody	@ltx/en_us_goadedes/he.h.m6:heHE.EkFlogosToisOsiois.name
ltx/en_us_goadedes/me.m11.d07:alt1.meMA.Ode8C13.mode	@ltx/en_us_goadedes/miscellanea:misc.Mode6
ltx/en_us_goadedes/me.m11.d07:alt1.meMA.Ode8C13.ode	@ltx/en_us_goadedes/miscellanea:misc.Ode8
ltx/en_us_goadedes/me.m11.d07:alt1.meMA.Ode8C13.text	
ltx/en_us_goadedes/me.m11.d07:alt1.meMA.Ode8C14.incipit	…
ltx/en_us_goadedes/me.m11.d07:alt1.meMA.Ode8C14.melody	@ltx/en_us_goadedes/he.h.m6:heHE.EkFlogosToisOsiois.name
ltx/en_us_goadedes/me.m11.d07:alt1.meMA.Ode8C14.mode	@ltx/en_us_goadedes/miscellanea:misc.Mode6
ltx/en_us_goadedes/me.m11.d07:alt1.meMA.Ode8C14.ode	@ltx/en_us_goadedes/miscellanea:misc.Ode8
ltx/en_us_goadedes/me.m11.d07:alt1.meMA.Ode8C14.text	
ltx/en_us_goadedes/me.m11.d07:alt1.meMA.Ode8C1T.incipit	…
ltx/en_us_goadedes/me.m11.d07:alt1.meMA.Ode8C1T.melody	@ltx/en_us_goadedes/he.h.m6:heHE.EkFlogosToisOsiois.name
ltx/en_us_goadedes/me.m11.d07:alt1.meMA.Ode8C1T.mode	@ltx/en_us_goadedes/miscellanea:misc.Mode6
ltx/en_us_goadedes/me.m11.d07:alt1.meMA.Ode8C1T.ode	@ltx/en_us_goadedes/miscellanea:misc.Ode8
ltx/en_us_goadedes/me.m11.d07:alt1.meMA.Ode8C1T.text	
ltx/en_us_goadedes/me.m11.d07:alt1.meMA.Ode9C11.greekmelody	@ltx/en_us_goadedes/he.h.m6:heHE.TheonAnthropois.greekname
ltx/en_us_goadedes/me.m11.d07:alt1.meMA.Ode9C11.incipit	…
ltx/en_us_goadedes/me.m11.d07:alt1.meMA.Ode9C11.melody	@ltx/en_us_goadedes/he.h.m6:heHE.TheonAnthropois.name
ltx/en_us_goadedes/me.m11.d07:alt1.meMA.Ode9C11.mode	@ltx/en_us_goadedes/miscellanea:misc.Mode6
ltx/en_us_goadedes/me.m11.d07:alt1.meMA.Ode9C11.ode	@ltx/en_us_goadedes/miscellanea:misc.Ode9
ltx/en_us_goadedes/me.m11.d07:alt1.meMA.Ode9C11.text	
ltx/en_us_goadedes/me.m11.d07:alt1.meMA.Ode9C12.incipit	…
ltx/en_us_goadedes/me.m11.d07:alt1.meMA.Ode9C12.melody	@ltx/en_us_goadedes/he.h.m6:heHE.TheonAnthropois.name
ltx/en_us_goadedes/me.m11.d07:alt1.meMA.Ode9C12.mode	@ltx/en_us_goadedes/miscellanea:misc.Mode6
ltx/en_us_goadedes/me.m11.d07:alt1.meMA.Ode9C12.ode	@ltx/en_us_goadedes/miscellanea:misc.Ode9
ltx/en_us_goadedes/me.m11.d07:alt1.meMA.Ode9C12.text	
ltx/en_us_goadedes/me.m11.d07:alt1.meMA.Ode9C13.incipit	…
ltx/en_us_goadedes/me.m11.d07:alt1.meMA.Ode9C13.melody	@ltx/en_us_goadedes/he.h.m6:heHE.TheonAnthropois.name
ltx/en_us_goadedes/me.m11.d07:alt1.meMA.Ode9C13.mode	@ltx/en_us_goadedes/miscellanea:misc.Mode6
ltx/en_us_goadedes/me.m11.d07:alt1.meMA.Ode9C13.ode	@ltx/en_us_goadedes/miscellanea:misc.Ode9
ltx/en_us_goadedes/me.m11.d07:alt1.meMA.Ode9C13.text	
ltx/en_us_goadedes/me.m11.d07:alt1.meMA.Ode9C14.incipit	…
ltx/en_us_goadedes/me.m11.d07:alt1.meMA.Ode9C14.melody	@ltx/en_us_goadedes/he.h.m6:heHE.TheonAnthropois.name
ltx/en_us_goadedes/me.m11.d07:alt1.meMA.Ode9C14.mode	@ltx/en_us_goadedes/miscellanea:misc.Mode6
ltx/en_us_goadedes/me.m11.d07:alt1.meMA.Ode9C14.ode	@ltx/en_us_goadedes/miscellanea:misc.Ode9
ltx/en_us_goadedes/me.m11.d07:alt1.meMA.Ode9C14.text	
ltx/en_us_goadedes/me.m11.d07:alt1.meMA.Ode9C1T.incipit	…
ltx/en_us_goadedes/me.m11.d07:alt1.meMA.Ode9C1T.melody	@ltx/en_us_goadedes/he.h.m6:heHE.TheonAnthropois.name
ltx/en_us_goadedes/me.m11.d07:alt1.meMA.Ode9C1T.mode	@ltx/en_us_goadedes/miscellanea:misc.Mode6
ltx/en_us_goadedes/me.m11.d07:alt1.meMA.Ode9C1T.ode	@ltx/en_us_goadedes/miscellanea:misc.Ode9
ltx/en_us_goadedes/me.m11.d07:alt1.meMA.Ode9C1T.text	
ltx/en_us_goadedes/me.m11.d07:alt1.meMA.Oikos1.text	
ltx/en_us_goadedes/me.m11.d07:alt1.meMA.PostGospelBoth.incipit	…
ltx/en_us_goadedes/me.m11.d07:alt1.meMA.PostGospelBoth.melody	
ltx/en_us_goadedes/me.m11.d07:alt1.meMA.PostGospelBoth.mode	@ltx/en_us_goadedes/miscellanea:misc.Mode2
ltx/en_us_goadedes/me.m11.d07:alt1.meMA.PostGospelBoth.text	
ltx/en_us_goadedes/me.m11.d07:alt1.meMA.PostGospelGlory.incipit	…
ltx/en_us_goadedes/me.m11.d07:alt1.meMA.PostGospelGlory.melody	
ltx/en_us_goadedes/me.m11.d07:alt1.meMA.PostGospelGlory.mode	@ltx/en_us_goadedes/miscellanea:misc.Mode2
ltx/en_us_goadedes/me.m11.d07:alt1.meMA.PostGospelGlory.text	
ltx/en_us_goadedes/me.m11.d07:alt1.meMA.PostGospelIdiomelon.incipit	…
ltx/en_us_goadedes/me.m11.d07:alt1.meMA.PostGospelIdiomelon.melody	
ltx/en_us_goadedes/me.m11.d07:alt1.meMA.PostGospelIdiomelon.mode	@ltx/en_us_goadedes/miscellanea:misc.Mode5
ltx/en_us_goadedes/me.m11.d07:alt1.meMA.PostGospelIdiomelon.text	
ltx/en_us_goadedes/me.m11.d07:alt1.meMA.Synaxarion.commemoration.text	
ltx/en_us_goadedes/me.m11.d07:alt1.meVE.Apolytikion1.greekmelody	@ltx/en_us_goadedes/he.a.m3:heAU.TheiasPisteos.greekname
ltx/en_us_goadedes/me.m11.d07:alt1.meVE.Apolytikion1.incipit	…
ltx/en_us_goadedes/me.m11.d07:alt1.meVE.Apolytikion1.melody	@ltx/en_us_goadedes/he.a.m3:heAU.TheiasPisteos.name
ltx/en_us_goadedes/me.m11.d07:alt1.meVE.Apolytikion1.mode	@ltx/en_us_goadedes/miscellanea:misc.Mode3
ltx/en_us_goadedes/me.m11.d07:alt1.meVE.Apolytikion1.text	
ltx/en_us_goadedes/me.m11.d07:alt1.meVE.AposGlory.incipit	…
ltx/en_us_goadedes/me.m11.d07:alt1.meVE.AposGlory.melody	
ltx/en_us_goadedes/me.m11.d07:alt1.meVE.AposGlory.mode	@ltx/en_us_goadedes/miscellanea:misc.Mode4
ltx/en_us_goadedes/me.m11.d07:alt1.meVE.AposGlory.text	
ltx/en_us_goadedes/me.m11.d07:alt1.meVE.Aposticha1.greekmelody	@ltx/en_us_goadedes/he.a.m2:heAU.OikosTouEfratha.greekname
ltx/en_us_goadedes/me.m11.d07:alt1.meVE.Aposticha1.incipit	…
ltx/en_us_goadedes/me.m11.d07:alt1.meVE.Aposticha1.melody	@ltx/en_us_goadedes/he.a.m2:heAU.OikosTouEfratha.name
ltx/en_us_goadedes/me.m11.d07:alt1.meVE.Aposticha1.mode	@ltx/en_us_goadedes/miscellanea:misc.Mode2
ltx/en_us_goadedes/me.m11.d07:alt1.meVE.Aposticha1.text	
ltx/en_us_goadedes/me.m11.d07:alt1.meVE.Aposticha2.incipit	…
ltx/en_us_goadedes/me.m11.d07:alt1.meVE.Aposticha2.melody	@ltx/en_us_goadedes/he.a.m2:heAU.OikosTouEfratha.name
ltx/en_us_goadedes/me.m11.d07:alt1.meVE.Aposticha2.mode	@ltx/en_us_goadedes/miscellanea:misc.Mode2
ltx/en_us_goadedes/me.m11.d07:alt1.meVE.Aposticha2.text	
ltx/en_us_goadedes/me.m11.d07:alt1.meVE.Aposticha3.incipit	…
ltx/en_us_goadedes/me.m11.d07:alt1.meVE.Aposticha3.melody	@ltx/en_us_goadedes/he.a.m2:heAU.OikosTouEfratha.name
ltx/en_us_goadedes/me.m11.d07:alt1.meVE.Aposticha3.mode	@ltx/en_us_goadedes/miscellanea:misc.Mode2
ltx/en_us_goadedes/me.m11.d07:alt1.meVE.Aposticha3.text	
ltx/en_us_goadedes/me.m11.d07:alt1.meVE.LityGlory.incipit	…
ltx/en_us_goadedes/me.m11.d07:alt1.meVE.LityGlory.melody	
ltx/en_us_goadedes/me.m11.d07:alt1.meVE.LityGlory.mode	@ltx/en_us_goadedes/miscellanea:misc.Mode5
ltx/en_us_goadedes/me.m11.d07:alt1.meVE.LityGlory.text	
ltx/en_us_goadedes/me.m11.d07:alt1.meVE.SticGlory.incipit	…
ltx/en_us_goadedes/me.m11.d07:alt1.meVE.SticGlory.melody	
ltx/en_us_goadedes/me.m11.d07:alt1.meVE.SticGlory.mode	@ltx/en_us_goadedes/miscellanea:misc.Mode6
ltx/en_us_goadedes/me.m11.d07:alt1.meVE.SticGlory.text	
ltx/en_us_goadedes/me.m11.d07:alt1.meVE.Stichera01.greekmelody	@ltx/en_us_goadedes/he.a.m1:heAU.OTouParadoxouThavmatos.greekname
ltx/en_us_goadedes/me.m11.d07:alt1.meVE.Stichera01.incipit	…
ltx/en_us_goadedes/me.m11.d07:alt1.meVE.Stichera01.melody	@ltx/en_us_goadedes/he.a.m1:heAU.OTouParadoxouThavmatos.name
ltx/en_us_goadedes/me.m11.d07:alt1.meVE.Stichera01.mode	@ltx/en_us_goadedes/miscellanea:misc.Mode1
ltx/en_us_goadedes/me.m11.d07:alt1.meVE.Stichera01.text	
ltx/en_us_goadedes/me.m11.d07:alt1.meVE.Stichera02.incipit	…
ltx/en_us_goadedes/me.m11.d07:alt1.meVE.Stichera02.melody	@ltx/en_us_goadedes/he.a.m1:heAU.OTouParadoxouThavmatos.name
ltx/en_us_goadedes/me.m11.d07:alt1.meVE.Stichera02.mode	@ltx/en_us_goadedes/miscellanea:misc.Mode1
ltx/en_us_goadedes/me.m11.d07:alt1.meVE.Stichera02.text	
ltx/en_us_goadedes/me.m11.d07:alt1.meVE.Stichera03.incipit	…
ltx/en_us_goadedes/me.m11.d07:alt1.meVE.Stichera03.melody	@ltx/en_us_goadedes/he.a.m1:heAU.OTouParadoxouThavmatos.name
ltx/en_us_goadedes/me.m11.d07:alt1.meVE.Stichera03.mode	@ltx/en_us_goadedes/miscellanea:misc.Mode1
ltx/en_us_goadedes/me.m11.d07:alt1.meVE.Stichera03.text	
ltx/en_us_goadedes/me.m11.d07:meDA.commemoration.first	
ltx/en_us_goadedes/me.m11.d07:meDA.commemoration.first_name	
ltx/en_us_goadedes/me.m11.d07:meDA.commemoration.first_short	
ltx/en_us_goadedes/me.m11.d07:meDA.commemoration.first_title	@ltx/en_us_goadedes/titles:ti.Martyrs
ltx/en_us_goadedes/me.m11.d07:meDA.commemoration.full	
ltx/en_us_goadedes/me.m11.d07:meDA.commemoration.second_name	
ltx/en_us_goadedes/me.m11.d07:meDA.commemoration.second_title	For St. Lazarus.
ltx/en_us_goadedes/me.m11.d07:meDA.date	
ltx/en_us_goadedes/me.m11.d07:meDA.fordate	
ltx/en_us_goadedes/me.m11.d07:meDA.insert1	
ltx/en_us_goadedes/me.m11.d07:meDA.insert2	
ltx/en_us_goadedes/me.m11.d07:meDA.note	
ltx/en_us_goadedes/me.m11.d07:meDA.pdfcoverdate	
ltx/en_us_goadedes/me.m11.d07:meDA.pdfheaderdate	
ltx/en_us_goadedes/me.m11.d07:meHO.commemorations	
ltx/en_us_goadedes/me.m11.d07:meHO.note1	
ltx/en_us_goadedes/me.m11.d07:meHO.note2	
ltx/en_us_goadedes/me.m11.d07:meHO.number	
ltx/en_us_goadedes/me.m11.d07:meHO.rank	
ltx/en_us_goadedes/me.m11.d07:meLE.commemoration1	
ltx/en_us_goadedes/me.m11.d07:meLE.commemoration2	
ltx/en_us_goadedes/me.m11.d07:meLI.Kontakion1.greekmelody	@ltx/en_us_goadedes/me.m11.d07:meMA.Kontakion1.greekmelody
ltx/en_us_goadedes/me.m11.d07:meLI.Kontakion1.incipit	@ltx/en_us_goadedes/me.m11.d07:meMA.Kontakion1.incipit
ltx/en_us_goadedes/me.m11.d07:meLI.Kontakion1.melody	@ltx/en_us_goadedes/me.m11.d07:meMA.Kontakion1.melody
ltx/en_us_goadedes/me.m11.d07:meLI.Kontakion1.mode	@ltx/en_us_goadedes/me.m11.d07:meMA.Kontakion1.mode
ltx/en_us_goadedes/me.m11.d07:meLI.Kontakion1.text	@ltx/en_us_goadedes/me.m11.d07:meMA.Kontakion1.text
ltx/en_us_goadedes/me.m11.d07:meLI.Megalynarion.text	
ltx/en_us_goadedes/me.m11.d07:meMA.C1.acrostic.notice1	
ltx/en_us_goadedes/me.m11.d07:meMA.C1.acrostic.text	
ltx/en_us_goadedes/me.m11.d07:meMA.C1.acrostic.title	
ltx/en_us_goadedes/me.m11.d07:meMA.C1.poet	@ltx/en_us_goadedes/poets:po.IoannouMonachou
ltx/en_us_goadedes/me.m11.d07:meMA.C1.title	@ltx/en_us_goadedes/titles:ti.CanonMartyrs
ltx/en_us_goadedes/me.m11.d07:meMA.C1.verse	@ltx/en_us_goadedes/prayers:pr.verse_SaintsM.text
ltx/en_us_goadedes/me.m11.d07:meMA.C2.acrostic.notice1	
ltx/en_us_goadedes/me.m11.d07:meMA.C2.acrostic.text	
ltx/en_us_goadedes/me.m11.d07:meMA.C2.acrostic.title	
ltx/en_us_goadedes/me.m11.d07:meMA.C2.title	@ltx/en_us_goadedes/titles:ti.CanonDevoutM
ltx/en_us_goadedes/me.m11.d07:meMA.C2.verse	@ltx/en_us_goadedes/prayers:pr.verse_DevoutMan.text
ltx/en_us_goadedes/me.m11.d07:meMA.ExapTheotokion.incipit	…
ltx/en_us_goadedes/me.m11.d07:meMA.ExapTheotokion.melody	@ltx/en_us_goadedes/he.a.m2:heAU.ToisMathitaisSynelthomen.name
ltx/en_us_goadedes/me.m11.d07:meMA.ExapTheotokion.mode	@ltx/en_us_goadedes/miscellanea:misc.Mode2
ltx/en_us_goadedes/me.m11.d07:meMA.ExapTheotokion.text	
ltx/en_us_goadedes/me.m11.d07:meMA.Exaposteilarion1.greekmelody	@ltx/en_us_goadedes/he.a.m2:heAU.GynaikesAkoutisthite.greekname
ltx/en_us_goadedes/me.m11.d07:meMA.Exaposteilarion1.incipit	…
ltx/en_us_goadedes/me.m11.d07:meMA.Exaposteilarion1.melody	@ltx/en_us_goadedes/he.a.m2:heAU.GynaikesAkoutisthite.name
ltx/en_us_goadedes/me.m11.d07:meMA.Exaposteilarion1.mode	@ltx/en_us_goadedes/miscellanea:misc.Mode2
ltx/en_us_goadedes/me.m11.d07:meMA.Exaposteilarion1.text	
ltx/en_us_goadedes/me.m11.d07:meMA.Exaposteilarion2.greekmelody	@ltx/en_us_goadedes/he.a.m2:heAU.ToisMathitaisSynelthomen.greekname
ltx/en_us_goadedes/me.m11.d07:meMA.Exaposteilarion2.incipit	…
ltx/en_us_goadedes/me.m11.d07:meMA.Exaposteilarion2.melody	@ltx/en_us_goadedes/he.a.m2:heAU.ToisMathitaisSynelthomen.name
ltx/en_us_goadedes/me.m11.d07:meMA.Exaposteilarion2.mode	@ltx/en_us_goadedes/miscellanea:misc.Mode2
ltx/en_us_goadedes/me.m11.d07:meMA.Exaposteilarion2.text	
ltx/en_us_goadedes/me.m11.d07:meMA.Kontakion1.greekmelody	@ltx/en_us_goadedes/he.a.m4:heAU.OYpsotheisEnToStavro.greekname
ltx/en_us_goadedes/me.m11.d07:meMA.Kontakion1.incipit	…
ltx/en_us_goadedes/me.m11.d07:meMA.Kontakion1.melody	@ltx/en_us_goadedes/he.a.m4:heAU.OYpsotheisEnToStavro.name
ltx/en_us_goadedes/me.m11.d07:meMA.Kontakion1.mode	@ltx/en_us_goadedes/miscellanea:misc.Mode4
ltx/en_us_goadedes/me.m11.d07:meMA.Kontakion1.text	
ltx/en_us_goadedes/me.m11.d07:meMA.Kontakion2.greekmelody	@ltx/en_us_goadedes/he.a.m8:heAU.TiYpermacho.greekname
ltx/en_us_goadedes/me.m11.d07:meMA.Kontakion2.incipit	…
ltx/en_us_goadedes/me.m11.d07:meMA.Kontakion2.melody	@ltx/en_us_goadedes/he.a.m8:heAU.TiYpermacho.name
ltx/en_us_goadedes/me.m11.d07:meMA.Kontakion2.mode	@ltx/en_us_goadedes/miscellanea:misc.Mode8
ltx/en_us_goadedes/me.m11.d07:meMA.Kontakion2.text	
ltx/en_us_goadedes/me.m11.d07:meMA.Lauds1.greekmelody	@ltx/en_us_goadedes/he.a.m4:heAU.OExYpsistouKlitheis.greekname
ltx/en_us_goadedes/me.m11.d07:meMA.Lauds1.incipit	…
ltx/en_us_goadedes/me.m11.d07:meMA.Lauds1.melody	@ltx/en_us_goadedes/he.a.m4:heAU.OExYpsistouKlitheis.name
ltx/en_us_goadedes/me.m11.d07:meMA.Lauds1.mode	@ltx/en_us_goadedes/miscellanea:misc.Mode4
ltx/en_us_goadedes/me.m11.d07:meMA.Lauds1.text	
ltx/en_us_goadedes/me.m11.d07:meMA.Lauds2.incipit	…
ltx/en_us_goadedes/me.m11.d07:meMA.Lauds2.melody	@ltx/en_us_goadedes/he.a.m4:heAU.OExYpsistouKlitheis.name
ltx/en_us_goadedes/me.m11.d07:meMA.Lauds2.mode	@ltx/en_us_goadedes/miscellanea:misc.Mode4
ltx/en_us_goadedes/me.m11.d07:meMA.Lauds2.text	
ltx/en_us_goadedes/me.m11.d07:meMA.Lauds3.incipit	…
ltx/en_us_goadedes/me.m11.d07:meMA.Lauds3.melody	@ltx/en_us_goadedes/he.a.m4:heAU.OExYpsistouKlitheis.name
ltx/en_us_goadedes/me.m11.d07:meMA.Lauds3.mode	@ltx/en_us_goadedes/miscellanea:misc.Mode4
ltx/en_us_goadedes/me.m11.d07:meMA.Lauds3.text	
ltx/en_us_goadedes/me.m11.d07:meMA.LaudsGlory.incipit	@ltx/en_us_goadedes/me.m01.d15:meVE.AposGlory.incipit
ltx/en_us_goadedes/me.m11.d07:meMA.LaudsGlory.melody	
ltx/en_us_goadedes/me.m11.d07:meMA.LaudsGlory.mode	@ltx/en_us_goadedes/miscellanea:misc.Mode6
ltx/en_us_goadedes/me.m11.d07:meMA.LaudsGlory.text	@ltx/en_us_goadedes/me.m01.d15:meVE.AposGlory.text
ltx/en_us_goadedes/me.m11.d07:meMA.LaudsStavrotheotokion.greekmelody	@ltx/en_us_goadedes/he.a.m6:heAU.TriimerosAnestis.greekname
ltx/en_us_goadedes/me.m11.d07:meMA.LaudsStavrotheotokion.incipit	@ltx/en_us_goadedes/oc.m6.d4:ocMA.AposTheotokion.incipit
ltx/en_us_goadedes/me.m11.d07:meMA.LaudsStavrotheotokion.melody	@ltx/en_us_goadedes/he.a.m6:heAU.TriimerosAnestis.name
ltx/en_us_goadedes/me.m11.d07:meMA.LaudsStavrotheotokion.mode	@ltx/en_us_goadedes/miscellanea:misc.Mode6
ltx/en_us_goadedes/me.m11.d07:meMA.LaudsStavrotheotokion.text	@ltx/en_us_goadedes/oc.m6.d4:ocMA.AposTheotokion.text
ltx/en_us_goadedes/me.m11.d07:meMA.LaudsTheotokion.incipit	@ltx/en_us_goadedes/oc.m6.d3:ocVE.AposTheotokion.incipit
ltx/en_us_goadedes/me.m11.d07:meMA.LaudsTheotokion.melody	
ltx/en_us_goadedes/me.m11.d07:meMA.LaudsTheotokion.mode	@ltx/en_us_goadedes/miscellanea:misc.Mode6
ltx/en_us_goadedes/me.m11.d07:meMA.LaudsTheotokion.text	@ltx/en_us_goadedes/oc.m6.d3:ocVE.AposTheotokion.text
ltx/en_us_goadedes/me.m11.d07:meMA.MM.Lauds1123as5678.text	@ltx/en_us_goadedes/properties:media.key
ltx/en_us_goadedes/me.m11.d07:meMA.Ode1C11.greekmelody	@ltx/en_us_goadedes/he.h.m2:heHE.DefteLaoi.greekname
ltx/en_us_goadedes/me.m11.d07:meMA.Ode1C11.incipit	…
ltx/en_us_goadedes/me.m11.d07:meMA.Ode1C11.melody	@ltx/en_us_goadedes/he.h.m2:heHE.DefteLaoi.name
ltx/en_us_goadedes/me.m11.d07:meMA.Ode1C11.mode	@ltx/en_us_goadedes/miscellanea:misc.Mode2
ltx/en_us_goadedes/me.m11.d07:meMA.Ode1C11.ode	@ltx/en_us_goadedes/miscellanea:misc.Ode1
ltx/en_us_goadedes/me.m11.d07:meMA.Ode1C11.text	
ltx/en_us_goadedes/me.m11.d07:meMA.Ode1C12.incipit	…
ltx/en_us_goadedes/me.m11.d07:meMA.Ode1C12.melody	@ltx/en_us_goadedes/he.h.m2:heHE.DefteLaoi.name
ltx/en_us_goadedes/me.m11.d07:meMA.Ode1C12.mode	@ltx/en_us_goadedes/miscellanea:misc.Mode2
ltx/en_us_goadedes/me.m11.d07:meMA.Ode1C12.ode	@ltx/en_us_goadedes/miscellanea:misc.Ode1
ltx/en_us_goadedes/me.m11.d07:meMA.Ode1C12.text	
ltx/en_us_goadedes/me.m11.d07:meMA.Ode1C13.incipit	…
ltx/en_us_goadedes/me.m11.d07:meMA.Ode1C13.melody	@ltx/en_us_goadedes/he.h.m2:heHE.DefteLaoi.name
ltx/en_us_goadedes/me.m11.d07:meMA.Ode1C13.mode	@ltx/en_us_goadedes/miscellanea:misc.Mode2
ltx/en_us_goadedes/me.m11.d07:meMA.Ode1C13.ode	@ltx/en_us_goadedes/miscellanea:misc.Ode1
ltx/en_us_goadedes/me.m11.d07:meMA.Ode1C13.text	
ltx/en_us_goadedes/me.m11.d07:meMA.Ode1C1T.incipit	…
ltx/en_us_goadedes/me.m11.d07:meMA.Ode1C1T.melody	@ltx/en_us_goadedes/he.h.m2:heHE.DefteLaoi.name
ltx/en_us_goadedes/me.m11.d07:meMA.Ode1C1T.mode	@ltx/en_us_goadedes/miscellanea:misc.Mode2
ltx/en_us_goadedes/me.m11.d07:meMA.Ode1C1T.ode	@ltx/en_us_goadedes/miscellanea:misc.Ode1
ltx/en_us_goadedes/me.m11.d07:meMA.Ode1C1T.text	
ltx/en_us_goadedes/me.m11.d07:meMA.Ode1C21.greekmelody	@ltx/en_us_goadedes/he.h.m4:heHE.AnoixoToStomaMou.greekname
ltx/en_us_goadedes/me.m11.d07:meMA.Ode1C21.incipit	…
ltx/en_us_goadedes/me.m11.d07:meMA.Ode1C21.melody	@ltx/en_us_goadedes/he.h.m4:heHE.AnoixoToStomaMou.name
ltx/en_us_goadedes/me.m11.d07:meMA.Ode1C21.mode	@ltx/en_us_goadedes/miscellanea:misc.Mode4
ltx/en_us_goadedes/me.m11.d07:meMA.Ode1C21.ode	@ltx/en_us_goadedes/miscellanea:misc.Ode1
ltx/en_us_goadedes/me.m11.d07:meMA.Ode1C21.text	
ltx/en_us_goadedes/me.m11.d07:meMA.Ode1C22.incipit	…
ltx/en_us_goadedes/me.m11.d07:meMA.Ode1C22.melody	@ltx/en_us_goadedes/he.h.m4:heHE.AnoixoToStomaMou.name
ltx/en_us_goadedes/me.m11.d07:meMA.Ode1C22.mode	@ltx/en_us_goadedes/miscellanea:misc.Mode4
ltx/en_us_goadedes/me.m11.d07:meMA.Ode1C22.ode	@ltx/en_us_goadedes/miscellanea:misc.Ode1
ltx/en_us_goadedes/me.m11.d07:meMA.Ode1C22.text	
ltx/en_us_goadedes/me.m11.d07:meMA.Ode1C23.incipit	…
ltx/en_us_goadedes/me.m11.d07:meMA.Ode1C23.melody	@ltx/en_us_goadedes/he.h.m4:heHE.AnoixoToStomaMou.name
ltx/en_us_goadedes/me.m11.d07:meMA.Ode1C23.mode	@ltx/en_us_goadedes/miscellanea:misc.Mode4
ltx/en_us_goadedes/me.m11.d07:meMA.Ode1C23.ode	@ltx/en_us_goadedes/miscellanea:misc.Ode1
ltx/en_us_goadedes/me.m11.d07:meMA.Ode1C23.text	
ltx/en_us_goadedes/me.m11.d07:meMA.Ode1C2T.incipit	…
ltx/en_us_goadedes/me.m11.d07:meMA.Ode1C2T.melody	@ltx/en_us_goadedes/he.h.m4:heHE.AnoixoToStomaMou.name
ltx/en_us_goadedes/me.m11.d07:meMA.Ode1C2T.mode	@ltx/en_us_goadedes/miscellanea:misc.Mode4
ltx/en_us_goadedes/me.m11.d07:meMA.Ode1C2T.ode	@ltx/en_us_goadedes/miscellanea:misc.Ode1
ltx/en_us_goadedes/me.m11.d07:meMA.Ode1C2T.text	
ltx/en_us_goadedes/me.m11.d07:meMA.Ode3C11.greekmelody	@ltx/en_us_goadedes/he.h.m2:heHE.EnPetraMeTisPisteos.greekname
ltx/en_us_goadedes/me.m11.d07:meMA.Ode3C11.incipit	…
ltx/en_us_goadedes/me.m11.d07:meMA.Ode3C11.melody	@ltx/en_us_goadedes/he.h.m2:heHE.EnPetraMeTisPisteos.name
ltx/en_us_goadedes/me.m11.d07:meMA.Ode3C11.mode	@ltx/en_us_goadedes/miscellanea:misc.Mode2
ltx/en_us_goadedes/me.m11.d07:meMA.Ode3C11.ode	@ltx/en_us_goadedes/miscellanea:misc.Ode3
ltx/en_us_goadedes/me.m11.d07:meMA.Ode3C11.text	
ltx/en_us_goadedes/me.m11.d07:meMA.Ode3C12.incipit	…
ltx/en_us_goadedes/me.m11.d07:meMA.Ode3C12.melody	@ltx/en_us_goadedes/he.h.m2:heHE.EnPetraMeTisPisteos.name
ltx/en_us_goadedes/me.m11.d07:meMA.Ode3C12.mode	@ltx/en_us_goadedes/miscellanea:misc.Mode2
ltx/en_us_goadedes/me.m11.d07:meMA.Ode3C12.ode	@ltx/en_us_goadedes/miscellanea:misc.Ode3
ltx/en_us_goadedes/me.m11.d07:meMA.Ode3C12.text	
ltx/en_us_goadedes/me.m11.d07:meMA.Ode3C13.incipit	…
ltx/en_us_goadedes/me.m11.d07:meMA.Ode3C13.melody	@ltx/en_us_goadedes/he.h.m2:heHE.EnPetraMeTisPisteos.name
ltx/en_us_goadedes/me.m11.d07:meMA.Ode3C13.mode	@ltx/en_us_goadedes/miscellanea:misc.Mode2
ltx/en_us_goadedes/me.m11.d07:meMA.Ode3C13.ode	@ltx/en_us_goadedes/miscellanea:misc.Ode3
ltx/en_us_goadedes/me.m11.d07:meMA.Ode3C13.text	
ltx/en_us_goadedes/me.m11.d07:meMA.Ode3C1T.incipit	…
ltx/en_us_goadedes/me.m11.d07:meMA.Ode3C1T.melody	@ltx/en_us_goadedes/he.h.m2:heHE.EnPetraMeTisPisteos.name
ltx/en_us_goadedes/me.m11.d07:meMA.Ode3C1T.mode	@ltx/en_us_goadedes/miscellanea:misc.Mode2
ltx/en_us_goadedes/me.m11.d07:meMA.Ode3C1T.ode	@ltx/en_us_goadedes/miscellanea:misc.Ode3
ltx/en_us_goadedes/me.m11.d07:meMA.Ode3C1T.text	
ltx/en_us_goadedes/me.m11.d07:meMA.Ode3C21.greekmelody	@ltx/en_us_goadedes/he.h.m4:heHE.TousSousYmnologous.greekname
ltx/en_us_goadedes/me.m11.d07:meMA.Ode3C21.incipit	…
ltx/en_us_goadedes/me.m11.d07:meMA.Ode3C21.melody	@ltx/en_us_goadedes/he.h.m4:heHE.TousSousYmnologous.name
ltx/en_us_goadedes/me.m11.d07:meMA.Ode3C21.mode	@ltx/en_us_goadedes/miscellanea:misc.Mode4
ltx/en_us_goadedes/me.m11.d07:meMA.Ode3C21.ode	@ltx/en_us_goadedes/miscellanea:misc.Ode3
ltx/en_us_goadedes/me.m11.d07:meMA.Ode3C21.text	
ltx/en_us_goadedes/me.m11.d07:meMA.Ode3C22.incipit	…
ltx/en_us_goadedes/me.m11.d07:meMA.Ode3C22.melody	@ltx/en_us_goadedes/he.h.m4:heHE.TousSousYmnologous.name
ltx/en_us_goadedes/me.m11.d07:meMA.Ode3C22.mode	@ltx/en_us_goadedes/miscellanea:misc.Mode4
ltx/en_us_goadedes/me.m11.d07:meMA.Ode3C22.ode	@ltx/en_us_goadedes/miscellanea:misc.Ode3
ltx/en_us_goadedes/me.m11.d07:meMA.Ode3C22.text	
ltx/en_us_goadedes/me.m11.d07:meMA.Ode3C2T.incipit	…
ltx/en_us_goadedes/me.m11.d07:meMA.Ode3C2T.melody	@ltx/en_us_goadedes/he.h.m4:heHE.TousSousYmnologous.name
ltx/en_us_goadedes/me.m11.d07:meMA.Ode3C2T.mode	@ltx/en_us_goadedes/miscellanea:misc.Mode4
ltx/en_us_goadedes/me.m11.d07:meMA.Ode3C2T.ode	@ltx/en_us_goadedes/miscellanea:misc.Ode3
ltx/en_us_goadedes/me.m11.d07:meMA.Ode3C2T.text	
ltx/en_us_goadedes/me.m11.d07:meMA.Ode3H.greekmelody	@ltx/en_us_goadedes/he.h.m4:heHE.TousSousYmnologous.greekname
ltx/en_us_goadedes/me.m11.d07:meMA.Ode3H.incipit	@ltx/en_us_goadedes/he.h.m4:heHE.TousSousYmnologous.incipit
ltx/en_us_goadedes/me.m11.d07:meMA.Ode3H.melody	@ltx/en_us_goadedes/he.h.m4:heHE.TousSousYmnologous.melody
ltx/en_us_goadedes/me.m11.d07:meMA.Ode3H.mode	@ltx/en_us_goadedes/miscellanea:misc.Mode4
ltx/en_us_goadedes/me.m11.d07:meMA.Ode3H.ode	@ltx/en_us_goadedes/miscellanea:misc.Ode3
ltx/en_us_goadedes/me.m11.d07:meMA.Ode3H.text	@ltx/en_us_goadedes/he.h.m4:heHE.TousSousYmnologous.text
ltx/en_us_goadedes/me.m11.d07:meMA.Ode3Kathisma1.greekmelody	@ltx/en_us_goadedes/he.a.m4:heAU.TachyProkatalave.greekname
ltx/en_us_goadedes/me.m11.d07:meMA.Ode3Kathisma1.incipit	…
ltx/en_us_goadedes/me.m11.d07:meMA.Ode3Kathisma1.melody	@ltx/en_us_goadedes/he.a.m4:heAU.TachyProkatalave.name
ltx/en_us_goadedes/me.m11.d07:meMA.Ode3Kathisma1.mode	@ltx/en_us_goadedes/miscellanea:misc.Mode4
ltx/en_us_goadedes/me.m11.d07:meMA.Ode3Kathisma1.text	
ltx/en_us_goadedes/me.m11.d07:meMA.Ode3Kathisma2.greekmelody	@ltx/en_us_goadedes/he.a.m8:heAU.TinSofianKaiLogon.greekname
ltx/en_us_goadedes/me.m11.d07:meMA.Ode3Kathisma2.incipit	…
ltx/en_us_goadedes/me.m11.d07:meMA.Ode3Kathisma2.melody	@ltx/en_us_goadedes/he.a.m8:heAU.TinSofianKaiLogon.name
ltx/en_us_goadedes/me.m11.d07:meMA.Ode3Kathisma2.mode	@ltx/en_us_goadedes/miscellanea:misc.Mode8
ltx/en_us_goadedes/me.m11.d07:meMA.Ode3Kathisma2.text	
ltx/en_us_goadedes/me.m11.d07:meMA.Ode3KathismaSt.incipit	@ltx/en_us_goadedes/oc.m8.d4:ocMA.Kathisma13.incipit
ltx/en_us_goadedes/me.m11.d07:meMA.Ode3KathismaSt.melody	@ltx/en_us_goadedes/he.a.m8:heAU.TinSofianKaiLogon.name
ltx/en_us_goadedes/me.m11.d07:meMA.Ode3KathismaSt.mode	@ltx/en_us_goadedes/miscellanea:misc.Mode8
ltx/en_us_goadedes/me.m11.d07:meMA.Ode3KathismaSt.text	@ltx/en_us_goadedes/oc.m8.d4:ocMA.Kathisma13.text
ltx/en_us_goadedes/me.m11.d07:meMA.Ode3KathismaT.incipit	@ltx/en_us_goadedes/me.m06.d29:meMA.Kathisma2T.incipit
ltx/en_us_goadedes/me.m11.d07:meMA.Ode3KathismaT.melody	@ltx/en_us_goadedes/he.a.m8:heAU.TinSofianKaiLogon.name
ltx/en_us_goadedes/me.m11.d07:meMA.Ode3KathismaT.mode	@ltx/en_us_goadedes/miscellanea:misc.Mode8
ltx/en_us_goadedes/me.m11.d07:meMA.Ode3KathismaT.text	@ltx/en_us_goadedes/me.m06.d29:meMA.Kathisma2T.text
ltx/en_us_goadedes/me.m11.d07:meMA.Ode4C11.greekmelody	@ltx/en_us_goadedes/he.h.m2:heHE.EisakikoaKyrieTinAkoin.greekname
ltx/en_us_goadedes/me.m11.d07:meMA.Ode4C11.incipit	…
ltx/en_us_goadedes/me.m11.d07:meMA.Ode4C11.melody	@ltx/en_us_goadedes/he.h.m2:heHE.EisakikoaKyrieTinAkoin.name
ltx/en_us_goadedes/me.m11.d07:meMA.Ode4C11.mode	@ltx/en_us_goadedes/miscellanea:misc.Mode2
ltx/en_us_goadedes/me.m11.d07:meMA.Ode4C11.ode	@ltx/en_us_goadedes/miscellanea:misc.Ode4
ltx/en_us_goadedes/me.m11.d07:meMA.Ode4C11.text	
ltx/en_us_goadedes/me.m11.d07:meMA.Ode4C12.incipit	…
ltx/en_us_goadedes/me.m11.d07:meMA.Ode4C12.melody	@ltx/en_us_goadedes/he.h.m2:heHE.EisakikoaKyrieTinAkoin.name
ltx/en_us_goadedes/me.m11.d07:meMA.Ode4C12.mode	@ltx/en_us_goadedes/miscellanea:misc.Mode2
ltx/en_us_goadedes/me.m11.d07:meMA.Ode4C12.ode	@ltx/en_us_goadedes/miscellanea:misc.Ode4
ltx/en_us_goadedes/me.m11.d07:meMA.Ode4C12.text	
ltx/en_us_goadedes/me.m11.d07:meMA.Ode4C13.incipit	…
ltx/en_us_goadedes/me.m11.d07:meMA.Ode4C13.melody	@ltx/en_us_goadedes/he.h.m2:heHE.EisakikoaKyrieTinAkoin.name
ltx/en_us_goadedes/me.m11.d07:meMA.Ode4C13.mode	@ltx/en_us_goadedes/miscellanea:misc.Mode2
ltx/en_us_goadedes/me.m11.d07:meMA.Ode4C13.ode	@ltx/en_us_goadedes/miscellanea:misc.Ode4
ltx/en_us_goadedes/me.m11.d07:meMA.Ode4C13.text	
ltx/en_us_goadedes/me.m11.d07:meMA.Ode4C1T.incipit	…
ltx/en_us_goadedes/me.m11.d07:meMA.Ode4C1T.melody	@ltx/en_us_goadedes/he.h.m2:heHE.EisakikoaKyrieTinAkoin.name
ltx/en_us_goadedes/me.m11.d07:meMA.Ode4C1T.mode	@ltx/en_us_goadedes/miscellanea:misc.Mode2
ltx/en_us_goadedes/me.m11.d07:meMA.Ode4C1T.ode	@ltx/en_us_goadedes/miscellanea:misc.Ode4
ltx/en_us_goadedes/me.m11.d07:meMA.Ode4C1T.text	
ltx/en_us_goadedes/me.m11.d07:meMA.Ode4C21.greekmelody	@ltx/en_us_goadedes/he.h.m4:heHE.OKathimenosEnDoxi.greekname
ltx/en_us_goadedes/me.m11.d07:meMA.Ode4C21.incipit	…
ltx/en_us_goadedes/me.m11.d07:meMA.Ode4C21.melody	@ltx/en_us_goadedes/he.h.m4:heHE.OKathimenosEnDoxi.name
ltx/en_us_goadedes/me.m11.d07:meMA.Ode4C21.mode	@ltx/en_us_goadedes/miscellanea:misc.Mode4
ltx/en_us_goadedes/me.m11.d07:meMA.Ode4C21.ode	@ltx/en_us_goadedes/miscellanea:misc.Ode4
ltx/en_us_goadedes/me.m11.d07:meMA.Ode4C21.text	
ltx/en_us_goadedes/me.m11.d07:meMA.Ode4C22.incipit	…
ltx/en_us_goadedes/me.m11.d07:meMA.Ode4C22.melody	@ltx/en_us_goadedes/he.h.m4:heHE.OKathimenosEnDoxi.name
ltx/en_us_goadedes/me.m11.d07:meMA.Ode4C22.mode	@ltx/en_us_goadedes/miscellanea:misc.Mode4
ltx/en_us_goadedes/me.m11.d07:meMA.Ode4C22.ode	@ltx/en_us_goadedes/miscellanea:misc.Ode4
ltx/en_us_goadedes/me.m11.d07:meMA.Ode4C22.text	
ltx/en_us_goadedes/me.m11.d07:meMA.Ode4C23.incipit	…
ltx/en_us_goadedes/me.m11.d07:meMA.Ode4C23.melody	@ltx/en_us_goadedes/he.h.m4:heHE.OKathimenosEnDoxi.name
ltx/en_us_goadedes/me.m11.d07:meMA.Ode4C23.mode	@ltx/en_us_goadedes/miscellanea:misc.Mode4
ltx/en_us_goadedes/me.m11.d07:meMA.Ode4C23.ode	@ltx/en_us_goadedes/miscellanea:misc.Ode4
ltx/en_us_goadedes/me.m11.d07:meMA.Ode4C23.text	
ltx/en_us_goadedes/me.m11.d07:meMA.Ode4C2T.incipit	…
ltx/en_us_goadedes/me.m11.d07:meMA.Ode4C2T.melody	@ltx/en_us_goadedes/he.h.m4:heHE.OKathimenosEnDoxi.name
ltx/en_us_goadedes/me.m11.d07:meMA.Ode4C2T.mode	@ltx/en_us_goadedes/miscellanea:misc.Mode4
ltx/en_us_goadedes/me.m11.d07:meMA.Ode4C2T.ode	@ltx/en_us_goadedes/miscellanea:misc.Ode4
ltx/en_us_goadedes/me.m11.d07:meMA.Ode4C2T.text	
ltx/en_us_goadedes/me.m11.d07:meMA.Ode5C11.greekmelody	@ltx/en_us_goadedes/he.h.m2:heHE.OTouFotosChorigos.greekname
ltx/en_us_goadedes/me.m11.d07:meMA.Ode5C11.incipit	…
ltx/en_us_goadedes/me.m11.d07:meMA.Ode5C11.melody	@ltx/en_us_goadedes/he.h.m2:heHE.OTouFotosChorigos.name
ltx/en_us_goadedes/me.m11.d07:meMA.Ode5C11.mode	@ltx/en_us_goadedes/miscellanea:misc.Mode2
ltx/en_us_goadedes/me.m11.d07:meMA.Ode5C11.ode	@ltx/en_us_goadedes/miscellanea:misc.Ode5
ltx/en_us_goadedes/me.m11.d07:meMA.Ode5C11.text	
ltx/en_us_goadedes/me.m11.d07:meMA.Ode5C12.incipit	…
ltx/en_us_goadedes/me.m11.d07:meMA.Ode5C12.melody	@ltx/en_us_goadedes/he.h.m2:heHE.OTouFotosChorigos.name
ltx/en_us_goadedes/me.m11.d07:meMA.Ode5C12.mode	@ltx/en_us_goadedes/miscellanea:misc.Mode2
ltx/en_us_goadedes/me.m11.d07:meMA.Ode5C12.ode	@ltx/en_us_goadedes/miscellanea:misc.Ode5
ltx/en_us_goadedes/me.m11.d07:meMA.Ode5C12.text	
ltx/en_us_goadedes/me.m11.d07:meMA.Ode5C13.incipit	…
ltx/en_us_goadedes/me.m11.d07:meMA.Ode5C13.melody	@ltx/en_us_goadedes/he.h.m2:heHE.OTouFotosChorigos.name
ltx/en_us_goadedes/me.m11.d07:meMA.Ode5C13.mode	@ltx/en_us_goadedes/miscellanea:misc.Mode2
ltx/en_us_goadedes/me.m11.d07:meMA.Ode5C13.ode	@ltx/en_us_goadedes/miscellanea:misc.Ode5
ltx/en_us_goadedes/me.m11.d07:meMA.Ode5C13.text	
ltx/en_us_goadedes/me.m11.d07:meMA.Ode5C1T.incipit	…
ltx/en_us_goadedes/me.m11.d07:meMA.Ode5C1T.melody	@ltx/en_us_goadedes/he.h.m2:heHE.OTouFotosChorigos.name
ltx/en_us_goadedes/me.m11.d07:meMA.Ode5C1T.mode	@ltx/en_us_goadedes/miscellanea:misc.Mode2
ltx/en_us_goadedes/me.m11.d07:meMA.Ode5C1T.ode	@ltx/en_us_goadedes/miscellanea:misc.Ode5
ltx/en_us_goadedes/me.m11.d07:meMA.Ode5C1T.text	
ltx/en_us_goadedes/me.m11.d07:meMA.Ode5C21.greekmelody	@ltx/en_us_goadedes/he.h.m4:heHE.ExestiTaSympanta.greekname
ltx/en_us_goadedes/me.m11.d07:meMA.Ode5C21.incipit	…
ltx/en_us_goadedes/me.m11.d07:meMA.Ode5C21.melody	@ltx/en_us_goadedes/he.h.m4:heHE.ExestiTaSympanta.name
ltx/en_us_goadedes/me.m11.d07:meMA.Ode5C21.mode	@ltx/en_us_goadedes/miscellanea:misc.Mode4
ltx/en_us_goadedes/me.m11.d07:meMA.Ode5C21.ode	@ltx/en_us_goadedes/miscellanea:misc.Ode5
ltx/en_us_goadedes/me.m11.d07:meMA.Ode5C21.text	
ltx/en_us_goadedes/me.m11.d07:meMA.Ode5C22.incipit	…
ltx/en_us_goadedes/me.m11.d07:meMA.Ode5C22.melody	@ltx/en_us_goadedes/he.h.m4:heHE.ExestiTaSympanta.name
ltx/en_us_goadedes/me.m11.d07:meMA.Ode5C22.mode	@ltx/en_us_goadedes/miscellanea:misc.Mode4
ltx/en_us_goadedes/me.m11.d07:meMA.Ode5C22.ode	@ltx/en_us_goadedes/miscellanea:misc.Ode5
ltx/en_us_goadedes/me.m11.d07:meMA.Ode5C22.text	
ltx/en_us_goadedes/me.m11.d07:meMA.Ode5C23.incipit	…
ltx/en_us_goadedes/me.m11.d07:meMA.Ode5C23.melody	@ltx/en_us_goadedes/he.h.m4:heHE.ExestiTaSympanta.name
ltx/en_us_goadedes/me.m11.d07:meMA.Ode5C23.mode	@ltx/en_us_goadedes/miscellanea:misc.Mode4
ltx/en_us_goadedes/me.m11.d07:meMA.Ode5C23.ode	@ltx/en_us_goadedes/miscellanea:misc.Ode5
ltx/en_us_goadedes/me.m11.d07:meMA.Ode5C23.text	
ltx/en_us_goadedes/me.m11.d07:meMA.Ode5C2T.incipit	…
ltx/en_us_goadedes/me.m11.d07:meMA.Ode5C2T.melody	@ltx/en_us_goadedes/he.h.m4:heHE.ExestiTaSympanta.name
ltx/en_us_goadedes/me.m11.d07:meMA.Ode5C2T.mode	@ltx/en_us_goadedes/miscellanea:misc.Mode4
ltx/en_us_goadedes/me.m11.d07:meMA.Ode5C2T.ode	@ltx/en_us_goadedes/miscellanea:misc.Ode5
ltx/en_us_goadedes/me.m11.d07:meMA.Ode5C2T.text	
ltx/en_us_goadedes/me.m11.d07:meMA.Ode6C11.greekmelody	@ltx/en_us_goadedes/he.h.m2:heHE.AvyssosAmartimaton.greekname
ltx/en_us_goadedes/me.m11.d07:meMA.Ode6C11.incipit	…
ltx/en_us_goadedes/me.m11.d07:meMA.Ode6C11.melody	@ltx/en_us_goadedes/he.h.m2:heHE.AvyssosAmartimaton.name
ltx/en_us_goadedes/me.m11.d07:meMA.Ode6C11.mode	@ltx/en_us_goadedes/miscellanea:misc.Mode2
ltx/en_us_goadedes/me.m11.d07:meMA.Ode6C11.ode	@ltx/en_us_goadedes/miscellanea:misc.Ode6
ltx/en_us_goadedes/me.m11.d07:meMA.Ode6C11.text	
ltx/en_us_goadedes/me.m11.d07:meMA.Ode6C12.incipit	…
ltx/en_us_goadedes/me.m11.d07:meMA.Ode6C12.melody	@ltx/en_us_goadedes/he.h.m2:heHE.AvyssosAmartimaton.name
ltx/en_us_goadedes/me.m11.d07:meMA.Ode6C12.mode	@ltx/en_us_goadedes/miscellanea:misc.Mode2
ltx/en_us_goadedes/me.m11.d07:meMA.Ode6C12.ode	@ltx/en_us_goadedes/miscellanea:misc.Ode6
ltx/en_us_goadedes/me.m11.d07:meMA.Ode6C12.text	
ltx/en_us_goadedes/me.m11.d07:meMA.Ode6C13.incipit	…
ltx/en_us_goadedes/me.m11.d07:meMA.Ode6C13.melody	@ltx/en_us_goadedes/he.h.m2:heHE.AvyssosAmartimaton.name
ltx/en_us_goadedes/me.m11.d07:meMA.Ode6C13.mode	@ltx/en_us_goadedes/miscellanea:misc.Mode2
ltx/en_us_goadedes/me.m11.d07:meMA.Ode6C13.ode	@ltx/en_us_goadedes/miscellanea:misc.Ode6
ltx/en_us_goadedes/me.m11.d07:meMA.Ode6C13.text	
ltx/en_us_goadedes/me.m11.d07:meMA.Ode6C1T.incipit	…
ltx/en_us_goadedes/me.m11.d07:meMA.Ode6C1T.melody	@ltx/en_us_goadedes/he.h.m2:heHE.AvyssosAmartimaton.name
ltx/en_us_goadedes/me.m11.d07:meMA.Ode6C1T.mode	@ltx/en_us_goadedes/miscellanea:misc.Mode2
ltx/en_us_goadedes/me.m11.d07:meMA.Ode6C1T.ode	@ltx/en_us_goadedes/miscellanea:misc.Ode6
ltx/en_us_goadedes/me.m11.d07:meMA.Ode6C1T.text	
ltx/en_us_goadedes/me.m11.d07:meMA.Ode6C21.greekmelody	@ltx/en_us_goadedes/he.h.m4:heHE.TinTheianTaftin.greekname
ltx/en_us_goadedes/me.m11.d07:meMA.Ode6C21.incipit	…
ltx/en_us_goadedes/me.m11.d07:meMA.Ode6C21.melody	@ltx/en_us_goadedes/he.h.m4:heHE.TinTheianTaftin.name
ltx/en_us_goadedes/me.m11.d07:meMA.Ode6C21.mode	@ltx/en_us_goadedes/miscellanea:misc.Mode4
ltx/en_us_goadedes/me.m11.d07:meMA.Ode6C21.ode	@ltx/en_us_goadedes/miscellanea:misc.Ode6
ltx/en_us_goadedes/me.m11.d07:meMA.Ode6C21.text	
ltx/en_us_goadedes/me.m11.d07:meMA.Ode6C22.incipit	…
ltx/en_us_goadedes/me.m11.d07:meMA.Ode6C22.melody	@ltx/en_us_goadedes/he.h.m4:heHE.TinTheianTaftin.name
ltx/en_us_goadedes/me.m11.d07:meMA.Ode6C22.mode	@ltx/en_us_goadedes/miscellanea:misc.Mode4
ltx/en_us_goadedes/me.m11.d07:meMA.Ode6C22.ode	@ltx/en_us_goadedes/miscellanea:misc.Ode6
ltx/en_us_goadedes/me.m11.d07:meMA.Ode6C22.text	
ltx/en_us_goadedes/me.m11.d07:meMA.Ode6C23.incipit	…
ltx/en_us_goadedes/me.m11.d07:meMA.Ode6C23.melody	@ltx/en_us_goadedes/he.h.m4:heHE.TinTheianTaftin.name
ltx/en_us_goadedes/me.m11.d07:meMA.Ode6C23.mode	@ltx/en_us_goadedes/miscellanea:misc.Mode4
ltx/en_us_goadedes/me.m11.d07:meMA.Ode6C23.ode	@ltx/en_us_goadedes/miscellanea:misc.Ode6
ltx/en_us_goadedes/me.m11.d07:meMA.Ode6C23.text	
ltx/en_us_goadedes/me.m11.d07:meMA.Ode6C2T.incipit	…
ltx/en_us_goadedes/me.m11.d07:meMA.Ode6C2T.melody	@ltx/en_us_goadedes/he.h.m4:heHE.TinTheianTaftin.name
ltx/en_us_goadedes/me.m11.d07:meMA.Ode6C2T.mode	@ltx/en_us_goadedes/miscellanea:misc.Mode4
ltx/en_us_goadedes/me.m11.d07:meMA.Ode6C2T.ode	@ltx/en_us_goadedes/miscellanea:misc.Ode6
ltx/en_us_goadedes/me.m11.d07:meMA.Ode6C2T.text	
ltx/en_us_goadedes/me.m11.d07:meMA.Ode6H.greekmelody	@ltx/en_us_goadedes/he.h.m4:heHE.TinTheianTaftin.greekname
ltx/en_us_goadedes/me.m11.d07:meMA.Ode6H.incipit	@ltx/en_us_goadedes/he.h.m4:heHE.TinTheianTaftin.incipit
ltx/en_us_goadedes/me.m11.d07:meMA.Ode6H.melody	@ltx/en_us_goadedes/he.h.m4:heHE.TinTheianTaftin.melody
ltx/en_us_goadedes/me.m11.d07:meMA.Ode6H.mode	@ltx/en_us_goadedes/miscellanea:misc.Mode4
ltx/en_us_goadedes/me.m11.d07:meMA.Ode6H.ode	@ltx/en_us_goadedes/miscellanea:misc.Ode6
ltx/en_us_goadedes/me.m11.d07:meMA.Ode6H.text	@ltx/en_us_goadedes/he.h.m4:heHE.TinTheianTaftin.text
ltx/en_us_goadedes/me.m11.d07:meMA.Ode7C11.greekmelody	@ltx/en_us_goadedes/he.h.m2:heHE.EikonosChrysis.greekname
ltx/en_us_goadedes/me.m11.d07:meMA.Ode7C11.incipit	…
ltx/en_us_goadedes/me.m11.d07:meMA.Ode7C11.melody	@ltx/en_us_goadedes/he.h.m2:heHE.EikonosChrysis.name
ltx/en_us_goadedes/me.m11.d07:meMA.Ode7C11.mode	@ltx/en_us_goadedes/miscellanea:misc.Mode2
ltx/en_us_goadedes/me.m11.d07:meMA.Ode7C11.ode	@ltx/en_us_goadedes/miscellanea:misc.Ode7
ltx/en_us_goadedes/me.m11.d07:meMA.Ode7C11.text	
ltx/en_us_goadedes/me.m11.d07:meMA.Ode7C12.incipit	…
ltx/en_us_goadedes/me.m11.d07:meMA.Ode7C12.melody	@ltx/en_us_goadedes/he.h.m2:heHE.EikonosChrysis.name
ltx/en_us_goadedes/me.m11.d07:meMA.Ode7C12.mode	@ltx/en_us_goadedes/miscellanea:misc.Mode2
ltx/en_us_goadedes/me.m11.d07:meMA.Ode7C12.ode	@ltx/en_us_goadedes/miscellanea:misc.Ode7
ltx/en_us_goadedes/me.m11.d07:meMA.Ode7C12.text	
ltx/en_us_goadedes/me.m11.d07:meMA.Ode7C13.incipit	…
ltx/en_us_goadedes/me.m11.d07:meMA.Ode7C13.melody	@ltx/en_us_goadedes/he.h.m2:heHE.EikonosChrysis.name
ltx/en_us_goadedes/me.m11.d07:meMA.Ode7C13.mode	@ltx/en_us_goadedes/miscellanea:misc.Mode2
ltx/en_us_goadedes/me.m11.d07:meMA.Ode7C13.ode	@ltx/en_us_goadedes/miscellanea:misc.Ode7
ltx/en_us_goadedes/me.m11.d07:meMA.Ode7C13.text	
ltx/en_us_goadedes/me.m11.d07:meMA.Ode7C14.incipit	…
ltx/en_us_goadedes/me.m11.d07:meMA.Ode7C14.melody	@ltx/en_us_goadedes/he.h.m2:heHE.EikonosChrysis.name
ltx/en_us_goadedes/me.m11.d07:meMA.Ode7C14.mode	@ltx/en_us_goadedes/miscellanea:misc.Mode2
ltx/en_us_goadedes/me.m11.d07:meMA.Ode7C14.ode	@ltx/en_us_goadedes/miscellanea:misc.Ode7
ltx/en_us_goadedes/me.m11.d07:meMA.Ode7C14.text	
ltx/en_us_goadedes/me.m11.d07:meMA.Ode7C1T.incipit	…
ltx/en_us_goadedes/me.m11.d07:meMA.Ode7C1T.melody	@ltx/en_us_goadedes/he.h.m2:heHE.EikonosChrysis.name
ltx/en_us_goadedes/me.m11.d07:meMA.Ode7C1T.mode	@ltx/en_us_goadedes/miscellanea:misc.Mode2
ltx/en_us_goadedes/me.m11.d07:meMA.Ode7C1T.ode	@ltx/en_us_goadedes/miscellanea:misc.Ode7
ltx/en_us_goadedes/me.m11.d07:meMA.Ode7C1T.text	
ltx/en_us_goadedes/me.m11.d07:meMA.Ode7C21.greekmelody	@ltx/en_us_goadedes/he.h.m4:heHE.OukElatrefsan.greekname
ltx/en_us_goadedes/me.m11.d07:meMA.Ode7C21.incipit	…
ltx/en_us_goadedes/me.m11.d07:meMA.Ode7C21.melody	@ltx/en_us_goadedes/he.h.m4:heHE.OukElatrefsan.name
ltx/en_us_goadedes/me.m11.d07:meMA.Ode7C21.mode	@ltx/en_us_goadedes/miscellanea:misc.Mode4
ltx/en_us_goadedes/me.m11.d07:meMA.Ode7C21.ode	@ltx/en_us_goadedes/miscellanea:misc.Ode7
ltx/en_us_goadedes/me.m11.d07:meMA.Ode7C21.text	
ltx/en_us_goadedes/me.m11.d07:meMA.Ode7C22.incipit	…
ltx/en_us_goadedes/me.m11.d07:meMA.Ode7C22.melody	@ltx/en_us_goadedes/he.h.m4:heHE.OukElatrefsan.name
ltx/en_us_goadedes/me.m11.d07:meMA.Ode7C22.mode	@ltx/en_us_goadedes/miscellanea:misc.Mode4
ltx/en_us_goadedes/me.m11.d07:meMA.Ode7C22.ode	@ltx/en_us_goadedes/miscellanea:misc.Ode7
ltx/en_us_goadedes/me.m11.d07:meMA.Ode7C22.text	
ltx/en_us_goadedes/me.m11.d07:meMA.Ode7C23.incipit	…
ltx/en_us_goadedes/me.m11.d07:meMA.Ode7C23.melody	@ltx/en_us_goadedes/he.h.m4:heHE.OukElatrefsan.name
ltx/en_us_goadedes/me.m11.d07:meMA.Ode7C23.mode	@ltx/en_us_goadedes/miscellanea:misc.Mode4
ltx/en_us_goadedes/me.m11.d07:meMA.Ode7C23.ode	@ltx/en_us_goadedes/miscellanea:misc.Ode7
ltx/en_us_goadedes/me.m11.d07:meMA.Ode7C23.text	
ltx/en_us_goadedes/me.m11.d07:meMA.Ode7C2T.incipit	…
ltx/en_us_goadedes/me.m11.d07:meMA.Ode7C2T.melody	@ltx/en_us_goadedes/he.h.m4:heHE.OukElatrefsan.name
ltx/en_us_goadedes/me.m11.d07:meMA.Ode7C2T.mode	@ltx/en_us_goadedes/miscellanea:misc.Mode4
ltx/en_us_goadedes/me.m11.d07:meMA.Ode7C2T.ode	@ltx/en_us_goadedes/miscellanea:misc.Ode7
ltx/en_us_goadedes/me.m11.d07:meMA.Ode7C2T.text	
ltx/en_us_goadedes/me.m11.d07:meMA.Ode8C11.greekmelody	@ltx/en_us_goadedes/he.h.m2:heHE.TonArritoSofia.greekname
ltx/en_us_goadedes/me.m11.d07:meMA.Ode8C11.incipit	…
ltx/en_us_goadedes/me.m11.d07:meMA.Ode8C11.melody	@ltx/en_us_goadedes/he.h.m2:heHE.TonArritoSofia.name
ltx/en_us_goadedes/me.m11.d07:meMA.Ode8C11.mode	@ltx/en_us_goadedes/miscellanea:misc.Mode2
ltx/en_us_goadedes/me.m11.d07:meMA.Ode8C11.ode	@ltx/en_us_goadedes/miscellanea:misc.Ode8
ltx/en_us_goadedes/me.m11.d07:meMA.Ode8C11.text	
ltx/en_us_goadedes/me.m11.d07:meMA.Ode8C12.incipit	…
ltx/en_us_goadedes/me.m11.d07:meMA.Ode8C12.melody	@ltx/en_us_goadedes/he.h.m2:heHE.TonArritoSofia.name
ltx/en_us_goadedes/me.m11.d07:meMA.Ode8C12.mode	@ltx/en_us_goadedes/miscellanea:misc.Mode2
ltx/en_us_goadedes/me.m11.d07:meMA.Ode8C12.ode	@ltx/en_us_goadedes/miscellanea:misc.Ode8
ltx/en_us_goadedes/me.m11.d07:meMA.Ode8C12.text	
ltx/en_us_goadedes/me.m11.d07:meMA.Ode8C13.incipit	…
ltx/en_us_goadedes/me.m11.d07:meMA.Ode8C13.melody	@ltx/en_us_goadedes/he.h.m2:heHE.TonArritoSofia.name
ltx/en_us_goadedes/me.m11.d07:meMA.Ode8C13.mode	@ltx/en_us_goadedes/miscellanea:misc.Mode2
ltx/en_us_goadedes/me.m11.d07:meMA.Ode8C13.ode	@ltx/en_us_goadedes/miscellanea:misc.Ode8
ltx/en_us_goadedes/me.m11.d07:meMA.Ode8C13.text	
ltx/en_us_goadedes/me.m11.d07:meMA.Ode8C1T.incipit	…
ltx/en_us_goadedes/me.m11.d07:meMA.Ode8C1T.melody	@ltx/en_us_goadedes/he.h.m2:heHE.TonArritoSofia.name
ltx/en_us_goadedes/me.m11.d07:meMA.Ode8C1T.mode	@ltx/en_us_goadedes/miscellanea:misc.Mode2
ltx/en_us_goadedes/me.m11.d07:meMA.Ode8C1T.ode	@ltx/en_us_goadedes/miscellanea:misc.Ode8
ltx/en_us_goadedes/me.m11.d07:meMA.Ode8C1T.text	
ltx/en_us_goadedes/me.m11.d07:meMA.Ode8C21.greekmelody	@ltx/en_us_goadedes/he.h.m4:heHE.AkoueKori.greekname
ltx/en_us_goadedes/me.m11.d07:meMA.Ode8C21.incipit	…
ltx/en_us_goadedes/me.m11.d07:meMA.Ode8C21.melody	@ltx/en_us_goadedes/he.h.m4:heHE.AkoueKori.name
ltx/en_us_goadedes/me.m11.d07:meMA.Ode8C21.mode	@ltx/en_us_goadedes/miscellanea:misc.Mode4
ltx/en_us_goadedes/me.m11.d07:meMA.Ode8C21.ode	@ltx/en_us_goadedes/miscellanea:misc.Ode8
ltx/en_us_goadedes/me.m11.d07:meMA.Ode8C21.text	
ltx/en_us_goadedes/me.m11.d07:meMA.Ode8C22.incipit	…
ltx/en_us_goadedes/me.m11.d07:meMA.Ode8C22.melody	@ltx/en_us_goadedes/he.h.m4:heHE.AkoueKori.name
ltx/en_us_goadedes/me.m11.d07:meMA.Ode8C22.mode	@ltx/en_us_goadedes/miscellanea:misc.Mode4
ltx/en_us_goadedes/me.m11.d07:meMA.Ode8C22.ode	@ltx/en_us_goadedes/miscellanea:misc.Ode8
ltx/en_us_goadedes/me.m11.d07:meMA.Ode8C22.text	
ltx/en_us_goadedes/me.m11.d07:meMA.Ode8C23.incipit	…
ltx/en_us_goadedes/me.m11.d07:meMA.Ode8C23.melody	@ltx/en_us_goadedes/he.h.m4:heHE.AkoueKori.name
ltx/en_us_goadedes/me.m11.d07:meMA.Ode8C23.mode	@ltx/en_us_goadedes/miscellanea:misc.Mode4
ltx/en_us_goadedes/me.m11.d07:meMA.Ode8C23.ode	@ltx/en_us_goadedes/miscellanea:misc.Ode8
ltx/en_us_goadedes/me.m11.d07:meMA.Ode8C23.text	
ltx/en_us_goadedes/me.m11.d07:meMA.Ode8C2T.incipit	…
ltx/en_us_goadedes/me.m11.d07:meMA.Ode8C2T.melody	@ltx/en_us_goadedes/he.h.m4:heHE.AkoueKori.name
ltx/en_us_goadedes/me.m11.d07:meMA.Ode8C2T.mode	@ltx/en_us_goadedes/miscellanea:misc.Mode4
ltx/en_us_goadedes/me.m11.d07:meMA.Ode8C2T.ode	@ltx/en_us_goadedes/miscellanea:misc.Ode8
ltx/en_us_goadedes/me.m11.d07:meMA.Ode8C2T.text	
ltx/en_us_goadedes/me.m11.d07:meMA.Ode8H.greekmelody	@ltx/en_us_goadedes/he.h.m4:heHE.AkoueKori.greekname
ltx/en_us_goadedes/me.m11.d07:meMA.Ode8H.incipit	@ltx/en_us_goadedes/he.h.m4:heHE.AkoueKori.incipit
ltx/en_us_goadedes/me.m11.d07:meMA.Ode8H.melody	@ltx/en_us_goadedes/he.h.m4:heHE.AkoueKori.melody
ltx/en_us_goadedes/me.m11.d07:meMA.Ode8H.mode	@ltx/en_us_goadedes/miscellanea:misc.Mode4
ltx/en_us_goadedes/me.m11.d07:meMA.Ode8H.ode	@ltx/en_us_goadedes/miscellanea:misc.Ode8
ltx/en_us_goadedes/me.m11.d07:meMA.Ode8H.text	@ltx/en_us_goadedes/he.h.m4:heHE.AkoueKori.text
ltx/en_us_goadedes/me.m11.d07:meMA.Ode9C11.greekmelody	@ltx/en_us_goadedes/he.h.m2:heHE.TonEkTheouTheonLogon.greekname
ltx/en_us_goadedes/me.m11.d07:meMA.Ode9C11.incipit	…
ltx/en_us_goadedes/me.m11.d07:meMA.Ode9C11.melody	@ltx/en_us_goadedes/he.h.m2:heHE.TonEkTheouTheonLogon.name
ltx/en_us_goadedes/me.m11.d07:meMA.Ode9C11.mode	@ltx/en_us_goadedes/miscellanea:misc.Mode2
ltx/en_us_goadedes/me.m11.d07:meMA.Ode9C11.ode	@ltx/en_us_goadedes/miscellanea:misc.Ode9
ltx/en_us_goadedes/me.m11.d07:meMA.Ode9C11.text	
ltx/en_us_goadedes/me.m11.d07:meMA.Ode9C12.incipit	…
ltx/en_us_goadedes/me.m11.d07:meMA.Ode9C12.melody	@ltx/en_us_goadedes/he.h.m2:heHE.TonEkTheouTheonLogon.name
ltx/en_us_goadedes/me.m11.d07:meMA.Ode9C12.mode	@ltx/en_us_goadedes/miscellanea:misc.Mode2
ltx/en_us_goadedes/me.m11.d07:meMA.Ode9C12.ode	@ltx/en_us_goadedes/miscellanea:misc.Ode9
ltx/en_us_goadedes/me.m11.d07:meMA.Ode9C12.text	
ltx/en_us_goadedes/me.m11.d07:meMA.Ode9C13.incipit	…
ltx/en_us_goadedes/me.m11.d07:meMA.Ode9C13.melody	@ltx/en_us_goadedes/he.h.m2:heHE.TonEkTheouTheonLogon.name
ltx/en_us_goadedes/me.m11.d07:meMA.Ode9C13.mode	@ltx/en_us_goadedes/miscellanea:misc.Mode2
ltx/en_us_goadedes/me.m11.d07:meMA.Ode9C13.ode	@ltx/en_us_goadedes/miscellanea:misc.Ode9
ltx/en_us_goadedes/me.m11.d07:meMA.Ode9C13.text	
ltx/en_us_goadedes/me.m11.d07:meMA.Ode9C1T.incipit	…
ltx/en_us_goadedes/me.m11.d07:meMA.Ode9C1T.melody	@ltx/en_us_goadedes/he.h.m2:heHE.TonEkTheouTheonLogon.name
ltx/en_us_goadedes/me.m11.d07:meMA.Ode9C1T.mode	@ltx/en_us_goadedes/miscellanea:misc.Mode2
ltx/en_us_goadedes/me.m11.d07:meMA.Ode9C1T.ode	@ltx/en_us_goadedes/miscellanea:misc.Ode9
ltx/en_us_goadedes/me.m11.d07:meMA.Ode9C1T.text	
ltx/en_us_goadedes/me.m11.d07:meMA.Ode9C21.greekmelody	@ltx/en_us_goadedes/he.h.m4:heHE.OsEmpsychoTheouKivoto.greekname
ltx/en_us_goadedes/me.m11.d07:meMA.Ode9C21.incipit	…
ltx/en_us_goadedes/me.m11.d07:meMA.Ode9C21.melody	@ltx/en_us_goadedes/he.h.m4:heHE.OsEmpsychoTheouKivoto.name
ltx/en_us_goadedes/me.m11.d07:meMA.Ode9C21.mode	@ltx/en_us_goadedes/miscellanea:misc.Mode4
ltx/en_us_goadedes/me.m11.d07:meMA.Ode9C21.ode	@ltx/en_us_goadedes/miscellanea:misc.Ode9
ltx/en_us_goadedes/me.m11.d07:meMA.Ode9C21.text	
ltx/en_us_goadedes/me.m11.d07:meMA.Ode9C22.incipit	…
ltx/en_us_goadedes/me.m11.d07:meMA.Ode9C22.melody	@ltx/en_us_goadedes/he.h.m4:heHE.OsEmpsychoTheouKivoto.name
ltx/en_us_goadedes/me.m11.d07:meMA.Ode9C22.mode	@ltx/en_us_goadedes/miscellanea:misc.Mode4
ltx/en_us_goadedes/me.m11.d07:meMA.Ode9C22.ode	@ltx/en_us_goadedes/miscellanea:misc.Ode9
ltx/en_us_goadedes/me.m11.d07:meMA.Ode9C22.text	
ltx/en_us_goadedes/me.m11.d07:meMA.Ode9C23.incipit	…
ltx/en_us_goadedes/me.m11.d07:meMA.Ode9C23.melody	@ltx/en_us_goadedes/he.h.m4:heHE.OsEmpsychoTheouKivoto.name
ltx/en_us_goadedes/me.m11.d07:meMA.Ode9C23.mode	@ltx/en_us_goadedes/miscellanea:misc.Mode4
ltx/en_us_goadedes/me.m11.d07:meMA.Ode9C23.ode	@ltx/en_us_goadedes/miscellanea:misc.Ode9
ltx/en_us_goadedes/me.m11.d07:meMA.Ode9C23.text	
ltx/en_us_goadedes/me.m11.d07:meMA.Ode9C2T.incipit	…
ltx/en_us_goadedes/me.m11.d07:meMA.Ode9C2T.melody	@ltx/en_us_goadedes/he.h.m4:heHE.OsEmpsychoTheouKivoto.name
ltx/en_us_goadedes/me.m11.d07:meMA.Ode9C2T.mode	@ltx/en_us_goadedes/miscellanea:misc.Mode4
ltx/en_us_goadedes/me.m11.d07:meMA.Ode9C2T.ode	@ltx/en_us_goadedes/miscellanea:misc.Ode9
ltx/en_us_goadedes/me.m11.d07:meMA.Ode9C2T.text	
ltx/en_us_goadedes/me.m11.d07:meMA.Ode9H.greekmelody	@ltx/en_us_goadedes/he.h.m4:heHE.OsEmpsychoTheouKivoto.greekname
ltx/en_us_goadedes/me.m11.d07:meMA.Ode9H.incipit	@ltx/en_us_goadedes/he.h.m4:heHE.OsEmpsychoTheouKivoto.incipit
ltx/en_us_goadedes/me.m11.d07:meMA.Ode9H.melody	@ltx/en_us_goadedes/he.h.m4:heHE.OsEmpsychoTheouKivoto.melody
ltx/en_us_goadedes/me.m11.d07:meMA.Ode9H.mode	@ltx/en_us_goadedes/miscellanea:misc.Mode4
ltx/en_us_goadedes/me.m11.d07:meMA.Ode9H.ode	@ltx/en_us_goadedes/miscellanea:misc.Ode9
ltx/en_us_goadedes/me.m11.d07:meMA.Ode9H.text	@ltx/en_us_goadedes/he.h.m4:heHE.OsEmpsychoTheouKivoto.text
ltx/en_us_goadedes/me.m11.d07:meMA.Oikos2.text	
ltx/en_us_goadedes/me.m11.d07:meMA.Oikos22.text	
ltx/en_us_goadedes/me.m11.d07:meMA.Oikos23.text	
ltx/en_us_goadedes/me.m11.d07:meMA.Oikos24.text	
ltx/en_us_goadedes/me.m11.d07:meMA.Oikos25.text	
ltx/en_us_goadedes/me.m11.d07:meMA.Oikos26.text	
ltx/en_us_goadedes/me.m11.d07:meMA.Oikos27.text	
ltx/en_us_goadedes/me.m11.d07:meMA.Oikos28.text	
ltx/en_us_goadedes/me.m11.d07:meVE.Apolytikion1ger.greekmelody	@ltx/en_us_goadedes/he.a.m3:heAU.TheiasPisteos.greekname
ltx/en_us_goadedes/me.m11.d07:meVE.Apolytikion1ger.incipit	…
ltx/en_us_goadedes/me.m11.d07:meVE.Apolytikion1ger.melody	@ltx/en_us_goadedes/he.a.m3:heAU.TheiasPisteos.name
ltx/en_us_goadedes/me.m11.d07:meVE.Apolytikion1ger.mode	@ltx/en_us_goadedes/miscellanea:misc.Mode3
ltx/en_us_goadedes/me.m11.d07:meVE.Apolytikion1ger.poet	@ltx/en_us_goadedes/poets:po.Gerasimou
ltx/en_us_goadedes/me.m11.d07:meVE.Apolytikion1ger.text	
ltx/en_us_goadedes/me.m11.d07:meVE.Apolytikion2.incipit	…
ltx/en_us_goadedes/me.m11.d07:meVE.Apolytikion2.melody	
ltx/en_us_goadedes/me.m11.d07:meVE.Apolytikion2.mode	@ltx/en_us_goadedes/miscellanea:misc.Mode8
ltx/en_us_goadedes/me.m11.d07:meVE.Apolytikion2.text	
ltx/en_us_goadedes/me.m11.d07:meVE.AposGlory.incipit	@ltx/en_us_goadedes/me.m01.d15:meVE.AposGlory.incipit
ltx/en_us_goadedes/me.m11.d07:meVE.AposGlory.melody	
ltx/en_us_goadedes/me.m11.d07:meVE.AposGlory.mode	@ltx/en_us_goadedes/miscellanea:misc.Mode6
ltx/en_us_goadedes/me.m11.d07:meVE.AposGlory.text	@ltx/en_us_goadedes/me.m01.d15:meVE.AposGlory.text
ltx/en_us_goadedes/me.m11.d07:meVE.AposStavrotheotokion.greekmelody	@ltx/en_us_goadedes/he.a.m6:heAU.TriimerosAnestis.greekname
ltx/en_us_goadedes/me.m11.d07:meVE.AposStavrotheotokion.incipit	…
ltx/en_us_goadedes/me.m11.d07:meVE.AposStavrotheotokion.melody	@ltx/en_us_goadedes/he.a.m6:heAU.TriimerosAnestis.name
ltx/en_us_goadedes/me.m11.d07:meVE.AposStavrotheotokion.mode	@ltx/en_us_goadedes/miscellanea:misc.Mode6
ltx/en_us_goadedes/me.m11.d07:meVE.AposStavrotheotokion.text	
ltx/en_us_goadedes/me.m11.d07:meVE.AposTheotokion.greekmelody	@ltx/en_us_goadedes/he.a.m6:heAU.TriimerosAnestis.greekname
ltx/en_us_goadedes/me.m11.d07:meVE.AposTheotokion.incipit	@ltx/en_us_goadedes/me.m07.d08:meVE.SticTheotokion.incipit
ltx/en_us_goadedes/me.m11.d07:meVE.AposTheotokion.melody	@ltx/en_us_goadedes/he.a.m6:heAU.TriimerosAnestis.name
ltx/en_us_goadedes/me.m11.d07:meVE.AposTheotokion.mode	@ltx/en_us_goadedes/miscellanea:misc.Mode6
ltx/en_us_goadedes/me.m11.d07:meVE.AposTheotokion.text	@ltx/en_us_goadedes/me.m07.d08:meVE.SticTheotokion.text
ltx/en_us_goadedes/me.m11.d07:meVE.SticGlory.incipit	…
ltx/en_us_goadedes/me.m11.d07:meVE.SticGlory.melody	
ltx/en_us_goadedes/me.m11.d07:meVE.SticGlory.mode	@ltx/en_us_goadedes/miscellanea:misc.Mode5
ltx/en_us_goadedes/me.m11.d07:meVE.SticGlory.text	
ltx/en_us_goadedes/me.m11.d07:meVE.SticStavrotheotokion.greekmelody	@ltx/en_us_goadedes/he.a.m5:heAU.ChairoisAskitikon.greekname
ltx/en_us_goadedes/me.m11.d07:meVE.SticStavrotheotokion.incipit	…
ltx/en_us_goadedes/me.m11.d07:meVE.SticStavrotheotokion.melody	@ltx/en_us_goadedes/he.a.m5:heAU.ChairoisAskitikon.name
ltx/en_us_goadedes/me.m11.d07:meVE.SticStavrotheotokion.mode	@ltx/en_us_goadedes/miscellanea:misc.Mode5
ltx/en_us_goadedes/me.m11.d07:meVE.SticStavrotheotokion.text	
ltx/en_us_goadedes/me.m11.d07:meVE.SticTheotokion.greekmelody	@ltx/en_us_goadedes/he.a.m5:heAU.ChairoisAskitikon.greekname
ltx/en_us_goadedes/me.m11.d07:meVE.SticTheotokion.incipit	…
ltx/en_us_goadedes/me.m11.d07:meVE.SticTheotokion.melody	@ltx/en_us_goadedes/he.a.m5:heAU.ChairoisAskitikon.name
ltx/en_us_goadedes/me.m11.d07:meVE.SticTheotokion.mode	@ltx/en_us_goadedes/miscellanea:misc.Mode5
ltx/en_us_goadedes/me.m11.d07:meVE.SticTheotokion.text	
ltx/en_us_goadedes/me.m11.d07:meVE.Stichera01.greekmelody	@ltx/en_us_goadedes/he.a.m4:heAU.OsGennaionEnMartysi.greekname
ltx/en_us_goadedes/me.m11.d07:meVE.Stichera01.incipit	…
ltx/en_us_goadedes/me.m11.d07:meVE.Stichera01.melody	@ltx/en_us_goadedes/he.a.m4:heAU.OsGennaionEnMartysi.name
ltx/en_us_goadedes/me.m11.d07:meVE.Stichera01.mode	@ltx/en_us_goadedes/miscellanea:misc.Mode4
ltx/en_us_goadedes/me.m11.d07:meVE.Stichera01.text	
ltx/en_us_goadedes/me.m11.d07:meVE.Stichera02.incipit	…
ltx/en_us_goadedes/me.m11.d07:meVE.Stichera02.melody	@ltx/en_us_goadedes/he.a.m4:heAU.OsGennaionEnMartysi.name
ltx/en_us_goadedes/me.m11.d07:meVE.Stichera02.mode	@ltx/en_us_goadedes/miscellanea:misc.Mode4
ltx/en_us_goadedes/me.m11.d07:meVE.Stichera02.text	
ltx/en_us_goadedes/me.m11.d07:meVE.Stichera03.incipit	…
ltx/en_us_goadedes/me.m11.d07:meVE.Stichera03.melody	@ltx/en_us_goadedes/he.a.m4:heAU.OsGennaionEnMartysi.name
ltx/en_us_goadedes/me.m11.d07:meVE.Stichera03.mode	@ltx/en_us_goadedes/miscellanea:misc.Mode4
ltx/en_us_goadedes/me.m11.d07:meVE.Stichera03.text	
ltx/en_us_goadedes/me.m11.d07:meVE.Stichera04.greekmelody	@ltx/en_us_goadedes/he.a.m6:heAU.OlinApothemenoi.greekname
ltx/en_us_goadedes/me.m11.d07:meVE.Stichera04.incipit	…
ltx/en_us_goadedes/me.m11.d07:meVE.Stichera04.melody	@ltx/en_us_goadedes/he.a.m6:heAU.OlinApothemenoi.name
ltx/en_us_goadedes/me.m11.d07:meVE.Stichera04.mode	@ltx/en_us_goadedes/miscellanea:misc.Mode6
ltx/en_us_goadedes/me.m11.d07:meVE.Stichera04.text	
ltx/en_us_goadedes/me.m11.d07:meVE.Stichera05.incipit	…
ltx/en_us_goadedes/me.m11.d07:meVE.Stichera05.melody	@ltx/en_us_goadedes/he.a.m6:heAU.OlinApothemenoi.name
ltx/en_us_goadedes/me.m11.d07:meVE.Stichera05.mode	@ltx/en_us_goadedes/miscellanea:misc.Mode6
ltx/en_us_goadedes/me.m11.d07:meVE.Stichera05.text	
ltx/en_us_goadedes/me.m11.d07:meVE.Stichera06.incipit	…
ltx/en_us_goadedes/me.m11.d07:meVE.Stichera06.melody	@ltx/en_us_goadedes/he.a.m6:heAU.OlinApothemenoi.name
ltx/en_us_goadedes/me.m11.d07:meVE.Stichera06.mode	@ltx/en_us_goadedes/miscellanea:misc.Mode6
ltx/en_us_goadedes/me.m11.d07:meVE.Stichera06.text	
