ltx/en_us_goadedes/template.titles:bap.html.tab	
ltx/en_us_goadedes/template.titles:bap.pdf.cover	
ltx/en_us_goadedes/template.titles:bap.pdf.header	
ltx/en_us_goadedes/template.titles:cdo.html.tab	
ltx/en_us_goadedes/template.titles:cdo.pdf.cover	
ltx/en_us_goadedes/template.titles:cdo.pdf.header	
ltx/en_us_goadedes/template.titles:chi.html.tab	
ltx/en_us_goadedes/template.titles:chi.pdf.cover	
ltx/en_us_goadedes/template.titles:chi.pdf.header	
ltx/en_us_goadedes/template.titles:clps.additionallitanies.bottom	
ltx/en_us_goadedes/template.titles:clps.additionallitanies.top	
ltx/en_us_goadedes/template.titles:clps.additionalpetitions.bottom	
ltx/en_us_goadedes/template.titles:clps.additionalpetitions.top	
ltx/en_us_goadedes/template.titles:clps.alternative.bottom	
ltx/en_us_goadedes/template.titles:clps.alternative.top	
ltx/en_us_goadedes/template.titles:clps.lity.bottom	
ltx/en_us_goadedes/template.titles:clps.lity.top	
ltx/en_us_goadedes/template.titles:clps.matinsordinary.bottom	
ltx/en_us_goadedes/template.titles:clps.matinsordinary.top	
ltx/en_us_goadedes/template.titles:clps.prayers.bottom	
ltx/en_us_goadedes/template.titles:clps.prayers.top	
ltx/en_us_goadedes/template.titles:clps.precommunionprayers.bottom	
ltx/en_us_goadedes/template.titles:clps.precommunionprayers.top	
ltx/en_us_goadedes/template.titles:clps.selectedverses.bottom	
ltx/en_us_goadedes/template.titles:clps.selectedverses.top	
ltx/en_us_goadedes/template.titles:clps.stichologia.bottom	
ltx/en_us_goadedes/template.titles:clps.stichologia.top	
ltx/en_us_goadedes/template.titles:clps.typikon.bottom	
ltx/en_us_goadedes/template.titles:clps.typikon.top	
ltx/en_us_goadedes/template.titles:co.akathist.html.tab	
ltx/en_us_goadedes/template.titles:co.akathist.pdf.cover	
ltx/en_us_goadedes/template.titles:co.akathist.pdf.header	
ltx/en_us_goadedes/template.titles:co.christmasvigil.html.tab	
ltx/en_us_goadedes/template.titles:co.christmasvigil.pdf.cover	
ltx/en_us_goadedes/template.titles:co.christmasvigil.pdf.header	
ltx/en_us_goadedes/template.titles:co.epiphanyvigil.html.tab	
ltx/en_us_goadedes/template.titles:co.epiphanyvigil.pdf.cover	
ltx/en_us_goadedes/template.titles:co.epiphanyvigil.pdf.header	
ltx/en_us_goadedes/template.titles:co.greatcanon.html.tab	
ltx/en_us_goadedes/template.titles:co.greatcanon.pdf.cover	
ltx/en_us_goadedes/template.titles:co.greatcanon.pdf.header	
ltx/en_us_goadedes/template.titles:co.greatcompline.pdf.cover	
ltx/en_us_goadedes/template.titles:co.greatcompline.pdf.header	
ltx/en_us_goadedes/template.titles:co.html.tab	
ltx/en_us_goadedes/template.titles:co.pdf.cover	
ltx/en_us_goadedes/template.titles:co.pdf.header	
ltx/en_us_goadedes/template.titles:co.salutations.pdf.cover	
ltx/en_us_goadedes/template.titles:co.salutations.pdf.header	
ltx/en_us_goadedes/template.titles:co.smallcompline.html.tab	
ltx/en_us_goadedes/template.titles:co.smallcompline.pdf.cover	
ltx/en_us_goadedes/template.titles:co.smallcompline.pdf.header	
ltx/en_us_goadedes/template.titles:co.smallcomplinewithcanon.html.tab	
ltx/en_us_goadedes/template.titles:co.smallcomplinewithcanon.pdf.cover	
ltx/en_us_goadedes/template.titles:co.smallcomplinewithcanon.pdf.header	
ltx/en_us_goadedes/template.titles:co1.html.tab	
ltx/en_us_goadedes/template.titles:co1.pdf.cover	
ltx/en_us_goadedes/template.titles:co1.pdf.header	
ltx/en_us_goadedes/template.titles:co2.html.tab	
ltx/en_us_goadedes/template.titles:co2.pdf.cover	
ltx/en_us_goadedes/template.titles:co2.pdf.header	
ltx/en_us_goadedes/template.titles:co3.html.tab	
ltx/en_us_goadedes/template.titles:co3.pdf.cover	
ltx/en_us_goadedes/template.titles:co3.pdf.header	
ltx/en_us_goadedes/template.titles:co4.html.tab	
ltx/en_us_goadedes/template.titles:co4.pdf.cover	
ltx/en_us_goadedes/template.titles:co4.pdf.header	
ltx/en_us_goadedes/template.titles:co6.html.tab	
ltx/en_us_goadedes/template.titles:co6.pdf.cover	
ltx/en_us_goadedes/template.titles:co6.pdf.header	
ltx/en_us_goadedes/template.titles:con.html.tab	
ltx/en_us_goadedes/template.titles:con.pdf.cover	
ltx/en_us_goadedes/template.titles:con.pdf.header	
ltx/en_us_goadedes/template.titles:d	
ltx/en_us_goadedes/template.titles:d.delimiter	
ltx/en_us_goadedes/template.titles:d.for	
ltx/en_us_goadedes/template.titles:d.of	
ltx/en_us_goadedes/template.titles:d.on	
ltx/en_us_goadedes/template.titles:d.onFridayAfternoon	
ltx/en_us_goadedes/template.titles:d.onFridayEvening	
ltx/en_us_goadedes/template.titles:d.onFridayMorning	
ltx/en_us_goadedes/template.titles:d.onMondayEvening	
ltx/en_us_goadedes/template.titles:d.onMondayMorning	
ltx/en_us_goadedes/template.titles:d.onSaturdayEvening	
ltx/en_us_goadedes/template.titles:d.onSaturdayMorning	
ltx/en_us_goadedes/template.titles:d.onSundayEvening	
ltx/en_us_goadedes/template.titles:d.onSundayMorning	
ltx/en_us_goadedes/template.titles:d.onThursdayEvening	
ltx/en_us_goadedes/template.titles:d.onThursdayMorning	
ltx/en_us_goadedes/template.titles:d.onTuesdayEvening	
ltx/en_us_goadedes/template.titles:d.onTuesdayMorning	
ltx/en_us_goadedes/template.titles:d.onWednesdayEvening	
ltx/en_us_goadedes/template.titles:d.onWednesdayMorning	
ltx/en_us_goadedes/template.titles:d.ontheeveof	
ltx/en_us_goadedes/template.titles:dr.html.tab	
ltx/en_us_goadedes/template.titles:dr.pdf.cover	
ltx/en_us_goadedes/template.titles:dr.pdf.header	
ltx/en_us_goadedes/template.titles:em.html.tab	
ltx/en_us_goadedes/template.titles:em.pdf.cover	
ltx/en_us_goadedes/template.titles:em.pdf.header	
ltx/en_us_goadedes/template.titles:em3.html.tab	
ltx/en_us_goadedes/template.titles:em3.pdf.cover	
ltx/en_us_goadedes/template.titles:em3.pdf.header	
ltx/en_us_goadedes/template.titles:eo	
ltx/en_us_goadedes/template.titles:eu	
ltx/en_us_goadedes/template.titles:fun.html.tab	
ltx/en_us_goadedes/template.titles:fun.pdf.cover	
ltx/en_us_goadedes/template.titles:fun.pdf.header	
ltx/en_us_goadedes/template.titles:gc.html.tab	
ltx/en_us_goadedes/template.titles:gc.pdf.cover	
ltx/en_us_goadedes/template.titles:gc.pdf.header	
ltx/en_us_goadedes/template.titles:gh.html.tab	
ltx/en_us_goadedes/template.titles:gh.pdf.cover	
ltx/en_us_goadedes/template.titles:gh.pdf.header	
ltx/en_us_goadedes/template.titles:gp.html.tab	
ltx/en_us_goadedes/template.titles:gp.pdf.cover	
ltx/en_us_goadedes/template.titles:gp.pdf.header	
ltx/en_us_goadedes/template.titles:h1.html.tab	
ltx/en_us_goadedes/template.titles:h1.pdf.cover	
ltx/en_us_goadedes/template.titles:h1.pdf.header	
ltx/en_us_goadedes/template.titles:h13.html.tab	
ltx/en_us_goadedes/template.titles:h13.pdf.cover	
ltx/en_us_goadedes/template.titles:h13.pdf.header	
ltx/en_us_goadedes/template.titles:h3.html.tab	
ltx/en_us_goadedes/template.titles:h3.pdf.cover	
ltx/en_us_goadedes/template.titles:h3.pdf.header	
ltx/en_us_goadedes/template.titles:h36.html.tab	
ltx/en_us_goadedes/template.titles:h36.pdf.cover	
ltx/en_us_goadedes/template.titles:h36.pdf.header	
ltx/en_us_goadedes/template.titles:h6.html.tab	
ltx/en_us_goadedes/template.titles:h6.pdf.cover	
ltx/en_us_goadedes/template.titles:h6.pdf.header	
ltx/en_us_goadedes/template.titles:h61.html.tab	
ltx/en_us_goadedes/template.titles:h61.pdf.cover	
ltx/en_us_goadedes/template.titles:h61.pdf.header	
ltx/en_us_goadedes/template.titles:h9.html.tab	
ltx/en_us_goadedes/template.titles:h9.pdf.cover	
ltx/en_us_goadedes/template.titles:h9.pdf.header	
ltx/en_us_goadedes/template.titles:h91.html.tab	
ltx/en_us_goadedes/template.titles:h91.pdf.cover	
ltx/en_us_goadedes/template.titles:h91.pdf.header	
ltx/en_us_goadedes/template.titles:h92.html.tab	
ltx/en_us_goadedes/template.titles:h92.pdf.cover	
ltx/en_us_goadedes/template.titles:h92.pdf.header	
ltx/en_us_goadedes/template.titles:he	
ltx/en_us_goadedes/template.titles:hi	
ltx/en_us_goadedes/template.titles:ho	
ltx/en_us_goadedes/template.titles:hw.beforeresurrection	
ltx/en_us_goadedes/template.titles:hw.bridegroomservice	
ltx/en_us_goadedes/template.titles:hw.lamentation	
ltx/en_us_goadedes/template.titles:hw.mergedscores.title	
ltx/en_us_goadedes/template.titles:hw.ofholyfriday	
ltx/en_us_goadedes/template.titles:hw.ofholymonday	
ltx/en_us_goadedes/template.titles:hw.ofholysaturday	
ltx/en_us_goadedes/template.titles:hw.ofholythursday	
ltx/en_us_goadedes/template.titles:hw.ofholytuesday	
ltx/en_us_goadedes/template.titles:hw.ofholywednesday	
ltx/en_us_goadedes/template.titles:hw.palmsunday	
ltx/en_us_goadedes/template.titles:hw.passion	
ltx/en_us_goadedes/template.titles:hw.pdf.cover	
ltx/en_us_goadedes/template.titles:hw.removal	
ltx/en_us_goadedes/template.titles:ka	
ltx/en_us_goadedes/template.titles:le	
ltx/en_us_goadedes/template.titles:li.html.tab	
ltx/en_us_goadedes/template.titles:li.pdf.cover	
ltx/en_us_goadedes/template.titles:li.pdf.header	
ltx/en_us_goadedes/template.titles:li1.html.tab	
ltx/en_us_goadedes/template.titles:li1.pdf.cover	
ltx/en_us_goadedes/template.titles:li1.pdf.header	
ltx/en_us_goadedes/template.titles:li2.html.tab	
ltx/en_us_goadedes/template.titles:li2.pdf.cover	
ltx/en_us_goadedes/template.titles:li2.pdf.header	
ltx/en_us_goadedes/template.titles:li3.html.tab	
ltx/en_us_goadedes/template.titles:li3.pdf.cover	
ltx/en_us_goadedes/template.titles:li3.pdf.header	
ltx/en_us_goadedes/template.titles:li4.html.tab	
ltx/en_us_goadedes/template.titles:li4.pdf.cover	
ltx/en_us_goadedes/template.titles:li4.pdf.header	
ltx/en_us_goadedes/template.titles:li5.html.tab	
ltx/en_us_goadedes/template.titles:li5.pdf.cover	
ltx/en_us_goadedes/template.titles:li5.pdf.header	
ltx/en_us_goadedes/template.titles:li6.html.tab	
ltx/en_us_goadedes/template.titles:li6.pdf.cover	
ltx/en_us_goadedes/template.titles:li6.pdf.header	
ltx/en_us_goadedes/template.titles:li7.html.tab	
ltx/en_us_goadedes/template.titles:li7.pdf.cover	
ltx/en_us_goadedes/template.titles:li7.pdf.header	
ltx/en_us_goadedes/template.titles:li8.html.tab	
ltx/en_us_goadedes/template.titles:li8.pdf.cover	
ltx/en_us_goadedes/template.titles:li8.pdf.header	
ltx/en_us_goadedes/template.titles:li9.html.tab	
ltx/en_us_goadedes/template.titles:li9.pdf.cover	
ltx/en_us_goadedes/template.titles:li9.pdf.header	
ltx/en_us_goadedes/template.titles:m.mode	
ltx/en_us_goadedes/template.titles:m.month	
ltx/en_us_goadedes/template.titles:ma.html.tab	
ltx/en_us_goadedes/template.titles:ma.pdf.cover	
ltx/en_us_goadedes/template.titles:ma.pdf.header	
ltx/en_us_goadedes/template.titles:ma2.html.tab	
ltx/en_us_goadedes/template.titles:ma2.pdf.cover	
ltx/en_us_goadedes/template.titles:ma2.pdf.header	
ltx/en_us_goadedes/template.titles:ma3.html.tab	
ltx/en_us_goadedes/template.titles:ma3.pdf.cover	
ltx/en_us_goadedes/template.titles:ma3.pdf.header	
ltx/en_us_goadedes/template.titles:ma4.html.tab	
ltx/en_us_goadedes/template.titles:ma4.pdf.cover	
ltx/en_us_goadedes/template.titles:ma4.pdf.header	
ltx/en_us_goadedes/template.titles:ma5.html.tab	
ltx/en_us_goadedes/template.titles:ma5.pdf.cover	
ltx/en_us_goadedes/template.titles:ma5.pdf.header	
ltx/en_us_goadedes/template.titles:me	
ltx/en_us_goadedes/template.titles:me.SundayAfterFeast	
ltx/en_us_goadedes/template.titles:me.m01.d06.onEpiphanyEve	
ltx/en_us_goadedes/template.titles:me.m12.d25.onChristmasEve	
ltx/en_us_goadedes/template.titles:mem.html.tab	
ltx/en_us_goadedes/template.titles:mem.pdf.cover	
ltx/en_us_goadedes/template.titles:mem.pdf.header	
ltx/en_us_goadedes/template.titles:mo.html.tab	
ltx/en_us_goadedes/template.titles:mo.pdf.cover	
ltx/en_us_goadedes/template.titles:mo.pdf.header	
ltx/en_us_goadedes/template.titles:mo1.html.tab	
ltx/en_us_goadedes/template.titles:mo1.pdf.cover	
ltx/en_us_goadedes/template.titles:mo1.pdf.header	
ltx/en_us_goadedes/template.titles:mo6.html.tab	
ltx/en_us_goadedes/template.titles:mo6.pdf.cover	
ltx/en_us_goadedes/template.titles:mo6.pdf.header	
ltx/en_us_goadedes/template.titles:oc	
ltx/en_us_goadedes/template.titles:oc.html.tab	
ltx/en_us_goadedes/template.titles:oc.pdf.cover	
ltx/en_us_goadedes/template.titles:oc.pdf.header	
ltx/en_us_goadedes/template.titles:ord.html.tab	
ltx/en_us_goadedes/template.titles:ord.pdf.cover	
ltx/en_us_goadedes/template.titles:ord.pdf.header	
ltx/en_us_goadedes/template.titles:pa.agape	
ltx/en_us_goadedes/template.titles:pa.brightweek	
ltx/en_us_goadedes/template.titles:pa.easter	
ltx/en_us_goadedes/template.titles:pa.ofbrightweek	
ltx/en_us_goadedes/template.titles:pa.ofpascha	
ltx/en_us_goadedes/template.titles:pa.pascha	
ltx/en_us_goadedes/template.titles:pa.resurrection	
ltx/en_us_goadedes/template.titles:pe	
ltx/en_us_goadedes/template.titles:pen.html.tab	
ltx/en_us_goadedes/template.titles:pen.pdf.cover	
ltx/en_us_goadedes/template.titles:pen.pdf.header	
ltx/en_us_goadedes/template.titles:pl.html.tab	
ltx/en_us_goadedes/template.titles:pl.pdf.cover	
ltx/en_us_goadedes/template.titles:pl.pdf.header	
ltx/en_us_goadedes/template.titles:ps	
ltx/en_us_goadedes/template.titles:sal.theotokos	
ltx/en_us_goadedes/template.titles:sat	
ltx/en_us_goadedes/template.titles:service	
ltx/en_us_goadedes/template.titles:sp.html.tab	
ltx/en_us_goadedes/template.titles:sp.pdf.cover	
ltx/en_us_goadedes/template.titles:sp.pdf.header	
ltx/en_us_goadedes/template.titles:sun	
ltx/en_us_goadedes/template.titles:sv.html.tab	
ltx/en_us_goadedes/template.titles:sv.pdf.cover	
ltx/en_us_goadedes/template.titles:sv.pdf.header	
ltx/en_us_goadedes/template.titles:sv3.html.tab	
ltx/en_us_goadedes/template.titles:sv3.pdf.cover	
ltx/en_us_goadedes/template.titles:sv3.pdf.header	
ltx/en_us_goadedes/template.titles:swb.html.tab	
ltx/en_us_goadedes/template.titles:swb.pdf.cover	
ltx/en_us_goadedes/template.titles:swb.pdf.header	
ltx/en_us_goadedes/template.titles:sy	
ltx/en_us_goadedes/template.titles:tr	
ltx/en_us_goadedes/template.titles:unc.html.tab	
ltx/en_us_goadedes/template.titles:unc.pdf.cover	
ltx/en_us_goadedes/template.titles:unc.pdf.header	
ltx/en_us_goadedes/template.titles:ve.html.tab	
ltx/en_us_goadedes/template.titles:ve.pdf.cover	
ltx/en_us_goadedes/template.titles:ve.pdf.header	
ltx/en_us_goadedes/template.titles:ve2.html.tab	
ltx/en_us_goadedes/template.titles:ve2.pdf.cover	
ltx/en_us_goadedes/template.titles:ve2.pdf.header	
ltx/en_us_goadedes/template.titles:ve3.html.tab	
ltx/en_us_goadedes/template.titles:ve3.pdf.cover	
ltx/en_us_goadedes/template.titles:ve3.pdf.header	
ltx/en_us_goadedes/template.titles:ve4.html.tab	
ltx/en_us_goadedes/template.titles:ve4.pdf.cover	
ltx/en_us_goadedes/template.titles:ve4.pdf.header	
ltx/en_us_goadedes/template.titles:ve5.html.tab	
ltx/en_us_goadedes/template.titles:ve5.pdf.cover	
ltx/en_us_goadedes/template.titles:ve5.pdf.header	
ltx/en_us_goadedes/template.titles:vl.html.tab	
ltx/en_us_goadedes/template.titles:vl.pdf.cover	
ltx/en_us_goadedes/template.titles:vl.pdf.cover2	
ltx/en_us_goadedes/template.titles:vl.pdf.header	
ltx/en_us_goadedes/template.titles:vl2.html.tab	VESPERAL LITURGY OF ST. JOHN CHRYSOSTOM
ltx/en_us_goadedes/template.titles:vl2.pdf.cover	Vesperal Liturgy
ltx/en_us_goadedes/template.titles:vl2.pdf.cover2	of St. John Chrysostom
ltx/en_us_goadedes/template.titles:vl2.pdf.header	Vesperal Liturgy of St. John Chrysostom
ltx/en_us_goadedes/template.titles:wed.html.tab	
ltx/en_us_goadedes/template.titles:wed.pdf.cover	
ltx/en_us_goadedes/template.titles:wed.pdf.header	
ltx/en_us_goadedes/template.titles:wkd	
