ltx/en_us_goadedes/pe.d121:peDA.commemoration.full	
ltx/en_us_goadedes/pe.d121:peDA.commemoration.name	Holy Spirit
ltx/en_us_goadedes/pe.d121:peDA.commemoration.short	Monday of the Holy Spirit
ltx/en_us_goadedes/pe.d121:peDA.dismissal	@ltx/en_us_goadedes/dismissals:dis00.pentecost
ltx/en_us_goadedes/pe.d121:peDA.insert1	
ltx/en_us_goadedes/pe.d121:peDA.insert2	
ltx/en_us_goadedes/pe.d121:peDA.note	
ltx/en_us_goadedes/pe.d121:peHO.commemorations	
ltx/en_us_goadedes/pe.d121:peHO.daytitle	
ltx/en_us_goadedes/pe.d121:peHO.description1	
ltx/en_us_goadedes/pe.d121:peHO.description2	
ltx/en_us_goadedes/pe.d121:peHO.note1	
ltx/en_us_goadedes/pe.d121:peHO.note2	
ltx/en_us_goadedes/pe.d121:peLI.CommunionHymn.text	Do not take Your Holy Spirit from us, we pray, O benevolent God.
ltx/en_us_goadedes/pe.d121:peLI.MM.EntranceHymn.text	@ltx/en_us_goadedes/properties:media.key
ltx/en_us_goadedes/pe.d121:peLI.Megalynarion.text	The all-holy Spirit in fiery tongues * came down on the Apostles of Christ, making them all wise. * They spoke in other tongues and proclaimed the strange teachings * about the mighty deeds of You our eternal God.
ltx/en_us_goadedes/pe.d121:peLI.TheotokosHymn.incipit	@ltx/en_us_goadedes/pe.d120:peMA.Ode9C2H.incipit
ltx/en_us_goadedes/pe.d121:peLI.TheotokosHymn.mode	@ltx/en_us_goadedes/pe.d120:peMA.Ode9C2H.mode
ltx/en_us_goadedes/pe.d121:peLI.TheotokosHymn.text	@ltx/en_us_goadedes/pe.d120:peMA.Ode9C2H.text
ltx/en_us_goadedes/pe.d121:peMA.Exaposteilarion1.greekmelody	@ltx/en_us_goadedes/pe.d120:peMA.Exaposteilarion1.greekmelody
ltx/en_us_goadedes/pe.d121:peMA.Exaposteilarion1.incipit	@ltx/en_us_goadedes/pe.d120:peMA.Exaposteilarion1.incipit
ltx/en_us_goadedes/pe.d121:peMA.Exaposteilarion1.melody	@ltx/en_us_goadedes/pe.d120:peMA.Exaposteilarion1.melody
ltx/en_us_goadedes/pe.d121:peMA.Exaposteilarion1.mode	@ltx/en_us_goadedes/pe.d120:peMA.Exaposteilarion1.mode
ltx/en_us_goadedes/pe.d121:peMA.Exaposteilarion1.text	@ltx/en_us_goadedes/pe.d120:peMA.Exaposteilarion1.text
ltx/en_us_goadedes/pe.d121:peMA.Exaposteilarion2.greekmelody	@ltx/en_us_goadedes/pe.d120:peMA.Exaposteilarion2.greekmelody
ltx/en_us_goadedes/pe.d121:peMA.Exaposteilarion2.incipit	@ltx/en_us_goadedes/pe.d120:peMA.Exaposteilarion2.incipit
ltx/en_us_goadedes/pe.d121:peMA.Exaposteilarion2.melody	@ltx/en_us_goadedes/pe.d120:peMA.Exaposteilarion2.melody
ltx/en_us_goadedes/pe.d121:peMA.Exaposteilarion2.mode	@ltx/en_us_goadedes/pe.d120:peMA.Exaposteilarion2.mode
ltx/en_us_goadedes/pe.d121:peMA.Exaposteilarion2.text	@ltx/en_us_goadedes/pe.d120:peMA.Exaposteilarion2.text
ltx/en_us_goadedes/pe.d121:peMA.Kathisma11.greekmelody	@ltx/en_us_goadedes/pe.d120:peMA.Kathisma11.greekmelody
ltx/en_us_goadedes/pe.d121:peMA.Kathisma11.incipit	@ltx/en_us_goadedes/pe.d120:peMA.Kathisma11.incipit
ltx/en_us_goadedes/pe.d121:peMA.Kathisma11.melody	@ltx/en_us_goadedes/pe.d120:peMA.Kathisma11.melody
ltx/en_us_goadedes/pe.d121:peMA.Kathisma11.mode	@ltx/en_us_goadedes/pe.d120:peMA.Kathisma11.mode
ltx/en_us_goadedes/pe.d121:peMA.Kathisma11.text	@ltx/en_us_goadedes/pe.d120:peMA.Kathisma11.text
ltx/en_us_goadedes/pe.d121:peMA.Kathisma21.greekmelody	@ltx/en_us_goadedes/pe.d120:peMA.Kathisma21.greekmelody
ltx/en_us_goadedes/pe.d121:peMA.Kathisma21.incipit	@ltx/en_us_goadedes/pe.d120:peMA.Kathisma21.incipit
ltx/en_us_goadedes/pe.d121:peMA.Kathisma21.melody	@ltx/en_us_goadedes/pe.d120:peMA.Kathisma21.melody
ltx/en_us_goadedes/pe.d121:peMA.Kathisma21.mode	@ltx/en_us_goadedes/pe.d120:peMA.Kathisma21.mode
ltx/en_us_goadedes/pe.d121:peMA.Kathisma21.text	@ltx/en_us_goadedes/pe.d120:peMA.Kathisma21.text
ltx/en_us_goadedes/pe.d121:peMA.Kathisma31.incipit	@ltx/en_us_goadedes/pe.d120:peMA.Kathisma31.incipit
ltx/en_us_goadedes/pe.d121:peMA.Kathisma31.melody	@ltx/en_us_goadedes/pe.d120:peMA.Kathisma31.melody
ltx/en_us_goadedes/pe.d121:peMA.Kathisma31.mode	@ltx/en_us_goadedes/pe.d120:peMA.Kathisma31.mode
ltx/en_us_goadedes/pe.d121:peMA.Kathisma31.text	@ltx/en_us_goadedes/pe.d120:peMA.Kathisma31.text
ltx/en_us_goadedes/pe.d121:peMA.Kontakion1.incipit	@ltx/en_us_goadedes/pe.d120:peMA.Kontakion1.incipit
ltx/en_us_goadedes/pe.d121:peMA.Kontakion1.melody	@ltx/en_us_goadedes/pe.d120:peMA.Kontakion1.melody
ltx/en_us_goadedes/pe.d121:peMA.Kontakion1.mode	@ltx/en_us_goadedes/pe.d120:peMA.Kontakion1.mode
ltx/en_us_goadedes/pe.d121:peMA.Kontakion1.text	@ltx/en_us_goadedes/pe.d120:peMA.Kontakion1.text
ltx/en_us_goadedes/pe.d121:peMA.Lauds1.incipit	@ltx/en_us_goadedes/pe.d120:peVE.Stichera05.incipit
ltx/en_us_goadedes/pe.d121:peMA.Lauds1.melody	@ltx/en_us_goadedes/pe.d120:peVE.Stichera05.melody
ltx/en_us_goadedes/pe.d121:peMA.Lauds1.mode	@ltx/en_us_goadedes/pe.d120:peVE.Stichera05.mode
ltx/en_us_goadedes/pe.d121:peMA.Lauds1.text	@ltx/en_us_goadedes/pe.d120:peVE.Stichera05.text
ltx/en_us_goadedes/pe.d121:peMA.Lauds2.incipit	@ltx/en_us_goadedes/pe.d120:peVE.Stichera06.incipit
ltx/en_us_goadedes/pe.d121:peMA.Lauds2.melody	@ltx/en_us_goadedes/pe.d120:peVE.Stichera06.melody
ltx/en_us_goadedes/pe.d121:peMA.Lauds2.mode	@ltx/en_us_goadedes/pe.d120:peVE.Stichera06.mode
ltx/en_us_goadedes/pe.d121:peMA.Lauds2.text	@ltx/en_us_goadedes/pe.d120:peVE.Stichera06.text
ltx/en_us_goadedes/pe.d121:peMA.Lauds3.incipit	@ltx/en_us_goadedes/pe.d120:peVE.Stichera07.incipit
ltx/en_us_goadedes/pe.d121:peMA.Lauds3.melody	@ltx/en_us_goadedes/pe.d120:peVE.Stichera07.melody
ltx/en_us_goadedes/pe.d121:peMA.Lauds3.mode	@ltx/en_us_goadedes/pe.d120:peVE.Stichera07.mode
ltx/en_us_goadedes/pe.d121:peMA.Lauds3.text	@ltx/en_us_goadedes/pe.d120:peVE.Stichera07.text
ltx/en_us_goadedes/pe.d121:peMA.LaudsGlory.incipit	@ltx/en_us_goadedes/pe.d120:peVE.AposGlory.incipit
ltx/en_us_goadedes/pe.d121:peMA.LaudsGlory.melody	@ltx/en_us_goadedes/pe.d120:peVE.AposGlory.melody
ltx/en_us_goadedes/pe.d121:peMA.LaudsGlory.mode	@ltx/en_us_goadedes/pe.d120:peVE.AposGlory.mode
ltx/en_us_goadedes/pe.d121:peMA.LaudsGlory.text	@ltx/en_us_goadedes/pe.d120:peVE.AposGlory.text
ltx/en_us_goadedes/pe.d121:peMA.MM.Lauds123as123.text	@ltx/en_us_goadedes/properties:media.key
ltx/en_us_goadedes/pe.d121:peMA.Oikos1.text	@ltx/en_us_goadedes/pe.d120:peMA.Oikos1.text
ltx/en_us_goadedes/pe.d121:pePE.Prayer1.rubric	
ltx/en_us_goadedes/pe.d121:pePE.Prayer1.title	
ltx/en_us_goadedes/pe.d121:pePE.Prayer11.text	
ltx/en_us_goadedes/pe.d121:pePE.Prayer12.text	
ltx/en_us_goadedes/pe.d121:pePE.Prayer13.text	
ltx/en_us_goadedes/pe.d121:pePE.Prayer14.text	
ltx/en_us_goadedes/pe.d121:pePE.Prayer2.rubric	
ltx/en_us_goadedes/pe.d121:pePE.Prayer2.title	
ltx/en_us_goadedes/pe.d121:pePE.Prayer21.text	
ltx/en_us_goadedes/pe.d121:pePE.Prayer22.text	
ltx/en_us_goadedes/pe.d121:pePE.Prayer3.rubric	
ltx/en_us_goadedes/pe.d121:pePE.Prayer3.title	
ltx/en_us_goadedes/pe.d121:pePE.Prayer31.text	
ltx/en_us_goadedes/pe.d121:pePE.Prayer32.text	
ltx/en_us_goadedes/pe.d121:pePE.Prayer33.text	
ltx/en_us_goadedes/pe.d121:pePE.Prayer34.text	
ltx/en_us_goadedes/pe.d121:pePE.Prayer4.rubric	
ltx/en_us_goadedes/pe.d121:pePE.Prayer4.title	
ltx/en_us_goadedes/pe.d121:pePE.Prayer41.text	
ltx/en_us_goadedes/pe.d121:pePE.Prayer5.rubric	
ltx/en_us_goadedes/pe.d121:pePE.Prayer5.title	
ltx/en_us_goadedes/pe.d121:pePE.Prayer51.text	
ltx/en_us_goadedes/pe.d121:pePE.Prayer52.text	
ltx/en_us_goadedes/pe.d121:pePE.Prayer53.text	
ltx/en_us_goadedes/pe.d121:pePE.Prayer54.text	
ltx/en_us_goadedes/pe.d121:pePE.Prayer6.rubric	
ltx/en_us_goadedes/pe.d121:pePE.Prayer6.title	
ltx/en_us_goadedes/pe.d121:pePE.Prayer61.text	
ltx/en_us_goadedes/pe.d121:pePE.Prayer62.text	
ltx/en_us_goadedes/pe.d121:pePE.Prayer63.text	
ltx/en_us_goadedes/pe.d121:pePE.Prayer64.text	
ltx/en_us_goadedes/pe.d121:pePE.Prayer65.text	
ltx/en_us_goadedes/pe.d121:pePE.Prayer7.rubric	
ltx/en_us_goadedes/pe.d121:pePE.Prayer7.title	
ltx/en_us_goadedes/pe.d121:pePE.Prayer71.text	
ltx/en_us_goadedes/pe.d121:peSY.commemoration.couplet1.title	@ltx/en_us_goadedes/titles:ti.Verses
ltx/en_us_goadedes/pe.d121:peSY.commemoration.couplet1.verse1	
ltx/en_us_goadedes/pe.d121:peSY.commemoration.couplet1.verse2	
ltx/en_us_goadedes/pe.d121:peSY.commemoration.narration.p01	
ltx/en_us_goadedes/pe.d121:peSY.commemoration.narration.p02	
ltx/en_us_goadedes/pe.d121:peSY.commemoration.narration.p03	
ltx/en_us_goadedes/pe.d121:peSY.commemoration.narration.p04	
ltx/en_us_goadedes/pe.d121:peSY.commemoration.narration.p05	
ltx/en_us_goadedes/pe.d121:peSY.commemoration.narration.p06	
ltx/en_us_goadedes/pe.d121:peSY.commemoration.narration.p07	
ltx/en_us_goadedes/pe.d121:peSY.commemoration.text	
ltx/en_us_goadedes/pe.d121:peSY.lastline	
ltx/en_us_goadedes/pe.d121:peVE.Apolytikion1.incipit	@ltx/en_us_goadedes/pe.d120:peVE.Apolytikion1.incipit
ltx/en_us_goadedes/pe.d121:peVE.Apolytikion1.melody	
ltx/en_us_goadedes/pe.d121:peVE.Apolytikion1.mode	@ltx/en_us_goadedes/pe.d120:peVE.Apolytikion1.mode
ltx/en_us_goadedes/pe.d121:peVE.Apolytikion1.text	@ltx/en_us_goadedes/pe.d120:peVE.Apolytikion1.text
ltx/en_us_goadedes/pe.d121:peVE.AposGlory.incipit	@ltx/en_us_goadedes/pe.d120:peVE.SticGlory.incipit
ltx/en_us_goadedes/pe.d121:peVE.AposGlory.melody	@ltx/en_us_goadedes/pe.d120:peVE.SticGlory.melody
ltx/en_us_goadedes/pe.d121:peVE.AposGlory.mode	@ltx/en_us_goadedes/pe.d120:peVE.SticGlory.mode
ltx/en_us_goadedes/pe.d121:peVE.AposGlory.text	@ltx/en_us_goadedes/pe.d120:peVE.SticGlory.text
ltx/en_us_goadedes/pe.d121:peVE.Aposticha1.incipit	…
ltx/en_us_goadedes/pe.d121:peVE.Aposticha1.melody	@ltx/en_us_goadedes/miscellanea:misc.Idiomelon
ltx/en_us_goadedes/pe.d121:peVE.Aposticha1.mode	@ltx/en_us_goadedes/miscellanea:misc.Mode3
ltx/en_us_goadedes/pe.d121:peVE.Aposticha1.text	
ltx/en_us_goadedes/pe.d121:peVE.Aposticha2.incipit	…
ltx/en_us_goadedes/pe.d121:peVE.Aposticha2.melody	@ltx/en_us_goadedes/miscellanea:misc.Idiomelon
ltx/en_us_goadedes/pe.d121:peVE.Aposticha2.mode	@ltx/en_us_goadedes/miscellanea:misc.Mode3
ltx/en_us_goadedes/pe.d121:peVE.Aposticha2.text	
ltx/en_us_goadedes/pe.d121:peVE.Aposticha3.incipit	…
ltx/en_us_goadedes/pe.d121:peVE.Aposticha3.melody	@ltx/en_us_goadedes/miscellanea:misc.Idiomelon
ltx/en_us_goadedes/pe.d121:peVE.Aposticha3.mode	@ltx/en_us_goadedes/miscellanea:misc.Mode3
ltx/en_us_goadedes/pe.d121:peVE.Aposticha3.text	
ltx/en_us_goadedes/pe.d121:peVE.MM.Stichera123as345.text	@ltx/en_us_goadedes/properties:media.key
ltx/en_us_goadedes/pe.d121:peVE.MM.Stichera123as567.text	@ltx/en_us_goadedes/properties:media.key
ltx/en_us_goadedes/pe.d121:peVE.SticGlory.incipit	@ltx/en_us_goadedes/pe.d120:peVE.Aposticha3.incipit
ltx/en_us_goadedes/pe.d121:peVE.SticGlory.melody	@ltx/en_us_goadedes/miscellanea:misc.Idiomelon
ltx/en_us_goadedes/pe.d121:peVE.SticGlory.mode	@ltx/en_us_goadedes/miscellanea:misc.Mode6
ltx/en_us_goadedes/pe.d121:peVE.SticGlory.text	@ltx/en_us_goadedes/pe.d120:peVE.Aposticha3.text
ltx/en_us_goadedes/pe.d121:peVE.Stichera01.incipit	@ltx/en_us_goadedes/pe.d120:peMA.Lauds1.incipit
ltx/en_us_goadedes/pe.d121:peVE.Stichera01.melody	
ltx/en_us_goadedes/pe.d121:peVE.Stichera01.mode	@ltx/en_us_goadedes/pe.d120:peMA.Lauds1.mode
ltx/en_us_goadedes/pe.d121:peVE.Stichera01.text	@ltx/en_us_goadedes/pe.d120:peMA.Lauds1.text
ltx/en_us_goadedes/pe.d121:peVE.Stichera02.incipit	@ltx/en_us_goadedes/pe.d120:peMA.Lauds2.incipit
ltx/en_us_goadedes/pe.d121:peVE.Stichera02.melody	
ltx/en_us_goadedes/pe.d121:peVE.Stichera02.mode	@ltx/en_us_goadedes/pe.d120:peMA.Lauds2.mode
ltx/en_us_goadedes/pe.d121:peVE.Stichera02.text	@ltx/en_us_goadedes/pe.d120:peMA.Lauds2.text
ltx/en_us_goadedes/pe.d121:peVE.Stichera03.incipit	@ltx/en_us_goadedes/pe.d120:peMA.Lauds3.incipit
ltx/en_us_goadedes/pe.d121:peVE.Stichera03.melody	
ltx/en_us_goadedes/pe.d121:peVE.Stichera03.mode	@ltx/en_us_goadedes/pe.d120:peMA.Lauds3.mode
ltx/en_us_goadedes/pe.d121:peVE.Stichera03.text	@ltx/en_us_goadedes/pe.d120:peMA.Lauds3.text
