ltx/en_us_goadedes/me.m05.d25:meDA.commemoration.first	
ltx/en_us_goadedes/me.m05.d25:meDA.commemoration.first_name	
ltx/en_us_goadedes/me.m05.d25:meDA.commemoration.first_short	
ltx/en_us_goadedes/me.m05.d25:meDA.commemoration.first_title	@ltx/en_us_goadedes/titles:ti.Forerunner
ltx/en_us_goadedes/me.m05.d25:meDA.commemoration.full	
ltx/en_us_goadedes/me.m05.d25:meDA.commemoration.second_name	
ltx/en_us_goadedes/me.m05.d25:meDA.commemoration.second_title	
ltx/en_us_goadedes/me.m05.d25:meDA.date	
ltx/en_us_goadedes/me.m05.d25:meDA.fordate	
ltx/en_us_goadedes/me.m05.d25:meDA.insert1	
ltx/en_us_goadedes/me.m05.d25:meDA.insert2	
ltx/en_us_goadedes/me.m05.d25:meDA.note	
ltx/en_us_goadedes/me.m05.d25:meDA.pdfcoverdate	
ltx/en_us_goadedes/me.m05.d25:meDA.pdfheaderdate	
ltx/en_us_goadedes/me.m05.d25:meHO.commemorations	
ltx/en_us_goadedes/me.m05.d25:meHO.note1	@ltx/en_us_goadedes/rubrical:ru.HolidayWineOil
ltx/en_us_goadedes/me.m05.d25:meHO.note2	
ltx/en_us_goadedes/me.m05.d25:meHO.number	
ltx/en_us_goadedes/me.m05.d25:meHO.rank	
ltx/en_us_goadedes/me.m05.d25:meLE.commemoration1	
ltx/en_us_goadedes/me.m05.d25:meLE.commemoration2	
ltx/en_us_goadedes/me.m05.d25:meLI.Kontakion1.greekmelody	@ltx/en_us_goadedes/me.m05.d25:meMA.Kontakion1.greekmelody
ltx/en_us_goadedes/me.m05.d25:meLI.Kontakion1.incipit	@ltx/en_us_goadedes/me.m05.d25:meMA.Kontakion1.incipit
ltx/en_us_goadedes/me.m05.d25:meLI.Kontakion1.melody	@ltx/en_us_goadedes/me.m05.d25:meMA.Kontakion1.melody
ltx/en_us_goadedes/me.m05.d25:meLI.Kontakion1.mode	@ltx/en_us_goadedes/me.m05.d25:meMA.Kontakion1.mode
ltx/en_us_goadedes/me.m05.d25:meLI.Kontakion1.text	@ltx/en_us_goadedes/me.m05.d25:meMA.Kontakion1.text
ltx/en_us_goadedes/me.m05.d25:meLI.MM.CommunionHymn.text	@ltx/en_us_goadedes/properties:media.key
ltx/en_us_goadedes/me.m05.d25:meLI.Megalynarion.text	
ltx/en_us_goadedes/me.m05.d25:meMA.C1.poet	@ltx/en_us_goadedes/poets:po.Tarasiou
ltx/en_us_goadedes/me.m05.d25:meMA.C1.title	@ltx/en_us_goadedes/titles:ti.CanonForerunner
ltx/en_us_goadedes/me.m05.d25:meMA.C1.verse	@ltx/en_us_goadedes/prayers:pr.verse_Baptist.text
ltx/en_us_goadedes/me.m05.d25:meMA.ExapTheotokion.incipit	@ltx/en_us_goadedes/me.m05.d21:meMA.ExapTheotokion.incipit
ltx/en_us_goadedes/me.m05.d25:meMA.ExapTheotokion.melody	@ltx/en_us_goadedes/he.a.m2:heAU.ToisMathitaisSynelthomen.name
ltx/en_us_goadedes/me.m05.d25:meMA.ExapTheotokion.mode	@ltx/en_us_goadedes/miscellanea:misc.Mode2
ltx/en_us_goadedes/me.m05.d25:meMA.ExapTheotokion.text	@ltx/en_us_goadedes/me.m05.d21:meMA.ExapTheotokion.text
ltx/en_us_goadedes/me.m05.d25:meMA.Exaposteilarion1.greekmelody	@ltx/en_us_goadedes/he.a.m2:heAU.ToisMathitaisSynelthomen.greekname
ltx/en_us_goadedes/me.m05.d25:meMA.Exaposteilarion1.incipit	…
ltx/en_us_goadedes/me.m05.d25:meMA.Exaposteilarion1.melody	@ltx/en_us_goadedes/he.a.m2:heAU.ToisMathitaisSynelthomen.name
ltx/en_us_goadedes/me.m05.d25:meMA.Exaposteilarion1.mode	@ltx/en_us_goadedes/miscellanea:misc.Mode2
ltx/en_us_goadedes/me.m05.d25:meMA.Exaposteilarion1.text	
ltx/en_us_goadedes/me.m05.d25:meMA.Kathisma11.greekmelody	@ltx/en_us_goadedes/he.a.m4:heAU.TachyProkatalave.greekname
ltx/en_us_goadedes/me.m05.d25:meMA.Kathisma11.incipit	@ltx/en_us_goadedes/me.m02.d24:meVE.Apolytikion1.incipit
ltx/en_us_goadedes/me.m05.d25:meMA.Kathisma11.melody	@ltx/en_us_goadedes/he.a.m4:heAU.TachyProkatalave.name
ltx/en_us_goadedes/me.m05.d25:meMA.Kathisma11.mode	@ltx/en_us_goadedes/miscellanea:misc.Mode4
ltx/en_us_goadedes/me.m05.d25:meMA.Kathisma11.text	@ltx/en_us_goadedes/me.m02.d24:meVE.Apolytikion1.text
ltx/en_us_goadedes/me.m05.d25:meMA.Kathisma1T.incipit	@ltx/en_us_goadedes/me.m05.d18:meMA.Ode3KathismaT.incipit
ltx/en_us_goadedes/me.m05.d25:meMA.Kathisma1T.melody	@ltx/en_us_goadedes/he.a.m4:heAU.TachyProkatalave.name
ltx/en_us_goadedes/me.m05.d25:meMA.Kathisma1T.mode	@ltx/en_us_goadedes/miscellanea:misc.Mode4
ltx/en_us_goadedes/me.m05.d25:meMA.Kathisma1T.text	@ltx/en_us_goadedes/me.m05.d18:meMA.Ode3KathismaT.text
ltx/en_us_goadedes/me.m05.d25:meMA.Kathisma21.greekmelody	@ltx/en_us_goadedes/he.a.m4:heAU.OYpsotheisEnToStavro.greekname
ltx/en_us_goadedes/me.m05.d25:meMA.Kathisma21.incipit	@ltx/en_us_goadedes/me.m02.d24:meMA.Kathisma21.incipit
ltx/en_us_goadedes/me.m05.d25:meMA.Kathisma21.melody	@ltx/en_us_goadedes/he.a.m4:heAU.OYpsotheisEnToStavro.name
ltx/en_us_goadedes/me.m05.d25:meMA.Kathisma21.mode	@ltx/en_us_goadedes/miscellanea:misc.Mode4
ltx/en_us_goadedes/me.m05.d25:meMA.Kathisma21.text	@ltx/en_us_goadedes/me.m02.d24:meMA.Kathisma21.text
ltx/en_us_goadedes/me.m05.d25:meMA.Kathisma2T.incipit	@ltx/en_us_goadedes/ho.ho23:hoCA.Apolytikion2.incipit
ltx/en_us_goadedes/me.m05.d25:meMA.Kathisma2T.melody	
ltx/en_us_goadedes/me.m05.d25:meMA.Kathisma2T.mode	@ltx/en_us_goadedes/miscellanea:misc.Mode4
ltx/en_us_goadedes/me.m05.d25:meMA.Kathisma2T.text	@ltx/en_us_goadedes/ho.ho23:hoCA.Apolytikion2.text
ltx/en_us_goadedes/me.m05.d25:meMA.Kathisma31.greekmelody	@ltx/en_us_goadedes/he.a.m4:heAU.EpefanisSimeron.greekname
ltx/en_us_goadedes/me.m05.d25:meMA.Kathisma31.incipit	@ltx/en_us_goadedes/me.m02.d24:meMA.Kathisma31.incipit
ltx/en_us_goadedes/me.m05.d25:meMA.Kathisma31.melody	@ltx/en_us_goadedes/he.a.m4:heAU.EpefanisSimeron.name
ltx/en_us_goadedes/me.m05.d25:meMA.Kathisma31.mode	@ltx/en_us_goadedes/miscellanea:misc.Mode4
ltx/en_us_goadedes/me.m05.d25:meMA.Kathisma31.text	@ltx/en_us_goadedes/me.m02.d24:meMA.Kathisma31.text
ltx/en_us_goadedes/me.m05.d25:meMA.Kathisma3T.incipit	@ltx/en_us_goadedes/me.m01.d30:meMA.Kathisma3T.incipit
ltx/en_us_goadedes/me.m05.d25:meMA.Kathisma3T.melody	@ltx/en_us_goadedes/he.a.m4:heAU.EpefanisSimeron.name
ltx/en_us_goadedes/me.m05.d25:meMA.Kathisma3T.mode	@ltx/en_us_goadedes/miscellanea:misc.Mode4
ltx/en_us_goadedes/me.m05.d25:meMA.Kathisma3T.text	@ltx/en_us_goadedes/me.m01.d30:meMA.Kathisma3T.text
ltx/en_us_goadedes/me.m05.d25:meMA.Kontakion1.greekmelody	@ltx/en_us_goadedes/he.a.m6:heAU.TinYperImon.greekname
ltx/en_us_goadedes/me.m05.d25:meMA.Kontakion1.incipit	In the world is he…
ltx/en_us_goadedes/me.m05.d25:meMA.Kontakion1.melody	@ltx/en_us_goadedes/he.a.m6:heAU.TinYperImon.name
ltx/en_us_goadedes/me.m05.d25:meMA.Kontakion1.mode	@ltx/en_us_goadedes/miscellanea:misc.Mode6
ltx/en_us_goadedes/me.m05.d25:meMA.Kontakion1.text	In the world is he a divine and brilliant pillar; * he is the noetic Sun’s lamp and Forerunner. * By revealing today his divine and luminous head * to the farthest reaches of the earth, * he sanctifies those who faithfully * venerate it and cry out to him, * “O wise Baptist of Christ, we pray you, save us all.”
ltx/en_us_goadedes/me.m05.d25:meMA.Lauds1.greekmelody	@ltx/en_us_goadedes/he.a.m5:heAU.ChairoisAskitikon.greekname
ltx/en_us_goadedes/me.m05.d25:meMA.Lauds1.incipit	…
ltx/en_us_goadedes/me.m05.d25:meMA.Lauds1.melody	@ltx/en_us_goadedes/he.a.m5:heAU.ChairoisAskitikon.name
ltx/en_us_goadedes/me.m05.d25:meMA.Lauds1.mode	@ltx/en_us_goadedes/miscellanea:misc.Mode5
ltx/en_us_goadedes/me.m05.d25:meMA.Lauds1.text	
ltx/en_us_goadedes/me.m05.d25:meMA.Lauds2.incipit	…
ltx/en_us_goadedes/me.m05.d25:meMA.Lauds2.melody	@ltx/en_us_goadedes/he.a.m5:heAU.ChairoisAskitikon.name
ltx/en_us_goadedes/me.m05.d25:meMA.Lauds2.mode	@ltx/en_us_goadedes/miscellanea:misc.Mode5
ltx/en_us_goadedes/me.m05.d25:meMA.Lauds2.text	
ltx/en_us_goadedes/me.m05.d25:meMA.Lauds3.incipit	…
ltx/en_us_goadedes/me.m05.d25:meMA.Lauds3.melody	@ltx/en_us_goadedes/he.a.m5:heAU.ChairoisAskitikon.name
ltx/en_us_goadedes/me.m05.d25:meMA.Lauds3.mode	@ltx/en_us_goadedes/miscellanea:misc.Mode5
ltx/en_us_goadedes/me.m05.d25:meMA.Lauds3.text	
ltx/en_us_goadedes/me.m05.d25:meMA.LaudsGlory.incipit	@ltx/en_us_goadedes/me.m02.d24:meMA.LaudsGlory.incipit
ltx/en_us_goadedes/me.m05.d25:meMA.LaudsGlory.melody	
ltx/en_us_goadedes/me.m05.d25:meMA.LaudsGlory.mode	@ltx/en_us_goadedes/miscellanea:misc.Mode6
ltx/en_us_goadedes/me.m05.d25:meMA.LaudsGlory.text	@ltx/en_us_goadedes/me.m02.d24:meMA.LaudsGlory.text
ltx/en_us_goadedes/me.m05.d25:meMA.LaudsTheotokion.incipit	@ltx/en_us_goadedes/he.o:heOT.TheotokeSyEi.incipit
ltx/en_us_goadedes/me.m05.d25:meMA.LaudsTheotokion.melody	@ltx/en_us_goadedes/he.o:heOT.TheotokeSyEi.name
ltx/en_us_goadedes/me.m05.d25:meMA.LaudsTheotokion.mode	@ltx/en_us_goadedes/miscellanea:misc.Mode6
ltx/en_us_goadedes/me.m05.d25:meMA.LaudsTheotokion.text	@ltx/en_us_goadedes/he.o:heOT.TheotokeSyEiProdromou.text
ltx/en_us_goadedes/me.m05.d25:meMA.MM.Lauds123as456.text	@ltx/en_us_goadedes/properties:media.key
ltx/en_us_goadedes/me.m05.d25:meMA.Ode1C11.greekmelody	@ltx/en_us_goadedes/he.h.m8:heHE.ArmatilatinFarao.greekname
ltx/en_us_goadedes/me.m05.d25:meMA.Ode1C11.incipit	…
ltx/en_us_goadedes/me.m05.d25:meMA.Ode1C11.melody	@ltx/en_us_goadedes/he.h.m8:heHE.ArmatilatinFarao.name
ltx/en_us_goadedes/me.m05.d25:meMA.Ode1C11.mode	@ltx/en_us_goadedes/miscellanea:misc.Mode8
ltx/en_us_goadedes/me.m05.d25:meMA.Ode1C11.ode	@ltx/en_us_goadedes/miscellanea:misc.Ode1
ltx/en_us_goadedes/me.m05.d25:meMA.Ode1C11.text	
ltx/en_us_goadedes/me.m05.d25:meMA.Ode1C12.incipit	…
ltx/en_us_goadedes/me.m05.d25:meMA.Ode1C12.melody	@ltx/en_us_goadedes/he.h.m8:heHE.ArmatilatinFarao.name
ltx/en_us_goadedes/me.m05.d25:meMA.Ode1C12.mode	@ltx/en_us_goadedes/miscellanea:misc.Mode8
ltx/en_us_goadedes/me.m05.d25:meMA.Ode1C12.ode	@ltx/en_us_goadedes/miscellanea:misc.Ode1
ltx/en_us_goadedes/me.m05.d25:meMA.Ode1C12.text	
ltx/en_us_goadedes/me.m05.d25:meMA.Ode1C13.incipit	…
ltx/en_us_goadedes/me.m05.d25:meMA.Ode1C13.melody	@ltx/en_us_goadedes/he.h.m8:heHE.ArmatilatinFarao.name
ltx/en_us_goadedes/me.m05.d25:meMA.Ode1C13.mode	@ltx/en_us_goadedes/miscellanea:misc.Mode8
ltx/en_us_goadedes/me.m05.d25:meMA.Ode1C13.ode	@ltx/en_us_goadedes/miscellanea:misc.Ode1
ltx/en_us_goadedes/me.m05.d25:meMA.Ode1C13.text	
ltx/en_us_goadedes/me.m05.d25:meMA.Ode1C1T.incipit	…
ltx/en_us_goadedes/me.m05.d25:meMA.Ode1C1T.melody	@ltx/en_us_goadedes/he.h.m8:heHE.ArmatilatinFarao.name
ltx/en_us_goadedes/me.m05.d25:meMA.Ode1C1T.mode	@ltx/en_us_goadedes/miscellanea:misc.Mode8
ltx/en_us_goadedes/me.m05.d25:meMA.Ode1C1T.ode	@ltx/en_us_goadedes/miscellanea:misc.Ode1
ltx/en_us_goadedes/me.m05.d25:meMA.Ode1C1T.text	
ltx/en_us_goadedes/me.m05.d25:meMA.Ode3C11.greekmelody	@ltx/en_us_goadedes/he.h.m8:heHE.OuraniasApsidos.greekname
ltx/en_us_goadedes/me.m05.d25:meMA.Ode3C11.incipit	…
ltx/en_us_goadedes/me.m05.d25:meMA.Ode3C11.melody	@ltx/en_us_goadedes/he.h.m8:heHE.OuraniasApsidos.name
ltx/en_us_goadedes/me.m05.d25:meMA.Ode3C11.mode	@ltx/en_us_goadedes/miscellanea:misc.Mode8
ltx/en_us_goadedes/me.m05.d25:meMA.Ode3C11.ode	@ltx/en_us_goadedes/miscellanea:misc.Ode3
ltx/en_us_goadedes/me.m05.d25:meMA.Ode3C11.text	
ltx/en_us_goadedes/me.m05.d25:meMA.Ode3C12.incipit	…
ltx/en_us_goadedes/me.m05.d25:meMA.Ode3C12.melody	@ltx/en_us_goadedes/he.h.m8:heHE.OuraniasApsidos.name
ltx/en_us_goadedes/me.m05.d25:meMA.Ode3C12.mode	@ltx/en_us_goadedes/miscellanea:misc.Mode8
ltx/en_us_goadedes/me.m05.d25:meMA.Ode3C12.ode	@ltx/en_us_goadedes/miscellanea:misc.Ode3
ltx/en_us_goadedes/me.m05.d25:meMA.Ode3C12.text	
ltx/en_us_goadedes/me.m05.d25:meMA.Ode3C13.incipit	…
ltx/en_us_goadedes/me.m05.d25:meMA.Ode3C13.melody	@ltx/en_us_goadedes/he.h.m8:heHE.OuraniasApsidos.name
ltx/en_us_goadedes/me.m05.d25:meMA.Ode3C13.mode	@ltx/en_us_goadedes/miscellanea:misc.Mode8
ltx/en_us_goadedes/me.m05.d25:meMA.Ode3C13.ode	@ltx/en_us_goadedes/miscellanea:misc.Ode3
ltx/en_us_goadedes/me.m05.d25:meMA.Ode3C13.text	
ltx/en_us_goadedes/me.m05.d25:meMA.Ode3C1T.incipit	…
ltx/en_us_goadedes/me.m05.d25:meMA.Ode3C1T.melody	@ltx/en_us_goadedes/he.h.m8:heHE.OuraniasApsidos.name
ltx/en_us_goadedes/me.m05.d25:meMA.Ode3C1T.mode	@ltx/en_us_goadedes/miscellanea:misc.Mode8
ltx/en_us_goadedes/me.m05.d25:meMA.Ode3C1T.ode	@ltx/en_us_goadedes/miscellanea:misc.Ode3
ltx/en_us_goadedes/me.m05.d25:meMA.Ode3C1T.text	
ltx/en_us_goadedes/me.m05.d25:meMA.Ode3Kathisma1.greekmelody	@ltx/en_us_goadedes/he.a.m4:heAU.EpefanisSimeron.greekname
ltx/en_us_goadedes/me.m05.d25:meMA.Ode3Kathisma1.incipit	…
ltx/en_us_goadedes/me.m05.d25:meMA.Ode3Kathisma1.melody	@ltx/en_us_goadedes/he.a.m4:heAU.EpefanisSimeron.name
ltx/en_us_goadedes/me.m05.d25:meMA.Ode3Kathisma1.mode	@ltx/en_us_goadedes/miscellanea:misc.Mode4
ltx/en_us_goadedes/me.m05.d25:meMA.Ode3Kathisma1.text	
ltx/en_us_goadedes/me.m05.d25:meMA.Ode3KathismaT.incipit	@ltx/en_us_goadedes/me.m05.d25:meMA.Kathisma3T.incipit
ltx/en_us_goadedes/me.m05.d25:meMA.Ode3KathismaT.melody	@ltx/en_us_goadedes/he.a.m4:heAU.EpefanisSimeron.name
ltx/en_us_goadedes/me.m05.d25:meMA.Ode3KathismaT.mode	@ltx/en_us_goadedes/miscellanea:misc.Mode4
ltx/en_us_goadedes/me.m05.d25:meMA.Ode3KathismaT.text	@ltx/en_us_goadedes/me.m05.d25:meMA.Kathisma3T.text
ltx/en_us_goadedes/me.m05.d25:meMA.Ode4C11.greekmelody	@ltx/en_us_goadedes/he.h.m8:heHE.EisakikoaKyrie.greekname
ltx/en_us_goadedes/me.m05.d25:meMA.Ode4C11.incipit	…
ltx/en_us_goadedes/me.m05.d25:meMA.Ode4C11.melody	@ltx/en_us_goadedes/he.h.m8:heHE.EisakikoaKyrie.name
ltx/en_us_goadedes/me.m05.d25:meMA.Ode4C11.mode	@ltx/en_us_goadedes/miscellanea:misc.Mode8
ltx/en_us_goadedes/me.m05.d25:meMA.Ode4C11.ode	@ltx/en_us_goadedes/miscellanea:misc.Ode4
ltx/en_us_goadedes/me.m05.d25:meMA.Ode4C11.text	
ltx/en_us_goadedes/me.m05.d25:meMA.Ode4C12.incipit	…
ltx/en_us_goadedes/me.m05.d25:meMA.Ode4C12.melody	@ltx/en_us_goadedes/he.h.m8:heHE.EisakikoaKyrie.name
ltx/en_us_goadedes/me.m05.d25:meMA.Ode4C12.mode	@ltx/en_us_goadedes/miscellanea:misc.Mode8
ltx/en_us_goadedes/me.m05.d25:meMA.Ode4C12.ode	@ltx/en_us_goadedes/miscellanea:misc.Ode4
ltx/en_us_goadedes/me.m05.d25:meMA.Ode4C12.text	
ltx/en_us_goadedes/me.m05.d25:meMA.Ode4C13.incipit	…
ltx/en_us_goadedes/me.m05.d25:meMA.Ode4C13.melody	@ltx/en_us_goadedes/he.h.m8:heHE.EisakikoaKyrie.name
ltx/en_us_goadedes/me.m05.d25:meMA.Ode4C13.mode	@ltx/en_us_goadedes/miscellanea:misc.Mode8
ltx/en_us_goadedes/me.m05.d25:meMA.Ode4C13.ode	@ltx/en_us_goadedes/miscellanea:misc.Ode4
ltx/en_us_goadedes/me.m05.d25:meMA.Ode4C13.text	
ltx/en_us_goadedes/me.m05.d25:meMA.Ode4C1T.incipit	…
ltx/en_us_goadedes/me.m05.d25:meMA.Ode4C1T.melody	@ltx/en_us_goadedes/he.h.m8:heHE.EisakikoaKyrie.name
ltx/en_us_goadedes/me.m05.d25:meMA.Ode4C1T.mode	@ltx/en_us_goadedes/miscellanea:misc.Mode8
ltx/en_us_goadedes/me.m05.d25:meMA.Ode4C1T.ode	@ltx/en_us_goadedes/miscellanea:misc.Ode4
ltx/en_us_goadedes/me.m05.d25:meMA.Ode4C1T.text	
ltx/en_us_goadedes/me.m05.d25:meMA.Ode5C11.greekmelody	@ltx/en_us_goadedes/he.h.m8:heHE.InaTiMeAposo.greekname
ltx/en_us_goadedes/me.m05.d25:meMA.Ode5C11.incipit	…
ltx/en_us_goadedes/me.m05.d25:meMA.Ode5C11.melody	@ltx/en_us_goadedes/he.h.m8:heHE.InaTiMeAposo.name
ltx/en_us_goadedes/me.m05.d25:meMA.Ode5C11.mode	@ltx/en_us_goadedes/miscellanea:misc.Mode8
ltx/en_us_goadedes/me.m05.d25:meMA.Ode5C11.ode	@ltx/en_us_goadedes/miscellanea:misc.Ode5
ltx/en_us_goadedes/me.m05.d25:meMA.Ode5C11.text	
ltx/en_us_goadedes/me.m05.d25:meMA.Ode5C12.incipit	…
ltx/en_us_goadedes/me.m05.d25:meMA.Ode5C12.melody	@ltx/en_us_goadedes/he.h.m8:heHE.InaTiMeAposo.name
ltx/en_us_goadedes/me.m05.d25:meMA.Ode5C12.mode	@ltx/en_us_goadedes/miscellanea:misc.Mode8
ltx/en_us_goadedes/me.m05.d25:meMA.Ode5C12.ode	@ltx/en_us_goadedes/miscellanea:misc.Ode5
ltx/en_us_goadedes/me.m05.d25:meMA.Ode5C12.text	
ltx/en_us_goadedes/me.m05.d25:meMA.Ode5C13.incipit	…
ltx/en_us_goadedes/me.m05.d25:meMA.Ode5C13.melody	@ltx/en_us_goadedes/he.h.m8:heHE.InaTiMeAposo.name
ltx/en_us_goadedes/me.m05.d25:meMA.Ode5C13.mode	@ltx/en_us_goadedes/miscellanea:misc.Mode8
ltx/en_us_goadedes/me.m05.d25:meMA.Ode5C13.ode	@ltx/en_us_goadedes/miscellanea:misc.Ode5
ltx/en_us_goadedes/me.m05.d25:meMA.Ode5C13.text	
ltx/en_us_goadedes/me.m05.d25:meMA.Ode5C1T.incipit	…
ltx/en_us_goadedes/me.m05.d25:meMA.Ode5C1T.melody	@ltx/en_us_goadedes/he.h.m8:heHE.InaTiMeAposo.name
ltx/en_us_goadedes/me.m05.d25:meMA.Ode5C1T.mode	@ltx/en_us_goadedes/miscellanea:misc.Mode8
ltx/en_us_goadedes/me.m05.d25:meMA.Ode5C1T.ode	@ltx/en_us_goadedes/miscellanea:misc.Ode5
ltx/en_us_goadedes/me.m05.d25:meMA.Ode5C1T.text	
ltx/en_us_goadedes/me.m05.d25:meMA.Ode6C11.greekmelody	@ltx/en_us_goadedes/he.h.m8:heHE.IlasthitiMoiSotir.greekname
ltx/en_us_goadedes/me.m05.d25:meMA.Ode6C11.incipit	O Christ, when the precious…
ltx/en_us_goadedes/me.m05.d25:meMA.Ode6C11.melody	@ltx/en_us_goadedes/he.h.m8:heHE.IlasthitiMoiSotir.name
ltx/en_us_goadedes/me.m05.d25:meMA.Ode6C11.mode	@ltx/en_us_goadedes/miscellanea:misc.Mode8
ltx/en_us_goadedes/me.m05.d25:meMA.Ode6C11.ode	@ltx/en_us_goadedes/miscellanea:misc.Ode6
ltx/en_us_goadedes/me.m05.d25:meMA.Ode6C11.text	O Christ, when the precious head * of John the Baptist, Your Forerunner, * was exhumed from the earth, * the truth like the sun arose, * dispelling the winter of heresy and falsehood, * while enlightening the whole wide world.
ltx/en_us_goadedes/me.m05.d25:meMA.Ode6C12.incipit	Believers, come forth…
ltx/en_us_goadedes/me.m05.d25:meMA.Ode6C12.melody	@ltx/en_us_goadedes/he.h.m8:heHE.IlasthitiMoiSotir.name
ltx/en_us_goadedes/me.m05.d25:meMA.Ode6C12.mode	@ltx/en_us_goadedes/miscellanea:misc.Mode8
ltx/en_us_goadedes/me.m05.d25:meMA.Ode6C12.ode	@ltx/en_us_goadedes/miscellanea:misc.Ode6
ltx/en_us_goadedes/me.m05.d25:meMA.Ode6C12.text	Believers, come forth and draw * illumination, the grace of God, * and mercy, and have your heads * and souls sanctified, when you * with faith venerate the head of St. John the Baptist, * who in the river touched the head of God.
ltx/en_us_goadedes/me.m05.d25:meMA.Ode6C13.incipit	O Forerunner, pray…
ltx/en_us_goadedes/me.m05.d25:meMA.Ode6C13.melody	@ltx/en_us_goadedes/he.h.m8:heHE.IlasthitiMoiSotir.name
ltx/en_us_goadedes/me.m05.d25:meMA.Ode6C13.mode	@ltx/en_us_goadedes/miscellanea:misc.Mode8
ltx/en_us_goadedes/me.m05.d25:meMA.Ode6C13.ode	@ltx/en_us_goadedes/miscellanea:misc.Ode6
ltx/en_us_goadedes/me.m05.d25:meMA.Ode6C13.text	O Forerunner, pray to God * to crush the heads of our enemies * attacking us and defend * the country wherein we live, * so that we may lovingly venerate your precious * head that castigated Herod of old.
ltx/en_us_goadedes/me.m05.d25:meMA.Ode6C1T.incipit	O blessed Forerunner…
ltx/en_us_goadedes/me.m05.d25:meMA.Ode6C1T.melody	@ltx/en_us_goadedes/he.h.m8:heHE.IlasthitiMoiSotir.name
ltx/en_us_goadedes/me.m05.d25:meMA.Ode6C1T.mode	@ltx/en_us_goadedes/miscellanea:misc.Mode8
ltx/en_us_goadedes/me.m05.d25:meMA.Ode6C1T.ode	@ltx/en_us_goadedes/miscellanea:misc.Ode6
ltx/en_us_goadedes/me.m05.d25:meMA.Ode6C1T.text	O blessed Forerunner John, * when you went down to the netherworld, * you preached to those who were there * that Light had become a man, * incarnate of virgin blood, and that He was coming * for the good of all humanity.
ltx/en_us_goadedes/me.m05.d25:meMA.Ode7C11.greekmelody	@ltx/en_us_goadedes/he.h.m8:heHE.OiEkTisIoudaias.greekname
ltx/en_us_goadedes/me.m05.d25:meMA.Ode7C11.incipit	…
ltx/en_us_goadedes/me.m05.d25:meMA.Ode7C11.melody	@ltx/en_us_goadedes/he.h.m8:heHE.OiEkTisIoudaias.name
ltx/en_us_goadedes/me.m05.d25:meMA.Ode7C11.mode	@ltx/en_us_goadedes/miscellanea:misc.Mode8
ltx/en_us_goadedes/me.m05.d25:meMA.Ode7C11.ode	@ltx/en_us_goadedes/miscellanea:misc.Ode7
ltx/en_us_goadedes/me.m05.d25:meMA.Ode7C11.text	
ltx/en_us_goadedes/me.m05.d25:meMA.Ode7C12.incipit	…
ltx/en_us_goadedes/me.m05.d25:meMA.Ode7C12.melody	@ltx/en_us_goadedes/he.h.m8:heHE.OiEkTisIoudaias.name
ltx/en_us_goadedes/me.m05.d25:meMA.Ode7C12.mode	@ltx/en_us_goadedes/miscellanea:misc.Mode8
ltx/en_us_goadedes/me.m05.d25:meMA.Ode7C12.ode	@ltx/en_us_goadedes/miscellanea:misc.Ode7
ltx/en_us_goadedes/me.m05.d25:meMA.Ode7C12.text	
ltx/en_us_goadedes/me.m05.d25:meMA.Ode7C13.incipit	…
ltx/en_us_goadedes/me.m05.d25:meMA.Ode7C13.melody	@ltx/en_us_goadedes/he.h.m8:heHE.OiEkTisIoudaias.name
ltx/en_us_goadedes/me.m05.d25:meMA.Ode7C13.mode	@ltx/en_us_goadedes/miscellanea:misc.Mode8
ltx/en_us_goadedes/me.m05.d25:meMA.Ode7C13.ode	@ltx/en_us_goadedes/miscellanea:misc.Ode7
ltx/en_us_goadedes/me.m05.d25:meMA.Ode7C13.text	
ltx/en_us_goadedes/me.m05.d25:meMA.Ode7C1T.incipit	…
ltx/en_us_goadedes/me.m05.d25:meMA.Ode7C1T.melody	@ltx/en_us_goadedes/he.h.m8:heHE.OiEkTisIoudaias.name
ltx/en_us_goadedes/me.m05.d25:meMA.Ode7C1T.mode	@ltx/en_us_goadedes/miscellanea:misc.Mode8
ltx/en_us_goadedes/me.m05.d25:meMA.Ode7C1T.ode	@ltx/en_us_goadedes/miscellanea:misc.Ode7
ltx/en_us_goadedes/me.m05.d25:meMA.Ode7C1T.text	
ltx/en_us_goadedes/me.m05.d25:meMA.Ode8C11.greekmelody	@ltx/en_us_goadedes/he.h.m8:heHE.EptaplasiosKaminon.greekname
ltx/en_us_goadedes/me.m05.d25:meMA.Ode8C11.incipit	…
ltx/en_us_goadedes/me.m05.d25:meMA.Ode8C11.melody	@ltx/en_us_goadedes/he.h.m8:heHE.EptaplasiosKaminon.name
ltx/en_us_goadedes/me.m05.d25:meMA.Ode8C11.mode	@ltx/en_us_goadedes/miscellanea:misc.Mode8
ltx/en_us_goadedes/me.m05.d25:meMA.Ode8C11.ode	@ltx/en_us_goadedes/miscellanea:misc.Ode8
ltx/en_us_goadedes/me.m05.d25:meMA.Ode8C11.text	
ltx/en_us_goadedes/me.m05.d25:meMA.Ode8C12.incipit	…
ltx/en_us_goadedes/me.m05.d25:meMA.Ode8C12.melody	@ltx/en_us_goadedes/he.h.m8:heHE.EptaplasiosKaminon.name
ltx/en_us_goadedes/me.m05.d25:meMA.Ode8C12.mode	@ltx/en_us_goadedes/miscellanea:misc.Mode8
ltx/en_us_goadedes/me.m05.d25:meMA.Ode8C12.ode	@ltx/en_us_goadedes/miscellanea:misc.Ode8
ltx/en_us_goadedes/me.m05.d25:meMA.Ode8C12.text	
ltx/en_us_goadedes/me.m05.d25:meMA.Ode8C13.incipit	…
ltx/en_us_goadedes/me.m05.d25:meMA.Ode8C13.melody	@ltx/en_us_goadedes/he.h.m8:heHE.EptaplasiosKaminon.name
ltx/en_us_goadedes/me.m05.d25:meMA.Ode8C13.mode	@ltx/en_us_goadedes/miscellanea:misc.Mode8
ltx/en_us_goadedes/me.m05.d25:meMA.Ode8C13.ode	@ltx/en_us_goadedes/miscellanea:misc.Ode8
ltx/en_us_goadedes/me.m05.d25:meMA.Ode8C13.text	
ltx/en_us_goadedes/me.m05.d25:meMA.Ode8C1T.incipit	…
ltx/en_us_goadedes/me.m05.d25:meMA.Ode8C1T.melody	@ltx/en_us_goadedes/he.h.m8:heHE.EptaplasiosKaminon.name
ltx/en_us_goadedes/me.m05.d25:meMA.Ode8C1T.mode	@ltx/en_us_goadedes/miscellanea:misc.Mode8
ltx/en_us_goadedes/me.m05.d25:meMA.Ode8C1T.ode	@ltx/en_us_goadedes/miscellanea:misc.Ode8
ltx/en_us_goadedes/me.m05.d25:meMA.Ode8C1T.text	
ltx/en_us_goadedes/me.m05.d25:meMA.Ode9C11.greekmelody	@ltx/en_us_goadedes/he.h.m8:heHE.EfrixePasaAkoi.greekname
ltx/en_us_goadedes/me.m05.d25:meMA.Ode9C11.incipit	…
ltx/en_us_goadedes/me.m05.d25:meMA.Ode9C11.melody	@ltx/en_us_goadedes/he.h.m8:heHE.EfrixePasaAkoi.name
ltx/en_us_goadedes/me.m05.d25:meMA.Ode9C11.mode	@ltx/en_us_goadedes/miscellanea:misc.Mode8
ltx/en_us_goadedes/me.m05.d25:meMA.Ode9C11.ode	@ltx/en_us_goadedes/miscellanea:misc.Ode9
ltx/en_us_goadedes/me.m05.d25:meMA.Ode9C11.text	
ltx/en_us_goadedes/me.m05.d25:meMA.Ode9C12.incipit	…
ltx/en_us_goadedes/me.m05.d25:meMA.Ode9C12.melody	@ltx/en_us_goadedes/he.h.m8:heHE.EfrixePasaAkoi.name
ltx/en_us_goadedes/me.m05.d25:meMA.Ode9C12.mode	@ltx/en_us_goadedes/miscellanea:misc.Mode8
ltx/en_us_goadedes/me.m05.d25:meMA.Ode9C12.ode	@ltx/en_us_goadedes/miscellanea:misc.Ode9
ltx/en_us_goadedes/me.m05.d25:meMA.Ode9C12.text	
ltx/en_us_goadedes/me.m05.d25:meMA.Ode9C13.incipit	…
ltx/en_us_goadedes/me.m05.d25:meMA.Ode9C13.melody	@ltx/en_us_goadedes/he.h.m8:heHE.EfrixePasaAkoi.name
ltx/en_us_goadedes/me.m05.d25:meMA.Ode9C13.mode	@ltx/en_us_goadedes/miscellanea:misc.Mode8
ltx/en_us_goadedes/me.m05.d25:meMA.Ode9C13.ode	@ltx/en_us_goadedes/miscellanea:misc.Ode9
ltx/en_us_goadedes/me.m05.d25:meMA.Ode9C13.text	
ltx/en_us_goadedes/me.m05.d25:meMA.Ode9C1T.incipit	…
ltx/en_us_goadedes/me.m05.d25:meMA.Ode9C1T.melody	@ltx/en_us_goadedes/he.h.m8:heHE.EfrixePasaAkoi.name
ltx/en_us_goadedes/me.m05.d25:meMA.Ode9C1T.mode	@ltx/en_us_goadedes/miscellanea:misc.Mode8
ltx/en_us_goadedes/me.m05.d25:meMA.Ode9C1T.ode	@ltx/en_us_goadedes/miscellanea:misc.Ode9
ltx/en_us_goadedes/me.m05.d25:meMA.Ode9C1T.text	
ltx/en_us_goadedes/me.m05.d25:meMA.Oikos1.text	
ltx/en_us_goadedes/me.m05.d25:meMA.PostGospelBoth.incipit	@ltx/en_us_goadedes/ho.ho03:hoMA.PostGospelTheotokos.incipit
ltx/en_us_goadedes/me.m05.d25:meMA.PostGospelBoth.melody	
ltx/en_us_goadedes/me.m05.d25:meMA.PostGospelBoth.mode	@ltx/en_us_goadedes/miscellanea:misc.Mode2
ltx/en_us_goadedes/me.m05.d25:meMA.PostGospelBoth.text	@ltx/en_us_goadedes/ho.ho03:hoMA.PostGospelTheotokos.text
ltx/en_us_goadedes/me.m05.d25:meMA.PostGospelGlory.incipit	@ltx/en_us_goadedes/ho.ho03:hoMA.PostGospelForerunner.incipit
ltx/en_us_goadedes/me.m05.d25:meMA.PostGospelGlory.melody	
ltx/en_us_goadedes/me.m05.d25:meMA.PostGospelGlory.mode	@ltx/en_us_goadedes/miscellanea:misc.Mode2
ltx/en_us_goadedes/me.m05.d25:meMA.PostGospelGlory.text	@ltx/en_us_goadedes/ho.ho03:hoMA.PostGospelForerunner.text
ltx/en_us_goadedes/me.m05.d25:meMA.PostGospelIdiomelon.incipit	@ltx/en_us_goadedes/me.m02.d24:meVE.AposGlory.incipit
ltx/en_us_goadedes/me.m05.d25:meMA.PostGospelIdiomelon.melody	
ltx/en_us_goadedes/me.m05.d25:meMA.PostGospelIdiomelon.mode	@ltx/en_us_goadedes/miscellanea:misc.Mode2
ltx/en_us_goadedes/me.m05.d25:meMA.PostGospelIdiomelon.text	@ltx/en_us_goadedes/me.m02.d24:meVE.AposGlory.text
ltx/en_us_goadedes/me.m05.d25:meR001	
ltx/en_us_goadedes/me.m05.d25:meVE.Apolytikion1.greekmelody	@ltx/en_us_goadedes/he.a.m4:heAU.TachyProkatalave.greekname
ltx/en_us_goadedes/me.m05.d25:meVE.Apolytikion1.incipit	@ltx/en_us_goadedes/me.m02.d24:meMA.Kathisma11.incipit
ltx/en_us_goadedes/me.m05.d25:meVE.Apolytikion1.melody	@ltx/en_us_goadedes/he.a.m4:heAU.TachyProkatalave.name
ltx/en_us_goadedes/me.m05.d25:meVE.Apolytikion1.mode	@ltx/en_us_goadedes/miscellanea:misc.Mode4
ltx/en_us_goadedes/me.m05.d25:meVE.Apolytikion1.text	@ltx/en_us_goadedes/me.m02.d24:meMA.Kathisma11.text
ltx/en_us_goadedes/me.m05.d25:meVE.AposGlory.incipit	@ltx/en_us_goadedes/me.m02.d24:meVE.AposGlory.incipit
ltx/en_us_goadedes/me.m05.d25:meVE.AposGlory.melody	@ltx/en_us_goadedes/miscellanea:misc.Idiomelon
ltx/en_us_goadedes/me.m05.d25:meVE.AposGlory.mode	@ltx/en_us_goadedes/miscellanea:misc.Mode2
ltx/en_us_goadedes/me.m05.d25:meVE.AposGlory.text	@ltx/en_us_goadedes/me.m02.d24:meVE.AposGlory.text
ltx/en_us_goadedes/me.m05.d25:meVE.AposTheotokion.incipit	@ltx/en_us_goadedes/oc.m2.d2:ocVE.AposTheotokion.incipit
ltx/en_us_goadedes/me.m05.d25:meVE.AposTheotokion.melody	
ltx/en_us_goadedes/me.m05.d25:meVE.AposTheotokion.mode	@ltx/en_us_goadedes/miscellanea:misc.Mode2
ltx/en_us_goadedes/me.m05.d25:meVE.AposTheotokion.text	@ltx/en_us_goadedes/oc.m2.d2:ocVE.AposTheotokion.text
ltx/en_us_goadedes/me.m05.d25:meVE.Aposticha1.greekmelody	@ltx/en_us_goadedes/he.a.m2:heAU.OteEkTouXylou.greekname
ltx/en_us_goadedes/me.m05.d25:meVE.Aposticha1.incipit	@ltx/en_us_goadedes/me.m02.d25:meVE.Stichera01.incipit
ltx/en_us_goadedes/me.m05.d25:meVE.Aposticha1.melody	@ltx/en_us_goadedes/he.a.m2:heAU.OteEkTouXylou.name
ltx/en_us_goadedes/me.m05.d25:meVE.Aposticha1.mode	@ltx/en_us_goadedes/miscellanea:misc.Mode2
ltx/en_us_goadedes/me.m05.d25:meVE.Aposticha1.text	@ltx/en_us_goadedes/me.m02.d25:meVE.Stichera01.text
ltx/en_us_goadedes/me.m05.d25:meVE.Aposticha2.incipit	…
ltx/en_us_goadedes/me.m05.d25:meVE.Aposticha2.melody	@ltx/en_us_goadedes/he.a.m2:heAU.OteEkTouXylou.name
ltx/en_us_goadedes/me.m05.d25:meVE.Aposticha2.mode	@ltx/en_us_goadedes/miscellanea:misc.Mode2
ltx/en_us_goadedes/me.m05.d25:meVE.Aposticha2.text	
ltx/en_us_goadedes/me.m05.d25:meVE.Aposticha3.incipit	…
ltx/en_us_goadedes/me.m05.d25:meVE.Aposticha3.melody	@ltx/en_us_goadedes/he.a.m2:heAU.OteEkTouXylou.name
ltx/en_us_goadedes/me.m05.d25:meVE.Aposticha3.mode	@ltx/en_us_goadedes/miscellanea:misc.Mode2
ltx/en_us_goadedes/me.m05.d25:meVE.Aposticha3.text	
ltx/en_us_goadedes/me.m05.d25:meVE.SticGlory.incipit	@ltx/en_us_goadedes/me.m02.d24:meVE.SticGlory.incipit
ltx/en_us_goadedes/me.m05.d25:meVE.SticGlory.melody	@ltx/en_us_goadedes/miscellanea:misc.Idiomelon
ltx/en_us_goadedes/me.m05.d25:meVE.SticGlory.mode	@ltx/en_us_goadedes/miscellanea:misc.Mode6
ltx/en_us_goadedes/me.m05.d25:meVE.SticGlory.text	@ltx/en_us_goadedes/me.m02.d24:meVE.SticGlory.text
ltx/en_us_goadedes/me.m05.d25:meVE.SticTheotokion.incipit	@ltx/en_us_goadedes/oc.m6.d1:ocVE.SticTheotokion.incipit
ltx/en_us_goadedes/me.m05.d25:meVE.SticTheotokion.melody	
ltx/en_us_goadedes/me.m05.d25:meVE.SticTheotokion.mode	@ltx/en_us_goadedes/miscellanea:misc.Mode6
ltx/en_us_goadedes/me.m05.d25:meVE.SticTheotokion.text	@ltx/en_us_goadedes/oc.m6.d1:ocVE.SticTheotokion.text
ltx/en_us_goadedes/me.m05.d25:meVE.Stichera01.greekmelody	@ltx/en_us_goadedes/he.a.m8:heAU.OTouParadoxou.greekname
ltx/en_us_goadedes/me.m05.d25:meVE.Stichera01.incipit	…
ltx/en_us_goadedes/me.m05.d25:meVE.Stichera01.melody	@ltx/en_us_goadedes/he.a.m8:heAU.OTouParadoxou.name
ltx/en_us_goadedes/me.m05.d25:meVE.Stichera01.mode	@ltx/en_us_goadedes/miscellanea:misc.Mode8
ltx/en_us_goadedes/me.m05.d25:meVE.Stichera01.text	
ltx/en_us_goadedes/me.m05.d25:meVE.Stichera02.incipit	…
ltx/en_us_goadedes/me.m05.d25:meVE.Stichera02.melody	@ltx/en_us_goadedes/he.a.m8:heAU.OTouParadoxou.name
ltx/en_us_goadedes/me.m05.d25:meVE.Stichera02.mode	@ltx/en_us_goadedes/miscellanea:misc.Mode8
ltx/en_us_goadedes/me.m05.d25:meVE.Stichera02.text	
ltx/en_us_goadedes/me.m05.d25:meVE.Stichera03.incipit	…
ltx/en_us_goadedes/me.m05.d25:meVE.Stichera03.melody	@ltx/en_us_goadedes/he.a.m8:heAU.OTouParadoxou.name
ltx/en_us_goadedes/me.m05.d25:meVE.Stichera03.mode	@ltx/en_us_goadedes/miscellanea:misc.Mode8
ltx/en_us_goadedes/me.m05.d25:meVE.Stichera03.text	
