ltx/en_us_goadedes/me.m11.d16:alt1.meMA.PostGospelBoth.incipit	@ltx/en_us_goadedes/ho.ho03:hoMA.PostGospelTheotokos.incipit
ltx/en_us_goadedes/me.m11.d16:alt1.meMA.PostGospelBoth.melody	
ltx/en_us_goadedes/me.m11.d16:alt1.meMA.PostGospelBoth.mode	@ltx/en_us_goadedes/miscellanea:misc.Mode2
ltx/en_us_goadedes/me.m11.d16:alt1.meMA.PostGospelBoth.text	@ltx/en_us_goadedes/ho.ho03:hoMA.PostGospelTheotokos.text
ltx/en_us_goadedes/me.m11.d16:alt1.meMA.PostGospelGlory.incipit	@ltx/en_us_goadedes/ho.ho03:hoMA.PostGospelApostle.incipit
ltx/en_us_goadedes/me.m11.d16:alt1.meMA.PostGospelGlory.melody	
ltx/en_us_goadedes/me.m11.d16:alt1.meMA.PostGospelGlory.mode	@ltx/en_us_goadedes/miscellanea:misc.Mode2
ltx/en_us_goadedes/me.m11.d16:alt1.meMA.PostGospelGlory.text	@ltx/en_us_goadedes/ho.ho03:hoMA.PostGospelApostle.text
ltx/en_us_goadedes/me.m11.d16:alt1.meMA.PostGospelIdiomelon.incipit	…
ltx/en_us_goadedes/me.m11.d16:alt1.meMA.PostGospelIdiomelon.melody	
ltx/en_us_goadedes/me.m11.d16:alt1.meMA.PostGospelIdiomelon.mode	@ltx/en_us_goadedes/miscellanea:misc.Mode6
ltx/en_us_goadedes/me.m11.d16:alt1.meMA.PostGospelIdiomelon.text	All the faithful, let us congregate today, and with spiritual songs let us extol St. Matthew, the disciple and eyewitness of the Savior, and the all-glorious Apostle and Evangelist of Christ.
ltx/en_us_goadedes/me.m11.d16:meDA.commemoration.first	
ltx/en_us_goadedes/me.m11.d16:meDA.commemoration.first_name	
ltx/en_us_goadedes/me.m11.d16:meDA.commemoration.first_short	
ltx/en_us_goadedes/me.m11.d16:meDA.commemoration.first_title	@ltx/en_us_goadedes/titles:ti.Evangelist
ltx/en_us_goadedes/me.m11.d16:meDA.commemoration.full	
ltx/en_us_goadedes/me.m11.d16:meDA.commemoration.second_name	
ltx/en_us_goadedes/me.m11.d16:meDA.commemoration.second_title	
ltx/en_us_goadedes/me.m11.d16:meDA.date	
ltx/en_us_goadedes/me.m11.d16:meDA.fordate	
ltx/en_us_goadedes/me.m11.d16:meDA.insert1	
ltx/en_us_goadedes/me.m11.d16:meDA.insert2	
ltx/en_us_goadedes/me.m11.d16:meDA.note	
ltx/en_us_goadedes/me.m11.d16:meDA.pdfcoverdate	
ltx/en_us_goadedes/me.m11.d16:meDA.pdfheaderdate	
ltx/en_us_goadedes/me.m11.d16:meHO.commemorations	
ltx/en_us_goadedes/me.m11.d16:meHO.note1	
ltx/en_us_goadedes/me.m11.d16:meHO.note2	
ltx/en_us_goadedes/me.m11.d16:meHO.number	
ltx/en_us_goadedes/me.m11.d16:meHO.rank	
ltx/en_us_goadedes/me.m11.d16:meLE.commemoration1	
ltx/en_us_goadedes/me.m11.d16:meLE.commemoration2	
ltx/en_us_goadedes/me.m11.d16:meLI.Kontakion1.greekmelody	@ltx/en_us_goadedes/me.m11.d16:meMA.Kontakion1.greekmelody
ltx/en_us_goadedes/me.m11.d16:meLI.Kontakion1.incipit	@ltx/en_us_goadedes/me.m11.d16:meMA.Kontakion1.incipit
ltx/en_us_goadedes/me.m11.d16:meLI.Kontakion1.melody	@ltx/en_us_goadedes/me.m11.d16:meMA.Kontakion1.melody
ltx/en_us_goadedes/me.m11.d16:meLI.Kontakion1.mode	@ltx/en_us_goadedes/me.m11.d16:meMA.Kontakion1.mode
ltx/en_us_goadedes/me.m11.d16:meLI.Kontakion1.text	@ltx/en_us_goadedes/me.m11.d16:meMA.Kontakion1.text
ltx/en_us_goadedes/me.m11.d16:meLI.MM.CommunionHymn.text	@ltx/en_us_goadedes/properties:media.key
ltx/en_us_goadedes/me.m11.d16:meLI.Megalynarion.text	Being a companion of Christ the Word, * you were introduced to the sublime mysteries of God. * O Apostle Matthew, then grace divine inspired you * to put down in writing the holy Gospel of life.
ltx/en_us_goadedes/me.m11.d16:meMA.C1.poet	@ltx/en_us_goadedes/poets:po.Theofanous
ltx/en_us_goadedes/me.m11.d16:meMA.C1.title	@ltx/en_us_goadedes/titles:ti.CanonEvangelist
ltx/en_us_goadedes/me.m11.d16:meMA.C1.verse	@ltx/en_us_goadedes/prayers:pr.verse_Apostle.text
ltx/en_us_goadedes/me.m11.d16:meMA.ExapTheotokion.incipit	…
ltx/en_us_goadedes/me.m11.d16:meMA.ExapTheotokion.melody	@ltx/en_us_goadedes/he.a.m3:heAU.EnPnevmatiToIero.name
ltx/en_us_goadedes/me.m11.d16:meMA.ExapTheotokion.mode	@ltx/en_us_goadedes/miscellanea:misc.Mode3
ltx/en_us_goadedes/me.m11.d16:meMA.ExapTheotokion.text	
ltx/en_us_goadedes/me.m11.d16:meMA.Exaposteilarion1.greekmelody	@ltx/en_us_goadedes/he.a.m3:heAU.EnPnevmatiToIero.greekname
ltx/en_us_goadedes/me.m11.d16:meMA.Exaposteilarion1.incipit	…
ltx/en_us_goadedes/me.m11.d16:meMA.Exaposteilarion1.melody	@ltx/en_us_goadedes/he.a.m3:heAU.EnPnevmatiToIero.name
ltx/en_us_goadedes/me.m11.d16:meMA.Exaposteilarion1.mode	@ltx/en_us_goadedes/miscellanea:misc.Mode3
ltx/en_us_goadedes/me.m11.d16:meMA.Exaposteilarion1.text	
ltx/en_us_goadedes/me.m11.d16:meMA.Kathisma11.greekmelody	@ltx/en_us_goadedes/he.a.m4:heAU.TachyProkatalave.greekname
ltx/en_us_goadedes/me.m11.d16:meMA.Kathisma11.incipit	…
ltx/en_us_goadedes/me.m11.d16:meMA.Kathisma11.melody	@ltx/en_us_goadedes/he.a.m4:heAU.TachyProkatalave.name
ltx/en_us_goadedes/me.m11.d16:meMA.Kathisma11.mode	@ltx/en_us_goadedes/miscellanea:misc.Mode4
ltx/en_us_goadedes/me.m11.d16:meMA.Kathisma11.poet	@ltx/en_us_goadedes/poets:po.SymeonThessalonikis
ltx/en_us_goadedes/me.m11.d16:meMA.Kathisma11.text	
ltx/en_us_goadedes/me.m11.d16:meMA.Kathisma1T.incipit	@ltx/en_us_goadedes/me.m09.d01:meMA.Kathisma2T.incipit
ltx/en_us_goadedes/me.m11.d16:meMA.Kathisma1T.melody	@ltx/en_us_goadedes/me.m09.d01:meMA.Kathisma2T.melody
ltx/en_us_goadedes/me.m11.d16:meMA.Kathisma1T.mode	@ltx/en_us_goadedes/me.m09.d01:meMA.Kathisma2T.mode
ltx/en_us_goadedes/me.m11.d16:meMA.Kathisma1T.text	@ltx/en_us_goadedes/me.m09.d01:meMA.Kathisma2T.text
ltx/en_us_goadedes/me.m11.d16:meMA.Kathisma21.greekmelody	@ltx/en_us_goadedes/he.a.m8:heAU.TinSofianKaiLogon.greekname
ltx/en_us_goadedes/me.m11.d16:meMA.Kathisma21.incipit	…
ltx/en_us_goadedes/me.m11.d16:meMA.Kathisma21.melody	@ltx/en_us_goadedes/he.a.m8:heAU.TinSofianKaiLogon.name
ltx/en_us_goadedes/me.m11.d16:meMA.Kathisma21.mode	@ltx/en_us_goadedes/miscellanea:misc.Mode8
ltx/en_us_goadedes/me.m11.d16:meMA.Kathisma21.poet	@ltx/en_us_goadedes/poets:po.SymeonThessalonikis
ltx/en_us_goadedes/me.m11.d16:meMA.Kathisma21.text	
ltx/en_us_goadedes/me.m11.d16:meMA.Kathisma2T.incipit	…
ltx/en_us_goadedes/me.m11.d16:meMA.Kathisma2T.melody	@ltx/en_us_goadedes/he.a.m8:heAU.TinSofianKaiLogon.name
ltx/en_us_goadedes/me.m11.d16:meMA.Kathisma2T.mode	@ltx/en_us_goadedes/miscellanea:misc.Mode8
ltx/en_us_goadedes/me.m11.d16:meMA.Kathisma2T.poet	@ltx/en_us_goadedes/poets:po.SymeonThessalonikis
ltx/en_us_goadedes/me.m11.d16:meMA.Kathisma2T.text	
ltx/en_us_goadedes/me.m11.d16:meMA.Kontakion1.greekmelody	@ltx/en_us_goadedes/he.a.m4:heAU.OYpsotheisEnToStavro.greekname
ltx/en_us_goadedes/me.m11.d16:meMA.Kontakion1.incipit	…
ltx/en_us_goadedes/me.m11.d16:meMA.Kontakion1.melody	@ltx/en_us_goadedes/he.a.m4:heAU.OYpsotheisEnToStavro.name
ltx/en_us_goadedes/me.m11.d16:meMA.Kontakion1.mode	@ltx/en_us_goadedes/miscellanea:misc.Mode4
ltx/en_us_goadedes/me.m11.d16:meMA.Kontakion1.text	
ltx/en_us_goadedes/me.m11.d16:meMA.Lauds1.greekmelody	@ltx/en_us_goadedes/he.a.m4:heAU.EdokasSimeiosin.greekname
ltx/en_us_goadedes/me.m11.d16:meMA.Lauds1.incipit	…
ltx/en_us_goadedes/me.m11.d16:meMA.Lauds1.melody	@ltx/en_us_goadedes/he.a.m4:heAU.EdokasSimeiosin.name
ltx/en_us_goadedes/me.m11.d16:meMA.Lauds1.mode	@ltx/en_us_goadedes/miscellanea:misc.Mode4
ltx/en_us_goadedes/me.m11.d16:meMA.Lauds1.text	
ltx/en_us_goadedes/me.m11.d16:meMA.Lauds2.incipit	…
ltx/en_us_goadedes/me.m11.d16:meMA.Lauds2.melody	@ltx/en_us_goadedes/he.a.m4:heAU.EdokasSimeiosin.name
ltx/en_us_goadedes/me.m11.d16:meMA.Lauds2.mode	@ltx/en_us_goadedes/miscellanea:misc.Mode4
ltx/en_us_goadedes/me.m11.d16:meMA.Lauds2.text	
ltx/en_us_goadedes/me.m11.d16:meMA.Lauds3.incipit	…
ltx/en_us_goadedes/me.m11.d16:meMA.Lauds3.melody	@ltx/en_us_goadedes/he.a.m4:heAU.EdokasSimeiosin.name
ltx/en_us_goadedes/me.m11.d16:meMA.Lauds3.mode	@ltx/en_us_goadedes/miscellanea:misc.Mode4
ltx/en_us_goadedes/me.m11.d16:meMA.Lauds3.text	
ltx/en_us_goadedes/me.m11.d16:meMA.LaudsGlory.incipit	…
ltx/en_us_goadedes/me.m11.d16:meMA.LaudsGlory.melody	
ltx/en_us_goadedes/me.m11.d16:meMA.LaudsGlory.mode	@ltx/en_us_goadedes/miscellanea:misc.Mode8
ltx/en_us_goadedes/me.m11.d16:meMA.LaudsGlory.text	
ltx/en_us_goadedes/me.m11.d16:meMA.LaudsTheotokion.incipit	@ltx/en_us_goadedes/oc.m8.d5:ocMA.AposTheotokion.incipit
ltx/en_us_goadedes/me.m11.d16:meMA.LaudsTheotokion.melody	
ltx/en_us_goadedes/me.m11.d16:meMA.LaudsTheotokion.mode	@ltx/en_us_goadedes/miscellanea:misc.Mode8
ltx/en_us_goadedes/me.m11.d16:meMA.LaudsTheotokion.text	@ltx/en_us_goadedes/oc.m8.d5:ocMA.AposTheotokion.text
ltx/en_us_goadedes/me.m11.d16:meMA.MM.Lauds1123as5678.text	@ltx/en_us_goadedes/properties:media.key
ltx/en_us_goadedes/me.m11.d16:meMA.Ode1C11.greekmelody	@ltx/en_us_goadedes/he.h.m4:heHE.AnoixoToStomaMou.greekname
ltx/en_us_goadedes/me.m11.d16:meMA.Ode1C11.incipit	…
ltx/en_us_goadedes/me.m11.d16:meMA.Ode1C11.melody	@ltx/en_us_goadedes/he.h.m4:heHE.AnoixoToStomaMou.name
ltx/en_us_goadedes/me.m11.d16:meMA.Ode1C11.mode	@ltx/en_us_goadedes/miscellanea:misc.Mode4
ltx/en_us_goadedes/me.m11.d16:meMA.Ode1C11.ode	@ltx/en_us_goadedes/miscellanea:misc.Ode1
ltx/en_us_goadedes/me.m11.d16:meMA.Ode1C11.text	
ltx/en_us_goadedes/me.m11.d16:meMA.Ode1C12.incipit	…
ltx/en_us_goadedes/me.m11.d16:meMA.Ode1C12.melody	@ltx/en_us_goadedes/he.h.m4:heHE.AnoixoToStomaMou.name
ltx/en_us_goadedes/me.m11.d16:meMA.Ode1C12.mode	@ltx/en_us_goadedes/miscellanea:misc.Mode4
ltx/en_us_goadedes/me.m11.d16:meMA.Ode1C12.ode	@ltx/en_us_goadedes/miscellanea:misc.Ode1
ltx/en_us_goadedes/me.m11.d16:meMA.Ode1C12.text	
ltx/en_us_goadedes/me.m11.d16:meMA.Ode1C13.incipit	…
ltx/en_us_goadedes/me.m11.d16:meMA.Ode1C13.melody	@ltx/en_us_goadedes/he.h.m4:heHE.AnoixoToStomaMou.name
ltx/en_us_goadedes/me.m11.d16:meMA.Ode1C13.mode	@ltx/en_us_goadedes/miscellanea:misc.Mode4
ltx/en_us_goadedes/me.m11.d16:meMA.Ode1C13.ode	@ltx/en_us_goadedes/miscellanea:misc.Ode1
ltx/en_us_goadedes/me.m11.d16:meMA.Ode1C13.text	
ltx/en_us_goadedes/me.m11.d16:meMA.Ode1C1T.incipit	…
ltx/en_us_goadedes/me.m11.d16:meMA.Ode1C1T.melody	@ltx/en_us_goadedes/he.h.m4:heHE.AnoixoToStomaMou.name
ltx/en_us_goadedes/me.m11.d16:meMA.Ode1C1T.mode	@ltx/en_us_goadedes/miscellanea:misc.Mode4
ltx/en_us_goadedes/me.m11.d16:meMA.Ode1C1T.ode	@ltx/en_us_goadedes/miscellanea:misc.Ode1
ltx/en_us_goadedes/me.m11.d16:meMA.Ode1C1T.text	
ltx/en_us_goadedes/me.m11.d16:meMA.Ode3C11.greekmelody	@ltx/en_us_goadedes/he.h.m4:heHE.TousSousYmnologous.greekname
ltx/en_us_goadedes/me.m11.d16:meMA.Ode3C11.incipit	…
ltx/en_us_goadedes/me.m11.d16:meMA.Ode3C11.melody	@ltx/en_us_goadedes/he.h.m4:heHE.TousSousYmnologous.name
ltx/en_us_goadedes/me.m11.d16:meMA.Ode3C11.mode	@ltx/en_us_goadedes/miscellanea:misc.Mode4
ltx/en_us_goadedes/me.m11.d16:meMA.Ode3C11.ode	@ltx/en_us_goadedes/miscellanea:misc.Ode3
ltx/en_us_goadedes/me.m11.d16:meMA.Ode3C11.text	
ltx/en_us_goadedes/me.m11.d16:meMA.Ode3C12.incipit	…
ltx/en_us_goadedes/me.m11.d16:meMA.Ode3C12.melody	@ltx/en_us_goadedes/he.h.m4:heHE.TousSousYmnologous.name
ltx/en_us_goadedes/me.m11.d16:meMA.Ode3C12.mode	@ltx/en_us_goadedes/miscellanea:misc.Mode4
ltx/en_us_goadedes/me.m11.d16:meMA.Ode3C12.ode	@ltx/en_us_goadedes/miscellanea:misc.Ode3
ltx/en_us_goadedes/me.m11.d16:meMA.Ode3C12.text	
ltx/en_us_goadedes/me.m11.d16:meMA.Ode3C13.incipit	…
ltx/en_us_goadedes/me.m11.d16:meMA.Ode3C13.melody	@ltx/en_us_goadedes/he.h.m4:heHE.TousSousYmnologous.name
ltx/en_us_goadedes/me.m11.d16:meMA.Ode3C13.mode	@ltx/en_us_goadedes/miscellanea:misc.Mode4
ltx/en_us_goadedes/me.m11.d16:meMA.Ode3C13.ode	@ltx/en_us_goadedes/miscellanea:misc.Ode3
ltx/en_us_goadedes/me.m11.d16:meMA.Ode3C13.text	
ltx/en_us_goadedes/me.m11.d16:meMA.Ode3C1T.incipit	…
ltx/en_us_goadedes/me.m11.d16:meMA.Ode3C1T.melody	@ltx/en_us_goadedes/he.h.m4:heHE.TousSousYmnologous.name
ltx/en_us_goadedes/me.m11.d16:meMA.Ode3C1T.mode	@ltx/en_us_goadedes/miscellanea:misc.Mode4
ltx/en_us_goadedes/me.m11.d16:meMA.Ode3C1T.ode	@ltx/en_us_goadedes/miscellanea:misc.Ode3
ltx/en_us_goadedes/me.m11.d16:meMA.Ode3C1T.text	
ltx/en_us_goadedes/me.m11.d16:meMA.Ode3H.greekmelody	@ltx/en_us_goadedes/he.h.m4:heHE.TousSousYmnologous.greekname
ltx/en_us_goadedes/me.m11.d16:meMA.Ode3H.incipit	@ltx/en_us_goadedes/he.h.m4:heHE.TousSousYmnologous.incipit
ltx/en_us_goadedes/me.m11.d16:meMA.Ode3H.melody	@ltx/en_us_goadedes/he.h.m4:heHE.TousSousYmnologous.melody
ltx/en_us_goadedes/me.m11.d16:meMA.Ode3H.mode	@ltx/en_us_goadedes/miscellanea:misc.Mode4
ltx/en_us_goadedes/me.m11.d16:meMA.Ode3H.ode	@ltx/en_us_goadedes/miscellanea:misc.Ode3
ltx/en_us_goadedes/me.m11.d16:meMA.Ode3H.text	@ltx/en_us_goadedes/he.h.m4:heHE.TousSousYmnologous.text
ltx/en_us_goadedes/me.m11.d16:meMA.Ode3Kathisma1.greekmelody	@ltx/en_us_goadedes/he.a.m1:heAU.TonTafonSouSotir.greekname
ltx/en_us_goadedes/me.m11.d16:meMA.Ode3Kathisma1.incipit	…
ltx/en_us_goadedes/me.m11.d16:meMA.Ode3Kathisma1.melody	@ltx/en_us_goadedes/he.a.m1:heAU.TonTafonSouSotir.name
ltx/en_us_goadedes/me.m11.d16:meMA.Ode3Kathisma1.mode	@ltx/en_us_goadedes/miscellanea:misc.Mode1
ltx/en_us_goadedes/me.m11.d16:meMA.Ode3Kathisma1.text	
ltx/en_us_goadedes/me.m11.d16:meMA.Ode3Kathisma2.greekmelody	@ltx/en_us_goadedes/he.a.m8:heAU.TinSofianKaiLogon.greekname
ltx/en_us_goadedes/me.m11.d16:meMA.Ode3Kathisma2.incipit	…
ltx/en_us_goadedes/me.m11.d16:meMA.Ode3Kathisma2.melody	@ltx/en_us_goadedes/he.a.m8:heAU.TinSofianKaiLogon.name
ltx/en_us_goadedes/me.m11.d16:meMA.Ode3Kathisma2.mode	@ltx/en_us_goadedes/miscellanea:misc.Mode8
ltx/en_us_goadedes/me.m11.d16:meMA.Ode3Kathisma2.text	
ltx/en_us_goadedes/me.m11.d16:meMA.Ode3KathismaT.incipit	@ltx/en_us_goadedes/oc.m8.d1:ocMA.Kathisma13.incipit
ltx/en_us_goadedes/me.m11.d16:meMA.Ode3KathismaT.melody	@ltx/en_us_goadedes/he.a.m8:heAU.TinSofianKaiLogon.name
ltx/en_us_goadedes/me.m11.d16:meMA.Ode3KathismaT.mode	@ltx/en_us_goadedes/miscellanea:misc.Mode8
ltx/en_us_goadedes/me.m11.d16:meMA.Ode3KathismaT.text	@ltx/en_us_goadedes/oc.m8.d1:ocMA.Kathisma13.text
ltx/en_us_goadedes/me.m11.d16:meMA.Ode4C11.greekmelody	@ltx/en_us_goadedes/he.h.m4:heHE.TinAnexichniaston.greekname
ltx/en_us_goadedes/me.m11.d16:meMA.Ode4C11.incipit	…
ltx/en_us_goadedes/me.m11.d16:meMA.Ode4C11.melody	@ltx/en_us_goadedes/he.h.m4:heHE.TinAnexichniaston.name
ltx/en_us_goadedes/me.m11.d16:meMA.Ode4C11.mode	@ltx/en_us_goadedes/miscellanea:misc.Mode4
ltx/en_us_goadedes/me.m11.d16:meMA.Ode4C11.ode	@ltx/en_us_goadedes/miscellanea:misc.Ode4
ltx/en_us_goadedes/me.m11.d16:meMA.Ode4C11.text	
ltx/en_us_goadedes/me.m11.d16:meMA.Ode4C12.incipit	…
ltx/en_us_goadedes/me.m11.d16:meMA.Ode4C12.melody	@ltx/en_us_goadedes/he.h.m4:heHE.TinAnexichniaston.name
ltx/en_us_goadedes/me.m11.d16:meMA.Ode4C12.mode	@ltx/en_us_goadedes/miscellanea:misc.Mode4
ltx/en_us_goadedes/me.m11.d16:meMA.Ode4C12.ode	@ltx/en_us_goadedes/miscellanea:misc.Ode4
ltx/en_us_goadedes/me.m11.d16:meMA.Ode4C12.text	
ltx/en_us_goadedes/me.m11.d16:meMA.Ode4C13.incipit	…
ltx/en_us_goadedes/me.m11.d16:meMA.Ode4C13.melody	@ltx/en_us_goadedes/he.h.m4:heHE.TinAnexichniaston.name
ltx/en_us_goadedes/me.m11.d16:meMA.Ode4C13.mode	@ltx/en_us_goadedes/miscellanea:misc.Mode4
ltx/en_us_goadedes/me.m11.d16:meMA.Ode4C13.ode	@ltx/en_us_goadedes/miscellanea:misc.Ode4
ltx/en_us_goadedes/me.m11.d16:meMA.Ode4C13.text	
ltx/en_us_goadedes/me.m11.d16:meMA.Ode4C1T.incipit	…
ltx/en_us_goadedes/me.m11.d16:meMA.Ode4C1T.melody	@ltx/en_us_goadedes/he.h.m4:heHE.TinAnexichniaston.name
ltx/en_us_goadedes/me.m11.d16:meMA.Ode4C1T.mode	@ltx/en_us_goadedes/miscellanea:misc.Mode4
ltx/en_us_goadedes/me.m11.d16:meMA.Ode4C1T.ode	@ltx/en_us_goadedes/miscellanea:misc.Ode4
ltx/en_us_goadedes/me.m11.d16:meMA.Ode4C1T.text	
ltx/en_us_goadedes/me.m11.d16:meMA.Ode5C11.greekmelody	@ltx/en_us_goadedes/he.h.m4:heHE.ExestiTaSympanta.greekname
ltx/en_us_goadedes/me.m11.d16:meMA.Ode5C11.incipit	…
ltx/en_us_goadedes/me.m11.d16:meMA.Ode5C11.melody	@ltx/en_us_goadedes/he.h.m4:heHE.ExestiTaSympanta.name
ltx/en_us_goadedes/me.m11.d16:meMA.Ode5C11.mode	@ltx/en_us_goadedes/miscellanea:misc.Mode4
ltx/en_us_goadedes/me.m11.d16:meMA.Ode5C11.ode	@ltx/en_us_goadedes/miscellanea:misc.Ode5
ltx/en_us_goadedes/me.m11.d16:meMA.Ode5C11.text	
ltx/en_us_goadedes/me.m11.d16:meMA.Ode5C12.incipit	…
ltx/en_us_goadedes/me.m11.d16:meMA.Ode5C12.melody	@ltx/en_us_goadedes/he.h.m4:heHE.ExestiTaSympanta.name
ltx/en_us_goadedes/me.m11.d16:meMA.Ode5C12.mode	@ltx/en_us_goadedes/miscellanea:misc.Mode4
ltx/en_us_goadedes/me.m11.d16:meMA.Ode5C12.ode	@ltx/en_us_goadedes/miscellanea:misc.Ode5
ltx/en_us_goadedes/me.m11.d16:meMA.Ode5C12.text	
ltx/en_us_goadedes/me.m11.d16:meMA.Ode5C13.incipit	…
ltx/en_us_goadedes/me.m11.d16:meMA.Ode5C13.melody	@ltx/en_us_goadedes/he.h.m4:heHE.ExestiTaSympanta.name
ltx/en_us_goadedes/me.m11.d16:meMA.Ode5C13.mode	@ltx/en_us_goadedes/miscellanea:misc.Mode4
ltx/en_us_goadedes/me.m11.d16:meMA.Ode5C13.ode	@ltx/en_us_goadedes/miscellanea:misc.Ode5
ltx/en_us_goadedes/me.m11.d16:meMA.Ode5C13.text	
ltx/en_us_goadedes/me.m11.d16:meMA.Ode5C1T.incipit	…
ltx/en_us_goadedes/me.m11.d16:meMA.Ode5C1T.melody	@ltx/en_us_goadedes/he.h.m4:heHE.ExestiTaSympanta.name
ltx/en_us_goadedes/me.m11.d16:meMA.Ode5C1T.mode	@ltx/en_us_goadedes/miscellanea:misc.Mode4
ltx/en_us_goadedes/me.m11.d16:meMA.Ode5C1T.ode	@ltx/en_us_goadedes/miscellanea:misc.Ode5
ltx/en_us_goadedes/me.m11.d16:meMA.Ode5C1T.text	
ltx/en_us_goadedes/me.m11.d16:meMA.Ode6C11.greekmelody	@ltx/en_us_goadedes/he.h.m4:heHE.IlthonEisTaVathi.greekname
ltx/en_us_goadedes/me.m11.d16:meMA.Ode6C11.incipit	…
ltx/en_us_goadedes/me.m11.d16:meMA.Ode6C11.melody	@ltx/en_us_goadedes/he.h.m4:heHE.IlthonEisTaVathi.name
ltx/en_us_goadedes/me.m11.d16:meMA.Ode6C11.mode	@ltx/en_us_goadedes/miscellanea:misc.Mode4
ltx/en_us_goadedes/me.m11.d16:meMA.Ode6C11.ode	@ltx/en_us_goadedes/miscellanea:misc.Ode6
ltx/en_us_goadedes/me.m11.d16:meMA.Ode6C11.text	
ltx/en_us_goadedes/me.m11.d16:meMA.Ode6C12.incipit	…
ltx/en_us_goadedes/me.m11.d16:meMA.Ode6C12.melody	@ltx/en_us_goadedes/he.h.m4:heHE.IlthonEisTaVathi.name
ltx/en_us_goadedes/me.m11.d16:meMA.Ode6C12.mode	@ltx/en_us_goadedes/miscellanea:misc.Mode4
ltx/en_us_goadedes/me.m11.d16:meMA.Ode6C12.ode	@ltx/en_us_goadedes/miscellanea:misc.Ode6
ltx/en_us_goadedes/me.m11.d16:meMA.Ode6C12.text	
ltx/en_us_goadedes/me.m11.d16:meMA.Ode6C13.incipit	…
ltx/en_us_goadedes/me.m11.d16:meMA.Ode6C13.melody	@ltx/en_us_goadedes/he.h.m4:heHE.IlthonEisTaVathi.name
ltx/en_us_goadedes/me.m11.d16:meMA.Ode6C13.mode	@ltx/en_us_goadedes/miscellanea:misc.Mode4
ltx/en_us_goadedes/me.m11.d16:meMA.Ode6C13.ode	@ltx/en_us_goadedes/miscellanea:misc.Ode6
ltx/en_us_goadedes/me.m11.d16:meMA.Ode6C13.text	
ltx/en_us_goadedes/me.m11.d16:meMA.Ode6C1T.incipit	…
ltx/en_us_goadedes/me.m11.d16:meMA.Ode6C1T.melody	@ltx/en_us_goadedes/he.h.m4:heHE.IlthonEisTaVathi.name
ltx/en_us_goadedes/me.m11.d16:meMA.Ode6C1T.mode	@ltx/en_us_goadedes/miscellanea:misc.Mode4
ltx/en_us_goadedes/me.m11.d16:meMA.Ode6C1T.ode	@ltx/en_us_goadedes/miscellanea:misc.Ode6
ltx/en_us_goadedes/me.m11.d16:meMA.Ode6C1T.text	
ltx/en_us_goadedes/me.m11.d16:meMA.Ode6H.greekmelody	@ltx/en_us_goadedes/he.h.m4:heHE.IlthonEisTaVathi.greekname
ltx/en_us_goadedes/me.m11.d16:meMA.Ode6H.incipit	@ltx/en_us_goadedes/he.h.m4:heHE.IlthonEisTaVathi.incipit
ltx/en_us_goadedes/me.m11.d16:meMA.Ode6H.melody	@ltx/en_us_goadedes/he.h.m4:heHE.IlthonEisTaVathi.melody
ltx/en_us_goadedes/me.m11.d16:meMA.Ode6H.mode	@ltx/en_us_goadedes/miscellanea:misc.Mode4
ltx/en_us_goadedes/me.m11.d16:meMA.Ode6H.ode	@ltx/en_us_goadedes/miscellanea:misc.Ode6
ltx/en_us_goadedes/me.m11.d16:meMA.Ode6H.text	@ltx/en_us_goadedes/he.h.m4:heHE.IlthonEisTaVathi.text
ltx/en_us_goadedes/me.m11.d16:meMA.Ode7C11.greekmelody	@ltx/en_us_goadedes/he.h.m4:heHE.OukElatrefsan.greekname
ltx/en_us_goadedes/me.m11.d16:meMA.Ode7C11.incipit	…
ltx/en_us_goadedes/me.m11.d16:meMA.Ode7C11.melody	@ltx/en_us_goadedes/he.h.m4:heHE.OukElatrefsan.name
ltx/en_us_goadedes/me.m11.d16:meMA.Ode7C11.mode	@ltx/en_us_goadedes/miscellanea:misc.Mode4
ltx/en_us_goadedes/me.m11.d16:meMA.Ode7C11.ode	@ltx/en_us_goadedes/miscellanea:misc.Ode7
ltx/en_us_goadedes/me.m11.d16:meMA.Ode7C11.text	
ltx/en_us_goadedes/me.m11.d16:meMA.Ode7C12.incipit	…
ltx/en_us_goadedes/me.m11.d16:meMA.Ode7C12.melody	@ltx/en_us_goadedes/he.h.m4:heHE.OukElatrefsan.name
ltx/en_us_goadedes/me.m11.d16:meMA.Ode7C12.mode	@ltx/en_us_goadedes/miscellanea:misc.Mode4
ltx/en_us_goadedes/me.m11.d16:meMA.Ode7C12.ode	@ltx/en_us_goadedes/miscellanea:misc.Ode7
ltx/en_us_goadedes/me.m11.d16:meMA.Ode7C12.text	
ltx/en_us_goadedes/me.m11.d16:meMA.Ode7C13.incipit	…
ltx/en_us_goadedes/me.m11.d16:meMA.Ode7C13.melody	@ltx/en_us_goadedes/he.h.m4:heHE.OukElatrefsan.name
ltx/en_us_goadedes/me.m11.d16:meMA.Ode7C13.mode	@ltx/en_us_goadedes/miscellanea:misc.Mode4
ltx/en_us_goadedes/me.m11.d16:meMA.Ode7C13.ode	@ltx/en_us_goadedes/miscellanea:misc.Ode7
ltx/en_us_goadedes/me.m11.d16:meMA.Ode7C13.text	
ltx/en_us_goadedes/me.m11.d16:meMA.Ode7C1T.incipit	…
ltx/en_us_goadedes/me.m11.d16:meMA.Ode7C1T.melody	@ltx/en_us_goadedes/he.h.m4:heHE.OukElatrefsan.name
ltx/en_us_goadedes/me.m11.d16:meMA.Ode7C1T.mode	@ltx/en_us_goadedes/miscellanea:misc.Mode4
ltx/en_us_goadedes/me.m11.d16:meMA.Ode7C1T.ode	@ltx/en_us_goadedes/miscellanea:misc.Ode7
ltx/en_us_goadedes/me.m11.d16:meMA.Ode7C1T.text	
ltx/en_us_goadedes/me.m11.d16:meMA.Ode8C11.greekmelody	@ltx/en_us_goadedes/he.h.m4:heHE.PaidasEvageis.greekname
ltx/en_us_goadedes/me.m11.d16:meMA.Ode8C11.incipit	…
ltx/en_us_goadedes/me.m11.d16:meMA.Ode8C11.melody	@ltx/en_us_goadedes/he.h.m4:heHE.PaidasEvageis.name
ltx/en_us_goadedes/me.m11.d16:meMA.Ode8C11.mode	@ltx/en_us_goadedes/miscellanea:misc.Mode4
ltx/en_us_goadedes/me.m11.d16:meMA.Ode8C11.ode	@ltx/en_us_goadedes/miscellanea:misc.Ode8
ltx/en_us_goadedes/me.m11.d16:meMA.Ode8C11.text	
ltx/en_us_goadedes/me.m11.d16:meMA.Ode8C12.incipit	…
ltx/en_us_goadedes/me.m11.d16:meMA.Ode8C12.melody	@ltx/en_us_goadedes/he.h.m4:heHE.PaidasEvageis.name
ltx/en_us_goadedes/me.m11.d16:meMA.Ode8C12.mode	@ltx/en_us_goadedes/miscellanea:misc.Mode4
ltx/en_us_goadedes/me.m11.d16:meMA.Ode8C12.ode	@ltx/en_us_goadedes/miscellanea:misc.Ode8
ltx/en_us_goadedes/me.m11.d16:meMA.Ode8C12.text	
ltx/en_us_goadedes/me.m11.d16:meMA.Ode8C13.incipit	…
ltx/en_us_goadedes/me.m11.d16:meMA.Ode8C13.melody	@ltx/en_us_goadedes/he.h.m4:heHE.PaidasEvageis.name
ltx/en_us_goadedes/me.m11.d16:meMA.Ode8C13.mode	@ltx/en_us_goadedes/miscellanea:misc.Mode4
ltx/en_us_goadedes/me.m11.d16:meMA.Ode8C13.ode	@ltx/en_us_goadedes/miscellanea:misc.Ode8
ltx/en_us_goadedes/me.m11.d16:meMA.Ode8C13.text	
ltx/en_us_goadedes/me.m11.d16:meMA.Ode8C1T.incipit	…
ltx/en_us_goadedes/me.m11.d16:meMA.Ode8C1T.melody	@ltx/en_us_goadedes/he.h.m4:heHE.PaidasEvageis.name
ltx/en_us_goadedes/me.m11.d16:meMA.Ode8C1T.mode	@ltx/en_us_goadedes/miscellanea:misc.Mode4
ltx/en_us_goadedes/me.m11.d16:meMA.Ode8C1T.ode	@ltx/en_us_goadedes/miscellanea:misc.Ode8
ltx/en_us_goadedes/me.m11.d16:meMA.Ode8C1T.text	
ltx/en_us_goadedes/me.m11.d16:meMA.Ode8H.greekmelody	@ltx/en_us_goadedes/he.h.m4:heHE.PaidasEvageis.greekname
ltx/en_us_goadedes/me.m11.d16:meMA.Ode8H.incipit	@ltx/en_us_goadedes/he.h.m4:heHE.PaidasEvageis.incipit
ltx/en_us_goadedes/me.m11.d16:meMA.Ode8H.melody	@ltx/en_us_goadedes/he.h.m4:heHE.PaidasEvageis.melody
ltx/en_us_goadedes/me.m11.d16:meMA.Ode8H.mode	@ltx/en_us_goadedes/miscellanea:misc.Mode4
ltx/en_us_goadedes/me.m11.d16:meMA.Ode8H.ode	@ltx/en_us_goadedes/miscellanea:misc.Ode8
ltx/en_us_goadedes/me.m11.d16:meMA.Ode8H.text	@ltx/en_us_goadedes/he.h.m4:heHE.PaidasEvageis.text
ltx/en_us_goadedes/me.m11.d16:meMA.Ode9C11.greekmelody	@ltx/en_us_goadedes/he.h.m4:heHE.ApasGigenis.greekname
ltx/en_us_goadedes/me.m11.d16:meMA.Ode9C11.incipit	…
ltx/en_us_goadedes/me.m11.d16:meMA.Ode9C11.melody	@ltx/en_us_goadedes/he.h.m4:heHE.ApasGigenis.name
ltx/en_us_goadedes/me.m11.d16:meMA.Ode9C11.mode	@ltx/en_us_goadedes/miscellanea:misc.Mode4
ltx/en_us_goadedes/me.m11.d16:meMA.Ode9C11.ode	@ltx/en_us_goadedes/miscellanea:misc.Ode9
ltx/en_us_goadedes/me.m11.d16:meMA.Ode9C11.text	
ltx/en_us_goadedes/me.m11.d16:meMA.Ode9C12.incipit	…
ltx/en_us_goadedes/me.m11.d16:meMA.Ode9C12.melody	@ltx/en_us_goadedes/he.h.m4:heHE.ApasGigenis.name
ltx/en_us_goadedes/me.m11.d16:meMA.Ode9C12.mode	@ltx/en_us_goadedes/miscellanea:misc.Mode4
ltx/en_us_goadedes/me.m11.d16:meMA.Ode9C12.ode	@ltx/en_us_goadedes/miscellanea:misc.Ode9
ltx/en_us_goadedes/me.m11.d16:meMA.Ode9C12.text	
ltx/en_us_goadedes/me.m11.d16:meMA.Ode9C13.incipit	…
ltx/en_us_goadedes/me.m11.d16:meMA.Ode9C13.melody	@ltx/en_us_goadedes/he.h.m4:heHE.ApasGigenis.name
ltx/en_us_goadedes/me.m11.d16:meMA.Ode9C13.mode	@ltx/en_us_goadedes/miscellanea:misc.Mode4
ltx/en_us_goadedes/me.m11.d16:meMA.Ode9C13.ode	@ltx/en_us_goadedes/miscellanea:misc.Ode9
ltx/en_us_goadedes/me.m11.d16:meMA.Ode9C13.text	
ltx/en_us_goadedes/me.m11.d16:meMA.Ode9C1T.incipit	…
ltx/en_us_goadedes/me.m11.d16:meMA.Ode9C1T.melody	@ltx/en_us_goadedes/he.h.m4:heHE.ApasGigenis.name
ltx/en_us_goadedes/me.m11.d16:meMA.Ode9C1T.mode	@ltx/en_us_goadedes/miscellanea:misc.Mode4
ltx/en_us_goadedes/me.m11.d16:meMA.Ode9C1T.ode	@ltx/en_us_goadedes/miscellanea:misc.Ode9
ltx/en_us_goadedes/me.m11.d16:meMA.Ode9C1T.text	
ltx/en_us_goadedes/me.m11.d16:meMA.Ode9H.greekmelody	@ltx/en_us_goadedes/he.h.m4:heHE.ApasGigenis.greekname
ltx/en_us_goadedes/me.m11.d16:meMA.Ode9H.incipit	@ltx/en_us_goadedes/he.h.m4:heHE.ApasGigenis.incipit
ltx/en_us_goadedes/me.m11.d16:meMA.Ode9H.melody	@ltx/en_us_goadedes/he.h.m4:heHE.ApasGigenis.melody
ltx/en_us_goadedes/me.m11.d16:meMA.Ode9H.mode	@ltx/en_us_goadedes/miscellanea:misc.Mode4
ltx/en_us_goadedes/me.m11.d16:meMA.Ode9H.ode	@ltx/en_us_goadedes/miscellanea:misc.Ode9
ltx/en_us_goadedes/me.m11.d16:meMA.Ode9H.text	@ltx/en_us_goadedes/he.h.m4:heHE.ApasGigenis.text
ltx/en_us_goadedes/me.m11.d16:meMA.Oikos1.text	
ltx/en_us_goadedes/me.m11.d16:meVE.Apolytikion2ger.greekmelody	@ltx/en_us_goadedes/he.a.m3:heAU.TheiasPisteos.greekname
ltx/en_us_goadedes/me.m11.d16:meVE.Apolytikion2ger.incipit	…
ltx/en_us_goadedes/me.m11.d16:meVE.Apolytikion2ger.melody	@ltx/en_us_goadedes/he.a.m3:heAU.TheiasPisteos.name
ltx/en_us_goadedes/me.m11.d16:meVE.Apolytikion2ger.mode	@ltx/en_us_goadedes/miscellanea:misc.Mode3
ltx/en_us_goadedes/me.m11.d16:meVE.Apolytikion2ger.poet	@ltx/en_us_goadedes/poets:po.Gerasimou
ltx/en_us_goadedes/me.m11.d16:meVE.Apolytikion2ger.text	
ltx/en_us_goadedes/me.m11.d16:meVE.AposGlory.incipit	…
ltx/en_us_goadedes/me.m11.d16:meVE.AposGlory.melody	
ltx/en_us_goadedes/me.m11.d16:meVE.AposGlory.mode	@ltx/en_us_goadedes/miscellanea:misc.Mode6
ltx/en_us_goadedes/me.m11.d16:meVE.AposGlory.text	
ltx/en_us_goadedes/me.m11.d16:meVE.AposTheotokion.incipit	@ltx/en_us_goadedes/he.o:heOT.TheotokeSyEi.incipit
ltx/en_us_goadedes/me.m11.d16:meVE.AposTheotokion.melody	@ltx/en_us_goadedes/he.o:heOT.TheotokeSyEi.name
ltx/en_us_goadedes/me.m11.d16:meVE.AposTheotokion.mode	@ltx/en_us_goadedes/miscellanea:misc.Mode6
ltx/en_us_goadedes/me.m11.d16:meVE.AposTheotokion.text	@ltx/en_us_goadedes/he.o:heOT.TheotokeSyEiApostolou.text
ltx/en_us_goadedes/me.m11.d16:meVE.Aposticha1.greekmelody	@ltx/en_us_goadedes/he.a.m4:heAU.OsGennaionEnMartysi.greekname
ltx/en_us_goadedes/me.m11.d16:meVE.Aposticha1.incipit	…
ltx/en_us_goadedes/me.m11.d16:meVE.Aposticha1.melody	@ltx/en_us_goadedes/he.a.m4:heAU.OsGennaionEnMartysi.name
ltx/en_us_goadedes/me.m11.d16:meVE.Aposticha1.mode	@ltx/en_us_goadedes/miscellanea:misc.Mode4
ltx/en_us_goadedes/me.m11.d16:meVE.Aposticha1.text	
ltx/en_us_goadedes/me.m11.d16:meVE.Aposticha2.incipit	…
ltx/en_us_goadedes/me.m11.d16:meVE.Aposticha2.melody	@ltx/en_us_goadedes/he.a.m4:heAU.OsGennaionEnMartysi.name
ltx/en_us_goadedes/me.m11.d16:meVE.Aposticha2.mode	@ltx/en_us_goadedes/miscellanea:misc.Mode4
ltx/en_us_goadedes/me.m11.d16:meVE.Aposticha2.text	
ltx/en_us_goadedes/me.m11.d16:meVE.Aposticha3.incipit	…
ltx/en_us_goadedes/me.m11.d16:meVE.Aposticha3.melody	@ltx/en_us_goadedes/he.a.m4:heAU.OsGennaionEnMartysi.name
ltx/en_us_goadedes/me.m11.d16:meVE.Aposticha3.mode	@ltx/en_us_goadedes/miscellanea:misc.Mode4
ltx/en_us_goadedes/me.m11.d16:meVE.Aposticha3.text	
ltx/en_us_goadedes/me.m11.d16:meVE.GeneralApolytikion1.melody	@ltx/en_us_goadedes/he.ga:heGA.ApostoleAgie.name
ltx/en_us_goadedes/me.m11.d16:meVE.GeneralApolytikion1.mode	@ltx/en_us_goadedes/miscellanea:misc.Mode3
ltx/en_us_goadedes/me.m11.d16:meVE.GeneralApolytikion1.name	
ltx/en_us_goadedes/me.m11.d16:meVE.MM.GeneralApolytikion1.text	
ltx/en_us_goadedes/me.m11.d16:meVE.MM.Stichera1123as78910.text	
ltx/en_us_goadedes/me.m11.d16:meVE.SticGlory.incipit	…
ltx/en_us_goadedes/me.m11.d16:meVE.SticGlory.melody	
ltx/en_us_goadedes/me.m11.d16:meVE.SticGlory.mode	@ltx/en_us_goadedes/miscellanea:misc.Mode4
ltx/en_us_goadedes/me.m11.d16:meVE.SticGlory.text	
ltx/en_us_goadedes/me.m11.d16:meVE.SticTheotokion.greekmelody	@ltx/en_us_goadedes/he.a.m4:heAU.OExYpsistouKlitheis.greekname
ltx/en_us_goadedes/me.m11.d16:meVE.SticTheotokion.incipit	…
ltx/en_us_goadedes/me.m11.d16:meVE.SticTheotokion.melody	@ltx/en_us_goadedes/he.a.m4:heAU.OExYpsistouKlitheis.name
ltx/en_us_goadedes/me.m11.d16:meVE.SticTheotokion.mode	@ltx/en_us_goadedes/miscellanea:misc.Mode4
ltx/en_us_goadedes/me.m11.d16:meVE.SticTheotokion.text	
ltx/en_us_goadedes/me.m11.d16:meVE.Stichera01.greekmelody	@ltx/en_us_goadedes/he.a.m4:heAU.OExYpsistouKlitheis.greekname
ltx/en_us_goadedes/me.m11.d16:meVE.Stichera01.incipit	…
ltx/en_us_goadedes/me.m11.d16:meVE.Stichera01.melody	@ltx/en_us_goadedes/he.a.m4:heAU.OExYpsistouKlitheis.name
ltx/en_us_goadedes/me.m11.d16:meVE.Stichera01.mode	@ltx/en_us_goadedes/miscellanea:misc.Mode4
ltx/en_us_goadedes/me.m11.d16:meVE.Stichera01.text	
ltx/en_us_goadedes/me.m11.d16:meVE.Stichera02.incipit	…
ltx/en_us_goadedes/me.m11.d16:meVE.Stichera02.melody	@ltx/en_us_goadedes/he.a.m4:heAU.OExYpsistouKlitheis.name
ltx/en_us_goadedes/me.m11.d16:meVE.Stichera02.mode	@ltx/en_us_goadedes/miscellanea:misc.Mode4
ltx/en_us_goadedes/me.m11.d16:meVE.Stichera02.text	
ltx/en_us_goadedes/me.m11.d16:meVE.Stichera03.incipit	…
ltx/en_us_goadedes/me.m11.d16:meVE.Stichera03.melody	@ltx/en_us_goadedes/he.a.m4:heAU.OExYpsistouKlitheis.name
ltx/en_us_goadedes/me.m11.d16:meVE.Stichera03.mode	@ltx/en_us_goadedes/miscellanea:misc.Mode4
ltx/en_us_goadedes/me.m11.d16:meVE.Stichera03.text	
