ltx/en_us_goadedes/me.m02.d19:alt1.meDA.commemoration.first_name	
ltx/en_us_goadedes/me.m02.d19:alt1.meDA.commemoration.first_short	
ltx/en_us_goadedes/me.m02.d19:alt1.meDA.commemoration.first_title	@ltx/en_us_goadedes/titles:ti.SaintW
ltx/en_us_goadedes/me.m02.d19:alt1.meDA.commemoration.full	
ltx/en_us_goadedes/me.m02.d19:alt1.meDA.commemoration.second_name	
ltx/en_us_goadedes/me.m02.d19:alt1.meDA.commemoration.second_title	
ltx/en_us_goadedes/me.m02.d19:alt1.meDA.date	
ltx/en_us_goadedes/me.m02.d19:alt1.meDA.insert1	
ltx/en_us_goadedes/me.m02.d19:alt1.meDA.insert2	
ltx/en_us_goadedes/me.m02.d19:alt1.meDA.note	
ltx/en_us_goadedes/me.m02.d19:alt1.meHO.commemorations	
ltx/en_us_goadedes/me.m02.d19:alt1.meHO.note1	
ltx/en_us_goadedes/me.m02.d19:alt1.meHO.note2	
ltx/en_us_goadedes/me.m02.d19:alt1.meHO.number	
ltx/en_us_goadedes/me.m02.d19:alt1.meHO.rank	
ltx/en_us_goadedes/me.m02.d19:alt1.meLE.commemoration1	
ltx/en_us_goadedes/me.m02.d19:alt1.meLE.commemoration2	
ltx/en_us_goadedes/me.m02.d19:alt1.meLI.Kontakion1.incipit	@ltx/en_us_goadedes/me.m02.d19:alt1.meMA.Kontakion1.incipit
ltx/en_us_goadedes/me.m02.d19:alt1.meLI.Kontakion1.melody	@ltx/en_us_goadedes/me.m02.d19:alt1.meMA.Kontakion1.melody
ltx/en_us_goadedes/me.m02.d19:alt1.meLI.Kontakion1.mode	@ltx/en_us_goadedes/me.m02.d19:alt1.meMA.Kontakion1.mode
ltx/en_us_goadedes/me.m02.d19:alt1.meLI.Kontakion1.text	@ltx/en_us_goadedes/me.m02.d19:alt1.meMA.Kontakion1.text
ltx/en_us_goadedes/me.m02.d19:alt1.meLI.MM.CommunionHymn.text	@ltx/en_us_goadedes/properties:media.key
ltx/en_us_goadedes/me.m02.d19:alt1.meLI.Megalynarion.text	Let us praise the nun-martyr of the Lord. * Philothea famously competed in Athens, Greece. * She is decorated in heaven with the medals * for martyrdom and virtue. Therefore we honor her.
ltx/en_us_goadedes/me.m02.d19:alt1.meLI.Megalynarion2.text	
ltx/en_us_goadedes/me.m02.d19:alt1.meMA.C1.acrostic.notice1	
ltx/en_us_goadedes/me.m02.d19:alt1.meMA.C1.acrostic.text	
ltx/en_us_goadedes/me.m02.d19:alt1.meMA.C1.acrostic.title	
ltx/en_us_goadedes/me.m02.d19:alt1.meMA.C1.title	@ltx/en_us_goadedes/titles:ti.CanonTheotokos
ltx/en_us_goadedes/me.m02.d19:alt1.meMA.C1.verse	@ltx/en_us_goadedes/prayers:pr.verse_Theotokos.text
ltx/en_us_goadedes/me.m02.d19:alt1.meMA.C2.acrostic.notice1	
ltx/en_us_goadedes/me.m02.d19:alt1.meMA.C2.acrostic.text	
ltx/en_us_goadedes/me.m02.d19:alt1.meMA.C2.acrostic.title	
ltx/en_us_goadedes/me.m02.d19:alt1.meMA.C2.title	@ltx/en_us_goadedes/titles:ti.CanonDevoutW
ltx/en_us_goadedes/me.m02.d19:alt1.meMA.C2.verse	@ltx/en_us_goadedes/prayers:pr.verse_DevoutWoman.text
ltx/en_us_goadedes/me.m02.d19:alt1.meMA.ExapTheotokion.incipit	…
ltx/en_us_goadedes/me.m02.d19:alt1.meMA.ExapTheotokion.melody	@ltx/en_us_goadedes/he.a.m2:heAU.GynaikesAkoutisthite.name
ltx/en_us_goadedes/me.m02.d19:alt1.meMA.ExapTheotokion.mode	@ltx/en_us_goadedes/miscellanea:misc.Mode2
ltx/en_us_goadedes/me.m02.d19:alt1.meMA.ExapTheotokion.text	
ltx/en_us_goadedes/me.m02.d19:alt1.meMA.Exaposteilarion1.greekmelody	@ltx/en_us_goadedes/he.a.m2:heAU.GynaikesAkoutisthite.greekname
ltx/en_us_goadedes/me.m02.d19:alt1.meMA.Exaposteilarion1.incipit	…
ltx/en_us_goadedes/me.m02.d19:alt1.meMA.Exaposteilarion1.melody	@ltx/en_us_goadedes/he.a.m2:heAU.GynaikesAkoutisthite.name
ltx/en_us_goadedes/me.m02.d19:alt1.meMA.Exaposteilarion1.mode	@ltx/en_us_goadedes/miscellanea:misc.Mode2
ltx/en_us_goadedes/me.m02.d19:alt1.meMA.Exaposteilarion1.text	
ltx/en_us_goadedes/me.m02.d19:alt1.meMA.Kathisma11.greekmelody	@ltx/en_us_goadedes/he.a.m1:heAU.TonTafonSouSotir.greekname
ltx/en_us_goadedes/me.m02.d19:alt1.meMA.Kathisma11.incipit	…
ltx/en_us_goadedes/me.m02.d19:alt1.meMA.Kathisma11.melody	@ltx/en_us_goadedes/he.a.m1:heAU.TonTafonSouSotir.name
ltx/en_us_goadedes/me.m02.d19:alt1.meMA.Kathisma11.mode	@ltx/en_us_goadedes/miscellanea:misc.Mode1
ltx/en_us_goadedes/me.m02.d19:alt1.meMA.Kathisma11.text	
ltx/en_us_goadedes/me.m02.d19:alt1.meMA.Kathisma1T.greekmelody	@ltx/en_us_goadedes/he.a.m1:heAU.TonTafonSouSotir.greekname
ltx/en_us_goadedes/me.m02.d19:alt1.meMA.Kathisma1T.incipit	@ltx/en_us_goadedes/oc.m1.d1:ocMA.Kathisma13.incipit
ltx/en_us_goadedes/me.m02.d19:alt1.meMA.Kathisma1T.melody	@ltx/en_us_goadedes/he.a.m1:heAU.TonTafonSouSotir.name
ltx/en_us_goadedes/me.m02.d19:alt1.meMA.Kathisma1T.mode	@ltx/en_us_goadedes/miscellanea:misc.Mode1
ltx/en_us_goadedes/me.m02.d19:alt1.meMA.Kathisma1T.text	@ltx/en_us_goadedes/oc.m1.d1:ocMA.Kathisma13.text
ltx/en_us_goadedes/me.m02.d19:alt1.meMA.Kathisma21.greekmelody	@ltx/en_us_goadedes/he.a.m4:heAU.TachyProkatalave.greekname
ltx/en_us_goadedes/me.m02.d19:alt1.meMA.Kathisma21.incipit	…
ltx/en_us_goadedes/me.m02.d19:alt1.meMA.Kathisma21.melody	@ltx/en_us_goadedes/he.a.m4:heAU.TachyProkatalave.name
ltx/en_us_goadedes/me.m02.d19:alt1.meMA.Kathisma21.mode	@ltx/en_us_goadedes/miscellanea:misc.Mode4
ltx/en_us_goadedes/me.m02.d19:alt1.meMA.Kathisma21.text	
ltx/en_us_goadedes/me.m02.d19:alt1.meMA.Kathisma2T.greekmelody	@ltx/en_us_goadedes/he.a.m4:heAU.TachyProkatalave.greekname
ltx/en_us_goadedes/me.m02.d19:alt1.meMA.Kathisma2T.incipit	…
ltx/en_us_goadedes/me.m02.d19:alt1.meMA.Kathisma2T.melody	@ltx/en_us_goadedes/he.a.m4:heAU.TachyProkatalave.name
ltx/en_us_goadedes/me.m02.d19:alt1.meMA.Kathisma2T.mode	@ltx/en_us_goadedes/miscellanea:misc.Mode4
ltx/en_us_goadedes/me.m02.d19:alt1.meMA.Kathisma2T.text	
ltx/en_us_goadedes/me.m02.d19:alt1.meMA.Kathisma31.greekmelody	@ltx/en_us_goadedes/he.a.m8:heAU.ToProstachthen.greekname
ltx/en_us_goadedes/me.m02.d19:alt1.meMA.Kathisma31.incipit	…
ltx/en_us_goadedes/me.m02.d19:alt1.meMA.Kathisma31.melody	@ltx/en_us_goadedes/he.a.m8:heAU.ToProstachthen.name
ltx/en_us_goadedes/me.m02.d19:alt1.meMA.Kathisma31.mode	@ltx/en_us_goadedes/miscellanea:misc.Mode8
ltx/en_us_goadedes/me.m02.d19:alt1.meMA.Kathisma31.text	
ltx/en_us_goadedes/me.m02.d19:alt1.meMA.Kathisma3T.greekmelody	@ltx/en_us_goadedes/he.a.m8:heAU.ToProstachthen.greekname
ltx/en_us_goadedes/me.m02.d19:alt1.meMA.Kathisma3T.incipit	@ltx/en_us_goadedes/oc.m8.d2:ocMA.Kathisma23.incipit
ltx/en_us_goadedes/me.m02.d19:alt1.meMA.Kathisma3T.melody	@ltx/en_us_goadedes/he.a.m8:heAU.ToProstachthen.name
ltx/en_us_goadedes/me.m02.d19:alt1.meMA.Kathisma3T.mode	@ltx/en_us_goadedes/miscellanea:misc.Mode8
ltx/en_us_goadedes/me.m02.d19:alt1.meMA.Kathisma3T.text	@ltx/en_us_goadedes/oc.m8.d2:ocMA.Kathisma23.text
ltx/en_us_goadedes/me.m02.d19:alt1.meMA.Kontakion1.greekmelody	@ltx/en_us_goadedes/he.a.m3:heAU.IParthenosSimeron.greekname
ltx/en_us_goadedes/me.m02.d19:alt1.meMA.Kontakion1.incipit	…
ltx/en_us_goadedes/me.m02.d19:alt1.meMA.Kontakion1.melody	@ltx/en_us_goadedes/he.a.m3:heAU.IParthenosSimeron.name
ltx/en_us_goadedes/me.m02.d19:alt1.meMA.Kontakion1.mode	@ltx/en_us_goadedes/miscellanea:misc.Mode3
ltx/en_us_goadedes/me.m02.d19:alt1.meMA.Kontakion1.text	
ltx/en_us_goadedes/me.m02.d19:alt1.meMA.Lauds1.greekmelody	@ltx/en_us_goadedes/he.a.m4:heAU.OExYpsistouKlitheis.greekname
ltx/en_us_goadedes/me.m02.d19:alt1.meMA.Lauds1.incipit	…
ltx/en_us_goadedes/me.m02.d19:alt1.meMA.Lauds1.melody	@ltx/en_us_goadedes/he.a.m4:heAU.OExYpsistouKlitheis.name
ltx/en_us_goadedes/me.m02.d19:alt1.meMA.Lauds1.mode	@ltx/en_us_goadedes/miscellanea:misc.Mode4
ltx/en_us_goadedes/me.m02.d19:alt1.meMA.Lauds1.text	
ltx/en_us_goadedes/me.m02.d19:alt1.meMA.Lauds2.incipit	…
ltx/en_us_goadedes/me.m02.d19:alt1.meMA.Lauds2.melody	@ltx/en_us_goadedes/he.a.m4:heAU.OExYpsistouKlitheis.name
ltx/en_us_goadedes/me.m02.d19:alt1.meMA.Lauds2.mode	@ltx/en_us_goadedes/miscellanea:misc.Mode4
ltx/en_us_goadedes/me.m02.d19:alt1.meMA.Lauds2.text	
ltx/en_us_goadedes/me.m02.d19:alt1.meMA.Lauds3.incipit	…
ltx/en_us_goadedes/me.m02.d19:alt1.meMA.Lauds3.melody	@ltx/en_us_goadedes/he.a.m4:heAU.OExYpsistouKlitheis.name
ltx/en_us_goadedes/me.m02.d19:alt1.meMA.Lauds3.mode	@ltx/en_us_goadedes/miscellanea:misc.Mode4
ltx/en_us_goadedes/me.m02.d19:alt1.meMA.Lauds3.text	
ltx/en_us_goadedes/me.m02.d19:alt1.meMA.Lauds4.incipit	…
ltx/en_us_goadedes/me.m02.d19:alt1.meMA.Lauds4.melody	@ltx/en_us_goadedes/he.a.m4:heAU.OExYpsistouKlitheis.name
ltx/en_us_goadedes/me.m02.d19:alt1.meMA.Lauds4.mode	@ltx/en_us_goadedes/miscellanea:misc.Mode4
ltx/en_us_goadedes/me.m02.d19:alt1.meMA.Lauds4.text	
ltx/en_us_goadedes/me.m02.d19:alt1.meMA.LaudsGlory.incipit	…
ltx/en_us_goadedes/me.m02.d19:alt1.meMA.LaudsGlory.melody	
ltx/en_us_goadedes/me.m02.d19:alt1.meMA.LaudsGlory.mode	@ltx/en_us_goadedes/miscellanea:misc.Mode5
ltx/en_us_goadedes/me.m02.d19:alt1.meMA.LaudsGlory.text	
ltx/en_us_goadedes/me.m02.d19:alt1.meMA.LaudsTheotokion.incipit	@ltx/en_us_goadedes/oc.m5.d3:ocVE.AposTheotokion.incipit
ltx/en_us_goadedes/me.m02.d19:alt1.meMA.LaudsTheotokion.melody	
ltx/en_us_goadedes/me.m02.d19:alt1.meMA.LaudsTheotokion.mode	@ltx/en_us_goadedes/miscellanea:misc.Mode5
ltx/en_us_goadedes/me.m02.d19:alt1.meMA.LaudsTheotokion.text	@ltx/en_us_goadedes/oc.m5.d3:ocVE.AposTheotokion.text
ltx/en_us_goadedes/me.m02.d19:alt1.meMA.MM.LaudsSunday.text	@ltx/en_us_goadedes/properties:media.key
ltx/en_us_goadedes/me.m02.d19:alt1.meMA.Ode1C11.greekmelody	@ltx/en_us_goadedes/he.h.m8:heHE.ArmatilatinFarao.greekname
ltx/en_us_goadedes/me.m02.d19:alt1.meMA.Ode1C11.incipit	…
ltx/en_us_goadedes/me.m02.d19:alt1.meMA.Ode1C11.melody	@ltx/en_us_goadedes/he.h.m8:heHE.ArmatilatinFarao.name
ltx/en_us_goadedes/me.m02.d19:alt1.meMA.Ode1C11.mode	@ltx/en_us_goadedes/miscellanea:misc.Mode8
ltx/en_us_goadedes/me.m02.d19:alt1.meMA.Ode1C11.ode	@ltx/en_us_goadedes/miscellanea:misc.Ode1
ltx/en_us_goadedes/me.m02.d19:alt1.meMA.Ode1C11.text	
ltx/en_us_goadedes/me.m02.d19:alt1.meMA.Ode1C12.incipit	…
ltx/en_us_goadedes/me.m02.d19:alt1.meMA.Ode1C12.melody	@ltx/en_us_goadedes/he.h.m8:heHE.ArmatilatinFarao.name
ltx/en_us_goadedes/me.m02.d19:alt1.meMA.Ode1C12.mode	@ltx/en_us_goadedes/miscellanea:misc.Mode8
ltx/en_us_goadedes/me.m02.d19:alt1.meMA.Ode1C12.ode	@ltx/en_us_goadedes/miscellanea:misc.Ode1
ltx/en_us_goadedes/me.m02.d19:alt1.meMA.Ode1C12.text	
ltx/en_us_goadedes/me.m02.d19:alt1.meMA.Ode1C13.incipit	…
ltx/en_us_goadedes/me.m02.d19:alt1.meMA.Ode1C13.melody	@ltx/en_us_goadedes/he.h.m8:heHE.ArmatilatinFarao.name
ltx/en_us_goadedes/me.m02.d19:alt1.meMA.Ode1C13.mode	@ltx/en_us_goadedes/miscellanea:misc.Mode8
ltx/en_us_goadedes/me.m02.d19:alt1.meMA.Ode1C13.ode	@ltx/en_us_goadedes/miscellanea:misc.Ode1
ltx/en_us_goadedes/me.m02.d19:alt1.meMA.Ode1C13.text	
ltx/en_us_goadedes/me.m02.d19:alt1.meMA.Ode1C14.incipit	…
ltx/en_us_goadedes/me.m02.d19:alt1.meMA.Ode1C14.melody	@ltx/en_us_goadedes/he.h.m8:heHE.ArmatilatinFarao.name
ltx/en_us_goadedes/me.m02.d19:alt1.meMA.Ode1C14.mode	@ltx/en_us_goadedes/miscellanea:misc.Mode8
ltx/en_us_goadedes/me.m02.d19:alt1.meMA.Ode1C14.ode	@ltx/en_us_goadedes/miscellanea:misc.Ode1
ltx/en_us_goadedes/me.m02.d19:alt1.meMA.Ode1C14.text	
ltx/en_us_goadedes/me.m02.d19:alt1.meMA.Ode1C1H.greekmelody	@ltx/en_us_goadedes/he.h.m8:heHE.ArmatilatinFarao.greekname
ltx/en_us_goadedes/me.m02.d19:alt1.meMA.Ode1C1H.incipit	@ltx/en_us_goadedes/he.h.m8:heHE.ArmatilatinFarao.incipit
ltx/en_us_goadedes/me.m02.d19:alt1.meMA.Ode1C1H.melody	@ltx/en_us_goadedes/he.h.m8:heHE.ArmatilatinFarao.melody
ltx/en_us_goadedes/me.m02.d19:alt1.meMA.Ode1C1H.mode	@ltx/en_us_goadedes/miscellanea:misc.Mode8
ltx/en_us_goadedes/me.m02.d19:alt1.meMA.Ode1C1H.ode	@ltx/en_us_goadedes/miscellanea:misc.Ode1
ltx/en_us_goadedes/me.m02.d19:alt1.meMA.Ode1C1H.text	@ltx/en_us_goadedes/he.h.m8:heHE.ArmatilatinFarao.text
ltx/en_us_goadedes/me.m02.d19:alt1.meMA.Ode1C21.greekmelody	@ltx/en_us_goadedes/he.h.m4:heHE.AnoixoToStomaMou.greekname
ltx/en_us_goadedes/me.m02.d19:alt1.meMA.Ode1C21.incipit	…
ltx/en_us_goadedes/me.m02.d19:alt1.meMA.Ode1C21.melody	@ltx/en_us_goadedes/he.h.m4:heHE.AnoixoToStomaMou.name
ltx/en_us_goadedes/me.m02.d19:alt1.meMA.Ode1C21.mode	@ltx/en_us_goadedes/miscellanea:misc.Mode4
ltx/en_us_goadedes/me.m02.d19:alt1.meMA.Ode1C21.ode	@ltx/en_us_goadedes/miscellanea:misc.Ode1
ltx/en_us_goadedes/me.m02.d19:alt1.meMA.Ode1C21.text	
ltx/en_us_goadedes/me.m02.d19:alt1.meMA.Ode1C22.incipit	…
ltx/en_us_goadedes/me.m02.d19:alt1.meMA.Ode1C22.melody	@ltx/en_us_goadedes/he.h.m4:heHE.AnoixoToStomaMou.name
ltx/en_us_goadedes/me.m02.d19:alt1.meMA.Ode1C22.mode	@ltx/en_us_goadedes/miscellanea:misc.Mode4
ltx/en_us_goadedes/me.m02.d19:alt1.meMA.Ode1C22.ode	@ltx/en_us_goadedes/miscellanea:misc.Ode1
ltx/en_us_goadedes/me.m02.d19:alt1.meMA.Ode1C22.text	
ltx/en_us_goadedes/me.m02.d19:alt1.meMA.Ode1C23.incipit	…
ltx/en_us_goadedes/me.m02.d19:alt1.meMA.Ode1C23.melody	@ltx/en_us_goadedes/he.h.m4:heHE.AnoixoToStomaMou.name
ltx/en_us_goadedes/me.m02.d19:alt1.meMA.Ode1C23.mode	@ltx/en_us_goadedes/miscellanea:misc.Mode4
ltx/en_us_goadedes/me.m02.d19:alt1.meMA.Ode1C23.ode	@ltx/en_us_goadedes/miscellanea:misc.Ode1
ltx/en_us_goadedes/me.m02.d19:alt1.meMA.Ode1C23.text	
ltx/en_us_goadedes/me.m02.d19:alt1.meMA.Ode1C2T.incipit	…
ltx/en_us_goadedes/me.m02.d19:alt1.meMA.Ode1C2T.melody	@ltx/en_us_goadedes/he.h.m4:heHE.AnoixoToStomaMou.name
ltx/en_us_goadedes/me.m02.d19:alt1.meMA.Ode1C2T.mode	@ltx/en_us_goadedes/miscellanea:misc.Mode4
ltx/en_us_goadedes/me.m02.d19:alt1.meMA.Ode1C2T.ode	@ltx/en_us_goadedes/miscellanea:misc.Ode1
ltx/en_us_goadedes/me.m02.d19:alt1.meMA.Ode1C2T.text	
ltx/en_us_goadedes/me.m02.d19:alt1.meMA.Ode3C11.greekmelody	@ltx/en_us_goadedes/he.h.m8:heHE.OuraniasApsidos.greekname
ltx/en_us_goadedes/me.m02.d19:alt1.meMA.Ode3C11.incipit	…
ltx/en_us_goadedes/me.m02.d19:alt1.meMA.Ode3C11.melody	@ltx/en_us_goadedes/he.h.m8:heHE.OuraniasApsidos.name
ltx/en_us_goadedes/me.m02.d19:alt1.meMA.Ode3C11.mode	@ltx/en_us_goadedes/miscellanea:misc.Mode8
ltx/en_us_goadedes/me.m02.d19:alt1.meMA.Ode3C11.ode	@ltx/en_us_goadedes/miscellanea:misc.Ode3
ltx/en_us_goadedes/me.m02.d19:alt1.meMA.Ode3C11.text	
ltx/en_us_goadedes/me.m02.d19:alt1.meMA.Ode3C12.incipit	…
ltx/en_us_goadedes/me.m02.d19:alt1.meMA.Ode3C12.melody	@ltx/en_us_goadedes/he.h.m8:heHE.OuraniasApsidos.name
ltx/en_us_goadedes/me.m02.d19:alt1.meMA.Ode3C12.mode	@ltx/en_us_goadedes/miscellanea:misc.Mode8
ltx/en_us_goadedes/me.m02.d19:alt1.meMA.Ode3C12.ode	@ltx/en_us_goadedes/miscellanea:misc.Ode3
ltx/en_us_goadedes/me.m02.d19:alt1.meMA.Ode3C12.text	
ltx/en_us_goadedes/me.m02.d19:alt1.meMA.Ode3C13.incipit	…
ltx/en_us_goadedes/me.m02.d19:alt1.meMA.Ode3C13.melody	@ltx/en_us_goadedes/he.h.m8:heHE.OuraniasApsidos.name
ltx/en_us_goadedes/me.m02.d19:alt1.meMA.Ode3C13.mode	@ltx/en_us_goadedes/miscellanea:misc.Mode8
ltx/en_us_goadedes/me.m02.d19:alt1.meMA.Ode3C13.ode	@ltx/en_us_goadedes/miscellanea:misc.Ode3
ltx/en_us_goadedes/me.m02.d19:alt1.meMA.Ode3C13.text	
ltx/en_us_goadedes/me.m02.d19:alt1.meMA.Ode3C14.incipit	…
ltx/en_us_goadedes/me.m02.d19:alt1.meMA.Ode3C14.melody	@ltx/en_us_goadedes/he.h.m8:heHE.OuraniasApsidos.name
ltx/en_us_goadedes/me.m02.d19:alt1.meMA.Ode3C14.mode	@ltx/en_us_goadedes/miscellanea:misc.Mode8
ltx/en_us_goadedes/me.m02.d19:alt1.meMA.Ode3C14.ode	@ltx/en_us_goadedes/miscellanea:misc.Ode3
ltx/en_us_goadedes/me.m02.d19:alt1.meMA.Ode3C14.text	
ltx/en_us_goadedes/me.m02.d19:alt1.meMA.Ode3C1H.greekmelody	@ltx/en_us_goadedes/he.h.m8:heHE.OuraniasApsidos.greekname
ltx/en_us_goadedes/me.m02.d19:alt1.meMA.Ode3C1H.incipit	@ltx/en_us_goadedes/he.h.m8:heHE.OuraniasApsidos.incipit
ltx/en_us_goadedes/me.m02.d19:alt1.meMA.Ode3C1H.melody	@ltx/en_us_goadedes/he.h.m8:heHE.OuraniasApsidos.melody
ltx/en_us_goadedes/me.m02.d19:alt1.meMA.Ode3C1H.mode	@ltx/en_us_goadedes/miscellanea:misc.Mode8
ltx/en_us_goadedes/me.m02.d19:alt1.meMA.Ode3C1H.ode	@ltx/en_us_goadedes/miscellanea:misc.Ode3
ltx/en_us_goadedes/me.m02.d19:alt1.meMA.Ode3C1H.text	@ltx/en_us_goadedes/he.h.m8:heHE.OuraniasApsidos.text
ltx/en_us_goadedes/me.m02.d19:alt1.meMA.Ode3C21.greekmelody	@ltx/en_us_goadedes/he.h.m4:heHE.TousSousYmnologous.greekname
ltx/en_us_goadedes/me.m02.d19:alt1.meMA.Ode3C21.incipit	…
ltx/en_us_goadedes/me.m02.d19:alt1.meMA.Ode3C21.melody	@ltx/en_us_goadedes/he.h.m4:heHE.TousSousYmnologous.name
ltx/en_us_goadedes/me.m02.d19:alt1.meMA.Ode3C21.mode	@ltx/en_us_goadedes/miscellanea:misc.Mode4
ltx/en_us_goadedes/me.m02.d19:alt1.meMA.Ode3C21.ode	@ltx/en_us_goadedes/miscellanea:misc.Ode3
ltx/en_us_goadedes/me.m02.d19:alt1.meMA.Ode3C21.text	
ltx/en_us_goadedes/me.m02.d19:alt1.meMA.Ode3C22.incipit	…
ltx/en_us_goadedes/me.m02.d19:alt1.meMA.Ode3C22.melody	@ltx/en_us_goadedes/he.h.m4:heHE.TousSousYmnologous.name
ltx/en_us_goadedes/me.m02.d19:alt1.meMA.Ode3C22.mode	@ltx/en_us_goadedes/miscellanea:misc.Mode4
ltx/en_us_goadedes/me.m02.d19:alt1.meMA.Ode3C22.ode	@ltx/en_us_goadedes/miscellanea:misc.Ode3
ltx/en_us_goadedes/me.m02.d19:alt1.meMA.Ode3C22.text	
ltx/en_us_goadedes/me.m02.d19:alt1.meMA.Ode3C23.incipit	…
ltx/en_us_goadedes/me.m02.d19:alt1.meMA.Ode3C23.melody	@ltx/en_us_goadedes/he.h.m4:heHE.TousSousYmnologous.name
ltx/en_us_goadedes/me.m02.d19:alt1.meMA.Ode3C23.mode	@ltx/en_us_goadedes/miscellanea:misc.Mode4
ltx/en_us_goadedes/me.m02.d19:alt1.meMA.Ode3C23.ode	@ltx/en_us_goadedes/miscellanea:misc.Ode3
ltx/en_us_goadedes/me.m02.d19:alt1.meMA.Ode3C23.text	
ltx/en_us_goadedes/me.m02.d19:alt1.meMA.Ode3C2T.incipit	…
ltx/en_us_goadedes/me.m02.d19:alt1.meMA.Ode3C2T.melody	@ltx/en_us_goadedes/he.h.m4:heHE.TousSousYmnologous.name
ltx/en_us_goadedes/me.m02.d19:alt1.meMA.Ode3C2T.mode	@ltx/en_us_goadedes/miscellanea:misc.Mode4
ltx/en_us_goadedes/me.m02.d19:alt1.meMA.Ode3C2T.ode	@ltx/en_us_goadedes/miscellanea:misc.Ode3
ltx/en_us_goadedes/me.m02.d19:alt1.meMA.Ode3C2T.text	
ltx/en_us_goadedes/me.m02.d19:alt1.meMA.Ode3Kathisma1.greekmelody	@ltx/en_us_goadedes/he.a.m8:heAU.ToProstachthen.greekname
ltx/en_us_goadedes/me.m02.d19:alt1.meMA.Ode3Kathisma1.incipit	…
ltx/en_us_goadedes/me.m02.d19:alt1.meMA.Ode3Kathisma1.melody	@ltx/en_us_goadedes/he.a.m8:heAU.ToProstachthen.name
ltx/en_us_goadedes/me.m02.d19:alt1.meMA.Ode3Kathisma1.mode	@ltx/en_us_goadedes/miscellanea:misc.Mode8
ltx/en_us_goadedes/me.m02.d19:alt1.meMA.Ode3Kathisma1.text	
ltx/en_us_goadedes/me.m02.d19:alt1.meMA.Ode3KathismaT.incipit	@ltx/en_us_goadedes/me.m02.d19:alt1.meMA.Kathisma3T.incipit
ltx/en_us_goadedes/me.m02.d19:alt1.meMA.Ode3KathismaT.melody	@ltx/en_us_goadedes/he.a.m8:heAU.ToProstachthen.name
ltx/en_us_goadedes/me.m02.d19:alt1.meMA.Ode3KathismaT.mode	@ltx/en_us_goadedes/miscellanea:misc.Mode8
ltx/en_us_goadedes/me.m02.d19:alt1.meMA.Ode3KathismaT.text	@ltx/en_us_goadedes/me.m02.d19:alt1.meMA.Kathisma3T.text
ltx/en_us_goadedes/me.m02.d19:alt1.meMA.Ode4C11.greekmelody	@ltx/en_us_goadedes/he.h.m8:heHE.SyMouIschys.greekname
ltx/en_us_goadedes/me.m02.d19:alt1.meMA.Ode4C11.incipit	…
ltx/en_us_goadedes/me.m02.d19:alt1.meMA.Ode4C11.melody	@ltx/en_us_goadedes/he.h.m8:heHE.SyMouIschys.name
ltx/en_us_goadedes/me.m02.d19:alt1.meMA.Ode4C11.mode	@ltx/en_us_goadedes/miscellanea:misc.Mode8
ltx/en_us_goadedes/me.m02.d19:alt1.meMA.Ode4C11.ode	@ltx/en_us_goadedes/miscellanea:misc.Ode4
ltx/en_us_goadedes/me.m02.d19:alt1.meMA.Ode4C11.text	
ltx/en_us_goadedes/me.m02.d19:alt1.meMA.Ode4C12.incipit	…
ltx/en_us_goadedes/me.m02.d19:alt1.meMA.Ode4C12.melody	@ltx/en_us_goadedes/he.h.m8:heHE.SyMouIschys.name
ltx/en_us_goadedes/me.m02.d19:alt1.meMA.Ode4C12.mode	@ltx/en_us_goadedes/miscellanea:misc.Mode8
ltx/en_us_goadedes/me.m02.d19:alt1.meMA.Ode4C12.ode	@ltx/en_us_goadedes/miscellanea:misc.Ode4
ltx/en_us_goadedes/me.m02.d19:alt1.meMA.Ode4C12.text	
ltx/en_us_goadedes/me.m02.d19:alt1.meMA.Ode4C13.incipit	…
ltx/en_us_goadedes/me.m02.d19:alt1.meMA.Ode4C13.melody	@ltx/en_us_goadedes/he.h.m8:heHE.SyMouIschys.name
ltx/en_us_goadedes/me.m02.d19:alt1.meMA.Ode4C13.mode	@ltx/en_us_goadedes/miscellanea:misc.Mode8
ltx/en_us_goadedes/me.m02.d19:alt1.meMA.Ode4C13.ode	@ltx/en_us_goadedes/miscellanea:misc.Ode4
ltx/en_us_goadedes/me.m02.d19:alt1.meMA.Ode4C13.text	
ltx/en_us_goadedes/me.m02.d19:alt1.meMA.Ode4C14.incipit	…
ltx/en_us_goadedes/me.m02.d19:alt1.meMA.Ode4C14.melody	@ltx/en_us_goadedes/he.h.m8:heHE.SyMouIschys.name
ltx/en_us_goadedes/me.m02.d19:alt1.meMA.Ode4C14.mode	@ltx/en_us_goadedes/miscellanea:misc.Mode8
ltx/en_us_goadedes/me.m02.d19:alt1.meMA.Ode4C14.ode	@ltx/en_us_goadedes/miscellanea:misc.Ode4
ltx/en_us_goadedes/me.m02.d19:alt1.meMA.Ode4C14.text	
ltx/en_us_goadedes/me.m02.d19:alt1.meMA.Ode4C1H.greekmelody	@ltx/en_us_goadedes/he.h.m8:heHE.SyMouIschys.greekname
ltx/en_us_goadedes/me.m02.d19:alt1.meMA.Ode4C1H.incipit	@ltx/en_us_goadedes/he.h.m8:heHE.SyMouIschys.incipit
ltx/en_us_goadedes/me.m02.d19:alt1.meMA.Ode4C1H.melody	@ltx/en_us_goadedes/he.h.m8:heHE.SyMouIschys.melody
ltx/en_us_goadedes/me.m02.d19:alt1.meMA.Ode4C1H.mode	@ltx/en_us_goadedes/miscellanea:misc.Mode8
ltx/en_us_goadedes/me.m02.d19:alt1.meMA.Ode4C1H.ode	@ltx/en_us_goadedes/miscellanea:misc.Ode4
ltx/en_us_goadedes/me.m02.d19:alt1.meMA.Ode4C1H.text	@ltx/en_us_goadedes/he.h.m8:heHE.SyMouIschys.text
ltx/en_us_goadedes/me.m02.d19:alt1.meMA.Ode4C21.greekmelody	@ltx/en_us_goadedes/he.h.m4:heHE.OKathimenosEnDoxi.greekname
ltx/en_us_goadedes/me.m02.d19:alt1.meMA.Ode4C21.incipit	…
ltx/en_us_goadedes/me.m02.d19:alt1.meMA.Ode4C21.melody	@ltx/en_us_goadedes/he.h.m4:heHE.OKathimenosEnDoxi.name
ltx/en_us_goadedes/me.m02.d19:alt1.meMA.Ode4C21.mode	@ltx/en_us_goadedes/miscellanea:misc.Mode4
ltx/en_us_goadedes/me.m02.d19:alt1.meMA.Ode4C21.ode	@ltx/en_us_goadedes/miscellanea:misc.Ode4
ltx/en_us_goadedes/me.m02.d19:alt1.meMA.Ode4C21.text	
ltx/en_us_goadedes/me.m02.d19:alt1.meMA.Ode4C22.incipit	…
ltx/en_us_goadedes/me.m02.d19:alt1.meMA.Ode4C22.melody	@ltx/en_us_goadedes/he.h.m4:heHE.OKathimenosEnDoxi.name
ltx/en_us_goadedes/me.m02.d19:alt1.meMA.Ode4C22.mode	@ltx/en_us_goadedes/miscellanea:misc.Mode4
ltx/en_us_goadedes/me.m02.d19:alt1.meMA.Ode4C22.ode	@ltx/en_us_goadedes/miscellanea:misc.Ode4
ltx/en_us_goadedes/me.m02.d19:alt1.meMA.Ode4C22.text	
ltx/en_us_goadedes/me.m02.d19:alt1.meMA.Ode4C23.incipit	…
ltx/en_us_goadedes/me.m02.d19:alt1.meMA.Ode4C23.melody	@ltx/en_us_goadedes/he.h.m4:heHE.OKathimenosEnDoxi.name
ltx/en_us_goadedes/me.m02.d19:alt1.meMA.Ode4C23.mode	@ltx/en_us_goadedes/miscellanea:misc.Mode4
ltx/en_us_goadedes/me.m02.d19:alt1.meMA.Ode4C23.ode	@ltx/en_us_goadedes/miscellanea:misc.Ode4
ltx/en_us_goadedes/me.m02.d19:alt1.meMA.Ode4C23.text	
ltx/en_us_goadedes/me.m02.d19:alt1.meMA.Ode4C2T.incipit	…
ltx/en_us_goadedes/me.m02.d19:alt1.meMA.Ode4C2T.melody	@ltx/en_us_goadedes/he.h.m4:heHE.OKathimenosEnDoxi.name
ltx/en_us_goadedes/me.m02.d19:alt1.meMA.Ode4C2T.mode	@ltx/en_us_goadedes/miscellanea:misc.Mode4
ltx/en_us_goadedes/me.m02.d19:alt1.meMA.Ode4C2T.ode	@ltx/en_us_goadedes/miscellanea:misc.Ode4
ltx/en_us_goadedes/me.m02.d19:alt1.meMA.Ode4C2T.text	
ltx/en_us_goadedes/me.m02.d19:alt1.meMA.Ode5C11.greekmelody	@ltx/en_us_goadedes/he.h.m8:heHE.InaTiMeAposo.greekname
ltx/en_us_goadedes/me.m02.d19:alt1.meMA.Ode5C11.incipit	…
ltx/en_us_goadedes/me.m02.d19:alt1.meMA.Ode5C11.melody	@ltx/en_us_goadedes/he.h.m8:heHE.InaTiMeAposo.name
ltx/en_us_goadedes/me.m02.d19:alt1.meMA.Ode5C11.mode	@ltx/en_us_goadedes/miscellanea:misc.Mode8
ltx/en_us_goadedes/me.m02.d19:alt1.meMA.Ode5C11.ode	@ltx/en_us_goadedes/miscellanea:misc.Ode5
ltx/en_us_goadedes/me.m02.d19:alt1.meMA.Ode5C11.text	
ltx/en_us_goadedes/me.m02.d19:alt1.meMA.Ode5C12.incipit	…
ltx/en_us_goadedes/me.m02.d19:alt1.meMA.Ode5C12.melody	@ltx/en_us_goadedes/he.h.m8:heHE.InaTiMeAposo.name
ltx/en_us_goadedes/me.m02.d19:alt1.meMA.Ode5C12.mode	@ltx/en_us_goadedes/miscellanea:misc.Mode8
ltx/en_us_goadedes/me.m02.d19:alt1.meMA.Ode5C12.ode	@ltx/en_us_goadedes/miscellanea:misc.Ode5
ltx/en_us_goadedes/me.m02.d19:alt1.meMA.Ode5C12.text	
ltx/en_us_goadedes/me.m02.d19:alt1.meMA.Ode5C13.incipit	…
ltx/en_us_goadedes/me.m02.d19:alt1.meMA.Ode5C13.melody	@ltx/en_us_goadedes/he.h.m8:heHE.InaTiMeAposo.name
ltx/en_us_goadedes/me.m02.d19:alt1.meMA.Ode5C13.mode	@ltx/en_us_goadedes/miscellanea:misc.Mode8
ltx/en_us_goadedes/me.m02.d19:alt1.meMA.Ode5C13.ode	@ltx/en_us_goadedes/miscellanea:misc.Ode5
ltx/en_us_goadedes/me.m02.d19:alt1.meMA.Ode5C13.text	
ltx/en_us_goadedes/me.m02.d19:alt1.meMA.Ode5C14.incipit	…
ltx/en_us_goadedes/me.m02.d19:alt1.meMA.Ode5C14.melody	@ltx/en_us_goadedes/he.h.m8:heHE.InaTiMeAposo.name
ltx/en_us_goadedes/me.m02.d19:alt1.meMA.Ode5C14.mode	@ltx/en_us_goadedes/miscellanea:misc.Mode8
ltx/en_us_goadedes/me.m02.d19:alt1.meMA.Ode5C14.ode	@ltx/en_us_goadedes/miscellanea:misc.Ode5
ltx/en_us_goadedes/me.m02.d19:alt1.meMA.Ode5C14.text	
ltx/en_us_goadedes/me.m02.d19:alt1.meMA.Ode5C1H.greekmelody	@ltx/en_us_goadedes/he.h.m8:heHE.InaTiMeAposo.greekname
ltx/en_us_goadedes/me.m02.d19:alt1.meMA.Ode5C1H.incipit	@ltx/en_us_goadedes/he.h.m8:heHE.InaTiMeAposo.incipit
ltx/en_us_goadedes/me.m02.d19:alt1.meMA.Ode5C1H.melody	@ltx/en_us_goadedes/he.h.m8:heHE.InaTiMeAposo.melody
ltx/en_us_goadedes/me.m02.d19:alt1.meMA.Ode5C1H.mode	@ltx/en_us_goadedes/miscellanea:misc.Mode8
ltx/en_us_goadedes/me.m02.d19:alt1.meMA.Ode5C1H.ode	@ltx/en_us_goadedes/miscellanea:misc.Ode5
ltx/en_us_goadedes/me.m02.d19:alt1.meMA.Ode5C1H.text	@ltx/en_us_goadedes/he.h.m8:heHE.InaTiMeAposo.text
ltx/en_us_goadedes/me.m02.d19:alt1.meMA.Ode5C21.greekmelody	@ltx/en_us_goadedes/he.h.m4:heHE.ExestiTaSympanta.greekname
ltx/en_us_goadedes/me.m02.d19:alt1.meMA.Ode5C21.incipit	…
ltx/en_us_goadedes/me.m02.d19:alt1.meMA.Ode5C21.melody	@ltx/en_us_goadedes/he.h.m4:heHE.ExestiTaSympanta.name
ltx/en_us_goadedes/me.m02.d19:alt1.meMA.Ode5C21.mode	@ltx/en_us_goadedes/miscellanea:misc.Mode4
ltx/en_us_goadedes/me.m02.d19:alt1.meMA.Ode5C21.ode	@ltx/en_us_goadedes/miscellanea:misc.Ode5
ltx/en_us_goadedes/me.m02.d19:alt1.meMA.Ode5C21.text	
ltx/en_us_goadedes/me.m02.d19:alt1.meMA.Ode5C22.incipit	…
ltx/en_us_goadedes/me.m02.d19:alt1.meMA.Ode5C22.melody	@ltx/en_us_goadedes/he.h.m4:heHE.ExestiTaSympanta.name
ltx/en_us_goadedes/me.m02.d19:alt1.meMA.Ode5C22.mode	@ltx/en_us_goadedes/miscellanea:misc.Mode4
ltx/en_us_goadedes/me.m02.d19:alt1.meMA.Ode5C22.ode	@ltx/en_us_goadedes/miscellanea:misc.Ode5
ltx/en_us_goadedes/me.m02.d19:alt1.meMA.Ode5C22.text	
ltx/en_us_goadedes/me.m02.d19:alt1.meMA.Ode5C23.incipit	…
ltx/en_us_goadedes/me.m02.d19:alt1.meMA.Ode5C23.melody	@ltx/en_us_goadedes/he.h.m4:heHE.ExestiTaSympanta.name
ltx/en_us_goadedes/me.m02.d19:alt1.meMA.Ode5C23.mode	@ltx/en_us_goadedes/miscellanea:misc.Mode4
ltx/en_us_goadedes/me.m02.d19:alt1.meMA.Ode5C23.ode	@ltx/en_us_goadedes/miscellanea:misc.Ode5
ltx/en_us_goadedes/me.m02.d19:alt1.meMA.Ode5C23.text	
ltx/en_us_goadedes/me.m02.d19:alt1.meMA.Ode5C2T.incipit	…
ltx/en_us_goadedes/me.m02.d19:alt1.meMA.Ode5C2T.melody	@ltx/en_us_goadedes/he.h.m4:heHE.ExestiTaSympanta.name
ltx/en_us_goadedes/me.m02.d19:alt1.meMA.Ode5C2T.mode	@ltx/en_us_goadedes/miscellanea:misc.Mode4
ltx/en_us_goadedes/me.m02.d19:alt1.meMA.Ode5C2T.ode	@ltx/en_us_goadedes/miscellanea:misc.Ode5
ltx/en_us_goadedes/me.m02.d19:alt1.meMA.Ode5C2T.text	
ltx/en_us_goadedes/me.m02.d19:alt1.meMA.Ode6C11.greekmelody	@ltx/en_us_goadedes/he.h.m8:heHE.TinDeisinEkcheo.greekname
ltx/en_us_goadedes/me.m02.d19:alt1.meMA.Ode6C11.incipit	…
ltx/en_us_goadedes/me.m02.d19:alt1.meMA.Ode6C11.melody	@ltx/en_us_goadedes/he.h.m8:heHE.TinDeisinEkcheo.name
ltx/en_us_goadedes/me.m02.d19:alt1.meMA.Ode6C11.mode	@ltx/en_us_goadedes/miscellanea:misc.Mode8
ltx/en_us_goadedes/me.m02.d19:alt1.meMA.Ode6C11.ode	@ltx/en_us_goadedes/miscellanea:misc.Ode6
ltx/en_us_goadedes/me.m02.d19:alt1.meMA.Ode6C11.text	
ltx/en_us_goadedes/me.m02.d19:alt1.meMA.Ode6C12.incipit	…
ltx/en_us_goadedes/me.m02.d19:alt1.meMA.Ode6C12.melody	@ltx/en_us_goadedes/he.h.m8:heHE.TinDeisinEkcheo.name
ltx/en_us_goadedes/me.m02.d19:alt1.meMA.Ode6C12.mode	@ltx/en_us_goadedes/miscellanea:misc.Mode8
ltx/en_us_goadedes/me.m02.d19:alt1.meMA.Ode6C12.ode	@ltx/en_us_goadedes/miscellanea:misc.Ode6
ltx/en_us_goadedes/me.m02.d19:alt1.meMA.Ode6C12.text	
ltx/en_us_goadedes/me.m02.d19:alt1.meMA.Ode6C13.incipit	…
ltx/en_us_goadedes/me.m02.d19:alt1.meMA.Ode6C13.melody	@ltx/en_us_goadedes/he.h.m8:heHE.TinDeisinEkcheo.name
ltx/en_us_goadedes/me.m02.d19:alt1.meMA.Ode6C13.mode	@ltx/en_us_goadedes/miscellanea:misc.Mode8
ltx/en_us_goadedes/me.m02.d19:alt1.meMA.Ode6C13.ode	@ltx/en_us_goadedes/miscellanea:misc.Ode6
ltx/en_us_goadedes/me.m02.d19:alt1.meMA.Ode6C13.text	
ltx/en_us_goadedes/me.m02.d19:alt1.meMA.Ode6C14.incipit	…
ltx/en_us_goadedes/me.m02.d19:alt1.meMA.Ode6C14.melody	@ltx/en_us_goadedes/he.h.m8:heHE.TinDeisinEkcheo.name
ltx/en_us_goadedes/me.m02.d19:alt1.meMA.Ode6C14.mode	@ltx/en_us_goadedes/miscellanea:misc.Mode8
ltx/en_us_goadedes/me.m02.d19:alt1.meMA.Ode6C14.ode	@ltx/en_us_goadedes/miscellanea:misc.Ode6
ltx/en_us_goadedes/me.m02.d19:alt1.meMA.Ode6C14.text	
ltx/en_us_goadedes/me.m02.d19:alt1.meMA.Ode6C1H.greekmelody	@ltx/en_us_goadedes/he.h.m8:heHE.TinDeisinEkcheo.greekname
ltx/en_us_goadedes/me.m02.d19:alt1.meMA.Ode6C1H.incipit	@ltx/en_us_goadedes/he.h.m8:heHE.TinDeisinEkcheo.incipit
ltx/en_us_goadedes/me.m02.d19:alt1.meMA.Ode6C1H.melody	@ltx/en_us_goadedes/he.h.m8:heHE.TinDeisinEkcheo.melody
ltx/en_us_goadedes/me.m02.d19:alt1.meMA.Ode6C1H.mode	@ltx/en_us_goadedes/miscellanea:misc.Mode8
ltx/en_us_goadedes/me.m02.d19:alt1.meMA.Ode6C1H.ode	@ltx/en_us_goadedes/miscellanea:misc.Ode6
ltx/en_us_goadedes/me.m02.d19:alt1.meMA.Ode6C1H.text	@ltx/en_us_goadedes/he.h.m8:heHE.TinDeisinEkcheo.text
ltx/en_us_goadedes/me.m02.d19:alt1.meMA.Ode6C21.greekmelody	@ltx/en_us_goadedes/he.h.m4:heHE.TinTheianTaftin.greekname
ltx/en_us_goadedes/me.m02.d19:alt1.meMA.Ode6C21.incipit	…
ltx/en_us_goadedes/me.m02.d19:alt1.meMA.Ode6C21.melody	@ltx/en_us_goadedes/he.h.m4:heHE.TinTheianTaftin.name
ltx/en_us_goadedes/me.m02.d19:alt1.meMA.Ode6C21.mode	@ltx/en_us_goadedes/miscellanea:misc.Mode4
ltx/en_us_goadedes/me.m02.d19:alt1.meMA.Ode6C21.ode	@ltx/en_us_goadedes/miscellanea:misc.Ode6
ltx/en_us_goadedes/me.m02.d19:alt1.meMA.Ode6C21.text	
ltx/en_us_goadedes/me.m02.d19:alt1.meMA.Ode6C22.incipit	…
ltx/en_us_goadedes/me.m02.d19:alt1.meMA.Ode6C22.melody	@ltx/en_us_goadedes/he.h.m4:heHE.TinTheianTaftin.name
ltx/en_us_goadedes/me.m02.d19:alt1.meMA.Ode6C22.mode	@ltx/en_us_goadedes/miscellanea:misc.Mode4
ltx/en_us_goadedes/me.m02.d19:alt1.meMA.Ode6C22.ode	@ltx/en_us_goadedes/miscellanea:misc.Ode6
ltx/en_us_goadedes/me.m02.d19:alt1.meMA.Ode6C22.text	
ltx/en_us_goadedes/me.m02.d19:alt1.meMA.Ode6C23.incipit	…
ltx/en_us_goadedes/me.m02.d19:alt1.meMA.Ode6C23.melody	@ltx/en_us_goadedes/he.h.m4:heHE.TinTheianTaftin.name
ltx/en_us_goadedes/me.m02.d19:alt1.meMA.Ode6C23.mode	@ltx/en_us_goadedes/miscellanea:misc.Mode4
ltx/en_us_goadedes/me.m02.d19:alt1.meMA.Ode6C23.ode	@ltx/en_us_goadedes/miscellanea:misc.Ode6
ltx/en_us_goadedes/me.m02.d19:alt1.meMA.Ode6C23.text	
ltx/en_us_goadedes/me.m02.d19:alt1.meMA.Ode6C2T.incipit	…
ltx/en_us_goadedes/me.m02.d19:alt1.meMA.Ode6C2T.melody	@ltx/en_us_goadedes/he.h.m4:heHE.TinTheianTaftin.name
ltx/en_us_goadedes/me.m02.d19:alt1.meMA.Ode6C2T.mode	@ltx/en_us_goadedes/miscellanea:misc.Mode4
ltx/en_us_goadedes/me.m02.d19:alt1.meMA.Ode6C2T.ode	@ltx/en_us_goadedes/miscellanea:misc.Ode6
ltx/en_us_goadedes/me.m02.d19:alt1.meMA.Ode6C2T.text	
ltx/en_us_goadedes/me.m02.d19:alt1.meMA.Ode7C11.greekmelody	@ltx/en_us_goadedes/he.h.m8:heHE.TheouSynkatavasin.greekname
ltx/en_us_goadedes/me.m02.d19:alt1.meMA.Ode7C11.incipit	…
ltx/en_us_goadedes/me.m02.d19:alt1.meMA.Ode7C11.melody	@ltx/en_us_goadedes/he.h.m8:heHE.TheouSynkatavasin.name
ltx/en_us_goadedes/me.m02.d19:alt1.meMA.Ode7C11.mode	@ltx/en_us_goadedes/miscellanea:misc.Mode8
ltx/en_us_goadedes/me.m02.d19:alt1.meMA.Ode7C11.ode	@ltx/en_us_goadedes/miscellanea:misc.Ode7
ltx/en_us_goadedes/me.m02.d19:alt1.meMA.Ode7C11.text	
ltx/en_us_goadedes/me.m02.d19:alt1.meMA.Ode7C12.incipit	…
ltx/en_us_goadedes/me.m02.d19:alt1.meMA.Ode7C12.melody	@ltx/en_us_goadedes/he.h.m8:heHE.TheouSynkatavasin.name
ltx/en_us_goadedes/me.m02.d19:alt1.meMA.Ode7C12.mode	@ltx/en_us_goadedes/miscellanea:misc.Mode8
ltx/en_us_goadedes/me.m02.d19:alt1.meMA.Ode7C12.ode	@ltx/en_us_goadedes/miscellanea:misc.Ode7
ltx/en_us_goadedes/me.m02.d19:alt1.meMA.Ode7C12.text	
ltx/en_us_goadedes/me.m02.d19:alt1.meMA.Ode7C13.incipit	…
ltx/en_us_goadedes/me.m02.d19:alt1.meMA.Ode7C13.melody	@ltx/en_us_goadedes/he.h.m8:heHE.TheouSynkatavasin.name
ltx/en_us_goadedes/me.m02.d19:alt1.meMA.Ode7C13.mode	@ltx/en_us_goadedes/miscellanea:misc.Mode8
ltx/en_us_goadedes/me.m02.d19:alt1.meMA.Ode7C13.ode	@ltx/en_us_goadedes/miscellanea:misc.Ode7
ltx/en_us_goadedes/me.m02.d19:alt1.meMA.Ode7C13.text	
ltx/en_us_goadedes/me.m02.d19:alt1.meMA.Ode7C14.incipit	…
ltx/en_us_goadedes/me.m02.d19:alt1.meMA.Ode7C14.melody	@ltx/en_us_goadedes/he.h.m8:heHE.TheouSynkatavasin.name
ltx/en_us_goadedes/me.m02.d19:alt1.meMA.Ode7C14.mode	@ltx/en_us_goadedes/miscellanea:misc.Mode8
ltx/en_us_goadedes/me.m02.d19:alt1.meMA.Ode7C14.ode	@ltx/en_us_goadedes/miscellanea:misc.Ode7
ltx/en_us_goadedes/me.m02.d19:alt1.meMA.Ode7C14.text	
ltx/en_us_goadedes/me.m02.d19:alt1.meMA.Ode7C1H.greekmelody	@ltx/en_us_goadedes/he.h.m8:heHE.TheouSynkatavasin.greekname
ltx/en_us_goadedes/me.m02.d19:alt1.meMA.Ode7C1H.incipit	@ltx/en_us_goadedes/he.h.m8:heHE.TheouSynkatavasin.incipit
ltx/en_us_goadedes/me.m02.d19:alt1.meMA.Ode7C1H.melody	@ltx/en_us_goadedes/he.h.m8:heHE.TheouSynkatavasin.melody
ltx/en_us_goadedes/me.m02.d19:alt1.meMA.Ode7C1H.mode	@ltx/en_us_goadedes/miscellanea:misc.Mode8
ltx/en_us_goadedes/me.m02.d19:alt1.meMA.Ode7C1H.ode	@ltx/en_us_goadedes/miscellanea:misc.Ode7
ltx/en_us_goadedes/me.m02.d19:alt1.meMA.Ode7C1H.text	@ltx/en_us_goadedes/he.h.m8:heHE.TheouSynkatavasin.text
ltx/en_us_goadedes/me.m02.d19:alt1.meMA.Ode7C21.greekmelody	@ltx/en_us_goadedes/he.h.m4:heHE.ODiasosasEnPyri.greekname
ltx/en_us_goadedes/me.m02.d19:alt1.meMA.Ode7C21.incipit	…
ltx/en_us_goadedes/me.m02.d19:alt1.meMA.Ode7C21.melody	@ltx/en_us_goadedes/he.h.m4:heHE.ODiasosasEnPyri.name
ltx/en_us_goadedes/me.m02.d19:alt1.meMA.Ode7C21.mode	@ltx/en_us_goadedes/miscellanea:misc.Mode4
ltx/en_us_goadedes/me.m02.d19:alt1.meMA.Ode7C21.ode	@ltx/en_us_goadedes/miscellanea:misc.Ode7
ltx/en_us_goadedes/me.m02.d19:alt1.meMA.Ode7C21.text	
ltx/en_us_goadedes/me.m02.d19:alt1.meMA.Ode7C22.incipit	…
ltx/en_us_goadedes/me.m02.d19:alt1.meMA.Ode7C22.melody	@ltx/en_us_goadedes/he.h.m4:heHE.ODiasosasEnPyri.name
ltx/en_us_goadedes/me.m02.d19:alt1.meMA.Ode7C22.mode	@ltx/en_us_goadedes/miscellanea:misc.Mode4
ltx/en_us_goadedes/me.m02.d19:alt1.meMA.Ode7C22.ode	@ltx/en_us_goadedes/miscellanea:misc.Ode7
ltx/en_us_goadedes/me.m02.d19:alt1.meMA.Ode7C22.text	
ltx/en_us_goadedes/me.m02.d19:alt1.meMA.Ode7C23.incipit	…
ltx/en_us_goadedes/me.m02.d19:alt1.meMA.Ode7C23.melody	@ltx/en_us_goadedes/he.h.m4:heHE.ODiasosasEnPyri.name
ltx/en_us_goadedes/me.m02.d19:alt1.meMA.Ode7C23.mode	@ltx/en_us_goadedes/miscellanea:misc.Mode4
ltx/en_us_goadedes/me.m02.d19:alt1.meMA.Ode7C23.ode	@ltx/en_us_goadedes/miscellanea:misc.Ode7
ltx/en_us_goadedes/me.m02.d19:alt1.meMA.Ode7C23.text	
ltx/en_us_goadedes/me.m02.d19:alt1.meMA.Ode7C2T.incipit	…
ltx/en_us_goadedes/me.m02.d19:alt1.meMA.Ode7C2T.melody	@ltx/en_us_goadedes/he.h.m4:heHE.ODiasosasEnPyri.name
ltx/en_us_goadedes/me.m02.d19:alt1.meMA.Ode7C2T.mode	@ltx/en_us_goadedes/miscellanea:misc.Mode4
ltx/en_us_goadedes/me.m02.d19:alt1.meMA.Ode7C2T.ode	@ltx/en_us_goadedes/miscellanea:misc.Ode7
ltx/en_us_goadedes/me.m02.d19:alt1.meMA.Ode7C2T.text	
ltx/en_us_goadedes/me.m02.d19:alt1.meMA.Ode8C11.greekmelody	@ltx/en_us_goadedes/he.h.m8:heHE.EvlogeitePaides.greekname
ltx/en_us_goadedes/me.m02.d19:alt1.meMA.Ode8C11.incipit	…
ltx/en_us_goadedes/me.m02.d19:alt1.meMA.Ode8C11.melody	@ltx/en_us_goadedes/he.h.m8:heHE.EvlogeitePaides.name
ltx/en_us_goadedes/me.m02.d19:alt1.meMA.Ode8C11.mode	@ltx/en_us_goadedes/miscellanea:misc.Mode8
ltx/en_us_goadedes/me.m02.d19:alt1.meMA.Ode8C11.ode	@ltx/en_us_goadedes/miscellanea:misc.Ode8
ltx/en_us_goadedes/me.m02.d19:alt1.meMA.Ode8C11.text	
ltx/en_us_goadedes/me.m02.d19:alt1.meMA.Ode8C12.incipit	…
ltx/en_us_goadedes/me.m02.d19:alt1.meMA.Ode8C12.melody	@ltx/en_us_goadedes/he.h.m8:heHE.EvlogeitePaides.name
ltx/en_us_goadedes/me.m02.d19:alt1.meMA.Ode8C12.mode	@ltx/en_us_goadedes/miscellanea:misc.Mode8
ltx/en_us_goadedes/me.m02.d19:alt1.meMA.Ode8C12.ode	@ltx/en_us_goadedes/miscellanea:misc.Ode8
ltx/en_us_goadedes/me.m02.d19:alt1.meMA.Ode8C12.text	
ltx/en_us_goadedes/me.m02.d19:alt1.meMA.Ode8C13.incipit	…
ltx/en_us_goadedes/me.m02.d19:alt1.meMA.Ode8C13.melody	@ltx/en_us_goadedes/he.h.m8:heHE.EvlogeitePaides.name
ltx/en_us_goadedes/me.m02.d19:alt1.meMA.Ode8C13.mode	@ltx/en_us_goadedes/miscellanea:misc.Mode8
ltx/en_us_goadedes/me.m02.d19:alt1.meMA.Ode8C13.ode	@ltx/en_us_goadedes/miscellanea:misc.Ode8
ltx/en_us_goadedes/me.m02.d19:alt1.meMA.Ode8C13.text	
ltx/en_us_goadedes/me.m02.d19:alt1.meMA.Ode8C14.incipit	…
ltx/en_us_goadedes/me.m02.d19:alt1.meMA.Ode8C14.melody	@ltx/en_us_goadedes/he.h.m8:heHE.EvlogeitePaides.name
ltx/en_us_goadedes/me.m02.d19:alt1.meMA.Ode8C14.mode	@ltx/en_us_goadedes/miscellanea:misc.Mode8
ltx/en_us_goadedes/me.m02.d19:alt1.meMA.Ode8C14.ode	@ltx/en_us_goadedes/miscellanea:misc.Ode8
ltx/en_us_goadedes/me.m02.d19:alt1.meMA.Ode8C14.text	
ltx/en_us_goadedes/me.m02.d19:alt1.meMA.Ode8C1H.greekmelody	@ltx/en_us_goadedes/he.h.m8:heHE.EvlogeitePaides.greekname
ltx/en_us_goadedes/me.m02.d19:alt1.meMA.Ode8C1H.incipit	@ltx/en_us_goadedes/he.h.m8:heHE.EvlogeitePaides.incipit
ltx/en_us_goadedes/me.m02.d19:alt1.meMA.Ode8C1H.melody	@ltx/en_us_goadedes/he.h.m8:heHE.EvlogeitePaides.melody
ltx/en_us_goadedes/me.m02.d19:alt1.meMA.Ode8C1H.mode	@ltx/en_us_goadedes/miscellanea:misc.Mode8
ltx/en_us_goadedes/me.m02.d19:alt1.meMA.Ode8C1H.ode	@ltx/en_us_goadedes/miscellanea:misc.Ode8
ltx/en_us_goadedes/me.m02.d19:alt1.meMA.Ode8C1H.text	@ltx/en_us_goadedes/he.h.m8:heHE.EvlogeitePaides.text
ltx/en_us_goadedes/me.m02.d19:alt1.meMA.Ode8C21.greekmelody	@ltx/en_us_goadedes/he.h.m4:heHE.PaidasEvageis.greekname
ltx/en_us_goadedes/me.m02.d19:alt1.meMA.Ode8C21.incipit	…
ltx/en_us_goadedes/me.m02.d19:alt1.meMA.Ode8C21.melody	@ltx/en_us_goadedes/he.h.m4:heHE.PaidasEvageis.name
ltx/en_us_goadedes/me.m02.d19:alt1.meMA.Ode8C21.mode	@ltx/en_us_goadedes/miscellanea:misc.Mode4
ltx/en_us_goadedes/me.m02.d19:alt1.meMA.Ode8C21.ode	@ltx/en_us_goadedes/miscellanea:misc.Ode8
ltx/en_us_goadedes/me.m02.d19:alt1.meMA.Ode8C21.text	
ltx/en_us_goadedes/me.m02.d19:alt1.meMA.Ode8C22.incipit	…
ltx/en_us_goadedes/me.m02.d19:alt1.meMA.Ode8C22.melody	@ltx/en_us_goadedes/he.h.m4:heHE.PaidasEvageis.name
ltx/en_us_goadedes/me.m02.d19:alt1.meMA.Ode8C22.mode	@ltx/en_us_goadedes/miscellanea:misc.Mode4
ltx/en_us_goadedes/me.m02.d19:alt1.meMA.Ode8C22.ode	@ltx/en_us_goadedes/miscellanea:misc.Ode8
ltx/en_us_goadedes/me.m02.d19:alt1.meMA.Ode8C22.text	
ltx/en_us_goadedes/me.m02.d19:alt1.meMA.Ode8C23.incipit	…
ltx/en_us_goadedes/me.m02.d19:alt1.meMA.Ode8C23.melody	@ltx/en_us_goadedes/he.h.m4:heHE.PaidasEvageis.name
ltx/en_us_goadedes/me.m02.d19:alt1.meMA.Ode8C23.mode	@ltx/en_us_goadedes/miscellanea:misc.Mode4
ltx/en_us_goadedes/me.m02.d19:alt1.meMA.Ode8C23.ode	@ltx/en_us_goadedes/miscellanea:misc.Ode8
ltx/en_us_goadedes/me.m02.d19:alt1.meMA.Ode8C23.text	
ltx/en_us_goadedes/me.m02.d19:alt1.meMA.Ode8C2T.incipit	…
ltx/en_us_goadedes/me.m02.d19:alt1.meMA.Ode8C2T.melody	@ltx/en_us_goadedes/he.h.m4:heHE.PaidasEvageis.name
ltx/en_us_goadedes/me.m02.d19:alt1.meMA.Ode8C2T.mode	@ltx/en_us_goadedes/miscellanea:misc.Mode4
ltx/en_us_goadedes/me.m02.d19:alt1.meMA.Ode8C2T.ode	@ltx/en_us_goadedes/miscellanea:misc.Ode8
ltx/en_us_goadedes/me.m02.d19:alt1.meMA.Ode8C2T.text	
ltx/en_us_goadedes/me.m02.d19:alt1.meMA.Ode9C11.greekmelody	@ltx/en_us_goadedes/he.h.m8:heHE.EfrixePasaAkoi.greekname
ltx/en_us_goadedes/me.m02.d19:alt1.meMA.Ode9C11.incipit	…
ltx/en_us_goadedes/me.m02.d19:alt1.meMA.Ode9C11.melody	@ltx/en_us_goadedes/he.h.m8:heHE.EfrixePasaAkoi.name
ltx/en_us_goadedes/me.m02.d19:alt1.meMA.Ode9C11.mode	@ltx/en_us_goadedes/miscellanea:misc.Mode8
ltx/en_us_goadedes/me.m02.d19:alt1.meMA.Ode9C11.ode	@ltx/en_us_goadedes/miscellanea:misc.Ode9
ltx/en_us_goadedes/me.m02.d19:alt1.meMA.Ode9C11.text	
ltx/en_us_goadedes/me.m02.d19:alt1.meMA.Ode9C12.incipit	…
ltx/en_us_goadedes/me.m02.d19:alt1.meMA.Ode9C12.melody	@ltx/en_us_goadedes/he.h.m8:heHE.EfrixePasaAkoi.name
ltx/en_us_goadedes/me.m02.d19:alt1.meMA.Ode9C12.mode	@ltx/en_us_goadedes/miscellanea:misc.Mode8
ltx/en_us_goadedes/me.m02.d19:alt1.meMA.Ode9C12.ode	@ltx/en_us_goadedes/miscellanea:misc.Ode9
ltx/en_us_goadedes/me.m02.d19:alt1.meMA.Ode9C12.text	
ltx/en_us_goadedes/me.m02.d19:alt1.meMA.Ode9C13.incipit	…
ltx/en_us_goadedes/me.m02.d19:alt1.meMA.Ode9C13.melody	@ltx/en_us_goadedes/he.h.m8:heHE.EfrixePasaAkoi.name
ltx/en_us_goadedes/me.m02.d19:alt1.meMA.Ode9C13.mode	@ltx/en_us_goadedes/miscellanea:misc.Mode8
ltx/en_us_goadedes/me.m02.d19:alt1.meMA.Ode9C13.ode	@ltx/en_us_goadedes/miscellanea:misc.Ode9
ltx/en_us_goadedes/me.m02.d19:alt1.meMA.Ode9C13.text	
ltx/en_us_goadedes/me.m02.d19:alt1.meMA.Ode9C14.incipit	…
ltx/en_us_goadedes/me.m02.d19:alt1.meMA.Ode9C14.melody	@ltx/en_us_goadedes/he.h.m8:heHE.EfrixePasaAkoi.name
ltx/en_us_goadedes/me.m02.d19:alt1.meMA.Ode9C14.mode	@ltx/en_us_goadedes/miscellanea:misc.Mode8
ltx/en_us_goadedes/me.m02.d19:alt1.meMA.Ode9C14.ode	@ltx/en_us_goadedes/miscellanea:misc.Ode9
ltx/en_us_goadedes/me.m02.d19:alt1.meMA.Ode9C14.text	
ltx/en_us_goadedes/me.m02.d19:alt1.meMA.Ode9C1H.greekmelody	@ltx/en_us_goadedes/he.h.m8:heHE.EfrixePasaAkoi.greekname
ltx/en_us_goadedes/me.m02.d19:alt1.meMA.Ode9C1H.incipit	@ltx/en_us_goadedes/he.h.m8:heHE.EfrixePasaAkoi.incipit
ltx/en_us_goadedes/me.m02.d19:alt1.meMA.Ode9C1H.melody	@ltx/en_us_goadedes/he.h.m8:heHE.EfrixePasaAkoi.melody
ltx/en_us_goadedes/me.m02.d19:alt1.meMA.Ode9C1H.mode	@ltx/en_us_goadedes/miscellanea:misc.Mode8
ltx/en_us_goadedes/me.m02.d19:alt1.meMA.Ode9C1H.ode	@ltx/en_us_goadedes/miscellanea:misc.Ode9
ltx/en_us_goadedes/me.m02.d19:alt1.meMA.Ode9C1H.text	@ltx/en_us_goadedes/he.h.m8:heHE.EfrixePasaAkoi.text
ltx/en_us_goadedes/me.m02.d19:alt1.meMA.Ode9C21.greekmelody	@ltx/en_us_goadedes/he.h.m4:heHE.ApasGigenis.greekname
ltx/en_us_goadedes/me.m02.d19:alt1.meMA.Ode9C21.incipit	…
ltx/en_us_goadedes/me.m02.d19:alt1.meMA.Ode9C21.melody	@ltx/en_us_goadedes/he.h.m4:heHE.ApasGigenis.name
ltx/en_us_goadedes/me.m02.d19:alt1.meMA.Ode9C21.mode	@ltx/en_us_goadedes/miscellanea:misc.Mode4
ltx/en_us_goadedes/me.m02.d19:alt1.meMA.Ode9C21.ode	@ltx/en_us_goadedes/miscellanea:misc.Ode9
ltx/en_us_goadedes/me.m02.d19:alt1.meMA.Ode9C21.text	
ltx/en_us_goadedes/me.m02.d19:alt1.meMA.Ode9C22.incipit	…
ltx/en_us_goadedes/me.m02.d19:alt1.meMA.Ode9C22.melody	@ltx/en_us_goadedes/he.h.m4:heHE.ApasGigenis.name
ltx/en_us_goadedes/me.m02.d19:alt1.meMA.Ode9C22.mode	@ltx/en_us_goadedes/miscellanea:misc.Mode4
ltx/en_us_goadedes/me.m02.d19:alt1.meMA.Ode9C22.ode	@ltx/en_us_goadedes/miscellanea:misc.Ode9
ltx/en_us_goadedes/me.m02.d19:alt1.meMA.Ode9C22.text	
ltx/en_us_goadedes/me.m02.d19:alt1.meMA.Ode9C23.incipit	…
ltx/en_us_goadedes/me.m02.d19:alt1.meMA.Ode9C23.melody	@ltx/en_us_goadedes/he.h.m4:heHE.ApasGigenis.name
ltx/en_us_goadedes/me.m02.d19:alt1.meMA.Ode9C23.mode	@ltx/en_us_goadedes/miscellanea:misc.Mode4
ltx/en_us_goadedes/me.m02.d19:alt1.meMA.Ode9C23.ode	@ltx/en_us_goadedes/miscellanea:misc.Ode9
ltx/en_us_goadedes/me.m02.d19:alt1.meMA.Ode9C23.text	
ltx/en_us_goadedes/me.m02.d19:alt1.meMA.Ode9C2T.incipit	…
ltx/en_us_goadedes/me.m02.d19:alt1.meMA.Ode9C2T.melody	@ltx/en_us_goadedes/he.h.m4:heHE.ApasGigenis.name
ltx/en_us_goadedes/me.m02.d19:alt1.meMA.Ode9C2T.mode	@ltx/en_us_goadedes/miscellanea:misc.Mode4
ltx/en_us_goadedes/me.m02.d19:alt1.meMA.Ode9C2T.ode	@ltx/en_us_goadedes/miscellanea:misc.Ode9
ltx/en_us_goadedes/me.m02.d19:alt1.meMA.Ode9C2T.text	
ltx/en_us_goadedes/me.m02.d19:alt1.meMA.Oikos1.text	
ltx/en_us_goadedes/me.m02.d19:alt1.meMA.PostGospelBoth.incipit	@ltx/en_us_goadedes/ho.ho03:hoMA.PostGospelTheotokos.incipit
ltx/en_us_goadedes/me.m02.d19:alt1.meMA.PostGospelBoth.melody	
ltx/en_us_goadedes/me.m02.d19:alt1.meMA.PostGospelBoth.mode	@ltx/en_us_goadedes/miscellanea:misc.Mode2
ltx/en_us_goadedes/me.m02.d19:alt1.meMA.PostGospelBoth.text	@ltx/en_us_goadedes/ho.ho03:hoMA.PostGospelTheotokos.text
ltx/en_us_goadedes/me.m02.d19:alt1.meMA.PostGospelGlory.incipit	@ltx/en_us_goadedes/ho.ho03:hoMA.PostGospelWomanMartyr.incipit
ltx/en_us_goadedes/me.m02.d19:alt1.meMA.PostGospelGlory.melody	
ltx/en_us_goadedes/me.m02.d19:alt1.meMA.PostGospelGlory.mode	@ltx/en_us_goadedes/miscellanea:misc.Mode2
ltx/en_us_goadedes/me.m02.d19:alt1.meMA.PostGospelGlory.text	@ltx/en_us_goadedes/ho.ho03:hoMA.PostGospelWomanMartyr.text
ltx/en_us_goadedes/me.m02.d19:alt1.meMA.PostGospelIdiomelon.incipit	…
ltx/en_us_goadedes/me.m02.d19:alt1.meMA.PostGospelIdiomelon.melody	
ltx/en_us_goadedes/me.m02.d19:alt1.meMA.PostGospelIdiomelon.mode	@ltx/en_us_goadedes/miscellanea:misc.Mode2
ltx/en_us_goadedes/me.m02.d19:alt1.meMA.PostGospelIdiomelon.text	
ltx/en_us_goadedes/me.m02.d19:alt1.meVE.Apolytikion1.greekmelody	@ltx/en_us_goadedes/he.a.m5:heAU.TonSynanarchonLogon.greekname
ltx/en_us_goadedes/me.m02.d19:alt1.meVE.Apolytikion1.incipit	…
ltx/en_us_goadedes/me.m02.d19:alt1.meVE.Apolytikion1.melody	@ltx/en_us_goadedes/he.a.m5:heAU.TonSynanarchonLogon.name
ltx/en_us_goadedes/me.m02.d19:alt1.meVE.Apolytikion1.mode	@ltx/en_us_goadedes/miscellanea:misc.Mode5
ltx/en_us_goadedes/me.m02.d19:alt1.meVE.Apolytikion1.text	
ltx/en_us_goadedes/me.m02.d19:alt1.meVE.AposGlory.incipit	…
ltx/en_us_goadedes/me.m02.d19:alt1.meVE.AposGlory.melody	
ltx/en_us_goadedes/me.m02.d19:alt1.meVE.AposGlory.mode	@ltx/en_us_goadedes/miscellanea:misc.Mode8
ltx/en_us_goadedes/me.m02.d19:alt1.meVE.AposGlory.text	
ltx/en_us_goadedes/me.m02.d19:alt1.meVE.AposTheotokion.incipit	@ltx/en_us_goadedes/oc.m8.d1:ocVE.AposTheotokion.incipit
ltx/en_us_goadedes/me.m02.d19:alt1.meVE.AposTheotokion.melody	
ltx/en_us_goadedes/me.m02.d19:alt1.meVE.AposTheotokion.mode	@ltx/en_us_goadedes/miscellanea:misc.Mode8
ltx/en_us_goadedes/me.m02.d19:alt1.meVE.AposTheotokion.text	@ltx/en_us_goadedes/oc.m8.d1:ocVE.AposTheotokion.text
ltx/en_us_goadedes/me.m02.d19:alt1.meVE.Aposticha1.greekmelody	@ltx/en_us_goadedes/he.a.m5:heAU.ChairoisAskitikon.greekname
ltx/en_us_goadedes/me.m02.d19:alt1.meVE.Aposticha1.incipit	…
ltx/en_us_goadedes/me.m02.d19:alt1.meVE.Aposticha1.melody	@ltx/en_us_goadedes/he.a.m5:heAU.ChairoisAskitikon.name
ltx/en_us_goadedes/me.m02.d19:alt1.meVE.Aposticha1.mode	@ltx/en_us_goadedes/miscellanea:misc.Mode5
ltx/en_us_goadedes/me.m02.d19:alt1.meVE.Aposticha1.text	
ltx/en_us_goadedes/me.m02.d19:alt1.meVE.Aposticha2.incipit	…
ltx/en_us_goadedes/me.m02.d19:alt1.meVE.Aposticha2.melody	@ltx/en_us_goadedes/he.a.m5:heAU.ChairoisAskitikon.name
ltx/en_us_goadedes/me.m02.d19:alt1.meVE.Aposticha2.mode	@ltx/en_us_goadedes/miscellanea:misc.Mode5
ltx/en_us_goadedes/me.m02.d19:alt1.meVE.Aposticha2.text	
ltx/en_us_goadedes/me.m02.d19:alt1.meVE.Aposticha3.incipit	…
ltx/en_us_goadedes/me.m02.d19:alt1.meVE.Aposticha3.melody	@ltx/en_us_goadedes/he.a.m5:heAU.ChairoisAskitikon.name
ltx/en_us_goadedes/me.m02.d19:alt1.meVE.Aposticha3.mode	@ltx/en_us_goadedes/miscellanea:misc.Mode5
ltx/en_us_goadedes/me.m02.d19:alt1.meVE.Aposticha3.text	
ltx/en_us_goadedes/me.m02.d19:alt1.meVE.Lity1.incipit	…
ltx/en_us_goadedes/me.m02.d19:alt1.meVE.Lity1.melody	
ltx/en_us_goadedes/me.m02.d19:alt1.meVE.Lity1.mode	@ltx/en_us_goadedes/miscellanea:misc.Mode1
ltx/en_us_goadedes/me.m02.d19:alt1.meVE.Lity1.text	
ltx/en_us_goadedes/me.m02.d19:alt1.meVE.Lity2.incipit	…
ltx/en_us_goadedes/me.m02.d19:alt1.meVE.Lity2.melody	
ltx/en_us_goadedes/me.m02.d19:alt1.meVE.Lity2.mode	@ltx/en_us_goadedes/miscellanea:misc.Mode1
ltx/en_us_goadedes/me.m02.d19:alt1.meVE.Lity2.text	
ltx/en_us_goadedes/me.m02.d19:alt1.meVE.Lity3.incipit	…
ltx/en_us_goadedes/me.m02.d19:alt1.meVE.Lity3.melody	
ltx/en_us_goadedes/me.m02.d19:alt1.meVE.Lity3.mode	@ltx/en_us_goadedes/miscellanea:misc.Mode2
ltx/en_us_goadedes/me.m02.d19:alt1.meVE.Lity3.text	
ltx/en_us_goadedes/me.m02.d19:alt1.meVE.LityBoth.incipit	@ltx/en_us_goadedes/oc.m8.d5:ocMA.AposTheotokion.incipit
ltx/en_us_goadedes/me.m02.d19:alt1.meVE.LityBoth.melody	
ltx/en_us_goadedes/me.m02.d19:alt1.meVE.LityBoth.mode	@ltx/en_us_goadedes/miscellanea:misc.Mode8
ltx/en_us_goadedes/me.m02.d19:alt1.meVE.LityBoth.text	@ltx/en_us_goadedes/oc.m8.d5:ocMA.AposTheotokion.text
ltx/en_us_goadedes/me.m02.d19:alt1.meVE.LityGlory.incipit	…
ltx/en_us_goadedes/me.m02.d19:alt1.meVE.LityGlory.melody	
ltx/en_us_goadedes/me.m02.d19:alt1.meVE.LityGlory.mode	@ltx/en_us_goadedes/miscellanea:misc.Mode8
ltx/en_us_goadedes/me.m02.d19:alt1.meVE.LityGlory.text	
ltx/en_us_goadedes/me.m02.d19:alt1.meVE.SticGlory.incipit	…
ltx/en_us_goadedes/me.m02.d19:alt1.meVE.SticGlory.melody	
ltx/en_us_goadedes/me.m02.d19:alt1.meVE.SticGlory.mode	@ltx/en_us_goadedes/miscellanea:misc.Mode5
ltx/en_us_goadedes/me.m02.d19:alt1.meVE.SticGlory.text	
ltx/en_us_goadedes/me.m02.d19:alt1.meVE.SticTheotokion.incipit	@ltx/en_us_goadedes/oc.m5.d1:ocVE.SticTheotokion.incipit
ltx/en_us_goadedes/me.m02.d19:alt1.meVE.SticTheotokion.melody	
ltx/en_us_goadedes/me.m02.d19:alt1.meVE.SticTheotokion.mode	@ltx/en_us_goadedes/miscellanea:misc.Mode5
ltx/en_us_goadedes/me.m02.d19:alt1.meVE.SticTheotokion.text	@ltx/en_us_goadedes/oc.m5.d1:ocVE.SticTheotokion.text
ltx/en_us_goadedes/me.m02.d19:alt1.meVE.Stichera01.greekmelody	@ltx/en_us_goadedes/he.a.m4:heAU.OsGennaionEnMartysi.greekname
ltx/en_us_goadedes/me.m02.d19:alt1.meVE.Stichera01.incipit	…
ltx/en_us_goadedes/me.m02.d19:alt1.meVE.Stichera01.melody	@ltx/en_us_goadedes/he.a.m4:heAU.OsGennaionEnMartysi.name
ltx/en_us_goadedes/me.m02.d19:alt1.meVE.Stichera01.mode	@ltx/en_us_goadedes/miscellanea:misc.Mode4
ltx/en_us_goadedes/me.m02.d19:alt1.meVE.Stichera01.text	
ltx/en_us_goadedes/me.m02.d19:alt1.meVE.Stichera02.incipit	…
ltx/en_us_goadedes/me.m02.d19:alt1.meVE.Stichera02.melody	@ltx/en_us_goadedes/he.a.m4:heAU.OsGennaionEnMartysi.name
ltx/en_us_goadedes/me.m02.d19:alt1.meVE.Stichera02.mode	@ltx/en_us_goadedes/miscellanea:misc.Mode4
ltx/en_us_goadedes/me.m02.d19:alt1.meVE.Stichera02.text	
ltx/en_us_goadedes/me.m02.d19:alt1.meVE.Stichera03.incipit	…
ltx/en_us_goadedes/me.m02.d19:alt1.meVE.Stichera03.melody	@ltx/en_us_goadedes/he.a.m4:heAU.OsGennaionEnMartysi.name
ltx/en_us_goadedes/me.m02.d19:alt1.meVE.Stichera03.mode	@ltx/en_us_goadedes/miscellanea:misc.Mode4
ltx/en_us_goadedes/me.m02.d19:alt1.meVE.Stichera03.text	
ltx/en_us_goadedes/me.m02.d19:alt1.meVE.Stichera04.greekmelody	@ltx/en_us_goadedes/he.a.m4:heAU.EdokasSimeiosin.greekname
ltx/en_us_goadedes/me.m02.d19:alt1.meVE.Stichera04.incipit	…
ltx/en_us_goadedes/me.m02.d19:alt1.meVE.Stichera04.melody	@ltx/en_us_goadedes/he.a.m4:heAU.EdokasSimeiosin.name
ltx/en_us_goadedes/me.m02.d19:alt1.meVE.Stichera04.mode	@ltx/en_us_goadedes/miscellanea:misc.Mode4
ltx/en_us_goadedes/me.m02.d19:alt1.meVE.Stichera04.text	
ltx/en_us_goadedes/me.m02.d19:alt1.meVE.Stichera05.greekmelody	@ltx/en_us_goadedes/he.a.m4:heAU.EdokasSimeiosin.greekname
ltx/en_us_goadedes/me.m02.d19:alt1.meVE.Stichera05.incipit	…
ltx/en_us_goadedes/me.m02.d19:alt1.meVE.Stichera05.melody	@ltx/en_us_goadedes/he.a.m4:heAU.EdokasSimeiosin.name
ltx/en_us_goadedes/me.m02.d19:alt1.meVE.Stichera05.mode	@ltx/en_us_goadedes/miscellanea:misc.Mode4
ltx/en_us_goadedes/me.m02.d19:alt1.meVE.Stichera05.text	
ltx/en_us_goadedes/me.m02.d19:alt1.meVE.Stichera06.incipit	…
ltx/en_us_goadedes/me.m02.d19:alt1.meVE.Stichera06.melody	@ltx/en_us_goadedes/he.a.m4:heAU.EdokasSimeiosin.name
ltx/en_us_goadedes/me.m02.d19:alt1.meVE.Stichera06.mode	@ltx/en_us_goadedes/miscellanea:misc.Mode4
ltx/en_us_goadedes/me.m02.d19:alt1.meVE.Stichera06.text	
ltx/en_us_goadedes/me.m02.d19:meDA.commemoration.first	
ltx/en_us_goadedes/me.m02.d19:meDA.commemoration.first_name	
ltx/en_us_goadedes/me.m02.d19:meDA.commemoration.first_short	
ltx/en_us_goadedes/me.m02.d19:meDA.commemoration.first_title	@ltx/en_us_goadedes/titles:ti.Apostle
ltx/en_us_goadedes/me.m02.d19:meDA.commemoration.full	
ltx/en_us_goadedes/me.m02.d19:meDA.commemoration.second_name	
ltx/en_us_goadedes/me.m02.d19:meDA.commemoration.second_title	
ltx/en_us_goadedes/me.m02.d19:meDA.date	
ltx/en_us_goadedes/me.m02.d19:meDA.fordate	
ltx/en_us_goadedes/me.m02.d19:meDA.insert1	
ltx/en_us_goadedes/me.m02.d19:meDA.insert2	
ltx/en_us_goadedes/me.m02.d19:meDA.note	
ltx/en_us_goadedes/me.m02.d19:meDA.pdfcoverdate	
ltx/en_us_goadedes/me.m02.d19:meDA.pdfheaderdate	
ltx/en_us_goadedes/me.m02.d19:meHO.commemorations	
ltx/en_us_goadedes/me.m02.d19:meHO.note1	
ltx/en_us_goadedes/me.m02.d19:meHO.note2	
ltx/en_us_goadedes/me.m02.d19:meHO.number	
ltx/en_us_goadedes/me.m02.d19:meHO.rank	
ltx/en_us_goadedes/me.m02.d19:meLE.commemoration1	
ltx/en_us_goadedes/me.m02.d19:meLE.commemoration2	
ltx/en_us_goadedes/me.m02.d19:meLI.Kontakion1.greekmelody	@ltx/en_us_goadedes/me.m02.d19:meMA.Kontakion1.greekmelody
ltx/en_us_goadedes/me.m02.d19:meLI.Kontakion1.incipit	@ltx/en_us_goadedes/me.m02.d19:meMA.Kontakion1.incipit
ltx/en_us_goadedes/me.m02.d19:meLI.Kontakion1.melody	@ltx/en_us_goadedes/me.m02.d19:meMA.Kontakion1.melody
ltx/en_us_goadedes/me.m02.d19:meLI.Kontakion1.mode	@ltx/en_us_goadedes/me.m02.d19:meMA.Kontakion1.mode
ltx/en_us_goadedes/me.m02.d19:meLI.Kontakion1.text	@ltx/en_us_goadedes/me.m02.d19:meMA.Kontakion1.text
ltx/en_us_goadedes/me.m02.d19:meLI.Megalynarion.text	
ltx/en_us_goadedes/me.m02.d19:meMA.C1.acrostic.notice1	
ltx/en_us_goadedes/me.m02.d19:meMA.C1.acrostic.text	
ltx/en_us_goadedes/me.m02.d19:meMA.C1.acrostic.title	
ltx/en_us_goadedes/me.m02.d19:meMA.C1.title	@ltx/en_us_goadedes/titles:ti.CanonApostle
ltx/en_us_goadedes/me.m02.d19:meMA.C1.verse	@ltx/en_us_goadedes/prayers:pr.verse_Apostle.text
ltx/en_us_goadedes/me.m02.d19:meMA.Kontakion1.greekmelody	@ltx/en_us_goadedes/he.a.m4:heAU.EpefanisSimeron.greekname
ltx/en_us_goadedes/me.m02.d19:meMA.Kontakion1.incipit	…
ltx/en_us_goadedes/me.m02.d19:meMA.Kontakion1.melody	@ltx/en_us_goadedes/he.a.m4:heAU.EpefanisSimeron.name
ltx/en_us_goadedes/me.m02.d19:meMA.Kontakion1.mode	@ltx/en_us_goadedes/miscellanea:misc.Mode4
ltx/en_us_goadedes/me.m02.d19:meMA.Kontakion1.text	
ltx/en_us_goadedes/me.m02.d19:meMA.Ode1C11.greekmelody	@ltx/en_us_goadedes/he.h.m4:heHE.ThalassisToErythraion.greekname
ltx/en_us_goadedes/me.m02.d19:meMA.Ode1C11.incipit	…
ltx/en_us_goadedes/me.m02.d19:meMA.Ode1C11.melody	@ltx/en_us_goadedes/he.h.m4:heHE.ThalassisToErythraion.name
ltx/en_us_goadedes/me.m02.d19:meMA.Ode1C11.mode	@ltx/en_us_goadedes/miscellanea:misc.Mode4
ltx/en_us_goadedes/me.m02.d19:meMA.Ode1C11.ode	@ltx/en_us_goadedes/miscellanea:misc.Ode1
ltx/en_us_goadedes/me.m02.d19:meMA.Ode1C11.text	
ltx/en_us_goadedes/me.m02.d19:meMA.Ode1C12.incipit	…
ltx/en_us_goadedes/me.m02.d19:meMA.Ode1C12.melody	@ltx/en_us_goadedes/he.h.m4:heHE.ThalassisToErythraion.name
ltx/en_us_goadedes/me.m02.d19:meMA.Ode1C12.mode	@ltx/en_us_goadedes/miscellanea:misc.Mode4
ltx/en_us_goadedes/me.m02.d19:meMA.Ode1C12.ode	@ltx/en_us_goadedes/miscellanea:misc.Ode1
ltx/en_us_goadedes/me.m02.d19:meMA.Ode1C12.text	
ltx/en_us_goadedes/me.m02.d19:meMA.Ode1C13.incipit	…
ltx/en_us_goadedes/me.m02.d19:meMA.Ode1C13.melody	@ltx/en_us_goadedes/he.h.m4:heHE.ThalassisToErythraion.name
ltx/en_us_goadedes/me.m02.d19:meMA.Ode1C13.mode	@ltx/en_us_goadedes/miscellanea:misc.Mode4
ltx/en_us_goadedes/me.m02.d19:meMA.Ode1C13.ode	@ltx/en_us_goadedes/miscellanea:misc.Ode1
ltx/en_us_goadedes/me.m02.d19:meMA.Ode1C13.text	
ltx/en_us_goadedes/me.m02.d19:meMA.Ode1C1H.greekmelody	@ltx/en_us_goadedes/he.h.m4:heHE.ThalassisToErythraion.greekname
ltx/en_us_goadedes/me.m02.d19:meMA.Ode1C1H.incipit	@ltx/en_us_goadedes/he.h.m4:heHE.ThalassisToErythraion.incipit
ltx/en_us_goadedes/me.m02.d19:meMA.Ode1C1H.melody	@ltx/en_us_goadedes/he.h.m4:heHE.ThalassisToErythraion.melody
ltx/en_us_goadedes/me.m02.d19:meMA.Ode1C1H.mode	@ltx/en_us_goadedes/miscellanea:misc.Mode4
ltx/en_us_goadedes/me.m02.d19:meMA.Ode1C1H.ode	@ltx/en_us_goadedes/miscellanea:misc.Ode1
ltx/en_us_goadedes/me.m02.d19:meMA.Ode1C1H.text	@ltx/en_us_goadedes/he.h.m4:heHE.ThalassisToErythraion.text
ltx/en_us_goadedes/me.m02.d19:meMA.Ode1C1T.incipit	…
ltx/en_us_goadedes/me.m02.d19:meMA.Ode1C1T.melody	@ltx/en_us_goadedes/he.h.m4:heHE.ThalassisToErythraion.name
ltx/en_us_goadedes/me.m02.d19:meMA.Ode1C1T.mode	@ltx/en_us_goadedes/miscellanea:misc.Mode4
ltx/en_us_goadedes/me.m02.d19:meMA.Ode1C1T.ode	@ltx/en_us_goadedes/miscellanea:misc.Ode1
ltx/en_us_goadedes/me.m02.d19:meMA.Ode1C1T.text	
ltx/en_us_goadedes/me.m02.d19:meMA.Ode3C11.greekmelody	@ltx/en_us_goadedes/he.h.m4:heHE.EffrainetaiEpiSoi.greekname
ltx/en_us_goadedes/me.m02.d19:meMA.Ode3C11.incipit	…
ltx/en_us_goadedes/me.m02.d19:meMA.Ode3C11.melody	@ltx/en_us_goadedes/he.h.m4:heHE.EffrainetaiEpiSoi.name
ltx/en_us_goadedes/me.m02.d19:meMA.Ode3C11.mode	@ltx/en_us_goadedes/miscellanea:misc.Mode4
ltx/en_us_goadedes/me.m02.d19:meMA.Ode3C11.ode	@ltx/en_us_goadedes/miscellanea:misc.Ode3
ltx/en_us_goadedes/me.m02.d19:meMA.Ode3C11.text	
ltx/en_us_goadedes/me.m02.d19:meMA.Ode3C12.incipit	…
ltx/en_us_goadedes/me.m02.d19:meMA.Ode3C12.melody	@ltx/en_us_goadedes/he.h.m4:heHE.EffrainetaiEpiSoi.name
ltx/en_us_goadedes/me.m02.d19:meMA.Ode3C12.mode	@ltx/en_us_goadedes/miscellanea:misc.Mode4
ltx/en_us_goadedes/me.m02.d19:meMA.Ode3C12.ode	@ltx/en_us_goadedes/miscellanea:misc.Ode3
ltx/en_us_goadedes/me.m02.d19:meMA.Ode3C12.text	
ltx/en_us_goadedes/me.m02.d19:meMA.Ode3C13.incipit	…
ltx/en_us_goadedes/me.m02.d19:meMA.Ode3C13.melody	@ltx/en_us_goadedes/he.h.m4:heHE.EffrainetaiEpiSoi.name
ltx/en_us_goadedes/me.m02.d19:meMA.Ode3C13.mode	@ltx/en_us_goadedes/miscellanea:misc.Mode4
ltx/en_us_goadedes/me.m02.d19:meMA.Ode3C13.ode	@ltx/en_us_goadedes/miscellanea:misc.Ode3
ltx/en_us_goadedes/me.m02.d19:meMA.Ode3C13.text	
ltx/en_us_goadedes/me.m02.d19:meMA.Ode3C1H.greekmelody	@ltx/en_us_goadedes/he.h.m4:heHE.EffrainetaiEpiSoi.greekname
ltx/en_us_goadedes/me.m02.d19:meMA.Ode3C1H.incipit	@ltx/en_us_goadedes/he.h.m4:heHE.EffrainetaiEpiSoi.incipit
ltx/en_us_goadedes/me.m02.d19:meMA.Ode3C1H.melody	@ltx/en_us_goadedes/he.h.m4:heHE.EffrainetaiEpiSoi.melody
ltx/en_us_goadedes/me.m02.d19:meMA.Ode3C1H.mode	@ltx/en_us_goadedes/miscellanea:misc.Mode4
ltx/en_us_goadedes/me.m02.d19:meMA.Ode3C1H.ode	@ltx/en_us_goadedes/miscellanea:misc.Ode3
ltx/en_us_goadedes/me.m02.d19:meMA.Ode3C1H.text	@ltx/en_us_goadedes/he.h.m4:heHE.EffrainetaiEpiSoi.text
ltx/en_us_goadedes/me.m02.d19:meMA.Ode3C1T.incipit	…
ltx/en_us_goadedes/me.m02.d19:meMA.Ode3C1T.melody	@ltx/en_us_goadedes/he.h.m4:heHE.EffrainetaiEpiSoi.name
ltx/en_us_goadedes/me.m02.d19:meMA.Ode3C1T.mode	@ltx/en_us_goadedes/miscellanea:misc.Mode4
ltx/en_us_goadedes/me.m02.d19:meMA.Ode3C1T.ode	@ltx/en_us_goadedes/miscellanea:misc.Ode3
ltx/en_us_goadedes/me.m02.d19:meMA.Ode3C1T.text	
ltx/en_us_goadedes/me.m02.d19:meMA.Ode3Kathisma1.greekmelody	@ltx/en_us_goadedes/he.a.m1:heAU.TonTafonSouSotir.greekname
ltx/en_us_goadedes/me.m02.d19:meMA.Ode3Kathisma1.incipit	…
ltx/en_us_goadedes/me.m02.d19:meMA.Ode3Kathisma1.melody	@ltx/en_us_goadedes/he.a.m1:heAU.TonTafonSouSotir.name
ltx/en_us_goadedes/me.m02.d19:meMA.Ode3Kathisma1.mode	@ltx/en_us_goadedes/miscellanea:misc.Mode1
ltx/en_us_goadedes/me.m02.d19:meMA.Ode3Kathisma1.text	
ltx/en_us_goadedes/me.m02.d19:meMA.Ode3KathismaSt.incipit	…
ltx/en_us_goadedes/me.m02.d19:meMA.Ode3KathismaSt.melody	@ltx/en_us_goadedes/he.a.m1:heAU.TonTafonSouSotir.name
ltx/en_us_goadedes/me.m02.d19:meMA.Ode3KathismaSt.mode	@ltx/en_us_goadedes/miscellanea:misc.Mode1
ltx/en_us_goadedes/me.m02.d19:meMA.Ode3KathismaSt.text	
ltx/en_us_goadedes/me.m02.d19:meMA.Ode3KathismaT.incipit	@ltx/en_us_goadedes/oc.m1.d1:ocMO.Kathisma12.incipit
ltx/en_us_goadedes/me.m02.d19:meMA.Ode3KathismaT.melody	@ltx/en_us_goadedes/he.a.m1:heAU.TonTafonSouSotir.name
ltx/en_us_goadedes/me.m02.d19:meMA.Ode3KathismaT.mode	@ltx/en_us_goadedes/miscellanea:misc.Mode1
ltx/en_us_goadedes/me.m02.d19:meMA.Ode3KathismaT.text	@ltx/en_us_goadedes/oc.m1.d1:ocMO.Kathisma12.text
ltx/en_us_goadedes/me.m02.d19:meMA.Ode4C11.greekmelody	@ltx/en_us_goadedes/he.h.m4:heHE.EparthentaSeIdousa.greekname
ltx/en_us_goadedes/me.m02.d19:meMA.Ode4C11.incipit	…
ltx/en_us_goadedes/me.m02.d19:meMA.Ode4C11.melody	@ltx/en_us_goadedes/he.h.m4:heHE.EparthentaSeIdousa.name
ltx/en_us_goadedes/me.m02.d19:meMA.Ode4C11.mode	@ltx/en_us_goadedes/miscellanea:misc.Mode4
ltx/en_us_goadedes/me.m02.d19:meMA.Ode4C11.ode	@ltx/en_us_goadedes/miscellanea:misc.Ode4
ltx/en_us_goadedes/me.m02.d19:meMA.Ode4C11.text	
ltx/en_us_goadedes/me.m02.d19:meMA.Ode4C12.incipit	…
ltx/en_us_goadedes/me.m02.d19:meMA.Ode4C12.melody	@ltx/en_us_goadedes/he.h.m4:heHE.EparthentaSeIdousa.name
ltx/en_us_goadedes/me.m02.d19:meMA.Ode4C12.mode	@ltx/en_us_goadedes/miscellanea:misc.Mode4
ltx/en_us_goadedes/me.m02.d19:meMA.Ode4C12.ode	@ltx/en_us_goadedes/miscellanea:misc.Ode4
ltx/en_us_goadedes/me.m02.d19:meMA.Ode4C12.text	
ltx/en_us_goadedes/me.m02.d19:meMA.Ode4C13.incipit	…
ltx/en_us_goadedes/me.m02.d19:meMA.Ode4C13.melody	@ltx/en_us_goadedes/he.h.m4:heHE.EparthentaSeIdousa.name
ltx/en_us_goadedes/me.m02.d19:meMA.Ode4C13.mode	@ltx/en_us_goadedes/miscellanea:misc.Mode4
ltx/en_us_goadedes/me.m02.d19:meMA.Ode4C13.ode	@ltx/en_us_goadedes/miscellanea:misc.Ode4
ltx/en_us_goadedes/me.m02.d19:meMA.Ode4C13.text	
ltx/en_us_goadedes/me.m02.d19:meMA.Ode4C1H.greekmelody	@ltx/en_us_goadedes/he.h.m4:heHE.EparthentaSeIdousa.greekname
ltx/en_us_goadedes/me.m02.d19:meMA.Ode4C1H.incipit	@ltx/en_us_goadedes/he.h.m4:heHE.EparthentaSeIdousa.incipit
ltx/en_us_goadedes/me.m02.d19:meMA.Ode4C1H.melody	@ltx/en_us_goadedes/he.h.m4:heHE.EparthentaSeIdousa.melody
ltx/en_us_goadedes/me.m02.d19:meMA.Ode4C1H.mode	@ltx/en_us_goadedes/miscellanea:misc.Mode4
ltx/en_us_goadedes/me.m02.d19:meMA.Ode4C1H.ode	@ltx/en_us_goadedes/miscellanea:misc.Ode4
ltx/en_us_goadedes/me.m02.d19:meMA.Ode4C1H.text	@ltx/en_us_goadedes/he.h.m4:heHE.EparthentaSeIdousa.text
ltx/en_us_goadedes/me.m02.d19:meMA.Ode4C1T.incipit	…
ltx/en_us_goadedes/me.m02.d19:meMA.Ode4C1T.melody	@ltx/en_us_goadedes/he.h.m4:heHE.EparthentaSeIdousa.name
ltx/en_us_goadedes/me.m02.d19:meMA.Ode4C1T.mode	@ltx/en_us_goadedes/miscellanea:misc.Mode4
ltx/en_us_goadedes/me.m02.d19:meMA.Ode4C1T.ode	@ltx/en_us_goadedes/miscellanea:misc.Ode4
ltx/en_us_goadedes/me.m02.d19:meMA.Ode4C1T.text	
ltx/en_us_goadedes/me.m02.d19:meMA.Ode5C11.greekmelody	@ltx/en_us_goadedes/he.h.m4:heHE.SyKyrieMouFos.greekname
ltx/en_us_goadedes/me.m02.d19:meMA.Ode5C11.incipit	…
ltx/en_us_goadedes/me.m02.d19:meMA.Ode5C11.melody	@ltx/en_us_goadedes/he.h.m4:heHE.SyKyrieMouFos.name
ltx/en_us_goadedes/me.m02.d19:meMA.Ode5C11.mode	@ltx/en_us_goadedes/miscellanea:misc.Mode4
ltx/en_us_goadedes/me.m02.d19:meMA.Ode5C11.ode	@ltx/en_us_goadedes/miscellanea:misc.Ode5
ltx/en_us_goadedes/me.m02.d19:meMA.Ode5C11.text	
ltx/en_us_goadedes/me.m02.d19:meMA.Ode5C12.incipit	…
ltx/en_us_goadedes/me.m02.d19:meMA.Ode5C12.melody	@ltx/en_us_goadedes/he.h.m4:heHE.SyKyrieMouFos.name
ltx/en_us_goadedes/me.m02.d19:meMA.Ode5C12.mode	@ltx/en_us_goadedes/miscellanea:misc.Mode4
ltx/en_us_goadedes/me.m02.d19:meMA.Ode5C12.ode	@ltx/en_us_goadedes/miscellanea:misc.Ode5
ltx/en_us_goadedes/me.m02.d19:meMA.Ode5C12.text	
ltx/en_us_goadedes/me.m02.d19:meMA.Ode5C13.incipit	…
ltx/en_us_goadedes/me.m02.d19:meMA.Ode5C13.melody	@ltx/en_us_goadedes/he.h.m4:heHE.SyKyrieMouFos.name
ltx/en_us_goadedes/me.m02.d19:meMA.Ode5C13.mode	@ltx/en_us_goadedes/miscellanea:misc.Mode4
ltx/en_us_goadedes/me.m02.d19:meMA.Ode5C13.ode	@ltx/en_us_goadedes/miscellanea:misc.Ode5
ltx/en_us_goadedes/me.m02.d19:meMA.Ode5C13.text	
ltx/en_us_goadedes/me.m02.d19:meMA.Ode5C1H.greekmelody	@ltx/en_us_goadedes/he.h.m4:heHE.SyKyrieMouFos.greekname
ltx/en_us_goadedes/me.m02.d19:meMA.Ode5C1H.incipit	@ltx/en_us_goadedes/he.h.m4:heHE.SyKyrieMouFos.incipit
ltx/en_us_goadedes/me.m02.d19:meMA.Ode5C1H.melody	@ltx/en_us_goadedes/he.h.m4:heHE.SyKyrieMouFos.melody
ltx/en_us_goadedes/me.m02.d19:meMA.Ode5C1H.mode	@ltx/en_us_goadedes/miscellanea:misc.Mode4
ltx/en_us_goadedes/me.m02.d19:meMA.Ode5C1H.ode	@ltx/en_us_goadedes/miscellanea:misc.Ode5
ltx/en_us_goadedes/me.m02.d19:meMA.Ode5C1H.text	@ltx/en_us_goadedes/he.h.m4:heHE.SyKyrieMouFos.text
ltx/en_us_goadedes/me.m02.d19:meMA.Ode5C1T.incipit	…
ltx/en_us_goadedes/me.m02.d19:meMA.Ode5C1T.melody	@ltx/en_us_goadedes/he.h.m4:heHE.SyKyrieMouFos.name
ltx/en_us_goadedes/me.m02.d19:meMA.Ode5C1T.mode	@ltx/en_us_goadedes/miscellanea:misc.Mode4
ltx/en_us_goadedes/me.m02.d19:meMA.Ode5C1T.ode	@ltx/en_us_goadedes/miscellanea:misc.Ode5
ltx/en_us_goadedes/me.m02.d19:meMA.Ode5C1T.text	
ltx/en_us_goadedes/me.m02.d19:meMA.Ode6C11.greekmelody	@ltx/en_us_goadedes/he.h.m4:heHE.ThysoSoiMetaFonis.greekname
ltx/en_us_goadedes/me.m02.d19:meMA.Ode6C11.incipit	…
ltx/en_us_goadedes/me.m02.d19:meMA.Ode6C11.melody	@ltx/en_us_goadedes/he.h.m4:heHE.ThysoSoiMetaFonis.name
ltx/en_us_goadedes/me.m02.d19:meMA.Ode6C11.mode	@ltx/en_us_goadedes/miscellanea:misc.Mode4
ltx/en_us_goadedes/me.m02.d19:meMA.Ode6C11.ode	@ltx/en_us_goadedes/miscellanea:misc.Ode6
ltx/en_us_goadedes/me.m02.d19:meMA.Ode6C11.text	
ltx/en_us_goadedes/me.m02.d19:meMA.Ode6C12.incipit	…
ltx/en_us_goadedes/me.m02.d19:meMA.Ode6C12.melody	@ltx/en_us_goadedes/he.h.m4:heHE.ThysoSoiMetaFonis.name
ltx/en_us_goadedes/me.m02.d19:meMA.Ode6C12.mode	@ltx/en_us_goadedes/miscellanea:misc.Mode4
ltx/en_us_goadedes/me.m02.d19:meMA.Ode6C12.ode	@ltx/en_us_goadedes/miscellanea:misc.Ode6
ltx/en_us_goadedes/me.m02.d19:meMA.Ode6C12.text	
ltx/en_us_goadedes/me.m02.d19:meMA.Ode6C13.incipit	…
ltx/en_us_goadedes/me.m02.d19:meMA.Ode6C13.melody	@ltx/en_us_goadedes/he.h.m4:heHE.ThysoSoiMetaFonis.name
ltx/en_us_goadedes/me.m02.d19:meMA.Ode6C13.mode	@ltx/en_us_goadedes/miscellanea:misc.Mode4
ltx/en_us_goadedes/me.m02.d19:meMA.Ode6C13.ode	@ltx/en_us_goadedes/miscellanea:misc.Ode6
ltx/en_us_goadedes/me.m02.d19:meMA.Ode6C13.text	
ltx/en_us_goadedes/me.m02.d19:meMA.Ode6C1H.greekmelody	@ltx/en_us_goadedes/he.h.m4:heHE.ThysoSoiMetaFonis.greekname
ltx/en_us_goadedes/me.m02.d19:meMA.Ode6C1H.incipit	@ltx/en_us_goadedes/he.h.m4:heHE.ThysoSoiMetaFonis.incipit
ltx/en_us_goadedes/me.m02.d19:meMA.Ode6C1H.melody	@ltx/en_us_goadedes/he.h.m4:heHE.ThysoSoiMetaFonis.melody
ltx/en_us_goadedes/me.m02.d19:meMA.Ode6C1H.mode	@ltx/en_us_goadedes/miscellanea:misc.Mode4
ltx/en_us_goadedes/me.m02.d19:meMA.Ode6C1H.ode	@ltx/en_us_goadedes/miscellanea:misc.Ode6
ltx/en_us_goadedes/me.m02.d19:meMA.Ode6C1H.text	@ltx/en_us_goadedes/he.h.m4:heHE.ThysoSoiMetaFonis.text
ltx/en_us_goadedes/me.m02.d19:meMA.Ode6C1T.incipit	…
ltx/en_us_goadedes/me.m02.d19:meMA.Ode6C1T.melody	@ltx/en_us_goadedes/he.h.m4:heHE.ThysoSoiMetaFonis.name
ltx/en_us_goadedes/me.m02.d19:meMA.Ode6C1T.mode	@ltx/en_us_goadedes/miscellanea:misc.Mode4
ltx/en_us_goadedes/me.m02.d19:meMA.Ode6C1T.ode	@ltx/en_us_goadedes/miscellanea:misc.Ode6
ltx/en_us_goadedes/me.m02.d19:meMA.Ode6C1T.text	
ltx/en_us_goadedes/me.m02.d19:meMA.Ode7C11.greekmelody	@ltx/en_us_goadedes/he.h.m4:heHE.EnTiKaminoAvramiaioi.greekname
ltx/en_us_goadedes/me.m02.d19:meMA.Ode7C11.incipit	…
ltx/en_us_goadedes/me.m02.d19:meMA.Ode7C11.melody	@ltx/en_us_goadedes/he.h.m4:heHE.EnTiKaminoAvramiaioi.name
ltx/en_us_goadedes/me.m02.d19:meMA.Ode7C11.mode	@ltx/en_us_goadedes/miscellanea:misc.Mode4
ltx/en_us_goadedes/me.m02.d19:meMA.Ode7C11.ode	@ltx/en_us_goadedes/miscellanea:misc.Ode7
ltx/en_us_goadedes/me.m02.d19:meMA.Ode7C11.text	
ltx/en_us_goadedes/me.m02.d19:meMA.Ode7C12.incipit	…
ltx/en_us_goadedes/me.m02.d19:meMA.Ode7C12.melody	@ltx/en_us_goadedes/he.h.m4:heHE.EnTiKaminoAvramiaioi.name
ltx/en_us_goadedes/me.m02.d19:meMA.Ode7C12.mode	@ltx/en_us_goadedes/miscellanea:misc.Mode4
ltx/en_us_goadedes/me.m02.d19:meMA.Ode7C12.ode	@ltx/en_us_goadedes/miscellanea:misc.Ode7
ltx/en_us_goadedes/me.m02.d19:meMA.Ode7C12.text	
ltx/en_us_goadedes/me.m02.d19:meMA.Ode7C13.incipit	…
ltx/en_us_goadedes/me.m02.d19:meMA.Ode7C13.melody	@ltx/en_us_goadedes/he.h.m4:heHE.EnTiKaminoAvramiaioi.name
ltx/en_us_goadedes/me.m02.d19:meMA.Ode7C13.mode	@ltx/en_us_goadedes/miscellanea:misc.Mode4
ltx/en_us_goadedes/me.m02.d19:meMA.Ode7C13.ode	@ltx/en_us_goadedes/miscellanea:misc.Ode7
ltx/en_us_goadedes/me.m02.d19:meMA.Ode7C13.text	
ltx/en_us_goadedes/me.m02.d19:meMA.Ode7C1H.greekmelody	@ltx/en_us_goadedes/he.h.m4:heHE.EnTiKaminoAvramiaioi.greekname
ltx/en_us_goadedes/me.m02.d19:meMA.Ode7C1H.incipit	@ltx/en_us_goadedes/he.h.m4:heHE.EnTiKaminoAvramiaioi.incipit
ltx/en_us_goadedes/me.m02.d19:meMA.Ode7C1H.melody	@ltx/en_us_goadedes/he.h.m4:heHE.EnTiKaminoAvramiaioi.melody
ltx/en_us_goadedes/me.m02.d19:meMA.Ode7C1H.mode	@ltx/en_us_goadedes/miscellanea:misc.Mode4
ltx/en_us_goadedes/me.m02.d19:meMA.Ode7C1H.ode	@ltx/en_us_goadedes/miscellanea:misc.Ode7
ltx/en_us_goadedes/me.m02.d19:meMA.Ode7C1H.text	@ltx/en_us_goadedes/he.h.m4:heHE.EnTiKaminoAvramiaioi.text
ltx/en_us_goadedes/me.m02.d19:meMA.Ode7C1T.incipit	…
ltx/en_us_goadedes/me.m02.d19:meMA.Ode7C1T.melody	@ltx/en_us_goadedes/he.h.m4:heHE.EnTiKaminoAvramiaioi.name
ltx/en_us_goadedes/me.m02.d19:meMA.Ode7C1T.mode	@ltx/en_us_goadedes/miscellanea:misc.Mode4
ltx/en_us_goadedes/me.m02.d19:meMA.Ode7C1T.ode	@ltx/en_us_goadedes/miscellanea:misc.Ode7
ltx/en_us_goadedes/me.m02.d19:meMA.Ode7C1T.text	
ltx/en_us_goadedes/me.m02.d19:meMA.Ode8C11.greekmelody	@ltx/en_us_goadedes/he.h.m4:heHE.CheirasEkpetasasDaniil.greekname
ltx/en_us_goadedes/me.m02.d19:meMA.Ode8C11.incipit	…
ltx/en_us_goadedes/me.m02.d19:meMA.Ode8C11.melody	@ltx/en_us_goadedes/he.h.m4:heHE.CheirasEkpetasasDaniil.name
ltx/en_us_goadedes/me.m02.d19:meMA.Ode8C11.mode	@ltx/en_us_goadedes/miscellanea:misc.Mode4
ltx/en_us_goadedes/me.m02.d19:meMA.Ode8C11.ode	@ltx/en_us_goadedes/miscellanea:misc.Ode8
ltx/en_us_goadedes/me.m02.d19:meMA.Ode8C11.text	
ltx/en_us_goadedes/me.m02.d19:meMA.Ode8C12.incipit	…
ltx/en_us_goadedes/me.m02.d19:meMA.Ode8C12.melody	@ltx/en_us_goadedes/he.h.m4:heHE.CheirasEkpetasasDaniil.name
ltx/en_us_goadedes/me.m02.d19:meMA.Ode8C12.mode	@ltx/en_us_goadedes/miscellanea:misc.Mode4
ltx/en_us_goadedes/me.m02.d19:meMA.Ode8C12.ode	@ltx/en_us_goadedes/miscellanea:misc.Ode8
ltx/en_us_goadedes/me.m02.d19:meMA.Ode8C12.text	
ltx/en_us_goadedes/me.m02.d19:meMA.Ode8C13.incipit	…
ltx/en_us_goadedes/me.m02.d19:meMA.Ode8C13.melody	@ltx/en_us_goadedes/he.h.m4:heHE.CheirasEkpetasasDaniil.name
ltx/en_us_goadedes/me.m02.d19:meMA.Ode8C13.mode	@ltx/en_us_goadedes/miscellanea:misc.Mode4
ltx/en_us_goadedes/me.m02.d19:meMA.Ode8C13.ode	@ltx/en_us_goadedes/miscellanea:misc.Ode8
ltx/en_us_goadedes/me.m02.d19:meMA.Ode8C13.text	
ltx/en_us_goadedes/me.m02.d19:meMA.Ode8C1H.greekmelody	@ltx/en_us_goadedes/he.h.m4:heHE.CheirasEkpetasasDaniil.greekname
ltx/en_us_goadedes/me.m02.d19:meMA.Ode8C1H.incipit	@ltx/en_us_goadedes/he.h.m4:heHE.CheirasEkpetasasDaniil.incipit
ltx/en_us_goadedes/me.m02.d19:meMA.Ode8C1H.melody	@ltx/en_us_goadedes/he.h.m4:heHE.CheirasEkpetasasDaniil.melody
ltx/en_us_goadedes/me.m02.d19:meMA.Ode8C1H.mode	@ltx/en_us_goadedes/miscellanea:misc.Mode4
ltx/en_us_goadedes/me.m02.d19:meMA.Ode8C1H.ode	@ltx/en_us_goadedes/miscellanea:misc.Ode8
ltx/en_us_goadedes/me.m02.d19:meMA.Ode8C1H.text	@ltx/en_us_goadedes/he.h.m4:heHE.CheirasEkpetasasDaniil.text
ltx/en_us_goadedes/me.m02.d19:meMA.Ode8C1T.incipit	…
ltx/en_us_goadedes/me.m02.d19:meMA.Ode8C1T.melody	@ltx/en_us_goadedes/he.h.m4:heHE.CheirasEkpetasasDaniil.name
ltx/en_us_goadedes/me.m02.d19:meMA.Ode8C1T.mode	@ltx/en_us_goadedes/miscellanea:misc.Mode4
ltx/en_us_goadedes/me.m02.d19:meMA.Ode8C1T.ode	@ltx/en_us_goadedes/miscellanea:misc.Ode8
ltx/en_us_goadedes/me.m02.d19:meMA.Ode8C1T.text	
ltx/en_us_goadedes/me.m02.d19:meMA.Ode9C11.greekmelody	@ltx/en_us_goadedes/he.h.m4:heHE.LithosAcheirotmitos.greekname
ltx/en_us_goadedes/me.m02.d19:meMA.Ode9C11.incipit	…
ltx/en_us_goadedes/me.m02.d19:meMA.Ode9C11.melody	@ltx/en_us_goadedes/he.h.m4:heHE.LithosAcheirotmitos.name
ltx/en_us_goadedes/me.m02.d19:meMA.Ode9C11.mode	@ltx/en_us_goadedes/miscellanea:misc.Mode4
ltx/en_us_goadedes/me.m02.d19:meMA.Ode9C11.ode	@ltx/en_us_goadedes/miscellanea:misc.Ode9
ltx/en_us_goadedes/me.m02.d19:meMA.Ode9C11.text	
ltx/en_us_goadedes/me.m02.d19:meMA.Ode9C12.incipit	…
ltx/en_us_goadedes/me.m02.d19:meMA.Ode9C12.melody	@ltx/en_us_goadedes/he.h.m4:heHE.LithosAcheirotmitos.name
ltx/en_us_goadedes/me.m02.d19:meMA.Ode9C12.mode	@ltx/en_us_goadedes/miscellanea:misc.Mode4
ltx/en_us_goadedes/me.m02.d19:meMA.Ode9C12.ode	@ltx/en_us_goadedes/miscellanea:misc.Ode9
ltx/en_us_goadedes/me.m02.d19:meMA.Ode9C12.text	
ltx/en_us_goadedes/me.m02.d19:meMA.Ode9C13.incipit	…
ltx/en_us_goadedes/me.m02.d19:meMA.Ode9C13.melody	@ltx/en_us_goadedes/he.h.m4:heHE.LithosAcheirotmitos.name
ltx/en_us_goadedes/me.m02.d19:meMA.Ode9C13.mode	@ltx/en_us_goadedes/miscellanea:misc.Mode4
ltx/en_us_goadedes/me.m02.d19:meMA.Ode9C13.ode	@ltx/en_us_goadedes/miscellanea:misc.Ode9
ltx/en_us_goadedes/me.m02.d19:meMA.Ode9C13.text	
ltx/en_us_goadedes/me.m02.d19:meMA.Ode9C14.incipit	…
ltx/en_us_goadedes/me.m02.d19:meMA.Ode9C14.melody	@ltx/en_us_goadedes/he.h.m4:heHE.LithosAcheirotmitos.name
ltx/en_us_goadedes/me.m02.d19:meMA.Ode9C14.mode	@ltx/en_us_goadedes/miscellanea:misc.Mode4
ltx/en_us_goadedes/me.m02.d19:meMA.Ode9C14.ode	@ltx/en_us_goadedes/miscellanea:misc.Ode9
ltx/en_us_goadedes/me.m02.d19:meMA.Ode9C14.text	
ltx/en_us_goadedes/me.m02.d19:meMA.Ode9C1H.greekmelody	@ltx/en_us_goadedes/he.h.m4:heHE.LithosAcheirotmitos.greekname
ltx/en_us_goadedes/me.m02.d19:meMA.Ode9C1H.incipit	@ltx/en_us_goadedes/he.h.m4:heHE.LithosAcheirotmitos.incipit
ltx/en_us_goadedes/me.m02.d19:meMA.Ode9C1H.melody	@ltx/en_us_goadedes/he.h.m4:heHE.LithosAcheirotmitos.melody
ltx/en_us_goadedes/me.m02.d19:meMA.Ode9C1H.mode	@ltx/en_us_goadedes/miscellanea:misc.Mode4
ltx/en_us_goadedes/me.m02.d19:meMA.Ode9C1H.ode	@ltx/en_us_goadedes/miscellanea:misc.Ode9
ltx/en_us_goadedes/me.m02.d19:meMA.Ode9C1H.text	@ltx/en_us_goadedes/he.h.m4:heHE.LithosAcheirotmitos.text
ltx/en_us_goadedes/me.m02.d19:meMA.Ode9C1T.incipit	…
ltx/en_us_goadedes/me.m02.d19:meMA.Ode9C1T.melody	@ltx/en_us_goadedes/he.h.m4:heHE.LithosAcheirotmitos.name
ltx/en_us_goadedes/me.m02.d19:meMA.Ode9C1T.mode	@ltx/en_us_goadedes/miscellanea:misc.Mode4
ltx/en_us_goadedes/me.m02.d19:meMA.Ode9C1T.ode	@ltx/en_us_goadedes/miscellanea:misc.Ode9
ltx/en_us_goadedes/me.m02.d19:meMA.Ode9C1T.text	
ltx/en_us_goadedes/me.m02.d19:meMA.Oikos1.text	
ltx/en_us_goadedes/me.m02.d19:meVE.Apolytikion1ger.greekmelody	@ltx/en_us_goadedes/he.a.m4:heAU.OYpsotheisEnToStavro.greekname
ltx/en_us_goadedes/me.m02.d19:meVE.Apolytikion1ger.incipit	…
ltx/en_us_goadedes/me.m02.d19:meVE.Apolytikion1ger.melody	@ltx/en_us_goadedes/he.a.m4:heAU.OYpsotheisEnToStavro.name
ltx/en_us_goadedes/me.m02.d19:meVE.Apolytikion1ger.mode	@ltx/en_us_goadedes/miscellanea:misc.Mode4
ltx/en_us_goadedes/me.m02.d19:meVE.Apolytikion1ger.poet	@ltx/en_us_goadedes/poets:po.Gerasimou
ltx/en_us_goadedes/me.m02.d19:meVE.Apolytikion1ger.text	
ltx/en_us_goadedes/me.m02.d19:meVE.SticStavrotheotokion.greekmelody	@ltx/en_us_goadedes/he.a.m8:heAU.OiMartyresSouKyrie.greekname
ltx/en_us_goadedes/me.m02.d19:meVE.SticStavrotheotokion.incipit	…
ltx/en_us_goadedes/me.m02.d19:meVE.SticStavrotheotokion.melody	@ltx/en_us_goadedes/he.a.m8:heAU.OiMartyresSouKyrie.name
ltx/en_us_goadedes/me.m02.d19:meVE.SticStavrotheotokion.mode	@ltx/en_us_goadedes/miscellanea:misc.Mode8
ltx/en_us_goadedes/me.m02.d19:meVE.SticStavrotheotokion.text	
ltx/en_us_goadedes/me.m02.d19:meVE.SticTheotokion.greekmelody	@ltx/en_us_goadedes/he.a.m8:heAU.OiMartyresSouKyrie.greekname
ltx/en_us_goadedes/me.m02.d19:meVE.SticTheotokion.incipit	…
ltx/en_us_goadedes/me.m02.d19:meVE.SticTheotokion.melody	@ltx/en_us_goadedes/he.a.m8:heAU.OiMartyresSouKyrie.name
ltx/en_us_goadedes/me.m02.d19:meVE.SticTheotokion.mode	@ltx/en_us_goadedes/miscellanea:misc.Mode8
ltx/en_us_goadedes/me.m02.d19:meVE.SticTheotokion.text	
ltx/en_us_goadedes/me.m02.d19:meVE.Stichera01.greekmelody	@ltx/en_us_goadedes/he.a.m8:heAU.OiMartyresSouKyrie.greekname
ltx/en_us_goadedes/me.m02.d19:meVE.Stichera01.incipit	…
ltx/en_us_goadedes/me.m02.d19:meVE.Stichera01.melody	@ltx/en_us_goadedes/he.a.m8:heAU.OiMartyresSouKyrie.name
ltx/en_us_goadedes/me.m02.d19:meVE.Stichera01.mode	@ltx/en_us_goadedes/miscellanea:misc.Mode8
ltx/en_us_goadedes/me.m02.d19:meVE.Stichera01.text	
ltx/en_us_goadedes/me.m02.d19:meVE.Stichera02.incipit	…
ltx/en_us_goadedes/me.m02.d19:meVE.Stichera02.melody	@ltx/en_us_goadedes/he.a.m8:heAU.OiMartyresSouKyrie.name
ltx/en_us_goadedes/me.m02.d19:meVE.Stichera02.mode	@ltx/en_us_goadedes/miscellanea:misc.Mode8
ltx/en_us_goadedes/me.m02.d19:meVE.Stichera02.text	
ltx/en_us_goadedes/me.m02.d19:meVE.Stichera03.incipit	…
ltx/en_us_goadedes/me.m02.d19:meVE.Stichera03.melody	@ltx/en_us_goadedes/he.a.m8:heAU.OiMartyresSouKyrie.name
ltx/en_us_goadedes/me.m02.d19:meVE.Stichera03.mode	@ltx/en_us_goadedes/miscellanea:misc.Mode8
ltx/en_us_goadedes/me.m02.d19:meVE.Stichera03.text	
