ltx/en_us_goadedes/me.m09.d26:meDA.commemoration.first	
ltx/en_us_goadedes/me.m09.d26:meDA.commemoration.first_name	
ltx/en_us_goadedes/me.m09.d26:meDA.commemoration.first_short	
ltx/en_us_goadedes/me.m09.d26:meDA.commemoration.first_title	@ltx/en_us_goadedes/titles:ti.Evangelist
ltx/en_us_goadedes/me.m09.d26:meDA.commemoration.full	
ltx/en_us_goadedes/me.m09.d26:meDA.commemoration.second_name	
ltx/en_us_goadedes/me.m09.d26:meDA.commemoration.second_title	
ltx/en_us_goadedes/me.m09.d26:meDA.date	
ltx/en_us_goadedes/me.m09.d26:meDA.fordate	
ltx/en_us_goadedes/me.m09.d26:meDA.insert1	
ltx/en_us_goadedes/me.m09.d26:meDA.insert2	
ltx/en_us_goadedes/me.m09.d26:meDA.note	
ltx/en_us_goadedes/me.m09.d26:meDA.pdfcoverdate	
ltx/en_us_goadedes/me.m09.d26:meDA.pdfheaderdate	
ltx/en_us_goadedes/me.m09.d26:meHO.commemorations	
ltx/en_us_goadedes/me.m09.d26:meHO.note1	
ltx/en_us_goadedes/me.m09.d26:meHO.note2	
ltx/en_us_goadedes/me.m09.d26:meHO.number	
ltx/en_us_goadedes/me.m09.d26:meHO.rank	
ltx/en_us_goadedes/me.m09.d26:meLE.commemoration1	
ltx/en_us_goadedes/me.m09.d26:meLE.commemoration2	
ltx/en_us_goadedes/me.m09.d26:meLI.Kontakion1.incipit	@ltx/en_us_goadedes/me.m09.d26:meMA.Kontakion1.incipit
ltx/en_us_goadedes/me.m09.d26:meLI.Kontakion1.melody	@ltx/en_us_goadedes/me.m09.d26:meMA.Kontakion1.melody
ltx/en_us_goadedes/me.m09.d26:meLI.Kontakion1.mode	@ltx/en_us_goadedes/me.m09.d26:meMA.Kontakion1.mode
ltx/en_us_goadedes/me.m09.d26:meLI.Kontakion1.text	@ltx/en_us_goadedes/me.m09.d26:meMA.Kontakion1.text
ltx/en_us_goadedes/me.m09.d26:meLI.MM.CommunionHymn.text	@ltx/en_us_goadedes/properties:media.key
ltx/en_us_goadedes/me.m09.d26:meLI.Megalynarion.text	Beloved Disciple of Jesus Christ, * the wealth of theology was opened to you, O John. * Now we magnify you, Evangelist, Apostle, * seer of God, and knower of divine mysteries.
ltx/en_us_goadedes/me.m09.d26:meMA.C1.acrostic.notice1	
ltx/en_us_goadedes/me.m09.d26:meMA.C1.acrostic.notice2	
ltx/en_us_goadedes/me.m09.d26:meMA.C1.acrostic.title	Canon for the Theotokos
ltx/en_us_goadedes/me.m09.d26:meMA.C1.poet	@ltx/en_us_goadedes/poets:po.Theofanous
ltx/en_us_goadedes/me.m09.d26:meMA.C1.title	@ltx/en_us_goadedes/titles:ti.CanonTheotokos
ltx/en_us_goadedes/me.m09.d26:meMA.C1.verse	@ltx/en_us_goadedes/prayers:pr.verse_Theotokos.text
ltx/en_us_goadedes/me.m09.d26:meMA.C2.acrostic.notice1	
ltx/en_us_goadedes/me.m09.d26:meMA.C2.acrostic.text	
ltx/en_us_goadedes/me.m09.d26:meMA.C2.acrostic.title	Canon for the Saint
ltx/en_us_goadedes/me.m09.d26:meMA.C2.poet	@ltx/en_us_goadedes/poets:po.Theofanous
ltx/en_us_goadedes/me.m09.d26:meMA.C2.title	@ltx/en_us_goadedes/titles:ti.Canon1SaintM
ltx/en_us_goadedes/me.m09.d26:meMA.C2.verse	@ltx/en_us_goadedes/prayers:pr.verse_SaintM.text
ltx/en_us_goadedes/me.m09.d26:meMA.C3.acrostic.notice1	
ltx/en_us_goadedes/me.m09.d26:meMA.C3.acrostic.text	
ltx/en_us_goadedes/me.m09.d26:meMA.C3.acrostic.title	Another Canon for the Saint
ltx/en_us_goadedes/me.m09.d26:meMA.C3.title	@ltx/en_us_goadedes/titles:ti.Canon2SaintM
ltx/en_us_goadedes/me.m09.d26:meMA.C3.verse	@ltx/en_us_goadedes/prayers:pr.verse_SaintM.text
ltx/en_us_goadedes/me.m09.d26:meMA.ExapTheotokion.incipit	…
ltx/en_us_goadedes/me.m09.d26:meMA.ExapTheotokion.melody	@ltx/en_us_goadedes/he.a.m2:heAU.GynaikesAkoutisthite.name
ltx/en_us_goadedes/me.m09.d26:meMA.ExapTheotokion.mode	@ltx/en_us_goadedes/miscellanea:misc.Mode2
ltx/en_us_goadedes/me.m09.d26:meMA.ExapTheotokion.text	
ltx/en_us_goadedes/me.m09.d26:meMA.Exaposteilarion1.greekmelody	@ltx/en_us_goadedes/he.a.m2:heAU.GynaikesAkoutisthite.greekname
ltx/en_us_goadedes/me.m09.d26:meMA.Exaposteilarion1.incipit	…
ltx/en_us_goadedes/me.m09.d26:meMA.Exaposteilarion1.melody	@ltx/en_us_goadedes/he.a.m2:heAU.GynaikesAkoutisthite.name
ltx/en_us_goadedes/me.m09.d26:meMA.Exaposteilarion1.mode	@ltx/en_us_goadedes/miscellanea:misc.Mode2
ltx/en_us_goadedes/me.m09.d26:meMA.Exaposteilarion1.text	
ltx/en_us_goadedes/me.m09.d26:meMA.Kathisma11.greekmelody	@ltx/en_us_goadedes/he.a.m8:heAU.TinSofianKaiLogon.greekname
ltx/en_us_goadedes/me.m09.d26:meMA.Kathisma11.incipit	…
ltx/en_us_goadedes/me.m09.d26:meMA.Kathisma11.melody	@ltx/en_us_goadedes/he.a.m8:heAU.TinSofianKaiLogon.name
ltx/en_us_goadedes/me.m09.d26:meMA.Kathisma11.mode	@ltx/en_us_goadedes/miscellanea:misc.Mode8
ltx/en_us_goadedes/me.m09.d26:meMA.Kathisma11.text	
ltx/en_us_goadedes/me.m09.d26:meMA.Kathisma1T.incipit	@ltx/en_us_goadedes/he.a.m8:heAU.TinSofianKaiLogon.incipit
ltx/en_us_goadedes/me.m09.d26:meMA.Kathisma1T.melody	@ltx/en_us_goadedes/he.a.m8:heAU.TinSofianKaiLogon.melody
ltx/en_us_goadedes/me.m09.d26:meMA.Kathisma1T.mode	@ltx/en_us_goadedes/miscellanea:misc.Mode8
ltx/en_us_goadedes/me.m09.d26:meMA.Kathisma1T.text	@ltx/en_us_goadedes/he.a.m8:heAU.TinSofianKaiLogon.text
ltx/en_us_goadedes/me.m09.d26:meMA.Kathisma21.greekmelody	@ltx/en_us_goadedes/he.a.m8:heAU.TinSofianKaiLogon.greekname
ltx/en_us_goadedes/me.m09.d26:meMA.Kathisma21.incipit	…
ltx/en_us_goadedes/me.m09.d26:meMA.Kathisma21.melody	@ltx/en_us_goadedes/he.a.m8:heAU.TinSofianKaiLogon.name
ltx/en_us_goadedes/me.m09.d26:meMA.Kathisma21.mode	@ltx/en_us_goadedes/miscellanea:misc.Mode8
ltx/en_us_goadedes/me.m09.d26:meMA.Kathisma21.text	
ltx/en_us_goadedes/me.m09.d26:meMA.Kathisma2T.incipit	…
ltx/en_us_goadedes/me.m09.d26:meMA.Kathisma2T.melody	@ltx/en_us_goadedes/he.a.m8:heAU.TinSofianKaiLogon.name
ltx/en_us_goadedes/me.m09.d26:meMA.Kathisma2T.mode	@ltx/en_us_goadedes/miscellanea:misc.Mode8
ltx/en_us_goadedes/me.m09.d26:meMA.Kathisma2T.text	
ltx/en_us_goadedes/me.m09.d26:meMA.Kathisma31.greekmelody	@ltx/en_us_goadedes/he.a.m8:heAU.TinSofianKaiLogon.greekname
ltx/en_us_goadedes/me.m09.d26:meMA.Kathisma31.incipit	@ltx/en_us_goadedes/me.m05.d08:meMA.Kathisma21.incipit
ltx/en_us_goadedes/me.m09.d26:meMA.Kathisma31.melody	@ltx/en_us_goadedes/he.a.m8:heAU.TinSofianKaiLogon.name
ltx/en_us_goadedes/me.m09.d26:meMA.Kathisma31.mode	@ltx/en_us_goadedes/miscellanea:misc.Mode8
ltx/en_us_goadedes/me.m09.d26:meMA.Kathisma31.text	@ltx/en_us_goadedes/me.m05.d08:meMA.Kathisma21.text
ltx/en_us_goadedes/me.m09.d26:meMA.Kathisma3T.incipit	…
ltx/en_us_goadedes/me.m09.d26:meMA.Kathisma3T.melody	@ltx/en_us_goadedes/he.a.m8:heAU.TinSofianKaiLogon.name
ltx/en_us_goadedes/me.m09.d26:meMA.Kathisma3T.mode	@ltx/en_us_goadedes/miscellanea:misc.Mode8
ltx/en_us_goadedes/me.m09.d26:meMA.Kathisma3T.text	
ltx/en_us_goadedes/me.m09.d26:meMA.Kontakion1.incipit	…
ltx/en_us_goadedes/me.m09.d26:meMA.Kontakion1.melody	
ltx/en_us_goadedes/me.m09.d26:meMA.Kontakion1.mode	@ltx/en_us_goadedes/miscellanea:misc.Mode2
ltx/en_us_goadedes/me.m09.d26:meMA.Kontakion1.text	
ltx/en_us_goadedes/me.m09.d26:meMA.Lauds1.greekmelody	@ltx/en_us_goadedes/he.a.m8:heAU.OTouParadoxou.greekname
ltx/en_us_goadedes/me.m09.d26:meMA.Lauds1.incipit	…
ltx/en_us_goadedes/me.m09.d26:meMA.Lauds1.melody	@ltx/en_us_goadedes/he.a.m8:heAU.OTouParadoxou.name
ltx/en_us_goadedes/me.m09.d26:meMA.Lauds1.mode	@ltx/en_us_goadedes/miscellanea:misc.Mode8
ltx/en_us_goadedes/me.m09.d26:meMA.Lauds1.text	
ltx/en_us_goadedes/me.m09.d26:meMA.Lauds2.incipit	…
ltx/en_us_goadedes/me.m09.d26:meMA.Lauds2.melody	@ltx/en_us_goadedes/he.a.m8:heAU.OTouParadoxou.name
ltx/en_us_goadedes/me.m09.d26:meMA.Lauds2.mode	@ltx/en_us_goadedes/miscellanea:misc.Mode8
ltx/en_us_goadedes/me.m09.d26:meMA.Lauds2.text	
ltx/en_us_goadedes/me.m09.d26:meMA.Lauds3.incipit	…
ltx/en_us_goadedes/me.m09.d26:meMA.Lauds3.melody	@ltx/en_us_goadedes/he.a.m8:heAU.OTouParadoxou.name
ltx/en_us_goadedes/me.m09.d26:meMA.Lauds3.mode	@ltx/en_us_goadedes/miscellanea:misc.Mode8
ltx/en_us_goadedes/me.m09.d26:meMA.Lauds3.text	
ltx/en_us_goadedes/me.m09.d26:meMA.Lauds4.greekmelody	@ltx/en_us_goadedes/he.a.m8:heAU.OTouParadoxou.greekname
ltx/en_us_goadedes/me.m09.d26:meMA.Lauds4.incipit	…
ltx/en_us_goadedes/me.m09.d26:meMA.Lauds4.melody	@ltx/en_us_goadedes/he.a.m8:heAU.OTouParadoxou.name
ltx/en_us_goadedes/me.m09.d26:meMA.Lauds4.mode	@ltx/en_us_goadedes/miscellanea:misc.Mode8
ltx/en_us_goadedes/me.m09.d26:meMA.Lauds4.text	
ltx/en_us_goadedes/me.m09.d26:meMA.LaudsGlory.incipit	@ltx/en_us_goadedes/me.m05.d08:meMA.LaudsGlory.incipit
ltx/en_us_goadedes/me.m09.d26:meMA.LaudsGlory.melody	
ltx/en_us_goadedes/me.m09.d26:meMA.LaudsGlory.mode	@ltx/en_us_goadedes/miscellanea:misc.Mode8
ltx/en_us_goadedes/me.m09.d26:meMA.LaudsGlory.text	@ltx/en_us_goadedes/me.m05.d08:meMA.LaudsGlory.text
ltx/en_us_goadedes/me.m09.d26:meMA.LaudsTheotokion.incipit	@ltx/en_us_goadedes/oc.m8.d5:ocMA.AposTheotokion.incipit
ltx/en_us_goadedes/me.m09.d26:meMA.LaudsTheotokion.melody	
ltx/en_us_goadedes/me.m09.d26:meMA.LaudsTheotokion.mode	@ltx/en_us_goadedes/miscellanea:misc.Mode8
ltx/en_us_goadedes/me.m09.d26:meMA.LaudsTheotokion.text	@ltx/en_us_goadedes/oc.m8.d5:ocMA.AposTheotokion.text
ltx/en_us_goadedes/me.m09.d26:meMA.MM.Lauds1234as5678.text	@ltx/en_us_goadedes/properties:media.key
ltx/en_us_goadedes/me.m09.d26:meMA.Ode1C11.greekmelody	@ltx/en_us_goadedes/he.h.m2:heHE.EnVythoKatestrose.greekname
ltx/en_us_goadedes/me.m09.d26:meMA.Ode1C11.incipit	@ltx/en_us_goadedes/me.m07.d27:meMA.Ode1C11.incipit
ltx/en_us_goadedes/me.m09.d26:meMA.Ode1C11.melody	@ltx/en_us_goadedes/he.h.m2:heHE.EnVythoKatestrose.name
ltx/en_us_goadedes/me.m09.d26:meMA.Ode1C11.mode	@ltx/en_us_goadedes/miscellanea:misc.Mode2
ltx/en_us_goadedes/me.m09.d26:meMA.Ode1C11.ode	@ltx/en_us_goadedes/miscellanea:misc.Ode1
ltx/en_us_goadedes/me.m09.d26:meMA.Ode1C11.text	@ltx/en_us_goadedes/me.m07.d27:meMA.Ode1C11.text
ltx/en_us_goadedes/me.m09.d26:meMA.Ode1C12.incipit	@ltx/en_us_goadedes/me.m07.d27:meMA.Ode1C12.incipit
ltx/en_us_goadedes/me.m09.d26:meMA.Ode1C12.melody	@ltx/en_us_goadedes/he.h.m2:heHE.EnVythoKatestrose.name
ltx/en_us_goadedes/me.m09.d26:meMA.Ode1C12.mode	@ltx/en_us_goadedes/miscellanea:misc.Mode2
ltx/en_us_goadedes/me.m09.d26:meMA.Ode1C12.ode	@ltx/en_us_goadedes/miscellanea:misc.Ode1
ltx/en_us_goadedes/me.m09.d26:meMA.Ode1C12.text	@ltx/en_us_goadedes/me.m07.d27:meMA.Ode1C12.text
ltx/en_us_goadedes/me.m09.d26:meMA.Ode1C13.incipit	@ltx/en_us_goadedes/me.m07.d27:meMA.Ode1C13.incipit
ltx/en_us_goadedes/me.m09.d26:meMA.Ode1C13.melody	@ltx/en_us_goadedes/he.h.m2:heHE.EnVythoKatestrose.name
ltx/en_us_goadedes/me.m09.d26:meMA.Ode1C13.mode	@ltx/en_us_goadedes/miscellanea:misc.Mode2
ltx/en_us_goadedes/me.m09.d26:meMA.Ode1C13.ode	@ltx/en_us_goadedes/miscellanea:misc.Ode1
ltx/en_us_goadedes/me.m09.d26:meMA.Ode1C13.text	@ltx/en_us_goadedes/me.m07.d27:meMA.Ode1C13.text
ltx/en_us_goadedes/me.m09.d26:meMA.Ode1C1H.greekmelody	@ltx/en_us_goadedes/he.h.m2:heHE.EnVythoKatestrose.greekname
ltx/en_us_goadedes/me.m09.d26:meMA.Ode1C1H.incipit	@ltx/en_us_goadedes/he.h.m2:heHE.EnVythoKatestrose.incipit
ltx/en_us_goadedes/me.m09.d26:meMA.Ode1C1H.melody	@ltx/en_us_goadedes/he.h.m2:heHE.EnVythoKatestrose.melody
ltx/en_us_goadedes/me.m09.d26:meMA.Ode1C1H.mode	@ltx/en_us_goadedes/miscellanea:misc.Mode2
ltx/en_us_goadedes/me.m09.d26:meMA.Ode1C1H.ode	@ltx/en_us_goadedes/miscellanea:misc.Ode1
ltx/en_us_goadedes/me.m09.d26:meMA.Ode1C1H.text	@ltx/en_us_goadedes/he.h.m2:heHE.EnVythoKatestrose.text
ltx/en_us_goadedes/me.m09.d26:meMA.Ode1C21.greekmelody	@ltx/en_us_goadedes/he.h.m2:heHE.EnVythoKatestrose.greekname
ltx/en_us_goadedes/me.m09.d26:meMA.Ode1C21.incipit	…
ltx/en_us_goadedes/me.m09.d26:meMA.Ode1C21.melody	@ltx/en_us_goadedes/he.h.m2:heHE.EnVythoKatestrose.name
ltx/en_us_goadedes/me.m09.d26:meMA.Ode1C21.mode	@ltx/en_us_goadedes/miscellanea:misc.Mode2
ltx/en_us_goadedes/me.m09.d26:meMA.Ode1C21.ode	@ltx/en_us_goadedes/miscellanea:misc.Ode1
ltx/en_us_goadedes/me.m09.d26:meMA.Ode1C21.text	
ltx/en_us_goadedes/me.m09.d26:meMA.Ode1C22.incipit	…
ltx/en_us_goadedes/me.m09.d26:meMA.Ode1C22.melody	@ltx/en_us_goadedes/he.h.m2:heHE.EnVythoKatestrose.name
ltx/en_us_goadedes/me.m09.d26:meMA.Ode1C22.mode	@ltx/en_us_goadedes/miscellanea:misc.Mode2
ltx/en_us_goadedes/me.m09.d26:meMA.Ode1C22.ode	@ltx/en_us_goadedes/miscellanea:misc.Ode1
ltx/en_us_goadedes/me.m09.d26:meMA.Ode1C22.text	
ltx/en_us_goadedes/me.m09.d26:meMA.Ode1C23.incipit	…
ltx/en_us_goadedes/me.m09.d26:meMA.Ode1C23.melody	@ltx/en_us_goadedes/he.h.m2:heHE.EnVythoKatestrose.name
ltx/en_us_goadedes/me.m09.d26:meMA.Ode1C23.mode	@ltx/en_us_goadedes/miscellanea:misc.Mode2
ltx/en_us_goadedes/me.m09.d26:meMA.Ode1C23.ode	@ltx/en_us_goadedes/miscellanea:misc.Ode1
ltx/en_us_goadedes/me.m09.d26:meMA.Ode1C23.text	
ltx/en_us_goadedes/me.m09.d26:meMA.Ode1C2T.incipit	…
ltx/en_us_goadedes/me.m09.d26:meMA.Ode1C2T.melody	@ltx/en_us_goadedes/he.h.m2:heHE.EnVythoKatestrose.name
ltx/en_us_goadedes/me.m09.d26:meMA.Ode1C2T.mode	@ltx/en_us_goadedes/miscellanea:misc.Mode2
ltx/en_us_goadedes/me.m09.d26:meMA.Ode1C2T.ode	@ltx/en_us_goadedes/miscellanea:misc.Ode1
ltx/en_us_goadedes/me.m09.d26:meMA.Ode1C2T.text	
ltx/en_us_goadedes/me.m09.d26:meMA.Ode1C31.greekmelody	@ltx/en_us_goadedes/he.h.m6:heHE.OsEnIpeiroPezefsas.greekname
ltx/en_us_goadedes/me.m09.d26:meMA.Ode1C31.incipit	…
ltx/en_us_goadedes/me.m09.d26:meMA.Ode1C31.melody	@ltx/en_us_goadedes/he.h.m6:heHE.OsEnIpeiroPezefsas.name
ltx/en_us_goadedes/me.m09.d26:meMA.Ode1C31.mode	@ltx/en_us_goadedes/miscellanea:misc.Mode6
ltx/en_us_goadedes/me.m09.d26:meMA.Ode1C31.ode	@ltx/en_us_goadedes/miscellanea:misc.Ode1
ltx/en_us_goadedes/me.m09.d26:meMA.Ode1C31.text	
ltx/en_us_goadedes/me.m09.d26:meMA.Ode1C32.incipit	…
ltx/en_us_goadedes/me.m09.d26:meMA.Ode1C32.melody	@ltx/en_us_goadedes/he.h.m6:heHE.OsEnIpeiroPezefsas.name
ltx/en_us_goadedes/me.m09.d26:meMA.Ode1C32.mode	@ltx/en_us_goadedes/miscellanea:misc.Mode6
ltx/en_us_goadedes/me.m09.d26:meMA.Ode1C32.ode	@ltx/en_us_goadedes/miscellanea:misc.Ode1
ltx/en_us_goadedes/me.m09.d26:meMA.Ode1C32.text	
ltx/en_us_goadedes/me.m09.d26:meMA.Ode1C33.incipit	…
ltx/en_us_goadedes/me.m09.d26:meMA.Ode1C33.melody	@ltx/en_us_goadedes/he.h.m6:heHE.OsEnIpeiroPezefsas.name
ltx/en_us_goadedes/me.m09.d26:meMA.Ode1C33.mode	@ltx/en_us_goadedes/miscellanea:misc.Mode6
ltx/en_us_goadedes/me.m09.d26:meMA.Ode1C33.ode	@ltx/en_us_goadedes/miscellanea:misc.Ode1
ltx/en_us_goadedes/me.m09.d26:meMA.Ode1C33.text	
ltx/en_us_goadedes/me.m09.d26:meMA.Ode1C3T.incipit	…
ltx/en_us_goadedes/me.m09.d26:meMA.Ode1C3T.melody	@ltx/en_us_goadedes/he.h.m6:heHE.OsEnIpeiroPezefsas.name
ltx/en_us_goadedes/me.m09.d26:meMA.Ode1C3T.mode	@ltx/en_us_goadedes/miscellanea:misc.Mode6
ltx/en_us_goadedes/me.m09.d26:meMA.Ode1C3T.ode	@ltx/en_us_goadedes/miscellanea:misc.Ode1
ltx/en_us_goadedes/me.m09.d26:meMA.Ode1C3T.text	
ltx/en_us_goadedes/me.m09.d26:meMA.Ode3C11.greekmelody	@ltx/en_us_goadedes/he.h.m2:heHE.ExinthisenIErimos.greekname
ltx/en_us_goadedes/me.m09.d26:meMA.Ode3C11.incipit	@ltx/en_us_goadedes/me.m07.d27:meMA.Ode3C11.incipit
ltx/en_us_goadedes/me.m09.d26:meMA.Ode3C11.melody	@ltx/en_us_goadedes/he.h.m2:heHE.ExinthisenIErimos.name
ltx/en_us_goadedes/me.m09.d26:meMA.Ode3C11.mode	@ltx/en_us_goadedes/miscellanea:misc.Mode2
ltx/en_us_goadedes/me.m09.d26:meMA.Ode3C11.ode	@ltx/en_us_goadedes/miscellanea:misc.Ode3
ltx/en_us_goadedes/me.m09.d26:meMA.Ode3C11.text	@ltx/en_us_goadedes/me.m07.d27:meMA.Ode3C11.text
ltx/en_us_goadedes/me.m09.d26:meMA.Ode3C12.incipit	@ltx/en_us_goadedes/me.m07.d27:meMA.Ode3C12.incipit
ltx/en_us_goadedes/me.m09.d26:meMA.Ode3C12.melody	@ltx/en_us_goadedes/he.h.m2:heHE.ExinthisenIErimos.name
ltx/en_us_goadedes/me.m09.d26:meMA.Ode3C12.mode	@ltx/en_us_goadedes/miscellanea:misc.Mode2
ltx/en_us_goadedes/me.m09.d26:meMA.Ode3C12.ode	@ltx/en_us_goadedes/miscellanea:misc.Ode3
ltx/en_us_goadedes/me.m09.d26:meMA.Ode3C12.text	@ltx/en_us_goadedes/me.m07.d27:meMA.Ode3C12.text
ltx/en_us_goadedes/me.m09.d26:meMA.Ode3C13.incipit	@ltx/en_us_goadedes/me.m07.d27:meMA.Ode3C13.incipit
ltx/en_us_goadedes/me.m09.d26:meMA.Ode3C13.melody	@ltx/en_us_goadedes/he.h.m2:heHE.ExinthisenIErimos.name
ltx/en_us_goadedes/me.m09.d26:meMA.Ode3C13.mode	@ltx/en_us_goadedes/miscellanea:misc.Mode2
ltx/en_us_goadedes/me.m09.d26:meMA.Ode3C13.ode	@ltx/en_us_goadedes/miscellanea:misc.Ode3
ltx/en_us_goadedes/me.m09.d26:meMA.Ode3C13.text	@ltx/en_us_goadedes/me.m07.d27:meMA.Ode3C13.text
ltx/en_us_goadedes/me.m09.d26:meMA.Ode3C1H.greekmelody	@ltx/en_us_goadedes/he.h.m2:heHE.ExinthisenIErimos.greekname
ltx/en_us_goadedes/me.m09.d26:meMA.Ode3C1H.incipit	@ltx/en_us_goadedes/he.h.m2:heHE.ExinthisenIErimos.incipit
ltx/en_us_goadedes/me.m09.d26:meMA.Ode3C1H.melody	@ltx/en_us_goadedes/he.h.m2:heHE.ExinthisenIErimos.melody
ltx/en_us_goadedes/me.m09.d26:meMA.Ode3C1H.mode	@ltx/en_us_goadedes/miscellanea:misc.Mode2
ltx/en_us_goadedes/me.m09.d26:meMA.Ode3C1H.ode	@ltx/en_us_goadedes/miscellanea:misc.Ode3
ltx/en_us_goadedes/me.m09.d26:meMA.Ode3C1H.text	@ltx/en_us_goadedes/he.h.m2:heHE.ExinthisenIErimos.text
ltx/en_us_goadedes/me.m09.d26:meMA.Ode3C21.greekmelody	@ltx/en_us_goadedes/he.h.m2:heHE.ExinthisenIErimos.greekname
ltx/en_us_goadedes/me.m09.d26:meMA.Ode3C21.incipit	…
ltx/en_us_goadedes/me.m09.d26:meMA.Ode3C21.melody	@ltx/en_us_goadedes/he.h.m2:heHE.ExinthisenIErimos.name
ltx/en_us_goadedes/me.m09.d26:meMA.Ode3C21.mode	@ltx/en_us_goadedes/miscellanea:misc.Mode2
ltx/en_us_goadedes/me.m09.d26:meMA.Ode3C21.ode	@ltx/en_us_goadedes/miscellanea:misc.Ode3
ltx/en_us_goadedes/me.m09.d26:meMA.Ode3C21.text	
ltx/en_us_goadedes/me.m09.d26:meMA.Ode3C22.incipit	…
ltx/en_us_goadedes/me.m09.d26:meMA.Ode3C22.melody	@ltx/en_us_goadedes/he.h.m2:heHE.ExinthisenIErimos.name
ltx/en_us_goadedes/me.m09.d26:meMA.Ode3C22.mode	@ltx/en_us_goadedes/miscellanea:misc.Mode2
ltx/en_us_goadedes/me.m09.d26:meMA.Ode3C22.ode	@ltx/en_us_goadedes/miscellanea:misc.Ode3
ltx/en_us_goadedes/me.m09.d26:meMA.Ode3C22.text	
ltx/en_us_goadedes/me.m09.d26:meMA.Ode3C23.incipit	…
ltx/en_us_goadedes/me.m09.d26:meMA.Ode3C23.melody	@ltx/en_us_goadedes/he.h.m2:heHE.ExinthisenIErimos.name
ltx/en_us_goadedes/me.m09.d26:meMA.Ode3C23.mode	@ltx/en_us_goadedes/miscellanea:misc.Mode2
ltx/en_us_goadedes/me.m09.d26:meMA.Ode3C23.ode	@ltx/en_us_goadedes/miscellanea:misc.Ode3
ltx/en_us_goadedes/me.m09.d26:meMA.Ode3C23.text	
ltx/en_us_goadedes/me.m09.d26:meMA.Ode3C2T.incipit	…
ltx/en_us_goadedes/me.m09.d26:meMA.Ode3C2T.melody	@ltx/en_us_goadedes/he.h.m2:heHE.ExinthisenIErimos.name
ltx/en_us_goadedes/me.m09.d26:meMA.Ode3C2T.mode	@ltx/en_us_goadedes/miscellanea:misc.Mode2
ltx/en_us_goadedes/me.m09.d26:meMA.Ode3C2T.ode	@ltx/en_us_goadedes/miscellanea:misc.Ode3
ltx/en_us_goadedes/me.m09.d26:meMA.Ode3C2T.text	
ltx/en_us_goadedes/me.m09.d26:meMA.Ode3C31.greekmelody	@ltx/en_us_goadedes/he.h.m6:heHE.OukEstinAgios.greekname
ltx/en_us_goadedes/me.m09.d26:meMA.Ode3C31.incipit	…
ltx/en_us_goadedes/me.m09.d26:meMA.Ode3C31.melody	@ltx/en_us_goadedes/he.h.m6:heHE.OukEstinAgios.name
ltx/en_us_goadedes/me.m09.d26:meMA.Ode3C31.mode	@ltx/en_us_goadedes/miscellanea:misc.Mode6
ltx/en_us_goadedes/me.m09.d26:meMA.Ode3C31.ode	@ltx/en_us_goadedes/miscellanea:misc.Ode3
ltx/en_us_goadedes/me.m09.d26:meMA.Ode3C31.text	
ltx/en_us_goadedes/me.m09.d26:meMA.Ode3C32.incipit	…
ltx/en_us_goadedes/me.m09.d26:meMA.Ode3C32.melody	@ltx/en_us_goadedes/he.h.m6:heHE.OukEstinAgios.name
ltx/en_us_goadedes/me.m09.d26:meMA.Ode3C32.mode	@ltx/en_us_goadedes/miscellanea:misc.Mode6
ltx/en_us_goadedes/me.m09.d26:meMA.Ode3C32.ode	@ltx/en_us_goadedes/miscellanea:misc.Ode3
ltx/en_us_goadedes/me.m09.d26:meMA.Ode3C32.text	
ltx/en_us_goadedes/me.m09.d26:meMA.Ode3C33.incipit	…
ltx/en_us_goadedes/me.m09.d26:meMA.Ode3C33.melody	@ltx/en_us_goadedes/he.h.m6:heHE.OukEstinAgios.name
ltx/en_us_goadedes/me.m09.d26:meMA.Ode3C33.mode	@ltx/en_us_goadedes/miscellanea:misc.Mode6
ltx/en_us_goadedes/me.m09.d26:meMA.Ode3C33.ode	@ltx/en_us_goadedes/miscellanea:misc.Ode3
ltx/en_us_goadedes/me.m09.d26:meMA.Ode3C33.text	
ltx/en_us_goadedes/me.m09.d26:meMA.Ode3C3T.incipit	…
ltx/en_us_goadedes/me.m09.d26:meMA.Ode3C3T.melody	@ltx/en_us_goadedes/he.h.m6:heHE.OukEstinAgios.name
ltx/en_us_goadedes/me.m09.d26:meMA.Ode3C3T.mode	@ltx/en_us_goadedes/miscellanea:misc.Mode6
ltx/en_us_goadedes/me.m09.d26:meMA.Ode3C3T.ode	@ltx/en_us_goadedes/miscellanea:misc.Ode3
ltx/en_us_goadedes/me.m09.d26:meMA.Ode3C3T.text	
ltx/en_us_goadedes/me.m09.d26:meMA.Ode3Kathisma1.greekmelody	@ltx/en_us_goadedes/he.a.m8:heAU.TinSofianKaiLogon.greekname
ltx/en_us_goadedes/me.m09.d26:meMA.Ode3Kathisma1.incipit	@ltx/en_us_goadedes/me.m05.d08:meMA.Ode3Kathisma1.incipit
ltx/en_us_goadedes/me.m09.d26:meMA.Ode3Kathisma1.melody	@ltx/en_us_goadedes/he.a.m8:heAU.TinSofianKaiLogon.name
ltx/en_us_goadedes/me.m09.d26:meMA.Ode3Kathisma1.mode	@ltx/en_us_goadedes/miscellanea:misc.Mode8
ltx/en_us_goadedes/me.m09.d26:meMA.Ode3Kathisma1.text	@ltx/en_us_goadedes/me.m05.d08:meMA.Ode3Kathisma1.text
ltx/en_us_goadedes/me.m09.d26:meMA.Ode3KathismaT.incipit	…
ltx/en_us_goadedes/me.m09.d26:meMA.Ode3KathismaT.melody	@ltx/en_us_goadedes/he.a.m8:heAU.TinSofianKaiLogon.name
ltx/en_us_goadedes/me.m09.d26:meMA.Ode3KathismaT.mode	@ltx/en_us_goadedes/miscellanea:misc.Mode8
ltx/en_us_goadedes/me.m09.d26:meMA.Ode3KathismaT.text	
ltx/en_us_goadedes/me.m09.d26:meMA.Ode4C11.greekmelody	@ltx/en_us_goadedes/he.h.m2:heHE.ElilythasEkParthenou.greekname
ltx/en_us_goadedes/me.m09.d26:meMA.Ode4C11.incipit	@ltx/en_us_goadedes/me.m07.d27:meMA.Ode4C11.incipit
ltx/en_us_goadedes/me.m09.d26:meMA.Ode4C11.melody	@ltx/en_us_goadedes/he.h.m2:heHE.ElilythasEkParthenou.name
ltx/en_us_goadedes/me.m09.d26:meMA.Ode4C11.mode	@ltx/en_us_goadedes/miscellanea:misc.Mode2
ltx/en_us_goadedes/me.m09.d26:meMA.Ode4C11.ode	@ltx/en_us_goadedes/miscellanea:misc.Ode4
ltx/en_us_goadedes/me.m09.d26:meMA.Ode4C11.text	@ltx/en_us_goadedes/me.m07.d27:meMA.Ode4C11.text
ltx/en_us_goadedes/me.m09.d26:meMA.Ode4C12.incipit	@ltx/en_us_goadedes/me.m07.d27:meMA.Ode4C12.incipit
ltx/en_us_goadedes/me.m09.d26:meMA.Ode4C12.melody	@ltx/en_us_goadedes/he.h.m2:heHE.ElilythasEkParthenou.name
ltx/en_us_goadedes/me.m09.d26:meMA.Ode4C12.mode	@ltx/en_us_goadedes/miscellanea:misc.Mode2
ltx/en_us_goadedes/me.m09.d26:meMA.Ode4C12.ode	@ltx/en_us_goadedes/miscellanea:misc.Ode4
ltx/en_us_goadedes/me.m09.d26:meMA.Ode4C12.text	@ltx/en_us_goadedes/me.m07.d27:meMA.Ode4C12.text
ltx/en_us_goadedes/me.m09.d26:meMA.Ode4C13.incipit	@ltx/en_us_goadedes/me.m07.d27:meMA.Ode4C13.incipit
ltx/en_us_goadedes/me.m09.d26:meMA.Ode4C13.melody	@ltx/en_us_goadedes/he.h.m2:heHE.ElilythasEkParthenou.name
ltx/en_us_goadedes/me.m09.d26:meMA.Ode4C13.mode	@ltx/en_us_goadedes/miscellanea:misc.Mode2
ltx/en_us_goadedes/me.m09.d26:meMA.Ode4C13.ode	@ltx/en_us_goadedes/miscellanea:misc.Ode4
ltx/en_us_goadedes/me.m09.d26:meMA.Ode4C13.text	@ltx/en_us_goadedes/me.m07.d27:meMA.Ode4C13.text
ltx/en_us_goadedes/me.m09.d26:meMA.Ode4C1H.greekmelody	@ltx/en_us_goadedes/he.h.m2:heHE.ElilythasEkParthenou.greekname
ltx/en_us_goadedes/me.m09.d26:meMA.Ode4C1H.incipit	@ltx/en_us_goadedes/he.h.m2:heHE.ElilythasEkParthenou.incipit
ltx/en_us_goadedes/me.m09.d26:meMA.Ode4C1H.melody	@ltx/en_us_goadedes/he.h.m2:heHE.ElilythasEkParthenou.melody
ltx/en_us_goadedes/me.m09.d26:meMA.Ode4C1H.mode	@ltx/en_us_goadedes/miscellanea:misc.Mode2
ltx/en_us_goadedes/me.m09.d26:meMA.Ode4C1H.ode	@ltx/en_us_goadedes/miscellanea:misc.Ode4
ltx/en_us_goadedes/me.m09.d26:meMA.Ode4C1H.text	@ltx/en_us_goadedes/he.h.m2:heHE.ElilythasEkParthenou.text
ltx/en_us_goadedes/me.m09.d26:meMA.Ode4C21.greekmelody	@ltx/en_us_goadedes/he.h.m2:heHE.ElilythasEkParthenou.greekname
ltx/en_us_goadedes/me.m09.d26:meMA.Ode4C21.incipit	…
ltx/en_us_goadedes/me.m09.d26:meMA.Ode4C21.melody	@ltx/en_us_goadedes/he.h.m2:heHE.ElilythasEkParthenou.name
ltx/en_us_goadedes/me.m09.d26:meMA.Ode4C21.mode	@ltx/en_us_goadedes/miscellanea:misc.Mode2
ltx/en_us_goadedes/me.m09.d26:meMA.Ode4C21.ode	@ltx/en_us_goadedes/miscellanea:misc.Ode4
ltx/en_us_goadedes/me.m09.d26:meMA.Ode4C21.text	
ltx/en_us_goadedes/me.m09.d26:meMA.Ode4C22.incipit	…
ltx/en_us_goadedes/me.m09.d26:meMA.Ode4C22.melody	@ltx/en_us_goadedes/he.h.m2:heHE.ElilythasEkParthenou.name
ltx/en_us_goadedes/me.m09.d26:meMA.Ode4C22.mode	@ltx/en_us_goadedes/miscellanea:misc.Mode2
ltx/en_us_goadedes/me.m09.d26:meMA.Ode4C22.ode	@ltx/en_us_goadedes/miscellanea:misc.Ode4
ltx/en_us_goadedes/me.m09.d26:meMA.Ode4C22.text	
ltx/en_us_goadedes/me.m09.d26:meMA.Ode4C23.incipit	…
ltx/en_us_goadedes/me.m09.d26:meMA.Ode4C23.melody	@ltx/en_us_goadedes/he.h.m2:heHE.ElilythasEkParthenou.name
ltx/en_us_goadedes/me.m09.d26:meMA.Ode4C23.mode	@ltx/en_us_goadedes/miscellanea:misc.Mode2
ltx/en_us_goadedes/me.m09.d26:meMA.Ode4C23.ode	@ltx/en_us_goadedes/miscellanea:misc.Ode4
ltx/en_us_goadedes/me.m09.d26:meMA.Ode4C23.text	
ltx/en_us_goadedes/me.m09.d26:meMA.Ode4C2T.incipit	…
ltx/en_us_goadedes/me.m09.d26:meMA.Ode4C2T.melody	@ltx/en_us_goadedes/he.h.m2:heHE.ElilythasEkParthenou.name
ltx/en_us_goadedes/me.m09.d26:meMA.Ode4C2T.mode	@ltx/en_us_goadedes/miscellanea:misc.Mode2
ltx/en_us_goadedes/me.m09.d26:meMA.Ode4C2T.ode	@ltx/en_us_goadedes/miscellanea:misc.Ode4
ltx/en_us_goadedes/me.m09.d26:meMA.Ode4C2T.text	
ltx/en_us_goadedes/me.m09.d26:meMA.Ode4C31.greekmelody	@ltx/en_us_goadedes/he.h.m6:heHE.ChristosMouDynamis.greekname
ltx/en_us_goadedes/me.m09.d26:meMA.Ode4C31.incipit	…
ltx/en_us_goadedes/me.m09.d26:meMA.Ode4C31.melody	@ltx/en_us_goadedes/he.h.m6:heHE.ChristosMouDynamis.name
ltx/en_us_goadedes/me.m09.d26:meMA.Ode4C31.mode	@ltx/en_us_goadedes/miscellanea:misc.Mode6
ltx/en_us_goadedes/me.m09.d26:meMA.Ode4C31.ode	@ltx/en_us_goadedes/miscellanea:misc.Ode4
ltx/en_us_goadedes/me.m09.d26:meMA.Ode4C31.text	
ltx/en_us_goadedes/me.m09.d26:meMA.Ode4C32.incipit	…
ltx/en_us_goadedes/me.m09.d26:meMA.Ode4C32.melody	@ltx/en_us_goadedes/he.h.m6:heHE.ChristosMouDynamis.name
ltx/en_us_goadedes/me.m09.d26:meMA.Ode4C32.mode	@ltx/en_us_goadedes/miscellanea:misc.Mode6
ltx/en_us_goadedes/me.m09.d26:meMA.Ode4C32.ode	@ltx/en_us_goadedes/miscellanea:misc.Ode4
ltx/en_us_goadedes/me.m09.d26:meMA.Ode4C32.text	
ltx/en_us_goadedes/me.m09.d26:meMA.Ode4C33.incipit	…
ltx/en_us_goadedes/me.m09.d26:meMA.Ode4C33.melody	@ltx/en_us_goadedes/he.h.m6:heHE.ChristosMouDynamis.name
ltx/en_us_goadedes/me.m09.d26:meMA.Ode4C33.mode	@ltx/en_us_goadedes/miscellanea:misc.Mode6
ltx/en_us_goadedes/me.m09.d26:meMA.Ode4C33.ode	@ltx/en_us_goadedes/miscellanea:misc.Ode4
ltx/en_us_goadedes/me.m09.d26:meMA.Ode4C33.text	
ltx/en_us_goadedes/me.m09.d26:meMA.Ode4C3T.incipit	…
ltx/en_us_goadedes/me.m09.d26:meMA.Ode4C3T.melody	@ltx/en_us_goadedes/he.h.m6:heHE.ChristosMouDynamis.name
ltx/en_us_goadedes/me.m09.d26:meMA.Ode4C3T.mode	@ltx/en_us_goadedes/miscellanea:misc.Mode6
ltx/en_us_goadedes/me.m09.d26:meMA.Ode4C3T.ode	@ltx/en_us_goadedes/miscellanea:misc.Ode4
ltx/en_us_goadedes/me.m09.d26:meMA.Ode4C3T.text	
ltx/en_us_goadedes/me.m09.d26:meMA.Ode5C11.greekmelody	@ltx/en_us_goadedes/he.h.m2:heHE.MesitisTheou.greekname
ltx/en_us_goadedes/me.m09.d26:meMA.Ode5C11.incipit	@ltx/en_us_goadedes/me.m07.d27:meMA.Ode5C11.incipit
ltx/en_us_goadedes/me.m09.d26:meMA.Ode5C11.melody	@ltx/en_us_goadedes/he.h.m2:heHE.MesitisTheou.name
ltx/en_us_goadedes/me.m09.d26:meMA.Ode5C11.mode	@ltx/en_us_goadedes/miscellanea:misc.Mode2
ltx/en_us_goadedes/me.m09.d26:meMA.Ode5C11.ode	@ltx/en_us_goadedes/miscellanea:misc.Ode5
ltx/en_us_goadedes/me.m09.d26:meMA.Ode5C11.text	@ltx/en_us_goadedes/me.m07.d27:meMA.Ode5C11.text
ltx/en_us_goadedes/me.m09.d26:meMA.Ode5C12.incipit	@ltx/en_us_goadedes/me.m07.d27:meMA.Ode5C12.incipit
ltx/en_us_goadedes/me.m09.d26:meMA.Ode5C12.melody	@ltx/en_us_goadedes/he.h.m2:heHE.MesitisTheou.name
ltx/en_us_goadedes/me.m09.d26:meMA.Ode5C12.mode	@ltx/en_us_goadedes/miscellanea:misc.Mode2
ltx/en_us_goadedes/me.m09.d26:meMA.Ode5C12.ode	@ltx/en_us_goadedes/miscellanea:misc.Ode5
ltx/en_us_goadedes/me.m09.d26:meMA.Ode5C12.text	@ltx/en_us_goadedes/me.m07.d27:meMA.Ode5C12.text
ltx/en_us_goadedes/me.m09.d26:meMA.Ode5C13.incipit	@ltx/en_us_goadedes/me.m07.d27:meMA.Ode5C13.incipit
ltx/en_us_goadedes/me.m09.d26:meMA.Ode5C13.melody	@ltx/en_us_goadedes/he.h.m2:heHE.MesitisTheou.name
ltx/en_us_goadedes/me.m09.d26:meMA.Ode5C13.mode	@ltx/en_us_goadedes/miscellanea:misc.Mode2
ltx/en_us_goadedes/me.m09.d26:meMA.Ode5C13.ode	@ltx/en_us_goadedes/miscellanea:misc.Ode5
ltx/en_us_goadedes/me.m09.d26:meMA.Ode5C13.text	@ltx/en_us_goadedes/me.m07.d27:meMA.Ode5C13.text
ltx/en_us_goadedes/me.m09.d26:meMA.Ode5C1H.greekmelody	@ltx/en_us_goadedes/he.h.m2:heHE.MesitisTheou.greekname
ltx/en_us_goadedes/me.m09.d26:meMA.Ode5C1H.incipit	@ltx/en_us_goadedes/he.h.m2:heHE.MesitisTheou.incipit
ltx/en_us_goadedes/me.m09.d26:meMA.Ode5C1H.melody	@ltx/en_us_goadedes/he.h.m2:heHE.MesitisTheou.melody
ltx/en_us_goadedes/me.m09.d26:meMA.Ode5C1H.mode	@ltx/en_us_goadedes/miscellanea:misc.Mode2
ltx/en_us_goadedes/me.m09.d26:meMA.Ode5C1H.ode	@ltx/en_us_goadedes/miscellanea:misc.Ode5
ltx/en_us_goadedes/me.m09.d26:meMA.Ode5C1H.text	@ltx/en_us_goadedes/he.h.m2:heHE.MesitisTheou.text
ltx/en_us_goadedes/me.m09.d26:meMA.Ode5C21.greekmelody	@ltx/en_us_goadedes/he.h.m2:heHE.MesitisTheou.greekname
ltx/en_us_goadedes/me.m09.d26:meMA.Ode5C21.incipit	…
ltx/en_us_goadedes/me.m09.d26:meMA.Ode5C21.melody	@ltx/en_us_goadedes/he.h.m2:heHE.MesitisTheou.name
ltx/en_us_goadedes/me.m09.d26:meMA.Ode5C21.mode	@ltx/en_us_goadedes/miscellanea:misc.Mode2
ltx/en_us_goadedes/me.m09.d26:meMA.Ode5C21.ode	@ltx/en_us_goadedes/miscellanea:misc.Ode5
ltx/en_us_goadedes/me.m09.d26:meMA.Ode5C21.text	
ltx/en_us_goadedes/me.m09.d26:meMA.Ode5C22.incipit	…
ltx/en_us_goadedes/me.m09.d26:meMA.Ode5C22.melody	@ltx/en_us_goadedes/he.h.m2:heHE.MesitisTheou.name
ltx/en_us_goadedes/me.m09.d26:meMA.Ode5C22.mode	@ltx/en_us_goadedes/miscellanea:misc.Mode2
ltx/en_us_goadedes/me.m09.d26:meMA.Ode5C22.ode	@ltx/en_us_goadedes/miscellanea:misc.Ode5
ltx/en_us_goadedes/me.m09.d26:meMA.Ode5C22.text	
ltx/en_us_goadedes/me.m09.d26:meMA.Ode5C23.incipit	…
ltx/en_us_goadedes/me.m09.d26:meMA.Ode5C23.melody	@ltx/en_us_goadedes/he.h.m2:heHE.MesitisTheou.name
ltx/en_us_goadedes/me.m09.d26:meMA.Ode5C23.mode	@ltx/en_us_goadedes/miscellanea:misc.Mode2
ltx/en_us_goadedes/me.m09.d26:meMA.Ode5C23.ode	@ltx/en_us_goadedes/miscellanea:misc.Ode5
ltx/en_us_goadedes/me.m09.d26:meMA.Ode5C23.text	
ltx/en_us_goadedes/me.m09.d26:meMA.Ode5C2T.incipit	…
ltx/en_us_goadedes/me.m09.d26:meMA.Ode5C2T.melody	@ltx/en_us_goadedes/he.h.m2:heHE.MesitisTheou.name
ltx/en_us_goadedes/me.m09.d26:meMA.Ode5C2T.mode	@ltx/en_us_goadedes/miscellanea:misc.Mode2
ltx/en_us_goadedes/me.m09.d26:meMA.Ode5C2T.ode	@ltx/en_us_goadedes/miscellanea:misc.Ode5
ltx/en_us_goadedes/me.m09.d26:meMA.Ode5C2T.text	
ltx/en_us_goadedes/me.m09.d26:meMA.Ode5C31.greekmelody	@ltx/en_us_goadedes/he.h.m6:heHE.ToTheioFengeiSou.greekname
ltx/en_us_goadedes/me.m09.d26:meMA.Ode5C31.incipit	…
ltx/en_us_goadedes/me.m09.d26:meMA.Ode5C31.melody	@ltx/en_us_goadedes/he.h.m6:heHE.ToTheioFengeiSou.name
ltx/en_us_goadedes/me.m09.d26:meMA.Ode5C31.mode	@ltx/en_us_goadedes/miscellanea:misc.Mode6
ltx/en_us_goadedes/me.m09.d26:meMA.Ode5C31.ode	@ltx/en_us_goadedes/miscellanea:misc.Ode5
ltx/en_us_goadedes/me.m09.d26:meMA.Ode5C31.text	
ltx/en_us_goadedes/me.m09.d26:meMA.Ode5C32.incipit	…
ltx/en_us_goadedes/me.m09.d26:meMA.Ode5C32.melody	@ltx/en_us_goadedes/he.h.m6:heHE.ToTheioFengeiSou.name
ltx/en_us_goadedes/me.m09.d26:meMA.Ode5C32.mode	@ltx/en_us_goadedes/miscellanea:misc.Mode6
ltx/en_us_goadedes/me.m09.d26:meMA.Ode5C32.ode	@ltx/en_us_goadedes/miscellanea:misc.Ode5
ltx/en_us_goadedes/me.m09.d26:meMA.Ode5C32.text	
ltx/en_us_goadedes/me.m09.d26:meMA.Ode5C33.incipit	…
ltx/en_us_goadedes/me.m09.d26:meMA.Ode5C33.melody	@ltx/en_us_goadedes/he.h.m6:heHE.ToTheioFengeiSou.name
ltx/en_us_goadedes/me.m09.d26:meMA.Ode5C33.mode	@ltx/en_us_goadedes/miscellanea:misc.Mode6
ltx/en_us_goadedes/me.m09.d26:meMA.Ode5C33.ode	@ltx/en_us_goadedes/miscellanea:misc.Ode5
ltx/en_us_goadedes/me.m09.d26:meMA.Ode5C33.text	
ltx/en_us_goadedes/me.m09.d26:meMA.Ode5C3T.incipit	…
ltx/en_us_goadedes/me.m09.d26:meMA.Ode5C3T.melody	@ltx/en_us_goadedes/he.h.m6:heHE.ToTheioFengeiSou.name
ltx/en_us_goadedes/me.m09.d26:meMA.Ode5C3T.mode	@ltx/en_us_goadedes/miscellanea:misc.Mode6
ltx/en_us_goadedes/me.m09.d26:meMA.Ode5C3T.ode	@ltx/en_us_goadedes/miscellanea:misc.Ode5
ltx/en_us_goadedes/me.m09.d26:meMA.Ode5C3T.text	
ltx/en_us_goadedes/me.m09.d26:meMA.Ode6C11.greekmelody	@ltx/en_us_goadedes/he.h.m2:heHE.EnAvyssoPtaismaton.greekname
ltx/en_us_goadedes/me.m09.d26:meMA.Ode6C11.incipit	@ltx/en_us_goadedes/me.m07.d27:meMA.Ode6C11.incipit
ltx/en_us_goadedes/me.m09.d26:meMA.Ode6C11.melody	@ltx/en_us_goadedes/he.h.m2:heHE.EnAvyssoPtaismaton.name
ltx/en_us_goadedes/me.m09.d26:meMA.Ode6C11.mode	@ltx/en_us_goadedes/miscellanea:misc.Mode2
ltx/en_us_goadedes/me.m09.d26:meMA.Ode6C11.ode	@ltx/en_us_goadedes/miscellanea:misc.Ode6
ltx/en_us_goadedes/me.m09.d26:meMA.Ode6C11.text	@ltx/en_us_goadedes/me.m07.d27:meMA.Ode6C11.text
ltx/en_us_goadedes/me.m09.d26:meMA.Ode6C12.incipit	@ltx/en_us_goadedes/me.m07.d27:meMA.Ode6C12.incipit
ltx/en_us_goadedes/me.m09.d26:meMA.Ode6C12.melody	@ltx/en_us_goadedes/he.h.m2:heHE.EnAvyssoPtaismaton.name
ltx/en_us_goadedes/me.m09.d26:meMA.Ode6C12.mode	@ltx/en_us_goadedes/miscellanea:misc.Mode2
ltx/en_us_goadedes/me.m09.d26:meMA.Ode6C12.ode	@ltx/en_us_goadedes/miscellanea:misc.Ode6
ltx/en_us_goadedes/me.m09.d26:meMA.Ode6C12.text	@ltx/en_us_goadedes/me.m07.d27:meMA.Ode6C12.text
ltx/en_us_goadedes/me.m09.d26:meMA.Ode6C13.incipit	@ltx/en_us_goadedes/me.m07.d27:meMA.Ode6C13.incipit
ltx/en_us_goadedes/me.m09.d26:meMA.Ode6C13.melody	@ltx/en_us_goadedes/he.h.m2:heHE.EnAvyssoPtaismaton.name
ltx/en_us_goadedes/me.m09.d26:meMA.Ode6C13.mode	@ltx/en_us_goadedes/miscellanea:misc.Mode2
ltx/en_us_goadedes/me.m09.d26:meMA.Ode6C13.ode	@ltx/en_us_goadedes/miscellanea:misc.Ode6
ltx/en_us_goadedes/me.m09.d26:meMA.Ode6C13.text	@ltx/en_us_goadedes/me.m07.d27:meMA.Ode6C13.text
ltx/en_us_goadedes/me.m09.d26:meMA.Ode6C1H.greekmelody	@ltx/en_us_goadedes/he.h.m2:heHE.EnAvyssoPtaismaton.greekname
ltx/en_us_goadedes/me.m09.d26:meMA.Ode6C1H.incipit	@ltx/en_us_goadedes/he.h.m2:heHE.EnAvyssoPtaismaton.incipit
ltx/en_us_goadedes/me.m09.d26:meMA.Ode6C1H.melody	@ltx/en_us_goadedes/he.h.m2:heHE.EnAvyssoPtaismaton.melody
ltx/en_us_goadedes/me.m09.d26:meMA.Ode6C1H.mode	@ltx/en_us_goadedes/miscellanea:misc.Mode2
ltx/en_us_goadedes/me.m09.d26:meMA.Ode6C1H.ode	@ltx/en_us_goadedes/miscellanea:misc.Ode6
ltx/en_us_goadedes/me.m09.d26:meMA.Ode6C1H.text	@ltx/en_us_goadedes/he.h.m2:heHE.EnAvyssoPtaismaton.text
ltx/en_us_goadedes/me.m09.d26:meMA.Ode6C21.greekmelody	@ltx/en_us_goadedes/he.h.m2:heHE.EnAvyssoPtaismaton.greekname
ltx/en_us_goadedes/me.m09.d26:meMA.Ode6C21.incipit	…
ltx/en_us_goadedes/me.m09.d26:meMA.Ode6C21.melody	@ltx/en_us_goadedes/he.h.m2:heHE.EnAvyssoPtaismaton.name
ltx/en_us_goadedes/me.m09.d26:meMA.Ode6C21.mode	@ltx/en_us_goadedes/miscellanea:misc.Mode2
ltx/en_us_goadedes/me.m09.d26:meMA.Ode6C21.ode	@ltx/en_us_goadedes/miscellanea:misc.Ode6
ltx/en_us_goadedes/me.m09.d26:meMA.Ode6C21.text	
ltx/en_us_goadedes/me.m09.d26:meMA.Ode6C22.incipit	…
ltx/en_us_goadedes/me.m09.d26:meMA.Ode6C22.melody	@ltx/en_us_goadedes/he.h.m2:heHE.EnAvyssoPtaismaton.name
ltx/en_us_goadedes/me.m09.d26:meMA.Ode6C22.mode	@ltx/en_us_goadedes/miscellanea:misc.Mode2
ltx/en_us_goadedes/me.m09.d26:meMA.Ode6C22.ode	@ltx/en_us_goadedes/miscellanea:misc.Ode6
ltx/en_us_goadedes/me.m09.d26:meMA.Ode6C22.text	
ltx/en_us_goadedes/me.m09.d26:meMA.Ode6C23.incipit	…
ltx/en_us_goadedes/me.m09.d26:meMA.Ode6C23.melody	@ltx/en_us_goadedes/he.h.m2:heHE.EnAvyssoPtaismaton.name
ltx/en_us_goadedes/me.m09.d26:meMA.Ode6C23.mode	@ltx/en_us_goadedes/miscellanea:misc.Mode2
ltx/en_us_goadedes/me.m09.d26:meMA.Ode6C23.ode	@ltx/en_us_goadedes/miscellanea:misc.Ode6
ltx/en_us_goadedes/me.m09.d26:meMA.Ode6C23.text	
ltx/en_us_goadedes/me.m09.d26:meMA.Ode6C2T.incipit	…
ltx/en_us_goadedes/me.m09.d26:meMA.Ode6C2T.melody	@ltx/en_us_goadedes/he.h.m2:heHE.EnAvyssoPtaismaton.name
ltx/en_us_goadedes/me.m09.d26:meMA.Ode6C2T.mode	@ltx/en_us_goadedes/miscellanea:misc.Mode2
ltx/en_us_goadedes/me.m09.d26:meMA.Ode6C2T.ode	@ltx/en_us_goadedes/miscellanea:misc.Ode6
ltx/en_us_goadedes/me.m09.d26:meMA.Ode6C2T.text	
ltx/en_us_goadedes/me.m09.d26:meMA.Ode6C31.greekmelody	@ltx/en_us_goadedes/he.h.m6:heHE.TouViouTinThalassan.greekname
ltx/en_us_goadedes/me.m09.d26:meMA.Ode6C31.incipit	…
ltx/en_us_goadedes/me.m09.d26:meMA.Ode6C31.melody	@ltx/en_us_goadedes/he.h.m6:heHE.TouViouTinThalassan.name
ltx/en_us_goadedes/me.m09.d26:meMA.Ode6C31.mode	@ltx/en_us_goadedes/miscellanea:misc.Mode6
ltx/en_us_goadedes/me.m09.d26:meMA.Ode6C31.ode	@ltx/en_us_goadedes/miscellanea:misc.Ode6
ltx/en_us_goadedes/me.m09.d26:meMA.Ode6C31.text	
ltx/en_us_goadedes/me.m09.d26:meMA.Ode6C32.incipit	…
ltx/en_us_goadedes/me.m09.d26:meMA.Ode6C32.melody	@ltx/en_us_goadedes/he.h.m6:heHE.TouViouTinThalassan.name
ltx/en_us_goadedes/me.m09.d26:meMA.Ode6C32.mode	@ltx/en_us_goadedes/miscellanea:misc.Mode6
ltx/en_us_goadedes/me.m09.d26:meMA.Ode6C32.ode	@ltx/en_us_goadedes/miscellanea:misc.Ode6
ltx/en_us_goadedes/me.m09.d26:meMA.Ode6C32.text	
ltx/en_us_goadedes/me.m09.d26:meMA.Ode6C33.incipit	…
ltx/en_us_goadedes/me.m09.d26:meMA.Ode6C33.melody	@ltx/en_us_goadedes/he.h.m6:heHE.TouViouTinThalassan.name
ltx/en_us_goadedes/me.m09.d26:meMA.Ode6C33.mode	@ltx/en_us_goadedes/miscellanea:misc.Mode6
ltx/en_us_goadedes/me.m09.d26:meMA.Ode6C33.ode	@ltx/en_us_goadedes/miscellanea:misc.Ode6
ltx/en_us_goadedes/me.m09.d26:meMA.Ode6C33.text	
ltx/en_us_goadedes/me.m09.d26:meMA.Ode6C3T.incipit	…
ltx/en_us_goadedes/me.m09.d26:meMA.Ode6C3T.melody	@ltx/en_us_goadedes/he.h.m6:heHE.TouViouTinThalassan.name
ltx/en_us_goadedes/me.m09.d26:meMA.Ode6C3T.mode	@ltx/en_us_goadedes/miscellanea:misc.Mode6
ltx/en_us_goadedes/me.m09.d26:meMA.Ode6C3T.ode	@ltx/en_us_goadedes/miscellanea:misc.Ode6
ltx/en_us_goadedes/me.m09.d26:meMA.Ode6C3T.text	
ltx/en_us_goadedes/me.m09.d26:meMA.Ode7C11.greekmelody	@ltx/en_us_goadedes/he.h.m2:heHE.AntitheonProstagma.greekname
ltx/en_us_goadedes/me.m09.d26:meMA.Ode7C11.incipit	@ltx/en_us_goadedes/me.m07.d27:meMA.Ode7C11.incipit
ltx/en_us_goadedes/me.m09.d26:meMA.Ode7C11.melody	@ltx/en_us_goadedes/he.h.m2:heHE.AntitheonProstagma.name
ltx/en_us_goadedes/me.m09.d26:meMA.Ode7C11.mode	@ltx/en_us_goadedes/miscellanea:misc.Mode2
ltx/en_us_goadedes/me.m09.d26:meMA.Ode7C11.ode	@ltx/en_us_goadedes/miscellanea:misc.Ode7
ltx/en_us_goadedes/me.m09.d26:meMA.Ode7C11.text	@ltx/en_us_goadedes/me.m07.d27:meMA.Ode7C11.text
ltx/en_us_goadedes/me.m09.d26:meMA.Ode7C12.incipit	@ltx/en_us_goadedes/me.m07.d27:meMA.Ode7C12.incipit
ltx/en_us_goadedes/me.m09.d26:meMA.Ode7C12.melody	@ltx/en_us_goadedes/he.h.m2:heHE.AntitheonProstagma.name
ltx/en_us_goadedes/me.m09.d26:meMA.Ode7C12.mode	@ltx/en_us_goadedes/miscellanea:misc.Mode2
ltx/en_us_goadedes/me.m09.d26:meMA.Ode7C12.ode	@ltx/en_us_goadedes/miscellanea:misc.Ode7
ltx/en_us_goadedes/me.m09.d26:meMA.Ode7C12.text	@ltx/en_us_goadedes/me.m07.d27:meMA.Ode7C12.text
ltx/en_us_goadedes/me.m09.d26:meMA.Ode7C13.incipit	@ltx/en_us_goadedes/me.m07.d27:meMA.Ode7C13.incipit
ltx/en_us_goadedes/me.m09.d26:meMA.Ode7C13.melody	@ltx/en_us_goadedes/he.h.m2:heHE.AntitheonProstagma.name
ltx/en_us_goadedes/me.m09.d26:meMA.Ode7C13.mode	@ltx/en_us_goadedes/miscellanea:misc.Mode2
ltx/en_us_goadedes/me.m09.d26:meMA.Ode7C13.ode	@ltx/en_us_goadedes/miscellanea:misc.Ode7
ltx/en_us_goadedes/me.m09.d26:meMA.Ode7C13.text	@ltx/en_us_goadedes/me.m07.d27:meMA.Ode7C13.text
ltx/en_us_goadedes/me.m09.d26:meMA.Ode7C1H.greekmelody	@ltx/en_us_goadedes/he.h.m2:heHE.AntitheonProstagma.greekname
ltx/en_us_goadedes/me.m09.d26:meMA.Ode7C1H.incipit	@ltx/en_us_goadedes/he.h.m2:heHE.AntitheonProstagma.incipit
ltx/en_us_goadedes/me.m09.d26:meMA.Ode7C1H.melody	@ltx/en_us_goadedes/he.h.m2:heHE.AntitheonProstagma.melody
ltx/en_us_goadedes/me.m09.d26:meMA.Ode7C1H.mode	@ltx/en_us_goadedes/miscellanea:misc.Mode2
ltx/en_us_goadedes/me.m09.d26:meMA.Ode7C1H.ode	@ltx/en_us_goadedes/miscellanea:misc.Ode7
ltx/en_us_goadedes/me.m09.d26:meMA.Ode7C1H.text	@ltx/en_us_goadedes/he.h.m2:heHE.AntitheonProstagma.text
ltx/en_us_goadedes/me.m09.d26:meMA.Ode7C21.greekmelody	@ltx/en_us_goadedes/he.h.m2:heHE.AntitheonProstagma.greekname
ltx/en_us_goadedes/me.m09.d26:meMA.Ode7C21.incipit	…
ltx/en_us_goadedes/me.m09.d26:meMA.Ode7C21.melody	@ltx/en_us_goadedes/he.h.m2:heHE.AntitheonProstagma.name
ltx/en_us_goadedes/me.m09.d26:meMA.Ode7C21.mode	@ltx/en_us_goadedes/miscellanea:misc.Mode2
ltx/en_us_goadedes/me.m09.d26:meMA.Ode7C21.ode	@ltx/en_us_goadedes/miscellanea:misc.Ode7
ltx/en_us_goadedes/me.m09.d26:meMA.Ode7C21.text	
ltx/en_us_goadedes/me.m09.d26:meMA.Ode7C22.incipit	…
ltx/en_us_goadedes/me.m09.d26:meMA.Ode7C22.melody	@ltx/en_us_goadedes/he.h.m2:heHE.AntitheonProstagma.name
ltx/en_us_goadedes/me.m09.d26:meMA.Ode7C22.mode	@ltx/en_us_goadedes/miscellanea:misc.Mode2
ltx/en_us_goadedes/me.m09.d26:meMA.Ode7C22.ode	@ltx/en_us_goadedes/miscellanea:misc.Ode7
ltx/en_us_goadedes/me.m09.d26:meMA.Ode7C22.text	
ltx/en_us_goadedes/me.m09.d26:meMA.Ode7C23.incipit	…
ltx/en_us_goadedes/me.m09.d26:meMA.Ode7C23.melody	@ltx/en_us_goadedes/he.h.m2:heHE.AntitheonProstagma.name
ltx/en_us_goadedes/me.m09.d26:meMA.Ode7C23.mode	@ltx/en_us_goadedes/miscellanea:misc.Mode2
ltx/en_us_goadedes/me.m09.d26:meMA.Ode7C23.ode	@ltx/en_us_goadedes/miscellanea:misc.Ode7
ltx/en_us_goadedes/me.m09.d26:meMA.Ode7C23.text	
ltx/en_us_goadedes/me.m09.d26:meMA.Ode7C2T.incipit	…
ltx/en_us_goadedes/me.m09.d26:meMA.Ode7C2T.melody	@ltx/en_us_goadedes/he.h.m2:heHE.AntitheonProstagma.name
ltx/en_us_goadedes/me.m09.d26:meMA.Ode7C2T.mode	@ltx/en_us_goadedes/miscellanea:misc.Mode2
ltx/en_us_goadedes/me.m09.d26:meMA.Ode7C2T.ode	@ltx/en_us_goadedes/miscellanea:misc.Ode7
ltx/en_us_goadedes/me.m09.d26:meMA.Ode7C2T.text	
ltx/en_us_goadedes/me.m09.d26:meMA.Ode7C31.greekmelody	@ltx/en_us_goadedes/he.h.m6:heHE.DrosovolonMenTinKaminon.greekname
ltx/en_us_goadedes/me.m09.d26:meMA.Ode7C31.incipit	…
ltx/en_us_goadedes/me.m09.d26:meMA.Ode7C31.melody	@ltx/en_us_goadedes/he.h.m6:heHE.DrosovolonMenTinKaminon.name
ltx/en_us_goadedes/me.m09.d26:meMA.Ode7C31.mode	@ltx/en_us_goadedes/miscellanea:misc.Mode6
ltx/en_us_goadedes/me.m09.d26:meMA.Ode7C31.ode	@ltx/en_us_goadedes/miscellanea:misc.Ode7
ltx/en_us_goadedes/me.m09.d26:meMA.Ode7C31.text	
ltx/en_us_goadedes/me.m09.d26:meMA.Ode7C32.incipit	…
ltx/en_us_goadedes/me.m09.d26:meMA.Ode7C32.melody	@ltx/en_us_goadedes/he.h.m6:heHE.DrosovolonMenTinKaminon.name
ltx/en_us_goadedes/me.m09.d26:meMA.Ode7C32.mode	@ltx/en_us_goadedes/miscellanea:misc.Mode6
ltx/en_us_goadedes/me.m09.d26:meMA.Ode7C32.ode	@ltx/en_us_goadedes/miscellanea:misc.Ode7
ltx/en_us_goadedes/me.m09.d26:meMA.Ode7C32.text	
ltx/en_us_goadedes/me.m09.d26:meMA.Ode7C33.incipit	…
ltx/en_us_goadedes/me.m09.d26:meMA.Ode7C33.melody	@ltx/en_us_goadedes/he.h.m6:heHE.DrosovolonMenTinKaminon.name
ltx/en_us_goadedes/me.m09.d26:meMA.Ode7C33.mode	@ltx/en_us_goadedes/miscellanea:misc.Mode6
ltx/en_us_goadedes/me.m09.d26:meMA.Ode7C33.ode	@ltx/en_us_goadedes/miscellanea:misc.Ode7
ltx/en_us_goadedes/me.m09.d26:meMA.Ode7C33.text	
ltx/en_us_goadedes/me.m09.d26:meMA.Ode7C3T.incipit	…
ltx/en_us_goadedes/me.m09.d26:meMA.Ode7C3T.melody	@ltx/en_us_goadedes/he.h.m6:heHE.DrosovolonMenTinKaminon.name
ltx/en_us_goadedes/me.m09.d26:meMA.Ode7C3T.mode	@ltx/en_us_goadedes/miscellanea:misc.Mode6
ltx/en_us_goadedes/me.m09.d26:meMA.Ode7C3T.ode	@ltx/en_us_goadedes/miscellanea:misc.Ode7
ltx/en_us_goadedes/me.m09.d26:meMA.Ode7C3T.text	
ltx/en_us_goadedes/me.m09.d26:meMA.Ode8C11.greekmelody	@ltx/en_us_goadedes/he.h.m2:heHE.KaminosPote.greekname
ltx/en_us_goadedes/me.m09.d26:meMA.Ode8C11.incipit	@ltx/en_us_goadedes/me.m07.d27:meMA.Ode8C11.incipit
ltx/en_us_goadedes/me.m09.d26:meMA.Ode8C11.melody	@ltx/en_us_goadedes/he.h.m2:heHE.KaminosPote.name
ltx/en_us_goadedes/me.m09.d26:meMA.Ode8C11.mode	@ltx/en_us_goadedes/miscellanea:misc.Mode2
ltx/en_us_goadedes/me.m09.d26:meMA.Ode8C11.ode	@ltx/en_us_goadedes/miscellanea:misc.Ode8
ltx/en_us_goadedes/me.m09.d26:meMA.Ode8C11.text	@ltx/en_us_goadedes/me.m07.d27:meMA.Ode8C11.text
ltx/en_us_goadedes/me.m09.d26:meMA.Ode8C12.incipit	@ltx/en_us_goadedes/me.m07.d27:meMA.Ode8C12.incipit
ltx/en_us_goadedes/me.m09.d26:meMA.Ode8C12.melody	@ltx/en_us_goadedes/he.h.m2:heHE.KaminosPote.name
ltx/en_us_goadedes/me.m09.d26:meMA.Ode8C12.mode	@ltx/en_us_goadedes/miscellanea:misc.Mode2
ltx/en_us_goadedes/me.m09.d26:meMA.Ode8C12.ode	@ltx/en_us_goadedes/miscellanea:misc.Ode8
ltx/en_us_goadedes/me.m09.d26:meMA.Ode8C12.text	@ltx/en_us_goadedes/me.m07.d27:meMA.Ode8C12.text
ltx/en_us_goadedes/me.m09.d26:meMA.Ode8C13.incipit	@ltx/en_us_goadedes/me.m07.d27:meMA.Ode8C13.incipit
ltx/en_us_goadedes/me.m09.d26:meMA.Ode8C13.melody	@ltx/en_us_goadedes/he.h.m2:heHE.KaminosPote.name
ltx/en_us_goadedes/me.m09.d26:meMA.Ode8C13.mode	@ltx/en_us_goadedes/miscellanea:misc.Mode2
ltx/en_us_goadedes/me.m09.d26:meMA.Ode8C13.ode	@ltx/en_us_goadedes/miscellanea:misc.Ode8
ltx/en_us_goadedes/me.m09.d26:meMA.Ode8C13.text	@ltx/en_us_goadedes/me.m07.d27:meMA.Ode8C13.text
ltx/en_us_goadedes/me.m09.d26:meMA.Ode8C1H.greekmelody	@ltx/en_us_goadedes/he.h.m2:heHE.KaminosPote.greekname
ltx/en_us_goadedes/me.m09.d26:meMA.Ode8C1H.incipit	@ltx/en_us_goadedes/he.h.m2:heHE.KaminosPote.incipit
ltx/en_us_goadedes/me.m09.d26:meMA.Ode8C1H.melody	@ltx/en_us_goadedes/he.h.m2:heHE.KaminosPote.melody
ltx/en_us_goadedes/me.m09.d26:meMA.Ode8C1H.mode	@ltx/en_us_goadedes/miscellanea:misc.Mode2
ltx/en_us_goadedes/me.m09.d26:meMA.Ode8C1H.ode	@ltx/en_us_goadedes/miscellanea:misc.Ode8
ltx/en_us_goadedes/me.m09.d26:meMA.Ode8C1H.text	@ltx/en_us_goadedes/he.h.m2:heHE.KaminosPote.text
ltx/en_us_goadedes/me.m09.d26:meMA.Ode8C21.greekmelody	@ltx/en_us_goadedes/he.h.m2:heHE.KaminosPote.greekname
ltx/en_us_goadedes/me.m09.d26:meMA.Ode8C21.incipit	…
ltx/en_us_goadedes/me.m09.d26:meMA.Ode8C21.melody	@ltx/en_us_goadedes/he.h.m2:heHE.KaminosPote.name
ltx/en_us_goadedes/me.m09.d26:meMA.Ode8C21.mode	@ltx/en_us_goadedes/miscellanea:misc.Mode2
ltx/en_us_goadedes/me.m09.d26:meMA.Ode8C21.ode	@ltx/en_us_goadedes/miscellanea:misc.Ode8
ltx/en_us_goadedes/me.m09.d26:meMA.Ode8C21.text	
ltx/en_us_goadedes/me.m09.d26:meMA.Ode8C22.incipit	…
ltx/en_us_goadedes/me.m09.d26:meMA.Ode8C22.melody	@ltx/en_us_goadedes/he.h.m2:heHE.KaminosPote.name
ltx/en_us_goadedes/me.m09.d26:meMA.Ode8C22.mode	@ltx/en_us_goadedes/miscellanea:misc.Mode2
ltx/en_us_goadedes/me.m09.d26:meMA.Ode8C22.ode	@ltx/en_us_goadedes/miscellanea:misc.Ode8
ltx/en_us_goadedes/me.m09.d26:meMA.Ode8C22.text	
ltx/en_us_goadedes/me.m09.d26:meMA.Ode8C23.incipit	…
ltx/en_us_goadedes/me.m09.d26:meMA.Ode8C23.melody	@ltx/en_us_goadedes/he.h.m2:heHE.KaminosPote.name
ltx/en_us_goadedes/me.m09.d26:meMA.Ode8C23.mode	@ltx/en_us_goadedes/miscellanea:misc.Mode2
ltx/en_us_goadedes/me.m09.d26:meMA.Ode8C23.ode	@ltx/en_us_goadedes/miscellanea:misc.Ode8
ltx/en_us_goadedes/me.m09.d26:meMA.Ode8C23.text	
ltx/en_us_goadedes/me.m09.d26:meMA.Ode8C2T.incipit	…
ltx/en_us_goadedes/me.m09.d26:meMA.Ode8C2T.melody	@ltx/en_us_goadedes/he.h.m2:heHE.KaminosPote.name
ltx/en_us_goadedes/me.m09.d26:meMA.Ode8C2T.mode	@ltx/en_us_goadedes/miscellanea:misc.Mode2
ltx/en_us_goadedes/me.m09.d26:meMA.Ode8C2T.ode	@ltx/en_us_goadedes/miscellanea:misc.Ode8
ltx/en_us_goadedes/me.m09.d26:meMA.Ode8C2T.text	
ltx/en_us_goadedes/me.m09.d26:meMA.Ode8C31.greekmelody	@ltx/en_us_goadedes/he.h.m6:heHE.EkFlogosToisOsiois.greekname
ltx/en_us_goadedes/me.m09.d26:meMA.Ode8C31.incipit	…
ltx/en_us_goadedes/me.m09.d26:meMA.Ode8C31.melody	@ltx/en_us_goadedes/he.h.m6:heHE.EkFlogosToisOsiois.name
ltx/en_us_goadedes/me.m09.d26:meMA.Ode8C31.mode	@ltx/en_us_goadedes/miscellanea:misc.Mode6
ltx/en_us_goadedes/me.m09.d26:meMA.Ode8C31.ode	@ltx/en_us_goadedes/miscellanea:misc.Ode8
ltx/en_us_goadedes/me.m09.d26:meMA.Ode8C31.text	
ltx/en_us_goadedes/me.m09.d26:meMA.Ode8C32.incipit	…
ltx/en_us_goadedes/me.m09.d26:meMA.Ode8C32.melody	@ltx/en_us_goadedes/he.h.m6:heHE.EkFlogosToisOsiois.name
ltx/en_us_goadedes/me.m09.d26:meMA.Ode8C32.mode	@ltx/en_us_goadedes/miscellanea:misc.Mode6
ltx/en_us_goadedes/me.m09.d26:meMA.Ode8C32.ode	@ltx/en_us_goadedes/miscellanea:misc.Ode8
ltx/en_us_goadedes/me.m09.d26:meMA.Ode8C32.text	
ltx/en_us_goadedes/me.m09.d26:meMA.Ode8C33.incipit	…
ltx/en_us_goadedes/me.m09.d26:meMA.Ode8C33.melody	@ltx/en_us_goadedes/he.h.m6:heHE.EkFlogosToisOsiois.name
ltx/en_us_goadedes/me.m09.d26:meMA.Ode8C33.mode	@ltx/en_us_goadedes/miscellanea:misc.Mode6
ltx/en_us_goadedes/me.m09.d26:meMA.Ode8C33.ode	@ltx/en_us_goadedes/miscellanea:misc.Ode8
ltx/en_us_goadedes/me.m09.d26:meMA.Ode8C33.text	
ltx/en_us_goadedes/me.m09.d26:meMA.Ode8C3T.incipit	…
ltx/en_us_goadedes/me.m09.d26:meMA.Ode8C3T.melody	@ltx/en_us_goadedes/he.h.m6:heHE.EkFlogosToisOsiois.name
ltx/en_us_goadedes/me.m09.d26:meMA.Ode8C3T.mode	@ltx/en_us_goadedes/miscellanea:misc.Mode6
ltx/en_us_goadedes/me.m09.d26:meMA.Ode8C3T.ode	@ltx/en_us_goadedes/miscellanea:misc.Ode8
ltx/en_us_goadedes/me.m09.d26:meMA.Ode8C3T.text	
ltx/en_us_goadedes/me.m09.d26:meMA.Ode9C11.greekmelody	@ltx/en_us_goadedes/he.h.m2:heHE.AnarchouGennitoros.greekname
ltx/en_us_goadedes/me.m09.d26:meMA.Ode9C11.incipit	@ltx/en_us_goadedes/me.m07.d27:meMA.Ode9C11.incipit
ltx/en_us_goadedes/me.m09.d26:meMA.Ode9C11.melody	@ltx/en_us_goadedes/he.h.m2:heHE.AnarchouGennitoros.name
ltx/en_us_goadedes/me.m09.d26:meMA.Ode9C11.mode	@ltx/en_us_goadedes/miscellanea:misc.Mode2
ltx/en_us_goadedes/me.m09.d26:meMA.Ode9C11.ode	@ltx/en_us_goadedes/miscellanea:misc.Ode9
ltx/en_us_goadedes/me.m09.d26:meMA.Ode9C11.text	@ltx/en_us_goadedes/me.m07.d27:meMA.Ode9C11.text
ltx/en_us_goadedes/me.m09.d26:meMA.Ode9C12.incipit	@ltx/en_us_goadedes/me.m07.d27:meMA.Ode9C12.incipit
ltx/en_us_goadedes/me.m09.d26:meMA.Ode9C12.melody	@ltx/en_us_goadedes/he.h.m2:heHE.AnarchouGennitoros.name
ltx/en_us_goadedes/me.m09.d26:meMA.Ode9C12.mode	@ltx/en_us_goadedes/miscellanea:misc.Mode2
ltx/en_us_goadedes/me.m09.d26:meMA.Ode9C12.ode	@ltx/en_us_goadedes/miscellanea:misc.Ode9
ltx/en_us_goadedes/me.m09.d26:meMA.Ode9C12.text	@ltx/en_us_goadedes/me.m07.d27:meMA.Ode9C12.text
ltx/en_us_goadedes/me.m09.d26:meMA.Ode9C13.incipit	@ltx/en_us_goadedes/me.m07.d27:meMA.Ode9C13.incipit
ltx/en_us_goadedes/me.m09.d26:meMA.Ode9C13.melody	@ltx/en_us_goadedes/he.h.m2:heHE.AnarchouGennitoros.name
ltx/en_us_goadedes/me.m09.d26:meMA.Ode9C13.mode	@ltx/en_us_goadedes/miscellanea:misc.Mode2
ltx/en_us_goadedes/me.m09.d26:meMA.Ode9C13.ode	@ltx/en_us_goadedes/miscellanea:misc.Ode9
ltx/en_us_goadedes/me.m09.d26:meMA.Ode9C13.text	@ltx/en_us_goadedes/me.m07.d27:meMA.Ode9C13.text
ltx/en_us_goadedes/me.m09.d26:meMA.Ode9C1H.greekmelody	@ltx/en_us_goadedes/he.h.m2:heHE.AnarchouGennitoros.greekname
ltx/en_us_goadedes/me.m09.d26:meMA.Ode9C1H.incipit	@ltx/en_us_goadedes/he.h.m2:heHE.AnarchouGennitoros.incipit
ltx/en_us_goadedes/me.m09.d26:meMA.Ode9C1H.melody	@ltx/en_us_goadedes/he.h.m2:heHE.AnarchouGennitoros.melody
ltx/en_us_goadedes/me.m09.d26:meMA.Ode9C1H.mode	@ltx/en_us_goadedes/miscellanea:misc.Mode2
ltx/en_us_goadedes/me.m09.d26:meMA.Ode9C1H.ode	@ltx/en_us_goadedes/miscellanea:misc.Ode9
ltx/en_us_goadedes/me.m09.d26:meMA.Ode9C1H.text	@ltx/en_us_goadedes/he.h.m2:heHE.AnarchouGennitoros.text
ltx/en_us_goadedes/me.m09.d26:meMA.Ode9C21.greekmelody	@ltx/en_us_goadedes/he.h.m2:heHE.AnarchouGennitoros.greekname
ltx/en_us_goadedes/me.m09.d26:meMA.Ode9C21.incipit	…
ltx/en_us_goadedes/me.m09.d26:meMA.Ode9C21.melody	@ltx/en_us_goadedes/he.h.m2:heHE.AnarchouGennitoros.name
ltx/en_us_goadedes/me.m09.d26:meMA.Ode9C21.mode	@ltx/en_us_goadedes/miscellanea:misc.Mode2
ltx/en_us_goadedes/me.m09.d26:meMA.Ode9C21.ode	@ltx/en_us_goadedes/miscellanea:misc.Ode9
ltx/en_us_goadedes/me.m09.d26:meMA.Ode9C21.text	
ltx/en_us_goadedes/me.m09.d26:meMA.Ode9C22.incipit	…
ltx/en_us_goadedes/me.m09.d26:meMA.Ode9C22.melody	@ltx/en_us_goadedes/he.h.m2:heHE.AnarchouGennitoros.name
ltx/en_us_goadedes/me.m09.d26:meMA.Ode9C22.mode	@ltx/en_us_goadedes/miscellanea:misc.Mode2
ltx/en_us_goadedes/me.m09.d26:meMA.Ode9C22.ode	@ltx/en_us_goadedes/miscellanea:misc.Ode9
ltx/en_us_goadedes/me.m09.d26:meMA.Ode9C22.text	
ltx/en_us_goadedes/me.m09.d26:meMA.Ode9C23.incipit	…
ltx/en_us_goadedes/me.m09.d26:meMA.Ode9C23.melody	@ltx/en_us_goadedes/he.h.m2:heHE.AnarchouGennitoros.name
ltx/en_us_goadedes/me.m09.d26:meMA.Ode9C23.mode	@ltx/en_us_goadedes/miscellanea:misc.Mode2
ltx/en_us_goadedes/me.m09.d26:meMA.Ode9C23.ode	@ltx/en_us_goadedes/miscellanea:misc.Ode9
ltx/en_us_goadedes/me.m09.d26:meMA.Ode9C23.text	
ltx/en_us_goadedes/me.m09.d26:meMA.Ode9C2T.incipit	…
ltx/en_us_goadedes/me.m09.d26:meMA.Ode9C2T.melody	@ltx/en_us_goadedes/he.h.m2:heHE.AnarchouGennitoros.name
ltx/en_us_goadedes/me.m09.d26:meMA.Ode9C2T.mode	@ltx/en_us_goadedes/miscellanea:misc.Mode2
ltx/en_us_goadedes/me.m09.d26:meMA.Ode9C2T.ode	@ltx/en_us_goadedes/miscellanea:misc.Ode9
ltx/en_us_goadedes/me.m09.d26:meMA.Ode9C2T.text	
ltx/en_us_goadedes/me.m09.d26:meMA.Ode9C31.greekmelody	@ltx/en_us_goadedes/he.h.m6:heHE.TheonAnthropois.greekname
ltx/en_us_goadedes/me.m09.d26:meMA.Ode9C31.incipit	…
ltx/en_us_goadedes/me.m09.d26:meMA.Ode9C31.melody	@ltx/en_us_goadedes/he.h.m6:heHE.TheonAnthropois.name
ltx/en_us_goadedes/me.m09.d26:meMA.Ode9C31.mode	@ltx/en_us_goadedes/miscellanea:misc.Mode6
ltx/en_us_goadedes/me.m09.d26:meMA.Ode9C31.ode	@ltx/en_us_goadedes/miscellanea:misc.Ode9
ltx/en_us_goadedes/me.m09.d26:meMA.Ode9C31.text	
ltx/en_us_goadedes/me.m09.d26:meMA.Ode9C32.incipit	…
ltx/en_us_goadedes/me.m09.d26:meMA.Ode9C32.melody	@ltx/en_us_goadedes/he.h.m6:heHE.TheonAnthropois.name
ltx/en_us_goadedes/me.m09.d26:meMA.Ode9C32.mode	@ltx/en_us_goadedes/miscellanea:misc.Mode6
ltx/en_us_goadedes/me.m09.d26:meMA.Ode9C32.ode	@ltx/en_us_goadedes/miscellanea:misc.Ode9
ltx/en_us_goadedes/me.m09.d26:meMA.Ode9C32.text	
ltx/en_us_goadedes/me.m09.d26:meMA.Ode9C33.incipit	…
ltx/en_us_goadedes/me.m09.d26:meMA.Ode9C33.melody	@ltx/en_us_goadedes/he.h.m6:heHE.TheonAnthropois.name
ltx/en_us_goadedes/me.m09.d26:meMA.Ode9C33.mode	@ltx/en_us_goadedes/miscellanea:misc.Mode6
ltx/en_us_goadedes/me.m09.d26:meMA.Ode9C33.ode	@ltx/en_us_goadedes/miscellanea:misc.Ode9
ltx/en_us_goadedes/me.m09.d26:meMA.Ode9C33.text	
ltx/en_us_goadedes/me.m09.d26:meMA.Ode9C3T.incipit	…
ltx/en_us_goadedes/me.m09.d26:meMA.Ode9C3T.melody	@ltx/en_us_goadedes/he.h.m6:heHE.TheonAnthropois.name
ltx/en_us_goadedes/me.m09.d26:meMA.Ode9C3T.mode	@ltx/en_us_goadedes/miscellanea:misc.Mode6
ltx/en_us_goadedes/me.m09.d26:meMA.Ode9C3T.ode	@ltx/en_us_goadedes/miscellanea:misc.Ode9
ltx/en_us_goadedes/me.m09.d26:meMA.Ode9C3T.text	
ltx/en_us_goadedes/me.m09.d26:meMA.Oikos1.text	
ltx/en_us_goadedes/me.m09.d26:meMA.PostGospelBoth.incipit	@ltx/en_us_goadedes/ho.ho03:hoMA.PostGospelTheotokos.incipit
ltx/en_us_goadedes/me.m09.d26:meMA.PostGospelBoth.melody	
ltx/en_us_goadedes/me.m09.d26:meMA.PostGospelBoth.mode	@ltx/en_us_goadedes/miscellanea:misc.Mode2
ltx/en_us_goadedes/me.m09.d26:meMA.PostGospelBoth.text	@ltx/en_us_goadedes/ho.ho03:hoMA.PostGospelTheotokos.text
ltx/en_us_goadedes/me.m09.d26:meMA.PostGospelGlory.incipit	@ltx/en_us_goadedes/ho.ho03:hoMA.PostGospelApostle.incipit
ltx/en_us_goadedes/me.m09.d26:meMA.PostGospelGlory.melody	
ltx/en_us_goadedes/me.m09.d26:meMA.PostGospelGlory.mode	@ltx/en_us_goadedes/miscellanea:misc.Mode2
ltx/en_us_goadedes/me.m09.d26:meMA.PostGospelGlory.text	@ltx/en_us_goadedes/ho.ho03:hoMA.PostGospelApostle.text
ltx/en_us_goadedes/me.m09.d26:meMA.PostGospelIdiomelon.incipit	@ltx/en_us_goadedes/me.m09.d26:meSV.SticGlory.incipit
ltx/en_us_goadedes/me.m09.d26:meMA.PostGospelIdiomelon.melody	
ltx/en_us_goadedes/me.m09.d26:meMA.PostGospelIdiomelon.mode	@ltx/en_us_goadedes/miscellanea:misc.Mode2
ltx/en_us_goadedes/me.m09.d26:meMA.PostGospelIdiomelon.text	@ltx/en_us_goadedes/me.m09.d26:meSV.SticGlory.text
ltx/en_us_goadedes/me.m09.d26:meSV.AposGlory.incipit	…
ltx/en_us_goadedes/me.m09.d26:meSV.AposGlory.melody	@ltx/en_us_goadedes/he.a.m6:heAU.TriimerosAnestis.name
ltx/en_us_goadedes/me.m09.d26:meSV.AposGlory.mode	@ltx/en_us_goadedes/miscellanea:misc.Mode6
ltx/en_us_goadedes/me.m09.d26:meSV.AposGlory.text	
ltx/en_us_goadedes/me.m09.d26:meSV.Aposticha1.incipit	…
ltx/en_us_goadedes/me.m09.d26:meSV.Aposticha1.melody	@ltx/en_us_goadedes/he.a.m6:heAU.TriimerosAnestis.name
ltx/en_us_goadedes/me.m09.d26:meSV.Aposticha1.mode	@ltx/en_us_goadedes/miscellanea:misc.Mode6
ltx/en_us_goadedes/me.m09.d26:meSV.Aposticha1.text	
ltx/en_us_goadedes/me.m09.d26:meSV.Aposticha2.incipit	…
ltx/en_us_goadedes/me.m09.d26:meSV.Aposticha2.melody	@ltx/en_us_goadedes/he.a.m6:heAU.TriimerosAnestis.name
ltx/en_us_goadedes/me.m09.d26:meSV.Aposticha2.mode	@ltx/en_us_goadedes/miscellanea:misc.Mode6
ltx/en_us_goadedes/me.m09.d26:meSV.Aposticha2.text	
ltx/en_us_goadedes/me.m09.d26:meSV.Aposticha3.incipit	…
ltx/en_us_goadedes/me.m09.d26:meSV.Aposticha3.melody	@ltx/en_us_goadedes/he.a.m6:heAU.TriimerosAnestis.name
ltx/en_us_goadedes/me.m09.d26:meSV.Aposticha3.mode	@ltx/en_us_goadedes/miscellanea:misc.Mode6
ltx/en_us_goadedes/me.m09.d26:meSV.Aposticha3.text	
ltx/en_us_goadedes/me.m09.d26:meSV.SticBoth.incipit	…
ltx/en_us_goadedes/me.m09.d26:meSV.SticBoth.melody	
ltx/en_us_goadedes/me.m09.d26:meSV.SticBoth.mode	@ltx/en_us_goadedes/miscellanea:misc.Mode2
ltx/en_us_goadedes/me.m09.d26:meSV.SticBoth.text	
ltx/en_us_goadedes/me.m09.d26:meSV.SticGlory.incipit	…
ltx/en_us_goadedes/me.m09.d26:meSV.SticGlory.melody	
ltx/en_us_goadedes/me.m09.d26:meSV.SticGlory.mode	@ltx/en_us_goadedes/miscellanea:misc.Mode2
ltx/en_us_goadedes/me.m09.d26:meSV.SticGlory.text	
ltx/en_us_goadedes/me.m09.d26:meSV.Stichera1.incipit	…
ltx/en_us_goadedes/me.m09.d26:meSV.Stichera1.melody	@ltx/en_us_goadedes/he.a.m2:heAU.OteEkTouXylou.name
ltx/en_us_goadedes/me.m09.d26:meSV.Stichera1.mode	@ltx/en_us_goadedes/miscellanea:misc.Mode2
ltx/en_us_goadedes/me.m09.d26:meSV.Stichera1.text	
ltx/en_us_goadedes/me.m09.d26:meSV.Stichera2.incipit	…
ltx/en_us_goadedes/me.m09.d26:meSV.Stichera2.melody	@ltx/en_us_goadedes/he.a.m2:heAU.OteEkTouXylou.name
ltx/en_us_goadedes/me.m09.d26:meSV.Stichera2.mode	@ltx/en_us_goadedes/miscellanea:misc.Mode2
ltx/en_us_goadedes/me.m09.d26:meSV.Stichera2.text	
ltx/en_us_goadedes/me.m09.d26:meSV.Stichera3.incipit	…
ltx/en_us_goadedes/me.m09.d26:meSV.Stichera3.melody	@ltx/en_us_goadedes/he.a.m2:heAU.OteEkTouXylou.name
ltx/en_us_goadedes/me.m09.d26:meSV.Stichera3.mode	@ltx/en_us_goadedes/miscellanea:misc.Mode2
ltx/en_us_goadedes/me.m09.d26:meSV.Stichera3.text	
ltx/en_us_goadedes/me.m09.d26:meVE.Apolytikion1.incipit	@ltx/en_us_goadedes/me.m05.d08:meVE.Apolytikion1.incipit
ltx/en_us_goadedes/me.m09.d26:meVE.Apolytikion1.melody	
ltx/en_us_goadedes/me.m09.d26:meVE.Apolytikion1.mode	@ltx/en_us_goadedes/miscellanea:misc.Mode2
ltx/en_us_goadedes/me.m09.d26:meVE.Apolytikion1.text	@ltx/en_us_goadedes/me.m05.d08:meVE.Apolytikion1.text
ltx/en_us_goadedes/me.m09.d26:meVE.AposGlory.incipit	@ltx/en_us_goadedes/me.m05.d08:meVE.AposGlory.incipit
ltx/en_us_goadedes/me.m09.d26:meVE.AposGlory.melody	
ltx/en_us_goadedes/me.m09.d26:meVE.AposGlory.mode	@ltx/en_us_goadedes/miscellanea:misc.Mode6
ltx/en_us_goadedes/me.m09.d26:meVE.AposGlory.poet	@ltx/en_us_goadedes/poets:po.IoannouMonachou
ltx/en_us_goadedes/me.m09.d26:meVE.AposGlory.text	@ltx/en_us_goadedes/me.m05.d08:meVE.AposGlory.text
ltx/en_us_goadedes/me.m09.d26:meVE.Aposticha1.greekmelody	@ltx/en_us_goadedes/he.a.m4:heAU.OExYpsistouKlitheis.greekname
ltx/en_us_goadedes/me.m09.d26:meVE.Aposticha1.incipit	…
ltx/en_us_goadedes/me.m09.d26:meVE.Aposticha1.melody	@ltx/en_us_goadedes/he.a.m4:heAU.OExYpsistouKlitheis.name
ltx/en_us_goadedes/me.m09.d26:meVE.Aposticha1.mode	@ltx/en_us_goadedes/miscellanea:misc.Mode4
ltx/en_us_goadedes/me.m09.d26:meVE.Aposticha1.text	
ltx/en_us_goadedes/me.m09.d26:meVE.Aposticha2.incipit	…
ltx/en_us_goadedes/me.m09.d26:meVE.Aposticha2.melody	@ltx/en_us_goadedes/he.a.m4:heAU.OExYpsistouKlitheis.name
ltx/en_us_goadedes/me.m09.d26:meVE.Aposticha2.mode	@ltx/en_us_goadedes/miscellanea:misc.Mode4
ltx/en_us_goadedes/me.m09.d26:meVE.Aposticha2.text	
ltx/en_us_goadedes/me.m09.d26:meVE.Aposticha3.incipit	…
ltx/en_us_goadedes/me.m09.d26:meVE.Aposticha3.melody	@ltx/en_us_goadedes/he.a.m4:heAU.OExYpsistouKlitheis.name
ltx/en_us_goadedes/me.m09.d26:meVE.Aposticha3.mode	@ltx/en_us_goadedes/miscellanea:misc.Mode4
ltx/en_us_goadedes/me.m09.d26:meVE.Aposticha3.text	
ltx/en_us_goadedes/me.m09.d26:meVE.Lity1.incipit	@ltx/en_us_goadedes/me.m05.d08:meVE.Lity1.incipit
ltx/en_us_goadedes/me.m09.d26:meVE.Lity1.melody	
ltx/en_us_goadedes/me.m09.d26:meVE.Lity1.mode	@ltx/en_us_goadedes/miscellanea:misc.Mode1
ltx/en_us_goadedes/me.m09.d26:meVE.Lity1.poet	@ltx/en_us_goadedes/poets:po.Germanou
ltx/en_us_goadedes/me.m09.d26:meVE.Lity1.text	@ltx/en_us_goadedes/me.m05.d08:meVE.Lity1.text
ltx/en_us_goadedes/me.m09.d26:meVE.Lity2.incipit	@ltx/en_us_goadedes/me.m05.d08:meVE.Lity2.incipit
ltx/en_us_goadedes/me.m09.d26:meVE.Lity2.melody	
ltx/en_us_goadedes/me.m09.d26:meVE.Lity2.mode	@ltx/en_us_goadedes/miscellanea:misc.Mode1
ltx/en_us_goadedes/me.m09.d26:meVE.Lity2.poet	@ltx/en_us_goadedes/poets:po.AndreouPyrou
ltx/en_us_goadedes/me.m09.d26:meVE.Lity2.text	@ltx/en_us_goadedes/me.m05.d08:meVE.Lity2.text
ltx/en_us_goadedes/me.m09.d26:meVE.Lity3.incipit	O Disciple of the Savior…
ltx/en_us_goadedes/me.m09.d26:meVE.Lity3.melody	
ltx/en_us_goadedes/me.m09.d26:meVE.Lity3.mode	@ltx/en_us_goadedes/miscellanea:misc.Mode1
ltx/en_us_goadedes/me.m09.d26:meVE.Lity3.text	O Disciple of the Savior, Virgin and Theologian, when Christ our God was hanging on the Cross, He entrusted the Virgin and Theotokos to you as virgin; and you guarded her as the apple of your eye. We pray you intercede for the salvation of our souls.
ltx/en_us_goadedes/me.m09.d26:meVE.Lity4.incipit	@ltx/en_us_goadedes/me.m05.d08:meVE.Lity3.incipit
ltx/en_us_goadedes/me.m09.d26:meVE.Lity4.melody	
ltx/en_us_goadedes/me.m09.d26:meVE.Lity4.mode	@ltx/en_us_goadedes/miscellanea:misc.Mode1
ltx/en_us_goadedes/me.m09.d26:meVE.Lity4.text	@ltx/en_us_goadedes/me.m05.d08:meVE.Lity3.text
ltx/en_us_goadedes/me.m09.d26:meVE.Lity5.incipit	@ltx/en_us_goadedes/me.m05.d08:meVE.Lity4.incipit
ltx/en_us_goadedes/me.m09.d26:meVE.Lity5.melody	
ltx/en_us_goadedes/me.m09.d26:meVE.Lity5.mode	@ltx/en_us_goadedes/miscellanea:misc.Mode2
ltx/en_us_goadedes/me.m09.d26:meVE.Lity5.poet	@ltx/en_us_goadedes/poets:po.Theofanous
ltx/en_us_goadedes/me.m09.d26:meVE.Lity5.text	@ltx/en_us_goadedes/me.m05.d08:meVE.Lity4.text
ltx/en_us_goadedes/me.m09.d26:meVE.LityBoth.incipit	With the Father and the Spirit…
ltx/en_us_goadedes/me.m09.d26:meVE.LityBoth.melody	
ltx/en_us_goadedes/me.m09.d26:meVE.LityBoth.mode	@ltx/en_us_goadedes/miscellanea:misc.Mode4
ltx/en_us_goadedes/me.m09.d26:meVE.LityBoth.text	With the Father and the Spirit, the Son is also glorified in the heights by the Cherubim. Wishing to refashion first-created man, He emptied himself wholly and ineffably in your womb, O all-lauded Theotokos. Rising from you like the sun, He illumined the entire world with His divinity, and He freed it from the folly of idolatry. In himself He deified humanity, and He joined it to heaven. He is Christ our God and the Savior of our souls.
ltx/en_us_goadedes/me.m09.d26:meVE.LityGlory.incipit	@ltx/en_us_goadedes/me.m05.d08:meVE.LityGlory.incipit
ltx/en_us_goadedes/me.m09.d26:meVE.LityGlory.melody	
ltx/en_us_goadedes/me.m09.d26:meVE.LityGlory.mode	@ltx/en_us_goadedes/miscellanea:misc.Mode4
ltx/en_us_goadedes/me.m09.d26:meVE.LityGlory.poet	@ltx/en_us_goadedes/poets:po.Vyzantiou
ltx/en_us_goadedes/me.m09.d26:meVE.LityGlory.text	@ltx/en_us_goadedes/me.m05.d08:meVE.LityGlory.text
ltx/en_us_goadedes/me.m09.d26:meVE.SticGlory.incipit	@ltx/en_us_goadedes/me.m05.d08:meVE.SticGlory.incipit
ltx/en_us_goadedes/me.m09.d26:meVE.SticGlory.melody	
ltx/en_us_goadedes/me.m09.d26:meVE.SticGlory.mode	@ltx/en_us_goadedes/miscellanea:misc.Mode2
ltx/en_us_goadedes/me.m09.d26:meVE.SticGlory.poet	@ltx/en_us_goadedes/poets:po.GermanouOiDeVyzantiou
ltx/en_us_goadedes/me.m09.d26:meVE.SticGlory.text	@ltx/en_us_goadedes/me.m05.d08:meVE.SticGlory.text
ltx/en_us_goadedes/me.m09.d26:meVE.Stichera01.greekmelody	@ltx/en_us_goadedes/he.a.m1:heAU.TonOuranionTagmaton.greekname
ltx/en_us_goadedes/me.m09.d26:meVE.Stichera01.incipit	@ltx/en_us_goadedes/me.m05.d08:meVE.Stichera01.incipit
ltx/en_us_goadedes/me.m09.d26:meVE.Stichera01.melody	@ltx/en_us_goadedes/he.a.m1:heAU.TonOuranionTagmaton.name
ltx/en_us_goadedes/me.m09.d26:meVE.Stichera01.mode	@ltx/en_us_goadedes/miscellanea:misc.Mode1
ltx/en_us_goadedes/me.m09.d26:meVE.Stichera01.text	@ltx/en_us_goadedes/me.m05.d08:meVE.Stichera01.text
ltx/en_us_goadedes/me.m09.d26:meVE.Stichera02.incipit	@ltx/en_us_goadedes/me.m05.d08:meVE.Stichera02.incipit
ltx/en_us_goadedes/me.m09.d26:meVE.Stichera02.melody	@ltx/en_us_goadedes/he.a.m1:heAU.TonOuranionTagmaton.name
ltx/en_us_goadedes/me.m09.d26:meVE.Stichera02.mode	@ltx/en_us_goadedes/miscellanea:misc.Mode1
ltx/en_us_goadedes/me.m09.d26:meVE.Stichera02.text	@ltx/en_us_goadedes/me.m05.d08:meVE.Stichera02.text
ltx/en_us_goadedes/me.m09.d26:meVE.Stichera03.incipit	@ltx/en_us_goadedes/me.m05.d08:meVE.Stichera03.incipit
ltx/en_us_goadedes/me.m09.d26:meVE.Stichera03.melody	@ltx/en_us_goadedes/he.a.m1:heAU.TonOuranionTagmaton.name
ltx/en_us_goadedes/me.m09.d26:meVE.Stichera03.mode	@ltx/en_us_goadedes/miscellanea:misc.Mode1
ltx/en_us_goadedes/me.m09.d26:meVE.Stichera03.text	@ltx/en_us_goadedes/me.m05.d08:meVE.Stichera03.text
