ltx/en_us_goadedes/me.m12.dAC:meDA.commemoration.first	
ltx/en_us_goadedes/me.m12.dAC:meDA.commemoration.first_name	
ltx/en_us_goadedes/me.m12.dAC:meDA.commemoration.first_short	
ltx/en_us_goadedes/me.m12.dAC:meDA.commemoration.first_title	@ltx/en_us_goadedes/titles:ti.Saints
ltx/en_us_goadedes/me.m12.dAC:meDA.commemoration.full	
ltx/en_us_goadedes/me.m12.dAC:meDA.commemoration.second_name	
ltx/en_us_goadedes/me.m12.dAC:meDA.commemoration.second_title	
ltx/en_us_goadedes/me.m12.dAC:meDA.date	
ltx/en_us_goadedes/me.m12.dAC:meDA.dismissal	@ltx/en_us_goadedes/dismissals:dis00.christmas
ltx/en_us_goadedes/me.m12.dAC:meDA.fordate	
ltx/en_us_goadedes/me.m12.dAC:meDA.insert1	
ltx/en_us_goadedes/me.m12.dAC:meDA.insert2	
ltx/en_us_goadedes/me.m12.dAC:meDA.note	
ltx/en_us_goadedes/me.m12.dAC:meDA.pdfcoverdate	
ltx/en_us_goadedes/me.m12.dAC:meDA.pdfheaderdate	
ltx/en_us_goadedes/me.m12.dAC:meHO.commemorations	
ltx/en_us_goadedes/me.m12.dAC:meHO.note1	
ltx/en_us_goadedes/me.m12.dAC:meHO.note2	
ltx/en_us_goadedes/me.m12.dAC:meHO.number	
ltx/en_us_goadedes/me.m12.dAC:meHO.rank	
ltx/en_us_goadedes/me.m12.dAC:meLE.commemoration1	
ltx/en_us_goadedes/me.m12.dAC:meLE.commemoration2	
ltx/en_us_goadedes/me.m12.dAC:meLI.Kontakion1.greekmelody	@ltx/en_us_goadedes/me.m12.dAC:meMA.Kontakion1.greekmelody
ltx/en_us_goadedes/me.m12.dAC:meLI.Kontakion1.incipit	@ltx/en_us_goadedes/me.m12.dAC:meMA.Kontakion1.incipit
ltx/en_us_goadedes/me.m12.dAC:meLI.Kontakion1.melody	@ltx/en_us_goadedes/me.m12.dAC:meMA.Kontakion1.melody
ltx/en_us_goadedes/me.m12.dAC:meLI.Kontakion1.mode	@ltx/en_us_goadedes/me.m12.dAC:meMA.Kontakion1.mode
ltx/en_us_goadedes/me.m12.dAC:meLI.Kontakion1.text	@ltx/en_us_goadedes/me.m12.dAC:meMA.Kontakion1.text
ltx/en_us_goadedes/me.m12.dAC:meLI.Megalynarion.text	
ltx/en_us_goadedes/me.m12.dAC:meMA.C1.acrostic.notice1	
ltx/en_us_goadedes/me.m12.dAC:meMA.C1.acrostic.text	
ltx/en_us_goadedes/me.m12.dAC:meMA.C1.acrostic.title	
ltx/en_us_goadedes/me.m12.dAC:meMA.C1.title	
ltx/en_us_goadedes/me.m12.dAC:meMA.C1.verse	@ltx/en_us_goadedes/prayers:pr.verse_SaintM.text
ltx/en_us_goadedes/me.m12.dAC:meMA.C2.acrostic.title	
ltx/en_us_goadedes/me.m12.dAC:meMA.C2.poet	@ltx/en_us_goadedes/poets:po.KosmaMonachou
ltx/en_us_goadedes/me.m12.dAC:meMA.C2.title	@ltx/en_us_goadedes/titles:ti.CanonSaints
ltx/en_us_goadedes/me.m12.dAC:meMA.C2.verse	@ltx/en_us_goadedes/prayers:pr.verse_SaintsM.text
ltx/en_us_goadedes/me.m12.dAC:meMA.Exaposteilarion1.greekmelody	@ltx/en_us_goadedes/he.a.m2:heAU.ToisMathitaisSynelthomen.greekname
ltx/en_us_goadedes/me.m12.dAC:meMA.Exaposteilarion1.incipit	…
ltx/en_us_goadedes/me.m12.dAC:meMA.Exaposteilarion1.melody	@ltx/en_us_goadedes/he.a.m2:heAU.ToisMathitaisSynelthomen.name
ltx/en_us_goadedes/me.m12.dAC:meMA.Exaposteilarion1.mode	@ltx/en_us_goadedes/miscellanea:misc.Mode2
ltx/en_us_goadedes/me.m12.dAC:meMA.Exaposteilarion1.text	
ltx/en_us_goadedes/me.m12.dAC:meMA.Kontakion1.greekmelody	@ltx/en_us_goadedes/he.a.m3:heAU.IParthenosSimeron.greekname
ltx/en_us_goadedes/me.m12.dAC:meMA.Kontakion1.incipit	…
ltx/en_us_goadedes/me.m12.dAC:meMA.Kontakion1.melody	@ltx/en_us_goadedes/he.a.m3:heAU.IParthenosSimeron.name
ltx/en_us_goadedes/me.m12.dAC:meMA.Kontakion1.mode	@ltx/en_us_goadedes/miscellanea:misc.Mode3
ltx/en_us_goadedes/me.m12.dAC:meMA.Kontakion1.text	
ltx/en_us_goadedes/me.m12.dAC:meMA.Lauds1.incipit	@ltx/en_us_goadedes/me.m12.d25:meMA.Lauds1.incipit
ltx/en_us_goadedes/me.m12.dAC:meMA.Lauds1.melody	
ltx/en_us_goadedes/me.m12.dAC:meMA.Lauds1.mode	@ltx/en_us_goadedes/miscellanea:misc.Mode4
ltx/en_us_goadedes/me.m12.dAC:meMA.Lauds1.text	@ltx/en_us_goadedes/me.m12.d25:meMA.Lauds1.text
ltx/en_us_goadedes/me.m12.dAC:meMA.Lauds2.incipit	@ltx/en_us_goadedes/me.m12.d25:meMA.Lauds3.incipit
ltx/en_us_goadedes/me.m12.dAC:meMA.Lauds2.melody	
ltx/en_us_goadedes/me.m12.dAC:meMA.Lauds2.mode	@ltx/en_us_goadedes/miscellanea:misc.Mode4
ltx/en_us_goadedes/me.m12.dAC:meMA.Lauds2.text	@ltx/en_us_goadedes/me.m12.d25:meMA.Lauds3.text
ltx/en_us_goadedes/me.m12.dAC:meMA.Lauds3.incipit	@ltx/en_us_goadedes/me.m12.d25:meMA.Lauds4.incipit
ltx/en_us_goadedes/me.m12.dAC:meMA.Lauds3.melody	
ltx/en_us_goadedes/me.m12.dAC:meMA.Lauds3.mode	@ltx/en_us_goadedes/miscellanea:misc.Mode4
ltx/en_us_goadedes/me.m12.dAC:meMA.Lauds3.text	@ltx/en_us_goadedes/me.m12.d25:meMA.Lauds4.text
ltx/en_us_goadedes/me.m12.dAC:meMA.Lauds4.incipit	@ltx/en_us_goadedes/me.m12.d25:meMA.Lauds2.incipit
ltx/en_us_goadedes/me.m12.dAC:meMA.Lauds4.melody	
ltx/en_us_goadedes/me.m12.dAC:meMA.Lauds4.mode	@ltx/en_us_goadedes/miscellanea:misc.Mode4
ltx/en_us_goadedes/me.m12.dAC:meMA.Lauds4.text	@ltx/en_us_goadedes/me.m12.d25:meMA.Lauds2.text
ltx/en_us_goadedes/me.m12.dAC:meMA.LaudsGlory.incipit	…
ltx/en_us_goadedes/me.m12.dAC:meMA.LaudsGlory.melody	
ltx/en_us_goadedes/me.m12.dAC:meMA.LaudsGlory.mode	@ltx/en_us_goadedes/miscellanea:misc.Mode8
ltx/en_us_goadedes/me.m12.dAC:meMA.LaudsGlory.poet	@ltx/en_us_goadedes/poets:po.Anatoliou
ltx/en_us_goadedes/me.m12.dAC:meMA.LaudsGlory.text	
ltx/en_us_goadedes/me.m12.dAC:meMA.MM.Lauds1234as3456.text	@ltx/en_us_goadedes/properties:media.key
ltx/en_us_goadedes/me.m12.dAC:meMA.MM.Lauds1234as5678.text	@ltx/en_us_goadedes/properties:media.key
ltx/en_us_goadedes/me.m12.dAC:meMA.Ode1C11.greekmelody	@ltx/en_us_goadedes/he.h.m1:heHE.ChristosGennatai.greekname
ltx/en_us_goadedes/me.m12.dAC:meMA.Ode1C11.incipit	…
ltx/en_us_goadedes/me.m12.dAC:meMA.Ode1C11.melody	@ltx/en_us_goadedes/he.h.m1:heHE.ChristosGennatai.name
ltx/en_us_goadedes/me.m12.dAC:meMA.Ode1C11.mode	@ltx/en_us_goadedes/miscellanea:misc.Mode1
ltx/en_us_goadedes/me.m12.dAC:meMA.Ode1C11.ode	@ltx/en_us_goadedes/miscellanea:misc.Ode1
ltx/en_us_goadedes/me.m12.dAC:meMA.Ode1C11.text	
ltx/en_us_goadedes/me.m12.dAC:meMA.Ode1C12.incipit	…
ltx/en_us_goadedes/me.m12.dAC:meMA.Ode1C12.melody	@ltx/en_us_goadedes/he.h.m1:heHE.ChristosGennatai.name
ltx/en_us_goadedes/me.m12.dAC:meMA.Ode1C12.mode	@ltx/en_us_goadedes/miscellanea:misc.Mode1
ltx/en_us_goadedes/me.m12.dAC:meMA.Ode1C12.ode	@ltx/en_us_goadedes/miscellanea:misc.Ode1
ltx/en_us_goadedes/me.m12.dAC:meMA.Ode1C12.text	
ltx/en_us_goadedes/me.m12.dAC:meMA.Ode1C13.incipit	…
ltx/en_us_goadedes/me.m12.dAC:meMA.Ode1C13.melody	@ltx/en_us_goadedes/he.h.m1:heHE.ChristosGennatai.name
ltx/en_us_goadedes/me.m12.dAC:meMA.Ode1C13.mode	@ltx/en_us_goadedes/miscellanea:misc.Mode1
ltx/en_us_goadedes/me.m12.dAC:meMA.Ode1C13.ode	@ltx/en_us_goadedes/miscellanea:misc.Ode1
ltx/en_us_goadedes/me.m12.dAC:meMA.Ode1C13.text	
ltx/en_us_goadedes/me.m12.dAC:meMA.Ode1C1T.incipit	…
ltx/en_us_goadedes/me.m12.dAC:meMA.Ode1C1T.melody	@ltx/en_us_goadedes/he.h.m1:heHE.ChristosGennatai.name
ltx/en_us_goadedes/me.m12.dAC:meMA.Ode1C1T.mode	@ltx/en_us_goadedes/miscellanea:misc.Mode1
ltx/en_us_goadedes/me.m12.dAC:meMA.Ode1C1T.ode	@ltx/en_us_goadedes/miscellanea:misc.Ode1
ltx/en_us_goadedes/me.m12.dAC:meMA.Ode1C1T.text	
ltx/en_us_goadedes/me.m12.dAC:meMA.Ode1C21.greekmelody	@ltx/en_us_goadedes/he.h.m4:heHE.AsomaiSoiKyrie.greekname
ltx/en_us_goadedes/me.m12.dAC:meMA.Ode1C21.incipit	…
ltx/en_us_goadedes/me.m12.dAC:meMA.Ode1C21.melody	@ltx/en_us_goadedes/he.h.m4:heHE.AsomaiSoiKyrie.name
ltx/en_us_goadedes/me.m12.dAC:meMA.Ode1C21.mode	@ltx/en_us_goadedes/miscellanea:misc.Mode4
ltx/en_us_goadedes/me.m12.dAC:meMA.Ode1C21.ode	@ltx/en_us_goadedes/miscellanea:misc.Ode1
ltx/en_us_goadedes/me.m12.dAC:meMA.Ode1C21.text	
ltx/en_us_goadedes/me.m12.dAC:meMA.Ode1C22.incipit	…
ltx/en_us_goadedes/me.m12.dAC:meMA.Ode1C22.melody	@ltx/en_us_goadedes/he.h.m4:heHE.AsomaiSoiKyrie.name
ltx/en_us_goadedes/me.m12.dAC:meMA.Ode1C22.mode	@ltx/en_us_goadedes/miscellanea:misc.Mode4
ltx/en_us_goadedes/me.m12.dAC:meMA.Ode1C22.ode	@ltx/en_us_goadedes/miscellanea:misc.Ode1
ltx/en_us_goadedes/me.m12.dAC:meMA.Ode1C22.text	
ltx/en_us_goadedes/me.m12.dAC:meMA.Ode1C23.incipit	…
ltx/en_us_goadedes/me.m12.dAC:meMA.Ode1C23.melody	@ltx/en_us_goadedes/he.h.m4:heHE.AsomaiSoiKyrie.name
ltx/en_us_goadedes/me.m12.dAC:meMA.Ode1C23.mode	@ltx/en_us_goadedes/miscellanea:misc.Mode4
ltx/en_us_goadedes/me.m12.dAC:meMA.Ode1C23.ode	@ltx/en_us_goadedes/miscellanea:misc.Ode1
ltx/en_us_goadedes/me.m12.dAC:meMA.Ode1C23.text	
ltx/en_us_goadedes/me.m12.dAC:meMA.Ode1C24.incipit	…
ltx/en_us_goadedes/me.m12.dAC:meMA.Ode1C24.melody	@ltx/en_us_goadedes/he.h.m4:heHE.AsomaiSoiKyrie.name
ltx/en_us_goadedes/me.m12.dAC:meMA.Ode1C24.mode	@ltx/en_us_goadedes/miscellanea:misc.Mode4
ltx/en_us_goadedes/me.m12.dAC:meMA.Ode1C24.ode	@ltx/en_us_goadedes/miscellanea:misc.Ode1
ltx/en_us_goadedes/me.m12.dAC:meMA.Ode1C24.text	
ltx/en_us_goadedes/me.m12.dAC:meMA.Ode1C25.incipit	…
ltx/en_us_goadedes/me.m12.dAC:meMA.Ode1C25.melody	@ltx/en_us_goadedes/he.h.m4:heHE.AsomaiSoiKyrie.name
ltx/en_us_goadedes/me.m12.dAC:meMA.Ode1C25.mode	@ltx/en_us_goadedes/miscellanea:misc.Mode4
ltx/en_us_goadedes/me.m12.dAC:meMA.Ode1C25.ode	@ltx/en_us_goadedes/miscellanea:misc.Ode1
ltx/en_us_goadedes/me.m12.dAC:meMA.Ode1C25.text	
ltx/en_us_goadedes/me.m12.dAC:meMA.Ode3C11.greekmelody	@ltx/en_us_goadedes/he.h.m1:heHE.ToProTonAionon.greekname
ltx/en_us_goadedes/me.m12.dAC:meMA.Ode3C11.incipit	…
ltx/en_us_goadedes/me.m12.dAC:meMA.Ode3C11.melody	@ltx/en_us_goadedes/he.h.m1:heHE.ToProTonAionon.name
ltx/en_us_goadedes/me.m12.dAC:meMA.Ode3C11.mode	@ltx/en_us_goadedes/miscellanea:misc.Mode1
ltx/en_us_goadedes/me.m12.dAC:meMA.Ode3C11.ode	@ltx/en_us_goadedes/miscellanea:misc.Ode3
ltx/en_us_goadedes/me.m12.dAC:meMA.Ode3C11.text	
ltx/en_us_goadedes/me.m12.dAC:meMA.Ode3C12.incipit	…
ltx/en_us_goadedes/me.m12.dAC:meMA.Ode3C12.melody	@ltx/en_us_goadedes/he.h.m1:heHE.ToProTonAionon.name
ltx/en_us_goadedes/me.m12.dAC:meMA.Ode3C12.mode	@ltx/en_us_goadedes/miscellanea:misc.Mode1
ltx/en_us_goadedes/me.m12.dAC:meMA.Ode3C12.ode	@ltx/en_us_goadedes/miscellanea:misc.Ode3
ltx/en_us_goadedes/me.m12.dAC:meMA.Ode3C12.text	
ltx/en_us_goadedes/me.m12.dAC:meMA.Ode3C13.incipit	…
ltx/en_us_goadedes/me.m12.dAC:meMA.Ode3C13.melody	@ltx/en_us_goadedes/he.h.m1:heHE.ToProTonAionon.name
ltx/en_us_goadedes/me.m12.dAC:meMA.Ode3C13.mode	@ltx/en_us_goadedes/miscellanea:misc.Mode1
ltx/en_us_goadedes/me.m12.dAC:meMA.Ode3C13.ode	@ltx/en_us_goadedes/miscellanea:misc.Ode3
ltx/en_us_goadedes/me.m12.dAC:meMA.Ode3C13.text	
ltx/en_us_goadedes/me.m12.dAC:meMA.Ode3C1T.incipit	…
ltx/en_us_goadedes/me.m12.dAC:meMA.Ode3C1T.melody	@ltx/en_us_goadedes/he.h.m1:heHE.ToProTonAionon.name
ltx/en_us_goadedes/me.m12.dAC:meMA.Ode3C1T.mode	@ltx/en_us_goadedes/miscellanea:misc.Mode1
ltx/en_us_goadedes/me.m12.dAC:meMA.Ode3C1T.ode	@ltx/en_us_goadedes/miscellanea:misc.Ode3
ltx/en_us_goadedes/me.m12.dAC:meMA.Ode3C1T.text	
ltx/en_us_goadedes/me.m12.dAC:meMA.Ode3C21.greekmelody	@ltx/en_us_goadedes/he.h.m4:heHE.ToStereoma.greekname
ltx/en_us_goadedes/me.m12.dAC:meMA.Ode3C21.incipit	…
ltx/en_us_goadedes/me.m12.dAC:meMA.Ode3C21.melody	@ltx/en_us_goadedes/he.h.m4:heHE.ToStereoma.name
ltx/en_us_goadedes/me.m12.dAC:meMA.Ode3C21.mode	@ltx/en_us_goadedes/miscellanea:misc.Mode4
ltx/en_us_goadedes/me.m12.dAC:meMA.Ode3C21.ode	@ltx/en_us_goadedes/miscellanea:misc.Ode3
ltx/en_us_goadedes/me.m12.dAC:meMA.Ode3C21.text	
ltx/en_us_goadedes/me.m12.dAC:meMA.Ode3C22.incipit	…
ltx/en_us_goadedes/me.m12.dAC:meMA.Ode3C22.melody	@ltx/en_us_goadedes/he.h.m4:heHE.ToStereoma.name
ltx/en_us_goadedes/me.m12.dAC:meMA.Ode3C22.mode	@ltx/en_us_goadedes/miscellanea:misc.Mode4
ltx/en_us_goadedes/me.m12.dAC:meMA.Ode3C22.ode	@ltx/en_us_goadedes/miscellanea:misc.Ode3
ltx/en_us_goadedes/me.m12.dAC:meMA.Ode3C22.text	
ltx/en_us_goadedes/me.m12.dAC:meMA.Ode3C23.incipit	…
ltx/en_us_goadedes/me.m12.dAC:meMA.Ode3C23.melody	@ltx/en_us_goadedes/he.h.m4:heHE.ToStereoma.name
ltx/en_us_goadedes/me.m12.dAC:meMA.Ode3C23.mode	@ltx/en_us_goadedes/miscellanea:misc.Mode4
ltx/en_us_goadedes/me.m12.dAC:meMA.Ode3C23.ode	@ltx/en_us_goadedes/miscellanea:misc.Ode3
ltx/en_us_goadedes/me.m12.dAC:meMA.Ode3C23.text	
ltx/en_us_goadedes/me.m12.dAC:meMA.Ode3C24.incipit	…
ltx/en_us_goadedes/me.m12.dAC:meMA.Ode3C24.melody	@ltx/en_us_goadedes/he.h.m4:heHE.ToStereoma.name
ltx/en_us_goadedes/me.m12.dAC:meMA.Ode3C24.mode	@ltx/en_us_goadedes/miscellanea:misc.Mode4
ltx/en_us_goadedes/me.m12.dAC:meMA.Ode3C24.ode	@ltx/en_us_goadedes/miscellanea:misc.Ode3
ltx/en_us_goadedes/me.m12.dAC:meMA.Ode3C24.text	
ltx/en_us_goadedes/me.m12.dAC:meMA.Ode3C25.incipit	…
ltx/en_us_goadedes/me.m12.dAC:meMA.Ode3C25.melody	@ltx/en_us_goadedes/he.h.m4:heHE.ToStereoma.name
ltx/en_us_goadedes/me.m12.dAC:meMA.Ode3C25.mode	@ltx/en_us_goadedes/miscellanea:misc.Mode4
ltx/en_us_goadedes/me.m12.dAC:meMA.Ode3C25.ode	@ltx/en_us_goadedes/miscellanea:misc.Ode3
ltx/en_us_goadedes/me.m12.dAC:meMA.Ode3C25.text	
ltx/en_us_goadedes/me.m12.dAC:meMA.Ode3Kathisma1.greekmelody	@ltx/en_us_goadedes/he.a.m1:heAU.ChorosAngelikos.greekname
ltx/en_us_goadedes/me.m12.dAC:meMA.Ode3Kathisma1.incipit	…
ltx/en_us_goadedes/me.m12.dAC:meMA.Ode3Kathisma1.melody	@ltx/en_us_goadedes/he.a.m1:heAU.ChorosAngelikos.name
ltx/en_us_goadedes/me.m12.dAC:meMA.Ode3Kathisma1.mode	@ltx/en_us_goadedes/miscellanea:misc.Mode1
ltx/en_us_goadedes/me.m12.dAC:meMA.Ode3Kathisma1.text	
ltx/en_us_goadedes/me.m12.dAC:meMA.Ode3Kathisma2.greekmelody	@ltx/en_us_goadedes/he.a.m1:heAU.ChorosAngelikos.greekname
ltx/en_us_goadedes/me.m12.dAC:meMA.Ode3Kathisma2.incipit	…
ltx/en_us_goadedes/me.m12.dAC:meMA.Ode3Kathisma2.melody	@ltx/en_us_goadedes/he.a.m1:heAU.ChorosAngelikos.name
ltx/en_us_goadedes/me.m12.dAC:meMA.Ode3Kathisma2.mode	@ltx/en_us_goadedes/miscellanea:misc.Mode1
ltx/en_us_goadedes/me.m12.dAC:meMA.Ode3Kathisma2.text	
ltx/en_us_goadedes/me.m12.dAC:meMA.Ode4C11.greekmelody	@ltx/en_us_goadedes/he.h.m1:heHE.RavdosEkTisRizis.greekname
ltx/en_us_goadedes/me.m12.dAC:meMA.Ode4C11.incipit	…
ltx/en_us_goadedes/me.m12.dAC:meMA.Ode4C11.melody	@ltx/en_us_goadedes/he.h.m1:heHE.RavdosEkTisRizis.name
ltx/en_us_goadedes/me.m12.dAC:meMA.Ode4C11.mode	@ltx/en_us_goadedes/miscellanea:misc.Mode1
ltx/en_us_goadedes/me.m12.dAC:meMA.Ode4C11.ode	@ltx/en_us_goadedes/miscellanea:misc.Ode4
ltx/en_us_goadedes/me.m12.dAC:meMA.Ode4C11.text	
ltx/en_us_goadedes/me.m12.dAC:meMA.Ode4C12.incipit	…
ltx/en_us_goadedes/me.m12.dAC:meMA.Ode4C12.melody	@ltx/en_us_goadedes/he.h.m1:heHE.RavdosEkTisRizis.name
ltx/en_us_goadedes/me.m12.dAC:meMA.Ode4C12.mode	@ltx/en_us_goadedes/miscellanea:misc.Mode1
ltx/en_us_goadedes/me.m12.dAC:meMA.Ode4C12.ode	@ltx/en_us_goadedes/miscellanea:misc.Ode4
ltx/en_us_goadedes/me.m12.dAC:meMA.Ode4C12.text	
ltx/en_us_goadedes/me.m12.dAC:meMA.Ode4C13.incipit	…
ltx/en_us_goadedes/me.m12.dAC:meMA.Ode4C13.melody	@ltx/en_us_goadedes/he.h.m1:heHE.RavdosEkTisRizis.name
ltx/en_us_goadedes/me.m12.dAC:meMA.Ode4C13.mode	@ltx/en_us_goadedes/miscellanea:misc.Mode1
ltx/en_us_goadedes/me.m12.dAC:meMA.Ode4C13.ode	@ltx/en_us_goadedes/miscellanea:misc.Ode4
ltx/en_us_goadedes/me.m12.dAC:meMA.Ode4C13.text	
ltx/en_us_goadedes/me.m12.dAC:meMA.Ode4C1T.incipit	…
ltx/en_us_goadedes/me.m12.dAC:meMA.Ode4C1T.melody	@ltx/en_us_goadedes/he.h.m1:heHE.RavdosEkTisRizis.name
ltx/en_us_goadedes/me.m12.dAC:meMA.Ode4C1T.mode	@ltx/en_us_goadedes/miscellanea:misc.Mode1
ltx/en_us_goadedes/me.m12.dAC:meMA.Ode4C1T.ode	@ltx/en_us_goadedes/miscellanea:misc.Ode4
ltx/en_us_goadedes/me.m12.dAC:meMA.Ode4C1T.text	
ltx/en_us_goadedes/me.m12.dAC:meMA.Ode4C21.greekmelody	@ltx/en_us_goadedes/he.h.m4:heHE.TousOuranousIAretiSou.greekname
ltx/en_us_goadedes/me.m12.dAC:meMA.Ode4C21.incipit	…
ltx/en_us_goadedes/me.m12.dAC:meMA.Ode4C21.melody	@ltx/en_us_goadedes/he.h.m4:heHE.TousOuranousIAretiSou.name
ltx/en_us_goadedes/me.m12.dAC:meMA.Ode4C21.mode	@ltx/en_us_goadedes/miscellanea:misc.Mode4
ltx/en_us_goadedes/me.m12.dAC:meMA.Ode4C21.ode	@ltx/en_us_goadedes/miscellanea:misc.Ode4
ltx/en_us_goadedes/me.m12.dAC:meMA.Ode4C21.text	
ltx/en_us_goadedes/me.m12.dAC:meMA.Ode4C22.incipit	…
ltx/en_us_goadedes/me.m12.dAC:meMA.Ode4C22.melody	@ltx/en_us_goadedes/he.h.m4:heHE.TousOuranousIAretiSou.name
ltx/en_us_goadedes/me.m12.dAC:meMA.Ode4C22.mode	@ltx/en_us_goadedes/miscellanea:misc.Mode4
ltx/en_us_goadedes/me.m12.dAC:meMA.Ode4C22.ode	@ltx/en_us_goadedes/miscellanea:misc.Ode4
ltx/en_us_goadedes/me.m12.dAC:meMA.Ode4C22.text	
ltx/en_us_goadedes/me.m12.dAC:meMA.Ode4C23.incipit	…
ltx/en_us_goadedes/me.m12.dAC:meMA.Ode4C23.melody	@ltx/en_us_goadedes/he.h.m4:heHE.TousOuranousIAretiSou.name
ltx/en_us_goadedes/me.m12.dAC:meMA.Ode4C23.mode	@ltx/en_us_goadedes/miscellanea:misc.Mode4
ltx/en_us_goadedes/me.m12.dAC:meMA.Ode4C23.ode	@ltx/en_us_goadedes/miscellanea:misc.Ode4
ltx/en_us_goadedes/me.m12.dAC:meMA.Ode4C23.text	
ltx/en_us_goadedes/me.m12.dAC:meMA.Ode4C24.incipit	…
ltx/en_us_goadedes/me.m12.dAC:meMA.Ode4C24.melody	@ltx/en_us_goadedes/he.h.m4:heHE.TousOuranousIAretiSou.name
ltx/en_us_goadedes/me.m12.dAC:meMA.Ode4C24.mode	@ltx/en_us_goadedes/miscellanea:misc.Mode4
ltx/en_us_goadedes/me.m12.dAC:meMA.Ode4C24.ode	@ltx/en_us_goadedes/miscellanea:misc.Ode4
ltx/en_us_goadedes/me.m12.dAC:meMA.Ode4C24.text	
ltx/en_us_goadedes/me.m12.dAC:meMA.Ode4C2T.incipit	…
ltx/en_us_goadedes/me.m12.dAC:meMA.Ode4C2T.melody	@ltx/en_us_goadedes/he.h.m4:heHE.TousOuranousIAretiSou.name
ltx/en_us_goadedes/me.m12.dAC:meMA.Ode4C2T.mode	@ltx/en_us_goadedes/miscellanea:misc.Mode4
ltx/en_us_goadedes/me.m12.dAC:meMA.Ode4C2T.ode	@ltx/en_us_goadedes/miscellanea:misc.Ode4
ltx/en_us_goadedes/me.m12.dAC:meMA.Ode4C2T.text	
ltx/en_us_goadedes/me.m12.dAC:meMA.Ode5C11.greekmelody	@ltx/en_us_goadedes/he.h.m1:heHE.TheosOnEirinis.greekname
ltx/en_us_goadedes/me.m12.dAC:meMA.Ode5C11.incipit	…
ltx/en_us_goadedes/me.m12.dAC:meMA.Ode5C11.melody	@ltx/en_us_goadedes/he.h.m1:heHE.TheosOnEirinis.name
ltx/en_us_goadedes/me.m12.dAC:meMA.Ode5C11.mode	@ltx/en_us_goadedes/miscellanea:misc.Mode1
ltx/en_us_goadedes/me.m12.dAC:meMA.Ode5C11.ode	@ltx/en_us_goadedes/miscellanea:misc.Ode5
ltx/en_us_goadedes/me.m12.dAC:meMA.Ode5C11.text	
ltx/en_us_goadedes/me.m12.dAC:meMA.Ode5C12.incipit	…
ltx/en_us_goadedes/me.m12.dAC:meMA.Ode5C12.melody	@ltx/en_us_goadedes/he.h.m1:heHE.TheosOnEirinis.name
ltx/en_us_goadedes/me.m12.dAC:meMA.Ode5C12.mode	@ltx/en_us_goadedes/miscellanea:misc.Mode1
ltx/en_us_goadedes/me.m12.dAC:meMA.Ode5C12.ode	@ltx/en_us_goadedes/miscellanea:misc.Ode5
ltx/en_us_goadedes/me.m12.dAC:meMA.Ode5C12.text	
ltx/en_us_goadedes/me.m12.dAC:meMA.Ode5C13.incipit	…
ltx/en_us_goadedes/me.m12.dAC:meMA.Ode5C13.melody	@ltx/en_us_goadedes/he.h.m1:heHE.TheosOnEirinis.name
ltx/en_us_goadedes/me.m12.dAC:meMA.Ode5C13.mode	@ltx/en_us_goadedes/miscellanea:misc.Mode1
ltx/en_us_goadedes/me.m12.dAC:meMA.Ode5C13.ode	@ltx/en_us_goadedes/miscellanea:misc.Ode5
ltx/en_us_goadedes/me.m12.dAC:meMA.Ode5C13.text	
ltx/en_us_goadedes/me.m12.dAC:meMA.Ode5C1T.incipit	…
ltx/en_us_goadedes/me.m12.dAC:meMA.Ode5C1T.melody	@ltx/en_us_goadedes/he.h.m1:heHE.TheosOnEirinis.name
ltx/en_us_goadedes/me.m12.dAC:meMA.Ode5C1T.mode	@ltx/en_us_goadedes/miscellanea:misc.Mode1
ltx/en_us_goadedes/me.m12.dAC:meMA.Ode5C1T.ode	@ltx/en_us_goadedes/miscellanea:misc.Ode5
ltx/en_us_goadedes/me.m12.dAC:meMA.Ode5C1T.text	
ltx/en_us_goadedes/me.m12.dAC:meMA.Ode5C21.greekmelody	@ltx/en_us_goadedes/he.h.m4:heHE.OAnateilasToFos.greekname
ltx/en_us_goadedes/me.m12.dAC:meMA.Ode5C21.incipit	…
ltx/en_us_goadedes/me.m12.dAC:meMA.Ode5C21.melody	@ltx/en_us_goadedes/he.h.m4:heHE.OAnateilasToFos.name
ltx/en_us_goadedes/me.m12.dAC:meMA.Ode5C21.mode	@ltx/en_us_goadedes/miscellanea:misc.Mode4
ltx/en_us_goadedes/me.m12.dAC:meMA.Ode5C21.ode	@ltx/en_us_goadedes/miscellanea:misc.Ode5
ltx/en_us_goadedes/me.m12.dAC:meMA.Ode5C21.text	
ltx/en_us_goadedes/me.m12.dAC:meMA.Ode5C22.incipit	…
ltx/en_us_goadedes/me.m12.dAC:meMA.Ode5C22.melody	@ltx/en_us_goadedes/he.h.m4:heHE.OAnateilasToFos.name
ltx/en_us_goadedes/me.m12.dAC:meMA.Ode5C22.mode	@ltx/en_us_goadedes/miscellanea:misc.Mode4
ltx/en_us_goadedes/me.m12.dAC:meMA.Ode5C22.ode	@ltx/en_us_goadedes/miscellanea:misc.Ode5
ltx/en_us_goadedes/me.m12.dAC:meMA.Ode5C22.text	
ltx/en_us_goadedes/me.m12.dAC:meMA.Ode5C23.incipit	…
ltx/en_us_goadedes/me.m12.dAC:meMA.Ode5C23.melody	@ltx/en_us_goadedes/he.h.m4:heHE.OAnateilasToFos.name
ltx/en_us_goadedes/me.m12.dAC:meMA.Ode5C23.mode	@ltx/en_us_goadedes/miscellanea:misc.Mode4
ltx/en_us_goadedes/me.m12.dAC:meMA.Ode5C23.ode	@ltx/en_us_goadedes/miscellanea:misc.Ode5
ltx/en_us_goadedes/me.m12.dAC:meMA.Ode5C23.text	
ltx/en_us_goadedes/me.m12.dAC:meMA.Ode5C24.incipit	…
ltx/en_us_goadedes/me.m12.dAC:meMA.Ode5C24.melody	@ltx/en_us_goadedes/he.h.m4:heHE.OAnateilasToFos.name
ltx/en_us_goadedes/me.m12.dAC:meMA.Ode5C24.mode	@ltx/en_us_goadedes/miscellanea:misc.Mode4
ltx/en_us_goadedes/me.m12.dAC:meMA.Ode5C24.ode	@ltx/en_us_goadedes/miscellanea:misc.Ode5
ltx/en_us_goadedes/me.m12.dAC:meMA.Ode5C24.text	
ltx/en_us_goadedes/me.m12.dAC:meMA.Ode5C25.incipit	…
ltx/en_us_goadedes/me.m12.dAC:meMA.Ode5C25.melody	@ltx/en_us_goadedes/he.h.m4:heHE.OAnateilasToFos.name
ltx/en_us_goadedes/me.m12.dAC:meMA.Ode5C25.mode	@ltx/en_us_goadedes/miscellanea:misc.Mode4
ltx/en_us_goadedes/me.m12.dAC:meMA.Ode5C25.ode	@ltx/en_us_goadedes/miscellanea:misc.Ode5
ltx/en_us_goadedes/me.m12.dAC:meMA.Ode5C25.text	
ltx/en_us_goadedes/me.m12.dAC:meMA.Ode5C2T.incipit	…
ltx/en_us_goadedes/me.m12.dAC:meMA.Ode5C2T.melody	@ltx/en_us_goadedes/he.h.m4:heHE.OAnateilasToFos.name
ltx/en_us_goadedes/me.m12.dAC:meMA.Ode5C2T.mode	@ltx/en_us_goadedes/miscellanea:misc.Mode4
ltx/en_us_goadedes/me.m12.dAC:meMA.Ode5C2T.ode	@ltx/en_us_goadedes/miscellanea:misc.Ode5
ltx/en_us_goadedes/me.m12.dAC:meMA.Ode5C2T.text	
ltx/en_us_goadedes/me.m12.dAC:meMA.Ode6C11.greekmelody	@ltx/en_us_goadedes/he.h.m1:heHE.SplanchnonIonan.greekname
ltx/en_us_goadedes/me.m12.dAC:meMA.Ode6C11.incipit	…
ltx/en_us_goadedes/me.m12.dAC:meMA.Ode6C11.melody	@ltx/en_us_goadedes/he.h.m1:heHE.SplanchnonIonan.name
ltx/en_us_goadedes/me.m12.dAC:meMA.Ode6C11.mode	@ltx/en_us_goadedes/miscellanea:misc.Mode1
ltx/en_us_goadedes/me.m12.dAC:meMA.Ode6C11.ode	@ltx/en_us_goadedes/miscellanea:misc.Ode6
ltx/en_us_goadedes/me.m12.dAC:meMA.Ode6C11.text	
ltx/en_us_goadedes/me.m12.dAC:meMA.Ode6C12.incipit	…
ltx/en_us_goadedes/me.m12.dAC:meMA.Ode6C12.melody	@ltx/en_us_goadedes/he.h.m1:heHE.SplanchnonIonan.name
ltx/en_us_goadedes/me.m12.dAC:meMA.Ode6C12.mode	@ltx/en_us_goadedes/miscellanea:misc.Mode1
ltx/en_us_goadedes/me.m12.dAC:meMA.Ode6C12.ode	@ltx/en_us_goadedes/miscellanea:misc.Ode6
ltx/en_us_goadedes/me.m12.dAC:meMA.Ode6C12.text	
ltx/en_us_goadedes/me.m12.dAC:meMA.Ode6C13.incipit	…
ltx/en_us_goadedes/me.m12.dAC:meMA.Ode6C13.melody	@ltx/en_us_goadedes/he.h.m1:heHE.SplanchnonIonan.name
ltx/en_us_goadedes/me.m12.dAC:meMA.Ode6C13.mode	@ltx/en_us_goadedes/miscellanea:misc.Mode1
ltx/en_us_goadedes/me.m12.dAC:meMA.Ode6C13.ode	@ltx/en_us_goadedes/miscellanea:misc.Ode6
ltx/en_us_goadedes/me.m12.dAC:meMA.Ode6C13.text	
ltx/en_us_goadedes/me.m12.dAC:meMA.Ode6C1T.incipit	…
ltx/en_us_goadedes/me.m12.dAC:meMA.Ode6C1T.melody	@ltx/en_us_goadedes/he.h.m1:heHE.SplanchnonIonan.name
ltx/en_us_goadedes/me.m12.dAC:meMA.Ode6C1T.mode	@ltx/en_us_goadedes/miscellanea:misc.Mode1
ltx/en_us_goadedes/me.m12.dAC:meMA.Ode6C1T.ode	@ltx/en_us_goadedes/miscellanea:misc.Ode6
ltx/en_us_goadedes/me.m12.dAC:meMA.Ode6C1T.text	
ltx/en_us_goadedes/me.m12.dAC:meMA.Ode6C21.greekmelody	@ltx/en_us_goadedes/he.h.m4:heHE.EvoiseProtypon.greekname
ltx/en_us_goadedes/me.m12.dAC:meMA.Ode6C21.incipit	…
ltx/en_us_goadedes/me.m12.dAC:meMA.Ode6C21.melody	@ltx/en_us_goadedes/he.h.m4:heHE.EvoiseProtypon.name
ltx/en_us_goadedes/me.m12.dAC:meMA.Ode6C21.mode	@ltx/en_us_goadedes/miscellanea:misc.Mode4
ltx/en_us_goadedes/me.m12.dAC:meMA.Ode6C21.ode	@ltx/en_us_goadedes/miscellanea:misc.Ode6
ltx/en_us_goadedes/me.m12.dAC:meMA.Ode6C21.text	
ltx/en_us_goadedes/me.m12.dAC:meMA.Ode6C22.incipit	…
ltx/en_us_goadedes/me.m12.dAC:meMA.Ode6C22.melody	@ltx/en_us_goadedes/he.h.m4:heHE.EvoiseProtypon.name
ltx/en_us_goadedes/me.m12.dAC:meMA.Ode6C22.mode	@ltx/en_us_goadedes/miscellanea:misc.Mode4
ltx/en_us_goadedes/me.m12.dAC:meMA.Ode6C22.ode	@ltx/en_us_goadedes/miscellanea:misc.Ode6
ltx/en_us_goadedes/me.m12.dAC:meMA.Ode6C22.text	
ltx/en_us_goadedes/me.m12.dAC:meMA.Ode6C23.incipit	…
ltx/en_us_goadedes/me.m12.dAC:meMA.Ode6C23.melody	@ltx/en_us_goadedes/he.h.m4:heHE.EvoiseProtypon.name
ltx/en_us_goadedes/me.m12.dAC:meMA.Ode6C23.mode	@ltx/en_us_goadedes/miscellanea:misc.Mode4
ltx/en_us_goadedes/me.m12.dAC:meMA.Ode6C23.ode	@ltx/en_us_goadedes/miscellanea:misc.Ode6
ltx/en_us_goadedes/me.m12.dAC:meMA.Ode6C23.text	
ltx/en_us_goadedes/me.m12.dAC:meMA.Ode6C24.incipit	…
ltx/en_us_goadedes/me.m12.dAC:meMA.Ode6C24.melody	@ltx/en_us_goadedes/he.h.m4:heHE.EvoiseProtypon.name
ltx/en_us_goadedes/me.m12.dAC:meMA.Ode6C24.mode	@ltx/en_us_goadedes/miscellanea:misc.Mode4
ltx/en_us_goadedes/me.m12.dAC:meMA.Ode6C24.ode	@ltx/en_us_goadedes/miscellanea:misc.Ode6
ltx/en_us_goadedes/me.m12.dAC:meMA.Ode6C24.text	
ltx/en_us_goadedes/me.m12.dAC:meMA.Ode6C25.incipit	…
ltx/en_us_goadedes/me.m12.dAC:meMA.Ode6C25.melody	@ltx/en_us_goadedes/he.h.m4:heHE.EvoiseProtypon.name
ltx/en_us_goadedes/me.m12.dAC:meMA.Ode6C25.mode	@ltx/en_us_goadedes/miscellanea:misc.Mode4
ltx/en_us_goadedes/me.m12.dAC:meMA.Ode6C25.ode	@ltx/en_us_goadedes/miscellanea:misc.Ode6
ltx/en_us_goadedes/me.m12.dAC:meMA.Ode6C25.text	
ltx/en_us_goadedes/me.m12.dAC:meMA.Ode6C2T.incipit	…
ltx/en_us_goadedes/me.m12.dAC:meMA.Ode6C2T.melody	@ltx/en_us_goadedes/he.h.m4:heHE.EvoiseProtypon.name
ltx/en_us_goadedes/me.m12.dAC:meMA.Ode6C2T.mode	@ltx/en_us_goadedes/miscellanea:misc.Mode4
ltx/en_us_goadedes/me.m12.dAC:meMA.Ode6C2T.ode	@ltx/en_us_goadedes/miscellanea:misc.Ode6
ltx/en_us_goadedes/me.m12.dAC:meMA.Ode6C2T.text	
ltx/en_us_goadedes/me.m12.dAC:meMA.Ode7C11.greekmelody	@ltx/en_us_goadedes/he.h.m1:heHE.OiPaidesEfseveia.greekname
ltx/en_us_goadedes/me.m12.dAC:meMA.Ode7C11.incipit	…
ltx/en_us_goadedes/me.m12.dAC:meMA.Ode7C11.melody	@ltx/en_us_goadedes/he.h.m1:heHE.OiPaidesEfseveia.name
ltx/en_us_goadedes/me.m12.dAC:meMA.Ode7C11.mode	@ltx/en_us_goadedes/miscellanea:misc.Mode1
ltx/en_us_goadedes/me.m12.dAC:meMA.Ode7C11.ode	@ltx/en_us_goadedes/miscellanea:misc.Ode7
ltx/en_us_goadedes/me.m12.dAC:meMA.Ode7C11.text	
ltx/en_us_goadedes/me.m12.dAC:meMA.Ode7C12.incipit	…
ltx/en_us_goadedes/me.m12.dAC:meMA.Ode7C12.melody	@ltx/en_us_goadedes/he.h.m1:heHE.OiPaidesEfseveia.name
ltx/en_us_goadedes/me.m12.dAC:meMA.Ode7C12.mode	@ltx/en_us_goadedes/miscellanea:misc.Mode1
ltx/en_us_goadedes/me.m12.dAC:meMA.Ode7C12.ode	@ltx/en_us_goadedes/miscellanea:misc.Ode7
ltx/en_us_goadedes/me.m12.dAC:meMA.Ode7C12.text	
ltx/en_us_goadedes/me.m12.dAC:meMA.Ode7C13.incipit	…
ltx/en_us_goadedes/me.m12.dAC:meMA.Ode7C13.melody	@ltx/en_us_goadedes/he.h.m1:heHE.OiPaidesEfseveia.name
ltx/en_us_goadedes/me.m12.dAC:meMA.Ode7C13.mode	@ltx/en_us_goadedes/miscellanea:misc.Mode1
ltx/en_us_goadedes/me.m12.dAC:meMA.Ode7C13.ode	@ltx/en_us_goadedes/miscellanea:misc.Ode7
ltx/en_us_goadedes/me.m12.dAC:meMA.Ode7C13.text	
ltx/en_us_goadedes/me.m12.dAC:meMA.Ode7C14.incipit	…
ltx/en_us_goadedes/me.m12.dAC:meMA.Ode7C14.melody	@ltx/en_us_goadedes/he.h.m1:heHE.OiPaidesEfseveia.name
ltx/en_us_goadedes/me.m12.dAC:meMA.Ode7C14.mode	@ltx/en_us_goadedes/miscellanea:misc.Mode1
ltx/en_us_goadedes/me.m12.dAC:meMA.Ode7C14.ode	@ltx/en_us_goadedes/miscellanea:misc.Ode7
ltx/en_us_goadedes/me.m12.dAC:meMA.Ode7C14.text	
ltx/en_us_goadedes/me.m12.dAC:meMA.Ode7C1T.incipit	…
ltx/en_us_goadedes/me.m12.dAC:meMA.Ode7C1T.melody	@ltx/en_us_goadedes/he.h.m1:heHE.OiPaidesEfseveia.name
ltx/en_us_goadedes/me.m12.dAC:meMA.Ode7C1T.mode	@ltx/en_us_goadedes/miscellanea:misc.Mode1
ltx/en_us_goadedes/me.m12.dAC:meMA.Ode7C1T.ode	@ltx/en_us_goadedes/miscellanea:misc.Ode7
ltx/en_us_goadedes/me.m12.dAC:meMA.Ode7C1T.text	
ltx/en_us_goadedes/me.m12.dAC:meMA.Ode7C21.greekmelody	@ltx/en_us_goadedes/he.h.m4:heHE.AvramiaioiPote.greekname
ltx/en_us_goadedes/me.m12.dAC:meMA.Ode7C21.incipit	…
ltx/en_us_goadedes/me.m12.dAC:meMA.Ode7C21.melody	@ltx/en_us_goadedes/he.h.m4:heHE.AvramiaioiPote.name
ltx/en_us_goadedes/me.m12.dAC:meMA.Ode7C21.mode	@ltx/en_us_goadedes/miscellanea:misc.Mode4
ltx/en_us_goadedes/me.m12.dAC:meMA.Ode7C21.ode	@ltx/en_us_goadedes/miscellanea:misc.Ode7
ltx/en_us_goadedes/me.m12.dAC:meMA.Ode7C21.text	
ltx/en_us_goadedes/me.m12.dAC:meMA.Ode7C22.incipit	…
ltx/en_us_goadedes/me.m12.dAC:meMA.Ode7C22.melody	@ltx/en_us_goadedes/he.h.m4:heHE.AvramiaioiPote.name
ltx/en_us_goadedes/me.m12.dAC:meMA.Ode7C22.mode	@ltx/en_us_goadedes/miscellanea:misc.Mode4
ltx/en_us_goadedes/me.m12.dAC:meMA.Ode7C22.ode	@ltx/en_us_goadedes/miscellanea:misc.Ode7
ltx/en_us_goadedes/me.m12.dAC:meMA.Ode7C22.text	
ltx/en_us_goadedes/me.m12.dAC:meMA.Ode7C23.incipit	…
ltx/en_us_goadedes/me.m12.dAC:meMA.Ode7C23.melody	@ltx/en_us_goadedes/he.h.m4:heHE.AvramiaioiPote.name
ltx/en_us_goadedes/me.m12.dAC:meMA.Ode7C23.mode	@ltx/en_us_goadedes/miscellanea:misc.Mode4
ltx/en_us_goadedes/me.m12.dAC:meMA.Ode7C23.ode	@ltx/en_us_goadedes/miscellanea:misc.Ode7
ltx/en_us_goadedes/me.m12.dAC:meMA.Ode7C23.text	
ltx/en_us_goadedes/me.m12.dAC:meMA.Ode7C24.incipit	…
ltx/en_us_goadedes/me.m12.dAC:meMA.Ode7C24.melody	@ltx/en_us_goadedes/he.h.m4:heHE.AvramiaioiPote.name
ltx/en_us_goadedes/me.m12.dAC:meMA.Ode7C24.mode	@ltx/en_us_goadedes/miscellanea:misc.Mode4
ltx/en_us_goadedes/me.m12.dAC:meMA.Ode7C24.ode	@ltx/en_us_goadedes/miscellanea:misc.Ode7
ltx/en_us_goadedes/me.m12.dAC:meMA.Ode7C24.text	
ltx/en_us_goadedes/me.m12.dAC:meMA.Ode7C25.incipit	…
ltx/en_us_goadedes/me.m12.dAC:meMA.Ode7C25.melody	@ltx/en_us_goadedes/he.h.m4:heHE.AvramiaioiPote.name
ltx/en_us_goadedes/me.m12.dAC:meMA.Ode7C25.mode	@ltx/en_us_goadedes/miscellanea:misc.Mode4
ltx/en_us_goadedes/me.m12.dAC:meMA.Ode7C25.ode	@ltx/en_us_goadedes/miscellanea:misc.Ode7
ltx/en_us_goadedes/me.m12.dAC:meMA.Ode7C25.text	
ltx/en_us_goadedes/me.m12.dAC:meMA.Ode7C2T.incipit	…
ltx/en_us_goadedes/me.m12.dAC:meMA.Ode7C2T.melody	@ltx/en_us_goadedes/he.h.m4:heHE.AvramiaioiPote.name
ltx/en_us_goadedes/me.m12.dAC:meMA.Ode7C2T.mode	@ltx/en_us_goadedes/miscellanea:misc.Mode4
ltx/en_us_goadedes/me.m12.dAC:meMA.Ode7C2T.ode	@ltx/en_us_goadedes/miscellanea:misc.Ode7
ltx/en_us_goadedes/me.m12.dAC:meMA.Ode7C2T.text	
ltx/en_us_goadedes/me.m12.dAC:meMA.Ode8C11.greekmelody	@ltx/en_us_goadedes/he.h.m1:heHE.ThavmatosYperfyous.greekname
ltx/en_us_goadedes/me.m12.dAC:meMA.Ode8C11.incipit	…
ltx/en_us_goadedes/me.m12.dAC:meMA.Ode8C11.melody	@ltx/en_us_goadedes/he.h.m1:heHE.ThavmatosYperfyous.name
ltx/en_us_goadedes/me.m12.dAC:meMA.Ode8C11.mode	@ltx/en_us_goadedes/miscellanea:misc.Mode1
ltx/en_us_goadedes/me.m12.dAC:meMA.Ode8C11.ode	@ltx/en_us_goadedes/miscellanea:misc.Ode8
ltx/en_us_goadedes/me.m12.dAC:meMA.Ode8C11.text	
ltx/en_us_goadedes/me.m12.dAC:meMA.Ode8C12.incipit	…
ltx/en_us_goadedes/me.m12.dAC:meMA.Ode8C12.melody	@ltx/en_us_goadedes/he.h.m1:heHE.ThavmatosYperfyous.name
ltx/en_us_goadedes/me.m12.dAC:meMA.Ode8C12.mode	@ltx/en_us_goadedes/miscellanea:misc.Mode1
ltx/en_us_goadedes/me.m12.dAC:meMA.Ode8C12.ode	@ltx/en_us_goadedes/miscellanea:misc.Ode8
ltx/en_us_goadedes/me.m12.dAC:meMA.Ode8C12.text	
ltx/en_us_goadedes/me.m12.dAC:meMA.Ode8C13.incipit	…
ltx/en_us_goadedes/me.m12.dAC:meMA.Ode8C13.melody	@ltx/en_us_goadedes/he.h.m1:heHE.ThavmatosYperfyous.name
ltx/en_us_goadedes/me.m12.dAC:meMA.Ode8C13.mode	@ltx/en_us_goadedes/miscellanea:misc.Mode1
ltx/en_us_goadedes/me.m12.dAC:meMA.Ode8C13.ode	@ltx/en_us_goadedes/miscellanea:misc.Ode8
ltx/en_us_goadedes/me.m12.dAC:meMA.Ode8C13.text	
ltx/en_us_goadedes/me.m12.dAC:meMA.Ode8C1T.incipit	…
ltx/en_us_goadedes/me.m12.dAC:meMA.Ode8C1T.melody	@ltx/en_us_goadedes/he.h.m1:heHE.ThavmatosYperfyous.name
ltx/en_us_goadedes/me.m12.dAC:meMA.Ode8C1T.mode	@ltx/en_us_goadedes/miscellanea:misc.Mode1
ltx/en_us_goadedes/me.m12.dAC:meMA.Ode8C1T.ode	@ltx/en_us_goadedes/miscellanea:misc.Ode8
ltx/en_us_goadedes/me.m12.dAC:meMA.Ode8C1T.text	
ltx/en_us_goadedes/me.m12.dAC:meMA.Ode8C21.greekmelody	@ltx/en_us_goadedes/he.h.m4:heHE.TonVasileaChriston.greekname
ltx/en_us_goadedes/me.m12.dAC:meMA.Ode8C21.incipit	…
ltx/en_us_goadedes/me.m12.dAC:meMA.Ode8C21.melody	@ltx/en_us_goadedes/he.h.m4:heHE.TonVasileaChriston.name
ltx/en_us_goadedes/me.m12.dAC:meMA.Ode8C21.mode	@ltx/en_us_goadedes/miscellanea:misc.Mode4
ltx/en_us_goadedes/me.m12.dAC:meMA.Ode8C21.ode	@ltx/en_us_goadedes/miscellanea:misc.Ode8
ltx/en_us_goadedes/me.m12.dAC:meMA.Ode8C21.text	
ltx/en_us_goadedes/me.m12.dAC:meMA.Ode8C22.incipit	…
ltx/en_us_goadedes/me.m12.dAC:meMA.Ode8C22.melody	@ltx/en_us_goadedes/he.h.m4:heHE.TonVasileaChriston.name
ltx/en_us_goadedes/me.m12.dAC:meMA.Ode8C22.mode	@ltx/en_us_goadedes/miscellanea:misc.Mode4
ltx/en_us_goadedes/me.m12.dAC:meMA.Ode8C22.ode	@ltx/en_us_goadedes/miscellanea:misc.Ode8
ltx/en_us_goadedes/me.m12.dAC:meMA.Ode8C22.text	
ltx/en_us_goadedes/me.m12.dAC:meMA.Ode8C23.incipit	…
ltx/en_us_goadedes/me.m12.dAC:meMA.Ode8C23.melody	@ltx/en_us_goadedes/he.h.m4:heHE.TonVasileaChriston.name
ltx/en_us_goadedes/me.m12.dAC:meMA.Ode8C23.mode	@ltx/en_us_goadedes/miscellanea:misc.Mode4
ltx/en_us_goadedes/me.m12.dAC:meMA.Ode8C23.ode	@ltx/en_us_goadedes/miscellanea:misc.Ode8
ltx/en_us_goadedes/me.m12.dAC:meMA.Ode8C23.text	
ltx/en_us_goadedes/me.m12.dAC:meMA.Ode8C24.incipit	…
ltx/en_us_goadedes/me.m12.dAC:meMA.Ode8C24.melody	@ltx/en_us_goadedes/he.h.m4:heHE.TonVasileaChriston.name
ltx/en_us_goadedes/me.m12.dAC:meMA.Ode8C24.mode	@ltx/en_us_goadedes/miscellanea:misc.Mode4
ltx/en_us_goadedes/me.m12.dAC:meMA.Ode8C24.ode	@ltx/en_us_goadedes/miscellanea:misc.Ode8
ltx/en_us_goadedes/me.m12.dAC:meMA.Ode8C24.text	
ltx/en_us_goadedes/me.m12.dAC:meMA.Ode8C2T.incipit	…
ltx/en_us_goadedes/me.m12.dAC:meMA.Ode8C2T.melody	@ltx/en_us_goadedes/he.h.m4:heHE.TonVasileaChriston.name
ltx/en_us_goadedes/me.m12.dAC:meMA.Ode8C2T.mode	@ltx/en_us_goadedes/miscellanea:misc.Mode4
ltx/en_us_goadedes/me.m12.dAC:meMA.Ode8C2T.ode	@ltx/en_us_goadedes/miscellanea:misc.Ode8
ltx/en_us_goadedes/me.m12.dAC:meMA.Ode8C2T.text	
ltx/en_us_goadedes/me.m12.dAC:meMA.Ode9C11.greekmelody	@ltx/en_us_goadedes/he.h.m1:heHE.MystirionXenon.greekname
ltx/en_us_goadedes/me.m12.dAC:meMA.Ode9C11.incipit	…
ltx/en_us_goadedes/me.m12.dAC:meMA.Ode9C11.melody	@ltx/en_us_goadedes/he.h.m1:heHE.MystirionXenon.name
ltx/en_us_goadedes/me.m12.dAC:meMA.Ode9C11.mode	@ltx/en_us_goadedes/miscellanea:misc.Mode1
ltx/en_us_goadedes/me.m12.dAC:meMA.Ode9C11.ode	@ltx/en_us_goadedes/miscellanea:misc.Ode9
ltx/en_us_goadedes/me.m12.dAC:meMA.Ode9C11.text	
ltx/en_us_goadedes/me.m12.dAC:meMA.Ode9C12.incipit	…
ltx/en_us_goadedes/me.m12.dAC:meMA.Ode9C12.melody	@ltx/en_us_goadedes/he.h.m1:heHE.MystirionXenon.name
ltx/en_us_goadedes/me.m12.dAC:meMA.Ode9C12.mode	@ltx/en_us_goadedes/miscellanea:misc.Mode1
ltx/en_us_goadedes/me.m12.dAC:meMA.Ode9C12.ode	@ltx/en_us_goadedes/miscellanea:misc.Ode9
ltx/en_us_goadedes/me.m12.dAC:meMA.Ode9C12.text	
ltx/en_us_goadedes/me.m12.dAC:meMA.Ode9C13.incipit	…
ltx/en_us_goadedes/me.m12.dAC:meMA.Ode9C13.melody	@ltx/en_us_goadedes/he.h.m1:heHE.MystirionXenon.name
ltx/en_us_goadedes/me.m12.dAC:meMA.Ode9C13.mode	@ltx/en_us_goadedes/miscellanea:misc.Mode1
ltx/en_us_goadedes/me.m12.dAC:meMA.Ode9C13.ode	@ltx/en_us_goadedes/miscellanea:misc.Ode9
ltx/en_us_goadedes/me.m12.dAC:meMA.Ode9C13.text	
ltx/en_us_goadedes/me.m12.dAC:meMA.Ode9C14.incipit	…
ltx/en_us_goadedes/me.m12.dAC:meMA.Ode9C14.melody	@ltx/en_us_goadedes/he.h.m1:heHE.MystirionXenon.name
ltx/en_us_goadedes/me.m12.dAC:meMA.Ode9C14.mode	@ltx/en_us_goadedes/miscellanea:misc.Mode1
ltx/en_us_goadedes/me.m12.dAC:meMA.Ode9C14.ode	@ltx/en_us_goadedes/miscellanea:misc.Ode9
ltx/en_us_goadedes/me.m12.dAC:meMA.Ode9C14.text	
ltx/en_us_goadedes/me.m12.dAC:meMA.Ode9C1T.incipit	…
ltx/en_us_goadedes/me.m12.dAC:meMA.Ode9C1T.melody	@ltx/en_us_goadedes/he.h.m1:heHE.MystirionXenon.name
ltx/en_us_goadedes/me.m12.dAC:meMA.Ode9C1T.mode	@ltx/en_us_goadedes/miscellanea:misc.Mode1
ltx/en_us_goadedes/me.m12.dAC:meMA.Ode9C1T.ode	@ltx/en_us_goadedes/miscellanea:misc.Ode9
ltx/en_us_goadedes/me.m12.dAC:meMA.Ode9C1T.text	
ltx/en_us_goadedes/me.m12.dAC:meMA.Ode9C21.greekmelody	@ltx/en_us_goadedes/he.h.m4:heHE.MoysisEnToOrei.greekname
ltx/en_us_goadedes/me.m12.dAC:meMA.Ode9C21.incipit	…
ltx/en_us_goadedes/me.m12.dAC:meMA.Ode9C21.melody	@ltx/en_us_goadedes/he.h.m4:heHE.MoysisEnToOrei.name
ltx/en_us_goadedes/me.m12.dAC:meMA.Ode9C21.mode	@ltx/en_us_goadedes/miscellanea:misc.Mode4
ltx/en_us_goadedes/me.m12.dAC:meMA.Ode9C21.ode	@ltx/en_us_goadedes/miscellanea:misc.Ode9
ltx/en_us_goadedes/me.m12.dAC:meMA.Ode9C21.text	
ltx/en_us_goadedes/me.m12.dAC:meMA.Ode9C22.incipit	…
ltx/en_us_goadedes/me.m12.dAC:meMA.Ode9C22.melody	@ltx/en_us_goadedes/he.h.m4:heHE.MoysisEnToOrei.name
ltx/en_us_goadedes/me.m12.dAC:meMA.Ode9C22.mode	@ltx/en_us_goadedes/miscellanea:misc.Mode4
ltx/en_us_goadedes/me.m12.dAC:meMA.Ode9C22.ode	@ltx/en_us_goadedes/miscellanea:misc.Ode9
ltx/en_us_goadedes/me.m12.dAC:meMA.Ode9C22.text	
ltx/en_us_goadedes/me.m12.dAC:meMA.Ode9C23.incipit	…
ltx/en_us_goadedes/me.m12.dAC:meMA.Ode9C23.melody	@ltx/en_us_goadedes/he.h.m4:heHE.MoysisEnToOrei.name
ltx/en_us_goadedes/me.m12.dAC:meMA.Ode9C23.mode	@ltx/en_us_goadedes/miscellanea:misc.Mode4
ltx/en_us_goadedes/me.m12.dAC:meMA.Ode9C23.ode	@ltx/en_us_goadedes/miscellanea:misc.Ode9
ltx/en_us_goadedes/me.m12.dAC:meMA.Ode9C23.text	
ltx/en_us_goadedes/me.m12.dAC:meMA.Ode9C24.incipit	…
ltx/en_us_goadedes/me.m12.dAC:meMA.Ode9C24.melody	@ltx/en_us_goadedes/he.h.m4:heHE.MoysisEnToOrei.name
ltx/en_us_goadedes/me.m12.dAC:meMA.Ode9C24.mode	@ltx/en_us_goadedes/miscellanea:misc.Mode4
ltx/en_us_goadedes/me.m12.dAC:meMA.Ode9C24.ode	@ltx/en_us_goadedes/miscellanea:misc.Ode9
ltx/en_us_goadedes/me.m12.dAC:meMA.Ode9C24.text	
ltx/en_us_goadedes/me.m12.dAC:meMA.Ode9C25.incipit	…
ltx/en_us_goadedes/me.m12.dAC:meMA.Ode9C25.melody	@ltx/en_us_goadedes/he.h.m4:heHE.MoysisEnToOrei.name
ltx/en_us_goadedes/me.m12.dAC:meMA.Ode9C25.mode	@ltx/en_us_goadedes/miscellanea:misc.Mode4
ltx/en_us_goadedes/me.m12.dAC:meMA.Ode9C25.ode	@ltx/en_us_goadedes/miscellanea:misc.Ode9
ltx/en_us_goadedes/me.m12.dAC:meMA.Ode9C25.text	
ltx/en_us_goadedes/me.m12.dAC:meMA.Ode9C2T.incipit	…
ltx/en_us_goadedes/me.m12.dAC:meMA.Ode9C2T.melody	@ltx/en_us_goadedes/he.h.m4:heHE.MoysisEnToOrei.name
ltx/en_us_goadedes/me.m12.dAC:meMA.Ode9C2T.mode	@ltx/en_us_goadedes/miscellanea:misc.Mode4
ltx/en_us_goadedes/me.m12.dAC:meMA.Ode9C2T.ode	@ltx/en_us_goadedes/miscellanea:misc.Ode9
ltx/en_us_goadedes/me.m12.dAC:meMA.Ode9C2T.text	
ltx/en_us_goadedes/me.m12.dAC:meMA.Oikos1.text	
ltx/en_us_goadedes/me.m12.dAC:meVE.Apolytikion1.incipit	…
ltx/en_us_goadedes/me.m12.dAC:meVE.Apolytikion1.melody	
ltx/en_us_goadedes/me.m12.dAC:meVE.Apolytikion1.mode	@ltx/en_us_goadedes/miscellanea:misc.Mode2
ltx/en_us_goadedes/me.m12.dAC:meVE.Apolytikion1.text	
ltx/en_us_goadedes/me.m12.dAC:meVE.AposBoth.incipit	@ltx/en_us_goadedes/me.m12.d25:meVE.LityBoth.incipit
ltx/en_us_goadedes/me.m12.dAC:meVE.AposBoth.melody	
ltx/en_us_goadedes/me.m12.dAC:meVE.AposBoth.mode	@ltx/en_us_goadedes/miscellanea:misc.Mode6
ltx/en_us_goadedes/me.m12.dAC:meVE.AposBoth.text	@ltx/en_us_goadedes/me.m12.d25:meVE.LityBoth.text
ltx/en_us_goadedes/me.m12.dAC:meVE.AposGlory.incipit	…
ltx/en_us_goadedes/me.m12.dAC:meVE.AposGlory.melody	
ltx/en_us_goadedes/me.m12.dAC:meVE.AposGlory.mode	@ltx/en_us_goadedes/miscellanea:misc.Mode6
ltx/en_us_goadedes/me.m12.dAC:meVE.AposGlory.text	
ltx/en_us_goadedes/me.m12.dAC:meVE.MM.Stichera123as567.text	@ltx/en_us_goadedes/properties:media.key
ltx/en_us_goadedes/me.m12.dAC:meVE.MM.Stichera123as8910.text	@ltx/en_us_goadedes/properties:media.key
ltx/en_us_goadedes/me.m12.dAC:meVE.SticGlory.incipit	…
ltx/en_us_goadedes/me.m12.dAC:meVE.SticGlory.melody	
ltx/en_us_goadedes/me.m12.dAC:meVE.SticGlory.mode	@ltx/en_us_goadedes/miscellanea:misc.Mode6
ltx/en_us_goadedes/me.m12.dAC:meVE.SticGlory.text	
ltx/en_us_goadedes/me.m12.dAC:meVE.Stichera01.greekmelody	@ltx/en_us_goadedes/he.a.m1:heAU.TonOuranionTagmaton.greekname
ltx/en_us_goadedes/me.m12.dAC:meVE.Stichera01.incipit	…
ltx/en_us_goadedes/me.m12.dAC:meVE.Stichera01.melody	@ltx/en_us_goadedes/he.a.m1:heAU.TonOuranionTagmaton.name
ltx/en_us_goadedes/me.m12.dAC:meVE.Stichera01.mode	@ltx/en_us_goadedes/miscellanea:misc.Mode1
ltx/en_us_goadedes/me.m12.dAC:meVE.Stichera01.text	
ltx/en_us_goadedes/me.m12.dAC:meVE.Stichera02.incipit	…
ltx/en_us_goadedes/me.m12.dAC:meVE.Stichera02.melody	@ltx/en_us_goadedes/he.a.m1:heAU.TonOuranionTagmaton.name
ltx/en_us_goadedes/me.m12.dAC:meVE.Stichera02.mode	@ltx/en_us_goadedes/miscellanea:misc.Mode1
ltx/en_us_goadedes/me.m12.dAC:meVE.Stichera02.text	
ltx/en_us_goadedes/me.m12.dAC:meVE.Stichera03.incipit	…
ltx/en_us_goadedes/me.m12.dAC:meVE.Stichera03.melody	@ltx/en_us_goadedes/he.a.m1:heAU.TonOuranionTagmaton.name
ltx/en_us_goadedes/me.m12.dAC:meVE.Stichera03.mode	@ltx/en_us_goadedes/miscellanea:misc.Mode1
ltx/en_us_goadedes/me.m12.dAC:meVE.Stichera03.text	
