ltx/en_us_goadedes/me.m12.dFF:meDA.commemoration.first	
ltx/en_us_goadedes/me.m12.dFF:meDA.commemoration.first_name	
ltx/en_us_goadedes/me.m12.dFF:meDA.commemoration.first_short	
ltx/en_us_goadedes/me.m12.dFF:meDA.commemoration.first_title	@ltx/en_us_goadedes/titles:ti.Forefathers
ltx/en_us_goadedes/me.m12.dFF:meDA.commemoration.full	
ltx/en_us_goadedes/me.m12.dFF:meDA.commemoration.second_name	
ltx/en_us_goadedes/me.m12.dFF:meDA.commemoration.second_title	
ltx/en_us_goadedes/me.m12.dFF:meDA.date	
ltx/en_us_goadedes/me.m12.dFF:meDA.fordate	
ltx/en_us_goadedes/me.m12.dFF:meDA.insert1	
ltx/en_us_goadedes/me.m12.dFF:meDA.insert2	
ltx/en_us_goadedes/me.m12.dFF:meDA.note	
ltx/en_us_goadedes/me.m12.dFF:meDA.pdfcoverdate	
ltx/en_us_goadedes/me.m12.dFF:meDA.pdfheaderdate	
ltx/en_us_goadedes/me.m12.dFF:meHO.commemorations	
ltx/en_us_goadedes/me.m12.dFF:meHO.note1	
ltx/en_us_goadedes/me.m12.dFF:meHO.note2	
ltx/en_us_goadedes/me.m12.dFF:meHO.number	
ltx/en_us_goadedes/me.m12.dFF:meHO.rank	
ltx/en_us_goadedes/me.m12.dFF:meLE.commemoration1	
ltx/en_us_goadedes/me.m12.dFF:meLE.commemoration2	
ltx/en_us_goadedes/me.m12.dFF:meLI.Kontakion1.incipit	@ltx/en_us_goadedes/me.m12.dFF:meMA.Kontakion1.incipit
ltx/en_us_goadedes/me.m12.dFF:meLI.Kontakion1.melody	@ltx/en_us_goadedes/me.m12.dFF:meMA.Kontakion1.melody
ltx/en_us_goadedes/me.m12.dFF:meLI.Kontakion1.mode	@ltx/en_us_goadedes/me.m12.dFF:meMA.Kontakion1.mode
ltx/en_us_goadedes/me.m12.dFF:meLI.Kontakion1.text	@ltx/en_us_goadedes/me.m12.dFF:meMA.Kontakion1.text
ltx/en_us_goadedes/me.m12.dFF:meLI.Megalynarion.text	
ltx/en_us_goadedes/me.m12.dFF:meMA.C1.acrostic.notice1	
ltx/en_us_goadedes/me.m12.dFF:meMA.C1.acrostic.text	
ltx/en_us_goadedes/me.m12.dFF:meMA.C1.acrostic.title	
ltx/en_us_goadedes/me.m12.dFF:meMA.C1.poet	@ltx/en_us_goadedes/poets:po.Theofanous
ltx/en_us_goadedes/me.m12.dFF:meMA.C1.title	@ltx/en_us_goadedes/titles:ti.CanonSaints
ltx/en_us_goadedes/me.m12.dFF:meMA.C1.verse	@ltx/en_us_goadedes/prayers:pr.verse_SaintsM.text
ltx/en_us_goadedes/me.m12.dFF:meMA.C2.acrostic.notice1	
ltx/en_us_goadedes/me.m12.dFF:meMA.C2.acrostic.text	
ltx/en_us_goadedes/me.m12.dFF:meMA.C2.acrostic.title	
ltx/en_us_goadedes/me.m12.dFF:meMA.C2.title	@ltx/en_us_goadedes/titles:ti.CanonForefathers
ltx/en_us_goadedes/me.m12.dFF:meMA.C2.verse	@ltx/en_us_goadedes/prayers:pr.verse_SaintsM.text
ltx/en_us_goadedes/me.m12.dFF:meMA.ExapTheotokion.incipit	…
ltx/en_us_goadedes/me.m12.dFF:meMA.ExapTheotokion.melody	@ltx/en_us_goadedes/he.a.m2:heAU.GynaikesAkoutisthite.name
ltx/en_us_goadedes/me.m12.dFF:meMA.ExapTheotokion.mode	@ltx/en_us_goadedes/miscellanea:misc.Mode2
ltx/en_us_goadedes/me.m12.dFF:meMA.ExapTheotokion.text	
ltx/en_us_goadedes/me.m12.dFF:meMA.Exaposteilarion1.greekmelody	@ltx/en_us_goadedes/he.a.m2:heAU.GynaikesAkoutisthite.greekname
ltx/en_us_goadedes/me.m12.dFF:meMA.Exaposteilarion1.incipit	…
ltx/en_us_goadedes/me.m12.dFF:meMA.Exaposteilarion1.melody	@ltx/en_us_goadedes/he.a.m2:heAU.GynaikesAkoutisthite.name
ltx/en_us_goadedes/me.m12.dFF:meMA.Exaposteilarion1.mode	@ltx/en_us_goadedes/miscellanea:misc.Mode2
ltx/en_us_goadedes/me.m12.dFF:meMA.Exaposteilarion1.text	
ltx/en_us_goadedes/me.m12.dFF:meMA.Exaposteilarion2.greekmelody	@ltx/en_us_goadedes/he.a.m2:heAU.GynaikesAkoutisthite.greekname
ltx/en_us_goadedes/me.m12.dFF:meMA.Exaposteilarion2.incipit	…
ltx/en_us_goadedes/me.m12.dFF:meMA.Exaposteilarion2.melody	@ltx/en_us_goadedes/he.a.m2:heAU.GynaikesAkoutisthite.name
ltx/en_us_goadedes/me.m12.dFF:meMA.Exaposteilarion2.mode	@ltx/en_us_goadedes/miscellanea:misc.Mode2
ltx/en_us_goadedes/me.m12.dFF:meMA.Exaposteilarion2.text	
ltx/en_us_goadedes/me.m12.dFF:meMA.Hypakoe.incipit	…
ltx/en_us_goadedes/me.m12.dFF:meMA.Hypakoe.melody	
ltx/en_us_goadedes/me.m12.dFF:meMA.Hypakoe.mode	@ltx/en_us_goadedes/miscellanea:misc.Mode2
ltx/en_us_goadedes/me.m12.dFF:meMA.Hypakoe.text	
ltx/en_us_goadedes/me.m12.dFF:meMA.Kontakion1.incipit	…
ltx/en_us_goadedes/me.m12.dFF:meMA.Kontakion1.melody	@ltx/en_us_goadedes/miscellanea:misc.Automelon
ltx/en_us_goadedes/me.m12.dFF:meMA.Kontakion1.mode	@ltx/en_us_goadedes/miscellanea:misc.Mode2
ltx/en_us_goadedes/me.m12.dFF:meMA.Kontakion1.text	
ltx/en_us_goadedes/me.m12.dFF:meMA.Lauds1.greekmelody	@ltx/en_us_goadedes/he.a.m2:heAU.OikosTouEfratha.greekname
ltx/en_us_goadedes/me.m12.dFF:meMA.Lauds1.incipit	…
ltx/en_us_goadedes/me.m12.dFF:meMA.Lauds1.melody	@ltx/en_us_goadedes/he.a.m2:heAU.OikosTouEfratha.name
ltx/en_us_goadedes/me.m12.dFF:meMA.Lauds1.mode	@ltx/en_us_goadedes/miscellanea:misc.Mode2
ltx/en_us_goadedes/me.m12.dFF:meMA.Lauds1.text	
ltx/en_us_goadedes/me.m12.dFF:meMA.Lauds2.incipit	…
ltx/en_us_goadedes/me.m12.dFF:meMA.Lauds2.melody	@ltx/en_us_goadedes/he.a.m2:heAU.OikosTouEfratha.name
ltx/en_us_goadedes/me.m12.dFF:meMA.Lauds2.mode	@ltx/en_us_goadedes/miscellanea:misc.Mode2
ltx/en_us_goadedes/me.m12.dFF:meMA.Lauds2.text	
ltx/en_us_goadedes/me.m12.dFF:meMA.Lauds3.incipit	…
ltx/en_us_goadedes/me.m12.dFF:meMA.Lauds3.melody	@ltx/en_us_goadedes/he.a.m2:heAU.OikosTouEfratha.name
ltx/en_us_goadedes/me.m12.dFF:meMA.Lauds3.mode	@ltx/en_us_goadedes/miscellanea:misc.Mode2
ltx/en_us_goadedes/me.m12.dFF:meMA.Lauds3.text	
ltx/en_us_goadedes/me.m12.dFF:meMA.LaudsGlory.incipit	…
ltx/en_us_goadedes/me.m12.dFF:meMA.LaudsGlory.melody	
ltx/en_us_goadedes/me.m12.dFF:meMA.LaudsGlory.mode	@ltx/en_us_goadedes/miscellanea:misc.Mode7
ltx/en_us_goadedes/me.m12.dFF:meMA.LaudsGlory.poet	@ltx/en_us_goadedes/poets:po.Germanou
ltx/en_us_goadedes/me.m12.dFF:meMA.LaudsGlory.text	
ltx/en_us_goadedes/me.m12.dFF:meMA.MM.Lauds1123as5678.text	@ltx/en_us_goadedes/properties:media.key
ltx/en_us_goadedes/me.m12.dFF:meMA.MM.Lauds123as345.text	@ltx/en_us_goadedes/properties:media.key
ltx/en_us_goadedes/me.m12.dFF:meMA.Ode1C11.greekmelody	@ltx/en_us_goadedes/he.h.m8:heHE.YgranDiodefsas.greekname
ltx/en_us_goadedes/me.m12.dFF:meMA.Ode1C11.incipit	…
ltx/en_us_goadedes/me.m12.dFF:meMA.Ode1C11.melody	@ltx/en_us_goadedes/he.h.m8:heHE.YgranDiodefsas.name
ltx/en_us_goadedes/me.m12.dFF:meMA.Ode1C11.mode	@ltx/en_us_goadedes/miscellanea:misc.Mode8
ltx/en_us_goadedes/me.m12.dFF:meMA.Ode1C11.ode	@ltx/en_us_goadedes/miscellanea:misc.Ode1
ltx/en_us_goadedes/me.m12.dFF:meMA.Ode1C11.text	
ltx/en_us_goadedes/me.m12.dFF:meMA.Ode1C12.incipit	…
ltx/en_us_goadedes/me.m12.dFF:meMA.Ode1C12.melody	@ltx/en_us_goadedes/he.h.m8:heHE.YgranDiodefsas.name
ltx/en_us_goadedes/me.m12.dFF:meMA.Ode1C12.mode	@ltx/en_us_goadedes/miscellanea:misc.Mode8
ltx/en_us_goadedes/me.m12.dFF:meMA.Ode1C12.ode	@ltx/en_us_goadedes/miscellanea:misc.Ode1
ltx/en_us_goadedes/me.m12.dFF:meMA.Ode1C12.text	
ltx/en_us_goadedes/me.m12.dFF:meMA.Ode1C13.incipit	…
ltx/en_us_goadedes/me.m12.dFF:meMA.Ode1C13.melody	@ltx/en_us_goadedes/he.h.m8:heHE.YgranDiodefsas.name
ltx/en_us_goadedes/me.m12.dFF:meMA.Ode1C13.mode	@ltx/en_us_goadedes/miscellanea:misc.Mode8
ltx/en_us_goadedes/me.m12.dFF:meMA.Ode1C13.ode	@ltx/en_us_goadedes/miscellanea:misc.Ode1
ltx/en_us_goadedes/me.m12.dFF:meMA.Ode1C13.text	
ltx/en_us_goadedes/me.m12.dFF:meMA.Ode1C1T.incipit	…
ltx/en_us_goadedes/me.m12.dFF:meMA.Ode1C1T.melody	@ltx/en_us_goadedes/he.h.m8:heHE.YgranDiodefsas.name
ltx/en_us_goadedes/me.m12.dFF:meMA.Ode1C1T.mode	@ltx/en_us_goadedes/miscellanea:misc.Mode8
ltx/en_us_goadedes/me.m12.dFF:meMA.Ode1C1T.ode	@ltx/en_us_goadedes/miscellanea:misc.Ode1
ltx/en_us_goadedes/me.m12.dFF:meMA.Ode1C1T.text	
ltx/en_us_goadedes/me.m12.dFF:meMA.Ode1C21.greekmelody	@ltx/en_us_goadedes/he.h.m1:heHE.ChristosGennatai.greekname
ltx/en_us_goadedes/me.m12.dFF:meMA.Ode1C21.incipit	…
ltx/en_us_goadedes/me.m12.dFF:meMA.Ode1C21.melody	@ltx/en_us_goadedes/he.h.m1:heHE.ChristosGennatai.name
ltx/en_us_goadedes/me.m12.dFF:meMA.Ode1C21.mode	@ltx/en_us_goadedes/miscellanea:misc.Mode1
ltx/en_us_goadedes/me.m12.dFF:meMA.Ode1C21.ode	@ltx/en_us_goadedes/miscellanea:misc.Ode1
ltx/en_us_goadedes/me.m12.dFF:meMA.Ode1C21.text	
ltx/en_us_goadedes/me.m12.dFF:meMA.Ode1C22.incipit	…
ltx/en_us_goadedes/me.m12.dFF:meMA.Ode1C22.melody	@ltx/en_us_goadedes/he.h.m1:heHE.ChristosGennatai.name
ltx/en_us_goadedes/me.m12.dFF:meMA.Ode1C22.mode	@ltx/en_us_goadedes/miscellanea:misc.Mode1
ltx/en_us_goadedes/me.m12.dFF:meMA.Ode1C22.ode	@ltx/en_us_goadedes/miscellanea:misc.Ode1
ltx/en_us_goadedes/me.m12.dFF:meMA.Ode1C22.text	
ltx/en_us_goadedes/me.m12.dFF:meMA.Ode1C23.incipit	…
ltx/en_us_goadedes/me.m12.dFF:meMA.Ode1C23.melody	@ltx/en_us_goadedes/he.h.m1:heHE.ChristosGennatai.name
ltx/en_us_goadedes/me.m12.dFF:meMA.Ode1C23.mode	@ltx/en_us_goadedes/miscellanea:misc.Mode1
ltx/en_us_goadedes/me.m12.dFF:meMA.Ode1C23.ode	@ltx/en_us_goadedes/miscellanea:misc.Ode1
ltx/en_us_goadedes/me.m12.dFF:meMA.Ode1C23.text	
ltx/en_us_goadedes/me.m12.dFF:meMA.Ode1C2T.incipit	…
ltx/en_us_goadedes/me.m12.dFF:meMA.Ode1C2T.melody	@ltx/en_us_goadedes/he.h.m1:heHE.ChristosGennatai.name
ltx/en_us_goadedes/me.m12.dFF:meMA.Ode1C2T.mode	@ltx/en_us_goadedes/miscellanea:misc.Mode1
ltx/en_us_goadedes/me.m12.dFF:meMA.Ode1C2T.ode	@ltx/en_us_goadedes/miscellanea:misc.Ode1
ltx/en_us_goadedes/me.m12.dFF:meMA.Ode1C2T.text	
ltx/en_us_goadedes/me.m12.dFF:meMA.Ode3C11.greekmelody	@ltx/en_us_goadedes/he.h.m8:heHE.SyEiToStereoma.greekname
ltx/en_us_goadedes/me.m12.dFF:meMA.Ode3C11.incipit	…
ltx/en_us_goadedes/me.m12.dFF:meMA.Ode3C11.melody	@ltx/en_us_goadedes/he.h.m8:heHE.SyEiToStereoma.name
ltx/en_us_goadedes/me.m12.dFF:meMA.Ode3C11.mode	@ltx/en_us_goadedes/miscellanea:misc.Mode8
ltx/en_us_goadedes/me.m12.dFF:meMA.Ode3C11.ode	@ltx/en_us_goadedes/miscellanea:misc.Ode3
ltx/en_us_goadedes/me.m12.dFF:meMA.Ode3C11.text	
ltx/en_us_goadedes/me.m12.dFF:meMA.Ode3C12.incipit	…
ltx/en_us_goadedes/me.m12.dFF:meMA.Ode3C12.melody	@ltx/en_us_goadedes/he.h.m8:heHE.SyEiToStereoma.name
ltx/en_us_goadedes/me.m12.dFF:meMA.Ode3C12.mode	@ltx/en_us_goadedes/miscellanea:misc.Mode8
ltx/en_us_goadedes/me.m12.dFF:meMA.Ode3C12.ode	@ltx/en_us_goadedes/miscellanea:misc.Ode3
ltx/en_us_goadedes/me.m12.dFF:meMA.Ode3C12.text	
ltx/en_us_goadedes/me.m12.dFF:meMA.Ode3C13.incipit	…
ltx/en_us_goadedes/me.m12.dFF:meMA.Ode3C13.melody	@ltx/en_us_goadedes/he.h.m8:heHE.SyEiToStereoma.name
ltx/en_us_goadedes/me.m12.dFF:meMA.Ode3C13.mode	@ltx/en_us_goadedes/miscellanea:misc.Mode8
ltx/en_us_goadedes/me.m12.dFF:meMA.Ode3C13.ode	@ltx/en_us_goadedes/miscellanea:misc.Ode3
ltx/en_us_goadedes/me.m12.dFF:meMA.Ode3C13.text	
ltx/en_us_goadedes/me.m12.dFF:meMA.Ode3C1T.incipit	…
ltx/en_us_goadedes/me.m12.dFF:meMA.Ode3C1T.melody	@ltx/en_us_goadedes/he.h.m8:heHE.SyEiToStereoma.name
ltx/en_us_goadedes/me.m12.dFF:meMA.Ode3C1T.mode	@ltx/en_us_goadedes/miscellanea:misc.Mode8
ltx/en_us_goadedes/me.m12.dFF:meMA.Ode3C1T.ode	@ltx/en_us_goadedes/miscellanea:misc.Ode3
ltx/en_us_goadedes/me.m12.dFF:meMA.Ode3C1T.text	
ltx/en_us_goadedes/me.m12.dFF:meMA.Ode3C21.greekmelody	@ltx/en_us_goadedes/he.h.m1:heHE.ToProTonAionon.greekname
ltx/en_us_goadedes/me.m12.dFF:meMA.Ode3C21.incipit	…
ltx/en_us_goadedes/me.m12.dFF:meMA.Ode3C21.melody	@ltx/en_us_goadedes/he.h.m1:heHE.ToProTonAionon.name
ltx/en_us_goadedes/me.m12.dFF:meMA.Ode3C21.mode	@ltx/en_us_goadedes/miscellanea:misc.Mode1
ltx/en_us_goadedes/me.m12.dFF:meMA.Ode3C21.ode	@ltx/en_us_goadedes/miscellanea:misc.Ode3
ltx/en_us_goadedes/me.m12.dFF:meMA.Ode3C21.text	
ltx/en_us_goadedes/me.m12.dFF:meMA.Ode3C22.incipit	…
ltx/en_us_goadedes/me.m12.dFF:meMA.Ode3C22.melody	@ltx/en_us_goadedes/he.h.m1:heHE.ToProTonAionon.name
ltx/en_us_goadedes/me.m12.dFF:meMA.Ode3C22.mode	@ltx/en_us_goadedes/miscellanea:misc.Mode1
ltx/en_us_goadedes/me.m12.dFF:meMA.Ode3C22.ode	@ltx/en_us_goadedes/miscellanea:misc.Ode3
ltx/en_us_goadedes/me.m12.dFF:meMA.Ode3C22.text	
ltx/en_us_goadedes/me.m12.dFF:meMA.Ode3C23.incipit	…
ltx/en_us_goadedes/me.m12.dFF:meMA.Ode3C23.melody	@ltx/en_us_goadedes/he.h.m1:heHE.ToProTonAionon.name
ltx/en_us_goadedes/me.m12.dFF:meMA.Ode3C23.mode	@ltx/en_us_goadedes/miscellanea:misc.Mode1
ltx/en_us_goadedes/me.m12.dFF:meMA.Ode3C23.ode	@ltx/en_us_goadedes/miscellanea:misc.Ode3
ltx/en_us_goadedes/me.m12.dFF:meMA.Ode3C23.text	
ltx/en_us_goadedes/me.m12.dFF:meMA.Ode3C2T.incipit	…
ltx/en_us_goadedes/me.m12.dFF:meMA.Ode3C2T.melody	@ltx/en_us_goadedes/he.h.m1:heHE.ToProTonAionon.name
ltx/en_us_goadedes/me.m12.dFF:meMA.Ode3C2T.mode	@ltx/en_us_goadedes/miscellanea:misc.Mode1
ltx/en_us_goadedes/me.m12.dFF:meMA.Ode3C2T.ode	@ltx/en_us_goadedes/miscellanea:misc.Ode3
ltx/en_us_goadedes/me.m12.dFF:meMA.Ode3C2T.text	
ltx/en_us_goadedes/me.m12.dFF:meMA.Ode3Kathisma1.greekmelody	@ltx/en_us_goadedes/he.a.m1:heAU.TonTafonSouSotir.greekname
ltx/en_us_goadedes/me.m12.dFF:meMA.Ode3Kathisma1.incipit	…
ltx/en_us_goadedes/me.m12.dFF:meMA.Ode3Kathisma1.melody	@ltx/en_us_goadedes/he.a.m1:heAU.TonTafonSouSotir.name
ltx/en_us_goadedes/me.m12.dFF:meMA.Ode3Kathisma1.mode	@ltx/en_us_goadedes/miscellanea:misc.Mode1
ltx/en_us_goadedes/me.m12.dFF:meMA.Ode3Kathisma1.text	
ltx/en_us_goadedes/me.m12.dFF:meMA.Ode4C11.greekmelody	@ltx/en_us_goadedes/he.h.m8:heHE.EisakikoaKyrie.greekname
ltx/en_us_goadedes/me.m12.dFF:meMA.Ode4C11.incipit	…
ltx/en_us_goadedes/me.m12.dFF:meMA.Ode4C11.melody	@ltx/en_us_goadedes/he.h.m8:heHE.EisakikoaKyrie.name
ltx/en_us_goadedes/me.m12.dFF:meMA.Ode4C11.mode	@ltx/en_us_goadedes/miscellanea:misc.Mode8
ltx/en_us_goadedes/me.m12.dFF:meMA.Ode4C11.ode	@ltx/en_us_goadedes/miscellanea:misc.Ode4
ltx/en_us_goadedes/me.m12.dFF:meMA.Ode4C11.text	
ltx/en_us_goadedes/me.m12.dFF:meMA.Ode4C12.incipit	…
ltx/en_us_goadedes/me.m12.dFF:meMA.Ode4C12.melody	@ltx/en_us_goadedes/he.h.m8:heHE.EisakikoaKyrie.name
ltx/en_us_goadedes/me.m12.dFF:meMA.Ode4C12.mode	@ltx/en_us_goadedes/miscellanea:misc.Mode8
ltx/en_us_goadedes/me.m12.dFF:meMA.Ode4C12.ode	@ltx/en_us_goadedes/miscellanea:misc.Ode4
ltx/en_us_goadedes/me.m12.dFF:meMA.Ode4C12.text	
ltx/en_us_goadedes/me.m12.dFF:meMA.Ode4C13.incipit	…
ltx/en_us_goadedes/me.m12.dFF:meMA.Ode4C13.melody	@ltx/en_us_goadedes/he.h.m8:heHE.EisakikoaKyrie.name
ltx/en_us_goadedes/me.m12.dFF:meMA.Ode4C13.mode	@ltx/en_us_goadedes/miscellanea:misc.Mode8
ltx/en_us_goadedes/me.m12.dFF:meMA.Ode4C13.ode	@ltx/en_us_goadedes/miscellanea:misc.Ode4
ltx/en_us_goadedes/me.m12.dFF:meMA.Ode4C13.text	
ltx/en_us_goadedes/me.m12.dFF:meMA.Ode4C1T.incipit	…
ltx/en_us_goadedes/me.m12.dFF:meMA.Ode4C1T.melody	@ltx/en_us_goadedes/he.h.m8:heHE.EisakikoaKyrie.name
ltx/en_us_goadedes/me.m12.dFF:meMA.Ode4C1T.mode	@ltx/en_us_goadedes/miscellanea:misc.Mode8
ltx/en_us_goadedes/me.m12.dFF:meMA.Ode4C1T.ode	@ltx/en_us_goadedes/miscellanea:misc.Ode4
ltx/en_us_goadedes/me.m12.dFF:meMA.Ode4C1T.text	
ltx/en_us_goadedes/me.m12.dFF:meMA.Ode4C21.greekmelody	@ltx/en_us_goadedes/he.h.m1:heHE.RavdosEkTisRizis.greekname
ltx/en_us_goadedes/me.m12.dFF:meMA.Ode4C21.incipit	…
ltx/en_us_goadedes/me.m12.dFF:meMA.Ode4C21.melody	@ltx/en_us_goadedes/he.h.m1:heHE.RavdosEkTisRizis.name
ltx/en_us_goadedes/me.m12.dFF:meMA.Ode4C21.mode	@ltx/en_us_goadedes/miscellanea:misc.Mode1
ltx/en_us_goadedes/me.m12.dFF:meMA.Ode4C21.ode	@ltx/en_us_goadedes/miscellanea:misc.Ode4
ltx/en_us_goadedes/me.m12.dFF:meMA.Ode4C21.text	
ltx/en_us_goadedes/me.m12.dFF:meMA.Ode4C22.incipit	…
ltx/en_us_goadedes/me.m12.dFF:meMA.Ode4C22.melody	@ltx/en_us_goadedes/he.h.m1:heHE.RavdosEkTisRizis.name
ltx/en_us_goadedes/me.m12.dFF:meMA.Ode4C22.mode	@ltx/en_us_goadedes/miscellanea:misc.Mode1
ltx/en_us_goadedes/me.m12.dFF:meMA.Ode4C22.ode	@ltx/en_us_goadedes/miscellanea:misc.Ode4
ltx/en_us_goadedes/me.m12.dFF:meMA.Ode4C22.text	
ltx/en_us_goadedes/me.m12.dFF:meMA.Ode4C23.incipit	…
ltx/en_us_goadedes/me.m12.dFF:meMA.Ode4C23.melody	@ltx/en_us_goadedes/he.h.m1:heHE.RavdosEkTisRizis.name
ltx/en_us_goadedes/me.m12.dFF:meMA.Ode4C23.mode	@ltx/en_us_goadedes/miscellanea:misc.Mode1
ltx/en_us_goadedes/me.m12.dFF:meMA.Ode4C23.ode	@ltx/en_us_goadedes/miscellanea:misc.Ode4
ltx/en_us_goadedes/me.m12.dFF:meMA.Ode4C23.text	
ltx/en_us_goadedes/me.m12.dFF:meMA.Ode4C24.incipit	…
ltx/en_us_goadedes/me.m12.dFF:meMA.Ode4C24.melody	@ltx/en_us_goadedes/he.h.m1:heHE.RavdosEkTisRizis.name
ltx/en_us_goadedes/me.m12.dFF:meMA.Ode4C24.mode	@ltx/en_us_goadedes/miscellanea:misc.Mode1
ltx/en_us_goadedes/me.m12.dFF:meMA.Ode4C24.ode	@ltx/en_us_goadedes/miscellanea:misc.Ode4
ltx/en_us_goadedes/me.m12.dFF:meMA.Ode4C24.text	
ltx/en_us_goadedes/me.m12.dFF:meMA.Ode4C2T.incipit	…
ltx/en_us_goadedes/me.m12.dFF:meMA.Ode4C2T.melody	@ltx/en_us_goadedes/he.h.m1:heHE.RavdosEkTisRizis.name
ltx/en_us_goadedes/me.m12.dFF:meMA.Ode4C2T.mode	@ltx/en_us_goadedes/miscellanea:misc.Mode1
ltx/en_us_goadedes/me.m12.dFF:meMA.Ode4C2T.ode	@ltx/en_us_goadedes/miscellanea:misc.Ode4
ltx/en_us_goadedes/me.m12.dFF:meMA.Ode4C2T.text	
ltx/en_us_goadedes/me.m12.dFF:meMA.Ode5C11.greekmelody	@ltx/en_us_goadedes/he.h.m8:heHE.InaTiMeAposo.greekname
ltx/en_us_goadedes/me.m12.dFF:meMA.Ode5C11.incipit	…
ltx/en_us_goadedes/me.m12.dFF:meMA.Ode5C11.melody	@ltx/en_us_goadedes/he.h.m8:heHE.InaTiMeAposo.name
ltx/en_us_goadedes/me.m12.dFF:meMA.Ode5C11.mode	@ltx/en_us_goadedes/miscellanea:misc.Mode8
ltx/en_us_goadedes/me.m12.dFF:meMA.Ode5C11.ode	@ltx/en_us_goadedes/miscellanea:misc.Ode5
ltx/en_us_goadedes/me.m12.dFF:meMA.Ode5C11.text	
ltx/en_us_goadedes/me.m12.dFF:meMA.Ode5C12.incipit	…
ltx/en_us_goadedes/me.m12.dFF:meMA.Ode5C12.melody	@ltx/en_us_goadedes/he.h.m8:heHE.InaTiMeAposo.name
ltx/en_us_goadedes/me.m12.dFF:meMA.Ode5C12.mode	@ltx/en_us_goadedes/miscellanea:misc.Mode8
ltx/en_us_goadedes/me.m12.dFF:meMA.Ode5C12.ode	@ltx/en_us_goadedes/miscellanea:misc.Ode5
ltx/en_us_goadedes/me.m12.dFF:meMA.Ode5C12.text	
ltx/en_us_goadedes/me.m12.dFF:meMA.Ode5C13.incipit	…
ltx/en_us_goadedes/me.m12.dFF:meMA.Ode5C13.melody	@ltx/en_us_goadedes/he.h.m8:heHE.InaTiMeAposo.name
ltx/en_us_goadedes/me.m12.dFF:meMA.Ode5C13.mode	@ltx/en_us_goadedes/miscellanea:misc.Mode8
ltx/en_us_goadedes/me.m12.dFF:meMA.Ode5C13.ode	@ltx/en_us_goadedes/miscellanea:misc.Ode5
ltx/en_us_goadedes/me.m12.dFF:meMA.Ode5C13.text	
ltx/en_us_goadedes/me.m12.dFF:meMA.Ode5C1T.incipit	…
ltx/en_us_goadedes/me.m12.dFF:meMA.Ode5C1T.melody	@ltx/en_us_goadedes/he.h.m8:heHE.InaTiMeAposo.name
ltx/en_us_goadedes/me.m12.dFF:meMA.Ode5C1T.mode	@ltx/en_us_goadedes/miscellanea:misc.Mode8
ltx/en_us_goadedes/me.m12.dFF:meMA.Ode5C1T.ode	@ltx/en_us_goadedes/miscellanea:misc.Ode5
ltx/en_us_goadedes/me.m12.dFF:meMA.Ode5C1T.text	
ltx/en_us_goadedes/me.m12.dFF:meMA.Ode5C21.greekmelody	@ltx/en_us_goadedes/he.h.m1:heHE.TheosOnEirinis.greekname
ltx/en_us_goadedes/me.m12.dFF:meMA.Ode5C21.incipit	…
ltx/en_us_goadedes/me.m12.dFF:meMA.Ode5C21.melody	@ltx/en_us_goadedes/he.h.m1:heHE.TheosOnEirinis.name
ltx/en_us_goadedes/me.m12.dFF:meMA.Ode5C21.mode	@ltx/en_us_goadedes/miscellanea:misc.Mode1
ltx/en_us_goadedes/me.m12.dFF:meMA.Ode5C21.ode	@ltx/en_us_goadedes/miscellanea:misc.Ode5
ltx/en_us_goadedes/me.m12.dFF:meMA.Ode5C21.text	
ltx/en_us_goadedes/me.m12.dFF:meMA.Ode5C22.incipit	…
ltx/en_us_goadedes/me.m12.dFF:meMA.Ode5C22.melody	@ltx/en_us_goadedes/he.h.m1:heHE.TheosOnEirinis.name
ltx/en_us_goadedes/me.m12.dFF:meMA.Ode5C22.mode	@ltx/en_us_goadedes/miscellanea:misc.Mode1
ltx/en_us_goadedes/me.m12.dFF:meMA.Ode5C22.ode	@ltx/en_us_goadedes/miscellanea:misc.Ode5
ltx/en_us_goadedes/me.m12.dFF:meMA.Ode5C22.text	
ltx/en_us_goadedes/me.m12.dFF:meMA.Ode5C23.incipit	…
ltx/en_us_goadedes/me.m12.dFF:meMA.Ode5C23.melody	@ltx/en_us_goadedes/he.h.m1:heHE.TheosOnEirinis.name
ltx/en_us_goadedes/me.m12.dFF:meMA.Ode5C23.mode	@ltx/en_us_goadedes/miscellanea:misc.Mode1
ltx/en_us_goadedes/me.m12.dFF:meMA.Ode5C23.ode	@ltx/en_us_goadedes/miscellanea:misc.Ode5
ltx/en_us_goadedes/me.m12.dFF:meMA.Ode5C23.text	
ltx/en_us_goadedes/me.m12.dFF:meMA.Ode5C2T.incipit	…
ltx/en_us_goadedes/me.m12.dFF:meMA.Ode5C2T.melody	@ltx/en_us_goadedes/he.h.m1:heHE.TheosOnEirinis.name
ltx/en_us_goadedes/me.m12.dFF:meMA.Ode5C2T.mode	@ltx/en_us_goadedes/miscellanea:misc.Mode1
ltx/en_us_goadedes/me.m12.dFF:meMA.Ode5C2T.ode	@ltx/en_us_goadedes/miscellanea:misc.Ode5
ltx/en_us_goadedes/me.m12.dFF:meMA.Ode5C2T.text	
ltx/en_us_goadedes/me.m12.dFF:meMA.Ode6C11.greekmelody	@ltx/en_us_goadedes/he.h.m8:heHE.AvyssosAmartion.greekname
ltx/en_us_goadedes/me.m12.dFF:meMA.Ode6C11.incipit	…
ltx/en_us_goadedes/me.m12.dFF:meMA.Ode6C11.melody	@ltx/en_us_goadedes/he.h.m8:heHE.AvyssosAmartion.name
ltx/en_us_goadedes/me.m12.dFF:meMA.Ode6C11.mode	@ltx/en_us_goadedes/miscellanea:misc.Mode8
ltx/en_us_goadedes/me.m12.dFF:meMA.Ode6C11.ode	@ltx/en_us_goadedes/miscellanea:misc.Ode6
ltx/en_us_goadedes/me.m12.dFF:meMA.Ode6C11.text	
ltx/en_us_goadedes/me.m12.dFF:meMA.Ode6C12.incipit	…
ltx/en_us_goadedes/me.m12.dFF:meMA.Ode6C12.melody	@ltx/en_us_goadedes/he.h.m8:heHE.AvyssosAmartion.name
ltx/en_us_goadedes/me.m12.dFF:meMA.Ode6C12.mode	@ltx/en_us_goadedes/miscellanea:misc.Mode8
ltx/en_us_goadedes/me.m12.dFF:meMA.Ode6C12.ode	@ltx/en_us_goadedes/miscellanea:misc.Ode6
ltx/en_us_goadedes/me.m12.dFF:meMA.Ode6C12.text	
ltx/en_us_goadedes/me.m12.dFF:meMA.Ode6C1T.incipit	…
ltx/en_us_goadedes/me.m12.dFF:meMA.Ode6C1T.melody	@ltx/en_us_goadedes/he.h.m8:heHE.AvyssosAmartion.name
ltx/en_us_goadedes/me.m12.dFF:meMA.Ode6C1T.mode	@ltx/en_us_goadedes/miscellanea:misc.Mode8
ltx/en_us_goadedes/me.m12.dFF:meMA.Ode6C1T.ode	@ltx/en_us_goadedes/miscellanea:misc.Ode6
ltx/en_us_goadedes/me.m12.dFF:meMA.Ode6C1T.text	
ltx/en_us_goadedes/me.m12.dFF:meMA.Ode6C21.greekmelody	@ltx/en_us_goadedes/he.h.m1:heHE.SplanchnonIonan.greekname
ltx/en_us_goadedes/me.m12.dFF:meMA.Ode6C21.incipit	…
ltx/en_us_goadedes/me.m12.dFF:meMA.Ode6C21.melody	@ltx/en_us_goadedes/he.h.m1:heHE.SplanchnonIonan.name
ltx/en_us_goadedes/me.m12.dFF:meMA.Ode6C21.mode	@ltx/en_us_goadedes/miscellanea:misc.Mode1
ltx/en_us_goadedes/me.m12.dFF:meMA.Ode6C21.ode	@ltx/en_us_goadedes/miscellanea:misc.Ode6
ltx/en_us_goadedes/me.m12.dFF:meMA.Ode6C21.text	
ltx/en_us_goadedes/me.m12.dFF:meMA.Ode6C22.incipit	…
ltx/en_us_goadedes/me.m12.dFF:meMA.Ode6C22.melody	@ltx/en_us_goadedes/he.h.m1:heHE.SplanchnonIonan.name
ltx/en_us_goadedes/me.m12.dFF:meMA.Ode6C22.mode	@ltx/en_us_goadedes/miscellanea:misc.Mode1
ltx/en_us_goadedes/me.m12.dFF:meMA.Ode6C22.ode	@ltx/en_us_goadedes/miscellanea:misc.Ode6
ltx/en_us_goadedes/me.m12.dFF:meMA.Ode6C22.text	
ltx/en_us_goadedes/me.m12.dFF:meMA.Ode6C23.incipit	…
ltx/en_us_goadedes/me.m12.dFF:meMA.Ode6C23.melody	@ltx/en_us_goadedes/he.h.m1:heHE.SplanchnonIonan.name
ltx/en_us_goadedes/me.m12.dFF:meMA.Ode6C23.mode	@ltx/en_us_goadedes/miscellanea:misc.Mode1
ltx/en_us_goadedes/me.m12.dFF:meMA.Ode6C23.ode	@ltx/en_us_goadedes/miscellanea:misc.Ode6
ltx/en_us_goadedes/me.m12.dFF:meMA.Ode6C23.text	
ltx/en_us_goadedes/me.m12.dFF:meMA.Ode6C2T.incipit	…
ltx/en_us_goadedes/me.m12.dFF:meMA.Ode6C2T.melody	@ltx/en_us_goadedes/he.h.m1:heHE.SplanchnonIonan.name
ltx/en_us_goadedes/me.m12.dFF:meMA.Ode6C2T.mode	@ltx/en_us_goadedes/miscellanea:misc.Mode1
ltx/en_us_goadedes/me.m12.dFF:meMA.Ode6C2T.ode	@ltx/en_us_goadedes/miscellanea:misc.Ode6
ltx/en_us_goadedes/me.m12.dFF:meMA.Ode6C2T.text	
ltx/en_us_goadedes/me.m12.dFF:meMA.Ode7C11.greekmelody	@ltx/en_us_goadedes/he.h.m8:heHE.PaidesTheoseveis.greekname
ltx/en_us_goadedes/me.m12.dFF:meMA.Ode7C11.incipit	…
ltx/en_us_goadedes/me.m12.dFF:meMA.Ode7C11.melody	@ltx/en_us_goadedes/he.h.m8:heHE.PaidesTheoseveis.name
ltx/en_us_goadedes/me.m12.dFF:meMA.Ode7C11.mode	@ltx/en_us_goadedes/miscellanea:misc.Mode8
ltx/en_us_goadedes/me.m12.dFF:meMA.Ode7C11.ode	@ltx/en_us_goadedes/miscellanea:misc.Ode7
ltx/en_us_goadedes/me.m12.dFF:meMA.Ode7C11.text	
ltx/en_us_goadedes/me.m12.dFF:meMA.Ode7C12.incipit	…
ltx/en_us_goadedes/me.m12.dFF:meMA.Ode7C12.melody	@ltx/en_us_goadedes/he.h.m8:heHE.PaidesTheoseveis.name
ltx/en_us_goadedes/me.m12.dFF:meMA.Ode7C12.mode	@ltx/en_us_goadedes/miscellanea:misc.Mode8
ltx/en_us_goadedes/me.m12.dFF:meMA.Ode7C12.ode	@ltx/en_us_goadedes/miscellanea:misc.Ode7
ltx/en_us_goadedes/me.m12.dFF:meMA.Ode7C12.text	
ltx/en_us_goadedes/me.m12.dFF:meMA.Ode7C13.incipit	…
ltx/en_us_goadedes/me.m12.dFF:meMA.Ode7C13.melody	@ltx/en_us_goadedes/he.h.m8:heHE.PaidesTheoseveis.name
ltx/en_us_goadedes/me.m12.dFF:meMA.Ode7C13.mode	@ltx/en_us_goadedes/miscellanea:misc.Mode8
ltx/en_us_goadedes/me.m12.dFF:meMA.Ode7C13.ode	@ltx/en_us_goadedes/miscellanea:misc.Ode7
ltx/en_us_goadedes/me.m12.dFF:meMA.Ode7C13.text	
ltx/en_us_goadedes/me.m12.dFF:meMA.Ode7C1T.incipit	…
ltx/en_us_goadedes/me.m12.dFF:meMA.Ode7C1T.melody	@ltx/en_us_goadedes/he.h.m8:heHE.PaidesTheoseveis.name
ltx/en_us_goadedes/me.m12.dFF:meMA.Ode7C1T.mode	@ltx/en_us_goadedes/miscellanea:misc.Mode8
ltx/en_us_goadedes/me.m12.dFF:meMA.Ode7C1T.ode	@ltx/en_us_goadedes/miscellanea:misc.Ode7
ltx/en_us_goadedes/me.m12.dFF:meMA.Ode7C1T.text	
ltx/en_us_goadedes/me.m12.dFF:meMA.Ode7C21.greekmelody	@ltx/en_us_goadedes/he.h.m1:heHE.OiPaidesEfseveia.greekname
ltx/en_us_goadedes/me.m12.dFF:meMA.Ode7C21.incipit	…
ltx/en_us_goadedes/me.m12.dFF:meMA.Ode7C21.melody	@ltx/en_us_goadedes/he.h.m1:heHE.OiPaidesEfseveia.name
ltx/en_us_goadedes/me.m12.dFF:meMA.Ode7C21.mode	@ltx/en_us_goadedes/miscellanea:misc.Mode1
ltx/en_us_goadedes/me.m12.dFF:meMA.Ode7C21.ode	@ltx/en_us_goadedes/miscellanea:misc.Ode7
ltx/en_us_goadedes/me.m12.dFF:meMA.Ode7C21.text	
ltx/en_us_goadedes/me.m12.dFF:meMA.Ode7C22.incipit	…
ltx/en_us_goadedes/me.m12.dFF:meMA.Ode7C22.melody	@ltx/en_us_goadedes/he.h.m1:heHE.OiPaidesEfseveia.name
ltx/en_us_goadedes/me.m12.dFF:meMA.Ode7C22.mode	@ltx/en_us_goadedes/miscellanea:misc.Mode1
ltx/en_us_goadedes/me.m12.dFF:meMA.Ode7C22.ode	@ltx/en_us_goadedes/miscellanea:misc.Ode7
ltx/en_us_goadedes/me.m12.dFF:meMA.Ode7C22.text	
ltx/en_us_goadedes/me.m12.dFF:meMA.Ode7C23.incipit	…
ltx/en_us_goadedes/me.m12.dFF:meMA.Ode7C23.melody	@ltx/en_us_goadedes/he.h.m1:heHE.OiPaidesEfseveia.name
ltx/en_us_goadedes/me.m12.dFF:meMA.Ode7C23.mode	@ltx/en_us_goadedes/miscellanea:misc.Mode1
ltx/en_us_goadedes/me.m12.dFF:meMA.Ode7C23.ode	@ltx/en_us_goadedes/miscellanea:misc.Ode7
ltx/en_us_goadedes/me.m12.dFF:meMA.Ode7C23.text	
ltx/en_us_goadedes/me.m12.dFF:meMA.Ode7C2T.incipit	…
ltx/en_us_goadedes/me.m12.dFF:meMA.Ode7C2T.melody	@ltx/en_us_goadedes/he.h.m1:heHE.OiPaidesEfseveia.name
ltx/en_us_goadedes/me.m12.dFF:meMA.Ode7C2T.mode	@ltx/en_us_goadedes/miscellanea:misc.Mode1
ltx/en_us_goadedes/me.m12.dFF:meMA.Ode7C2T.ode	@ltx/en_us_goadedes/miscellanea:misc.Ode7
ltx/en_us_goadedes/me.m12.dFF:meMA.Ode7C2T.text	
ltx/en_us_goadedes/me.m12.dFF:meMA.Ode8C11.greekmelody	@ltx/en_us_goadedes/he.h.m8:heHE.EptaplasiosKaminon.greekname
ltx/en_us_goadedes/me.m12.dFF:meMA.Ode8C11.incipit	…
ltx/en_us_goadedes/me.m12.dFF:meMA.Ode8C11.melody	@ltx/en_us_goadedes/he.h.m8:heHE.EptaplasiosKaminon.name
ltx/en_us_goadedes/me.m12.dFF:meMA.Ode8C11.mode	@ltx/en_us_goadedes/miscellanea:misc.Mode8
ltx/en_us_goadedes/me.m12.dFF:meMA.Ode8C11.ode	@ltx/en_us_goadedes/miscellanea:misc.Ode8
ltx/en_us_goadedes/me.m12.dFF:meMA.Ode8C11.text	
ltx/en_us_goadedes/me.m12.dFF:meMA.Ode8C12.incipit	…
ltx/en_us_goadedes/me.m12.dFF:meMA.Ode8C12.melody	@ltx/en_us_goadedes/he.h.m8:heHE.EptaplasiosKaminon.name
ltx/en_us_goadedes/me.m12.dFF:meMA.Ode8C12.mode	@ltx/en_us_goadedes/miscellanea:misc.Mode8
ltx/en_us_goadedes/me.m12.dFF:meMA.Ode8C12.ode	@ltx/en_us_goadedes/miscellanea:misc.Ode8
ltx/en_us_goadedes/me.m12.dFF:meMA.Ode8C12.text	
ltx/en_us_goadedes/me.m12.dFF:meMA.Ode8C13.incipit	…
ltx/en_us_goadedes/me.m12.dFF:meMA.Ode8C13.melody	@ltx/en_us_goadedes/he.h.m8:heHE.EptaplasiosKaminon.name
ltx/en_us_goadedes/me.m12.dFF:meMA.Ode8C13.mode	@ltx/en_us_goadedes/miscellanea:misc.Mode8
ltx/en_us_goadedes/me.m12.dFF:meMA.Ode8C13.ode	@ltx/en_us_goadedes/miscellanea:misc.Ode8
ltx/en_us_goadedes/me.m12.dFF:meMA.Ode8C13.text	
ltx/en_us_goadedes/me.m12.dFF:meMA.Ode8C1T.incipit	…
ltx/en_us_goadedes/me.m12.dFF:meMA.Ode8C1T.melody	@ltx/en_us_goadedes/he.h.m8:heHE.EptaplasiosKaminon.name
ltx/en_us_goadedes/me.m12.dFF:meMA.Ode8C1T.mode	@ltx/en_us_goadedes/miscellanea:misc.Mode8
ltx/en_us_goadedes/me.m12.dFF:meMA.Ode8C1T.ode	@ltx/en_us_goadedes/miscellanea:misc.Ode8
ltx/en_us_goadedes/me.m12.dFF:meMA.Ode8C1T.text	
ltx/en_us_goadedes/me.m12.dFF:meMA.Ode8C21.greekmelody	@ltx/en_us_goadedes/he.h.m1:heHE.ThavmatosYperfyous.greekname
ltx/en_us_goadedes/me.m12.dFF:meMA.Ode8C21.incipit	…
ltx/en_us_goadedes/me.m12.dFF:meMA.Ode8C21.melody	@ltx/en_us_goadedes/he.h.m1:heHE.ThavmatosYperfyous.name
ltx/en_us_goadedes/me.m12.dFF:meMA.Ode8C21.mode	@ltx/en_us_goadedes/miscellanea:misc.Mode1
ltx/en_us_goadedes/me.m12.dFF:meMA.Ode8C21.ode	@ltx/en_us_goadedes/miscellanea:misc.Ode8
ltx/en_us_goadedes/me.m12.dFF:meMA.Ode8C21.text	
ltx/en_us_goadedes/me.m12.dFF:meMA.Ode8C22.incipit	…
ltx/en_us_goadedes/me.m12.dFF:meMA.Ode8C22.melody	@ltx/en_us_goadedes/he.h.m1:heHE.ThavmatosYperfyous.name
ltx/en_us_goadedes/me.m12.dFF:meMA.Ode8C22.mode	@ltx/en_us_goadedes/miscellanea:misc.Mode1
ltx/en_us_goadedes/me.m12.dFF:meMA.Ode8C22.ode	@ltx/en_us_goadedes/miscellanea:misc.Ode8
ltx/en_us_goadedes/me.m12.dFF:meMA.Ode8C22.text	
ltx/en_us_goadedes/me.m12.dFF:meMA.Ode8C23.incipit	…
ltx/en_us_goadedes/me.m12.dFF:meMA.Ode8C23.melody	@ltx/en_us_goadedes/he.h.m1:heHE.ThavmatosYperfyous.name
ltx/en_us_goadedes/me.m12.dFF:meMA.Ode8C23.mode	@ltx/en_us_goadedes/miscellanea:misc.Mode1
ltx/en_us_goadedes/me.m12.dFF:meMA.Ode8C23.ode	@ltx/en_us_goadedes/miscellanea:misc.Ode8
ltx/en_us_goadedes/me.m12.dFF:meMA.Ode8C23.text	
ltx/en_us_goadedes/me.m12.dFF:meMA.Ode8C2T.incipit	…
ltx/en_us_goadedes/me.m12.dFF:meMA.Ode8C2T.melody	@ltx/en_us_goadedes/he.h.m1:heHE.ThavmatosYperfyous.name
ltx/en_us_goadedes/me.m12.dFF:meMA.Ode8C2T.mode	@ltx/en_us_goadedes/miscellanea:misc.Mode1
ltx/en_us_goadedes/me.m12.dFF:meMA.Ode8C2T.ode	@ltx/en_us_goadedes/miscellanea:misc.Ode8
ltx/en_us_goadedes/me.m12.dFF:meMA.Ode8C2T.text	
ltx/en_us_goadedes/me.m12.dFF:meMA.Ode8C2Tr.incipit	…
ltx/en_us_goadedes/me.m12.dFF:meMA.Ode8C2Tr.melody	@ltx/en_us_goadedes/he.h.m1:heHE.ThavmatosYperfyous.name
ltx/en_us_goadedes/me.m12.dFF:meMA.Ode8C2Tr.mode	@ltx/en_us_goadedes/miscellanea:misc.Mode1
ltx/en_us_goadedes/me.m12.dFF:meMA.Ode8C2Tr.ode	@ltx/en_us_goadedes/miscellanea:misc.Ode8
ltx/en_us_goadedes/me.m12.dFF:meMA.Ode8C2Tr.text	
ltx/en_us_goadedes/me.m12.dFF:meMA.Ode9C11.greekmelody	@ltx/en_us_goadedes/he.h.m8:heHE.KyriosTheotokon.greekname
ltx/en_us_goadedes/me.m12.dFF:meMA.Ode9C11.incipit	…
ltx/en_us_goadedes/me.m12.dFF:meMA.Ode9C11.melody	@ltx/en_us_goadedes/he.h.m8:heHE.KyriosTheotokon.name
ltx/en_us_goadedes/me.m12.dFF:meMA.Ode9C11.mode	@ltx/en_us_goadedes/miscellanea:misc.Mode8
ltx/en_us_goadedes/me.m12.dFF:meMA.Ode9C11.ode	@ltx/en_us_goadedes/miscellanea:misc.Ode9
ltx/en_us_goadedes/me.m12.dFF:meMA.Ode9C11.text	
ltx/en_us_goadedes/me.m12.dFF:meMA.Ode9C12.incipit	…
ltx/en_us_goadedes/me.m12.dFF:meMA.Ode9C12.melody	@ltx/en_us_goadedes/he.h.m8:heHE.KyriosTheotokon.name
ltx/en_us_goadedes/me.m12.dFF:meMA.Ode9C12.mode	@ltx/en_us_goadedes/miscellanea:misc.Mode8
ltx/en_us_goadedes/me.m12.dFF:meMA.Ode9C12.ode	@ltx/en_us_goadedes/miscellanea:misc.Ode9
ltx/en_us_goadedes/me.m12.dFF:meMA.Ode9C12.text	
ltx/en_us_goadedes/me.m12.dFF:meMA.Ode9C13.incipit	…
ltx/en_us_goadedes/me.m12.dFF:meMA.Ode9C13.melody	@ltx/en_us_goadedes/he.h.m8:heHE.KyriosTheotokon.name
ltx/en_us_goadedes/me.m12.dFF:meMA.Ode9C13.mode	@ltx/en_us_goadedes/miscellanea:misc.Mode8
ltx/en_us_goadedes/me.m12.dFF:meMA.Ode9C13.ode	@ltx/en_us_goadedes/miscellanea:misc.Ode9
ltx/en_us_goadedes/me.m12.dFF:meMA.Ode9C13.text	
ltx/en_us_goadedes/me.m12.dFF:meMA.Ode9C1T.incipit	…
ltx/en_us_goadedes/me.m12.dFF:meMA.Ode9C1T.melody	@ltx/en_us_goadedes/he.h.m8:heHE.KyriosTheotokon.name
ltx/en_us_goadedes/me.m12.dFF:meMA.Ode9C1T.mode	@ltx/en_us_goadedes/miscellanea:misc.Mode8
ltx/en_us_goadedes/me.m12.dFF:meMA.Ode9C1T.ode	@ltx/en_us_goadedes/miscellanea:misc.Ode9
ltx/en_us_goadedes/me.m12.dFF:meMA.Ode9C1T.text	
ltx/en_us_goadedes/me.m12.dFF:meMA.Ode9C21.greekmelody	@ltx/en_us_goadedes/he.h.m1:heHE.MystirionXenon.greekname
ltx/en_us_goadedes/me.m12.dFF:meMA.Ode9C21.incipit	…
ltx/en_us_goadedes/me.m12.dFF:meMA.Ode9C21.melody	@ltx/en_us_goadedes/he.h.m1:heHE.MystirionXenon.name
ltx/en_us_goadedes/me.m12.dFF:meMA.Ode9C21.mode	@ltx/en_us_goadedes/miscellanea:misc.Mode1
ltx/en_us_goadedes/me.m12.dFF:meMA.Ode9C21.ode	@ltx/en_us_goadedes/miscellanea:misc.Ode9
ltx/en_us_goadedes/me.m12.dFF:meMA.Ode9C21.text	
ltx/en_us_goadedes/me.m12.dFF:meMA.Ode9C22.incipit	…
ltx/en_us_goadedes/me.m12.dFF:meMA.Ode9C22.melody	@ltx/en_us_goadedes/he.h.m1:heHE.MystirionXenon.name
ltx/en_us_goadedes/me.m12.dFF:meMA.Ode9C22.mode	@ltx/en_us_goadedes/miscellanea:misc.Mode1
ltx/en_us_goadedes/me.m12.dFF:meMA.Ode9C22.ode	@ltx/en_us_goadedes/miscellanea:misc.Ode9
ltx/en_us_goadedes/me.m12.dFF:meMA.Ode9C22.text	
ltx/en_us_goadedes/me.m12.dFF:meMA.Ode9C23.incipit	…
ltx/en_us_goadedes/me.m12.dFF:meMA.Ode9C23.melody	@ltx/en_us_goadedes/he.h.m1:heHE.MystirionXenon.name
ltx/en_us_goadedes/me.m12.dFF:meMA.Ode9C23.mode	@ltx/en_us_goadedes/miscellanea:misc.Mode1
ltx/en_us_goadedes/me.m12.dFF:meMA.Ode9C23.ode	@ltx/en_us_goadedes/miscellanea:misc.Ode9
ltx/en_us_goadedes/me.m12.dFF:meMA.Ode9C23.text	
ltx/en_us_goadedes/me.m12.dFF:meMA.Ode9C24.incipit	…
ltx/en_us_goadedes/me.m12.dFF:meMA.Ode9C24.melody	@ltx/en_us_goadedes/he.h.m1:heHE.MystirionXenon.name
ltx/en_us_goadedes/me.m12.dFF:meMA.Ode9C24.mode	@ltx/en_us_goadedes/miscellanea:misc.Mode1
ltx/en_us_goadedes/me.m12.dFF:meMA.Ode9C24.ode	@ltx/en_us_goadedes/miscellanea:misc.Ode9
ltx/en_us_goadedes/me.m12.dFF:meMA.Ode9C24.text	
ltx/en_us_goadedes/me.m12.dFF:meMA.Ode9C2T.incipit	…
ltx/en_us_goadedes/me.m12.dFF:meMA.Ode9C2T.melody	@ltx/en_us_goadedes/he.h.m1:heHE.MystirionXenon.name
ltx/en_us_goadedes/me.m12.dFF:meMA.Ode9C2T.mode	@ltx/en_us_goadedes/miscellanea:misc.Mode1
ltx/en_us_goadedes/me.m12.dFF:meMA.Ode9C2T.ode	@ltx/en_us_goadedes/miscellanea:misc.Ode9
ltx/en_us_goadedes/me.m12.dFF:meMA.Ode9C2T.text	
ltx/en_us_goadedes/me.m12.dFF:meMA.Oikos1.text	
ltx/en_us_goadedes/me.m12.dFF:meVE.Apolytikion1.incipit	…
ltx/en_us_goadedes/me.m12.dFF:meVE.Apolytikion1.melody	
ltx/en_us_goadedes/me.m12.dFF:meVE.Apolytikion1.mode	@ltx/en_us_goadedes/miscellanea:misc.Mode2
ltx/en_us_goadedes/me.m12.dFF:meVE.Apolytikion1.text	
ltx/en_us_goadedes/me.m12.dFF:meVE.AposGlory.incipit	…
ltx/en_us_goadedes/me.m12.dFF:meVE.AposGlory.melody	
ltx/en_us_goadedes/me.m12.dFF:meVE.AposGlory.mode	@ltx/en_us_goadedes/miscellanea:misc.Mode3
ltx/en_us_goadedes/me.m12.dFF:meVE.AposGlory.poet	@ltx/en_us_goadedes/poets:po.Germanou
ltx/en_us_goadedes/me.m12.dFF:meVE.AposGlory.text	
ltx/en_us_goadedes/me.m12.dFF:meVE.AposTheotokion.incipit	@ltx/en_us_goadedes/oc.m3.d1:ocVE.AposTheotokion.incipit
ltx/en_us_goadedes/me.m12.dFF:meVE.AposTheotokion.melody	
ltx/en_us_goadedes/me.m12.dFF:meVE.AposTheotokion.mode	@ltx/en_us_goadedes/miscellanea:misc.Mode3
ltx/en_us_goadedes/me.m12.dFF:meVE.AposTheotokion.text	@ltx/en_us_goadedes/oc.m3.d1:ocVE.AposTheotokion.text
ltx/en_us_goadedes/me.m12.dFF:meVE.MM.Stichera123as567.text	@ltx/en_us_goadedes/properties:media.key
ltx/en_us_goadedes/me.m12.dFF:meVE.SticGlory.incipit	…
ltx/en_us_goadedes/me.m12.dFF:meVE.SticGlory.melody	
ltx/en_us_goadedes/me.m12.dFF:meVE.SticGlory.mode	@ltx/en_us_goadedes/miscellanea:misc.Mode6
ltx/en_us_goadedes/me.m12.dFF:meVE.SticGlory.poet	@ltx/en_us_goadedes/poets:po.Anatoliou
ltx/en_us_goadedes/me.m12.dFF:meVE.SticGlory.text	
ltx/en_us_goadedes/me.m12.dFF:meVE.Stichera01.greekmelody	@ltx/en_us_goadedes/he.a.m8:heAU.OEnEdemParadeisos.greekname
ltx/en_us_goadedes/me.m12.dFF:meVE.Stichera01.incipit	…
ltx/en_us_goadedes/me.m12.dFF:meVE.Stichera01.melody	@ltx/en_us_goadedes/he.a.m8:heAU.OEnEdemParadeisos.name
ltx/en_us_goadedes/me.m12.dFF:meVE.Stichera01.mode	@ltx/en_us_goadedes/miscellanea:misc.Mode8
ltx/en_us_goadedes/me.m12.dFF:meVE.Stichera01.text	
ltx/en_us_goadedes/me.m12.dFF:meVE.Stichera02.incipit	…
ltx/en_us_goadedes/me.m12.dFF:meVE.Stichera02.melody	@ltx/en_us_goadedes/he.a.m8:heAU.OEnEdemParadeisos.name
ltx/en_us_goadedes/me.m12.dFF:meVE.Stichera02.mode	@ltx/en_us_goadedes/miscellanea:misc.Mode8
ltx/en_us_goadedes/me.m12.dFF:meVE.Stichera02.text	
ltx/en_us_goadedes/me.m12.dFF:meVE.Stichera03.incipit	…
ltx/en_us_goadedes/me.m12.dFF:meVE.Stichera03.melody	@ltx/en_us_goadedes/he.a.m8:heAU.OEnEdemParadeisos.name
ltx/en_us_goadedes/me.m12.dFF:meVE.Stichera03.mode	@ltx/en_us_goadedes/miscellanea:misc.Mode8
ltx/en_us_goadedes/me.m12.dFF:meVE.Stichera03.text	
ltx/en_us_goadedes/me.m12.dFF:meVE.Stichera04.greekmelody	@ltx/en_us_goadedes/he.a.m8:heAU.OEnEdemParadeisos.greekname
ltx/en_us_goadedes/me.m12.dFF:meVE.Stichera04.incipit	…
ltx/en_us_goadedes/me.m12.dFF:meVE.Stichera04.melody	@ltx/en_us_goadedes/he.a.m8:heAU.OEnEdemParadeisos.name
ltx/en_us_goadedes/me.m12.dFF:meVE.Stichera04.mode	@ltx/en_us_goadedes/miscellanea:misc.Mode8
ltx/en_us_goadedes/me.m12.dFF:meVE.Stichera04.text	
