ltx/en_us_goadedes/me.m12.d29:meDA.commemoration.first	
ltx/en_us_goadedes/me.m12.d29:meDA.commemoration.first_name	
ltx/en_us_goadedes/me.m12.d29:meDA.commemoration.first_short	
ltx/en_us_goadedes/me.m12.d29:meDA.commemoration.first_title	For the Holy Innocents.
ltx/en_us_goadedes/me.m12.d29:meDA.commemoration.full	
ltx/en_us_goadedes/me.m12.d29:meDA.commemoration.second_name	
ltx/en_us_goadedes/me.m12.d29:meDA.commemoration.second_title	@ltx/en_us_goadedes/titles:ti.SaintM
ltx/en_us_goadedes/me.m12.d29:meDA.date	
ltx/en_us_goadedes/me.m12.d29:meDA.dismissal	@ltx/en_us_goadedes/dismissals:dis00.christmas
ltx/en_us_goadedes/me.m12.d29:meDA.fordate	
ltx/en_us_goadedes/me.m12.d29:meDA.insert1	
ltx/en_us_goadedes/me.m12.d29:meDA.insert2	
ltx/en_us_goadedes/me.m12.d29:meDA.note	
ltx/en_us_goadedes/me.m12.d29:meDA.pdfcoverdate	
ltx/en_us_goadedes/me.m12.d29:meDA.pdfheaderdate	
ltx/en_us_goadedes/me.m12.d29:meHO.commemorations	
ltx/en_us_goadedes/me.m12.d29:meHO.note1	
ltx/en_us_goadedes/me.m12.d29:meHO.note2	
ltx/en_us_goadedes/me.m12.d29:meHO.number	
ltx/en_us_goadedes/me.m12.d29:meHO.rank	
ltx/en_us_goadedes/me.m12.d29:meLE.commemoration1	
ltx/en_us_goadedes/me.m12.d29:meLE.commemoration2	
ltx/en_us_goadedes/me.m12.d29:meLI.Kontakion1.greekmelody	@ltx/en_us_goadedes/me.m12.d29:meMA.Kontakion1.greekmelody
ltx/en_us_goadedes/me.m12.d29:meLI.Kontakion1.incipit	@ltx/en_us_goadedes/me.m12.d29:meMA.Kontakion1.incipit
ltx/en_us_goadedes/me.m12.d29:meLI.Kontakion1.melody	@ltx/en_us_goadedes/me.m12.d29:meMA.Kontakion1.melody
ltx/en_us_goadedes/me.m12.d29:meLI.Kontakion1.mode	@ltx/en_us_goadedes/me.m12.d29:meMA.Kontakion1.mode
ltx/en_us_goadedes/me.m12.d29:meLI.Kontakion1.text	@ltx/en_us_goadedes/me.m12.d29:meMA.Kontakion1.text
ltx/en_us_goadedes/me.m12.d29:meLI.Megalynarion.text	
ltx/en_us_goadedes/me.m12.d29:meMA.AposBoth.incipit	@ltx/en_us_goadedes/me.m12.d25:meVE.LityBoth.incipit
ltx/en_us_goadedes/me.m12.d29:meMA.AposBoth.melody	
ltx/en_us_goadedes/me.m12.d29:meMA.AposBoth.mode	@ltx/en_us_goadedes/miscellanea:misc.Mode6
ltx/en_us_goadedes/me.m12.d29:meMA.AposBoth.text	@ltx/en_us_goadedes/me.m12.d25:meVE.LityBoth.text
ltx/en_us_goadedes/me.m12.d29:meMA.AposGlory.incipit	@ltx/en_us_goadedes/me.m01.d15:meVE.AposGlory.incipit
ltx/en_us_goadedes/me.m12.d29:meMA.AposGlory.melody	
ltx/en_us_goadedes/me.m12.d29:meMA.AposGlory.mode	@ltx/en_us_goadedes/miscellanea:misc.Mode6
ltx/en_us_goadedes/me.m12.d29:meMA.AposGlory.text	@ltx/en_us_goadedes/me.m01.d15:meVE.AposGlory.text
ltx/en_us_goadedes/me.m12.d29:meMA.Aposticha1.incipit	…
ltx/en_us_goadedes/me.m12.d29:meMA.Aposticha1.melody	
ltx/en_us_goadedes/me.m12.d29:meMA.Aposticha1.mode	@ltx/en_us_goadedes/miscellanea:misc.Mode1
ltx/en_us_goadedes/me.m12.d29:meMA.Aposticha1.poet	@ltx/en_us_goadedes/poets:po.Kyprianou
ltx/en_us_goadedes/me.m12.d29:meMA.Aposticha1.text	
ltx/en_us_goadedes/me.m12.d29:meMA.Aposticha2.incipit	…
ltx/en_us_goadedes/me.m12.d29:meMA.Aposticha2.melody	
ltx/en_us_goadedes/me.m12.d29:meMA.Aposticha2.mode	@ltx/en_us_goadedes/miscellanea:misc.Mode2
ltx/en_us_goadedes/me.m12.d29:meMA.Aposticha2.poet	@ltx/en_us_goadedes/poets:po.Kyprianou
ltx/en_us_goadedes/me.m12.d29:meMA.Aposticha2.text	
ltx/en_us_goadedes/me.m12.d29:meMA.Aposticha3.incipit	…
ltx/en_us_goadedes/me.m12.d29:meMA.Aposticha3.melody	
ltx/en_us_goadedes/me.m12.d29:meMA.Aposticha3.mode	@ltx/en_us_goadedes/miscellanea:misc.Mode3
ltx/en_us_goadedes/me.m12.d29:meMA.Aposticha3.text	
ltx/en_us_goadedes/me.m12.d29:meMA.C1.acrostic.notice1	
ltx/en_us_goadedes/me.m12.d29:meMA.C1.acrostic.notice2	
ltx/en_us_goadedes/me.m12.d29:meMA.C1.acrostic.text	
ltx/en_us_goadedes/me.m12.d29:meMA.C1.acrostic.title	
ltx/en_us_goadedes/me.m12.d29:meMA.C1.title	@ltx/en_us_goadedes/titles:ti.CanonSaints
ltx/en_us_goadedes/me.m12.d29:meMA.C1.verse	@ltx/en_us_goadedes/prayers:pr.verse_SaintsM.text
ltx/en_us_goadedes/me.m12.d29:meMA.Exaposteilarion1.greekmelody	@ltx/en_us_goadedes/he.a.m2:heAU.TonMathitonOrontonSe.greekname
ltx/en_us_goadedes/me.m12.d29:meMA.Exaposteilarion1.incipit	…
ltx/en_us_goadedes/me.m12.d29:meMA.Exaposteilarion1.melody	@ltx/en_us_goadedes/he.a.m2:heAU.TonMathitonOrontonSe.name
ltx/en_us_goadedes/me.m12.d29:meMA.Exaposteilarion1.mode	@ltx/en_us_goadedes/miscellanea:misc.Mode2
ltx/en_us_goadedes/me.m12.d29:meMA.Exaposteilarion1.text	
ltx/en_us_goadedes/me.m12.d29:meMA.Exaposteilarion2.greekmelody	@ltx/en_us_goadedes/he.a.m2:heAU.TonMathitonOrontonSe.greekname
ltx/en_us_goadedes/me.m12.d29:meMA.Exaposteilarion2.incipit	…
ltx/en_us_goadedes/me.m12.d29:meMA.Exaposteilarion2.melody	@ltx/en_us_goadedes/he.a.m2:heAU.TonMathitonOrontonSe.name
ltx/en_us_goadedes/me.m12.d29:meMA.Exaposteilarion2.mode	@ltx/en_us_goadedes/miscellanea:misc.Mode2
ltx/en_us_goadedes/me.m12.d29:meMA.Exaposteilarion2.text	
ltx/en_us_goadedes/me.m12.d29:meMA.Exaposteilarion3.greekmelody	@ltx/en_us_goadedes/he.a.m2:heAU.TonMathitonOrontonSe.greekname
ltx/en_us_goadedes/me.m12.d29:meMA.Exaposteilarion3.incipit	…
ltx/en_us_goadedes/me.m12.d29:meMA.Exaposteilarion3.melody	@ltx/en_us_goadedes/he.a.m2:heAU.TonMathitonOrontonSe.name
ltx/en_us_goadedes/me.m12.d29:meMA.Exaposteilarion3.mode	@ltx/en_us_goadedes/miscellanea:misc.Mode2
ltx/en_us_goadedes/me.m12.d29:meMA.Exaposteilarion3.text	
ltx/en_us_goadedes/me.m12.d29:meMA.Kathisma11.greekmelody	@ltx/en_us_goadedes/he.a.m8:heAU.ToProstachthen.greekname
ltx/en_us_goadedes/me.m12.d29:meMA.Kathisma11.incipit	…
ltx/en_us_goadedes/me.m12.d29:meMA.Kathisma11.melody	@ltx/en_us_goadedes/he.a.m8:heAU.ToProstachthen.name
ltx/en_us_goadedes/me.m12.d29:meMA.Kathisma11.mode	@ltx/en_us_goadedes/miscellanea:misc.Mode8
ltx/en_us_goadedes/me.m12.d29:meMA.Kathisma11.text	
ltx/en_us_goadedes/me.m12.d29:meMA.Kathisma21.greekmelody	@ltx/en_us_goadedes/he.a.m8:heAU.TinSofianKaiLogon.greekname
ltx/en_us_goadedes/me.m12.d29:meMA.Kathisma21.incipit	…
ltx/en_us_goadedes/me.m12.d29:meMA.Kathisma21.melody	@ltx/en_us_goadedes/he.a.m8:heAU.TinSofianKaiLogon.name
ltx/en_us_goadedes/me.m12.d29:meMA.Kathisma21.mode	@ltx/en_us_goadedes/miscellanea:misc.Mode8
ltx/en_us_goadedes/me.m12.d29:meMA.Kathisma21.text	
ltx/en_us_goadedes/me.m12.d29:meMA.Kontakion1.greekmelody	@ltx/en_us_goadedes/he.a.m4:heAU.EpefanisSimeron.greekname
ltx/en_us_goadedes/me.m12.d29:meMA.Kontakion1.incipit	…
ltx/en_us_goadedes/me.m12.d29:meMA.Kontakion1.melody	@ltx/en_us_goadedes/he.a.m4:heAU.EpefanisSimeron.name
ltx/en_us_goadedes/me.m12.d29:meMA.Kontakion1.mode	@ltx/en_us_goadedes/miscellanea:misc.Mode4
ltx/en_us_goadedes/me.m12.d29:meMA.Kontakion1.text	
ltx/en_us_goadedes/me.m12.d29:meMA.Lauds1.greekmelody	@ltx/en_us_goadedes/he.a.m8:heAU.OTouParadoxou.greekname
ltx/en_us_goadedes/me.m12.d29:meMA.Lauds1.incipit	…
ltx/en_us_goadedes/me.m12.d29:meMA.Lauds1.melody	@ltx/en_us_goadedes/he.a.m8:heAU.OTouParadoxou.name
ltx/en_us_goadedes/me.m12.d29:meMA.Lauds1.mode	@ltx/en_us_goadedes/miscellanea:misc.Mode8
ltx/en_us_goadedes/me.m12.d29:meMA.Lauds1.text	
ltx/en_us_goadedes/me.m12.d29:meMA.Lauds2.incipit	…
ltx/en_us_goadedes/me.m12.d29:meMA.Lauds2.melody	@ltx/en_us_goadedes/he.a.m8:heAU.OTouParadoxou.name
ltx/en_us_goadedes/me.m12.d29:meMA.Lauds2.mode	@ltx/en_us_goadedes/miscellanea:misc.Mode8
ltx/en_us_goadedes/me.m12.d29:meMA.Lauds2.text	
ltx/en_us_goadedes/me.m12.d29:meMA.Lauds3.incipit	…
ltx/en_us_goadedes/me.m12.d29:meMA.Lauds3.melody	@ltx/en_us_goadedes/he.a.m8:heAU.OTouParadoxou.name
ltx/en_us_goadedes/me.m12.d29:meMA.Lauds3.mode	@ltx/en_us_goadedes/miscellanea:misc.Mode8
ltx/en_us_goadedes/me.m12.d29:meMA.Lauds3.text	
ltx/en_us_goadedes/me.m12.d29:meMA.LaudsBoth.incipit	@ltx/en_us_goadedes/me.m12.d26:meVE.AposGlory.incipit
ltx/en_us_goadedes/me.m12.d29:meMA.LaudsBoth.melody	
ltx/en_us_goadedes/me.m12.d29:meMA.LaudsBoth.mode	@ltx/en_us_goadedes/miscellanea:misc.Mode8
ltx/en_us_goadedes/me.m12.d29:meMA.LaudsBoth.text	@ltx/en_us_goadedes/me.m12.d26:meVE.AposGlory.text
ltx/en_us_goadedes/me.m12.d29:meMA.LaudsGlory.incipit	…
ltx/en_us_goadedes/me.m12.d29:meMA.LaudsGlory.melody	
ltx/en_us_goadedes/me.m12.d29:meMA.LaudsGlory.mode	@ltx/en_us_goadedes/miscellanea:misc.Mode8
ltx/en_us_goadedes/me.m12.d29:meMA.LaudsGlory.text	
ltx/en_us_goadedes/me.m12.d29:meMA.Ode1C11.greekmelody	@ltx/en_us_goadedes/he.h.m6:heHE.OsEnIpeiroPezefsas.greekname
ltx/en_us_goadedes/me.m12.d29:meMA.Ode1C11.incipit	…
ltx/en_us_goadedes/me.m12.d29:meMA.Ode1C11.melody	@ltx/en_us_goadedes/he.h.m6:heHE.OsEnIpeiroPezefsas.name
ltx/en_us_goadedes/me.m12.d29:meMA.Ode1C11.mode	@ltx/en_us_goadedes/miscellanea:misc.Mode6
ltx/en_us_goadedes/me.m12.d29:meMA.Ode1C11.ode	@ltx/en_us_goadedes/miscellanea:misc.Ode1
ltx/en_us_goadedes/me.m12.d29:meMA.Ode1C11.text	
ltx/en_us_goadedes/me.m12.d29:meMA.Ode1C12.incipit	…
ltx/en_us_goadedes/me.m12.d29:meMA.Ode1C12.melody	@ltx/en_us_goadedes/he.h.m6:heHE.OsEnIpeiroPezefsas.name
ltx/en_us_goadedes/me.m12.d29:meMA.Ode1C12.mode	@ltx/en_us_goadedes/miscellanea:misc.Mode6
ltx/en_us_goadedes/me.m12.d29:meMA.Ode1C12.ode	@ltx/en_us_goadedes/miscellanea:misc.Ode1
ltx/en_us_goadedes/me.m12.d29:meMA.Ode1C12.text	
ltx/en_us_goadedes/me.m12.d29:meMA.Ode1C13.incipit	…
ltx/en_us_goadedes/me.m12.d29:meMA.Ode1C13.melody	@ltx/en_us_goadedes/he.h.m6:heHE.OsEnIpeiroPezefsas.name
ltx/en_us_goadedes/me.m12.d29:meMA.Ode1C13.mode	@ltx/en_us_goadedes/miscellanea:misc.Mode6
ltx/en_us_goadedes/me.m12.d29:meMA.Ode1C13.ode	@ltx/en_us_goadedes/miscellanea:misc.Ode1
ltx/en_us_goadedes/me.m12.d29:meMA.Ode1C13.text	
ltx/en_us_goadedes/me.m12.d29:meMA.Ode1C14.incipit	…
ltx/en_us_goadedes/me.m12.d29:meMA.Ode1C14.melody	@ltx/en_us_goadedes/he.h.m6:heHE.OsEnIpeiroPezefsas.name
ltx/en_us_goadedes/me.m12.d29:meMA.Ode1C14.mode	@ltx/en_us_goadedes/miscellanea:misc.Mode6
ltx/en_us_goadedes/me.m12.d29:meMA.Ode1C14.ode	@ltx/en_us_goadedes/miscellanea:misc.Ode1
ltx/en_us_goadedes/me.m12.d29:meMA.Ode1C14.text	
ltx/en_us_goadedes/me.m12.d29:meMA.Ode1C1T.incipit	…
ltx/en_us_goadedes/me.m12.d29:meMA.Ode1C1T.melody	@ltx/en_us_goadedes/he.h.m6:heHE.OsEnIpeiroPezefsas.name
ltx/en_us_goadedes/me.m12.d29:meMA.Ode1C1T.mode	@ltx/en_us_goadedes/miscellanea:misc.Mode6
ltx/en_us_goadedes/me.m12.d29:meMA.Ode1C1T.ode	@ltx/en_us_goadedes/miscellanea:misc.Ode1
ltx/en_us_goadedes/me.m12.d29:meMA.Ode1C1T.text	
ltx/en_us_goadedes/me.m12.d29:meMA.Ode3C11.greekmelody	@ltx/en_us_goadedes/he.h.m6:heHE.OukEstinAgios.greekname
ltx/en_us_goadedes/me.m12.d29:meMA.Ode3C11.incipit	…
ltx/en_us_goadedes/me.m12.d29:meMA.Ode3C11.melody	@ltx/en_us_goadedes/he.h.m6:heHE.OukEstinAgios.name
ltx/en_us_goadedes/me.m12.d29:meMA.Ode3C11.mode	@ltx/en_us_goadedes/miscellanea:misc.Mode6
ltx/en_us_goadedes/me.m12.d29:meMA.Ode3C11.ode	@ltx/en_us_goadedes/miscellanea:misc.Ode3
ltx/en_us_goadedes/me.m12.d29:meMA.Ode3C11.text	
ltx/en_us_goadedes/me.m12.d29:meMA.Ode3C12.incipit	…
ltx/en_us_goadedes/me.m12.d29:meMA.Ode3C12.melody	@ltx/en_us_goadedes/he.h.m6:heHE.OukEstinAgios.name
ltx/en_us_goadedes/me.m12.d29:meMA.Ode3C12.mode	@ltx/en_us_goadedes/miscellanea:misc.Mode6
ltx/en_us_goadedes/me.m12.d29:meMA.Ode3C12.ode	@ltx/en_us_goadedes/miscellanea:misc.Ode3
ltx/en_us_goadedes/me.m12.d29:meMA.Ode3C12.text	
ltx/en_us_goadedes/me.m12.d29:meMA.Ode3C13.incipit	…
ltx/en_us_goadedes/me.m12.d29:meMA.Ode3C13.melody	@ltx/en_us_goadedes/he.h.m6:heHE.OukEstinAgios.name
ltx/en_us_goadedes/me.m12.d29:meMA.Ode3C13.mode	@ltx/en_us_goadedes/miscellanea:misc.Mode6
ltx/en_us_goadedes/me.m12.d29:meMA.Ode3C13.ode	@ltx/en_us_goadedes/miscellanea:misc.Ode3
ltx/en_us_goadedes/me.m12.d29:meMA.Ode3C13.text	
ltx/en_us_goadedes/me.m12.d29:meMA.Ode3C14.incipit	…
ltx/en_us_goadedes/me.m12.d29:meMA.Ode3C14.melody	@ltx/en_us_goadedes/he.h.m6:heHE.OukEstinAgios.name
ltx/en_us_goadedes/me.m12.d29:meMA.Ode3C14.mode	@ltx/en_us_goadedes/miscellanea:misc.Mode6
ltx/en_us_goadedes/me.m12.d29:meMA.Ode3C14.ode	@ltx/en_us_goadedes/miscellanea:misc.Ode3
ltx/en_us_goadedes/me.m12.d29:meMA.Ode3C14.text	
ltx/en_us_goadedes/me.m12.d29:meMA.Ode3C1T.incipit	…
ltx/en_us_goadedes/me.m12.d29:meMA.Ode3C1T.melody	@ltx/en_us_goadedes/he.h.m6:heHE.OukEstinAgios.name
ltx/en_us_goadedes/me.m12.d29:meMA.Ode3C1T.mode	@ltx/en_us_goadedes/miscellanea:misc.Mode6
ltx/en_us_goadedes/me.m12.d29:meMA.Ode3C1T.ode	@ltx/en_us_goadedes/miscellanea:misc.Ode3
ltx/en_us_goadedes/me.m12.d29:meMA.Ode3C1T.text	
ltx/en_us_goadedes/me.m12.d29:meMA.Ode3H.greekmelody	@ltx/en_us_goadedes/he.h.m6:heHE.OukEstinAgios.greekname
ltx/en_us_goadedes/me.m12.d29:meMA.Ode3H.incipit	@ltx/en_us_goadedes/he.h.m6:heHE.OukEstinAgios.incipit
ltx/en_us_goadedes/me.m12.d29:meMA.Ode3H.melody	@ltx/en_us_goadedes/he.h.m6:heHE.OukEstinAgios.melody
ltx/en_us_goadedes/me.m12.d29:meMA.Ode3H.mode	@ltx/en_us_goadedes/miscellanea:misc.Mode6
ltx/en_us_goadedes/me.m12.d29:meMA.Ode3H.ode	@ltx/en_us_goadedes/miscellanea:misc.Ode3
ltx/en_us_goadedes/me.m12.d29:meMA.Ode3H.text	@ltx/en_us_goadedes/he.h.m6:heHE.OukEstinAgios.text
ltx/en_us_goadedes/me.m12.d29:meMA.Ode3Kathisma1.greekmelody	@ltx/en_us_goadedes/he.a.m4:heAU.EpefanisSimeron.greekname
ltx/en_us_goadedes/me.m12.d29:meMA.Ode3Kathisma1.incipit	…
ltx/en_us_goadedes/me.m12.d29:meMA.Ode3Kathisma1.melody	@ltx/en_us_goadedes/he.a.m4:heAU.EpefanisSimeron.name
ltx/en_us_goadedes/me.m12.d29:meMA.Ode3Kathisma1.mode	@ltx/en_us_goadedes/miscellanea:misc.Mode4
ltx/en_us_goadedes/me.m12.d29:meMA.Ode3Kathisma1.text	
ltx/en_us_goadedes/me.m12.d29:meMA.Ode3Kathisma2.greekmelody	@ltx/en_us_goadedes/he.a.m4:heAU.TachyProkatalave.greekname
ltx/en_us_goadedes/me.m12.d29:meMA.Ode3Kathisma2.incipit	…
ltx/en_us_goadedes/me.m12.d29:meMA.Ode3Kathisma2.melody	@ltx/en_us_goadedes/he.a.m4:heAU.TachyProkatalave.name
ltx/en_us_goadedes/me.m12.d29:meMA.Ode3Kathisma2.mode	@ltx/en_us_goadedes/miscellanea:misc.Mode4
ltx/en_us_goadedes/me.m12.d29:meMA.Ode3Kathisma2.text	
ltx/en_us_goadedes/me.m12.d29:meMA.Ode3Kathisma3.greekmelody	@ltx/en_us_goadedes/he.a.m4:heAU.TachyProkatalave.greekname
ltx/en_us_goadedes/me.m12.d29:meMA.Ode3Kathisma3.incipit	…
ltx/en_us_goadedes/me.m12.d29:meMA.Ode3Kathisma3.melody	@ltx/en_us_goadedes/he.a.m4:heAU.TachyProkatalave.name
ltx/en_us_goadedes/me.m12.d29:meMA.Ode3Kathisma3.mode	@ltx/en_us_goadedes/miscellanea:misc.Mode4
ltx/en_us_goadedes/me.m12.d29:meMA.Ode3Kathisma3.text	
ltx/en_us_goadedes/me.m12.d29:meMA.Ode4C11.greekmelody	@ltx/en_us_goadedes/he.h.m6:heHE.ChristosMouDynamis.greekname
ltx/en_us_goadedes/me.m12.d29:meMA.Ode4C11.incipit	…
ltx/en_us_goadedes/me.m12.d29:meMA.Ode4C11.melody	@ltx/en_us_goadedes/he.h.m6:heHE.ChristosMouDynamis.name
ltx/en_us_goadedes/me.m12.d29:meMA.Ode4C11.mode	@ltx/en_us_goadedes/miscellanea:misc.Mode6
ltx/en_us_goadedes/me.m12.d29:meMA.Ode4C11.ode	@ltx/en_us_goadedes/miscellanea:misc.Ode4
ltx/en_us_goadedes/me.m12.d29:meMA.Ode4C11.text	
ltx/en_us_goadedes/me.m12.d29:meMA.Ode4C12.incipit	…
ltx/en_us_goadedes/me.m12.d29:meMA.Ode4C12.melody	@ltx/en_us_goadedes/he.h.m6:heHE.ChristosMouDynamis.name
ltx/en_us_goadedes/me.m12.d29:meMA.Ode4C12.mode	@ltx/en_us_goadedes/miscellanea:misc.Mode6
ltx/en_us_goadedes/me.m12.d29:meMA.Ode4C12.ode	@ltx/en_us_goadedes/miscellanea:misc.Ode4
ltx/en_us_goadedes/me.m12.d29:meMA.Ode4C12.text	
ltx/en_us_goadedes/me.m12.d29:meMA.Ode4C13.incipit	…
ltx/en_us_goadedes/me.m12.d29:meMA.Ode4C13.melody	@ltx/en_us_goadedes/he.h.m6:heHE.ChristosMouDynamis.name
ltx/en_us_goadedes/me.m12.d29:meMA.Ode4C13.mode	@ltx/en_us_goadedes/miscellanea:misc.Mode6
ltx/en_us_goadedes/me.m12.d29:meMA.Ode4C13.ode	@ltx/en_us_goadedes/miscellanea:misc.Ode4
ltx/en_us_goadedes/me.m12.d29:meMA.Ode4C13.text	
ltx/en_us_goadedes/me.m12.d29:meMA.Ode4C14.incipit	…
ltx/en_us_goadedes/me.m12.d29:meMA.Ode4C14.melody	@ltx/en_us_goadedes/he.h.m6:heHE.ChristosMouDynamis.name
ltx/en_us_goadedes/me.m12.d29:meMA.Ode4C14.mode	@ltx/en_us_goadedes/miscellanea:misc.Mode6
ltx/en_us_goadedes/me.m12.d29:meMA.Ode4C14.ode	@ltx/en_us_goadedes/miscellanea:misc.Ode4
ltx/en_us_goadedes/me.m12.d29:meMA.Ode4C14.text	
ltx/en_us_goadedes/me.m12.d29:meMA.Ode4C1T.incipit	…
ltx/en_us_goadedes/me.m12.d29:meMA.Ode4C1T.melody	@ltx/en_us_goadedes/he.h.m6:heHE.ChristosMouDynamis.name
ltx/en_us_goadedes/me.m12.d29:meMA.Ode4C1T.mode	@ltx/en_us_goadedes/miscellanea:misc.Mode6
ltx/en_us_goadedes/me.m12.d29:meMA.Ode4C1T.ode	@ltx/en_us_goadedes/miscellanea:misc.Ode4
ltx/en_us_goadedes/me.m12.d29:meMA.Ode4C1T.text	
ltx/en_us_goadedes/me.m12.d29:meMA.Ode5C11.greekmelody	@ltx/en_us_goadedes/he.h.m6:heHE.ToTheioFengeiSou.greekname
ltx/en_us_goadedes/me.m12.d29:meMA.Ode5C11.incipit	…
ltx/en_us_goadedes/me.m12.d29:meMA.Ode5C11.melody	@ltx/en_us_goadedes/he.h.m6:heHE.ToTheioFengeiSou.name
ltx/en_us_goadedes/me.m12.d29:meMA.Ode5C11.mode	@ltx/en_us_goadedes/miscellanea:misc.Mode6
ltx/en_us_goadedes/me.m12.d29:meMA.Ode5C11.ode	@ltx/en_us_goadedes/miscellanea:misc.Ode5
ltx/en_us_goadedes/me.m12.d29:meMA.Ode5C11.text	
ltx/en_us_goadedes/me.m12.d29:meMA.Ode5C12.incipit	…
ltx/en_us_goadedes/me.m12.d29:meMA.Ode5C12.melody	@ltx/en_us_goadedes/he.h.m6:heHE.ToTheioFengeiSou.name
ltx/en_us_goadedes/me.m12.d29:meMA.Ode5C12.mode	@ltx/en_us_goadedes/miscellanea:misc.Mode6
ltx/en_us_goadedes/me.m12.d29:meMA.Ode5C12.ode	@ltx/en_us_goadedes/miscellanea:misc.Ode5
ltx/en_us_goadedes/me.m12.d29:meMA.Ode5C12.text	
ltx/en_us_goadedes/me.m12.d29:meMA.Ode5C13.incipit	…
ltx/en_us_goadedes/me.m12.d29:meMA.Ode5C13.melody	@ltx/en_us_goadedes/he.h.m6:heHE.ToTheioFengeiSou.name
ltx/en_us_goadedes/me.m12.d29:meMA.Ode5C13.mode	@ltx/en_us_goadedes/miscellanea:misc.Mode6
ltx/en_us_goadedes/me.m12.d29:meMA.Ode5C13.ode	@ltx/en_us_goadedes/miscellanea:misc.Ode5
ltx/en_us_goadedes/me.m12.d29:meMA.Ode5C13.text	
ltx/en_us_goadedes/me.m12.d29:meMA.Ode5C1T.incipit	…
ltx/en_us_goadedes/me.m12.d29:meMA.Ode5C1T.melody	@ltx/en_us_goadedes/he.h.m6:heHE.ToTheioFengeiSou.name
ltx/en_us_goadedes/me.m12.d29:meMA.Ode5C1T.mode	@ltx/en_us_goadedes/miscellanea:misc.Mode6
ltx/en_us_goadedes/me.m12.d29:meMA.Ode5C1T.ode	@ltx/en_us_goadedes/miscellanea:misc.Ode5
ltx/en_us_goadedes/me.m12.d29:meMA.Ode5C1T.text	
ltx/en_us_goadedes/me.m12.d29:meMA.Ode6C11.greekmelody	@ltx/en_us_goadedes/he.h.m6:heHE.TouViouTinThalassan.greekname
ltx/en_us_goadedes/me.m12.d29:meMA.Ode6C11.incipit	…
ltx/en_us_goadedes/me.m12.d29:meMA.Ode6C11.melody	@ltx/en_us_goadedes/he.h.m6:heHE.TouViouTinThalassan.name
ltx/en_us_goadedes/me.m12.d29:meMA.Ode6C11.mode	@ltx/en_us_goadedes/miscellanea:misc.Mode6
ltx/en_us_goadedes/me.m12.d29:meMA.Ode6C11.ode	@ltx/en_us_goadedes/miscellanea:misc.Ode6
ltx/en_us_goadedes/me.m12.d29:meMA.Ode6C11.text	
ltx/en_us_goadedes/me.m12.d29:meMA.Ode6C12.incipit	…
ltx/en_us_goadedes/me.m12.d29:meMA.Ode6C12.melody	@ltx/en_us_goadedes/he.h.m6:heHE.TouViouTinThalassan.name
ltx/en_us_goadedes/me.m12.d29:meMA.Ode6C12.mode	@ltx/en_us_goadedes/miscellanea:misc.Mode6
ltx/en_us_goadedes/me.m12.d29:meMA.Ode6C12.ode	@ltx/en_us_goadedes/miscellanea:misc.Ode6
ltx/en_us_goadedes/me.m12.d29:meMA.Ode6C12.text	
ltx/en_us_goadedes/me.m12.d29:meMA.Ode6C13.incipit	…
ltx/en_us_goadedes/me.m12.d29:meMA.Ode6C13.melody	@ltx/en_us_goadedes/he.h.m6:heHE.TouViouTinThalassan.name
ltx/en_us_goadedes/me.m12.d29:meMA.Ode6C13.mode	@ltx/en_us_goadedes/miscellanea:misc.Mode6
ltx/en_us_goadedes/me.m12.d29:meMA.Ode6C13.ode	@ltx/en_us_goadedes/miscellanea:misc.Ode6
ltx/en_us_goadedes/me.m12.d29:meMA.Ode6C13.text	
ltx/en_us_goadedes/me.m12.d29:meMA.Ode6C1T.incipit	…
ltx/en_us_goadedes/me.m12.d29:meMA.Ode6C1T.melody	@ltx/en_us_goadedes/he.h.m6:heHE.TouViouTinThalassan.name
ltx/en_us_goadedes/me.m12.d29:meMA.Ode6C1T.mode	@ltx/en_us_goadedes/miscellanea:misc.Mode6
ltx/en_us_goadedes/me.m12.d29:meMA.Ode6C1T.ode	@ltx/en_us_goadedes/miscellanea:misc.Ode6
ltx/en_us_goadedes/me.m12.d29:meMA.Ode6C1T.text	
ltx/en_us_goadedes/me.m12.d29:meMA.Ode6H.greekmelody	@ltx/en_us_goadedes/he.h.m6:heHE.TouViouTinThalassan.greekname
ltx/en_us_goadedes/me.m12.d29:meMA.Ode6H.incipit	@ltx/en_us_goadedes/he.h.m6:heHE.TouViouTinThalassan.incipit
ltx/en_us_goadedes/me.m12.d29:meMA.Ode6H.melody	@ltx/en_us_goadedes/he.h.m6:heHE.TouViouTinThalassan.melody
ltx/en_us_goadedes/me.m12.d29:meMA.Ode6H.mode	@ltx/en_us_goadedes/miscellanea:misc.Mode6
ltx/en_us_goadedes/me.m12.d29:meMA.Ode6H.ode	@ltx/en_us_goadedes/miscellanea:misc.Ode6
ltx/en_us_goadedes/me.m12.d29:meMA.Ode6H.text	@ltx/en_us_goadedes/he.h.m6:heHE.TouViouTinThalassan.text
ltx/en_us_goadedes/me.m12.d29:meMA.Ode7C11.greekmelody	@ltx/en_us_goadedes/he.h.m6:heHE.DrosovolonMenTinKaminon.greekname
ltx/en_us_goadedes/me.m12.d29:meMA.Ode7C11.incipit	…
ltx/en_us_goadedes/me.m12.d29:meMA.Ode7C11.melody	@ltx/en_us_goadedes/he.h.m6:heHE.DrosovolonMenTinKaminon.name
ltx/en_us_goadedes/me.m12.d29:meMA.Ode7C11.mode	@ltx/en_us_goadedes/miscellanea:misc.Mode6
ltx/en_us_goadedes/me.m12.d29:meMA.Ode7C11.ode	@ltx/en_us_goadedes/miscellanea:misc.Ode7
ltx/en_us_goadedes/me.m12.d29:meMA.Ode7C11.text	
ltx/en_us_goadedes/me.m12.d29:meMA.Ode7C12.incipit	…
ltx/en_us_goadedes/me.m12.d29:meMA.Ode7C12.melody	@ltx/en_us_goadedes/he.h.m6:heHE.DrosovolonMenTinKaminon.name
ltx/en_us_goadedes/me.m12.d29:meMA.Ode7C12.mode	@ltx/en_us_goadedes/miscellanea:misc.Mode6
ltx/en_us_goadedes/me.m12.d29:meMA.Ode7C12.ode	@ltx/en_us_goadedes/miscellanea:misc.Ode7
ltx/en_us_goadedes/me.m12.d29:meMA.Ode7C12.text	
ltx/en_us_goadedes/me.m12.d29:meMA.Ode7C13.incipit	…
ltx/en_us_goadedes/me.m12.d29:meMA.Ode7C13.melody	@ltx/en_us_goadedes/he.h.m6:heHE.DrosovolonMenTinKaminon.name
ltx/en_us_goadedes/me.m12.d29:meMA.Ode7C13.mode	@ltx/en_us_goadedes/miscellanea:misc.Mode6
ltx/en_us_goadedes/me.m12.d29:meMA.Ode7C13.ode	@ltx/en_us_goadedes/miscellanea:misc.Ode7
ltx/en_us_goadedes/me.m12.d29:meMA.Ode7C13.text	
ltx/en_us_goadedes/me.m12.d29:meMA.Ode7C14.incipit	…
ltx/en_us_goadedes/me.m12.d29:meMA.Ode7C14.melody	@ltx/en_us_goadedes/he.h.m6:heHE.DrosovolonMenTinKaminon.name
ltx/en_us_goadedes/me.m12.d29:meMA.Ode7C14.mode	@ltx/en_us_goadedes/miscellanea:misc.Mode6
ltx/en_us_goadedes/me.m12.d29:meMA.Ode7C14.ode	@ltx/en_us_goadedes/miscellanea:misc.Ode7
ltx/en_us_goadedes/me.m12.d29:meMA.Ode7C14.text	
ltx/en_us_goadedes/me.m12.d29:meMA.Ode7C1T.incipit	…
ltx/en_us_goadedes/me.m12.d29:meMA.Ode7C1T.melody	@ltx/en_us_goadedes/he.h.m6:heHE.DrosovolonMenTinKaminon.name
ltx/en_us_goadedes/me.m12.d29:meMA.Ode7C1T.mode	@ltx/en_us_goadedes/miscellanea:misc.Mode6
ltx/en_us_goadedes/me.m12.d29:meMA.Ode7C1T.ode	@ltx/en_us_goadedes/miscellanea:misc.Ode7
ltx/en_us_goadedes/me.m12.d29:meMA.Ode7C1T.text	
ltx/en_us_goadedes/me.m12.d29:meMA.Ode8C11.greekmelody	@ltx/en_us_goadedes/he.h.m6:heHE.EkFlogosToisOsiois.greekname
ltx/en_us_goadedes/me.m12.d29:meMA.Ode8C11.incipit	…
ltx/en_us_goadedes/me.m12.d29:meMA.Ode8C11.melody	@ltx/en_us_goadedes/he.h.m6:heHE.EkFlogosToisOsiois.name
ltx/en_us_goadedes/me.m12.d29:meMA.Ode8C11.mode	@ltx/en_us_goadedes/miscellanea:misc.Mode6
ltx/en_us_goadedes/me.m12.d29:meMA.Ode8C11.ode	@ltx/en_us_goadedes/miscellanea:misc.Ode8
ltx/en_us_goadedes/me.m12.d29:meMA.Ode8C11.text	
ltx/en_us_goadedes/me.m12.d29:meMA.Ode8C12.incipit	…
ltx/en_us_goadedes/me.m12.d29:meMA.Ode8C12.melody	@ltx/en_us_goadedes/he.h.m6:heHE.EkFlogosToisOsiois.name
ltx/en_us_goadedes/me.m12.d29:meMA.Ode8C12.mode	@ltx/en_us_goadedes/miscellanea:misc.Mode6
ltx/en_us_goadedes/me.m12.d29:meMA.Ode8C12.ode	@ltx/en_us_goadedes/miscellanea:misc.Ode8
ltx/en_us_goadedes/me.m12.d29:meMA.Ode8C12.text	
ltx/en_us_goadedes/me.m12.d29:meMA.Ode8C13.incipit	…
ltx/en_us_goadedes/me.m12.d29:meMA.Ode8C13.melody	@ltx/en_us_goadedes/he.h.m6:heHE.EkFlogosToisOsiois.name
ltx/en_us_goadedes/me.m12.d29:meMA.Ode8C13.mode	@ltx/en_us_goadedes/miscellanea:misc.Mode6
ltx/en_us_goadedes/me.m12.d29:meMA.Ode8C13.ode	@ltx/en_us_goadedes/miscellanea:misc.Ode8
ltx/en_us_goadedes/me.m12.d29:meMA.Ode8C13.text	
ltx/en_us_goadedes/me.m12.d29:meMA.Ode8C14.incipit	…
ltx/en_us_goadedes/me.m12.d29:meMA.Ode8C14.melody	@ltx/en_us_goadedes/he.h.m6:heHE.EkFlogosToisOsiois.name
ltx/en_us_goadedes/me.m12.d29:meMA.Ode8C14.mode	@ltx/en_us_goadedes/miscellanea:misc.Mode6
ltx/en_us_goadedes/me.m12.d29:meMA.Ode8C14.ode	@ltx/en_us_goadedes/miscellanea:misc.Ode8
ltx/en_us_goadedes/me.m12.d29:meMA.Ode8C14.text	
ltx/en_us_goadedes/me.m12.d29:meMA.Ode8C1T.incipit	…
ltx/en_us_goadedes/me.m12.d29:meMA.Ode8C1T.melody	@ltx/en_us_goadedes/he.h.m6:heHE.EkFlogosToisOsiois.name
ltx/en_us_goadedes/me.m12.d29:meMA.Ode8C1T.mode	@ltx/en_us_goadedes/miscellanea:misc.Mode6
ltx/en_us_goadedes/me.m12.d29:meMA.Ode8C1T.ode	@ltx/en_us_goadedes/miscellanea:misc.Ode8
ltx/en_us_goadedes/me.m12.d29:meMA.Ode8C1T.text	
ltx/en_us_goadedes/me.m12.d29:meMA.Ode8H.greekmelody	@ltx/en_us_goadedes/he.h.m6:heHE.EkFlogosToisOsiois.greekname
ltx/en_us_goadedes/me.m12.d29:meMA.Ode8H.incipit	@ltx/en_us_goadedes/he.h.m6:heHE.EkFlogosToisOsiois.incipit
ltx/en_us_goadedes/me.m12.d29:meMA.Ode8H.melody	@ltx/en_us_goadedes/he.h.m6:heHE.EkFlogosToisOsiois.melody
ltx/en_us_goadedes/me.m12.d29:meMA.Ode8H.mode	@ltx/en_us_goadedes/miscellanea:misc.Mode6
ltx/en_us_goadedes/me.m12.d29:meMA.Ode8H.ode	@ltx/en_us_goadedes/miscellanea:misc.Ode8
ltx/en_us_goadedes/me.m12.d29:meMA.Ode8H.text	@ltx/en_us_goadedes/he.h.m6:heHE.EkFlogosToisOsiois.text
ltx/en_us_goadedes/me.m12.d29:meMA.Ode9C11.greekmelody	@ltx/en_us_goadedes/he.h.m6:heHE.TheonAnthropois.greekname
ltx/en_us_goadedes/me.m12.d29:meMA.Ode9C11.incipit	…
ltx/en_us_goadedes/me.m12.d29:meMA.Ode9C11.melody	@ltx/en_us_goadedes/he.h.m6:heHE.TheonAnthropois.name
ltx/en_us_goadedes/me.m12.d29:meMA.Ode9C11.mode	@ltx/en_us_goadedes/miscellanea:misc.Mode6
ltx/en_us_goadedes/me.m12.d29:meMA.Ode9C11.ode	@ltx/en_us_goadedes/miscellanea:misc.Ode9
ltx/en_us_goadedes/me.m12.d29:meMA.Ode9C11.text	
ltx/en_us_goadedes/me.m12.d29:meMA.Ode9C12.incipit	…
ltx/en_us_goadedes/me.m12.d29:meMA.Ode9C12.melody	@ltx/en_us_goadedes/he.h.m6:heHE.TheonAnthropois.name
ltx/en_us_goadedes/me.m12.d29:meMA.Ode9C12.mode	@ltx/en_us_goadedes/miscellanea:misc.Mode6
ltx/en_us_goadedes/me.m12.d29:meMA.Ode9C12.ode	@ltx/en_us_goadedes/miscellanea:misc.Ode9
ltx/en_us_goadedes/me.m12.d29:meMA.Ode9C12.text	
ltx/en_us_goadedes/me.m12.d29:meMA.Ode9C13.incipit	…
ltx/en_us_goadedes/me.m12.d29:meMA.Ode9C13.melody	@ltx/en_us_goadedes/he.h.m6:heHE.TheonAnthropois.name
ltx/en_us_goadedes/me.m12.d29:meMA.Ode9C13.mode	@ltx/en_us_goadedes/miscellanea:misc.Mode6
ltx/en_us_goadedes/me.m12.d29:meMA.Ode9C13.ode	@ltx/en_us_goadedes/miscellanea:misc.Ode9
ltx/en_us_goadedes/me.m12.d29:meMA.Ode9C13.text	
ltx/en_us_goadedes/me.m12.d29:meMA.Ode9C14.incipit	…
ltx/en_us_goadedes/me.m12.d29:meMA.Ode9C14.melody	@ltx/en_us_goadedes/he.h.m6:heHE.TheonAnthropois.name
ltx/en_us_goadedes/me.m12.d29:meMA.Ode9C14.mode	@ltx/en_us_goadedes/miscellanea:misc.Mode6
ltx/en_us_goadedes/me.m12.d29:meMA.Ode9C14.ode	@ltx/en_us_goadedes/miscellanea:misc.Ode9
ltx/en_us_goadedes/me.m12.d29:meMA.Ode9C14.text	
ltx/en_us_goadedes/me.m12.d29:meMA.Ode9C1T.incipit	…
ltx/en_us_goadedes/me.m12.d29:meMA.Ode9C1T.melody	@ltx/en_us_goadedes/he.h.m6:heHE.TheonAnthropois.name
ltx/en_us_goadedes/me.m12.d29:meMA.Ode9C1T.mode	@ltx/en_us_goadedes/miscellanea:misc.Mode6
ltx/en_us_goadedes/me.m12.d29:meMA.Ode9C1T.ode	@ltx/en_us_goadedes/miscellanea:misc.Ode9
ltx/en_us_goadedes/me.m12.d29:meMA.Ode9C1T.text	
ltx/en_us_goadedes/me.m12.d29:meMA.Ode9H.greekmelody	@ltx/en_us_goadedes/he.h.m6:heHE.TheonAnthropois.greekname
ltx/en_us_goadedes/me.m12.d29:meMA.Ode9H.incipit	@ltx/en_us_goadedes/he.h.m6:heHE.TheonAnthropois.incipit
ltx/en_us_goadedes/me.m12.d29:meMA.Ode9H.melody	@ltx/en_us_goadedes/he.h.m6:heHE.TheonAnthropois.melody
ltx/en_us_goadedes/me.m12.d29:meMA.Ode9H.mode	@ltx/en_us_goadedes/miscellanea:misc.Mode6
ltx/en_us_goadedes/me.m12.d29:meMA.Ode9H.ode	@ltx/en_us_goadedes/miscellanea:misc.Ode9
ltx/en_us_goadedes/me.m12.d29:meMA.Ode9H.text	@ltx/en_us_goadedes/he.h.m6:heHE.TheonAnthropois.text
ltx/en_us_goadedes/me.m12.d29:meMA.Oikos1.text	
ltx/en_us_goadedes/me.m12.d29:meVE.Apolytikion1.incipit	@ltx/en_us_goadedes/he.ga:heGA.TasAlgidonas.incipit
ltx/en_us_goadedes/me.m12.d29:meVE.Apolytikion1.melody	
ltx/en_us_goadedes/me.m12.d29:meVE.Apolytikion1.mode	@ltx/en_us_goadedes/miscellanea:misc.Mode1
ltx/en_us_goadedes/me.m12.d29:meVE.Apolytikion1.text	@ltx/en_us_goadedes/he.ga:heGA.TasAlgidonas.text
ltx/en_us_goadedes/me.m12.d29:meVE.Apolytikion2ger.greekmelody	@ltx/en_us_goadedes/he.a.m1:heAU.TonTafonSouSotir.greekname
ltx/en_us_goadedes/me.m12.d29:meVE.Apolytikion2ger.incipit	…
ltx/en_us_goadedes/me.m12.d29:meVE.Apolytikion2ger.melody	@ltx/en_us_goadedes/he.a.m1:heAU.TonTafonSouSotir.name
ltx/en_us_goadedes/me.m12.d29:meVE.Apolytikion2ger.mode	@ltx/en_us_goadedes/miscellanea:misc.Mode1
ltx/en_us_goadedes/me.m12.d29:meVE.Apolytikion2ger.poet	@ltx/en_us_goadedes/poets:po.Gerasimou
ltx/en_us_goadedes/me.m12.d29:meVE.Apolytikion2ger.text	
ltx/en_us_goadedes/me.m12.d29:meVE.Apolytikion3ger.greekmelody	@ltx/en_us_goadedes/he.a.m3:heAU.TheiasPisteos.greekname
ltx/en_us_goadedes/me.m12.d29:meVE.Apolytikion3ger.incipit	…
ltx/en_us_goadedes/me.m12.d29:meVE.Apolytikion3ger.melody	@ltx/en_us_goadedes/he.a.m3:heAU.TheiasPisteos.name
ltx/en_us_goadedes/me.m12.d29:meVE.Apolytikion3ger.mode	@ltx/en_us_goadedes/miscellanea:misc.Mode3
ltx/en_us_goadedes/me.m12.d29:meVE.Apolytikion3ger.poet	@ltx/en_us_goadedes/poets:po.Gerasimou
ltx/en_us_goadedes/me.m12.d29:meVE.Apolytikion3ger.text	
ltx/en_us_goadedes/me.m12.d29:meVE.AposBoth.incipit	@ltx/en_us_goadedes/me.m12.d26:meVE.Aposticha2.incipit
ltx/en_us_goadedes/me.m12.d29:meVE.AposBoth.melody	
ltx/en_us_goadedes/me.m12.d29:meVE.AposBoth.mode	@ltx/en_us_goadedes/miscellanea:misc.Mode8
ltx/en_us_goadedes/me.m12.d29:meVE.AposBoth.text	@ltx/en_us_goadedes/me.m12.d26:meVE.Aposticha2.text
ltx/en_us_goadedes/me.m12.d29:meVE.AposGlory.incipit	…
ltx/en_us_goadedes/me.m12.d29:meVE.AposGlory.melody	
ltx/en_us_goadedes/me.m12.d29:meVE.AposGlory.mode	@ltx/en_us_goadedes/miscellanea:misc.Mode8
ltx/en_us_goadedes/me.m12.d29:meVE.AposGlory.poet	@ltx/en_us_goadedes/poets:po.AndreouKritis
ltx/en_us_goadedes/me.m12.d29:meVE.AposGlory.text	
ltx/en_us_goadedes/me.m12.d29:meVE.Aposticha1.greekmelody	@ltx/en_us_goadedes/he.a.m6:heAU.TriimerosAnestis.greekname
ltx/en_us_goadedes/me.m12.d29:meVE.Aposticha1.incipit	…
ltx/en_us_goadedes/me.m12.d29:meVE.Aposticha1.melody	@ltx/en_us_goadedes/he.a.m6:heAU.TriimerosAnestis.name
ltx/en_us_goadedes/me.m12.d29:meVE.Aposticha1.mode	@ltx/en_us_goadedes/miscellanea:misc.Mode6
ltx/en_us_goadedes/me.m12.d29:meVE.Aposticha1.text	
ltx/en_us_goadedes/me.m12.d29:meVE.Aposticha2.incipit	…
ltx/en_us_goadedes/me.m12.d29:meVE.Aposticha2.melody	@ltx/en_us_goadedes/he.a.m6:heAU.TriimerosAnestis.name
ltx/en_us_goadedes/me.m12.d29:meVE.Aposticha2.mode	@ltx/en_us_goadedes/miscellanea:misc.Mode6
ltx/en_us_goadedes/me.m12.d29:meVE.Aposticha2.text	
ltx/en_us_goadedes/me.m12.d29:meVE.Aposticha3.incipit	…
ltx/en_us_goadedes/me.m12.d29:meVE.Aposticha3.melody	@ltx/en_us_goadedes/he.a.m6:heAU.TriimerosAnestis.name
ltx/en_us_goadedes/me.m12.d29:meVE.Aposticha3.mode	@ltx/en_us_goadedes/miscellanea:misc.Mode6
ltx/en_us_goadedes/me.m12.d29:meVE.Aposticha3.text	
ltx/en_us_goadedes/me.m12.d29:meVE.GeneralApolytikion3.name	
ltx/en_us_goadedes/me.m12.d29:meVE.MM.GeneralApolytikion3.text	@ltx/en_us_goadedes/properties:media.key
ltx/en_us_goadedes/me.m12.d29:meVE.SticBoth.incipit	@ltx/en_us_goadedes/me.m12.d26:meVE.Aposticha1.incipit
ltx/en_us_goadedes/me.m12.d29:meVE.SticBoth.melody	
ltx/en_us_goadedes/me.m12.d29:meVE.SticBoth.mode	@ltx/en_us_goadedes/miscellanea:misc.Mode8
ltx/en_us_goadedes/me.m12.d29:meVE.SticBoth.text	@ltx/en_us_goadedes/me.m12.d26:meVE.Aposticha1.text
ltx/en_us_goadedes/me.m12.d29:meVE.SticGlory.incipit	…
ltx/en_us_goadedes/me.m12.d29:meVE.SticGlory.melody	
ltx/en_us_goadedes/me.m12.d29:meVE.SticGlory.mode	@ltx/en_us_goadedes/miscellanea:misc.Mode8
ltx/en_us_goadedes/me.m12.d29:meVE.SticGlory.poet	@ltx/en_us_goadedes/poets:po.AndreouKritis
ltx/en_us_goadedes/me.m12.d29:meVE.SticGlory.text	
ltx/en_us_goadedes/me.m12.d29:meVE.Stichera01.greekmelody	@ltx/en_us_goadedes/he.a.m4:heAU.OsGennaionEnMartysi.greekname
ltx/en_us_goadedes/me.m12.d29:meVE.Stichera01.incipit	…
ltx/en_us_goadedes/me.m12.d29:meVE.Stichera01.melody	@ltx/en_us_goadedes/he.a.m4:heAU.OsGennaionEnMartysi.name
ltx/en_us_goadedes/me.m12.d29:meVE.Stichera01.mode	@ltx/en_us_goadedes/miscellanea:misc.Mode4
ltx/en_us_goadedes/me.m12.d29:meVE.Stichera01.text	
ltx/en_us_goadedes/me.m12.d29:meVE.Stichera02.incipit	…
ltx/en_us_goadedes/me.m12.d29:meVE.Stichera02.melody	@ltx/en_us_goadedes/he.a.m4:heAU.OsGennaionEnMartysi.name
ltx/en_us_goadedes/me.m12.d29:meVE.Stichera02.mode	@ltx/en_us_goadedes/miscellanea:misc.Mode4
ltx/en_us_goadedes/me.m12.d29:meVE.Stichera02.text	
ltx/en_us_goadedes/me.m12.d29:meVE.Stichera03.incipit	…
ltx/en_us_goadedes/me.m12.d29:meVE.Stichera03.melody	@ltx/en_us_goadedes/he.a.m4:heAU.OsGennaionEnMartysi.name
ltx/en_us_goadedes/me.m12.d29:meVE.Stichera03.mode	@ltx/en_us_goadedes/miscellanea:misc.Mode4
ltx/en_us_goadedes/me.m12.d29:meVE.Stichera03.text	
ltx/en_us_goadedes/me.m12.d29:meVE.Stichera04.greekmelody	@ltx/en_us_goadedes/he.a.m4:heAU.OsGennaionEnMartysi.greekname
ltx/en_us_goadedes/me.m12.d29:meVE.Stichera04.incipit	…
ltx/en_us_goadedes/me.m12.d29:meVE.Stichera04.melody	@ltx/en_us_goadedes/he.a.m4:heAU.OsGennaionEnMartysi.name
ltx/en_us_goadedes/me.m12.d29:meVE.Stichera04.mode	@ltx/en_us_goadedes/miscellanea:misc.Mode4
ltx/en_us_goadedes/me.m12.d29:meVE.Stichera04.text	
ltx/en_us_goadedes/me.m12.d29:meVE.Stichera05.incipit	…
ltx/en_us_goadedes/me.m12.d29:meVE.Stichera05.melody	@ltx/en_us_goadedes/he.a.m4:heAU.OsGennaionEnMartysi.name
ltx/en_us_goadedes/me.m12.d29:meVE.Stichera05.mode	@ltx/en_us_goadedes/miscellanea:misc.Mode4
ltx/en_us_goadedes/me.m12.d29:meVE.Stichera05.text	
ltx/en_us_goadedes/me.m12.d29:meVE.Stichera06.incipit	…
ltx/en_us_goadedes/me.m12.d29:meVE.Stichera06.melody	@ltx/en_us_goadedes/he.a.m4:heAU.OsGennaionEnMartysi.name
ltx/en_us_goadedes/me.m12.d29:meVE.Stichera06.mode	@ltx/en_us_goadedes/miscellanea:misc.Mode4
ltx/en_us_goadedes/me.m12.d29:meVE.Stichera06.text	
