ltx/en_us_goadedes/me.m01.d19:meDA.commemoration.first	
ltx/en_us_goadedes/me.m01.d19:meDA.commemoration.first_name	
ltx/en_us_goadedes/me.m01.d19:meDA.commemoration.first_short	
ltx/en_us_goadedes/me.m01.d19:meDA.commemoration.first_title	@ltx/en_us_goadedes/titles:ti.SaintM
ltx/en_us_goadedes/me.m01.d19:meDA.commemoration.full	
ltx/en_us_goadedes/me.m01.d19:meDA.commemoration.second_name	
ltx/en_us_goadedes/me.m01.d19:meDA.commemoration.second_title	
ltx/en_us_goadedes/me.m01.d19:meDA.date	
ltx/en_us_goadedes/me.m01.d19:meDA.fordate	
ltx/en_us_goadedes/me.m01.d19:meDA.insert1	
ltx/en_us_goadedes/me.m01.d19:meDA.insert2	
ltx/en_us_goadedes/me.m01.d19:meDA.note	
ltx/en_us_goadedes/me.m01.d19:meDA.pdfcoverdate	
ltx/en_us_goadedes/me.m01.d19:meDA.pdfheaderdate	
ltx/en_us_goadedes/me.m01.d19:meHO.commemorations	
ltx/en_us_goadedes/me.m01.d19:meHO.note1	
ltx/en_us_goadedes/me.m01.d19:meHO.note2	
ltx/en_us_goadedes/me.m01.d19:meHO.number	
ltx/en_us_goadedes/me.m01.d19:meHO.rank	
ltx/en_us_goadedes/me.m01.d19:meLE.commemoration1	
ltx/en_us_goadedes/me.m01.d19:meLE.commemoration2	
ltx/en_us_goadedes/me.m01.d19:meLI.Kontakion1.greekmelody	@ltx/en_us_goadedes/me.m01.d19:meMA.Kontakion1.greekmelody
ltx/en_us_goadedes/me.m01.d19:meLI.Kontakion1.incipit	@ltx/en_us_goadedes/me.m01.d19:meMA.Kontakion1.incipit
ltx/en_us_goadedes/me.m01.d19:meLI.Kontakion1.melody	@ltx/en_us_goadedes/me.m01.d19:meMA.Kontakion1.melody
ltx/en_us_goadedes/me.m01.d19:meLI.Kontakion1.mode	@ltx/en_us_goadedes/me.m01.d19:meMA.Kontakion1.mode
ltx/en_us_goadedes/me.m01.d19:meLI.Kontakion1.text	@ltx/en_us_goadedes/me.m01.d19:meMA.Kontakion1.text
ltx/en_us_goadedes/me.m01.d19:meLI.MM.CommunionHymn.text	@ltx/en_us_goadedes/properties:media.key
ltx/en_us_goadedes/me.m01.d19:meLI.Megalynarion.text	
ltx/en_us_goadedes/me.m01.d19:meMA.AposGlory.incipit	…
ltx/en_us_goadedes/me.m01.d19:meMA.AposGlory.melody	
ltx/en_us_goadedes/me.m01.d19:meMA.AposGlory.mode	@ltx/en_us_goadedes/miscellanea:misc.Mode4
ltx/en_us_goadedes/me.m01.d19:meMA.AposGlory.text	
ltx/en_us_goadedes/me.m01.d19:meMA.AposStavrotheotokion.greekmelody	@ltx/en_us_goadedes/he.a.m4:heAU.OsGennaionEnMartysi.greekname
ltx/en_us_goadedes/me.m01.d19:meMA.AposStavrotheotokion.incipit	…
ltx/en_us_goadedes/me.m01.d19:meMA.AposStavrotheotokion.melody	@ltx/en_us_goadedes/he.a.m4:heAU.OsGennaionEnMartysi.name
ltx/en_us_goadedes/me.m01.d19:meMA.AposStavrotheotokion.mode	@ltx/en_us_goadedes/miscellanea:misc.Mode4
ltx/en_us_goadedes/me.m01.d19:meMA.AposStavrotheotokion.text	
ltx/en_us_goadedes/me.m01.d19:meMA.AposTheotokion.greekmelody	@ltx/en_us_goadedes/he.a.m4:heAU.OsGennaionEnMartysi.greekname
ltx/en_us_goadedes/me.m01.d19:meMA.AposTheotokion.incipit	@ltx/en_us_goadedes/oc.m4.d2:ocVE.SticTheotokion.incipit
ltx/en_us_goadedes/me.m01.d19:meMA.AposTheotokion.melody	@ltx/en_us_goadedes/he.a.m4:heAU.OsGennaionEnMartysi.name
ltx/en_us_goadedes/me.m01.d19:meMA.AposTheotokion.mode	@ltx/en_us_goadedes/miscellanea:misc.Mode4
ltx/en_us_goadedes/me.m01.d19:meMA.AposTheotokion.text	@ltx/en_us_goadedes/oc.m4.d2:ocVE.SticTheotokion.text
ltx/en_us_goadedes/me.m01.d19:meMA.C1.acrostic.notice1	
ltx/en_us_goadedes/me.m01.d19:meMA.C1.acrostic.text	
ltx/en_us_goadedes/me.m01.d19:meMA.C1.acrostic.title	
ltx/en_us_goadedes/me.m01.d19:meMA.C1.poet	@ltx/en_us_goadedes/poets:po.Theofanous
ltx/en_us_goadedes/me.m01.d19:meMA.C1.title	@ltx/en_us_goadedes/titles:ti.CanonDevoutM
ltx/en_us_goadedes/me.m01.d19:meMA.C1.verse	@ltx/en_us_goadedes/prayers:pr.verse_DevoutMan.text
ltx/en_us_goadedes/me.m01.d19:meMA.ExapTheotokion.incipit	…
ltx/en_us_goadedes/me.m01.d19:meMA.ExapTheotokion.melody	@ltx/en_us_goadedes/he.a.m3:heAU.OOuranonToisAstrois.name
ltx/en_us_goadedes/me.m01.d19:meMA.ExapTheotokion.mode	@ltx/en_us_goadedes/miscellanea:misc.Mode3
ltx/en_us_goadedes/me.m01.d19:meMA.ExapTheotokion.text	
ltx/en_us_goadedes/me.m01.d19:meMA.Exaposteilarion1.greekmelody	@ltx/en_us_goadedes/he.a.m3:heAU.OOuranonToisAstrois.greekname
ltx/en_us_goadedes/me.m01.d19:meMA.Exaposteilarion1.incipit	…
ltx/en_us_goadedes/me.m01.d19:meMA.Exaposteilarion1.melody	@ltx/en_us_goadedes/he.a.m3:heAU.OOuranonToisAstrois.name
ltx/en_us_goadedes/me.m01.d19:meMA.Exaposteilarion1.mode	@ltx/en_us_goadedes/miscellanea:misc.Mode3
ltx/en_us_goadedes/me.m01.d19:meMA.Exaposteilarion1.text	
ltx/en_us_goadedes/me.m01.d19:meMA.Kontakion1.greekmelody	@ltx/en_us_goadedes/he.a.m4:heAU.EpefanisSimeron.greekname
ltx/en_us_goadedes/me.m01.d19:meMA.Kontakion1.incipit	…
ltx/en_us_goadedes/me.m01.d19:meMA.Kontakion1.melody	@ltx/en_us_goadedes/he.a.m4:heAU.EpefanisSimeron.name
ltx/en_us_goadedes/me.m01.d19:meMA.Kontakion1.mode	@ltx/en_us_goadedes/miscellanea:misc.Mode4
ltx/en_us_goadedes/me.m01.d19:meMA.Kontakion1.text	
ltx/en_us_goadedes/me.m01.d19:meMA.MM.Ve1123as5678.text	@ltx/en_us_goadedes/properties:media.key
ltx/en_us_goadedes/me.m01.d19:meMA.Ode1C11.greekmelody	@ltx/en_us_goadedes/he.h.m4:heHE.ChoroiIsrail.greekname
ltx/en_us_goadedes/me.m01.d19:meMA.Ode1C11.incipit	…
ltx/en_us_goadedes/me.m01.d19:meMA.Ode1C11.melody	@ltx/en_us_goadedes/he.h.m4:heHE.ChoroiIsrail.name
ltx/en_us_goadedes/me.m01.d19:meMA.Ode1C11.mode	@ltx/en_us_goadedes/miscellanea:misc.Mode4
ltx/en_us_goadedes/me.m01.d19:meMA.Ode1C11.ode	@ltx/en_us_goadedes/miscellanea:misc.Ode1
ltx/en_us_goadedes/me.m01.d19:meMA.Ode1C11.text	
ltx/en_us_goadedes/me.m01.d19:meMA.Ode1C12.incipit	…
ltx/en_us_goadedes/me.m01.d19:meMA.Ode1C12.melody	@ltx/en_us_goadedes/he.h.m4:heHE.ChoroiIsrail.name
ltx/en_us_goadedes/me.m01.d19:meMA.Ode1C12.mode	@ltx/en_us_goadedes/miscellanea:misc.Mode4
ltx/en_us_goadedes/me.m01.d19:meMA.Ode1C12.ode	@ltx/en_us_goadedes/miscellanea:misc.Ode1
ltx/en_us_goadedes/me.m01.d19:meMA.Ode1C12.text	
ltx/en_us_goadedes/me.m01.d19:meMA.Ode1C13.incipit	…
ltx/en_us_goadedes/me.m01.d19:meMA.Ode1C13.melody	@ltx/en_us_goadedes/he.h.m4:heHE.ChoroiIsrail.name
ltx/en_us_goadedes/me.m01.d19:meMA.Ode1C13.mode	@ltx/en_us_goadedes/miscellanea:misc.Mode4
ltx/en_us_goadedes/me.m01.d19:meMA.Ode1C13.ode	@ltx/en_us_goadedes/miscellanea:misc.Ode1
ltx/en_us_goadedes/me.m01.d19:meMA.Ode1C13.text	
ltx/en_us_goadedes/me.m01.d19:meMA.Ode1C14.incipit	…
ltx/en_us_goadedes/me.m01.d19:meMA.Ode1C14.melody	@ltx/en_us_goadedes/he.h.m4:heHE.ChoroiIsrail.name
ltx/en_us_goadedes/me.m01.d19:meMA.Ode1C14.mode	@ltx/en_us_goadedes/miscellanea:misc.Mode4
ltx/en_us_goadedes/me.m01.d19:meMA.Ode1C14.ode	@ltx/en_us_goadedes/miscellanea:misc.Ode1
ltx/en_us_goadedes/me.m01.d19:meMA.Ode1C14.text	
ltx/en_us_goadedes/me.m01.d19:meMA.Ode1C1T.incipit	…
ltx/en_us_goadedes/me.m01.d19:meMA.Ode1C1T.melody	@ltx/en_us_goadedes/he.h.m4:heHE.ChoroiIsrail.name
ltx/en_us_goadedes/me.m01.d19:meMA.Ode1C1T.mode	@ltx/en_us_goadedes/miscellanea:misc.Mode4
ltx/en_us_goadedes/me.m01.d19:meMA.Ode1C1T.ode	@ltx/en_us_goadedes/miscellanea:misc.Ode1
ltx/en_us_goadedes/me.m01.d19:meMA.Ode1C1T.text	
ltx/en_us_goadedes/me.m01.d19:meMA.Ode3C11.greekmelody	@ltx/en_us_goadedes/he.h.m4:heHE.ToxonDynatonIsthenise.greekname
ltx/en_us_goadedes/me.m01.d19:meMA.Ode3C11.incipit	…
ltx/en_us_goadedes/me.m01.d19:meMA.Ode3C11.melody	@ltx/en_us_goadedes/he.h.m4:heHE.ToxonDynatonIsthenise.name
ltx/en_us_goadedes/me.m01.d19:meMA.Ode3C11.mode	@ltx/en_us_goadedes/miscellanea:misc.Mode4
ltx/en_us_goadedes/me.m01.d19:meMA.Ode3C11.ode	@ltx/en_us_goadedes/miscellanea:misc.Ode3
ltx/en_us_goadedes/me.m01.d19:meMA.Ode3C11.text	
ltx/en_us_goadedes/me.m01.d19:meMA.Ode3C12.incipit	…
ltx/en_us_goadedes/me.m01.d19:meMA.Ode3C12.melody	@ltx/en_us_goadedes/he.h.m4:heHE.ToxonDynatonIsthenise.name
ltx/en_us_goadedes/me.m01.d19:meMA.Ode3C12.mode	@ltx/en_us_goadedes/miscellanea:misc.Mode4
ltx/en_us_goadedes/me.m01.d19:meMA.Ode3C12.ode	@ltx/en_us_goadedes/miscellanea:misc.Ode3
ltx/en_us_goadedes/me.m01.d19:meMA.Ode3C12.text	
ltx/en_us_goadedes/me.m01.d19:meMA.Ode3C13.incipit	…
ltx/en_us_goadedes/me.m01.d19:meMA.Ode3C13.melody	@ltx/en_us_goadedes/he.h.m4:heHE.ToxonDynatonIsthenise.name
ltx/en_us_goadedes/me.m01.d19:meMA.Ode3C13.mode	@ltx/en_us_goadedes/miscellanea:misc.Mode4
ltx/en_us_goadedes/me.m01.d19:meMA.Ode3C13.ode	@ltx/en_us_goadedes/miscellanea:misc.Ode3
ltx/en_us_goadedes/me.m01.d19:meMA.Ode3C13.text	
ltx/en_us_goadedes/me.m01.d19:meMA.Ode3C14.incipit	…
ltx/en_us_goadedes/me.m01.d19:meMA.Ode3C14.melody	@ltx/en_us_goadedes/he.h.m4:heHE.ToxonDynatonIsthenise.name
ltx/en_us_goadedes/me.m01.d19:meMA.Ode3C14.mode	@ltx/en_us_goadedes/miscellanea:misc.Mode4
ltx/en_us_goadedes/me.m01.d19:meMA.Ode3C14.ode	@ltx/en_us_goadedes/miscellanea:misc.Ode3
ltx/en_us_goadedes/me.m01.d19:meMA.Ode3C14.text	
ltx/en_us_goadedes/me.m01.d19:meMA.Ode3C1T.incipit	…
ltx/en_us_goadedes/me.m01.d19:meMA.Ode3C1T.melody	@ltx/en_us_goadedes/he.h.m4:heHE.ToxonDynatonIsthenise.name
ltx/en_us_goadedes/me.m01.d19:meMA.Ode3C1T.mode	@ltx/en_us_goadedes/miscellanea:misc.Mode4
ltx/en_us_goadedes/me.m01.d19:meMA.Ode3C1T.ode	@ltx/en_us_goadedes/miscellanea:misc.Ode3
ltx/en_us_goadedes/me.m01.d19:meMA.Ode3C1T.text	
ltx/en_us_goadedes/me.m01.d19:meMA.Ode3H.greekmelody	@ltx/en_us_goadedes/he.h.m4:heHE.ToxonDynatonIsthenise.greekname
ltx/en_us_goadedes/me.m01.d19:meMA.Ode3H.incipit	@ltx/en_us_goadedes/he.h.m4:heHE.ToxonDynatonIsthenise.incipit
ltx/en_us_goadedes/me.m01.d19:meMA.Ode3H.melody	@ltx/en_us_goadedes/he.h.m4:heHE.ToxonDynatonIsthenise.melody
ltx/en_us_goadedes/me.m01.d19:meMA.Ode3H.mode	@ltx/en_us_goadedes/miscellanea:misc.Mode4
ltx/en_us_goadedes/me.m01.d19:meMA.Ode3H.ode	@ltx/en_us_goadedes/miscellanea:misc.Ode3
ltx/en_us_goadedes/me.m01.d19:meMA.Ode3H.text	@ltx/en_us_goadedes/he.h.m4:heHE.ToxonDynatonIsthenise.text
ltx/en_us_goadedes/me.m01.d19:meMA.Ode3Kathisma1.greekmelody	@ltx/en_us_goadedes/he.a.m1:heAU.TonTafonSouSotir.greekname
ltx/en_us_goadedes/me.m01.d19:meMA.Ode3Kathisma1.incipit	…
ltx/en_us_goadedes/me.m01.d19:meMA.Ode3Kathisma1.melody	@ltx/en_us_goadedes/he.a.m1:heAU.TonTafonSouSotir.name
ltx/en_us_goadedes/me.m01.d19:meMA.Ode3Kathisma1.mode	@ltx/en_us_goadedes/miscellanea:misc.Mode1
ltx/en_us_goadedes/me.m01.d19:meMA.Ode3Kathisma1.text	
ltx/en_us_goadedes/me.m01.d19:meMA.Ode3KathismaSt.incipit	…
ltx/en_us_goadedes/me.m01.d19:meMA.Ode3KathismaSt.melody	@ltx/en_us_goadedes/he.a.m1:heAU.TonTafonSouSotir.name
ltx/en_us_goadedes/me.m01.d19:meMA.Ode3KathismaSt.mode	@ltx/en_us_goadedes/miscellanea:misc.Mode1
ltx/en_us_goadedes/me.m01.d19:meMA.Ode3KathismaSt.text	
ltx/en_us_goadedes/me.m01.d19:meMA.Ode3KathismaT.incipit	@ltx/en_us_goadedes/oc.m1.d1:ocMO.Kathisma12.incipit
ltx/en_us_goadedes/me.m01.d19:meMA.Ode3KathismaT.melody	@ltx/en_us_goadedes/he.a.m1:heAU.TonTafonSouSotir.name
ltx/en_us_goadedes/me.m01.d19:meMA.Ode3KathismaT.mode	@ltx/en_us_goadedes/miscellanea:misc.Mode1
ltx/en_us_goadedes/me.m01.d19:meMA.Ode3KathismaT.text	@ltx/en_us_goadedes/oc.m1.d1:ocMO.Kathisma12.text
ltx/en_us_goadedes/me.m01.d19:meMA.Ode4C11.greekmelody	@ltx/en_us_goadedes/he.h.m4:heHE.OKathimenosEnDoxi.greekname
ltx/en_us_goadedes/me.m01.d19:meMA.Ode4C11.incipit	…
ltx/en_us_goadedes/me.m01.d19:meMA.Ode4C11.melody	@ltx/en_us_goadedes/he.h.m4:heHE.OKathimenosEnDoxi.name
ltx/en_us_goadedes/me.m01.d19:meMA.Ode4C11.mode	@ltx/en_us_goadedes/miscellanea:misc.Mode4
ltx/en_us_goadedes/me.m01.d19:meMA.Ode4C11.ode	@ltx/en_us_goadedes/miscellanea:misc.Ode4
ltx/en_us_goadedes/me.m01.d19:meMA.Ode4C11.text	
ltx/en_us_goadedes/me.m01.d19:meMA.Ode4C12.incipit	…
ltx/en_us_goadedes/me.m01.d19:meMA.Ode4C12.melody	@ltx/en_us_goadedes/he.h.m4:heHE.OKathimenosEnDoxi.name
ltx/en_us_goadedes/me.m01.d19:meMA.Ode4C12.mode	@ltx/en_us_goadedes/miscellanea:misc.Mode4
ltx/en_us_goadedes/me.m01.d19:meMA.Ode4C12.ode	@ltx/en_us_goadedes/miscellanea:misc.Ode4
ltx/en_us_goadedes/me.m01.d19:meMA.Ode4C12.text	
ltx/en_us_goadedes/me.m01.d19:meMA.Ode4C13.incipit	…
ltx/en_us_goadedes/me.m01.d19:meMA.Ode4C13.melody	@ltx/en_us_goadedes/he.h.m4:heHE.OKathimenosEnDoxi.name
ltx/en_us_goadedes/me.m01.d19:meMA.Ode4C13.mode	@ltx/en_us_goadedes/miscellanea:misc.Mode4
ltx/en_us_goadedes/me.m01.d19:meMA.Ode4C13.ode	@ltx/en_us_goadedes/miscellanea:misc.Ode4
ltx/en_us_goadedes/me.m01.d19:meMA.Ode4C13.text	
ltx/en_us_goadedes/me.m01.d19:meMA.Ode4C14.incipit	…
ltx/en_us_goadedes/me.m01.d19:meMA.Ode4C14.melody	@ltx/en_us_goadedes/he.h.m4:heHE.OKathimenosEnDoxi.name
ltx/en_us_goadedes/me.m01.d19:meMA.Ode4C14.mode	@ltx/en_us_goadedes/miscellanea:misc.Mode4
ltx/en_us_goadedes/me.m01.d19:meMA.Ode4C14.ode	@ltx/en_us_goadedes/miscellanea:misc.Ode4
ltx/en_us_goadedes/me.m01.d19:meMA.Ode4C14.text	
ltx/en_us_goadedes/me.m01.d19:meMA.Ode4C1T.incipit	…
ltx/en_us_goadedes/me.m01.d19:meMA.Ode4C1T.melody	@ltx/en_us_goadedes/he.h.m4:heHE.OKathimenosEnDoxi.name
ltx/en_us_goadedes/me.m01.d19:meMA.Ode4C1T.mode	@ltx/en_us_goadedes/miscellanea:misc.Mode4
ltx/en_us_goadedes/me.m01.d19:meMA.Ode4C1T.ode	@ltx/en_us_goadedes/miscellanea:misc.Ode4
ltx/en_us_goadedes/me.m01.d19:meMA.Ode4C1T.text	
ltx/en_us_goadedes/me.m01.d19:meMA.Ode5C11.greekmelody	@ltx/en_us_goadedes/he.h.m4:heHE.TonFotismonSouKyrie.greekname
ltx/en_us_goadedes/me.m01.d19:meMA.Ode5C11.incipit	…
ltx/en_us_goadedes/me.m01.d19:meMA.Ode5C11.melody	@ltx/en_us_goadedes/he.h.m4:heHE.TonFotismonSouKyrie.name
ltx/en_us_goadedes/me.m01.d19:meMA.Ode5C11.mode	@ltx/en_us_goadedes/miscellanea:misc.Mode4
ltx/en_us_goadedes/me.m01.d19:meMA.Ode5C11.ode	@ltx/en_us_goadedes/miscellanea:misc.Ode5
ltx/en_us_goadedes/me.m01.d19:meMA.Ode5C11.text	
ltx/en_us_goadedes/me.m01.d19:meMA.Ode5C12.incipit	…
ltx/en_us_goadedes/me.m01.d19:meMA.Ode5C12.melody	@ltx/en_us_goadedes/he.h.m4:heHE.TonFotismonSouKyrie.name
ltx/en_us_goadedes/me.m01.d19:meMA.Ode5C12.mode	@ltx/en_us_goadedes/miscellanea:misc.Mode4
ltx/en_us_goadedes/me.m01.d19:meMA.Ode5C12.ode	@ltx/en_us_goadedes/miscellanea:misc.Ode5
ltx/en_us_goadedes/me.m01.d19:meMA.Ode5C12.text	
ltx/en_us_goadedes/me.m01.d19:meMA.Ode5C13.incipit	…
ltx/en_us_goadedes/me.m01.d19:meMA.Ode5C13.melody	@ltx/en_us_goadedes/he.h.m4:heHE.TonFotismonSouKyrie.name
ltx/en_us_goadedes/me.m01.d19:meMA.Ode5C13.mode	@ltx/en_us_goadedes/miscellanea:misc.Mode4
ltx/en_us_goadedes/me.m01.d19:meMA.Ode5C13.ode	@ltx/en_us_goadedes/miscellanea:misc.Ode5
ltx/en_us_goadedes/me.m01.d19:meMA.Ode5C13.text	
ltx/en_us_goadedes/me.m01.d19:meMA.Ode5C1T.incipit	…
ltx/en_us_goadedes/me.m01.d19:meMA.Ode5C1T.melody	@ltx/en_us_goadedes/he.h.m4:heHE.TonFotismonSouKyrie.name
ltx/en_us_goadedes/me.m01.d19:meMA.Ode5C1T.mode	@ltx/en_us_goadedes/miscellanea:misc.Mode4
ltx/en_us_goadedes/me.m01.d19:meMA.Ode5C1T.ode	@ltx/en_us_goadedes/miscellanea:misc.Ode5
ltx/en_us_goadedes/me.m01.d19:meMA.Ode5C1T.text	
ltx/en_us_goadedes/me.m01.d19:meMA.Ode6C11.greekmelody	@ltx/en_us_goadedes/he.h.m4:heHE.EvoiseProtypon.greekname
ltx/en_us_goadedes/me.m01.d19:meMA.Ode6C11.incipit	…
ltx/en_us_goadedes/me.m01.d19:meMA.Ode6C11.melody	@ltx/en_us_goadedes/he.h.m4:heHE.EvoiseProtypon.name
ltx/en_us_goadedes/me.m01.d19:meMA.Ode6C11.mode	@ltx/en_us_goadedes/miscellanea:misc.Mode4
ltx/en_us_goadedes/me.m01.d19:meMA.Ode6C11.ode	@ltx/en_us_goadedes/miscellanea:misc.Ode6
ltx/en_us_goadedes/me.m01.d19:meMA.Ode6C11.text	
ltx/en_us_goadedes/me.m01.d19:meMA.Ode6C12.incipit	…
ltx/en_us_goadedes/me.m01.d19:meMA.Ode6C12.melody	@ltx/en_us_goadedes/he.h.m4:heHE.EvoiseProtypon.name
ltx/en_us_goadedes/me.m01.d19:meMA.Ode6C12.mode	@ltx/en_us_goadedes/miscellanea:misc.Mode4
ltx/en_us_goadedes/me.m01.d19:meMA.Ode6C12.ode	@ltx/en_us_goadedes/miscellanea:misc.Ode6
ltx/en_us_goadedes/me.m01.d19:meMA.Ode6C12.text	
ltx/en_us_goadedes/me.m01.d19:meMA.Ode6C13.incipit	…
ltx/en_us_goadedes/me.m01.d19:meMA.Ode6C13.melody	@ltx/en_us_goadedes/he.h.m4:heHE.EvoiseProtypon.name
ltx/en_us_goadedes/me.m01.d19:meMA.Ode6C13.mode	@ltx/en_us_goadedes/miscellanea:misc.Mode4
ltx/en_us_goadedes/me.m01.d19:meMA.Ode6C13.ode	@ltx/en_us_goadedes/miscellanea:misc.Ode6
ltx/en_us_goadedes/me.m01.d19:meMA.Ode6C13.text	
ltx/en_us_goadedes/me.m01.d19:meMA.Ode6C1T.incipit	…
ltx/en_us_goadedes/me.m01.d19:meMA.Ode6C1T.melody	@ltx/en_us_goadedes/he.h.m4:heHE.EvoiseProtypon.name
ltx/en_us_goadedes/me.m01.d19:meMA.Ode6C1T.mode	@ltx/en_us_goadedes/miscellanea:misc.Mode4
ltx/en_us_goadedes/me.m01.d19:meMA.Ode6C1T.ode	@ltx/en_us_goadedes/miscellanea:misc.Ode6
ltx/en_us_goadedes/me.m01.d19:meMA.Ode6C1T.text	
ltx/en_us_goadedes/me.m01.d19:meMA.Ode6H.greekmelody	@ltx/en_us_goadedes/he.h.m4:heHE.EvoiseProtypon.greekname
ltx/en_us_goadedes/me.m01.d19:meMA.Ode6H.incipit	@ltx/en_us_goadedes/he.h.m4:heHE.EvoiseProtypon.incipit
ltx/en_us_goadedes/me.m01.d19:meMA.Ode6H.melody	@ltx/en_us_goadedes/he.h.m4:heHE.EvoiseProtypon.melody
ltx/en_us_goadedes/me.m01.d19:meMA.Ode6H.mode	@ltx/en_us_goadedes/miscellanea:misc.Mode4
ltx/en_us_goadedes/me.m01.d19:meMA.Ode6H.ode	@ltx/en_us_goadedes/miscellanea:misc.Ode6
ltx/en_us_goadedes/me.m01.d19:meMA.Ode6H.text	@ltx/en_us_goadedes/he.h.m4:heHE.EvoiseProtypon.text
ltx/en_us_goadedes/me.m01.d19:meMA.Ode7C11.greekmelody	@ltx/en_us_goadedes/he.h.m4:heHE.ODiasosasEnPyri.greekname
ltx/en_us_goadedes/me.m01.d19:meMA.Ode7C11.incipit	…
ltx/en_us_goadedes/me.m01.d19:meMA.Ode7C11.melody	@ltx/en_us_goadedes/he.h.m4:heHE.ODiasosasEnPyri.name
ltx/en_us_goadedes/me.m01.d19:meMA.Ode7C11.mode	@ltx/en_us_goadedes/miscellanea:misc.Mode4
ltx/en_us_goadedes/me.m01.d19:meMA.Ode7C11.ode	@ltx/en_us_goadedes/miscellanea:misc.Ode7
ltx/en_us_goadedes/me.m01.d19:meMA.Ode7C11.text	
ltx/en_us_goadedes/me.m01.d19:meMA.Ode7C12.incipit	…
ltx/en_us_goadedes/me.m01.d19:meMA.Ode7C12.melody	@ltx/en_us_goadedes/he.h.m4:heHE.ODiasosasEnPyri.name
ltx/en_us_goadedes/me.m01.d19:meMA.Ode7C12.mode	@ltx/en_us_goadedes/miscellanea:misc.Mode4
ltx/en_us_goadedes/me.m01.d19:meMA.Ode7C12.ode	@ltx/en_us_goadedes/miscellanea:misc.Ode7
ltx/en_us_goadedes/me.m01.d19:meMA.Ode7C12.text	
ltx/en_us_goadedes/me.m01.d19:meMA.Ode7C13.incipit	…
ltx/en_us_goadedes/me.m01.d19:meMA.Ode7C13.melody	@ltx/en_us_goadedes/he.h.m4:heHE.ODiasosasEnPyri.name
ltx/en_us_goadedes/me.m01.d19:meMA.Ode7C13.mode	@ltx/en_us_goadedes/miscellanea:misc.Mode4
ltx/en_us_goadedes/me.m01.d19:meMA.Ode7C13.ode	@ltx/en_us_goadedes/miscellanea:misc.Ode7
ltx/en_us_goadedes/me.m01.d19:meMA.Ode7C13.text	
ltx/en_us_goadedes/me.m01.d19:meMA.Ode7C1T.incipit	…
ltx/en_us_goadedes/me.m01.d19:meMA.Ode7C1T.melody	@ltx/en_us_goadedes/he.h.m4:heHE.ODiasosasEnPyri.name
ltx/en_us_goadedes/me.m01.d19:meMA.Ode7C1T.mode	@ltx/en_us_goadedes/miscellanea:misc.Mode4
ltx/en_us_goadedes/me.m01.d19:meMA.Ode7C1T.ode	@ltx/en_us_goadedes/miscellanea:misc.Ode7
ltx/en_us_goadedes/me.m01.d19:meMA.Ode7C1T.text	
ltx/en_us_goadedes/me.m01.d19:meMA.Ode8C11.greekmelody	@ltx/en_us_goadedes/he.h.m4:heHE.PaidasEvageis.greekname
ltx/en_us_goadedes/me.m01.d19:meMA.Ode8C11.incipit	…
ltx/en_us_goadedes/me.m01.d19:meMA.Ode8C11.melody	@ltx/en_us_goadedes/he.h.m4:heHE.PaidasEvageis.name
ltx/en_us_goadedes/me.m01.d19:meMA.Ode8C11.mode	@ltx/en_us_goadedes/miscellanea:misc.Mode4
ltx/en_us_goadedes/me.m01.d19:meMA.Ode8C11.ode	@ltx/en_us_goadedes/miscellanea:misc.Ode8
ltx/en_us_goadedes/me.m01.d19:meMA.Ode8C11.text	
ltx/en_us_goadedes/me.m01.d19:meMA.Ode8C12.incipit	…
ltx/en_us_goadedes/me.m01.d19:meMA.Ode8C12.melody	@ltx/en_us_goadedes/he.h.m4:heHE.PaidasEvageis.name
ltx/en_us_goadedes/me.m01.d19:meMA.Ode8C12.mode	@ltx/en_us_goadedes/miscellanea:misc.Mode4
ltx/en_us_goadedes/me.m01.d19:meMA.Ode8C12.ode	@ltx/en_us_goadedes/miscellanea:misc.Ode8
ltx/en_us_goadedes/me.m01.d19:meMA.Ode8C12.text	
ltx/en_us_goadedes/me.m01.d19:meMA.Ode8C13.incipit	…
ltx/en_us_goadedes/me.m01.d19:meMA.Ode8C13.melody	@ltx/en_us_goadedes/he.h.m4:heHE.PaidasEvageis.name
ltx/en_us_goadedes/me.m01.d19:meMA.Ode8C13.mode	@ltx/en_us_goadedes/miscellanea:misc.Mode4
ltx/en_us_goadedes/me.m01.d19:meMA.Ode8C13.ode	@ltx/en_us_goadedes/miscellanea:misc.Ode8
ltx/en_us_goadedes/me.m01.d19:meMA.Ode8C13.text	
ltx/en_us_goadedes/me.m01.d19:meMA.Ode8C14.incipit	…
ltx/en_us_goadedes/me.m01.d19:meMA.Ode8C14.melody	@ltx/en_us_goadedes/he.h.m4:heHE.PaidasEvageis.name
ltx/en_us_goadedes/me.m01.d19:meMA.Ode8C14.mode	@ltx/en_us_goadedes/miscellanea:misc.Mode4
ltx/en_us_goadedes/me.m01.d19:meMA.Ode8C14.ode	@ltx/en_us_goadedes/miscellanea:misc.Ode8
ltx/en_us_goadedes/me.m01.d19:meMA.Ode8C14.text	
ltx/en_us_goadedes/me.m01.d19:meMA.Ode8C1T.incipit	…
ltx/en_us_goadedes/me.m01.d19:meMA.Ode8C1T.melody	@ltx/en_us_goadedes/he.h.m4:heHE.PaidasEvageis.name
ltx/en_us_goadedes/me.m01.d19:meMA.Ode8C1T.mode	@ltx/en_us_goadedes/miscellanea:misc.Mode4
ltx/en_us_goadedes/me.m01.d19:meMA.Ode8C1T.ode	@ltx/en_us_goadedes/miscellanea:misc.Ode8
ltx/en_us_goadedes/me.m01.d19:meMA.Ode8C1T.text	
ltx/en_us_goadedes/me.m01.d19:meMA.Ode8H.greekmelody	@ltx/en_us_goadedes/he.h.m4:heHE.PaidasEvageis.greekname
ltx/en_us_goadedes/me.m01.d19:meMA.Ode8H.incipit	@ltx/en_us_goadedes/he.h.m4:heHE.PaidasEvageis.incipit
ltx/en_us_goadedes/me.m01.d19:meMA.Ode8H.melody	@ltx/en_us_goadedes/he.h.m4:heHE.PaidasEvageis.melody
ltx/en_us_goadedes/me.m01.d19:meMA.Ode8H.mode	@ltx/en_us_goadedes/miscellanea:misc.Mode4
ltx/en_us_goadedes/me.m01.d19:meMA.Ode8H.ode	@ltx/en_us_goadedes/miscellanea:misc.Ode8
ltx/en_us_goadedes/me.m01.d19:meMA.Ode8H.text	@ltx/en_us_goadedes/he.h.m4:heHE.PaidasEvageis.text
ltx/en_us_goadedes/me.m01.d19:meMA.Ode9C11.greekmelody	@ltx/en_us_goadedes/he.h.m4:heHE.EvaMenToTisParakois.greekname
ltx/en_us_goadedes/me.m01.d19:meMA.Ode9C11.incipit	…
ltx/en_us_goadedes/me.m01.d19:meMA.Ode9C11.melody	@ltx/en_us_goadedes/he.h.m4:heHE.EvaMenToTisParakois.name
ltx/en_us_goadedes/me.m01.d19:meMA.Ode9C11.mode	@ltx/en_us_goadedes/miscellanea:misc.Mode4
ltx/en_us_goadedes/me.m01.d19:meMA.Ode9C11.ode	@ltx/en_us_goadedes/miscellanea:misc.Ode9
ltx/en_us_goadedes/me.m01.d19:meMA.Ode9C11.text	
ltx/en_us_goadedes/me.m01.d19:meMA.Ode9C12.incipit	…
ltx/en_us_goadedes/me.m01.d19:meMA.Ode9C12.melody	@ltx/en_us_goadedes/he.h.m4:heHE.EvaMenToTisParakois.name
ltx/en_us_goadedes/me.m01.d19:meMA.Ode9C12.mode	@ltx/en_us_goadedes/miscellanea:misc.Mode4
ltx/en_us_goadedes/me.m01.d19:meMA.Ode9C12.ode	@ltx/en_us_goadedes/miscellanea:misc.Ode9
ltx/en_us_goadedes/me.m01.d19:meMA.Ode9C12.text	
ltx/en_us_goadedes/me.m01.d19:meMA.Ode9C13.incipit	…
ltx/en_us_goadedes/me.m01.d19:meMA.Ode9C13.melody	@ltx/en_us_goadedes/he.h.m4:heHE.EvaMenToTisParakois.name
ltx/en_us_goadedes/me.m01.d19:meMA.Ode9C13.mode	@ltx/en_us_goadedes/miscellanea:misc.Mode4
ltx/en_us_goadedes/me.m01.d19:meMA.Ode9C13.ode	@ltx/en_us_goadedes/miscellanea:misc.Ode9
ltx/en_us_goadedes/me.m01.d19:meMA.Ode9C13.text	
ltx/en_us_goadedes/me.m01.d19:meMA.Ode9C1T.incipit	…
ltx/en_us_goadedes/me.m01.d19:meMA.Ode9C1T.melody	@ltx/en_us_goadedes/he.h.m4:heHE.EvaMenToTisParakois.name
ltx/en_us_goadedes/me.m01.d19:meMA.Ode9C1T.mode	@ltx/en_us_goadedes/miscellanea:misc.Mode4
ltx/en_us_goadedes/me.m01.d19:meMA.Ode9C1T.ode	@ltx/en_us_goadedes/miscellanea:misc.Ode9
ltx/en_us_goadedes/me.m01.d19:meMA.Ode9C1T.text	
ltx/en_us_goadedes/me.m01.d19:meMA.Ode9H.greekmelody	@ltx/en_us_goadedes/he.h.m4:heHE.EvaMenToTisParakois.greekname
ltx/en_us_goadedes/me.m01.d19:meMA.Ode9H.incipit	@ltx/en_us_goadedes/he.h.m4:heHE.EvaMenToTisParakois.incipit
ltx/en_us_goadedes/me.m01.d19:meMA.Ode9H.melody	@ltx/en_us_goadedes/he.h.m4:heHE.EvaMenToTisParakois.melody
ltx/en_us_goadedes/me.m01.d19:meMA.Ode9H.mode	@ltx/en_us_goadedes/miscellanea:misc.Mode4
ltx/en_us_goadedes/me.m01.d19:meMA.Ode9H.ode	@ltx/en_us_goadedes/miscellanea:misc.Ode9
ltx/en_us_goadedes/me.m01.d19:meMA.Ode9H.text	@ltx/en_us_goadedes/he.h.m4:heHE.EvaMenToTisParakois.text
ltx/en_us_goadedes/me.m01.d19:meMA.Oikos1.text	
ltx/en_us_goadedes/me.m01.d19:meVE.AposGlory.incipit	@ltx/en_us_goadedes/me.m01.d15:meVE.AposGlory.incipit
ltx/en_us_goadedes/me.m01.d19:meVE.AposGlory.melody	
ltx/en_us_goadedes/me.m01.d19:meVE.AposGlory.mode	@ltx/en_us_goadedes/miscellanea:misc.Mode6
ltx/en_us_goadedes/me.m01.d19:meVE.AposGlory.poet	@ltx/en_us_goadedes/poets:po.Anatoliou
ltx/en_us_goadedes/me.m01.d19:meVE.AposGlory.text	@ltx/en_us_goadedes/me.m01.d15:meVE.AposGlory.text
ltx/en_us_goadedes/me.m01.d19:meVE.AposStavrotheotokion.greekmelody	@ltx/en_us_goadedes/he.a.m6:heAU.OlinApothemenoi.greekname
ltx/en_us_goadedes/me.m01.d19:meVE.AposStavrotheotokion.incipit	@ltx/en_us_goadedes/me.m01.d15:meVE.AposStavrotheotokion.incipit
ltx/en_us_goadedes/me.m01.d19:meVE.AposStavrotheotokion.melody	@ltx/en_us_goadedes/he.a.m6:heAU.OlinApothemenoi.name
ltx/en_us_goadedes/me.m01.d19:meVE.AposStavrotheotokion.mode	@ltx/en_us_goadedes/miscellanea:misc.Mode6
ltx/en_us_goadedes/me.m01.d19:meVE.AposStavrotheotokion.text	@ltx/en_us_goadedes/me.m01.d15:meVE.AposStavrotheotokion.text
ltx/en_us_goadedes/me.m01.d19:meVE.AposTheotokion.greekmelody	@ltx/en_us_goadedes/he.a.m6:heAU.OlinApothemenoi.greekname
ltx/en_us_goadedes/me.m01.d19:meVE.AposTheotokion.incipit	@ltx/en_us_goadedes/me.m01.d15:meVE.AposTheotokion.incipit
ltx/en_us_goadedes/me.m01.d19:meVE.AposTheotokion.melody	@ltx/en_us_goadedes/he.a.m6:heAU.OlinApothemenoi.name
ltx/en_us_goadedes/me.m01.d19:meVE.AposTheotokion.mode	@ltx/en_us_goadedes/miscellanea:misc.Mode6
ltx/en_us_goadedes/me.m01.d19:meVE.AposTheotokion.text	@ltx/en_us_goadedes/me.m01.d15:meVE.AposTheotokion.text
ltx/en_us_goadedes/me.m01.d19:meVE.GeneralApolytikion1.melody	@ltx/en_us_goadedes/he.ga:heGA.TisErimouPolitis.name
ltx/en_us_goadedes/me.m01.d19:meVE.GeneralApolytikion1.mode	@ltx/en_us_goadedes/miscellanea:misc.Mode1
ltx/en_us_goadedes/me.m01.d19:meVE.GeneralApolytikion1.name	
ltx/en_us_goadedes/me.m01.d19:meVE.MM.GeneralApolytikion1.text	@ltx/en_us_goadedes/properties:media.key
ltx/en_us_goadedes/me.m01.d19:meVE.SticGlory.incipit	…
ltx/en_us_goadedes/me.m01.d19:meVE.SticGlory.melody	
ltx/en_us_goadedes/me.m01.d19:meVE.SticGlory.mode	@ltx/en_us_goadedes/miscellanea:misc.Mode8
ltx/en_us_goadedes/me.m01.d19:meVE.SticGlory.poet	@ltx/en_us_goadedes/poets:po.Anatoliou
ltx/en_us_goadedes/me.m01.d19:meVE.SticGlory.text	
ltx/en_us_goadedes/me.m01.d19:meVE.SticStavrotheotokion.greekmelody	@ltx/en_us_goadedes/he.a.m8:heAU.KyrieEiKaiKritirio.greekname
ltx/en_us_goadedes/me.m01.d19:meVE.SticStavrotheotokion.incipit	When she saw You…
ltx/en_us_goadedes/me.m01.d19:meVE.SticStavrotheotokion.melody	@ltx/en_us_goadedes/he.a.m8:heAU.KyrieEiKaiKritirio.name
ltx/en_us_goadedes/me.m01.d19:meVE.SticStavrotheotokion.mode	@ltx/en_us_goadedes/miscellanea:misc.Mode8
ltx/en_us_goadedes/me.m01.d19:meVE.SticStavrotheotokion.text	When she saw You, her Lamb, go in earnest * to be slaughtered, the Virgin ewe * tearfully cried out to You, Logos, * as she followed You to Golgotha, * “Where are you hurrying?” she said. * “I’ll come with You, my sweetest Son. * I cannot endure Your absence, * O my Jesus, very merciful.”
ltx/en_us_goadedes/me.m01.d19:meVE.SticTheotokion.greekmelody	@ltx/en_us_goadedes/he.a.m8:heAU.KyrieEiKaiKritirio.greekname
ltx/en_us_goadedes/me.m01.d19:meVE.SticTheotokion.incipit	@ltx/en_us_goadedes/oc.m8.d5:ocVE.SticTheotokion.incipit
ltx/en_us_goadedes/me.m01.d19:meVE.SticTheotokion.melody	@ltx/en_us_goadedes/he.a.m8:heAU.KyrieEiKaiKritirio.name
ltx/en_us_goadedes/me.m01.d19:meVE.SticTheotokion.mode	@ltx/en_us_goadedes/miscellanea:misc.Mode8
ltx/en_us_goadedes/me.m01.d19:meVE.SticTheotokion.text	@ltx/en_us_goadedes/oc.m8.d5:ocVE.SticTheotokion.text
ltx/en_us_goadedes/me.m01.d19:meVE.Stichera01.greekmelody	@ltx/en_us_goadedes/he.a.m4:heAU.EdokasSimeiosin.greekname
ltx/en_us_goadedes/me.m01.d19:meVE.Stichera01.incipit	…
ltx/en_us_goadedes/me.m01.d19:meVE.Stichera01.melody	@ltx/en_us_goadedes/he.a.m4:heAU.EdokasSimeiosin.name
ltx/en_us_goadedes/me.m01.d19:meVE.Stichera01.mode	@ltx/en_us_goadedes/miscellanea:misc.Mode4
ltx/en_us_goadedes/me.m01.d19:meVE.Stichera01.text	
ltx/en_us_goadedes/me.m01.d19:meVE.Stichera02.incipit	…
ltx/en_us_goadedes/me.m01.d19:meVE.Stichera02.melody	@ltx/en_us_goadedes/he.a.m4:heAU.EdokasSimeiosin.name
ltx/en_us_goadedes/me.m01.d19:meVE.Stichera02.mode	@ltx/en_us_goadedes/miscellanea:misc.Mode4
ltx/en_us_goadedes/me.m01.d19:meVE.Stichera02.text	
ltx/en_us_goadedes/me.m01.d19:meVE.Stichera03.incipit	…
ltx/en_us_goadedes/me.m01.d19:meVE.Stichera03.melody	@ltx/en_us_goadedes/he.a.m4:heAU.EdokasSimeiosin.name
ltx/en_us_goadedes/me.m01.d19:meVE.Stichera03.mode	@ltx/en_us_goadedes/miscellanea:misc.Mode4
ltx/en_us_goadedes/me.m01.d19:meVE.Stichera03.text	
