ltx/en_us_goadedes/me.m09.d23:meDA.commemoration.first	
ltx/en_us_goadedes/me.m09.d23:meDA.commemoration.first_name	
ltx/en_us_goadedes/me.m09.d23:meDA.commemoration.first_short	
ltx/en_us_goadedes/me.m09.d23:meDA.commemoration.first_title	@ltx/en_us_goadedes/titles:ti.Forerunner
ltx/en_us_goadedes/me.m09.d23:meDA.commemoration.full	
ltx/en_us_goadedes/me.m09.d23:meDA.commemoration.second_name	
ltx/en_us_goadedes/me.m09.d23:meDA.commemoration.second_title	
ltx/en_us_goadedes/me.m09.d23:meDA.date	
ltx/en_us_goadedes/me.m09.d23:meDA.fordate	
ltx/en_us_goadedes/me.m09.d23:meDA.insert1	
ltx/en_us_goadedes/me.m09.d23:meDA.insert2	
ltx/en_us_goadedes/me.m09.d23:meDA.note	
ltx/en_us_goadedes/me.m09.d23:meDA.pdfcoverdate	
ltx/en_us_goadedes/me.m09.d23:meDA.pdfheaderdate	
ltx/en_us_goadedes/me.m09.d23:meHO.commemorations	
ltx/en_us_goadedes/me.m09.d23:meHO.note1	
ltx/en_us_goadedes/me.m09.d23:meHO.note2	
ltx/en_us_goadedes/me.m09.d23:meHO.number	
ltx/en_us_goadedes/me.m09.d23:meHO.rank	
ltx/en_us_goadedes/me.m09.d23:meLE.commemoration1	
ltx/en_us_goadedes/me.m09.d23:meLE.commemoration2	
ltx/en_us_goadedes/me.m09.d23:meLI.Kontakion1.greekmelody	@ltx/en_us_goadedes/me.m09.d23:meMA.Kontakion1.greekmelody
ltx/en_us_goadedes/me.m09.d23:meLI.Kontakion1.incipit	@ltx/en_us_goadedes/me.m09.d23:meMA.Kontakion1.incipit
ltx/en_us_goadedes/me.m09.d23:meLI.Kontakion1.melody	@ltx/en_us_goadedes/me.m09.d23:meMA.Kontakion1.melody
ltx/en_us_goadedes/me.m09.d23:meLI.Kontakion1.mode	@ltx/en_us_goadedes/me.m09.d23:meMA.Kontakion1.mode
ltx/en_us_goadedes/me.m09.d23:meLI.Kontakion1.text	@ltx/en_us_goadedes/me.m09.d23:meMA.Kontakion1.text
ltx/en_us_goadedes/me.m09.d23:meLI.MM.CommunionHymn.text	@ltx/en_us_goadedes/properties:media.key
ltx/en_us_goadedes/me.m09.d23:meLI.Megalynarion.text	
ltx/en_us_goadedes/me.m09.d23:meMA.C1.poet	@ltx/en_us_goadedes/poets:po.IoannouTouDamaskinou
ltx/en_us_goadedes/me.m09.d23:meMA.C1.title	@ltx/en_us_goadedes/titles:ti.CanonForerunner
ltx/en_us_goadedes/me.m09.d23:meMA.C1.verse	@ltx/en_us_goadedes/prayers:pr.verse_Baptist.text
ltx/en_us_goadedes/me.m09.d23:meMA.ExapTheotokion.incipit	…
ltx/en_us_goadedes/me.m09.d23:meMA.ExapTheotokion.melody	@ltx/en_us_goadedes/he.a.m2:heAU.ToisMathitaisSynelthomen.name
ltx/en_us_goadedes/me.m09.d23:meMA.ExapTheotokion.mode	@ltx/en_us_goadedes/miscellanea:misc.Mode2
ltx/en_us_goadedes/me.m09.d23:meMA.ExapTheotokion.text	
ltx/en_us_goadedes/me.m09.d23:meMA.Exaposteilarion1.greekmelody	@ltx/en_us_goadedes/he.a.m2:heAU.ToisMathitaisSynelthomen.greekname
ltx/en_us_goadedes/me.m09.d23:meMA.Exaposteilarion1.incipit	…
ltx/en_us_goadedes/me.m09.d23:meMA.Exaposteilarion1.melody	@ltx/en_us_goadedes/he.a.m2:heAU.ToisMathitaisSynelthomen.name
ltx/en_us_goadedes/me.m09.d23:meMA.Exaposteilarion1.mode	@ltx/en_us_goadedes/miscellanea:misc.Mode2
ltx/en_us_goadedes/me.m09.d23:meMA.Exaposteilarion1.text	
ltx/en_us_goadedes/me.m09.d23:meMA.Kathisma11.greekmelody	@ltx/en_us_goadedes/he.a.m5:heAU.TonSynanarchonLogon.greekname
ltx/en_us_goadedes/me.m09.d23:meMA.Kathisma11.incipit	@ltx/en_us_goadedes/oc.m5.d3:ocMA.Kathisma31.incipit
ltx/en_us_goadedes/me.m09.d23:meMA.Kathisma11.melody	@ltx/en_us_goadedes/he.a.m5:heAU.TonSynanarchonLogon.name
ltx/en_us_goadedes/me.m09.d23:meMA.Kathisma11.mode	@ltx/en_us_goadedes/miscellanea:misc.Mode5
ltx/en_us_goadedes/me.m09.d23:meMA.Kathisma11.text	@ltx/en_us_goadedes/oc.m5.d3:ocMA.Kathisma31.text
ltx/en_us_goadedes/me.m09.d23:meMA.Kathisma1T.incipit	@ltx/en_us_goadedes/oc.m5.d1:ocMA.Kathisma13.incipit
ltx/en_us_goadedes/me.m09.d23:meMA.Kathisma1T.melody	@ltx/en_us_goadedes/he.a.m5:heAU.TonSynanarchonLogon.name
ltx/en_us_goadedes/me.m09.d23:meMA.Kathisma1T.mode	@ltx/en_us_goadedes/miscellanea:misc.Mode5
ltx/en_us_goadedes/me.m09.d23:meMA.Kathisma1T.text	@ltx/en_us_goadedes/oc.m5.d1:ocMA.Kathisma13.text
ltx/en_us_goadedes/me.m09.d23:meMA.Kathisma21.greekmelody	@ltx/en_us_goadedes/he.a.m4:heAU.TachyProkatalave.greekname
ltx/en_us_goadedes/me.m09.d23:meMA.Kathisma21.incipit	…
ltx/en_us_goadedes/me.m09.d23:meMA.Kathisma21.melody	@ltx/en_us_goadedes/he.a.m4:heAU.TachyProkatalave.name
ltx/en_us_goadedes/me.m09.d23:meMA.Kathisma21.mode	@ltx/en_us_goadedes/miscellanea:misc.Mode4
ltx/en_us_goadedes/me.m09.d23:meMA.Kathisma21.text	
ltx/en_us_goadedes/me.m09.d23:meMA.Kathisma2T.incipit	@ltx/en_us_goadedes/oc.m4.d3:ocMA.Kathisma33.incipit
ltx/en_us_goadedes/me.m09.d23:meMA.Kathisma2T.melody	@ltx/en_us_goadedes/he.a.m4:heAU.TachyProkatalave.name
ltx/en_us_goadedes/me.m09.d23:meMA.Kathisma2T.mode	@ltx/en_us_goadedes/miscellanea:misc.Mode4
ltx/en_us_goadedes/me.m09.d23:meMA.Kathisma2T.text	@ltx/en_us_goadedes/oc.m4.d3:ocMA.Kathisma33.text
ltx/en_us_goadedes/me.m09.d23:meMA.Kontakion1.greekmelody	@ltx/en_us_goadedes/he.a.m1:heAU.ChorosAngelikos.greekname
ltx/en_us_goadedes/me.m09.d23:meMA.Kontakion1.incipit	…
ltx/en_us_goadedes/me.m09.d23:meMA.Kontakion1.melody	@ltx/en_us_goadedes/he.a.m1:heAU.ChorosAngelikos.name
ltx/en_us_goadedes/me.m09.d23:meMA.Kontakion1.mode	@ltx/en_us_goadedes/miscellanea:misc.Mode1
ltx/en_us_goadedes/me.m09.d23:meMA.Kontakion1.text	
ltx/en_us_goadedes/me.m09.d23:meMA.Lauds1.greekmelody	@ltx/en_us_goadedes/he.a.m1:heAU.TonOuranionTagmaton.greekname
ltx/en_us_goadedes/me.m09.d23:meMA.Lauds1.incipit	…
ltx/en_us_goadedes/me.m09.d23:meMA.Lauds1.melody	@ltx/en_us_goadedes/he.a.m1:heAU.TonOuranionTagmaton.name
ltx/en_us_goadedes/me.m09.d23:meMA.Lauds1.mode	@ltx/en_us_goadedes/miscellanea:misc.Mode1
ltx/en_us_goadedes/me.m09.d23:meMA.Lauds1.text	
ltx/en_us_goadedes/me.m09.d23:meMA.Lauds2.incipit	…
ltx/en_us_goadedes/me.m09.d23:meMA.Lauds2.melody	@ltx/en_us_goadedes/he.a.m1:heAU.TonOuranionTagmaton.name
ltx/en_us_goadedes/me.m09.d23:meMA.Lauds2.mode	@ltx/en_us_goadedes/miscellanea:misc.Mode1
ltx/en_us_goadedes/me.m09.d23:meMA.Lauds2.text	
ltx/en_us_goadedes/me.m09.d23:meMA.Lauds3.incipit	…
ltx/en_us_goadedes/me.m09.d23:meMA.Lauds3.melody	@ltx/en_us_goadedes/he.a.m1:heAU.TonOuranionTagmaton.name
ltx/en_us_goadedes/me.m09.d23:meMA.Lauds3.mode	@ltx/en_us_goadedes/miscellanea:misc.Mode1
ltx/en_us_goadedes/me.m09.d23:meMA.Lauds3.text	
ltx/en_us_goadedes/me.m09.d23:meMA.LaudsGlory.incipit	…
ltx/en_us_goadedes/me.m09.d23:meMA.LaudsGlory.melody	
ltx/en_us_goadedes/me.m09.d23:meMA.LaudsGlory.mode	@ltx/en_us_goadedes/miscellanea:misc.Mode8
ltx/en_us_goadedes/me.m09.d23:meMA.LaudsGlory.text	
ltx/en_us_goadedes/me.m09.d23:meMA.MM.Lauds1123as5678.text	@ltx/en_us_goadedes/properties:media.key
ltx/en_us_goadedes/me.m09.d23:meMA.Ode1C11.greekmelody	@ltx/en_us_goadedes/he.h.m6:heHE.OsEnIpeiroPezefsas.greekname
ltx/en_us_goadedes/me.m09.d23:meMA.Ode1C11.incipit	…
ltx/en_us_goadedes/me.m09.d23:meMA.Ode1C11.melody	@ltx/en_us_goadedes/he.h.m6:heHE.OsEnIpeiroPezefsas.name
ltx/en_us_goadedes/me.m09.d23:meMA.Ode1C11.mode	@ltx/en_us_goadedes/miscellanea:misc.Mode6
ltx/en_us_goadedes/me.m09.d23:meMA.Ode1C11.ode	@ltx/en_us_goadedes/miscellanea:misc.Ode1
ltx/en_us_goadedes/me.m09.d23:meMA.Ode1C11.text	
ltx/en_us_goadedes/me.m09.d23:meMA.Ode1C12.incipit	…
ltx/en_us_goadedes/me.m09.d23:meMA.Ode1C12.melody	@ltx/en_us_goadedes/he.h.m6:heHE.OsEnIpeiroPezefsas.name
ltx/en_us_goadedes/me.m09.d23:meMA.Ode1C12.mode	@ltx/en_us_goadedes/miscellanea:misc.Mode6
ltx/en_us_goadedes/me.m09.d23:meMA.Ode1C12.ode	@ltx/en_us_goadedes/miscellanea:misc.Ode1
ltx/en_us_goadedes/me.m09.d23:meMA.Ode1C12.text	
ltx/en_us_goadedes/me.m09.d23:meMA.Ode1C13.incipit	…
ltx/en_us_goadedes/me.m09.d23:meMA.Ode1C13.melody	@ltx/en_us_goadedes/he.h.m6:heHE.OsEnIpeiroPezefsas.name
ltx/en_us_goadedes/me.m09.d23:meMA.Ode1C13.mode	@ltx/en_us_goadedes/miscellanea:misc.Mode6
ltx/en_us_goadedes/me.m09.d23:meMA.Ode1C13.ode	@ltx/en_us_goadedes/miscellanea:misc.Ode1
ltx/en_us_goadedes/me.m09.d23:meMA.Ode1C13.text	
ltx/en_us_goadedes/me.m09.d23:meMA.Ode1C1T.incipit	…
ltx/en_us_goadedes/me.m09.d23:meMA.Ode1C1T.melody	@ltx/en_us_goadedes/he.h.m6:heHE.OsEnIpeiroPezefsas.name
ltx/en_us_goadedes/me.m09.d23:meMA.Ode1C1T.mode	@ltx/en_us_goadedes/miscellanea:misc.Mode6
ltx/en_us_goadedes/me.m09.d23:meMA.Ode1C1T.ode	@ltx/en_us_goadedes/miscellanea:misc.Ode1
ltx/en_us_goadedes/me.m09.d23:meMA.Ode1C1T.text	
ltx/en_us_goadedes/me.m09.d23:meMA.Ode3C11.greekmelody	@ltx/en_us_goadedes/he.h.m6:heHE.OukEstinAgios.greekname
ltx/en_us_goadedes/me.m09.d23:meMA.Ode3C11.incipit	Today the barren woman…
ltx/en_us_goadedes/me.m09.d23:meMA.Ode3C11.melody	@ltx/en_us_goadedes/he.h.m6:heHE.OukEstinAgios.notmetered
ltx/en_us_goadedes/me.m09.d23:meMA.Ode3C11.mode	@ltx/en_us_goadedes/miscellanea:misc.Mode6
ltx/en_us_goadedes/me.m09.d23:meMA.Ode3C11.ode	@ltx/en_us_goadedes/miscellanea:misc.Ode3
ltx/en_us_goadedes/me.m09.d23:meMA.Ode3C11.text	Today the barren woman conceives a sacred fruit, who later will by grace cut out all the unfruitfulness of souls with the spiritual ax.
ltx/en_us_goadedes/me.m09.d23:meMA.Ode3C12.incipit	Zechariah the great…
ltx/en_us_goadedes/me.m09.d23:meMA.Ode3C12.melody	@ltx/en_us_goadedes/he.h.m6:heHE.OukEstinAgios.notmetered
ltx/en_us_goadedes/me.m09.d23:meMA.Ode3C12.mode	@ltx/en_us_goadedes/miscellanea:misc.Mode6
ltx/en_us_goadedes/me.m09.d23:meMA.Ode3C12.ode	@ltx/en_us_goadedes/miscellanea:misc.Ode3
ltx/en_us_goadedes/me.m09.d23:meMA.Ode3C12.text	Zechariah the great lost his voice in the temple; but according to the fearful announcement, he acquired the voice of the Logos. And he radiantly magnifies the compassionate Lord.
ltx/en_us_goadedes/me.m09.d23:meMA.Ode3C13.incipit	The glorious Forerunner…
ltx/en_us_goadedes/me.m09.d23:meMA.Ode3C13.melody	@ltx/en_us_goadedes/he.h.m6:heHE.OukEstinAgios.notmetered
ltx/en_us_goadedes/me.m09.d23:meMA.Ode3C13.mode	@ltx/en_us_goadedes/miscellanea:misc.Mode6
ltx/en_us_goadedes/me.m09.d23:meMA.Ode3C13.ode	@ltx/en_us_goadedes/miscellanea:misc.Ode3
ltx/en_us_goadedes/me.m09.d23:meMA.Ode3C13.text	The glorious Forerunner grows in his mother’s womb, beyond all hope, as the Angel said he would, according to God’s will. And he will show those who believe the unerring path of repentance.
ltx/en_us_goadedes/me.m09.d23:meMA.Ode3C1T.incipit	When the barren woman’s son…
ltx/en_us_goadedes/me.m09.d23:meMA.Ode3C1T.melody	@ltx/en_us_goadedes/he.h.m6:heHE.OukEstinAgios.notmetered
ltx/en_us_goadedes/me.m09.d23:meMA.Ode3C1T.mode	@ltx/en_us_goadedes/miscellanea:misc.Mode6
ltx/en_us_goadedes/me.m09.d23:meMA.Ode3C1T.ode	@ltx/en_us_goadedes/miscellanea:misc.Ode3
ltx/en_us_goadedes/me.m09.d23:meMA.Ode3C1T.text	When the barren woman’s son recognized Christ being carried in the Virgin’s womb, he leaped, foretelling the joy that had come down to earth to ransom all from despair.
ltx/en_us_goadedes/me.m09.d23:meMA.Ode3Kathisma1.greekmelody	@ltx/en_us_goadedes/he.a.m4:heAU.KateplagiIosif.greekname
ltx/en_us_goadedes/me.m09.d23:meMA.Ode3Kathisma1.incipit	…
ltx/en_us_goadedes/me.m09.d23:meMA.Ode3Kathisma1.melody	@ltx/en_us_goadedes/he.a.m4:heAU.KateplagiIosif.name
ltx/en_us_goadedes/me.m09.d23:meMA.Ode3Kathisma1.mode	@ltx/en_us_goadedes/miscellanea:misc.Mode4
ltx/en_us_goadedes/me.m09.d23:meMA.Ode3Kathisma1.text	
ltx/en_us_goadedes/me.m09.d23:meMA.Ode3KathismaT.incipit	@ltx/en_us_goadedes/he.a.m4:heAU.KateplagiIosif.incipit
ltx/en_us_goadedes/me.m09.d23:meMA.Ode3KathismaT.melody	@ltx/en_us_goadedes/he.a.m4:heAU.KateplagiIosif.melody
ltx/en_us_goadedes/me.m09.d23:meMA.Ode3KathismaT.mode	@ltx/en_us_goadedes/miscellanea:misc.Mode4
ltx/en_us_goadedes/me.m09.d23:meMA.Ode3KathismaT.text	@ltx/en_us_goadedes/he.a.m4:heAU.KateplagiIosif.text
ltx/en_us_goadedes/me.m09.d23:meMA.Ode4C11.greekmelody	@ltx/en_us_goadedes/he.h.m6:heHE.ChristosMouDynamis.greekname
ltx/en_us_goadedes/me.m09.d23:meMA.Ode4C11.incipit	…
ltx/en_us_goadedes/me.m09.d23:meMA.Ode4C11.melody	@ltx/en_us_goadedes/he.h.m6:heHE.ChristosMouDynamis.name
ltx/en_us_goadedes/me.m09.d23:meMA.Ode4C11.mode	@ltx/en_us_goadedes/miscellanea:misc.Mode6
ltx/en_us_goadedes/me.m09.d23:meMA.Ode4C11.ode	@ltx/en_us_goadedes/miscellanea:misc.Ode4
ltx/en_us_goadedes/me.m09.d23:meMA.Ode4C11.text	
ltx/en_us_goadedes/me.m09.d23:meMA.Ode4C12.incipit	…
ltx/en_us_goadedes/me.m09.d23:meMA.Ode4C12.melody	@ltx/en_us_goadedes/he.h.m6:heHE.ChristosMouDynamis.name
ltx/en_us_goadedes/me.m09.d23:meMA.Ode4C12.mode	@ltx/en_us_goadedes/miscellanea:misc.Mode6
ltx/en_us_goadedes/me.m09.d23:meMA.Ode4C12.ode	@ltx/en_us_goadedes/miscellanea:misc.Ode4
ltx/en_us_goadedes/me.m09.d23:meMA.Ode4C12.text	
ltx/en_us_goadedes/me.m09.d23:meMA.Ode4C13.incipit	…
ltx/en_us_goadedes/me.m09.d23:meMA.Ode4C13.melody	@ltx/en_us_goadedes/he.h.m6:heHE.ChristosMouDynamis.name
ltx/en_us_goadedes/me.m09.d23:meMA.Ode4C13.mode	@ltx/en_us_goadedes/miscellanea:misc.Mode6
ltx/en_us_goadedes/me.m09.d23:meMA.Ode4C13.ode	@ltx/en_us_goadedes/miscellanea:misc.Ode4
ltx/en_us_goadedes/me.m09.d23:meMA.Ode4C13.text	
ltx/en_us_goadedes/me.m09.d23:meMA.Ode4C1T.incipit	…
ltx/en_us_goadedes/me.m09.d23:meMA.Ode4C1T.melody	@ltx/en_us_goadedes/he.h.m6:heHE.ChristosMouDynamis.name
ltx/en_us_goadedes/me.m09.d23:meMA.Ode4C1T.mode	@ltx/en_us_goadedes/miscellanea:misc.Mode6
ltx/en_us_goadedes/me.m09.d23:meMA.Ode4C1T.ode	@ltx/en_us_goadedes/miscellanea:misc.Ode4
ltx/en_us_goadedes/me.m09.d23:meMA.Ode4C1T.text	
ltx/en_us_goadedes/me.m09.d23:meMA.Ode5C11.greekmelody	@ltx/en_us_goadedes/he.h.m6:heHE.ToTheioFengeiSou.greekname
ltx/en_us_goadedes/me.m09.d23:meMA.Ode5C11.incipit	…
ltx/en_us_goadedes/me.m09.d23:meMA.Ode5C11.melody	@ltx/en_us_goadedes/he.h.m6:heHE.ToTheioFengeiSou.name
ltx/en_us_goadedes/me.m09.d23:meMA.Ode5C11.mode	@ltx/en_us_goadedes/miscellanea:misc.Mode6
ltx/en_us_goadedes/me.m09.d23:meMA.Ode5C11.ode	@ltx/en_us_goadedes/miscellanea:misc.Ode5
ltx/en_us_goadedes/me.m09.d23:meMA.Ode5C11.text	
ltx/en_us_goadedes/me.m09.d23:meMA.Ode5C12.incipit	…
ltx/en_us_goadedes/me.m09.d23:meMA.Ode5C12.melody	@ltx/en_us_goadedes/he.h.m6:heHE.ToTheioFengeiSou.name
ltx/en_us_goadedes/me.m09.d23:meMA.Ode5C12.mode	@ltx/en_us_goadedes/miscellanea:misc.Mode6
ltx/en_us_goadedes/me.m09.d23:meMA.Ode5C12.ode	@ltx/en_us_goadedes/miscellanea:misc.Ode5
ltx/en_us_goadedes/me.m09.d23:meMA.Ode5C12.text	
ltx/en_us_goadedes/me.m09.d23:meMA.Ode5C13.incipit	…
ltx/en_us_goadedes/me.m09.d23:meMA.Ode5C13.melody	@ltx/en_us_goadedes/he.h.m6:heHE.ToTheioFengeiSou.name
ltx/en_us_goadedes/me.m09.d23:meMA.Ode5C13.mode	@ltx/en_us_goadedes/miscellanea:misc.Mode6
ltx/en_us_goadedes/me.m09.d23:meMA.Ode5C13.ode	@ltx/en_us_goadedes/miscellanea:misc.Ode5
ltx/en_us_goadedes/me.m09.d23:meMA.Ode5C13.text	
ltx/en_us_goadedes/me.m09.d23:meMA.Ode5C1T.incipit	…
ltx/en_us_goadedes/me.m09.d23:meMA.Ode5C1T.melody	@ltx/en_us_goadedes/he.h.m6:heHE.ToTheioFengeiSou.name
ltx/en_us_goadedes/me.m09.d23:meMA.Ode5C1T.mode	@ltx/en_us_goadedes/miscellanea:misc.Mode6
ltx/en_us_goadedes/me.m09.d23:meMA.Ode5C1T.ode	@ltx/en_us_goadedes/miscellanea:misc.Ode5
ltx/en_us_goadedes/me.m09.d23:meMA.Ode5C1T.text	
ltx/en_us_goadedes/me.m09.d23:meMA.Ode6C11.greekmelody	@ltx/en_us_goadedes/he.h.m6:heHE.TouViouTinThalassan.greekname
ltx/en_us_goadedes/me.m09.d23:meMA.Ode6C11.incipit	The priest said…
ltx/en_us_goadedes/me.m09.d23:meMA.Ode6C11.melody	@ltx/en_us_goadedes/he.h.m6:heHE.TouViouTinThalassan.notmetered
ltx/en_us_goadedes/me.m09.d23:meMA.Ode6C11.mode	@ltx/en_us_goadedes/miscellanea:misc.Mode6
ltx/en_us_goadedes/me.m09.d23:meMA.Ode6C11.ode	@ltx/en_us_goadedes/miscellanea:misc.Ode6
ltx/en_us_goadedes/me.m09.d23:meMA.Ode6C11.text	The priest said to the Archangel, “My mind is full of doubt and I do not believe your words; for I prayed for the people’s salvation, not for fruit from my loins.”
ltx/en_us_goadedes/me.m09.d23:meMA.Ode6C12.incipit	The Archangel minister replied…
ltx/en_us_goadedes/me.m09.d23:meMA.Ode6C12.melody	@ltx/en_us_goadedes/he.h.m6:heHE.TouViouTinThalassan.notmetered
ltx/en_us_goadedes/me.m09.d23:meMA.Ode6C12.mode	@ltx/en_us_goadedes/miscellanea:misc.Mode6
ltx/en_us_goadedes/me.m09.d23:meMA.Ode6C12.ode	@ltx/en_us_goadedes/miscellanea:misc.Ode6
ltx/en_us_goadedes/me.m09.d23:meMA.Ode6C12.text	The Archangel minister replied, “The Fashioner of nature, the King of the Angels, has been well-pleased for you to beget the Messenger of His coming. So do not disbelieve my words, O man.”
ltx/en_us_goadedes/me.m09.d23:meMA.Ode6C13.incipit	Zechariah said…
ltx/en_us_goadedes/me.m09.d23:meMA.Ode6C13.melody	@ltx/en_us_goadedes/he.h.m6:heHE.TouViouTinThalassan.notmetered
ltx/en_us_goadedes/me.m09.d23:meMA.Ode6C13.mode	@ltx/en_us_goadedes/miscellanea:misc.Mode6
ltx/en_us_goadedes/me.m09.d23:meMA.Ode6C13.ode	@ltx/en_us_goadedes/miscellanea:misc.Ode6
ltx/en_us_goadedes/me.m09.d23:meMA.Ode6C13.text	Zechariah said to the Archangel minister, “Fiery is your form, and frightening your appearance; and your message is amazing. Yet I do not believe you, saying strange things that surpass nature.”
ltx/en_us_goadedes/me.m09.d23:meMA.Ode6C1T.incipit	The lamp, dwelling in the darkness…
ltx/en_us_goadedes/me.m09.d23:meMA.Ode6C1T.melody	@ltx/en_us_goadedes/he.h.m6:heHE.TouViouTinThalassan.notmetered
ltx/en_us_goadedes/me.m09.d23:meMA.Ode6C1T.mode	@ltx/en_us_goadedes/miscellanea:misc.Mode6
ltx/en_us_goadedes/me.m09.d23:meMA.Ode6C1T.ode	@ltx/en_us_goadedes/miscellanea:misc.Ode6
ltx/en_us_goadedes/me.m09.d23:meMA.Ode6C1T.text	The lamp, dwelling in the darkness of his own mother’s womb, recognized the Sun hidden in the cloud of His virgin Mother’s womb, and he leaped for joy and worshiped Him.
ltx/en_us_goadedes/me.m09.d23:meMA.Ode7C11.greekmelody	@ltx/en_us_goadedes/he.h.m6:heHE.DrosovolonMenTinKaminon.greekname
ltx/en_us_goadedes/me.m09.d23:meMA.Ode7C11.incipit	…
ltx/en_us_goadedes/me.m09.d23:meMA.Ode7C11.melody	@ltx/en_us_goadedes/he.h.m6:heHE.DrosovolonMenTinKaminon.name
ltx/en_us_goadedes/me.m09.d23:meMA.Ode7C11.mode	@ltx/en_us_goadedes/miscellanea:misc.Mode6
ltx/en_us_goadedes/me.m09.d23:meMA.Ode7C11.ode	@ltx/en_us_goadedes/miscellanea:misc.Ode7
ltx/en_us_goadedes/me.m09.d23:meMA.Ode7C11.text	
ltx/en_us_goadedes/me.m09.d23:meMA.Ode7C12.incipit	…
ltx/en_us_goadedes/me.m09.d23:meMA.Ode7C12.melody	@ltx/en_us_goadedes/he.h.m6:heHE.DrosovolonMenTinKaminon.name
ltx/en_us_goadedes/me.m09.d23:meMA.Ode7C12.mode	@ltx/en_us_goadedes/miscellanea:misc.Mode6
ltx/en_us_goadedes/me.m09.d23:meMA.Ode7C12.ode	@ltx/en_us_goadedes/miscellanea:misc.Ode7
ltx/en_us_goadedes/me.m09.d23:meMA.Ode7C12.text	
ltx/en_us_goadedes/me.m09.d23:meMA.Ode7C13.incipit	…
ltx/en_us_goadedes/me.m09.d23:meMA.Ode7C13.melody	@ltx/en_us_goadedes/he.h.m6:heHE.DrosovolonMenTinKaminon.name
ltx/en_us_goadedes/me.m09.d23:meMA.Ode7C13.mode	@ltx/en_us_goadedes/miscellanea:misc.Mode6
ltx/en_us_goadedes/me.m09.d23:meMA.Ode7C13.ode	@ltx/en_us_goadedes/miscellanea:misc.Ode7
ltx/en_us_goadedes/me.m09.d23:meMA.Ode7C13.text	
ltx/en_us_goadedes/me.m09.d23:meMA.Ode7C1T.incipit	…
ltx/en_us_goadedes/me.m09.d23:meMA.Ode7C1T.melody	@ltx/en_us_goadedes/he.h.m6:heHE.DrosovolonMenTinKaminon.name
ltx/en_us_goadedes/me.m09.d23:meMA.Ode7C1T.mode	@ltx/en_us_goadedes/miscellanea:misc.Mode6
ltx/en_us_goadedes/me.m09.d23:meMA.Ode7C1T.ode	@ltx/en_us_goadedes/miscellanea:misc.Ode7
ltx/en_us_goadedes/me.m09.d23:meMA.Ode7C1T.text	
ltx/en_us_goadedes/me.m09.d23:meMA.Ode8C11.greekmelody	@ltx/en_us_goadedes/he.h.m6:heHE.EkFlogosToisOsiois.greekname
ltx/en_us_goadedes/me.m09.d23:meMA.Ode8C11.incipit	…
ltx/en_us_goadedes/me.m09.d23:meMA.Ode8C11.melody	@ltx/en_us_goadedes/he.h.m6:heHE.EkFlogosToisOsiois.name
ltx/en_us_goadedes/me.m09.d23:meMA.Ode8C11.mode	@ltx/en_us_goadedes/miscellanea:misc.Mode6
ltx/en_us_goadedes/me.m09.d23:meMA.Ode8C11.ode	@ltx/en_us_goadedes/miscellanea:misc.Ode8
ltx/en_us_goadedes/me.m09.d23:meMA.Ode8C11.text	
ltx/en_us_goadedes/me.m09.d23:meMA.Ode8C12.incipit	…
ltx/en_us_goadedes/me.m09.d23:meMA.Ode8C12.melody	@ltx/en_us_goadedes/he.h.m6:heHE.EkFlogosToisOsiois.name
ltx/en_us_goadedes/me.m09.d23:meMA.Ode8C12.mode	@ltx/en_us_goadedes/miscellanea:misc.Mode6
ltx/en_us_goadedes/me.m09.d23:meMA.Ode8C12.ode	@ltx/en_us_goadedes/miscellanea:misc.Ode8
ltx/en_us_goadedes/me.m09.d23:meMA.Ode8C12.text	
ltx/en_us_goadedes/me.m09.d23:meMA.Ode8C13.incipit	…
ltx/en_us_goadedes/me.m09.d23:meMA.Ode8C13.melody	@ltx/en_us_goadedes/he.h.m6:heHE.EkFlogosToisOsiois.name
ltx/en_us_goadedes/me.m09.d23:meMA.Ode8C13.mode	@ltx/en_us_goadedes/miscellanea:misc.Mode6
ltx/en_us_goadedes/me.m09.d23:meMA.Ode8C13.ode	@ltx/en_us_goadedes/miscellanea:misc.Ode8
ltx/en_us_goadedes/me.m09.d23:meMA.Ode8C13.text	
ltx/en_us_goadedes/me.m09.d23:meMA.Ode8C1T.incipit	…
ltx/en_us_goadedes/me.m09.d23:meMA.Ode8C1T.melody	@ltx/en_us_goadedes/he.h.m6:heHE.EkFlogosToisOsiois.name
ltx/en_us_goadedes/me.m09.d23:meMA.Ode8C1T.mode	@ltx/en_us_goadedes/miscellanea:misc.Mode6
ltx/en_us_goadedes/me.m09.d23:meMA.Ode8C1T.ode	@ltx/en_us_goadedes/miscellanea:misc.Ode8
ltx/en_us_goadedes/me.m09.d23:meMA.Ode8C1T.text	
ltx/en_us_goadedes/me.m09.d23:meMA.Ode9C11.greekmelody	@ltx/en_us_goadedes/he.h.m6:heHE.TheonAnthropois.greekname
ltx/en_us_goadedes/me.m09.d23:meMA.Ode9C11.incipit	…
ltx/en_us_goadedes/me.m09.d23:meMA.Ode9C11.melody	@ltx/en_us_goadedes/he.h.m6:heHE.TheonAnthropois.name
ltx/en_us_goadedes/me.m09.d23:meMA.Ode9C11.mode	@ltx/en_us_goadedes/miscellanea:misc.Mode6
ltx/en_us_goadedes/me.m09.d23:meMA.Ode9C11.ode	@ltx/en_us_goadedes/miscellanea:misc.Ode9
ltx/en_us_goadedes/me.m09.d23:meMA.Ode9C11.text	
ltx/en_us_goadedes/me.m09.d23:meMA.Ode9C12.incipit	…
ltx/en_us_goadedes/me.m09.d23:meMA.Ode9C12.melody	@ltx/en_us_goadedes/he.h.m6:heHE.TheonAnthropois.name
ltx/en_us_goadedes/me.m09.d23:meMA.Ode9C12.mode	@ltx/en_us_goadedes/miscellanea:misc.Mode6
ltx/en_us_goadedes/me.m09.d23:meMA.Ode9C12.ode	@ltx/en_us_goadedes/miscellanea:misc.Ode9
ltx/en_us_goadedes/me.m09.d23:meMA.Ode9C12.text	
ltx/en_us_goadedes/me.m09.d23:meMA.Ode9C13.incipit	…
ltx/en_us_goadedes/me.m09.d23:meMA.Ode9C13.melody	@ltx/en_us_goadedes/he.h.m6:heHE.TheonAnthropois.name
ltx/en_us_goadedes/me.m09.d23:meMA.Ode9C13.mode	@ltx/en_us_goadedes/miscellanea:misc.Mode6
ltx/en_us_goadedes/me.m09.d23:meMA.Ode9C13.ode	@ltx/en_us_goadedes/miscellanea:misc.Ode9
ltx/en_us_goadedes/me.m09.d23:meMA.Ode9C13.text	
ltx/en_us_goadedes/me.m09.d23:meMA.Ode9C1T.incipit	…
ltx/en_us_goadedes/me.m09.d23:meMA.Ode9C1T.melody	@ltx/en_us_goadedes/he.h.m6:heHE.TheonAnthropois.name
ltx/en_us_goadedes/me.m09.d23:meMA.Ode9C1T.mode	@ltx/en_us_goadedes/miscellanea:misc.Mode6
ltx/en_us_goadedes/me.m09.d23:meMA.Ode9C1T.ode	@ltx/en_us_goadedes/miscellanea:misc.Ode9
ltx/en_us_goadedes/me.m09.d23:meMA.Ode9C1T.text	
ltx/en_us_goadedes/me.m09.d23:meMA.Oikos1.text	Let us open the holy Gospel and read what was written for us by Luke, that holy and marvelous Evangelist. And we shall see a joyous and remarkable conception. As he says, when Zechariah, elderly and righteous, entered the Holy of Holies to offer incense, when his division was on duty, Gabriel appeared to him, bringing good tidings and saying, “O high priest, you will have a son in your old age. He will be a Prophet and Forerunner, a voice and a preacher, the ever-shining lamp, the mystic of grace.”
ltx/en_us_goadedes/me.m09.d23:meVE.Apolytikion1.greekmelody	@ltx/en_us_goadedes/he.a.m4:heAU.TachyProkatalave.greekname
ltx/en_us_goadedes/me.m09.d23:meVE.Apolytikion1.incipit	…
ltx/en_us_goadedes/me.m09.d23:meVE.Apolytikion1.melody	@ltx/en_us_goadedes/he.a.m4:heAU.TachyProkatalave.name
ltx/en_us_goadedes/me.m09.d23:meVE.Apolytikion1.mode	@ltx/en_us_goadedes/miscellanea:misc.Mode4
ltx/en_us_goadedes/me.m09.d23:meVE.Apolytikion1.text	
ltx/en_us_goadedes/me.m09.d23:meVE.AposGlory.incipit	@ltx/en_us_goadedes/me.m01.d07:meMA.LaudsGlory.incipit
ltx/en_us_goadedes/me.m09.d23:meVE.AposGlory.melody	
ltx/en_us_goadedes/me.m09.d23:meVE.AposGlory.mode	@ltx/en_us_goadedes/miscellanea:misc.Mode6
ltx/en_us_goadedes/me.m09.d23:meVE.AposGlory.text	@ltx/en_us_goadedes/me.m01.d07:meMA.LaudsGlory.text
ltx/en_us_goadedes/me.m09.d23:meVE.AposTheotokion.incipit	@ltx/en_us_goadedes/he.o:heOT.TheotokeSyEi.incipit
ltx/en_us_goadedes/me.m09.d23:meVE.AposTheotokion.melody	@ltx/en_us_goadedes/he.o:heOT.TheotokeSyEi.name
ltx/en_us_goadedes/me.m09.d23:meVE.AposTheotokion.mode	@ltx/en_us_goadedes/miscellanea:misc.Mode6
ltx/en_us_goadedes/me.m09.d23:meVE.AposTheotokion.text	@ltx/en_us_goadedes/he.o:heOT.TheotokeSyEiProdromou.text
ltx/en_us_goadedes/me.m09.d23:meVE.Aposticha1.greekmelody	@ltx/en_us_goadedes/he.a.m6:heAU.OlinApothemenoi.greekname
ltx/en_us_goadedes/me.m09.d23:meVE.Aposticha1.incipit	…
ltx/en_us_goadedes/me.m09.d23:meVE.Aposticha1.melody	@ltx/en_us_goadedes/he.a.m6:heAU.OlinApothemenoi.name
ltx/en_us_goadedes/me.m09.d23:meVE.Aposticha1.mode	@ltx/en_us_goadedes/miscellanea:misc.Mode6
ltx/en_us_goadedes/me.m09.d23:meVE.Aposticha1.text	
ltx/en_us_goadedes/me.m09.d23:meVE.Aposticha2.incipit	…
ltx/en_us_goadedes/me.m09.d23:meVE.Aposticha2.melody	@ltx/en_us_goadedes/he.a.m6:heAU.OlinApothemenoi.name
ltx/en_us_goadedes/me.m09.d23:meVE.Aposticha2.mode	@ltx/en_us_goadedes/miscellanea:misc.Mode6
ltx/en_us_goadedes/me.m09.d23:meVE.Aposticha2.text	
ltx/en_us_goadedes/me.m09.d23:meVE.Aposticha3.incipit	…
ltx/en_us_goadedes/me.m09.d23:meVE.Aposticha3.melody	@ltx/en_us_goadedes/he.a.m6:heAU.OlinApothemenoi.name
ltx/en_us_goadedes/me.m09.d23:meVE.Aposticha3.mode	@ltx/en_us_goadedes/miscellanea:misc.Mode6
ltx/en_us_goadedes/me.m09.d23:meVE.Aposticha3.text	
ltx/en_us_goadedes/me.m09.d23:meVE.SticGlory.incipit	…
ltx/en_us_goadedes/me.m09.d23:meVE.SticGlory.melody	
ltx/en_us_goadedes/me.m09.d23:meVE.SticGlory.mode	@ltx/en_us_goadedes/miscellanea:misc.Mode6
ltx/en_us_goadedes/me.m09.d23:meVE.SticGlory.poet	@ltx/en_us_goadedes/poets:po.Vyzantiou
ltx/en_us_goadedes/me.m09.d23:meVE.SticGlory.text	
ltx/en_us_goadedes/me.m09.d23:meVE.SticTheotokion.incipit	@ltx/en_us_goadedes/oc.m6.d1:ocVE.SticTheotokion.incipit
ltx/en_us_goadedes/me.m09.d23:meVE.SticTheotokion.melody	
ltx/en_us_goadedes/me.m09.d23:meVE.SticTheotokion.mode	@ltx/en_us_goadedes/miscellanea:misc.Mode6
ltx/en_us_goadedes/me.m09.d23:meVE.SticTheotokion.text	@ltx/en_us_goadedes/oc.m6.d1:ocVE.SticTheotokion.text
ltx/en_us_goadedes/me.m09.d23:meVE.Stichera01.greekmelody	@ltx/en_us_goadedes/he.a.m4:heAU.OExYpsistouKlitheis.greekname
ltx/en_us_goadedes/me.m09.d23:meVE.Stichera01.incipit	…
ltx/en_us_goadedes/me.m09.d23:meVE.Stichera01.melody	@ltx/en_us_goadedes/he.a.m4:heAU.OExYpsistouKlitheis.name
ltx/en_us_goadedes/me.m09.d23:meVE.Stichera01.mode	@ltx/en_us_goadedes/miscellanea:misc.Mode4
ltx/en_us_goadedes/me.m09.d23:meVE.Stichera01.text	
ltx/en_us_goadedes/me.m09.d23:meVE.Stichera02.incipit	…
ltx/en_us_goadedes/me.m09.d23:meVE.Stichera02.melody	@ltx/en_us_goadedes/he.a.m4:heAU.OExYpsistouKlitheis.name
ltx/en_us_goadedes/me.m09.d23:meVE.Stichera02.mode	@ltx/en_us_goadedes/miscellanea:misc.Mode4
ltx/en_us_goadedes/me.m09.d23:meVE.Stichera02.text	
ltx/en_us_goadedes/me.m09.d23:meVE.Stichera03.incipit	…
ltx/en_us_goadedes/me.m09.d23:meVE.Stichera03.melody	@ltx/en_us_goadedes/he.a.m4:heAU.OExYpsistouKlitheis.name
ltx/en_us_goadedes/me.m09.d23:meVE.Stichera03.mode	@ltx/en_us_goadedes/miscellanea:misc.Mode4
ltx/en_us_goadedes/me.m09.d23:meVE.Stichera03.text	
