ltx/en_us_goadedes/me.m02.d01:meDA.commemoration.first	
ltx/en_us_goadedes/me.m02.d01:meDA.commemoration.first_name	
ltx/en_us_goadedes/me.m02.d01:meDA.commemoration.first_short	
ltx/en_us_goadedes/me.m02.d01:meDA.commemoration.first_title	For the Forefeast.
ltx/en_us_goadedes/me.m02.d01:meDA.commemoration.full	
ltx/en_us_goadedes/me.m02.d01:meDA.commemoration.second	
ltx/en_us_goadedes/me.m02.d01:meDA.commemoration.second_name	
ltx/en_us_goadedes/me.m02.d01:meDA.commemoration.second_short	
ltx/en_us_goadedes/me.m02.d01:meDA.commemoration.second_title	@ltx/en_us_goadedes/titles:ti.Martyr
ltx/en_us_goadedes/me.m02.d01:meDA.date	
ltx/en_us_goadedes/me.m02.d01:meDA.fordate	
ltx/en_us_goadedes/me.m02.d01:meDA.insert1	
ltx/en_us_goadedes/me.m02.d01:meDA.insert2	
ltx/en_us_goadedes/me.m02.d01:meDA.note	
ltx/en_us_goadedes/me.m02.d01:meDA.pdfcoverdate	
ltx/en_us_goadedes/me.m02.d01:meDA.pdfheaderdate	
ltx/en_us_goadedes/me.m02.d01:meHO.commemorations	
ltx/en_us_goadedes/me.m02.d01:meHO.note1	
ltx/en_us_goadedes/me.m02.d01:meHO.note2	
ltx/en_us_goadedes/me.m02.d01:meHO.number	
ltx/en_us_goadedes/me.m02.d01:meHO.rank	
ltx/en_us_goadedes/me.m02.d01:meLE.commemoration1	
ltx/en_us_goadedes/me.m02.d01:meLE.commemoration2	
ltx/en_us_goadedes/me.m02.d01:meLI.Kontakion1.greekmelody	@ltx/en_us_goadedes/me.m02.d01:meMA.Kontakion1.greekmelody
ltx/en_us_goadedes/me.m02.d01:meLI.Kontakion1.incipit	@ltx/en_us_goadedes/me.m02.d01:meMA.Kontakion1.incipit
ltx/en_us_goadedes/me.m02.d01:meLI.Kontakion1.melody	@ltx/en_us_goadedes/me.m02.d01:meMA.Kontakion1.melody
ltx/en_us_goadedes/me.m02.d01:meLI.Kontakion1.mode	@ltx/en_us_goadedes/me.m02.d01:meMA.Kontakion1.mode
ltx/en_us_goadedes/me.m02.d01:meLI.Kontakion1.text	@ltx/en_us_goadedes/me.m02.d01:meMA.Kontakion1.text
ltx/en_us_goadedes/me.m02.d01:meLI.Kontakion2.greekmelody	@ltx/en_us_goadedes/he.a.m4:heAU.EpefanisSimeron.greekname
ltx/en_us_goadedes/me.m02.d01:meLI.Kontakion2.incipit	…
ltx/en_us_goadedes/me.m02.d01:meLI.Kontakion2.melody	@ltx/en_us_goadedes/he.a.m4:heAU.EpefanisSimeron.name
ltx/en_us_goadedes/me.m02.d01:meLI.Kontakion2.mode	@ltx/en_us_goadedes/miscellanea:misc.Mode4
ltx/en_us_goadedes/me.m02.d01:meLI.Kontakion2.text	
ltx/en_us_goadedes/me.m02.d01:meLI.Megalynarion.text	
ltx/en_us_goadedes/me.m02.d01:meLI.Megalynarion2.text	
ltx/en_us_goadedes/me.m02.d01:meMA.AposGlory.incipit	…
ltx/en_us_goadedes/me.m02.d01:meMA.AposGlory.melody	
ltx/en_us_goadedes/me.m02.d01:meMA.AposGlory.mode	@ltx/en_us_goadedes/miscellanea:misc.Mode2
ltx/en_us_goadedes/me.m02.d01:meMA.AposGlory.poet	@ltx/en_us_goadedes/poets:po.Germanou
ltx/en_us_goadedes/me.m02.d01:meMA.AposGlory.text	
ltx/en_us_goadedes/me.m02.d01:meMA.Aposticha1.greekmelody	@ltx/en_us_goadedes/he.a.m2:heAU.OikosTouEfratha.greekname
ltx/en_us_goadedes/me.m02.d01:meMA.Aposticha1.incipit	…
ltx/en_us_goadedes/me.m02.d01:meMA.Aposticha1.melody	@ltx/en_us_goadedes/he.a.m2:heAU.OikosTouEfratha.name
ltx/en_us_goadedes/me.m02.d01:meMA.Aposticha1.mode	@ltx/en_us_goadedes/miscellanea:misc.Mode2
ltx/en_us_goadedes/me.m02.d01:meMA.Aposticha1.text	
ltx/en_us_goadedes/me.m02.d01:meMA.Aposticha2.incipit	…
ltx/en_us_goadedes/me.m02.d01:meMA.Aposticha2.melody	@ltx/en_us_goadedes/he.a.m2:heAU.OikosTouEfratha.name
ltx/en_us_goadedes/me.m02.d01:meMA.Aposticha2.mode	@ltx/en_us_goadedes/miscellanea:misc.Mode2
ltx/en_us_goadedes/me.m02.d01:meMA.Aposticha2.text	
ltx/en_us_goadedes/me.m02.d01:meMA.Aposticha3.incipit	…
ltx/en_us_goadedes/me.m02.d01:meMA.Aposticha3.melody	@ltx/en_us_goadedes/he.a.m2:heAU.OikosTouEfratha.name
ltx/en_us_goadedes/me.m02.d01:meMA.Aposticha3.mode	@ltx/en_us_goadedes/miscellanea:misc.Mode2
ltx/en_us_goadedes/me.m02.d01:meMA.Aposticha3.text	
ltx/en_us_goadedes/me.m02.d01:meMA.C1.title	@ltx/en_us_goadedes/titles:ti.CanonForefeast
ltx/en_us_goadedes/me.m02.d01:meMA.C1.verse	@ltx/en_us_goadedes/prayers:pr.verse_God.text
ltx/en_us_goadedes/me.m02.d01:meMA.C2.acrostic.notice1	
ltx/en_us_goadedes/me.m02.d01:meMA.C2.acrostic.text	
ltx/en_us_goadedes/me.m02.d01:meMA.C2.acrostic.title	
ltx/en_us_goadedes/me.m02.d01:meMA.C2.poet	@ltx/en_us_goadedes/poets:po.Theofanous
ltx/en_us_goadedes/me.m02.d01:meMA.C2.title	@ltx/en_us_goadedes/titles:ti.CanonMartyrM
ltx/en_us_goadedes/me.m02.d01:meMA.C2.verse	@ltx/en_us_goadedes/prayers:pr.verse_SaintM.text
ltx/en_us_goadedes/me.m02.d01:meMA.Exaposteilarion1.greekmelody	@ltx/en_us_goadedes/he.a.m3:heAU.EnPnevmatiToIero.greekname
ltx/en_us_goadedes/me.m02.d01:meMA.Exaposteilarion1.incipit	…
ltx/en_us_goadedes/me.m02.d01:meMA.Exaposteilarion1.melody	@ltx/en_us_goadedes/he.a.m3:heAU.EnPnevmatiToIero.name
ltx/en_us_goadedes/me.m02.d01:meMA.Exaposteilarion1.mode	@ltx/en_us_goadedes/miscellanea:misc.Mode3
ltx/en_us_goadedes/me.m02.d01:meMA.Exaposteilarion1.text	
ltx/en_us_goadedes/me.m02.d01:meMA.Exaposteilarion2.greekmelody	@ltx/en_us_goadedes/he.a.m3:heAU.EnPnevmatiToIero.greekname
ltx/en_us_goadedes/me.m02.d01:meMA.Exaposteilarion2.incipit	…
ltx/en_us_goadedes/me.m02.d01:meMA.Exaposteilarion2.melody	@ltx/en_us_goadedes/he.a.m3:heAU.EnPnevmatiToIero.name
ltx/en_us_goadedes/me.m02.d01:meMA.Exaposteilarion2.mode	@ltx/en_us_goadedes/miscellanea:misc.Mode3
ltx/en_us_goadedes/me.m02.d01:meMA.Exaposteilarion2.text	
ltx/en_us_goadedes/me.m02.d01:meMA.Kathisma11.greekmelody	@ltx/en_us_goadedes/he.a.m1:heAU.ChorosAngelikos.greekname
ltx/en_us_goadedes/me.m02.d01:meMA.Kathisma11.incipit	@ltx/en_us_goadedes/me.m02.d02:meMA.Kathisma21.incipit
ltx/en_us_goadedes/me.m02.d01:meMA.Kathisma11.melody	@ltx/en_us_goadedes/he.a.m1:heAU.ChorosAngelikos.name
ltx/en_us_goadedes/me.m02.d01:meMA.Kathisma11.mode	@ltx/en_us_goadedes/miscellanea:misc.Mode1
ltx/en_us_goadedes/me.m02.d01:meMA.Kathisma11.text	@ltx/en_us_goadedes/me.m02.d02:meMA.Kathisma21.text
ltx/en_us_goadedes/me.m02.d01:meMA.Kathisma21.greekmelody	@ltx/en_us_goadedes/he.a.m4:heAU.TachyProkatalave.greekname
ltx/en_us_goadedes/me.m02.d01:meMA.Kathisma21.incipit	…
ltx/en_us_goadedes/me.m02.d01:meMA.Kathisma21.melody	@ltx/en_us_goadedes/he.a.m4:heAU.TachyProkatalave.name
ltx/en_us_goadedes/me.m02.d01:meMA.Kathisma21.mode	@ltx/en_us_goadedes/miscellanea:misc.Mode4
ltx/en_us_goadedes/me.m02.d01:meMA.Kathisma21.text	
ltx/en_us_goadedes/me.m02.d01:meMA.Kontakion1.greekmelody	@ltx/en_us_goadedes/he.a.m8:heAU.OsAparchas.greekname
ltx/en_us_goadedes/me.m02.d01:meMA.Kontakion1.incipit	…
ltx/en_us_goadedes/me.m02.d01:meMA.Kontakion1.melody	@ltx/en_us_goadedes/he.a.m8:heAU.OsAparchas.name
ltx/en_us_goadedes/me.m02.d01:meMA.Kontakion1.mode	@ltx/en_us_goadedes/miscellanea:misc.Mode8
ltx/en_us_goadedes/me.m02.d01:meMA.Kontakion1.text	
ltx/en_us_goadedes/me.m02.d01:meMA.MM.Apos1123as5678.text	@ltx/en_us_goadedes/properties:media.key
ltx/en_us_goadedes/me.m02.d01:meMA.MM.Apos123as678.text	@ltx/en_us_goadedes/properties:media.key
ltx/en_us_goadedes/me.m02.d01:meMA.Ode1C11.greekmelody	@ltx/en_us_goadedes/he.h.m4:heHE.AsomaiSoiKyrie.greekname
ltx/en_us_goadedes/me.m02.d01:meMA.Ode1C11.incipit	…
ltx/en_us_goadedes/me.m02.d01:meMA.Ode1C11.melody	@ltx/en_us_goadedes/he.h.m4:heHE.AsomaiSoiKyrie.name
ltx/en_us_goadedes/me.m02.d01:meMA.Ode1C11.mode	@ltx/en_us_goadedes/miscellanea:misc.Mode4
ltx/en_us_goadedes/me.m02.d01:meMA.Ode1C11.ode	@ltx/en_us_goadedes/miscellanea:misc.Ode1
ltx/en_us_goadedes/me.m02.d01:meMA.Ode1C11.text	
ltx/en_us_goadedes/me.m02.d01:meMA.Ode1C12.incipit	…
ltx/en_us_goadedes/me.m02.d01:meMA.Ode1C12.melody	@ltx/en_us_goadedes/he.h.m4:heHE.AsomaiSoiKyrie.name
ltx/en_us_goadedes/me.m02.d01:meMA.Ode1C12.mode	@ltx/en_us_goadedes/miscellanea:misc.Mode4
ltx/en_us_goadedes/me.m02.d01:meMA.Ode1C12.ode	@ltx/en_us_goadedes/miscellanea:misc.Ode1
ltx/en_us_goadedes/me.m02.d01:meMA.Ode1C12.text	
ltx/en_us_goadedes/me.m02.d01:meMA.Ode1C13.incipit	…
ltx/en_us_goadedes/me.m02.d01:meMA.Ode1C13.melody	@ltx/en_us_goadedes/he.h.m4:heHE.AsomaiSoiKyrie.name
ltx/en_us_goadedes/me.m02.d01:meMA.Ode1C13.mode	@ltx/en_us_goadedes/miscellanea:misc.Mode4
ltx/en_us_goadedes/me.m02.d01:meMA.Ode1C13.ode	@ltx/en_us_goadedes/miscellanea:misc.Ode1
ltx/en_us_goadedes/me.m02.d01:meMA.Ode1C13.text	
ltx/en_us_goadedes/me.m02.d01:meMA.Ode1C1H.greekmelody	@ltx/en_us_goadedes/he.h.m4:heHE.AsomaiSoiKyrie.greekname
ltx/en_us_goadedes/me.m02.d01:meMA.Ode1C1H.incipit	@ltx/en_us_goadedes/he.h.m4:heHE.AsomaiSoiKyrie.incipit
ltx/en_us_goadedes/me.m02.d01:meMA.Ode1C1H.melody	@ltx/en_us_goadedes/he.h.m4:heHE.AsomaiSoiKyrie.melody
ltx/en_us_goadedes/me.m02.d01:meMA.Ode1C1H.mode	@ltx/en_us_goadedes/miscellanea:misc.Mode4
ltx/en_us_goadedes/me.m02.d01:meMA.Ode1C1H.ode	@ltx/en_us_goadedes/miscellanea:misc.Ode1
ltx/en_us_goadedes/me.m02.d01:meMA.Ode1C1H.text	@ltx/en_us_goadedes/he.h.m4:heHE.AsomaiSoiKyrie.text
ltx/en_us_goadedes/me.m02.d01:meMA.Ode1C1T.incipit	…
ltx/en_us_goadedes/me.m02.d01:meMA.Ode1C1T.melody	@ltx/en_us_goadedes/he.h.m4:heHE.AsomaiSoiKyrie.name
ltx/en_us_goadedes/me.m02.d01:meMA.Ode1C1T.mode	@ltx/en_us_goadedes/miscellanea:misc.Mode4
ltx/en_us_goadedes/me.m02.d01:meMA.Ode1C1T.ode	@ltx/en_us_goadedes/miscellanea:misc.Ode1
ltx/en_us_goadedes/me.m02.d01:meMA.Ode1C1T.text	
ltx/en_us_goadedes/me.m02.d01:meMA.Ode1C21.greekmelody	@ltx/en_us_goadedes/he.h.m8:heHE.YgranDiodefsas.greekname
ltx/en_us_goadedes/me.m02.d01:meMA.Ode1C21.incipit	…
ltx/en_us_goadedes/me.m02.d01:meMA.Ode1C21.melody	@ltx/en_us_goadedes/he.h.m8:heHE.YgranDiodefsas.name
ltx/en_us_goadedes/me.m02.d01:meMA.Ode1C21.mode	@ltx/en_us_goadedes/miscellanea:misc.Mode8
ltx/en_us_goadedes/me.m02.d01:meMA.Ode1C21.ode	@ltx/en_us_goadedes/miscellanea:misc.Ode1
ltx/en_us_goadedes/me.m02.d01:meMA.Ode1C21.text	
ltx/en_us_goadedes/me.m02.d01:meMA.Ode1C22.incipit	…
ltx/en_us_goadedes/me.m02.d01:meMA.Ode1C22.melody	@ltx/en_us_goadedes/he.h.m8:heHE.YgranDiodefsas.name
ltx/en_us_goadedes/me.m02.d01:meMA.Ode1C22.mode	@ltx/en_us_goadedes/miscellanea:misc.Mode8
ltx/en_us_goadedes/me.m02.d01:meMA.Ode1C22.ode	@ltx/en_us_goadedes/miscellanea:misc.Ode1
ltx/en_us_goadedes/me.m02.d01:meMA.Ode1C22.text	
ltx/en_us_goadedes/me.m02.d01:meMA.Ode1C23.incipit	…
ltx/en_us_goadedes/me.m02.d01:meMA.Ode1C23.melody	@ltx/en_us_goadedes/he.h.m8:heHE.YgranDiodefsas.name
ltx/en_us_goadedes/me.m02.d01:meMA.Ode1C23.mode	@ltx/en_us_goadedes/miscellanea:misc.Mode8
ltx/en_us_goadedes/me.m02.d01:meMA.Ode1C23.ode	@ltx/en_us_goadedes/miscellanea:misc.Ode1
ltx/en_us_goadedes/me.m02.d01:meMA.Ode1C23.text	
ltx/en_us_goadedes/me.m02.d01:meMA.Ode1C2T.incipit	…
ltx/en_us_goadedes/me.m02.d01:meMA.Ode1C2T.melody	@ltx/en_us_goadedes/he.h.m8:heHE.YgranDiodefsas.name
ltx/en_us_goadedes/me.m02.d01:meMA.Ode1C2T.mode	@ltx/en_us_goadedes/miscellanea:misc.Mode8
ltx/en_us_goadedes/me.m02.d01:meMA.Ode1C2T.ode	@ltx/en_us_goadedes/miscellanea:misc.Ode1
ltx/en_us_goadedes/me.m02.d01:meMA.Ode1C2T.text	
ltx/en_us_goadedes/me.m02.d01:meMA.Ode3C11.greekmelody	@ltx/en_us_goadedes/he.h.m4:heHE.EnKyrioTheoMou.greekname
ltx/en_us_goadedes/me.m02.d01:meMA.Ode3C11.incipit	Let the Temple open…
ltx/en_us_goadedes/me.m02.d01:meMA.Ode3C11.melody	@ltx/en_us_goadedes/he.h.m4:heHE.EnKyrioTheoMou.notmetered
ltx/en_us_goadedes/me.m02.d01:meMA.Ode3C11.mode	@ltx/en_us_goadedes/miscellanea:misc.Mode4
ltx/en_us_goadedes/me.m02.d01:meMA.Ode3C11.ode	@ltx/en_us_goadedes/miscellanea:misc.Ode3
ltx/en_us_goadedes/me.m02.d01:meMA.Ode3C11.text	Let the Temple open its doors; for now she who is the temple of God has come, to make us temples of His Holy Spirit.
ltx/en_us_goadedes/me.m02.d01:meMA.Ode3C12.incipit	…
ltx/en_us_goadedes/me.m02.d01:meMA.Ode3C12.melody	@ltx/en_us_goadedes/he.h.m4:heHE.EnKyrioTheoMou.notmetered
ltx/en_us_goadedes/me.m02.d01:meMA.Ode3C12.mode	@ltx/en_us_goadedes/miscellanea:misc.Mode4
ltx/en_us_goadedes/me.m02.d01:meMA.Ode3C12.ode	@ltx/en_us_goadedes/miscellanea:misc.Ode3
ltx/en_us_goadedes/me.m02.d01:meMA.Ode3C12.text	The shadow of the Law has passed, and in its place the truth is introduced with the coming of grace. Symeon, come now and receive Christ.
ltx/en_us_goadedes/me.m02.d01:meMA.Ode3C13.incipit	…
ltx/en_us_goadedes/me.m02.d01:meMA.Ode3C13.melody	@ltx/en_us_goadedes/he.h.m4:heHE.EnKyrioTheoMou.notmetered
ltx/en_us_goadedes/me.m02.d01:meMA.Ode3C13.mode	@ltx/en_us_goadedes/miscellanea:misc.Mode4
ltx/en_us_goadedes/me.m02.d01:meMA.Ode3C13.ode	@ltx/en_us_goadedes/miscellanea:misc.Ode3
ltx/en_us_goadedes/me.m02.d01:meMA.Ode3C13.text	Let Anna the chaste widow, secluded and known to God, come now and give thanks to Him who physically became an infant for us.
ltx/en_us_goadedes/me.m02.d01:meMA.Ode3C1H.greekmelody	@ltx/en_us_goadedes/he.h.m4:heHE.EnKyrioTheoMou.greekname
ltx/en_us_goadedes/me.m02.d01:meMA.Ode3C1H.incipit	@ltx/en_us_goadedes/he.h.m4:heHE.EnKyrioTheoMou.incipit
ltx/en_us_goadedes/me.m02.d01:meMA.Ode3C1H.melody	@ltx/en_us_goadedes/he.h.m4:heHE.EnKyrioTheoMou.melody
ltx/en_us_goadedes/me.m02.d01:meMA.Ode3C1H.mode	@ltx/en_us_goadedes/miscellanea:misc.Mode4
ltx/en_us_goadedes/me.m02.d01:meMA.Ode3C1H.ode	@ltx/en_us_goadedes/miscellanea:misc.Ode3
ltx/en_us_goadedes/me.m02.d01:meMA.Ode3C1H.text	@ltx/en_us_goadedes/he.h.m4:heHE.EnKyrioTheoMou.text
ltx/en_us_goadedes/me.m02.d01:meMA.Ode3C1T.incipit	Let us as Orthodox…
ltx/en_us_goadedes/me.m02.d01:meMA.Ode3C1T.melody	@ltx/en_us_goadedes/he.h.m4:heHE.EnKyrioTheoMou.notmetered
ltx/en_us_goadedes/me.m02.d01:meMA.Ode3C1T.mode	@ltx/en_us_goadedes/miscellanea:misc.Mode4
ltx/en_us_goadedes/me.m02.d01:meMA.Ode3C1T.ode	@ltx/en_us_goadedes/miscellanea:misc.Ode3
ltx/en_us_goadedes/me.m02.d01:meMA.Ode3C1T.text	Let us as Orthodox Christians extol the Virgin Mother of God. For she does not cease to intercede with the Lord on our behalf.
ltx/en_us_goadedes/me.m02.d01:meMA.Ode3C21.greekmelody	@ltx/en_us_goadedes/he.h.m8:heHE.SyEiToStereoma.greekname
ltx/en_us_goadedes/me.m02.d01:meMA.Ode3C21.incipit	…
ltx/en_us_goadedes/me.m02.d01:meMA.Ode3C21.melody	@ltx/en_us_goadedes/he.h.m8:heHE.SyEiToStereoma.name
ltx/en_us_goadedes/me.m02.d01:meMA.Ode3C21.mode	@ltx/en_us_goadedes/miscellanea:misc.Mode8
ltx/en_us_goadedes/me.m02.d01:meMA.Ode3C21.ode	@ltx/en_us_goadedes/miscellanea:misc.Ode3
ltx/en_us_goadedes/me.m02.d01:meMA.Ode3C21.text	
ltx/en_us_goadedes/me.m02.d01:meMA.Ode3C22.incipit	…
ltx/en_us_goadedes/me.m02.d01:meMA.Ode3C22.melody	@ltx/en_us_goadedes/he.h.m8:heHE.SyEiToStereoma.name
ltx/en_us_goadedes/me.m02.d01:meMA.Ode3C22.mode	@ltx/en_us_goadedes/miscellanea:misc.Mode8
ltx/en_us_goadedes/me.m02.d01:meMA.Ode3C22.ode	@ltx/en_us_goadedes/miscellanea:misc.Ode3
ltx/en_us_goadedes/me.m02.d01:meMA.Ode3C22.text	
ltx/en_us_goadedes/me.m02.d01:meMA.Ode3C23.incipit	…
ltx/en_us_goadedes/me.m02.d01:meMA.Ode3C23.melody	@ltx/en_us_goadedes/he.h.m8:heHE.SyEiToStereoma.name
ltx/en_us_goadedes/me.m02.d01:meMA.Ode3C23.mode	@ltx/en_us_goadedes/miscellanea:misc.Mode8
ltx/en_us_goadedes/me.m02.d01:meMA.Ode3C23.ode	@ltx/en_us_goadedes/miscellanea:misc.Ode3
ltx/en_us_goadedes/me.m02.d01:meMA.Ode3C23.text	
ltx/en_us_goadedes/me.m02.d01:meMA.Ode3C2T.incipit	…
ltx/en_us_goadedes/me.m02.d01:meMA.Ode3C2T.melody	@ltx/en_us_goadedes/he.h.m8:heHE.SyEiToStereoma.name
ltx/en_us_goadedes/me.m02.d01:meMA.Ode3C2T.mode	@ltx/en_us_goadedes/miscellanea:misc.Mode8
ltx/en_us_goadedes/me.m02.d01:meMA.Ode3C2T.ode	@ltx/en_us_goadedes/miscellanea:misc.Ode3
ltx/en_us_goadedes/me.m02.d01:meMA.Ode3C2T.text	
ltx/en_us_goadedes/me.m02.d01:meMA.Ode3H.greekmelody	@ltx/en_us_goadedes/he.h.m8:heHE.SyEiToStereoma.greekname
ltx/en_us_goadedes/me.m02.d01:meMA.Ode3H.incipit	@ltx/en_us_goadedes/he.h.m8:heHE.SyEiToStereoma.incipit
ltx/en_us_goadedes/me.m02.d01:meMA.Ode3H.melody	@ltx/en_us_goadedes/he.h.m8:heHE.SyEiToStereoma.melody
ltx/en_us_goadedes/me.m02.d01:meMA.Ode3H.mode	@ltx/en_us_goadedes/miscellanea:misc.Mode8
ltx/en_us_goadedes/me.m02.d01:meMA.Ode3H.ode	@ltx/en_us_goadedes/miscellanea:misc.Ode3
ltx/en_us_goadedes/me.m02.d01:meMA.Ode3H.text	@ltx/en_us_goadedes/he.h.m8:heHE.SyEiToStereoma.text
ltx/en_us_goadedes/me.m02.d01:meMA.Ode3Kathisma1.greekmelody	@ltx/en_us_goadedes/he.a.m4:heAU.TachyProkatalave.greekname
ltx/en_us_goadedes/me.m02.d01:meMA.Ode3Kathisma1.incipit	…
ltx/en_us_goadedes/me.m02.d01:meMA.Ode3Kathisma1.melody	@ltx/en_us_goadedes/he.a.m4:heAU.TachyProkatalave.name
ltx/en_us_goadedes/me.m02.d01:meMA.Ode3Kathisma1.mode	@ltx/en_us_goadedes/miscellanea:misc.Mode4
ltx/en_us_goadedes/me.m02.d01:meMA.Ode3Kathisma1.text	
ltx/en_us_goadedes/me.m02.d01:meMA.Ode3Kathisma2.greekmelody	@ltx/en_us_goadedes/he.a.m1:heAU.TouLithouSfragisthentos.greekname
ltx/en_us_goadedes/me.m02.d01:meMA.Ode3Kathisma2.incipit	…
ltx/en_us_goadedes/me.m02.d01:meMA.Ode3Kathisma2.melody	@ltx/en_us_goadedes/he.a.m1:heAU.TouLithouSfragisthentos.name
ltx/en_us_goadedes/me.m02.d01:meMA.Ode3Kathisma2.mode	@ltx/en_us_goadedes/miscellanea:misc.Mode1
ltx/en_us_goadedes/me.m02.d01:meMA.Ode3Kathisma2.text	
ltx/en_us_goadedes/me.m02.d01:meMA.Ode4C11.greekmelody	@ltx/en_us_goadedes/he.h.m4:heHE.TousOuranousIAretiSou.greekname
ltx/en_us_goadedes/me.m02.d01:meMA.Ode4C11.incipit	…
ltx/en_us_goadedes/me.m02.d01:meMA.Ode4C11.melody	@ltx/en_us_goadedes/he.h.m4:heHE.TousOuranousIAretiSou.name
ltx/en_us_goadedes/me.m02.d01:meMA.Ode4C11.mode	@ltx/en_us_goadedes/miscellanea:misc.Mode4
ltx/en_us_goadedes/me.m02.d01:meMA.Ode4C11.ode	@ltx/en_us_goadedes/miscellanea:misc.Ode4
ltx/en_us_goadedes/me.m02.d01:meMA.Ode4C11.text	
ltx/en_us_goadedes/me.m02.d01:meMA.Ode4C12.incipit	…
ltx/en_us_goadedes/me.m02.d01:meMA.Ode4C12.melody	@ltx/en_us_goadedes/he.h.m4:heHE.TousOuranousIAretiSou.name
ltx/en_us_goadedes/me.m02.d01:meMA.Ode4C12.mode	@ltx/en_us_goadedes/miscellanea:misc.Mode4
ltx/en_us_goadedes/me.m02.d01:meMA.Ode4C12.ode	@ltx/en_us_goadedes/miscellanea:misc.Ode4
ltx/en_us_goadedes/me.m02.d01:meMA.Ode4C12.text	
ltx/en_us_goadedes/me.m02.d01:meMA.Ode4C13.incipit	…
ltx/en_us_goadedes/me.m02.d01:meMA.Ode4C13.melody	@ltx/en_us_goadedes/he.h.m4:heHE.TousOuranousIAretiSou.name
ltx/en_us_goadedes/me.m02.d01:meMA.Ode4C13.mode	@ltx/en_us_goadedes/miscellanea:misc.Mode4
ltx/en_us_goadedes/me.m02.d01:meMA.Ode4C13.ode	@ltx/en_us_goadedes/miscellanea:misc.Ode4
ltx/en_us_goadedes/me.m02.d01:meMA.Ode4C13.text	
ltx/en_us_goadedes/me.m02.d01:meMA.Ode4C14.incipit	…
ltx/en_us_goadedes/me.m02.d01:meMA.Ode4C14.melody	@ltx/en_us_goadedes/he.h.m4:heHE.TousOuranousIAretiSou.name
ltx/en_us_goadedes/me.m02.d01:meMA.Ode4C14.mode	@ltx/en_us_goadedes/miscellanea:misc.Mode4
ltx/en_us_goadedes/me.m02.d01:meMA.Ode4C14.ode	@ltx/en_us_goadedes/miscellanea:misc.Ode4
ltx/en_us_goadedes/me.m02.d01:meMA.Ode4C14.text	
ltx/en_us_goadedes/me.m02.d01:meMA.Ode4C1H.greekmelody	@ltx/en_us_goadedes/he.h.m4:heHE.TousOuranousIAretiSou.greekname
ltx/en_us_goadedes/me.m02.d01:meMA.Ode4C1H.incipit	@ltx/en_us_goadedes/he.h.m4:heHE.TousOuranousIAretiSou.incipit
ltx/en_us_goadedes/me.m02.d01:meMA.Ode4C1H.melody	@ltx/en_us_goadedes/he.h.m4:heHE.TousOuranousIAretiSou.melody
ltx/en_us_goadedes/me.m02.d01:meMA.Ode4C1H.mode	@ltx/en_us_goadedes/miscellanea:misc.Mode4
ltx/en_us_goadedes/me.m02.d01:meMA.Ode4C1H.ode	@ltx/en_us_goadedes/miscellanea:misc.Ode4
ltx/en_us_goadedes/me.m02.d01:meMA.Ode4C1H.text	@ltx/en_us_goadedes/he.h.m4:heHE.TousOuranousIAretiSou.text
ltx/en_us_goadedes/me.m02.d01:meMA.Ode4C1T.incipit	…
ltx/en_us_goadedes/me.m02.d01:meMA.Ode4C1T.melody	@ltx/en_us_goadedes/he.h.m4:heHE.TousOuranousIAretiSou.name
ltx/en_us_goadedes/me.m02.d01:meMA.Ode4C1T.mode	@ltx/en_us_goadedes/miscellanea:misc.Mode4
ltx/en_us_goadedes/me.m02.d01:meMA.Ode4C1T.ode	@ltx/en_us_goadedes/miscellanea:misc.Ode4
ltx/en_us_goadedes/me.m02.d01:meMA.Ode4C1T.text	
ltx/en_us_goadedes/me.m02.d01:meMA.Ode4C21.greekmelody	@ltx/en_us_goadedes/he.h.m8:heHE.EisakikoaKyrie.greekname
ltx/en_us_goadedes/me.m02.d01:meMA.Ode4C21.incipit	…
ltx/en_us_goadedes/me.m02.d01:meMA.Ode4C21.melody	@ltx/en_us_goadedes/he.h.m8:heHE.EisakikoaKyrie.name
ltx/en_us_goadedes/me.m02.d01:meMA.Ode4C21.mode	@ltx/en_us_goadedes/miscellanea:misc.Mode8
ltx/en_us_goadedes/me.m02.d01:meMA.Ode4C21.ode	@ltx/en_us_goadedes/miscellanea:misc.Ode4
ltx/en_us_goadedes/me.m02.d01:meMA.Ode4C21.text	
ltx/en_us_goadedes/me.m02.d01:meMA.Ode4C22.incipit	…
ltx/en_us_goadedes/me.m02.d01:meMA.Ode4C22.melody	@ltx/en_us_goadedes/he.h.m8:heHE.EisakikoaKyrie.name
ltx/en_us_goadedes/me.m02.d01:meMA.Ode4C22.mode	@ltx/en_us_goadedes/miscellanea:misc.Mode8
ltx/en_us_goadedes/me.m02.d01:meMA.Ode4C22.ode	@ltx/en_us_goadedes/miscellanea:misc.Ode4
ltx/en_us_goadedes/me.m02.d01:meMA.Ode4C22.text	
ltx/en_us_goadedes/me.m02.d01:meMA.Ode4C23.incipit	…
ltx/en_us_goadedes/me.m02.d01:meMA.Ode4C23.melody	@ltx/en_us_goadedes/he.h.m8:heHE.EisakikoaKyrie.name
ltx/en_us_goadedes/me.m02.d01:meMA.Ode4C23.mode	@ltx/en_us_goadedes/miscellanea:misc.Mode8
ltx/en_us_goadedes/me.m02.d01:meMA.Ode4C23.ode	@ltx/en_us_goadedes/miscellanea:misc.Ode4
ltx/en_us_goadedes/me.m02.d01:meMA.Ode4C23.text	
ltx/en_us_goadedes/me.m02.d01:meMA.Ode4C2T.incipit	…
ltx/en_us_goadedes/me.m02.d01:meMA.Ode4C2T.melody	@ltx/en_us_goadedes/he.h.m8:heHE.EisakikoaKyrie.name
ltx/en_us_goadedes/me.m02.d01:meMA.Ode4C2T.mode	@ltx/en_us_goadedes/miscellanea:misc.Mode8
ltx/en_us_goadedes/me.m02.d01:meMA.Ode4C2T.ode	@ltx/en_us_goadedes/miscellanea:misc.Ode4
ltx/en_us_goadedes/me.m02.d01:meMA.Ode4C2T.text	
ltx/en_us_goadedes/me.m02.d01:meMA.Ode5C11.greekmelody	@ltx/en_us_goadedes/he.h.m4:heHE.OAnateilasToFos.greekname
ltx/en_us_goadedes/me.m02.d01:meMA.Ode5C11.incipit	…
ltx/en_us_goadedes/me.m02.d01:meMA.Ode5C11.melody	@ltx/en_us_goadedes/he.h.m4:heHE.OAnateilasToFos.name
ltx/en_us_goadedes/me.m02.d01:meMA.Ode5C11.mode	@ltx/en_us_goadedes/miscellanea:misc.Mode4
ltx/en_us_goadedes/me.m02.d01:meMA.Ode5C11.ode	@ltx/en_us_goadedes/miscellanea:misc.Ode5
ltx/en_us_goadedes/me.m02.d01:meMA.Ode5C11.text	
ltx/en_us_goadedes/me.m02.d01:meMA.Ode5C12.incipit	…
ltx/en_us_goadedes/me.m02.d01:meMA.Ode5C12.melody	@ltx/en_us_goadedes/he.h.m4:heHE.OAnateilasToFos.name
ltx/en_us_goadedes/me.m02.d01:meMA.Ode5C12.mode	@ltx/en_us_goadedes/miscellanea:misc.Mode4
ltx/en_us_goadedes/me.m02.d01:meMA.Ode5C12.ode	@ltx/en_us_goadedes/miscellanea:misc.Ode5
ltx/en_us_goadedes/me.m02.d01:meMA.Ode5C12.text	
ltx/en_us_goadedes/me.m02.d01:meMA.Ode5C1H.greekmelody	@ltx/en_us_goadedes/he.h.m4:heHE.OAnateilasToFos.greekname
ltx/en_us_goadedes/me.m02.d01:meMA.Ode5C1H.incipit	@ltx/en_us_goadedes/he.h.m4:heHE.OAnateilasToFos.incipit
ltx/en_us_goadedes/me.m02.d01:meMA.Ode5C1H.melody	@ltx/en_us_goadedes/he.h.m4:heHE.OAnateilasToFos.melody
ltx/en_us_goadedes/me.m02.d01:meMA.Ode5C1H.mode	@ltx/en_us_goadedes/miscellanea:misc.Mode4
ltx/en_us_goadedes/me.m02.d01:meMA.Ode5C1H.ode	@ltx/en_us_goadedes/miscellanea:misc.Ode5
ltx/en_us_goadedes/me.m02.d01:meMA.Ode5C1H.text	@ltx/en_us_goadedes/he.h.m4:heHE.OAnateilasToFos.text
ltx/en_us_goadedes/me.m02.d01:meMA.Ode5C1T.incipit	…
ltx/en_us_goadedes/me.m02.d01:meMA.Ode5C1T.melody	@ltx/en_us_goadedes/he.h.m4:heHE.OAnateilasToFos.name
ltx/en_us_goadedes/me.m02.d01:meMA.Ode5C1T.mode	@ltx/en_us_goadedes/miscellanea:misc.Mode4
ltx/en_us_goadedes/me.m02.d01:meMA.Ode5C1T.ode	@ltx/en_us_goadedes/miscellanea:misc.Ode5
ltx/en_us_goadedes/me.m02.d01:meMA.Ode5C1T.text	
ltx/en_us_goadedes/me.m02.d01:meMA.Ode5C21.greekmelody	@ltx/en_us_goadedes/he.h.m8:heHE.OrthrizontesVoomenSoi.greekname
ltx/en_us_goadedes/me.m02.d01:meMA.Ode5C21.incipit	…
ltx/en_us_goadedes/me.m02.d01:meMA.Ode5C21.melody	@ltx/en_us_goadedes/he.h.m8:heHE.OrthrizontesVoomenSoi.name
ltx/en_us_goadedes/me.m02.d01:meMA.Ode5C21.mode	@ltx/en_us_goadedes/miscellanea:misc.Mode8
ltx/en_us_goadedes/me.m02.d01:meMA.Ode5C21.ode	@ltx/en_us_goadedes/miscellanea:misc.Ode5
ltx/en_us_goadedes/me.m02.d01:meMA.Ode5C21.text	
ltx/en_us_goadedes/me.m02.d01:meMA.Ode5C22.incipit	…
ltx/en_us_goadedes/me.m02.d01:meMA.Ode5C22.melody	@ltx/en_us_goadedes/he.h.m8:heHE.OrthrizontesVoomenSoi.name
ltx/en_us_goadedes/me.m02.d01:meMA.Ode5C22.mode	@ltx/en_us_goadedes/miscellanea:misc.Mode8
ltx/en_us_goadedes/me.m02.d01:meMA.Ode5C22.ode	@ltx/en_us_goadedes/miscellanea:misc.Ode5
ltx/en_us_goadedes/me.m02.d01:meMA.Ode5C22.text	
ltx/en_us_goadedes/me.m02.d01:meMA.Ode5C2T.incipit	…
ltx/en_us_goadedes/me.m02.d01:meMA.Ode5C2T.melody	@ltx/en_us_goadedes/he.h.m8:heHE.OrthrizontesVoomenSoi.name
ltx/en_us_goadedes/me.m02.d01:meMA.Ode5C2T.mode	@ltx/en_us_goadedes/miscellanea:misc.Mode8
ltx/en_us_goadedes/me.m02.d01:meMA.Ode5C2T.ode	@ltx/en_us_goadedes/miscellanea:misc.Ode5
ltx/en_us_goadedes/me.m02.d01:meMA.Ode5C2T.text	
ltx/en_us_goadedes/me.m02.d01:meMA.Ode6C11.greekmelody	@ltx/en_us_goadedes/he.h.m4:heHE.OsIonanTonProfitin.greekname
ltx/en_us_goadedes/me.m02.d01:meMA.Ode6C11.incipit	…
ltx/en_us_goadedes/me.m02.d01:meMA.Ode6C11.melody	@ltx/en_us_goadedes/he.h.m4:heHE.OsIonanTonProfitin.name
ltx/en_us_goadedes/me.m02.d01:meMA.Ode6C11.mode	@ltx/en_us_goadedes/miscellanea:misc.Mode4
ltx/en_us_goadedes/me.m02.d01:meMA.Ode6C11.ode	@ltx/en_us_goadedes/miscellanea:misc.Ode6
ltx/en_us_goadedes/me.m02.d01:meMA.Ode6C11.text	
ltx/en_us_goadedes/me.m02.d01:meMA.Ode6C12.incipit	…
ltx/en_us_goadedes/me.m02.d01:meMA.Ode6C12.melody	@ltx/en_us_goadedes/he.h.m4:heHE.OsIonanTonProfitin.name
ltx/en_us_goadedes/me.m02.d01:meMA.Ode6C12.mode	@ltx/en_us_goadedes/miscellanea:misc.Mode4
ltx/en_us_goadedes/me.m02.d01:meMA.Ode6C12.ode	@ltx/en_us_goadedes/miscellanea:misc.Ode6
ltx/en_us_goadedes/me.m02.d01:meMA.Ode6C12.text	
ltx/en_us_goadedes/me.m02.d01:meMA.Ode6C13.incipit	…
ltx/en_us_goadedes/me.m02.d01:meMA.Ode6C13.melody	@ltx/en_us_goadedes/he.h.m4:heHE.OsIonanTonProfitin.name
ltx/en_us_goadedes/me.m02.d01:meMA.Ode6C13.mode	@ltx/en_us_goadedes/miscellanea:misc.Mode4
ltx/en_us_goadedes/me.m02.d01:meMA.Ode6C13.ode	@ltx/en_us_goadedes/miscellanea:misc.Ode6
ltx/en_us_goadedes/me.m02.d01:meMA.Ode6C13.text	
ltx/en_us_goadedes/me.m02.d01:meMA.Ode6C1H.greekmelody	@ltx/en_us_goadedes/he.h.m4:heHE.OsIonanTonProfitin.greekname
ltx/en_us_goadedes/me.m02.d01:meMA.Ode6C1H.incipit	@ltx/en_us_goadedes/he.h.m4:heHE.OsIonanTonProfitin.incipit
ltx/en_us_goadedes/me.m02.d01:meMA.Ode6C1H.melody	@ltx/en_us_goadedes/he.h.m4:heHE.OsIonanTonProfitin.melody
ltx/en_us_goadedes/me.m02.d01:meMA.Ode6C1H.mode	@ltx/en_us_goadedes/miscellanea:misc.Mode4
ltx/en_us_goadedes/me.m02.d01:meMA.Ode6C1H.ode	@ltx/en_us_goadedes/miscellanea:misc.Ode6
ltx/en_us_goadedes/me.m02.d01:meMA.Ode6C1H.text	@ltx/en_us_goadedes/he.h.m4:heHE.OsIonanTonProfitin.text
ltx/en_us_goadedes/me.m02.d01:meMA.Ode6C1T.incipit	…
ltx/en_us_goadedes/me.m02.d01:meMA.Ode6C1T.melody	@ltx/en_us_goadedes/he.h.m4:heHE.OsIonanTonProfitin.name
ltx/en_us_goadedes/me.m02.d01:meMA.Ode6C1T.mode	@ltx/en_us_goadedes/miscellanea:misc.Mode4
ltx/en_us_goadedes/me.m02.d01:meMA.Ode6C1T.ode	@ltx/en_us_goadedes/miscellanea:misc.Ode6
ltx/en_us_goadedes/me.m02.d01:meMA.Ode6C1T.text	
ltx/en_us_goadedes/me.m02.d01:meMA.Ode6C21.greekmelody	@ltx/en_us_goadedes/he.h.m8:heHE.IlasthitiMoiSotir.greekname
ltx/en_us_goadedes/me.m02.d01:meMA.Ode6C21.incipit	O glorious Trypho…
ltx/en_us_goadedes/me.m02.d01:meMA.Ode6C21.melody	@ltx/en_us_goadedes/he.h.m8:heHE.IlasthitiMoiSotir.notmetered
ltx/en_us_goadedes/me.m02.d01:meMA.Ode6C21.mode	@ltx/en_us_goadedes/miscellanea:misc.Mode8
ltx/en_us_goadedes/me.m02.d01:meMA.Ode6C21.ode	@ltx/en_us_goadedes/miscellanea:misc.Ode6
ltx/en_us_goadedes/me.m02.d01:meMA.Ode6C21.text	O glorious Trypho, with your own blood you dried the foul libations and the stench of frenzied pagan sacrifices, and you irrigated all the noble scions of the Church. 
ltx/en_us_goadedes/me.m02.d01:meMA.Ode6C22.incipit	…
ltx/en_us_goadedes/me.m02.d01:meMA.Ode6C22.melody	@ltx/en_us_goadedes/he.h.m8:heHE.IlasthitiMoiSotir.notmetered
ltx/en_us_goadedes/me.m02.d01:meMA.Ode6C22.mode	@ltx/en_us_goadedes/miscellanea:misc.Mode8
ltx/en_us_goadedes/me.m02.d01:meMA.Ode6C22.ode	@ltx/en_us_goadedes/miscellanea:misc.Ode6
ltx/en_us_goadedes/me.m02.d01:meMA.Ode6C22.text	The gore of martyrdom is fragrant as myrrh; the blood of the athletes wells up cures; and the dust of their bodies sanctifies the souls of those who faithfully attend church for them memories.
ltx/en_us_goadedes/me.m02.d01:meMA.Ode6C2T.incipit	…
ltx/en_us_goadedes/me.m02.d01:meMA.Ode6C2T.melody	@ltx/en_us_goadedes/he.h.m8:heHE.IlasthitiMoiSotir.notmetered
ltx/en_us_goadedes/me.m02.d01:meMA.Ode6C2T.mode	@ltx/en_us_goadedes/miscellanea:misc.Mode8
ltx/en_us_goadedes/me.m02.d01:meMA.Ode6C2T.ode	@ltx/en_us_goadedes/miscellanea:misc.Ode6
ltx/en_us_goadedes/me.m02.d01:meMA.Ode6C2T.text	O Mother of God, when you received the incarnate Logos, you were like the Ark. When you contained the Creator, you were like the holy Temple. When you held the Master of the universe, you were like a fiery throne.
ltx/en_us_goadedes/me.m02.d01:meMA.Ode6H.greekmelody	@ltx/en_us_goadedes/he.h.m8:heHE.IlasthitiMoiSotir.greekname
ltx/en_us_goadedes/me.m02.d01:meMA.Ode6H.incipit	@ltx/en_us_goadedes/he.h.m8:heHE.IlasthitiMoiSotir.incipit
ltx/en_us_goadedes/me.m02.d01:meMA.Ode6H.melody	@ltx/en_us_goadedes/he.h.m8:heHE.IlasthitiMoiSotir.melody
ltx/en_us_goadedes/me.m02.d01:meMA.Ode6H.mode	@ltx/en_us_goadedes/miscellanea:misc.Mode8
ltx/en_us_goadedes/me.m02.d01:meMA.Ode6H.ode	@ltx/en_us_goadedes/miscellanea:misc.Ode6
ltx/en_us_goadedes/me.m02.d01:meMA.Ode6H.text	@ltx/en_us_goadedes/he.h.m8:heHE.IlasthitiMoiSotir.text
ltx/en_us_goadedes/me.m02.d01:meMA.Ode7C11.greekmelody	@ltx/en_us_goadedes/he.h.m4:heHE.OTonPateronTheos.greekname
ltx/en_us_goadedes/me.m02.d01:meMA.Ode7C11.incipit	…
ltx/en_us_goadedes/me.m02.d01:meMA.Ode7C11.melody	@ltx/en_us_goadedes/he.h.m4:heHE.OTonPateronTheos.name
ltx/en_us_goadedes/me.m02.d01:meMA.Ode7C11.mode	@ltx/en_us_goadedes/miscellanea:misc.Mode4
ltx/en_us_goadedes/me.m02.d01:meMA.Ode7C11.ode	@ltx/en_us_goadedes/miscellanea:misc.Ode7
ltx/en_us_goadedes/me.m02.d01:meMA.Ode7C11.text	
ltx/en_us_goadedes/me.m02.d01:meMA.Ode7C12.incipit	…
ltx/en_us_goadedes/me.m02.d01:meMA.Ode7C12.melody	@ltx/en_us_goadedes/he.h.m4:heHE.OTonPateronTheos.name
ltx/en_us_goadedes/me.m02.d01:meMA.Ode7C12.mode	@ltx/en_us_goadedes/miscellanea:misc.Mode4
ltx/en_us_goadedes/me.m02.d01:meMA.Ode7C12.ode	@ltx/en_us_goadedes/miscellanea:misc.Ode7
ltx/en_us_goadedes/me.m02.d01:meMA.Ode7C12.text	
ltx/en_us_goadedes/me.m02.d01:meMA.Ode7C13.incipit	…
ltx/en_us_goadedes/me.m02.d01:meMA.Ode7C13.melody	@ltx/en_us_goadedes/he.h.m4:heHE.OTonPateronTheos.name
ltx/en_us_goadedes/me.m02.d01:meMA.Ode7C13.mode	@ltx/en_us_goadedes/miscellanea:misc.Mode4
ltx/en_us_goadedes/me.m02.d01:meMA.Ode7C13.ode	@ltx/en_us_goadedes/miscellanea:misc.Ode7
ltx/en_us_goadedes/me.m02.d01:meMA.Ode7C13.text	
ltx/en_us_goadedes/me.m02.d01:meMA.Ode7C1H.greekmelody	@ltx/en_us_goadedes/he.h.m4:heHE.OTonPateronTheos.greekname
ltx/en_us_goadedes/me.m02.d01:meMA.Ode7C1H.incipit	@ltx/en_us_goadedes/he.h.m4:heHE.OTonPateronTheos.incipit
ltx/en_us_goadedes/me.m02.d01:meMA.Ode7C1H.melody	@ltx/en_us_goadedes/he.h.m4:heHE.OTonPateronTheos.melody
ltx/en_us_goadedes/me.m02.d01:meMA.Ode7C1H.mode	@ltx/en_us_goadedes/miscellanea:misc.Mode4
ltx/en_us_goadedes/me.m02.d01:meMA.Ode7C1H.ode	@ltx/en_us_goadedes/miscellanea:misc.Ode7
ltx/en_us_goadedes/me.m02.d01:meMA.Ode7C1H.text	@ltx/en_us_goadedes/he.h.m4:heHE.OTonPateronTheos.text
ltx/en_us_goadedes/me.m02.d01:meMA.Ode7C1T.incipit	…
ltx/en_us_goadedes/me.m02.d01:meMA.Ode7C1T.melody	@ltx/en_us_goadedes/he.h.m4:heHE.OTonPateronTheos.name
ltx/en_us_goadedes/me.m02.d01:meMA.Ode7C1T.mode	@ltx/en_us_goadedes/miscellanea:misc.Mode4
ltx/en_us_goadedes/me.m02.d01:meMA.Ode7C1T.ode	@ltx/en_us_goadedes/miscellanea:misc.Ode7
ltx/en_us_goadedes/me.m02.d01:meMA.Ode7C1T.text	
ltx/en_us_goadedes/me.m02.d01:meMA.Ode7C21.greekmelody	@ltx/en_us_goadedes/he.h.m8:heHE.OiEkTisIoudaias.greekname
ltx/en_us_goadedes/me.m02.d01:meMA.Ode7C21.incipit	…
ltx/en_us_goadedes/me.m02.d01:meMA.Ode7C21.melody	@ltx/en_us_goadedes/he.h.m8:heHE.OiEkTisIoudaias.name
ltx/en_us_goadedes/me.m02.d01:meMA.Ode7C21.mode	@ltx/en_us_goadedes/miscellanea:misc.Mode8
ltx/en_us_goadedes/me.m02.d01:meMA.Ode7C21.ode	@ltx/en_us_goadedes/miscellanea:misc.Ode7
ltx/en_us_goadedes/me.m02.d01:meMA.Ode7C21.text	
ltx/en_us_goadedes/me.m02.d01:meMA.Ode7C22.incipit	…
ltx/en_us_goadedes/me.m02.d01:meMA.Ode7C22.melody	@ltx/en_us_goadedes/he.h.m8:heHE.OiEkTisIoudaias.name
ltx/en_us_goadedes/me.m02.d01:meMA.Ode7C22.mode	@ltx/en_us_goadedes/miscellanea:misc.Mode8
ltx/en_us_goadedes/me.m02.d01:meMA.Ode7C22.ode	@ltx/en_us_goadedes/miscellanea:misc.Ode7
ltx/en_us_goadedes/me.m02.d01:meMA.Ode7C22.text	
ltx/en_us_goadedes/me.m02.d01:meMA.Ode7C2T.incipit	…
ltx/en_us_goadedes/me.m02.d01:meMA.Ode7C2T.melody	@ltx/en_us_goadedes/he.h.m8:heHE.OiEkTisIoudaias.name
ltx/en_us_goadedes/me.m02.d01:meMA.Ode7C2T.mode	@ltx/en_us_goadedes/miscellanea:misc.Mode8
ltx/en_us_goadedes/me.m02.d01:meMA.Ode7C2T.ode	@ltx/en_us_goadedes/miscellanea:misc.Ode7
ltx/en_us_goadedes/me.m02.d01:meMA.Ode7C2T.text	
ltx/en_us_goadedes/me.m02.d01:meMA.Ode8C11.greekmelody	@ltx/en_us_goadedes/he.h.m4:heHE.TonVasileaChriston.greekname
ltx/en_us_goadedes/me.m02.d01:meMA.Ode8C11.incipit	…
ltx/en_us_goadedes/me.m02.d01:meMA.Ode8C11.melody	@ltx/en_us_goadedes/he.h.m4:heHE.TonVasileaChriston.name
ltx/en_us_goadedes/me.m02.d01:meMA.Ode8C11.mode	@ltx/en_us_goadedes/miscellanea:misc.Mode4
ltx/en_us_goadedes/me.m02.d01:meMA.Ode8C11.ode	@ltx/en_us_goadedes/miscellanea:misc.Ode8
ltx/en_us_goadedes/me.m02.d01:meMA.Ode8C11.text	
ltx/en_us_goadedes/me.m02.d01:meMA.Ode8C12.incipit	…
ltx/en_us_goadedes/me.m02.d01:meMA.Ode8C12.melody	@ltx/en_us_goadedes/he.h.m4:heHE.TonVasileaChriston.name
ltx/en_us_goadedes/me.m02.d01:meMA.Ode8C12.mode	@ltx/en_us_goadedes/miscellanea:misc.Mode4
ltx/en_us_goadedes/me.m02.d01:meMA.Ode8C12.ode	@ltx/en_us_goadedes/miscellanea:misc.Ode8
ltx/en_us_goadedes/me.m02.d01:meMA.Ode8C12.text	
ltx/en_us_goadedes/me.m02.d01:meMA.Ode8C13.incipit	…
ltx/en_us_goadedes/me.m02.d01:meMA.Ode8C13.melody	@ltx/en_us_goadedes/he.h.m4:heHE.TonVasileaChriston.name
ltx/en_us_goadedes/me.m02.d01:meMA.Ode8C13.mode	@ltx/en_us_goadedes/miscellanea:misc.Mode4
ltx/en_us_goadedes/me.m02.d01:meMA.Ode8C13.ode	@ltx/en_us_goadedes/miscellanea:misc.Ode8
ltx/en_us_goadedes/me.m02.d01:meMA.Ode8C13.text	
ltx/en_us_goadedes/me.m02.d01:meMA.Ode8C1H.greekmelody	@ltx/en_us_goadedes/he.h.m4:heHE.TonVasileaChriston.greekname
ltx/en_us_goadedes/me.m02.d01:meMA.Ode8C1H.incipit	@ltx/en_us_goadedes/he.h.m4:heHE.TonVasileaChriston.incipit
ltx/en_us_goadedes/me.m02.d01:meMA.Ode8C1H.melody	@ltx/en_us_goadedes/he.h.m4:heHE.TonVasileaChriston.melody
ltx/en_us_goadedes/me.m02.d01:meMA.Ode8C1H.mode	@ltx/en_us_goadedes/miscellanea:misc.Mode4
ltx/en_us_goadedes/me.m02.d01:meMA.Ode8C1H.ode	@ltx/en_us_goadedes/miscellanea:misc.Ode8
ltx/en_us_goadedes/me.m02.d01:meMA.Ode8C1H.text	@ltx/en_us_goadedes/he.h.m4:heHE.TonVasileaChriston.text
ltx/en_us_goadedes/me.m02.d01:meMA.Ode8C1T.incipit	…
ltx/en_us_goadedes/me.m02.d01:meMA.Ode8C1T.melody	@ltx/en_us_goadedes/he.h.m4:heHE.TonVasileaChriston.name
ltx/en_us_goadedes/me.m02.d01:meMA.Ode8C1T.mode	@ltx/en_us_goadedes/miscellanea:misc.Mode4
ltx/en_us_goadedes/me.m02.d01:meMA.Ode8C1T.ode	@ltx/en_us_goadedes/miscellanea:misc.Ode8
ltx/en_us_goadedes/me.m02.d01:meMA.Ode8C1T.text	
ltx/en_us_goadedes/me.m02.d01:meMA.Ode8C21.greekmelody	@ltx/en_us_goadedes/he.h.m8:heHE.EptaplasiosKaminon.greekname
ltx/en_us_goadedes/me.m02.d01:meMA.Ode8C21.incipit	…
ltx/en_us_goadedes/me.m02.d01:meMA.Ode8C21.melody	@ltx/en_us_goadedes/he.h.m8:heHE.EptaplasiosKaminon.name
ltx/en_us_goadedes/me.m02.d01:meMA.Ode8C21.mode	@ltx/en_us_goadedes/miscellanea:misc.Mode8
ltx/en_us_goadedes/me.m02.d01:meMA.Ode8C21.ode	@ltx/en_us_goadedes/miscellanea:misc.Ode8
ltx/en_us_goadedes/me.m02.d01:meMA.Ode8C21.text	
ltx/en_us_goadedes/me.m02.d01:meMA.Ode8C22.incipit	…
ltx/en_us_goadedes/me.m02.d01:meMA.Ode8C22.melody	@ltx/en_us_goadedes/he.h.m8:heHE.EptaplasiosKaminon.name
ltx/en_us_goadedes/me.m02.d01:meMA.Ode8C22.mode	@ltx/en_us_goadedes/miscellanea:misc.Mode8
ltx/en_us_goadedes/me.m02.d01:meMA.Ode8C22.ode	@ltx/en_us_goadedes/miscellanea:misc.Ode8
ltx/en_us_goadedes/me.m02.d01:meMA.Ode8C22.text	
ltx/en_us_goadedes/me.m02.d01:meMA.Ode8C23.incipit	…
ltx/en_us_goadedes/me.m02.d01:meMA.Ode8C23.melody	@ltx/en_us_goadedes/he.h.m8:heHE.EptaplasiosKaminon.name
ltx/en_us_goadedes/me.m02.d01:meMA.Ode8C23.mode	@ltx/en_us_goadedes/miscellanea:misc.Mode8
ltx/en_us_goadedes/me.m02.d01:meMA.Ode8C23.ode	@ltx/en_us_goadedes/miscellanea:misc.Ode8
ltx/en_us_goadedes/me.m02.d01:meMA.Ode8C23.text	
ltx/en_us_goadedes/me.m02.d01:meMA.Ode8C2T.incipit	…
ltx/en_us_goadedes/me.m02.d01:meMA.Ode8C2T.melody	@ltx/en_us_goadedes/he.h.m8:heHE.EptaplasiosKaminon.name
ltx/en_us_goadedes/me.m02.d01:meMA.Ode8C2T.mode	@ltx/en_us_goadedes/miscellanea:misc.Mode8
ltx/en_us_goadedes/me.m02.d01:meMA.Ode8C2T.ode	@ltx/en_us_goadedes/miscellanea:misc.Ode8
ltx/en_us_goadedes/me.m02.d01:meMA.Ode8C2T.text	
ltx/en_us_goadedes/me.m02.d01:meMA.Ode8H.greekmelody	@ltx/en_us_goadedes/he.h.m8:heHE.EptaplasiosKaminon.greekname
ltx/en_us_goadedes/me.m02.d01:meMA.Ode8H.incipit	@ltx/en_us_goadedes/he.h.m8:heHE.EptaplasiosKaminon.incipit
ltx/en_us_goadedes/me.m02.d01:meMA.Ode8H.melody	@ltx/en_us_goadedes/he.h.m8:heHE.EptaplasiosKaminon.melody
ltx/en_us_goadedes/me.m02.d01:meMA.Ode8H.mode	@ltx/en_us_goadedes/miscellanea:misc.Mode8
ltx/en_us_goadedes/me.m02.d01:meMA.Ode8H.ode	@ltx/en_us_goadedes/miscellanea:misc.Ode8
ltx/en_us_goadedes/me.m02.d01:meMA.Ode8H.text	@ltx/en_us_goadedes/he.h.m8:heHE.EptaplasiosKaminon.text
ltx/en_us_goadedes/me.m02.d01:meMA.Ode9C11.greekmelody	@ltx/en_us_goadedes/he.h.m4:heHE.MegalynomenPantes.greekname
ltx/en_us_goadedes/me.m02.d01:meMA.Ode9C11.incipit	…
ltx/en_us_goadedes/me.m02.d01:meMA.Ode9C11.melody	@ltx/en_us_goadedes/he.h.m4:heHE.MegalynomenPantes.name
ltx/en_us_goadedes/me.m02.d01:meMA.Ode9C11.mode	@ltx/en_us_goadedes/miscellanea:misc.Mode4
ltx/en_us_goadedes/me.m02.d01:meMA.Ode9C11.ode	@ltx/en_us_goadedes/miscellanea:misc.Ode9
ltx/en_us_goadedes/me.m02.d01:meMA.Ode9C11.text	
ltx/en_us_goadedes/me.m02.d01:meMA.Ode9C12.incipit	…
ltx/en_us_goadedes/me.m02.d01:meMA.Ode9C12.melody	@ltx/en_us_goadedes/he.h.m4:heHE.MegalynomenPantes.name
ltx/en_us_goadedes/me.m02.d01:meMA.Ode9C12.mode	@ltx/en_us_goadedes/miscellanea:misc.Mode4
ltx/en_us_goadedes/me.m02.d01:meMA.Ode9C12.ode	@ltx/en_us_goadedes/miscellanea:misc.Ode9
ltx/en_us_goadedes/me.m02.d01:meMA.Ode9C12.text	
ltx/en_us_goadedes/me.m02.d01:meMA.Ode9C13.incipit	…
ltx/en_us_goadedes/me.m02.d01:meMA.Ode9C13.melody	@ltx/en_us_goadedes/he.h.m4:heHE.MegalynomenPantes.name
ltx/en_us_goadedes/me.m02.d01:meMA.Ode9C13.mode	@ltx/en_us_goadedes/miscellanea:misc.Mode4
ltx/en_us_goadedes/me.m02.d01:meMA.Ode9C13.ode	@ltx/en_us_goadedes/miscellanea:misc.Ode9
ltx/en_us_goadedes/me.m02.d01:meMA.Ode9C13.text	
ltx/en_us_goadedes/me.m02.d01:meMA.Ode9C14.incipit	…
ltx/en_us_goadedes/me.m02.d01:meMA.Ode9C14.melody	@ltx/en_us_goadedes/he.h.m4:heHE.MegalynomenPantes.name
ltx/en_us_goadedes/me.m02.d01:meMA.Ode9C14.mode	@ltx/en_us_goadedes/miscellanea:misc.Mode4
ltx/en_us_goadedes/me.m02.d01:meMA.Ode9C14.ode	@ltx/en_us_goadedes/miscellanea:misc.Ode9
ltx/en_us_goadedes/me.m02.d01:meMA.Ode9C14.text	
ltx/en_us_goadedes/me.m02.d01:meMA.Ode9C1H.greekmelody	@ltx/en_us_goadedes/he.h.m4:heHE.MegalynomenPantes.greekname
ltx/en_us_goadedes/me.m02.d01:meMA.Ode9C1H.incipit	@ltx/en_us_goadedes/he.h.m4:heHE.MegalynomenPantes.incipit
ltx/en_us_goadedes/me.m02.d01:meMA.Ode9C1H.melody	@ltx/en_us_goadedes/he.h.m4:heHE.MegalynomenPantes.melody
ltx/en_us_goadedes/me.m02.d01:meMA.Ode9C1H.mode	@ltx/en_us_goadedes/miscellanea:misc.Mode4
ltx/en_us_goadedes/me.m02.d01:meMA.Ode9C1H.ode	@ltx/en_us_goadedes/miscellanea:misc.Ode9
ltx/en_us_goadedes/me.m02.d01:meMA.Ode9C1H.text	@ltx/en_us_goadedes/he.h.m4:heHE.MegalynomenPantes.text
ltx/en_us_goadedes/me.m02.d01:meMA.Ode9C1T.incipit	…
ltx/en_us_goadedes/me.m02.d01:meMA.Ode9C1T.melody	@ltx/en_us_goadedes/he.h.m4:heHE.MegalynomenPantes.name
ltx/en_us_goadedes/me.m02.d01:meMA.Ode9C1T.mode	@ltx/en_us_goadedes/miscellanea:misc.Mode4
ltx/en_us_goadedes/me.m02.d01:meMA.Ode9C1T.ode	@ltx/en_us_goadedes/miscellanea:misc.Ode9
ltx/en_us_goadedes/me.m02.d01:meMA.Ode9C1T.text	
ltx/en_us_goadedes/me.m02.d01:meMA.Ode9C21.greekmelody	@ltx/en_us_goadedes/he.h.m8:heHE.SeTinApeirogamon.greekname
ltx/en_us_goadedes/me.m02.d01:meMA.Ode9C21.incipit	…
ltx/en_us_goadedes/me.m02.d01:meMA.Ode9C21.melody	@ltx/en_us_goadedes/he.h.m8:heHE.SeTinApeirogamon.name
ltx/en_us_goadedes/me.m02.d01:meMA.Ode9C21.mode	@ltx/en_us_goadedes/miscellanea:misc.Mode8
ltx/en_us_goadedes/me.m02.d01:meMA.Ode9C21.ode	@ltx/en_us_goadedes/miscellanea:misc.Ode9
ltx/en_us_goadedes/me.m02.d01:meMA.Ode9C21.text	
ltx/en_us_goadedes/me.m02.d01:meMA.Ode9C22.incipit	…
ltx/en_us_goadedes/me.m02.d01:meMA.Ode9C22.melody	@ltx/en_us_goadedes/he.h.m8:heHE.SeTinApeirogamon.name
ltx/en_us_goadedes/me.m02.d01:meMA.Ode9C22.mode	@ltx/en_us_goadedes/miscellanea:misc.Mode8
ltx/en_us_goadedes/me.m02.d01:meMA.Ode9C22.ode	@ltx/en_us_goadedes/miscellanea:misc.Ode9
ltx/en_us_goadedes/me.m02.d01:meMA.Ode9C22.text	
ltx/en_us_goadedes/me.m02.d01:meMA.Ode9C23.incipit	…
ltx/en_us_goadedes/me.m02.d01:meMA.Ode9C23.melody	@ltx/en_us_goadedes/he.h.m8:heHE.SeTinApeirogamon.name
ltx/en_us_goadedes/me.m02.d01:meMA.Ode9C23.mode	@ltx/en_us_goadedes/miscellanea:misc.Mode8
ltx/en_us_goadedes/me.m02.d01:meMA.Ode9C23.ode	@ltx/en_us_goadedes/miscellanea:misc.Ode9
ltx/en_us_goadedes/me.m02.d01:meMA.Ode9C23.text	
ltx/en_us_goadedes/me.m02.d01:meMA.Ode9C2T.incipit	…
ltx/en_us_goadedes/me.m02.d01:meMA.Ode9C2T.melody	@ltx/en_us_goadedes/he.h.m8:heHE.SeTinApeirogamon.name
ltx/en_us_goadedes/me.m02.d01:meMA.Ode9C2T.mode	@ltx/en_us_goadedes/miscellanea:misc.Mode8
ltx/en_us_goadedes/me.m02.d01:meMA.Ode9C2T.ode	@ltx/en_us_goadedes/miscellanea:misc.Ode9
ltx/en_us_goadedes/me.m02.d01:meMA.Ode9C2T.text	
ltx/en_us_goadedes/me.m02.d01:meMA.Ode9H.greekmelody	@ltx/en_us_goadedes/he.h.m8:heHE.SeTinApeirogamon.greekname
ltx/en_us_goadedes/me.m02.d01:meMA.Ode9H.incipit	@ltx/en_us_goadedes/he.h.m8:heHE.SeTinApeirogamon.incipit
ltx/en_us_goadedes/me.m02.d01:meMA.Ode9H.melody	@ltx/en_us_goadedes/he.h.m8:heHE.SeTinApeirogamon.melody
ltx/en_us_goadedes/me.m02.d01:meMA.Ode9H.mode	@ltx/en_us_goadedes/miscellanea:misc.Mode8
ltx/en_us_goadedes/me.m02.d01:meMA.Ode9H.ode	@ltx/en_us_goadedes/miscellanea:misc.Ode9
ltx/en_us_goadedes/me.m02.d01:meMA.Ode9H.text	@ltx/en_us_goadedes/he.h.m8:heHE.SeTinApeirogamon.text
ltx/en_us_goadedes/me.m02.d01:meMA.Oikos1.text	
ltx/en_us_goadedes/me.m02.d01:meVE.Apolytikion1.greekmelody	@ltx/en_us_goadedes/he.a.m4:heAU.TachyProkatalave.greekname
ltx/en_us_goadedes/me.m02.d01:meVE.Apolytikion1.incipit	@ltx/en_us_goadedes/he.ga:heGA.OMartysSouKyrie.incipit
ltx/en_us_goadedes/me.m02.d01:meVE.Apolytikion1.melody	@ltx/en_us_goadedes/he.a.m4:heAU.TachyProkatalave.name
ltx/en_us_goadedes/me.m02.d01:meVE.Apolytikion1.mode	@ltx/en_us_goadedes/miscellanea:misc.Mode4
ltx/en_us_goadedes/me.m02.d01:meVE.Apolytikion1.text	@ltx/en_us_goadedes/he.ga:heGA.OMartysSouKyrie.text
ltx/en_us_goadedes/me.m02.d01:meVE.Apolytikion2.greekmelody	@ltx/en_us_goadedes/he.a.m1:heAU.ChorosAngelikos.greekname
ltx/en_us_goadedes/me.m02.d01:meVE.Apolytikion2.incipit	…
ltx/en_us_goadedes/me.m02.d01:meVE.Apolytikion2.melody	@ltx/en_us_goadedes/he.a.m1:heAU.ChorosAngelikos.name
ltx/en_us_goadedes/me.m02.d01:meVE.Apolytikion2.mode	@ltx/en_us_goadedes/miscellanea:misc.Mode1
ltx/en_us_goadedes/me.m02.d01:meVE.Apolytikion2.text	
ltx/en_us_goadedes/me.m02.d01:meVE.AposGlory.incipit	…
ltx/en_us_goadedes/me.m02.d01:meVE.AposGlory.melody	
ltx/en_us_goadedes/me.m02.d01:meVE.AposGlory.mode	@ltx/en_us_goadedes/miscellanea:misc.Mode2
ltx/en_us_goadedes/me.m02.d01:meVE.AposGlory.poet	@ltx/en_us_goadedes/poets:po.GermanouOiDeIoannouMonachou
ltx/en_us_goadedes/me.m02.d01:meVE.AposGlory.text	
ltx/en_us_goadedes/me.m02.d01:meVE.Aposticha1.greekmelody	Τὴν Ἀνάστασίν σου.
ltx/en_us_goadedes/me.m02.d01:meVE.Aposticha1.incipit	…
ltx/en_us_goadedes/me.m02.d01:meVE.Aposticha1.melody	
ltx/en_us_goadedes/me.m02.d01:meVE.Aposticha1.mode	@ltx/en_us_goadedes/miscellanea:misc.Mode6
ltx/en_us_goadedes/me.m02.d01:meVE.Aposticha1.text	
ltx/en_us_goadedes/me.m02.d01:meVE.Aposticha2.incipit	…
ltx/en_us_goadedes/me.m02.d01:meVE.Aposticha2.melody	
ltx/en_us_goadedes/me.m02.d01:meVE.Aposticha2.mode	@ltx/en_us_goadedes/miscellanea:misc.Mode6
ltx/en_us_goadedes/me.m02.d01:meVE.Aposticha2.text	
ltx/en_us_goadedes/me.m02.d01:meVE.Aposticha3.incipit	…
ltx/en_us_goadedes/me.m02.d01:meVE.Aposticha3.melody	
ltx/en_us_goadedes/me.m02.d01:meVE.Aposticha3.mode	@ltx/en_us_goadedes/miscellanea:misc.Mode6
ltx/en_us_goadedes/me.m02.d01:meVE.Aposticha3.text	
ltx/en_us_goadedes/me.m02.d01:meVE.SticBoth.incipit	…
ltx/en_us_goadedes/me.m02.d01:meVE.SticBoth.melody	
ltx/en_us_goadedes/me.m02.d01:meVE.SticBoth.mode	@ltx/en_us_goadedes/miscellanea:misc.Mode2
ltx/en_us_goadedes/me.m02.d01:meVE.SticBoth.poet	@ltx/en_us_goadedes/poets:po.Germanou
ltx/en_us_goadedes/me.m02.d01:meVE.SticBoth.text	
ltx/en_us_goadedes/me.m02.d01:meVE.SticGlory.incipit	…
ltx/en_us_goadedes/me.m02.d01:meVE.SticGlory.melody	
ltx/en_us_goadedes/me.m02.d01:meVE.SticGlory.mode	@ltx/en_us_goadedes/miscellanea:misc.Mode2
ltx/en_us_goadedes/me.m02.d01:meVE.SticGlory.poet	@ltx/en_us_goadedes/poets:po.Kyprianou
ltx/en_us_goadedes/me.m02.d01:meVE.SticGlory.text	
ltx/en_us_goadedes/me.m02.d01:meVE.Stichera01.greekmelody	@ltx/en_us_goadedes/he.a.m4:heAU.OsGennaionEnMartysi.greekname
ltx/en_us_goadedes/me.m02.d01:meVE.Stichera01.incipit	…
ltx/en_us_goadedes/me.m02.d01:meVE.Stichera01.melody	@ltx/en_us_goadedes/he.a.m4:heAU.OsGennaionEnMartysi.name
ltx/en_us_goadedes/me.m02.d01:meVE.Stichera01.mode	@ltx/en_us_goadedes/miscellanea:misc.Mode4
ltx/en_us_goadedes/me.m02.d01:meVE.Stichera01.text	
ltx/en_us_goadedes/me.m02.d01:meVE.Stichera02.incipit	…
ltx/en_us_goadedes/me.m02.d01:meVE.Stichera02.melody	@ltx/en_us_goadedes/he.a.m4:heAU.OsGennaionEnMartysi.name
ltx/en_us_goadedes/me.m02.d01:meVE.Stichera02.mode	@ltx/en_us_goadedes/miscellanea:misc.Mode4
ltx/en_us_goadedes/me.m02.d01:meVE.Stichera02.text	
ltx/en_us_goadedes/me.m02.d01:meVE.Stichera03.incipit	…
ltx/en_us_goadedes/me.m02.d01:meVE.Stichera03.melody	@ltx/en_us_goadedes/he.a.m4:heAU.OsGennaionEnMartysi.name
ltx/en_us_goadedes/me.m02.d01:meVE.Stichera03.mode	@ltx/en_us_goadedes/miscellanea:misc.Mode4
ltx/en_us_goadedes/me.m02.d01:meVE.Stichera03.text	
ltx/en_us_goadedes/me.m02.d01:meVE.Stichera04.greekmelody	@ltx/en_us_goadedes/he.a.m1:heAU.PaneffimoiMartyres.greekname
ltx/en_us_goadedes/me.m02.d01:meVE.Stichera04.incipit	…
ltx/en_us_goadedes/me.m02.d01:meVE.Stichera04.melody	@ltx/en_us_goadedes/he.a.m1:heAU.PaneffimoiMartyres.name
ltx/en_us_goadedes/me.m02.d01:meVE.Stichera04.mode	@ltx/en_us_goadedes/miscellanea:misc.Mode1
ltx/en_us_goadedes/me.m02.d01:meVE.Stichera04.text	
ltx/en_us_goadedes/me.m02.d01:meVE.Stichera05.incipit	…
ltx/en_us_goadedes/me.m02.d01:meVE.Stichera05.melody	@ltx/en_us_goadedes/he.a.m1:heAU.PaneffimoiMartyres.name
ltx/en_us_goadedes/me.m02.d01:meVE.Stichera05.mode	@ltx/en_us_goadedes/miscellanea:misc.Mode1
ltx/en_us_goadedes/me.m02.d01:meVE.Stichera05.text	
ltx/en_us_goadedes/me.m02.d01:meVE.Stichera06.incipit	…
ltx/en_us_goadedes/me.m02.d01:meVE.Stichera06.melody	@ltx/en_us_goadedes/he.a.m1:heAU.PaneffimoiMartyres.name
ltx/en_us_goadedes/me.m02.d01:meVE.Stichera06.mode	@ltx/en_us_goadedes/miscellanea:misc.Mode1
ltx/en_us_goadedes/me.m02.d01:meVE.Stichera06.text	
