ltx/en_us_goadedes/eu.beforeliturgy:euBL.Key0100.title	
ltx/en_us_goadedes/eu.beforeliturgy:euBL.Key0100h.text	
ltx/en_us_goadedes/eu.beforeliturgy:euBL.Key0101.text	
ltx/en_us_goadedes/eu.beforeliturgy:euBL.Key0102.text	
ltx/en_us_goadedes/eu.beforeliturgy:euBL.Key0200.title	
ltx/en_us_goadedes/eu.beforeliturgy:euBL.Key0201.text	
ltx/en_us_goadedes/eu.beforeliturgy:euBL.Key0202.text	
ltx/en_us_goadedes/eu.beforeliturgy:euBL.Key0203.text	
ltx/en_us_goadedes/eu.beforeliturgy:euBL.Key0204.text	
ltx/en_us_goadedes/eu.beforeliturgy:euBL.Key0205.text	
ltx/en_us_goadedes/eu.beforeliturgy:euBL.Key0206.text	
ltx/en_us_goadedes/eu.beforeliturgy:euBL.Key0207.text	
ltx/en_us_goadedes/eu.beforeliturgy:euBL.Key0208.text	
ltx/en_us_goadedes/eu.beforeliturgy:euBL.Key0209.text	
ltx/en_us_goadedes/eu.beforeliturgy:euBL.Key0300.title	
ltx/en_us_goadedes/eu.beforeliturgy:euBL.Key0301.text	
ltx/en_us_goadedes/eu.beforeliturgy:euBL.Key0302.text	
ltx/en_us_goadedes/eu.beforeliturgy:euBL.Key0303.text	
ltx/en_us_goadedes/eu.beforeliturgy:euBL.Key0304.text	
ltx/en_us_goadedes/eu.beforeliturgy:euBL.Key0305.text	
ltx/en_us_goadedes/eu.beforeliturgy:euBL.Key0306.text	
ltx/en_us_goadedes/eu.beforeliturgy:euBL.Key0307.text	
ltx/en_us_goadedes/eu.beforeliturgy:euBL.Key0308.text	
ltx/en_us_goadedes/eu.beforeliturgy:euBL.Key0309.text	
ltx/en_us_goadedes/eu.beforeliturgy:euBL.Key0310.text	
ltx/en_us_goadedes/eu.beforeliturgy:euBL.Key0311.text	
ltx/en_us_goadedes/eu.beforeliturgy:euBL.Key0312.text	
ltx/en_us_goadedes/eu.beforeliturgy:euBL.Key0313.text	
ltx/en_us_goadedes/eu.beforeliturgy:euBL.Key0314.text	
ltx/en_us_goadedes/eu.beforeliturgy:euBL.Key0315.text	
ltx/en_us_goadedes/eu.beforeliturgy:euBL.Key0316.text	
ltx/en_us_goadedes/eu.beforeliturgy:euBL.Key0317.text	
ltx/en_us_goadedes/eu.beforeliturgy:euBL.Key0318.text	
ltx/en_us_goadedes/eu.beforeliturgy:euBL.Key0319.text	
ltx/en_us_goadedes/eu.beforeliturgy:euBL.Key0320.text	
ltx/en_us_goadedes/eu.beforeliturgy:euBL.Key0321.text	
ltx/en_us_goadedes/eu.beforeliturgy:euBL.Key0322.text	
ltx/en_us_goadedes/eu.beforeliturgy:euBL.Key0323.text	
ltx/en_us_goadedes/eu.beforeliturgy:euBL.Key0400.title	
ltx/en_us_goadedes/eu.beforeliturgy:euBL.Key0401.text	
ltx/en_us_goadedes/eu.beforeliturgy:euBL.R101	
ltx/en_us_goadedes/eu.beforeliturgy:euBL.R102	
ltx/en_us_goadedes/eu.beforeliturgy:euBL.R103	
ltx/en_us_goadedes/eu.beforeliturgy:euBL.R104	
ltx/en_us_goadedes/eu.beforeliturgy:euBL.R105	
ltx/en_us_goadedes/eu.beforeliturgy:euBL.R106	
ltx/en_us_goadedes/eu.beforeliturgy:euBL.R107	
ltx/en_us_goadedes/eu.beforeliturgy:euBL.R108	
ltx/en_us_goadedes/eu.beforeliturgy:euBL.R109	
ltx/en_us_goadedes/eu.beforeliturgy:euBL.R110	
ltx/en_us_goadedes/eu.beforeliturgy:euBL.R111	
ltx/en_us_goadedes/eu.beforeliturgy:euBL.R112	
ltx/en_us_goadedes/eu.beforeliturgy:euBL.R113	
ltx/en_us_goadedes/eu.beforeliturgy:euBL.R114	
ltx/en_us_goadedes/eu.beforeliturgy:euBL.R115	
ltx/en_us_goadedes/eu.beforeliturgy:euBL.R116	
ltx/en_us_goadedes/eu.beforeliturgy:euBL.R117	
ltx/en_us_goadedes/eu.beforeliturgy:euBL.R201	
ltx/en_us_goadedes/eu.beforeliturgy:euBL.R202	
ltx/en_us_goadedes/eu.beforeliturgy:euBL.R203	
ltx/en_us_goadedes/eu.beforeliturgy:euBL.R204	
ltx/en_us_goadedes/eu.beforeliturgy:euBL.R205	
ltx/en_us_goadedes/eu.beforeliturgy:euBL.R206	
ltx/en_us_goadedes/eu.beforeliturgy:euBL.R207	
ltx/en_us_goadedes/eu.beforeliturgy:euBL.R208	
ltx/en_us_goadedes/eu.beforeliturgy:euBL.R209	
ltx/en_us_goadedes/eu.beforeliturgy:euBL.R210	
ltx/en_us_goadedes/eu.beforeliturgy:euBL.R211	
ltx/en_us_goadedes/eu.beforeliturgy:euBL.R212	
ltx/en_us_goadedes/eu.beforeliturgy:euBL.R213	
ltx/en_us_goadedes/eu.beforeliturgy:euBL.R214	
ltx/en_us_goadedes/eu.beforeliturgy:euBL.R215	
ltx/en_us_goadedes/eu.beforeliturgy:euBL.R216	
ltx/en_us_goadedes/eu.beforeliturgy:euBL.R217	
ltx/en_us_goadedes/eu.beforeliturgy:euBL.R301	
ltx/en_us_goadedes/eu.beforeliturgy:euBL.R302	
ltx/en_us_goadedes/eu.beforeliturgy:euBL.R303	
ltx/en_us_goadedes/eu.beforeliturgy:euBL.R304	
ltx/en_us_goadedes/eu.beforeliturgy:euBL.R305	
ltx/en_us_goadedes/eu.beforeliturgy:euBL.R306	
ltx/en_us_goadedes/eu.beforeliturgy:euBL.R307	
ltx/en_us_goadedes/eu.beforeliturgy:euBL.R308	
ltx/en_us_goadedes/eu.beforeliturgy:euBL.R309	
ltx/en_us_goadedes/eu.beforeliturgy:euBL.R310	
ltx/en_us_goadedes/eu.beforeliturgy:euBL.R311	
ltx/en_us_goadedes/eu.beforeliturgy:euBL.R401	
ltx/en_us_goadedes/eu.beforeliturgy:euBL.R402	
ltx/en_us_goadedes/eu.beforeliturgy:euBL.R403	
ltx/en_us_goadedes/eu.beforeliturgy:euBL.copyright	
ltx/en_us_goadedes/eu.beforeliturgy:euBL.notice	
ltx/en_us_goadedes/eu.beforeliturgy:euLBL.title	
