ltx/en_us_goadedes/eo.e03:eo.Doxasticon.incipit	When Mary Magdalene…
ltx/en_us_goadedes/eo.e03:eo.Doxasticon.mode	@ltx/en_us_goadedes/miscellanea:misc.Mode3
ltx/en_us_goadedes/eo.e03:eo.Doxasticon.text	When Mary Magdalene brought the good news, that You, the Savior, had risen from the dead, and had appeared to her, the disciples did not believe her. So You upbraided them for their hardness of heart. But once they were fully equipped with the signs and miracles, You sent them out to preach the gospel. Then You, O Lord, were taken up to Your Father, the Source of Light; and they went forth and preached everywhere, and the message was confirmed by the miracles. And now we, who through them have been enlightened, glorify Your resurrection from the dead, O benevolent Lord.
ltx/en_us_goadedes/eo.e03:eo.Exaposteilarion.greekmelody	@ltx/en_us_goadedes/he.a.m2:heAU.ToisMathitaisSynelthomen.greekname
ltx/en_us_goadedes/eo.e03:eo.Exaposteilarion.incipit	Let no one doubt…
ltx/en_us_goadedes/eo.e03:eo.Exaposteilarion.melody	@ltx/en_us_goadedes/he.a.m2:heAU.ToisMathitaisSynelthomen.name
ltx/en_us_goadedes/eo.e03:eo.Exaposteilarion.mode	@ltx/en_us_goadedes/miscellanea:misc.Mode2
ltx/en_us_goadedes/eo.e03:eo.Exaposteilarion.text	Let no one doubt or disbelieve * that Christ has truly risen. * For first to Mary Magdalene * He appeared, then to others, * as they walked into the country, * later, to the eleven * disciples, as they ate a meal. * He sent them out to baptize throughout the world. * Then He ascended into heaven, from which * He had come down. And He confirmed * by many signs the message.
ltx/en_us_goadedes/eo.e03:eo.Theotokion.incipit	You have risen today…
ltx/en_us_goadedes/eo.e03:eo.Theotokion.melody	@ltx/en_us_goadedes/he.a.m2:heAU.ToisMathitaisSynelthomen.name
ltx/en_us_goadedes/eo.e03:eo.Theotokion.mode	@ltx/en_us_goadedes/miscellanea:misc.Mode2
ltx/en_us_goadedes/eo.e03:eo.Theotokion.text	You have risen today, O Sun, * the bridegroom from his chamber, * from Your all-holy sepulcher, * after despoiling Hades * and making death ineffective. * Heed, now, the intercessions * of Your Mother, and send us light, * light divine that illumines our hearts and souls, * to us all send out the light that is guiding * our feet into the ways of peace * and paths of Your commandments.
ltx/en_us_goadedes/eo.e03:eo.title	Eothinon 3.
