ltx/en_us_goadedes/oc.m8.d1:ocBK.ModeNaked	@ltx/en_us_goadedes/miscellanea:misc.Mode8.naked
ltx/en_us_goadedes/oc.m8.d1:ocBK.mode.title	
ltx/en_us_goadedes/oc.m8.d1:ocGE.MM.BothHeirmologic.text	@ltx/en_us_goadedes/properties:media.key
ltx/en_us_goadedes/oc.m8.d1:ocGE.MM.BothSticheraric.text	@ltx/en_us_goadedes/properties:media.key
ltx/en_us_goadedes/oc.m8.d1:ocGE.MM.GloryHeirmologic.text	@ltx/en_us_goadedes/properties:media.key
ltx/en_us_goadedes/oc.m8.d1:ocGE.MM.GlorySticheraric.text	@ltx/en_us_goadedes/properties:media.key
ltx/en_us_goadedes/oc.m8.d1:ocLI.Beatitudes1.incipit	…
ltx/en_us_goadedes/oc.m8.d1:ocLI.Beatitudes1.melody	
ltx/en_us_goadedes/oc.m8.d1:ocLI.Beatitudes1.mode	@ltx/en_us_goadedes/miscellanea:misc.Mode8
ltx/en_us_goadedes/oc.m8.d1:ocLI.Beatitudes1.text	
ltx/en_us_goadedes/oc.m8.d1:ocLI.Beatitudes2.incipit	…
ltx/en_us_goadedes/oc.m8.d1:ocLI.Beatitudes2.melody	
ltx/en_us_goadedes/oc.m8.d1:ocLI.Beatitudes2.mode	@ltx/en_us_goadedes/miscellanea:misc.Mode8
ltx/en_us_goadedes/oc.m8.d1:ocLI.Beatitudes2.text	
ltx/en_us_goadedes/oc.m8.d1:ocLI.Beatitudes3.incipit	…
ltx/en_us_goadedes/oc.m8.d1:ocLI.Beatitudes3.melody	
ltx/en_us_goadedes/oc.m8.d1:ocLI.Beatitudes3.mode	@ltx/en_us_goadedes/miscellanea:misc.Mode8
ltx/en_us_goadedes/oc.m8.d1:ocLI.Beatitudes3.text	
ltx/en_us_goadedes/oc.m8.d1:ocLI.Beatitudes4.incipit	…
ltx/en_us_goadedes/oc.m8.d1:ocLI.Beatitudes4.melody	
ltx/en_us_goadedes/oc.m8.d1:ocLI.Beatitudes4.mode	@ltx/en_us_goadedes/miscellanea:misc.Mode8
ltx/en_us_goadedes/oc.m8.d1:ocLI.Beatitudes4.text	
ltx/en_us_goadedes/oc.m8.d1:ocLI.Beatitudes5.incipit	…
ltx/en_us_goadedes/oc.m8.d1:ocLI.Beatitudes5.melody	
ltx/en_us_goadedes/oc.m8.d1:ocLI.Beatitudes5.mode	@ltx/en_us_goadedes/miscellanea:misc.Mode8
ltx/en_us_goadedes/oc.m8.d1:ocLI.Beatitudes5.text	
ltx/en_us_goadedes/oc.m8.d1:ocLI.Beatitudes6.incipit	…
ltx/en_us_goadedes/oc.m8.d1:ocLI.Beatitudes6.melody	
ltx/en_us_goadedes/oc.m8.d1:ocLI.Beatitudes6.mode	@ltx/en_us_goadedes/miscellanea:misc.Mode8
ltx/en_us_goadedes/oc.m8.d1:ocLI.Beatitudes6.text	
ltx/en_us_goadedes/oc.m8.d1:ocLI.BeatitudesT.incipit	…
ltx/en_us_goadedes/oc.m8.d1:ocLI.BeatitudesT.melody	
ltx/en_us_goadedes/oc.m8.d1:ocLI.BeatitudesT.mode	@ltx/en_us_goadedes/miscellanea:misc.Mode8
ltx/en_us_goadedes/oc.m8.d1:ocLI.BeatitudesT.text	
ltx/en_us_goadedes/oc.m8.d1:ocLI.BeatitudesTr.incipit	…
ltx/en_us_goadedes/oc.m8.d1:ocLI.BeatitudesTr.melody	
ltx/en_us_goadedes/oc.m8.d1:ocLI.BeatitudesTr.mode	@ltx/en_us_goadedes/miscellanea:misc.Mode8
ltx/en_us_goadedes/oc.m8.d1:ocLI.BeatitudesTr.text	
ltx/en_us_goadedes/oc.m8.d1:ocLI.MM.Beatitudes123456TrTas5678910GB.text	@ltx/en_us_goadedes/properties:media.key
ltx/en_us_goadedes/oc.m8.d1:ocLI.MM.Beatitudes123Tas1234.text	@ltx/en_us_goadedes/properties:media.key
ltx/en_us_goadedes/oc.m8.d1:ocLI.MM.Beatitudes123Tas5678.text	@ltx/en_us_goadedes/properties:media.key
ltx/en_us_goadedes/oc.m8.d1:ocLI.MM.Prokeimenon.text	@ltx/en_us_goadedes/properties:media.key
ltx/en_us_goadedes/oc.m8.d1:ocMA.Antiphon11.incipit	From my youth…
ltx/en_us_goadedes/oc.m8.d1:ocMA.Antiphon11.melody	
ltx/en_us_goadedes/oc.m8.d1:ocMA.Antiphon11.mode	@ltx/en_us_goadedes/miscellanea:misc.Mode8
ltx/en_us_goadedes/oc.m8.d1:ocMA.Antiphon11.text	From my youth the enemy tempts me, with the pleasures he inflames me. But trusting in You, O Lord, I repel and vanquish him.
ltx/en_us_goadedes/oc.m8.d1:ocMA.Antiphon12.incipit	Let those who hate Zion…
ltx/en_us_goadedes/oc.m8.d1:ocMA.Antiphon12.melody	
ltx/en_us_goadedes/oc.m8.d1:ocMA.Antiphon12.mode	@ltx/en_us_goadedes/miscellanea:misc.Mode8
ltx/en_us_goadedes/oc.m8.d1:ocMA.Antiphon12.text	Let those who hate Zion become like the grass before it is plucked up. For Christ will cut their necks in pieces with the cutting blade of torments.
ltx/en_us_goadedes/oc.m8.d1:ocMA.Antiphon13.incipit	In the Holy Spirit is the life…
ltx/en_us_goadedes/oc.m8.d1:ocMA.Antiphon13.melody	
ltx/en_us_goadedes/oc.m8.d1:ocMA.Antiphon13.mode	@ltx/en_us_goadedes/miscellanea:misc.Mode8
ltx/en_us_goadedes/oc.m8.d1:ocMA.Antiphon13.text	In the Holy Spirit is the life of all things living. He is light from light and great God. We extol Him with the Father and the Logos.
ltx/en_us_goadedes/oc.m8.d1:ocMA.Antiphon21.incipit	Let my heart be humble-minded…
ltx/en_us_goadedes/oc.m8.d1:ocMA.Antiphon21.melody	
ltx/en_us_goadedes/oc.m8.d1:ocMA.Antiphon21.mode	@ltx/en_us_goadedes/miscellanea:misc.Mode8
ltx/en_us_goadedes/oc.m8.d1:ocMA.Antiphon21.text	Let my heart be humble-minded and covered with the fear of You, O Lord, lest it be exalted and fall from You, all-compassionate Master.
ltx/en_us_goadedes/oc.m8.d1:ocMA.Antiphon22.incipit	Whoever hopes in the Lord…
ltx/en_us_goadedes/oc.m8.d1:ocMA.Antiphon22.melody	
ltx/en_us_goadedes/oc.m8.d1:ocMA.Antiphon22.mode	@ltx/en_us_goadedes/miscellanea:misc.Mode8
ltx/en_us_goadedes/oc.m8.d1:ocMA.Antiphon22.text	Whoever hopes in the Lord will not fear when He will judge and punish all things with fire.
ltx/en_us_goadedes/oc.m8.d1:ocMA.Antiphon23.incipit	In the Holy Spirit every…
ltx/en_us_goadedes/oc.m8.d1:ocMA.Antiphon23.melody	
ltx/en_us_goadedes/oc.m8.d1:ocMA.Antiphon23.mode	@ltx/en_us_goadedes/miscellanea:misc.Mode8
ltx/en_us_goadedes/oc.m8.d1:ocMA.Antiphon23.text	In the Holy Spirit every holy person sees and speaks as a prophet. They do sublime miracles, praising the one God in three persons. For though It shines with three-fold light, yet the Godhead rules as monarch.
ltx/en_us_goadedes/oc.m8.d1:ocMA.Antiphon31.incipit	I cried to You, O Lord…
ltx/en_us_goadedes/oc.m8.d1:ocMA.Antiphon31.melody	
ltx/en_us_goadedes/oc.m8.d1:ocMA.Antiphon31.mode	@ltx/en_us_goadedes/miscellanea:misc.Mode8
ltx/en_us_goadedes/oc.m8.d1:ocMA.Antiphon31.text	I cried to You, O Lord. Attend to me. Incline Your ear to me who am crying, and purify me prior to taking me from this life.
ltx/en_us_goadedes/oc.m8.d1:ocMA.Antiphon32.incipit	Everyone who sets…
ltx/en_us_goadedes/oc.m8.d1:ocMA.Antiphon32.melody	
ltx/en_us_goadedes/oc.m8.d1:ocMA.Antiphon32.mode	@ltx/en_us_goadedes/miscellanea:misc.Mode8
ltx/en_us_goadedes/oc.m8.d1:ocMA.Antiphon32.text	Everyone who sets in the earth, his mother, will again return thence, to receive the torments or honors for his life’s actions.
ltx/en_us_goadedes/oc.m8.d1:ocMA.Antiphon33.incipit	From the Holy Spirit comes theology…
ltx/en_us_goadedes/oc.m8.d1:ocMA.Antiphon33.melody	
ltx/en_us_goadedes/oc.m8.d1:ocMA.Antiphon33.mode	@ltx/en_us_goadedes/miscellanea:misc.Mode8
ltx/en_us_goadedes/oc.m8.d1:ocMA.Antiphon33.text	From the Holy Spirit comes theology. One God, thrice-holy: The Father is without beginning, and the Son came from Him eternally, and the Spirit, sharing form and throne, shone at once from the Father.
ltx/en_us_goadedes/oc.m8.d1:ocMA.Antiphon41.incipit	Behold now, what is so good…
ltx/en_us_goadedes/oc.m8.d1:ocMA.Antiphon41.melody	
ltx/en_us_goadedes/oc.m8.d1:ocMA.Antiphon41.mode	@ltx/en_us_goadedes/miscellanea:misc.Mode8
ltx/en_us_goadedes/oc.m8.d1:ocMA.Antiphon41.text	Behold now, what is so good or so pleasant as for brethren to dwell together? For in this the Lord has promised life everlasting.
ltx/en_us_goadedes/oc.m8.d1:ocMA.Antiphon42.incipit	He who adorns…
ltx/en_us_goadedes/oc.m8.d1:ocMA.Antiphon42.melody	
ltx/en_us_goadedes/oc.m8.d1:ocMA.Antiphon42.mode	@ltx/en_us_goadedes/miscellanea:misc.Mode8
ltx/en_us_goadedes/oc.m8.d1:ocMA.Antiphon42.text	He who adorns the lilies of the field commands us not to be concerned about our clothing.
ltx/en_us_goadedes/oc.m8.d1:ocMA.Antiphon43.incipit	In the Holy Spirit, the unifying Cause…
ltx/en_us_goadedes/oc.m8.d1:ocMA.Antiphon43.melody	
ltx/en_us_goadedes/oc.m8.d1:ocMA.Antiphon43.mode	@ltx/en_us_goadedes/miscellanea:misc.Mode8
ltx/en_us_goadedes/oc.m8.d1:ocMA.Antiphon43.text	In the Holy Spirit, the unifying Cause, all things are sustained in peaceful coexistence. This is so for He is God, with the Father and the Son being truly one in essence.
ltx/en_us_goadedes/oc.m8.d1:ocMA.ApolTheotokion.incipit	@ltx/en_us_goadedes/ho.ho03:hoMA.SunTroparion2.incipit
ltx/en_us_goadedes/oc.m8.d1:ocMA.ApolTheotokion.melody	
ltx/en_us_goadedes/oc.m8.d1:ocMA.ApolTheotokion.mode	@ltx/en_us_goadedes/miscellanea:misc.Mode8
ltx/en_us_goadedes/oc.m8.d1:ocMA.ApolTheotokion.text	@ltx/en_us_goadedes/ho.ho03:hoMA.SunTroparion2.text
ltx/en_us_goadedes/oc.m8.d1:ocMA.C3.acrostic.notice1	
ltx/en_us_goadedes/oc.m8.d1:ocMA.C3.acrostic.title	Canon for the Theotokos.
ltx/en_us_goadedes/oc.m8.d1:ocMA.Hypakoe.incipit	The Myrrh-bearing Women…
ltx/en_us_goadedes/oc.m8.d1:ocMA.Hypakoe.melody	
ltx/en_us_goadedes/oc.m8.d1:ocMA.Hypakoe.mode	@ltx/en_us_goadedes/miscellanea:misc.Mode8
ltx/en_us_goadedes/oc.m8.d1:ocMA.Hypakoe.text	The Myrrh-bearing Women went to the tomb of the Giver of Life, seeking the immortal Master among the dead. And receiving good tidings of joy from the Angel, they reported to the Apostles, that the Lord had risen, granting the great mercy to the world.
ltx/en_us_goadedes/oc.m8.d1:ocMA.Kathisma11.greekmelody	@ltx/en_us_goadedes/he.a.m8:heAU.AnestisEkNekron.greekname
ltx/en_us_goadedes/oc.m8.d1:ocMA.Kathisma11.incipit	@ltx/en_us_goadedes/he.a.m8:heAU.AnestisEkNekron.incipit
ltx/en_us_goadedes/oc.m8.d1:ocMA.Kathisma11.melody	@ltx/en_us_goadedes/he.a.m8:heAU.AnestisEkNekron.melody
ltx/en_us_goadedes/oc.m8.d1:ocMA.Kathisma11.mode	@ltx/en_us_goadedes/miscellanea:misc.Mode8
ltx/en_us_goadedes/oc.m8.d1:ocMA.Kathisma11.text	@ltx/en_us_goadedes/he.a.m8:heAU.AnestisEkNekron.text
ltx/en_us_goadedes/oc.m8.d1:ocMA.Kathisma12.greekmelody	@ltx/en_us_goadedes/he.a.m8:heAU.TinSofianKaiLogon.greekname
ltx/en_us_goadedes/oc.m8.d1:ocMA.Kathisma12.incipit	Having risen indeed…
ltx/en_us_goadedes/oc.m8.d1:ocMA.Kathisma12.melody	@ltx/en_us_goadedes/he.a.m8:heAU.TinSofianKaiLogon.name
ltx/en_us_goadedes/oc.m8.d1:ocMA.Kathisma12.mode	@ltx/en_us_goadedes/miscellanea:misc.Mode8
ltx/en_us_goadedes/oc.m8.d1:ocMA.Kathisma12.text	Having risen indeed from the tomb, O Lord, * as recorded in Scripture, You told the devout * women to proclaim Your resurrection to the Apostles. * Then Peter came out and he ran to the tomb; * he was amazed beholding the light in the sepulcher. * Looking in he saw that Your holy body was missing; * the napkin and linen cloths were by themselves, lying separately. * Then he believed it and cried aloud, * “Glory to You, Christ God, for You save all people, O Savior! * You are the reflection of the Father’s glory!”
ltx/en_us_goadedes/oc.m8.d1:ocMA.Kathisma13.greekmelody	@ltx/en_us_goadedes/he.a.m8:heAU.TinSofianKaiLogon.greekname
ltx/en_us_goadedes/oc.m8.d1:ocMA.Kathisma13.incipit	Let us sing hymns…
ltx/en_us_goadedes/oc.m8.d1:ocMA.Kathisma13.melody	@ltx/en_us_goadedes/he.a.m8:heAU.TinSofianKaiLogon.name
ltx/en_us_goadedes/oc.m8.d1:ocMA.Kathisma13.mode	@ltx/en_us_goadedes/miscellanea:misc.Mode8
ltx/en_us_goadedes/oc.m8.d1:ocMA.Kathisma13.text	Let us sing hymns extolling the holy ark * and the heavenly gate and the shining cloud, * the all-holy mountain, and the heavenly ladder, * the allegorical Paradise and the release of Eve, * the great and precious treasure of the entire world. * For in her humanity’s salvation was accomplished; * through her has the world received the forgiveness of age-old sins. * Let us therefore cry out to her, * “Intercede with your Son and our God, that He grant forgiveness of their offenses * to those who reverently honor your all-holy childbirth.”
ltx/en_us_goadedes/oc.m8.d1:ocMA.Kathisma21.incipit	Human beings put a seal…
ltx/en_us_goadedes/oc.m8.d1:ocMA.Kathisma21.melody	
ltx/en_us_goadedes/oc.m8.d1:ocMA.Kathisma21.mode	@ltx/en_us_goadedes/miscellanea:misc.Mode8
ltx/en_us_goadedes/oc.m8.d1:ocMA.Kathisma21.text	Human beings put a seal on Your tomb; an Angel rolled the stone away from its door. Women saw You risen from the dead, O Savior, and they brought the joyful news to Your disciples in Zion, that You the life of all had risen, and that the bonds of death were shattered. Glory to You, O Lord!
ltx/en_us_goadedes/oc.m8.d1:ocMA.Kathisma22.greekmelody	@ltx/en_us_goadedes/he.a.m8:heAU.AnestisEkNekron.greekname
ltx/en_us_goadedes/oc.m8.d1:ocMA.Kathisma22.incipit	The women who were taking…
ltx/en_us_goadedes/oc.m8.d1:ocMA.Kathisma22.melody	@ltx/en_us_goadedes/he.a.m8:heAU.AnestisEkNekron.name
ltx/en_us_goadedes/oc.m8.d1:ocMA.Kathisma22.mode	@ltx/en_us_goadedes/miscellanea:misc.Mode8
ltx/en_us_goadedes/oc.m8.d1:ocMA.Kathisma22.text	The women who were taking the burial spices * heard an angelic voice from the sepulcher saying, * “Weep no more! And instead of your sorrow take with you the tidings of joy. * Sing out in exultation, ‘Truly risen from the dead is Christ the Lord, * who was well pleased to save the human race, as God our only Savior.’”
ltx/en_us_goadedes/oc.m8.d1:ocMA.Kathisma23.incipit	In you, O Lady full of grace…
ltx/en_us_goadedes/oc.m8.d1:ocMA.Kathisma23.melody	
ltx/en_us_goadedes/oc.m8.d1:ocMA.Kathisma23.mode	@ltx/en_us_goadedes/miscellanea:misc.Mode8
ltx/en_us_goadedes/oc.m8.d1:ocMA.Kathisma23.text	In you, O Lady full of grace, all creation rejoices, the hosts of Angels and the human race. O consecrated temple and allegorical Paradise, virgins boast of you. For God became incarnate from you, yes, our eternally existing God became a child from you. He made a throne of your womb, and He made your body wider than the heavens. In you, O Lady full of grace, all creation rejoices. Glory to you!
ltx/en_us_goadedes/oc.m8.d1:ocMA.Kontakion.incipit	When You rose from the grave…
ltx/en_us_goadedes/oc.m8.d1:ocMA.Kontakion.melody	@ltx/en_us_goadedes/he.a.m8:heAU.OsAparchas.notmetered
ltx/en_us_goadedes/oc.m8.d1:ocMA.Kontakion.mode	@ltx/en_us_goadedes/miscellanea:misc.Mode8
ltx/en_us_goadedes/oc.m8.d1:ocMA.Kontakion.text	When You rose from the grave, You also raised the dead, and You resurrected Adam. Because of Your Resurrection, Eve is rejoicing, and people the world over celebrate Your resurrection from the dead, O very merciful Lord.
ltx/en_us_goadedes/oc.m8.d1:ocMA.Lauds1.greekmelody	@ltx/en_us_goadedes/he.a.m8:heAU.KyrieEiKaiKritirio.greekname
ltx/en_us_goadedes/oc.m8.d1:ocMA.Lauds1.incipit	@ltx/en_us_goadedes/he.a.m8:heAU.KyrieEiKaiKritirio.incipit
ltx/en_us_goadedes/oc.m8.d1:ocMA.Lauds1.melody	@ltx/en_us_goadedes/he.a.m8:heAU.KyrieEiKaiKritirio.melody
ltx/en_us_goadedes/oc.m8.d1:ocMA.Lauds1.mode	@ltx/en_us_goadedes/miscellanea:misc.Mode8
ltx/en_us_goadedes/oc.m8.d1:ocMA.Lauds1.text	@ltx/en_us_goadedes/he.a.m8:heAU.KyrieEiKaiKritirio.text
ltx/en_us_goadedes/oc.m8.d1:ocMA.Lauds2.incipit	Lord, even though You were buried…
ltx/en_us_goadedes/oc.m8.d1:ocMA.Lauds2.melody	@ltx/en_us_goadedes/he.a.m8:heAU.KyrieEiKaiKritirio.name
ltx/en_us_goadedes/oc.m8.d1:ocMA.Lauds2.mode	@ltx/en_us_goadedes/miscellanea:misc.Mode8
ltx/en_us_goadedes/oc.m8.d1:ocMA.Lauds2.text	Lord, even though You were buried as a mortal * in a sepulcher by Jewish men, * yet a guard of soldiers was watching * over You as though a sleeping king. * As the treasure house of life, * they made it secure with a seal. * But You rose, and You have granted * our souls incorruptibility.
ltx/en_us_goadedes/oc.m8.d1:ocMA.Lauds3.incipit	Lord, You have given…
ltx/en_us_goadedes/oc.m8.d1:ocMA.Lauds3.melody	@ltx/en_us_goadedes/he.a.m8:heAU.KyrieEiKaiKritirio.name
ltx/en_us_goadedes/oc.m8.d1:ocMA.Lauds3.mode	@ltx/en_us_goadedes/miscellanea:misc.Mode8
ltx/en_us_goadedes/oc.m8.d1:ocMA.Lauds3.text	Lord, You have given us Your Cross as a weapon * against the devil, our enemy. * He is gripped with fear and he trembles, * for he cannot bear to see its might, * because it raises the dead; * it neutralized the power of death. * Therefore we worship You and honor * Your burial and resurrection.
ltx/en_us_goadedes/oc.m8.d1:ocMA.Lauds4.greekmelody	@ltx/en_us_goadedes/he.a.m8:heAU.OAngelosSouKyrie.greekname
ltx/en_us_goadedes/oc.m8.d1:ocMA.Lauds4.incipit	@ltx/en_us_goadedes/he.a.m8:heAU.OAngelosSouKyrie.incipit
ltx/en_us_goadedes/oc.m8.d1:ocMA.Lauds4.melody	@ltx/en_us_goadedes/he.a.m8:heAU.OAngelosSouKyrie.melody
ltx/en_us_goadedes/oc.m8.d1:ocMA.Lauds4.mode	@ltx/en_us_goadedes/miscellanea:misc.Mode8
ltx/en_us_goadedes/oc.m8.d1:ocMA.Lauds4.text	@ltx/en_us_goadedes/he.a.m8:heAU.OAngelosSouKyrie.text
ltx/en_us_goadedes/oc.m8.d1:ocMA.Lauds5.incipit	You suffered through crucifixion…
ltx/en_us_goadedes/oc.m8.d1:ocMA.Lauds5.melody	
ltx/en_us_goadedes/oc.m8.d1:ocMA.Lauds5.mode	@ltx/en_us_goadedes/miscellanea:misc.Mode8
ltx/en_us_goadedes/oc.m8.d1:ocMA.Lauds5.text	You suffered through crucifixion, O Lord, impassible in Your divinity. You accepted three-day burial, to free us from slavery to the enemy, and to make us immortal and alive, through Your resurrection, O benevolent Christ our God.
ltx/en_us_goadedes/oc.m8.d1:ocMA.Lauds6.incipit	I venerate and glorify…
ltx/en_us_goadedes/oc.m8.d1:ocMA.Lauds6.melody	
ltx/en_us_goadedes/oc.m8.d1:ocMA.Lauds6.mode	@ltx/en_us_goadedes/miscellanea:misc.Mode8
ltx/en_us_goadedes/oc.m8.d1:ocMA.Lauds6.text	I venerate and glorify and extol Your resurrection from the sepulcher, O Christ. Through it You freed us from the inescapable dungeon of Hades, and as God You have granted to the world life eternal and the great mercy.
ltx/en_us_goadedes/oc.m8.d1:ocMA.Lauds7.incipit	The villains set a guard…
ltx/en_us_goadedes/oc.m8.d1:ocMA.Lauds7.melody	
ltx/en_us_goadedes/oc.m8.d1:ocMA.Lauds7.mode	@ltx/en_us_goadedes/miscellanea:misc.Mode8
ltx/en_us_goadedes/oc.m8.d1:ocMA.Lauds7.text	The villains set a guard of soldiers to watch Your tomb that was holding life, and they secured it with a seal. But You, as God immortal and almighty, rose on the third day.
ltx/en_us_goadedes/oc.m8.d1:ocMA.Lauds8.incipit	O Lord, when You proceeded…
ltx/en_us_goadedes/oc.m8.d1:ocMA.Lauds8.melody	
ltx/en_us_goadedes/oc.m8.d1:ocMA.Lauds8.mode	@ltx/en_us_goadedes/miscellanea:misc.Mode8
ltx/en_us_goadedes/oc.m8.d1:ocMA.Lauds8.text	O Lord, when You proceeded to the gates of Hades, and You had shattered them, then the prisoner cried out and said, “Who is this? For not only is he not condemned to the lowest parts of the earth, but he has also torn down the prison of death, as if it were a tent. I received him as a mortal man, and I tremble at him as God.” O almighty Savior, have mercy on us!
ltx/en_us_goadedes/oc.m8.d1:ocMA.MM.AntiphonsProkeimenon.text	@ltx/en_us_goadedes/properties:media.key
ltx/en_us_goadedes/oc.m8.d1:ocMA.MM.GodIsTheLord.text	@ltx/en_us_goadedes/properties:media.key
ltx/en_us_goadedes/oc.m8.d1:ocMA.MM.Lauds01.text	@ltx/en_us_goadedes/properties:media.key
ltx/en_us_goadedes/oc.m8.d1:ocMA.MM.Lauds02.text	@ltx/en_us_goadedes/properties:media.key
ltx/en_us_goadedes/oc.m8.d1:ocMA.MM.LaudsStichologia.text	
ltx/en_us_goadedes/oc.m8.d1:ocMA.MM.Prokeimenon.text	@ltx/en_us_goadedes/properties:media.key
ltx/en_us_goadedes/oc.m8.d1:ocMA.Magnificat.incipit	@ltx/en_us_goadedes/he.h.m6:heHE.TinTimioteran.incipit
ltx/en_us_goadedes/oc.m8.d1:ocMA.Magnificat.mode	@ltx/en_us_goadedes/miscellanea:misc.Mode8
ltx/en_us_goadedes/oc.m8.d1:ocMA.Magnificat.text	@ltx/en_us_goadedes/he.h.m6:heHE.TinTimioteran.text
ltx/en_us_goadedes/oc.m8.d1:ocMA.OdeS1C11.incipit	…
ltx/en_us_goadedes/oc.m8.d1:ocMA.OdeS1C11.melody	@ltx/en_us_goadedes/he.h.m8:heHE.ArmatilatinFarao.name
ltx/en_us_goadedes/oc.m8.d1:ocMA.OdeS1C11.mode	@ltx/en_us_goadedes/miscellanea:misc.Mode8
ltx/en_us_goadedes/oc.m8.d1:ocMA.OdeS1C11.ode	@ltx/en_us_goadedes/miscellanea:misc.Ode1
ltx/en_us_goadedes/oc.m8.d1:ocMA.OdeS1C11.text	
ltx/en_us_goadedes/oc.m8.d1:ocMA.OdeS1C12.incipit	…
ltx/en_us_goadedes/oc.m8.d1:ocMA.OdeS1C12.melody	@ltx/en_us_goadedes/he.h.m8:heHE.ArmatilatinFarao.name
ltx/en_us_goadedes/oc.m8.d1:ocMA.OdeS1C12.mode	@ltx/en_us_goadedes/miscellanea:misc.Mode8
ltx/en_us_goadedes/oc.m8.d1:ocMA.OdeS1C12.ode	@ltx/en_us_goadedes/miscellanea:misc.Ode1
ltx/en_us_goadedes/oc.m8.d1:ocMA.OdeS1C12.text	
ltx/en_us_goadedes/oc.m8.d1:ocMA.OdeS1C1H.greekmelody	@ltx/en_us_goadedes/he.h.m8:heHE.ArmatilatinFarao.greekname
ltx/en_us_goadedes/oc.m8.d1:ocMA.OdeS1C1H.incipit	@ltx/en_us_goadedes/he.h.m8:heHE.ArmatilatinFarao.incipit
ltx/en_us_goadedes/oc.m8.d1:ocMA.OdeS1C1H.melody	@ltx/en_us_goadedes/he.h.m8:heHE.ArmatilatinFarao.melody
ltx/en_us_goadedes/oc.m8.d1:ocMA.OdeS1C1H.mode	@ltx/en_us_goadedes/miscellanea:misc.Mode8
ltx/en_us_goadedes/oc.m8.d1:ocMA.OdeS1C1H.ode	@ltx/en_us_goadedes/miscellanea:misc.Ode1
ltx/en_us_goadedes/oc.m8.d1:ocMA.OdeS1C1H.text	@ltx/en_us_goadedes/he.h.m8:heHE.ArmatilatinFarao.text
ltx/en_us_goadedes/oc.m8.d1:ocMA.OdeS1C1T.incipit	…
ltx/en_us_goadedes/oc.m8.d1:ocMA.OdeS1C1T.melody	@ltx/en_us_goadedes/he.h.m8:heHE.ArmatilatinFarao.name
ltx/en_us_goadedes/oc.m8.d1:ocMA.OdeS1C1T.mode	@ltx/en_us_goadedes/miscellanea:misc.Mode8
ltx/en_us_goadedes/oc.m8.d1:ocMA.OdeS1C1T.ode	@ltx/en_us_goadedes/miscellanea:misc.Ode1
ltx/en_us_goadedes/oc.m8.d1:ocMA.OdeS1C1T.text	
ltx/en_us_goadedes/oc.m8.d1:ocMA.OdeS1C21.greekmelody	@ltx/en_us_goadedes/he.h.m8:heHE.YgranDiodefsas.greekname
ltx/en_us_goadedes/oc.m8.d1:ocMA.OdeS1C21.incipit	…
ltx/en_us_goadedes/oc.m8.d1:ocMA.OdeS1C21.melody	@ltx/en_us_goadedes/he.h.m8:heHE.YgranDiodefsas.name
ltx/en_us_goadedes/oc.m8.d1:ocMA.OdeS1C21.mode	@ltx/en_us_goadedes/miscellanea:misc.Mode8
ltx/en_us_goadedes/oc.m8.d1:ocMA.OdeS1C21.ode	@ltx/en_us_goadedes/miscellanea:misc.Ode1
ltx/en_us_goadedes/oc.m8.d1:ocMA.OdeS1C21.text	
ltx/en_us_goadedes/oc.m8.d1:ocMA.OdeS1C22.incipit	…
ltx/en_us_goadedes/oc.m8.d1:ocMA.OdeS1C22.melody	@ltx/en_us_goadedes/he.h.m8:heHE.YgranDiodefsas.name
ltx/en_us_goadedes/oc.m8.d1:ocMA.OdeS1C22.mode	@ltx/en_us_goadedes/miscellanea:misc.Mode8
ltx/en_us_goadedes/oc.m8.d1:ocMA.OdeS1C22.ode	@ltx/en_us_goadedes/miscellanea:misc.Ode1
ltx/en_us_goadedes/oc.m8.d1:ocMA.OdeS1C22.text	
ltx/en_us_goadedes/oc.m8.d1:ocMA.OdeS1C2T.incipit	…
ltx/en_us_goadedes/oc.m8.d1:ocMA.OdeS1C2T.melody	@ltx/en_us_goadedes/he.h.m8:heHE.YgranDiodefsas.name
ltx/en_us_goadedes/oc.m8.d1:ocMA.OdeS1C2T.mode	@ltx/en_us_goadedes/miscellanea:misc.Mode8
ltx/en_us_goadedes/oc.m8.d1:ocMA.OdeS1C2T.ode	@ltx/en_us_goadedes/miscellanea:misc.Ode1
ltx/en_us_goadedes/oc.m8.d1:ocMA.OdeS1C2T.text	
ltx/en_us_goadedes/oc.m8.d1:ocMA.OdeS1C31.greekmelody	@ltx/en_us_goadedes/he.h.m8:heHE.AsomenToKyrio.greekname
ltx/en_us_goadedes/oc.m8.d1:ocMA.OdeS1C31.incipit	…
ltx/en_us_goadedes/oc.m8.d1:ocMA.OdeS1C31.melody	@ltx/en_us_goadedes/he.h.m8:heHE.AsomenToKyrio.name
ltx/en_us_goadedes/oc.m8.d1:ocMA.OdeS1C31.mode	@ltx/en_us_goadedes/miscellanea:misc.Mode8
ltx/en_us_goadedes/oc.m8.d1:ocMA.OdeS1C31.ode	@ltx/en_us_goadedes/miscellanea:misc.Ode1
ltx/en_us_goadedes/oc.m8.d1:ocMA.OdeS1C31.text	
ltx/en_us_goadedes/oc.m8.d1:ocMA.OdeS1C32.incipit	…
ltx/en_us_goadedes/oc.m8.d1:ocMA.OdeS1C32.melody	@ltx/en_us_goadedes/he.h.m8:heHE.AsomenToKyrio.name
ltx/en_us_goadedes/oc.m8.d1:ocMA.OdeS1C32.mode	@ltx/en_us_goadedes/miscellanea:misc.Mode8
ltx/en_us_goadedes/oc.m8.d1:ocMA.OdeS1C32.ode	@ltx/en_us_goadedes/miscellanea:misc.Ode1
ltx/en_us_goadedes/oc.m8.d1:ocMA.OdeS1C32.text	
ltx/en_us_goadedes/oc.m8.d1:ocMA.OdeS1C33.incipit	…
ltx/en_us_goadedes/oc.m8.d1:ocMA.OdeS1C33.melody	@ltx/en_us_goadedes/he.h.m8:heHE.AsomenToKyrio.name
ltx/en_us_goadedes/oc.m8.d1:ocMA.OdeS1C33.mode	@ltx/en_us_goadedes/miscellanea:misc.Mode8
ltx/en_us_goadedes/oc.m8.d1:ocMA.OdeS1C33.ode	@ltx/en_us_goadedes/miscellanea:misc.Ode1
ltx/en_us_goadedes/oc.m8.d1:ocMA.OdeS1C33.text	
ltx/en_us_goadedes/oc.m8.d1:ocMA.OdeS3C11.incipit	…
ltx/en_us_goadedes/oc.m8.d1:ocMA.OdeS3C11.melody	@ltx/en_us_goadedes/he.h.m8:heHE.OStereosasKatArchas.name
ltx/en_us_goadedes/oc.m8.d1:ocMA.OdeS3C11.mode	@ltx/en_us_goadedes/miscellanea:misc.Mode8
ltx/en_us_goadedes/oc.m8.d1:ocMA.OdeS3C11.ode	@ltx/en_us_goadedes/miscellanea:misc.Ode3
ltx/en_us_goadedes/oc.m8.d1:ocMA.OdeS3C11.text	
ltx/en_us_goadedes/oc.m8.d1:ocMA.OdeS3C12.incipit	…
ltx/en_us_goadedes/oc.m8.d1:ocMA.OdeS3C12.melody	@ltx/en_us_goadedes/he.h.m8:heHE.OStereosasKatArchas.name
ltx/en_us_goadedes/oc.m8.d1:ocMA.OdeS3C12.mode	@ltx/en_us_goadedes/miscellanea:misc.Mode8
ltx/en_us_goadedes/oc.m8.d1:ocMA.OdeS3C12.ode	@ltx/en_us_goadedes/miscellanea:misc.Ode3
ltx/en_us_goadedes/oc.m8.d1:ocMA.OdeS3C12.text	
ltx/en_us_goadedes/oc.m8.d1:ocMA.OdeS3C1H.greekmelody	@ltx/en_us_goadedes/he.h.m8:heHE.OStereosasKatArchas.greekname
ltx/en_us_goadedes/oc.m8.d1:ocMA.OdeS3C1H.incipit	@ltx/en_us_goadedes/he.h.m8:heHE.OStereosasKatArchas.incipit
ltx/en_us_goadedes/oc.m8.d1:ocMA.OdeS3C1H.melody	@ltx/en_us_goadedes/he.h.m8:heHE.OStereosasKatArchas.melody
ltx/en_us_goadedes/oc.m8.d1:ocMA.OdeS3C1H.mode	@ltx/en_us_goadedes/miscellanea:misc.Mode8
ltx/en_us_goadedes/oc.m8.d1:ocMA.OdeS3C1H.ode	@ltx/en_us_goadedes/miscellanea:misc.Ode3
ltx/en_us_goadedes/oc.m8.d1:ocMA.OdeS3C1H.text	@ltx/en_us_goadedes/he.h.m8:heHE.OStereosasKatArchas.text
ltx/en_us_goadedes/oc.m8.d1:ocMA.OdeS3C1T.incipit	…
ltx/en_us_goadedes/oc.m8.d1:ocMA.OdeS3C1T.melody	@ltx/en_us_goadedes/he.h.m8:heHE.OStereosasKatArchas.name
ltx/en_us_goadedes/oc.m8.d1:ocMA.OdeS3C1T.mode	@ltx/en_us_goadedes/miscellanea:misc.Mode8
ltx/en_us_goadedes/oc.m8.d1:ocMA.OdeS3C1T.ode	@ltx/en_us_goadedes/miscellanea:misc.Ode3
ltx/en_us_goadedes/oc.m8.d1:ocMA.OdeS3C1T.text	
ltx/en_us_goadedes/oc.m8.d1:ocMA.OdeS3C21.greekmelody	@ltx/en_us_goadedes/he.h.m8:heHE.OuraniasApsidos.greekname
ltx/en_us_goadedes/oc.m8.d1:ocMA.OdeS3C21.incipit	…
ltx/en_us_goadedes/oc.m8.d1:ocMA.OdeS3C21.melody	@ltx/en_us_goadedes/he.h.m8:heHE.OuraniasApsidos.name
ltx/en_us_goadedes/oc.m8.d1:ocMA.OdeS3C21.mode	@ltx/en_us_goadedes/miscellanea:misc.Mode8
ltx/en_us_goadedes/oc.m8.d1:ocMA.OdeS3C21.ode	@ltx/en_us_goadedes/miscellanea:misc.Ode3
ltx/en_us_goadedes/oc.m8.d1:ocMA.OdeS3C21.text	
ltx/en_us_goadedes/oc.m8.d1:ocMA.OdeS3C22.incipit	…
ltx/en_us_goadedes/oc.m8.d1:ocMA.OdeS3C22.melody	@ltx/en_us_goadedes/he.h.m8:heHE.OuraniasApsidos.name
ltx/en_us_goadedes/oc.m8.d1:ocMA.OdeS3C22.mode	@ltx/en_us_goadedes/miscellanea:misc.Mode8
ltx/en_us_goadedes/oc.m8.d1:ocMA.OdeS3C22.ode	@ltx/en_us_goadedes/miscellanea:misc.Ode3
ltx/en_us_goadedes/oc.m8.d1:ocMA.OdeS3C22.text	
ltx/en_us_goadedes/oc.m8.d1:ocMA.OdeS3C2T.incipit	…
ltx/en_us_goadedes/oc.m8.d1:ocMA.OdeS3C2T.melody	@ltx/en_us_goadedes/he.h.m8:heHE.OuraniasApsidos.name
ltx/en_us_goadedes/oc.m8.d1:ocMA.OdeS3C2T.mode	@ltx/en_us_goadedes/miscellanea:misc.Mode8
ltx/en_us_goadedes/oc.m8.d1:ocMA.OdeS3C2T.ode	@ltx/en_us_goadedes/miscellanea:misc.Ode3
ltx/en_us_goadedes/oc.m8.d1:ocMA.OdeS3C2T.text	
ltx/en_us_goadedes/oc.m8.d1:ocMA.OdeS3C31.greekmelody	@ltx/en_us_goadedes/he.h.m8:heHE.SyEiToStereoma.greekname
ltx/en_us_goadedes/oc.m8.d1:ocMA.OdeS3C31.incipit	…
ltx/en_us_goadedes/oc.m8.d1:ocMA.OdeS3C31.melody	@ltx/en_us_goadedes/he.h.m8:heHE.SyEiToStereoma.name
ltx/en_us_goadedes/oc.m8.d1:ocMA.OdeS3C31.mode	@ltx/en_us_goadedes/miscellanea:misc.Mode8
ltx/en_us_goadedes/oc.m8.d1:ocMA.OdeS3C31.ode	@ltx/en_us_goadedes/miscellanea:misc.Ode3
ltx/en_us_goadedes/oc.m8.d1:ocMA.OdeS3C31.text	
ltx/en_us_goadedes/oc.m8.d1:ocMA.OdeS3C32.incipit	…
ltx/en_us_goadedes/oc.m8.d1:ocMA.OdeS3C32.melody	@ltx/en_us_goadedes/he.h.m8:heHE.SyEiToStereoma.name
ltx/en_us_goadedes/oc.m8.d1:ocMA.OdeS3C32.mode	@ltx/en_us_goadedes/miscellanea:misc.Mode8
ltx/en_us_goadedes/oc.m8.d1:ocMA.OdeS3C32.ode	@ltx/en_us_goadedes/miscellanea:misc.Ode3
ltx/en_us_goadedes/oc.m8.d1:ocMA.OdeS3C32.text	
ltx/en_us_goadedes/oc.m8.d1:ocMA.OdeS3C33.incipit	…
ltx/en_us_goadedes/oc.m8.d1:ocMA.OdeS3C33.melody	@ltx/en_us_goadedes/he.h.m8:heHE.SyEiToStereoma.name
ltx/en_us_goadedes/oc.m8.d1:ocMA.OdeS3C33.mode	@ltx/en_us_goadedes/miscellanea:misc.Mode8
ltx/en_us_goadedes/oc.m8.d1:ocMA.OdeS3C33.ode	@ltx/en_us_goadedes/miscellanea:misc.Ode3
ltx/en_us_goadedes/oc.m8.d1:ocMA.OdeS3C33.text	
ltx/en_us_goadedes/oc.m8.d1:ocMA.OdeS4C11.incipit	…
ltx/en_us_goadedes/oc.m8.d1:ocMA.OdeS4C11.melody	@ltx/en_us_goadedes/he.h.m8:heHE.SyMouIschys.name
ltx/en_us_goadedes/oc.m8.d1:ocMA.OdeS4C11.mode	@ltx/en_us_goadedes/miscellanea:misc.Mode8
ltx/en_us_goadedes/oc.m8.d1:ocMA.OdeS4C11.ode	@ltx/en_us_goadedes/miscellanea:misc.Ode4
ltx/en_us_goadedes/oc.m8.d1:ocMA.OdeS4C11.text	
ltx/en_us_goadedes/oc.m8.d1:ocMA.OdeS4C12.incipit	…
ltx/en_us_goadedes/oc.m8.d1:ocMA.OdeS4C12.melody	@ltx/en_us_goadedes/he.h.m8:heHE.SyMouIschys.name
ltx/en_us_goadedes/oc.m8.d1:ocMA.OdeS4C12.mode	@ltx/en_us_goadedes/miscellanea:misc.Mode8
ltx/en_us_goadedes/oc.m8.d1:ocMA.OdeS4C12.ode	@ltx/en_us_goadedes/miscellanea:misc.Ode4
ltx/en_us_goadedes/oc.m8.d1:ocMA.OdeS4C12.text	
ltx/en_us_goadedes/oc.m8.d1:ocMA.OdeS4C1H.greekmelody	@ltx/en_us_goadedes/he.h.m8:heHE.SyMouIschys.greekname
ltx/en_us_goadedes/oc.m8.d1:ocMA.OdeS4C1H.incipit	@ltx/en_us_goadedes/he.h.m8:heHE.SyMouIschys.incipit
ltx/en_us_goadedes/oc.m8.d1:ocMA.OdeS4C1H.melody	@ltx/en_us_goadedes/he.h.m8:heHE.SyMouIschys.melody
ltx/en_us_goadedes/oc.m8.d1:ocMA.OdeS4C1H.mode	@ltx/en_us_goadedes/miscellanea:misc.Mode8
ltx/en_us_goadedes/oc.m8.d1:ocMA.OdeS4C1H.ode	@ltx/en_us_goadedes/miscellanea:misc.Ode4
ltx/en_us_goadedes/oc.m8.d1:ocMA.OdeS4C1H.text	@ltx/en_us_goadedes/he.h.m8:heHE.SyMouIschys.text
ltx/en_us_goadedes/oc.m8.d1:ocMA.OdeS4C1T.incipit	…
ltx/en_us_goadedes/oc.m8.d1:ocMA.OdeS4C1T.melody	@ltx/en_us_goadedes/he.h.m8:heHE.SyMouIschys.name
ltx/en_us_goadedes/oc.m8.d1:ocMA.OdeS4C1T.mode	@ltx/en_us_goadedes/miscellanea:misc.Mode8
ltx/en_us_goadedes/oc.m8.d1:ocMA.OdeS4C1T.ode	@ltx/en_us_goadedes/miscellanea:misc.Ode4
ltx/en_us_goadedes/oc.m8.d1:ocMA.OdeS4C1T.text	
ltx/en_us_goadedes/oc.m8.d1:ocMA.OdeS4C21.greekmelody	@ltx/en_us_goadedes/he.h.m8:heHE.EisakikoaKyrie.greekname
ltx/en_us_goadedes/oc.m8.d1:ocMA.OdeS4C21.incipit	…
ltx/en_us_goadedes/oc.m8.d1:ocMA.OdeS4C21.melody	@ltx/en_us_goadedes/he.h.m8:heHE.EisakikoaKyrie.name
ltx/en_us_goadedes/oc.m8.d1:ocMA.OdeS4C21.mode	@ltx/en_us_goadedes/miscellanea:misc.Mode8
ltx/en_us_goadedes/oc.m8.d1:ocMA.OdeS4C21.ode	@ltx/en_us_goadedes/miscellanea:misc.Ode4
ltx/en_us_goadedes/oc.m8.d1:ocMA.OdeS4C21.text	
ltx/en_us_goadedes/oc.m8.d1:ocMA.OdeS4C22.incipit	…
ltx/en_us_goadedes/oc.m8.d1:ocMA.OdeS4C22.melody	@ltx/en_us_goadedes/he.h.m8:heHE.EisakikoaKyrie.name
ltx/en_us_goadedes/oc.m8.d1:ocMA.OdeS4C22.mode	@ltx/en_us_goadedes/miscellanea:misc.Mode8
ltx/en_us_goadedes/oc.m8.d1:ocMA.OdeS4C22.ode	@ltx/en_us_goadedes/miscellanea:misc.Ode4
ltx/en_us_goadedes/oc.m8.d1:ocMA.OdeS4C22.text	
ltx/en_us_goadedes/oc.m8.d1:ocMA.OdeS4C2T.incipit	…
ltx/en_us_goadedes/oc.m8.d1:ocMA.OdeS4C2T.melody	@ltx/en_us_goadedes/he.h.m8:heHE.EisakikoaKyrie.name
ltx/en_us_goadedes/oc.m8.d1:ocMA.OdeS4C2T.mode	@ltx/en_us_goadedes/miscellanea:misc.Mode8
ltx/en_us_goadedes/oc.m8.d1:ocMA.OdeS4C2T.ode	@ltx/en_us_goadedes/miscellanea:misc.Ode4
ltx/en_us_goadedes/oc.m8.d1:ocMA.OdeS4C2T.text	
ltx/en_us_goadedes/oc.m8.d1:ocMA.OdeS4C31.greekmelody	@ltx/en_us_goadedes/he.h.m8:heHE.EisakikoaKyrie.greekname
ltx/en_us_goadedes/oc.m8.d1:ocMA.OdeS4C31.incipit	…
ltx/en_us_goadedes/oc.m8.d1:ocMA.OdeS4C31.melody	@ltx/en_us_goadedes/he.h.m8:heHE.EisakikoaKyrie.name
ltx/en_us_goadedes/oc.m8.d1:ocMA.OdeS4C31.mode	@ltx/en_us_goadedes/miscellanea:misc.Mode8
ltx/en_us_goadedes/oc.m8.d1:ocMA.OdeS4C31.ode	@ltx/en_us_goadedes/miscellanea:misc.Ode4
ltx/en_us_goadedes/oc.m8.d1:ocMA.OdeS4C31.text	
ltx/en_us_goadedes/oc.m8.d1:ocMA.OdeS4C32.incipit	…
ltx/en_us_goadedes/oc.m8.d1:ocMA.OdeS4C32.melody	@ltx/en_us_goadedes/he.h.m8:heHE.EisakikoaKyrie.name
ltx/en_us_goadedes/oc.m8.d1:ocMA.OdeS4C32.mode	@ltx/en_us_goadedes/miscellanea:misc.Mode8
ltx/en_us_goadedes/oc.m8.d1:ocMA.OdeS4C32.ode	@ltx/en_us_goadedes/miscellanea:misc.Ode4
ltx/en_us_goadedes/oc.m8.d1:ocMA.OdeS4C32.text	
ltx/en_us_goadedes/oc.m8.d1:ocMA.OdeS4C33.incipit	…
ltx/en_us_goadedes/oc.m8.d1:ocMA.OdeS4C33.melody	@ltx/en_us_goadedes/he.h.m8:heHE.EisakikoaKyrie.name
ltx/en_us_goadedes/oc.m8.d1:ocMA.OdeS4C33.mode	@ltx/en_us_goadedes/miscellanea:misc.Mode8
ltx/en_us_goadedes/oc.m8.d1:ocMA.OdeS4C33.ode	@ltx/en_us_goadedes/miscellanea:misc.Ode4
ltx/en_us_goadedes/oc.m8.d1:ocMA.OdeS4C33.text	
ltx/en_us_goadedes/oc.m8.d1:ocMA.OdeS5C11.incipit	…
ltx/en_us_goadedes/oc.m8.d1:ocMA.OdeS5C11.melody	@ltx/en_us_goadedes/he.h.m8:heHE.InaTiMeAposo.name
ltx/en_us_goadedes/oc.m8.d1:ocMA.OdeS5C11.mode	@ltx/en_us_goadedes/miscellanea:misc.Mode8
ltx/en_us_goadedes/oc.m8.d1:ocMA.OdeS5C11.ode	@ltx/en_us_goadedes/miscellanea:misc.Ode5
ltx/en_us_goadedes/oc.m8.d1:ocMA.OdeS5C11.text	
ltx/en_us_goadedes/oc.m8.d1:ocMA.OdeS5C12.incipit	…
ltx/en_us_goadedes/oc.m8.d1:ocMA.OdeS5C12.melody	@ltx/en_us_goadedes/he.h.m8:heHE.InaTiMeAposo.name
ltx/en_us_goadedes/oc.m8.d1:ocMA.OdeS5C12.mode	@ltx/en_us_goadedes/miscellanea:misc.Mode8
ltx/en_us_goadedes/oc.m8.d1:ocMA.OdeS5C12.ode	@ltx/en_us_goadedes/miscellanea:misc.Ode5
ltx/en_us_goadedes/oc.m8.d1:ocMA.OdeS5C12.text	
ltx/en_us_goadedes/oc.m8.d1:ocMA.OdeS5C1H.greekmelody	@ltx/en_us_goadedes/he.h.m8:heHE.InaTiMeAposo.greekname
ltx/en_us_goadedes/oc.m8.d1:ocMA.OdeS5C1H.incipit	@ltx/en_us_goadedes/he.h.m8:heHE.InaTiMeAposo.incipit
ltx/en_us_goadedes/oc.m8.d1:ocMA.OdeS5C1H.melody	@ltx/en_us_goadedes/he.h.m8:heHE.InaTiMeAposo.melody
ltx/en_us_goadedes/oc.m8.d1:ocMA.OdeS5C1H.mode	@ltx/en_us_goadedes/miscellanea:misc.Mode8
ltx/en_us_goadedes/oc.m8.d1:ocMA.OdeS5C1H.ode	@ltx/en_us_goadedes/miscellanea:misc.Ode5
ltx/en_us_goadedes/oc.m8.d1:ocMA.OdeS5C1H.text	@ltx/en_us_goadedes/he.h.m8:heHE.InaTiMeAposo.text
ltx/en_us_goadedes/oc.m8.d1:ocMA.OdeS5C1T.incipit	…
ltx/en_us_goadedes/oc.m8.d1:ocMA.OdeS5C1T.melody	@ltx/en_us_goadedes/he.h.m8:heHE.InaTiMeAposo.name
ltx/en_us_goadedes/oc.m8.d1:ocMA.OdeS5C1T.mode	@ltx/en_us_goadedes/miscellanea:misc.Mode8
ltx/en_us_goadedes/oc.m8.d1:ocMA.OdeS5C1T.ode	@ltx/en_us_goadedes/miscellanea:misc.Ode5
ltx/en_us_goadedes/oc.m8.d1:ocMA.OdeS5C1T.text	
ltx/en_us_goadedes/oc.m8.d1:ocMA.OdeS5C21.greekmelody	@ltx/en_us_goadedes/he.h.m8:heHE.FotisonImas.greekname
ltx/en_us_goadedes/oc.m8.d1:ocMA.OdeS5C21.incipit	…
ltx/en_us_goadedes/oc.m8.d1:ocMA.OdeS5C21.melody	@ltx/en_us_goadedes/he.h.m8:heHE.FotisonImas.name
ltx/en_us_goadedes/oc.m8.d1:ocMA.OdeS5C21.mode	@ltx/en_us_goadedes/miscellanea:misc.Mode8
ltx/en_us_goadedes/oc.m8.d1:ocMA.OdeS5C21.ode	@ltx/en_us_goadedes/miscellanea:misc.Ode5
ltx/en_us_goadedes/oc.m8.d1:ocMA.OdeS5C21.text	
ltx/en_us_goadedes/oc.m8.d1:ocMA.OdeS5C22.incipit	…
ltx/en_us_goadedes/oc.m8.d1:ocMA.OdeS5C22.melody	@ltx/en_us_goadedes/he.h.m8:heHE.FotisonImas.name
ltx/en_us_goadedes/oc.m8.d1:ocMA.OdeS5C22.mode	@ltx/en_us_goadedes/miscellanea:misc.Mode8
ltx/en_us_goadedes/oc.m8.d1:ocMA.OdeS5C22.ode	@ltx/en_us_goadedes/miscellanea:misc.Ode5
ltx/en_us_goadedes/oc.m8.d1:ocMA.OdeS5C22.text	
ltx/en_us_goadedes/oc.m8.d1:ocMA.OdeS5C2T.incipit	…
ltx/en_us_goadedes/oc.m8.d1:ocMA.OdeS5C2T.melody	@ltx/en_us_goadedes/he.h.m8:heHE.FotisonImas.name
ltx/en_us_goadedes/oc.m8.d1:ocMA.OdeS5C2T.mode	@ltx/en_us_goadedes/miscellanea:misc.Mode8
ltx/en_us_goadedes/oc.m8.d1:ocMA.OdeS5C2T.ode	@ltx/en_us_goadedes/miscellanea:misc.Ode5
ltx/en_us_goadedes/oc.m8.d1:ocMA.OdeS5C2T.text	
ltx/en_us_goadedes/oc.m8.d1:ocMA.OdeS5C31.greekmelody	@ltx/en_us_goadedes/he.h.m8:heHE.OrthrizontesVoomenSoi.greekname
ltx/en_us_goadedes/oc.m8.d1:ocMA.OdeS5C31.incipit	…
ltx/en_us_goadedes/oc.m8.d1:ocMA.OdeS5C31.melody	@ltx/en_us_goadedes/he.h.m8:heHE.OrthrizontesVoomenSoi.name
ltx/en_us_goadedes/oc.m8.d1:ocMA.OdeS5C31.mode	@ltx/en_us_goadedes/miscellanea:misc.Mode8
ltx/en_us_goadedes/oc.m8.d1:ocMA.OdeS5C31.ode	@ltx/en_us_goadedes/miscellanea:misc.Ode5
ltx/en_us_goadedes/oc.m8.d1:ocMA.OdeS5C31.text	
ltx/en_us_goadedes/oc.m8.d1:ocMA.OdeS5C32.incipit	…
ltx/en_us_goadedes/oc.m8.d1:ocMA.OdeS5C32.melody	@ltx/en_us_goadedes/he.h.m8:heHE.OrthrizontesVoomenSoi.name
ltx/en_us_goadedes/oc.m8.d1:ocMA.OdeS5C32.mode	@ltx/en_us_goadedes/miscellanea:misc.Mode8
ltx/en_us_goadedes/oc.m8.d1:ocMA.OdeS5C32.ode	@ltx/en_us_goadedes/miscellanea:misc.Ode5
ltx/en_us_goadedes/oc.m8.d1:ocMA.OdeS5C32.text	
ltx/en_us_goadedes/oc.m8.d1:ocMA.OdeS5C33.incipit	…
ltx/en_us_goadedes/oc.m8.d1:ocMA.OdeS5C33.melody	@ltx/en_us_goadedes/he.h.m8:heHE.OrthrizontesVoomenSoi.name
ltx/en_us_goadedes/oc.m8.d1:ocMA.OdeS5C33.mode	@ltx/en_us_goadedes/miscellanea:misc.Mode8
ltx/en_us_goadedes/oc.m8.d1:ocMA.OdeS5C33.ode	@ltx/en_us_goadedes/miscellanea:misc.Ode5
ltx/en_us_goadedes/oc.m8.d1:ocMA.OdeS5C33.text	
ltx/en_us_goadedes/oc.m8.d1:ocMA.OdeS6C11.incipit	…
ltx/en_us_goadedes/oc.m8.d1:ocMA.OdeS6C11.melody	@ltx/en_us_goadedes/he.h.m8:heHE.IlasthitiMoiSotir.name
ltx/en_us_goadedes/oc.m8.d1:ocMA.OdeS6C11.mode	@ltx/en_us_goadedes/miscellanea:misc.Mode8
ltx/en_us_goadedes/oc.m8.d1:ocMA.OdeS6C11.ode	@ltx/en_us_goadedes/miscellanea:misc.Ode6
ltx/en_us_goadedes/oc.m8.d1:ocMA.OdeS6C11.text	
ltx/en_us_goadedes/oc.m8.d1:ocMA.OdeS6C12.incipit	…
ltx/en_us_goadedes/oc.m8.d1:ocMA.OdeS6C12.melody	@ltx/en_us_goadedes/he.h.m8:heHE.IlasthitiMoiSotir.name
ltx/en_us_goadedes/oc.m8.d1:ocMA.OdeS6C12.mode	@ltx/en_us_goadedes/miscellanea:misc.Mode8
ltx/en_us_goadedes/oc.m8.d1:ocMA.OdeS6C12.ode	@ltx/en_us_goadedes/miscellanea:misc.Ode6
ltx/en_us_goadedes/oc.m8.d1:ocMA.OdeS6C12.text	
ltx/en_us_goadedes/oc.m8.d1:ocMA.OdeS6C1H.greekmelody	@ltx/en_us_goadedes/he.h.m8:heHE.IlasthitiMoiSotir.greekname
ltx/en_us_goadedes/oc.m8.d1:ocMA.OdeS6C1H.incipit	@ltx/en_us_goadedes/he.h.m8:heHE.IlasthitiMoiSotir.incipit
ltx/en_us_goadedes/oc.m8.d1:ocMA.OdeS6C1H.melody	@ltx/en_us_goadedes/he.h.m8:heHE.IlasthitiMoiSotir.melody
ltx/en_us_goadedes/oc.m8.d1:ocMA.OdeS6C1H.mode	@ltx/en_us_goadedes/miscellanea:misc.Mode8
ltx/en_us_goadedes/oc.m8.d1:ocMA.OdeS6C1H.ode	@ltx/en_us_goadedes/miscellanea:misc.Ode6
ltx/en_us_goadedes/oc.m8.d1:ocMA.OdeS6C1H.text	@ltx/en_us_goadedes/he.h.m8:heHE.IlasthitiMoiSotir.text
ltx/en_us_goadedes/oc.m8.d1:ocMA.OdeS6C1T.incipit	…
ltx/en_us_goadedes/oc.m8.d1:ocMA.OdeS6C1T.melody	@ltx/en_us_goadedes/he.h.m8:heHE.IlasthitiMoiSotir.name
ltx/en_us_goadedes/oc.m8.d1:ocMA.OdeS6C1T.mode	@ltx/en_us_goadedes/miscellanea:misc.Mode8
ltx/en_us_goadedes/oc.m8.d1:ocMA.OdeS6C1T.ode	@ltx/en_us_goadedes/miscellanea:misc.Ode6
ltx/en_us_goadedes/oc.m8.d1:ocMA.OdeS6C1T.text	
ltx/en_us_goadedes/oc.m8.d1:ocMA.OdeS6C21.greekmelody	@ltx/en_us_goadedes/he.h.m8:heHE.TinDeisinEkcheo.greekname
ltx/en_us_goadedes/oc.m8.d1:ocMA.OdeS6C21.incipit	…
ltx/en_us_goadedes/oc.m8.d1:ocMA.OdeS6C21.melody	@ltx/en_us_goadedes/he.h.m8:heHE.TinDeisinEkcheo.name
ltx/en_us_goadedes/oc.m8.d1:ocMA.OdeS6C21.mode	@ltx/en_us_goadedes/miscellanea:misc.Mode8
ltx/en_us_goadedes/oc.m8.d1:ocMA.OdeS6C21.ode	@ltx/en_us_goadedes/miscellanea:misc.Ode6
ltx/en_us_goadedes/oc.m8.d1:ocMA.OdeS6C21.text	
ltx/en_us_goadedes/oc.m8.d1:ocMA.OdeS6C22.incipit	…
ltx/en_us_goadedes/oc.m8.d1:ocMA.OdeS6C22.melody	@ltx/en_us_goadedes/he.h.m8:heHE.TinDeisinEkcheo.name
ltx/en_us_goadedes/oc.m8.d1:ocMA.OdeS6C22.mode	@ltx/en_us_goadedes/miscellanea:misc.Mode8
ltx/en_us_goadedes/oc.m8.d1:ocMA.OdeS6C22.ode	@ltx/en_us_goadedes/miscellanea:misc.Ode6
ltx/en_us_goadedes/oc.m8.d1:ocMA.OdeS6C22.text	
ltx/en_us_goadedes/oc.m8.d1:ocMA.OdeS6C2T.incipit	…
ltx/en_us_goadedes/oc.m8.d1:ocMA.OdeS6C2T.melody	@ltx/en_us_goadedes/he.h.m8:heHE.TinDeisinEkcheo.name
ltx/en_us_goadedes/oc.m8.d1:ocMA.OdeS6C2T.mode	@ltx/en_us_goadedes/miscellanea:misc.Mode8
ltx/en_us_goadedes/oc.m8.d1:ocMA.OdeS6C2T.ode	@ltx/en_us_goadedes/miscellanea:misc.Ode6
ltx/en_us_goadedes/oc.m8.d1:ocMA.OdeS6C2T.text	
ltx/en_us_goadedes/oc.m8.d1:ocMA.OdeS6C31.greekmelody	@ltx/en_us_goadedes/he.h.m8:heHE.ChitonaMoiParaschou.greekname
ltx/en_us_goadedes/oc.m8.d1:ocMA.OdeS6C31.incipit	…
ltx/en_us_goadedes/oc.m8.d1:ocMA.OdeS6C31.melody	@ltx/en_us_goadedes/he.h.m8:heHE.ChitonaMoiParaschou.name
ltx/en_us_goadedes/oc.m8.d1:ocMA.OdeS6C31.mode	@ltx/en_us_goadedes/miscellanea:misc.Mode8
ltx/en_us_goadedes/oc.m8.d1:ocMA.OdeS6C31.ode	@ltx/en_us_goadedes/miscellanea:misc.Ode6
ltx/en_us_goadedes/oc.m8.d1:ocMA.OdeS6C31.text	
ltx/en_us_goadedes/oc.m8.d1:ocMA.OdeS6C32.incipit	…
ltx/en_us_goadedes/oc.m8.d1:ocMA.OdeS6C32.melody	@ltx/en_us_goadedes/he.h.m8:heHE.ChitonaMoiParaschou.name
ltx/en_us_goadedes/oc.m8.d1:ocMA.OdeS6C32.mode	@ltx/en_us_goadedes/miscellanea:misc.Mode8
ltx/en_us_goadedes/oc.m8.d1:ocMA.OdeS6C32.ode	@ltx/en_us_goadedes/miscellanea:misc.Ode6
ltx/en_us_goadedes/oc.m8.d1:ocMA.OdeS6C32.text	
ltx/en_us_goadedes/oc.m8.d1:ocMA.OdeS6C33.incipit	…
ltx/en_us_goadedes/oc.m8.d1:ocMA.OdeS6C33.melody	@ltx/en_us_goadedes/he.h.m8:heHE.ChitonaMoiParaschou.name
ltx/en_us_goadedes/oc.m8.d1:ocMA.OdeS6C33.mode	@ltx/en_us_goadedes/miscellanea:misc.Mode8
ltx/en_us_goadedes/oc.m8.d1:ocMA.OdeS6C33.ode	@ltx/en_us_goadedes/miscellanea:misc.Ode6
ltx/en_us_goadedes/oc.m8.d1:ocMA.OdeS6C33.text	
ltx/en_us_goadedes/oc.m8.d1:ocMA.OdeS7C11.incipit	…
ltx/en_us_goadedes/oc.m8.d1:ocMA.OdeS7C11.melody	@ltx/en_us_goadedes/he.h.m8:heHE.TheouSynkatavasin.name
ltx/en_us_goadedes/oc.m8.d1:ocMA.OdeS7C11.mode	@ltx/en_us_goadedes/miscellanea:misc.Mode8
ltx/en_us_goadedes/oc.m8.d1:ocMA.OdeS7C11.ode	@ltx/en_us_goadedes/miscellanea:misc.Ode7
ltx/en_us_goadedes/oc.m8.d1:ocMA.OdeS7C11.text	
ltx/en_us_goadedes/oc.m8.d1:ocMA.OdeS7C12.incipit	…
ltx/en_us_goadedes/oc.m8.d1:ocMA.OdeS7C12.melody	@ltx/en_us_goadedes/he.h.m8:heHE.TheouSynkatavasin.name
ltx/en_us_goadedes/oc.m8.d1:ocMA.OdeS7C12.mode	@ltx/en_us_goadedes/miscellanea:misc.Mode8
ltx/en_us_goadedes/oc.m8.d1:ocMA.OdeS7C12.ode	@ltx/en_us_goadedes/miscellanea:misc.Ode7
ltx/en_us_goadedes/oc.m8.d1:ocMA.OdeS7C12.text	
ltx/en_us_goadedes/oc.m8.d1:ocMA.OdeS7C1H.greekmelody	@ltx/en_us_goadedes/he.h.m8:heHE.TheouSynkatavasin.greekname
ltx/en_us_goadedes/oc.m8.d1:ocMA.OdeS7C1H.incipit	@ltx/en_us_goadedes/he.h.m8:heHE.TheouSynkatavasin.incipit
ltx/en_us_goadedes/oc.m8.d1:ocMA.OdeS7C1H.melody	@ltx/en_us_goadedes/he.h.m8:heHE.TheouSynkatavasin.melody
ltx/en_us_goadedes/oc.m8.d1:ocMA.OdeS7C1H.mode	@ltx/en_us_goadedes/miscellanea:misc.Mode8
ltx/en_us_goadedes/oc.m8.d1:ocMA.OdeS7C1H.ode	@ltx/en_us_goadedes/miscellanea:misc.Ode7
ltx/en_us_goadedes/oc.m8.d1:ocMA.OdeS7C1H.text	@ltx/en_us_goadedes/he.h.m8:heHE.TheouSynkatavasin.text
ltx/en_us_goadedes/oc.m8.d1:ocMA.OdeS7C1Tr.incipit	…
ltx/en_us_goadedes/oc.m8.d1:ocMA.OdeS7C1Tr.melody	@ltx/en_us_goadedes/he.h.m8:heHE.TheouSynkatavasin.name
ltx/en_us_goadedes/oc.m8.d1:ocMA.OdeS7C1Tr.mode	@ltx/en_us_goadedes/miscellanea:misc.Mode8
ltx/en_us_goadedes/oc.m8.d1:ocMA.OdeS7C1Tr.ode	@ltx/en_us_goadedes/miscellanea:misc.Ode7
ltx/en_us_goadedes/oc.m8.d1:ocMA.OdeS7C1Tr.text	
ltx/en_us_goadedes/oc.m8.d1:ocMA.OdeS7C21.greekmelody	@ltx/en_us_goadedes/he.h.m8:heHE.OiEkTisIoudaias.greekname
ltx/en_us_goadedes/oc.m8.d1:ocMA.OdeS7C21.incipit	…
ltx/en_us_goadedes/oc.m8.d1:ocMA.OdeS7C21.melody	@ltx/en_us_goadedes/he.h.m8:heHE.OiEkTisIoudaias.name
ltx/en_us_goadedes/oc.m8.d1:ocMA.OdeS7C21.mode	@ltx/en_us_goadedes/miscellanea:misc.Mode8
ltx/en_us_goadedes/oc.m8.d1:ocMA.OdeS7C21.ode	@ltx/en_us_goadedes/miscellanea:misc.Ode7
ltx/en_us_goadedes/oc.m8.d1:ocMA.OdeS7C21.text	
ltx/en_us_goadedes/oc.m8.d1:ocMA.OdeS7C22.incipit	…
ltx/en_us_goadedes/oc.m8.d1:ocMA.OdeS7C22.melody	@ltx/en_us_goadedes/he.h.m8:heHE.OiEkTisIoudaias.name
ltx/en_us_goadedes/oc.m8.d1:ocMA.OdeS7C22.mode	@ltx/en_us_goadedes/miscellanea:misc.Mode8
ltx/en_us_goadedes/oc.m8.d1:ocMA.OdeS7C22.ode	@ltx/en_us_goadedes/miscellanea:misc.Ode7
ltx/en_us_goadedes/oc.m8.d1:ocMA.OdeS7C22.text	
ltx/en_us_goadedes/oc.m8.d1:ocMA.OdeS7C2T.incipit	…
ltx/en_us_goadedes/oc.m8.d1:ocMA.OdeS7C2T.melody	@ltx/en_us_goadedes/he.h.m8:heHE.OiEkTisIoudaias.name
ltx/en_us_goadedes/oc.m8.d1:ocMA.OdeS7C2T.mode	@ltx/en_us_goadedes/miscellanea:misc.Mode8
ltx/en_us_goadedes/oc.m8.d1:ocMA.OdeS7C2T.ode	@ltx/en_us_goadedes/miscellanea:misc.Ode7
ltx/en_us_goadedes/oc.m8.d1:ocMA.OdeS7C2T.text	
ltx/en_us_goadedes/oc.m8.d1:ocMA.OdeS7C31.greekmelody	@ltx/en_us_goadedes/he.h.m8:heHE.OiEkTisIoudaias.greekname
ltx/en_us_goadedes/oc.m8.d1:ocMA.OdeS7C31.incipit	…
ltx/en_us_goadedes/oc.m8.d1:ocMA.OdeS7C31.melody	@ltx/en_us_goadedes/he.h.m8:heHE.OiEkTisIoudaias.name
ltx/en_us_goadedes/oc.m8.d1:ocMA.OdeS7C31.mode	@ltx/en_us_goadedes/miscellanea:misc.Mode8
ltx/en_us_goadedes/oc.m8.d1:ocMA.OdeS7C31.ode	@ltx/en_us_goadedes/miscellanea:misc.Ode7
ltx/en_us_goadedes/oc.m8.d1:ocMA.OdeS7C31.text	
ltx/en_us_goadedes/oc.m8.d1:ocMA.OdeS7C32.incipit	…
ltx/en_us_goadedes/oc.m8.d1:ocMA.OdeS7C32.melody	@ltx/en_us_goadedes/he.h.m8:heHE.OiEkTisIoudaias.name
ltx/en_us_goadedes/oc.m8.d1:ocMA.OdeS7C32.mode	@ltx/en_us_goadedes/miscellanea:misc.Mode8
ltx/en_us_goadedes/oc.m8.d1:ocMA.OdeS7C32.ode	@ltx/en_us_goadedes/miscellanea:misc.Ode7
ltx/en_us_goadedes/oc.m8.d1:ocMA.OdeS7C32.text	
ltx/en_us_goadedes/oc.m8.d1:ocMA.OdeS7C33.incipit	…
ltx/en_us_goadedes/oc.m8.d1:ocMA.OdeS7C33.melody	@ltx/en_us_goadedes/he.h.m8:heHE.OiEkTisIoudaias.name
ltx/en_us_goadedes/oc.m8.d1:ocMA.OdeS7C33.mode	@ltx/en_us_goadedes/miscellanea:misc.Mode8
ltx/en_us_goadedes/oc.m8.d1:ocMA.OdeS7C33.ode	@ltx/en_us_goadedes/miscellanea:misc.Ode7
ltx/en_us_goadedes/oc.m8.d1:ocMA.OdeS7C33.text	
ltx/en_us_goadedes/oc.m8.d1:ocMA.OdeS8C11.incipit	…
ltx/en_us_goadedes/oc.m8.d1:ocMA.OdeS8C11.melody	@ltx/en_us_goadedes/he.h.m8:heHE.EptaplasiosKaminon.name
ltx/en_us_goadedes/oc.m8.d1:ocMA.OdeS8C11.mode	@ltx/en_us_goadedes/miscellanea:misc.Mode8
ltx/en_us_goadedes/oc.m8.d1:ocMA.OdeS8C11.ode	@ltx/en_us_goadedes/miscellanea:misc.Ode8
ltx/en_us_goadedes/oc.m8.d1:ocMA.OdeS8C11.text	
ltx/en_us_goadedes/oc.m8.d1:ocMA.OdeS8C12.incipit	…
ltx/en_us_goadedes/oc.m8.d1:ocMA.OdeS8C12.melody	@ltx/en_us_goadedes/he.h.m8:heHE.EptaplasiosKaminon.name
ltx/en_us_goadedes/oc.m8.d1:ocMA.OdeS8C12.mode	@ltx/en_us_goadedes/miscellanea:misc.Mode8
ltx/en_us_goadedes/oc.m8.d1:ocMA.OdeS8C12.ode	@ltx/en_us_goadedes/miscellanea:misc.Ode8
ltx/en_us_goadedes/oc.m8.d1:ocMA.OdeS8C12.text	
ltx/en_us_goadedes/oc.m8.d1:ocMA.OdeS8C1H.greekmelody	@ltx/en_us_goadedes/he.h.m8:heHE.EptaplasiosKaminon.greekname
ltx/en_us_goadedes/oc.m8.d1:ocMA.OdeS8C1H.incipit	@ltx/en_us_goadedes/he.h.m8:heHE.EptaplasiosKaminon.incipit
ltx/en_us_goadedes/oc.m8.d1:ocMA.OdeS8C1H.melody	@ltx/en_us_goadedes/he.h.m8:heHE.EptaplasiosKaminon.melody
ltx/en_us_goadedes/oc.m8.d1:ocMA.OdeS8C1H.mode	@ltx/en_us_goadedes/miscellanea:misc.Mode8
ltx/en_us_goadedes/oc.m8.d1:ocMA.OdeS8C1H.ode	@ltx/en_us_goadedes/miscellanea:misc.Ode8
ltx/en_us_goadedes/oc.m8.d1:ocMA.OdeS8C1H.text	@ltx/en_us_goadedes/he.h.m8:heHE.EptaplasiosKaminon.text
ltx/en_us_goadedes/oc.m8.d1:ocMA.OdeS8C1Tr.incipit	…
ltx/en_us_goadedes/oc.m8.d1:ocMA.OdeS8C1Tr.melody	@ltx/en_us_goadedes/he.h.m8:heHE.EptaplasiosKaminon.name
ltx/en_us_goadedes/oc.m8.d1:ocMA.OdeS8C1Tr.mode	@ltx/en_us_goadedes/miscellanea:misc.Mode8
ltx/en_us_goadedes/oc.m8.d1:ocMA.OdeS8C1Tr.ode	@ltx/en_us_goadedes/miscellanea:misc.Ode8
ltx/en_us_goadedes/oc.m8.d1:ocMA.OdeS8C1Tr.text	
ltx/en_us_goadedes/oc.m8.d1:ocMA.OdeS8C21.greekmelody	@ltx/en_us_goadedes/he.h.m8:heHE.NikitaiTyrannou.greekname
ltx/en_us_goadedes/oc.m8.d1:ocMA.OdeS8C21.incipit	…
ltx/en_us_goadedes/oc.m8.d1:ocMA.OdeS8C21.melody	@ltx/en_us_goadedes/he.h.m8:heHE.NikitaiTyrannou.name
ltx/en_us_goadedes/oc.m8.d1:ocMA.OdeS8C21.mode	@ltx/en_us_goadedes/miscellanea:misc.Mode8
ltx/en_us_goadedes/oc.m8.d1:ocMA.OdeS8C21.ode	@ltx/en_us_goadedes/miscellanea:misc.Ode8
ltx/en_us_goadedes/oc.m8.d1:ocMA.OdeS8C21.text	
ltx/en_us_goadedes/oc.m8.d1:ocMA.OdeS8C22.incipit	…
ltx/en_us_goadedes/oc.m8.d1:ocMA.OdeS8C22.melody	@ltx/en_us_goadedes/he.h.m8:heHE.NikitaiTyrannou.name
ltx/en_us_goadedes/oc.m8.d1:ocMA.OdeS8C22.mode	@ltx/en_us_goadedes/miscellanea:misc.Mode8
ltx/en_us_goadedes/oc.m8.d1:ocMA.OdeS8C22.ode	@ltx/en_us_goadedes/miscellanea:misc.Ode8
ltx/en_us_goadedes/oc.m8.d1:ocMA.OdeS8C22.text	
ltx/en_us_goadedes/oc.m8.d1:ocMA.OdeS8C2T.incipit	…
ltx/en_us_goadedes/oc.m8.d1:ocMA.OdeS8C2T.melody	@ltx/en_us_goadedes/he.h.m8:heHE.NikitaiTyrannou.name
ltx/en_us_goadedes/oc.m8.d1:ocMA.OdeS8C2T.mode	@ltx/en_us_goadedes/miscellanea:misc.Mode8
ltx/en_us_goadedes/oc.m8.d1:ocMA.OdeS8C2T.ode	@ltx/en_us_goadedes/miscellanea:misc.Ode8
ltx/en_us_goadedes/oc.m8.d1:ocMA.OdeS8C2T.text	
ltx/en_us_goadedes/oc.m8.d1:ocMA.OdeS8C31.greekmelody	@ltx/en_us_goadedes/he.h.m8:heHE.TonVasileaTonOuranon.greekname
ltx/en_us_goadedes/oc.m8.d1:ocMA.OdeS8C31.incipit	…
ltx/en_us_goadedes/oc.m8.d1:ocMA.OdeS8C31.melody	@ltx/en_us_goadedes/he.h.m8:heHE.TonVasileaTonOuranon.name
ltx/en_us_goadedes/oc.m8.d1:ocMA.OdeS8C31.mode	@ltx/en_us_goadedes/miscellanea:misc.Mode8
ltx/en_us_goadedes/oc.m8.d1:ocMA.OdeS8C31.ode	@ltx/en_us_goadedes/miscellanea:misc.Ode8
ltx/en_us_goadedes/oc.m8.d1:ocMA.OdeS8C31.text	
ltx/en_us_goadedes/oc.m8.d1:ocMA.OdeS8C32.incipit	…
ltx/en_us_goadedes/oc.m8.d1:ocMA.OdeS8C32.melody	@ltx/en_us_goadedes/he.h.m8:heHE.TonVasileaTonOuranon.name
ltx/en_us_goadedes/oc.m8.d1:ocMA.OdeS8C32.mode	@ltx/en_us_goadedes/miscellanea:misc.Mode8
ltx/en_us_goadedes/oc.m8.d1:ocMA.OdeS8C32.ode	@ltx/en_us_goadedes/miscellanea:misc.Ode8
ltx/en_us_goadedes/oc.m8.d1:ocMA.OdeS8C32.text	
ltx/en_us_goadedes/oc.m8.d1:ocMA.OdeS8C33.incipit	…
ltx/en_us_goadedes/oc.m8.d1:ocMA.OdeS8C33.melody	@ltx/en_us_goadedes/he.h.m8:heHE.TonVasileaTonOuranon.name
ltx/en_us_goadedes/oc.m8.d1:ocMA.OdeS8C33.mode	@ltx/en_us_goadedes/miscellanea:misc.Mode8
ltx/en_us_goadedes/oc.m8.d1:ocMA.OdeS8C33.ode	@ltx/en_us_goadedes/miscellanea:misc.Ode8
ltx/en_us_goadedes/oc.m8.d1:ocMA.OdeS8C33.text	
ltx/en_us_goadedes/oc.m8.d1:ocMA.OdeS9C11.incipit	…
ltx/en_us_goadedes/oc.m8.d1:ocMA.OdeS9C11.melody	@ltx/en_us_goadedes/he.h.m8:heHE.ExestiEpiTouto.name
ltx/en_us_goadedes/oc.m8.d1:ocMA.OdeS9C11.mode	@ltx/en_us_goadedes/miscellanea:misc.Mode8
ltx/en_us_goadedes/oc.m8.d1:ocMA.OdeS9C11.ode	@ltx/en_us_goadedes/miscellanea:misc.Ode9
ltx/en_us_goadedes/oc.m8.d1:ocMA.OdeS9C11.text	
ltx/en_us_goadedes/oc.m8.d1:ocMA.OdeS9C12.incipit	…
ltx/en_us_goadedes/oc.m8.d1:ocMA.OdeS9C12.melody	@ltx/en_us_goadedes/he.h.m8:heHE.ExestiEpiTouto.name
ltx/en_us_goadedes/oc.m8.d1:ocMA.OdeS9C12.mode	@ltx/en_us_goadedes/miscellanea:misc.Mode8
ltx/en_us_goadedes/oc.m8.d1:ocMA.OdeS9C12.ode	@ltx/en_us_goadedes/miscellanea:misc.Ode9
ltx/en_us_goadedes/oc.m8.d1:ocMA.OdeS9C12.text	
ltx/en_us_goadedes/oc.m8.d1:ocMA.OdeS9C1H.greekmelody	@ltx/en_us_goadedes/he.h.m8:heHE.ExestiEpiTouto.greekname
ltx/en_us_goadedes/oc.m8.d1:ocMA.OdeS9C1H.incipit	@ltx/en_us_goadedes/he.h.m8:heHE.ExestiEpiTouto.incipit
ltx/en_us_goadedes/oc.m8.d1:ocMA.OdeS9C1H.melody	@ltx/en_us_goadedes/he.h.m8:heHE.ExestiEpiTouto.melody
ltx/en_us_goadedes/oc.m8.d1:ocMA.OdeS9C1H.mode	@ltx/en_us_goadedes/miscellanea:misc.Mode8
ltx/en_us_goadedes/oc.m8.d1:ocMA.OdeS9C1H.ode	@ltx/en_us_goadedes/miscellanea:misc.Ode9
ltx/en_us_goadedes/oc.m8.d1:ocMA.OdeS9C1H.text	@ltx/en_us_goadedes/he.h.m8:heHE.ExestiEpiTouto.text
ltx/en_us_goadedes/oc.m8.d1:ocMA.OdeS9C1T.incipit	…
ltx/en_us_goadedes/oc.m8.d1:ocMA.OdeS9C1T.melody	@ltx/en_us_goadedes/he.h.m8:heHE.ExestiEpiTouto.name
ltx/en_us_goadedes/oc.m8.d1:ocMA.OdeS9C1T.mode	@ltx/en_us_goadedes/miscellanea:misc.Mode8
ltx/en_us_goadedes/oc.m8.d1:ocMA.OdeS9C1T.ode	@ltx/en_us_goadedes/miscellanea:misc.Ode9
ltx/en_us_goadedes/oc.m8.d1:ocMA.OdeS9C1T.text	
ltx/en_us_goadedes/oc.m8.d1:ocMA.OdeS9C21.greekmelody	@ltx/en_us_goadedes/he.h.m8:heHE.EfrixePasaAkoi.greekname
ltx/en_us_goadedes/oc.m8.d1:ocMA.OdeS9C21.incipit	…
ltx/en_us_goadedes/oc.m8.d1:ocMA.OdeS9C21.melody	@ltx/en_us_goadedes/he.h.m8:heHE.EfrixePasaAkoi.name
ltx/en_us_goadedes/oc.m8.d1:ocMA.OdeS9C21.mode	@ltx/en_us_goadedes/miscellanea:misc.Mode8
ltx/en_us_goadedes/oc.m8.d1:ocMA.OdeS9C21.ode	@ltx/en_us_goadedes/miscellanea:misc.Ode9
ltx/en_us_goadedes/oc.m8.d1:ocMA.OdeS9C21.text	
ltx/en_us_goadedes/oc.m8.d1:ocMA.OdeS9C22.incipit	…
ltx/en_us_goadedes/oc.m8.d1:ocMA.OdeS9C22.melody	@ltx/en_us_goadedes/he.h.m8:heHE.EfrixePasaAkoi.name
ltx/en_us_goadedes/oc.m8.d1:ocMA.OdeS9C22.mode	@ltx/en_us_goadedes/miscellanea:misc.Mode8
ltx/en_us_goadedes/oc.m8.d1:ocMA.OdeS9C22.ode	@ltx/en_us_goadedes/miscellanea:misc.Ode9
ltx/en_us_goadedes/oc.m8.d1:ocMA.OdeS9C22.text	
ltx/en_us_goadedes/oc.m8.d1:ocMA.OdeS9C2T.incipit	…
ltx/en_us_goadedes/oc.m8.d1:ocMA.OdeS9C2T.melody	@ltx/en_us_goadedes/he.h.m8:heHE.EfrixePasaAkoi.name
ltx/en_us_goadedes/oc.m8.d1:ocMA.OdeS9C2T.mode	@ltx/en_us_goadedes/miscellanea:misc.Mode8
ltx/en_us_goadedes/oc.m8.d1:ocMA.OdeS9C2T.ode	@ltx/en_us_goadedes/miscellanea:misc.Ode9
ltx/en_us_goadedes/oc.m8.d1:ocMA.OdeS9C2T.text	
ltx/en_us_goadedes/oc.m8.d1:ocMA.OdeS9C31.greekmelody	@ltx/en_us_goadedes/he.h.m8:heHE.KyriosTheotokon.greekname
ltx/en_us_goadedes/oc.m8.d1:ocMA.OdeS9C31.incipit	…
ltx/en_us_goadedes/oc.m8.d1:ocMA.OdeS9C31.melody	@ltx/en_us_goadedes/he.h.m8:heHE.KyriosTheotokon.name
ltx/en_us_goadedes/oc.m8.d1:ocMA.OdeS9C31.mode	@ltx/en_us_goadedes/miscellanea:misc.Mode8
ltx/en_us_goadedes/oc.m8.d1:ocMA.OdeS9C31.ode	@ltx/en_us_goadedes/miscellanea:misc.Ode9
ltx/en_us_goadedes/oc.m8.d1:ocMA.OdeS9C31.text	
ltx/en_us_goadedes/oc.m8.d1:ocMA.OdeS9C32.incipit	…
ltx/en_us_goadedes/oc.m8.d1:ocMA.OdeS9C32.melody	@ltx/en_us_goadedes/he.h.m8:heHE.KyriosTheotokon.name
ltx/en_us_goadedes/oc.m8.d1:ocMA.OdeS9C32.mode	@ltx/en_us_goadedes/miscellanea:misc.Mode8
ltx/en_us_goadedes/oc.m8.d1:ocMA.OdeS9C32.ode	@ltx/en_us_goadedes/miscellanea:misc.Ode9
ltx/en_us_goadedes/oc.m8.d1:ocMA.OdeS9C32.text	
ltx/en_us_goadedes/oc.m8.d1:ocMA.OdeS9C33.incipit	…
ltx/en_us_goadedes/oc.m8.d1:ocMA.OdeS9C33.melody	@ltx/en_us_goadedes/he.h.m8:heHE.KyriosTheotokon.name
ltx/en_us_goadedes/oc.m8.d1:ocMA.OdeS9C33.mode	@ltx/en_us_goadedes/miscellanea:misc.Mode8
ltx/en_us_goadedes/oc.m8.d1:ocMA.OdeS9C33.ode	@ltx/en_us_goadedes/miscellanea:misc.Ode9
ltx/en_us_goadedes/oc.m8.d1:ocMA.OdeS9C33.text	
ltx/en_us_goadedes/oc.m8.d1:ocMA.Oikos.incipit	When You ransacked the realm…
ltx/en_us_goadedes/oc.m8.d1:ocMA.Oikos.mode	@ltx/en_us_goadedes/miscellanea:misc.Mode8
ltx/en_us_goadedes/oc.m8.d1:ocMA.Oikos.text	When You ransacked the realm of Hades, and You raised the dead, O long-suffering Master, You met the Myrrh-bearing Women, and You gave them joy in place of sorrow. You showed Your Apostles the marks of Your victory, O Savior and Giver of Life, and You illumined creation, O benevolent God. Therefore the world also celebrates Your resurrection from the dead, O very merciful Lord.
ltx/en_us_goadedes/oc.m8.d1:ocMO.Kathisma11.greekmelody	@ltx/en_us_goadedes/he.a.m8:heAU.ToProstachthen.greekname
ltx/en_us_goadedes/oc.m8.d1:ocMO.Kathisma11.incipit	We the believers now extol…
ltx/en_us_goadedes/oc.m8.d1:ocMO.Kathisma11.melody	@ltx/en_us_goadedes/he.a.m8:heAU.ToProstachthen.name
ltx/en_us_goadedes/oc.m8.d1:ocMO.Kathisma11.mode	@ltx/en_us_goadedes/miscellanea:misc.Mode8
ltx/en_us_goadedes/oc.m8.d1:ocMO.Kathisma11.text	We the believers now extol the great and mighty deeds * of the tri-solar God and Maker of the universe. * By a simple command God created everything: * the choirs of the angelic orders on high, * the ranks of the Church’s hierarchy on earth; * so that all sing together, “Holy, Holy, Holy are You! * We praise and we glorify * Your dominion, most benevolent God.”
ltx/en_us_goadedes/oc.m8.d1:ocMO.Kathisma12.incipit	Mother of never changing God…
ltx/en_us_goadedes/oc.m8.d1:ocMO.Kathisma12.melody	@ltx/en_us_goadedes/he.a.m8:heAU.ToProstachthen.name
ltx/en_us_goadedes/oc.m8.d1:ocMO.Kathisma12.mode	@ltx/en_us_goadedes/miscellanea:misc.Mode8
ltx/en_us_goadedes/oc.m8.d1:ocMO.Kathisma12.text	Mother of never changing God, my heart is ever * subject to change, and tends to sin, for I am careless * and the devil assaults me with cunning temptations. * Good Lady, I pray you strengthen my weakened soul, * imploring Your Son and Master on my behalf. * And with gratitude I will sing, “O Mary, Mother of our God, * have mercy on the flock that you have been given, O all-blameless one.”
ltx/en_us_goadedes/oc.m8.d1:ocMO.Kathisma21.greekmelody	@ltx/en_us_goadedes/he.a.m8:heAU.ToProstachthen.greekname
ltx/en_us_goadedes/oc.m8.d1:ocMO.Kathisma21.incipit	…
ltx/en_us_goadedes/oc.m8.d1:ocMO.Kathisma21.melody	@ltx/en_us_goadedes/he.a.m8:heAU.ToProstachthen.name
ltx/en_us_goadedes/oc.m8.d1:ocMO.Kathisma21.mode	@ltx/en_us_goadedes/miscellanea:misc.Mode8
ltx/en_us_goadedes/oc.m8.d1:ocMO.Kathisma21.text	
ltx/en_us_goadedes/oc.m8.d1:ocMO.Kathisma22.incipit	As we confess our faith…
ltx/en_us_goadedes/oc.m8.d1:ocMO.Kathisma22.melody	@ltx/en_us_goadedes/he.a.m8:heAU.ToProstachthen.name
ltx/en_us_goadedes/oc.m8.d1:ocMO.Kathisma22.mode	@ltx/en_us_goadedes/miscellanea:misc.Mode8
ltx/en_us_goadedes/oc.m8.d1:ocMO.Kathisma22.text	As we confess our faith in God, the Holy Trinity, * simple, unmingled, indivisible, immutable, * unoriginate Father, Son, and Holy Spirit, * the three consubstantial persons, in nature one, * we sing with the holy angels, “Holy are You, * Father, Son, and the Spirit, the all-holy and divine, * be merciful to us whom You * have created in Your image, O Lord.”
ltx/en_us_goadedes/oc.m8.d1:ocMO.Ode11.greekmelody	@ltx/en_us_goadedes/he.h.m8:heHE.ArmatilatinFarao.greekname
ltx/en_us_goadedes/oc.m8.d1:ocMO.Ode11.incipit	…
ltx/en_us_goadedes/oc.m8.d1:ocMO.Ode11.melody	@ltx/en_us_goadedes/he.h.m8:heHE.ArmatilatinFarao.name
ltx/en_us_goadedes/oc.m8.d1:ocMO.Ode11.mode	@ltx/en_us_goadedes/miscellanea:misc.Mode8
ltx/en_us_goadedes/oc.m8.d1:ocMO.Ode11.ode	@ltx/en_us_goadedes/miscellanea:misc.Ode1
ltx/en_us_goadedes/oc.m8.d1:ocMO.Ode11.text	
ltx/en_us_goadedes/oc.m8.d1:ocMO.Ode12.incipit	…
ltx/en_us_goadedes/oc.m8.d1:ocMO.Ode12.melody	@ltx/en_us_goadedes/he.h.m8:heHE.ArmatilatinFarao.name
ltx/en_us_goadedes/oc.m8.d1:ocMO.Ode12.mode	@ltx/en_us_goadedes/miscellanea:misc.Mode8
ltx/en_us_goadedes/oc.m8.d1:ocMO.Ode12.ode	@ltx/en_us_goadedes/miscellanea:misc.Ode1
ltx/en_us_goadedes/oc.m8.d1:ocMO.Ode12.text	
ltx/en_us_goadedes/oc.m8.d1:ocMO.Ode13.incipit	…
ltx/en_us_goadedes/oc.m8.d1:ocMO.Ode13.melody	@ltx/en_us_goadedes/he.h.m8:heHE.ArmatilatinFarao.name
ltx/en_us_goadedes/oc.m8.d1:ocMO.Ode13.mode	@ltx/en_us_goadedes/miscellanea:misc.Mode8
ltx/en_us_goadedes/oc.m8.d1:ocMO.Ode13.ode	@ltx/en_us_goadedes/miscellanea:misc.Ode1
ltx/en_us_goadedes/oc.m8.d1:ocMO.Ode13.text	
ltx/en_us_goadedes/oc.m8.d1:ocMO.Ode1T.incipit	…
ltx/en_us_goadedes/oc.m8.d1:ocMO.Ode1T.melody	@ltx/en_us_goadedes/he.h.m8:heHE.ArmatilatinFarao.name
ltx/en_us_goadedes/oc.m8.d1:ocMO.Ode1T.mode	@ltx/en_us_goadedes/miscellanea:misc.Mode8
ltx/en_us_goadedes/oc.m8.d1:ocMO.Ode1T.ode	@ltx/en_us_goadedes/miscellanea:misc.Ode1
ltx/en_us_goadedes/oc.m8.d1:ocMO.Ode1T.text	
ltx/en_us_goadedes/oc.m8.d1:ocMO.Ode31.greekmelody	@ltx/en_us_goadedes/he.h.m8:heHE.OStereosasKatArchas.greekname
ltx/en_us_goadedes/oc.m8.d1:ocMO.Ode31.incipit	…
ltx/en_us_goadedes/oc.m8.d1:ocMO.Ode31.melody	@ltx/en_us_goadedes/he.h.m8:heHE.OStereosasKatArchas.name
ltx/en_us_goadedes/oc.m8.d1:ocMO.Ode31.mode	@ltx/en_us_goadedes/miscellanea:misc.Mode8
ltx/en_us_goadedes/oc.m8.d1:ocMO.Ode31.ode	@ltx/en_us_goadedes/miscellanea:misc.Ode3
ltx/en_us_goadedes/oc.m8.d1:ocMO.Ode31.text	
ltx/en_us_goadedes/oc.m8.d1:ocMO.Ode32.incipit	…
ltx/en_us_goadedes/oc.m8.d1:ocMO.Ode32.melody	@ltx/en_us_goadedes/he.h.m8:heHE.OStereosasKatArchas.name
ltx/en_us_goadedes/oc.m8.d1:ocMO.Ode32.mode	@ltx/en_us_goadedes/miscellanea:misc.Mode8
ltx/en_us_goadedes/oc.m8.d1:ocMO.Ode32.ode	@ltx/en_us_goadedes/miscellanea:misc.Ode3
ltx/en_us_goadedes/oc.m8.d1:ocMO.Ode32.text	
ltx/en_us_goadedes/oc.m8.d1:ocMO.Ode33.incipit	…
ltx/en_us_goadedes/oc.m8.d1:ocMO.Ode33.melody	@ltx/en_us_goadedes/he.h.m8:heHE.OStereosasKatArchas.name
ltx/en_us_goadedes/oc.m8.d1:ocMO.Ode33.mode	@ltx/en_us_goadedes/miscellanea:misc.Mode8
ltx/en_us_goadedes/oc.m8.d1:ocMO.Ode33.ode	@ltx/en_us_goadedes/miscellanea:misc.Ode3
ltx/en_us_goadedes/oc.m8.d1:ocMO.Ode33.text	
ltx/en_us_goadedes/oc.m8.d1:ocMO.Ode3T.incipit	…
ltx/en_us_goadedes/oc.m8.d1:ocMO.Ode3T.melody	@ltx/en_us_goadedes/he.h.m8:heHE.OStereosasKatArchas.name
ltx/en_us_goadedes/oc.m8.d1:ocMO.Ode3T.mode	@ltx/en_us_goadedes/miscellanea:misc.Mode8
ltx/en_us_goadedes/oc.m8.d1:ocMO.Ode3T.ode	@ltx/en_us_goadedes/miscellanea:misc.Ode3
ltx/en_us_goadedes/oc.m8.d1:ocMO.Ode3T.text	
ltx/en_us_goadedes/oc.m8.d1:ocMO.Ode41.greekmelody	@ltx/en_us_goadedes/he.h.m8:heHE.SyMouIschys.greekname
ltx/en_us_goadedes/oc.m8.d1:ocMO.Ode41.incipit	…
ltx/en_us_goadedes/oc.m8.d1:ocMO.Ode41.melody	@ltx/en_us_goadedes/he.h.m8:heHE.SyMouIschys.name
ltx/en_us_goadedes/oc.m8.d1:ocMO.Ode41.mode	@ltx/en_us_goadedes/miscellanea:misc.Mode8
ltx/en_us_goadedes/oc.m8.d1:ocMO.Ode41.ode	@ltx/en_us_goadedes/miscellanea:misc.Ode4
ltx/en_us_goadedes/oc.m8.d1:ocMO.Ode41.text	
ltx/en_us_goadedes/oc.m8.d1:ocMO.Ode42.incipit	…
ltx/en_us_goadedes/oc.m8.d1:ocMO.Ode42.melody	@ltx/en_us_goadedes/he.h.m8:heHE.SyMouIschys.name
ltx/en_us_goadedes/oc.m8.d1:ocMO.Ode42.mode	@ltx/en_us_goadedes/miscellanea:misc.Mode8
ltx/en_us_goadedes/oc.m8.d1:ocMO.Ode42.ode	@ltx/en_us_goadedes/miscellanea:misc.Ode4
ltx/en_us_goadedes/oc.m8.d1:ocMO.Ode42.text	
ltx/en_us_goadedes/oc.m8.d1:ocMO.Ode43.incipit	…
ltx/en_us_goadedes/oc.m8.d1:ocMO.Ode43.melody	@ltx/en_us_goadedes/he.h.m8:heHE.SyMouIschys.name
ltx/en_us_goadedes/oc.m8.d1:ocMO.Ode43.mode	@ltx/en_us_goadedes/miscellanea:misc.Mode8
ltx/en_us_goadedes/oc.m8.d1:ocMO.Ode43.ode	@ltx/en_us_goadedes/miscellanea:misc.Ode4
ltx/en_us_goadedes/oc.m8.d1:ocMO.Ode43.text	
ltx/en_us_goadedes/oc.m8.d1:ocMO.Ode4T.incipit	…
ltx/en_us_goadedes/oc.m8.d1:ocMO.Ode4T.melody	@ltx/en_us_goadedes/he.h.m8:heHE.SyMouIschys.name
ltx/en_us_goadedes/oc.m8.d1:ocMO.Ode4T.mode	@ltx/en_us_goadedes/miscellanea:misc.Mode8
ltx/en_us_goadedes/oc.m8.d1:ocMO.Ode4T.ode	@ltx/en_us_goadedes/miscellanea:misc.Ode4
ltx/en_us_goadedes/oc.m8.d1:ocMO.Ode4T.text	
ltx/en_us_goadedes/oc.m8.d1:ocMO.Ode51.greekmelody	@ltx/en_us_goadedes/he.h.m8:heHE.InaTiMeAposo.greekname
ltx/en_us_goadedes/oc.m8.d1:ocMO.Ode51.incipit	…
ltx/en_us_goadedes/oc.m8.d1:ocMO.Ode51.melody	@ltx/en_us_goadedes/he.h.m8:heHE.InaTiMeAposo.name
ltx/en_us_goadedes/oc.m8.d1:ocMO.Ode51.mode	@ltx/en_us_goadedes/miscellanea:misc.Mode8
ltx/en_us_goadedes/oc.m8.d1:ocMO.Ode51.ode	@ltx/en_us_goadedes/miscellanea:misc.Ode5
ltx/en_us_goadedes/oc.m8.d1:ocMO.Ode51.text	
ltx/en_us_goadedes/oc.m8.d1:ocMO.Ode52.incipit	…
ltx/en_us_goadedes/oc.m8.d1:ocMO.Ode52.melody	@ltx/en_us_goadedes/he.h.m8:heHE.InaTiMeAposo.name
ltx/en_us_goadedes/oc.m8.d1:ocMO.Ode52.mode	@ltx/en_us_goadedes/miscellanea:misc.Mode8
ltx/en_us_goadedes/oc.m8.d1:ocMO.Ode52.ode	@ltx/en_us_goadedes/miscellanea:misc.Ode5
ltx/en_us_goadedes/oc.m8.d1:ocMO.Ode52.text	
ltx/en_us_goadedes/oc.m8.d1:ocMO.Ode53.incipit	…
ltx/en_us_goadedes/oc.m8.d1:ocMO.Ode53.melody	@ltx/en_us_goadedes/he.h.m8:heHE.InaTiMeAposo.name
ltx/en_us_goadedes/oc.m8.d1:ocMO.Ode53.mode	@ltx/en_us_goadedes/miscellanea:misc.Mode8
ltx/en_us_goadedes/oc.m8.d1:ocMO.Ode53.ode	@ltx/en_us_goadedes/miscellanea:misc.Ode5
ltx/en_us_goadedes/oc.m8.d1:ocMO.Ode53.text	
ltx/en_us_goadedes/oc.m8.d1:ocMO.Ode5T.incipit	…
ltx/en_us_goadedes/oc.m8.d1:ocMO.Ode5T.melody	@ltx/en_us_goadedes/he.h.m8:heHE.InaTiMeAposo.name
ltx/en_us_goadedes/oc.m8.d1:ocMO.Ode5T.mode	@ltx/en_us_goadedes/miscellanea:misc.Mode8
ltx/en_us_goadedes/oc.m8.d1:ocMO.Ode5T.ode	@ltx/en_us_goadedes/miscellanea:misc.Ode5
ltx/en_us_goadedes/oc.m8.d1:ocMO.Ode5T.text	
ltx/en_us_goadedes/oc.m8.d1:ocMO.Ode61.greekmelody	@ltx/en_us_goadedes/he.h.m8:heHE.IlasthitiMoiSotir.greekname
ltx/en_us_goadedes/oc.m8.d1:ocMO.Ode61.incipit	…
ltx/en_us_goadedes/oc.m8.d1:ocMO.Ode61.melody	@ltx/en_us_goadedes/he.h.m8:heHE.IlasthitiMoiSotir.name
ltx/en_us_goadedes/oc.m8.d1:ocMO.Ode61.mode	@ltx/en_us_goadedes/miscellanea:misc.Mode8
ltx/en_us_goadedes/oc.m8.d1:ocMO.Ode61.ode	@ltx/en_us_goadedes/miscellanea:misc.Ode6
ltx/en_us_goadedes/oc.m8.d1:ocMO.Ode61.text	
ltx/en_us_goadedes/oc.m8.d1:ocMO.Ode62.incipit	…
ltx/en_us_goadedes/oc.m8.d1:ocMO.Ode62.melody	@ltx/en_us_goadedes/he.h.m8:heHE.IlasthitiMoiSotir.name
ltx/en_us_goadedes/oc.m8.d1:ocMO.Ode62.mode	@ltx/en_us_goadedes/miscellanea:misc.Mode8
ltx/en_us_goadedes/oc.m8.d1:ocMO.Ode62.ode	@ltx/en_us_goadedes/miscellanea:misc.Ode6
ltx/en_us_goadedes/oc.m8.d1:ocMO.Ode62.text	
ltx/en_us_goadedes/oc.m8.d1:ocMO.Ode63.incipit	…
ltx/en_us_goadedes/oc.m8.d1:ocMO.Ode63.melody	@ltx/en_us_goadedes/he.h.m8:heHE.IlasthitiMoiSotir.name
ltx/en_us_goadedes/oc.m8.d1:ocMO.Ode63.mode	@ltx/en_us_goadedes/miscellanea:misc.Mode8
ltx/en_us_goadedes/oc.m8.d1:ocMO.Ode63.ode	@ltx/en_us_goadedes/miscellanea:misc.Ode6
ltx/en_us_goadedes/oc.m8.d1:ocMO.Ode63.text	
ltx/en_us_goadedes/oc.m8.d1:ocMO.Ode6T.incipit	…
ltx/en_us_goadedes/oc.m8.d1:ocMO.Ode6T.melody	@ltx/en_us_goadedes/he.h.m8:heHE.IlasthitiMoiSotir.name
ltx/en_us_goadedes/oc.m8.d1:ocMO.Ode6T.mode	@ltx/en_us_goadedes/miscellanea:misc.Mode8
ltx/en_us_goadedes/oc.m8.d1:ocMO.Ode6T.ode	@ltx/en_us_goadedes/miscellanea:misc.Ode6
ltx/en_us_goadedes/oc.m8.d1:ocMO.Ode6T.text	
ltx/en_us_goadedes/oc.m8.d1:ocMO.Ode71.greekmelody	@ltx/en_us_goadedes/he.h.m8:heHE.TheouSynkatavasin.greekname
ltx/en_us_goadedes/oc.m8.d1:ocMO.Ode71.incipit	…
ltx/en_us_goadedes/oc.m8.d1:ocMO.Ode71.melody	@ltx/en_us_goadedes/he.h.m8:heHE.TheouSynkatavasin.name
ltx/en_us_goadedes/oc.m8.d1:ocMO.Ode71.mode	@ltx/en_us_goadedes/miscellanea:misc.Mode8
ltx/en_us_goadedes/oc.m8.d1:ocMO.Ode71.ode	@ltx/en_us_goadedes/miscellanea:misc.Ode7
ltx/en_us_goadedes/oc.m8.d1:ocMO.Ode71.text	
ltx/en_us_goadedes/oc.m8.d1:ocMO.Ode72.incipit	…
ltx/en_us_goadedes/oc.m8.d1:ocMO.Ode72.melody	@ltx/en_us_goadedes/he.h.m8:heHE.TheouSynkatavasin.name
ltx/en_us_goadedes/oc.m8.d1:ocMO.Ode72.mode	@ltx/en_us_goadedes/miscellanea:misc.Mode8
ltx/en_us_goadedes/oc.m8.d1:ocMO.Ode72.ode	@ltx/en_us_goadedes/miscellanea:misc.Ode7
ltx/en_us_goadedes/oc.m8.d1:ocMO.Ode72.text	
ltx/en_us_goadedes/oc.m8.d1:ocMO.Ode7T.incipit	…
ltx/en_us_goadedes/oc.m8.d1:ocMO.Ode7T.melody	@ltx/en_us_goadedes/he.h.m8:heHE.TheouSynkatavasin.name
ltx/en_us_goadedes/oc.m8.d1:ocMO.Ode7T.mode	@ltx/en_us_goadedes/miscellanea:misc.Mode8
ltx/en_us_goadedes/oc.m8.d1:ocMO.Ode7T.ode	@ltx/en_us_goadedes/miscellanea:misc.Ode7
ltx/en_us_goadedes/oc.m8.d1:ocMO.Ode7T.text	
ltx/en_us_goadedes/oc.m8.d1:ocMO.Ode81.greekmelody	@ltx/en_us_goadedes/he.h.m8:heHE.EptaplasiosKaminon.greekname
ltx/en_us_goadedes/oc.m8.d1:ocMO.Ode81.incipit	…
ltx/en_us_goadedes/oc.m8.d1:ocMO.Ode81.melody	@ltx/en_us_goadedes/he.h.m8:heHE.EptaplasiosKaminon.name
ltx/en_us_goadedes/oc.m8.d1:ocMO.Ode81.mode	@ltx/en_us_goadedes/miscellanea:misc.Mode8
ltx/en_us_goadedes/oc.m8.d1:ocMO.Ode81.ode	@ltx/en_us_goadedes/miscellanea:misc.Ode8
ltx/en_us_goadedes/oc.m8.d1:ocMO.Ode81.text	
ltx/en_us_goadedes/oc.m8.d1:ocMO.Ode82.incipit	…
ltx/en_us_goadedes/oc.m8.d1:ocMO.Ode82.melody	@ltx/en_us_goadedes/he.h.m8:heHE.EptaplasiosKaminon.name
ltx/en_us_goadedes/oc.m8.d1:ocMO.Ode82.mode	@ltx/en_us_goadedes/miscellanea:misc.Mode8
ltx/en_us_goadedes/oc.m8.d1:ocMO.Ode82.ode	@ltx/en_us_goadedes/miscellanea:misc.Ode8
ltx/en_us_goadedes/oc.m8.d1:ocMO.Ode82.text	
ltx/en_us_goadedes/oc.m8.d1:ocMO.Ode83.incipit	…
ltx/en_us_goadedes/oc.m8.d1:ocMO.Ode83.melody	@ltx/en_us_goadedes/he.h.m8:heHE.EptaplasiosKaminon.name
ltx/en_us_goadedes/oc.m8.d1:ocMO.Ode83.mode	@ltx/en_us_goadedes/miscellanea:misc.Mode8
ltx/en_us_goadedes/oc.m8.d1:ocMO.Ode83.ode	@ltx/en_us_goadedes/miscellanea:misc.Ode8
ltx/en_us_goadedes/oc.m8.d1:ocMO.Ode83.text	
ltx/en_us_goadedes/oc.m8.d1:ocMO.Ode8T.incipit	…
ltx/en_us_goadedes/oc.m8.d1:ocMO.Ode8T.melody	@ltx/en_us_goadedes/he.h.m8:heHE.EptaplasiosKaminon.name
ltx/en_us_goadedes/oc.m8.d1:ocMO.Ode8T.mode	@ltx/en_us_goadedes/miscellanea:misc.Mode8
ltx/en_us_goadedes/oc.m8.d1:ocMO.Ode8T.ode	@ltx/en_us_goadedes/miscellanea:misc.Ode8
ltx/en_us_goadedes/oc.m8.d1:ocMO.Ode8T.text	
ltx/en_us_goadedes/oc.m8.d1:ocMO.Ode91.greekmelody	@ltx/en_us_goadedes/he.h.m8:heHE.ExestiEpiTouto.greekname
ltx/en_us_goadedes/oc.m8.d1:ocMO.Ode91.incipit	…
ltx/en_us_goadedes/oc.m8.d1:ocMO.Ode91.melody	@ltx/en_us_goadedes/he.h.m8:heHE.ExestiEpiTouto.name
ltx/en_us_goadedes/oc.m8.d1:ocMO.Ode91.mode	@ltx/en_us_goadedes/miscellanea:misc.Mode8
ltx/en_us_goadedes/oc.m8.d1:ocMO.Ode91.ode	@ltx/en_us_goadedes/miscellanea:misc.Ode9
ltx/en_us_goadedes/oc.m8.d1:ocMO.Ode91.text	
ltx/en_us_goadedes/oc.m8.d1:ocMO.Ode92.incipit	…
ltx/en_us_goadedes/oc.m8.d1:ocMO.Ode92.melody	@ltx/en_us_goadedes/he.h.m8:heHE.ExestiEpiTouto.name
ltx/en_us_goadedes/oc.m8.d1:ocMO.Ode92.mode	@ltx/en_us_goadedes/miscellanea:misc.Mode8
ltx/en_us_goadedes/oc.m8.d1:ocMO.Ode92.ode	@ltx/en_us_goadedes/miscellanea:misc.Ode9
ltx/en_us_goadedes/oc.m8.d1:ocMO.Ode92.text	
ltx/en_us_goadedes/oc.m8.d1:ocMO.Ode9T.incipit	…
ltx/en_us_goadedes/oc.m8.d1:ocMO.Ode9T.melody	@ltx/en_us_goadedes/he.h.m8:heHE.ExestiEpiTouto.name
ltx/en_us_goadedes/oc.m8.d1:ocMO.Ode9T.mode	@ltx/en_us_goadedes/miscellanea:misc.Mode8
ltx/en_us_goadedes/oc.m8.d1:ocMO.Ode9T.ode	@ltx/en_us_goadedes/miscellanea:misc.Ode9
ltx/en_us_goadedes/oc.m8.d1:ocMO.Ode9T.text	
ltx/en_us_goadedes/oc.m8.d1:ocMO.acrostic.notice	
ltx/en_us_goadedes/oc.m8.d1:ocMO.acrostic.text	
ltx/en_us_goadedes/oc.m8.d1:ocMO.poet	@ltx/en_us_goadedes/poets:po.MitrofanousSmirnis
ltx/en_us_goadedes/oc.m8.d1:ocMO.title	Canon for the Trinity
ltx/en_us_goadedes/oc.m8.d1:ocSV.AposDogmatic.incipit	…
ltx/en_us_goadedes/oc.m8.d1:ocSV.AposDogmatic.melody	
ltx/en_us_goadedes/oc.m8.d1:ocSV.AposDogmatic.mode	@ltx/en_us_goadedes/miscellanea:misc.Mode8
ltx/en_us_goadedes/oc.m8.d1:ocSV.AposDogmatic.text	
ltx/en_us_goadedes/oc.m8.d1:ocSV.Aposticha1.incipit	…
ltx/en_us_goadedes/oc.m8.d1:ocSV.Aposticha1.melody	@ltx/en_us_goadedes/he.a.m8:heAU.OTouParadoxou.name
ltx/en_us_goadedes/oc.m8.d1:ocSV.Aposticha1.mode	@ltx/en_us_goadedes/miscellanea:misc.Mode8
ltx/en_us_goadedes/oc.m8.d1:ocSV.Aposticha1.text	
ltx/en_us_goadedes/oc.m8.d1:ocSV.Aposticha2.incipit	…
ltx/en_us_goadedes/oc.m8.d1:ocSV.Aposticha2.melody	@ltx/en_us_goadedes/he.a.m8:heAU.OTouParadoxou.name
ltx/en_us_goadedes/oc.m8.d1:ocSV.Aposticha2.mode	@ltx/en_us_goadedes/miscellanea:misc.Mode8
ltx/en_us_goadedes/oc.m8.d1:ocSV.Aposticha2.text	
ltx/en_us_goadedes/oc.m8.d1:ocSV.Aposticha3.incipit	…
ltx/en_us_goadedes/oc.m8.d1:ocSV.Aposticha3.melody	@ltx/en_us_goadedes/he.a.m8:heAU.OTouParadoxou.name
ltx/en_us_goadedes/oc.m8.d1:ocSV.Aposticha3.mode	@ltx/en_us_goadedes/miscellanea:misc.Mode8
ltx/en_us_goadedes/oc.m8.d1:ocSV.Aposticha3.text	
ltx/en_us_goadedes/oc.m8.d1:ocSV.Dogmatic.incipit	…
ltx/en_us_goadedes/oc.m8.d1:ocSV.Dogmatic.melody	
ltx/en_us_goadedes/oc.m8.d1:ocSV.Dogmatic.mode	@ltx/en_us_goadedes/miscellanea:misc.Mode8
ltx/en_us_goadedes/oc.m8.d1:ocSV.Dogmatic.text	
ltx/en_us_goadedes/oc.m8.d1:ocVE.ApolTheotokionVM.incipit	You were born of a Virgin…
ltx/en_us_goadedes/oc.m8.d1:ocVE.ApolTheotokionVM.melody	
ltx/en_us_goadedes/oc.m8.d1:ocVE.ApolTheotokionVM.mode	@ltx/en_us_goadedes/miscellanea:misc.Mode8
ltx/en_us_goadedes/oc.m8.d1:ocVE.ApolTheotokionVM.text	You were born of a Virgin, and You endured crucifixion for us, O good Lord. By Your death You divested death of spoils, and You displayed resurrection, as God. Please do not despise us, the work of Your hand. Demonstrate Your loving kindness, O merciful Master. Defer to Your Mother, the Theotokos, when she intercedes on our behalf, and save us, Your people in despair, O Savior.
ltx/en_us_goadedes/oc.m8.d1:ocVE.Apolytikion.incipit	You descended from on high…
ltx/en_us_goadedes/oc.m8.d1:ocVE.Apolytikion.melody	
ltx/en_us_goadedes/oc.m8.d1:ocVE.Apolytikion.mode	@ltx/en_us_goadedes/miscellanea:misc.Mode8
ltx/en_us_goadedes/oc.m8.d1:ocVE.Apolytikion.text	You descended from on high, O compassionate One, and consented to a three-day burial, to free us from the passions. O Lord, our life and resurrection, glory to You!
ltx/en_us_goadedes/oc.m8.d1:ocVE.AposTheotokion.incipit	All-blameless Virgin…
ltx/en_us_goadedes/oc.m8.d1:ocVE.AposTheotokion.melody	
ltx/en_us_goadedes/oc.m8.d1:ocVE.AposTheotokion.mode	@ltx/en_us_goadedes/miscellanea:misc.Mode8
ltx/en_us_goadedes/oc.m8.d1:ocVE.AposTheotokion.text	All-blameless Virgin, who did not know man yet ineffably conceived God in the flesh, Mother of God Most High, hear our supplications when we pray to you, who provide the cleansing of offenses to all. Again we pray you, receive us who now entreat you, and implore your Son to save us all.
ltx/en_us_goadedes/oc.m8.d1:ocVE.Aposticha1.incipit	Jesus, You descended…
ltx/en_us_goadedes/oc.m8.d1:ocVE.Aposticha1.melody	
ltx/en_us_goadedes/oc.m8.d1:ocVE.Aposticha1.mode	@ltx/en_us_goadedes/miscellanea:misc.Mode8
ltx/en_us_goadedes/oc.m8.d1:ocVE.Aposticha1.text	Jesus, You descended from heaven, and You ascended the Cross. You, who are immortal life, came in order to die. You, who are the true light, went to those who sat in darkness, the resurrection of all, to those who were fallen. Our enlightener and Savior, glory to You!
ltx/en_us_goadedes/oc.m8.d1:ocVE.Aposticha2.incipit	Let us glorify Christ…
ltx/en_us_goadedes/oc.m8.d1:ocVE.Aposticha2.melody	
ltx/en_us_goadedes/oc.m8.d1:ocVE.Aposticha2.mode	@ltx/en_us_goadedes/miscellanea:misc.Mode8
ltx/en_us_goadedes/oc.m8.d1:ocVE.Aposticha2.text	Let us glorify Christ who has risen from the dead. He had assumed both a soul and a body, and enduring His Passion He separated them. His immaculate soul went down to Hades, and He devastated it, while in the grave the holy body of the Redeemer of our souls did not see corruption nor undergo decay.
ltx/en_us_goadedes/oc.m8.d1:ocVE.Aposticha3.incipit	With Psalms and hymns…
ltx/en_us_goadedes/oc.m8.d1:ocVE.Aposticha3.melody	
ltx/en_us_goadedes/oc.m8.d1:ocVE.Aposticha3.mode	@ltx/en_us_goadedes/miscellanea:misc.Mode8
ltx/en_us_goadedes/oc.m8.d1:ocVE.Aposticha3.text	With Psalms and hymns we glorify Your resurrection from the dead, through which You, O Christ, freed us from the tyranny of Hades, and as God You gave to the world life eternal and the great mercy.
ltx/en_us_goadedes/oc.m8.d1:ocVE.Aposticha4.incipit	O Master of the universe…
ltx/en_us_goadedes/oc.m8.d1:ocVE.Aposticha4.melody	
ltx/en_us_goadedes/oc.m8.d1:ocVE.Aposticha4.mode	@ltx/en_us_goadedes/miscellanea:misc.Mode8
ltx/en_us_goadedes/oc.m8.d1:ocVE.Aposticha4.text	O Master of the universe, incomprehensible Maker of heaven and earth, through Your Passion and the Cross, You became for me a fount of dispassion. You consented to be buried, then You rose again in glory, raising Adam with yourself by Your almighty hand. Glory to Your resurrection on the third day! Through it You have given us eternal life and forgiveness of sins, O supremely compassionate Lord.
ltx/en_us_goadedes/oc.m8.d1:ocVE.MM.LIHC1.text	@ltx/en_us_goadedes/properties:media.key
ltx/en_us_goadedes/oc.m8.d1:ocVE.MM.LIHC2.text	@ltx/en_us_goadedes/properties:media.key
ltx/en_us_goadedes/oc.m8.d1:ocVE.MM.Stichologia.text	@ltx/en_us_goadedes/properties:media.key
ltx/en_us_goadedes/oc.m8.d1:ocVE.SticTheotokion.incipit	The King of heaven…
ltx/en_us_goadedes/oc.m8.d1:ocVE.SticTheotokion.melody	
ltx/en_us_goadedes/oc.m8.d1:ocVE.SticTheotokion.mode	@ltx/en_us_goadedes/miscellanea:misc.Mode8
ltx/en_us_goadedes/oc.m8.d1:ocVE.SticTheotokion.text	The King of heaven appeared on earth and lived among men, in His benevolence towards humanity. He assumed flesh from the pure Virgin, and, with the human nature that He assumed, He was born from her. Now twofold in nature, He is but one person, the Son. So we confess and correctly profess that fully divine and fully human He is one and the same, Christ our God. We pray you, His virgin Mother, entreat Him to have mercy on our souls.
ltx/en_us_goadedes/oc.m8.d1:ocVE.Stichera1.incipit	We offer You, O Christ…
ltx/en_us_goadedes/oc.m8.d1:ocVE.Stichera1.melody	
ltx/en_us_goadedes/oc.m8.d1:ocVE.Stichera1.mode	@ltx/en_us_goadedes/miscellanea:misc.Mode8
ltx/en_us_goadedes/oc.m8.d1:ocVE.Stichera1.text	We offer You, O Christ, evening hymns of praise, this service of spiritual worship. For You were well pleased to have mercy on us through the resurrection.
ltx/en_us_goadedes/oc.m8.d1:ocVE.Stichera2.incipit	We pray You, O Lord…
ltx/en_us_goadedes/oc.m8.d1:ocVE.Stichera2.melody	
ltx/en_us_goadedes/oc.m8.d1:ocVE.Stichera2.mode	@ltx/en_us_goadedes/miscellanea:misc.Mode8
ltx/en_us_goadedes/oc.m8.d1:ocVE.Stichera2.text	We pray You, O Lord, O Lord, do not cast us away from Your presence. Please have mercy on us, through the resurrection.
ltx/en_us_goadedes/oc.m8.d1:ocVE.Stichera3.incipit	Rejoice, O holy Zion…
ltx/en_us_goadedes/oc.m8.d1:ocVE.Stichera3.melody	
ltx/en_us_goadedes/oc.m8.d1:ocVE.Stichera3.mode	@ltx/en_us_goadedes/miscellanea:misc.Mode8
ltx/en_us_goadedes/oc.m8.d1:ocVE.Stichera3.text	Rejoice, O holy Zion, Mother of the churches, and where God made His dwelling! You were first to receive the forgiveness of sins through the resurrection.
ltx/en_us_goadedes/oc.m8.d1:ocVE.Stichera4.incipit	The Logos, who before all ages…
ltx/en_us_goadedes/oc.m8.d1:ocVE.Stichera4.melody	
ltx/en_us_goadedes/oc.m8.d1:ocVE.Stichera4.mode	@ltx/en_us_goadedes/miscellanea:misc.Mode8
ltx/en_us_goadedes/oc.m8.d1:ocVE.Stichera4.text	The Logos, who before all ages was begotten of God the Father and in latter times became incarnate of the ever-virgin Mary, of His own will endured crucifixion and death, and through His resurrection He saved humanity, which had died long ago.
ltx/en_us_goadedes/oc.m8.d1:ocVE.Stichera5.incipit	We glorify Your resurrection…
ltx/en_us_goadedes/oc.m8.d1:ocVE.Stichera5.melody	
ltx/en_us_goadedes/oc.m8.d1:ocVE.Stichera5.mode	@ltx/en_us_goadedes/miscellanea:misc.Mode8
ltx/en_us_goadedes/oc.m8.d1:ocVE.Stichera5.text	We glorify Your resurrection from the dead, through which You freed the human race, the descendants of Adam, from the tyranny of Hades, and as God You gave the world eternal life and the great mercy, O Christ.
ltx/en_us_goadedes/oc.m8.d1:ocVE.Stichera6.incipit	Glory to You, O Savior Christ…
ltx/en_us_goadedes/oc.m8.d1:ocVE.Stichera6.melody	
ltx/en_us_goadedes/oc.m8.d1:ocVE.Stichera6.mode	@ltx/en_us_goadedes/miscellanea:misc.Mode8
ltx/en_us_goadedes/oc.m8.d1:ocVE.Stichera6.text	Glory to You, O Savior Christ, the only-begotten Son of God, for You were nailed to the Cross, and on the third day You rose from the tomb.
ltx/en_us_goadedes/oc.m8.d1:ocVE.Stichera7.incipit	We glorify and worship You…
ltx/en_us_goadedes/oc.m8.d1:ocVE.Stichera7.melody	
ltx/en_us_goadedes/oc.m8.d1:ocVE.Stichera7.mode	@ltx/en_us_goadedes/miscellanea:misc.Mode8
ltx/en_us_goadedes/oc.m8.d1:ocVE.Stichera7.text	We glorify and worship You, almighty Savior, who for us endured the Cross voluntarily. We pray You, do not cast us away from Your presence, but hear us, O benevolent Lord, and save us, through Your resurrection.
