ltx/en_us_goadedes/me.m11.d17:meDA.commemoration.first	
ltx/en_us_goadedes/me.m11.d17:meDA.commemoration.first_name	
ltx/en_us_goadedes/me.m11.d17:meDA.commemoration.first_short	
ltx/en_us_goadedes/me.m11.d17:meDA.commemoration.first_title	@ltx/en_us_goadedes/titles:ti.SaintM
ltx/en_us_goadedes/me.m11.d17:meDA.commemoration.full	
ltx/en_us_goadedes/me.m11.d17:meDA.commemoration.second_name	
ltx/en_us_goadedes/me.m11.d17:meDA.commemoration.second_title	
ltx/en_us_goadedes/me.m11.d17:meDA.date	
ltx/en_us_goadedes/me.m11.d17:meDA.fordate	
ltx/en_us_goadedes/me.m11.d17:meDA.insert1	
ltx/en_us_goadedes/me.m11.d17:meDA.insert2	
ltx/en_us_goadedes/me.m11.d17:meDA.note	
ltx/en_us_goadedes/me.m11.d17:meDA.pdfcoverdate	
ltx/en_us_goadedes/me.m11.d17:meDA.pdfheaderdate	
ltx/en_us_goadedes/me.m11.d17:meHO.commemorations	
ltx/en_us_goadedes/me.m11.d17:meHO.note1	
ltx/en_us_goadedes/me.m11.d17:meHO.note2	
ltx/en_us_goadedes/me.m11.d17:meHO.number	
ltx/en_us_goadedes/me.m11.d17:meHO.rank	
ltx/en_us_goadedes/me.m11.d17:meLE.commemoration1	
ltx/en_us_goadedes/me.m11.d17:meLE.commemoration2	
ltx/en_us_goadedes/me.m11.d17:meLI.Kontakion1.greekmelody	@ltx/en_us_goadedes/me.m11.d17:meMA.Kontakion1.greekmelody
ltx/en_us_goadedes/me.m11.d17:meLI.Kontakion1.incipit	@ltx/en_us_goadedes/me.m11.d17:meMA.Kontakion1.incipit
ltx/en_us_goadedes/me.m11.d17:meLI.Kontakion1.melody	@ltx/en_us_goadedes/me.m11.d17:meMA.Kontakion1.melody
ltx/en_us_goadedes/me.m11.d17:meLI.Kontakion1.mode	@ltx/en_us_goadedes/me.m11.d17:meMA.Kontakion1.mode
ltx/en_us_goadedes/me.m11.d17:meLI.Kontakion1.text	@ltx/en_us_goadedes/me.m11.d17:meMA.Kontakion1.text
ltx/en_us_goadedes/me.m11.d17:meLI.Megalynarion.text	
ltx/en_us_goadedes/me.m11.d17:meMA.AposGlory.incipit	…
ltx/en_us_goadedes/me.m11.d17:meMA.AposGlory.melody	
ltx/en_us_goadedes/me.m11.d17:meMA.AposGlory.mode	@ltx/en_us_goadedes/miscellanea:misc.Mode4
ltx/en_us_goadedes/me.m11.d17:meMA.AposGlory.text	
ltx/en_us_goadedes/me.m11.d17:meMA.AposStavrotheotokion.greekmelody	@ltx/en_us_goadedes/he.a.m4:heAU.EdokasSimeiosin.greekname
ltx/en_us_goadedes/me.m11.d17:meMA.AposStavrotheotokion.incipit	…
ltx/en_us_goadedes/me.m11.d17:meMA.AposStavrotheotokion.melody	@ltx/en_us_goadedes/he.a.m4:heAU.EdokasSimeiosin.name
ltx/en_us_goadedes/me.m11.d17:meMA.AposStavrotheotokion.mode	@ltx/en_us_goadedes/miscellanea:misc.Mode4
ltx/en_us_goadedes/me.m11.d17:meMA.AposStavrotheotokion.text	
ltx/en_us_goadedes/me.m11.d17:meMA.AposTheotokion.incipit	@ltx/en_us_goadedes/oc.m4.d2:ocMA.AposTheotokion.incipit
ltx/en_us_goadedes/me.m11.d17:meMA.AposTheotokion.melody	
ltx/en_us_goadedes/me.m11.d17:meMA.AposTheotokion.mode	@ltx/en_us_goadedes/miscellanea:misc.Mode4
ltx/en_us_goadedes/me.m11.d17:meMA.AposTheotokion.text	@ltx/en_us_goadedes/oc.m4.d2:ocMA.AposTheotokion.text
ltx/en_us_goadedes/me.m11.d17:meMA.C1.acrostic.notice1	
ltx/en_us_goadedes/me.m11.d17:meMA.C1.acrostic.text	
ltx/en_us_goadedes/me.m11.d17:meMA.C1.acrostic.title	
ltx/en_us_goadedes/me.m11.d17:meMA.C1.poet	@ltx/en_us_goadedes/poets:po.Theofanous
ltx/en_us_goadedes/me.m11.d17:meMA.C1.title	@ltx/en_us_goadedes/titles:ti.CanonSaintM
ltx/en_us_goadedes/me.m11.d17:meMA.C1.verse	@ltx/en_us_goadedes/prayers:pr.verse_SaintM.text
ltx/en_us_goadedes/me.m11.d17:meMA.ExapTheotokion.incipit	…
ltx/en_us_goadedes/me.m11.d17:meMA.ExapTheotokion.melody	@ltx/en_us_goadedes/he.a.m2:heAU.TonMathitonOrontonSe.name
ltx/en_us_goadedes/me.m11.d17:meMA.ExapTheotokion.mode	@ltx/en_us_goadedes/miscellanea:misc.Mode2
ltx/en_us_goadedes/me.m11.d17:meMA.ExapTheotokion.text	
ltx/en_us_goadedes/me.m11.d17:meMA.Exaposteilarion1.greekmelody	@ltx/en_us_goadedes/he.a.m2:heAU.TonMathitonOrontonSe.greekname
ltx/en_us_goadedes/me.m11.d17:meMA.Exaposteilarion1.incipit	…
ltx/en_us_goadedes/me.m11.d17:meMA.Exaposteilarion1.melody	@ltx/en_us_goadedes/he.a.m2:heAU.TonMathitonOrontonSe.name
ltx/en_us_goadedes/me.m11.d17:meMA.Exaposteilarion1.mode	@ltx/en_us_goadedes/miscellanea:misc.Mode2
ltx/en_us_goadedes/me.m11.d17:meMA.Exaposteilarion1.text	
ltx/en_us_goadedes/me.m11.d17:meMA.Kontakion1.greekmelody	@ltx/en_us_goadedes/he.a.m2:heAU.TaAnoZiton.greekname
ltx/en_us_goadedes/me.m11.d17:meMA.Kontakion1.incipit	…
ltx/en_us_goadedes/me.m11.d17:meMA.Kontakion1.melody	@ltx/en_us_goadedes/he.a.m2:heAU.TaAnoZiton.name
ltx/en_us_goadedes/me.m11.d17:meMA.Kontakion1.mode	@ltx/en_us_goadedes/miscellanea:misc.Mode2
ltx/en_us_goadedes/me.m11.d17:meMA.Kontakion1.text	
ltx/en_us_goadedes/me.m11.d17:meMA.Lauds1.greekmelody	@ltx/en_us_goadedes/he.a.m5:heAU.ChairoisAskitikon.greekname
ltx/en_us_goadedes/me.m11.d17:meMA.Lauds1.incipit	…
ltx/en_us_goadedes/me.m11.d17:meMA.Lauds1.melody	@ltx/en_us_goadedes/he.a.m5:heAU.ChairoisAskitikon.name
ltx/en_us_goadedes/me.m11.d17:meMA.Lauds1.mode	@ltx/en_us_goadedes/miscellanea:misc.Mode5
ltx/en_us_goadedes/me.m11.d17:meMA.Lauds1.text	
ltx/en_us_goadedes/me.m11.d17:meMA.Lauds2.incipit	…
ltx/en_us_goadedes/me.m11.d17:meMA.Lauds2.melody	@ltx/en_us_goadedes/he.a.m5:heAU.ChairoisAskitikon.name
ltx/en_us_goadedes/me.m11.d17:meMA.Lauds2.mode	@ltx/en_us_goadedes/miscellanea:misc.Mode5
ltx/en_us_goadedes/me.m11.d17:meMA.Lauds2.text	
ltx/en_us_goadedes/me.m11.d17:meMA.Lauds3.incipit	…
ltx/en_us_goadedes/me.m11.d17:meMA.Lauds3.melody	@ltx/en_us_goadedes/he.a.m5:heAU.ChairoisAskitikon.name
ltx/en_us_goadedes/me.m11.d17:meMA.Lauds3.mode	@ltx/en_us_goadedes/miscellanea:misc.Mode5
ltx/en_us_goadedes/me.m11.d17:meMA.Lauds3.text	
ltx/en_us_goadedes/me.m11.d17:meMA.LaudsGlory.incipit	…
ltx/en_us_goadedes/me.m11.d17:meMA.LaudsGlory.melody	
ltx/en_us_goadedes/me.m11.d17:meMA.LaudsGlory.mode	@ltx/en_us_goadedes/miscellanea:misc.Mode8
ltx/en_us_goadedes/me.m11.d17:meMA.LaudsGlory.text	
ltx/en_us_goadedes/me.m11.d17:meMA.LaudsStavrotheotokion.incipit	…
ltx/en_us_goadedes/me.m11.d17:meMA.LaudsStavrotheotokion.melody	
ltx/en_us_goadedes/me.m11.d17:meMA.LaudsStavrotheotokion.mode	@ltx/en_us_goadedes/miscellanea:misc.Mode8
ltx/en_us_goadedes/me.m11.d17:meMA.LaudsStavrotheotokion.text	
ltx/en_us_goadedes/me.m11.d17:meMA.LaudsTheotokion.incipit	@ltx/en_us_goadedes/oc.m8.d3:ocVE.AposTheotokion.incipit
ltx/en_us_goadedes/me.m11.d17:meMA.LaudsTheotokion.melody	
ltx/en_us_goadedes/me.m11.d17:meMA.LaudsTheotokion.mode	@ltx/en_us_goadedes/miscellanea:misc.Mode8
ltx/en_us_goadedes/me.m11.d17:meMA.LaudsTheotokion.text	@ltx/en_us_goadedes/oc.m8.d3:ocVE.AposTheotokion.text
ltx/en_us_goadedes/me.m11.d17:meMA.MM.Lauds1123as5678.text	@ltx/en_us_goadedes/properties:media.key
ltx/en_us_goadedes/me.m11.d17:meMA.Ode1C11.greekmelody	@ltx/en_us_goadedes/he.h.m8:heHE.ArmatilatinFarao.greekname
ltx/en_us_goadedes/me.m11.d17:meMA.Ode1C11.incipit	…
ltx/en_us_goadedes/me.m11.d17:meMA.Ode1C11.melody	@ltx/en_us_goadedes/he.h.m8:heHE.ArmatilatinFarao.name
ltx/en_us_goadedes/me.m11.d17:meMA.Ode1C11.mode	@ltx/en_us_goadedes/miscellanea:misc.Mode8
ltx/en_us_goadedes/me.m11.d17:meMA.Ode1C11.ode	@ltx/en_us_goadedes/miscellanea:misc.Ode1
ltx/en_us_goadedes/me.m11.d17:meMA.Ode1C11.text	
ltx/en_us_goadedes/me.m11.d17:meMA.Ode1C12.incipit	…
ltx/en_us_goadedes/me.m11.d17:meMA.Ode1C12.melody	@ltx/en_us_goadedes/he.h.m8:heHE.ArmatilatinFarao.name
ltx/en_us_goadedes/me.m11.d17:meMA.Ode1C12.mode	@ltx/en_us_goadedes/miscellanea:misc.Mode8
ltx/en_us_goadedes/me.m11.d17:meMA.Ode1C12.ode	@ltx/en_us_goadedes/miscellanea:misc.Ode1
ltx/en_us_goadedes/me.m11.d17:meMA.Ode1C12.text	
ltx/en_us_goadedes/me.m11.d17:meMA.Ode1C13.incipit	…
ltx/en_us_goadedes/me.m11.d17:meMA.Ode1C13.melody	@ltx/en_us_goadedes/he.h.m8:heHE.ArmatilatinFarao.name
ltx/en_us_goadedes/me.m11.d17:meMA.Ode1C13.mode	@ltx/en_us_goadedes/miscellanea:misc.Mode8
ltx/en_us_goadedes/me.m11.d17:meMA.Ode1C13.ode	@ltx/en_us_goadedes/miscellanea:misc.Ode1
ltx/en_us_goadedes/me.m11.d17:meMA.Ode1C13.text	
ltx/en_us_goadedes/me.m11.d17:meMA.Ode1C14.incipit	…
ltx/en_us_goadedes/me.m11.d17:meMA.Ode1C14.melody	@ltx/en_us_goadedes/he.h.m8:heHE.ArmatilatinFarao.name
ltx/en_us_goadedes/me.m11.d17:meMA.Ode1C14.mode	@ltx/en_us_goadedes/miscellanea:misc.Mode8
ltx/en_us_goadedes/me.m11.d17:meMA.Ode1C14.ode	@ltx/en_us_goadedes/miscellanea:misc.Ode1
ltx/en_us_goadedes/me.m11.d17:meMA.Ode1C14.text	
ltx/en_us_goadedes/me.m11.d17:meMA.Ode1C1T.incipit	…
ltx/en_us_goadedes/me.m11.d17:meMA.Ode1C1T.melody	@ltx/en_us_goadedes/he.h.m8:heHE.ArmatilatinFarao.name
ltx/en_us_goadedes/me.m11.d17:meMA.Ode1C1T.mode	@ltx/en_us_goadedes/miscellanea:misc.Mode8
ltx/en_us_goadedes/me.m11.d17:meMA.Ode1C1T.ode	@ltx/en_us_goadedes/miscellanea:misc.Ode1
ltx/en_us_goadedes/me.m11.d17:meMA.Ode1C1T.text	
ltx/en_us_goadedes/me.m11.d17:meMA.Ode3C11.greekmelody	@ltx/en_us_goadedes/he.h.m8:heHE.OStereosasKatArchas.greekname
ltx/en_us_goadedes/me.m11.d17:meMA.Ode3C11.incipit	…
ltx/en_us_goadedes/me.m11.d17:meMA.Ode3C11.melody	@ltx/en_us_goadedes/he.h.m8:heHE.OStereosasKatArchas.name
ltx/en_us_goadedes/me.m11.d17:meMA.Ode3C11.mode	@ltx/en_us_goadedes/miscellanea:misc.Mode8
ltx/en_us_goadedes/me.m11.d17:meMA.Ode3C11.ode	@ltx/en_us_goadedes/miscellanea:misc.Ode3
ltx/en_us_goadedes/me.m11.d17:meMA.Ode3C11.text	
ltx/en_us_goadedes/me.m11.d17:meMA.Ode3C12.incipit	…
ltx/en_us_goadedes/me.m11.d17:meMA.Ode3C12.melody	@ltx/en_us_goadedes/he.h.m8:heHE.OStereosasKatArchas.name
ltx/en_us_goadedes/me.m11.d17:meMA.Ode3C12.mode	@ltx/en_us_goadedes/miscellanea:misc.Mode8
ltx/en_us_goadedes/me.m11.d17:meMA.Ode3C12.ode	@ltx/en_us_goadedes/miscellanea:misc.Ode3
ltx/en_us_goadedes/me.m11.d17:meMA.Ode3C12.text	
ltx/en_us_goadedes/me.m11.d17:meMA.Ode3C13.incipit	…
ltx/en_us_goadedes/me.m11.d17:meMA.Ode3C13.melody	@ltx/en_us_goadedes/he.h.m8:heHE.OStereosasKatArchas.name
ltx/en_us_goadedes/me.m11.d17:meMA.Ode3C13.mode	@ltx/en_us_goadedes/miscellanea:misc.Mode8
ltx/en_us_goadedes/me.m11.d17:meMA.Ode3C13.ode	@ltx/en_us_goadedes/miscellanea:misc.Ode3
ltx/en_us_goadedes/me.m11.d17:meMA.Ode3C13.text	
ltx/en_us_goadedes/me.m11.d17:meMA.Ode3C14.incipit	…
ltx/en_us_goadedes/me.m11.d17:meMA.Ode3C14.melody	@ltx/en_us_goadedes/he.h.m8:heHE.OStereosasKatArchas.name
ltx/en_us_goadedes/me.m11.d17:meMA.Ode3C14.mode	@ltx/en_us_goadedes/miscellanea:misc.Mode8
ltx/en_us_goadedes/me.m11.d17:meMA.Ode3C14.ode	@ltx/en_us_goadedes/miscellanea:misc.Ode3
ltx/en_us_goadedes/me.m11.d17:meMA.Ode3C14.text	
ltx/en_us_goadedes/me.m11.d17:meMA.Ode3C1T.incipit	…
ltx/en_us_goadedes/me.m11.d17:meMA.Ode3C1T.melody	@ltx/en_us_goadedes/he.h.m8:heHE.OStereosasKatArchas.name
ltx/en_us_goadedes/me.m11.d17:meMA.Ode3C1T.mode	@ltx/en_us_goadedes/miscellanea:misc.Mode8
ltx/en_us_goadedes/me.m11.d17:meMA.Ode3C1T.ode	@ltx/en_us_goadedes/miscellanea:misc.Ode3
ltx/en_us_goadedes/me.m11.d17:meMA.Ode3C1T.text	
ltx/en_us_goadedes/me.m11.d17:meMA.Ode3H.greekmelody	@ltx/en_us_goadedes/he.h.m8:heHE.OStereosasKatArchas.greekname
ltx/en_us_goadedes/me.m11.d17:meMA.Ode3H.incipit	@ltx/en_us_goadedes/he.h.m8:heHE.OStereosasKatArchas.incipit
ltx/en_us_goadedes/me.m11.d17:meMA.Ode3H.melody	@ltx/en_us_goadedes/he.h.m8:heHE.OStereosasKatArchas.melody
ltx/en_us_goadedes/me.m11.d17:meMA.Ode3H.mode	@ltx/en_us_goadedes/miscellanea:misc.Mode8
ltx/en_us_goadedes/me.m11.d17:meMA.Ode3H.ode	@ltx/en_us_goadedes/miscellanea:misc.Ode3
ltx/en_us_goadedes/me.m11.d17:meMA.Ode3H.text	@ltx/en_us_goadedes/he.h.m8:heHE.OStereosasKatArchas.text
ltx/en_us_goadedes/me.m11.d17:meMA.Ode3Kathisma1.greekmelody	@ltx/en_us_goadedes/he.a.m3:heAU.TheiasPisteos.greekname
ltx/en_us_goadedes/me.m11.d17:meMA.Ode3Kathisma1.incipit	…
ltx/en_us_goadedes/me.m11.d17:meMA.Ode3Kathisma1.melody	@ltx/en_us_goadedes/he.a.m3:heAU.TheiasPisteos.name
ltx/en_us_goadedes/me.m11.d17:meMA.Ode3Kathisma1.mode	@ltx/en_us_goadedes/miscellanea:misc.Mode3
ltx/en_us_goadedes/me.m11.d17:meMA.Ode3Kathisma1.text	
ltx/en_us_goadedes/me.m11.d17:meMA.Ode3KathismaSt.incipit	@ltx/en_us_goadedes/me.m01.d29:meMA.Ode3KathismaSt.incipit
ltx/en_us_goadedes/me.m11.d17:meMA.Ode3KathismaSt.melody	@ltx/en_us_goadedes/he.a.m3:heAU.TheiasPisteos.name
ltx/en_us_goadedes/me.m11.d17:meMA.Ode3KathismaSt.mode	@ltx/en_us_goadedes/miscellanea:misc.Mode3
ltx/en_us_goadedes/me.m11.d17:meMA.Ode3KathismaSt.text	@ltx/en_us_goadedes/me.m01.d29:meMA.Ode3KathismaSt.text
ltx/en_us_goadedes/me.m11.d17:meMA.Ode3KathismaT.incipit	@ltx/en_us_goadedes/oc.m3.d2:ocMA.Kathisma23.incipit
ltx/en_us_goadedes/me.m11.d17:meMA.Ode3KathismaT.melody	@ltx/en_us_goadedes/he.a.m3:heAU.TheiasPisteos.name
ltx/en_us_goadedes/me.m11.d17:meMA.Ode3KathismaT.mode	@ltx/en_us_goadedes/miscellanea:misc.Mode3
ltx/en_us_goadedes/me.m11.d17:meMA.Ode3KathismaT.text	@ltx/en_us_goadedes/oc.m3.d2:ocMA.Kathisma23.text
ltx/en_us_goadedes/me.m11.d17:meMA.Ode4C11.greekmelody	@ltx/en_us_goadedes/he.h.m8:heHE.SyMouIschys.greekname
ltx/en_us_goadedes/me.m11.d17:meMA.Ode4C11.incipit	…
ltx/en_us_goadedes/me.m11.d17:meMA.Ode4C11.melody	@ltx/en_us_goadedes/he.h.m8:heHE.SyMouIschys.name
ltx/en_us_goadedes/me.m11.d17:meMA.Ode4C11.mode	@ltx/en_us_goadedes/miscellanea:misc.Mode4
ltx/en_us_goadedes/me.m11.d17:meMA.Ode4C11.ode	@ltx/en_us_goadedes/miscellanea:misc.Ode8
ltx/en_us_goadedes/me.m11.d17:meMA.Ode4C11.text	
ltx/en_us_goadedes/me.m11.d17:meMA.Ode4C12.incipit	…
ltx/en_us_goadedes/me.m11.d17:meMA.Ode4C12.melody	@ltx/en_us_goadedes/he.h.m8:heHE.SyMouIschys.name
ltx/en_us_goadedes/me.m11.d17:meMA.Ode4C12.mode	@ltx/en_us_goadedes/miscellanea:misc.Mode4
ltx/en_us_goadedes/me.m11.d17:meMA.Ode4C12.ode	@ltx/en_us_goadedes/miscellanea:misc.Ode8
ltx/en_us_goadedes/me.m11.d17:meMA.Ode4C12.text	
ltx/en_us_goadedes/me.m11.d17:meMA.Ode4C13.incipit	…
ltx/en_us_goadedes/me.m11.d17:meMA.Ode4C13.melody	@ltx/en_us_goadedes/he.h.m8:heHE.SyMouIschys.name
ltx/en_us_goadedes/me.m11.d17:meMA.Ode4C13.mode	@ltx/en_us_goadedes/miscellanea:misc.Mode8
ltx/en_us_goadedes/me.m11.d17:meMA.Ode4C13.ode	@ltx/en_us_goadedes/miscellanea:misc.Ode4
ltx/en_us_goadedes/me.m11.d17:meMA.Ode4C13.text	
ltx/en_us_goadedes/me.m11.d17:meMA.Ode4C14.incipit	…
ltx/en_us_goadedes/me.m11.d17:meMA.Ode4C14.melody	@ltx/en_us_goadedes/he.h.m8:heHE.SyMouIschys.name
ltx/en_us_goadedes/me.m11.d17:meMA.Ode4C14.mode	@ltx/en_us_goadedes/miscellanea:misc.Mode8
ltx/en_us_goadedes/me.m11.d17:meMA.Ode4C14.ode	@ltx/en_us_goadedes/miscellanea:misc.Ode4
ltx/en_us_goadedes/me.m11.d17:meMA.Ode4C14.text	
ltx/en_us_goadedes/me.m11.d17:meMA.Ode4C1T.incipit	…
ltx/en_us_goadedes/me.m11.d17:meMA.Ode4C1T.melody	@ltx/en_us_goadedes/he.h.m8:heHE.SyMouIschys.name
ltx/en_us_goadedes/me.m11.d17:meMA.Ode4C1T.mode	@ltx/en_us_goadedes/miscellanea:misc.Mode8
ltx/en_us_goadedes/me.m11.d17:meMA.Ode4C1T.ode	@ltx/en_us_goadedes/miscellanea:misc.Ode4
ltx/en_us_goadedes/me.m11.d17:meMA.Ode4C1T.text	
ltx/en_us_goadedes/me.m11.d17:meMA.Ode5C11.greekmelody	@ltx/en_us_goadedes/he.h.m8:heHE.InaTiMeAposo.greekname
ltx/en_us_goadedes/me.m11.d17:meMA.Ode5C11.incipit	…
ltx/en_us_goadedes/me.m11.d17:meMA.Ode5C11.melody	@ltx/en_us_goadedes/he.h.m8:heHE.InaTiMeAposo.name
ltx/en_us_goadedes/me.m11.d17:meMA.Ode5C11.mode	@ltx/en_us_goadedes/miscellanea:misc.Mode8
ltx/en_us_goadedes/me.m11.d17:meMA.Ode5C11.ode	@ltx/en_us_goadedes/miscellanea:misc.Ode5
ltx/en_us_goadedes/me.m11.d17:meMA.Ode5C11.text	
ltx/en_us_goadedes/me.m11.d17:meMA.Ode5C12.incipit	…
ltx/en_us_goadedes/me.m11.d17:meMA.Ode5C12.melody	@ltx/en_us_goadedes/he.h.m8:heHE.InaTiMeAposo.name
ltx/en_us_goadedes/me.m11.d17:meMA.Ode5C12.mode	@ltx/en_us_goadedes/miscellanea:misc.Mode8
ltx/en_us_goadedes/me.m11.d17:meMA.Ode5C12.ode	@ltx/en_us_goadedes/miscellanea:misc.Ode5
ltx/en_us_goadedes/me.m11.d17:meMA.Ode5C12.text	
ltx/en_us_goadedes/me.m11.d17:meMA.Ode5C13.incipit	…
ltx/en_us_goadedes/me.m11.d17:meMA.Ode5C13.melody	@ltx/en_us_goadedes/he.h.m8:heHE.InaTiMeAposo.name
ltx/en_us_goadedes/me.m11.d17:meMA.Ode5C13.mode	@ltx/en_us_goadedes/miscellanea:misc.Mode8
ltx/en_us_goadedes/me.m11.d17:meMA.Ode5C13.ode	@ltx/en_us_goadedes/miscellanea:misc.Ode5
ltx/en_us_goadedes/me.m11.d17:meMA.Ode5C13.text	
ltx/en_us_goadedes/me.m11.d17:meMA.Ode5C14.incipit	…
ltx/en_us_goadedes/me.m11.d17:meMA.Ode5C14.melody	@ltx/en_us_goadedes/he.h.m8:heHE.InaTiMeAposo.name
ltx/en_us_goadedes/me.m11.d17:meMA.Ode5C14.mode	@ltx/en_us_goadedes/miscellanea:misc.Mode8
ltx/en_us_goadedes/me.m11.d17:meMA.Ode5C14.ode	@ltx/en_us_goadedes/miscellanea:misc.Ode5
ltx/en_us_goadedes/me.m11.d17:meMA.Ode5C14.text	
ltx/en_us_goadedes/me.m11.d17:meMA.Ode5C1T.incipit	…
ltx/en_us_goadedes/me.m11.d17:meMA.Ode5C1T.melody	@ltx/en_us_goadedes/he.h.m8:heHE.InaTiMeAposo.name
ltx/en_us_goadedes/me.m11.d17:meMA.Ode5C1T.mode	@ltx/en_us_goadedes/miscellanea:misc.Mode8
ltx/en_us_goadedes/me.m11.d17:meMA.Ode5C1T.ode	@ltx/en_us_goadedes/miscellanea:misc.Ode5
ltx/en_us_goadedes/me.m11.d17:meMA.Ode5C1T.text	
ltx/en_us_goadedes/me.m11.d17:meMA.Ode6C11.greekmelody	@ltx/en_us_goadedes/he.h.m8:heHE.IlasthitiMoiSotir.greekname
ltx/en_us_goadedes/me.m11.d17:meMA.Ode6C11.incipit	…
ltx/en_us_goadedes/me.m11.d17:meMA.Ode6C11.melody	@ltx/en_us_goadedes/he.h.m8:heHE.IlasthitiMoiSotir.name
ltx/en_us_goadedes/me.m11.d17:meMA.Ode6C11.mode	@ltx/en_us_goadedes/miscellanea:misc.Mode8
ltx/en_us_goadedes/me.m11.d17:meMA.Ode6C11.ode	@ltx/en_us_goadedes/miscellanea:misc.Ode6
ltx/en_us_goadedes/me.m11.d17:meMA.Ode6C11.text	
ltx/en_us_goadedes/me.m11.d17:meMA.Ode6C12.incipit	…
ltx/en_us_goadedes/me.m11.d17:meMA.Ode6C12.melody	@ltx/en_us_goadedes/he.h.m8:heHE.IlasthitiMoiSotir.name
ltx/en_us_goadedes/me.m11.d17:meMA.Ode6C12.mode	@ltx/en_us_goadedes/miscellanea:misc.Mode8
ltx/en_us_goadedes/me.m11.d17:meMA.Ode6C12.ode	@ltx/en_us_goadedes/miscellanea:misc.Ode6
ltx/en_us_goadedes/me.m11.d17:meMA.Ode6C12.text	
ltx/en_us_goadedes/me.m11.d17:meMA.Ode6C13.incipit	…
ltx/en_us_goadedes/me.m11.d17:meMA.Ode6C13.melody	@ltx/en_us_goadedes/he.h.m8:heHE.IlasthitiMoiSotir.name
ltx/en_us_goadedes/me.m11.d17:meMA.Ode6C13.mode	@ltx/en_us_goadedes/miscellanea:misc.Mode8
ltx/en_us_goadedes/me.m11.d17:meMA.Ode6C13.ode	@ltx/en_us_goadedes/miscellanea:misc.Ode6
ltx/en_us_goadedes/me.m11.d17:meMA.Ode6C13.text	
ltx/en_us_goadedes/me.m11.d17:meMA.Ode6C1T.incipit	…
ltx/en_us_goadedes/me.m11.d17:meMA.Ode6C1T.melody	@ltx/en_us_goadedes/he.h.m8:heHE.IlasthitiMoiSotir.name
ltx/en_us_goadedes/me.m11.d17:meMA.Ode6C1T.mode	@ltx/en_us_goadedes/miscellanea:misc.Mode8
ltx/en_us_goadedes/me.m11.d17:meMA.Ode6C1T.ode	@ltx/en_us_goadedes/miscellanea:misc.Ode6
ltx/en_us_goadedes/me.m11.d17:meMA.Ode6C1T.text	
ltx/en_us_goadedes/me.m11.d17:meMA.Ode6H.greekmelody	@ltx/en_us_goadedes/he.h.m8:heHE.IlasthitiMoiSotir.greekname
ltx/en_us_goadedes/me.m11.d17:meMA.Ode6H.incipit	@ltx/en_us_goadedes/he.h.m8:heHE.IlasthitiMoiSotir.incipit
ltx/en_us_goadedes/me.m11.d17:meMA.Ode6H.melody	@ltx/en_us_goadedes/he.h.m8:heHE.IlasthitiMoiSotir.melody
ltx/en_us_goadedes/me.m11.d17:meMA.Ode6H.mode	@ltx/en_us_goadedes/miscellanea:misc.Mode8
ltx/en_us_goadedes/me.m11.d17:meMA.Ode6H.ode	@ltx/en_us_goadedes/miscellanea:misc.Ode6
ltx/en_us_goadedes/me.m11.d17:meMA.Ode6H.text	@ltx/en_us_goadedes/he.h.m8:heHE.IlasthitiMoiSotir.text
ltx/en_us_goadedes/me.m11.d17:meMA.Ode7C11.greekmelody	@ltx/en_us_goadedes/he.h.m8:heHE.TheouSynkatavasin.greekname
ltx/en_us_goadedes/me.m11.d17:meMA.Ode7C11.incipit	…
ltx/en_us_goadedes/me.m11.d17:meMA.Ode7C11.melody	@ltx/en_us_goadedes/he.h.m8:heHE.TheouSynkatavasin.name
ltx/en_us_goadedes/me.m11.d17:meMA.Ode7C11.mode	@ltx/en_us_goadedes/miscellanea:misc.Mode8
ltx/en_us_goadedes/me.m11.d17:meMA.Ode7C11.ode	@ltx/en_us_goadedes/miscellanea:misc.Ode7
ltx/en_us_goadedes/me.m11.d17:meMA.Ode7C11.text	
ltx/en_us_goadedes/me.m11.d17:meMA.Ode7C12.incipit	…
ltx/en_us_goadedes/me.m11.d17:meMA.Ode7C12.melody	@ltx/en_us_goadedes/he.h.m8:heHE.TheouSynkatavasin.name
ltx/en_us_goadedes/me.m11.d17:meMA.Ode7C12.mode	@ltx/en_us_goadedes/miscellanea:misc.Mode8
ltx/en_us_goadedes/me.m11.d17:meMA.Ode7C12.ode	@ltx/en_us_goadedes/miscellanea:misc.Ode7
ltx/en_us_goadedes/me.m11.d17:meMA.Ode7C12.text	
ltx/en_us_goadedes/me.m11.d17:meMA.Ode7C13.incipit	…
ltx/en_us_goadedes/me.m11.d17:meMA.Ode7C13.melody	@ltx/en_us_goadedes/he.h.m8:heHE.TheouSynkatavasin.name
ltx/en_us_goadedes/me.m11.d17:meMA.Ode7C13.mode	@ltx/en_us_goadedes/miscellanea:misc.Mode8
ltx/en_us_goadedes/me.m11.d17:meMA.Ode7C13.ode	@ltx/en_us_goadedes/miscellanea:misc.Ode7
ltx/en_us_goadedes/me.m11.d17:meMA.Ode7C13.text	
ltx/en_us_goadedes/me.m11.d17:meMA.Ode7C1T.incipit	…
ltx/en_us_goadedes/me.m11.d17:meMA.Ode7C1T.melody	@ltx/en_us_goadedes/he.h.m8:heHE.TheouSynkatavasin.name
ltx/en_us_goadedes/me.m11.d17:meMA.Ode7C1T.mode	@ltx/en_us_goadedes/miscellanea:misc.Mode8
ltx/en_us_goadedes/me.m11.d17:meMA.Ode7C1T.ode	@ltx/en_us_goadedes/miscellanea:misc.Ode7
ltx/en_us_goadedes/me.m11.d17:meMA.Ode7C1T.text	
ltx/en_us_goadedes/me.m11.d17:meMA.Ode8C11.greekmelody	@ltx/en_us_goadedes/he.h.m8:heHE.EptaplasiosKaminon.greekname
ltx/en_us_goadedes/me.m11.d17:meMA.Ode8C11.incipit	…
ltx/en_us_goadedes/me.m11.d17:meMA.Ode8C11.melody	@ltx/en_us_goadedes/he.h.m8:heHE.EptaplasiosKaminon.name
ltx/en_us_goadedes/me.m11.d17:meMA.Ode8C11.mode	@ltx/en_us_goadedes/miscellanea:misc.Mode8
ltx/en_us_goadedes/me.m11.d17:meMA.Ode8C11.ode	@ltx/en_us_goadedes/miscellanea:misc.Ode8
ltx/en_us_goadedes/me.m11.d17:meMA.Ode8C11.text	
ltx/en_us_goadedes/me.m11.d17:meMA.Ode8C12.incipit	…
ltx/en_us_goadedes/me.m11.d17:meMA.Ode8C12.melody	@ltx/en_us_goadedes/he.h.m8:heHE.EptaplasiosKaminon.name
ltx/en_us_goadedes/me.m11.d17:meMA.Ode8C12.mode	@ltx/en_us_goadedes/miscellanea:misc.Mode8
ltx/en_us_goadedes/me.m11.d17:meMA.Ode8C12.ode	@ltx/en_us_goadedes/miscellanea:misc.Ode8
ltx/en_us_goadedes/me.m11.d17:meMA.Ode8C12.text	
ltx/en_us_goadedes/me.m11.d17:meMA.Ode8C13.incipit	…
ltx/en_us_goadedes/me.m11.d17:meMA.Ode8C13.melody	@ltx/en_us_goadedes/he.h.m8:heHE.EptaplasiosKaminon.name
ltx/en_us_goadedes/me.m11.d17:meMA.Ode8C13.mode	@ltx/en_us_goadedes/miscellanea:misc.Mode8
ltx/en_us_goadedes/me.m11.d17:meMA.Ode8C13.ode	@ltx/en_us_goadedes/miscellanea:misc.Ode8
ltx/en_us_goadedes/me.m11.d17:meMA.Ode8C13.text	
ltx/en_us_goadedes/me.m11.d17:meMA.Ode8C1T.incipit	…
ltx/en_us_goadedes/me.m11.d17:meMA.Ode8C1T.melody	@ltx/en_us_goadedes/he.h.m8:heHE.EptaplasiosKaminon.name
ltx/en_us_goadedes/me.m11.d17:meMA.Ode8C1T.mode	@ltx/en_us_goadedes/miscellanea:misc.Mode8
ltx/en_us_goadedes/me.m11.d17:meMA.Ode8C1T.ode	@ltx/en_us_goadedes/miscellanea:misc.Ode8
ltx/en_us_goadedes/me.m11.d17:meMA.Ode8C1T.text	
ltx/en_us_goadedes/me.m11.d17:meMA.Ode8H.greekmelody	@ltx/en_us_goadedes/he.h.m8:heHE.EptaplasiosKaminon.greekname
ltx/en_us_goadedes/me.m11.d17:meMA.Ode8H.incipit	@ltx/en_us_goadedes/he.h.m8:heHE.EptaplasiosKaminon.incipit
ltx/en_us_goadedes/me.m11.d17:meMA.Ode8H.melody	@ltx/en_us_goadedes/he.h.m8:heHE.EptaplasiosKaminon.melody
ltx/en_us_goadedes/me.m11.d17:meMA.Ode8H.mode	@ltx/en_us_goadedes/miscellanea:misc.Mode8
ltx/en_us_goadedes/me.m11.d17:meMA.Ode8H.ode	@ltx/en_us_goadedes/miscellanea:misc.Ode8
ltx/en_us_goadedes/me.m11.d17:meMA.Ode8H.text	@ltx/en_us_goadedes/he.h.m8:heHE.EptaplasiosKaminon.text
ltx/en_us_goadedes/me.m11.d17:meMA.Ode9C11.greekmelody	@ltx/en_us_goadedes/he.h.m8:heHE.ExestiEpiTouto.greekname
ltx/en_us_goadedes/me.m11.d17:meMA.Ode9C11.incipit	…
ltx/en_us_goadedes/me.m11.d17:meMA.Ode9C11.melody	@ltx/en_us_goadedes/he.h.m8:heHE.ExestiEpiTouto.name
ltx/en_us_goadedes/me.m11.d17:meMA.Ode9C11.mode	@ltx/en_us_goadedes/miscellanea:misc.Mode8
ltx/en_us_goadedes/me.m11.d17:meMA.Ode9C11.ode	@ltx/en_us_goadedes/miscellanea:misc.Ode9
ltx/en_us_goadedes/me.m11.d17:meMA.Ode9C11.text	
ltx/en_us_goadedes/me.m11.d17:meMA.Ode9C12.incipit	…
ltx/en_us_goadedes/me.m11.d17:meMA.Ode9C12.melody	@ltx/en_us_goadedes/he.h.m8:heHE.ExestiEpiTouto.name
ltx/en_us_goadedes/me.m11.d17:meMA.Ode9C12.mode	@ltx/en_us_goadedes/miscellanea:misc.Mode8
ltx/en_us_goadedes/me.m11.d17:meMA.Ode9C12.ode	@ltx/en_us_goadedes/miscellanea:misc.Ode9
ltx/en_us_goadedes/me.m11.d17:meMA.Ode9C12.text	
ltx/en_us_goadedes/me.m11.d17:meMA.Ode9C13.incipit	…
ltx/en_us_goadedes/me.m11.d17:meMA.Ode9C13.melody	@ltx/en_us_goadedes/he.h.m8:heHE.ExestiEpiTouto.name
ltx/en_us_goadedes/me.m11.d17:meMA.Ode9C13.mode	@ltx/en_us_goadedes/miscellanea:misc.Mode8
ltx/en_us_goadedes/me.m11.d17:meMA.Ode9C13.ode	@ltx/en_us_goadedes/miscellanea:misc.Ode9
ltx/en_us_goadedes/me.m11.d17:meMA.Ode9C13.text	
ltx/en_us_goadedes/me.m11.d17:meMA.Ode9C1T.incipit	…
ltx/en_us_goadedes/me.m11.d17:meMA.Ode9C1T.melody	@ltx/en_us_goadedes/he.h.m8:heHE.ExestiEpiTouto.name
ltx/en_us_goadedes/me.m11.d17:meMA.Ode9C1T.mode	@ltx/en_us_goadedes/miscellanea:misc.Mode8
ltx/en_us_goadedes/me.m11.d17:meMA.Ode9C1T.ode	@ltx/en_us_goadedes/miscellanea:misc.Ode9
ltx/en_us_goadedes/me.m11.d17:meMA.Ode9C1T.text	
ltx/en_us_goadedes/me.m11.d17:meMA.Ode9H.greekmelody	@ltx/en_us_goadedes/he.h.m8:heHE.ExestiEpiTouto.greekname
ltx/en_us_goadedes/me.m11.d17:meMA.Ode9H.incipit	@ltx/en_us_goadedes/he.h.m8:heHE.ExestiEpiTouto.incipit
ltx/en_us_goadedes/me.m11.d17:meMA.Ode9H.melody	@ltx/en_us_goadedes/he.h.m8:heHE.ExestiEpiTouto.melody
ltx/en_us_goadedes/me.m11.d17:meMA.Ode9H.mode	@ltx/en_us_goadedes/miscellanea:misc.Mode8
ltx/en_us_goadedes/me.m11.d17:meMA.Ode9H.ode	@ltx/en_us_goadedes/miscellanea:misc.Ode9
ltx/en_us_goadedes/me.m11.d17:meMA.Ode9H.text	@ltx/en_us_goadedes/he.h.m8:heHE.ExestiEpiTouto.text
ltx/en_us_goadedes/me.m11.d17:meMA.Oikos1.text	
ltx/en_us_goadedes/me.m11.d17:meVE.Apolytikion1.incipit	…
ltx/en_us_goadedes/me.m11.d17:meVE.Apolytikion1.melody	
ltx/en_us_goadedes/me.m11.d17:meVE.Apolytikion1.mode	@ltx/en_us_goadedes/miscellanea:misc.Mode8
ltx/en_us_goadedes/me.m11.d17:meVE.Apolytikion1.text	
ltx/en_us_goadedes/me.m11.d17:meVE.AposGlory.incipit	…
ltx/en_us_goadedes/me.m11.d17:meVE.AposGlory.melody	
ltx/en_us_goadedes/me.m11.d17:meVE.AposGlory.mode	@ltx/en_us_goadedes/miscellanea:misc.Mode6
ltx/en_us_goadedes/me.m11.d17:meVE.AposGlory.text	
ltx/en_us_goadedes/me.m11.d17:meVE.AposStavrotheotokion.greekmelody	@ltx/en_us_goadedes/he.a.m6:heAU.TriimerosAnestis.greekname
ltx/en_us_goadedes/me.m11.d17:meVE.AposStavrotheotokion.incipit	@ltx/en_us_goadedes/oc.m6.d4:ocVE.AposTheotokion.incipit
ltx/en_us_goadedes/me.m11.d17:meVE.AposStavrotheotokion.melody	@ltx/en_us_goadedes/he.a.m6:heAU.TriimerosAnestis.name
ltx/en_us_goadedes/me.m11.d17:meVE.AposStavrotheotokion.mode	@ltx/en_us_goadedes/miscellanea:misc.Mode6
ltx/en_us_goadedes/me.m11.d17:meVE.AposStavrotheotokion.text	@ltx/en_us_goadedes/oc.m6.d4:ocVE.AposTheotokion.text
ltx/en_us_goadedes/me.m11.d17:meVE.AposTheotokion.incipit	…
ltx/en_us_goadedes/me.m11.d17:meVE.AposTheotokion.melody	
ltx/en_us_goadedes/me.m11.d17:meVE.AposTheotokion.mode	@ltx/en_us_goadedes/miscellanea:misc.Mode6
ltx/en_us_goadedes/me.m11.d17:meVE.AposTheotokion.text	
ltx/en_us_goadedes/me.m11.d17:meVE.SticGlory.incipit	…
ltx/en_us_goadedes/me.m11.d17:meVE.SticGlory.melody	
ltx/en_us_goadedes/me.m11.d17:meVE.SticGlory.mode	@ltx/en_us_goadedes/miscellanea:misc.Mode6
ltx/en_us_goadedes/me.m11.d17:meVE.SticGlory.text	
ltx/en_us_goadedes/me.m11.d17:meVE.SticStavrotheotokion.greekmelody	@ltx/en_us_goadedes/he.a.m6:heAU.OlinApothemenoi.greekname
ltx/en_us_goadedes/me.m11.d17:meVE.SticStavrotheotokion.incipit	…
ltx/en_us_goadedes/me.m11.d17:meVE.SticStavrotheotokion.melody	@ltx/en_us_goadedes/he.a.m6:heAU.OlinApothemenoi.name
ltx/en_us_goadedes/me.m11.d17:meVE.SticStavrotheotokion.mode	@ltx/en_us_goadedes/miscellanea:misc.Mode6
ltx/en_us_goadedes/me.m11.d17:meVE.SticStavrotheotokion.text	
ltx/en_us_goadedes/me.m11.d17:meVE.SticTheotokion.greekmelody	@ltx/en_us_goadedes/he.a.m6:heAU.OlinApothemenoi.greekname
ltx/en_us_goadedes/me.m11.d17:meVE.SticTheotokion.incipit	@ltx/en_us_goadedes/me.m01.d16:meVE.AposTheotokion.incipit
ltx/en_us_goadedes/me.m11.d17:meVE.SticTheotokion.melody	@ltx/en_us_goadedes/he.a.m6:heAU.OlinApothemenoi.name
ltx/en_us_goadedes/me.m11.d17:meVE.SticTheotokion.mode	@ltx/en_us_goadedes/miscellanea:misc.Mode6
ltx/en_us_goadedes/me.m11.d17:meVE.SticTheotokion.text	@ltx/en_us_goadedes/me.m01.d16:meVE.AposTheotokion.text
ltx/en_us_goadedes/me.m11.d17:meVE.Stichera01.greekmelody	@ltx/en_us_goadedes/he.a.m8:heAU.TiYmasKalesomen.greekname
ltx/en_us_goadedes/me.m11.d17:meVE.Stichera01.incipit	…
ltx/en_us_goadedes/me.m11.d17:meVE.Stichera01.melody	@ltx/en_us_goadedes/he.a.m8:heAU.TiYmasKalesomen.name
ltx/en_us_goadedes/me.m11.d17:meVE.Stichera01.mode	@ltx/en_us_goadedes/miscellanea:misc.Mode8
ltx/en_us_goadedes/me.m11.d17:meVE.Stichera01.text	
ltx/en_us_goadedes/me.m11.d17:meVE.Stichera02.incipit	…
ltx/en_us_goadedes/me.m11.d17:meVE.Stichera02.melody	@ltx/en_us_goadedes/he.a.m8:heAU.TiYmasKalesomen.name
ltx/en_us_goadedes/me.m11.d17:meVE.Stichera02.mode	@ltx/en_us_goadedes/miscellanea:misc.Mode8
ltx/en_us_goadedes/me.m11.d17:meVE.Stichera02.text	
ltx/en_us_goadedes/me.m11.d17:meVE.Stichera03.incipit	…
ltx/en_us_goadedes/me.m11.d17:meVE.Stichera03.melody	@ltx/en_us_goadedes/he.a.m8:heAU.TiYmasKalesomen.name
ltx/en_us_goadedes/me.m11.d17:meVE.Stichera03.mode	@ltx/en_us_goadedes/miscellanea:misc.Mode8
ltx/en_us_goadedes/me.m11.d17:meVE.Stichera03.text	
