ltx/en_us_goadedes/oc.m2.d4:ocBK.ModeNaked	@ltx/en_us_goadedes/miscellanea:misc.Mode2.naked
ltx/en_us_goadedes/oc.m2.d4:ocLI.Beatitudes1.incipit	@ltx/en_us_goadedes/oc.m2.d1:ocLI.Beatitudes1.incipit
ltx/en_us_goadedes/oc.m2.d4:ocLI.Beatitudes1.melody	@ltx/en_us_goadedes/he.h.m2:heHE.SyToLogoSouKyrie.name
ltx/en_us_goadedes/oc.m2.d4:ocLI.Beatitudes1.mode	@ltx/en_us_goadedes/miscellanea:misc.Mode2
ltx/en_us_goadedes/oc.m2.d4:ocLI.Beatitudes1.text	@ltx/en_us_goadedes/oc.m2.d1:ocLI.Beatitudes1.text
ltx/en_us_goadedes/oc.m2.d4:ocLI.Beatitudes2.incipit	…
ltx/en_us_goadedes/oc.m2.d4:ocLI.Beatitudes2.melody	@ltx/en_us_goadedes/he.h.m2:heHE.SyToLogoSouKyrie.name
ltx/en_us_goadedes/oc.m2.d4:ocLI.Beatitudes2.mode	@ltx/en_us_goadedes/miscellanea:misc.Mode2
ltx/en_us_goadedes/oc.m2.d4:ocLI.Beatitudes2.text	
ltx/en_us_goadedes/oc.m2.d4:ocLI.Beatitudes3.incipit	…
ltx/en_us_goadedes/oc.m2.d4:ocLI.Beatitudes3.melody	@ltx/en_us_goadedes/he.h.m2:heHE.SyToLogoSouKyrie.name
ltx/en_us_goadedes/oc.m2.d4:ocLI.Beatitudes3.mode	@ltx/en_us_goadedes/miscellanea:misc.Mode2
ltx/en_us_goadedes/oc.m2.d4:ocLI.Beatitudes3.text	
ltx/en_us_goadedes/oc.m2.d4:ocLI.Beatitudes4.incipit	…
ltx/en_us_goadedes/oc.m2.d4:ocLI.Beatitudes4.melody	@ltx/en_us_goadedes/he.h.m2:heHE.SyToLogoSouKyrie.name
ltx/en_us_goadedes/oc.m2.d4:ocLI.Beatitudes4.mode	@ltx/en_us_goadedes/miscellanea:misc.Mode2
ltx/en_us_goadedes/oc.m2.d4:ocLI.Beatitudes4.text	
ltx/en_us_goadedes/oc.m2.d4:ocLI.BeatitudesT.incipit	…
ltx/en_us_goadedes/oc.m2.d4:ocLI.BeatitudesT.melody	@ltx/en_us_goadedes/he.h.m2:heHE.SyToLogoSouKyrie.name
ltx/en_us_goadedes/oc.m2.d4:ocLI.BeatitudesT.mode	@ltx/en_us_goadedes/miscellanea:misc.Mode2
ltx/en_us_goadedes/oc.m2.d4:ocLI.BeatitudesT.text	
ltx/en_us_goadedes/oc.m2.d4:ocLI.BeatitudesTr.incipit	…
ltx/en_us_goadedes/oc.m2.d4:ocLI.BeatitudesTr.melody	@ltx/en_us_goadedes/he.h.m2:heHE.SyToLogoSouKyrie.name
ltx/en_us_goadedes/oc.m2.d4:ocLI.BeatitudesTr.mode	@ltx/en_us_goadedes/miscellanea:misc.Mode2
ltx/en_us_goadedes/oc.m2.d4:ocLI.BeatitudesTr.text	
ltx/en_us_goadedes/oc.m2.d4:ocLI.MM.Beatitudes1234TrTas78910GB.text	@ltx/en_us_goadedes/properties:media.key
ltx/en_us_goadedes/oc.m2.d4:ocMA.ApolTheotokion.incipit	@ltx/en_us_goadedes/oc.m2.d2:ocMA.Kathisma23.incipit
ltx/en_us_goadedes/oc.m2.d4:ocMA.ApolTheotokion.melody	
ltx/en_us_goadedes/oc.m2.d4:ocMA.ApolTheotokion.mode	@ltx/en_us_goadedes/miscellanea:misc.Mode2
ltx/en_us_goadedes/oc.m2.d4:ocMA.ApolTheotokion.text	@ltx/en_us_goadedes/oc.m2.d2:ocMA.Kathisma23.text
ltx/en_us_goadedes/oc.m2.d4:ocMA.AposTheotokion.greekmelody	@ltx/en_us_goadedes/he.a.m2:heAU.OteEkTouXylou.greekname
ltx/en_us_goadedes/oc.m2.d4:ocMA.AposTheotokion.incipit	Savior, when those men…
ltx/en_us_goadedes/oc.m2.d4:ocMA.AposTheotokion.melody	@ltx/en_us_goadedes/he.a.m2:heAU.OteEkTouXylou.name
ltx/en_us_goadedes/oc.m2.d4:ocMA.AposTheotokion.mode	@ltx/en_us_goadedes/miscellanea:misc.Mode2
ltx/en_us_goadedes/oc.m2.d4:ocMA.AposTheotokion.text	Savior, when those men unlawfully * hung You on a cross as a convict, being the life of all, * Your all-blameless, pure, and holy Mother stood nearby. * As she looked at You, she cried out, * lamenting and weeping, * “Woe is me, O sweetest Child of mine, the light of my eyes! * You who hung the earth in the waters, * how can You endure crucifixion, * nailed onto a cross between two criminals?”
ltx/en_us_goadedes/oc.m2.d4:ocMA.Aposticha1.incipit	…
ltx/en_us_goadedes/oc.m2.d4:ocMA.Aposticha1.melody	
ltx/en_us_goadedes/oc.m2.d4:ocMA.Aposticha1.mode	@ltx/en_us_goadedes/miscellanea:misc.Mode2
ltx/en_us_goadedes/oc.m2.d4:ocMA.Aposticha1.text	
ltx/en_us_goadedes/oc.m2.d4:ocMA.Aposticha2.incipit	…
ltx/en_us_goadedes/oc.m2.d4:ocMA.Aposticha2.melody	
ltx/en_us_goadedes/oc.m2.d4:ocMA.Aposticha2.mode	@ltx/en_us_goadedes/miscellanea:misc.Mode2
ltx/en_us_goadedes/oc.m2.d4:ocMA.Aposticha2.text	
ltx/en_us_goadedes/oc.m2.d4:ocMA.Aposticha3.incipit	…
ltx/en_us_goadedes/oc.m2.d4:ocMA.Aposticha3.melody	
ltx/en_us_goadedes/oc.m2.d4:ocMA.Aposticha3.mode	@ltx/en_us_goadedes/miscellanea:misc.Mode2
ltx/en_us_goadedes/oc.m2.d4:ocMA.Aposticha3.text	
ltx/en_us_goadedes/oc.m2.d4:ocMA.C1.acrostic.notice1	
ltx/en_us_goadedes/oc.m2.d4:ocMA.C1.acrostic.text	
ltx/en_us_goadedes/oc.m2.d4:ocMA.C1.acrostic.title	Canon for the Cross.
ltx/en_us_goadedes/oc.m2.d4:ocMA.C2.acrostic.notice1	
ltx/en_us_goadedes/oc.m2.d4:ocMA.C2.acrostic.title	Canon for the Theotokos.
ltx/en_us_goadedes/oc.m2.d4:ocMA.C2.poet	@ltx/en_us_goadedes/poets:po.IoannouEfchaiton
ltx/en_us_goadedes/oc.m2.d4:ocMA.CA.notice	
ltx/en_us_goadedes/oc.m2.d4:ocMA.Kathisma11.incipit	…
ltx/en_us_goadedes/oc.m2.d4:ocMA.Kathisma11.melody	
ltx/en_us_goadedes/oc.m2.d4:ocMA.Kathisma11.mode	@ltx/en_us_goadedes/miscellanea:misc.Mode2
ltx/en_us_goadedes/oc.m2.d4:ocMA.Kathisma11.text	
ltx/en_us_goadedes/oc.m2.d4:ocMA.Kathisma12.incipit	…
ltx/en_us_goadedes/oc.m2.d4:ocMA.Kathisma12.melody	
ltx/en_us_goadedes/oc.m2.d4:ocMA.Kathisma12.mode	@ltx/en_us_goadedes/miscellanea:misc.Mode2
ltx/en_us_goadedes/oc.m2.d4:ocMA.Kathisma12.text	
ltx/en_us_goadedes/oc.m2.d4:ocMA.Kathisma13.incipit	…
ltx/en_us_goadedes/oc.m2.d4:ocMA.Kathisma13.melody	
ltx/en_us_goadedes/oc.m2.d4:ocMA.Kathisma13.mode	@ltx/en_us_goadedes/miscellanea:misc.Mode2
ltx/en_us_goadedes/oc.m2.d4:ocMA.Kathisma13.text	
ltx/en_us_goadedes/oc.m2.d4:ocMA.Kathisma21.incipit	…
ltx/en_us_goadedes/oc.m2.d4:ocMA.Kathisma21.melody	
ltx/en_us_goadedes/oc.m2.d4:ocMA.Kathisma21.mode	@ltx/en_us_goadedes/miscellanea:misc.Mode2
ltx/en_us_goadedes/oc.m2.d4:ocMA.Kathisma21.text	
ltx/en_us_goadedes/oc.m2.d4:ocMA.Kathisma22.incipit	…
ltx/en_us_goadedes/oc.m2.d4:ocMA.Kathisma22.melody	
ltx/en_us_goadedes/oc.m2.d4:ocMA.Kathisma22.mode	@ltx/en_us_goadedes/miscellanea:misc.Mode2
ltx/en_us_goadedes/oc.m2.d4:ocMA.Kathisma22.text	
ltx/en_us_goadedes/oc.m2.d4:ocMA.Kathisma23.incipit	…
ltx/en_us_goadedes/oc.m2.d4:ocMA.Kathisma23.melody	
ltx/en_us_goadedes/oc.m2.d4:ocMA.Kathisma23.mode	@ltx/en_us_goadedes/miscellanea:misc.Mode2
ltx/en_us_goadedes/oc.m2.d4:ocMA.Kathisma23.text	
ltx/en_us_goadedes/oc.m2.d4:ocMA.Kathisma31.incipit	…
ltx/en_us_goadedes/oc.m2.d4:ocMA.Kathisma31.melody	
ltx/en_us_goadedes/oc.m2.d4:ocMA.Kathisma31.mode	@ltx/en_us_goadedes/miscellanea:misc.Mode2
ltx/en_us_goadedes/oc.m2.d4:ocMA.Kathisma31.text	
ltx/en_us_goadedes/oc.m2.d4:ocMA.Kathisma32.incipit	…
ltx/en_us_goadedes/oc.m2.d4:ocMA.Kathisma32.melody	
ltx/en_us_goadedes/oc.m2.d4:ocMA.Kathisma32.mode	@ltx/en_us_goadedes/miscellanea:misc.Mode2
ltx/en_us_goadedes/oc.m2.d4:ocMA.Kathisma32.text	
ltx/en_us_goadedes/oc.m2.d4:ocMA.Kathisma33.greekmelody	@ltx/en_us_goadedes/he.a.m2:heAU.TaAnoZiton.greekname
ltx/en_us_goadedes/oc.m2.d4:ocMA.Kathisma33.incipit	…
ltx/en_us_goadedes/oc.m2.d4:ocMA.Kathisma33.melody	@ltx/en_us_goadedes/he.a.m2:heAU.TaAnoZiton.name
ltx/en_us_goadedes/oc.m2.d4:ocMA.Kathisma33.mode	@ltx/en_us_goadedes/miscellanea:misc.Mode2
ltx/en_us_goadedes/oc.m2.d4:ocMA.Kathisma33.text	
ltx/en_us_goadedes/oc.m2.d4:ocMA.OdeW1C11.incipit	…
ltx/en_us_goadedes/oc.m2.d4:ocMA.OdeW1C11.melody	@ltx/en_us_goadedes/he.h.m2:heHE.EnVythoKatestrose.name
ltx/en_us_goadedes/oc.m2.d4:ocMA.OdeW1C11.mode	@ltx/en_us_goadedes/miscellanea:misc.Mode2
ltx/en_us_goadedes/oc.m2.d4:ocMA.OdeW1C11.ode	@ltx/en_us_goadedes/miscellanea:misc.Ode1
ltx/en_us_goadedes/oc.m2.d4:ocMA.OdeW1C11.text	
ltx/en_us_goadedes/oc.m2.d4:ocMA.OdeW1C12.incipit	…
ltx/en_us_goadedes/oc.m2.d4:ocMA.OdeW1C12.melody	@ltx/en_us_goadedes/he.h.m2:heHE.EnVythoKatestrose.name
ltx/en_us_goadedes/oc.m2.d4:ocMA.OdeW1C12.mode	@ltx/en_us_goadedes/miscellanea:misc.Mode2
ltx/en_us_goadedes/oc.m2.d4:ocMA.OdeW1C12.ode	@ltx/en_us_goadedes/miscellanea:misc.Ode1
ltx/en_us_goadedes/oc.m2.d4:ocMA.OdeW1C12.text	
ltx/en_us_goadedes/oc.m2.d4:ocMA.OdeW1C13.incipit	…
ltx/en_us_goadedes/oc.m2.d4:ocMA.OdeW1C13.melody	@ltx/en_us_goadedes/he.h.m2:heHE.EnVythoKatestrose.name
ltx/en_us_goadedes/oc.m2.d4:ocMA.OdeW1C13.mode	@ltx/en_us_goadedes/miscellanea:misc.Mode2
ltx/en_us_goadedes/oc.m2.d4:ocMA.OdeW1C13.ode	@ltx/en_us_goadedes/miscellanea:misc.Ode1
ltx/en_us_goadedes/oc.m2.d4:ocMA.OdeW1C13.text	
ltx/en_us_goadedes/oc.m2.d4:ocMA.OdeW1C14.incipit	…
ltx/en_us_goadedes/oc.m2.d4:ocMA.OdeW1C14.melody	@ltx/en_us_goadedes/he.h.m2:heHE.EnVythoKatestrose.name
ltx/en_us_goadedes/oc.m2.d4:ocMA.OdeW1C14.mode	@ltx/en_us_goadedes/miscellanea:misc.Mode2
ltx/en_us_goadedes/oc.m2.d4:ocMA.OdeW1C14.ode	@ltx/en_us_goadedes/miscellanea:misc.Ode1
ltx/en_us_goadedes/oc.m2.d4:ocMA.OdeW1C14.text	
ltx/en_us_goadedes/oc.m2.d4:ocMA.OdeW1C1H.greekmelody	@ltx/en_us_goadedes/he.h.m2:heHE.EnVythoKatestrose.greekname
ltx/en_us_goadedes/oc.m2.d4:ocMA.OdeW1C1H.incipit	@ltx/en_us_goadedes/he.h.m2:heHE.EnVythoKatestrose.incipit
ltx/en_us_goadedes/oc.m2.d4:ocMA.OdeW1C1H.melody	@ltx/en_us_goadedes/he.h.m2:heHE.EnVythoKatestrose.melody
ltx/en_us_goadedes/oc.m2.d4:ocMA.OdeW1C1H.mode	@ltx/en_us_goadedes/miscellanea:misc.Mode2
ltx/en_us_goadedes/oc.m2.d4:ocMA.OdeW1C1H.ode	@ltx/en_us_goadedes/miscellanea:misc.Ode1
ltx/en_us_goadedes/oc.m2.d4:ocMA.OdeW1C1H.text	@ltx/en_us_goadedes/he.h.m2:heHE.EnVythoKatestrose.text
ltx/en_us_goadedes/oc.m2.d4:ocMA.OdeW1C1T.incipit	…
ltx/en_us_goadedes/oc.m2.d4:ocMA.OdeW1C1T.melody	@ltx/en_us_goadedes/he.h.m2:heHE.EnVythoKatestrose.name
ltx/en_us_goadedes/oc.m2.d4:ocMA.OdeW1C1T.mode	@ltx/en_us_goadedes/miscellanea:misc.Mode2
ltx/en_us_goadedes/oc.m2.d4:ocMA.OdeW1C1T.ode	@ltx/en_us_goadedes/miscellanea:misc.Ode1
ltx/en_us_goadedes/oc.m2.d4:ocMA.OdeW1C1T.text	
ltx/en_us_goadedes/oc.m2.d4:ocMA.OdeW1C21.greekmelody	@ltx/en_us_goadedes/he.h.m2:heHE.EnVythoKatestrose.greekname
ltx/en_us_goadedes/oc.m2.d4:ocMA.OdeW1C21.incipit	From all women…
ltx/en_us_goadedes/oc.m2.d4:ocMA.OdeW1C21.melody	@ltx/en_us_goadedes/he.h.m2:heHE.EnVythoKatestrose.name
ltx/en_us_goadedes/oc.m2.d4:ocMA.OdeW1C21.mode	@ltx/en_us_goadedes/miscellanea:misc.Mode2
ltx/en_us_goadedes/oc.m2.d4:ocMA.OdeW1C21.ode	@ltx/en_us_goadedes/miscellanea:misc.Ode1
ltx/en_us_goadedes/oc.m2.d4:ocMA.OdeW1C21.text	From all women, God selected you, * blameless, holy Virgin pure, * for you were lovely and fair and most beautiful. * As a babe He dwelt within your all-blameless womb. * We implore you, all-blameless one, * pray to Him to free from blame of their transgressions all who sing your praise.
ltx/en_us_goadedes/oc.m2.d4:ocMA.OdeW1C22.incipit	As the Psalmist said…
ltx/en_us_goadedes/oc.m2.d4:ocMA.OdeW1C22.melody	@ltx/en_us_goadedes/he.h.m2:heHE.EnVythoKatestrose.name
ltx/en_us_goadedes/oc.m2.d4:ocMA.OdeW1C22.mode	@ltx/en_us_goadedes/miscellanea:misc.Mode2
ltx/en_us_goadedes/oc.m2.d4:ocMA.OdeW1C22.ode	@ltx/en_us_goadedes/miscellanea:misc.Ode1
ltx/en_us_goadedes/oc.m2.d4:ocMA.OdeW1C22.text	As the Psalmist said it long ago, * you stood at the right hand of the divine King, who came forth from your holy womb, * as a Queen, O Virgin pure. * Pray to Him for me, to permit me place to stand * near Him on His right hand, * on that day of just rewards, all-blameless one.
ltx/en_us_goadedes/oc.m2.d4:ocMA.OdeW1C23.incipit	Dry was human nature…
ltx/en_us_goadedes/oc.m2.d4:ocMA.OdeW1C23.melody	@ltx/en_us_goadedes/he.h.m2:heHE.EnVythoKatestrose.name
ltx/en_us_goadedes/oc.m2.d4:ocMA.OdeW1C23.mode	@ltx/en_us_goadedes/miscellanea:misc.Mode2
ltx/en_us_goadedes/oc.m2.d4:ocMA.OdeW1C23.ode	@ltx/en_us_goadedes/miscellanea:misc.Ode1
ltx/en_us_goadedes/oc.m2.d4:ocMA.OdeW1C23.text	Dry was human nature to the core, * due to all its deviance. * But you gave birth to rain from heaven, namely Christ, * who through you renewed it all. * I implore you now, make the soil of my sorry soul * once again be fruitful, * for my sins have dried it up, O Bride of God.
ltx/en_us_goadedes/oc.m2.d4:ocMA.OdeW3C11.incipit	…
ltx/en_us_goadedes/oc.m2.d4:ocMA.OdeW3C11.melody	@ltx/en_us_goadedes/he.h.m2:heHE.ExinthisenIErimos.name
ltx/en_us_goadedes/oc.m2.d4:ocMA.OdeW3C11.mode	@ltx/en_us_goadedes/miscellanea:misc.Mode2
ltx/en_us_goadedes/oc.m2.d4:ocMA.OdeW3C11.ode	@ltx/en_us_goadedes/miscellanea:misc.Ode3
ltx/en_us_goadedes/oc.m2.d4:ocMA.OdeW3C11.text	
ltx/en_us_goadedes/oc.m2.d4:ocMA.OdeW3C12.incipit	…
ltx/en_us_goadedes/oc.m2.d4:ocMA.OdeW3C12.melody	@ltx/en_us_goadedes/he.h.m2:heHE.ExinthisenIErimos.name
ltx/en_us_goadedes/oc.m2.d4:ocMA.OdeW3C12.mode	@ltx/en_us_goadedes/miscellanea:misc.Mode2
ltx/en_us_goadedes/oc.m2.d4:ocMA.OdeW3C12.ode	@ltx/en_us_goadedes/miscellanea:misc.Ode3
ltx/en_us_goadedes/oc.m2.d4:ocMA.OdeW3C12.text	
ltx/en_us_goadedes/oc.m2.d4:ocMA.OdeW3C13.incipit	…
ltx/en_us_goadedes/oc.m2.d4:ocMA.OdeW3C13.melody	@ltx/en_us_goadedes/he.h.m2:heHE.ExinthisenIErimos.name
ltx/en_us_goadedes/oc.m2.d4:ocMA.OdeW3C13.mode	@ltx/en_us_goadedes/miscellanea:misc.Mode2
ltx/en_us_goadedes/oc.m2.d4:ocMA.OdeW3C13.ode	@ltx/en_us_goadedes/miscellanea:misc.Ode3
ltx/en_us_goadedes/oc.m2.d4:ocMA.OdeW3C13.text	
ltx/en_us_goadedes/oc.m2.d4:ocMA.OdeW3C14.incipit	…
ltx/en_us_goadedes/oc.m2.d4:ocMA.OdeW3C14.melody	@ltx/en_us_goadedes/he.h.m2:heHE.ExinthisenIErimos.name
ltx/en_us_goadedes/oc.m2.d4:ocMA.OdeW3C14.mode	@ltx/en_us_goadedes/miscellanea:misc.Mode2
ltx/en_us_goadedes/oc.m2.d4:ocMA.OdeW3C14.ode	@ltx/en_us_goadedes/miscellanea:misc.Ode3
ltx/en_us_goadedes/oc.m2.d4:ocMA.OdeW3C14.text	
ltx/en_us_goadedes/oc.m2.d4:ocMA.OdeW3C1H.greekmelody	@ltx/en_us_goadedes/he.h.m2:heHE.ExinthisenIErimos.greekname
ltx/en_us_goadedes/oc.m2.d4:ocMA.OdeW3C1H.incipit	@ltx/en_us_goadedes/he.h.m2:heHE.ExinthisenIErimos.incipit
ltx/en_us_goadedes/oc.m2.d4:ocMA.OdeW3C1H.melody	@ltx/en_us_goadedes/he.h.m2:heHE.ExinthisenIErimos.melody
ltx/en_us_goadedes/oc.m2.d4:ocMA.OdeW3C1H.mode	@ltx/en_us_goadedes/miscellanea:misc.Mode2
ltx/en_us_goadedes/oc.m2.d4:ocMA.OdeW3C1H.ode	@ltx/en_us_goadedes/miscellanea:misc.Ode3
ltx/en_us_goadedes/oc.m2.d4:ocMA.OdeW3C1H.text	@ltx/en_us_goadedes/he.h.m2:heHE.ExinthisenIErimos.text
ltx/en_us_goadedes/oc.m2.d4:ocMA.OdeW3C1T.incipit	…
ltx/en_us_goadedes/oc.m2.d4:ocMA.OdeW3C1T.melody	@ltx/en_us_goadedes/he.h.m2:heHE.ExinthisenIErimos.name
ltx/en_us_goadedes/oc.m2.d4:ocMA.OdeW3C1T.mode	@ltx/en_us_goadedes/miscellanea:misc.Mode2
ltx/en_us_goadedes/oc.m2.d4:ocMA.OdeW3C1T.ode	@ltx/en_us_goadedes/miscellanea:misc.Ode3
ltx/en_us_goadedes/oc.m2.d4:ocMA.OdeW3C1T.text	
ltx/en_us_goadedes/oc.m2.d4:ocMA.OdeW3C21.greekmelody	@ltx/en_us_goadedes/he.h.m2:heHE.ExinthisenIErimos.greekname
ltx/en_us_goadedes/oc.m2.d4:ocMA.OdeW3C21.incipit	When He put on…
ltx/en_us_goadedes/oc.m2.d4:ocMA.OdeW3C21.melody	@ltx/en_us_goadedes/he.h.m2:heHE.ExinthisenIErimos.name
ltx/en_us_goadedes/oc.m2.d4:ocMA.OdeW3C21.mode	@ltx/en_us_goadedes/miscellanea:misc.Mode2
ltx/en_us_goadedes/oc.m2.d4:ocMA.OdeW3C21.ode	@ltx/en_us_goadedes/miscellanea:misc.Ode3
ltx/en_us_goadedes/oc.m2.d4:ocMA.OdeW3C21.text	When He put on my human form, * O all-spotless one, your Son, * the Maker, from your womb came forth; * and to those who because of many sins * had been stripped, He gave robes of immortality.
ltx/en_us_goadedes/oc.m2.d4:ocMA.OdeW3C22.incipit	All-spotless one…
ltx/en_us_goadedes/oc.m2.d4:ocMA.OdeW3C22.melody	@ltx/en_us_goadedes/he.h.m2:heHE.ExinthisenIErimos.name
ltx/en_us_goadedes/oc.m2.d4:ocMA.OdeW3C22.mode	@ltx/en_us_goadedes/miscellanea:misc.Mode2
ltx/en_us_goadedes/oc.m2.d4:ocMA.OdeW3C22.ode	@ltx/en_us_goadedes/miscellanea:misc.Ode3
ltx/en_us_goadedes/oc.m2.d4:ocMA.OdeW3C22.text	All-spotless one, as Mother of the most honored Word of God, * intently pray to Him for me * to take pity on my dejected soul * that submitted to pleasures that dishonor it.
ltx/en_us_goadedes/oc.m2.d4:ocMA.OdeW3C23.incipit	O Virgin all-immaculate…
ltx/en_us_goadedes/oc.m2.d4:ocMA.OdeW3C23.melody	@ltx/en_us_goadedes/he.h.m2:heHE.ExinthisenIErimos.name
ltx/en_us_goadedes/oc.m2.d4:ocMA.OdeW3C23.mode	@ltx/en_us_goadedes/miscellanea:misc.Mode2
ltx/en_us_goadedes/oc.m2.d4:ocMA.OdeW3C23.ode	@ltx/en_us_goadedes/miscellanea:misc.Ode3
ltx/en_us_goadedes/oc.m2.d4:ocMA.OdeW3C23.text	O Virgin all-immaculate, * heal the bruises on my soul. * With your effective medicine * treat my heart, which is in a sorry state, * for venom of the serpent has infected it.
ltx/en_us_goadedes/oc.m2.d4:ocMA.OdeW4C11.incipit	…
ltx/en_us_goadedes/oc.m2.d4:ocMA.OdeW4C11.melody	@ltx/en_us_goadedes/he.h.m2:heHE.ElilythasEkParthenou.name
ltx/en_us_goadedes/oc.m2.d4:ocMA.OdeW4C11.mode	@ltx/en_us_goadedes/miscellanea:misc.Mode2
ltx/en_us_goadedes/oc.m2.d4:ocMA.OdeW4C11.ode	@ltx/en_us_goadedes/miscellanea:misc.Ode4
ltx/en_us_goadedes/oc.m2.d4:ocMA.OdeW4C11.text	
ltx/en_us_goadedes/oc.m2.d4:ocMA.OdeW4C12.incipit	…
ltx/en_us_goadedes/oc.m2.d4:ocMA.OdeW4C12.melody	@ltx/en_us_goadedes/he.h.m2:heHE.ElilythasEkParthenou.name
ltx/en_us_goadedes/oc.m2.d4:ocMA.OdeW4C12.mode	@ltx/en_us_goadedes/miscellanea:misc.Mode2
ltx/en_us_goadedes/oc.m2.d4:ocMA.OdeW4C12.ode	@ltx/en_us_goadedes/miscellanea:misc.Ode4
ltx/en_us_goadedes/oc.m2.d4:ocMA.OdeW4C12.text	
ltx/en_us_goadedes/oc.m2.d4:ocMA.OdeW4C13.incipit	…
ltx/en_us_goadedes/oc.m2.d4:ocMA.OdeW4C13.melody	@ltx/en_us_goadedes/he.h.m2:heHE.ElilythasEkParthenou.name
ltx/en_us_goadedes/oc.m2.d4:ocMA.OdeW4C13.mode	@ltx/en_us_goadedes/miscellanea:misc.Mode2
ltx/en_us_goadedes/oc.m2.d4:ocMA.OdeW4C13.ode	@ltx/en_us_goadedes/miscellanea:misc.Ode4
ltx/en_us_goadedes/oc.m2.d4:ocMA.OdeW4C13.text	
ltx/en_us_goadedes/oc.m2.d4:ocMA.OdeW4C14.incipit	…
ltx/en_us_goadedes/oc.m2.d4:ocMA.OdeW4C14.melody	@ltx/en_us_goadedes/he.h.m2:heHE.ElilythasEkParthenou.name
ltx/en_us_goadedes/oc.m2.d4:ocMA.OdeW4C14.mode	@ltx/en_us_goadedes/miscellanea:misc.Mode2
ltx/en_us_goadedes/oc.m2.d4:ocMA.OdeW4C14.ode	@ltx/en_us_goadedes/miscellanea:misc.Ode4
ltx/en_us_goadedes/oc.m2.d4:ocMA.OdeW4C14.text	
ltx/en_us_goadedes/oc.m2.d4:ocMA.OdeW4C1H.greekmelody	@ltx/en_us_goadedes/he.h.m2:heHE.ElilythasEkParthenou.greekname
ltx/en_us_goadedes/oc.m2.d4:ocMA.OdeW4C1H.incipit	@ltx/en_us_goadedes/he.h.m2:heHE.ElilythasEkParthenou.incipit
ltx/en_us_goadedes/oc.m2.d4:ocMA.OdeW4C1H.melody	@ltx/en_us_goadedes/he.h.m2:heHE.ElilythasEkParthenou.melody
ltx/en_us_goadedes/oc.m2.d4:ocMA.OdeW4C1H.mode	@ltx/en_us_goadedes/miscellanea:misc.Mode2
ltx/en_us_goadedes/oc.m2.d4:ocMA.OdeW4C1H.ode	@ltx/en_us_goadedes/miscellanea:misc.Ode4
ltx/en_us_goadedes/oc.m2.d4:ocMA.OdeW4C1H.text	@ltx/en_us_goadedes/he.h.m2:heHE.ElilythasEkParthenou.text
ltx/en_us_goadedes/oc.m2.d4:ocMA.OdeW4C1T.incipit	…
ltx/en_us_goadedes/oc.m2.d4:ocMA.OdeW4C1T.melody	@ltx/en_us_goadedes/he.h.m2:heHE.ElilythasEkParthenou.name
ltx/en_us_goadedes/oc.m2.d4:ocMA.OdeW4C1T.mode	@ltx/en_us_goadedes/miscellanea:misc.Mode2
ltx/en_us_goadedes/oc.m2.d4:ocMA.OdeW4C1T.ode	@ltx/en_us_goadedes/miscellanea:misc.Ode4
ltx/en_us_goadedes/oc.m2.d4:ocMA.OdeW4C1T.text	
ltx/en_us_goadedes/oc.m2.d4:ocMA.OdeW4C21.greekmelody	@ltx/en_us_goadedes/he.h.m2:heHE.ElilythasEkParthenou.greekname
ltx/en_us_goadedes/oc.m2.d4:ocMA.OdeW4C21.incipit	O Lady, please…
ltx/en_us_goadedes/oc.m2.d4:ocMA.OdeW4C21.melody	@ltx/en_us_goadedes/he.h.m2:heHE.ElilythasEkParthenou.name
ltx/en_us_goadedes/oc.m2.d4:ocMA.OdeW4C21.mode	@ltx/en_us_goadedes/miscellanea:misc.Mode2
ltx/en_us_goadedes/oc.m2.d4:ocMA.OdeW4C21.ode	@ltx/en_us_goadedes/miscellanea:misc.Ode4
ltx/en_us_goadedes/oc.m2.d4:ocMA.OdeW4C21.text	O Lady, please, let a drop of compunction rain down on me, * which will make the scorching heat subside inside of my aching heart, * and suppress iniquitous * recollections afflicting my intellect.
ltx/en_us_goadedes/oc.m2.d4:ocMA.OdeW4C22.incipit	Immaculate, holy Virgin…
ltx/en_us_goadedes/oc.m2.d4:ocMA.OdeW4C22.melody	@ltx/en_us_goadedes/he.h.m2:heHE.ElilythasEkParthenou.name
ltx/en_us_goadedes/oc.m2.d4:ocMA.OdeW4C22.mode	@ltx/en_us_goadedes/miscellanea:misc.Mode2
ltx/en_us_goadedes/oc.m2.d4:ocMA.OdeW4C22.ode	@ltx/en_us_goadedes/miscellanea:misc.Ode4
ltx/en_us_goadedes/oc.m2.d4:ocMA.OdeW4C22.text	Immaculate, holy Virgin, I pray, do not pass me by, * as you see my lying here. The knife of pleasure has wounded me. * Heal me by the spear and blood * of Christ your Son, who is our God who was crucified.
ltx/en_us_goadedes/oc.m2.d4:ocMA.OdeW4C23.incipit	Enriched are you…
ltx/en_us_goadedes/oc.m2.d4:ocMA.OdeW4C23.melody	@ltx/en_us_goadedes/he.h.m2:heHE.ElilythasEkParthenou.name
ltx/en_us_goadedes/oc.m2.d4:ocMA.OdeW4C23.mode	@ltx/en_us_goadedes/miscellanea:misc.Mode2
ltx/en_us_goadedes/oc.m2.d4:ocMA.OdeW4C23.ode	@ltx/en_us_goadedes/miscellanea:misc.Ode4
ltx/en_us_goadedes/oc.m2.d4:ocMA.OdeW4C23.text	Enriched are you, with the mastery over creation all. * O Lady, my sins has made me poor in grace divine. Pity me, * so that I may magnify * you my benevolent patroness, all-blameless one.
ltx/en_us_goadedes/oc.m2.d4:ocMA.OdeW5C11.incipit	…
ltx/en_us_goadedes/oc.m2.d4:ocMA.OdeW5C11.melody	@ltx/en_us_goadedes/he.h.m2:heHE.MesitisTheou.name
ltx/en_us_goadedes/oc.m2.d4:ocMA.OdeW5C11.mode	@ltx/en_us_goadedes/miscellanea:misc.Mode2
ltx/en_us_goadedes/oc.m2.d4:ocMA.OdeW5C11.ode	@ltx/en_us_goadedes/miscellanea:misc.Ode5
ltx/en_us_goadedes/oc.m2.d4:ocMA.OdeW5C11.text	
ltx/en_us_goadedes/oc.m2.d4:ocMA.OdeW5C12.incipit	…
ltx/en_us_goadedes/oc.m2.d4:ocMA.OdeW5C12.melody	@ltx/en_us_goadedes/he.h.m2:heHE.MesitisTheou.name
ltx/en_us_goadedes/oc.m2.d4:ocMA.OdeW5C12.mode	@ltx/en_us_goadedes/miscellanea:misc.Mode2
ltx/en_us_goadedes/oc.m2.d4:ocMA.OdeW5C12.ode	@ltx/en_us_goadedes/miscellanea:misc.Ode5
ltx/en_us_goadedes/oc.m2.d4:ocMA.OdeW5C12.text	
ltx/en_us_goadedes/oc.m2.d4:ocMA.OdeW5C13.incipit	…
ltx/en_us_goadedes/oc.m2.d4:ocMA.OdeW5C13.melody	@ltx/en_us_goadedes/he.h.m2:heHE.MesitisTheou.name
ltx/en_us_goadedes/oc.m2.d4:ocMA.OdeW5C13.mode	@ltx/en_us_goadedes/miscellanea:misc.Mode2
ltx/en_us_goadedes/oc.m2.d4:ocMA.OdeW5C13.ode	@ltx/en_us_goadedes/miscellanea:misc.Ode5
ltx/en_us_goadedes/oc.m2.d4:ocMA.OdeW5C13.text	
ltx/en_us_goadedes/oc.m2.d4:ocMA.OdeW5C14.incipit	…
ltx/en_us_goadedes/oc.m2.d4:ocMA.OdeW5C14.melody	@ltx/en_us_goadedes/he.h.m2:heHE.MesitisTheou.name
ltx/en_us_goadedes/oc.m2.d4:ocMA.OdeW5C14.mode	@ltx/en_us_goadedes/miscellanea:misc.Mode2
ltx/en_us_goadedes/oc.m2.d4:ocMA.OdeW5C14.ode	@ltx/en_us_goadedes/miscellanea:misc.Ode5
ltx/en_us_goadedes/oc.m2.d4:ocMA.OdeW5C14.text	
ltx/en_us_goadedes/oc.m2.d4:ocMA.OdeW5C1H.greekmelody	@ltx/en_us_goadedes/he.h.m2:heHE.MesitisTheou.greekname
ltx/en_us_goadedes/oc.m2.d4:ocMA.OdeW5C1H.incipit	@ltx/en_us_goadedes/he.h.m2:heHE.MesitisTheou.incipit
ltx/en_us_goadedes/oc.m2.d4:ocMA.OdeW5C1H.melody	@ltx/en_us_goadedes/he.h.m2:heHE.MesitisTheou.melody
ltx/en_us_goadedes/oc.m2.d4:ocMA.OdeW5C1H.mode	@ltx/en_us_goadedes/miscellanea:misc.Mode2
ltx/en_us_goadedes/oc.m2.d4:ocMA.OdeW5C1H.ode	@ltx/en_us_goadedes/miscellanea:misc.Ode5
ltx/en_us_goadedes/oc.m2.d4:ocMA.OdeW5C1H.text	@ltx/en_us_goadedes/he.h.m2:heHE.MesitisTheou.text
ltx/en_us_goadedes/oc.m2.d4:ocMA.OdeW5C1T.incipit	…
ltx/en_us_goadedes/oc.m2.d4:ocMA.OdeW5C1T.melody	@ltx/en_us_goadedes/he.h.m2:heHE.MesitisTheou.name
ltx/en_us_goadedes/oc.m2.d4:ocMA.OdeW5C1T.mode	@ltx/en_us_goadedes/miscellanea:misc.Mode2
ltx/en_us_goadedes/oc.m2.d4:ocMA.OdeW5C1T.ode	@ltx/en_us_goadedes/miscellanea:misc.Ode5
ltx/en_us_goadedes/oc.m2.d4:ocMA.OdeW5C1T.text	
ltx/en_us_goadedes/oc.m2.d4:ocMA.OdeW5C21.greekmelody	@ltx/en_us_goadedes/he.h.m2:heHE.MesitisTheou.greekname
ltx/en_us_goadedes/oc.m2.d4:ocMA.OdeW5C21.incipit	Immaculate Maid…
ltx/en_us_goadedes/oc.m2.d4:ocMA.OdeW5C21.melody	@ltx/en_us_goadedes/he.h.m2:heHE.MesitisTheou.name
ltx/en_us_goadedes/oc.m2.d4:ocMA.OdeW5C21.mode	@ltx/en_us_goadedes/miscellanea:misc.Mode2
ltx/en_us_goadedes/oc.m2.d4:ocMA.OdeW5C21.ode	@ltx/en_us_goadedes/miscellanea:misc.Ode5
ltx/en_us_goadedes/oc.m2.d4:ocMA.OdeW5C21.text	Immaculate Maid, * who gave birth to Him who is way and the life, * I pray you to guide me straight on the narrow way, for I have senselessly * hurled myself to perdition and trackless lands of tragedy.
ltx/en_us_goadedes/oc.m2.d4:ocMA.OdeW5C22.incipit	I foolishly lived…
ltx/en_us_goadedes/oc.m2.d4:ocMA.OdeW5C22.melody	@ltx/en_us_goadedes/he.h.m2:heHE.MesitisTheou.name
ltx/en_us_goadedes/oc.m2.d4:ocMA.OdeW5C22.mode	@ltx/en_us_goadedes/miscellanea:misc.Mode2
ltx/en_us_goadedes/oc.m2.d4:ocMA.OdeW5C22.ode	@ltx/en_us_goadedes/miscellanea:misc.Ode5
ltx/en_us_goadedes/oc.m2.d4:ocMA.OdeW5C22.text	I foolishly lived * a licentious life, estranging myself from God, * and I have been wandering far away in passions like a foreign land. * Bring be back, holy Virgin, and save me, by your prayers for me.
ltx/en_us_goadedes/oc.m2.d4:ocMA.OdeW5C23.incipit	I pray, let me drink…
ltx/en_us_goadedes/oc.m2.d4:ocMA.OdeW5C23.melody	@ltx/en_us_goadedes/he.h.m2:heHE.MesitisTheou.name
ltx/en_us_goadedes/oc.m2.d4:ocMA.OdeW5C23.mode	@ltx/en_us_goadedes/miscellanea:misc.Mode2
ltx/en_us_goadedes/oc.m2.d4:ocMA.OdeW5C23.ode	@ltx/en_us_goadedes/miscellanea:misc.Ode5
ltx/en_us_goadedes/oc.m2.d4:ocMA.OdeW5C23.text	I pray, let me drink * from refreshing streams of life that flow from you, * O Mother and Virgin pure; for the flames of sinful deeds are burning me. * I your servant am threatened, for demons are assaulting me.
ltx/en_us_goadedes/oc.m2.d4:ocMA.OdeW6C11.incipit	…
ltx/en_us_goadedes/oc.m2.d4:ocMA.OdeW6C11.melody	@ltx/en_us_goadedes/he.h.m2:heHE.ProsKyrionEkKitous.name
ltx/en_us_goadedes/oc.m2.d4:ocMA.OdeW6C11.mode	@ltx/en_us_goadedes/miscellanea:misc.Mode2
ltx/en_us_goadedes/oc.m2.d4:ocMA.OdeW6C11.ode	@ltx/en_us_goadedes/miscellanea:misc.Ode6
ltx/en_us_goadedes/oc.m2.d4:ocMA.OdeW6C11.text	
ltx/en_us_goadedes/oc.m2.d4:ocMA.OdeW6C12.incipit	…
ltx/en_us_goadedes/oc.m2.d4:ocMA.OdeW6C12.melody	@ltx/en_us_goadedes/he.h.m2:heHE.ProsKyrionEkKitous.name
ltx/en_us_goadedes/oc.m2.d4:ocMA.OdeW6C12.mode	@ltx/en_us_goadedes/miscellanea:misc.Mode2
ltx/en_us_goadedes/oc.m2.d4:ocMA.OdeW6C12.ode	@ltx/en_us_goadedes/miscellanea:misc.Ode6
ltx/en_us_goadedes/oc.m2.d4:ocMA.OdeW6C12.text	
ltx/en_us_goadedes/oc.m2.d4:ocMA.OdeW6C13.incipit	…
ltx/en_us_goadedes/oc.m2.d4:ocMA.OdeW6C13.melody	@ltx/en_us_goadedes/he.h.m2:heHE.ProsKyrionEkKitous.name
ltx/en_us_goadedes/oc.m2.d4:ocMA.OdeW6C13.mode	@ltx/en_us_goadedes/miscellanea:misc.Mode2
ltx/en_us_goadedes/oc.m2.d4:ocMA.OdeW6C13.ode	@ltx/en_us_goadedes/miscellanea:misc.Ode6
ltx/en_us_goadedes/oc.m2.d4:ocMA.OdeW6C13.text	
ltx/en_us_goadedes/oc.m2.d4:ocMA.OdeW6C14.incipit	…
ltx/en_us_goadedes/oc.m2.d4:ocMA.OdeW6C14.melody	@ltx/en_us_goadedes/he.h.m2:heHE.ProsKyrionEkKitous.name
ltx/en_us_goadedes/oc.m2.d4:ocMA.OdeW6C14.mode	@ltx/en_us_goadedes/miscellanea:misc.Mode2
ltx/en_us_goadedes/oc.m2.d4:ocMA.OdeW6C14.ode	@ltx/en_us_goadedes/miscellanea:misc.Ode6
ltx/en_us_goadedes/oc.m2.d4:ocMA.OdeW6C14.text	
ltx/en_us_goadedes/oc.m2.d4:ocMA.OdeW6C1H.greekmelody	@ltx/en_us_goadedes/he.h.m2:heHE.ProsKyrionEkKitous.greekname
ltx/en_us_goadedes/oc.m2.d4:ocMA.OdeW6C1H.incipit	@ltx/en_us_goadedes/he.h.m2:heHE.ProsKyrionEkKitous.incipit
ltx/en_us_goadedes/oc.m2.d4:ocMA.OdeW6C1H.melody	@ltx/en_us_goadedes/he.h.m2:heHE.ProsKyrionEkKitous.melody
ltx/en_us_goadedes/oc.m2.d4:ocMA.OdeW6C1H.mode	@ltx/en_us_goadedes/miscellanea:misc.Mode2
ltx/en_us_goadedes/oc.m2.d4:ocMA.OdeW6C1H.ode	@ltx/en_us_goadedes/miscellanea:misc.Ode6
ltx/en_us_goadedes/oc.m2.d4:ocMA.OdeW6C1H.text	@ltx/en_us_goadedes/he.h.m2:heHE.ProsKyrionEkKitous.text
ltx/en_us_goadedes/oc.m2.d4:ocMA.OdeW6C1T.incipit	…
ltx/en_us_goadedes/oc.m2.d4:ocMA.OdeW6C1T.melody	@ltx/en_us_goadedes/he.h.m2:heHE.ProsKyrionEkKitous.name
ltx/en_us_goadedes/oc.m2.d4:ocMA.OdeW6C1T.mode	@ltx/en_us_goadedes/miscellanea:misc.Mode2
ltx/en_us_goadedes/oc.m2.d4:ocMA.OdeW6C1T.ode	@ltx/en_us_goadedes/miscellanea:misc.Ode6
ltx/en_us_goadedes/oc.m2.d4:ocMA.OdeW6C1T.text	
ltx/en_us_goadedes/oc.m2.d4:ocMA.OdeW6C21.greekmelody	@ltx/en_us_goadedes/he.h.m2:heHE.EnAvyssoPtaismaton.greekname
ltx/en_us_goadedes/oc.m2.d4:ocMA.OdeW6C21.incipit	Let me not be…
ltx/en_us_goadedes/oc.m2.d4:ocMA.OdeW6C21.melody	@ltx/en_us_goadedes/he.h.m2:heHE.EnAvyssoPtaismaton.name
ltx/en_us_goadedes/oc.m2.d4:ocMA.OdeW6C21.mode	@ltx/en_us_goadedes/miscellanea:misc.Mode2
ltx/en_us_goadedes/oc.m2.d4:ocMA.OdeW6C21.ode	@ltx/en_us_goadedes/miscellanea:misc.Ode6
ltx/en_us_goadedes/oc.m2.d4:ocMA.OdeW6C21.text	Let me not be the object of ridicule * by the wicked demons, O Lady, on Judgment Day, * but pray for me to Christ, the Judge * and your Son, to regard me with charity.
ltx/en_us_goadedes/oc.m2.d4:ocMA.OdeW6C22.incipit	I have moved You…
ltx/en_us_goadedes/oc.m2.d4:ocMA.OdeW6C22.melody	@ltx/en_us_goadedes/he.h.m2:heHE.EnAvyssoPtaismaton.name
ltx/en_us_goadedes/oc.m2.d4:ocMA.OdeW6C22.mode	@ltx/en_us_goadedes/miscellanea:misc.Mode2
ltx/en_us_goadedes/oc.m2.d4:ocMA.OdeW6C22.ode	@ltx/en_us_goadedes/miscellanea:misc.Ode6
ltx/en_us_goadedes/oc.m2.d4:ocMA.OdeW6C22.text	I have moved You to wrath with my shameful thoughts * and my wicked deeds and transgressions and sins, O Lord. * Forgive me, by your Mother’s prayers, * in Your mercy, and save me, O Christ my God.
ltx/en_us_goadedes/oc.m2.d4:ocMA.OdeW6C23.incipit	You gave birth…
ltx/en_us_goadedes/oc.m2.d4:ocMA.OdeW6C23.melody	@ltx/en_us_goadedes/he.h.m2:heHE.EnAvyssoPtaismaton.name
ltx/en_us_goadedes/oc.m2.d4:ocMA.OdeW6C23.mode	@ltx/en_us_goadedes/miscellanea:misc.Mode2
ltx/en_us_goadedes/oc.m2.d4:ocMA.OdeW6C23.ode	@ltx/en_us_goadedes/miscellanea:misc.Ode6
ltx/en_us_goadedes/oc.m2.d4:ocMA.OdeW6C23.text	You gave birth to the Lord of the universe, * who as God will Judge all. Alas, I am self-condemned * in many sins. O Lady, please, * from His just condemnation deliver me.
ltx/en_us_goadedes/oc.m2.d4:ocMA.OdeW7C11.incipit	…
ltx/en_us_goadedes/oc.m2.d4:ocMA.OdeW7C11.melody	@ltx/en_us_goadedes/he.h.m2:heHE.AntitheonProstagma.name
ltx/en_us_goadedes/oc.m2.d4:ocMA.OdeW7C11.mode	@ltx/en_us_goadedes/miscellanea:misc.Mode2
ltx/en_us_goadedes/oc.m2.d4:ocMA.OdeW7C11.ode	@ltx/en_us_goadedes/miscellanea:misc.Ode7
ltx/en_us_goadedes/oc.m2.d4:ocMA.OdeW7C11.text	
ltx/en_us_goadedes/oc.m2.d4:ocMA.OdeW7C12.incipit	…
ltx/en_us_goadedes/oc.m2.d4:ocMA.OdeW7C12.melody	@ltx/en_us_goadedes/he.h.m2:heHE.AntitheonProstagma.name
ltx/en_us_goadedes/oc.m2.d4:ocMA.OdeW7C12.mode	@ltx/en_us_goadedes/miscellanea:misc.Mode2
ltx/en_us_goadedes/oc.m2.d4:ocMA.OdeW7C12.ode	@ltx/en_us_goadedes/miscellanea:misc.Ode7
ltx/en_us_goadedes/oc.m2.d4:ocMA.OdeW7C12.text	
ltx/en_us_goadedes/oc.m2.d4:ocMA.OdeW7C13.incipit	…
ltx/en_us_goadedes/oc.m2.d4:ocMA.OdeW7C13.melody	@ltx/en_us_goadedes/he.h.m2:heHE.AntitheonProstagma.name
ltx/en_us_goadedes/oc.m2.d4:ocMA.OdeW7C13.mode	@ltx/en_us_goadedes/miscellanea:misc.Mode2
ltx/en_us_goadedes/oc.m2.d4:ocMA.OdeW7C13.ode	@ltx/en_us_goadedes/miscellanea:misc.Ode7
ltx/en_us_goadedes/oc.m2.d4:ocMA.OdeW7C13.text	
ltx/en_us_goadedes/oc.m2.d4:ocMA.OdeW7C14.incipit	…
ltx/en_us_goadedes/oc.m2.d4:ocMA.OdeW7C14.melody	@ltx/en_us_goadedes/he.h.m2:heHE.AntitheonProstagma.name
ltx/en_us_goadedes/oc.m2.d4:ocMA.OdeW7C14.mode	@ltx/en_us_goadedes/miscellanea:misc.Mode2
ltx/en_us_goadedes/oc.m2.d4:ocMA.OdeW7C14.ode	@ltx/en_us_goadedes/miscellanea:misc.Ode7
ltx/en_us_goadedes/oc.m2.d4:ocMA.OdeW7C14.text	
ltx/en_us_goadedes/oc.m2.d4:ocMA.OdeW7C1H.greekmelody	@ltx/en_us_goadedes/he.h.m2:heHE.AntitheonProstagma.greekname
ltx/en_us_goadedes/oc.m2.d4:ocMA.OdeW7C1H.incipit	@ltx/en_us_goadedes/he.h.m2:heHE.AntitheonProstagma.incipit
ltx/en_us_goadedes/oc.m2.d4:ocMA.OdeW7C1H.melody	@ltx/en_us_goadedes/he.h.m2:heHE.AntitheonProstagma.melody
ltx/en_us_goadedes/oc.m2.d4:ocMA.OdeW7C1H.mode	@ltx/en_us_goadedes/miscellanea:misc.Mode2
ltx/en_us_goadedes/oc.m2.d4:ocMA.OdeW7C1H.ode	@ltx/en_us_goadedes/miscellanea:misc.Ode7
ltx/en_us_goadedes/oc.m2.d4:ocMA.OdeW7C1H.text	@ltx/en_us_goadedes/he.h.m2:heHE.AntitheonProstagma.text
ltx/en_us_goadedes/oc.m2.d4:ocMA.OdeW7C1T.incipit	…
ltx/en_us_goadedes/oc.m2.d4:ocMA.OdeW7C1T.melody	@ltx/en_us_goadedes/he.h.m2:heHE.AntitheonProstagma.name
ltx/en_us_goadedes/oc.m2.d4:ocMA.OdeW7C1T.mode	@ltx/en_us_goadedes/miscellanea:misc.Mode2
ltx/en_us_goadedes/oc.m2.d4:ocMA.OdeW7C1T.ode	@ltx/en_us_goadedes/miscellanea:misc.Ode7
ltx/en_us_goadedes/oc.m2.d4:ocMA.OdeW7C1T.text	
ltx/en_us_goadedes/oc.m2.d4:ocMA.OdeW7C21.greekmelody	@ltx/en_us_goadedes/he.h.m2:heHE.AntitheonProstagma.greekname
ltx/en_us_goadedes/oc.m2.d4:ocMA.OdeW7C21.incipit	O Lady, my praise…
ltx/en_us_goadedes/oc.m2.d4:ocMA.OdeW7C21.melody	@ltx/en_us_goadedes/he.h.m2:heHE.AntitheonProstagma.name
ltx/en_us_goadedes/oc.m2.d4:ocMA.OdeW7C21.mode	@ltx/en_us_goadedes/miscellanea:misc.Mode2
ltx/en_us_goadedes/oc.m2.d4:ocMA.OdeW7C21.ode	@ltx/en_us_goadedes/miscellanea:misc.Ode7
ltx/en_us_goadedes/oc.m2.d4:ocMA.OdeW7C21.text	O Lady, my praise are you and my salvation, * my surest assistance and my fortress unassailable. * I earnestly pray that you will fight for me against * demons who unceasingly attack me and are always seeking to murder me.
ltx/en_us_goadedes/oc.m2.d4:ocMA.OdeW7C22.incipit	When God with your blood…
ltx/en_us_goadedes/oc.m2.d4:ocMA.OdeW7C22.melody	@ltx/en_us_goadedes/he.h.m2:heHE.AntitheonProstagma.name
ltx/en_us_goadedes/oc.m2.d4:ocMA.OdeW7C22.mode	@ltx/en_us_goadedes/miscellanea:misc.Mode2
ltx/en_us_goadedes/oc.m2.d4:ocMA.OdeW7C22.ode	@ltx/en_us_goadedes/miscellanea:misc.Ode7
ltx/en_us_goadedes/oc.m2.d4:ocMA.OdeW7C22.text	When God with your blood assumed a human body, * O Virgin, through you thereby humanity was deified. * Now I, who succumbing to the passions, lie here defiled * with wounds, pray you save me by your intercessions from the plots of the enemy.
ltx/en_us_goadedes/oc.m2.d4:ocMA.OdeW7C23.incipit	The furnace in Babylon…
ltx/en_us_goadedes/oc.m2.d4:ocMA.OdeW7C23.melody	@ltx/en_us_goadedes/he.h.m2:heHE.AntitheonProstagma.name
ltx/en_us_goadedes/oc.m2.d4:ocMA.OdeW7C23.mode	@ltx/en_us_goadedes/miscellanea:misc.Mode2
ltx/en_us_goadedes/oc.m2.d4:ocMA.OdeW7C23.ode	@ltx/en_us_goadedes/miscellanea:misc.Ode7
ltx/en_us_goadedes/oc.m2.d4:ocMA.OdeW7C23.text	The furnace in Babylon of old prefigured * your childbirth, O Virgin pure; for the Servants were not consumed; * neither was your womb consumed by the unbearable fire. * Therefore we implore you to deliver us, your servants, from the eternal fire.
ltx/en_us_goadedes/oc.m2.d4:ocMA.OdeW8C11.incipit	…
ltx/en_us_goadedes/oc.m2.d4:ocMA.OdeW8C11.melody	@ltx/en_us_goadedes/he.h.m2:heHE.KaminosPote.name
ltx/en_us_goadedes/oc.m2.d4:ocMA.OdeW8C11.mode	@ltx/en_us_goadedes/miscellanea:misc.Mode2
ltx/en_us_goadedes/oc.m2.d4:ocMA.OdeW8C11.ode	@ltx/en_us_goadedes/miscellanea:misc.Ode8
ltx/en_us_goadedes/oc.m2.d4:ocMA.OdeW8C11.text	
ltx/en_us_goadedes/oc.m2.d4:ocMA.OdeW8C12.incipit	…
ltx/en_us_goadedes/oc.m2.d4:ocMA.OdeW8C12.melody	@ltx/en_us_goadedes/he.h.m2:heHE.KaminosPote.name
ltx/en_us_goadedes/oc.m2.d4:ocMA.OdeW8C12.mode	@ltx/en_us_goadedes/miscellanea:misc.Mode2
ltx/en_us_goadedes/oc.m2.d4:ocMA.OdeW8C12.ode	@ltx/en_us_goadedes/miscellanea:misc.Ode8
ltx/en_us_goadedes/oc.m2.d4:ocMA.OdeW8C12.text	
ltx/en_us_goadedes/oc.m2.d4:ocMA.OdeW8C13.incipit	…
ltx/en_us_goadedes/oc.m2.d4:ocMA.OdeW8C13.melody	@ltx/en_us_goadedes/he.h.m2:heHE.KaminosPote.name
ltx/en_us_goadedes/oc.m2.d4:ocMA.OdeW8C13.mode	@ltx/en_us_goadedes/miscellanea:misc.Mode2
ltx/en_us_goadedes/oc.m2.d4:ocMA.OdeW8C13.ode	@ltx/en_us_goadedes/miscellanea:misc.Ode8
ltx/en_us_goadedes/oc.m2.d4:ocMA.OdeW8C13.text	
ltx/en_us_goadedes/oc.m2.d4:ocMA.OdeW8C14.incipit	…
ltx/en_us_goadedes/oc.m2.d4:ocMA.OdeW8C14.melody	@ltx/en_us_goadedes/he.h.m2:heHE.KaminosPote.name
ltx/en_us_goadedes/oc.m2.d4:ocMA.OdeW8C14.mode	@ltx/en_us_goadedes/miscellanea:misc.Mode2
ltx/en_us_goadedes/oc.m2.d4:ocMA.OdeW8C14.ode	@ltx/en_us_goadedes/miscellanea:misc.Ode8
ltx/en_us_goadedes/oc.m2.d4:ocMA.OdeW8C14.text	
ltx/en_us_goadedes/oc.m2.d4:ocMA.OdeW8C1H.greekmelody	@ltx/en_us_goadedes/he.h.m2:heHE.KaminosPote.greekname
ltx/en_us_goadedes/oc.m2.d4:ocMA.OdeW8C1H.incipit	@ltx/en_us_goadedes/he.h.m2:heHE.KaminosPote.incipit
ltx/en_us_goadedes/oc.m2.d4:ocMA.OdeW8C1H.melody	@ltx/en_us_goadedes/he.h.m2:heHE.KaminosPote.melody
ltx/en_us_goadedes/oc.m2.d4:ocMA.OdeW8C1H.mode	@ltx/en_us_goadedes/miscellanea:misc.Mode2
ltx/en_us_goadedes/oc.m2.d4:ocMA.OdeW8C1H.ode	@ltx/en_us_goadedes/miscellanea:misc.Ode8
ltx/en_us_goadedes/oc.m2.d4:ocMA.OdeW8C1H.text	@ltx/en_us_goadedes/he.h.m2:heHE.KaminosPote.text
ltx/en_us_goadedes/oc.m2.d4:ocMA.OdeW8C1T.incipit	…
ltx/en_us_goadedes/oc.m2.d4:ocMA.OdeW8C1T.melody	@ltx/en_us_goadedes/he.h.m2:heHE.KaminosPote.name
ltx/en_us_goadedes/oc.m2.d4:ocMA.OdeW8C1T.mode	@ltx/en_us_goadedes/miscellanea:misc.Mode2
ltx/en_us_goadedes/oc.m2.d4:ocMA.OdeW8C1T.ode	@ltx/en_us_goadedes/miscellanea:misc.Ode8
ltx/en_us_goadedes/oc.m2.d4:ocMA.OdeW8C1T.text	
ltx/en_us_goadedes/oc.m2.d4:ocMA.OdeW8C21.greekmelody	@ltx/en_us_goadedes/he.h.m2:heHE.KaminosPote.greekname
ltx/en_us_goadedes/oc.m2.d4:ocMA.OdeW8C21.incipit	Zealously pursue…
ltx/en_us_goadedes/oc.m2.d4:ocMA.OdeW8C21.melody	@ltx/en_us_goadedes/he.h.m2:heHE.KaminosPote.name
ltx/en_us_goadedes/oc.m2.d4:ocMA.OdeW8C21.mode	@ltx/en_us_goadedes/miscellanea:misc.Mode2
ltx/en_us_goadedes/oc.m2.d4:ocMA.OdeW8C21.ode	@ltx/en_us_goadedes/miscellanea:misc.Ode8
ltx/en_us_goadedes/oc.m2.d4:ocMA.OdeW8C21.text	Zealously pursue the virtues, through divine acts, * and keep your distance from all wickedness, my soul, for you have as your * intercessor the immaculate and sympathetic Mother of Christ our God, * the benevolent, kind protectress who never fails.
ltx/en_us_goadedes/oc.m2.d4:ocMA.OdeW8C22.incipit	Mother of our God…
ltx/en_us_goadedes/oc.m2.d4:ocMA.OdeW8C22.melody	@ltx/en_us_goadedes/he.h.m2:heHE.KaminosPote.name
ltx/en_us_goadedes/oc.m2.d4:ocMA.OdeW8C22.mode	@ltx/en_us_goadedes/miscellanea:misc.Mode2
ltx/en_us_goadedes/oc.m2.d4:ocMA.OdeW8C22.ode	@ltx/en_us_goadedes/miscellanea:misc.Ode8
ltx/en_us_goadedes/oc.m2.d4:ocMA.OdeW8C22.text	Mother of our God, you freed our human nature * from the ancestral bond and curse. And now, O immaculate * Virgin, I implore you, free my heart from everything that binds it to wickedness, * and bind me to the love of God who created me.
ltx/en_us_goadedes/oc.m2.d4:ocMA.OdeW8C23.incipit	Dismal is my heart…
ltx/en_us_goadedes/oc.m2.d4:ocMA.OdeW8C23.melody	@ltx/en_us_goadedes/he.h.m2:heHE.KaminosPote.name
ltx/en_us_goadedes/oc.m2.d4:ocMA.OdeW8C23.mode	@ltx/en_us_goadedes/miscellanea:misc.Mode2
ltx/en_us_goadedes/oc.m2.d4:ocMA.OdeW8C23.ode	@ltx/en_us_goadedes/miscellanea:misc.Ode8
ltx/en_us_goadedes/oc.m2.d4:ocMA.OdeW8C23.text	Dismal is my heart, inglorious from sinning. * O Theotokos, who gave birth to Him who is the reflection of * the Father’s glory, please make it shine. Let me partake of glory that never ends, * O all-blameless and blessed Virgin immaculate.
ltx/en_us_goadedes/oc.m2.d4:ocMA.OdeW9C11.incipit	…
ltx/en_us_goadedes/oc.m2.d4:ocMA.OdeW9C11.melody	@ltx/en_us_goadedes/he.h.m2:heHE.AnarchouGennitoros.name
ltx/en_us_goadedes/oc.m2.d4:ocMA.OdeW9C11.mode	@ltx/en_us_goadedes/miscellanea:misc.Mode2
ltx/en_us_goadedes/oc.m2.d4:ocMA.OdeW9C11.ode	@ltx/en_us_goadedes/miscellanea:misc.Ode9
ltx/en_us_goadedes/oc.m2.d4:ocMA.OdeW9C11.text	
ltx/en_us_goadedes/oc.m2.d4:ocMA.OdeW9C12.incipit	…
ltx/en_us_goadedes/oc.m2.d4:ocMA.OdeW9C12.melody	@ltx/en_us_goadedes/he.h.m2:heHE.AnarchouGennitoros.name
ltx/en_us_goadedes/oc.m2.d4:ocMA.OdeW9C12.mode	@ltx/en_us_goadedes/miscellanea:misc.Mode2
ltx/en_us_goadedes/oc.m2.d4:ocMA.OdeW9C12.ode	@ltx/en_us_goadedes/miscellanea:misc.Ode9
ltx/en_us_goadedes/oc.m2.d4:ocMA.OdeW9C12.text	
ltx/en_us_goadedes/oc.m2.d4:ocMA.OdeW9C13.incipit	…
ltx/en_us_goadedes/oc.m2.d4:ocMA.OdeW9C13.melody	@ltx/en_us_goadedes/he.h.m2:heHE.AnarchouGennitoros.name
ltx/en_us_goadedes/oc.m2.d4:ocMA.OdeW9C13.mode	@ltx/en_us_goadedes/miscellanea:misc.Mode2
ltx/en_us_goadedes/oc.m2.d4:ocMA.OdeW9C13.ode	@ltx/en_us_goadedes/miscellanea:misc.Ode9
ltx/en_us_goadedes/oc.m2.d4:ocMA.OdeW9C13.text	
ltx/en_us_goadedes/oc.m2.d4:ocMA.OdeW9C14.incipit	…
ltx/en_us_goadedes/oc.m2.d4:ocMA.OdeW9C14.melody	@ltx/en_us_goadedes/he.h.m2:heHE.AnarchouGennitoros.name
ltx/en_us_goadedes/oc.m2.d4:ocMA.OdeW9C14.mode	@ltx/en_us_goadedes/miscellanea:misc.Mode2
ltx/en_us_goadedes/oc.m2.d4:ocMA.OdeW9C14.ode	@ltx/en_us_goadedes/miscellanea:misc.Ode9
ltx/en_us_goadedes/oc.m2.d4:ocMA.OdeW9C14.text	
ltx/en_us_goadedes/oc.m2.d4:ocMA.OdeW9C1H.greekmelody	@ltx/en_us_goadedes/he.h.m2:heHE.AnarchouGennitoros.greekname
ltx/en_us_goadedes/oc.m2.d4:ocMA.OdeW9C1H.incipit	@ltx/en_us_goadedes/he.h.m2:heHE.AnarchouGennitoros.incipit
ltx/en_us_goadedes/oc.m2.d4:ocMA.OdeW9C1H.melody	@ltx/en_us_goadedes/he.h.m2:heHE.AnarchouGennitoros.melody
ltx/en_us_goadedes/oc.m2.d4:ocMA.OdeW9C1H.mode	@ltx/en_us_goadedes/miscellanea:misc.Mode2
ltx/en_us_goadedes/oc.m2.d4:ocMA.OdeW9C1H.ode	@ltx/en_us_goadedes/miscellanea:misc.Ode9
ltx/en_us_goadedes/oc.m2.d4:ocMA.OdeW9C1H.text	@ltx/en_us_goadedes/he.h.m2:heHE.AnarchouGennitoros.text
ltx/en_us_goadedes/oc.m2.d4:ocMA.OdeW9C1T.incipit	…
ltx/en_us_goadedes/oc.m2.d4:ocMA.OdeW9C1T.melody	@ltx/en_us_goadedes/he.h.m2:heHE.AnarchouGennitoros.name
ltx/en_us_goadedes/oc.m2.d4:ocMA.OdeW9C1T.mode	@ltx/en_us_goadedes/miscellanea:misc.Mode2
ltx/en_us_goadedes/oc.m2.d4:ocMA.OdeW9C1T.ode	@ltx/en_us_goadedes/miscellanea:misc.Ode9
ltx/en_us_goadedes/oc.m2.d4:ocMA.OdeW9C1T.text	
ltx/en_us_goadedes/oc.m2.d4:ocMA.OdeW9C21.greekmelody	@ltx/en_us_goadedes/he.h.m2:heHE.AnarchouGennitoros.greekname
ltx/en_us_goadedes/oc.m2.d4:ocMA.OdeW9C21.incipit	When Adam succumbed…
ltx/en_us_goadedes/oc.m2.d4:ocMA.OdeW9C21.melody	@ltx/en_us_goadedes/he.h.m2:heHE.AnarchouGennitoros.name
ltx/en_us_goadedes/oc.m2.d4:ocMA.OdeW9C21.mode	@ltx/en_us_goadedes/miscellanea:misc.Mode2
ltx/en_us_goadedes/oc.m2.d4:ocMA.OdeW9C21.ode	@ltx/en_us_goadedes/miscellanea:misc.Ode9
ltx/en_us_goadedes/oc.m2.d4:ocMA.OdeW9C21.text	When Adam succumbed and ate forbidden fruit, he bitterly * garnered death and mortality from the tree of old. * When your Son was willingly nailed to the holy tree, He poured out the sweetness * of true immortality. Hence we honor you, O Virgin pure.
ltx/en_us_goadedes/oc.m2.d4:ocMA.OdeW9C22.incipit	O Lady, the Queen…
ltx/en_us_goadedes/oc.m2.d4:ocMA.OdeW9C22.melody	@ltx/en_us_goadedes/he.h.m2:heHE.AnarchouGennitoros.name
ltx/en_us_goadedes/oc.m2.d4:ocMA.OdeW9C22.mode	@ltx/en_us_goadedes/miscellanea:misc.Mode2
ltx/en_us_goadedes/oc.m2.d4:ocMA.OdeW9C22.ode	@ltx/en_us_goadedes/miscellanea:misc.Ode9
ltx/en_us_goadedes/oc.m2.d4:ocMA.OdeW9C22.text	O Lady, the Queen are you, for you gave birth ineffably * to the King and the Lord, who dissolved the realm of hell. * O all-holy Virgin, implore Him, that He account worthy of the kingdom * of heaven your servants all, who with faith and longing sing your praise.
ltx/en_us_goadedes/oc.m2.d4:ocMA.OdeW9C23.incipit	O Lady, I pray you…
ltx/en_us_goadedes/oc.m2.d4:ocMA.OdeW9C23.melody	@ltx/en_us_goadedes/he.h.m2:heHE.AnarchouGennitoros.name
ltx/en_us_goadedes/oc.m2.d4:ocMA.OdeW9C23.mode	@ltx/en_us_goadedes/miscellanea:misc.Mode2
ltx/en_us_goadedes/oc.m2.d4:ocMA.OdeW9C23.ode	@ltx/en_us_goadedes/miscellanea:misc.Ode9
ltx/en_us_goadedes/oc.m2.d4:ocMA.OdeW9C23.text	O Lady, I pray you to do good to my pathetic heart, * for indulgence in pleasure has harmed and wounded it. * You have given birth to the Good God, and you yourself are good, blessed Virgin. * To the good and open gates of repentance please direct my steps.
ltx/en_us_goadedes/oc.m2.d4:ocVE.ApolTheotokionVM.incipit	@ltx/en_us_goadedes/oc.m2.d1:ocMA.Kathisma13.incipit
ltx/en_us_goadedes/oc.m2.d4:ocVE.ApolTheotokionVM.melody	
ltx/en_us_goadedes/oc.m2.d4:ocVE.ApolTheotokionVM.mode	@ltx/en_us_goadedes/miscellanea:misc.Mode2
ltx/en_us_goadedes/oc.m2.d4:ocVE.ApolTheotokionVM.text	@ltx/en_us_goadedes/oc.m2.d1:ocMA.Kathisma13.text
ltx/en_us_goadedes/oc.m2.d4:ocVE.AposTheotokion.greekmelody	@ltx/en_us_goadedes/he.a.m2:heAU.OteEkTouXylou.greekname
ltx/en_us_goadedes/oc.m2.d4:ocVE.AposTheotokion.incipit	…
ltx/en_us_goadedes/oc.m2.d4:ocVE.AposTheotokion.melody	@ltx/en_us_goadedes/he.a.m2:heAU.OteEkTouXylou.name
ltx/en_us_goadedes/oc.m2.d4:ocVE.AposTheotokion.mode	@ltx/en_us_goadedes/miscellanea:misc.Mode2
ltx/en_us_goadedes/oc.m2.d4:ocVE.AposTheotokion.text	
ltx/en_us_goadedes/oc.m2.d4:ocVE.Aposticha1.incipit	…
ltx/en_us_goadedes/oc.m2.d4:ocVE.Aposticha1.melody	
ltx/en_us_goadedes/oc.m2.d4:ocVE.Aposticha1.mode	@ltx/en_us_goadedes/miscellanea:misc.Mode2
ltx/en_us_goadedes/oc.m2.d4:ocVE.Aposticha1.text	
ltx/en_us_goadedes/oc.m2.d4:ocVE.Aposticha2.incipit	…
ltx/en_us_goadedes/oc.m2.d4:ocVE.Aposticha2.melody	
ltx/en_us_goadedes/oc.m2.d4:ocVE.Aposticha2.mode	@ltx/en_us_goadedes/miscellanea:misc.Mode2
ltx/en_us_goadedes/oc.m2.d4:ocVE.Aposticha2.text	
ltx/en_us_goadedes/oc.m2.d4:ocVE.Aposticha3.incipit	…
ltx/en_us_goadedes/oc.m2.d4:ocVE.Aposticha3.melody	
ltx/en_us_goadedes/oc.m2.d4:ocVE.Aposticha3.mode	@ltx/en_us_goadedes/miscellanea:misc.Mode2
ltx/en_us_goadedes/oc.m2.d4:ocVE.Aposticha3.text	
ltx/en_us_goadedes/oc.m2.d4:ocVE.SticTheotokion.greekmelody	@ltx/en_us_goadedes/he.a.m2:heAU.OteEkTouXylou.greekname
ltx/en_us_goadedes/oc.m2.d4:ocVE.SticTheotokion.incipit	…
ltx/en_us_goadedes/oc.m2.d4:ocVE.SticTheotokion.melody	@ltx/en_us_goadedes/he.a.m2:heAU.OteEkTouXylou.name
ltx/en_us_goadedes/oc.m2.d4:ocVE.SticTheotokion.mode	@ltx/en_us_goadedes/miscellanea:misc.Mode2
ltx/en_us_goadedes/oc.m2.d4:ocVE.SticTheotokion.text	
ltx/en_us_goadedes/oc.m2.d4:ocVE.Stichera1.greekmelody	@ltx/en_us_goadedes/he.a.m2:heAU.OteEkTouXylou.greekname
ltx/en_us_goadedes/oc.m2.d4:ocVE.Stichera1.incipit	…
ltx/en_us_goadedes/oc.m2.d4:ocVE.Stichera1.melody	@ltx/en_us_goadedes/he.a.m2:heAU.OteEkTouXylou.name
ltx/en_us_goadedes/oc.m2.d4:ocVE.Stichera1.mode	@ltx/en_us_goadedes/miscellanea:misc.Mode2
ltx/en_us_goadedes/oc.m2.d4:ocVE.Stichera1.text	
ltx/en_us_goadedes/oc.m2.d4:ocVE.Stichera2.incipit	…
ltx/en_us_goadedes/oc.m2.d4:ocVE.Stichera2.melody	@ltx/en_us_goadedes/he.a.m2:heAU.OteEkTouXylou.name
ltx/en_us_goadedes/oc.m2.d4:ocVE.Stichera2.mode	@ltx/en_us_goadedes/miscellanea:misc.Mode2
ltx/en_us_goadedes/oc.m2.d4:ocVE.Stichera2.text	
ltx/en_us_goadedes/oc.m2.d4:ocVE.Stichera3.incipit	…
ltx/en_us_goadedes/oc.m2.d4:ocVE.Stichera3.melody	@ltx/en_us_goadedes/he.a.m2:heAU.OteEkTouXylou.name
ltx/en_us_goadedes/oc.m2.d4:ocVE.Stichera3.mode	@ltx/en_us_goadedes/miscellanea:misc.Mode2
ltx/en_us_goadedes/oc.m2.d4:ocVE.Stichera3.text	
ltx/en_us_goadedes/oc.m2.d4:ocVE.Stichera4.greekmelody	@ltx/en_us_goadedes/he.a.m2:heAU.OteEkTouXylou.greekname
ltx/en_us_goadedes/oc.m2.d4:ocVE.Stichera4.incipit	Lady, you are riches…
ltx/en_us_goadedes/oc.m2.d4:ocVE.Stichera4.melody	@ltx/en_us_goadedes/he.a.m2:heAU.OteEkTouXylou.name
ltx/en_us_goadedes/oc.m2.d4:ocVE.Stichera4.mode	@ltx/en_us_goadedes/miscellanea:misc.Mode2
ltx/en_us_goadedes/oc.m2.d4:ocVE.Stichera4.text	Lady, you are riches for the poor, * and for the impoverished comfort, a place of refuge and hope * for the orphaned children. Also we who suffer distress * glorify you and honor you. O all-holy Virgin, * quickly hear your servants’ prayers and come to rescue us * from every assault of the demons, * and from terrifying perdition, * and from condemnation to eternal hell.
ltx/en_us_goadedes/oc.m2.d4:ocVE.Stichera5.incipit	Truly rising up over my head…
ltx/en_us_goadedes/oc.m2.d4:ocVE.Stichera5.melody	@ltx/en_us_goadedes/he.a.m2:heAU.OteEkTouXylou.name
ltx/en_us_goadedes/oc.m2.d4:ocVE.Stichera5.mode	@ltx/en_us_goadedes/miscellanea:misc.Mode2
ltx/en_us_goadedes/oc.m2.d4:ocVE.Stichera5.text	Truly rising up over my head * are the many sins and transgressions that I committed indeed; * truly they have multiplied more than the hairs of my head. * O pure Virgin, I have incurred innumerable burdens, * too heavy for me, incorrigible wretch that I am. * Please come quickly, help me and save me, * by your prayers and strong intercession; * for you can restore those who committed sins.
ltx/en_us_goadedes/oc.m2.d4:ocVE.Stichera6.incipit	…
ltx/en_us_goadedes/oc.m2.d4:ocVE.Stichera6.melody	@ltx/en_us_goadedes/he.a.m2:heAU.OteEkTouXylou.name
ltx/en_us_goadedes/oc.m2.d4:ocVE.Stichera6.mode	@ltx/en_us_goadedes/miscellanea:misc.Mode2
ltx/en_us_goadedes/oc.m2.d4:ocVE.Stichera6.text	
ltx/en_us_goadedes/oc.m2.d4:octrMA.Kathisma11.incipit	@ltx/en_us_goadedes/oc.m2.d4:ocMA.Kathisma12.incipit
ltx/en_us_goadedes/oc.m2.d4:octrMA.Kathisma11.melody	
ltx/en_us_goadedes/oc.m2.d4:octrMA.Kathisma11.mode	@ltx/en_us_goadedes/miscellanea:misc.Mode2
ltx/en_us_goadedes/oc.m2.d4:octrMA.Kathisma11.text	@ltx/en_us_goadedes/oc.m2.d4:ocMA.Kathisma12.text
ltx/en_us_goadedes/oc.m2.d4:octrMA.Kathisma12.incipit	…
ltx/en_us_goadedes/oc.m2.d4:octrMA.Kathisma12.melody	
ltx/en_us_goadedes/oc.m2.d4:octrMA.Kathisma12.mode	@ltx/en_us_goadedes/miscellanea:misc.Mode2
ltx/en_us_goadedes/oc.m2.d4:octrMA.Kathisma12.text	
ltx/en_us_goadedes/oc.m2.d4:octrMA.Kathisma1T.incipit	@ltx/en_us_goadedes/oc.m2.d4:ocMA.Kathisma13.incipit
ltx/en_us_goadedes/oc.m2.d4:octrMA.Kathisma1T.melody	
ltx/en_us_goadedes/oc.m2.d4:octrMA.Kathisma1T.mode	@ltx/en_us_goadedes/miscellanea:misc.Mode2
ltx/en_us_goadedes/oc.m2.d4:octrMA.Kathisma1T.text	@ltx/en_us_goadedes/oc.m2.d4:ocMA.Kathisma13.text
ltx/en_us_goadedes/oc.m2.d4:octrMA.Ode7Martyricon.incipit	@ltx/en_us_goadedes/oc.m2.d4:ocMA.Kathisma32.incipit
ltx/en_us_goadedes/oc.m2.d4:octrMA.Ode7Martyricon.melody	
ltx/en_us_goadedes/oc.m2.d4:octrMA.Ode7Martyricon.mode	@ltx/en_us_goadedes/miscellanea:misc.Mode2
ltx/en_us_goadedes/oc.m2.d4:octrMA.Ode7Martyricon.text	@ltx/en_us_goadedes/oc.m2.d4:ocMA.Kathisma32.text
ltx/en_us_goadedes/oc.m2.d4:octrMA.Photogogic.incipit	@ltx/en_us_goadedes/oc.m2.d2:octrMA.Photagogic.incipit
ltx/en_us_goadedes/oc.m2.d4:octrMA.Photogogic.mode	@ltx/en_us_goadedes/miscellanea:misc.Mode2
ltx/en_us_goadedes/oc.m2.d4:octrMA.Photogogic.text	@ltx/en_us_goadedes/oc.m2.d2:octrMA.Photagogic.text
ltx/en_us_goadedes/oc.m2.d4:octrMA.Triadic1.incipit	@ltx/en_us_goadedes/oc.m2.d2:octrMA.Triadic1.incipit
ltx/en_us_goadedes/oc.m2.d4:octrMA.Triadic1.mode	@ltx/en_us_goadedes/miscellanea:misc.Mode2
ltx/en_us_goadedes/oc.m2.d4:octrMA.Triadic1.text	@ltx/en_us_goadedes/oc.m2.d2:octrMA.Triadic1.text
ltx/en_us_goadedes/oc.m2.d4:octrMA.Triadic2.incipit	@ltx/en_us_goadedes/oc.m2.d2:octrMA.Triadic2.incipit
ltx/en_us_goadedes/oc.m2.d4:octrMA.Triadic2.mode	@ltx/en_us_goadedes/miscellanea:misc.Mode2
ltx/en_us_goadedes/oc.m2.d4:octrMA.Triadic2.text	@ltx/en_us_goadedes/oc.m2.d2:octrMA.Triadic2.text
ltx/en_us_goadedes/oc.m2.d4:octrMA.Triadic3.incipit	@ltx/en_us_goadedes/oc.m2.d2:octrMA.Triadic3.incipit
ltx/en_us_goadedes/oc.m2.d4:octrMA.Triadic3.mode	@ltx/en_us_goadedes/miscellanea:misc.Mode2
ltx/en_us_goadedes/oc.m2.d4:octrMA.Triadic3.text	@ltx/en_us_goadedes/oc.m2.d2:octrMA.Triadic3.text
