ltx/en_us_goadedes/other.stgerasimosofamerica1:hoCA.Apolytikion1.greekmelody	@ltx/en_us_goadedes/he.a.m4:heAU.OYpsotheisEnToStavro.greekname
ltx/en_us_goadedes/other.stgerasimosofamerica1:hoCA.Apolytikion1.incipit	Let us extol our all-devout…
ltx/en_us_goadedes/other.stgerasimosofamerica1:hoCA.Apolytikion1.melody	@ltx/en_us_goadedes/he.a.m4:heAU.OYpsotheisEnToStavro.name
ltx/en_us_goadedes/other.stgerasimosofamerica1:hoCA.Apolytikion1.mode	@ltx/en_us_goadedes/miscellanea:misc.Mode4
ltx/en_us_goadedes/other.stgerasimosofamerica1:hoCA.Apolytikion1.text	Let us extol and praise devout St. Gerasimos, * who came from Greece to serve the Church in America, * as an enlightened teacher and a hierarch. * He was an exemplar of godly love, peace, and of wisdom, * scholarship and holiness. Let us pray to him, saying: * “Give us who need enlightenment your words * of God-inspired instruction, O Saint of God.”
ltx/en_us_goadedes/other.stgerasimosofamerica1:hoCA.Apolytikion2.incipit	@ltx/en_us_goadedes/ho.ho23:hoCA.Apolytikion2.incipit
ltx/en_us_goadedes/other.stgerasimosofamerica1:hoCA.Apolytikion2.melody	@ltx/en_us_goadedes/ho.ho23:hoCA.Apolytikion2.melody
ltx/en_us_goadedes/other.stgerasimosofamerica1:hoCA.Apolytikion2.mode	@ltx/en_us_goadedes/ho.ho23:hoCA.Apolytikion2.mode
ltx/en_us_goadedes/other.stgerasimosofamerica1:hoCA.Apolytikion2.text	@ltx/en_us_goadedes/ho.ho23:hoCA.Apolytikion2.text
ltx/en_us_goadedes/other.stgerasimosofamerica1:hoCA.Insert1	our devout and God-bearing father Gerasimos of America,
ltx/en_us_goadedes/other.stgerasimosofamerica1:hoCA.Kathisma11.greekmelody	@ltx/en_us_goadedes/he.a.m2:heAU.TaAnoZiton.greekname
ltx/en_us_goadedes/other.stgerasimosofamerica1:hoCA.Kathisma11.incipit	We pray, never cease…
ltx/en_us_goadedes/other.stgerasimosofamerica1:hoCA.Kathisma11.melody	@ltx/en_us_goadedes/he.a.m2:heAU.TaAnoZiton.name
ltx/en_us_goadedes/other.stgerasimosofamerica1:hoCA.Kathisma11.mode	@ltx/en_us_goadedes/miscellanea:misc.Mode2
ltx/en_us_goadedes/other.stgerasimosofamerica1:hoCA.Kathisma11.text	We pray, never cease imploring Christ our King and God * to send down to us, the faithful, His abundant grace. * Blessed St. Gerasimos, * our beloved and thrice-blessed hierarch, * we extol your efforts to promote * our sanctification in America.
ltx/en_us_goadedes/other.stgerasimosofamerica1:hoCA.Kontakion.incipit	Let us extol that blameless hierarch…
ltx/en_us_goadedes/other.stgerasimosofamerica1:hoCA.Kontakion.melody	@ltx/en_us_goadedes/he.a.m2:heAU.ToisTonAimatonSou.name
ltx/en_us_goadedes/other.stgerasimosofamerica1:hoCA.Kontakion.mode	@ltx/en_us_goadedes/miscellanea:misc.Mode2
ltx/en_us_goadedes/other.stgerasimosofamerica1:hoCA.Kontakion.text	Let us extol that blameless hierarch Gerasimos, * the humble scholar and professor of New Testament. * The Holy Spirit filled his soul with many gifts of grace. * He was a spiritual father in America. * And even now he helps and blesses all who pray to him.
ltx/en_us_goadedes/other.stgerasimosofamerica1:hoCA.Meg00.incipit	@ltx/en_us_goadedes/ho.ho03:hoMA.Ode9.Meg00.incipit
ltx/en_us_goadedes/other.stgerasimosofamerica1:hoCA.Meg00.text	@ltx/en_us_goadedes/ho.ho03:hoMA.Ode9.Meg00.text
ltx/en_us_goadedes/other.stgerasimosofamerica1:hoCA.Meg01.incipit	@ltx/en_us_goadedes/he.h.m6:heHE.TinTimioteran.incipit
ltx/en_us_goadedes/other.stgerasimosofamerica1:hoCA.Meg01.melody	@ltx/en_us_goadedes/he.h.m6:heHE.TinTimioteran.melody
ltx/en_us_goadedes/other.stgerasimosofamerica1:hoCA.Meg01.text	@ltx/en_us_goadedes/he.h.m6:heHE.TinTimioteran.text
ltx/en_us_goadedes/other.stgerasimosofamerica1:hoCA.Meg02.incipit	Now we all salute you…
ltx/en_us_goadedes/other.stgerasimosofamerica1:hoCA.Meg02.melody	@ltx/en_us_goadedes/he.h.m6:heHE.TinTimioteran.name
ltx/en_us_goadedes/other.stgerasimosofamerica1:hoCA.Meg02.text	Now we all salute you and sing, “Rejoice!” * Hierarchs, confessors, and professors admire you. * America has you, her God-appointed guardian * and spiritual father, blessed Gerasimos.
ltx/en_us_goadedes/other.stgerasimosofamerica1:hoCA.Meg03.incipit	Father, we extol you…
ltx/en_us_goadedes/other.stgerasimosofamerica1:hoCA.Meg03.melody	@ltx/en_us_goadedes/he.h.m6:heHE.TinTimioteran.name
ltx/en_us_goadedes/other.stgerasimosofamerica1:hoCA.Meg03.text	Father, we extol you who came from Greece. * You instructed students who would go on to serve as priests. * You were both a scholar and God-inspired bishop, * with gifts of grace abounding, blessed Gerasimos.
ltx/en_us_goadedes/other.stgerasimosofamerica1:hoCA.Meg04.incipit	Even in retirement…
ltx/en_us_goadedes/other.stgerasimosofamerica1:hoCA.Meg04.melody	@ltx/en_us_goadedes/he.h.m6:heHE.TinTimioteran.name
ltx/en_us_goadedes/other.stgerasimosofamerica1:hoCA.Meg04.text	Even in retirement, when you lived * at the School in Brookline, many students were drawn to Christ, * guided on the path to salvation by your counsels. * We therefore magnify you our Saint Gerasimos.
ltx/en_us_goadedes/other.stgerasimosofamerica1:hoCA.Meg05.incipit	When you were in Pittsburgh…
ltx/en_us_goadedes/other.stgerasimosofamerica1:hoCA.Meg05.melody	@ltx/en_us_goadedes/he.h.m6:heHE.TinTimioteran.name
ltx/en_us_goadedes/other.stgerasimosofamerica1:hoCA.Meg05.text	When you were in Pittsburgh and led the flock * of Christ in that district with divine sympathy and love, * you taught all to hold to the Christian faith and ethos. * We honor you, O holy bishop Gerasimos.
ltx/en_us_goadedes/other.stgerasimosofamerica1:hoCA.Meg06.incipit	On the Holy Hill…
ltx/en_us_goadedes/other.stgerasimosofamerica1:hoCA.Meg06.melody	@ltx/en_us_goadedes/he.h.m6:heHE.TinTimioteran.name
ltx/en_us_goadedes/other.stgerasimosofamerica1:hoCA.Meg06.text	On the Holy Hill, by the grace of Christ, * you were a professor of theology, and you led * your spiritual children to holiness, O father * Gerasimos. And now all the faithful honor you.
ltx/en_us_goadedes/other.stgerasimosofamerica1:hoCA.Meg07.incipit	Mightily protect us…
ltx/en_us_goadedes/other.stgerasimosofamerica1:hoCA.Meg07.melody	@ltx/en_us_goadedes/he.h.m6:heHE.TinTimioteran.name
ltx/en_us_goadedes/other.stgerasimosofamerica1:hoCA.Meg07.text	Mightily protect us who honor you, * who were known as Bishop of Avydu, O man of God. * Especially guard the United States, O father, * where all the faithful honor you, St. Gerasimos.
ltx/en_us_goadedes/other.stgerasimosofamerica1:hoCA.Meg0F.incipit	@ltx/en_us_goadedes/ho.ho23:hoCA.Meg0F.incipit
ltx/en_us_goadedes/other.stgerasimosofamerica1:hoCA.Meg0F.melody	@ltx/en_us_goadedes/he.h.m6:heHE.TinTimioteran.name
ltx/en_us_goadedes/other.stgerasimosofamerica1:hoCA.Meg0F.text	@ltx/en_us_goadedes/ho.ho23:hoCA.Meg0F.text
ltx/en_us_goadedes/other.stgerasimosofamerica1:hoCA.Ode11.greekmelody	@ltx/en_us_goadedes/he.h.m8:heHE.YgranDiodefsas.greekname
ltx/en_us_goadedes/other.stgerasimosofamerica1:hoCA.Ode11.incipit	O bishop Gerasimos…
ltx/en_us_goadedes/other.stgerasimosofamerica1:hoCA.Ode11.melody	@ltx/en_us_goadedes/he.h.m8:heHE.YgranDiodefsas.name
ltx/en_us_goadedes/other.stgerasimosofamerica1:hoCA.Ode11.mode	@ltx/en_us_goadedes/miscellanea:misc.Mode8
ltx/en_us_goadedes/other.stgerasimosofamerica1:hoCA.Ode11.ode	@ltx/en_us_goadedes/miscellanea:misc.Ode1
ltx/en_us_goadedes/other.stgerasimosofamerica1:hoCA.Ode11.text	O bishop Gerasimos, guiding light * and teacher of virtue in America, never cease * dispelling the darkness of our passions, * by your most luminous words and your prayers to God.
ltx/en_us_goadedes/other.stgerasimosofamerica1:hoCA.Ode12.incipit	O blessed Gerasimos…
ltx/en_us_goadedes/other.stgerasimosofamerica1:hoCA.Ode12.melody	@ltx/en_us_goadedes/he.h.m8:heHE.YgranDiodefsas.name
ltx/en_us_goadedes/other.stgerasimosofamerica1:hoCA.Ode12.mode	@ltx/en_us_goadedes/miscellanea:misc.Mode8
ltx/en_us_goadedes/other.stgerasimosofamerica1:hoCA.Ode12.ode	@ltx/en_us_goadedes/miscellanea:misc.Ode1
ltx/en_us_goadedes/other.stgerasimosofamerica1:hoCA.Ode12.text	O blessed Gerasimos, God indeed * was pleased by your manner and your disciplined way of life. * With sympathy hear us who entreat you, * and who rely on your prayers to the Lord for us.
ltx/en_us_goadedes/other.stgerasimosofamerica1:hoCA.Ode13.incipit	From youth you ignored…
ltx/en_us_goadedes/other.stgerasimosofamerica1:hoCA.Ode13.melody	@ltx/en_us_goadedes/he.h.m8:heHE.YgranDiodefsas.name
ltx/en_us_goadedes/other.stgerasimosofamerica1:hoCA.Ode13.mode	@ltx/en_us_goadedes/miscellanea:misc.Mode8
ltx/en_us_goadedes/other.stgerasimosofamerica1:hoCA.Ode13.ode	@ltx/en_us_goadedes/miscellanea:misc.Ode1
ltx/en_us_goadedes/other.stgerasimosofamerica1:hoCA.Ode13.text	From youth you ignored everything mundane * and fleeting, O father, and devoted yourself to God. * We pray that you help us to aspire * to things eternal, O righteous Gerasimos.
ltx/en_us_goadedes/other.stgerasimosofamerica1:hoCA.Ode1T.incipit	We seek your assistance…
ltx/en_us_goadedes/other.stgerasimosofamerica1:hoCA.Ode1T.melody	@ltx/en_us_goadedes/he.h.m8:heHE.YgranDiodefsas.name
ltx/en_us_goadedes/other.stgerasimosofamerica1:hoCA.Ode1T.mode	@ltx/en_us_goadedes/miscellanea:misc.Mode8
ltx/en_us_goadedes/other.stgerasimosofamerica1:hoCA.Ode1T.ode	@ltx/en_us_goadedes/miscellanea:misc.Ode1
ltx/en_us_goadedes/other.stgerasimosofamerica1:hoCA.Ode1T.text	We seek your assistance and pray with faith, * O pure Theotokos. We implore you to wash away * the filth of our passions, with the help of * your Son’s disciple and friend, St. Gerasimos.
ltx/en_us_goadedes/other.stgerasimosofamerica1:hoCA.Ode31.greekmelody	@ltx/en_us_goadedes/he.h.m8:heHE.OuraniasApsidos.greekname
ltx/en_us_goadedes/other.stgerasimosofamerica1:hoCA.Ode31.incipit	Erudition and virtue…
ltx/en_us_goadedes/other.stgerasimosofamerica1:hoCA.Ode31.melody	@ltx/en_us_goadedes/he.h.m8:heHE.OuraniasApsidos.name
ltx/en_us_goadedes/other.stgerasimosofamerica1:hoCA.Ode31.mode	@ltx/en_us_goadedes/miscellanea:misc.Mode8
ltx/en_us_goadedes/other.stgerasimosofamerica1:hoCA.Ode31.ode	@ltx/en_us_goadedes/miscellanea:misc.Ode3
ltx/en_us_goadedes/other.stgerasimosofamerica1:hoCA.Ode31.text	Erudition and virtue made you a model for both * bishops and professors, O blessed father Gerasimos. * We pray you grant to all who magnify you with longing * to know what is good and beneficial for our souls.
ltx/en_us_goadedes/other.stgerasimosofamerica1:hoCA.Ode32.incipit	Sympathetically hear us…
ltx/en_us_goadedes/other.stgerasimosofamerica1:hoCA.Ode32.melody	@ltx/en_us_goadedes/he.h.m8:heHE.OuraniasApsidos.name
ltx/en_us_goadedes/other.stgerasimosofamerica1:hoCA.Ode32.mode	@ltx/en_us_goadedes/miscellanea:misc.Mode8
ltx/en_us_goadedes/other.stgerasimosofamerica1:hoCA.Ode32.ode	@ltx/en_us_goadedes/miscellanea:misc.Ode3
ltx/en_us_goadedes/other.stgerasimosofamerica1:hoCA.Ode32.text	Sympathetically hear us who supplicate you, O Saint. * Save us from demonic deception and every harm to us, * who joyfully present our sacred hymns to extol you, * holy and illustrious bishop Gerasimos.
ltx/en_us_goadedes/other.stgerasimosofamerica1:hoCA.Ode33.incipit	As you wished to converse…
ltx/en_us_goadedes/other.stgerasimosofamerica1:hoCA.Ode33.melody	@ltx/en_us_goadedes/he.h.m8:heHE.OuraniasApsidos.name
ltx/en_us_goadedes/other.stgerasimosofamerica1:hoCA.Ode33.mode	@ltx/en_us_goadedes/miscellanea:misc.Mode8
ltx/en_us_goadedes/other.stgerasimosofamerica1:hoCA.Ode33.ode	@ltx/en_us_goadedes/miscellanea:misc.Ode3
ltx/en_us_goadedes/other.stgerasimosofamerica1:hoCA.Ode33.text	As you wished to converse with the Lord alone through your prayers, * you alloted quality time daily to accomplish this, * avoiding foolish disputes and useless banter and gossip. * Help us to avoid all this, blessed Gerasimos.
ltx/en_us_goadedes/other.stgerasimosofamerica1:hoCA.Ode3T.incipit	Ever-virgin, all-blessed…
ltx/en_us_goadedes/other.stgerasimosofamerica1:hoCA.Ode3T.melody	@ltx/en_us_goadedes/he.h.m8:heHE.OuraniasApsidos.name
ltx/en_us_goadedes/other.stgerasimosofamerica1:hoCA.Ode3T.mode	@ltx/en_us_goadedes/miscellanea:misc.Mode8
ltx/en_us_goadedes/other.stgerasimosofamerica1:hoCA.Ode3T.ode	@ltx/en_us_goadedes/miscellanea:misc.Ode3
ltx/en_us_goadedes/other.stgerasimosofamerica1:hoCA.Ode3T.text	Ever-virgin, all-blessed, most holy Mother of God, * intercede for me with your only-begotten Son and Lord, * to cleanse me from the stain of all my sins and offences, * and to wash me thoroughly from all my lawlessness.
ltx/en_us_goadedes/other.stgerasimosofamerica1:hoCA.Ode41.greekmelody	@ltx/en_us_goadedes/he.h.m8:heHE.EisakikoaKyrie.greekname
ltx/en_us_goadedes/other.stgerasimosofamerica1:hoCA.Ode41.incipit	As a son of Corinthia…
ltx/en_us_goadedes/other.stgerasimosofamerica1:hoCA.Ode41.melody	@ltx/en_us_goadedes/he.h.m8:heHE.EisakikoaKyrie.name
ltx/en_us_goadedes/other.stgerasimosofamerica1:hoCA.Ode41.mode	@ltx/en_us_goadedes/miscellanea:misc.Mode8
ltx/en_us_goadedes/other.stgerasimosofamerica1:hoCA.Ode41.ode	@ltx/en_us_goadedes/miscellanea:misc.Ode4
ltx/en_us_goadedes/other.stgerasimosofamerica1:hoCA.Ode41.text	As a son of Corinthia, * you became a resident of St. Anna’s Skete * on Mt. Athos, O Gerasimos. * Free us who extol you from temptations all.
ltx/en_us_goadedes/other.stgerasimosofamerica1:hoCA.Ode42.incipit	You wholeheartedly sought…
ltx/en_us_goadedes/other.stgerasimosofamerica1:hoCA.Ode42.melody	@ltx/en_us_goadedes/he.h.m8:heHE.EisakikoaKyrie.name
ltx/en_us_goadedes/other.stgerasimosofamerica1:hoCA.Ode42.mode	@ltx/en_us_goadedes/miscellanea:misc.Mode8
ltx/en_us_goadedes/other.stgerasimosofamerica1:hoCA.Ode42.ode	@ltx/en_us_goadedes/miscellanea:misc.Ode4
ltx/en_us_goadedes/other.stgerasimosofamerica1:hoCA.Ode42.text	You wholeheartedly sought to please * God in every way, blessed St. Gerasimos. * Intercede with Him on our behalf * to alleviate our pain and suffering.
ltx/en_us_goadedes/other.stgerasimosofamerica1:hoCA.Ode43.incipit	When you taught…
ltx/en_us_goadedes/other.stgerasimosofamerica1:hoCA.Ode43.melody	@ltx/en_us_goadedes/he.h.m8:heHE.EisakikoaKyrie.name
ltx/en_us_goadedes/other.stgerasimosofamerica1:hoCA.Ode43.mode	@ltx/en_us_goadedes/miscellanea:misc.Mode8
ltx/en_us_goadedes/other.stgerasimosofamerica1:hoCA.Ode43.ode	@ltx/en_us_goadedes/miscellanea:misc.Ode4
ltx/en_us_goadedes/other.stgerasimosofamerica1:hoCA.Ode43.text	When you taught on the Holy Hill, * you enlightened students and seminarians. * Now we pray you, St. Gerasimos, * to dispel the darkness of our ignorance.
ltx/en_us_goadedes/other.stgerasimosofamerica1:hoCA.Ode4T.incipit	Redirect me towards holiness…
ltx/en_us_goadedes/other.stgerasimosofamerica1:hoCA.Ode4T.melody	@ltx/en_us_goadedes/he.h.m8:heHE.EisakikoaKyrie.name
ltx/en_us_goadedes/other.stgerasimosofamerica1:hoCA.Ode4T.mode	@ltx/en_us_goadedes/miscellanea:misc.Mode8
ltx/en_us_goadedes/other.stgerasimosofamerica1:hoCA.Ode4T.ode	@ltx/en_us_goadedes/miscellanea:misc.Ode4
ltx/en_us_goadedes/other.stgerasimosofamerica1:hoCA.Ode4T.text	Redirect me towards holiness, * blessed Theotokos and Virgin full of grace, * at the prayers of St. Gerasimos, * the believers’ modern-day inerrant guide.
ltx/en_us_goadedes/other.stgerasimosofamerica1:hoCA.Ode51.greekmelody	@ltx/en_us_goadedes/he.h.m8:heHE.FotisonImas.greekname
ltx/en_us_goadedes/other.stgerasimosofamerica1:hoCA.Ode51.incipit	Drive away the night…
ltx/en_us_goadedes/other.stgerasimosofamerica1:hoCA.Ode51.melody	@ltx/en_us_goadedes/he.h.m8:heHE.FotisonImas.name
ltx/en_us_goadedes/other.stgerasimosofamerica1:hoCA.Ode51.mode	@ltx/en_us_goadedes/miscellanea:misc.Mode8
ltx/en_us_goadedes/other.stgerasimosofamerica1:hoCA.Ode51.ode	@ltx/en_us_goadedes/miscellanea:misc.Ode5
ltx/en_us_goadedes/other.stgerasimosofamerica1:hoCA.Ode51.text	Drive away the night * of the passions with the brilliant light * of your earnest supplications to the Lord * for the faithful who implore you, St. Gerasimos.
ltx/en_us_goadedes/other.stgerasimosofamerica1:hoCA.Ode52.incipit	Shaken by the cares…
ltx/en_us_goadedes/other.stgerasimosofamerica1:hoCA.Ode52.melody	@ltx/en_us_goadedes/he.h.m8:heHE.FotisonImas.name
ltx/en_us_goadedes/other.stgerasimosofamerica1:hoCA.Ode52.mode	@ltx/en_us_goadedes/miscellanea:misc.Mode8
ltx/en_us_goadedes/other.stgerasimosofamerica1:hoCA.Ode52.ode	@ltx/en_us_goadedes/miscellanea:misc.Ode5
ltx/en_us_goadedes/other.stgerasimosofamerica1:hoCA.Ode52.text	Shaken by the cares * of our daily life, we pray to you * to support as you did the parishes * that you shepherded as bishop, O Gerasimos.
ltx/en_us_goadedes/other.stgerasimosofamerica1:hoCA.Ode53.incipit	Since you have attained…
ltx/en_us_goadedes/other.stgerasimosofamerica1:hoCA.Ode53.melody	@ltx/en_us_goadedes/he.h.m8:heHE.FotisonImas.name
ltx/en_us_goadedes/other.stgerasimosofamerica1:hoCA.Ode53.mode	@ltx/en_us_goadedes/miscellanea:misc.Mode8
ltx/en_us_goadedes/other.stgerasimosofamerica1:hoCA.Ode53.ode	@ltx/en_us_goadedes/miscellanea:misc.Ode5
ltx/en_us_goadedes/other.stgerasimosofamerica1:hoCA.Ode53.text	Since you have attained * heights of virtue, we rely on you * to assist us on the way that leads us up * to the mansions in the heavens, O Gerasimos.
ltx/en_us_goadedes/other.stgerasimosofamerica1:hoCA.Ode5T.incipit	Always pray for us…
ltx/en_us_goadedes/other.stgerasimosofamerica1:hoCA.Ode5T.melody	@ltx/en_us_goadedes/he.h.m8:heHE.FotisonImas.name
ltx/en_us_goadedes/other.stgerasimosofamerica1:hoCA.Ode5T.mode	@ltx/en_us_goadedes/miscellanea:misc.Mode8
ltx/en_us_goadedes/other.stgerasimosofamerica1:hoCA.Ode5T.ode	@ltx/en_us_goadedes/miscellanea:misc.Ode5
ltx/en_us_goadedes/other.stgerasimosofamerica1:hoCA.Ode5T.text	Always pray for us * and dispel the clouds of misery * with your light, all-blessed Mother of our God, * when your servants are confronted with calamity.
ltx/en_us_goadedes/other.stgerasimosofamerica1:hoCA.Ode61.greekmelody	@ltx/en_us_goadedes/he.h.m8:heHE.TinDeisinEkcheo.greekname
ltx/en_us_goadedes/other.stgerasimosofamerica1:hoCA.Ode61.incipit	Gerasimos, by your holy way…
ltx/en_us_goadedes/other.stgerasimosofamerica1:hoCA.Ode61.melody	@ltx/en_us_goadedes/he.h.m8:heHE.TinDeisinEkcheo.name
ltx/en_us_goadedes/other.stgerasimosofamerica1:hoCA.Ode61.mode	@ltx/en_us_goadedes/miscellanea:misc.Mode8
ltx/en_us_goadedes/other.stgerasimosofamerica1:hoCA.Ode61.ode	@ltx/en_us_goadedes/miscellanea:misc.Ode6
ltx/en_us_goadedes/other.stgerasimosofamerica1:hoCA.Ode61.text	Gerasimos, by your holy way of life * and your wise and inspirational teachings, * you blessed the cities of Pittsburgh and Brookline. * You were a blameless professor of future priests. * And now you earnestly implore * the Redeemer for all those who pray to you. 
ltx/en_us_goadedes/other.stgerasimosofamerica1:hoCA.Ode62.incipit	We think of you…
ltx/en_us_goadedes/other.stgerasimosofamerica1:hoCA.Ode62.melody	@ltx/en_us_goadedes/he.h.m8:heHE.TinDeisinEkcheo.name
ltx/en_us_goadedes/other.stgerasimosofamerica1:hoCA.Ode62.mode	@ltx/en_us_goadedes/miscellanea:misc.Mode8
ltx/en_us_goadedes/other.stgerasimosofamerica1:hoCA.Ode62.ode	@ltx/en_us_goadedes/miscellanea:misc.Ode6
ltx/en_us_goadedes/other.stgerasimosofamerica1:hoCA.Ode62.text	We think of you, O devout and humble Saint, * as a precious gem and peer of the fathers. * We pray you, help us, your spiritual children, * to be victorious over the enemy * and to defeat him by the might * of the life-giving Cross, O Gerasimos.
ltx/en_us_goadedes/other.stgerasimosofamerica1:hoCA.Ode63.incipit	We pray to you…
ltx/en_us_goadedes/other.stgerasimosofamerica1:hoCA.Ode63.melody	@ltx/en_us_goadedes/he.h.m8:heHE.TinDeisinEkcheo.name
ltx/en_us_goadedes/other.stgerasimosofamerica1:hoCA.Ode63.mode	@ltx/en_us_goadedes/miscellanea:misc.Mode8
ltx/en_us_goadedes/other.stgerasimosofamerica1:hoCA.Ode63.ode	@ltx/en_us_goadedes/miscellanea:misc.Ode6
ltx/en_us_goadedes/other.stgerasimosofamerica1:hoCA.Ode63.text	We pray to you, and indeed rely on you * to assist us in pursuing a peaceful, * God-pleasing life, so that we who extol you * may not be sentenced to hell and eternal fire, * O godly-minded and divine * theologian and bishop Gerasimos.
ltx/en_us_goadedes/other.stgerasimosofamerica1:hoCA.Ode6T.incipit	Persistently pray…
ltx/en_us_goadedes/other.stgerasimosofamerica1:hoCA.Ode6T.melody	@ltx/en_us_goadedes/he.h.m8:heHE.TinDeisinEkcheo.name
ltx/en_us_goadedes/other.stgerasimosofamerica1:hoCA.Ode6T.mode	@ltx/en_us_goadedes/miscellanea:misc.Mode8
ltx/en_us_goadedes/other.stgerasimosofamerica1:hoCA.Ode6T.ode	@ltx/en_us_goadedes/miscellanea:misc.Ode6
ltx/en_us_goadedes/other.stgerasimosofamerica1:hoCA.Ode6T.text	Persistently pray to Christ the King of peace, * that He send to us the peace that surpasses * all understanding, O all-holy Lady, * and that He hear us, your servants, when we invoke * your holy prayers as well as those * of our all-holy bishop Gerasimos.
ltx/en_us_goadedes/other.stgerasimosofamerica1:hoCA.Ode71.greekmelody	@ltx/en_us_goadedes/he.h.m8:heHE.OiEkTisIoudaias.greekname
ltx/en_us_goadedes/other.stgerasimosofamerica1:hoCA.Ode71.incipit	You directed your students…
ltx/en_us_goadedes/other.stgerasimosofamerica1:hoCA.Ode71.melody	@ltx/en_us_goadedes/he.h.m8:heHE.OiEkTisIoudaias.name
ltx/en_us_goadedes/other.stgerasimosofamerica1:hoCA.Ode71.mode	@ltx/en_us_goadedes/miscellanea:misc.Mode8
ltx/en_us_goadedes/other.stgerasimosofamerica1:hoCA.Ode71.ode	@ltx/en_us_goadedes/miscellanea:misc.Ode7
ltx/en_us_goadedes/other.stgerasimosofamerica1:hoCA.Ode71.text	You directed your students * in the ways of the Lord, O devout Gerasimos. * Now we with faith implore you * to guide us to divine joy * and to life that will never end, * by your entreaties for us, who gratefully extol you.
ltx/en_us_goadedes/other.stgerasimosofamerica1:hoCA.Ode72.incipit	By your presence…
ltx/en_us_goadedes/other.stgerasimosofamerica1:hoCA.Ode72.melody	@ltx/en_us_goadedes/he.h.m8:heHE.OiEkTisIoudaias.name
ltx/en_us_goadedes/other.stgerasimosofamerica1:hoCA.Ode72.mode	@ltx/en_us_goadedes/miscellanea:misc.Mode8
ltx/en_us_goadedes/other.stgerasimosofamerica1:hoCA.Ode72.ode	@ltx/en_us_goadedes/miscellanea:misc.Ode7
ltx/en_us_goadedes/other.stgerasimosofamerica1:hoCA.Ode72.text	By your presence you blessed us * at the school of theology on the Holy Hill. * We pray that you continue * to bless us who extol you * as a saint, O Gerasimos, * now in the company of the Church’s sainted bishops.
ltx/en_us_goadedes/other.stgerasimosofamerica1:hoCA.Ode73.incipit	Quickly come to assist us…
ltx/en_us_goadedes/other.stgerasimosofamerica1:hoCA.Ode73.melody	@ltx/en_us_goadedes/he.h.m8:heHE.OiEkTisIoudaias.name
ltx/en_us_goadedes/other.stgerasimosofamerica1:hoCA.Ode73.mode	@ltx/en_us_goadedes/miscellanea:misc.Mode8
ltx/en_us_goadedes/other.stgerasimosofamerica1:hoCA.Ode73.ode	@ltx/en_us_goadedes/miscellanea:misc.Ode7
ltx/en_us_goadedes/other.stgerasimosofamerica1:hoCA.Ode73.text	Quickly come to assist us, * when our life becomes difficult, St. Gerasimos, * we fervently entreat you, * whom Christ our God has given * to the Church in America, * to intercede on behalf of all who sing your praises.
ltx/en_us_goadedes/other.stgerasimosofamerica1:hoCA.Ode7T.incipit	Holy Mother of Christ God…
ltx/en_us_goadedes/other.stgerasimosofamerica1:hoCA.Ode7T.melody	@ltx/en_us_goadedes/he.h.m8:heHE.OiEkTisIoudaias.name
ltx/en_us_goadedes/other.stgerasimosofamerica1:hoCA.Ode7T.mode	@ltx/en_us_goadedes/miscellanea:misc.Mode8
ltx/en_us_goadedes/other.stgerasimosofamerica1:hoCA.Ode7T.ode	@ltx/en_us_goadedes/miscellanea:misc.Ode7
ltx/en_us_goadedes/other.stgerasimosofamerica1:hoCA.Ode7T.text	Holy Mother of Christ God, * I implore you to be my Directress, pointing me * towards celestial mansions, * all pure and blessed Virgin, * as the sure and inerrant guide * for humankind to sincere repentance and salvation.
ltx/en_us_goadedes/other.stgerasimosofamerica1:hoCA.Ode81.greekmelody	@ltx/en_us_goadedes/he.h.m8:heHE.TonVasileaTonOuranon.greekname
ltx/en_us_goadedes/other.stgerasimosofamerica1:hoCA.Ode81.incipit	O holy father…
ltx/en_us_goadedes/other.stgerasimosofamerica1:hoCA.Ode81.melody	@ltx/en_us_goadedes/he.h.m8:heHE.TonVasileaTonOuranon.name
ltx/en_us_goadedes/other.stgerasimosofamerica1:hoCA.Ode81.mode	@ltx/en_us_goadedes/miscellanea:misc.Mode8
ltx/en_us_goadedes/other.stgerasimosofamerica1:hoCA.Ode81.ode	@ltx/en_us_goadedes/miscellanea:misc.Ode8
ltx/en_us_goadedes/other.stgerasimosofamerica1:hoCA.Ode81.text	O holy father, dispel the darkness of sorrow * and offences from us who extol you, * by your supplications to God that shine like sunlight.
ltx/en_us_goadedes/other.stgerasimosofamerica1:hoCA.Ode82.incipit	Be not dismissive…
ltx/en_us_goadedes/other.stgerasimosofamerica1:hoCA.Ode82.melody	@ltx/en_us_goadedes/he.h.m8:heHE.TonVasileaTonOuranon.name
ltx/en_us_goadedes/other.stgerasimosofamerica1:hoCA.Ode82.mode	@ltx/en_us_goadedes/miscellanea:misc.Mode8
ltx/en_us_goadedes/other.stgerasimosofamerica1:hoCA.Ode82.ode	@ltx/en_us_goadedes/miscellanea:misc.Ode8
ltx/en_us_goadedes/other.stgerasimosofamerica1:hoCA.Ode82.text	Be not dismissive of our entreaties, O blessed * St. Gerasimos, rather present them * to the Lord our God, as a hierarch and high priest. 
ltx/en_us_goadedes/other.stgerasimosofamerica1:hoCA.Ode83.incipit	From heaven guard us…
ltx/en_us_goadedes/other.stgerasimosofamerica1:hoCA.Ode83.melody	@ltx/en_us_goadedes/he.h.m8:heHE.TonVasileaTonOuranon.name
ltx/en_us_goadedes/other.stgerasimosofamerica1:hoCA.Ode83.mode	@ltx/en_us_goadedes/miscellanea:misc.Mode8
ltx/en_us_goadedes/other.stgerasimosofamerica1:hoCA.Ode83.ode	@ltx/en_us_goadedes/miscellanea:misc.Ode8
ltx/en_us_goadedes/other.stgerasimosofamerica1:hoCA.Ode83.text	From heaven guard us, who seek the grace you were given, * O Gerasimos, as a successor * of the Lord’s Apostles in doctrine and demeanor.
ltx/en_us_goadedes/other.stgerasimosofamerica1:hoCA.Ode8T.incipit	I pray you, Lady…
ltx/en_us_goadedes/other.stgerasimosofamerica1:hoCA.Ode8T.melody	@ltx/en_us_goadedes/he.h.m8:heHE.TonVasileaTonOuranon.name
ltx/en_us_goadedes/other.stgerasimosofamerica1:hoCA.Ode8T.mode	@ltx/en_us_goadedes/miscellanea:misc.Mode8
ltx/en_us_goadedes/other.stgerasimosofamerica1:hoCA.Ode8T.ode	@ltx/en_us_goadedes/miscellanea:misc.Ode8
ltx/en_us_goadedes/other.stgerasimosofamerica1:hoCA.Ode8T.text	I pray you, Lady, show me the way to repentance. * Give me strength to resist the deceiver, * O all-blessed Virgin, most holy Theotokos.
ltx/en_us_goadedes/other.stgerasimosofamerica1:hoCA.Ode91.greekmelody	@ltx/en_us_goadedes/he.h.m8:heHE.KyriosTheotokon.greekname
ltx/en_us_goadedes/other.stgerasimosofamerica1:hoCA.Ode91.incipit	We prayerfully extol you…
ltx/en_us_goadedes/other.stgerasimosofamerica1:hoCA.Ode91.melody	@ltx/en_us_goadedes/he.h.m8:heHE.KyriosTheotokon.name
ltx/en_us_goadedes/other.stgerasimosofamerica1:hoCA.Ode91.mode	@ltx/en_us_goadedes/miscellanea:misc.Mode8
ltx/en_us_goadedes/other.stgerasimosofamerica1:hoCA.Ode91.ode	@ltx/en_us_goadedes/miscellanea:misc.Ode9
ltx/en_us_goadedes/other.stgerasimosofamerica1:hoCA.Ode91.text	We prayerfully extol you * as our intercessor * with our Creator and God, O Gerasimos, * and as a vigilant guard of the holy Church of Christ.
ltx/en_us_goadedes/other.stgerasimosofamerica1:hoCA.Ode92.incipit	Remember us, O father…
ltx/en_us_goadedes/other.stgerasimosofamerica1:hoCA.Ode92.melody	@ltx/en_us_goadedes/he.h.m8:heHE.KyriosTheotokon.name
ltx/en_us_goadedes/other.stgerasimosofamerica1:hoCA.Ode92.mode	@ltx/en_us_goadedes/miscellanea:misc.Mode8
ltx/en_us_goadedes/other.stgerasimosofamerica1:hoCA.Ode92.ode	@ltx/en_us_goadedes/miscellanea:misc.Ode9
ltx/en_us_goadedes/other.stgerasimosofamerica1:hoCA.Ode92.text	Remember us, O father, * as we now extol you, * the sturdy pillar of faith and enlightener * of theological students, O St. Gerasimos.
ltx/en_us_goadedes/other.stgerasimosofamerica1:hoCA.Ode93.incipit	O godly father…
ltx/en_us_goadedes/other.stgerasimosofamerica1:hoCA.Ode93.melody	@ltx/en_us_goadedes/he.h.m8:heHE.KyriosTheotokon.name
ltx/en_us_goadedes/other.stgerasimosofamerica1:hoCA.Ode93.mode	@ltx/en_us_goadedes/miscellanea:misc.Mode8
ltx/en_us_goadedes/other.stgerasimosofamerica1:hoCA.Ode93.ode	@ltx/en_us_goadedes/miscellanea:misc.Ode9
ltx/en_us_goadedes/other.stgerasimosofamerica1:hoCA.Ode93.text	O godly father, bless us, * who with faith implore you * to ask the Lord to release us who honor you * from our inveterate passions, O St. Gerasimos.
ltx/en_us_goadedes/other.stgerasimosofamerica1:hoCA.Ode9T.incipit	Most holy Theotokos…
ltx/en_us_goadedes/other.stgerasimosofamerica1:hoCA.Ode9T.melody	@ltx/en_us_goadedes/he.h.m8:heHE.KyriosTheotokon.name
ltx/en_us_goadedes/other.stgerasimosofamerica1:hoCA.Ode9T.mode	@ltx/en_us_goadedes/miscellanea:misc.Mode8
ltx/en_us_goadedes/other.stgerasimosofamerica1:hoCA.Ode9T.ode	@ltx/en_us_goadedes/miscellanea:misc.Ode9
ltx/en_us_goadedes/other.stgerasimosofamerica1:hoCA.Ode9T.text	Most holy Theotokos, * the immortal fountain * of holy joy for all people, refresh the souls * of those in pain and affliction, who sing your hymns of praise.
ltx/en_us_goadedes/other.stgerasimosofamerica1:hoCA.PostGospelBoth.incipit	@ltx/en_us_goadedes/ho.ho03:hoMA.PostGospelTheotokos.incipit
ltx/en_us_goadedes/other.stgerasimosofamerica1:hoCA.PostGospelBoth.melody	
ltx/en_us_goadedes/other.stgerasimosofamerica1:hoCA.PostGospelBoth.mode	@ltx/en_us_goadedes/miscellanea:misc.Mode2
ltx/en_us_goadedes/other.stgerasimosofamerica1:hoCA.PostGospelBoth.text	@ltx/en_us_goadedes/ho.ho03:hoMA.PostGospelTheotokos.text
ltx/en_us_goadedes/other.stgerasimosofamerica1:hoCA.PostGospelGlory.incipit	@ltx/en_us_goadedes/ho.ho03:hoMA.PostGospelHierarch.incipit
ltx/en_us_goadedes/other.stgerasimosofamerica1:hoCA.PostGospelGlory.melody	
ltx/en_us_goadedes/other.stgerasimosofamerica1:hoCA.PostGospelGlory.mode	@ltx/en_us_goadedes/miscellanea:misc.Mode2
ltx/en_us_goadedes/other.stgerasimosofamerica1:hoCA.PostGospelGlory.text	@ltx/en_us_goadedes/ho.ho03:hoMA.PostGospelHierarch.text
ltx/en_us_goadedes/other.stgerasimosofamerica1:hoCA.PostGospelHymn1.greekmelody	@ltx/en_us_goadedes/he.a.m6:heAU.OlinApothemenoi.greekname
ltx/en_us_goadedes/other.stgerasimosofamerica1:hoCA.PostGospelHymn1.incipit	Man of God, Gerasimos…
ltx/en_us_goadedes/other.stgerasimosofamerica1:hoCA.PostGospelHymn1.melody	@ltx/en_us_goadedes/he.a.m6:heAU.OlinApothemenoi.name
ltx/en_us_goadedes/other.stgerasimosofamerica1:hoCA.PostGospelHymn1.mode	@ltx/en_us_goadedes/miscellanea:misc.Mode6
ltx/en_us_goadedes/other.stgerasimosofamerica1:hoCA.PostGospelHymn1.text	Man of God, Gerasimos, you are a solid foundation * of the holy Church of Christ, * born in Greece and flourishing in America. * You were a virtuous and enlightened bishop. * You instructed seminarians. * Hear us who pray to you. * Rescue us from evils and tragedies, * all-blessed Saint, and save us from * ever being harmed by the evil one; * and we shall extol you, the torch that shines the light of God on all, * the inexhaustible reservoir of the holy love of Christ.
ltx/en_us_goadedes/other.stgerasimosofamerica1:hoCA.Troparion1.greekmelody	@ltx/en_us_goadedes/he.a.m2:heAU.OteEkTouXylou.greekname
ltx/en_us_goadedes/other.stgerasimosofamerica1:hoCA.Troparion1.incipit	Hear us who in earnest…
ltx/en_us_goadedes/other.stgerasimosofamerica1:hoCA.Troparion1.melody	@ltx/en_us_goadedes/he.a.m2:heAU.OteEkTouXylou.name
ltx/en_us_goadedes/other.stgerasimosofamerica1:hoCA.Troparion1.mode	@ltx/en_us_goadedes/miscellanea:misc.Mode2
ltx/en_us_goadedes/other.stgerasimosofamerica1:hoCA.Troparion1.text	Hear us who in earnest pray to you. * Send to us the grace of the Spirit that richly flows from you. * Paragon of gentleness and of humility, * precious jewel of America, * both Pittsburgh and Brookline * boast for having hosted you, O St. Gerasimos, * for you were the faithful exemplar * of the love of Christ for His people. * Therefore we all prayerfully now honor you. 
ltx/en_us_goadedes/other.stgerasimosofamerica1:hoCA.Troparion2.incipit	@ltx/en_us_goadedes/ho.ho23:hoCA.Troparion6.incipit
ltx/en_us_goadedes/other.stgerasimosofamerica1:hoCA.Troparion2.melody	
ltx/en_us_goadedes/other.stgerasimosofamerica1:hoCA.Troparion2.mode	@ltx/en_us_goadedes/miscellanea:misc.Mode2
ltx/en_us_goadedes/other.stgerasimosofamerica1:hoCA.Troparion2.text	@ltx/en_us_goadedes/ho.ho23:hoCA.Troparion6.text
ltx/en_us_goadedes/other.stgerasimosofamerica1:hoCA.Troparion3.incipit	@ltx/en_us_goadedes/ho.ho23:hoCA.Troparion7.incipit
ltx/en_us_goadedes/other.stgerasimosofamerica1:hoCA.Troparion3.melody	
ltx/en_us_goadedes/other.stgerasimosofamerica1:hoCA.Troparion3.mode	@ltx/en_us_goadedes/miscellanea:misc.Mode2
ltx/en_us_goadedes/other.stgerasimosofamerica1:hoCA.Troparion3.text	@ltx/en_us_goadedes/ho.ho23:hoCA.Troparion7.text
ltx/en_us_goadedes/other.stgerasimosofamerica1:hoCA.Troparion31.incipit	O Spirit-filled…
ltx/en_us_goadedes/other.stgerasimosofamerica1:hoCA.Troparion31.melody	
ltx/en_us_goadedes/other.stgerasimosofamerica1:hoCA.Troparion31.mode	@ltx/en_us_goadedes/miscellanea:misc.Mode8
ltx/en_us_goadedes/other.stgerasimosofamerica1:hoCA.Troparion31.text	O Spirit-filled, * all-holy bishop Gerasimos, we entreat you * to direct us who with devotion honor your memory, * and to guide us to knowledge and salvation.
ltx/en_us_goadedes/other.stgerasimosofamerica1:hoCA.Troparion32.incipit	@ltx/en_us_goadedes/ho.ho23:hoCA.Troparion32.incipit
ltx/en_us_goadedes/other.stgerasimosofamerica1:hoCA.Troparion32.melody	
ltx/en_us_goadedes/other.stgerasimosofamerica1:hoCA.Troparion32.mode	@ltx/en_us_goadedes/miscellanea:misc.Mode8
ltx/en_us_goadedes/other.stgerasimosofamerica1:hoCA.Troparion32.text	@ltx/en_us_goadedes/ho.ho23:hoCA.Troparion32.text
ltx/en_us_goadedes/other.stgerasimosofamerica1:hoCA.Troparion61.incipit	@ltx/en_us_goadedes/other.stgerasimosofamerica1:hoCA.Troparion31.incipit
ltx/en_us_goadedes/other.stgerasimosofamerica1:hoCA.Troparion61.melody	
ltx/en_us_goadedes/other.stgerasimosofamerica1:hoCA.Troparion61.mode	@ltx/en_us_goadedes/miscellanea:misc.Mode8
ltx/en_us_goadedes/other.stgerasimosofamerica1:hoCA.Troparion61.text	@ltx/en_us_goadedes/other.stgerasimosofamerica1:hoCA.Troparion31.text
ltx/en_us_goadedes/other.stgerasimosofamerica1:hoCA.Troparion62.incipit	@ltx/en_us_goadedes/ho.ho23:hoCA.Troparion62.incipit
ltx/en_us_goadedes/other.stgerasimosofamerica1:hoCA.Troparion62.melody	
ltx/en_us_goadedes/other.stgerasimosofamerica1:hoCA.Troparion62.mode	@ltx/en_us_goadedes/miscellanea:misc.Mode8
ltx/en_us_goadedes/other.stgerasimosofamerica1:hoCA.Troparion62.text	@ltx/en_us_goadedes/ho.ho23:hoCA.Troparion62.text
ltx/en_us_goadedes/other.stgerasimosofamerica1:hoCA.acrostic.notice1	which has an acrostic in the Theotokia:
ltx/en_us_goadedes/other.stgerasimosofamerica1:hoCA.acrostic.text	“Seraphim”
ltx/en_us_goadedes/other.stgerasimosofamerica1:hoCA.acrostic.title	The Canon,
ltx/en_us_goadedes/other.stgerasimosofamerica1:hoCA.couplet1.title	Couplet
ltx/en_us_goadedes/other.stgerasimosofamerica1:hoCA.couplet1.verse1	Gracious Gerasimos, remember me to the Savior,
ltx/en_us_goadedes/other.stgerasimosofamerica1:hoCA.couplet1.verse2	imploring Him to overlook this Seraphim’s misbehavior.
ltx/en_us_goadedes/other.stgerasimosofamerica1:hoCA.media.text	
ltx/en_us_goadedes/other.stgerasimosofamerica1:hoCA.poet	English text by Fr. Seraphim Dedes
ltx/en_us_goadedes/other.stgerasimosofamerica1:hoCA.title1	SUPPLICATION SERVICE
ltx/en_us_goadedes/other.stgerasimosofamerica1:hoCA.title2	TO OUR DEVOUT AND GOD-BEARING FATHER
ltx/en_us_goadedes/other.stgerasimosofamerica1:hoCA.title3	GERASIMOS
ltx/en_us_goadedes/other.stgerasimosofamerica1:hoCA.title4	BISHOP OF ABYDUS
ltx/en_us_goadedes/other.stgerasimosofamerica1:hoCA.title5	AMERICA’s TEACHER OF PEACE AND LOVE
ltx/en_us_goadedes/other.stgerasimosofamerica1:hoCA.title6	Reposed in peace on June 12, 1995
ltx/en_us_goadedes/other.stgerasimosofamerica1:hoCA.translator	
ltx/en_us_goadedes/other.stgerasimosofamerica1:hoCA.verse	@ltx/en_us_goadedes/prayers:pr.verse_SaintM.text
