ltx/en_us_goadedes/ho.ho15.m10:ho.Days	
ltx/en_us_goadedes/ho.ho15.m10:ho.Hours	
ltx/en_us_goadedes/ho.ho15.m10:ho.Month	
ltx/en_us_goadedes/ho.ho15.m10:hoD04.GeneralApolytikion1.name	
ltx/en_us_goadedes/ho.ho15.m10:hoD09.GeneralApolytikion3.name	
ltx/en_us_goadedes/ho.ho15.m10:hoD11.GeneralApolytikion1.name	
ltx/en_us_goadedes/ho.ho15.m10:hoD11.GeneralApolytikion2.name	
ltx/en_us_goadedes/ho.ho15.m10:hoD12.Apolytikion1.greekmelody	@ltx/en_us_goadedes/he.a.m5:heAU.TonSynanarchonLogon.greekname
ltx/en_us_goadedes/ho.ho15.m10:hoD12.Apolytikion1.incipit	@ltx/en_us_goadedes/oc.m5.d3:ocMA.Kathisma32.incipit
ltx/en_us_goadedes/ho.ho15.m10:hoD12.Apolytikion1.melody	@ltx/en_us_goadedes/he.a.m5:heAU.TonSynanarchonLogon.name
ltx/en_us_goadedes/ho.ho15.m10:hoD12.Apolytikion1.mode	@ltx/en_us_goadedes/miscellanea:misc.Mode5
ltx/en_us_goadedes/ho.ho15.m10:hoD12.Apolytikion1.text	@ltx/en_us_goadedes/oc.m5.d3:ocMA.Kathisma32.text
ltx/en_us_goadedes/ho.ho15.m10:hoD12.Apolytikion1.title	
ltx/en_us_goadedes/ho.ho15.m10:hoD14.GeneralApolytikion3.name	
ltx/en_us_goadedes/ho.ho15.m10:hoD19.GeneralApolytikion1.name	
ltx/en_us_goadedes/ho.ho15.m10:hoD22.GeneralApolytikion1.name	
ltx/en_us_goadedes/ho.ho15.m10:hoD28.GeneralApolytikion4.name	
ltx/en_us_goadedes/ho.ho15.m10:hoD29.GeneralApolytikion3.name	
