ltx/en_us_goadedes/eu.consecration:euCA.MM.Ode1.text	@ltx/en_us_goadedes/properties:media.key
ltx/en_us_goadedes/eu.consecration:euCA.MM.Ode3.text	@ltx/en_us_goadedes/properties:media.key
ltx/en_us_goadedes/eu.consecration:euCA.MM.Ode4.text	@ltx/en_us_goadedes/properties:media.key
ltx/en_us_goadedes/eu.consecration:euCA.MM.Ode5.text	@ltx/en_us_goadedes/properties:media.key
ltx/en_us_goadedes/eu.consecration:euCA.MM.Ode6.text	@ltx/en_us_goadedes/properties:media.key
ltx/en_us_goadedes/eu.consecration:euCA.MM.Ode7.text	@ltx/en_us_goadedes/properties:media.key
ltx/en_us_goadedes/eu.consecration:euCA.MM.Ode8.text	@ltx/en_us_goadedes/properties:media.key
ltx/en_us_goadedes/eu.consecration:euCA.MM.Ode9.text	@ltx/en_us_goadedes/properties:media.key
ltx/en_us_goadedes/eu.consecration:euCA.Ode11.greekmelody	@ltx/en_us_goadedes/he.h.m4:heHE.ThalassisToErythraion.greekname
ltx/en_us_goadedes/eu.consecration:euCA.Ode11.incipit	You led the chosen people…
ltx/en_us_goadedes/eu.consecration:euCA.Ode11.melody	@ltx/en_us_goadedes/he.h.m4:heHE.ThalassisToErythraion.name
ltx/en_us_goadedes/eu.consecration:euCA.Ode11.mode	@ltx/en_us_goadedes/miscellanea:misc.Mode4
ltx/en_us_goadedes/eu.consecration:euCA.Ode11.ode	@ltx/en_us_goadedes/miscellanea:misc.Ode1
ltx/en_us_goadedes/eu.consecration:euCA.Ode11.text	You led the chosen people of Israel using a cloud long ago. * And now in Zion You planted Your Church * through the water of baptism, * O Christ, and she cries out to all, * “Come, let us sing unto our God a song.”
ltx/en_us_goadedes/eu.consecration:euCA.Ode12.incipit	Today the descending…
ltx/en_us_goadedes/eu.consecration:euCA.Ode12.melody	@ltx/en_us_goadedes/he.h.m4:heHE.ThalassisToErythraion.name
ltx/en_us_goadedes/eu.consecration:euCA.Ode12.mode	@ltx/en_us_goadedes/miscellanea:misc.Mode4
ltx/en_us_goadedes/eu.consecration:euCA.Ode12.ode	@ltx/en_us_goadedes/miscellanea:misc.Ode1
ltx/en_us_goadedes/eu.consecration:euCA.Ode12.text	Today the descending of Your glory, which is unapproachable, * has made this church, constructed here on earth, * into heaven, O Christ our God. * In it we all together sing, * “Come, let us sing unto our God a song.”
ltx/en_us_goadedes/eu.consecration:euCA.Ode13.incipit	O Savior, Your Church…
ltx/en_us_goadedes/eu.consecration:euCA.Ode13.melody	@ltx/en_us_goadedes/he.h.m4:heHE.ThalassisToErythraion.name
ltx/en_us_goadedes/eu.consecration:euCA.Ode13.mode	@ltx/en_us_goadedes/miscellanea:misc.Mode4
ltx/en_us_goadedes/eu.consecration:euCA.Ode13.ode	@ltx/en_us_goadedes/miscellanea:misc.Ode1
ltx/en_us_goadedes/eu.consecration:euCA.Ode13.text	O Savior, Your Church is decorated not by ritual rules of the Law, * nor by the slavish lifting of the hands. * But she sings to You, boasting in * the grace of Your all-holy Cross, * “Come, let us sing unto our God a song.”
ltx/en_us_goadedes/eu.consecration:euCA.Ode1T.incipit	The Father so willed…
ltx/en_us_goadedes/eu.consecration:euCA.Ode1T.melody	@ltx/en_us_goadedes/he.h.m4:heHE.ThalassisToErythraion.name
ltx/en_us_goadedes/eu.consecration:euCA.Ode1T.mode	@ltx/en_us_goadedes/miscellanea:misc.Mode4
ltx/en_us_goadedes/eu.consecration:euCA.Ode1T.ode	@ltx/en_us_goadedes/miscellanea:misc.Ode1
ltx/en_us_goadedes/eu.consecration:euCA.Ode1T.text	The Father so willed, and by the Holy Spirit without seed you conceived * the Son of God and bore Him in the flesh, * whom the Father begot without * a mother, and whom you brought forth * without a father, for the sake of all.
ltx/en_us_goadedes/eu.consecration:euCA.Ode31.greekmelody	@ltx/en_us_goadedes/he.h.m4:heHE.EffrainetaiEpiSoi.greekname
ltx/en_us_goadedes/eu.consecration:euCA.Ode31.incipit	Anointing this holy Church…
ltx/en_us_goadedes/eu.consecration:euCA.Ode31.melody	@ltx/en_us_goadedes/he.h.m4:heHE.EffrainetaiEpiSoi.name
ltx/en_us_goadedes/eu.consecration:euCA.Ode31.mode	@ltx/en_us_goadedes/miscellanea:misc.Mode4
ltx/en_us_goadedes/eu.consecration:euCA.Ode31.ode	@ltx/en_us_goadedes/miscellanea:misc.Ode3
ltx/en_us_goadedes/eu.consecration:euCA.Ode31.text	Anointing this holy Church * with oil of gladness here on earth today, * by Your all-holy Spirit’s grace * You have sanctified it, O Christ our God.
ltx/en_us_goadedes/eu.consecration:euCA.Ode32.incipit	O Christ, this Your holy Church…
ltx/en_us_goadedes/eu.consecration:euCA.Ode32.melody	@ltx/en_us_goadedes/he.h.m4:heHE.EffrainetaiEpiSoi.name
ltx/en_us_goadedes/eu.consecration:euCA.Ode32.mode	@ltx/en_us_goadedes/miscellanea:misc.Mode4
ltx/en_us_goadedes/eu.consecration:euCA.Ode32.ode	@ltx/en_us_goadedes/miscellanea:misc.Ode3
ltx/en_us_goadedes/eu.consecration:euCA.Ode32.text	O Christ, this Your holy Church * has its unbreakable foundation in You; * and now Your most holy Cross, * like a royal crown, is surmounting it.
ltx/en_us_goadedes/eu.consecration:euCA.Ode33.incipit	Benevolent Lord…
ltx/en_us_goadedes/eu.consecration:euCA.Ode33.melody	@ltx/en_us_goadedes/he.h.m4:heHE.EffrainetaiEpiSoi.name
ltx/en_us_goadedes/eu.consecration:euCA.Ode33.mode	@ltx/en_us_goadedes/miscellanea:misc.Mode4
ltx/en_us_goadedes/eu.consecration:euCA.Ode33.ode	@ltx/en_us_goadedes/miscellanea:misc.Ode3
ltx/en_us_goadedes/eu.consecration:euCA.Ode33.text	Benevolent Lord, today * You make this building, that was made by hands, * to providentially house * Your glory, divine and ineffable.
ltx/en_us_goadedes/eu.consecration:euCA.Ode3T.incipit	From you only we on earth…
ltx/en_us_goadedes/eu.consecration:euCA.Ode3T.melody	@ltx/en_us_goadedes/he.h.m4:heHE.EffrainetaiEpiSoi.name
ltx/en_us_goadedes/eu.consecration:euCA.Ode3T.mode	@ltx/en_us_goadedes/miscellanea:misc.Mode4
ltx/en_us_goadedes/eu.consecration:euCA.Ode3T.ode	@ltx/en_us_goadedes/miscellanea:misc.Ode3
ltx/en_us_goadedes/eu.consecration:euCA.Ode3T.text	Through you only we on earth * procure divine and supernatural gifts, * all-holy Mother of God. * Therefore we salute you and sing, “Rejoice!”
ltx/en_us_goadedes/eu.consecration:euCA.Ode41.greekmelody	@ltx/en_us_goadedes/he.h.m4:heHE.EparthentaSeIdousa.greekname
ltx/en_us_goadedes/eu.consecration:euCA.Ode41.incipit	Now Your Church…
ltx/en_us_goadedes/eu.consecration:euCA.Ode41.melody	@ltx/en_us_goadedes/he.h.m4:heHE.EparthentaSeIdousa.name
ltx/en_us_goadedes/eu.consecration:euCA.Ode41.mode	@ltx/en_us_goadedes/miscellanea:misc.Mode4
ltx/en_us_goadedes/eu.consecration:euCA.Ode41.ode	@ltx/en_us_goadedes/miscellanea:misc.Ode4
ltx/en_us_goadedes/eu.consecration:euCA.Ode41.text	Now Your Church, O Christ, is not sprinkled like the Temple * with sacrificial victims, but rather with Your precious * blood from Your life-giving side. * And rightly she sings to You, * “Glory to Your strength, O Lord!”
ltx/en_us_goadedes/eu.consecration:euCA.Ode42.incipit	To the faithful…
ltx/en_us_goadedes/eu.consecration:euCA.Ode42.melody	@ltx/en_us_goadedes/he.h.m4:heHE.EparthentaSeIdousa.name
ltx/en_us_goadedes/eu.consecration:euCA.Ode42.mode	@ltx/en_us_goadedes/miscellanea:misc.Mode4
ltx/en_us_goadedes/eu.consecration:euCA.Ode42.ode	@ltx/en_us_goadedes/miscellanea:misc.Ode4
ltx/en_us_goadedes/eu.consecration:euCA.Ode42.text	To the faithful who desire to lay their eyes on * the glory of Your face unveiled, O Lord, Your beloved * tabernacles shout to them * with one voice and cry aloud, * “Glory to Your strength, O Lord!”
ltx/en_us_goadedes/eu.consecration:euCA.Ode43.incipit	Now this church…
ltx/en_us_goadedes/eu.consecration:euCA.Ode43.melody	@ltx/en_us_goadedes/he.h.m4:heHE.EparthentaSeIdousa.name
ltx/en_us_goadedes/eu.consecration:euCA.Ode43.mode	@ltx/en_us_goadedes/miscellanea:misc.Mode4
ltx/en_us_goadedes/eu.consecration:euCA.Ode43.ode	@ltx/en_us_goadedes/miscellanea:misc.Ode4
ltx/en_us_goadedes/eu.consecration:euCA.Ode43.text	Now this church has been anointed today, depicting * the spiritual anointing of us Your chosen people * with the very precious oil * of chrism, receiving thus * the Spirit’s divine grace invisibly.
ltx/en_us_goadedes/eu.consecration:euCA.Ode4T.incipit	Remaining virgin, you conceived
ltx/en_us_goadedes/eu.consecration:euCA.Ode4T.melody	@ltx/en_us_goadedes/he.h.m4:heHE.EparthentaSeIdousa.name
ltx/en_us_goadedes/eu.consecration:euCA.Ode4T.mode	@ltx/en_us_goadedes/miscellanea:misc.Mode4
ltx/en_us_goadedes/eu.consecration:euCA.Ode4T.ode	@ltx/en_us_goadedes/miscellanea:misc.Ode4
ltx/en_us_goadedes/eu.consecration:euCA.Ode4T.text	Remaining virgin, you conceived in your womb, O Virgin, * and even after childbirth, you remained a virgin. * Therefore with unwavering faith, O Lady, unceasingly * singing, we salute you: Rejoice!
ltx/en_us_goadedes/eu.consecration:euCA.Ode51.greekmelody	@ltx/en_us_goadedes/he.h.m4:heHE.SyKyrieMouFos.greekname
ltx/en_us_goadedes/eu.consecration:euCA.Ode51.incipit	On Sinai long ago…
ltx/en_us_goadedes/eu.consecration:euCA.Ode51.melody	@ltx/en_us_goadedes/he.h.m4:heHE.SyKyrieMouFos.name
ltx/en_us_goadedes/eu.consecration:euCA.Ode51.mode	@ltx/en_us_goadedes/miscellanea:misc.Mode4
ltx/en_us_goadedes/eu.consecration:euCA.Ode51.ode	@ltx/en_us_goadedes/miscellanea:misc.Ode5
ltx/en_us_goadedes/eu.consecration:euCA.Ode51.text	On Sinai long ago * You showed Moses, that seer of God, * the plan of the tabernacle, * O my Christ, that prefigured * Your Church, not made by human hands.
ltx/en_us_goadedes/eu.consecration:euCA.Ode52.incipit	O Master, You have built…
ltx/en_us_goadedes/eu.consecration:euCA.Ode52.melody	@ltx/en_us_goadedes/he.h.m4:heHE.SyKyrieMouFos.name
ltx/en_us_goadedes/eu.consecration:euCA.Ode52.mode	@ltx/en_us_goadedes/miscellanea:misc.Mode4
ltx/en_us_goadedes/eu.consecration:euCA.Ode52.ode	@ltx/en_us_goadedes/miscellanea:misc.Ode5
ltx/en_us_goadedes/eu.consecration:euCA.Ode52.text	O Master, You have built * this tabernacle here on earth, * where heavenly hosts of Angels * meet the choirs of humans, * by Your divine omnipotence.
ltx/en_us_goadedes/eu.consecration:euCA.Ode53.incipit	O Christ, we know…
ltx/en_us_goadedes/eu.consecration:euCA.Ode53.melody	@ltx/en_us_goadedes/he.h.m4:heHE.SyKyrieMouFos.name
ltx/en_us_goadedes/eu.consecration:euCA.Ode53.mode	@ltx/en_us_goadedes/miscellanea:misc.Mode4
ltx/en_us_goadedes/eu.consecration:euCA.Ode53.ode	@ltx/en_us_goadedes/miscellanea:misc.Ode5
ltx/en_us_goadedes/eu.consecration:euCA.Ode53.text	O Christ, we know that You * are the source of eternal life. * You came and You preached the Gospel * of peace unto Your people, * Your Church, O holy Lord our God.
ltx/en_us_goadedes/eu.consecration:euCA.Ode5T.incipit	Against our every foe…
ltx/en_us_goadedes/eu.consecration:euCA.Ode5T.melody	@ltx/en_us_goadedes/he.h.m4:heHE.SyKyrieMouFos.name
ltx/en_us_goadedes/eu.consecration:euCA.Ode5T.mode	@ltx/en_us_goadedes/miscellanea:misc.Mode4
ltx/en_us_goadedes/eu.consecration:euCA.Ode5T.ode	@ltx/en_us_goadedes/miscellanea:misc.Ode5
ltx/en_us_goadedes/eu.consecration:euCA.Ode5T.text	Against our every foe, * we have you, our unbreakable shield. * We hope in you for salvation. * We have you as our anchor, all-holy Virgin, Bride of God.
ltx/en_us_goadedes/eu.consecration:euCA.Ode61.greekmelody	@ltx/en_us_goadedes/he.h.m4:heHE.ThysoSoiMetaFonis.greekname
ltx/en_us_goadedes/eu.consecration:euCA.Ode61.incipit	Christ the King…
ltx/en_us_goadedes/eu.consecration:euCA.Ode61.melody	@ltx/en_us_goadedes/he.h.m4:heHE.ThysoSoiMetaFonis.name
ltx/en_us_goadedes/eu.consecration:euCA.Ode61.mode	@ltx/en_us_goadedes/miscellanea:misc.Mode4
ltx/en_us_goadedes/eu.consecration:euCA.Ode61.ode	@ltx/en_us_goadedes/miscellanea:misc.Ode6
ltx/en_us_goadedes/eu.consecration:euCA.Ode61.text	Christ the King as Lord has now desired the beauty of the holy Church that He founded. * He has made her mother of all the nations * He adopted by the Spirit and rescued from slavery.
ltx/en_us_goadedes/eu.consecration:euCA.Ode62.incipit	Battalions of wicked demons…
ltx/en_us_goadedes/eu.consecration:euCA.Ode62.melody	@ltx/en_us_goadedes/he.h.m4:heHE.ThysoSoiMetaFonis.name
ltx/en_us_goadedes/eu.consecration:euCA.Ode62.mode	@ltx/en_us_goadedes/miscellanea:misc.Mode4
ltx/en_us_goadedes/eu.consecration:euCA.Ode62.ode	@ltx/en_us_goadedes/miscellanea:misc.Ode6
ltx/en_us_goadedes/eu.consecration:euCA.Ode62.text	Battalions of wicked demons shudder before the Church of Christ and fearfully tremble, * for the holy sign of the Cross is marked there; * and the Spirit’s illumination covers and hallows it.
ltx/en_us_goadedes/eu.consecration:euCA.Ode63.incipit	Having her foundation…
ltx/en_us_goadedes/eu.consecration:euCA.Ode63.melody	@ltx/en_us_goadedes/he.h.m4:heHE.ThysoSoiMetaFonis.name
ltx/en_us_goadedes/eu.consecration:euCA.Ode63.mode	@ltx/en_us_goadedes/miscellanea:misc.Mode4
ltx/en_us_goadedes/eu.consecration:euCA.Ode63.ode	@ltx/en_us_goadedes/miscellanea:misc.Ode6
ltx/en_us_goadedes/eu.consecration:euCA.Ode63.text	Having her foundation not on sand but the rock of Christ, the holy Church of the Gentiles * is adorned with unapproachable beauty, * with the symbols of the eternal kingdom bedecking her.
ltx/en_us_goadedes/eu.consecration:euCA.Ode6T.incipit	O miracle, more novel…
ltx/en_us_goadedes/eu.consecration:euCA.Ode6T.melody	@ltx/en_us_goadedes/he.h.m4:heHE.ThysoSoiMetaFonis.name
ltx/en_us_goadedes/eu.consecration:euCA.Ode6T.mode	@ltx/en_us_goadedes/miscellanea:misc.Mode4
ltx/en_us_goadedes/eu.consecration:euCA.Ode6T.ode	@ltx/en_us_goadedes/miscellanea:misc.Ode6
ltx/en_us_goadedes/eu.consecration:euCA.Ode6T.text	O miracle, more novel than all other miracles! * Behold, without man a Virgin * in her body conceived the One who holds * in His hands the universe, and He was not confined by her.
ltx/en_us_goadedes/eu.consecration:euCA.Ode71.greekmelody	@ltx/en_us_goadedes/he.h.m4:heHE.EnTiKaminoAvramiaioi.greekname
ltx/en_us_goadedes/eu.consecration:euCA.Ode71.incipit	That fiery furnace…
ltx/en_us_goadedes/eu.consecration:euCA.Ode71.melody	@ltx/en_us_goadedes/he.h.m4:heHE.EnTiKaminoAvramiaioi.name
ltx/en_us_goadedes/eu.consecration:euCA.Ode71.mode	@ltx/en_us_goadedes/miscellanea:misc.Mode4
ltx/en_us_goadedes/eu.consecration:euCA.Ode71.ode	@ltx/en_us_goadedes/miscellanea:misc.Ode7
ltx/en_us_goadedes/eu.consecration:euCA.Ode71.text	That fiery furnace * long ago became like a dew-laden breeze. * Now the spiritual chrism composed of oil * sanctifies the faithful, who cry out * together, “In the temple of Your holy glory, You are blessed, O Lord.”
ltx/en_us_goadedes/eu.consecration:euCA.Ode72.incipit	As in that furnace…
ltx/en_us_goadedes/eu.consecration:euCA.Ode72.melody	@ltx/en_us_goadedes/he.h.m4:heHE.EnTiKaminoAvramiaioi.name
ltx/en_us_goadedes/eu.consecration:euCA.Ode72.mode	@ltx/en_us_goadedes/miscellanea:misc.Mode4
ltx/en_us_goadedes/eu.consecration:euCA.Ode72.ode	@ltx/en_us_goadedes/miscellanea:misc.Ode7
ltx/en_us_goadedes/eu.consecration:euCA.Ode72.text	As in that furnace, * we who are the spiritual Israel, * standing in this new tabernacle where God dwells, * are bedewed with grace. So let us sing * together, “In the temple of Your holy glory, You are blessed, O Lord.”
ltx/en_us_goadedes/eu.consecration:euCA.Ode73.incipit	All who are smitten…
ltx/en_us_goadedes/eu.consecration:euCA.Ode73.melody	@ltx/en_us_goadedes/he.h.m4:heHE.EnTiKaminoAvramiaioi.name
ltx/en_us_goadedes/eu.consecration:euCA.Ode73.mode	@ltx/en_us_goadedes/miscellanea:misc.Mode4
ltx/en_us_goadedes/eu.consecration:euCA.Ode73.ode	@ltx/en_us_goadedes/miscellanea:misc.Ode7
ltx/en_us_goadedes/eu.consecration:euCA.Ode73.text	All who are smitten * with sweetest love and longing for God, * entering this mystical bridal chamber now, * be united to the Bridegroom Christ. * Together let us sing to Him, “O Lord of glory, You are blessed.”
ltx/en_us_goadedes/eu.consecration:euCA.Ode7T.incipit	Divine and hallowed habitation…
ltx/en_us_goadedes/eu.consecration:euCA.Ode7T.melody	@ltx/en_us_goadedes/he.h.m4:heHE.EnTiKaminoAvramiaioi.name
ltx/en_us_goadedes/eu.consecration:euCA.Ode7T.mode	@ltx/en_us_goadedes/miscellanea:misc.Mode4
ltx/en_us_goadedes/eu.consecration:euCA.Ode7T.ode	@ltx/en_us_goadedes/miscellanea:misc.Ode7
ltx/en_us_goadedes/eu.consecration:euCA.Ode7T.text	Divine and hallowed * habitation of the Most High God, rejoice! * For through you, O Theotokos, was given joy * unto us who cry aloud to you: * Among all women, Lady, you are blessed, all-blameless, and immaculate.
ltx/en_us_goadedes/eu.consecration:euCA.Ode81.greekmelody	@ltx/en_us_goadedes/he.h.m4:heHE.CheirasEkpetasasDaniil.greekname
ltx/en_us_goadedes/eu.consecration:euCA.Ode81.incipit	Master, on this day…
ltx/en_us_goadedes/eu.consecration:euCA.Ode81.melody	@ltx/en_us_goadedes/he.h.m4:heHE.CheirasEkpetasasDaniil.name
ltx/en_us_goadedes/eu.consecration:euCA.Ode81.mode	@ltx/en_us_goadedes/miscellanea:misc.Mode4
ltx/en_us_goadedes/eu.consecration:euCA.Ode81.ode	@ltx/en_us_goadedes/miscellanea:misc.Ode8
ltx/en_us_goadedes/eu.consecration:euCA.Ode81.text	Master, on this day Your holy Church is like a bride who is wearing a wedding gown * that has been woven of grace divine * in the heavens. She invites her friends * and all the people to rejoice * and celebrate with her together singing, * “Bless the Lord and praise Him, all you works of the Lord.”
ltx/en_us_goadedes/eu.consecration:euCA.Ode82.incipit	Today, second Adam…
ltx/en_us_goadedes/eu.consecration:euCA.Ode82.melody	@ltx/en_us_goadedes/he.h.m4:heHE.CheirasEkpetasasDaniil.name
ltx/en_us_goadedes/eu.consecration:euCA.Ode82.mode	@ltx/en_us_goadedes/miscellanea:misc.Mode4
ltx/en_us_goadedes/eu.consecration:euCA.Ode82.ode	@ltx/en_us_goadedes/miscellanea:misc.Ode8
ltx/en_us_goadedes/eu.consecration:euCA.Ode82.text	Today, second Adam, namely Christ, has made this new tabernacle a spiritual * Garden of Eden. And in its midst, * instead of the tree of knowledge, * is the holy Cross, which is for us * life-giving armor, as we are singing, * “Bless the Lord and praise Him, all you works of the Lord.”
ltx/en_us_goadedes/eu.consecration:euCA.Ode83.incipit	Single is the Godhead…
ltx/en_us_goadedes/eu.consecration:euCA.Ode83.melody	@ltx/en_us_goadedes/he.h.m4:heHE.CheirasEkpetasasDaniil.name
ltx/en_us_goadedes/eu.consecration:euCA.Ode83.mode	@ltx/en_us_goadedes/miscellanea:misc.Mode4
ltx/en_us_goadedes/eu.consecration:euCA.Ode83.ode	@ltx/en_us_goadedes/miscellanea:misc.Ode8
ltx/en_us_goadedes/eu.consecration:euCA.Ode83.text	Single is the Godhead we adore, and unoriginate, in three hypostases, * consubstantial, indivisible, * perfect: Father unoriginate, * and You His Son, and the divine * Spirit, the Trinity. We extol You, * “Bless the Lord and praise Him, all you works of the Lord.”
ltx/en_us_goadedes/eu.consecration:euCA.Ode8T.incipit	Immaculate Virgin…
ltx/en_us_goadedes/eu.consecration:euCA.Ode8T.melody	@ltx/en_us_goadedes/he.h.m4:heHE.CheirasEkpetasasDaniil.name
ltx/en_us_goadedes/eu.consecration:euCA.Ode8T.mode	@ltx/en_us_goadedes/miscellanea:misc.Mode4
ltx/en_us_goadedes/eu.consecration:euCA.Ode8T.ode	@ltx/en_us_goadedes/miscellanea:misc.Ode8
ltx/en_us_goadedes/eu.consecration:euCA.Ode8T.text	Immaculate Virgin, in all generations only you became the Mother of God; * and you were also the dwelling place * of the Godhead, O all-blameless one, * and you were not at all consumed * by the fire of the unapproachable light. * We all now bless you, O Mary the Bride of God.
ltx/en_us_goadedes/eu.consecration:euCA.Ode91.greekmelody	@ltx/en_us_goadedes/he.h.m4:heHE.LithosAcheirotmitos.greekname
ltx/en_us_goadedes/eu.consecration:euCA.Ode91.incipit	Purified in heart…
ltx/en_us_goadedes/eu.consecration:euCA.Ode91.melody	@ltx/en_us_goadedes/he.h.m4:heHE.LithosAcheirotmitos.name
ltx/en_us_goadedes/eu.consecration:euCA.Ode91.mode	@ltx/en_us_goadedes/miscellanea:misc.Mode4
ltx/en_us_goadedes/eu.consecration:euCA.Ode91.ode	@ltx/en_us_goadedes/miscellanea:misc.Ode9
ltx/en_us_goadedes/eu.consecration:euCA.Ode91.text	Purified in heart and with wakeful eyes of our intellect beholding * all the beauty and all the glory, * which is more splendid than gold, within the Church, * let us perceive the daughter of the King and magnify her evermore.
ltx/en_us_goadedes/eu.consecration:euCA.Ode92.incipit	Bride of the great King…
ltx/en_us_goadedes/eu.consecration:euCA.Ode92.melody	@ltx/en_us_goadedes/he.h.m4:heHE.LithosAcheirotmitos.name
ltx/en_us_goadedes/eu.consecration:euCA.Ode92.mode	@ltx/en_us_goadedes/miscellanea:misc.Mode4
ltx/en_us_goadedes/eu.consecration:euCA.Ode92.ode	@ltx/en_us_goadedes/miscellanea:misc.Ode9
ltx/en_us_goadedes/eu.consecration:euCA.Ode92.text	Bride of the great King, we salute you: Rejoice, O Virgin, and be merry! * For you are distinctly reflecting * the holy beauty of your celestial Bridegroom. * And with your people sing to Him, “We magnify You, O Giver of life.”
ltx/en_us_goadedes/eu.consecration:euCA.Ode93.incipit	Grant Your Church…
ltx/en_us_goadedes/eu.consecration:euCA.Ode93.melody	@ltx/en_us_goadedes/he.h.m4:heHE.LithosAcheirotmitos.name
ltx/en_us_goadedes/eu.consecration:euCA.Ode93.mode	@ltx/en_us_goadedes/miscellanea:misc.Mode4
ltx/en_us_goadedes/eu.consecration:euCA.Ode93.ode	@ltx/en_us_goadedes/miscellanea:misc.Ode9
ltx/en_us_goadedes/eu.consecration:euCA.Ode93.text	Grant Your Church the mighty protection that comes from heaven, O our Savior. * For she knows no other protector * except for You, who laid down Your life for her. * And knowing this, she magnifies You as the Lord who is benevolent.
ltx/en_us_goadedes/eu.consecration:euCA.Ode9T.incipit	Rejoice, holy Bride…
ltx/en_us_goadedes/eu.consecration:euCA.Ode9T.melody	@ltx/en_us_goadedes/he.h.m4:heHE.LithosAcheirotmitos.name
ltx/en_us_goadedes/eu.consecration:euCA.Ode9T.mode	@ltx/en_us_goadedes/miscellanea:misc.Mode4
ltx/en_us_goadedes/eu.consecration:euCA.Ode9T.ode	@ltx/en_us_goadedes/miscellanea:misc.Ode9
ltx/en_us_goadedes/eu.consecration:euCA.Ode9T.text	Rejoice, holy Bride of the great King, Maiden full of grace, Virgin Mary! * Through you we have all been delivered * from the curse that Eve heard long ago in Eden, * and we have found eternal life, O ever-virgin, through your childbirth.
ltx/en_us_goadedes/eu.consecration:euCON.Key1000.title	
ltx/en_us_goadedes/eu.consecration:euCON.Key1001.text	
ltx/en_us_goadedes/eu.consecration:euCON.Key1001.title	
ltx/en_us_goadedes/eu.consecration:euCON.Key1002.text	
ltx/en_us_goadedes/eu.consecration:euCON.Key1002.title	
ltx/en_us_goadedes/eu.consecration:euCON.Key1003.incipit	@ltx/en_us_goadedes/pe.d127:peVE.SticGlory.incipit
ltx/en_us_goadedes/eu.consecration:euCON.Key1003.mode	@ltx/en_us_goadedes/miscellanea:misc.Mode6
ltx/en_us_goadedes/eu.consecration:euCON.Key1003.text	@ltx/en_us_goadedes/pe.d127:peVE.SticGlory.text
ltx/en_us_goadedes/eu.consecration:euCON.Key1004.incipit	@ltx/en_us_goadedes/oc.m6.d5:ocVE.AposTheotokion.incipit
ltx/en_us_goadedes/eu.consecration:euCON.Key1004.mode	@ltx/en_us_goadedes/miscellanea:misc.Mode6
ltx/en_us_goadedes/eu.consecration:euCON.Key1004.text	@ltx/en_us_goadedes/oc.m6.d5:ocVE.AposTheotokion.text
ltx/en_us_goadedes/eu.consecration:euCON.Key2000.title	
ltx/en_us_goadedes/eu.consecration:euCON.Key3000.title	
ltx/en_us_goadedes/eu.consecration:euCON.Key4000.title	
ltx/en_us_goadedes/eu.consecration:euCON.Key4100.title	
ltx/en_us_goadedes/eu.consecration:euCON.Key4101.text	@ltx/en_us_goadedes/prayers:pr.enarxis02.text
ltx/en_us_goadedes/eu.consecration:euCON.Key4102.text	@ltx/en_us_goadedes/prayers:pr.enarxis01.text
ltx/en_us_goadedes/eu.consecration:euCON.Key4104.text	
ltx/en_us_goadedes/eu.consecration:euCON.Key4105.text	@ltx/en_us_goadedes/prayers:pr.exc07b.text
ltx/en_us_goadedes/eu.consecration:euCON.Key4106.text	
ltx/en_us_goadedes/eu.consecration:euCON.Key4107.text	@ltx/en_us_goadedes/prayers:pr.exc14.text
ltx/en_us_goadedes/eu.consecration:euCON.Key4200.title	
ltx/en_us_goadedes/eu.consecration:euCON.Key4201.incipit	@ltx/en_us_goadedes/oc.m7.d3:ocVE.Aposticha3.incipit
ltx/en_us_goadedes/eu.consecration:euCON.Key4201.mode	@ltx/en_us_goadedes/miscellanea:misc.Mode7
ltx/en_us_goadedes/eu.consecration:euCON.Key4201.text	@ltx/en_us_goadedes/oc.m7.d3:ocVE.Aposticha3.text
ltx/en_us_goadedes/eu.consecration:euCON.Key4202.incipit	@ltx/en_us_goadedes/oc.m7.d2:ocVE.Aposticha3.incipit
ltx/en_us_goadedes/eu.consecration:euCON.Key4202.mode	@ltx/en_us_goadedes/miscellanea:misc.Mode7
ltx/en_us_goadedes/eu.consecration:euCON.Key4202.text	@ltx/en_us_goadedes/oc.m7.d2:ocVE.Aposticha3.text
ltx/en_us_goadedes/eu.consecration:euCON.Key4203.incipit	@ltx/en_us_goadedes/me.m09.d13:meMA.Lauds4.incipit
ltx/en_us_goadedes/eu.consecration:euCON.Key4203.melody	@ltx/en_us_goadedes/miscellanea:misc.Idiomelon
ltx/en_us_goadedes/eu.consecration:euCON.Key4203.mode	@ltx/en_us_goadedes/miscellanea:misc.Mode1
ltx/en_us_goadedes/eu.consecration:euCON.Key4203.text	@ltx/en_us_goadedes/me.m09.d13:meMA.Lauds4.text
ltx/en_us_goadedes/eu.consecration:euCON.Key4204.incipit	@ltx/en_us_goadedes/me.m09.d13:meMA.Lauds5.incipit
ltx/en_us_goadedes/eu.consecration:euCON.Key4204.melody	@ltx/en_us_goadedes/miscellanea:misc.Idiomelon
ltx/en_us_goadedes/eu.consecration:euCON.Key4204.mode	@ltx/en_us_goadedes/miscellanea:misc.Mode1
ltx/en_us_goadedes/eu.consecration:euCON.Key4204.text	@ltx/en_us_goadedes/me.m09.d13:meMA.Lauds5.text
ltx/en_us_goadedes/eu.consecration:euCON.Key4205.incipit	@ltx/en_us_goadedes/me.m09.d13:meVE.Stichera01.incipit
ltx/en_us_goadedes/eu.consecration:euCON.Key4205.melody	@ltx/en_us_goadedes/miscellanea:misc.Idiomelon
ltx/en_us_goadedes/eu.consecration:euCON.Key4205.mode	@ltx/en_us_goadedes/miscellanea:misc.Mode6
ltx/en_us_goadedes/eu.consecration:euCON.Key4205.text	@ltx/en_us_goadedes/me.m09.d13:meVE.Stichera01.text
ltx/en_us_goadedes/eu.consecration:euCON.Key4206.incipit	@ltx/en_us_goadedes/me.m12.d09:meMA.LaudsGlory.incipit
ltx/en_us_goadedes/eu.consecration:euCON.Key4206.melody	@ltx/en_us_goadedes/miscellanea:misc.Idiomelon
ltx/en_us_goadedes/eu.consecration:euCON.Key4206.mode	@ltx/en_us_goadedes/miscellanea:misc.Mode5
ltx/en_us_goadedes/eu.consecration:euCON.Key4206.text	@ltx/en_us_goadedes/me.m12.d09:meMA.LaudsGlory.text
ltx/en_us_goadedes/eu.consecration:euCON.Key4207.title	
ltx/en_us_goadedes/eu.consecration:euCON.Key4208.title	
ltx/en_us_goadedes/eu.consecration:euCON.Key4209.incipit	…
ltx/en_us_goadedes/eu.consecration:euCON.Key4209.text	
ltx/en_us_goadedes/eu.consecration:euCON.Key4210.incipit	…
ltx/en_us_goadedes/eu.consecration:euCON.Key4210.mode	@ltx/en_us_goadedes/miscellanea:misc.Mode3
ltx/en_us_goadedes/eu.consecration:euCON.Key4210.text	
ltx/en_us_goadedes/eu.consecration:euCON.Key4211.text	O God and Father of our Lord Jesus Christ, You are the One who is blessed forever. Through the veil of Your Son’s flesh, You inaugurated an entrance for us into the Church of the firstborn who are enrolled in heaven, where they celebrate with a clear voice of great joy. We entreat You, Master who love humanity, look upon us Your sinful and unworthy servants, as we conduct the door-opening ceremony of this holy church of St. Nicholas the Wonder-worker, Archbishop of Myra in Lycia. May it symbolize Your most holy Church, namely this body of ours, which You have qualified to be called temple and members of Your Christ, by St. Paul, the all-lauded Apostle. Keep this structure standing strong till the end of time, unshaken, and glorified in You. Allow us to enter it without reproach, understanding and sensing everything, and to offer praises and doxologies to Your glory, and to Your only-begotten Son, our Lord Jesus Christ, and to Your Holy Spirit. May we worship You in fear of You, and thus be found worthy of Your divine tender mercies. Graciously accept these prayers that we offer to Your ineffable compassion, for ourselves and for all Your people, at the intercessions of our immaculate Lady Theotokos and ever-virgin Mary.
ltx/en_us_goadedes/eu.consecration:euCON.Key4211a.incipit	O God and Father…
ltx/en_us_goadedes/eu.consecration:euCON.Key4211a.text	O God and Father of our Lord Jesus Christ, You are the One is blessed forever. Through the veil of Your Son’s flesh, You inaugurated an entrance for us into the Church of the firstborn who are enrolled in heaven, where they celebrate with a clear voice of great joy. We entreat You, Master who love humanity, look upon us Your sinful and unworthy servants, as we conduct the consecration of this holy church of 
ltx/en_us_goadedes/eu.consecration:euCON.Key4211b.text	[name]
ltx/en_us_goadedes/eu.consecration:euCON.Key4211c.text	May it symbolize Your most holy Church, namely this body of ours, which You have qualified to be called temple and members of Your Christ, by St. Paul, the all-lauded Apostle. Keep this structure standing strong till the end of time, unshaken, and glorified in You. Allow us to enter it without reproach, understanding and sensing everything, and to offer praises and doxologies to Your glory, and to Your only-begotten Son, our Lord Jesus Christ, and to Your Holy Spirit. May we worship You in fear of You, and thus be found worthy of Your divine tender mercies. Graciously accept these prayers that we offer to Your ineffable compassion, for ourselves and for all Your people, at the intercessions of our immaculate Lady Theotokos and ever-virgin Mary.
ltx/en_us_goadedes/eu.consecration:euCON.Key4212.text	@ltx/en_us_goadedes/prayers:pr.exc06.text
ltx/en_us_goadedes/eu.consecration:euCON.Key4213.text	
ltx/en_us_goadedes/eu.consecration:euCON.Key4214.text	@ltx/en_us_goadedes/prayers:pr.exc01.text
ltx/en_us_goadedes/eu.consecration:euCON.Key4218.text	O God and Father of our Lord Jesus Christ, You are the One is blessed forever. Through the veil of Your Son’s flesh, You inaugurated an entrance for us into the Church of the firstborn who are enrolled in heaven, where they celebrate with a clear voice of great joy. We entreat You, Master who love humanity, look upon us Your sinful and unworthy servants, as we conduct the consecration of this holy church of
ltx/en_us_goadedes/eu.consecration:euCON.Key4219.text	May it symbolize Your most holy Church, namely this body of ours, which You have qualified to be called temple and members of Your Christ, by St. Paul, the all-lauded Apostle. Keep this structure standing strong till the end of time, unshaken, and glorified in You. Allow us to enter it without reproach, understanding and sensing everything, and to offer praises and doxologies to Your glory, and to Your only-begotten Son, our Lord Jesus Christ, and to Your Holy Spirit. May we worship You in fear of You, and thus be found worthy of Your divine tender mercies. Graciously accept these prayers that we offer to Your ineffable compassion, for ourselves and for all Your people, at the intercessions of our immaculate Lady Theotokos and ever-virgin Mary.
ltx/en_us_goadedes/eu.consecration:euCON.Key4300.title	
ltx/en_us_goadedes/eu.consecration:euCON.Key4304.incipit	@ltx/en_us_goadedes/me.m09.d13:meVE.Apolytikion1.incipit
ltx/en_us_goadedes/eu.consecration:euCON.Key4304.mode	@ltx/en_us_goadedes/miscellanea:misc.Mode4
ltx/en_us_goadedes/eu.consecration:euCON.Key4304.text	@ltx/en_us_goadedes/me.m09.d13:meVE.Apolytikion1.text
ltx/en_us_goadedes/eu.consecration:euCON.Key4304.title	
ltx/en_us_goadedes/eu.consecration:euCON.Key4400.title	
ltx/en_us_goadedes/eu.consecration:euCON.Key4401.text	
ltx/en_us_goadedes/eu.consecration:euCON.Key4402.text	
ltx/en_us_goadedes/eu.consecration:euCON.Key4403.text	
ltx/en_us_goadedes/eu.consecration:euCON.Key4404.text	@ltx/en_us_goadedes/prayers:pr.exc20.text
ltx/en_us_goadedes/eu.consecration:euCON.Key4405a.text	
ltx/en_us_goadedes/eu.consecration:euCON.Key4405b.text	
ltx/en_us_goadedes/eu.consecration:euCON.Key4405c.text	
ltx/en_us_goadedes/eu.consecration:euCON.Key4406.text	@ltx/en_us_goadedes/prayers:pr.exc01.text
ltx/en_us_goadedes/eu.consecration:euCON.Key4500.title	
ltx/en_us_goadedes/eu.consecration:euCON.Key4501.text	@ltx/en_us_goadedes/prayers:pr.enarxis01.text
ltx/en_us_goadedes/eu.consecration:euCON.Key4502.text	@ltx/en_us_goadedes/prayers:pr.petKneel07.text
ltx/en_us_goadedes/eu.consecration:euCON.Key4503a.text	
ltx/en_us_goadedes/eu.consecration:euCON.Key4503b.text	
ltx/en_us_goadedes/eu.consecration:euCON.Key4503c.text	
ltx/en_us_goadedes/eu.consecration:euCON.Key4504.text	
ltx/en_us_goadedes/eu.consecration:euCON.Key4505.text	@ltx/en_us_goadedes/prayers:pr.petKneel08.text
ltx/en_us_goadedes/eu.consecration:euCON.Key4506.text	
ltx/en_us_goadedes/eu.consecration:euCON.Key4507.text	
ltx/en_us_goadedes/eu.consecration:euCON.Key4508.text	@ltx/en_us_goadedes/prayers:pr.InTheNameOfFather.text
ltx/en_us_goadedes/eu.consecration:euCON.Key4510.text	
ltx/en_us_goadedes/eu.consecration:euCON.Key4600.title	
ltx/en_us_goadedes/eu.consecration:euCON.Key4603.text	@ltx/en_us_goadedes/prayers:pr.enarxis01.text
ltx/en_us_goadedes/eu.consecration:euCON.Key4604.text	@ltx/en_us_goadedes/prayers:pr.Alleluia3.text
ltx/en_us_goadedes/eu.consecration:euCON.Key4606.text	
ltx/en_us_goadedes/eu.consecration:euCON.Key4607.text	
ltx/en_us_goadedes/eu.consecration:euCON.Key4700.title	
ltx/en_us_goadedes/eu.consecration:euCON.Key4702.text	
ltx/en_us_goadedes/eu.consecration:euCON.Key4704.text	
ltx/en_us_goadedes/eu.consecration:euCON.Key4800.title	
ltx/en_us_goadedes/eu.consecration:euCON.Key4801.text	
ltx/en_us_goadedes/eu.consecration:euCON.Key4802.text	
ltx/en_us_goadedes/eu.consecration:euCON.Key4802.title	
ltx/en_us_goadedes/eu.consecration:euCON.Key4803.text	
ltx/en_us_goadedes/eu.consecration:euCON.Key4804.text	
ltx/en_us_goadedes/eu.consecration:euCON.Key4805.title	
ltx/en_us_goadedes/eu.consecration:euCON.Key4900.title	
ltx/en_us_goadedes/eu.consecration:euCON.Key4901.title	
ltx/en_us_goadedes/eu.consecration:euCON.Key4902.title	
ltx/en_us_goadedes/eu.consecration:euCON.R100	
ltx/en_us_goadedes/eu.consecration:euCON.R101	
ltx/en_us_goadedes/eu.consecration:euCON.R102	
ltx/en_us_goadedes/eu.consecration:euCON.R410	
ltx/en_us_goadedes/eu.consecration:euCON.R411	
ltx/en_us_goadedes/eu.consecration:euCON.R420	
ltx/en_us_goadedes/eu.consecration:euCON.R421	
ltx/en_us_goadedes/eu.consecration:euCON.R422	
ltx/en_us_goadedes/eu.consecration:euCON.R423	
ltx/en_us_goadedes/eu.consecration:euCON.R424	
ltx/en_us_goadedes/eu.consecration:euCON.R425	
ltx/en_us_goadedes/eu.consecration:euCON.R426	
ltx/en_us_goadedes/eu.consecration:euCON.R427	
ltx/en_us_goadedes/eu.consecration:euCON.R428	
ltx/en_us_goadedes/eu.consecration:euCON.R430	
ltx/en_us_goadedes/eu.consecration:euCON.R431	
ltx/en_us_goadedes/eu.consecration:euCON.R432	
ltx/en_us_goadedes/eu.consecration:euCON.R440	
ltx/en_us_goadedes/eu.consecration:euCON.R441	
ltx/en_us_goadedes/eu.consecration:euCON.R442	
ltx/en_us_goadedes/eu.consecration:euCON.R443	
ltx/en_us_goadedes/eu.consecration:euCON.R444	
ltx/en_us_goadedes/eu.consecration:euCON.R450	
ltx/en_us_goadedes/eu.consecration:euCON.R451	
ltx/en_us_goadedes/eu.consecration:euCON.R452	
ltx/en_us_goadedes/eu.consecration:euCON.R453	
ltx/en_us_goadedes/eu.consecration:euCON.R460	
ltx/en_us_goadedes/eu.consecration:euCON.R461	
ltx/en_us_goadedes/eu.consecration:euCON.R462	
ltx/en_us_goadedes/eu.consecration:euCON.R463	
ltx/en_us_goadedes/eu.consecration:euCON.R464	
ltx/en_us_goadedes/eu.consecration:euCON.R465	
ltx/en_us_goadedes/eu.consecration:euCON.R470	
ltx/en_us_goadedes/eu.consecration:euCON.R471	
ltx/en_us_goadedes/eu.consecration:euCON.R472	
ltx/en_us_goadedes/eu.consecration:euCON.R473	
ltx/en_us_goadedes/eu.consecration:euCON.R480	
ltx/en_us_goadedes/eu.consecration:euCON.R481	
ltx/en_us_goadedes/eu.consecration:euCON.R482	
ltx/en_us_goadedes/eu.consecration:euCON.R483	
ltx/en_us_goadedes/eu.consecration:euCON.R484	
ltx/en_us_goadedes/eu.consecration:euCON.R485	
ltx/en_us_goadedes/eu.consecration:euCON.R490	
ltx/en_us_goadedes/eu.consecration:euCON.R491	
ltx/en_us_goadedes/eu.consecration:euMA.C1.title	
ltx/en_us_goadedes/eu.consecration:euMA.C1.verse	@ltx/en_us_goadedes/prayers:pr.verse_God.text
ltx/en_us_goadedes/eu.consecration:euMA.Exaposteilarion1.incipit	…
ltx/en_us_goadedes/eu.consecration:euMA.Exaposteilarion1.melody	@ltx/en_us_goadedes/he.a.m2:heAU.GynaikesAkoutisthite.name
ltx/en_us_goadedes/eu.consecration:euMA.Exaposteilarion1.mode	@ltx/en_us_goadedes/miscellanea:misc.Mode2
ltx/en_us_goadedes/eu.consecration:euMA.Exaposteilarion1.text	
ltx/en_us_goadedes/eu.consecration:euMA.Kathisma11.incipit	@ltx/en_us_goadedes/me.m09.d13:meMA.Ode3Kathisma1.incipit
ltx/en_us_goadedes/eu.consecration:euMA.Kathisma11.melody	@ltx/en_us_goadedes/he.a.m8:heAU.ToProstachthen.name
ltx/en_us_goadedes/eu.consecration:euMA.Kathisma11.mode	@ltx/en_us_goadedes/miscellanea:misc.Mode8
ltx/en_us_goadedes/eu.consecration:euMA.Kathisma11.text	@ltx/en_us_goadedes/me.m09.d13:meMA.Ode3Kathisma1.text
ltx/en_us_goadedes/eu.consecration:euMA.Kathisma21.incipit	…
ltx/en_us_goadedes/eu.consecration:euMA.Kathisma21.melody	@ltx/en_us_goadedes/he.a.m8:heAU.TinSofianKaiLogon.name
ltx/en_us_goadedes/eu.consecration:euMA.Kathisma21.mode	@ltx/en_us_goadedes/miscellanea:misc.Mode8
ltx/en_us_goadedes/eu.consecration:euMA.Kathisma21.text	
ltx/en_us_goadedes/eu.consecration:euMA.Kathisma31.incipit	…
ltx/en_us_goadedes/eu.consecration:euMA.Kathisma31.melody	@ltx/en_us_goadedes/he.a.m4:heAU.TachyProkatalave.name
ltx/en_us_goadedes/eu.consecration:euMA.Kathisma31.mode	@ltx/en_us_goadedes/miscellanea:misc.Mode4
ltx/en_us_goadedes/eu.consecration:euMA.Kathisma31.text	
ltx/en_us_goadedes/eu.consecration:euMA.Kontakion.incipit	@ltx/en_us_goadedes/me.m09.d13:meMA.Kontakion1.incipit
ltx/en_us_goadedes/eu.consecration:euMA.Kontakion.melody	@ltx/en_us_goadedes/me.m09.d13:meMA.Kontakion1.melody
ltx/en_us_goadedes/eu.consecration:euMA.Kontakion.mode	@ltx/en_us_goadedes/me.m09.d13:meMA.Kontakion1.mode
ltx/en_us_goadedes/eu.consecration:euMA.Kontakion.text	@ltx/en_us_goadedes/me.m09.d13:meMA.Kontakion1.text
ltx/en_us_goadedes/eu.consecration:euMA.Lauds1.incipit	@ltx/en_us_goadedes/me.m09.d13:meMA.Lauds1.incipit
ltx/en_us_goadedes/eu.consecration:euMA.Lauds1.melody	@ltx/en_us_goadedes/he.a.m4:heAU.EdokasSimeiosin.name
ltx/en_us_goadedes/eu.consecration:euMA.Lauds1.mode	@ltx/en_us_goadedes/miscellanea:misc.Mode4
ltx/en_us_goadedes/eu.consecration:euMA.Lauds1.text	@ltx/en_us_goadedes/me.m09.d13:meMA.Lauds1.text
ltx/en_us_goadedes/eu.consecration:euMA.Lauds2.incipit	@ltx/en_us_goadedes/me.m09.d13:meMA.Lauds2.incipit
ltx/en_us_goadedes/eu.consecration:euMA.Lauds2.melody	@ltx/en_us_goadedes/he.a.m4:heAU.EdokasSimeiosin.name
ltx/en_us_goadedes/eu.consecration:euMA.Lauds2.mode	@ltx/en_us_goadedes/miscellanea:misc.Mode4
ltx/en_us_goadedes/eu.consecration:euMA.Lauds2.text	@ltx/en_us_goadedes/me.m09.d13:meMA.Lauds2.text
ltx/en_us_goadedes/eu.consecration:euMA.Lauds3.incipit	@ltx/en_us_goadedes/me.m09.d13:meMA.Lauds3.incipit
ltx/en_us_goadedes/eu.consecration:euMA.Lauds3.melody	@ltx/en_us_goadedes/he.a.m4:heAU.EdokasSimeiosin.name
ltx/en_us_goadedes/eu.consecration:euMA.Lauds3.mode	@ltx/en_us_goadedes/miscellanea:misc.Mode4
ltx/en_us_goadedes/eu.consecration:euMA.Lauds3.text	@ltx/en_us_goadedes/me.m09.d13:meMA.Lauds3.text
ltx/en_us_goadedes/eu.consecration:euMA.LaudsBoth.incipit	@ltx/en_us_goadedes/me.m12.d09:meMA.LaudsGlory.incipit
ltx/en_us_goadedes/eu.consecration:euMA.LaudsBoth.melody	@ltx/en_us_goadedes/miscellanea:misc.Idiomelon
ltx/en_us_goadedes/eu.consecration:euMA.LaudsBoth.mode	@ltx/en_us_goadedes/miscellanea:misc.Mode5
ltx/en_us_goadedes/eu.consecration:euMA.LaudsBoth.text	@ltx/en_us_goadedes/me.m12.d09:meMA.LaudsGlory.text
ltx/en_us_goadedes/eu.consecration:euMA.MM.Lauds123as456.text	@ltx/en_us_goadedes/properties:media.key
ltx/en_us_goadedes/eu.consecration:euMA.MM.Lauds12as12.text	@ltx/en_us_goadedes/properties:media.key
ltx/en_us_goadedes/eu.consecration:euMA.MM.Ode1.text	@ltx/en_us_goadedes/properties:media.key
ltx/en_us_goadedes/eu.consecration:euMA.MM.Ode3.text	@ltx/en_us_goadedes/properties:media.key
ltx/en_us_goadedes/eu.consecration:euMA.MM.Ode4.text	@ltx/en_us_goadedes/properties:media.key
ltx/en_us_goadedes/eu.consecration:euMA.MM.Ode5.text	@ltx/en_us_goadedes/properties:media.key
ltx/en_us_goadedes/eu.consecration:euMA.MM.Ode6.text	@ltx/en_us_goadedes/properties:media.key
ltx/en_us_goadedes/eu.consecration:euMA.MM.Ode7.text	@ltx/en_us_goadedes/properties:media.key
ltx/en_us_goadedes/eu.consecration:euMA.MM.Ode8.text	@ltx/en_us_goadedes/properties:media.key
ltx/en_us_goadedes/eu.consecration:euMA.MM.Ode9.text	@ltx/en_us_goadedes/properties:media.key
ltx/en_us_goadedes/eu.consecration:euMA.Ode3Kathisma1.incipit	@ltx/en_us_goadedes/me.m09.d13:meMA.Kathisma11.incipit
ltx/en_us_goadedes/eu.consecration:euMA.Ode3Kathisma1.melody	@ltx/en_us_goadedes/he.a.m4:heAU.TachyProkatalave.name
ltx/en_us_goadedes/eu.consecration:euMA.Ode3Kathisma1.mode	@ltx/en_us_goadedes/miscellanea:misc.Mode4
ltx/en_us_goadedes/eu.consecration:euMA.Ode3Kathisma1.text	@ltx/en_us_goadedes/me.m09.d13:meMA.Kathisma11.text
ltx/en_us_goadedes/eu.consecration:euMA.Ode3KathismaT.incipit	@ltx/en_us_goadedes/me.m09.d13:meMA.Ode3KathismaT.incipit
ltx/en_us_goadedes/eu.consecration:euMA.Ode3KathismaT.melody	@ltx/en_us_goadedes/he.a.m4:heAU.TachyProkatalave.name
ltx/en_us_goadedes/eu.consecration:euMA.Ode3KathismaT.mode	@ltx/en_us_goadedes/miscellanea:misc.Mode4
ltx/en_us_goadedes/eu.consecration:euMA.Ode3KathismaT.text	@ltx/en_us_goadedes/me.m09.d13:meMA.Ode3KathismaT.text
ltx/en_us_goadedes/eu.consecration:euMA.Oikos.text	@ltx/en_us_goadedes/me.m09.d13:meMA.Oikos1.text
ltx/en_us_goadedes/eu.consecration:euMA.R001	The Hierarch … and says the prayers of Pat. Callistus.
ltx/en_us_goadedes/eu.consecration:euVE.Apolytikion.incipit	@ltx/en_us_goadedes/me.m09.d13:meVE.Apolytikion1.incipit
ltx/en_us_goadedes/eu.consecration:euVE.Apolytikion.melody	
ltx/en_us_goadedes/eu.consecration:euVE.Apolytikion.mode	@ltx/en_us_goadedes/miscellanea:misc.Mode4
ltx/en_us_goadedes/eu.consecration:euVE.Apolytikion.text	@ltx/en_us_goadedes/me.m09.d13:meVE.Apolytikion1.text
ltx/en_us_goadedes/eu.consecration:euVE.AposGlory.incipit	@ltx/en_us_goadedes/me.m09.d13:meMA.LaudsGlory.incipit
ltx/en_us_goadedes/eu.consecration:euVE.AposGlory.melody	@ltx/en_us_goadedes/miscellanea:misc.Idiomelon
ltx/en_us_goadedes/eu.consecration:euVE.AposGlory.mode	@ltx/en_us_goadedes/miscellanea:misc.Mode3
ltx/en_us_goadedes/eu.consecration:euVE.AposGlory.text	@ltx/en_us_goadedes/me.m09.d13:meMA.LaudsGlory.text
ltx/en_us_goadedes/eu.consecration:euVE.Aposticha1.incipit	@ltx/en_us_goadedes/me.m09.d13:meMA.Lauds4.incipit
ltx/en_us_goadedes/eu.consecration:euVE.Aposticha1.melody	@ltx/en_us_goadedes/miscellanea:misc.Idiomelon
ltx/en_us_goadedes/eu.consecration:euVE.Aposticha1.mode	@ltx/en_us_goadedes/miscellanea:misc.Mode1
ltx/en_us_goadedes/eu.consecration:euVE.Aposticha1.poet	@ltx/en_us_goadedes/poets:po.IoannouMonachou
ltx/en_us_goadedes/eu.consecration:euVE.Aposticha1.text	@ltx/en_us_goadedes/me.m09.d13:meMA.Lauds4.text
ltx/en_us_goadedes/eu.consecration:euVE.Aposticha2.incipit	@ltx/en_us_goadedes/me.m09.d13:meMA.Lauds5.incipit
ltx/en_us_goadedes/eu.consecration:euVE.Aposticha2.melody	@ltx/en_us_goadedes/miscellanea:misc.Idiomelon
ltx/en_us_goadedes/eu.consecration:euVE.Aposticha2.mode	@ltx/en_us_goadedes/miscellanea:misc.Mode1
ltx/en_us_goadedes/eu.consecration:euVE.Aposticha2.poet	@ltx/en_us_goadedes/poets:po.Anatoliou
ltx/en_us_goadedes/eu.consecration:euVE.Aposticha2.text	@ltx/en_us_goadedes/me.m09.d13:meMA.Lauds5.text
ltx/en_us_goadedes/eu.consecration:euVE.Aposticha3.incipit	@ltx/en_us_goadedes/me.m09.d13:meMA.Lauds6.incipit
ltx/en_us_goadedes/eu.consecration:euVE.Aposticha3.melody	@ltx/en_us_goadedes/miscellanea:misc.Idiomelon
ltx/en_us_goadedes/eu.consecration:euVE.Aposticha3.mode	@ltx/en_us_goadedes/me.m09.d13:meMA.Lauds6.mode
ltx/en_us_goadedes/eu.consecration:euVE.Aposticha3.poet	@ltx/en_us_goadedes/poets:po.IoannouMonachou
ltx/en_us_goadedes/eu.consecration:euVE.Aposticha3.text	@ltx/en_us_goadedes/me.m09.d13:meMA.Lauds6.text
ltx/en_us_goadedes/eu.consecration:euVE.MM.Stichera1234as1234.text	@ltx/en_us_goadedes/properties:media.key
ltx/en_us_goadedes/eu.consecration:euVE.MM.Stichera1234as3456.text	@ltx/en_us_goadedes/properties:media.key
ltx/en_us_goadedes/eu.consecration:euVE.MM.Stichera1234as78910.text	@ltx/en_us_goadedes/properties:media.key
ltx/en_us_goadedes/eu.consecration:euVE.MM.Stichera123as567.text	@ltx/en_us_goadedes/properties:media.key
ltx/en_us_goadedes/eu.consecration:euVE.SticBoth.incipit	@ltx/en_us_goadedes/me.m09.d13:meVE.AposGlory.incipit
ltx/en_us_goadedes/eu.consecration:euVE.SticBoth.melody	@ltx/en_us_goadedes/miscellanea:misc.Idiomelon
ltx/en_us_goadedes/eu.consecration:euVE.SticBoth.mode	@ltx/en_us_goadedes/miscellanea:misc.Mode2
ltx/en_us_goadedes/eu.consecration:euVE.SticBoth.poet	@ltx/en_us_goadedes/poets:po.Anatoliou
ltx/en_us_goadedes/eu.consecration:euVE.SticBoth.text	@ltx/en_us_goadedes/me.m09.d13:meVE.AposGlory.text
ltx/en_us_goadedes/eu.consecration:euVE.Stichera01.incipit	@ltx/en_us_goadedes/me.m09.d13:meVE.Stichera01.incipit
ltx/en_us_goadedes/eu.consecration:euVE.Stichera01.melody	@ltx/en_us_goadedes/miscellanea:misc.Idiomelon
ltx/en_us_goadedes/eu.consecration:euVE.Stichera01.mode	@ltx/en_us_goadedes/miscellanea:misc.Mode6
ltx/en_us_goadedes/eu.consecration:euVE.Stichera01.text	@ltx/en_us_goadedes/me.m09.d13:meVE.Stichera01.text
ltx/en_us_goadedes/eu.consecration:euVE.Stichera02.incipit	@ltx/en_us_goadedes/me.m09.d13:meVE.Stichera02.incipit
ltx/en_us_goadedes/eu.consecration:euVE.Stichera02.melody	@ltx/en_us_goadedes/miscellanea:misc.Idiomelon
ltx/en_us_goadedes/eu.consecration:euVE.Stichera02.mode	@ltx/en_us_goadedes/miscellanea:misc.Mode6
ltx/en_us_goadedes/eu.consecration:euVE.Stichera02.text	@ltx/en_us_goadedes/me.m09.d13:meVE.Stichera02.text
ltx/en_us_goadedes/eu.consecration:euVE.Stichera03.incipit	@ltx/en_us_goadedes/me.m09.d13:meVE.Stichera03.incipit
ltx/en_us_goadedes/eu.consecration:euVE.Stichera03.melody	@ltx/en_us_goadedes/miscellanea:misc.Idiomelon
ltx/en_us_goadedes/eu.consecration:euVE.Stichera03.mode	@ltx/en_us_goadedes/miscellanea:misc.Mode6
ltx/en_us_goadedes/eu.consecration:euVE.Stichera03.poet	@ltx/en_us_goadedes/poets:po.Anatoliou
ltx/en_us_goadedes/eu.consecration:euVE.Stichera03.text	@ltx/en_us_goadedes/me.m09.d13:meVE.Stichera03.text
ltx/en_us_goadedes/eu.consecration:euVE.Stichera04.incipit	@ltx/en_us_goadedes/me.m09.d13:meVE.SticGlory.incipit
ltx/en_us_goadedes/eu.consecration:euVE.Stichera04.melody	@ltx/en_us_goadedes/miscellanea:misc.Idiomelon
ltx/en_us_goadedes/eu.consecration:euVE.Stichera04.mode	@ltx/en_us_goadedes/miscellanea:misc.Mode6
ltx/en_us_goadedes/eu.consecration:euVE.Stichera04.poet	@ltx/en_us_goadedes/poets:po.IoannouMonachou
ltx/en_us_goadedes/eu.consecration:euVE.Stichera04.text	@ltx/en_us_goadedes/me.m09.d13:meVE.SticGlory.text
ltx/en_us_goadedes/eu.consecration:meCA.poet	@ltx/en_us_goadedes/poets:po.IoannouMonachou
ltx/en_us_goadedes/eu.consecration:meCA.title	@ltx/en_us_goadedes/titles:ti.CanonConsecration
ltx/en_us_goadedes/eu.consecration:meCA.verse	@ltx/en_us_goadedes/prayers:pr.verse_God.text
