ltx/en_us_goadedes/oc.m4.d1:ocBK.ModeNaked	@ltx/en_us_goadedes/miscellanea:misc.Mode4.naked
ltx/en_us_goadedes/oc.m4.d1:ocBK.mode.title	
ltx/en_us_goadedes/oc.m4.d1:ocGE.MM.BothHeirmologic.text	@ltx/en_us_goadedes/properties:media.key
ltx/en_us_goadedes/oc.m4.d1:ocGE.MM.BothSticheraric.text	@ltx/en_us_goadedes/properties:media.key
ltx/en_us_goadedes/oc.m4.d1:ocGE.MM.GloryHeirmologic.text	@ltx/en_us_goadedes/properties:media.key
ltx/en_us_goadedes/oc.m4.d1:ocGE.MM.GlorySticheraric.text	@ltx/en_us_goadedes/properties:media.key
ltx/en_us_goadedes/oc.m4.d1:ocLI.Beatitudes1.incipit	…
ltx/en_us_goadedes/oc.m4.d1:ocLI.Beatitudes1.melody	
ltx/en_us_goadedes/oc.m4.d1:ocLI.Beatitudes1.mode	@ltx/en_us_goadedes/miscellanea:misc.Mode4
ltx/en_us_goadedes/oc.m4.d1:ocLI.Beatitudes1.text	
ltx/en_us_goadedes/oc.m4.d1:ocLI.Beatitudes2.incipit	…
ltx/en_us_goadedes/oc.m4.d1:ocLI.Beatitudes2.melody	
ltx/en_us_goadedes/oc.m4.d1:ocLI.Beatitudes2.mode	@ltx/en_us_goadedes/miscellanea:misc.Mode4
ltx/en_us_goadedes/oc.m4.d1:ocLI.Beatitudes2.text	
ltx/en_us_goadedes/oc.m4.d1:ocLI.Beatitudes3.incipit	…
ltx/en_us_goadedes/oc.m4.d1:ocLI.Beatitudes3.melody	
ltx/en_us_goadedes/oc.m4.d1:ocLI.Beatitudes3.mode	@ltx/en_us_goadedes/miscellanea:misc.Mode4
ltx/en_us_goadedes/oc.m4.d1:ocLI.Beatitudes3.text	
ltx/en_us_goadedes/oc.m4.d1:ocLI.Beatitudes4.incipit	…
ltx/en_us_goadedes/oc.m4.d1:ocLI.Beatitudes4.melody	
ltx/en_us_goadedes/oc.m4.d1:ocLI.Beatitudes4.mode	@ltx/en_us_goadedes/miscellanea:misc.Mode4
ltx/en_us_goadedes/oc.m4.d1:ocLI.Beatitudes4.text	
ltx/en_us_goadedes/oc.m4.d1:ocLI.Beatitudes5.incipit	…
ltx/en_us_goadedes/oc.m4.d1:ocLI.Beatitudes5.melody	
ltx/en_us_goadedes/oc.m4.d1:ocLI.Beatitudes5.mode	@ltx/en_us_goadedes/miscellanea:misc.Mode4
ltx/en_us_goadedes/oc.m4.d1:ocLI.Beatitudes5.text	
ltx/en_us_goadedes/oc.m4.d1:ocLI.Beatitudes6.incipit	…
ltx/en_us_goadedes/oc.m4.d1:ocLI.Beatitudes6.melody	
ltx/en_us_goadedes/oc.m4.d1:ocLI.Beatitudes6.mode	@ltx/en_us_goadedes/miscellanea:misc.Mode4
ltx/en_us_goadedes/oc.m4.d1:ocLI.Beatitudes6.text	
ltx/en_us_goadedes/oc.m4.d1:ocLI.BeatitudesT.incipit	…
ltx/en_us_goadedes/oc.m4.d1:ocLI.BeatitudesT.melody	
ltx/en_us_goadedes/oc.m4.d1:ocLI.BeatitudesT.mode	@ltx/en_us_goadedes/miscellanea:misc.Mode4
ltx/en_us_goadedes/oc.m4.d1:ocLI.BeatitudesT.text	
ltx/en_us_goadedes/oc.m4.d1:ocLI.BeatitudesTr.incipit	…
ltx/en_us_goadedes/oc.m4.d1:ocLI.BeatitudesTr.melody	
ltx/en_us_goadedes/oc.m4.d1:ocLI.BeatitudesTr.mode	@ltx/en_us_goadedes/miscellanea:misc.Mode4
ltx/en_us_goadedes/oc.m4.d1:ocLI.BeatitudesTr.text	
ltx/en_us_goadedes/oc.m4.d1:ocLI.MM.Beatitudes123456TrTas5678910GB.text	@ltx/en_us_goadedes/properties:media.key
ltx/en_us_goadedes/oc.m4.d1:ocLI.MM.Beatitudes123Tas1234.text	@ltx/en_us_goadedes/properties:media.key
ltx/en_us_goadedes/oc.m4.d1:ocLI.MM.Beatitudes123Tas5678.text	@ltx/en_us_goadedes/properties:media.key
ltx/en_us_goadedes/oc.m4.d1:ocLI.MM.Prokeimenon.text	@ltx/en_us_goadedes/properties:media.key
ltx/en_us_goadedes/oc.m4.d1:ocMA.Antiphon11.incipit	From my youth…
ltx/en_us_goadedes/oc.m4.d1:ocMA.Antiphon11.melody	
ltx/en_us_goadedes/oc.m4.d1:ocMA.Antiphon11.mode	@ltx/en_us_goadedes/miscellanea:misc.Mode4
ltx/en_us_goadedes/oc.m4.d1:ocMA.Antiphon11.text	From my youth, many passions war against me. O my Savior, I implore You, uphold me and save me.
ltx/en_us_goadedes/oc.m4.d1:ocMA.Antiphon12.incipit	You who hate Zion…
ltx/en_us_goadedes/oc.m4.d1:ocMA.Antiphon12.melody	
ltx/en_us_goadedes/oc.m4.d1:ocMA.Antiphon12.mode	@ltx/en_us_goadedes/miscellanea:misc.Mode4
ltx/en_us_goadedes/oc.m4.d1:ocMA.Antiphon12.text	You who hate Zion, be shamed by the Lord; for you will be withered like grass in the fire.
ltx/en_us_goadedes/oc.m4.d1:ocMA.Antiphon13.incipit	By the Holy Spirit every soul…
ltx/en_us_goadedes/oc.m4.d1:ocMA.Antiphon13.melody	
ltx/en_us_goadedes/oc.m4.d1:ocMA.Antiphon13.mode	@ltx/en_us_goadedes/miscellanea:misc.Mode4
ltx/en_us_goadedes/oc.m4.d1:ocMA.Antiphon13.text	By the Holy Spirit every soul is animated, and when purified, it is mystically uplifted and brightened by the triune Godhead.
ltx/en_us_goadedes/oc.m4.d1:ocMA.Antiphon21.incipit	I have cried to You…
ltx/en_us_goadedes/oc.m4.d1:ocMA.Antiphon21.melody	
ltx/en_us_goadedes/oc.m4.d1:ocMA.Antiphon21.mode	@ltx/en_us_goadedes/miscellanea:misc.Mode4
ltx/en_us_goadedes/oc.m4.d1:ocMA.Antiphon21.text	I have cried to You, O Lord, from the depth of my soul with fervor. Let Your divine ears be attentive to me.
ltx/en_us_goadedes/oc.m4.d1:ocMA.Antiphon22.incipit	Everyone who has…
ltx/en_us_goadedes/oc.m4.d1:ocMA.Antiphon22.melody	
ltx/en_us_goadedes/oc.m4.d1:ocMA.Antiphon22.mode	@ltx/en_us_goadedes/miscellanea:misc.Mode4
ltx/en_us_goadedes/oc.m4.d1:ocMA.Antiphon22.text	Everyone who has their hope in the Lord is higher than anything that could sadden them.
ltx/en_us_goadedes/oc.m4.d1:ocMA.Antiphon23.incipit	From the Holy Spirit the streams…
ltx/en_us_goadedes/oc.m4.d1:ocMA.Antiphon23.melody	
ltx/en_us_goadedes/oc.m4.d1:ocMA.Antiphon23.mode	@ltx/en_us_goadedes/miscellanea:misc.Mode4
ltx/en_us_goadedes/oc.m4.d1:ocMA.Antiphon23.text	From the Holy Spirit the streams of grace well forth; they water all creation, so that life be engendered.
ltx/en_us_goadedes/oc.m4.d1:ocMA.Antiphon31.incipit	Let my heart be lifted…
ltx/en_us_goadedes/oc.m4.d1:ocMA.Antiphon31.melody	
ltx/en_us_goadedes/oc.m4.d1:ocMA.Antiphon31.mode	@ltx/en_us_goadedes/miscellanea:misc.Mode4
ltx/en_us_goadedes/oc.m4.d1:ocMA.Antiphon31.text	Let my heart be lifted up to You, O Logos; and none of the world’s delights will entice me to be earthly-minded.
ltx/en_us_goadedes/oc.m4.d1:ocMA.Antiphon32.incipit	Whereas one has filial…
ltx/en_us_goadedes/oc.m4.d1:ocMA.Antiphon32.melody	
ltx/en_us_goadedes/oc.m4.d1:ocMA.Antiphon32.mode	@ltx/en_us_goadedes/miscellanea:misc.Mode4
ltx/en_us_goadedes/oc.m4.d1:ocMA.Antiphon32.text	Whereas one has filial affection for his mother, for the Lord we ought to have a love even more fervent.
ltx/en_us_goadedes/oc.m4.d1:ocMA.Antiphon33.incipit	In the Holy Spirit is the wealth…
ltx/en_us_goadedes/oc.m4.d1:ocMA.Antiphon33.melody	
ltx/en_us_goadedes/oc.m4.d1:ocMA.Antiphon33.mode	@ltx/en_us_goadedes/miscellanea:misc.Mode4
ltx/en_us_goadedes/oc.m4.d1:ocMA.Antiphon33.text	In the Holy Spirit is the wealth of knowledge of God, contemplation and wisdom. For in Him the Logos discloses all the dogmas of the Father.
ltx/en_us_goadedes/oc.m4.d1:ocMA.ApolTheotokion.incipit	
ltx/en_us_goadedes/oc.m4.d1:ocMA.ApolTheotokion.melody	
ltx/en_us_goadedes/oc.m4.d1:ocMA.ApolTheotokion.mode	@ltx/en_us_goadedes/miscellanea:misc.Mode4
ltx/en_us_goadedes/oc.m4.d1:ocMA.ApolTheotokion.text	
ltx/en_us_goadedes/oc.m4.d1:ocMA.C1.poet	@ltx/en_us_goadedes/poets:po.IoannouTouDamaskinou
ltx/en_us_goadedes/oc.m4.d1:ocMA.C2.acrostic.notice1	
ltx/en_us_goadedes/oc.m4.d1:ocMA.C2.acrostic.text	
ltx/en_us_goadedes/oc.m4.d1:ocMA.C2.acrostic.title	Canon for the Cross and Resurrection.
ltx/en_us_goadedes/oc.m4.d1:ocMA.C3.acrostic.notice1	
ltx/en_us_goadedes/oc.m4.d1:ocMA.C3.acrostic.text	
ltx/en_us_goadedes/oc.m4.d1:ocMA.C3.acrostic.title	Canon for the Theotokos.
ltx/en_us_goadedes/oc.m4.d1:ocMA.Hypakoe.incipit	The Myrrh-bearing Women…
ltx/en_us_goadedes/oc.m4.d1:ocMA.Hypakoe.melody	
ltx/en_us_goadedes/oc.m4.d1:ocMA.Hypakoe.mode	@ltx/en_us_goadedes/miscellanea:misc.Mode4
ltx/en_us_goadedes/oc.m4.d1:ocMA.Hypakoe.text	The Myrrh-bearing Women hurried to declare the matter of Your paradoxal rising to Your Apostles, O Christ, that You rose, as God, and granted to the world the great mercy.
ltx/en_us_goadedes/oc.m4.d1:ocMA.Kathisma11.incipit	Looking up at the entrance…
ltx/en_us_goadedes/oc.m4.d1:ocMA.Kathisma11.melody	
ltx/en_us_goadedes/oc.m4.d1:ocMA.Kathisma11.mode	@ltx/en_us_goadedes/miscellanea:misc.Mode4
ltx/en_us_goadedes/oc.m4.d1:ocMA.Kathisma11.text	Looking up at the entrance to the sepulcher, then unable to endure the Angel’s radiance, the Myrrh-bearing Women were frightened; and perplexed they said, “Has He been stolen, who opened Paradise to the Robber? Has He arisen, who before His Passion announced His rising?” Indeed, Christ God has truly risen, granting life and resurrection to those in the netherworld.
ltx/en_us_goadedes/oc.m4.d1:ocMA.Kathisma12.greekmelody	@ltx/en_us_goadedes/he.a.m4:heAU.KateplagiIosif.greekname
ltx/en_us_goadedes/oc.m4.d1:ocMA.Kathisma12.incipit	By Your voluntary will…
ltx/en_us_goadedes/oc.m4.d1:ocMA.Kathisma12.melody	@ltx/en_us_goadedes/he.a.m4:heAU.KateplagiIosif.name
ltx/en_us_goadedes/oc.m4.d1:ocMA.Kathisma12.mode	@ltx/en_us_goadedes/miscellanea:misc.Mode4
ltx/en_us_goadedes/oc.m4.d1:ocMA.Kathisma12.text	By Your voluntary will, O Savior, You endured the Cross, * In a new tomb mortal men buried Your body, O Lord, * who by a word had created the universe. * Death, the ancient foe, was restrained by You * and forcefully deprived of the spoils it had. * And all the souls in Hades sang and glorified * Your resurrection, which gave them life, * “Christ the Giver of Life has risen! * And He abides forever!”
ltx/en_us_goadedes/oc.m4.d1:ocMA.Kathisma13.greekmelody	@ltx/en_us_goadedes/he.a.m4:heAU.KateplagiIosif.greekname
ltx/en_us_goadedes/oc.m4.d1:ocMA.Kathisma13.incipit	@ltx/en_us_goadedes/he.a.m4:heAU.KateplagiIosif.incipit
ltx/en_us_goadedes/oc.m4.d1:ocMA.Kathisma13.melody	@ltx/en_us_goadedes/he.a.m4:heAU.KateplagiIosif.melody
ltx/en_us_goadedes/oc.m4.d1:ocMA.Kathisma13.mode	@ltx/en_us_goadedes/miscellanea:misc.Mode4
ltx/en_us_goadedes/oc.m4.d1:ocMA.Kathisma13.text	@ltx/en_us_goadedes/he.a.m4:heAU.KateplagiIosif.text
ltx/en_us_goadedes/oc.m4.d1:ocMA.Kathisma21.greekmelody	@ltx/en_us_goadedes/he.a.m4:heAU.TachyProkatalave.greekname
ltx/en_us_goadedes/oc.m4.d1:ocMA.Kathisma21.incipit	You rose, as immortal…
ltx/en_us_goadedes/oc.m4.d1:ocMA.Kathisma21.melody	@ltx/en_us_goadedes/he.a.m4:heAU.TachyProkatalave.name
ltx/en_us_goadedes/oc.m4.d1:ocMA.Kathisma21.mode	@ltx/en_us_goadedes/miscellanea:misc.Mode4
ltx/en_us_goadedes/oc.m4.d1:ocMA.Kathisma21.text	You rose, as immortal Savior, from the netherworld, * and with yourself You also raised Your world by Your resurrection, O Christ our God. * Mightily You shattered the power of death, O Master. * Merciful Lord, You showed to all the resurrection. * Therefore we glorify You, only benevolent God.
ltx/en_us_goadedes/oc.m4.d1:ocMA.Kathisma22.greekmelody	@ltx/en_us_goadedes/he.a.m4:heAU.KateplagiIosif.greekname
ltx/en_us_goadedes/oc.m4.d1:ocMA.Kathisma22.incipit	From exalted heights…
ltx/en_us_goadedes/oc.m4.d1:ocMA.Kathisma22.melody	@ltx/en_us_goadedes/he.a.m4:heAU.KateplagiIosif.name
ltx/en_us_goadedes/oc.m4.d1:ocMA.Kathisma22.mode	@ltx/en_us_goadedes/miscellanea:misc.Mode4
ltx/en_us_goadedes/oc.m4.d1:ocMA.Kathisma22.text	From exalted heights above Gabriel came down to earth; * and he sat upon the rock wherein the Rock of life had lain. * Arrayed in white, he cried out to the weeping women, * “Women, even though you are emotional, * You no longer need to lament and mourn. * No more weeping, for the One you are seeking * has truly risen, so be of good cheer. * And go and tell it to His Apostles, * that the Lord has truly risen.”
ltx/en_us_goadedes/oc.m4.d1:ocMA.Kathisma23.greekmelody	@ltx/en_us_goadedes/he.a.m4:heAU.KateplagiIosif.greekname
ltx/en_us_goadedes/oc.m4.d1:ocMA.Kathisma23.incipit	O pure Virgin…
ltx/en_us_goadedes/oc.m4.d1:ocMA.Kathisma23.melody	@ltx/en_us_goadedes/he.a.m4:heAU.KateplagiIosif.name
ltx/en_us_goadedes/oc.m4.d1:ocMA.Kathisma23.mode	@ltx/en_us_goadedes/miscellanea:misc.Mode4
ltx/en_us_goadedes/oc.m4.d1:ocMA.Kathisma23.text	O pure Virgin, all the hosts of holy angels were amazed * at the awesome mystery of your pregnancy and birth, * how He whose simple command holds all things together * is held in your embrace as a mortal babe, * the pre-eternal Word accepts an origin; * and He is nursed who nourishes the whole world * in His ineffable kindness. * And they extol you and glorify you * who are truly Theotokos.
ltx/en_us_goadedes/oc.m4.d1:ocMA.Kontakion.incipit	He who saved…
ltx/en_us_goadedes/oc.m4.d1:ocMA.Kontakion.melody	@ltx/en_us_goadedes/he.a.m4:heAU.EpefanisSimeron.name
ltx/en_us_goadedes/oc.m4.d1:ocMA.Kontakion.mode	@ltx/en_us_goadedes/miscellanea:misc.Mode4
ltx/en_us_goadedes/oc.m4.d1:ocMA.Kontakion.text	He who saved and rescued me has resurrected from the tomb and bonds of death those born on earth, for He is God. He smashed the gates of the netherworld, and on the third day, He rose, as the Lord of all.
ltx/en_us_goadedes/oc.m4.d1:ocMA.Lauds1.incipit	You endured the Cross…
ltx/en_us_goadedes/oc.m4.d1:ocMA.Lauds1.melody	
ltx/en_us_goadedes/oc.m4.d1:ocMA.Lauds1.mode	@ltx/en_us_goadedes/miscellanea:misc.Mode4
ltx/en_us_goadedes/oc.m4.d1:ocMA.Lauds1.text	You endured the Cross and death, and You rose from the dead. O almighty Lord, we glorify Your resurrection.
ltx/en_us_goadedes/oc.m4.d1:ocMA.Lauds2.incipit	By Your Cross…
ltx/en_us_goadedes/oc.m4.d1:ocMA.Lauds2.melody	
ltx/en_us_goadedes/oc.m4.d1:ocMA.Lauds2.mode	@ltx/en_us_goadedes/miscellanea:misc.Mode4
ltx/en_us_goadedes/oc.m4.d1:ocMA.Lauds2.text	By Your Cross You freed us from the ancient curse, O Christ; and by Your death You neutralized the devil who tyrannized our nature; and by Your resurrection, You filled the whole world with joy. Therefore we sing to You, who rose from the dead, “Glory to You, O Lord.”
ltx/en_us_goadedes/oc.m4.d1:ocMA.Lauds3.incipit	O Christ our Savior…
ltx/en_us_goadedes/oc.m4.d1:ocMA.Lauds3.melody	
ltx/en_us_goadedes/oc.m4.d1:ocMA.Lauds3.mode	@ltx/en_us_goadedes/miscellanea:misc.Mode4
ltx/en_us_goadedes/oc.m4.d1:ocMA.Lauds3.text	O Christ our Savior, by Your Cross, guide us to Your truth, and deliver us from the snares of the foe. Since You have risen from the dead, reach out Your hand and raise us who have fallen into sin, O benevolent Lord, at the intercession of Your Saints.
ltx/en_us_goadedes/oc.m4.d1:ocMA.Lauds4.incipit	Never parting…
ltx/en_us_goadedes/oc.m4.d1:ocMA.Lauds4.melody	
ltx/en_us_goadedes/oc.m4.d1:ocMA.Lauds4.mode	@ltx/en_us_goadedes/miscellanea:misc.Mode4
ltx/en_us_goadedes/oc.m4.d1:ocMA.Lauds4.text	Never parting from the Father’s bosom, Only-begotten Logos of God, You came to earth, for the sake of humanity, and without change became man. And in the flesh You endured the Cross and death, remaining impassible in divinity. As the only almighty Lord, You rose from the dead, and You granted immortality to the human race.
ltx/en_us_goadedes/oc.m4.d1:ocMA.Lauds5.incipit	You accepted death…
ltx/en_us_goadedes/oc.m4.d1:ocMA.Lauds5.melody	
ltx/en_us_goadedes/oc.m4.d1:ocMA.Lauds5.mode	@ltx/en_us_goadedes/miscellanea:misc.Mode4
ltx/en_us_goadedes/oc.m4.d1:ocMA.Lauds5.text	You accepted death in the flesh, in order to achieve immortality for us, O Savior. You were confined in a tomb, that You might release us from Hades and resurrect us with yourself. You suffered as a man, but You rose as God. And therefore we now sing: “Glory to You, O Giver of Life and only benevolent Lord.”
ltx/en_us_goadedes/oc.m4.d1:ocMA.Lauds6.incipit	As Your cross stood…
ltx/en_us_goadedes/oc.m4.d1:ocMA.Lauds6.melody	
ltx/en_us_goadedes/oc.m4.d1:ocMA.Lauds6.mode	@ltx/en_us_goadedes/miscellanea:misc.Mode4
ltx/en_us_goadedes/oc.m4.d1:ocMA.Lauds6.text	As Your cross stood on Calvary, O Savior, the rocks were split. As a mortal You were laid in the sepulcher, and the doorkeepers of Hades quaked. By Your resurrection, O Savior, You neutralized the force of death and granted incorruption to all the dead. Lord and Giver of Life, glory to You!
ltx/en_us_goadedes/oc.m4.d1:ocMA.Lauds7.incipit	The women longed to see…
ltx/en_us_goadedes/oc.m4.d1:ocMA.Lauds7.melody	
ltx/en_us_goadedes/oc.m4.d1:ocMA.Lauds7.mode	@ltx/en_us_goadedes/miscellanea:misc.Mode4
ltx/en_us_goadedes/oc.m4.d1:ocMA.Lauds7.text	The women longed to see Your resurrection, O Christ God. Mary Magdalene had come before the others. She found the stone rolled away from the tomb. An Angel sat on it and said, “Why do you seek the living among the dead? He has risen, as God, to save the universe.”
ltx/en_us_goadedes/oc.m4.d1:ocMA.Lauds8.incipit	So where is Jesus…
ltx/en_us_goadedes/oc.m4.d1:ocMA.Lauds8.melody	
ltx/en_us_goadedes/oc.m4.d1:ocMA.Lauds8.mode	@ltx/en_us_goadedes/miscellanea:misc.Mode4
ltx/en_us_goadedes/oc.m4.d1:ocMA.Lauds8.text	So where is Jesus, whom you thought you were guarding? Tell us, O leaders of the Jews! Where is He who was laid in the sepulcher, the stone of which you sealed? Give up the dead man, you who rejected life. Give up the buried corpse, or believe in Him who rose from the dead. Even if you try to cover up the Lord’s resurrection, the stones will shout, especially the one that was rolled back from the sepulcher. “Great is Your mercy! Great is the mystery of Your plan for our salvation! Glory to You, our Savior!”
ltx/en_us_goadedes/oc.m4.d1:ocMA.MM.AntiphonsProkeimenon.text	@ltx/en_us_goadedes/properties:media.key
ltx/en_us_goadedes/oc.m4.d1:ocMA.MM.GodIsTheLord.text	@ltx/en_us_goadedes/properties:media.key
ltx/en_us_goadedes/oc.m4.d1:ocMA.MM.Lauds01.text	@ltx/en_us_goadedes/properties:media.key
ltx/en_us_goadedes/oc.m4.d1:ocMA.MM.Lauds02.text	@ltx/en_us_goadedes/properties:media.key
ltx/en_us_goadedes/oc.m4.d1:ocMA.MM.LaudsHeirmologic01.text	@ltx/en_us_goadedes/properties:media.key
ltx/en_us_goadedes/oc.m4.d1:ocMA.MM.LaudsHeirmologic02.text	@ltx/en_us_goadedes/properties:media.key
ltx/en_us_goadedes/oc.m4.d1:ocMA.MM.LaudsStichologia.text	
ltx/en_us_goadedes/oc.m4.d1:ocMA.MM.Prokeimenon.text	@ltx/en_us_goadedes/properties:media.key
ltx/en_us_goadedes/oc.m4.d1:ocMA.Magnificat.incipit	@ltx/en_us_goadedes/he.h.m6:heHE.TinTimioteran.incipit
ltx/en_us_goadedes/oc.m4.d1:ocMA.Magnificat.mode	@ltx/en_us_goadedes/miscellanea:misc.Mode4
ltx/en_us_goadedes/oc.m4.d1:ocMA.Magnificat.text	@ltx/en_us_goadedes/he.h.m6:heHE.TinTimioteran.text
ltx/en_us_goadedes/oc.m4.d1:ocMA.OdeS1C11.incipit	…
ltx/en_us_goadedes/oc.m4.d1:ocMA.OdeS1C11.melody	@ltx/en_us_goadedes/he.h.m4:heHE.ThalassisToErythraion.name
ltx/en_us_goadedes/oc.m4.d1:ocMA.OdeS1C11.mode	@ltx/en_us_goadedes/miscellanea:misc.Mode4
ltx/en_us_goadedes/oc.m4.d1:ocMA.OdeS1C11.ode	@ltx/en_us_goadedes/miscellanea:misc.Ode1
ltx/en_us_goadedes/oc.m4.d1:ocMA.OdeS1C11.text	
ltx/en_us_goadedes/oc.m4.d1:ocMA.OdeS1C12.incipit	…
ltx/en_us_goadedes/oc.m4.d1:ocMA.OdeS1C12.melody	@ltx/en_us_goadedes/he.h.m4:heHE.ThalassisToErythraion.name
ltx/en_us_goadedes/oc.m4.d1:ocMA.OdeS1C12.mode	@ltx/en_us_goadedes/miscellanea:misc.Mode4
ltx/en_us_goadedes/oc.m4.d1:ocMA.OdeS1C12.ode	@ltx/en_us_goadedes/miscellanea:misc.Ode1
ltx/en_us_goadedes/oc.m4.d1:ocMA.OdeS1C12.text	
ltx/en_us_goadedes/oc.m4.d1:ocMA.OdeS1C1H.greekmelody	@ltx/en_us_goadedes/he.h.m4:heHE.ThalassisToErythraion.greekname
ltx/en_us_goadedes/oc.m4.d1:ocMA.OdeS1C1H.incipit	@ltx/en_us_goadedes/he.h.m4:heHE.ThalassisToErythraion.incipit
ltx/en_us_goadedes/oc.m4.d1:ocMA.OdeS1C1H.melody	@ltx/en_us_goadedes/he.h.m4:heHE.ThalassisToErythraion.melody
ltx/en_us_goadedes/oc.m4.d1:ocMA.OdeS1C1H.mode	@ltx/en_us_goadedes/miscellanea:misc.Mode4
ltx/en_us_goadedes/oc.m4.d1:ocMA.OdeS1C1H.ode	@ltx/en_us_goadedes/miscellanea:misc.Ode1
ltx/en_us_goadedes/oc.m4.d1:ocMA.OdeS1C1H.text	@ltx/en_us_goadedes/he.h.m4:heHE.ThalassisToErythraion.text
ltx/en_us_goadedes/oc.m4.d1:ocMA.OdeS1C1T.incipit	…
ltx/en_us_goadedes/oc.m4.d1:ocMA.OdeS1C1T.melody	@ltx/en_us_goadedes/he.h.m4:heHE.ThalassisToErythraion.name
ltx/en_us_goadedes/oc.m4.d1:ocMA.OdeS1C1T.mode	@ltx/en_us_goadedes/miscellanea:misc.Mode4
ltx/en_us_goadedes/oc.m4.d1:ocMA.OdeS1C1T.ode	@ltx/en_us_goadedes/miscellanea:misc.Ode1
ltx/en_us_goadedes/oc.m4.d1:ocMA.OdeS1C1T.text	
ltx/en_us_goadedes/oc.m4.d1:ocMA.OdeS1C21.greekmelody	@ltx/en_us_goadedes/he.h.m4:heHE.AnoixoToStomaMou.greekname
ltx/en_us_goadedes/oc.m4.d1:ocMA.OdeS1C21.incipit	…
ltx/en_us_goadedes/oc.m4.d1:ocMA.OdeS1C21.melody	@ltx/en_us_goadedes/he.h.m4:heHE.AnoixoToStomaMou.name
ltx/en_us_goadedes/oc.m4.d1:ocMA.OdeS1C21.mode	@ltx/en_us_goadedes/miscellanea:misc.Mode4
ltx/en_us_goadedes/oc.m4.d1:ocMA.OdeS1C21.ode	@ltx/en_us_goadedes/miscellanea:misc.Ode1
ltx/en_us_goadedes/oc.m4.d1:ocMA.OdeS1C21.text	
ltx/en_us_goadedes/oc.m4.d1:ocMA.OdeS1C22.incipit	…
ltx/en_us_goadedes/oc.m4.d1:ocMA.OdeS1C22.melody	@ltx/en_us_goadedes/he.h.m4:heHE.AnoixoToStomaMou.name
ltx/en_us_goadedes/oc.m4.d1:ocMA.OdeS1C22.mode	@ltx/en_us_goadedes/miscellanea:misc.Mode4
ltx/en_us_goadedes/oc.m4.d1:ocMA.OdeS1C22.ode	@ltx/en_us_goadedes/miscellanea:misc.Ode1
ltx/en_us_goadedes/oc.m4.d1:ocMA.OdeS1C22.text	
ltx/en_us_goadedes/oc.m4.d1:ocMA.OdeS1C2H.incipit	…
ltx/en_us_goadedes/oc.m4.d1:ocMA.OdeS1C2H.melody	@ltx/en_us_goadedes/he.h.m4:heHE.AnoixoToStomaMou.name
ltx/en_us_goadedes/oc.m4.d1:ocMA.OdeS1C2H.mode	@ltx/en_us_goadedes/miscellanea:misc.Mode4
ltx/en_us_goadedes/oc.m4.d1:ocMA.OdeS1C2H.ode	@ltx/en_us_goadedes/miscellanea:misc.Ode1
ltx/en_us_goadedes/oc.m4.d1:ocMA.OdeS1C2H.text	
ltx/en_us_goadedes/oc.m4.d1:ocMA.OdeS1C2T.incipit	…
ltx/en_us_goadedes/oc.m4.d1:ocMA.OdeS1C2T.melody	@ltx/en_us_goadedes/he.h.m4:heHE.AnoixoToStomaMou.name
ltx/en_us_goadedes/oc.m4.d1:ocMA.OdeS1C2T.mode	@ltx/en_us_goadedes/miscellanea:misc.Mode4
ltx/en_us_goadedes/oc.m4.d1:ocMA.OdeS1C2T.ode	@ltx/en_us_goadedes/miscellanea:misc.Ode1
ltx/en_us_goadedes/oc.m4.d1:ocMA.OdeS1C2T.text	
ltx/en_us_goadedes/oc.m4.d1:ocMA.OdeS1C31.greekmelody	@ltx/en_us_goadedes/he.h.m4:heHE.TristatasKrataious.greekname
ltx/en_us_goadedes/oc.m4.d1:ocMA.OdeS1C31.incipit	…
ltx/en_us_goadedes/oc.m4.d1:ocMA.OdeS1C31.melody	@ltx/en_us_goadedes/he.h.m4:heHE.TristatasKrataious.name
ltx/en_us_goadedes/oc.m4.d1:ocMA.OdeS1C31.mode	@ltx/en_us_goadedes/miscellanea:misc.Mode4
ltx/en_us_goadedes/oc.m4.d1:ocMA.OdeS1C31.ode	@ltx/en_us_goadedes/miscellanea:misc.Ode1
ltx/en_us_goadedes/oc.m4.d1:ocMA.OdeS1C31.text	
ltx/en_us_goadedes/oc.m4.d1:ocMA.OdeS1C32.incipit	…
ltx/en_us_goadedes/oc.m4.d1:ocMA.OdeS1C32.melody	@ltx/en_us_goadedes/he.h.m4:heHE.TristatasKrataious.name
ltx/en_us_goadedes/oc.m4.d1:ocMA.OdeS1C32.mode	@ltx/en_us_goadedes/miscellanea:misc.Mode4
ltx/en_us_goadedes/oc.m4.d1:ocMA.OdeS1C32.ode	@ltx/en_us_goadedes/miscellanea:misc.Ode1
ltx/en_us_goadedes/oc.m4.d1:ocMA.OdeS1C32.text	
ltx/en_us_goadedes/oc.m4.d1:ocMA.OdeS3C11.incipit	…
ltx/en_us_goadedes/oc.m4.d1:ocMA.OdeS3C11.melody	@ltx/en_us_goadedes/he.h.m4:heHE.EffrainetaiEpiSoi.name
ltx/en_us_goadedes/oc.m4.d1:ocMA.OdeS3C11.mode	@ltx/en_us_goadedes/miscellanea:misc.Mode4
ltx/en_us_goadedes/oc.m4.d1:ocMA.OdeS3C11.ode	@ltx/en_us_goadedes/miscellanea:misc.Ode3
ltx/en_us_goadedes/oc.m4.d1:ocMA.OdeS3C11.text	
ltx/en_us_goadedes/oc.m4.d1:ocMA.OdeS3C12.incipit	…
ltx/en_us_goadedes/oc.m4.d1:ocMA.OdeS3C12.melody	@ltx/en_us_goadedes/he.h.m4:heHE.EffrainetaiEpiSoi.name
ltx/en_us_goadedes/oc.m4.d1:ocMA.OdeS3C12.mode	@ltx/en_us_goadedes/miscellanea:misc.Mode4
ltx/en_us_goadedes/oc.m4.d1:ocMA.OdeS3C12.ode	@ltx/en_us_goadedes/miscellanea:misc.Ode3
ltx/en_us_goadedes/oc.m4.d1:ocMA.OdeS3C12.text	
ltx/en_us_goadedes/oc.m4.d1:ocMA.OdeS3C1H.greekmelody	@ltx/en_us_goadedes/he.h.m4:heHE.EffrainetaiEpiSoi.greekname
ltx/en_us_goadedes/oc.m4.d1:ocMA.OdeS3C1H.incipit	@ltx/en_us_goadedes/he.h.m4:heHE.EffrainetaiEpiSoi.incipit
ltx/en_us_goadedes/oc.m4.d1:ocMA.OdeS3C1H.melody	@ltx/en_us_goadedes/he.h.m4:heHE.EffrainetaiEpiSoi.melody
ltx/en_us_goadedes/oc.m4.d1:ocMA.OdeS3C1H.mode	@ltx/en_us_goadedes/miscellanea:misc.Mode4
ltx/en_us_goadedes/oc.m4.d1:ocMA.OdeS3C1H.ode	@ltx/en_us_goadedes/miscellanea:misc.Ode3
ltx/en_us_goadedes/oc.m4.d1:ocMA.OdeS3C1H.text	@ltx/en_us_goadedes/he.h.m4:heHE.EffrainetaiEpiSoi.text
ltx/en_us_goadedes/oc.m4.d1:ocMA.OdeS3C1T.incipit	…
ltx/en_us_goadedes/oc.m4.d1:ocMA.OdeS3C1T.melody	@ltx/en_us_goadedes/he.h.m4:heHE.EffrainetaiEpiSoi.name
ltx/en_us_goadedes/oc.m4.d1:ocMA.OdeS3C1T.mode	@ltx/en_us_goadedes/miscellanea:misc.Mode4
ltx/en_us_goadedes/oc.m4.d1:ocMA.OdeS3C1T.ode	@ltx/en_us_goadedes/miscellanea:misc.Ode3
ltx/en_us_goadedes/oc.m4.d1:ocMA.OdeS3C1T.text	
ltx/en_us_goadedes/oc.m4.d1:ocMA.OdeS3C21.greekmelody	@ltx/en_us_goadedes/he.h.m4:heHE.TousSousYmnologous.greekname
ltx/en_us_goadedes/oc.m4.d1:ocMA.OdeS3C21.incipit	…
ltx/en_us_goadedes/oc.m4.d1:ocMA.OdeS3C21.melody	@ltx/en_us_goadedes/he.h.m4:heHE.TousSousYmnologous.name
ltx/en_us_goadedes/oc.m4.d1:ocMA.OdeS3C21.mode	@ltx/en_us_goadedes/miscellanea:misc.Mode4
ltx/en_us_goadedes/oc.m4.d1:ocMA.OdeS3C21.ode	@ltx/en_us_goadedes/miscellanea:misc.Ode3
ltx/en_us_goadedes/oc.m4.d1:ocMA.OdeS3C21.text	
ltx/en_us_goadedes/oc.m4.d1:ocMA.OdeS3C22.incipit	…
ltx/en_us_goadedes/oc.m4.d1:ocMA.OdeS3C22.melody	@ltx/en_us_goadedes/he.h.m4:heHE.TousSousYmnologous.name
ltx/en_us_goadedes/oc.m4.d1:ocMA.OdeS3C22.mode	@ltx/en_us_goadedes/miscellanea:misc.Mode4
ltx/en_us_goadedes/oc.m4.d1:ocMA.OdeS3C22.ode	@ltx/en_us_goadedes/miscellanea:misc.Ode3
ltx/en_us_goadedes/oc.m4.d1:ocMA.OdeS3C22.text	
ltx/en_us_goadedes/oc.m4.d1:ocMA.OdeS3C2H.incipit	…
ltx/en_us_goadedes/oc.m4.d1:ocMA.OdeS3C2H.melody	@ltx/en_us_goadedes/he.h.m4:heHE.TousSousYmnologous.name
ltx/en_us_goadedes/oc.m4.d1:ocMA.OdeS3C2H.mode	@ltx/en_us_goadedes/miscellanea:misc.Mode4
ltx/en_us_goadedes/oc.m4.d1:ocMA.OdeS3C2H.ode	@ltx/en_us_goadedes/miscellanea:misc.Ode3
ltx/en_us_goadedes/oc.m4.d1:ocMA.OdeS3C2H.text	
ltx/en_us_goadedes/oc.m4.d1:ocMA.OdeS3C2T.incipit	…
ltx/en_us_goadedes/oc.m4.d1:ocMA.OdeS3C2T.melody	@ltx/en_us_goadedes/he.h.m4:heHE.TousSousYmnologous.name
ltx/en_us_goadedes/oc.m4.d1:ocMA.OdeS3C2T.mode	@ltx/en_us_goadedes/miscellanea:misc.Mode4
ltx/en_us_goadedes/oc.m4.d1:ocMA.OdeS3C2T.ode	@ltx/en_us_goadedes/miscellanea:misc.Ode3
ltx/en_us_goadedes/oc.m4.d1:ocMA.OdeS3C2T.text	
ltx/en_us_goadedes/oc.m4.d1:ocMA.OdeS3C31.greekmelody	@ltx/en_us_goadedes/he.h.m4:heHE.AfYpsousKatilthes.greekname
ltx/en_us_goadedes/oc.m4.d1:ocMA.OdeS3C31.incipit	…
ltx/en_us_goadedes/oc.m4.d1:ocMA.OdeS3C31.melody	@ltx/en_us_goadedes/he.h.m4:heHE.AfYpsousKatilthes.name
ltx/en_us_goadedes/oc.m4.d1:ocMA.OdeS3C31.mode	@ltx/en_us_goadedes/miscellanea:misc.Mode4
ltx/en_us_goadedes/oc.m4.d1:ocMA.OdeS3C31.ode	@ltx/en_us_goadedes/miscellanea:misc.Ode3
ltx/en_us_goadedes/oc.m4.d1:ocMA.OdeS3C31.text	
ltx/en_us_goadedes/oc.m4.d1:ocMA.OdeS3C32.incipit	…
ltx/en_us_goadedes/oc.m4.d1:ocMA.OdeS3C32.melody	@ltx/en_us_goadedes/he.h.m4:heHE.AfYpsousKatilthes.name
ltx/en_us_goadedes/oc.m4.d1:ocMA.OdeS3C32.mode	@ltx/en_us_goadedes/miscellanea:misc.Mode4
ltx/en_us_goadedes/oc.m4.d1:ocMA.OdeS3C32.ode	@ltx/en_us_goadedes/miscellanea:misc.Ode3
ltx/en_us_goadedes/oc.m4.d1:ocMA.OdeS3C32.text	
ltx/en_us_goadedes/oc.m4.d1:ocMA.OdeS4C11.incipit	…
ltx/en_us_goadedes/oc.m4.d1:ocMA.OdeS4C11.melody	@ltx/en_us_goadedes/he.h.m4:heHE.EparthentaSeIdousa.name
ltx/en_us_goadedes/oc.m4.d1:ocMA.OdeS4C11.mode	@ltx/en_us_goadedes/miscellanea:misc.Mode4
ltx/en_us_goadedes/oc.m4.d1:ocMA.OdeS4C11.ode	@ltx/en_us_goadedes/miscellanea:misc.Ode4
ltx/en_us_goadedes/oc.m4.d1:ocMA.OdeS4C11.text	
ltx/en_us_goadedes/oc.m4.d1:ocMA.OdeS4C12.incipit	…
ltx/en_us_goadedes/oc.m4.d1:ocMA.OdeS4C12.melody	@ltx/en_us_goadedes/he.h.m4:heHE.EparthentaSeIdousa.name
ltx/en_us_goadedes/oc.m4.d1:ocMA.OdeS4C12.mode	@ltx/en_us_goadedes/miscellanea:misc.Mode4
ltx/en_us_goadedes/oc.m4.d1:ocMA.OdeS4C12.ode	@ltx/en_us_goadedes/miscellanea:misc.Ode4
ltx/en_us_goadedes/oc.m4.d1:ocMA.OdeS4C12.text	
ltx/en_us_goadedes/oc.m4.d1:ocMA.OdeS4C1H.greekmelody	@ltx/en_us_goadedes/he.h.m4:heHE.EparthentaSeIdousa.greekname
ltx/en_us_goadedes/oc.m4.d1:ocMA.OdeS4C1H.incipit	@ltx/en_us_goadedes/he.h.m4:heHE.EparthentaSeIdousa.incipit
ltx/en_us_goadedes/oc.m4.d1:ocMA.OdeS4C1H.melody	@ltx/en_us_goadedes/he.h.m4:heHE.EparthentaSeIdousa.melody
ltx/en_us_goadedes/oc.m4.d1:ocMA.OdeS4C1H.mode	@ltx/en_us_goadedes/miscellanea:misc.Mode4
ltx/en_us_goadedes/oc.m4.d1:ocMA.OdeS4C1H.ode	@ltx/en_us_goadedes/miscellanea:misc.Ode4
ltx/en_us_goadedes/oc.m4.d1:ocMA.OdeS4C1H.text	@ltx/en_us_goadedes/he.h.m4:heHE.EparthentaSeIdousa.text
ltx/en_us_goadedes/oc.m4.d1:ocMA.OdeS4C1T.incipit	…
ltx/en_us_goadedes/oc.m4.d1:ocMA.OdeS4C1T.melody	@ltx/en_us_goadedes/he.h.m4:heHE.EparthentaSeIdousa.name
ltx/en_us_goadedes/oc.m4.d1:ocMA.OdeS4C1T.mode	@ltx/en_us_goadedes/miscellanea:misc.Mode4
ltx/en_us_goadedes/oc.m4.d1:ocMA.OdeS4C1T.ode	@ltx/en_us_goadedes/miscellanea:misc.Ode4
ltx/en_us_goadedes/oc.m4.d1:ocMA.OdeS4C1T.text	
ltx/en_us_goadedes/oc.m4.d1:ocMA.OdeS4C21.greekmelody	@ltx/en_us_goadedes/he.h.m4:heHE.TinAnexichniaston.greekname
ltx/en_us_goadedes/oc.m4.d1:ocMA.OdeS4C21.incipit	…
ltx/en_us_goadedes/oc.m4.d1:ocMA.OdeS4C21.melody	@ltx/en_us_goadedes/he.h.m4:heHE.TinAnexichniaston.name
ltx/en_us_goadedes/oc.m4.d1:ocMA.OdeS4C21.mode	@ltx/en_us_goadedes/miscellanea:misc.Mode4
ltx/en_us_goadedes/oc.m4.d1:ocMA.OdeS4C21.ode	@ltx/en_us_goadedes/miscellanea:misc.Ode4
ltx/en_us_goadedes/oc.m4.d1:ocMA.OdeS4C21.text	
ltx/en_us_goadedes/oc.m4.d1:ocMA.OdeS4C22.incipit	…
ltx/en_us_goadedes/oc.m4.d1:ocMA.OdeS4C22.melody	@ltx/en_us_goadedes/he.h.m4:heHE.TinAnexichniaston.name
ltx/en_us_goadedes/oc.m4.d1:ocMA.OdeS4C22.mode	@ltx/en_us_goadedes/miscellanea:misc.Mode4
ltx/en_us_goadedes/oc.m4.d1:ocMA.OdeS4C22.ode	@ltx/en_us_goadedes/miscellanea:misc.Ode4
ltx/en_us_goadedes/oc.m4.d1:ocMA.OdeS4C22.text	
ltx/en_us_goadedes/oc.m4.d1:ocMA.OdeS4C2H.incipit	…
ltx/en_us_goadedes/oc.m4.d1:ocMA.OdeS4C2H.melody	@ltx/en_us_goadedes/he.h.m4:heHE.TinAnexichniaston.name
ltx/en_us_goadedes/oc.m4.d1:ocMA.OdeS4C2H.mode	@ltx/en_us_goadedes/miscellanea:misc.Mode4
ltx/en_us_goadedes/oc.m4.d1:ocMA.OdeS4C2H.ode	@ltx/en_us_goadedes/miscellanea:misc.Ode4
ltx/en_us_goadedes/oc.m4.d1:ocMA.OdeS4C2H.text	
ltx/en_us_goadedes/oc.m4.d1:ocMA.OdeS4C2T.incipit	…
ltx/en_us_goadedes/oc.m4.d1:ocMA.OdeS4C2T.melody	@ltx/en_us_goadedes/he.h.m4:heHE.TinAnexichniaston.name
ltx/en_us_goadedes/oc.m4.d1:ocMA.OdeS4C2T.mode	@ltx/en_us_goadedes/miscellanea:misc.Mode4
ltx/en_us_goadedes/oc.m4.d1:ocMA.OdeS4C2T.ode	@ltx/en_us_goadedes/miscellanea:misc.Ode4
ltx/en_us_goadedes/oc.m4.d1:ocMA.OdeS4C2T.text	
ltx/en_us_goadedes/oc.m4.d1:ocMA.OdeS4C31.greekmelody	@ltx/en_us_goadedes/he.h.m4:heHE.OKathimenosEnDoxi.greekname
ltx/en_us_goadedes/oc.m4.d1:ocMA.OdeS4C31.incipit	…
ltx/en_us_goadedes/oc.m4.d1:ocMA.OdeS4C31.melody	@ltx/en_us_goadedes/he.h.m4:heHE.OKathimenosEnDoxi.name
ltx/en_us_goadedes/oc.m4.d1:ocMA.OdeS4C31.mode	@ltx/en_us_goadedes/miscellanea:misc.Mode4
ltx/en_us_goadedes/oc.m4.d1:ocMA.OdeS4C31.ode	@ltx/en_us_goadedes/miscellanea:misc.Ode4
ltx/en_us_goadedes/oc.m4.d1:ocMA.OdeS4C31.text	
ltx/en_us_goadedes/oc.m4.d1:ocMA.OdeS4C32.incipit	…
ltx/en_us_goadedes/oc.m4.d1:ocMA.OdeS4C32.melody	@ltx/en_us_goadedes/he.h.m4:heHE.OKathimenosEnDoxi.name
ltx/en_us_goadedes/oc.m4.d1:ocMA.OdeS4C32.mode	@ltx/en_us_goadedes/miscellanea:misc.Mode4
ltx/en_us_goadedes/oc.m4.d1:ocMA.OdeS4C32.ode	@ltx/en_us_goadedes/miscellanea:misc.Ode4
ltx/en_us_goadedes/oc.m4.d1:ocMA.OdeS4C32.text	
ltx/en_us_goadedes/oc.m4.d1:ocMA.OdeS4C33.incipit	…
ltx/en_us_goadedes/oc.m4.d1:ocMA.OdeS4C33.melody	@ltx/en_us_goadedes/he.h.m4:heHE.OKathimenosEnDoxi.name
ltx/en_us_goadedes/oc.m4.d1:ocMA.OdeS4C33.mode	@ltx/en_us_goadedes/miscellanea:misc.Mode4
ltx/en_us_goadedes/oc.m4.d1:ocMA.OdeS4C33.ode	@ltx/en_us_goadedes/miscellanea:misc.Ode4
ltx/en_us_goadedes/oc.m4.d1:ocMA.OdeS4C33.text	
ltx/en_us_goadedes/oc.m4.d1:ocMA.OdeS5C11.incipit	…
ltx/en_us_goadedes/oc.m4.d1:ocMA.OdeS5C11.melody	@ltx/en_us_goadedes/he.h.m4:heHE.SyKyrieMouFos.name
ltx/en_us_goadedes/oc.m4.d1:ocMA.OdeS5C11.mode	@ltx/en_us_goadedes/miscellanea:misc.Mode4
ltx/en_us_goadedes/oc.m4.d1:ocMA.OdeS5C11.ode	@ltx/en_us_goadedes/miscellanea:misc.Ode5
ltx/en_us_goadedes/oc.m4.d1:ocMA.OdeS5C11.text	
ltx/en_us_goadedes/oc.m4.d1:ocMA.OdeS5C12.incipit	…
ltx/en_us_goadedes/oc.m4.d1:ocMA.OdeS5C12.melody	@ltx/en_us_goadedes/he.h.m4:heHE.SyKyrieMouFos.name
ltx/en_us_goadedes/oc.m4.d1:ocMA.OdeS5C12.mode	@ltx/en_us_goadedes/miscellanea:misc.Mode4
ltx/en_us_goadedes/oc.m4.d1:ocMA.OdeS5C12.ode	@ltx/en_us_goadedes/miscellanea:misc.Ode5
ltx/en_us_goadedes/oc.m4.d1:ocMA.OdeS5C12.text	
ltx/en_us_goadedes/oc.m4.d1:ocMA.OdeS5C1H.greekmelody	@ltx/en_us_goadedes/he.h.m4:heHE.SyKyrieMouFos.greekname
ltx/en_us_goadedes/oc.m4.d1:ocMA.OdeS5C1H.incipit	@ltx/en_us_goadedes/he.h.m4:heHE.SyKyrieMouFos.incipit
ltx/en_us_goadedes/oc.m4.d1:ocMA.OdeS5C1H.melody	@ltx/en_us_goadedes/he.h.m4:heHE.SyKyrieMouFos.melody
ltx/en_us_goadedes/oc.m4.d1:ocMA.OdeS5C1H.mode	@ltx/en_us_goadedes/miscellanea:misc.Mode4
ltx/en_us_goadedes/oc.m4.d1:ocMA.OdeS5C1H.ode	@ltx/en_us_goadedes/miscellanea:misc.Ode5
ltx/en_us_goadedes/oc.m4.d1:ocMA.OdeS5C1H.text	@ltx/en_us_goadedes/he.h.m4:heHE.SyKyrieMouFos.text
ltx/en_us_goadedes/oc.m4.d1:ocMA.OdeS5C1T.incipit	…
ltx/en_us_goadedes/oc.m4.d1:ocMA.OdeS5C1T.melody	@ltx/en_us_goadedes/he.h.m4:heHE.SyKyrieMouFos.name
ltx/en_us_goadedes/oc.m4.d1:ocMA.OdeS5C1T.mode	@ltx/en_us_goadedes/miscellanea:misc.Mode4
ltx/en_us_goadedes/oc.m4.d1:ocMA.OdeS5C1T.ode	@ltx/en_us_goadedes/miscellanea:misc.Ode5
ltx/en_us_goadedes/oc.m4.d1:ocMA.OdeS5C1T.text	
ltx/en_us_goadedes/oc.m4.d1:ocMA.OdeS5C21.greekmelody	@ltx/en_us_goadedes/he.h.m4:heHE.ExestiTaSympanta.greekname
ltx/en_us_goadedes/oc.m4.d1:ocMA.OdeS5C21.incipit	…
ltx/en_us_goadedes/oc.m4.d1:ocMA.OdeS5C21.melody	@ltx/en_us_goadedes/he.h.m4:heHE.ExestiTaSympanta.name
ltx/en_us_goadedes/oc.m4.d1:ocMA.OdeS5C21.mode	@ltx/en_us_goadedes/miscellanea:misc.Mode4
ltx/en_us_goadedes/oc.m4.d1:ocMA.OdeS5C21.ode	@ltx/en_us_goadedes/miscellanea:misc.Ode5
ltx/en_us_goadedes/oc.m4.d1:ocMA.OdeS5C21.text	
ltx/en_us_goadedes/oc.m4.d1:ocMA.OdeS5C22.incipit	…
ltx/en_us_goadedes/oc.m4.d1:ocMA.OdeS5C22.melody	@ltx/en_us_goadedes/he.h.m4:heHE.ExestiTaSympanta.name
ltx/en_us_goadedes/oc.m4.d1:ocMA.OdeS5C22.mode	@ltx/en_us_goadedes/miscellanea:misc.Mode4
ltx/en_us_goadedes/oc.m4.d1:ocMA.OdeS5C22.ode	@ltx/en_us_goadedes/miscellanea:misc.Ode5
ltx/en_us_goadedes/oc.m4.d1:ocMA.OdeS5C22.text	
ltx/en_us_goadedes/oc.m4.d1:ocMA.OdeS5C2H.incipit	…
ltx/en_us_goadedes/oc.m4.d1:ocMA.OdeS5C2H.melody	
ltx/en_us_goadedes/oc.m4.d1:ocMA.OdeS5C2H.mode	@ltx/en_us_goadedes/miscellanea:misc.Mode4
ltx/en_us_goadedes/oc.m4.d1:ocMA.OdeS5C2H.ode	@ltx/en_us_goadedes/miscellanea:misc.Ode5
ltx/en_us_goadedes/oc.m4.d1:ocMA.OdeS5C2H.text	
ltx/en_us_goadedes/oc.m4.d1:ocMA.OdeS5C2T.incipit	…
ltx/en_us_goadedes/oc.m4.d1:ocMA.OdeS5C2T.melody	@ltx/en_us_goadedes/he.h.m4:heHE.ExestiTaSympanta.name
ltx/en_us_goadedes/oc.m4.d1:ocMA.OdeS5C2T.mode	@ltx/en_us_goadedes/miscellanea:misc.Mode4
ltx/en_us_goadedes/oc.m4.d1:ocMA.OdeS5C2T.ode	@ltx/en_us_goadedes/miscellanea:misc.Ode5
ltx/en_us_goadedes/oc.m4.d1:ocMA.OdeS5C2T.text	
ltx/en_us_goadedes/oc.m4.d1:ocMA.OdeS5C31.greekmelody	@ltx/en_us_goadedes/he.h.m4:heHE.NynAnastisomai.greekname
ltx/en_us_goadedes/oc.m4.d1:ocMA.OdeS5C31.incipit	…
ltx/en_us_goadedes/oc.m4.d1:ocMA.OdeS5C31.melody	@ltx/en_us_goadedes/he.h.m4:heHE.NynAnastisomai.name
ltx/en_us_goadedes/oc.m4.d1:ocMA.OdeS5C31.mode	@ltx/en_us_goadedes/miscellanea:misc.Mode4
ltx/en_us_goadedes/oc.m4.d1:ocMA.OdeS5C31.ode	@ltx/en_us_goadedes/miscellanea:misc.Ode5
ltx/en_us_goadedes/oc.m4.d1:ocMA.OdeS5C31.text	
ltx/en_us_goadedes/oc.m4.d1:ocMA.OdeS5C32.incipit	…
ltx/en_us_goadedes/oc.m4.d1:ocMA.OdeS5C32.melody	@ltx/en_us_goadedes/he.h.m4:heHE.NynAnastisomai.name
ltx/en_us_goadedes/oc.m4.d1:ocMA.OdeS5C32.mode	@ltx/en_us_goadedes/miscellanea:misc.Mode4
ltx/en_us_goadedes/oc.m4.d1:ocMA.OdeS5C32.ode	@ltx/en_us_goadedes/miscellanea:misc.Ode5
ltx/en_us_goadedes/oc.m4.d1:ocMA.OdeS5C32.text	
ltx/en_us_goadedes/oc.m4.d1:ocMA.OdeS5C33.incipit	…
ltx/en_us_goadedes/oc.m4.d1:ocMA.OdeS5C33.melody	@ltx/en_us_goadedes/he.h.m4:heHE.NynAnastisomai.name
ltx/en_us_goadedes/oc.m4.d1:ocMA.OdeS5C33.mode	@ltx/en_us_goadedes/miscellanea:misc.Mode4
ltx/en_us_goadedes/oc.m4.d1:ocMA.OdeS5C33.ode	@ltx/en_us_goadedes/miscellanea:misc.Ode5
ltx/en_us_goadedes/oc.m4.d1:ocMA.OdeS5C33.text	
ltx/en_us_goadedes/oc.m4.d1:ocMA.OdeS6C11.incipit	…
ltx/en_us_goadedes/oc.m4.d1:ocMA.OdeS6C11.melody	@ltx/en_us_goadedes/he.h.m4:heHE.ThysoSoiMetaFonis.name
ltx/en_us_goadedes/oc.m4.d1:ocMA.OdeS6C11.mode	@ltx/en_us_goadedes/miscellanea:misc.Mode4
ltx/en_us_goadedes/oc.m4.d1:ocMA.OdeS6C11.ode	@ltx/en_us_goadedes/miscellanea:misc.Ode6
ltx/en_us_goadedes/oc.m4.d1:ocMA.OdeS6C11.text	
ltx/en_us_goadedes/oc.m4.d1:ocMA.OdeS6C12.incipit	…
ltx/en_us_goadedes/oc.m4.d1:ocMA.OdeS6C12.melody	@ltx/en_us_goadedes/he.h.m4:heHE.ThysoSoiMetaFonis.name
ltx/en_us_goadedes/oc.m4.d1:ocMA.OdeS6C12.mode	@ltx/en_us_goadedes/miscellanea:misc.Mode4
ltx/en_us_goadedes/oc.m4.d1:ocMA.OdeS6C12.ode	@ltx/en_us_goadedes/miscellanea:misc.Ode6
ltx/en_us_goadedes/oc.m4.d1:ocMA.OdeS6C12.text	
ltx/en_us_goadedes/oc.m4.d1:ocMA.OdeS6C1H.greekmelody	@ltx/en_us_goadedes/he.h.m4:heHE.ThysoSoiMetaFonis.greekname
ltx/en_us_goadedes/oc.m4.d1:ocMA.OdeS6C1H.incipit	@ltx/en_us_goadedes/he.h.m4:heHE.ThysoSoiMetaFonis.incipit
ltx/en_us_goadedes/oc.m4.d1:ocMA.OdeS6C1H.melody	@ltx/en_us_goadedes/he.h.m4:heHE.ThysoSoiMetaFonis.melody
ltx/en_us_goadedes/oc.m4.d1:ocMA.OdeS6C1H.mode	@ltx/en_us_goadedes/miscellanea:misc.Mode4
ltx/en_us_goadedes/oc.m4.d1:ocMA.OdeS6C1H.ode	@ltx/en_us_goadedes/miscellanea:misc.Ode6
ltx/en_us_goadedes/oc.m4.d1:ocMA.OdeS6C1H.text	@ltx/en_us_goadedes/he.h.m4:heHE.ThysoSoiMetaFonis.text
ltx/en_us_goadedes/oc.m4.d1:ocMA.OdeS6C1T.incipit	…
ltx/en_us_goadedes/oc.m4.d1:ocMA.OdeS6C1T.melody	@ltx/en_us_goadedes/he.h.m4:heHE.ThysoSoiMetaFonis.name
ltx/en_us_goadedes/oc.m4.d1:ocMA.OdeS6C1T.mode	@ltx/en_us_goadedes/miscellanea:misc.Mode4
ltx/en_us_goadedes/oc.m4.d1:ocMA.OdeS6C1T.ode	@ltx/en_us_goadedes/miscellanea:misc.Ode6
ltx/en_us_goadedes/oc.m4.d1:ocMA.OdeS6C1T.text	
ltx/en_us_goadedes/oc.m4.d1:ocMA.OdeS6C21.greekmelody	@ltx/en_us_goadedes/he.h.m4:heHE.IlthonEisTaVathi.greekname
ltx/en_us_goadedes/oc.m4.d1:ocMA.OdeS6C21.incipit	…
ltx/en_us_goadedes/oc.m4.d1:ocMA.OdeS6C21.melody	@ltx/en_us_goadedes/he.h.m4:heHE.IlthonEisTaVathi.name
ltx/en_us_goadedes/oc.m4.d1:ocMA.OdeS6C21.mode	@ltx/en_us_goadedes/miscellanea:misc.Mode4
ltx/en_us_goadedes/oc.m4.d1:ocMA.OdeS6C21.ode	@ltx/en_us_goadedes/miscellanea:misc.Ode6
ltx/en_us_goadedes/oc.m4.d1:ocMA.OdeS6C21.text	
ltx/en_us_goadedes/oc.m4.d1:ocMA.OdeS6C22.incipit	…
ltx/en_us_goadedes/oc.m4.d1:ocMA.OdeS6C22.melody	@ltx/en_us_goadedes/he.h.m4:heHE.IlthonEisTaVathi.name
ltx/en_us_goadedes/oc.m4.d1:ocMA.OdeS6C22.mode	@ltx/en_us_goadedes/miscellanea:misc.Mode4
ltx/en_us_goadedes/oc.m4.d1:ocMA.OdeS6C22.ode	@ltx/en_us_goadedes/miscellanea:misc.Ode6
ltx/en_us_goadedes/oc.m4.d1:ocMA.OdeS6C22.text	
ltx/en_us_goadedes/oc.m4.d1:ocMA.OdeS6C2H.incipit	…
ltx/en_us_goadedes/oc.m4.d1:ocMA.OdeS6C2H.melody	
ltx/en_us_goadedes/oc.m4.d1:ocMA.OdeS6C2H.mode	@ltx/en_us_goadedes/miscellanea:misc.Mode4
ltx/en_us_goadedes/oc.m4.d1:ocMA.OdeS6C2H.ode	@ltx/en_us_goadedes/miscellanea:misc.Ode6
ltx/en_us_goadedes/oc.m4.d1:ocMA.OdeS6C2H.text	
ltx/en_us_goadedes/oc.m4.d1:ocMA.OdeS6C2T.incipit	…
ltx/en_us_goadedes/oc.m4.d1:ocMA.OdeS6C2T.melody	@ltx/en_us_goadedes/he.h.m4:heHE.IlthonEisTaVathi.name
ltx/en_us_goadedes/oc.m4.d1:ocMA.OdeS6C2T.mode	@ltx/en_us_goadedes/miscellanea:misc.Mode4
ltx/en_us_goadedes/oc.m4.d1:ocMA.OdeS6C2T.ode	@ltx/en_us_goadedes/miscellanea:misc.Ode6
ltx/en_us_goadedes/oc.m4.d1:ocMA.OdeS6C2T.text	
ltx/en_us_goadedes/oc.m4.d1:ocMA.OdeS6C31.greekmelody	@ltx/en_us_goadedes/he.h.m4:heHE.IlthonEisTaVathi.greekname
ltx/en_us_goadedes/oc.m4.d1:ocMA.OdeS6C31.incipit	…
ltx/en_us_goadedes/oc.m4.d1:ocMA.OdeS6C31.melody	@ltx/en_us_goadedes/he.h.m4:heHE.IlthonEisTaVathi.name
ltx/en_us_goadedes/oc.m4.d1:ocMA.OdeS6C31.mode	@ltx/en_us_goadedes/miscellanea:misc.Mode4
ltx/en_us_goadedes/oc.m4.d1:ocMA.OdeS6C31.ode	@ltx/en_us_goadedes/miscellanea:misc.Ode6
ltx/en_us_goadedes/oc.m4.d1:ocMA.OdeS6C31.text	
ltx/en_us_goadedes/oc.m4.d1:ocMA.OdeS6C32.incipit	…
ltx/en_us_goadedes/oc.m4.d1:ocMA.OdeS6C32.melody	@ltx/en_us_goadedes/he.h.m4:heHE.IlthonEisTaVathi.name
ltx/en_us_goadedes/oc.m4.d1:ocMA.OdeS6C32.mode	@ltx/en_us_goadedes/miscellanea:misc.Mode4
ltx/en_us_goadedes/oc.m4.d1:ocMA.OdeS6C32.ode	@ltx/en_us_goadedes/miscellanea:misc.Ode6
ltx/en_us_goadedes/oc.m4.d1:ocMA.OdeS6C32.text	
ltx/en_us_goadedes/oc.m4.d1:ocMA.OdeS7C11.incipit	…
ltx/en_us_goadedes/oc.m4.d1:ocMA.OdeS7C11.melody	@ltx/en_us_goadedes/he.h.m4:heHE.EnTiKaminoAvramiaioi.name
ltx/en_us_goadedes/oc.m4.d1:ocMA.OdeS7C11.mode	@ltx/en_us_goadedes/miscellanea:misc.Mode4
ltx/en_us_goadedes/oc.m4.d1:ocMA.OdeS7C11.ode	@ltx/en_us_goadedes/miscellanea:misc.Ode7
ltx/en_us_goadedes/oc.m4.d1:ocMA.OdeS7C11.text	
ltx/en_us_goadedes/oc.m4.d1:ocMA.OdeS7C12.incipit	…
ltx/en_us_goadedes/oc.m4.d1:ocMA.OdeS7C12.melody	@ltx/en_us_goadedes/he.h.m4:heHE.EnTiKaminoAvramiaioi.name
ltx/en_us_goadedes/oc.m4.d1:ocMA.OdeS7C12.mode	@ltx/en_us_goadedes/miscellanea:misc.Mode4
ltx/en_us_goadedes/oc.m4.d1:ocMA.OdeS7C12.ode	@ltx/en_us_goadedes/miscellanea:misc.Ode7
ltx/en_us_goadedes/oc.m4.d1:ocMA.OdeS7C12.text	
ltx/en_us_goadedes/oc.m4.d1:ocMA.OdeS7C1H.greekmelody	@ltx/en_us_goadedes/he.h.m4:heHE.EnTiKaminoAvramiaioi.greekname
ltx/en_us_goadedes/oc.m4.d1:ocMA.OdeS7C1H.incipit	@ltx/en_us_goadedes/he.h.m4:heHE.EnTiKaminoAvramiaioi.incipit
ltx/en_us_goadedes/oc.m4.d1:ocMA.OdeS7C1H.melody	@ltx/en_us_goadedes/he.h.m4:heHE.EnTiKaminoAvramiaioi.melody
ltx/en_us_goadedes/oc.m4.d1:ocMA.OdeS7C1H.mode	@ltx/en_us_goadedes/miscellanea:misc.Mode4
ltx/en_us_goadedes/oc.m4.d1:ocMA.OdeS7C1H.ode	@ltx/en_us_goadedes/miscellanea:misc.Ode7
ltx/en_us_goadedes/oc.m4.d1:ocMA.OdeS7C1H.text	@ltx/en_us_goadedes/he.h.m4:heHE.EnTiKaminoAvramiaioi.text
ltx/en_us_goadedes/oc.m4.d1:ocMA.OdeS7C1T.incipit	…
ltx/en_us_goadedes/oc.m4.d1:ocMA.OdeS7C1T.melody	@ltx/en_us_goadedes/he.h.m4:heHE.EnTiKaminoAvramiaioi.name
ltx/en_us_goadedes/oc.m4.d1:ocMA.OdeS7C1T.mode	@ltx/en_us_goadedes/miscellanea:misc.Mode4
ltx/en_us_goadedes/oc.m4.d1:ocMA.OdeS7C1T.ode	@ltx/en_us_goadedes/miscellanea:misc.Ode7
ltx/en_us_goadedes/oc.m4.d1:ocMA.OdeS7C1T.text	
ltx/en_us_goadedes/oc.m4.d1:ocMA.OdeS7C21.greekmelody	@ltx/en_us_goadedes/he.h.m4:heHE.OukElatrefsan.greekname
ltx/en_us_goadedes/oc.m4.d1:ocMA.OdeS7C21.incipit	…
ltx/en_us_goadedes/oc.m4.d1:ocMA.OdeS7C21.melody	@ltx/en_us_goadedes/he.h.m4:heHE.OukElatrefsan.name
ltx/en_us_goadedes/oc.m4.d1:ocMA.OdeS7C21.mode	@ltx/en_us_goadedes/miscellanea:misc.Mode4
ltx/en_us_goadedes/oc.m4.d1:ocMA.OdeS7C21.ode	@ltx/en_us_goadedes/miscellanea:misc.Ode7
ltx/en_us_goadedes/oc.m4.d1:ocMA.OdeS7C21.text	
ltx/en_us_goadedes/oc.m4.d1:ocMA.OdeS7C22.incipit	…
ltx/en_us_goadedes/oc.m4.d1:ocMA.OdeS7C22.melody	@ltx/en_us_goadedes/he.h.m4:heHE.OukElatrefsan.name
ltx/en_us_goadedes/oc.m4.d1:ocMA.OdeS7C22.mode	@ltx/en_us_goadedes/miscellanea:misc.Mode4
ltx/en_us_goadedes/oc.m4.d1:ocMA.OdeS7C22.ode	@ltx/en_us_goadedes/miscellanea:misc.Ode7
ltx/en_us_goadedes/oc.m4.d1:ocMA.OdeS7C22.text	
ltx/en_us_goadedes/oc.m4.d1:ocMA.OdeS7C2H.incipit	…
ltx/en_us_goadedes/oc.m4.d1:ocMA.OdeS7C2H.melody	@ltx/en_us_goadedes/he.h.m4:heHE.OukElatrefsan.name
ltx/en_us_goadedes/oc.m4.d1:ocMA.OdeS7C2H.mode	@ltx/en_us_goadedes/miscellanea:misc.Mode4
ltx/en_us_goadedes/oc.m4.d1:ocMA.OdeS7C2H.ode	@ltx/en_us_goadedes/miscellanea:misc.Ode7
ltx/en_us_goadedes/oc.m4.d1:ocMA.OdeS7C2H.text	
ltx/en_us_goadedes/oc.m4.d1:ocMA.OdeS7C2Tr.incipit	…
ltx/en_us_goadedes/oc.m4.d1:ocMA.OdeS7C2Tr.melody	@ltx/en_us_goadedes/he.h.m4:heHE.OukElatrefsan.name
ltx/en_us_goadedes/oc.m4.d1:ocMA.OdeS7C2Tr.mode	@ltx/en_us_goadedes/miscellanea:misc.Mode4
ltx/en_us_goadedes/oc.m4.d1:ocMA.OdeS7C2Tr.ode	@ltx/en_us_goadedes/miscellanea:misc.Ode7
ltx/en_us_goadedes/oc.m4.d1:ocMA.OdeS7C2Tr.text	
ltx/en_us_goadedes/oc.m4.d1:ocMA.OdeS7C31.greekmelody	@ltx/en_us_goadedes/he.h.m4:heHE.NeoiTreisEnVavyloni.greekname
ltx/en_us_goadedes/oc.m4.d1:ocMA.OdeS7C31.incipit	…
ltx/en_us_goadedes/oc.m4.d1:ocMA.OdeS7C31.melody	@ltx/en_us_goadedes/he.h.m4:heHE.NeoiTreisEnVavyloni.name
ltx/en_us_goadedes/oc.m4.d1:ocMA.OdeS7C31.mode	@ltx/en_us_goadedes/miscellanea:misc.Mode4
ltx/en_us_goadedes/oc.m4.d1:ocMA.OdeS7C31.ode	@ltx/en_us_goadedes/miscellanea:misc.Ode7
ltx/en_us_goadedes/oc.m4.d1:ocMA.OdeS7C31.text	
ltx/en_us_goadedes/oc.m4.d1:ocMA.OdeS7C32.incipit	…
ltx/en_us_goadedes/oc.m4.d1:ocMA.OdeS7C32.melody	@ltx/en_us_goadedes/he.h.m4:heHE.NeoiTreisEnVavyloni.name
ltx/en_us_goadedes/oc.m4.d1:ocMA.OdeS7C32.mode	@ltx/en_us_goadedes/miscellanea:misc.Mode4
ltx/en_us_goadedes/oc.m4.d1:ocMA.OdeS7C32.ode	@ltx/en_us_goadedes/miscellanea:misc.Ode7
ltx/en_us_goadedes/oc.m4.d1:ocMA.OdeS7C32.text	
ltx/en_us_goadedes/oc.m4.d1:ocMA.OdeS7C3Tr.incipit	…
ltx/en_us_goadedes/oc.m4.d1:ocMA.OdeS7C3Tr.melody	@ltx/en_us_goadedes/he.h.m4:heHE.NeoiTreisEnVavyloni.name
ltx/en_us_goadedes/oc.m4.d1:ocMA.OdeS7C3Tr.mode	@ltx/en_us_goadedes/miscellanea:misc.Mode4
ltx/en_us_goadedes/oc.m4.d1:ocMA.OdeS7C3Tr.ode	@ltx/en_us_goadedes/miscellanea:misc.Ode7
ltx/en_us_goadedes/oc.m4.d1:ocMA.OdeS7C3Tr.text	
ltx/en_us_goadedes/oc.m4.d1:ocMA.OdeS8C11.incipit	…
ltx/en_us_goadedes/oc.m4.d1:ocMA.OdeS8C11.melody	@ltx/en_us_goadedes/he.h.m4:heHE.CheirasEkpetasasDaniil.name
ltx/en_us_goadedes/oc.m4.d1:ocMA.OdeS8C11.mode	@ltx/en_us_goadedes/miscellanea:misc.Mode4
ltx/en_us_goadedes/oc.m4.d1:ocMA.OdeS8C11.ode	@ltx/en_us_goadedes/miscellanea:misc.Ode8
ltx/en_us_goadedes/oc.m4.d1:ocMA.OdeS8C11.text	
ltx/en_us_goadedes/oc.m4.d1:ocMA.OdeS8C12.incipit	…
ltx/en_us_goadedes/oc.m4.d1:ocMA.OdeS8C12.melody	@ltx/en_us_goadedes/he.h.m4:heHE.CheirasEkpetasasDaniil.name
ltx/en_us_goadedes/oc.m4.d1:ocMA.OdeS8C12.mode	@ltx/en_us_goadedes/miscellanea:misc.Mode4
ltx/en_us_goadedes/oc.m4.d1:ocMA.OdeS8C12.ode	@ltx/en_us_goadedes/miscellanea:misc.Ode8
ltx/en_us_goadedes/oc.m4.d1:ocMA.OdeS8C12.text	
ltx/en_us_goadedes/oc.m4.d1:ocMA.OdeS8C1H.greekmelody	@ltx/en_us_goadedes/he.h.m4:heHE.CheirasEkpetasasDaniil.greekname
ltx/en_us_goadedes/oc.m4.d1:ocMA.OdeS8C1H.incipit	@ltx/en_us_goadedes/he.h.m4:heHE.CheirasEkpetasasDaniil.incipit
ltx/en_us_goadedes/oc.m4.d1:ocMA.OdeS8C1H.melody	@ltx/en_us_goadedes/he.h.m4:heHE.CheirasEkpetasasDaniil.melody
ltx/en_us_goadedes/oc.m4.d1:ocMA.OdeS8C1H.mode	@ltx/en_us_goadedes/miscellanea:misc.Mode4
ltx/en_us_goadedes/oc.m4.d1:ocMA.OdeS8C1H.ode	@ltx/en_us_goadedes/miscellanea:misc.Ode8
ltx/en_us_goadedes/oc.m4.d1:ocMA.OdeS8C1H.text	@ltx/en_us_goadedes/he.h.m4:heHE.CheirasEkpetasasDaniil.text
ltx/en_us_goadedes/oc.m4.d1:ocMA.OdeS8C1T.incipit	…
ltx/en_us_goadedes/oc.m4.d1:ocMA.OdeS8C1T.melody	@ltx/en_us_goadedes/he.h.m4:heHE.CheirasEkpetasasDaniil.name
ltx/en_us_goadedes/oc.m4.d1:ocMA.OdeS8C1T.mode	@ltx/en_us_goadedes/miscellanea:misc.Mode4
ltx/en_us_goadedes/oc.m4.d1:ocMA.OdeS8C1T.ode	@ltx/en_us_goadedes/miscellanea:misc.Ode8
ltx/en_us_goadedes/oc.m4.d1:ocMA.OdeS8C1T.text	
ltx/en_us_goadedes/oc.m4.d1:ocMA.OdeS8C21.greekmelody	@ltx/en_us_goadedes/he.h.m4:heHE.PaidasEvageis.greekname
ltx/en_us_goadedes/oc.m4.d1:ocMA.OdeS8C21.incipit	…
ltx/en_us_goadedes/oc.m4.d1:ocMA.OdeS8C21.melody	@ltx/en_us_goadedes/he.h.m4:heHE.PaidasEvageis.name
ltx/en_us_goadedes/oc.m4.d1:ocMA.OdeS8C21.mode	@ltx/en_us_goadedes/miscellanea:misc.Mode4
ltx/en_us_goadedes/oc.m4.d1:ocMA.OdeS8C21.ode	@ltx/en_us_goadedes/miscellanea:misc.Ode8
ltx/en_us_goadedes/oc.m4.d1:ocMA.OdeS8C21.text	
ltx/en_us_goadedes/oc.m4.d1:ocMA.OdeS8C22.incipit	…
ltx/en_us_goadedes/oc.m4.d1:ocMA.OdeS8C22.melody	@ltx/en_us_goadedes/he.h.m4:heHE.PaidasEvageis.name
ltx/en_us_goadedes/oc.m4.d1:ocMA.OdeS8C22.mode	@ltx/en_us_goadedes/miscellanea:misc.Mode4
ltx/en_us_goadedes/oc.m4.d1:ocMA.OdeS8C22.ode	@ltx/en_us_goadedes/miscellanea:misc.Ode8
ltx/en_us_goadedes/oc.m4.d1:ocMA.OdeS8C22.text	
ltx/en_us_goadedes/oc.m4.d1:ocMA.OdeS8C2H.incipit	…
ltx/en_us_goadedes/oc.m4.d1:ocMA.OdeS8C2H.melody	@ltx/en_us_goadedes/he.h.m4:heHE.PaidasEvageis.name
ltx/en_us_goadedes/oc.m4.d1:ocMA.OdeS8C2H.mode	@ltx/en_us_goadedes/miscellanea:misc.Mode4
ltx/en_us_goadedes/oc.m4.d1:ocMA.OdeS8C2H.ode	@ltx/en_us_goadedes/miscellanea:misc.Ode8
ltx/en_us_goadedes/oc.m4.d1:ocMA.OdeS8C2H.text	
ltx/en_us_goadedes/oc.m4.d1:ocMA.OdeS8C2Tr.incipit	…
ltx/en_us_goadedes/oc.m4.d1:ocMA.OdeS8C2Tr.melody	@ltx/en_us_goadedes/he.h.m4:heHE.PaidasEvageis.name
ltx/en_us_goadedes/oc.m4.d1:ocMA.OdeS8C2Tr.mode	@ltx/en_us_goadedes/miscellanea:misc.Mode4
ltx/en_us_goadedes/oc.m4.d1:ocMA.OdeS8C2Tr.ode	@ltx/en_us_goadedes/miscellanea:misc.Ode8
ltx/en_us_goadedes/oc.m4.d1:ocMA.OdeS8C2Tr.text	
ltx/en_us_goadedes/oc.m4.d1:ocMA.OdeS8C31.greekmelody	@ltx/en_us_goadedes/he.h.m4:heHE.LytrotaTouPantos.greekname
ltx/en_us_goadedes/oc.m4.d1:ocMA.OdeS8C31.incipit	…
ltx/en_us_goadedes/oc.m4.d1:ocMA.OdeS8C31.melody	@ltx/en_us_goadedes/he.h.m4:heHE.LytrotaTouPantos.name
ltx/en_us_goadedes/oc.m4.d1:ocMA.OdeS8C31.mode	@ltx/en_us_goadedes/miscellanea:misc.Mode4
ltx/en_us_goadedes/oc.m4.d1:ocMA.OdeS8C31.ode	@ltx/en_us_goadedes/miscellanea:misc.Ode8
ltx/en_us_goadedes/oc.m4.d1:ocMA.OdeS8C31.text	
ltx/en_us_goadedes/oc.m4.d1:ocMA.OdeS8C32.incipit	…
ltx/en_us_goadedes/oc.m4.d1:ocMA.OdeS8C32.melody	@ltx/en_us_goadedes/he.h.m4:heHE.LytrotaTouPantos.name
ltx/en_us_goadedes/oc.m4.d1:ocMA.OdeS8C32.mode	@ltx/en_us_goadedes/miscellanea:misc.Mode4
ltx/en_us_goadedes/oc.m4.d1:ocMA.OdeS8C32.ode	@ltx/en_us_goadedes/miscellanea:misc.Ode8
ltx/en_us_goadedes/oc.m4.d1:ocMA.OdeS8C32.text	
ltx/en_us_goadedes/oc.m4.d1:ocMA.OdeS8C33.incipit	…
ltx/en_us_goadedes/oc.m4.d1:ocMA.OdeS8C33.melody	@ltx/en_us_goadedes/he.h.m4:heHE.LytrotaTouPantos.name
ltx/en_us_goadedes/oc.m4.d1:ocMA.OdeS8C33.mode	@ltx/en_us_goadedes/miscellanea:misc.Mode4
ltx/en_us_goadedes/oc.m4.d1:ocMA.OdeS8C33.ode	@ltx/en_us_goadedes/miscellanea:misc.Ode8
ltx/en_us_goadedes/oc.m4.d1:ocMA.OdeS8C33.text	
ltx/en_us_goadedes/oc.m4.d1:ocMA.OdeS9C11.incipit	…
ltx/en_us_goadedes/oc.m4.d1:ocMA.OdeS9C11.melody	@ltx/en_us_goadedes/he.h.m4:heHE.LithosAcheirotmitos.name
ltx/en_us_goadedes/oc.m4.d1:ocMA.OdeS9C11.mode	@ltx/en_us_goadedes/miscellanea:misc.Mode4
ltx/en_us_goadedes/oc.m4.d1:ocMA.OdeS9C11.ode	@ltx/en_us_goadedes/miscellanea:misc.Ode9
ltx/en_us_goadedes/oc.m4.d1:ocMA.OdeS9C11.text	
ltx/en_us_goadedes/oc.m4.d1:ocMA.OdeS9C12.incipit	…
ltx/en_us_goadedes/oc.m4.d1:ocMA.OdeS9C12.melody	@ltx/en_us_goadedes/he.h.m4:heHE.LithosAcheirotmitos.name
ltx/en_us_goadedes/oc.m4.d1:ocMA.OdeS9C12.mode	@ltx/en_us_goadedes/miscellanea:misc.Mode4
ltx/en_us_goadedes/oc.m4.d1:ocMA.OdeS9C12.ode	@ltx/en_us_goadedes/miscellanea:misc.Ode9
ltx/en_us_goadedes/oc.m4.d1:ocMA.OdeS9C12.text	
ltx/en_us_goadedes/oc.m4.d1:ocMA.OdeS9C1H.greekmelody	@ltx/en_us_goadedes/he.h.m4:heHE.LithosAcheirotmitos.greekname
ltx/en_us_goadedes/oc.m4.d1:ocMA.OdeS9C1H.incipit	@ltx/en_us_goadedes/he.h.m4:heHE.LithosAcheirotmitos.incipit
ltx/en_us_goadedes/oc.m4.d1:ocMA.OdeS9C1H.melody	@ltx/en_us_goadedes/he.h.m4:heHE.LithosAcheirotmitos.melody
ltx/en_us_goadedes/oc.m4.d1:ocMA.OdeS9C1H.mode	@ltx/en_us_goadedes/miscellanea:misc.Mode4
ltx/en_us_goadedes/oc.m4.d1:ocMA.OdeS9C1H.ode	@ltx/en_us_goadedes/miscellanea:misc.Ode9
ltx/en_us_goadedes/oc.m4.d1:ocMA.OdeS9C1H.text	@ltx/en_us_goadedes/he.h.m4:heHE.LithosAcheirotmitos.text
ltx/en_us_goadedes/oc.m4.d1:ocMA.OdeS9C1Tr.incipit	…
ltx/en_us_goadedes/oc.m4.d1:ocMA.OdeS9C1Tr.melody	@ltx/en_us_goadedes/he.h.m4:heHE.LithosAcheirotmitos.name
ltx/en_us_goadedes/oc.m4.d1:ocMA.OdeS9C1Tr.mode	@ltx/en_us_goadedes/miscellanea:misc.Mode4
ltx/en_us_goadedes/oc.m4.d1:ocMA.OdeS9C1Tr.ode	@ltx/en_us_goadedes/miscellanea:misc.Ode9
ltx/en_us_goadedes/oc.m4.d1:ocMA.OdeS9C1Tr.text	
ltx/en_us_goadedes/oc.m4.d1:ocMA.OdeS9C21.greekmelody	@ltx/en_us_goadedes/he.h.m4:heHE.ApasGigenis.greekname
ltx/en_us_goadedes/oc.m4.d1:ocMA.OdeS9C21.incipit	…
ltx/en_us_goadedes/oc.m4.d1:ocMA.OdeS9C21.melody	@ltx/en_us_goadedes/he.h.m4:heHE.ApasGigenis.name
ltx/en_us_goadedes/oc.m4.d1:ocMA.OdeS9C21.mode	@ltx/en_us_goadedes/miscellanea:misc.Mode4
ltx/en_us_goadedes/oc.m4.d1:ocMA.OdeS9C21.ode	@ltx/en_us_goadedes/miscellanea:misc.Ode9
ltx/en_us_goadedes/oc.m4.d1:ocMA.OdeS9C21.text	
ltx/en_us_goadedes/oc.m4.d1:ocMA.OdeS9C22.incipit	…
ltx/en_us_goadedes/oc.m4.d1:ocMA.OdeS9C22.melody	@ltx/en_us_goadedes/he.h.m4:heHE.ApasGigenis.name
ltx/en_us_goadedes/oc.m4.d1:ocMA.OdeS9C22.mode	@ltx/en_us_goadedes/miscellanea:misc.Mode4
ltx/en_us_goadedes/oc.m4.d1:ocMA.OdeS9C22.ode	@ltx/en_us_goadedes/miscellanea:misc.Ode9
ltx/en_us_goadedes/oc.m4.d1:ocMA.OdeS9C22.text	
ltx/en_us_goadedes/oc.m4.d1:ocMA.OdeS9C23.incipit	…
ltx/en_us_goadedes/oc.m4.d1:ocMA.OdeS9C23.melody	@ltx/en_us_goadedes/he.h.m4:heHE.ApasGigenis.name
ltx/en_us_goadedes/oc.m4.d1:ocMA.OdeS9C23.mode	@ltx/en_us_goadedes/miscellanea:misc.Mode4
ltx/en_us_goadedes/oc.m4.d1:ocMA.OdeS9C23.ode	@ltx/en_us_goadedes/miscellanea:misc.Ode9
ltx/en_us_goadedes/oc.m4.d1:ocMA.OdeS9C23.text	
ltx/en_us_goadedes/oc.m4.d1:ocMA.OdeS9C31.greekmelody	@ltx/en_us_goadedes/he.h.m4:heHE.KryptonTheionAchranton.greekname
ltx/en_us_goadedes/oc.m4.d1:ocMA.OdeS9C31.incipit	…
ltx/en_us_goadedes/oc.m4.d1:ocMA.OdeS9C31.melody	@ltx/en_us_goadedes/he.h.m4:heHE.KryptonTheionAchranton.name
ltx/en_us_goadedes/oc.m4.d1:ocMA.OdeS9C31.mode	@ltx/en_us_goadedes/miscellanea:misc.Mode4
ltx/en_us_goadedes/oc.m4.d1:ocMA.OdeS9C31.ode	@ltx/en_us_goadedes/miscellanea:misc.Ode9
ltx/en_us_goadedes/oc.m4.d1:ocMA.OdeS9C31.text	
ltx/en_us_goadedes/oc.m4.d1:ocMA.OdeS9C32.incipit	…
ltx/en_us_goadedes/oc.m4.d1:ocMA.OdeS9C32.melody	@ltx/en_us_goadedes/he.h.m4:heHE.KryptonTheionAchranton.name
ltx/en_us_goadedes/oc.m4.d1:ocMA.OdeS9C32.mode	@ltx/en_us_goadedes/miscellanea:misc.Mode4
ltx/en_us_goadedes/oc.m4.d1:ocMA.OdeS9C32.ode	@ltx/en_us_goadedes/miscellanea:misc.Ode9
ltx/en_us_goadedes/oc.m4.d1:ocMA.OdeS9C32.text	
ltx/en_us_goadedes/oc.m4.d1:ocMA.OdeS9C33.incipit	…
ltx/en_us_goadedes/oc.m4.d1:ocMA.OdeS9C33.melody	@ltx/en_us_goadedes/he.h.m4:heHE.KryptonTheionAchranton.name
ltx/en_us_goadedes/oc.m4.d1:ocMA.OdeS9C33.mode	@ltx/en_us_goadedes/miscellanea:misc.Mode4
ltx/en_us_goadedes/oc.m4.d1:ocMA.OdeS9C33.ode	@ltx/en_us_goadedes/miscellanea:misc.Ode9
ltx/en_us_goadedes/oc.m4.d1:ocMA.OdeS9C33.text	
ltx/en_us_goadedes/oc.m4.d1:ocMA.Oikos.incipit	Christ is the Giver of Life…
ltx/en_us_goadedes/oc.m4.d1:ocMA.Oikos.mode	@ltx/en_us_goadedes/miscellanea:misc.Mode4
ltx/en_us_goadedes/oc.m4.d1:ocMA.Oikos.text	Christ is the Giver of Life. He rose from the dead and the tomb, on the third day. He smashed the gates of death with His might today. He neutralized Hades and crushed the sting of death. And He freed Adam and Eve. Let all of us born on earth earnestly sing and praise Him with gratitude; for He is our one and mighty God, and on the third day He rose, as the Lord of all.
ltx/en_us_goadedes/oc.m4.d1:ocMO.Kathisma11.greekmelody	@ltx/en_us_goadedes/he.a.m4:heAU.TachyProkatalave.greekname
ltx/en_us_goadedes/oc.m4.d1:ocMO.Kathisma11.incipit	O tri-solar, uncreated…
ltx/en_us_goadedes/oc.m4.d1:ocMO.Kathisma11.melody	@ltx/en_us_goadedes/he.a.m4:heAU.TachyProkatalave.name
ltx/en_us_goadedes/oc.m4.d1:ocMO.Kathisma11.mode	@ltx/en_us_goadedes/miscellanea:misc.Mode4
ltx/en_us_goadedes/oc.m4.d1:ocMO.Kathisma11.text	O tri-solar, uncreated, consubstantial one God, * incomprehensible, in three hypostases, * Your servants implore You now. * Pity us and save us * from disaster and danger. * Merciful God, for us You are our only Lord and Savior, * O Master, and we pray to You: Have mercy on us.
ltx/en_us_goadedes/oc.m4.d1:ocMO.Kathisma12.incipit	O Virgin, your servants…
ltx/en_us_goadedes/oc.m4.d1:ocMO.Kathisma12.melody	@ltx/en_us_goadedes/he.a.m4:heAU.TachyProkatalave.name
ltx/en_us_goadedes/oc.m4.d1:ocMO.Kathisma12.mode	@ltx/en_us_goadedes/miscellanea:misc.Mode4
ltx/en_us_goadedes/oc.m4.d1:ocMO.Kathisma12.text	O Virgin, your servants frequently succumb to despair, * because of the many tragedies, disasters, and woes * besetting us every day. * All-holy Theotokos, we rely on you solely * for hope and protection and salvation, O Lady. * And therefore with faith we properly pray you to rescue us.
ltx/en_us_goadedes/oc.m4.d1:ocMO.Kathisma21.greekmelody	@ltx/en_us_goadedes/he.a.m4:heAU.TachyProkatalave.greekname
ltx/en_us_goadedes/oc.m4.d1:ocMO.Kathisma21.incipit	The Father is unbegotten…
ltx/en_us_goadedes/oc.m4.d1:ocMO.Kathisma21.melody	@ltx/en_us_goadedes/he.a.m4:heAU.TachyProkatalave.name
ltx/en_us_goadedes/oc.m4.d1:ocMO.Kathisma21.mode	@ltx/en_us_goadedes/miscellanea:misc.Mode4
ltx/en_us_goadedes/oc.m4.d1:ocMO.Kathisma21.text	The Father is unbegotten, and begotten is the Son; * the all-holy Spirit from the Father only proceeds. * And thus we proclaim our faith. * Singular is the Godhead, and beginningless the Kingdom, * which we adore and glorify in unison, saying, * “O consubstantial Trinity, save us, for You are our God!”
ltx/en_us_goadedes/oc.m4.d1:ocMO.Kathisma22.incipit	O Virgin, your Son is God…
ltx/en_us_goadedes/oc.m4.d1:ocMO.Kathisma22.melody	@ltx/en_us_goadedes/he.a.m4:heAU.TachyProkatalave.name
ltx/en_us_goadedes/oc.m4.d1:ocMO.Kathisma22.mode	@ltx/en_us_goadedes/miscellanea:misc.Mode4
ltx/en_us_goadedes/oc.m4.d1:ocMO.Kathisma22.text	O Virgin, your Son is God and man. In flesh within time * you bore Him supernaturally. He is pre-eternal God, * existing beyond all time. * Therefore we all confess it, truly and properly speaking, * that you are Theotokos. And we earnestly pray you * to count us worthy of the glory that never ends.
ltx/en_us_goadedes/oc.m4.d1:ocMO.Ode11.greekmelody	@ltx/en_us_goadedes/he.h.m4:heHE.ThalassisToErythraion.greekname
ltx/en_us_goadedes/oc.m4.d1:ocMO.Ode11.incipit	Let us glorify the Godhead…
ltx/en_us_goadedes/oc.m4.d1:ocMO.Ode11.melody	@ltx/en_us_goadedes/he.h.m4:heHE.ThalassisToErythraion.notmetered
ltx/en_us_goadedes/oc.m4.d1:ocMO.Ode11.mode	@ltx/en_us_goadedes/miscellanea:misc.Mode4
ltx/en_us_goadedes/oc.m4.d1:ocMO.Ode11.ode	@ltx/en_us_goadedes/miscellanea:misc.Ode1
ltx/en_us_goadedes/oc.m4.d1:ocMO.Ode11.text	Let us glorify the Godhead, Trinity in hypostases, and single nature of the three, co-eternal, equal in majesty. We implore, saying, “Save us who with faith glorify You!”
ltx/en_us_goadedes/oc.m4.d1:ocMO.Ode12.incipit	O Son, by the Father …
ltx/en_us_goadedes/oc.m4.d1:ocMO.Ode12.melody	@ltx/en_us_goadedes/he.h.m4:heHE.ThalassisToErythraion.notmetered
ltx/en_us_goadedes/oc.m4.d1:ocMO.Ode12.mode	@ltx/en_us_goadedes/miscellanea:misc.Mode4
ltx/en_us_goadedes/oc.m4.d1:ocMO.Ode12.ode	@ltx/en_us_goadedes/miscellanea:misc.Ode1
ltx/en_us_goadedes/oc.m4.d1:ocMO.Ode12.text	O Son, by the Father You were anointed with the Spirit, the divine oil of gladness; and You became human, and You taught about the three hypostases of the one Godhead.
ltx/en_us_goadedes/oc.m4.d1:ocMO.Ode13.incipit	The Seraphim cannot bear…
ltx/en_us_goadedes/oc.m4.d1:ocMO.Ode13.melody	@ltx/en_us_goadedes/he.h.m4:heHE.ThalassisToErythraion.notmetered
ltx/en_us_goadedes/oc.m4.d1:ocMO.Ode13.mode	@ltx/en_us_goadedes/miscellanea:misc.Mode4
ltx/en_us_goadedes/oc.m4.d1:ocMO.Ode13.ode	@ltx/en_us_goadedes/miscellanea:misc.Ode1
ltx/en_us_goadedes/oc.m4.d1:ocMO.Ode13.text	The Seraphim cannot bear to look at the beauty of your unapproachable glory, O tri-solar Monad. They cover themselves with their wings, and they glorify You unceasingly in thrice-holy songs.
ltx/en_us_goadedes/oc.m4.d1:ocMO.Ode1T.incipit	O all-pure Virgin…
ltx/en_us_goadedes/oc.m4.d1:ocMO.Ode1T.melody	@ltx/en_us_goadedes/he.h.m4:heHE.ThalassisToErythraion.notmetered
ltx/en_us_goadedes/oc.m4.d1:ocMO.Ode1T.mode	@ltx/en_us_goadedes/miscellanea:misc.Mode4
ltx/en_us_goadedes/oc.m4.d1:ocMO.Ode1T.ode	@ltx/en_us_goadedes/miscellanea:misc.Ode1
ltx/en_us_goadedes/oc.m4.d1:ocMO.Ode1T.text	O all-pure Virgin, you have given birth ineffably to the Maker of the universe. He delivers humanity from the primeval curse and the decay of death. Through you we have come to know the one God in three hypostases.
ltx/en_us_goadedes/oc.m4.d1:ocMO.Ode31.greekmelody	@ltx/en_us_goadedes/he.h.m4:heHE.OukEnSofia.greekname
ltx/en_us_goadedes/oc.m4.d1:ocMO.Ode31.incipit	O Christ, once You sent…
ltx/en_us_goadedes/oc.m4.d1:ocMO.Ode31.melody	@ltx/en_us_goadedes/he.h.m4:heHE.OukEnSofia.notmetered
ltx/en_us_goadedes/oc.m4.d1:ocMO.Ode31.mode	@ltx/en_us_goadedes/miscellanea:misc.Mode4
ltx/en_us_goadedes/oc.m4.d1:ocMO.Ode31.ode	@ltx/en_us_goadedes/miscellanea:misc.Ode3
ltx/en_us_goadedes/oc.m4.d1:ocMO.Ode31.text	O Christ, once You sent to Your holy Apostles power from on high, namely the Paraclete from the Father, You exhibited the one tri-solar divine nature.
ltx/en_us_goadedes/oc.m4.d1:ocMO.Ode32.incipit	O threefold Monad…
ltx/en_us_goadedes/oc.m4.d1:ocMO.Ode32.melody	@ltx/en_us_goadedes/he.h.m4:heHE.OukEnSofia.notmetered
ltx/en_us_goadedes/oc.m4.d1:ocMO.Ode32.mode	@ltx/en_us_goadedes/miscellanea:misc.Mode4
ltx/en_us_goadedes/oc.m4.d1:ocMO.Ode32.ode	@ltx/en_us_goadedes/miscellanea:misc.Ode3
ltx/en_us_goadedes/oc.m4.d1:ocMO.Ode32.text	O threefold Monad, when You appeared in human form to the Patriarch Abraham, You revealed that the three persons are exactly the same in Your goodness and Your dominion.
ltx/en_us_goadedes/oc.m4.d1:ocMO.Ode33.incipit	We entreat You, O God…
ltx/en_us_goadedes/oc.m4.d1:ocMO.Ode33.melody	@ltx/en_us_goadedes/he.h.m4:heHE.OukEnSofia.notmetered
ltx/en_us_goadedes/oc.m4.d1:ocMO.Ode33.mode	@ltx/en_us_goadedes/miscellanea:misc.Mode4
ltx/en_us_goadedes/oc.m4.d1:ocMO.Ode33.ode	@ltx/en_us_goadedes/miscellanea:misc.Ode3
ltx/en_us_goadedes/oc.m4.d1:ocMO.Ode33.text	We entreat You, O God, whom we believe to be one nature in three persons, truly uncircumscribed, incomprehensible to all: Rescue our souls from every affliction.
ltx/en_us_goadedes/oc.m4.d1:ocMO.Ode3T.incipit	Grounded in the wise teachings…
ltx/en_us_goadedes/oc.m4.d1:ocMO.Ode3T.melody	@ltx/en_us_goadedes/he.h.m4:heHE.OukEnSofia.notmetered
ltx/en_us_goadedes/oc.m4.d1:ocMO.Ode3T.mode	@ltx/en_us_goadedes/miscellanea:misc.Mode4
ltx/en_us_goadedes/oc.m4.d1:ocMO.Ode3T.ode	@ltx/en_us_goadedes/miscellanea:misc.Ode3
ltx/en_us_goadedes/oc.m4.d1:ocMO.Ode3T.text	Grounded in the wise teachings of your Son, we glorify the single, thrice-radiant Godhead; and we call you blessed, O ever-virgin Mary.
ltx/en_us_goadedes/oc.m4.d1:ocMO.Ode41.greekmelody	@ltx/en_us_goadedes/he.h.m4:heHE.OKathimenosEnDoxi.greekname
ltx/en_us_goadedes/oc.m4.d1:ocMO.Ode41.incipit	We join the Seraphim…
ltx/en_us_goadedes/oc.m4.d1:ocMO.Ode41.melody	@ltx/en_us_goadedes/he.h.m4:heHE.OKathimenosEnDoxi.notmetered
ltx/en_us_goadedes/oc.m4.d1:ocMO.Ode41.mode	@ltx/en_us_goadedes/miscellanea:misc.Mode4
ltx/en_us_goadedes/oc.m4.d1:ocMO.Ode41.ode	@ltx/en_us_goadedes/miscellanea:misc.Ode4
ltx/en_us_goadedes/oc.m4.d1:ocMO.Ode41.text	We join the Seraphim and glorify You, O incomprehensible God, superessential Dominion and Trinity in unity of Godhead, undivided nature, without confusion, exactly equal in glory.
ltx/en_us_goadedes/oc.m4.d1:ocMO.Ode42.incipit	We extol You, only Godhead…
ltx/en_us_goadedes/oc.m4.d1:ocMO.Ode42.melody	@ltx/en_us_goadedes/he.h.m4:heHE.OKathimenosEnDoxi.notmetered
ltx/en_us_goadedes/oc.m4.d1:ocMO.Ode42.mode	@ltx/en_us_goadedes/miscellanea:misc.Mode4
ltx/en_us_goadedes/oc.m4.d1:ocMO.Ode42.ode	@ltx/en_us_goadedes/miscellanea:misc.Ode4
ltx/en_us_goadedes/oc.m4.d1:ocMO.Ode42.text	We extol You, only Godhead, ineffably divided in persons and identical in one dominion, infinite, uncircumscribed, the Maker of creation all.
ltx/en_us_goadedes/oc.m4.d1:ocMO.Ode43.incipit	The unoriginate Nous…
ltx/en_us_goadedes/oc.m4.d1:ocMO.Ode43.melody	@ltx/en_us_goadedes/he.h.m4:heHE.OKathimenosEnDoxi.notmetered
ltx/en_us_goadedes/oc.m4.d1:ocMO.Ode43.mode	@ltx/en_us_goadedes/miscellanea:misc.Mode4
ltx/en_us_goadedes/oc.m4.d1:ocMO.Ode43.ode	@ltx/en_us_goadedes/miscellanea:misc.Ode4
ltx/en_us_goadedes/oc.m4.d1:ocMO.Ode43.text	The unoriginate Nous ineffably begot the Logos and sent out the divine Spirit who is equal in might. Therefore we profess that the God and Master of all is a consubstantial Trinity.
ltx/en_us_goadedes/oc.m4.d1:ocMO.Ode4T.incipit	O Virgin, the Logos appeared…
ltx/en_us_goadedes/oc.m4.d1:ocMO.Ode4T.melody	@ltx/en_us_goadedes/he.h.m4:heHE.OKathimenosEnDoxi.notmetered
ltx/en_us_goadedes/oc.m4.d1:ocMO.Ode4T.mode	@ltx/en_us_goadedes/miscellanea:misc.Mode4
ltx/en_us_goadedes/oc.m4.d1:ocMO.Ode4T.ode	@ltx/en_us_goadedes/miscellanea:misc.Ode4
ltx/en_us_goadedes/oc.m4.d1:ocMO.Ode4T.text	O Virgin, the Logos appeared to men of old in types and foretold His incarnation from you. Later He appeared to men in reality, and He revealed the one Principle in three hypostases.
ltx/en_us_goadedes/oc.m4.d1:ocMO.Ode51.greekmelody	@ltx/en_us_goadedes/he.h.m4:heHE.ExestiTaSympanta.greekname
ltx/en_us_goadedes/oc.m4.d1:ocMO.Ode51.incipit	From our faith…
ltx/en_us_goadedes/oc.m4.d1:ocMO.Ode51.melody	@ltx/en_us_goadedes/he.h.m4:heHE.ExestiTaSympanta.notmetered
ltx/en_us_goadedes/oc.m4.d1:ocMO.Ode51.mode	@ltx/en_us_goadedes/miscellanea:misc.Mode4
ltx/en_us_goadedes/oc.m4.d1:ocMO.Ode51.ode	@ltx/en_us_goadedes/miscellanea:misc.Ode5
ltx/en_us_goadedes/oc.m4.d1:ocMO.Ode51.text	From our faith, we are able to understand that there is one unapproachable essence and three consubstantial life-giving hypostases of the omnipotent Godhead; and we worship Father, Son and Holy Spirit, the co-eternal existence.
ltx/en_us_goadedes/oc.m4.d1:ocMO.Ode52.incipit	O single Godhead…
ltx/en_us_goadedes/oc.m4.d1:ocMO.Ode52.melody	@ltx/en_us_goadedes/he.h.m4:heHE.ExestiTaSympanta.notmetered
ltx/en_us_goadedes/oc.m4.d1:ocMO.Ode52.mode	@ltx/en_us_goadedes/miscellanea:misc.Mode4
ltx/en_us_goadedes/oc.m4.d1:ocMO.Ode52.ode	@ltx/en_us_goadedes/miscellanea:misc.Ode5
ltx/en_us_goadedes/oc.m4.d1:ocMO.Ode52.text	O single Godhead, uncreated nature, illuminating source of every light-giving beam, shine in me the tri-solar light of Your essential splendor, so that I may see the reflection of Your ineffable beauty.
ltx/en_us_goadedes/oc.m4.d1:ocMO.Ode53.incipit	We know that You are…
ltx/en_us_goadedes/oc.m4.d1:ocMO.Ode53.melody	@ltx/en_us_goadedes/he.h.m4:heHE.ExestiTaSympanta.notmetered
ltx/en_us_goadedes/oc.m4.d1:ocMO.Ode53.mode	@ltx/en_us_goadedes/miscellanea:misc.Mode4
ltx/en_us_goadedes/oc.m4.d1:ocMO.Ode53.ode	@ltx/en_us_goadedes/miscellanea:misc.Ode5
ltx/en_us_goadedes/oc.m4.d1:ocMO.Ode53.text	We know that You are the only all-wise Creator, Sustainer, and Governor of the universe, and the Giver of life. We cry out to You in faith: O tri-solar Master, guard us who sing Your praise.
ltx/en_us_goadedes/oc.m4.d1:ocMO.Ode5T.incipit	O Virgin, in His goodness…
ltx/en_us_goadedes/oc.m4.d1:ocMO.Ode5T.melody	@ltx/en_us_goadedes/he.h.m4:heHE.ExestiTaSympanta.notmetered
ltx/en_us_goadedes/oc.m4.d1:ocMO.Ode5T.mode	@ltx/en_us_goadedes/miscellanea:misc.Mode4
ltx/en_us_goadedes/oc.m4.d1:ocMO.Ode5T.ode	@ltx/en_us_goadedes/miscellanea:misc.Ode5
ltx/en_us_goadedes/oc.m4.d1:ocMO.Ode5T.text	O Virgin, in His goodness your Son made man in the divine image. When humanity had been corrupted, He wished to deify it. He became man from you, and He proclaimed that there is one Godhead in three persons.
ltx/en_us_goadedes/oc.m4.d1:ocMO.Ode61.greekmelody	@ltx/en_us_goadedes/he.h.m4:heHE.EvoiseProtypon.greekname
ltx/en_us_goadedes/oc.m4.d1:ocMO.Ode61.incipit	At the baptism of Christ…
ltx/en_us_goadedes/oc.m4.d1:ocMO.Ode61.melody	@ltx/en_us_goadedes/he.h.m4:heHE.EvoiseProtypon.notmetered
ltx/en_us_goadedes/oc.m4.d1:ocMO.Ode61.mode	@ltx/en_us_goadedes/miscellanea:misc.Mode4
ltx/en_us_goadedes/oc.m4.d1:ocMO.Ode61.ode	@ltx/en_us_goadedes/miscellanea:misc.Ode6
ltx/en_us_goadedes/oc.m4.d1:ocMO.Ode61.text	At the baptism of Christ, the Father called Him Son, and the Spirit appeared to Him. Therefore we glorify one Godhead in three hypostases.
ltx/en_us_goadedes/oc.m4.d1:ocMO.Ode62.incipit	When Isaiah saw You…
ltx/en_us_goadedes/oc.m4.d1:ocMO.Ode62.melody	@ltx/en_us_goadedes/he.h.m4:heHE.EvoiseProtypon.notmetered
ltx/en_us_goadedes/oc.m4.d1:ocMO.Ode62.mode	@ltx/en_us_goadedes/miscellanea:misc.Mode4
ltx/en_us_goadedes/oc.m4.d1:ocMO.Ode62.ode	@ltx/en_us_goadedes/miscellanea:misc.Ode6
ltx/en_us_goadedes/oc.m4.d1:ocMO.Ode62.text	When Isaiah saw You seated on an exalted throne and being praised with thrice-holy hymns, he came to know the one Godhead in three hypostases.
ltx/en_us_goadedes/oc.m4.d1:ocMO.Ode63.incipit	O exalted King…
ltx/en_us_goadedes/oc.m4.d1:ocMO.Ode63.melody	@ltx/en_us_goadedes/he.h.m4:heHE.EvoiseProtypon.notmetered
ltx/en_us_goadedes/oc.m4.d1:ocMO.Ode63.mode	@ltx/en_us_goadedes/miscellanea:misc.Mode4
ltx/en_us_goadedes/oc.m4.d1:ocMO.Ode63.ode	@ltx/en_us_goadedes/miscellanea:misc.Ode6
ltx/en_us_goadedes/oc.m4.d1:ocMO.Ode63.text	O exalted King in three hypostases, lift the hearts of your servants, so that we may luminously contemplate the splendor of Your glory.
ltx/en_us_goadedes/oc.m4.d1:ocMO.Ode6T.incipit	The humane Son of God…
ltx/en_us_goadedes/oc.m4.d1:ocMO.Ode6T.melody	@ltx/en_us_goadedes/he.h.m4:heHE.EvoiseProtypon.notmetered
ltx/en_us_goadedes/oc.m4.d1:ocMO.Ode6T.mode	@ltx/en_us_goadedes/miscellanea:misc.Mode4
ltx/en_us_goadedes/oc.m4.d1:ocMO.Ode6T.ode	@ltx/en_us_goadedes/miscellanea:misc.Ode6
ltx/en_us_goadedes/oc.m4.d1:ocMO.Ode6T.text	The humane Son of God was pleased to be conformed to our nature from a Virgin, and He made people partakers of divine glory.
ltx/en_us_goadedes/oc.m4.d1:ocMO.Ode71.greekmelody	@ltx/en_us_goadedes/he.h.m2:heHE.EnTiKamino.greekname
ltx/en_us_goadedes/oc.m4.d1:ocMO.Ode71.incipit	Imitating the ranks…
ltx/en_us_goadedes/oc.m4.d1:ocMO.Ode71.melody	@ltx/en_us_goadedes/he.h.m2:heHE.EnTiKamino.notmetered
ltx/en_us_goadedes/oc.m4.d1:ocMO.Ode71.mode	@ltx/en_us_goadedes/miscellanea:misc.Mode4
ltx/en_us_goadedes/oc.m4.d1:ocMO.Ode71.ode	@ltx/en_us_goadedes/miscellanea:misc.Ode7
ltx/en_us_goadedes/oc.m4.d1:ocMO.Ode71.text	Imitating the ranks of celestial beings and angelic orders, all we born of earth with Orthodox beliefs glorify one Godhead in three equivalent hypostases.
ltx/en_us_goadedes/oc.m4.d1:ocMO.Ode72.incipit	Sayings of the holy Prophets…
ltx/en_us_goadedes/oc.m4.d1:ocMO.Ode72.melody	@ltx/en_us_goadedes/he.h.m2:heHE.EnTiKamino.notmetered
ltx/en_us_goadedes/oc.m4.d1:ocMO.Ode72.mode	@ltx/en_us_goadedes/miscellanea:misc.Mode4
ltx/en_us_goadedes/oc.m4.d1:ocMO.Ode72.ode	@ltx/en_us_goadedes/miscellanea:misc.Ode7
ltx/en_us_goadedes/oc.m4.d1:ocMO.Ode72.text	Sayings of the holy Prophets symbolically revealed of old that You, the Creator of all the ages, are one inexpressible God and Lord in three divine hypostases.
ltx/en_us_goadedes/oc.m4.d1:ocMO.Ode7T.incipit	Invisible in essence…
ltx/en_us_goadedes/oc.m4.d1:ocMO.Ode7T.melody	@ltx/en_us_goadedes/he.h.m2:heHE.EnTiKamino.notmetered
ltx/en_us_goadedes/oc.m4.d1:ocMO.Ode7T.mode	@ltx/en_us_goadedes/miscellanea:misc.Mode4
ltx/en_us_goadedes/oc.m4.d1:ocMO.Ode7T.ode	@ltx/en_us_goadedes/miscellanea:misc.Ode7
ltx/en_us_goadedes/oc.m4.d1:ocMO.Ode7T.text	Invisible in essence, omnific Logos, You appeared to humanity as a man, born of the pure Mother of God, calling humanity to participation in your divinity.
ltx/en_us_goadedes/oc.m4.d1:ocMO.Ode81.greekmelody	@ltx/en_us_goadedes/he.h.m4:heHE.CheirasEkpetasasDaniil.greekname
ltx/en_us_goadedes/oc.m4.d1:ocMO.Ode81.incipit	Monarchal and thrice-radiant Light…
ltx/en_us_goadedes/oc.m4.d1:ocMO.Ode81.melody	@ltx/en_us_goadedes/he.h.m4:heHE.CheirasEkpetasasDaniil.notmetered
ltx/en_us_goadedes/oc.m4.d1:ocMO.Ode81.mode	@ltx/en_us_goadedes/miscellanea:misc.Mode4
ltx/en_us_goadedes/oc.m4.d1:ocMO.Ode81.ode	@ltx/en_us_goadedes/miscellanea:misc.Ode8
ltx/en_us_goadedes/oc.m4.d1:ocMO.Ode81.text	Monarchal and thrice-radiant Light, unoriginate Essence, inconceivable beauty, come reside in my heart, and make me to be a clean and luminous temple of Your Divinity, as I sing: “O all you works of the Lord, bless the Lord!”
ltx/en_us_goadedes/oc.m4.d1:ocMO.Ode82.incipit	O inseparate Trinity…
ltx/en_us_goadedes/oc.m4.d1:ocMO.Ode82.melody	@ltx/en_us_goadedes/he.h.m4:heHE.CheirasEkpetasasDaniil.notmetered
ltx/en_us_goadedes/oc.m4.d1:ocMO.Ode82.mode	@ltx/en_us_goadedes/miscellanea:misc.Mode4
ltx/en_us_goadedes/oc.m4.d1:ocMO.Ode82.ode	@ltx/en_us_goadedes/miscellanea:misc.Ode8
ltx/en_us_goadedes/oc.m4.d1:ocMO.Ode82.text	O inseparate Trinity and unconfused Unity, free me from the various passions and from the darkness of transgressions. Illumine me with Your divine effulgence, that I may contemplate Your glory and extol You, the Lord of glory.
ltx/en_us_goadedes/oc.m4.d1:ocMO.Ode8T.incipit	O Nous, the unbegotten Father…
ltx/en_us_goadedes/oc.m4.d1:ocMO.Ode8T.melody	@ltx/en_us_goadedes/he.h.m4:heHE.CheirasEkpetasasDaniil.notmetered
ltx/en_us_goadedes/oc.m4.d1:ocMO.Ode8T.mode	@ltx/en_us_goadedes/miscellanea:misc.Mode4
ltx/en_us_goadedes/oc.m4.d1:ocMO.Ode8T.ode	@ltx/en_us_goadedes/miscellanea:misc.Ode8
ltx/en_us_goadedes/oc.m4.d1:ocMO.Ode8T.text	O Nous, the unbegotten Father, and corresponding Logos, and coequal Spirit! O superessential, inexpressible, magnificent Essence, Power, and Being, Trinity and Unity! We pray You who are naturally humane: Guard your flock, at the intercessions of the Theotokos.
ltx/en_us_goadedes/oc.m4.d1:ocMO.Ode91.greekmelody	@ltx/en_us_goadedes/he.h.m4:heHE.ApasGigenis.greekname
ltx/en_us_goadedes/oc.m4.d1:ocMO.Ode91.incipit	Now I focus all my heart…
ltx/en_us_goadedes/oc.m4.d1:ocMO.Ode91.melody	@ltx/en_us_goadedes/he.h.m4:heHE.ApasGigenis.notmetered
ltx/en_us_goadedes/oc.m4.d1:ocMO.Ode91.mode	@ltx/en_us_goadedes/miscellanea:misc.Mode4
ltx/en_us_goadedes/oc.m4.d1:ocMO.Ode91.ode	@ltx/en_us_goadedes/miscellanea:misc.Ode9
ltx/en_us_goadedes/oc.m4.d1:ocMO.Ode91.text	Now I focus all my heart and mind and all the faculties of my soul and body on You, my Fashioner and Deliverer, thrice-radiant Monarch, and I sing to You: Save me, Your servant, from temptations and afflictions of every kind.
ltx/en_us_goadedes/oc.m4.d1:ocMO.Ode92.incipit	Raise our mind and reason…
ltx/en_us_goadedes/oc.m4.d1:ocMO.Ode92.melody	@ltx/en_us_goadedes/he.h.m4:heHE.ApasGigenis.notmetered
ltx/en_us_goadedes/oc.m4.d1:ocMO.Ode92.mode	@ltx/en_us_goadedes/miscellanea:misc.Mode4
ltx/en_us_goadedes/oc.m4.d1:ocMO.Ode92.ode	@ltx/en_us_goadedes/miscellanea:misc.Ode9
ltx/en_us_goadedes/oc.m4.d1:ocMO.Ode92.text	Raise our mind and reason to You, the Most High God. Illumine them with Your immaculate radiance, O Father, Logos, and Paraclete, who dwell in unapproachable light, Sun of glory and Lord of light, so that we may always glorify You, the monarchal God in three hypostases.
ltx/en_us_goadedes/oc.m4.d1:ocMO.Ode9T.incipit	Save those who believe in You…
ltx/en_us_goadedes/oc.m4.d1:ocMO.Ode9T.melody	@ltx/en_us_goadedes/he.h.m4:heHE.ApasGigenis.notmetered
ltx/en_us_goadedes/oc.m4.d1:ocMO.Ode9T.mode	@ltx/en_us_goadedes/miscellanea:misc.Mode4
ltx/en_us_goadedes/oc.m4.d1:ocMO.Ode9T.ode	@ltx/en_us_goadedes/miscellanea:misc.Ode9
ltx/en_us_goadedes/oc.m4.d1:ocMO.Ode9T.text	Save those who believe in You, O Lord, and who proclaim Your one, unoriginate, eternal Essence, and three divine and consubstantial Persons. Count us worthy of Your divine glory, at the entreaties of the pure Mother of God.
ltx/en_us_goadedes/oc.m4.d1:ocMO.acrostic.notice	
ltx/en_us_goadedes/oc.m4.d1:ocMO.acrostic.text	
ltx/en_us_goadedes/oc.m4.d1:ocMO.poet	@ltx/en_us_goadedes/poets:po.MitrofanousSmirnis
ltx/en_us_goadedes/oc.m4.d1:ocMO.title	Canon for the Trinity
ltx/en_us_goadedes/oc.m4.d1:ocSV.AposDogmatic.incipit	…
ltx/en_us_goadedes/oc.m4.d1:ocSV.AposDogmatic.melody	
ltx/en_us_goadedes/oc.m4.d1:ocSV.AposDogmatic.mode	@ltx/en_us_goadedes/miscellanea:misc.Mode4
ltx/en_us_goadedes/oc.m4.d1:ocSV.AposDogmatic.text	
ltx/en_us_goadedes/oc.m4.d1:ocSV.Aposticha1.incipit	…
ltx/en_us_goadedes/oc.m4.d1:ocSV.Aposticha1.melody	@ltx/en_us_goadedes/he.a.m4:heAU.OExYpsistouKlitheis.name
ltx/en_us_goadedes/oc.m4.d1:ocSV.Aposticha1.mode	@ltx/en_us_goadedes/miscellanea:misc.Mode4
ltx/en_us_goadedes/oc.m4.d1:ocSV.Aposticha1.text	
ltx/en_us_goadedes/oc.m4.d1:ocSV.Aposticha2.incipit	…
ltx/en_us_goadedes/oc.m4.d1:ocSV.Aposticha2.melody	@ltx/en_us_goadedes/he.a.m4:heAU.OExYpsistouKlitheis.name
ltx/en_us_goadedes/oc.m4.d1:ocSV.Aposticha2.mode	@ltx/en_us_goadedes/miscellanea:misc.Mode4
ltx/en_us_goadedes/oc.m4.d1:ocSV.Aposticha2.text	
ltx/en_us_goadedes/oc.m4.d1:ocSV.Aposticha3.incipit	We pray you, blot out…
ltx/en_us_goadedes/oc.m4.d1:ocSV.Aposticha3.melody	@ltx/en_us_goadedes/he.a.m4:heAU.OExYpsistouKlitheis.name
ltx/en_us_goadedes/oc.m4.d1:ocSV.Aposticha3.mode	@ltx/en_us_goadedes/miscellanea:misc.Mode4
ltx/en_us_goadedes/oc.m4.d1:ocSV.Aposticha3.text	We pray you, blot out the sins and the transgressions * of us your unworthy servants, and thereby reveal * to all that great and abundant is your tender mercy * and that your goodness towards all is fathomless. * O all-blameless Virgin, as the Mother of our God, * you have been give authority over creation, * and by your power you do all that you will. * Clearly the Holy Spirit’s grace in you * works together with you and accomplishes * all the blessings and wonders * that you do for us, all-blessed one.
ltx/en_us_goadedes/oc.m4.d1:ocSV.Dogmatic.incipit	…
ltx/en_us_goadedes/oc.m4.d1:ocSV.Dogmatic.melody	
ltx/en_us_goadedes/oc.m4.d1:ocSV.Dogmatic.mode	@ltx/en_us_goadedes/miscellanea:misc.Mode4
ltx/en_us_goadedes/oc.m4.d1:ocSV.Dogmatic.text	
ltx/en_us_goadedes/oc.m4.d1:ocVE.ApolTheotokionVM.incipit	O Theotokos, revealed through you…
ltx/en_us_goadedes/oc.m4.d1:ocVE.ApolTheotokionVM.melody	
ltx/en_us_goadedes/oc.m4.d1:ocVE.ApolTheotokionVM.mode	@ltx/en_us_goadedes/miscellanea:misc.Mode4
ltx/en_us_goadedes/oc.m4.d1:ocVE.ApolTheotokionVM.text	O Theotokos, revealed through you to us on earth was the mystery, that was hidden for ages and unknown by the angels. God became incarnate, uniting natures without confusion, and for us He voluntarily accepted crucifixion, through which He resurrected the first-formed man, and He saved our souls from death.
ltx/en_us_goadedes/oc.m4.d1:ocVE.Apolytikion.incipit	When the women disciples…
ltx/en_us_goadedes/oc.m4.d1:ocVE.Apolytikion.melody	
ltx/en_us_goadedes/oc.m4.d1:ocVE.Apolytikion.mode	@ltx/en_us_goadedes/miscellanea:misc.Mode4
ltx/en_us_goadedes/oc.m4.d1:ocVE.Apolytikion.text	When the women disciples of the Lord heard the Angel joyously proclaim the resurrection, they cast aside the ancestral verdict, and boasting in glory they said to the Apostles, “Death has been despoiled! Christ God has risen, granting the great mercy to the world!”
ltx/en_us_goadedes/oc.m4.d1:ocVE.AposTheotokion.incipit	Graciously answer supplications…
ltx/en_us_goadedes/oc.m4.d1:ocVE.AposTheotokion.melody	
ltx/en_us_goadedes/oc.m4.d1:ocVE.AposTheotokion.mode	@ltx/en_us_goadedes/miscellanea:misc.Mode4
ltx/en_us_goadedes/oc.m4.d1:ocVE.AposTheotokion.text	Graciously answer supplications of us your servants, all-blameless Virgin. We pray you put an end to the uprisings that beset us, and deliver us from all our troubles. We only have you as our stable and immovable anchor, and we are securely under your protection. When we entreat you, Lady, let us not be disappointed. Attend to the requests of us who faithfully salute you: O Lady, rejoice! You are the help and joy and protection of all, and the salvation of our souls.
ltx/en_us_goadedes/oc.m4.d1:ocVE.Aposticha1.greekmelody	@ltx/en_us_goadedes/he.a.m4:heAU.KyrieAnelthonEnToStavro.greekname
ltx/en_us_goadedes/oc.m4.d1:ocVE.Aposticha1.incipit	@ltx/en_us_goadedes/he.a.m4:heAU.KyrieAnelthonEnToStavro.incipit
ltx/en_us_goadedes/oc.m4.d1:ocVE.Aposticha1.melody	@ltx/en_us_goadedes/he.a.m4:heAU.KyrieAnelthonEnToStavro.melody
ltx/en_us_goadedes/oc.m4.d1:ocVE.Aposticha1.mode	@ltx/en_us_goadedes/miscellanea:misc.Mode4
ltx/en_us_goadedes/oc.m4.d1:ocVE.Aposticha1.text	@ltx/en_us_goadedes/he.a.m4:heAU.KyrieAnelthonEnToStavro.text
ltx/en_us_goadedes/oc.m4.d1:ocVE.Aposticha2.incipit	Only mighty Lord…
ltx/en_us_goadedes/oc.m4.d1:ocVE.Aposticha2.melody	
ltx/en_us_goadedes/oc.m4.d1:ocVE.Aposticha2.mode	@ltx/en_us_goadedes/miscellanea:misc.Mode4
ltx/en_us_goadedes/oc.m4.d1:ocVE.Aposticha2.text	Only mighty Lord, You were hung upon the Cross, and You caused all creation to quake. You were laid in the tomb, and You raised those who were dwelling in the tombs. Now we gratefully praise You and glorify Your resurrection on the third day.
ltx/en_us_goadedes/oc.m4.d1:ocVE.Aposticha3.incipit	Lawless people delivered You…
ltx/en_us_goadedes/oc.m4.d1:ocVE.Aposticha3.melody	
ltx/en_us_goadedes/oc.m4.d1:ocVE.Aposticha3.mode	@ltx/en_us_goadedes/miscellanea:misc.Mode4
ltx/en_us_goadedes/oc.m4.d1:ocVE.Aposticha3.text	Lawless people delivered You to Pilate, O Christ, and they condemned You to be crucified, showing their ingratitude toward their benefactor. But You voluntarily submitted to burial, and by Your authority as God You rose on the third day, granting us everlasting life and the great mercy.
ltx/en_us_goadedes/oc.m4.d1:ocVE.Aposticha4.incipit	The women arrived…
ltx/en_us_goadedes/oc.m4.d1:ocVE.Aposticha4.melody	
ltx/en_us_goadedes/oc.m4.d1:ocVE.Aposticha4.mode	@ltx/en_us_goadedes/miscellanea:misc.Mode4
ltx/en_us_goadedes/oc.m4.d1:ocVE.Aposticha4.text	The women arrived at the tomb, and tearfully they looked for You but did not find You. Lamenting and crying, they said, “Our Savior and King of all, alas! Have You indeed been stolen away? Where is Your life-bearing corpse being held now?” Then the Angel answered them and said, “Do not weep. Go and proclaim that the Lord has risen, granting us exultant joy, as He is exceedingly compassionate.”
ltx/en_us_goadedes/oc.m4.d1:ocVE.MM.LIHC1.text	@ltx/en_us_goadedes/properties:media.key
ltx/en_us_goadedes/oc.m4.d1:ocVE.MM.LIHC2.text	@ltx/en_us_goadedes/properties:media.key
ltx/en_us_goadedes/oc.m4.d1:ocVE.MM.Stichologia.text	@ltx/en_us_goadedes/properties:media.key
ltx/en_us_goadedes/oc.m4.d1:ocVE.SticTheotokion.incipit	By you, O Lady…
ltx/en_us_goadedes/oc.m4.d1:ocVE.SticTheotokion.melody	
ltx/en_us_goadedes/oc.m4.d1:ocVE.SticTheotokion.mode	@ltx/en_us_goadedes/miscellanea:misc.Mode4
ltx/en_us_goadedes/oc.m4.d1:ocVE.SticTheotokion.text	By you, O Lady, the Prophet David became an ancestor of God. Long ago, he sang a Psalm to Him, who would do great things for you: “The Queen stood at Your right hand.” God chose you to be the mother who would engender Life. For it was His good pleasure to become human from you without father, so that He could refashion His image, which had become distorted by the passions, and so that He could find the lost sheep that had gone astray on the mountains, and carry it on His shoulders, and bring it to His Father, and reunite it with the heavenly hosts, as He willed, and so that He could save the world, O Theotokos, since He is Christ, and He has the great and rich mercy.
ltx/en_us_goadedes/oc.m4.d1:ocVE.Stichera1.incipit	Unceasingly we venerate…
ltx/en_us_goadedes/oc.m4.d1:ocVE.Stichera1.melody	
ltx/en_us_goadedes/oc.m4.d1:ocVE.Stichera1.mode	@ltx/en_us_goadedes/miscellanea:misc.Mode4
ltx/en_us_goadedes/oc.m4.d1:ocVE.Stichera1.text	Unceasingly we venerate Your crucifixion that bestowed life, O Christ our God, and glorify Your resurrection on the third day. Thereby You refashioned human nature that was damaged; You also revealed to us the ascent into the heavens, O almighty Lord, singularly good and benevolent.
ltx/en_us_goadedes/oc.m4.d1:ocVE.Stichera2.incipit	You rescinded the penalty…
ltx/en_us_goadedes/oc.m4.d1:ocVE.Stichera2.melody	
ltx/en_us_goadedes/oc.m4.d1:ocVE.Stichera2.mode	@ltx/en_us_goadedes/miscellanea:misc.Mode4
ltx/en_us_goadedes/oc.m4.d1:ocVE.Stichera2.text	You rescinded the penalty for failure to obey at the tree, when You, O Savior, voluntarily were nailed to the tree of the Cross. As God, You broke the bonds of death, when You descended to the netherworld, O Mighty One. And now we honor Your resurrection from the dead, and we sing in exultation: Glory to You, O almighty Lord!
ltx/en_us_goadedes/oc.m4.d1:ocVE.Stichera3.incipit	You blasted the gates…
ltx/en_us_goadedes/oc.m4.d1:ocVE.Stichera3.melody	
ltx/en_us_goadedes/oc.m4.d1:ocVE.Stichera3.mode	@ltx/en_us_goadedes/miscellanea:misc.Mode4
ltx/en_us_goadedes/oc.m4.d1:ocVE.Stichera3.text	You blasted the gates of Hades, and You toppled the regime of death, by Your death, O Master. You freed the human race from disintegration, for to the world You granted life, freedom from decay, and the great mercy.
ltx/en_us_goadedes/oc.m4.d1:ocVE.Stichera4.incipit	Everybody, come…
ltx/en_us_goadedes/oc.m4.d1:ocVE.Stichera4.melody	
ltx/en_us_goadedes/oc.m4.d1:ocVE.Stichera4.mode	@ltx/en_us_goadedes/miscellanea:misc.Mode4
ltx/en_us_goadedes/oc.m4.d1:ocVE.Stichera4.text	Everybody, come, let us extol the Savior’s resurrection on the third day, through which we were released from inescapable imprisonment in the netherworld, and we all have received life and freedom from decay; and let us sing to Him, “O uniquely benevolent Lord, You were crucified and buried, and You rose. We pray You save us, by Your resurrection!”
ltx/en_us_goadedes/oc.m4.d1:ocVE.Stichera5.incipit	Angels and humanity…
ltx/en_us_goadedes/oc.m4.d1:ocVE.Stichera5.melody	
ltx/en_us_goadedes/oc.m4.d1:ocVE.Stichera5.mode	@ltx/en_us_goadedes/miscellanea:misc.Mode4
ltx/en_us_goadedes/oc.m4.d1:ocVE.Stichera5.text	Angels and humanity extol Your resurrection on the third day, O Savior, through which the entire earth has been illumined, and we all have been released from enslavement to the foe; and let us sing to Him, “O uniquely benevolent Lord, almighty Savior, the Giver of life, we pray You save us, by Your resurrection!”
ltx/en_us_goadedes/oc.m4.d1:ocVE.Stichera6.incipit	You crushed the gates…
ltx/en_us_goadedes/oc.m4.d1:ocVE.Stichera6.melody	
ltx/en_us_goadedes/oc.m4.d1:ocVE.Stichera6.mode	@ltx/en_us_goadedes/miscellanea:misc.Mode4
ltx/en_us_goadedes/oc.m4.d1:ocVE.Stichera6.text	You crushed the gates of bronze, and You shattered the bars, and then You raised the human race, which had fallen, O Christ God. And so we join our voices and sing to You: Glory to You, O Lord, who arose from the dead!
ltx/en_us_goadedes/oc.m4.d1:ocVE.Stichera7.incipit	O Lord, You were begotten…
ltx/en_us_goadedes/oc.m4.d1:ocVE.Stichera7.melody	
ltx/en_us_goadedes/oc.m4.d1:ocVE.Stichera7.mode	@ltx/en_us_goadedes/miscellanea:misc.Mode4
ltx/en_us_goadedes/oc.m4.d1:ocVE.Stichera7.text	O Lord, You were begotten of the Father, timelessly and eternally, and ineffably incarnate of the Virgin, which is humanly incomprehensible. You descended into the netherworld, and You frightened the devil and his angels. And when You trampled death, You rose on the third day, and You granted immortality and the great mercy to humanity.
