ltx/en_us_goadedes/tr.d051:trCO.header	
ltx/en_us_goadedes/tr.d051:trDA.commemoration.full	
ltx/en_us_goadedes/tr.d051:trDA.commemoration.short	
ltx/en_us_goadedes/tr.d051:trDA.insert1	
ltx/en_us_goadedes/tr.d051:trDA.insert2	
ltx/en_us_goadedes/tr.d051:trDA.note	
ltx/en_us_goadedes/tr.d051:trDA.title	
ltx/en_us_goadedes/tr.d051:trHO.commemorations	
ltx/en_us_goadedes/tr.d051:trHO.daytitle	
ltx/en_us_goadedes/tr.d051:trHO.description1	
ltx/en_us_goadedes/tr.d051:trHO.description2	
ltx/en_us_goadedes/tr.d051:trHO.note1	
ltx/en_us_goadedes/tr.d051:trHO.note2	
ltx/en_us_goadedes/tr.d051:trMA.AposIdiomelon1.incipit	…
ltx/en_us_goadedes/tr.d051:trMA.AposIdiomelon1.melody	@ltx/en_us_goadedes/miscellanea:misc.Idiomelon
ltx/en_us_goadedes/tr.d051:trMA.AposIdiomelon1.mode	@ltx/en_us_goadedes/miscellanea:misc.Mode8
ltx/en_us_goadedes/tr.d051:trMA.AposIdiomelon1.text	
ltx/en_us_goadedes/tr.d051:trMA.AposMartyric.greekmelody	@ltx/en_us_goadedes/he.a.m8:heAU.TiYmasKalesomen.greekname
ltx/en_us_goadedes/tr.d051:trMA.AposMartyric.incipit	@ltx/en_us_goadedes/he.a.m8:heAU.TiYmasKalesomen.incipit
ltx/en_us_goadedes/tr.d051:trMA.AposMartyric.melody	@ltx/en_us_goadedes/he.a.m8:heAU.TiYmasKalesomen.melody
ltx/en_us_goadedes/tr.d051:trMA.AposMartyric.mode	@ltx/en_us_goadedes/miscellanea:misc.Mode8
ltx/en_us_goadedes/tr.d051:trMA.AposMartyric.text	@ltx/en_us_goadedes/he.a.m8:heAU.TiYmasKalesomen.text
ltx/en_us_goadedes/tr.d051:trMA.AposTheotokion.incipit	@ltx/en_us_goadedes/tr.d044:trVE.AposTheotokion.incipit
ltx/en_us_goadedes/tr.d051:trMA.AposTheotokion.melody	
ltx/en_us_goadedes/tr.d051:trMA.AposTheotokion.mode	@ltx/en_us_goadedes/miscellanea:misc.Mode8
ltx/en_us_goadedes/tr.d051:trMA.AposTheotokion.text	@ltx/en_us_goadedes/tr.d044:trVE.AposTheotokion.text
ltx/en_us_goadedes/tr.d051:trMA.C1.poet	@ltx/en_us_goadedes/poets:po.Iosif
ltx/en_us_goadedes/tr.d051:trMA.C1.title	
ltx/en_us_goadedes/tr.d051:trMA.C1.verse	
ltx/en_us_goadedes/tr.d051:trMA.C2.poet	@ltx/en_us_goadedes/poets:po.Theodorou
ltx/en_us_goadedes/tr.d051:trMA.C2.title	
ltx/en_us_goadedes/tr.d051:trMA.C2.verse	
ltx/en_us_goadedes/tr.d051:trMA.Kathisma21.greekmelody	@ltx/en_us_goadedes/he.a.m3:heAU.TinOraiotita.greekname
ltx/en_us_goadedes/tr.d051:trMA.Kathisma21.incipit	…
ltx/en_us_goadedes/tr.d051:trMA.Kathisma21.melody	@ltx/en_us_goadedes/he.a.m3:heAU.TinOraiotita.name
ltx/en_us_goadedes/tr.d051:trMA.Kathisma21.mode	@ltx/en_us_goadedes/miscellanea:misc.Mode3
ltx/en_us_goadedes/tr.d051:trMA.Kathisma21.text	
ltx/en_us_goadedes/tr.d051:trMA.Kathisma22.greekmelody	@ltx/en_us_goadedes/he.a.m3:heAU.TinOraiotita.greekname
ltx/en_us_goadedes/tr.d051:trMA.Kathisma22.incipit	@ltx/en_us_goadedes/he.a.m3:heAU.TinOraiotita.incipit
ltx/en_us_goadedes/tr.d051:trMA.Kathisma22.melody	@ltx/en_us_goadedes/he.a.m3:heAU.TinOraiotita.melody
ltx/en_us_goadedes/tr.d051:trMA.Kathisma22.mode	@ltx/en_us_goadedes/miscellanea:misc.Mode3
ltx/en_us_goadedes/tr.d051:trMA.Kathisma22.text	@ltx/en_us_goadedes/he.a.m3:heAU.TinOraiotita.text
ltx/en_us_goadedes/tr.d051:trMA.Kathisma31.incipit	…
ltx/en_us_goadedes/tr.d051:trMA.Kathisma31.melody	
ltx/en_us_goadedes/tr.d051:trMA.Kathisma31.mode	@ltx/en_us_goadedes/miscellanea:misc.Mode7
ltx/en_us_goadedes/tr.d051:trMA.Kathisma31.text	
ltx/en_us_goadedes/tr.d051:trMA.Kathisma32.incipit	…
ltx/en_us_goadedes/tr.d051:trMA.Kathisma32.melody	
ltx/en_us_goadedes/tr.d051:trMA.Kathisma32.mode	@ltx/en_us_goadedes/miscellanea:misc.Mode7
ltx/en_us_goadedes/tr.d051:trMA.Kathisma32.text	
ltx/en_us_goadedes/tr.d051:trMA.Ode1C11.greekmelody	@ltx/en_us_goadedes/he.h.m3:heHE.OTaYdata.greekname
ltx/en_us_goadedes/tr.d051:trMA.Ode1C11.incipit	…
ltx/en_us_goadedes/tr.d051:trMA.Ode1C11.melody	@ltx/en_us_goadedes/he.h.m3:heHE.OTaYdata.name
ltx/en_us_goadedes/tr.d051:trMA.Ode1C11.mode	@ltx/en_us_goadedes/miscellanea:misc.Mode3
ltx/en_us_goadedes/tr.d051:trMA.Ode1C11.ode	@ltx/en_us_goadedes/miscellanea:misc.Ode1
ltx/en_us_goadedes/tr.d051:trMA.Ode1C11.text	
ltx/en_us_goadedes/tr.d051:trMA.Ode1C12.incipit	…
ltx/en_us_goadedes/tr.d051:trMA.Ode1C12.melody	@ltx/en_us_goadedes/he.h.m3:heHE.OTaYdata.name
ltx/en_us_goadedes/tr.d051:trMA.Ode1C12.mode	@ltx/en_us_goadedes/miscellanea:misc.Mode3
ltx/en_us_goadedes/tr.d051:trMA.Ode1C12.ode	@ltx/en_us_goadedes/miscellanea:misc.Ode1
ltx/en_us_goadedes/tr.d051:trMA.Ode1C12.text	
ltx/en_us_goadedes/tr.d051:trMA.Ode1C13.incipit	…
ltx/en_us_goadedes/tr.d051:trMA.Ode1C13.melody	@ltx/en_us_goadedes/he.h.m3:heHE.OTaYdata.name
ltx/en_us_goadedes/tr.d051:trMA.Ode1C13.mode	@ltx/en_us_goadedes/miscellanea:misc.Mode3
ltx/en_us_goadedes/tr.d051:trMA.Ode1C13.ode	@ltx/en_us_goadedes/miscellanea:misc.Ode1
ltx/en_us_goadedes/tr.d051:trMA.Ode1C13.text	
ltx/en_us_goadedes/tr.d051:trMA.Ode1C1T.incipit	…
ltx/en_us_goadedes/tr.d051:trMA.Ode1C1T.melody	@ltx/en_us_goadedes/he.h.m3:heHE.OTaYdata.name
ltx/en_us_goadedes/tr.d051:trMA.Ode1C1T.mode	@ltx/en_us_goadedes/miscellanea:misc.Mode3
ltx/en_us_goadedes/tr.d051:trMA.Ode1C1T.ode	@ltx/en_us_goadedes/miscellanea:misc.Ode1
ltx/en_us_goadedes/tr.d051:trMA.Ode1C1T.text	
ltx/en_us_goadedes/tr.d051:trMA.Ode1C21.greekmelody	@ltx/en_us_goadedes/he.h.m7:heHE.AsomenToKyrio.greekname
ltx/en_us_goadedes/tr.d051:trMA.Ode1C21.incipit	…
ltx/en_us_goadedes/tr.d051:trMA.Ode1C21.melody	@ltx/en_us_goadedes/he.h.m7:heHE.AsomenToKyrio.name
ltx/en_us_goadedes/tr.d051:trMA.Ode1C21.mode	@ltx/en_us_goadedes/miscellanea:misc.Mode7
ltx/en_us_goadedes/tr.d051:trMA.Ode1C21.ode	@ltx/en_us_goadedes/miscellanea:misc.Ode1
ltx/en_us_goadedes/tr.d051:trMA.Ode1C21.text	
ltx/en_us_goadedes/tr.d051:trMA.Ode1C22.incipit	…
ltx/en_us_goadedes/tr.d051:trMA.Ode1C22.melody	@ltx/en_us_goadedes/he.h.m7:heHE.AsomenToKyrio.name
ltx/en_us_goadedes/tr.d051:trMA.Ode1C22.mode	@ltx/en_us_goadedes/miscellanea:misc.Mode7
ltx/en_us_goadedes/tr.d051:trMA.Ode1C22.ode	@ltx/en_us_goadedes/miscellanea:misc.Ode1
ltx/en_us_goadedes/tr.d051:trMA.Ode1C22.text	
ltx/en_us_goadedes/tr.d051:trMA.Ode1C2A1.incipit	…
ltx/en_us_goadedes/tr.d051:trMA.Ode1C2A1.melody	@ltx/en_us_goadedes/he.h.m7:heHE.AsomenToKyrio.name
ltx/en_us_goadedes/tr.d051:trMA.Ode1C2A1.mode	@ltx/en_us_goadedes/miscellanea:misc.Mode7
ltx/en_us_goadedes/tr.d051:trMA.Ode1C2A1.ode	@ltx/en_us_goadedes/miscellanea:misc.Ode1
ltx/en_us_goadedes/tr.d051:trMA.Ode1C2A1.text	
ltx/en_us_goadedes/tr.d051:trMA.Ode1C2H.greekmelody	@ltx/en_us_goadedes/he.h.m7:heHE.AsomenToKyrio.greekname
ltx/en_us_goadedes/tr.d051:trMA.Ode1C2H.incipit	@ltx/en_us_goadedes/he.h.m7:heHE.AsomenToKyrio.incipit
ltx/en_us_goadedes/tr.d051:trMA.Ode1C2H.melody	@ltx/en_us_goadedes/he.h.m7:heHE.AsomenToKyrio.melody
ltx/en_us_goadedes/tr.d051:trMA.Ode1C2H.mode	@ltx/en_us_goadedes/miscellanea:misc.Mode7
ltx/en_us_goadedes/tr.d051:trMA.Ode1C2H.ode	@ltx/en_us_goadedes/miscellanea:misc.Ode1
ltx/en_us_goadedes/tr.d051:trMA.Ode1C2H.text	@ltx/en_us_goadedes/he.h.m7:heHE.AsomenToKyrio.text
ltx/en_us_goadedes/tr.d051:trMA.Ode1C2T.incipit	…
ltx/en_us_goadedes/tr.d051:trMA.Ode1C2T.melody	@ltx/en_us_goadedes/he.h.m7:heHE.AsomenToKyrio.name
ltx/en_us_goadedes/tr.d051:trMA.Ode1C2T.mode	@ltx/en_us_goadedes/miscellanea:misc.Mode7
ltx/en_us_goadedes/tr.d051:trMA.Ode1C2T.ode	@ltx/en_us_goadedes/miscellanea:misc.Ode1
ltx/en_us_goadedes/tr.d051:trMA.Ode1C2T.text	
ltx/en_us_goadedes/tr.d051:trMA.Ode1C2Tr.incipit	…
ltx/en_us_goadedes/tr.d051:trMA.Ode1C2Tr.melody	@ltx/en_us_goadedes/he.h.m7:heHE.AsomenToKyrio.name
ltx/en_us_goadedes/tr.d051:trMA.Ode1C2Tr.mode	@ltx/en_us_goadedes/miscellanea:misc.Mode7
ltx/en_us_goadedes/tr.d051:trMA.Ode1C2Tr.ode	@ltx/en_us_goadedes/miscellanea:misc.Ode1
ltx/en_us_goadedes/tr.d051:trMA.Ode1C2Tr.text	
ltx/en_us_goadedes/tr.d051:trMA.Ode8C11.greekmelody	@ltx/en_us_goadedes/he.h.m3:heHE.VavyloniaKaminos.greekname
ltx/en_us_goadedes/tr.d051:trMA.Ode8C11.incipit	…
ltx/en_us_goadedes/tr.d051:trMA.Ode8C11.melody	@ltx/en_us_goadedes/he.h.m3:heHE.VavyloniaKaminos.name
ltx/en_us_goadedes/tr.d051:trMA.Ode8C11.mode	@ltx/en_us_goadedes/miscellanea:misc.Mode3
ltx/en_us_goadedes/tr.d051:trMA.Ode8C11.ode	@ltx/en_us_goadedes/miscellanea:misc.Ode8
ltx/en_us_goadedes/tr.d051:trMA.Ode8C11.text	
ltx/en_us_goadedes/tr.d051:trMA.Ode8C12.incipit	…
ltx/en_us_goadedes/tr.d051:trMA.Ode8C12.melody	@ltx/en_us_goadedes/he.h.m3:heHE.VavyloniaKaminos.name
ltx/en_us_goadedes/tr.d051:trMA.Ode8C12.mode	@ltx/en_us_goadedes/miscellanea:misc.Mode3
ltx/en_us_goadedes/tr.d051:trMA.Ode8C12.ode	@ltx/en_us_goadedes/miscellanea:misc.Ode8
ltx/en_us_goadedes/tr.d051:trMA.Ode8C12.text	
ltx/en_us_goadedes/tr.d051:trMA.Ode8C13.incipit	…
ltx/en_us_goadedes/tr.d051:trMA.Ode8C13.melody	@ltx/en_us_goadedes/he.h.m3:heHE.VavyloniaKaminos.name
ltx/en_us_goadedes/tr.d051:trMA.Ode8C13.mode	@ltx/en_us_goadedes/miscellanea:misc.Mode3
ltx/en_us_goadedes/tr.d051:trMA.Ode8C13.ode	@ltx/en_us_goadedes/miscellanea:misc.Ode8
ltx/en_us_goadedes/tr.d051:trMA.Ode8C13.text	
ltx/en_us_goadedes/tr.d051:trMA.Ode8C1T.incipit	…
ltx/en_us_goadedes/tr.d051:trMA.Ode8C1T.melody	@ltx/en_us_goadedes/he.h.m3:heHE.VavyloniaKaminos.name
ltx/en_us_goadedes/tr.d051:trMA.Ode8C1T.mode	@ltx/en_us_goadedes/miscellanea:misc.Mode3
ltx/en_us_goadedes/tr.d051:trMA.Ode8C1T.ode	@ltx/en_us_goadedes/miscellanea:misc.Ode8
ltx/en_us_goadedes/tr.d051:trMA.Ode8C1T.text	
ltx/en_us_goadedes/tr.d051:trMA.Ode8C21.greekmelody	@ltx/en_us_goadedes/he.h.m7:heHE.TonFoveronToisCherouvim.greekname
ltx/en_us_goadedes/tr.d051:trMA.Ode8C21.incipit	…
ltx/en_us_goadedes/tr.d051:trMA.Ode8C21.melody	@ltx/en_us_goadedes/he.h.m7:heHE.TonFoveronToisCherouvim.name
ltx/en_us_goadedes/tr.d051:trMA.Ode8C21.mode	@ltx/en_us_goadedes/miscellanea:misc.Mode7
ltx/en_us_goadedes/tr.d051:trMA.Ode8C21.ode	@ltx/en_us_goadedes/miscellanea:misc.Ode8
ltx/en_us_goadedes/tr.d051:trMA.Ode8C21.text	
ltx/en_us_goadedes/tr.d051:trMA.Ode8C22.incipit	…
ltx/en_us_goadedes/tr.d051:trMA.Ode8C22.melody	@ltx/en_us_goadedes/he.h.m7:heHE.TonFoveronToisCherouvim.name
ltx/en_us_goadedes/tr.d051:trMA.Ode8C22.mode	@ltx/en_us_goadedes/miscellanea:misc.Mode7
ltx/en_us_goadedes/tr.d051:trMA.Ode8C22.ode	@ltx/en_us_goadedes/miscellanea:misc.Ode8
ltx/en_us_goadedes/tr.d051:trMA.Ode8C22.text	
ltx/en_us_goadedes/tr.d051:trMA.Ode8C2A1.incipit	…
ltx/en_us_goadedes/tr.d051:trMA.Ode8C2A1.melody	@ltx/en_us_goadedes/he.h.m7:heHE.TonFoveronToisCherouvim.name
ltx/en_us_goadedes/tr.d051:trMA.Ode8C2A1.mode	@ltx/en_us_goadedes/miscellanea:misc.Mode7
ltx/en_us_goadedes/tr.d051:trMA.Ode8C2A1.ode	@ltx/en_us_goadedes/miscellanea:misc.Ode8
ltx/en_us_goadedes/tr.d051:trMA.Ode8C2A1.text	
ltx/en_us_goadedes/tr.d051:trMA.Ode8C2H.greekmelody	@ltx/en_us_goadedes/he.h.m7:heHE.TonFoveronToisCherouvim.greekname
ltx/en_us_goadedes/tr.d051:trMA.Ode8C2H.incipit	@ltx/en_us_goadedes/he.h.m7:heHE.TonFoveronToisCherouvim.incipit
ltx/en_us_goadedes/tr.d051:trMA.Ode8C2H.melody	@ltx/en_us_goadedes/he.h.m7:heHE.TonFoveronToisCherouvim.melody
ltx/en_us_goadedes/tr.d051:trMA.Ode8C2H.mode	@ltx/en_us_goadedes/miscellanea:misc.Mode7
ltx/en_us_goadedes/tr.d051:trMA.Ode8C2H.ode	@ltx/en_us_goadedes/miscellanea:misc.Ode8
ltx/en_us_goadedes/tr.d051:trMA.Ode8C2H.text	@ltx/en_us_goadedes/he.h.m7:heHE.TonFoveronToisCherouvim.text
ltx/en_us_goadedes/tr.d051:trMA.Ode8C2T.incipit	…
ltx/en_us_goadedes/tr.d051:trMA.Ode8C2T.melody	@ltx/en_us_goadedes/he.h.m7:heHE.TonFoveronToisCherouvim.name
ltx/en_us_goadedes/tr.d051:trMA.Ode8C2T.mode	@ltx/en_us_goadedes/miscellanea:misc.Mode7
ltx/en_us_goadedes/tr.d051:trMA.Ode8C2T.ode	@ltx/en_us_goadedes/miscellanea:misc.Ode8
ltx/en_us_goadedes/tr.d051:trMA.Ode8C2T.text	
ltx/en_us_goadedes/tr.d051:trMA.Ode8C2Tr.incipit	…
ltx/en_us_goadedes/tr.d051:trMA.Ode8C2Tr.melody	@ltx/en_us_goadedes/he.h.m7:heHE.TonFoveronToisCherouvim.name
ltx/en_us_goadedes/tr.d051:trMA.Ode8C2Tr.mode	@ltx/en_us_goadedes/miscellanea:misc.Mode7
ltx/en_us_goadedes/tr.d051:trMA.Ode8C2Tr.ode	@ltx/en_us_goadedes/miscellanea:misc.Ode8
ltx/en_us_goadedes/tr.d051:trMA.Ode8C2Tr.text	
ltx/en_us_goadedes/tr.d051:trMA.Ode9C11.greekmelody	@ltx/en_us_goadedes/he.h.m3:heHE.KainonToThavma.greekname
ltx/en_us_goadedes/tr.d051:trMA.Ode9C11.incipit	…
ltx/en_us_goadedes/tr.d051:trMA.Ode9C11.melody	@ltx/en_us_goadedes/he.h.m3:heHE.KainonToThavma.name
ltx/en_us_goadedes/tr.d051:trMA.Ode9C11.mode	@ltx/en_us_goadedes/miscellanea:misc.Mode3
ltx/en_us_goadedes/tr.d051:trMA.Ode9C11.ode	@ltx/en_us_goadedes/miscellanea:misc.Ode9
ltx/en_us_goadedes/tr.d051:trMA.Ode9C11.text	
ltx/en_us_goadedes/tr.d051:trMA.Ode9C12.incipit	…
ltx/en_us_goadedes/tr.d051:trMA.Ode9C12.melody	@ltx/en_us_goadedes/he.h.m3:heHE.KainonToThavma.name
ltx/en_us_goadedes/tr.d051:trMA.Ode9C12.mode	@ltx/en_us_goadedes/miscellanea:misc.Mode3
ltx/en_us_goadedes/tr.d051:trMA.Ode9C12.ode	@ltx/en_us_goadedes/miscellanea:misc.Ode9
ltx/en_us_goadedes/tr.d051:trMA.Ode9C12.text	
ltx/en_us_goadedes/tr.d051:trMA.Ode9C13.incipit	…
ltx/en_us_goadedes/tr.d051:trMA.Ode9C13.melody	@ltx/en_us_goadedes/he.h.m3:heHE.KainonToThavma.name
ltx/en_us_goadedes/tr.d051:trMA.Ode9C13.mode	@ltx/en_us_goadedes/miscellanea:misc.Mode3
ltx/en_us_goadedes/tr.d051:trMA.Ode9C13.ode	@ltx/en_us_goadedes/miscellanea:misc.Ode9
ltx/en_us_goadedes/tr.d051:trMA.Ode9C13.text	
ltx/en_us_goadedes/tr.d051:trMA.Ode9C1T.incipit	…
ltx/en_us_goadedes/tr.d051:trMA.Ode9C1T.melody	@ltx/en_us_goadedes/he.h.m3:heHE.KainonToThavma.name
ltx/en_us_goadedes/tr.d051:trMA.Ode9C1T.mode	@ltx/en_us_goadedes/miscellanea:misc.Mode3
ltx/en_us_goadedes/tr.d051:trMA.Ode9C1T.ode	@ltx/en_us_goadedes/miscellanea:misc.Ode9
ltx/en_us_goadedes/tr.d051:trMA.Ode9C1T.text	
ltx/en_us_goadedes/tr.d051:trMA.Ode9C21.greekmelody	@ltx/en_us_goadedes/he.h.m7:heHE.TinYperFysinMitera.greekname
ltx/en_us_goadedes/tr.d051:trMA.Ode9C21.incipit	…
ltx/en_us_goadedes/tr.d051:trMA.Ode9C21.melody	@ltx/en_us_goadedes/he.h.m7:heHE.TinYperFysinMitera.name
ltx/en_us_goadedes/tr.d051:trMA.Ode9C21.mode	@ltx/en_us_goadedes/miscellanea:misc.Mode7
ltx/en_us_goadedes/tr.d051:trMA.Ode9C21.ode	@ltx/en_us_goadedes/miscellanea:misc.Ode9
ltx/en_us_goadedes/tr.d051:trMA.Ode9C21.text	
ltx/en_us_goadedes/tr.d051:trMA.Ode9C22.incipit	…
ltx/en_us_goadedes/tr.d051:trMA.Ode9C22.melody	@ltx/en_us_goadedes/he.h.m7:heHE.TinYperFysinMitera.name
ltx/en_us_goadedes/tr.d051:trMA.Ode9C22.mode	@ltx/en_us_goadedes/miscellanea:misc.Mode7
ltx/en_us_goadedes/tr.d051:trMA.Ode9C22.ode	@ltx/en_us_goadedes/miscellanea:misc.Ode9
ltx/en_us_goadedes/tr.d051:trMA.Ode9C22.text	
ltx/en_us_goadedes/tr.d051:trMA.Ode9C2A1.incipit	…
ltx/en_us_goadedes/tr.d051:trMA.Ode9C2A1.melody	@ltx/en_us_goadedes/he.h.m7:heHE.TinYperFysinMitera.name
ltx/en_us_goadedes/tr.d051:trMA.Ode9C2A1.mode	@ltx/en_us_goadedes/miscellanea:misc.Mode7
ltx/en_us_goadedes/tr.d051:trMA.Ode9C2A1.ode	@ltx/en_us_goadedes/miscellanea:misc.Ode9
ltx/en_us_goadedes/tr.d051:trMA.Ode9C2A1.text	
ltx/en_us_goadedes/tr.d051:trMA.Ode9C2H.greekmelody	@ltx/en_us_goadedes/he.h.m7:heHE.TinYperFysinMitera.greekname
ltx/en_us_goadedes/tr.d051:trMA.Ode9C2H.incipit	@ltx/en_us_goadedes/he.h.m7:heHE.TinYperFysinMitera.incipit
ltx/en_us_goadedes/tr.d051:trMA.Ode9C2H.melody	@ltx/en_us_goadedes/he.h.m7:heHE.TinYperFysinMitera.melody
ltx/en_us_goadedes/tr.d051:trMA.Ode9C2H.mode	@ltx/en_us_goadedes/miscellanea:misc.Mode7
ltx/en_us_goadedes/tr.d051:trMA.Ode9C2H.ode	@ltx/en_us_goadedes/miscellanea:misc.Ode9
ltx/en_us_goadedes/tr.d051:trMA.Ode9C2H.text	@ltx/en_us_goadedes/he.h.m7:heHE.TinYperFysinMitera.text
ltx/en_us_goadedes/tr.d051:trMA.Ode9C2T.incipit	…
ltx/en_us_goadedes/tr.d051:trMA.Ode9C2T.melody	@ltx/en_us_goadedes/he.h.m7:heHE.TinYperFysinMitera.name
ltx/en_us_goadedes/tr.d051:trMA.Ode9C2T.mode	@ltx/en_us_goadedes/miscellanea:misc.Mode7
ltx/en_us_goadedes/tr.d051:trMA.Ode9C2T.ode	@ltx/en_us_goadedes/miscellanea:misc.Ode9
ltx/en_us_goadedes/tr.d051:trMA.Ode9C2T.text	
ltx/en_us_goadedes/tr.d051:trMA.Ode9C2Tr.incipit	…
ltx/en_us_goadedes/tr.d051:trMA.Ode9C2Tr.melody	@ltx/en_us_goadedes/he.h.m7:heHE.TinYperFysinMitera.name
ltx/en_us_goadedes/tr.d051:trMA.Ode9C2Tr.mode	@ltx/en_us_goadedes/miscellanea:misc.Mode7
ltx/en_us_goadedes/tr.d051:trMA.Ode9C2Tr.ode	@ltx/en_us_goadedes/miscellanea:misc.Ode9
ltx/en_us_goadedes/tr.d051:trMA.Ode9C2Tr.text	
ltx/en_us_goadedes/tr.d051:trTE.Troparion.incipit	…
ltx/en_us_goadedes/tr.d051:trTE.Troparion.melody	
ltx/en_us_goadedes/tr.d051:trTE.Troparion.mode	@ltx/en_us_goadedes/miscellanea:misc.Mode3
ltx/en_us_goadedes/tr.d051:trTE.Troparion.text	
ltx/en_us_goadedes/tr.d051:trTE.Troparion2.incipit	…
ltx/en_us_goadedes/tr.d051:trTE.Troparion2.text	
ltx/en_us_goadedes/tr.d051:trVE.AposIdiomelon1.incipit	…
ltx/en_us_goadedes/tr.d051:trVE.AposIdiomelon1.melody	@ltx/en_us_goadedes/miscellanea:misc.Idiomelon
ltx/en_us_goadedes/tr.d051:trVE.AposIdiomelon1.mode	@ltx/en_us_goadedes/miscellanea:misc.Mode7
ltx/en_us_goadedes/tr.d051:trVE.AposIdiomelon1.text	
ltx/en_us_goadedes/tr.d051:trVE.AposIdiomelon2.incipit	…
ltx/en_us_goadedes/tr.d051:trVE.AposIdiomelon2.melody	@ltx/en_us_goadedes/miscellanea:misc.Idiomelon
ltx/en_us_goadedes/tr.d051:trVE.AposIdiomelon2.mode	@ltx/en_us_goadedes/miscellanea:misc.Mode6
ltx/en_us_goadedes/tr.d051:trVE.AposIdiomelon2.poet	@ltx/en_us_goadedes/poets:po.Stefanou
ltx/en_us_goadedes/tr.d051:trVE.AposIdiomelon2.text	
ltx/en_us_goadedes/tr.d051:trVE.AposMartyric.incipit	@ltx/en_us_goadedes/oc.m6.d2:ocVE.Aposticha3.incipit
ltx/en_us_goadedes/tr.d051:trVE.AposMartyric.melody	
ltx/en_us_goadedes/tr.d051:trVE.AposMartyric.mode	@ltx/en_us_goadedes/miscellanea:misc.Mode6
ltx/en_us_goadedes/tr.d051:trVE.AposMartyric.text	@ltx/en_us_goadedes/oc.m6.d2:ocVE.Aposticha3.text
ltx/en_us_goadedes/tr.d051:trVE.AposTheotokion.incipit	…
ltx/en_us_goadedes/tr.d051:trVE.AposTheotokion.melody	
ltx/en_us_goadedes/tr.d051:trVE.AposTheotokion.mode	@ltx/en_us_goadedes/miscellanea:misc.Mode6
ltx/en_us_goadedes/tr.d051:trVE.AposTheotokion.text	
ltx/en_us_goadedes/tr.d051:trVE.Stichera01.greekmelody	@ltx/en_us_goadedes/he.a.m3:heAU.MegaliTouStavrouSou.greekname
ltx/en_us_goadedes/tr.d051:trVE.Stichera01.incipit	Believers, let us demonstrate…
ltx/en_us_goadedes/tr.d051:trVE.Stichera01.melody	@ltx/en_us_goadedes/he.a.m3:heAU.MegaliTouStavrouSou.name
ltx/en_us_goadedes/tr.d051:trVE.Stichera01.mode	@ltx/en_us_goadedes/miscellanea:misc.Mode3
ltx/en_us_goadedes/tr.d051:trVE.Stichera01.text	Believers, let us demonstrate the greatest diligence * in self-control and fasting during this Lenten season, * so that we may be delivered from the fire of Hades, * and instead may attain * greater glory by the mercy of our great God and King.
ltx/en_us_goadedes/tr.d051:trVE.Stichera02.greekmelody	@ltx/en_us_goadedes/he.a.m3:heAU.MegaliTouStavrouSou.greekname
ltx/en_us_goadedes/tr.d051:trVE.Stichera02.incipit	Today, as we have passed…
ltx/en_us_goadedes/tr.d051:trVE.Stichera02.melody	@ltx/en_us_goadedes/he.a.m3:heAU.MegaliTouStavrouSou.name
ltx/en_us_goadedes/tr.d051:trVE.Stichera02.mode	@ltx/en_us_goadedes/miscellanea:misc.Mode3
ltx/en_us_goadedes/tr.d051:trVE.Stichera02.text	Today, as we have passed the midpoint of the Lenten fast, * let us show some advancement towards that godly glory. * Let us eagerly push forward to attaining * a truly virtuous life, * that we may also receive that never-ending delight.
ltx/en_us_goadedes/tr.d051:trVE.Stichera03.greekmelody	@ltx/en_us_goadedes/he.a.m7:heAU.KatafronisantesPanton.greekname
ltx/en_us_goadedes/tr.d051:trVE.Stichera03.incipit	Having completed…
ltx/en_us_goadedes/tr.d051:trVE.Stichera03.melody	@ltx/en_us_goadedes/he.a.m7:heAU.KatafronisantesPanton.name
ltx/en_us_goadedes/tr.d051:trVE.Stichera03.mode	@ltx/en_us_goadedes/miscellanea:misc.Mode7
ltx/en_us_goadedes/tr.d051:trVE.Stichera03.text	Having completed more than half of the annual * season of the Lenten fast, * let us joyfully stay the course until the very end; * and let us anoint our souls with the oil of righteous deeds, * so that we may be counted worthy * to celebrate Holy Week * and to honor and venerate * the Passion and Crucifixion * and holy Resurrection of Christ our God.
