ltx/en_us_goadedes/tr.d021:trCO.header	
ltx/en_us_goadedes/tr.d021:trDA.commemoration.full	
ltx/en_us_goadedes/tr.d021:trDA.commemoration.short	
ltx/en_us_goadedes/tr.d021:trDA.insert1	
ltx/en_us_goadedes/tr.d021:trDA.insert2	
ltx/en_us_goadedes/tr.d021:trDA.note	
ltx/en_us_goadedes/tr.d021:trDA.title	@ltx/en_us_goadedes/titles:ti.DevoutSaints
ltx/en_us_goadedes/tr.d021:trHO.commemorations	
ltx/en_us_goadedes/tr.d021:trHO.daytitle	
ltx/en_us_goadedes/tr.d021:trHO.description1	
ltx/en_us_goadedes/tr.d021:trHO.description2	
ltx/en_us_goadedes/tr.d021:trHO.note1	
ltx/en_us_goadedes/tr.d021:trHO.note2	
ltx/en_us_goadedes/tr.d021:trLI.MM.CommunionHymn.text	@ltx/en_us_goadedes/properties:media.key
ltx/en_us_goadedes/tr.d021:trLI.Megalynarion.text	
ltx/en_us_goadedes/tr.d021:trMA.C1.title	@ltx/en_us_goadedes/titles:ti.CanonFathers
ltx/en_us_goadedes/tr.d021:trMA.C1.verse	@ltx/en_us_goadedes/prayers:pr.verse_DevoutMen.text
ltx/en_us_goadedes/tr.d021:trMA.Exaposteilarion1.greekmelody	@ltx/en_us_goadedes/he.a.m2:heAU.GynaikesAkoutisthite.greekname
ltx/en_us_goadedes/tr.d021:trMA.Exaposteilarion1.incipit	…
ltx/en_us_goadedes/tr.d021:trMA.Exaposteilarion1.melody	@ltx/en_us_goadedes/he.a.m2:heAU.GynaikesAkoutisthite.name
ltx/en_us_goadedes/tr.d021:trMA.Exaposteilarion1.mode	@ltx/en_us_goadedes/miscellanea:misc.Mode2
ltx/en_us_goadedes/tr.d021:trMA.Exaposteilarion1.text	
ltx/en_us_goadedes/tr.d021:trMA.Exaposteilarion2.greekmelody	@ltx/en_us_goadedes/he.a.m2:heAU.ToisMathitaisSynelthomen.greekname
ltx/en_us_goadedes/tr.d021:trMA.Exaposteilarion2.incipit	…
ltx/en_us_goadedes/tr.d021:trMA.Exaposteilarion2.melody	@ltx/en_us_goadedes/he.a.m2:heAU.ToisMathitaisSynelthomen.name
ltx/en_us_goadedes/tr.d021:trMA.Exaposteilarion2.mode	@ltx/en_us_goadedes/miscellanea:misc.Mode2
ltx/en_us_goadedes/tr.d021:trMA.Exaposteilarion2.text	
ltx/en_us_goadedes/tr.d021:trMA.Kathisma11.greekmelody	@ltx/en_us_goadedes/he.a.m8:heAU.ToProstachthen.greekname
ltx/en_us_goadedes/tr.d021:trMA.Kathisma11.incipit	…
ltx/en_us_goadedes/tr.d021:trMA.Kathisma11.melody	@ltx/en_us_goadedes/he.a.m8:heAU.ToProstachthen.name
ltx/en_us_goadedes/tr.d021:trMA.Kathisma11.mode	@ltx/en_us_goadedes/miscellanea:misc.Mode8
ltx/en_us_goadedes/tr.d021:trMA.Kathisma11.text	
ltx/en_us_goadedes/tr.d021:trMA.Kathisma12.greekmelody	@ltx/en_us_goadedes/he.a.m8:heAU.ToProstachthen.greekname
ltx/en_us_goadedes/tr.d021:trMA.Kathisma12.incipit	…
ltx/en_us_goadedes/tr.d021:trMA.Kathisma12.melody	@ltx/en_us_goadedes/he.a.m8:heAU.ToProstachthen.name
ltx/en_us_goadedes/tr.d021:trMA.Kathisma12.mode	@ltx/en_us_goadedes/miscellanea:misc.Mode8
ltx/en_us_goadedes/tr.d021:trMA.Kathisma12.text	
ltx/en_us_goadedes/tr.d021:trMA.Kathisma13.greekmelody	@ltx/en_us_goadedes/he.a.m8:heAU.ToProstachthen.greekname
ltx/en_us_goadedes/tr.d021:trMA.Kathisma13.incipit	@ltx/en_us_goadedes/oc.m8.d1:ocMO.Kathisma22.incipit
ltx/en_us_goadedes/tr.d021:trMA.Kathisma13.melody	@ltx/en_us_goadedes/he.a.m8:heAU.ToProstachthen.name
ltx/en_us_goadedes/tr.d021:trMA.Kathisma13.mode	@ltx/en_us_goadedes/miscellanea:misc.Mode8
ltx/en_us_goadedes/tr.d021:trMA.Kathisma13.text	@ltx/en_us_goadedes/oc.m8.d1:ocMO.Kathisma22.text
ltx/en_us_goadedes/tr.d021:trMA.Kathisma21.greekmelody	@ltx/en_us_goadedes/he.a.m8:heAU.AnestisEkNekron.greekname
ltx/en_us_goadedes/tr.d021:trMA.Kathisma21.incipit	…
ltx/en_us_goadedes/tr.d021:trMA.Kathisma21.melody	@ltx/en_us_goadedes/he.a.m8:heAU.AnestisEkNekron.name
ltx/en_us_goadedes/tr.d021:trMA.Kathisma21.mode	@ltx/en_us_goadedes/miscellanea:misc.Mode8
ltx/en_us_goadedes/tr.d021:trMA.Kathisma21.text	
ltx/en_us_goadedes/tr.d021:trMA.Kathisma22.greekmelody	@ltx/en_us_goadedes/he.a.m8:heAU.ToProstachthen.greekname
ltx/en_us_goadedes/tr.d021:trMA.Kathisma22.incipit	…
ltx/en_us_goadedes/tr.d021:trMA.Kathisma22.melody	@ltx/en_us_goadedes/he.a.m8:heAU.ToProstachthen.name
ltx/en_us_goadedes/tr.d021:trMA.Kathisma22.mode	@ltx/en_us_goadedes/miscellanea:misc.Mode8
ltx/en_us_goadedes/tr.d021:trMA.Kathisma22.text	
ltx/en_us_goadedes/tr.d021:trMA.Kathisma23.greekmelody	@ltx/en_us_goadedes/he.a.m8:heAU.ToProstachthen.greekname
ltx/en_us_goadedes/tr.d021:trMA.Kathisma23.incipit	…
ltx/en_us_goadedes/tr.d021:trMA.Kathisma23.melody	@ltx/en_us_goadedes/he.a.m8:heAU.ToProstachthen.name
ltx/en_us_goadedes/tr.d021:trMA.Kathisma23.mode	@ltx/en_us_goadedes/miscellanea:misc.Mode8
ltx/en_us_goadedes/tr.d021:trMA.Kathisma23.text	
ltx/en_us_goadedes/tr.d021:trMA.Kontakion1.incipit	…
ltx/en_us_goadedes/tr.d021:trMA.Kontakion1.melody	@ltx/en_us_goadedes/he.a.m8:heAU.OsAparchas.name
ltx/en_us_goadedes/tr.d021:trMA.Kontakion1.mode	@ltx/en_us_goadedes/miscellanea:misc.Mode8
ltx/en_us_goadedes/tr.d021:trMA.Kontakion1.text	
ltx/en_us_goadedes/tr.d021:trMA.Lauds1.greekmelody	@ltx/en_us_goadedes/he.a.m8:heAU.OEnEdemParadeisos.greekname
ltx/en_us_goadedes/tr.d021:trMA.Lauds1.incipit	…
ltx/en_us_goadedes/tr.d021:trMA.Lauds1.melody	@ltx/en_us_goadedes/he.a.m8:heAU.OEnEdemParadeisos.name
ltx/en_us_goadedes/tr.d021:trMA.Lauds1.mode	@ltx/en_us_goadedes/miscellanea:misc.Mode8
ltx/en_us_goadedes/tr.d021:trMA.Lauds1.text	
ltx/en_us_goadedes/tr.d021:trMA.Lauds2.incipit	…
ltx/en_us_goadedes/tr.d021:trMA.Lauds2.melody	@ltx/en_us_goadedes/he.a.m8:heAU.OEnEdemParadeisos.name
ltx/en_us_goadedes/tr.d021:trMA.Lauds2.mode	@ltx/en_us_goadedes/miscellanea:misc.Mode8
ltx/en_us_goadedes/tr.d021:trMA.Lauds2.text	
ltx/en_us_goadedes/tr.d021:trMA.Lauds3.incipit	…
ltx/en_us_goadedes/tr.d021:trMA.Lauds3.melody	@ltx/en_us_goadedes/he.a.m8:heAU.OEnEdemParadeisos.name
ltx/en_us_goadedes/tr.d021:trMA.Lauds3.mode	@ltx/en_us_goadedes/miscellanea:misc.Mode8
ltx/en_us_goadedes/tr.d021:trMA.Lauds3.text	
ltx/en_us_goadedes/tr.d021:trMA.Lauds4.incipit	…
ltx/en_us_goadedes/tr.d021:trMA.Lauds4.melody	@ltx/en_us_goadedes/he.a.m8:heAU.OEnEdemParadeisos.name
ltx/en_us_goadedes/tr.d021:trMA.Lauds4.mode	@ltx/en_us_goadedes/miscellanea:misc.Mode8
ltx/en_us_goadedes/tr.d021:trMA.Lauds4.text	
ltx/en_us_goadedes/tr.d021:trMA.LaudsGlory.incipit	…
ltx/en_us_goadedes/tr.d021:trMA.LaudsGlory.melody	@ltx/en_us_goadedes/miscellanea:misc.Idiomelon
ltx/en_us_goadedes/tr.d021:trMA.LaudsGlory.mode	@ltx/en_us_goadedes/miscellanea:misc.Mode6
ltx/en_us_goadedes/tr.d021:trMA.LaudsGlory.text	
ltx/en_us_goadedes/tr.d021:trMA.LaudsTheotokion.incipit	@ltx/en_us_goadedes/he.o:heOT.TheotokeSyEi.incipit
ltx/en_us_goadedes/tr.d021:trMA.LaudsTheotokion.melody	@ltx/en_us_goadedes/he.o:heOT.TheotokeSyEi.name
ltx/en_us_goadedes/tr.d021:trMA.LaudsTheotokion.mode	@ltx/en_us_goadedes/miscellanea:misc.Mode6
ltx/en_us_goadedes/tr.d021:trMA.LaudsTheotokion.text	@ltx/en_us_goadedes/he.o:heOT.TheotokeSyEiOsion.text
ltx/en_us_goadedes/tr.d021:trMA.Ode1C11.greekmelody	@ltx/en_us_goadedes/he.h.m8:heHE.AsmaAnapempsomen.greekname
ltx/en_us_goadedes/tr.d021:trMA.Ode1C11.incipit	…
ltx/en_us_goadedes/tr.d021:trMA.Ode1C11.melody	@ltx/en_us_goadedes/he.h.m8:heHE.AsmaAnapempsomen.name
ltx/en_us_goadedes/tr.d021:trMA.Ode1C11.mode	@ltx/en_us_goadedes/miscellanea:misc.Mode8
ltx/en_us_goadedes/tr.d021:trMA.Ode1C11.ode	@ltx/en_us_goadedes/miscellanea:misc.Ode1
ltx/en_us_goadedes/tr.d021:trMA.Ode1C11.text	
ltx/en_us_goadedes/tr.d021:trMA.Ode1C12.incipit	…
ltx/en_us_goadedes/tr.d021:trMA.Ode1C12.melody	@ltx/en_us_goadedes/he.h.m8:heHE.AsmaAnapempsomen.name
ltx/en_us_goadedes/tr.d021:trMA.Ode1C12.mode	@ltx/en_us_goadedes/miscellanea:misc.Mode8
ltx/en_us_goadedes/tr.d021:trMA.Ode1C12.ode	@ltx/en_us_goadedes/miscellanea:misc.Ode1
ltx/en_us_goadedes/tr.d021:trMA.Ode1C12.text	
ltx/en_us_goadedes/tr.d021:trMA.Ode1C13.incipit	…
ltx/en_us_goadedes/tr.d021:trMA.Ode1C13.melody	@ltx/en_us_goadedes/he.h.m8:heHE.AsmaAnapempsomen.name
ltx/en_us_goadedes/tr.d021:trMA.Ode1C13.mode	@ltx/en_us_goadedes/miscellanea:misc.Mode8
ltx/en_us_goadedes/tr.d021:trMA.Ode1C13.ode	@ltx/en_us_goadedes/miscellanea:misc.Ode1
ltx/en_us_goadedes/tr.d021:trMA.Ode1C13.text	
ltx/en_us_goadedes/tr.d021:trMA.Ode1C14.incipit	…
ltx/en_us_goadedes/tr.d021:trMA.Ode1C14.melody	@ltx/en_us_goadedes/he.h.m8:heHE.AsmaAnapempsomen.name
ltx/en_us_goadedes/tr.d021:trMA.Ode1C14.mode	@ltx/en_us_goadedes/miscellanea:misc.Mode8
ltx/en_us_goadedes/tr.d021:trMA.Ode1C14.ode	@ltx/en_us_goadedes/miscellanea:misc.Ode1
ltx/en_us_goadedes/tr.d021:trMA.Ode1C14.text	
ltx/en_us_goadedes/tr.d021:trMA.Ode1C15.incipit	…
ltx/en_us_goadedes/tr.d021:trMA.Ode1C15.melody	@ltx/en_us_goadedes/he.h.m8:heHE.AsmaAnapempsomen.name
ltx/en_us_goadedes/tr.d021:trMA.Ode1C15.mode	@ltx/en_us_goadedes/miscellanea:misc.Mode8
ltx/en_us_goadedes/tr.d021:trMA.Ode1C15.ode	@ltx/en_us_goadedes/miscellanea:misc.Ode1
ltx/en_us_goadedes/tr.d021:trMA.Ode1C15.text	
ltx/en_us_goadedes/tr.d021:trMA.Ode1C16.incipit	…
ltx/en_us_goadedes/tr.d021:trMA.Ode1C16.melody	@ltx/en_us_goadedes/he.h.m8:heHE.AsmaAnapempsomen.name
ltx/en_us_goadedes/tr.d021:trMA.Ode1C16.mode	@ltx/en_us_goadedes/miscellanea:misc.Mode8
ltx/en_us_goadedes/tr.d021:trMA.Ode1C16.ode	@ltx/en_us_goadedes/miscellanea:misc.Ode1
ltx/en_us_goadedes/tr.d021:trMA.Ode1C16.text	
ltx/en_us_goadedes/tr.d021:trMA.Ode1C17.incipit	…
ltx/en_us_goadedes/tr.d021:trMA.Ode1C17.melody	@ltx/en_us_goadedes/he.h.m8:heHE.AsmaAnapempsomen.name
ltx/en_us_goadedes/tr.d021:trMA.Ode1C17.mode	@ltx/en_us_goadedes/miscellanea:misc.Mode8
ltx/en_us_goadedes/tr.d021:trMA.Ode1C17.ode	@ltx/en_us_goadedes/miscellanea:misc.Ode1
ltx/en_us_goadedes/tr.d021:trMA.Ode1C17.text	
ltx/en_us_goadedes/tr.d021:trMA.Ode1C18.incipit	…
ltx/en_us_goadedes/tr.d021:trMA.Ode1C18.melody	@ltx/en_us_goadedes/he.h.m8:heHE.AsmaAnapempsomen.name
ltx/en_us_goadedes/tr.d021:trMA.Ode1C18.mode	@ltx/en_us_goadedes/miscellanea:misc.Mode1
ltx/en_us_goadedes/tr.d021:trMA.Ode1C18.ode	@ltx/en_us_goadedes/miscellanea:misc.Ode8
ltx/en_us_goadedes/tr.d021:trMA.Ode1C18.text	
ltx/en_us_goadedes/tr.d021:trMA.Ode1C1H.greekmelody	@ltx/en_us_goadedes/he.h.m8:heHE.AsmaAnapempsomen.greekname
ltx/en_us_goadedes/tr.d021:trMA.Ode1C1H.incipit	@ltx/en_us_goadedes/he.h.m8:heHE.AsmaAnapempsomen.incipit
ltx/en_us_goadedes/tr.d021:trMA.Ode1C1H.melody	@ltx/en_us_goadedes/he.h.m8:heHE.AsmaAnapempsomen.melody
ltx/en_us_goadedes/tr.d021:trMA.Ode1C1H.mode	@ltx/en_us_goadedes/miscellanea:misc.Mode8
ltx/en_us_goadedes/tr.d021:trMA.Ode1C1H.ode	@ltx/en_us_goadedes/miscellanea:misc.Ode1
ltx/en_us_goadedes/tr.d021:trMA.Ode1C1H.text	@ltx/en_us_goadedes/he.h.m8:heHE.AsmaAnapempsomen.text
ltx/en_us_goadedes/tr.d021:trMA.Ode1C1M.incipit	…
ltx/en_us_goadedes/tr.d021:trMA.Ode1C1M.melody	@ltx/en_us_goadedes/he.h.m8:heHE.AsmaAnapempsomen.name
ltx/en_us_goadedes/tr.d021:trMA.Ode1C1M.mode	@ltx/en_us_goadedes/miscellanea:misc.Mode8
ltx/en_us_goadedes/tr.d021:trMA.Ode1C1M.ode	@ltx/en_us_goadedes/miscellanea:misc.Ode1
ltx/en_us_goadedes/tr.d021:trMA.Ode1C1M.text	
ltx/en_us_goadedes/tr.d021:trMA.Ode1C1T.incipit	…
ltx/en_us_goadedes/tr.d021:trMA.Ode1C1T.melody	@ltx/en_us_goadedes/he.h.m8:heHE.AsmaAnapempsomen.name
ltx/en_us_goadedes/tr.d021:trMA.Ode1C1T.mode	@ltx/en_us_goadedes/miscellanea:misc.Mode8
ltx/en_us_goadedes/tr.d021:trMA.Ode1C1T.ode	@ltx/en_us_goadedes/miscellanea:misc.Ode1
ltx/en_us_goadedes/tr.d021:trMA.Ode1C1T.text	
ltx/en_us_goadedes/tr.d021:trMA.Ode1C1Tr.incipit	…
ltx/en_us_goadedes/tr.d021:trMA.Ode1C1Tr.melody	@ltx/en_us_goadedes/he.h.m8:heHE.AsmaAnapempsomen.name
ltx/en_us_goadedes/tr.d021:trMA.Ode1C1Tr.mode	@ltx/en_us_goadedes/miscellanea:misc.Mode8
ltx/en_us_goadedes/tr.d021:trMA.Ode1C1Tr.ode	@ltx/en_us_goadedes/miscellanea:misc.Ode1
ltx/en_us_goadedes/tr.d021:trMA.Ode1C1Tr.text	
ltx/en_us_goadedes/tr.d021:trMA.Ode1K.incipit	@ltx/en_us_goadedes/he.h.m8:heHE.AsmaAnapempsomen.incipit
ltx/en_us_goadedes/tr.d021:trMA.Ode1K.melody	@ltx/en_us_goadedes/he.h.m8:heHE.AsmaAnapempsomen.melody
ltx/en_us_goadedes/tr.d021:trMA.Ode1K.mode	@ltx/en_us_goadedes/miscellanea:misc.Mode8
ltx/en_us_goadedes/tr.d021:trMA.Ode1K.ode	@ltx/en_us_goadedes/miscellanea:misc.Ode1
ltx/en_us_goadedes/tr.d021:trMA.Ode1K.text	@ltx/en_us_goadedes/he.h.m8:heHE.AsmaAnapempsomen.text
ltx/en_us_goadedes/tr.d021:trMA.Ode2C11.greekmelody	@ltx/en_us_goadedes/he.h.m8:heHE.IdeteIdeteOProTonAionon.greekname
ltx/en_us_goadedes/tr.d021:trMA.Ode2C11.incipit	…
ltx/en_us_goadedes/tr.d021:trMA.Ode2C11.melody	@ltx/en_us_goadedes/he.h.m8:heHE.IdeteIdeteOProTonAionon.name
ltx/en_us_goadedes/tr.d021:trMA.Ode2C11.mode	@ltx/en_us_goadedes/miscellanea:misc.Mode8
ltx/en_us_goadedes/tr.d021:trMA.Ode2C11.ode	@ltx/en_us_goadedes/miscellanea:misc.Ode2
ltx/en_us_goadedes/tr.d021:trMA.Ode2C11.text	
ltx/en_us_goadedes/tr.d021:trMA.Ode2C12.incipit	…
ltx/en_us_goadedes/tr.d021:trMA.Ode2C12.melody	@ltx/en_us_goadedes/he.h.m8:heHE.IdeteIdeteOProTonAionon.name
ltx/en_us_goadedes/tr.d021:trMA.Ode2C12.mode	@ltx/en_us_goadedes/miscellanea:misc.Mode8
ltx/en_us_goadedes/tr.d021:trMA.Ode2C12.ode	@ltx/en_us_goadedes/miscellanea:misc.Ode2
ltx/en_us_goadedes/tr.d021:trMA.Ode2C12.text	
ltx/en_us_goadedes/tr.d021:trMA.Ode2C13.incipit	…
ltx/en_us_goadedes/tr.d021:trMA.Ode2C13.melody	@ltx/en_us_goadedes/he.h.m8:heHE.IdeteIdeteOProTonAionon.name
ltx/en_us_goadedes/tr.d021:trMA.Ode2C13.mode	@ltx/en_us_goadedes/miscellanea:misc.Mode8
ltx/en_us_goadedes/tr.d021:trMA.Ode2C13.ode	@ltx/en_us_goadedes/miscellanea:misc.Ode2
ltx/en_us_goadedes/tr.d021:trMA.Ode2C13.text	
ltx/en_us_goadedes/tr.d021:trMA.Ode2C14.incipit	…
ltx/en_us_goadedes/tr.d021:trMA.Ode2C14.melody	@ltx/en_us_goadedes/he.h.m8:heHE.IdeteIdeteOProTonAionon.name
ltx/en_us_goadedes/tr.d021:trMA.Ode2C14.mode	@ltx/en_us_goadedes/miscellanea:misc.Mode8
ltx/en_us_goadedes/tr.d021:trMA.Ode2C14.ode	@ltx/en_us_goadedes/miscellanea:misc.Ode2
ltx/en_us_goadedes/tr.d021:trMA.Ode2C14.text	
ltx/en_us_goadedes/tr.d021:trMA.Ode2C15.incipit	…
ltx/en_us_goadedes/tr.d021:trMA.Ode2C15.melody	@ltx/en_us_goadedes/he.h.m8:heHE.IdeteIdeteOProTonAionon.name
ltx/en_us_goadedes/tr.d021:trMA.Ode2C15.mode	@ltx/en_us_goadedes/miscellanea:misc.Mode8
ltx/en_us_goadedes/tr.d021:trMA.Ode2C15.ode	@ltx/en_us_goadedes/miscellanea:misc.Ode2
ltx/en_us_goadedes/tr.d021:trMA.Ode2C15.text	
ltx/en_us_goadedes/tr.d021:trMA.Ode2C16.incipit	…
ltx/en_us_goadedes/tr.d021:trMA.Ode2C16.melody	@ltx/en_us_goadedes/he.h.m8:heHE.IdeteIdeteOProTonAionon.name
ltx/en_us_goadedes/tr.d021:trMA.Ode2C16.mode	@ltx/en_us_goadedes/miscellanea:misc.Mode8
ltx/en_us_goadedes/tr.d021:trMA.Ode2C16.ode	@ltx/en_us_goadedes/miscellanea:misc.Ode2
ltx/en_us_goadedes/tr.d021:trMA.Ode2C16.text	
ltx/en_us_goadedes/tr.d021:trMA.Ode2C1H.greekmelody	@ltx/en_us_goadedes/he.h.m8:heHE.IdeteIdeteOProTonAionon.greekname
ltx/en_us_goadedes/tr.d021:trMA.Ode2C1H.incipit	@ltx/en_us_goadedes/he.h.m8:heHE.IdeteIdeteOProTonAionon.incipit
ltx/en_us_goadedes/tr.d021:trMA.Ode2C1H.melody	@ltx/en_us_goadedes/he.h.m8:heHE.IdeteIdeteOProTonAionon.melody
ltx/en_us_goadedes/tr.d021:trMA.Ode2C1H.mode	@ltx/en_us_goadedes/miscellanea:misc.Mode8
ltx/en_us_goadedes/tr.d021:trMA.Ode2C1H.ode	@ltx/en_us_goadedes/miscellanea:misc.Ode2
ltx/en_us_goadedes/tr.d021:trMA.Ode2C1H.text	@ltx/en_us_goadedes/he.h.m8:heHE.IdeteIdeteOProTonAionon.text
ltx/en_us_goadedes/tr.d021:trMA.Ode2C1M.incipit	…
ltx/en_us_goadedes/tr.d021:trMA.Ode2C1M.melody	@ltx/en_us_goadedes/he.h.m8:heHE.IdeteIdeteOProTonAionon.name
ltx/en_us_goadedes/tr.d021:trMA.Ode2C1M.mode	@ltx/en_us_goadedes/miscellanea:misc.Mode8
ltx/en_us_goadedes/tr.d021:trMA.Ode2C1M.ode	@ltx/en_us_goadedes/miscellanea:misc.Ode2
ltx/en_us_goadedes/tr.d021:trMA.Ode2C1M.text	
ltx/en_us_goadedes/tr.d021:trMA.Ode2C1T.incipit	…
ltx/en_us_goadedes/tr.d021:trMA.Ode2C1T.melody	@ltx/en_us_goadedes/he.h.m8:heHE.IdeteIdeteOProTonAionon.name
ltx/en_us_goadedes/tr.d021:trMA.Ode2C1T.mode	@ltx/en_us_goadedes/miscellanea:misc.Mode8
ltx/en_us_goadedes/tr.d021:trMA.Ode2C1T.ode	@ltx/en_us_goadedes/miscellanea:misc.Ode2
ltx/en_us_goadedes/tr.d021:trMA.Ode2C1T.text	
ltx/en_us_goadedes/tr.d021:trMA.Ode2C1Tr.incipit	…
ltx/en_us_goadedes/tr.d021:trMA.Ode2C1Tr.melody	@ltx/en_us_goadedes/he.h.m8:heHE.IdeteIdeteOProTonAionon.name
ltx/en_us_goadedes/tr.d021:trMA.Ode2C1Tr.mode	@ltx/en_us_goadedes/miscellanea:misc.Mode8
ltx/en_us_goadedes/tr.d021:trMA.Ode2C1Tr.ode	@ltx/en_us_goadedes/miscellanea:misc.Ode2
ltx/en_us_goadedes/tr.d021:trMA.Ode2C1Tr.text	
ltx/en_us_goadedes/tr.d021:trMA.Ode2K.incipit	@ltx/en_us_goadedes/he.h.m8:heHE.IdeteIdeteOProTonAionon.incipit
ltx/en_us_goadedes/tr.d021:trMA.Ode2K.melody	@ltx/en_us_goadedes/he.h.m8:heHE.IdeteIdeteOProTonAionon.melody
ltx/en_us_goadedes/tr.d021:trMA.Ode2K.mode	@ltx/en_us_goadedes/miscellanea:misc.Mode8
ltx/en_us_goadedes/tr.d021:trMA.Ode2K.ode	@ltx/en_us_goadedes/miscellanea:misc.Ode2
ltx/en_us_goadedes/tr.d021:trMA.Ode2K.text	@ltx/en_us_goadedes/he.h.m8:heHE.IdeteIdeteOProTonAionon.text
ltx/en_us_goadedes/tr.d021:trMA.Ode3C11.greekmelody	@ltx/en_us_goadedes/he.h.m8:heHE.OukEstinAgios.greekname
ltx/en_us_goadedes/tr.d021:trMA.Ode3C11.incipit	…
ltx/en_us_goadedes/tr.d021:trMA.Ode3C11.melody	@ltx/en_us_goadedes/he.h.m8:heHE.OukEstinAgios.name
ltx/en_us_goadedes/tr.d021:trMA.Ode3C11.mode	@ltx/en_us_goadedes/miscellanea:misc.Mode8
ltx/en_us_goadedes/tr.d021:trMA.Ode3C11.ode	@ltx/en_us_goadedes/miscellanea:misc.Ode3
ltx/en_us_goadedes/tr.d021:trMA.Ode3C11.text	
ltx/en_us_goadedes/tr.d021:trMA.Ode3C12.incipit	…
ltx/en_us_goadedes/tr.d021:trMA.Ode3C12.melody	@ltx/en_us_goadedes/he.h.m8:heHE.OukEstinAgios.name
ltx/en_us_goadedes/tr.d021:trMA.Ode3C12.mode	@ltx/en_us_goadedes/miscellanea:misc.Mode8
ltx/en_us_goadedes/tr.d021:trMA.Ode3C12.ode	@ltx/en_us_goadedes/miscellanea:misc.Ode3
ltx/en_us_goadedes/tr.d021:trMA.Ode3C12.text	
ltx/en_us_goadedes/tr.d021:trMA.Ode3C13.incipit	…
ltx/en_us_goadedes/tr.d021:trMA.Ode3C13.melody	@ltx/en_us_goadedes/he.h.m8:heHE.OukEstinAgios.name
ltx/en_us_goadedes/tr.d021:trMA.Ode3C13.mode	@ltx/en_us_goadedes/miscellanea:misc.Mode8
ltx/en_us_goadedes/tr.d021:trMA.Ode3C13.ode	@ltx/en_us_goadedes/miscellanea:misc.Ode3
ltx/en_us_goadedes/tr.d021:trMA.Ode3C13.text	
ltx/en_us_goadedes/tr.d021:trMA.Ode3C14.incipit	…
ltx/en_us_goadedes/tr.d021:trMA.Ode3C14.melody	@ltx/en_us_goadedes/he.h.m8:heHE.OukEstinAgios.name
ltx/en_us_goadedes/tr.d021:trMA.Ode3C14.mode	@ltx/en_us_goadedes/miscellanea:misc.Mode8
ltx/en_us_goadedes/tr.d021:trMA.Ode3C14.ode	@ltx/en_us_goadedes/miscellanea:misc.Ode3
ltx/en_us_goadedes/tr.d021:trMA.Ode3C14.text	
ltx/en_us_goadedes/tr.d021:trMA.Ode3C15.incipit	…
ltx/en_us_goadedes/tr.d021:trMA.Ode3C15.melody	@ltx/en_us_goadedes/he.h.m8:heHE.OukEstinAgios.name
ltx/en_us_goadedes/tr.d021:trMA.Ode3C15.mode	@ltx/en_us_goadedes/miscellanea:misc.Mode8
ltx/en_us_goadedes/tr.d021:trMA.Ode3C15.ode	@ltx/en_us_goadedes/miscellanea:misc.Ode3
ltx/en_us_goadedes/tr.d021:trMA.Ode3C15.text	
ltx/en_us_goadedes/tr.d021:trMA.Ode3C16.incipit	…
ltx/en_us_goadedes/tr.d021:trMA.Ode3C16.melody	@ltx/en_us_goadedes/he.h.m8:heHE.OukEstinAgios.name
ltx/en_us_goadedes/tr.d021:trMA.Ode3C16.mode	@ltx/en_us_goadedes/miscellanea:misc.Mode8
ltx/en_us_goadedes/tr.d021:trMA.Ode3C16.ode	@ltx/en_us_goadedes/miscellanea:misc.Ode3
ltx/en_us_goadedes/tr.d021:trMA.Ode3C16.text	
ltx/en_us_goadedes/tr.d021:trMA.Ode3C1H.greekmelody	@ltx/en_us_goadedes/he.h.m8:heHE.OukEstinAgios.greekname
ltx/en_us_goadedes/tr.d021:trMA.Ode3C1H.incipit	@ltx/en_us_goadedes/he.h.m8:heHE.OukEstinAgios.incipit
ltx/en_us_goadedes/tr.d021:trMA.Ode3C1H.melody	@ltx/en_us_goadedes/he.h.m8:heHE.OukEstinAgios.melody
ltx/en_us_goadedes/tr.d021:trMA.Ode3C1H.mode	@ltx/en_us_goadedes/miscellanea:misc.Mode8
ltx/en_us_goadedes/tr.d021:trMA.Ode3C1H.ode	@ltx/en_us_goadedes/miscellanea:misc.Ode3
ltx/en_us_goadedes/tr.d021:trMA.Ode3C1H.text	@ltx/en_us_goadedes/he.h.m8:heHE.OukEstinAgios.text
ltx/en_us_goadedes/tr.d021:trMA.Ode3C1M.incipit	…
ltx/en_us_goadedes/tr.d021:trMA.Ode3C1M.melody	@ltx/en_us_goadedes/he.h.m8:heHE.OukEstinAgios.name
ltx/en_us_goadedes/tr.d021:trMA.Ode3C1M.mode	@ltx/en_us_goadedes/miscellanea:misc.Mode8
ltx/en_us_goadedes/tr.d021:trMA.Ode3C1M.ode	@ltx/en_us_goadedes/miscellanea:misc.Ode3
ltx/en_us_goadedes/tr.d021:trMA.Ode3C1M.text	
ltx/en_us_goadedes/tr.d021:trMA.Ode3C1T.incipit	…
ltx/en_us_goadedes/tr.d021:trMA.Ode3C1T.melody	@ltx/en_us_goadedes/he.h.m8:heHE.OukEstinAgios.name
ltx/en_us_goadedes/tr.d021:trMA.Ode3C1T.mode	@ltx/en_us_goadedes/miscellanea:misc.Mode8
ltx/en_us_goadedes/tr.d021:trMA.Ode3C1T.ode	@ltx/en_us_goadedes/miscellanea:misc.Ode3
ltx/en_us_goadedes/tr.d021:trMA.Ode3C1T.text	
ltx/en_us_goadedes/tr.d021:trMA.Ode3C1Tr.incipit	…
ltx/en_us_goadedes/tr.d021:trMA.Ode3C1Tr.melody	@ltx/en_us_goadedes/he.h.m8:heHE.OukEstinAgios.name
ltx/en_us_goadedes/tr.d021:trMA.Ode3C1Tr.mode	@ltx/en_us_goadedes/miscellanea:misc.Mode8
ltx/en_us_goadedes/tr.d021:trMA.Ode3C1Tr.ode	@ltx/en_us_goadedes/miscellanea:misc.Ode3
ltx/en_us_goadedes/tr.d021:trMA.Ode3C1Tr.text	
ltx/en_us_goadedes/tr.d021:trMA.Ode3K.incipit	@ltx/en_us_goadedes/he.h.m8:heHE.OukEstinAgios.incipit
ltx/en_us_goadedes/tr.d021:trMA.Ode3K.melody	@ltx/en_us_goadedes/he.h.m8:heHE.OukEstinAgios.melody
ltx/en_us_goadedes/tr.d021:trMA.Ode3K.mode	@ltx/en_us_goadedes/miscellanea:misc.Mode8
ltx/en_us_goadedes/tr.d021:trMA.Ode3K.ode	@ltx/en_us_goadedes/miscellanea:misc.Ode3
ltx/en_us_goadedes/tr.d021:trMA.Ode3K.text	@ltx/en_us_goadedes/he.h.m8:heHE.OukEstinAgios.text
ltx/en_us_goadedes/tr.d021:trMA.Ode3Kathisma1.greekmelody	@ltx/en_us_goadedes/he.a.m8:heAU.TinSofianKaiLogon.greekname
ltx/en_us_goadedes/tr.d021:trMA.Ode3Kathisma1.incipit	…
ltx/en_us_goadedes/tr.d021:trMA.Ode3Kathisma1.melody	@ltx/en_us_goadedes/he.a.m8:heAU.TinSofianKaiLogon.name
ltx/en_us_goadedes/tr.d021:trMA.Ode3Kathisma1.mode	@ltx/en_us_goadedes/miscellanea:misc.Mode8
ltx/en_us_goadedes/tr.d021:trMA.Ode3Kathisma1.text	
ltx/en_us_goadedes/tr.d021:trMA.Ode3Kathisma2.greekmelody	@ltx/en_us_goadedes/he.a.m8:heAU.TinSofianKaiLogon.greekname
ltx/en_us_goadedes/tr.d021:trMA.Ode3Kathisma2.incipit	…
ltx/en_us_goadedes/tr.d021:trMA.Ode3Kathisma2.melody	@ltx/en_us_goadedes/he.a.m8:heAU.TinSofianKaiLogon.name
ltx/en_us_goadedes/tr.d021:trMA.Ode3Kathisma2.mode	@ltx/en_us_goadedes/miscellanea:misc.Mode8
ltx/en_us_goadedes/tr.d021:trMA.Ode3Kathisma2.text	
ltx/en_us_goadedes/tr.d021:trMA.Ode3Kathisma3.greekmelody	@ltx/en_us_goadedes/he.a.m8:heAU.TinSofianKaiLogon.greekname
ltx/en_us_goadedes/tr.d021:trMA.Ode3Kathisma3.incipit	…
ltx/en_us_goadedes/tr.d021:trMA.Ode3Kathisma3.melody	@ltx/en_us_goadedes/he.a.m8:heAU.TinSofianKaiLogon.name
ltx/en_us_goadedes/tr.d021:trMA.Ode3Kathisma3.mode	@ltx/en_us_goadedes/miscellanea:misc.Mode8
ltx/en_us_goadedes/tr.d021:trMA.Ode3Kathisma3.text	
ltx/en_us_goadedes/tr.d021:trMA.Ode4C11.greekmelody	@ltx/en_us_goadedes/he.h.m8:heHE.ExOrousKataskiou.greekname
ltx/en_us_goadedes/tr.d021:trMA.Ode4C11.incipit	…
ltx/en_us_goadedes/tr.d021:trMA.Ode4C11.melody	@ltx/en_us_goadedes/he.h.m8:heHE.ExOrousKataskiou.name
ltx/en_us_goadedes/tr.d021:trMA.Ode4C11.mode	@ltx/en_us_goadedes/miscellanea:misc.Mode8
ltx/en_us_goadedes/tr.d021:trMA.Ode4C11.ode	@ltx/en_us_goadedes/miscellanea:misc.Ode4
ltx/en_us_goadedes/tr.d021:trMA.Ode4C11.text	
ltx/en_us_goadedes/tr.d021:trMA.Ode4C12.incipit	…
ltx/en_us_goadedes/tr.d021:trMA.Ode4C12.melody	@ltx/en_us_goadedes/he.h.m8:heHE.ExOrousKataskiou.name
ltx/en_us_goadedes/tr.d021:trMA.Ode4C12.mode	@ltx/en_us_goadedes/miscellanea:misc.Mode8
ltx/en_us_goadedes/tr.d021:trMA.Ode4C12.ode	@ltx/en_us_goadedes/miscellanea:misc.Ode4
ltx/en_us_goadedes/tr.d021:trMA.Ode4C12.text	
ltx/en_us_goadedes/tr.d021:trMA.Ode4C13.incipit	…
ltx/en_us_goadedes/tr.d021:trMA.Ode4C13.melody	@ltx/en_us_goadedes/he.h.m8:heHE.ExOrousKataskiou.name
ltx/en_us_goadedes/tr.d021:trMA.Ode4C13.mode	@ltx/en_us_goadedes/miscellanea:misc.Mode8
ltx/en_us_goadedes/tr.d021:trMA.Ode4C13.ode	@ltx/en_us_goadedes/miscellanea:misc.Ode4
ltx/en_us_goadedes/tr.d021:trMA.Ode4C13.text	
ltx/en_us_goadedes/tr.d021:trMA.Ode4C14.incipit	…
ltx/en_us_goadedes/tr.d021:trMA.Ode4C14.melody	@ltx/en_us_goadedes/he.h.m8:heHE.ExOrousKataskiou.name
ltx/en_us_goadedes/tr.d021:trMA.Ode4C14.mode	@ltx/en_us_goadedes/miscellanea:misc.Mode8
ltx/en_us_goadedes/tr.d021:trMA.Ode4C14.ode	@ltx/en_us_goadedes/miscellanea:misc.Ode4
ltx/en_us_goadedes/tr.d021:trMA.Ode4C14.text	
ltx/en_us_goadedes/tr.d021:trMA.Ode4C15.incipit	…
ltx/en_us_goadedes/tr.d021:trMA.Ode4C15.melody	@ltx/en_us_goadedes/he.h.m8:heHE.ExOrousKataskiou.name
ltx/en_us_goadedes/tr.d021:trMA.Ode4C15.mode	@ltx/en_us_goadedes/miscellanea:misc.Mode8
ltx/en_us_goadedes/tr.d021:trMA.Ode4C15.ode	@ltx/en_us_goadedes/miscellanea:misc.Ode4
ltx/en_us_goadedes/tr.d021:trMA.Ode4C15.text	
ltx/en_us_goadedes/tr.d021:trMA.Ode4C16.incipit	…
ltx/en_us_goadedes/tr.d021:trMA.Ode4C16.melody	@ltx/en_us_goadedes/he.h.m8:heHE.ExOrousKataskiou.name
ltx/en_us_goadedes/tr.d021:trMA.Ode4C16.mode	@ltx/en_us_goadedes/miscellanea:misc.Mode8
ltx/en_us_goadedes/tr.d021:trMA.Ode4C16.ode	@ltx/en_us_goadedes/miscellanea:misc.Ode4
ltx/en_us_goadedes/tr.d021:trMA.Ode4C16.text	
ltx/en_us_goadedes/tr.d021:trMA.Ode4C1H.greekmelody	@ltx/en_us_goadedes/he.h.m8:heHE.ExOrousKataskiou.greekname
ltx/en_us_goadedes/tr.d021:trMA.Ode4C1H.incipit	@ltx/en_us_goadedes/he.h.m8:heHE.ExOrousKataskiou.incipit
ltx/en_us_goadedes/tr.d021:trMA.Ode4C1H.melody	@ltx/en_us_goadedes/he.h.m8:heHE.ExOrousKataskiou.melody
ltx/en_us_goadedes/tr.d021:trMA.Ode4C1H.mode	@ltx/en_us_goadedes/miscellanea:misc.Mode8
ltx/en_us_goadedes/tr.d021:trMA.Ode4C1H.ode	@ltx/en_us_goadedes/miscellanea:misc.Ode4
ltx/en_us_goadedes/tr.d021:trMA.Ode4C1H.text	@ltx/en_us_goadedes/he.h.m8:heHE.ExOrousKataskiou.text
ltx/en_us_goadedes/tr.d021:trMA.Ode4C1M.incipit	…
ltx/en_us_goadedes/tr.d021:trMA.Ode4C1M.melody	@ltx/en_us_goadedes/he.h.m8:heHE.ExOrousKataskiou.name
ltx/en_us_goadedes/tr.d021:trMA.Ode4C1M.mode	@ltx/en_us_goadedes/miscellanea:misc.Mode8
ltx/en_us_goadedes/tr.d021:trMA.Ode4C1M.ode	@ltx/en_us_goadedes/miscellanea:misc.Ode4
ltx/en_us_goadedes/tr.d021:trMA.Ode4C1M.text	
ltx/en_us_goadedes/tr.d021:trMA.Ode4C1T.incipit	…
ltx/en_us_goadedes/tr.d021:trMA.Ode4C1T.melody	@ltx/en_us_goadedes/he.h.m8:heHE.ExOrousKataskiou.name
ltx/en_us_goadedes/tr.d021:trMA.Ode4C1T.mode	@ltx/en_us_goadedes/miscellanea:misc.Mode8
ltx/en_us_goadedes/tr.d021:trMA.Ode4C1T.ode	@ltx/en_us_goadedes/miscellanea:misc.Ode4
ltx/en_us_goadedes/tr.d021:trMA.Ode4C1T.text	
ltx/en_us_goadedes/tr.d021:trMA.Ode4C1Tr.incipit	…
ltx/en_us_goadedes/tr.d021:trMA.Ode4C1Tr.melody	@ltx/en_us_goadedes/he.h.m8:heHE.ExOrousKataskiou.name
ltx/en_us_goadedes/tr.d021:trMA.Ode4C1Tr.mode	@ltx/en_us_goadedes/miscellanea:misc.Mode8
ltx/en_us_goadedes/tr.d021:trMA.Ode4C1Tr.ode	@ltx/en_us_goadedes/miscellanea:misc.Ode4
ltx/en_us_goadedes/tr.d021:trMA.Ode4C1Tr.text	
ltx/en_us_goadedes/tr.d021:trMA.Ode4K.incipit	@ltx/en_us_goadedes/he.h.m8:heHE.ExOrousKataskiou.incipit
ltx/en_us_goadedes/tr.d021:trMA.Ode4K.melody	@ltx/en_us_goadedes/he.h.m8:heHE.ExOrousKataskiou.melody
ltx/en_us_goadedes/tr.d021:trMA.Ode4K.mode	@ltx/en_us_goadedes/miscellanea:misc.Mode8
ltx/en_us_goadedes/tr.d021:trMA.Ode4K.ode	@ltx/en_us_goadedes/miscellanea:misc.Ode4
ltx/en_us_goadedes/tr.d021:trMA.Ode4K.text	@ltx/en_us_goadedes/he.h.m8:heHE.ExOrousKataskiou.text
ltx/en_us_goadedes/tr.d021:trMA.Ode5C11.greekmelody	@ltx/en_us_goadedes/he.h.m8:heHE.TisTonPathonMeAchlyos.greekname
ltx/en_us_goadedes/tr.d021:trMA.Ode5C11.incipit	…
ltx/en_us_goadedes/tr.d021:trMA.Ode5C11.melody	@ltx/en_us_goadedes/he.h.m8:heHE.TisTonPathonMeAchlyos.name
ltx/en_us_goadedes/tr.d021:trMA.Ode5C11.mode	@ltx/en_us_goadedes/miscellanea:misc.Mode8
ltx/en_us_goadedes/tr.d021:trMA.Ode5C11.ode	@ltx/en_us_goadedes/miscellanea:misc.Ode5
ltx/en_us_goadedes/tr.d021:trMA.Ode5C11.text	
ltx/en_us_goadedes/tr.d021:trMA.Ode5C12.incipit	…
ltx/en_us_goadedes/tr.d021:trMA.Ode5C12.melody	@ltx/en_us_goadedes/he.h.m8:heHE.TisTonPathonMeAchlyos.name
ltx/en_us_goadedes/tr.d021:trMA.Ode5C12.mode	@ltx/en_us_goadedes/miscellanea:misc.Mode8
ltx/en_us_goadedes/tr.d021:trMA.Ode5C12.ode	@ltx/en_us_goadedes/miscellanea:misc.Ode5
ltx/en_us_goadedes/tr.d021:trMA.Ode5C12.text	
ltx/en_us_goadedes/tr.d021:trMA.Ode5C13.incipit	…
ltx/en_us_goadedes/tr.d021:trMA.Ode5C13.melody	@ltx/en_us_goadedes/he.h.m8:heHE.TisTonPathonMeAchlyos.name
ltx/en_us_goadedes/tr.d021:trMA.Ode5C13.mode	@ltx/en_us_goadedes/miscellanea:misc.Mode8
ltx/en_us_goadedes/tr.d021:trMA.Ode5C13.ode	@ltx/en_us_goadedes/miscellanea:misc.Ode5
ltx/en_us_goadedes/tr.d021:trMA.Ode5C13.text	
ltx/en_us_goadedes/tr.d021:trMA.Ode5C14.incipit	…
ltx/en_us_goadedes/tr.d021:trMA.Ode5C14.melody	@ltx/en_us_goadedes/he.h.m8:heHE.TisTonPathonMeAchlyos.name
ltx/en_us_goadedes/tr.d021:trMA.Ode5C14.mode	@ltx/en_us_goadedes/miscellanea:misc.Mode8
ltx/en_us_goadedes/tr.d021:trMA.Ode5C14.ode	@ltx/en_us_goadedes/miscellanea:misc.Ode5
ltx/en_us_goadedes/tr.d021:trMA.Ode5C14.text	
ltx/en_us_goadedes/tr.d021:trMA.Ode5C15.incipit	…
ltx/en_us_goadedes/tr.d021:trMA.Ode5C15.melody	@ltx/en_us_goadedes/he.h.m8:heHE.TisTonPathonMeAchlyos.name
ltx/en_us_goadedes/tr.d021:trMA.Ode5C15.mode	@ltx/en_us_goadedes/miscellanea:misc.Mode8
ltx/en_us_goadedes/tr.d021:trMA.Ode5C15.ode	@ltx/en_us_goadedes/miscellanea:misc.Ode5
ltx/en_us_goadedes/tr.d021:trMA.Ode5C15.text	
ltx/en_us_goadedes/tr.d021:trMA.Ode5C16.incipit	…
ltx/en_us_goadedes/tr.d021:trMA.Ode5C16.melody	@ltx/en_us_goadedes/he.h.m8:heHE.TisTonPathonMeAchlyos.name
ltx/en_us_goadedes/tr.d021:trMA.Ode5C16.mode	@ltx/en_us_goadedes/miscellanea:misc.Mode8
ltx/en_us_goadedes/tr.d021:trMA.Ode5C16.ode	@ltx/en_us_goadedes/miscellanea:misc.Ode5
ltx/en_us_goadedes/tr.d021:trMA.Ode5C16.text	
ltx/en_us_goadedes/tr.d021:trMA.Ode5C1H.greekmelody	@ltx/en_us_goadedes/he.h.m8:heHE.TisTonPathonMeAchlyos.greekname
ltx/en_us_goadedes/tr.d021:trMA.Ode5C1H.incipit	@ltx/en_us_goadedes/he.h.m8:heHE.TisTonPathonMeAchlyos.incipit
ltx/en_us_goadedes/tr.d021:trMA.Ode5C1H.melody	@ltx/en_us_goadedes/he.h.m8:heHE.TisTonPathonMeAchlyos.melody
ltx/en_us_goadedes/tr.d021:trMA.Ode5C1H.mode	@ltx/en_us_goadedes/miscellanea:misc.Mode8
ltx/en_us_goadedes/tr.d021:trMA.Ode5C1H.ode	@ltx/en_us_goadedes/miscellanea:misc.Ode5
ltx/en_us_goadedes/tr.d021:trMA.Ode5C1H.text	@ltx/en_us_goadedes/he.h.m8:heHE.TisTonPathonMeAchlyos.text
ltx/en_us_goadedes/tr.d021:trMA.Ode5C1M.incipit	…
ltx/en_us_goadedes/tr.d021:trMA.Ode5C1M.melody	@ltx/en_us_goadedes/he.h.m8:heHE.TisTonPathonMeAchlyos.name
ltx/en_us_goadedes/tr.d021:trMA.Ode5C1M.mode	@ltx/en_us_goadedes/miscellanea:misc.Mode8
ltx/en_us_goadedes/tr.d021:trMA.Ode5C1M.ode	@ltx/en_us_goadedes/miscellanea:misc.Ode5
ltx/en_us_goadedes/tr.d021:trMA.Ode5C1M.text	
ltx/en_us_goadedes/tr.d021:trMA.Ode5C1T.incipit	…
ltx/en_us_goadedes/tr.d021:trMA.Ode5C1T.melody	@ltx/en_us_goadedes/he.h.m8:heHE.TisTonPathonMeAchlyos.name
ltx/en_us_goadedes/tr.d021:trMA.Ode5C1T.mode	@ltx/en_us_goadedes/miscellanea:misc.Mode8
ltx/en_us_goadedes/tr.d021:trMA.Ode5C1T.ode	@ltx/en_us_goadedes/miscellanea:misc.Ode5
ltx/en_us_goadedes/tr.d021:trMA.Ode5C1T.text	
ltx/en_us_goadedes/tr.d021:trMA.Ode5C1Tr.incipit	…
ltx/en_us_goadedes/tr.d021:trMA.Ode5C1Tr.melody	@ltx/en_us_goadedes/he.h.m8:heHE.TisTonPathonMeAchlyos.name
ltx/en_us_goadedes/tr.d021:trMA.Ode5C1Tr.mode	@ltx/en_us_goadedes/miscellanea:misc.Mode8
ltx/en_us_goadedes/tr.d021:trMA.Ode5C1Tr.ode	@ltx/en_us_goadedes/miscellanea:misc.Ode5
ltx/en_us_goadedes/tr.d021:trMA.Ode5C1Tr.text	
ltx/en_us_goadedes/tr.d021:trMA.Ode5K.incipit	@ltx/en_us_goadedes/he.h.m8:heHE.TisTonPathonMeAchlyos.incipit
ltx/en_us_goadedes/tr.d021:trMA.Ode5K.melody	@ltx/en_us_goadedes/he.h.m8:heHE.TisTonPathonMeAchlyos.melody
ltx/en_us_goadedes/tr.d021:trMA.Ode5K.mode	@ltx/en_us_goadedes/miscellanea:misc.Mode8
ltx/en_us_goadedes/tr.d021:trMA.Ode5K.ode	@ltx/en_us_goadedes/miscellanea:misc.Ode5
ltx/en_us_goadedes/tr.d021:trMA.Ode5K.text	@ltx/en_us_goadedes/he.h.m8:heHE.TisTonPathonMeAchlyos.text
ltx/en_us_goadedes/tr.d021:trMA.Ode6C11.greekmelody	@ltx/en_us_goadedes/he.h.m8:heHE.SynechomenonDexaiMe.greekname
ltx/en_us_goadedes/tr.d021:trMA.Ode6C11.incipit	…
ltx/en_us_goadedes/tr.d021:trMA.Ode6C11.melody	@ltx/en_us_goadedes/he.h.m8:heHE.SynechomenonDexaiMe.name
ltx/en_us_goadedes/tr.d021:trMA.Ode6C11.mode	@ltx/en_us_goadedes/miscellanea:misc.Mode8
ltx/en_us_goadedes/tr.d021:trMA.Ode6C11.ode	@ltx/en_us_goadedes/miscellanea:misc.Ode6
ltx/en_us_goadedes/tr.d021:trMA.Ode6C11.text	
ltx/en_us_goadedes/tr.d021:trMA.Ode6C12.incipit	…
ltx/en_us_goadedes/tr.d021:trMA.Ode6C12.melody	@ltx/en_us_goadedes/he.h.m8:heHE.SynechomenonDexaiMe.name
ltx/en_us_goadedes/tr.d021:trMA.Ode6C12.mode	@ltx/en_us_goadedes/miscellanea:misc.Mode8
ltx/en_us_goadedes/tr.d021:trMA.Ode6C12.ode	@ltx/en_us_goadedes/miscellanea:misc.Ode6
ltx/en_us_goadedes/tr.d021:trMA.Ode6C12.text	
ltx/en_us_goadedes/tr.d021:trMA.Ode6C13.incipit	…
ltx/en_us_goadedes/tr.d021:trMA.Ode6C13.melody	@ltx/en_us_goadedes/he.h.m8:heHE.SynechomenonDexaiMe.name
ltx/en_us_goadedes/tr.d021:trMA.Ode6C13.mode	@ltx/en_us_goadedes/miscellanea:misc.Mode8
ltx/en_us_goadedes/tr.d021:trMA.Ode6C13.ode	@ltx/en_us_goadedes/miscellanea:misc.Ode6
ltx/en_us_goadedes/tr.d021:trMA.Ode6C13.text	
ltx/en_us_goadedes/tr.d021:trMA.Ode6C14.incipit	…
ltx/en_us_goadedes/tr.d021:trMA.Ode6C14.melody	@ltx/en_us_goadedes/he.h.m8:heHE.SynechomenonDexaiMe.name
ltx/en_us_goadedes/tr.d021:trMA.Ode6C14.mode	@ltx/en_us_goadedes/miscellanea:misc.Mode8
ltx/en_us_goadedes/tr.d021:trMA.Ode6C14.ode	@ltx/en_us_goadedes/miscellanea:misc.Ode6
ltx/en_us_goadedes/tr.d021:trMA.Ode6C14.text	
ltx/en_us_goadedes/tr.d021:trMA.Ode6C15.incipit	…
ltx/en_us_goadedes/tr.d021:trMA.Ode6C15.melody	@ltx/en_us_goadedes/he.h.m8:heHE.SynechomenonDexaiMe.name
ltx/en_us_goadedes/tr.d021:trMA.Ode6C15.mode	@ltx/en_us_goadedes/miscellanea:misc.Mode8
ltx/en_us_goadedes/tr.d021:trMA.Ode6C15.ode	@ltx/en_us_goadedes/miscellanea:misc.Ode6
ltx/en_us_goadedes/tr.d021:trMA.Ode6C15.text	
ltx/en_us_goadedes/tr.d021:trMA.Ode6C16.incipit	…
ltx/en_us_goadedes/tr.d021:trMA.Ode6C16.melody	@ltx/en_us_goadedes/he.h.m8:heHE.SynechomenonDexaiMe.name
ltx/en_us_goadedes/tr.d021:trMA.Ode6C16.mode	@ltx/en_us_goadedes/miscellanea:misc.Mode8
ltx/en_us_goadedes/tr.d021:trMA.Ode6C16.ode	@ltx/en_us_goadedes/miscellanea:misc.Ode6
ltx/en_us_goadedes/tr.d021:trMA.Ode6C16.text	
ltx/en_us_goadedes/tr.d021:trMA.Ode6C1H.greekmelody	@ltx/en_us_goadedes/he.h.m8:heHE.SynechomenonDexaiMe.greekname
ltx/en_us_goadedes/tr.d021:trMA.Ode6C1H.incipit	@ltx/en_us_goadedes/he.h.m8:heHE.SynechomenonDexaiMe.incipit
ltx/en_us_goadedes/tr.d021:trMA.Ode6C1H.melody	@ltx/en_us_goadedes/he.h.m8:heHE.SynechomenonDexaiMe.melody
ltx/en_us_goadedes/tr.d021:trMA.Ode6C1H.mode	@ltx/en_us_goadedes/miscellanea:misc.Mode8
ltx/en_us_goadedes/tr.d021:trMA.Ode6C1H.ode	@ltx/en_us_goadedes/miscellanea:misc.Ode6
ltx/en_us_goadedes/tr.d021:trMA.Ode6C1H.text	@ltx/en_us_goadedes/he.h.m8:heHE.SynechomenonDexaiMe.text
ltx/en_us_goadedes/tr.d021:trMA.Ode6C1M.incipit	…
ltx/en_us_goadedes/tr.d021:trMA.Ode6C1M.melody	@ltx/en_us_goadedes/he.h.m8:heHE.SynechomenonDexaiMe.name
ltx/en_us_goadedes/tr.d021:trMA.Ode6C1M.mode	@ltx/en_us_goadedes/miscellanea:misc.Mode8
ltx/en_us_goadedes/tr.d021:trMA.Ode6C1M.ode	@ltx/en_us_goadedes/miscellanea:misc.Ode6
ltx/en_us_goadedes/tr.d021:trMA.Ode6C1M.text	
ltx/en_us_goadedes/tr.d021:trMA.Ode6C1T.incipit	…
ltx/en_us_goadedes/tr.d021:trMA.Ode6C1T.melody	@ltx/en_us_goadedes/he.h.m8:heHE.SynechomenonDexaiMe.name
ltx/en_us_goadedes/tr.d021:trMA.Ode6C1T.mode	@ltx/en_us_goadedes/miscellanea:misc.Mode8
ltx/en_us_goadedes/tr.d021:trMA.Ode6C1T.ode	@ltx/en_us_goadedes/miscellanea:misc.Ode6
ltx/en_us_goadedes/tr.d021:trMA.Ode6C1T.text	
ltx/en_us_goadedes/tr.d021:trMA.Ode6C1Tr.incipit	…
ltx/en_us_goadedes/tr.d021:trMA.Ode6C1Tr.melody	@ltx/en_us_goadedes/he.h.m8:heHE.SynechomenonDexaiMe.name
ltx/en_us_goadedes/tr.d021:trMA.Ode6C1Tr.mode	@ltx/en_us_goadedes/miscellanea:misc.Mode8
ltx/en_us_goadedes/tr.d021:trMA.Ode6C1Tr.ode	@ltx/en_us_goadedes/miscellanea:misc.Ode6
ltx/en_us_goadedes/tr.d021:trMA.Ode6C1Tr.text	
ltx/en_us_goadedes/tr.d021:trMA.Ode6K.incipit	@ltx/en_us_goadedes/he.h.m8:heHE.SynechomenonDexaiMe.incipit
ltx/en_us_goadedes/tr.d021:trMA.Ode6K.melody	@ltx/en_us_goadedes/he.h.m8:heHE.SynechomenonDexaiMe.melody
ltx/en_us_goadedes/tr.d021:trMA.Ode6K.mode	@ltx/en_us_goadedes/miscellanea:misc.Mode8
ltx/en_us_goadedes/tr.d021:trMA.Ode6K.ode	@ltx/en_us_goadedes/miscellanea:misc.Ode6
ltx/en_us_goadedes/tr.d021:trMA.Ode6K.text	@ltx/en_us_goadedes/he.h.m8:heHE.SynechomenonDexaiMe.text
ltx/en_us_goadedes/tr.d021:trMA.Ode7C11.greekmelody	@ltx/en_us_goadedes/he.h.m8:heHE.OTousPaidasDrosisas.greekname
ltx/en_us_goadedes/tr.d021:trMA.Ode7C11.incipit	…
ltx/en_us_goadedes/tr.d021:trMA.Ode7C11.melody	@ltx/en_us_goadedes/he.h.m8:heHE.OTousPaidasDrosisas.name
ltx/en_us_goadedes/tr.d021:trMA.Ode7C11.mode	@ltx/en_us_goadedes/miscellanea:misc.Mode8
ltx/en_us_goadedes/tr.d021:trMA.Ode7C11.ode	@ltx/en_us_goadedes/miscellanea:misc.Ode7
ltx/en_us_goadedes/tr.d021:trMA.Ode7C11.text	
ltx/en_us_goadedes/tr.d021:trMA.Ode7C12.incipit	…
ltx/en_us_goadedes/tr.d021:trMA.Ode7C12.melody	@ltx/en_us_goadedes/he.h.m8:heHE.OTousPaidasDrosisas.name
ltx/en_us_goadedes/tr.d021:trMA.Ode7C12.mode	@ltx/en_us_goadedes/miscellanea:misc.Mode8
ltx/en_us_goadedes/tr.d021:trMA.Ode7C12.ode	@ltx/en_us_goadedes/miscellanea:misc.Ode7
ltx/en_us_goadedes/tr.d021:trMA.Ode7C12.text	
ltx/en_us_goadedes/tr.d021:trMA.Ode7C13.incipit	…
ltx/en_us_goadedes/tr.d021:trMA.Ode7C13.melody	@ltx/en_us_goadedes/he.h.m8:heHE.OTousPaidasDrosisas.name
ltx/en_us_goadedes/tr.d021:trMA.Ode7C13.mode	@ltx/en_us_goadedes/miscellanea:misc.Mode8
ltx/en_us_goadedes/tr.d021:trMA.Ode7C13.ode	@ltx/en_us_goadedes/miscellanea:misc.Ode7
ltx/en_us_goadedes/tr.d021:trMA.Ode7C13.text	
ltx/en_us_goadedes/tr.d021:trMA.Ode7C14.incipit	…
ltx/en_us_goadedes/tr.d021:trMA.Ode7C14.melody	@ltx/en_us_goadedes/he.h.m8:heHE.OTousPaidasDrosisas.name
ltx/en_us_goadedes/tr.d021:trMA.Ode7C14.mode	@ltx/en_us_goadedes/miscellanea:misc.Mode8
ltx/en_us_goadedes/tr.d021:trMA.Ode7C14.ode	@ltx/en_us_goadedes/miscellanea:misc.Ode7
ltx/en_us_goadedes/tr.d021:trMA.Ode7C14.text	
ltx/en_us_goadedes/tr.d021:trMA.Ode7C15.incipit	…
ltx/en_us_goadedes/tr.d021:trMA.Ode7C15.melody	@ltx/en_us_goadedes/he.h.m8:heHE.OTousPaidasDrosisas.name
ltx/en_us_goadedes/tr.d021:trMA.Ode7C15.mode	@ltx/en_us_goadedes/miscellanea:misc.Mode8
ltx/en_us_goadedes/tr.d021:trMA.Ode7C15.ode	@ltx/en_us_goadedes/miscellanea:misc.Ode7
ltx/en_us_goadedes/tr.d021:trMA.Ode7C15.text	
ltx/en_us_goadedes/tr.d021:trMA.Ode7C16.incipit	…
ltx/en_us_goadedes/tr.d021:trMA.Ode7C16.melody	@ltx/en_us_goadedes/he.h.m8:heHE.OTousPaidasDrosisas.name
ltx/en_us_goadedes/tr.d021:trMA.Ode7C16.mode	@ltx/en_us_goadedes/miscellanea:misc.Mode8
ltx/en_us_goadedes/tr.d021:trMA.Ode7C16.ode	@ltx/en_us_goadedes/miscellanea:misc.Ode7
ltx/en_us_goadedes/tr.d021:trMA.Ode7C16.text	
ltx/en_us_goadedes/tr.d021:trMA.Ode7C17.incipit	…
ltx/en_us_goadedes/tr.d021:trMA.Ode7C17.melody	@ltx/en_us_goadedes/he.h.m8:heHE.OTousPaidasDrosisas.name
ltx/en_us_goadedes/tr.d021:trMA.Ode7C17.mode	@ltx/en_us_goadedes/miscellanea:misc.Mode8
ltx/en_us_goadedes/tr.d021:trMA.Ode7C17.ode	@ltx/en_us_goadedes/miscellanea:misc.Ode7
ltx/en_us_goadedes/tr.d021:trMA.Ode7C17.text	
ltx/en_us_goadedes/tr.d021:trMA.Ode7C1H.greekmelody	@ltx/en_us_goadedes/he.h.m8:heHE.OTousPaidasDrosisas.greekname
ltx/en_us_goadedes/tr.d021:trMA.Ode7C1H.incipit	@ltx/en_us_goadedes/he.h.m8:heHE.OTousPaidasDrosisas.incipit
ltx/en_us_goadedes/tr.d021:trMA.Ode7C1H.melody	@ltx/en_us_goadedes/he.h.m8:heHE.OTousPaidasDrosisas.melody
ltx/en_us_goadedes/tr.d021:trMA.Ode7C1H.mode	@ltx/en_us_goadedes/miscellanea:misc.Mode8
ltx/en_us_goadedes/tr.d021:trMA.Ode7C1H.ode	@ltx/en_us_goadedes/miscellanea:misc.Ode7
ltx/en_us_goadedes/tr.d021:trMA.Ode7C1H.text	@ltx/en_us_goadedes/he.h.m8:heHE.OTousPaidasDrosisas.text
ltx/en_us_goadedes/tr.d021:trMA.Ode7C1M.incipit	…
ltx/en_us_goadedes/tr.d021:trMA.Ode7C1M.melody	@ltx/en_us_goadedes/he.h.m8:heHE.OTousPaidasDrosisas.name
ltx/en_us_goadedes/tr.d021:trMA.Ode7C1M.mode	@ltx/en_us_goadedes/miscellanea:misc.Mode8
ltx/en_us_goadedes/tr.d021:trMA.Ode7C1M.ode	@ltx/en_us_goadedes/miscellanea:misc.Ode7
ltx/en_us_goadedes/tr.d021:trMA.Ode7C1M.text	
ltx/en_us_goadedes/tr.d021:trMA.Ode7C1T.incipit	…
ltx/en_us_goadedes/tr.d021:trMA.Ode7C1T.melody	@ltx/en_us_goadedes/he.h.m8:heHE.OTousPaidasDrosisas.name
ltx/en_us_goadedes/tr.d021:trMA.Ode7C1T.mode	@ltx/en_us_goadedes/miscellanea:misc.Mode8
ltx/en_us_goadedes/tr.d021:trMA.Ode7C1T.ode	@ltx/en_us_goadedes/miscellanea:misc.Ode7
ltx/en_us_goadedes/tr.d021:trMA.Ode7C1T.text	
ltx/en_us_goadedes/tr.d021:trMA.Ode7C1Tr.incipit	…
ltx/en_us_goadedes/tr.d021:trMA.Ode7C1Tr.melody	@ltx/en_us_goadedes/he.h.m8:heHE.OTousPaidasDrosisas.name
ltx/en_us_goadedes/tr.d021:trMA.Ode7C1Tr.mode	@ltx/en_us_goadedes/miscellanea:misc.Mode8
ltx/en_us_goadedes/tr.d021:trMA.Ode7C1Tr.ode	@ltx/en_us_goadedes/miscellanea:misc.Ode7
ltx/en_us_goadedes/tr.d021:trMA.Ode7C1Tr.text	
ltx/en_us_goadedes/tr.d021:trMA.Ode7K.incipit	@ltx/en_us_goadedes/he.h.m8:heHE.OTousPaidasDrosisas.incipit
ltx/en_us_goadedes/tr.d021:trMA.Ode7K.melody	@ltx/en_us_goadedes/he.h.m8:heHE.OTousPaidasDrosisas.melody
ltx/en_us_goadedes/tr.d021:trMA.Ode7K.mode	@ltx/en_us_goadedes/miscellanea:misc.Mode8
ltx/en_us_goadedes/tr.d021:trMA.Ode7K.ode	@ltx/en_us_goadedes/miscellanea:misc.Ode7
ltx/en_us_goadedes/tr.d021:trMA.Ode7K.text	@ltx/en_us_goadedes/he.h.m8:heHE.OTousPaidasDrosisas.text
ltx/en_us_goadedes/tr.d021:trMA.Ode8C11.greekmelody	@ltx/en_us_goadedes/he.h.m8:heHE.TonEnOreiAgio.greekname
ltx/en_us_goadedes/tr.d021:trMA.Ode8C11.incipit	…
ltx/en_us_goadedes/tr.d021:trMA.Ode8C11.melody	@ltx/en_us_goadedes/he.h.m8:heHE.TonEnOreiAgio.name
ltx/en_us_goadedes/tr.d021:trMA.Ode8C11.mode	@ltx/en_us_goadedes/miscellanea:misc.Mode8
ltx/en_us_goadedes/tr.d021:trMA.Ode8C11.ode	@ltx/en_us_goadedes/miscellanea:misc.Ode8
ltx/en_us_goadedes/tr.d021:trMA.Ode8C11.text	
ltx/en_us_goadedes/tr.d021:trMA.Ode8C12.incipit	…
ltx/en_us_goadedes/tr.d021:trMA.Ode8C12.melody	@ltx/en_us_goadedes/he.h.m8:heHE.TonEnOreiAgio.name
ltx/en_us_goadedes/tr.d021:trMA.Ode8C12.mode	@ltx/en_us_goadedes/miscellanea:misc.Mode8
ltx/en_us_goadedes/tr.d021:trMA.Ode8C12.ode	@ltx/en_us_goadedes/miscellanea:misc.Ode8
ltx/en_us_goadedes/tr.d021:trMA.Ode8C12.text	
ltx/en_us_goadedes/tr.d021:trMA.Ode8C13.incipit	…
ltx/en_us_goadedes/tr.d021:trMA.Ode8C13.melody	@ltx/en_us_goadedes/he.h.m8:heHE.TonEnOreiAgio.name
ltx/en_us_goadedes/tr.d021:trMA.Ode8C13.mode	@ltx/en_us_goadedes/miscellanea:misc.Mode8
ltx/en_us_goadedes/tr.d021:trMA.Ode8C13.ode	@ltx/en_us_goadedes/miscellanea:misc.Ode8
ltx/en_us_goadedes/tr.d021:trMA.Ode8C13.text	
ltx/en_us_goadedes/tr.d021:trMA.Ode8C14.incipit	…
ltx/en_us_goadedes/tr.d021:trMA.Ode8C14.melody	@ltx/en_us_goadedes/he.h.m8:heHE.TonEnOreiAgio.name
ltx/en_us_goadedes/tr.d021:trMA.Ode8C14.mode	@ltx/en_us_goadedes/miscellanea:misc.Mode8
ltx/en_us_goadedes/tr.d021:trMA.Ode8C14.ode	@ltx/en_us_goadedes/miscellanea:misc.Ode8
ltx/en_us_goadedes/tr.d021:trMA.Ode8C14.text	
ltx/en_us_goadedes/tr.d021:trMA.Ode8C15.incipit	…
ltx/en_us_goadedes/tr.d021:trMA.Ode8C15.melody	@ltx/en_us_goadedes/he.h.m8:heHE.TonEnOreiAgio.name
ltx/en_us_goadedes/tr.d021:trMA.Ode8C15.mode	@ltx/en_us_goadedes/miscellanea:misc.Mode8
ltx/en_us_goadedes/tr.d021:trMA.Ode8C15.ode	@ltx/en_us_goadedes/miscellanea:misc.Ode8
ltx/en_us_goadedes/tr.d021:trMA.Ode8C15.text	
ltx/en_us_goadedes/tr.d021:trMA.Ode8C16.incipit	…
ltx/en_us_goadedes/tr.d021:trMA.Ode8C16.melody	@ltx/en_us_goadedes/he.h.m8:heHE.TonEnOreiAgio.name
ltx/en_us_goadedes/tr.d021:trMA.Ode8C16.mode	@ltx/en_us_goadedes/miscellanea:misc.Mode8
ltx/en_us_goadedes/tr.d021:trMA.Ode8C16.ode	@ltx/en_us_goadedes/miscellanea:misc.Ode8
ltx/en_us_goadedes/tr.d021:trMA.Ode8C16.text	
ltx/en_us_goadedes/tr.d021:trMA.Ode8C1H.greekmelody	@ltx/en_us_goadedes/he.h.m8:heHE.TonEnOreiAgio.greekname
ltx/en_us_goadedes/tr.d021:trMA.Ode8C1H.incipit	@ltx/en_us_goadedes/he.h.m8:heHE.TonEnOreiAgio.incipit
ltx/en_us_goadedes/tr.d021:trMA.Ode8C1H.melody	@ltx/en_us_goadedes/he.h.m8:heHE.TonEnOreiAgio.melody
ltx/en_us_goadedes/tr.d021:trMA.Ode8C1H.mode	@ltx/en_us_goadedes/miscellanea:misc.Mode8
ltx/en_us_goadedes/tr.d021:trMA.Ode8C1H.ode	@ltx/en_us_goadedes/miscellanea:misc.Ode8
ltx/en_us_goadedes/tr.d021:trMA.Ode8C1H.text	@ltx/en_us_goadedes/he.h.m8:heHE.TonEnOreiAgio.text
ltx/en_us_goadedes/tr.d021:trMA.Ode8C1M.incipit	…
ltx/en_us_goadedes/tr.d021:trMA.Ode8C1M.melody	@ltx/en_us_goadedes/he.h.m8:heHE.TonEnOreiAgio.name
ltx/en_us_goadedes/tr.d021:trMA.Ode8C1M.mode	@ltx/en_us_goadedes/miscellanea:misc.Mode8
ltx/en_us_goadedes/tr.d021:trMA.Ode8C1M.ode	@ltx/en_us_goadedes/miscellanea:misc.Ode8
ltx/en_us_goadedes/tr.d021:trMA.Ode8C1M.text	
ltx/en_us_goadedes/tr.d021:trMA.Ode8C1T.incipit	…
ltx/en_us_goadedes/tr.d021:trMA.Ode8C1T.melody	@ltx/en_us_goadedes/he.h.m8:heHE.TonEnOreiAgio.name
ltx/en_us_goadedes/tr.d021:trMA.Ode8C1T.mode	@ltx/en_us_goadedes/miscellanea:misc.Mode8
ltx/en_us_goadedes/tr.d021:trMA.Ode8C1T.ode	@ltx/en_us_goadedes/miscellanea:misc.Ode8
ltx/en_us_goadedes/tr.d021:trMA.Ode8C1T.text	
ltx/en_us_goadedes/tr.d021:trMA.Ode8C1Tr.incipit	…
ltx/en_us_goadedes/tr.d021:trMA.Ode8C1Tr.melody	@ltx/en_us_goadedes/he.h.m8:heHE.TonEnOreiAgio.name
ltx/en_us_goadedes/tr.d021:trMA.Ode8C1Tr.mode	@ltx/en_us_goadedes/miscellanea:misc.Mode8
ltx/en_us_goadedes/tr.d021:trMA.Ode8C1Tr.ode	@ltx/en_us_goadedes/miscellanea:misc.Ode8
ltx/en_us_goadedes/tr.d021:trMA.Ode8C1Tr.text	
ltx/en_us_goadedes/tr.d021:trMA.Ode8K.incipit	@ltx/en_us_goadedes/he.h.m8:heHE.TonEnOreiAgio.incipit
ltx/en_us_goadedes/tr.d021:trMA.Ode8K.melody	@ltx/en_us_goadedes/he.h.m8:heHE.TonEnOreiAgio.melody
ltx/en_us_goadedes/tr.d021:trMA.Ode8K.mode	@ltx/en_us_goadedes/miscellanea:misc.Mode8
ltx/en_us_goadedes/tr.d021:trMA.Ode8K.ode	@ltx/en_us_goadedes/miscellanea:misc.Ode8
ltx/en_us_goadedes/tr.d021:trMA.Ode8K.text	@ltx/en_us_goadedes/he.h.m8:heHE.TonEnOreiAgio.text
ltx/en_us_goadedes/tr.d021:trMA.Ode9C11.greekmelody	@ltx/en_us_goadedes/he.h.m8:heHE.TonProdilothenta.greekname
ltx/en_us_goadedes/tr.d021:trMA.Ode9C11.incipit	…
ltx/en_us_goadedes/tr.d021:trMA.Ode9C11.melody	@ltx/en_us_goadedes/he.h.m8:heHE.TonProdilothenta.name
ltx/en_us_goadedes/tr.d021:trMA.Ode9C11.mode	@ltx/en_us_goadedes/miscellanea:misc.Mode8
ltx/en_us_goadedes/tr.d021:trMA.Ode9C11.ode	@ltx/en_us_goadedes/miscellanea:misc.Ode9
ltx/en_us_goadedes/tr.d021:trMA.Ode9C11.text	
ltx/en_us_goadedes/tr.d021:trMA.Ode9C12.incipit	…
ltx/en_us_goadedes/tr.d021:trMA.Ode9C12.melody	@ltx/en_us_goadedes/he.h.m8:heHE.TonProdilothenta.name
ltx/en_us_goadedes/tr.d021:trMA.Ode9C12.mode	@ltx/en_us_goadedes/miscellanea:misc.Mode8
ltx/en_us_goadedes/tr.d021:trMA.Ode9C12.ode	@ltx/en_us_goadedes/miscellanea:misc.Ode9
ltx/en_us_goadedes/tr.d021:trMA.Ode9C12.text	
ltx/en_us_goadedes/tr.d021:trMA.Ode9C13.incipit	…
ltx/en_us_goadedes/tr.d021:trMA.Ode9C13.melody	@ltx/en_us_goadedes/he.h.m8:heHE.TonProdilothenta.name
ltx/en_us_goadedes/tr.d021:trMA.Ode9C13.mode	@ltx/en_us_goadedes/miscellanea:misc.Mode8
ltx/en_us_goadedes/tr.d021:trMA.Ode9C13.ode	@ltx/en_us_goadedes/miscellanea:misc.Ode9
ltx/en_us_goadedes/tr.d021:trMA.Ode9C13.text	
ltx/en_us_goadedes/tr.d021:trMA.Ode9C14.incipit	…
ltx/en_us_goadedes/tr.d021:trMA.Ode9C14.melody	@ltx/en_us_goadedes/he.h.m8:heHE.TonProdilothenta.name
ltx/en_us_goadedes/tr.d021:trMA.Ode9C14.mode	@ltx/en_us_goadedes/miscellanea:misc.Mode8
ltx/en_us_goadedes/tr.d021:trMA.Ode9C14.ode	@ltx/en_us_goadedes/miscellanea:misc.Ode9
ltx/en_us_goadedes/tr.d021:trMA.Ode9C14.text	
ltx/en_us_goadedes/tr.d021:trMA.Ode9C15.incipit	…
ltx/en_us_goadedes/tr.d021:trMA.Ode9C15.melody	@ltx/en_us_goadedes/he.h.m8:heHE.TonProdilothenta.name
ltx/en_us_goadedes/tr.d021:trMA.Ode9C15.mode	@ltx/en_us_goadedes/miscellanea:misc.Mode8
ltx/en_us_goadedes/tr.d021:trMA.Ode9C15.ode	@ltx/en_us_goadedes/miscellanea:misc.Ode9
ltx/en_us_goadedes/tr.d021:trMA.Ode9C15.text	
ltx/en_us_goadedes/tr.d021:trMA.Ode9C16.incipit	…
ltx/en_us_goadedes/tr.d021:trMA.Ode9C16.melody	@ltx/en_us_goadedes/he.h.m8:heHE.TonProdilothenta.name
ltx/en_us_goadedes/tr.d021:trMA.Ode9C16.mode	@ltx/en_us_goadedes/miscellanea:misc.Mode8
ltx/en_us_goadedes/tr.d021:trMA.Ode9C16.ode	@ltx/en_us_goadedes/miscellanea:misc.Ode9
ltx/en_us_goadedes/tr.d021:trMA.Ode9C16.text	
ltx/en_us_goadedes/tr.d021:trMA.Ode9C1H.greekmelody	@ltx/en_us_goadedes/he.h.m8:heHE.TonProdilothenta.greekname
ltx/en_us_goadedes/tr.d021:trMA.Ode9C1H.incipit	@ltx/en_us_goadedes/he.h.m8:heHE.TonProdilothenta.incipit
ltx/en_us_goadedes/tr.d021:trMA.Ode9C1H.melody	@ltx/en_us_goadedes/he.h.m8:heHE.TonProdilothenta.melody
ltx/en_us_goadedes/tr.d021:trMA.Ode9C1H.mode	@ltx/en_us_goadedes/miscellanea:misc.Mode8
ltx/en_us_goadedes/tr.d021:trMA.Ode9C1H.ode	@ltx/en_us_goadedes/miscellanea:misc.Ode9
ltx/en_us_goadedes/tr.d021:trMA.Ode9C1H.text	@ltx/en_us_goadedes/he.h.m8:heHE.TonProdilothenta.text
ltx/en_us_goadedes/tr.d021:trMA.Ode9C1M.incipit	…
ltx/en_us_goadedes/tr.d021:trMA.Ode9C1M.melody	@ltx/en_us_goadedes/he.h.m8:heHE.TonProdilothenta.name
ltx/en_us_goadedes/tr.d021:trMA.Ode9C1M.mode	@ltx/en_us_goadedes/miscellanea:misc.Mode8
ltx/en_us_goadedes/tr.d021:trMA.Ode9C1M.ode	@ltx/en_us_goadedes/miscellanea:misc.Ode9
ltx/en_us_goadedes/tr.d021:trMA.Ode9C1M.text	
ltx/en_us_goadedes/tr.d021:trMA.Ode9C1T.incipit	…
ltx/en_us_goadedes/tr.d021:trMA.Ode9C1T.melody	@ltx/en_us_goadedes/he.h.m8:heHE.TonProdilothenta.name
ltx/en_us_goadedes/tr.d021:trMA.Ode9C1T.mode	@ltx/en_us_goadedes/miscellanea:misc.Mode8
ltx/en_us_goadedes/tr.d021:trMA.Ode9C1T.ode	@ltx/en_us_goadedes/miscellanea:misc.Ode9
ltx/en_us_goadedes/tr.d021:trMA.Ode9C1T.text	
ltx/en_us_goadedes/tr.d021:trMA.Ode9C1Tr.incipit	…
ltx/en_us_goadedes/tr.d021:trMA.Ode9C1Tr.melody	@ltx/en_us_goadedes/he.h.m8:heHE.TonProdilothenta.name
ltx/en_us_goadedes/tr.d021:trMA.Ode9C1Tr.mode	@ltx/en_us_goadedes/miscellanea:misc.Mode8
ltx/en_us_goadedes/tr.d021:trMA.Ode9C1Tr.ode	@ltx/en_us_goadedes/miscellanea:misc.Ode9
ltx/en_us_goadedes/tr.d021:trMA.Ode9C1Tr.text	
ltx/en_us_goadedes/tr.d021:trMA.Ode9K.incipit	@ltx/en_us_goadedes/he.h.m8:heHE.TonProdilothenta.incipit
ltx/en_us_goadedes/tr.d021:trMA.Ode9K.melody	@ltx/en_us_goadedes/he.h.m8:heHE.TonProdilothenta.melody
ltx/en_us_goadedes/tr.d021:trMA.Ode9K.mode	@ltx/en_us_goadedes/miscellanea:misc.Mode8
ltx/en_us_goadedes/tr.d021:trMA.Ode9K.ode	@ltx/en_us_goadedes/miscellanea:misc.Ode9
ltx/en_us_goadedes/tr.d021:trMA.Ode9K.text	@ltx/en_us_goadedes/he.h.m8:heHE.TonProdilothenta.text
ltx/en_us_goadedes/tr.d021:trMA.Oikos1.text	
ltx/en_us_goadedes/tr.d021:trSY.commemoration.couplet1.title	@ltx/en_us_goadedes/titles:ti.Verses
ltx/en_us_goadedes/tr.d021:trSY.commemoration.couplet1.verse1	
ltx/en_us_goadedes/tr.d021:trSY.commemoration.couplet1.verse2	
ltx/en_us_goadedes/tr.d021:trSY.commemoration.narration.p01	
ltx/en_us_goadedes/tr.d021:trSY.commemoration.narration.p02	
ltx/en_us_goadedes/tr.d021:trSY.commemoration.narration.p03	
ltx/en_us_goadedes/tr.d021:trSY.commemoration.narration.p04	
ltx/en_us_goadedes/tr.d021:trSY.commemoration.narration.p05	
ltx/en_us_goadedes/tr.d021:trSY.commemoration.narration.p06	
ltx/en_us_goadedes/tr.d021:trSY.commemoration.narration.p07	
ltx/en_us_goadedes/tr.d021:trSY.commemoration.text	
ltx/en_us_goadedes/tr.d021:trSY.lastline	
ltx/en_us_goadedes/tr.d021:trVE.ApolTheotokion.incipit	@ltx/en_us_goadedes/oc.m4.d1:ocVE.ApolTheotokionVM.incipit
ltx/en_us_goadedes/tr.d021:trVE.ApolTheotokion.melody	
ltx/en_us_goadedes/tr.d021:trVE.ApolTheotokion.mode	@ltx/en_us_goadedes/miscellanea:misc.Mode4
ltx/en_us_goadedes/tr.d021:trVE.ApolTheotokion.text	@ltx/en_us_goadedes/oc.m4.d1:ocVE.ApolTheotokionVM.text
ltx/en_us_goadedes/tr.d021:trVE.Apolytikion1.incipit	@ltx/en_us_goadedes/he.ga:heGA.OTheosTonPateronImon.incipit
ltx/en_us_goadedes/tr.d021:trVE.Apolytikion1.melody	
ltx/en_us_goadedes/tr.d021:trVE.Apolytikion1.mode	@ltx/en_us_goadedes/miscellanea:misc.Mode4
ltx/en_us_goadedes/tr.d021:trVE.Apolytikion1.text	@ltx/en_us_goadedes/he.ga:heGA.OTheosTonPateronImon.text
ltx/en_us_goadedes/tr.d021:trVE.AposGlory.incipit	…
ltx/en_us_goadedes/tr.d021:trVE.AposGlory.melody	@ltx/en_us_goadedes/miscellanea:misc.Idiomelon
ltx/en_us_goadedes/tr.d021:trVE.AposGlory.mode	@ltx/en_us_goadedes/miscellanea:misc.Mode8
ltx/en_us_goadedes/tr.d021:trVE.AposGlory.text	
ltx/en_us_goadedes/tr.d021:trVE.AposIdiomelon1.incipit	…
ltx/en_us_goadedes/tr.d021:trVE.AposIdiomelon1.melody	@ltx/en_us_goadedes/miscellanea:misc.Idiomelon
ltx/en_us_goadedes/tr.d021:trVE.AposIdiomelon1.mode	@ltx/en_us_goadedes/miscellanea:misc.Mode2
ltx/en_us_goadedes/tr.d021:trVE.AposIdiomelon1.text	
ltx/en_us_goadedes/tr.d021:trVE.AposMartyric.incipit	@ltx/en_us_goadedes/oc.m2.d3:ocVE.Aposticha3.incipit
ltx/en_us_goadedes/tr.d021:trVE.AposMartyric.melody	
ltx/en_us_goadedes/tr.d021:trVE.AposMartyric.mode	@ltx/en_us_goadedes/miscellanea:misc.Mode2
ltx/en_us_goadedes/tr.d021:trVE.AposMartyric.text	@ltx/en_us_goadedes/oc.m2.d3:ocVE.Aposticha3.text
ltx/en_us_goadedes/tr.d021:trVE.AposTheotokion.greekmelody	@ltx/en_us_goadedes/he.a.m8:heAU.OTouParadoxou.greekname
ltx/en_us_goadedes/tr.d021:trVE.AposTheotokion.incipit	…
ltx/en_us_goadedes/tr.d021:trVE.AposTheotokion.melody	@ltx/en_us_goadedes/he.a.m8:heAU.OTouParadoxou.name
ltx/en_us_goadedes/tr.d021:trVE.AposTheotokion.mode	@ltx/en_us_goadedes/miscellanea:misc.Mode8
ltx/en_us_goadedes/tr.d021:trVE.AposTheotokion.text	
ltx/en_us_goadedes/tr.d021:trVE.SticGlory.incipit	…
ltx/en_us_goadedes/tr.d021:trVE.SticGlory.melody	@ltx/en_us_goadedes/miscellanea:misc.Idiomelon
ltx/en_us_goadedes/tr.d021:trVE.SticGlory.mode	@ltx/en_us_goadedes/miscellanea:misc.Mode6
ltx/en_us_goadedes/tr.d021:trVE.SticGlory.text	
ltx/en_us_goadedes/tr.d021:trVE.Stichera01.greekmelody	@ltx/en_us_goadedes/he.a.m8:heAU.DefteApantesPistoi.greekname
ltx/en_us_goadedes/tr.d021:trVE.Stichera01.incipit	@ltx/en_us_goadedes/he.a.m8:heAU.DefteApantesPistoi.incipit
ltx/en_us_goadedes/tr.d021:trVE.Stichera01.melody	@ltx/en_us_goadedes/he.a.m8:heAU.DefteApantesPistoi.melody
ltx/en_us_goadedes/tr.d021:trVE.Stichera01.mode	@ltx/en_us_goadedes/miscellanea:misc.Mode8
ltx/en_us_goadedes/tr.d021:trVE.Stichera01.text	@ltx/en_us_goadedes/he.a.m8:heAU.DefteApantesPistoi.text
ltx/en_us_goadedes/tr.d021:trVE.Stichera02.greekmelody	@ltx/en_us_goadedes/he.a.m8:heAU.DefteApantesPistoi.greekname
ltx/en_us_goadedes/tr.d021:trVE.Stichera02.incipit	…
ltx/en_us_goadedes/tr.d021:trVE.Stichera02.melody	@ltx/en_us_goadedes/he.a.m8:heAU.DefteApantesPistoi.name
ltx/en_us_goadedes/tr.d021:trVE.Stichera02.mode	@ltx/en_us_goadedes/miscellanea:misc.Mode8
ltx/en_us_goadedes/tr.d021:trVE.Stichera02.text	
ltx/en_us_goadedes/tr.d021:trVE.Stichera03.greekmelody	@ltx/en_us_goadedes/he.a.m8:heAU.DefteApantesPistoi.greekname
ltx/en_us_goadedes/tr.d021:trVE.Stichera03.incipit	…
ltx/en_us_goadedes/tr.d021:trVE.Stichera03.melody	@ltx/en_us_goadedes/he.a.m8:heAU.DefteApantesPistoi.name
ltx/en_us_goadedes/tr.d021:trVE.Stichera03.mode	@ltx/en_us_goadedes/miscellanea:misc.Mode8
ltx/en_us_goadedes/tr.d021:trVE.Stichera03.text	
