ltx/en_us_goadedes/tr.d026:trCO.header	
ltx/en_us_goadedes/tr.d026:trDA.commemoration.full	
ltx/en_us_goadedes/tr.d026:trDA.commemoration.short	
ltx/en_us_goadedes/tr.d026:trDA.insert1	
ltx/en_us_goadedes/tr.d026:trDA.insert2	
ltx/en_us_goadedes/tr.d026:trDA.note	
ltx/en_us_goadedes/tr.d026:trDA.title	
ltx/en_us_goadedes/tr.d026:trHO.commemorations	
ltx/en_us_goadedes/tr.d026:trHO.daytitle	
ltx/en_us_goadedes/tr.d026:trHO.description1	
ltx/en_us_goadedes/tr.d026:trHO.description2	
ltx/en_us_goadedes/tr.d026:trHO.note1	
ltx/en_us_goadedes/tr.d026:trHO.note2	
ltx/en_us_goadedes/tr.d026:trMA.AposIdiomelon1.incipit	…
ltx/en_us_goadedes/tr.d026:trMA.AposIdiomelon1.melody	@ltx/en_us_goadedes/miscellanea:misc.Idiomelon
ltx/en_us_goadedes/tr.d026:trMA.AposIdiomelon1.mode	@ltx/en_us_goadedes/miscellanea:misc.Mode3
ltx/en_us_goadedes/tr.d026:trMA.AposIdiomelon1.text	
ltx/en_us_goadedes/tr.d026:trMA.AposMartyric.incipit	…
ltx/en_us_goadedes/tr.d026:trMA.AposMartyric.melody	
ltx/en_us_goadedes/tr.d026:trMA.AposMartyric.mode	@ltx/en_us_goadedes/miscellanea:misc.Mode3
ltx/en_us_goadedes/tr.d026:trMA.AposMartyric.text	
ltx/en_us_goadedes/tr.d026:trMA.AposTheotokion.incipit	…
ltx/en_us_goadedes/tr.d026:trMA.AposTheotokion.melody	
ltx/en_us_goadedes/tr.d026:trMA.AposTheotokion.mode	@ltx/en_us_goadedes/miscellanea:misc.Mode3
ltx/en_us_goadedes/tr.d026:trMA.AposTheotokion.text	
ltx/en_us_goadedes/tr.d026:trMA.C1.poet	@ltx/en_us_goadedes/poets:po.KyriouIosif
ltx/en_us_goadedes/tr.d026:trMA.C2.poet	@ltx/en_us_goadedes/poets:po.KyriouTheodorou
ltx/en_us_goadedes/tr.d026:trMA.Kathisma21.incipit	…
ltx/en_us_goadedes/tr.d026:trMA.Kathisma21.melody	
ltx/en_us_goadedes/tr.d026:trMA.Kathisma21.mode	@ltx/en_us_goadedes/miscellanea:misc.Mode2
ltx/en_us_goadedes/tr.d026:trMA.Kathisma21.text	
ltx/en_us_goadedes/tr.d026:trMA.Kathisma22.incipit	…
ltx/en_us_goadedes/tr.d026:trMA.Kathisma22.melody	
ltx/en_us_goadedes/tr.d026:trMA.Kathisma22.mode	@ltx/en_us_goadedes/miscellanea:misc.Mode2
ltx/en_us_goadedes/tr.d026:trMA.Kathisma22.text	
ltx/en_us_goadedes/tr.d026:trMA.Kathisma31.incipit	…
ltx/en_us_goadedes/tr.d026:trMA.Kathisma31.melody	
ltx/en_us_goadedes/tr.d026:trMA.Kathisma31.mode	@ltx/en_us_goadedes/miscellanea:misc.Mode5
ltx/en_us_goadedes/tr.d026:trMA.Kathisma31.text	
ltx/en_us_goadedes/tr.d026:trMA.Kathisma32.incipit	…
ltx/en_us_goadedes/tr.d026:trMA.Kathisma32.melody	
ltx/en_us_goadedes/tr.d026:trMA.Kathisma32.mode	@ltx/en_us_goadedes/miscellanea:misc.Mode5
ltx/en_us_goadedes/tr.d026:trMA.Kathisma32.text	
ltx/en_us_goadedes/tr.d026:trMA.Ode4C11.greekmelody	@ltx/en_us_goadedes/he.h.m2:heHE.ElilythasEkParthenou.greekname
ltx/en_us_goadedes/tr.d026:trMA.Ode4C11.incipit	…
ltx/en_us_goadedes/tr.d026:trMA.Ode4C11.melody	@ltx/en_us_goadedes/he.h.m2:heHE.ElilythasEkParthenou.name
ltx/en_us_goadedes/tr.d026:trMA.Ode4C11.mode	@ltx/en_us_goadedes/miscellanea:misc.Mode2
ltx/en_us_goadedes/tr.d026:trMA.Ode4C11.ode	@ltx/en_us_goadedes/miscellanea:misc.Ode4
ltx/en_us_goadedes/tr.d026:trMA.Ode4C11.text	
ltx/en_us_goadedes/tr.d026:trMA.Ode4C12.incipit	…
ltx/en_us_goadedes/tr.d026:trMA.Ode4C12.melody	@ltx/en_us_goadedes/he.h.m2:heHE.ElilythasEkParthenou.name
ltx/en_us_goadedes/tr.d026:trMA.Ode4C12.mode	@ltx/en_us_goadedes/miscellanea:misc.Mode2
ltx/en_us_goadedes/tr.d026:trMA.Ode4C12.ode	@ltx/en_us_goadedes/miscellanea:misc.Ode4
ltx/en_us_goadedes/tr.d026:trMA.Ode4C12.text	
ltx/en_us_goadedes/tr.d026:trMA.Ode4C13.incipit	…
ltx/en_us_goadedes/tr.d026:trMA.Ode4C13.melody	@ltx/en_us_goadedes/he.h.m2:heHE.ElilythasEkParthenou.name
ltx/en_us_goadedes/tr.d026:trMA.Ode4C13.mode	@ltx/en_us_goadedes/miscellanea:misc.Mode2
ltx/en_us_goadedes/tr.d026:trMA.Ode4C13.ode	@ltx/en_us_goadedes/miscellanea:misc.Ode4
ltx/en_us_goadedes/tr.d026:trMA.Ode4C13.text	
ltx/en_us_goadedes/tr.d026:trMA.Ode4C1T.incipit	…
ltx/en_us_goadedes/tr.d026:trMA.Ode4C1T.melody	@ltx/en_us_goadedes/he.h.m2:heHE.ElilythasEkParthenou.name
ltx/en_us_goadedes/tr.d026:trMA.Ode4C1T.mode	@ltx/en_us_goadedes/miscellanea:misc.Mode2
ltx/en_us_goadedes/tr.d026:trMA.Ode4C1T.ode	@ltx/en_us_goadedes/miscellanea:misc.Ode4
ltx/en_us_goadedes/tr.d026:trMA.Ode4C1T.text	
ltx/en_us_goadedes/tr.d026:trMA.Ode4C21.greekmelody	@ltx/en_us_goadedes/he.h.m5:heHE.TaErgaTisOikonomias.greekname
ltx/en_us_goadedes/tr.d026:trMA.Ode4C21.incipit	…
ltx/en_us_goadedes/tr.d026:trMA.Ode4C21.melody	@ltx/en_us_goadedes/he.h.m5:heHE.TaErgaTisOikonomias.name
ltx/en_us_goadedes/tr.d026:trMA.Ode4C21.mode	@ltx/en_us_goadedes/miscellanea:misc.Mode5
ltx/en_us_goadedes/tr.d026:trMA.Ode4C21.ode	@ltx/en_us_goadedes/miscellanea:misc.Ode4
ltx/en_us_goadedes/tr.d026:trMA.Ode4C21.text	
ltx/en_us_goadedes/tr.d026:trMA.Ode4C22.incipit	…
ltx/en_us_goadedes/tr.d026:trMA.Ode4C22.melody	@ltx/en_us_goadedes/he.h.m5:heHE.TaErgaTisOikonomias.name
ltx/en_us_goadedes/tr.d026:trMA.Ode4C22.mode	@ltx/en_us_goadedes/miscellanea:misc.Mode5
ltx/en_us_goadedes/tr.d026:trMA.Ode4C22.ode	@ltx/en_us_goadedes/miscellanea:misc.Ode4
ltx/en_us_goadedes/tr.d026:trMA.Ode4C22.text	
ltx/en_us_goadedes/tr.d026:trMA.Ode4C2A1.incipit	…
ltx/en_us_goadedes/tr.d026:trMA.Ode4C2A1.melody	@ltx/en_us_goadedes/he.h.m5:heHE.TaErgaTisOikonomias.name
ltx/en_us_goadedes/tr.d026:trMA.Ode4C2A1.mode	@ltx/en_us_goadedes/miscellanea:misc.Mode5
ltx/en_us_goadedes/tr.d026:trMA.Ode4C2A1.ode	@ltx/en_us_goadedes/miscellanea:misc.Ode4
ltx/en_us_goadedes/tr.d026:trMA.Ode4C2A1.text	
ltx/en_us_goadedes/tr.d026:trMA.Ode4C2H.greekmelody	@ltx/en_us_goadedes/he.h.m5:heHE.TaErgaTisOikonomias.greekname
ltx/en_us_goadedes/tr.d026:trMA.Ode4C2H.incipit	@ltx/en_us_goadedes/he.h.m5:heHE.TaErgaTisOikonomias.incipit
ltx/en_us_goadedes/tr.d026:trMA.Ode4C2H.melody	@ltx/en_us_goadedes/he.h.m5:heHE.TaErgaTisOikonomias.melody
ltx/en_us_goadedes/tr.d026:trMA.Ode4C2H.mode	@ltx/en_us_goadedes/miscellanea:misc.Mode5
ltx/en_us_goadedes/tr.d026:trMA.Ode4C2H.ode	@ltx/en_us_goadedes/miscellanea:misc.Ode4
ltx/en_us_goadedes/tr.d026:trMA.Ode4C2H.text	@ltx/en_us_goadedes/he.h.m5:heHE.TaErgaTisOikonomias.text
ltx/en_us_goadedes/tr.d026:trMA.Ode4C2T.incipit	…
ltx/en_us_goadedes/tr.d026:trMA.Ode4C2T.melody	@ltx/en_us_goadedes/he.h.m5:heHE.TaErgaTisOikonomias.name
ltx/en_us_goadedes/tr.d026:trMA.Ode4C2T.mode	@ltx/en_us_goadedes/miscellanea:misc.Mode5
ltx/en_us_goadedes/tr.d026:trMA.Ode4C2T.ode	@ltx/en_us_goadedes/miscellanea:misc.Ode4
ltx/en_us_goadedes/tr.d026:trMA.Ode4C2T.text	
ltx/en_us_goadedes/tr.d026:trMA.Ode4C2Tr.incipit	…
ltx/en_us_goadedes/tr.d026:trMA.Ode4C2Tr.melody	@ltx/en_us_goadedes/he.h.m5:heHE.TaErgaTisOikonomias.name
ltx/en_us_goadedes/tr.d026:trMA.Ode4C2Tr.mode	@ltx/en_us_goadedes/miscellanea:misc.Mode5
ltx/en_us_goadedes/tr.d026:trMA.Ode4C2Tr.ode	@ltx/en_us_goadedes/miscellanea:misc.Ode4
ltx/en_us_goadedes/tr.d026:trMA.Ode4C2Tr.text	
ltx/en_us_goadedes/tr.d026:trMA.Ode8C11.greekmelody	@ltx/en_us_goadedes/he.h.m2:heHE.ToDogmatiToTyranniko.greekname
ltx/en_us_goadedes/tr.d026:trMA.Ode8C11.incipit	…
ltx/en_us_goadedes/tr.d026:trMA.Ode8C11.melody	@ltx/en_us_goadedes/he.h.m2:heHE.ToDogmatiToTyranniko.name
ltx/en_us_goadedes/tr.d026:trMA.Ode8C11.mode	@ltx/en_us_goadedes/miscellanea:misc.Mode2
ltx/en_us_goadedes/tr.d026:trMA.Ode8C11.ode	@ltx/en_us_goadedes/miscellanea:misc.Ode8
ltx/en_us_goadedes/tr.d026:trMA.Ode8C11.text	
ltx/en_us_goadedes/tr.d026:trMA.Ode8C12.incipit	…
ltx/en_us_goadedes/tr.d026:trMA.Ode8C12.melody	@ltx/en_us_goadedes/he.h.m2:heHE.ToDogmatiToTyranniko.name
ltx/en_us_goadedes/tr.d026:trMA.Ode8C12.mode	@ltx/en_us_goadedes/miscellanea:misc.Mode2
ltx/en_us_goadedes/tr.d026:trMA.Ode8C12.ode	@ltx/en_us_goadedes/miscellanea:misc.Ode8
ltx/en_us_goadedes/tr.d026:trMA.Ode8C12.text	
ltx/en_us_goadedes/tr.d026:trMA.Ode8C13.incipit	…
ltx/en_us_goadedes/tr.d026:trMA.Ode8C13.melody	@ltx/en_us_goadedes/he.h.m2:heHE.ToDogmatiToTyranniko.name
ltx/en_us_goadedes/tr.d026:trMA.Ode8C13.mode	@ltx/en_us_goadedes/miscellanea:misc.Mode2
ltx/en_us_goadedes/tr.d026:trMA.Ode8C13.ode	@ltx/en_us_goadedes/miscellanea:misc.Ode8
ltx/en_us_goadedes/tr.d026:trMA.Ode8C13.text	
ltx/en_us_goadedes/tr.d026:trMA.Ode8C1T.incipit	…
ltx/en_us_goadedes/tr.d026:trMA.Ode8C1T.melody	@ltx/en_us_goadedes/he.h.m2:heHE.ToDogmatiToTyranniko.name
ltx/en_us_goadedes/tr.d026:trMA.Ode8C1T.mode	@ltx/en_us_goadedes/miscellanea:misc.Mode2
ltx/en_us_goadedes/tr.d026:trMA.Ode8C1T.ode	@ltx/en_us_goadedes/miscellanea:misc.Ode8
ltx/en_us_goadedes/tr.d026:trMA.Ode8C1T.text	
ltx/en_us_goadedes/tr.d026:trMA.Ode8C21.greekmelody	@ltx/en_us_goadedes/he.h.m5:heHE.OiOsioiSouPaides.greekname
ltx/en_us_goadedes/tr.d026:trMA.Ode8C21.incipit	…
ltx/en_us_goadedes/tr.d026:trMA.Ode8C21.melody	@ltx/en_us_goadedes/he.h.m5:heHE.OiOsioiSouPaides.name
ltx/en_us_goadedes/tr.d026:trMA.Ode8C21.mode	@ltx/en_us_goadedes/miscellanea:misc.Mode5
ltx/en_us_goadedes/tr.d026:trMA.Ode8C21.ode	@ltx/en_us_goadedes/miscellanea:misc.Ode8
ltx/en_us_goadedes/tr.d026:trMA.Ode8C21.text	
ltx/en_us_goadedes/tr.d026:trMA.Ode8C22.incipit	…
ltx/en_us_goadedes/tr.d026:trMA.Ode8C22.melody	@ltx/en_us_goadedes/he.h.m5:heHE.OiOsioiSouPaides.name
ltx/en_us_goadedes/tr.d026:trMA.Ode8C22.mode	@ltx/en_us_goadedes/miscellanea:misc.Mode5
ltx/en_us_goadedes/tr.d026:trMA.Ode8C22.ode	@ltx/en_us_goadedes/miscellanea:misc.Ode8
ltx/en_us_goadedes/tr.d026:trMA.Ode8C22.text	
ltx/en_us_goadedes/tr.d026:trMA.Ode8C2A1.incipit	…
ltx/en_us_goadedes/tr.d026:trMA.Ode8C2A1.melody	@ltx/en_us_goadedes/he.h.m5:heHE.OiOsioiSouPaides.name
ltx/en_us_goadedes/tr.d026:trMA.Ode8C2A1.mode	@ltx/en_us_goadedes/miscellanea:misc.Mode5
ltx/en_us_goadedes/tr.d026:trMA.Ode8C2A1.ode	@ltx/en_us_goadedes/miscellanea:misc.Ode8
ltx/en_us_goadedes/tr.d026:trMA.Ode8C2A1.text	
ltx/en_us_goadedes/tr.d026:trMA.Ode8C2H.greekmelody	@ltx/en_us_goadedes/he.h.m5:heHE.OiOsioiSouPaides.greekname
ltx/en_us_goadedes/tr.d026:trMA.Ode8C2H.incipit	@ltx/en_us_goadedes/he.h.m5:heHE.OiOsioiSouPaides.incipit
ltx/en_us_goadedes/tr.d026:trMA.Ode8C2H.melody	@ltx/en_us_goadedes/he.h.m5:heHE.OiOsioiSouPaides.melody
ltx/en_us_goadedes/tr.d026:trMA.Ode8C2H.mode	@ltx/en_us_goadedes/miscellanea:misc.Mode5
ltx/en_us_goadedes/tr.d026:trMA.Ode8C2H.ode	@ltx/en_us_goadedes/miscellanea:misc.Ode8
ltx/en_us_goadedes/tr.d026:trMA.Ode8C2H.text	@ltx/en_us_goadedes/he.h.m5:heHE.OiOsioiSouPaides.text
ltx/en_us_goadedes/tr.d026:trMA.Ode8C2T.incipit	…
ltx/en_us_goadedes/tr.d026:trMA.Ode8C2T.melody	@ltx/en_us_goadedes/he.h.m5:heHE.OiOsioiSouPaides.name
ltx/en_us_goadedes/tr.d026:trMA.Ode8C2T.mode	@ltx/en_us_goadedes/miscellanea:misc.Mode5
ltx/en_us_goadedes/tr.d026:trMA.Ode8C2T.ode	@ltx/en_us_goadedes/miscellanea:misc.Ode8
ltx/en_us_goadedes/tr.d026:trMA.Ode8C2T.text	
ltx/en_us_goadedes/tr.d026:trMA.Ode8C2Tr.incipit	…
ltx/en_us_goadedes/tr.d026:trMA.Ode8C2Tr.melody	@ltx/en_us_goadedes/he.h.m5:heHE.OiOsioiSouPaides.name
ltx/en_us_goadedes/tr.d026:trMA.Ode8C2Tr.mode	@ltx/en_us_goadedes/miscellanea:misc.Mode5
ltx/en_us_goadedes/tr.d026:trMA.Ode8C2Tr.ode	@ltx/en_us_goadedes/miscellanea:misc.Ode8
ltx/en_us_goadedes/tr.d026:trMA.Ode8C2Tr.text	
ltx/en_us_goadedes/tr.d026:trMA.Ode9C11.greekmelody	@ltx/en_us_goadedes/he.h.m2:heHE.ITonAchoritonTheon.greekname
ltx/en_us_goadedes/tr.d026:trMA.Ode9C11.incipit	…
ltx/en_us_goadedes/tr.d026:trMA.Ode9C11.melody	@ltx/en_us_goadedes/he.h.m2:heHE.ITonAchoritonTheon.name
ltx/en_us_goadedes/tr.d026:trMA.Ode9C11.mode	@ltx/en_us_goadedes/miscellanea:misc.Mode2
ltx/en_us_goadedes/tr.d026:trMA.Ode9C11.ode	@ltx/en_us_goadedes/miscellanea:misc.Ode9
ltx/en_us_goadedes/tr.d026:trMA.Ode9C11.text	
ltx/en_us_goadedes/tr.d026:trMA.Ode9C12.incipit	…
ltx/en_us_goadedes/tr.d026:trMA.Ode9C12.melody	@ltx/en_us_goadedes/he.h.m2:heHE.ITonAchoritonTheon.name
ltx/en_us_goadedes/tr.d026:trMA.Ode9C12.mode	@ltx/en_us_goadedes/miscellanea:misc.Mode2
ltx/en_us_goadedes/tr.d026:trMA.Ode9C12.ode	@ltx/en_us_goadedes/miscellanea:misc.Ode9
ltx/en_us_goadedes/tr.d026:trMA.Ode9C12.text	
ltx/en_us_goadedes/tr.d026:trMA.Ode9C13.incipit	…
ltx/en_us_goadedes/tr.d026:trMA.Ode9C13.melody	@ltx/en_us_goadedes/he.h.m2:heHE.ITonAchoritonTheon.name
ltx/en_us_goadedes/tr.d026:trMA.Ode9C13.mode	@ltx/en_us_goadedes/miscellanea:misc.Mode2
ltx/en_us_goadedes/tr.d026:trMA.Ode9C13.ode	@ltx/en_us_goadedes/miscellanea:misc.Ode9
ltx/en_us_goadedes/tr.d026:trMA.Ode9C13.text	
ltx/en_us_goadedes/tr.d026:trMA.Ode9C1T.incipit	…
ltx/en_us_goadedes/tr.d026:trMA.Ode9C1T.melody	@ltx/en_us_goadedes/he.h.m2:heHE.ITonAchoritonTheon.name
ltx/en_us_goadedes/tr.d026:trMA.Ode9C1T.mode	@ltx/en_us_goadedes/miscellanea:misc.Mode2
ltx/en_us_goadedes/tr.d026:trMA.Ode9C1T.ode	@ltx/en_us_goadedes/miscellanea:misc.Ode9
ltx/en_us_goadedes/tr.d026:trMA.Ode9C1T.text	
ltx/en_us_goadedes/tr.d026:trMA.Ode9C21.greekmelody	@ltx/en_us_goadedes/he.h.m5:heHE.MegalynomenChriste.greekname
ltx/en_us_goadedes/tr.d026:trMA.Ode9C21.incipit	…
ltx/en_us_goadedes/tr.d026:trMA.Ode9C21.melody	@ltx/en_us_goadedes/he.h.m5:heHE.MegalynomenChriste.name
ltx/en_us_goadedes/tr.d026:trMA.Ode9C21.mode	@ltx/en_us_goadedes/miscellanea:misc.Mode5
ltx/en_us_goadedes/tr.d026:trMA.Ode9C21.ode	@ltx/en_us_goadedes/miscellanea:misc.Ode9
ltx/en_us_goadedes/tr.d026:trMA.Ode9C21.text	
ltx/en_us_goadedes/tr.d026:trMA.Ode9C22.incipit	…
ltx/en_us_goadedes/tr.d026:trMA.Ode9C22.melody	@ltx/en_us_goadedes/he.h.m5:heHE.MegalynomenChriste.name
ltx/en_us_goadedes/tr.d026:trMA.Ode9C22.mode	@ltx/en_us_goadedes/miscellanea:misc.Mode5
ltx/en_us_goadedes/tr.d026:trMA.Ode9C22.ode	@ltx/en_us_goadedes/miscellanea:misc.Ode9
ltx/en_us_goadedes/tr.d026:trMA.Ode9C22.text	
ltx/en_us_goadedes/tr.d026:trMA.Ode9C2A1.incipit	…
ltx/en_us_goadedes/tr.d026:trMA.Ode9C2A1.melody	@ltx/en_us_goadedes/he.h.m5:heHE.MegalynomenChriste.name
ltx/en_us_goadedes/tr.d026:trMA.Ode9C2A1.mode	@ltx/en_us_goadedes/miscellanea:misc.Mode5
ltx/en_us_goadedes/tr.d026:trMA.Ode9C2A1.ode	@ltx/en_us_goadedes/miscellanea:misc.Ode9
ltx/en_us_goadedes/tr.d026:trMA.Ode9C2A1.text	
ltx/en_us_goadedes/tr.d026:trMA.Ode9C2H.greekmelody	@ltx/en_us_goadedes/he.h.m5:heHE.MegalynomenChriste.greekname
ltx/en_us_goadedes/tr.d026:trMA.Ode9C2H.incipit	@ltx/en_us_goadedes/he.h.m5:heHE.MegalynomenChriste.incipit
ltx/en_us_goadedes/tr.d026:trMA.Ode9C2H.melody	@ltx/en_us_goadedes/he.h.m5:heHE.MegalynomenChriste.melody
ltx/en_us_goadedes/tr.d026:trMA.Ode9C2H.mode	@ltx/en_us_goadedes/miscellanea:misc.Mode5
ltx/en_us_goadedes/tr.d026:trMA.Ode9C2H.ode	@ltx/en_us_goadedes/miscellanea:misc.Ode9
ltx/en_us_goadedes/tr.d026:trMA.Ode9C2H.text	@ltx/en_us_goadedes/he.h.m5:heHE.MegalynomenChriste.text
ltx/en_us_goadedes/tr.d026:trMA.Ode9C2T.incipit	…
ltx/en_us_goadedes/tr.d026:trMA.Ode9C2T.melody	@ltx/en_us_goadedes/he.h.m5:heHE.MegalynomenChriste.name
ltx/en_us_goadedes/tr.d026:trMA.Ode9C2T.mode	@ltx/en_us_goadedes/miscellanea:misc.Mode5
ltx/en_us_goadedes/tr.d026:trMA.Ode9C2T.ode	@ltx/en_us_goadedes/miscellanea:misc.Ode9
ltx/en_us_goadedes/tr.d026:trMA.Ode9C2T.text	
ltx/en_us_goadedes/tr.d026:trMA.Ode9C2Tr.incipit	…
ltx/en_us_goadedes/tr.d026:trMA.Ode9C2Tr.melody	@ltx/en_us_goadedes/he.h.m5:heHE.MegalynomenChriste.name
ltx/en_us_goadedes/tr.d026:trMA.Ode9C2Tr.mode	@ltx/en_us_goadedes/miscellanea:misc.Mode5
ltx/en_us_goadedes/tr.d026:trMA.Ode9C2Tr.ode	@ltx/en_us_goadedes/miscellanea:misc.Ode9
ltx/en_us_goadedes/tr.d026:trMA.Ode9C2Tr.text	
ltx/en_us_goadedes/tr.d026:trTE.Troparion.incipit	…
ltx/en_us_goadedes/tr.d026:trTE.Troparion.melody	
ltx/en_us_goadedes/tr.d026:trTE.Troparion.mode	@ltx/en_us_goadedes/miscellanea:misc.Mode1
ltx/en_us_goadedes/tr.d026:trTE.Troparion.text	
ltx/en_us_goadedes/tr.d026:trTE.Troparion2.text	
ltx/en_us_goadedes/tr.d026:trVE.AposIdiomelon1.incipit	…
ltx/en_us_goadedes/tr.d026:trVE.AposIdiomelon1.melody	@ltx/en_us_goadedes/miscellanea:misc.Idiomelon
ltx/en_us_goadedes/tr.d026:trVE.AposIdiomelon1.mode	@ltx/en_us_goadedes/miscellanea:misc.Mode8
ltx/en_us_goadedes/tr.d026:trVE.AposIdiomelon1.text	
ltx/en_us_goadedes/tr.d026:trVE.AposMartyric.incipit	@ltx/en_us_goadedes/oc.m8.d5:ocVE.Aposticha3.incipit
ltx/en_us_goadedes/tr.d026:trVE.AposMartyric.melody	
ltx/en_us_goadedes/tr.d026:trVE.AposMartyric.mode	@ltx/en_us_goadedes/miscellanea:misc.Mode8
ltx/en_us_goadedes/tr.d026:trVE.AposMartyric.text	@ltx/en_us_goadedes/oc.m8.d5:ocVE.Aposticha3.text
ltx/en_us_goadedes/tr.d026:trVE.Stichera01.incipit	…
ltx/en_us_goadedes/tr.d026:trVE.Stichera01.melody	
ltx/en_us_goadedes/tr.d026:trVE.Stichera01.mode	@ltx/en_us_goadedes/miscellanea:misc.Mode2
ltx/en_us_goadedes/tr.d026:trVE.Stichera01.text	
ltx/en_us_goadedes/tr.d026:trVE.Stichera02.incipit	…
ltx/en_us_goadedes/tr.d026:trVE.Stichera02.melody	
ltx/en_us_goadedes/tr.d026:trVE.Stichera02.mode	@ltx/en_us_goadedes/miscellanea:misc.Mode2
ltx/en_us_goadedes/tr.d026:trVE.Stichera02.text	
ltx/en_us_goadedes/tr.d026:trVE.Stichera03.greekmelody	@ltx/en_us_goadedes/he.a.m5:heAU.OsiePater.greekname
ltx/en_us_goadedes/tr.d026:trVE.Stichera03.incipit	…
ltx/en_us_goadedes/tr.d026:trVE.Stichera03.melody	@ltx/en_us_goadedes/he.a.m5:heAU.OsiePater.name
ltx/en_us_goadedes/tr.d026:trVE.Stichera03.mode	@ltx/en_us_goadedes/miscellanea:misc.Mode5
ltx/en_us_goadedes/tr.d026:trVE.Stichera03.text	
ltx/en_us_goadedes/tr.d026:trVL.header	
