ltx/en_us_goadedes/pe.d106:peDA.commemoration.full	
ltx/en_us_goadedes/pe.d106:peDA.commemoration.short	
ltx/en_us_goadedes/pe.d106:peDA.dismissal	@ltx/en_us_goadedes/dismissals:dis00.resurrection
ltx/en_us_goadedes/pe.d106:peDA.insert1	
ltx/en_us_goadedes/pe.d106:peDA.insert2	
ltx/en_us_goadedes/pe.d106:peDA.note	
ltx/en_us_goadedes/pe.d106:peHO.commemorations	
ltx/en_us_goadedes/pe.d106:peHO.daytitle	
ltx/en_us_goadedes/pe.d106:peHO.description1	
ltx/en_us_goadedes/pe.d106:peHO.description2	
ltx/en_us_goadedes/pe.d106:peHO.note1	
ltx/en_us_goadedes/pe.d106:peHO.note2	
ltx/en_us_goadedes/pe.d106:peLI.Kontakion1.greekmelody	@ltx/en_us_goadedes/pe.d106:peMA.Kontakion1.greekmelody
ltx/en_us_goadedes/pe.d106:peLI.Kontakion1.incipit	@ltx/en_us_goadedes/pe.d106:peMA.Kontakion1.incipit
ltx/en_us_goadedes/pe.d106:peLI.Kontakion1.melody	@ltx/en_us_goadedes/pe.d106:peMA.Kontakion1.melody
ltx/en_us_goadedes/pe.d106:peLI.Kontakion1.mode	@ltx/en_us_goadedes/pe.d106:peMA.Kontakion1.mode
ltx/en_us_goadedes/pe.d106:peLI.Kontakion1.text	@ltx/en_us_goadedes/pe.d106:peMA.Kontakion1.text
ltx/en_us_goadedes/pe.d106:peLI.Megalynarion.text	
ltx/en_us_goadedes/pe.d106:peLI.TheotokosHymn.incipit	@ltx/en_us_goadedes/pe.d071:peMA.Ode9C1H.incipit
ltx/en_us_goadedes/pe.d106:peLI.TheotokosHymn.mode	@ltx/en_us_goadedes/miscellanea:misc.Mode1
ltx/en_us_goadedes/pe.d106:peLI.TheotokosHymn.text	@ltx/en_us_goadedes/pe.d071:peMA.Ode9C1H.text
ltx/en_us_goadedes/pe.d106:peLI.TheotokosHymnVerse.text	@ltx/en_us_goadedes/pe.d071:peMA.Ode9C1MKa.text
ltx/en_us_goadedes/pe.d106:peMA.C1.acrostic.notice1	
ltx/en_us_goadedes/pe.d106:peMA.C1.acrostic.notice2	
ltx/en_us_goadedes/pe.d106:peMA.C1.acrostic.text	
ltx/en_us_goadedes/pe.d106:peMA.C1.acrostic.title	
ltx/en_us_goadedes/pe.d106:peMA.C1.poet	@ltx/en_us_goadedes/poets:po.IosifThessalonikis
ltx/en_us_goadedes/pe.d106:peMA.C1.title	@ltx/en_us_goadedes/titles:ti.CanonBlindman
ltx/en_us_goadedes/pe.d106:peMA.C1.verse	@ltx/en_us_goadedes/prayers:pr.verse_God.text
ltx/en_us_goadedes/pe.d106:peMA.Exaposteilarion1.greekmelody	@ltx/en_us_goadedes/he.a.m2:heAU.SarkiYpnosas.greekname
ltx/en_us_goadedes/pe.d106:peMA.Exaposteilarion1.incipit	…
ltx/en_us_goadedes/pe.d106:peMA.Exaposteilarion1.melody	@ltx/en_us_goadedes/he.a.m2:heAU.SarkiYpnosas.name
ltx/en_us_goadedes/pe.d106:peMA.Exaposteilarion1.mode	@ltx/en_us_goadedes/miscellanea:misc.Mode2
ltx/en_us_goadedes/pe.d106:peMA.Exaposteilarion1.text	
ltx/en_us_goadedes/pe.d106:peMA.Exaposteilarion2.greekmelody	@ltx/en_us_goadedes/he.a.m2:heAU.GynaikesAkoutisthite.greekname
ltx/en_us_goadedes/pe.d106:peMA.Exaposteilarion2.incipit	…
ltx/en_us_goadedes/pe.d106:peMA.Exaposteilarion2.melody	@ltx/en_us_goadedes/he.a.m2:heAU.GynaikesAkoutisthite.name
ltx/en_us_goadedes/pe.d106:peMA.Exaposteilarion2.mode	@ltx/en_us_goadedes/miscellanea:misc.Mode2
ltx/en_us_goadedes/pe.d106:peMA.Exaposteilarion2.text	
ltx/en_us_goadedes/pe.d106:peMA.Kathisma11.greekmelody	@ltx/en_us_goadedes/he.a.m5:heAU.TonSynanarchonLogon.greekname
ltx/en_us_goadedes/pe.d106:peMA.Kathisma11.incipit	@ltx/en_us_goadedes/oc.m5.d1:ocMA.Kathisma11.incipit
ltx/en_us_goadedes/pe.d106:peMA.Kathisma11.melody	@ltx/en_us_goadedes/he.a.m5:heAU.TonSynanarchonLogon.name
ltx/en_us_goadedes/pe.d106:peMA.Kathisma11.mode	@ltx/en_us_goadedes/miscellanea:misc.Mode5
ltx/en_us_goadedes/pe.d106:peMA.Kathisma11.text	@ltx/en_us_goadedes/oc.m5.d1:ocMA.Kathisma11.text
ltx/en_us_goadedes/pe.d106:peMA.Kathisma12.incipit	@ltx/en_us_goadedes/oc.m5.d1:ocMA.Kathisma12.incipit
ltx/en_us_goadedes/pe.d106:peMA.Kathisma12.melody	
ltx/en_us_goadedes/pe.d106:peMA.Kathisma12.mode	@ltx/en_us_goadedes/miscellanea:misc.Mode5
ltx/en_us_goadedes/pe.d106:peMA.Kathisma12.text	@ltx/en_us_goadedes/oc.m5.d1:ocMA.Kathisma12.text
ltx/en_us_goadedes/pe.d106:peMA.Kathisma13.greekmelody	@ltx/en_us_goadedes/he.a.m5:heAU.TonSynanarchonLogon.greekname
ltx/en_us_goadedes/pe.d106:peMA.Kathisma13.incipit	@ltx/en_us_goadedes/oc.m5.d1:ocMA.Kathisma13.incipit
ltx/en_us_goadedes/pe.d106:peMA.Kathisma13.melody	@ltx/en_us_goadedes/he.a.m5:heAU.TonSynanarchonLogon.name
ltx/en_us_goadedes/pe.d106:peMA.Kathisma13.mode	@ltx/en_us_goadedes/miscellanea:misc.Mode5
ltx/en_us_goadedes/pe.d106:peMA.Kathisma13.text	@ltx/en_us_goadedes/oc.m5.d1:ocMA.Kathisma13.text
ltx/en_us_goadedes/pe.d106:peMA.Kathisma21.incipit	@ltx/en_us_goadedes/oc.m5.d1:ocMA.Kathisma22.incipit
ltx/en_us_goadedes/pe.d106:peMA.Kathisma21.melody	
ltx/en_us_goadedes/pe.d106:peMA.Kathisma21.mode	@ltx/en_us_goadedes/miscellanea:misc.Mode5
ltx/en_us_goadedes/pe.d106:peMA.Kathisma21.text	@ltx/en_us_goadedes/oc.m5.d1:ocMA.Kathisma22.text
ltx/en_us_goadedes/pe.d106:peMA.Kathisma22.incipit	…
ltx/en_us_goadedes/pe.d106:peMA.Kathisma22.melody	
ltx/en_us_goadedes/pe.d106:peMA.Kathisma22.mode	@ltx/en_us_goadedes/miscellanea:misc.Mode5
ltx/en_us_goadedes/pe.d106:peMA.Kathisma22.text	
ltx/en_us_goadedes/pe.d106:peMA.Kathisma23.greekmelody	@ltx/en_us_goadedes/he.a.m5:heAU.TonSynanarchonLogon.greekname
ltx/en_us_goadedes/pe.d106:peMA.Kathisma23.incipit	@ltx/en_us_goadedes/oc.m5.d1:ocMA.Kathisma23.incipit
ltx/en_us_goadedes/pe.d106:peMA.Kathisma23.melody	@ltx/en_us_goadedes/he.a.m5:heAU.TonSynanarchonLogon.name
ltx/en_us_goadedes/pe.d106:peMA.Kathisma23.mode	@ltx/en_us_goadedes/miscellanea:misc.Mode5
ltx/en_us_goadedes/pe.d106:peMA.Kathisma23.text	@ltx/en_us_goadedes/oc.m5.d1:ocMA.Kathisma23.text
ltx/en_us_goadedes/pe.d106:peMA.Kontakion1.greekmelody	@ltx/en_us_goadedes/he.a.m4:heAU.EpefanisSimeron.greekname
ltx/en_us_goadedes/pe.d106:peMA.Kontakion1.incipit	…
ltx/en_us_goadedes/pe.d106:peMA.Kontakion1.melody	@ltx/en_us_goadedes/he.a.m4:heAU.EpefanisSimeron.name
ltx/en_us_goadedes/pe.d106:peMA.Kontakion1.mode	@ltx/en_us_goadedes/miscellanea:misc.Mode4
ltx/en_us_goadedes/pe.d106:peMA.Kontakion1.text	
ltx/en_us_goadedes/pe.d106:peMA.Lauds1.incipit	@ltx/en_us_goadedes/oc.m5.d1:ocMA.Lauds1.incipit
ltx/en_us_goadedes/pe.d106:peMA.Lauds1.melody	@ltx/en_us_goadedes/oc.m5.d1:ocMA.Lauds1.melody
ltx/en_us_goadedes/pe.d106:peMA.Lauds1.mode	@ltx/en_us_goadedes/oc.m5.d1:ocMA.Lauds1.mode
ltx/en_us_goadedes/pe.d106:peMA.Lauds1.text	@ltx/en_us_goadedes/oc.m5.d1:ocMA.Lauds1.text
ltx/en_us_goadedes/pe.d106:peMA.Lauds2.incipit	@ltx/en_us_goadedes/oc.m5.d1:ocMA.Lauds2.incipit
ltx/en_us_goadedes/pe.d106:peMA.Lauds2.melody	@ltx/en_us_goadedes/oc.m5.d1:ocMA.Lauds2.melody
ltx/en_us_goadedes/pe.d106:peMA.Lauds2.mode	@ltx/en_us_goadedes/oc.m5.d1:ocMA.Lauds2.mode
ltx/en_us_goadedes/pe.d106:peMA.Lauds2.text	@ltx/en_us_goadedes/oc.m5.d1:ocMA.Lauds2.text
ltx/en_us_goadedes/pe.d106:peMA.Lauds3.incipit	@ltx/en_us_goadedes/oc.m5.d1:ocMA.Lauds3.incipit
ltx/en_us_goadedes/pe.d106:peMA.Lauds3.melody	@ltx/en_us_goadedes/oc.m5.d1:ocMA.Lauds3.melody
ltx/en_us_goadedes/pe.d106:peMA.Lauds3.mode	@ltx/en_us_goadedes/oc.m5.d1:ocMA.Lauds3.mode
ltx/en_us_goadedes/pe.d106:peMA.Lauds3.text	@ltx/en_us_goadedes/oc.m5.d1:ocMA.Lauds3.text
ltx/en_us_goadedes/pe.d106:peMA.Lauds4.incipit	@ltx/en_us_goadedes/oc.m5.d1:ocMA.Lauds4.incipit
ltx/en_us_goadedes/pe.d106:peMA.Lauds4.melody	@ltx/en_us_goadedes/oc.m5.d1:ocMA.Lauds4.melody
ltx/en_us_goadedes/pe.d106:peMA.Lauds4.mode	@ltx/en_us_goadedes/oc.m5.d1:ocMA.Lauds4.mode
ltx/en_us_goadedes/pe.d106:peMA.Lauds4.text	@ltx/en_us_goadedes/oc.m5.d1:ocMA.Lauds4.text
ltx/en_us_goadedes/pe.d106:peMA.Lauds8.incipit	In Your tender mercy…
ltx/en_us_goadedes/pe.d106:peMA.Lauds8.melody	@ltx/en_us_goadedes/miscellanea:misc.Idiomelon
ltx/en_us_goadedes/pe.d106:peMA.Lauds8.mode	@ltx/en_us_goadedes/miscellanea:misc.Mode8
ltx/en_us_goadedes/pe.d106:peMA.Lauds8.text	In Your tender mercy, You became incarnate, O Christ our God. And thus, in Your ineffable compassion, You granted divine luster to the man who from his mother’s womb was deprived of sight, when using Your creative fingers You anointed his eyes with clay. We entreat You, O Giver of light, to also illumine the senses of our souls, for You are the ultimate source of abundant blessings.
ltx/en_us_goadedes/pe.d106:peMA.LaudsGlory.incipit	…
ltx/en_us_goadedes/pe.d106:peMA.LaudsGlory.melody	@ltx/en_us_goadedes/miscellanea:misc.Idiomelon
ltx/en_us_goadedes/pe.d106:peMA.LaudsGlory.mode	@ltx/en_us_goadedes/miscellanea:misc.Mode8
ltx/en_us_goadedes/pe.d106:peMA.LaudsGlory.text	
ltx/en_us_goadedes/pe.d106:peMA.Ode1C11.greekmelody	@ltx/en_us_goadedes/he.h.m5:heHE.GinEfInOukElampsen.greekname
ltx/en_us_goadedes/pe.d106:peMA.Ode1C11.incipit	…
ltx/en_us_goadedes/pe.d106:peMA.Ode1C11.melody	@ltx/en_us_goadedes/he.h.m5:heHE.GinEfInOukElampsen.name
ltx/en_us_goadedes/pe.d106:peMA.Ode1C11.mode	@ltx/en_us_goadedes/miscellanea:misc.Mode5
ltx/en_us_goadedes/pe.d106:peMA.Ode1C11.ode	@ltx/en_us_goadedes/miscellanea:misc.Ode1
ltx/en_us_goadedes/pe.d106:peMA.Ode1C11.text	
ltx/en_us_goadedes/pe.d106:peMA.Ode1C12.incipit	…
ltx/en_us_goadedes/pe.d106:peMA.Ode1C12.melody	@ltx/en_us_goadedes/he.h.m5:heHE.GinEfInOukElampsen.name
ltx/en_us_goadedes/pe.d106:peMA.Ode1C12.mode	@ltx/en_us_goadedes/miscellanea:misc.Mode5
ltx/en_us_goadedes/pe.d106:peMA.Ode1C12.ode	@ltx/en_us_goadedes/miscellanea:misc.Ode1
ltx/en_us_goadedes/pe.d106:peMA.Ode1C12.text	
ltx/en_us_goadedes/pe.d106:peMA.Ode1C13.incipit	…
ltx/en_us_goadedes/pe.d106:peMA.Ode1C13.melody	@ltx/en_us_goadedes/he.h.m5:heHE.GinEfInOukElampsen.name
ltx/en_us_goadedes/pe.d106:peMA.Ode1C13.mode	@ltx/en_us_goadedes/miscellanea:misc.Mode5
ltx/en_us_goadedes/pe.d106:peMA.Ode1C13.ode	@ltx/en_us_goadedes/miscellanea:misc.Ode1
ltx/en_us_goadedes/pe.d106:peMA.Ode1C13.text	
ltx/en_us_goadedes/pe.d106:peMA.Ode1C1F1.greekmelody	@ltx/en_us_goadedes/he.h.m5:heHE.GinEfInOukElampsen.greekname
ltx/en_us_goadedes/pe.d106:peMA.Ode1C1F1.incipit	…
ltx/en_us_goadedes/pe.d106:peMA.Ode1C1F1.melody	@ltx/en_us_goadedes/he.h.m5:heHE.GinEfInOukElampsen.name
ltx/en_us_goadedes/pe.d106:peMA.Ode1C1F1.mode	@ltx/en_us_goadedes/miscellanea:misc.Mode5
ltx/en_us_goadedes/pe.d106:peMA.Ode1C1F1.ode	@ltx/en_us_goadedes/miscellanea:misc.Ode1
ltx/en_us_goadedes/pe.d106:peMA.Ode1C1F1.text	
ltx/en_us_goadedes/pe.d106:peMA.Ode1C1H.greekmelody	@ltx/en_us_goadedes/he.h.m5:heHE.GinEfInOukElampsen.greekname
ltx/en_us_goadedes/pe.d106:peMA.Ode1C1H.incipit	@ltx/en_us_goadedes/he.h.m5:heHE.GinEfInOukElampsen.incipit
ltx/en_us_goadedes/pe.d106:peMA.Ode1C1H.melody	@ltx/en_us_goadedes/he.h.m5:heHE.GinEfInOukElampsen.melody
ltx/en_us_goadedes/pe.d106:peMA.Ode1C1H.mode	@ltx/en_us_goadedes/miscellanea:misc.Mode5
ltx/en_us_goadedes/pe.d106:peMA.Ode1C1H.ode	@ltx/en_us_goadedes/miscellanea:misc.Ode1
ltx/en_us_goadedes/pe.d106:peMA.Ode1C1H.text	@ltx/en_us_goadedes/he.h.m5:heHE.GinEfInOukElampsen.text
ltx/en_us_goadedes/pe.d106:peMA.Ode1C1T.incipit	…
ltx/en_us_goadedes/pe.d106:peMA.Ode1C1T.melody	@ltx/en_us_goadedes/he.h.m5:heHE.GinEfInOukElampsen.name
ltx/en_us_goadedes/pe.d106:peMA.Ode1C1T.mode	@ltx/en_us_goadedes/miscellanea:misc.Mode5
ltx/en_us_goadedes/pe.d106:peMA.Ode1C1T.ode	@ltx/en_us_goadedes/miscellanea:misc.Ode1
ltx/en_us_goadedes/pe.d106:peMA.Ode1C1T.text	
ltx/en_us_goadedes/pe.d106:peMA.Ode1C1Tr.incipit	…
ltx/en_us_goadedes/pe.d106:peMA.Ode1C1Tr.melody	@ltx/en_us_goadedes/he.h.m5:heHE.GinEfInOukElampsen.name
ltx/en_us_goadedes/pe.d106:peMA.Ode1C1Tr.mode	@ltx/en_us_goadedes/miscellanea:misc.Mode5
ltx/en_us_goadedes/pe.d106:peMA.Ode1C1Tr.ode	@ltx/en_us_goadedes/miscellanea:misc.Ode1
ltx/en_us_goadedes/pe.d106:peMA.Ode1C1Tr.text	
ltx/en_us_goadedes/pe.d106:peMA.Ode3C11.greekmelody	@ltx/en_us_goadedes/he.h.m5:heHE.SalevomeninTinKardian.greekname
ltx/en_us_goadedes/pe.d106:peMA.Ode3C11.incipit	…
ltx/en_us_goadedes/pe.d106:peMA.Ode3C11.melody	@ltx/en_us_goadedes/he.h.m5:heHE.SalevomeninTinKardian.name
ltx/en_us_goadedes/pe.d106:peMA.Ode3C11.mode	@ltx/en_us_goadedes/miscellanea:misc.Mode5
ltx/en_us_goadedes/pe.d106:peMA.Ode3C11.ode	@ltx/en_us_goadedes/miscellanea:misc.Ode3
ltx/en_us_goadedes/pe.d106:peMA.Ode3C11.text	
ltx/en_us_goadedes/pe.d106:peMA.Ode3C12.incipit	…
ltx/en_us_goadedes/pe.d106:peMA.Ode3C12.melody	@ltx/en_us_goadedes/he.h.m5:heHE.SalevomeninTinKardian.name
ltx/en_us_goadedes/pe.d106:peMA.Ode3C12.mode	@ltx/en_us_goadedes/miscellanea:misc.Mode5
ltx/en_us_goadedes/pe.d106:peMA.Ode3C12.ode	@ltx/en_us_goadedes/miscellanea:misc.Ode3
ltx/en_us_goadedes/pe.d106:peMA.Ode3C12.text	
ltx/en_us_goadedes/pe.d106:peMA.Ode3C13.incipit	…
ltx/en_us_goadedes/pe.d106:peMA.Ode3C13.melody	@ltx/en_us_goadedes/he.h.m5:heHE.SalevomeninTinKardian.name
ltx/en_us_goadedes/pe.d106:peMA.Ode3C13.mode	@ltx/en_us_goadedes/miscellanea:misc.Mode5
ltx/en_us_goadedes/pe.d106:peMA.Ode3C13.ode	@ltx/en_us_goadedes/miscellanea:misc.Ode3
ltx/en_us_goadedes/pe.d106:peMA.Ode3C13.text	
ltx/en_us_goadedes/pe.d106:peMA.Ode3C1F1.greekmelody	@ltx/en_us_goadedes/he.h.m5:heHE.SalevomeninTinKardian.greekname
ltx/en_us_goadedes/pe.d106:peMA.Ode3C1F1.incipit	…
ltx/en_us_goadedes/pe.d106:peMA.Ode3C1F1.melody	@ltx/en_us_goadedes/he.h.m5:heHE.SalevomeninTinKardian.name
ltx/en_us_goadedes/pe.d106:peMA.Ode3C1F1.mode	@ltx/en_us_goadedes/miscellanea:misc.Mode5
ltx/en_us_goadedes/pe.d106:peMA.Ode3C1F1.ode	@ltx/en_us_goadedes/miscellanea:misc.Ode3
ltx/en_us_goadedes/pe.d106:peMA.Ode3C1F1.text	
ltx/en_us_goadedes/pe.d106:peMA.Ode3C1H.greekmelody	@ltx/en_us_goadedes/he.h.m5:heHE.SalevomeninTinKardian.greekname
ltx/en_us_goadedes/pe.d106:peMA.Ode3C1H.incipit	@ltx/en_us_goadedes/he.h.m5:heHE.SalevomeninTinKardian.incipit
ltx/en_us_goadedes/pe.d106:peMA.Ode3C1H.melody	@ltx/en_us_goadedes/he.h.m5:heHE.SalevomeninTinKardian.melody
ltx/en_us_goadedes/pe.d106:peMA.Ode3C1H.mode	@ltx/en_us_goadedes/miscellanea:misc.Mode5
ltx/en_us_goadedes/pe.d106:peMA.Ode3C1H.ode	@ltx/en_us_goadedes/miscellanea:misc.Ode3
ltx/en_us_goadedes/pe.d106:peMA.Ode3C1H.text	@ltx/en_us_goadedes/he.h.m5:heHE.SalevomeninTinKardian.text
ltx/en_us_goadedes/pe.d106:peMA.Ode3C1T.incipit	…
ltx/en_us_goadedes/pe.d106:peMA.Ode3C1T.melody	@ltx/en_us_goadedes/he.h.m5:heHE.SalevomeninTinKardian.name
ltx/en_us_goadedes/pe.d106:peMA.Ode3C1T.mode	@ltx/en_us_goadedes/miscellanea:misc.Mode5
ltx/en_us_goadedes/pe.d106:peMA.Ode3C1T.ode	@ltx/en_us_goadedes/miscellanea:misc.Ode3
ltx/en_us_goadedes/pe.d106:peMA.Ode3C1T.text	
ltx/en_us_goadedes/pe.d106:peMA.Ode3C1Tr.incipit	…
ltx/en_us_goadedes/pe.d106:peMA.Ode3C1Tr.melody	@ltx/en_us_goadedes/he.h.m5:heHE.SalevomeninTinKardian.name
ltx/en_us_goadedes/pe.d106:peMA.Ode3C1Tr.mode	@ltx/en_us_goadedes/miscellanea:misc.Mode5
ltx/en_us_goadedes/pe.d106:peMA.Ode3C1Tr.ode	@ltx/en_us_goadedes/miscellanea:misc.Ode3
ltx/en_us_goadedes/pe.d106:peMA.Ode3C1Tr.text	
ltx/en_us_goadedes/pe.d106:peMA.Ode3Kathisma1.greekmelody	@ltx/en_us_goadedes/he.a.m8:heAU.TinSofianKaiLogon.greekname
ltx/en_us_goadedes/pe.d106:peMA.Ode3Kathisma1.incipit	The Creator and Master…
ltx/en_us_goadedes/pe.d106:peMA.Ode3Kathisma1.melody	@ltx/en_us_goadedes/he.a.m8:heAU.TinSofianKaiLogon.name
ltx/en_us_goadedes/pe.d106:peMA.Ode3Kathisma1.mode	@ltx/en_us_goadedes/miscellanea:misc.Mode8
ltx/en_us_goadedes/pe.d106:peMA.Ode3Kathisma1.text	The Creator and Master of all the world, * passing by, saw a man who was blind from birth, * who sat on the road and begged * and lamented and said to Him, * “All my life I have never been able to see the sun * that illumines the day, nor the moon that lights up the night. * So I now implore You, who were born of of Virgin, * to give light to all the world, that you also give sight to me, * and with cries I will worship You. * Lord and Savior, Christ my God, I entreat You for forgiveness of my sins, * in Your plentiful mercy and love for humanity.”
ltx/en_us_goadedes/pe.d106:peMA.Ode4C11.greekmelody	@ltx/en_us_goadedes/he.h.m5:heHE.AkikoaKyrieTinAkoin.greekname
ltx/en_us_goadedes/pe.d106:peMA.Ode4C11.incipit	…
ltx/en_us_goadedes/pe.d106:peMA.Ode4C11.melody	@ltx/en_us_goadedes/he.h.m5:heHE.AkikoaKyrieTinAkoin.name
ltx/en_us_goadedes/pe.d106:peMA.Ode4C11.mode	@ltx/en_us_goadedes/miscellanea:misc.Mode5
ltx/en_us_goadedes/pe.d106:peMA.Ode4C11.ode	@ltx/en_us_goadedes/miscellanea:misc.Ode4
ltx/en_us_goadedes/pe.d106:peMA.Ode4C11.text	
ltx/en_us_goadedes/pe.d106:peMA.Ode4C12.incipit	…
ltx/en_us_goadedes/pe.d106:peMA.Ode4C12.melody	@ltx/en_us_goadedes/he.h.m5:heHE.AkikoaKyrieTinAkoin.name
ltx/en_us_goadedes/pe.d106:peMA.Ode4C12.mode	@ltx/en_us_goadedes/miscellanea:misc.Mode5
ltx/en_us_goadedes/pe.d106:peMA.Ode4C12.ode	@ltx/en_us_goadedes/miscellanea:misc.Ode4
ltx/en_us_goadedes/pe.d106:peMA.Ode4C12.text	
ltx/en_us_goadedes/pe.d106:peMA.Ode4C13.incipit	…
ltx/en_us_goadedes/pe.d106:peMA.Ode4C13.melody	@ltx/en_us_goadedes/he.h.m5:heHE.AkikoaKyrieTinAkoin.name
ltx/en_us_goadedes/pe.d106:peMA.Ode4C13.mode	@ltx/en_us_goadedes/miscellanea:misc.Mode5
ltx/en_us_goadedes/pe.d106:peMA.Ode4C13.ode	@ltx/en_us_goadedes/miscellanea:misc.Ode4
ltx/en_us_goadedes/pe.d106:peMA.Ode4C13.text	
ltx/en_us_goadedes/pe.d106:peMA.Ode4C1F1.greekmelody	@ltx/en_us_goadedes/he.h.m5:heHE.AkikoaKyrieTinAkoin.greekname
ltx/en_us_goadedes/pe.d106:peMA.Ode4C1F1.incipit	…
ltx/en_us_goadedes/pe.d106:peMA.Ode4C1F1.melody	@ltx/en_us_goadedes/he.h.m5:heHE.AkikoaKyrieTinAkoin.name
ltx/en_us_goadedes/pe.d106:peMA.Ode4C1F1.mode	@ltx/en_us_goadedes/miscellanea:misc.Mode5
ltx/en_us_goadedes/pe.d106:peMA.Ode4C1F1.ode	@ltx/en_us_goadedes/miscellanea:misc.Ode4
ltx/en_us_goadedes/pe.d106:peMA.Ode4C1F1.text	
ltx/en_us_goadedes/pe.d106:peMA.Ode4C1H.greekmelody	@ltx/en_us_goadedes/he.h.m5:heHE.AkikoaKyrieTinAkoin.greekname
ltx/en_us_goadedes/pe.d106:peMA.Ode4C1H.incipit	@ltx/en_us_goadedes/he.h.m5:heHE.AkikoaKyrieTinAkoin.incipit
ltx/en_us_goadedes/pe.d106:peMA.Ode4C1H.melody	@ltx/en_us_goadedes/he.h.m5:heHE.AkikoaKyrieTinAkoin.melody
ltx/en_us_goadedes/pe.d106:peMA.Ode4C1H.mode	@ltx/en_us_goadedes/miscellanea:misc.Mode5
ltx/en_us_goadedes/pe.d106:peMA.Ode4C1H.ode	@ltx/en_us_goadedes/miscellanea:misc.Ode4
ltx/en_us_goadedes/pe.d106:peMA.Ode4C1H.text	@ltx/en_us_goadedes/he.h.m5:heHE.AkikoaKyrieTinAkoin.text
ltx/en_us_goadedes/pe.d106:peMA.Ode4C1T.incipit	…
ltx/en_us_goadedes/pe.d106:peMA.Ode4C1T.melody	@ltx/en_us_goadedes/he.h.m5:heHE.AkikoaKyrieTinAkoin.name
ltx/en_us_goadedes/pe.d106:peMA.Ode4C1T.mode	@ltx/en_us_goadedes/miscellanea:misc.Mode5
ltx/en_us_goadedes/pe.d106:peMA.Ode4C1T.ode	@ltx/en_us_goadedes/miscellanea:misc.Ode4
ltx/en_us_goadedes/pe.d106:peMA.Ode4C1T.text	
ltx/en_us_goadedes/pe.d106:peMA.Ode4C1Tr.incipit	…
ltx/en_us_goadedes/pe.d106:peMA.Ode4C1Tr.melody	@ltx/en_us_goadedes/he.h.m5:heHE.AkikoaKyrieTinAkoin.name
ltx/en_us_goadedes/pe.d106:peMA.Ode4C1Tr.mode	@ltx/en_us_goadedes/miscellanea:misc.Mode5
ltx/en_us_goadedes/pe.d106:peMA.Ode4C1Tr.ode	@ltx/en_us_goadedes/miscellanea:misc.Ode4
ltx/en_us_goadedes/pe.d106:peMA.Ode4C1Tr.text	
ltx/en_us_goadedes/pe.d106:peMA.Ode5C11.greekmelody	@ltx/en_us_goadedes/he.h.m5:heHE.TinTalainanPsychinMou.greekname
ltx/en_us_goadedes/pe.d106:peMA.Ode5C11.incipit	…
ltx/en_us_goadedes/pe.d106:peMA.Ode5C11.melody	@ltx/en_us_goadedes/he.h.m5:heHE.TinTalainanPsychinMou.name
ltx/en_us_goadedes/pe.d106:peMA.Ode5C11.mode	@ltx/en_us_goadedes/miscellanea:misc.Mode5
ltx/en_us_goadedes/pe.d106:peMA.Ode5C11.ode	@ltx/en_us_goadedes/miscellanea:misc.Ode5
ltx/en_us_goadedes/pe.d106:peMA.Ode5C11.text	
ltx/en_us_goadedes/pe.d106:peMA.Ode5C12.incipit	…
ltx/en_us_goadedes/pe.d106:peMA.Ode5C12.melody	@ltx/en_us_goadedes/he.h.m5:heHE.TinTalainanPsychinMou.name
ltx/en_us_goadedes/pe.d106:peMA.Ode5C12.mode	@ltx/en_us_goadedes/miscellanea:misc.Mode5
ltx/en_us_goadedes/pe.d106:peMA.Ode5C12.ode	@ltx/en_us_goadedes/miscellanea:misc.Ode5
ltx/en_us_goadedes/pe.d106:peMA.Ode5C12.text	
ltx/en_us_goadedes/pe.d106:peMA.Ode5C13.incipit	…
ltx/en_us_goadedes/pe.d106:peMA.Ode5C13.melody	@ltx/en_us_goadedes/he.h.m5:heHE.TinTalainanPsychinMou.name
ltx/en_us_goadedes/pe.d106:peMA.Ode5C13.mode	@ltx/en_us_goadedes/miscellanea:misc.Mode5
ltx/en_us_goadedes/pe.d106:peMA.Ode5C13.ode	@ltx/en_us_goadedes/miscellanea:misc.Ode5
ltx/en_us_goadedes/pe.d106:peMA.Ode5C13.text	
ltx/en_us_goadedes/pe.d106:peMA.Ode5C1F1.greekmelody	@ltx/en_us_goadedes/he.h.m5:heHE.TinTalainanPsychinMou.greekname
ltx/en_us_goadedes/pe.d106:peMA.Ode5C1F1.incipit	…
ltx/en_us_goadedes/pe.d106:peMA.Ode5C1F1.melody	@ltx/en_us_goadedes/he.h.m5:heHE.TinTalainanPsychinMou.name
ltx/en_us_goadedes/pe.d106:peMA.Ode5C1F1.mode	@ltx/en_us_goadedes/miscellanea:misc.Mode5
ltx/en_us_goadedes/pe.d106:peMA.Ode5C1F1.ode	@ltx/en_us_goadedes/miscellanea:misc.Ode5
ltx/en_us_goadedes/pe.d106:peMA.Ode5C1F1.text	
ltx/en_us_goadedes/pe.d106:peMA.Ode5C1H.greekmelody	@ltx/en_us_goadedes/he.h.m5:heHE.TinTalainanPsychinMou.greekname
ltx/en_us_goadedes/pe.d106:peMA.Ode5C1H.incipit	@ltx/en_us_goadedes/he.h.m5:heHE.TinTalainanPsychinMou.incipit
ltx/en_us_goadedes/pe.d106:peMA.Ode5C1H.melody	@ltx/en_us_goadedes/he.h.m5:heHE.TinTalainanPsychinMou.melody
ltx/en_us_goadedes/pe.d106:peMA.Ode5C1H.mode	@ltx/en_us_goadedes/miscellanea:misc.Mode5
ltx/en_us_goadedes/pe.d106:peMA.Ode5C1H.ode	@ltx/en_us_goadedes/miscellanea:misc.Ode5
ltx/en_us_goadedes/pe.d106:peMA.Ode5C1H.text	@ltx/en_us_goadedes/he.h.m5:heHE.TinTalainanPsychinMou.text
ltx/en_us_goadedes/pe.d106:peMA.Ode5C1T.incipit	…
ltx/en_us_goadedes/pe.d106:peMA.Ode5C1T.melody	@ltx/en_us_goadedes/he.h.m5:heHE.TinTalainanPsychinMou.name
ltx/en_us_goadedes/pe.d106:peMA.Ode5C1T.mode	@ltx/en_us_goadedes/miscellanea:misc.Mode5
ltx/en_us_goadedes/pe.d106:peMA.Ode5C1T.ode	@ltx/en_us_goadedes/miscellanea:misc.Ode5
ltx/en_us_goadedes/pe.d106:peMA.Ode5C1T.text	
ltx/en_us_goadedes/pe.d106:peMA.Ode5C1Tr.incipit	…
ltx/en_us_goadedes/pe.d106:peMA.Ode5C1Tr.melody	@ltx/en_us_goadedes/he.h.m5:heHE.TinTalainanPsychinMou.name
ltx/en_us_goadedes/pe.d106:peMA.Ode5C1Tr.mode	@ltx/en_us_goadedes/miscellanea:misc.Mode5
ltx/en_us_goadedes/pe.d106:peMA.Ode5C1Tr.ode	@ltx/en_us_goadedes/miscellanea:misc.Ode5
ltx/en_us_goadedes/pe.d106:peMA.Ode5C1Tr.text	
ltx/en_us_goadedes/pe.d106:peMA.Ode6C11.greekmelody	@ltx/en_us_goadedes/he.h.m5:heHE.OsTonProfitinTouThiros.greekname
ltx/en_us_goadedes/pe.d106:peMA.Ode6C11.incipit	Among the robbers…
ltx/en_us_goadedes/pe.d106:peMA.Ode6C11.melody	@ltx/en_us_goadedes/he.h.m5:heHE.OsTonProfitinTouThiros.name
ltx/en_us_goadedes/pe.d106:peMA.Ode6C11.mode	@ltx/en_us_goadedes/miscellanea:misc.Mode5
ltx/en_us_goadedes/pe.d106:peMA.Ode6C11.ode	@ltx/en_us_goadedes/miscellanea:misc.Ode6
ltx/en_us_goadedes/pe.d106:peMA.Ode6C11.text	Among the robbers You were crucified, O loving Lord. * O Master, You saved from evil robbers and passions that destroy the soul * all who in unison extol Your crucifixion and Your resurrection.
ltx/en_us_goadedes/pe.d106:peMA.Ode6C12.incipit	…
ltx/en_us_goadedes/pe.d106:peMA.Ode6C12.melody	@ltx/en_us_goadedes/he.h.m5:heHE.OsTonProfitinTouThiros.name
ltx/en_us_goadedes/pe.d106:peMA.Ode6C12.mode	@ltx/en_us_goadedes/miscellanea:misc.Mode5
ltx/en_us_goadedes/pe.d106:peMA.Ode6C12.ode	@ltx/en_us_goadedes/miscellanea:misc.Ode6
ltx/en_us_goadedes/pe.d106:peMA.Ode6C12.text	
ltx/en_us_goadedes/pe.d106:peMA.Ode6C13.incipit	…
ltx/en_us_goadedes/pe.d106:peMA.Ode6C13.melody	@ltx/en_us_goadedes/he.h.m5:heHE.OsTonProfitinTouThiros.name
ltx/en_us_goadedes/pe.d106:peMA.Ode6C13.mode	@ltx/en_us_goadedes/miscellanea:misc.Mode5
ltx/en_us_goadedes/pe.d106:peMA.Ode6C13.ode	@ltx/en_us_goadedes/miscellanea:misc.Ode6
ltx/en_us_goadedes/pe.d106:peMA.Ode6C13.text	
ltx/en_us_goadedes/pe.d106:peMA.Ode6C1F1.greekmelody	@ltx/en_us_goadedes/he.h.m5:heHE.OsTonProfitinTouThiros.greekname
ltx/en_us_goadedes/pe.d106:peMA.Ode6C1F1.incipit	O Lord, You spat…
ltx/en_us_goadedes/pe.d106:peMA.Ode6C1F1.melody	@ltx/en_us_goadedes/he.h.m5:heHE.OsTonProfitinTouThiros.name
ltx/en_us_goadedes/pe.d106:peMA.Ode6C1F1.mode	@ltx/en_us_goadedes/miscellanea:misc.Mode5
ltx/en_us_goadedes/pe.d106:peMA.Ode6C1F1.ode	@ltx/en_us_goadedes/miscellanea:misc.Ode6
ltx/en_us_goadedes/pe.d106:peMA.Ode6C1F1.text	O Lord, You spat upon the ground, with spittle making clay, * anointed the eyes of someone blind from his birth, and gave him the gift of sight. * And he extolled Your immaculate might, by which You saved the world, O Logos.
ltx/en_us_goadedes/pe.d106:peMA.Ode6C1H.greekmelody	@ltx/en_us_goadedes/he.h.m5:heHE.OsTonProfitinTouThiros.greekname
ltx/en_us_goadedes/pe.d106:peMA.Ode6C1H.incipit	@ltx/en_us_goadedes/he.h.m5:heHE.OsTonProfitinTouThiros.incipit
ltx/en_us_goadedes/pe.d106:peMA.Ode6C1H.melody	@ltx/en_us_goadedes/he.h.m5:heHE.OsTonProfitinTouThiros.melody
ltx/en_us_goadedes/pe.d106:peMA.Ode6C1H.mode	@ltx/en_us_goadedes/miscellanea:misc.Mode5
ltx/en_us_goadedes/pe.d106:peMA.Ode6C1H.ode	@ltx/en_us_goadedes/miscellanea:misc.Ode6
ltx/en_us_goadedes/pe.d106:peMA.Ode6C1H.text	@ltx/en_us_goadedes/he.h.m5:heHE.OsTonProfitinTouThiros.text
ltx/en_us_goadedes/pe.d106:peMA.Ode6C1T.incipit	All-blameless Virgin…
ltx/en_us_goadedes/pe.d106:peMA.Ode6C1T.melody	@ltx/en_us_goadedes/he.h.m5:heHE.OsTonProfitinTouThiros.name
ltx/en_us_goadedes/pe.d106:peMA.Ode6C1T.mode	@ltx/en_us_goadedes/miscellanea:misc.Mode5
ltx/en_us_goadedes/pe.d106:peMA.Ode6C1T.ode	@ltx/en_us_goadedes/miscellanea:misc.Ode6
ltx/en_us_goadedes/pe.d106:peMA.Ode6C1T.text	All-blameless Virgin, who can speak of your magnificence? * Ineffably you gave birth to God in the flesh; and through you He saved the world, * and He released it from every sin, O all-immaculate Lady.
ltx/en_us_goadedes/pe.d106:peMA.Ode6C1Tr.incipit	Thrice-holy Lord…
ltx/en_us_goadedes/pe.d106:peMA.Ode6C1Tr.melody	@ltx/en_us_goadedes/he.h.m5:heHE.OsTonProfitinTouThiros.name
ltx/en_us_goadedes/pe.d106:peMA.Ode6C1Tr.mode	@ltx/en_us_goadedes/miscellanea:misc.Mode5
ltx/en_us_goadedes/pe.d106:peMA.Ode6C1Tr.ode	@ltx/en_us_goadedes/miscellanea:misc.Ode6
ltx/en_us_goadedes/pe.d106:peMA.Ode6C1Tr.text	Thrice-holy Lord, the single God in three hypostases, * O unbegotten Father and begotten Son and Spirit who proceeds, * one in essence and omnipotence: we pray You save all Your people.
ltx/en_us_goadedes/pe.d106:peMA.Ode7C11.greekmelody	@ltx/en_us_goadedes/he.h.m5:heHE.PyrosSvestirion.greekname
ltx/en_us_goadedes/pe.d106:peMA.Ode7C11.incipit	…
ltx/en_us_goadedes/pe.d106:peMA.Ode7C11.melody	@ltx/en_us_goadedes/he.h.m5:heHE.PyrosSvestirion.name
ltx/en_us_goadedes/pe.d106:peMA.Ode7C11.mode	@ltx/en_us_goadedes/miscellanea:misc.Mode5
ltx/en_us_goadedes/pe.d106:peMA.Ode7C11.ode	@ltx/en_us_goadedes/miscellanea:misc.Ode7
ltx/en_us_goadedes/pe.d106:peMA.Ode7C11.text	
ltx/en_us_goadedes/pe.d106:peMA.Ode7C12.incipit	…
ltx/en_us_goadedes/pe.d106:peMA.Ode7C12.melody	@ltx/en_us_goadedes/he.h.m5:heHE.PyrosSvestirion.name
ltx/en_us_goadedes/pe.d106:peMA.Ode7C12.mode	@ltx/en_us_goadedes/miscellanea:misc.Mode5
ltx/en_us_goadedes/pe.d106:peMA.Ode7C12.ode	@ltx/en_us_goadedes/miscellanea:misc.Ode7
ltx/en_us_goadedes/pe.d106:peMA.Ode7C12.text	
ltx/en_us_goadedes/pe.d106:peMA.Ode7C13.incipit	…
ltx/en_us_goadedes/pe.d106:peMA.Ode7C13.melody	@ltx/en_us_goadedes/he.h.m5:heHE.PyrosSvestirion.name
ltx/en_us_goadedes/pe.d106:peMA.Ode7C13.mode	@ltx/en_us_goadedes/miscellanea:misc.Mode5
ltx/en_us_goadedes/pe.d106:peMA.Ode7C13.ode	@ltx/en_us_goadedes/miscellanea:misc.Ode7
ltx/en_us_goadedes/pe.d106:peMA.Ode7C13.text	
ltx/en_us_goadedes/pe.d106:peMA.Ode7C1F1.greekmelody	@ltx/en_us_goadedes/he.h.m5:heHE.PyrosSvestirion.greekname
ltx/en_us_goadedes/pe.d106:peMA.Ode7C1F1.incipit	…
ltx/en_us_goadedes/pe.d106:peMA.Ode7C1F1.melody	@ltx/en_us_goadedes/he.h.m5:heHE.PyrosSvestirion.name
ltx/en_us_goadedes/pe.d106:peMA.Ode7C1F1.mode	@ltx/en_us_goadedes/miscellanea:misc.Mode5
ltx/en_us_goadedes/pe.d106:peMA.Ode7C1F1.ode	@ltx/en_us_goadedes/miscellanea:misc.Ode7
ltx/en_us_goadedes/pe.d106:peMA.Ode7C1F1.text	
ltx/en_us_goadedes/pe.d106:peMA.Ode7C1H.greekmelody	@ltx/en_us_goadedes/he.h.m5:heHE.PyrosSvestirion.greekname
ltx/en_us_goadedes/pe.d106:peMA.Ode7C1H.incipit	@ltx/en_us_goadedes/he.h.m5:heHE.PyrosSvestirion.incipit
ltx/en_us_goadedes/pe.d106:peMA.Ode7C1H.melody	@ltx/en_us_goadedes/he.h.m5:heHE.PyrosSvestirion.melody
ltx/en_us_goadedes/pe.d106:peMA.Ode7C1H.mode	@ltx/en_us_goadedes/miscellanea:misc.Mode5
ltx/en_us_goadedes/pe.d106:peMA.Ode7C1H.ode	@ltx/en_us_goadedes/miscellanea:misc.Ode7
ltx/en_us_goadedes/pe.d106:peMA.Ode7C1H.text	@ltx/en_us_goadedes/he.h.m5:heHE.PyrosSvestirion.text
ltx/en_us_goadedes/pe.d106:peMA.Ode7C1T.incipit	…
ltx/en_us_goadedes/pe.d106:peMA.Ode7C1T.melody	@ltx/en_us_goadedes/he.h.m5:heHE.PyrosSvestirion.name
ltx/en_us_goadedes/pe.d106:peMA.Ode7C1T.mode	@ltx/en_us_goadedes/miscellanea:misc.Mode5
ltx/en_us_goadedes/pe.d106:peMA.Ode7C1T.ode	@ltx/en_us_goadedes/miscellanea:misc.Ode7
ltx/en_us_goadedes/pe.d106:peMA.Ode7C1T.text	
ltx/en_us_goadedes/pe.d106:peMA.Ode7C1Tr.incipit	…
ltx/en_us_goadedes/pe.d106:peMA.Ode7C1Tr.melody	@ltx/en_us_goadedes/he.h.m5:heHE.PyrosSvestirion.name
ltx/en_us_goadedes/pe.d106:peMA.Ode7C1Tr.mode	@ltx/en_us_goadedes/miscellanea:misc.Mode5
ltx/en_us_goadedes/pe.d106:peMA.Ode7C1Tr.ode	@ltx/en_us_goadedes/miscellanea:misc.Ode7
ltx/en_us_goadedes/pe.d106:peMA.Ode7C1Tr.text	
ltx/en_us_goadedes/pe.d106:peMA.Ode8C11.greekmelody	@ltx/en_us_goadedes/he.h.m5:heHE.AngelonSystima.greekname
ltx/en_us_goadedes/pe.d106:peMA.Ode8C11.incipit	…
ltx/en_us_goadedes/pe.d106:peMA.Ode8C11.melody	@ltx/en_us_goadedes/he.h.m5:heHE.AngelonSystima.name
ltx/en_us_goadedes/pe.d106:peMA.Ode8C11.mode	@ltx/en_us_goadedes/miscellanea:misc.Mode5
ltx/en_us_goadedes/pe.d106:peMA.Ode8C11.ode	@ltx/en_us_goadedes/miscellanea:misc.Ode8
ltx/en_us_goadedes/pe.d106:peMA.Ode8C11.text	
ltx/en_us_goadedes/pe.d106:peMA.Ode8C12.incipit	…
ltx/en_us_goadedes/pe.d106:peMA.Ode8C12.melody	@ltx/en_us_goadedes/he.h.m5:heHE.AngelonSystima.name
ltx/en_us_goadedes/pe.d106:peMA.Ode8C12.mode	@ltx/en_us_goadedes/miscellanea:misc.Mode5
ltx/en_us_goadedes/pe.d106:peMA.Ode8C12.ode	@ltx/en_us_goadedes/miscellanea:misc.Ode8
ltx/en_us_goadedes/pe.d106:peMA.Ode8C12.text	
ltx/en_us_goadedes/pe.d106:peMA.Ode8C13.incipit	…
ltx/en_us_goadedes/pe.d106:peMA.Ode8C13.melody	@ltx/en_us_goadedes/he.h.m5:heHE.AngelonSystima.name
ltx/en_us_goadedes/pe.d106:peMA.Ode8C13.mode	@ltx/en_us_goadedes/miscellanea:misc.Mode5
ltx/en_us_goadedes/pe.d106:peMA.Ode8C13.ode	@ltx/en_us_goadedes/miscellanea:misc.Ode8
ltx/en_us_goadedes/pe.d106:peMA.Ode8C13.text	
ltx/en_us_goadedes/pe.d106:peMA.Ode8C1F1.greekmelody	@ltx/en_us_goadedes/he.h.m5:heHE.AngelonSystima.greekname
ltx/en_us_goadedes/pe.d106:peMA.Ode8C1F1.incipit	…
ltx/en_us_goadedes/pe.d106:peMA.Ode8C1F1.melody	@ltx/en_us_goadedes/he.h.m5:heHE.AngelonSystima.name
ltx/en_us_goadedes/pe.d106:peMA.Ode8C1F1.mode	@ltx/en_us_goadedes/miscellanea:misc.Mode5
ltx/en_us_goadedes/pe.d106:peMA.Ode8C1F1.ode	@ltx/en_us_goadedes/miscellanea:misc.Ode8
ltx/en_us_goadedes/pe.d106:peMA.Ode8C1F1.text	
ltx/en_us_goadedes/pe.d106:peMA.Ode8C1H.greekmelody	@ltx/en_us_goadedes/he.h.m5:heHE.AngelonSystima.greekname
ltx/en_us_goadedes/pe.d106:peMA.Ode8C1H.incipit	@ltx/en_us_goadedes/he.h.m5:heHE.AngelonSystima.incipit
ltx/en_us_goadedes/pe.d106:peMA.Ode8C1H.melody	@ltx/en_us_goadedes/he.h.m5:heHE.AngelonSystima.melody
ltx/en_us_goadedes/pe.d106:peMA.Ode8C1H.mode	@ltx/en_us_goadedes/miscellanea:misc.Mode5
ltx/en_us_goadedes/pe.d106:peMA.Ode8C1H.ode	@ltx/en_us_goadedes/miscellanea:misc.Ode8
ltx/en_us_goadedes/pe.d106:peMA.Ode8C1H.text	@ltx/en_us_goadedes/he.h.m5:heHE.AngelonSystima.text
ltx/en_us_goadedes/pe.d106:peMA.Ode8C1T.incipit	…
ltx/en_us_goadedes/pe.d106:peMA.Ode8C1T.melody	@ltx/en_us_goadedes/he.h.m5:heHE.AngelonSystima.name
ltx/en_us_goadedes/pe.d106:peMA.Ode8C1T.mode	@ltx/en_us_goadedes/miscellanea:misc.Mode5
ltx/en_us_goadedes/pe.d106:peMA.Ode8C1T.ode	@ltx/en_us_goadedes/miscellanea:misc.Ode8
ltx/en_us_goadedes/pe.d106:peMA.Ode8C1T.text	
ltx/en_us_goadedes/pe.d106:peMA.Ode8C1Tr.incipit	…
ltx/en_us_goadedes/pe.d106:peMA.Ode8C1Tr.melody	@ltx/en_us_goadedes/he.h.m5:heHE.AngelonSystima.name
ltx/en_us_goadedes/pe.d106:peMA.Ode8C1Tr.mode	@ltx/en_us_goadedes/miscellanea:misc.Mode5
ltx/en_us_goadedes/pe.d106:peMA.Ode8C1Tr.ode	@ltx/en_us_goadedes/miscellanea:misc.Ode8
ltx/en_us_goadedes/pe.d106:peMA.Ode8C1Tr.text	
ltx/en_us_goadedes/pe.d106:peMA.Ode9C11.greekmelody	@ltx/en_us_goadedes/he.h.m5:heHE.OtiEpoiiseSoiMegaleia.greekname
ltx/en_us_goadedes/pe.d106:peMA.Ode9C11.incipit	…
ltx/en_us_goadedes/pe.d106:peMA.Ode9C11.melody	@ltx/en_us_goadedes/he.h.m5:heHE.OtiEpoiiseSoiMegaleia.name
ltx/en_us_goadedes/pe.d106:peMA.Ode9C11.mode	@ltx/en_us_goadedes/miscellanea:misc.Mode5
ltx/en_us_goadedes/pe.d106:peMA.Ode9C11.ode	@ltx/en_us_goadedes/miscellanea:misc.Ode9
ltx/en_us_goadedes/pe.d106:peMA.Ode9C11.text	
ltx/en_us_goadedes/pe.d106:peMA.Ode9C12.incipit	…
ltx/en_us_goadedes/pe.d106:peMA.Ode9C12.melody	@ltx/en_us_goadedes/he.h.m5:heHE.OtiEpoiiseSoiMegaleia.name
ltx/en_us_goadedes/pe.d106:peMA.Ode9C12.mode	@ltx/en_us_goadedes/miscellanea:misc.Mode5
ltx/en_us_goadedes/pe.d106:peMA.Ode9C12.ode	@ltx/en_us_goadedes/miscellanea:misc.Ode9
ltx/en_us_goadedes/pe.d106:peMA.Ode9C12.text	
ltx/en_us_goadedes/pe.d106:peMA.Ode9C13.incipit	…
ltx/en_us_goadedes/pe.d106:peMA.Ode9C13.melody	@ltx/en_us_goadedes/he.h.m5:heHE.OtiEpoiiseSoiMegaleia.name
ltx/en_us_goadedes/pe.d106:peMA.Ode9C13.mode	@ltx/en_us_goadedes/miscellanea:misc.Mode5
ltx/en_us_goadedes/pe.d106:peMA.Ode9C13.ode	@ltx/en_us_goadedes/miscellanea:misc.Ode9
ltx/en_us_goadedes/pe.d106:peMA.Ode9C13.text	
ltx/en_us_goadedes/pe.d106:peMA.Ode9C1F1.greekmelody	@ltx/en_us_goadedes/he.h.m5:heHE.OtiEpoiiseSoiMegaleia.greekname
ltx/en_us_goadedes/pe.d106:peMA.Ode9C1F1.incipit	…
ltx/en_us_goadedes/pe.d106:peMA.Ode9C1F1.melody	@ltx/en_us_goadedes/he.h.m5:heHE.OtiEpoiiseSoiMegaleia.name
ltx/en_us_goadedes/pe.d106:peMA.Ode9C1F1.mode	@ltx/en_us_goadedes/miscellanea:misc.Mode5
ltx/en_us_goadedes/pe.d106:peMA.Ode9C1F1.ode	@ltx/en_us_goadedes/miscellanea:misc.Ode9
ltx/en_us_goadedes/pe.d106:peMA.Ode9C1F1.text	
ltx/en_us_goadedes/pe.d106:peMA.Ode9C1H.greekmelody	@ltx/en_us_goadedes/he.h.m5:heHE.OtiEpoiiseSoiMegaleia.greekname
ltx/en_us_goadedes/pe.d106:peMA.Ode9C1H.incipit	@ltx/en_us_goadedes/he.h.m5:heHE.OtiEpoiiseSoiMegaleia.incipit
ltx/en_us_goadedes/pe.d106:peMA.Ode9C1H.melody	@ltx/en_us_goadedes/he.h.m5:heHE.OtiEpoiiseSoiMegaleia.melody
ltx/en_us_goadedes/pe.d106:peMA.Ode9C1H.mode	@ltx/en_us_goadedes/miscellanea:misc.Mode5
ltx/en_us_goadedes/pe.d106:peMA.Ode9C1H.ode	@ltx/en_us_goadedes/miscellanea:misc.Ode9
ltx/en_us_goadedes/pe.d106:peMA.Ode9C1H.text	@ltx/en_us_goadedes/he.h.m5:heHE.OtiEpoiiseSoiMegaleia.text
ltx/en_us_goadedes/pe.d106:peMA.Ode9C1T.incipit	…
ltx/en_us_goadedes/pe.d106:peMA.Ode9C1T.melody	@ltx/en_us_goadedes/he.h.m5:heHE.OtiEpoiiseSoiMegaleia.name
ltx/en_us_goadedes/pe.d106:peMA.Ode9C1T.mode	@ltx/en_us_goadedes/miscellanea:misc.Mode5
ltx/en_us_goadedes/pe.d106:peMA.Ode9C1T.ode	@ltx/en_us_goadedes/miscellanea:misc.Ode9
ltx/en_us_goadedes/pe.d106:peMA.Ode9C1T.text	
ltx/en_us_goadedes/pe.d106:peMA.Ode9C1Tr.incipit	…
ltx/en_us_goadedes/pe.d106:peMA.Ode9C1Tr.melody	@ltx/en_us_goadedes/he.h.m5:heHE.OtiEpoiiseSoiMegaleia.name
ltx/en_us_goadedes/pe.d106:peMA.Ode9C1Tr.mode	@ltx/en_us_goadedes/miscellanea:misc.Mode5
ltx/en_us_goadedes/pe.d106:peMA.Ode9C1Tr.ode	@ltx/en_us_goadedes/miscellanea:misc.Ode9
ltx/en_us_goadedes/pe.d106:peMA.Ode9C1Tr.text	
ltx/en_us_goadedes/pe.d106:peMA.Oikos1.text	Grant me a stream of ineffable wisdom and knowledge from on high, O Christ, the light for those in darkness and guide for those who are lost, and I will relate what the holy book of the Gospel of peace has taught, namely the miracle You performed on the Blindman: a man, who was blind from his birth, obtained the use of his physical eyes, and also the eyes of his soul, and he believed in You and cried out, “For those in darkness You are the most resplendent light.”
ltx/en_us_goadedes/pe.d106:peSV.Aposticha2.incipit	…
ltx/en_us_goadedes/pe.d106:peSV.Aposticha2.melody	@ltx/en_us_goadedes/he.a.m5:heAU.ChairoisAskitikon.name
ltx/en_us_goadedes/pe.d106:peSV.Aposticha2.mode	@ltx/en_us_goadedes/miscellanea:misc.Mode5
ltx/en_us_goadedes/pe.d106:peSV.Aposticha2.text	
ltx/en_us_goadedes/pe.d106:peSV.Aposticha3.incipit	…
ltx/en_us_goadedes/pe.d106:peSV.Aposticha3.melody	@ltx/en_us_goadedes/he.a.m5:heAU.ChairoisAskitikon.name
ltx/en_us_goadedes/pe.d106:peSV.Aposticha3.mode	@ltx/en_us_goadedes/miscellanea:misc.Mode5
ltx/en_us_goadedes/pe.d106:peSV.Aposticha3.text	
ltx/en_us_goadedes/pe.d106:peSV.Aposticha4.incipit	…
ltx/en_us_goadedes/pe.d106:peSV.Aposticha4.melody	@ltx/en_us_goadedes/he.a.m5:heAU.ChairoisAskitikon.name
ltx/en_us_goadedes/pe.d106:peSV.Aposticha4.mode	@ltx/en_us_goadedes/miscellanea:misc.Mode5
ltx/en_us_goadedes/pe.d106:peSV.Aposticha4.text	
ltx/en_us_goadedes/pe.d106:peSY.commemoration.couplet1.title	@ltx/en_us_goadedes/titles:ti.Verses
ltx/en_us_goadedes/pe.d106:peSY.commemoration.couplet1.verse1	
ltx/en_us_goadedes/pe.d106:peSY.commemoration.couplet1.verse2	
ltx/en_us_goadedes/pe.d106:peSY.commemoration.narration.p01	
ltx/en_us_goadedes/pe.d106:peSY.commemoration.narration.p02	
ltx/en_us_goadedes/pe.d106:peSY.commemoration.narration.p03	
ltx/en_us_goadedes/pe.d106:peSY.commemoration.narration.p04	
ltx/en_us_goadedes/pe.d106:peSY.commemoration.narration.p05	
ltx/en_us_goadedes/pe.d106:peSY.commemoration.narration.p06	
ltx/en_us_goadedes/pe.d106:peSY.commemoration.narration.p07	
ltx/en_us_goadedes/pe.d106:peSY.commemoration.text	
ltx/en_us_goadedes/pe.d106:peSY.lastline	
ltx/en_us_goadedes/pe.d106:peVE.AposGlory.incipit	…
ltx/en_us_goadedes/pe.d106:peVE.AposGlory.melody	@ltx/en_us_goadedes/miscellanea:misc.Idiomelon
ltx/en_us_goadedes/pe.d106:peVE.AposGlory.mode	@ltx/en_us_goadedes/miscellanea:misc.Mode8
ltx/en_us_goadedes/pe.d106:peVE.AposGlory.text	
ltx/en_us_goadedes/pe.d106:peVE.LityBoth.incipit	@ltx/en_us_goadedes/oc.m4.d1:ocVE.AposTheotokion.incipit
ltx/en_us_goadedes/pe.d106:peVE.LityBoth.melody	
ltx/en_us_goadedes/pe.d106:peVE.LityBoth.mode	@ltx/en_us_goadedes/miscellanea:misc.Mode4
ltx/en_us_goadedes/pe.d106:peVE.LityBoth.text	@ltx/en_us_goadedes/oc.m4.d1:ocVE.AposTheotokion.text
ltx/en_us_goadedes/pe.d106:peVE.LityGlory.incipit	…
ltx/en_us_goadedes/pe.d106:peVE.LityGlory.melody	@ltx/en_us_goadedes/miscellanea:misc.Idiomelon
ltx/en_us_goadedes/pe.d106:peVE.LityGlory.mode	@ltx/en_us_goadedes/miscellanea:misc.Mode4
ltx/en_us_goadedes/pe.d106:peVE.LityGlory.text	
ltx/en_us_goadedes/pe.d106:peVE.SticGlory.incipit	…
ltx/en_us_goadedes/pe.d106:peVE.SticGlory.melody	@ltx/en_us_goadedes/miscellanea:misc.Idiomelon
ltx/en_us_goadedes/pe.d106:peVE.SticGlory.mode	@ltx/en_us_goadedes/miscellanea:misc.Mode5
ltx/en_us_goadedes/pe.d106:peVE.SticGlory.text	
ltx/en_us_goadedes/pe.d106:peVE.Stichera09.incipit	…
ltx/en_us_goadedes/pe.d106:peVE.Stichera09.melody	@ltx/en_us_goadedes/miscellanea:misc.Idiomelon
ltx/en_us_goadedes/pe.d106:peVE.Stichera09.mode	@ltx/en_us_goadedes/miscellanea:misc.Mode2
ltx/en_us_goadedes/pe.d106:peVE.Stichera09.text	
ltx/en_us_goadedes/pe.d106:peVE.Stichera10.incipit	…
ltx/en_us_goadedes/pe.d106:peVE.Stichera10.melody	@ltx/en_us_goadedes/miscellanea:misc.Idiomelon
ltx/en_us_goadedes/pe.d106:peVE.Stichera10.mode	@ltx/en_us_goadedes/miscellanea:misc.Mode2
ltx/en_us_goadedes/pe.d106:peVE.Stichera10.text	
