ltx/en_us_goadedes/me.m08.d19:meDA.commemoration.first	
ltx/en_us_goadedes/me.m08.d19:meDA.commemoration.first_name	
ltx/en_us_goadedes/me.m08.d19:meDA.commemoration.first_short	
ltx/en_us_goadedes/me.m08.d19:meDA.commemoration.first_title	@ltx/en_us_goadedes/titles:ti.SaintM
ltx/en_us_goadedes/me.m08.d19:meDA.commemoration.full	
ltx/en_us_goadedes/me.m08.d19:meDA.commemoration.second_name	
ltx/en_us_goadedes/me.m08.d19:meDA.commemoration.second_title	
ltx/en_us_goadedes/me.m08.d19:meDA.date	
ltx/en_us_goadedes/me.m08.d19:meDA.fordate	
ltx/en_us_goadedes/me.m08.d19:meDA.insert1	
ltx/en_us_goadedes/me.m08.d19:meDA.insert2	
ltx/en_us_goadedes/me.m08.d19:meDA.note	
ltx/en_us_goadedes/me.m08.d19:meDA.pdfcoverdate	
ltx/en_us_goadedes/me.m08.d19:meDA.pdfheaderdate	
ltx/en_us_goadedes/me.m08.d19:meHO.commemorations	
ltx/en_us_goadedes/me.m08.d19:meHO.note1	
ltx/en_us_goadedes/me.m08.d19:meHO.note2	
ltx/en_us_goadedes/me.m08.d19:meHO.number	
ltx/en_us_goadedes/me.m08.d19:meHO.rank	
ltx/en_us_goadedes/me.m08.d19:meLE.commemoration1	
ltx/en_us_goadedes/me.m08.d19:meLE.commemoration2	
ltx/en_us_goadedes/me.m08.d19:meLI.Kontakion1.incipit	…
ltx/en_us_goadedes/me.m08.d19:meLI.Kontakion1.melody	
ltx/en_us_goadedes/me.m08.d19:meLI.Kontakion1.mode	
ltx/en_us_goadedes/me.m08.d19:meLI.Kontakion1.text	
ltx/en_us_goadedes/me.m08.d19:meLI.Megalynarion.text	
ltx/en_us_goadedes/me.m08.d19:meMA.AposGlory.incipit	…
ltx/en_us_goadedes/me.m08.d19:meMA.AposGlory.melody	@ltx/en_us_goadedes/he.a.m2:heAU.OikosTouEfratha.name
ltx/en_us_goadedes/me.m08.d19:meMA.AposGlory.mode	@ltx/en_us_goadedes/miscellanea:misc.Mode2
ltx/en_us_goadedes/me.m08.d19:meMA.AposGlory.text	
ltx/en_us_goadedes/me.m08.d19:meMA.Aposticha1.greekmelody	@ltx/en_us_goadedes/he.a.m2:heAU.OikosTouEfratha.greekname
ltx/en_us_goadedes/me.m08.d19:meMA.Aposticha1.incipit	@ltx/en_us_goadedes/me.m08.d16:meVE.Aposticha2.incipit
ltx/en_us_goadedes/me.m08.d19:meMA.Aposticha1.melody	@ltx/en_us_goadedes/he.a.m2:heAU.OikosTouEfratha.name
ltx/en_us_goadedes/me.m08.d19:meMA.Aposticha1.mode	@ltx/en_us_goadedes/miscellanea:misc.Mode2
ltx/en_us_goadedes/me.m08.d19:meMA.Aposticha1.text	@ltx/en_us_goadedes/me.m08.d16:meVE.Aposticha2.text
ltx/en_us_goadedes/me.m08.d19:meMA.Aposticha2.incipit	@ltx/en_us_goadedes/me.m08.d16:meVE.Aposticha3.incipit
ltx/en_us_goadedes/me.m08.d19:meMA.Aposticha2.melody	@ltx/en_us_goadedes/he.a.m2:heAU.OikosTouEfratha.name
ltx/en_us_goadedes/me.m08.d19:meMA.Aposticha2.mode	@ltx/en_us_goadedes/miscellanea:misc.Mode2
ltx/en_us_goadedes/me.m08.d19:meMA.Aposticha2.text	@ltx/en_us_goadedes/me.m08.d16:meVE.Aposticha3.text
ltx/en_us_goadedes/me.m08.d19:meMA.Aposticha3.incipit	@ltx/en_us_goadedes/me.m08.d16:meVE.AposGlory.incipit
ltx/en_us_goadedes/me.m08.d19:meMA.Aposticha3.melody	@ltx/en_us_goadedes/he.a.m2:heAU.OikosTouEfratha.name
ltx/en_us_goadedes/me.m08.d19:meMA.Aposticha3.mode	@ltx/en_us_goadedes/miscellanea:misc.Mode2
ltx/en_us_goadedes/me.m08.d19:meMA.Aposticha3.text	@ltx/en_us_goadedes/me.m08.d16:meVE.AposGlory.text
ltx/en_us_goadedes/me.m08.d19:meMA.C1.acrostic.notice1	
ltx/en_us_goadedes/me.m08.d19:meMA.C1.acrostic.text	
ltx/en_us_goadedes/me.m08.d19:meMA.C1.acrostic.title	
ltx/en_us_goadedes/me.m08.d19:meMA.C1.title	@ltx/en_us_goadedes/titles:ti.CanonSaintM
ltx/en_us_goadedes/me.m08.d19:meMA.C1.verse	@ltx/en_us_goadedes/prayers:pr.verse_SaintM.text
ltx/en_us_goadedes/me.m08.d19:meMA.Exaposteilarion1.greekmelody	@ltx/en_us_goadedes/he.a.m2:heAU.ToisMathitaisSynelthomen.greekname
ltx/en_us_goadedes/me.m08.d19:meMA.Exaposteilarion1.incipit	…
ltx/en_us_goadedes/me.m08.d19:meMA.Exaposteilarion1.melody	@ltx/en_us_goadedes/he.a.m2:heAU.ToisMathitaisSynelthomen.name
ltx/en_us_goadedes/me.m08.d19:meMA.Exaposteilarion1.mode	@ltx/en_us_goadedes/miscellanea:misc.Mode2
ltx/en_us_goadedes/me.m08.d19:meMA.Exaposteilarion1.text	
ltx/en_us_goadedes/me.m08.d19:meMA.Exaposteilarion2.greekmelody	@ltx/en_us_goadedes/he.a.m3:heAU.OOuranonToisAstrois.greekname
ltx/en_us_goadedes/me.m08.d19:meMA.Exaposteilarion2.incipit	@ltx/en_us_goadedes/me.m08.d17:meMA.Exaposteilarion2.incipit
ltx/en_us_goadedes/me.m08.d19:meMA.Exaposteilarion2.melody	@ltx/en_us_goadedes/he.a.m3:heAU.OOuranonToisAstrois.name
ltx/en_us_goadedes/me.m08.d19:meMA.Exaposteilarion2.mode	@ltx/en_us_goadedes/miscellanea:misc.Mode3
ltx/en_us_goadedes/me.m08.d19:meMA.Exaposteilarion2.text	@ltx/en_us_goadedes/me.m08.d17:meMA.Exaposteilarion2.text
ltx/en_us_goadedes/me.m08.d19:meMA.Kathisma11.greekmelody	@ltx/en_us_goadedes/he.a.m4:heAU.KateplagiIosif.greekname
ltx/en_us_goadedes/me.m08.d19:meMA.Kathisma11.incipit	@ltx/en_us_goadedes/me.m08.d15:meMA.Kathisma11.incipit
ltx/en_us_goadedes/me.m08.d19:meMA.Kathisma11.melody	@ltx/en_us_goadedes/he.a.m4:heAU.KateplagiIosif.name
ltx/en_us_goadedes/me.m08.d19:meMA.Kathisma11.mode	@ltx/en_us_goadedes/miscellanea:misc.Mode4
ltx/en_us_goadedes/me.m08.d19:meMA.Kathisma11.text	@ltx/en_us_goadedes/me.m08.d15:meMA.Kathisma11.text
ltx/en_us_goadedes/me.m08.d19:meMA.Kathisma21.greekmelody	@ltx/en_us_goadedes/he.a.m4:heAU.KateplagiIosif.greekname
ltx/en_us_goadedes/me.m08.d19:meMA.Kathisma21.incipit	@ltx/en_us_goadedes/me.m08.d16:meMA.Kathisma21.incipit
ltx/en_us_goadedes/me.m08.d19:meMA.Kathisma21.melody	@ltx/en_us_goadedes/he.a.m4:heAU.KateplagiIosif.name
ltx/en_us_goadedes/me.m08.d19:meMA.Kathisma21.mode	@ltx/en_us_goadedes/miscellanea:misc.Mode4
ltx/en_us_goadedes/me.m08.d19:meMA.Kathisma21.text	@ltx/en_us_goadedes/me.m08.d16:meMA.Kathisma21.text
ltx/en_us_goadedes/me.m08.d19:meMA.Ode1C11.greekmelody	@ltx/en_us_goadedes/he.h.m4:heHE.ThalassisToErythraion.greekname
ltx/en_us_goadedes/me.m08.d19:meMA.Ode1C11.incipit	…
ltx/en_us_goadedes/me.m08.d19:meMA.Ode1C11.melody	@ltx/en_us_goadedes/he.h.m4:heHE.ThalassisToErythraion.name
ltx/en_us_goadedes/me.m08.d19:meMA.Ode1C11.mode	@ltx/en_us_goadedes/miscellanea:misc.Mode4
ltx/en_us_goadedes/me.m08.d19:meMA.Ode1C11.ode	@ltx/en_us_goadedes/miscellanea:misc.Ode1
ltx/en_us_goadedes/me.m08.d19:meMA.Ode1C11.text	
ltx/en_us_goadedes/me.m08.d19:meMA.Ode1C12.incipit	…
ltx/en_us_goadedes/me.m08.d19:meMA.Ode1C12.melody	@ltx/en_us_goadedes/he.h.m4:heHE.ThalassisToErythraion.name
ltx/en_us_goadedes/me.m08.d19:meMA.Ode1C12.mode	@ltx/en_us_goadedes/miscellanea:misc.Mode4
ltx/en_us_goadedes/me.m08.d19:meMA.Ode1C12.ode	@ltx/en_us_goadedes/miscellanea:misc.Ode1
ltx/en_us_goadedes/me.m08.d19:meMA.Ode1C12.text	
ltx/en_us_goadedes/me.m08.d19:meMA.Ode1C13.incipit	…
ltx/en_us_goadedes/me.m08.d19:meMA.Ode1C13.melody	@ltx/en_us_goadedes/he.h.m4:heHE.ThalassisToErythraion.name
ltx/en_us_goadedes/me.m08.d19:meMA.Ode1C13.mode	@ltx/en_us_goadedes/miscellanea:misc.Mode4
ltx/en_us_goadedes/me.m08.d19:meMA.Ode1C13.ode	@ltx/en_us_goadedes/miscellanea:misc.Ode1
ltx/en_us_goadedes/me.m08.d19:meMA.Ode1C13.text	
ltx/en_us_goadedes/me.m08.d19:meMA.Ode1C1T.incipit	…
ltx/en_us_goadedes/me.m08.d19:meMA.Ode1C1T.melody	@ltx/en_us_goadedes/he.h.m4:heHE.ThalassisToErythraion.name
ltx/en_us_goadedes/me.m08.d19:meMA.Ode1C1T.mode	@ltx/en_us_goadedes/miscellanea:misc.Mode4
ltx/en_us_goadedes/me.m08.d19:meMA.Ode1C1T.ode	@ltx/en_us_goadedes/miscellanea:misc.Ode1
ltx/en_us_goadedes/me.m08.d19:meMA.Ode1C1T.text	
ltx/en_us_goadedes/me.m08.d19:meMA.Ode3C11.greekmelody	@ltx/en_us_goadedes/he.h.m4:heHE.EffrainetaiEpiSoi.greekname
ltx/en_us_goadedes/me.m08.d19:meMA.Ode3C11.incipit	…
ltx/en_us_goadedes/me.m08.d19:meMA.Ode3C11.melody	@ltx/en_us_goadedes/he.h.m4:heHE.EffrainetaiEpiSoi.name
ltx/en_us_goadedes/me.m08.d19:meMA.Ode3C11.mode	@ltx/en_us_goadedes/miscellanea:misc.Mode4
ltx/en_us_goadedes/me.m08.d19:meMA.Ode3C11.ode	@ltx/en_us_goadedes/miscellanea:misc.Ode3
ltx/en_us_goadedes/me.m08.d19:meMA.Ode3C11.text	
ltx/en_us_goadedes/me.m08.d19:meMA.Ode3C12.incipit	…
ltx/en_us_goadedes/me.m08.d19:meMA.Ode3C12.melody	@ltx/en_us_goadedes/he.h.m4:heHE.EffrainetaiEpiSoi.name
ltx/en_us_goadedes/me.m08.d19:meMA.Ode3C12.mode	@ltx/en_us_goadedes/miscellanea:misc.Mode4
ltx/en_us_goadedes/me.m08.d19:meMA.Ode3C12.ode	@ltx/en_us_goadedes/miscellanea:misc.Ode3
ltx/en_us_goadedes/me.m08.d19:meMA.Ode3C12.text	
ltx/en_us_goadedes/me.m08.d19:meMA.Ode3C13.incipit	…
ltx/en_us_goadedes/me.m08.d19:meMA.Ode3C13.melody	@ltx/en_us_goadedes/he.h.m4:heHE.EffrainetaiEpiSoi.name
ltx/en_us_goadedes/me.m08.d19:meMA.Ode3C13.mode	@ltx/en_us_goadedes/miscellanea:misc.Mode4
ltx/en_us_goadedes/me.m08.d19:meMA.Ode3C13.ode	@ltx/en_us_goadedes/miscellanea:misc.Ode3
ltx/en_us_goadedes/me.m08.d19:meMA.Ode3C13.text	
ltx/en_us_goadedes/me.m08.d19:meMA.Ode3C1T.incipit	…
ltx/en_us_goadedes/me.m08.d19:meMA.Ode3C1T.melody	@ltx/en_us_goadedes/he.h.m4:heHE.EffrainetaiEpiSoi.name
ltx/en_us_goadedes/me.m08.d19:meMA.Ode3C1T.mode	@ltx/en_us_goadedes/miscellanea:misc.Mode4
ltx/en_us_goadedes/me.m08.d19:meMA.Ode3C1T.ode	@ltx/en_us_goadedes/miscellanea:misc.Ode3
ltx/en_us_goadedes/me.m08.d19:meMA.Ode3C1T.text	
ltx/en_us_goadedes/me.m08.d19:meMA.Ode3H.greekmelody	@ltx/en_us_goadedes/he.h.m4:heHE.EffrainetaiEpiSoi.greekname
ltx/en_us_goadedes/me.m08.d19:meMA.Ode3H.incipit	@ltx/en_us_goadedes/he.h.m4:heHE.EffrainetaiEpiSoi.incipit
ltx/en_us_goadedes/me.m08.d19:meMA.Ode3H.melody	@ltx/en_us_goadedes/he.h.m4:heHE.EffrainetaiEpiSoi.melody
ltx/en_us_goadedes/me.m08.d19:meMA.Ode3H.mode	@ltx/en_us_goadedes/miscellanea:misc.Mode4
ltx/en_us_goadedes/me.m08.d19:meMA.Ode3H.ode	@ltx/en_us_goadedes/miscellanea:misc.Ode3
ltx/en_us_goadedes/me.m08.d19:meMA.Ode3H.text	@ltx/en_us_goadedes/he.h.m4:heHE.EffrainetaiEpiSoi.text
ltx/en_us_goadedes/me.m08.d19:meMA.Ode3Kathisma1.greekmelody	@ltx/en_us_goadedes/he.a.m1:heAU.TonTafonSouSotir.greekname
ltx/en_us_goadedes/me.m08.d19:meMA.Ode3Kathisma1.incipit	…
ltx/en_us_goadedes/me.m08.d19:meMA.Ode3Kathisma1.melody	@ltx/en_us_goadedes/he.a.m1:heAU.TonTafonSouSotir.name
ltx/en_us_goadedes/me.m08.d19:meMA.Ode3Kathisma1.mode	@ltx/en_us_goadedes/miscellanea:misc.Mode1
ltx/en_us_goadedes/me.m08.d19:meMA.Ode3Kathisma1.text	
ltx/en_us_goadedes/me.m08.d19:meMA.Ode3Kathisma2.greekmelody	@ltx/en_us_goadedes/he.a.m1:heAU.TonTafonSouSotir.greekname
ltx/en_us_goadedes/me.m08.d19:meMA.Ode3Kathisma2.incipit	@ltx/en_us_goadedes/me.m08.d15:meMA.Kathisma21.incipit
ltx/en_us_goadedes/me.m08.d19:meMA.Ode3Kathisma2.melody	@ltx/en_us_goadedes/he.a.m1:heAU.TonTafonSouSotir.name
ltx/en_us_goadedes/me.m08.d19:meMA.Ode3Kathisma2.mode	@ltx/en_us_goadedes/miscellanea:misc.Mode1
ltx/en_us_goadedes/me.m08.d19:meMA.Ode3Kathisma2.text	@ltx/en_us_goadedes/me.m08.d15:meMA.Kathisma21.text
ltx/en_us_goadedes/me.m08.d19:meMA.Ode4C11.greekmelody	@ltx/en_us_goadedes/he.h.m4:heHE.EparthentaSeIdousa.greekname
ltx/en_us_goadedes/me.m08.d19:meMA.Ode4C11.incipit	…
ltx/en_us_goadedes/me.m08.d19:meMA.Ode4C11.melody	@ltx/en_us_goadedes/he.h.m4:heHE.EparthentaSeIdousa.name
ltx/en_us_goadedes/me.m08.d19:meMA.Ode4C11.mode	@ltx/en_us_goadedes/miscellanea:misc.Mode4
ltx/en_us_goadedes/me.m08.d19:meMA.Ode4C11.ode	@ltx/en_us_goadedes/miscellanea:misc.Ode4
ltx/en_us_goadedes/me.m08.d19:meMA.Ode4C11.text	
ltx/en_us_goadedes/me.m08.d19:meMA.Ode4C12.incipit	…
ltx/en_us_goadedes/me.m08.d19:meMA.Ode4C12.melody	@ltx/en_us_goadedes/he.h.m4:heHE.EparthentaSeIdousa.name
ltx/en_us_goadedes/me.m08.d19:meMA.Ode4C12.mode	@ltx/en_us_goadedes/miscellanea:misc.Mode4
ltx/en_us_goadedes/me.m08.d19:meMA.Ode4C12.ode	@ltx/en_us_goadedes/miscellanea:misc.Ode4
ltx/en_us_goadedes/me.m08.d19:meMA.Ode4C12.text	
ltx/en_us_goadedes/me.m08.d19:meMA.Ode4C13.incipit	…
ltx/en_us_goadedes/me.m08.d19:meMA.Ode4C13.melody	@ltx/en_us_goadedes/he.h.m4:heHE.EparthentaSeIdousa.name
ltx/en_us_goadedes/me.m08.d19:meMA.Ode4C13.mode	@ltx/en_us_goadedes/miscellanea:misc.Mode4
ltx/en_us_goadedes/me.m08.d19:meMA.Ode4C13.ode	@ltx/en_us_goadedes/miscellanea:misc.Ode4
ltx/en_us_goadedes/me.m08.d19:meMA.Ode4C13.text	
ltx/en_us_goadedes/me.m08.d19:meMA.Ode4C14.incipit	…
ltx/en_us_goadedes/me.m08.d19:meMA.Ode4C14.melody	@ltx/en_us_goadedes/he.h.m4:heHE.EparthentaSeIdousa.name
ltx/en_us_goadedes/me.m08.d19:meMA.Ode4C14.mode	@ltx/en_us_goadedes/miscellanea:misc.Mode4
ltx/en_us_goadedes/me.m08.d19:meMA.Ode4C14.ode	@ltx/en_us_goadedes/miscellanea:misc.Ode4
ltx/en_us_goadedes/me.m08.d19:meMA.Ode4C14.text	
ltx/en_us_goadedes/me.m08.d19:meMA.Ode4C1T.incipit	…
ltx/en_us_goadedes/me.m08.d19:meMA.Ode4C1T.melody	@ltx/en_us_goadedes/he.h.m4:heHE.EparthentaSeIdousa.name
ltx/en_us_goadedes/me.m08.d19:meMA.Ode4C1T.mode	@ltx/en_us_goadedes/miscellanea:misc.Mode4
ltx/en_us_goadedes/me.m08.d19:meMA.Ode4C1T.ode	@ltx/en_us_goadedes/miscellanea:misc.Ode4
ltx/en_us_goadedes/me.m08.d19:meMA.Ode4C1T.text	
ltx/en_us_goadedes/me.m08.d19:meMA.Ode5C11.greekmelody	@ltx/en_us_goadedes/he.h.m4:heHE.SyKyrieMouFos.greekname
ltx/en_us_goadedes/me.m08.d19:meMA.Ode5C11.incipit	…
ltx/en_us_goadedes/me.m08.d19:meMA.Ode5C11.melody	@ltx/en_us_goadedes/he.h.m4:heHE.SyKyrieMouFos.name
ltx/en_us_goadedes/me.m08.d19:meMA.Ode5C11.mode	@ltx/en_us_goadedes/miscellanea:misc.Mode4
ltx/en_us_goadedes/me.m08.d19:meMA.Ode5C11.ode	@ltx/en_us_goadedes/miscellanea:misc.Ode5
ltx/en_us_goadedes/me.m08.d19:meMA.Ode5C11.text	
ltx/en_us_goadedes/me.m08.d19:meMA.Ode5C12.incipit	…
ltx/en_us_goadedes/me.m08.d19:meMA.Ode5C12.melody	@ltx/en_us_goadedes/he.h.m4:heHE.SyKyrieMouFos.name
ltx/en_us_goadedes/me.m08.d19:meMA.Ode5C12.mode	@ltx/en_us_goadedes/miscellanea:misc.Mode4
ltx/en_us_goadedes/me.m08.d19:meMA.Ode5C12.ode	@ltx/en_us_goadedes/miscellanea:misc.Ode5
ltx/en_us_goadedes/me.m08.d19:meMA.Ode5C12.text	
ltx/en_us_goadedes/me.m08.d19:meMA.Ode5C13.incipit	…
ltx/en_us_goadedes/me.m08.d19:meMA.Ode5C13.melody	@ltx/en_us_goadedes/he.h.m4:heHE.SyKyrieMouFos.name
ltx/en_us_goadedes/me.m08.d19:meMA.Ode5C13.mode	@ltx/en_us_goadedes/miscellanea:misc.Mode4
ltx/en_us_goadedes/me.m08.d19:meMA.Ode5C13.ode	@ltx/en_us_goadedes/miscellanea:misc.Ode5
ltx/en_us_goadedes/me.m08.d19:meMA.Ode5C13.text	
ltx/en_us_goadedes/me.m08.d19:meMA.Ode5C1T.incipit	…
ltx/en_us_goadedes/me.m08.d19:meMA.Ode5C1T.melody	@ltx/en_us_goadedes/he.h.m4:heHE.SyKyrieMouFos.name
ltx/en_us_goadedes/me.m08.d19:meMA.Ode5C1T.mode	@ltx/en_us_goadedes/miscellanea:misc.Mode4
ltx/en_us_goadedes/me.m08.d19:meMA.Ode5C1T.ode	@ltx/en_us_goadedes/miscellanea:misc.Ode5
ltx/en_us_goadedes/me.m08.d19:meMA.Ode5C1T.text	
ltx/en_us_goadedes/me.m08.d19:meMA.Ode6C11.greekmelody	@ltx/en_us_goadedes/he.h.m4:heHE.ThysoSoiMetaFonis.greekname
ltx/en_us_goadedes/me.m08.d19:meMA.Ode6C11.incipit	…
ltx/en_us_goadedes/me.m08.d19:meMA.Ode6C11.melody	@ltx/en_us_goadedes/he.h.m4:heHE.ThysoSoiMetaFonis.name
ltx/en_us_goadedes/me.m08.d19:meMA.Ode6C11.mode	@ltx/en_us_goadedes/miscellanea:misc.Mode4
ltx/en_us_goadedes/me.m08.d19:meMA.Ode6C11.ode	@ltx/en_us_goadedes/miscellanea:misc.Ode6
ltx/en_us_goadedes/me.m08.d19:meMA.Ode6C11.text	
ltx/en_us_goadedes/me.m08.d19:meMA.Ode6C12.incipit	…
ltx/en_us_goadedes/me.m08.d19:meMA.Ode6C12.melody	@ltx/en_us_goadedes/he.h.m4:heHE.ThysoSoiMetaFonis.name
ltx/en_us_goadedes/me.m08.d19:meMA.Ode6C12.mode	@ltx/en_us_goadedes/miscellanea:misc.Mode4
ltx/en_us_goadedes/me.m08.d19:meMA.Ode6C12.ode	@ltx/en_us_goadedes/miscellanea:misc.Ode6
ltx/en_us_goadedes/me.m08.d19:meMA.Ode6C12.text	
ltx/en_us_goadedes/me.m08.d19:meMA.Ode6C13.incipit	…
ltx/en_us_goadedes/me.m08.d19:meMA.Ode6C13.melody	@ltx/en_us_goadedes/he.h.m4:heHE.ThysoSoiMetaFonis.name
ltx/en_us_goadedes/me.m08.d19:meMA.Ode6C13.mode	@ltx/en_us_goadedes/miscellanea:misc.Mode4
ltx/en_us_goadedes/me.m08.d19:meMA.Ode6C13.ode	@ltx/en_us_goadedes/miscellanea:misc.Ode6
ltx/en_us_goadedes/me.m08.d19:meMA.Ode6C13.text	
ltx/en_us_goadedes/me.m08.d19:meMA.Ode6C1T.incipit	…
ltx/en_us_goadedes/me.m08.d19:meMA.Ode6C1T.melody	@ltx/en_us_goadedes/he.h.m4:heHE.ThysoSoiMetaFonis.name
ltx/en_us_goadedes/me.m08.d19:meMA.Ode6C1T.mode	@ltx/en_us_goadedes/miscellanea:misc.Mode4
ltx/en_us_goadedes/me.m08.d19:meMA.Ode6C1T.ode	@ltx/en_us_goadedes/miscellanea:misc.Ode6
ltx/en_us_goadedes/me.m08.d19:meMA.Ode6C1T.text	
ltx/en_us_goadedes/me.m08.d19:meMA.Ode6H.greekmelody	@ltx/en_us_goadedes/he.h.m4:heHE.ThysoSoiMetaFonis.greekname
ltx/en_us_goadedes/me.m08.d19:meMA.Ode6H.incipit	@ltx/en_us_goadedes/he.h.m4:heHE.ThysoSoiMetaFonis.incipit
ltx/en_us_goadedes/me.m08.d19:meMA.Ode6H.melody	@ltx/en_us_goadedes/he.h.m4:heHE.ThysoSoiMetaFonis.melody
ltx/en_us_goadedes/me.m08.d19:meMA.Ode6H.mode	@ltx/en_us_goadedes/miscellanea:misc.Mode4
ltx/en_us_goadedes/me.m08.d19:meMA.Ode6H.ode	@ltx/en_us_goadedes/miscellanea:misc.Ode6
ltx/en_us_goadedes/me.m08.d19:meMA.Ode6H.text	@ltx/en_us_goadedes/he.h.m4:heHE.ThysoSoiMetaFonis.text
ltx/en_us_goadedes/me.m08.d19:meMA.Ode7C11.greekmelody	@ltx/en_us_goadedes/he.h.m4:heHE.EnTiKaminoAvramiaioi.greekname
ltx/en_us_goadedes/me.m08.d19:meMA.Ode7C11.incipit	…
ltx/en_us_goadedes/me.m08.d19:meMA.Ode7C11.melody	@ltx/en_us_goadedes/he.h.m4:heHE.EnTiKaminoAvramiaioi.name
ltx/en_us_goadedes/me.m08.d19:meMA.Ode7C11.mode	@ltx/en_us_goadedes/miscellanea:misc.Mode4
ltx/en_us_goadedes/me.m08.d19:meMA.Ode7C11.ode	@ltx/en_us_goadedes/miscellanea:misc.Ode7
ltx/en_us_goadedes/me.m08.d19:meMA.Ode7C11.text	
ltx/en_us_goadedes/me.m08.d19:meMA.Ode7C12.incipit	…
ltx/en_us_goadedes/me.m08.d19:meMA.Ode7C12.melody	@ltx/en_us_goadedes/he.h.m4:heHE.EnTiKaminoAvramiaioi.name
ltx/en_us_goadedes/me.m08.d19:meMA.Ode7C12.mode	@ltx/en_us_goadedes/miscellanea:misc.Mode4
ltx/en_us_goadedes/me.m08.d19:meMA.Ode7C12.ode	@ltx/en_us_goadedes/miscellanea:misc.Ode7
ltx/en_us_goadedes/me.m08.d19:meMA.Ode7C12.text	
ltx/en_us_goadedes/me.m08.d19:meMA.Ode7C13.incipit	…
ltx/en_us_goadedes/me.m08.d19:meMA.Ode7C13.melody	@ltx/en_us_goadedes/he.h.m4:heHE.EnTiKaminoAvramiaioi.name
ltx/en_us_goadedes/me.m08.d19:meMA.Ode7C13.mode	@ltx/en_us_goadedes/miscellanea:misc.Mode4
ltx/en_us_goadedes/me.m08.d19:meMA.Ode7C13.ode	@ltx/en_us_goadedes/miscellanea:misc.Ode7
ltx/en_us_goadedes/me.m08.d19:meMA.Ode7C13.text	
ltx/en_us_goadedes/me.m08.d19:meMA.Ode7C1T.incipit	…
ltx/en_us_goadedes/me.m08.d19:meMA.Ode7C1T.melody	@ltx/en_us_goadedes/he.h.m4:heHE.EnTiKaminoAvramiaioi.name
ltx/en_us_goadedes/me.m08.d19:meMA.Ode7C1T.mode	@ltx/en_us_goadedes/miscellanea:misc.Mode4
ltx/en_us_goadedes/me.m08.d19:meMA.Ode7C1T.ode	@ltx/en_us_goadedes/miscellanea:misc.Ode7
ltx/en_us_goadedes/me.m08.d19:meMA.Ode7C1T.text	
ltx/en_us_goadedes/me.m08.d19:meMA.Ode8C11.greekmelody	@ltx/en_us_goadedes/he.h.m4:heHE.CheirasEkpetasasDaniil.greekname
ltx/en_us_goadedes/me.m08.d19:meMA.Ode8C11.incipit	…
ltx/en_us_goadedes/me.m08.d19:meMA.Ode8C11.melody	@ltx/en_us_goadedes/he.h.m4:heHE.CheirasEkpetasasDaniil.name
ltx/en_us_goadedes/me.m08.d19:meMA.Ode8C11.mode	@ltx/en_us_goadedes/miscellanea:misc.Mode4
ltx/en_us_goadedes/me.m08.d19:meMA.Ode8C11.ode	@ltx/en_us_goadedes/miscellanea:misc.Ode8
ltx/en_us_goadedes/me.m08.d19:meMA.Ode8C11.text	
ltx/en_us_goadedes/me.m08.d19:meMA.Ode8C12.incipit	…
ltx/en_us_goadedes/me.m08.d19:meMA.Ode8C12.melody	@ltx/en_us_goadedes/he.h.m4:heHE.CheirasEkpetasasDaniil.name
ltx/en_us_goadedes/me.m08.d19:meMA.Ode8C12.mode	@ltx/en_us_goadedes/miscellanea:misc.Mode4
ltx/en_us_goadedes/me.m08.d19:meMA.Ode8C12.ode	@ltx/en_us_goadedes/miscellanea:misc.Ode8
ltx/en_us_goadedes/me.m08.d19:meMA.Ode8C12.text	
ltx/en_us_goadedes/me.m08.d19:meMA.Ode8C13.incipit	…
ltx/en_us_goadedes/me.m08.d19:meMA.Ode8C13.melody	@ltx/en_us_goadedes/he.h.m4:heHE.CheirasEkpetasasDaniil.name
ltx/en_us_goadedes/me.m08.d19:meMA.Ode8C13.mode	@ltx/en_us_goadedes/miscellanea:misc.Mode4
ltx/en_us_goadedes/me.m08.d19:meMA.Ode8C13.ode	@ltx/en_us_goadedes/miscellanea:misc.Ode8
ltx/en_us_goadedes/me.m08.d19:meMA.Ode8C13.text	
ltx/en_us_goadedes/me.m08.d19:meMA.Ode8C1T.incipit	…
ltx/en_us_goadedes/me.m08.d19:meMA.Ode8C1T.melody	@ltx/en_us_goadedes/he.h.m4:heHE.CheirasEkpetasasDaniil.name
ltx/en_us_goadedes/me.m08.d19:meMA.Ode8C1T.mode	@ltx/en_us_goadedes/miscellanea:misc.Mode4
ltx/en_us_goadedes/me.m08.d19:meMA.Ode8C1T.ode	@ltx/en_us_goadedes/miscellanea:misc.Ode8
ltx/en_us_goadedes/me.m08.d19:meMA.Ode8C1T.text	
ltx/en_us_goadedes/me.m08.d19:meMA.Ode8H.greekmelody	@ltx/en_us_goadedes/he.h.m4:heHE.CheirasEkpetasasDaniil.greekname
ltx/en_us_goadedes/me.m08.d19:meMA.Ode8H.incipit	@ltx/en_us_goadedes/he.h.m4:heHE.CheirasEkpetasasDaniil.incipit
ltx/en_us_goadedes/me.m08.d19:meMA.Ode8H.melody	@ltx/en_us_goadedes/he.h.m4:heHE.CheirasEkpetasasDaniil.melody
ltx/en_us_goadedes/me.m08.d19:meMA.Ode8H.mode	@ltx/en_us_goadedes/miscellanea:misc.Mode4
ltx/en_us_goadedes/me.m08.d19:meMA.Ode8H.ode	@ltx/en_us_goadedes/miscellanea:misc.Ode8
ltx/en_us_goadedes/me.m08.d19:meMA.Ode8H.text	@ltx/en_us_goadedes/he.h.m4:heHE.CheirasEkpetasasDaniil.text
ltx/en_us_goadedes/me.m08.d19:meMA.Ode9C11.greekmelody	@ltx/en_us_goadedes/he.h.m4:heHE.LithosAcheirotmitos.greekname
ltx/en_us_goadedes/me.m08.d19:meMA.Ode9C11.incipit	…
ltx/en_us_goadedes/me.m08.d19:meMA.Ode9C11.melody	@ltx/en_us_goadedes/he.h.m4:heHE.LithosAcheirotmitos.name
ltx/en_us_goadedes/me.m08.d19:meMA.Ode9C11.mode	@ltx/en_us_goadedes/miscellanea:misc.Mode4
ltx/en_us_goadedes/me.m08.d19:meMA.Ode9C11.ode	@ltx/en_us_goadedes/miscellanea:misc.Ode9
ltx/en_us_goadedes/me.m08.d19:meMA.Ode9C11.text	
ltx/en_us_goadedes/me.m08.d19:meMA.Ode9C12.incipit	…
ltx/en_us_goadedes/me.m08.d19:meMA.Ode9C12.melody	@ltx/en_us_goadedes/he.h.m4:heHE.LithosAcheirotmitos.name
ltx/en_us_goadedes/me.m08.d19:meMA.Ode9C12.mode	@ltx/en_us_goadedes/miscellanea:misc.Mode4
ltx/en_us_goadedes/me.m08.d19:meMA.Ode9C12.ode	@ltx/en_us_goadedes/miscellanea:misc.Ode9
ltx/en_us_goadedes/me.m08.d19:meMA.Ode9C12.text	
ltx/en_us_goadedes/me.m08.d19:meMA.Ode9C13.incipit	…
ltx/en_us_goadedes/me.m08.d19:meMA.Ode9C13.melody	@ltx/en_us_goadedes/he.h.m4:heHE.LithosAcheirotmitos.name
ltx/en_us_goadedes/me.m08.d19:meMA.Ode9C13.mode	@ltx/en_us_goadedes/miscellanea:misc.Mode4
ltx/en_us_goadedes/me.m08.d19:meMA.Ode9C13.ode	@ltx/en_us_goadedes/miscellanea:misc.Ode9
ltx/en_us_goadedes/me.m08.d19:meMA.Ode9C13.text	
ltx/en_us_goadedes/me.m08.d19:meMA.Ode9C14.incipit	…
ltx/en_us_goadedes/me.m08.d19:meMA.Ode9C14.melody	@ltx/en_us_goadedes/he.h.m4:heHE.LithosAcheirotmitos.name
ltx/en_us_goadedes/me.m08.d19:meMA.Ode9C14.mode	@ltx/en_us_goadedes/miscellanea:misc.Mode4
ltx/en_us_goadedes/me.m08.d19:meMA.Ode9C14.ode	@ltx/en_us_goadedes/miscellanea:misc.Ode9
ltx/en_us_goadedes/me.m08.d19:meMA.Ode9C14.text	
ltx/en_us_goadedes/me.m08.d19:meMA.Ode9C1T.incipit	…
ltx/en_us_goadedes/me.m08.d19:meMA.Ode9C1T.melody	@ltx/en_us_goadedes/he.h.m4:heHE.LithosAcheirotmitos.name
ltx/en_us_goadedes/me.m08.d19:meMA.Ode9C1T.mode	@ltx/en_us_goadedes/miscellanea:misc.Mode4
ltx/en_us_goadedes/me.m08.d19:meMA.Ode9C1T.ode	@ltx/en_us_goadedes/miscellanea:misc.Ode9
ltx/en_us_goadedes/me.m08.d19:meMA.Ode9C1T.text	
ltx/en_us_goadedes/me.m08.d19:meMA.Ode9H.greekmelody	@ltx/en_us_goadedes/he.h.m4:heHE.LithosAcheirotmitos.greekname
ltx/en_us_goadedes/me.m08.d19:meMA.Ode9H.incipit	@ltx/en_us_goadedes/he.h.m4:heHE.LithosAcheirotmitos.incipit
ltx/en_us_goadedes/me.m08.d19:meMA.Ode9H.melody	@ltx/en_us_goadedes/he.h.m4:heHE.LithosAcheirotmitos.melody
ltx/en_us_goadedes/me.m08.d19:meMA.Ode9H.mode	@ltx/en_us_goadedes/miscellanea:misc.Mode4
ltx/en_us_goadedes/me.m08.d19:meMA.Ode9H.ode	@ltx/en_us_goadedes/miscellanea:misc.Ode9
ltx/en_us_goadedes/me.m08.d19:meMA.Ode9H.text	@ltx/en_us_goadedes/he.h.m4:heHE.LithosAcheirotmitos.text
ltx/en_us_goadedes/me.m08.d19:meVE.Apolytikion1ger.greekmelody	@ltx/en_us_goadedes/he.a.m3:heAU.TheiasPisteos.greekname
ltx/en_us_goadedes/me.m08.d19:meVE.Apolytikion1ger.incipit	…
ltx/en_us_goadedes/me.m08.d19:meVE.Apolytikion1ger.melody	@ltx/en_us_goadedes/he.a.m3:heAU.TheiasPisteos.name
ltx/en_us_goadedes/me.m08.d19:meVE.Apolytikion1ger.mode	@ltx/en_us_goadedes/miscellanea:misc.Mode3
ltx/en_us_goadedes/me.m08.d19:meVE.Apolytikion1ger.poet	@ltx/en_us_goadedes/poets:po.Gerasimou
ltx/en_us_goadedes/me.m08.d19:meVE.Apolytikion1ger.text	
ltx/en_us_goadedes/me.m08.d19:meVE.AposGlory.incipit	@ltx/en_us_goadedes/me.m08.d15:meVE.LityGlory.incipit
ltx/en_us_goadedes/me.m08.d19:meVE.AposGlory.melody	
ltx/en_us_goadedes/me.m08.d19:meVE.AposGlory.mode	@ltx/en_us_goadedes/miscellanea:misc.Mode5
ltx/en_us_goadedes/me.m08.d19:meVE.AposGlory.text	@ltx/en_us_goadedes/me.m08.d15:meVE.LityGlory.text
ltx/en_us_goadedes/me.m08.d19:meVE.Aposticha1.greekmelody	@ltx/en_us_goadedes/he.a.m2:heAU.OikosTouEfratha.greekname
ltx/en_us_goadedes/me.m08.d19:meVE.Aposticha1.incipit	@ltx/en_us_goadedes/me.m08.d18:meVE.Aposticha1.incipit
ltx/en_us_goadedes/me.m08.d19:meVE.Aposticha1.melody	@ltx/en_us_goadedes/he.a.m2:heAU.OikosTouEfratha.name
ltx/en_us_goadedes/me.m08.d19:meVE.Aposticha1.mode	@ltx/en_us_goadedes/miscellanea:misc.Mode2
ltx/en_us_goadedes/me.m08.d19:meVE.Aposticha1.text	@ltx/en_us_goadedes/me.m08.d18:meVE.Aposticha1.text
ltx/en_us_goadedes/me.m08.d19:meVE.Aposticha2.incipit	@ltx/en_us_goadedes/me.m08.d15:meSV.Aposticha3.incipit
ltx/en_us_goadedes/me.m08.d19:meVE.Aposticha2.melody	@ltx/en_us_goadedes/he.a.m2:heAU.OikosTouEfratha.name
ltx/en_us_goadedes/me.m08.d19:meVE.Aposticha2.mode	@ltx/en_us_goadedes/miscellanea:misc.Mode2
ltx/en_us_goadedes/me.m08.d19:meVE.Aposticha2.text	@ltx/en_us_goadedes/me.m08.d15:meSV.Aposticha3.text
ltx/en_us_goadedes/me.m08.d19:meVE.Aposticha3.incipit	…
ltx/en_us_goadedes/me.m08.d19:meVE.Aposticha3.melody	@ltx/en_us_goadedes/he.a.m2:heAU.OikosTouEfratha.name
ltx/en_us_goadedes/me.m08.d19:meVE.Aposticha3.mode	@ltx/en_us_goadedes/miscellanea:misc.Mode2
ltx/en_us_goadedes/me.m08.d19:meVE.Aposticha3.text	
ltx/en_us_goadedes/me.m08.d19:meVE.SticGlory.incipit	@ltx/en_us_goadedes/me.m08.d15:meVE.AposGlory.incipit
ltx/en_us_goadedes/me.m08.d19:meVE.SticGlory.melody	
ltx/en_us_goadedes/me.m08.d19:meVE.SticGlory.mode	@ltx/en_us_goadedes/miscellanea:misc.Mode4
ltx/en_us_goadedes/me.m08.d19:meVE.SticGlory.text	@ltx/en_us_goadedes/me.m08.d15:meVE.AposGlory.text
ltx/en_us_goadedes/me.m08.d19:meVE.Stichera01.greekmelody	@ltx/en_us_goadedes/he.a.m6:heAU.TriimerosAnestis.greekname
ltx/en_us_goadedes/me.m08.d19:meVE.Stichera01.incipit	…
ltx/en_us_goadedes/me.m08.d19:meVE.Stichera01.melody	@ltx/en_us_goadedes/he.a.m6:heAU.TriimerosAnestis.name
ltx/en_us_goadedes/me.m08.d19:meVE.Stichera01.mode	@ltx/en_us_goadedes/miscellanea:misc.Mode6
ltx/en_us_goadedes/me.m08.d19:meVE.Stichera01.text	
ltx/en_us_goadedes/me.m08.d19:meVE.Stichera02.incipit	…
ltx/en_us_goadedes/me.m08.d19:meVE.Stichera02.melody	@ltx/en_us_goadedes/he.a.m6:heAU.TriimerosAnestis.name
ltx/en_us_goadedes/me.m08.d19:meVE.Stichera02.mode	@ltx/en_us_goadedes/miscellanea:misc.Mode6
ltx/en_us_goadedes/me.m08.d19:meVE.Stichera02.text	
ltx/en_us_goadedes/me.m08.d19:meVE.Stichera03.incipit	…
ltx/en_us_goadedes/me.m08.d19:meVE.Stichera03.melody	@ltx/en_us_goadedes/he.a.m6:heAU.TriimerosAnestis.name
ltx/en_us_goadedes/me.m08.d19:meVE.Stichera03.mode	@ltx/en_us_goadedes/miscellanea:misc.Mode6
ltx/en_us_goadedes/me.m08.d19:meVE.Stichera03.text	
ltx/en_us_goadedes/me.m08.d19:meVE.Stichera04.greekmelody	@ltx/en_us_goadedes/he.a.m1:heAU.PaneffimoiMartyres.greekname
ltx/en_us_goadedes/me.m08.d19:meVE.Stichera04.incipit	…
ltx/en_us_goadedes/me.m08.d19:meVE.Stichera04.melody	@ltx/en_us_goadedes/he.a.m1:heAU.PaneffimoiMartyres.name
ltx/en_us_goadedes/me.m08.d19:meVE.Stichera04.mode	@ltx/en_us_goadedes/miscellanea:misc.Mode1
ltx/en_us_goadedes/me.m08.d19:meVE.Stichera04.text	
ltx/en_us_goadedes/me.m08.d19:meVE.Stichera05.incipit	…
ltx/en_us_goadedes/me.m08.d19:meVE.Stichera05.melody	@ltx/en_us_goadedes/he.a.m1:heAU.PaneffimoiMartyres.name
ltx/en_us_goadedes/me.m08.d19:meVE.Stichera05.mode	@ltx/en_us_goadedes/miscellanea:misc.Mode1
ltx/en_us_goadedes/me.m08.d19:meVE.Stichera05.text	
ltx/en_us_goadedes/me.m08.d19:meVE.Stichera06.incipit	…
ltx/en_us_goadedes/me.m08.d19:meVE.Stichera06.melody	@ltx/en_us_goadedes/he.a.m1:heAU.PaneffimoiMartyres.name
ltx/en_us_goadedes/me.m08.d19:meVE.Stichera06.mode	@ltx/en_us_goadedes/miscellanea:misc.Mode1
ltx/en_us_goadedes/me.m08.d19:meVE.Stichera06.text	
