ltx/en_us_goadedes/me.m01.d16:meDA.commemoration.first	
ltx/en_us_goadedes/me.m01.d16:meDA.commemoration.first_name	
ltx/en_us_goadedes/me.m01.d16:meDA.commemoration.first_short	
ltx/en_us_goadedes/me.m01.d16:meDA.commemoration.first_title	@ltx/en_us_goadedes/titles:ti.Apostle
ltx/en_us_goadedes/me.m01.d16:meDA.commemoration.full	
ltx/en_us_goadedes/me.m01.d16:meDA.commemoration.second_name	
ltx/en_us_goadedes/me.m01.d16:meDA.commemoration.second_title	
ltx/en_us_goadedes/me.m01.d16:meDA.date	
ltx/en_us_goadedes/me.m01.d16:meDA.fordate	
ltx/en_us_goadedes/me.m01.d16:meDA.insert1	
ltx/en_us_goadedes/me.m01.d16:meDA.insert2	
ltx/en_us_goadedes/me.m01.d16:meDA.note	
ltx/en_us_goadedes/me.m01.d16:meDA.pdfcoverdate	
ltx/en_us_goadedes/me.m01.d16:meDA.pdfheaderdate	
ltx/en_us_goadedes/me.m01.d16:meHO.commemorations	
ltx/en_us_goadedes/me.m01.d16:meHO.note1	@ltx/en_us_goadedes/rubrical:ru.WineOil
ltx/en_us_goadedes/me.m01.d16:meHO.note2	
ltx/en_us_goadedes/me.m01.d16:meHO.number	
ltx/en_us_goadedes/me.m01.d16:meHO.rank	
ltx/en_us_goadedes/me.m01.d16:meLE.commemoration1	
ltx/en_us_goadedes/me.m01.d16:meLE.commemoration2	
ltx/en_us_goadedes/me.m01.d16:meLI.Kontakion1.greekmelody	@ltx/en_us_goadedes/me.m01.d16:meMA.Kontakion1.greekmelody
ltx/en_us_goadedes/me.m01.d16:meLI.Kontakion1.incipit	@ltx/en_us_goadedes/me.m01.d16:meMA.Kontakion1.incipit
ltx/en_us_goadedes/me.m01.d16:meLI.Kontakion1.melody	@ltx/en_us_goadedes/me.m01.d16:meMA.Kontakion1.melody
ltx/en_us_goadedes/me.m01.d16:meLI.Kontakion1.mode	@ltx/en_us_goadedes/me.m01.d16:meMA.Kontakion1.mode
ltx/en_us_goadedes/me.m01.d16:meLI.Kontakion1.text	@ltx/en_us_goadedes/me.m01.d16:meMA.Kontakion1.text
ltx/en_us_goadedes/me.m01.d16:meLI.MM.CommunionHymn.text	@ltx/en_us_goadedes/properties:media.key
ltx/en_us_goadedes/me.m01.d16:meLI.Megalynarion.text	
ltx/en_us_goadedes/me.m01.d16:meMA.AposGlory.incipit	…
ltx/en_us_goadedes/me.m01.d16:meMA.AposGlory.melody	
ltx/en_us_goadedes/me.m01.d16:meMA.AposGlory.mode	@ltx/en_us_goadedes/miscellanea:misc.Mode4
ltx/en_us_goadedes/me.m01.d16:meMA.AposGlory.poet	@ltx/en_us_goadedes/poets:po.Anatoliou
ltx/en_us_goadedes/me.m01.d16:meMA.AposGlory.text	
ltx/en_us_goadedes/me.m01.d16:meMA.AposStavrotheotokion.greekmelody	@ltx/en_us_goadedes/he.a.m4:heAU.EdokasSimeiosin.greekname
ltx/en_us_goadedes/me.m01.d16:meMA.AposStavrotheotokion.incipit	@ltx/en_us_goadedes/oc.m4.d4:ocVE.SticTheotokion.incipit
ltx/en_us_goadedes/me.m01.d16:meMA.AposStavrotheotokion.melody	@ltx/en_us_goadedes/he.a.m4:heAU.EdokasSimeiosin.name
ltx/en_us_goadedes/me.m01.d16:meMA.AposStavrotheotokion.mode	@ltx/en_us_goadedes/miscellanea:misc.Mode4
ltx/en_us_goadedes/me.m01.d16:meMA.AposStavrotheotokion.text	@ltx/en_us_goadedes/oc.m4.d4:ocVE.SticTheotokion.text
ltx/en_us_goadedes/me.m01.d16:meMA.AposTheotokion.greekmelody	@ltx/en_us_goadedes/he.a.m4:heAU.EdokasSimeiosin.greekname
ltx/en_us_goadedes/me.m01.d16:meMA.AposTheotokion.incipit	@ltx/en_us_goadedes/oc.m4.d4:ocVE.Stichera6.incipit
ltx/en_us_goadedes/me.m01.d16:meMA.AposTheotokion.melody	@ltx/en_us_goadedes/he.a.m4:heAU.EdokasSimeiosin.name
ltx/en_us_goadedes/me.m01.d16:meMA.AposTheotokion.mode	@ltx/en_us_goadedes/miscellanea:misc.Mode4
ltx/en_us_goadedes/me.m01.d16:meMA.AposTheotokion.text	@ltx/en_us_goadedes/oc.m4.d4:ocVE.Stichera6.text
ltx/en_us_goadedes/me.m01.d16:meMA.C1.acrostic.notice1	
ltx/en_us_goadedes/me.m01.d16:meMA.C1.acrostic.text	
ltx/en_us_goadedes/me.m01.d16:meMA.C1.acrostic.title	Canon for the Apostle.
ltx/en_us_goadedes/me.m01.d16:meMA.C1.title	@ltx/en_us_goadedes/titles:ti.Canon1Apostle
ltx/en_us_goadedes/me.m01.d16:meMA.C1.verse	@ltx/en_us_goadedes/prayers:pr.verse_Apostle.text
ltx/en_us_goadedes/me.m01.d16:meMA.C2.acrostic.notice1	
ltx/en_us_goadedes/me.m01.d16:meMA.C2.acrostic.text	
ltx/en_us_goadedes/me.m01.d16:meMA.C2.acrostic.title	Another Canon.
ltx/en_us_goadedes/me.m01.d16:meMA.C2.title	@ltx/en_us_goadedes/titles:ti.Canon2Apostle
ltx/en_us_goadedes/me.m01.d16:meMA.C2.verse	@ltx/en_us_goadedes/prayers:pr.verse_Apostle.text
ltx/en_us_goadedes/me.m01.d16:meMA.ExapTheotokion.incipit	…
ltx/en_us_goadedes/me.m01.d16:meMA.ExapTheotokion.melody	@ltx/en_us_goadedes/he.a.m2:heAU.GynaikesAkoutisthite.name
ltx/en_us_goadedes/me.m01.d16:meMA.ExapTheotokion.mode	@ltx/en_us_goadedes/miscellanea:misc.Mode2
ltx/en_us_goadedes/me.m01.d16:meMA.ExapTheotokion.text	
ltx/en_us_goadedes/me.m01.d16:meMA.Exaposteilarion1.greekmelody	@ltx/en_us_goadedes/he.a.m2:heAU.GynaikesAkoutisthite.greekname
ltx/en_us_goadedes/me.m01.d16:meMA.Exaposteilarion1.incipit	…
ltx/en_us_goadedes/me.m01.d16:meMA.Exaposteilarion1.melody	@ltx/en_us_goadedes/he.a.m2:heAU.GynaikesAkoutisthite.name
ltx/en_us_goadedes/me.m01.d16:meMA.Exaposteilarion1.mode	@ltx/en_us_goadedes/miscellanea:misc.Mode2
ltx/en_us_goadedes/me.m01.d16:meMA.Exaposteilarion1.text	
ltx/en_us_goadedes/me.m01.d16:meMA.Kontakion1.greekmelody	@ltx/en_us_goadedes/he.a.m6:heAU.TinEnPresveiais.greekname
ltx/en_us_goadedes/me.m01.d16:meMA.Kontakion1.incipit	…
ltx/en_us_goadedes/me.m01.d16:meMA.Kontakion1.melody	@ltx/en_us_goadedes/he.a.m6:heAU.TinEnPresveiais.name
ltx/en_us_goadedes/me.m01.d16:meMA.Kontakion1.mode	@ltx/en_us_goadedes/miscellanea:misc.Mode2
ltx/en_us_goadedes/me.m01.d16:meMA.Kontakion1.text	
ltx/en_us_goadedes/me.m01.d16:meMA.Lauds1.greekmelody	@ltx/en_us_goadedes/he.a.m6:heAU.TriimerosAnestis.greekname
ltx/en_us_goadedes/me.m01.d16:meMA.Lauds1.incipit	…
ltx/en_us_goadedes/me.m01.d16:meMA.Lauds1.melody	@ltx/en_us_goadedes/he.a.m6:heAU.TriimerosAnestis.name
ltx/en_us_goadedes/me.m01.d16:meMA.Lauds1.mode	@ltx/en_us_goadedes/miscellanea:misc.Mode6
ltx/en_us_goadedes/me.m01.d16:meMA.Lauds1.text	
ltx/en_us_goadedes/me.m01.d16:meMA.Lauds2.incipit	…
ltx/en_us_goadedes/me.m01.d16:meMA.Lauds2.melody	@ltx/en_us_goadedes/he.a.m6:heAU.TriimerosAnestis.name
ltx/en_us_goadedes/me.m01.d16:meMA.Lauds2.mode	@ltx/en_us_goadedes/miscellanea:misc.Mode6
ltx/en_us_goadedes/me.m01.d16:meMA.Lauds2.text	
ltx/en_us_goadedes/me.m01.d16:meMA.Lauds3.incipit	…
ltx/en_us_goadedes/me.m01.d16:meMA.Lauds3.melody	@ltx/en_us_goadedes/he.a.m6:heAU.TriimerosAnestis.name
ltx/en_us_goadedes/me.m01.d16:meMA.Lauds3.mode	@ltx/en_us_goadedes/miscellanea:misc.Mode6
ltx/en_us_goadedes/me.m01.d16:meMA.Lauds3.text	
ltx/en_us_goadedes/me.m01.d16:meMA.LaudsGlory.incipit	…
ltx/en_us_goadedes/me.m01.d16:meMA.LaudsGlory.melody	
ltx/en_us_goadedes/me.m01.d16:meMA.LaudsGlory.mode	@ltx/en_us_goadedes/miscellanea:misc.Mode4
ltx/en_us_goadedes/me.m01.d16:meMA.LaudsGlory.text	
ltx/en_us_goadedes/me.m01.d16:meMA.LaudsStavrotheotokion.greekmelody	@ltx/en_us_goadedes/he.a.m4:heAU.OsGennaionEnMartysi.greekname
ltx/en_us_goadedes/me.m01.d16:meMA.LaudsStavrotheotokion.incipit	…
ltx/en_us_goadedes/me.m01.d16:meMA.LaudsStavrotheotokion.melody	@ltx/en_us_goadedes/he.a.m4:heAU.OsGennaionEnMartysi.name
ltx/en_us_goadedes/me.m01.d16:meMA.LaudsStavrotheotokion.mode	@ltx/en_us_goadedes/miscellanea:misc.Mode4
ltx/en_us_goadedes/me.m01.d16:meMA.LaudsStavrotheotokion.text	
ltx/en_us_goadedes/me.m01.d16:meMA.LaudsTheotokion.greekmelody	@ltx/en_us_goadedes/he.a.m4:heAU.OsGennaionEnMartysi.greekname
ltx/en_us_goadedes/me.m01.d16:meMA.LaudsTheotokion.incipit	@ltx/en_us_goadedes/oc.m4.d2:ocVE.SticTheotokion.incipit
ltx/en_us_goadedes/me.m01.d16:meMA.LaudsTheotokion.melody	@ltx/en_us_goadedes/he.a.m4:heAU.OsGennaionEnMartysi.name
ltx/en_us_goadedes/me.m01.d16:meMA.LaudsTheotokion.mode	@ltx/en_us_goadedes/miscellanea:misc.Mode4
ltx/en_us_goadedes/me.m01.d16:meMA.LaudsTheotokion.text	@ltx/en_us_goadedes/oc.m4.d2:ocVE.SticTheotokion.text
ltx/en_us_goadedes/me.m01.d16:meMA.MM.Lauds1123as5678.text	@ltx/en_us_goadedes/properties:media.key
ltx/en_us_goadedes/me.m01.d16:meMA.Ode1C11.greekmelody	@ltx/en_us_goadedes/he.h.m4:heHE.AnoixoToStomaMou.greekname
ltx/en_us_goadedes/me.m01.d16:meMA.Ode1C11.incipit	O preeminent and boast…
ltx/en_us_goadedes/me.m01.d16:meMA.Ode1C11.melody	@ltx/en_us_goadedes/he.h.m4:heHE.AnoixoToStomaMou.notmetered
ltx/en_us_goadedes/me.m01.d16:meMA.Ode1C11.mode	@ltx/en_us_goadedes/miscellanea:misc.Mode4
ltx/en_us_goadedes/me.m01.d16:meMA.Ode1C11.ode	@ltx/en_us_goadedes/miscellanea:misc.Ode1
ltx/en_us_goadedes/me.m01.d16:meMA.Ode1C11.text	O preeminent and boast of Christ’s Apostles, we are established on the rock of your inspired confession. With faith we venerate the chains that bound your immaculate hands.
ltx/en_us_goadedes/me.m01.d16:meMA.Ode1C12.incipit	…
ltx/en_us_goadedes/me.m01.d16:meMA.Ode1C12.melody	@ltx/en_us_goadedes/he.h.m4:heHE.AnoixoToStomaMou.notmetered
ltx/en_us_goadedes/me.m01.d16:meMA.Ode1C12.mode	@ltx/en_us_goadedes/miscellanea:misc.Mode4
ltx/en_us_goadedes/me.m01.d16:meMA.Ode1C12.ode	@ltx/en_us_goadedes/miscellanea:misc.Ode1
ltx/en_us_goadedes/me.m01.d16:meMA.Ode1C12.text	O Apostle, the Lord appointed you to be a most truthful witness of His incarnation, and to proclaim His coming, His crucifixion and death, and His resurrection.
ltx/en_us_goadedes/me.m01.d16:meMA.Ode1C13.incipit	…
ltx/en_us_goadedes/me.m01.d16:meMA.Ode1C13.melody	@ltx/en_us_goadedes/he.h.m4:heHE.AnoixoToStomaMou.notmetered
ltx/en_us_goadedes/me.m01.d16:meMA.Ode1C13.mode	@ltx/en_us_goadedes/miscellanea:misc.Mode4
ltx/en_us_goadedes/me.m01.d16:meMA.Ode1C13.ode	@ltx/en_us_goadedes/miscellanea:misc.Ode1
ltx/en_us_goadedes/me.m01.d16:meMA.Ode1C13.text	O Peter, even after you denied the Lord three times before the murderers of God, as though He were only a man, you did fall short of your former theology; for indeed you proclaimed Him to be both the Son of God and God.
ltx/en_us_goadedes/me.m01.d16:meMA.Ode1C14.incipit	…
ltx/en_us_goadedes/me.m01.d16:meMA.Ode1C14.melody	@ltx/en_us_goadedes/he.h.m4:heHE.AnoixoToStomaMou.notmetered
ltx/en_us_goadedes/me.m01.d16:meMA.Ode1C14.mode	@ltx/en_us_goadedes/miscellanea:misc.Mode4
ltx/en_us_goadedes/me.m01.d16:meMA.Ode1C14.ode	@ltx/en_us_goadedes/miscellanea:misc.Ode1
ltx/en_us_goadedes/me.m01.d16:meMA.Ode1C14.text	O compassionate Apostle, as we faithfully venerate your holy chain, break the chains of sin around our necks; take pity on us and unlock for us the gates of the kingdom of heaven.
ltx/en_us_goadedes/me.m01.d16:meMA.Ode1C1T.incipit	…
ltx/en_us_goadedes/me.m01.d16:meMA.Ode1C1T.melody	@ltx/en_us_goadedes/he.h.m4:heHE.AnoixoToStomaMou.notmetered
ltx/en_us_goadedes/me.m01.d16:meMA.Ode1C1T.mode	@ltx/en_us_goadedes/miscellanea:misc.Mode4
ltx/en_us_goadedes/me.m01.d16:meMA.Ode1C1T.ode	@ltx/en_us_goadedes/miscellanea:misc.Ode1
ltx/en_us_goadedes/me.m01.d16:meMA.Ode1C1T.text	O ever-virgin Lady, I am defiled and impure, and therefore I am unable to sing of you, the all-pure dwelling of purity. Please cleanse me by the Spirit, as in blast furnace, and I will glorify you.
ltx/en_us_goadedes/me.m01.d16:meMA.Ode1C21.greekmelody	@ltx/en_us_goadedes/he.h.m4:heHE.ChoroiIsrail.greekname
ltx/en_us_goadedes/me.m01.d16:meMA.Ode1C21.incipit	…
ltx/en_us_goadedes/me.m01.d16:meMA.Ode1C21.melody	@ltx/en_us_goadedes/he.h.m4:heHE.ChoroiIsrail.name
ltx/en_us_goadedes/me.m01.d16:meMA.Ode1C21.mode	@ltx/en_us_goadedes/miscellanea:misc.Mode4
ltx/en_us_goadedes/me.m01.d16:meMA.Ode1C21.ode	@ltx/en_us_goadedes/miscellanea:misc.Ode1
ltx/en_us_goadedes/me.m01.d16:meMA.Ode1C21.text	
ltx/en_us_goadedes/me.m01.d16:meMA.Ode1C22.incipit	…
ltx/en_us_goadedes/me.m01.d16:meMA.Ode1C22.melody	@ltx/en_us_goadedes/he.h.m4:heHE.ChoroiIsrail.name
ltx/en_us_goadedes/me.m01.d16:meMA.Ode1C22.mode	@ltx/en_us_goadedes/miscellanea:misc.Mode4
ltx/en_us_goadedes/me.m01.d16:meMA.Ode1C22.ode	@ltx/en_us_goadedes/miscellanea:misc.Ode1
ltx/en_us_goadedes/me.m01.d16:meMA.Ode1C22.text	
ltx/en_us_goadedes/me.m01.d16:meMA.Ode1C23.incipit	…
ltx/en_us_goadedes/me.m01.d16:meMA.Ode1C23.melody	@ltx/en_us_goadedes/he.h.m4:heHE.ChoroiIsrail.name
ltx/en_us_goadedes/me.m01.d16:meMA.Ode1C23.mode	@ltx/en_us_goadedes/miscellanea:misc.Mode4
ltx/en_us_goadedes/me.m01.d16:meMA.Ode1C23.ode	@ltx/en_us_goadedes/miscellanea:misc.Ode1
ltx/en_us_goadedes/me.m01.d16:meMA.Ode1C23.text	
ltx/en_us_goadedes/me.m01.d16:meMA.Ode1C2T.incipit	…
ltx/en_us_goadedes/me.m01.d16:meMA.Ode1C2T.melody	@ltx/en_us_goadedes/he.h.m4:heHE.ChoroiIsrail.name
ltx/en_us_goadedes/me.m01.d16:meMA.Ode1C2T.mode	@ltx/en_us_goadedes/miscellanea:misc.Mode4
ltx/en_us_goadedes/me.m01.d16:meMA.Ode1C2T.ode	@ltx/en_us_goadedes/miscellanea:misc.Ode1
ltx/en_us_goadedes/me.m01.d16:meMA.Ode1C2T.text	
ltx/en_us_goadedes/me.m01.d16:meMA.Ode3C11.greekmelody	@ltx/en_us_goadedes/he.h.m4:heHE.OukEnSofia.greekname
ltx/en_us_goadedes/me.m01.d16:meMA.Ode3C11.incipit	O all-lauded Peter…
ltx/en_us_goadedes/me.m01.d16:meMA.Ode3C11.melody	@ltx/en_us_goadedes/he.h.m4:heHE.OukEnSofia.notmetered
ltx/en_us_goadedes/me.m01.d16:meMA.Ode3C11.mode	@ltx/en_us_goadedes/miscellanea:misc.Mode4
ltx/en_us_goadedes/me.m01.d16:meMA.Ode3C11.ode	@ltx/en_us_goadedes/miscellanea:misc.Ode3
ltx/en_us_goadedes/me.m01.d16:meMA.Ode3C11.text	O all-lauded Peter, the Church honors your suffering, and she venerates the chains, to which wicked Herod condemned you as a criminal.
ltx/en_us_goadedes/me.m01.d16:meMA.Ode3C12.incipit	…
ltx/en_us_goadedes/me.m01.d16:meMA.Ode3C12.melody	@ltx/en_us_goadedes/he.h.m4:heHE.OukEnSofia.notmetered
ltx/en_us_goadedes/me.m01.d16:meMA.Ode3C12.mode	@ltx/en_us_goadedes/miscellanea:misc.Mode4
ltx/en_us_goadedes/me.m01.d16:meMA.Ode3C12.ode	@ltx/en_us_goadedes/miscellanea:misc.Ode3
ltx/en_us_goadedes/me.m01.d16:meMA.Ode3C12.text	O Apostle, the Church is decorated by your chains more than with gold and expensive ornaments. She venerates them and is honored to have them, because they were yours.
ltx/en_us_goadedes/me.m01.d16:meMA.Ode3C13.incipit	…
ltx/en_us_goadedes/me.m01.d16:meMA.Ode3C13.melody	@ltx/en_us_goadedes/he.h.m4:heHE.OukEnSofia.notmetered
ltx/en_us_goadedes/me.m01.d16:meMA.Ode3C13.mode	@ltx/en_us_goadedes/miscellanea:misc.Mode4
ltx/en_us_goadedes/me.m01.d16:meMA.Ode3C13.ode	@ltx/en_us_goadedes/miscellanea:misc.Ode3
ltx/en_us_goadedes/me.m01.d16:meMA.Ode3C13.text	O Peter, intending to slay you, Herod the tetrarch delivered you to four squads of soldiers to guard you, and they bound you in four chains. But Christ rescued you from them by the hand of an Angel.
ltx/en_us_goadedes/me.m01.d16:meMA.Ode3C14.incipit	…
ltx/en_us_goadedes/me.m01.d16:meMA.Ode3C14.melody	@ltx/en_us_goadedes/he.h.m4:heHE.OukEnSofia.notmetered
ltx/en_us_goadedes/me.m01.d16:meMA.Ode3C14.mode	@ltx/en_us_goadedes/miscellanea:misc.Mode4
ltx/en_us_goadedes/me.m01.d16:meMA.Ode3C14.ode	@ltx/en_us_goadedes/miscellanea:misc.Ode3
ltx/en_us_goadedes/me.m01.d16:meMA.Ode3C14.text	O Apostle, the chains that touched your holy and all-venerable body partook of the grace that was in you. Therefore they now sanctify all venerate them.
ltx/en_us_goadedes/me.m01.d16:meMA.Ode3C1T.incipit	…
ltx/en_us_goadedes/me.m01.d16:meMA.Ode3C1T.melody	@ltx/en_us_goadedes/he.h.m4:heHE.OukEnSofia.notmetered
ltx/en_us_goadedes/me.m01.d16:meMA.Ode3C1T.mode	@ltx/en_us_goadedes/miscellanea:misc.Mode4
ltx/en_us_goadedes/me.m01.d16:meMA.Ode3C1T.ode	@ltx/en_us_goadedes/miscellanea:misc.Ode3
ltx/en_us_goadedes/me.m01.d16:meMA.Ode3C1T.text	O pure Virgin, behold, human nature is released from the primal curse; and Satan, the cause of the fall, is undone. You are the one who gave birth to this blessing for us.
ltx/en_us_goadedes/me.m01.d16:meMA.Ode3C21.greekmelody	@ltx/en_us_goadedes/he.h.m4:heHE.ToxonDynatonIsthenise.greekname
ltx/en_us_goadedes/me.m01.d16:meMA.Ode3C21.incipit	…
ltx/en_us_goadedes/me.m01.d16:meMA.Ode3C21.melody	@ltx/en_us_goadedes/he.h.m4:heHE.ToxonDynatonIsthenise.name
ltx/en_us_goadedes/me.m01.d16:meMA.Ode3C21.mode	@ltx/en_us_goadedes/miscellanea:misc.Mode4
ltx/en_us_goadedes/me.m01.d16:meMA.Ode3C21.ode	@ltx/en_us_goadedes/miscellanea:misc.Ode3
ltx/en_us_goadedes/me.m01.d16:meMA.Ode3C21.text	
ltx/en_us_goadedes/me.m01.d16:meMA.Ode3C22.incipit	…
ltx/en_us_goadedes/me.m01.d16:meMA.Ode3C22.melody	@ltx/en_us_goadedes/he.h.m4:heHE.ToxonDynatonIsthenise.name
ltx/en_us_goadedes/me.m01.d16:meMA.Ode3C22.mode	@ltx/en_us_goadedes/miscellanea:misc.Mode4
ltx/en_us_goadedes/me.m01.d16:meMA.Ode3C22.ode	@ltx/en_us_goadedes/miscellanea:misc.Ode3
ltx/en_us_goadedes/me.m01.d16:meMA.Ode3C22.text	
ltx/en_us_goadedes/me.m01.d16:meMA.Ode3C23.incipit	…
ltx/en_us_goadedes/me.m01.d16:meMA.Ode3C23.melody	@ltx/en_us_goadedes/he.h.m4:heHE.ToxonDynatonIsthenise.name
ltx/en_us_goadedes/me.m01.d16:meMA.Ode3C23.mode	@ltx/en_us_goadedes/miscellanea:misc.Mode4
ltx/en_us_goadedes/me.m01.d16:meMA.Ode3C23.ode	@ltx/en_us_goadedes/miscellanea:misc.Ode3
ltx/en_us_goadedes/me.m01.d16:meMA.Ode3C23.text	
ltx/en_us_goadedes/me.m01.d16:meMA.Ode3C2T.incipit	…
ltx/en_us_goadedes/me.m01.d16:meMA.Ode3C2T.melody	@ltx/en_us_goadedes/he.h.m4:heHE.ToxonDynatonIsthenise.name
ltx/en_us_goadedes/me.m01.d16:meMA.Ode3C2T.mode	@ltx/en_us_goadedes/miscellanea:misc.Mode4
ltx/en_us_goadedes/me.m01.d16:meMA.Ode3C2T.ode	@ltx/en_us_goadedes/miscellanea:misc.Ode3
ltx/en_us_goadedes/me.m01.d16:meMA.Ode3C2T.text	
ltx/en_us_goadedes/me.m01.d16:meMA.Ode3H.greekmelody	@ltx/en_us_goadedes/he.h.m4:heHE.ToxonDynatonIsthenise.greekname
ltx/en_us_goadedes/me.m01.d16:meMA.Ode3H.incipit	@ltx/en_us_goadedes/he.h.m4:heHE.ToxonDynatonIsthenise.incipit
ltx/en_us_goadedes/me.m01.d16:meMA.Ode3H.melody	@ltx/en_us_goadedes/he.h.m4:heHE.ToxonDynatonIsthenise.melody
ltx/en_us_goadedes/me.m01.d16:meMA.Ode3H.mode	@ltx/en_us_goadedes/miscellanea:misc.Mode4
ltx/en_us_goadedes/me.m01.d16:meMA.Ode3H.ode	@ltx/en_us_goadedes/miscellanea:misc.Ode3
ltx/en_us_goadedes/me.m01.d16:meMA.Ode3H.text	@ltx/en_us_goadedes/he.h.m4:heHE.ToxonDynatonIsthenise.text
ltx/en_us_goadedes/me.m01.d16:meMA.Ode3Kathisma1.greekmelody	@ltx/en_us_goadedes/he.a.m4:heAU.TachyProkatalave.greekname
ltx/en_us_goadedes/me.m01.d16:meMA.Ode3Kathisma1.incipit	O holy Apostle…
ltx/en_us_goadedes/me.m01.d16:meMA.Ode3Kathisma1.melody	@ltx/en_us_goadedes/he.a.m4:heAU.TachyProkatalave.name
ltx/en_us_goadedes/me.m01.d16:meMA.Ode3Kathisma1.mode	@ltx/en_us_goadedes/miscellanea:misc.Mode4
ltx/en_us_goadedes/me.m01.d16:meMA.Ode3Kathisma1.text	O holy Apostle Peter, you have truly become * a temple of the Holy Trinity. We faithfully pray * to you in your holy house: * Illumine and sanctify us and fulfill our petitions; * free us from the devil’s crafty schemes and every scandal; * and earnestly pray to Christ for us who honor you.
ltx/en_us_goadedes/me.m01.d16:meMA.Ode3Kathisma2.greekmelody	@ltx/en_us_goadedes/he.a.m4:heAU.OYpsotheisEnToStavro.greekname
ltx/en_us_goadedes/me.m01.d16:meMA.Ode3Kathisma2.incipit	You are preeminent…
ltx/en_us_goadedes/me.m01.d16:meMA.Ode3Kathisma2.melody	@ltx/en_us_goadedes/he.a.m4:heAU.OYpsotheisEnToStavro.name
ltx/en_us_goadedes/me.m01.d16:meMA.Ode3Kathisma2.mode	@ltx/en_us_goadedes/miscellanea:misc.Mode4
ltx/en_us_goadedes/me.m01.d16:meMA.Ode3Kathisma2.text	You are preeminent of Christ’s wise Apostles. * You have the keys unto the kingdom of heaven. * O holy Apostle, we extol you with faith; * and we kiss and venerate with a purified conscience * the Chains that you wore as if a criminal, O Peter, * when you undid the mischief of the foe. * Entreat the Savior to free of from this as well.
ltx/en_us_goadedes/me.m01.d16:meMA.Ode3KathismaSt.incipit	…
ltx/en_us_goadedes/me.m01.d16:meMA.Ode3KathismaSt.melody	@ltx/en_us_goadedes/he.a.m4:heAU.OYpsotheisEnToStavro.name
ltx/en_us_goadedes/me.m01.d16:meMA.Ode3KathismaSt.mode	@ltx/en_us_goadedes/miscellanea:misc.Mode4
ltx/en_us_goadedes/me.m01.d16:meMA.Ode3KathismaSt.text	
ltx/en_us_goadedes/me.m01.d16:meMA.Ode3KathismaT.incipit	You are superior…
ltx/en_us_goadedes/me.m01.d16:meMA.Ode3KathismaT.melody	@ltx/en_us_goadedes/he.a.m4:heAU.OYpsotheisEnToStavro.name
ltx/en_us_goadedes/me.m01.d16:meMA.Ode3KathismaT.mode	@ltx/en_us_goadedes/miscellanea:misc.Mode4
ltx/en_us_goadedes/me.m01.d16:meMA.Ode3KathismaT.text	You are superior in honor and glory * to Cherubim and Seraphim, and more spacious * than heaven and the earth. And you exceed beyond compare * all creation, visible and invisible, Lady, * for the heavens’ wide expanse is unable to hold Him, * whom you contained within your virgin womb. * Earnestly pray Him to save us who serve you now.
ltx/en_us_goadedes/me.m01.d16:meMA.Ode4C11.greekmelody	@ltx/en_us_goadedes/he.h.m4:heHE.OKathimenosEnDoxi.greekname
ltx/en_us_goadedes/me.m01.d16:meMA.Ode4C11.incipit	O Peter, the capital city…
ltx/en_us_goadedes/me.m01.d16:meMA.Ode4C11.melody	@ltx/en_us_goadedes/he.h.m4:heHE.OKathimenosEnDoxi.notmetered
ltx/en_us_goadedes/me.m01.d16:meMA.Ode4C11.mode	@ltx/en_us_goadedes/miscellanea:misc.Mode4
ltx/en_us_goadedes/me.m01.d16:meMA.Ode4C11.ode	@ltx/en_us_goadedes/miscellanea:misc.Ode4
ltx/en_us_goadedes/me.m01.d16:meMA.Ode4C11.text	O Peter, the capital city and imperial court of old would mentally gird themselves in faith with your most precious chains, and they would actually kiss and venerate them and celebrate your might and your miracles.
ltx/en_us_goadedes/me.m01.d16:meMA.Ode4C12.incipit	…
ltx/en_us_goadedes/me.m01.d16:meMA.Ode4C12.melody	@ltx/en_us_goadedes/he.h.m4:heHE.OKathimenosEnDoxi.notmetered
ltx/en_us_goadedes/me.m01.d16:meMA.Ode4C12.mode	@ltx/en_us_goadedes/miscellanea:misc.Mode4
ltx/en_us_goadedes/me.m01.d16:meMA.Ode4C12.ode	@ltx/en_us_goadedes/miscellanea:misc.Ode4
ltx/en_us_goadedes/me.m01.d16:meMA.Ode4C12.text	O Apostle, Herod had you chained and imprisoned, in order to bring you before the deicidal mob. But God preserved you. And you have left your chains, so that we who pray to you may venerate them.
ltx/en_us_goadedes/me.m01.d16:meMA.Ode4C13.incipit	…
ltx/en_us_goadedes/me.m01.d16:meMA.Ode4C13.melody	@ltx/en_us_goadedes/he.h.m4:heHE.OKathimenosEnDoxi.notmetered
ltx/en_us_goadedes/me.m01.d16:meMA.Ode4C13.mode	@ltx/en_us_goadedes/miscellanea:misc.Mode4
ltx/en_us_goadedes/me.m01.d16:meMA.Ode4C13.ode	@ltx/en_us_goadedes/miscellanea:misc.Ode4
ltx/en_us_goadedes/me.m01.d16:meMA.Ode4C13.text	O all-venerable Peter, the chain that bound you opened and was filled with grace, by touching your immaculate body. Because of you it passes on sanctification to all of us who venerate it.
ltx/en_us_goadedes/me.m01.d16:meMA.Ode4C14.incipit	…
ltx/en_us_goadedes/me.m01.d16:meMA.Ode4C14.melody	@ltx/en_us_goadedes/he.h.m4:heHE.OKathimenosEnDoxi.notmetered
ltx/en_us_goadedes/me.m01.d16:meMA.Ode4C14.mode	@ltx/en_us_goadedes/miscellanea:misc.Mode4
ltx/en_us_goadedes/me.m01.d16:meMA.Ode4C14.ode	@ltx/en_us_goadedes/miscellanea:misc.Ode4
ltx/en_us_goadedes/me.m01.d16:meMA.Ode4C14.text	Let us approach with fear and love and venerate Peter’s chains, and by these symbols bring our faith to the Apostle, with the assurance that our veneration passes over to him.
ltx/en_us_goadedes/me.m01.d16:meMA.Ode4C1T.incipit	…
ltx/en_us_goadedes/me.m01.d16:meMA.Ode4C1T.melody	@ltx/en_us_goadedes/he.h.m4:heHE.OKathimenosEnDoxi.notmetered
ltx/en_us_goadedes/me.m01.d16:meMA.Ode4C1T.mode	@ltx/en_us_goadedes/miscellanea:misc.Mode4
ltx/en_us_goadedes/me.m01.d16:meMA.Ode4C1T.ode	@ltx/en_us_goadedes/miscellanea:misc.Ode4
ltx/en_us_goadedes/me.m01.d16:meMA.Ode4C1T.text	O Lady, when we extol you as the Theotokos who gave birth to God in a body, we overturn every heresy. The Logos truly fashioned and gave life to the soul-endowed flesh taken from your blood.
ltx/en_us_goadedes/me.m01.d16:meMA.Ode4C21.greekmelody	@ltx/en_us_goadedes/he.h.m4:heHE.DiAgapisinOiktirmon.greekname
ltx/en_us_goadedes/me.m01.d16:meMA.Ode4C21.incipit	…
ltx/en_us_goadedes/me.m01.d16:meMA.Ode4C21.melody	@ltx/en_us_goadedes/he.h.m4:heHE.DiAgapisinOiktirmon.name
ltx/en_us_goadedes/me.m01.d16:meMA.Ode4C21.mode	@ltx/en_us_goadedes/miscellanea:misc.Mode4
ltx/en_us_goadedes/me.m01.d16:meMA.Ode4C21.ode	@ltx/en_us_goadedes/miscellanea:misc.Ode4
ltx/en_us_goadedes/me.m01.d16:meMA.Ode4C21.text	
ltx/en_us_goadedes/me.m01.d16:meMA.Ode4C22.incipit	…
ltx/en_us_goadedes/me.m01.d16:meMA.Ode4C22.melody	@ltx/en_us_goadedes/he.h.m4:heHE.DiAgapisinOiktirmon.name
ltx/en_us_goadedes/me.m01.d16:meMA.Ode4C22.mode	@ltx/en_us_goadedes/miscellanea:misc.Mode4
ltx/en_us_goadedes/me.m01.d16:meMA.Ode4C22.ode	@ltx/en_us_goadedes/miscellanea:misc.Ode4
ltx/en_us_goadedes/me.m01.d16:meMA.Ode4C22.text	
ltx/en_us_goadedes/me.m01.d16:meMA.Ode4C23.incipit	…
ltx/en_us_goadedes/me.m01.d16:meMA.Ode4C23.melody	@ltx/en_us_goadedes/he.h.m4:heHE.DiAgapisinOiktirmon.name
ltx/en_us_goadedes/me.m01.d16:meMA.Ode4C23.mode	@ltx/en_us_goadedes/miscellanea:misc.Mode4
ltx/en_us_goadedes/me.m01.d16:meMA.Ode4C23.ode	@ltx/en_us_goadedes/miscellanea:misc.Ode4
ltx/en_us_goadedes/me.m01.d16:meMA.Ode4C23.text	
ltx/en_us_goadedes/me.m01.d16:meMA.Ode4C24.incipit	…
ltx/en_us_goadedes/me.m01.d16:meMA.Ode4C24.melody	@ltx/en_us_goadedes/he.h.m4:heHE.DiAgapisinOiktirmon.name
ltx/en_us_goadedes/me.m01.d16:meMA.Ode4C24.mode	@ltx/en_us_goadedes/miscellanea:misc.Mode4
ltx/en_us_goadedes/me.m01.d16:meMA.Ode4C24.ode	@ltx/en_us_goadedes/miscellanea:misc.Ode4
ltx/en_us_goadedes/me.m01.d16:meMA.Ode4C24.text	
ltx/en_us_goadedes/me.m01.d16:meMA.Ode4C2T.incipit	…
ltx/en_us_goadedes/me.m01.d16:meMA.Ode4C2T.melody	@ltx/en_us_goadedes/he.h.m4:heHE.DiAgapisinOiktirmon.name
ltx/en_us_goadedes/me.m01.d16:meMA.Ode4C2T.mode	@ltx/en_us_goadedes/miscellanea:misc.Mode4
ltx/en_us_goadedes/me.m01.d16:meMA.Ode4C2T.ode	@ltx/en_us_goadedes/miscellanea:misc.Ode4
ltx/en_us_goadedes/me.m01.d16:meMA.Ode4C2T.text	
ltx/en_us_goadedes/me.m01.d16:meMA.Ode5C11.greekmelody	@ltx/en_us_goadedes/he.h.m4:heHE.NynAnastisomai.greekname
ltx/en_us_goadedes/me.m01.d16:meMA.Ode5C11.incipit	O Apostle, you received…
ltx/en_us_goadedes/me.m01.d16:meMA.Ode5C11.melody	@ltx/en_us_goadedes/he.h.m4:heHE.NynAnastisomai.notmetered
ltx/en_us_goadedes/me.m01.d16:meMA.Ode5C11.mode	@ltx/en_us_goadedes/miscellanea:misc.Mode4
ltx/en_us_goadedes/me.m01.d16:meMA.Ode5C11.ode	@ltx/en_us_goadedes/miscellanea:misc.Ode5
ltx/en_us_goadedes/me.m01.d16:meMA.Ode5C11.text	O Apostle, you received authority from the Savior to bind and loose offenses. I pray you remove the collar of sin on my neck that pulls me toward corruption.
ltx/en_us_goadedes/me.m01.d16:meMA.Ode5C12.incipit	…
ltx/en_us_goadedes/me.m01.d16:meMA.Ode5C12.melody	@ltx/en_us_goadedes/he.h.m4:heHE.NynAnastisomai.notmetered
ltx/en_us_goadedes/me.m01.d16:meMA.Ode5C12.mode	@ltx/en_us_goadedes/miscellanea:misc.Mode4
ltx/en_us_goadedes/me.m01.d16:meMA.Ode5C12.ode	@ltx/en_us_goadedes/miscellanea:misc.Ode5
ltx/en_us_goadedes/me.m01.d16:meMA.Ode5C12.text	O all-lauded Peter, we faithfully venerate the chains, with which you were bound for the sake of the Church, in which end the scandals and grant unanimity. We also pray you stop unrest throughout the world.
ltx/en_us_goadedes/me.m01.d16:meMA.Ode5C13.incipit	…
ltx/en_us_goadedes/me.m01.d16:meMA.Ode5C13.melody	@ltx/en_us_goadedes/he.h.m4:heHE.NynAnastisomai.notmetered
ltx/en_us_goadedes/me.m01.d16:meMA.Ode5C13.mode	@ltx/en_us_goadedes/miscellanea:misc.Mode4
ltx/en_us_goadedes/me.m01.d16:meMA.Ode5C13.ode	@ltx/en_us_goadedes/miscellanea:misc.Ode5
ltx/en_us_goadedes/me.m01.d16:meMA.Ode5C13.text	O Apostle, we faithfully venerate your chain. We pray you rescue us from spiritual captivity. As our shepherd and teacher, guide us to the heavenly dwellings, for you were entrusted with them.
ltx/en_us_goadedes/me.m01.d16:meMA.Ode5C14.incipit	…
ltx/en_us_goadedes/me.m01.d16:meMA.Ode5C14.melody	@ltx/en_us_goadedes/he.h.m4:heHE.NynAnastisomai.notmetered
ltx/en_us_goadedes/me.m01.d16:meMA.Ode5C14.mode	@ltx/en_us_goadedes/miscellanea:misc.Mode4
ltx/en_us_goadedes/me.m01.d16:meMA.Ode5C14.ode	@ltx/en_us_goadedes/miscellanea:misc.Ode5
ltx/en_us_goadedes/me.m01.d16:meMA.Ode5C14.text	O all-lauded Apostle Peter, by your awesome intercession, your Teacher allows people to govern us. We pray you to guide them and preserve them in piety, by your mighty right hand. 
ltx/en_us_goadedes/me.m01.d16:meMA.Ode5C1T.incipit	…
ltx/en_us_goadedes/me.m01.d16:meMA.Ode5C1T.melody	@ltx/en_us_goadedes/he.h.m4:heHE.NynAnastisomai.notmetered
ltx/en_us_goadedes/me.m01.d16:meMA.Ode5C1T.mode	@ltx/en_us_goadedes/miscellanea:misc.Mode4
ltx/en_us_goadedes/me.m01.d16:meMA.Ode5C1T.ode	@ltx/en_us_goadedes/miscellanea:misc.Ode5
ltx/en_us_goadedes/me.m01.d16:meMA.Ode5C1T.text	O all-lauded Virgin, the sun has seen that you greatly surpass its brightness. From you, God appeared as a man, and He lifts those who honor you to the light of His divinity.
ltx/en_us_goadedes/me.m01.d16:meMA.Ode5C21.greekmelody	@ltx/en_us_goadedes/he.h.m4:heHE.TonFotismonSouKyrie.greekname
ltx/en_us_goadedes/me.m01.d16:meMA.Ode5C21.incipit	…
ltx/en_us_goadedes/me.m01.d16:meMA.Ode5C21.melody	@ltx/en_us_goadedes/he.h.m4:heHE.TonFotismonSouKyrie.name
ltx/en_us_goadedes/me.m01.d16:meMA.Ode5C21.mode	@ltx/en_us_goadedes/miscellanea:misc.Mode4
ltx/en_us_goadedes/me.m01.d16:meMA.Ode5C21.ode	@ltx/en_us_goadedes/miscellanea:misc.Ode5
ltx/en_us_goadedes/me.m01.d16:meMA.Ode5C21.text	
ltx/en_us_goadedes/me.m01.d16:meMA.Ode5C22.incipit	…
ltx/en_us_goadedes/me.m01.d16:meMA.Ode5C22.melody	@ltx/en_us_goadedes/he.h.m4:heHE.TonFotismonSouKyrie.name
ltx/en_us_goadedes/me.m01.d16:meMA.Ode5C22.mode	@ltx/en_us_goadedes/miscellanea:misc.Mode4
ltx/en_us_goadedes/me.m01.d16:meMA.Ode5C22.ode	@ltx/en_us_goadedes/miscellanea:misc.Ode5
ltx/en_us_goadedes/me.m01.d16:meMA.Ode5C22.text	
ltx/en_us_goadedes/me.m01.d16:meMA.Ode5C23.incipit	…
ltx/en_us_goadedes/me.m01.d16:meMA.Ode5C23.melody	@ltx/en_us_goadedes/he.h.m4:heHE.TonFotismonSouKyrie.name
ltx/en_us_goadedes/me.m01.d16:meMA.Ode5C23.mode	@ltx/en_us_goadedes/miscellanea:misc.Mode4
ltx/en_us_goadedes/me.m01.d16:meMA.Ode5C23.ode	@ltx/en_us_goadedes/miscellanea:misc.Ode5
ltx/en_us_goadedes/me.m01.d16:meMA.Ode5C23.text	
ltx/en_us_goadedes/me.m01.d16:meMA.Ode5C2T.incipit	…
ltx/en_us_goadedes/me.m01.d16:meMA.Ode5C2T.melody	@ltx/en_us_goadedes/he.h.m4:heHE.TonFotismonSouKyrie.name
ltx/en_us_goadedes/me.m01.d16:meMA.Ode5C2T.mode	@ltx/en_us_goadedes/miscellanea:misc.Mode4
ltx/en_us_goadedes/me.m01.d16:meMA.Ode5C2T.ode	@ltx/en_us_goadedes/miscellanea:misc.Ode5
ltx/en_us_goadedes/me.m01.d16:meMA.Ode5C2T.text	
ltx/en_us_goadedes/me.m01.d16:meMA.Ode6C11.greekmelody	@ltx/en_us_goadedes/he.h.m4:heHE.IlthonEisTaVathi.greekname
ltx/en_us_goadedes/me.m01.d16:meMA.Ode6C11.incipit	O Peter, the hosts of heaven…
ltx/en_us_goadedes/me.m01.d16:meMA.Ode6C11.melody	@ltx/en_us_goadedes/he.h.m4:heHE.IlthonEisTaVathi.notmetered
ltx/en_us_goadedes/me.m01.d16:meMA.Ode6C11.mode	@ltx/en_us_goadedes/miscellanea:misc.Mode4
ltx/en_us_goadedes/me.m01.d16:meMA.Ode6C11.ode	@ltx/en_us_goadedes/miscellanea:misc.Ode6
ltx/en_us_goadedes/me.m01.d16:meMA.Ode6C11.text	O Peter, the hosts of heaven and the Apostles all celebrate with us on earth, seeing the symbols of your sufferings venerated today.
ltx/en_us_goadedes/me.m01.d16:meMA.Ode6C12.incipit	…
ltx/en_us_goadedes/me.m01.d16:meMA.Ode6C12.melody	@ltx/en_us_goadedes/he.h.m4:heHE.IlthonEisTaVathi.notmetered
ltx/en_us_goadedes/me.m01.d16:meMA.Ode6C12.mode	@ltx/en_us_goadedes/miscellanea:misc.Mode4
ltx/en_us_goadedes/me.m01.d16:meMA.Ode6C12.ode	@ltx/en_us_goadedes/miscellanea:misc.Ode6
ltx/en_us_goadedes/me.m01.d16:meMA.Ode6C12.text	O Peter, the saints all applaud and the demons wail aghast, seeing the symbols of your sufferings venerated today.
ltx/en_us_goadedes/me.m01.d16:meMA.Ode6C13.incipit	…
ltx/en_us_goadedes/me.m01.d16:meMA.Ode6C13.melody	@ltx/en_us_goadedes/he.h.m4:heHE.IlthonEisTaVathi.notmetered
ltx/en_us_goadedes/me.m01.d16:meMA.Ode6C13.mode	@ltx/en_us_goadedes/miscellanea:misc.Mode4
ltx/en_us_goadedes/me.m01.d16:meMA.Ode6C13.ode	@ltx/en_us_goadedes/miscellanea:misc.Ode6
ltx/en_us_goadedes/me.m01.d16:meMA.Ode6C13.text	O Peter, the soldiers guarding you fell asleep the Angel came. Suddenly, from your hands the chains fell off. And we joyously venerate them today.
ltx/en_us_goadedes/me.m01.d16:meMA.Ode6C14.incipit	…
ltx/en_us_goadedes/me.m01.d16:meMA.Ode6C14.melody	@ltx/en_us_goadedes/he.h.m4:heHE.IlthonEisTaVathi.notmetered
ltx/en_us_goadedes/me.m01.d16:meMA.Ode6C14.mode	@ltx/en_us_goadedes/miscellanea:misc.Mode4
ltx/en_us_goadedes/me.m01.d16:meMA.Ode6C14.ode	@ltx/en_us_goadedes/miscellanea:misc.Ode6
ltx/en_us_goadedes/me.m01.d16:meMA.Ode6C14.text	O Apostle, you raised Tabitha when she was dead; but you deadened the guards and shook off the chains. Everything about you transcends reason. Therefore, with faith we honor you.
ltx/en_us_goadedes/me.m01.d16:meMA.Ode6C1T.incipit	…
ltx/en_us_goadedes/me.m01.d16:meMA.Ode6C1T.melody	@ltx/en_us_goadedes/he.h.m4:heHE.IlthonEisTaVathi.notmetered
ltx/en_us_goadedes/me.m01.d16:meMA.Ode6C1T.mode	@ltx/en_us_goadedes/miscellanea:misc.Mode4
ltx/en_us_goadedes/me.m01.d16:meMA.Ode6C1T.ode	@ltx/en_us_goadedes/miscellanea:misc.Ode6
ltx/en_us_goadedes/me.m01.d16:meMA.Ode6C1T.text	O Lady, I am in the winter of perdition, and rivers of countless faults trouble me. Take pity on me, and guide me to a safe place of God.
ltx/en_us_goadedes/me.m01.d16:meMA.Ode6C21.greekmelody	@ltx/en_us_goadedes/he.h.m4:heHE.EvoiseProtypon.greekname
ltx/en_us_goadedes/me.m01.d16:meMA.Ode6C21.incipit	…
ltx/en_us_goadedes/me.m01.d16:meMA.Ode6C21.melody	@ltx/en_us_goadedes/he.h.m4:heHE.EvoiseProtypon.name
ltx/en_us_goadedes/me.m01.d16:meMA.Ode6C21.mode	@ltx/en_us_goadedes/miscellanea:misc.Mode4
ltx/en_us_goadedes/me.m01.d16:meMA.Ode6C21.ode	@ltx/en_us_goadedes/miscellanea:misc.Ode6
ltx/en_us_goadedes/me.m01.d16:meMA.Ode6C21.text	
ltx/en_us_goadedes/me.m01.d16:meMA.Ode6C22.incipit	…
ltx/en_us_goadedes/me.m01.d16:meMA.Ode6C22.melody	@ltx/en_us_goadedes/he.h.m4:heHE.EvoiseProtypon.name
ltx/en_us_goadedes/me.m01.d16:meMA.Ode6C22.mode	@ltx/en_us_goadedes/miscellanea:misc.Mode4
ltx/en_us_goadedes/me.m01.d16:meMA.Ode6C22.ode	@ltx/en_us_goadedes/miscellanea:misc.Ode6
ltx/en_us_goadedes/me.m01.d16:meMA.Ode6C22.text	
ltx/en_us_goadedes/me.m01.d16:meMA.Ode6C23.incipit	…
ltx/en_us_goadedes/me.m01.d16:meMA.Ode6C23.melody	@ltx/en_us_goadedes/he.h.m4:heHE.EvoiseProtypon.name
ltx/en_us_goadedes/me.m01.d16:meMA.Ode6C23.mode	@ltx/en_us_goadedes/miscellanea:misc.Mode4
ltx/en_us_goadedes/me.m01.d16:meMA.Ode6C23.ode	@ltx/en_us_goadedes/miscellanea:misc.Ode6
ltx/en_us_goadedes/me.m01.d16:meMA.Ode6C23.text	
ltx/en_us_goadedes/me.m01.d16:meMA.Ode6C2T.incipit	…
ltx/en_us_goadedes/me.m01.d16:meMA.Ode6C2T.melody	@ltx/en_us_goadedes/he.h.m4:heHE.EvoiseProtypon.name
ltx/en_us_goadedes/me.m01.d16:meMA.Ode6C2T.mode	@ltx/en_us_goadedes/miscellanea:misc.Mode4
ltx/en_us_goadedes/me.m01.d16:meMA.Ode6C2T.ode	@ltx/en_us_goadedes/miscellanea:misc.Ode6
ltx/en_us_goadedes/me.m01.d16:meMA.Ode6C2T.text	
ltx/en_us_goadedes/me.m01.d16:meMA.Ode6H.greekmelody	@ltx/en_us_goadedes/he.h.m4:heHE.EvoiseProtypon.greekname
ltx/en_us_goadedes/me.m01.d16:meMA.Ode6H.incipit	@ltx/en_us_goadedes/he.h.m4:heHE.EvoiseProtypon.incipit
ltx/en_us_goadedes/me.m01.d16:meMA.Ode6H.melody	@ltx/en_us_goadedes/he.h.m4:heHE.EvoiseProtypon.melody
ltx/en_us_goadedes/me.m01.d16:meMA.Ode6H.mode	@ltx/en_us_goadedes/miscellanea:misc.Mode4
ltx/en_us_goadedes/me.m01.d16:meMA.Ode6H.ode	@ltx/en_us_goadedes/miscellanea:misc.Ode6
ltx/en_us_goadedes/me.m01.d16:meMA.Ode6H.text	@ltx/en_us_goadedes/he.h.m4:heHE.EvoiseProtypon.text
ltx/en_us_goadedes/me.m01.d16:meMA.Ode7C11.greekmelody	@ltx/en_us_goadedes/he.h.m4:heHE.ODiasosasEnPyri.greekname
ltx/en_us_goadedes/me.m01.d16:meMA.Ode7C11.incipit	O Apostle, Herod thought he ruled…
ltx/en_us_goadedes/me.m01.d16:meMA.Ode7C11.melody	@ltx/en_us_goadedes/he.h.m4:heHE.ODiasosasEnPyri.notmetered
ltx/en_us_goadedes/me.m01.d16:meMA.Ode7C11.mode	@ltx/en_us_goadedes/miscellanea:misc.Mode4
ltx/en_us_goadedes/me.m01.d16:meMA.Ode7C11.ode	@ltx/en_us_goadedes/miscellanea:misc.Ode7
ltx/en_us_goadedes/me.m01.d16:meMA.Ode7C11.text	O Apostle, Herod thought he ruled but was instead ruled by pleasure. He did what would please the Jews and sentenced you to have your hands bound with chains, which we today honor, as we extol you.
ltx/en_us_goadedes/me.m01.d16:meMA.Ode7C12.incipit	…
ltx/en_us_goadedes/me.m01.d16:meMA.Ode7C12.melody	@ltx/en_us_goadedes/he.h.m4:heHE.ODiasosasEnPyri.notmetered
ltx/en_us_goadedes/me.m01.d16:meMA.Ode7C12.mode	@ltx/en_us_goadedes/miscellanea:misc.Mode4
ltx/en_us_goadedes/me.m01.d16:meMA.Ode7C12.ode	@ltx/en_us_goadedes/miscellanea:misc.Ode7
ltx/en_us_goadedes/me.m01.d16:meMA.Ode7C12.text	O Disciple of Christ, all creation yields to you. The sea became walkable, the chains became fibrous, and iron gates were like avenues, all by the power of the Holy Spirit.
ltx/en_us_goadedes/me.m01.d16:meMA.Ode7C13.incipit	…
ltx/en_us_goadedes/me.m01.d16:meMA.Ode7C13.melody	@ltx/en_us_goadedes/he.h.m4:heHE.ODiasosasEnPyri.notmetered
ltx/en_us_goadedes/me.m01.d16:meMA.Ode7C13.mode	@ltx/en_us_goadedes/miscellanea:misc.Mode4
ltx/en_us_goadedes/me.m01.d16:meMA.Ode7C13.ode	@ltx/en_us_goadedes/miscellanea:misc.Ode7
ltx/en_us_goadedes/me.m01.d16:meMA.Ode7C13.text	O Peter, you put a stop to false magicians, you raised the dead and the disabled, you cured diseases and healed the infirm by your shadow, you passed through locked gates, and you escaped from the chains, which are now venerated.
ltx/en_us_goadedes/me.m01.d16:meMA.Ode7C14.incipit	…
ltx/en_us_goadedes/me.m01.d16:meMA.Ode7C14.melody	@ltx/en_us_goadedes/he.h.m4:heHE.ODiasosasEnPyri.notmetered
ltx/en_us_goadedes/me.m01.d16:meMA.Ode7C14.mode	@ltx/en_us_goadedes/miscellanea:misc.Mode4
ltx/en_us_goadedes/me.m01.d16:meMA.Ode7C14.ode	@ltx/en_us_goadedes/miscellanea:misc.Ode7
ltx/en_us_goadedes/me.m01.d16:meMA.Ode7C14.text	Peter, the horse and Apostle of Christ, shot out from Palestine as out of a starting-gate, and preached to the whole world. He reposed in Old Rome, but he gave his chain to New Rome to be venerated.
ltx/en_us_goadedes/me.m01.d16:meMA.Ode7C1T.incipit	…
ltx/en_us_goadedes/me.m01.d16:meMA.Ode7C1T.melody	@ltx/en_us_goadedes/he.h.m4:heHE.ODiasosasEnPyri.notmetered
ltx/en_us_goadedes/me.m01.d16:meMA.Ode7C1T.mode	@ltx/en_us_goadedes/miscellanea:misc.Mode4
ltx/en_us_goadedes/me.m01.d16:meMA.Ode7C1T.ode	@ltx/en_us_goadedes/miscellanea:misc.Ode7
ltx/en_us_goadedes/me.m01.d16:meMA.Ode7C1T.text	O Lady, the Chaldean flame, which did not harm the Servants, signified the novelty of your conception. Please rescue me with the dew of your intercession, for I am inflamed by many transgressions.
ltx/en_us_goadedes/me.m01.d16:meMA.Ode7C21.greekmelody	@ltx/en_us_goadedes/he.h.m4:heHE.AvramiaioiPote.greekname
ltx/en_us_goadedes/me.m01.d16:meMA.Ode7C21.incipit	…
ltx/en_us_goadedes/me.m01.d16:meMA.Ode7C21.melody	@ltx/en_us_goadedes/he.h.m4:heHE.AvramiaioiPote.name
ltx/en_us_goadedes/me.m01.d16:meMA.Ode7C21.mode	@ltx/en_us_goadedes/miscellanea:misc.Mode4
ltx/en_us_goadedes/me.m01.d16:meMA.Ode7C21.ode	@ltx/en_us_goadedes/miscellanea:misc.Ode7
ltx/en_us_goadedes/me.m01.d16:meMA.Ode7C21.text	
ltx/en_us_goadedes/me.m01.d16:meMA.Ode7C22.incipit	…
ltx/en_us_goadedes/me.m01.d16:meMA.Ode7C22.melody	@ltx/en_us_goadedes/he.h.m4:heHE.AvramiaioiPote.name
ltx/en_us_goadedes/me.m01.d16:meMA.Ode7C22.mode	@ltx/en_us_goadedes/miscellanea:misc.Mode4
ltx/en_us_goadedes/me.m01.d16:meMA.Ode7C22.ode	@ltx/en_us_goadedes/miscellanea:misc.Ode7
ltx/en_us_goadedes/me.m01.d16:meMA.Ode7C22.text	
ltx/en_us_goadedes/me.m01.d16:meMA.Ode7C23.incipit	…
ltx/en_us_goadedes/me.m01.d16:meMA.Ode7C23.melody	@ltx/en_us_goadedes/he.h.m4:heHE.AvramiaioiPote.name
ltx/en_us_goadedes/me.m01.d16:meMA.Ode7C23.mode	@ltx/en_us_goadedes/miscellanea:misc.Mode4
ltx/en_us_goadedes/me.m01.d16:meMA.Ode7C23.ode	@ltx/en_us_goadedes/miscellanea:misc.Ode7
ltx/en_us_goadedes/me.m01.d16:meMA.Ode7C23.text	
ltx/en_us_goadedes/me.m01.d16:meMA.Ode7C24.incipit	…
ltx/en_us_goadedes/me.m01.d16:meMA.Ode7C24.melody	@ltx/en_us_goadedes/he.h.m4:heHE.AvramiaioiPote.name
ltx/en_us_goadedes/me.m01.d16:meMA.Ode7C24.mode	@ltx/en_us_goadedes/miscellanea:misc.Mode4
ltx/en_us_goadedes/me.m01.d16:meMA.Ode7C24.ode	@ltx/en_us_goadedes/miscellanea:misc.Ode7
ltx/en_us_goadedes/me.m01.d16:meMA.Ode7C24.text	
ltx/en_us_goadedes/me.m01.d16:meMA.Ode7C2T.incipit	…
ltx/en_us_goadedes/me.m01.d16:meMA.Ode7C2T.melody	@ltx/en_us_goadedes/he.h.m4:heHE.AvramiaioiPote.name
ltx/en_us_goadedes/me.m01.d16:meMA.Ode7C2T.mode	@ltx/en_us_goadedes/miscellanea:misc.Mode4
ltx/en_us_goadedes/me.m01.d16:meMA.Ode7C2T.ode	@ltx/en_us_goadedes/miscellanea:misc.Ode7
ltx/en_us_goadedes/me.m01.d16:meMA.Ode7C2T.text	
ltx/en_us_goadedes/me.m01.d16:meMA.Ode8C11.greekmelody	@ltx/en_us_goadedes/he.h.m4:heHE.LytrotaTouPantos.greekname
ltx/en_us_goadedes/me.m01.d16:meMA.Ode8C11.incipit	Law-giver, shepherd…
ltx/en_us_goadedes/me.m01.d16:meMA.Ode8C11.melody	@ltx/en_us_goadedes/he.h.m4:heHE.LytrotaTouPantos.notmetered
ltx/en_us_goadedes/me.m01.d16:meMA.Ode8C11.mode	@ltx/en_us_goadedes/miscellanea:misc.Mode4
ltx/en_us_goadedes/me.m01.d16:meMA.Ode8C11.ode	@ltx/en_us_goadedes/miscellanea:misc.Ode8
ltx/en_us_goadedes/me.m01.d16:meMA.Ode8C11.text	Law-giver, shepherd, and teacher of the flock of Christ, glorious St. Peter, we who solemnly extol you and faithfully venerate your chains pray you to free us from the bonds of sin.
ltx/en_us_goadedes/me.m01.d16:meMA.Ode8C12.incipit	…
ltx/en_us_goadedes/me.m01.d16:meMA.Ode8C12.melody	@ltx/en_us_goadedes/he.h.m4:heHE.LytrotaTouPantos.notmetered
ltx/en_us_goadedes/me.m01.d16:meMA.Ode8C12.mode	@ltx/en_us_goadedes/miscellanea:misc.Mode4
ltx/en_us_goadedes/me.m01.d16:meMA.Ode8C12.ode	@ltx/en_us_goadedes/miscellanea:misc.Ode8
ltx/en_us_goadedes/me.m01.d16:meMA.Ode8C12.text	O Peter, we who honor your chains pray you to dispel demonic disturbances, calm the winter storm of sin, and expel sickness, peril, tribulation, and foreign attacks.
ltx/en_us_goadedes/me.m01.d16:meMA.Ode8C13.incipit	…
ltx/en_us_goadedes/me.m01.d16:meMA.Ode8C13.melody	@ltx/en_us_goadedes/he.h.m4:heHE.LytrotaTouPantos.notmetered
ltx/en_us_goadedes/me.m01.d16:meMA.Ode8C13.mode	@ltx/en_us_goadedes/miscellanea:misc.Mode4
ltx/en_us_goadedes/me.m01.d16:meMA.Ode8C13.ode	@ltx/en_us_goadedes/miscellanea:misc.Ode8
ltx/en_us_goadedes/me.m01.d16:meMA.Ode8C13.text	O Apostle, all who touch your precious chain are blessed with grace and filled with holiness, and they sing with joy, “Bless the Lord and sing a hymn to Him, O all you works of the Lord.”
ltx/en_us_goadedes/me.m01.d16:meMA.Ode8C14.incipit	…
ltx/en_us_goadedes/me.m01.d16:meMA.Ode8C14.melody	@ltx/en_us_goadedes/he.h.m4:heHE.LytrotaTouPantos.notmetered
ltx/en_us_goadedes/me.m01.d16:meMA.Ode8C14.mode	@ltx/en_us_goadedes/miscellanea:misc.Mode4
ltx/en_us_goadedes/me.m01.d16:meMA.Ode8C14.ode	@ltx/en_us_goadedes/miscellanea:misc.Ode8
ltx/en_us_goadedes/me.m01.d16:meMA.Ode8C14.text	The solemn veneration of your holy chains is better than the enjoyment of any party, O Apostle. And you are the host of this godly celebration.
ltx/en_us_goadedes/me.m01.d16:meMA.Ode8C1T.incipit	…
ltx/en_us_goadedes/me.m01.d16:meMA.Ode8C1T.melody	@ltx/en_us_goadedes/he.h.m4:heHE.LytrotaTouPantos.notmetered
ltx/en_us_goadedes/me.m01.d16:meMA.Ode8C1T.mode	@ltx/en_us_goadedes/miscellanea:misc.Mode4
ltx/en_us_goadedes/me.m01.d16:meMA.Ode8C1T.ode	@ltx/en_us_goadedes/miscellanea:misc.Ode8
ltx/en_us_goadedes/me.m01.d16:meMA.Ode8C1T.text	O Lady, the deceitful serpent crept up to me, and through bad counsel he got me exiled from the Garden of Eden. But the Angel of Great Counsel, who became human in your womb, made me once again a resident of Paradise.
ltx/en_us_goadedes/me.m01.d16:meMA.Ode8C21.greekmelody	@ltx/en_us_goadedes/he.h.m4:heHE.LytrotaTouPantos.greekname
ltx/en_us_goadedes/me.m01.d16:meMA.Ode8C21.incipit	…
ltx/en_us_goadedes/me.m01.d16:meMA.Ode8C21.melody	@ltx/en_us_goadedes/he.h.m4:heHE.LytrotaTouPantos.name
ltx/en_us_goadedes/me.m01.d16:meMA.Ode8C21.mode	@ltx/en_us_goadedes/miscellanea:misc.Mode4
ltx/en_us_goadedes/me.m01.d16:meMA.Ode8C21.ode	@ltx/en_us_goadedes/miscellanea:misc.Ode8
ltx/en_us_goadedes/me.m01.d16:meMA.Ode8C21.text	
ltx/en_us_goadedes/me.m01.d16:meMA.Ode8C22.incipit	…
ltx/en_us_goadedes/me.m01.d16:meMA.Ode8C22.melody	@ltx/en_us_goadedes/he.h.m4:heHE.LytrotaTouPantos.name
ltx/en_us_goadedes/me.m01.d16:meMA.Ode8C22.mode	@ltx/en_us_goadedes/miscellanea:misc.Mode4
ltx/en_us_goadedes/me.m01.d16:meMA.Ode8C22.ode	@ltx/en_us_goadedes/miscellanea:misc.Ode8
ltx/en_us_goadedes/me.m01.d16:meMA.Ode8C22.text	
ltx/en_us_goadedes/me.m01.d16:meMA.Ode8C23.incipit	…
ltx/en_us_goadedes/me.m01.d16:meMA.Ode8C23.melody	@ltx/en_us_goadedes/he.h.m4:heHE.LytrotaTouPantos.name
ltx/en_us_goadedes/me.m01.d16:meMA.Ode8C23.mode	@ltx/en_us_goadedes/miscellanea:misc.Mode4
ltx/en_us_goadedes/me.m01.d16:meMA.Ode8C23.ode	@ltx/en_us_goadedes/miscellanea:misc.Ode8
ltx/en_us_goadedes/me.m01.d16:meMA.Ode8C23.text	
ltx/en_us_goadedes/me.m01.d16:meMA.Ode8C24.incipit	…
ltx/en_us_goadedes/me.m01.d16:meMA.Ode8C24.melody	@ltx/en_us_goadedes/he.h.m4:heHE.LytrotaTouPantos.name
ltx/en_us_goadedes/me.m01.d16:meMA.Ode8C24.mode	@ltx/en_us_goadedes/miscellanea:misc.Mode4
ltx/en_us_goadedes/me.m01.d16:meMA.Ode8C24.ode	@ltx/en_us_goadedes/miscellanea:misc.Ode8
ltx/en_us_goadedes/me.m01.d16:meMA.Ode8C24.text	
ltx/en_us_goadedes/me.m01.d16:meMA.Ode8C2T.incipit	…
ltx/en_us_goadedes/me.m01.d16:meMA.Ode8C2T.melody	@ltx/en_us_goadedes/he.h.m4:heHE.LytrotaTouPantos.name
ltx/en_us_goadedes/me.m01.d16:meMA.Ode8C2T.mode	@ltx/en_us_goadedes/miscellanea:misc.Mode4
ltx/en_us_goadedes/me.m01.d16:meMA.Ode8C2T.ode	@ltx/en_us_goadedes/miscellanea:misc.Ode8
ltx/en_us_goadedes/me.m01.d16:meMA.Ode8C2T.text	
ltx/en_us_goadedes/me.m01.d16:meMA.Ode8C2Tr.incipit	…
ltx/en_us_goadedes/me.m01.d16:meMA.Ode8C2Tr.melody	@ltx/en_us_goadedes/he.h.m4:heHE.LytrotaTouPantos.name
ltx/en_us_goadedes/me.m01.d16:meMA.Ode8C2Tr.mode	@ltx/en_us_goadedes/miscellanea:misc.Mode4
ltx/en_us_goadedes/me.m01.d16:meMA.Ode8C2Tr.ode	@ltx/en_us_goadedes/miscellanea:misc.Ode8
ltx/en_us_goadedes/me.m01.d16:meMA.Ode8C2Tr.text	
ltx/en_us_goadedes/me.m01.d16:meMA.Ode8H.greekmelody	@ltx/en_us_goadedes/he.h.m4:heHE.LytrotaTouPantos.greekname
ltx/en_us_goadedes/me.m01.d16:meMA.Ode8H.incipit	@ltx/en_us_goadedes/he.h.m4:heHE.LytrotaTouPantos.incipit
ltx/en_us_goadedes/me.m01.d16:meMA.Ode8H.melody	@ltx/en_us_goadedes/he.h.m4:heHE.LytrotaTouPantos.melody
ltx/en_us_goadedes/me.m01.d16:meMA.Ode8H.mode	@ltx/en_us_goadedes/miscellanea:misc.Mode4
ltx/en_us_goadedes/me.m01.d16:meMA.Ode8H.ode	@ltx/en_us_goadedes/miscellanea:misc.Ode8
ltx/en_us_goadedes/me.m01.d16:meMA.Ode8H.text	@ltx/en_us_goadedes/he.h.m4:heHE.LytrotaTouPantos.text
ltx/en_us_goadedes/me.m01.d16:meMA.Ode9C11.greekmelody	@ltx/en_us_goadedes/he.h.m4:heHE.ApasGigenis.greekname
ltx/en_us_goadedes/me.m01.d16:meMA.Ode9C11.incipit	O Apostle, you are all sweetness…
ltx/en_us_goadedes/me.m01.d16:meMA.Ode9C11.melody	@ltx/en_us_goadedes/he.h.m4:heHE.ApasGigenis.notmetered
ltx/en_us_goadedes/me.m01.d16:meMA.Ode9C11.mode	@ltx/en_us_goadedes/miscellanea:misc.Mode4
ltx/en_us_goadedes/me.m01.d16:meMA.Ode9C11.ode	@ltx/en_us_goadedes/miscellanea:misc.Ode9
ltx/en_us_goadedes/me.m01.d16:meMA.Ode9C11.text	O Apostle, you are all sweetness when we extol you, and your feasts are all filled with gladness. We pray you also cheer us now and sanctify us, your servants, as we faithfully venerate your chains, and grant that we may celebrate them with joy.
ltx/en_us_goadedes/me.m01.d16:meMA.Ode9C12.incipit	…
ltx/en_us_goadedes/me.m01.d16:meMA.Ode9C12.melody	@ltx/en_us_goadedes/he.h.m4:heHE.ApasGigenis.notmetered
ltx/en_us_goadedes/me.m01.d16:meMA.Ode9C12.mode	@ltx/en_us_goadedes/miscellanea:misc.Mode4
ltx/en_us_goadedes/me.m01.d16:meMA.Ode9C12.ode	@ltx/en_us_goadedes/miscellanea:misc.Ode9
ltx/en_us_goadedes/me.m01.d16:meMA.Ode9C12.text	O Apostle, shatter the might of the ungodly who war against us. By your invincible power, subordinate them to our forces, and defeat them for the sake of our nation. We pray this as we honor the chain that bound your immaculate hands.
ltx/en_us_goadedes/me.m01.d16:meMA.Ode9C13.incipit	…
ltx/en_us_goadedes/me.m01.d16:meMA.Ode9C13.melody	@ltx/en_us_goadedes/he.h.m4:heHE.ApasGigenis.notmetered
ltx/en_us_goadedes/me.m01.d16:meMA.Ode9C13.mode	@ltx/en_us_goadedes/miscellanea:misc.Mode4
ltx/en_us_goadedes/me.m01.d16:meMA.Ode9C13.ode	@ltx/en_us_goadedes/miscellanea:misc.Ode9
ltx/en_us_goadedes/me.m01.d16:meMA.Ode9C13.text	O Master, absolutely true are Your words that You uttered when You said, “He who believes in me will do greater works than these.” For behold, Your Apostle, during his life, healed infirmities with his shadow; and now, by his chains, he works many miracles.
ltx/en_us_goadedes/me.m01.d16:meMA.Ode9C1T.incipit	…
ltx/en_us_goadedes/me.m01.d16:meMA.Ode9C1T.melody	@ltx/en_us_goadedes/he.h.m4:heHE.ApasGigenis.notmetered
ltx/en_us_goadedes/me.m01.d16:meMA.Ode9C1T.mode	@ltx/en_us_goadedes/miscellanea:misc.Mode4
ltx/en_us_goadedes/me.m01.d16:meMA.Ode9C1T.ode	@ltx/en_us_goadedes/miscellanea:misc.Ode9
ltx/en_us_goadedes/me.m01.d16:meMA.Ode9C1T.text	We mortals are all at a loss to extol your unique childbirth. So we use the salutation of the Angel who flew down to you, and we joyfully sing to you: “Rejoice, redemption of mortals, and food for the poor! Rejoice, expulsion of demons! Rejoice, for you was away all my stains.”
ltx/en_us_goadedes/me.m01.d16:meMA.Ode9C1Tr.incipit	…
ltx/en_us_goadedes/me.m01.d16:meMA.Ode9C1Tr.melody	@ltx/en_us_goadedes/he.h.m4:heHE.ApasGigenis.notmetered
ltx/en_us_goadedes/me.m01.d16:meMA.Ode9C1Tr.mode	@ltx/en_us_goadedes/miscellanea:misc.Mode4
ltx/en_us_goadedes/me.m01.d16:meMA.Ode9C1Tr.ode	@ltx/en_us_goadedes/miscellanea:misc.Ode9
ltx/en_us_goadedes/me.m01.d16:meMA.Ode9C1Tr.text	Most high Father, Son, and Comforter, the Trinity, one in honor: We pray that You ever fight beside our military, and keep our nation in unshaken and immovable tranquillity, by the supplications of Your preeminent Apostle Peter.
ltx/en_us_goadedes/me.m01.d16:meMA.Ode9C21.greekmelody	@ltx/en_us_goadedes/he.h.m4:heHE.OTokosSouAfthoros.greekname
ltx/en_us_goadedes/me.m01.d16:meMA.Ode9C21.incipit	…
ltx/en_us_goadedes/me.m01.d16:meMA.Ode9C21.melody	@ltx/en_us_goadedes/he.h.m4:heHE.OTokosSouAfthoros.name
ltx/en_us_goadedes/me.m01.d16:meMA.Ode9C21.mode	@ltx/en_us_goadedes/miscellanea:misc.Mode4
ltx/en_us_goadedes/me.m01.d16:meMA.Ode9C21.ode	@ltx/en_us_goadedes/miscellanea:misc.Ode9
ltx/en_us_goadedes/me.m01.d16:meMA.Ode9C21.text	
ltx/en_us_goadedes/me.m01.d16:meMA.Ode9C22.incipit	…
ltx/en_us_goadedes/me.m01.d16:meMA.Ode9C22.melody	@ltx/en_us_goadedes/he.h.m4:heHE.OTokosSouAfthoros.name
ltx/en_us_goadedes/me.m01.d16:meMA.Ode9C22.mode	@ltx/en_us_goadedes/miscellanea:misc.Mode4
ltx/en_us_goadedes/me.m01.d16:meMA.Ode9C22.ode	@ltx/en_us_goadedes/miscellanea:misc.Ode9
ltx/en_us_goadedes/me.m01.d16:meMA.Ode9C22.text	
ltx/en_us_goadedes/me.m01.d16:meMA.Ode9C23.incipit	…
ltx/en_us_goadedes/me.m01.d16:meMA.Ode9C23.melody	@ltx/en_us_goadedes/he.h.m4:heHE.OTokosSouAfthoros.name
ltx/en_us_goadedes/me.m01.d16:meMA.Ode9C23.mode	@ltx/en_us_goadedes/miscellanea:misc.Mode4
ltx/en_us_goadedes/me.m01.d16:meMA.Ode9C23.ode	@ltx/en_us_goadedes/miscellanea:misc.Ode9
ltx/en_us_goadedes/me.m01.d16:meMA.Ode9C23.text	
ltx/en_us_goadedes/me.m01.d16:meMA.Ode9C24.incipit	…
ltx/en_us_goadedes/me.m01.d16:meMA.Ode9C24.melody	@ltx/en_us_goadedes/he.h.m4:heHE.OTokosSouAfthoros.name
ltx/en_us_goadedes/me.m01.d16:meMA.Ode9C24.mode	@ltx/en_us_goadedes/miscellanea:misc.Mode4
ltx/en_us_goadedes/me.m01.d16:meMA.Ode9C24.ode	@ltx/en_us_goadedes/miscellanea:misc.Ode9
ltx/en_us_goadedes/me.m01.d16:meMA.Ode9C24.text	
ltx/en_us_goadedes/me.m01.d16:meMA.Ode9C2T.incipit	…
ltx/en_us_goadedes/me.m01.d16:meMA.Ode9C2T.melody	@ltx/en_us_goadedes/he.h.m4:heHE.OTokosSouAfthoros.name
ltx/en_us_goadedes/me.m01.d16:meMA.Ode9C2T.mode	@ltx/en_us_goadedes/miscellanea:misc.Mode4
ltx/en_us_goadedes/me.m01.d16:meMA.Ode9C2T.ode	@ltx/en_us_goadedes/miscellanea:misc.Ode9
ltx/en_us_goadedes/me.m01.d16:meMA.Ode9C2T.text	
ltx/en_us_goadedes/me.m01.d16:meMA.Ode9H.greekmelody	@ltx/en_us_goadedes/he.h.m4:heHE.OTokosSouAfthoros.greekname
ltx/en_us_goadedes/me.m01.d16:meMA.Ode9H.incipit	@ltx/en_us_goadedes/he.h.m4:heHE.OTokosSouAfthoros.incipit
ltx/en_us_goadedes/me.m01.d16:meMA.Ode9H.melody	@ltx/en_us_goadedes/he.h.m4:heHE.OTokosSouAfthoros.melody
ltx/en_us_goadedes/me.m01.d16:meMA.Ode9H.mode	@ltx/en_us_goadedes/miscellanea:misc.Mode4
ltx/en_us_goadedes/me.m01.d16:meMA.Ode9H.ode	@ltx/en_us_goadedes/miscellanea:misc.Ode9
ltx/en_us_goadedes/me.m01.d16:meMA.Ode9H.text	@ltx/en_us_goadedes/he.h.m4:heHE.OTokosSouAfthoros.text
ltx/en_us_goadedes/me.m01.d16:meMA.Oikos1.text	
ltx/en_us_goadedes/me.m01.d16:meVE.Apolytikion1.incipit	…
ltx/en_us_goadedes/me.m01.d16:meVE.Apolytikion1.melody	
ltx/en_us_goadedes/me.m01.d16:meVE.Apolytikion1.mode	@ltx/en_us_goadedes/miscellanea:misc.Mode4
ltx/en_us_goadedes/me.m01.d16:meVE.Apolytikion1.text	
ltx/en_us_goadedes/me.m01.d16:meVE.AposGlory.incipit	…
ltx/en_us_goadedes/me.m01.d16:meVE.AposGlory.melody	
ltx/en_us_goadedes/me.m01.d16:meVE.AposGlory.mode	@ltx/en_us_goadedes/miscellanea:misc.Mode6
ltx/en_us_goadedes/me.m01.d16:meVE.AposGlory.text	
ltx/en_us_goadedes/me.m01.d16:meVE.AposStavrotheotokion.greekmelody	@ltx/en_us_goadedes/he.a.m6:heAU.TriimerosAnestis.greekname
ltx/en_us_goadedes/me.m01.d16:meVE.AposStavrotheotokion.incipit	@ltx/en_us_goadedes/oc.m6.d4:ocVE.AposTheotokion.incipit
ltx/en_us_goadedes/me.m01.d16:meVE.AposStavrotheotokion.melody	@ltx/en_us_goadedes/he.a.m6:heAU.TriimerosAnestis.name
ltx/en_us_goadedes/me.m01.d16:meVE.AposStavrotheotokion.mode	@ltx/en_us_goadedes/miscellanea:misc.Mode6
ltx/en_us_goadedes/me.m01.d16:meVE.AposStavrotheotokion.text	@ltx/en_us_goadedes/oc.m6.d4:ocVE.AposTheotokion.text
ltx/en_us_goadedes/me.m01.d16:meVE.AposTheotokion.greekmelody	@ltx/en_us_goadedes/he.a.m6:heAU.OlinApothemenoi.greekname
ltx/en_us_goadedes/me.m01.d16:meVE.AposTheotokion.incipit	…
ltx/en_us_goadedes/me.m01.d16:meVE.AposTheotokion.melody	@ltx/en_us_goadedes/he.a.m6:heAU.OlinApothemenoi.name
ltx/en_us_goadedes/me.m01.d16:meVE.AposTheotokion.mode	@ltx/en_us_goadedes/miscellanea:misc.Mode6
ltx/en_us_goadedes/me.m01.d16:meVE.AposTheotokion.text	
ltx/en_us_goadedes/me.m01.d16:meVE.Aposticha1.greekmelody	@ltx/en_us_goadedes/he.a.m4:heAU.EdokasSimeiosin.greekname
ltx/en_us_goadedes/me.m01.d16:meVE.Aposticha1.incipit	…
ltx/en_us_goadedes/me.m01.d16:meVE.Aposticha1.melody	@ltx/en_us_goadedes/he.a.m4:heAU.EdokasSimeiosin.name
ltx/en_us_goadedes/me.m01.d16:meVE.Aposticha1.mode	@ltx/en_us_goadedes/miscellanea:misc.Mode4
ltx/en_us_goadedes/me.m01.d16:meVE.Aposticha1.text	
ltx/en_us_goadedes/me.m01.d16:meVE.Aposticha2.incipit	…
ltx/en_us_goadedes/me.m01.d16:meVE.Aposticha2.melody	@ltx/en_us_goadedes/he.a.m4:heAU.EdokasSimeiosin.name
ltx/en_us_goadedes/me.m01.d16:meVE.Aposticha2.mode	@ltx/en_us_goadedes/miscellanea:misc.Mode4
ltx/en_us_goadedes/me.m01.d16:meVE.Aposticha2.text	
ltx/en_us_goadedes/me.m01.d16:meVE.Aposticha3.incipit	…
ltx/en_us_goadedes/me.m01.d16:meVE.Aposticha3.melody	@ltx/en_us_goadedes/he.a.m4:heAU.EdokasSimeiosin.name
ltx/en_us_goadedes/me.m01.d16:meVE.Aposticha3.mode	@ltx/en_us_goadedes/miscellanea:misc.Mode4
ltx/en_us_goadedes/me.m01.d16:meVE.Aposticha3.text	
ltx/en_us_goadedes/me.m01.d16:meVE.SticGlory.incipit	…
ltx/en_us_goadedes/me.m01.d16:meVE.SticGlory.melody	
ltx/en_us_goadedes/me.m01.d16:meVE.SticGlory.mode	@ltx/en_us_goadedes/miscellanea:misc.Mode6
ltx/en_us_goadedes/me.m01.d16:meVE.SticGlory.poet	@ltx/en_us_goadedes/poets:po.Vyzantos
ltx/en_us_goadedes/me.m01.d16:meVE.SticGlory.text	
ltx/en_us_goadedes/me.m01.d16:meVE.SticStavrotheotokion.greekmelody	@ltx/en_us_goadedes/he.a.m6:heAU.TriimerosAnestis.greekname
ltx/en_us_goadedes/me.m01.d16:meVE.SticStavrotheotokion.incipit	…
ltx/en_us_goadedes/me.m01.d16:meVE.SticStavrotheotokion.melody	@ltx/en_us_goadedes/he.a.m6:heAU.TriimerosAnestis.name
ltx/en_us_goadedes/me.m01.d16:meVE.SticStavrotheotokion.mode	@ltx/en_us_goadedes/miscellanea:misc.Mode6
ltx/en_us_goadedes/me.m01.d16:meVE.SticStavrotheotokion.text	
ltx/en_us_goadedes/me.m01.d16:meVE.SticTheotokion.incipit	@ltx/en_us_goadedes/he.o:heOT.TheotokeSyEi.incipit
ltx/en_us_goadedes/me.m01.d16:meVE.SticTheotokion.melody	@ltx/en_us_goadedes/he.o:heOT.TheotokeSyEi.name
ltx/en_us_goadedes/me.m01.d16:meVE.SticTheotokion.mode	@ltx/en_us_goadedes/miscellanea:misc.Mode6
ltx/en_us_goadedes/me.m01.d16:meVE.SticTheotokion.text	@ltx/en_us_goadedes/he.o:heOT.TheotokeSyEiApostolou.text
ltx/en_us_goadedes/me.m01.d16:meVE.Stichera01.greekmelody	@ltx/en_us_goadedes/he.a.m4:heAU.OsGennaionEnMartysi.greekname
ltx/en_us_goadedes/me.m01.d16:meVE.Stichera01.incipit	…
ltx/en_us_goadedes/me.m01.d16:meVE.Stichera01.melody	@ltx/en_us_goadedes/he.a.m4:heAU.OsGennaionEnMartysi.name
ltx/en_us_goadedes/me.m01.d16:meVE.Stichera01.mode	@ltx/en_us_goadedes/miscellanea:misc.Mode4
ltx/en_us_goadedes/me.m01.d16:meVE.Stichera01.text	
ltx/en_us_goadedes/me.m01.d16:meVE.Stichera02.incipit	…
ltx/en_us_goadedes/me.m01.d16:meVE.Stichera02.melody	@ltx/en_us_goadedes/he.a.m4:heAU.OsGennaionEnMartysi.name
ltx/en_us_goadedes/me.m01.d16:meVE.Stichera02.mode	@ltx/en_us_goadedes/miscellanea:misc.Mode4
ltx/en_us_goadedes/me.m01.d16:meVE.Stichera02.text	
ltx/en_us_goadedes/me.m01.d16:meVE.Stichera03.incipit	…
ltx/en_us_goadedes/me.m01.d16:meVE.Stichera03.melody	@ltx/en_us_goadedes/he.a.m4:heAU.OsGennaionEnMartysi.name
ltx/en_us_goadedes/me.m01.d16:meVE.Stichera03.mode	@ltx/en_us_goadedes/miscellanea:misc.Mode4
ltx/en_us_goadedes/me.m01.d16:meVE.Stichera03.text	
