ltx/en_us_goadedes/tr.d008:trCO.header	
ltx/en_us_goadedes/tr.d008:trDA.commemoration.full	
ltx/en_us_goadedes/tr.d008:trDA.commemoration.short	
ltx/en_us_goadedes/tr.d008:trDA.dismissal	@ltx/en_us_goadedes/dismissals:dis00.resurrection
ltx/en_us_goadedes/tr.d008:trDA.insert1	
ltx/en_us_goadedes/tr.d008:trDA.insert2	
ltx/en_us_goadedes/tr.d008:trDA.note	
ltx/en_us_goadedes/tr.d008:trDA.title	
ltx/en_us_goadedes/tr.d008:trHO.commemorations	
ltx/en_us_goadedes/tr.d008:trHO.daytitle	
ltx/en_us_goadedes/tr.d008:trHO.description1	
ltx/en_us_goadedes/tr.d008:trHO.description2	
ltx/en_us_goadedes/tr.d008:trHO.note1	
ltx/en_us_goadedes/tr.d008:trHO.note2	
ltx/en_us_goadedes/tr.d008:trLI.Kontakion1.incipit	@ltx/en_us_goadedes/tr.d008:trMA.Kontakion1.incipit
ltx/en_us_goadedes/tr.d008:trLI.Kontakion1.melody	@ltx/en_us_goadedes/tr.d008:trMA.Kontakion1.melody
ltx/en_us_goadedes/tr.d008:trLI.Kontakion1.mode	@ltx/en_us_goadedes/tr.d008:trMA.Kontakion1.mode
ltx/en_us_goadedes/tr.d008:trLI.Kontakion1.text	@ltx/en_us_goadedes/tr.d008:trMA.Kontakion1.text
ltx/en_us_goadedes/tr.d008:trLI.MM.CommunionHymn.text	@ltx/en_us_goadedes/properties:media.key
ltx/en_us_goadedes/tr.d008:trLI.Megalynarion.text	
ltx/en_us_goadedes/tr.d008:trMA.C1.acrostic.notice1	
ltx/en_us_goadedes/tr.d008:trMA.C1.acrostic.text	
ltx/en_us_goadedes/tr.d008:trMA.C1.acrostic.title	
ltx/en_us_goadedes/tr.d008:trMA.C1.poet	@ltx/en_us_goadedes/poets:po.KyriouIosif
ltx/en_us_goadedes/tr.d008:trMA.C1.title	@ltx/en_us_goadedes/titles:ti.CanonTriodion
ltx/en_us_goadedes/tr.d008:trMA.C1.verse	@ltx/en_us_goadedes/prayers:pr.verse_God.text
ltx/en_us_goadedes/tr.d008:trMA.ExapTheotokion.greekmelody	@ltx/en_us_goadedes/he.a.m2:heAU.GynaikesAkoutisthite.greekname
ltx/en_us_goadedes/tr.d008:trMA.ExapTheotokion.incipit	…
ltx/en_us_goadedes/tr.d008:trMA.ExapTheotokion.melody	@ltx/en_us_goadedes/he.a.m2:heAU.GynaikesAkoutisthite.name
ltx/en_us_goadedes/tr.d008:trMA.ExapTheotokion.mode	@ltx/en_us_goadedes/miscellanea:misc.Mode2
ltx/en_us_goadedes/tr.d008:trMA.ExapTheotokion.text	
ltx/en_us_goadedes/tr.d008:trMA.Exaposteilarion1.greekmelody	@ltx/en_us_goadedes/he.a.m2:heAU.GynaikesAkoutisthite.greekname
ltx/en_us_goadedes/tr.d008:trMA.Exaposteilarion1.incipit	…
ltx/en_us_goadedes/tr.d008:trMA.Exaposteilarion1.melody	@ltx/en_us_goadedes/he.a.m2:heAU.GynaikesAkoutisthite.name
ltx/en_us_goadedes/tr.d008:trMA.Exaposteilarion1.mode	@ltx/en_us_goadedes/miscellanea:misc.Mode2
ltx/en_us_goadedes/tr.d008:trMA.Exaposteilarion1.text	
ltx/en_us_goadedes/tr.d008:trMA.Exaposteilarion2.greekmelody	@ltx/en_us_goadedes/he.a.m2:heAU.GynaikesAkoutisthite.greekname
ltx/en_us_goadedes/tr.d008:trMA.Exaposteilarion2.incipit	…
ltx/en_us_goadedes/tr.d008:trMA.Exaposteilarion2.melody	@ltx/en_us_goadedes/he.a.m2:heAU.GynaikesAkoutisthite.name
ltx/en_us_goadedes/tr.d008:trMA.Exaposteilarion2.mode	@ltx/en_us_goadedes/miscellanea:misc.Mode2
ltx/en_us_goadedes/tr.d008:trMA.Exaposteilarion2.text	
ltx/en_us_goadedes/tr.d008:trMA.Kontakion1.incipit	…
ltx/en_us_goadedes/tr.d008:trMA.Kontakion1.melody	@ltx/en_us_goadedes/he.a.m3:heAU.IParthenosSimeron.name
ltx/en_us_goadedes/tr.d008:trMA.Kontakion1.mode	@ltx/en_us_goadedes/miscellanea:misc.Mode3
ltx/en_us_goadedes/tr.d008:trMA.Kontakion1.text	
ltx/en_us_goadedes/tr.d008:trMA.Lauds1.incipit	…
ltx/en_us_goadedes/tr.d008:trMA.Lauds1.melody	@ltx/en_us_goadedes/miscellanea:misc.Idiomelon
ltx/en_us_goadedes/tr.d008:trMA.Lauds1.mode	@ltx/en_us_goadedes/miscellanea:misc.Mode2
ltx/en_us_goadedes/tr.d008:trMA.Lauds1.text	
ltx/en_us_goadedes/tr.d008:trMA.Lauds2.incipit	…
ltx/en_us_goadedes/tr.d008:trMA.Lauds2.melody	@ltx/en_us_goadedes/miscellanea:misc.Idiomelon
ltx/en_us_goadedes/tr.d008:trMA.Lauds2.mode	@ltx/en_us_goadedes/miscellanea:misc.Mode4
ltx/en_us_goadedes/tr.d008:trMA.Lauds2.text	
ltx/en_us_goadedes/tr.d008:trMA.Lauds3.incipit	…
ltx/en_us_goadedes/tr.d008:trMA.Lauds3.melody	@ltx/en_us_goadedes/miscellanea:misc.Idiomelon
ltx/en_us_goadedes/tr.d008:trMA.Lauds3.mode	@ltx/en_us_goadedes/miscellanea:misc.Mode8
ltx/en_us_goadedes/tr.d008:trMA.Lauds3.text	
ltx/en_us_goadedes/tr.d008:trMA.LaudsGlory.incipit	…
ltx/en_us_goadedes/tr.d008:trMA.LaudsGlory.melody	@ltx/en_us_goadedes/miscellanea:misc.Idiomelon
ltx/en_us_goadedes/tr.d008:trMA.LaudsGlory.mode	@ltx/en_us_goadedes/miscellanea:misc.Mode6
ltx/en_us_goadedes/tr.d008:trMA.LaudsGlory.text	
ltx/en_us_goadedes/tr.d008:trMA.LaudsTheotokion.incipit	@ltx/en_us_goadedes/oc.m2.d1:ocMA.Kathisma23.incipit
ltx/en_us_goadedes/tr.d008:trMA.LaudsTheotokion.melody	
ltx/en_us_goadedes/tr.d008:trMA.LaudsTheotokion.mode	
ltx/en_us_goadedes/tr.d008:trMA.LaudsTheotokion.text	@ltx/en_us_goadedes/oc.m2.d1:ocMA.Kathisma23.text
ltx/en_us_goadedes/tr.d008:trMA.MM.Lauds12as45.text	@ltx/en_us_goadedes/properties:media.key
ltx/en_us_goadedes/tr.d008:trMA.Ode1C11.greekmelody	@ltx/en_us_goadedes/he.h.m2:heHE.TinMoseosOdin.greekname
ltx/en_us_goadedes/tr.d008:trMA.Ode1C11.incipit	…
ltx/en_us_goadedes/tr.d008:trMA.Ode1C11.melody	@ltx/en_us_goadedes/he.h.m2:heHE.TinMoseosOdin.name
ltx/en_us_goadedes/tr.d008:trMA.Ode1C11.mode	@ltx/en_us_goadedes/miscellanea:misc.Mode2
ltx/en_us_goadedes/tr.d008:trMA.Ode1C11.ode	@ltx/en_us_goadedes/miscellanea:misc.Ode1
ltx/en_us_goadedes/tr.d008:trMA.Ode1C11.text	
ltx/en_us_goadedes/tr.d008:trMA.Ode1C12.incipit	…
ltx/en_us_goadedes/tr.d008:trMA.Ode1C12.melody	@ltx/en_us_goadedes/he.h.m2:heHE.TinMoseosOdin.name
ltx/en_us_goadedes/tr.d008:trMA.Ode1C12.mode	@ltx/en_us_goadedes/miscellanea:misc.Mode2
ltx/en_us_goadedes/tr.d008:trMA.Ode1C12.ode	@ltx/en_us_goadedes/miscellanea:misc.Ode1
ltx/en_us_goadedes/tr.d008:trMA.Ode1C12.text	
ltx/en_us_goadedes/tr.d008:trMA.Ode1C13.incipit	…
ltx/en_us_goadedes/tr.d008:trMA.Ode1C13.melody	@ltx/en_us_goadedes/he.h.m2:heHE.TinMoseosOdin.name
ltx/en_us_goadedes/tr.d008:trMA.Ode1C13.mode	@ltx/en_us_goadedes/miscellanea:misc.Mode2
ltx/en_us_goadedes/tr.d008:trMA.Ode1C13.ode	@ltx/en_us_goadedes/miscellanea:misc.Ode1
ltx/en_us_goadedes/tr.d008:trMA.Ode1C13.text	
ltx/en_us_goadedes/tr.d008:trMA.Ode1C1T.incipit	…
ltx/en_us_goadedes/tr.d008:trMA.Ode1C1T.melody	@ltx/en_us_goadedes/he.h.m2:heHE.TinMoseosOdin.name
ltx/en_us_goadedes/tr.d008:trMA.Ode1C1T.mode	@ltx/en_us_goadedes/miscellanea:misc.Mode2
ltx/en_us_goadedes/tr.d008:trMA.Ode1C1T.ode	@ltx/en_us_goadedes/miscellanea:misc.Ode1
ltx/en_us_goadedes/tr.d008:trMA.Ode1C1T.text	
ltx/en_us_goadedes/tr.d008:trMA.Ode3C11.greekmelody	@ltx/en_us_goadedes/he.h.m2:heHE.SteirothentaMouTonNoun.greekname
ltx/en_us_goadedes/tr.d008:trMA.Ode3C11.incipit	…
ltx/en_us_goadedes/tr.d008:trMA.Ode3C11.melody	@ltx/en_us_goadedes/he.h.m2:heHE.SteirothentaMouTonNoun.name
ltx/en_us_goadedes/tr.d008:trMA.Ode3C11.mode	@ltx/en_us_goadedes/miscellanea:misc.Mode2
ltx/en_us_goadedes/tr.d008:trMA.Ode3C11.ode	@ltx/en_us_goadedes/miscellanea:misc.Ode3
ltx/en_us_goadedes/tr.d008:trMA.Ode3C11.text	
ltx/en_us_goadedes/tr.d008:trMA.Ode3C12.incipit	…
ltx/en_us_goadedes/tr.d008:trMA.Ode3C12.melody	@ltx/en_us_goadedes/he.h.m2:heHE.SteirothentaMouTonNoun.name
ltx/en_us_goadedes/tr.d008:trMA.Ode3C12.mode	@ltx/en_us_goadedes/miscellanea:misc.Mode2
ltx/en_us_goadedes/tr.d008:trMA.Ode3C12.ode	@ltx/en_us_goadedes/miscellanea:misc.Ode3
ltx/en_us_goadedes/tr.d008:trMA.Ode3C12.text	
ltx/en_us_goadedes/tr.d008:trMA.Ode3C13.incipit	…
ltx/en_us_goadedes/tr.d008:trMA.Ode3C13.melody	@ltx/en_us_goadedes/he.h.m2:heHE.SteirothentaMouTonNoun.name
ltx/en_us_goadedes/tr.d008:trMA.Ode3C13.mode	@ltx/en_us_goadedes/miscellanea:misc.Mode2
ltx/en_us_goadedes/tr.d008:trMA.Ode3C13.ode	@ltx/en_us_goadedes/miscellanea:misc.Ode3
ltx/en_us_goadedes/tr.d008:trMA.Ode3C13.text	
ltx/en_us_goadedes/tr.d008:trMA.Ode3C1T.incipit	…
ltx/en_us_goadedes/tr.d008:trMA.Ode3C1T.melody	@ltx/en_us_goadedes/he.h.m2:heHE.SteirothentaMouTonNoun.name
ltx/en_us_goadedes/tr.d008:trMA.Ode3C1T.mode	@ltx/en_us_goadedes/miscellanea:misc.Mode2
ltx/en_us_goadedes/tr.d008:trMA.Ode3C1T.ode	@ltx/en_us_goadedes/miscellanea:misc.Ode3
ltx/en_us_goadedes/tr.d008:trMA.Ode3C1T.text	
ltx/en_us_goadedes/tr.d008:trMA.Ode3Kathisma1.greekmelody	@ltx/en_us_goadedes/he.a.m1:heAU.TonTafonSouSotir.greekname
ltx/en_us_goadedes/tr.d008:trMA.Ode3Kathisma1.incipit	@ltx/en_us_goadedes/oc.m1.d2:ocMA.Kathisma21.incipit
ltx/en_us_goadedes/tr.d008:trMA.Ode3Kathisma1.melody	@ltx/en_us_goadedes/he.a.m1:heAU.TonTafonSouSotir.name
ltx/en_us_goadedes/tr.d008:trMA.Ode3Kathisma1.mode	@ltx/en_us_goadedes/miscellanea:misc.Mode1
ltx/en_us_goadedes/tr.d008:trMA.Ode3Kathisma1.text	@ltx/en_us_goadedes/oc.m1.d2:ocMA.Kathisma21.text
ltx/en_us_goadedes/tr.d008:trMA.Ode3Kathisma2.greekmelody	@ltx/en_us_goadedes/he.a.m1:heAU.TonTafonSouSotir.greekname
ltx/en_us_goadedes/tr.d008:trMA.Ode3Kathisma2.incipit	…
ltx/en_us_goadedes/tr.d008:trMA.Ode3Kathisma2.melody	@ltx/en_us_goadedes/he.a.m1:heAU.TonTafonSouSotir.name
ltx/en_us_goadedes/tr.d008:trMA.Ode3Kathisma2.mode	@ltx/en_us_goadedes/miscellanea:misc.Mode1
ltx/en_us_goadedes/tr.d008:trMA.Ode3Kathisma2.text	
ltx/en_us_goadedes/tr.d008:trMA.Ode4C11.greekmelody	@ltx/en_us_goadedes/he.h.m2:heHE.TinEkParthenou.greekname
ltx/en_us_goadedes/tr.d008:trMA.Ode4C11.incipit	…
ltx/en_us_goadedes/tr.d008:trMA.Ode4C11.melody	@ltx/en_us_goadedes/he.h.m2:heHE.TinEkParthenou.name
ltx/en_us_goadedes/tr.d008:trMA.Ode4C11.mode	@ltx/en_us_goadedes/miscellanea:misc.Mode2
ltx/en_us_goadedes/tr.d008:trMA.Ode4C11.ode	@ltx/en_us_goadedes/miscellanea:misc.Ode4
ltx/en_us_goadedes/tr.d008:trMA.Ode4C11.text	
ltx/en_us_goadedes/tr.d008:trMA.Ode4C12.incipit	…
ltx/en_us_goadedes/tr.d008:trMA.Ode4C12.melody	@ltx/en_us_goadedes/he.h.m2:heHE.TinEkParthenou.name
ltx/en_us_goadedes/tr.d008:trMA.Ode4C12.mode	@ltx/en_us_goadedes/miscellanea:misc.Mode2
ltx/en_us_goadedes/tr.d008:trMA.Ode4C12.ode	@ltx/en_us_goadedes/miscellanea:misc.Ode4
ltx/en_us_goadedes/tr.d008:trMA.Ode4C12.text	
ltx/en_us_goadedes/tr.d008:trMA.Ode4C13.incipit	…
ltx/en_us_goadedes/tr.d008:trMA.Ode4C13.melody	@ltx/en_us_goadedes/he.h.m2:heHE.TinEkParthenou.name
ltx/en_us_goadedes/tr.d008:trMA.Ode4C13.mode	@ltx/en_us_goadedes/miscellanea:misc.Mode2
ltx/en_us_goadedes/tr.d008:trMA.Ode4C13.ode	@ltx/en_us_goadedes/miscellanea:misc.Ode4
ltx/en_us_goadedes/tr.d008:trMA.Ode4C13.text	
ltx/en_us_goadedes/tr.d008:trMA.Ode4C1T.incipit	…
ltx/en_us_goadedes/tr.d008:trMA.Ode4C1T.melody	@ltx/en_us_goadedes/he.h.m2:heHE.TinEkParthenou.name
ltx/en_us_goadedes/tr.d008:trMA.Ode4C1T.mode	@ltx/en_us_goadedes/miscellanea:misc.Mode2
ltx/en_us_goadedes/tr.d008:trMA.Ode4C1T.ode	@ltx/en_us_goadedes/miscellanea:misc.Ode4
ltx/en_us_goadedes/tr.d008:trMA.Ode4C1T.text	
ltx/en_us_goadedes/tr.d008:trMA.Ode5C11.greekmelody	@ltx/en_us_goadedes/he.h.m2:heHE.TisNyktosDielthousis.greekname
ltx/en_us_goadedes/tr.d008:trMA.Ode5C11.incipit	…
ltx/en_us_goadedes/tr.d008:trMA.Ode5C11.melody	@ltx/en_us_goadedes/he.h.m2:heHE.TisNyktosDielthousis.name
ltx/en_us_goadedes/tr.d008:trMA.Ode5C11.mode	@ltx/en_us_goadedes/miscellanea:misc.Mode2
ltx/en_us_goadedes/tr.d008:trMA.Ode5C11.ode	@ltx/en_us_goadedes/miscellanea:misc.Ode5
ltx/en_us_goadedes/tr.d008:trMA.Ode5C11.text	
ltx/en_us_goadedes/tr.d008:trMA.Ode5C12.incipit	…
ltx/en_us_goadedes/tr.d008:trMA.Ode5C12.melody	@ltx/en_us_goadedes/he.h.m2:heHE.TisNyktosDielthousis.name
ltx/en_us_goadedes/tr.d008:trMA.Ode5C12.mode	@ltx/en_us_goadedes/miscellanea:misc.Mode2
ltx/en_us_goadedes/tr.d008:trMA.Ode5C12.ode	@ltx/en_us_goadedes/miscellanea:misc.Ode5
ltx/en_us_goadedes/tr.d008:trMA.Ode5C12.text	
ltx/en_us_goadedes/tr.d008:trMA.Ode5C13.incipit	…
ltx/en_us_goadedes/tr.d008:trMA.Ode5C13.melody	@ltx/en_us_goadedes/he.h.m2:heHE.TisNyktosDielthousis.name
ltx/en_us_goadedes/tr.d008:trMA.Ode5C13.mode	@ltx/en_us_goadedes/miscellanea:misc.Mode2
ltx/en_us_goadedes/tr.d008:trMA.Ode5C13.ode	@ltx/en_us_goadedes/miscellanea:misc.Ode5
ltx/en_us_goadedes/tr.d008:trMA.Ode5C13.text	
ltx/en_us_goadedes/tr.d008:trMA.Ode5C1T.incipit	…
ltx/en_us_goadedes/tr.d008:trMA.Ode5C1T.melody	@ltx/en_us_goadedes/he.h.m2:heHE.TisNyktosDielthousis.name
ltx/en_us_goadedes/tr.d008:trMA.Ode5C1T.mode	@ltx/en_us_goadedes/miscellanea:misc.Mode2
ltx/en_us_goadedes/tr.d008:trMA.Ode5C1T.ode	@ltx/en_us_goadedes/miscellanea:misc.Ode5
ltx/en_us_goadedes/tr.d008:trMA.Ode5C1T.text	
ltx/en_us_goadedes/tr.d008:trMA.Ode6C11.greekmelody	@ltx/en_us_goadedes/he.h.m2:heHE.VythoAmartimaton.greekname
ltx/en_us_goadedes/tr.d008:trMA.Ode6C11.incipit	…
ltx/en_us_goadedes/tr.d008:trMA.Ode6C11.melody	@ltx/en_us_goadedes/he.h.m2:heHE.VythoAmartimaton.name
ltx/en_us_goadedes/tr.d008:trMA.Ode6C11.mode	@ltx/en_us_goadedes/miscellanea:misc.Mode2
ltx/en_us_goadedes/tr.d008:trMA.Ode6C11.ode	@ltx/en_us_goadedes/miscellanea:misc.Ode6
ltx/en_us_goadedes/tr.d008:trMA.Ode6C11.text	
ltx/en_us_goadedes/tr.d008:trMA.Ode6C12.incipit	…
ltx/en_us_goadedes/tr.d008:trMA.Ode6C12.melody	@ltx/en_us_goadedes/he.h.m2:heHE.VythoAmartimaton.name
ltx/en_us_goadedes/tr.d008:trMA.Ode6C12.mode	@ltx/en_us_goadedes/miscellanea:misc.Mode2
ltx/en_us_goadedes/tr.d008:trMA.Ode6C12.ode	@ltx/en_us_goadedes/miscellanea:misc.Ode6
ltx/en_us_goadedes/tr.d008:trMA.Ode6C12.text	
ltx/en_us_goadedes/tr.d008:trMA.Ode6C13.incipit	…
ltx/en_us_goadedes/tr.d008:trMA.Ode6C13.melody	@ltx/en_us_goadedes/he.h.m2:heHE.VythoAmartimaton.name
ltx/en_us_goadedes/tr.d008:trMA.Ode6C13.mode	@ltx/en_us_goadedes/miscellanea:misc.Mode2
ltx/en_us_goadedes/tr.d008:trMA.Ode6C13.ode	@ltx/en_us_goadedes/miscellanea:misc.Ode6
ltx/en_us_goadedes/tr.d008:trMA.Ode6C13.text	
ltx/en_us_goadedes/tr.d008:trMA.Ode6C1T.incipit	…
ltx/en_us_goadedes/tr.d008:trMA.Ode6C1T.melody	@ltx/en_us_goadedes/he.h.m2:heHE.VythoAmartimaton.name
ltx/en_us_goadedes/tr.d008:trMA.Ode6C1T.mode	@ltx/en_us_goadedes/miscellanea:misc.Mode2
ltx/en_us_goadedes/tr.d008:trMA.Ode6C1T.ode	@ltx/en_us_goadedes/miscellanea:misc.Ode6
ltx/en_us_goadedes/tr.d008:trMA.Ode6C1T.text	
ltx/en_us_goadedes/tr.d008:trMA.Ode7C11.greekmelody	@ltx/en_us_goadedes/he.h.m2:heHE.TaCherouvimMimoumenoi.greekname
ltx/en_us_goadedes/tr.d008:trMA.Ode7C11.incipit	…
ltx/en_us_goadedes/tr.d008:trMA.Ode7C11.melody	@ltx/en_us_goadedes/he.h.m2:heHE.TaCherouvimMimoumenoi.name
ltx/en_us_goadedes/tr.d008:trMA.Ode7C11.mode	@ltx/en_us_goadedes/miscellanea:misc.Mode2
ltx/en_us_goadedes/tr.d008:trMA.Ode7C11.ode	@ltx/en_us_goadedes/miscellanea:misc.Ode7
ltx/en_us_goadedes/tr.d008:trMA.Ode7C11.text	
ltx/en_us_goadedes/tr.d008:trMA.Ode7C12.incipit	…
ltx/en_us_goadedes/tr.d008:trMA.Ode7C12.melody	@ltx/en_us_goadedes/he.h.m2:heHE.TaCherouvimMimoumenoi.name
ltx/en_us_goadedes/tr.d008:trMA.Ode7C12.mode	@ltx/en_us_goadedes/miscellanea:misc.Mode2
ltx/en_us_goadedes/tr.d008:trMA.Ode7C12.ode	@ltx/en_us_goadedes/miscellanea:misc.Ode7
ltx/en_us_goadedes/tr.d008:trMA.Ode7C12.text	
ltx/en_us_goadedes/tr.d008:trMA.Ode7C13.incipit	…
ltx/en_us_goadedes/tr.d008:trMA.Ode7C13.melody	@ltx/en_us_goadedes/he.h.m2:heHE.TaCherouvimMimoumenoi.name
ltx/en_us_goadedes/tr.d008:trMA.Ode7C13.mode	@ltx/en_us_goadedes/miscellanea:misc.Mode2
ltx/en_us_goadedes/tr.d008:trMA.Ode7C13.ode	@ltx/en_us_goadedes/miscellanea:misc.Ode7
ltx/en_us_goadedes/tr.d008:trMA.Ode7C13.text	
ltx/en_us_goadedes/tr.d008:trMA.Ode7C1T.incipit	…
ltx/en_us_goadedes/tr.d008:trMA.Ode7C1T.melody	@ltx/en_us_goadedes/he.h.m2:heHE.TaCherouvimMimoumenoi.name
ltx/en_us_goadedes/tr.d008:trMA.Ode7C1T.mode	@ltx/en_us_goadedes/miscellanea:misc.Mode2
ltx/en_us_goadedes/tr.d008:trMA.Ode7C1T.ode	@ltx/en_us_goadedes/miscellanea:misc.Ode7
ltx/en_us_goadedes/tr.d008:trMA.Ode7C1T.text	
ltx/en_us_goadedes/tr.d008:trMA.Ode8C11.greekmelody	@ltx/en_us_goadedes/he.h.m2:heHE.TonEnTiVatoMosi.greekname
ltx/en_us_goadedes/tr.d008:trMA.Ode8C11.incipit	…
ltx/en_us_goadedes/tr.d008:trMA.Ode8C11.melody	@ltx/en_us_goadedes/he.h.m2:heHE.TonEnTiVatoMosi.name
ltx/en_us_goadedes/tr.d008:trMA.Ode8C11.mode	@ltx/en_us_goadedes/miscellanea:misc.Mode2
ltx/en_us_goadedes/tr.d008:trMA.Ode8C11.ode	@ltx/en_us_goadedes/miscellanea:misc.Ode8
ltx/en_us_goadedes/tr.d008:trMA.Ode8C11.text	
ltx/en_us_goadedes/tr.d008:trMA.Ode8C12.incipit	…
ltx/en_us_goadedes/tr.d008:trMA.Ode8C12.melody	@ltx/en_us_goadedes/he.h.m2:heHE.TonEnTiVatoMosi.name
ltx/en_us_goadedes/tr.d008:trMA.Ode8C12.mode	@ltx/en_us_goadedes/miscellanea:misc.Mode2
ltx/en_us_goadedes/tr.d008:trMA.Ode8C12.ode	@ltx/en_us_goadedes/miscellanea:misc.Ode8
ltx/en_us_goadedes/tr.d008:trMA.Ode8C12.text	
ltx/en_us_goadedes/tr.d008:trMA.Ode8C13.incipit	…
ltx/en_us_goadedes/tr.d008:trMA.Ode8C13.melody	@ltx/en_us_goadedes/he.h.m2:heHE.TonEnTiVatoMosi.name
ltx/en_us_goadedes/tr.d008:trMA.Ode8C13.mode	@ltx/en_us_goadedes/miscellanea:misc.Mode2
ltx/en_us_goadedes/tr.d008:trMA.Ode8C13.ode	@ltx/en_us_goadedes/miscellanea:misc.Ode8
ltx/en_us_goadedes/tr.d008:trMA.Ode8C13.text	
ltx/en_us_goadedes/tr.d008:trMA.Ode8C1T.incipit	…
ltx/en_us_goadedes/tr.d008:trMA.Ode8C1T.melody	@ltx/en_us_goadedes/he.h.m2:heHE.TonEnTiVatoMosi.name
ltx/en_us_goadedes/tr.d008:trMA.Ode8C1T.mode	@ltx/en_us_goadedes/miscellanea:misc.Mode2
ltx/en_us_goadedes/tr.d008:trMA.Ode8C1T.ode	@ltx/en_us_goadedes/miscellanea:misc.Ode8
ltx/en_us_goadedes/tr.d008:trMA.Ode8C1T.text	
ltx/en_us_goadedes/tr.d008:trMA.Ode9C11.greekmelody	@ltx/en_us_goadedes/he.h.m2:heHE.TonGigenonTisIkouse.greekname
ltx/en_us_goadedes/tr.d008:trMA.Ode9C11.incipit	…
ltx/en_us_goadedes/tr.d008:trMA.Ode9C11.melody	@ltx/en_us_goadedes/he.h.m2:heHE.TonGigenonTisIkouse.name
ltx/en_us_goadedes/tr.d008:trMA.Ode9C11.mode	@ltx/en_us_goadedes/miscellanea:misc.Mode2
ltx/en_us_goadedes/tr.d008:trMA.Ode9C11.ode	@ltx/en_us_goadedes/miscellanea:misc.Ode9
ltx/en_us_goadedes/tr.d008:trMA.Ode9C11.text	
ltx/en_us_goadedes/tr.d008:trMA.Ode9C12.incipit	…
ltx/en_us_goadedes/tr.d008:trMA.Ode9C12.melody	@ltx/en_us_goadedes/he.h.m2:heHE.TonGigenonTisIkouse.name
ltx/en_us_goadedes/tr.d008:trMA.Ode9C12.mode	@ltx/en_us_goadedes/miscellanea:misc.Mode2
ltx/en_us_goadedes/tr.d008:trMA.Ode9C12.ode	@ltx/en_us_goadedes/miscellanea:misc.Ode9
ltx/en_us_goadedes/tr.d008:trMA.Ode9C12.text	
ltx/en_us_goadedes/tr.d008:trMA.Ode9C13.incipit	…
ltx/en_us_goadedes/tr.d008:trMA.Ode9C13.melody	@ltx/en_us_goadedes/he.h.m2:heHE.TonGigenonTisIkouse.name
ltx/en_us_goadedes/tr.d008:trMA.Ode9C13.mode	@ltx/en_us_goadedes/miscellanea:misc.Mode2
ltx/en_us_goadedes/tr.d008:trMA.Ode9C13.ode	@ltx/en_us_goadedes/miscellanea:misc.Ode9
ltx/en_us_goadedes/tr.d008:trMA.Ode9C13.text	
ltx/en_us_goadedes/tr.d008:trMA.Ode9C14.incipit	…
ltx/en_us_goadedes/tr.d008:trMA.Ode9C14.melody	@ltx/en_us_goadedes/he.h.m2:heHE.TonGigenonTisIkouse.name
ltx/en_us_goadedes/tr.d008:trMA.Ode9C14.mode	@ltx/en_us_goadedes/miscellanea:misc.Mode2
ltx/en_us_goadedes/tr.d008:trMA.Ode9C14.ode	@ltx/en_us_goadedes/miscellanea:misc.Ode9
ltx/en_us_goadedes/tr.d008:trMA.Ode9C14.text	
ltx/en_us_goadedes/tr.d008:trMA.Ode9C1T.incipit	…
ltx/en_us_goadedes/tr.d008:trMA.Ode9C1T.melody	@ltx/en_us_goadedes/he.h.m2:heHE.TonGigenonTisIkouse.name
ltx/en_us_goadedes/tr.d008:trMA.Ode9C1T.mode	@ltx/en_us_goadedes/miscellanea:misc.Mode2
ltx/en_us_goadedes/tr.d008:trMA.Ode9C1T.ode	@ltx/en_us_goadedes/miscellanea:misc.Ode9
ltx/en_us_goadedes/tr.d008:trMA.Ode9C1T.text	
ltx/en_us_goadedes/tr.d008:trMA.Oikos1.text	Let us listen to the Scriptures, as our Savior teaches us each day in His own words, about the prodigal son who returned to his senses. Let us imitate his genuine repentance with faith, and with a humble heart cry out to the Lord who sees all our secrets. “We have sinned against You, compassionate Father, and we are no longer worthy as before to be called Your children. But I implore You, who are by nature benevolent, welcome me back, and treat me as one of Your hired hands.”
ltx/en_us_goadedes/tr.d008:trMA.PostGospelBoth.incipit	@ltx/en_us_goadedes/tr.d001:trMA.PostGospelBoth.incipit
ltx/en_us_goadedes/tr.d008:trMA.PostGospelBoth.melody	
ltx/en_us_goadedes/tr.d008:trMA.PostGospelBoth.mode	@ltx/en_us_goadedes/miscellanea:misc.Mode8
ltx/en_us_goadedes/tr.d008:trMA.PostGospelBoth.text	@ltx/en_us_goadedes/tr.d001:trMA.PostGospelBoth.text
ltx/en_us_goadedes/tr.d008:trMA.PostGospelGlory.incipit	@ltx/en_us_goadedes/tr.d001:trMA.PostGospelGlory.incipit
ltx/en_us_goadedes/tr.d008:trMA.PostGospelGlory.melody	
ltx/en_us_goadedes/tr.d008:trMA.PostGospelGlory.mode	@ltx/en_us_goadedes/miscellanea:misc.Mode8
ltx/en_us_goadedes/tr.d008:trMA.PostGospelGlory.text	@ltx/en_us_goadedes/tr.d001:trMA.PostGospelGlory.text
ltx/en_us_goadedes/tr.d008:trMA.PostGospelIdiomelon.incipit	@ltx/en_us_goadedes/tr.d001:trMA.PostGospelIdiomelon.incipit
ltx/en_us_goadedes/tr.d008:trMA.PostGospelIdiomelon.melody	
ltx/en_us_goadedes/tr.d008:trMA.PostGospelIdiomelon.mode	@ltx/en_us_goadedes/miscellanea:misc.Mode6
ltx/en_us_goadedes/tr.d008:trMA.PostGospelIdiomelon.text	@ltx/en_us_goadedes/tr.d001:trMA.PostGospelIdiomelon.text
ltx/en_us_goadedes/tr.d008:trSY.commemoration.couplet1.title	@ltx/en_us_goadedes/titles:ti.Verses
ltx/en_us_goadedes/tr.d008:trSY.commemoration.couplet1.verse1	
ltx/en_us_goadedes/tr.d008:trSY.commemoration.couplet1.verse2	
ltx/en_us_goadedes/tr.d008:trSY.commemoration.narration.p01	
ltx/en_us_goadedes/tr.d008:trSY.commemoration.narration.p02	
ltx/en_us_goadedes/tr.d008:trSY.commemoration.narration.p03	
ltx/en_us_goadedes/tr.d008:trSY.commemoration.narration.p04	
ltx/en_us_goadedes/tr.d008:trSY.commemoration.narration.p05	
ltx/en_us_goadedes/tr.d008:trSY.commemoration.narration.p06	
ltx/en_us_goadedes/tr.d008:trSY.commemoration.narration.p07	
ltx/en_us_goadedes/tr.d008:trSY.commemoration.text	
ltx/en_us_goadedes/tr.d008:trSY.lastline	
ltx/en_us_goadedes/tr.d008:trVE.AposGlory.incipit	…
ltx/en_us_goadedes/tr.d008:trVE.AposGlory.melody	@ltx/en_us_goadedes/miscellanea:misc.Idiomelon
ltx/en_us_goadedes/tr.d008:trVE.AposGlory.mode	@ltx/en_us_goadedes/miscellanea:misc.Mode6
ltx/en_us_goadedes/tr.d008:trVE.AposGlory.text	
ltx/en_us_goadedes/tr.d008:trVE.AposTheotokion.incipit	@ltx/en_us_goadedes/oc.m6.d1:ocVE.AposTheotokion.incipit
ltx/en_us_goadedes/tr.d008:trVE.AposTheotokion.melody	
ltx/en_us_goadedes/tr.d008:trVE.AposTheotokion.mode	@ltx/en_us_goadedes/miscellanea:misc.Mode6
ltx/en_us_goadedes/tr.d008:trVE.AposTheotokion.text	@ltx/en_us_goadedes/oc.m6.d1:ocVE.AposTheotokion.text
ltx/en_us_goadedes/tr.d008:trVE.MM.Stichera112as567.text	@ltx/en_us_goadedes/properties:media.key
ltx/en_us_goadedes/tr.d008:trVE.MM.Stichera112as8910.text	@ltx/en_us_goadedes/properties:media.key
ltx/en_us_goadedes/tr.d008:trVE.SticGlory.incipit	Oh! So many are the blessings…
ltx/en_us_goadedes/tr.d008:trVE.SticGlory.melody	@ltx/en_us_goadedes/miscellanea:misc.Idiomelon
ltx/en_us_goadedes/tr.d008:trVE.SticGlory.mode	@ltx/en_us_goadedes/miscellanea:misc.Mode2
ltx/en_us_goadedes/tr.d008:trVE.SticGlory.text	Oh! So many are the blessings that I deprived myself of, wretch that I am! What a kingdom I fell from! Woe is miserable me! I squandered the wealth that was given me. I disobeyed the commandment. Alas, sorry soul of mine! What remains is that You are sentenced to the eternal fire. So, now, before it is too late, cry out to Christ God, “Please wait for me, as the Prodigal Son, and have mercy on me, O God.”
ltx/en_us_goadedes/tr.d008:trVE.Stichera01.incipit	…
ltx/en_us_goadedes/tr.d008:trVE.Stichera01.melody	@ltx/en_us_goadedes/miscellanea:misc.Idiomelon
ltx/en_us_goadedes/tr.d008:trVE.Stichera01.mode	@ltx/en_us_goadedes/miscellanea:misc.Mode1
ltx/en_us_goadedes/tr.d008:trVE.Stichera01.text	
ltx/en_us_goadedes/tr.d008:trVE.Stichera02.incipit	…
ltx/en_us_goadedes/tr.d008:trVE.Stichera02.melody	@ltx/en_us_goadedes/miscellanea:misc.Idiomelon
ltx/en_us_goadedes/tr.d008:trVE.Stichera02.mode	@ltx/en_us_goadedes/miscellanea:misc.Mode1
ltx/en_us_goadedes/tr.d008:trVE.Stichera02.text	
