ltx/en_us_goadedes/me.m06.d14:meDA.commemoration.first	
ltx/en_us_goadedes/me.m06.d14:meDA.commemoration.first_name	
ltx/en_us_goadedes/me.m06.d14:meDA.commemoration.first_short	
ltx/en_us_goadedes/me.m06.d14:meDA.commemoration.first_title	@ltx/en_us_goadedes/titles:ti.Prophet
ltx/en_us_goadedes/me.m06.d14:meDA.commemoration.full	
ltx/en_us_goadedes/me.m06.d14:meDA.commemoration.second	
ltx/en_us_goadedes/me.m06.d14:meDA.commemoration.second_name	
ltx/en_us_goadedes/me.m06.d14:meDA.commemoration.second_title	@ltx/en_us_goadedes/titles:ti.SaintM
ltx/en_us_goadedes/me.m06.d14:meDA.date	
ltx/en_us_goadedes/me.m06.d14:meDA.dismissal	
ltx/en_us_goadedes/me.m06.d14:meDA.fordate	
ltx/en_us_goadedes/me.m06.d14:meDA.insert1	
ltx/en_us_goadedes/me.m06.d14:meDA.insert2	
ltx/en_us_goadedes/me.m06.d14:meDA.note	
ltx/en_us_goadedes/me.m06.d14:meDA.pdfcoverdate	
ltx/en_us_goadedes/me.m06.d14:meDA.pdfheaderdate	
ltx/en_us_goadedes/me.m06.d14:meHO.commemorations	
ltx/en_us_goadedes/me.m06.d14:meHO.note1	
ltx/en_us_goadedes/me.m06.d14:meHO.note2	
ltx/en_us_goadedes/me.m06.d14:meHO.number	
ltx/en_us_goadedes/me.m06.d14:meHO.rank	
ltx/en_us_goadedes/me.m06.d14:meLE.commemoration1	
ltx/en_us_goadedes/me.m06.d14:meLE.commemoration2	
ltx/en_us_goadedes/me.m06.d14:meLI.Kontakion1.greekmelody	@ltx/en_us_goadedes/me.m06.d14:meMA.Kontakion1.greekmelody
ltx/en_us_goadedes/me.m06.d14:meLI.Kontakion1.incipit	@ltx/en_us_goadedes/me.m06.d14:meMA.Kontakion1.incipit
ltx/en_us_goadedes/me.m06.d14:meLI.Kontakion1.melody	@ltx/en_us_goadedes/me.m06.d14:meMA.Kontakion1.melody
ltx/en_us_goadedes/me.m06.d14:meLI.Kontakion1.mode	@ltx/en_us_goadedes/me.m06.d14:meMA.Kontakion1.mode
ltx/en_us_goadedes/me.m06.d14:meLI.Kontakion1.text	@ltx/en_us_goadedes/me.m06.d14:meMA.Kontakion1.text
ltx/en_us_goadedes/me.m06.d14:meLI.MM.CommunionHymn.text	@ltx/en_us_goadedes/properties:media.key
ltx/en_us_goadedes/me.m06.d14:meLI.Megalynarion.text	
ltx/en_us_goadedes/me.m06.d14:meMA.AposGlory.incipit	…
ltx/en_us_goadedes/me.m06.d14:meMA.AposGlory.melody	@ltx/en_us_goadedes/miscellanea:misc.Idiomelon
ltx/en_us_goadedes/me.m06.d14:meMA.AposGlory.mode	@ltx/en_us_goadedes/miscellanea:misc.Mode6
ltx/en_us_goadedes/me.m06.d14:meMA.AposGlory.poet	@ltx/en_us_goadedes/poets:po.FotiouPatriarchou
ltx/en_us_goadedes/me.m06.d14:meMA.AposGlory.text	
ltx/en_us_goadedes/me.m06.d14:meMA.AposStavrotheotokion.greekmelody	@ltx/en_us_goadedes/he.a.m6:heAU.TriimerosAnestis.greekname
ltx/en_us_goadedes/me.m06.d14:meMA.AposStavrotheotokion.incipit	@ltx/en_us_goadedes/oc.m6.d4:ocVE.AposTheotokion.incipit
ltx/en_us_goadedes/me.m06.d14:meMA.AposStavrotheotokion.melody	@ltx/en_us_goadedes/he.a.m6:heAU.TriimerosAnestis.name
ltx/en_us_goadedes/me.m06.d14:meMA.AposStavrotheotokion.mode	@ltx/en_us_goadedes/miscellanea:misc.Mode6
ltx/en_us_goadedes/me.m06.d14:meMA.AposStavrotheotokion.text	@ltx/en_us_goadedes/oc.m6.d4:ocVE.AposTheotokion.text
ltx/en_us_goadedes/me.m06.d14:meMA.AposTheotokion.greekmelody	@ltx/en_us_goadedes/he.a.m6:heAU.TriimerosAnestis.greekname
ltx/en_us_goadedes/me.m06.d14:meMA.AposTheotokion.incipit	@ltx/en_us_goadedes/me.m03.d01:meVE.SticTheotokion2.incipit
ltx/en_us_goadedes/me.m06.d14:meMA.AposTheotokion.melody	@ltx/en_us_goadedes/he.a.m6:heAU.TriimerosAnestis.name
ltx/en_us_goadedes/me.m06.d14:meMA.AposTheotokion.mode	@ltx/en_us_goadedes/miscellanea:misc.Mode6
ltx/en_us_goadedes/me.m06.d14:meMA.AposTheotokion.text	@ltx/en_us_goadedes/me.m03.d01:meVE.SticTheotokion2.text
ltx/en_us_goadedes/me.m06.d14:meMA.C1.acrostic.notice1	
ltx/en_us_goadedes/me.m06.d14:meMA.C1.acrostic.text	
ltx/en_us_goadedes/me.m06.d14:meMA.C1.acrostic.title	
ltx/en_us_goadedes/me.m06.d14:meMA.C1.poet	@ltx/en_us_goadedes/poets:po.IoannouMonachou
ltx/en_us_goadedes/me.m06.d14:meMA.C1.title	@ltx/en_us_goadedes/titles:ti.CanonProphet
ltx/en_us_goadedes/me.m06.d14:meMA.C1.verse	@ltx/en_us_goadedes/prayers:pr.verse_Prophet.text
ltx/en_us_goadedes/me.m06.d14:meMA.C2.acrostic.notice1	
ltx/en_us_goadedes/me.m06.d14:meMA.C2.acrostic.text	
ltx/en_us_goadedes/me.m06.d14:meMA.C2.acrostic.title	
ltx/en_us_goadedes/me.m06.d14:meMA.C2.title	@ltx/en_us_goadedes/titles:ti.CanonSaintM
ltx/en_us_goadedes/me.m06.d14:meMA.C2.verse	@ltx/en_us_goadedes/prayers:pr.verse_SaintM.text
ltx/en_us_goadedes/me.m06.d14:meMA.ExapTheotokion.incipit	@ltx/en_us_goadedes/da.d7:daMA.ExapTheotokion2.incipit
ltx/en_us_goadedes/me.m06.d14:meMA.ExapTheotokion.melody	@ltx/en_us_goadedes/he.a.m2:heAU.TonMathitonOrontonSe.name
ltx/en_us_goadedes/me.m06.d14:meMA.ExapTheotokion.mode	@ltx/en_us_goadedes/miscellanea:misc.Mode2
ltx/en_us_goadedes/me.m06.d14:meMA.ExapTheotokion.text	@ltx/en_us_goadedes/da.d7:daMA.ExapTheotokion2.text
ltx/en_us_goadedes/me.m06.d14:meMA.Exaposteilarion1.greekmelody	@ltx/en_us_goadedes/he.a.m3:heAU.OOuranonToisAstrois.greekname
ltx/en_us_goadedes/me.m06.d14:meMA.Exaposteilarion1.incipit	…
ltx/en_us_goadedes/me.m06.d14:meMA.Exaposteilarion1.melody	@ltx/en_us_goadedes/he.a.m3:heAU.OOuranonToisAstrois.name
ltx/en_us_goadedes/me.m06.d14:meMA.Exaposteilarion1.mode	@ltx/en_us_goadedes/miscellanea:misc.Mode3
ltx/en_us_goadedes/me.m06.d14:meMA.Exaposteilarion1.text	
ltx/en_us_goadedes/me.m06.d14:meMA.Exaposteilarion2.greekmelody	@ltx/en_us_goadedes/he.a.m2:heAU.TonMathitonOrontonSe.greekname
ltx/en_us_goadedes/me.m06.d14:meMA.Exaposteilarion2.incipit	…
ltx/en_us_goadedes/me.m06.d14:meMA.Exaposteilarion2.melody	@ltx/en_us_goadedes/he.a.m2:heAU.TonMathitonOrontonSe.name
ltx/en_us_goadedes/me.m06.d14:meMA.Exaposteilarion2.mode	@ltx/en_us_goadedes/miscellanea:misc.Mode2
ltx/en_us_goadedes/me.m06.d14:meMA.Exaposteilarion2.text	
ltx/en_us_goadedes/me.m06.d14:meMA.Kontakion1.greekmelody	@ltx/en_us_goadedes/he.a.m8:heAU.TiYpermacho.greekname
ltx/en_us_goadedes/me.m06.d14:meMA.Kontakion1.incipit	…
ltx/en_us_goadedes/me.m06.d14:meMA.Kontakion1.melody	@ltx/en_us_goadedes/he.a.m8:heAU.TiYpermacho.name
ltx/en_us_goadedes/me.m06.d14:meMA.Kontakion1.mode	@ltx/en_us_goadedes/miscellanea:misc.Mode8
ltx/en_us_goadedes/me.m06.d14:meMA.Kontakion1.text	
ltx/en_us_goadedes/me.m06.d14:meMA.Ode1C11.greekmelody	@ltx/en_us_goadedes/he.h.m8:heHE.AsomenToKyrio.greekname
ltx/en_us_goadedes/me.m06.d14:meMA.Ode1C11.incipit	…
ltx/en_us_goadedes/me.m06.d14:meMA.Ode1C11.melody	@ltx/en_us_goadedes/he.h.m8:heHE.AsomenToKyrio.name
ltx/en_us_goadedes/me.m06.d14:meMA.Ode1C11.mode	@ltx/en_us_goadedes/miscellanea:misc.Mode8
ltx/en_us_goadedes/me.m06.d14:meMA.Ode1C11.ode	@ltx/en_us_goadedes/miscellanea:misc.Ode1
ltx/en_us_goadedes/me.m06.d14:meMA.Ode1C11.text	
ltx/en_us_goadedes/me.m06.d14:meMA.Ode1C12.incipit	…
ltx/en_us_goadedes/me.m06.d14:meMA.Ode1C12.melody	@ltx/en_us_goadedes/he.h.m8:heHE.AsomenToKyrio.name
ltx/en_us_goadedes/me.m06.d14:meMA.Ode1C12.mode	@ltx/en_us_goadedes/miscellanea:misc.Mode8
ltx/en_us_goadedes/me.m06.d14:meMA.Ode1C12.ode	@ltx/en_us_goadedes/miscellanea:misc.Ode1
ltx/en_us_goadedes/me.m06.d14:meMA.Ode1C12.text	
ltx/en_us_goadedes/me.m06.d14:meMA.Ode1C13.incipit	…
ltx/en_us_goadedes/me.m06.d14:meMA.Ode1C13.melody	@ltx/en_us_goadedes/he.h.m8:heHE.AsomenToKyrio.name
ltx/en_us_goadedes/me.m06.d14:meMA.Ode1C13.mode	@ltx/en_us_goadedes/miscellanea:misc.Mode8
ltx/en_us_goadedes/me.m06.d14:meMA.Ode1C13.ode	@ltx/en_us_goadedes/miscellanea:misc.Ode1
ltx/en_us_goadedes/me.m06.d14:meMA.Ode1C13.text	
ltx/en_us_goadedes/me.m06.d14:meMA.Ode1C1T.incipit	…
ltx/en_us_goadedes/me.m06.d14:meMA.Ode1C1T.melody	@ltx/en_us_goadedes/he.h.m8:heHE.AsomenToKyrio.name
ltx/en_us_goadedes/me.m06.d14:meMA.Ode1C1T.mode	@ltx/en_us_goadedes/miscellanea:misc.Mode8
ltx/en_us_goadedes/me.m06.d14:meMA.Ode1C1T.ode	@ltx/en_us_goadedes/miscellanea:misc.Ode1
ltx/en_us_goadedes/me.m06.d14:meMA.Ode1C1T.text	
ltx/en_us_goadedes/me.m06.d14:meMA.Ode1C21.greekmelody	@ltx/en_us_goadedes/he.h.m2:heHE.DefteLaoi.greekname
ltx/en_us_goadedes/me.m06.d14:meMA.Ode1C21.incipit	…
ltx/en_us_goadedes/me.m06.d14:meMA.Ode1C21.melody	@ltx/en_us_goadedes/he.h.m2:heHE.DefteLaoi.name
ltx/en_us_goadedes/me.m06.d14:meMA.Ode1C21.mode	@ltx/en_us_goadedes/miscellanea:misc.Mode2
ltx/en_us_goadedes/me.m06.d14:meMA.Ode1C21.ode	@ltx/en_us_goadedes/miscellanea:misc.Ode1
ltx/en_us_goadedes/me.m06.d14:meMA.Ode1C21.text	
ltx/en_us_goadedes/me.m06.d14:meMA.Ode1C22.incipit	…
ltx/en_us_goadedes/me.m06.d14:meMA.Ode1C22.melody	@ltx/en_us_goadedes/he.h.m2:heHE.DefteLaoi.name
ltx/en_us_goadedes/me.m06.d14:meMA.Ode1C22.mode	@ltx/en_us_goadedes/miscellanea:misc.Mode2
ltx/en_us_goadedes/me.m06.d14:meMA.Ode1C22.ode	@ltx/en_us_goadedes/miscellanea:misc.Ode1
ltx/en_us_goadedes/me.m06.d14:meMA.Ode1C22.text	
ltx/en_us_goadedes/me.m06.d14:meMA.Ode1C23.incipit	…
ltx/en_us_goadedes/me.m06.d14:meMA.Ode1C23.melody	@ltx/en_us_goadedes/he.h.m2:heHE.DefteLaoi.name
ltx/en_us_goadedes/me.m06.d14:meMA.Ode1C23.mode	@ltx/en_us_goadedes/miscellanea:misc.Mode2
ltx/en_us_goadedes/me.m06.d14:meMA.Ode1C23.ode	@ltx/en_us_goadedes/miscellanea:misc.Ode1
ltx/en_us_goadedes/me.m06.d14:meMA.Ode1C23.text	
ltx/en_us_goadedes/me.m06.d14:meMA.Ode1C2T.incipit	…
ltx/en_us_goadedes/me.m06.d14:meMA.Ode1C2T.melody	@ltx/en_us_goadedes/he.h.m2:heHE.DefteLaoi.name
ltx/en_us_goadedes/me.m06.d14:meMA.Ode1C2T.mode	@ltx/en_us_goadedes/miscellanea:misc.Mode2
ltx/en_us_goadedes/me.m06.d14:meMA.Ode1C2T.ode	@ltx/en_us_goadedes/miscellanea:misc.Ode1
ltx/en_us_goadedes/me.m06.d14:meMA.Ode1C2T.text	
ltx/en_us_goadedes/me.m06.d14:meMA.Ode3C11.greekmelody	@ltx/en_us_goadedes/he.h.m8:heHE.SyEiToStereoma.greekname
ltx/en_us_goadedes/me.m06.d14:meMA.Ode3C11.incipit	…
ltx/en_us_goadedes/me.m06.d14:meMA.Ode3C11.melody	@ltx/en_us_goadedes/he.h.m8:heHE.SyEiToStereoma.name
ltx/en_us_goadedes/me.m06.d14:meMA.Ode3C11.mode	@ltx/en_us_goadedes/miscellanea:misc.Mode8
ltx/en_us_goadedes/me.m06.d14:meMA.Ode3C11.ode	@ltx/en_us_goadedes/miscellanea:misc.Ode3
ltx/en_us_goadedes/me.m06.d14:meMA.Ode3C11.text	
ltx/en_us_goadedes/me.m06.d14:meMA.Ode3C12.incipit	…
ltx/en_us_goadedes/me.m06.d14:meMA.Ode3C12.melody	@ltx/en_us_goadedes/he.h.m8:heHE.SyEiToStereoma.name
ltx/en_us_goadedes/me.m06.d14:meMA.Ode3C12.mode	@ltx/en_us_goadedes/miscellanea:misc.Mode8
ltx/en_us_goadedes/me.m06.d14:meMA.Ode3C12.ode	@ltx/en_us_goadedes/miscellanea:misc.Ode3
ltx/en_us_goadedes/me.m06.d14:meMA.Ode3C12.text	
ltx/en_us_goadedes/me.m06.d14:meMA.Ode3C13.incipit	…
ltx/en_us_goadedes/me.m06.d14:meMA.Ode3C13.melody	@ltx/en_us_goadedes/he.h.m8:heHE.SyEiToStereoma.name
ltx/en_us_goadedes/me.m06.d14:meMA.Ode3C13.mode	@ltx/en_us_goadedes/miscellanea:misc.Mode8
ltx/en_us_goadedes/me.m06.d14:meMA.Ode3C13.ode	@ltx/en_us_goadedes/miscellanea:misc.Ode3
ltx/en_us_goadedes/me.m06.d14:meMA.Ode3C13.text	
ltx/en_us_goadedes/me.m06.d14:meMA.Ode3C1T.incipit	…
ltx/en_us_goadedes/me.m06.d14:meMA.Ode3C1T.melody	@ltx/en_us_goadedes/he.h.m8:heHE.SyEiToStereoma.name
ltx/en_us_goadedes/me.m06.d14:meMA.Ode3C1T.mode	@ltx/en_us_goadedes/miscellanea:misc.Mode8
ltx/en_us_goadedes/me.m06.d14:meMA.Ode3C1T.ode	@ltx/en_us_goadedes/miscellanea:misc.Ode3
ltx/en_us_goadedes/me.m06.d14:meMA.Ode3C1T.text	
ltx/en_us_goadedes/me.m06.d14:meMA.Ode3C21.greekmelody	@ltx/en_us_goadedes/he.h.m2:heHE.StereosonImasEnSoiKyrie.greekname
ltx/en_us_goadedes/me.m06.d14:meMA.Ode3C21.incipit	…
ltx/en_us_goadedes/me.m06.d14:meMA.Ode3C21.melody	@ltx/en_us_goadedes/he.h.m2:heHE.StereosonImasEnSoiKyrie.name
ltx/en_us_goadedes/me.m06.d14:meMA.Ode3C21.mode	@ltx/en_us_goadedes/miscellanea:misc.Mode2
ltx/en_us_goadedes/me.m06.d14:meMA.Ode3C21.ode	@ltx/en_us_goadedes/miscellanea:misc.Ode3
ltx/en_us_goadedes/me.m06.d14:meMA.Ode3C21.text	
ltx/en_us_goadedes/me.m06.d14:meMA.Ode3C22.incipit	…
ltx/en_us_goadedes/me.m06.d14:meMA.Ode3C22.melody	@ltx/en_us_goadedes/he.h.m2:heHE.StereosonImasEnSoiKyrie.name
ltx/en_us_goadedes/me.m06.d14:meMA.Ode3C22.mode	@ltx/en_us_goadedes/miscellanea:misc.Mode2
ltx/en_us_goadedes/me.m06.d14:meMA.Ode3C22.ode	@ltx/en_us_goadedes/miscellanea:misc.Ode3
ltx/en_us_goadedes/me.m06.d14:meMA.Ode3C22.text	
ltx/en_us_goadedes/me.m06.d14:meMA.Ode3C2T.incipit	…
ltx/en_us_goadedes/me.m06.d14:meMA.Ode3C2T.melody	@ltx/en_us_goadedes/he.h.m2:heHE.StereosonImasEnSoiKyrie.name
ltx/en_us_goadedes/me.m06.d14:meMA.Ode3C2T.mode	@ltx/en_us_goadedes/miscellanea:misc.Mode2
ltx/en_us_goadedes/me.m06.d14:meMA.Ode3C2T.ode	@ltx/en_us_goadedes/miscellanea:misc.Ode3
ltx/en_us_goadedes/me.m06.d14:meMA.Ode3C2T.text	
ltx/en_us_goadedes/me.m06.d14:meMA.Ode3H.greekmelody	@ltx/en_us_goadedes/he.h.m2:heHE.StereosonImasEnSoiKyrie.greekname
ltx/en_us_goadedes/me.m06.d14:meMA.Ode3H.incipit	@ltx/en_us_goadedes/he.h.m2:heHE.StereosonImasEnSoiKyrie.incipit
ltx/en_us_goadedes/me.m06.d14:meMA.Ode3H.melody	@ltx/en_us_goadedes/he.h.m2:heHE.StereosonImasEnSoiKyrie.melody
ltx/en_us_goadedes/me.m06.d14:meMA.Ode3H.mode	@ltx/en_us_goadedes/miscellanea:misc.Mode2
ltx/en_us_goadedes/me.m06.d14:meMA.Ode3H.ode	@ltx/en_us_goadedes/miscellanea:misc.Ode3
ltx/en_us_goadedes/me.m06.d14:meMA.Ode3H.text	@ltx/en_us_goadedes/he.h.m2:heHE.StereosonImasEnSoiKyrie.text
ltx/en_us_goadedes/me.m06.d14:meMA.Ode3Kathisma1.greekmelody	@ltx/en_us_goadedes/he.a.m4:heAU.EpefanisSimeron.greekname
ltx/en_us_goadedes/me.m06.d14:meMA.Ode3Kathisma1.incipit	…
ltx/en_us_goadedes/me.m06.d14:meMA.Ode3Kathisma1.melody	@ltx/en_us_goadedes/he.a.m4:heAU.EpefanisSimeron.name
ltx/en_us_goadedes/me.m06.d14:meMA.Ode3Kathisma1.mode	@ltx/en_us_goadedes/miscellanea:misc.Mode4
ltx/en_us_goadedes/me.m06.d14:meMA.Ode3Kathisma1.text	
ltx/en_us_goadedes/me.m06.d14:meMA.Ode3Kathisma2.greekmelody	@ltx/en_us_goadedes/he.a.m1:heAU.TonTafonSouSotir.greekname
ltx/en_us_goadedes/me.m06.d14:meMA.Ode3Kathisma2.incipit	…
ltx/en_us_goadedes/me.m06.d14:meMA.Ode3Kathisma2.melody	@ltx/en_us_goadedes/he.a.m1:heAU.TonTafonSouSotir.name
ltx/en_us_goadedes/me.m06.d14:meMA.Ode3Kathisma2.mode	@ltx/en_us_goadedes/miscellanea:misc.Mode1
ltx/en_us_goadedes/me.m06.d14:meMA.Ode3Kathisma2.text	
ltx/en_us_goadedes/me.m06.d14:meMA.Ode3Kathisma3.greekmelody	@ltx/en_us_goadedes/he.a.m4:heAU.EpefanisSimeron.greekname
ltx/en_us_goadedes/me.m06.d14:meMA.Ode3Kathisma3.incipit	…
ltx/en_us_goadedes/me.m06.d14:meMA.Ode3Kathisma3.melody	@ltx/en_us_goadedes/he.a.m4:heAU.EpefanisSimeron.name
ltx/en_us_goadedes/me.m06.d14:meMA.Ode3Kathisma3.mode	@ltx/en_us_goadedes/miscellanea:misc.Mode4
ltx/en_us_goadedes/me.m06.d14:meMA.Ode3Kathisma3.text	
ltx/en_us_goadedes/me.m06.d14:meMA.Ode3KathismaT.incipit	…
ltx/en_us_goadedes/me.m06.d14:meMA.Ode3KathismaT.melody	@ltx/en_us_goadedes/he.a.m4:heAU.EpefanisSimeron.name
ltx/en_us_goadedes/me.m06.d14:meMA.Ode3KathismaT.mode	@ltx/en_us_goadedes/miscellanea:misc.Mode4
ltx/en_us_goadedes/me.m06.d14:meMA.Ode3KathismaT.text	
ltx/en_us_goadedes/me.m06.d14:meMA.Ode4C11.greekmelody	@ltx/en_us_goadedes/he.h.m4:heHE.EisakikoaKyrie.greekname
ltx/en_us_goadedes/me.m06.d14:meMA.Ode4C11.incipit	…
ltx/en_us_goadedes/me.m06.d14:meMA.Ode4C11.melody	@ltx/en_us_goadedes/he.h.m4:heHE.EisakikoaKyrie.name
ltx/en_us_goadedes/me.m06.d14:meMA.Ode4C11.mode	@ltx/en_us_goadedes/miscellanea:misc.Mode8
ltx/en_us_goadedes/me.m06.d14:meMA.Ode4C11.ode	@ltx/en_us_goadedes/miscellanea:misc.Ode4
ltx/en_us_goadedes/me.m06.d14:meMA.Ode4C11.text	
ltx/en_us_goadedes/me.m06.d14:meMA.Ode4C12.incipit	…
ltx/en_us_goadedes/me.m06.d14:meMA.Ode4C12.melody	@ltx/en_us_goadedes/he.h.m4:heHE.EisakikoaKyrie.name
ltx/en_us_goadedes/me.m06.d14:meMA.Ode4C12.mode	@ltx/en_us_goadedes/miscellanea:misc.Mode8
ltx/en_us_goadedes/me.m06.d14:meMA.Ode4C12.ode	@ltx/en_us_goadedes/miscellanea:misc.Ode4
ltx/en_us_goadedes/me.m06.d14:meMA.Ode4C12.text	
ltx/en_us_goadedes/me.m06.d14:meMA.Ode4C13.incipit	…
ltx/en_us_goadedes/me.m06.d14:meMA.Ode4C13.melody	@ltx/en_us_goadedes/he.h.m4:heHE.EisakikoaKyrie.name
ltx/en_us_goadedes/me.m06.d14:meMA.Ode4C13.mode	@ltx/en_us_goadedes/miscellanea:misc.Mode8
ltx/en_us_goadedes/me.m06.d14:meMA.Ode4C13.ode	@ltx/en_us_goadedes/miscellanea:misc.Ode4
ltx/en_us_goadedes/me.m06.d14:meMA.Ode4C13.text	
ltx/en_us_goadedes/me.m06.d14:meMA.Ode4C1T.incipit	…
ltx/en_us_goadedes/me.m06.d14:meMA.Ode4C1T.melody	@ltx/en_us_goadedes/he.h.m4:heHE.EisakikoaKyrie.name
ltx/en_us_goadedes/me.m06.d14:meMA.Ode4C1T.mode	@ltx/en_us_goadedes/miscellanea:misc.Mode8
ltx/en_us_goadedes/me.m06.d14:meMA.Ode4C1T.ode	@ltx/en_us_goadedes/miscellanea:misc.Ode4
ltx/en_us_goadedes/me.m06.d14:meMA.Ode4C1T.text	
ltx/en_us_goadedes/me.m06.d14:meMA.Ode4C21.greekmelody	@ltx/en_us_goadedes/he.h.m2:heHE.YmnoSeAkoi.greekname
ltx/en_us_goadedes/me.m06.d14:meMA.Ode4C21.incipit	…
ltx/en_us_goadedes/me.m06.d14:meMA.Ode4C21.melody	@ltx/en_us_goadedes/he.h.m2:heHE.YmnoSeAkoi.name
ltx/en_us_goadedes/me.m06.d14:meMA.Ode4C21.mode	@ltx/en_us_goadedes/miscellanea:misc.Mode2
ltx/en_us_goadedes/me.m06.d14:meMA.Ode4C21.ode	@ltx/en_us_goadedes/miscellanea:misc.Ode4
ltx/en_us_goadedes/me.m06.d14:meMA.Ode4C21.text	
ltx/en_us_goadedes/me.m06.d14:meMA.Ode4C22.incipit	…
ltx/en_us_goadedes/me.m06.d14:meMA.Ode4C22.melody	@ltx/en_us_goadedes/he.h.m2:heHE.YmnoSeAkoi.name
ltx/en_us_goadedes/me.m06.d14:meMA.Ode4C22.mode	@ltx/en_us_goadedes/miscellanea:misc.Mode2
ltx/en_us_goadedes/me.m06.d14:meMA.Ode4C22.ode	@ltx/en_us_goadedes/miscellanea:misc.Ode4
ltx/en_us_goadedes/me.m06.d14:meMA.Ode4C22.text	
ltx/en_us_goadedes/me.m06.d14:meMA.Ode4C23.incipit	…
ltx/en_us_goadedes/me.m06.d14:meMA.Ode4C23.melody	@ltx/en_us_goadedes/he.h.m2:heHE.YmnoSeAkoi.name
ltx/en_us_goadedes/me.m06.d14:meMA.Ode4C23.mode	@ltx/en_us_goadedes/miscellanea:misc.Mode2
ltx/en_us_goadedes/me.m06.d14:meMA.Ode4C23.ode	@ltx/en_us_goadedes/miscellanea:misc.Ode4
ltx/en_us_goadedes/me.m06.d14:meMA.Ode4C23.text	
ltx/en_us_goadedes/me.m06.d14:meMA.Ode4C2T.incipit	…
ltx/en_us_goadedes/me.m06.d14:meMA.Ode4C2T.melody	@ltx/en_us_goadedes/he.h.m2:heHE.YmnoSeAkoi.name
ltx/en_us_goadedes/me.m06.d14:meMA.Ode4C2T.mode	@ltx/en_us_goadedes/miscellanea:misc.Mode2
ltx/en_us_goadedes/me.m06.d14:meMA.Ode4C2T.ode	@ltx/en_us_goadedes/miscellanea:misc.Ode4
ltx/en_us_goadedes/me.m06.d14:meMA.Ode4C2T.text	
ltx/en_us_goadedes/me.m06.d14:meMA.Ode5C11.greekmelody	@ltx/en_us_goadedes/he.h.m8:heHE.FotisonImas.greekname
ltx/en_us_goadedes/me.m06.d14:meMA.Ode5C11.incipit	…
ltx/en_us_goadedes/me.m06.d14:meMA.Ode5C11.melody	@ltx/en_us_goadedes/he.h.m8:heHE.FotisonImas.name
ltx/en_us_goadedes/me.m06.d14:meMA.Ode5C11.mode	@ltx/en_us_goadedes/miscellanea:misc.Mode8
ltx/en_us_goadedes/me.m06.d14:meMA.Ode5C11.ode	@ltx/en_us_goadedes/miscellanea:misc.Ode5
ltx/en_us_goadedes/me.m06.d14:meMA.Ode5C11.text	
ltx/en_us_goadedes/me.m06.d14:meMA.Ode5C12.incipit	…
ltx/en_us_goadedes/me.m06.d14:meMA.Ode5C12.melody	@ltx/en_us_goadedes/he.h.m8:heHE.FotisonImas.name
ltx/en_us_goadedes/me.m06.d14:meMA.Ode5C12.mode	@ltx/en_us_goadedes/miscellanea:misc.Mode8
ltx/en_us_goadedes/me.m06.d14:meMA.Ode5C12.ode	@ltx/en_us_goadedes/miscellanea:misc.Ode5
ltx/en_us_goadedes/me.m06.d14:meMA.Ode5C12.text	
ltx/en_us_goadedes/me.m06.d14:meMA.Ode5C13.incipit	…
ltx/en_us_goadedes/me.m06.d14:meMA.Ode5C13.melody	@ltx/en_us_goadedes/he.h.m8:heHE.FotisonImas.name
ltx/en_us_goadedes/me.m06.d14:meMA.Ode5C13.mode	@ltx/en_us_goadedes/miscellanea:misc.Mode8
ltx/en_us_goadedes/me.m06.d14:meMA.Ode5C13.ode	@ltx/en_us_goadedes/miscellanea:misc.Ode5
ltx/en_us_goadedes/me.m06.d14:meMA.Ode5C13.text	
ltx/en_us_goadedes/me.m06.d14:meMA.Ode5C1T.incipit	…
ltx/en_us_goadedes/me.m06.d14:meMA.Ode5C1T.melody	@ltx/en_us_goadedes/he.h.m8:heHE.FotisonImas.name
ltx/en_us_goadedes/me.m06.d14:meMA.Ode5C1T.mode	@ltx/en_us_goadedes/miscellanea:misc.Mode8
ltx/en_us_goadedes/me.m06.d14:meMA.Ode5C1T.ode	@ltx/en_us_goadedes/miscellanea:misc.Ode5
ltx/en_us_goadedes/me.m06.d14:meMA.Ode5C1T.text	
ltx/en_us_goadedes/me.m06.d14:meMA.Ode5C21.greekmelody	@ltx/en_us_goadedes/he.h.m2:heHE.OTouFotosChorigos.greekname
ltx/en_us_goadedes/me.m06.d14:meMA.Ode5C21.incipit	…
ltx/en_us_goadedes/me.m06.d14:meMA.Ode5C21.melody	@ltx/en_us_goadedes/he.h.m2:heHE.OTouFotosChorigos.name
ltx/en_us_goadedes/me.m06.d14:meMA.Ode5C21.mode	@ltx/en_us_goadedes/miscellanea:misc.Mode2
ltx/en_us_goadedes/me.m06.d14:meMA.Ode5C21.ode	@ltx/en_us_goadedes/miscellanea:misc.Ode5
ltx/en_us_goadedes/me.m06.d14:meMA.Ode5C21.text	
ltx/en_us_goadedes/me.m06.d14:meMA.Ode5C22.incipit	…
ltx/en_us_goadedes/me.m06.d14:meMA.Ode5C22.melody	@ltx/en_us_goadedes/he.h.m2:heHE.OTouFotosChorigos.name
ltx/en_us_goadedes/me.m06.d14:meMA.Ode5C22.mode	@ltx/en_us_goadedes/miscellanea:misc.Mode2
ltx/en_us_goadedes/me.m06.d14:meMA.Ode5C22.ode	@ltx/en_us_goadedes/miscellanea:misc.Ode5
ltx/en_us_goadedes/me.m06.d14:meMA.Ode5C22.text	
ltx/en_us_goadedes/me.m06.d14:meMA.Ode5C23.incipit	…
ltx/en_us_goadedes/me.m06.d14:meMA.Ode5C23.melody	@ltx/en_us_goadedes/he.h.m2:heHE.OTouFotosChorigos.name
ltx/en_us_goadedes/me.m06.d14:meMA.Ode5C23.mode	@ltx/en_us_goadedes/miscellanea:misc.Mode2
ltx/en_us_goadedes/me.m06.d14:meMA.Ode5C23.ode	@ltx/en_us_goadedes/miscellanea:misc.Ode5
ltx/en_us_goadedes/me.m06.d14:meMA.Ode5C23.text	
ltx/en_us_goadedes/me.m06.d14:meMA.Ode5C2T.incipit	…
ltx/en_us_goadedes/me.m06.d14:meMA.Ode5C2T.melody	@ltx/en_us_goadedes/he.h.m2:heHE.OTouFotosChorigos.name
ltx/en_us_goadedes/me.m06.d14:meMA.Ode5C2T.mode	@ltx/en_us_goadedes/miscellanea:misc.Mode2
ltx/en_us_goadedes/me.m06.d14:meMA.Ode5C2T.ode	@ltx/en_us_goadedes/miscellanea:misc.Ode5
ltx/en_us_goadedes/me.m06.d14:meMA.Ode5C2T.text	
ltx/en_us_goadedes/me.m06.d14:meMA.Ode6C11.greekmelody	@ltx/en_us_goadedes/he.h.m8:heHE.IlasthitiMoiSotir.greekname
ltx/en_us_goadedes/me.m06.d14:meMA.Ode6C11.incipit	…
ltx/en_us_goadedes/me.m06.d14:meMA.Ode6C11.melody	@ltx/en_us_goadedes/he.h.m8:heHE.IlasthitiMoiSotir.name
ltx/en_us_goadedes/me.m06.d14:meMA.Ode6C11.mode	@ltx/en_us_goadedes/miscellanea:misc.Mode8
ltx/en_us_goadedes/me.m06.d14:meMA.Ode6C11.ode	@ltx/en_us_goadedes/miscellanea:misc.Ode6
ltx/en_us_goadedes/me.m06.d14:meMA.Ode6C11.text	
ltx/en_us_goadedes/me.m06.d14:meMA.Ode6C12.incipit	…
ltx/en_us_goadedes/me.m06.d14:meMA.Ode6C12.melody	@ltx/en_us_goadedes/he.h.m8:heHE.IlasthitiMoiSotir.name
ltx/en_us_goadedes/me.m06.d14:meMA.Ode6C12.mode	@ltx/en_us_goadedes/miscellanea:misc.Mode8
ltx/en_us_goadedes/me.m06.d14:meMA.Ode6C12.ode	@ltx/en_us_goadedes/miscellanea:misc.Ode6
ltx/en_us_goadedes/me.m06.d14:meMA.Ode6C12.text	
ltx/en_us_goadedes/me.m06.d14:meMA.Ode6C13.incipit	…
ltx/en_us_goadedes/me.m06.d14:meMA.Ode6C13.melody	@ltx/en_us_goadedes/he.h.m8:heHE.IlasthitiMoiSotir.name
ltx/en_us_goadedes/me.m06.d14:meMA.Ode6C13.mode	@ltx/en_us_goadedes/miscellanea:misc.Mode8
ltx/en_us_goadedes/me.m06.d14:meMA.Ode6C13.ode	@ltx/en_us_goadedes/miscellanea:misc.Ode6
ltx/en_us_goadedes/me.m06.d14:meMA.Ode6C13.text	
ltx/en_us_goadedes/me.m06.d14:meMA.Ode6C1T.incipit	…
ltx/en_us_goadedes/me.m06.d14:meMA.Ode6C1T.melody	@ltx/en_us_goadedes/he.h.m8:heHE.IlasthitiMoiSotir.name
ltx/en_us_goadedes/me.m06.d14:meMA.Ode6C1T.mode	@ltx/en_us_goadedes/miscellanea:misc.Mode8
ltx/en_us_goadedes/me.m06.d14:meMA.Ode6C1T.ode	@ltx/en_us_goadedes/miscellanea:misc.Ode6
ltx/en_us_goadedes/me.m06.d14:meMA.Ode6C1T.text	
ltx/en_us_goadedes/me.m06.d14:meMA.Ode6C21.greekmelody	@ltx/en_us_goadedes/he.h.m2:heHE.EnAvyssoPtaismaton.greekname
ltx/en_us_goadedes/me.m06.d14:meMA.Ode6C21.incipit	…
ltx/en_us_goadedes/me.m06.d14:meMA.Ode6C21.melody	@ltx/en_us_goadedes/he.h.m2:heHE.EnAvyssoPtaismaton.name
ltx/en_us_goadedes/me.m06.d14:meMA.Ode6C21.mode	@ltx/en_us_goadedes/miscellanea:misc.Mode2
ltx/en_us_goadedes/me.m06.d14:meMA.Ode6C21.ode	@ltx/en_us_goadedes/miscellanea:misc.Ode6
ltx/en_us_goadedes/me.m06.d14:meMA.Ode6C21.text	
ltx/en_us_goadedes/me.m06.d14:meMA.Ode6C22.incipit	…
ltx/en_us_goadedes/me.m06.d14:meMA.Ode6C22.melody	@ltx/en_us_goadedes/he.h.m2:heHE.EnAvyssoPtaismaton.name
ltx/en_us_goadedes/me.m06.d14:meMA.Ode6C22.mode	@ltx/en_us_goadedes/miscellanea:misc.Mode2
ltx/en_us_goadedes/me.m06.d14:meMA.Ode6C22.ode	@ltx/en_us_goadedes/miscellanea:misc.Ode6
ltx/en_us_goadedes/me.m06.d14:meMA.Ode6C22.text	
ltx/en_us_goadedes/me.m06.d14:meMA.Ode6C23.incipit	…
ltx/en_us_goadedes/me.m06.d14:meMA.Ode6C23.melody	@ltx/en_us_goadedes/he.h.m2:heHE.EnAvyssoPtaismaton.name
ltx/en_us_goadedes/me.m06.d14:meMA.Ode6C23.mode	@ltx/en_us_goadedes/miscellanea:misc.Mode2
ltx/en_us_goadedes/me.m06.d14:meMA.Ode6C23.ode	@ltx/en_us_goadedes/miscellanea:misc.Ode6
ltx/en_us_goadedes/me.m06.d14:meMA.Ode6C23.text	
ltx/en_us_goadedes/me.m06.d14:meMA.Ode6C2T.incipit	…
ltx/en_us_goadedes/me.m06.d14:meMA.Ode6C2T.melody	@ltx/en_us_goadedes/he.h.m2:heHE.EnAvyssoPtaismaton.name
ltx/en_us_goadedes/me.m06.d14:meMA.Ode6C2T.mode	@ltx/en_us_goadedes/miscellanea:misc.Mode2
ltx/en_us_goadedes/me.m06.d14:meMA.Ode6C2T.ode	@ltx/en_us_goadedes/miscellanea:misc.Ode6
ltx/en_us_goadedes/me.m06.d14:meMA.Ode6C2T.text	
ltx/en_us_goadedes/me.m06.d14:meMA.Ode6H.greekmelody	@ltx/en_us_goadedes/he.h.m2:heHE.EnAvyssoPtaismaton.greekname
ltx/en_us_goadedes/me.m06.d14:meMA.Ode6H.incipit	@ltx/en_us_goadedes/he.h.m2:heHE.EnAvyssoPtaismaton.incipit
ltx/en_us_goadedes/me.m06.d14:meMA.Ode6H.melody	@ltx/en_us_goadedes/he.h.m2:heHE.EnAvyssoPtaismaton.melody
ltx/en_us_goadedes/me.m06.d14:meMA.Ode6H.mode	@ltx/en_us_goadedes/miscellanea:misc.Mode2
ltx/en_us_goadedes/me.m06.d14:meMA.Ode6H.ode	@ltx/en_us_goadedes/miscellanea:misc.Ode6
ltx/en_us_goadedes/me.m06.d14:meMA.Ode6H.text	@ltx/en_us_goadedes/he.h.m2:heHE.EnAvyssoPtaismaton.text
ltx/en_us_goadedes/me.m06.d14:meMA.Ode7C11.greekmelody	@ltx/en_us_goadedes/he.h.m8:heHE.PaidesEvraion.greekname
ltx/en_us_goadedes/me.m06.d14:meMA.Ode7C11.incipit	…
ltx/en_us_goadedes/me.m06.d14:meMA.Ode7C11.melody	@ltx/en_us_goadedes/he.h.m8:heHE.PaidesEvraion.name
ltx/en_us_goadedes/me.m06.d14:meMA.Ode7C11.mode	@ltx/en_us_goadedes/miscellanea:misc.Mode8
ltx/en_us_goadedes/me.m06.d14:meMA.Ode7C11.ode	@ltx/en_us_goadedes/miscellanea:misc.Ode7
ltx/en_us_goadedes/me.m06.d14:meMA.Ode7C11.text	
ltx/en_us_goadedes/me.m06.d14:meMA.Ode7C12.incipit	…
ltx/en_us_goadedes/me.m06.d14:meMA.Ode7C12.melody	@ltx/en_us_goadedes/he.h.m8:heHE.PaidesEvraion.name
ltx/en_us_goadedes/me.m06.d14:meMA.Ode7C12.mode	@ltx/en_us_goadedes/miscellanea:misc.Mode8
ltx/en_us_goadedes/me.m06.d14:meMA.Ode7C12.ode	@ltx/en_us_goadedes/miscellanea:misc.Ode7
ltx/en_us_goadedes/me.m06.d14:meMA.Ode7C12.text	
ltx/en_us_goadedes/me.m06.d14:meMA.Ode7C13.incipit	…
ltx/en_us_goadedes/me.m06.d14:meMA.Ode7C13.melody	@ltx/en_us_goadedes/he.h.m8:heHE.PaidesEvraion.name
ltx/en_us_goadedes/me.m06.d14:meMA.Ode7C13.mode	@ltx/en_us_goadedes/miscellanea:misc.Mode8
ltx/en_us_goadedes/me.m06.d14:meMA.Ode7C13.ode	@ltx/en_us_goadedes/miscellanea:misc.Ode7
ltx/en_us_goadedes/me.m06.d14:meMA.Ode7C13.text	
ltx/en_us_goadedes/me.m06.d14:meMA.Ode7C1T.incipit	…
ltx/en_us_goadedes/me.m06.d14:meMA.Ode7C1T.melody	@ltx/en_us_goadedes/he.h.m8:heHE.PaidesEvraion.name
ltx/en_us_goadedes/me.m06.d14:meMA.Ode7C1T.mode	@ltx/en_us_goadedes/miscellanea:misc.Mode8
ltx/en_us_goadedes/me.m06.d14:meMA.Ode7C1T.ode	@ltx/en_us_goadedes/miscellanea:misc.Ode7
ltx/en_us_goadedes/me.m06.d14:meMA.Ode7C1T.text	
ltx/en_us_goadedes/me.m06.d14:meMA.Ode7C21.greekmelody	@ltx/en_us_goadedes/he.h.m2:heHE.EikonosChrysis.greekname
ltx/en_us_goadedes/me.m06.d14:meMA.Ode7C21.incipit	…
ltx/en_us_goadedes/me.m06.d14:meMA.Ode7C21.melody	@ltx/en_us_goadedes/he.h.m2:heHE.EikonosChrysis.name
ltx/en_us_goadedes/me.m06.d14:meMA.Ode7C21.mode	@ltx/en_us_goadedes/miscellanea:misc.Mode2
ltx/en_us_goadedes/me.m06.d14:meMA.Ode7C21.ode	@ltx/en_us_goadedes/miscellanea:misc.Ode7
ltx/en_us_goadedes/me.m06.d14:meMA.Ode7C21.text	
ltx/en_us_goadedes/me.m06.d14:meMA.Ode7C22.incipit	…
ltx/en_us_goadedes/me.m06.d14:meMA.Ode7C22.melody	@ltx/en_us_goadedes/he.h.m2:heHE.EikonosChrysis.name
ltx/en_us_goadedes/me.m06.d14:meMA.Ode7C22.mode	@ltx/en_us_goadedes/miscellanea:misc.Mode2
ltx/en_us_goadedes/me.m06.d14:meMA.Ode7C22.ode	@ltx/en_us_goadedes/miscellanea:misc.Ode7
ltx/en_us_goadedes/me.m06.d14:meMA.Ode7C22.text	
ltx/en_us_goadedes/me.m06.d14:meMA.Ode7C23.incipit	…
ltx/en_us_goadedes/me.m06.d14:meMA.Ode7C23.melody	@ltx/en_us_goadedes/he.h.m2:heHE.EikonosChrysis.name
ltx/en_us_goadedes/me.m06.d14:meMA.Ode7C23.mode	@ltx/en_us_goadedes/miscellanea:misc.Mode2
ltx/en_us_goadedes/me.m06.d14:meMA.Ode7C23.ode	@ltx/en_us_goadedes/miscellanea:misc.Ode7
ltx/en_us_goadedes/me.m06.d14:meMA.Ode7C23.text	
ltx/en_us_goadedes/me.m06.d14:meMA.Ode7C2T.incipit	…
ltx/en_us_goadedes/me.m06.d14:meMA.Ode7C2T.melody	@ltx/en_us_goadedes/he.h.m2:heHE.EikonosChrysis.name
ltx/en_us_goadedes/me.m06.d14:meMA.Ode7C2T.mode	@ltx/en_us_goadedes/miscellanea:misc.Mode2
ltx/en_us_goadedes/me.m06.d14:meMA.Ode7C2T.ode	@ltx/en_us_goadedes/miscellanea:misc.Ode7
ltx/en_us_goadedes/me.m06.d14:meMA.Ode7C2T.text	
ltx/en_us_goadedes/me.m06.d14:meMA.Ode8C11.greekmelody	@ltx/en_us_goadedes/he.h.m8:heHE.TonEnOreiAgio.greekname
ltx/en_us_goadedes/me.m06.d14:meMA.Ode8C11.incipit	…
ltx/en_us_goadedes/me.m06.d14:meMA.Ode8C11.melody	@ltx/en_us_goadedes/he.h.m8:heHE.TonEnOreiAgio.name
ltx/en_us_goadedes/me.m06.d14:meMA.Ode8C11.mode	@ltx/en_us_goadedes/miscellanea:misc.Mode8
ltx/en_us_goadedes/me.m06.d14:meMA.Ode8C11.ode	@ltx/en_us_goadedes/miscellanea:misc.Ode8
ltx/en_us_goadedes/me.m06.d14:meMA.Ode8C11.text	
ltx/en_us_goadedes/me.m06.d14:meMA.Ode8C12.incipit	…
ltx/en_us_goadedes/me.m06.d14:meMA.Ode8C12.melody	@ltx/en_us_goadedes/he.h.m8:heHE.TonEnOreiAgio.name
ltx/en_us_goadedes/me.m06.d14:meMA.Ode8C12.mode	@ltx/en_us_goadedes/miscellanea:misc.Mode8
ltx/en_us_goadedes/me.m06.d14:meMA.Ode8C12.ode	@ltx/en_us_goadedes/miscellanea:misc.Ode8
ltx/en_us_goadedes/me.m06.d14:meMA.Ode8C12.text	
ltx/en_us_goadedes/me.m06.d14:meMA.Ode8C13.incipit	…
ltx/en_us_goadedes/me.m06.d14:meMA.Ode8C13.melody	@ltx/en_us_goadedes/he.h.m8:heHE.TonEnOreiAgio.name
ltx/en_us_goadedes/me.m06.d14:meMA.Ode8C13.mode	@ltx/en_us_goadedes/miscellanea:misc.Mode8
ltx/en_us_goadedes/me.m06.d14:meMA.Ode8C13.ode	@ltx/en_us_goadedes/miscellanea:misc.Ode8
ltx/en_us_goadedes/me.m06.d14:meMA.Ode8C13.text	
ltx/en_us_goadedes/me.m06.d14:meMA.Ode8C1T.incipit	…
ltx/en_us_goadedes/me.m06.d14:meMA.Ode8C1T.melody	@ltx/en_us_goadedes/he.h.m8:heHE.TonEnOreiAgio.name
ltx/en_us_goadedes/me.m06.d14:meMA.Ode8C1T.mode	@ltx/en_us_goadedes/miscellanea:misc.Mode8
ltx/en_us_goadedes/me.m06.d14:meMA.Ode8C1T.ode	@ltx/en_us_goadedes/miscellanea:misc.Ode8
ltx/en_us_goadedes/me.m06.d14:meMA.Ode8C1T.text	
ltx/en_us_goadedes/me.m06.d14:meMA.Ode8C21.greekmelody	@ltx/en_us_goadedes/he.h.m2:heHE.TonEnKaminoTouPyros.greekname
ltx/en_us_goadedes/me.m06.d14:meMA.Ode8C21.incipit	…
ltx/en_us_goadedes/me.m06.d14:meMA.Ode8C21.melody	@ltx/en_us_goadedes/he.h.m2:heHE.TonEnKaminoTouPyros.name
ltx/en_us_goadedes/me.m06.d14:meMA.Ode8C21.mode	@ltx/en_us_goadedes/miscellanea:misc.Mode2
ltx/en_us_goadedes/me.m06.d14:meMA.Ode8C21.ode	@ltx/en_us_goadedes/miscellanea:misc.Ode8
ltx/en_us_goadedes/me.m06.d14:meMA.Ode8C21.text	
ltx/en_us_goadedes/me.m06.d14:meMA.Ode8C22.incipit	…
ltx/en_us_goadedes/me.m06.d14:meMA.Ode8C22.melody	@ltx/en_us_goadedes/he.h.m2:heHE.TonEnKaminoTouPyros.name
ltx/en_us_goadedes/me.m06.d14:meMA.Ode8C22.mode	@ltx/en_us_goadedes/miscellanea:misc.Mode2
ltx/en_us_goadedes/me.m06.d14:meMA.Ode8C22.ode	@ltx/en_us_goadedes/miscellanea:misc.Ode8
ltx/en_us_goadedes/me.m06.d14:meMA.Ode8C22.text	
ltx/en_us_goadedes/me.m06.d14:meMA.Ode8C23.incipit	…
ltx/en_us_goadedes/me.m06.d14:meMA.Ode8C23.melody	@ltx/en_us_goadedes/he.h.m2:heHE.TonEnKaminoTouPyros.name
ltx/en_us_goadedes/me.m06.d14:meMA.Ode8C23.mode	@ltx/en_us_goadedes/miscellanea:misc.Mode2
ltx/en_us_goadedes/me.m06.d14:meMA.Ode8C23.ode	@ltx/en_us_goadedes/miscellanea:misc.Ode8
ltx/en_us_goadedes/me.m06.d14:meMA.Ode8C23.text	
ltx/en_us_goadedes/me.m06.d14:meMA.Ode8C2T.incipit	…
ltx/en_us_goadedes/me.m06.d14:meMA.Ode8C2T.melody	@ltx/en_us_goadedes/he.h.m2:heHE.TonEnKaminoTouPyros.name
ltx/en_us_goadedes/me.m06.d14:meMA.Ode8C2T.mode	@ltx/en_us_goadedes/miscellanea:misc.Mode2
ltx/en_us_goadedes/me.m06.d14:meMA.Ode8C2T.ode	@ltx/en_us_goadedes/miscellanea:misc.Ode8
ltx/en_us_goadedes/me.m06.d14:meMA.Ode8C2T.text	
ltx/en_us_goadedes/me.m06.d14:meMA.Ode8H.greekmelody	@ltx/en_us_goadedes/he.h.m2:heHE.TonEnKaminoTouPyros.greekname
ltx/en_us_goadedes/me.m06.d14:meMA.Ode8H.incipit	@ltx/en_us_goadedes/he.h.m2:heHE.TonEnKaminoTouPyros.incipit
ltx/en_us_goadedes/me.m06.d14:meMA.Ode8H.melody	@ltx/en_us_goadedes/he.h.m2:heHE.TonEnKaminoTouPyros.melody
ltx/en_us_goadedes/me.m06.d14:meMA.Ode8H.mode	@ltx/en_us_goadedes/miscellanea:misc.Mode2
ltx/en_us_goadedes/me.m06.d14:meMA.Ode8H.ode	@ltx/en_us_goadedes/miscellanea:misc.Ode8
ltx/en_us_goadedes/me.m06.d14:meMA.Ode8H.text	@ltx/en_us_goadedes/he.h.m2:heHE.TonEnKaminoTouPyros.text
ltx/en_us_goadedes/me.m06.d14:meMA.Ode9C11.greekmelody	@ltx/en_us_goadedes/he.h.m8:heHE.KyriosTheotokon.greekname
ltx/en_us_goadedes/me.m06.d14:meMA.Ode9C11.incipit	…
ltx/en_us_goadedes/me.m06.d14:meMA.Ode9C11.melody	@ltx/en_us_goadedes/he.h.m8:heHE.KyriosTheotokon.name
ltx/en_us_goadedes/me.m06.d14:meMA.Ode9C11.mode	@ltx/en_us_goadedes/miscellanea:misc.Mode8
ltx/en_us_goadedes/me.m06.d14:meMA.Ode9C11.ode	@ltx/en_us_goadedes/miscellanea:misc.Ode9
ltx/en_us_goadedes/me.m06.d14:meMA.Ode9C11.text	
ltx/en_us_goadedes/me.m06.d14:meMA.Ode9C12.incipit	…
ltx/en_us_goadedes/me.m06.d14:meMA.Ode9C12.melody	@ltx/en_us_goadedes/he.h.m8:heHE.KyriosTheotokon.name
ltx/en_us_goadedes/me.m06.d14:meMA.Ode9C12.mode	@ltx/en_us_goadedes/miscellanea:misc.Mode8
ltx/en_us_goadedes/me.m06.d14:meMA.Ode9C12.ode	@ltx/en_us_goadedes/miscellanea:misc.Ode9
ltx/en_us_goadedes/me.m06.d14:meMA.Ode9C12.text	
ltx/en_us_goadedes/me.m06.d14:meMA.Ode9C13.incipit	…
ltx/en_us_goadedes/me.m06.d14:meMA.Ode9C13.melody	@ltx/en_us_goadedes/he.h.m8:heHE.KyriosTheotokon.name
ltx/en_us_goadedes/me.m06.d14:meMA.Ode9C13.mode	@ltx/en_us_goadedes/miscellanea:misc.Mode8
ltx/en_us_goadedes/me.m06.d14:meMA.Ode9C13.ode	@ltx/en_us_goadedes/miscellanea:misc.Ode9
ltx/en_us_goadedes/me.m06.d14:meMA.Ode9C13.text	
ltx/en_us_goadedes/me.m06.d14:meMA.Ode9C1T.incipit	…
ltx/en_us_goadedes/me.m06.d14:meMA.Ode9C1T.melody	@ltx/en_us_goadedes/he.h.m8:heHE.KyriosTheotokon.name
ltx/en_us_goadedes/me.m06.d14:meMA.Ode9C1T.mode	@ltx/en_us_goadedes/miscellanea:misc.Mode8
ltx/en_us_goadedes/me.m06.d14:meMA.Ode9C1T.ode	@ltx/en_us_goadedes/miscellanea:misc.Ode9
ltx/en_us_goadedes/me.m06.d14:meMA.Ode9C1T.text	
ltx/en_us_goadedes/me.m06.d14:meMA.Ode9C21.greekmelody	@ltx/en_us_goadedes/he.h.m2:heHE.TonEkTheouTheonLogon.greekname
ltx/en_us_goadedes/me.m06.d14:meMA.Ode9C21.incipit	…
ltx/en_us_goadedes/me.m06.d14:meMA.Ode9C21.melody	@ltx/en_us_goadedes/he.h.m2:heHE.TonEkTheouTheonLogon.name
ltx/en_us_goadedes/me.m06.d14:meMA.Ode9C21.mode	@ltx/en_us_goadedes/miscellanea:misc.Mode2
ltx/en_us_goadedes/me.m06.d14:meMA.Ode9C21.ode	@ltx/en_us_goadedes/miscellanea:misc.Ode9
ltx/en_us_goadedes/me.m06.d14:meMA.Ode9C21.text	
ltx/en_us_goadedes/me.m06.d14:meMA.Ode9C22.incipit	…
ltx/en_us_goadedes/me.m06.d14:meMA.Ode9C22.melody	@ltx/en_us_goadedes/he.h.m2:heHE.TonEkTheouTheonLogon.name
ltx/en_us_goadedes/me.m06.d14:meMA.Ode9C22.mode	@ltx/en_us_goadedes/miscellanea:misc.Mode2
ltx/en_us_goadedes/me.m06.d14:meMA.Ode9C22.ode	@ltx/en_us_goadedes/miscellanea:misc.Ode9
ltx/en_us_goadedes/me.m06.d14:meMA.Ode9C22.text	
ltx/en_us_goadedes/me.m06.d14:meMA.Ode9C23.incipit	…
ltx/en_us_goadedes/me.m06.d14:meMA.Ode9C23.melody	@ltx/en_us_goadedes/he.h.m2:heHE.TonEkTheouTheonLogon.name
ltx/en_us_goadedes/me.m06.d14:meMA.Ode9C23.mode	@ltx/en_us_goadedes/miscellanea:misc.Mode2
ltx/en_us_goadedes/me.m06.d14:meMA.Ode9C23.ode	@ltx/en_us_goadedes/miscellanea:misc.Ode9
ltx/en_us_goadedes/me.m06.d14:meMA.Ode9C23.text	
ltx/en_us_goadedes/me.m06.d14:meMA.Ode9C2T.incipit	…
ltx/en_us_goadedes/me.m06.d14:meMA.Ode9C2T.melody	@ltx/en_us_goadedes/he.h.m2:heHE.TonEkTheouTheonLogon.name
ltx/en_us_goadedes/me.m06.d14:meMA.Ode9C2T.mode	@ltx/en_us_goadedes/miscellanea:misc.Mode2
ltx/en_us_goadedes/me.m06.d14:meMA.Ode9C2T.ode	@ltx/en_us_goadedes/miscellanea:misc.Ode9
ltx/en_us_goadedes/me.m06.d14:meMA.Ode9C2T.text	
ltx/en_us_goadedes/me.m06.d14:meMA.Ode9H.greekmelody	@ltx/en_us_goadedes/he.h.m2:heHE.TonEkTheouTheonLogon.greekname
ltx/en_us_goadedes/me.m06.d14:meMA.Ode9H.incipit	@ltx/en_us_goadedes/he.h.m2:heHE.TonEkTheouTheonLogon.incipit
ltx/en_us_goadedes/me.m06.d14:meMA.Ode9H.melody	@ltx/en_us_goadedes/he.h.m2:heHE.TonEkTheouTheonLogon.melody
ltx/en_us_goadedes/me.m06.d14:meMA.Ode9H.mode	@ltx/en_us_goadedes/miscellanea:misc.Mode2
ltx/en_us_goadedes/me.m06.d14:meMA.Ode9H.ode	@ltx/en_us_goadedes/miscellanea:misc.Ode9
ltx/en_us_goadedes/me.m06.d14:meMA.Ode9H.text	@ltx/en_us_goadedes/he.h.m2:heHE.TonEkTheouTheonLogon.text
ltx/en_us_goadedes/me.m06.d14:meMA.Oikos1.text	
ltx/en_us_goadedes/me.m06.d14:meMA.Oikos12.text	
ltx/en_us_goadedes/me.m06.d14:meMA.Oikos13.text	
ltx/en_us_goadedes/me.m06.d14:meMA.Oikos14.text	
ltx/en_us_goadedes/me.m06.d14:meMA.Oikos15.text	
ltx/en_us_goadedes/me.m06.d14:meMA.Oikos16.text	
ltx/en_us_goadedes/me.m06.d14:meMA.Oikos17.text	
ltx/en_us_goadedes/me.m06.d14:meMA.Oikos18.text	
ltx/en_us_goadedes/me.m06.d14:meVE.Apolytikion1.greekmelody	@ltx/en_us_goadedes/he.a.m4:heAU.TachyProkatalave.greekname
ltx/en_us_goadedes/me.m06.d14:meVE.Apolytikion1.incipit	@ltx/en_us_goadedes/me.m07.d20:meVE.Apolytikion1.incipit
ltx/en_us_goadedes/me.m06.d14:meVE.Apolytikion1.melody	@ltx/en_us_goadedes/he.a.m4:heAU.TachyProkatalave.name
ltx/en_us_goadedes/me.m06.d14:meVE.Apolytikion1.mode	@ltx/en_us_goadedes/miscellanea:misc.Mode4
ltx/en_us_goadedes/me.m06.d14:meVE.Apolytikion1.text	@ltx/en_us_goadedes/me.m07.d20:meVE.Apolytikion1.text
ltx/en_us_goadedes/me.m06.d14:meVE.Apolytikion2.melody	@ltx/en_us_goadedes/he.ga:heGA.OrthodoxiasOdigeH.name
ltx/en_us_goadedes/me.m06.d14:meVE.Apolytikion2.mode	@ltx/en_us_goadedes/miscellanea:misc.Mode8
ltx/en_us_goadedes/me.m06.d14:meVE.AposGlory.incipit	@ltx/en_us_goadedes/me.m07.d20:meMA.LaudsGlory.incipit
ltx/en_us_goadedes/me.m06.d14:meVE.AposGlory.melody	
ltx/en_us_goadedes/me.m06.d14:meVE.AposGlory.mode	@ltx/en_us_goadedes/miscellanea:misc.Mode8
ltx/en_us_goadedes/me.m06.d14:meVE.AposGlory.text	@ltx/en_us_goadedes/me.m07.d20:meMA.LaudsGlory.text
ltx/en_us_goadedes/me.m06.d14:meVE.AposStavrotheotokion.greekmelody	@ltx/en_us_goadedes/he.a.m8:heAU.OiMartyresSouKyrie.greekname
ltx/en_us_goadedes/me.m06.d14:meVE.AposStavrotheotokion.incipit	@ltx/en_us_goadedes/me.m02.d19:meVE.SticStavrotheotokion.incipit
ltx/en_us_goadedes/me.m06.d14:meVE.AposStavrotheotokion.melody	@ltx/en_us_goadedes/he.a.m8:heAU.OiMartyresSouKyrie.name
ltx/en_us_goadedes/me.m06.d14:meVE.AposStavrotheotokion.mode	@ltx/en_us_goadedes/miscellanea:misc.Mode8
ltx/en_us_goadedes/me.m06.d14:meVE.AposStavrotheotokion.text	@ltx/en_us_goadedes/me.m02.d19:meVE.SticStavrotheotokion.text
ltx/en_us_goadedes/me.m06.d14:meVE.AposTheotokion.incipit	…
ltx/en_us_goadedes/me.m06.d14:meVE.AposTheotokion.melody	
ltx/en_us_goadedes/me.m06.d14:meVE.AposTheotokion.mode	@ltx/en_us_goadedes/miscellanea:misc.Mode8
ltx/en_us_goadedes/me.m06.d14:meVE.AposTheotokion.text	
ltx/en_us_goadedes/me.m06.d14:meVE.Aposticha4.incipit	…
ltx/en_us_goadedes/me.m06.d14:meVE.Aposticha4.melody	@ltx/en_us_goadedes/miscellanea:misc.Idiomelon
ltx/en_us_goadedes/me.m06.d14:meVE.Aposticha4.mode	@ltx/en_us_goadedes/miscellanea:misc.Mode4
ltx/en_us_goadedes/me.m06.d14:meVE.Aposticha4.poet	@ltx/en_us_goadedes/poets:po.FotiouPatriarchou
ltx/en_us_goadedes/me.m06.d14:meVE.Aposticha4.text	
ltx/en_us_goadedes/me.m06.d14:meVE.GeneralApolytikion2.name	
ltx/en_us_goadedes/me.m06.d14:meVE.MM.Stichera1123as78910.text	@ltx/en_us_goadedes/properties:media.key
ltx/en_us_goadedes/me.m06.d14:meVE.SticGlory.incipit	…
ltx/en_us_goadedes/me.m06.d14:meVE.SticGlory.melody	
ltx/en_us_goadedes/me.m06.d14:meVE.SticGlory.mode	@ltx/en_us_goadedes/miscellanea:misc.Mode6
ltx/en_us_goadedes/me.m06.d14:meVE.SticGlory.text	
ltx/en_us_goadedes/me.m06.d14:meVE.SticStavrotheotokion.greekmelody	@ltx/en_us_goadedes/he.a.m6:heAU.TriimerosAnestis.greekname
ltx/en_us_goadedes/me.m06.d14:meVE.SticStavrotheotokion.incipit	@ltx/en_us_goadedes/oc.m6.d4:ocMA.AposTheotokion.incipit
ltx/en_us_goadedes/me.m06.d14:meVE.SticStavrotheotokion.melody	@ltx/en_us_goadedes/he.a.m6:heAU.TriimerosAnestis.name
ltx/en_us_goadedes/me.m06.d14:meVE.SticStavrotheotokion.mode	@ltx/en_us_goadedes/miscellanea:misc.Mode6
ltx/en_us_goadedes/me.m06.d14:meVE.SticStavrotheotokion.text	@ltx/en_us_goadedes/oc.m6.d4:ocMA.AposTheotokion.text
ltx/en_us_goadedes/me.m06.d14:meVE.SticTheotokion.greekmelody	@ltx/en_us_goadedes/he.a.m6:heAU.TriimerosAnestis.greekname
ltx/en_us_goadedes/me.m06.d14:meVE.SticTheotokion.incipit	@ltx/en_us_goadedes/me.m06.d12:meVE.SticTheotokion.incipit
ltx/en_us_goadedes/me.m06.d14:meVE.SticTheotokion.melody	@ltx/en_us_goadedes/he.a.m6:heAU.TriimerosAnestis.name
ltx/en_us_goadedes/me.m06.d14:meVE.SticTheotokion.mode	@ltx/en_us_goadedes/miscellanea:misc.Mode6
ltx/en_us_goadedes/me.m06.d14:meVE.SticTheotokion.text	@ltx/en_us_goadedes/me.m06.d12:meVE.SticTheotokion.text
ltx/en_us_goadedes/me.m06.d14:meVE.Stichera01.greekmelody	@ltx/en_us_goadedes/he.a.m8:heAU.OTouParadoxou.greekname
ltx/en_us_goadedes/me.m06.d14:meVE.Stichera01.incipit	…
ltx/en_us_goadedes/me.m06.d14:meVE.Stichera01.melody	@ltx/en_us_goadedes/he.a.m8:heAU.OTouParadoxou.name
ltx/en_us_goadedes/me.m06.d14:meVE.Stichera01.mode	@ltx/en_us_goadedes/miscellanea:misc.Mode8
ltx/en_us_goadedes/me.m06.d14:meVE.Stichera01.text	
ltx/en_us_goadedes/me.m06.d14:meVE.Stichera02.incipit	…
ltx/en_us_goadedes/me.m06.d14:meVE.Stichera02.melody	@ltx/en_us_goadedes/he.a.m8:heAU.OTouParadoxou.name
ltx/en_us_goadedes/me.m06.d14:meVE.Stichera02.mode	@ltx/en_us_goadedes/miscellanea:misc.Mode8
ltx/en_us_goadedes/me.m06.d14:meVE.Stichera02.text	
ltx/en_us_goadedes/me.m06.d14:meVE.Stichera03.incipit	…
ltx/en_us_goadedes/me.m06.d14:meVE.Stichera03.melody	@ltx/en_us_goadedes/he.a.m8:heAU.OTouParadoxou.name
ltx/en_us_goadedes/me.m06.d14:meVE.Stichera03.mode	@ltx/en_us_goadedes/miscellanea:misc.Mode8
ltx/en_us_goadedes/me.m06.d14:meVE.Stichera03.text	
ltx/en_us_goadedes/me.m06.d14:meVE.Stichera04.greekmelody	@ltx/en_us_goadedes/he.a.m4:heAU.OsGennaionEnMartysi.greekname
ltx/en_us_goadedes/me.m06.d14:meVE.Stichera04.incipit	…
ltx/en_us_goadedes/me.m06.d14:meVE.Stichera04.melody	@ltx/en_us_goadedes/he.a.m4:heAU.OsGennaionEnMartysi.name
ltx/en_us_goadedes/me.m06.d14:meVE.Stichera04.mode	@ltx/en_us_goadedes/miscellanea:misc.Mode4
ltx/en_us_goadedes/me.m06.d14:meVE.Stichera04.text	
ltx/en_us_goadedes/me.m06.d14:meVE.Stichera05.incipit	…
ltx/en_us_goadedes/me.m06.d14:meVE.Stichera05.melody	@ltx/en_us_goadedes/he.a.m4:heAU.OsGennaionEnMartysi.name
ltx/en_us_goadedes/me.m06.d14:meVE.Stichera05.mode	@ltx/en_us_goadedes/miscellanea:misc.Mode4
ltx/en_us_goadedes/me.m06.d14:meVE.Stichera05.text	
ltx/en_us_goadedes/me.m06.d14:meVE.Stichera06.incipit	…
ltx/en_us_goadedes/me.m06.d14:meVE.Stichera06.melody	@ltx/en_us_goadedes/he.a.m4:heAU.OsGennaionEnMartysi.name
ltx/en_us_goadedes/me.m06.d14:meVE.Stichera06.mode	@ltx/en_us_goadedes/miscellanea:misc.Mode4
ltx/en_us_goadedes/me.m06.d14:meVE.Stichera06.text	
