ltx/en_us_goadedes/da.d2:daCommemoration.text	
ltx/en_us_goadedes/da.d2:daDay.text	Monday.
ltx/en_us_goadedes/da.d2:daForDay.text	
ltx/en_us_goadedes/da.d2:daLI.EpistleProkeimenon.title	
ltx/en_us_goadedes/da.d2:daLI.MM.CommunionHymn.text	@ltx/en_us_goadedes/properties:media.key
ltx/en_us_goadedes/da.d2:daMA.ExapTheotokion1.greekmelody	@ltx/en_us_goadedes/he.a.m2:heAU.GynaikesAkoutisthite.greekname
ltx/en_us_goadedes/da.d2:daMA.ExapTheotokion1.incipit	…
ltx/en_us_goadedes/da.d2:daMA.ExapTheotokion1.melody	@ltx/en_us_goadedes/he.a.m2:heAU.GynaikesAkoutisthite.name
ltx/en_us_goadedes/da.d2:daMA.ExapTheotokion1.mode	@ltx/en_us_goadedes/miscellanea:misc.Mode2
ltx/en_us_goadedes/da.d2:daMA.ExapTheotokion1.text	
ltx/en_us_goadedes/da.d2:daMA.Exaposteilarion1.greekmelody	@ltx/en_us_goadedes/he.a.m2:heAU.GynaikesAkoutisthite.greekname
ltx/en_us_goadedes/da.d2:daMA.Exaposteilarion1.incipit	…
ltx/en_us_goadedes/da.d2:daMA.Exaposteilarion1.melody	@ltx/en_us_goadedes/he.a.m2:heAU.GynaikesAkoutisthite.name
ltx/en_us_goadedes/da.d2:daMA.Exaposteilarion1.mode	@ltx/en_us_goadedes/miscellanea:misc.Mode2
ltx/en_us_goadedes/da.d2:daMA.Exaposteilarion1.text	
ltx/en_us_goadedes/da.d2:daMA.Photagogic1Beginning.text	
ltx/en_us_goadedes/da.d2:daMA.Photagogic1Ending.text	
ltx/en_us_goadedes/da.d2:daMA.Photagogic2Beginning.text	@ltx/en_us_goadedes/prayers:pr.photagogic_begin_Saints.text
ltx/en_us_goadedes/da.d2:daMA.Photagogic2Ending.text	@ltx/en_us_goadedes/prayers:pr.photagogic_end_Saints.text
ltx/en_us_goadedes/da.d2:daMA.Photagogic3Beginning.text	@ltx/en_us_goadedes/prayers:pr.photagogic_begin_Theotokos.text
ltx/en_us_goadedes/da.d2:daMA.Photagogic3Ending.text	@ltx/en_us_goadedes/prayers:pr.photagogic_end_Theotokos.text
ltx/en_us_goadedes/da.d2:daMA.Triadic1Ending.text	
ltx/en_us_goadedes/da.d2:daMA.Triadic2Ending.text	@ltx/en_us_goadedes/prayers:pr.triadic_end_Saints.text
ltx/en_us_goadedes/da.d2:daMA.Triadic3Ending.text	@ltx/en_us_goadedes/prayers:pr.triadic_end_Theotokos.text
ltx/en_us_goadedes/da.d2:daOnDay.text	on Monday,
ltx/en_us_goadedes/da.d2:daVE.ApolTheotokion.incipit	@ltx/en_us_goadedes/oc.m4.d2:ocMA.Kathisma33.incipit
ltx/en_us_goadedes/da.d2:daVE.ApolTheotokion.melody	
ltx/en_us_goadedes/da.d2:daVE.ApolTheotokion.mode	@ltx/en_us_goadedes/miscellanea:misc.Mode4
ltx/en_us_goadedes/da.d2:daVE.ApolTheotokion.text	@ltx/en_us_goadedes/oc.m4.d2:ocMA.Kathisma33.text
ltx/en_us_goadedes/da.d2:daVE.Apolytikion1.greekmelody	@ltx/en_us_goadedes/he.a.m4:heAU.OYpsotheisEnToStavro.greekname
ltx/en_us_goadedes/da.d2:daVE.Apolytikion1.incipit	@ltx/en_us_goadedes/me.m11.d08:meVE.Apolytikion1.incipit
ltx/en_us_goadedes/da.d2:daVE.Apolytikion1.melody	@ltx/en_us_goadedes/he.a.m4:heAU.OYpsotheisEnToStavro.name
ltx/en_us_goadedes/da.d2:daVE.Apolytikion1.mode	@ltx/en_us_goadedes/miscellanea:misc.Mode4
ltx/en_us_goadedes/da.d2:daVE.Apolytikion1.text	@ltx/en_us_goadedes/me.m11.d08:meVE.Apolytikion1.text
ltx/en_us_goadedes/da.d2:daVE.OnTheDayBefore.text	
ltx/en_us_goadedes/da.d2:daVE.OnTheEveningBefore.text	@ltx/en_us_goadedes/template.titles:d.onSundayEvening
