ltx/en_us_goadedes/me.m01.d11:meDA.commemoration.first	
ltx/en_us_goadedes/me.m01.d11:meDA.commemoration.first_name	
ltx/en_us_goadedes/me.m01.d11:meDA.commemoration.first_short	
ltx/en_us_goadedes/me.m01.d11:meDA.commemoration.first_title	@ltx/en_us_goadedes/titles:ti.SaintM
ltx/en_us_goadedes/me.m01.d11:meDA.commemoration.full	
ltx/en_us_goadedes/me.m01.d11:meDA.commemoration.second_name	
ltx/en_us_goadedes/me.m01.d11:meDA.commemoration.second_title	
ltx/en_us_goadedes/me.m01.d11:meDA.date	
ltx/en_us_goadedes/me.m01.d11:meDA.dismissal	@ltx/en_us_goadedes/dismissals:dis00.epiphany
ltx/en_us_goadedes/me.m01.d11:meDA.fordate	
ltx/en_us_goadedes/me.m01.d11:meDA.insert1	
ltx/en_us_goadedes/me.m01.d11:meDA.insert2	
ltx/en_us_goadedes/me.m01.d11:meDA.note	
ltx/en_us_goadedes/me.m01.d11:meDA.pdfcoverdate	
ltx/en_us_goadedes/me.m01.d11:meDA.pdfheaderdate	
ltx/en_us_goadedes/me.m01.d11:meHO.commemorations	
ltx/en_us_goadedes/me.m01.d11:meHO.note1	@ltx/en_us_goadedes/rubrical:ru.WineOil
ltx/en_us_goadedes/me.m01.d11:meHO.note2	
ltx/en_us_goadedes/me.m01.d11:meHO.number	
ltx/en_us_goadedes/me.m01.d11:meHO.rank	
ltx/en_us_goadedes/me.m01.d11:meLE.commemoration1	
ltx/en_us_goadedes/me.m01.d11:meLE.commemoration2	
ltx/en_us_goadedes/me.m01.d11:meLI.Kontakion1.greekmelody	@ltx/en_us_goadedes/me.m01.d11:meMA.Kontakion1.greekmelody
ltx/en_us_goadedes/me.m01.d11:meLI.Kontakion1.incipit	@ltx/en_us_goadedes/me.m01.d11:meMA.Kontakion1.incipit
ltx/en_us_goadedes/me.m01.d11:meLI.Kontakion1.melody	@ltx/en_us_goadedes/me.m01.d11:meMA.Kontakion1.melody
ltx/en_us_goadedes/me.m01.d11:meLI.Kontakion1.mode	@ltx/en_us_goadedes/me.m01.d11:meMA.Kontakion1.mode
ltx/en_us_goadedes/me.m01.d11:meLI.Kontakion1.text	@ltx/en_us_goadedes/me.m01.d11:meMA.Kontakion1.text
ltx/en_us_goadedes/me.m01.d11:meLI.MM.CommunionHymn.text	@ltx/en_us_goadedes/properties:media.key
ltx/en_us_goadedes/me.m01.d11:meLI.Megalynarion.text	
ltx/en_us_goadedes/me.m01.d11:meMA.C1.title	@ltx/en_us_goadedes/titles:ti.CanonDevoutM
ltx/en_us_goadedes/me.m01.d11:meMA.C1.verse	@ltx/en_us_goadedes/prayers:pr.verse_SaintM.text
ltx/en_us_goadedes/me.m01.d11:meMA.Exaposteilarion1.greekmelody	@ltx/en_us_goadedes/he.a.m2:heAU.GynaikesAkoutisthite.greekname
ltx/en_us_goadedes/me.m01.d11:meMA.Exaposteilarion1.incipit	…
ltx/en_us_goadedes/me.m01.d11:meMA.Exaposteilarion1.melody	@ltx/en_us_goadedes/he.a.m2:heAU.GynaikesAkoutisthite.name
ltx/en_us_goadedes/me.m01.d11:meMA.Exaposteilarion1.mode	@ltx/en_us_goadedes/miscellanea:misc.Mode2
ltx/en_us_goadedes/me.m01.d11:meMA.Exaposteilarion1.text	
ltx/en_us_goadedes/me.m01.d11:meMA.Exaposteilarion2.greekmelody	@ltx/en_us_goadedes/he.a.m2:heAU.GynaikesAkoutisthite.greekname
ltx/en_us_goadedes/me.m01.d11:meMA.Exaposteilarion2.incipit	…
ltx/en_us_goadedes/me.m01.d11:meMA.Exaposteilarion2.melody	@ltx/en_us_goadedes/he.a.m2:heAU.GynaikesAkoutisthite.name
ltx/en_us_goadedes/me.m01.d11:meMA.Exaposteilarion2.mode	@ltx/en_us_goadedes/miscellanea:misc.Mode2
ltx/en_us_goadedes/me.m01.d11:meMA.Exaposteilarion2.text	
ltx/en_us_goadedes/me.m01.d11:meMA.Kathisma11.greekmelody	@ltx/en_us_goadedes/he.a.m4:heAU.KateplagiIosif.greekname
ltx/en_us_goadedes/me.m01.d11:meMA.Kathisma11.incipit	@ltx/en_us_goadedes/me.m01.d08:meMA.Kathisma11.incipit
ltx/en_us_goadedes/me.m01.d11:meMA.Kathisma11.melody	@ltx/en_us_goadedes/he.a.m4:heAU.KateplagiIosif.name
ltx/en_us_goadedes/me.m01.d11:meMA.Kathisma11.mode	@ltx/en_us_goadedes/miscellanea:misc.Mode4
ltx/en_us_goadedes/me.m01.d11:meMA.Kathisma11.text	@ltx/en_us_goadedes/me.m01.d08:meMA.Kathisma11.text
ltx/en_us_goadedes/me.m01.d11:meMA.Kathisma21.greekmelody	@ltx/en_us_goadedes/he.a.m4:heAU.KateplagiIosif.greekname
ltx/en_us_goadedes/me.m01.d11:meMA.Kathisma21.incipit	@ltx/en_us_goadedes/me.m01.d10:meMA.Kathisma21.incipit
ltx/en_us_goadedes/me.m01.d11:meMA.Kathisma21.melody	@ltx/en_us_goadedes/he.a.m4:heAU.KateplagiIosif.name
ltx/en_us_goadedes/me.m01.d11:meMA.Kathisma21.mode	@ltx/en_us_goadedes/miscellanea:misc.Mode4
ltx/en_us_goadedes/me.m01.d11:meMA.Kathisma21.text	@ltx/en_us_goadedes/me.m01.d10:meMA.Kathisma21.text
ltx/en_us_goadedes/me.m01.d11:meMA.Kathisma31.greekmelody	@ltx/en_us_goadedes/he.a.m3:heAU.TheiasPisteos.greekname
ltx/en_us_goadedes/me.m01.d11:meMA.Kathisma31.incipit	…
ltx/en_us_goadedes/me.m01.d11:meMA.Kathisma31.melody	@ltx/en_us_goadedes/he.a.m3:heAU.TheiasPisteos.name
ltx/en_us_goadedes/me.m01.d11:meMA.Kathisma31.mode	@ltx/en_us_goadedes/miscellanea:misc.Mode3
ltx/en_us_goadedes/me.m01.d11:meMA.Kathisma31.text	
ltx/en_us_goadedes/me.m01.d11:meMA.Kathisma32.greekmelody	@ltx/en_us_goadedes/he.a.m3:heAU.IParthenosSimeron.greekname
ltx/en_us_goadedes/me.m01.d11:meMA.Kathisma32.incipit	@ltx/en_us_goadedes/me.m01.d10:meMA.Kathisma11.incipit
ltx/en_us_goadedes/me.m01.d11:meMA.Kathisma32.melody	@ltx/en_us_goadedes/he.a.m3:heAU.IParthenosSimeron.name
ltx/en_us_goadedes/me.m01.d11:meMA.Kathisma32.mode	@ltx/en_us_goadedes/miscellanea:misc.Mode3
ltx/en_us_goadedes/me.m01.d11:meMA.Kathisma32.text	@ltx/en_us_goadedes/me.m01.d10:meMA.Kathisma11.text
ltx/en_us_goadedes/me.m01.d11:meMA.Kontakion1.greekmelody	@ltx/en_us_goadedes/he.a.m8:heAU.TiYpermacho.greekname
ltx/en_us_goadedes/me.m01.d11:meMA.Kontakion1.incipit	…
ltx/en_us_goadedes/me.m01.d11:meMA.Kontakion1.melody	@ltx/en_us_goadedes/he.a.m8:heAU.TiYpermacho.name
ltx/en_us_goadedes/me.m01.d11:meMA.Kontakion1.mode	@ltx/en_us_goadedes/miscellanea:misc.Mode8
ltx/en_us_goadedes/me.m01.d11:meMA.Kontakion1.text	
ltx/en_us_goadedes/me.m01.d11:meMA.Lauds1.greekmelody	@ltx/en_us_goadedes/he.a.m5:heAU.ChairoisAskitikon.greekname
ltx/en_us_goadedes/me.m01.d11:meMA.Lauds1.incipit	…
ltx/en_us_goadedes/me.m01.d11:meMA.Lauds1.melody	@ltx/en_us_goadedes/he.a.m5:heAU.ChairoisAskitikon.name
ltx/en_us_goadedes/me.m01.d11:meMA.Lauds1.mode	@ltx/en_us_goadedes/miscellanea:misc.Mode5
ltx/en_us_goadedes/me.m01.d11:meMA.Lauds1.text	
ltx/en_us_goadedes/me.m01.d11:meMA.Lauds2.incipit	…
ltx/en_us_goadedes/me.m01.d11:meMA.Lauds2.melody	@ltx/en_us_goadedes/he.a.m5:heAU.ChairoisAskitikon.name
ltx/en_us_goadedes/me.m01.d11:meMA.Lauds2.mode	@ltx/en_us_goadedes/miscellanea:misc.Mode5
ltx/en_us_goadedes/me.m01.d11:meMA.Lauds2.text	
ltx/en_us_goadedes/me.m01.d11:meMA.Lauds3.incipit	…
ltx/en_us_goadedes/me.m01.d11:meMA.Lauds3.melody	@ltx/en_us_goadedes/he.a.m5:heAU.ChairoisAskitikon.name
ltx/en_us_goadedes/me.m01.d11:meMA.Lauds3.mode	@ltx/en_us_goadedes/miscellanea:misc.Mode5
ltx/en_us_goadedes/me.m01.d11:meMA.Lauds3.text	
ltx/en_us_goadedes/me.m01.d11:meMA.Lauds4.greekmelody	@ltx/en_us_goadedes/he.a.m5:heAU.ChairoisAskitikon.greekname
ltx/en_us_goadedes/me.m01.d11:meMA.Lauds4.incipit	…
ltx/en_us_goadedes/me.m01.d11:meMA.Lauds4.melody	@ltx/en_us_goadedes/he.a.m5:heAU.ChairoisAskitikon.name
ltx/en_us_goadedes/me.m01.d11:meMA.Lauds4.mode	@ltx/en_us_goadedes/miscellanea:misc.Mode5
ltx/en_us_goadedes/me.m01.d11:meMA.Lauds4.text	
ltx/en_us_goadedes/me.m01.d11:meMA.LaudsBoth.incipit	@ltx/en_us_goadedes/me.m01.d06:meMA.LaudsBoth.incipit
ltx/en_us_goadedes/me.m01.d11:meMA.LaudsBoth.melody	
ltx/en_us_goadedes/me.m01.d11:meMA.LaudsBoth.mode	@ltx/en_us_goadedes/miscellanea:misc.Mode2
ltx/en_us_goadedes/me.m01.d11:meMA.LaudsBoth.poet	@ltx/en_us_goadedes/poets:po.Anatoliou
ltx/en_us_goadedes/me.m01.d11:meMA.LaudsBoth.text	@ltx/en_us_goadedes/me.m01.d06:meMA.LaudsBoth.text
ltx/en_us_goadedes/me.m01.d11:meMA.LaudsGlory.incipit	…
ltx/en_us_goadedes/me.m01.d11:meMA.LaudsGlory.melody	
ltx/en_us_goadedes/me.m01.d11:meMA.LaudsGlory.mode	@ltx/en_us_goadedes/miscellanea:misc.Mode2
ltx/en_us_goadedes/me.m01.d11:meMA.LaudsGlory.poet	@ltx/en_us_goadedes/poets:po.Anatoliou
ltx/en_us_goadedes/me.m01.d11:meMA.LaudsGlory.text	
ltx/en_us_goadedes/me.m01.d11:meMA.Ode1C11.greekmelody	@ltx/en_us_goadedes/he.h.m2:heHE.EnVythoKatestrose.greekname
ltx/en_us_goadedes/me.m01.d11:meMA.Ode1C11.incipit	…
ltx/en_us_goadedes/me.m01.d11:meMA.Ode1C11.melody	@ltx/en_us_goadedes/he.h.m2:heHE.EnVythoKatestrose.name
ltx/en_us_goadedes/me.m01.d11:meMA.Ode1C11.mode	@ltx/en_us_goadedes/miscellanea:misc.Mode2
ltx/en_us_goadedes/me.m01.d11:meMA.Ode1C11.ode	@ltx/en_us_goadedes/miscellanea:misc.Ode1
ltx/en_us_goadedes/me.m01.d11:meMA.Ode1C11.text	
ltx/en_us_goadedes/me.m01.d11:meMA.Ode1C12.incipit	…
ltx/en_us_goadedes/me.m01.d11:meMA.Ode1C12.melody	@ltx/en_us_goadedes/he.h.m2:heHE.EnVythoKatestrose.name
ltx/en_us_goadedes/me.m01.d11:meMA.Ode1C12.mode	@ltx/en_us_goadedes/miscellanea:misc.Mode2
ltx/en_us_goadedes/me.m01.d11:meMA.Ode1C12.ode	@ltx/en_us_goadedes/miscellanea:misc.Ode1
ltx/en_us_goadedes/me.m01.d11:meMA.Ode1C12.text	
ltx/en_us_goadedes/me.m01.d11:meMA.Ode1C13.incipit	…
ltx/en_us_goadedes/me.m01.d11:meMA.Ode1C13.melody	@ltx/en_us_goadedes/he.h.m2:heHE.EnVythoKatestrose.name
ltx/en_us_goadedes/me.m01.d11:meMA.Ode1C13.mode	@ltx/en_us_goadedes/miscellanea:misc.Mode2
ltx/en_us_goadedes/me.m01.d11:meMA.Ode1C13.ode	@ltx/en_us_goadedes/miscellanea:misc.Ode1
ltx/en_us_goadedes/me.m01.d11:meMA.Ode1C13.text	
ltx/en_us_goadedes/me.m01.d11:meMA.Ode1C14.incipit	…
ltx/en_us_goadedes/me.m01.d11:meMA.Ode1C14.melody	@ltx/en_us_goadedes/he.h.m2:heHE.EnVythoKatestrose.name
ltx/en_us_goadedes/me.m01.d11:meMA.Ode1C14.mode	@ltx/en_us_goadedes/miscellanea:misc.Mode2
ltx/en_us_goadedes/me.m01.d11:meMA.Ode1C14.ode	@ltx/en_us_goadedes/miscellanea:misc.Ode1
ltx/en_us_goadedes/me.m01.d11:meMA.Ode1C14.text	
ltx/en_us_goadedes/me.m01.d11:meMA.Ode1C1T.incipit	…
ltx/en_us_goadedes/me.m01.d11:meMA.Ode1C1T.melody	@ltx/en_us_goadedes/he.h.m2:heHE.EnVythoKatestrose.name
ltx/en_us_goadedes/me.m01.d11:meMA.Ode1C1T.mode	@ltx/en_us_goadedes/miscellanea:misc.Mode2
ltx/en_us_goadedes/me.m01.d11:meMA.Ode1C1T.ode	@ltx/en_us_goadedes/miscellanea:misc.Ode1
ltx/en_us_goadedes/me.m01.d11:meMA.Ode1C1T.text	
ltx/en_us_goadedes/me.m01.d11:meMA.Ode3C11.greekmelody	@ltx/en_us_goadedes/he.h.m2:heHE.ExinthisenIErimos.greekname
ltx/en_us_goadedes/me.m01.d11:meMA.Ode3C11.incipit	…
ltx/en_us_goadedes/me.m01.d11:meMA.Ode3C11.melody	@ltx/en_us_goadedes/he.h.m2:heHE.ExinthisenIErimos.name
ltx/en_us_goadedes/me.m01.d11:meMA.Ode3C11.mode	@ltx/en_us_goadedes/miscellanea:misc.Mode2
ltx/en_us_goadedes/me.m01.d11:meMA.Ode3C11.ode	@ltx/en_us_goadedes/miscellanea:misc.Ode3
ltx/en_us_goadedes/me.m01.d11:meMA.Ode3C11.text	
ltx/en_us_goadedes/me.m01.d11:meMA.Ode3C12.incipit	…
ltx/en_us_goadedes/me.m01.d11:meMA.Ode3C12.melody	@ltx/en_us_goadedes/he.h.m2:heHE.ExinthisenIErimos.name
ltx/en_us_goadedes/me.m01.d11:meMA.Ode3C12.mode	@ltx/en_us_goadedes/miscellanea:misc.Mode2
ltx/en_us_goadedes/me.m01.d11:meMA.Ode3C12.ode	@ltx/en_us_goadedes/miscellanea:misc.Ode3
ltx/en_us_goadedes/me.m01.d11:meMA.Ode3C12.text	
ltx/en_us_goadedes/me.m01.d11:meMA.Ode3C13.incipit	…
ltx/en_us_goadedes/me.m01.d11:meMA.Ode3C13.melody	@ltx/en_us_goadedes/he.h.m2:heHE.ExinthisenIErimos.name
ltx/en_us_goadedes/me.m01.d11:meMA.Ode3C13.mode	@ltx/en_us_goadedes/miscellanea:misc.Mode2
ltx/en_us_goadedes/me.m01.d11:meMA.Ode3C13.ode	@ltx/en_us_goadedes/miscellanea:misc.Ode3
ltx/en_us_goadedes/me.m01.d11:meMA.Ode3C13.text	
ltx/en_us_goadedes/me.m01.d11:meMA.Ode3C14.incipit	…
ltx/en_us_goadedes/me.m01.d11:meMA.Ode3C14.melody	@ltx/en_us_goadedes/he.h.m2:heHE.ExinthisenIErimos.name
ltx/en_us_goadedes/me.m01.d11:meMA.Ode3C14.mode	@ltx/en_us_goadedes/miscellanea:misc.Mode2
ltx/en_us_goadedes/me.m01.d11:meMA.Ode3C14.ode	@ltx/en_us_goadedes/miscellanea:misc.Ode3
ltx/en_us_goadedes/me.m01.d11:meMA.Ode3C14.text	
ltx/en_us_goadedes/me.m01.d11:meMA.Ode3C1T.incipit	…
ltx/en_us_goadedes/me.m01.d11:meMA.Ode3C1T.melody	@ltx/en_us_goadedes/he.h.m2:heHE.ExinthisenIErimos.name
ltx/en_us_goadedes/me.m01.d11:meMA.Ode3C1T.mode	@ltx/en_us_goadedes/miscellanea:misc.Mode2
ltx/en_us_goadedes/me.m01.d11:meMA.Ode3C1T.ode	@ltx/en_us_goadedes/miscellanea:misc.Ode3
ltx/en_us_goadedes/me.m01.d11:meMA.Ode3C1T.text	
ltx/en_us_goadedes/me.m01.d11:meMA.Ode3Kathisma1.greekmelody	@ltx/en_us_goadedes/he.a.m8:heAU.TinSofianKaiLogon.greekname
ltx/en_us_goadedes/me.m01.d11:meMA.Ode3Kathisma1.incipit	…
ltx/en_us_goadedes/me.m01.d11:meMA.Ode3Kathisma1.melody	@ltx/en_us_goadedes/he.a.m8:heAU.TinSofianKaiLogon.name
ltx/en_us_goadedes/me.m01.d11:meMA.Ode3Kathisma1.mode	@ltx/en_us_goadedes/miscellanea:misc.Mode8
ltx/en_us_goadedes/me.m01.d11:meMA.Ode3Kathisma1.text	
ltx/en_us_goadedes/me.m01.d11:meMA.Ode3Kathisma2.greekmelody	@ltx/en_us_goadedes/he.a.m8:heAU.TinSofianKaiLogon.greekname
ltx/en_us_goadedes/me.m01.d11:meMA.Ode3Kathisma2.incipit	…
ltx/en_us_goadedes/me.m01.d11:meMA.Ode3Kathisma2.melody	@ltx/en_us_goadedes/he.a.m8:heAU.TinSofianKaiLogon.name
ltx/en_us_goadedes/me.m01.d11:meMA.Ode3Kathisma2.mode	@ltx/en_us_goadedes/miscellanea:misc.Mode8
ltx/en_us_goadedes/me.m01.d11:meMA.Ode3Kathisma2.text	
ltx/en_us_goadedes/me.m01.d11:meMA.Ode4C11.greekmelody	@ltx/en_us_goadedes/he.h.m2:heHE.ElilythasEkParthenou.greekname
ltx/en_us_goadedes/me.m01.d11:meMA.Ode4C11.incipit	…
ltx/en_us_goadedes/me.m01.d11:meMA.Ode4C11.melody	@ltx/en_us_goadedes/he.h.m2:heHE.ElilythasEkParthenou.name
ltx/en_us_goadedes/me.m01.d11:meMA.Ode4C11.mode	@ltx/en_us_goadedes/miscellanea:misc.Mode2
ltx/en_us_goadedes/me.m01.d11:meMA.Ode4C11.ode	@ltx/en_us_goadedes/miscellanea:misc.Ode4
ltx/en_us_goadedes/me.m01.d11:meMA.Ode4C11.text	
ltx/en_us_goadedes/me.m01.d11:meMA.Ode4C12.incipit	…
ltx/en_us_goadedes/me.m01.d11:meMA.Ode4C12.melody	@ltx/en_us_goadedes/he.h.m2:heHE.ElilythasEkParthenou.name
ltx/en_us_goadedes/me.m01.d11:meMA.Ode4C12.mode	@ltx/en_us_goadedes/miscellanea:misc.Mode2
ltx/en_us_goadedes/me.m01.d11:meMA.Ode4C12.ode	@ltx/en_us_goadedes/miscellanea:misc.Ode4
ltx/en_us_goadedes/me.m01.d11:meMA.Ode4C12.text	
ltx/en_us_goadedes/me.m01.d11:meMA.Ode4C13.incipit	…
ltx/en_us_goadedes/me.m01.d11:meMA.Ode4C13.melody	@ltx/en_us_goadedes/he.h.m2:heHE.ElilythasEkParthenou.name
ltx/en_us_goadedes/me.m01.d11:meMA.Ode4C13.mode	@ltx/en_us_goadedes/miscellanea:misc.Mode2
ltx/en_us_goadedes/me.m01.d11:meMA.Ode4C13.ode	@ltx/en_us_goadedes/miscellanea:misc.Ode4
ltx/en_us_goadedes/me.m01.d11:meMA.Ode4C13.text	
ltx/en_us_goadedes/me.m01.d11:meMA.Ode4C14.incipit	…
ltx/en_us_goadedes/me.m01.d11:meMA.Ode4C14.melody	@ltx/en_us_goadedes/he.h.m2:heHE.ElilythasEkParthenou.name
ltx/en_us_goadedes/me.m01.d11:meMA.Ode4C14.mode	@ltx/en_us_goadedes/miscellanea:misc.Mode2
ltx/en_us_goadedes/me.m01.d11:meMA.Ode4C14.ode	@ltx/en_us_goadedes/miscellanea:misc.Ode4
ltx/en_us_goadedes/me.m01.d11:meMA.Ode4C14.text	
ltx/en_us_goadedes/me.m01.d11:meMA.Ode4C15.incipit	…
ltx/en_us_goadedes/me.m01.d11:meMA.Ode4C15.melody	@ltx/en_us_goadedes/he.h.m2:heHE.ElilythasEkParthenou.name
ltx/en_us_goadedes/me.m01.d11:meMA.Ode4C15.mode	@ltx/en_us_goadedes/miscellanea:misc.Mode2
ltx/en_us_goadedes/me.m01.d11:meMA.Ode4C15.ode	@ltx/en_us_goadedes/miscellanea:misc.Ode4
ltx/en_us_goadedes/me.m01.d11:meMA.Ode4C15.text	
ltx/en_us_goadedes/me.m01.d11:meMA.Ode4C1T.incipit	…
ltx/en_us_goadedes/me.m01.d11:meMA.Ode4C1T.melody	@ltx/en_us_goadedes/he.h.m2:heHE.ElilythasEkParthenou.name
ltx/en_us_goadedes/me.m01.d11:meMA.Ode4C1T.mode	@ltx/en_us_goadedes/miscellanea:misc.Mode2
ltx/en_us_goadedes/me.m01.d11:meMA.Ode4C1T.ode	@ltx/en_us_goadedes/miscellanea:misc.Ode4
ltx/en_us_goadedes/me.m01.d11:meMA.Ode4C1T.text	
ltx/en_us_goadedes/me.m01.d11:meMA.Ode5C11.greekmelody	@ltx/en_us_goadedes/he.h.m2:heHE.MesitisTheou.greekname
ltx/en_us_goadedes/me.m01.d11:meMA.Ode5C11.incipit	…
ltx/en_us_goadedes/me.m01.d11:meMA.Ode5C11.melody	@ltx/en_us_goadedes/he.h.m2:heHE.MesitisTheou.name
ltx/en_us_goadedes/me.m01.d11:meMA.Ode5C11.mode	@ltx/en_us_goadedes/miscellanea:misc.Mode2
ltx/en_us_goadedes/me.m01.d11:meMA.Ode5C11.ode	@ltx/en_us_goadedes/miscellanea:misc.Ode5
ltx/en_us_goadedes/me.m01.d11:meMA.Ode5C11.text	
ltx/en_us_goadedes/me.m01.d11:meMA.Ode5C12.incipit	…
ltx/en_us_goadedes/me.m01.d11:meMA.Ode5C12.melody	@ltx/en_us_goadedes/he.h.m2:heHE.MesitisTheou.name
ltx/en_us_goadedes/me.m01.d11:meMA.Ode5C12.mode	@ltx/en_us_goadedes/miscellanea:misc.Mode2
ltx/en_us_goadedes/me.m01.d11:meMA.Ode5C12.ode	@ltx/en_us_goadedes/miscellanea:misc.Ode5
ltx/en_us_goadedes/me.m01.d11:meMA.Ode5C12.text	
ltx/en_us_goadedes/me.m01.d11:meMA.Ode5C13.incipit	…
ltx/en_us_goadedes/me.m01.d11:meMA.Ode5C13.melody	@ltx/en_us_goadedes/he.h.m2:heHE.MesitisTheou.name
ltx/en_us_goadedes/me.m01.d11:meMA.Ode5C13.mode	@ltx/en_us_goadedes/miscellanea:misc.Mode2
ltx/en_us_goadedes/me.m01.d11:meMA.Ode5C13.ode	@ltx/en_us_goadedes/miscellanea:misc.Ode5
ltx/en_us_goadedes/me.m01.d11:meMA.Ode5C13.text	
ltx/en_us_goadedes/me.m01.d11:meMA.Ode5C1T.incipit	…
ltx/en_us_goadedes/me.m01.d11:meMA.Ode5C1T.melody	@ltx/en_us_goadedes/he.h.m2:heHE.MesitisTheou.name
ltx/en_us_goadedes/me.m01.d11:meMA.Ode5C1T.mode	@ltx/en_us_goadedes/miscellanea:misc.Mode2
ltx/en_us_goadedes/me.m01.d11:meMA.Ode5C1T.ode	@ltx/en_us_goadedes/miscellanea:misc.Ode5
ltx/en_us_goadedes/me.m01.d11:meMA.Ode5C1T.text	
ltx/en_us_goadedes/me.m01.d11:meMA.Ode6C11.greekmelody	@ltx/en_us_goadedes/he.h.m2:heHE.EnAvyssoPtaismaton.greekname
ltx/en_us_goadedes/me.m01.d11:meMA.Ode6C11.incipit	…
ltx/en_us_goadedes/me.m01.d11:meMA.Ode6C11.melody	@ltx/en_us_goadedes/he.h.m2:heHE.EnAvyssoPtaismaton.name
ltx/en_us_goadedes/me.m01.d11:meMA.Ode6C11.mode	@ltx/en_us_goadedes/miscellanea:misc.Mode2
ltx/en_us_goadedes/me.m01.d11:meMA.Ode6C11.ode	@ltx/en_us_goadedes/miscellanea:misc.Ode6
ltx/en_us_goadedes/me.m01.d11:meMA.Ode6C11.text	
ltx/en_us_goadedes/me.m01.d11:meMA.Ode6C12.incipit	…
ltx/en_us_goadedes/me.m01.d11:meMA.Ode6C12.melody	@ltx/en_us_goadedes/he.h.m2:heHE.EnAvyssoPtaismaton.name
ltx/en_us_goadedes/me.m01.d11:meMA.Ode6C12.mode	@ltx/en_us_goadedes/miscellanea:misc.Mode2
ltx/en_us_goadedes/me.m01.d11:meMA.Ode6C12.ode	@ltx/en_us_goadedes/miscellanea:misc.Ode6
ltx/en_us_goadedes/me.m01.d11:meMA.Ode6C12.text	
ltx/en_us_goadedes/me.m01.d11:meMA.Ode6C13.incipit	…
ltx/en_us_goadedes/me.m01.d11:meMA.Ode6C13.melody	@ltx/en_us_goadedes/he.h.m2:heHE.EnAvyssoPtaismaton.name
ltx/en_us_goadedes/me.m01.d11:meMA.Ode6C13.mode	@ltx/en_us_goadedes/miscellanea:misc.Mode2
ltx/en_us_goadedes/me.m01.d11:meMA.Ode6C13.ode	@ltx/en_us_goadedes/miscellanea:misc.Ode6
ltx/en_us_goadedes/me.m01.d11:meMA.Ode6C13.text	
ltx/en_us_goadedes/me.m01.d11:meMA.Ode6C1T.incipit	…
ltx/en_us_goadedes/me.m01.d11:meMA.Ode6C1T.melody	@ltx/en_us_goadedes/he.h.m2:heHE.EnAvyssoPtaismaton.name
ltx/en_us_goadedes/me.m01.d11:meMA.Ode6C1T.mode	@ltx/en_us_goadedes/miscellanea:misc.Mode2
ltx/en_us_goadedes/me.m01.d11:meMA.Ode6C1T.ode	@ltx/en_us_goadedes/miscellanea:misc.Ode6
ltx/en_us_goadedes/me.m01.d11:meMA.Ode6C1T.text	
ltx/en_us_goadedes/me.m01.d11:meMA.Ode7C11.greekmelody	@ltx/en_us_goadedes/he.h.m2:heHE.AntitheonProstagma.greekname
ltx/en_us_goadedes/me.m01.d11:meMA.Ode7C11.incipit	…
ltx/en_us_goadedes/me.m01.d11:meMA.Ode7C11.melody	@ltx/en_us_goadedes/he.h.m2:heHE.AntitheonProstagma.name
ltx/en_us_goadedes/me.m01.d11:meMA.Ode7C11.mode	@ltx/en_us_goadedes/miscellanea:misc.Mode2
ltx/en_us_goadedes/me.m01.d11:meMA.Ode7C11.ode	@ltx/en_us_goadedes/miscellanea:misc.Ode7
ltx/en_us_goadedes/me.m01.d11:meMA.Ode7C11.text	
ltx/en_us_goadedes/me.m01.d11:meMA.Ode7C12.incipit	…
ltx/en_us_goadedes/me.m01.d11:meMA.Ode7C12.melody	@ltx/en_us_goadedes/he.h.m2:heHE.AntitheonProstagma.name
ltx/en_us_goadedes/me.m01.d11:meMA.Ode7C12.mode	@ltx/en_us_goadedes/miscellanea:misc.Mode2
ltx/en_us_goadedes/me.m01.d11:meMA.Ode7C12.ode	@ltx/en_us_goadedes/miscellanea:misc.Ode7
ltx/en_us_goadedes/me.m01.d11:meMA.Ode7C12.text	
ltx/en_us_goadedes/me.m01.d11:meMA.Ode7C13.incipit	…
ltx/en_us_goadedes/me.m01.d11:meMA.Ode7C13.melody	@ltx/en_us_goadedes/he.h.m2:heHE.AntitheonProstagma.name
ltx/en_us_goadedes/me.m01.d11:meMA.Ode7C13.mode	@ltx/en_us_goadedes/miscellanea:misc.Mode2
ltx/en_us_goadedes/me.m01.d11:meMA.Ode7C13.ode	@ltx/en_us_goadedes/miscellanea:misc.Ode7
ltx/en_us_goadedes/me.m01.d11:meMA.Ode7C13.text	
ltx/en_us_goadedes/me.m01.d11:meMA.Ode7C14.incipit	…
ltx/en_us_goadedes/me.m01.d11:meMA.Ode7C14.melody	@ltx/en_us_goadedes/he.h.m2:heHE.AntitheonProstagma.name
ltx/en_us_goadedes/me.m01.d11:meMA.Ode7C14.mode	@ltx/en_us_goadedes/miscellanea:misc.Mode2
ltx/en_us_goadedes/me.m01.d11:meMA.Ode7C14.ode	@ltx/en_us_goadedes/miscellanea:misc.Ode7
ltx/en_us_goadedes/me.m01.d11:meMA.Ode7C14.text	
ltx/en_us_goadedes/me.m01.d11:meMA.Ode7C15.incipit	…
ltx/en_us_goadedes/me.m01.d11:meMA.Ode7C15.melody	@ltx/en_us_goadedes/he.h.m2:heHE.AntitheonProstagma.name
ltx/en_us_goadedes/me.m01.d11:meMA.Ode7C15.mode	@ltx/en_us_goadedes/miscellanea:misc.Mode2
ltx/en_us_goadedes/me.m01.d11:meMA.Ode7C15.ode	@ltx/en_us_goadedes/miscellanea:misc.Ode7
ltx/en_us_goadedes/me.m01.d11:meMA.Ode7C15.text	
ltx/en_us_goadedes/me.m01.d11:meMA.Ode7C1T.incipit	…
ltx/en_us_goadedes/me.m01.d11:meMA.Ode7C1T.melody	@ltx/en_us_goadedes/he.h.m2:heHE.AntitheonProstagma.name
ltx/en_us_goadedes/me.m01.d11:meMA.Ode7C1T.mode	@ltx/en_us_goadedes/miscellanea:misc.Mode2
ltx/en_us_goadedes/me.m01.d11:meMA.Ode7C1T.ode	@ltx/en_us_goadedes/miscellanea:misc.Ode7
ltx/en_us_goadedes/me.m01.d11:meMA.Ode7C1T.text	
ltx/en_us_goadedes/me.m01.d11:meMA.Ode8C11.greekmelody	@ltx/en_us_goadedes/he.h.m2:heHE.KaminosPote.greekname
ltx/en_us_goadedes/me.m01.d11:meMA.Ode8C11.incipit	…
ltx/en_us_goadedes/me.m01.d11:meMA.Ode8C11.melody	@ltx/en_us_goadedes/he.h.m2:heHE.KaminosPote.name
ltx/en_us_goadedes/me.m01.d11:meMA.Ode8C11.mode	@ltx/en_us_goadedes/miscellanea:misc.Mode2
ltx/en_us_goadedes/me.m01.d11:meMA.Ode8C11.ode	@ltx/en_us_goadedes/miscellanea:misc.Ode8
ltx/en_us_goadedes/me.m01.d11:meMA.Ode8C11.text	
ltx/en_us_goadedes/me.m01.d11:meMA.Ode8C12.incipit	…
ltx/en_us_goadedes/me.m01.d11:meMA.Ode8C12.melody	@ltx/en_us_goadedes/he.h.m2:heHE.KaminosPote.name
ltx/en_us_goadedes/me.m01.d11:meMA.Ode8C12.mode	@ltx/en_us_goadedes/miscellanea:misc.Mode2
ltx/en_us_goadedes/me.m01.d11:meMA.Ode8C12.ode	@ltx/en_us_goadedes/miscellanea:misc.Ode8
ltx/en_us_goadedes/me.m01.d11:meMA.Ode8C12.text	
ltx/en_us_goadedes/me.m01.d11:meMA.Ode8C13.incipit	…
ltx/en_us_goadedes/me.m01.d11:meMA.Ode8C13.melody	@ltx/en_us_goadedes/he.h.m2:heHE.KaminosPote.name
ltx/en_us_goadedes/me.m01.d11:meMA.Ode8C13.mode	@ltx/en_us_goadedes/miscellanea:misc.Mode2
ltx/en_us_goadedes/me.m01.d11:meMA.Ode8C13.ode	@ltx/en_us_goadedes/miscellanea:misc.Ode8
ltx/en_us_goadedes/me.m01.d11:meMA.Ode8C13.text	
ltx/en_us_goadedes/me.m01.d11:meMA.Ode8C14.incipit	…
ltx/en_us_goadedes/me.m01.d11:meMA.Ode8C14.melody	@ltx/en_us_goadedes/he.h.m2:heHE.KaminosPote.name
ltx/en_us_goadedes/me.m01.d11:meMA.Ode8C14.mode	@ltx/en_us_goadedes/miscellanea:misc.Mode2
ltx/en_us_goadedes/me.m01.d11:meMA.Ode8C14.ode	@ltx/en_us_goadedes/miscellanea:misc.Ode8
ltx/en_us_goadedes/me.m01.d11:meMA.Ode8C14.text	
ltx/en_us_goadedes/me.m01.d11:meMA.Ode8C15.incipit	…
ltx/en_us_goadedes/me.m01.d11:meMA.Ode8C15.melody	@ltx/en_us_goadedes/he.h.m2:heHE.KaminosPote.name
ltx/en_us_goadedes/me.m01.d11:meMA.Ode8C15.mode	@ltx/en_us_goadedes/miscellanea:misc.Mode2
ltx/en_us_goadedes/me.m01.d11:meMA.Ode8C15.ode	@ltx/en_us_goadedes/miscellanea:misc.Ode8
ltx/en_us_goadedes/me.m01.d11:meMA.Ode8C15.text	
ltx/en_us_goadedes/me.m01.d11:meMA.Ode8C16.incipit	…
ltx/en_us_goadedes/me.m01.d11:meMA.Ode8C16.melody	@ltx/en_us_goadedes/he.h.m2:heHE.KaminosPote.name
ltx/en_us_goadedes/me.m01.d11:meMA.Ode8C16.mode	@ltx/en_us_goadedes/miscellanea:misc.Mode2
ltx/en_us_goadedes/me.m01.d11:meMA.Ode8C16.ode	@ltx/en_us_goadedes/miscellanea:misc.Ode8
ltx/en_us_goadedes/me.m01.d11:meMA.Ode8C16.text	
ltx/en_us_goadedes/me.m01.d11:meMA.Ode8C1T.incipit	…
ltx/en_us_goadedes/me.m01.d11:meMA.Ode8C1T.melody	@ltx/en_us_goadedes/he.h.m2:heHE.KaminosPote.name
ltx/en_us_goadedes/me.m01.d11:meMA.Ode8C1T.mode	@ltx/en_us_goadedes/miscellanea:misc.Mode2
ltx/en_us_goadedes/me.m01.d11:meMA.Ode8C1T.ode	@ltx/en_us_goadedes/miscellanea:misc.Ode8
ltx/en_us_goadedes/me.m01.d11:meMA.Ode8C1T.text	
ltx/en_us_goadedes/me.m01.d11:meMA.Ode9C11.greekmelody	@ltx/en_us_goadedes/he.h.m2:heHE.AnarchouGennitoros.greekname
ltx/en_us_goadedes/me.m01.d11:meMA.Ode9C11.incipit	…
ltx/en_us_goadedes/me.m01.d11:meMA.Ode9C11.melody	@ltx/en_us_goadedes/he.h.m2:heHE.AnarchouGennitoros.name
ltx/en_us_goadedes/me.m01.d11:meMA.Ode9C11.mode	@ltx/en_us_goadedes/miscellanea:misc.Mode2
ltx/en_us_goadedes/me.m01.d11:meMA.Ode9C11.ode	@ltx/en_us_goadedes/miscellanea:misc.Ode9
ltx/en_us_goadedes/me.m01.d11:meMA.Ode9C11.text	
ltx/en_us_goadedes/me.m01.d11:meMA.Ode9C12.incipit	…
ltx/en_us_goadedes/me.m01.d11:meMA.Ode9C12.melody	@ltx/en_us_goadedes/he.h.m2:heHE.AnarchouGennitoros.name
ltx/en_us_goadedes/me.m01.d11:meMA.Ode9C12.mode	@ltx/en_us_goadedes/miscellanea:misc.Mode2
ltx/en_us_goadedes/me.m01.d11:meMA.Ode9C12.ode	@ltx/en_us_goadedes/miscellanea:misc.Ode9
ltx/en_us_goadedes/me.m01.d11:meMA.Ode9C12.text	
ltx/en_us_goadedes/me.m01.d11:meMA.Ode9C13.incipit	…
ltx/en_us_goadedes/me.m01.d11:meMA.Ode9C13.melody	@ltx/en_us_goadedes/he.h.m2:heHE.AnarchouGennitoros.name
ltx/en_us_goadedes/me.m01.d11:meMA.Ode9C13.mode	@ltx/en_us_goadedes/miscellanea:misc.Mode2
ltx/en_us_goadedes/me.m01.d11:meMA.Ode9C13.ode	@ltx/en_us_goadedes/miscellanea:misc.Ode9
ltx/en_us_goadedes/me.m01.d11:meMA.Ode9C13.text	
ltx/en_us_goadedes/me.m01.d11:meMA.Ode9C14.incipit	…
ltx/en_us_goadedes/me.m01.d11:meMA.Ode9C14.melody	@ltx/en_us_goadedes/he.h.m2:heHE.AnarchouGennitoros.name
ltx/en_us_goadedes/me.m01.d11:meMA.Ode9C14.mode	@ltx/en_us_goadedes/miscellanea:misc.Mode2
ltx/en_us_goadedes/me.m01.d11:meMA.Ode9C14.ode	@ltx/en_us_goadedes/miscellanea:misc.Ode9
ltx/en_us_goadedes/me.m01.d11:meMA.Ode9C14.text	
ltx/en_us_goadedes/me.m01.d11:meMA.Ode9C15.incipit	…
ltx/en_us_goadedes/me.m01.d11:meMA.Ode9C15.melody	@ltx/en_us_goadedes/he.h.m2:heHE.AnarchouGennitoros.name
ltx/en_us_goadedes/me.m01.d11:meMA.Ode9C15.mode	@ltx/en_us_goadedes/miscellanea:misc.Mode2
ltx/en_us_goadedes/me.m01.d11:meMA.Ode9C15.ode	@ltx/en_us_goadedes/miscellanea:misc.Ode9
ltx/en_us_goadedes/me.m01.d11:meMA.Ode9C15.text	
ltx/en_us_goadedes/me.m01.d11:meMA.Ode9C1T.incipit	…
ltx/en_us_goadedes/me.m01.d11:meMA.Ode9C1T.melody	@ltx/en_us_goadedes/he.h.m2:heHE.AnarchouGennitoros.name
ltx/en_us_goadedes/me.m01.d11:meMA.Ode9C1T.mode	@ltx/en_us_goadedes/miscellanea:misc.Mode2
ltx/en_us_goadedes/me.m01.d11:meMA.Ode9C1T.ode	@ltx/en_us_goadedes/miscellanea:misc.Ode9
ltx/en_us_goadedes/me.m01.d11:meMA.Ode9C1T.text	
ltx/en_us_goadedes/me.m01.d11:meMA.Oikos1.text	
ltx/en_us_goadedes/me.m01.d11:meMA.Oikos12.text	
ltx/en_us_goadedes/me.m01.d11:meMA.Oikos13.text	
ltx/en_us_goadedes/me.m01.d11:meMA.Oikos14.text	
ltx/en_us_goadedes/me.m01.d11:meMA.Oikos15.text	
ltx/en_us_goadedes/me.m01.d11:meMA.Oikos16.text	
ltx/en_us_goadedes/me.m01.d11:meMA.Oikos17.text	
ltx/en_us_goadedes/me.m01.d11:meMA.Oikos18.text	
ltx/en_us_goadedes/me.m01.d11:meMA.PostGospelBoth.incipit	@ltx/en_us_goadedes/ho.ho03:hoMA.PostGospelTheotokos.incipit
ltx/en_us_goadedes/me.m01.d11:meMA.PostGospelBoth.melody	
ltx/en_us_goadedes/me.m01.d11:meMA.PostGospelBoth.mode	@ltx/en_us_goadedes/miscellanea:misc.Mode2
ltx/en_us_goadedes/me.m01.d11:meMA.PostGospelBoth.text	@ltx/en_us_goadedes/ho.ho03:hoMA.PostGospelTheotokos.text
ltx/en_us_goadedes/me.m01.d11:meMA.PostGospelGlory.incipit	@ltx/en_us_goadedes/ho.ho03:hoMA.PostGospelMonastic.incipit
ltx/en_us_goadedes/me.m01.d11:meMA.PostGospelGlory.melody	
ltx/en_us_goadedes/me.m01.d11:meMA.PostGospelGlory.mode	@ltx/en_us_goadedes/miscellanea:misc.Mode2
ltx/en_us_goadedes/me.m01.d11:meMA.PostGospelGlory.text	@ltx/en_us_goadedes/ho.ho03:hoMA.PostGospelMonastic.text
ltx/en_us_goadedes/me.m01.d11:meMA.PostGospelIdiomelon.incipit	@ltx/en_us_goadedes/me.m01.d15:meVE.AposGlory.incipit
ltx/en_us_goadedes/me.m01.d11:meMA.PostGospelIdiomelon.melody	
ltx/en_us_goadedes/me.m01.d11:meMA.PostGospelIdiomelon.mode	@ltx/en_us_goadedes/miscellanea:misc.Mode6
ltx/en_us_goadedes/me.m01.d11:meMA.PostGospelIdiomelon.text	@ltx/en_us_goadedes/me.m01.d15:meVE.AposGlory.text
ltx/en_us_goadedes/me.m01.d11:meVE.AposBoth.incipit	…
ltx/en_us_goadedes/me.m01.d11:meVE.AposBoth.melody	
ltx/en_us_goadedes/me.m01.d11:meVE.AposBoth.mode	@ltx/en_us_goadedes/miscellanea:misc.Mode8
ltx/en_us_goadedes/me.m01.d11:meVE.AposBoth.poet	@ltx/en_us_goadedes/poets:po.IoannouMonachou
ltx/en_us_goadedes/me.m01.d11:meVE.AposBoth.text	
ltx/en_us_goadedes/me.m01.d11:meVE.AposGlory.incipit	…
ltx/en_us_goadedes/me.m01.d11:meVE.AposGlory.melody	
ltx/en_us_goadedes/me.m01.d11:meVE.AposGlory.mode	@ltx/en_us_goadedes/miscellanea:misc.Mode8
ltx/en_us_goadedes/me.m01.d11:meVE.AposGlory.poet	@ltx/en_us_goadedes/poets:po.Sykeotou
ltx/en_us_goadedes/me.m01.d11:meVE.AposGlory.text	
ltx/en_us_goadedes/me.m01.d11:meVE.Aposticha1.greekmelody	@ltx/en_us_goadedes/he.a.m4:heAU.EdokasSimeiosin.greekname
ltx/en_us_goadedes/me.m01.d11:meVE.Aposticha1.incipit	…
ltx/en_us_goadedes/me.m01.d11:meVE.Aposticha1.melody	@ltx/en_us_goadedes/he.a.m4:heAU.EdokasSimeiosin.name
ltx/en_us_goadedes/me.m01.d11:meVE.Aposticha1.mode	@ltx/en_us_goadedes/miscellanea:misc.Mode4
ltx/en_us_goadedes/me.m01.d11:meVE.Aposticha1.text	
ltx/en_us_goadedes/me.m01.d11:meVE.Aposticha2.incipit	…
ltx/en_us_goadedes/me.m01.d11:meVE.Aposticha2.melody	@ltx/en_us_goadedes/he.a.m4:heAU.EdokasSimeiosin.name
ltx/en_us_goadedes/me.m01.d11:meVE.Aposticha2.mode	@ltx/en_us_goadedes/miscellanea:misc.Mode4
ltx/en_us_goadedes/me.m01.d11:meVE.Aposticha2.text	
ltx/en_us_goadedes/me.m01.d11:meVE.Aposticha3.incipit	…
ltx/en_us_goadedes/me.m01.d11:meVE.Aposticha3.melody	@ltx/en_us_goadedes/he.a.m4:heAU.EdokasSimeiosin.name
ltx/en_us_goadedes/me.m01.d11:meVE.Aposticha3.mode	@ltx/en_us_goadedes/miscellanea:misc.Mode4
ltx/en_us_goadedes/me.m01.d11:meVE.Aposticha3.text	
ltx/en_us_goadedes/me.m01.d11:meVE.GeneralApolytikion1.melody	@ltx/en_us_goadedes/he.ga:heGA.TaisTonDakryonSou.name
ltx/en_us_goadedes/me.m01.d11:meVE.GeneralApolytikion1.mode	@ltx/en_us_goadedes/miscellanea:misc.Mode8
ltx/en_us_goadedes/me.m01.d11:meVE.GeneralApolytikion1.name	
ltx/en_us_goadedes/me.m01.d11:meVE.MM.GeneralApolytikion1.text	@ltx/en_us_goadedes/properties:media.key
ltx/en_us_goadedes/me.m01.d11:meVE.SticBoth.incipit	@ltx/en_us_goadedes/me.m01.d06:meVE.SticGlory.incipit
ltx/en_us_goadedes/me.m01.d11:meVE.SticBoth.melody	
ltx/en_us_goadedes/me.m01.d11:meVE.SticBoth.mode	@ltx/en_us_goadedes/miscellanea:misc.Mode2
ltx/en_us_goadedes/me.m01.d11:meVE.SticBoth.poet	@ltx/en_us_goadedes/poets:po.Vyzantiou
ltx/en_us_goadedes/me.m01.d11:meVE.SticBoth.text	@ltx/en_us_goadedes/me.m01.d06:meVE.SticGlory.text
ltx/en_us_goadedes/me.m01.d11:meVE.SticGlory.incipit	…
ltx/en_us_goadedes/me.m01.d11:meVE.SticGlory.melody	
ltx/en_us_goadedes/me.m01.d11:meVE.SticGlory.mode	@ltx/en_us_goadedes/miscellanea:misc.Mode2
ltx/en_us_goadedes/me.m01.d11:meVE.SticGlory.poet	@ltx/en_us_goadedes/poets:po.Anatoliou
ltx/en_us_goadedes/me.m01.d11:meVE.SticGlory.text	
ltx/en_us_goadedes/me.m01.d11:meVE.Stichera01.greekmelody	@ltx/en_us_goadedes/he.a.m5:heAU.OsiePater.greekname
ltx/en_us_goadedes/me.m01.d11:meVE.Stichera01.incipit	@ltx/en_us_goadedes/he.a.m5:heAU.OsiePater.incipit
ltx/en_us_goadedes/me.m01.d11:meVE.Stichera01.melody	@ltx/en_us_goadedes/he.a.m5:heAU.OsiePater.melody
ltx/en_us_goadedes/me.m01.d11:meVE.Stichera01.mode	@ltx/en_us_goadedes/miscellanea:misc.Mode5
ltx/en_us_goadedes/me.m01.d11:meVE.Stichera01.text	@ltx/en_us_goadedes/he.a.m5:heAU.OsiePater.text
ltx/en_us_goadedes/me.m01.d11:meVE.Stichera02.incipit	…
ltx/en_us_goadedes/me.m01.d11:meVE.Stichera02.melody	@ltx/en_us_goadedes/he.a.m5:heAU.OsiePater.name
ltx/en_us_goadedes/me.m01.d11:meVE.Stichera02.mode	@ltx/en_us_goadedes/miscellanea:misc.Mode5
ltx/en_us_goadedes/me.m01.d11:meVE.Stichera02.text	
ltx/en_us_goadedes/me.m01.d11:meVE.Stichera03.incipit	…
ltx/en_us_goadedes/me.m01.d11:meVE.Stichera03.melody	@ltx/en_us_goadedes/he.a.m5:heAU.OsiePater.name
ltx/en_us_goadedes/me.m01.d11:meVE.Stichera03.mode	@ltx/en_us_goadedes/miscellanea:misc.Mode5
ltx/en_us_goadedes/me.m01.d11:meVE.Stichera03.text	
ltx/en_us_goadedes/me.m01.d11:meVE.Stichera8910.text	@ltx/en_us_goadedes/properties:media.key
