ltx/en_us_goadedes/me.m02.d22:meDA.commemoration.first	
ltx/en_us_goadedes/me.m02.d22:meDA.commemoration.first_name	
ltx/en_us_goadedes/me.m02.d22:meDA.commemoration.first_short	
ltx/en_us_goadedes/me.m02.d22:meDA.commemoration.first_title	@ltx/en_us_goadedes/titles:ti.Martyrs
ltx/en_us_goadedes/me.m02.d22:meDA.commemoration.full	
ltx/en_us_goadedes/me.m02.d22:meDA.commemoration.second_name	
ltx/en_us_goadedes/me.m02.d22:meDA.commemoration.second_title	
ltx/en_us_goadedes/me.m02.d22:meDA.date	
ltx/en_us_goadedes/me.m02.d22:meDA.fordate	
ltx/en_us_goadedes/me.m02.d22:meDA.insert1	
ltx/en_us_goadedes/me.m02.d22:meDA.insert2	
ltx/en_us_goadedes/me.m02.d22:meDA.note	
ltx/en_us_goadedes/me.m02.d22:meDA.pdfcoverdate	
ltx/en_us_goadedes/me.m02.d22:meDA.pdfheaderdate	
ltx/en_us_goadedes/me.m02.d22:meHO.commemorations	
ltx/en_us_goadedes/me.m02.d22:meHO.note1	
ltx/en_us_goadedes/me.m02.d22:meHO.note2	
ltx/en_us_goadedes/me.m02.d22:meHO.number	
ltx/en_us_goadedes/me.m02.d22:meHO.rank	
ltx/en_us_goadedes/me.m02.d22:meLE.commemoration1	
ltx/en_us_goadedes/me.m02.d22:meLE.commemoration2	
ltx/en_us_goadedes/me.m02.d22:meLI.Kontakion1.greekmelody	@ltx/en_us_goadedes/me.m02.d22:meMA.Kontakion1.greekmelody
ltx/en_us_goadedes/me.m02.d22:meLI.Kontakion1.incipit	@ltx/en_us_goadedes/me.m02.d22:meMA.Kontakion1.incipit
ltx/en_us_goadedes/me.m02.d22:meLI.Kontakion1.melody	@ltx/en_us_goadedes/me.m02.d22:meMA.Kontakion1.melody
ltx/en_us_goadedes/me.m02.d22:meLI.Kontakion1.mode	@ltx/en_us_goadedes/me.m02.d22:meMA.Kontakion1.mode
ltx/en_us_goadedes/me.m02.d22:meLI.Kontakion1.text	@ltx/en_us_goadedes/me.m02.d22:meMA.Kontakion1.text
ltx/en_us_goadedes/me.m02.d22:meLI.Megalynarion.text	
ltx/en_us_goadedes/me.m02.d22:meMA.C1.title	@ltx/en_us_goadedes/titles:ti.CanonMartyrs
ltx/en_us_goadedes/me.m02.d22:meMA.C1.verse	@ltx/en_us_goadedes/prayers:pr.verse_SaintsM.text
ltx/en_us_goadedes/me.m02.d22:meMA.Kontakion1.greekmelody	@ltx/en_us_goadedes/he.a.m4:heAU.EpefanisSimeron.greekname
ltx/en_us_goadedes/me.m02.d22:meMA.Kontakion1.incipit	…
ltx/en_us_goadedes/me.m02.d22:meMA.Kontakion1.melody	@ltx/en_us_goadedes/he.a.m4:heAU.EpefanisSimeron.name
ltx/en_us_goadedes/me.m02.d22:meMA.Kontakion1.mode	@ltx/en_us_goadedes/miscellanea:misc.Mode4
ltx/en_us_goadedes/me.m02.d22:meMA.Kontakion1.text	
ltx/en_us_goadedes/me.m02.d22:meMA.Ode1C11.greekmelody	@ltx/en_us_goadedes/he.h.m8:heHE.ArmatilatinFarao.greekname
ltx/en_us_goadedes/me.m02.d22:meMA.Ode1C11.incipit	…
ltx/en_us_goadedes/me.m02.d22:meMA.Ode1C11.melody	@ltx/en_us_goadedes/he.h.m8:heHE.ArmatilatinFarao.name
ltx/en_us_goadedes/me.m02.d22:meMA.Ode1C11.mode	@ltx/en_us_goadedes/miscellanea:misc.Mode8
ltx/en_us_goadedes/me.m02.d22:meMA.Ode1C11.ode	@ltx/en_us_goadedes/miscellanea:misc.Ode1
ltx/en_us_goadedes/me.m02.d22:meMA.Ode1C11.text	
ltx/en_us_goadedes/me.m02.d22:meMA.Ode1C12.incipit	…
ltx/en_us_goadedes/me.m02.d22:meMA.Ode1C12.melody	@ltx/en_us_goadedes/he.h.m8:heHE.ArmatilatinFarao.name
ltx/en_us_goadedes/me.m02.d22:meMA.Ode1C12.mode	@ltx/en_us_goadedes/miscellanea:misc.Mode8
ltx/en_us_goadedes/me.m02.d22:meMA.Ode1C12.ode	@ltx/en_us_goadedes/miscellanea:misc.Ode1
ltx/en_us_goadedes/me.m02.d22:meMA.Ode1C12.text	
ltx/en_us_goadedes/me.m02.d22:meMA.Ode1C13.incipit	…
ltx/en_us_goadedes/me.m02.d22:meMA.Ode1C13.melody	@ltx/en_us_goadedes/he.h.m8:heHE.ArmatilatinFarao.name
ltx/en_us_goadedes/me.m02.d22:meMA.Ode1C13.mode	@ltx/en_us_goadedes/miscellanea:misc.Mode8
ltx/en_us_goadedes/me.m02.d22:meMA.Ode1C13.ode	@ltx/en_us_goadedes/miscellanea:misc.Ode1
ltx/en_us_goadedes/me.m02.d22:meMA.Ode1C13.text	
ltx/en_us_goadedes/me.m02.d22:meMA.Ode1C1H.greekmelody	@ltx/en_us_goadedes/he.h.m8:heHE.ArmatilatinFarao.greekname
ltx/en_us_goadedes/me.m02.d22:meMA.Ode1C1H.incipit	@ltx/en_us_goadedes/he.h.m8:heHE.ArmatilatinFarao.incipit
ltx/en_us_goadedes/me.m02.d22:meMA.Ode1C1H.melody	@ltx/en_us_goadedes/he.h.m8:heHE.ArmatilatinFarao.melody
ltx/en_us_goadedes/me.m02.d22:meMA.Ode1C1H.mode	@ltx/en_us_goadedes/miscellanea:misc.Mode8
ltx/en_us_goadedes/me.m02.d22:meMA.Ode1C1H.ode	@ltx/en_us_goadedes/miscellanea:misc.Ode1
ltx/en_us_goadedes/me.m02.d22:meMA.Ode1C1H.text	@ltx/en_us_goadedes/he.h.m8:heHE.ArmatilatinFarao.text
ltx/en_us_goadedes/me.m02.d22:meMA.Ode1C1T.incipit	…
ltx/en_us_goadedes/me.m02.d22:meMA.Ode1C1T.melody	@ltx/en_us_goadedes/he.h.m8:heHE.ArmatilatinFarao.name
ltx/en_us_goadedes/me.m02.d22:meMA.Ode1C1T.mode	@ltx/en_us_goadedes/miscellanea:misc.Mode8
ltx/en_us_goadedes/me.m02.d22:meMA.Ode1C1T.ode	@ltx/en_us_goadedes/miscellanea:misc.Ode1
ltx/en_us_goadedes/me.m02.d22:meMA.Ode1C1T.text	
ltx/en_us_goadedes/me.m02.d22:meMA.Ode3C11.greekmelody	@ltx/en_us_goadedes/he.h.m8:heHE.OuraniasApsidos.greekname
ltx/en_us_goadedes/me.m02.d22:meMA.Ode3C11.incipit	…
ltx/en_us_goadedes/me.m02.d22:meMA.Ode3C11.melody	@ltx/en_us_goadedes/he.h.m8:heHE.OuraniasApsidos.name
ltx/en_us_goadedes/me.m02.d22:meMA.Ode3C11.mode	@ltx/en_us_goadedes/miscellanea:misc.Mode8
ltx/en_us_goadedes/me.m02.d22:meMA.Ode3C11.ode	@ltx/en_us_goadedes/miscellanea:misc.Ode3
ltx/en_us_goadedes/me.m02.d22:meMA.Ode3C11.text	
ltx/en_us_goadedes/me.m02.d22:meMA.Ode3C12.incipit	…
ltx/en_us_goadedes/me.m02.d22:meMA.Ode3C12.melody	@ltx/en_us_goadedes/he.h.m8:heHE.OuraniasApsidos.name
ltx/en_us_goadedes/me.m02.d22:meMA.Ode3C12.mode	@ltx/en_us_goadedes/miscellanea:misc.Mode8
ltx/en_us_goadedes/me.m02.d22:meMA.Ode3C12.ode	@ltx/en_us_goadedes/miscellanea:misc.Ode3
ltx/en_us_goadedes/me.m02.d22:meMA.Ode3C12.text	
ltx/en_us_goadedes/me.m02.d22:meMA.Ode3C13.incipit	…
ltx/en_us_goadedes/me.m02.d22:meMA.Ode3C13.melody	@ltx/en_us_goadedes/he.h.m8:heHE.OuraniasApsidos.name
ltx/en_us_goadedes/me.m02.d22:meMA.Ode3C13.mode	@ltx/en_us_goadedes/miscellanea:misc.Mode8
ltx/en_us_goadedes/me.m02.d22:meMA.Ode3C13.ode	@ltx/en_us_goadedes/miscellanea:misc.Ode3
ltx/en_us_goadedes/me.m02.d22:meMA.Ode3C13.text	
ltx/en_us_goadedes/me.m02.d22:meMA.Ode3C1H.greekmelody	@ltx/en_us_goadedes/he.h.m8:heHE.OuraniasApsidos.greekname
ltx/en_us_goadedes/me.m02.d22:meMA.Ode3C1H.incipit	@ltx/en_us_goadedes/he.h.m8:heHE.OuraniasApsidos.incipit
ltx/en_us_goadedes/me.m02.d22:meMA.Ode3C1H.melody	@ltx/en_us_goadedes/he.h.m8:heHE.OuraniasApsidos.melody
ltx/en_us_goadedes/me.m02.d22:meMA.Ode3C1H.mode	@ltx/en_us_goadedes/miscellanea:misc.Mode8
ltx/en_us_goadedes/me.m02.d22:meMA.Ode3C1H.ode	@ltx/en_us_goadedes/miscellanea:misc.Ode3
ltx/en_us_goadedes/me.m02.d22:meMA.Ode3C1H.text	@ltx/en_us_goadedes/he.h.m8:heHE.OuraniasApsidos.text
ltx/en_us_goadedes/me.m02.d22:meMA.Ode3C1T.incipit	…
ltx/en_us_goadedes/me.m02.d22:meMA.Ode3C1T.melody	@ltx/en_us_goadedes/he.h.m8:heHE.OuraniasApsidos.name
ltx/en_us_goadedes/me.m02.d22:meMA.Ode3C1T.mode	@ltx/en_us_goadedes/miscellanea:misc.Mode8
ltx/en_us_goadedes/me.m02.d22:meMA.Ode3C1T.ode	@ltx/en_us_goadedes/miscellanea:misc.Ode3
ltx/en_us_goadedes/me.m02.d22:meMA.Ode3C1T.text	
ltx/en_us_goadedes/me.m02.d22:meMA.Ode3Kathisma1.greekmelody	@ltx/en_us_goadedes/he.a.m1:heAU.TonTafonSouSotir.greekname
ltx/en_us_goadedes/me.m02.d22:meMA.Ode3Kathisma1.incipit	…
ltx/en_us_goadedes/me.m02.d22:meMA.Ode3Kathisma1.melody	@ltx/en_us_goadedes/he.a.m1:heAU.TonTafonSouSotir.name
ltx/en_us_goadedes/me.m02.d22:meMA.Ode3Kathisma1.mode	@ltx/en_us_goadedes/miscellanea:misc.Mode1
ltx/en_us_goadedes/me.m02.d22:meMA.Ode3Kathisma1.text	
ltx/en_us_goadedes/me.m02.d22:meMA.Ode3KathismaSt.incipit	When you beheld…
ltx/en_us_goadedes/me.m02.d22:meMA.Ode3KathismaSt.melody	@ltx/en_us_goadedes/he.a.m1:heAU.TonTafonSouSotir.name
ltx/en_us_goadedes/me.m02.d22:meMA.Ode3KathismaSt.mode	@ltx/en_us_goadedes/miscellanea:misc.Mode1
ltx/en_us_goadedes/me.m02.d22:meMA.Ode3KathismaSt.text	When you beheld your Son’s crucifixion, O Lady, * a sword then truly pierced through your heart, blameless Virgin, * as Symeon said it would, O all-holy, immaculate, * blessed Mary. Now, O Theotokos, we sinners * turn to you for help. And you impart to the faithful * your mighty encouragement.
ltx/en_us_goadedes/me.m02.d22:meMA.Ode3KathismaT.incipit	…
ltx/en_us_goadedes/me.m02.d22:meMA.Ode3KathismaT.melody	@ltx/en_us_goadedes/he.a.m1:heAU.TonTafonSouSotir.name
ltx/en_us_goadedes/me.m02.d22:meMA.Ode3KathismaT.mode	@ltx/en_us_goadedes/miscellanea:misc.Mode1
ltx/en_us_goadedes/me.m02.d22:meMA.Ode3KathismaT.text	
ltx/en_us_goadedes/me.m02.d22:meMA.Ode4C11.greekmelody	@ltx/en_us_goadedes/he.h.m8:heHE.SyMouIschys.greekname
ltx/en_us_goadedes/me.m02.d22:meMA.Ode4C11.incipit	…
ltx/en_us_goadedes/me.m02.d22:meMA.Ode4C11.melody	@ltx/en_us_goadedes/he.h.m8:heHE.SyMouIschys.name
ltx/en_us_goadedes/me.m02.d22:meMA.Ode4C11.mode	@ltx/en_us_goadedes/miscellanea:misc.Mode8
ltx/en_us_goadedes/me.m02.d22:meMA.Ode4C11.ode	@ltx/en_us_goadedes/miscellanea:misc.Ode4
ltx/en_us_goadedes/me.m02.d22:meMA.Ode4C11.text	
ltx/en_us_goadedes/me.m02.d22:meMA.Ode4C12.incipit	…
ltx/en_us_goadedes/me.m02.d22:meMA.Ode4C12.melody	@ltx/en_us_goadedes/he.h.m8:heHE.SyMouIschys.name
ltx/en_us_goadedes/me.m02.d22:meMA.Ode4C12.mode	@ltx/en_us_goadedes/miscellanea:misc.Mode8
ltx/en_us_goadedes/me.m02.d22:meMA.Ode4C12.ode	@ltx/en_us_goadedes/miscellanea:misc.Ode4
ltx/en_us_goadedes/me.m02.d22:meMA.Ode4C12.text	
ltx/en_us_goadedes/me.m02.d22:meMA.Ode4C13.incipit	…
ltx/en_us_goadedes/me.m02.d22:meMA.Ode4C13.melody	@ltx/en_us_goadedes/he.h.m8:heHE.SyMouIschys.name
ltx/en_us_goadedes/me.m02.d22:meMA.Ode4C13.mode	@ltx/en_us_goadedes/miscellanea:misc.Mode8
ltx/en_us_goadedes/me.m02.d22:meMA.Ode4C13.ode	@ltx/en_us_goadedes/miscellanea:misc.Ode4
ltx/en_us_goadedes/me.m02.d22:meMA.Ode4C13.text	
ltx/en_us_goadedes/me.m02.d22:meMA.Ode4C1H.greekmelody	@ltx/en_us_goadedes/he.h.m8:heHE.SyMouIschys.greekname
ltx/en_us_goadedes/me.m02.d22:meMA.Ode4C1H.incipit	@ltx/en_us_goadedes/he.h.m8:heHE.SyMouIschys.incipit
ltx/en_us_goadedes/me.m02.d22:meMA.Ode4C1H.melody	@ltx/en_us_goadedes/he.h.m8:heHE.SyMouIschys.melody
ltx/en_us_goadedes/me.m02.d22:meMA.Ode4C1H.mode	@ltx/en_us_goadedes/miscellanea:misc.Mode8
ltx/en_us_goadedes/me.m02.d22:meMA.Ode4C1H.ode	@ltx/en_us_goadedes/miscellanea:misc.Ode4
ltx/en_us_goadedes/me.m02.d22:meMA.Ode4C1H.text	@ltx/en_us_goadedes/he.h.m8:heHE.SyMouIschys.text
ltx/en_us_goadedes/me.m02.d22:meMA.Ode4C1T.incipit	…
ltx/en_us_goadedes/me.m02.d22:meMA.Ode4C1T.melody	@ltx/en_us_goadedes/he.h.m8:heHE.SyMouIschys.name
ltx/en_us_goadedes/me.m02.d22:meMA.Ode4C1T.mode	@ltx/en_us_goadedes/miscellanea:misc.Mode8
ltx/en_us_goadedes/me.m02.d22:meMA.Ode4C1T.ode	@ltx/en_us_goadedes/miscellanea:misc.Ode4
ltx/en_us_goadedes/me.m02.d22:meMA.Ode4C1T.text	
ltx/en_us_goadedes/me.m02.d22:meMA.Ode5C11.greekmelody	@ltx/en_us_goadedes/he.h.m8:heHE.InaTiMeAposo.greekname
ltx/en_us_goadedes/me.m02.d22:meMA.Ode5C11.incipit	…
ltx/en_us_goadedes/me.m02.d22:meMA.Ode5C11.melody	@ltx/en_us_goadedes/he.h.m8:heHE.InaTiMeAposo.name
ltx/en_us_goadedes/me.m02.d22:meMA.Ode5C11.mode	@ltx/en_us_goadedes/miscellanea:misc.Mode8
ltx/en_us_goadedes/me.m02.d22:meMA.Ode5C11.ode	@ltx/en_us_goadedes/miscellanea:misc.Ode5
ltx/en_us_goadedes/me.m02.d22:meMA.Ode5C11.text	
ltx/en_us_goadedes/me.m02.d22:meMA.Ode5C12.incipit	…
ltx/en_us_goadedes/me.m02.d22:meMA.Ode5C12.melody	@ltx/en_us_goadedes/he.h.m8:heHE.InaTiMeAposo.name
ltx/en_us_goadedes/me.m02.d22:meMA.Ode5C12.mode	@ltx/en_us_goadedes/miscellanea:misc.Mode8
ltx/en_us_goadedes/me.m02.d22:meMA.Ode5C12.ode	@ltx/en_us_goadedes/miscellanea:misc.Ode5
ltx/en_us_goadedes/me.m02.d22:meMA.Ode5C12.text	
ltx/en_us_goadedes/me.m02.d22:meMA.Ode5C13.incipit	…
ltx/en_us_goadedes/me.m02.d22:meMA.Ode5C13.melody	@ltx/en_us_goadedes/he.h.m8:heHE.InaTiMeAposo.name
ltx/en_us_goadedes/me.m02.d22:meMA.Ode5C13.mode	@ltx/en_us_goadedes/miscellanea:misc.Mode8
ltx/en_us_goadedes/me.m02.d22:meMA.Ode5C13.ode	@ltx/en_us_goadedes/miscellanea:misc.Ode5
ltx/en_us_goadedes/me.m02.d22:meMA.Ode5C13.text	
ltx/en_us_goadedes/me.m02.d22:meMA.Ode5C1H.greekmelody	@ltx/en_us_goadedes/he.h.m8:heHE.InaTiMeAposo.greekname
ltx/en_us_goadedes/me.m02.d22:meMA.Ode5C1H.incipit	@ltx/en_us_goadedes/he.h.m8:heHE.InaTiMeAposo.incipit
ltx/en_us_goadedes/me.m02.d22:meMA.Ode5C1H.melody	@ltx/en_us_goadedes/he.h.m8:heHE.InaTiMeAposo.melody
ltx/en_us_goadedes/me.m02.d22:meMA.Ode5C1H.mode	@ltx/en_us_goadedes/miscellanea:misc.Mode8
ltx/en_us_goadedes/me.m02.d22:meMA.Ode5C1H.ode	@ltx/en_us_goadedes/miscellanea:misc.Ode5
ltx/en_us_goadedes/me.m02.d22:meMA.Ode5C1H.text	@ltx/en_us_goadedes/he.h.m8:heHE.InaTiMeAposo.text
ltx/en_us_goadedes/me.m02.d22:meMA.Ode5C1T.incipit	…
ltx/en_us_goadedes/me.m02.d22:meMA.Ode5C1T.melody	@ltx/en_us_goadedes/he.h.m8:heHE.InaTiMeAposo.name
ltx/en_us_goadedes/me.m02.d22:meMA.Ode5C1T.mode	@ltx/en_us_goadedes/miscellanea:misc.Mode8
ltx/en_us_goadedes/me.m02.d22:meMA.Ode5C1T.ode	@ltx/en_us_goadedes/miscellanea:misc.Ode5
ltx/en_us_goadedes/me.m02.d22:meMA.Ode5C1T.text	
ltx/en_us_goadedes/me.m02.d22:meMA.Ode6C11.greekmelody	@ltx/en_us_goadedes/he.h.m8:heHE.IlasthitiMoiSotir.greekname
ltx/en_us_goadedes/me.m02.d22:meMA.Ode6C11.incipit	…
ltx/en_us_goadedes/me.m02.d22:meMA.Ode6C11.melody	@ltx/en_us_goadedes/he.h.m8:heHE.IlasthitiMoiSotir.name
ltx/en_us_goadedes/me.m02.d22:meMA.Ode6C11.mode	@ltx/en_us_goadedes/miscellanea:misc.Mode8
ltx/en_us_goadedes/me.m02.d22:meMA.Ode6C11.ode	@ltx/en_us_goadedes/miscellanea:misc.Ode6
ltx/en_us_goadedes/me.m02.d22:meMA.Ode6C11.text	
ltx/en_us_goadedes/me.m02.d22:meMA.Ode6C12.incipit	…
ltx/en_us_goadedes/me.m02.d22:meMA.Ode6C12.melody	@ltx/en_us_goadedes/he.h.m8:heHE.IlasthitiMoiSotir.name
ltx/en_us_goadedes/me.m02.d22:meMA.Ode6C12.mode	@ltx/en_us_goadedes/miscellanea:misc.Mode8
ltx/en_us_goadedes/me.m02.d22:meMA.Ode6C12.ode	@ltx/en_us_goadedes/miscellanea:misc.Ode6
ltx/en_us_goadedes/me.m02.d22:meMA.Ode6C12.text	
ltx/en_us_goadedes/me.m02.d22:meMA.Ode6C13.incipit	…
ltx/en_us_goadedes/me.m02.d22:meMA.Ode6C13.melody	@ltx/en_us_goadedes/he.h.m8:heHE.IlasthitiMoiSotir.name
ltx/en_us_goadedes/me.m02.d22:meMA.Ode6C13.mode	@ltx/en_us_goadedes/miscellanea:misc.Mode8
ltx/en_us_goadedes/me.m02.d22:meMA.Ode6C13.ode	@ltx/en_us_goadedes/miscellanea:misc.Ode6
ltx/en_us_goadedes/me.m02.d22:meMA.Ode6C13.text	
ltx/en_us_goadedes/me.m02.d22:meMA.Ode6C1H.greekmelody	@ltx/en_us_goadedes/he.h.m8:heHE.IlasthitiMoiSotir.greekname
ltx/en_us_goadedes/me.m02.d22:meMA.Ode6C1H.incipit	@ltx/en_us_goadedes/he.h.m8:heHE.IlasthitiMoiSotir.incipit
ltx/en_us_goadedes/me.m02.d22:meMA.Ode6C1H.melody	@ltx/en_us_goadedes/he.h.m8:heHE.IlasthitiMoiSotir.melody
ltx/en_us_goadedes/me.m02.d22:meMA.Ode6C1H.mode	@ltx/en_us_goadedes/miscellanea:misc.Mode8
ltx/en_us_goadedes/me.m02.d22:meMA.Ode6C1H.ode	@ltx/en_us_goadedes/miscellanea:misc.Ode6
ltx/en_us_goadedes/me.m02.d22:meMA.Ode6C1H.text	@ltx/en_us_goadedes/he.h.m8:heHE.IlasthitiMoiSotir.text
ltx/en_us_goadedes/me.m02.d22:meMA.Ode6C1T.incipit	…
ltx/en_us_goadedes/me.m02.d22:meMA.Ode6C1T.melody	@ltx/en_us_goadedes/he.h.m8:heHE.IlasthitiMoiSotir.name
ltx/en_us_goadedes/me.m02.d22:meMA.Ode6C1T.mode	@ltx/en_us_goadedes/miscellanea:misc.Mode8
ltx/en_us_goadedes/me.m02.d22:meMA.Ode6C1T.ode	@ltx/en_us_goadedes/miscellanea:misc.Ode6
ltx/en_us_goadedes/me.m02.d22:meMA.Ode6C1T.text	
ltx/en_us_goadedes/me.m02.d22:meMA.Ode7C11.greekmelody	@ltx/en_us_goadedes/he.h.m8:heHE.TheouSynkatavasin.greekname
ltx/en_us_goadedes/me.m02.d22:meMA.Ode7C11.incipit	…
ltx/en_us_goadedes/me.m02.d22:meMA.Ode7C11.melody	@ltx/en_us_goadedes/he.h.m8:heHE.TheouSynkatavasin.name
ltx/en_us_goadedes/me.m02.d22:meMA.Ode7C11.mode	@ltx/en_us_goadedes/miscellanea:misc.Mode8
ltx/en_us_goadedes/me.m02.d22:meMA.Ode7C11.ode	@ltx/en_us_goadedes/miscellanea:misc.Ode7
ltx/en_us_goadedes/me.m02.d22:meMA.Ode7C11.text	
ltx/en_us_goadedes/me.m02.d22:meMA.Ode7C12.incipit	…
ltx/en_us_goadedes/me.m02.d22:meMA.Ode7C12.melody	@ltx/en_us_goadedes/he.h.m8:heHE.TheouSynkatavasin.name
ltx/en_us_goadedes/me.m02.d22:meMA.Ode7C12.mode	@ltx/en_us_goadedes/miscellanea:misc.Mode8
ltx/en_us_goadedes/me.m02.d22:meMA.Ode7C12.ode	@ltx/en_us_goadedes/miscellanea:misc.Ode7
ltx/en_us_goadedes/me.m02.d22:meMA.Ode7C12.text	
ltx/en_us_goadedes/me.m02.d22:meMA.Ode7C13.incipit	…
ltx/en_us_goadedes/me.m02.d22:meMA.Ode7C13.melody	@ltx/en_us_goadedes/he.h.m8:heHE.TheouSynkatavasin.name
ltx/en_us_goadedes/me.m02.d22:meMA.Ode7C13.mode	@ltx/en_us_goadedes/miscellanea:misc.Mode8
ltx/en_us_goadedes/me.m02.d22:meMA.Ode7C13.ode	@ltx/en_us_goadedes/miscellanea:misc.Ode7
ltx/en_us_goadedes/me.m02.d22:meMA.Ode7C13.text	
ltx/en_us_goadedes/me.m02.d22:meMA.Ode7C1H.greekmelody	@ltx/en_us_goadedes/he.h.m8:heHE.TheouSynkatavasin.greekname
ltx/en_us_goadedes/me.m02.d22:meMA.Ode7C1H.incipit	@ltx/en_us_goadedes/he.h.m8:heHE.TheouSynkatavasin.incipit
ltx/en_us_goadedes/me.m02.d22:meMA.Ode7C1H.melody	@ltx/en_us_goadedes/he.h.m8:heHE.TheouSynkatavasin.melody
ltx/en_us_goadedes/me.m02.d22:meMA.Ode7C1H.mode	@ltx/en_us_goadedes/miscellanea:misc.Mode8
ltx/en_us_goadedes/me.m02.d22:meMA.Ode7C1H.ode	@ltx/en_us_goadedes/miscellanea:misc.Ode7
ltx/en_us_goadedes/me.m02.d22:meMA.Ode7C1H.text	@ltx/en_us_goadedes/he.h.m8:heHE.TheouSynkatavasin.text
ltx/en_us_goadedes/me.m02.d22:meMA.Ode7C1T.incipit	…
ltx/en_us_goadedes/me.m02.d22:meMA.Ode7C1T.melody	@ltx/en_us_goadedes/he.h.m8:heHE.TheouSynkatavasin.name
ltx/en_us_goadedes/me.m02.d22:meMA.Ode7C1T.mode	@ltx/en_us_goadedes/miscellanea:misc.Mode8
ltx/en_us_goadedes/me.m02.d22:meMA.Ode7C1T.ode	@ltx/en_us_goadedes/miscellanea:misc.Ode7
ltx/en_us_goadedes/me.m02.d22:meMA.Ode7C1T.text	
ltx/en_us_goadedes/me.m02.d22:meMA.Ode8C11.greekmelody	@ltx/en_us_goadedes/he.h.m8:heHE.EptaplasiosKaminon.greekname
ltx/en_us_goadedes/me.m02.d22:meMA.Ode8C11.incipit	…
ltx/en_us_goadedes/me.m02.d22:meMA.Ode8C11.melody	@ltx/en_us_goadedes/he.h.m8:heHE.EptaplasiosKaminon.name
ltx/en_us_goadedes/me.m02.d22:meMA.Ode8C11.mode	@ltx/en_us_goadedes/miscellanea:misc.Mode8
ltx/en_us_goadedes/me.m02.d22:meMA.Ode8C11.ode	@ltx/en_us_goadedes/miscellanea:misc.Ode8
ltx/en_us_goadedes/me.m02.d22:meMA.Ode8C11.text	
ltx/en_us_goadedes/me.m02.d22:meMA.Ode8C12.incipit	…
ltx/en_us_goadedes/me.m02.d22:meMA.Ode8C12.melody	@ltx/en_us_goadedes/he.h.m8:heHE.EptaplasiosKaminon.name
ltx/en_us_goadedes/me.m02.d22:meMA.Ode8C12.mode	@ltx/en_us_goadedes/miscellanea:misc.Mode8
ltx/en_us_goadedes/me.m02.d22:meMA.Ode8C12.ode	@ltx/en_us_goadedes/miscellanea:misc.Ode8
ltx/en_us_goadedes/me.m02.d22:meMA.Ode8C12.text	
ltx/en_us_goadedes/me.m02.d22:meMA.Ode8C13.incipit	…
ltx/en_us_goadedes/me.m02.d22:meMA.Ode8C13.melody	@ltx/en_us_goadedes/he.h.m8:heHE.EptaplasiosKaminon.name
ltx/en_us_goadedes/me.m02.d22:meMA.Ode8C13.mode	@ltx/en_us_goadedes/miscellanea:misc.Mode8
ltx/en_us_goadedes/me.m02.d22:meMA.Ode8C13.ode	@ltx/en_us_goadedes/miscellanea:misc.Ode8
ltx/en_us_goadedes/me.m02.d22:meMA.Ode8C13.text	
ltx/en_us_goadedes/me.m02.d22:meMA.Ode8C1H.greekmelody	@ltx/en_us_goadedes/he.h.m8:heHE.EptaplasiosKaminon.greekname
ltx/en_us_goadedes/me.m02.d22:meMA.Ode8C1H.incipit	@ltx/en_us_goadedes/he.h.m8:heHE.EptaplasiosKaminon.incipit
ltx/en_us_goadedes/me.m02.d22:meMA.Ode8C1H.melody	@ltx/en_us_goadedes/he.h.m8:heHE.EptaplasiosKaminon.melody
ltx/en_us_goadedes/me.m02.d22:meMA.Ode8C1H.mode	@ltx/en_us_goadedes/miscellanea:misc.Mode8
ltx/en_us_goadedes/me.m02.d22:meMA.Ode8C1H.ode	@ltx/en_us_goadedes/miscellanea:misc.Ode8
ltx/en_us_goadedes/me.m02.d22:meMA.Ode8C1H.text	@ltx/en_us_goadedes/he.h.m8:heHE.EptaplasiosKaminon.text
ltx/en_us_goadedes/me.m02.d22:meMA.Ode8C1T.incipit	…
ltx/en_us_goadedes/me.m02.d22:meMA.Ode8C1T.melody	@ltx/en_us_goadedes/he.h.m8:heHE.EptaplasiosKaminon.name
ltx/en_us_goadedes/me.m02.d22:meMA.Ode8C1T.mode	@ltx/en_us_goadedes/miscellanea:misc.Mode8
ltx/en_us_goadedes/me.m02.d22:meMA.Ode8C1T.ode	@ltx/en_us_goadedes/miscellanea:misc.Ode8
ltx/en_us_goadedes/me.m02.d22:meMA.Ode8C1T.text	
ltx/en_us_goadedes/me.m02.d22:meMA.Ode9C11.greekmelody	@ltx/en_us_goadedes/he.h.m8:heHE.ExestiEpiTouto.greekname
ltx/en_us_goadedes/me.m02.d22:meMA.Ode9C11.incipit	…
ltx/en_us_goadedes/me.m02.d22:meMA.Ode9C11.melody	@ltx/en_us_goadedes/he.h.m8:heHE.ExestiEpiTouto.name
ltx/en_us_goadedes/me.m02.d22:meMA.Ode9C11.mode	@ltx/en_us_goadedes/miscellanea:misc.Mode8
ltx/en_us_goadedes/me.m02.d22:meMA.Ode9C11.ode	@ltx/en_us_goadedes/miscellanea:misc.Ode9
ltx/en_us_goadedes/me.m02.d22:meMA.Ode9C11.text	
ltx/en_us_goadedes/me.m02.d22:meMA.Ode9C12.incipit	…
ltx/en_us_goadedes/me.m02.d22:meMA.Ode9C12.melody	@ltx/en_us_goadedes/he.h.m8:heHE.ExestiEpiTouto.name
ltx/en_us_goadedes/me.m02.d22:meMA.Ode9C12.mode	@ltx/en_us_goadedes/miscellanea:misc.Mode8
ltx/en_us_goadedes/me.m02.d22:meMA.Ode9C12.ode	@ltx/en_us_goadedes/miscellanea:misc.Ode9
ltx/en_us_goadedes/me.m02.d22:meMA.Ode9C12.text	
ltx/en_us_goadedes/me.m02.d22:meMA.Ode9C13.incipit	…
ltx/en_us_goadedes/me.m02.d22:meMA.Ode9C13.melody	@ltx/en_us_goadedes/he.h.m8:heHE.ExestiEpiTouto.name
ltx/en_us_goadedes/me.m02.d22:meMA.Ode9C13.mode	@ltx/en_us_goadedes/miscellanea:misc.Mode8
ltx/en_us_goadedes/me.m02.d22:meMA.Ode9C13.ode	@ltx/en_us_goadedes/miscellanea:misc.Ode9
ltx/en_us_goadedes/me.m02.d22:meMA.Ode9C13.text	
ltx/en_us_goadedes/me.m02.d22:meMA.Ode9C1H.greekmelody	@ltx/en_us_goadedes/he.h.m8:heHE.ExestiEpiTouto.greekname
ltx/en_us_goadedes/me.m02.d22:meMA.Ode9C1H.incipit	@ltx/en_us_goadedes/he.h.m8:heHE.ExestiEpiTouto.incipit
ltx/en_us_goadedes/me.m02.d22:meMA.Ode9C1H.melody	@ltx/en_us_goadedes/he.h.m8:heHE.ExestiEpiTouto.melody
ltx/en_us_goadedes/me.m02.d22:meMA.Ode9C1H.mode	@ltx/en_us_goadedes/miscellanea:misc.Mode8
ltx/en_us_goadedes/me.m02.d22:meMA.Ode9C1H.ode	@ltx/en_us_goadedes/miscellanea:misc.Ode9
ltx/en_us_goadedes/me.m02.d22:meMA.Ode9C1H.text	@ltx/en_us_goadedes/he.h.m8:heHE.ExestiEpiTouto.text
ltx/en_us_goadedes/me.m02.d22:meMA.Ode9C1T.incipit	…
ltx/en_us_goadedes/me.m02.d22:meMA.Ode9C1T.melody	@ltx/en_us_goadedes/he.h.m8:heHE.ExestiEpiTouto.name
ltx/en_us_goadedes/me.m02.d22:meMA.Ode9C1T.mode	@ltx/en_us_goadedes/miscellanea:misc.Mode8
ltx/en_us_goadedes/me.m02.d22:meMA.Ode9C1T.ode	@ltx/en_us_goadedes/miscellanea:misc.Ode9
ltx/en_us_goadedes/me.m02.d22:meMA.Ode9C1T.text	
ltx/en_us_goadedes/me.m02.d22:meMA.Oikos1.text	
ltx/en_us_goadedes/me.m02.d22:meVE.Apolytikion1ger.greekmelody	@ltx/en_us_goadedes/he.a.m1:heAU.TonTafonSouSotir.greekname
ltx/en_us_goadedes/me.m02.d22:meVE.Apolytikion1ger.incipit	…
ltx/en_us_goadedes/me.m02.d22:meVE.Apolytikion1ger.melody	@ltx/en_us_goadedes/he.a.m1:heAU.TonTafonSouSotir.name
ltx/en_us_goadedes/me.m02.d22:meVE.Apolytikion1ger.mode	@ltx/en_us_goadedes/miscellanea:misc.Mode1
ltx/en_us_goadedes/me.m02.d22:meVE.Apolytikion1ger.poet	@ltx/en_us_goadedes/poets:po.Gerasimou
ltx/en_us_goadedes/me.m02.d22:meVE.Apolytikion1ger.text	
ltx/en_us_goadedes/me.m02.d22:meVE.SticStavrotheotokion.greekmelody	@ltx/en_us_goadedes/he.a.m4:heAU.OExYpsistouKlitheis.greekname
ltx/en_us_goadedes/me.m02.d22:meVE.SticStavrotheotokion.incipit	@ltx/en_us_goadedes/oc.m4.d6:ocVE.AposTheotokion.incipit
ltx/en_us_goadedes/me.m02.d22:meVE.SticStavrotheotokion.melody	@ltx/en_us_goadedes/he.a.m4:heAU.OExYpsistouKlitheis.name
ltx/en_us_goadedes/me.m02.d22:meVE.SticStavrotheotokion.mode	@ltx/en_us_goadedes/miscellanea:misc.Mode4
ltx/en_us_goadedes/me.m02.d22:meVE.SticStavrotheotokion.text	@ltx/en_us_goadedes/oc.m4.d6:ocVE.AposTheotokion.text
ltx/en_us_goadedes/me.m02.d22:meVE.SticTheotokion.greekmelody	@ltx/en_us_goadedes/he.a.m4:heAU.OExYpsistouKlitheis.greekname
ltx/en_us_goadedes/me.m02.d22:meVE.SticTheotokion.incipit	…
ltx/en_us_goadedes/me.m02.d22:meVE.SticTheotokion.melody	@ltx/en_us_goadedes/he.a.m4:heAU.OExYpsistouKlitheis.name
ltx/en_us_goadedes/me.m02.d22:meVE.SticTheotokion.mode	@ltx/en_us_goadedes/miscellanea:misc.Mode4
ltx/en_us_goadedes/me.m02.d22:meVE.SticTheotokion.text	
ltx/en_us_goadedes/me.m02.d22:meVE.Stichera01.greekmelody	@ltx/en_us_goadedes/he.a.m4:heAU.OExYpsistouKlitheis.greekname
ltx/en_us_goadedes/me.m02.d22:meVE.Stichera01.incipit	…
ltx/en_us_goadedes/me.m02.d22:meVE.Stichera01.melody	@ltx/en_us_goadedes/he.a.m4:heAU.OExYpsistouKlitheis.name
ltx/en_us_goadedes/me.m02.d22:meVE.Stichera01.mode	@ltx/en_us_goadedes/miscellanea:misc.Mode4
ltx/en_us_goadedes/me.m02.d22:meVE.Stichera01.text	
ltx/en_us_goadedes/me.m02.d22:meVE.Stichera02.incipit	…
ltx/en_us_goadedes/me.m02.d22:meVE.Stichera02.melody	@ltx/en_us_goadedes/he.a.m4:heAU.OExYpsistouKlitheis.name
ltx/en_us_goadedes/me.m02.d22:meVE.Stichera02.mode	@ltx/en_us_goadedes/miscellanea:misc.Mode4
ltx/en_us_goadedes/me.m02.d22:meVE.Stichera02.text	
ltx/en_us_goadedes/me.m02.d22:meVE.Stichera03.incipit	…
ltx/en_us_goadedes/me.m02.d22:meVE.Stichera03.melody	@ltx/en_us_goadedes/he.a.m4:heAU.OExYpsistouKlitheis.name
ltx/en_us_goadedes/me.m02.d22:meVE.Stichera03.mode	@ltx/en_us_goadedes/miscellanea:misc.Mode4
ltx/en_us_goadedes/me.m02.d22:meVE.Stichera03.text	
