ltx/en_us_goadedes/ho.ho23:R01	
ltx/en_us_goadedes/ho.ho23:R02	
ltx/en_us_goadedes/ho.ho23:R03	
ltx/en_us_goadedes/ho.ho23:R04	
ltx/en_us_goadedes/ho.ho23:R05	
ltx/en_us_goadedes/ho.ho23:R17	
ltx/en_us_goadedes/ho.ho23:R18	Then, the Megalynarion of the local church.
ltx/en_us_goadedes/ho.ho23:R19	Then, the following:
ltx/en_us_goadedes/ho.ho23:R24	
ltx/en_us_goadedes/ho.ho23:hoCA.Apolytikion1.greekmelody	@ltx/en_us_goadedes/he.a.m4:heAU.OYpsotheisEnToStavro.greekname
ltx/en_us_goadedes/ho.ho23:hoCA.Apolytikion1.incipit	@ltx/en_us_goadedes/oc.m4.d3:ocVE.ApolTheotokionVM.incipit
ltx/en_us_goadedes/ho.ho23:hoCA.Apolytikion1.melody	@ltx/en_us_goadedes/he.a.m4:heAU.OYpsotheisEnToStavro.name
ltx/en_us_goadedes/ho.ho23:hoCA.Apolytikion1.mode	@ltx/en_us_goadedes/miscellanea:misc.Mode4
ltx/en_us_goadedes/ho.ho23:hoCA.Apolytikion1.text	@ltx/en_us_goadedes/oc.m4.d3:ocVE.ApolTheotokionVM.text
ltx/en_us_goadedes/ho.ho23:hoCA.Apolytikion2.incipit	…
ltx/en_us_goadedes/ho.ho23:hoCA.Apolytikion2.melody	@ltx/en_us_goadedes/he.a.m4:heAU.OYpsotheisEnToStavro.name
ltx/en_us_goadedes/ho.ho23:hoCA.Apolytikion2.mode	@ltx/en_us_goadedes/miscellanea:misc.Mode4
ltx/en_us_goadedes/ho.ho23:hoCA.Apolytikion2.text	We the unworthy shall not ever be silent, * O Theotokos, from proclaiming your powers. * For were you not concerned to intercede for us, * who would have delivered us * from such manifold dangers, * and who else would up to now * have preserved us in freedom? * O Lady, we shall not depart from you, * for you ever save your servants * from evils of every kind.
ltx/en_us_goadedes/ho.ho23:hoCA.Exaposteilarion1.incipit	@ltx/en_us_goadedes/me.m08.d15:meMA.Exaposteilarion1.incipit
ltx/en_us_goadedes/ho.ho23:hoCA.Exaposteilarion1.melody	@ltx/en_us_goadedes/he.a.m3:heAU.OOuranonToisAstrois.name
ltx/en_us_goadedes/ho.ho23:hoCA.Exaposteilarion1.mode	@ltx/en_us_goadedes/miscellanea:misc.Mode3
ltx/en_us_goadedes/ho.ho23:hoCA.Exaposteilarion1.text	@ltx/en_us_goadedes/me.m08.d15:meMA.Exaposteilarion1.text
ltx/en_us_goadedes/ho.ho23:hoCA.Exaposteilarion2.incipit	@ltx/en_us_goadedes/da.d7:daMA.ExapTheotokion1.incipit
ltx/en_us_goadedes/ho.ho23:hoCA.Exaposteilarion2.melody	@ltx/en_us_goadedes/he.a.m3:heAU.OOuranonToisAstrois.name
ltx/en_us_goadedes/ho.ho23:hoCA.Exaposteilarion2.mode	@ltx/en_us_goadedes/miscellanea:misc.Mode3
ltx/en_us_goadedes/ho.ho23:hoCA.Exaposteilarion2.text	@ltx/en_us_goadedes/da.d7:daMA.ExapTheotokion1.text
ltx/en_us_goadedes/ho.ho23:hoCA.Exaposteilarion3.incipit	@ltx/en_us_goadedes/da.d3:daMA.ExapTheotokion1.incipit
ltx/en_us_goadedes/ho.ho23:hoCA.Exaposteilarion3.melody	@ltx/en_us_goadedes/he.a.m3:heAU.OOuranonToisAstrois.name
ltx/en_us_goadedes/ho.ho23:hoCA.Exaposteilarion3.mode	@ltx/en_us_goadedes/miscellanea:misc.Mode3
ltx/en_us_goadedes/ho.ho23:hoCA.Exaposteilarion3.text	@ltx/en_us_goadedes/da.d3:daMA.ExapTheotokion1.text
ltx/en_us_goadedes/ho.ho23:hoCA.Exaposteilarion4.incipit	O Tower fashioned of pure…
ltx/en_us_goadedes/ho.ho23:hoCA.Exaposteilarion4.melody	@ltx/en_us_goadedes/he.a.m3:heAU.OOuranonToisAstrois.name
ltx/en_us_goadedes/ho.ho23:hoCA.Exaposteilarion4.mode	@ltx/en_us_goadedes/miscellanea:misc.Mode3
ltx/en_us_goadedes/ho.ho23:hoCA.Exaposteilarion4.text	O Tower fashioned of pure gold, * and City which has a twelvefold wall, * O Throne aglitter with sunshine, * magnificent Chair of the King, * incomprehensible wonder, * how did you nurse the Master?
ltx/en_us_goadedes/ho.ho23:hoCA.Kathisma11.greekmelody	@ltx/en_us_goadedes/he.a.m2:heAU.TaAnoZiton.greekname
ltx/en_us_goadedes/ho.ho23:hoCA.Kathisma11.incipit	…
ltx/en_us_goadedes/ho.ho23:hoCA.Kathisma11.melody	@ltx/en_us_goadedes/he.a.m2:heAU.TaAnoZiton.name
ltx/en_us_goadedes/ho.ho23:hoCA.Kathisma11.mode	@ltx/en_us_goadedes/miscellanea:misc.Mode2
ltx/en_us_goadedes/ho.ho23:hoCA.Kathisma11.text	
ltx/en_us_goadedes/ho.ho23:hoCA.Kontakion.incipit	@ltx/en_us_goadedes/ho.ho07:hoTY.Key0408.incipit
ltx/en_us_goadedes/ho.ho23:hoCA.Kontakion.melody	
ltx/en_us_goadedes/ho.ho23:hoCA.Kontakion.mode	@ltx/en_us_goadedes/miscellanea:misc.Mode2
ltx/en_us_goadedes/ho.ho23:hoCA.Kontakion.text	@ltx/en_us_goadedes/ho.ho07:hoTY.Key0408.text
ltx/en_us_goadedes/ho.ho23:hoCA.Meg00.incipit	…
ltx/en_us_goadedes/ho.ho23:hoCA.Meg00.text	@ltx/en_us_goadedes/ho.ho03:hoMA.Ode9.Meg00.text
ltx/en_us_goadedes/ho.ho23:hoCA.Meg01.incipit	@ltx/en_us_goadedes/he.h.m6:heHE.TinTimioteran.incipit
ltx/en_us_goadedes/ho.ho23:hoCA.Meg01.melody	@ltx/en_us_goadedes/he.h.m6:heHE.TinTimioteran.melody
ltx/en_us_goadedes/ho.ho23:hoCA.Meg01.text	@ltx/en_us_goadedes/he.h.m6:heHE.TinTimioteran.text
ltx/en_us_goadedes/ho.ho23:hoCA.Meg02.incipit	…
ltx/en_us_goadedes/ho.ho23:hoCA.Meg02.melody	@ltx/en_us_goadedes/he.h.m6:heHE.TinTimioteran.name
ltx/en_us_goadedes/ho.ho23:hoCA.Meg02.text	
ltx/en_us_goadedes/ho.ho23:hoCA.Meg03.incipit	…
ltx/en_us_goadedes/ho.ho23:hoCA.Meg03.melody	@ltx/en_us_goadedes/he.h.m6:heHE.TinTimioteran.name
ltx/en_us_goadedes/ho.ho23:hoCA.Meg03.text	
ltx/en_us_goadedes/ho.ho23:hoCA.Meg04.incipit	…
ltx/en_us_goadedes/ho.ho23:hoCA.Meg04.melody	@ltx/en_us_goadedes/he.h.m6:heHE.TinTimioteran.name
ltx/en_us_goadedes/ho.ho23:hoCA.Meg04.text	
ltx/en_us_goadedes/ho.ho23:hoCA.Meg05.incipit	…
ltx/en_us_goadedes/ho.ho23:hoCA.Meg05.melody	@ltx/en_us_goadedes/he.h.m6:heHE.TinTimioteran.name
ltx/en_us_goadedes/ho.ho23:hoCA.Meg05.text	
ltx/en_us_goadedes/ho.ho23:hoCA.Meg06.incipit	…
ltx/en_us_goadedes/ho.ho23:hoCA.Meg06.melody	@ltx/en_us_goadedes/he.h.m6:heHE.TinTimioteran.name
ltx/en_us_goadedes/ho.ho23:hoCA.Meg06.text	
ltx/en_us_goadedes/ho.ho23:hoCA.Meg0F.incipit	Join the Theotokos…
ltx/en_us_goadedes/ho.ho23:hoCA.Meg0F.melody	@ltx/en_us_goadedes/he.h.m6:heHE.TinTimioteran.name
ltx/en_us_goadedes/ho.ho23:hoCA.Meg0F.text	Join the Theotokos, all you arrays * of angelic powers, honored Forerunner of the Lord, * holy Twelve Apostles * and all the Saints together, * and pray for our salvation, and intercede for us.
ltx/en_us_goadedes/ho.ho23:hoCA.MegLocal.text	Text (in right frame)
ltx/en_us_goadedes/ho.ho23:hoCA.MegTrans1.incipit	…
ltx/en_us_goadedes/ho.ho23:hoCA.MegTrans1.melody	@ltx/en_us_goadedes/he.h.m6:heHE.TinTimioteran.name
ltx/en_us_goadedes/ho.ho23:hoCA.MegTrans1.text	@ltx/en_us_goadedes/me.m08.d06:meLI.Megalynarion.text
ltx/en_us_goadedes/ho.ho23:hoCA.Ode11.greekmelody	@ltx/en_us_goadedes/he.h.m8:heHE.YgranDiodefsas.greekname
ltx/en_us_goadedes/ho.ho23:hoCA.Ode11.incipit	…
ltx/en_us_goadedes/ho.ho23:hoCA.Ode11.melody	@ltx/en_us_goadedes/he.h.m8:heHE.YgranDiodefsas.name
ltx/en_us_goadedes/ho.ho23:hoCA.Ode11.mode	@ltx/en_us_goadedes/miscellanea:misc.Mode8
ltx/en_us_goadedes/ho.ho23:hoCA.Ode11.ode	@ltx/en_us_goadedes/miscellanea:misc.Ode1
ltx/en_us_goadedes/ho.ho23:hoCA.Ode11.text	
ltx/en_us_goadedes/ho.ho23:hoCA.Ode12.incipit	…
ltx/en_us_goadedes/ho.ho23:hoCA.Ode12.melody	@ltx/en_us_goadedes/he.h.m8:heHE.YgranDiodefsas.name
ltx/en_us_goadedes/ho.ho23:hoCA.Ode12.mode	@ltx/en_us_goadedes/miscellanea:misc.Mode8
ltx/en_us_goadedes/ho.ho23:hoCA.Ode12.ode	@ltx/en_us_goadedes/miscellanea:misc.Ode1
ltx/en_us_goadedes/ho.ho23:hoCA.Ode12.text	
ltx/en_us_goadedes/ho.ho23:hoCA.Ode13.incipit	…
ltx/en_us_goadedes/ho.ho23:hoCA.Ode13.melody	@ltx/en_us_goadedes/he.h.m8:heHE.YgranDiodefsas.name
ltx/en_us_goadedes/ho.ho23:hoCA.Ode13.mode	@ltx/en_us_goadedes/miscellanea:misc.Mode8
ltx/en_us_goadedes/ho.ho23:hoCA.Ode13.ode	@ltx/en_us_goadedes/miscellanea:misc.Ode1
ltx/en_us_goadedes/ho.ho23:hoCA.Ode13.text	
ltx/en_us_goadedes/ho.ho23:hoCA.Ode14.incipit	…
ltx/en_us_goadedes/ho.ho23:hoCA.Ode14.melody	@ltx/en_us_goadedes/he.h.m8:heHE.YgranDiodefsas.name
ltx/en_us_goadedes/ho.ho23:hoCA.Ode14.mode	@ltx/en_us_goadedes/miscellanea:misc.Mode8
ltx/en_us_goadedes/ho.ho23:hoCA.Ode14.ode	@ltx/en_us_goadedes/miscellanea:misc.Ode1
ltx/en_us_goadedes/ho.ho23:hoCA.Ode14.text	
ltx/en_us_goadedes/ho.ho23:hoCA.Ode1H.greekmelody	@ltx/en_us_goadedes/he.h.m8:heHE.YgranDiodefsas.greekname
ltx/en_us_goadedes/ho.ho23:hoCA.Ode1H.incipit	@ltx/en_us_goadedes/he.h.m8:heHE.YgranDiodefsas.incipit
ltx/en_us_goadedes/ho.ho23:hoCA.Ode1H.melody	@ltx/en_us_goadedes/he.h.m8:heHE.YgranDiodefsas.melody
ltx/en_us_goadedes/ho.ho23:hoCA.Ode1H.mode	@ltx/en_us_goadedes/miscellanea:misc.Mode8
ltx/en_us_goadedes/ho.ho23:hoCA.Ode1H.ode	@ltx/en_us_goadedes/miscellanea:misc.Ode1
ltx/en_us_goadedes/ho.ho23:hoCA.Ode1H.text	@ltx/en_us_goadedes/he.h.m8:heHE.YgranDiodefsas.text
ltx/en_us_goadedes/ho.ho23:hoCA.Ode31.greekmelody	@ltx/en_us_goadedes/he.h.m8:heHE.OuraniasApsidos.greekname
ltx/en_us_goadedes/ho.ho23:hoCA.Ode31.incipit	…
ltx/en_us_goadedes/ho.ho23:hoCA.Ode31.melody	@ltx/en_us_goadedes/he.h.m8:heHE.OuraniasApsidos.name
ltx/en_us_goadedes/ho.ho23:hoCA.Ode31.mode	@ltx/en_us_goadedes/miscellanea:misc.Mode8
ltx/en_us_goadedes/ho.ho23:hoCA.Ode31.ode	@ltx/en_us_goadedes/miscellanea:misc.Ode3
ltx/en_us_goadedes/ho.ho23:hoCA.Ode31.text	
ltx/en_us_goadedes/ho.ho23:hoCA.Ode32.incipit	…
ltx/en_us_goadedes/ho.ho23:hoCA.Ode32.melody	@ltx/en_us_goadedes/he.h.m8:heHE.OuraniasApsidos.name
ltx/en_us_goadedes/ho.ho23:hoCA.Ode32.mode	@ltx/en_us_goadedes/miscellanea:misc.Mode8
ltx/en_us_goadedes/ho.ho23:hoCA.Ode32.ode	@ltx/en_us_goadedes/miscellanea:misc.Ode3
ltx/en_us_goadedes/ho.ho23:hoCA.Ode32.text	
ltx/en_us_goadedes/ho.ho23:hoCA.Ode33.incipit	…
ltx/en_us_goadedes/ho.ho23:hoCA.Ode33.melody	@ltx/en_us_goadedes/he.h.m8:heHE.OuraniasApsidos.name
ltx/en_us_goadedes/ho.ho23:hoCA.Ode33.mode	@ltx/en_us_goadedes/miscellanea:misc.Mode8
ltx/en_us_goadedes/ho.ho23:hoCA.Ode33.ode	@ltx/en_us_goadedes/miscellanea:misc.Ode3
ltx/en_us_goadedes/ho.ho23:hoCA.Ode33.text	
ltx/en_us_goadedes/ho.ho23:hoCA.Ode34.incipit	…
ltx/en_us_goadedes/ho.ho23:hoCA.Ode34.melody	@ltx/en_us_goadedes/he.h.m8:heHE.OuraniasApsidos.name
ltx/en_us_goadedes/ho.ho23:hoCA.Ode34.mode	@ltx/en_us_goadedes/miscellanea:misc.Mode8
ltx/en_us_goadedes/ho.ho23:hoCA.Ode34.ode	@ltx/en_us_goadedes/miscellanea:misc.Ode3
ltx/en_us_goadedes/ho.ho23:hoCA.Ode34.text	
ltx/en_us_goadedes/ho.ho23:hoCA.Ode3H.greekmelody	@ltx/en_us_goadedes/he.h.m8:heHE.OuraniasApsidos.greekname
ltx/en_us_goadedes/ho.ho23:hoCA.Ode3H.incipit	@ltx/en_us_goadedes/he.h.m8:heHE.OuraniasApsidos.incipit
ltx/en_us_goadedes/ho.ho23:hoCA.Ode3H.melody	@ltx/en_us_goadedes/he.h.m8:heHE.OuraniasApsidos.melody
ltx/en_us_goadedes/ho.ho23:hoCA.Ode3H.mode	@ltx/en_us_goadedes/miscellanea:misc.Mode8
ltx/en_us_goadedes/ho.ho23:hoCA.Ode3H.ode	@ltx/en_us_goadedes/miscellanea:misc.Ode3
ltx/en_us_goadedes/ho.ho23:hoCA.Ode3H.text	@ltx/en_us_goadedes/he.h.m8:heHE.OuraniasApsidos.text
ltx/en_us_goadedes/ho.ho23:hoCA.Ode41.greekmelody	@ltx/en_us_goadedes/he.h.m8:heHE.EisakikoaKyrie.greekname
ltx/en_us_goadedes/ho.ho23:hoCA.Ode41.incipit	…
ltx/en_us_goadedes/ho.ho23:hoCA.Ode41.melody	@ltx/en_us_goadedes/he.h.m8:heHE.EisakikoaKyrie.name
ltx/en_us_goadedes/ho.ho23:hoCA.Ode41.mode	@ltx/en_us_goadedes/miscellanea:misc.Mode8
ltx/en_us_goadedes/ho.ho23:hoCA.Ode41.ode	@ltx/en_us_goadedes/miscellanea:misc.Ode4
ltx/en_us_goadedes/ho.ho23:hoCA.Ode41.text	
ltx/en_us_goadedes/ho.ho23:hoCA.Ode42.incipit	…
ltx/en_us_goadedes/ho.ho23:hoCA.Ode42.melody	@ltx/en_us_goadedes/he.h.m8:heHE.EisakikoaKyrie.name
ltx/en_us_goadedes/ho.ho23:hoCA.Ode42.mode	@ltx/en_us_goadedes/miscellanea:misc.Mode8
ltx/en_us_goadedes/ho.ho23:hoCA.Ode42.ode	@ltx/en_us_goadedes/miscellanea:misc.Ode4
ltx/en_us_goadedes/ho.ho23:hoCA.Ode42.text	
ltx/en_us_goadedes/ho.ho23:hoCA.Ode43.incipit	…
ltx/en_us_goadedes/ho.ho23:hoCA.Ode43.melody	@ltx/en_us_goadedes/he.h.m8:heHE.EisakikoaKyrie.name
ltx/en_us_goadedes/ho.ho23:hoCA.Ode43.mode	@ltx/en_us_goadedes/miscellanea:misc.Mode8
ltx/en_us_goadedes/ho.ho23:hoCA.Ode43.ode	@ltx/en_us_goadedes/miscellanea:misc.Ode4
ltx/en_us_goadedes/ho.ho23:hoCA.Ode43.text	
ltx/en_us_goadedes/ho.ho23:hoCA.Ode44.incipit	…
ltx/en_us_goadedes/ho.ho23:hoCA.Ode44.melody	@ltx/en_us_goadedes/he.h.m8:heHE.EisakikoaKyrie.name
ltx/en_us_goadedes/ho.ho23:hoCA.Ode44.mode	@ltx/en_us_goadedes/miscellanea:misc.Mode8
ltx/en_us_goadedes/ho.ho23:hoCA.Ode44.ode	@ltx/en_us_goadedes/miscellanea:misc.Ode4
ltx/en_us_goadedes/ho.ho23:hoCA.Ode44.text	
ltx/en_us_goadedes/ho.ho23:hoCA.Ode4H.greekmelody	@ltx/en_us_goadedes/he.h.m8:heHE.EisakikoaKyrie.greekname
ltx/en_us_goadedes/ho.ho23:hoCA.Ode4H.incipit	@ltx/en_us_goadedes/he.h.m8:heHE.EisakikoaKyrie.incipit
ltx/en_us_goadedes/ho.ho23:hoCA.Ode4H.melody	@ltx/en_us_goadedes/he.h.m8:heHE.EisakikoaKyrie.melody
ltx/en_us_goadedes/ho.ho23:hoCA.Ode4H.mode	@ltx/en_us_goadedes/miscellanea:misc.Mode8
ltx/en_us_goadedes/ho.ho23:hoCA.Ode4H.ode	@ltx/en_us_goadedes/miscellanea:misc.Ode4
ltx/en_us_goadedes/ho.ho23:hoCA.Ode4H.text	@ltx/en_us_goadedes/he.h.m8:heHE.EisakikoaKyrie.text
ltx/en_us_goadedes/ho.ho23:hoCA.Ode51.greekmelody	@ltx/en_us_goadedes/he.h.m8:heHE.FotisonImas.greekname
ltx/en_us_goadedes/ho.ho23:hoCA.Ode51.incipit	…
ltx/en_us_goadedes/ho.ho23:hoCA.Ode51.melody	@ltx/en_us_goadedes/he.h.m8:heHE.FotisonImas.name
ltx/en_us_goadedes/ho.ho23:hoCA.Ode51.mode	@ltx/en_us_goadedes/miscellanea:misc.Mode8
ltx/en_us_goadedes/ho.ho23:hoCA.Ode51.ode	@ltx/en_us_goadedes/miscellanea:misc.Ode5
ltx/en_us_goadedes/ho.ho23:hoCA.Ode51.text	
ltx/en_us_goadedes/ho.ho23:hoCA.Ode52.incipit	…
ltx/en_us_goadedes/ho.ho23:hoCA.Ode52.melody	@ltx/en_us_goadedes/he.h.m8:heHE.FotisonImas.name
ltx/en_us_goadedes/ho.ho23:hoCA.Ode52.mode	@ltx/en_us_goadedes/miscellanea:misc.Mode8
ltx/en_us_goadedes/ho.ho23:hoCA.Ode52.ode	@ltx/en_us_goadedes/miscellanea:misc.Ode5
ltx/en_us_goadedes/ho.ho23:hoCA.Ode52.text	
ltx/en_us_goadedes/ho.ho23:hoCA.Ode53.incipit	…
ltx/en_us_goadedes/ho.ho23:hoCA.Ode53.melody	@ltx/en_us_goadedes/he.h.m8:heHE.FotisonImas.name
ltx/en_us_goadedes/ho.ho23:hoCA.Ode53.mode	@ltx/en_us_goadedes/miscellanea:misc.Mode8
ltx/en_us_goadedes/ho.ho23:hoCA.Ode53.ode	@ltx/en_us_goadedes/miscellanea:misc.Ode5
ltx/en_us_goadedes/ho.ho23:hoCA.Ode53.text	
ltx/en_us_goadedes/ho.ho23:hoCA.Ode54.incipit	…
ltx/en_us_goadedes/ho.ho23:hoCA.Ode54.melody	@ltx/en_us_goadedes/he.h.m8:heHE.FotisonImas.name
ltx/en_us_goadedes/ho.ho23:hoCA.Ode54.mode	@ltx/en_us_goadedes/miscellanea:misc.Mode8
ltx/en_us_goadedes/ho.ho23:hoCA.Ode54.ode	@ltx/en_us_goadedes/miscellanea:misc.Ode5
ltx/en_us_goadedes/ho.ho23:hoCA.Ode54.text	
ltx/en_us_goadedes/ho.ho23:hoCA.Ode5H.greekmelody	@ltx/en_us_goadedes/he.h.m8:heHE.FotisonImas.greekname
ltx/en_us_goadedes/ho.ho23:hoCA.Ode5H.incipit	@ltx/en_us_goadedes/he.h.m8:heHE.FotisonImas.incipit
ltx/en_us_goadedes/ho.ho23:hoCA.Ode5H.melody	@ltx/en_us_goadedes/he.h.m8:heHE.FotisonImas.melody
ltx/en_us_goadedes/ho.ho23:hoCA.Ode5H.mode	@ltx/en_us_goadedes/miscellanea:misc.Mode8
ltx/en_us_goadedes/ho.ho23:hoCA.Ode5H.ode	@ltx/en_us_goadedes/miscellanea:misc.Ode5
ltx/en_us_goadedes/ho.ho23:hoCA.Ode5H.text	@ltx/en_us_goadedes/he.h.m8:heHE.FotisonImas.text
ltx/en_us_goadedes/ho.ho23:hoCA.Ode61.greekmelody	@ltx/en_us_goadedes/he.h.m8:heHE.TinDeisinEkcheo.greekname
ltx/en_us_goadedes/ho.ho23:hoCA.Ode61.incipit	…
ltx/en_us_goadedes/ho.ho23:hoCA.Ode61.melody	@ltx/en_us_goadedes/he.h.m8:heHE.TinDeisinEkcheo.name
ltx/en_us_goadedes/ho.ho23:hoCA.Ode61.mode	@ltx/en_us_goadedes/miscellanea:misc.Mode8
ltx/en_us_goadedes/ho.ho23:hoCA.Ode61.ode	@ltx/en_us_goadedes/miscellanea:misc.Ode6
ltx/en_us_goadedes/ho.ho23:hoCA.Ode61.text	
ltx/en_us_goadedes/ho.ho23:hoCA.Ode62.incipit	…
ltx/en_us_goadedes/ho.ho23:hoCA.Ode62.melody	@ltx/en_us_goadedes/he.h.m8:heHE.TinDeisinEkcheo.name
ltx/en_us_goadedes/ho.ho23:hoCA.Ode62.mode	@ltx/en_us_goadedes/miscellanea:misc.Mode8
ltx/en_us_goadedes/ho.ho23:hoCA.Ode62.ode	@ltx/en_us_goadedes/miscellanea:misc.Ode6
ltx/en_us_goadedes/ho.ho23:hoCA.Ode62.text	
ltx/en_us_goadedes/ho.ho23:hoCA.Ode63.incipit	…
ltx/en_us_goadedes/ho.ho23:hoCA.Ode63.melody	@ltx/en_us_goadedes/he.h.m8:heHE.TinDeisinEkcheo.name
ltx/en_us_goadedes/ho.ho23:hoCA.Ode63.mode	@ltx/en_us_goadedes/miscellanea:misc.Mode8
ltx/en_us_goadedes/ho.ho23:hoCA.Ode63.ode	@ltx/en_us_goadedes/miscellanea:misc.Ode6
ltx/en_us_goadedes/ho.ho23:hoCA.Ode63.text	
ltx/en_us_goadedes/ho.ho23:hoCA.Ode64.incipit	…
ltx/en_us_goadedes/ho.ho23:hoCA.Ode64.melody	@ltx/en_us_goadedes/he.h.m8:heHE.TinDeisinEkcheo.name
ltx/en_us_goadedes/ho.ho23:hoCA.Ode64.mode	@ltx/en_us_goadedes/miscellanea:misc.Mode8
ltx/en_us_goadedes/ho.ho23:hoCA.Ode64.ode	@ltx/en_us_goadedes/miscellanea:misc.Ode6
ltx/en_us_goadedes/ho.ho23:hoCA.Ode64.text	
ltx/en_us_goadedes/ho.ho23:hoCA.Ode6H.greekmelody	@ltx/en_us_goadedes/he.h.m8:heHE.TinDeisinEkcheo.greekname
ltx/en_us_goadedes/ho.ho23:hoCA.Ode6H.incipit	@ltx/en_us_goadedes/he.h.m8:heHE.TinDeisinEkcheo.incipit
ltx/en_us_goadedes/ho.ho23:hoCA.Ode6H.melody	@ltx/en_us_goadedes/he.h.m8:heHE.TinDeisinEkcheo.melody
ltx/en_us_goadedes/ho.ho23:hoCA.Ode6H.mode	@ltx/en_us_goadedes/miscellanea:misc.Mode8
ltx/en_us_goadedes/ho.ho23:hoCA.Ode6H.ode	@ltx/en_us_goadedes/miscellanea:misc.Ode6
ltx/en_us_goadedes/ho.ho23:hoCA.Ode6H.text	@ltx/en_us_goadedes/he.h.m8:heHE.TinDeisinEkcheo.text
ltx/en_us_goadedes/ho.ho23:hoCA.Ode71.greekmelody	@ltx/en_us_goadedes/he.h.m8:heHE.OiEkTisIoudaias.greekname
ltx/en_us_goadedes/ho.ho23:hoCA.Ode71.incipit	…
ltx/en_us_goadedes/ho.ho23:hoCA.Ode71.melody	@ltx/en_us_goadedes/he.h.m8:heHE.OiEkTisIoudaias.name
ltx/en_us_goadedes/ho.ho23:hoCA.Ode71.mode	@ltx/en_us_goadedes/miscellanea:misc.Mode8
ltx/en_us_goadedes/ho.ho23:hoCA.Ode71.ode	@ltx/en_us_goadedes/miscellanea:misc.Ode7
ltx/en_us_goadedes/ho.ho23:hoCA.Ode71.text	
ltx/en_us_goadedes/ho.ho23:hoCA.Ode72.incipit	…
ltx/en_us_goadedes/ho.ho23:hoCA.Ode72.melody	@ltx/en_us_goadedes/he.h.m8:heHE.OiEkTisIoudaias.name
ltx/en_us_goadedes/ho.ho23:hoCA.Ode72.mode	@ltx/en_us_goadedes/miscellanea:misc.Mode8
ltx/en_us_goadedes/ho.ho23:hoCA.Ode72.ode	@ltx/en_us_goadedes/miscellanea:misc.Ode7
ltx/en_us_goadedes/ho.ho23:hoCA.Ode72.text	
ltx/en_us_goadedes/ho.ho23:hoCA.Ode73.incipit	…
ltx/en_us_goadedes/ho.ho23:hoCA.Ode73.melody	@ltx/en_us_goadedes/he.h.m8:heHE.OiEkTisIoudaias.name
ltx/en_us_goadedes/ho.ho23:hoCA.Ode73.mode	@ltx/en_us_goadedes/miscellanea:misc.Mode8
ltx/en_us_goadedes/ho.ho23:hoCA.Ode73.ode	@ltx/en_us_goadedes/miscellanea:misc.Ode7
ltx/en_us_goadedes/ho.ho23:hoCA.Ode73.text	
ltx/en_us_goadedes/ho.ho23:hoCA.Ode74.incipit	…
ltx/en_us_goadedes/ho.ho23:hoCA.Ode74.melody	@ltx/en_us_goadedes/he.h.m8:heHE.OiEkTisIoudaias.name
ltx/en_us_goadedes/ho.ho23:hoCA.Ode74.mode	@ltx/en_us_goadedes/miscellanea:misc.Mode8
ltx/en_us_goadedes/ho.ho23:hoCA.Ode74.ode	@ltx/en_us_goadedes/miscellanea:misc.Ode7
ltx/en_us_goadedes/ho.ho23:hoCA.Ode74.text	
ltx/en_us_goadedes/ho.ho23:hoCA.Ode7H.greekmelody	@ltx/en_us_goadedes/he.h.m8:heHE.OiEkTisIoudaias.greekname
ltx/en_us_goadedes/ho.ho23:hoCA.Ode7H.incipit	@ltx/en_us_goadedes/he.h.m8:heHE.OiEkTisIoudaias.incipit
ltx/en_us_goadedes/ho.ho23:hoCA.Ode7H.melody	@ltx/en_us_goadedes/he.h.m8:heHE.OiEkTisIoudaias.melody
ltx/en_us_goadedes/ho.ho23:hoCA.Ode7H.mode	@ltx/en_us_goadedes/miscellanea:misc.Mode8
ltx/en_us_goadedes/ho.ho23:hoCA.Ode7H.ode	@ltx/en_us_goadedes/miscellanea:misc.Ode7
ltx/en_us_goadedes/ho.ho23:hoCA.Ode7H.text	@ltx/en_us_goadedes/he.h.m8:heHE.OiEkTisIoudaias.text
ltx/en_us_goadedes/ho.ho23:hoCA.Ode81.greekmelody	@ltx/en_us_goadedes/he.h.m8:heHE.TonVasileaTonOuranon.greekname
ltx/en_us_goadedes/ho.ho23:hoCA.Ode81.incipit	…
ltx/en_us_goadedes/ho.ho23:hoCA.Ode81.melody	@ltx/en_us_goadedes/he.h.m8:heHE.TonVasileaTonOuranon.name
ltx/en_us_goadedes/ho.ho23:hoCA.Ode81.mode	@ltx/en_us_goadedes/miscellanea:misc.Mode8
ltx/en_us_goadedes/ho.ho23:hoCA.Ode81.ode	@ltx/en_us_goadedes/miscellanea:misc.Ode8
ltx/en_us_goadedes/ho.ho23:hoCA.Ode81.text	
ltx/en_us_goadedes/ho.ho23:hoCA.Ode82.incipit	…
ltx/en_us_goadedes/ho.ho23:hoCA.Ode82.melody	@ltx/en_us_goadedes/he.h.m8:heHE.TonVasileaTonOuranon.name
ltx/en_us_goadedes/ho.ho23:hoCA.Ode82.mode	@ltx/en_us_goadedes/miscellanea:misc.Mode8
ltx/en_us_goadedes/ho.ho23:hoCA.Ode82.ode	@ltx/en_us_goadedes/miscellanea:misc.Ode8
ltx/en_us_goadedes/ho.ho23:hoCA.Ode82.text	
ltx/en_us_goadedes/ho.ho23:hoCA.Ode83.incipit	…
ltx/en_us_goadedes/ho.ho23:hoCA.Ode83.melody	@ltx/en_us_goadedes/he.h.m8:heHE.TonVasileaTonOuranon.name
ltx/en_us_goadedes/ho.ho23:hoCA.Ode83.mode	@ltx/en_us_goadedes/miscellanea:misc.Mode8
ltx/en_us_goadedes/ho.ho23:hoCA.Ode83.ode	@ltx/en_us_goadedes/miscellanea:misc.Ode8
ltx/en_us_goadedes/ho.ho23:hoCA.Ode83.text	
ltx/en_us_goadedes/ho.ho23:hoCA.Ode84.incipit	…
ltx/en_us_goadedes/ho.ho23:hoCA.Ode84.melody	@ltx/en_us_goadedes/he.h.m8:heHE.TonVasileaTonOuranon.name
ltx/en_us_goadedes/ho.ho23:hoCA.Ode84.mode	@ltx/en_us_goadedes/miscellanea:misc.Mode8
ltx/en_us_goadedes/ho.ho23:hoCA.Ode84.ode	@ltx/en_us_goadedes/miscellanea:misc.Ode8
ltx/en_us_goadedes/ho.ho23:hoCA.Ode84.text	
ltx/en_us_goadedes/ho.ho23:hoCA.Ode8H.greekmelody	@ltx/en_us_goadedes/he.h.m8:heHE.TonVasileaTonOuranon.greekname
ltx/en_us_goadedes/ho.ho23:hoCA.Ode8H.incipit	@ltx/en_us_goadedes/he.h.m8:heHE.TonVasileaTonOuranon.incipit
ltx/en_us_goadedes/ho.ho23:hoCA.Ode8H.melody	@ltx/en_us_goadedes/he.h.m8:heHE.TonVasileaTonOuranon.melody
ltx/en_us_goadedes/ho.ho23:hoCA.Ode8H.mode	@ltx/en_us_goadedes/miscellanea:misc.Mode8
ltx/en_us_goadedes/ho.ho23:hoCA.Ode8H.ode	@ltx/en_us_goadedes/miscellanea:misc.Ode8
ltx/en_us_goadedes/ho.ho23:hoCA.Ode8H.text	@ltx/en_us_goadedes/he.h.m8:heHE.TonVasileaTonOuranon.text
ltx/en_us_goadedes/ho.ho23:hoCA.Ode91.greekmelody	@ltx/en_us_goadedes/he.h.m8:heHE.KyriosTheotokon.greekname
ltx/en_us_goadedes/ho.ho23:hoCA.Ode91.incipit	…
ltx/en_us_goadedes/ho.ho23:hoCA.Ode91.melody	@ltx/en_us_goadedes/he.h.m8:heHE.KyriosTheotokon.name
ltx/en_us_goadedes/ho.ho23:hoCA.Ode91.mode	@ltx/en_us_goadedes/miscellanea:misc.Mode8
ltx/en_us_goadedes/ho.ho23:hoCA.Ode91.ode	@ltx/en_us_goadedes/miscellanea:misc.Ode9
ltx/en_us_goadedes/ho.ho23:hoCA.Ode91.text	
ltx/en_us_goadedes/ho.ho23:hoCA.Ode92.incipit	…
ltx/en_us_goadedes/ho.ho23:hoCA.Ode92.melody	@ltx/en_us_goadedes/he.h.m8:heHE.KyriosTheotokon.name
ltx/en_us_goadedes/ho.ho23:hoCA.Ode92.mode	@ltx/en_us_goadedes/miscellanea:misc.Mode8
ltx/en_us_goadedes/ho.ho23:hoCA.Ode92.ode	@ltx/en_us_goadedes/miscellanea:misc.Ode9
ltx/en_us_goadedes/ho.ho23:hoCA.Ode92.text	
ltx/en_us_goadedes/ho.ho23:hoCA.Ode93.incipit	…
ltx/en_us_goadedes/ho.ho23:hoCA.Ode93.melody	@ltx/en_us_goadedes/he.h.m8:heHE.KyriosTheotokon.name
ltx/en_us_goadedes/ho.ho23:hoCA.Ode93.mode	@ltx/en_us_goadedes/miscellanea:misc.Mode8
ltx/en_us_goadedes/ho.ho23:hoCA.Ode93.ode	@ltx/en_us_goadedes/miscellanea:misc.Ode9
ltx/en_us_goadedes/ho.ho23:hoCA.Ode93.text	
ltx/en_us_goadedes/ho.ho23:hoCA.Ode94.incipit	…
ltx/en_us_goadedes/ho.ho23:hoCA.Ode94.melody	@ltx/en_us_goadedes/he.h.m8:heHE.KyriosTheotokon.name
ltx/en_us_goadedes/ho.ho23:hoCA.Ode94.mode	@ltx/en_us_goadedes/miscellanea:misc.Mode8
ltx/en_us_goadedes/ho.ho23:hoCA.Ode94.ode	@ltx/en_us_goadedes/miscellanea:misc.Ode9
ltx/en_us_goadedes/ho.ho23:hoCA.Ode94.text	
ltx/en_us_goadedes/ho.ho23:hoCA.Ode95.incipit	…
ltx/en_us_goadedes/ho.ho23:hoCA.Ode95.melody	@ltx/en_us_goadedes/he.h.m8:heHE.KyriosTheotokon.name
ltx/en_us_goadedes/ho.ho23:hoCA.Ode95.mode	@ltx/en_us_goadedes/miscellanea:misc.Mode8
ltx/en_us_goadedes/ho.ho23:hoCA.Ode95.ode	@ltx/en_us_goadedes/miscellanea:misc.Ode9
ltx/en_us_goadedes/ho.ho23:hoCA.Ode95.text	
ltx/en_us_goadedes/ho.ho23:hoCA.Ode9H.greekmelody	@ltx/en_us_goadedes/he.h.m8:heHE.KyriosTheotokon.greekname
ltx/en_us_goadedes/ho.ho23:hoCA.Ode9H.incipit	@ltx/en_us_goadedes/he.h.m8:heHE.KyriosTheotokon.incipit
ltx/en_us_goadedes/ho.ho23:hoCA.Ode9H.melody	@ltx/en_us_goadedes/he.h.m8:heHE.KyriosTheotokon.melody
ltx/en_us_goadedes/ho.ho23:hoCA.Ode9H.mode	@ltx/en_us_goadedes/miscellanea:misc.Mode8
ltx/en_us_goadedes/ho.ho23:hoCA.Ode9H.ode	@ltx/en_us_goadedes/miscellanea:misc.Ode9
ltx/en_us_goadedes/ho.ho23:hoCA.Ode9H.text	@ltx/en_us_goadedes/he.h.m8:heHE.KyriosTheotokon.text
ltx/en_us_goadedes/ho.ho23:hoCA.PostGospelBoth.incipit	…
ltx/en_us_goadedes/ho.ho23:hoCA.PostGospelBoth.melody	
ltx/en_us_goadedes/ho.ho23:hoCA.PostGospelBoth.mode	@ltx/en_us_goadedes/miscellanea:misc.Mode2
ltx/en_us_goadedes/ho.ho23:hoCA.PostGospelBoth.text	@ltx/en_us_goadedes/ho.ho03:hoMA.PostGospelTheotokos.text
ltx/en_us_goadedes/ho.ho23:hoCA.PostGospelGlory.incipit	…
ltx/en_us_goadedes/ho.ho23:hoCA.PostGospelGlory.melody	
ltx/en_us_goadedes/ho.ho23:hoCA.PostGospelGlory.mode	@ltx/en_us_goadedes/miscellanea:misc.Mode2
ltx/en_us_goadedes/ho.ho23:hoCA.PostGospelGlory.text	@ltx/en_us_goadedes/ho.ho03:hoMA.PostGospelTrinity.text
ltx/en_us_goadedes/ho.ho23:hoCA.PostGospelHymn1.greekmelody	@ltx/en_us_goadedes/he.a.m6:heAU.OlinApothemenoi.greekname
ltx/en_us_goadedes/ho.ho23:hoCA.PostGospelHymn1.incipit	…
ltx/en_us_goadedes/ho.ho23:hoCA.PostGospelHymn1.melody	@ltx/en_us_goadedes/he.a.m6:heAU.OlinApothemenoi.name
ltx/en_us_goadedes/ho.ho23:hoCA.PostGospelHymn1.mode	@ltx/en_us_goadedes/miscellanea:misc.Mode6
ltx/en_us_goadedes/ho.ho23:hoCA.PostGospelHymn1.text	
ltx/en_us_goadedes/ho.ho23:hoCA.PostGospelHymn2.incipit	@ltx/en_us_goadedes/oc.m6.d3:ocMA.AposTheotokion.incipit
ltx/en_us_goadedes/ho.ho23:hoCA.PostGospelHymn2.melody	
ltx/en_us_goadedes/ho.ho23:hoCA.PostGospelHymn2.mode	@ltx/en_us_goadedes/miscellanea:misc.Mode6
ltx/en_us_goadedes/ho.ho23:hoCA.PostGospelHymn2.text	@ltx/en_us_goadedes/oc.m6.d3:ocMA.AposTheotokion.text
ltx/en_us_goadedes/ho.ho23:hoCA.PostGospelHymn3.incipit	@ltx/en_us_goadedes/oc.m6.d3:ocVE.AposTheotokion.incipit
ltx/en_us_goadedes/ho.ho23:hoCA.PostGospelHymn3.melody	
ltx/en_us_goadedes/ho.ho23:hoCA.PostGospelHymn3.mode	@ltx/en_us_goadedes/miscellanea:misc.Mode6
ltx/en_us_goadedes/ho.ho23:hoCA.PostGospelHymn3.text	@ltx/en_us_goadedes/oc.m6.d3:ocVE.AposTheotokion.text
ltx/en_us_goadedes/ho.ho23:hoCA.PostGospelVerse.text	
ltx/en_us_goadedes/ho.ho23:hoCA.Troparion1.incipit	@ltx/en_us_goadedes/oc.m6.d3:octrMA.Kathisma12.incipit
ltx/en_us_goadedes/ho.ho23:hoCA.Troparion1.melody	
ltx/en_us_goadedes/ho.ho23:hoCA.Troparion1.mode	@ltx/en_us_goadedes/miscellanea:misc.Mode6
ltx/en_us_goadedes/ho.ho23:hoCA.Troparion1.text	@ltx/en_us_goadedes/oc.m6.d3:octrMA.Kathisma12.text
ltx/en_us_goadedes/ho.ho23:hoCA.Troparion2.incipit	@ltx/en_us_goadedes/oc.m6.d2:ocMA.Kathisma22.incipit
ltx/en_us_goadedes/ho.ho23:hoCA.Troparion2.melody	
ltx/en_us_goadedes/ho.ho23:hoCA.Troparion2.mode	@ltx/en_us_goadedes/miscellanea:misc.Mode6
ltx/en_us_goadedes/ho.ho23:hoCA.Troparion2.text	@ltx/en_us_goadedes/oc.m6.d2:ocMA.Kathisma22.text
ltx/en_us_goadedes/ho.ho23:hoCA.Troparion3.incipit	@ltx/en_us_goadedes/oc.m6.d5:ocMA.Kathisma13.incipit
ltx/en_us_goadedes/ho.ho23:hoCA.Troparion3.melody	
ltx/en_us_goadedes/ho.ho23:hoCA.Troparion3.mode	@ltx/en_us_goadedes/miscellanea:misc.Mode6
ltx/en_us_goadedes/ho.ho23:hoCA.Troparion3.text	@ltx/en_us_goadedes/oc.m6.d5:ocMA.Kathisma13.text
ltx/en_us_goadedes/ho.ho23:hoCA.Troparion31.incipit	Deliver us…
ltx/en_us_goadedes/ho.ho23:hoCA.Troparion31.melody	
ltx/en_us_goadedes/ho.ho23:hoCA.Troparion31.mode	@ltx/en_us_goadedes/miscellanea:misc.Mode8
ltx/en_us_goadedes/ho.ho23:hoCA.Troparion31.text	Deliver us your humble servants from perils, O Theotokos, as for refuge, after God, we all flee to you, an impregnable fortress and protection.
ltx/en_us_goadedes/ho.ho23:hoCA.Troparion32.incipit	Look graciously…
ltx/en_us_goadedes/ho.ho23:hoCA.Troparion32.melody	
ltx/en_us_goadedes/ho.ho23:hoCA.Troparion32.mode	@ltx/en_us_goadedes/miscellanea:misc.Mode8
ltx/en_us_goadedes/ho.ho23:hoCA.Troparion32.text	Look graciously upon your servant, all-praiseworthy Theotokos, and upon my painful physical suffering, and remedy my anguish of spirit.
ltx/en_us_goadedes/ho.ho23:hoCA.Troparion4.greekmelody	@ltx/en_us_goadedes/he.a.m2:heAU.OteEkTouXylou.greekname
ltx/en_us_goadedes/ho.ho23:hoCA.Troparion4.incipit	@ltx/en_us_goadedes/oc.m2.d5:ocVE.AposTheotokion.incipit
ltx/en_us_goadedes/ho.ho23:hoCA.Troparion4.melody	@ltx/en_us_goadedes/he.a.m2:heAU.OteEkTouXylou.name
ltx/en_us_goadedes/ho.ho23:hoCA.Troparion4.mode	@ltx/en_us_goadedes/miscellanea:misc.Mode2
ltx/en_us_goadedes/ho.ho23:hoCA.Troparion4.text	@ltx/en_us_goadedes/oc.m2.d5:ocVE.AposTheotokion.text
ltx/en_us_goadedes/ho.ho23:hoCA.Troparion5.incipit	@ltx/en_us_goadedes/oc.m2.d1:ocSV.Aposticha1.incipit
ltx/en_us_goadedes/ho.ho23:hoCA.Troparion5.melody	@ltx/en_us_goadedes/he.a.m2:heAU.OteEkTouXylou.name
ltx/en_us_goadedes/ho.ho23:hoCA.Troparion5.mode	@ltx/en_us_goadedes/miscellanea:misc.Mode2
ltx/en_us_goadedes/ho.ho23:hoCA.Troparion5.text	@ltx/en_us_goadedes/oc.m2.d1:ocSV.Aposticha1.text
ltx/en_us_goadedes/ho.ho23:hoCA.Troparion6.incipit	@ltx/en_us_goadedes/oc.m8.d5:ocMA.AposTheotokion.incipit
ltx/en_us_goadedes/ho.ho23:hoCA.Troparion6.melody	
ltx/en_us_goadedes/ho.ho23:hoCA.Troparion6.mode	@ltx/en_us_goadedes/miscellanea:misc.Mode8
ltx/en_us_goadedes/ho.ho23:hoCA.Troparion6.text	@ltx/en_us_goadedes/oc.m8.d5:ocMA.AposTheotokion.text
ltx/en_us_goadedes/ho.ho23:hoCA.Troparion61.incipit	@ltx/en_us_goadedes/ho.ho23:hoCA.Troparion31.incipit
ltx/en_us_goadedes/ho.ho23:hoCA.Troparion61.melody	
ltx/en_us_goadedes/ho.ho23:hoCA.Troparion61.mode	@ltx/en_us_goadedes/miscellanea:misc.Mode8
ltx/en_us_goadedes/ho.ho23:hoCA.Troparion61.text	@ltx/en_us_goadedes/ho.ho23:hoCA.Troparion31.text
ltx/en_us_goadedes/ho.ho23:hoCA.Troparion62.incipit	Entreat for us…
ltx/en_us_goadedes/ho.ho23:hoCA.Troparion62.melody	
ltx/en_us_goadedes/ho.ho23:hoCA.Troparion62.mode	@ltx/en_us_goadedes/miscellanea:misc.Mode8
ltx/en_us_goadedes/ho.ho23:hoCA.Troparion62.text	Entreat for us, * O spotless Maiden who gave birth to the divine Word * inexplicably through a word in the latter days, * since you indeed * speak with motherly freedom.
ltx/en_us_goadedes/ho.ho23:hoCA.Troparion7.incipit	O Mother of God…
ltx/en_us_goadedes/ho.ho23:hoCA.Troparion7.melody	
ltx/en_us_goadedes/ho.ho23:hoCA.Troparion7.mode	@ltx/en_us_goadedes/miscellanea:misc.Mode2
ltx/en_us_goadedes/ho.ho23:hoCA.Troparion7.text	O Mother of God, I have committed my every hope wholly unto you. Keep me under your shelter.
ltx/en_us_goadedes/ho.ho23:hoCA.media.text	
ltx/en_us_goadedes/ho.ho23:hoCA.poet	@ltx/en_us_goadedes/poets:po.TheostiriktouMonachouOiDeThefanous
ltx/en_us_goadedes/ho.ho23:hoCA.title	
ltx/en_us_goadedes/ho.ho23:hoCA.title2	
ltx/en_us_goadedes/ho.ho23:hoCA.translator	
