ltx/en_us_goadedes/ho.ho15.m12:ho.Days	
ltx/en_us_goadedes/ho.ho15.m12:ho.Hours	
ltx/en_us_goadedes/ho.ho15.m12:ho.Month	
ltx/en_us_goadedes/ho.ho15.m12:hoD08.GeneralApolytikion1.name	
ltx/en_us_goadedes/ho.ho15.m12:hoD10.Apolytikion1.greekmelody	@ltx/en_us_goadedes/he.a.m8:heAU.ToProstachthen.greekname
ltx/en_us_goadedes/ho.ho15.m12:hoD10.Apolytikion1.incipit	@ltx/en_us_goadedes/oc.m8.d4:ocMA.Kathisma32.incipit
ltx/en_us_goadedes/ho.ho15.m12:hoD10.Apolytikion1.melody	@ltx/en_us_goadedes/he.a.m8:heAU.ToProstachthen.name
ltx/en_us_goadedes/ho.ho15.m12:hoD10.Apolytikion1.mode	@ltx/en_us_goadedes/miscellanea:misc.Mode8
ltx/en_us_goadedes/ho.ho15.m12:hoD10.Apolytikion1.poet	
ltx/en_us_goadedes/ho.ho15.m12:hoD10.Apolytikion1.text	@ltx/en_us_goadedes/oc.m8.d4:ocMA.Kathisma32.text
ltx/en_us_goadedes/ho.ho15.m12:hoD10.Apolytikion1.title	@ltx/en_us_goadedes/titles:ti.Martyrs
ltx/en_us_goadedes/ho.ho15.m12:hoD10.Kontakion1.greekmelody	@ltx/en_us_goadedes/he.a.m1:heAU.ChorosAngelikos.greekname
ltx/en_us_goadedes/ho.ho15.m12:hoD10.Kontakion1.incipit	…
ltx/en_us_goadedes/ho.ho15.m12:hoD10.Kontakion1.melody	@ltx/en_us_goadedes/he.a.m1:heAU.ChorosAngelikos.name
ltx/en_us_goadedes/ho.ho15.m12:hoD10.Kontakion1.mode	@ltx/en_us_goadedes/miscellanea:misc.Mode1
ltx/en_us_goadedes/ho.ho15.m12:hoD10.Kontakion1.poet	
ltx/en_us_goadedes/ho.ho15.m12:hoD10.Kontakion1.text	
ltx/en_us_goadedes/ho.ho15.m12:hoD10.Kontakion1.title	@ltx/en_us_goadedes/titles:ti.Martyrs
ltx/en_us_goadedes/ho.ho15.m12:hoD16.GeneralApolytikion1.name	
ltx/en_us_goadedes/ho.ho15.m12:hoD17.Kontakion3.greekmelody	@ltx/en_us_goadedes/he.a.m3:heAU.IParthenosSimeron.greekname
ltx/en_us_goadedes/ho.ho15.m12:hoD17.Kontakion3.incipit	…
ltx/en_us_goadedes/ho.ho15.m12:hoD17.Kontakion3.melody	@ltx/en_us_goadedes/he.a.m3:heAU.IParthenosSimeron.name
ltx/en_us_goadedes/ho.ho15.m12:hoD17.Kontakion3.mode	@ltx/en_us_goadedes/miscellanea:misc.Mode3
ltx/en_us_goadedes/ho.ho15.m12:hoD17.Kontakion3.poet	
ltx/en_us_goadedes/ho.ho15.m12:hoD17.Kontakion3.text	
ltx/en_us_goadedes/ho.ho15.m12:hoD17.Kontakion3.title	@ltx/en_us_goadedes/titles:ti.Hierarch
ltx/en_us_goadedes/ho.ho15.m12:hoD20.Apolytikion3.greekmelody	@ltx/en_us_goadedes/he.a.m3:heAU.TheiasPisteos.greekname
ltx/en_us_goadedes/ho.ho15.m12:hoD20.Apolytikion3.melody	@ltx/en_us_goadedes/he.a.m3:heAU.TheiasPisteos.name
ltx/en_us_goadedes/ho.ho15.m12:hoD20.Apolytikion3.mode	@ltx/en_us_goadedes/miscellanea:misc.Mode3
ltx/en_us_goadedes/ho.ho15.m12:hoD20.Apolytikion3.poet	
ltx/en_us_goadedes/ho.ho15.m12:hoD20.Apolytikion3.text	
ltx/en_us_goadedes/ho.ho15.m12:hoD20.Apolytikion3.title	@ltx/en_us_goadedes/titles:ti.SaintM
ltx/en_us_goadedes/ho.ho15.m12:hoD20.GeneralApolytikion2.name	
