ltx/en_us_goadedes/pe.d113:peDA.commemoration.full	
ltx/en_us_goadedes/pe.d113:peDA.commemoration.short	
ltx/en_us_goadedes/pe.d113:peDA.dismissal	@ltx/en_us_goadedes/dismissals:dis00.andascension
ltx/en_us_goadedes/pe.d113:peDA.insert1	
ltx/en_us_goadedes/pe.d113:peDA.insert2	
ltx/en_us_goadedes/pe.d113:peDA.note	
ltx/en_us_goadedes/pe.d113:peHO.commemorations	
ltx/en_us_goadedes/pe.d113:peHO.daytitle	
ltx/en_us_goadedes/pe.d113:peHO.description1	
ltx/en_us_goadedes/pe.d113:peHO.description2	
ltx/en_us_goadedes/pe.d113:peHO.note1	
ltx/en_us_goadedes/pe.d113:peHO.note2	
ltx/en_us_goadedes/pe.d113:peLI.AfterCommunion.incipit	@ltx/en_us_goadedes/pe.d110:peVE.Apolytikion1.incipit
ltx/en_us_goadedes/pe.d113:peLI.AfterCommunion.mode	@ltx/en_us_goadedes/miscellanea:misc.Mode4
ltx/en_us_goadedes/pe.d113:peLI.AfterCommunion.text	@ltx/en_us_goadedes/pe.d110:peVE.Apolytikion1.text
ltx/en_us_goadedes/pe.d113:peLI.Megalynarion.text	
ltx/en_us_goadedes/pe.d113:peMA.C1.acrostic.notice1	
ltx/en_us_goadedes/pe.d113:peMA.C1.acrostic.notice2	
ltx/en_us_goadedes/pe.d113:peMA.C1.acrostic.text	
ltx/en_us_goadedes/pe.d113:peMA.C1.acrostic.title	Canon for the Holy Fathers.
ltx/en_us_goadedes/pe.d113:peMA.C1.poet	
ltx/en_us_goadedes/pe.d113:peMA.C1.title	@ltx/en_us_goadedes/titles:ti.CanonFathers
ltx/en_us_goadedes/pe.d113:peMA.C1.verse	@ltx/en_us_goadedes/prayers:pr.verse_SaintsM.text
ltx/en_us_goadedes/pe.d113:peMA.Exaposteilarion1.greekmelody	@ltx/en_us_goadedes/he.a.m2:heAU.ToisMathitaisSynelthomen.greekname
ltx/en_us_goadedes/pe.d113:peMA.Exaposteilarion1.incipit	@ltx/en_us_goadedes/eo.e10:eo.Exaposteilarion.incipit
ltx/en_us_goadedes/pe.d113:peMA.Exaposteilarion1.melody	@ltx/en_us_goadedes/he.a.m2:heAU.ToisMathitaisSynelthomen.name
ltx/en_us_goadedes/pe.d113:peMA.Exaposteilarion1.mode	@ltx/en_us_goadedes/miscellanea:misc.Mode2
ltx/en_us_goadedes/pe.d113:peMA.Exaposteilarion1.text	@ltx/en_us_goadedes/eo.e10:eo.Exaposteilarion.text
ltx/en_us_goadedes/pe.d113:peMA.Exaposteilarion2.greekmelody	@ltx/en_us_goadedes/he.a.m2:heAU.GynaikesAkoutisthite.greekname
ltx/en_us_goadedes/pe.d113:peMA.Exaposteilarion2.incipit	@ltx/en_us_goadedes/me.m07.dHF:meMA.Exaposteilarion1.incipit
ltx/en_us_goadedes/pe.d113:peMA.Exaposteilarion2.melody	@ltx/en_us_goadedes/he.a.m2:heAU.GynaikesAkoutisthite.name
ltx/en_us_goadedes/pe.d113:peMA.Exaposteilarion2.mode	@ltx/en_us_goadedes/miscellanea:misc.Mode2
ltx/en_us_goadedes/pe.d113:peMA.Exaposteilarion2.text	@ltx/en_us_goadedes/me.m07.dHF:meMA.Exaposteilarion1.text
ltx/en_us_goadedes/pe.d113:peMA.Exaposteilarion3.greekmelody	@ltx/en_us_goadedes/pe.d110:peMA.Exaposteilarion1.greekmelody
ltx/en_us_goadedes/pe.d113:peMA.Exaposteilarion3.incipit	@ltx/en_us_goadedes/pe.d110:peMA.Exaposteilarion1.incipit
ltx/en_us_goadedes/pe.d113:peMA.Exaposteilarion3.melody	@ltx/en_us_goadedes/pe.d110:peMA.Exaposteilarion1.melody
ltx/en_us_goadedes/pe.d113:peMA.Exaposteilarion3.mode	@ltx/en_us_goadedes/pe.d110:peMA.Exaposteilarion1.mode
ltx/en_us_goadedes/pe.d113:peMA.Exaposteilarion3.text	@ltx/en_us_goadedes/pe.d110:peMA.Exaposteilarion1.text
ltx/en_us_goadedes/pe.d113:peMA.Kathisma11.incipit	@ltx/en_us_goadedes/oc.m6.d1:ocMA.Kathisma11.incipit
ltx/en_us_goadedes/pe.d113:peMA.Kathisma11.melody	
ltx/en_us_goadedes/pe.d113:peMA.Kathisma11.mode	@ltx/en_us_goadedes/miscellanea:misc.Mode6
ltx/en_us_goadedes/pe.d113:peMA.Kathisma11.text	@ltx/en_us_goadedes/oc.m6.d1:ocMA.Kathisma11.text
ltx/en_us_goadedes/pe.d113:peMA.Kathisma12.incipit	@ltx/en_us_goadedes/oc.m6.d1:ocMA.Kathisma12.incipit
ltx/en_us_goadedes/pe.d113:peMA.Kathisma12.melody	
ltx/en_us_goadedes/pe.d113:peMA.Kathisma12.mode	@ltx/en_us_goadedes/miscellanea:misc.Mode6
ltx/en_us_goadedes/pe.d113:peMA.Kathisma12.text	@ltx/en_us_goadedes/oc.m6.d1:ocMA.Kathisma12.text
ltx/en_us_goadedes/pe.d113:peMA.Kathisma13.incipit	@ltx/en_us_goadedes/oc.m6.d1:ocVE.ApolTheotokionVM.incipit
ltx/en_us_goadedes/pe.d113:peMA.Kathisma13.melody	
ltx/en_us_goadedes/pe.d113:peMA.Kathisma13.mode	@ltx/en_us_goadedes/miscellanea:misc.Mode6
ltx/en_us_goadedes/pe.d113:peMA.Kathisma13.text	@ltx/en_us_goadedes/oc.m6.d1:ocVE.ApolTheotokionVM.text
ltx/en_us_goadedes/pe.d113:peMA.Kathisma21.incipit	@ltx/en_us_goadedes/oc.m6.d1:ocMA.Kathisma21.incipit
ltx/en_us_goadedes/pe.d113:peMA.Kathisma21.melody	
ltx/en_us_goadedes/pe.d113:peMA.Kathisma21.mode	@ltx/en_us_goadedes/miscellanea:misc.Mode6
ltx/en_us_goadedes/pe.d113:peMA.Kathisma21.text	@ltx/en_us_goadedes/oc.m6.d1:ocMA.Kathisma21.text
ltx/en_us_goadedes/pe.d113:peMA.Kathisma22.incipit	…
ltx/en_us_goadedes/pe.d113:peMA.Kathisma22.melody	
ltx/en_us_goadedes/pe.d113:peMA.Kathisma22.mode	@ltx/en_us_goadedes/miscellanea:misc.Mode6
ltx/en_us_goadedes/pe.d113:peMA.Kathisma22.text	
ltx/en_us_goadedes/pe.d113:peMA.Kathisma23.incipit	@ltx/en_us_goadedes/oc.m6.d1:ocMA.Kathisma23.incipit
ltx/en_us_goadedes/pe.d113:peMA.Kathisma23.melody	
ltx/en_us_goadedes/pe.d113:peMA.Kathisma23.mode	@ltx/en_us_goadedes/miscellanea:misc.Mode6
ltx/en_us_goadedes/pe.d113:peMA.Kathisma23.text	@ltx/en_us_goadedes/oc.m6.d1:ocMA.Kathisma23.text
ltx/en_us_goadedes/pe.d113:peMA.Kontakion1.incipit	@ltx/en_us_goadedes/me.m07.dHF:meMA.Kontakion1.incipit
ltx/en_us_goadedes/pe.d113:peMA.Kontakion1.melody	@ltx/en_us_goadedes/miscellanea:misc.Automelon
ltx/en_us_goadedes/pe.d113:peMA.Kontakion1.mode	@ltx/en_us_goadedes/miscellanea:misc.Mode8
ltx/en_us_goadedes/pe.d113:peMA.Kontakion1.text	@ltx/en_us_goadedes/me.m07.dHF:meMA.Kontakion1.text
ltx/en_us_goadedes/pe.d113:peMA.Lauds6.greekmelody	@ltx/en_us_goadedes/he.a.m6:heAU.OlinApothemenoi.greekname
ltx/en_us_goadedes/pe.d113:peMA.Lauds6.incipit	@ltx/en_us_goadedes/me.m07.dHF:meMA.Lauds1.incipit
ltx/en_us_goadedes/pe.d113:peMA.Lauds6.melody	@ltx/en_us_goadedes/he.a.m6:heAU.OlinApothemenoi.name
ltx/en_us_goadedes/pe.d113:peMA.Lauds6.mode	@ltx/en_us_goadedes/miscellanea:misc.Mode6
ltx/en_us_goadedes/pe.d113:peMA.Lauds6.text	@ltx/en_us_goadedes/me.m07.dHF:meMA.Lauds1.text
ltx/en_us_goadedes/pe.d113:peMA.Lauds7.incipit	@ltx/en_us_goadedes/me.m07.dHF:meMA.Lauds2.incipit
ltx/en_us_goadedes/pe.d113:peMA.Lauds7.melody	@ltx/en_us_goadedes/he.a.m6:heAU.OlinApothemenoi.name
ltx/en_us_goadedes/pe.d113:peMA.Lauds7.mode	@ltx/en_us_goadedes/miscellanea:misc.Mode6
ltx/en_us_goadedes/pe.d113:peMA.Lauds7.text	@ltx/en_us_goadedes/me.m07.dHF:meMA.Lauds2.text
ltx/en_us_goadedes/pe.d113:peMA.Lauds8.incipit	@ltx/en_us_goadedes/me.m07.dHF:meMA.Lauds3.incipit
ltx/en_us_goadedes/pe.d113:peMA.Lauds8.melody	@ltx/en_us_goadedes/he.a.m6:heAU.OlinApothemenoi.name
ltx/en_us_goadedes/pe.d113:peMA.Lauds8.mode	@ltx/en_us_goadedes/miscellanea:misc.Mode6
ltx/en_us_goadedes/pe.d113:peMA.Lauds8.text	@ltx/en_us_goadedes/me.m07.dHF:meMA.Lauds3.text
ltx/en_us_goadedes/pe.d113:peMA.LaudsGlory.incipit	@ltx/en_us_goadedes/me.m10.dHF:meMA.LaudsGlory.incipit
ltx/en_us_goadedes/pe.d113:peMA.LaudsGlory.melody	@ltx/en_us_goadedes/miscellanea:misc.Idiomelon
ltx/en_us_goadedes/pe.d113:peMA.LaudsGlory.mode	@ltx/en_us_goadedes/miscellanea:misc.Mode8
ltx/en_us_goadedes/pe.d113:peMA.LaudsGlory.text	@ltx/en_us_goadedes/me.m10.dHF:meMA.LaudsGlory.text
ltx/en_us_goadedes/pe.d113:peMA.Ode1C11.greekmelody	@ltx/en_us_goadedes/he.h.m6:heHE.OsEnIpeiroPezefsas.greekname
ltx/en_us_goadedes/pe.d113:peMA.Ode1C11.incipit	As I am singing…
ltx/en_us_goadedes/pe.d113:peMA.Ode1C11.melody	@ltx/en_us_goadedes/he.h.m6:heHE.OsEnIpeiroPezefsas.name
ltx/en_us_goadedes/pe.d113:peMA.Ode1C11.mode	@ltx/en_us_goadedes/miscellanea:misc.Mode6
ltx/en_us_goadedes/pe.d113:peMA.Ode1C11.ode	@ltx/en_us_goadedes/miscellanea:misc.Ode1
ltx/en_us_goadedes/pe.d113:peMA.Ode1C11.text	As I am singing these hymns to extol the great * and all-holy Council of holy Fathers, I implore * You, O Christ, to grant me to defend * and abide by their divine prophetic utterance.
ltx/en_us_goadedes/pe.d113:peMA.Ode1C12.incipit	Today, the God-bearing Fathers…
ltx/en_us_goadedes/pe.d113:peMA.Ode1C12.melody	@ltx/en_us_goadedes/he.h.m6:heHE.OsEnIpeiroPezefsas.name
ltx/en_us_goadedes/pe.d113:peMA.Ode1C12.mode	@ltx/en_us_goadedes/miscellanea:misc.Mode6
ltx/en_us_goadedes/pe.d113:peMA.Ode1C12.ode	@ltx/en_us_goadedes/miscellanea:misc.Ode1
ltx/en_us_goadedes/pe.d113:peMA.Ode1C12.text	Today, the God-bearing Fathers, those bolts of light, * came together publicly to profess the Faith, O Christ: * You are the only-begotten Son, * coeternal with the Father and in essence one.
ltx/en_us_goadedes/pe.d113:peMA.Ode1C13.incipit	The famous Fathers…
ltx/en_us_goadedes/pe.d113:peMA.Ode1C13.melody	@ltx/en_us_goadedes/he.h.m6:heHE.OsEnIpeiroPezefsas.name
ltx/en_us_goadedes/pe.d113:peMA.Ode1C13.mode	@ltx/en_us_goadedes/miscellanea:misc.Mode6
ltx/en_us_goadedes/pe.d113:peMA.Ode1C13.ode	@ltx/en_us_goadedes/miscellanea:misc.Ode1
ltx/en_us_goadedes/pe.d113:peMA.Ode1C13.text	The famous Fathers succinctly decreed the Faith. * With their definition, Lord, as with jewelry made of gold * and is fit to dignify a bride, * they adorned the holy Church, which is Your Bride, O Christ.
ltx/en_us_goadedes/pe.d113:peMA.Ode1C1T.incipit	Adorned with glory…
ltx/en_us_goadedes/pe.d113:peMA.Ode1C1T.melody	@ltx/en_us_goadedes/he.h.m6:heHE.OsEnIpeiroPezefsas.name
ltx/en_us_goadedes/pe.d113:peMA.Ode1C1T.mode	@ltx/en_us_goadedes/miscellanea:misc.Mode6
ltx/en_us_goadedes/pe.d113:peMA.Ode1C1T.ode	@ltx/en_us_goadedes/miscellanea:misc.Ode1
ltx/en_us_goadedes/pe.d113:peMA.Ode1C1T.text	Adorned with glory divine and with many gifts, * the most noble Queen of all stands beside her Son and God, * whom she never ceases to implore * on behalf of us believers, that He save our souls.
ltx/en_us_goadedes/pe.d113:peMA.Ode3C11.greekmelody	@ltx/en_us_goadedes/he.h.m6:heHE.OukEstinAgios.greekname
ltx/en_us_goadedes/pe.d113:peMA.Ode3C11.incipit	Deluded Arius…
ltx/en_us_goadedes/pe.d113:peMA.Ode3C11.melody	@ltx/en_us_goadedes/he.h.m6:heHE.OukEstinAgios.name
ltx/en_us_goadedes/pe.d113:peMA.Ode3C11.mode	@ltx/en_us_goadedes/miscellanea:misc.Mode6
ltx/en_us_goadedes/pe.d113:peMA.Ode3C11.ode	@ltx/en_us_goadedes/miscellanea:misc.Ode3
ltx/en_us_goadedes/pe.d113:peMA.Ode3C11.text	Deluded Arius ascribed passion and flux and cutting * to divine generation, for he lapsed from true belief. * By the Fathers’ cutting sword * he was therefore cut off as a heretic.
ltx/en_us_goadedes/pe.d113:peMA.Ode3C12.incipit	Like godly Abraham…
ltx/en_us_goadedes/pe.d113:peMA.Ode3C12.melody	@ltx/en_us_goadedes/he.h.m6:heHE.OukEstinAgios.name
ltx/en_us_goadedes/pe.d113:peMA.Ode3C12.mode	@ltx/en_us_goadedes/miscellanea:misc.Mode6
ltx/en_us_goadedes/pe.d113:peMA.Ode3C12.ode	@ltx/en_us_goadedes/miscellanea:misc.Ode3
ltx/en_us_goadedes/pe.d113:peMA.Ode3C12.text	Like godly Abraham of lore, now the God-bearing fathers * waged a spiritual battle on Your enemies, O Lord; * and by Your might they prevailed, * and they vanquished those demented heretics.
ltx/en_us_goadedes/pe.d113:peMA.Ode3C13.incipit	O Lord, Your clerics…
ltx/en_us_goadedes/pe.d113:peMA.Ode3C13.melody	@ltx/en_us_goadedes/he.h.m6:heHE.OukEstinAgios.name
ltx/en_us_goadedes/pe.d113:peMA.Ode3C13.mode	@ltx/en_us_goadedes/miscellanea:misc.Mode6
ltx/en_us_goadedes/pe.d113:peMA.Ode3C13.ode	@ltx/en_us_goadedes/miscellanea:misc.Ode3
ltx/en_us_goadedes/pe.d113:peMA.Ode3C13.text	O Lord, Your clerics of the First Ecumenical Council * claimed that You were begotten of the unoriginate * Father and Maker of all, * consubstantial with Him, which is Orthodox.
ltx/en_us_goadedes/pe.d113:peMA.Ode3C1T.incipit	No human language…
ltx/en_us_goadedes/pe.d113:peMA.Ode3C1T.melody	@ltx/en_us_goadedes/he.h.m6:heHE.OukEstinAgios.name
ltx/en_us_goadedes/pe.d113:peMA.Ode3C1T.mode	@ltx/en_us_goadedes/miscellanea:misc.Mode6
ltx/en_us_goadedes/pe.d113:peMA.Ode3C1T.ode	@ltx/en_us_goadedes/miscellanea:misc.Ode3
ltx/en_us_goadedes/pe.d113:peMA.Ode3C1T.text	No human language has the words that can worthily praise you, * O immaculate Virgin. For Christ, the Giver of life, * became incarnate from you, * without seed of man, as He was pleased to do.
ltx/en_us_goadedes/pe.d113:peMA.Ode3Kathisma1.greekmelody	@ltx/en_us_goadedes/he.a.m4:heAU.TachyProkatalave.greekname
ltx/en_us_goadedes/pe.d113:peMA.Ode3Kathisma1.incipit	@ltx/en_us_goadedes/me.m07.dHF:meMA.Ode3Kathisma1.incipit
ltx/en_us_goadedes/pe.d113:peMA.Ode3Kathisma1.melody	@ltx/en_us_goadedes/he.a.m4:heAU.TachyProkatalave.name
ltx/en_us_goadedes/pe.d113:peMA.Ode3Kathisma1.mode	@ltx/en_us_goadedes/miscellanea:misc.Mode4
ltx/en_us_goadedes/pe.d113:peMA.Ode3Kathisma1.text	@ltx/en_us_goadedes/me.m07.dHF:meMA.Ode3Kathisma1.text
ltx/en_us_goadedes/pe.d113:peMA.Ode3Kathisma2.greekmelody	@ltx/en_us_goadedes/he.a.m4:heAU.OYpsotheisEnToStavro.greekname
ltx/en_us_goadedes/pe.d113:peMA.Ode3Kathisma2.incipit	The famous city of Nicea…
ltx/en_us_goadedes/pe.d113:peMA.Ode3Kathisma2.melody	@ltx/en_us_goadedes/he.a.m4:heAU.OYpsotheisEnToStavro.name
ltx/en_us_goadedes/pe.d113:peMA.Ode3Kathisma2.mode	@ltx/en_us_goadedes/miscellanea:misc.Mode4
ltx/en_us_goadedes/pe.d113:peMA.Ode3Kathisma2.text	The famous city of Nicea once hosted * three hundred eighteen holy bishops and clerics, * from all the earth. And we, today, remember what they did. * They confronted Arius and his blasphemous teaching * that one of the Trinity is subordinated, * although He is the Son and Word of God; * and they condemned it, confirming the Orthodox Faith.
ltx/en_us_goadedes/pe.d113:peMA.Ode3Kathisma3.greekmelody	@ltx/en_us_goadedes/he.a.m4:heAU.OYpsotheisEnToStavro.greekname
ltx/en_us_goadedes/pe.d113:peMA.Ode3Kathisma3.incipit	You have ascended…
ltx/en_us_goadedes/pe.d113:peMA.Ode3Kathisma3.melody	@ltx/en_us_goadedes/he.a.m4:heAU.OYpsotheisEnToStavro.name
ltx/en_us_goadedes/pe.d113:peMA.Ode3Kathisma3.mode	@ltx/en_us_goadedes/miscellanea:misc.Mode4
ltx/en_us_goadedes/pe.d113:peMA.Ode3Kathisma3.text	You have ascended into heaven with glory, * and You are seated on the right with Your Father, * from whom You never parted, O Christ who love mankind. * To Your wise Disciples You sent the all-holy Spirit, * as You promised. And now we pray You to give us also * illumination, brightening our minds, * and we will praise You, our Master, forevermore.
ltx/en_us_goadedes/pe.d113:peMA.Ode4C11.greekmelody	@ltx/en_us_goadedes/he.h.m6:heHE.ChristosMouDynamis.greekname
ltx/en_us_goadedes/pe.d113:peMA.Ode4C11.incipit	The thoughts of Arius…
ltx/en_us_goadedes/pe.d113:peMA.Ode4C11.melody	@ltx/en_us_goadedes/he.h.m6:heHE.ChristosMouDynamis.name
ltx/en_us_goadedes/pe.d113:peMA.Ode4C11.mode	@ltx/en_us_goadedes/miscellanea:misc.Mode6
ltx/en_us_goadedes/pe.d113:peMA.Ode4C11.ode	@ltx/en_us_goadedes/miscellanea:misc.Ode4
ltx/en_us_goadedes/pe.d113:peMA.Ode4C11.text	The thoughts of Arius the villain were unsound. * He did not rightly teach the Orthodox Faith. * Therefore by decree of the all-holy Fathers he was banned * from the Church as one incurable.
ltx/en_us_goadedes/pe.d113:peMA.Ode4C12.incipit	O Lord, the Council…
ltx/en_us_goadedes/pe.d113:peMA.Ode4C12.melody	@ltx/en_us_goadedes/he.h.m6:heHE.ChristosMouDynamis.name
ltx/en_us_goadedes/pe.d113:peMA.Ode4C12.mode	@ltx/en_us_goadedes/miscellanea:misc.Mode6
ltx/en_us_goadedes/pe.d113:peMA.Ode4C12.ode	@ltx/en_us_goadedes/miscellanea:misc.Ode4
ltx/en_us_goadedes/pe.d113:peMA.Ode4C12.text	O Lord, the Council of the holy Fathers fought * in defense of the Orthodox Faith in You, * that You are consubstantial with the Father and the Spirit; * and they vanquished all Your enemies.
ltx/en_us_goadedes/pe.d113:peMA.Ode4C13.incipit	You are the mediator…
ltx/en_us_goadedes/pe.d113:peMA.Ode4C13.melody	@ltx/en_us_goadedes/he.h.m6:heHE.ChristosMouDynamis.name
ltx/en_us_goadedes/pe.d113:peMA.Ode4C13.mode	@ltx/en_us_goadedes/miscellanea:misc.Mode6
ltx/en_us_goadedes/pe.d113:peMA.Ode4C13.ode	@ltx/en_us_goadedes/miscellanea:misc.Ode4
ltx/en_us_goadedes/pe.d113:peMA.Ode4C13.text	You are the mediator between God and men, * O Christ Jesus, for You are both God and man. * Thus those godly-minded men knew You to be a single Son * in two natures, and they so decreed.
ltx/en_us_goadedes/pe.d113:peMA.Ode4C1T.incipit	Refection from the tree…
ltx/en_us_goadedes/pe.d113:peMA.Ode4C1T.melody	@ltx/en_us_goadedes/he.h.m6:heHE.ChristosMouDynamis.name
ltx/en_us_goadedes/pe.d113:peMA.Ode4C1T.mode	@ltx/en_us_goadedes/miscellanea:misc.Mode6
ltx/en_us_goadedes/pe.d113:peMA.Ode4C1T.ode	@ltx/en_us_goadedes/miscellanea:misc.Ode4
ltx/en_us_goadedes/pe.d113:peMA.Ode4C1T.text	Refection from the tree became the death of me. * Then from you, holy Virgin, the Tree of life * came and resurrected me; and He has counted me an heir * of divine delight of Paradise.
ltx/en_us_goadedes/pe.d113:peMA.Ode5C11.greekmelody	@ltx/en_us_goadedes/he.h.m6:heHE.ToTheioFengeiSou.greekname
ltx/en_us_goadedes/pe.d113:peMA.Ode5C11.incipit	Indeed, how beautiful…
ltx/en_us_goadedes/pe.d113:peMA.Ode5C11.melody	@ltx/en_us_goadedes/he.h.m6:heHE.ToTheioFengeiSou.name
ltx/en_us_goadedes/pe.d113:peMA.Ode5C11.mode	@ltx/en_us_goadedes/miscellanea:misc.Mode6
ltx/en_us_goadedes/pe.d113:peMA.Ode5C11.ode	@ltx/en_us_goadedes/miscellanea:misc.Ode5
ltx/en_us_goadedes/pe.d113:peMA.Ode5C11.text	Indeed, how beautiful are the feet * of those who are preaching the good news, that You, O Christ, are the peace of God, * passing understanding of all, both Angels and men, * and uniting all the world in an abundance of peace.
ltx/en_us_goadedes/pe.d113:peMA.Ode5C12.incipit	The godly Teachers…
ltx/en_us_goadedes/pe.d113:peMA.Ode5C12.melody	@ltx/en_us_goadedes/he.h.m6:heHE.ToTheioFengeiSou.name
ltx/en_us_goadedes/pe.d113:peMA.Ode5C12.mode	@ltx/en_us_goadedes/miscellanea:misc.Mode6
ltx/en_us_goadedes/pe.d113:peMA.Ode5C12.ode	@ltx/en_us_goadedes/miscellanea:misc.Ode5
ltx/en_us_goadedes/pe.d113:peMA.Ode5C12.text	The godly Teachers who bore the seal * of all-holy orders from on high, and who were legally authorized, * convened and decreed that You are God the Father’s Word, * the power and the wisdom of God, O Christ our God.
ltx/en_us_goadedes/pe.d113:peMA.Ode5C13.incipit	O Saints, you gave…
ltx/en_us_goadedes/pe.d113:peMA.Ode5C13.melody	@ltx/en_us_goadedes/he.h.m6:heHE.ToTheioFengeiSou.name
ltx/en_us_goadedes/pe.d113:peMA.Ode5C13.mode	@ltx/en_us_goadedes/miscellanea:misc.Mode6
ltx/en_us_goadedes/pe.d113:peMA.Ode5C13.ode	@ltx/en_us_goadedes/miscellanea:misc.Ode5
ltx/en_us_goadedes/pe.d113:peMA.Ode5C13.text	O Saints, you gave to the holy Church * the teaching of Christ as a drink of water coming from purest streams. * Now you are delighting beside the still waters * of heavenly repose, rejoicing forevermore.
ltx/en_us_goadedes/pe.d113:peMA.Ode5C1T.incipit	O only Virgin…
ltx/en_us_goadedes/pe.d113:peMA.Ode5C1T.melody	@ltx/en_us_goadedes/he.h.m6:heHE.ToTheioFengeiSou.name
ltx/en_us_goadedes/pe.d113:peMA.Ode5C1T.mode	@ltx/en_us_goadedes/miscellanea:misc.Mode6
ltx/en_us_goadedes/pe.d113:peMA.Ode5C1T.ode	@ltx/en_us_goadedes/miscellanea:misc.Ode5
ltx/en_us_goadedes/pe.d113:peMA.Ode5C1T.text	O only Virgin Mother of God, * we analogize you to a lamp, for you have brightly shone forth to all * Christ the Sun of Righteousness. O all-pure one, we pray * that you be our protectress, now and evermore.
ltx/en_us_goadedes/pe.d113:peMA.Ode6C11.greekmelody	@ltx/en_us_goadedes/he.h.m6:heHE.TouViouTinThalassan.greekname
ltx/en_us_goadedes/pe.d113:peMA.Ode6C11.incipit	That terrible heretic…
ltx/en_us_goadedes/pe.d113:peMA.Ode6C11.melody	@ltx/en_us_goadedes/he.h.m6:heHE.TouViouTinThalassan.name
ltx/en_us_goadedes/pe.d113:peMA.Ode6C11.mode	@ltx/en_us_goadedes/miscellanea:misc.Mode6
ltx/en_us_goadedes/pe.d113:peMA.Ode6C11.ode	@ltx/en_us_goadedes/miscellanea:misc.Ode6
ltx/en_us_goadedes/pe.d113:peMA.Ode6C11.text	That terrible heretic, * who sowed weeds within the Church, * could not escape the punishment * of inscrutable providence, for he burst * like Judas, when he became * a maniacal traitor to the Orthodox Faith.
ltx/en_us_goadedes/pe.d113:peMA.Ode6C12.incipit	The only-begotten Son…
ltx/en_us_goadedes/pe.d113:peMA.Ode6C12.melody	@ltx/en_us_goadedes/he.h.m6:heHE.TouViouTinThalassan.name
ltx/en_us_goadedes/pe.d113:peMA.Ode6C12.mode	@ltx/en_us_goadedes/miscellanea:misc.Mode6
ltx/en_us_goadedes/pe.d113:peMA.Ode6C12.ode	@ltx/en_us_goadedes/miscellanea:misc.Ode6
ltx/en_us_goadedes/pe.d113:peMA.Ode6C12.text	The only-begotten Son * and the radiance that shone * from God the Father’s essence, Lord, * and begotten before all ages, are You. * The Council of God-inspired * holy Fathers so believed and so decreed.
ltx/en_us_goadedes/pe.d113:peMA.Ode6C13.incipit	The belly of Arius…
ltx/en_us_goadedes/pe.d113:peMA.Ode6C13.melody	@ltx/en_us_goadedes/he.h.m6:heHE.TouViouTinThalassan.name
ltx/en_us_goadedes/pe.d113:peMA.Ode6C13.mode	@ltx/en_us_goadedes/miscellanea:misc.Mode6
ltx/en_us_goadedes/pe.d113:peMA.Ode6C13.ode	@ltx/en_us_goadedes/miscellanea:misc.Ode6
ltx/en_us_goadedes/pe.d113:peMA.Ode6C13.text	The belly of Arius, * who poured out a murky spring * of toxic, godless heresies, * providentially burst, as we have been told, * when prayers by the God-inspired * holy clergy acted as a sharpened plow.
ltx/en_us_goadedes/pe.d113:peMA.Ode6C1T.incipit	The great Prophet Moses…
ltx/en_us_goadedes/pe.d113:peMA.Ode6C1T.melody	@ltx/en_us_goadedes/he.h.m6:heHE.TouViouTinThalassan.name
ltx/en_us_goadedes/pe.d113:peMA.Ode6C1T.mode	@ltx/en_us_goadedes/miscellanea:misc.Mode6
ltx/en_us_goadedes/pe.d113:peMA.Ode6C1T.ode	@ltx/en_us_goadedes/miscellanea:misc.Ode6
ltx/en_us_goadedes/pe.d113:peMA.Ode6C1T.text	The great Prophet Moses wrote * in the Law concerning you, * the Ark and table, lamp and jar, * and depicted symbolically long ago * the Most High’s eventual * incarnation from you, O Virgin Mother of God.
ltx/en_us_goadedes/pe.d113:peMA.Ode7C11.greekmelody	@ltx/en_us_goadedes/he.h.m6:heHE.DrosovolonMenTinKaminon.greekname
ltx/en_us_goadedes/pe.d113:peMA.Ode7C11.incipit	Holy Fathers, You defeated…
ltx/en_us_goadedes/pe.d113:peMA.Ode7C11.melody	@ltx/en_us_goadedes/he.h.m6:heHE.DrosovolonMenTinKaminon.name
ltx/en_us_goadedes/pe.d113:peMA.Ode7C11.mode	@ltx/en_us_goadedes/miscellanea:misc.Mode6
ltx/en_us_goadedes/pe.d113:peMA.Ode7C11.ode	@ltx/en_us_goadedes/miscellanea:misc.Ode7
ltx/en_us_goadedes/pe.d113:peMA.Ode7C11.text	Holy Fathers, You defeated that maniacal * heretic, namely Arius, * who, synonymous now with madness, publicly pronounced * untruths about God, and to the Son * refused to sing, “O God of our fathers, blessed are You.”
ltx/en_us_goadedes/pe.d113:peMA.Ode7C12.incipit	Imitating John…
ltx/en_us_goadedes/pe.d113:peMA.Ode7C12.melody	@ltx/en_us_goadedes/he.h.m6:heHE.DrosovolonMenTinKaminon.name
ltx/en_us_goadedes/pe.d113:peMA.Ode7C12.mode	@ltx/en_us_goadedes/miscellanea:misc.Mode6
ltx/en_us_goadedes/pe.d113:peMA.Ode7C12.ode	@ltx/en_us_goadedes/miscellanea:misc.Ode7
ltx/en_us_goadedes/pe.d113:peMA.Ode7C12.text	Imitating John, that son of thunder, O inspired * fathers, with fiery mouths you teach * that the Logos is coeternal, coequal true God * from true God the Father, and that all * should cry aloud, “O God of our fathers, blessed are You.”
ltx/en_us_goadedes/pe.d113:peMA.Ode7C13.incipit	In defense of God the Logos…
ltx/en_us_goadedes/pe.d113:peMA.Ode7C13.melody	@ltx/en_us_goadedes/he.h.m6:heHE.DrosovolonMenTinKaminon.name
ltx/en_us_goadedes/pe.d113:peMA.Ode7C13.mode	@ltx/en_us_goadedes/miscellanea:misc.Mode6
ltx/en_us_goadedes/pe.d113:peMA.Ode7C13.ode	@ltx/en_us_goadedes/miscellanea:misc.Ode7
ltx/en_us_goadedes/pe.d113:peMA.Ode7C13.text	In defense of God the Logos, you O blessed of God, * arrived as if you flew in on wings. * For the Holy Spirit assembled you from every part * of civilization to convene * and cry aloud, “O God of our fathers, blessed are You.”
ltx/en_us_goadedes/pe.d113:peMA.Ode7C1T.incipit	When the furnace…
ltx/en_us_goadedes/pe.d113:peMA.Ode7C1T.melody	@ltx/en_us_goadedes/he.h.m6:heHE.DrosovolonMenTinKaminon.name
ltx/en_us_goadedes/pe.d113:peMA.Ode7C1T.mode	@ltx/en_us_goadedes/miscellanea:misc.Mode6
ltx/en_us_goadedes/pe.d113:peMA.Ode7C1T.ode	@ltx/en_us_goadedes/miscellanea:misc.Ode7
ltx/en_us_goadedes/pe.d113:peMA.Ode7C1T.text	When the furnace did not burn the three Young Men of old, * it prefigured your childbirth. * For the divine fire was inside you, and it burned you not, * enlightening everyone to sing * to you, “Blessed are you, who in the flesh gave birth to God.”
ltx/en_us_goadedes/pe.d113:peMA.Ode8C11.greekmelody	@ltx/en_us_goadedes/he.h.m6:heHE.EkFlogosToisOsiois.greekname
ltx/en_us_goadedes/pe.d113:peMA.Ode8C11.incipit	All ablaze with the rays…
ltx/en_us_goadedes/pe.d113:peMA.Ode8C11.melody	@ltx/en_us_goadedes/he.h.m6:heHE.EkFlogosToisOsiois.name
ltx/en_us_goadedes/pe.d113:peMA.Ode8C11.mode	@ltx/en_us_goadedes/miscellanea:misc.Mode6
ltx/en_us_goadedes/pe.d113:peMA.Ode8C11.ode	@ltx/en_us_goadedes/miscellanea:misc.Ode8
ltx/en_us_goadedes/pe.d113:peMA.Ode8C11.text	All ablaze with the rays of Your true divinity, * Your ordained godly Pastors confessed You and decreed * that You are the Lord who created the universe. * We exalt You beyond measure, unto all the ages.
ltx/en_us_goadedes/pe.d113:peMA.Ode8C12.incipit	That renowned host…
ltx/en_us_goadedes/pe.d113:peMA.Ode8C12.melody	@ltx/en_us_goadedes/he.h.m6:heHE.EkFlogosToisOsiois.name
ltx/en_us_goadedes/pe.d113:peMA.Ode8C12.mode	@ltx/en_us_goadedes/miscellanea:misc.Mode6
ltx/en_us_goadedes/pe.d113:peMA.Ode8C12.ode	@ltx/en_us_goadedes/miscellanea:misc.Ode8
ltx/en_us_goadedes/pe.d113:peMA.Ode8C12.text	That renowned host of Pastors, inspired by God, convened * to define the theology of the Trinity, * which is uncreated; and they taught all to sing, * “We exalt You beyond measure, unto all the ages.”
ltx/en_us_goadedes/pe.d113:peMA.Ode8C13.incipit	The illustrious Pastors…
ltx/en_us_goadedes/pe.d113:peMA.Ode8C13.melody	@ltx/en_us_goadedes/he.h.m6:heHE.EkFlogosToisOsiois.name
ltx/en_us_goadedes/pe.d113:peMA.Ode8C13.mode	@ltx/en_us_goadedes/miscellanea:misc.Mode6
ltx/en_us_goadedes/pe.d113:peMA.Ode8C13.ode	@ltx/en_us_goadedes/miscellanea:misc.Ode8
ltx/en_us_goadedes/pe.d113:peMA.Ode8C13.text	The illustrious Pastors and Hierarchs of Christ * are in various places, throughout all history, * shining in His holy Church, brightly and splendidly, * and exalting beyond measure, unto all the ages.
ltx/en_us_goadedes/pe.d113:peMA.Ode8C1T.incipit	All the Prophets…
ltx/en_us_goadedes/pe.d113:peMA.Ode8C1T.melody	@ltx/en_us_goadedes/he.h.m6:heHE.EkFlogosToisOsiois.name
ltx/en_us_goadedes/pe.d113:peMA.Ode8C1T.mode	@ltx/en_us_goadedes/miscellanea:misc.Mode6
ltx/en_us_goadedes/pe.d113:peMA.Ode8C1T.ode	@ltx/en_us_goadedes/miscellanea:misc.Ode8
ltx/en_us_goadedes/pe.d113:peMA.Ode8C1T.text	All the Prophets foresaw you in images of old, * and they mystically knew that the Logos would from you * be incarnate and in two natures come forth from you. * We exalt Him beyond measure, unto all the ages.
ltx/en_us_goadedes/pe.d113:peMA.Ode9C11.greekmelody	@ltx/en_us_goadedes/he.h.m6:heHE.TheonAnthropois.greekname
ltx/en_us_goadedes/pe.d113:peMA.Ode9C11.incipit	The Father’s coequal…
ltx/en_us_goadedes/pe.d113:peMA.Ode9C11.melody	@ltx/en_us_goadedes/he.h.m6:heHE.TheonAnthropois.name
ltx/en_us_goadedes/pe.d113:peMA.Ode9C11.mode	@ltx/en_us_goadedes/miscellanea:misc.Mode6
ltx/en_us_goadedes/pe.d113:peMA.Ode9C11.ode	@ltx/en_us_goadedes/miscellanea:misc.Ode9
ltx/en_us_goadedes/pe.d113:peMA.Ode9C11.text	The Father’s coequal, coeternal Word * and Son, whom He begot before all ages, considered you * to be allies of His and assembled you, * armed with Spirit’s power. * All-holy fathers, now * joining the celestial hosts, you glorify Him evermore.
ltx/en_us_goadedes/pe.d113:peMA.Ode9C12.incipit	You stopped the spread…
ltx/en_us_goadedes/pe.d113:peMA.Ode9C12.melody	@ltx/en_us_goadedes/he.h.m6:heHE.TheonAnthropois.name
ltx/en_us_goadedes/pe.d113:peMA.Ode9C12.mode	@ltx/en_us_goadedes/miscellanea:misc.Mode6
ltx/en_us_goadedes/pe.d113:peMA.Ode9C12.ode	@ltx/en_us_goadedes/miscellanea:misc.Ode9
ltx/en_us_goadedes/pe.d113:peMA.Ode9C12.text	You stopped the spread of the awful heresy * of Arius, O fathers, when you published the holy Creed * of the Orthodox Faith, which we have thanks to you, * healers of souls and bodies. * Now, holy Hierarchs, * evermore we celebrate and glorify your memory.
ltx/en_us_goadedes/pe.d113:peMA.Ode9C13.incipit	Since You, O Christ…
ltx/en_us_goadedes/pe.d113:peMA.Ode9C13.melody	@ltx/en_us_goadedes/he.h.m6:heHE.TheonAnthropois.name
ltx/en_us_goadedes/pe.d113:peMA.Ode9C13.mode	@ltx/en_us_goadedes/miscellanea:misc.Mode6
ltx/en_us_goadedes/pe.d113:peMA.Ode9C13.ode	@ltx/en_us_goadedes/miscellanea:misc.Ode9
ltx/en_us_goadedes/pe.d113:peMA.Ode9C13.text	Since You, O Christ, are most pure and holy light, * please free me from the darkness of the passions that plague my soul, * at the intercessions of Your priests who proclaimed * You to be uncreated * and unoriginate * with the Father, Lord and God, Creator of the universe.
ltx/en_us_goadedes/pe.d113:peMA.Ode9C1T.incipit	Now resurrection…
ltx/en_us_goadedes/pe.d113:peMA.Ode9C1T.melody	@ltx/en_us_goadedes/he.h.m6:heHE.TheonAnthropois.name
ltx/en_us_goadedes/pe.d113:peMA.Ode9C1T.mode	@ltx/en_us_goadedes/miscellanea:misc.Mode6
ltx/en_us_goadedes/pe.d113:peMA.Ode9C1T.ode	@ltx/en_us_goadedes/miscellanea:misc.Ode9
ltx/en_us_goadedes/pe.d113:peMA.Ode9C1T.text	Now resurrection is granted to the dead, * through your incomprehensible, ineffable childbirth, * Lady Theotokos; for from you did Life * put on a human body, * shine forth on everyone, * and dispel the somberness death for all eternity.
ltx/en_us_goadedes/pe.d113:peMA.Oikos1.text	@ltx/en_us_goadedes/me.m07.dHF:meMA.Oikos1.text
ltx/en_us_goadedes/pe.d113:peSY.commemoration.couplet1.title	@ltx/en_us_goadedes/titles:ti.Verses
ltx/en_us_goadedes/pe.d113:peSY.commemoration.couplet1.verse1	
ltx/en_us_goadedes/pe.d113:peSY.commemoration.couplet1.verse2	
ltx/en_us_goadedes/pe.d113:peSY.commemoration.couplet2.title	
ltx/en_us_goadedes/pe.d113:peSY.commemoration.couplet2.verse1	
ltx/en_us_goadedes/pe.d113:peSY.commemoration.couplet2.verse2	
ltx/en_us_goadedes/pe.d113:peSY.commemoration.narration.p01	
ltx/en_us_goadedes/pe.d113:peSY.commemoration.narration.p02	
ltx/en_us_goadedes/pe.d113:peSY.commemoration.narration.p03	
ltx/en_us_goadedes/pe.d113:peSY.commemoration.narration.p04	
ltx/en_us_goadedes/pe.d113:peSY.commemoration.narration.p05	
ltx/en_us_goadedes/pe.d113:peSY.commemoration.narration.p06	
ltx/en_us_goadedes/pe.d113:peSY.commemoration.narration.p07	
ltx/en_us_goadedes/pe.d113:peSY.commemoration.text	
ltx/en_us_goadedes/pe.d113:peSY.lastline	
ltx/en_us_goadedes/pe.d113:peVE.Apolytikion1.incipit	@ltx/en_us_goadedes/oc.m6.d1:ocVE.Apolytikion.incipit
ltx/en_us_goadedes/pe.d113:peVE.Apolytikion1.melody	
ltx/en_us_goadedes/pe.d113:peVE.Apolytikion1.mode	@ltx/en_us_goadedes/miscellanea:misc.Mode6
ltx/en_us_goadedes/pe.d113:peVE.Apolytikion1.text	@ltx/en_us_goadedes/oc.m6.d1:ocVE.Apolytikion.text
ltx/en_us_goadedes/pe.d113:peVE.Apolytikion2.incipit	@ltx/en_us_goadedes/me.m07.dHF:meVE.Apolytikion1.incipit
ltx/en_us_goadedes/pe.d113:peVE.Apolytikion2.melody	
ltx/en_us_goadedes/pe.d113:peVE.Apolytikion2.mode	@ltx/en_us_goadedes/miscellanea:misc.Mode8
ltx/en_us_goadedes/pe.d113:peVE.Apolytikion2.text	@ltx/en_us_goadedes/me.m07.dHF:meVE.Apolytikion1.text
ltx/en_us_goadedes/pe.d113:peVE.Apolytikion3.incipit	@ltx/en_us_goadedes/pe.d110:peVE.Apolytikion1.incipit
ltx/en_us_goadedes/pe.d113:peVE.Apolytikion3.melody	
ltx/en_us_goadedes/pe.d113:peVE.Apolytikion3.mode	@ltx/en_us_goadedes/miscellanea:misc.Mode4
ltx/en_us_goadedes/pe.d113:peVE.Apolytikion3.text	@ltx/en_us_goadedes/pe.d110:peVE.Apolytikion1.text
ltx/en_us_goadedes/pe.d113:peVE.AposBoth.incipit	@ltx/en_us_goadedes/pe.d110:peVE.LityGlory.incipit
ltx/en_us_goadedes/pe.d113:peVE.AposBoth.melody	@ltx/en_us_goadedes/miscellanea:misc.Idiomelon
ltx/en_us_goadedes/pe.d113:peVE.AposBoth.mode	@ltx/en_us_goadedes/miscellanea:misc.Mode4
ltx/en_us_goadedes/pe.d113:peVE.AposBoth.text	@ltx/en_us_goadedes/pe.d110:peVE.LityGlory.text
ltx/en_us_goadedes/pe.d113:peVE.AposGlory.incipit	@ltx/en_us_goadedes/me.m10.dHF:meVE.AposGlory.incipit
ltx/en_us_goadedes/pe.d113:peVE.AposGlory.melody	@ltx/en_us_goadedes/miscellanea:misc.Idiomelon
ltx/en_us_goadedes/pe.d113:peVE.AposGlory.mode	@ltx/en_us_goadedes/miscellanea:misc.Mode4
ltx/en_us_goadedes/pe.d113:peVE.AposGlory.text	@ltx/en_us_goadedes/me.m10.dHF:meVE.AposGlory.text
ltx/en_us_goadedes/pe.d113:peVE.LityBoth.incipit	@ltx/en_us_goadedes/pe.d110:peVE.Stichera05.incipit
ltx/en_us_goadedes/pe.d113:peVE.LityBoth.melody	@ltx/en_us_goadedes/miscellanea:misc.Idiomelon
ltx/en_us_goadedes/pe.d113:peVE.LityBoth.mode	@ltx/en_us_goadedes/miscellanea:misc.Mode6
ltx/en_us_goadedes/pe.d113:peVE.LityBoth.text	@ltx/en_us_goadedes/pe.d110:peVE.Stichera05.text
ltx/en_us_goadedes/pe.d113:peVE.LityGlory.incipit	@ltx/en_us_goadedes/me.m07.dHF:meVE.AposGlory.incipit
ltx/en_us_goadedes/pe.d113:peVE.LityGlory.melody	@ltx/en_us_goadedes/miscellanea:misc.Idiomelon
ltx/en_us_goadedes/pe.d113:peVE.LityGlory.mode	@ltx/en_us_goadedes/miscellanea:misc.Mode3
ltx/en_us_goadedes/pe.d113:peVE.LityGlory.text	@ltx/en_us_goadedes/me.m07.dHF:meVE.AposGlory.text
ltx/en_us_goadedes/pe.d113:peVE.MM.Stichera789as567.text	
ltx/en_us_goadedes/pe.d113:peVE.SticGlory.incipit	@ltx/en_us_goadedes/me.m10.dHF:meVE.SticGlory.incipit
ltx/en_us_goadedes/pe.d113:peVE.SticGlory.melody	@ltx/en_us_goadedes/miscellanea:misc.Idiomelon
ltx/en_us_goadedes/pe.d113:peVE.SticGlory.mode	@ltx/en_us_goadedes/miscellanea:misc.Mode6
ltx/en_us_goadedes/pe.d113:peVE.SticGlory.text	@ltx/en_us_goadedes/me.m10.dHF:meVE.SticGlory.text
ltx/en_us_goadedes/pe.d113:peVE.Stichera04.incipit	@ltx/en_us_goadedes/pe.d110:peVE.Stichera01.incipit
ltx/en_us_goadedes/pe.d113:peVE.Stichera04.melody	@ltx/en_us_goadedes/miscellanea:misc.Idiomelon
ltx/en_us_goadedes/pe.d113:peVE.Stichera04.mode	@ltx/en_us_goadedes/miscellanea:misc.Mode6
ltx/en_us_goadedes/pe.d113:peVE.Stichera04.text	@ltx/en_us_goadedes/pe.d110:peVE.Stichera01.text
ltx/en_us_goadedes/pe.d113:peVE.Stichera05.incipit	@ltx/en_us_goadedes/pe.d110:peVE.Stichera02.incipit
ltx/en_us_goadedes/pe.d113:peVE.Stichera05.melody	@ltx/en_us_goadedes/miscellanea:misc.Idiomelon
ltx/en_us_goadedes/pe.d113:peVE.Stichera05.mode	@ltx/en_us_goadedes/miscellanea:misc.Mode6
ltx/en_us_goadedes/pe.d113:peVE.Stichera05.text	@ltx/en_us_goadedes/pe.d110:peVE.Stichera02.text
ltx/en_us_goadedes/pe.d113:peVE.Stichera06.incipit	@ltx/en_us_goadedes/pe.d110:peVE.Stichera03.incipit
ltx/en_us_goadedes/pe.d113:peVE.Stichera06.melody	@ltx/en_us_goadedes/miscellanea:misc.Idiomelon
ltx/en_us_goadedes/pe.d113:peVE.Stichera06.mode	@ltx/en_us_goadedes/miscellanea:misc.Mode6
ltx/en_us_goadedes/pe.d113:peVE.Stichera06.text	@ltx/en_us_goadedes/pe.d110:peVE.Stichera03.text
ltx/en_us_goadedes/pe.d113:peVE.Stichera07.greekmelody	@ltx/en_us_goadedes/he.a.m6:heAU.IApegnosmeni.greekname
ltx/en_us_goadedes/pe.d113:peVE.Stichera07.incipit	From the womb You came forth…
ltx/en_us_goadedes/pe.d113:peVE.Stichera07.melody	@ltx/en_us_goadedes/he.a.m6:heAU.IApegnosmeni.name
ltx/en_us_goadedes/pe.d113:peVE.Stichera07.mode	@ltx/en_us_goadedes/miscellanea:misc.Mode6
ltx/en_us_goadedes/pe.d113:peVE.Stichera07.text	From the womb You came forth, although begotten * from Your Father motherless before the ages. * But Arius thought of You not as God but as creature, * foolishly daring to confuse You the Creator with creatures; * and thus he laid up for himself the fuel for eternal fire. * But the holy Council in Nicea * proclaimed that You are the Son of God and share the throne * with the Father and the Spirit, O Lord.
ltx/en_us_goadedes/pe.d113:peVE.Stichera08.greekmelody	@ltx/en_us_goadedes/he.a.m6:heAU.IApegnosmeni.greekname
ltx/en_us_goadedes/pe.d113:peVE.Stichera08.incipit	Who is it, O Savior…
ltx/en_us_goadedes/pe.d113:peVE.Stichera08.melody	@ltx/en_us_goadedes/he.a.m6:heAU.IApegnosmeni.name
ltx/en_us_goadedes/pe.d113:peVE.Stichera08.mode	@ltx/en_us_goadedes/miscellanea:misc.Mode6
ltx/en_us_goadedes/pe.d113:peVE.Stichera08.text	Who is it, O Savior, that rent Your garment? * “Arius,” You said, who creates divisions, * dividing the Trinity’s equipotent dominion. * He rejected You as being one of the Trinity’s persons. * He teaches Nestorius not to use the term Theotokos. * But the holy Council in Nicea * proclaimed that You are the Son of God and share the throne * with the Father and the Spirit, O Lord.
ltx/en_us_goadedes/pe.d113:peVE.Stichera09.incipit	Arius fell off the cliff…
ltx/en_us_goadedes/pe.d113:peVE.Stichera09.melody	@ltx/en_us_goadedes/he.a.m6:heAU.IApegnosmeni.name
ltx/en_us_goadedes/pe.d113:peVE.Stichera09.mode	@ltx/en_us_goadedes/miscellanea:misc.Mode6
ltx/en_us_goadedes/pe.d113:peVE.Stichera09.text	Arius fell off the cliff of transgression, * for he closed his eyes so as not to see light. * And his bowels were rent asunder by the divine trident, * and he violently hemorrhaged his soul and all his being, * for he had become like Judas, in both attitude and manner. * But the holy Council in Nicea * proclaimed that You are the Son of God and share the throne * with the Father and the Spirit, O Lord.
ltx/en_us_goadedes/pe.d113:peVE.Stichera10.incipit	Arius the fool introduced…
ltx/en_us_goadedes/pe.d113:peVE.Stichera10.melody	@ltx/en_us_goadedes/he.a.m6:heAU.IApegnosmeni.name
ltx/en_us_goadedes/pe.d113:peVE.Stichera10.mode	@ltx/en_us_goadedes/miscellanea:misc.Mode6
ltx/en_us_goadedes/pe.d113:peVE.Stichera10.text	Arius the fool introduced division * into the holy Trinity’s single kingship, * asserting three dissimilar and alien natures. * Therefore the God-bearing fathers convened in the holy Council * burning with zeal for God, like the Prophet Elijah the Tishbite, * and they wielded the sword of the Spirit, * and they cut off that shameful teacher of blasphemy, * according to what the Spirit decreed.
