ltx/en_us_goadedes/me.m11.d25:meDA.commemoration.first	
ltx/en_us_goadedes/me.m11.d25:meDA.commemoration.first_name	St. Catherine
ltx/en_us_goadedes/me.m11.d25:meDA.commemoration.first_short	
ltx/en_us_goadedes/me.m11.d25:meDA.commemoration.first_title	For St. Catherine.
ltx/en_us_goadedes/me.m11.d25:meDA.commemoration.full	
ltx/en_us_goadedes/me.m11.d25:meDA.commemoration.second_name	
ltx/en_us_goadedes/me.m11.d25:meDA.commemoration.second_title	For St. Mercury.
ltx/en_us_goadedes/me.m11.d25:meDA.date	
ltx/en_us_goadedes/me.m11.d25:meDA.fordate	
ltx/en_us_goadedes/me.m11.d25:meDA.insert1	
ltx/en_us_goadedes/me.m11.d25:meDA.insert2	
ltx/en_us_goadedes/me.m11.d25:meDA.note	
ltx/en_us_goadedes/me.m11.d25:meDA.pdfcoverdate	
ltx/en_us_goadedes/me.m11.d25:meDA.pdfheaderdate	
ltx/en_us_goadedes/me.m11.d25:meHO.commemorations	
ltx/en_us_goadedes/me.m11.d25:meHO.note1	
ltx/en_us_goadedes/me.m11.d25:meHO.note2	
ltx/en_us_goadedes/me.m11.d25:meHO.number	
ltx/en_us_goadedes/me.m11.d25:meHO.rank	
ltx/en_us_goadedes/me.m11.d25:meLE.commemoration1	
ltx/en_us_goadedes/me.m11.d25:meLE.commemoration2	
ltx/en_us_goadedes/me.m11.d25:meLI.Kontakion1.greekmelody	@ltx/en_us_goadedes/me.m11.d25:meMA.Kontakion1.greekmelody
ltx/en_us_goadedes/me.m11.d25:meLI.Kontakion1.incipit	@ltx/en_us_goadedes/me.m11.d25:meMA.Kontakion1.incipit
ltx/en_us_goadedes/me.m11.d25:meLI.Kontakion1.melody	@ltx/en_us_goadedes/me.m11.d25:meMA.Kontakion1.melody
ltx/en_us_goadedes/me.m11.d25:meLI.Kontakion1.mode	@ltx/en_us_goadedes/me.m11.d25:meMA.Kontakion1.mode
ltx/en_us_goadedes/me.m11.d25:meLI.Kontakion1.text	@ltx/en_us_goadedes/me.m11.d25:meMA.Kontakion1.text
ltx/en_us_goadedes/me.m11.d25:meLI.MM.CommunionHymn.text	@ltx/en_us_goadedes/properties:media.key
ltx/en_us_goadedes/me.m11.d25:meLI.Megalynarion.text	You, the famous bride of the Savior Christ, * shine with all the glory of virginity and the bright * beauty of your wisdom, O virgin martyr Catherine, * and celebrated victories of your martyrdom.
ltx/en_us_goadedes/me.m11.d25:meLI.Megalynarion2.text	
ltx/en_us_goadedes/me.m11.d25:meLI.TheotokosHymn.incipit	…
ltx/en_us_goadedes/me.m11.d25:meLI.TheotokosHymn.mode	
ltx/en_us_goadedes/me.m11.d25:meLI.TheotokosHymn.text	
ltx/en_us_goadedes/me.m11.d25:meLI.TheotokosHymnVerse.incipit	…
ltx/en_us_goadedes/me.m11.d25:meLI.TheotokosHymnVerse.text	
ltx/en_us_goadedes/me.m11.d25:meMA.C1.acrostic.notice1	
ltx/en_us_goadedes/me.m11.d25:meMA.C1.acrostic.text	
ltx/en_us_goadedes/me.m11.d25:meMA.C1.acrostic.title	Canon for St. Catherine.
ltx/en_us_goadedes/me.m11.d25:meMA.C1.poet	@ltx/en_us_goadedes/poets:po.Theofanous
ltx/en_us_goadedes/me.m11.d25:meMA.C1.title	@ltx/en_us_goadedes/titles:ti.CanonSaintW
ltx/en_us_goadedes/me.m11.d25:meMA.C1.verse	@ltx/en_us_goadedes/prayers:pr.verse_SaintW.text
ltx/en_us_goadedes/me.m11.d25:meMA.C2.acrostic.notice1	
ltx/en_us_goadedes/me.m11.d25:meMA.C2.acrostic.text	
ltx/en_us_goadedes/me.m11.d25:meMA.C2.acrostic.title	Canon for St. Mercury.
ltx/en_us_goadedes/me.m11.d25:meMA.C2.title	@ltx/en_us_goadedes/titles:ti.CanonSaintM
ltx/en_us_goadedes/me.m11.d25:meMA.C2.verse	@ltx/en_us_goadedes/prayers:pr.verse_SaintM.text
ltx/en_us_goadedes/me.m11.d25:meMA.Exaposteilarion1.greekmelody	@ltx/en_us_goadedes/he.a.m3:heAU.EnPnevmatiToIero.greekname
ltx/en_us_goadedes/me.m11.d25:meMA.Exaposteilarion1.incipit	…
ltx/en_us_goadedes/me.m11.d25:meMA.Exaposteilarion1.melody	@ltx/en_us_goadedes/he.a.m3:heAU.EnPnevmatiToIero.name
ltx/en_us_goadedes/me.m11.d25:meMA.Exaposteilarion1.mode	@ltx/en_us_goadedes/miscellanea:misc.Mode3
ltx/en_us_goadedes/me.m11.d25:meMA.Exaposteilarion1.text	
ltx/en_us_goadedes/me.m11.d25:meMA.Exaposteilarion2.greekmelody	@ltx/en_us_goadedes/he.a.m3:heAU.EnPnevmatiToIero.greekname
ltx/en_us_goadedes/me.m11.d25:meMA.Exaposteilarion2.incipit	…
ltx/en_us_goadedes/me.m11.d25:meMA.Exaposteilarion2.melody	@ltx/en_us_goadedes/he.a.m3:heAU.EnPnevmatiToIero.name
ltx/en_us_goadedes/me.m11.d25:meMA.Exaposteilarion2.mode	@ltx/en_us_goadedes/miscellanea:misc.Mode3
ltx/en_us_goadedes/me.m11.d25:meMA.Exaposteilarion2.text	
ltx/en_us_goadedes/me.m11.d25:meMA.Exaposteilarion3.greekmelody	@ltx/en_us_goadedes/he.a.m3:heAU.EnPnevmatiToIero.greekname
ltx/en_us_goadedes/me.m11.d25:meMA.Exaposteilarion3.incipit	@ltx/en_us_goadedes/me.m11.d23:meMA.Exaposteilarion2.incipit
ltx/en_us_goadedes/me.m11.d25:meMA.Exaposteilarion3.melody	@ltx/en_us_goadedes/he.a.m3:heAU.EnPnevmatiToIero.name
ltx/en_us_goadedes/me.m11.d25:meMA.Exaposteilarion3.mode	@ltx/en_us_goadedes/miscellanea:misc.Mode3
ltx/en_us_goadedes/me.m11.d25:meMA.Exaposteilarion3.text	@ltx/en_us_goadedes/me.m11.d23:meMA.Exaposteilarion2.text
ltx/en_us_goadedes/me.m11.d25:meMA.Kathisma11.greekmelody	@ltx/en_us_goadedes/he.a.m1:heAU.TonTafonSouSotir.greekname
ltx/en_us_goadedes/me.m11.d25:meMA.Kathisma11.incipit	…
ltx/en_us_goadedes/me.m11.d25:meMA.Kathisma11.melody	@ltx/en_us_goadedes/he.a.m1:heAU.TonTafonSouSotir.name
ltx/en_us_goadedes/me.m11.d25:meMA.Kathisma11.mode	@ltx/en_us_goadedes/miscellanea:misc.Mode1
ltx/en_us_goadedes/me.m11.d25:meMA.Kathisma11.text	
ltx/en_us_goadedes/me.m11.d25:meMA.Kathisma12.greekmelody	@ltx/en_us_goadedes/he.a.m1:heAU.TonTafonSouSotir.greekname
ltx/en_us_goadedes/me.m11.d25:meMA.Kathisma12.incipit	@ltx/en_us_goadedes/me.m11.d21:meMA.Kathisma11.incipit
ltx/en_us_goadedes/me.m11.d25:meMA.Kathisma12.melody	@ltx/en_us_goadedes/he.a.m1:heAU.TonTafonSouSotir.name
ltx/en_us_goadedes/me.m11.d25:meMA.Kathisma12.mode	@ltx/en_us_goadedes/miscellanea:misc.Mode1
ltx/en_us_goadedes/me.m11.d25:meMA.Kathisma12.text	@ltx/en_us_goadedes/me.m11.d21:meMA.Kathisma11.text
ltx/en_us_goadedes/me.m11.d25:meMA.Kathisma21.greekmelody	@ltx/en_us_goadedes/he.a.m4:heAU.KateplagiIosif.greekname
ltx/en_us_goadedes/me.m11.d25:meMA.Kathisma21.incipit	…
ltx/en_us_goadedes/me.m11.d25:meMA.Kathisma21.melody	@ltx/en_us_goadedes/he.a.m4:heAU.KateplagiIosif.name
ltx/en_us_goadedes/me.m11.d25:meMA.Kathisma21.mode	@ltx/en_us_goadedes/miscellanea:misc.Mode4
ltx/en_us_goadedes/me.m11.d25:meMA.Kathisma21.text	
ltx/en_us_goadedes/me.m11.d25:meMA.Kathisma22.greekmelody	@ltx/en_us_goadedes/he.a.m4:heAU.KateplagiIosif.greekname
ltx/en_us_goadedes/me.m11.d25:meMA.Kathisma22.incipit	@ltx/en_us_goadedes/me.m11.d21:meMA.Kathisma21.incipit
ltx/en_us_goadedes/me.m11.d25:meMA.Kathisma22.melody	@ltx/en_us_goadedes/he.a.m4:heAU.KateplagiIosif.name
ltx/en_us_goadedes/me.m11.d25:meMA.Kathisma22.mode	@ltx/en_us_goadedes/miscellanea:misc.Mode4
ltx/en_us_goadedes/me.m11.d25:meMA.Kathisma22.text	@ltx/en_us_goadedes/me.m11.d21:meMA.Kathisma21.text
ltx/en_us_goadedes/me.m11.d25:meMA.Kathisma31.greekmelody	@ltx/en_us_goadedes/he.a.m8:heAU.ToProstachthen.greekname
ltx/en_us_goadedes/me.m11.d25:meMA.Kathisma31.incipit	…
ltx/en_us_goadedes/me.m11.d25:meMA.Kathisma31.melody	@ltx/en_us_goadedes/he.a.m8:heAU.ToProstachthen.name
ltx/en_us_goadedes/me.m11.d25:meMA.Kathisma31.mode	@ltx/en_us_goadedes/miscellanea:misc.Mode8
ltx/en_us_goadedes/me.m11.d25:meMA.Kathisma31.text	
ltx/en_us_goadedes/me.m11.d25:meMA.Kathisma32.greekmelody	@ltx/en_us_goadedes/he.a.m8:heAU.ToProstachthen.greekname
ltx/en_us_goadedes/me.m11.d25:meMA.Kathisma32.incipit	@ltx/en_us_goadedes/me.m11.d21:meMA.Kathisma31.incipit
ltx/en_us_goadedes/me.m11.d25:meMA.Kathisma32.melody	@ltx/en_us_goadedes/he.a.m8:heAU.ToProstachthen.name
ltx/en_us_goadedes/me.m11.d25:meMA.Kathisma32.mode	@ltx/en_us_goadedes/miscellanea:misc.Mode8
ltx/en_us_goadedes/me.m11.d25:meMA.Kathisma32.text	@ltx/en_us_goadedes/me.m11.d21:meMA.Kathisma31.text
ltx/en_us_goadedes/me.m11.d25:meMA.Kontakion1.greekmelody	@ltx/en_us_goadedes/he.a.m2:heAU.TaAnoZiton.greekname
ltx/en_us_goadedes/me.m11.d25:meMA.Kontakion1.incipit	…
ltx/en_us_goadedes/me.m11.d25:meMA.Kontakion1.melody	@ltx/en_us_goadedes/he.a.m2:heAU.TaAnoZiton.name
ltx/en_us_goadedes/me.m11.d25:meMA.Kontakion1.mode	@ltx/en_us_goadedes/miscellanea:misc.Mode2
ltx/en_us_goadedes/me.m11.d25:meMA.Kontakion1.text	
ltx/en_us_goadedes/me.m11.d25:meMA.Lauds1.greekmelody	@ltx/en_us_goadedes/he.a.m1:heAU.TonOuranionTagmaton.greekname
ltx/en_us_goadedes/me.m11.d25:meMA.Lauds1.incipit	@ltx/en_us_goadedes/me.m11.d21:meMA.Lauds1.incipit
ltx/en_us_goadedes/me.m11.d25:meMA.Lauds1.melody	@ltx/en_us_goadedes/he.a.m1:heAU.TonOuranionTagmaton.name
ltx/en_us_goadedes/me.m11.d25:meMA.Lauds1.mode	@ltx/en_us_goadedes/miscellanea:misc.Mode1
ltx/en_us_goadedes/me.m11.d25:meMA.Lauds1.text	@ltx/en_us_goadedes/me.m11.d21:meMA.Lauds1.text
ltx/en_us_goadedes/me.m11.d25:meMA.Lauds2.incipit	@ltx/en_us_goadedes/me.m11.d21:meMA.Lauds2.incipit
ltx/en_us_goadedes/me.m11.d25:meMA.Lauds2.melody	@ltx/en_us_goadedes/he.a.m1:heAU.TonOuranionTagmaton.name
ltx/en_us_goadedes/me.m11.d25:meMA.Lauds2.mode	@ltx/en_us_goadedes/miscellanea:misc.Mode1
ltx/en_us_goadedes/me.m11.d25:meMA.Lauds2.text	@ltx/en_us_goadedes/me.m11.d21:meMA.Lauds2.text
ltx/en_us_goadedes/me.m11.d25:meMA.Lauds3.incipit	@ltx/en_us_goadedes/me.m11.d21:meMA.Lauds3.incipit
ltx/en_us_goadedes/me.m11.d25:meMA.Lauds3.melody	@ltx/en_us_goadedes/he.a.m1:heAU.TonOuranionTagmaton.name
ltx/en_us_goadedes/me.m11.d25:meMA.Lauds3.mode	@ltx/en_us_goadedes/miscellanea:misc.Mode1
ltx/en_us_goadedes/me.m11.d25:meMA.Lauds3.text	@ltx/en_us_goadedes/me.m11.d21:meMA.Lauds3.text
ltx/en_us_goadedes/me.m11.d25:meMA.Lauds4.greekmelody	@ltx/en_us_goadedes/he.a.m4:heAU.EdokasSimeiosin.greekname
ltx/en_us_goadedes/me.m11.d25:meMA.Lauds4.incipit	…
ltx/en_us_goadedes/me.m11.d25:meMA.Lauds4.melody	@ltx/en_us_goadedes/he.a.m4:heAU.EdokasSimeiosin.name
ltx/en_us_goadedes/me.m11.d25:meMA.Lauds4.mode	@ltx/en_us_goadedes/miscellanea:misc.Mode4
ltx/en_us_goadedes/me.m11.d25:meMA.Lauds4.text	
ltx/en_us_goadedes/me.m11.d25:meMA.Lauds5.incipit	…
ltx/en_us_goadedes/me.m11.d25:meMA.Lauds5.melody	@ltx/en_us_goadedes/he.a.m4:heAU.EdokasSimeiosin.name
ltx/en_us_goadedes/me.m11.d25:meMA.Lauds5.mode	@ltx/en_us_goadedes/miscellanea:misc.Mode4
ltx/en_us_goadedes/me.m11.d25:meMA.Lauds5.text	
ltx/en_us_goadedes/me.m11.d25:meMA.Lauds6.incipit	…
ltx/en_us_goadedes/me.m11.d25:meMA.Lauds6.melody	@ltx/en_us_goadedes/he.a.m4:heAU.EdokasSimeiosin.name
ltx/en_us_goadedes/me.m11.d25:meMA.Lauds6.mode	@ltx/en_us_goadedes/miscellanea:misc.Mode4
ltx/en_us_goadedes/me.m11.d25:meMA.Lauds6.text	
ltx/en_us_goadedes/me.m11.d25:meMA.LaudsBoth.incipit	@ltx/en_us_goadedes/me.m11.d21:meMA.LaudsGlory.incipit
ltx/en_us_goadedes/me.m11.d25:meMA.LaudsBoth.melody	
ltx/en_us_goadedes/me.m11.d25:meMA.LaudsBoth.mode	@ltx/en_us_goadedes/miscellanea:misc.Mode2
ltx/en_us_goadedes/me.m11.d25:meMA.LaudsBoth.text	@ltx/en_us_goadedes/me.m11.d21:meMA.LaudsGlory.text
ltx/en_us_goadedes/me.m11.d25:meMA.LaudsGlory.incipit	@ltx/en_us_goadedes/me.m11.d25:meVE.AposGlory.incipit
ltx/en_us_goadedes/me.m11.d25:meMA.LaudsGlory.melody	
ltx/en_us_goadedes/me.m11.d25:meMA.LaudsGlory.mode	@ltx/en_us_goadedes/miscellanea:misc.Mode2
ltx/en_us_goadedes/me.m11.d25:meMA.LaudsGlory.text	@ltx/en_us_goadedes/me.m11.d25:meVE.AposGlory.text
ltx/en_us_goadedes/me.m11.d25:meMA.MM.Lauds123as123.text	@ltx/en_us_goadedes/properties:media.key
ltx/en_us_goadedes/me.m11.d25:meMA.MM.Lauds12as45.text	@ltx/en_us_goadedes/properties:media.key
ltx/en_us_goadedes/me.m11.d25:meMA.MM.Lauds456as678.text	@ltx/en_us_goadedes/properties:media.key
ltx/en_us_goadedes/me.m11.d25:meMA.Ode1C11.greekmelody	@ltx/en_us_goadedes/he.h.m8:heHE.ArmatilatinFarao.greekname
ltx/en_us_goadedes/me.m11.d25:meMA.Ode1C11.incipit	…
ltx/en_us_goadedes/me.m11.d25:meMA.Ode1C11.melody	@ltx/en_us_goadedes/he.h.m8:heHE.ArmatilatinFarao.name
ltx/en_us_goadedes/me.m11.d25:meMA.Ode1C11.mode	@ltx/en_us_goadedes/miscellanea:misc.Mode8
ltx/en_us_goadedes/me.m11.d25:meMA.Ode1C11.ode	@ltx/en_us_goadedes/miscellanea:misc.Ode1
ltx/en_us_goadedes/me.m11.d25:meMA.Ode1C11.text	
ltx/en_us_goadedes/me.m11.d25:meMA.Ode1C12.incipit	…
ltx/en_us_goadedes/me.m11.d25:meMA.Ode1C12.melody	@ltx/en_us_goadedes/he.h.m8:heHE.ArmatilatinFarao.name
ltx/en_us_goadedes/me.m11.d25:meMA.Ode1C12.mode	@ltx/en_us_goadedes/miscellanea:misc.Mode8
ltx/en_us_goadedes/me.m11.d25:meMA.Ode1C12.ode	@ltx/en_us_goadedes/miscellanea:misc.Ode1
ltx/en_us_goadedes/me.m11.d25:meMA.Ode1C12.text	
ltx/en_us_goadedes/me.m11.d25:meMA.Ode1C13.incipit	…
ltx/en_us_goadedes/me.m11.d25:meMA.Ode1C13.melody	@ltx/en_us_goadedes/he.h.m8:heHE.ArmatilatinFarao.name
ltx/en_us_goadedes/me.m11.d25:meMA.Ode1C13.mode	@ltx/en_us_goadedes/miscellanea:misc.Mode8
ltx/en_us_goadedes/me.m11.d25:meMA.Ode1C13.ode	@ltx/en_us_goadedes/miscellanea:misc.Ode1
ltx/en_us_goadedes/me.m11.d25:meMA.Ode1C13.text	
ltx/en_us_goadedes/me.m11.d25:meMA.Ode1C14.incipit	…
ltx/en_us_goadedes/me.m11.d25:meMA.Ode1C14.melody	@ltx/en_us_goadedes/he.h.m8:heHE.ArmatilatinFarao.name
ltx/en_us_goadedes/me.m11.d25:meMA.Ode1C14.mode	@ltx/en_us_goadedes/miscellanea:misc.Mode8
ltx/en_us_goadedes/me.m11.d25:meMA.Ode1C14.ode	@ltx/en_us_goadedes/miscellanea:misc.Ode1
ltx/en_us_goadedes/me.m11.d25:meMA.Ode1C14.text	
ltx/en_us_goadedes/me.m11.d25:meMA.Ode1C1T.incipit	…
ltx/en_us_goadedes/me.m11.d25:meMA.Ode1C1T.melody	@ltx/en_us_goadedes/he.h.m8:heHE.ArmatilatinFarao.name
ltx/en_us_goadedes/me.m11.d25:meMA.Ode1C1T.mode	@ltx/en_us_goadedes/miscellanea:misc.Mode8
ltx/en_us_goadedes/me.m11.d25:meMA.Ode1C1T.ode	@ltx/en_us_goadedes/miscellanea:misc.Ode1
ltx/en_us_goadedes/me.m11.d25:meMA.Ode1C1T.text	
ltx/en_us_goadedes/me.m11.d25:meMA.Ode1C21.greekmelody	@ltx/en_us_goadedes/he.h.m8:heHE.IKekommeni.greekname
ltx/en_us_goadedes/me.m11.d25:meMA.Ode1C21.incipit	…
ltx/en_us_goadedes/me.m11.d25:meMA.Ode1C21.melody	@ltx/en_us_goadedes/he.h.m8:heHE.IKekommeni.name
ltx/en_us_goadedes/me.m11.d25:meMA.Ode1C21.mode	@ltx/en_us_goadedes/miscellanea:misc.Mode8
ltx/en_us_goadedes/me.m11.d25:meMA.Ode1C21.ode	@ltx/en_us_goadedes/miscellanea:misc.Ode1
ltx/en_us_goadedes/me.m11.d25:meMA.Ode1C21.text	
ltx/en_us_goadedes/me.m11.d25:meMA.Ode1C22.incipit	…
ltx/en_us_goadedes/me.m11.d25:meMA.Ode1C22.melody	@ltx/en_us_goadedes/he.h.m8:heHE.IKekommeni.name
ltx/en_us_goadedes/me.m11.d25:meMA.Ode1C22.mode	@ltx/en_us_goadedes/miscellanea:misc.Mode8
ltx/en_us_goadedes/me.m11.d25:meMA.Ode1C22.ode	@ltx/en_us_goadedes/miscellanea:misc.Ode1
ltx/en_us_goadedes/me.m11.d25:meMA.Ode1C22.text	
ltx/en_us_goadedes/me.m11.d25:meMA.Ode1C23.incipit	…
ltx/en_us_goadedes/me.m11.d25:meMA.Ode1C23.melody	@ltx/en_us_goadedes/he.h.m8:heHE.IKekommeni.name
ltx/en_us_goadedes/me.m11.d25:meMA.Ode1C23.mode	@ltx/en_us_goadedes/miscellanea:misc.Mode8
ltx/en_us_goadedes/me.m11.d25:meMA.Ode1C23.ode	@ltx/en_us_goadedes/miscellanea:misc.Ode1
ltx/en_us_goadedes/me.m11.d25:meMA.Ode1C23.text	
ltx/en_us_goadedes/me.m11.d25:meMA.Ode1C2T.incipit	…
ltx/en_us_goadedes/me.m11.d25:meMA.Ode1C2T.melody	@ltx/en_us_goadedes/he.h.m8:heHE.IKekommeni.name
ltx/en_us_goadedes/me.m11.d25:meMA.Ode1C2T.mode	@ltx/en_us_goadedes/miscellanea:misc.Mode8
ltx/en_us_goadedes/me.m11.d25:meMA.Ode1C2T.ode	@ltx/en_us_goadedes/miscellanea:misc.Ode1
ltx/en_us_goadedes/me.m11.d25:meMA.Ode1C2T.text	
ltx/en_us_goadedes/me.m11.d25:meMA.Ode3C11.greekmelody	@ltx/en_us_goadedes/he.h.m8:heHE.OStereosasKatArchas.greekname
ltx/en_us_goadedes/me.m11.d25:meMA.Ode3C11.incipit	…
ltx/en_us_goadedes/me.m11.d25:meMA.Ode3C11.melody	@ltx/en_us_goadedes/he.h.m8:heHE.OStereosasKatArchas.name
ltx/en_us_goadedes/me.m11.d25:meMA.Ode3C11.mode	@ltx/en_us_goadedes/miscellanea:misc.Mode8
ltx/en_us_goadedes/me.m11.d25:meMA.Ode3C11.ode	@ltx/en_us_goadedes/miscellanea:misc.Ode3
ltx/en_us_goadedes/me.m11.d25:meMA.Ode3C11.text	
ltx/en_us_goadedes/me.m11.d25:meMA.Ode3C12.incipit	…
ltx/en_us_goadedes/me.m11.d25:meMA.Ode3C12.melody	@ltx/en_us_goadedes/he.h.m8:heHE.OStereosasKatArchas.name
ltx/en_us_goadedes/me.m11.d25:meMA.Ode3C12.mode	@ltx/en_us_goadedes/miscellanea:misc.Mode8
ltx/en_us_goadedes/me.m11.d25:meMA.Ode3C12.ode	@ltx/en_us_goadedes/miscellanea:misc.Ode3
ltx/en_us_goadedes/me.m11.d25:meMA.Ode3C12.text	
ltx/en_us_goadedes/me.m11.d25:meMA.Ode3C13.incipit	…
ltx/en_us_goadedes/me.m11.d25:meMA.Ode3C13.melody	@ltx/en_us_goadedes/he.h.m8:heHE.OStereosasKatArchas.name
ltx/en_us_goadedes/me.m11.d25:meMA.Ode3C13.mode	@ltx/en_us_goadedes/miscellanea:misc.Mode8
ltx/en_us_goadedes/me.m11.d25:meMA.Ode3C13.ode	@ltx/en_us_goadedes/miscellanea:misc.Ode3
ltx/en_us_goadedes/me.m11.d25:meMA.Ode3C13.text	
ltx/en_us_goadedes/me.m11.d25:meMA.Ode3C1T.incipit	…
ltx/en_us_goadedes/me.m11.d25:meMA.Ode3C1T.melody	@ltx/en_us_goadedes/he.h.m8:heHE.OStereosasKatArchas.name
ltx/en_us_goadedes/me.m11.d25:meMA.Ode3C1T.mode	@ltx/en_us_goadedes/miscellanea:misc.Mode8
ltx/en_us_goadedes/me.m11.d25:meMA.Ode3C1T.ode	@ltx/en_us_goadedes/miscellanea:misc.Ode3
ltx/en_us_goadedes/me.m11.d25:meMA.Ode3C1T.text	
ltx/en_us_goadedes/me.m11.d25:meMA.Ode3C21.greekmelody	@ltx/en_us_goadedes/he.h.m8:heHE.SyEiToStereoma.greekname
ltx/en_us_goadedes/me.m11.d25:meMA.Ode3C21.incipit	…
ltx/en_us_goadedes/me.m11.d25:meMA.Ode3C21.melody	@ltx/en_us_goadedes/he.h.m8:heHE.SyEiToStereoma.name
ltx/en_us_goadedes/me.m11.d25:meMA.Ode3C21.mode	@ltx/en_us_goadedes/miscellanea:misc.Mode8
ltx/en_us_goadedes/me.m11.d25:meMA.Ode3C21.ode	@ltx/en_us_goadedes/miscellanea:misc.Ode3
ltx/en_us_goadedes/me.m11.d25:meMA.Ode3C21.text	
ltx/en_us_goadedes/me.m11.d25:meMA.Ode3C22.incipit	…
ltx/en_us_goadedes/me.m11.d25:meMA.Ode3C22.melody	@ltx/en_us_goadedes/he.h.m8:heHE.SyEiToStereoma.name
ltx/en_us_goadedes/me.m11.d25:meMA.Ode3C22.mode	@ltx/en_us_goadedes/miscellanea:misc.Mode8
ltx/en_us_goadedes/me.m11.d25:meMA.Ode3C22.ode	@ltx/en_us_goadedes/miscellanea:misc.Ode3
ltx/en_us_goadedes/me.m11.d25:meMA.Ode3C22.text	
ltx/en_us_goadedes/me.m11.d25:meMA.Ode3C23.incipit	…
ltx/en_us_goadedes/me.m11.d25:meMA.Ode3C23.melody	@ltx/en_us_goadedes/he.h.m8:heHE.SyEiToStereoma.name
ltx/en_us_goadedes/me.m11.d25:meMA.Ode3C23.mode	@ltx/en_us_goadedes/miscellanea:misc.Mode8
ltx/en_us_goadedes/me.m11.d25:meMA.Ode3C23.ode	@ltx/en_us_goadedes/miscellanea:misc.Ode3
ltx/en_us_goadedes/me.m11.d25:meMA.Ode3C23.text	
ltx/en_us_goadedes/me.m11.d25:meMA.Ode3C2T.incipit	…
ltx/en_us_goadedes/me.m11.d25:meMA.Ode3C2T.melody	@ltx/en_us_goadedes/he.h.m8:heHE.SyEiToStereoma.name
ltx/en_us_goadedes/me.m11.d25:meMA.Ode3C2T.mode	@ltx/en_us_goadedes/miscellanea:misc.Mode8
ltx/en_us_goadedes/me.m11.d25:meMA.Ode3C2T.ode	@ltx/en_us_goadedes/miscellanea:misc.Ode3
ltx/en_us_goadedes/me.m11.d25:meMA.Ode3C2T.text	
ltx/en_us_goadedes/me.m11.d25:meMA.Ode3Kathisma1.greekmelody	@ltx/en_us_goadedes/he.a.m8:heAU.TinSofianKaiLogon.greekname
ltx/en_us_goadedes/me.m11.d25:meMA.Ode3Kathisma1.incipit	…
ltx/en_us_goadedes/me.m11.d25:meMA.Ode3Kathisma1.melody	@ltx/en_us_goadedes/he.a.m8:heAU.TinSofianKaiLogon.name
ltx/en_us_goadedes/me.m11.d25:meMA.Ode3Kathisma1.mode	@ltx/en_us_goadedes/miscellanea:misc.Mode8
ltx/en_us_goadedes/me.m11.d25:meMA.Ode3Kathisma1.text	
ltx/en_us_goadedes/me.m11.d25:meMA.Ode3Kathisma2.greekmelody	@ltx/en_us_goadedes/he.a.m4:heAU.TachyProkatalave.greekname
ltx/en_us_goadedes/me.m11.d25:meMA.Ode3Kathisma2.incipit	…
ltx/en_us_goadedes/me.m11.d25:meMA.Ode3Kathisma2.melody	@ltx/en_us_goadedes/he.a.m4:heAU.TachyProkatalave.name
ltx/en_us_goadedes/me.m11.d25:meMA.Ode3Kathisma2.mode	@ltx/en_us_goadedes/miscellanea:misc.Mode4
ltx/en_us_goadedes/me.m11.d25:meMA.Ode3Kathisma2.text	
ltx/en_us_goadedes/me.m11.d25:meMA.Ode3Kathisma3.greekmelody	@ltx/en_us_goadedes/he.a.m4:heAU.KateplagiIosif.greekname
ltx/en_us_goadedes/me.m11.d25:meMA.Ode3Kathisma3.incipit	@ltx/en_us_goadedes/me.m11.d24:meMA.Kathisma21.incipit
ltx/en_us_goadedes/me.m11.d25:meMA.Ode3Kathisma3.melody	@ltx/en_us_goadedes/he.a.m4:heAU.KateplagiIosif.name
ltx/en_us_goadedes/me.m11.d25:meMA.Ode3Kathisma3.mode	@ltx/en_us_goadedes/miscellanea:misc.Mode4
ltx/en_us_goadedes/me.m11.d25:meMA.Ode3Kathisma3.text	@ltx/en_us_goadedes/me.m11.d24:meMA.Kathisma21.text
ltx/en_us_goadedes/me.m11.d25:meMA.Ode4C11.greekmelody	@ltx/en_us_goadedes/he.h.m8:heHE.SyMouIschys.greekname
ltx/en_us_goadedes/me.m11.d25:meMA.Ode4C11.incipit	…
ltx/en_us_goadedes/me.m11.d25:meMA.Ode4C11.melody	@ltx/en_us_goadedes/he.h.m8:heHE.SyMouIschys.name
ltx/en_us_goadedes/me.m11.d25:meMA.Ode4C11.mode	@ltx/en_us_goadedes/miscellanea:misc.Mode8
ltx/en_us_goadedes/me.m11.d25:meMA.Ode4C11.ode	@ltx/en_us_goadedes/miscellanea:misc.Ode4
ltx/en_us_goadedes/me.m11.d25:meMA.Ode4C11.text	
ltx/en_us_goadedes/me.m11.d25:meMA.Ode4C12.incipit	…
ltx/en_us_goadedes/me.m11.d25:meMA.Ode4C12.melody	@ltx/en_us_goadedes/he.h.m8:heHE.SyMouIschys.name
ltx/en_us_goadedes/me.m11.d25:meMA.Ode4C12.mode	@ltx/en_us_goadedes/miscellanea:misc.Mode8
ltx/en_us_goadedes/me.m11.d25:meMA.Ode4C12.ode	@ltx/en_us_goadedes/miscellanea:misc.Ode4
ltx/en_us_goadedes/me.m11.d25:meMA.Ode4C12.text	
ltx/en_us_goadedes/me.m11.d25:meMA.Ode4C13.incipit	…
ltx/en_us_goadedes/me.m11.d25:meMA.Ode4C13.melody	@ltx/en_us_goadedes/he.h.m8:heHE.SyMouIschys.name
ltx/en_us_goadedes/me.m11.d25:meMA.Ode4C13.mode	@ltx/en_us_goadedes/miscellanea:misc.Mode8
ltx/en_us_goadedes/me.m11.d25:meMA.Ode4C13.ode	@ltx/en_us_goadedes/miscellanea:misc.Ode4
ltx/en_us_goadedes/me.m11.d25:meMA.Ode4C13.text	
ltx/en_us_goadedes/me.m11.d25:meMA.Ode4C14.incipit	…
ltx/en_us_goadedes/me.m11.d25:meMA.Ode4C14.melody	@ltx/en_us_goadedes/he.h.m8:heHE.SyMouIschys.name
ltx/en_us_goadedes/me.m11.d25:meMA.Ode4C14.mode	@ltx/en_us_goadedes/miscellanea:misc.Mode8
ltx/en_us_goadedes/me.m11.d25:meMA.Ode4C14.ode	@ltx/en_us_goadedes/miscellanea:misc.Ode4
ltx/en_us_goadedes/me.m11.d25:meMA.Ode4C14.text	
ltx/en_us_goadedes/me.m11.d25:meMA.Ode4C1T.incipit	…
ltx/en_us_goadedes/me.m11.d25:meMA.Ode4C1T.melody	@ltx/en_us_goadedes/he.h.m8:heHE.SyMouIschys.name
ltx/en_us_goadedes/me.m11.d25:meMA.Ode4C1T.mode	@ltx/en_us_goadedes/miscellanea:misc.Mode8
ltx/en_us_goadedes/me.m11.d25:meMA.Ode4C1T.ode	@ltx/en_us_goadedes/miscellanea:misc.Ode4
ltx/en_us_goadedes/me.m11.d25:meMA.Ode4C1T.text	
ltx/en_us_goadedes/me.m11.d25:meMA.Ode4C21.greekmelody	@ltx/en_us_goadedes/he.h.m8:heHE.EisakikoaKyrie.greekname
ltx/en_us_goadedes/me.m11.d25:meMA.Ode4C21.incipit	…
ltx/en_us_goadedes/me.m11.d25:meMA.Ode4C21.melody	@ltx/en_us_goadedes/he.h.m8:heHE.EisakikoaKyrie.name
ltx/en_us_goadedes/me.m11.d25:meMA.Ode4C21.mode	@ltx/en_us_goadedes/miscellanea:misc.Mode8
ltx/en_us_goadedes/me.m11.d25:meMA.Ode4C21.ode	@ltx/en_us_goadedes/miscellanea:misc.Ode4
ltx/en_us_goadedes/me.m11.d25:meMA.Ode4C21.text	
ltx/en_us_goadedes/me.m11.d25:meMA.Ode4C22.incipit	…
ltx/en_us_goadedes/me.m11.d25:meMA.Ode4C22.melody	@ltx/en_us_goadedes/he.h.m8:heHE.EisakikoaKyrie.name
ltx/en_us_goadedes/me.m11.d25:meMA.Ode4C22.mode	@ltx/en_us_goadedes/miscellanea:misc.Mode8
ltx/en_us_goadedes/me.m11.d25:meMA.Ode4C22.ode	@ltx/en_us_goadedes/miscellanea:misc.Ode4
ltx/en_us_goadedes/me.m11.d25:meMA.Ode4C22.text	
ltx/en_us_goadedes/me.m11.d25:meMA.Ode4C23.incipit	…
ltx/en_us_goadedes/me.m11.d25:meMA.Ode4C23.melody	@ltx/en_us_goadedes/he.h.m8:heHE.EisakikoaKyrie.name
ltx/en_us_goadedes/me.m11.d25:meMA.Ode4C23.mode	@ltx/en_us_goadedes/miscellanea:misc.Mode8
ltx/en_us_goadedes/me.m11.d25:meMA.Ode4C23.ode	@ltx/en_us_goadedes/miscellanea:misc.Ode4
ltx/en_us_goadedes/me.m11.d25:meMA.Ode4C23.text	
ltx/en_us_goadedes/me.m11.d25:meMA.Ode4C2T.incipit	…
ltx/en_us_goadedes/me.m11.d25:meMA.Ode4C2T.melody	@ltx/en_us_goadedes/he.h.m8:heHE.EisakikoaKyrie.name
ltx/en_us_goadedes/me.m11.d25:meMA.Ode4C2T.mode	@ltx/en_us_goadedes/miscellanea:misc.Mode8
ltx/en_us_goadedes/me.m11.d25:meMA.Ode4C2T.ode	@ltx/en_us_goadedes/miscellanea:misc.Ode4
ltx/en_us_goadedes/me.m11.d25:meMA.Ode4C2T.text	
ltx/en_us_goadedes/me.m11.d25:meMA.Ode5C11.greekmelody	@ltx/en_us_goadedes/he.h.m8:heHE.InaTiMeAposo.greekname
ltx/en_us_goadedes/me.m11.d25:meMA.Ode5C11.incipit	…
ltx/en_us_goadedes/me.m11.d25:meMA.Ode5C11.melody	@ltx/en_us_goadedes/he.h.m8:heHE.InaTiMeAposo.name
ltx/en_us_goadedes/me.m11.d25:meMA.Ode5C11.mode	@ltx/en_us_goadedes/miscellanea:misc.Mode8
ltx/en_us_goadedes/me.m11.d25:meMA.Ode5C11.ode	@ltx/en_us_goadedes/miscellanea:misc.Ode5
ltx/en_us_goadedes/me.m11.d25:meMA.Ode5C11.text	
ltx/en_us_goadedes/me.m11.d25:meMA.Ode5C12.incipit	…
ltx/en_us_goadedes/me.m11.d25:meMA.Ode5C12.melody	@ltx/en_us_goadedes/he.h.m8:heHE.InaTiMeAposo.name
ltx/en_us_goadedes/me.m11.d25:meMA.Ode5C12.mode	@ltx/en_us_goadedes/miscellanea:misc.Mode8
ltx/en_us_goadedes/me.m11.d25:meMA.Ode5C12.ode	@ltx/en_us_goadedes/miscellanea:misc.Ode5
ltx/en_us_goadedes/me.m11.d25:meMA.Ode5C12.text	
ltx/en_us_goadedes/me.m11.d25:meMA.Ode5C13.incipit	…
ltx/en_us_goadedes/me.m11.d25:meMA.Ode5C13.melody	@ltx/en_us_goadedes/he.h.m8:heHE.InaTiMeAposo.name
ltx/en_us_goadedes/me.m11.d25:meMA.Ode5C13.mode	@ltx/en_us_goadedes/miscellanea:misc.Mode8
ltx/en_us_goadedes/me.m11.d25:meMA.Ode5C13.ode	@ltx/en_us_goadedes/miscellanea:misc.Ode5
ltx/en_us_goadedes/me.m11.d25:meMA.Ode5C13.text	
ltx/en_us_goadedes/me.m11.d25:meMA.Ode5C1T.incipit	…
ltx/en_us_goadedes/me.m11.d25:meMA.Ode5C1T.melody	@ltx/en_us_goadedes/he.h.m8:heHE.InaTiMeAposo.name
ltx/en_us_goadedes/me.m11.d25:meMA.Ode5C1T.mode	@ltx/en_us_goadedes/miscellanea:misc.Mode8
ltx/en_us_goadedes/me.m11.d25:meMA.Ode5C1T.ode	@ltx/en_us_goadedes/miscellanea:misc.Ode5
ltx/en_us_goadedes/me.m11.d25:meMA.Ode5C1T.text	
ltx/en_us_goadedes/me.m11.d25:meMA.Ode5C21.greekmelody	@ltx/en_us_goadedes/he.h.m8:heHE.OrthrizontesVoomenSoi.greekname
ltx/en_us_goadedes/me.m11.d25:meMA.Ode5C21.incipit	…
ltx/en_us_goadedes/me.m11.d25:meMA.Ode5C21.melody	@ltx/en_us_goadedes/he.h.m8:heHE.OrthrizontesVoomenSoi.name
ltx/en_us_goadedes/me.m11.d25:meMA.Ode5C21.mode	@ltx/en_us_goadedes/miscellanea:misc.Mode8
ltx/en_us_goadedes/me.m11.d25:meMA.Ode5C21.ode	@ltx/en_us_goadedes/miscellanea:misc.Ode5
ltx/en_us_goadedes/me.m11.d25:meMA.Ode5C21.text	
ltx/en_us_goadedes/me.m11.d25:meMA.Ode5C22.incipit	…
ltx/en_us_goadedes/me.m11.d25:meMA.Ode5C22.melody	@ltx/en_us_goadedes/he.h.m8:heHE.OrthrizontesVoomenSoi.name
ltx/en_us_goadedes/me.m11.d25:meMA.Ode5C22.mode	@ltx/en_us_goadedes/miscellanea:misc.Mode8
ltx/en_us_goadedes/me.m11.d25:meMA.Ode5C22.ode	@ltx/en_us_goadedes/miscellanea:misc.Ode5
ltx/en_us_goadedes/me.m11.d25:meMA.Ode5C22.text	
ltx/en_us_goadedes/me.m11.d25:meMA.Ode5C23.incipit	…
ltx/en_us_goadedes/me.m11.d25:meMA.Ode5C23.melody	@ltx/en_us_goadedes/he.h.m8:heHE.OrthrizontesVoomenSoi.name
ltx/en_us_goadedes/me.m11.d25:meMA.Ode5C23.mode	@ltx/en_us_goadedes/miscellanea:misc.Mode8
ltx/en_us_goadedes/me.m11.d25:meMA.Ode5C23.ode	@ltx/en_us_goadedes/miscellanea:misc.Ode5
ltx/en_us_goadedes/me.m11.d25:meMA.Ode5C23.text	
ltx/en_us_goadedes/me.m11.d25:meMA.Ode5C2T.incipit	…
ltx/en_us_goadedes/me.m11.d25:meMA.Ode5C2T.melody	@ltx/en_us_goadedes/he.h.m8:heHE.OrthrizontesVoomenSoi.name
ltx/en_us_goadedes/me.m11.d25:meMA.Ode5C2T.mode	@ltx/en_us_goadedes/miscellanea:misc.Mode8
ltx/en_us_goadedes/me.m11.d25:meMA.Ode5C2T.ode	@ltx/en_us_goadedes/miscellanea:misc.Ode5
ltx/en_us_goadedes/me.m11.d25:meMA.Ode5C2T.text	
ltx/en_us_goadedes/me.m11.d25:meMA.Ode6C11.greekmelody	@ltx/en_us_goadedes/he.h.m8:heHE.AvyssosAmartion.greekname
ltx/en_us_goadedes/me.m11.d25:meMA.Ode6C11.incipit	…
ltx/en_us_goadedes/me.m11.d25:meMA.Ode6C11.melody	@ltx/en_us_goadedes/he.h.m8:heHE.AvyssosAmartion.name
ltx/en_us_goadedes/me.m11.d25:meMA.Ode6C11.mode	@ltx/en_us_goadedes/miscellanea:misc.Mode8
ltx/en_us_goadedes/me.m11.d25:meMA.Ode6C11.ode	@ltx/en_us_goadedes/miscellanea:misc.Ode6
ltx/en_us_goadedes/me.m11.d25:meMA.Ode6C11.text	
ltx/en_us_goadedes/me.m11.d25:meMA.Ode6C12.incipit	…
ltx/en_us_goadedes/me.m11.d25:meMA.Ode6C12.melody	@ltx/en_us_goadedes/he.h.m8:heHE.AvyssosAmartion.name
ltx/en_us_goadedes/me.m11.d25:meMA.Ode6C12.mode	@ltx/en_us_goadedes/miscellanea:misc.Mode8
ltx/en_us_goadedes/me.m11.d25:meMA.Ode6C12.ode	@ltx/en_us_goadedes/miscellanea:misc.Ode6
ltx/en_us_goadedes/me.m11.d25:meMA.Ode6C12.text	
ltx/en_us_goadedes/me.m11.d25:meMA.Ode6C13.incipit	…
ltx/en_us_goadedes/me.m11.d25:meMA.Ode6C13.melody	@ltx/en_us_goadedes/he.h.m8:heHE.AvyssosAmartion.name
ltx/en_us_goadedes/me.m11.d25:meMA.Ode6C13.mode	@ltx/en_us_goadedes/miscellanea:misc.Mode8
ltx/en_us_goadedes/me.m11.d25:meMA.Ode6C13.ode	@ltx/en_us_goadedes/miscellanea:misc.Ode6
ltx/en_us_goadedes/me.m11.d25:meMA.Ode6C13.text	
ltx/en_us_goadedes/me.m11.d25:meMA.Ode6C1T.incipit	…
ltx/en_us_goadedes/me.m11.d25:meMA.Ode6C1T.melody	@ltx/en_us_goadedes/he.h.m8:heHE.AvyssosAmartion.name
ltx/en_us_goadedes/me.m11.d25:meMA.Ode6C1T.mode	@ltx/en_us_goadedes/miscellanea:misc.Mode8
ltx/en_us_goadedes/me.m11.d25:meMA.Ode6C1T.ode	@ltx/en_us_goadedes/miscellanea:misc.Ode6
ltx/en_us_goadedes/me.m11.d25:meMA.Ode6C1T.text	
ltx/en_us_goadedes/me.m11.d25:meMA.Ode6C21.greekmelody	@ltx/en_us_goadedes/he.h.m8:heHE.TinDeisinEkcheo.greekname
ltx/en_us_goadedes/me.m11.d25:meMA.Ode6C21.incipit	…
ltx/en_us_goadedes/me.m11.d25:meMA.Ode6C21.melody	@ltx/en_us_goadedes/he.h.m8:heHE.TinDeisinEkcheo.name
ltx/en_us_goadedes/me.m11.d25:meMA.Ode6C21.mode	@ltx/en_us_goadedes/miscellanea:misc.Mode8
ltx/en_us_goadedes/me.m11.d25:meMA.Ode6C21.ode	@ltx/en_us_goadedes/miscellanea:misc.Ode6
ltx/en_us_goadedes/me.m11.d25:meMA.Ode6C21.text	
ltx/en_us_goadedes/me.m11.d25:meMA.Ode6C22.incipit	…
ltx/en_us_goadedes/me.m11.d25:meMA.Ode6C22.melody	@ltx/en_us_goadedes/he.h.m8:heHE.TinDeisinEkcheo.name
ltx/en_us_goadedes/me.m11.d25:meMA.Ode6C22.mode	@ltx/en_us_goadedes/miscellanea:misc.Mode8
ltx/en_us_goadedes/me.m11.d25:meMA.Ode6C22.ode	@ltx/en_us_goadedes/miscellanea:misc.Ode6
ltx/en_us_goadedes/me.m11.d25:meMA.Ode6C22.text	
ltx/en_us_goadedes/me.m11.d25:meMA.Ode6C23.incipit	…
ltx/en_us_goadedes/me.m11.d25:meMA.Ode6C23.melody	@ltx/en_us_goadedes/he.h.m8:heHE.TinDeisinEkcheo.name
ltx/en_us_goadedes/me.m11.d25:meMA.Ode6C23.mode	@ltx/en_us_goadedes/miscellanea:misc.Mode8
ltx/en_us_goadedes/me.m11.d25:meMA.Ode6C23.ode	@ltx/en_us_goadedes/miscellanea:misc.Ode6
ltx/en_us_goadedes/me.m11.d25:meMA.Ode6C23.text	
ltx/en_us_goadedes/me.m11.d25:meMA.Ode6C2T.incipit	…
ltx/en_us_goadedes/me.m11.d25:meMA.Ode6C2T.melody	@ltx/en_us_goadedes/he.h.m8:heHE.TinDeisinEkcheo.name
ltx/en_us_goadedes/me.m11.d25:meMA.Ode6C2T.mode	@ltx/en_us_goadedes/miscellanea:misc.Mode8
ltx/en_us_goadedes/me.m11.d25:meMA.Ode6C2T.ode	@ltx/en_us_goadedes/miscellanea:misc.Ode6
ltx/en_us_goadedes/me.m11.d25:meMA.Ode6C2T.text	
ltx/en_us_goadedes/me.m11.d25:meMA.Ode7C11.greekmelody	@ltx/en_us_goadedes/he.h.m8:heHE.TheouSynkatavasin.greekname
ltx/en_us_goadedes/me.m11.d25:meMA.Ode7C11.incipit	…
ltx/en_us_goadedes/me.m11.d25:meMA.Ode7C11.melody	@ltx/en_us_goadedes/he.h.m8:heHE.TheouSynkatavasin.name
ltx/en_us_goadedes/me.m11.d25:meMA.Ode7C11.mode	@ltx/en_us_goadedes/miscellanea:misc.Mode8
ltx/en_us_goadedes/me.m11.d25:meMA.Ode7C11.ode	@ltx/en_us_goadedes/miscellanea:misc.Ode7
ltx/en_us_goadedes/me.m11.d25:meMA.Ode7C11.text	
ltx/en_us_goadedes/me.m11.d25:meMA.Ode7C12.incipit	…
ltx/en_us_goadedes/me.m11.d25:meMA.Ode7C12.melody	@ltx/en_us_goadedes/he.h.m8:heHE.TheouSynkatavasin.name
ltx/en_us_goadedes/me.m11.d25:meMA.Ode7C12.mode	@ltx/en_us_goadedes/miscellanea:misc.Mode8
ltx/en_us_goadedes/me.m11.d25:meMA.Ode7C12.ode	@ltx/en_us_goadedes/miscellanea:misc.Ode7
ltx/en_us_goadedes/me.m11.d25:meMA.Ode7C12.text	
ltx/en_us_goadedes/me.m11.d25:meMA.Ode7C13.incipit	…
ltx/en_us_goadedes/me.m11.d25:meMA.Ode7C13.melody	@ltx/en_us_goadedes/he.h.m8:heHE.TheouSynkatavasin.name
ltx/en_us_goadedes/me.m11.d25:meMA.Ode7C13.mode	@ltx/en_us_goadedes/miscellanea:misc.Mode8
ltx/en_us_goadedes/me.m11.d25:meMA.Ode7C13.ode	@ltx/en_us_goadedes/miscellanea:misc.Ode7
ltx/en_us_goadedes/me.m11.d25:meMA.Ode7C13.text	
ltx/en_us_goadedes/me.m11.d25:meMA.Ode7C1T.incipit	…
ltx/en_us_goadedes/me.m11.d25:meMA.Ode7C1T.melody	@ltx/en_us_goadedes/he.h.m8:heHE.TheouSynkatavasin.name
ltx/en_us_goadedes/me.m11.d25:meMA.Ode7C1T.mode	@ltx/en_us_goadedes/miscellanea:misc.Mode8
ltx/en_us_goadedes/me.m11.d25:meMA.Ode7C1T.ode	@ltx/en_us_goadedes/miscellanea:misc.Ode7
ltx/en_us_goadedes/me.m11.d25:meMA.Ode7C1T.text	
ltx/en_us_goadedes/me.m11.d25:meMA.Ode7C21.greekmelody	@ltx/en_us_goadedes/he.h.m8:heHE.PaidesEvraion.greekname
ltx/en_us_goadedes/me.m11.d25:meMA.Ode7C21.incipit	…
ltx/en_us_goadedes/me.m11.d25:meMA.Ode7C21.melody	@ltx/en_us_goadedes/he.h.m8:heHE.PaidesEvraion.name
ltx/en_us_goadedes/me.m11.d25:meMA.Ode7C21.mode	@ltx/en_us_goadedes/miscellanea:misc.Mode8
ltx/en_us_goadedes/me.m11.d25:meMA.Ode7C21.ode	@ltx/en_us_goadedes/miscellanea:misc.Ode7
ltx/en_us_goadedes/me.m11.d25:meMA.Ode7C21.text	
ltx/en_us_goadedes/me.m11.d25:meMA.Ode7C22.incipit	…
ltx/en_us_goadedes/me.m11.d25:meMA.Ode7C22.melody	@ltx/en_us_goadedes/he.h.m8:heHE.PaidesEvraion.name
ltx/en_us_goadedes/me.m11.d25:meMA.Ode7C22.mode	@ltx/en_us_goadedes/miscellanea:misc.Mode8
ltx/en_us_goadedes/me.m11.d25:meMA.Ode7C22.ode	@ltx/en_us_goadedes/miscellanea:misc.Ode7
ltx/en_us_goadedes/me.m11.d25:meMA.Ode7C22.text	
ltx/en_us_goadedes/me.m11.d25:meMA.Ode7C23.incipit	…
ltx/en_us_goadedes/me.m11.d25:meMA.Ode7C23.melody	@ltx/en_us_goadedes/he.h.m8:heHE.PaidesEvraion.name
ltx/en_us_goadedes/me.m11.d25:meMA.Ode7C23.mode	@ltx/en_us_goadedes/miscellanea:misc.Mode8
ltx/en_us_goadedes/me.m11.d25:meMA.Ode7C23.ode	@ltx/en_us_goadedes/miscellanea:misc.Ode7
ltx/en_us_goadedes/me.m11.d25:meMA.Ode7C23.text	
ltx/en_us_goadedes/me.m11.d25:meMA.Ode7C24.incipit	…
ltx/en_us_goadedes/me.m11.d25:meMA.Ode7C24.melody	@ltx/en_us_goadedes/he.h.m8:heHE.PaidesEvraion.name
ltx/en_us_goadedes/me.m11.d25:meMA.Ode7C24.mode	@ltx/en_us_goadedes/miscellanea:misc.Mode8
ltx/en_us_goadedes/me.m11.d25:meMA.Ode7C24.ode	@ltx/en_us_goadedes/miscellanea:misc.Ode7
ltx/en_us_goadedes/me.m11.d25:meMA.Ode7C24.text	
ltx/en_us_goadedes/me.m11.d25:meMA.Ode7C2T.incipit	…
ltx/en_us_goadedes/me.m11.d25:meMA.Ode7C2T.melody	@ltx/en_us_goadedes/he.h.m8:heHE.PaidesEvraion.name
ltx/en_us_goadedes/me.m11.d25:meMA.Ode7C2T.mode	@ltx/en_us_goadedes/miscellanea:misc.Mode8
ltx/en_us_goadedes/me.m11.d25:meMA.Ode7C2T.ode	@ltx/en_us_goadedes/miscellanea:misc.Ode7
ltx/en_us_goadedes/me.m11.d25:meMA.Ode7C2T.text	
ltx/en_us_goadedes/me.m11.d25:meMA.Ode8C11.greekmelody	@ltx/en_us_goadedes/he.h.m8:heHE.EptaplasiosKaminon.greekname
ltx/en_us_goadedes/me.m11.d25:meMA.Ode8C11.incipit	…
ltx/en_us_goadedes/me.m11.d25:meMA.Ode8C11.melody	@ltx/en_us_goadedes/he.h.m8:heHE.EptaplasiosKaminon.name
ltx/en_us_goadedes/me.m11.d25:meMA.Ode8C11.mode	@ltx/en_us_goadedes/miscellanea:misc.Mode8
ltx/en_us_goadedes/me.m11.d25:meMA.Ode8C11.ode	@ltx/en_us_goadedes/miscellanea:misc.Ode8
ltx/en_us_goadedes/me.m11.d25:meMA.Ode8C11.text	
ltx/en_us_goadedes/me.m11.d25:meMA.Ode8C12.incipit	…
ltx/en_us_goadedes/me.m11.d25:meMA.Ode8C12.melody	@ltx/en_us_goadedes/he.h.m8:heHE.EptaplasiosKaminon.name
ltx/en_us_goadedes/me.m11.d25:meMA.Ode8C12.mode	@ltx/en_us_goadedes/miscellanea:misc.Mode8
ltx/en_us_goadedes/me.m11.d25:meMA.Ode8C12.ode	@ltx/en_us_goadedes/miscellanea:misc.Ode8
ltx/en_us_goadedes/me.m11.d25:meMA.Ode8C12.text	
ltx/en_us_goadedes/me.m11.d25:meMA.Ode8C13.incipit	…
ltx/en_us_goadedes/me.m11.d25:meMA.Ode8C13.melody	@ltx/en_us_goadedes/he.h.m8:heHE.EptaplasiosKaminon.name
ltx/en_us_goadedes/me.m11.d25:meMA.Ode8C13.mode	@ltx/en_us_goadedes/miscellanea:misc.Mode8
ltx/en_us_goadedes/me.m11.d25:meMA.Ode8C13.ode	@ltx/en_us_goadedes/miscellanea:misc.Ode8
ltx/en_us_goadedes/me.m11.d25:meMA.Ode8C13.text	
ltx/en_us_goadedes/me.m11.d25:meMA.Ode8C14.incipit	…
ltx/en_us_goadedes/me.m11.d25:meMA.Ode8C14.melody	@ltx/en_us_goadedes/he.h.m8:heHE.EptaplasiosKaminon.name
ltx/en_us_goadedes/me.m11.d25:meMA.Ode8C14.mode	@ltx/en_us_goadedes/miscellanea:misc.Mode8
ltx/en_us_goadedes/me.m11.d25:meMA.Ode8C14.ode	@ltx/en_us_goadedes/miscellanea:misc.Ode8
ltx/en_us_goadedes/me.m11.d25:meMA.Ode8C14.text	
ltx/en_us_goadedes/me.m11.d25:meMA.Ode8C1T.incipit	…
ltx/en_us_goadedes/me.m11.d25:meMA.Ode8C1T.melody	@ltx/en_us_goadedes/he.h.m8:heHE.EptaplasiosKaminon.name
ltx/en_us_goadedes/me.m11.d25:meMA.Ode8C1T.mode	@ltx/en_us_goadedes/miscellanea:misc.Mode8
ltx/en_us_goadedes/me.m11.d25:meMA.Ode8C1T.ode	@ltx/en_us_goadedes/miscellanea:misc.Ode8
ltx/en_us_goadedes/me.m11.d25:meMA.Ode8C1T.text	
ltx/en_us_goadedes/me.m11.d25:meMA.Ode8C21.greekmelody	@ltx/en_us_goadedes/he.h.m8:heHE.EptaplasiosKaminon.greekname
ltx/en_us_goadedes/me.m11.d25:meMA.Ode8C21.incipit	…
ltx/en_us_goadedes/me.m11.d25:meMA.Ode8C21.melody	@ltx/en_us_goadedes/he.h.m8:heHE.EptaplasiosKaminon.name
ltx/en_us_goadedes/me.m11.d25:meMA.Ode8C21.mode	@ltx/en_us_goadedes/miscellanea:misc.Mode8
ltx/en_us_goadedes/me.m11.d25:meMA.Ode8C21.ode	@ltx/en_us_goadedes/miscellanea:misc.Ode8
ltx/en_us_goadedes/me.m11.d25:meMA.Ode8C21.text	
ltx/en_us_goadedes/me.m11.d25:meMA.Ode8C22.incipit	…
ltx/en_us_goadedes/me.m11.d25:meMA.Ode8C22.melody	@ltx/en_us_goadedes/he.h.m8:heHE.EptaplasiosKaminon.name
ltx/en_us_goadedes/me.m11.d25:meMA.Ode8C22.mode	@ltx/en_us_goadedes/miscellanea:misc.Mode8
ltx/en_us_goadedes/me.m11.d25:meMA.Ode8C22.ode	@ltx/en_us_goadedes/miscellanea:misc.Ode8
ltx/en_us_goadedes/me.m11.d25:meMA.Ode8C22.text	
ltx/en_us_goadedes/me.m11.d25:meMA.Ode8C23.incipit	…
ltx/en_us_goadedes/me.m11.d25:meMA.Ode8C23.melody	@ltx/en_us_goadedes/he.h.m8:heHE.EptaplasiosKaminon.name
ltx/en_us_goadedes/me.m11.d25:meMA.Ode8C23.mode	@ltx/en_us_goadedes/miscellanea:misc.Mode8
ltx/en_us_goadedes/me.m11.d25:meMA.Ode8C23.ode	@ltx/en_us_goadedes/miscellanea:misc.Ode8
ltx/en_us_goadedes/me.m11.d25:meMA.Ode8C23.text	
ltx/en_us_goadedes/me.m11.d25:meMA.Ode8C24.incipit	…
ltx/en_us_goadedes/me.m11.d25:meMA.Ode8C24.melody	@ltx/en_us_goadedes/he.h.m8:heHE.EptaplasiosKaminon.name
ltx/en_us_goadedes/me.m11.d25:meMA.Ode8C24.mode	@ltx/en_us_goadedes/miscellanea:misc.Mode8
ltx/en_us_goadedes/me.m11.d25:meMA.Ode8C24.ode	@ltx/en_us_goadedes/miscellanea:misc.Ode8
ltx/en_us_goadedes/me.m11.d25:meMA.Ode8C24.text	
ltx/en_us_goadedes/me.m11.d25:meMA.Ode8C2T.incipit	…
ltx/en_us_goadedes/me.m11.d25:meMA.Ode8C2T.melody	@ltx/en_us_goadedes/he.h.m8:heHE.EptaplasiosKaminon.name
ltx/en_us_goadedes/me.m11.d25:meMA.Ode8C2T.mode	@ltx/en_us_goadedes/miscellanea:misc.Mode8
ltx/en_us_goadedes/me.m11.d25:meMA.Ode8C2T.ode	@ltx/en_us_goadedes/miscellanea:misc.Ode8
ltx/en_us_goadedes/me.m11.d25:meMA.Ode8C2T.text	
ltx/en_us_goadedes/me.m11.d25:meMA.Ode8H.greekmelody	@ltx/en_us_goadedes/he.h.m8:heHE.EptaplasiosKaminon.greekname
ltx/en_us_goadedes/me.m11.d25:meMA.Ode8H.incipit	@ltx/en_us_goadedes/he.h.m8:heHE.EptaplasiosKaminon.incipit
ltx/en_us_goadedes/me.m11.d25:meMA.Ode8H.melody	@ltx/en_us_goadedes/he.h.m8:heHE.EptaplasiosKaminon.melody
ltx/en_us_goadedes/me.m11.d25:meMA.Ode8H.mode	@ltx/en_us_goadedes/miscellanea:misc.Mode8
ltx/en_us_goadedes/me.m11.d25:meMA.Ode8H.ode	@ltx/en_us_goadedes/miscellanea:misc.Ode8
ltx/en_us_goadedes/me.m11.d25:meMA.Ode8H.text	@ltx/en_us_goadedes/he.h.m8:heHE.EptaplasiosKaminon.text
ltx/en_us_goadedes/me.m11.d25:meMA.Ode9C11.greekmelody	@ltx/en_us_goadedes/he.h.m8:heHE.ExestiEpiTouto.greekname
ltx/en_us_goadedes/me.m11.d25:meMA.Ode9C11.incipit	…
ltx/en_us_goadedes/me.m11.d25:meMA.Ode9C11.melody	@ltx/en_us_goadedes/he.h.m8:heHE.ExestiEpiTouto.name
ltx/en_us_goadedes/me.m11.d25:meMA.Ode9C11.mode	@ltx/en_us_goadedes/miscellanea:misc.Mode8
ltx/en_us_goadedes/me.m11.d25:meMA.Ode9C11.ode	@ltx/en_us_goadedes/miscellanea:misc.Ode9
ltx/en_us_goadedes/me.m11.d25:meMA.Ode9C11.text	
ltx/en_us_goadedes/me.m11.d25:meMA.Ode9C12.incipit	…
ltx/en_us_goadedes/me.m11.d25:meMA.Ode9C12.melody	@ltx/en_us_goadedes/he.h.m8:heHE.ExestiEpiTouto.name
ltx/en_us_goadedes/me.m11.d25:meMA.Ode9C12.mode	@ltx/en_us_goadedes/miscellanea:misc.Mode8
ltx/en_us_goadedes/me.m11.d25:meMA.Ode9C12.ode	@ltx/en_us_goadedes/miscellanea:misc.Ode9
ltx/en_us_goadedes/me.m11.d25:meMA.Ode9C12.text	
ltx/en_us_goadedes/me.m11.d25:meMA.Ode9C13.incipit	…
ltx/en_us_goadedes/me.m11.d25:meMA.Ode9C13.melody	@ltx/en_us_goadedes/he.h.m8:heHE.ExestiEpiTouto.name
ltx/en_us_goadedes/me.m11.d25:meMA.Ode9C13.mode	@ltx/en_us_goadedes/miscellanea:misc.Mode8
ltx/en_us_goadedes/me.m11.d25:meMA.Ode9C13.ode	@ltx/en_us_goadedes/miscellanea:misc.Ode9
ltx/en_us_goadedes/me.m11.d25:meMA.Ode9C13.text	
ltx/en_us_goadedes/me.m11.d25:meMA.Ode9C14.incipit	…
ltx/en_us_goadedes/me.m11.d25:meMA.Ode9C14.melody	@ltx/en_us_goadedes/he.h.m8:heHE.ExestiEpiTouto.name
ltx/en_us_goadedes/me.m11.d25:meMA.Ode9C14.mode	@ltx/en_us_goadedes/miscellanea:misc.Mode8
ltx/en_us_goadedes/me.m11.d25:meMA.Ode9C14.ode	@ltx/en_us_goadedes/miscellanea:misc.Ode9
ltx/en_us_goadedes/me.m11.d25:meMA.Ode9C14.text	
ltx/en_us_goadedes/me.m11.d25:meMA.Ode9C1T.incipit	…
ltx/en_us_goadedes/me.m11.d25:meMA.Ode9C1T.melody	@ltx/en_us_goadedes/he.h.m8:heHE.ExestiEpiTouto.name
ltx/en_us_goadedes/me.m11.d25:meMA.Ode9C1T.mode	@ltx/en_us_goadedes/miscellanea:misc.Mode8
ltx/en_us_goadedes/me.m11.d25:meMA.Ode9C1T.ode	@ltx/en_us_goadedes/miscellanea:misc.Ode9
ltx/en_us_goadedes/me.m11.d25:meMA.Ode9C1T.text	
ltx/en_us_goadedes/me.m11.d25:meMA.Ode9C21.greekmelody	@ltx/en_us_goadedes/he.h.m8:heHE.EfrixePasaAkoi.greekname
ltx/en_us_goadedes/me.m11.d25:meMA.Ode9C21.incipit	…
ltx/en_us_goadedes/me.m11.d25:meMA.Ode9C21.melody	@ltx/en_us_goadedes/he.h.m8:heHE.EfrixePasaAkoi.name
ltx/en_us_goadedes/me.m11.d25:meMA.Ode9C21.mode	@ltx/en_us_goadedes/miscellanea:misc.Mode8
ltx/en_us_goadedes/me.m11.d25:meMA.Ode9C21.ode	@ltx/en_us_goadedes/miscellanea:misc.Ode9
ltx/en_us_goadedes/me.m11.d25:meMA.Ode9C21.text	
ltx/en_us_goadedes/me.m11.d25:meMA.Ode9C22.incipit	…
ltx/en_us_goadedes/me.m11.d25:meMA.Ode9C22.melody	@ltx/en_us_goadedes/he.h.m8:heHE.EfrixePasaAkoi.name
ltx/en_us_goadedes/me.m11.d25:meMA.Ode9C22.mode	@ltx/en_us_goadedes/miscellanea:misc.Mode8
ltx/en_us_goadedes/me.m11.d25:meMA.Ode9C22.ode	@ltx/en_us_goadedes/miscellanea:misc.Ode9
ltx/en_us_goadedes/me.m11.d25:meMA.Ode9C22.text	
ltx/en_us_goadedes/me.m11.d25:meMA.Ode9C23.incipit	…
ltx/en_us_goadedes/me.m11.d25:meMA.Ode9C23.melody	@ltx/en_us_goadedes/he.h.m8:heHE.EfrixePasaAkoi.name
ltx/en_us_goadedes/me.m11.d25:meMA.Ode9C23.mode	@ltx/en_us_goadedes/miscellanea:misc.Mode8
ltx/en_us_goadedes/me.m11.d25:meMA.Ode9C23.ode	@ltx/en_us_goadedes/miscellanea:misc.Ode9
ltx/en_us_goadedes/me.m11.d25:meMA.Ode9C23.text	
ltx/en_us_goadedes/me.m11.d25:meMA.Ode9C24.incipit	…
ltx/en_us_goadedes/me.m11.d25:meMA.Ode9C24.melody	@ltx/en_us_goadedes/he.h.m8:heHE.EfrixePasaAkoi.name
ltx/en_us_goadedes/me.m11.d25:meMA.Ode9C24.mode	@ltx/en_us_goadedes/miscellanea:misc.Mode8
ltx/en_us_goadedes/me.m11.d25:meMA.Ode9C24.ode	@ltx/en_us_goadedes/miscellanea:misc.Ode9
ltx/en_us_goadedes/me.m11.d25:meMA.Ode9C24.text	
ltx/en_us_goadedes/me.m11.d25:meMA.Ode9C2T.incipit	…
ltx/en_us_goadedes/me.m11.d25:meMA.Ode9C2T.melody	@ltx/en_us_goadedes/he.h.m8:heHE.EfrixePasaAkoi.name
ltx/en_us_goadedes/me.m11.d25:meMA.Ode9C2T.mode	@ltx/en_us_goadedes/miscellanea:misc.Mode8
ltx/en_us_goadedes/me.m11.d25:meMA.Ode9C2T.ode	@ltx/en_us_goadedes/miscellanea:misc.Ode9
ltx/en_us_goadedes/me.m11.d25:meMA.Ode9C2T.text	
ltx/en_us_goadedes/me.m11.d25:meMA.Oikos1.text	
ltx/en_us_goadedes/me.m11.d25:meMA.PostGospelBoth.incipit	@ltx/en_us_goadedes/ho.ho03:hoMA.PostGospelTheotokos.incipit
ltx/en_us_goadedes/me.m11.d25:meMA.PostGospelBoth.melody	
ltx/en_us_goadedes/me.m11.d25:meMA.PostGospelBoth.mode	@ltx/en_us_goadedes/miscellanea:misc.Mode2
ltx/en_us_goadedes/me.m11.d25:meMA.PostGospelBoth.text	@ltx/en_us_goadedes/ho.ho03:hoMA.PostGospelTheotokos.text
ltx/en_us_goadedes/me.m11.d25:meMA.PostGospelGlory.incipit	@ltx/en_us_goadedes/ho.ho03:hoMA.PostGospelWomanMartyr.incipit
ltx/en_us_goadedes/me.m11.d25:meMA.PostGospelGlory.melody	
ltx/en_us_goadedes/me.m11.d25:meMA.PostGospelGlory.mode	@ltx/en_us_goadedes/miscellanea:misc.Mode2
ltx/en_us_goadedes/me.m11.d25:meMA.PostGospelGlory.text	@ltx/en_us_goadedes/ho.ho03:hoMA.PostGospelWomanMartyr.text
ltx/en_us_goadedes/me.m11.d25:meMA.PostGospelIdiomelon.incipit	@ltx/en_us_goadedes/me.m11.d25:meVE.AposGlory.incipit
ltx/en_us_goadedes/me.m11.d25:meMA.PostGospelIdiomelon.melody	
ltx/en_us_goadedes/me.m11.d25:meMA.PostGospelIdiomelon.mode	@ltx/en_us_goadedes/miscellanea:misc.Mode2
ltx/en_us_goadedes/me.m11.d25:meMA.PostGospelIdiomelon.text	@ltx/en_us_goadedes/me.m11.d25:meVE.AposGlory.text
ltx/en_us_goadedes/me.m11.d25:meVE.Apolytikion1.greekmelody	@ltx/en_us_goadedes/he.a.m5:heAU.TonSynanarchonLogon.greekname
ltx/en_us_goadedes/me.m11.d25:meVE.Apolytikion1.incipit	…
ltx/en_us_goadedes/me.m11.d25:meVE.Apolytikion1.melody	@ltx/en_us_goadedes/he.a.m5:heAU.TonSynanarchonLogon.name
ltx/en_us_goadedes/me.m11.d25:meVE.Apolytikion1.mode	@ltx/en_us_goadedes/miscellanea:misc.Mode5
ltx/en_us_goadedes/me.m11.d25:meVE.Apolytikion1.text	
ltx/en_us_goadedes/me.m11.d25:meVE.Apolytikion2ger.greekmelody	@ltx/en_us_goadedes/he.a.m4:heAU.TachyProkatalave.greekname
ltx/en_us_goadedes/me.m11.d25:meVE.Apolytikion2ger.incipit	…
ltx/en_us_goadedes/me.m11.d25:meVE.Apolytikion2ger.melody	@ltx/en_us_goadedes/he.a.m4:heAU.TachyProkatalave.name
ltx/en_us_goadedes/me.m11.d25:meVE.Apolytikion2ger.mode	@ltx/en_us_goadedes/miscellanea:misc.Mode4
ltx/en_us_goadedes/me.m11.d25:meVE.Apolytikion2ger.poet	@ltx/en_us_goadedes/poets:po.Gerasimou
ltx/en_us_goadedes/me.m11.d25:meVE.Apolytikion2ger.text	
ltx/en_us_goadedes/me.m11.d25:meVE.AposBoth.incipit	@ltx/en_us_goadedes/me.m11.d21:meVE.AposGlory.incipit
ltx/en_us_goadedes/me.m11.d25:meVE.AposBoth.melody	
ltx/en_us_goadedes/me.m11.d25:meVE.AposBoth.mode	@ltx/en_us_goadedes/miscellanea:misc.Mode6
ltx/en_us_goadedes/me.m11.d25:meVE.AposBoth.text	@ltx/en_us_goadedes/me.m11.d21:meVE.AposGlory.text
ltx/en_us_goadedes/me.m11.d25:meVE.AposGlory.incipit	…
ltx/en_us_goadedes/me.m11.d25:meVE.AposGlory.melody	
ltx/en_us_goadedes/me.m11.d25:meVE.AposGlory.mode	@ltx/en_us_goadedes/miscellanea:misc.Mode2
ltx/en_us_goadedes/me.m11.d25:meVE.AposGlory.poet	@ltx/en_us_goadedes/poets:po.Vavyla
ltx/en_us_goadedes/me.m11.d25:meVE.AposGlory.text	
ltx/en_us_goadedes/me.m11.d25:meVE.Aposticha1.greekmelody	@ltx/en_us_goadedes/he.a.m4:heAU.OsGennaionEnMartysi.greekname
ltx/en_us_goadedes/me.m11.d25:meVE.Aposticha1.incipit	…
ltx/en_us_goadedes/me.m11.d25:meVE.Aposticha1.melody	@ltx/en_us_goadedes/he.a.m4:heAU.OsGennaionEnMartysi.name
ltx/en_us_goadedes/me.m11.d25:meVE.Aposticha1.mode	@ltx/en_us_goadedes/miscellanea:misc.Mode4
ltx/en_us_goadedes/me.m11.d25:meVE.Aposticha1.text	
ltx/en_us_goadedes/me.m11.d25:meVE.Aposticha2.incipit	…
ltx/en_us_goadedes/me.m11.d25:meVE.Aposticha2.melody	@ltx/en_us_goadedes/he.a.m4:heAU.OsGennaionEnMartysi.name
ltx/en_us_goadedes/me.m11.d25:meVE.Aposticha2.mode	@ltx/en_us_goadedes/miscellanea:misc.Mode4
ltx/en_us_goadedes/me.m11.d25:meVE.Aposticha2.text	
ltx/en_us_goadedes/me.m11.d25:meVE.Aposticha3.incipit	…
ltx/en_us_goadedes/me.m11.d25:meVE.Aposticha3.melody	@ltx/en_us_goadedes/he.a.m4:heAU.OsGennaionEnMartysi.name
ltx/en_us_goadedes/me.m11.d25:meVE.Aposticha3.mode	@ltx/en_us_goadedes/miscellanea:misc.Mode4
ltx/en_us_goadedes/me.m11.d25:meVE.Aposticha3.text	
ltx/en_us_goadedes/me.m11.d25:meVE.LityBoth.incipit	@ltx/en_us_goadedes/me.m11.d08:meVE.LityBoth.incipit
ltx/en_us_goadedes/me.m11.d25:meVE.LityBoth.melody	
ltx/en_us_goadedes/me.m11.d25:meVE.LityBoth.mode	@ltx/en_us_goadedes/miscellanea:misc.Mode4
ltx/en_us_goadedes/me.m11.d25:meVE.LityBoth.text	@ltx/en_us_goadedes/me.m11.d08:meVE.LityBoth.text
ltx/en_us_goadedes/me.m11.d25:meVE.LityGlory.incipit	…
ltx/en_us_goadedes/me.m11.d25:meVE.LityGlory.melody	
ltx/en_us_goadedes/me.m11.d25:meVE.LityGlory.mode	@ltx/en_us_goadedes/miscellanea:misc.Mode2
ltx/en_us_goadedes/me.m11.d25:meVE.LityGlory.text	
ltx/en_us_goadedes/me.m11.d25:meVE.SticBoth.incipit	@ltx/en_us_goadedes/me.m11.d21:meVE.SticGlory.incipit
ltx/en_us_goadedes/me.m11.d25:meVE.SticBoth.melody	
ltx/en_us_goadedes/me.m11.d25:meVE.SticBoth.mode	@ltx/en_us_goadedes/miscellanea:misc.Mode8
ltx/en_us_goadedes/me.m11.d25:meVE.SticBoth.text	@ltx/en_us_goadedes/me.m11.d21:meVE.SticGlory.text
ltx/en_us_goadedes/me.m11.d25:meVE.SticGlory.incipit	…
ltx/en_us_goadedes/me.m11.d25:meVE.SticGlory.melody	
ltx/en_us_goadedes/me.m11.d25:meVE.SticGlory.mode	@ltx/en_us_goadedes/miscellanea:misc.Mode2
ltx/en_us_goadedes/me.m11.d25:meVE.SticGlory.text	
ltx/en_us_goadedes/me.m11.d25:meVE.Stichera01.greekmelody	@ltx/en_us_goadedes/he.a.m1:heAU.OTouParadoxouThavmatos.greekname
ltx/en_us_goadedes/me.m11.d25:meVE.Stichera01.incipit	@ltx/en_us_goadedes/me.m11.d21:meVE.Stichera01.incipit
ltx/en_us_goadedes/me.m11.d25:meVE.Stichera01.melody	@ltx/en_us_goadedes/he.a.m1:heAU.OTouParadoxouThavmatos.name
ltx/en_us_goadedes/me.m11.d25:meVE.Stichera01.mode	@ltx/en_us_goadedes/miscellanea:misc.Mode1
ltx/en_us_goadedes/me.m11.d25:meVE.Stichera01.text	@ltx/en_us_goadedes/me.m11.d21:meVE.Stichera01.text
ltx/en_us_goadedes/me.m11.d25:meVE.Stichera02.incipit	@ltx/en_us_goadedes/me.m11.d21:meVE.Stichera02.incipit
ltx/en_us_goadedes/me.m11.d25:meVE.Stichera02.melody	@ltx/en_us_goadedes/he.a.m1:heAU.OTouParadoxouThavmatos.name
ltx/en_us_goadedes/me.m11.d25:meVE.Stichera02.mode	@ltx/en_us_goadedes/miscellanea:misc.Mode1
ltx/en_us_goadedes/me.m11.d25:meVE.Stichera02.text	@ltx/en_us_goadedes/me.m11.d21:meVE.Stichera02.text
ltx/en_us_goadedes/me.m11.d25:meVE.Stichera03.incipit	@ltx/en_us_goadedes/me.m11.d21:meVE.Stichera03.incipit
ltx/en_us_goadedes/me.m11.d25:meVE.Stichera03.melody	@ltx/en_us_goadedes/he.a.m1:heAU.OTouParadoxouThavmatos.name
ltx/en_us_goadedes/me.m11.d25:meVE.Stichera03.mode	@ltx/en_us_goadedes/miscellanea:misc.Mode1
ltx/en_us_goadedes/me.m11.d25:meVE.Stichera03.text	@ltx/en_us_goadedes/me.m11.d21:meVE.Stichera03.text
ltx/en_us_goadedes/me.m11.d25:meVE.Stichera04.greekmelody	@ltx/en_us_goadedes/he.a.m1:heAU.TonOuranionTagmaton.greekname
ltx/en_us_goadedes/me.m11.d25:meVE.Stichera04.incipit	…
ltx/en_us_goadedes/me.m11.d25:meVE.Stichera04.melody	@ltx/en_us_goadedes/he.a.m1:heAU.TonOuranionTagmaton.name
ltx/en_us_goadedes/me.m11.d25:meVE.Stichera04.mode	@ltx/en_us_goadedes/miscellanea:misc.Mode1
ltx/en_us_goadedes/me.m11.d25:meVE.Stichera04.text	
ltx/en_us_goadedes/me.m11.d25:meVE.Stichera05.incipit	…
ltx/en_us_goadedes/me.m11.d25:meVE.Stichera05.melody	@ltx/en_us_goadedes/he.a.m1:heAU.TonOuranionTagmaton.name
ltx/en_us_goadedes/me.m11.d25:meVE.Stichera05.mode	@ltx/en_us_goadedes/miscellanea:misc.Mode1
ltx/en_us_goadedes/me.m11.d25:meVE.Stichera05.text	
ltx/en_us_goadedes/me.m11.d25:meVE.Stichera06.incipit	…
ltx/en_us_goadedes/me.m11.d25:meVE.Stichera06.melody	@ltx/en_us_goadedes/he.a.m1:heAU.TonOuranionTagmaton.name
ltx/en_us_goadedes/me.m11.d25:meVE.Stichera06.mode	@ltx/en_us_goadedes/miscellanea:misc.Mode1
ltx/en_us_goadedes/me.m11.d25:meVE.Stichera06.text	
