ltx/en_us_goadedes/he.a.m1:heAU.ChorosAngelikos.greekname	Χορὸς ἀγγελικός.
ltx/en_us_goadedes/he.a.m1:heAU.ChorosAngelikos.incipit	In heaven be amazed…
ltx/en_us_goadedes/he.a.m1:heAU.ChorosAngelikos.melody	@ltx/en_us_goadedes/miscellanea:misc.Automelon
ltx/en_us_goadedes/he.a.m1:heAU.ChorosAngelikos.mode	@ltx/en_us_goadedes/miscellanea:misc.Mode1
ltx/en_us_goadedes/he.a.m1:heAU.ChorosAngelikos.name	In heaven be amazed.
ltx/en_us_goadedes/he.a.m1:heAU.ChorosAngelikos.notmetered	N/M (In heaven.)
ltx/en_us_goadedes/he.a.m1:heAU.ChorosAngelikos.text	In heaven be amazed by the wonder, O Angels; * with voices cry aloud a divine hymn, O mortals,* beholding the ineffable condescension of God to us.* For now Symeon holds in his aged embraces * Him before whom stand the hosts of heaven and tremble,* the only benevolent Lord.
ltx/en_us_goadedes/he.a.m1:heAU.NefelinSeFotos.greekname	Νεφέλην σε φωτός.
ltx/en_us_goadedes/he.a.m1:heAU.NefelinSeFotos.incipit	Nefelin Se Fotos…
ltx/en_us_goadedes/he.a.m1:heAU.NefelinSeFotos.melody	@ltx/en_us_goadedes/miscellanea:misc.Automelon
ltx/en_us_goadedes/he.a.m1:heAU.NefelinSeFotos.mode	@ltx/en_us_goadedes/miscellanea:misc.Mode1
ltx/en_us_goadedes/he.a.m1:heAU.NefelinSeFotos.name	Nefelin Se Fotos.
ltx/en_us_goadedes/he.a.m1:heAU.NefelinSeFotos.notmetered	N/M (Nefelin Se Fotos)
ltx/en_us_goadedes/he.a.m1:heAU.NefelinSeFotos.text	
ltx/en_us_goadedes/he.a.m1:heAU.OTouParadoxouThavmatos.greekname	Ὢ τοῦ παραδόξου θαύματος.
ltx/en_us_goadedes/he.a.m1:heAU.OTouParadoxouThavmatos.incipit	Marvel at the wondrous paradox…
ltx/en_us_goadedes/he.a.m1:heAU.OTouParadoxouThavmatos.melody	@ltx/en_us_goadedes/miscellanea:misc.Automelon
ltx/en_us_goadedes/he.a.m1:heAU.OTouParadoxouThavmatos.mode	@ltx/en_us_goadedes/miscellanea:misc.Mode1
ltx/en_us_goadedes/he.a.m1:heAU.OTouParadoxouThavmatos.name	Marvel at the wondrous paradox.
ltx/en_us_goadedes/he.a.m1:heAU.OTouParadoxouThavmatos.notmetered	N/M (Marvel.)
ltx/en_us_goadedes/he.a.m1:heAU.OTouParadoxouThavmatos.text	Marvel at the wondrous paradox! * Now the fount of our life has been laid within a tomb; * her tomb has become a ladder to heaven above. * Gethsemane, holy place, * the Theotokos reposed in you. Celebrate! * Believers, together sing, * having the Archangel Gabriel leading us. * “We salute you, Lady full of grace: O rejoice! For the Lord * is with you and is granting to the world great mercy through you.”
ltx/en_us_goadedes/he.a.m1:heAU.OtanElthisOTheos.greekname	Ὅταν ἔλθῃς ὁ Θεός.
ltx/en_us_goadedes/he.a.m1:heAU.OtanElthisOTheos.incipit	When You come down…
ltx/en_us_goadedes/he.a.m1:heAU.OtanElthisOTheos.melody	@ltx/en_us_goadedes/miscellanea:misc.Automelon
ltx/en_us_goadedes/he.a.m1:heAU.OtanElthisOTheos.mode	@ltx/en_us_goadedes/miscellanea:misc.Mode1
ltx/en_us_goadedes/he.a.m1:heAU.OtanElthisOTheos.name	When You come down.
ltx/en_us_goadedes/he.a.m1:heAU.OtanElthisOTheos.notmetered	N/M (When You come down.)
ltx/en_us_goadedes/he.a.m1:heAU.OtanElthisOTheos.text	When You come down to the earth, O God, in Your glory, all things will cower tremulous, and a river of fire will draw before Your Judgment Seat; the books shall be opened up, and public knowledge will things hidden be. Rescue me, then, I pray, from unquenchable fire, and count me worthy to stand at Your right hand, O You, the most righteous Judge.
ltx/en_us_goadedes/he.a.m1:heAU.PaneffimoiMartyres.greekname	Πανεύφημοι μάρτυρες.
ltx/en_us_goadedes/he.a.m1:heAU.PaneffimoiMartyres.incipit	O Martyrs, extolled…
ltx/en_us_goadedes/he.a.m1:heAU.PaneffimoiMartyres.melody	@ltx/en_us_goadedes/miscellanea:misc.Automelon
ltx/en_us_goadedes/he.a.m1:heAU.PaneffimoiMartyres.mode	@ltx/en_us_goadedes/miscellanea:misc.Mode1
ltx/en_us_goadedes/he.a.m1:heAU.PaneffimoiMartyres.name	O Martyrs, extolled.
ltx/en_us_goadedes/he.a.m1:heAU.PaneffimoiMartyres.notmetered	N/M (O Martyrs, extolled.)
ltx/en_us_goadedes/he.a.m1:heAU.PaneffimoiMartyres.text	O Martyrs, extolled in all the world, * you were not concealed by earth, * but rather heaven admitted you. The gates of Paradise * unto you were opened. * Having gone within, you now * enjoy the tree of life, and you intercede with Christ on our behalf, * supplicating that surpassing peace * and great mercy * be upon our souls bestowed.
ltx/en_us_goadedes/he.a.m1:heAU.TisErimouPolitis.greekname	Τῆς ἐρήμου πολίτης.
ltx/en_us_goadedes/he.a.m1:heAU.TisErimouPolitis.incipit	As a citizen of the desert…
ltx/en_us_goadedes/he.a.m1:heAU.TisErimouPolitis.melody	@ltx/en_us_goadedes/miscellanea:misc.Automelon
ltx/en_us_goadedes/he.a.m1:heAU.TisErimouPolitis.mode	@ltx/en_us_goadedes/miscellanea:misc.Mode1
ltx/en_us_goadedes/he.a.m1:heAU.TisErimouPolitis.name	As a citizen of the desert.
ltx/en_us_goadedes/he.a.m1:heAU.TisErimouPolitis.notmetered	N/M (As a citizen.)
ltx/en_us_goadedes/he.a.m1:heAU.TisErimouPolitis.text	As a citizen of the desert and an angel incarnate * and a wonder-worker you shone forth, O [name] our God-bearing father. * Since you received the spiritual gifts * by fasting and vigilance and prayer, * you can cure those who are ailing and heal the souls * of those who run to you with faith. * Glory to Him who gave His might to you; * glory to Him who placed a crown on you; * glory to Him who operates through you, providing cures to all.
ltx/en_us_goadedes/he.a.m1:heAU.TonOuranionTagmaton.greekname	Τῶν οὐρανίων ταγμάτων.
ltx/en_us_goadedes/he.a.m1:heAU.TonOuranionTagmaton.incipit	For all the powers of heaven…
ltx/en_us_goadedes/he.a.m1:heAU.TonOuranionTagmaton.melody	@ltx/en_us_goadedes/miscellanea:misc.Automelon
ltx/en_us_goadedes/he.a.m1:heAU.TonOuranionTagmaton.mode	@ltx/en_us_goadedes/miscellanea:misc.Mode1
ltx/en_us_goadedes/he.a.m1:heAU.TonOuranionTagmaton.name	For all the powers of heaven.
ltx/en_us_goadedes/he.a.m1:heAU.TonOuranionTagmaton.notmetered	N/M (For all the powers.)
ltx/en_us_goadedes/he.a.m1:heAU.TonOuranionTagmaton.text	For all the powers of heaven you are exultant joy. * For us on earth, O Lady, you are mighty protection. * Pure and holy Virgin, save us, we pray, * when for refuge we come to you. * O Theotokos, for second only to God, * it is you in whom we set our hopes.
ltx/en_us_goadedes/he.a.m1:heAU.TonTafonSouSotir.greekname	Τὸν τάφον σου Σωτήρ.
ltx/en_us_goadedes/he.a.m1:heAU.TonTafonSouSotir.incipit	The soldiers who were guarding…
ltx/en_us_goadedes/he.a.m1:heAU.TonTafonSouSotir.melody	@ltx/en_us_goadedes/miscellanea:misc.Automelon
ltx/en_us_goadedes/he.a.m1:heAU.TonTafonSouSotir.mode	@ltx/en_us_goadedes/miscellanea:misc.Mode1
ltx/en_us_goadedes/he.a.m1:heAU.TonTafonSouSotir.name	The soldiers.
ltx/en_us_goadedes/he.a.m1:heAU.TonTafonSouSotir.notmetered	N/M (The soldiers.)
ltx/en_us_goadedes/he.a.m1:heAU.TonTafonSouSotir.text	The soldiers who were guarding Your tomb became like dead men, * O Savior, when Your Angel appeared there like lightning * and said to the women that You had risen, as You had said. * We now worship You, our only God, and extol You, * for You conquered death and dissolution, O Master, * and rose from the sepulcher.
ltx/en_us_goadedes/he.a.m1:heAU.TouLithouSfragisthentos.greekname	Τοῦ λίθου σφραγισθέντος.
ltx/en_us_goadedes/he.a.m1:heAU.TouLithouSfragisthentos.incipit	The stone having been sealed…
ltx/en_us_goadedes/he.a.m1:heAU.TouLithouSfragisthentos.melody	@ltx/en_us_goadedes/miscellanea:misc.Automelon
ltx/en_us_goadedes/he.a.m1:heAU.TouLithouSfragisthentos.mode	@ltx/en_us_goadedes/miscellanea:misc.Mode1
ltx/en_us_goadedes/he.a.m1:heAU.TouLithouSfragisthentos.name	The stone having been sealed.
ltx/en_us_goadedes/he.a.m1:heAU.TouLithouSfragisthentos.notmetered	N/M (The stone.)
ltx/en_us_goadedes/he.a.m1:heAU.TouLithouSfragisthentos.text	The stone having been sealed by the Pharisees and chief priests, * and Your all-immaculate body being guarded by soldiers, * You rose on the third day, O Lord and Savior, granting life unto the world. * Then the powers of the heavens cried out to You, O Giver of Life, and shouted, * “Glory to Your resurrection, O Christ! * Glory to Your eternal rule! * Glory to Your plan for saving us, only benevolent God!”
ltx/en_us_goadedes/he.a.m1:heAU.title	Automela of Mode 1
