ltx/en_us_goadedes/oc.m2.d7:ocBK.ModeNaked	@ltx/en_us_goadedes/miscellanea:misc.Mode2.naked
ltx/en_us_goadedes/oc.m2.d7:ocBK.end.title	
ltx/en_us_goadedes/oc.m2.d7:ocBK.end.verse1.text	
ltx/en_us_goadedes/oc.m2.d7:ocBK.end.verse2.text	
ltx/en_us_goadedes/oc.m2.d7:ocBK.end.verse3.text	
ltx/en_us_goadedes/oc.m2.d7:ocBK.end.verse4.text	
ltx/en_us_goadedes/oc.m2.d7:ocBK.end.verse5.text	
ltx/en_us_goadedes/oc.m2.d7:ocBK.end.verse6.text	
ltx/en_us_goadedes/oc.m2.d7:ocLI.Beatitudes1.incipit	@ltx/en_us_goadedes/oc.m2.d1:ocLI.Beatitudes1.incipit
ltx/en_us_goadedes/oc.m2.d7:ocLI.Beatitudes1.melody	@ltx/en_us_goadedes/he.h.m2:heHE.SyToLogoSouKyrie.name
ltx/en_us_goadedes/oc.m2.d7:ocLI.Beatitudes1.mode	@ltx/en_us_goadedes/miscellanea:misc.Mode2
ltx/en_us_goadedes/oc.m2.d7:ocLI.Beatitudes1.text	@ltx/en_us_goadedes/oc.m2.d1:ocLI.Beatitudes1.text
ltx/en_us_goadedes/oc.m2.d7:ocLI.Beatitudes2.incipit	…
ltx/en_us_goadedes/oc.m2.d7:ocLI.Beatitudes2.melody	@ltx/en_us_goadedes/he.h.m2:heHE.SyToLogoSouKyrie.name
ltx/en_us_goadedes/oc.m2.d7:ocLI.Beatitudes2.mode	@ltx/en_us_goadedes/miscellanea:misc.Mode2
ltx/en_us_goadedes/oc.m2.d7:ocLI.Beatitudes2.text	
ltx/en_us_goadedes/oc.m2.d7:ocLI.Beatitudes3.incipit	…
ltx/en_us_goadedes/oc.m2.d7:ocLI.Beatitudes3.melody	@ltx/en_us_goadedes/he.h.m2:heHE.SyToLogoSouKyrie.name
ltx/en_us_goadedes/oc.m2.d7:ocLI.Beatitudes3.mode	@ltx/en_us_goadedes/miscellanea:misc.Mode2
ltx/en_us_goadedes/oc.m2.d7:ocLI.Beatitudes3.text	
ltx/en_us_goadedes/oc.m2.d7:ocLI.Beatitudes4.incipit	…
ltx/en_us_goadedes/oc.m2.d7:ocLI.Beatitudes4.melody	@ltx/en_us_goadedes/he.h.m2:heHE.SyToLogoSouKyrie.name
ltx/en_us_goadedes/oc.m2.d7:ocLI.Beatitudes4.mode	@ltx/en_us_goadedes/miscellanea:misc.Mode2
ltx/en_us_goadedes/oc.m2.d7:ocLI.Beatitudes4.text	
ltx/en_us_goadedes/oc.m2.d7:ocLI.BeatitudesT.incipit	…
ltx/en_us_goadedes/oc.m2.d7:ocLI.BeatitudesT.melody	@ltx/en_us_goadedes/he.h.m2:heHE.SyToLogoSouKyrie.name
ltx/en_us_goadedes/oc.m2.d7:ocLI.BeatitudesT.mode	@ltx/en_us_goadedes/miscellanea:misc.Mode2
ltx/en_us_goadedes/oc.m2.d7:ocLI.BeatitudesT.text	
ltx/en_us_goadedes/oc.m2.d7:ocLI.BeatitudesTr.incipit	…
ltx/en_us_goadedes/oc.m2.d7:ocLI.BeatitudesTr.melody	@ltx/en_us_goadedes/he.h.m2:heHE.SyToLogoSouKyrie.name
ltx/en_us_goadedes/oc.m2.d7:ocLI.BeatitudesTr.mode	@ltx/en_us_goadedes/miscellanea:misc.Mode2
ltx/en_us_goadedes/oc.m2.d7:ocLI.BeatitudesTr.text	
ltx/en_us_goadedes/oc.m2.d7:ocLI.MM.Beatitudes1234TrTas78910GB.text	@ltx/en_us_goadedes/properties:media.key
ltx/en_us_goadedes/oc.m2.d7:ocMA.ApolTheotokion.incipit	@ltx/en_us_goadedes/oc.m2.d2:ocMA.ApolTheotokion.incipit
ltx/en_us_goadedes/oc.m2.d7:ocMA.ApolTheotokion.melody	
ltx/en_us_goadedes/oc.m2.d7:ocMA.ApolTheotokion.mode	@ltx/en_us_goadedes/miscellanea:misc.Mode2
ltx/en_us_goadedes/oc.m2.d7:ocMA.ApolTheotokion.text	@ltx/en_us_goadedes/oc.m2.d2:ocMA.ApolTheotokion.text
ltx/en_us_goadedes/oc.m2.d7:ocMA.AposTheotokion.greekmelody	@ltx/en_us_goadedes/he.a.m2:heAU.OteEkTouXylou.greekname
ltx/en_us_goadedes/oc.m2.d7:ocMA.AposTheotokion.incipit	…
ltx/en_us_goadedes/oc.m2.d7:ocMA.AposTheotokion.melody	@ltx/en_us_goadedes/he.a.m2:heAU.OteEkTouXylou.name
ltx/en_us_goadedes/oc.m2.d7:ocMA.AposTheotokion.mode	@ltx/en_us_goadedes/miscellanea:misc.Mode2
ltx/en_us_goadedes/oc.m2.d7:ocMA.AposTheotokion.text	
ltx/en_us_goadedes/oc.m2.d7:ocMA.Aposticha1.greekmelody	@ltx/en_us_goadedes/he.a.m2:heAU.OteEkTouXylou.greekname
ltx/en_us_goadedes/oc.m2.d7:ocMA.Aposticha1.incipit	…
ltx/en_us_goadedes/oc.m2.d7:ocMA.Aposticha1.melody	@ltx/en_us_goadedes/he.a.m2:heAU.OteEkTouXylou.name
ltx/en_us_goadedes/oc.m2.d7:ocMA.Aposticha1.mode	@ltx/en_us_goadedes/miscellanea:misc.Mode2
ltx/en_us_goadedes/oc.m2.d7:ocMA.Aposticha1.text	
ltx/en_us_goadedes/oc.m2.d7:ocMA.Aposticha2.greekmelody	@ltx/en_us_goadedes/he.a.m2:heAU.OteEkTouXylou.greekname
ltx/en_us_goadedes/oc.m2.d7:ocMA.Aposticha2.incipit	…
ltx/en_us_goadedes/oc.m2.d7:ocMA.Aposticha2.melody	@ltx/en_us_goadedes/he.a.m2:heAU.OteEkTouXylou.name
ltx/en_us_goadedes/oc.m2.d7:ocMA.Aposticha2.mode	@ltx/en_us_goadedes/miscellanea:misc.Mode2
ltx/en_us_goadedes/oc.m2.d7:ocMA.Aposticha2.text	
ltx/en_us_goadedes/oc.m2.d7:ocMA.Aposticha3.greekmelody	@ltx/en_us_goadedes/he.a.m2:heAU.OteEkTouXylou.greekname
ltx/en_us_goadedes/oc.m2.d7:ocMA.Aposticha3.incipit	…
ltx/en_us_goadedes/oc.m2.d7:ocMA.Aposticha3.melody	@ltx/en_us_goadedes/he.a.m2:heAU.OteEkTouXylou.name
ltx/en_us_goadedes/oc.m2.d7:ocMA.Aposticha3.mode	@ltx/en_us_goadedes/miscellanea:misc.Mode2
ltx/en_us_goadedes/oc.m2.d7:ocMA.Aposticha3.text	
ltx/en_us_goadedes/oc.m2.d7:ocMA.Aposticha4.greekmelody	@ltx/en_us_goadedes/he.a.m2:heAU.OteEkTouXylou.greekname
ltx/en_us_goadedes/oc.m2.d7:ocMA.Aposticha4.incipit	…
ltx/en_us_goadedes/oc.m2.d7:ocMA.Aposticha4.melody	@ltx/en_us_goadedes/he.a.m2:heAU.OteEkTouXylou.name
ltx/en_us_goadedes/oc.m2.d7:ocMA.Aposticha4.mode	@ltx/en_us_goadedes/miscellanea:misc.Mode2
ltx/en_us_goadedes/oc.m2.d7:ocMA.Aposticha4.text	
ltx/en_us_goadedes/oc.m2.d7:ocMA.C1.acrostic.notice1	
ltx/en_us_goadedes/oc.m2.d7:ocMA.C1.acrostic.text	
ltx/en_us_goadedes/oc.m2.d7:ocMA.C1.acrostic.title	Canon for all the Saints.
ltx/en_us_goadedes/oc.m2.d7:ocMA.C2.acrostic.notice1	
ltx/en_us_goadedes/oc.m2.d7:ocMA.C2.acrostic.text	
ltx/en_us_goadedes/oc.m2.d7:ocMA.C2.acrostic.title	Canon for the Deceased.
ltx/en_us_goadedes/oc.m2.d7:ocMA.C2.poet	@ltx/en_us_goadedes/poets:po.Theofanous
ltx/en_us_goadedes/oc.m2.d7:ocMA.CA.notice	
ltx/en_us_goadedes/oc.m2.d7:ocMA.Kathisma11.incipit	@ltx/en_us_goadedes/oc.m2.d3:ocMA.Kathisma32.incipit
ltx/en_us_goadedes/oc.m2.d7:ocMA.Kathisma11.melody	
ltx/en_us_goadedes/oc.m2.d7:ocMA.Kathisma11.mode	@ltx/en_us_goadedes/miscellanea:misc.Mode2
ltx/en_us_goadedes/oc.m2.d7:ocMA.Kathisma11.text	@ltx/en_us_goadedes/oc.m2.d3:ocMA.Kathisma32.text
ltx/en_us_goadedes/oc.m2.d7:ocMA.Kathisma12.incipit	@ltx/en_us_goadedes/oc.m2.d4:ocMA.Kathisma32.incipit
ltx/en_us_goadedes/oc.m2.d7:ocMA.Kathisma12.melody	
ltx/en_us_goadedes/oc.m2.d7:ocMA.Kathisma12.mode	@ltx/en_us_goadedes/miscellanea:misc.Mode2
ltx/en_us_goadedes/oc.m2.d7:ocMA.Kathisma12.text	@ltx/en_us_goadedes/oc.m2.d4:ocMA.Kathisma32.text
ltx/en_us_goadedes/oc.m2.d7:ocMA.Kathisma13.incipit	@ltx/en_us_goadedes/oc.m2.d5:ocMA.Kathisma32.incipit
ltx/en_us_goadedes/oc.m2.d7:ocMA.Kathisma13.melody	
ltx/en_us_goadedes/oc.m2.d7:ocMA.Kathisma13.mode	@ltx/en_us_goadedes/miscellanea:misc.Mode2
ltx/en_us_goadedes/oc.m2.d7:ocMA.Kathisma13.text	@ltx/en_us_goadedes/oc.m2.d5:ocMA.Kathisma32.text
ltx/en_us_goadedes/oc.m2.d7:ocMA.Kathisma14.incipit	@ltx/en_us_goadedes/oc.m2.d1:ocVE.ApolTheotokionVM.incipit
ltx/en_us_goadedes/oc.m2.d7:ocMA.Kathisma14.melody	
ltx/en_us_goadedes/oc.m2.d7:ocMA.Kathisma14.mode	@ltx/en_us_goadedes/miscellanea:misc.Mode2
ltx/en_us_goadedes/oc.m2.d7:ocMA.Kathisma14.text	@ltx/en_us_goadedes/oc.m2.d1:ocVE.ApolTheotokionVM.text
ltx/en_us_goadedes/oc.m2.d7:ocMA.Kathisma21.incipit	@ltx/en_us_goadedes/oc.m2.d2:ocMA.Kathisma32.incipit
ltx/en_us_goadedes/oc.m2.d7:ocMA.Kathisma21.melody	
ltx/en_us_goadedes/oc.m2.d7:ocMA.Kathisma21.mode	@ltx/en_us_goadedes/miscellanea:misc.Mode2
ltx/en_us_goadedes/oc.m2.d7:ocMA.Kathisma21.text	@ltx/en_us_goadedes/oc.m2.d2:ocMA.Kathisma32.text
ltx/en_us_goadedes/oc.m2.d7:ocMA.Kathisma22.greekmelody	@ltx/en_us_goadedes/he.a.m2:heAU.EfsplagchniasYparchousa.greekname
ltx/en_us_goadedes/oc.m2.d7:ocMA.Kathisma22.incipit	As the Giver of life…
ltx/en_us_goadedes/oc.m2.d7:ocMA.Kathisma22.melody	@ltx/en_us_goadedes/he.a.m2:heAU.EfsplagchniasYparchousa.name
ltx/en_us_goadedes/oc.m2.d7:ocMA.Kathisma22.mode	@ltx/en_us_goadedes/miscellanea:misc.Mode2
ltx/en_us_goadedes/oc.m2.d7:ocMA.Kathisma22.text	As the Giver of life and only God, * with authority over all, the dead and the living, * listen to Your servants when we pray to You, * show us Your compassionate and tender love. * We pray You forgive the sins * of souls who have hoped in You * and whom You took to yourself, * who are most benevolent and merciful.
ltx/en_us_goadedes/oc.m2.d7:ocMA.Kathisma23.incipit	…
ltx/en_us_goadedes/oc.m2.d7:ocMA.Kathisma23.melody	
ltx/en_us_goadedes/oc.m2.d7:ocMA.Kathisma23.mode	@ltx/en_us_goadedes/miscellanea:misc.Mode2
ltx/en_us_goadedes/oc.m2.d7:ocMA.Kathisma23.text	
ltx/en_us_goadedes/oc.m2.d7:ocMA.Kathisma24.incipit	@ltx/en_us_goadedes/oc.m2.d2:ocMA.ApolTheotokion.incipit
ltx/en_us_goadedes/oc.m2.d7:ocMA.Kathisma24.melody	
ltx/en_us_goadedes/oc.m2.d7:ocMA.Kathisma24.mode	@ltx/en_us_goadedes/miscellanea:misc.Mode2
ltx/en_us_goadedes/oc.m2.d7:ocMA.Kathisma24.text	@ltx/en_us_goadedes/oc.m2.d2:ocMA.ApolTheotokion.text
ltx/en_us_goadedes/oc.m2.d7:ocMA.Lauds1.incipit	@ltx/en_us_goadedes/oc.m2.d3:ocMA.Aposticha3.incipit
ltx/en_us_goadedes/oc.m2.d7:ocMA.Lauds1.melody	
ltx/en_us_goadedes/oc.m2.d7:ocMA.Lauds1.mode	@ltx/en_us_goadedes/miscellanea:misc.Mode2
ltx/en_us_goadedes/oc.m2.d7:ocMA.Lauds1.text	@ltx/en_us_goadedes/oc.m2.d3:ocMA.Aposticha3.text
ltx/en_us_goadedes/oc.m2.d7:ocMA.Lauds2.incipit	@ltx/en_us_goadedes/oc.m2.d4:ocMA.Aposticha3.incipit
ltx/en_us_goadedes/oc.m2.d7:ocMA.Lauds2.melody	
ltx/en_us_goadedes/oc.m2.d7:ocMA.Lauds2.mode	@ltx/en_us_goadedes/miscellanea:misc.Mode2
ltx/en_us_goadedes/oc.m2.d7:ocMA.Lauds2.text	@ltx/en_us_goadedes/oc.m2.d4:ocMA.Aposticha3.text
ltx/en_us_goadedes/oc.m2.d7:ocMA.Lauds3.incipit	@ltx/en_us_goadedes/oc.m2.d5:ocMA.Aposticha3.incipit
ltx/en_us_goadedes/oc.m2.d7:ocMA.Lauds3.melody	
ltx/en_us_goadedes/oc.m2.d7:ocMA.Lauds3.mode	@ltx/en_us_goadedes/miscellanea:misc.Mode2
ltx/en_us_goadedes/oc.m2.d7:ocMA.Lauds3.text	@ltx/en_us_goadedes/oc.m2.d5:ocMA.Aposticha3.text
ltx/en_us_goadedes/oc.m2.d7:ocMA.Lauds4.incipit	…
ltx/en_us_goadedes/oc.m2.d7:ocMA.Lauds4.melody	
ltx/en_us_goadedes/oc.m2.d7:ocMA.Lauds4.mode	@ltx/en_us_goadedes/miscellanea:misc.Mode2
ltx/en_us_goadedes/oc.m2.d7:ocMA.Lauds4.text	
ltx/en_us_goadedes/oc.m2.d7:ocMA.LaudsRubric1.text	@ltx/en_us_goadedes/oc.m1.d7:ocMA.LaudsRubric1.text
ltx/en_us_goadedes/oc.m2.d7:ocMA.LaudsTheotokion.incipit	…
ltx/en_us_goadedes/oc.m2.d7:ocMA.LaudsTheotokion.melody	@ltx/en_us_goadedes/he.a.m2:heAU.OteEkTouXylou.name
ltx/en_us_goadedes/oc.m2.d7:ocMA.LaudsTheotokion.mode	@ltx/en_us_goadedes/miscellanea:misc.Mode2
ltx/en_us_goadedes/oc.m2.d7:ocMA.LaudsTheotokion.text	
ltx/en_us_goadedes/oc.m2.d7:ocMA.MM.Alleluia.text	@ltx/en_us_goadedes/properties:media.key
ltx/en_us_goadedes/oc.m2.d7:ocMA.OdeW1C11.incipit	…
ltx/en_us_goadedes/oc.m2.d7:ocMA.OdeW1C11.melody	@ltx/en_us_goadedes/he.h.m2:heHE.TinMoseosOdin.name
ltx/en_us_goadedes/oc.m2.d7:ocMA.OdeW1C11.mode	@ltx/en_us_goadedes/miscellanea:misc.Mode2
ltx/en_us_goadedes/oc.m2.d7:ocMA.OdeW1C11.ode	@ltx/en_us_goadedes/miscellanea:misc.Ode1
ltx/en_us_goadedes/oc.m2.d7:ocMA.OdeW1C11.text	
ltx/en_us_goadedes/oc.m2.d7:ocMA.OdeW1C12.incipit	…
ltx/en_us_goadedes/oc.m2.d7:ocMA.OdeW1C12.melody	@ltx/en_us_goadedes/he.h.m2:heHE.TinMoseosOdin.name
ltx/en_us_goadedes/oc.m2.d7:ocMA.OdeW1C12.mode	@ltx/en_us_goadedes/miscellanea:misc.Mode2
ltx/en_us_goadedes/oc.m2.d7:ocMA.OdeW1C12.ode	@ltx/en_us_goadedes/miscellanea:misc.Ode1
ltx/en_us_goadedes/oc.m2.d7:ocMA.OdeW1C12.text	
ltx/en_us_goadedes/oc.m2.d7:ocMA.OdeW1C13.incipit	…
ltx/en_us_goadedes/oc.m2.d7:ocMA.OdeW1C13.melody	@ltx/en_us_goadedes/he.h.m2:heHE.TinMoseosOdin.name
ltx/en_us_goadedes/oc.m2.d7:ocMA.OdeW1C13.mode	@ltx/en_us_goadedes/miscellanea:misc.Mode2
ltx/en_us_goadedes/oc.m2.d7:ocMA.OdeW1C13.ode	@ltx/en_us_goadedes/miscellanea:misc.Ode1
ltx/en_us_goadedes/oc.m2.d7:ocMA.OdeW1C13.text	
ltx/en_us_goadedes/oc.m2.d7:ocMA.OdeW1C14.incipit	…
ltx/en_us_goadedes/oc.m2.d7:ocMA.OdeW1C14.melody	@ltx/en_us_goadedes/he.h.m2:heHE.TinMoseosOdin.name
ltx/en_us_goadedes/oc.m2.d7:ocMA.OdeW1C14.mode	@ltx/en_us_goadedes/miscellanea:misc.Mode2
ltx/en_us_goadedes/oc.m2.d7:ocMA.OdeW1C14.ode	@ltx/en_us_goadedes/miscellanea:misc.Ode1
ltx/en_us_goadedes/oc.m2.d7:ocMA.OdeW1C14.text	
ltx/en_us_goadedes/oc.m2.d7:ocMA.OdeW1C1H.greekmelody	@ltx/en_us_goadedes/he.h.m2:heHE.TinMoseosOdin.greekname
ltx/en_us_goadedes/oc.m2.d7:ocMA.OdeW1C1H.incipit	@ltx/en_us_goadedes/he.h.m2:heHE.TinMoseosOdin.incipit
ltx/en_us_goadedes/oc.m2.d7:ocMA.OdeW1C1H.melody	@ltx/en_us_goadedes/he.h.m2:heHE.TinMoseosOdin.melody
ltx/en_us_goadedes/oc.m2.d7:ocMA.OdeW1C1H.mode	@ltx/en_us_goadedes/miscellanea:misc.Mode2
ltx/en_us_goadedes/oc.m2.d7:ocMA.OdeW1C1H.ode	@ltx/en_us_goadedes/miscellanea:misc.Ode1
ltx/en_us_goadedes/oc.m2.d7:ocMA.OdeW1C1H.text	@ltx/en_us_goadedes/he.h.m2:heHE.TinMoseosOdin.text
ltx/en_us_goadedes/oc.m2.d7:ocMA.OdeW1C1T.incipit	…
ltx/en_us_goadedes/oc.m2.d7:ocMA.OdeW1C1T.melody	@ltx/en_us_goadedes/he.h.m2:heHE.TinMoseosOdin.name
ltx/en_us_goadedes/oc.m2.d7:ocMA.OdeW1C1T.mode	@ltx/en_us_goadedes/miscellanea:misc.Mode2
ltx/en_us_goadedes/oc.m2.d7:ocMA.OdeW1C1T.ode	@ltx/en_us_goadedes/miscellanea:misc.Ode1
ltx/en_us_goadedes/oc.m2.d7:ocMA.OdeW1C1T.text	
ltx/en_us_goadedes/oc.m2.d7:ocMA.OdeW1C21.greekmelody	@ltx/en_us_goadedes/he.h.m2:heHE.ToTinAvaton.greekname
ltx/en_us_goadedes/oc.m2.d7:ocMA.OdeW1C21.incipit	…
ltx/en_us_goadedes/oc.m2.d7:ocMA.OdeW1C21.melody	@ltx/en_us_goadedes/he.h.m2:heHE.ToTinAvaton.name
ltx/en_us_goadedes/oc.m2.d7:ocMA.OdeW1C21.mode	@ltx/en_us_goadedes/miscellanea:misc.Mode2
ltx/en_us_goadedes/oc.m2.d7:ocMA.OdeW1C21.ode	@ltx/en_us_goadedes/miscellanea:misc.Ode1
ltx/en_us_goadedes/oc.m2.d7:ocMA.OdeW1C21.text	
ltx/en_us_goadedes/oc.m2.d7:ocMA.OdeW1C22.incipit	…
ltx/en_us_goadedes/oc.m2.d7:ocMA.OdeW1C22.melody	@ltx/en_us_goadedes/he.h.m2:heHE.ToTinAvaton.name
ltx/en_us_goadedes/oc.m2.d7:ocMA.OdeW1C22.mode	@ltx/en_us_goadedes/miscellanea:misc.Mode2
ltx/en_us_goadedes/oc.m2.d7:ocMA.OdeW1C22.ode	@ltx/en_us_goadedes/miscellanea:misc.Ode1
ltx/en_us_goadedes/oc.m2.d7:ocMA.OdeW1C22.text	
ltx/en_us_goadedes/oc.m2.d7:ocMA.OdeW1C23.incipit	…
ltx/en_us_goadedes/oc.m2.d7:ocMA.OdeW1C23.melody	@ltx/en_us_goadedes/he.h.m2:heHE.ToTinAvaton.name
ltx/en_us_goadedes/oc.m2.d7:ocMA.OdeW1C23.mode	@ltx/en_us_goadedes/miscellanea:misc.Mode2
ltx/en_us_goadedes/oc.m2.d7:ocMA.OdeW1C23.ode	@ltx/en_us_goadedes/miscellanea:misc.Ode1
ltx/en_us_goadedes/oc.m2.d7:ocMA.OdeW1C23.text	
ltx/en_us_goadedes/oc.m2.d7:ocMA.OdeW1C2T.incipit	…
ltx/en_us_goadedes/oc.m2.d7:ocMA.OdeW1C2T.melody	@ltx/en_us_goadedes/he.h.m2:heHE.ToTinAvaton.name
ltx/en_us_goadedes/oc.m2.d7:ocMA.OdeW1C2T.mode	@ltx/en_us_goadedes/miscellanea:misc.Mode2
ltx/en_us_goadedes/oc.m2.d7:ocMA.OdeW1C2T.ode	@ltx/en_us_goadedes/miscellanea:misc.Ode1
ltx/en_us_goadedes/oc.m2.d7:ocMA.OdeW1C2T.text	
ltx/en_us_goadedes/oc.m2.d7:ocMA.OdeW3C11.incipit	…
ltx/en_us_goadedes/oc.m2.d7:ocMA.OdeW3C11.melody	@ltx/en_us_goadedes/he.h.m2:heHE.SteirothentaMouTonNoun.name
ltx/en_us_goadedes/oc.m2.d7:ocMA.OdeW3C11.mode	@ltx/en_us_goadedes/miscellanea:misc.Mode2
ltx/en_us_goadedes/oc.m2.d7:ocMA.OdeW3C11.ode	@ltx/en_us_goadedes/miscellanea:misc.Ode3
ltx/en_us_goadedes/oc.m2.d7:ocMA.OdeW3C11.text	
ltx/en_us_goadedes/oc.m2.d7:ocMA.OdeW3C12.incipit	…
ltx/en_us_goadedes/oc.m2.d7:ocMA.OdeW3C12.melody	@ltx/en_us_goadedes/he.h.m2:heHE.SteirothentaMouTonNoun.name
ltx/en_us_goadedes/oc.m2.d7:ocMA.OdeW3C12.mode	@ltx/en_us_goadedes/miscellanea:misc.Mode2
ltx/en_us_goadedes/oc.m2.d7:ocMA.OdeW3C12.ode	@ltx/en_us_goadedes/miscellanea:misc.Ode3
ltx/en_us_goadedes/oc.m2.d7:ocMA.OdeW3C12.text	
ltx/en_us_goadedes/oc.m2.d7:ocMA.OdeW3C13.incipit	…
ltx/en_us_goadedes/oc.m2.d7:ocMA.OdeW3C13.melody	@ltx/en_us_goadedes/he.h.m2:heHE.SteirothentaMouTonNoun.name
ltx/en_us_goadedes/oc.m2.d7:ocMA.OdeW3C13.mode	@ltx/en_us_goadedes/miscellanea:misc.Mode2
ltx/en_us_goadedes/oc.m2.d7:ocMA.OdeW3C13.ode	@ltx/en_us_goadedes/miscellanea:misc.Ode3
ltx/en_us_goadedes/oc.m2.d7:ocMA.OdeW3C13.text	
ltx/en_us_goadedes/oc.m2.d7:ocMA.OdeW3C14.incipit	…
ltx/en_us_goadedes/oc.m2.d7:ocMA.OdeW3C14.melody	@ltx/en_us_goadedes/he.h.m2:heHE.SteirothentaMouTonNoun.name
ltx/en_us_goadedes/oc.m2.d7:ocMA.OdeW3C14.mode	@ltx/en_us_goadedes/miscellanea:misc.Mode2
ltx/en_us_goadedes/oc.m2.d7:ocMA.OdeW3C14.ode	@ltx/en_us_goadedes/miscellanea:misc.Ode3
ltx/en_us_goadedes/oc.m2.d7:ocMA.OdeW3C14.text	
ltx/en_us_goadedes/oc.m2.d7:ocMA.OdeW3C1H.greekmelody	@ltx/en_us_goadedes/he.h.m2:heHE.SteirothentaMouTonNoun.greekname
ltx/en_us_goadedes/oc.m2.d7:ocMA.OdeW3C1H.incipit	@ltx/en_us_goadedes/he.h.m2:heHE.SteirothentaMouTonNoun.incipit
ltx/en_us_goadedes/oc.m2.d7:ocMA.OdeW3C1H.melody	@ltx/en_us_goadedes/he.h.m2:heHE.SteirothentaMouTonNoun.melody
ltx/en_us_goadedes/oc.m2.d7:ocMA.OdeW3C1H.mode	@ltx/en_us_goadedes/miscellanea:misc.Mode2
ltx/en_us_goadedes/oc.m2.d7:ocMA.OdeW3C1H.ode	@ltx/en_us_goadedes/miscellanea:misc.Ode3
ltx/en_us_goadedes/oc.m2.d7:ocMA.OdeW3C1H.text	@ltx/en_us_goadedes/he.h.m2:heHE.SteirothentaMouTonNoun.text
ltx/en_us_goadedes/oc.m2.d7:ocMA.OdeW3C1T.incipit	…
ltx/en_us_goadedes/oc.m2.d7:ocMA.OdeW3C1T.melody	@ltx/en_us_goadedes/he.h.m2:heHE.SteirothentaMouTonNoun.name
ltx/en_us_goadedes/oc.m2.d7:ocMA.OdeW3C1T.mode	@ltx/en_us_goadedes/miscellanea:misc.Mode2
ltx/en_us_goadedes/oc.m2.d7:ocMA.OdeW3C1T.ode	@ltx/en_us_goadedes/miscellanea:misc.Ode3
ltx/en_us_goadedes/oc.m2.d7:ocMA.OdeW3C1T.text	
ltx/en_us_goadedes/oc.m2.d7:ocMA.OdeW3C21.greekmelody	@ltx/en_us_goadedes/he.h.m2:heHE.EnPetraMeTisPisteos.greekname
ltx/en_us_goadedes/oc.m2.d7:ocMA.OdeW3C21.incipit	…
ltx/en_us_goadedes/oc.m2.d7:ocMA.OdeW3C21.melody	@ltx/en_us_goadedes/he.h.m2:heHE.EnPetraMeTisPisteos.name
ltx/en_us_goadedes/oc.m2.d7:ocMA.OdeW3C21.mode	@ltx/en_us_goadedes/miscellanea:misc.Mode2
ltx/en_us_goadedes/oc.m2.d7:ocMA.OdeW3C21.ode	@ltx/en_us_goadedes/miscellanea:misc.Ode3
ltx/en_us_goadedes/oc.m2.d7:ocMA.OdeW3C21.text	
ltx/en_us_goadedes/oc.m2.d7:ocMA.OdeW3C22.incipit	…
ltx/en_us_goadedes/oc.m2.d7:ocMA.OdeW3C22.melody	@ltx/en_us_goadedes/he.h.m2:heHE.EnPetraMeTisPisteos.name
ltx/en_us_goadedes/oc.m2.d7:ocMA.OdeW3C22.mode	@ltx/en_us_goadedes/miscellanea:misc.Mode2
ltx/en_us_goadedes/oc.m2.d7:ocMA.OdeW3C22.ode	@ltx/en_us_goadedes/miscellanea:misc.Ode3
ltx/en_us_goadedes/oc.m2.d7:ocMA.OdeW3C22.text	
ltx/en_us_goadedes/oc.m2.d7:ocMA.OdeW3C23.incipit	…
ltx/en_us_goadedes/oc.m2.d7:ocMA.OdeW3C23.melody	@ltx/en_us_goadedes/he.h.m2:heHE.EnPetraMeTisPisteos.name
ltx/en_us_goadedes/oc.m2.d7:ocMA.OdeW3C23.mode	@ltx/en_us_goadedes/miscellanea:misc.Mode2
ltx/en_us_goadedes/oc.m2.d7:ocMA.OdeW3C23.ode	@ltx/en_us_goadedes/miscellanea:misc.Ode3
ltx/en_us_goadedes/oc.m2.d7:ocMA.OdeW3C23.text	
ltx/en_us_goadedes/oc.m2.d7:ocMA.OdeW3C2T.incipit	…
ltx/en_us_goadedes/oc.m2.d7:ocMA.OdeW3C2T.melody	@ltx/en_us_goadedes/he.h.m2:heHE.EnPetraMeTisPisteos.name
ltx/en_us_goadedes/oc.m2.d7:ocMA.OdeW3C2T.mode	@ltx/en_us_goadedes/miscellanea:misc.Mode2
ltx/en_us_goadedes/oc.m2.d7:ocMA.OdeW3C2T.ode	@ltx/en_us_goadedes/miscellanea:misc.Ode3
ltx/en_us_goadedes/oc.m2.d7:ocMA.OdeW3C2T.text	
ltx/en_us_goadedes/oc.m2.d7:ocMA.OdeW4C11.incipit	…
ltx/en_us_goadedes/oc.m2.d7:ocMA.OdeW4C11.melody	@ltx/en_us_goadedes/he.h.m2:heHE.TinEkParthenou.name
ltx/en_us_goadedes/oc.m2.d7:ocMA.OdeW4C11.mode	@ltx/en_us_goadedes/miscellanea:misc.Mode2
ltx/en_us_goadedes/oc.m2.d7:ocMA.OdeW4C11.ode	@ltx/en_us_goadedes/miscellanea:misc.Ode4
ltx/en_us_goadedes/oc.m2.d7:ocMA.OdeW4C11.text	
ltx/en_us_goadedes/oc.m2.d7:ocMA.OdeW4C12.incipit	…
ltx/en_us_goadedes/oc.m2.d7:ocMA.OdeW4C12.melody	@ltx/en_us_goadedes/he.h.m2:heHE.TinEkParthenou.name
ltx/en_us_goadedes/oc.m2.d7:ocMA.OdeW4C12.mode	@ltx/en_us_goadedes/miscellanea:misc.Mode2
ltx/en_us_goadedes/oc.m2.d7:ocMA.OdeW4C12.ode	@ltx/en_us_goadedes/miscellanea:misc.Ode4
ltx/en_us_goadedes/oc.m2.d7:ocMA.OdeW4C12.text	
ltx/en_us_goadedes/oc.m2.d7:ocMA.OdeW4C13.incipit	…
ltx/en_us_goadedes/oc.m2.d7:ocMA.OdeW4C13.melody	@ltx/en_us_goadedes/he.h.m2:heHE.TinEkParthenou.name
ltx/en_us_goadedes/oc.m2.d7:ocMA.OdeW4C13.mode	@ltx/en_us_goadedes/miscellanea:misc.Mode2
ltx/en_us_goadedes/oc.m2.d7:ocMA.OdeW4C13.ode	@ltx/en_us_goadedes/miscellanea:misc.Ode4
ltx/en_us_goadedes/oc.m2.d7:ocMA.OdeW4C13.text	
ltx/en_us_goadedes/oc.m2.d7:ocMA.OdeW4C14.incipit	…
ltx/en_us_goadedes/oc.m2.d7:ocMA.OdeW4C14.melody	@ltx/en_us_goadedes/he.h.m2:heHE.TinEkParthenou.name
ltx/en_us_goadedes/oc.m2.d7:ocMA.OdeW4C14.mode	@ltx/en_us_goadedes/miscellanea:misc.Mode2
ltx/en_us_goadedes/oc.m2.d7:ocMA.OdeW4C14.ode	@ltx/en_us_goadedes/miscellanea:misc.Ode4
ltx/en_us_goadedes/oc.m2.d7:ocMA.OdeW4C14.text	
ltx/en_us_goadedes/oc.m2.d7:ocMA.OdeW4C15.incipit	…
ltx/en_us_goadedes/oc.m2.d7:ocMA.OdeW4C15.melody	@ltx/en_us_goadedes/he.h.m2:heHE.TinEkParthenou.name
ltx/en_us_goadedes/oc.m2.d7:ocMA.OdeW4C15.mode	@ltx/en_us_goadedes/miscellanea:misc.Mode2
ltx/en_us_goadedes/oc.m2.d7:ocMA.OdeW4C15.ode	@ltx/en_us_goadedes/miscellanea:misc.Ode4
ltx/en_us_goadedes/oc.m2.d7:ocMA.OdeW4C15.text	
ltx/en_us_goadedes/oc.m2.d7:ocMA.OdeW4C1H.greekmelody	@ltx/en_us_goadedes/he.h.m2:heHE.TinEkParthenou.greekname
ltx/en_us_goadedes/oc.m2.d7:ocMA.OdeW4C1H.incipit	@ltx/en_us_goadedes/he.h.m2:heHE.TinEkParthenou.incipit
ltx/en_us_goadedes/oc.m2.d7:ocMA.OdeW4C1H.melody	@ltx/en_us_goadedes/he.h.m2:heHE.TinEkParthenou.melody
ltx/en_us_goadedes/oc.m2.d7:ocMA.OdeW4C1H.mode	@ltx/en_us_goadedes/miscellanea:misc.Mode2
ltx/en_us_goadedes/oc.m2.d7:ocMA.OdeW4C1H.ode	@ltx/en_us_goadedes/miscellanea:misc.Ode4
ltx/en_us_goadedes/oc.m2.d7:ocMA.OdeW4C1H.text	@ltx/en_us_goadedes/he.h.m2:heHE.TinEkParthenou.text
ltx/en_us_goadedes/oc.m2.d7:ocMA.OdeW4C1T.incipit	…
ltx/en_us_goadedes/oc.m2.d7:ocMA.OdeW4C1T.melody	@ltx/en_us_goadedes/he.h.m2:heHE.TinEkParthenou.name
ltx/en_us_goadedes/oc.m2.d7:ocMA.OdeW4C1T.mode	@ltx/en_us_goadedes/miscellanea:misc.Mode2
ltx/en_us_goadedes/oc.m2.d7:ocMA.OdeW4C1T.ode	@ltx/en_us_goadedes/miscellanea:misc.Ode4
ltx/en_us_goadedes/oc.m2.d7:ocMA.OdeW4C1T.text	
ltx/en_us_goadedes/oc.m2.d7:ocMA.OdeW4C21.greekmelody	@ltx/en_us_goadedes/he.h.m2:heHE.YmnoSeAkoi.greekname
ltx/en_us_goadedes/oc.m2.d7:ocMA.OdeW4C21.incipit	…
ltx/en_us_goadedes/oc.m2.d7:ocMA.OdeW4C21.melody	@ltx/en_us_goadedes/he.h.m2:heHE.YmnoSeAkoi.name
ltx/en_us_goadedes/oc.m2.d7:ocMA.OdeW4C21.mode	@ltx/en_us_goadedes/miscellanea:misc.Mode2
ltx/en_us_goadedes/oc.m2.d7:ocMA.OdeW4C21.ode	@ltx/en_us_goadedes/miscellanea:misc.Ode4
ltx/en_us_goadedes/oc.m2.d7:ocMA.OdeW4C21.text	
ltx/en_us_goadedes/oc.m2.d7:ocMA.OdeW4C22.incipit	…
ltx/en_us_goadedes/oc.m2.d7:ocMA.OdeW4C22.melody	@ltx/en_us_goadedes/he.h.m2:heHE.YmnoSeAkoi.name
ltx/en_us_goadedes/oc.m2.d7:ocMA.OdeW4C22.mode	@ltx/en_us_goadedes/miscellanea:misc.Mode2
ltx/en_us_goadedes/oc.m2.d7:ocMA.OdeW4C22.ode	@ltx/en_us_goadedes/miscellanea:misc.Ode4
ltx/en_us_goadedes/oc.m2.d7:ocMA.OdeW4C22.text	
ltx/en_us_goadedes/oc.m2.d7:ocMA.OdeW4C23.incipit	…
ltx/en_us_goadedes/oc.m2.d7:ocMA.OdeW4C23.melody	@ltx/en_us_goadedes/he.h.m2:heHE.YmnoSeAkoi.name
ltx/en_us_goadedes/oc.m2.d7:ocMA.OdeW4C23.mode	@ltx/en_us_goadedes/miscellanea:misc.Mode2
ltx/en_us_goadedes/oc.m2.d7:ocMA.OdeW4C23.ode	@ltx/en_us_goadedes/miscellanea:misc.Ode4
ltx/en_us_goadedes/oc.m2.d7:ocMA.OdeW4C23.text	
ltx/en_us_goadedes/oc.m2.d7:ocMA.OdeW4C2T.incipit	…
ltx/en_us_goadedes/oc.m2.d7:ocMA.OdeW4C2T.melody	@ltx/en_us_goadedes/he.h.m2:heHE.YmnoSeAkoi.name
ltx/en_us_goadedes/oc.m2.d7:ocMA.OdeW4C2T.mode	@ltx/en_us_goadedes/miscellanea:misc.Mode2
ltx/en_us_goadedes/oc.m2.d7:ocMA.OdeW4C2T.ode	@ltx/en_us_goadedes/miscellanea:misc.Ode4
ltx/en_us_goadedes/oc.m2.d7:ocMA.OdeW4C2T.text	
ltx/en_us_goadedes/oc.m2.d7:ocMA.OdeW5C11.incipit	…
ltx/en_us_goadedes/oc.m2.d7:ocMA.OdeW5C11.melody	@ltx/en_us_goadedes/he.h.m2:heHE.TinAchlynTisPsychisMou.name
ltx/en_us_goadedes/oc.m2.d7:ocMA.OdeW5C11.mode	@ltx/en_us_goadedes/miscellanea:misc.Mode2
ltx/en_us_goadedes/oc.m2.d7:ocMA.OdeW5C11.ode	@ltx/en_us_goadedes/miscellanea:misc.Ode5
ltx/en_us_goadedes/oc.m2.d7:ocMA.OdeW5C11.text	
ltx/en_us_goadedes/oc.m2.d7:ocMA.OdeW5C12.incipit	…
ltx/en_us_goadedes/oc.m2.d7:ocMA.OdeW5C12.melody	@ltx/en_us_goadedes/he.h.m2:heHE.TinAchlynTisPsychisMou.name
ltx/en_us_goadedes/oc.m2.d7:ocMA.OdeW5C12.mode	@ltx/en_us_goadedes/miscellanea:misc.Mode2
ltx/en_us_goadedes/oc.m2.d7:ocMA.OdeW5C12.ode	@ltx/en_us_goadedes/miscellanea:misc.Ode5
ltx/en_us_goadedes/oc.m2.d7:ocMA.OdeW5C12.text	
ltx/en_us_goadedes/oc.m2.d7:ocMA.OdeW5C13.incipit	…
ltx/en_us_goadedes/oc.m2.d7:ocMA.OdeW5C13.melody	@ltx/en_us_goadedes/he.h.m2:heHE.TinAchlynTisPsychisMou.name
ltx/en_us_goadedes/oc.m2.d7:ocMA.OdeW5C13.mode	@ltx/en_us_goadedes/miscellanea:misc.Mode2
ltx/en_us_goadedes/oc.m2.d7:ocMA.OdeW5C13.ode	@ltx/en_us_goadedes/miscellanea:misc.Ode5
ltx/en_us_goadedes/oc.m2.d7:ocMA.OdeW5C13.text	
ltx/en_us_goadedes/oc.m2.d7:ocMA.OdeW5C14.incipit	…
ltx/en_us_goadedes/oc.m2.d7:ocMA.OdeW5C14.melody	@ltx/en_us_goadedes/he.h.m2:heHE.TinAchlynTisPsychisMou.name
ltx/en_us_goadedes/oc.m2.d7:ocMA.OdeW5C14.mode	@ltx/en_us_goadedes/miscellanea:misc.Mode2
ltx/en_us_goadedes/oc.m2.d7:ocMA.OdeW5C14.ode	@ltx/en_us_goadedes/miscellanea:misc.Ode5
ltx/en_us_goadedes/oc.m2.d7:ocMA.OdeW5C14.text	
ltx/en_us_goadedes/oc.m2.d7:ocMA.OdeW5C1H.greekmelody	@ltx/en_us_goadedes/he.h.m2:heHE.TinAchlynTisPsychisMou.greekname
ltx/en_us_goadedes/oc.m2.d7:ocMA.OdeW5C1H.incipit	@ltx/en_us_goadedes/he.h.m2:heHE.TinAchlynTisPsychisMou.incipit
ltx/en_us_goadedes/oc.m2.d7:ocMA.OdeW5C1H.melody	@ltx/en_us_goadedes/he.h.m2:heHE.TinAchlynTisPsychisMou.melody
ltx/en_us_goadedes/oc.m2.d7:ocMA.OdeW5C1H.mode	@ltx/en_us_goadedes/miscellanea:misc.Mode2
ltx/en_us_goadedes/oc.m2.d7:ocMA.OdeW5C1H.ode	@ltx/en_us_goadedes/miscellanea:misc.Ode5
ltx/en_us_goadedes/oc.m2.d7:ocMA.OdeW5C1H.text	@ltx/en_us_goadedes/he.h.m2:heHE.TinAchlynTisPsychisMou.text
ltx/en_us_goadedes/oc.m2.d7:ocMA.OdeW5C1T.incipit	…
ltx/en_us_goadedes/oc.m2.d7:ocMA.OdeW5C1T.melody	@ltx/en_us_goadedes/he.h.m2:heHE.TinAchlynTisPsychisMou.name
ltx/en_us_goadedes/oc.m2.d7:ocMA.OdeW5C1T.mode	@ltx/en_us_goadedes/miscellanea:misc.Mode2
ltx/en_us_goadedes/oc.m2.d7:ocMA.OdeW5C1T.ode	@ltx/en_us_goadedes/miscellanea:misc.Ode5
ltx/en_us_goadedes/oc.m2.d7:ocMA.OdeW5C1T.text	
ltx/en_us_goadedes/oc.m2.d7:ocMA.OdeW5C21.greekmelody	@ltx/en_us_goadedes/he.h.m2:heHE.OTouFotosChorigos.greekname
ltx/en_us_goadedes/oc.m2.d7:ocMA.OdeW5C21.incipit	…
ltx/en_us_goadedes/oc.m2.d7:ocMA.OdeW5C21.melody	@ltx/en_us_goadedes/he.h.m2:heHE.OTouFotosChorigos.name
ltx/en_us_goadedes/oc.m2.d7:ocMA.OdeW5C21.mode	@ltx/en_us_goadedes/miscellanea:misc.Mode2
ltx/en_us_goadedes/oc.m2.d7:ocMA.OdeW5C21.ode	@ltx/en_us_goadedes/miscellanea:misc.Ode5
ltx/en_us_goadedes/oc.m2.d7:ocMA.OdeW5C21.text	
ltx/en_us_goadedes/oc.m2.d7:ocMA.OdeW5C22.incipit	…
ltx/en_us_goadedes/oc.m2.d7:ocMA.OdeW5C22.melody	@ltx/en_us_goadedes/he.h.m2:heHE.OTouFotosChorigos.name
ltx/en_us_goadedes/oc.m2.d7:ocMA.OdeW5C22.mode	@ltx/en_us_goadedes/miscellanea:misc.Mode2
ltx/en_us_goadedes/oc.m2.d7:ocMA.OdeW5C22.ode	@ltx/en_us_goadedes/miscellanea:misc.Ode5
ltx/en_us_goadedes/oc.m2.d7:ocMA.OdeW5C22.text	
ltx/en_us_goadedes/oc.m2.d7:ocMA.OdeW5C23.incipit	…
ltx/en_us_goadedes/oc.m2.d7:ocMA.OdeW5C23.melody	@ltx/en_us_goadedes/he.h.m2:heHE.OTouFotosChorigos.name
ltx/en_us_goadedes/oc.m2.d7:ocMA.OdeW5C23.mode	@ltx/en_us_goadedes/miscellanea:misc.Mode2
ltx/en_us_goadedes/oc.m2.d7:ocMA.OdeW5C23.ode	@ltx/en_us_goadedes/miscellanea:misc.Ode5
ltx/en_us_goadedes/oc.m2.d7:ocMA.OdeW5C23.text	
ltx/en_us_goadedes/oc.m2.d7:ocMA.OdeW5C2T.incipit	…
ltx/en_us_goadedes/oc.m2.d7:ocMA.OdeW5C2T.melody	@ltx/en_us_goadedes/he.h.m2:heHE.OTouFotosChorigos.name
ltx/en_us_goadedes/oc.m2.d7:ocMA.OdeW5C2T.mode	@ltx/en_us_goadedes/miscellanea:misc.Mode2
ltx/en_us_goadedes/oc.m2.d7:ocMA.OdeW5C2T.ode	@ltx/en_us_goadedes/miscellanea:misc.Ode5
ltx/en_us_goadedes/oc.m2.d7:ocMA.OdeW5C2T.text	
ltx/en_us_goadedes/oc.m2.d7:ocMA.OdeW6C11.incipit	…
ltx/en_us_goadedes/oc.m2.d7:ocMA.OdeW6C11.melody	@ltx/en_us_goadedes/he.h.m2:heHE.VythoAmartimaton.name
ltx/en_us_goadedes/oc.m2.d7:ocMA.OdeW6C11.mode	@ltx/en_us_goadedes/miscellanea:misc.Mode2
ltx/en_us_goadedes/oc.m2.d7:ocMA.OdeW6C11.ode	@ltx/en_us_goadedes/miscellanea:misc.Ode6
ltx/en_us_goadedes/oc.m2.d7:ocMA.OdeW6C11.text	
ltx/en_us_goadedes/oc.m2.d7:ocMA.OdeW6C12.incipit	…
ltx/en_us_goadedes/oc.m2.d7:ocMA.OdeW6C12.melody	@ltx/en_us_goadedes/he.h.m2:heHE.VythoAmartimaton.name
ltx/en_us_goadedes/oc.m2.d7:ocMA.OdeW6C12.mode	@ltx/en_us_goadedes/miscellanea:misc.Mode2
ltx/en_us_goadedes/oc.m2.d7:ocMA.OdeW6C12.ode	@ltx/en_us_goadedes/miscellanea:misc.Ode6
ltx/en_us_goadedes/oc.m2.d7:ocMA.OdeW6C12.text	
ltx/en_us_goadedes/oc.m2.d7:ocMA.OdeW6C13.incipit	…
ltx/en_us_goadedes/oc.m2.d7:ocMA.OdeW6C13.melody	@ltx/en_us_goadedes/he.h.m2:heHE.VythoAmartimaton.name
ltx/en_us_goadedes/oc.m2.d7:ocMA.OdeW6C13.mode	@ltx/en_us_goadedes/miscellanea:misc.Mode2
ltx/en_us_goadedes/oc.m2.d7:ocMA.OdeW6C13.ode	@ltx/en_us_goadedes/miscellanea:misc.Ode6
ltx/en_us_goadedes/oc.m2.d7:ocMA.OdeW6C13.text	
ltx/en_us_goadedes/oc.m2.d7:ocMA.OdeW6C14.incipit	…
ltx/en_us_goadedes/oc.m2.d7:ocMA.OdeW6C14.melody	@ltx/en_us_goadedes/he.h.m2:heHE.VythoAmartimaton.name
ltx/en_us_goadedes/oc.m2.d7:ocMA.OdeW6C14.mode	@ltx/en_us_goadedes/miscellanea:misc.Mode2
ltx/en_us_goadedes/oc.m2.d7:ocMA.OdeW6C14.ode	@ltx/en_us_goadedes/miscellanea:misc.Ode6
ltx/en_us_goadedes/oc.m2.d7:ocMA.OdeW6C14.text	
ltx/en_us_goadedes/oc.m2.d7:ocMA.OdeW6C1H.greekmelody	@ltx/en_us_goadedes/he.h.m2:heHE.VythoAmartimaton.greekname
ltx/en_us_goadedes/oc.m2.d7:ocMA.OdeW6C1H.incipit	@ltx/en_us_goadedes/he.h.m2:heHE.VythoAmartimaton.incipit
ltx/en_us_goadedes/oc.m2.d7:ocMA.OdeW6C1H.melody	@ltx/en_us_goadedes/he.h.m2:heHE.VythoAmartimaton.melody
ltx/en_us_goadedes/oc.m2.d7:ocMA.OdeW6C1H.mode	@ltx/en_us_goadedes/miscellanea:misc.Mode2
ltx/en_us_goadedes/oc.m2.d7:ocMA.OdeW6C1H.ode	@ltx/en_us_goadedes/miscellanea:misc.Ode6
ltx/en_us_goadedes/oc.m2.d7:ocMA.OdeW6C1H.text	@ltx/en_us_goadedes/he.h.m2:heHE.VythoAmartimaton.text
ltx/en_us_goadedes/oc.m2.d7:ocMA.OdeW6C1T.incipit	…
ltx/en_us_goadedes/oc.m2.d7:ocMA.OdeW6C1T.melody	@ltx/en_us_goadedes/he.h.m2:heHE.VythoAmartimaton.name
ltx/en_us_goadedes/oc.m2.d7:ocMA.OdeW6C1T.mode	@ltx/en_us_goadedes/miscellanea:misc.Mode2
ltx/en_us_goadedes/oc.m2.d7:ocMA.OdeW6C1T.ode	@ltx/en_us_goadedes/miscellanea:misc.Ode6
ltx/en_us_goadedes/oc.m2.d7:ocMA.OdeW6C1T.text	
ltx/en_us_goadedes/oc.m2.d7:ocMA.OdeW6C21.greekmelody	@ltx/en_us_goadedes/he.h.m2:heHE.EnAvyssoPtaismaton.greekname
ltx/en_us_goadedes/oc.m2.d7:ocMA.OdeW6C21.incipit	…
ltx/en_us_goadedes/oc.m2.d7:ocMA.OdeW6C21.melody	@ltx/en_us_goadedes/he.h.m2:heHE.EnAvyssoPtaismaton.name
ltx/en_us_goadedes/oc.m2.d7:ocMA.OdeW6C21.mode	@ltx/en_us_goadedes/miscellanea:misc.Mode2
ltx/en_us_goadedes/oc.m2.d7:ocMA.OdeW6C21.ode	@ltx/en_us_goadedes/miscellanea:misc.Ode6
ltx/en_us_goadedes/oc.m2.d7:ocMA.OdeW6C21.text	
ltx/en_us_goadedes/oc.m2.d7:ocMA.OdeW6C22.incipit	…
ltx/en_us_goadedes/oc.m2.d7:ocMA.OdeW6C22.melody	@ltx/en_us_goadedes/he.h.m2:heHE.EnAvyssoPtaismaton.name
ltx/en_us_goadedes/oc.m2.d7:ocMA.OdeW6C22.mode	@ltx/en_us_goadedes/miscellanea:misc.Mode2
ltx/en_us_goadedes/oc.m2.d7:ocMA.OdeW6C22.ode	@ltx/en_us_goadedes/miscellanea:misc.Ode6
ltx/en_us_goadedes/oc.m2.d7:ocMA.OdeW6C22.text	
ltx/en_us_goadedes/oc.m2.d7:ocMA.OdeW6C2T.incipit	…
ltx/en_us_goadedes/oc.m2.d7:ocMA.OdeW6C2T.melody	@ltx/en_us_goadedes/he.h.m2:heHE.EnAvyssoPtaismaton.name
ltx/en_us_goadedes/oc.m2.d7:ocMA.OdeW6C2T.mode	@ltx/en_us_goadedes/miscellanea:misc.Mode2
ltx/en_us_goadedes/oc.m2.d7:ocMA.OdeW6C2T.ode	@ltx/en_us_goadedes/miscellanea:misc.Ode6
ltx/en_us_goadedes/oc.m2.d7:ocMA.OdeW6C2T.text	
ltx/en_us_goadedes/oc.m2.d7:ocMA.OdeW7C11.incipit	…
ltx/en_us_goadedes/oc.m2.d7:ocMA.OdeW7C11.melody	@ltx/en_us_goadedes/he.h.m2:heHE.TaCherouvimMimoumenoi.name
ltx/en_us_goadedes/oc.m2.d7:ocMA.OdeW7C11.mode	@ltx/en_us_goadedes/miscellanea:misc.Mode2
ltx/en_us_goadedes/oc.m2.d7:ocMA.OdeW7C11.ode	@ltx/en_us_goadedes/miscellanea:misc.Ode7
ltx/en_us_goadedes/oc.m2.d7:ocMA.OdeW7C11.text	
ltx/en_us_goadedes/oc.m2.d7:ocMA.OdeW7C12.incipit	…
ltx/en_us_goadedes/oc.m2.d7:ocMA.OdeW7C12.melody	@ltx/en_us_goadedes/he.h.m2:heHE.TaCherouvimMimoumenoi.name
ltx/en_us_goadedes/oc.m2.d7:ocMA.OdeW7C12.mode	@ltx/en_us_goadedes/miscellanea:misc.Mode2
ltx/en_us_goadedes/oc.m2.d7:ocMA.OdeW7C12.ode	@ltx/en_us_goadedes/miscellanea:misc.Ode7
ltx/en_us_goadedes/oc.m2.d7:ocMA.OdeW7C12.text	
ltx/en_us_goadedes/oc.m2.d7:ocMA.OdeW7C13.incipit	…
ltx/en_us_goadedes/oc.m2.d7:ocMA.OdeW7C13.melody	@ltx/en_us_goadedes/he.h.m2:heHE.TaCherouvimMimoumenoi.name
ltx/en_us_goadedes/oc.m2.d7:ocMA.OdeW7C13.mode	@ltx/en_us_goadedes/miscellanea:misc.Mode2
ltx/en_us_goadedes/oc.m2.d7:ocMA.OdeW7C13.ode	@ltx/en_us_goadedes/miscellanea:misc.Ode7
ltx/en_us_goadedes/oc.m2.d7:ocMA.OdeW7C13.text	
ltx/en_us_goadedes/oc.m2.d7:ocMA.OdeW7C1H.greekmelody	@ltx/en_us_goadedes/he.h.m2:heHE.TaCherouvimMimoumenoi.greekname
ltx/en_us_goadedes/oc.m2.d7:ocMA.OdeW7C1H.incipit	@ltx/en_us_goadedes/he.h.m2:heHE.TaCherouvimMimoumenoi.incipit
ltx/en_us_goadedes/oc.m2.d7:ocMA.OdeW7C1H.melody	@ltx/en_us_goadedes/he.h.m2:heHE.TaCherouvimMimoumenoi.melody
ltx/en_us_goadedes/oc.m2.d7:ocMA.OdeW7C1H.mode	@ltx/en_us_goadedes/miscellanea:misc.Mode2
ltx/en_us_goadedes/oc.m2.d7:ocMA.OdeW7C1H.ode	@ltx/en_us_goadedes/miscellanea:misc.Ode7
ltx/en_us_goadedes/oc.m2.d7:ocMA.OdeW7C1H.text	@ltx/en_us_goadedes/he.h.m2:heHE.TaCherouvimMimoumenoi.text
ltx/en_us_goadedes/oc.m2.d7:ocMA.OdeW7C1T.incipit	…
ltx/en_us_goadedes/oc.m2.d7:ocMA.OdeW7C1T.melody	@ltx/en_us_goadedes/he.h.m2:heHE.TaCherouvimMimoumenoi.name
ltx/en_us_goadedes/oc.m2.d7:ocMA.OdeW7C1T.mode	@ltx/en_us_goadedes/miscellanea:misc.Mode2
ltx/en_us_goadedes/oc.m2.d7:ocMA.OdeW7C1T.ode	@ltx/en_us_goadedes/miscellanea:misc.Ode7
ltx/en_us_goadedes/oc.m2.d7:ocMA.OdeW7C1T.text	
ltx/en_us_goadedes/oc.m2.d7:ocMA.OdeW7C21.greekmelody	@ltx/en_us_goadedes/he.h.m2:heHE.AntitheonProstagma.greekname
ltx/en_us_goadedes/oc.m2.d7:ocMA.OdeW7C21.incipit	…
ltx/en_us_goadedes/oc.m2.d7:ocMA.OdeW7C21.melody	@ltx/en_us_goadedes/he.h.m2:heHE.AntitheonProstagma.name
ltx/en_us_goadedes/oc.m2.d7:ocMA.OdeW7C21.mode	@ltx/en_us_goadedes/miscellanea:misc.Mode2
ltx/en_us_goadedes/oc.m2.d7:ocMA.OdeW7C21.ode	@ltx/en_us_goadedes/miscellanea:misc.Ode7
ltx/en_us_goadedes/oc.m2.d7:ocMA.OdeW7C21.text	
ltx/en_us_goadedes/oc.m2.d7:ocMA.OdeW7C22.incipit	…
ltx/en_us_goadedes/oc.m2.d7:ocMA.OdeW7C22.melody	@ltx/en_us_goadedes/he.h.m2:heHE.AntitheonProstagma.name
ltx/en_us_goadedes/oc.m2.d7:ocMA.OdeW7C22.mode	@ltx/en_us_goadedes/miscellanea:misc.Mode2
ltx/en_us_goadedes/oc.m2.d7:ocMA.OdeW7C22.ode	@ltx/en_us_goadedes/miscellanea:misc.Ode7
ltx/en_us_goadedes/oc.m2.d7:ocMA.OdeW7C22.text	
ltx/en_us_goadedes/oc.m2.d7:ocMA.OdeW7C23.incipit	…
ltx/en_us_goadedes/oc.m2.d7:ocMA.OdeW7C23.melody	@ltx/en_us_goadedes/he.h.m2:heHE.AntitheonProstagma.name
ltx/en_us_goadedes/oc.m2.d7:ocMA.OdeW7C23.mode	@ltx/en_us_goadedes/miscellanea:misc.Mode2
ltx/en_us_goadedes/oc.m2.d7:ocMA.OdeW7C23.ode	@ltx/en_us_goadedes/miscellanea:misc.Ode7
ltx/en_us_goadedes/oc.m2.d7:ocMA.OdeW7C23.text	
ltx/en_us_goadedes/oc.m2.d7:ocMA.OdeW7C2T.incipit	…
ltx/en_us_goadedes/oc.m2.d7:ocMA.OdeW7C2T.melody	@ltx/en_us_goadedes/he.h.m2:heHE.AntitheonProstagma.name
ltx/en_us_goadedes/oc.m2.d7:ocMA.OdeW7C2T.mode	@ltx/en_us_goadedes/miscellanea:misc.Mode2
ltx/en_us_goadedes/oc.m2.d7:ocMA.OdeW7C2T.ode	@ltx/en_us_goadedes/miscellanea:misc.Ode7
ltx/en_us_goadedes/oc.m2.d7:ocMA.OdeW7C2T.text	
ltx/en_us_goadedes/oc.m2.d7:ocMA.OdeW8C11.incipit	…
ltx/en_us_goadedes/oc.m2.d7:ocMA.OdeW8C11.melody	@ltx/en_us_goadedes/he.h.m2:heHE.TonEnTiVatoMosi.name
ltx/en_us_goadedes/oc.m2.d7:ocMA.OdeW8C11.mode	@ltx/en_us_goadedes/miscellanea:misc.Mode2
ltx/en_us_goadedes/oc.m2.d7:ocMA.OdeW8C11.ode	@ltx/en_us_goadedes/miscellanea:misc.Ode8
ltx/en_us_goadedes/oc.m2.d7:ocMA.OdeW8C11.text	
ltx/en_us_goadedes/oc.m2.d7:ocMA.OdeW8C12.incipit	…
ltx/en_us_goadedes/oc.m2.d7:ocMA.OdeW8C12.melody	@ltx/en_us_goadedes/he.h.m2:heHE.TonEnTiVatoMosi.name
ltx/en_us_goadedes/oc.m2.d7:ocMA.OdeW8C12.mode	@ltx/en_us_goadedes/miscellanea:misc.Mode2
ltx/en_us_goadedes/oc.m2.d7:ocMA.OdeW8C12.ode	@ltx/en_us_goadedes/miscellanea:misc.Ode8
ltx/en_us_goadedes/oc.m2.d7:ocMA.OdeW8C12.text	
ltx/en_us_goadedes/oc.m2.d7:ocMA.OdeW8C13.incipit	…
ltx/en_us_goadedes/oc.m2.d7:ocMA.OdeW8C13.melody	@ltx/en_us_goadedes/he.h.m2:heHE.TonEnTiVatoMosi.name
ltx/en_us_goadedes/oc.m2.d7:ocMA.OdeW8C13.mode	@ltx/en_us_goadedes/miscellanea:misc.Mode2
ltx/en_us_goadedes/oc.m2.d7:ocMA.OdeW8C13.ode	@ltx/en_us_goadedes/miscellanea:misc.Ode8
ltx/en_us_goadedes/oc.m2.d7:ocMA.OdeW8C13.text	
ltx/en_us_goadedes/oc.m2.d7:ocMA.OdeW8C1H.greekmelody	@ltx/en_us_goadedes/he.h.m2:heHE.TonEnTiVatoMosi.greekname
ltx/en_us_goadedes/oc.m2.d7:ocMA.OdeW8C1H.incipit	@ltx/en_us_goadedes/he.h.m2:heHE.TonEnTiVatoMosi.incipit
ltx/en_us_goadedes/oc.m2.d7:ocMA.OdeW8C1H.melody	@ltx/en_us_goadedes/he.h.m2:heHE.TonEnTiVatoMosi.melody
ltx/en_us_goadedes/oc.m2.d7:ocMA.OdeW8C1H.mode	@ltx/en_us_goadedes/miscellanea:misc.Mode2
ltx/en_us_goadedes/oc.m2.d7:ocMA.OdeW8C1H.ode	@ltx/en_us_goadedes/miscellanea:misc.Ode8
ltx/en_us_goadedes/oc.m2.d7:ocMA.OdeW8C1H.text	@ltx/en_us_goadedes/he.h.m2:heHE.TonEnTiVatoMosi.text
ltx/en_us_goadedes/oc.m2.d7:ocMA.OdeW8C1T.incipit	…
ltx/en_us_goadedes/oc.m2.d7:ocMA.OdeW8C1T.melody	@ltx/en_us_goadedes/he.h.m2:heHE.TonEnTiVatoMosi.name
ltx/en_us_goadedes/oc.m2.d7:ocMA.OdeW8C1T.mode	@ltx/en_us_goadedes/miscellanea:misc.Mode2
ltx/en_us_goadedes/oc.m2.d7:ocMA.OdeW8C1T.ode	@ltx/en_us_goadedes/miscellanea:misc.Ode8
ltx/en_us_goadedes/oc.m2.d7:ocMA.OdeW8C1T.text	
ltx/en_us_goadedes/oc.m2.d7:ocMA.OdeW8C21.greekmelody	@ltx/en_us_goadedes/he.h.m2:heHE.KaminosPote.greekname
ltx/en_us_goadedes/oc.m2.d7:ocMA.OdeW8C21.incipit	…
ltx/en_us_goadedes/oc.m2.d7:ocMA.OdeW8C21.melody	@ltx/en_us_goadedes/he.h.m2:heHE.KaminosPote.name
ltx/en_us_goadedes/oc.m2.d7:ocMA.OdeW8C21.mode	@ltx/en_us_goadedes/miscellanea:misc.Mode2
ltx/en_us_goadedes/oc.m2.d7:ocMA.OdeW8C21.ode	@ltx/en_us_goadedes/miscellanea:misc.Ode8
ltx/en_us_goadedes/oc.m2.d7:ocMA.OdeW8C21.text	
ltx/en_us_goadedes/oc.m2.d7:ocMA.OdeW8C22.incipit	…
ltx/en_us_goadedes/oc.m2.d7:ocMA.OdeW8C22.melody	@ltx/en_us_goadedes/he.h.m2:heHE.KaminosPote.name
ltx/en_us_goadedes/oc.m2.d7:ocMA.OdeW8C22.mode	@ltx/en_us_goadedes/miscellanea:misc.Mode2
ltx/en_us_goadedes/oc.m2.d7:ocMA.OdeW8C22.ode	@ltx/en_us_goadedes/miscellanea:misc.Ode8
ltx/en_us_goadedes/oc.m2.d7:ocMA.OdeW8C22.text	
ltx/en_us_goadedes/oc.m2.d7:ocMA.OdeW8C23.incipit	…
ltx/en_us_goadedes/oc.m2.d7:ocMA.OdeW8C23.melody	@ltx/en_us_goadedes/he.h.m2:heHE.KaminosPote.name
ltx/en_us_goadedes/oc.m2.d7:ocMA.OdeW8C23.mode	@ltx/en_us_goadedes/miscellanea:misc.Mode2
ltx/en_us_goadedes/oc.m2.d7:ocMA.OdeW8C23.ode	@ltx/en_us_goadedes/miscellanea:misc.Ode8
ltx/en_us_goadedes/oc.m2.d7:ocMA.OdeW8C23.text	
ltx/en_us_goadedes/oc.m2.d7:ocMA.OdeW8C2T.incipit	…
ltx/en_us_goadedes/oc.m2.d7:ocMA.OdeW8C2T.melody	@ltx/en_us_goadedes/he.h.m2:heHE.KaminosPote.name
ltx/en_us_goadedes/oc.m2.d7:ocMA.OdeW8C2T.mode	@ltx/en_us_goadedes/miscellanea:misc.Mode2
ltx/en_us_goadedes/oc.m2.d7:ocMA.OdeW8C2T.ode	@ltx/en_us_goadedes/miscellanea:misc.Ode8
ltx/en_us_goadedes/oc.m2.d7:ocMA.OdeW8C2T.text	
ltx/en_us_goadedes/oc.m2.d7:ocMA.OdeW9C11.incipit	…
ltx/en_us_goadedes/oc.m2.d7:ocMA.OdeW9C11.melody	@ltx/en_us_goadedes/he.h.m2:heHE.TinYperfyosSarki.name
ltx/en_us_goadedes/oc.m2.d7:ocMA.OdeW9C11.mode	@ltx/en_us_goadedes/miscellanea:misc.Mode2
ltx/en_us_goadedes/oc.m2.d7:ocMA.OdeW9C11.ode	@ltx/en_us_goadedes/miscellanea:misc.Ode9
ltx/en_us_goadedes/oc.m2.d7:ocMA.OdeW9C11.text	
ltx/en_us_goadedes/oc.m2.d7:ocMA.OdeW9C12.incipit	…
ltx/en_us_goadedes/oc.m2.d7:ocMA.OdeW9C12.melody	@ltx/en_us_goadedes/he.h.m2:heHE.TinYperfyosSarki.name
ltx/en_us_goadedes/oc.m2.d7:ocMA.OdeW9C12.mode	@ltx/en_us_goadedes/miscellanea:misc.Mode2
ltx/en_us_goadedes/oc.m2.d7:ocMA.OdeW9C12.ode	@ltx/en_us_goadedes/miscellanea:misc.Ode9
ltx/en_us_goadedes/oc.m2.d7:ocMA.OdeW9C12.text	
ltx/en_us_goadedes/oc.m2.d7:ocMA.OdeW9C13.incipit	…
ltx/en_us_goadedes/oc.m2.d7:ocMA.OdeW9C13.melody	@ltx/en_us_goadedes/he.h.m2:heHE.TinYperfyosSarki.name
ltx/en_us_goadedes/oc.m2.d7:ocMA.OdeW9C13.mode	@ltx/en_us_goadedes/miscellanea:misc.Mode2
ltx/en_us_goadedes/oc.m2.d7:ocMA.OdeW9C13.ode	@ltx/en_us_goadedes/miscellanea:misc.Ode9
ltx/en_us_goadedes/oc.m2.d7:ocMA.OdeW9C13.text	
ltx/en_us_goadedes/oc.m2.d7:ocMA.OdeW9C14.incipit	…
ltx/en_us_goadedes/oc.m2.d7:ocMA.OdeW9C14.melody	@ltx/en_us_goadedes/he.h.m2:heHE.TinYperfyosSarki.name
ltx/en_us_goadedes/oc.m2.d7:ocMA.OdeW9C14.mode	@ltx/en_us_goadedes/miscellanea:misc.Mode2
ltx/en_us_goadedes/oc.m2.d7:ocMA.OdeW9C14.ode	@ltx/en_us_goadedes/miscellanea:misc.Ode9
ltx/en_us_goadedes/oc.m2.d7:ocMA.OdeW9C14.text	
ltx/en_us_goadedes/oc.m2.d7:ocMA.OdeW9C1H.greekmelody	@ltx/en_us_goadedes/he.h.m2:heHE.TinYperfyosSarki.greekname
ltx/en_us_goadedes/oc.m2.d7:ocMA.OdeW9C1H.incipit	@ltx/en_us_goadedes/he.h.m2:heHE.TinYperfyosSarki.incipit
ltx/en_us_goadedes/oc.m2.d7:ocMA.OdeW9C1H.melody	@ltx/en_us_goadedes/he.h.m2:heHE.TinYperfyosSarki.melody
ltx/en_us_goadedes/oc.m2.d7:ocMA.OdeW9C1H.mode	@ltx/en_us_goadedes/miscellanea:misc.Mode2
ltx/en_us_goadedes/oc.m2.d7:ocMA.OdeW9C1H.ode	@ltx/en_us_goadedes/miscellanea:misc.Ode9
ltx/en_us_goadedes/oc.m2.d7:ocMA.OdeW9C1H.text	@ltx/en_us_goadedes/he.h.m2:heHE.TinYperfyosSarki.text
ltx/en_us_goadedes/oc.m2.d7:ocMA.OdeW9C1T.incipit	…
ltx/en_us_goadedes/oc.m2.d7:ocMA.OdeW9C1T.melody	@ltx/en_us_goadedes/he.h.m2:heHE.TinYperfyosSarki.name
ltx/en_us_goadedes/oc.m2.d7:ocMA.OdeW9C1T.mode	@ltx/en_us_goadedes/miscellanea:misc.Mode2
ltx/en_us_goadedes/oc.m2.d7:ocMA.OdeW9C1T.ode	@ltx/en_us_goadedes/miscellanea:misc.Ode9
ltx/en_us_goadedes/oc.m2.d7:ocMA.OdeW9C1T.text	
ltx/en_us_goadedes/oc.m2.d7:ocMA.OdeW9C21.greekmelody	@ltx/en_us_goadedes/he.h.m2:heHE.ITonProIliouFostira.greekname
ltx/en_us_goadedes/oc.m2.d7:ocMA.OdeW9C21.incipit	…
ltx/en_us_goadedes/oc.m2.d7:ocMA.OdeW9C21.melody	@ltx/en_us_goadedes/he.h.m2:heHE.ITonProIliouFostira.name
ltx/en_us_goadedes/oc.m2.d7:ocMA.OdeW9C21.mode	@ltx/en_us_goadedes/miscellanea:misc.Mode2
ltx/en_us_goadedes/oc.m2.d7:ocMA.OdeW9C21.ode	@ltx/en_us_goadedes/miscellanea:misc.Ode9
ltx/en_us_goadedes/oc.m2.d7:ocMA.OdeW9C21.text	
ltx/en_us_goadedes/oc.m2.d7:ocMA.OdeW9C22.incipit	…
ltx/en_us_goadedes/oc.m2.d7:ocMA.OdeW9C22.melody	@ltx/en_us_goadedes/he.h.m2:heHE.ITonProIliouFostira.name
ltx/en_us_goadedes/oc.m2.d7:ocMA.OdeW9C22.mode	@ltx/en_us_goadedes/miscellanea:misc.Mode2
ltx/en_us_goadedes/oc.m2.d7:ocMA.OdeW9C22.ode	@ltx/en_us_goadedes/miscellanea:misc.Ode9
ltx/en_us_goadedes/oc.m2.d7:ocMA.OdeW9C22.text	
ltx/en_us_goadedes/oc.m2.d7:ocMA.OdeW9C23.incipit	…
ltx/en_us_goadedes/oc.m2.d7:ocMA.OdeW9C23.melody	@ltx/en_us_goadedes/he.h.m2:heHE.ITonProIliouFostira.name
ltx/en_us_goadedes/oc.m2.d7:ocMA.OdeW9C23.mode	@ltx/en_us_goadedes/miscellanea:misc.Mode2
ltx/en_us_goadedes/oc.m2.d7:ocMA.OdeW9C23.ode	@ltx/en_us_goadedes/miscellanea:misc.Ode9
ltx/en_us_goadedes/oc.m2.d7:ocMA.OdeW9C23.text	
ltx/en_us_goadedes/oc.m2.d7:ocMA.OdeW9C2T.incipit	…
ltx/en_us_goadedes/oc.m2.d7:ocMA.OdeW9C2T.melody	@ltx/en_us_goadedes/he.h.m2:heHE.ITonProIliouFostira.name
ltx/en_us_goadedes/oc.m2.d7:ocMA.OdeW9C2T.mode	@ltx/en_us_goadedes/miscellanea:misc.Mode2
ltx/en_us_goadedes/oc.m2.d7:ocMA.OdeW9C2T.ode	@ltx/en_us_goadedes/miscellanea:misc.Ode9
ltx/en_us_goadedes/oc.m2.d7:ocMA.OdeW9C2T.text	
ltx/en_us_goadedes/oc.m2.d7:ocVE.ApolTheotokionVM.incipit	@ltx/en_us_goadedes/oc.m2.d1:ocVE.ApolTheotokionVM.incipit
ltx/en_us_goadedes/oc.m2.d7:ocVE.ApolTheotokionVM.melody	
ltx/en_us_goadedes/oc.m2.d7:ocVE.ApolTheotokionVM.mode	@ltx/en_us_goadedes/miscellanea:misc.Mode2
ltx/en_us_goadedes/oc.m2.d7:ocVE.ApolTheotokionVM.text	@ltx/en_us_goadedes/oc.m2.d1:ocVE.ApolTheotokionVM.text
ltx/en_us_goadedes/oc.m2.d7:ocVE.AposTheotokion.incipit	…
ltx/en_us_goadedes/oc.m2.d7:ocVE.AposTheotokion.melody	
ltx/en_us_goadedes/oc.m2.d7:ocVE.AposTheotokion.mode	@ltx/en_us_goadedes/miscellanea:misc.Mode2
ltx/en_us_goadedes/oc.m2.d7:ocVE.AposTheotokion.text	
ltx/en_us_goadedes/oc.m2.d7:ocVE.Aposticha1.incipit	@ltx/en_us_goadedes/oc.m2.d3:ocVE.Aposticha3.incipit
ltx/en_us_goadedes/oc.m2.d7:ocVE.Aposticha1.melody	
ltx/en_us_goadedes/oc.m2.d7:ocVE.Aposticha1.mode	@ltx/en_us_goadedes/miscellanea:misc.Mode2
ltx/en_us_goadedes/oc.m2.d7:ocVE.Aposticha1.text	@ltx/en_us_goadedes/oc.m2.d3:ocVE.Aposticha3.text
ltx/en_us_goadedes/oc.m2.d7:ocVE.Aposticha2.incipit	@ltx/en_us_goadedes/oc.m2.d4:ocVE.Aposticha3.incipit
ltx/en_us_goadedes/oc.m2.d7:ocVE.Aposticha2.melody	
ltx/en_us_goadedes/oc.m2.d7:ocVE.Aposticha2.mode	@ltx/en_us_goadedes/miscellanea:misc.Mode2
ltx/en_us_goadedes/oc.m2.d7:ocVE.Aposticha2.text	@ltx/en_us_goadedes/oc.m2.d4:ocVE.Aposticha3.text
ltx/en_us_goadedes/oc.m2.d7:ocVE.Aposticha3.incipit	@ltx/en_us_goadedes/oc.m2.d5:ocVE.Aposticha3.incipit
ltx/en_us_goadedes/oc.m2.d7:ocVE.Aposticha3.melody	
ltx/en_us_goadedes/oc.m2.d7:ocVE.Aposticha3.mode	@ltx/en_us_goadedes/miscellanea:misc.Mode2
ltx/en_us_goadedes/oc.m2.d7:ocVE.Aposticha3.text	@ltx/en_us_goadedes/oc.m2.d5:ocVE.Aposticha3.text
ltx/en_us_goadedes/oc.m2.d7:ocVE.Aposticha4.incipit	…
ltx/en_us_goadedes/oc.m2.d7:ocVE.Aposticha4.melody	
ltx/en_us_goadedes/oc.m2.d7:ocVE.Aposticha4.mode	@ltx/en_us_goadedes/miscellanea:misc.Mode2
ltx/en_us_goadedes/oc.m2.d7:ocVE.Aposticha4.text	
ltx/en_us_goadedes/oc.m2.d7:ocVE.SticTheotokion.incipit	@ltx/en_us_goadedes/oc.m2.d1:ocVE.SticTheotokion.incipit
ltx/en_us_goadedes/oc.m2.d7:ocVE.SticTheotokion.melody	
ltx/en_us_goadedes/oc.m2.d7:ocVE.SticTheotokion.mode	@ltx/en_us_goadedes/miscellanea:misc.Mode2
ltx/en_us_goadedes/oc.m2.d7:ocVE.SticTheotokion.text	@ltx/en_us_goadedes/oc.m2.d1:ocVE.SticTheotokion.text
ltx/en_us_goadedes/oc.m2.d7:ocVE.Stichera1.greekmelody	@ltx/en_us_goadedes/he.a.m2:heAU.OteEkTouXylou.greekname
ltx/en_us_goadedes/oc.m2.d7:ocVE.Stichera1.incipit	…
ltx/en_us_goadedes/oc.m2.d7:ocVE.Stichera1.melody	@ltx/en_us_goadedes/he.a.m2:heAU.OteEkTouXylou.name
ltx/en_us_goadedes/oc.m2.d7:ocVE.Stichera1.mode	@ltx/en_us_goadedes/miscellanea:misc.Mode2
ltx/en_us_goadedes/oc.m2.d7:ocVE.Stichera1.text	
ltx/en_us_goadedes/oc.m2.d7:ocVE.Stichera2.incipit	…
ltx/en_us_goadedes/oc.m2.d7:ocVE.Stichera2.melody	@ltx/en_us_goadedes/he.a.m2:heAU.OteEkTouXylou.name
ltx/en_us_goadedes/oc.m2.d7:ocVE.Stichera2.mode	@ltx/en_us_goadedes/miscellanea:misc.Mode2
ltx/en_us_goadedes/oc.m2.d7:ocVE.Stichera2.text	
ltx/en_us_goadedes/oc.m2.d7:ocVE.Stichera3.incipit	…
ltx/en_us_goadedes/oc.m2.d7:ocVE.Stichera3.melody	@ltx/en_us_goadedes/he.a.m2:heAU.OteEkTouXylou.name
ltx/en_us_goadedes/oc.m2.d7:ocVE.Stichera3.mode	@ltx/en_us_goadedes/miscellanea:misc.Mode2
ltx/en_us_goadedes/oc.m2.d7:ocVE.Stichera3.text	
ltx/en_us_goadedes/oc.m2.d7:ocVE.Stichera4.greekmelody	@ltx/en_us_goadedes/he.a.m2:heAU.OteEkTouXylou.greekname
ltx/en_us_goadedes/oc.m2.d7:ocVE.Stichera4.incipit	Since my adolescence…
ltx/en_us_goadedes/oc.m2.d7:ocVE.Stichera4.melody	@ltx/en_us_goadedes/he.a.m2:heAU.OteEkTouXylou.name
ltx/en_us_goadedes/oc.m2.d7:ocVE.Stichera4.mode	@ltx/en_us_goadedes/miscellanea:misc.Mode2
ltx/en_us_goadedes/oc.m2.d7:ocVE.Stichera4.text	Since my adolescence I have been * a slave to degenerate passions. Through immorality * I defaced the part of me that is the image of God. * O pure Virgin, I am afraid of imminent judgment, * when I shall appear before your Son and God to be judged. * Purge me of my passions, I beg you, * before my demise, holy Lady, * and secure a pardon for my trespasses.
ltx/en_us_goadedes/oc.m2.d7:ocVE.Stichera5.incipit	…
ltx/en_us_goadedes/oc.m2.d7:ocVE.Stichera5.melody	@ltx/en_us_goadedes/he.a.m2:heAU.OteEkTouXylou.name
ltx/en_us_goadedes/oc.m2.d7:ocVE.Stichera5.mode	@ltx/en_us_goadedes/miscellanea:misc.Mode2
ltx/en_us_goadedes/oc.m2.d7:ocVE.Stichera5.text	
ltx/en_us_goadedes/oc.m2.d7:ocVE.Stichera6.incipit	…
ltx/en_us_goadedes/oc.m2.d7:ocVE.Stichera6.melody	@ltx/en_us_goadedes/he.a.m2:heAU.OteEkTouXylou.name
ltx/en_us_goadedes/oc.m2.d7:ocVE.Stichera6.mode	@ltx/en_us_goadedes/miscellanea:misc.Mode2
ltx/en_us_goadedes/oc.m2.d7:ocVE.Stichera6.text	
ltx/en_us_goadedes/oc.m2.d7:octrMA.AposGlory.incipit	@ltx/en_us_goadedes/oc.m2.d7:ocMA.Aposticha4.incipit
ltx/en_us_goadedes/oc.m2.d7:octrMA.AposGlory.melody	@ltx/en_us_goadedes/he.a.m2:heAU.OteEkTouXylou.name
ltx/en_us_goadedes/oc.m2.d7:octrMA.AposGlory.mode	@ltx/en_us_goadedes/miscellanea:misc.Mode2
ltx/en_us_goadedes/oc.m2.d7:octrMA.AposGlory.text	@ltx/en_us_goadedes/oc.m2.d7:ocMA.Aposticha4.text
ltx/en_us_goadedes/oc.m2.d7:octrMA.AposTheotokion.incipit	Virgin, you conceived…
ltx/en_us_goadedes/oc.m2.d7:octrMA.AposTheotokion.melody	@ltx/en_us_goadedes/he.a.m2:heAU.OteEkTouXylou.name
ltx/en_us_goadedes/oc.m2.d7:octrMA.AposTheotokion.mode	@ltx/en_us_goadedes/miscellanea:misc.Mode2
ltx/en_us_goadedes/oc.m2.d7:octrMA.AposTheotokion.text	Virgin, you conceived the Son of God, * who gives resurrection and freedom from death to those who believe. * In so doing you repaid the debt of mother Eve. * And your Son grants the shining crown * of glory immortal * unto those who glorify you as the Bride of God. * Now we pray you ever implore Him * to appoint a place to your servants, * where they may experience His splendid light.
ltx/en_us_goadedes/oc.m2.d7:octrMA.Aposticha1.greekmelody	@ltx/en_us_goadedes/he.a.m2:heAU.OteEkTouXylou.greekname
ltx/en_us_goadedes/oc.m2.d7:octrMA.Aposticha1.incipit	@ltx/en_us_goadedes/oc.m2.d7:ocMA.Aposticha1.incipit
ltx/en_us_goadedes/oc.m2.d7:octrMA.Aposticha1.melody	@ltx/en_us_goadedes/he.a.m2:heAU.OteEkTouXylou.name
ltx/en_us_goadedes/oc.m2.d7:octrMA.Aposticha1.mode	@ltx/en_us_goadedes/miscellanea:misc.Mode2
ltx/en_us_goadedes/oc.m2.d7:octrMA.Aposticha1.text	@ltx/en_us_goadedes/oc.m2.d7:ocMA.Aposticha1.text
ltx/en_us_goadedes/oc.m2.d7:octrMA.Aposticha2.incipit	@ltx/en_us_goadedes/oc.m2.d7:ocMA.Aposticha2.incipit
ltx/en_us_goadedes/oc.m2.d7:octrMA.Aposticha2.melody	@ltx/en_us_goadedes/he.a.m2:heAU.OteEkTouXylou.name
ltx/en_us_goadedes/oc.m2.d7:octrMA.Aposticha2.mode	@ltx/en_us_goadedes/miscellanea:misc.Mode2
ltx/en_us_goadedes/oc.m2.d7:octrMA.Aposticha2.text	@ltx/en_us_goadedes/oc.m2.d7:ocMA.Aposticha2.text
ltx/en_us_goadedes/oc.m2.d7:octrMA.Aposticha3.incipit	@ltx/en_us_goadedes/oc.m2.d7:ocMA.Aposticha3.incipit
ltx/en_us_goadedes/oc.m2.d7:octrMA.Aposticha3.melody	@ltx/en_us_goadedes/he.a.m2:heAU.OteEkTouXylou.name
ltx/en_us_goadedes/oc.m2.d7:octrMA.Aposticha3.mode	@ltx/en_us_goadedes/miscellanea:misc.Mode2
ltx/en_us_goadedes/oc.m2.d7:octrMA.Aposticha3.text	@ltx/en_us_goadedes/oc.m2.d7:ocMA.Aposticha3.text
ltx/en_us_goadedes/oc.m2.d7:octrMA.Kathisma11.incipit	@ltx/en_us_goadedes/oc.m2.d7:ocMA.Kathisma11.incipit
ltx/en_us_goadedes/oc.m2.d7:octrMA.Kathisma11.melody	
ltx/en_us_goadedes/oc.m2.d7:octrMA.Kathisma11.mode	@ltx/en_us_goadedes/miscellanea:misc.Mode2
ltx/en_us_goadedes/oc.m2.d7:octrMA.Kathisma11.text	@ltx/en_us_goadedes/oc.m2.d7:ocMA.Kathisma11.text
ltx/en_us_goadedes/oc.m2.d7:octrMA.Kathisma12.incipit	@ltx/en_us_goadedes/oc.m2.d7:ocMA.Kathisma12.incipit
ltx/en_us_goadedes/oc.m2.d7:octrMA.Kathisma12.melody	
ltx/en_us_goadedes/oc.m2.d7:octrMA.Kathisma12.mode	@ltx/en_us_goadedes/miscellanea:misc.Mode2
ltx/en_us_goadedes/oc.m2.d7:octrMA.Kathisma12.text	@ltx/en_us_goadedes/oc.m2.d7:ocMA.Kathisma12.text
ltx/en_us_goadedes/oc.m2.d7:octrMA.Kathisma13.incipit	@ltx/en_us_goadedes/oc.m2.d7:ocMA.Kathisma13.incipit
ltx/en_us_goadedes/oc.m2.d7:octrMA.Kathisma13.melody	
ltx/en_us_goadedes/oc.m2.d7:octrMA.Kathisma13.mode	@ltx/en_us_goadedes/miscellanea:misc.Mode2
ltx/en_us_goadedes/oc.m2.d7:octrMA.Kathisma13.text	@ltx/en_us_goadedes/oc.m2.d7:ocMA.Kathisma13.text
ltx/en_us_goadedes/oc.m2.d7:octrMA.Kathisma14.incipit	…
ltx/en_us_goadedes/oc.m2.d7:octrMA.Kathisma14.melody	
ltx/en_us_goadedes/oc.m2.d7:octrMA.Kathisma14.mode	@ltx/en_us_goadedes/miscellanea:misc.Mode2
ltx/en_us_goadedes/oc.m2.d7:octrMA.Kathisma14.text	
ltx/en_us_goadedes/oc.m2.d7:octrMA.Kathisma1T.incipit	@ltx/en_us_goadedes/oc.m2.d7:ocMA.Kathisma24.incipit
ltx/en_us_goadedes/oc.m2.d7:octrMA.Kathisma1T.melody	
ltx/en_us_goadedes/oc.m2.d7:octrMA.Kathisma1T.mode	@ltx/en_us_goadedes/miscellanea:misc.Mode2
ltx/en_us_goadedes/oc.m2.d7:octrMA.Kathisma1T.text	@ltx/en_us_goadedes/oc.m2.d7:ocMA.Kathisma24.text
ltx/en_us_goadedes/oc.m2.d7:octrMA.Lauds1.incipit	@ltx/en_us_goadedes/oc.m2.d2:ocMA.Aposticha3.incipit
ltx/en_us_goadedes/oc.m2.d7:octrMA.Lauds1.melody	
ltx/en_us_goadedes/oc.m2.d7:octrMA.Lauds1.mode	@ltx/en_us_goadedes/miscellanea:misc.Mode2
ltx/en_us_goadedes/oc.m2.d7:octrMA.Lauds1.text	@ltx/en_us_goadedes/oc.m2.d2:ocMA.Aposticha3.text
ltx/en_us_goadedes/oc.m2.d7:octrMA.Lauds2.incipit	@ltx/en_us_goadedes/oc.m2.d7:ocMA.Lauds1.incipit
ltx/en_us_goadedes/oc.m2.d7:octrMA.Lauds2.melody	
ltx/en_us_goadedes/oc.m2.d7:octrMA.Lauds2.mode	@ltx/en_us_goadedes/miscellanea:misc.Mode2
ltx/en_us_goadedes/oc.m2.d7:octrMA.Lauds2.text	@ltx/en_us_goadedes/oc.m2.d7:ocMA.Lauds1.text
ltx/en_us_goadedes/oc.m2.d7:octrMA.Lauds3.incipit	@ltx/en_us_goadedes/oc.m2.d7:ocMA.Lauds2.incipit
ltx/en_us_goadedes/oc.m2.d7:octrMA.Lauds3.melody	
ltx/en_us_goadedes/oc.m2.d7:octrMA.Lauds3.mode	@ltx/en_us_goadedes/miscellanea:misc.Mode2
ltx/en_us_goadedes/oc.m2.d7:octrMA.Lauds3.text	@ltx/en_us_goadedes/oc.m2.d7:ocMA.Lauds2.text
ltx/en_us_goadedes/oc.m2.d7:octrMA.Lauds4.incipit	@ltx/en_us_goadedes/oc.m2.d7:ocMA.Lauds3.incipit
ltx/en_us_goadedes/oc.m2.d7:octrMA.Lauds4.melody	
ltx/en_us_goadedes/oc.m2.d7:octrMA.Lauds4.mode	@ltx/en_us_goadedes/miscellanea:misc.Mode2
ltx/en_us_goadedes/oc.m2.d7:octrMA.Lauds4.text	@ltx/en_us_goadedes/oc.m2.d7:ocMA.Lauds3.text
ltx/en_us_goadedes/oc.m2.d7:octrMA.LaudsGlory.incipit	You formed me from the dust…
ltx/en_us_goadedes/oc.m2.d7:octrMA.LaudsGlory.melody	
ltx/en_us_goadedes/oc.m2.d7:octrMA.LaudsGlory.mode	@ltx/en_us_goadedes/miscellanea:misc.Mode2
ltx/en_us_goadedes/oc.m2.d7:octrMA.LaudsGlory.poet	@ltx/en_us_goadedes/poets:po.IoannouTouDamaskinou
ltx/en_us_goadedes/oc.m2.d7:octrMA.LaudsGlory.text	You formed me from the dust of the ground. Then, because of the transgression, You sentenced me to return to the ground. You set a day of examination, when each person’s secret deeds will be presented before You. I beg You, spare me on that day, O sinless Lord. Grant to me a pardon for my sins, and please do not exclude me from Your Kingdom.
ltx/en_us_goadedes/oc.m2.d7:octrMA.LaudsTheotokion.incipit	@ltx/en_us_goadedes/oc.m2.d3:ocMA.AposTheotokion.incipit
ltx/en_us_goadedes/oc.m2.d7:octrMA.LaudsTheotokion.melody	
ltx/en_us_goadedes/oc.m2.d7:octrMA.LaudsTheotokion.mode	@ltx/en_us_goadedes/miscellanea:misc.Mode2
ltx/en_us_goadedes/oc.m2.d7:octrMA.LaudsTheotokion.text	@ltx/en_us_goadedes/oc.m2.d3:ocMA.AposTheotokion.text
ltx/en_us_goadedes/oc.m2.d7:octrMA.Photogogic.incipit	@ltx/en_us_goadedes/oc.m2.d2:octrMA.Photagogic.incipit
ltx/en_us_goadedes/oc.m2.d7:octrMA.Photogogic.mode	@ltx/en_us_goadedes/miscellanea:misc.Mode2
ltx/en_us_goadedes/oc.m2.d7:octrMA.Photogogic.text	@ltx/en_us_goadedes/oc.m2.d2:octrMA.Photagogic.text
ltx/en_us_goadedes/oc.m2.d7:octrVE.SticBoth.incipit	@ltx/en_us_goadedes/oc.m2.d7:ocVE.SticTheotokion.incipit
ltx/en_us_goadedes/oc.m2.d7:octrVE.SticBoth.melody	
ltx/en_us_goadedes/oc.m2.d7:octrVE.SticBoth.mode	@ltx/en_us_goadedes/miscellanea:misc.Mode2
ltx/en_us_goadedes/oc.m2.d7:octrVE.SticBoth.text	@ltx/en_us_goadedes/oc.m2.d7:ocVE.SticTheotokion.text
ltx/en_us_goadedes/oc.m2.d7:octrVE.SticGlory.incipit	@ltx/en_us_goadedes/oc.m2.d7:ocMA.Lauds4.incipit
ltx/en_us_goadedes/oc.m2.d7:octrVE.SticGlory.melody	
ltx/en_us_goadedes/oc.m2.d7:octrVE.SticGlory.mode	@ltx/en_us_goadedes/miscellanea:misc.Mode2
ltx/en_us_goadedes/oc.m2.d7:octrVE.SticGlory.text	@ltx/en_us_goadedes/oc.m2.d7:ocMA.Lauds4.text
ltx/en_us_goadedes/oc.m2.d7:octrVE.Stichera1.incipit	@ltx/en_us_goadedes/oc.m2.d2:ocVE.Aposticha3.incipit
ltx/en_us_goadedes/oc.m2.d7:octrVE.Stichera1.melody	
ltx/en_us_goadedes/oc.m2.d7:octrVE.Stichera1.mode	@ltx/en_us_goadedes/miscellanea:misc.Mode2
ltx/en_us_goadedes/oc.m2.d7:octrVE.Stichera1.text	@ltx/en_us_goadedes/oc.m2.d2:ocVE.Aposticha3.text
ltx/en_us_goadedes/oc.m2.d7:octrVE.Stichera2.incipit	@ltx/en_us_goadedes/oc.m2.d3:ocVE.Aposticha3.incipit
ltx/en_us_goadedes/oc.m2.d7:octrVE.Stichera2.melody	
ltx/en_us_goadedes/oc.m2.d7:octrVE.Stichera2.mode	@ltx/en_us_goadedes/miscellanea:misc.Mode2
ltx/en_us_goadedes/oc.m2.d7:octrVE.Stichera2.text	@ltx/en_us_goadedes/oc.m2.d3:ocVE.Aposticha3.text
ltx/en_us_goadedes/oc.m2.d7:octrVE.Stichera3.incipit	@ltx/en_us_goadedes/oc.m2.d4:ocVE.Aposticha3.incipit
ltx/en_us_goadedes/oc.m2.d7:octrVE.Stichera3.melody	
ltx/en_us_goadedes/oc.m2.d7:octrVE.Stichera3.mode	@ltx/en_us_goadedes/miscellanea:misc.Mode2
ltx/en_us_goadedes/oc.m2.d7:octrVE.Stichera3.text	@ltx/en_us_goadedes/oc.m2.d4:ocVE.Aposticha3.text
ltx/en_us_goadedes/oc.m2.d7:octrVE.Stichera4.incipit	@ltx/en_us_goadedes/oc.m2.d5:ocVE.Aposticha3.incipit
ltx/en_us_goadedes/oc.m2.d7:octrVE.Stichera4.melody	
ltx/en_us_goadedes/oc.m2.d7:octrVE.Stichera4.mode	@ltx/en_us_goadedes/miscellanea:misc.Mode2
ltx/en_us_goadedes/oc.m2.d7:octrVE.Stichera4.text	@ltx/en_us_goadedes/oc.m2.d5:ocVE.Aposticha3.text
