ltx/en_us_goadedes/me.m04.d23:meDA.commemoration.first	
ltx/en_us_goadedes/me.m04.d23:meDA.commemoration.first_name	
ltx/en_us_goadedes/me.m04.d23:meDA.commemoration.first_short	
ltx/en_us_goadedes/me.m04.d23:meDA.commemoration.first_title	For St. George.
ltx/en_us_goadedes/me.m04.d23:meDA.commemoration.full	
ltx/en_us_goadedes/me.m04.d23:meDA.commemoration.second_name	
ltx/en_us_goadedes/me.m04.d23:meDA.commemoration.second_title	
ltx/en_us_goadedes/me.m04.d23:meDA.date	
ltx/en_us_goadedes/me.m04.d23:meDA.fordate	
ltx/en_us_goadedes/me.m04.d23:meDA.insert1	
ltx/en_us_goadedes/me.m04.d23:meDA.insert2	
ltx/en_us_goadedes/me.m04.d23:meDA.note	
ltx/en_us_goadedes/me.m04.d23:meDA.pdfcoverdate	
ltx/en_us_goadedes/me.m04.d23:meDA.pdfheaderdate	
ltx/en_us_goadedes/me.m04.d23:meHO.commemorations	
ltx/en_us_goadedes/me.m04.d23:meHO.note1	@ltx/en_us_goadedes/rubrical:ru.HolidayWineOil
ltx/en_us_goadedes/me.m04.d23:meHO.note2	
ltx/en_us_goadedes/me.m04.d23:meHO.number	
ltx/en_us_goadedes/me.m04.d23:meHO.rank	
ltx/en_us_goadedes/me.m04.d23:meLE.commemoration1	
ltx/en_us_goadedes/me.m04.d23:meLE.commemoration2	
ltx/en_us_goadedes/me.m04.d23:meLI.Kontakion1.greekmelody	@ltx/en_us_goadedes/me.m04.d23:meMA.Kontakion1.greekmelody
ltx/en_us_goadedes/me.m04.d23:meLI.Kontakion1.incipit	@ltx/en_us_goadedes/me.m04.d23:meMA.Kontakion1.incipit
ltx/en_us_goadedes/me.m04.d23:meLI.Kontakion1.melody	@ltx/en_us_goadedes/me.m04.d23:meMA.Kontakion1.melody
ltx/en_us_goadedes/me.m04.d23:meLI.Kontakion1.mode	@ltx/en_us_goadedes/me.m04.d23:meMA.Kontakion1.mode
ltx/en_us_goadedes/me.m04.d23:meLI.Kontakion1.text	@ltx/en_us_goadedes/me.m04.d23:meMA.Kontakion1.text
ltx/en_us_goadedes/me.m04.d23:meLI.MM.CommunionHymn.text	@ltx/en_us_goadedes/properties:media.key
ltx/en_us_goadedes/me.m04.d23:meLI.Megalynarion.text	
ltx/en_us_goadedes/me.m04.d23:meMA.C1.acrostic.notice1	
ltx/en_us_goadedes/me.m04.d23:meMA.C1.acrostic.text	
ltx/en_us_goadedes/me.m04.d23:meMA.C1.acrostic.title	
ltx/en_us_goadedes/me.m04.d23:meMA.C1.title	@ltx/en_us_goadedes/titles:ti.Canon1SaintM
ltx/en_us_goadedes/me.m04.d23:meMA.C1.verse	@ltx/en_us_goadedes/prayers:pr.verse_SaintM.text
ltx/en_us_goadedes/me.m04.d23:meMA.C2.acrostic.notice1	
ltx/en_us_goadedes/me.m04.d23:meMA.C2.acrostic.text	
ltx/en_us_goadedes/me.m04.d23:meMA.C2.acrostic.title	
ltx/en_us_goadedes/me.m04.d23:meMA.C2.poet	@ltx/en_us_goadedes/poets:po.Theofanous
ltx/en_us_goadedes/me.m04.d23:meMA.C2.title	@ltx/en_us_goadedes/titles:ti.Canon2SaintM
ltx/en_us_goadedes/me.m04.d23:meMA.C2.verse	@ltx/en_us_goadedes/prayers:pr.verse_SaintM.text
ltx/en_us_goadedes/me.m04.d23:meMA.Exaposteilarion1.greekmelody	@ltx/en_us_goadedes/he.a.m2:heAU.ToisMathitaisSynelthomen.greekname
ltx/en_us_goadedes/me.m04.d23:meMA.Exaposteilarion1.incipit	…
ltx/en_us_goadedes/me.m04.d23:meMA.Exaposteilarion1.melody	@ltx/en_us_goadedes/he.a.m2:heAU.ToisMathitaisSynelthomen.name
ltx/en_us_goadedes/me.m04.d23:meMA.Exaposteilarion1.mode	@ltx/en_us_goadedes/miscellanea:misc.Mode2
ltx/en_us_goadedes/me.m04.d23:meMA.Exaposteilarion1.text	
ltx/en_us_goadedes/me.m04.d23:meMA.Kathisma11.greekmelody	@ltx/en_us_goadedes/he.a.m1:heAU.TonTafonSouSotir.greekname
ltx/en_us_goadedes/me.m04.d23:meMA.Kathisma11.incipit	…
ltx/en_us_goadedes/me.m04.d23:meMA.Kathisma11.melody	@ltx/en_us_goadedes/he.a.m1:heAU.TonTafonSouSotir.name
ltx/en_us_goadedes/me.m04.d23:meMA.Kathisma11.mode	@ltx/en_us_goadedes/miscellanea:misc.Mode1
ltx/en_us_goadedes/me.m04.d23:meMA.Kathisma11.text	
ltx/en_us_goadedes/me.m04.d23:meMA.Kathisma21.greekmelody	@ltx/en_us_goadedes/he.a.m3:heAU.TheiasPisteos.greekname
ltx/en_us_goadedes/me.m04.d23:meMA.Kathisma21.incipit	…
ltx/en_us_goadedes/me.m04.d23:meMA.Kathisma21.melody	@ltx/en_us_goadedes/he.a.m3:heAU.TheiasPisteos.name
ltx/en_us_goadedes/me.m04.d23:meMA.Kathisma21.mode	@ltx/en_us_goadedes/miscellanea:misc.Mode3
ltx/en_us_goadedes/me.m04.d23:meMA.Kathisma21.text	
ltx/en_us_goadedes/me.m04.d23:meMA.Kathisma31.greekmelody	@ltx/en_us_goadedes/he.a.m4:heAU.KateplagiIosif.greekname
ltx/en_us_goadedes/me.m04.d23:meMA.Kathisma31.incipit	…
ltx/en_us_goadedes/me.m04.d23:meMA.Kathisma31.melody	@ltx/en_us_goadedes/he.a.m4:heAU.KateplagiIosif.name
ltx/en_us_goadedes/me.m04.d23:meMA.Kathisma31.mode	@ltx/en_us_goadedes/miscellanea:misc.Mode4
ltx/en_us_goadedes/me.m04.d23:meMA.Kathisma31.text	
ltx/en_us_goadedes/me.m04.d23:meMA.Kontakion1.greekmelody	@ltx/en_us_goadedes/he.a.m4:heAU.OYpsotheisEnToStavro.greekname
ltx/en_us_goadedes/me.m04.d23:meMA.Kontakion1.incipit	…
ltx/en_us_goadedes/me.m04.d23:meMA.Kontakion1.melody	@ltx/en_us_goadedes/he.a.m4:heAU.OYpsotheisEnToStavro.name
ltx/en_us_goadedes/me.m04.d23:meMA.Kontakion1.mode	@ltx/en_us_goadedes/miscellanea:misc.Mode4
ltx/en_us_goadedes/me.m04.d23:meMA.Kontakion1.text	
ltx/en_us_goadedes/me.m04.d23:meMA.Lauds1.greekmelody	@ltx/en_us_goadedes/he.a.m2:heAU.OteEkTouXylou.greekname
ltx/en_us_goadedes/me.m04.d23:meMA.Lauds1.incipit	…
ltx/en_us_goadedes/me.m04.d23:meMA.Lauds1.melody	@ltx/en_us_goadedes/he.a.m2:heAU.OteEkTouXylou.name
ltx/en_us_goadedes/me.m04.d23:meMA.Lauds1.mode	@ltx/en_us_goadedes/miscellanea:misc.Mode2
ltx/en_us_goadedes/me.m04.d23:meMA.Lauds1.text	
ltx/en_us_goadedes/me.m04.d23:meMA.Lauds2.incipit	…
ltx/en_us_goadedes/me.m04.d23:meMA.Lauds2.melody	@ltx/en_us_goadedes/he.a.m2:heAU.OteEkTouXylou.name
ltx/en_us_goadedes/me.m04.d23:meMA.Lauds2.mode	@ltx/en_us_goadedes/miscellanea:misc.Mode2
ltx/en_us_goadedes/me.m04.d23:meMA.Lauds2.text	
ltx/en_us_goadedes/me.m04.d23:meMA.Lauds3.incipit	…
ltx/en_us_goadedes/me.m04.d23:meMA.Lauds3.melody	@ltx/en_us_goadedes/he.a.m2:heAU.OteEkTouXylou.name
ltx/en_us_goadedes/me.m04.d23:meMA.Lauds3.mode	@ltx/en_us_goadedes/miscellanea:misc.Mode2
ltx/en_us_goadedes/me.m04.d23:meMA.Lauds3.text	
ltx/en_us_goadedes/me.m04.d23:meMA.Lauds4.greekmelody	@ltx/en_us_goadedes/he.a.m2:heAU.OteEkTouXylou.greekname
ltx/en_us_goadedes/me.m04.d23:meMA.Lauds4.incipit	…
ltx/en_us_goadedes/me.m04.d23:meMA.Lauds4.melody	@ltx/en_us_goadedes/he.a.m2:heAU.OteEkTouXylou.name
ltx/en_us_goadedes/me.m04.d23:meMA.Lauds4.mode	@ltx/en_us_goadedes/miscellanea:misc.Mode2
ltx/en_us_goadedes/me.m04.d23:meMA.Lauds4.text	
ltx/en_us_goadedes/me.m04.d23:meMA.LaudsGlory.incipit	…
ltx/en_us_goadedes/me.m04.d23:meMA.LaudsGlory.melody	
ltx/en_us_goadedes/me.m04.d23:meMA.LaudsGlory.mode	@ltx/en_us_goadedes/miscellanea:misc.Mode5
ltx/en_us_goadedes/me.m04.d23:meMA.LaudsGlory.poet	@ltx/en_us_goadedes/poets:po.Theofanous
ltx/en_us_goadedes/me.m04.d23:meMA.LaudsGlory.text	
ltx/en_us_goadedes/me.m04.d23:meMA.MM.Lauds1234as5678.text	@ltx/en_us_goadedes/properties:media.key
ltx/en_us_goadedes/me.m04.d23:meMA.MM.Lauds123as456.text	@ltx/en_us_goadedes/properties:media.key
ltx/en_us_goadedes/me.m04.d23:meMA.MM.PostGospelIdiomelon.text	@ltx/en_us_goadedes/properties:media.key
ltx/en_us_goadedes/me.m04.d23:meMA.Ode1C11.greekmelody	@ltx/en_us_goadedes/he.h.m1:heHE.AnastaseosImera.greekname
ltx/en_us_goadedes/me.m04.d23:meMA.Ode1C11.incipit	…
ltx/en_us_goadedes/me.m04.d23:meMA.Ode1C11.melody	@ltx/en_us_goadedes/he.h.m1:heHE.AnastaseosImera.name
ltx/en_us_goadedes/me.m04.d23:meMA.Ode1C11.mode	@ltx/en_us_goadedes/miscellanea:misc.Mode1
ltx/en_us_goadedes/me.m04.d23:meMA.Ode1C11.ode	@ltx/en_us_goadedes/miscellanea:misc.Ode1
ltx/en_us_goadedes/me.m04.d23:meMA.Ode1C11.text	
ltx/en_us_goadedes/me.m04.d23:meMA.Ode1C12.incipit	…
ltx/en_us_goadedes/me.m04.d23:meMA.Ode1C12.melody	@ltx/en_us_goadedes/he.h.m1:heHE.AnastaseosImera.name
ltx/en_us_goadedes/me.m04.d23:meMA.Ode1C12.mode	@ltx/en_us_goadedes/miscellanea:misc.Mode1
ltx/en_us_goadedes/me.m04.d23:meMA.Ode1C12.ode	@ltx/en_us_goadedes/miscellanea:misc.Ode1
ltx/en_us_goadedes/me.m04.d23:meMA.Ode1C12.text	
ltx/en_us_goadedes/me.m04.d23:meMA.Ode1C13.incipit	…
ltx/en_us_goadedes/me.m04.d23:meMA.Ode1C13.melody	@ltx/en_us_goadedes/he.h.m1:heHE.AnastaseosImera.name
ltx/en_us_goadedes/me.m04.d23:meMA.Ode1C13.mode	@ltx/en_us_goadedes/miscellanea:misc.Mode1
ltx/en_us_goadedes/me.m04.d23:meMA.Ode1C13.ode	@ltx/en_us_goadedes/miscellanea:misc.Ode1
ltx/en_us_goadedes/me.m04.d23:meMA.Ode1C13.text	
ltx/en_us_goadedes/me.m04.d23:meMA.Ode1C1T.incipit	…
ltx/en_us_goadedes/me.m04.d23:meMA.Ode1C1T.melody	@ltx/en_us_goadedes/he.h.m1:heHE.AnastaseosImera.name
ltx/en_us_goadedes/me.m04.d23:meMA.Ode1C1T.mode	@ltx/en_us_goadedes/miscellanea:misc.Mode1
ltx/en_us_goadedes/me.m04.d23:meMA.Ode1C1T.ode	@ltx/en_us_goadedes/miscellanea:misc.Ode1
ltx/en_us_goadedes/me.m04.d23:meMA.Ode1C1T.text	
ltx/en_us_goadedes/me.m04.d23:meMA.Ode1C21.greekmelody	@ltx/en_us_goadedes/he.h.m2:heHE.EnVythoKatestrose.greekname
ltx/en_us_goadedes/me.m04.d23:meMA.Ode1C21.incipit	…
ltx/en_us_goadedes/me.m04.d23:meMA.Ode1C21.melody	@ltx/en_us_goadedes/he.h.m2:heHE.EnVythoKatestrose.name
ltx/en_us_goadedes/me.m04.d23:meMA.Ode1C21.mode	@ltx/en_us_goadedes/miscellanea:misc.Mode2
ltx/en_us_goadedes/me.m04.d23:meMA.Ode1C21.ode	@ltx/en_us_goadedes/miscellanea:misc.Ode1
ltx/en_us_goadedes/me.m04.d23:meMA.Ode1C21.text	
ltx/en_us_goadedes/me.m04.d23:meMA.Ode1C22.incipit	…
ltx/en_us_goadedes/me.m04.d23:meMA.Ode1C22.melody	@ltx/en_us_goadedes/he.h.m2:heHE.EnVythoKatestrose.name
ltx/en_us_goadedes/me.m04.d23:meMA.Ode1C22.mode	@ltx/en_us_goadedes/miscellanea:misc.Mode2
ltx/en_us_goadedes/me.m04.d23:meMA.Ode1C22.ode	@ltx/en_us_goadedes/miscellanea:misc.Ode1
ltx/en_us_goadedes/me.m04.d23:meMA.Ode1C22.text	
ltx/en_us_goadedes/me.m04.d23:meMA.Ode1C23.incipit	…
ltx/en_us_goadedes/me.m04.d23:meMA.Ode1C23.melody	@ltx/en_us_goadedes/he.h.m2:heHE.EnVythoKatestrose.name
ltx/en_us_goadedes/me.m04.d23:meMA.Ode1C23.mode	@ltx/en_us_goadedes/miscellanea:misc.Mode2
ltx/en_us_goadedes/me.m04.d23:meMA.Ode1C23.ode	@ltx/en_us_goadedes/miscellanea:misc.Ode1
ltx/en_us_goadedes/me.m04.d23:meMA.Ode1C23.text	
ltx/en_us_goadedes/me.m04.d23:meMA.Ode1C24.incipit	…
ltx/en_us_goadedes/me.m04.d23:meMA.Ode1C24.melody	@ltx/en_us_goadedes/he.h.m2:heHE.EnVythoKatestrose.name
ltx/en_us_goadedes/me.m04.d23:meMA.Ode1C24.mode	@ltx/en_us_goadedes/miscellanea:misc.Mode2
ltx/en_us_goadedes/me.m04.d23:meMA.Ode1C24.ode	@ltx/en_us_goadedes/miscellanea:misc.Ode1
ltx/en_us_goadedes/me.m04.d23:meMA.Ode1C24.text	
ltx/en_us_goadedes/me.m04.d23:meMA.Ode1C2H.greekmelody	@ltx/en_us_goadedes/he.h.m2:heHE.EnVythoKatestrose.greekname
ltx/en_us_goadedes/me.m04.d23:meMA.Ode1C2H.incipit	@ltx/en_us_goadedes/he.h.m2:heHE.EnVythoKatestrose.incipit
ltx/en_us_goadedes/me.m04.d23:meMA.Ode1C2H.melody	@ltx/en_us_goadedes/he.h.m2:heHE.EnVythoKatestrose.melody
ltx/en_us_goadedes/me.m04.d23:meMA.Ode1C2H.mode	@ltx/en_us_goadedes/miscellanea:misc.Mode2
ltx/en_us_goadedes/me.m04.d23:meMA.Ode1C2H.ode	@ltx/en_us_goadedes/miscellanea:misc.Ode1
ltx/en_us_goadedes/me.m04.d23:meMA.Ode1C2H.text	@ltx/en_us_goadedes/he.h.m2:heHE.EnVythoKatestrose.text
ltx/en_us_goadedes/me.m04.d23:meMA.Ode1C2T.incipit	…
ltx/en_us_goadedes/me.m04.d23:meMA.Ode1C2T.melody	@ltx/en_us_goadedes/he.h.m2:heHE.EnVythoKatestrose.name
ltx/en_us_goadedes/me.m04.d23:meMA.Ode1C2T.mode	@ltx/en_us_goadedes/miscellanea:misc.Mode2
ltx/en_us_goadedes/me.m04.d23:meMA.Ode1C2T.ode	@ltx/en_us_goadedes/miscellanea:misc.Ode1
ltx/en_us_goadedes/me.m04.d23:meMA.Ode1C2T.text	
ltx/en_us_goadedes/me.m04.d23:meMA.Ode3C11.greekmelody	@ltx/en_us_goadedes/he.h.m1:heHE.DeftePomaPiomen.greekname
ltx/en_us_goadedes/me.m04.d23:meMA.Ode3C11.incipit	…
ltx/en_us_goadedes/me.m04.d23:meMA.Ode3C11.melody	@ltx/en_us_goadedes/he.h.m1:heHE.DeftePomaPiomen.name
ltx/en_us_goadedes/me.m04.d23:meMA.Ode3C11.mode	@ltx/en_us_goadedes/miscellanea:misc.Mode1
ltx/en_us_goadedes/me.m04.d23:meMA.Ode3C11.ode	@ltx/en_us_goadedes/miscellanea:misc.Ode3
ltx/en_us_goadedes/me.m04.d23:meMA.Ode3C11.text	
ltx/en_us_goadedes/me.m04.d23:meMA.Ode3C12.incipit	…
ltx/en_us_goadedes/me.m04.d23:meMA.Ode3C12.melody	@ltx/en_us_goadedes/he.h.m1:heHE.DeftePomaPiomen.name
ltx/en_us_goadedes/me.m04.d23:meMA.Ode3C12.mode	@ltx/en_us_goadedes/miscellanea:misc.Mode1
ltx/en_us_goadedes/me.m04.d23:meMA.Ode3C12.ode	@ltx/en_us_goadedes/miscellanea:misc.Ode3
ltx/en_us_goadedes/me.m04.d23:meMA.Ode3C12.text	
ltx/en_us_goadedes/me.m04.d23:meMA.Ode3C13.incipit	…
ltx/en_us_goadedes/me.m04.d23:meMA.Ode3C13.melody	@ltx/en_us_goadedes/he.h.m1:heHE.DeftePomaPiomen.name
ltx/en_us_goadedes/me.m04.d23:meMA.Ode3C13.mode	@ltx/en_us_goadedes/miscellanea:misc.Mode1
ltx/en_us_goadedes/me.m04.d23:meMA.Ode3C13.ode	@ltx/en_us_goadedes/miscellanea:misc.Ode3
ltx/en_us_goadedes/me.m04.d23:meMA.Ode3C13.text	
ltx/en_us_goadedes/me.m04.d23:meMA.Ode3C1T.incipit	…
ltx/en_us_goadedes/me.m04.d23:meMA.Ode3C1T.melody	@ltx/en_us_goadedes/he.h.m1:heHE.DeftePomaPiomen.name
ltx/en_us_goadedes/me.m04.d23:meMA.Ode3C1T.mode	@ltx/en_us_goadedes/miscellanea:misc.Mode1
ltx/en_us_goadedes/me.m04.d23:meMA.Ode3C1T.ode	@ltx/en_us_goadedes/miscellanea:misc.Ode3
ltx/en_us_goadedes/me.m04.d23:meMA.Ode3C1T.text	
ltx/en_us_goadedes/me.m04.d23:meMA.Ode3C21.greekmelody	@ltx/en_us_goadedes/he.h.m2:heHE.ExinthisenIErimos.greekname
ltx/en_us_goadedes/me.m04.d23:meMA.Ode3C21.incipit	…
ltx/en_us_goadedes/me.m04.d23:meMA.Ode3C21.melody	@ltx/en_us_goadedes/he.h.m2:heHE.ExinthisenIErimos.name
ltx/en_us_goadedes/me.m04.d23:meMA.Ode3C21.mode	@ltx/en_us_goadedes/miscellanea:misc.Mode2
ltx/en_us_goadedes/me.m04.d23:meMA.Ode3C21.ode	@ltx/en_us_goadedes/miscellanea:misc.Ode3
ltx/en_us_goadedes/me.m04.d23:meMA.Ode3C21.text	
ltx/en_us_goadedes/me.m04.d23:meMA.Ode3C22.incipit	…
ltx/en_us_goadedes/me.m04.d23:meMA.Ode3C22.melody	@ltx/en_us_goadedes/he.h.m2:heHE.ExinthisenIErimos.name
ltx/en_us_goadedes/me.m04.d23:meMA.Ode3C22.mode	@ltx/en_us_goadedes/miscellanea:misc.Mode2
ltx/en_us_goadedes/me.m04.d23:meMA.Ode3C22.ode	@ltx/en_us_goadedes/miscellanea:misc.Ode3
ltx/en_us_goadedes/me.m04.d23:meMA.Ode3C22.text	
ltx/en_us_goadedes/me.m04.d23:meMA.Ode3C23.incipit	…
ltx/en_us_goadedes/me.m04.d23:meMA.Ode3C23.melody	@ltx/en_us_goadedes/he.h.m2:heHE.ExinthisenIErimos.name
ltx/en_us_goadedes/me.m04.d23:meMA.Ode3C23.mode	@ltx/en_us_goadedes/miscellanea:misc.Mode2
ltx/en_us_goadedes/me.m04.d23:meMA.Ode3C23.ode	@ltx/en_us_goadedes/miscellanea:misc.Ode3
ltx/en_us_goadedes/me.m04.d23:meMA.Ode3C23.text	
ltx/en_us_goadedes/me.m04.d23:meMA.Ode3C2H.greekmelody	@ltx/en_us_goadedes/he.h.m2:heHE.ExinthisenIErimos.greekname
ltx/en_us_goadedes/me.m04.d23:meMA.Ode3C2H.incipit	@ltx/en_us_goadedes/he.h.m2:heHE.ExinthisenIErimos.incipit
ltx/en_us_goadedes/me.m04.d23:meMA.Ode3C2H.melody	@ltx/en_us_goadedes/he.h.m2:heHE.ExinthisenIErimos.melody
ltx/en_us_goadedes/me.m04.d23:meMA.Ode3C2H.mode	@ltx/en_us_goadedes/miscellanea:misc.Mode2
ltx/en_us_goadedes/me.m04.d23:meMA.Ode3C2H.ode	@ltx/en_us_goadedes/miscellanea:misc.Ode3
ltx/en_us_goadedes/me.m04.d23:meMA.Ode3C2H.text	@ltx/en_us_goadedes/he.h.m2:heHE.ExinthisenIErimos.text
ltx/en_us_goadedes/me.m04.d23:meMA.Ode3C2T.incipit	…
ltx/en_us_goadedes/me.m04.d23:meMA.Ode3C2T.melody	@ltx/en_us_goadedes/he.h.m2:heHE.ExinthisenIErimos.name
ltx/en_us_goadedes/me.m04.d23:meMA.Ode3C2T.mode	@ltx/en_us_goadedes/miscellanea:misc.Mode2
ltx/en_us_goadedes/me.m04.d23:meMA.Ode3C2T.ode	@ltx/en_us_goadedes/miscellanea:misc.Ode3
ltx/en_us_goadedes/me.m04.d23:meMA.Ode3C2T.text	
ltx/en_us_goadedes/me.m04.d23:meMA.Ode3Kathisma1.greekmelody	@ltx/en_us_goadedes/he.a.m8:heAU.TinSofianKaiLogon.greekname
ltx/en_us_goadedes/me.m04.d23:meMA.Ode3Kathisma1.incipit	…
ltx/en_us_goadedes/me.m04.d23:meMA.Ode3Kathisma1.melody	@ltx/en_us_goadedes/he.a.m8:heAU.TinSofianKaiLogon.name
ltx/en_us_goadedes/me.m04.d23:meMA.Ode3Kathisma1.mode	@ltx/en_us_goadedes/miscellanea:misc.Mode8
ltx/en_us_goadedes/me.m04.d23:meMA.Ode3Kathisma1.text	
ltx/en_us_goadedes/me.m04.d23:meMA.Ode3Kathisma2.greekmelody	@ltx/en_us_goadedes/he.a.m8:heAU.TinSofianKaiLogon.greekname
ltx/en_us_goadedes/me.m04.d23:meMA.Ode3Kathisma2.incipit	…
ltx/en_us_goadedes/me.m04.d23:meMA.Ode3Kathisma2.melody	@ltx/en_us_goadedes/he.a.m8:heAU.TinSofianKaiLogon.name
ltx/en_us_goadedes/me.m04.d23:meMA.Ode3Kathisma2.mode	@ltx/en_us_goadedes/miscellanea:misc.Mode8
ltx/en_us_goadedes/me.m04.d23:meMA.Ode3Kathisma2.text	
ltx/en_us_goadedes/me.m04.d23:meMA.Ode4C11.greekmelody	@ltx/en_us_goadedes/he.h.m1:heHE.EpiTisTheiasFylakis.greekname
ltx/en_us_goadedes/me.m04.d23:meMA.Ode4C11.incipit	…
ltx/en_us_goadedes/me.m04.d23:meMA.Ode4C11.melody	@ltx/en_us_goadedes/he.h.m1:heHE.EpiTisTheiasFylakis.name
ltx/en_us_goadedes/me.m04.d23:meMA.Ode4C11.mode	@ltx/en_us_goadedes/miscellanea:misc.Mode1
ltx/en_us_goadedes/me.m04.d23:meMA.Ode4C11.ode	@ltx/en_us_goadedes/miscellanea:misc.Ode4
ltx/en_us_goadedes/me.m04.d23:meMA.Ode4C11.text	
ltx/en_us_goadedes/me.m04.d23:meMA.Ode4C12.incipit	…
ltx/en_us_goadedes/me.m04.d23:meMA.Ode4C12.melody	@ltx/en_us_goadedes/he.h.m1:heHE.EpiTisTheiasFylakis.name
ltx/en_us_goadedes/me.m04.d23:meMA.Ode4C12.mode	@ltx/en_us_goadedes/miscellanea:misc.Mode1
ltx/en_us_goadedes/me.m04.d23:meMA.Ode4C12.ode	@ltx/en_us_goadedes/miscellanea:misc.Ode4
ltx/en_us_goadedes/me.m04.d23:meMA.Ode4C12.text	
ltx/en_us_goadedes/me.m04.d23:meMA.Ode4C13.incipit	…
ltx/en_us_goadedes/me.m04.d23:meMA.Ode4C13.melody	@ltx/en_us_goadedes/he.h.m1:heHE.EpiTisTheiasFylakis.name
ltx/en_us_goadedes/me.m04.d23:meMA.Ode4C13.mode	@ltx/en_us_goadedes/miscellanea:misc.Mode1
ltx/en_us_goadedes/me.m04.d23:meMA.Ode4C13.ode	@ltx/en_us_goadedes/miscellanea:misc.Ode4
ltx/en_us_goadedes/me.m04.d23:meMA.Ode4C13.text	
ltx/en_us_goadedes/me.m04.d23:meMA.Ode4C1T.incipit	…
ltx/en_us_goadedes/me.m04.d23:meMA.Ode4C1T.melody	@ltx/en_us_goadedes/he.h.m1:heHE.EpiTisTheiasFylakis.name
ltx/en_us_goadedes/me.m04.d23:meMA.Ode4C1T.mode	@ltx/en_us_goadedes/miscellanea:misc.Mode1
ltx/en_us_goadedes/me.m04.d23:meMA.Ode4C1T.ode	@ltx/en_us_goadedes/miscellanea:misc.Ode4
ltx/en_us_goadedes/me.m04.d23:meMA.Ode4C1T.text	
ltx/en_us_goadedes/me.m04.d23:meMA.Ode4C21.greekmelody	@ltx/en_us_goadedes/he.h.m2:heHE.ElilythasEkParthenou.greekname
ltx/en_us_goadedes/me.m04.d23:meMA.Ode4C21.incipit	…
ltx/en_us_goadedes/me.m04.d23:meMA.Ode4C21.melody	@ltx/en_us_goadedes/he.h.m2:heHE.ElilythasEkParthenou.name
ltx/en_us_goadedes/me.m04.d23:meMA.Ode4C21.mode	@ltx/en_us_goadedes/miscellanea:misc.Mode2
ltx/en_us_goadedes/me.m04.d23:meMA.Ode4C21.ode	@ltx/en_us_goadedes/miscellanea:misc.Ode4
ltx/en_us_goadedes/me.m04.d23:meMA.Ode4C21.text	
ltx/en_us_goadedes/me.m04.d23:meMA.Ode4C22.incipit	…
ltx/en_us_goadedes/me.m04.d23:meMA.Ode4C22.melody	@ltx/en_us_goadedes/he.h.m2:heHE.ElilythasEkParthenou.name
ltx/en_us_goadedes/me.m04.d23:meMA.Ode4C22.mode	@ltx/en_us_goadedes/miscellanea:misc.Mode2
ltx/en_us_goadedes/me.m04.d23:meMA.Ode4C22.ode	@ltx/en_us_goadedes/miscellanea:misc.Ode4
ltx/en_us_goadedes/me.m04.d23:meMA.Ode4C22.text	
ltx/en_us_goadedes/me.m04.d23:meMA.Ode4C23.incipit	…
ltx/en_us_goadedes/me.m04.d23:meMA.Ode4C23.melody	@ltx/en_us_goadedes/he.h.m2:heHE.ElilythasEkParthenou.name
ltx/en_us_goadedes/me.m04.d23:meMA.Ode4C23.mode	@ltx/en_us_goadedes/miscellanea:misc.Mode2
ltx/en_us_goadedes/me.m04.d23:meMA.Ode4C23.ode	@ltx/en_us_goadedes/miscellanea:misc.Ode4
ltx/en_us_goadedes/me.m04.d23:meMA.Ode4C23.text	
ltx/en_us_goadedes/me.m04.d23:meMA.Ode4C2H.greekmelody	@ltx/en_us_goadedes/he.h.m2:heHE.ElilythasEkParthenou.greekname
ltx/en_us_goadedes/me.m04.d23:meMA.Ode4C2H.incipit	@ltx/en_us_goadedes/he.h.m2:heHE.ElilythasEkParthenou.incipit
ltx/en_us_goadedes/me.m04.d23:meMA.Ode4C2H.melody	@ltx/en_us_goadedes/he.h.m2:heHE.ElilythasEkParthenou.melody
ltx/en_us_goadedes/me.m04.d23:meMA.Ode4C2H.mode	@ltx/en_us_goadedes/miscellanea:misc.Mode2
ltx/en_us_goadedes/me.m04.d23:meMA.Ode4C2H.ode	@ltx/en_us_goadedes/miscellanea:misc.Ode4
ltx/en_us_goadedes/me.m04.d23:meMA.Ode4C2H.text	@ltx/en_us_goadedes/he.h.m2:heHE.ElilythasEkParthenou.text
ltx/en_us_goadedes/me.m04.d23:meMA.Ode4C2T.incipit	…
ltx/en_us_goadedes/me.m04.d23:meMA.Ode4C2T.melody	@ltx/en_us_goadedes/he.h.m2:heHE.ElilythasEkParthenou.name
ltx/en_us_goadedes/me.m04.d23:meMA.Ode4C2T.mode	@ltx/en_us_goadedes/miscellanea:misc.Mode2
ltx/en_us_goadedes/me.m04.d23:meMA.Ode4C2T.ode	@ltx/en_us_goadedes/miscellanea:misc.Ode4
ltx/en_us_goadedes/me.m04.d23:meMA.Ode4C2T.text	
ltx/en_us_goadedes/me.m04.d23:meMA.Ode5C11.greekmelody	@ltx/en_us_goadedes/he.h.m1:heHE.OrthrisomenOrthrouVatheos.greekname
ltx/en_us_goadedes/me.m04.d23:meMA.Ode5C11.incipit	…
ltx/en_us_goadedes/me.m04.d23:meMA.Ode5C11.melody	@ltx/en_us_goadedes/he.h.m1:heHE.OrthrisomenOrthrouVatheos.name
ltx/en_us_goadedes/me.m04.d23:meMA.Ode5C11.mode	@ltx/en_us_goadedes/miscellanea:misc.Mode1
ltx/en_us_goadedes/me.m04.d23:meMA.Ode5C11.ode	@ltx/en_us_goadedes/miscellanea:misc.Ode5
ltx/en_us_goadedes/me.m04.d23:meMA.Ode5C11.text	
ltx/en_us_goadedes/me.m04.d23:meMA.Ode5C12.incipit	…
ltx/en_us_goadedes/me.m04.d23:meMA.Ode5C12.melody	@ltx/en_us_goadedes/he.h.m1:heHE.OrthrisomenOrthrouVatheos.name
ltx/en_us_goadedes/me.m04.d23:meMA.Ode5C12.mode	@ltx/en_us_goadedes/miscellanea:misc.Mode1
ltx/en_us_goadedes/me.m04.d23:meMA.Ode5C12.ode	@ltx/en_us_goadedes/miscellanea:misc.Ode5
ltx/en_us_goadedes/me.m04.d23:meMA.Ode5C12.text	
ltx/en_us_goadedes/me.m04.d23:meMA.Ode5C13.incipit	…
ltx/en_us_goadedes/me.m04.d23:meMA.Ode5C13.melody	@ltx/en_us_goadedes/he.h.m1:heHE.OrthrisomenOrthrouVatheos.name
ltx/en_us_goadedes/me.m04.d23:meMA.Ode5C13.mode	@ltx/en_us_goadedes/miscellanea:misc.Mode1
ltx/en_us_goadedes/me.m04.d23:meMA.Ode5C13.ode	@ltx/en_us_goadedes/miscellanea:misc.Ode5
ltx/en_us_goadedes/me.m04.d23:meMA.Ode5C13.text	
ltx/en_us_goadedes/me.m04.d23:meMA.Ode5C1T.incipit	…
ltx/en_us_goadedes/me.m04.d23:meMA.Ode5C1T.melody	@ltx/en_us_goadedes/he.h.m1:heHE.OrthrisomenOrthrouVatheos.name
ltx/en_us_goadedes/me.m04.d23:meMA.Ode5C1T.mode	@ltx/en_us_goadedes/miscellanea:misc.Mode1
ltx/en_us_goadedes/me.m04.d23:meMA.Ode5C1T.ode	@ltx/en_us_goadedes/miscellanea:misc.Ode5
ltx/en_us_goadedes/me.m04.d23:meMA.Ode5C1T.text	
ltx/en_us_goadedes/me.m04.d23:meMA.Ode5C21.greekmelody	@ltx/en_us_goadedes/he.h.m2:heHE.OFotismos.greekname
ltx/en_us_goadedes/me.m04.d23:meMA.Ode5C21.incipit	…
ltx/en_us_goadedes/me.m04.d23:meMA.Ode5C21.melody	@ltx/en_us_goadedes/he.h.m2:heHE.OFotismos.name
ltx/en_us_goadedes/me.m04.d23:meMA.Ode5C21.mode	@ltx/en_us_goadedes/miscellanea:misc.Mode2
ltx/en_us_goadedes/me.m04.d23:meMA.Ode5C21.ode	@ltx/en_us_goadedes/miscellanea:misc.Ode5
ltx/en_us_goadedes/me.m04.d23:meMA.Ode5C21.text	
ltx/en_us_goadedes/me.m04.d23:meMA.Ode5C22.incipit	…
ltx/en_us_goadedes/me.m04.d23:meMA.Ode5C22.melody	@ltx/en_us_goadedes/he.h.m2:heHE.OFotismos.name
ltx/en_us_goadedes/me.m04.d23:meMA.Ode5C22.mode	@ltx/en_us_goadedes/miscellanea:misc.Mode2
ltx/en_us_goadedes/me.m04.d23:meMA.Ode5C22.ode	@ltx/en_us_goadedes/miscellanea:misc.Ode5
ltx/en_us_goadedes/me.m04.d23:meMA.Ode5C22.text	
ltx/en_us_goadedes/me.m04.d23:meMA.Ode5C23.incipit	…
ltx/en_us_goadedes/me.m04.d23:meMA.Ode5C23.melody	@ltx/en_us_goadedes/he.h.m2:heHE.OFotismos.name
ltx/en_us_goadedes/me.m04.d23:meMA.Ode5C23.mode	@ltx/en_us_goadedes/miscellanea:misc.Mode2
ltx/en_us_goadedes/me.m04.d23:meMA.Ode5C23.ode	@ltx/en_us_goadedes/miscellanea:misc.Ode5
ltx/en_us_goadedes/me.m04.d23:meMA.Ode5C23.text	
ltx/en_us_goadedes/me.m04.d23:meMA.Ode5C2H.greekmelody	@ltx/en_us_goadedes/he.h.m2:heHE.OFotismos.greekname
ltx/en_us_goadedes/me.m04.d23:meMA.Ode5C2H.incipit	@ltx/en_us_goadedes/he.h.m2:heHE.OFotismos.incipit
ltx/en_us_goadedes/me.m04.d23:meMA.Ode5C2H.melody	@ltx/en_us_goadedes/he.h.m2:heHE.OFotismos.melody
ltx/en_us_goadedes/me.m04.d23:meMA.Ode5C2H.mode	@ltx/en_us_goadedes/miscellanea:misc.Mode2
ltx/en_us_goadedes/me.m04.d23:meMA.Ode5C2H.ode	@ltx/en_us_goadedes/miscellanea:misc.Ode5
ltx/en_us_goadedes/me.m04.d23:meMA.Ode5C2H.text	@ltx/en_us_goadedes/he.h.m2:heHE.OFotismos.text
ltx/en_us_goadedes/me.m04.d23:meMA.Ode5C2T.incipit	…
ltx/en_us_goadedes/me.m04.d23:meMA.Ode5C2T.melody	@ltx/en_us_goadedes/he.h.m2:heHE.OFotismos.name
ltx/en_us_goadedes/me.m04.d23:meMA.Ode5C2T.mode	@ltx/en_us_goadedes/miscellanea:misc.Mode2
ltx/en_us_goadedes/me.m04.d23:meMA.Ode5C2T.ode	@ltx/en_us_goadedes/miscellanea:misc.Ode5
ltx/en_us_goadedes/me.m04.d23:meMA.Ode5C2T.text	
ltx/en_us_goadedes/me.m04.d23:meMA.Ode6C11.greekmelody	@ltx/en_us_goadedes/he.h.m1:heHE.KatilthesEnToisKatotatois.greekname
ltx/en_us_goadedes/me.m04.d23:meMA.Ode6C11.incipit	…
ltx/en_us_goadedes/me.m04.d23:meMA.Ode6C11.melody	@ltx/en_us_goadedes/he.h.m1:heHE.KatilthesEnToisKatotatois.name
ltx/en_us_goadedes/me.m04.d23:meMA.Ode6C11.mode	@ltx/en_us_goadedes/miscellanea:misc.Mode1
ltx/en_us_goadedes/me.m04.d23:meMA.Ode6C11.ode	@ltx/en_us_goadedes/miscellanea:misc.Ode6
ltx/en_us_goadedes/me.m04.d23:meMA.Ode6C11.text	
ltx/en_us_goadedes/me.m04.d23:meMA.Ode6C12.incipit	…
ltx/en_us_goadedes/me.m04.d23:meMA.Ode6C12.melody	@ltx/en_us_goadedes/he.h.m1:heHE.KatilthesEnToisKatotatois.name
ltx/en_us_goadedes/me.m04.d23:meMA.Ode6C12.mode	@ltx/en_us_goadedes/miscellanea:misc.Mode1
ltx/en_us_goadedes/me.m04.d23:meMA.Ode6C12.ode	@ltx/en_us_goadedes/miscellanea:misc.Ode6
ltx/en_us_goadedes/me.m04.d23:meMA.Ode6C12.text	
ltx/en_us_goadedes/me.m04.d23:meMA.Ode6C13.incipit	…
ltx/en_us_goadedes/me.m04.d23:meMA.Ode6C13.melody	@ltx/en_us_goadedes/he.h.m1:heHE.KatilthesEnToisKatotatois.name
ltx/en_us_goadedes/me.m04.d23:meMA.Ode6C13.mode	@ltx/en_us_goadedes/miscellanea:misc.Mode1
ltx/en_us_goadedes/me.m04.d23:meMA.Ode6C13.ode	@ltx/en_us_goadedes/miscellanea:misc.Ode6
ltx/en_us_goadedes/me.m04.d23:meMA.Ode6C13.text	
ltx/en_us_goadedes/me.m04.d23:meMA.Ode6C1T.incipit	…
ltx/en_us_goadedes/me.m04.d23:meMA.Ode6C1T.melody	@ltx/en_us_goadedes/he.h.m1:heHE.KatilthesEnToisKatotatois.name
ltx/en_us_goadedes/me.m04.d23:meMA.Ode6C1T.mode	@ltx/en_us_goadedes/miscellanea:misc.Mode1
ltx/en_us_goadedes/me.m04.d23:meMA.Ode6C1T.ode	@ltx/en_us_goadedes/miscellanea:misc.Ode6
ltx/en_us_goadedes/me.m04.d23:meMA.Ode6C1T.text	
ltx/en_us_goadedes/me.m04.d23:meMA.Ode6C21.greekmelody	@ltx/en_us_goadedes/he.h.m2:heHE.EnAvyssoPtaismaton.greekname
ltx/en_us_goadedes/me.m04.d23:meMA.Ode6C21.incipit	…
ltx/en_us_goadedes/me.m04.d23:meMA.Ode6C21.melody	@ltx/en_us_goadedes/he.h.m2:heHE.EnAvyssoPtaismaton.name
ltx/en_us_goadedes/me.m04.d23:meMA.Ode6C21.mode	@ltx/en_us_goadedes/miscellanea:misc.Mode2
ltx/en_us_goadedes/me.m04.d23:meMA.Ode6C21.ode	@ltx/en_us_goadedes/miscellanea:misc.Ode6
ltx/en_us_goadedes/me.m04.d23:meMA.Ode6C21.text	
ltx/en_us_goadedes/me.m04.d23:meMA.Ode6C22.incipit	…
ltx/en_us_goadedes/me.m04.d23:meMA.Ode6C22.melody	@ltx/en_us_goadedes/he.h.m2:heHE.EnAvyssoPtaismaton.name
ltx/en_us_goadedes/me.m04.d23:meMA.Ode6C22.mode	@ltx/en_us_goadedes/miscellanea:misc.Mode2
ltx/en_us_goadedes/me.m04.d23:meMA.Ode6C22.ode	@ltx/en_us_goadedes/miscellanea:misc.Ode6
ltx/en_us_goadedes/me.m04.d23:meMA.Ode6C22.text	
ltx/en_us_goadedes/me.m04.d23:meMA.Ode6C23.incipit	…
ltx/en_us_goadedes/me.m04.d23:meMA.Ode6C23.melody	@ltx/en_us_goadedes/he.h.m2:heHE.EnAvyssoPtaismaton.name
ltx/en_us_goadedes/me.m04.d23:meMA.Ode6C23.mode	@ltx/en_us_goadedes/miscellanea:misc.Mode2
ltx/en_us_goadedes/me.m04.d23:meMA.Ode6C23.ode	@ltx/en_us_goadedes/miscellanea:misc.Ode6
ltx/en_us_goadedes/me.m04.d23:meMA.Ode6C23.text	
ltx/en_us_goadedes/me.m04.d23:meMA.Ode6C2H.greekmelody	@ltx/en_us_goadedes/he.h.m2:heHE.EnAvyssoPtaismaton.greekname
ltx/en_us_goadedes/me.m04.d23:meMA.Ode6C2H.incipit	@ltx/en_us_goadedes/he.h.m2:heHE.EnAvyssoPtaismaton.incipit
ltx/en_us_goadedes/me.m04.d23:meMA.Ode6C2H.melody	@ltx/en_us_goadedes/he.h.m2:heHE.EnAvyssoPtaismaton.melody
ltx/en_us_goadedes/me.m04.d23:meMA.Ode6C2H.mode	@ltx/en_us_goadedes/miscellanea:misc.Mode2
ltx/en_us_goadedes/me.m04.d23:meMA.Ode6C2H.ode	@ltx/en_us_goadedes/miscellanea:misc.Ode6
ltx/en_us_goadedes/me.m04.d23:meMA.Ode6C2H.text	@ltx/en_us_goadedes/he.h.m2:heHE.EnAvyssoPtaismaton.text
ltx/en_us_goadedes/me.m04.d23:meMA.Ode6C2T.incipit	…
ltx/en_us_goadedes/me.m04.d23:meMA.Ode6C2T.melody	@ltx/en_us_goadedes/he.h.m2:heHE.EnAvyssoPtaismaton.name
ltx/en_us_goadedes/me.m04.d23:meMA.Ode6C2T.mode	@ltx/en_us_goadedes/miscellanea:misc.Mode2
ltx/en_us_goadedes/me.m04.d23:meMA.Ode6C2T.ode	@ltx/en_us_goadedes/miscellanea:misc.Ode6
ltx/en_us_goadedes/me.m04.d23:meMA.Ode6C2T.text	
ltx/en_us_goadedes/me.m04.d23:meMA.Ode7C11.greekmelody	@ltx/en_us_goadedes/he.h.m1:heHE.OPaidasEkKaminou.greekname
ltx/en_us_goadedes/me.m04.d23:meMA.Ode7C11.incipit	…
ltx/en_us_goadedes/me.m04.d23:meMA.Ode7C11.melody	@ltx/en_us_goadedes/he.h.m1:heHE.OPaidasEkKaminou.name
ltx/en_us_goadedes/me.m04.d23:meMA.Ode7C11.mode	@ltx/en_us_goadedes/miscellanea:misc.Mode1
ltx/en_us_goadedes/me.m04.d23:meMA.Ode7C11.ode	@ltx/en_us_goadedes/miscellanea:misc.Ode7
ltx/en_us_goadedes/me.m04.d23:meMA.Ode7C11.text	
ltx/en_us_goadedes/me.m04.d23:meMA.Ode7C12.incipit	…
ltx/en_us_goadedes/me.m04.d23:meMA.Ode7C12.melody	@ltx/en_us_goadedes/he.h.m1:heHE.OPaidasEkKaminou.name
ltx/en_us_goadedes/me.m04.d23:meMA.Ode7C12.mode	@ltx/en_us_goadedes/miscellanea:misc.Mode1
ltx/en_us_goadedes/me.m04.d23:meMA.Ode7C12.ode	@ltx/en_us_goadedes/miscellanea:misc.Ode7
ltx/en_us_goadedes/me.m04.d23:meMA.Ode7C12.text	
ltx/en_us_goadedes/me.m04.d23:meMA.Ode7C13.incipit	…
ltx/en_us_goadedes/me.m04.d23:meMA.Ode7C13.melody	@ltx/en_us_goadedes/he.h.m1:heHE.OPaidasEkKaminou.name
ltx/en_us_goadedes/me.m04.d23:meMA.Ode7C13.mode	@ltx/en_us_goadedes/miscellanea:misc.Mode1
ltx/en_us_goadedes/me.m04.d23:meMA.Ode7C13.ode	@ltx/en_us_goadedes/miscellanea:misc.Ode7
ltx/en_us_goadedes/me.m04.d23:meMA.Ode7C13.text	
ltx/en_us_goadedes/me.m04.d23:meMA.Ode7C1T.incipit	…
ltx/en_us_goadedes/me.m04.d23:meMA.Ode7C1T.melody	@ltx/en_us_goadedes/he.h.m1:heHE.OPaidasEkKaminou.name
ltx/en_us_goadedes/me.m04.d23:meMA.Ode7C1T.mode	@ltx/en_us_goadedes/miscellanea:misc.Mode1
ltx/en_us_goadedes/me.m04.d23:meMA.Ode7C1T.ode	@ltx/en_us_goadedes/miscellanea:misc.Ode7
ltx/en_us_goadedes/me.m04.d23:meMA.Ode7C1T.text	
ltx/en_us_goadedes/me.m04.d23:meMA.Ode7C21.greekmelody	@ltx/en_us_goadedes/he.h.m2:heHE.AntitheonProstagma.greekname
ltx/en_us_goadedes/me.m04.d23:meMA.Ode7C21.incipit	…
ltx/en_us_goadedes/me.m04.d23:meMA.Ode7C21.melody	@ltx/en_us_goadedes/he.h.m2:heHE.AntitheonProstagma.name
ltx/en_us_goadedes/me.m04.d23:meMA.Ode7C21.mode	@ltx/en_us_goadedes/miscellanea:misc.Mode2
ltx/en_us_goadedes/me.m04.d23:meMA.Ode7C21.ode	@ltx/en_us_goadedes/miscellanea:misc.Ode7
ltx/en_us_goadedes/me.m04.d23:meMA.Ode7C21.text	
ltx/en_us_goadedes/me.m04.d23:meMA.Ode7C22.incipit	…
ltx/en_us_goadedes/me.m04.d23:meMA.Ode7C22.melody	@ltx/en_us_goadedes/he.h.m2:heHE.AntitheonProstagma.name
ltx/en_us_goadedes/me.m04.d23:meMA.Ode7C22.mode	@ltx/en_us_goadedes/miscellanea:misc.Mode2
ltx/en_us_goadedes/me.m04.d23:meMA.Ode7C22.ode	@ltx/en_us_goadedes/miscellanea:misc.Ode7
ltx/en_us_goadedes/me.m04.d23:meMA.Ode7C22.text	
ltx/en_us_goadedes/me.m04.d23:meMA.Ode7C23.incipit	…
ltx/en_us_goadedes/me.m04.d23:meMA.Ode7C23.melody	@ltx/en_us_goadedes/he.h.m2:heHE.AntitheonProstagma.name
ltx/en_us_goadedes/me.m04.d23:meMA.Ode7C23.mode	@ltx/en_us_goadedes/miscellanea:misc.Mode2
ltx/en_us_goadedes/me.m04.d23:meMA.Ode7C23.ode	@ltx/en_us_goadedes/miscellanea:misc.Ode7
ltx/en_us_goadedes/me.m04.d23:meMA.Ode7C23.text	
ltx/en_us_goadedes/me.m04.d23:meMA.Ode7C2H.greekmelody	@ltx/en_us_goadedes/he.h.m2:heHE.AntitheonProstagma.greekname
ltx/en_us_goadedes/me.m04.d23:meMA.Ode7C2H.incipit	@ltx/en_us_goadedes/he.h.m2:heHE.AntitheonProstagma.incipit
ltx/en_us_goadedes/me.m04.d23:meMA.Ode7C2H.melody	@ltx/en_us_goadedes/he.h.m2:heHE.AntitheonProstagma.melody
ltx/en_us_goadedes/me.m04.d23:meMA.Ode7C2H.mode	@ltx/en_us_goadedes/miscellanea:misc.Mode2
ltx/en_us_goadedes/me.m04.d23:meMA.Ode7C2H.ode	@ltx/en_us_goadedes/miscellanea:misc.Ode7
ltx/en_us_goadedes/me.m04.d23:meMA.Ode7C2H.text	@ltx/en_us_goadedes/he.h.m2:heHE.AntitheonProstagma.text
ltx/en_us_goadedes/me.m04.d23:meMA.Ode7C2T.incipit	…
ltx/en_us_goadedes/me.m04.d23:meMA.Ode7C2T.melody	@ltx/en_us_goadedes/he.h.m2:heHE.AntitheonProstagma.name
ltx/en_us_goadedes/me.m04.d23:meMA.Ode7C2T.mode	@ltx/en_us_goadedes/miscellanea:misc.Mode2
ltx/en_us_goadedes/me.m04.d23:meMA.Ode7C2T.ode	@ltx/en_us_goadedes/miscellanea:misc.Ode7
ltx/en_us_goadedes/me.m04.d23:meMA.Ode7C2T.text	
ltx/en_us_goadedes/me.m04.d23:meMA.Ode8C11.greekmelody	@ltx/en_us_goadedes/he.h.m1:heHE.AftiIKliti.greekname
ltx/en_us_goadedes/me.m04.d23:meMA.Ode8C11.incipit	…
ltx/en_us_goadedes/me.m04.d23:meMA.Ode8C11.melody	@ltx/en_us_goadedes/he.h.m1:heHE.AftiIKliti.name
ltx/en_us_goadedes/me.m04.d23:meMA.Ode8C11.mode	@ltx/en_us_goadedes/miscellanea:misc.Mode1
ltx/en_us_goadedes/me.m04.d23:meMA.Ode8C11.ode	@ltx/en_us_goadedes/miscellanea:misc.Ode8
ltx/en_us_goadedes/me.m04.d23:meMA.Ode8C11.text	
ltx/en_us_goadedes/me.m04.d23:meMA.Ode8C12.incipit	…
ltx/en_us_goadedes/me.m04.d23:meMA.Ode8C12.melody	@ltx/en_us_goadedes/he.h.m1:heHE.AftiIKliti.name
ltx/en_us_goadedes/me.m04.d23:meMA.Ode8C12.mode	@ltx/en_us_goadedes/miscellanea:misc.Mode1
ltx/en_us_goadedes/me.m04.d23:meMA.Ode8C12.ode	@ltx/en_us_goadedes/miscellanea:misc.Ode8
ltx/en_us_goadedes/me.m04.d23:meMA.Ode8C12.text	
ltx/en_us_goadedes/me.m04.d23:meMA.Ode8C13.incipit	…
ltx/en_us_goadedes/me.m04.d23:meMA.Ode8C13.melody	@ltx/en_us_goadedes/he.h.m1:heHE.AftiIKliti.name
ltx/en_us_goadedes/me.m04.d23:meMA.Ode8C13.mode	@ltx/en_us_goadedes/miscellanea:misc.Mode1
ltx/en_us_goadedes/me.m04.d23:meMA.Ode8C13.ode	@ltx/en_us_goadedes/miscellanea:misc.Ode8
ltx/en_us_goadedes/me.m04.d23:meMA.Ode8C13.text	
ltx/en_us_goadedes/me.m04.d23:meMA.Ode8C1T.incipit	…
ltx/en_us_goadedes/me.m04.d23:meMA.Ode8C1T.melody	@ltx/en_us_goadedes/he.h.m1:heHE.AftiIKliti.name
ltx/en_us_goadedes/me.m04.d23:meMA.Ode8C1T.mode	@ltx/en_us_goadedes/miscellanea:misc.Mode1
ltx/en_us_goadedes/me.m04.d23:meMA.Ode8C1T.ode	@ltx/en_us_goadedes/miscellanea:misc.Ode8
ltx/en_us_goadedes/me.m04.d23:meMA.Ode8C1T.text	
ltx/en_us_goadedes/me.m04.d23:meMA.Ode8C21.greekmelody	@ltx/en_us_goadedes/he.h.m2:heHE.KaminosPote.greekname
ltx/en_us_goadedes/me.m04.d23:meMA.Ode8C21.incipit	…
ltx/en_us_goadedes/me.m04.d23:meMA.Ode8C21.melody	@ltx/en_us_goadedes/he.h.m2:heHE.KaminosPote.name
ltx/en_us_goadedes/me.m04.d23:meMA.Ode8C21.mode	@ltx/en_us_goadedes/miscellanea:misc.Mode2
ltx/en_us_goadedes/me.m04.d23:meMA.Ode8C21.ode	@ltx/en_us_goadedes/miscellanea:misc.Ode8
ltx/en_us_goadedes/me.m04.d23:meMA.Ode8C21.text	
ltx/en_us_goadedes/me.m04.d23:meMA.Ode8C22.incipit	…
ltx/en_us_goadedes/me.m04.d23:meMA.Ode8C22.melody	@ltx/en_us_goadedes/he.h.m2:heHE.KaminosPote.name
ltx/en_us_goadedes/me.m04.d23:meMA.Ode8C22.mode	@ltx/en_us_goadedes/miscellanea:misc.Mode2
ltx/en_us_goadedes/me.m04.d23:meMA.Ode8C22.ode	@ltx/en_us_goadedes/miscellanea:misc.Ode8
ltx/en_us_goadedes/me.m04.d23:meMA.Ode8C22.text	
ltx/en_us_goadedes/me.m04.d23:meMA.Ode8C23.incipit	…
ltx/en_us_goadedes/me.m04.d23:meMA.Ode8C23.melody	@ltx/en_us_goadedes/he.h.m2:heHE.KaminosPote.name
ltx/en_us_goadedes/me.m04.d23:meMA.Ode8C23.mode	@ltx/en_us_goadedes/miscellanea:misc.Mode2
ltx/en_us_goadedes/me.m04.d23:meMA.Ode8C23.ode	@ltx/en_us_goadedes/miscellanea:misc.Ode8
ltx/en_us_goadedes/me.m04.d23:meMA.Ode8C23.text	
ltx/en_us_goadedes/me.m04.d23:meMA.Ode8C2H.greekmelody	@ltx/en_us_goadedes/he.h.m2:heHE.KaminosPote.greekname
ltx/en_us_goadedes/me.m04.d23:meMA.Ode8C2H.incipit	@ltx/en_us_goadedes/he.h.m2:heHE.KaminosPote.incipit
ltx/en_us_goadedes/me.m04.d23:meMA.Ode8C2H.melody	@ltx/en_us_goadedes/he.h.m2:heHE.KaminosPote.melody
ltx/en_us_goadedes/me.m04.d23:meMA.Ode8C2H.mode	@ltx/en_us_goadedes/miscellanea:misc.Mode2
ltx/en_us_goadedes/me.m04.d23:meMA.Ode8C2H.ode	@ltx/en_us_goadedes/miscellanea:misc.Ode8
ltx/en_us_goadedes/me.m04.d23:meMA.Ode8C2H.text	@ltx/en_us_goadedes/he.h.m2:heHE.KaminosPote.text
ltx/en_us_goadedes/me.m04.d23:meMA.Ode8C2T.incipit	…
ltx/en_us_goadedes/me.m04.d23:meMA.Ode8C2T.melody	@ltx/en_us_goadedes/he.h.m2:heHE.KaminosPote.name
ltx/en_us_goadedes/me.m04.d23:meMA.Ode8C2T.mode	@ltx/en_us_goadedes/miscellanea:misc.Mode2
ltx/en_us_goadedes/me.m04.d23:meMA.Ode8C2T.ode	@ltx/en_us_goadedes/miscellanea:misc.Ode8
ltx/en_us_goadedes/me.m04.d23:meMA.Ode8C2T.text	
ltx/en_us_goadedes/me.m04.d23:meMA.Ode9C11.greekmelody	@ltx/en_us_goadedes/he.h.m1:heHE.FotizouFotizou.greekname
ltx/en_us_goadedes/me.m04.d23:meMA.Ode9C11.incipit	…
ltx/en_us_goadedes/me.m04.d23:meMA.Ode9C11.melody	@ltx/en_us_goadedes/he.h.m1:heHE.FotizouFotizou.name
ltx/en_us_goadedes/me.m04.d23:meMA.Ode9C11.mode	@ltx/en_us_goadedes/miscellanea:misc.Mode1
ltx/en_us_goadedes/me.m04.d23:meMA.Ode9C11.ode	@ltx/en_us_goadedes/miscellanea:misc.Ode9
ltx/en_us_goadedes/me.m04.d23:meMA.Ode9C11.text	
ltx/en_us_goadedes/me.m04.d23:meMA.Ode9C12.incipit	…
ltx/en_us_goadedes/me.m04.d23:meMA.Ode9C12.melody	@ltx/en_us_goadedes/he.h.m1:heHE.FotizouFotizou.name
ltx/en_us_goadedes/me.m04.d23:meMA.Ode9C12.mode	@ltx/en_us_goadedes/miscellanea:misc.Mode1
ltx/en_us_goadedes/me.m04.d23:meMA.Ode9C12.ode	@ltx/en_us_goadedes/miscellanea:misc.Ode9
ltx/en_us_goadedes/me.m04.d23:meMA.Ode9C12.text	
ltx/en_us_goadedes/me.m04.d23:meMA.Ode9C13.incipit	…
ltx/en_us_goadedes/me.m04.d23:meMA.Ode9C13.melody	@ltx/en_us_goadedes/he.h.m1:heHE.FotizouFotizou.name
ltx/en_us_goadedes/me.m04.d23:meMA.Ode9C13.mode	@ltx/en_us_goadedes/miscellanea:misc.Mode1
ltx/en_us_goadedes/me.m04.d23:meMA.Ode9C13.ode	@ltx/en_us_goadedes/miscellanea:misc.Ode9
ltx/en_us_goadedes/me.m04.d23:meMA.Ode9C13.text	
ltx/en_us_goadedes/me.m04.d23:meMA.Ode9C14.incipit	…
ltx/en_us_goadedes/me.m04.d23:meMA.Ode9C14.melody	@ltx/en_us_goadedes/he.h.m1:heHE.FotizouFotizou.name
ltx/en_us_goadedes/me.m04.d23:meMA.Ode9C14.mode	@ltx/en_us_goadedes/miscellanea:misc.Mode1
ltx/en_us_goadedes/me.m04.d23:meMA.Ode9C14.ode	@ltx/en_us_goadedes/miscellanea:misc.Ode9
ltx/en_us_goadedes/me.m04.d23:meMA.Ode9C14.text	
ltx/en_us_goadedes/me.m04.d23:meMA.Ode9C1M01.incipit	…
ltx/en_us_goadedes/me.m04.d23:meMA.Ode9C1M01.text	
ltx/en_us_goadedes/me.m04.d23:meMA.Ode9C1M02.incipit	…
ltx/en_us_goadedes/me.m04.d23:meMA.Ode9C1M02.text	
ltx/en_us_goadedes/me.m04.d23:meMA.Ode9C1MTh.incipit	@ltx/en_us_goadedes/pe.d071:peMA.Ode9C1MTh.incipit
ltx/en_us_goadedes/me.m04.d23:meMA.Ode9C1MTh.text	@ltx/en_us_goadedes/pe.d071:peMA.Ode9C1MTh.text
ltx/en_us_goadedes/me.m04.d23:meMA.Ode9C1MTr.incipit	@ltx/en_us_goadedes/pe.d071:peMA.Ode9C1MTr.incipit
ltx/en_us_goadedes/me.m04.d23:meMA.Ode9C1MTr.text	@ltx/en_us_goadedes/pe.d071:peMA.Ode9C1MTr.text
ltx/en_us_goadedes/me.m04.d23:meMA.Ode9C1T.incipit	…
ltx/en_us_goadedes/me.m04.d23:meMA.Ode9C1T.melody	@ltx/en_us_goadedes/he.h.m1:heHE.FotizouFotizou.name
ltx/en_us_goadedes/me.m04.d23:meMA.Ode9C1T.mode	@ltx/en_us_goadedes/miscellanea:misc.Mode1
ltx/en_us_goadedes/me.m04.d23:meMA.Ode9C1T.ode	@ltx/en_us_goadedes/miscellanea:misc.Ode9
ltx/en_us_goadedes/me.m04.d23:meMA.Ode9C1T.text	
ltx/en_us_goadedes/me.m04.d23:meMA.Ode9C21.greekmelody	@ltx/en_us_goadedes/he.h.m2:heHE.AnarchouGennitoros.greekname
ltx/en_us_goadedes/me.m04.d23:meMA.Ode9C21.incipit	…
ltx/en_us_goadedes/me.m04.d23:meMA.Ode9C21.melody	@ltx/en_us_goadedes/he.h.m2:heHE.AnarchouGennitoros.name
ltx/en_us_goadedes/me.m04.d23:meMA.Ode9C21.mode	@ltx/en_us_goadedes/miscellanea:misc.Mode2
ltx/en_us_goadedes/me.m04.d23:meMA.Ode9C21.ode	@ltx/en_us_goadedes/miscellanea:misc.Ode9
ltx/en_us_goadedes/me.m04.d23:meMA.Ode9C21.text	
ltx/en_us_goadedes/me.m04.d23:meMA.Ode9C22.incipit	…
ltx/en_us_goadedes/me.m04.d23:meMA.Ode9C22.melody	@ltx/en_us_goadedes/he.h.m2:heHE.AnarchouGennitoros.name
ltx/en_us_goadedes/me.m04.d23:meMA.Ode9C22.mode	@ltx/en_us_goadedes/miscellanea:misc.Mode2
ltx/en_us_goadedes/me.m04.d23:meMA.Ode9C22.ode	@ltx/en_us_goadedes/miscellanea:misc.Ode9
ltx/en_us_goadedes/me.m04.d23:meMA.Ode9C22.text	
ltx/en_us_goadedes/me.m04.d23:meMA.Ode9C23.incipit	…
ltx/en_us_goadedes/me.m04.d23:meMA.Ode9C23.melody	@ltx/en_us_goadedes/he.h.m2:heHE.AnarchouGennitoros.name
ltx/en_us_goadedes/me.m04.d23:meMA.Ode9C23.mode	@ltx/en_us_goadedes/miscellanea:misc.Mode2
ltx/en_us_goadedes/me.m04.d23:meMA.Ode9C23.ode	@ltx/en_us_goadedes/miscellanea:misc.Ode9
ltx/en_us_goadedes/me.m04.d23:meMA.Ode9C23.text	
ltx/en_us_goadedes/me.m04.d23:meMA.Ode9C2H.greekmelody	@ltx/en_us_goadedes/he.h.m2:heHE.AnarchouGennitoros.greekname
ltx/en_us_goadedes/me.m04.d23:meMA.Ode9C2H.incipit	@ltx/en_us_goadedes/he.h.m2:heHE.AnarchouGennitoros.incipit
ltx/en_us_goadedes/me.m04.d23:meMA.Ode9C2H.melody	@ltx/en_us_goadedes/he.h.m2:heHE.AnarchouGennitoros.melody
ltx/en_us_goadedes/me.m04.d23:meMA.Ode9C2H.mode	@ltx/en_us_goadedes/miscellanea:misc.Mode2
ltx/en_us_goadedes/me.m04.d23:meMA.Ode9C2H.ode	@ltx/en_us_goadedes/miscellanea:misc.Ode9
ltx/en_us_goadedes/me.m04.d23:meMA.Ode9C2H.text	@ltx/en_us_goadedes/he.h.m2:heHE.AnarchouGennitoros.text
ltx/en_us_goadedes/me.m04.d23:meMA.Ode9C2T.incipit	…
ltx/en_us_goadedes/me.m04.d23:meMA.Ode9C2T.melody	@ltx/en_us_goadedes/he.h.m2:heHE.AnarchouGennitoros.name
ltx/en_us_goadedes/me.m04.d23:meMA.Ode9C2T.mode	@ltx/en_us_goadedes/miscellanea:misc.Mode2
ltx/en_us_goadedes/me.m04.d23:meMA.Ode9C2T.ode	@ltx/en_us_goadedes/miscellanea:misc.Ode9
ltx/en_us_goadedes/me.m04.d23:meMA.Ode9C2T.text	
ltx/en_us_goadedes/me.m04.d23:meMA.Oikos1.text	
ltx/en_us_goadedes/me.m04.d23:meMA.PostGospelBoth.incipit	@ltx/en_us_goadedes/ho.ho03:hoMA.PostGospelTheotokos.incipit
ltx/en_us_goadedes/me.m04.d23:meMA.PostGospelBoth.melody	
ltx/en_us_goadedes/me.m04.d23:meMA.PostGospelBoth.mode	@ltx/en_us_goadedes/miscellanea:misc.Mode2
ltx/en_us_goadedes/me.m04.d23:meMA.PostGospelBoth.text	@ltx/en_us_goadedes/ho.ho03:hoMA.PostGospelTheotokos.text
ltx/en_us_goadedes/me.m04.d23:meMA.PostGospelGlory.incipit	@ltx/en_us_goadedes/ho.ho03:hoMA.PostGospelMaleMartyr.incipit
ltx/en_us_goadedes/me.m04.d23:meMA.PostGospelGlory.melody	
ltx/en_us_goadedes/me.m04.d23:meMA.PostGospelGlory.mode	@ltx/en_us_goadedes/miscellanea:misc.Mode2
ltx/en_us_goadedes/me.m04.d23:meMA.PostGospelGlory.text	@ltx/en_us_goadedes/ho.ho03:hoMA.PostGospelMaleMartyr.text
ltx/en_us_goadedes/me.m04.d23:meMA.PostGospelIdiomelon.incipit	…
ltx/en_us_goadedes/me.m04.d23:meMA.PostGospelIdiomelon.melody	@ltx/en_us_goadedes/miscellanea:misc.Idiomelon
ltx/en_us_goadedes/me.m04.d23:meMA.PostGospelIdiomelon.mode	@ltx/en_us_goadedes/miscellanea:misc.Mode6
ltx/en_us_goadedes/me.m04.d23:meMA.PostGospelIdiomelon.text	
ltx/en_us_goadedes/me.m04.d23:meSV.AposGlory.incipit	@ltx/en_us_goadedes/me.m04.d23:meVE.Lity5.incipit
ltx/en_us_goadedes/me.m04.d23:meSV.AposGlory.melody	
ltx/en_us_goadedes/me.m04.d23:meSV.AposGlory.mode	@ltx/en_us_goadedes/miscellanea:misc.Mode4
ltx/en_us_goadedes/me.m04.d23:meSV.AposGlory.poet	@ltx/en_us_goadedes/poets:po.Anatoliou
ltx/en_us_goadedes/me.m04.d23:meSV.AposGlory.text	@ltx/en_us_goadedes/me.m04.d23:meVE.Lity5.text
ltx/en_us_goadedes/me.m04.d23:meSV.Aposticha1.incipit	…
ltx/en_us_goadedes/me.m04.d23:meSV.Aposticha1.melody	@ltx/en_us_goadedes/he.a.m2:heAU.OikosTouEfratha.name
ltx/en_us_goadedes/me.m04.d23:meSV.Aposticha1.mode	@ltx/en_us_goadedes/miscellanea:misc.Mode2
ltx/en_us_goadedes/me.m04.d23:meSV.Aposticha1.text	
ltx/en_us_goadedes/me.m04.d23:meSV.Aposticha2.incipit	…
ltx/en_us_goadedes/me.m04.d23:meSV.Aposticha2.melody	@ltx/en_us_goadedes/he.a.m2:heAU.OikosTouEfratha.name
ltx/en_us_goadedes/me.m04.d23:meSV.Aposticha2.mode	@ltx/en_us_goadedes/miscellanea:misc.Mode2
ltx/en_us_goadedes/me.m04.d23:meSV.Aposticha2.text	
ltx/en_us_goadedes/me.m04.d23:meSV.Aposticha3.incipit	…
ltx/en_us_goadedes/me.m04.d23:meSV.Aposticha3.melody	@ltx/en_us_goadedes/he.a.m2:heAU.OikosTouEfratha.name
ltx/en_us_goadedes/me.m04.d23:meSV.Aposticha3.mode	@ltx/en_us_goadedes/miscellanea:misc.Mode2
ltx/en_us_goadedes/me.m04.d23:meSV.Aposticha3.text	
ltx/en_us_goadedes/me.m04.d23:meSV.SticGlory.incipit	@ltx/en_us_goadedes/me.m04.d23:meVE.Lity3.incipit
ltx/en_us_goadedes/me.m04.d23:meSV.SticGlory.melody	
ltx/en_us_goadedes/me.m04.d23:meSV.SticGlory.mode	@ltx/en_us_goadedes/miscellanea:misc.Mode1
ltx/en_us_goadedes/me.m04.d23:meSV.SticGlory.text	@ltx/en_us_goadedes/me.m04.d23:meVE.Lity3.text
ltx/en_us_goadedes/me.m04.d23:meSV.Stichera1.incipit	…
ltx/en_us_goadedes/me.m04.d23:meSV.Stichera1.melody	@ltx/en_us_goadedes/he.a.m1:heAU.TonOuranionTagmaton.name
ltx/en_us_goadedes/me.m04.d23:meSV.Stichera1.mode	@ltx/en_us_goadedes/miscellanea:misc.Mode1
ltx/en_us_goadedes/me.m04.d23:meSV.Stichera1.text	
ltx/en_us_goadedes/me.m04.d23:meSV.Stichera2.incipit	…
ltx/en_us_goadedes/me.m04.d23:meSV.Stichera2.melody	@ltx/en_us_goadedes/he.a.m1:heAU.TonOuranionTagmaton.name
ltx/en_us_goadedes/me.m04.d23:meSV.Stichera2.mode	@ltx/en_us_goadedes/miscellanea:misc.Mode1
ltx/en_us_goadedes/me.m04.d23:meSV.Stichera2.text	
ltx/en_us_goadedes/me.m04.d23:meSV.Stichera3.incipit	…
ltx/en_us_goadedes/me.m04.d23:meSV.Stichera3.melody	@ltx/en_us_goadedes/he.a.m1:heAU.TonOuranionTagmaton.name
ltx/en_us_goadedes/me.m04.d23:meSV.Stichera3.mode	@ltx/en_us_goadedes/miscellanea:misc.Mode1
ltx/en_us_goadedes/me.m04.d23:meSV.Stichera3.text	
ltx/en_us_goadedes/me.m04.d23:meVE.Apolytikion1.incipit	…
ltx/en_us_goadedes/me.m04.d23:meVE.Apolytikion1.melody	
ltx/en_us_goadedes/me.m04.d23:meVE.Apolytikion1.mode	@ltx/en_us_goadedes/miscellanea:misc.Mode4
ltx/en_us_goadedes/me.m04.d23:meVE.Apolytikion1.text	
ltx/en_us_goadedes/me.m04.d23:meVE.AposGlory.incipit	…
ltx/en_us_goadedes/me.m04.d23:meVE.AposGlory.melody	
ltx/en_us_goadedes/me.m04.d23:meVE.AposGlory.mode	@ltx/en_us_goadedes/miscellanea:misc.Mode4
ltx/en_us_goadedes/me.m04.d23:meVE.AposGlory.poet	@ltx/en_us_goadedes/poets:po.Stouditou
ltx/en_us_goadedes/me.m04.d23:meVE.AposGlory.text	
ltx/en_us_goadedes/me.m04.d23:meVE.Aposticha1.greekmelody	@ltx/en_us_goadedes/he.a.m4:heAU.OExYpsistouKlitheis.greekname
ltx/en_us_goadedes/me.m04.d23:meVE.Aposticha1.incipit	…
ltx/en_us_goadedes/me.m04.d23:meVE.Aposticha1.melody	@ltx/en_us_goadedes/he.a.m4:heAU.OExYpsistouKlitheis.name
ltx/en_us_goadedes/me.m04.d23:meVE.Aposticha1.mode	@ltx/en_us_goadedes/miscellanea:misc.Mode4
ltx/en_us_goadedes/me.m04.d23:meVE.Aposticha1.text	
ltx/en_us_goadedes/me.m04.d23:meVE.Aposticha2.incipit	…
ltx/en_us_goadedes/me.m04.d23:meVE.Aposticha2.melody	@ltx/en_us_goadedes/he.a.m4:heAU.OExYpsistouKlitheis.name
ltx/en_us_goadedes/me.m04.d23:meVE.Aposticha2.mode	@ltx/en_us_goadedes/miscellanea:misc.Mode4
ltx/en_us_goadedes/me.m04.d23:meVE.Aposticha2.text	
ltx/en_us_goadedes/me.m04.d23:meVE.Aposticha3.incipit	…
ltx/en_us_goadedes/me.m04.d23:meVE.Aposticha3.melody	@ltx/en_us_goadedes/he.a.m4:heAU.OExYpsistouKlitheis.name
ltx/en_us_goadedes/me.m04.d23:meVE.Aposticha3.mode	@ltx/en_us_goadedes/miscellanea:misc.Mode4
ltx/en_us_goadedes/me.m04.d23:meVE.Aposticha3.text	
ltx/en_us_goadedes/me.m04.d23:meVE.Lity1.incipit	…
ltx/en_us_goadedes/me.m04.d23:meVE.Lity1.melody	
ltx/en_us_goadedes/me.m04.d23:meVE.Lity1.mode	@ltx/en_us_goadedes/miscellanea:misc.Mode1
ltx/en_us_goadedes/me.m04.d23:meVE.Lity1.poet	@ltx/en_us_goadedes/poets:po.Anatoliou
ltx/en_us_goadedes/me.m04.d23:meVE.Lity1.text	
ltx/en_us_goadedes/me.m04.d23:meVE.Lity2.incipit	…
ltx/en_us_goadedes/me.m04.d23:meVE.Lity2.melody	
ltx/en_us_goadedes/me.m04.d23:meVE.Lity2.mode	@ltx/en_us_goadedes/miscellanea:misc.Mode1
ltx/en_us_goadedes/me.m04.d23:meVE.Lity2.text	
ltx/en_us_goadedes/me.m04.d23:meVE.Lity3.incipit	…
ltx/en_us_goadedes/me.m04.d23:meVE.Lity3.melody	
ltx/en_us_goadedes/me.m04.d23:meVE.Lity3.mode	@ltx/en_us_goadedes/miscellanea:misc.Mode1
ltx/en_us_goadedes/me.m04.d23:meVE.Lity3.text	
ltx/en_us_goadedes/me.m04.d23:meVE.Lity4.incipit	…
ltx/en_us_goadedes/me.m04.d23:meVE.Lity4.melody	
ltx/en_us_goadedes/me.m04.d23:meVE.Lity4.mode	@ltx/en_us_goadedes/miscellanea:misc.Mode4
ltx/en_us_goadedes/me.m04.d23:meVE.Lity4.text	
ltx/en_us_goadedes/me.m04.d23:meVE.Lity5.incipit	…
ltx/en_us_goadedes/me.m04.d23:meVE.Lity5.melody	
ltx/en_us_goadedes/me.m04.d23:meVE.Lity5.mode	@ltx/en_us_goadedes/miscellanea:misc.Mode4
ltx/en_us_goadedes/me.m04.d23:meVE.Lity5.poet	@ltx/en_us_goadedes/poets:po.Anatoliou
ltx/en_us_goadedes/me.m04.d23:meVE.Lity5.text	
ltx/en_us_goadedes/me.m04.d23:meVE.Lity6.incipit	…
ltx/en_us_goadedes/me.m04.d23:meVE.Lity6.melody	
ltx/en_us_goadedes/me.m04.d23:meVE.Lity6.mode	@ltx/en_us_goadedes/miscellanea:misc.Mode4
ltx/en_us_goadedes/me.m04.d23:meVE.Lity6.text	
ltx/en_us_goadedes/me.m04.d23:meVE.Lity7.incipit	…
ltx/en_us_goadedes/me.m04.d23:meVE.Lity7.melody	
ltx/en_us_goadedes/me.m04.d23:meVE.Lity7.mode	@ltx/en_us_goadedes/miscellanea:misc.Mode4
ltx/en_us_goadedes/me.m04.d23:meVE.Lity7.text	
ltx/en_us_goadedes/me.m04.d23:meVE.LityGlory.incipit	…
ltx/en_us_goadedes/me.m04.d23:meVE.LityGlory.melody	
ltx/en_us_goadedes/me.m04.d23:meVE.LityGlory.mode	@ltx/en_us_goadedes/miscellanea:misc.Mode2
ltx/en_us_goadedes/me.m04.d23:meVE.LityGlory.poet	@ltx/en_us_goadedes/poets:po.IoannouMonachou
ltx/en_us_goadedes/me.m04.d23:meVE.LityGlory.text	
ltx/en_us_goadedes/me.m04.d23:meVE.MM.Stichera1234as5678.text	@ltx/en_us_goadedes/properties:media.key
ltx/en_us_goadedes/me.m04.d23:meVE.MM.Stichera1234as78910.text	@ltx/en_us_goadedes/properties:media.key
ltx/en_us_goadedes/me.m04.d23:meVE.SticGlory.incipit	…
ltx/en_us_goadedes/me.m04.d23:meVE.SticGlory.melody	
ltx/en_us_goadedes/me.m04.d23:meVE.SticGlory.mode	@ltx/en_us_goadedes/miscellanea:misc.Mode6
ltx/en_us_goadedes/me.m04.d23:meVE.SticGlory.text	
ltx/en_us_goadedes/me.m04.d23:meVE.Stichera01.greekmelody	@ltx/en_us_goadedes/he.a.m4:heAU.OsGennaionEnMartysi.greekname
ltx/en_us_goadedes/me.m04.d23:meVE.Stichera01.incipit	@ltx/en_us_goadedes/he.a.m4:heAU.OsGennaionEnMartysi.incipit
ltx/en_us_goadedes/me.m04.d23:meVE.Stichera01.melody	@ltx/en_us_goadedes/he.a.m4:heAU.OsGennaionEnMartysi.melody
ltx/en_us_goadedes/me.m04.d23:meVE.Stichera01.mode	@ltx/en_us_goadedes/miscellanea:misc.Mode4
ltx/en_us_goadedes/me.m04.d23:meVE.Stichera01.text	@ltx/en_us_goadedes/he.a.m4:heAU.OsGennaionEnMartysi.text
ltx/en_us_goadedes/me.m04.d23:meVE.Stichera02.incipit	…
ltx/en_us_goadedes/me.m04.d23:meVE.Stichera02.melody	@ltx/en_us_goadedes/he.a.m4:heAU.OsGennaionEnMartysi.name
ltx/en_us_goadedes/me.m04.d23:meVE.Stichera02.mode	@ltx/en_us_goadedes/miscellanea:misc.Mode4
ltx/en_us_goadedes/me.m04.d23:meVE.Stichera02.text	
ltx/en_us_goadedes/me.m04.d23:meVE.Stichera03.incipit	…
ltx/en_us_goadedes/me.m04.d23:meVE.Stichera03.melody	@ltx/en_us_goadedes/he.a.m4:heAU.OsGennaionEnMartysi.name
ltx/en_us_goadedes/me.m04.d23:meVE.Stichera03.mode	@ltx/en_us_goadedes/miscellanea:misc.Mode4
ltx/en_us_goadedes/me.m04.d23:meVE.Stichera03.text	
ltx/en_us_goadedes/me.m04.d23:meVE.Stichera04.greekmelody	@ltx/en_us_goadedes/he.a.m4:heAU.OsGennaionEnMartysi.greekname
ltx/en_us_goadedes/me.m04.d23:meVE.Stichera04.incipit	…
ltx/en_us_goadedes/me.m04.d23:meVE.Stichera04.melody	@ltx/en_us_goadedes/he.a.m4:heAU.OsGennaionEnMartysi.name
ltx/en_us_goadedes/me.m04.d23:meVE.Stichera04.mode	@ltx/en_us_goadedes/miscellanea:misc.Mode4
ltx/en_us_goadedes/me.m04.d23:meVE.Stichera04.text	
ltx/en_us_goadedes/me.m04.d23:meVE.Stichera05.incipit	…
ltx/en_us_goadedes/me.m04.d23:meVE.Stichera05.melody	@ltx/en_us_goadedes/he.a.m4:heAU.OsGennaionEnMartysi.name
ltx/en_us_goadedes/me.m04.d23:meVE.Stichera05.mode	@ltx/en_us_goadedes/miscellanea:misc.Mode4
ltx/en_us_goadedes/me.m04.d23:meVE.Stichera05.text	
ltx/en_us_goadedes/me.m04.d23:meVE.Stichera06.incipit	…
ltx/en_us_goadedes/me.m04.d23:meVE.Stichera06.melody	@ltx/en_us_goadedes/he.a.m4:heAU.OsGennaionEnMartysi.name
ltx/en_us_goadedes/me.m04.d23:meVE.Stichera06.mode	@ltx/en_us_goadedes/miscellanea:misc.Mode4
ltx/en_us_goadedes/me.m04.d23:meVE.Stichera06.text	
