ltx/en_us_goadedes/pe.d117:peDA.commemoration.full	
ltx/en_us_goadedes/pe.d117:peDA.commemoration.short	
ltx/en_us_goadedes/pe.d117:peDA.dismissal	@ltx/en_us_goadedes/dismissals:dis00.ascension
ltx/en_us_goadedes/pe.d117:peDA.insert1	
ltx/en_us_goadedes/pe.d117:peDA.insert2	
ltx/en_us_goadedes/pe.d117:peDA.note	
ltx/en_us_goadedes/pe.d117:peHO.commemorations	
ltx/en_us_goadedes/pe.d117:peHO.daytitle	
ltx/en_us_goadedes/pe.d117:peHO.description1	
ltx/en_us_goadedes/pe.d117:peHO.description2	
ltx/en_us_goadedes/pe.d117:peHO.note1	
ltx/en_us_goadedes/pe.d117:peHO.note2	
ltx/en_us_goadedes/pe.d117:peMA.AposGlory.incipit	@ltx/en_us_goadedes/pe.d112:peMA.AposGlory.incipit
ltx/en_us_goadedes/pe.d117:peMA.AposGlory.melody	@ltx/en_us_goadedes/pe.d112:peMA.AposGlory.melody
ltx/en_us_goadedes/pe.d117:peMA.AposGlory.mode	@ltx/en_us_goadedes/pe.d112:peMA.AposGlory.mode
ltx/en_us_goadedes/pe.d117:peMA.AposGlory.text	@ltx/en_us_goadedes/pe.d112:peMA.AposGlory.text
ltx/en_us_goadedes/pe.d117:peMA.Aposticha1.greekmelody	@ltx/en_us_goadedes/he.a.m6:heAU.AiAngelikai.greekname
ltx/en_us_goadedes/pe.d117:peMA.Aposticha1.incipit	…
ltx/en_us_goadedes/pe.d117:peMA.Aposticha1.melody	@ltx/en_us_goadedes/he.a.m6:heAU.AiAngelikai.name
ltx/en_us_goadedes/pe.d117:peMA.Aposticha1.mode	@ltx/en_us_goadedes/miscellanea:misc.Mode6
ltx/en_us_goadedes/pe.d117:peMA.Aposticha1.text	
ltx/en_us_goadedes/pe.d117:peMA.Aposticha2.incipit	…
ltx/en_us_goadedes/pe.d117:peMA.Aposticha2.melody	@ltx/en_us_goadedes/he.a.m6:heAU.AiAngelikai.name
ltx/en_us_goadedes/pe.d117:peMA.Aposticha2.mode	@ltx/en_us_goadedes/miscellanea:misc.Mode6
ltx/en_us_goadedes/pe.d117:peMA.Aposticha2.text	
ltx/en_us_goadedes/pe.d117:peMA.Aposticha3.incipit	…
ltx/en_us_goadedes/pe.d117:peMA.Aposticha3.melody	@ltx/en_us_goadedes/he.a.m6:heAU.AiAngelikai.name
ltx/en_us_goadedes/pe.d117:peMA.Aposticha3.mode	@ltx/en_us_goadedes/miscellanea:misc.Mode6
ltx/en_us_goadedes/pe.d117:peMA.Aposticha3.text	
ltx/en_us_goadedes/pe.d117:peMA.Kathisma11.greekmelody	@ltx/en_us_goadedes/pe.d110:peMA.Kathisma31.greekmelody
ltx/en_us_goadedes/pe.d117:peMA.Kathisma11.incipit	@ltx/en_us_goadedes/pe.d110:peMA.Kathisma31.incipit
ltx/en_us_goadedes/pe.d117:peMA.Kathisma11.melody	@ltx/en_us_goadedes/pe.d110:peMA.Kathisma31.melody
ltx/en_us_goadedes/pe.d117:peMA.Kathisma11.mode	@ltx/en_us_goadedes/pe.d110:peMA.Kathisma31.mode
ltx/en_us_goadedes/pe.d117:peMA.Kathisma11.text	@ltx/en_us_goadedes/pe.d110:peMA.Kathisma31.text
ltx/en_us_goadedes/pe.d117:peMA.Kathisma21.greekmelody	@ltx/en_us_goadedes/pe.d111:peMA.Kathisma11.greekmelody
ltx/en_us_goadedes/pe.d117:peMA.Kathisma21.incipit	@ltx/en_us_goadedes/pe.d111:peMA.Kathisma11.incipit
ltx/en_us_goadedes/pe.d117:peMA.Kathisma21.melody	@ltx/en_us_goadedes/pe.d111:peMA.Kathisma11.melody
ltx/en_us_goadedes/pe.d117:peMA.Kathisma21.mode	@ltx/en_us_goadedes/pe.d111:peMA.Kathisma11.mode
ltx/en_us_goadedes/pe.d117:peMA.Kathisma21.text	@ltx/en_us_goadedes/pe.d111:peMA.Kathisma11.text
ltx/en_us_goadedes/pe.d117:peVE.AposGlory.incipit	@ltx/en_us_goadedes/pe.d110:peMA.PostGospelIdiomelon.incipit
ltx/en_us_goadedes/pe.d117:peVE.AposGlory.melody	@ltx/en_us_goadedes/pe.d110:peMA.PostGospelIdiomelon.melody
ltx/en_us_goadedes/pe.d117:peVE.AposGlory.mode	@ltx/en_us_goadedes/pe.d110:peMA.PostGospelIdiomelon.mode
ltx/en_us_goadedes/pe.d117:peVE.AposGlory.text	@ltx/en_us_goadedes/pe.d110:peMA.PostGospelIdiomelon.text
ltx/en_us_goadedes/pe.d117:peVE.Aposticha1.greekmelody	@ltx/en_us_goadedes/he.a.m6:heAU.AiAngelikai.greekname
ltx/en_us_goadedes/pe.d117:peVE.Aposticha1.incipit	…
ltx/en_us_goadedes/pe.d117:peVE.Aposticha1.melody	@ltx/en_us_goadedes/he.a.m6:heAU.AiAngelikai.name
ltx/en_us_goadedes/pe.d117:peVE.Aposticha1.mode	@ltx/en_us_goadedes/miscellanea:misc.Mode6
ltx/en_us_goadedes/pe.d117:peVE.Aposticha1.text	
ltx/en_us_goadedes/pe.d117:peVE.Aposticha2.incipit	…
ltx/en_us_goadedes/pe.d117:peVE.Aposticha2.melody	@ltx/en_us_goadedes/he.a.m6:heAU.AiAngelikai.name
ltx/en_us_goadedes/pe.d117:peVE.Aposticha2.mode	@ltx/en_us_goadedes/miscellanea:misc.Mode6
ltx/en_us_goadedes/pe.d117:peVE.Aposticha2.text	
ltx/en_us_goadedes/pe.d117:peVE.Aposticha3.incipit	…
ltx/en_us_goadedes/pe.d117:peVE.Aposticha3.melody	@ltx/en_us_goadedes/he.a.m6:heAU.AiAngelikai.name
ltx/en_us_goadedes/pe.d117:peVE.Aposticha3.mode	@ltx/en_us_goadedes/miscellanea:misc.Mode6
ltx/en_us_goadedes/pe.d117:peVE.Aposticha3.text	
ltx/en_us_goadedes/pe.d117:peVE.SticGlory.incipit	@ltx/en_us_goadedes/pe.d110:peVE.AposGlory.incipit
ltx/en_us_goadedes/pe.d117:peVE.SticGlory.melody	@ltx/en_us_goadedes/pe.d110:peVE.AposGlory.melody
ltx/en_us_goadedes/pe.d117:peVE.SticGlory.mode	@ltx/en_us_goadedes/pe.d110:peVE.AposGlory.mode
ltx/en_us_goadedes/pe.d117:peVE.SticGlory.text	@ltx/en_us_goadedes/pe.d110:peVE.AposGlory.text
ltx/en_us_goadedes/pe.d117:peVE.Stichera01.greekmelody	@ltx/en_us_goadedes/he.a.m4:heAU.OExYpsistouKlitheis.greekname
ltx/en_us_goadedes/pe.d117:peVE.Stichera01.incipit	When You completed…
ltx/en_us_goadedes/pe.d117:peVE.Stichera01.melody	@ltx/en_us_goadedes/he.a.m4:heAU.OExYpsistouKlitheis.name
ltx/en_us_goadedes/pe.d117:peVE.Stichera01.mode	@ltx/en_us_goadedes/miscellanea:misc.Mode4
ltx/en_us_goadedes/pe.d117:peVE.Stichera01.text	When You completed the plan for the salvation * of all, You went up onto the Mount of Olives, O Christ. * With Your Disciples as witnesses, from there You flew up, * carried to heaven in glory on the clouds. * The mystery baffled the Angels of lower ranks, * and in amazement they shouted to the higher orders, * “Lift up the gates, for our God and King of all * is coming back into the heights from where * He went out, as He willed, to enact the plan * of eternal salvation * of the world extraordinarily.”
ltx/en_us_goadedes/pe.d117:peVE.Stichera02.incipit	As Your Disciples…
ltx/en_us_goadedes/pe.d117:peVE.Stichera02.melody	@ltx/en_us_goadedes/he.a.m4:heAU.OExYpsistouKlitheis.name
ltx/en_us_goadedes/pe.d117:peVE.Stichera02.mode	@ltx/en_us_goadedes/miscellanea:misc.Mode4
ltx/en_us_goadedes/pe.d117:peVE.Stichera02.text	As Your Disciples were watching You, O Master, * being taken up to heaven, they cried out and said, * “Where are You going away from us, Your faithful servants, * O Lord who hold in your hands the universe? * For our part, we left behind all things for You our God; * and we rejoiced as we followed You, for we were given * the hope of being with You forevermore. * As You once promised with paternal love, * please do not leave us orphaned. But send to us * from the Father the Spirit, * yes, the Comforter who saves our souls.”
ltx/en_us_goadedes/pe.d117:peVE.Stichera03.incipit	As You were giving…
ltx/en_us_goadedes/pe.d117:peVE.Stichera03.melody	@ltx/en_us_goadedes/he.a.m4:heAU.OExYpsistouKlitheis.name
ltx/en_us_goadedes/pe.d117:peVE.Stichera03.mode	@ltx/en_us_goadedes/miscellanea:misc.Mode4
ltx/en_us_goadedes/pe.d117:peVE.Stichera03.text	As You were giving Your friends the final blessing, * O Lord, You revealed to them the mysteries of God. * “My friends, behold, I am going now unto my Father, * and I will send You another Comforter. * And according to the promise that I made to you, * whom I have gathered, I will not leave you to be orphaned, * nor will I ever forget you, whom I love. * Once you are vested from on high with divine * grace and power, go forth and evangelize * every nation, announcing * the salvation Gospel everywhere.”
