ltx/en_us_goadedes/me.m12.d03:meDA.commemoration.first	
ltx/en_us_goadedes/me.m12.d03:meDA.commemoration.first_name	
ltx/en_us_goadedes/me.m12.d03:meDA.commemoration.first_short	
ltx/en_us_goadedes/me.m12.d03:meDA.commemoration.first_title	@ltx/en_us_goadedes/titles:ti.Prophet
ltx/en_us_goadedes/me.m12.d03:meDA.commemoration.full	
ltx/en_us_goadedes/me.m12.d03:meDA.commemoration.second_name	
ltx/en_us_goadedes/me.m12.d03:meDA.commemoration.second_title	
ltx/en_us_goadedes/me.m12.d03:meDA.date	
ltx/en_us_goadedes/me.m12.d03:meDA.fordate	
ltx/en_us_goadedes/me.m12.d03:meDA.insert1	
ltx/en_us_goadedes/me.m12.d03:meDA.insert2	
ltx/en_us_goadedes/me.m12.d03:meDA.note	
ltx/en_us_goadedes/me.m12.d03:meDA.pdfcoverdate	
ltx/en_us_goadedes/me.m12.d03:meDA.pdfheaderdate	
ltx/en_us_goadedes/me.m12.d03:meHO.commemorations	
ltx/en_us_goadedes/me.m12.d03:meHO.note1	
ltx/en_us_goadedes/me.m12.d03:meHO.note2	
ltx/en_us_goadedes/me.m12.d03:meHO.number	
ltx/en_us_goadedes/me.m12.d03:meHO.rank	
ltx/en_us_goadedes/me.m12.d03:meLE.commemoration1	
ltx/en_us_goadedes/me.m12.d03:meLE.commemoration2	
ltx/en_us_goadedes/me.m12.d03:meLI.Kontakion1.incipit	…
ltx/en_us_goadedes/me.m12.d03:meLI.Kontakion1.melody	
ltx/en_us_goadedes/me.m12.d03:meLI.Kontakion1.mode	
ltx/en_us_goadedes/me.m12.d03:meLI.Kontakion1.text	
ltx/en_us_goadedes/me.m12.d03:meLI.MM.CommunionHymn.text	@ltx/en_us_goadedes/properties:media.key
ltx/en_us_goadedes/me.m12.d03:meLI.Megalynarion.text	
ltx/en_us_goadedes/me.m12.d03:meMA.C1.acrostic.notice1	
ltx/en_us_goadedes/me.m12.d03:meMA.C1.acrostic.text	
ltx/en_us_goadedes/me.m12.d03:meMA.C1.acrostic.title	
ltx/en_us_goadedes/me.m12.d03:meMA.C1.poet	@ltx/en_us_goadedes/poets:po.Theofanous
ltx/en_us_goadedes/me.m12.d03:meMA.C1.title	@ltx/en_us_goadedes/titles:ti.CanonProphet
ltx/en_us_goadedes/me.m12.d03:meMA.C1.verse	@ltx/en_us_goadedes/prayers:pr.verse_Prophet.text
ltx/en_us_goadedes/me.m12.d03:meMA.ExapTheotokion.incipit	…
ltx/en_us_goadedes/me.m12.d03:meMA.ExapTheotokion.melody	@ltx/en_us_goadedes/he.a.m2:heAU.ToisMathitaisSynelthomen.name
ltx/en_us_goadedes/me.m12.d03:meMA.ExapTheotokion.mode	@ltx/en_us_goadedes/miscellanea:misc.Mode2
ltx/en_us_goadedes/me.m12.d03:meMA.ExapTheotokion.text	
ltx/en_us_goadedes/me.m12.d03:meMA.Exaposteilarion1.greekmelody	@ltx/en_us_goadedes/he.a.m2:heAU.ToisMathitaisSynelthomen.greekname
ltx/en_us_goadedes/me.m12.d03:meMA.Exaposteilarion1.incipit	…
ltx/en_us_goadedes/me.m12.d03:meMA.Exaposteilarion1.melody	@ltx/en_us_goadedes/he.a.m2:heAU.ToisMathitaisSynelthomen.name
ltx/en_us_goadedes/me.m12.d03:meMA.Exaposteilarion1.mode	@ltx/en_us_goadedes/miscellanea:misc.Mode2
ltx/en_us_goadedes/me.m12.d03:meMA.Exaposteilarion1.text	
ltx/en_us_goadedes/me.m12.d03:meMA.Ode1C11.greekmelody	@ltx/en_us_goadedes/he.h.m6:heHE.OsEnIpeiroPezefsas.greekname
ltx/en_us_goadedes/me.m12.d03:meMA.Ode1C11.incipit	…
ltx/en_us_goadedes/me.m12.d03:meMA.Ode1C11.melody	@ltx/en_us_goadedes/he.h.m6:heHE.OsEnIpeiroPezefsas.name
ltx/en_us_goadedes/me.m12.d03:meMA.Ode1C11.mode	@ltx/en_us_goadedes/miscellanea:misc.Mode6
ltx/en_us_goadedes/me.m12.d03:meMA.Ode1C11.ode	@ltx/en_us_goadedes/miscellanea:misc.Ode1
ltx/en_us_goadedes/me.m12.d03:meMA.Ode1C11.text	
ltx/en_us_goadedes/me.m12.d03:meMA.Ode1C12.incipit	…
ltx/en_us_goadedes/me.m12.d03:meMA.Ode1C12.melody	@ltx/en_us_goadedes/he.h.m6:heHE.OsEnIpeiroPezefsas.name
ltx/en_us_goadedes/me.m12.d03:meMA.Ode1C12.mode	@ltx/en_us_goadedes/miscellanea:misc.Mode6
ltx/en_us_goadedes/me.m12.d03:meMA.Ode1C12.ode	@ltx/en_us_goadedes/miscellanea:misc.Ode1
ltx/en_us_goadedes/me.m12.d03:meMA.Ode1C12.text	
ltx/en_us_goadedes/me.m12.d03:meMA.Ode1C1T.incipit	…
ltx/en_us_goadedes/me.m12.d03:meMA.Ode1C1T.melody	@ltx/en_us_goadedes/he.h.m6:heHE.OsEnIpeiroPezefsas.name
ltx/en_us_goadedes/me.m12.d03:meMA.Ode1C1T.mode	@ltx/en_us_goadedes/miscellanea:misc.Mode6
ltx/en_us_goadedes/me.m12.d03:meMA.Ode1C1T.ode	@ltx/en_us_goadedes/miscellanea:misc.Ode1
ltx/en_us_goadedes/me.m12.d03:meMA.Ode1C1T.text	
ltx/en_us_goadedes/me.m12.d03:meMA.Ode3C11.greekmelody	@ltx/en_us_goadedes/he.h.m6:heHE.OukEstinAgios.greekname
ltx/en_us_goadedes/me.m12.d03:meMA.Ode3C11.incipit	…
ltx/en_us_goadedes/me.m12.d03:meMA.Ode3C11.melody	@ltx/en_us_goadedes/he.h.m6:heHE.OukEstinAgios.name
ltx/en_us_goadedes/me.m12.d03:meMA.Ode3C11.mode	@ltx/en_us_goadedes/miscellanea:misc.Mode6
ltx/en_us_goadedes/me.m12.d03:meMA.Ode3C11.ode	@ltx/en_us_goadedes/miscellanea:misc.Ode3
ltx/en_us_goadedes/me.m12.d03:meMA.Ode3C11.text	
ltx/en_us_goadedes/me.m12.d03:meMA.Ode3C12.incipit	…
ltx/en_us_goadedes/me.m12.d03:meMA.Ode3C12.melody	@ltx/en_us_goadedes/he.h.m6:heHE.OukEstinAgios.name
ltx/en_us_goadedes/me.m12.d03:meMA.Ode3C12.mode	@ltx/en_us_goadedes/miscellanea:misc.Mode6
ltx/en_us_goadedes/me.m12.d03:meMA.Ode3C12.ode	@ltx/en_us_goadedes/miscellanea:misc.Ode3
ltx/en_us_goadedes/me.m12.d03:meMA.Ode3C12.text	
ltx/en_us_goadedes/me.m12.d03:meMA.Ode3C1T.incipit	…
ltx/en_us_goadedes/me.m12.d03:meMA.Ode3C1T.melody	@ltx/en_us_goadedes/he.h.m6:heHE.OukEstinAgios.name
ltx/en_us_goadedes/me.m12.d03:meMA.Ode3C1T.mode	@ltx/en_us_goadedes/miscellanea:misc.Mode6
ltx/en_us_goadedes/me.m12.d03:meMA.Ode3C1T.ode	@ltx/en_us_goadedes/miscellanea:misc.Ode3
ltx/en_us_goadedes/me.m12.d03:meMA.Ode3C1T.text	
ltx/en_us_goadedes/me.m12.d03:meMA.Ode3H.greekmelody	@ltx/en_us_goadedes/he.h.m6:heHE.OukEstinAgios.greekname
ltx/en_us_goadedes/me.m12.d03:meMA.Ode3H.incipit	@ltx/en_us_goadedes/he.h.m6:heHE.OukEstinAgios.incipit
ltx/en_us_goadedes/me.m12.d03:meMA.Ode3H.melody	@ltx/en_us_goadedes/he.h.m6:heHE.OukEstinAgios.melody
ltx/en_us_goadedes/me.m12.d03:meMA.Ode3H.mode	@ltx/en_us_goadedes/miscellanea:misc.Mode6
ltx/en_us_goadedes/me.m12.d03:meMA.Ode3H.ode	@ltx/en_us_goadedes/miscellanea:misc.Ode3
ltx/en_us_goadedes/me.m12.d03:meMA.Ode3H.text	@ltx/en_us_goadedes/he.h.m6:heHE.OukEstinAgios.text
ltx/en_us_goadedes/me.m12.d03:meMA.Ode3Kathisma1.greekmelody	@ltx/en_us_goadedes/he.a.m3:heAU.TheiasPisteos.greekname
ltx/en_us_goadedes/me.m12.d03:meMA.Ode3Kathisma1.incipit	…
ltx/en_us_goadedes/me.m12.d03:meMA.Ode3Kathisma1.melody	@ltx/en_us_goadedes/he.a.m3:heAU.TheiasPisteos.name
ltx/en_us_goadedes/me.m12.d03:meMA.Ode3Kathisma1.mode	@ltx/en_us_goadedes/miscellanea:misc.Mode3
ltx/en_us_goadedes/me.m12.d03:meMA.Ode3Kathisma1.text	
ltx/en_us_goadedes/me.m12.d03:meMA.Ode3KathismaSt.incipit	@ltx/en_us_goadedes/me.m01.d29:meMA.Ode3KathismaSt.incipit
ltx/en_us_goadedes/me.m12.d03:meMA.Ode3KathismaSt.melody	@ltx/en_us_goadedes/he.a.m3:heAU.TheiasPisteos.name
ltx/en_us_goadedes/me.m12.d03:meMA.Ode3KathismaSt.mode	@ltx/en_us_goadedes/miscellanea:misc.Mode3
ltx/en_us_goadedes/me.m12.d03:meMA.Ode3KathismaSt.text	@ltx/en_us_goadedes/me.m01.d29:meMA.Ode3KathismaSt.text
ltx/en_us_goadedes/me.m12.d03:meMA.Ode3KathismaT.incipit	@ltx/en_us_goadedes/oc.m3.d2:ocMA.Kathisma23.incipit
ltx/en_us_goadedes/me.m12.d03:meMA.Ode3KathismaT.melody	@ltx/en_us_goadedes/he.a.m3:heAU.TheiasPisteos.name
ltx/en_us_goadedes/me.m12.d03:meMA.Ode3KathismaT.mode	@ltx/en_us_goadedes/miscellanea:misc.Mode3
ltx/en_us_goadedes/me.m12.d03:meMA.Ode3KathismaT.text	@ltx/en_us_goadedes/oc.m3.d2:ocMA.Kathisma23.text
ltx/en_us_goadedes/me.m12.d03:meMA.Ode4C11.greekmelody	@ltx/en_us_goadedes/he.h.m6:heHE.ChristosMouDynamis.greekname
ltx/en_us_goadedes/me.m12.d03:meMA.Ode4C11.incipit	…
ltx/en_us_goadedes/me.m12.d03:meMA.Ode4C11.melody	@ltx/en_us_goadedes/he.h.m6:heHE.ChristosMouDynamis.name
ltx/en_us_goadedes/me.m12.d03:meMA.Ode4C11.mode	@ltx/en_us_goadedes/miscellanea:misc.Mode6
ltx/en_us_goadedes/me.m12.d03:meMA.Ode4C11.ode	@ltx/en_us_goadedes/miscellanea:misc.Ode4
ltx/en_us_goadedes/me.m12.d03:meMA.Ode4C11.text	
ltx/en_us_goadedes/me.m12.d03:meMA.Ode4C12.incipit	…
ltx/en_us_goadedes/me.m12.d03:meMA.Ode4C12.melody	@ltx/en_us_goadedes/he.h.m6:heHE.ChristosMouDynamis.name
ltx/en_us_goadedes/me.m12.d03:meMA.Ode4C12.mode	@ltx/en_us_goadedes/miscellanea:misc.Mode6
ltx/en_us_goadedes/me.m12.d03:meMA.Ode4C12.ode	@ltx/en_us_goadedes/miscellanea:misc.Ode4
ltx/en_us_goadedes/me.m12.d03:meMA.Ode4C12.text	
ltx/en_us_goadedes/me.m12.d03:meMA.Ode4C1T.incipit	…
ltx/en_us_goadedes/me.m12.d03:meMA.Ode4C1T.melody	@ltx/en_us_goadedes/he.h.m6:heHE.ChristosMouDynamis.name
ltx/en_us_goadedes/me.m12.d03:meMA.Ode4C1T.mode	@ltx/en_us_goadedes/miscellanea:misc.Mode6
ltx/en_us_goadedes/me.m12.d03:meMA.Ode4C1T.ode	@ltx/en_us_goadedes/miscellanea:misc.Ode4
ltx/en_us_goadedes/me.m12.d03:meMA.Ode4C1T.text	
ltx/en_us_goadedes/me.m12.d03:meMA.Ode5C11.greekmelody	@ltx/en_us_goadedes/he.h.m6:heHE.ToTheioFengeiSou.greekname
ltx/en_us_goadedes/me.m12.d03:meMA.Ode5C11.incipit	…
ltx/en_us_goadedes/me.m12.d03:meMA.Ode5C11.melody	@ltx/en_us_goadedes/he.h.m6:heHE.ToTheioFengeiSou.name
ltx/en_us_goadedes/me.m12.d03:meMA.Ode5C11.mode	@ltx/en_us_goadedes/miscellanea:misc.Mode6
ltx/en_us_goadedes/me.m12.d03:meMA.Ode5C11.ode	@ltx/en_us_goadedes/miscellanea:misc.Ode5
ltx/en_us_goadedes/me.m12.d03:meMA.Ode5C11.text	
ltx/en_us_goadedes/me.m12.d03:meMA.Ode5C12.incipit	…
ltx/en_us_goadedes/me.m12.d03:meMA.Ode5C12.melody	@ltx/en_us_goadedes/he.h.m6:heHE.ToTheioFengeiSou.name
ltx/en_us_goadedes/me.m12.d03:meMA.Ode5C12.mode	@ltx/en_us_goadedes/miscellanea:misc.Mode6
ltx/en_us_goadedes/me.m12.d03:meMA.Ode5C12.ode	@ltx/en_us_goadedes/miscellanea:misc.Ode5
ltx/en_us_goadedes/me.m12.d03:meMA.Ode5C12.text	
ltx/en_us_goadedes/me.m12.d03:meMA.Ode5C1T.incipit	…
ltx/en_us_goadedes/me.m12.d03:meMA.Ode5C1T.melody	@ltx/en_us_goadedes/he.h.m6:heHE.ToTheioFengeiSou.name
ltx/en_us_goadedes/me.m12.d03:meMA.Ode5C1T.mode	@ltx/en_us_goadedes/miscellanea:misc.Mode6
ltx/en_us_goadedes/me.m12.d03:meMA.Ode5C1T.ode	@ltx/en_us_goadedes/miscellanea:misc.Ode5
ltx/en_us_goadedes/me.m12.d03:meMA.Ode5C1T.text	
ltx/en_us_goadedes/me.m12.d03:meMA.Ode6C11.greekmelody	@ltx/en_us_goadedes/he.h.m6:heHE.TouViouTinThalassan.greekname
ltx/en_us_goadedes/me.m12.d03:meMA.Ode6C11.incipit	…
ltx/en_us_goadedes/me.m12.d03:meMA.Ode6C11.melody	@ltx/en_us_goadedes/he.h.m6:heHE.TouViouTinThalassan.name
ltx/en_us_goadedes/me.m12.d03:meMA.Ode6C11.mode	@ltx/en_us_goadedes/miscellanea:misc.Mode6
ltx/en_us_goadedes/me.m12.d03:meMA.Ode6C11.ode	@ltx/en_us_goadedes/miscellanea:misc.Ode6
ltx/en_us_goadedes/me.m12.d03:meMA.Ode6C11.text	
ltx/en_us_goadedes/me.m12.d03:meMA.Ode6C12.incipit	…
ltx/en_us_goadedes/me.m12.d03:meMA.Ode6C12.melody	@ltx/en_us_goadedes/he.h.m6:heHE.TouViouTinThalassan.name
ltx/en_us_goadedes/me.m12.d03:meMA.Ode6C12.mode	@ltx/en_us_goadedes/miscellanea:misc.Mode6
ltx/en_us_goadedes/me.m12.d03:meMA.Ode6C12.ode	@ltx/en_us_goadedes/miscellanea:misc.Ode6
ltx/en_us_goadedes/me.m12.d03:meMA.Ode6C12.text	
ltx/en_us_goadedes/me.m12.d03:meMA.Ode6C1T.incipit	…
ltx/en_us_goadedes/me.m12.d03:meMA.Ode6C1T.melody	@ltx/en_us_goadedes/he.h.m6:heHE.TouViouTinThalassan.name
ltx/en_us_goadedes/me.m12.d03:meMA.Ode6C1T.mode	@ltx/en_us_goadedes/miscellanea:misc.Mode6
ltx/en_us_goadedes/me.m12.d03:meMA.Ode6C1T.ode	@ltx/en_us_goadedes/miscellanea:misc.Ode6
ltx/en_us_goadedes/me.m12.d03:meMA.Ode6C1T.text	
ltx/en_us_goadedes/me.m12.d03:meMA.Ode6H.greekmelody	@ltx/en_us_goadedes/he.h.m6:heHE.TouViouTinThalassan.greekname
ltx/en_us_goadedes/me.m12.d03:meMA.Ode6H.incipit	@ltx/en_us_goadedes/he.h.m6:heHE.TouViouTinThalassan.incipit
ltx/en_us_goadedes/me.m12.d03:meMA.Ode6H.melody	@ltx/en_us_goadedes/he.h.m6:heHE.TouViouTinThalassan.melody
ltx/en_us_goadedes/me.m12.d03:meMA.Ode6H.mode	@ltx/en_us_goadedes/miscellanea:misc.Mode6
ltx/en_us_goadedes/me.m12.d03:meMA.Ode6H.ode	@ltx/en_us_goadedes/miscellanea:misc.Ode6
ltx/en_us_goadedes/me.m12.d03:meMA.Ode6H.text	@ltx/en_us_goadedes/he.h.m6:heHE.TouViouTinThalassan.text
ltx/en_us_goadedes/me.m12.d03:meMA.Ode7C11.greekmelody	@ltx/en_us_goadedes/he.h.m6:heHE.DrosovolonMenTinKaminon.greekname
ltx/en_us_goadedes/me.m12.d03:meMA.Ode7C11.incipit	…
ltx/en_us_goadedes/me.m12.d03:meMA.Ode7C11.melody	@ltx/en_us_goadedes/he.h.m6:heHE.DrosovolonMenTinKaminon.name
ltx/en_us_goadedes/me.m12.d03:meMA.Ode7C11.mode	@ltx/en_us_goadedes/miscellanea:misc.Mode6
ltx/en_us_goadedes/me.m12.d03:meMA.Ode7C11.ode	@ltx/en_us_goadedes/miscellanea:misc.Ode7
ltx/en_us_goadedes/me.m12.d03:meMA.Ode7C11.text	
ltx/en_us_goadedes/me.m12.d03:meMA.Ode7C12.incipit	…
ltx/en_us_goadedes/me.m12.d03:meMA.Ode7C12.melody	@ltx/en_us_goadedes/he.h.m6:heHE.DrosovolonMenTinKaminon.name
ltx/en_us_goadedes/me.m12.d03:meMA.Ode7C12.mode	@ltx/en_us_goadedes/miscellanea:misc.Mode6
ltx/en_us_goadedes/me.m12.d03:meMA.Ode7C12.ode	@ltx/en_us_goadedes/miscellanea:misc.Ode7
ltx/en_us_goadedes/me.m12.d03:meMA.Ode7C12.text	
ltx/en_us_goadedes/me.m12.d03:meMA.Ode7C1T.incipit	…
ltx/en_us_goadedes/me.m12.d03:meMA.Ode7C1T.melody	@ltx/en_us_goadedes/he.h.m6:heHE.DrosovolonMenTinKaminon.name
ltx/en_us_goadedes/me.m12.d03:meMA.Ode7C1T.mode	@ltx/en_us_goadedes/miscellanea:misc.Mode6
ltx/en_us_goadedes/me.m12.d03:meMA.Ode7C1T.ode	@ltx/en_us_goadedes/miscellanea:misc.Ode7
ltx/en_us_goadedes/me.m12.d03:meMA.Ode7C1T.text	
ltx/en_us_goadedes/me.m12.d03:meMA.Ode8C11.greekmelody	@ltx/en_us_goadedes/he.h.m6:heHE.EkFlogosToisOsiois.greekname
ltx/en_us_goadedes/me.m12.d03:meMA.Ode8C11.incipit	…
ltx/en_us_goadedes/me.m12.d03:meMA.Ode8C11.melody	@ltx/en_us_goadedes/he.h.m6:heHE.EkFlogosToisOsiois.name
ltx/en_us_goadedes/me.m12.d03:meMA.Ode8C11.mode	@ltx/en_us_goadedes/miscellanea:misc.Mode6
ltx/en_us_goadedes/me.m12.d03:meMA.Ode8C11.ode	@ltx/en_us_goadedes/miscellanea:misc.Ode8
ltx/en_us_goadedes/me.m12.d03:meMA.Ode8C11.text	
ltx/en_us_goadedes/me.m12.d03:meMA.Ode8C12.incipit	…
ltx/en_us_goadedes/me.m12.d03:meMA.Ode8C12.melody	@ltx/en_us_goadedes/he.h.m6:heHE.EkFlogosToisOsiois.name
ltx/en_us_goadedes/me.m12.d03:meMA.Ode8C12.mode	@ltx/en_us_goadedes/miscellanea:misc.Mode6
ltx/en_us_goadedes/me.m12.d03:meMA.Ode8C12.ode	@ltx/en_us_goadedes/miscellanea:misc.Ode8
ltx/en_us_goadedes/me.m12.d03:meMA.Ode8C12.text	
ltx/en_us_goadedes/me.m12.d03:meMA.Ode8C1T.incipit	…
ltx/en_us_goadedes/me.m12.d03:meMA.Ode8C1T.melody	@ltx/en_us_goadedes/he.h.m6:heHE.EkFlogosToisOsiois.name
ltx/en_us_goadedes/me.m12.d03:meMA.Ode8C1T.mode	@ltx/en_us_goadedes/miscellanea:misc.Mode6
ltx/en_us_goadedes/me.m12.d03:meMA.Ode8C1T.ode	@ltx/en_us_goadedes/miscellanea:misc.Ode8
ltx/en_us_goadedes/me.m12.d03:meMA.Ode8C1T.text	
ltx/en_us_goadedes/me.m12.d03:meMA.Ode8H.greekmelody	@ltx/en_us_goadedes/he.h.m6:heHE.EkFlogosToisOsiois.greekname
ltx/en_us_goadedes/me.m12.d03:meMA.Ode8H.incipit	@ltx/en_us_goadedes/he.h.m6:heHE.EkFlogosToisOsiois.incipit
ltx/en_us_goadedes/me.m12.d03:meMA.Ode8H.melody	@ltx/en_us_goadedes/he.h.m6:heHE.EkFlogosToisOsiois.melody
ltx/en_us_goadedes/me.m12.d03:meMA.Ode8H.mode	@ltx/en_us_goadedes/miscellanea:misc.Mode6
ltx/en_us_goadedes/me.m12.d03:meMA.Ode8H.ode	@ltx/en_us_goadedes/miscellanea:misc.Ode8
ltx/en_us_goadedes/me.m12.d03:meMA.Ode8H.text	@ltx/en_us_goadedes/he.h.m6:heHE.EkFlogosToisOsiois.text
ltx/en_us_goadedes/me.m12.d03:meMA.Ode9C11.greekmelody	@ltx/en_us_goadedes/he.h.m6:heHE.TheonAnthropois.greekname
ltx/en_us_goadedes/me.m12.d03:meMA.Ode9C11.incipit	…
ltx/en_us_goadedes/me.m12.d03:meMA.Ode9C11.melody	@ltx/en_us_goadedes/he.h.m6:heHE.TheonAnthropois.name
ltx/en_us_goadedes/me.m12.d03:meMA.Ode9C11.mode	@ltx/en_us_goadedes/miscellanea:misc.Mode6
ltx/en_us_goadedes/me.m12.d03:meMA.Ode9C11.ode	@ltx/en_us_goadedes/miscellanea:misc.Ode9
ltx/en_us_goadedes/me.m12.d03:meMA.Ode9C11.text	
ltx/en_us_goadedes/me.m12.d03:meMA.Ode9C12.incipit	…
ltx/en_us_goadedes/me.m12.d03:meMA.Ode9C12.melody	@ltx/en_us_goadedes/he.h.m6:heHE.TheonAnthropois.name
ltx/en_us_goadedes/me.m12.d03:meMA.Ode9C12.mode	@ltx/en_us_goadedes/miscellanea:misc.Mode6
ltx/en_us_goadedes/me.m12.d03:meMA.Ode9C12.ode	@ltx/en_us_goadedes/miscellanea:misc.Ode9
ltx/en_us_goadedes/me.m12.d03:meMA.Ode9C12.text	
ltx/en_us_goadedes/me.m12.d03:meMA.Ode9C1T.incipit	…
ltx/en_us_goadedes/me.m12.d03:meMA.Ode9C1T.melody	@ltx/en_us_goadedes/he.h.m6:heHE.TheonAnthropois.name
ltx/en_us_goadedes/me.m12.d03:meMA.Ode9C1T.mode	@ltx/en_us_goadedes/miscellanea:misc.Mode6
ltx/en_us_goadedes/me.m12.d03:meMA.Ode9C1T.ode	@ltx/en_us_goadedes/miscellanea:misc.Ode9
ltx/en_us_goadedes/me.m12.d03:meMA.Ode9C1T.text	
ltx/en_us_goadedes/me.m12.d03:meMA.Ode9H.greekmelody	@ltx/en_us_goadedes/he.h.m6:heHE.TheonAnthropois.greekname
ltx/en_us_goadedes/me.m12.d03:meMA.Ode9H.incipit	@ltx/en_us_goadedes/he.h.m6:heHE.TheonAnthropois.incipit
ltx/en_us_goadedes/me.m12.d03:meMA.Ode9H.melody	@ltx/en_us_goadedes/he.h.m6:heHE.TheonAnthropois.melody
ltx/en_us_goadedes/me.m12.d03:meMA.Ode9H.mode	@ltx/en_us_goadedes/miscellanea:misc.Mode6
ltx/en_us_goadedes/me.m12.d03:meMA.Ode9H.ode	@ltx/en_us_goadedes/miscellanea:misc.Ode9
ltx/en_us_goadedes/me.m12.d03:meMA.Ode9H.text	@ltx/en_us_goadedes/he.h.m6:heHE.TheonAnthropois.text
ltx/en_us_goadedes/me.m12.d03:meVE.Apolytikion1.melody	@ltx/en_us_goadedes/he.ga:heGA.TouProfitouSou.name
ltx/en_us_goadedes/me.m12.d03:meVE.Apolytikion1.mode	@ltx/en_us_goadedes/miscellanea:misc.Mode2
ltx/en_us_goadedes/me.m12.d03:meVE.Apolytikion2ger.greekmelody	@ltx/en_us_goadedes/he.a.m1:heAU.TisErimouPolitis.greekname
ltx/en_us_goadedes/me.m12.d03:meVE.Apolytikion2ger.incipit	…
ltx/en_us_goadedes/me.m12.d03:meVE.Apolytikion2ger.melody	@ltx/en_us_goadedes/he.a.m1:heAU.TisErimouPolitis.name
ltx/en_us_goadedes/me.m12.d03:meVE.Apolytikion2ger.mode	@ltx/en_us_goadedes/miscellanea:misc.Mode1
ltx/en_us_goadedes/me.m12.d03:meVE.Apolytikion2ger.poet	@ltx/en_us_goadedes/poets:po.Gerasimou
ltx/en_us_goadedes/me.m12.d03:meVE.Apolytikion2ger.text	
ltx/en_us_goadedes/me.m12.d03:meVE.GeneralApolytikion1.name	
ltx/en_us_goadedes/me.m12.d03:meVE.SticStavrotheotokion.greekmelody	@ltx/en_us_goadedes/he.a.m4:heAU.OExYpsistouKlitheis.greekname
ltx/en_us_goadedes/me.m12.d03:meVE.SticStavrotheotokion.incipit	…
ltx/en_us_goadedes/me.m12.d03:meVE.SticStavrotheotokion.melody	@ltx/en_us_goadedes/he.a.m4:heAU.OExYpsistouKlitheis.name
ltx/en_us_goadedes/me.m12.d03:meVE.SticStavrotheotokion.mode	@ltx/en_us_goadedes/miscellanea:misc.Mode4
ltx/en_us_goadedes/me.m12.d03:meVE.SticStavrotheotokion.text	
ltx/en_us_goadedes/me.m12.d03:meVE.SticTheotokion.greekmelody	@ltx/en_us_goadedes/he.a.m4:heAU.OExYpsistouKlitheis.greekname
ltx/en_us_goadedes/me.m12.d03:meVE.SticTheotokion.incipit	@ltx/en_us_goadedes/oc.m4.d1:ocSV.Aposticha3.incipit
ltx/en_us_goadedes/me.m12.d03:meVE.SticTheotokion.melody	@ltx/en_us_goadedes/he.a.m4:heAU.OExYpsistouKlitheis.name
ltx/en_us_goadedes/me.m12.d03:meVE.SticTheotokion.mode	@ltx/en_us_goadedes/miscellanea:misc.Mode4
ltx/en_us_goadedes/me.m12.d03:meVE.SticTheotokion.text	@ltx/en_us_goadedes/oc.m4.d1:ocSV.Aposticha3.text
ltx/en_us_goadedes/me.m12.d03:meVE.Stichera01.greekmelody	@ltx/en_us_goadedes/he.a.m4:heAU.OExYpsistouKlitheis.greekname
ltx/en_us_goadedes/me.m12.d03:meVE.Stichera01.incipit	…
ltx/en_us_goadedes/me.m12.d03:meVE.Stichera01.melody	@ltx/en_us_goadedes/he.a.m4:heAU.OExYpsistouKlitheis.name
ltx/en_us_goadedes/me.m12.d03:meVE.Stichera01.mode	@ltx/en_us_goadedes/miscellanea:misc.Mode4
ltx/en_us_goadedes/me.m12.d03:meVE.Stichera01.text	
ltx/en_us_goadedes/me.m12.d03:meVE.Stichera02.incipit	…
ltx/en_us_goadedes/me.m12.d03:meVE.Stichera02.melody	@ltx/en_us_goadedes/he.a.m4:heAU.OExYpsistouKlitheis.name
ltx/en_us_goadedes/me.m12.d03:meVE.Stichera02.mode	@ltx/en_us_goadedes/miscellanea:misc.Mode4
ltx/en_us_goadedes/me.m12.d03:meVE.Stichera02.text	
ltx/en_us_goadedes/me.m12.d03:meVE.Stichera03.incipit	…
ltx/en_us_goadedes/me.m12.d03:meVE.Stichera03.melody	@ltx/en_us_goadedes/he.a.m4:heAU.OExYpsistouKlitheis.name
ltx/en_us_goadedes/me.m12.d03:meVE.Stichera03.mode	@ltx/en_us_goadedes/miscellanea:misc.Mode4
ltx/en_us_goadedes/me.m12.d03:meVE.Stichera03.text	
