ltx/en_us_goadedes/tr.d052:trCO.header	
ltx/en_us_goadedes/tr.d052:trDA.commemoration.full	
ltx/en_us_goadedes/tr.d052:trDA.commemoration.short	
ltx/en_us_goadedes/tr.d052:trDA.insert1	
ltx/en_us_goadedes/tr.d052:trDA.insert2	
ltx/en_us_goadedes/tr.d052:trDA.note	
ltx/en_us_goadedes/tr.d052:trDA.title	
ltx/en_us_goadedes/tr.d052:trHO.commemorations	
ltx/en_us_goadedes/tr.d052:trHO.daytitle	
ltx/en_us_goadedes/tr.d052:trHO.description1	
ltx/en_us_goadedes/tr.d052:trHO.description2	
ltx/en_us_goadedes/tr.d052:trHO.note1	
ltx/en_us_goadedes/tr.d052:trHO.note2	
ltx/en_us_goadedes/tr.d052:trMA.AposIdiomelon1.incipit	…
ltx/en_us_goadedes/tr.d052:trMA.AposIdiomelon1.melody	@ltx/en_us_goadedes/miscellanea:misc.Idiomelon
ltx/en_us_goadedes/tr.d052:trMA.AposIdiomelon1.mode	@ltx/en_us_goadedes/miscellanea:misc.Mode7
ltx/en_us_goadedes/tr.d052:trMA.AposIdiomelon1.text	
ltx/en_us_goadedes/tr.d052:trMA.AposMartyric.incipit	…
ltx/en_us_goadedes/tr.d052:trMA.AposMartyric.melody	
ltx/en_us_goadedes/tr.d052:trMA.AposMartyric.mode	@ltx/en_us_goadedes/miscellanea:misc.Mode7
ltx/en_us_goadedes/tr.d052:trMA.AposMartyric.text	
ltx/en_us_goadedes/tr.d052:trMA.AposTheotokion.incipit	…
ltx/en_us_goadedes/tr.d052:trMA.AposTheotokion.melody	
ltx/en_us_goadedes/tr.d052:trMA.AposTheotokion.mode	@ltx/en_us_goadedes/miscellanea:misc.Mode7
ltx/en_us_goadedes/tr.d052:trMA.AposTheotokion.text	
ltx/en_us_goadedes/tr.d052:trMA.C1.poet	@ltx/en_us_goadedes/poets:po.Iosif
ltx/en_us_goadedes/tr.d052:trMA.C2.poet	@ltx/en_us_goadedes/poets:po.Theodorou
ltx/en_us_goadedes/tr.d052:trMA.Kathisma21.greekmelody	@ltx/en_us_goadedes/he.a.m3:heAU.TheiasPisteos.greekname
ltx/en_us_goadedes/tr.d052:trMA.Kathisma21.incipit	…
ltx/en_us_goadedes/tr.d052:trMA.Kathisma21.melody	@ltx/en_us_goadedes/he.a.m3:heAU.TheiasPisteos.name
ltx/en_us_goadedes/tr.d052:trMA.Kathisma21.mode	@ltx/en_us_goadedes/miscellanea:misc.Mode3
ltx/en_us_goadedes/tr.d052:trMA.Kathisma21.text	
ltx/en_us_goadedes/tr.d052:trMA.Kathisma22.greekmelody	@ltx/en_us_goadedes/he.a.m3:heAU.TheiasPisteos.greekname
ltx/en_us_goadedes/tr.d052:trMA.Kathisma22.incipit	@ltx/en_us_goadedes/oc.m3.d2:ocMA.Kathisma23.incipit
ltx/en_us_goadedes/tr.d052:trMA.Kathisma22.melody	@ltx/en_us_goadedes/he.a.m3:heAU.TheiasPisteos.name
ltx/en_us_goadedes/tr.d052:trMA.Kathisma22.mode	@ltx/en_us_goadedes/miscellanea:misc.Mode3
ltx/en_us_goadedes/tr.d052:trMA.Kathisma22.text	@ltx/en_us_goadedes/oc.m3.d2:ocMA.Kathisma23.text
ltx/en_us_goadedes/tr.d052:trMA.Kathisma31.incipit	…
ltx/en_us_goadedes/tr.d052:trMA.Kathisma31.melody	
ltx/en_us_goadedes/tr.d052:trMA.Kathisma31.mode	@ltx/en_us_goadedes/miscellanea:misc.Mode2
ltx/en_us_goadedes/tr.d052:trMA.Kathisma31.text	
ltx/en_us_goadedes/tr.d052:trMA.Kathisma32.incipit	…
ltx/en_us_goadedes/tr.d052:trMA.Kathisma32.melody	
ltx/en_us_goadedes/tr.d052:trMA.Kathisma32.mode	@ltx/en_us_goadedes/miscellanea:misc.Mode2
ltx/en_us_goadedes/tr.d052:trMA.Kathisma32.text	
ltx/en_us_goadedes/tr.d052:trMA.Ode2C11.greekmelody	@ltx/en_us_goadedes/he.h.m3:heHE.ProsecheGiKaiOurane.greekname
ltx/en_us_goadedes/tr.d052:trMA.Ode2C11.incipit	…
ltx/en_us_goadedes/tr.d052:trMA.Ode2C11.melody	@ltx/en_us_goadedes/he.h.m3:heHE.ProsecheGiKaiOurane.name
ltx/en_us_goadedes/tr.d052:trMA.Ode2C11.mode	@ltx/en_us_goadedes/miscellanea:misc.Mode3
ltx/en_us_goadedes/tr.d052:trMA.Ode2C11.ode	@ltx/en_us_goadedes/miscellanea:misc.Ode2
ltx/en_us_goadedes/tr.d052:trMA.Ode2C11.text	
ltx/en_us_goadedes/tr.d052:trMA.Ode2C12.incipit	…
ltx/en_us_goadedes/tr.d052:trMA.Ode2C12.melody	@ltx/en_us_goadedes/he.h.m3:heHE.ProsecheGiKaiOurane.name
ltx/en_us_goadedes/tr.d052:trMA.Ode2C12.mode	@ltx/en_us_goadedes/miscellanea:misc.Mode3
ltx/en_us_goadedes/tr.d052:trMA.Ode2C12.ode	@ltx/en_us_goadedes/miscellanea:misc.Ode2
ltx/en_us_goadedes/tr.d052:trMA.Ode2C12.text	
ltx/en_us_goadedes/tr.d052:trMA.Ode2C13.incipit	…
ltx/en_us_goadedes/tr.d052:trMA.Ode2C13.melody	@ltx/en_us_goadedes/he.h.m3:heHE.ProsecheGiKaiOurane.name
ltx/en_us_goadedes/tr.d052:trMA.Ode2C13.mode	@ltx/en_us_goadedes/miscellanea:misc.Mode3
ltx/en_us_goadedes/tr.d052:trMA.Ode2C13.ode	@ltx/en_us_goadedes/miscellanea:misc.Ode2
ltx/en_us_goadedes/tr.d052:trMA.Ode2C13.text	
ltx/en_us_goadedes/tr.d052:trMA.Ode2C1H.greekmelody	@ltx/en_us_goadedes/he.h.m3:heHE.ProsecheGiKaiOurane.greekname
ltx/en_us_goadedes/tr.d052:trMA.Ode2C1H.incipit	@ltx/en_us_goadedes/he.h.m3:heHE.ProsecheGiKaiOurane.incipit
ltx/en_us_goadedes/tr.d052:trMA.Ode2C1H.melody	@ltx/en_us_goadedes/he.h.m3:heHE.ProsecheGiKaiOurane.melody
ltx/en_us_goadedes/tr.d052:trMA.Ode2C1H.mode	@ltx/en_us_goadedes/miscellanea:misc.Mode3
ltx/en_us_goadedes/tr.d052:trMA.Ode2C1H.ode	@ltx/en_us_goadedes/miscellanea:misc.Ode2
ltx/en_us_goadedes/tr.d052:trMA.Ode2C1H.text	@ltx/en_us_goadedes/he.h.m3:heHE.ProsecheGiKaiOurane.text
ltx/en_us_goadedes/tr.d052:trMA.Ode2C1T.incipit	…
ltx/en_us_goadedes/tr.d052:trMA.Ode2C1T.melody	@ltx/en_us_goadedes/he.h.m3:heHE.ProsecheGiKaiOurane.name
ltx/en_us_goadedes/tr.d052:trMA.Ode2C1T.mode	@ltx/en_us_goadedes/miscellanea:misc.Mode3
ltx/en_us_goadedes/tr.d052:trMA.Ode2C1T.ode	@ltx/en_us_goadedes/miscellanea:misc.Ode2
ltx/en_us_goadedes/tr.d052:trMA.Ode2C1T.text	
ltx/en_us_goadedes/tr.d052:trMA.Ode2C21.greekmelody	@ltx/en_us_goadedes/he.h.m2:heHE.ProsecheteLaoi.greekname
ltx/en_us_goadedes/tr.d052:trMA.Ode2C21.incipit	…
ltx/en_us_goadedes/tr.d052:trMA.Ode2C21.melody	@ltx/en_us_goadedes/he.h.m2:heHE.ProsecheteLaoi.name
ltx/en_us_goadedes/tr.d052:trMA.Ode2C21.mode	@ltx/en_us_goadedes/miscellanea:misc.Mode2
ltx/en_us_goadedes/tr.d052:trMA.Ode2C21.ode	@ltx/en_us_goadedes/miscellanea:misc.Ode2
ltx/en_us_goadedes/tr.d052:trMA.Ode2C21.text	
ltx/en_us_goadedes/tr.d052:trMA.Ode2C22.incipit	…
ltx/en_us_goadedes/tr.d052:trMA.Ode2C22.melody	@ltx/en_us_goadedes/he.h.m2:heHE.ProsecheteLaoi.name
ltx/en_us_goadedes/tr.d052:trMA.Ode2C22.mode	@ltx/en_us_goadedes/miscellanea:misc.Mode2
ltx/en_us_goadedes/tr.d052:trMA.Ode2C22.ode	@ltx/en_us_goadedes/miscellanea:misc.Ode2
ltx/en_us_goadedes/tr.d052:trMA.Ode2C22.text	
ltx/en_us_goadedes/tr.d052:trMA.Ode2C2A1.incipit	…
ltx/en_us_goadedes/tr.d052:trMA.Ode2C2A1.melody	@ltx/en_us_goadedes/he.h.m2:heHE.ProsecheteLaoi.name
ltx/en_us_goadedes/tr.d052:trMA.Ode2C2A1.mode	@ltx/en_us_goadedes/miscellanea:misc.Mode2
ltx/en_us_goadedes/tr.d052:trMA.Ode2C2A1.ode	@ltx/en_us_goadedes/miscellanea:misc.Ode2
ltx/en_us_goadedes/tr.d052:trMA.Ode2C2A1.text	
ltx/en_us_goadedes/tr.d052:trMA.Ode2C2H.greekmelody	@ltx/en_us_goadedes/he.h.m2:heHE.ProsecheteLaoi.greekname
ltx/en_us_goadedes/tr.d052:trMA.Ode2C2H.incipit	@ltx/en_us_goadedes/he.h.m2:heHE.ProsecheteLaoi.incipit
ltx/en_us_goadedes/tr.d052:trMA.Ode2C2H.melody	@ltx/en_us_goadedes/he.h.m2:heHE.ProsecheteLaoi.melody
ltx/en_us_goadedes/tr.d052:trMA.Ode2C2H.mode	@ltx/en_us_goadedes/miscellanea:misc.Mode2
ltx/en_us_goadedes/tr.d052:trMA.Ode2C2H.ode	@ltx/en_us_goadedes/miscellanea:misc.Ode2
ltx/en_us_goadedes/tr.d052:trMA.Ode2C2H.text	@ltx/en_us_goadedes/he.h.m2:heHE.ProsecheteLaoi.text
ltx/en_us_goadedes/tr.d052:trMA.Ode2C2T.incipit	…
ltx/en_us_goadedes/tr.d052:trMA.Ode2C2T.melody	@ltx/en_us_goadedes/he.h.m2:heHE.ProsecheteLaoi.name
ltx/en_us_goadedes/tr.d052:trMA.Ode2C2T.mode	@ltx/en_us_goadedes/miscellanea:misc.Mode2
ltx/en_us_goadedes/tr.d052:trMA.Ode2C2T.ode	@ltx/en_us_goadedes/miscellanea:misc.Ode2
ltx/en_us_goadedes/tr.d052:trMA.Ode2C2T.text	
ltx/en_us_goadedes/tr.d052:trMA.Ode2C2Tr.incipit	…
ltx/en_us_goadedes/tr.d052:trMA.Ode2C2Tr.melody	@ltx/en_us_goadedes/he.h.m2:heHE.ProsecheteLaoi.name
ltx/en_us_goadedes/tr.d052:trMA.Ode2C2Tr.mode	@ltx/en_us_goadedes/miscellanea:misc.Mode2
ltx/en_us_goadedes/tr.d052:trMA.Ode2C2Tr.ode	@ltx/en_us_goadedes/miscellanea:misc.Ode2
ltx/en_us_goadedes/tr.d052:trMA.Ode2C2Tr.text	
ltx/en_us_goadedes/tr.d052:trMA.Ode8C11.greekmelody	@ltx/en_us_goadedes/he.h.m3:heHE.TonYpAngelon.greekname
ltx/en_us_goadedes/tr.d052:trMA.Ode8C11.incipit	…
ltx/en_us_goadedes/tr.d052:trMA.Ode8C11.melody	@ltx/en_us_goadedes/he.h.m3:heHE.TonYpAngelon.name
ltx/en_us_goadedes/tr.d052:trMA.Ode8C11.mode	@ltx/en_us_goadedes/miscellanea:misc.Mode3
ltx/en_us_goadedes/tr.d052:trMA.Ode8C11.ode	@ltx/en_us_goadedes/miscellanea:misc.Ode8
ltx/en_us_goadedes/tr.d052:trMA.Ode8C11.text	
ltx/en_us_goadedes/tr.d052:trMA.Ode8C12.incipit	…
ltx/en_us_goadedes/tr.d052:trMA.Ode8C12.melody	@ltx/en_us_goadedes/he.h.m3:heHE.TonYpAngelon.name
ltx/en_us_goadedes/tr.d052:trMA.Ode8C12.mode	@ltx/en_us_goadedes/miscellanea:misc.Mode3
ltx/en_us_goadedes/tr.d052:trMA.Ode8C12.ode	@ltx/en_us_goadedes/miscellanea:misc.Ode8
ltx/en_us_goadedes/tr.d052:trMA.Ode8C12.text	
ltx/en_us_goadedes/tr.d052:trMA.Ode8C13.incipit	…
ltx/en_us_goadedes/tr.d052:trMA.Ode8C13.melody	@ltx/en_us_goadedes/he.h.m3:heHE.TonYpAngelon.name
ltx/en_us_goadedes/tr.d052:trMA.Ode8C13.mode	@ltx/en_us_goadedes/miscellanea:misc.Mode3
ltx/en_us_goadedes/tr.d052:trMA.Ode8C13.ode	@ltx/en_us_goadedes/miscellanea:misc.Ode8
ltx/en_us_goadedes/tr.d052:trMA.Ode8C13.text	
ltx/en_us_goadedes/tr.d052:trMA.Ode8C1T.incipit	…
ltx/en_us_goadedes/tr.d052:trMA.Ode8C1T.melody	@ltx/en_us_goadedes/he.h.m3:heHE.TonYpAngelon.name
ltx/en_us_goadedes/tr.d052:trMA.Ode8C1T.mode	@ltx/en_us_goadedes/miscellanea:misc.Mode3
ltx/en_us_goadedes/tr.d052:trMA.Ode8C1T.ode	@ltx/en_us_goadedes/miscellanea:misc.Ode8
ltx/en_us_goadedes/tr.d052:trMA.Ode8C1T.text	
ltx/en_us_goadedes/tr.d052:trMA.Ode8C21.greekmelody	@ltx/en_us_goadedes/he.h.m2:heHE.TonPalaiDrosisanta.greekname
ltx/en_us_goadedes/tr.d052:trMA.Ode8C21.incipit	…
ltx/en_us_goadedes/tr.d052:trMA.Ode8C21.melody	@ltx/en_us_goadedes/he.h.m2:heHE.TonPalaiDrosisanta.name
ltx/en_us_goadedes/tr.d052:trMA.Ode8C21.mode	@ltx/en_us_goadedes/miscellanea:misc.Mode2
ltx/en_us_goadedes/tr.d052:trMA.Ode8C21.ode	@ltx/en_us_goadedes/miscellanea:misc.Ode8
ltx/en_us_goadedes/tr.d052:trMA.Ode8C21.text	
ltx/en_us_goadedes/tr.d052:trMA.Ode8C22.incipit	…
ltx/en_us_goadedes/tr.d052:trMA.Ode8C22.melody	@ltx/en_us_goadedes/he.h.m2:heHE.TonPalaiDrosisanta.name
ltx/en_us_goadedes/tr.d052:trMA.Ode8C22.mode	@ltx/en_us_goadedes/miscellanea:misc.Mode2
ltx/en_us_goadedes/tr.d052:trMA.Ode8C22.ode	@ltx/en_us_goadedes/miscellanea:misc.Ode8
ltx/en_us_goadedes/tr.d052:trMA.Ode8C22.text	
ltx/en_us_goadedes/tr.d052:trMA.Ode8C2A1.incipit	…
ltx/en_us_goadedes/tr.d052:trMA.Ode8C2A1.melody	@ltx/en_us_goadedes/he.h.m2:heHE.TonPalaiDrosisanta.name
ltx/en_us_goadedes/tr.d052:trMA.Ode8C2A1.mode	@ltx/en_us_goadedes/miscellanea:misc.Mode2
ltx/en_us_goadedes/tr.d052:trMA.Ode8C2A1.ode	@ltx/en_us_goadedes/miscellanea:misc.Ode8
ltx/en_us_goadedes/tr.d052:trMA.Ode8C2A1.text	
ltx/en_us_goadedes/tr.d052:trMA.Ode8C2H.greekmelody	@ltx/en_us_goadedes/he.h.m2:heHE.TonPalaiDrosisanta.greekname
ltx/en_us_goadedes/tr.d052:trMA.Ode8C2H.incipit	@ltx/en_us_goadedes/he.h.m2:heHE.TonPalaiDrosisanta.incipit
ltx/en_us_goadedes/tr.d052:trMA.Ode8C2H.melody	@ltx/en_us_goadedes/he.h.m2:heHE.TonPalaiDrosisanta.melody
ltx/en_us_goadedes/tr.d052:trMA.Ode8C2H.mode	@ltx/en_us_goadedes/miscellanea:misc.Mode2
ltx/en_us_goadedes/tr.d052:trMA.Ode8C2H.ode	@ltx/en_us_goadedes/miscellanea:misc.Ode8
ltx/en_us_goadedes/tr.d052:trMA.Ode8C2H.text	@ltx/en_us_goadedes/he.h.m2:heHE.TonPalaiDrosisanta.text
ltx/en_us_goadedes/tr.d052:trMA.Ode8C2T.incipit	…
ltx/en_us_goadedes/tr.d052:trMA.Ode8C2T.melody	@ltx/en_us_goadedes/he.h.m2:heHE.TonPalaiDrosisanta.name
ltx/en_us_goadedes/tr.d052:trMA.Ode8C2T.mode	@ltx/en_us_goadedes/miscellanea:misc.Mode2
ltx/en_us_goadedes/tr.d052:trMA.Ode8C2T.ode	@ltx/en_us_goadedes/miscellanea:misc.Ode8
ltx/en_us_goadedes/tr.d052:trMA.Ode8C2T.text	
ltx/en_us_goadedes/tr.d052:trMA.Ode8C2Tr.incipit	…
ltx/en_us_goadedes/tr.d052:trMA.Ode8C2Tr.melody	@ltx/en_us_goadedes/he.h.m2:heHE.TonPalaiDrosisanta.name
ltx/en_us_goadedes/tr.d052:trMA.Ode8C2Tr.mode	@ltx/en_us_goadedes/miscellanea:misc.Mode2
ltx/en_us_goadedes/tr.d052:trMA.Ode8C2Tr.ode	@ltx/en_us_goadedes/miscellanea:misc.Ode8
ltx/en_us_goadedes/tr.d052:trMA.Ode8C2Tr.text	
ltx/en_us_goadedes/tr.d052:trMA.Ode9C11.greekmelody	@ltx/en_us_goadedes/he.h.m3:heHE.SeTinAkataflekton.greekname
ltx/en_us_goadedes/tr.d052:trMA.Ode9C11.incipit	…
ltx/en_us_goadedes/tr.d052:trMA.Ode9C11.melody	@ltx/en_us_goadedes/he.h.m3:heHE.SeTinAkataflekton.name
ltx/en_us_goadedes/tr.d052:trMA.Ode9C11.mode	@ltx/en_us_goadedes/miscellanea:misc.Mode3
ltx/en_us_goadedes/tr.d052:trMA.Ode9C11.ode	@ltx/en_us_goadedes/miscellanea:misc.Ode9
ltx/en_us_goadedes/tr.d052:trMA.Ode9C11.text	
ltx/en_us_goadedes/tr.d052:trMA.Ode9C12.incipit	…
ltx/en_us_goadedes/tr.d052:trMA.Ode9C12.melody	@ltx/en_us_goadedes/he.h.m3:heHE.SeTinAkataflekton.name
ltx/en_us_goadedes/tr.d052:trMA.Ode9C12.mode	@ltx/en_us_goadedes/miscellanea:misc.Mode3
ltx/en_us_goadedes/tr.d052:trMA.Ode9C12.ode	@ltx/en_us_goadedes/miscellanea:misc.Ode9
ltx/en_us_goadedes/tr.d052:trMA.Ode9C12.text	
ltx/en_us_goadedes/tr.d052:trMA.Ode9C13.incipit	…
ltx/en_us_goadedes/tr.d052:trMA.Ode9C13.melody	@ltx/en_us_goadedes/he.h.m3:heHE.SeTinAkataflekton.name
ltx/en_us_goadedes/tr.d052:trMA.Ode9C13.mode	@ltx/en_us_goadedes/miscellanea:misc.Mode3
ltx/en_us_goadedes/tr.d052:trMA.Ode9C13.ode	@ltx/en_us_goadedes/miscellanea:misc.Ode9
ltx/en_us_goadedes/tr.d052:trMA.Ode9C13.text	
ltx/en_us_goadedes/tr.d052:trMA.Ode9C1T.incipit	…
ltx/en_us_goadedes/tr.d052:trMA.Ode9C1T.melody	@ltx/en_us_goadedes/he.h.m3:heHE.SeTinAkataflekton.name
ltx/en_us_goadedes/tr.d052:trMA.Ode9C1T.mode	@ltx/en_us_goadedes/miscellanea:misc.Mode3
ltx/en_us_goadedes/tr.d052:trMA.Ode9C1T.ode	@ltx/en_us_goadedes/miscellanea:misc.Ode9
ltx/en_us_goadedes/tr.d052:trMA.Ode9C1T.text	
ltx/en_us_goadedes/tr.d052:trMA.Ode9C21.greekmelody	@ltx/en_us_goadedes/he.h.m2:heHE.TinYperfyosSarki.greekname
ltx/en_us_goadedes/tr.d052:trMA.Ode9C21.incipit	…
ltx/en_us_goadedes/tr.d052:trMA.Ode9C21.melody	@ltx/en_us_goadedes/he.h.m2:heHE.TinYperfyosSarki.name
ltx/en_us_goadedes/tr.d052:trMA.Ode9C21.mode	@ltx/en_us_goadedes/miscellanea:misc.Mode2
ltx/en_us_goadedes/tr.d052:trMA.Ode9C21.ode	@ltx/en_us_goadedes/miscellanea:misc.Ode9
ltx/en_us_goadedes/tr.d052:trMA.Ode9C21.text	
ltx/en_us_goadedes/tr.d052:trMA.Ode9C22.incipit	…
ltx/en_us_goadedes/tr.d052:trMA.Ode9C22.melody	@ltx/en_us_goadedes/he.h.m2:heHE.TinYperfyosSarki.name
ltx/en_us_goadedes/tr.d052:trMA.Ode9C22.mode	@ltx/en_us_goadedes/miscellanea:misc.Mode2
ltx/en_us_goadedes/tr.d052:trMA.Ode9C22.ode	@ltx/en_us_goadedes/miscellanea:misc.Ode9
ltx/en_us_goadedes/tr.d052:trMA.Ode9C22.text	
ltx/en_us_goadedes/tr.d052:trMA.Ode9C2A1.incipit	…
ltx/en_us_goadedes/tr.d052:trMA.Ode9C2A1.melody	@ltx/en_us_goadedes/he.h.m2:heHE.TinYperfyosSarki.name
ltx/en_us_goadedes/tr.d052:trMA.Ode9C2A1.mode	@ltx/en_us_goadedes/miscellanea:misc.Mode2
ltx/en_us_goadedes/tr.d052:trMA.Ode9C2A1.ode	@ltx/en_us_goadedes/miscellanea:misc.Ode9
ltx/en_us_goadedes/tr.d052:trMA.Ode9C2A1.text	
ltx/en_us_goadedes/tr.d052:trMA.Ode9C2H.greekmelody	@ltx/en_us_goadedes/he.h.m2:heHE.TinYperfyosSarki.greekname
ltx/en_us_goadedes/tr.d052:trMA.Ode9C2H.incipit	@ltx/en_us_goadedes/he.h.m2:heHE.TinYperfyosSarki.incipit
ltx/en_us_goadedes/tr.d052:trMA.Ode9C2H.melody	@ltx/en_us_goadedes/he.h.m2:heHE.TinYperfyosSarki.melody
ltx/en_us_goadedes/tr.d052:trMA.Ode9C2H.mode	@ltx/en_us_goadedes/miscellanea:misc.Mode2
ltx/en_us_goadedes/tr.d052:trMA.Ode9C2H.ode	@ltx/en_us_goadedes/miscellanea:misc.Ode9
ltx/en_us_goadedes/tr.d052:trMA.Ode9C2H.text	@ltx/en_us_goadedes/he.h.m2:heHE.TinYperfyosSarki.text
ltx/en_us_goadedes/tr.d052:trMA.Ode9C2T.incipit	…
ltx/en_us_goadedes/tr.d052:trMA.Ode9C2T.melody	@ltx/en_us_goadedes/he.h.m2:heHE.TinYperfyosSarki.name
ltx/en_us_goadedes/tr.d052:trMA.Ode9C2T.mode	@ltx/en_us_goadedes/miscellanea:misc.Mode2
ltx/en_us_goadedes/tr.d052:trMA.Ode9C2T.ode	@ltx/en_us_goadedes/miscellanea:misc.Ode9
ltx/en_us_goadedes/tr.d052:trMA.Ode9C2T.text	
ltx/en_us_goadedes/tr.d052:trMA.Ode9C2Tr.incipit	…
ltx/en_us_goadedes/tr.d052:trMA.Ode9C2Tr.melody	@ltx/en_us_goadedes/he.h.m2:heHE.TinYperfyosSarki.name
ltx/en_us_goadedes/tr.d052:trMA.Ode9C2Tr.mode	@ltx/en_us_goadedes/miscellanea:misc.Mode2
ltx/en_us_goadedes/tr.d052:trMA.Ode9C2Tr.ode	@ltx/en_us_goadedes/miscellanea:misc.Ode9
ltx/en_us_goadedes/tr.d052:trMA.Ode9C2Tr.text	
ltx/en_us_goadedes/tr.d052:trTE.Troparion.incipit	…
ltx/en_us_goadedes/tr.d052:trTE.Troparion.melody	
ltx/en_us_goadedes/tr.d052:trTE.Troparion.mode	@ltx/en_us_goadedes/miscellanea:misc.Mode3
ltx/en_us_goadedes/tr.d052:trTE.Troparion.text	
ltx/en_us_goadedes/tr.d052:trTE.Troparion2.incipit	…
ltx/en_us_goadedes/tr.d052:trTE.Troparion2.text	
ltx/en_us_goadedes/tr.d052:trVE.AposIdiomelon1.incipit	…
ltx/en_us_goadedes/tr.d052:trVE.AposIdiomelon1.melody	@ltx/en_us_goadedes/miscellanea:misc.Idiomelon
ltx/en_us_goadedes/tr.d052:trVE.AposIdiomelon1.mode	@ltx/en_us_goadedes/miscellanea:misc.Mode7
ltx/en_us_goadedes/tr.d052:trVE.AposIdiomelon1.text	
ltx/en_us_goadedes/tr.d052:trVE.AposIdiomelon2.incipit	…
ltx/en_us_goadedes/tr.d052:trVE.AposIdiomelon2.melody	@ltx/en_us_goadedes/miscellanea:misc.Idiomelon
ltx/en_us_goadedes/tr.d052:trVE.AposIdiomelon2.mode	@ltx/en_us_goadedes/miscellanea:misc.Mode4
ltx/en_us_goadedes/tr.d052:trVE.AposIdiomelon2.text	
ltx/en_us_goadedes/tr.d052:trVE.AposMartyric.incipit	@ltx/en_us_goadedes/oc.m4.d3:ocVE.Aposticha3.incipit
ltx/en_us_goadedes/tr.d052:trVE.AposMartyric.melody	
ltx/en_us_goadedes/tr.d052:trVE.AposMartyric.mode	@ltx/en_us_goadedes/miscellanea:misc.Mode4
ltx/en_us_goadedes/tr.d052:trVE.AposMartyric.text	@ltx/en_us_goadedes/oc.m4.d3:ocVE.Aposticha3.text
ltx/en_us_goadedes/tr.d052:trVE.AposTheotokion.incipit	@ltx/en_us_goadedes/oc.m4.d2:ocMA.AposTheotokion.incipit
ltx/en_us_goadedes/tr.d052:trVE.AposTheotokion.melody	
ltx/en_us_goadedes/tr.d052:trVE.AposTheotokion.mode	@ltx/en_us_goadedes/miscellanea:misc.Mode4
ltx/en_us_goadedes/tr.d052:trVE.AposTheotokion.text	@ltx/en_us_goadedes/oc.m4.d2:ocMA.AposTheotokion.text
ltx/en_us_goadedes/tr.d052:trVE.Stichera01.greekmelody	@ltx/en_us_goadedes/he.a.m3:heAU.StavrofanosMoysis.greekname
ltx/en_us_goadedes/tr.d052:trVE.Stichera01.incipit	…
ltx/en_us_goadedes/tr.d052:trVE.Stichera01.melody	@ltx/en_us_goadedes/he.a.m3:heAU.StavrofanosMoysis.name
ltx/en_us_goadedes/tr.d052:trVE.Stichera01.mode	@ltx/en_us_goadedes/miscellanea:misc.Mode3
ltx/en_us_goadedes/tr.d052:trVE.Stichera01.text	
ltx/en_us_goadedes/tr.d052:trVE.Stichera02.greekmelody	@ltx/en_us_goadedes/he.a.m3:heAU.StavrofanosMoysis.greekname
ltx/en_us_goadedes/tr.d052:trVE.Stichera02.incipit	…
ltx/en_us_goadedes/tr.d052:trVE.Stichera02.melody	@ltx/en_us_goadedes/he.a.m3:heAU.StavrofanosMoysis.name
ltx/en_us_goadedes/tr.d052:trVE.Stichera02.mode	@ltx/en_us_goadedes/miscellanea:misc.Mode3
ltx/en_us_goadedes/tr.d052:trVE.Stichera02.text	
ltx/en_us_goadedes/tr.d052:trVE.Stichera03.incipit	…
ltx/en_us_goadedes/tr.d052:trVE.Stichera03.melody	
ltx/en_us_goadedes/tr.d052:trVE.Stichera03.mode	@ltx/en_us_goadedes/miscellanea:misc.Mode2
ltx/en_us_goadedes/tr.d052:trVE.Stichera03.text	
