ltx/en_us_goadedes/da.d1:daCommemoration.text	
ltx/en_us_goadedes/da.d1:daDay.text	Sunday.
ltx/en_us_goadedes/da.d1:daForDay.text	
ltx/en_us_goadedes/da.d1:daLI.GospelAlleluia.text	@ltx/en_us_goadedes/prayers:pr.Alleluia3.text
ltx/en_us_goadedes/da.d1:daLI.MM.CommunionHymn.text	@ltx/en_us_goadedes/properties:media.key
ltx/en_us_goadedes/da.d1:daOnDay.text	on Sunday,
ltx/en_us_goadedes/da.d1:daVE.OnTheDayBefore.text	
ltx/en_us_goadedes/da.d1:daVE.OnTheEveningBefore.text	@ltx/en_us_goadedes/template.titles:d.onSaturdayEvening
