ltx/en_us_goadedes/me.m05.d13:meDA.commemoration.first	
ltx/en_us_goadedes/me.m05.d13:meDA.commemoration.first_name	
ltx/en_us_goadedes/me.m05.d13:meDA.commemoration.first_short	
ltx/en_us_goadedes/me.m05.d13:meDA.commemoration.first_title	@ltx/en_us_goadedes/titles:ti.SaintW
ltx/en_us_goadedes/me.m05.d13:meDA.commemoration.full	
ltx/en_us_goadedes/me.m05.d13:meDA.commemoration.second_name	
ltx/en_us_goadedes/me.m05.d13:meDA.commemoration.second_title	
ltx/en_us_goadedes/me.m05.d13:meDA.date	
ltx/en_us_goadedes/me.m05.d13:meDA.fordate	
ltx/en_us_goadedes/me.m05.d13:meDA.insert1	
ltx/en_us_goadedes/me.m05.d13:meDA.insert2	
ltx/en_us_goadedes/me.m05.d13:meDA.note	
ltx/en_us_goadedes/me.m05.d13:meDA.pdfcoverdate	
ltx/en_us_goadedes/me.m05.d13:meDA.pdfheaderdate	
ltx/en_us_goadedes/me.m05.d13:meHO.commemorations	
ltx/en_us_goadedes/me.m05.d13:meHO.note1	
ltx/en_us_goadedes/me.m05.d13:meHO.note2	
ltx/en_us_goadedes/me.m05.d13:meHO.number	
ltx/en_us_goadedes/me.m05.d13:meHO.rank	
ltx/en_us_goadedes/me.m05.d13:meLE.commemoration1	
ltx/en_us_goadedes/me.m05.d13:meLE.commemoration2	
ltx/en_us_goadedes/me.m05.d13:meLI.Kontakion1.greekmelody	@ltx/en_us_goadedes/me.m05.d13:meMA.Kontakion1.greekmelody
ltx/en_us_goadedes/me.m05.d13:meLI.Kontakion1.incipit	@ltx/en_us_goadedes/me.m05.d13:meMA.Kontakion1.incipit
ltx/en_us_goadedes/me.m05.d13:meLI.Kontakion1.melody	@ltx/en_us_goadedes/me.m05.d13:meMA.Kontakion1.melody
ltx/en_us_goadedes/me.m05.d13:meLI.Kontakion1.mode	@ltx/en_us_goadedes/me.m05.d13:meMA.Kontakion1.mode
ltx/en_us_goadedes/me.m05.d13:meLI.Kontakion1.text	@ltx/en_us_goadedes/me.m05.d13:meMA.Kontakion1.text
ltx/en_us_goadedes/me.m05.d13:meLI.MM.CommunionHymn.text	@ltx/en_us_goadedes/properties:media.key
ltx/en_us_goadedes/me.m05.d13:meLI.Megalynarion.text	
ltx/en_us_goadedes/me.m05.d13:meMA.C1.title	@ltx/en_us_goadedes/titles:ti.CanonSaintW
ltx/en_us_goadedes/me.m05.d13:meMA.C1.verse	@ltx/en_us_goadedes/prayers:pr.verse_SaintW.text
ltx/en_us_goadedes/me.m05.d13:meMA.Kontakion1.greekmelody	@ltx/en_us_goadedes/he.a.m3:heAU.IParthenosSimeron.greekname
ltx/en_us_goadedes/me.m05.d13:meMA.Kontakion1.incipit	…
ltx/en_us_goadedes/me.m05.d13:meMA.Kontakion1.melody	@ltx/en_us_goadedes/he.a.m3:heAU.IParthenosSimeron.name
ltx/en_us_goadedes/me.m05.d13:meMA.Kontakion1.mode	@ltx/en_us_goadedes/miscellanea:misc.Mode3
ltx/en_us_goadedes/me.m05.d13:meMA.Kontakion1.text	
ltx/en_us_goadedes/me.m05.d13:meMA.Ode1C11.greekmelody	@ltx/en_us_goadedes/he.h.m2:heHE.DefteLaoi.greekname
ltx/en_us_goadedes/me.m05.d13:meMA.Ode1C11.incipit	…
ltx/en_us_goadedes/me.m05.d13:meMA.Ode1C11.melody	@ltx/en_us_goadedes/he.h.m2:heHE.DefteLaoi.name
ltx/en_us_goadedes/me.m05.d13:meMA.Ode1C11.mode	@ltx/en_us_goadedes/miscellanea:misc.Mode2
ltx/en_us_goadedes/me.m05.d13:meMA.Ode1C11.ode	@ltx/en_us_goadedes/miscellanea:misc.Ode1
ltx/en_us_goadedes/me.m05.d13:meMA.Ode1C11.text	
ltx/en_us_goadedes/me.m05.d13:meMA.Ode1C12.incipit	…
ltx/en_us_goadedes/me.m05.d13:meMA.Ode1C12.melody	@ltx/en_us_goadedes/he.h.m2:heHE.DefteLaoi.name
ltx/en_us_goadedes/me.m05.d13:meMA.Ode1C12.mode	@ltx/en_us_goadedes/miscellanea:misc.Mode2
ltx/en_us_goadedes/me.m05.d13:meMA.Ode1C12.ode	@ltx/en_us_goadedes/miscellanea:misc.Ode1
ltx/en_us_goadedes/me.m05.d13:meMA.Ode1C12.text	
ltx/en_us_goadedes/me.m05.d13:meMA.Ode1C13.incipit	…
ltx/en_us_goadedes/me.m05.d13:meMA.Ode1C13.melody	@ltx/en_us_goadedes/he.h.m2:heHE.DefteLaoi.name
ltx/en_us_goadedes/me.m05.d13:meMA.Ode1C13.mode	@ltx/en_us_goadedes/miscellanea:misc.Mode2
ltx/en_us_goadedes/me.m05.d13:meMA.Ode1C13.ode	@ltx/en_us_goadedes/miscellanea:misc.Ode1
ltx/en_us_goadedes/me.m05.d13:meMA.Ode1C13.text	
ltx/en_us_goadedes/me.m05.d13:meMA.Ode1C1T.incipit	…
ltx/en_us_goadedes/me.m05.d13:meMA.Ode1C1T.melody	@ltx/en_us_goadedes/he.h.m2:heHE.DefteLaoi.name
ltx/en_us_goadedes/me.m05.d13:meMA.Ode1C1T.mode	@ltx/en_us_goadedes/miscellanea:misc.Mode2
ltx/en_us_goadedes/me.m05.d13:meMA.Ode1C1T.ode	@ltx/en_us_goadedes/miscellanea:misc.Ode1
ltx/en_us_goadedes/me.m05.d13:meMA.Ode1C1T.text	
ltx/en_us_goadedes/me.m05.d13:meMA.Ode3C11.greekmelody	@ltx/en_us_goadedes/he.h.m2:heHE.StereosonImasEnSoiKyrie.greekname
ltx/en_us_goadedes/me.m05.d13:meMA.Ode3C11.incipit	…
ltx/en_us_goadedes/me.m05.d13:meMA.Ode3C11.melody	@ltx/en_us_goadedes/he.h.m2:heHE.StereosonImasEnSoiKyrie.name
ltx/en_us_goadedes/me.m05.d13:meMA.Ode3C11.mode	@ltx/en_us_goadedes/miscellanea:misc.Mode2
ltx/en_us_goadedes/me.m05.d13:meMA.Ode3C11.ode	@ltx/en_us_goadedes/miscellanea:misc.Ode3
ltx/en_us_goadedes/me.m05.d13:meMA.Ode3C11.text	
ltx/en_us_goadedes/me.m05.d13:meMA.Ode3C12.incipit	…
ltx/en_us_goadedes/me.m05.d13:meMA.Ode3C12.melody	@ltx/en_us_goadedes/he.h.m2:heHE.StereosonImasEnSoiKyrie.name
ltx/en_us_goadedes/me.m05.d13:meMA.Ode3C12.mode	@ltx/en_us_goadedes/miscellanea:misc.Mode2
ltx/en_us_goadedes/me.m05.d13:meMA.Ode3C12.ode	@ltx/en_us_goadedes/miscellanea:misc.Ode3
ltx/en_us_goadedes/me.m05.d13:meMA.Ode3C12.text	
ltx/en_us_goadedes/me.m05.d13:meMA.Ode3C1T.incipit	…
ltx/en_us_goadedes/me.m05.d13:meMA.Ode3C1T.melody	@ltx/en_us_goadedes/he.h.m2:heHE.StereosonImasEnSoiKyrie.name
ltx/en_us_goadedes/me.m05.d13:meMA.Ode3C1T.mode	@ltx/en_us_goadedes/miscellanea:misc.Mode2
ltx/en_us_goadedes/me.m05.d13:meMA.Ode3C1T.ode	@ltx/en_us_goadedes/miscellanea:misc.Ode3
ltx/en_us_goadedes/me.m05.d13:meMA.Ode3C1T.text	
ltx/en_us_goadedes/me.m05.d13:meMA.Ode3H.greekmelody	@ltx/en_us_goadedes/he.h.m2:heHE.StereosonImasEnSoiKyrie.greekname
ltx/en_us_goadedes/me.m05.d13:meMA.Ode3H.incipit	@ltx/en_us_goadedes/he.h.m2:heHE.StereosonImasEnSoiKyrie.incipit
ltx/en_us_goadedes/me.m05.d13:meMA.Ode3H.melody	@ltx/en_us_goadedes/he.h.m2:heHE.StereosonImasEnSoiKyrie.melody
ltx/en_us_goadedes/me.m05.d13:meMA.Ode3H.mode	@ltx/en_us_goadedes/miscellanea:misc.Mode2
ltx/en_us_goadedes/me.m05.d13:meMA.Ode3H.ode	@ltx/en_us_goadedes/miscellanea:misc.Ode3
ltx/en_us_goadedes/me.m05.d13:meMA.Ode3H.text	@ltx/en_us_goadedes/he.h.m2:heHE.StereosonImasEnSoiKyrie.text
ltx/en_us_goadedes/me.m05.d13:meMA.Ode3Kathisma1.greekmelody	@ltx/en_us_goadedes/he.a.m4:heAU.OYpsotheisEnToStavro.greekname
ltx/en_us_goadedes/me.m05.d13:meMA.Ode3Kathisma1.incipit	…
ltx/en_us_goadedes/me.m05.d13:meMA.Ode3Kathisma1.melody	@ltx/en_us_goadedes/he.a.m4:heAU.OYpsotheisEnToStavro.name
ltx/en_us_goadedes/me.m05.d13:meMA.Ode3Kathisma1.mode	@ltx/en_us_goadedes/miscellanea:misc.Mode4
ltx/en_us_goadedes/me.m05.d13:meMA.Ode3Kathisma1.text	
ltx/en_us_goadedes/me.m05.d13:meMA.Ode4C11.greekmelody	@ltx/en_us_goadedes/he.h.m2:heHE.EisakikoaKyrieTinAkoin.greekname
ltx/en_us_goadedes/me.m05.d13:meMA.Ode4C11.incipit	…
ltx/en_us_goadedes/me.m05.d13:meMA.Ode4C11.melody	@ltx/en_us_goadedes/he.h.m2:heHE.EisakikoaKyrieTinAkoin.name
ltx/en_us_goadedes/me.m05.d13:meMA.Ode4C11.mode	@ltx/en_us_goadedes/miscellanea:misc.Mode2
ltx/en_us_goadedes/me.m05.d13:meMA.Ode4C11.ode	@ltx/en_us_goadedes/miscellanea:misc.Ode4
ltx/en_us_goadedes/me.m05.d13:meMA.Ode4C11.text	
ltx/en_us_goadedes/me.m05.d13:meMA.Ode4C12.incipit	…
ltx/en_us_goadedes/me.m05.d13:meMA.Ode4C12.melody	@ltx/en_us_goadedes/he.h.m2:heHE.EisakikoaKyrieTinAkoin.name
ltx/en_us_goadedes/me.m05.d13:meMA.Ode4C12.mode	@ltx/en_us_goadedes/miscellanea:misc.Mode2
ltx/en_us_goadedes/me.m05.d13:meMA.Ode4C12.ode	@ltx/en_us_goadedes/miscellanea:misc.Ode4
ltx/en_us_goadedes/me.m05.d13:meMA.Ode4C12.text	
ltx/en_us_goadedes/me.m05.d13:meMA.Ode4C1T.incipit	…
ltx/en_us_goadedes/me.m05.d13:meMA.Ode4C1T.melody	@ltx/en_us_goadedes/he.h.m2:heHE.EisakikoaKyrieTinAkoin.name
ltx/en_us_goadedes/me.m05.d13:meMA.Ode4C1T.mode	@ltx/en_us_goadedes/miscellanea:misc.Mode2
ltx/en_us_goadedes/me.m05.d13:meMA.Ode4C1T.ode	@ltx/en_us_goadedes/miscellanea:misc.Ode4
ltx/en_us_goadedes/me.m05.d13:meMA.Ode4C1T.text	
ltx/en_us_goadedes/me.m05.d13:meMA.Ode5C11.greekmelody	@ltx/en_us_goadedes/he.h.m2:heHE.OFotismos.greekname
ltx/en_us_goadedes/me.m05.d13:meMA.Ode5C11.incipit	…
ltx/en_us_goadedes/me.m05.d13:meMA.Ode5C11.melody	@ltx/en_us_goadedes/he.h.m2:heHE.OFotismos.name
ltx/en_us_goadedes/me.m05.d13:meMA.Ode5C11.mode	@ltx/en_us_goadedes/miscellanea:misc.Mode2
ltx/en_us_goadedes/me.m05.d13:meMA.Ode5C11.ode	@ltx/en_us_goadedes/miscellanea:misc.Ode5
ltx/en_us_goadedes/me.m05.d13:meMA.Ode5C11.text	
ltx/en_us_goadedes/me.m05.d13:meMA.Ode5C12.incipit	…
ltx/en_us_goadedes/me.m05.d13:meMA.Ode5C12.melody	@ltx/en_us_goadedes/he.h.m2:heHE.OFotismos.name
ltx/en_us_goadedes/me.m05.d13:meMA.Ode5C12.mode	@ltx/en_us_goadedes/miscellanea:misc.Mode2
ltx/en_us_goadedes/me.m05.d13:meMA.Ode5C12.ode	@ltx/en_us_goadedes/miscellanea:misc.Ode5
ltx/en_us_goadedes/me.m05.d13:meMA.Ode5C12.text	
ltx/en_us_goadedes/me.m05.d13:meMA.Ode5C1T.incipit	…
ltx/en_us_goadedes/me.m05.d13:meMA.Ode5C1T.melody	@ltx/en_us_goadedes/he.h.m2:heHE.OFotismos.name
ltx/en_us_goadedes/me.m05.d13:meMA.Ode5C1T.mode	@ltx/en_us_goadedes/miscellanea:misc.Mode2
ltx/en_us_goadedes/me.m05.d13:meMA.Ode5C1T.ode	@ltx/en_us_goadedes/miscellanea:misc.Ode5
ltx/en_us_goadedes/me.m05.d13:meMA.Ode5C1T.text	
ltx/en_us_goadedes/me.m05.d13:meMA.Ode6C11.greekmelody	@ltx/en_us_goadedes/he.h.m2:heHE.EnAvyssoPtaismaton.greekname
ltx/en_us_goadedes/me.m05.d13:meMA.Ode6C11.incipit	…
ltx/en_us_goadedes/me.m05.d13:meMA.Ode6C11.melody	@ltx/en_us_goadedes/he.h.m2:heHE.EnAvyssoPtaismaton.name
ltx/en_us_goadedes/me.m05.d13:meMA.Ode6C11.mode	@ltx/en_us_goadedes/miscellanea:misc.Mode2
ltx/en_us_goadedes/me.m05.d13:meMA.Ode6C11.ode	@ltx/en_us_goadedes/miscellanea:misc.Ode6
ltx/en_us_goadedes/me.m05.d13:meMA.Ode6C11.text	
ltx/en_us_goadedes/me.m05.d13:meMA.Ode6C12.incipit	…
ltx/en_us_goadedes/me.m05.d13:meMA.Ode6C12.melody	@ltx/en_us_goadedes/he.h.m2:heHE.EnAvyssoPtaismaton.name
ltx/en_us_goadedes/me.m05.d13:meMA.Ode6C12.mode	@ltx/en_us_goadedes/miscellanea:misc.Mode2
ltx/en_us_goadedes/me.m05.d13:meMA.Ode6C12.ode	@ltx/en_us_goadedes/miscellanea:misc.Ode6
ltx/en_us_goadedes/me.m05.d13:meMA.Ode6C12.text	
ltx/en_us_goadedes/me.m05.d13:meMA.Ode6C1T.incipit	…
ltx/en_us_goadedes/me.m05.d13:meMA.Ode6C1T.melody	@ltx/en_us_goadedes/he.h.m2:heHE.EnAvyssoPtaismaton.name
ltx/en_us_goadedes/me.m05.d13:meMA.Ode6C1T.mode	@ltx/en_us_goadedes/miscellanea:misc.Mode2
ltx/en_us_goadedes/me.m05.d13:meMA.Ode6C1T.ode	@ltx/en_us_goadedes/miscellanea:misc.Ode6
ltx/en_us_goadedes/me.m05.d13:meMA.Ode6C1T.text	
ltx/en_us_goadedes/me.m05.d13:meMA.Ode6H.greekmelody	@ltx/en_us_goadedes/he.h.m2:heHE.EnAvyssoPtaismaton.greekname
ltx/en_us_goadedes/me.m05.d13:meMA.Ode6H.incipit	@ltx/en_us_goadedes/he.h.m2:heHE.EnAvyssoPtaismaton.incipit
ltx/en_us_goadedes/me.m05.d13:meMA.Ode6H.melody	@ltx/en_us_goadedes/he.h.m2:heHE.EnAvyssoPtaismaton.melody
ltx/en_us_goadedes/me.m05.d13:meMA.Ode6H.mode	@ltx/en_us_goadedes/miscellanea:misc.Mode2
ltx/en_us_goadedes/me.m05.d13:meMA.Ode6H.ode	@ltx/en_us_goadedes/miscellanea:misc.Ode6
ltx/en_us_goadedes/me.m05.d13:meMA.Ode6H.text	@ltx/en_us_goadedes/he.h.m2:heHE.EnAvyssoPtaismaton.text
ltx/en_us_goadedes/me.m05.d13:meMA.Ode7C11.greekmelody	@ltx/en_us_goadedes/he.h.m2:heHE.EikonosChrysis.greekname
ltx/en_us_goadedes/me.m05.d13:meMA.Ode7C11.incipit	…
ltx/en_us_goadedes/me.m05.d13:meMA.Ode7C11.melody	@ltx/en_us_goadedes/he.h.m2:heHE.EikonosChrysis.name
ltx/en_us_goadedes/me.m05.d13:meMA.Ode7C11.mode	@ltx/en_us_goadedes/miscellanea:misc.Mode2
ltx/en_us_goadedes/me.m05.d13:meMA.Ode7C11.ode	@ltx/en_us_goadedes/miscellanea:misc.Ode7
ltx/en_us_goadedes/me.m05.d13:meMA.Ode7C11.text	
ltx/en_us_goadedes/me.m05.d13:meMA.Ode7C12.incipit	…
ltx/en_us_goadedes/me.m05.d13:meMA.Ode7C12.melody	@ltx/en_us_goadedes/he.h.m2:heHE.EikonosChrysis.name
ltx/en_us_goadedes/me.m05.d13:meMA.Ode7C12.mode	@ltx/en_us_goadedes/miscellanea:misc.Mode2
ltx/en_us_goadedes/me.m05.d13:meMA.Ode7C12.ode	@ltx/en_us_goadedes/miscellanea:misc.Ode7
ltx/en_us_goadedes/me.m05.d13:meMA.Ode7C12.text	
ltx/en_us_goadedes/me.m05.d13:meMA.Ode7C1T.incipit	…
ltx/en_us_goadedes/me.m05.d13:meMA.Ode7C1T.melody	@ltx/en_us_goadedes/he.h.m2:heHE.EikonosChrysis.name
ltx/en_us_goadedes/me.m05.d13:meMA.Ode7C1T.mode	@ltx/en_us_goadedes/miscellanea:misc.Mode2
ltx/en_us_goadedes/me.m05.d13:meMA.Ode7C1T.ode	@ltx/en_us_goadedes/miscellanea:misc.Ode7
ltx/en_us_goadedes/me.m05.d13:meMA.Ode7C1T.text	
ltx/en_us_goadedes/me.m05.d13:meMA.Ode8C11.greekmelody	@ltx/en_us_goadedes/he.h.m2:heHE.TonEnKaminoTouPyros.greekname
ltx/en_us_goadedes/me.m05.d13:meMA.Ode8C11.incipit	…
ltx/en_us_goadedes/me.m05.d13:meMA.Ode8C11.melody	@ltx/en_us_goadedes/he.h.m2:heHE.TonEnKaminoTouPyros.name
ltx/en_us_goadedes/me.m05.d13:meMA.Ode8C11.mode	@ltx/en_us_goadedes/miscellanea:misc.Mode2
ltx/en_us_goadedes/me.m05.d13:meMA.Ode8C11.ode	@ltx/en_us_goadedes/miscellanea:misc.Ode8
ltx/en_us_goadedes/me.m05.d13:meMA.Ode8C11.text	
ltx/en_us_goadedes/me.m05.d13:meMA.Ode8C12.incipit	…
ltx/en_us_goadedes/me.m05.d13:meMA.Ode8C12.melody	@ltx/en_us_goadedes/he.h.m2:heHE.TonEnKaminoTouPyros.name
ltx/en_us_goadedes/me.m05.d13:meMA.Ode8C12.mode	@ltx/en_us_goadedes/miscellanea:misc.Mode2
ltx/en_us_goadedes/me.m05.d13:meMA.Ode8C12.ode	@ltx/en_us_goadedes/miscellanea:misc.Ode8
ltx/en_us_goadedes/me.m05.d13:meMA.Ode8C12.text	
ltx/en_us_goadedes/me.m05.d13:meMA.Ode8C1T.incipit	…
ltx/en_us_goadedes/me.m05.d13:meMA.Ode8C1T.melody	@ltx/en_us_goadedes/he.h.m2:heHE.TonEnKaminoTouPyros.name
ltx/en_us_goadedes/me.m05.d13:meMA.Ode8C1T.mode	@ltx/en_us_goadedes/miscellanea:misc.Mode2
ltx/en_us_goadedes/me.m05.d13:meMA.Ode8C1T.ode	@ltx/en_us_goadedes/miscellanea:misc.Ode8
ltx/en_us_goadedes/me.m05.d13:meMA.Ode8C1T.text	
ltx/en_us_goadedes/me.m05.d13:meMA.Ode8H.greekmelody	@ltx/en_us_goadedes/he.h.m2:heHE.TonEnKaminoTouPyros.greekname
ltx/en_us_goadedes/me.m05.d13:meMA.Ode8H.incipit	@ltx/en_us_goadedes/he.h.m2:heHE.TonEnKaminoTouPyros.incipit
ltx/en_us_goadedes/me.m05.d13:meMA.Ode8H.melody	@ltx/en_us_goadedes/he.h.m2:heHE.TonEnKaminoTouPyros.melody
ltx/en_us_goadedes/me.m05.d13:meMA.Ode8H.mode	@ltx/en_us_goadedes/miscellanea:misc.Mode2
ltx/en_us_goadedes/me.m05.d13:meMA.Ode8H.ode	@ltx/en_us_goadedes/miscellanea:misc.Ode8
ltx/en_us_goadedes/me.m05.d13:meMA.Ode8H.text	@ltx/en_us_goadedes/he.h.m2:heHE.TonEnKaminoTouPyros.text
ltx/en_us_goadedes/me.m05.d13:meMA.Ode9C11.greekmelody	@ltx/en_us_goadedes/he.h.m2:heHE.TonEkTheouTheonLogon.greekname
ltx/en_us_goadedes/me.m05.d13:meMA.Ode9C11.incipit	…
ltx/en_us_goadedes/me.m05.d13:meMA.Ode9C11.melody	@ltx/en_us_goadedes/he.h.m2:heHE.TonEkTheouTheonLogon.name
ltx/en_us_goadedes/me.m05.d13:meMA.Ode9C11.mode	@ltx/en_us_goadedes/miscellanea:misc.Mode2
ltx/en_us_goadedes/me.m05.d13:meMA.Ode9C11.ode	@ltx/en_us_goadedes/miscellanea:misc.Ode9
ltx/en_us_goadedes/me.m05.d13:meMA.Ode9C11.text	
ltx/en_us_goadedes/me.m05.d13:meMA.Ode9C12.incipit	…
ltx/en_us_goadedes/me.m05.d13:meMA.Ode9C12.melody	@ltx/en_us_goadedes/he.h.m2:heHE.TonEkTheouTheonLogon.name
ltx/en_us_goadedes/me.m05.d13:meMA.Ode9C12.mode	@ltx/en_us_goadedes/miscellanea:misc.Mode2
ltx/en_us_goadedes/me.m05.d13:meMA.Ode9C12.ode	@ltx/en_us_goadedes/miscellanea:misc.Ode9
ltx/en_us_goadedes/me.m05.d13:meMA.Ode9C12.text	
ltx/en_us_goadedes/me.m05.d13:meMA.Ode9C1T.incipit	…
ltx/en_us_goadedes/me.m05.d13:meMA.Ode9C1T.melody	@ltx/en_us_goadedes/he.h.m2:heHE.TonEkTheouTheonLogon.name
ltx/en_us_goadedes/me.m05.d13:meMA.Ode9C1T.mode	@ltx/en_us_goadedes/miscellanea:misc.Mode2
ltx/en_us_goadedes/me.m05.d13:meMA.Ode9C1T.ode	@ltx/en_us_goadedes/miscellanea:misc.Ode9
ltx/en_us_goadedes/me.m05.d13:meMA.Ode9C1T.text	
ltx/en_us_goadedes/me.m05.d13:meMA.Ode9H.greekmelody	@ltx/en_us_goadedes/he.h.m2:heHE.TonEkTheouTheonLogon.greekname
ltx/en_us_goadedes/me.m05.d13:meMA.Ode9H.incipit	@ltx/en_us_goadedes/he.h.m2:heHE.TonEkTheouTheonLogon.incipit
ltx/en_us_goadedes/me.m05.d13:meMA.Ode9H.melody	@ltx/en_us_goadedes/he.h.m2:heHE.TonEkTheouTheonLogon.melody
ltx/en_us_goadedes/me.m05.d13:meMA.Ode9H.mode	@ltx/en_us_goadedes/miscellanea:misc.Mode2
ltx/en_us_goadedes/me.m05.d13:meMA.Ode9H.ode	@ltx/en_us_goadedes/miscellanea:misc.Ode9
ltx/en_us_goadedes/me.m05.d13:meMA.Ode9H.text	@ltx/en_us_goadedes/he.h.m2:heHE.TonEkTheouTheonLogon.text
ltx/en_us_goadedes/me.m05.d13:meVE.Apolytikion1ger.greekmelody	@ltx/en_us_goadedes/he.a.m3:heAU.TinOraiotita.greekname
ltx/en_us_goadedes/me.m05.d13:meVE.Apolytikion1ger.incipit	…
ltx/en_us_goadedes/me.m05.d13:meVE.Apolytikion1ger.melody	@ltx/en_us_goadedes/he.a.m3:heAU.TinOraiotita.name
ltx/en_us_goadedes/me.m05.d13:meVE.Apolytikion1ger.mode	@ltx/en_us_goadedes/miscellanea:misc.Mode3
ltx/en_us_goadedes/me.m05.d13:meVE.Apolytikion1ger.poet	@ltx/en_us_goadedes/poets:po.Gerasimou
ltx/en_us_goadedes/me.m05.d13:meVE.Apolytikion1ger.text	
ltx/en_us_goadedes/me.m05.d13:meVE.Stichera01.greekmelody	@ltx/en_us_goadedes/he.a.m4:heAU.OsGennaionEnMartysi.greekname
ltx/en_us_goadedes/me.m05.d13:meVE.Stichera01.incipit	…
ltx/en_us_goadedes/me.m05.d13:meVE.Stichera01.melody	@ltx/en_us_goadedes/he.a.m4:heAU.OsGennaionEnMartysi.name
ltx/en_us_goadedes/me.m05.d13:meVE.Stichera01.mode	@ltx/en_us_goadedes/miscellanea:misc.Mode4
ltx/en_us_goadedes/me.m05.d13:meVE.Stichera01.text	
ltx/en_us_goadedes/me.m05.d13:meVE.Stichera02.incipit	…
ltx/en_us_goadedes/me.m05.d13:meVE.Stichera02.melody	@ltx/en_us_goadedes/he.a.m4:heAU.OsGennaionEnMartysi.name
ltx/en_us_goadedes/me.m05.d13:meVE.Stichera02.mode	@ltx/en_us_goadedes/miscellanea:misc.Mode4
ltx/en_us_goadedes/me.m05.d13:meVE.Stichera02.text	
ltx/en_us_goadedes/me.m05.d13:meVE.Stichera03.incipit	…
ltx/en_us_goadedes/me.m05.d13:meVE.Stichera03.melody	@ltx/en_us_goadedes/he.a.m4:heAU.OsGennaionEnMartysi.name
ltx/en_us_goadedes/me.m05.d13:meVE.Stichera03.mode	@ltx/en_us_goadedes/miscellanea:misc.Mode4
ltx/en_us_goadedes/me.m05.d13:meVE.Stichera03.text	
