ltx/en_us_goadedes/oc.m8.d4:ocBK.ModeNaked	@ltx/en_us_goadedes/miscellanea:misc.Mode8.naked
ltx/en_us_goadedes/oc.m8.d4:ocLI.Beatitudes1.incipit	@ltx/en_us_goadedes/oc.m8.d1:ocLI.Beatitudes1.incipit
ltx/en_us_goadedes/oc.m8.d4:ocLI.Beatitudes1.melody	
ltx/en_us_goadedes/oc.m8.d4:ocLI.Beatitudes1.mode	@ltx/en_us_goadedes/miscellanea:misc.Mode8
ltx/en_us_goadedes/oc.m8.d4:ocLI.Beatitudes1.text	@ltx/en_us_goadedes/oc.m8.d1:ocLI.Beatitudes1.text
ltx/en_us_goadedes/oc.m8.d4:ocLI.Beatitudes2.incipit	…
ltx/en_us_goadedes/oc.m8.d4:ocLI.Beatitudes2.melody	
ltx/en_us_goadedes/oc.m8.d4:ocLI.Beatitudes2.mode	@ltx/en_us_goadedes/miscellanea:misc.Mode8
ltx/en_us_goadedes/oc.m8.d4:ocLI.Beatitudes2.text	
ltx/en_us_goadedes/oc.m8.d4:ocLI.Beatitudes3.incipit	…
ltx/en_us_goadedes/oc.m8.d4:ocLI.Beatitudes3.melody	
ltx/en_us_goadedes/oc.m8.d4:ocLI.Beatitudes3.mode	@ltx/en_us_goadedes/miscellanea:misc.Mode8
ltx/en_us_goadedes/oc.m8.d4:ocLI.Beatitudes3.text	
ltx/en_us_goadedes/oc.m8.d4:ocLI.Beatitudes4.incipit	…
ltx/en_us_goadedes/oc.m8.d4:ocLI.Beatitudes4.melody	
ltx/en_us_goadedes/oc.m8.d4:ocLI.Beatitudes4.mode	@ltx/en_us_goadedes/miscellanea:misc.Mode8
ltx/en_us_goadedes/oc.m8.d4:ocLI.Beatitudes4.text	
ltx/en_us_goadedes/oc.m8.d4:ocLI.BeatitudesT.incipit	…
ltx/en_us_goadedes/oc.m8.d4:ocLI.BeatitudesT.melody	
ltx/en_us_goadedes/oc.m8.d4:ocLI.BeatitudesT.mode	@ltx/en_us_goadedes/miscellanea:misc.Mode8
ltx/en_us_goadedes/oc.m8.d4:ocLI.BeatitudesT.text	
ltx/en_us_goadedes/oc.m8.d4:ocLI.BeatitudesTr.incipit	…
ltx/en_us_goadedes/oc.m8.d4:ocLI.BeatitudesTr.melody	
ltx/en_us_goadedes/oc.m8.d4:ocLI.BeatitudesTr.mode	@ltx/en_us_goadedes/miscellanea:misc.Mode8
ltx/en_us_goadedes/oc.m8.d4:ocLI.BeatitudesTr.text	
ltx/en_us_goadedes/oc.m8.d4:ocLI.MM.Beatitudes1234TrTas78910GB.text	@ltx/en_us_goadedes/properties:media.key
ltx/en_us_goadedes/oc.m8.d4:ocMA.ApolTheotokion.incipit	@ltx/en_us_goadedes/oc.m7.d5:ocMA.Kathisma13.incipit
ltx/en_us_goadedes/oc.m8.d4:ocMA.ApolTheotokion.melody	
ltx/en_us_goadedes/oc.m8.d4:ocMA.ApolTheotokion.mode	@ltx/en_us_goadedes/miscellanea:misc.Mode8
ltx/en_us_goadedes/oc.m8.d4:ocMA.ApolTheotokion.text	@ltx/en_us_goadedes/oc.m7.d5:ocMA.Kathisma13.text
ltx/en_us_goadedes/oc.m8.d4:ocMA.AposTheotokion.greekmelody	@ltx/en_us_goadedes/he.a.m8:heAU.TiYmasKalesomen.greekname
ltx/en_us_goadedes/oc.m8.d4:ocMA.AposTheotokion.incipit	…
ltx/en_us_goadedes/oc.m8.d4:ocMA.AposTheotokion.melody	@ltx/en_us_goadedes/he.a.m8:heAU.TiYmasKalesomen.name
ltx/en_us_goadedes/oc.m8.d4:ocMA.AposTheotokion.mode	@ltx/en_us_goadedes/miscellanea:misc.Mode8
ltx/en_us_goadedes/oc.m8.d4:ocMA.AposTheotokion.text	
ltx/en_us_goadedes/oc.m8.d4:ocMA.Aposticha1.incipit	…
ltx/en_us_goadedes/oc.m8.d4:ocMA.Aposticha1.melody	
ltx/en_us_goadedes/oc.m8.d4:ocMA.Aposticha1.mode	@ltx/en_us_goadedes/miscellanea:misc.Mode8
ltx/en_us_goadedes/oc.m8.d4:ocMA.Aposticha1.text	
ltx/en_us_goadedes/oc.m8.d4:ocMA.Aposticha2.greekmelody	@ltx/en_us_goadedes/he.a.m8:heAU.OEnEdemParadeisos.greekname
ltx/en_us_goadedes/oc.m8.d4:ocMA.Aposticha2.incipit	@ltx/en_us_goadedes/he.a.m8:heAU.OEnEdemParadeisos.incipit
ltx/en_us_goadedes/oc.m8.d4:ocMA.Aposticha2.melody	@ltx/en_us_goadedes/he.a.m8:heAU.OEnEdemParadeisos.melody
ltx/en_us_goadedes/oc.m8.d4:ocMA.Aposticha2.mode	@ltx/en_us_goadedes/miscellanea:misc.Mode8
ltx/en_us_goadedes/oc.m8.d4:ocMA.Aposticha2.text	@ltx/en_us_goadedes/he.a.m8:heAU.OEnEdemParadeisos.text
ltx/en_us_goadedes/oc.m8.d4:ocMA.Aposticha3.greekmelody	@ltx/en_us_goadedes/he.a.m8:heAU.TiYmasKalesomen.greekname
ltx/en_us_goadedes/oc.m8.d4:ocMA.Aposticha3.incipit	…
ltx/en_us_goadedes/oc.m8.d4:ocMA.Aposticha3.melody	@ltx/en_us_goadedes/he.a.m8:heAU.TiYmasKalesomen.name
ltx/en_us_goadedes/oc.m8.d4:ocMA.Aposticha3.mode	@ltx/en_us_goadedes/miscellanea:misc.Mode8
ltx/en_us_goadedes/oc.m8.d4:ocMA.Aposticha3.text	
ltx/en_us_goadedes/oc.m8.d4:ocMA.C1.acrostic.notice1	
ltx/en_us_goadedes/oc.m8.d4:ocMA.C1.acrostic.text	
ltx/en_us_goadedes/oc.m8.d4:ocMA.C1.acrostic.title	Canon for the Cross.
ltx/en_us_goadedes/oc.m8.d4:ocMA.C2.acrostic.notice1	
ltx/en_us_goadedes/oc.m8.d4:ocMA.C2.acrostic.text	
ltx/en_us_goadedes/oc.m8.d4:ocMA.C2.acrostic.title	Canon for the Theotokos.
ltx/en_us_goadedes/oc.m8.d4:ocMA.CA.notice	
ltx/en_us_goadedes/oc.m8.d4:ocMA.Kathisma11.incipit	…
ltx/en_us_goadedes/oc.m8.d4:ocMA.Kathisma11.melody	
ltx/en_us_goadedes/oc.m8.d4:ocMA.Kathisma11.mode	@ltx/en_us_goadedes/miscellanea:misc.Mode8
ltx/en_us_goadedes/oc.m8.d4:ocMA.Kathisma11.text	
ltx/en_us_goadedes/oc.m8.d4:ocMA.Kathisma12.incipit	…
ltx/en_us_goadedes/oc.m8.d4:ocMA.Kathisma12.melody	
ltx/en_us_goadedes/oc.m8.d4:ocMA.Kathisma12.mode	@ltx/en_us_goadedes/miscellanea:misc.Mode8
ltx/en_us_goadedes/oc.m8.d4:ocMA.Kathisma12.text	
ltx/en_us_goadedes/oc.m8.d4:ocMA.Kathisma13.greekmelody	@ltx/en_us_goadedes/he.a.m8:heAU.TinSofianKaiLogon.greekname
ltx/en_us_goadedes/oc.m8.d4:ocMA.Kathisma13.incipit	…
ltx/en_us_goadedes/oc.m8.d4:ocMA.Kathisma13.melody	@ltx/en_us_goadedes/he.a.m8:heAU.TinSofianKaiLogon.name
ltx/en_us_goadedes/oc.m8.d4:ocMA.Kathisma13.mode	@ltx/en_us_goadedes/miscellanea:misc.Mode8
ltx/en_us_goadedes/oc.m8.d4:ocMA.Kathisma13.text	
ltx/en_us_goadedes/oc.m8.d4:ocMA.Kathisma21.greekmelody	@ltx/en_us_goadedes/he.a.m8:heAU.AnestisEkNekron.greekname
ltx/en_us_goadedes/oc.m8.d4:ocMA.Kathisma21.incipit	…
ltx/en_us_goadedes/oc.m8.d4:ocMA.Kathisma21.melody	@ltx/en_us_goadedes/he.a.m8:heAU.AnestisEkNekron.name
ltx/en_us_goadedes/oc.m8.d4:ocMA.Kathisma21.mode	@ltx/en_us_goadedes/miscellanea:misc.Mode8
ltx/en_us_goadedes/oc.m8.d4:ocMA.Kathisma21.text	
ltx/en_us_goadedes/oc.m8.d4:ocMA.Kathisma22.greekmelody	@ltx/en_us_goadedes/he.a.m8:heAU.ToProstachthen.greekname
ltx/en_us_goadedes/oc.m8.d4:ocMA.Kathisma22.incipit	…
ltx/en_us_goadedes/oc.m8.d4:ocMA.Kathisma22.melody	@ltx/en_us_goadedes/he.a.m8:heAU.ToProstachthen.name
ltx/en_us_goadedes/oc.m8.d4:ocMA.Kathisma22.mode	@ltx/en_us_goadedes/miscellanea:misc.Mode8
ltx/en_us_goadedes/oc.m8.d4:ocMA.Kathisma22.text	
ltx/en_us_goadedes/oc.m8.d4:ocMA.Kathisma23.greekmelody	@ltx/en_us_goadedes/he.a.m8:heAU.ToProstachthen.greekname
ltx/en_us_goadedes/oc.m8.d4:ocMA.Kathisma23.incipit	…
ltx/en_us_goadedes/oc.m8.d4:ocMA.Kathisma23.melody	@ltx/en_us_goadedes/he.a.m8:heAU.ToProstachthen.name
ltx/en_us_goadedes/oc.m8.d4:ocMA.Kathisma23.mode	@ltx/en_us_goadedes/miscellanea:misc.Mode8
ltx/en_us_goadedes/oc.m8.d4:ocMA.Kathisma23.text	
ltx/en_us_goadedes/oc.m8.d4:ocMA.Kathisma31.greekmelody	@ltx/en_us_goadedes/he.a.m8:heAU.ToProstachthen.greekname
ltx/en_us_goadedes/oc.m8.d4:ocMA.Kathisma31.incipit	…
ltx/en_us_goadedes/oc.m8.d4:ocMA.Kathisma31.melody	@ltx/en_us_goadedes/he.a.m8:heAU.ToProstachthen.name
ltx/en_us_goadedes/oc.m8.d4:ocMA.Kathisma31.mode	@ltx/en_us_goadedes/miscellanea:misc.Mode8
ltx/en_us_goadedes/oc.m8.d4:ocMA.Kathisma31.text	
ltx/en_us_goadedes/oc.m8.d4:ocMA.Kathisma32.greekmelody	@ltx/en_us_goadedes/he.a.m8:heAU.ToProstachthen.greekname
ltx/en_us_goadedes/oc.m8.d4:ocMA.Kathisma32.incipit	…
ltx/en_us_goadedes/oc.m8.d4:ocMA.Kathisma32.melody	@ltx/en_us_goadedes/he.a.m8:heAU.ToProstachthen.name
ltx/en_us_goadedes/oc.m8.d4:ocMA.Kathisma32.mode	@ltx/en_us_goadedes/miscellanea:misc.Mode8
ltx/en_us_goadedes/oc.m8.d4:ocMA.Kathisma32.text	
ltx/en_us_goadedes/oc.m8.d4:ocMA.Kathisma33.greekmelody	@ltx/en_us_goadedes/he.a.m8:heAU.AnestisEkNekron.greekname
ltx/en_us_goadedes/oc.m8.d4:ocMA.Kathisma33.incipit	…
ltx/en_us_goadedes/oc.m8.d4:ocMA.Kathisma33.melody	@ltx/en_us_goadedes/he.a.m8:heAU.AnestisEkNekron.name
ltx/en_us_goadedes/oc.m8.d4:ocMA.Kathisma33.mode	@ltx/en_us_goadedes/miscellanea:misc.Mode8
ltx/en_us_goadedes/oc.m8.d4:ocMA.Kathisma33.text	
ltx/en_us_goadedes/oc.m8.d4:ocMA.OdeW1C11.incipit	…
ltx/en_us_goadedes/oc.m8.d4:ocMA.OdeW1C11.melody	@ltx/en_us_goadedes/he.h.m8:heHE.ArmatilatinFarao.name
ltx/en_us_goadedes/oc.m8.d4:ocMA.OdeW1C11.mode	@ltx/en_us_goadedes/miscellanea:misc.Mode8
ltx/en_us_goadedes/oc.m8.d4:ocMA.OdeW1C11.ode	@ltx/en_us_goadedes/miscellanea:misc.Ode1
ltx/en_us_goadedes/oc.m8.d4:ocMA.OdeW1C11.text	
ltx/en_us_goadedes/oc.m8.d4:ocMA.OdeW1C12.incipit	…
ltx/en_us_goadedes/oc.m8.d4:ocMA.OdeW1C12.melody	@ltx/en_us_goadedes/he.h.m8:heHE.ArmatilatinFarao.name
ltx/en_us_goadedes/oc.m8.d4:ocMA.OdeW1C12.mode	@ltx/en_us_goadedes/miscellanea:misc.Mode8
ltx/en_us_goadedes/oc.m8.d4:ocMA.OdeW1C12.ode	@ltx/en_us_goadedes/miscellanea:misc.Ode1
ltx/en_us_goadedes/oc.m8.d4:ocMA.OdeW1C12.text	
ltx/en_us_goadedes/oc.m8.d4:ocMA.OdeW1C13.incipit	…
ltx/en_us_goadedes/oc.m8.d4:ocMA.OdeW1C13.melody	@ltx/en_us_goadedes/he.h.m8:heHE.ArmatilatinFarao.name
ltx/en_us_goadedes/oc.m8.d4:ocMA.OdeW1C13.mode	@ltx/en_us_goadedes/miscellanea:misc.Mode8
ltx/en_us_goadedes/oc.m8.d4:ocMA.OdeW1C13.ode	@ltx/en_us_goadedes/miscellanea:misc.Ode1
ltx/en_us_goadedes/oc.m8.d4:ocMA.OdeW1C13.text	
ltx/en_us_goadedes/oc.m8.d4:ocMA.OdeW1C14.incipit	…
ltx/en_us_goadedes/oc.m8.d4:ocMA.OdeW1C14.melody	@ltx/en_us_goadedes/he.h.m8:heHE.ArmatilatinFarao.name
ltx/en_us_goadedes/oc.m8.d4:ocMA.OdeW1C14.mode	@ltx/en_us_goadedes/miscellanea:misc.Mode8
ltx/en_us_goadedes/oc.m8.d4:ocMA.OdeW1C14.ode	@ltx/en_us_goadedes/miscellanea:misc.Ode1
ltx/en_us_goadedes/oc.m8.d4:ocMA.OdeW1C14.text	
ltx/en_us_goadedes/oc.m8.d4:ocMA.OdeW1C1H.greekmelody	@ltx/en_us_goadedes/he.h.m8:heHE.ArmatilatinFarao.greekname
ltx/en_us_goadedes/oc.m8.d4:ocMA.OdeW1C1H.incipit	@ltx/en_us_goadedes/he.h.m8:heHE.ArmatilatinFarao.incipit
ltx/en_us_goadedes/oc.m8.d4:ocMA.OdeW1C1H.melody	@ltx/en_us_goadedes/he.h.m8:heHE.ArmatilatinFarao.melody
ltx/en_us_goadedes/oc.m8.d4:ocMA.OdeW1C1H.mode	@ltx/en_us_goadedes/miscellanea:misc.Mode8
ltx/en_us_goadedes/oc.m8.d4:ocMA.OdeW1C1H.ode	@ltx/en_us_goadedes/miscellanea:misc.Ode1
ltx/en_us_goadedes/oc.m8.d4:ocMA.OdeW1C1H.text	@ltx/en_us_goadedes/he.h.m8:heHE.ArmatilatinFarao.text
ltx/en_us_goadedes/oc.m8.d4:ocMA.OdeW1C1T.incipit	…
ltx/en_us_goadedes/oc.m8.d4:ocMA.OdeW1C1T.melody	@ltx/en_us_goadedes/he.h.m8:heHE.ArmatilatinFarao.name
ltx/en_us_goadedes/oc.m8.d4:ocMA.OdeW1C1T.mode	@ltx/en_us_goadedes/miscellanea:misc.Mode8
ltx/en_us_goadedes/oc.m8.d4:ocMA.OdeW1C1T.ode	@ltx/en_us_goadedes/miscellanea:misc.Ode1
ltx/en_us_goadedes/oc.m8.d4:ocMA.OdeW1C1T.text	
ltx/en_us_goadedes/oc.m8.d4:ocMA.OdeW1C21.greekmelody	@ltx/en_us_goadedes/he.h.m8:heHE.ArmatilatinFarao.greekname
ltx/en_us_goadedes/oc.m8.d4:ocMA.OdeW1C21.incipit	…
ltx/en_us_goadedes/oc.m8.d4:ocMA.OdeW1C21.melody	@ltx/en_us_goadedes/he.h.m8:heHE.ArmatilatinFarao.name
ltx/en_us_goadedes/oc.m8.d4:ocMA.OdeW1C21.mode	@ltx/en_us_goadedes/miscellanea:misc.Mode8
ltx/en_us_goadedes/oc.m8.d4:ocMA.OdeW1C21.ode	@ltx/en_us_goadedes/miscellanea:misc.Ode1
ltx/en_us_goadedes/oc.m8.d4:ocMA.OdeW1C21.text	
ltx/en_us_goadedes/oc.m8.d4:ocMA.OdeW1C22.incipit	…
ltx/en_us_goadedes/oc.m8.d4:ocMA.OdeW1C22.melody	@ltx/en_us_goadedes/he.h.m8:heHE.ArmatilatinFarao.name
ltx/en_us_goadedes/oc.m8.d4:ocMA.OdeW1C22.mode	@ltx/en_us_goadedes/miscellanea:misc.Mode8
ltx/en_us_goadedes/oc.m8.d4:ocMA.OdeW1C22.ode	@ltx/en_us_goadedes/miscellanea:misc.Ode1
ltx/en_us_goadedes/oc.m8.d4:ocMA.OdeW1C22.text	
ltx/en_us_goadedes/oc.m8.d4:ocMA.OdeW1C23.incipit	…
ltx/en_us_goadedes/oc.m8.d4:ocMA.OdeW1C23.melody	@ltx/en_us_goadedes/he.h.m8:heHE.ArmatilatinFarao.name
ltx/en_us_goadedes/oc.m8.d4:ocMA.OdeW1C23.mode	@ltx/en_us_goadedes/miscellanea:misc.Mode8
ltx/en_us_goadedes/oc.m8.d4:ocMA.OdeW1C23.ode	@ltx/en_us_goadedes/miscellanea:misc.Ode1
ltx/en_us_goadedes/oc.m8.d4:ocMA.OdeW1C23.text	
ltx/en_us_goadedes/oc.m8.d4:ocMA.OdeW1C24.incipit	…
ltx/en_us_goadedes/oc.m8.d4:ocMA.OdeW1C24.melody	@ltx/en_us_goadedes/he.h.m8:heHE.ArmatilatinFarao.name
ltx/en_us_goadedes/oc.m8.d4:ocMA.OdeW1C24.mode	@ltx/en_us_goadedes/miscellanea:misc.Mode8
ltx/en_us_goadedes/oc.m8.d4:ocMA.OdeW1C24.ode	@ltx/en_us_goadedes/miscellanea:misc.Ode1
ltx/en_us_goadedes/oc.m8.d4:ocMA.OdeW1C24.text	
ltx/en_us_goadedes/oc.m8.d4:ocMA.OdeW3C11.incipit	…
ltx/en_us_goadedes/oc.m8.d4:ocMA.OdeW3C11.melody	@ltx/en_us_goadedes/he.h.m8:heHE.OStereosasKatArchas.name
ltx/en_us_goadedes/oc.m8.d4:ocMA.OdeW3C11.mode	@ltx/en_us_goadedes/miscellanea:misc.Mode8
ltx/en_us_goadedes/oc.m8.d4:ocMA.OdeW3C11.ode	@ltx/en_us_goadedes/miscellanea:misc.Ode3
ltx/en_us_goadedes/oc.m8.d4:ocMA.OdeW3C11.text	
ltx/en_us_goadedes/oc.m8.d4:ocMA.OdeW3C12.incipit	…
ltx/en_us_goadedes/oc.m8.d4:ocMA.OdeW3C12.melody	@ltx/en_us_goadedes/he.h.m8:heHE.OStereosasKatArchas.name
ltx/en_us_goadedes/oc.m8.d4:ocMA.OdeW3C12.mode	@ltx/en_us_goadedes/miscellanea:misc.Mode8
ltx/en_us_goadedes/oc.m8.d4:ocMA.OdeW3C12.ode	@ltx/en_us_goadedes/miscellanea:misc.Ode3
ltx/en_us_goadedes/oc.m8.d4:ocMA.OdeW3C12.text	
ltx/en_us_goadedes/oc.m8.d4:ocMA.OdeW3C13.incipit	…
ltx/en_us_goadedes/oc.m8.d4:ocMA.OdeW3C13.melody	@ltx/en_us_goadedes/he.h.m8:heHE.OStereosasKatArchas.name
ltx/en_us_goadedes/oc.m8.d4:ocMA.OdeW3C13.mode	@ltx/en_us_goadedes/miscellanea:misc.Mode8
ltx/en_us_goadedes/oc.m8.d4:ocMA.OdeW3C13.ode	@ltx/en_us_goadedes/miscellanea:misc.Ode3
ltx/en_us_goadedes/oc.m8.d4:ocMA.OdeW3C13.text	
ltx/en_us_goadedes/oc.m8.d4:ocMA.OdeW3C14.incipit	…
ltx/en_us_goadedes/oc.m8.d4:ocMA.OdeW3C14.melody	@ltx/en_us_goadedes/he.h.m8:heHE.OStereosasKatArchas.name
ltx/en_us_goadedes/oc.m8.d4:ocMA.OdeW3C14.mode	@ltx/en_us_goadedes/miscellanea:misc.Mode8
ltx/en_us_goadedes/oc.m8.d4:ocMA.OdeW3C14.ode	@ltx/en_us_goadedes/miscellanea:misc.Ode3
ltx/en_us_goadedes/oc.m8.d4:ocMA.OdeW3C14.text	
ltx/en_us_goadedes/oc.m8.d4:ocMA.OdeW3C1H.greekmelody	@ltx/en_us_goadedes/he.h.m8:heHE.OStereosasKatArchas.greekname
ltx/en_us_goadedes/oc.m8.d4:ocMA.OdeW3C1H.incipit	@ltx/en_us_goadedes/he.h.m8:heHE.OStereosasKatArchas.incipit
ltx/en_us_goadedes/oc.m8.d4:ocMA.OdeW3C1H.melody	@ltx/en_us_goadedes/he.h.m8:heHE.OStereosasKatArchas.melody
ltx/en_us_goadedes/oc.m8.d4:ocMA.OdeW3C1H.mode	@ltx/en_us_goadedes/miscellanea:misc.Mode8
ltx/en_us_goadedes/oc.m8.d4:ocMA.OdeW3C1H.ode	@ltx/en_us_goadedes/miscellanea:misc.Ode3
ltx/en_us_goadedes/oc.m8.d4:ocMA.OdeW3C1H.text	@ltx/en_us_goadedes/he.h.m8:heHE.OStereosasKatArchas.text
ltx/en_us_goadedes/oc.m8.d4:ocMA.OdeW3C1T.incipit	…
ltx/en_us_goadedes/oc.m8.d4:ocMA.OdeW3C1T.melody	@ltx/en_us_goadedes/he.h.m8:heHE.OStereosasKatArchas.name
ltx/en_us_goadedes/oc.m8.d4:ocMA.OdeW3C1T.mode	@ltx/en_us_goadedes/miscellanea:misc.Mode8
ltx/en_us_goadedes/oc.m8.d4:ocMA.OdeW3C1T.ode	@ltx/en_us_goadedes/miscellanea:misc.Ode3
ltx/en_us_goadedes/oc.m8.d4:ocMA.OdeW3C1T.text	
ltx/en_us_goadedes/oc.m8.d4:ocMA.OdeW3C21.greekmelody	@ltx/en_us_goadedes/he.h.m8:heHE.OuraniasApsidos.greekname
ltx/en_us_goadedes/oc.m8.d4:ocMA.OdeW3C21.incipit	…
ltx/en_us_goadedes/oc.m8.d4:ocMA.OdeW3C21.melody	@ltx/en_us_goadedes/he.h.m8:heHE.OuraniasApsidos.name
ltx/en_us_goadedes/oc.m8.d4:ocMA.OdeW3C21.mode	@ltx/en_us_goadedes/miscellanea:misc.Mode8
ltx/en_us_goadedes/oc.m8.d4:ocMA.OdeW3C21.ode	@ltx/en_us_goadedes/miscellanea:misc.Ode3
ltx/en_us_goadedes/oc.m8.d4:ocMA.OdeW3C21.text	
ltx/en_us_goadedes/oc.m8.d4:ocMA.OdeW3C22.incipit	…
ltx/en_us_goadedes/oc.m8.d4:ocMA.OdeW3C22.melody	@ltx/en_us_goadedes/he.h.m8:heHE.OuraniasApsidos.name
ltx/en_us_goadedes/oc.m8.d4:ocMA.OdeW3C22.mode	@ltx/en_us_goadedes/miscellanea:misc.Mode8
ltx/en_us_goadedes/oc.m8.d4:ocMA.OdeW3C22.ode	@ltx/en_us_goadedes/miscellanea:misc.Ode3
ltx/en_us_goadedes/oc.m8.d4:ocMA.OdeW3C22.text	
ltx/en_us_goadedes/oc.m8.d4:ocMA.OdeW3C23.incipit	…
ltx/en_us_goadedes/oc.m8.d4:ocMA.OdeW3C23.melody	@ltx/en_us_goadedes/he.h.m8:heHE.OuraniasApsidos.name
ltx/en_us_goadedes/oc.m8.d4:ocMA.OdeW3C23.mode	@ltx/en_us_goadedes/miscellanea:misc.Mode8
ltx/en_us_goadedes/oc.m8.d4:ocMA.OdeW3C23.ode	@ltx/en_us_goadedes/miscellanea:misc.Ode3
ltx/en_us_goadedes/oc.m8.d4:ocMA.OdeW3C23.text	
ltx/en_us_goadedes/oc.m8.d4:ocMA.OdeW3C24.incipit	…
ltx/en_us_goadedes/oc.m8.d4:ocMA.OdeW3C24.melody	@ltx/en_us_goadedes/he.h.m8:heHE.OuraniasApsidos.name
ltx/en_us_goadedes/oc.m8.d4:ocMA.OdeW3C24.mode	@ltx/en_us_goadedes/miscellanea:misc.Mode8
ltx/en_us_goadedes/oc.m8.d4:ocMA.OdeW3C24.ode	@ltx/en_us_goadedes/miscellanea:misc.Ode3
ltx/en_us_goadedes/oc.m8.d4:ocMA.OdeW3C24.text	
ltx/en_us_goadedes/oc.m8.d4:ocMA.OdeW4C11.incipit	…
ltx/en_us_goadedes/oc.m8.d4:ocMA.OdeW4C11.melody	@ltx/en_us_goadedes/he.h.m8:heHE.SyMouIschys.name
ltx/en_us_goadedes/oc.m8.d4:ocMA.OdeW4C11.mode	@ltx/en_us_goadedes/miscellanea:misc.Mode8
ltx/en_us_goadedes/oc.m8.d4:ocMA.OdeW4C11.ode	@ltx/en_us_goadedes/miscellanea:misc.Ode4
ltx/en_us_goadedes/oc.m8.d4:ocMA.OdeW4C11.text	
ltx/en_us_goadedes/oc.m8.d4:ocMA.OdeW4C12.incipit	…
ltx/en_us_goadedes/oc.m8.d4:ocMA.OdeW4C12.melody	@ltx/en_us_goadedes/he.h.m8:heHE.SyMouIschys.name
ltx/en_us_goadedes/oc.m8.d4:ocMA.OdeW4C12.mode	@ltx/en_us_goadedes/miscellanea:misc.Mode8
ltx/en_us_goadedes/oc.m8.d4:ocMA.OdeW4C12.ode	@ltx/en_us_goadedes/miscellanea:misc.Ode4
ltx/en_us_goadedes/oc.m8.d4:ocMA.OdeW4C12.text	
ltx/en_us_goadedes/oc.m8.d4:ocMA.OdeW4C13.incipit	…
ltx/en_us_goadedes/oc.m8.d4:ocMA.OdeW4C13.melody	@ltx/en_us_goadedes/he.h.m8:heHE.SyMouIschys.name
ltx/en_us_goadedes/oc.m8.d4:ocMA.OdeW4C13.mode	@ltx/en_us_goadedes/miscellanea:misc.Mode8
ltx/en_us_goadedes/oc.m8.d4:ocMA.OdeW4C13.ode	@ltx/en_us_goadedes/miscellanea:misc.Ode4
ltx/en_us_goadedes/oc.m8.d4:ocMA.OdeW4C13.text	
ltx/en_us_goadedes/oc.m8.d4:ocMA.OdeW4C14.incipit	…
ltx/en_us_goadedes/oc.m8.d4:ocMA.OdeW4C14.melody	@ltx/en_us_goadedes/he.h.m8:heHE.SyMouIschys.name
ltx/en_us_goadedes/oc.m8.d4:ocMA.OdeW4C14.mode	@ltx/en_us_goadedes/miscellanea:misc.Mode8
ltx/en_us_goadedes/oc.m8.d4:ocMA.OdeW4C14.ode	@ltx/en_us_goadedes/miscellanea:misc.Ode4
ltx/en_us_goadedes/oc.m8.d4:ocMA.OdeW4C14.text	
ltx/en_us_goadedes/oc.m8.d4:ocMA.OdeW4C1H.greekmelody	@ltx/en_us_goadedes/he.h.m8:heHE.SyMouIschys.greekname
ltx/en_us_goadedes/oc.m8.d4:ocMA.OdeW4C1H.incipit	@ltx/en_us_goadedes/he.h.m8:heHE.SyMouIschys.incipit
ltx/en_us_goadedes/oc.m8.d4:ocMA.OdeW4C1H.melody	@ltx/en_us_goadedes/he.h.m8:heHE.SyMouIschys.melody
ltx/en_us_goadedes/oc.m8.d4:ocMA.OdeW4C1H.mode	@ltx/en_us_goadedes/miscellanea:misc.Mode8
ltx/en_us_goadedes/oc.m8.d4:ocMA.OdeW4C1H.ode	@ltx/en_us_goadedes/miscellanea:misc.Ode4
ltx/en_us_goadedes/oc.m8.d4:ocMA.OdeW4C1H.text	@ltx/en_us_goadedes/he.h.m8:heHE.SyMouIschys.text
ltx/en_us_goadedes/oc.m8.d4:ocMA.OdeW4C1T.incipit	…
ltx/en_us_goadedes/oc.m8.d4:ocMA.OdeW4C1T.melody	@ltx/en_us_goadedes/he.h.m8:heHE.SyMouIschys.name
ltx/en_us_goadedes/oc.m8.d4:ocMA.OdeW4C1T.mode	@ltx/en_us_goadedes/miscellanea:misc.Mode8
ltx/en_us_goadedes/oc.m8.d4:ocMA.OdeW4C1T.ode	@ltx/en_us_goadedes/miscellanea:misc.Ode4
ltx/en_us_goadedes/oc.m8.d4:ocMA.OdeW4C1T.text	
ltx/en_us_goadedes/oc.m8.d4:ocMA.OdeW4C21.greekmelody	@ltx/en_us_goadedes/he.h.m8:heHE.SyMouIschys.greekname
ltx/en_us_goadedes/oc.m8.d4:ocMA.OdeW4C21.incipit	…
ltx/en_us_goadedes/oc.m8.d4:ocMA.OdeW4C21.melody	@ltx/en_us_goadedes/he.h.m8:heHE.SyMouIschys.name
ltx/en_us_goadedes/oc.m8.d4:ocMA.OdeW4C21.mode	@ltx/en_us_goadedes/miscellanea:misc.Mode8
ltx/en_us_goadedes/oc.m8.d4:ocMA.OdeW4C21.ode	@ltx/en_us_goadedes/miscellanea:misc.Ode4
ltx/en_us_goadedes/oc.m8.d4:ocMA.OdeW4C21.text	
ltx/en_us_goadedes/oc.m8.d4:ocMA.OdeW4C22.incipit	…
ltx/en_us_goadedes/oc.m8.d4:ocMA.OdeW4C22.melody	@ltx/en_us_goadedes/he.h.m8:heHE.SyMouIschys.name
ltx/en_us_goadedes/oc.m8.d4:ocMA.OdeW4C22.mode	@ltx/en_us_goadedes/miscellanea:misc.Mode8
ltx/en_us_goadedes/oc.m8.d4:ocMA.OdeW4C22.ode	@ltx/en_us_goadedes/miscellanea:misc.Ode4
ltx/en_us_goadedes/oc.m8.d4:ocMA.OdeW4C22.text	
ltx/en_us_goadedes/oc.m8.d4:ocMA.OdeW4C23.incipit	…
ltx/en_us_goadedes/oc.m8.d4:ocMA.OdeW4C23.melody	@ltx/en_us_goadedes/he.h.m8:heHE.SyMouIschys.name
ltx/en_us_goadedes/oc.m8.d4:ocMA.OdeW4C23.mode	@ltx/en_us_goadedes/miscellanea:misc.Mode8
ltx/en_us_goadedes/oc.m8.d4:ocMA.OdeW4C23.ode	@ltx/en_us_goadedes/miscellanea:misc.Ode4
ltx/en_us_goadedes/oc.m8.d4:ocMA.OdeW4C23.text	
ltx/en_us_goadedes/oc.m8.d4:ocMA.OdeW4C24.incipit	…
ltx/en_us_goadedes/oc.m8.d4:ocMA.OdeW4C24.melody	@ltx/en_us_goadedes/he.h.m8:heHE.SyMouIschys.name
ltx/en_us_goadedes/oc.m8.d4:ocMA.OdeW4C24.mode	@ltx/en_us_goadedes/miscellanea:misc.Mode8
ltx/en_us_goadedes/oc.m8.d4:ocMA.OdeW4C24.ode	@ltx/en_us_goadedes/miscellanea:misc.Ode4
ltx/en_us_goadedes/oc.m8.d4:ocMA.OdeW4C24.text	
ltx/en_us_goadedes/oc.m8.d4:ocMA.OdeW5C11.incipit	…
ltx/en_us_goadedes/oc.m8.d4:ocMA.OdeW5C11.melody	@ltx/en_us_goadedes/he.h.m8:heHE.InaTiMeAposo.name
ltx/en_us_goadedes/oc.m8.d4:ocMA.OdeW5C11.mode	@ltx/en_us_goadedes/miscellanea:misc.Mode8
ltx/en_us_goadedes/oc.m8.d4:ocMA.OdeW5C11.ode	@ltx/en_us_goadedes/miscellanea:misc.Ode5
ltx/en_us_goadedes/oc.m8.d4:ocMA.OdeW5C11.text	
ltx/en_us_goadedes/oc.m8.d4:ocMA.OdeW5C12.incipit	…
ltx/en_us_goadedes/oc.m8.d4:ocMA.OdeW5C12.melody	@ltx/en_us_goadedes/he.h.m8:heHE.InaTiMeAposo.name
ltx/en_us_goadedes/oc.m8.d4:ocMA.OdeW5C12.mode	@ltx/en_us_goadedes/miscellanea:misc.Mode8
ltx/en_us_goadedes/oc.m8.d4:ocMA.OdeW5C12.ode	@ltx/en_us_goadedes/miscellanea:misc.Ode5
ltx/en_us_goadedes/oc.m8.d4:ocMA.OdeW5C12.text	
ltx/en_us_goadedes/oc.m8.d4:ocMA.OdeW5C13.incipit	…
ltx/en_us_goadedes/oc.m8.d4:ocMA.OdeW5C13.melody	@ltx/en_us_goadedes/he.h.m8:heHE.InaTiMeAposo.name
ltx/en_us_goadedes/oc.m8.d4:ocMA.OdeW5C13.mode	@ltx/en_us_goadedes/miscellanea:misc.Mode8
ltx/en_us_goadedes/oc.m8.d4:ocMA.OdeW5C13.ode	@ltx/en_us_goadedes/miscellanea:misc.Ode5
ltx/en_us_goadedes/oc.m8.d4:ocMA.OdeW5C13.text	
ltx/en_us_goadedes/oc.m8.d4:ocMA.OdeW5C14.incipit	…
ltx/en_us_goadedes/oc.m8.d4:ocMA.OdeW5C14.melody	@ltx/en_us_goadedes/he.h.m8:heHE.InaTiMeAposo.name
ltx/en_us_goadedes/oc.m8.d4:ocMA.OdeW5C14.mode	@ltx/en_us_goadedes/miscellanea:misc.Mode8
ltx/en_us_goadedes/oc.m8.d4:ocMA.OdeW5C14.ode	@ltx/en_us_goadedes/miscellanea:misc.Ode5
ltx/en_us_goadedes/oc.m8.d4:ocMA.OdeW5C14.text	
ltx/en_us_goadedes/oc.m8.d4:ocMA.OdeW5C1H.greekmelody	@ltx/en_us_goadedes/he.h.m8:heHE.InaTiMeAposo.greekname
ltx/en_us_goadedes/oc.m8.d4:ocMA.OdeW5C1H.incipit	@ltx/en_us_goadedes/he.h.m8:heHE.InaTiMeAposo.incipit
ltx/en_us_goadedes/oc.m8.d4:ocMA.OdeW5C1H.melody	@ltx/en_us_goadedes/he.h.m8:heHE.InaTiMeAposo.melody
ltx/en_us_goadedes/oc.m8.d4:ocMA.OdeW5C1H.mode	@ltx/en_us_goadedes/miscellanea:misc.Mode8
ltx/en_us_goadedes/oc.m8.d4:ocMA.OdeW5C1H.ode	@ltx/en_us_goadedes/miscellanea:misc.Ode5
ltx/en_us_goadedes/oc.m8.d4:ocMA.OdeW5C1H.text	@ltx/en_us_goadedes/he.h.m8:heHE.InaTiMeAposo.text
ltx/en_us_goadedes/oc.m8.d4:ocMA.OdeW5C1T.incipit	…
ltx/en_us_goadedes/oc.m8.d4:ocMA.OdeW5C1T.melody	@ltx/en_us_goadedes/he.h.m8:heHE.InaTiMeAposo.name
ltx/en_us_goadedes/oc.m8.d4:ocMA.OdeW5C1T.mode	@ltx/en_us_goadedes/miscellanea:misc.Mode8
ltx/en_us_goadedes/oc.m8.d4:ocMA.OdeW5C1T.ode	@ltx/en_us_goadedes/miscellanea:misc.Ode5
ltx/en_us_goadedes/oc.m8.d4:ocMA.OdeW5C1T.text	
ltx/en_us_goadedes/oc.m8.d4:ocMA.OdeW5C21.greekmelody	@ltx/en_us_goadedes/he.h.m8:heHE.InaTiMeAposo.greekname
ltx/en_us_goadedes/oc.m8.d4:ocMA.OdeW5C21.incipit	…
ltx/en_us_goadedes/oc.m8.d4:ocMA.OdeW5C21.melody	@ltx/en_us_goadedes/he.h.m8:heHE.InaTiMeAposo.name
ltx/en_us_goadedes/oc.m8.d4:ocMA.OdeW5C21.mode	@ltx/en_us_goadedes/miscellanea:misc.Mode8
ltx/en_us_goadedes/oc.m8.d4:ocMA.OdeW5C21.ode	@ltx/en_us_goadedes/miscellanea:misc.Ode5
ltx/en_us_goadedes/oc.m8.d4:ocMA.OdeW5C21.text	
ltx/en_us_goadedes/oc.m8.d4:ocMA.OdeW5C22.incipit	…
ltx/en_us_goadedes/oc.m8.d4:ocMA.OdeW5C22.melody	@ltx/en_us_goadedes/he.h.m8:heHE.InaTiMeAposo.name
ltx/en_us_goadedes/oc.m8.d4:ocMA.OdeW5C22.mode	@ltx/en_us_goadedes/miscellanea:misc.Mode8
ltx/en_us_goadedes/oc.m8.d4:ocMA.OdeW5C22.ode	@ltx/en_us_goadedes/miscellanea:misc.Ode5
ltx/en_us_goadedes/oc.m8.d4:ocMA.OdeW5C22.text	
ltx/en_us_goadedes/oc.m8.d4:ocMA.OdeW5C23.incipit	…
ltx/en_us_goadedes/oc.m8.d4:ocMA.OdeW5C23.melody	@ltx/en_us_goadedes/he.h.m8:heHE.InaTiMeAposo.name
ltx/en_us_goadedes/oc.m8.d4:ocMA.OdeW5C23.mode	@ltx/en_us_goadedes/miscellanea:misc.Mode8
ltx/en_us_goadedes/oc.m8.d4:ocMA.OdeW5C23.ode	@ltx/en_us_goadedes/miscellanea:misc.Ode5
ltx/en_us_goadedes/oc.m8.d4:ocMA.OdeW5C23.text	
ltx/en_us_goadedes/oc.m8.d4:ocMA.OdeW6C11.incipit	…
ltx/en_us_goadedes/oc.m8.d4:ocMA.OdeW6C11.melody	@ltx/en_us_goadedes/he.h.m8:heHE.AvyssosAmartion.name
ltx/en_us_goadedes/oc.m8.d4:ocMA.OdeW6C11.mode	@ltx/en_us_goadedes/miscellanea:misc.Mode8
ltx/en_us_goadedes/oc.m8.d4:ocMA.OdeW6C11.ode	@ltx/en_us_goadedes/miscellanea:misc.Ode6
ltx/en_us_goadedes/oc.m8.d4:ocMA.OdeW6C11.text	
ltx/en_us_goadedes/oc.m8.d4:ocMA.OdeW6C12.incipit	…
ltx/en_us_goadedes/oc.m8.d4:ocMA.OdeW6C12.melody	@ltx/en_us_goadedes/he.h.m8:heHE.AvyssosAmartion.name
ltx/en_us_goadedes/oc.m8.d4:ocMA.OdeW6C12.mode	@ltx/en_us_goadedes/miscellanea:misc.Mode8
ltx/en_us_goadedes/oc.m8.d4:ocMA.OdeW6C12.ode	@ltx/en_us_goadedes/miscellanea:misc.Ode6
ltx/en_us_goadedes/oc.m8.d4:ocMA.OdeW6C12.text	
ltx/en_us_goadedes/oc.m8.d4:ocMA.OdeW6C13.incipit	…
ltx/en_us_goadedes/oc.m8.d4:ocMA.OdeW6C13.melody	@ltx/en_us_goadedes/he.h.m8:heHE.AvyssosAmartion.name
ltx/en_us_goadedes/oc.m8.d4:ocMA.OdeW6C13.mode	@ltx/en_us_goadedes/miscellanea:misc.Mode8
ltx/en_us_goadedes/oc.m8.d4:ocMA.OdeW6C13.ode	@ltx/en_us_goadedes/miscellanea:misc.Ode6
ltx/en_us_goadedes/oc.m8.d4:ocMA.OdeW6C13.text	
ltx/en_us_goadedes/oc.m8.d4:ocMA.OdeW6C14.incipit	…
ltx/en_us_goadedes/oc.m8.d4:ocMA.OdeW6C14.melody	@ltx/en_us_goadedes/he.h.m8:heHE.AvyssosAmartion.name
ltx/en_us_goadedes/oc.m8.d4:ocMA.OdeW6C14.mode	@ltx/en_us_goadedes/miscellanea:misc.Mode8
ltx/en_us_goadedes/oc.m8.d4:ocMA.OdeW6C14.ode	@ltx/en_us_goadedes/miscellanea:misc.Ode6
ltx/en_us_goadedes/oc.m8.d4:ocMA.OdeW6C14.text	
ltx/en_us_goadedes/oc.m8.d4:ocMA.OdeW6C1H.greekmelody	@ltx/en_us_goadedes/he.h.m8:heHE.AvyssosAmartion.greekname
ltx/en_us_goadedes/oc.m8.d4:ocMA.OdeW6C1H.incipit	@ltx/en_us_goadedes/he.h.m8:heHE.AvyssosAmartion.incipit
ltx/en_us_goadedes/oc.m8.d4:ocMA.OdeW6C1H.melody	@ltx/en_us_goadedes/he.h.m8:heHE.AvyssosAmartion.melody
ltx/en_us_goadedes/oc.m8.d4:ocMA.OdeW6C1H.mode	@ltx/en_us_goadedes/miscellanea:misc.Mode8
ltx/en_us_goadedes/oc.m8.d4:ocMA.OdeW6C1H.ode	@ltx/en_us_goadedes/miscellanea:misc.Ode6
ltx/en_us_goadedes/oc.m8.d4:ocMA.OdeW6C1H.text	@ltx/en_us_goadedes/he.h.m8:heHE.AvyssosAmartion.text
ltx/en_us_goadedes/oc.m8.d4:ocMA.OdeW6C1T.incipit	…
ltx/en_us_goadedes/oc.m8.d4:ocMA.OdeW6C1T.melody	@ltx/en_us_goadedes/he.h.m8:heHE.AvyssosAmartion.name
ltx/en_us_goadedes/oc.m8.d4:ocMA.OdeW6C1T.mode	@ltx/en_us_goadedes/miscellanea:misc.Mode8
ltx/en_us_goadedes/oc.m8.d4:ocMA.OdeW6C1T.ode	@ltx/en_us_goadedes/miscellanea:misc.Ode6
ltx/en_us_goadedes/oc.m8.d4:ocMA.OdeW6C1T.text	
ltx/en_us_goadedes/oc.m8.d4:ocMA.OdeW6C21.greekmelody	@ltx/en_us_goadedes/he.h.m8:heHE.IlasthitiMoiSotir.greekname
ltx/en_us_goadedes/oc.m8.d4:ocMA.OdeW6C21.incipit	…
ltx/en_us_goadedes/oc.m8.d4:ocMA.OdeW6C21.melody	@ltx/en_us_goadedes/he.h.m8:heHE.IlasthitiMoiSotir.name
ltx/en_us_goadedes/oc.m8.d4:ocMA.OdeW6C21.mode	@ltx/en_us_goadedes/miscellanea:misc.Mode8
ltx/en_us_goadedes/oc.m8.d4:ocMA.OdeW6C21.ode	@ltx/en_us_goadedes/miscellanea:misc.Ode6
ltx/en_us_goadedes/oc.m8.d4:ocMA.OdeW6C21.text	
ltx/en_us_goadedes/oc.m8.d4:ocMA.OdeW6C22.incipit	…
ltx/en_us_goadedes/oc.m8.d4:ocMA.OdeW6C22.melody	@ltx/en_us_goadedes/he.h.m8:heHE.IlasthitiMoiSotir.name
ltx/en_us_goadedes/oc.m8.d4:ocMA.OdeW6C22.mode	@ltx/en_us_goadedes/miscellanea:misc.Mode8
ltx/en_us_goadedes/oc.m8.d4:ocMA.OdeW6C22.ode	@ltx/en_us_goadedes/miscellanea:misc.Ode6
ltx/en_us_goadedes/oc.m8.d4:ocMA.OdeW6C22.text	
ltx/en_us_goadedes/oc.m8.d4:ocMA.OdeW6C23.incipit	…
ltx/en_us_goadedes/oc.m8.d4:ocMA.OdeW6C23.melody	@ltx/en_us_goadedes/he.h.m8:heHE.IlasthitiMoiSotir.name
ltx/en_us_goadedes/oc.m8.d4:ocMA.OdeW6C23.mode	@ltx/en_us_goadedes/miscellanea:misc.Mode8
ltx/en_us_goadedes/oc.m8.d4:ocMA.OdeW6C23.ode	@ltx/en_us_goadedes/miscellanea:misc.Ode6
ltx/en_us_goadedes/oc.m8.d4:ocMA.OdeW6C23.text	
ltx/en_us_goadedes/oc.m8.d4:ocMA.OdeW6C24.incipit	…
ltx/en_us_goadedes/oc.m8.d4:ocMA.OdeW6C24.melody	@ltx/en_us_goadedes/he.h.m8:heHE.IlasthitiMoiSotir.name
ltx/en_us_goadedes/oc.m8.d4:ocMA.OdeW6C24.mode	@ltx/en_us_goadedes/miscellanea:misc.Mode8
ltx/en_us_goadedes/oc.m8.d4:ocMA.OdeW6C24.ode	@ltx/en_us_goadedes/miscellanea:misc.Ode6
ltx/en_us_goadedes/oc.m8.d4:ocMA.OdeW6C24.text	
ltx/en_us_goadedes/oc.m8.d4:ocMA.OdeW7C11.incipit	…
ltx/en_us_goadedes/oc.m8.d4:ocMA.OdeW7C11.melody	@ltx/en_us_goadedes/he.h.m8:heHE.TheouSynkatavasin.name
ltx/en_us_goadedes/oc.m8.d4:ocMA.OdeW7C11.mode	@ltx/en_us_goadedes/miscellanea:misc.Mode8
ltx/en_us_goadedes/oc.m8.d4:ocMA.OdeW7C11.ode	@ltx/en_us_goadedes/miscellanea:misc.Ode7
ltx/en_us_goadedes/oc.m8.d4:ocMA.OdeW7C11.text	
ltx/en_us_goadedes/oc.m8.d4:ocMA.OdeW7C12.incipit	…
ltx/en_us_goadedes/oc.m8.d4:ocMA.OdeW7C12.melody	@ltx/en_us_goadedes/he.h.m8:heHE.TheouSynkatavasin.name
ltx/en_us_goadedes/oc.m8.d4:ocMA.OdeW7C12.mode	@ltx/en_us_goadedes/miscellanea:misc.Mode8
ltx/en_us_goadedes/oc.m8.d4:ocMA.OdeW7C12.ode	@ltx/en_us_goadedes/miscellanea:misc.Ode7
ltx/en_us_goadedes/oc.m8.d4:ocMA.OdeW7C12.text	
ltx/en_us_goadedes/oc.m8.d4:ocMA.OdeW7C13.incipit	…
ltx/en_us_goadedes/oc.m8.d4:ocMA.OdeW7C13.melody	@ltx/en_us_goadedes/he.h.m8:heHE.TheouSynkatavasin.name
ltx/en_us_goadedes/oc.m8.d4:ocMA.OdeW7C13.mode	@ltx/en_us_goadedes/miscellanea:misc.Mode8
ltx/en_us_goadedes/oc.m8.d4:ocMA.OdeW7C13.ode	@ltx/en_us_goadedes/miscellanea:misc.Ode7
ltx/en_us_goadedes/oc.m8.d4:ocMA.OdeW7C13.text	
ltx/en_us_goadedes/oc.m8.d4:ocMA.OdeW7C14.incipit	…
ltx/en_us_goadedes/oc.m8.d4:ocMA.OdeW7C14.melody	@ltx/en_us_goadedes/he.h.m8:heHE.TheouSynkatavasin.name
ltx/en_us_goadedes/oc.m8.d4:ocMA.OdeW7C14.mode	@ltx/en_us_goadedes/miscellanea:misc.Mode8
ltx/en_us_goadedes/oc.m8.d4:ocMA.OdeW7C14.ode	@ltx/en_us_goadedes/miscellanea:misc.Ode7
ltx/en_us_goadedes/oc.m8.d4:ocMA.OdeW7C14.text	
ltx/en_us_goadedes/oc.m8.d4:ocMA.OdeW7C1H.greekmelody	@ltx/en_us_goadedes/he.h.m8:heHE.TheouSynkatavasin.greekname
ltx/en_us_goadedes/oc.m8.d4:ocMA.OdeW7C1H.incipit	@ltx/en_us_goadedes/he.h.m8:heHE.TheouSynkatavasin.incipit
ltx/en_us_goadedes/oc.m8.d4:ocMA.OdeW7C1H.melody	@ltx/en_us_goadedes/he.h.m8:heHE.TheouSynkatavasin.melody
ltx/en_us_goadedes/oc.m8.d4:ocMA.OdeW7C1H.mode	@ltx/en_us_goadedes/miscellanea:misc.Mode8
ltx/en_us_goadedes/oc.m8.d4:ocMA.OdeW7C1H.ode	@ltx/en_us_goadedes/miscellanea:misc.Ode7
ltx/en_us_goadedes/oc.m8.d4:ocMA.OdeW7C1H.text	@ltx/en_us_goadedes/he.h.m8:heHE.TheouSynkatavasin.text
ltx/en_us_goadedes/oc.m8.d4:ocMA.OdeW7C1T.incipit	…
ltx/en_us_goadedes/oc.m8.d4:ocMA.OdeW7C1T.melody	@ltx/en_us_goadedes/he.h.m8:heHE.TheouSynkatavasin.name
ltx/en_us_goadedes/oc.m8.d4:ocMA.OdeW7C1T.mode	@ltx/en_us_goadedes/miscellanea:misc.Mode8
ltx/en_us_goadedes/oc.m8.d4:ocMA.OdeW7C1T.ode	@ltx/en_us_goadedes/miscellanea:misc.Ode7
ltx/en_us_goadedes/oc.m8.d4:ocMA.OdeW7C1T.text	
ltx/en_us_goadedes/oc.m8.d4:ocMA.OdeW7C21.greekmelody	@ltx/en_us_goadedes/he.h.m8:heHE.TheouSynkatavasin.greekname
ltx/en_us_goadedes/oc.m8.d4:ocMA.OdeW7C21.incipit	…
ltx/en_us_goadedes/oc.m8.d4:ocMA.OdeW7C21.melody	@ltx/en_us_goadedes/he.h.m8:heHE.TheouSynkatavasin.name
ltx/en_us_goadedes/oc.m8.d4:ocMA.OdeW7C21.mode	@ltx/en_us_goadedes/miscellanea:misc.Mode8
ltx/en_us_goadedes/oc.m8.d4:ocMA.OdeW7C21.ode	@ltx/en_us_goadedes/miscellanea:misc.Ode7
ltx/en_us_goadedes/oc.m8.d4:ocMA.OdeW7C21.text	
ltx/en_us_goadedes/oc.m8.d4:ocMA.OdeW7C22.incipit	…
ltx/en_us_goadedes/oc.m8.d4:ocMA.OdeW7C22.melody	@ltx/en_us_goadedes/he.h.m8:heHE.TheouSynkatavasin.name
ltx/en_us_goadedes/oc.m8.d4:ocMA.OdeW7C22.mode	@ltx/en_us_goadedes/miscellanea:misc.Mode8
ltx/en_us_goadedes/oc.m8.d4:ocMA.OdeW7C22.ode	@ltx/en_us_goadedes/miscellanea:misc.Ode7
ltx/en_us_goadedes/oc.m8.d4:ocMA.OdeW7C22.text	
ltx/en_us_goadedes/oc.m8.d4:ocMA.OdeW7C23.incipit	…
ltx/en_us_goadedes/oc.m8.d4:ocMA.OdeW7C23.melody	@ltx/en_us_goadedes/he.h.m8:heHE.TheouSynkatavasin.name
ltx/en_us_goadedes/oc.m8.d4:ocMA.OdeW7C23.mode	@ltx/en_us_goadedes/miscellanea:misc.Mode8
ltx/en_us_goadedes/oc.m8.d4:ocMA.OdeW7C23.ode	@ltx/en_us_goadedes/miscellanea:misc.Ode7
ltx/en_us_goadedes/oc.m8.d4:ocMA.OdeW7C23.text	
ltx/en_us_goadedes/oc.m8.d4:ocMA.OdeW7C24.incipit	…
ltx/en_us_goadedes/oc.m8.d4:ocMA.OdeW7C24.melody	@ltx/en_us_goadedes/he.h.m8:heHE.TheouSynkatavasin.name
ltx/en_us_goadedes/oc.m8.d4:ocMA.OdeW7C24.mode	@ltx/en_us_goadedes/miscellanea:misc.Mode8
ltx/en_us_goadedes/oc.m8.d4:ocMA.OdeW7C24.ode	@ltx/en_us_goadedes/miscellanea:misc.Ode7
ltx/en_us_goadedes/oc.m8.d4:ocMA.OdeW7C24.text	
ltx/en_us_goadedes/oc.m8.d4:ocMA.OdeW8C11.incipit	…
ltx/en_us_goadedes/oc.m8.d4:ocMA.OdeW8C11.melody	@ltx/en_us_goadedes/he.h.m8:heHE.EptaplasiosKaminon.name
ltx/en_us_goadedes/oc.m8.d4:ocMA.OdeW8C11.mode	@ltx/en_us_goadedes/miscellanea:misc.Mode8
ltx/en_us_goadedes/oc.m8.d4:ocMA.OdeW8C11.ode	@ltx/en_us_goadedes/miscellanea:misc.Ode8
ltx/en_us_goadedes/oc.m8.d4:ocMA.OdeW8C11.text	
ltx/en_us_goadedes/oc.m8.d4:ocMA.OdeW8C12.incipit	…
ltx/en_us_goadedes/oc.m8.d4:ocMA.OdeW8C12.melody	@ltx/en_us_goadedes/he.h.m8:heHE.EptaplasiosKaminon.name
ltx/en_us_goadedes/oc.m8.d4:ocMA.OdeW8C12.mode	@ltx/en_us_goadedes/miscellanea:misc.Mode8
ltx/en_us_goadedes/oc.m8.d4:ocMA.OdeW8C12.ode	@ltx/en_us_goadedes/miscellanea:misc.Ode8
ltx/en_us_goadedes/oc.m8.d4:ocMA.OdeW8C12.text	
ltx/en_us_goadedes/oc.m8.d4:ocMA.OdeW8C13.incipit	…
ltx/en_us_goadedes/oc.m8.d4:ocMA.OdeW8C13.melody	@ltx/en_us_goadedes/he.h.m8:heHE.EptaplasiosKaminon.name
ltx/en_us_goadedes/oc.m8.d4:ocMA.OdeW8C13.mode	@ltx/en_us_goadedes/miscellanea:misc.Mode8
ltx/en_us_goadedes/oc.m8.d4:ocMA.OdeW8C13.ode	@ltx/en_us_goadedes/miscellanea:misc.Ode8
ltx/en_us_goadedes/oc.m8.d4:ocMA.OdeW8C13.text	
ltx/en_us_goadedes/oc.m8.d4:ocMA.OdeW8C14.incipit	…
ltx/en_us_goadedes/oc.m8.d4:ocMA.OdeW8C14.melody	@ltx/en_us_goadedes/he.h.m8:heHE.EptaplasiosKaminon.name
ltx/en_us_goadedes/oc.m8.d4:ocMA.OdeW8C14.mode	@ltx/en_us_goadedes/miscellanea:misc.Mode8
ltx/en_us_goadedes/oc.m8.d4:ocMA.OdeW8C14.ode	@ltx/en_us_goadedes/miscellanea:misc.Ode8
ltx/en_us_goadedes/oc.m8.d4:ocMA.OdeW8C14.text	
ltx/en_us_goadedes/oc.m8.d4:ocMA.OdeW8C1H.greekmelody	@ltx/en_us_goadedes/he.h.m8:heHE.EptaplasiosKaminon.greekname
ltx/en_us_goadedes/oc.m8.d4:ocMA.OdeW8C1H.incipit	@ltx/en_us_goadedes/he.h.m8:heHE.EptaplasiosKaminon.incipit
ltx/en_us_goadedes/oc.m8.d4:ocMA.OdeW8C1H.melody	@ltx/en_us_goadedes/he.h.m8:heHE.EptaplasiosKaminon.melody
ltx/en_us_goadedes/oc.m8.d4:ocMA.OdeW8C1H.mode	@ltx/en_us_goadedes/miscellanea:misc.Mode8
ltx/en_us_goadedes/oc.m8.d4:ocMA.OdeW8C1H.ode	@ltx/en_us_goadedes/miscellanea:misc.Ode8
ltx/en_us_goadedes/oc.m8.d4:ocMA.OdeW8C1H.text	@ltx/en_us_goadedes/he.h.m8:heHE.EptaplasiosKaminon.text
ltx/en_us_goadedes/oc.m8.d4:ocMA.OdeW8C1T.incipit	…
ltx/en_us_goadedes/oc.m8.d4:ocMA.OdeW8C1T.melody	@ltx/en_us_goadedes/he.h.m8:heHE.EptaplasiosKaminon.name
ltx/en_us_goadedes/oc.m8.d4:ocMA.OdeW8C1T.mode	@ltx/en_us_goadedes/miscellanea:misc.Mode8
ltx/en_us_goadedes/oc.m8.d4:ocMA.OdeW8C1T.ode	@ltx/en_us_goadedes/miscellanea:misc.Ode8
ltx/en_us_goadedes/oc.m8.d4:ocMA.OdeW8C1T.text	
ltx/en_us_goadedes/oc.m8.d4:ocMA.OdeW8C21.greekmelody	@ltx/en_us_goadedes/he.h.m8:heHE.EptaplasiosKaminon.greekname
ltx/en_us_goadedes/oc.m8.d4:ocMA.OdeW8C21.incipit	…
ltx/en_us_goadedes/oc.m8.d4:ocMA.OdeW8C21.melody	@ltx/en_us_goadedes/he.h.m8:heHE.EptaplasiosKaminon.name
ltx/en_us_goadedes/oc.m8.d4:ocMA.OdeW8C21.mode	@ltx/en_us_goadedes/miscellanea:misc.Mode8
ltx/en_us_goadedes/oc.m8.d4:ocMA.OdeW8C21.ode	@ltx/en_us_goadedes/miscellanea:misc.Ode8
ltx/en_us_goadedes/oc.m8.d4:ocMA.OdeW8C21.text	
ltx/en_us_goadedes/oc.m8.d4:ocMA.OdeW8C22.incipit	…
ltx/en_us_goadedes/oc.m8.d4:ocMA.OdeW8C22.melody	@ltx/en_us_goadedes/he.h.m8:heHE.EptaplasiosKaminon.name
ltx/en_us_goadedes/oc.m8.d4:ocMA.OdeW8C22.mode	@ltx/en_us_goadedes/miscellanea:misc.Mode8
ltx/en_us_goadedes/oc.m8.d4:ocMA.OdeW8C22.ode	@ltx/en_us_goadedes/miscellanea:misc.Ode8
ltx/en_us_goadedes/oc.m8.d4:ocMA.OdeW8C22.text	
ltx/en_us_goadedes/oc.m8.d4:ocMA.OdeW8C23.incipit	…
ltx/en_us_goadedes/oc.m8.d4:ocMA.OdeW8C23.melody	@ltx/en_us_goadedes/he.h.m8:heHE.EptaplasiosKaminon.name
ltx/en_us_goadedes/oc.m8.d4:ocMA.OdeW8C23.mode	@ltx/en_us_goadedes/miscellanea:misc.Mode8
ltx/en_us_goadedes/oc.m8.d4:ocMA.OdeW8C23.ode	@ltx/en_us_goadedes/miscellanea:misc.Ode8
ltx/en_us_goadedes/oc.m8.d4:ocMA.OdeW8C23.text	
ltx/en_us_goadedes/oc.m8.d4:ocMA.OdeW9C11.incipit	…
ltx/en_us_goadedes/oc.m8.d4:ocMA.OdeW9C11.melody	@ltx/en_us_goadedes/he.h.m8:heHE.ExestiEpiTouto.name
ltx/en_us_goadedes/oc.m8.d4:ocMA.OdeW9C11.mode	@ltx/en_us_goadedes/miscellanea:misc.Mode8
ltx/en_us_goadedes/oc.m8.d4:ocMA.OdeW9C11.ode	@ltx/en_us_goadedes/miscellanea:misc.Ode9
ltx/en_us_goadedes/oc.m8.d4:ocMA.OdeW9C11.text	
ltx/en_us_goadedes/oc.m8.d4:ocMA.OdeW9C12.incipit	…
ltx/en_us_goadedes/oc.m8.d4:ocMA.OdeW9C12.melody	@ltx/en_us_goadedes/he.h.m8:heHE.ExestiEpiTouto.name
ltx/en_us_goadedes/oc.m8.d4:ocMA.OdeW9C12.mode	@ltx/en_us_goadedes/miscellanea:misc.Mode8
ltx/en_us_goadedes/oc.m8.d4:ocMA.OdeW9C12.ode	@ltx/en_us_goadedes/miscellanea:misc.Ode9
ltx/en_us_goadedes/oc.m8.d4:ocMA.OdeW9C12.text	
ltx/en_us_goadedes/oc.m8.d4:ocMA.OdeW9C13.incipit	…
ltx/en_us_goadedes/oc.m8.d4:ocMA.OdeW9C13.melody	@ltx/en_us_goadedes/he.h.m8:heHE.ExestiEpiTouto.name
ltx/en_us_goadedes/oc.m8.d4:ocMA.OdeW9C13.mode	@ltx/en_us_goadedes/miscellanea:misc.Mode8
ltx/en_us_goadedes/oc.m8.d4:ocMA.OdeW9C13.ode	@ltx/en_us_goadedes/miscellanea:misc.Ode9
ltx/en_us_goadedes/oc.m8.d4:ocMA.OdeW9C13.text	
ltx/en_us_goadedes/oc.m8.d4:ocMA.OdeW9C14.incipit	…
ltx/en_us_goadedes/oc.m8.d4:ocMA.OdeW9C14.melody	@ltx/en_us_goadedes/he.h.m8:heHE.ExestiEpiTouto.name
ltx/en_us_goadedes/oc.m8.d4:ocMA.OdeW9C14.mode	@ltx/en_us_goadedes/miscellanea:misc.Mode8
ltx/en_us_goadedes/oc.m8.d4:ocMA.OdeW9C14.ode	@ltx/en_us_goadedes/miscellanea:misc.Ode9
ltx/en_us_goadedes/oc.m8.d4:ocMA.OdeW9C14.text	
ltx/en_us_goadedes/oc.m8.d4:ocMA.OdeW9C1H.greekmelody	@ltx/en_us_goadedes/he.h.m8:heHE.ExestiEpiTouto.greekname
ltx/en_us_goadedes/oc.m8.d4:ocMA.OdeW9C1H.incipit	@ltx/en_us_goadedes/he.h.m8:heHE.ExestiEpiTouto.incipit
ltx/en_us_goadedes/oc.m8.d4:ocMA.OdeW9C1H.melody	@ltx/en_us_goadedes/he.h.m8:heHE.ExestiEpiTouto.melody
ltx/en_us_goadedes/oc.m8.d4:ocMA.OdeW9C1H.mode	@ltx/en_us_goadedes/miscellanea:misc.Mode8
ltx/en_us_goadedes/oc.m8.d4:ocMA.OdeW9C1H.ode	@ltx/en_us_goadedes/miscellanea:misc.Ode9
ltx/en_us_goadedes/oc.m8.d4:ocMA.OdeW9C1H.text	@ltx/en_us_goadedes/he.h.m8:heHE.ExestiEpiTouto.text
ltx/en_us_goadedes/oc.m8.d4:ocMA.OdeW9C1T.incipit	…
ltx/en_us_goadedes/oc.m8.d4:ocMA.OdeW9C1T.melody	@ltx/en_us_goadedes/he.h.m8:heHE.ExestiEpiTouto.name
ltx/en_us_goadedes/oc.m8.d4:ocMA.OdeW9C1T.mode	@ltx/en_us_goadedes/miscellanea:misc.Mode8
ltx/en_us_goadedes/oc.m8.d4:ocMA.OdeW9C1T.ode	@ltx/en_us_goadedes/miscellanea:misc.Ode9
ltx/en_us_goadedes/oc.m8.d4:ocMA.OdeW9C1T.text	
ltx/en_us_goadedes/oc.m8.d4:ocMA.OdeW9C21.greekmelody	@ltx/en_us_goadedes/he.h.m8:heHE.EfrixePasaAkoi.greekname
ltx/en_us_goadedes/oc.m8.d4:ocMA.OdeW9C21.incipit	…
ltx/en_us_goadedes/oc.m8.d4:ocMA.OdeW9C21.melody	@ltx/en_us_goadedes/he.h.m8:heHE.EfrixePasaAkoi.name
ltx/en_us_goadedes/oc.m8.d4:ocMA.OdeW9C21.mode	@ltx/en_us_goadedes/miscellanea:misc.Mode8
ltx/en_us_goadedes/oc.m8.d4:ocMA.OdeW9C21.ode	@ltx/en_us_goadedes/miscellanea:misc.Ode9
ltx/en_us_goadedes/oc.m8.d4:ocMA.OdeW9C21.text	
ltx/en_us_goadedes/oc.m8.d4:ocMA.OdeW9C22.incipit	…
ltx/en_us_goadedes/oc.m8.d4:ocMA.OdeW9C22.melody	@ltx/en_us_goadedes/he.h.m8:heHE.EfrixePasaAkoi.name
ltx/en_us_goadedes/oc.m8.d4:ocMA.OdeW9C22.mode	@ltx/en_us_goadedes/miscellanea:misc.Mode8
ltx/en_us_goadedes/oc.m8.d4:ocMA.OdeW9C22.ode	@ltx/en_us_goadedes/miscellanea:misc.Ode9
ltx/en_us_goadedes/oc.m8.d4:ocMA.OdeW9C22.text	
ltx/en_us_goadedes/oc.m8.d4:ocMA.OdeW9C23.incipit	…
ltx/en_us_goadedes/oc.m8.d4:ocMA.OdeW9C23.melody	@ltx/en_us_goadedes/he.h.m8:heHE.EfrixePasaAkoi.name
ltx/en_us_goadedes/oc.m8.d4:ocMA.OdeW9C23.mode	@ltx/en_us_goadedes/miscellanea:misc.Mode8
ltx/en_us_goadedes/oc.m8.d4:ocMA.OdeW9C23.ode	@ltx/en_us_goadedes/miscellanea:misc.Ode9
ltx/en_us_goadedes/oc.m8.d4:ocMA.OdeW9C23.text	
ltx/en_us_goadedes/oc.m8.d4:ocMA.OdeW9C24.incipit	…
ltx/en_us_goadedes/oc.m8.d4:ocMA.OdeW9C24.melody	@ltx/en_us_goadedes/he.h.m8:heHE.EfrixePasaAkoi.name
ltx/en_us_goadedes/oc.m8.d4:ocMA.OdeW9C24.mode	@ltx/en_us_goadedes/miscellanea:misc.Mode8
ltx/en_us_goadedes/oc.m8.d4:ocMA.OdeW9C24.ode	@ltx/en_us_goadedes/miscellanea:misc.Ode9
ltx/en_us_goadedes/oc.m8.d4:ocMA.OdeW9C24.text	
ltx/en_us_goadedes/oc.m8.d4:ocVE.ApolTheotokionVM.incipit	…
ltx/en_us_goadedes/oc.m8.d4:ocVE.ApolTheotokionVM.melody	
ltx/en_us_goadedes/oc.m8.d4:ocVE.ApolTheotokionVM.mode	@ltx/en_us_goadedes/miscellanea:misc.Mode8
ltx/en_us_goadedes/oc.m8.d4:ocVE.ApolTheotokionVM.text	
ltx/en_us_goadedes/oc.m8.d4:ocVE.AposTheotokion.greekmelody	@ltx/en_us_goadedes/he.a.m8:heAU.OiMartyresSouKyrie.greekname
ltx/en_us_goadedes/oc.m8.d4:ocVE.AposTheotokion.incipit	…
ltx/en_us_goadedes/oc.m8.d4:ocVE.AposTheotokion.melody	@ltx/en_us_goadedes/he.a.m8:heAU.OiMartyresSouKyrie.name
ltx/en_us_goadedes/oc.m8.d4:ocVE.AposTheotokion.mode	@ltx/en_us_goadedes/miscellanea:misc.Mode8
ltx/en_us_goadedes/oc.m8.d4:ocVE.AposTheotokion.text	
ltx/en_us_goadedes/oc.m8.d4:ocVE.Aposticha1.incipit	…
ltx/en_us_goadedes/oc.m8.d4:ocVE.Aposticha1.melody	
ltx/en_us_goadedes/oc.m8.d4:ocVE.Aposticha1.mode	@ltx/en_us_goadedes/miscellanea:misc.Mode8
ltx/en_us_goadedes/oc.m8.d4:ocVE.Aposticha1.text	
ltx/en_us_goadedes/oc.m8.d4:ocVE.Aposticha2.incipit	…
ltx/en_us_goadedes/oc.m8.d4:ocVE.Aposticha2.melody	
ltx/en_us_goadedes/oc.m8.d4:ocVE.Aposticha2.mode	@ltx/en_us_goadedes/miscellanea:misc.Mode8
ltx/en_us_goadedes/oc.m8.d4:ocVE.Aposticha2.text	
ltx/en_us_goadedes/oc.m8.d4:ocVE.Aposticha3.greekmelody	@ltx/en_us_goadedes/he.a.m8:heAU.OiMartyresSouKyrie.greekname
ltx/en_us_goadedes/oc.m8.d4:ocVE.Aposticha3.incipit	@ltx/en_us_goadedes/he.a.m8:heAU.OiMartyresSouKyrie.incipit
ltx/en_us_goadedes/oc.m8.d4:ocVE.Aposticha3.melody	@ltx/en_us_goadedes/he.a.m8:heAU.OiMartyresSouKyrie.melody
ltx/en_us_goadedes/oc.m8.d4:ocVE.Aposticha3.mode	@ltx/en_us_goadedes/miscellanea:misc.Mode8
ltx/en_us_goadedes/oc.m8.d4:ocVE.Aposticha3.text	@ltx/en_us_goadedes/he.a.m8:heAU.OiMartyresSouKyrie.text
ltx/en_us_goadedes/oc.m8.d4:ocVE.SticTheotokion.greekmelody	@ltx/en_us_goadedes/he.a.m8:heAU.OTouParadoxou.greekname
ltx/en_us_goadedes/oc.m8.d4:ocVE.SticTheotokion.incipit	…
ltx/en_us_goadedes/oc.m8.d4:ocVE.SticTheotokion.melody	@ltx/en_us_goadedes/he.a.m8:heAU.OTouParadoxou.name
ltx/en_us_goadedes/oc.m8.d4:ocVE.SticTheotokion.mode	@ltx/en_us_goadedes/miscellanea:misc.Mode8
ltx/en_us_goadedes/oc.m8.d4:ocVE.SticTheotokion.text	
ltx/en_us_goadedes/oc.m8.d4:ocVE.Stichera1.greekmelody	@ltx/en_us_goadedes/he.a.m8:heAU.OTouParadoxou.greekname
ltx/en_us_goadedes/oc.m8.d4:ocVE.Stichera1.incipit	…
ltx/en_us_goadedes/oc.m8.d4:ocVE.Stichera1.melody	@ltx/en_us_goadedes/he.a.m8:heAU.OTouParadoxou.name
ltx/en_us_goadedes/oc.m8.d4:ocVE.Stichera1.mode	@ltx/en_us_goadedes/miscellanea:misc.Mode8
ltx/en_us_goadedes/oc.m8.d4:ocVE.Stichera1.text	
ltx/en_us_goadedes/oc.m8.d4:ocVE.Stichera2.incipit	…
ltx/en_us_goadedes/oc.m8.d4:ocVE.Stichera2.melody	@ltx/en_us_goadedes/he.a.m8:heAU.OTouParadoxou.name
ltx/en_us_goadedes/oc.m8.d4:ocVE.Stichera2.mode	@ltx/en_us_goadedes/miscellanea:misc.Mode8
ltx/en_us_goadedes/oc.m8.d4:ocVE.Stichera2.text	
ltx/en_us_goadedes/oc.m8.d4:ocVE.Stichera3.incipit	…
ltx/en_us_goadedes/oc.m8.d4:ocVE.Stichera3.melody	@ltx/en_us_goadedes/he.a.m8:heAU.OTouParadoxou.name
ltx/en_us_goadedes/oc.m8.d4:ocVE.Stichera3.mode	@ltx/en_us_goadedes/miscellanea:misc.Mode8
ltx/en_us_goadedes/oc.m8.d4:ocVE.Stichera3.text	
ltx/en_us_goadedes/oc.m8.d4:ocVE.Stichera4.greekmelody	@ltx/en_us_goadedes/he.a.m8:heAU.OTouParadoxou.greekname
ltx/en_us_goadedes/oc.m8.d4:ocVE.Stichera4.incipit	Ever-virgin Bride of God…
ltx/en_us_goadedes/oc.m8.d4:ocVE.Stichera4.melody	@ltx/en_us_goadedes/he.a.m8:heAU.OTouParadoxou.name
ltx/en_us_goadedes/oc.m8.d4:ocVE.Stichera4.mode	@ltx/en_us_goadedes/miscellanea:misc.Mode8
ltx/en_us_goadedes/oc.m8.d4:ocVE.Stichera4.text	Ever-virgin Bride of God, rejoice! * For all believers, the hope! * You deliver your servants from * all adversity. Rejoice! And the world is forgiven through you. * Rejoice! Through you was the realm of death destroyed. * You are the life-bearing Paradise. Rejoice! * You are the help of all * who invoke you when they pray and who salute * you, the dwelling place of God, and holy mountain. Rejoice!
ltx/en_us_goadedes/oc.m8.d4:ocVE.Stichera5.incipit	…
ltx/en_us_goadedes/oc.m8.d4:ocVE.Stichera5.melody	@ltx/en_us_goadedes/he.a.m8:heAU.OTouParadoxou.name
ltx/en_us_goadedes/oc.m8.d4:ocVE.Stichera5.mode	@ltx/en_us_goadedes/miscellanea:misc.Mode8
ltx/en_us_goadedes/oc.m8.d4:ocVE.Stichera5.text	
ltx/en_us_goadedes/oc.m8.d4:ocVE.Stichera6.incipit	…
ltx/en_us_goadedes/oc.m8.d4:ocVE.Stichera6.melody	@ltx/en_us_goadedes/he.a.m8:heAU.OTouParadoxou.name
ltx/en_us_goadedes/oc.m8.d4:ocVE.Stichera6.mode	@ltx/en_us_goadedes/miscellanea:misc.Mode8
ltx/en_us_goadedes/oc.m8.d4:ocVE.Stichera6.text	
ltx/en_us_goadedes/oc.m8.d4:octrMA.Kathisma11.incipit	@ltx/en_us_goadedes/oc.m8.d4:ocMA.Kathisma11.incipit
ltx/en_us_goadedes/oc.m8.d4:octrMA.Kathisma11.melody	
ltx/en_us_goadedes/oc.m8.d4:octrMA.Kathisma11.mode	@ltx/en_us_goadedes/miscellanea:misc.Mode8
ltx/en_us_goadedes/oc.m8.d4:octrMA.Kathisma11.text	@ltx/en_us_goadedes/oc.m8.d4:ocMA.Kathisma11.text
ltx/en_us_goadedes/oc.m8.d4:octrMA.Kathisma12.incipit	@ltx/en_us_goadedes/oc.m8.d4:ocMA.Kathisma12.incipit
ltx/en_us_goadedes/oc.m8.d4:octrMA.Kathisma12.melody	
ltx/en_us_goadedes/oc.m8.d4:octrMA.Kathisma12.mode	@ltx/en_us_goadedes/miscellanea:misc.Mode8
ltx/en_us_goadedes/oc.m8.d4:octrMA.Kathisma12.text	@ltx/en_us_goadedes/oc.m8.d4:ocMA.Kathisma12.text
ltx/en_us_goadedes/oc.m8.d4:octrMA.Kathisma1T.greekmelody	@ltx/en_us_goadedes/he.a.m8:heAU.TinSofianKaiLogon.greekname
ltx/en_us_goadedes/oc.m8.d4:octrMA.Kathisma1T.incipit	@ltx/en_us_goadedes/oc.m8.d4:ocMA.Kathisma13.incipit
ltx/en_us_goadedes/oc.m8.d4:octrMA.Kathisma1T.melody	@ltx/en_us_goadedes/he.a.m8:heAU.TinSofianKaiLogon.name
ltx/en_us_goadedes/oc.m8.d4:octrMA.Kathisma1T.mode	@ltx/en_us_goadedes/miscellanea:misc.Mode8
ltx/en_us_goadedes/oc.m8.d4:octrMA.Kathisma1T.text	@ltx/en_us_goadedes/oc.m8.d4:ocMA.Kathisma13.text
ltx/en_us_goadedes/oc.m8.d4:octrMA.Ode7Martyricon.incipit	…
ltx/en_us_goadedes/oc.m8.d4:octrMA.Ode7Martyricon.melody	
ltx/en_us_goadedes/oc.m8.d4:octrMA.Ode7Martyricon.mode	@ltx/en_us_goadedes/miscellanea:misc.Mode8
ltx/en_us_goadedes/oc.m8.d4:octrMA.Ode7Martyricon.text	
ltx/en_us_goadedes/oc.m8.d4:octrMA.Photogogic.incipit	@ltx/en_us_goadedes/oc.m8.d2:octrMA.Photagogic.incipit
ltx/en_us_goadedes/oc.m8.d4:octrMA.Photogogic.mode	@ltx/en_us_goadedes/miscellanea:misc.Mode8
ltx/en_us_goadedes/oc.m8.d4:octrMA.Photogogic.text	@ltx/en_us_goadedes/oc.m8.d2:octrMA.Photagogic.text
ltx/en_us_goadedes/oc.m8.d4:octrMA.Triadic1.incipit	@ltx/en_us_goadedes/oc.m8.d2:octrMA.Triadic1.incipit
ltx/en_us_goadedes/oc.m8.d4:octrMA.Triadic1.mode	@ltx/en_us_goadedes/miscellanea:misc.Mode8
ltx/en_us_goadedes/oc.m8.d4:octrMA.Triadic1.text	@ltx/en_us_goadedes/oc.m8.d2:octrMA.Triadic1.text
ltx/en_us_goadedes/oc.m8.d4:octrMA.Triadic2.incipit	@ltx/en_us_goadedes/oc.m8.d2:octrMA.Triadic2.incipit
ltx/en_us_goadedes/oc.m8.d4:octrMA.Triadic2.mode	@ltx/en_us_goadedes/miscellanea:misc.Mode8
ltx/en_us_goadedes/oc.m8.d4:octrMA.Triadic2.text	@ltx/en_us_goadedes/oc.m8.d2:octrMA.Triadic2.text
ltx/en_us_goadedes/oc.m8.d4:octrMA.Triadic3.incipit	@ltx/en_us_goadedes/oc.m8.d2:octrMA.Triadic3.incipit
ltx/en_us_goadedes/oc.m8.d4:octrMA.Triadic3.mode	@ltx/en_us_goadedes/miscellanea:misc.Mode8
ltx/en_us_goadedes/oc.m8.d4:octrMA.Triadic3.text	@ltx/en_us_goadedes/oc.m8.d2:octrMA.Triadic3.text
