ltx/en_us_goadedes/pe.d116:peDA.commemoration.full	
ltx/en_us_goadedes/pe.d116:peDA.commemoration.short	
ltx/en_us_goadedes/pe.d116:peDA.dismissal	@ltx/en_us_goadedes/dismissals:dis00.ascension
ltx/en_us_goadedes/pe.d116:peDA.insert1	
ltx/en_us_goadedes/pe.d116:peDA.insert2	
ltx/en_us_goadedes/pe.d116:peDA.note	
ltx/en_us_goadedes/pe.d116:peHO.commemorations	
ltx/en_us_goadedes/pe.d116:peHO.daytitle	
ltx/en_us_goadedes/pe.d116:peHO.description1	
ltx/en_us_goadedes/pe.d116:peHO.description2	
ltx/en_us_goadedes/pe.d116:peHO.note1	
ltx/en_us_goadedes/pe.d116:peHO.note2	
ltx/en_us_goadedes/pe.d116:peMA.AposGlory.incipit	@ltx/en_us_goadedes/pe.d110:peVE.SticGlory.incipit
ltx/en_us_goadedes/pe.d116:peMA.AposGlory.melody	@ltx/en_us_goadedes/pe.d110:peVE.SticGlory.melody
ltx/en_us_goadedes/pe.d116:peMA.AposGlory.mode	@ltx/en_us_goadedes/pe.d110:peVE.SticGlory.mode
ltx/en_us_goadedes/pe.d116:peMA.AposGlory.text	@ltx/en_us_goadedes/pe.d110:peVE.SticGlory.text
ltx/en_us_goadedes/pe.d116:peMA.Aposticha1.greekmelody	@ltx/en_us_goadedes/he.a.m6:heAU.TriimerosAnestis.greekname
ltx/en_us_goadedes/pe.d116:peMA.Aposticha1.incipit	…
ltx/en_us_goadedes/pe.d116:peMA.Aposticha1.melody	@ltx/en_us_goadedes/he.a.m6:heAU.TriimerosAnestis.name
ltx/en_us_goadedes/pe.d116:peMA.Aposticha1.mode	@ltx/en_us_goadedes/miscellanea:misc.Mode6
ltx/en_us_goadedes/pe.d116:peMA.Aposticha1.text	
ltx/en_us_goadedes/pe.d116:peMA.Aposticha2.incipit	…
ltx/en_us_goadedes/pe.d116:peMA.Aposticha2.melody	@ltx/en_us_goadedes/he.a.m6:heAU.TriimerosAnestis.name
ltx/en_us_goadedes/pe.d116:peMA.Aposticha2.mode	@ltx/en_us_goadedes/miscellanea:misc.Mode6
ltx/en_us_goadedes/pe.d116:peMA.Aposticha2.text	
ltx/en_us_goadedes/pe.d116:peMA.Aposticha3.incipit	…
ltx/en_us_goadedes/pe.d116:peMA.Aposticha3.melody	@ltx/en_us_goadedes/he.a.m6:heAU.TriimerosAnestis.name
ltx/en_us_goadedes/pe.d116:peMA.Aposticha3.mode	@ltx/en_us_goadedes/miscellanea:misc.Mode6
ltx/en_us_goadedes/pe.d116:peMA.Aposticha3.text	
ltx/en_us_goadedes/pe.d116:peMA.Kathisma11.greekmelody	@ltx/en_us_goadedes/he.a.m4:heAU.EpefanisSimeron.greekname
ltx/en_us_goadedes/pe.d116:peMA.Kathisma11.incipit	…
ltx/en_us_goadedes/pe.d116:peMA.Kathisma11.melody	@ltx/en_us_goadedes/he.a.m4:heAU.EpefanisSimeron.name
ltx/en_us_goadedes/pe.d116:peMA.Kathisma11.mode	@ltx/en_us_goadedes/miscellanea:misc.Mode4
ltx/en_us_goadedes/pe.d116:peMA.Kathisma11.text	
ltx/en_us_goadedes/pe.d116:peMA.Kathisma21.greekmelody	@ltx/en_us_goadedes/he.a.m4:heAU.EpefanisSimeron.greekname
ltx/en_us_goadedes/pe.d116:peMA.Kathisma21.incipit	…
ltx/en_us_goadedes/pe.d116:peMA.Kathisma21.melody	@ltx/en_us_goadedes/he.a.m4:heAU.EpefanisSimeron.name
ltx/en_us_goadedes/pe.d116:peMA.Kathisma21.mode	@ltx/en_us_goadedes/miscellanea:misc.Mode4
ltx/en_us_goadedes/pe.d116:peMA.Kathisma21.text	
ltx/en_us_goadedes/pe.d116:peVE.AposGlory.incipit	@ltx/en_us_goadedes/pe.d111:peMA.AposGlory.incipit
ltx/en_us_goadedes/pe.d116:peVE.AposGlory.melody	@ltx/en_us_goadedes/pe.d111:peMA.AposGlory.melody
ltx/en_us_goadedes/pe.d116:peVE.AposGlory.mode	@ltx/en_us_goadedes/pe.d111:peMA.AposGlory.mode
ltx/en_us_goadedes/pe.d116:peVE.AposGlory.text	@ltx/en_us_goadedes/pe.d111:peMA.AposGlory.text
ltx/en_us_goadedes/pe.d116:peVE.Aposticha1.greekmelody	@ltx/en_us_goadedes/pe.d111:peMA.Aposticha1.greekmelody
ltx/en_us_goadedes/pe.d116:peVE.Aposticha1.incipit	@ltx/en_us_goadedes/pe.d111:peMA.Aposticha1.incipit
ltx/en_us_goadedes/pe.d116:peVE.Aposticha1.melody	@ltx/en_us_goadedes/pe.d111:peMA.Aposticha1.melody
ltx/en_us_goadedes/pe.d116:peVE.Aposticha1.mode	@ltx/en_us_goadedes/pe.d111:peMA.Aposticha1.mode
ltx/en_us_goadedes/pe.d116:peVE.Aposticha1.text	@ltx/en_us_goadedes/pe.d111:peMA.Aposticha1.text
ltx/en_us_goadedes/pe.d116:peVE.Aposticha2.incipit	@ltx/en_us_goadedes/pe.d111:peMA.Aposticha2.incipit
ltx/en_us_goadedes/pe.d116:peVE.Aposticha2.melody	@ltx/en_us_goadedes/pe.d111:peMA.Aposticha2.melody
ltx/en_us_goadedes/pe.d116:peVE.Aposticha2.mode	@ltx/en_us_goadedes/pe.d111:peMA.Aposticha2.mode
ltx/en_us_goadedes/pe.d116:peVE.Aposticha2.text	@ltx/en_us_goadedes/pe.d111:peMA.Aposticha2.text
ltx/en_us_goadedes/pe.d116:peVE.Aposticha3.incipit	@ltx/en_us_goadedes/pe.d111:peMA.Aposticha3.incipit
ltx/en_us_goadedes/pe.d116:peVE.Aposticha3.melody	@ltx/en_us_goadedes/pe.d111:peMA.Aposticha3.melody
ltx/en_us_goadedes/pe.d116:peVE.Aposticha3.mode	@ltx/en_us_goadedes/pe.d111:peMA.Aposticha3.mode
ltx/en_us_goadedes/pe.d116:peVE.Aposticha3.text	@ltx/en_us_goadedes/pe.d111:peMA.Aposticha3.text
ltx/en_us_goadedes/pe.d116:peVE.SticGlory.incipit	…
ltx/en_us_goadedes/pe.d116:peVE.SticGlory.melody	@ltx/en_us_goadedes/miscellanea:misc.Idiomelon
ltx/en_us_goadedes/pe.d116:peVE.SticGlory.mode	@ltx/en_us_goadedes/miscellanea:misc.Mode5
ltx/en_us_goadedes/pe.d116:peVE.SticGlory.text	
ltx/en_us_goadedes/pe.d116:peVE.Stichera01.greekmelody	@ltx/en_us_goadedes/he.a.m4:heAU.OsGennaionEnMartysi.greekname
ltx/en_us_goadedes/pe.d116:peVE.Stichera01.incipit	…
ltx/en_us_goadedes/pe.d116:peVE.Stichera01.melody	@ltx/en_us_goadedes/he.a.m4:heAU.OsGennaionEnMartysi.name
ltx/en_us_goadedes/pe.d116:peVE.Stichera01.mode	@ltx/en_us_goadedes/miscellanea:misc.Mode4
ltx/en_us_goadedes/pe.d116:peVE.Stichera01.text	
ltx/en_us_goadedes/pe.d116:peVE.Stichera02.incipit	…
ltx/en_us_goadedes/pe.d116:peVE.Stichera02.melody	@ltx/en_us_goadedes/he.a.m4:heAU.OsGennaionEnMartysi.name
ltx/en_us_goadedes/pe.d116:peVE.Stichera02.mode	@ltx/en_us_goadedes/miscellanea:misc.Mode4
ltx/en_us_goadedes/pe.d116:peVE.Stichera02.text	
ltx/en_us_goadedes/pe.d116:peVE.Stichera03.incipit	…
ltx/en_us_goadedes/pe.d116:peVE.Stichera03.melody	@ltx/en_us_goadedes/he.a.m4:heAU.OsGennaionEnMartysi.name
ltx/en_us_goadedes/pe.d116:peVE.Stichera03.mode	@ltx/en_us_goadedes/miscellanea:misc.Mode4
ltx/en_us_goadedes/pe.d116:peVE.Stichera03.text	
