ltx/en_us_goadedes/he.h.m5:heHE.AkikoaKyrieTinAkoin.greekname	Ἀκήκοα Κύριε τὴν ἀκοήν.
ltx/en_us_goadedes/he.h.m5:heHE.AkikoaKyrieTinAkoin.incipit	…
ltx/en_us_goadedes/he.h.m5:heHE.AkikoaKyrieTinAkoin.melody	@ltx/en_us_goadedes/miscellanea:misc.Heirmos
ltx/en_us_goadedes/he.h.m5:heHE.AkikoaKyrieTinAkoin.mode	@ltx/en_us_goadedes/miscellanea:misc.Mode5
ltx/en_us_goadedes/he.h.m5:heHE.AkikoaKyrieTinAkoin.name	
ltx/en_us_goadedes/he.h.m5:heHE.AkikoaKyrieTinAkoin.notmetered	N/M ()
ltx/en_us_goadedes/he.h.m5:heHE.AkikoaKyrieTinAkoin.ode	@ltx/en_us_goadedes/miscellanea:misc.Ode4
ltx/en_us_goadedes/he.h.m5:heHE.AkikoaKyrieTinAkoin.text	
ltx/en_us_goadedes/he.h.m5:heHE.AkikoaKyrieTinEkTouTafou.greekname	Ἀκήκοα Κύριε τὴν ἐκ τοῦ τάφου.
ltx/en_us_goadedes/he.h.m5:heHE.AkikoaKyrieTinEkTouTafou.incipit	…
ltx/en_us_goadedes/he.h.m5:heHE.AkikoaKyrieTinEkTouTafou.melody	@ltx/en_us_goadedes/miscellanea:misc.Heirmos
ltx/en_us_goadedes/he.h.m5:heHE.AkikoaKyrieTinEkTouTafou.mode	@ltx/en_us_goadedes/miscellanea:misc.Mode5
ltx/en_us_goadedes/he.h.m5:heHE.AkikoaKyrieTinEkTouTafou.name	
ltx/en_us_goadedes/he.h.m5:heHE.AkikoaKyrieTinEkTouTafou.notmetered	N/M ()
ltx/en_us_goadedes/he.h.m5:heHE.AkikoaKyrieTinEkTouTafou.ode	@ltx/en_us_goadedes/miscellanea:misc.Ode4
ltx/en_us_goadedes/he.h.m5:heHE.AkikoaKyrieTinEkTouTafou.text	I heard of Your resurrection from the sepulcher, O Lord, * and I glorified You power which is invincible.
ltx/en_us_goadedes/he.h.m5:heHE.AngelonSystima.greekname	Ἀγγέλων σύστημα.
ltx/en_us_goadedes/he.h.m5:heHE.AngelonSystima.incipit	…
ltx/en_us_goadedes/he.h.m5:heHE.AngelonSystima.melody	@ltx/en_us_goadedes/miscellanea:misc.Heirmos
ltx/en_us_goadedes/he.h.m5:heHE.AngelonSystima.mode	@ltx/en_us_goadedes/miscellanea:misc.Mode5
ltx/en_us_goadedes/he.h.m5:heHE.AngelonSystima.name	
ltx/en_us_goadedes/he.h.m5:heHE.AngelonSystima.notmetered	N/M ()
ltx/en_us_goadedes/he.h.m5:heHE.AngelonSystima.ode	@ltx/en_us_goadedes/miscellanea:misc.Ode8
ltx/en_us_goadedes/he.h.m5:heHE.AngelonSystima.text	
ltx/en_us_goadedes/he.h.m5:heHE.AsomenToKyrio.greekname	ᾌσωμεν τῷ Κυρίῳ.
ltx/en_us_goadedes/he.h.m5:heHE.AsomenToKyrio.incipit	…
ltx/en_us_goadedes/he.h.m5:heHE.AsomenToKyrio.melody	@ltx/en_us_goadedes/miscellanea:misc.Heirmos
ltx/en_us_goadedes/he.h.m5:heHE.AsomenToKyrio.mode	@ltx/en_us_goadedes/miscellanea:misc.Mode5
ltx/en_us_goadedes/he.h.m5:heHE.AsomenToKyrio.name	
ltx/en_us_goadedes/he.h.m5:heHE.AsomenToKyrio.notmetered	N/M ()
ltx/en_us_goadedes/he.h.m5:heHE.AsomenToKyrio.ode	@ltx/en_us_goadedes/miscellanea:misc.Ode1
ltx/en_us_goadedes/he.h.m5:heHE.AsomenToKyrio.text	
ltx/en_us_goadedes/he.h.m5:heHE.DynameiTouStavrouSou.greekname	Δυνάμει τοῦ Σταυροῦ σου.
ltx/en_us_goadedes/he.h.m5:heHE.DynameiTouStavrouSou.incipit	O Christ, I pray…
ltx/en_us_goadedes/he.h.m5:heHE.DynameiTouStavrouSou.melody	@ltx/en_us_goadedes/miscellanea:misc.Heirmos
ltx/en_us_goadedes/he.h.m5:heHE.DynameiTouStavrouSou.mode	@ltx/en_us_goadedes/miscellanea:misc.Mode5
ltx/en_us_goadedes/he.h.m5:heHE.DynameiTouStavrouSou.name	O Christ, I pray.
ltx/en_us_goadedes/he.h.m5:heHE.DynameiTouStavrouSou.notmetered	N/M (O Christ, I pray.)
ltx/en_us_goadedes/he.h.m5:heHE.DynameiTouStavrouSou.ode	@ltx/en_us_goadedes/miscellanea:misc.Ode3
ltx/en_us_goadedes/he.h.m5:heHE.DynameiTouStavrouSou.text	O Christ, I pray You strengthen my mind * and heart, O Savior, by Your Cross’s might, * that I may praise You and glorify * Your Ascension that has saved us all.
ltx/en_us_goadedes/he.h.m5:heHE.EisakikoaTinAkoin.greekname	Εἰσακήκοα τὴν ἀκοήν.
ltx/en_us_goadedes/he.h.m5:heHE.EisakikoaTinAkoin.incipit	I have heard the report…
ltx/en_us_goadedes/he.h.m5:heHE.EisakikoaTinAkoin.melody	@ltx/en_us_goadedes/miscellanea:misc.Heirmos
ltx/en_us_goadedes/he.h.m5:heHE.EisakikoaTinAkoin.mode	@ltx/en_us_goadedes/miscellanea:misc.Mode5
ltx/en_us_goadedes/he.h.m5:heHE.EisakikoaTinAkoin.name	I have heard the report.
ltx/en_us_goadedes/he.h.m5:heHE.EisakikoaTinAkoin.notmetered	N/M (I have heard the report.)
ltx/en_us_goadedes/he.h.m5:heHE.EisakikoaTinAkoin.ode	@ltx/en_us_goadedes/miscellanea:misc.Ode4
ltx/en_us_goadedes/he.h.m5:heHE.EisakikoaTinAkoin.text	I have heard the report about the power of Your Cross, * that the Garden of Eden was opened by it, O Christ, * and I cried aloud: * Glory to Your strength, O Lord my God.
ltx/en_us_goadedes/he.h.m5:heHE.EkNyktosOrthrizontes.greekname	Ἐκ νυκτὸς ὀρθρίζοντες.
ltx/en_us_goadedes/he.h.m5:heHE.EkNyktosOrthrizontes.incipit	…
ltx/en_us_goadedes/he.h.m5:heHE.EkNyktosOrthrizontes.melody	@ltx/en_us_goadedes/miscellanea:misc.Heirmos
ltx/en_us_goadedes/he.h.m5:heHE.EkNyktosOrthrizontes.mode	@ltx/en_us_goadedes/miscellanea:misc.Mode5
ltx/en_us_goadedes/he.h.m5:heHE.EkNyktosOrthrizontes.name	
ltx/en_us_goadedes/he.h.m5:heHE.EkNyktosOrthrizontes.notmetered	N/M ()
ltx/en_us_goadedes/he.h.m5:heHE.EkNyktosOrthrizontes.ode	@ltx/en_us_goadedes/miscellanea:misc.Ode5
ltx/en_us_goadedes/he.h.m5:heHE.EkNyktosOrthrizontes.text	
ltx/en_us_goadedes/he.h.m5:heHE.EkykloseMeAvyssos.greekname	Ἐκύκλωσέ με ἄβυσσος.
ltx/en_us_goadedes/he.h.m5:heHE.EkykloseMeAvyssos.incipit	The deep abyss…
ltx/en_us_goadedes/he.h.m5:heHE.EkykloseMeAvyssos.melody	@ltx/en_us_goadedes/miscellanea:misc.Heirmos
ltx/en_us_goadedes/he.h.m5:heHE.EkykloseMeAvyssos.mode	@ltx/en_us_goadedes/miscellanea:misc.Mode5
ltx/en_us_goadedes/he.h.m5:heHE.EkykloseMeAvyssos.name	The deep abyss.
ltx/en_us_goadedes/he.h.m5:heHE.EkykloseMeAvyssos.notmetered	N/M (The deep abyss.)
ltx/en_us_goadedes/he.h.m5:heHE.EkykloseMeAvyssos.ode	@ltx/en_us_goadedes/miscellanea:misc.Ode6
ltx/en_us_goadedes/he.h.m5:heHE.EkykloseMeAvyssos.text	The deep abyss encompassed me; the great fish became like a tomb for me. * But I cried aloud to You, benevolent Lord my God. * Then with Your right hand, You raised me and delivered me.
ltx/en_us_goadedes/he.h.m5:heHE.EpiTaEthni.greekname	Ἐπὶ τὰ ἔθνη.
ltx/en_us_goadedes/he.h.m5:heHE.EpiTaEthni.incipit	…
ltx/en_us_goadedes/he.h.m5:heHE.EpiTaEthni.melody	@ltx/en_us_goadedes/miscellanea:misc.Heirmos
ltx/en_us_goadedes/he.h.m5:heHE.EpiTaEthni.mode	@ltx/en_us_goadedes/miscellanea:misc.Mode5
ltx/en_us_goadedes/he.h.m5:heHE.EpiTaEthni.name	
ltx/en_us_goadedes/he.h.m5:heHE.EpiTaEthni.notmetered	N/M ()
ltx/en_us_goadedes/he.h.m5:heHE.EpiTaEthni.ode	@ltx/en_us_goadedes/miscellanea:misc.Ode3
ltx/en_us_goadedes/he.h.m5:heHE.EpiTaEthni.text	
ltx/en_us_goadedes/he.h.m5:heHE.EvlogitosEiOTheos.greekname	Εὐλογητὸς εἶ ὁ Θεός.
ltx/en_us_goadedes/he.h.m5:heHE.EvlogitosEiOTheos.incipit	…
ltx/en_us_goadedes/he.h.m5:heHE.EvlogitosEiOTheos.melody	@ltx/en_us_goadedes/miscellanea:misc.Heirmos
ltx/en_us_goadedes/he.h.m5:heHE.EvlogitosEiOTheos.mode	@ltx/en_us_goadedes/miscellanea:misc.Mode5
ltx/en_us_goadedes/he.h.m5:heHE.EvlogitosEiOTheos.name	
ltx/en_us_goadedes/he.h.m5:heHE.EvlogitosEiOTheos.notmetered	N/M ()
ltx/en_us_goadedes/he.h.m5:heHE.EvlogitosEiOTheos.ode	@ltx/en_us_goadedes/miscellanea:misc.Ode7
ltx/en_us_goadedes/he.h.m5:heHE.EvlogitosEiOTheos.text	
ltx/en_us_goadedes/he.h.m5:heHE.GinEfInOukElampsen.greekname	Γῆν ἐφʼ ἣν οὐκ ἔλαμψεν.
ltx/en_us_goadedes/he.h.m5:heHE.GinEfInOukElampsen.incipit	Over land…
ltx/en_us_goadedes/he.h.m5:heHE.GinEfInOukElampsen.melody	@ltx/en_us_goadedes/miscellanea:misc.Heirmos
ltx/en_us_goadedes/he.h.m5:heHE.GinEfInOukElampsen.mode	@ltx/en_us_goadedes/miscellanea:misc.Mode5
ltx/en_us_goadedes/he.h.m5:heHE.GinEfInOukElampsen.name	Over land.
ltx/en_us_goadedes/he.h.m5:heHE.GinEfInOukElampsen.notmetered	N/M (Over land.)
ltx/en_us_goadedes/he.h.m5:heHE.GinEfInOukElampsen.ode	@ltx/en_us_goadedes/miscellanea:misc.Ode1
ltx/en_us_goadedes/he.h.m5:heHE.GinEfInOukElampsen.text	Over land on which the sun had never shone or ever seen * and the abyss which the vault of heaven had not seen exposed before, * Israel perambulated without getting wet; * and You led them and You gave them entry unto Your Holy Mountain, * as they sang and chanted songs of victory, O Lord.
ltx/en_us_goadedes/he.h.m5:heHE.IdeteIdete.greekname	Ἴδετε, ἴδετε.
ltx/en_us_goadedes/he.h.m5:heHE.IdeteIdete.incipit	…
ltx/en_us_goadedes/he.h.m5:heHE.IdeteIdete.melody	@ltx/en_us_goadedes/miscellanea:misc.Heirmos
ltx/en_us_goadedes/he.h.m5:heHE.IdeteIdete.mode	@ltx/en_us_goadedes/miscellanea:misc.Mode5
ltx/en_us_goadedes/he.h.m5:heHE.IdeteIdete.name	
ltx/en_us_goadedes/he.h.m5:heHE.IdeteIdete.notmetered	N/M ()
ltx/en_us_goadedes/he.h.m5:heHE.IdeteIdete.ode	@ltx/en_us_goadedes/miscellanea:misc.Ode2
ltx/en_us_goadedes/he.h.m5:heHE.IdeteIdete.text	
ltx/en_us_goadedes/he.h.m5:heHE.IpponKaiAnavatin.greekname	Ἵππον καὶ ἀναβάτην.
ltx/en_us_goadedes/he.h.m5:heHE.IpponKaiAnavatin.incipit	He who brings wars to nothing…
ltx/en_us_goadedes/he.h.m5:heHE.IpponKaiAnavatin.melody	@ltx/en_us_goadedes/miscellanea:misc.Heirmos
ltx/en_us_goadedes/he.h.m5:heHE.IpponKaiAnavatin.mode	@ltx/en_us_goadedes/miscellanea:misc.Mode5
ltx/en_us_goadedes/he.h.m5:heHE.IpponKaiAnavatin.name	He who brings wars to nothing.
ltx/en_us_goadedes/he.h.m5:heHE.IpponKaiAnavatin.notmetered	N/M (He who brings wars to nothing.)
ltx/en_us_goadedes/he.h.m5:heHE.IpponKaiAnavatin.ode	@ltx/en_us_goadedes/miscellanea:misc.Ode1
ltx/en_us_goadedes/he.h.m5:heHE.IpponKaiAnavatin.text	He who brings wars to nothing with arm exalted is Christ. * Horse and rider of Egypt He shook off; and He threw them in the midst of the Red Sea * and delivered Israel, * who were singing a song of victory.
ltx/en_us_goadedes/he.h.m5:heHE.IsaiaChoreve.greekname	Ἠσαΐα χόρευε.
ltx/en_us_goadedes/he.h.m5:heHE.IsaiaChoreve.incipit	O Isaiah, dance with joy…
ltx/en_us_goadedes/he.h.m5:heHE.IsaiaChoreve.melody	@ltx/en_us_goadedes/miscellanea:misc.Heirmos
ltx/en_us_goadedes/he.h.m5:heHE.IsaiaChoreve.mode	@ltx/en_us_goadedes/miscellanea:misc.Mode5
ltx/en_us_goadedes/he.h.m5:heHE.IsaiaChoreve.name	O Isaiah, dance with joy.
ltx/en_us_goadedes/he.h.m5:heHE.IsaiaChoreve.notmetered	N/M (O Isaiah, dance with joy.)
ltx/en_us_goadedes/he.h.m5:heHE.IsaiaChoreve.ode	@ltx/en_us_goadedes/miscellanea:misc.Ode9
ltx/en_us_goadedes/he.h.m5:heHE.IsaiaChoreve.text	O Isaiah, dance with joy, * for the Virgin conceived in the womb; * and she brought forth a son, who is God and man. * His name is Emmanuel, Dayspring and dawn, Orient, The Branch. * We magnify the Lord, and we also call the Virgin blest.
ltx/en_us_goadedes/he.h.m5:heHE.MainomeninKlydoni.greekname	Μαινομένην κλύδωνι.
ltx/en_us_goadedes/he.h.m5:heHE.MainomeninKlydoni.incipit	I implore You, Master Christ…
ltx/en_us_goadedes/he.h.m5:heHE.MainomeninKlydoni.melody	@ltx/en_us_goadedes/miscellanea:misc.Heirmos
ltx/en_us_goadedes/he.h.m5:heHE.MainomeninKlydoni.mode	@ltx/en_us_goadedes/miscellanea:misc.Mode5
ltx/en_us_goadedes/he.h.m5:heHE.MainomeninKlydoni.name	I implore You, Master Christ.
ltx/en_us_goadedes/he.h.m5:heHE.MainomeninKlydoni.notmetered	N/M (I implore You, Master Christ.)
ltx/en_us_goadedes/he.h.m5:heHE.MainomeninKlydoni.ode	@ltx/en_us_goadedes/miscellanea:misc.Ode6
ltx/en_us_goadedes/he.h.m5:heHE.MainomeninKlydoni.text	I implore You, Master Christ, that You quiet the furious sea * of the passions and the soul-destroying waves; * and from corruption raise me, O compassionate Lord.
ltx/en_us_goadedes/he.h.m5:heHE.MegalynomenChriste.greekname	Μεγαλύνομεν Χριστέ.
ltx/en_us_goadedes/he.h.m5:heHE.MegalynomenChriste.incipit	…
ltx/en_us_goadedes/he.h.m5:heHE.MegalynomenChriste.melody	@ltx/en_us_goadedes/miscellanea:misc.Heirmos
ltx/en_us_goadedes/he.h.m5:heHE.MegalynomenChriste.mode	@ltx/en_us_goadedes/miscellanea:misc.Mode5
ltx/en_us_goadedes/he.h.m5:heHE.MegalynomenChriste.name	
ltx/en_us_goadedes/he.h.m5:heHE.MegalynomenChriste.notmetered	N/M ()
ltx/en_us_goadedes/he.h.m5:heHE.MegalynomenChriste.ode	@ltx/en_us_goadedes/miscellanea:misc.Ode9
ltx/en_us_goadedes/he.h.m5:heHE.MegalynomenChriste.text	
ltx/en_us_goadedes/he.h.m5:heHE.OAnavallomenos.greekname	Ὁ ἀναβαλλόμενος.
ltx/en_us_goadedes/he.h.m5:heHE.OAnavallomenos.incipit	Early do I rise to You…
ltx/en_us_goadedes/he.h.m5:heHE.OAnavallomenos.melody	@ltx/en_us_goadedes/miscellanea:misc.Heirmos
ltx/en_us_goadedes/he.h.m5:heHE.OAnavallomenos.mode	@ltx/en_us_goadedes/miscellanea:misc.Mode5
ltx/en_us_goadedes/he.h.m5:heHE.OAnavallomenos.name	Early do I rise to You.
ltx/en_us_goadedes/he.h.m5:heHE.OAnavallomenos.notmetered	N/M (Early do I rise to You.)
ltx/en_us_goadedes/he.h.m5:heHE.OAnavallomenos.ode	@ltx/en_us_goadedes/miscellanea:misc.Ode5
ltx/en_us_goadedes/he.h.m5:heHE.OAnavallomenos.text	Early do I rise to You, who cover yourself with light * as with a garment. O God, I cry out * to You, to illumine my soul that has been darkened, * O Christ, the only merciful Lord.
ltx/en_us_goadedes/he.h.m5:heHE.OEnKaminoPyros.greekname	Ὁ ἐν καμίνῳ πυρός.
ltx/en_us_goadedes/he.h.m5:heHE.OEnKaminoPyros.incipit	Inside the furnace…
ltx/en_us_goadedes/he.h.m5:heHE.OEnKaminoPyros.melody	@ltx/en_us_goadedes/miscellanea:misc.Heirmos
ltx/en_us_goadedes/he.h.m5:heHE.OEnKaminoPyros.mode	@ltx/en_us_goadedes/miscellanea:misc.Mode5
ltx/en_us_goadedes/he.h.m5:heHE.OEnKaminoPyros.name	Inside the furnace.
ltx/en_us_goadedes/he.h.m5:heHE.OEnKaminoPyros.notmetered	N/M (Inside the furnace.)
ltx/en_us_goadedes/he.h.m5:heHE.OEnKaminoPyros.ode	@ltx/en_us_goadedes/miscellanea:misc.Ode7
ltx/en_us_goadedes/he.h.m5:heHE.OEnKaminoPyros.text	Inside the furnace You saved the three young men who sang Your praises. * You are the God of our fathers, Lord, and blessed are You.
ltx/en_us_goadedes/he.h.m5:heHE.OPixasEpOudenos.greekname	Ὁ πήξας ἐπʼ οὐδενός.
ltx/en_us_goadedes/he.h.m5:heHE.OPixasEpOudenos.incipit	O Lord, You established earth…
ltx/en_us_goadedes/he.h.m5:heHE.OPixasEpOudenos.melody	@ltx/en_us_goadedes/miscellanea:misc.Heirmos
ltx/en_us_goadedes/he.h.m5:heHE.OPixasEpOudenos.mode	@ltx/en_us_goadedes/miscellanea:misc.Mode5
ltx/en_us_goadedes/he.h.m5:heHE.OPixasEpOudenos.name	O Lord, You established earth.
ltx/en_us_goadedes/he.h.m5:heHE.OPixasEpOudenos.notmetered	N/M (O Lord, You established earth.)
ltx/en_us_goadedes/he.h.m5:heHE.OPixasEpOudenos.ode	@ltx/en_us_goadedes/miscellanea:misc.Ode3
ltx/en_us_goadedes/he.h.m5:heHE.OPixasEpOudenos.text	O Lord, You established earth on nothing by Your command, * and You made it free floating, heavy though it be. * Do likewise now establish Your Church on Your divine commandments, * as on a rock that is immovable. * You alone are good and humane, O Christ.
ltx/en_us_goadedes/he.h.m5:heHE.OYperypsoumenos.greekname	Ὁ ὑπερυψούμενος.
ltx/en_us_goadedes/he.h.m5:heHE.OYperypsoumenos.incipit	Praiseworthy and beyond measure…
ltx/en_us_goadedes/he.h.m5:heHE.OYperypsoumenos.melody	@ltx/en_us_goadedes/miscellanea:misc.Heirmos
ltx/en_us_goadedes/he.h.m5:heHE.OYperypsoumenos.mode	@ltx/en_us_goadedes/miscellanea:misc.Mode5
ltx/en_us_goadedes/he.h.m5:heHE.OYperypsoumenos.name	Praiseworthy and beyond measure.
ltx/en_us_goadedes/he.h.m5:heHE.OYperypsoumenos.notmetered	N/M (Praiseworthy and beyond measure.)
ltx/en_us_goadedes/he.h.m5:heHE.OYperypsoumenos.ode	@ltx/en_us_goadedes/miscellanea:misc.Ode7
ltx/en_us_goadedes/he.h.m5:heHE.OYperypsoumenos.text	Praiseworthy and beyond measure exalted Lord and God * extinguished the furnace fire, refreshing the three young men, * who sang to Him together, * “God of our fathers, You are blessed.”
ltx/en_us_goadedes/he.h.m5:heHE.OiOsioiSouPaides.greekname	Οἱ ὅσιοί σου Παῖδες.
ltx/en_us_goadedes/he.h.m5:heHE.OiOsioiSouPaides.incipit	…
ltx/en_us_goadedes/he.h.m5:heHE.OiOsioiSouPaides.melody	@ltx/en_us_goadedes/miscellanea:misc.Heirmos
ltx/en_us_goadedes/he.h.m5:heHE.OiOsioiSouPaides.mode	@ltx/en_us_goadedes/miscellanea:misc.Mode5
ltx/en_us_goadedes/he.h.m5:heHE.OiOsioiSouPaides.name	
ltx/en_us_goadedes/he.h.m5:heHE.OiOsioiSouPaides.notmetered	N/M ()
ltx/en_us_goadedes/he.h.m5:heHE.OiOsioiSouPaides.ode	@ltx/en_us_goadedes/miscellanea:misc.Ode8
ltx/en_us_goadedes/he.h.m5:heHE.OiOsioiSouPaides.text	
ltx/en_us_goadedes/he.h.m5:heHE.OrthrizontesVoomenSoi.greekname	Ὀρθρίζοντες βοῶμέν σοιε.
ltx/en_us_goadedes/he.h.m5:heHE.OrthrizontesVoomenSoi.incipit	Arising very early…
ltx/en_us_goadedes/he.h.m5:heHE.OrthrizontesVoomenSoi.melody	@ltx/en_us_goadedes/miscellanea:misc.Heirmos
ltx/en_us_goadedes/he.h.m5:heHE.OrthrizontesVoomenSoi.mode	@ltx/en_us_goadedes/miscellanea:misc.Mode5
ltx/en_us_goadedes/he.h.m5:heHE.OrthrizontesVoomenSoi.name	Arising very early.
ltx/en_us_goadedes/he.h.m5:heHE.OrthrizontesVoomenSoi.notmetered	N/M (Arising very early.)
ltx/en_us_goadedes/he.h.m5:heHE.OrthrizontesVoomenSoi.ode	@ltx/en_us_goadedes/miscellanea:misc.Ode5
ltx/en_us_goadedes/he.h.m5:heHE.OrthrizontesVoomenSoi.text	Arising very early, we cry aloud to You, O Lord. * Save us, for You are our God. * We know no other, except for You.
ltx/en_us_goadedes/he.h.m5:heHE.OsTonProfitinTouThiros.greekname	Ὡς τὸν Προφήτην τοῦ θηρός.
ltx/en_us_goadedes/he.h.m5:heHE.OsTonProfitinTouThiros.incipit	O Lord, You rescued…
ltx/en_us_goadedes/he.h.m5:heHE.OsTonProfitinTouThiros.melody	@ltx/en_us_goadedes/miscellanea:misc.Heirmos
ltx/en_us_goadedes/he.h.m5:heHE.OsTonProfitinTouThiros.mode	@ltx/en_us_goadedes/miscellanea:misc.Mode5
ltx/en_us_goadedes/he.h.m5:heHE.OsTonProfitinTouThiros.name	O Lord, You rescued.
ltx/en_us_goadedes/he.h.m5:heHE.OsTonProfitinTouThiros.notmetered	N/M (O Lord, You rescued.)
ltx/en_us_goadedes/he.h.m5:heHE.OsTonProfitinTouThiros.ode	@ltx/en_us_goadedes/miscellanea:misc.Ode6
ltx/en_us_goadedes/he.h.m5:heHE.OsTonProfitinTouThiros.text	O Lord, You rescued from the whale the Prophet long ago. * I pray that You also let me rise from the sea of passions oppressing me, * so that with favor I may once again look toward Your holy temple.
ltx/en_us_goadedes/he.h.m5:heHE.OtiEpoiiseSoiMegaleia.greekname	Ὅτι ἐποίησέ σοι μεγαλεῖα.
ltx/en_us_goadedes/he.h.m5:heHE.OtiEpoiiseSoiMegaleia.incipit	…
ltx/en_us_goadedes/he.h.m5:heHE.OtiEpoiiseSoiMegaleia.melody	@ltx/en_us_goadedes/miscellanea:misc.Heirmos
ltx/en_us_goadedes/he.h.m5:heHE.OtiEpoiiseSoiMegaleia.mode	@ltx/en_us_goadedes/miscellanea:misc.Mode5
ltx/en_us_goadedes/he.h.m5:heHE.OtiEpoiiseSoiMegaleia.name	
ltx/en_us_goadedes/he.h.m5:heHE.OtiEpoiiseSoiMegaleia.notmetered	N/M ()
ltx/en_us_goadedes/he.h.m5:heHE.OtiEpoiiseSoiMegaleia.ode	@ltx/en_us_goadedes/miscellanea:misc.Ode9
ltx/en_us_goadedes/he.h.m5:heHE.OtiEpoiiseSoiMegaleia.text	
ltx/en_us_goadedes/he.h.m5:heHE.PyrosSvestirion.greekname	Πυρὸς σβεστήριον.
ltx/en_us_goadedes/he.h.m5:heHE.PyrosSvestirion.incipit	…
ltx/en_us_goadedes/he.h.m5:heHE.PyrosSvestirion.melody	@ltx/en_us_goadedes/miscellanea:misc.Heirmos
ltx/en_us_goadedes/he.h.m5:heHE.PyrosSvestirion.mode	@ltx/en_us_goadedes/miscellanea:misc.Mode5
ltx/en_us_goadedes/he.h.m5:heHE.PyrosSvestirion.name	
ltx/en_us_goadedes/he.h.m5:heHE.PyrosSvestirion.notmetered	N/M ()
ltx/en_us_goadedes/he.h.m5:heHE.PyrosSvestirion.ode	@ltx/en_us_goadedes/miscellanea:misc.Ode7
ltx/en_us_goadedes/he.h.m5:heHE.PyrosSvestirion.text	
ltx/en_us_goadedes/he.h.m5:heHE.SalevomeninTinKardian.greekname	Σαλευομένην τὴν καρδίαν.
ltx/en_us_goadedes/he.h.m5:heHE.SalevomeninTinKardian.incipit	…
ltx/en_us_goadedes/he.h.m5:heHE.SalevomeninTinKardian.melody	@ltx/en_us_goadedes/miscellanea:misc.Heirmos
ltx/en_us_goadedes/he.h.m5:heHE.SalevomeninTinKardian.mode	@ltx/en_us_goadedes/miscellanea:misc.Mode5
ltx/en_us_goadedes/he.h.m5:heHE.SalevomeninTinKardian.name	
ltx/en_us_goadedes/he.h.m5:heHE.SalevomeninTinKardian.notmetered	N/M ()
ltx/en_us_goadedes/he.h.m5:heHE.SalevomeninTinKardian.ode	@ltx/en_us_goadedes/miscellanea:misc.Ode3
ltx/en_us_goadedes/he.h.m5:heHE.SalevomeninTinKardian.text	
ltx/en_us_goadedes/he.h.m5:heHE.SeTinMakarianEnGynaixi.greekname	Σὲ τὴν μακαρίαν ἐν γυναιξί.
ltx/en_us_goadedes/he.h.m5:heHE.SeTinMakarianEnGynaixi.incipit	…
ltx/en_us_goadedes/he.h.m5:heHE.SeTinMakarianEnGynaixi.melody	@ltx/en_us_goadedes/miscellanea:misc.Heirmos
ltx/en_us_goadedes/he.h.m5:heHE.SeTinMakarianEnGynaixi.mode	@ltx/en_us_goadedes/miscellanea:misc.Mode5
ltx/en_us_goadedes/he.h.m5:heHE.SeTinMakarianEnGynaixi.name	
ltx/en_us_goadedes/he.h.m5:heHE.SeTinMakarianEnGynaixi.notmetered	N/M ()
ltx/en_us_goadedes/he.h.m5:heHE.SeTinMakarianEnGynaixi.ode	@ltx/en_us_goadedes/miscellanea:misc.Ode9
ltx/en_us_goadedes/he.h.m5:heHE.SeTinMakarianEnGynaixi.text	
ltx/en_us_goadedes/he.h.m5:heHE.SeTinYperNoun.greekname	Σὲ τὴν ὑπὲρ νοῦν.
ltx/en_us_goadedes/he.h.m5:heHE.SeTinYperNoun.incipit	You, transcending mind…
ltx/en_us_goadedes/he.h.m5:heHE.SeTinYperNoun.melody	@ltx/en_us_goadedes/miscellanea:misc.Heirmos
ltx/en_us_goadedes/he.h.m5:heHE.SeTinYperNoun.mode	@ltx/en_us_goadedes/miscellanea:misc.Mode5
ltx/en_us_goadedes/he.h.m5:heHE.SeTinYperNoun.name	You, transcending mind.
ltx/en_us_goadedes/he.h.m5:heHE.SeTinYperNoun.notmetered	N/M (You, transcending mind.)
ltx/en_us_goadedes/he.h.m5:heHE.SeTinYperNoun.ode	@ltx/en_us_goadedes/miscellanea:misc.Ode9
ltx/en_us_goadedes/he.h.m5:heHE.SeTinYperNoun.text	You, transcending mind and reason are Mother of God; * you gave birth to the timeless One in time inexpressibly. * We the faithful with one accord magnify you.
ltx/en_us_goadedes/he.h.m5:heHE.SoiToPantourgo.greekname	Σοὶ τῷ παντουργῷ.
ltx/en_us_goadedes/he.h.m5:heHE.SoiToPantourgo.incipit	Summoning a worldwide chorus…
ltx/en_us_goadedes/he.h.m5:heHE.SoiToPantourgo.melody	@ltx/en_us_goadedes/miscellanea:misc.Heirmos
ltx/en_us_goadedes/he.h.m5:heHE.SoiToPantourgo.mode	@ltx/en_us_goadedes/miscellanea:misc.Mode5
ltx/en_us_goadedes/he.h.m5:heHE.SoiToPantourgo.name	Summoning a worldwide chorus.
ltx/en_us_goadedes/he.h.m5:heHE.SoiToPantourgo.notmetered	N/M (Summoning a worldwide chorus.)
ltx/en_us_goadedes/he.h.m5:heHE.SoiToPantourgo.ode	@ltx/en_us_goadedes/miscellanea:misc.Ode8
ltx/en_us_goadedes/he.h.m5:heHE.SoiToPantourgo.text	Summoning a worldwide chorus in the furnace, * Your Servants sang to You, O God who created all, * “All you works, to the Lord sing a hymn and praise Him; * exalt Him beyond measure unto all the ages.”
ltx/en_us_goadedes/he.h.m5:heHE.StereosonImasOTheos.greekname	Στερέωσον ἡμᾶς ὁ Θεός.
ltx/en_us_goadedes/he.h.m5:heHE.StereosonImasOTheos.incipit	…
ltx/en_us_goadedes/he.h.m5:heHE.StereosonImasOTheos.melody	@ltx/en_us_goadedes/miscellanea:misc.Heirmos
ltx/en_us_goadedes/he.h.m5:heHE.StereosonImasOTheos.mode	@ltx/en_us_goadedes/miscellanea:misc.Mode5
ltx/en_us_goadedes/he.h.m5:heHE.StereosonImasOTheos.name	
ltx/en_us_goadedes/he.h.m5:heHE.StereosonImasOTheos.notmetered	N/M ()
ltx/en_us_goadedes/he.h.m5:heHE.StereosonImasOTheos.ode	@ltx/en_us_goadedes/miscellanea:misc.Ode3
ltx/en_us_goadedes/he.h.m5:heHE.StereosonImasOTheos.text	
ltx/en_us_goadedes/he.h.m5:heHE.TaErgaTisOikonomias.greekname	Τὰ ἔργα τῆς οἰκονομίας.
ltx/en_us_goadedes/he.h.m5:heHE.TaErgaTisOikonomias.incipit	…
ltx/en_us_goadedes/he.h.m5:heHE.TaErgaTisOikonomias.melody	@ltx/en_us_goadedes/miscellanea:misc.Heirmos
ltx/en_us_goadedes/he.h.m5:heHE.TaErgaTisOikonomias.mode	@ltx/en_us_goadedes/miscellanea:misc.Mode5
ltx/en_us_goadedes/he.h.m5:heHE.TaErgaTisOikonomias.name	
ltx/en_us_goadedes/he.h.m5:heHE.TaErgaTisOikonomias.notmetered	N/M ()
ltx/en_us_goadedes/he.h.m5:heHE.TaErgaTisOikonomias.ode	@ltx/en_us_goadedes/miscellanea:misc.Ode4
ltx/en_us_goadedes/he.h.m5:heHE.TaErgaTisOikonomias.text	
ltx/en_us_goadedes/he.h.m5:heHE.TinTalainanPsychinMou.greekname	Τὴν τάλαιναν ψυχήν μου.
ltx/en_us_goadedes/he.h.m5:heHE.TinTalainanPsychinMou.incipit	…
ltx/en_us_goadedes/he.h.m5:heHE.TinTalainanPsychinMou.melody	@ltx/en_us_goadedes/miscellanea:misc.Heirmos
ltx/en_us_goadedes/he.h.m5:heHE.TinTalainanPsychinMou.mode	@ltx/en_us_goadedes/miscellanea:misc.Mode5
ltx/en_us_goadedes/he.h.m5:heHE.TinTalainanPsychinMou.name	
ltx/en_us_goadedes/he.h.m5:heHE.TinTalainanPsychinMou.notmetered	N/M ()
ltx/en_us_goadedes/he.h.m5:heHE.TinTalainanPsychinMou.ode	@ltx/en_us_goadedes/miscellanea:misc.Ode5
ltx/en_us_goadedes/he.h.m5:heHE.TinTalainanPsychinMou.text	
ltx/en_us_goadedes/he.h.m5:heHE.TinTheianEnnoisas.greekname	Τὴν θείαν ἐννοήσας.
ltx/en_us_goadedes/he.h.m5:heHE.TinTheianEnnoisas.incipit	Habakkuk as a prophet…
ltx/en_us_goadedes/he.h.m5:heHE.TinTheianEnnoisas.melody	@ltx/en_us_goadedes/miscellanea:misc.Heirmos
ltx/en_us_goadedes/he.h.m5:heHE.TinTheianEnnoisas.mode	@ltx/en_us_goadedes/miscellanea:misc.Mode5
ltx/en_us_goadedes/he.h.m5:heHE.TinTheianEnnoisas.name	Habakkuk as a prophet.
ltx/en_us_goadedes/he.h.m5:heHE.TinTheianEnnoisas.notmetered	N/M (Habakkuk as a prophet.)
ltx/en_us_goadedes/he.h.m5:heHE.TinTheianEnnoisas.ode	@ltx/en_us_goadedes/miscellanea:misc.Ode4
ltx/en_us_goadedes/he.h.m5:heHE.TinTheianEnnoisas.text	Habakkuk as a prophet considered Your divine self-emptying, O Christ, and in astonishment said to You, * “For the salvation of Your people You have come, to save Your anointed ones.”
ltx/en_us_goadedes/he.h.m5:heHE.ToFosToAlithinon.greekname	Τὸ φῶς τὸ ἀληθινόν.
ltx/en_us_goadedes/he.h.m5:heHE.ToFosToAlithinon.incipit	…
ltx/en_us_goadedes/he.h.m5:heHE.ToFosToAlithinon.melody	@ltx/en_us_goadedes/miscellanea:misc.Heirmos
ltx/en_us_goadedes/he.h.m5:heHE.ToFosToAlithinon.mode	@ltx/en_us_goadedes/miscellanea:misc.Mode5
ltx/en_us_goadedes/he.h.m5:heHE.ToFosToAlithinon.name	
ltx/en_us_goadedes/he.h.m5:heHE.ToFosToAlithinon.notmetered	N/M ()
ltx/en_us_goadedes/he.h.m5:heHE.ToFosToAlithinon.ode	@ltx/en_us_goadedes/miscellanea:misc.Ode5
ltx/en_us_goadedes/he.h.m5:heHE.ToFosToAlithinon.text	
ltx/en_us_goadedes/he.h.m5:heHE.ToSotiriTheo.greekname	Τῷ Σωτῆρι Θεῷ.
ltx/en_us_goadedes/he.h.m5:heHE.ToSotiriTheo.incipit	To our Savior and God…
ltx/en_us_goadedes/he.h.m5:heHE.ToSotiriTheo.melody	@ltx/en_us_goadedes/miscellanea:misc.Heirmos
ltx/en_us_goadedes/he.h.m5:heHE.ToSotiriTheo.mode	@ltx/en_us_goadedes/miscellanea:misc.Mode5
ltx/en_us_goadedes/he.h.m5:heHE.ToSotiriTheo.name	To our Savior and God.
ltx/en_us_goadedes/he.h.m5:heHE.ToSotiriTheo.notmetered	N/M (To our Savior and God.)
ltx/en_us_goadedes/he.h.m5:heHE.ToSotiriTheo.ode	@ltx/en_us_goadedes/miscellanea:misc.Ode1
ltx/en_us_goadedes/he.h.m5:heHE.ToSotiriTheo.text	To our Savior and God, who led His people of old * across the Red Sea, and they walked on dry ground, * and under water covered Pharaoh and his forces all, * to Him only let us sing, for He is glorified.
ltx/en_us_goadedes/he.h.m5:heHE.TonEkPatrosProAionon.greekname	Τὸν ἐκ Πατρὸς πρὸ αἰώνων.
ltx/en_us_goadedes/he.h.m5:heHE.TonEkPatrosProAionon.incipit	Before the ages…
ltx/en_us_goadedes/he.h.m5:heHE.TonEkPatrosProAionon.melody	@ltx/en_us_goadedes/miscellanea:misc.Heirmos
ltx/en_us_goadedes/he.h.m5:heHE.TonEkPatrosProAionon.mode	@ltx/en_us_goadedes/miscellanea:misc.Mode5
ltx/en_us_goadedes/he.h.m5:heHE.TonEkPatrosProAionon.name	Before the ages.
ltx/en_us_goadedes/he.h.m5:heHE.TonEkPatrosProAionon.notmetered	N/M (Before the ages.)
ltx/en_us_goadedes/he.h.m5:heHE.TonEkPatrosProAionon.ode	@ltx/en_us_goadedes/miscellanea:misc.Ode8
ltx/en_us_goadedes/he.h.m5:heHE.TonEkPatrosProAionon.text	Before the ages begotten from the Father, He is Son and God. * He was incarnate and born of a Virgin Mother in latter times. * Praise Him, priests and people, exalt Him beyond measure, unto all the ages.
ltx/en_us_goadedes/he.h.m5:heHE.TonPoiitinTisKtiseos.greekname	Τὸν Ποιητὴν τῆς κτίσεως.
ltx/en_us_goadedes/he.h.m5:heHE.TonPoiitinTisKtiseos.incipit	…
ltx/en_us_goadedes/he.h.m5:heHE.TonPoiitinTisKtiseos.melody	@ltx/en_us_goadedes/miscellanea:misc.Heirmos
ltx/en_us_goadedes/he.h.m5:heHE.TonPoiitinTisKtiseos.mode	@ltx/en_us_goadedes/miscellanea:misc.Mode5
ltx/en_us_goadedes/he.h.m5:heHE.TonPoiitinTisKtiseos.name	
ltx/en_us_goadedes/he.h.m5:heHE.TonPoiitinTisKtiseos.notmetered	N/M ()
ltx/en_us_goadedes/he.h.m5:heHE.TonPoiitinTisKtiseos.ode	@ltx/en_us_goadedes/miscellanea:misc.Ode8
ltx/en_us_goadedes/he.h.m5:heHE.TonPoiitinTisKtiseos.text	
ltx/en_us_goadedes/he.h.m5:heHE.TouKitousTonProfitin.greekname	Τοῦ κήτους τὸν Προφήτην.
ltx/en_us_goadedes/he.h.m5:heHE.TouKitousTonProfitin.incipit	…
ltx/en_us_goadedes/he.h.m5:heHE.TouKitousTonProfitin.melody	@ltx/en_us_goadedes/miscellanea:misc.Heirmos
ltx/en_us_goadedes/he.h.m5:heHE.TouKitousTonProfitin.mode	@ltx/en_us_goadedes/miscellanea:misc.Mode5
ltx/en_us_goadedes/he.h.m5:heHE.TouKitousTonProfitin.name	
ltx/en_us_goadedes/he.h.m5:heHE.TouKitousTonProfitin.notmetered	N/M ()
ltx/en_us_goadedes/he.h.m5:heHE.TouKitousTonProfitin.ode	@ltx/en_us_goadedes/miscellanea:misc.Ode6
ltx/en_us_goadedes/he.h.m5:heHE.TouKitousTonProfitin.text	
ltx/en_us_goadedes/he.h.m5:heHE.TousEkNyktos.greekname	Τοὺς ἐκ νυκτός.
ltx/en_us_goadedes/he.h.m5:heHE.TousEkNyktos.incipit	…
ltx/en_us_goadedes/he.h.m5:heHE.TousEkNyktos.melody	@ltx/en_us_goadedes/miscellanea:misc.Heirmos
ltx/en_us_goadedes/he.h.m5:heHE.TousEkNyktos.mode	@ltx/en_us_goadedes/miscellanea:misc.Mode5
ltx/en_us_goadedes/he.h.m5:heHE.TousEkNyktos.name	
ltx/en_us_goadedes/he.h.m5:heHE.TousEkNyktos.notmetered	N/M ()
ltx/en_us_goadedes/he.h.m5:heHE.TousEkNyktos.ode	@ltx/en_us_goadedes/miscellanea:misc.Ode5
ltx/en_us_goadedes/he.h.m5:heHE.TousEkNyktos.text	
