ltx/en_us_goadedes/tr.d030:trCO.header	
ltx/en_us_goadedes/tr.d030:trDA.commemoration.full	
ltx/en_us_goadedes/tr.d030:trDA.commemoration.short	
ltx/en_us_goadedes/tr.d030:trDA.insert1	
ltx/en_us_goadedes/tr.d030:trDA.insert2	
ltx/en_us_goadedes/tr.d030:trDA.note	
ltx/en_us_goadedes/tr.d030:trDA.title	
ltx/en_us_goadedes/tr.d030:trHO.commemorations	
ltx/en_us_goadedes/tr.d030:trHO.daytitle	
ltx/en_us_goadedes/tr.d030:trHO.description1	
ltx/en_us_goadedes/tr.d030:trHO.description2	
ltx/en_us_goadedes/tr.d030:trHO.note1	
ltx/en_us_goadedes/tr.d030:trHO.note2	
ltx/en_us_goadedes/tr.d030:trMA.AposIdiomelon1.incipit	…
ltx/en_us_goadedes/tr.d030:trMA.AposIdiomelon1.melody	@ltx/en_us_goadedes/miscellanea:misc.Idiomelon
ltx/en_us_goadedes/tr.d030:trMA.AposIdiomelon1.mode	@ltx/en_us_goadedes/miscellanea:misc.Mode5
ltx/en_us_goadedes/tr.d030:trMA.AposIdiomelon1.text	
ltx/en_us_goadedes/tr.d030:trMA.AposMartyric.incipit	@ltx/en_us_goadedes/oc.m5.d2:ocMA.Aposticha3.incipit
ltx/en_us_goadedes/tr.d030:trMA.AposMartyric.melody	
ltx/en_us_goadedes/tr.d030:trMA.AposMartyric.mode	@ltx/en_us_goadedes/miscellanea:misc.Mode5
ltx/en_us_goadedes/tr.d030:trMA.AposMartyric.text	@ltx/en_us_goadedes/oc.m5.d2:ocMA.Aposticha3.text
ltx/en_us_goadedes/tr.d030:trMA.AposTheotokion.incipit	@ltx/en_us_goadedes/oc.m5.d7:ocVE.AposTheotokion.incipit
ltx/en_us_goadedes/tr.d030:trMA.AposTheotokion.melody	
ltx/en_us_goadedes/tr.d030:trMA.AposTheotokion.mode	@ltx/en_us_goadedes/miscellanea:misc.Mode5
ltx/en_us_goadedes/tr.d030:trMA.AposTheotokion.text	@ltx/en_us_goadedes/oc.m5.d7:ocVE.AposTheotokion.text
ltx/en_us_goadedes/tr.d030:trMA.C1.poet	@ltx/en_us_goadedes/poets:po.Iosif
ltx/en_us_goadedes/tr.d030:trMA.C1.title	@ltx/en_us_goadedes/titles:ti.Canon1Triodion
ltx/en_us_goadedes/tr.d030:trMA.C1.verse	
ltx/en_us_goadedes/tr.d030:trMA.C2.poet	@ltx/en_us_goadedes/poets:po.Theodorou
ltx/en_us_goadedes/tr.d030:trMA.C2.title	@ltx/en_us_goadedes/titles:ti.Canon2Triodion
ltx/en_us_goadedes/tr.d030:trMA.C2.verse	
ltx/en_us_goadedes/tr.d030:trMA.Kathisma21.greekmelody	@ltx/en_us_goadedes/he.a.m4:heAU.KateplagiIosif.greekname
ltx/en_us_goadedes/tr.d030:trMA.Kathisma21.incipit	…
ltx/en_us_goadedes/tr.d030:trMA.Kathisma21.melody	@ltx/en_us_goadedes/he.a.m4:heAU.KateplagiIosif.name
ltx/en_us_goadedes/tr.d030:trMA.Kathisma21.mode	@ltx/en_us_goadedes/miscellanea:misc.Mode4
ltx/en_us_goadedes/tr.d030:trMA.Kathisma21.text	
ltx/en_us_goadedes/tr.d030:trMA.Kathisma22.greekmelody	@ltx/en_us_goadedes/he.a.m4:heAU.KateplagiIosif.greekname
ltx/en_us_goadedes/tr.d030:trMA.Kathisma22.incipit	…
ltx/en_us_goadedes/tr.d030:trMA.Kathisma22.melody	@ltx/en_us_goadedes/he.a.m4:heAU.KateplagiIosif.name
ltx/en_us_goadedes/tr.d030:trMA.Kathisma22.mode	@ltx/en_us_goadedes/miscellanea:misc.Mode4
ltx/en_us_goadedes/tr.d030:trMA.Kathisma22.text	
ltx/en_us_goadedes/tr.d030:trMA.Kathisma31.incipit	…
ltx/en_us_goadedes/tr.d030:trMA.Kathisma31.melody	
ltx/en_us_goadedes/tr.d030:trMA.Kathisma31.mode	@ltx/en_us_goadedes/miscellanea:misc.Mode6
ltx/en_us_goadedes/tr.d030:trMA.Kathisma31.text	
ltx/en_us_goadedes/tr.d030:trMA.Kathisma32.incipit	…
ltx/en_us_goadedes/tr.d030:trMA.Kathisma32.melody	
ltx/en_us_goadedes/tr.d030:trMA.Kathisma32.mode	@ltx/en_us_goadedes/miscellanea:misc.Mode6
ltx/en_us_goadedes/tr.d030:trMA.Kathisma32.text	
ltx/en_us_goadedes/tr.d030:trMA.Ode1C11.greekmelody	@ltx/en_us_goadedes/he.h.m4:heHE.TristatasKrataious.greekname
ltx/en_us_goadedes/tr.d030:trMA.Ode1C11.incipit	…
ltx/en_us_goadedes/tr.d030:trMA.Ode1C11.melody	@ltx/en_us_goadedes/he.h.m4:heHE.TristatasKrataious.name
ltx/en_us_goadedes/tr.d030:trMA.Ode1C11.mode	@ltx/en_us_goadedes/miscellanea:misc.Mode4
ltx/en_us_goadedes/tr.d030:trMA.Ode1C11.ode	@ltx/en_us_goadedes/miscellanea:misc.Ode1
ltx/en_us_goadedes/tr.d030:trMA.Ode1C11.text	
ltx/en_us_goadedes/tr.d030:trMA.Ode1C12.incipit	…
ltx/en_us_goadedes/tr.d030:trMA.Ode1C12.melody	@ltx/en_us_goadedes/he.h.m4:heHE.TristatasKrataious.name
ltx/en_us_goadedes/tr.d030:trMA.Ode1C12.mode	@ltx/en_us_goadedes/miscellanea:misc.Mode4
ltx/en_us_goadedes/tr.d030:trMA.Ode1C12.ode	@ltx/en_us_goadedes/miscellanea:misc.Ode1
ltx/en_us_goadedes/tr.d030:trMA.Ode1C12.text	
ltx/en_us_goadedes/tr.d030:trMA.Ode1C13.incipit	…
ltx/en_us_goadedes/tr.d030:trMA.Ode1C13.melody	@ltx/en_us_goadedes/he.h.m4:heHE.TristatasKrataious.name
ltx/en_us_goadedes/tr.d030:trMA.Ode1C13.mode	@ltx/en_us_goadedes/miscellanea:misc.Mode4
ltx/en_us_goadedes/tr.d030:trMA.Ode1C13.ode	@ltx/en_us_goadedes/miscellanea:misc.Ode1
ltx/en_us_goadedes/tr.d030:trMA.Ode1C13.text	
ltx/en_us_goadedes/tr.d030:trMA.Ode1C1T.incipit	…
ltx/en_us_goadedes/tr.d030:trMA.Ode1C1T.melody	@ltx/en_us_goadedes/he.h.m4:heHE.TristatasKrataious.name
ltx/en_us_goadedes/tr.d030:trMA.Ode1C1T.mode	@ltx/en_us_goadedes/miscellanea:misc.Mode4
ltx/en_us_goadedes/tr.d030:trMA.Ode1C1T.ode	@ltx/en_us_goadedes/miscellanea:misc.Ode1
ltx/en_us_goadedes/tr.d030:trMA.Ode1C1T.text	
ltx/en_us_goadedes/tr.d030:trMA.Ode1C21.greekmelody	@ltx/en_us_goadedes/he.h.m6:heHE.VoithosKaiSkepastis.greekname
ltx/en_us_goadedes/tr.d030:trMA.Ode1C21.incipit	…
ltx/en_us_goadedes/tr.d030:trMA.Ode1C21.melody	@ltx/en_us_goadedes/he.h.m6:heHE.VoithosKaiSkepastis.name
ltx/en_us_goadedes/tr.d030:trMA.Ode1C21.mode	@ltx/en_us_goadedes/miscellanea:misc.Mode6
ltx/en_us_goadedes/tr.d030:trMA.Ode1C21.ode	@ltx/en_us_goadedes/miscellanea:misc.Ode1
ltx/en_us_goadedes/tr.d030:trMA.Ode1C21.text	
ltx/en_us_goadedes/tr.d030:trMA.Ode1C22.incipit	…
ltx/en_us_goadedes/tr.d030:trMA.Ode1C22.melody	@ltx/en_us_goadedes/he.h.m6:heHE.VoithosKaiSkepastis.name
ltx/en_us_goadedes/tr.d030:trMA.Ode1C22.mode	@ltx/en_us_goadedes/miscellanea:misc.Mode6
ltx/en_us_goadedes/tr.d030:trMA.Ode1C22.ode	@ltx/en_us_goadedes/miscellanea:misc.Ode1
ltx/en_us_goadedes/tr.d030:trMA.Ode1C22.text	
ltx/en_us_goadedes/tr.d030:trMA.Ode1C2A1.incipit	…
ltx/en_us_goadedes/tr.d030:trMA.Ode1C2A1.melody	@ltx/en_us_goadedes/he.h.m6:heHE.VoithosKaiSkepastis.name
ltx/en_us_goadedes/tr.d030:trMA.Ode1C2A1.mode	@ltx/en_us_goadedes/miscellanea:misc.Mode6
ltx/en_us_goadedes/tr.d030:trMA.Ode1C2A1.ode	@ltx/en_us_goadedes/miscellanea:misc.Ode1
ltx/en_us_goadedes/tr.d030:trMA.Ode1C2A1.text	
ltx/en_us_goadedes/tr.d030:trMA.Ode1C2H.greekmelody	@ltx/en_us_goadedes/he.h.m6:heHE.VoithosKaiSkepastis.greekname
ltx/en_us_goadedes/tr.d030:trMA.Ode1C2H.incipit	@ltx/en_us_goadedes/he.h.m6:heHE.VoithosKaiSkepastis.incipit
ltx/en_us_goadedes/tr.d030:trMA.Ode1C2H.melody	@ltx/en_us_goadedes/he.h.m6:heHE.VoithosKaiSkepastis.melody
ltx/en_us_goadedes/tr.d030:trMA.Ode1C2H.mode	@ltx/en_us_goadedes/miscellanea:misc.Mode6
ltx/en_us_goadedes/tr.d030:trMA.Ode1C2H.ode	@ltx/en_us_goadedes/miscellanea:misc.Ode1
ltx/en_us_goadedes/tr.d030:trMA.Ode1C2H.text	@ltx/en_us_goadedes/he.h.m6:heHE.VoithosKaiSkepastis.text
ltx/en_us_goadedes/tr.d030:trMA.Ode1C2T.incipit	…
ltx/en_us_goadedes/tr.d030:trMA.Ode1C2T.melody	@ltx/en_us_goadedes/he.h.m6:heHE.VoithosKaiSkepastis.name
ltx/en_us_goadedes/tr.d030:trMA.Ode1C2T.mode	@ltx/en_us_goadedes/miscellanea:misc.Mode6
ltx/en_us_goadedes/tr.d030:trMA.Ode1C2T.ode	@ltx/en_us_goadedes/miscellanea:misc.Ode1
ltx/en_us_goadedes/tr.d030:trMA.Ode1C2T.text	
ltx/en_us_goadedes/tr.d030:trMA.Ode1C2Tr.incipit	…
ltx/en_us_goadedes/tr.d030:trMA.Ode1C2Tr.melody	@ltx/en_us_goadedes/he.h.m6:heHE.VoithosKaiSkepastis.name
ltx/en_us_goadedes/tr.d030:trMA.Ode1C2Tr.mode	@ltx/en_us_goadedes/miscellanea:misc.Mode6
ltx/en_us_goadedes/tr.d030:trMA.Ode1C2Tr.ode	@ltx/en_us_goadedes/miscellanea:misc.Ode1
ltx/en_us_goadedes/tr.d030:trMA.Ode1C2Tr.text	
ltx/en_us_goadedes/tr.d030:trMA.Ode8C11.greekmelody	@ltx/en_us_goadedes/he.h.m4:heHE.LytrotaTouPantos.greekname
ltx/en_us_goadedes/tr.d030:trMA.Ode8C11.incipit	…
ltx/en_us_goadedes/tr.d030:trMA.Ode8C11.melody	@ltx/en_us_goadedes/he.h.m4:heHE.LytrotaTouPantos.name
ltx/en_us_goadedes/tr.d030:trMA.Ode8C11.mode	@ltx/en_us_goadedes/miscellanea:misc.Mode6
ltx/en_us_goadedes/tr.d030:trMA.Ode8C11.ode	@ltx/en_us_goadedes/miscellanea:misc.Ode8
ltx/en_us_goadedes/tr.d030:trMA.Ode8C11.text	
ltx/en_us_goadedes/tr.d030:trMA.Ode8C12.incipit	…
ltx/en_us_goadedes/tr.d030:trMA.Ode8C12.melody	@ltx/en_us_goadedes/he.h.m4:heHE.LytrotaTouPantos.name
ltx/en_us_goadedes/tr.d030:trMA.Ode8C12.mode	@ltx/en_us_goadedes/miscellanea:misc.Mode6
ltx/en_us_goadedes/tr.d030:trMA.Ode8C12.ode	@ltx/en_us_goadedes/miscellanea:misc.Ode8
ltx/en_us_goadedes/tr.d030:trMA.Ode8C12.text	
ltx/en_us_goadedes/tr.d030:trMA.Ode8C13.incipit	…
ltx/en_us_goadedes/tr.d030:trMA.Ode8C13.melody	@ltx/en_us_goadedes/he.h.m4:heHE.LytrotaTouPantos.name
ltx/en_us_goadedes/tr.d030:trMA.Ode8C13.mode	@ltx/en_us_goadedes/miscellanea:misc.Mode6
ltx/en_us_goadedes/tr.d030:trMA.Ode8C13.ode	@ltx/en_us_goadedes/miscellanea:misc.Ode8
ltx/en_us_goadedes/tr.d030:trMA.Ode8C13.text	
ltx/en_us_goadedes/tr.d030:trMA.Ode8C1T.incipit	…
ltx/en_us_goadedes/tr.d030:trMA.Ode8C1T.melody	@ltx/en_us_goadedes/he.h.m4:heHE.LytrotaTouPantos.name
ltx/en_us_goadedes/tr.d030:trMA.Ode8C1T.mode	@ltx/en_us_goadedes/miscellanea:misc.Mode6
ltx/en_us_goadedes/tr.d030:trMA.Ode8C1T.ode	@ltx/en_us_goadedes/miscellanea:misc.Ode8
ltx/en_us_goadedes/tr.d030:trMA.Ode8C1T.text	
ltx/en_us_goadedes/tr.d030:trMA.Ode8C21.greekmelody	@ltx/en_us_goadedes/he.h.m6:heHE.OnStratiaiOuranon.greekname
ltx/en_us_goadedes/tr.d030:trMA.Ode8C21.incipit	…
ltx/en_us_goadedes/tr.d030:trMA.Ode8C21.melody	@ltx/en_us_goadedes/he.h.m6:heHE.OnStratiaiOuranon.name
ltx/en_us_goadedes/tr.d030:trMA.Ode8C21.mode	@ltx/en_us_goadedes/miscellanea:misc.Mode6
ltx/en_us_goadedes/tr.d030:trMA.Ode8C21.ode	@ltx/en_us_goadedes/miscellanea:misc.Ode8
ltx/en_us_goadedes/tr.d030:trMA.Ode8C21.text	
ltx/en_us_goadedes/tr.d030:trMA.Ode8C22.incipit	…
ltx/en_us_goadedes/tr.d030:trMA.Ode8C22.melody	@ltx/en_us_goadedes/he.h.m6:heHE.OnStratiaiOuranon.name
ltx/en_us_goadedes/tr.d030:trMA.Ode8C22.mode	@ltx/en_us_goadedes/miscellanea:misc.Mode6
ltx/en_us_goadedes/tr.d030:trMA.Ode8C22.ode	@ltx/en_us_goadedes/miscellanea:misc.Ode8
ltx/en_us_goadedes/tr.d030:trMA.Ode8C22.text	
ltx/en_us_goadedes/tr.d030:trMA.Ode8C2A1.incipit	…
ltx/en_us_goadedes/tr.d030:trMA.Ode8C2A1.melody	@ltx/en_us_goadedes/he.h.m6:heHE.OnStratiaiOuranon.name
ltx/en_us_goadedes/tr.d030:trMA.Ode8C2A1.mode	@ltx/en_us_goadedes/miscellanea:misc.Mode6
ltx/en_us_goadedes/tr.d030:trMA.Ode8C2A1.ode	@ltx/en_us_goadedes/miscellanea:misc.Ode8
ltx/en_us_goadedes/tr.d030:trMA.Ode8C2A1.text	
ltx/en_us_goadedes/tr.d030:trMA.Ode8C2H.greekmelody	@ltx/en_us_goadedes/he.h.m6:heHE.OnStratiaiOuranon.greekname
ltx/en_us_goadedes/tr.d030:trMA.Ode8C2H.incipit	@ltx/en_us_goadedes/he.h.m6:heHE.OnStratiaiOuranon.incipit
ltx/en_us_goadedes/tr.d030:trMA.Ode8C2H.melody	@ltx/en_us_goadedes/he.h.m6:heHE.OnStratiaiOuranon.melody
ltx/en_us_goadedes/tr.d030:trMA.Ode8C2H.mode	@ltx/en_us_goadedes/miscellanea:misc.Mode6
ltx/en_us_goadedes/tr.d030:trMA.Ode8C2H.ode	@ltx/en_us_goadedes/miscellanea:misc.Ode8
ltx/en_us_goadedes/tr.d030:trMA.Ode8C2H.text	@ltx/en_us_goadedes/he.h.m6:heHE.OnStratiaiOuranon.text
ltx/en_us_goadedes/tr.d030:trMA.Ode8C2T.incipit	…
ltx/en_us_goadedes/tr.d030:trMA.Ode8C2T.melody	@ltx/en_us_goadedes/he.h.m6:heHE.OnStratiaiOuranon.name
ltx/en_us_goadedes/tr.d030:trMA.Ode8C2T.mode	@ltx/en_us_goadedes/miscellanea:misc.Mode6
ltx/en_us_goadedes/tr.d030:trMA.Ode8C2T.ode	@ltx/en_us_goadedes/miscellanea:misc.Ode8
ltx/en_us_goadedes/tr.d030:trMA.Ode8C2T.text	
ltx/en_us_goadedes/tr.d030:trMA.Ode8C2Tr.incipit	…
ltx/en_us_goadedes/tr.d030:trMA.Ode8C2Tr.melody	@ltx/en_us_goadedes/he.h.m6:heHE.OnStratiaiOuranon.name
ltx/en_us_goadedes/tr.d030:trMA.Ode8C2Tr.mode	@ltx/en_us_goadedes/miscellanea:misc.Mode6
ltx/en_us_goadedes/tr.d030:trMA.Ode8C2Tr.ode	@ltx/en_us_goadedes/miscellanea:misc.Ode8
ltx/en_us_goadedes/tr.d030:trMA.Ode8C2Tr.text	
ltx/en_us_goadedes/tr.d030:trMA.Ode9C11.greekmelody	@ltx/en_us_goadedes/he.h.m4:heHE.EvaMenToTisParakois.greekname
ltx/en_us_goadedes/tr.d030:trMA.Ode9C11.incipit	…
ltx/en_us_goadedes/tr.d030:trMA.Ode9C11.melody	@ltx/en_us_goadedes/he.h.m4:heHE.EvaMenToTisParakois.name
ltx/en_us_goadedes/tr.d030:trMA.Ode9C11.mode	@ltx/en_us_goadedes/miscellanea:misc.Mode4
ltx/en_us_goadedes/tr.d030:trMA.Ode9C11.ode	@ltx/en_us_goadedes/miscellanea:misc.Ode9
ltx/en_us_goadedes/tr.d030:trMA.Ode9C11.text	
ltx/en_us_goadedes/tr.d030:trMA.Ode9C12.incipit	…
ltx/en_us_goadedes/tr.d030:trMA.Ode9C12.melody	@ltx/en_us_goadedes/he.h.m4:heHE.EvaMenToTisParakois.name
ltx/en_us_goadedes/tr.d030:trMA.Ode9C12.mode	@ltx/en_us_goadedes/miscellanea:misc.Mode4
ltx/en_us_goadedes/tr.d030:trMA.Ode9C12.ode	@ltx/en_us_goadedes/miscellanea:misc.Ode9
ltx/en_us_goadedes/tr.d030:trMA.Ode9C12.text	
ltx/en_us_goadedes/tr.d030:trMA.Ode9C13.incipit	…
ltx/en_us_goadedes/tr.d030:trMA.Ode9C13.melody	@ltx/en_us_goadedes/he.h.m4:heHE.EvaMenToTisParakois.name
ltx/en_us_goadedes/tr.d030:trMA.Ode9C13.mode	@ltx/en_us_goadedes/miscellanea:misc.Mode4
ltx/en_us_goadedes/tr.d030:trMA.Ode9C13.ode	@ltx/en_us_goadedes/miscellanea:misc.Ode9
ltx/en_us_goadedes/tr.d030:trMA.Ode9C13.text	
ltx/en_us_goadedes/tr.d030:trMA.Ode9C1T.incipit	…
ltx/en_us_goadedes/tr.d030:trMA.Ode9C1T.melody	@ltx/en_us_goadedes/he.h.m4:heHE.EvaMenToTisParakois.name
ltx/en_us_goadedes/tr.d030:trMA.Ode9C1T.mode	@ltx/en_us_goadedes/miscellanea:misc.Mode4
ltx/en_us_goadedes/tr.d030:trMA.Ode9C1T.ode	@ltx/en_us_goadedes/miscellanea:misc.Ode9
ltx/en_us_goadedes/tr.d030:trMA.Ode9C1T.text	
ltx/en_us_goadedes/tr.d030:trMA.Ode9C21.greekmelody	@ltx/en_us_goadedes/he.h.m6:heHE.AsporouSyllipseos.greekname
ltx/en_us_goadedes/tr.d030:trMA.Ode9C21.incipit	…
ltx/en_us_goadedes/tr.d030:trMA.Ode9C21.melody	@ltx/en_us_goadedes/he.h.m6:heHE.AsporouSyllipseos.name
ltx/en_us_goadedes/tr.d030:trMA.Ode9C21.mode	@ltx/en_us_goadedes/miscellanea:misc.Mode6
ltx/en_us_goadedes/tr.d030:trMA.Ode9C21.ode	@ltx/en_us_goadedes/miscellanea:misc.Ode9
ltx/en_us_goadedes/tr.d030:trMA.Ode9C21.text	
ltx/en_us_goadedes/tr.d030:trMA.Ode9C22.incipit	…
ltx/en_us_goadedes/tr.d030:trMA.Ode9C22.melody	@ltx/en_us_goadedes/he.h.m6:heHE.AsporouSyllipseos.name
ltx/en_us_goadedes/tr.d030:trMA.Ode9C22.mode	@ltx/en_us_goadedes/miscellanea:misc.Mode6
ltx/en_us_goadedes/tr.d030:trMA.Ode9C22.ode	@ltx/en_us_goadedes/miscellanea:misc.Ode9
ltx/en_us_goadedes/tr.d030:trMA.Ode9C22.text	
ltx/en_us_goadedes/tr.d030:trMA.Ode9C2A1.incipit	…
ltx/en_us_goadedes/tr.d030:trMA.Ode9C2A1.melody	@ltx/en_us_goadedes/he.h.m6:heHE.AsporouSyllipseos.name
ltx/en_us_goadedes/tr.d030:trMA.Ode9C2A1.mode	@ltx/en_us_goadedes/miscellanea:misc.Mode6
ltx/en_us_goadedes/tr.d030:trMA.Ode9C2A1.ode	@ltx/en_us_goadedes/miscellanea:misc.Ode9
ltx/en_us_goadedes/tr.d030:trMA.Ode9C2A1.text	
ltx/en_us_goadedes/tr.d030:trMA.Ode9C2H.greekmelody	@ltx/en_us_goadedes/he.h.m6:heHE.AsporouSyllipseos.greekname
ltx/en_us_goadedes/tr.d030:trMA.Ode9C2H.incipit	@ltx/en_us_goadedes/he.h.m6:heHE.AsporouSyllipseos.incipit
ltx/en_us_goadedes/tr.d030:trMA.Ode9C2H.melody	@ltx/en_us_goadedes/he.h.m6:heHE.AsporouSyllipseos.melody
ltx/en_us_goadedes/tr.d030:trMA.Ode9C2H.mode	@ltx/en_us_goadedes/miscellanea:misc.Mode6
ltx/en_us_goadedes/tr.d030:trMA.Ode9C2H.ode	@ltx/en_us_goadedes/miscellanea:misc.Ode9
ltx/en_us_goadedes/tr.d030:trMA.Ode9C2H.text	@ltx/en_us_goadedes/he.h.m6:heHE.AsporouSyllipseos.text
ltx/en_us_goadedes/tr.d030:trMA.Ode9C2T.incipit	…
ltx/en_us_goadedes/tr.d030:trMA.Ode9C2T.melody	@ltx/en_us_goadedes/he.h.m6:heHE.AsporouSyllipseos.name
ltx/en_us_goadedes/tr.d030:trMA.Ode9C2T.mode	@ltx/en_us_goadedes/miscellanea:misc.Mode6
ltx/en_us_goadedes/tr.d030:trMA.Ode9C2T.ode	@ltx/en_us_goadedes/miscellanea:misc.Ode9
ltx/en_us_goadedes/tr.d030:trMA.Ode9C2T.text	
ltx/en_us_goadedes/tr.d030:trMA.Ode9C2Tr.incipit	…
ltx/en_us_goadedes/tr.d030:trMA.Ode9C2Tr.melody	@ltx/en_us_goadedes/he.h.m6:heHE.AsporouSyllipseos.name
ltx/en_us_goadedes/tr.d030:trMA.Ode9C2Tr.mode	@ltx/en_us_goadedes/miscellanea:misc.Mode6
ltx/en_us_goadedes/tr.d030:trMA.Ode9C2Tr.ode	@ltx/en_us_goadedes/miscellanea:misc.Ode9
ltx/en_us_goadedes/tr.d030:trMA.Ode9C2Tr.text	
ltx/en_us_goadedes/tr.d030:trTE.Troparion.incipit	…
ltx/en_us_goadedes/tr.d030:trTE.Troparion.melody	
ltx/en_us_goadedes/tr.d030:trTE.Troparion.mode	@ltx/en_us_goadedes/miscellanea:misc.Mode5
ltx/en_us_goadedes/tr.d030:trTE.Troparion.text	
ltx/en_us_goadedes/tr.d030:trTE.Troparion2.text	
ltx/en_us_goadedes/tr.d030:trVE.AposIdiomelon1.incipit	…
ltx/en_us_goadedes/tr.d030:trVE.AposIdiomelon1.melody	@ltx/en_us_goadedes/miscellanea:misc.Idiomelon
ltx/en_us_goadedes/tr.d030:trVE.AposIdiomelon1.mode	@ltx/en_us_goadedes/miscellanea:misc.Mode8
ltx/en_us_goadedes/tr.d030:trVE.AposIdiomelon1.text	
ltx/en_us_goadedes/tr.d030:trVE.AposMartyric.incipit	@ltx/en_us_goadedes/oc.m8.d2:ocVE.Aposticha3.incipit
ltx/en_us_goadedes/tr.d030:trVE.AposMartyric.melody	
ltx/en_us_goadedes/tr.d030:trVE.AposMartyric.mode	@ltx/en_us_goadedes/miscellanea:misc.Mode8
ltx/en_us_goadedes/tr.d030:trVE.AposMartyric.text	@ltx/en_us_goadedes/oc.m8.d2:ocVE.Aposticha3.text
ltx/en_us_goadedes/tr.d030:trVE.AposTheotokion.incipit	…
ltx/en_us_goadedes/tr.d030:trVE.AposTheotokion.melody	
ltx/en_us_goadedes/tr.d030:trVE.AposTheotokion.mode	@ltx/en_us_goadedes/miscellanea:misc.Mode8
ltx/en_us_goadedes/tr.d030:trVE.AposTheotokion.text	
ltx/en_us_goadedes/tr.d030:trVE.Stichera01.greekmelody	@ltx/en_us_goadedes/he.a.m4:heAU.EdokasSimeiosin.greekname
ltx/en_us_goadedes/tr.d030:trVE.Stichera01.incipit	…
ltx/en_us_goadedes/tr.d030:trVE.Stichera01.melody	@ltx/en_us_goadedes/he.a.m4:heAU.EdokasSimeiosin.name
ltx/en_us_goadedes/tr.d030:trVE.Stichera01.mode	@ltx/en_us_goadedes/miscellanea:misc.Mode4
ltx/en_us_goadedes/tr.d030:trVE.Stichera01.poet	@ltx/en_us_goadedes/poets:po.Iosif
ltx/en_us_goadedes/tr.d030:trVE.Stichera01.text	
ltx/en_us_goadedes/tr.d030:trVE.Stichera02.greekmelody	@ltx/en_us_goadedes/he.a.m4:heAU.EdokasSimeiosin.greekname
ltx/en_us_goadedes/tr.d030:trVE.Stichera02.incipit	…
ltx/en_us_goadedes/tr.d030:trVE.Stichera02.melody	@ltx/en_us_goadedes/he.a.m4:heAU.EdokasSimeiosin.name
ltx/en_us_goadedes/tr.d030:trVE.Stichera02.mode	@ltx/en_us_goadedes/miscellanea:misc.Mode4
ltx/en_us_goadedes/tr.d030:trVE.Stichera02.text	
ltx/en_us_goadedes/tr.d030:trVE.Stichera03.incipit	…
ltx/en_us_goadedes/tr.d030:trVE.Stichera03.melody	
ltx/en_us_goadedes/tr.d030:trVE.Stichera03.mode	@ltx/en_us_goadedes/miscellanea:misc.Mode6
ltx/en_us_goadedes/tr.d030:trVE.Stichera03.poet	@ltx/en_us_goadedes/poets:po.KyriouTheodorou
ltx/en_us_goadedes/tr.d030:trVE.Stichera03.text	
