ltx/en_us_goadedes/me.m05.d05:meDA.commemoration.first	
ltx/en_us_goadedes/me.m05.d05:meDA.commemoration.first_name	
ltx/en_us_goadedes/me.m05.d05:meDA.commemoration.first_short	
ltx/en_us_goadedes/me.m05.d05:meDA.commemoration.first_title	@ltx/en_us_goadedes/titles:ti.SaintW
ltx/en_us_goadedes/me.m05.d05:meDA.commemoration.full	
ltx/en_us_goadedes/me.m05.d05:meDA.commemoration.second_name	
ltx/en_us_goadedes/me.m05.d05:meDA.commemoration.second_title	
ltx/en_us_goadedes/me.m05.d05:meDA.date	
ltx/en_us_goadedes/me.m05.d05:meDA.fordate	
ltx/en_us_goadedes/me.m05.d05:meDA.insert1	
ltx/en_us_goadedes/me.m05.d05:meDA.insert2	
ltx/en_us_goadedes/me.m05.d05:meDA.note	
ltx/en_us_goadedes/me.m05.d05:meDA.pdfcoverdate	
ltx/en_us_goadedes/me.m05.d05:meDA.pdfheaderdate	
ltx/en_us_goadedes/me.m05.d05:meHO.commemorations	
ltx/en_us_goadedes/me.m05.d05:meHO.note1	
ltx/en_us_goadedes/me.m05.d05:meHO.note2	
ltx/en_us_goadedes/me.m05.d05:meHO.number	
ltx/en_us_goadedes/me.m05.d05:meHO.rank	
ltx/en_us_goadedes/me.m05.d05:meLE.commemoration1	
ltx/en_us_goadedes/me.m05.d05:meLE.commemoration2	
ltx/en_us_goadedes/me.m05.d05:meLI.Kontakion1.greekmelody	@ltx/en_us_goadedes/me.m05.d05:meMA.Kontakion1.greekmelody
ltx/en_us_goadedes/me.m05.d05:meLI.Kontakion1.incipit	@ltx/en_us_goadedes/me.m05.d05:meMA.Kontakion1.incipit
ltx/en_us_goadedes/me.m05.d05:meLI.Kontakion1.melody	@ltx/en_us_goadedes/me.m05.d05:meMA.Kontakion1.melody
ltx/en_us_goadedes/me.m05.d05:meLI.Kontakion1.mode	@ltx/en_us_goadedes/me.m05.d05:meMA.Kontakion1.mode
ltx/en_us_goadedes/me.m05.d05:meLI.Kontakion1.text	@ltx/en_us_goadedes/me.m05.d05:meMA.Kontakion1.text
ltx/en_us_goadedes/me.m05.d05:meLI.MM.CommunionHymn.text	@ltx/en_us_goadedes/properties:media.key
ltx/en_us_goadedes/me.m05.d05:meLI.Megalynarion.text	
ltx/en_us_goadedes/me.m05.d05:meMA.C1.acrostic.notice1	
ltx/en_us_goadedes/me.m05.d05:meMA.C1.acrostic.text	
ltx/en_us_goadedes/me.m05.d05:meMA.C1.acrostic.title	
ltx/en_us_goadedes/me.m05.d05:meMA.C1.title	@ltx/en_us_goadedes/titles:ti.CanonSaintW
ltx/en_us_goadedes/me.m05.d05:meMA.C1.verse	@ltx/en_us_goadedes/prayers:pr.verse_SaintW.text
ltx/en_us_goadedes/me.m05.d05:meMA.Exaposteilarion1.greekmelody	@ltx/en_us_goadedes/he.a.m2:heAU.GynaikesAkoutisthite.greekname
ltx/en_us_goadedes/me.m05.d05:meMA.Exaposteilarion1.incipit	…
ltx/en_us_goadedes/me.m05.d05:meMA.Exaposteilarion1.melody	@ltx/en_us_goadedes/he.a.m2:heAU.GynaikesAkoutisthite.name
ltx/en_us_goadedes/me.m05.d05:meMA.Exaposteilarion1.mode	@ltx/en_us_goadedes/miscellanea:misc.Mode2
ltx/en_us_goadedes/me.m05.d05:meMA.Exaposteilarion1.text	
ltx/en_us_goadedes/me.m05.d05:meMA.Kontakion1.greekmelody	@ltx/en_us_goadedes/he.a.m3:heAU.IParthenosSimeron.greekname
ltx/en_us_goadedes/me.m05.d05:meMA.Kontakion1.incipit	…
ltx/en_us_goadedes/me.m05.d05:meMA.Kontakion1.melody	@ltx/en_us_goadedes/he.a.m3:heAU.IParthenosSimeron.name
ltx/en_us_goadedes/me.m05.d05:meMA.Kontakion1.mode	@ltx/en_us_goadedes/miscellanea:misc.Mode3
ltx/en_us_goadedes/me.m05.d05:meMA.Kontakion1.text	
ltx/en_us_goadedes/me.m05.d05:meMA.Ode1C11.greekmelody	@ltx/en_us_goadedes/he.h.m4:heHE.AsomaiSoiKyrie.greekname
ltx/en_us_goadedes/me.m05.d05:meMA.Ode1C11.incipit	…
ltx/en_us_goadedes/me.m05.d05:meMA.Ode1C11.melody	@ltx/en_us_goadedes/he.h.m4:heHE.AsomaiSoiKyrie.name
ltx/en_us_goadedes/me.m05.d05:meMA.Ode1C11.mode	@ltx/en_us_goadedes/miscellanea:misc.Mode4
ltx/en_us_goadedes/me.m05.d05:meMA.Ode1C11.ode	@ltx/en_us_goadedes/miscellanea:misc.Ode1
ltx/en_us_goadedes/me.m05.d05:meMA.Ode1C11.text	
ltx/en_us_goadedes/me.m05.d05:meMA.Ode1C12.incipit	…
ltx/en_us_goadedes/me.m05.d05:meMA.Ode1C12.melody	@ltx/en_us_goadedes/he.h.m4:heHE.AsomaiSoiKyrie.name
ltx/en_us_goadedes/me.m05.d05:meMA.Ode1C12.mode	@ltx/en_us_goadedes/miscellanea:misc.Mode4
ltx/en_us_goadedes/me.m05.d05:meMA.Ode1C12.ode	@ltx/en_us_goadedes/miscellanea:misc.Ode1
ltx/en_us_goadedes/me.m05.d05:meMA.Ode1C12.text	
ltx/en_us_goadedes/me.m05.d05:meMA.Ode1C13.incipit	…
ltx/en_us_goadedes/me.m05.d05:meMA.Ode1C13.melody	@ltx/en_us_goadedes/he.h.m4:heHE.AsomaiSoiKyrie.name
ltx/en_us_goadedes/me.m05.d05:meMA.Ode1C13.mode	@ltx/en_us_goadedes/miscellanea:misc.Mode4
ltx/en_us_goadedes/me.m05.d05:meMA.Ode1C13.ode	@ltx/en_us_goadedes/miscellanea:misc.Ode1
ltx/en_us_goadedes/me.m05.d05:meMA.Ode1C13.text	
ltx/en_us_goadedes/me.m05.d05:meMA.Ode1C1T.incipit	…
ltx/en_us_goadedes/me.m05.d05:meMA.Ode1C1T.melody	@ltx/en_us_goadedes/he.h.m4:heHE.AsomaiSoiKyrie.name
ltx/en_us_goadedes/me.m05.d05:meMA.Ode1C1T.mode	@ltx/en_us_goadedes/miscellanea:misc.Mode4
ltx/en_us_goadedes/me.m05.d05:meMA.Ode1C1T.ode	@ltx/en_us_goadedes/miscellanea:misc.Ode1
ltx/en_us_goadedes/me.m05.d05:meMA.Ode1C1T.text	
ltx/en_us_goadedes/me.m05.d05:meMA.Ode3C11.greekmelody	@ltx/en_us_goadedes/he.h.m4:heHE.ToxonDynatonIsthenise.greekname
ltx/en_us_goadedes/me.m05.d05:meMA.Ode3C11.incipit	…
ltx/en_us_goadedes/me.m05.d05:meMA.Ode3C11.melody	@ltx/en_us_goadedes/he.h.m4:heHE.ToxonDynatonIsthenise.name
ltx/en_us_goadedes/me.m05.d05:meMA.Ode3C11.mode	@ltx/en_us_goadedes/miscellanea:misc.Mode4
ltx/en_us_goadedes/me.m05.d05:meMA.Ode3C11.ode	@ltx/en_us_goadedes/miscellanea:misc.Ode3
ltx/en_us_goadedes/me.m05.d05:meMA.Ode3C11.text	
ltx/en_us_goadedes/me.m05.d05:meMA.Ode3C12.incipit	…
ltx/en_us_goadedes/me.m05.d05:meMA.Ode3C12.melody	@ltx/en_us_goadedes/he.h.m4:heHE.ToxonDynatonIsthenise.name
ltx/en_us_goadedes/me.m05.d05:meMA.Ode3C12.mode	@ltx/en_us_goadedes/miscellanea:misc.Mode4
ltx/en_us_goadedes/me.m05.d05:meMA.Ode3C12.ode	@ltx/en_us_goadedes/miscellanea:misc.Ode3
ltx/en_us_goadedes/me.m05.d05:meMA.Ode3C12.text	
ltx/en_us_goadedes/me.m05.d05:meMA.Ode3C13.incipit	…
ltx/en_us_goadedes/me.m05.d05:meMA.Ode3C13.melody	@ltx/en_us_goadedes/he.h.m4:heHE.ToxonDynatonIsthenise.name
ltx/en_us_goadedes/me.m05.d05:meMA.Ode3C13.mode	@ltx/en_us_goadedes/miscellanea:misc.Mode4
ltx/en_us_goadedes/me.m05.d05:meMA.Ode3C13.ode	@ltx/en_us_goadedes/miscellanea:misc.Ode3
ltx/en_us_goadedes/me.m05.d05:meMA.Ode3C13.text	
ltx/en_us_goadedes/me.m05.d05:meMA.Ode3C1T.incipit	…
ltx/en_us_goadedes/me.m05.d05:meMA.Ode3C1T.melody	@ltx/en_us_goadedes/he.h.m4:heHE.ToxonDynatonIsthenise.name
ltx/en_us_goadedes/me.m05.d05:meMA.Ode3C1T.mode	@ltx/en_us_goadedes/miscellanea:misc.Mode4
ltx/en_us_goadedes/me.m05.d05:meMA.Ode3C1T.ode	@ltx/en_us_goadedes/miscellanea:misc.Ode3
ltx/en_us_goadedes/me.m05.d05:meMA.Ode3C1T.text	
ltx/en_us_goadedes/me.m05.d05:meMA.Ode3H.greekmelody	@ltx/en_us_goadedes/he.h.m4:heHE.ToxonDynatonIsthenise.greekname
ltx/en_us_goadedes/me.m05.d05:meMA.Ode3H.incipit	@ltx/en_us_goadedes/he.h.m4:heHE.ToxonDynatonIsthenise.incipit
ltx/en_us_goadedes/me.m05.d05:meMA.Ode3H.melody	@ltx/en_us_goadedes/he.h.m4:heHE.ToxonDynatonIsthenise.melody
ltx/en_us_goadedes/me.m05.d05:meMA.Ode3H.mode	@ltx/en_us_goadedes/miscellanea:misc.Mode4
ltx/en_us_goadedes/me.m05.d05:meMA.Ode3H.ode	@ltx/en_us_goadedes/miscellanea:misc.Ode3
ltx/en_us_goadedes/me.m05.d05:meMA.Ode3H.text	@ltx/en_us_goadedes/he.h.m4:heHE.ToxonDynatonIsthenise.text
ltx/en_us_goadedes/me.m05.d05:meMA.Ode3Kathisma1.greekmelody	@ltx/en_us_goadedes/he.a.m1:heAU.TonTafonSouSotir.greekname
ltx/en_us_goadedes/me.m05.d05:meMA.Ode3Kathisma1.incipit	…
ltx/en_us_goadedes/me.m05.d05:meMA.Ode3Kathisma1.melody	@ltx/en_us_goadedes/he.a.m1:heAU.TonTafonSouSotir.name
ltx/en_us_goadedes/me.m05.d05:meMA.Ode3Kathisma1.mode	@ltx/en_us_goadedes/miscellanea:misc.Mode1
ltx/en_us_goadedes/me.m05.d05:meMA.Ode3Kathisma1.text	
ltx/en_us_goadedes/me.m05.d05:meMA.Ode4C11.greekmelody	@ltx/en_us_goadedes/he.h.m4:heHE.TisSisEpiGis.greekname
ltx/en_us_goadedes/me.m05.d05:meMA.Ode4C11.incipit	…
ltx/en_us_goadedes/me.m05.d05:meMA.Ode4C11.melody	@ltx/en_us_goadedes/he.h.m4:heHE.TisSisEpiGis.name
ltx/en_us_goadedes/me.m05.d05:meMA.Ode4C11.mode	@ltx/en_us_goadedes/miscellanea:misc.Mode4
ltx/en_us_goadedes/me.m05.d05:meMA.Ode4C11.ode	@ltx/en_us_goadedes/miscellanea:misc.Ode4
ltx/en_us_goadedes/me.m05.d05:meMA.Ode4C11.text	
ltx/en_us_goadedes/me.m05.d05:meMA.Ode4C12.incipit	…
ltx/en_us_goadedes/me.m05.d05:meMA.Ode4C12.melody	@ltx/en_us_goadedes/he.h.m4:heHE.TisSisEpiGis.name
ltx/en_us_goadedes/me.m05.d05:meMA.Ode4C12.mode	@ltx/en_us_goadedes/miscellanea:misc.Mode4
ltx/en_us_goadedes/me.m05.d05:meMA.Ode4C12.ode	@ltx/en_us_goadedes/miscellanea:misc.Ode4
ltx/en_us_goadedes/me.m05.d05:meMA.Ode4C12.text	
ltx/en_us_goadedes/me.m05.d05:meMA.Ode4C13.incipit	…
ltx/en_us_goadedes/me.m05.d05:meMA.Ode4C13.melody	@ltx/en_us_goadedes/he.h.m4:heHE.TisSisEpiGis.name
ltx/en_us_goadedes/me.m05.d05:meMA.Ode4C13.mode	@ltx/en_us_goadedes/miscellanea:misc.Mode4
ltx/en_us_goadedes/me.m05.d05:meMA.Ode4C13.ode	@ltx/en_us_goadedes/miscellanea:misc.Ode4
ltx/en_us_goadedes/me.m05.d05:meMA.Ode4C13.text	
ltx/en_us_goadedes/me.m05.d05:meMA.Ode4C14.incipit	…
ltx/en_us_goadedes/me.m05.d05:meMA.Ode4C14.melody	@ltx/en_us_goadedes/he.h.m4:heHE.TisSisEpiGis.name
ltx/en_us_goadedes/me.m05.d05:meMA.Ode4C14.mode	@ltx/en_us_goadedes/miscellanea:misc.Mode4
ltx/en_us_goadedes/me.m05.d05:meMA.Ode4C14.ode	@ltx/en_us_goadedes/miscellanea:misc.Ode4
ltx/en_us_goadedes/me.m05.d05:meMA.Ode4C14.text	
ltx/en_us_goadedes/me.m05.d05:meMA.Ode4C1T.incipit	…
ltx/en_us_goadedes/me.m05.d05:meMA.Ode4C1T.melody	@ltx/en_us_goadedes/he.h.m4:heHE.TisSisEpiGis.name
ltx/en_us_goadedes/me.m05.d05:meMA.Ode4C1T.mode	@ltx/en_us_goadedes/miscellanea:misc.Mode4
ltx/en_us_goadedes/me.m05.d05:meMA.Ode4C1T.ode	@ltx/en_us_goadedes/miscellanea:misc.Ode4
ltx/en_us_goadedes/me.m05.d05:meMA.Ode4C1T.text	
ltx/en_us_goadedes/me.m05.d05:meMA.Ode5C11.greekmelody	@ltx/en_us_goadedes/he.h.m4:heHE.TonFotismonSouKyrie.greekname
ltx/en_us_goadedes/me.m05.d05:meMA.Ode5C11.incipit	…
ltx/en_us_goadedes/me.m05.d05:meMA.Ode5C11.melody	@ltx/en_us_goadedes/he.h.m4:heHE.TonFotismonSouKyrie.name
ltx/en_us_goadedes/me.m05.d05:meMA.Ode5C11.mode	@ltx/en_us_goadedes/miscellanea:misc.Mode4
ltx/en_us_goadedes/me.m05.d05:meMA.Ode5C11.ode	@ltx/en_us_goadedes/miscellanea:misc.Ode5
ltx/en_us_goadedes/me.m05.d05:meMA.Ode5C11.text	
ltx/en_us_goadedes/me.m05.d05:meMA.Ode5C12.incipit	…
ltx/en_us_goadedes/me.m05.d05:meMA.Ode5C12.melody	@ltx/en_us_goadedes/he.h.m4:heHE.TonFotismonSouKyrie.name
ltx/en_us_goadedes/me.m05.d05:meMA.Ode5C12.mode	@ltx/en_us_goadedes/miscellanea:misc.Mode4
ltx/en_us_goadedes/me.m05.d05:meMA.Ode5C12.ode	@ltx/en_us_goadedes/miscellanea:misc.Ode5
ltx/en_us_goadedes/me.m05.d05:meMA.Ode5C12.text	
ltx/en_us_goadedes/me.m05.d05:meMA.Ode5C13.incipit	…
ltx/en_us_goadedes/me.m05.d05:meMA.Ode5C13.melody	@ltx/en_us_goadedes/he.h.m4:heHE.TonFotismonSouKyrie.name
ltx/en_us_goadedes/me.m05.d05:meMA.Ode5C13.mode	@ltx/en_us_goadedes/miscellanea:misc.Mode4
ltx/en_us_goadedes/me.m05.d05:meMA.Ode5C13.ode	@ltx/en_us_goadedes/miscellanea:misc.Ode5
ltx/en_us_goadedes/me.m05.d05:meMA.Ode5C13.text	
ltx/en_us_goadedes/me.m05.d05:meMA.Ode5C1T.incipit	…
ltx/en_us_goadedes/me.m05.d05:meMA.Ode5C1T.melody	@ltx/en_us_goadedes/he.h.m4:heHE.TonFotismonSouKyrie.name
ltx/en_us_goadedes/me.m05.d05:meMA.Ode5C1T.mode	@ltx/en_us_goadedes/miscellanea:misc.Mode4
ltx/en_us_goadedes/me.m05.d05:meMA.Ode5C1T.ode	@ltx/en_us_goadedes/miscellanea:misc.Ode5
ltx/en_us_goadedes/me.m05.d05:meMA.Ode5C1T.text	
ltx/en_us_goadedes/me.m05.d05:meMA.Ode6C11.greekmelody	@ltx/en_us_goadedes/he.h.m4:heHE.EvoiseProtypon.greekname
ltx/en_us_goadedes/me.m05.d05:meMA.Ode6C11.incipit	…
ltx/en_us_goadedes/me.m05.d05:meMA.Ode6C11.melody	@ltx/en_us_goadedes/he.h.m4:heHE.EvoiseProtypon.name
ltx/en_us_goadedes/me.m05.d05:meMA.Ode6C11.mode	@ltx/en_us_goadedes/miscellanea:misc.Mode4
ltx/en_us_goadedes/me.m05.d05:meMA.Ode6C11.ode	@ltx/en_us_goadedes/miscellanea:misc.Ode6
ltx/en_us_goadedes/me.m05.d05:meMA.Ode6C11.text	
ltx/en_us_goadedes/me.m05.d05:meMA.Ode6C12.incipit	…
ltx/en_us_goadedes/me.m05.d05:meMA.Ode6C12.melody	@ltx/en_us_goadedes/he.h.m4:heHE.EvoiseProtypon.name
ltx/en_us_goadedes/me.m05.d05:meMA.Ode6C12.mode	@ltx/en_us_goadedes/miscellanea:misc.Mode4
ltx/en_us_goadedes/me.m05.d05:meMA.Ode6C12.ode	@ltx/en_us_goadedes/miscellanea:misc.Ode6
ltx/en_us_goadedes/me.m05.d05:meMA.Ode6C12.text	
ltx/en_us_goadedes/me.m05.d05:meMA.Ode6C13.incipit	…
ltx/en_us_goadedes/me.m05.d05:meMA.Ode6C13.melody	@ltx/en_us_goadedes/he.h.m4:heHE.EvoiseProtypon.name
ltx/en_us_goadedes/me.m05.d05:meMA.Ode6C13.mode	@ltx/en_us_goadedes/miscellanea:misc.Mode4
ltx/en_us_goadedes/me.m05.d05:meMA.Ode6C13.ode	@ltx/en_us_goadedes/miscellanea:misc.Ode6
ltx/en_us_goadedes/me.m05.d05:meMA.Ode6C13.text	
ltx/en_us_goadedes/me.m05.d05:meMA.Ode6C1T.incipit	…
ltx/en_us_goadedes/me.m05.d05:meMA.Ode6C1T.melody	@ltx/en_us_goadedes/he.h.m4:heHE.EvoiseProtypon.name
ltx/en_us_goadedes/me.m05.d05:meMA.Ode6C1T.mode	@ltx/en_us_goadedes/miscellanea:misc.Mode4
ltx/en_us_goadedes/me.m05.d05:meMA.Ode6C1T.ode	@ltx/en_us_goadedes/miscellanea:misc.Ode6
ltx/en_us_goadedes/me.m05.d05:meMA.Ode6C1T.text	
ltx/en_us_goadedes/me.m05.d05:meMA.Ode6H.greekmelody	@ltx/en_us_goadedes/he.h.m4:heHE.EvoiseProtypon.greekname
ltx/en_us_goadedes/me.m05.d05:meMA.Ode6H.incipit	@ltx/en_us_goadedes/he.h.m4:heHE.EvoiseProtypon.incipit
ltx/en_us_goadedes/me.m05.d05:meMA.Ode6H.melody	@ltx/en_us_goadedes/he.h.m4:heHE.EvoiseProtypon.melody
ltx/en_us_goadedes/me.m05.d05:meMA.Ode6H.mode	@ltx/en_us_goadedes/miscellanea:misc.Mode4
ltx/en_us_goadedes/me.m05.d05:meMA.Ode6H.ode	@ltx/en_us_goadedes/miscellanea:misc.Ode6
ltx/en_us_goadedes/me.m05.d05:meMA.Ode6H.text	@ltx/en_us_goadedes/he.h.m4:heHE.EvoiseProtypon.text
ltx/en_us_goadedes/me.m05.d05:meMA.Ode7C11.greekmelody	@ltx/en_us_goadedes/he.h.m4:heHE.AvramiaioiPote.greekname
ltx/en_us_goadedes/me.m05.d05:meMA.Ode7C11.incipit	…
ltx/en_us_goadedes/me.m05.d05:meMA.Ode7C11.melody	@ltx/en_us_goadedes/he.h.m4:heHE.AvramiaioiPote.name
ltx/en_us_goadedes/me.m05.d05:meMA.Ode7C11.mode	@ltx/en_us_goadedes/miscellanea:misc.Mode4
ltx/en_us_goadedes/me.m05.d05:meMA.Ode7C11.ode	@ltx/en_us_goadedes/miscellanea:misc.Ode7
ltx/en_us_goadedes/me.m05.d05:meMA.Ode7C11.text	
ltx/en_us_goadedes/me.m05.d05:meMA.Ode7C12.incipit	…
ltx/en_us_goadedes/me.m05.d05:meMA.Ode7C12.melody	@ltx/en_us_goadedes/he.h.m4:heHE.AvramiaioiPote.name
ltx/en_us_goadedes/me.m05.d05:meMA.Ode7C12.mode	@ltx/en_us_goadedes/miscellanea:misc.Mode4
ltx/en_us_goadedes/me.m05.d05:meMA.Ode7C12.ode	@ltx/en_us_goadedes/miscellanea:misc.Ode7
ltx/en_us_goadedes/me.m05.d05:meMA.Ode7C12.text	
ltx/en_us_goadedes/me.m05.d05:meMA.Ode7C13.incipit	…
ltx/en_us_goadedes/me.m05.d05:meMA.Ode7C13.melody	@ltx/en_us_goadedes/he.h.m4:heHE.AvramiaioiPote.name
ltx/en_us_goadedes/me.m05.d05:meMA.Ode7C13.mode	@ltx/en_us_goadedes/miscellanea:misc.Mode4
ltx/en_us_goadedes/me.m05.d05:meMA.Ode7C13.ode	@ltx/en_us_goadedes/miscellanea:misc.Ode7
ltx/en_us_goadedes/me.m05.d05:meMA.Ode7C13.text	
ltx/en_us_goadedes/me.m05.d05:meMA.Ode7C1T.incipit	…
ltx/en_us_goadedes/me.m05.d05:meMA.Ode7C1T.melody	@ltx/en_us_goadedes/he.h.m4:heHE.AvramiaioiPote.name
ltx/en_us_goadedes/me.m05.d05:meMA.Ode7C1T.mode	@ltx/en_us_goadedes/miscellanea:misc.Mode4
ltx/en_us_goadedes/me.m05.d05:meMA.Ode7C1T.ode	@ltx/en_us_goadedes/miscellanea:misc.Ode7
ltx/en_us_goadedes/me.m05.d05:meMA.Ode7C1T.text	
ltx/en_us_goadedes/me.m05.d05:meMA.Ode8C11.greekmelody	@ltx/en_us_goadedes/he.h.m4:heHE.PaidasEvageis.greekname
ltx/en_us_goadedes/me.m05.d05:meMA.Ode8C11.incipit	…
ltx/en_us_goadedes/me.m05.d05:meMA.Ode8C11.melody	@ltx/en_us_goadedes/he.h.m4:heHE.PaidasEvageis.name
ltx/en_us_goadedes/me.m05.d05:meMA.Ode8C11.mode	@ltx/en_us_goadedes/miscellanea:misc.Mode4
ltx/en_us_goadedes/me.m05.d05:meMA.Ode8C11.ode	@ltx/en_us_goadedes/miscellanea:misc.Ode8
ltx/en_us_goadedes/me.m05.d05:meMA.Ode8C11.text	
ltx/en_us_goadedes/me.m05.d05:meMA.Ode8C12.incipit	…
ltx/en_us_goadedes/me.m05.d05:meMA.Ode8C12.melody	@ltx/en_us_goadedes/he.h.m4:heHE.PaidasEvageis.name
ltx/en_us_goadedes/me.m05.d05:meMA.Ode8C12.mode	@ltx/en_us_goadedes/miscellanea:misc.Mode4
ltx/en_us_goadedes/me.m05.d05:meMA.Ode8C12.ode	@ltx/en_us_goadedes/miscellanea:misc.Ode8
ltx/en_us_goadedes/me.m05.d05:meMA.Ode8C12.text	
ltx/en_us_goadedes/me.m05.d05:meMA.Ode8C13.incipit	…
ltx/en_us_goadedes/me.m05.d05:meMA.Ode8C13.melody	@ltx/en_us_goadedes/he.h.m4:heHE.PaidasEvageis.name
ltx/en_us_goadedes/me.m05.d05:meMA.Ode8C13.mode	@ltx/en_us_goadedes/miscellanea:misc.Mode4
ltx/en_us_goadedes/me.m05.d05:meMA.Ode8C13.ode	@ltx/en_us_goadedes/miscellanea:misc.Ode8
ltx/en_us_goadedes/me.m05.d05:meMA.Ode8C13.text	
ltx/en_us_goadedes/me.m05.d05:meMA.Ode8C1T.incipit	…
ltx/en_us_goadedes/me.m05.d05:meMA.Ode8C1T.melody	@ltx/en_us_goadedes/he.h.m4:heHE.PaidasEvageis.name
ltx/en_us_goadedes/me.m05.d05:meMA.Ode8C1T.mode	@ltx/en_us_goadedes/miscellanea:misc.Mode4
ltx/en_us_goadedes/me.m05.d05:meMA.Ode8C1T.ode	@ltx/en_us_goadedes/miscellanea:misc.Ode8
ltx/en_us_goadedes/me.m05.d05:meMA.Ode8C1T.text	
ltx/en_us_goadedes/me.m05.d05:meMA.Ode8H.greekmelody	@ltx/en_us_goadedes/he.h.m4:heHE.PaidasEvageis.greekname
ltx/en_us_goadedes/me.m05.d05:meMA.Ode8H.incipit	@ltx/en_us_goadedes/he.h.m4:heHE.PaidasEvageis.incipit
ltx/en_us_goadedes/me.m05.d05:meMA.Ode8H.melody	@ltx/en_us_goadedes/he.h.m4:heHE.PaidasEvageis.melody
ltx/en_us_goadedes/me.m05.d05:meMA.Ode8H.mode	@ltx/en_us_goadedes/miscellanea:misc.Mode4
ltx/en_us_goadedes/me.m05.d05:meMA.Ode8H.ode	@ltx/en_us_goadedes/miscellanea:misc.Ode8
ltx/en_us_goadedes/me.m05.d05:meMA.Ode8H.text	@ltx/en_us_goadedes/he.h.m4:heHE.PaidasEvageis.text
ltx/en_us_goadedes/me.m05.d05:meMA.Ode9C11.greekmelody	@ltx/en_us_goadedes/he.h.m4:heHE.EvaMenToTisParakois.greekname
ltx/en_us_goadedes/me.m05.d05:meMA.Ode9C11.incipit	…
ltx/en_us_goadedes/me.m05.d05:meMA.Ode9C11.melody	@ltx/en_us_goadedes/he.h.m4:heHE.EvaMenToTisParakois.name
ltx/en_us_goadedes/me.m05.d05:meMA.Ode9C11.mode	@ltx/en_us_goadedes/miscellanea:misc.Mode4
ltx/en_us_goadedes/me.m05.d05:meMA.Ode9C11.ode	@ltx/en_us_goadedes/miscellanea:misc.Ode9
ltx/en_us_goadedes/me.m05.d05:meMA.Ode9C11.text	
ltx/en_us_goadedes/me.m05.d05:meMA.Ode9C12.incipit	…
ltx/en_us_goadedes/me.m05.d05:meMA.Ode9C12.melody	@ltx/en_us_goadedes/he.h.m4:heHE.EvaMenToTisParakois.name
ltx/en_us_goadedes/me.m05.d05:meMA.Ode9C12.mode	@ltx/en_us_goadedes/miscellanea:misc.Mode4
ltx/en_us_goadedes/me.m05.d05:meMA.Ode9C12.ode	@ltx/en_us_goadedes/miscellanea:misc.Ode9
ltx/en_us_goadedes/me.m05.d05:meMA.Ode9C12.text	
ltx/en_us_goadedes/me.m05.d05:meMA.Ode9C13.incipit	…
ltx/en_us_goadedes/me.m05.d05:meMA.Ode9C13.melody	@ltx/en_us_goadedes/he.h.m4:heHE.EvaMenToTisParakois.name
ltx/en_us_goadedes/me.m05.d05:meMA.Ode9C13.mode	@ltx/en_us_goadedes/miscellanea:misc.Mode4
ltx/en_us_goadedes/me.m05.d05:meMA.Ode9C13.ode	@ltx/en_us_goadedes/miscellanea:misc.Ode9
ltx/en_us_goadedes/me.m05.d05:meMA.Ode9C13.text	
ltx/en_us_goadedes/me.m05.d05:meMA.Ode9C1T.incipit	…
ltx/en_us_goadedes/me.m05.d05:meMA.Ode9C1T.melody	@ltx/en_us_goadedes/he.h.m4:heHE.EvaMenToTisParakois.name
ltx/en_us_goadedes/me.m05.d05:meMA.Ode9C1T.mode	@ltx/en_us_goadedes/miscellanea:misc.Mode4
ltx/en_us_goadedes/me.m05.d05:meMA.Ode9C1T.ode	@ltx/en_us_goadedes/miscellanea:misc.Ode9
ltx/en_us_goadedes/me.m05.d05:meMA.Ode9C1T.text	
ltx/en_us_goadedes/me.m05.d05:meMA.Ode9H.greekmelody	@ltx/en_us_goadedes/he.h.m4:heHE.EvaMenToTisParakois.greekname
ltx/en_us_goadedes/me.m05.d05:meMA.Ode9H.incipit	@ltx/en_us_goadedes/he.h.m4:heHE.EvaMenToTisParakois.incipit
ltx/en_us_goadedes/me.m05.d05:meMA.Ode9H.melody	@ltx/en_us_goadedes/he.h.m4:heHE.EvaMenToTisParakois.melody
ltx/en_us_goadedes/me.m05.d05:meMA.Ode9H.mode	@ltx/en_us_goadedes/miscellanea:misc.Mode4
ltx/en_us_goadedes/me.m05.d05:meMA.Ode9H.ode	@ltx/en_us_goadedes/miscellanea:misc.Ode9
ltx/en_us_goadedes/me.m05.d05:meMA.Ode9H.text	@ltx/en_us_goadedes/he.h.m4:heHE.EvaMenToTisParakois.text
ltx/en_us_goadedes/me.m05.d05:meMA.Oikos1.text	
ltx/en_us_goadedes/me.m05.d05:meVE.Apolytikion1ger.greekmelody	@ltx/en_us_goadedes/he.a.m4:heAU.TachyProkatalave.greekname
ltx/en_us_goadedes/me.m05.d05:meVE.Apolytikion1ger.incipit	…
ltx/en_us_goadedes/me.m05.d05:meVE.Apolytikion1ger.melody	@ltx/en_us_goadedes/he.a.m4:heAU.TachyProkatalave.name
ltx/en_us_goadedes/me.m05.d05:meVE.Apolytikion1ger.mode	@ltx/en_us_goadedes/miscellanea:misc.Mode4
ltx/en_us_goadedes/me.m05.d05:meVE.Apolytikion1ger.poet	@ltx/en_us_goadedes/poets:po.Gerasimou
ltx/en_us_goadedes/me.m05.d05:meVE.Apolytikion1ger.text	
ltx/en_us_goadedes/me.m05.d05:meVE.Apolytikion2ger.greekmelody	@ltx/en_us_goadedes/he.a.m4:heAU.TachyProkatalave.greekname
ltx/en_us_goadedes/me.m05.d05:meVE.Apolytikion2ger.incipit	…
ltx/en_us_goadedes/me.m05.d05:meVE.Apolytikion2ger.melody	@ltx/en_us_goadedes/he.a.m4:heAU.TachyProkatalave.name
ltx/en_us_goadedes/me.m05.d05:meVE.Apolytikion2ger.mode	@ltx/en_us_goadedes/miscellanea:misc.Mode4
ltx/en_us_goadedes/me.m05.d05:meVE.Apolytikion2ger.poet	@ltx/en_us_goadedes/poets:po.Gerasimou
ltx/en_us_goadedes/me.m05.d05:meVE.Apolytikion2ger.text	
ltx/en_us_goadedes/me.m05.d05:meVE.Stichera01.greekmelody	@ltx/en_us_goadedes/he.a.m1:heAU.PaneffimoiMartyres.greekname
ltx/en_us_goadedes/me.m05.d05:meVE.Stichera01.incipit	…
ltx/en_us_goadedes/me.m05.d05:meVE.Stichera01.melody	@ltx/en_us_goadedes/he.a.m1:heAU.PaneffimoiMartyres.name
ltx/en_us_goadedes/me.m05.d05:meVE.Stichera01.mode	@ltx/en_us_goadedes/miscellanea:misc.Mode1
ltx/en_us_goadedes/me.m05.d05:meVE.Stichera01.text	
ltx/en_us_goadedes/me.m05.d05:meVE.Stichera02.incipit	…
ltx/en_us_goadedes/me.m05.d05:meVE.Stichera02.melody	@ltx/en_us_goadedes/he.a.m1:heAU.PaneffimoiMartyres.name
ltx/en_us_goadedes/me.m05.d05:meVE.Stichera02.mode	@ltx/en_us_goadedes/miscellanea:misc.Mode1
ltx/en_us_goadedes/me.m05.d05:meVE.Stichera02.text	
ltx/en_us_goadedes/me.m05.d05:meVE.Stichera03.incipit	…
ltx/en_us_goadedes/me.m05.d05:meVE.Stichera03.melody	@ltx/en_us_goadedes/he.a.m1:heAU.PaneffimoiMartyres.name
ltx/en_us_goadedes/me.m05.d05:meVE.Stichera03.mode	@ltx/en_us_goadedes/miscellanea:misc.Mode1
ltx/en_us_goadedes/me.m05.d05:meVE.Stichera03.text	
