ltx/en_us_goadedes/oc.m2.d1:ocBK.ModeNaked	@ltx/en_us_goadedes/miscellanea:misc.Mode2.naked
ltx/en_us_goadedes/oc.m2.d1:ocBK.mode.title	
ltx/en_us_goadedes/oc.m2.d1:ocGE.MM.BothHeirmologic.text	@ltx/en_us_goadedes/properties:media.key
ltx/en_us_goadedes/oc.m2.d1:ocGE.MM.BothSticheraric.text	@ltx/en_us_goadedes/properties:media.key
ltx/en_us_goadedes/oc.m2.d1:ocGE.MM.GloryHeirmologic.text	@ltx/en_us_goadedes/properties:media.key
ltx/en_us_goadedes/oc.m2.d1:ocGE.MM.GlorySticheraric.text	@ltx/en_us_goadedes/properties:media.key
ltx/en_us_goadedes/oc.m2.d1:ocLI.Beatitudes1.incipit	…
ltx/en_us_goadedes/oc.m2.d1:ocLI.Beatitudes1.melody	@ltx/en_us_goadedes/he.h.m2:heHE.SyToLogoSouKyrie.name
ltx/en_us_goadedes/oc.m2.d1:ocLI.Beatitudes1.mode	@ltx/en_us_goadedes/miscellanea:misc.Mode2
ltx/en_us_goadedes/oc.m2.d1:ocLI.Beatitudes1.text	
ltx/en_us_goadedes/oc.m2.d1:ocLI.Beatitudes2.incipit	…
ltx/en_us_goadedes/oc.m2.d1:ocLI.Beatitudes2.melody	@ltx/en_us_goadedes/he.h.m2:heHE.SyToLogoSouKyrie.name
ltx/en_us_goadedes/oc.m2.d1:ocLI.Beatitudes2.mode	@ltx/en_us_goadedes/miscellanea:misc.Mode2
ltx/en_us_goadedes/oc.m2.d1:ocLI.Beatitudes2.text	
ltx/en_us_goadedes/oc.m2.d1:ocLI.Beatitudes3.incipit	…
ltx/en_us_goadedes/oc.m2.d1:ocLI.Beatitudes3.melody	@ltx/en_us_goadedes/he.h.m2:heHE.SyToLogoSouKyrie.name
ltx/en_us_goadedes/oc.m2.d1:ocLI.Beatitudes3.mode	@ltx/en_us_goadedes/miscellanea:misc.Mode2
ltx/en_us_goadedes/oc.m2.d1:ocLI.Beatitudes3.text	
ltx/en_us_goadedes/oc.m2.d1:ocLI.Beatitudes4.incipit	…
ltx/en_us_goadedes/oc.m2.d1:ocLI.Beatitudes4.melody	@ltx/en_us_goadedes/he.h.m2:heHE.SyToLogoSouKyrie.name
ltx/en_us_goadedes/oc.m2.d1:ocLI.Beatitudes4.mode	@ltx/en_us_goadedes/miscellanea:misc.Mode2
ltx/en_us_goadedes/oc.m2.d1:ocLI.Beatitudes4.text	
ltx/en_us_goadedes/oc.m2.d1:ocLI.Beatitudes5.incipit	…
ltx/en_us_goadedes/oc.m2.d1:ocLI.Beatitudes5.melody	@ltx/en_us_goadedes/he.h.m2:heHE.SyToLogoSouKyrie.name
ltx/en_us_goadedes/oc.m2.d1:ocLI.Beatitudes5.mode	@ltx/en_us_goadedes/miscellanea:misc.Mode2
ltx/en_us_goadedes/oc.m2.d1:ocLI.Beatitudes5.text	
ltx/en_us_goadedes/oc.m2.d1:ocLI.Beatitudes6.incipit	…
ltx/en_us_goadedes/oc.m2.d1:ocLI.Beatitudes6.melody	@ltx/en_us_goadedes/he.h.m2:heHE.SyToLogoSouKyrie.name
ltx/en_us_goadedes/oc.m2.d1:ocLI.Beatitudes6.mode	@ltx/en_us_goadedes/miscellanea:misc.Mode2
ltx/en_us_goadedes/oc.m2.d1:ocLI.Beatitudes6.text	
ltx/en_us_goadedes/oc.m2.d1:ocLI.BeatitudesT.incipit	…
ltx/en_us_goadedes/oc.m2.d1:ocLI.BeatitudesT.melody	@ltx/en_us_goadedes/he.h.m2:heHE.SyToLogoSouKyrie.name
ltx/en_us_goadedes/oc.m2.d1:ocLI.BeatitudesT.mode	@ltx/en_us_goadedes/miscellanea:misc.Mode2
ltx/en_us_goadedes/oc.m2.d1:ocLI.BeatitudesT.text	
ltx/en_us_goadedes/oc.m2.d1:ocLI.BeatitudesTr.incipit	…
ltx/en_us_goadedes/oc.m2.d1:ocLI.BeatitudesTr.melody	@ltx/en_us_goadedes/he.h.m2:heHE.SyToLogoSouKyrie.name
ltx/en_us_goadedes/oc.m2.d1:ocLI.BeatitudesTr.mode	@ltx/en_us_goadedes/miscellanea:misc.Mode2
ltx/en_us_goadedes/oc.m2.d1:ocLI.BeatitudesTr.text	
ltx/en_us_goadedes/oc.m2.d1:ocLI.MM.Beatitudes123456TrTas5678910GB.text	@ltx/en_us_goadedes/properties:media.key
ltx/en_us_goadedes/oc.m2.d1:ocLI.MM.Beatitudes123Tas1234.text	@ltx/en_us_goadedes/properties:media.key
ltx/en_us_goadedes/oc.m2.d1:ocLI.MM.Beatitudes123Tas5678.text	@ltx/en_us_goadedes/properties:media.key
ltx/en_us_goadedes/oc.m2.d1:ocLI.MM.Prokeimenon.text	@ltx/en_us_goadedes/properties:media.key
ltx/en_us_goadedes/oc.m2.d1:ocMA.Antiphon11.incipit	I direct the eyes…
ltx/en_us_goadedes/oc.m2.d1:ocMA.Antiphon11.melody	
ltx/en_us_goadedes/oc.m2.d1:ocMA.Antiphon11.mode	@ltx/en_us_goadedes/miscellanea:misc.Mode2
ltx/en_us_goadedes/oc.m2.d1:ocMA.Antiphon11.text	I direct the eyes of my heart to You in heaven, O Savior. Save me, I pray, shining on me Your resplendence.
ltx/en_us_goadedes/oc.m2.d1:ocMA.Antiphon12.incipit	Have mercy on us…
ltx/en_us_goadedes/oc.m2.d1:ocMA.Antiphon12.melody	
ltx/en_us_goadedes/oc.m2.d1:ocMA.Antiphon12.mode	@ltx/en_us_goadedes/miscellanea:misc.Mode2
ltx/en_us_goadedes/oc.m2.d1:ocMA.Antiphon12.text	Have mercy on us who hourly offend You in many things, O my Christ; and before the end, give us ways to return to You in repentance.
ltx/en_us_goadedes/oc.m2.d1:ocMA.Antiphon13.incipit	To the Holy Spirit it is proper…
ltx/en_us_goadedes/oc.m2.d1:ocMA.Antiphon13.melody	
ltx/en_us_goadedes/oc.m2.d1:ocMA.Antiphon13.mode	@ltx/en_us_goadedes/miscellanea:misc.Mode2
ltx/en_us_goadedes/oc.m2.d1:ocMA.Antiphon13.text	To the Holy Spirit it is proper to rule, to sanctify, and to move all creation; for He is God, one in essence with the Father and the Logos.
ltx/en_us_goadedes/oc.m2.d1:ocMA.Antiphon21.incipit	If the Lord had not been…
ltx/en_us_goadedes/oc.m2.d1:ocMA.Antiphon21.melody	
ltx/en_us_goadedes/oc.m2.d1:ocMA.Antiphon21.mode	@ltx/en_us_goadedes/miscellanea:misc.Mode2
ltx/en_us_goadedes/oc.m2.d1:ocMA.Antiphon21.text	If the Lord had not been with us, who would be sufficient to preserve himself uninjured from the enemy and murderer of mankind?
ltx/en_us_goadedes/oc.m2.d1:ocMA.Antiphon22.incipit	Do not deliver me…
ltx/en_us_goadedes/oc.m2.d1:ocMA.Antiphon22.melody	
ltx/en_us_goadedes/oc.m2.d1:ocMA.Antiphon22.mode	@ltx/en_us_goadedes/miscellanea:misc.Mode2
ltx/en_us_goadedes/oc.m2.d1:ocMA.Antiphon22.text	Do not deliver me to the teeth of my enemies, O Savior, for in the manner of a lion they move against me Your servant.
ltx/en_us_goadedes/oc.m2.d1:ocMA.Antiphon23.incipit	In the Holy Spirit is the principle…
ltx/en_us_goadedes/oc.m2.d1:ocMA.Antiphon23.melody	
ltx/en_us_goadedes/oc.m2.d1:ocMA.Antiphon23.mode	@ltx/en_us_goadedes/miscellanea:misc.Mode2
ltx/en_us_goadedes/oc.m2.d1:ocMA.Antiphon23.text	In the Holy Spirit is the principle of life, and to Him belongs the honor. He is God, and in the Father through the Son He strengthens and sustains every creature.
ltx/en_us_goadedes/oc.m2.d1:ocMA.Antiphon31.incipit	Those who trust in the Lord…
ltx/en_us_goadedes/oc.m2.d1:ocMA.Antiphon31.melody	
ltx/en_us_goadedes/oc.m2.d1:ocMA.Antiphon31.mode	@ltx/en_us_goadedes/miscellanea:misc.Mode2
ltx/en_us_goadedes/oc.m2.d1:ocMA.Antiphon31.text	Those who trust in the Lord are like the holy mountain. They are in no way shaken by the devil’s assaults.
ltx/en_us_goadedes/oc.m2.d1:ocMA.Antiphon32.incipit	Let those who live for God…
ltx/en_us_goadedes/oc.m2.d1:ocMA.Antiphon32.melody	
ltx/en_us_goadedes/oc.m2.d1:ocMA.Antiphon32.mode	@ltx/en_us_goadedes/miscellanea:misc.Mode2
ltx/en_us_goadedes/oc.m2.d1:ocMA.Antiphon32.text	Let those who live for God never stretch out their hands in lawlessness. For Christ will not permit the rod to be upon His inheritance.
ltx/en_us_goadedes/oc.m2.d1:ocMA.Antiphon33.incipit	From the Holy Spirit all wisdom…
ltx/en_us_goadedes/oc.m2.d1:ocMA.Antiphon33.melody	
ltx/en_us_goadedes/oc.m2.d1:ocMA.Antiphon33.mode	@ltx/en_us_goadedes/miscellanea:misc.Mode2
ltx/en_us_goadedes/oc.m2.d1:ocMA.Antiphon33.text	From the Holy Spirit all wisdom gushes forth, as does grace to Apostles. By Him Martyrs are awarded for their contests, and Prophets have visions.
ltx/en_us_goadedes/oc.m2.d1:ocMA.ApolTheotokion.incipit	@ltx/en_us_goadedes/ho.ho03:hoMA.SunTroparion1.incipit
ltx/en_us_goadedes/oc.m2.d1:ocMA.ApolTheotokion.melody	
ltx/en_us_goadedes/oc.m2.d1:ocMA.ApolTheotokion.mode	@ltx/en_us_goadedes/miscellanea:misc.Mode2
ltx/en_us_goadedes/oc.m2.d1:ocMA.ApolTheotokion.text	@ltx/en_us_goadedes/ho.ho03:hoMA.SunTroparion1.text
ltx/en_us_goadedes/oc.m2.d1:ocMA.C1.poet	@ltx/en_us_goadedes/poets:po.IoannouMonachou
ltx/en_us_goadedes/oc.m2.d1:ocMA.C2.acrostic.notice1	
ltx/en_us_goadedes/oc.m2.d1:ocMA.C2.acrostic.title	Canon for the Cross and Resurrection.
ltx/en_us_goadedes/oc.m2.d1:ocMA.C2.poet	@ltx/en_us_goadedes/poets:po.IoannouMonachou
ltx/en_us_goadedes/oc.m2.d1:ocMA.C3.acrostic.notice1	
ltx/en_us_goadedes/oc.m2.d1:ocMA.C3.acrostic.notice2	
ltx/en_us_goadedes/oc.m2.d1:ocMA.C3.acrostic.text	
ltx/en_us_goadedes/oc.m2.d1:ocMA.C3.acrostic.title	Canon for the Theotokos.
ltx/en_us_goadedes/oc.m2.d1:ocMA.C3.poet	@ltx/en_us_goadedes/poets:po.IoannouMonachou
ltx/en_us_goadedes/oc.m2.d1:ocMA.Hypakoe.incipit	After Your Passion…
ltx/en_us_goadedes/oc.m2.d1:ocMA.Hypakoe.melody	
ltx/en_us_goadedes/oc.m2.d1:ocMA.Hypakoe.mode	@ltx/en_us_goadedes/miscellanea:misc.Mode2
ltx/en_us_goadedes/oc.m2.d1:ocMA.Hypakoe.text	After Your Passion, O Christ God, the women went to the tomb to anoint Your body. They saw Angels in the sepulcher, and they were amazed. For they heard them saying that You the Lord had risen, granting to the world the great mercy.
ltx/en_us_goadedes/oc.m2.d1:ocMA.Kathisma11.incipit	When he took down…
ltx/en_us_goadedes/oc.m2.d1:ocMA.Kathisma11.melody	
ltx/en_us_goadedes/oc.m2.d1:ocMA.Kathisma11.mode	@ltx/en_us_goadedes/miscellanea:misc.Mode2
ltx/en_us_goadedes/oc.m2.d1:ocMA.Kathisma11.text	When he took down Your immaculate Body from the Cross, the honorable Joseph wrapped it in a clean linen shroud with spices and laid it for burial in a new tomb. But on the third day You rose, O Lord, and granted to the world the great mercy.
ltx/en_us_goadedes/oc.m2.d1:ocMA.Kathisma12.incipit	The Angel who had come…
ltx/en_us_goadedes/oc.m2.d1:ocMA.Kathisma12.melody	
ltx/en_us_goadedes/oc.m2.d1:ocMA.Kathisma12.mode	@ltx/en_us_goadedes/miscellanea:misc.Mode2
ltx/en_us_goadedes/oc.m2.d1:ocMA.Kathisma12.text	The Angel who had come to the sepulcher said to the Myrrh-bearing women, “Ointments are appropriate for mortal men; but Christ is indeed a stranger to decay. Now go proclaim that the Lord has risen and granted to the world the great mercy.”
ltx/en_us_goadedes/oc.m2.d1:ocMA.Kathisma13.incipit	You are supremely glorified…
ltx/en_us_goadedes/oc.m2.d1:ocMA.Kathisma13.melody	
ltx/en_us_goadedes/oc.m2.d1:ocMA.Kathisma13.mode	@ltx/en_us_goadedes/miscellanea:misc.Mode2
ltx/en_us_goadedes/oc.m2.d1:ocMA.Kathisma13.text	You are supremely glorified, O Virgin Theotokos; we sing your praise. By your Son’s crucifixion, Hades was overthrown and death itself has died. We who were dead have risen and have been granted life. We have received the original enjoyment of Paradise. Therefore we give thanks and send up glory to Christ our God, the only strong and very merciful Lord.
ltx/en_us_goadedes/oc.m2.d1:ocMA.Kathisma21.incipit	Not preventing the sealing…
ltx/en_us_goadedes/oc.m2.d1:ocMA.Kathisma21.melody	
ltx/en_us_goadedes/oc.m2.d1:ocMA.Kathisma21.mode	@ltx/en_us_goadedes/miscellanea:misc.Mode2
ltx/en_us_goadedes/oc.m2.d1:ocMA.Kathisma21.text	Not preventing the sealing of the stone of the tomb, with Your rising You gave to all the rock of the faith. Glory to You, O Lord.
ltx/en_us_goadedes/oc.m2.d1:ocMA.Kathisma22.incipit	The choir of Your disciples…
ltx/en_us_goadedes/oc.m2.d1:ocMA.Kathisma22.melody	
ltx/en_us_goadedes/oc.m2.d1:ocMA.Kathisma22.mode	@ltx/en_us_goadedes/miscellanea:misc.Mode2
ltx/en_us_goadedes/oc.m2.d1:ocMA.Kathisma22.text	The choir of Your disciples and the Myrrh-bearing Women are greatly rejoicing together with us. For we are celebrating one and the same feast, which glorifies and honors Your resurrection. By their intercessions, O benevolent Lord, grant to us Your people the great mercy.
ltx/en_us_goadedes/oc.m2.d1:ocMA.Kathisma23.incipit	You are supremely blessed…
ltx/en_us_goadedes/oc.m2.d1:ocMA.Kathisma23.melody	
ltx/en_us_goadedes/oc.m2.d1:ocMA.Kathisma23.mode	@ltx/en_us_goadedes/miscellanea:misc.Mode2
ltx/en_us_goadedes/oc.m2.d1:ocMA.Kathisma23.text	You are supremely blessed, O Virgin Theotokos. For through Him who from you became incarnate, Hades has been captured, and Adam has been called back; the curse has been killed, and Eve has been freed; death has been put to death, and we have been brought back to life. Therefore we extol Him and cry out, “O Christ our God, You are blessed, for so was Your good pleasure. Glory to You!”
ltx/en_us_goadedes/oc.m2.d1:ocMA.Kontakion.incipit	Omnipotent Lord…
ltx/en_us_goadedes/oc.m2.d1:ocMA.Kontakion.melody	@ltx/en_us_goadedes/he.a.m2:heAU.TaAnoZiton.name
ltx/en_us_goadedes/oc.m2.d1:ocMA.Kontakion.mode	@ltx/en_us_goadedes/miscellanea:misc.Mode2
ltx/en_us_goadedes/oc.m2.d1:ocMA.Kontakion.text	Omnipotent Lord, You rose from the sepulcher. * The netherworld saw the miracle and was stupefied, * for the dead were also raised. * But creation saw it and rejoiced with You; * Adam also greatly rejoiced. * O my Savior, the world forever sings Your praise.
ltx/en_us_goadedes/oc.m2.d1:ocMA.Lauds1.incipit	Everything that breathes…
ltx/en_us_goadedes/oc.m2.d1:ocMA.Lauds1.melody	
ltx/en_us_goadedes/oc.m2.d1:ocMA.Lauds1.mode	@ltx/en_us_goadedes/miscellanea:misc.Mode2
ltx/en_us_goadedes/oc.m2.d1:ocMA.Lauds1.text	Everything that breathes and all creation glorifies You, O Lord, for by the Cross You made death powerless, to demonstrate to all people Your resurrection from the dead, as our only benevolent God.
ltx/en_us_goadedes/oc.m2.d1:ocMA.Lauds2.incipit	Let the Jewish leaders…
ltx/en_us_goadedes/oc.m2.d1:ocMA.Lauds2.melody	
ltx/en_us_goadedes/oc.m2.d1:ocMA.Lauds2.mode	@ltx/en_us_goadedes/miscellanea:misc.Mode2
ltx/en_us_goadedes/oc.m2.d1:ocMA.Lauds2.text	Let the Jewish leaders explain it. How did the soldiers lose the King, whom they were guarding? Why couldn’t the stone secure the rock of life? Either produce Him who was buried, or else worship Him as risen from the dead, then join us and say, “Glory to the abundance of Your tender mercies, our Savior, glory to You!”
ltx/en_us_goadedes/oc.m2.d1:ocMA.Lauds3.incipit	Rejoice and be glad…
ltx/en_us_goadedes/oc.m2.d1:ocMA.Lauds3.melody	
ltx/en_us_goadedes/oc.m2.d1:ocMA.Lauds3.mode	@ltx/en_us_goadedes/miscellanea:misc.Mode2
ltx/en_us_goadedes/oc.m2.d1:ocMA.Lauds3.text	Rejoice and be glad, all people! An Angel sat on the stone of the tomb. And he announced to us the good news and said, “Christ has risen from the dead, as the Savior of the world; and He has filled the universe with fragrance.” Rejoice and be glad, all people!
ltx/en_us_goadedes/oc.m2.d1:ocMA.Lauds4.incipit	Before Your conception…
ltx/en_us_goadedes/oc.m2.d1:ocMA.Lauds4.melody	
ltx/en_us_goadedes/oc.m2.d1:ocMA.Lauds4.mode	@ltx/en_us_goadedes/miscellanea:misc.Mode2
ltx/en_us_goadedes/oc.m2.d1:ocMA.Lauds4.text	Before Your conception, an Angel brought the salutation, “Rejoice!” to the Maiden full of grace. Again, at Your resurrection, an Angel rolled away the stone from Your glorious tomb, O Lord. The one brought a promise of joy, replacing the pain and sorrow. The other declared that the Master gives life, reversing the threat of death. Therefore we sing to You: Lord and benefactor of all, glory to You!
ltx/en_us_goadedes/oc.m2.d1:ocMA.Lauds5.incipit	The women sprinkled…
ltx/en_us_goadedes/oc.m2.d1:ocMA.Lauds5.melody	
ltx/en_us_goadedes/oc.m2.d1:ocMA.Lauds5.mode	@ltx/en_us_goadedes/miscellanea:misc.Mode2
ltx/en_us_goadedes/oc.m2.d1:ocMA.Lauds5.text	The women sprinkled Your grave with ointments mixed with their tears. And then their mouths were filled with joy when they said, “The Lord has risen!”
ltx/en_us_goadedes/oc.m2.d1:ocMA.Lauds6.incipit	Let the people…
ltx/en_us_goadedes/oc.m2.d1:ocMA.Lauds6.melody	
ltx/en_us_goadedes/oc.m2.d1:ocMA.Lauds6.mode	@ltx/en_us_goadedes/miscellanea:misc.Mode2
ltx/en_us_goadedes/oc.m2.d1:ocMA.Lauds6.text	Let the people of all nations give praise to Christ our God, who voluntarily endured the Cross for us and for three days dwelt in the netherworld. And let them show reverence to His resurrection from the dead, through which all the ends of the earth have been enlightened.
ltx/en_us_goadedes/oc.m2.d1:ocMA.Lauds7.incipit	You were crucified…
ltx/en_us_goadedes/oc.m2.d1:ocMA.Lauds7.melody	
ltx/en_us_goadedes/oc.m2.d1:ocMA.Lauds7.mode	@ltx/en_us_goadedes/miscellanea:misc.Mode2
ltx/en_us_goadedes/oc.m2.d1:ocMA.Lauds7.text	You were crucified and buried as You willed, O Christ. As God and Master, You despoiled death, and to the world You gave eternal life and the great mercy.
ltx/en_us_goadedes/oc.m2.d1:ocMA.Lauds8.incipit	Villains that you truly are…
ltx/en_us_goadedes/oc.m2.d1:ocMA.Lauds8.melody	
ltx/en_us_goadedes/oc.m2.d1:ocMA.Lauds8.mode	@ltx/en_us_goadedes/miscellanea:misc.Mode2
ltx/en_us_goadedes/oc.m2.d1:ocMA.Lauds8.text	Villains that you truly are, since you sealed the stone, you unwittingly entitled us to claim a greater miracle. The guards know about this. He came forth from the tomb today. But you told them to say, “His disciples came and stole Him away while we were asleep.” Who steals a dead man, and a naked one at that? This one rose, by His own authority as God, and He left the grave clothes in the sepulcher. O Jews, come and see it, how He did not break the seals, yes, He who trampled death and grants to the human race never-ending life and the great mercy.
ltx/en_us_goadedes/oc.m2.d1:ocMA.MM.AntiphonsProkeimenon.text	@ltx/en_us_goadedes/properties:media.key
ltx/en_us_goadedes/oc.m2.d1:ocMA.MM.GodIsTheLord.text	@ltx/en_us_goadedes/properties:media.key
ltx/en_us_goadedes/oc.m2.d1:ocMA.MM.Lauds01.text	@ltx/en_us_goadedes/properties:media.key
ltx/en_us_goadedes/oc.m2.d1:ocMA.MM.Lauds02.text	@ltx/en_us_goadedes/properties:media.key
ltx/en_us_goadedes/oc.m2.d1:ocMA.MM.LaudsStichologia.text	@ltx/en_us_goadedes/properties:media.key
ltx/en_us_goadedes/oc.m2.d1:ocMA.MM.Prokeimenon.text	@ltx/en_us_goadedes/properties:media.key
ltx/en_us_goadedes/oc.m2.d1:ocMA.Magnificat.incipit	@ltx/en_us_goadedes/he.h.m6:heHE.TinTimioteran.incipit
ltx/en_us_goadedes/oc.m2.d1:ocMA.Magnificat.mode	@ltx/en_us_goadedes/miscellanea:misc.Mode2
ltx/en_us_goadedes/oc.m2.d1:ocMA.Magnificat.text	@ltx/en_us_goadedes/he.h.m6:heHE.TinTimioteran.text
ltx/en_us_goadedes/oc.m2.d1:ocMA.OdeS1C11.incipit	…
ltx/en_us_goadedes/oc.m2.d1:ocMA.OdeS1C11.melody	@ltx/en_us_goadedes/he.h.m2:heHE.EnVythoKatestrose.name
ltx/en_us_goadedes/oc.m2.d1:ocMA.OdeS1C11.mode	@ltx/en_us_goadedes/miscellanea:misc.Mode2
ltx/en_us_goadedes/oc.m2.d1:ocMA.OdeS1C11.ode	@ltx/en_us_goadedes/miscellanea:misc.Ode1
ltx/en_us_goadedes/oc.m2.d1:ocMA.OdeS1C11.text	
ltx/en_us_goadedes/oc.m2.d1:ocMA.OdeS1C12.incipit	…
ltx/en_us_goadedes/oc.m2.d1:ocMA.OdeS1C12.melody	@ltx/en_us_goadedes/he.h.m2:heHE.EnVythoKatestrose.name
ltx/en_us_goadedes/oc.m2.d1:ocMA.OdeS1C12.mode	@ltx/en_us_goadedes/miscellanea:misc.Mode2
ltx/en_us_goadedes/oc.m2.d1:ocMA.OdeS1C12.ode	@ltx/en_us_goadedes/miscellanea:misc.Ode1
ltx/en_us_goadedes/oc.m2.d1:ocMA.OdeS1C12.text	
ltx/en_us_goadedes/oc.m2.d1:ocMA.OdeS1C1H.greekmelody	@ltx/en_us_goadedes/he.h.m2:heHE.EnVythoKatestrose.greekname
ltx/en_us_goadedes/oc.m2.d1:ocMA.OdeS1C1H.incipit	@ltx/en_us_goadedes/he.h.m2:heHE.EnVythoKatestrose.incipit
ltx/en_us_goadedes/oc.m2.d1:ocMA.OdeS1C1H.melody	@ltx/en_us_goadedes/he.h.m2:heHE.EnVythoKatestrose.melody
ltx/en_us_goadedes/oc.m2.d1:ocMA.OdeS1C1H.mode	@ltx/en_us_goadedes/miscellanea:misc.Mode2
ltx/en_us_goadedes/oc.m2.d1:ocMA.OdeS1C1H.ode	@ltx/en_us_goadedes/miscellanea:misc.Ode1
ltx/en_us_goadedes/oc.m2.d1:ocMA.OdeS1C1H.text	@ltx/en_us_goadedes/he.h.m2:heHE.EnVythoKatestrose.text
ltx/en_us_goadedes/oc.m2.d1:ocMA.OdeS1C1T.incipit	…
ltx/en_us_goadedes/oc.m2.d1:ocMA.OdeS1C1T.melody	@ltx/en_us_goadedes/he.h.m2:heHE.EnVythoKatestrose.name
ltx/en_us_goadedes/oc.m2.d1:ocMA.OdeS1C1T.mode	@ltx/en_us_goadedes/miscellanea:misc.Mode2
ltx/en_us_goadedes/oc.m2.d1:ocMA.OdeS1C1T.ode	@ltx/en_us_goadedes/miscellanea:misc.Ode1
ltx/en_us_goadedes/oc.m2.d1:ocMA.OdeS1C1T.text	
ltx/en_us_goadedes/oc.m2.d1:ocMA.OdeS1C21.greekmelody	@ltx/en_us_goadedes/he.h.m2:heHE.AtriptonAsynithi.greekname
ltx/en_us_goadedes/oc.m2.d1:ocMA.OdeS1C21.incipit	…
ltx/en_us_goadedes/oc.m2.d1:ocMA.OdeS1C21.melody	@ltx/en_us_goadedes/he.h.m2:heHE.AtriptonAsynithi.name
ltx/en_us_goadedes/oc.m2.d1:ocMA.OdeS1C21.mode	@ltx/en_us_goadedes/miscellanea:misc.Mode2
ltx/en_us_goadedes/oc.m2.d1:ocMA.OdeS1C21.ode	@ltx/en_us_goadedes/miscellanea:misc.Ode1
ltx/en_us_goadedes/oc.m2.d1:ocMA.OdeS1C21.text	
ltx/en_us_goadedes/oc.m2.d1:ocMA.OdeS1C22.incipit	…
ltx/en_us_goadedes/oc.m2.d1:ocMA.OdeS1C22.melody	@ltx/en_us_goadedes/he.h.m2:heHE.AtriptonAsynithi.name
ltx/en_us_goadedes/oc.m2.d1:ocMA.OdeS1C22.mode	@ltx/en_us_goadedes/miscellanea:misc.Mode2
ltx/en_us_goadedes/oc.m2.d1:ocMA.OdeS1C22.ode	@ltx/en_us_goadedes/miscellanea:misc.Ode1
ltx/en_us_goadedes/oc.m2.d1:ocMA.OdeS1C22.text	
ltx/en_us_goadedes/oc.m2.d1:ocMA.OdeS1C31.greekmelody	@ltx/en_us_goadedes/he.h.m2:heHE.AtriptonAsynithi.greekname
ltx/en_us_goadedes/oc.m2.d1:ocMA.OdeS1C31.incipit	…
ltx/en_us_goadedes/oc.m2.d1:ocMA.OdeS1C31.melody	@ltx/en_us_goadedes/he.h.m2:heHE.AtriptonAsynithi.name
ltx/en_us_goadedes/oc.m2.d1:ocMA.OdeS1C31.mode	@ltx/en_us_goadedes/miscellanea:misc.Mode2
ltx/en_us_goadedes/oc.m2.d1:ocMA.OdeS1C31.ode	@ltx/en_us_goadedes/miscellanea:misc.Ode1
ltx/en_us_goadedes/oc.m2.d1:ocMA.OdeS1C31.text	
ltx/en_us_goadedes/oc.m2.d1:ocMA.OdeS1C32.incipit	…
ltx/en_us_goadedes/oc.m2.d1:ocMA.OdeS1C32.melody	@ltx/en_us_goadedes/he.h.m2:heHE.AtriptonAsynithi.name
ltx/en_us_goadedes/oc.m2.d1:ocMA.OdeS1C32.mode	@ltx/en_us_goadedes/miscellanea:misc.Mode2
ltx/en_us_goadedes/oc.m2.d1:ocMA.OdeS1C32.ode	@ltx/en_us_goadedes/miscellanea:misc.Ode1
ltx/en_us_goadedes/oc.m2.d1:ocMA.OdeS1C32.text	
ltx/en_us_goadedes/oc.m2.d1:ocMA.OdeS1C33.incipit	…
ltx/en_us_goadedes/oc.m2.d1:ocMA.OdeS1C33.melody	@ltx/en_us_goadedes/he.h.m2:heHE.AtriptonAsynithi.name
ltx/en_us_goadedes/oc.m2.d1:ocMA.OdeS1C33.mode	@ltx/en_us_goadedes/miscellanea:misc.Mode2
ltx/en_us_goadedes/oc.m2.d1:ocMA.OdeS1C33.ode	@ltx/en_us_goadedes/miscellanea:misc.Ode1
ltx/en_us_goadedes/oc.m2.d1:ocMA.OdeS1C33.text	
ltx/en_us_goadedes/oc.m2.d1:ocMA.OdeS3C11.incipit	…
ltx/en_us_goadedes/oc.m2.d1:ocMA.OdeS3C11.melody	@ltx/en_us_goadedes/he.h.m2:heHE.ExinthisenIErimos.name
ltx/en_us_goadedes/oc.m2.d1:ocMA.OdeS3C11.mode	@ltx/en_us_goadedes/miscellanea:misc.Mode2
ltx/en_us_goadedes/oc.m2.d1:ocMA.OdeS3C11.ode	@ltx/en_us_goadedes/miscellanea:misc.Ode4
ltx/en_us_goadedes/oc.m2.d1:ocMA.OdeS3C11.text	
ltx/en_us_goadedes/oc.m2.d1:ocMA.OdeS3C12.incipit	…
ltx/en_us_goadedes/oc.m2.d1:ocMA.OdeS3C12.melody	@ltx/en_us_goadedes/he.h.m2:heHE.ExinthisenIErimos.name
ltx/en_us_goadedes/oc.m2.d1:ocMA.OdeS3C12.mode	@ltx/en_us_goadedes/miscellanea:misc.Mode2
ltx/en_us_goadedes/oc.m2.d1:ocMA.OdeS3C12.ode	@ltx/en_us_goadedes/miscellanea:misc.Ode3
ltx/en_us_goadedes/oc.m2.d1:ocMA.OdeS3C12.text	
ltx/en_us_goadedes/oc.m2.d1:ocMA.OdeS3C1H.greekmelody	@ltx/en_us_goadedes/he.h.m2:heHE.ExinthisenIErimos.greekname
ltx/en_us_goadedes/oc.m2.d1:ocMA.OdeS3C1H.incipit	@ltx/en_us_goadedes/he.h.m2:heHE.ExinthisenIErimos.incipit
ltx/en_us_goadedes/oc.m2.d1:ocMA.OdeS3C1H.melody	@ltx/en_us_goadedes/he.h.m2:heHE.ExinthisenIErimos.melody
ltx/en_us_goadedes/oc.m2.d1:ocMA.OdeS3C1H.mode	@ltx/en_us_goadedes/miscellanea:misc.Mode2
ltx/en_us_goadedes/oc.m2.d1:ocMA.OdeS3C1H.ode	@ltx/en_us_goadedes/miscellanea:misc.Ode3
ltx/en_us_goadedes/oc.m2.d1:ocMA.OdeS3C1H.text	@ltx/en_us_goadedes/he.h.m2:heHE.ExinthisenIErimos.text
ltx/en_us_goadedes/oc.m2.d1:ocMA.OdeS3C1T.incipit	…
ltx/en_us_goadedes/oc.m2.d1:ocMA.OdeS3C1T.melody	@ltx/en_us_goadedes/he.h.m2:heHE.ExinthisenIErimos.name
ltx/en_us_goadedes/oc.m2.d1:ocMA.OdeS3C1T.mode	@ltx/en_us_goadedes/miscellanea:misc.Mode2
ltx/en_us_goadedes/oc.m2.d1:ocMA.OdeS3C1T.ode	@ltx/en_us_goadedes/miscellanea:misc.Ode3
ltx/en_us_goadedes/oc.m2.d1:ocMA.OdeS3C1T.text	
ltx/en_us_goadedes/oc.m2.d1:ocMA.OdeS3C21.greekmelody	@ltx/en_us_goadedes/he.h.m2:heHE.ToxonSynetriviDynaston.greekname
ltx/en_us_goadedes/oc.m2.d1:ocMA.OdeS3C21.incipit	…
ltx/en_us_goadedes/oc.m2.d1:ocMA.OdeS3C21.melody	@ltx/en_us_goadedes/he.h.m2:heHE.ToxonSynetriviDynaston.name
ltx/en_us_goadedes/oc.m2.d1:ocMA.OdeS3C21.mode	@ltx/en_us_goadedes/miscellanea:misc.Mode2
ltx/en_us_goadedes/oc.m2.d1:ocMA.OdeS3C21.ode	@ltx/en_us_goadedes/miscellanea:misc.Ode3
ltx/en_us_goadedes/oc.m2.d1:ocMA.OdeS3C21.text	
ltx/en_us_goadedes/oc.m2.d1:ocMA.OdeS3C22.incipit	…
ltx/en_us_goadedes/oc.m2.d1:ocMA.OdeS3C22.melody	@ltx/en_us_goadedes/he.h.m2:heHE.ToxonSynetriviDynaston.name
ltx/en_us_goadedes/oc.m2.d1:ocMA.OdeS3C22.mode	@ltx/en_us_goadedes/miscellanea:misc.Mode2
ltx/en_us_goadedes/oc.m2.d1:ocMA.OdeS3C22.ode	@ltx/en_us_goadedes/miscellanea:misc.Ode3
ltx/en_us_goadedes/oc.m2.d1:ocMA.OdeS3C22.text	
ltx/en_us_goadedes/oc.m2.d1:ocMA.OdeS3C31.greekmelody	@ltx/en_us_goadedes/he.h.m2:heHE.ToxonSynetriviDynaston.greekname
ltx/en_us_goadedes/oc.m2.d1:ocMA.OdeS3C31.incipit	…
ltx/en_us_goadedes/oc.m2.d1:ocMA.OdeS3C31.melody	@ltx/en_us_goadedes/he.h.m2:heHE.ToxonSynetriviDynaston.name
ltx/en_us_goadedes/oc.m2.d1:ocMA.OdeS3C31.mode	@ltx/en_us_goadedes/miscellanea:misc.Mode2
ltx/en_us_goadedes/oc.m2.d1:ocMA.OdeS3C31.ode	@ltx/en_us_goadedes/miscellanea:misc.Ode3
ltx/en_us_goadedes/oc.m2.d1:ocMA.OdeS3C31.text	
ltx/en_us_goadedes/oc.m2.d1:ocMA.OdeS3C32.incipit	…
ltx/en_us_goadedes/oc.m2.d1:ocMA.OdeS3C32.melody	@ltx/en_us_goadedes/he.h.m2:heHE.ToxonSynetriviDynaston.name
ltx/en_us_goadedes/oc.m2.d1:ocMA.OdeS3C32.mode	@ltx/en_us_goadedes/miscellanea:misc.Mode2
ltx/en_us_goadedes/oc.m2.d1:ocMA.OdeS3C32.ode	@ltx/en_us_goadedes/miscellanea:misc.Ode3
ltx/en_us_goadedes/oc.m2.d1:ocMA.OdeS3C32.text	
ltx/en_us_goadedes/oc.m2.d1:ocMA.OdeS4C11.incipit	…
ltx/en_us_goadedes/oc.m2.d1:ocMA.OdeS4C11.melody	@ltx/en_us_goadedes/he.h.m2:heHE.ElilythasEkParthenou.name
ltx/en_us_goadedes/oc.m2.d1:ocMA.OdeS4C11.mode	@ltx/en_us_goadedes/miscellanea:misc.Mode2
ltx/en_us_goadedes/oc.m2.d1:ocMA.OdeS4C11.ode	@ltx/en_us_goadedes/miscellanea:misc.Ode4
ltx/en_us_goadedes/oc.m2.d1:ocMA.OdeS4C11.text	
ltx/en_us_goadedes/oc.m2.d1:ocMA.OdeS4C12.incipit	…
ltx/en_us_goadedes/oc.m2.d1:ocMA.OdeS4C12.melody	@ltx/en_us_goadedes/he.h.m2:heHE.ElilythasEkParthenou.name
ltx/en_us_goadedes/oc.m2.d1:ocMA.OdeS4C12.mode	@ltx/en_us_goadedes/miscellanea:misc.Mode2
ltx/en_us_goadedes/oc.m2.d1:ocMA.OdeS4C12.ode	@ltx/en_us_goadedes/miscellanea:misc.Ode4
ltx/en_us_goadedes/oc.m2.d1:ocMA.OdeS4C12.text	
ltx/en_us_goadedes/oc.m2.d1:ocMA.OdeS4C1H.greekmelody	@ltx/en_us_goadedes/he.h.m2:heHE.ElilythasEkParthenou.greekname
ltx/en_us_goadedes/oc.m2.d1:ocMA.OdeS4C1H.incipit	@ltx/en_us_goadedes/he.h.m2:heHE.ElilythasEkParthenou.incipit
ltx/en_us_goadedes/oc.m2.d1:ocMA.OdeS4C1H.melody	@ltx/en_us_goadedes/he.h.m2:heHE.ElilythasEkParthenou.melody
ltx/en_us_goadedes/oc.m2.d1:ocMA.OdeS4C1H.mode	@ltx/en_us_goadedes/miscellanea:misc.Mode2
ltx/en_us_goadedes/oc.m2.d1:ocMA.OdeS4C1H.ode	@ltx/en_us_goadedes/miscellanea:misc.Ode4
ltx/en_us_goadedes/oc.m2.d1:ocMA.OdeS4C1H.text	@ltx/en_us_goadedes/he.h.m2:heHE.ElilythasEkParthenou.text
ltx/en_us_goadedes/oc.m2.d1:ocMA.OdeS4C1T.incipit	…
ltx/en_us_goadedes/oc.m2.d1:ocMA.OdeS4C1T.melody	@ltx/en_us_goadedes/he.h.m2:heHE.ElilythasEkParthenou.name
ltx/en_us_goadedes/oc.m2.d1:ocMA.OdeS4C1T.mode	@ltx/en_us_goadedes/miscellanea:misc.Mode2
ltx/en_us_goadedes/oc.m2.d1:ocMA.OdeS4C1T.ode	@ltx/en_us_goadedes/miscellanea:misc.Ode4
ltx/en_us_goadedes/oc.m2.d1:ocMA.OdeS4C1T.text	
ltx/en_us_goadedes/oc.m2.d1:ocMA.OdeS4C21.greekmelody	@ltx/en_us_goadedes/he.h.m2:heHE.AkikoaKyrieTinEndoxon.greekname
ltx/en_us_goadedes/oc.m2.d1:ocMA.OdeS4C21.incipit	…
ltx/en_us_goadedes/oc.m2.d1:ocMA.OdeS4C21.melody	@ltx/en_us_goadedes/he.h.m2:heHE.AkikoaKyrieTinEndoxon.name
ltx/en_us_goadedes/oc.m2.d1:ocMA.OdeS4C21.mode	@ltx/en_us_goadedes/miscellanea:misc.Mode2
ltx/en_us_goadedes/oc.m2.d1:ocMA.OdeS4C21.ode	@ltx/en_us_goadedes/miscellanea:misc.Ode4
ltx/en_us_goadedes/oc.m2.d1:ocMA.OdeS4C21.text	
ltx/en_us_goadedes/oc.m2.d1:ocMA.OdeS4C22.incipit	…
ltx/en_us_goadedes/oc.m2.d1:ocMA.OdeS4C22.melody	@ltx/en_us_goadedes/he.h.m2:heHE.AkikoaKyrieTinEndoxon.name
ltx/en_us_goadedes/oc.m2.d1:ocMA.OdeS4C22.mode	@ltx/en_us_goadedes/miscellanea:misc.Mode2
ltx/en_us_goadedes/oc.m2.d1:ocMA.OdeS4C22.ode	@ltx/en_us_goadedes/miscellanea:misc.Ode4
ltx/en_us_goadedes/oc.m2.d1:ocMA.OdeS4C22.text	
ltx/en_us_goadedes/oc.m2.d1:ocMA.OdeS4C31.greekmelody	@ltx/en_us_goadedes/he.h.m2:heHE.AkikoaKyrieTinEndoxon.greekname
ltx/en_us_goadedes/oc.m2.d1:ocMA.OdeS4C31.incipit	…
ltx/en_us_goadedes/oc.m2.d1:ocMA.OdeS4C31.melody	@ltx/en_us_goadedes/he.h.m2:heHE.AkikoaKyrieTinEndoxon.name
ltx/en_us_goadedes/oc.m2.d1:ocMA.OdeS4C31.mode	@ltx/en_us_goadedes/miscellanea:misc.Mode2
ltx/en_us_goadedes/oc.m2.d1:ocMA.OdeS4C31.ode	@ltx/en_us_goadedes/miscellanea:misc.Ode4
ltx/en_us_goadedes/oc.m2.d1:ocMA.OdeS4C31.text	
ltx/en_us_goadedes/oc.m2.d1:ocMA.OdeS4C32.incipit	…
ltx/en_us_goadedes/oc.m2.d1:ocMA.OdeS4C32.melody	@ltx/en_us_goadedes/he.h.m2:heHE.AkikoaKyrieTinEndoxon.name
ltx/en_us_goadedes/oc.m2.d1:ocMA.OdeS4C32.mode	@ltx/en_us_goadedes/miscellanea:misc.Mode2
ltx/en_us_goadedes/oc.m2.d1:ocMA.OdeS4C32.ode	@ltx/en_us_goadedes/miscellanea:misc.Ode4
ltx/en_us_goadedes/oc.m2.d1:ocMA.OdeS4C32.text	
ltx/en_us_goadedes/oc.m2.d1:ocMA.OdeS5C11.incipit	…
ltx/en_us_goadedes/oc.m2.d1:ocMA.OdeS5C11.melody	@ltx/en_us_goadedes/he.h.m2:heHE.MesitisTheou.name
ltx/en_us_goadedes/oc.m2.d1:ocMA.OdeS5C11.mode	@ltx/en_us_goadedes/miscellanea:misc.Mode2
ltx/en_us_goadedes/oc.m2.d1:ocMA.OdeS5C11.ode	@ltx/en_us_goadedes/miscellanea:misc.Ode5
ltx/en_us_goadedes/oc.m2.d1:ocMA.OdeS5C11.text	
ltx/en_us_goadedes/oc.m2.d1:ocMA.OdeS5C12.incipit	…
ltx/en_us_goadedes/oc.m2.d1:ocMA.OdeS5C12.melody	@ltx/en_us_goadedes/he.h.m2:heHE.MesitisTheou.name
ltx/en_us_goadedes/oc.m2.d1:ocMA.OdeS5C12.mode	@ltx/en_us_goadedes/miscellanea:misc.Mode2
ltx/en_us_goadedes/oc.m2.d1:ocMA.OdeS5C12.ode	@ltx/en_us_goadedes/miscellanea:misc.Ode5
ltx/en_us_goadedes/oc.m2.d1:ocMA.OdeS5C12.text	
ltx/en_us_goadedes/oc.m2.d1:ocMA.OdeS5C1H.greekmelody	@ltx/en_us_goadedes/he.h.m2:heHE.MesitisTheou.greekname
ltx/en_us_goadedes/oc.m2.d1:ocMA.OdeS5C1H.incipit	@ltx/en_us_goadedes/he.h.m2:heHE.MesitisTheou.incipit
ltx/en_us_goadedes/oc.m2.d1:ocMA.OdeS5C1H.melody	@ltx/en_us_goadedes/he.h.m2:heHE.MesitisTheou.melody
ltx/en_us_goadedes/oc.m2.d1:ocMA.OdeS5C1H.mode	@ltx/en_us_goadedes/miscellanea:misc.Mode2
ltx/en_us_goadedes/oc.m2.d1:ocMA.OdeS5C1H.ode	@ltx/en_us_goadedes/miscellanea:misc.Ode5
ltx/en_us_goadedes/oc.m2.d1:ocMA.OdeS5C1H.text	@ltx/en_us_goadedes/he.h.m2:heHE.MesitisTheou.text
ltx/en_us_goadedes/oc.m2.d1:ocMA.OdeS5C1T.incipit	…
ltx/en_us_goadedes/oc.m2.d1:ocMA.OdeS5C1T.melody	@ltx/en_us_goadedes/he.h.m2:heHE.MesitisTheou.name
ltx/en_us_goadedes/oc.m2.d1:ocMA.OdeS5C1T.mode	@ltx/en_us_goadedes/miscellanea:misc.Mode2
ltx/en_us_goadedes/oc.m2.d1:ocMA.OdeS5C1T.ode	@ltx/en_us_goadedes/miscellanea:misc.Ode5
ltx/en_us_goadedes/oc.m2.d1:ocMA.OdeS5C1T.text	
ltx/en_us_goadedes/oc.m2.d1:ocMA.OdeS5C21.greekmelody	@ltx/en_us_goadedes/he.h.m2:heHE.OAnthraxToIsaia.greekname
ltx/en_us_goadedes/oc.m2.d1:ocMA.OdeS5C21.incipit	…
ltx/en_us_goadedes/oc.m2.d1:ocMA.OdeS5C21.melody	@ltx/en_us_goadedes/he.h.m2:heHE.OAnthraxToIsaia.name
ltx/en_us_goadedes/oc.m2.d1:ocMA.OdeS5C21.mode	@ltx/en_us_goadedes/miscellanea:misc.Mode2
ltx/en_us_goadedes/oc.m2.d1:ocMA.OdeS5C21.ode	@ltx/en_us_goadedes/miscellanea:misc.Ode5
ltx/en_us_goadedes/oc.m2.d1:ocMA.OdeS5C21.text	
ltx/en_us_goadedes/oc.m2.d1:ocMA.OdeS5C22.incipit	…
ltx/en_us_goadedes/oc.m2.d1:ocMA.OdeS5C22.melody	@ltx/en_us_goadedes/he.h.m2:heHE.OAnthraxToIsaia.name
ltx/en_us_goadedes/oc.m2.d1:ocMA.OdeS5C22.mode	@ltx/en_us_goadedes/miscellanea:misc.Mode2
ltx/en_us_goadedes/oc.m2.d1:ocMA.OdeS5C22.ode	@ltx/en_us_goadedes/miscellanea:misc.Ode5
ltx/en_us_goadedes/oc.m2.d1:ocMA.OdeS5C22.text	
ltx/en_us_goadedes/oc.m2.d1:ocMA.OdeS5C31.greekmelody	@ltx/en_us_goadedes/he.h.m2:heHE.OAnthraxToIsaia.greekname
ltx/en_us_goadedes/oc.m2.d1:ocMA.OdeS5C31.incipit	…
ltx/en_us_goadedes/oc.m2.d1:ocMA.OdeS5C31.melody	@ltx/en_us_goadedes/he.h.m2:heHE.OAnthraxToIsaia.name
ltx/en_us_goadedes/oc.m2.d1:ocMA.OdeS5C31.mode	@ltx/en_us_goadedes/miscellanea:misc.Mode2
ltx/en_us_goadedes/oc.m2.d1:ocMA.OdeS5C31.ode	@ltx/en_us_goadedes/miscellanea:misc.Ode5
ltx/en_us_goadedes/oc.m2.d1:ocMA.OdeS5C31.text	
ltx/en_us_goadedes/oc.m2.d1:ocMA.OdeS5C32.incipit	…
ltx/en_us_goadedes/oc.m2.d1:ocMA.OdeS5C32.melody	@ltx/en_us_goadedes/he.h.m2:heHE.OAnthraxToIsaia.name
ltx/en_us_goadedes/oc.m2.d1:ocMA.OdeS5C32.mode	@ltx/en_us_goadedes/miscellanea:misc.Mode2
ltx/en_us_goadedes/oc.m2.d1:ocMA.OdeS5C32.ode	@ltx/en_us_goadedes/miscellanea:misc.Ode5
ltx/en_us_goadedes/oc.m2.d1:ocMA.OdeS5C32.text	
ltx/en_us_goadedes/oc.m2.d1:ocMA.OdeS6C11.incipit	…
ltx/en_us_goadedes/oc.m2.d1:ocMA.OdeS6C11.melody	@ltx/en_us_goadedes/he.h.m2:heHE.EnAvyssoPtaismaton.name
ltx/en_us_goadedes/oc.m2.d1:ocMA.OdeS6C11.mode	@ltx/en_us_goadedes/miscellanea:misc.Mode2
ltx/en_us_goadedes/oc.m2.d1:ocMA.OdeS6C11.ode	@ltx/en_us_goadedes/miscellanea:misc.Ode6
ltx/en_us_goadedes/oc.m2.d1:ocMA.OdeS6C11.text	
ltx/en_us_goadedes/oc.m2.d1:ocMA.OdeS6C12.incipit	…
ltx/en_us_goadedes/oc.m2.d1:ocMA.OdeS6C12.melody	@ltx/en_us_goadedes/he.h.m2:heHE.EnAvyssoPtaismaton.name
ltx/en_us_goadedes/oc.m2.d1:ocMA.OdeS6C12.mode	@ltx/en_us_goadedes/miscellanea:misc.Mode2
ltx/en_us_goadedes/oc.m2.d1:ocMA.OdeS6C12.ode	@ltx/en_us_goadedes/miscellanea:misc.Ode6
ltx/en_us_goadedes/oc.m2.d1:ocMA.OdeS6C12.text	
ltx/en_us_goadedes/oc.m2.d1:ocMA.OdeS6C1H.greekmelody	@ltx/en_us_goadedes/he.h.m2:heHE.EnAvyssoPtaismaton.greekname
ltx/en_us_goadedes/oc.m2.d1:ocMA.OdeS6C1H.incipit	@ltx/en_us_goadedes/he.h.m2:heHE.EnAvyssoPtaismaton.incipit
ltx/en_us_goadedes/oc.m2.d1:ocMA.OdeS6C1H.melody	@ltx/en_us_goadedes/he.h.m2:heHE.EnAvyssoPtaismaton.melody
ltx/en_us_goadedes/oc.m2.d1:ocMA.OdeS6C1H.mode	@ltx/en_us_goadedes/miscellanea:misc.Mode2
ltx/en_us_goadedes/oc.m2.d1:ocMA.OdeS6C1H.ode	@ltx/en_us_goadedes/miscellanea:misc.Ode6
ltx/en_us_goadedes/oc.m2.d1:ocMA.OdeS6C1H.text	@ltx/en_us_goadedes/he.h.m2:heHE.EnAvyssoPtaismaton.text
ltx/en_us_goadedes/oc.m2.d1:ocMA.OdeS6C1T.incipit	…
ltx/en_us_goadedes/oc.m2.d1:ocMA.OdeS6C1T.melody	@ltx/en_us_goadedes/he.h.m2:heHE.EnAvyssoPtaismaton.name
ltx/en_us_goadedes/oc.m2.d1:ocMA.OdeS6C1T.mode	@ltx/en_us_goadedes/miscellanea:misc.Mode2
ltx/en_us_goadedes/oc.m2.d1:ocMA.OdeS6C1T.ode	@ltx/en_us_goadedes/miscellanea:misc.Ode6
ltx/en_us_goadedes/oc.m2.d1:ocMA.OdeS6C1T.text	
ltx/en_us_goadedes/oc.m2.d1:ocMA.OdeS6C21.greekmelody	@ltx/en_us_goadedes/he.h.m2:heHE.IchouRimatonDeiseos.greekname
ltx/en_us_goadedes/oc.m2.d1:ocMA.OdeS6C21.incipit	…
ltx/en_us_goadedes/oc.m2.d1:ocMA.OdeS6C21.melody	@ltx/en_us_goadedes/he.h.m2:heHE.IchouRimatonDeiseos.name
ltx/en_us_goadedes/oc.m2.d1:ocMA.OdeS6C21.mode	@ltx/en_us_goadedes/miscellanea:misc.Mode2
ltx/en_us_goadedes/oc.m2.d1:ocMA.OdeS6C21.ode	@ltx/en_us_goadedes/miscellanea:misc.Ode6
ltx/en_us_goadedes/oc.m2.d1:ocMA.OdeS6C21.text	
ltx/en_us_goadedes/oc.m2.d1:ocMA.OdeS6C22.incipit	…
ltx/en_us_goadedes/oc.m2.d1:ocMA.OdeS6C22.melody	@ltx/en_us_goadedes/he.h.m2:heHE.IchouRimatonDeiseos.name
ltx/en_us_goadedes/oc.m2.d1:ocMA.OdeS6C22.mode	@ltx/en_us_goadedes/miscellanea:misc.Mode2
ltx/en_us_goadedes/oc.m2.d1:ocMA.OdeS6C22.ode	@ltx/en_us_goadedes/miscellanea:misc.Ode6
ltx/en_us_goadedes/oc.m2.d1:ocMA.OdeS6C22.text	
ltx/en_us_goadedes/oc.m2.d1:ocMA.OdeS6C31.greekmelody	@ltx/en_us_goadedes/he.h.m2:heHE.IchouRimatonDeiseos.greekname
ltx/en_us_goadedes/oc.m2.d1:ocMA.OdeS6C31.incipit	…
ltx/en_us_goadedes/oc.m2.d1:ocMA.OdeS6C31.melody	@ltx/en_us_goadedes/he.h.m2:heHE.IchouRimatonDeiseos.name
ltx/en_us_goadedes/oc.m2.d1:ocMA.OdeS6C31.mode	@ltx/en_us_goadedes/miscellanea:misc.Mode2
ltx/en_us_goadedes/oc.m2.d1:ocMA.OdeS6C31.ode	@ltx/en_us_goadedes/miscellanea:misc.Ode6
ltx/en_us_goadedes/oc.m2.d1:ocMA.OdeS6C31.text	
ltx/en_us_goadedes/oc.m2.d1:ocMA.OdeS6C32.incipit	…
ltx/en_us_goadedes/oc.m2.d1:ocMA.OdeS6C32.melody	@ltx/en_us_goadedes/he.h.m2:heHE.IchouRimatonDeiseos.name
ltx/en_us_goadedes/oc.m2.d1:ocMA.OdeS6C32.mode	@ltx/en_us_goadedes/miscellanea:misc.Mode2
ltx/en_us_goadedes/oc.m2.d1:ocMA.OdeS6C32.ode	@ltx/en_us_goadedes/miscellanea:misc.Ode6
ltx/en_us_goadedes/oc.m2.d1:ocMA.OdeS6C32.text	
ltx/en_us_goadedes/oc.m2.d1:ocMA.OdeS7C11.incipit	…
ltx/en_us_goadedes/oc.m2.d1:ocMA.OdeS7C11.melody	@ltx/en_us_goadedes/he.h.m2:heHE.AntitheonProstagma.name
ltx/en_us_goadedes/oc.m2.d1:ocMA.OdeS7C11.mode	@ltx/en_us_goadedes/miscellanea:misc.Mode2
ltx/en_us_goadedes/oc.m2.d1:ocMA.OdeS7C11.ode	@ltx/en_us_goadedes/miscellanea:misc.Ode7
ltx/en_us_goadedes/oc.m2.d1:ocMA.OdeS7C11.text	
ltx/en_us_goadedes/oc.m2.d1:ocMA.OdeS7C12.incipit	…
ltx/en_us_goadedes/oc.m2.d1:ocMA.OdeS7C12.melody	@ltx/en_us_goadedes/he.h.m2:heHE.AntitheonProstagma.name
ltx/en_us_goadedes/oc.m2.d1:ocMA.OdeS7C12.mode	@ltx/en_us_goadedes/miscellanea:misc.Mode2
ltx/en_us_goadedes/oc.m2.d1:ocMA.OdeS7C12.ode	@ltx/en_us_goadedes/miscellanea:misc.Ode7
ltx/en_us_goadedes/oc.m2.d1:ocMA.OdeS7C12.text	
ltx/en_us_goadedes/oc.m2.d1:ocMA.OdeS7C1H.greekmelody	@ltx/en_us_goadedes/he.h.m2:heHE.AntitheonProstagma.greekname
ltx/en_us_goadedes/oc.m2.d1:ocMA.OdeS7C1H.incipit	@ltx/en_us_goadedes/he.h.m2:heHE.AntitheonProstagma.incipit
ltx/en_us_goadedes/oc.m2.d1:ocMA.OdeS7C1H.melody	@ltx/en_us_goadedes/he.h.m2:heHE.AntitheonProstagma.melody
ltx/en_us_goadedes/oc.m2.d1:ocMA.OdeS7C1H.mode	@ltx/en_us_goadedes/miscellanea:misc.Mode2
ltx/en_us_goadedes/oc.m2.d1:ocMA.OdeS7C1H.ode	@ltx/en_us_goadedes/miscellanea:misc.Ode7
ltx/en_us_goadedes/oc.m2.d1:ocMA.OdeS7C1H.text	@ltx/en_us_goadedes/he.h.m2:heHE.AntitheonProstagma.text
ltx/en_us_goadedes/oc.m2.d1:ocMA.OdeS7C1T.incipit	…
ltx/en_us_goadedes/oc.m2.d1:ocMA.OdeS7C1T.melody	@ltx/en_us_goadedes/he.h.m2:heHE.AntitheonProstagma.name
ltx/en_us_goadedes/oc.m2.d1:ocMA.OdeS7C1T.mode	@ltx/en_us_goadedes/miscellanea:misc.Mode2
ltx/en_us_goadedes/oc.m2.d1:ocMA.OdeS7C1T.ode	@ltx/en_us_goadedes/miscellanea:misc.Ode7
ltx/en_us_goadedes/oc.m2.d1:ocMA.OdeS7C1T.text	
ltx/en_us_goadedes/oc.m2.d1:ocMA.OdeS7C21.greekmelody	@ltx/en_us_goadedes/he.h.m2:heHE.AntitheonProstagma.greekname
ltx/en_us_goadedes/oc.m2.d1:ocMA.OdeS7C21.incipit	…
ltx/en_us_goadedes/oc.m2.d1:ocMA.OdeS7C21.melody	@ltx/en_us_goadedes/he.h.m2:heHE.AntitheonProstagma.name
ltx/en_us_goadedes/oc.m2.d1:ocMA.OdeS7C21.mode	@ltx/en_us_goadedes/miscellanea:misc.Mode2
ltx/en_us_goadedes/oc.m2.d1:ocMA.OdeS7C21.ode	@ltx/en_us_goadedes/miscellanea:misc.Ode7
ltx/en_us_goadedes/oc.m2.d1:ocMA.OdeS7C21.text	
ltx/en_us_goadedes/oc.m2.d1:ocMA.OdeS7C22.incipit	…
ltx/en_us_goadedes/oc.m2.d1:ocMA.OdeS7C22.melody	@ltx/en_us_goadedes/he.h.m2:heHE.RitoresAnedeichthisanPaides.name
ltx/en_us_goadedes/oc.m2.d1:ocMA.OdeS7C22.mode	@ltx/en_us_goadedes/miscellanea:misc.Mode2
ltx/en_us_goadedes/oc.m2.d1:ocMA.OdeS7C22.ode	@ltx/en_us_goadedes/miscellanea:misc.Ode7
ltx/en_us_goadedes/oc.m2.d1:ocMA.OdeS7C22.text	
ltx/en_us_goadedes/oc.m2.d1:ocMA.OdeS7C23.incipit	…
ltx/en_us_goadedes/oc.m2.d1:ocMA.OdeS7C23.melody	@ltx/en_us_goadedes/he.h.m2:heHE.RitoresAnedeichthisanPaides.name
ltx/en_us_goadedes/oc.m2.d1:ocMA.OdeS7C23.mode	@ltx/en_us_goadedes/miscellanea:misc.Mode2
ltx/en_us_goadedes/oc.m2.d1:ocMA.OdeS7C23.ode	@ltx/en_us_goadedes/miscellanea:misc.Ode7
ltx/en_us_goadedes/oc.m2.d1:ocMA.OdeS7C23.text	
ltx/en_us_goadedes/oc.m2.d1:ocMA.OdeS7C31.greekmelody	@ltx/en_us_goadedes/he.h.m2:heHE.RitoresAnedeichthisanPaides.greekname
ltx/en_us_goadedes/oc.m2.d1:ocMA.OdeS7C31.incipit	…
ltx/en_us_goadedes/oc.m2.d1:ocMA.OdeS7C31.melody	@ltx/en_us_goadedes/he.h.m2:heHE.RitoresAnedeichthisanPaides.name
ltx/en_us_goadedes/oc.m2.d1:ocMA.OdeS7C31.mode	@ltx/en_us_goadedes/miscellanea:misc.Mode2
ltx/en_us_goadedes/oc.m2.d1:ocMA.OdeS7C31.ode	@ltx/en_us_goadedes/miscellanea:misc.Ode7
ltx/en_us_goadedes/oc.m2.d1:ocMA.OdeS7C31.text	
ltx/en_us_goadedes/oc.m2.d1:ocMA.OdeS7C32.incipit	…
ltx/en_us_goadedes/oc.m2.d1:ocMA.OdeS7C32.melody	@ltx/en_us_goadedes/he.h.m2:heHE.RitoresAnedeichthisanPaides.name
ltx/en_us_goadedes/oc.m2.d1:ocMA.OdeS7C32.mode	@ltx/en_us_goadedes/miscellanea:misc.Mode2
ltx/en_us_goadedes/oc.m2.d1:ocMA.OdeS7C32.ode	@ltx/en_us_goadedes/miscellanea:misc.Ode7
ltx/en_us_goadedes/oc.m2.d1:ocMA.OdeS7C32.text	
ltx/en_us_goadedes/oc.m2.d1:ocMA.OdeS7C33.incipit	…
ltx/en_us_goadedes/oc.m2.d1:ocMA.OdeS7C33.melody	@ltx/en_us_goadedes/he.h.m2:heHE.RitoresAnedeichthisanPaides.name
ltx/en_us_goadedes/oc.m2.d1:ocMA.OdeS7C33.mode	@ltx/en_us_goadedes/miscellanea:misc.Mode2
ltx/en_us_goadedes/oc.m2.d1:ocMA.OdeS7C33.ode	@ltx/en_us_goadedes/miscellanea:misc.Ode7
ltx/en_us_goadedes/oc.m2.d1:ocMA.OdeS7C33.text	
ltx/en_us_goadedes/oc.m2.d1:ocMA.OdeS8C11.incipit	…
ltx/en_us_goadedes/oc.m2.d1:ocMA.OdeS8C11.melody	@ltx/en_us_goadedes/he.h.m2:heHE.KaminosPote.name
ltx/en_us_goadedes/oc.m2.d1:ocMA.OdeS8C11.mode	@ltx/en_us_goadedes/miscellanea:misc.Mode2
ltx/en_us_goadedes/oc.m2.d1:ocMA.OdeS8C11.ode	@ltx/en_us_goadedes/miscellanea:misc.Ode8
ltx/en_us_goadedes/oc.m2.d1:ocMA.OdeS8C11.text	
ltx/en_us_goadedes/oc.m2.d1:ocMA.OdeS8C12.incipit	…
ltx/en_us_goadedes/oc.m2.d1:ocMA.OdeS8C12.melody	@ltx/en_us_goadedes/he.h.m2:heHE.KaminosPote.name
ltx/en_us_goadedes/oc.m2.d1:ocMA.OdeS8C12.mode	@ltx/en_us_goadedes/miscellanea:misc.Mode2
ltx/en_us_goadedes/oc.m2.d1:ocMA.OdeS8C12.ode	@ltx/en_us_goadedes/miscellanea:misc.Ode8
ltx/en_us_goadedes/oc.m2.d1:ocMA.OdeS8C12.text	
ltx/en_us_goadedes/oc.m2.d1:ocMA.OdeS8C1H.greekmelody	@ltx/en_us_goadedes/he.h.m2:heHE.KaminosPote.greekname
ltx/en_us_goadedes/oc.m2.d1:ocMA.OdeS8C1H.incipit	@ltx/en_us_goadedes/he.h.m2:heHE.KaminosPote.incipit
ltx/en_us_goadedes/oc.m2.d1:ocMA.OdeS8C1H.melody	@ltx/en_us_goadedes/he.h.m2:heHE.KaminosPote.melody
ltx/en_us_goadedes/oc.m2.d1:ocMA.OdeS8C1H.mode	@ltx/en_us_goadedes/miscellanea:misc.Mode2
ltx/en_us_goadedes/oc.m2.d1:ocMA.OdeS8C1H.ode	@ltx/en_us_goadedes/miscellanea:misc.Ode8
ltx/en_us_goadedes/oc.m2.d1:ocMA.OdeS8C1H.text	@ltx/en_us_goadedes/he.h.m2:heHE.KaminosPote.text
ltx/en_us_goadedes/oc.m2.d1:ocMA.OdeS8C1T.incipit	…
ltx/en_us_goadedes/oc.m2.d1:ocMA.OdeS8C1T.melody	@ltx/en_us_goadedes/he.h.m2:heHE.KaminosPote.name
ltx/en_us_goadedes/oc.m2.d1:ocMA.OdeS8C1T.mode	@ltx/en_us_goadedes/miscellanea:misc.Mode2
ltx/en_us_goadedes/oc.m2.d1:ocMA.OdeS8C1T.ode	@ltx/en_us_goadedes/miscellanea:misc.Ode8
ltx/en_us_goadedes/oc.m2.d1:ocMA.OdeS8C1T.text	
ltx/en_us_goadedes/oc.m2.d1:ocMA.OdeS8C21.greekmelody	@ltx/en_us_goadedes/he.h.m2:heHE.IndalmatosChrysou.greekname
ltx/en_us_goadedes/oc.m2.d1:ocMA.OdeS8C21.incipit	…
ltx/en_us_goadedes/oc.m2.d1:ocMA.OdeS8C21.melody	@ltx/en_us_goadedes/he.h.m2:heHE.IndalmatosChrysou.name
ltx/en_us_goadedes/oc.m2.d1:ocMA.OdeS8C21.mode	@ltx/en_us_goadedes/miscellanea:misc.Mode2
ltx/en_us_goadedes/oc.m2.d1:ocMA.OdeS8C21.ode	@ltx/en_us_goadedes/miscellanea:misc.Ode8
ltx/en_us_goadedes/oc.m2.d1:ocMA.OdeS8C21.text	
ltx/en_us_goadedes/oc.m2.d1:ocMA.OdeS8C22.incipit	…
ltx/en_us_goadedes/oc.m2.d1:ocMA.OdeS8C22.melody	@ltx/en_us_goadedes/he.h.m2:heHE.IndalmatosChrysou.name
ltx/en_us_goadedes/oc.m2.d1:ocMA.OdeS8C22.mode	@ltx/en_us_goadedes/miscellanea:misc.Mode2
ltx/en_us_goadedes/oc.m2.d1:ocMA.OdeS8C22.ode	@ltx/en_us_goadedes/miscellanea:misc.Ode8
ltx/en_us_goadedes/oc.m2.d1:ocMA.OdeS8C22.text	
ltx/en_us_goadedes/oc.m2.d1:ocMA.OdeS8C31.greekmelody	@ltx/en_us_goadedes/he.h.m2:heHE.IndalmatosChrysou.greekname
ltx/en_us_goadedes/oc.m2.d1:ocMA.OdeS8C31.incipit	…
ltx/en_us_goadedes/oc.m2.d1:ocMA.OdeS8C31.melody	@ltx/en_us_goadedes/he.h.m2:heHE.IndalmatosChrysou.name
ltx/en_us_goadedes/oc.m2.d1:ocMA.OdeS8C31.mode	@ltx/en_us_goadedes/miscellanea:misc.Mode2
ltx/en_us_goadedes/oc.m2.d1:ocMA.OdeS8C31.ode	@ltx/en_us_goadedes/miscellanea:misc.Ode8
ltx/en_us_goadedes/oc.m2.d1:ocMA.OdeS8C31.text	
ltx/en_us_goadedes/oc.m2.d1:ocMA.OdeS8C32.incipit	…
ltx/en_us_goadedes/oc.m2.d1:ocMA.OdeS8C32.melody	@ltx/en_us_goadedes/he.h.m2:heHE.IndalmatosChrysou.name
ltx/en_us_goadedes/oc.m2.d1:ocMA.OdeS8C32.mode	@ltx/en_us_goadedes/miscellanea:misc.Mode2
ltx/en_us_goadedes/oc.m2.d1:ocMA.OdeS8C32.ode	@ltx/en_us_goadedes/miscellanea:misc.Ode8
ltx/en_us_goadedes/oc.m2.d1:ocMA.OdeS8C32.text	
ltx/en_us_goadedes/oc.m2.d1:ocMA.OdeS9C11.incipit	…
ltx/en_us_goadedes/oc.m2.d1:ocMA.OdeS9C11.melody	@ltx/en_us_goadedes/he.h.m2:heHE.AnarchouGennitoros.name
ltx/en_us_goadedes/oc.m2.d1:ocMA.OdeS9C11.mode	@ltx/en_us_goadedes/miscellanea:misc.Mode2
ltx/en_us_goadedes/oc.m2.d1:ocMA.OdeS9C11.ode	@ltx/en_us_goadedes/miscellanea:misc.Ode9
ltx/en_us_goadedes/oc.m2.d1:ocMA.OdeS9C11.text	
ltx/en_us_goadedes/oc.m2.d1:ocMA.OdeS9C12.incipit	…
ltx/en_us_goadedes/oc.m2.d1:ocMA.OdeS9C12.melody	@ltx/en_us_goadedes/he.h.m2:heHE.AnarchouGennitoros.name
ltx/en_us_goadedes/oc.m2.d1:ocMA.OdeS9C12.mode	@ltx/en_us_goadedes/miscellanea:misc.Mode2
ltx/en_us_goadedes/oc.m2.d1:ocMA.OdeS9C12.ode	@ltx/en_us_goadedes/miscellanea:misc.Ode9
ltx/en_us_goadedes/oc.m2.d1:ocMA.OdeS9C12.text	
ltx/en_us_goadedes/oc.m2.d1:ocMA.OdeS9C1H.greekmelody	@ltx/en_us_goadedes/he.h.m2:heHE.AnarchouGennitoros.greekname
ltx/en_us_goadedes/oc.m2.d1:ocMA.OdeS9C1H.incipit	@ltx/en_us_goadedes/he.h.m2:heHE.AnarchouGennitoros.incipit
ltx/en_us_goadedes/oc.m2.d1:ocMA.OdeS9C1H.melody	@ltx/en_us_goadedes/he.h.m2:heHE.AnarchouGennitoros.melody
ltx/en_us_goadedes/oc.m2.d1:ocMA.OdeS9C1H.mode	@ltx/en_us_goadedes/miscellanea:misc.Mode2
ltx/en_us_goadedes/oc.m2.d1:ocMA.OdeS9C1H.ode	@ltx/en_us_goadedes/miscellanea:misc.Ode9
ltx/en_us_goadedes/oc.m2.d1:ocMA.OdeS9C1H.text	@ltx/en_us_goadedes/he.h.m2:heHE.AnarchouGennitoros.text
ltx/en_us_goadedes/oc.m2.d1:ocMA.OdeS9C1Tr.incipit	…
ltx/en_us_goadedes/oc.m2.d1:ocMA.OdeS9C1Tr.melody	@ltx/en_us_goadedes/he.h.m2:heHE.AnarchouGennitoros.name
ltx/en_us_goadedes/oc.m2.d1:ocMA.OdeS9C1Tr.mode	@ltx/en_us_goadedes/miscellanea:misc.Mode2
ltx/en_us_goadedes/oc.m2.d1:ocMA.OdeS9C1Tr.ode	@ltx/en_us_goadedes/miscellanea:misc.Ode9
ltx/en_us_goadedes/oc.m2.d1:ocMA.OdeS9C1Tr.text	
ltx/en_us_goadedes/oc.m2.d1:ocMA.OdeS9C21.greekmelody	@ltx/en_us_goadedes/he.h.m2:heHE.AnarchouGennitoros.greekname
ltx/en_us_goadedes/oc.m2.d1:ocMA.OdeS9C21.incipit	…
ltx/en_us_goadedes/oc.m2.d1:ocMA.OdeS9C21.melody	@ltx/en_us_goadedes/he.h.m2:heHE.AnarchouGennitoros.name
ltx/en_us_goadedes/oc.m2.d1:ocMA.OdeS9C21.mode	@ltx/en_us_goadedes/miscellanea:misc.Mode2
ltx/en_us_goadedes/oc.m2.d1:ocMA.OdeS9C21.ode	@ltx/en_us_goadedes/miscellanea:misc.Ode9
ltx/en_us_goadedes/oc.m2.d1:ocMA.OdeS9C21.text	
ltx/en_us_goadedes/oc.m2.d1:ocMA.OdeS9C22.incipit	…
ltx/en_us_goadedes/oc.m2.d1:ocMA.OdeS9C22.melody	@ltx/en_us_goadedes/he.h.m2:heHE.AnarchouGennitoros.name
ltx/en_us_goadedes/oc.m2.d1:ocMA.OdeS9C22.mode	@ltx/en_us_goadedes/miscellanea:misc.Mode2
ltx/en_us_goadedes/oc.m2.d1:ocMA.OdeS9C22.ode	@ltx/en_us_goadedes/miscellanea:misc.Ode9
ltx/en_us_goadedes/oc.m2.d1:ocMA.OdeS9C22.text	
ltx/en_us_goadedes/oc.m2.d1:ocMA.OdeS9C31.greekmelody	@ltx/en_us_goadedes/he.h.m2:heHE.AnarchouGennitoros.greekname
ltx/en_us_goadedes/oc.m2.d1:ocMA.OdeS9C31.incipit	…
ltx/en_us_goadedes/oc.m2.d1:ocMA.OdeS9C31.melody	@ltx/en_us_goadedes/he.h.m2:heHE.AnarchouGennitoros.name
ltx/en_us_goadedes/oc.m2.d1:ocMA.OdeS9C31.mode	@ltx/en_us_goadedes/miscellanea:misc.Mode2
ltx/en_us_goadedes/oc.m2.d1:ocMA.OdeS9C31.ode	@ltx/en_us_goadedes/miscellanea:misc.Ode9
ltx/en_us_goadedes/oc.m2.d1:ocMA.OdeS9C31.text	
ltx/en_us_goadedes/oc.m2.d1:ocMA.OdeS9C32.incipit	…
ltx/en_us_goadedes/oc.m2.d1:ocMA.OdeS9C32.melody	@ltx/en_us_goadedes/he.h.m2:heHE.AnarchouGennitoros.name
ltx/en_us_goadedes/oc.m2.d1:ocMA.OdeS9C32.mode	@ltx/en_us_goadedes/miscellanea:misc.Mode2
ltx/en_us_goadedes/oc.m2.d1:ocMA.OdeS9C32.ode	@ltx/en_us_goadedes/miscellanea:misc.Ode9
ltx/en_us_goadedes/oc.m2.d1:ocMA.OdeS9C32.text	
ltx/en_us_goadedes/oc.m2.d1:ocMA.Oikos.incipit	You, O Word of God…
ltx/en_us_goadedes/oc.m2.d1:ocMA.Oikos.mode	@ltx/en_us_goadedes/miscellanea:misc.Mode2
ltx/en_us_goadedes/oc.m2.d1:ocMA.Oikos.text	You, O Word of God, are the light of those in the darkness. You are the resurrection and the life of all humanity. When You destroyed the power of death and smashed the gates of Hades, You raised everyone with yourself. Mortals saw the miracle and marveled, All creation rejoices with You in Your resurrection, O benevolent Lord. So we all now glorify and extol Your condescension, O my Savior, and the world forever sings Your praise.
ltx/en_us_goadedes/oc.m2.d1:ocMO.Kathisma11.incipit	…
ltx/en_us_goadedes/oc.m2.d1:ocMO.Kathisma11.melody	
ltx/en_us_goadedes/oc.m2.d1:ocMO.Kathisma11.mode	@ltx/en_us_goadedes/miscellanea:misc.Mode2
ltx/en_us_goadedes/oc.m2.d1:ocMO.Kathisma11.text	
ltx/en_us_goadedes/oc.m2.d1:ocMO.Kathisma12.incipit	…
ltx/en_us_goadedes/oc.m2.d1:ocMO.Kathisma12.melody	
ltx/en_us_goadedes/oc.m2.d1:ocMO.Kathisma12.mode	@ltx/en_us_goadedes/miscellanea:misc.Mode2
ltx/en_us_goadedes/oc.m2.d1:ocMO.Kathisma12.text	
ltx/en_us_goadedes/oc.m2.d1:ocMO.Kathisma21.greekmelody	@ltx/en_us_goadedes/he.a.m2:heAU.EfsplagchniasYparchousa.greekname
ltx/en_us_goadedes/oc.m2.d1:ocMO.Kathisma21.incipit	We implore You to buoy us…
ltx/en_us_goadedes/oc.m2.d1:ocMO.Kathisma21.melody	@ltx/en_us_goadedes/he.a.m2:heAU.EfsplagchniasYparchousa.name
ltx/en_us_goadedes/oc.m2.d1:ocMO.Kathisma21.mode	@ltx/en_us_goadedes/miscellanea:misc.Mode2
ltx/en_us_goadedes/oc.m2.d1:ocMO.Kathisma21.text	We implore You to buoy us, O Lord, * in the sea of Your compassion and love, and accept us. * Look upon the people glorifying You, * and receive the songs of those who pray to You, * O all-holy Trinity, the one unoriginate * God of all, in whom we hope, * that You will forgive us our iniquities.
ltx/en_us_goadedes/oc.m2.d1:ocMO.Kathisma22.incipit	As the Mother of God, you bore…
ltx/en_us_goadedes/oc.m2.d1:ocMO.Kathisma22.melody	@ltx/en_us_goadedes/he.a.m2:heAU.EfsplagchniasYparchousa.name
ltx/en_us_goadedes/oc.m2.d1:ocMO.Kathisma22.mode	@ltx/en_us_goadedes/miscellanea:misc.Mode2
ltx/en_us_goadedes/oc.m2.d1:ocMO.Kathisma22.text	As the Mother of God, you bore the source * of compassion, good Lady, and you are sympathetic. * We the faithful seek assistance first from you. * You assuage our sorrows and you comfort us. * And now we all pray to you with faith to deliver us * from every evil and woe. * We are blest in having your exceptional help.
ltx/en_us_goadedes/oc.m2.d1:ocMO.Ode11.greekmelody	@ltx/en_us_goadedes/he.h.m2:heHE.EnVythoKatestrose.greekname
ltx/en_us_goadedes/oc.m2.d1:ocMO.Ode11.incipit	…
ltx/en_us_goadedes/oc.m2.d1:ocMO.Ode11.melody	@ltx/en_us_goadedes/he.h.m2:heHE.EnVythoKatestrose.name
ltx/en_us_goadedes/oc.m2.d1:ocMO.Ode11.mode	@ltx/en_us_goadedes/miscellanea:misc.Mode2
ltx/en_us_goadedes/oc.m2.d1:ocMO.Ode11.ode	@ltx/en_us_goadedes/miscellanea:misc.Ode1
ltx/en_us_goadedes/oc.m2.d1:ocMO.Ode11.text	
ltx/en_us_goadedes/oc.m2.d1:ocMO.Ode12.incipit	…
ltx/en_us_goadedes/oc.m2.d1:ocMO.Ode12.melody	@ltx/en_us_goadedes/he.h.m2:heHE.EnVythoKatestrose.name
ltx/en_us_goadedes/oc.m2.d1:ocMO.Ode12.mode	@ltx/en_us_goadedes/miscellanea:misc.Mode2
ltx/en_us_goadedes/oc.m2.d1:ocMO.Ode12.ode	@ltx/en_us_goadedes/miscellanea:misc.Ode1
ltx/en_us_goadedes/oc.m2.d1:ocMO.Ode12.text	
ltx/en_us_goadedes/oc.m2.d1:ocMO.Ode13.incipit	…
ltx/en_us_goadedes/oc.m2.d1:ocMO.Ode13.melody	@ltx/en_us_goadedes/he.h.m2:heHE.EnVythoKatestrose.name
ltx/en_us_goadedes/oc.m2.d1:ocMO.Ode13.mode	@ltx/en_us_goadedes/miscellanea:misc.Mode2
ltx/en_us_goadedes/oc.m2.d1:ocMO.Ode13.ode	@ltx/en_us_goadedes/miscellanea:misc.Ode1
ltx/en_us_goadedes/oc.m2.d1:ocMO.Ode13.text	
ltx/en_us_goadedes/oc.m2.d1:ocMO.Ode1T.incipit	…
ltx/en_us_goadedes/oc.m2.d1:ocMO.Ode1T.melody	@ltx/en_us_goadedes/he.h.m2:heHE.EnVythoKatestrose.name
ltx/en_us_goadedes/oc.m2.d1:ocMO.Ode1T.mode	@ltx/en_us_goadedes/miscellanea:misc.Mode2
ltx/en_us_goadedes/oc.m2.d1:ocMO.Ode1T.ode	@ltx/en_us_goadedes/miscellanea:misc.Ode1
ltx/en_us_goadedes/oc.m2.d1:ocMO.Ode1T.text	
ltx/en_us_goadedes/oc.m2.d1:ocMO.Ode31.greekmelody	@ltx/en_us_goadedes/he.h.m2:heHE.EnPetraMeTisPisteos.greekname
ltx/en_us_goadedes/oc.m2.d1:ocMO.Ode31.incipit	…
ltx/en_us_goadedes/oc.m2.d1:ocMO.Ode31.melody	@ltx/en_us_goadedes/he.h.m2:heHE.EnPetraMeTisPisteos.name
ltx/en_us_goadedes/oc.m2.d1:ocMO.Ode31.mode	@ltx/en_us_goadedes/miscellanea:misc.Mode2
ltx/en_us_goadedes/oc.m2.d1:ocMO.Ode31.ode	@ltx/en_us_goadedes/miscellanea:misc.Ode3
ltx/en_us_goadedes/oc.m2.d1:ocMO.Ode31.text	
ltx/en_us_goadedes/oc.m2.d1:ocMO.Ode32.incipit	…
ltx/en_us_goadedes/oc.m2.d1:ocMO.Ode32.melody	@ltx/en_us_goadedes/he.h.m2:heHE.EnPetraMeTisPisteos.name
ltx/en_us_goadedes/oc.m2.d1:ocMO.Ode32.mode	@ltx/en_us_goadedes/miscellanea:misc.Mode2
ltx/en_us_goadedes/oc.m2.d1:ocMO.Ode32.ode	@ltx/en_us_goadedes/miscellanea:misc.Ode3
ltx/en_us_goadedes/oc.m2.d1:ocMO.Ode32.text	
ltx/en_us_goadedes/oc.m2.d1:ocMO.Ode33.incipit	…
ltx/en_us_goadedes/oc.m2.d1:ocMO.Ode33.melody	@ltx/en_us_goadedes/he.h.m2:heHE.EnPetraMeTisPisteos.name
ltx/en_us_goadedes/oc.m2.d1:ocMO.Ode33.mode	@ltx/en_us_goadedes/miscellanea:misc.Mode2
ltx/en_us_goadedes/oc.m2.d1:ocMO.Ode33.ode	@ltx/en_us_goadedes/miscellanea:misc.Ode3
ltx/en_us_goadedes/oc.m2.d1:ocMO.Ode33.text	
ltx/en_us_goadedes/oc.m2.d1:ocMO.Ode3T.incipit	…
ltx/en_us_goadedes/oc.m2.d1:ocMO.Ode3T.melody	@ltx/en_us_goadedes/he.h.m2:heHE.EnPetraMeTisPisteos.name
ltx/en_us_goadedes/oc.m2.d1:ocMO.Ode3T.mode	@ltx/en_us_goadedes/miscellanea:misc.Mode2
ltx/en_us_goadedes/oc.m2.d1:ocMO.Ode3T.ode	@ltx/en_us_goadedes/miscellanea:misc.Ode3
ltx/en_us_goadedes/oc.m2.d1:ocMO.Ode3T.text	
ltx/en_us_goadedes/oc.m2.d1:ocMO.Ode41.greekmelody	@ltx/en_us_goadedes/he.h.m2:heHE.YmnoSeAkoi.greekname
ltx/en_us_goadedes/oc.m2.d1:ocMO.Ode41.incipit	…
ltx/en_us_goadedes/oc.m2.d1:ocMO.Ode41.melody	@ltx/en_us_goadedes/he.h.m2:heHE.YmnoSeAkoi.name
ltx/en_us_goadedes/oc.m2.d1:ocMO.Ode41.mode	@ltx/en_us_goadedes/miscellanea:misc.Mode2
ltx/en_us_goadedes/oc.m2.d1:ocMO.Ode41.ode	@ltx/en_us_goadedes/miscellanea:misc.Ode4
ltx/en_us_goadedes/oc.m2.d1:ocMO.Ode41.text	
ltx/en_us_goadedes/oc.m2.d1:ocMO.Ode42.incipit	…
ltx/en_us_goadedes/oc.m2.d1:ocMO.Ode42.melody	@ltx/en_us_goadedes/he.h.m2:heHE.YmnoSeAkoi.name
ltx/en_us_goadedes/oc.m2.d1:ocMO.Ode42.mode	@ltx/en_us_goadedes/miscellanea:misc.Mode2
ltx/en_us_goadedes/oc.m2.d1:ocMO.Ode42.ode	@ltx/en_us_goadedes/miscellanea:misc.Ode4
ltx/en_us_goadedes/oc.m2.d1:ocMO.Ode42.text	
ltx/en_us_goadedes/oc.m2.d1:ocMO.Ode43.incipit	…
ltx/en_us_goadedes/oc.m2.d1:ocMO.Ode43.melody	@ltx/en_us_goadedes/he.h.m2:heHE.YmnoSeAkoi.name
ltx/en_us_goadedes/oc.m2.d1:ocMO.Ode43.mode	@ltx/en_us_goadedes/miscellanea:misc.Mode2
ltx/en_us_goadedes/oc.m2.d1:ocMO.Ode43.ode	@ltx/en_us_goadedes/miscellanea:misc.Ode4
ltx/en_us_goadedes/oc.m2.d1:ocMO.Ode43.text	
ltx/en_us_goadedes/oc.m2.d1:ocMO.Ode4T.incipit	…
ltx/en_us_goadedes/oc.m2.d1:ocMO.Ode4T.melody	@ltx/en_us_goadedes/he.h.m2:heHE.YmnoSeAkoi.name
ltx/en_us_goadedes/oc.m2.d1:ocMO.Ode4T.mode	@ltx/en_us_goadedes/miscellanea:misc.Mode2
ltx/en_us_goadedes/oc.m2.d1:ocMO.Ode4T.ode	@ltx/en_us_goadedes/miscellanea:misc.Ode4
ltx/en_us_goadedes/oc.m2.d1:ocMO.Ode4T.text	
ltx/en_us_goadedes/oc.m2.d1:ocMO.Ode51.greekmelody	@ltx/en_us_goadedes/he.h.m2:heHE.OFotismos.greekname
ltx/en_us_goadedes/oc.m2.d1:ocMO.Ode51.incipit	…
ltx/en_us_goadedes/oc.m2.d1:ocMO.Ode51.melody	@ltx/en_us_goadedes/he.h.m2:heHE.OFotismos.name
ltx/en_us_goadedes/oc.m2.d1:ocMO.Ode51.mode	@ltx/en_us_goadedes/miscellanea:misc.Mode2
ltx/en_us_goadedes/oc.m2.d1:ocMO.Ode51.ode	@ltx/en_us_goadedes/miscellanea:misc.Ode5
ltx/en_us_goadedes/oc.m2.d1:ocMO.Ode51.text	
ltx/en_us_goadedes/oc.m2.d1:ocMO.Ode52.incipit	…
ltx/en_us_goadedes/oc.m2.d1:ocMO.Ode52.melody	@ltx/en_us_goadedes/he.h.m2:heHE.OFotismos.name
ltx/en_us_goadedes/oc.m2.d1:ocMO.Ode52.mode	@ltx/en_us_goadedes/miscellanea:misc.Mode2
ltx/en_us_goadedes/oc.m2.d1:ocMO.Ode52.ode	@ltx/en_us_goadedes/miscellanea:misc.Ode5
ltx/en_us_goadedes/oc.m2.d1:ocMO.Ode52.text	
ltx/en_us_goadedes/oc.m2.d1:ocMO.Ode53.incipit	…
ltx/en_us_goadedes/oc.m2.d1:ocMO.Ode53.melody	@ltx/en_us_goadedes/he.h.m2:heHE.OFotismos.name
ltx/en_us_goadedes/oc.m2.d1:ocMO.Ode53.mode	@ltx/en_us_goadedes/miscellanea:misc.Mode2
ltx/en_us_goadedes/oc.m2.d1:ocMO.Ode53.ode	@ltx/en_us_goadedes/miscellanea:misc.Ode5
ltx/en_us_goadedes/oc.m2.d1:ocMO.Ode53.text	
ltx/en_us_goadedes/oc.m2.d1:ocMO.Ode5T.incipit	…
ltx/en_us_goadedes/oc.m2.d1:ocMO.Ode5T.melody	@ltx/en_us_goadedes/he.h.m2:heHE.OFotismos.name
ltx/en_us_goadedes/oc.m2.d1:ocMO.Ode5T.mode	@ltx/en_us_goadedes/miscellanea:misc.Mode2
ltx/en_us_goadedes/oc.m2.d1:ocMO.Ode5T.ode	@ltx/en_us_goadedes/miscellanea:misc.Ode5
ltx/en_us_goadedes/oc.m2.d1:ocMO.Ode5T.text	
ltx/en_us_goadedes/oc.m2.d1:ocMO.Ode61.greekmelody	@ltx/en_us_goadedes/he.h.m2:heHE.EnAvyssoPtaismaton.greekname
ltx/en_us_goadedes/oc.m2.d1:ocMO.Ode61.incipit	…
ltx/en_us_goadedes/oc.m2.d1:ocMO.Ode61.melody	@ltx/en_us_goadedes/he.h.m2:heHE.EnAvyssoPtaismaton.name
ltx/en_us_goadedes/oc.m2.d1:ocMO.Ode61.mode	@ltx/en_us_goadedes/miscellanea:misc.Mode2
ltx/en_us_goadedes/oc.m2.d1:ocMO.Ode61.ode	@ltx/en_us_goadedes/miscellanea:misc.Ode6
ltx/en_us_goadedes/oc.m2.d1:ocMO.Ode61.text	
ltx/en_us_goadedes/oc.m2.d1:ocMO.Ode62.incipit	…
ltx/en_us_goadedes/oc.m2.d1:ocMO.Ode62.melody	@ltx/en_us_goadedes/he.h.m2:heHE.EnAvyssoPtaismaton.name
ltx/en_us_goadedes/oc.m2.d1:ocMO.Ode62.mode	@ltx/en_us_goadedes/miscellanea:misc.Mode2
ltx/en_us_goadedes/oc.m2.d1:ocMO.Ode62.ode	@ltx/en_us_goadedes/miscellanea:misc.Ode6
ltx/en_us_goadedes/oc.m2.d1:ocMO.Ode62.text	
ltx/en_us_goadedes/oc.m2.d1:ocMO.Ode6T.incipit	…
ltx/en_us_goadedes/oc.m2.d1:ocMO.Ode6T.melody	@ltx/en_us_goadedes/he.h.m2:heHE.EnAvyssoPtaismaton.name
ltx/en_us_goadedes/oc.m2.d1:ocMO.Ode6T.mode	@ltx/en_us_goadedes/miscellanea:misc.Mode2
ltx/en_us_goadedes/oc.m2.d1:ocMO.Ode6T.ode	@ltx/en_us_goadedes/miscellanea:misc.Ode6
ltx/en_us_goadedes/oc.m2.d1:ocMO.Ode6T.text	
ltx/en_us_goadedes/oc.m2.d1:ocMO.Ode71.greekmelody	@ltx/en_us_goadedes/he.h.m2:heHE.EikonosChrysis.greekname
ltx/en_us_goadedes/oc.m2.d1:ocMO.Ode71.incipit	…
ltx/en_us_goadedes/oc.m2.d1:ocMO.Ode71.melody	@ltx/en_us_goadedes/he.h.m2:heHE.EikonosChrysis.name
ltx/en_us_goadedes/oc.m2.d1:ocMO.Ode71.mode	@ltx/en_us_goadedes/miscellanea:misc.Mode2
ltx/en_us_goadedes/oc.m2.d1:ocMO.Ode71.ode	@ltx/en_us_goadedes/miscellanea:misc.Ode7
ltx/en_us_goadedes/oc.m2.d1:ocMO.Ode71.text	
ltx/en_us_goadedes/oc.m2.d1:ocMO.Ode72.incipit	…
ltx/en_us_goadedes/oc.m2.d1:ocMO.Ode72.melody	@ltx/en_us_goadedes/he.h.m2:heHE.EikonosChrysis.name
ltx/en_us_goadedes/oc.m2.d1:ocMO.Ode72.mode	@ltx/en_us_goadedes/miscellanea:misc.Mode2
ltx/en_us_goadedes/oc.m2.d1:ocMO.Ode72.ode	@ltx/en_us_goadedes/miscellanea:misc.Ode7
ltx/en_us_goadedes/oc.m2.d1:ocMO.Ode72.text	
ltx/en_us_goadedes/oc.m2.d1:ocMO.Ode7T.incipit	…
ltx/en_us_goadedes/oc.m2.d1:ocMO.Ode7T.melody	@ltx/en_us_goadedes/he.h.m2:heHE.EikonosChrysis.name
ltx/en_us_goadedes/oc.m2.d1:ocMO.Ode7T.mode	@ltx/en_us_goadedes/miscellanea:misc.Mode2
ltx/en_us_goadedes/oc.m2.d1:ocMO.Ode7T.ode	@ltx/en_us_goadedes/miscellanea:misc.Ode7
ltx/en_us_goadedes/oc.m2.d1:ocMO.Ode7T.text	
ltx/en_us_goadedes/oc.m2.d1:ocMO.Ode81.greekmelody	@ltx/en_us_goadedes/he.h.m2:heHE.IndalmatosChrysou.greekname
ltx/en_us_goadedes/oc.m2.d1:ocMO.Ode81.incipit	…
ltx/en_us_goadedes/oc.m2.d1:ocMO.Ode81.melody	@ltx/en_us_goadedes/he.h.m2:heHE.IndalmatosChrysou.name
ltx/en_us_goadedes/oc.m2.d1:ocMO.Ode81.mode	@ltx/en_us_goadedes/miscellanea:misc.Mode2
ltx/en_us_goadedes/oc.m2.d1:ocMO.Ode81.ode	@ltx/en_us_goadedes/miscellanea:misc.Ode8
ltx/en_us_goadedes/oc.m2.d1:ocMO.Ode81.text	
ltx/en_us_goadedes/oc.m2.d1:ocMO.Ode82.incipit	…
ltx/en_us_goadedes/oc.m2.d1:ocMO.Ode82.melody	@ltx/en_us_goadedes/he.h.m2:heHE.IndalmatosChrysou.name
ltx/en_us_goadedes/oc.m2.d1:ocMO.Ode82.mode	@ltx/en_us_goadedes/miscellanea:misc.Mode2
ltx/en_us_goadedes/oc.m2.d1:ocMO.Ode82.ode	@ltx/en_us_goadedes/miscellanea:misc.Ode8
ltx/en_us_goadedes/oc.m2.d1:ocMO.Ode82.text	
ltx/en_us_goadedes/oc.m2.d1:ocMO.Ode83.incipit	…
ltx/en_us_goadedes/oc.m2.d1:ocMO.Ode83.melody	@ltx/en_us_goadedes/he.h.m2:heHE.IndalmatosChrysou.name
ltx/en_us_goadedes/oc.m2.d1:ocMO.Ode83.mode	@ltx/en_us_goadedes/miscellanea:misc.Mode2
ltx/en_us_goadedes/oc.m2.d1:ocMO.Ode83.ode	@ltx/en_us_goadedes/miscellanea:misc.Ode8
ltx/en_us_goadedes/oc.m2.d1:ocMO.Ode83.text	
ltx/en_us_goadedes/oc.m2.d1:ocMO.Ode91.greekmelody	@ltx/en_us_goadedes/he.h.m2:heHE.ITonProIliouFostira.greekname
ltx/en_us_goadedes/oc.m2.d1:ocMO.Ode91.incipit	…
ltx/en_us_goadedes/oc.m2.d1:ocMO.Ode91.melody	@ltx/en_us_goadedes/he.h.m2:heHE.ITonProIliouFostira.name
ltx/en_us_goadedes/oc.m2.d1:ocMO.Ode91.mode	@ltx/en_us_goadedes/miscellanea:misc.Mode2
ltx/en_us_goadedes/oc.m2.d1:ocMO.Ode91.ode	@ltx/en_us_goadedes/miscellanea:misc.Ode9
ltx/en_us_goadedes/oc.m2.d1:ocMO.Ode91.text	
ltx/en_us_goadedes/oc.m2.d1:ocMO.Ode92.incipit	…
ltx/en_us_goadedes/oc.m2.d1:ocMO.Ode92.melody	@ltx/en_us_goadedes/he.h.m2:heHE.ITonProIliouFostira.name
ltx/en_us_goadedes/oc.m2.d1:ocMO.Ode92.mode	@ltx/en_us_goadedes/miscellanea:misc.Mode2
ltx/en_us_goadedes/oc.m2.d1:ocMO.Ode92.ode	@ltx/en_us_goadedes/miscellanea:misc.Ode9
ltx/en_us_goadedes/oc.m2.d1:ocMO.Ode92.text	
ltx/en_us_goadedes/oc.m2.d1:ocMO.Ode93.incipit	…
ltx/en_us_goadedes/oc.m2.d1:ocMO.Ode93.melody	@ltx/en_us_goadedes/he.h.m2:heHE.ITonProIliouFostira.name
ltx/en_us_goadedes/oc.m2.d1:ocMO.Ode93.mode	@ltx/en_us_goadedes/miscellanea:misc.Mode2
ltx/en_us_goadedes/oc.m2.d1:ocMO.Ode93.ode	@ltx/en_us_goadedes/miscellanea:misc.Ode9
ltx/en_us_goadedes/oc.m2.d1:ocMO.Ode93.text	
ltx/en_us_goadedes/oc.m2.d1:ocMO.Ode9T.incipit	…
ltx/en_us_goadedes/oc.m2.d1:ocMO.Ode9T.melody	@ltx/en_us_goadedes/he.h.m2:heHE.ITonProIliouFostira.name
ltx/en_us_goadedes/oc.m2.d1:ocMO.Ode9T.mode	@ltx/en_us_goadedes/miscellanea:misc.Mode2
ltx/en_us_goadedes/oc.m2.d1:ocMO.Ode9T.ode	@ltx/en_us_goadedes/miscellanea:misc.Ode9
ltx/en_us_goadedes/oc.m2.d1:ocMO.Ode9T.text	
ltx/en_us_goadedes/oc.m2.d1:ocMO.acrostic.notice	
ltx/en_us_goadedes/oc.m2.d1:ocMO.acrostic.text	
ltx/en_us_goadedes/oc.m2.d1:ocMO.poet	@ltx/en_us_goadedes/poets:po.MitrofanousSmirnis
ltx/en_us_goadedes/oc.m2.d1:ocMO.title	Canon for the Trinity
ltx/en_us_goadedes/oc.m2.d1:ocSV.AposDogmatic.incipit	…
ltx/en_us_goadedes/oc.m2.d1:ocSV.AposDogmatic.melody	
ltx/en_us_goadedes/oc.m2.d1:ocSV.AposDogmatic.mode	@ltx/en_us_goadedes/miscellanea:misc.Mode2
ltx/en_us_goadedes/oc.m2.d1:ocSV.AposDogmatic.text	
ltx/en_us_goadedes/oc.m2.d1:ocSV.Aposticha1.incipit	…
ltx/en_us_goadedes/oc.m2.d1:ocSV.Aposticha1.melody	@ltx/en_us_goadedes/he.a.m2:heAU.OteEkTouXylou.name
ltx/en_us_goadedes/oc.m2.d1:ocSV.Aposticha1.mode	@ltx/en_us_goadedes/miscellanea:misc.Mode2
ltx/en_us_goadedes/oc.m2.d1:ocSV.Aposticha1.text	
ltx/en_us_goadedes/oc.m2.d1:ocSV.Aposticha2.incipit	…
ltx/en_us_goadedes/oc.m2.d1:ocSV.Aposticha2.melody	@ltx/en_us_goadedes/he.a.m2:heAU.OteEkTouXylou.name
ltx/en_us_goadedes/oc.m2.d1:ocSV.Aposticha2.mode	@ltx/en_us_goadedes/miscellanea:misc.Mode2
ltx/en_us_goadedes/oc.m2.d1:ocSV.Aposticha2.text	
ltx/en_us_goadedes/oc.m2.d1:ocSV.Aposticha3.incipit	…
ltx/en_us_goadedes/oc.m2.d1:ocSV.Aposticha3.melody	@ltx/en_us_goadedes/he.a.m2:heAU.OteEkTouXylou.name
ltx/en_us_goadedes/oc.m2.d1:ocSV.Aposticha3.mode	@ltx/en_us_goadedes/miscellanea:misc.Mode2
ltx/en_us_goadedes/oc.m2.d1:ocSV.Aposticha3.text	
ltx/en_us_goadedes/oc.m2.d1:ocSV.Dogmatic.incipit	What a grand mystery…
ltx/en_us_goadedes/oc.m2.d1:ocSV.Dogmatic.melody	
ltx/en_us_goadedes/oc.m2.d1:ocSV.Dogmatic.mode	@ltx/en_us_goadedes/miscellanea:misc.Mode2
ltx/en_us_goadedes/oc.m2.d1:ocSV.Dogmatic.text	What a grand mystery! I see the miracles, I proclaim the divinity, and I do not deny the humanity. For Emmanuel opened the gates of His mother’s organs, and as benevolent God He did not rupture the seals of her virginity. He came out of the womb as He had through hearing entered it. He was incarnate as He was conceived. Impassibly He entered, ineffably He came out, even as the Prophet said of old, “This gate shall remain shut; it shall not be opened, and no one shall enter by it,” except the Lord, the God of Israel alone, who has the great mercy.
ltx/en_us_goadedes/oc.m2.d1:ocVE.ApolTheotokionVM.incipit	All surpassing every thought…
ltx/en_us_goadedes/oc.m2.d1:ocVE.ApolTheotokionVM.melody	
ltx/en_us_goadedes/oc.m2.d1:ocVE.ApolTheotokionVM.mode	@ltx/en_us_goadedes/miscellanea:misc.Mode2
ltx/en_us_goadedes/oc.m2.d1:ocVE.ApolTheotokionVM.text	All surpassing every thought, all surpassing glorious, O Theotokos, are your mysteries. With your chastity sealed and your virginity preserved, still you are a mother in truth, for to the true God you gave birth. We pray you fervently entreat Him to save our souls.
ltx/en_us_goadedes/oc.m2.d1:ocVE.Apolytikion.incipit	When You descended…
ltx/en_us_goadedes/oc.m2.d1:ocVE.Apolytikion.melody	
ltx/en_us_goadedes/oc.m2.d1:ocVE.Apolytikion.mode	@ltx/en_us_goadedes/miscellanea:misc.Mode2
ltx/en_us_goadedes/oc.m2.d1:ocVE.Apolytikion.text	When You descended unto Death, O Lord, You who are immortal Life put Hades to death, by the lightning of Your divinity. And when You raised the dead from the netherworld, all the hosts of heaven sang aloud to You, “O Christ God, Giver of life, glory to You!”
ltx/en_us_goadedes/oc.m2.d1:ocVE.AposTheotokion.incipit	Oh, miracle of all miracles…
ltx/en_us_goadedes/oc.m2.d1:ocVE.AposTheotokion.melody	
ltx/en_us_goadedes/oc.m2.d1:ocVE.AposTheotokion.mode	@ltx/en_us_goadedes/miscellanea:misc.Mode2
ltx/en_us_goadedes/oc.m2.d1:ocVE.AposTheotokion.text	Oh, miracle of all miracles, which was unheard of before! No one else has had a mother who conceived without a man and embraced Him who surrounds all creation, only He, the Counsel of God, who was born of you, O all-pure Virgin, and whom you held in your lap. As you thus have maternal access to Him, we pray you never cease imploring Him for us who honor you, to be merciful to us and to save our souls.
ltx/en_us_goadedes/oc.m2.d1:ocVE.Aposticha1.incipit	Your resurrection has illumined…
ltx/en_us_goadedes/oc.m2.d1:ocVE.Aposticha1.melody	
ltx/en_us_goadedes/oc.m2.d1:ocVE.Aposticha1.mode	@ltx/en_us_goadedes/miscellanea:misc.Mode2
ltx/en_us_goadedes/oc.m2.d1:ocVE.Aposticha1.text	Your resurrection has illumined the entire earth, O Savior Christ; and from the dead You summoned back Your creature. O almighty Lord, glory to You!
ltx/en_us_goadedes/oc.m2.d1:ocVE.Aposticha2.incipit	O Savior, by a tree…
ltx/en_us_goadedes/oc.m2.d1:ocVE.Aposticha2.melody	
ltx/en_us_goadedes/oc.m2.d1:ocVE.Aposticha2.mode	@ltx/en_us_goadedes/miscellanea:misc.Mode2
ltx/en_us_goadedes/oc.m2.d1:ocVE.Aposticha2.text	O Savior, by a tree You lifted the curse of the tree; by Your burial You put to death the power of death; and by Your resurrection You illumined our human race. We therefore sing to You: O Giver of life, Christ our God, glory to You!
ltx/en_us_goadedes/oc.m2.d1:ocVE.Aposticha3.incipit	When You, O Christ…
ltx/en_us_goadedes/oc.m2.d1:ocVE.Aposticha3.melody	
ltx/en_us_goadedes/oc.m2.d1:ocVE.Aposticha3.mode	@ltx/en_us_goadedes/miscellanea:misc.Mode2
ltx/en_us_goadedes/oc.m2.d1:ocVE.Aposticha3.text	When You, O Christ, were publicly nailed to the cross, creation’s beauty was altered. The Roman soldiers demonstrated inhumanity and pierced Your side with a spear. The Jewish leaders underestimated Your authority and asked that Your sepulcher be sealed. In Your tender mercy You accepted burial, O Lord, and arose within three days. Glory to You!
ltx/en_us_goadedes/oc.m2.d1:ocVE.Aposticha4.incipit	O Christ, as the Giver of Life…
ltx/en_us_goadedes/oc.m2.d1:ocVE.Aposticha4.melody	
ltx/en_us_goadedes/oc.m2.d1:ocVE.Aposticha4.mode	@ltx/en_us_goadedes/miscellanea:misc.Mode2
ltx/en_us_goadedes/oc.m2.d1:ocVE.Aposticha4.text	O Christ, as the Giver of Life, for us mortals, You willingly underwent the Passion. As the Mighty One, You went down to Hades; and there You found those who awaited Your arrival, and You rescued them as from a stronghold. You have granted them to live in Paradise instead of Hades. And now, as we glorify Your resurrection on the third day, we pray You grant us forgiveness of sins and the great mercy.
ltx/en_us_goadedes/oc.m2.d1:ocVE.MM.LIHC1.text	@ltx/en_us_goadedes/properties:media.key
ltx/en_us_goadedes/oc.m2.d1:ocVE.MM.LIHC2.text	@ltx/en_us_goadedes/properties:media.key
ltx/en_us_goadedes/oc.m2.d1:ocVE.MM.Stichologia.text	@ltx/en_us_goadedes/properties:media.key
ltx/en_us_goadedes/oc.m2.d1:ocVE.SticTheotokion.incipit	When grace came…
ltx/en_us_goadedes/oc.m2.d1:ocVE.SticTheotokion.melody	
ltx/en_us_goadedes/oc.m2.d1:ocVE.SticTheotokion.mode	@ltx/en_us_goadedes/miscellanea:misc.Mode2
ltx/en_us_goadedes/oc.m2.d1:ocVE.SticTheotokion.text	When grace came, the shadow of the Law passed away. The bush of old was not consumed, even as it was burning; likewise you, a virgin, gave birth and still remained a virgin. Instead of the pillar of fire, the Sun of righteousness has risen. Instead of Moses, there is Christ, the salvation of our souls.
ltx/en_us_goadedes/oc.m2.d1:ocVE.Stichera1.incipit	He who was begotten…
ltx/en_us_goadedes/oc.m2.d1:ocVE.Stichera1.melody	
ltx/en_us_goadedes/oc.m2.d1:ocVE.Stichera1.mode	@ltx/en_us_goadedes/miscellanea:misc.Mode2
ltx/en_us_goadedes/oc.m2.d1:ocVE.Stichera1.text	He who was begotten of the Father before all ages, God the Logos, became incarnate of the Virgin Mary. Come let us worship Him. He endured the Cross and submitted to burial, as He so willed. And then He rose from the dead, and He saved me and all humanity who had gone astray.
ltx/en_us_goadedes/oc.m2.d1:ocVE.Stichera2.incipit	Christ our Savior nailed…
ltx/en_us_goadedes/oc.m2.d1:ocVE.Stichera2.melody	
ltx/en_us_goadedes/oc.m2.d1:ocVE.Stichera2.mode	@ltx/en_us_goadedes/miscellanea:misc.Mode2
ltx/en_us_goadedes/oc.m2.d1:ocVE.Stichera2.text	Christ our Savior nailed to the Cross the bond which stood against us, and thus He canceled it; and He destroyed the power of death. We worship His rising on the third day.
ltx/en_us_goadedes/oc.m2.d1:ocVE.Stichera3.incipit	Let us join the Archangels…
ltx/en_us_goadedes/oc.m2.d1:ocVE.Stichera3.melody	
ltx/en_us_goadedes/oc.m2.d1:ocVE.Stichera3.mode	@ltx/en_us_goadedes/miscellanea:misc.Mode2
ltx/en_us_goadedes/oc.m2.d1:ocVE.Stichera3.text	Let us join the Archangels and extol the Resurrection of Christ. He is the Redeemer and Savior of our souls; and He will come again, in awesome glory and mighty power, to judge the world which He created.
ltx/en_us_goadedes/oc.m2.d1:ocVE.Stichera4.incipit	After You were crucified…
ltx/en_us_goadedes/oc.m2.d1:ocVE.Stichera4.melody	
ltx/en_us_goadedes/oc.m2.d1:ocVE.Stichera4.mode	@ltx/en_us_goadedes/miscellanea:misc.Mode2
ltx/en_us_goadedes/oc.m2.d1:ocVE.Stichera4.text	After You were crucified and buried, an Angel declared to the women that You are the Master, and he said to them, “Come, see the place where the Lord lay. He has risen, as He said; for He is almighty.” We therefore worship You, the only immortal One. O Christ the Giver of Life, have mercy on us.
ltx/en_us_goadedes/oc.m2.d1:ocVE.Stichera5.incipit	By Your crucifixion…
ltx/en_us_goadedes/oc.m2.d1:ocVE.Stichera5.melody	
ltx/en_us_goadedes/oc.m2.d1:ocVE.Stichera5.mode	@ltx/en_us_goadedes/miscellanea:misc.Mode2
ltx/en_us_goadedes/oc.m2.d1:ocVE.Stichera5.text	By Your crucifixion, You destroyed the curse of the tree; by Your burial, You killed the power of death; and by Your resurrection, You illumined the human race. Therefore we sing to You: O Benefactor, Christ our God, glory to You!
ltx/en_us_goadedes/oc.m2.d1:ocVE.Stichera6.incipit	The gates of death…
ltx/en_us_goadedes/oc.m2.d1:ocVE.Stichera6.melody	
ltx/en_us_goadedes/oc.m2.d1:ocVE.Stichera6.mode	@ltx/en_us_goadedes/miscellanea:misc.Mode2
ltx/en_us_goadedes/oc.m2.d1:ocVE.Stichera6.text	The gates of death opened to You for fear, and the doorkeepers of Hades quaked when they saw You. For You crushed the gates of bronze and You shattered the bars of iron, and You brought us out of darkness and the shadow of death, and You broke our chains to pieces.
ltx/en_us_goadedes/oc.m2.d1:ocVE.Stichera7.incipit	Let us open our mouths…
ltx/en_us_goadedes/oc.m2.d1:ocVE.Stichera7.melody	
ltx/en_us_goadedes/oc.m2.d1:ocVE.Stichera7.mode	@ltx/en_us_goadedes/miscellanea:misc.Mode2
ltx/en_us_goadedes/oc.m2.d1:ocVE.Stichera7.text	Let us open our mouths and sing extolling our salvation. Come all in the house of the Lord, and let us pray to Him and say, “You were crucified on a tree, and You rose from the dead, and You always are in the bosom of the Father. We implore You to forgive our sins.”
