ltx/en_us_goadedes/pe.d108:alt1.peDA.commemoration.full	
ltx/en_us_goadedes/pe.d108:alt1.peDA.commemoration.short	
ltx/en_us_goadedes/pe.d108:alt1.peMA.AposGlory.incipit	@ltx/en_us_goadedes/pe.d106:peVE.AposGlory.incipit
ltx/en_us_goadedes/pe.d108:alt1.peMA.AposGlory.melody	@ltx/en_us_goadedes/pe.d106:peVE.AposGlory.melody
ltx/en_us_goadedes/pe.d108:alt1.peMA.AposGlory.mode	@ltx/en_us_goadedes/pe.d106:peVE.AposGlory.mode
ltx/en_us_goadedes/pe.d108:alt1.peMA.AposGlory.text	@ltx/en_us_goadedes/pe.d106:peVE.AposGlory.text
ltx/en_us_goadedes/pe.d108:alt1.peMA.Kathisma11.incipit	@ltx/en_us_goadedes/pe.d106:peMA.Kathisma12.incipit
ltx/en_us_goadedes/pe.d108:alt1.peMA.Kathisma11.melody	
ltx/en_us_goadedes/pe.d108:alt1.peMA.Kathisma11.mode	@ltx/en_us_goadedes/pe.d106:peMA.Kathisma12.mode
ltx/en_us_goadedes/pe.d108:alt1.peMA.Kathisma11.text	@ltx/en_us_goadedes/pe.d106:peMA.Kathisma12.text
ltx/en_us_goadedes/pe.d108:alt1.peMA.Kathisma12.incipit	@ltx/en_us_goadedes/oc.m5.d3:ocMA.Kathisma11.incipit
ltx/en_us_goadedes/pe.d108:alt1.peMA.Kathisma12.melody	
ltx/en_us_goadedes/pe.d108:alt1.peMA.Kathisma12.mode	@ltx/en_us_goadedes/oc.m5.d3:ocMA.Kathisma11.mode
ltx/en_us_goadedes/pe.d108:alt1.peMA.Kathisma12.text	@ltx/en_us_goadedes/oc.m5.d3:ocMA.Kathisma11.text
ltx/en_us_goadedes/pe.d108:alt1.peMA.Kathisma13.incipit	@ltx/en_us_goadedes/oc.m5.d2:ocMA.Kathisma32.incipit
ltx/en_us_goadedes/pe.d108:alt1.peMA.Kathisma13.melody	
ltx/en_us_goadedes/pe.d108:alt1.peMA.Kathisma13.mode	@ltx/en_us_goadedes/oc.m5.d2:ocMA.Kathisma32.mode
ltx/en_us_goadedes/pe.d108:alt1.peMA.Kathisma13.text	@ltx/en_us_goadedes/oc.m5.d2:ocMA.Kathisma32.text
ltx/en_us_goadedes/pe.d108:alt1.peMA.Kathisma1T.incipit	@ltx/en_us_goadedes/oc.m5.d3:ocMA.Kathisma33.incipit
ltx/en_us_goadedes/pe.d108:alt1.peMA.Kathisma1T.melody	
ltx/en_us_goadedes/pe.d108:alt1.peMA.Kathisma1T.mode	@ltx/en_us_goadedes/oc.m5.d3:ocMA.Kathisma33.mode
ltx/en_us_goadedes/pe.d108:alt1.peMA.Kathisma1T.text	@ltx/en_us_goadedes/oc.m5.d3:ocMA.Kathisma33.text
ltx/en_us_goadedes/pe.d108:alt1.peMA.Kathisma21.greekmelody	@ltx/en_us_goadedes/he.a.m5:heAU.TonSynanarchonLogon.greekname
ltx/en_us_goadedes/pe.d108:alt1.peMA.Kathisma21.incipit	…
ltx/en_us_goadedes/pe.d108:alt1.peMA.Kathisma21.melody	@ltx/en_us_goadedes/he.a.m5:heAU.TonSynanarchonLogon.name
ltx/en_us_goadedes/pe.d108:alt1.peMA.Kathisma21.mode	@ltx/en_us_goadedes/miscellanea:misc.Mode5
ltx/en_us_goadedes/pe.d108:alt1.peMA.Kathisma21.text	
ltx/en_us_goadedes/pe.d108:alt1.peMA.Lauds1.incipit	@ltx/en_us_goadedes/oc.m5.d1:ocMA.Lauds2.incipit
ltx/en_us_goadedes/pe.d108:alt1.peMA.Lauds1.melody	
ltx/en_us_goadedes/pe.d108:alt1.peMA.Lauds1.mode	@ltx/en_us_goadedes/oc.m5.d1:ocMA.Lauds2.mode
ltx/en_us_goadedes/pe.d108:alt1.peMA.Lauds1.text	@ltx/en_us_goadedes/oc.m5.d1:ocMA.Lauds2.text
ltx/en_us_goadedes/pe.d108:alt1.peMA.Lauds2.incipit	@ltx/en_us_goadedes/oc.m5.d3:ocMA.Aposticha2.incipit
ltx/en_us_goadedes/pe.d108:alt1.peMA.Lauds2.melody	
ltx/en_us_goadedes/pe.d108:alt1.peMA.Lauds2.mode	@ltx/en_us_goadedes/oc.m5.d3:ocMA.Aposticha2.mode
ltx/en_us_goadedes/pe.d108:alt1.peMA.Lauds2.text	@ltx/en_us_goadedes/oc.m5.d3:ocMA.Aposticha2.text
ltx/en_us_goadedes/pe.d108:alt1.peMA.Lauds3.incipit	@ltx/en_us_goadedes/oc.m5.d4:ocMA.Aposticha3.incipit
ltx/en_us_goadedes/pe.d108:alt1.peMA.Lauds3.melody	
ltx/en_us_goadedes/pe.d108:alt1.peMA.Lauds3.mode	@ltx/en_us_goadedes/oc.m5.d4:ocMA.Aposticha3.mode
ltx/en_us_goadedes/pe.d108:alt1.peMA.Lauds3.text	@ltx/en_us_goadedes/oc.m5.d4:ocMA.Aposticha3.text
ltx/en_us_goadedes/pe.d108:alt1.peMA.LaudsGlory.incipit	@ltx/en_us_goadedes/pe.d106:peMA.LaudsGlory.incipit
ltx/en_us_goadedes/pe.d108:alt1.peMA.LaudsGlory.melody	@ltx/en_us_goadedes/pe.d106:peMA.LaudsGlory.melody
ltx/en_us_goadedes/pe.d108:alt1.peMA.LaudsGlory.mode	@ltx/en_us_goadedes/pe.d106:peMA.LaudsGlory.mode
ltx/en_us_goadedes/pe.d108:alt1.peMA.LaudsGlory.text	@ltx/en_us_goadedes/pe.d106:peMA.LaudsGlory.text
ltx/en_us_goadedes/pe.d108:alt1.peVE.AposGlory.incipit	@ltx/en_us_goadedes/pe.d106:peMA.Lauds8.incipit
ltx/en_us_goadedes/pe.d108:alt1.peVE.AposGlory.melody	@ltx/en_us_goadedes/pe.d106:peMA.Lauds8.melody
ltx/en_us_goadedes/pe.d108:alt1.peVE.AposGlory.mode	@ltx/en_us_goadedes/pe.d106:peMA.Lauds8.mode
ltx/en_us_goadedes/pe.d108:alt1.peVE.AposGlory.text	@ltx/en_us_goadedes/pe.d106:peMA.Lauds8.text
ltx/en_us_goadedes/pe.d108:alt1.peVE.Aposticha1.incipit	@ltx/en_us_goadedes/oc.m5.d1:ocVE.Stichera2.incipit
ltx/en_us_goadedes/pe.d108:alt1.peVE.Aposticha1.melody	
ltx/en_us_goadedes/pe.d108:alt1.peVE.Aposticha1.mode	@ltx/en_us_goadedes/oc.m5.d1:ocVE.Stichera2.mode
ltx/en_us_goadedes/pe.d108:alt1.peVE.Aposticha1.text	@ltx/en_us_goadedes/oc.m5.d1:ocVE.Stichera2.text
ltx/en_us_goadedes/pe.d108:alt1.peVE.Aposticha2.incipit	@ltx/en_us_goadedes/oc.m5.d3:ocVE.Aposticha2.incipit
ltx/en_us_goadedes/pe.d108:alt1.peVE.Aposticha2.melody	
ltx/en_us_goadedes/pe.d108:alt1.peVE.Aposticha2.mode	@ltx/en_us_goadedes/oc.m5.d3:ocVE.Aposticha2.mode
ltx/en_us_goadedes/pe.d108:alt1.peVE.Aposticha2.text	@ltx/en_us_goadedes/oc.m5.d3:ocVE.Aposticha2.text
ltx/en_us_goadedes/pe.d108:alt1.peVE.Aposticha3.incipit	@ltx/en_us_goadedes/oc.m5.d3:ocVE.Aposticha3.incipit
ltx/en_us_goadedes/pe.d108:alt1.peVE.Aposticha3.melody	
ltx/en_us_goadedes/pe.d108:alt1.peVE.Aposticha3.mode	@ltx/en_us_goadedes/oc.m5.d3:ocVE.Aposticha3.mode
ltx/en_us_goadedes/pe.d108:alt1.peVE.Aposticha3.text	@ltx/en_us_goadedes/oc.m5.d3:ocVE.Aposticha3.text
ltx/en_us_goadedes/pe.d108:alt1.peVE.SticGlory.incipit	@ltx/en_us_goadedes/pe.d106:peVE.AposGlory.incipit
ltx/en_us_goadedes/pe.d108:alt1.peVE.SticGlory.melody	@ltx/en_us_goadedes/pe.d106:peVE.AposGlory.melody
ltx/en_us_goadedes/pe.d108:alt1.peVE.SticGlory.mode	@ltx/en_us_goadedes/pe.d106:peVE.AposGlory.mode
ltx/en_us_goadedes/pe.d108:alt1.peVE.SticGlory.text	@ltx/en_us_goadedes/pe.d106:peVE.AposGlory.text
ltx/en_us_goadedes/pe.d108:alt1.peVE.Stichera01.greekmelody	@ltx/en_us_goadedes/he.a.m5:heAU.ChairoisAskitikon.greekname
ltx/en_us_goadedes/pe.d108:alt1.peVE.Stichera01.incipit	…
ltx/en_us_goadedes/pe.d108:alt1.peVE.Stichera01.melody	@ltx/en_us_goadedes/he.a.m5:heAU.ChairoisAskitikon.name
ltx/en_us_goadedes/pe.d108:alt1.peVE.Stichera01.mode	@ltx/en_us_goadedes/miscellanea:misc.Mode5
ltx/en_us_goadedes/pe.d108:alt1.peVE.Stichera01.text	
ltx/en_us_goadedes/pe.d108:alt1.peVE.Stichera02.incipit	…
ltx/en_us_goadedes/pe.d108:alt1.peVE.Stichera02.melody	@ltx/en_us_goadedes/he.a.m5:heAU.ChairoisAskitikon.name
ltx/en_us_goadedes/pe.d108:alt1.peVE.Stichera02.mode	@ltx/en_us_goadedes/miscellanea:misc.Mode5
ltx/en_us_goadedes/pe.d108:alt1.peVE.Stichera02.text	
ltx/en_us_goadedes/pe.d108:alt1.peVE.Stichera03.incipit	…
ltx/en_us_goadedes/pe.d108:alt1.peVE.Stichera03.melody	@ltx/en_us_goadedes/he.a.m5:heAU.ChairoisAskitikon.name
ltx/en_us_goadedes/pe.d108:alt1.peVE.Stichera03.mode	@ltx/en_us_goadedes/miscellanea:misc.Mode5
ltx/en_us_goadedes/pe.d108:alt1.peVE.Stichera03.text	
ltx/en_us_goadedes/pe.d108:peDA.commemoration.full	
ltx/en_us_goadedes/pe.d108:peDA.commemoration.short	
ltx/en_us_goadedes/pe.d108:peDA.dismissal	@ltx/en_us_goadedes/dismissals:dis00.resurrection
ltx/en_us_goadedes/pe.d108:peDA.insert1	
ltx/en_us_goadedes/pe.d108:peDA.insert2	
ltx/en_us_goadedes/pe.d108:peDA.note	
ltx/en_us_goadedes/pe.d108:peHO.commemorations	
ltx/en_us_goadedes/pe.d108:peHO.daytitle	
ltx/en_us_goadedes/pe.d108:peHO.description1	
ltx/en_us_goadedes/pe.d108:peHO.description2	
ltx/en_us_goadedes/pe.d108:peHO.note1	
ltx/en_us_goadedes/pe.d108:peHO.note2	
ltx/en_us_goadedes/pe.d108:peMA.AposGlory.incipit	@ltx/en_us_goadedes/pe.d106:peMA.Lauds8.incipit
ltx/en_us_goadedes/pe.d108:peMA.AposGlory.melody	@ltx/en_us_goadedes/pe.d106:peMA.Lauds8.melody
ltx/en_us_goadedes/pe.d108:peMA.AposGlory.mode	@ltx/en_us_goadedes/pe.d106:peMA.Lauds8.mode
ltx/en_us_goadedes/pe.d108:peMA.AposGlory.text	@ltx/en_us_goadedes/pe.d106:peMA.Lauds8.text
ltx/en_us_goadedes/pe.d108:peMA.Aposticha1.greekmelody	@ltx/en_us_goadedes/he.a.m5:heAU.OsiePater.greekname
ltx/en_us_goadedes/pe.d108:peMA.Aposticha1.incipit	…
ltx/en_us_goadedes/pe.d108:peMA.Aposticha1.melody	@ltx/en_us_goadedes/he.a.m5:heAU.OsiePater.name
ltx/en_us_goadedes/pe.d108:peMA.Aposticha1.mode	@ltx/en_us_goadedes/miscellanea:misc.Mode5
ltx/en_us_goadedes/pe.d108:peMA.Aposticha1.text	
ltx/en_us_goadedes/pe.d108:peMA.Aposticha2.incipit	…
ltx/en_us_goadedes/pe.d108:peMA.Aposticha2.melody	@ltx/en_us_goadedes/he.a.m5:heAU.OsiePater.name
ltx/en_us_goadedes/pe.d108:peMA.Aposticha2.mode	@ltx/en_us_goadedes/miscellanea:misc.Mode5
ltx/en_us_goadedes/pe.d108:peMA.Aposticha2.text	
ltx/en_us_goadedes/pe.d108:peMA.Aposticha3.incipit	…
ltx/en_us_goadedes/pe.d108:peMA.Aposticha3.melody	@ltx/en_us_goadedes/he.a.m5:heAU.OsiePater.name
ltx/en_us_goadedes/pe.d108:peMA.Aposticha3.mode	@ltx/en_us_goadedes/miscellanea:misc.Mode5
ltx/en_us_goadedes/pe.d108:peMA.Aposticha3.text	
ltx/en_us_goadedes/pe.d108:peMA.Kathisma11.greekmelody	@ltx/en_us_goadedes/pe.d106:peMA.Kathisma11.greekmelody
ltx/en_us_goadedes/pe.d108:peMA.Kathisma11.incipit	@ltx/en_us_goadedes/pe.d106:peMA.Kathisma11.incipit
ltx/en_us_goadedes/pe.d108:peMA.Kathisma11.melody	@ltx/en_us_goadedes/pe.d106:peMA.Kathisma11.melody
ltx/en_us_goadedes/pe.d108:peMA.Kathisma11.mode	@ltx/en_us_goadedes/pe.d106:peMA.Kathisma11.mode
ltx/en_us_goadedes/pe.d108:peMA.Kathisma11.text	@ltx/en_us_goadedes/pe.d106:peMA.Kathisma11.text
ltx/en_us_goadedes/pe.d108:peMA.Kathisma12.incipit	@ltx/en_us_goadedes/pe.d106:peMA.Kathisma12.incipit
ltx/en_us_goadedes/pe.d108:peMA.Kathisma12.melody	
ltx/en_us_goadedes/pe.d108:peMA.Kathisma12.mode	@ltx/en_us_goadedes/pe.d106:peMA.Kathisma12.mode
ltx/en_us_goadedes/pe.d108:peMA.Kathisma12.text	@ltx/en_us_goadedes/pe.d106:peMA.Kathisma12.text
ltx/en_us_goadedes/pe.d108:peMA.Kathisma1T.incipit	@ltx/en_us_goadedes/pe.d106:peMA.Kathisma13.incipit
ltx/en_us_goadedes/pe.d108:peMA.Kathisma1T.melody	@ltx/en_us_goadedes/pe.d106:peMA.Kathisma13.melody
ltx/en_us_goadedes/pe.d108:peMA.Kathisma1T.mode	@ltx/en_us_goadedes/pe.d106:peMA.Kathisma13.mode
ltx/en_us_goadedes/pe.d108:peMA.Kathisma1T.text	@ltx/en_us_goadedes/pe.d106:peMA.Kathisma13.text
ltx/en_us_goadedes/pe.d108:peMA.Kathisma21.greekmelody	@ltx/en_us_goadedes/he.a.m5:heAU.TonSynanarchonLogon.greekname
ltx/en_us_goadedes/pe.d108:peMA.Kathisma21.incipit	…
ltx/en_us_goadedes/pe.d108:peMA.Kathisma21.melody	@ltx/en_us_goadedes/he.a.m5:heAU.TonSynanarchonLogon.name
ltx/en_us_goadedes/pe.d108:peMA.Kathisma21.mode	@ltx/en_us_goadedes/miscellanea:misc.Mode5
ltx/en_us_goadedes/pe.d108:peMA.Kathisma21.text	
ltx/en_us_goadedes/pe.d108:peMA.Lauds1.incipit	@ltx/en_us_goadedes/oc.m5.d1:ocMA.Lauds1.incipit
ltx/en_us_goadedes/pe.d108:peMA.Lauds1.melody	
ltx/en_us_goadedes/pe.d108:peMA.Lauds1.mode	@ltx/en_us_goadedes/oc.m5.d1:ocMA.Lauds1.mode
ltx/en_us_goadedes/pe.d108:peMA.Lauds1.text	@ltx/en_us_goadedes/oc.m5.d1:ocMA.Lauds1.text
ltx/en_us_goadedes/pe.d108:peMA.Lauds2.incipit	@ltx/en_us_goadedes/oc.m5.d1:ocMA.Lauds2.incipit
ltx/en_us_goadedes/pe.d108:peMA.Lauds2.melody	
ltx/en_us_goadedes/pe.d108:peMA.Lauds2.mode	@ltx/en_us_goadedes/oc.m5.d1:ocMA.Lauds2.mode
ltx/en_us_goadedes/pe.d108:peMA.Lauds2.text	@ltx/en_us_goadedes/oc.m5.d1:ocMA.Lauds2.text
ltx/en_us_goadedes/pe.d108:peMA.Lauds3.incipit	@ltx/en_us_goadedes/oc.m5.d1:ocMA.Lauds3.incipit
ltx/en_us_goadedes/pe.d108:peMA.Lauds3.melody	
ltx/en_us_goadedes/pe.d108:peMA.Lauds3.mode	@ltx/en_us_goadedes/oc.m5.d1:ocMA.Lauds3.mode
ltx/en_us_goadedes/pe.d108:peMA.Lauds3.text	@ltx/en_us_goadedes/oc.m5.d1:ocMA.Lauds3.text
ltx/en_us_goadedes/pe.d108:peMA.Lauds4.incipit	@ltx/en_us_goadedes/oc.m5.d1:ocMA.Lauds4.incipit
ltx/en_us_goadedes/pe.d108:peMA.Lauds4.melody	
ltx/en_us_goadedes/pe.d108:peMA.Lauds4.mode	@ltx/en_us_goadedes/oc.m5.d1:ocMA.Lauds4.mode
ltx/en_us_goadedes/pe.d108:peMA.Lauds4.text	@ltx/en_us_goadedes/oc.m5.d1:ocMA.Lauds4.text
ltx/en_us_goadedes/pe.d108:peMA.LaudsGlory.incipit	@ltx/en_us_goadedes/pe.d106:peMA.LaudsGlory.incipit
ltx/en_us_goadedes/pe.d108:peMA.LaudsGlory.melody	@ltx/en_us_goadedes/pe.d106:peMA.LaudsGlory.melody
ltx/en_us_goadedes/pe.d108:peMA.LaudsGlory.mode	@ltx/en_us_goadedes/pe.d106:peMA.LaudsGlory.mode
ltx/en_us_goadedes/pe.d108:peMA.LaudsGlory.text	@ltx/en_us_goadedes/pe.d106:peMA.LaudsGlory.text
ltx/en_us_goadedes/pe.d108:peVE.AposGlory.incipit	@ltx/en_us_goadedes/pe.d106:peVE.AposGlory.incipit
ltx/en_us_goadedes/pe.d108:peVE.AposGlory.melody	@ltx/en_us_goadedes/pe.d106:peVE.AposGlory.melody
ltx/en_us_goadedes/pe.d108:peVE.AposGlory.mode	@ltx/en_us_goadedes/pe.d106:peVE.AposGlory.mode
ltx/en_us_goadedes/pe.d108:peVE.AposGlory.text	@ltx/en_us_goadedes/pe.d106:peVE.AposGlory.text
ltx/en_us_goadedes/pe.d108:peVE.Aposticha1.incipit	@ltx/en_us_goadedes/oc.m5.d1:ocVE.Stichera1.incipit
ltx/en_us_goadedes/pe.d108:peVE.Aposticha1.melody	
ltx/en_us_goadedes/pe.d108:peVE.Aposticha1.mode	@ltx/en_us_goadedes/oc.m5.d1:ocVE.Stichera1.mode
ltx/en_us_goadedes/pe.d108:peVE.Aposticha1.text	@ltx/en_us_goadedes/oc.m5.d1:ocVE.Stichera1.text
ltx/en_us_goadedes/pe.d108:peVE.Aposticha2.incipit	@ltx/en_us_goadedes/oc.m5.d1:ocVE.Stichera2.incipit
ltx/en_us_goadedes/pe.d108:peVE.Aposticha2.melody	
ltx/en_us_goadedes/pe.d108:peVE.Aposticha2.mode	@ltx/en_us_goadedes/oc.m5.d1:ocVE.Stichera2.mode
ltx/en_us_goadedes/pe.d108:peVE.Aposticha2.text	@ltx/en_us_goadedes/oc.m5.d1:ocVE.Stichera2.text
ltx/en_us_goadedes/pe.d108:peVE.Aposticha3.incipit	@ltx/en_us_goadedes/oc.m5.d1:ocVE.Stichera3.incipit
ltx/en_us_goadedes/pe.d108:peVE.Aposticha3.melody	
ltx/en_us_goadedes/pe.d108:peVE.Aposticha3.mode	@ltx/en_us_goadedes/oc.m5.d1:ocVE.Stichera3.mode
ltx/en_us_goadedes/pe.d108:peVE.Aposticha3.text	@ltx/en_us_goadedes/oc.m5.d1:ocVE.Stichera3.text
ltx/en_us_goadedes/pe.d108:peVE.Aposticha4.incipit	@ltx/en_us_goadedes/oc.m5.d1:ocVE.Aposticha1.incipit
ltx/en_us_goadedes/pe.d108:peVE.Aposticha4.melody	
ltx/en_us_goadedes/pe.d108:peVE.Aposticha4.mode	@ltx/en_us_goadedes/oc.m5.d1:ocVE.Aposticha1.mode
ltx/en_us_goadedes/pe.d108:peVE.Aposticha4.text	@ltx/en_us_goadedes/oc.m5.d1:ocVE.Aposticha1.text
ltx/en_us_goadedes/pe.d108:peVE.SticBoth.incipit	@ltx/en_us_goadedes/oc.m5.d1:ocVE.SticTheotokion.incipit
ltx/en_us_goadedes/pe.d108:peVE.SticBoth.melody	@ltx/en_us_goadedes/oc.m5.d1:ocVE.SticTheotokion.melody
ltx/en_us_goadedes/pe.d108:peVE.SticBoth.mode	@ltx/en_us_goadedes/oc.m5.d1:ocVE.SticTheotokion.mode
ltx/en_us_goadedes/pe.d108:peVE.SticBoth.text	@ltx/en_us_goadedes/oc.m5.d1:ocVE.SticTheotokion.text
ltx/en_us_goadedes/pe.d108:peVE.SticGlory.incipit	@ltx/en_us_goadedes/pe.d106:peVE.SticGlory.incipit
ltx/en_us_goadedes/pe.d108:peVE.SticGlory.melody	@ltx/en_us_goadedes/pe.d106:peVE.SticGlory.melody
ltx/en_us_goadedes/pe.d108:peVE.SticGlory.mode	@ltx/en_us_goadedes/pe.d106:peVE.SticGlory.mode
ltx/en_us_goadedes/pe.d108:peVE.SticGlory.text	@ltx/en_us_goadedes/pe.d106:peVE.SticGlory.text
ltx/en_us_goadedes/pe.d108:peVE.Stichera01.incipit	@ltx/en_us_goadedes/pe.d106:peVE.Stichera09.incipit
ltx/en_us_goadedes/pe.d108:peVE.Stichera01.melody	@ltx/en_us_goadedes/pe.d106:peVE.Stichera09.melody
ltx/en_us_goadedes/pe.d108:peVE.Stichera01.mode	@ltx/en_us_goadedes/pe.d106:peVE.Stichera09.mode
ltx/en_us_goadedes/pe.d108:peVE.Stichera01.text	@ltx/en_us_goadedes/pe.d106:peVE.Stichera09.text
ltx/en_us_goadedes/pe.d108:peVE.Stichera02.incipit	@ltx/en_us_goadedes/pe.d106:peVE.Stichera10.incipit
ltx/en_us_goadedes/pe.d108:peVE.Stichera02.melody	@ltx/en_us_goadedes/pe.d106:peVE.Stichera10.melody
ltx/en_us_goadedes/pe.d108:peVE.Stichera02.mode	@ltx/en_us_goadedes/pe.d106:peVE.Stichera10.mode
ltx/en_us_goadedes/pe.d108:peVE.Stichera02.text	@ltx/en_us_goadedes/pe.d106:peVE.Stichera10.text
ltx/en_us_goadedes/pe.d108:peVE.Stichera03.incipit	@ltx/en_us_goadedes/pe.d106:peVE.LityGlory.incipit
ltx/en_us_goadedes/pe.d108:peVE.Stichera03.melody	@ltx/en_us_goadedes/pe.d106:peVE.LityGlory.melody
ltx/en_us_goadedes/pe.d108:peVE.Stichera03.mode	@ltx/en_us_goadedes/pe.d106:peVE.LityGlory.mode
ltx/en_us_goadedes/pe.d108:peVE.Stichera03.text	@ltx/en_us_goadedes/pe.d106:peVE.LityGlory.text
