ltx/en_us_goadedes/me.m10.d09:meDA.commemoration.first	
ltx/en_us_goadedes/me.m10.d09:meDA.commemoration.first_name	
ltx/en_us_goadedes/me.m10.d09:meDA.commemoration.first_short	
ltx/en_us_goadedes/me.m10.d09:meDA.commemoration.first_title	@ltx/en_us_goadedes/titles:ti.Apostle
ltx/en_us_goadedes/me.m10.d09:meDA.commemoration.full	
ltx/en_us_goadedes/me.m10.d09:meDA.commemoration.second_name	
ltx/en_us_goadedes/me.m10.d09:meDA.commemoration.second_title	@ltx/en_us_goadedes/titles:ti.DevoutSaints
ltx/en_us_goadedes/me.m10.d09:meDA.date	
ltx/en_us_goadedes/me.m10.d09:meDA.fordate	
ltx/en_us_goadedes/me.m10.d09:meDA.insert1	
ltx/en_us_goadedes/me.m10.d09:meDA.insert2	
ltx/en_us_goadedes/me.m10.d09:meDA.note	
ltx/en_us_goadedes/me.m10.d09:meDA.pdfcoverdate	
ltx/en_us_goadedes/me.m10.d09:meDA.pdfheaderdate	
ltx/en_us_goadedes/me.m10.d09:meHO.commemorations	
ltx/en_us_goadedes/me.m10.d09:meHO.note1	
ltx/en_us_goadedes/me.m10.d09:meHO.note2	
ltx/en_us_goadedes/me.m10.d09:meHO.number	
ltx/en_us_goadedes/me.m10.d09:meHO.rank	
ltx/en_us_goadedes/me.m10.d09:meLE.commemoration1	
ltx/en_us_goadedes/me.m10.d09:meLE.commemoration2	
ltx/en_us_goadedes/me.m10.d09:meLI.Kontakion1.greekmelody	@ltx/en_us_goadedes/me.m10.d09:meMA.Kontakion1.greekmelody
ltx/en_us_goadedes/me.m10.d09:meLI.Kontakion1.incipit	@ltx/en_us_goadedes/me.m10.d09:meMA.Kontakion1.incipit
ltx/en_us_goadedes/me.m10.d09:meLI.Kontakion1.melody	@ltx/en_us_goadedes/me.m10.d09:meMA.Kontakion1.melody
ltx/en_us_goadedes/me.m10.d09:meLI.Kontakion1.mode	@ltx/en_us_goadedes/me.m10.d09:meMA.Kontakion1.mode
ltx/en_us_goadedes/me.m10.d09:meLI.Kontakion1.text	@ltx/en_us_goadedes/me.m10.d09:meMA.Kontakion1.text
ltx/en_us_goadedes/me.m10.d09:meLI.Megalynarion.text	
ltx/en_us_goadedes/me.m10.d09:meMA.C1.acrostic.notice1	
ltx/en_us_goadedes/me.m10.d09:meMA.C1.acrostic.text	
ltx/en_us_goadedes/me.m10.d09:meMA.C1.acrostic.title	
ltx/en_us_goadedes/me.m10.d09:meMA.C1.poet	@ltx/en_us_goadedes/poets:po.Theofanous
ltx/en_us_goadedes/me.m10.d09:meMA.C1.title	@ltx/en_us_goadedes/titles:ti.CanonApostle
ltx/en_us_goadedes/me.m10.d09:meMA.C1.verse	@ltx/en_us_goadedes/prayers:pr.verse_Apostle.text
ltx/en_us_goadedes/me.m10.d09:meMA.C2.acrostic.notice1	
ltx/en_us_goadedes/me.m10.d09:meMA.C2.acrostic.text	
ltx/en_us_goadedes/me.m10.d09:meMA.C2.acrostic.title	
ltx/en_us_goadedes/me.m10.d09:meMA.C2.title	@ltx/en_us_goadedes/titles:ti.CanonDevoutSaints
ltx/en_us_goadedes/me.m10.d09:meMA.C2.verse	@ltx/en_us_goadedes/prayers:pr.verse_SaintsM.text
ltx/en_us_goadedes/me.m10.d09:meMA.ExapTheotokion.incipit	…
ltx/en_us_goadedes/me.m10.d09:meMA.ExapTheotokion.melody	@ltx/en_us_goadedes/he.a.m2:heAU.GynaikesAkoutisthite.name
ltx/en_us_goadedes/me.m10.d09:meMA.ExapTheotokion.mode	@ltx/en_us_goadedes/miscellanea:misc.Mode2
ltx/en_us_goadedes/me.m10.d09:meMA.ExapTheotokion.text	
ltx/en_us_goadedes/me.m10.d09:meMA.Exaposteilarion1.greekmelody	@ltx/en_us_goadedes/he.a.m2:heAU.GynaikesAkoutisthite.greekname
ltx/en_us_goadedes/me.m10.d09:meMA.Exaposteilarion1.incipit	…
ltx/en_us_goadedes/me.m10.d09:meMA.Exaposteilarion1.melody	@ltx/en_us_goadedes/he.a.m2:heAU.GynaikesAkoutisthite.name
ltx/en_us_goadedes/me.m10.d09:meMA.Exaposteilarion1.mode	@ltx/en_us_goadedes/miscellanea:misc.Mode2
ltx/en_us_goadedes/me.m10.d09:meMA.Exaposteilarion1.text	
ltx/en_us_goadedes/me.m10.d09:meMA.Kontakion1.greekmelody	@ltx/en_us_goadedes/he.a.m6:heAU.TinEnPresveiais.greekname
ltx/en_us_goadedes/me.m10.d09:meMA.Kontakion1.incipit	…
ltx/en_us_goadedes/me.m10.d09:meMA.Kontakion1.melody	@ltx/en_us_goadedes/he.a.m6:heAU.TinEnPresveiais.name
ltx/en_us_goadedes/me.m10.d09:meMA.Kontakion1.mode	@ltx/en_us_goadedes/miscellanea:misc.Mode6
ltx/en_us_goadedes/me.m10.d09:meMA.Kontakion1.text	
ltx/en_us_goadedes/me.m10.d09:meMA.Lauds1.greekmelody	@ltx/en_us_goadedes/he.a.m4:heAU.EdokasSimeiosin.greekname
ltx/en_us_goadedes/me.m10.d09:meMA.Lauds1.incipit	…
ltx/en_us_goadedes/me.m10.d09:meMA.Lauds1.melody	@ltx/en_us_goadedes/he.a.m4:heAU.EdokasSimeiosin.name
ltx/en_us_goadedes/me.m10.d09:meMA.Lauds1.mode	@ltx/en_us_goadedes/miscellanea:misc.Mode4
ltx/en_us_goadedes/me.m10.d09:meMA.Lauds1.text	
ltx/en_us_goadedes/me.m10.d09:meMA.Lauds2.incipit	…
ltx/en_us_goadedes/me.m10.d09:meMA.Lauds2.melody	@ltx/en_us_goadedes/he.a.m4:heAU.EdokasSimeiosin.name
ltx/en_us_goadedes/me.m10.d09:meMA.Lauds2.mode	@ltx/en_us_goadedes/miscellanea:misc.Mode4
ltx/en_us_goadedes/me.m10.d09:meMA.Lauds2.text	
ltx/en_us_goadedes/me.m10.d09:meMA.Lauds3.incipit	…
ltx/en_us_goadedes/me.m10.d09:meMA.Lauds3.melody	@ltx/en_us_goadedes/he.a.m4:heAU.EdokasSimeiosin.name
ltx/en_us_goadedes/me.m10.d09:meMA.Lauds3.mode	@ltx/en_us_goadedes/miscellanea:misc.Mode4
ltx/en_us_goadedes/me.m10.d09:meMA.Lauds3.text	
ltx/en_us_goadedes/me.m10.d09:meMA.LaudsGlory.incipit	…
ltx/en_us_goadedes/me.m10.d09:meMA.LaudsGlory.melody	
ltx/en_us_goadedes/me.m10.d09:meMA.LaudsGlory.mode	@ltx/en_us_goadedes/miscellanea:misc.Mode5
ltx/en_us_goadedes/me.m10.d09:meMA.LaudsGlory.text	
ltx/en_us_goadedes/me.m10.d09:meMA.LaudsTheotokion.incipit	@ltx/en_us_goadedes/oc.m5.d5:ocVE.AposTheotokion.incipit
ltx/en_us_goadedes/me.m10.d09:meMA.LaudsTheotokion.melody	
ltx/en_us_goadedes/me.m10.d09:meMA.LaudsTheotokion.mode	@ltx/en_us_goadedes/miscellanea:misc.Mode5
ltx/en_us_goadedes/me.m10.d09:meMA.LaudsTheotokion.text	@ltx/en_us_goadedes/oc.m5.d5:ocVE.AposTheotokion.text
ltx/en_us_goadedes/me.m10.d09:meMA.MM.Lauds1123as5678.text	@ltx/en_us_goadedes/properties:media.key
ltx/en_us_goadedes/me.m10.d09:meMA.Ode1C11.greekmelody	@ltx/en_us_goadedes/he.h.m6:heHE.OsEnIpeiroPezefsas.greekname
ltx/en_us_goadedes/me.m10.d09:meMA.Ode1C11.incipit	…
ltx/en_us_goadedes/me.m10.d09:meMA.Ode1C11.melody	@ltx/en_us_goadedes/he.h.m6:heHE.OsEnIpeiroPezefsas.name
ltx/en_us_goadedes/me.m10.d09:meMA.Ode1C11.mode	@ltx/en_us_goadedes/miscellanea:misc.Mode6
ltx/en_us_goadedes/me.m10.d09:meMA.Ode1C11.ode	@ltx/en_us_goadedes/miscellanea:misc.Ode1
ltx/en_us_goadedes/me.m10.d09:meMA.Ode1C11.text	
ltx/en_us_goadedes/me.m10.d09:meMA.Ode1C12.incipit	…
ltx/en_us_goadedes/me.m10.d09:meMA.Ode1C12.melody	@ltx/en_us_goadedes/he.h.m6:heHE.OsEnIpeiroPezefsas.name
ltx/en_us_goadedes/me.m10.d09:meMA.Ode1C12.mode	@ltx/en_us_goadedes/miscellanea:misc.Mode6
ltx/en_us_goadedes/me.m10.d09:meMA.Ode1C12.ode	@ltx/en_us_goadedes/miscellanea:misc.Ode1
ltx/en_us_goadedes/me.m10.d09:meMA.Ode1C12.text	
ltx/en_us_goadedes/me.m10.d09:meMA.Ode1C13.incipit	…
ltx/en_us_goadedes/me.m10.d09:meMA.Ode1C13.melody	@ltx/en_us_goadedes/he.h.m6:heHE.OsEnIpeiroPezefsas.name
ltx/en_us_goadedes/me.m10.d09:meMA.Ode1C13.mode	@ltx/en_us_goadedes/miscellanea:misc.Mode6
ltx/en_us_goadedes/me.m10.d09:meMA.Ode1C13.ode	@ltx/en_us_goadedes/miscellanea:misc.Ode1
ltx/en_us_goadedes/me.m10.d09:meMA.Ode1C13.text	
ltx/en_us_goadedes/me.m10.d09:meMA.Ode1C1T.incipit	…
ltx/en_us_goadedes/me.m10.d09:meMA.Ode1C1T.melody	@ltx/en_us_goadedes/he.h.m6:heHE.OsEnIpeiroPezefsas.name
ltx/en_us_goadedes/me.m10.d09:meMA.Ode1C1T.mode	@ltx/en_us_goadedes/miscellanea:misc.Mode6
ltx/en_us_goadedes/me.m10.d09:meMA.Ode1C1T.ode	@ltx/en_us_goadedes/miscellanea:misc.Ode1
ltx/en_us_goadedes/me.m10.d09:meMA.Ode1C1T.text	
ltx/en_us_goadedes/me.m10.d09:meMA.Ode1C21.greekmelody	@ltx/en_us_goadedes/he.h.m8:heHE.ArmatilatinFarao.greekname
ltx/en_us_goadedes/me.m10.d09:meMA.Ode1C21.incipit	…
ltx/en_us_goadedes/me.m10.d09:meMA.Ode1C21.melody	@ltx/en_us_goadedes/he.h.m8:heHE.ArmatilatinFarao.name
ltx/en_us_goadedes/me.m10.d09:meMA.Ode1C21.mode	@ltx/en_us_goadedes/miscellanea:misc.Mode8
ltx/en_us_goadedes/me.m10.d09:meMA.Ode1C21.ode	@ltx/en_us_goadedes/miscellanea:misc.Ode1
ltx/en_us_goadedes/me.m10.d09:meMA.Ode1C21.text	
ltx/en_us_goadedes/me.m10.d09:meMA.Ode1C22.incipit	…
ltx/en_us_goadedes/me.m10.d09:meMA.Ode1C22.melody	@ltx/en_us_goadedes/he.h.m8:heHE.ArmatilatinFarao.name
ltx/en_us_goadedes/me.m10.d09:meMA.Ode1C22.mode	@ltx/en_us_goadedes/miscellanea:misc.Mode8
ltx/en_us_goadedes/me.m10.d09:meMA.Ode1C22.ode	@ltx/en_us_goadedes/miscellanea:misc.Ode1
ltx/en_us_goadedes/me.m10.d09:meMA.Ode1C22.text	
ltx/en_us_goadedes/me.m10.d09:meMA.Ode1C23.incipit	…
ltx/en_us_goadedes/me.m10.d09:meMA.Ode1C23.melody	@ltx/en_us_goadedes/he.h.m8:heHE.ArmatilatinFarao.name
ltx/en_us_goadedes/me.m10.d09:meMA.Ode1C23.mode	@ltx/en_us_goadedes/miscellanea:misc.Mode8
ltx/en_us_goadedes/me.m10.d09:meMA.Ode1C23.ode	@ltx/en_us_goadedes/miscellanea:misc.Ode1
ltx/en_us_goadedes/me.m10.d09:meMA.Ode1C23.text	
ltx/en_us_goadedes/me.m10.d09:meMA.Ode1C2T.incipit	…
ltx/en_us_goadedes/me.m10.d09:meMA.Ode1C2T.melody	@ltx/en_us_goadedes/he.h.m8:heHE.ArmatilatinFarao.name
ltx/en_us_goadedes/me.m10.d09:meMA.Ode1C2T.mode	@ltx/en_us_goadedes/miscellanea:misc.Mode8
ltx/en_us_goadedes/me.m10.d09:meMA.Ode1C2T.ode	@ltx/en_us_goadedes/miscellanea:misc.Ode1
ltx/en_us_goadedes/me.m10.d09:meMA.Ode1C2T.text	
ltx/en_us_goadedes/me.m10.d09:meMA.Ode3C11.greekmelody	@ltx/en_us_goadedes/he.h.m6:heHE.OukEstinAgios.greekname
ltx/en_us_goadedes/me.m10.d09:meMA.Ode3C11.incipit	…
ltx/en_us_goadedes/me.m10.d09:meMA.Ode3C11.melody	@ltx/en_us_goadedes/he.h.m6:heHE.OukEstinAgios.name
ltx/en_us_goadedes/me.m10.d09:meMA.Ode3C11.mode	@ltx/en_us_goadedes/miscellanea:misc.Mode6
ltx/en_us_goadedes/me.m10.d09:meMA.Ode3C11.ode	@ltx/en_us_goadedes/miscellanea:misc.Ode3
ltx/en_us_goadedes/me.m10.d09:meMA.Ode3C11.text	
ltx/en_us_goadedes/me.m10.d09:meMA.Ode3C12.incipit	…
ltx/en_us_goadedes/me.m10.d09:meMA.Ode3C12.melody	@ltx/en_us_goadedes/he.h.m6:heHE.OukEstinAgios.name
ltx/en_us_goadedes/me.m10.d09:meMA.Ode3C12.mode	@ltx/en_us_goadedes/miscellanea:misc.Mode6
ltx/en_us_goadedes/me.m10.d09:meMA.Ode3C12.ode	@ltx/en_us_goadedes/miscellanea:misc.Ode3
ltx/en_us_goadedes/me.m10.d09:meMA.Ode3C12.text	
ltx/en_us_goadedes/me.m10.d09:meMA.Ode3C13.incipit	…
ltx/en_us_goadedes/me.m10.d09:meMA.Ode3C13.melody	@ltx/en_us_goadedes/he.h.m6:heHE.OukEstinAgios.name
ltx/en_us_goadedes/me.m10.d09:meMA.Ode3C13.mode	@ltx/en_us_goadedes/miscellanea:misc.Mode6
ltx/en_us_goadedes/me.m10.d09:meMA.Ode3C13.ode	@ltx/en_us_goadedes/miscellanea:misc.Ode3
ltx/en_us_goadedes/me.m10.d09:meMA.Ode3C13.text	
ltx/en_us_goadedes/me.m10.d09:meMA.Ode3C1T.incipit	…
ltx/en_us_goadedes/me.m10.d09:meMA.Ode3C1T.melody	@ltx/en_us_goadedes/he.h.m6:heHE.OukEstinAgios.name
ltx/en_us_goadedes/me.m10.d09:meMA.Ode3C1T.mode	@ltx/en_us_goadedes/miscellanea:misc.Mode6
ltx/en_us_goadedes/me.m10.d09:meMA.Ode3C1T.ode	@ltx/en_us_goadedes/miscellanea:misc.Ode3
ltx/en_us_goadedes/me.m10.d09:meMA.Ode3C1T.text	
ltx/en_us_goadedes/me.m10.d09:meMA.Ode3C21.greekmelody	@ltx/en_us_goadedes/he.h.m8:heHE.OStereosasKatArchas.greekname
ltx/en_us_goadedes/me.m10.d09:meMA.Ode3C21.incipit	…
ltx/en_us_goadedes/me.m10.d09:meMA.Ode3C21.melody	@ltx/en_us_goadedes/he.h.m8:heHE.OStereosasKatArchas.name
ltx/en_us_goadedes/me.m10.d09:meMA.Ode3C21.mode	@ltx/en_us_goadedes/miscellanea:misc.Mode8
ltx/en_us_goadedes/me.m10.d09:meMA.Ode3C21.ode	@ltx/en_us_goadedes/miscellanea:misc.Ode3
ltx/en_us_goadedes/me.m10.d09:meMA.Ode3C21.text	
ltx/en_us_goadedes/me.m10.d09:meMA.Ode3C22.incipit	…
ltx/en_us_goadedes/me.m10.d09:meMA.Ode3C22.melody	@ltx/en_us_goadedes/he.h.m8:heHE.OStereosasKatArchas.name
ltx/en_us_goadedes/me.m10.d09:meMA.Ode3C22.mode	@ltx/en_us_goadedes/miscellanea:misc.Mode8
ltx/en_us_goadedes/me.m10.d09:meMA.Ode3C22.ode	@ltx/en_us_goadedes/miscellanea:misc.Ode3
ltx/en_us_goadedes/me.m10.d09:meMA.Ode3C22.text	
ltx/en_us_goadedes/me.m10.d09:meMA.Ode3C23.incipit	…
ltx/en_us_goadedes/me.m10.d09:meMA.Ode3C23.melody	@ltx/en_us_goadedes/he.h.m8:heHE.OStereosasKatArchas.name
ltx/en_us_goadedes/me.m10.d09:meMA.Ode3C23.mode	@ltx/en_us_goadedes/miscellanea:misc.Mode8
ltx/en_us_goadedes/me.m10.d09:meMA.Ode3C23.ode	@ltx/en_us_goadedes/miscellanea:misc.Ode3
ltx/en_us_goadedes/me.m10.d09:meMA.Ode3C23.text	
ltx/en_us_goadedes/me.m10.d09:meMA.Ode3C2T.incipit	…
ltx/en_us_goadedes/me.m10.d09:meMA.Ode3C2T.melody	@ltx/en_us_goadedes/he.h.m8:heHE.OStereosasKatArchas.name
ltx/en_us_goadedes/me.m10.d09:meMA.Ode3C2T.mode	@ltx/en_us_goadedes/miscellanea:misc.Mode8
ltx/en_us_goadedes/me.m10.d09:meMA.Ode3C2T.ode	@ltx/en_us_goadedes/miscellanea:misc.Ode3
ltx/en_us_goadedes/me.m10.d09:meMA.Ode3C2T.text	
ltx/en_us_goadedes/me.m10.d09:meMA.Ode3H.greekmelody	@ltx/en_us_goadedes/he.h.m8:heHE.OStereosasKatArchas.greekname
ltx/en_us_goadedes/me.m10.d09:meMA.Ode3H.incipit	@ltx/en_us_goadedes/he.h.m8:heHE.OStereosasKatArchas.incipit
ltx/en_us_goadedes/me.m10.d09:meMA.Ode3H.melody	@ltx/en_us_goadedes/he.h.m8:heHE.OStereosasKatArchas.melody
ltx/en_us_goadedes/me.m10.d09:meMA.Ode3H.mode	@ltx/en_us_goadedes/miscellanea:misc.Mode8
ltx/en_us_goadedes/me.m10.d09:meMA.Ode3H.ode	@ltx/en_us_goadedes/miscellanea:misc.Ode3
ltx/en_us_goadedes/me.m10.d09:meMA.Ode3H.text	@ltx/en_us_goadedes/he.h.m8:heHE.OStereosasKatArchas.text
ltx/en_us_goadedes/me.m10.d09:meMA.Ode3Kathisma1.greekmelody	@ltx/en_us_goadedes/he.a.m8:heAU.TinSofianKaiLogon.greekname
ltx/en_us_goadedes/me.m10.d09:meMA.Ode3Kathisma1.incipit	…
ltx/en_us_goadedes/me.m10.d09:meMA.Ode3Kathisma1.melody	@ltx/en_us_goadedes/he.a.m8:heAU.TinSofianKaiLogon.name
ltx/en_us_goadedes/me.m10.d09:meMA.Ode3Kathisma1.mode	@ltx/en_us_goadedes/miscellanea:misc.Mode8
ltx/en_us_goadedes/me.m10.d09:meMA.Ode3Kathisma1.text	
ltx/en_us_goadedes/me.m10.d09:meMA.Ode3Kathisma2.greekmelody	@ltx/en_us_goadedes/he.a.m8:heAU.TinSofianKaiLogon.greekname
ltx/en_us_goadedes/me.m10.d09:meMA.Ode3Kathisma2.incipit	…
ltx/en_us_goadedes/me.m10.d09:meMA.Ode3Kathisma2.melody	@ltx/en_us_goadedes/he.a.m8:heAU.TinSofianKaiLogon.name
ltx/en_us_goadedes/me.m10.d09:meMA.Ode3Kathisma2.mode	@ltx/en_us_goadedes/miscellanea:misc.Mode8
ltx/en_us_goadedes/me.m10.d09:meMA.Ode3Kathisma2.text	
ltx/en_us_goadedes/me.m10.d09:meMA.Ode3KathismaSt.incipit	…
ltx/en_us_goadedes/me.m10.d09:meMA.Ode3KathismaSt.melody	@ltx/en_us_goadedes/he.a.m8:heAU.TinSofianKaiLogon.name
ltx/en_us_goadedes/me.m10.d09:meMA.Ode3KathismaSt.mode	@ltx/en_us_goadedes/miscellanea:misc.Mode8
ltx/en_us_goadedes/me.m10.d09:meMA.Ode3KathismaSt.text	
ltx/en_us_goadedes/me.m10.d09:meMA.Ode3KathismaT.incipit	…
ltx/en_us_goadedes/me.m10.d09:meMA.Ode3KathismaT.melody	@ltx/en_us_goadedes/he.a.m8:heAU.TinSofianKaiLogon.name
ltx/en_us_goadedes/me.m10.d09:meMA.Ode3KathismaT.mode	@ltx/en_us_goadedes/miscellanea:misc.Mode8
ltx/en_us_goadedes/me.m10.d09:meMA.Ode3KathismaT.text	
ltx/en_us_goadedes/me.m10.d09:meMA.Ode4C11.greekmelody	@ltx/en_us_goadedes/he.h.m6:heHE.ChristosMouDynamis.greekname
ltx/en_us_goadedes/me.m10.d09:meMA.Ode4C11.incipit	…
ltx/en_us_goadedes/me.m10.d09:meMA.Ode4C11.melody	@ltx/en_us_goadedes/he.h.m6:heHE.ChristosMouDynamis.name
ltx/en_us_goadedes/me.m10.d09:meMA.Ode4C11.mode	@ltx/en_us_goadedes/miscellanea:misc.Mode6
ltx/en_us_goadedes/me.m10.d09:meMA.Ode4C11.ode	@ltx/en_us_goadedes/miscellanea:misc.Ode4
ltx/en_us_goadedes/me.m10.d09:meMA.Ode4C11.text	
ltx/en_us_goadedes/me.m10.d09:meMA.Ode4C12.incipit	…
ltx/en_us_goadedes/me.m10.d09:meMA.Ode4C12.melody	@ltx/en_us_goadedes/he.h.m6:heHE.ChristosMouDynamis.name
ltx/en_us_goadedes/me.m10.d09:meMA.Ode4C12.mode	@ltx/en_us_goadedes/miscellanea:misc.Mode6
ltx/en_us_goadedes/me.m10.d09:meMA.Ode4C12.ode	@ltx/en_us_goadedes/miscellanea:misc.Ode4
ltx/en_us_goadedes/me.m10.d09:meMA.Ode4C12.text	
ltx/en_us_goadedes/me.m10.d09:meMA.Ode4C13.incipit	…
ltx/en_us_goadedes/me.m10.d09:meMA.Ode4C13.melody	@ltx/en_us_goadedes/he.h.m6:heHE.ChristosMouDynamis.name
ltx/en_us_goadedes/me.m10.d09:meMA.Ode4C13.mode	@ltx/en_us_goadedes/miscellanea:misc.Mode6
ltx/en_us_goadedes/me.m10.d09:meMA.Ode4C13.ode	@ltx/en_us_goadedes/miscellanea:misc.Ode4
ltx/en_us_goadedes/me.m10.d09:meMA.Ode4C13.text	
ltx/en_us_goadedes/me.m10.d09:meMA.Ode4C1T.incipit	…
ltx/en_us_goadedes/me.m10.d09:meMA.Ode4C1T.melody	@ltx/en_us_goadedes/he.h.m6:heHE.ChristosMouDynamis.name
ltx/en_us_goadedes/me.m10.d09:meMA.Ode4C1T.mode	@ltx/en_us_goadedes/miscellanea:misc.Mode6
ltx/en_us_goadedes/me.m10.d09:meMA.Ode4C1T.ode	@ltx/en_us_goadedes/miscellanea:misc.Ode4
ltx/en_us_goadedes/me.m10.d09:meMA.Ode4C1T.text	
ltx/en_us_goadedes/me.m10.d09:meMA.Ode4C21.greekmelody	@ltx/en_us_goadedes/he.h.m8:heHE.EisakikoaKyrie.greekname
ltx/en_us_goadedes/me.m10.d09:meMA.Ode4C21.incipit	…
ltx/en_us_goadedes/me.m10.d09:meMA.Ode4C21.melody	@ltx/en_us_goadedes/he.h.m8:heHE.EisakikoaKyrie.name
ltx/en_us_goadedes/me.m10.d09:meMA.Ode4C21.mode	@ltx/en_us_goadedes/miscellanea:misc.Mode8
ltx/en_us_goadedes/me.m10.d09:meMA.Ode4C21.ode	@ltx/en_us_goadedes/miscellanea:misc.Ode4
ltx/en_us_goadedes/me.m10.d09:meMA.Ode4C21.text	
ltx/en_us_goadedes/me.m10.d09:meMA.Ode4C22.incipit	…
ltx/en_us_goadedes/me.m10.d09:meMA.Ode4C22.melody	@ltx/en_us_goadedes/he.h.m8:heHE.EisakikoaKyrie.name
ltx/en_us_goadedes/me.m10.d09:meMA.Ode4C22.mode	@ltx/en_us_goadedes/miscellanea:misc.Mode8
ltx/en_us_goadedes/me.m10.d09:meMA.Ode4C22.ode	@ltx/en_us_goadedes/miscellanea:misc.Ode4
ltx/en_us_goadedes/me.m10.d09:meMA.Ode4C22.text	
ltx/en_us_goadedes/me.m10.d09:meMA.Ode4C23.incipit	…
ltx/en_us_goadedes/me.m10.d09:meMA.Ode4C23.melody	@ltx/en_us_goadedes/he.h.m8:heHE.EisakikoaKyrie.name
ltx/en_us_goadedes/me.m10.d09:meMA.Ode4C23.mode	@ltx/en_us_goadedes/miscellanea:misc.Mode8
ltx/en_us_goadedes/me.m10.d09:meMA.Ode4C23.ode	@ltx/en_us_goadedes/miscellanea:misc.Ode4
ltx/en_us_goadedes/me.m10.d09:meMA.Ode4C23.text	
ltx/en_us_goadedes/me.m10.d09:meMA.Ode4C2T.incipit	…
ltx/en_us_goadedes/me.m10.d09:meMA.Ode4C2T.melody	@ltx/en_us_goadedes/he.h.m8:heHE.EisakikoaKyrie.name
ltx/en_us_goadedes/me.m10.d09:meMA.Ode4C2T.mode	@ltx/en_us_goadedes/miscellanea:misc.Mode8
ltx/en_us_goadedes/me.m10.d09:meMA.Ode4C2T.ode	@ltx/en_us_goadedes/miscellanea:misc.Ode4
ltx/en_us_goadedes/me.m10.d09:meMA.Ode4C2T.text	
ltx/en_us_goadedes/me.m10.d09:meMA.Ode5C11.greekmelody	@ltx/en_us_goadedes/he.h.m6:heHE.ToTheioFengeiSou.greekname
ltx/en_us_goadedes/me.m10.d09:meMA.Ode5C11.incipit	…
ltx/en_us_goadedes/me.m10.d09:meMA.Ode5C11.melody	@ltx/en_us_goadedes/he.h.m6:heHE.ToTheioFengeiSou.name
ltx/en_us_goadedes/me.m10.d09:meMA.Ode5C11.mode	@ltx/en_us_goadedes/miscellanea:misc.Mode6
ltx/en_us_goadedes/me.m10.d09:meMA.Ode5C11.ode	@ltx/en_us_goadedes/miscellanea:misc.Ode5
ltx/en_us_goadedes/me.m10.d09:meMA.Ode5C11.text	
ltx/en_us_goadedes/me.m10.d09:meMA.Ode5C12.incipit	…
ltx/en_us_goadedes/me.m10.d09:meMA.Ode5C12.melody	@ltx/en_us_goadedes/he.h.m6:heHE.ToTheioFengeiSou.name
ltx/en_us_goadedes/me.m10.d09:meMA.Ode5C12.mode	@ltx/en_us_goadedes/miscellanea:misc.Mode6
ltx/en_us_goadedes/me.m10.d09:meMA.Ode5C12.ode	@ltx/en_us_goadedes/miscellanea:misc.Ode5
ltx/en_us_goadedes/me.m10.d09:meMA.Ode5C12.text	
ltx/en_us_goadedes/me.m10.d09:meMA.Ode5C13.incipit	…
ltx/en_us_goadedes/me.m10.d09:meMA.Ode5C13.melody	@ltx/en_us_goadedes/he.h.m6:heHE.ToTheioFengeiSou.name
ltx/en_us_goadedes/me.m10.d09:meMA.Ode5C13.mode	@ltx/en_us_goadedes/miscellanea:misc.Mode6
ltx/en_us_goadedes/me.m10.d09:meMA.Ode5C13.ode	@ltx/en_us_goadedes/miscellanea:misc.Ode5
ltx/en_us_goadedes/me.m10.d09:meMA.Ode5C13.text	
ltx/en_us_goadedes/me.m10.d09:meMA.Ode5C1T.incipit	…
ltx/en_us_goadedes/me.m10.d09:meMA.Ode5C1T.melody	@ltx/en_us_goadedes/he.h.m6:heHE.ToTheioFengeiSou.name
ltx/en_us_goadedes/me.m10.d09:meMA.Ode5C1T.mode	@ltx/en_us_goadedes/miscellanea:misc.Mode6
ltx/en_us_goadedes/me.m10.d09:meMA.Ode5C1T.ode	@ltx/en_us_goadedes/miscellanea:misc.Ode5
ltx/en_us_goadedes/me.m10.d09:meMA.Ode5C1T.text	
ltx/en_us_goadedes/me.m10.d09:meMA.Ode5C21.greekmelody	@ltx/en_us_goadedes/he.h.m8:heHE.OrthrizontesVoomenSoi.greekname
ltx/en_us_goadedes/me.m10.d09:meMA.Ode5C21.incipit	…
ltx/en_us_goadedes/me.m10.d09:meMA.Ode5C21.melody	@ltx/en_us_goadedes/he.h.m8:heHE.OrthrizontesVoomenSoi.name
ltx/en_us_goadedes/me.m10.d09:meMA.Ode5C21.mode	@ltx/en_us_goadedes/miscellanea:misc.Mode8
ltx/en_us_goadedes/me.m10.d09:meMA.Ode5C21.ode	@ltx/en_us_goadedes/miscellanea:misc.Ode5
ltx/en_us_goadedes/me.m10.d09:meMA.Ode5C21.text	
ltx/en_us_goadedes/me.m10.d09:meMA.Ode5C22.incipit	…
ltx/en_us_goadedes/me.m10.d09:meMA.Ode5C22.melody	@ltx/en_us_goadedes/he.h.m8:heHE.OrthrizontesVoomenSoi.name
ltx/en_us_goadedes/me.m10.d09:meMA.Ode5C22.mode	@ltx/en_us_goadedes/miscellanea:misc.Mode8
ltx/en_us_goadedes/me.m10.d09:meMA.Ode5C22.ode	@ltx/en_us_goadedes/miscellanea:misc.Ode5
ltx/en_us_goadedes/me.m10.d09:meMA.Ode5C22.text	
ltx/en_us_goadedes/me.m10.d09:meMA.Ode5C23.incipit	…
ltx/en_us_goadedes/me.m10.d09:meMA.Ode5C23.melody	@ltx/en_us_goadedes/he.h.m8:heHE.OrthrizontesVoomenSoi.name
ltx/en_us_goadedes/me.m10.d09:meMA.Ode5C23.mode	@ltx/en_us_goadedes/miscellanea:misc.Mode8
ltx/en_us_goadedes/me.m10.d09:meMA.Ode5C23.ode	@ltx/en_us_goadedes/miscellanea:misc.Ode5
ltx/en_us_goadedes/me.m10.d09:meMA.Ode5C23.text	
ltx/en_us_goadedes/me.m10.d09:meMA.Ode5C2T.incipit	…
ltx/en_us_goadedes/me.m10.d09:meMA.Ode5C2T.melody	@ltx/en_us_goadedes/he.h.m8:heHE.OrthrizontesVoomenSoi.name
ltx/en_us_goadedes/me.m10.d09:meMA.Ode5C2T.mode	@ltx/en_us_goadedes/miscellanea:misc.Mode8
ltx/en_us_goadedes/me.m10.d09:meMA.Ode5C2T.ode	@ltx/en_us_goadedes/miscellanea:misc.Ode5
ltx/en_us_goadedes/me.m10.d09:meMA.Ode5C2T.text	
ltx/en_us_goadedes/me.m10.d09:meMA.Ode6C11.greekmelody	@ltx/en_us_goadedes/he.h.m6:heHE.TouViouTinThalassan.greekname
ltx/en_us_goadedes/me.m10.d09:meMA.Ode6C11.incipit	…
ltx/en_us_goadedes/me.m10.d09:meMA.Ode6C11.melody	@ltx/en_us_goadedes/he.h.m6:heHE.TouViouTinThalassan.name
ltx/en_us_goadedes/me.m10.d09:meMA.Ode6C11.mode	@ltx/en_us_goadedes/miscellanea:misc.Mode6
ltx/en_us_goadedes/me.m10.d09:meMA.Ode6C11.ode	@ltx/en_us_goadedes/miscellanea:misc.Ode6
ltx/en_us_goadedes/me.m10.d09:meMA.Ode6C11.text	
ltx/en_us_goadedes/me.m10.d09:meMA.Ode6C12.incipit	…
ltx/en_us_goadedes/me.m10.d09:meMA.Ode6C12.melody	@ltx/en_us_goadedes/he.h.m6:heHE.TouViouTinThalassan.name
ltx/en_us_goadedes/me.m10.d09:meMA.Ode6C12.mode	@ltx/en_us_goadedes/miscellanea:misc.Mode6
ltx/en_us_goadedes/me.m10.d09:meMA.Ode6C12.ode	@ltx/en_us_goadedes/miscellanea:misc.Ode6
ltx/en_us_goadedes/me.m10.d09:meMA.Ode6C12.text	
ltx/en_us_goadedes/me.m10.d09:meMA.Ode6C13.incipit	…
ltx/en_us_goadedes/me.m10.d09:meMA.Ode6C13.melody	@ltx/en_us_goadedes/he.h.m6:heHE.TouViouTinThalassan.name
ltx/en_us_goadedes/me.m10.d09:meMA.Ode6C13.mode	@ltx/en_us_goadedes/miscellanea:misc.Mode6
ltx/en_us_goadedes/me.m10.d09:meMA.Ode6C13.ode	@ltx/en_us_goadedes/miscellanea:misc.Ode6
ltx/en_us_goadedes/me.m10.d09:meMA.Ode6C13.text	
ltx/en_us_goadedes/me.m10.d09:meMA.Ode6C1T.incipit	…
ltx/en_us_goadedes/me.m10.d09:meMA.Ode6C1T.melody	@ltx/en_us_goadedes/he.h.m6:heHE.TouViouTinThalassan.name
ltx/en_us_goadedes/me.m10.d09:meMA.Ode6C1T.mode	@ltx/en_us_goadedes/miscellanea:misc.Mode6
ltx/en_us_goadedes/me.m10.d09:meMA.Ode6C1T.ode	@ltx/en_us_goadedes/miscellanea:misc.Ode6
ltx/en_us_goadedes/me.m10.d09:meMA.Ode6C1T.text	
ltx/en_us_goadedes/me.m10.d09:meMA.Ode6C21.greekmelody	@ltx/en_us_goadedes/he.h.m8:heHE.ChitonaMoiParaschou.greekname
ltx/en_us_goadedes/me.m10.d09:meMA.Ode6C21.incipit	…
ltx/en_us_goadedes/me.m10.d09:meMA.Ode6C21.melody	@ltx/en_us_goadedes/he.h.m8:heHE.ChitonaMoiParaschou.name
ltx/en_us_goadedes/me.m10.d09:meMA.Ode6C21.mode	@ltx/en_us_goadedes/miscellanea:misc.Mode8
ltx/en_us_goadedes/me.m10.d09:meMA.Ode6C21.ode	@ltx/en_us_goadedes/miscellanea:misc.Ode6
ltx/en_us_goadedes/me.m10.d09:meMA.Ode6C21.text	
ltx/en_us_goadedes/me.m10.d09:meMA.Ode6C22.incipit	…
ltx/en_us_goadedes/me.m10.d09:meMA.Ode6C22.melody	@ltx/en_us_goadedes/he.h.m8:heHE.ChitonaMoiParaschou.name
ltx/en_us_goadedes/me.m10.d09:meMA.Ode6C22.mode	@ltx/en_us_goadedes/miscellanea:misc.Mode8
ltx/en_us_goadedes/me.m10.d09:meMA.Ode6C22.ode	@ltx/en_us_goadedes/miscellanea:misc.Ode6
ltx/en_us_goadedes/me.m10.d09:meMA.Ode6C22.text	
ltx/en_us_goadedes/me.m10.d09:meMA.Ode6C23.incipit	…
ltx/en_us_goadedes/me.m10.d09:meMA.Ode6C23.melody	@ltx/en_us_goadedes/he.h.m8:heHE.ChitonaMoiParaschou.name
ltx/en_us_goadedes/me.m10.d09:meMA.Ode6C23.mode	@ltx/en_us_goadedes/miscellanea:misc.Mode8
ltx/en_us_goadedes/me.m10.d09:meMA.Ode6C23.ode	@ltx/en_us_goadedes/miscellanea:misc.Ode6
ltx/en_us_goadedes/me.m10.d09:meMA.Ode6C23.text	
ltx/en_us_goadedes/me.m10.d09:meMA.Ode6C2T.incipit	…
ltx/en_us_goadedes/me.m10.d09:meMA.Ode6C2T.melody	@ltx/en_us_goadedes/he.h.m8:heHE.ChitonaMoiParaschou.name
ltx/en_us_goadedes/me.m10.d09:meMA.Ode6C2T.mode	@ltx/en_us_goadedes/miscellanea:misc.Mode8
ltx/en_us_goadedes/me.m10.d09:meMA.Ode6C2T.ode	@ltx/en_us_goadedes/miscellanea:misc.Ode6
ltx/en_us_goadedes/me.m10.d09:meMA.Ode6C2T.text	
ltx/en_us_goadedes/me.m10.d09:meMA.Ode6H.greekmelody	@ltx/en_us_goadedes/he.h.m8:heHE.ChitonaMoiParaschou.greekname
ltx/en_us_goadedes/me.m10.d09:meMA.Ode6H.incipit	@ltx/en_us_goadedes/he.h.m8:heHE.ChitonaMoiParaschou.incipit
ltx/en_us_goadedes/me.m10.d09:meMA.Ode6H.melody	@ltx/en_us_goadedes/he.h.m8:heHE.ChitonaMoiParaschou.melody
ltx/en_us_goadedes/me.m10.d09:meMA.Ode6H.mode	@ltx/en_us_goadedes/miscellanea:misc.Mode8
ltx/en_us_goadedes/me.m10.d09:meMA.Ode6H.ode	@ltx/en_us_goadedes/miscellanea:misc.Ode6
ltx/en_us_goadedes/me.m10.d09:meMA.Ode6H.text	@ltx/en_us_goadedes/he.h.m8:heHE.ChitonaMoiParaschou.text
ltx/en_us_goadedes/me.m10.d09:meMA.Ode7C11.greekmelody	@ltx/en_us_goadedes/he.h.m6:heHE.OiPaidesEnVavyloni.greekname
ltx/en_us_goadedes/me.m10.d09:meMA.Ode7C11.incipit	…
ltx/en_us_goadedes/me.m10.d09:meMA.Ode7C11.melody	@ltx/en_us_goadedes/he.h.m6:heHE.OiPaidesEnVavyloni.name
ltx/en_us_goadedes/me.m10.d09:meMA.Ode7C11.mode	@ltx/en_us_goadedes/miscellanea:misc.Mode6
ltx/en_us_goadedes/me.m10.d09:meMA.Ode7C11.ode	@ltx/en_us_goadedes/miscellanea:misc.Ode7
ltx/en_us_goadedes/me.m10.d09:meMA.Ode7C11.text	
ltx/en_us_goadedes/me.m10.d09:meMA.Ode7C12.incipit	…
ltx/en_us_goadedes/me.m10.d09:meMA.Ode7C12.melody	@ltx/en_us_goadedes/he.h.m6:heHE.OiPaidesEnVavyloni.name
ltx/en_us_goadedes/me.m10.d09:meMA.Ode7C12.mode	@ltx/en_us_goadedes/miscellanea:misc.Mode6
ltx/en_us_goadedes/me.m10.d09:meMA.Ode7C12.ode	@ltx/en_us_goadedes/miscellanea:misc.Ode7
ltx/en_us_goadedes/me.m10.d09:meMA.Ode7C12.text	
ltx/en_us_goadedes/me.m10.d09:meMA.Ode7C13.incipit	…
ltx/en_us_goadedes/me.m10.d09:meMA.Ode7C13.melody	@ltx/en_us_goadedes/he.h.m6:heHE.OiPaidesEnVavyloni.name
ltx/en_us_goadedes/me.m10.d09:meMA.Ode7C13.mode	@ltx/en_us_goadedes/miscellanea:misc.Mode6
ltx/en_us_goadedes/me.m10.d09:meMA.Ode7C13.ode	@ltx/en_us_goadedes/miscellanea:misc.Ode7
ltx/en_us_goadedes/me.m10.d09:meMA.Ode7C13.text	
ltx/en_us_goadedes/me.m10.d09:meMA.Ode7C1T.incipit	…
ltx/en_us_goadedes/me.m10.d09:meMA.Ode7C1T.melody	@ltx/en_us_goadedes/he.h.m6:heHE.OiPaidesEnVavyloni.name
ltx/en_us_goadedes/me.m10.d09:meMA.Ode7C1T.mode	@ltx/en_us_goadedes/miscellanea:misc.Mode6
ltx/en_us_goadedes/me.m10.d09:meMA.Ode7C1T.ode	@ltx/en_us_goadedes/miscellanea:misc.Ode7
ltx/en_us_goadedes/me.m10.d09:meMA.Ode7C1T.text	
ltx/en_us_goadedes/me.m10.d09:meMA.Ode7C21.greekmelody	@ltx/en_us_goadedes/he.h.m8:heHE.PaidesEvraion.greekname
ltx/en_us_goadedes/me.m10.d09:meMA.Ode7C21.incipit	…
ltx/en_us_goadedes/me.m10.d09:meMA.Ode7C21.melody	@ltx/en_us_goadedes/he.h.m8:heHE.PaidesEvraion.name
ltx/en_us_goadedes/me.m10.d09:meMA.Ode7C21.mode	@ltx/en_us_goadedes/miscellanea:misc.Mode8
ltx/en_us_goadedes/me.m10.d09:meMA.Ode7C21.ode	@ltx/en_us_goadedes/miscellanea:misc.Ode7
ltx/en_us_goadedes/me.m10.d09:meMA.Ode7C21.text	
ltx/en_us_goadedes/me.m10.d09:meMA.Ode7C22.incipit	…
ltx/en_us_goadedes/me.m10.d09:meMA.Ode7C22.melody	@ltx/en_us_goadedes/he.h.m8:heHE.PaidesEvraion.name
ltx/en_us_goadedes/me.m10.d09:meMA.Ode7C22.mode	@ltx/en_us_goadedes/miscellanea:misc.Mode8
ltx/en_us_goadedes/me.m10.d09:meMA.Ode7C22.ode	@ltx/en_us_goadedes/miscellanea:misc.Ode7
ltx/en_us_goadedes/me.m10.d09:meMA.Ode7C22.text	
ltx/en_us_goadedes/me.m10.d09:meMA.Ode7C23.incipit	…
ltx/en_us_goadedes/me.m10.d09:meMA.Ode7C23.melody	@ltx/en_us_goadedes/he.h.m8:heHE.PaidesEvraion.name
ltx/en_us_goadedes/me.m10.d09:meMA.Ode7C23.mode	@ltx/en_us_goadedes/miscellanea:misc.Mode8
ltx/en_us_goadedes/me.m10.d09:meMA.Ode7C23.ode	@ltx/en_us_goadedes/miscellanea:misc.Ode7
ltx/en_us_goadedes/me.m10.d09:meMA.Ode7C23.text	
ltx/en_us_goadedes/me.m10.d09:meMA.Ode7C2T.incipit	…
ltx/en_us_goadedes/me.m10.d09:meMA.Ode7C2T.melody	@ltx/en_us_goadedes/he.h.m8:heHE.PaidesEvraion.name
ltx/en_us_goadedes/me.m10.d09:meMA.Ode7C2T.mode	@ltx/en_us_goadedes/miscellanea:misc.Mode8
ltx/en_us_goadedes/me.m10.d09:meMA.Ode7C2T.ode	@ltx/en_us_goadedes/miscellanea:misc.Ode7
ltx/en_us_goadedes/me.m10.d09:meMA.Ode7C2T.text	
ltx/en_us_goadedes/me.m10.d09:meMA.Ode8C11.greekmelody	@ltx/en_us_goadedes/he.h.m6:heHE.NomonPatroon.greekname
ltx/en_us_goadedes/me.m10.d09:meMA.Ode8C11.incipit	…
ltx/en_us_goadedes/me.m10.d09:meMA.Ode8C11.melody	@ltx/en_us_goadedes/he.h.m6:heHE.NomonPatroon.name
ltx/en_us_goadedes/me.m10.d09:meMA.Ode8C11.mode	@ltx/en_us_goadedes/miscellanea:misc.Mode6
ltx/en_us_goadedes/me.m10.d09:meMA.Ode8C11.ode	@ltx/en_us_goadedes/miscellanea:misc.Ode8
ltx/en_us_goadedes/me.m10.d09:meMA.Ode8C11.text	
ltx/en_us_goadedes/me.m10.d09:meMA.Ode8C12.incipit	…
ltx/en_us_goadedes/me.m10.d09:meMA.Ode8C12.melody	@ltx/en_us_goadedes/he.h.m6:heHE.NomonPatroon.name
ltx/en_us_goadedes/me.m10.d09:meMA.Ode8C12.mode	@ltx/en_us_goadedes/miscellanea:misc.Mode6
ltx/en_us_goadedes/me.m10.d09:meMA.Ode8C12.ode	@ltx/en_us_goadedes/miscellanea:misc.Ode8
ltx/en_us_goadedes/me.m10.d09:meMA.Ode8C12.text	
ltx/en_us_goadedes/me.m10.d09:meMA.Ode8C13.incipit	…
ltx/en_us_goadedes/me.m10.d09:meMA.Ode8C13.melody	@ltx/en_us_goadedes/he.h.m6:heHE.NomonPatroon.name
ltx/en_us_goadedes/me.m10.d09:meMA.Ode8C13.mode	@ltx/en_us_goadedes/miscellanea:misc.Mode6
ltx/en_us_goadedes/me.m10.d09:meMA.Ode8C13.ode	@ltx/en_us_goadedes/miscellanea:misc.Ode8
ltx/en_us_goadedes/me.m10.d09:meMA.Ode8C13.text	
ltx/en_us_goadedes/me.m10.d09:meMA.Ode8C1T.incipit	…
ltx/en_us_goadedes/me.m10.d09:meMA.Ode8C1T.melody	@ltx/en_us_goadedes/he.h.m6:heHE.NomonPatroon.name
ltx/en_us_goadedes/me.m10.d09:meMA.Ode8C1T.mode	@ltx/en_us_goadedes/miscellanea:misc.Mode6
ltx/en_us_goadedes/me.m10.d09:meMA.Ode8C1T.ode	@ltx/en_us_goadedes/miscellanea:misc.Ode8
ltx/en_us_goadedes/me.m10.d09:meMA.Ode8C1T.text	
ltx/en_us_goadedes/me.m10.d09:meMA.Ode8C21.greekmelody	@ltx/en_us_goadedes/he.h.m8:heHE.TonVasileaTonOuranon.greekname
ltx/en_us_goadedes/me.m10.d09:meMA.Ode8C21.incipit	…
ltx/en_us_goadedes/me.m10.d09:meMA.Ode8C21.melody	@ltx/en_us_goadedes/he.h.m8:heHE.TonVasileaTonOuranon.name
ltx/en_us_goadedes/me.m10.d09:meMA.Ode8C21.mode	@ltx/en_us_goadedes/miscellanea:misc.Mode8
ltx/en_us_goadedes/me.m10.d09:meMA.Ode8C21.ode	@ltx/en_us_goadedes/miscellanea:misc.Ode8
ltx/en_us_goadedes/me.m10.d09:meMA.Ode8C21.text	
ltx/en_us_goadedes/me.m10.d09:meMA.Ode8C22.incipit	…
ltx/en_us_goadedes/me.m10.d09:meMA.Ode8C22.melody	@ltx/en_us_goadedes/he.h.m8:heHE.TonVasileaTonOuranon.name
ltx/en_us_goadedes/me.m10.d09:meMA.Ode8C22.mode	@ltx/en_us_goadedes/miscellanea:misc.Mode8
ltx/en_us_goadedes/me.m10.d09:meMA.Ode8C22.ode	@ltx/en_us_goadedes/miscellanea:misc.Ode8
ltx/en_us_goadedes/me.m10.d09:meMA.Ode8C22.text	
ltx/en_us_goadedes/me.m10.d09:meMA.Ode8C23.incipit	…
ltx/en_us_goadedes/me.m10.d09:meMA.Ode8C23.melody	@ltx/en_us_goadedes/he.h.m8:heHE.TonVasileaTonOuranon.name
ltx/en_us_goadedes/me.m10.d09:meMA.Ode8C23.mode	@ltx/en_us_goadedes/miscellanea:misc.Mode8
ltx/en_us_goadedes/me.m10.d09:meMA.Ode8C23.ode	@ltx/en_us_goadedes/miscellanea:misc.Ode8
ltx/en_us_goadedes/me.m10.d09:meMA.Ode8C23.text	
ltx/en_us_goadedes/me.m10.d09:meMA.Ode8C2T.incipit	…
ltx/en_us_goadedes/me.m10.d09:meMA.Ode8C2T.melody	@ltx/en_us_goadedes/he.h.m8:heHE.TonVasileaTonOuranon.name
ltx/en_us_goadedes/me.m10.d09:meMA.Ode8C2T.mode	@ltx/en_us_goadedes/miscellanea:misc.Mode8
ltx/en_us_goadedes/me.m10.d09:meMA.Ode8C2T.ode	@ltx/en_us_goadedes/miscellanea:misc.Ode8
ltx/en_us_goadedes/me.m10.d09:meMA.Ode8C2T.text	
ltx/en_us_goadedes/me.m10.d09:meMA.Ode8H.greekmelody	@ltx/en_us_goadedes/he.h.m8:heHE.TonVasileaTonOuranon.greekname
ltx/en_us_goadedes/me.m10.d09:meMA.Ode8H.incipit	@ltx/en_us_goadedes/he.h.m8:heHE.TonVasileaTonOuranon.incipit
ltx/en_us_goadedes/me.m10.d09:meMA.Ode8H.melody	@ltx/en_us_goadedes/he.h.m8:heHE.TonVasileaTonOuranon.melody
ltx/en_us_goadedes/me.m10.d09:meMA.Ode8H.mode	@ltx/en_us_goadedes/miscellanea:misc.Mode8
ltx/en_us_goadedes/me.m10.d09:meMA.Ode8H.ode	@ltx/en_us_goadedes/miscellanea:misc.Ode8
ltx/en_us_goadedes/me.m10.d09:meMA.Ode8H.text	@ltx/en_us_goadedes/he.h.m8:heHE.TonVasileaTonOuranon.text
ltx/en_us_goadedes/me.m10.d09:meMA.Ode9C11.greekmelody	@ltx/en_us_goadedes/he.h.m2:heHE.AporeiPasaGlossa.greekname
ltx/en_us_goadedes/me.m10.d09:meMA.Ode9C11.incipit	…
ltx/en_us_goadedes/me.m10.d09:meMA.Ode9C11.melody	@ltx/en_us_goadedes/he.h.m2:heHE.AporeiPasaGlossa.name
ltx/en_us_goadedes/me.m10.d09:meMA.Ode9C11.mode	@ltx/en_us_goadedes/miscellanea:misc.Mode6
ltx/en_us_goadedes/me.m10.d09:meMA.Ode9C11.ode	@ltx/en_us_goadedes/miscellanea:misc.Ode9
ltx/en_us_goadedes/me.m10.d09:meMA.Ode9C11.text	
ltx/en_us_goadedes/me.m10.d09:meMA.Ode9C12.incipit	…
ltx/en_us_goadedes/me.m10.d09:meMA.Ode9C12.melody	@ltx/en_us_goadedes/he.h.m2:heHE.AporeiPasaGlossa.name
ltx/en_us_goadedes/me.m10.d09:meMA.Ode9C12.mode	@ltx/en_us_goadedes/miscellanea:misc.Mode6
ltx/en_us_goadedes/me.m10.d09:meMA.Ode9C12.ode	@ltx/en_us_goadedes/miscellanea:misc.Ode9
ltx/en_us_goadedes/me.m10.d09:meMA.Ode9C12.text	
ltx/en_us_goadedes/me.m10.d09:meMA.Ode9C13.incipit	…
ltx/en_us_goadedes/me.m10.d09:meMA.Ode9C13.melody	@ltx/en_us_goadedes/he.h.m2:heHE.AporeiPasaGlossa.name
ltx/en_us_goadedes/me.m10.d09:meMA.Ode9C13.mode	@ltx/en_us_goadedes/miscellanea:misc.Mode6
ltx/en_us_goadedes/me.m10.d09:meMA.Ode9C13.ode	@ltx/en_us_goadedes/miscellanea:misc.Ode9
ltx/en_us_goadedes/me.m10.d09:meMA.Ode9C13.text	
ltx/en_us_goadedes/me.m10.d09:meMA.Ode9C1T.incipit	…
ltx/en_us_goadedes/me.m10.d09:meMA.Ode9C1T.melody	@ltx/en_us_goadedes/he.h.m2:heHE.AporeiPasaGlossa.name
ltx/en_us_goadedes/me.m10.d09:meMA.Ode9C1T.mode	@ltx/en_us_goadedes/miscellanea:misc.Mode6
ltx/en_us_goadedes/me.m10.d09:meMA.Ode9C1T.ode	@ltx/en_us_goadedes/miscellanea:misc.Ode9
ltx/en_us_goadedes/me.m10.d09:meMA.Ode9C1T.text	
ltx/en_us_goadedes/me.m10.d09:meMA.Ode9C21.greekmelody	@ltx/en_us_goadedes/he.h.m8:heHE.KyriosTheotokon.greekname
ltx/en_us_goadedes/me.m10.d09:meMA.Ode9C21.incipit	…
ltx/en_us_goadedes/me.m10.d09:meMA.Ode9C21.melody	@ltx/en_us_goadedes/he.h.m8:heHE.KyriosTheotokon.name
ltx/en_us_goadedes/me.m10.d09:meMA.Ode9C21.mode	@ltx/en_us_goadedes/miscellanea:misc.Mode8
ltx/en_us_goadedes/me.m10.d09:meMA.Ode9C21.ode	@ltx/en_us_goadedes/miscellanea:misc.Ode9
ltx/en_us_goadedes/me.m10.d09:meMA.Ode9C21.text	
ltx/en_us_goadedes/me.m10.d09:meMA.Ode9C22.incipit	…
ltx/en_us_goadedes/me.m10.d09:meMA.Ode9C22.melody	@ltx/en_us_goadedes/he.h.m8:heHE.KyriosTheotokon.name
ltx/en_us_goadedes/me.m10.d09:meMA.Ode9C22.mode	@ltx/en_us_goadedes/miscellanea:misc.Mode8
ltx/en_us_goadedes/me.m10.d09:meMA.Ode9C22.ode	@ltx/en_us_goadedes/miscellanea:misc.Ode9
ltx/en_us_goadedes/me.m10.d09:meMA.Ode9C22.text	
ltx/en_us_goadedes/me.m10.d09:meMA.Ode9C23.incipit	…
ltx/en_us_goadedes/me.m10.d09:meMA.Ode9C23.melody	@ltx/en_us_goadedes/he.h.m8:heHE.KyriosTheotokon.name
ltx/en_us_goadedes/me.m10.d09:meMA.Ode9C23.mode	@ltx/en_us_goadedes/miscellanea:misc.Mode8
ltx/en_us_goadedes/me.m10.d09:meMA.Ode9C23.ode	@ltx/en_us_goadedes/miscellanea:misc.Ode9
ltx/en_us_goadedes/me.m10.d09:meMA.Ode9C23.text	
ltx/en_us_goadedes/me.m10.d09:meMA.Ode9C2T.incipit	…
ltx/en_us_goadedes/me.m10.d09:meMA.Ode9C2T.melody	@ltx/en_us_goadedes/he.h.m8:heHE.KyriosTheotokon.name
ltx/en_us_goadedes/me.m10.d09:meMA.Ode9C2T.mode	@ltx/en_us_goadedes/miscellanea:misc.Mode8
ltx/en_us_goadedes/me.m10.d09:meMA.Ode9C2T.ode	@ltx/en_us_goadedes/miscellanea:misc.Ode9
ltx/en_us_goadedes/me.m10.d09:meMA.Ode9C2T.text	
ltx/en_us_goadedes/me.m10.d09:meMA.Ode9H.greekmelody	@ltx/en_us_goadedes/he.h.m8:heHE.KyriosTheotokon.greekname
ltx/en_us_goadedes/me.m10.d09:meMA.Ode9H.incipit	@ltx/en_us_goadedes/he.h.m8:heHE.KyriosTheotokon.incipit
ltx/en_us_goadedes/me.m10.d09:meMA.Ode9H.melody	@ltx/en_us_goadedes/he.h.m8:heHE.KyriosTheotokon.melody
ltx/en_us_goadedes/me.m10.d09:meMA.Ode9H.mode	@ltx/en_us_goadedes/miscellanea:misc.Mode8
ltx/en_us_goadedes/me.m10.d09:meMA.Ode9H.ode	@ltx/en_us_goadedes/miscellanea:misc.Ode9
ltx/en_us_goadedes/me.m10.d09:meMA.Ode9H.text	@ltx/en_us_goadedes/he.h.m8:heHE.KyriosTheotokon.text
ltx/en_us_goadedes/me.m10.d09:meMA.Oikos1.text	
ltx/en_us_goadedes/me.m10.d09:meVE.Apolytikion1ger.greekmelody	@ltx/en_us_goadedes/he.a.m4:heAU.TachyProkatalave.greekname
ltx/en_us_goadedes/me.m10.d09:meVE.Apolytikion1ger.incipit	…
ltx/en_us_goadedes/me.m10.d09:meVE.Apolytikion1ger.melody	@ltx/en_us_goadedes/he.a.m4:heAU.TachyProkatalave.name
ltx/en_us_goadedes/me.m10.d09:meVE.Apolytikion1ger.mode	@ltx/en_us_goadedes/miscellanea:misc.Mode4
ltx/en_us_goadedes/me.m10.d09:meVE.Apolytikion1ger.poet	@ltx/en_us_goadedes/poets:po.Gerasimou
ltx/en_us_goadedes/me.m10.d09:meVE.Apolytikion1ger.text	
ltx/en_us_goadedes/me.m10.d09:meVE.Apolytikion2ger.greekmelody	@ltx/en_us_goadedes/he.a.m5:heAU.TonSynanarchonLogon.greekname
ltx/en_us_goadedes/me.m10.d09:meVE.Apolytikion2ger.incipit	…
ltx/en_us_goadedes/me.m10.d09:meVE.Apolytikion2ger.melody	@ltx/en_us_goadedes/he.a.m5:heAU.TonSynanarchonLogon.name
ltx/en_us_goadedes/me.m10.d09:meVE.Apolytikion2ger.mode	@ltx/en_us_goadedes/miscellanea:misc.Mode5
ltx/en_us_goadedes/me.m10.d09:meVE.Apolytikion2ger.poet	@ltx/en_us_goadedes/poets:po.Gerasimou
ltx/en_us_goadedes/me.m10.d09:meVE.Apolytikion2ger.text	
ltx/en_us_goadedes/me.m10.d09:meVE.AposGlory.incipit	…
ltx/en_us_goadedes/me.m10.d09:meVE.AposGlory.melody	
ltx/en_us_goadedes/me.m10.d09:meVE.AposGlory.mode	@ltx/en_us_goadedes/miscellanea:misc.Mode5
ltx/en_us_goadedes/me.m10.d09:meVE.AposGlory.text	
ltx/en_us_goadedes/me.m10.d09:meVE.AposStavrotheotokion.greekmelody	@ltx/en_us_goadedes/he.a.m5:heAU.ChairoisAskitikon.greekname
ltx/en_us_goadedes/me.m10.d09:meVE.AposStavrotheotokion.incipit	…
ltx/en_us_goadedes/me.m10.d09:meVE.AposStavrotheotokion.melody	@ltx/en_us_goadedes/he.a.m5:heAU.ChairoisAskitikon.name
ltx/en_us_goadedes/me.m10.d09:meVE.AposStavrotheotokion.mode	@ltx/en_us_goadedes/miscellanea:misc.Mode5
ltx/en_us_goadedes/me.m10.d09:meVE.AposStavrotheotokion.text	
ltx/en_us_goadedes/me.m10.d09:meVE.AposTheotokion.greekmelody	@ltx/en_us_goadedes/he.a.m5:heAU.ChairoisAskitikon.greekname
ltx/en_us_goadedes/me.m10.d09:meVE.AposTheotokion.incipit	…
ltx/en_us_goadedes/me.m10.d09:meVE.AposTheotokion.melody	@ltx/en_us_goadedes/he.a.m5:heAU.ChairoisAskitikon.name
ltx/en_us_goadedes/me.m10.d09:meVE.AposTheotokion.mode	@ltx/en_us_goadedes/miscellanea:misc.Mode5
ltx/en_us_goadedes/me.m10.d09:meVE.AposTheotokion.text	
ltx/en_us_goadedes/me.m10.d09:meVE.GeneralApolytikion1.name	
ltx/en_us_goadedes/me.m10.d09:meVE.MM.GeneralApolytikion1.text	@ltx/en_us_goadedes/properties:media.key
ltx/en_us_goadedes/me.m10.d09:meVE.MM.GeneralApolytikion3.text	@ltx/en_us_goadedes/properties:media.key
ltx/en_us_goadedes/me.m10.d09:meVE.SticGlory.incipit	…
ltx/en_us_goadedes/me.m10.d09:meVE.SticGlory.melody	
ltx/en_us_goadedes/me.m10.d09:meVE.SticGlory.mode	@ltx/en_us_goadedes/miscellanea:misc.Mode4
ltx/en_us_goadedes/me.m10.d09:meVE.SticGlory.poet	@ltx/en_us_goadedes/poets:po.Theofanous
ltx/en_us_goadedes/me.m10.d09:meVE.SticGlory.text	
ltx/en_us_goadedes/me.m10.d09:meVE.SticStavrotheotokion.greekmelody	@ltx/en_us_goadedes/he.a.m4:heAU.OsGennaionEnMartysi.greekname
ltx/en_us_goadedes/me.m10.d09:meVE.SticStavrotheotokion.incipit	@ltx/en_us_goadedes/me.m10.d05:meVE.SticStavrotheotokion.incipit
ltx/en_us_goadedes/me.m10.d09:meVE.SticStavrotheotokion.melody	@ltx/en_us_goadedes/he.a.m4:heAU.OsGennaionEnMartysi.name
ltx/en_us_goadedes/me.m10.d09:meVE.SticStavrotheotokion.mode	@ltx/en_us_goadedes/miscellanea:misc.Mode4
ltx/en_us_goadedes/me.m10.d09:meVE.SticStavrotheotokion.text	@ltx/en_us_goadedes/me.m10.d05:meVE.SticStavrotheotokion.text
ltx/en_us_goadedes/me.m10.d09:meVE.SticTheotokion.greekmelody	@ltx/en_us_goadedes/he.a.m4:heAU.OsGennaionEnMartysi.greekname
ltx/en_us_goadedes/me.m10.d09:meVE.SticTheotokion.incipit	…
ltx/en_us_goadedes/me.m10.d09:meVE.SticTheotokion.melody	@ltx/en_us_goadedes/he.a.m4:heAU.OsGennaionEnMartysi.name
ltx/en_us_goadedes/me.m10.d09:meVE.SticTheotokion.mode	@ltx/en_us_goadedes/miscellanea:misc.Mode4
ltx/en_us_goadedes/me.m10.d09:meVE.SticTheotokion.text	
ltx/en_us_goadedes/me.m10.d09:meVE.Stichera01.greekmelody	@ltx/en_us_goadedes/he.a.m4:heAU.OsGennaionEnMartysi.greekname
ltx/en_us_goadedes/me.m10.d09:meVE.Stichera01.incipit	@ltx/en_us_goadedes/me.m04.d30:meMA.Lauds1.incipit
ltx/en_us_goadedes/me.m10.d09:meVE.Stichera01.melody	@ltx/en_us_goadedes/he.a.m4:heAU.OsGennaionEnMartysi.name
ltx/en_us_goadedes/me.m10.d09:meVE.Stichera01.mode	@ltx/en_us_goadedes/miscellanea:misc.Mode4
ltx/en_us_goadedes/me.m10.d09:meVE.Stichera01.text	@ltx/en_us_goadedes/me.m04.d30:meMA.Lauds1.text
ltx/en_us_goadedes/me.m10.d09:meVE.Stichera02.incipit	@ltx/en_us_goadedes/me.m04.d30:meMA.Lauds2.incipit
ltx/en_us_goadedes/me.m10.d09:meVE.Stichera02.melody	@ltx/en_us_goadedes/he.a.m4:heAU.OsGennaionEnMartysi.name
ltx/en_us_goadedes/me.m10.d09:meVE.Stichera02.mode	@ltx/en_us_goadedes/miscellanea:misc.Mode4
ltx/en_us_goadedes/me.m10.d09:meVE.Stichera02.text	@ltx/en_us_goadedes/me.m04.d30:meMA.Lauds2.text
ltx/en_us_goadedes/me.m10.d09:meVE.Stichera03.incipit	@ltx/en_us_goadedes/me.m04.d30:meMA.Lauds3.incipit
ltx/en_us_goadedes/me.m10.d09:meVE.Stichera03.melody	@ltx/en_us_goadedes/he.a.m4:heAU.OsGennaionEnMartysi.name
ltx/en_us_goadedes/me.m10.d09:meVE.Stichera03.mode	@ltx/en_us_goadedes/miscellanea:misc.Mode4
ltx/en_us_goadedes/me.m10.d09:meVE.Stichera03.text	@ltx/en_us_goadedes/me.m04.d30:meMA.Lauds3.text
ltx/en_us_goadedes/me.m10.d09:meVE.Stichera04.greekmelody	@ltx/en_us_goadedes/he.a.m6:heAU.OlinApothemenoi.greekname
ltx/en_us_goadedes/me.m10.d09:meVE.Stichera04.incipit	…
ltx/en_us_goadedes/me.m10.d09:meVE.Stichera04.melody	@ltx/en_us_goadedes/he.a.m6:heAU.OlinApothemenoi.name
ltx/en_us_goadedes/me.m10.d09:meVE.Stichera04.mode	@ltx/en_us_goadedes/miscellanea:misc.Mode6
ltx/en_us_goadedes/me.m10.d09:meVE.Stichera04.text	
ltx/en_us_goadedes/me.m10.d09:meVE.Stichera05.incipit	…
ltx/en_us_goadedes/me.m10.d09:meVE.Stichera05.melody	@ltx/en_us_goadedes/he.a.m6:heAU.OlinApothemenoi.name
ltx/en_us_goadedes/me.m10.d09:meVE.Stichera05.mode	@ltx/en_us_goadedes/miscellanea:misc.Mode6
ltx/en_us_goadedes/me.m10.d09:meVE.Stichera05.text	
ltx/en_us_goadedes/me.m10.d09:meVE.Stichera06.incipit	…
ltx/en_us_goadedes/me.m10.d09:meVE.Stichera06.melody	@ltx/en_us_goadedes/he.a.m6:heAU.OlinApothemenoi.name
ltx/en_us_goadedes/me.m10.d09:meVE.Stichera06.mode	@ltx/en_us_goadedes/miscellanea:misc.Mode6
ltx/en_us_goadedes/me.m10.d09:meVE.Stichera06.text	
