ltx/en_us_goadedes/properties:contact.address_1	
ltx/en_us_goadedes/properties:contact.address_2	
ltx/en_us_goadedes/properties:contact.address_3	
ltx/en_us_goadedes/properties:contact.email	
ltx/en_us_goadedes/properties:contact.phone	
ltx/en_us_goadedes/properties:deprecated.key	This key is no longer used.
ltx/en_us_goadedes/properties:media.key	For media only.
ltx/en_us_goadedes/properties:pdf.cover.language	English
ltx/en_us_goadedes/properties:version.copyright1	© The Greek Orthodox Archdiocese of America and Fr. Seraphim Dedes
ltx/en_us_goadedes/properties:version.copyright2	
ltx/en_us_goadedes/properties:version.copyright3	
ltx/en_us_goadedes/properties:version.designation	GOASD
ltx/en_us_goadedes/properties:version.name	Fr. Seraphim Dedes.
ltx/en_us_goadedes/properties:version.notice1	
ltx/en_us_goadedes/properties:version.translator	Translated by Fr. Seraphim Dedes
