ltx/en_us_goadedes/pe.d099:peDA.commemoration.full	
ltx/en_us_goadedes/pe.d099:peDA.commemoration.short	
ltx/en_us_goadedes/pe.d099:peDA.dismissal	@ltx/en_us_goadedes/dismissals:dis00.resurrection
ltx/en_us_goadedes/pe.d099:peDA.insert1	
ltx/en_us_goadedes/pe.d099:peDA.insert2	
ltx/en_us_goadedes/pe.d099:peDA.note	
ltx/en_us_goadedes/pe.d099:peHO.commemorations	
ltx/en_us_goadedes/pe.d099:peHO.daytitle	
ltx/en_us_goadedes/pe.d099:peHO.description1	
ltx/en_us_goadedes/pe.d099:peHO.description2	
ltx/en_us_goadedes/pe.d099:peHO.note1	
ltx/en_us_goadedes/pe.d099:peHO.note2	
ltx/en_us_goadedes/pe.d099:peLI.Kontakion1.incipit	@ltx/en_us_goadedes/pe.d099:peMA.Kontakion1.incipit
ltx/en_us_goadedes/pe.d099:peLI.Kontakion1.melody	@ltx/en_us_goadedes/pe.d099:peMA.Kontakion1.melody
ltx/en_us_goadedes/pe.d099:peLI.Kontakion1.mode	@ltx/en_us_goadedes/pe.d099:peMA.Kontakion1.mode
ltx/en_us_goadedes/pe.d099:peLI.Kontakion1.text	@ltx/en_us_goadedes/pe.d099:peMA.Kontakion1.text
ltx/en_us_goadedes/pe.d099:peLI.Megalynarion.text	
ltx/en_us_goadedes/pe.d099:peLI.Megalynarion2.text	
ltx/en_us_goadedes/pe.d099:peLI.TheotokosHymn.incipit	@ltx/en_us_goadedes/pe.d071:peMA.Ode9C22.incipit
ltx/en_us_goadedes/pe.d099:peLI.TheotokosHymn.mode	@ltx/en_us_goadedes/miscellanea:misc.Mode1
ltx/en_us_goadedes/pe.d099:peLI.TheotokosHymn.text	@ltx/en_us_goadedes/pe.d071:peMA.Ode9C22.text
ltx/en_us_goadedes/pe.d099:peLI.TheotokosHymnVerse.text	@ltx/en_us_goadedes/pe.d071:peMA.Ode9C1MKa.text
ltx/en_us_goadedes/pe.d099:peMA.C1.acrostic.notice1	
ltx/en_us_goadedes/pe.d099:peMA.C1.acrostic.notice2	
ltx/en_us_goadedes/pe.d099:peMA.C1.acrostic.text	
ltx/en_us_goadedes/pe.d099:peMA.C1.acrostic.title	
ltx/en_us_goadedes/pe.d099:peMA.C1.poet	@ltx/en_us_goadedes/poets:po.IosifThessalonikis
ltx/en_us_goadedes/pe.d099:peMA.C1.title	@ltx/en_us_goadedes/titles:ti.CanonSamaritanWoman
ltx/en_us_goadedes/pe.d099:peMA.C1.verse	@ltx/en_us_goadedes/prayers:pr.verse_God.text
ltx/en_us_goadedes/pe.d099:peMA.Exaposteilarion1.greekmelody	@ltx/en_us_goadedes/he.a.m2:heAU.GynaikesAkoutisthite.greekname
ltx/en_us_goadedes/pe.d099:peMA.Exaposteilarion1.incipit	…
ltx/en_us_goadedes/pe.d099:peMA.Exaposteilarion1.melody	@ltx/en_us_goadedes/he.a.m2:heAU.GynaikesAkoutisthite.name
ltx/en_us_goadedes/pe.d099:peMA.Exaposteilarion1.mode	@ltx/en_us_goadedes/miscellanea:misc.Mode2
ltx/en_us_goadedes/pe.d099:peMA.Exaposteilarion1.text	
ltx/en_us_goadedes/pe.d099:peMA.Exaposteilarion2.greekmelody	@ltx/en_us_goadedes/he.a.m2:heAU.GynaikesAkoutisthite.greekname
ltx/en_us_goadedes/pe.d099:peMA.Exaposteilarion2.incipit	…
ltx/en_us_goadedes/pe.d099:peMA.Exaposteilarion2.melody	@ltx/en_us_goadedes/he.a.m2:heAU.GynaikesAkoutisthite.name
ltx/en_us_goadedes/pe.d099:peMA.Exaposteilarion2.mode	@ltx/en_us_goadedes/miscellanea:misc.Mode2
ltx/en_us_goadedes/pe.d099:peMA.Exaposteilarion2.text	
ltx/en_us_goadedes/pe.d099:peMA.Kathisma11.incipit	@ltx/en_us_goadedes/oc.m4.d1:ocMA.Kathisma11.incipit
ltx/en_us_goadedes/pe.d099:peMA.Kathisma11.melody	
ltx/en_us_goadedes/pe.d099:peMA.Kathisma11.mode	@ltx/en_us_goadedes/miscellanea:misc.Mode4
ltx/en_us_goadedes/pe.d099:peMA.Kathisma11.text	@ltx/en_us_goadedes/oc.m4.d1:ocMA.Kathisma11.text
ltx/en_us_goadedes/pe.d099:peMA.Kathisma12.greekmelody	@ltx/en_us_goadedes/he.a.m4:heAU.TachyProkatalave.greekname
ltx/en_us_goadedes/pe.d099:peMA.Kathisma12.incipit	@ltx/en_us_goadedes/oc.m4.d1:ocMA.Kathisma21.incipit
ltx/en_us_goadedes/pe.d099:peMA.Kathisma12.melody	@ltx/en_us_goadedes/he.a.m4:heAU.TachyProkatalave.name
ltx/en_us_goadedes/pe.d099:peMA.Kathisma12.mode	@ltx/en_us_goadedes/miscellanea:misc.Mode4
ltx/en_us_goadedes/pe.d099:peMA.Kathisma12.text	@ltx/en_us_goadedes/oc.m4.d1:ocMA.Kathisma21.text
ltx/en_us_goadedes/pe.d099:peMA.Kathisma13.incipit	@ltx/en_us_goadedes/oc.m4.d1:ocVE.ApolTheotokionVM.incipit
ltx/en_us_goadedes/pe.d099:peMA.Kathisma13.melody	
ltx/en_us_goadedes/pe.d099:peMA.Kathisma13.mode	@ltx/en_us_goadedes/miscellanea:misc.Mode4
ltx/en_us_goadedes/pe.d099:peMA.Kathisma13.text	@ltx/en_us_goadedes/oc.m4.d1:ocVE.ApolTheotokionVM.text
ltx/en_us_goadedes/pe.d099:peMA.Kathisma21.greekmelody	@ltx/en_us_goadedes/he.a.m4:heAU.KateplagiIosif.greekname
ltx/en_us_goadedes/pe.d099:peMA.Kathisma21.incipit	@ltx/en_us_goadedes/oc.m4.d1:ocMA.Kathisma22.incipit
ltx/en_us_goadedes/pe.d099:peMA.Kathisma21.melody	@ltx/en_us_goadedes/he.a.m4:heAU.KateplagiIosif.name
ltx/en_us_goadedes/pe.d099:peMA.Kathisma21.mode	@ltx/en_us_goadedes/miscellanea:misc.Mode4
ltx/en_us_goadedes/pe.d099:peMA.Kathisma21.text	@ltx/en_us_goadedes/oc.m4.d1:ocMA.Kathisma22.text
ltx/en_us_goadedes/pe.d099:peMA.Kathisma22.greekmelody	@ltx/en_us_goadedes/he.a.m4:heAU.KateplagiIosif.greekname
ltx/en_us_goadedes/pe.d099:peMA.Kathisma22.incipit	@ltx/en_us_goadedes/oc.m4.d1:ocMA.Kathisma12.incipit
ltx/en_us_goadedes/pe.d099:peMA.Kathisma22.melody	@ltx/en_us_goadedes/he.a.m4:heAU.KateplagiIosif.name
ltx/en_us_goadedes/pe.d099:peMA.Kathisma22.mode	@ltx/en_us_goadedes/miscellanea:misc.Mode4
ltx/en_us_goadedes/pe.d099:peMA.Kathisma22.text	@ltx/en_us_goadedes/oc.m4.d1:ocMA.Kathisma12.text
ltx/en_us_goadedes/pe.d099:peMA.Kathisma23.greekmelody	@ltx/en_us_goadedes/he.a.m4:heAU.KateplagiIosif.greekname
ltx/en_us_goadedes/pe.d099:peMA.Kathisma23.incipit	@ltx/en_us_goadedes/he.a.m4:heAU.KateplagiIosif.incipit
ltx/en_us_goadedes/pe.d099:peMA.Kathisma23.melody	@ltx/en_us_goadedes/he.a.m4:heAU.KateplagiIosif.melody
ltx/en_us_goadedes/pe.d099:peMA.Kathisma23.mode	@ltx/en_us_goadedes/he.a.m4:heAU.KateplagiIosif.mode
ltx/en_us_goadedes/pe.d099:peMA.Kathisma23.text	@ltx/en_us_goadedes/he.a.m4:heAU.KateplagiIosif.text
ltx/en_us_goadedes/pe.d099:peMA.Kontakion1.incipit	…
ltx/en_us_goadedes/pe.d099:peMA.Kontakion1.melody	
ltx/en_us_goadedes/pe.d099:peMA.Kontakion1.mode	@ltx/en_us_goadedes/miscellanea:misc.Mode8
ltx/en_us_goadedes/pe.d099:peMA.Kontakion1.text	
ltx/en_us_goadedes/pe.d099:peMA.Lauds1.incipit	@ltx/en_us_goadedes/oc.m4.d1:ocMA.Lauds1.incipit
ltx/en_us_goadedes/pe.d099:peMA.Lauds1.melody	@ltx/en_us_goadedes/oc.m4.d1:ocMA.Lauds1.melody
ltx/en_us_goadedes/pe.d099:peMA.Lauds1.mode	@ltx/en_us_goadedes/oc.m4.d1:ocMA.Lauds1.mode
ltx/en_us_goadedes/pe.d099:peMA.Lauds1.text	@ltx/en_us_goadedes/oc.m4.d1:ocMA.Lauds1.text
ltx/en_us_goadedes/pe.d099:peMA.Lauds2.incipit	@ltx/en_us_goadedes/oc.m4.d1:ocMA.Lauds2.incipit
ltx/en_us_goadedes/pe.d099:peMA.Lauds2.melody	@ltx/en_us_goadedes/oc.m4.d1:ocMA.Lauds2.melody
ltx/en_us_goadedes/pe.d099:peMA.Lauds2.mode	@ltx/en_us_goadedes/oc.m4.d1:ocMA.Lauds2.mode
ltx/en_us_goadedes/pe.d099:peMA.Lauds2.text	@ltx/en_us_goadedes/oc.m4.d1:ocMA.Lauds2.text
ltx/en_us_goadedes/pe.d099:peMA.Lauds3.incipit	@ltx/en_us_goadedes/oc.m4.d1:ocMA.Lauds3.incipit
ltx/en_us_goadedes/pe.d099:peMA.Lauds3.melody	@ltx/en_us_goadedes/oc.m4.d1:ocMA.Lauds3.melody
ltx/en_us_goadedes/pe.d099:peMA.Lauds3.mode	@ltx/en_us_goadedes/oc.m4.d1:ocMA.Lauds3.mode
ltx/en_us_goadedes/pe.d099:peMA.Lauds3.text	@ltx/en_us_goadedes/oc.m4.d1:ocMA.Lauds3.text
ltx/en_us_goadedes/pe.d099:peMA.Lauds4.incipit	@ltx/en_us_goadedes/oc.m4.d1:ocMA.Lauds4.incipit
ltx/en_us_goadedes/pe.d099:peMA.Lauds4.melody	@ltx/en_us_goadedes/oc.m4.d1:ocMA.Lauds4.melody
ltx/en_us_goadedes/pe.d099:peMA.Lauds4.mode	@ltx/en_us_goadedes/oc.m4.d1:ocMA.Lauds4.mode
ltx/en_us_goadedes/pe.d099:peMA.Lauds4.text	@ltx/en_us_goadedes/oc.m4.d1:ocMA.Lauds4.text
ltx/en_us_goadedes/pe.d099:peMA.Lauds7.incipit	@ltx/en_us_goadedes/pe.d099:peVE.LityGlory.incipit
ltx/en_us_goadedes/pe.d099:peMA.Lauds7.melody	@ltx/en_us_goadedes/miscellanea:misc.Idiomelon
ltx/en_us_goadedes/pe.d099:peMA.Lauds7.mode	@ltx/en_us_goadedes/miscellanea:misc.Mode3
ltx/en_us_goadedes/pe.d099:peMA.Lauds7.text	@ltx/en_us_goadedes/pe.d099:peVE.LityGlory.text
ltx/en_us_goadedes/pe.d099:peMA.Lauds8.incipit	…
ltx/en_us_goadedes/pe.d099:peMA.Lauds8.melody	@ltx/en_us_goadedes/miscellanea:misc.Idiomelon
ltx/en_us_goadedes/pe.d099:peMA.Lauds8.mode	@ltx/en_us_goadedes/miscellanea:misc.Mode6
ltx/en_us_goadedes/pe.d099:peMA.Lauds8.text	
ltx/en_us_goadedes/pe.d099:peMA.LaudsGlory.incipit	…
ltx/en_us_goadedes/pe.d099:peMA.LaudsGlory.melody	@ltx/en_us_goadedes/miscellanea:misc.Idiomelon
ltx/en_us_goadedes/pe.d099:peMA.LaudsGlory.mode	@ltx/en_us_goadedes/miscellanea:misc.Mode6
ltx/en_us_goadedes/pe.d099:peMA.LaudsGlory.text	
ltx/en_us_goadedes/pe.d099:peMA.Ode1C11.greekmelody	@ltx/en_us_goadedes/he.h.m4:heHE.OPataxasAigypton.greekname
ltx/en_us_goadedes/pe.d099:peMA.Ode1C11.incipit	…
ltx/en_us_goadedes/pe.d099:peMA.Ode1C11.melody	@ltx/en_us_goadedes/he.h.m4:heHE.OPataxasAigypton.name
ltx/en_us_goadedes/pe.d099:peMA.Ode1C11.mode	@ltx/en_us_goadedes/miscellanea:misc.Mode4
ltx/en_us_goadedes/pe.d099:peMA.Ode1C11.ode	@ltx/en_us_goadedes/miscellanea:misc.Ode1
ltx/en_us_goadedes/pe.d099:peMA.Ode1C11.text	
ltx/en_us_goadedes/pe.d099:peMA.Ode1C12.incipit	…
ltx/en_us_goadedes/pe.d099:peMA.Ode1C12.melody	@ltx/en_us_goadedes/he.h.m4:heHE.OPataxasAigypton.name
ltx/en_us_goadedes/pe.d099:peMA.Ode1C12.mode	@ltx/en_us_goadedes/miscellanea:misc.Mode4
ltx/en_us_goadedes/pe.d099:peMA.Ode1C12.ode	@ltx/en_us_goadedes/miscellanea:misc.Ode1
ltx/en_us_goadedes/pe.d099:peMA.Ode1C12.text	
ltx/en_us_goadedes/pe.d099:peMA.Ode1C13.incipit	…
ltx/en_us_goadedes/pe.d099:peMA.Ode1C13.melody	@ltx/en_us_goadedes/he.h.m4:heHE.OPataxasAigypton.name
ltx/en_us_goadedes/pe.d099:peMA.Ode1C13.mode	@ltx/en_us_goadedes/miscellanea:misc.Mode4
ltx/en_us_goadedes/pe.d099:peMA.Ode1C13.ode	@ltx/en_us_goadedes/miscellanea:misc.Ode1
ltx/en_us_goadedes/pe.d099:peMA.Ode1C13.text	
ltx/en_us_goadedes/pe.d099:peMA.Ode1C1F1.greekmelody	@ltx/en_us_goadedes/he.h.m4:heHE.OPataxasAigypton.greekname
ltx/en_us_goadedes/pe.d099:peMA.Ode1C1F1.incipit	…
ltx/en_us_goadedes/pe.d099:peMA.Ode1C1F1.melody	@ltx/en_us_goadedes/he.h.m4:heHE.OPataxasAigypton.name
ltx/en_us_goadedes/pe.d099:peMA.Ode1C1F1.mode	@ltx/en_us_goadedes/miscellanea:misc.Mode4
ltx/en_us_goadedes/pe.d099:peMA.Ode1C1F1.ode	@ltx/en_us_goadedes/miscellanea:misc.Ode1
ltx/en_us_goadedes/pe.d099:peMA.Ode1C1F1.text	
ltx/en_us_goadedes/pe.d099:peMA.Ode1C1H.greekmelody	@ltx/en_us_goadedes/he.h.m4:heHE.OPataxasAigypton.greekname
ltx/en_us_goadedes/pe.d099:peMA.Ode1C1H.incipit	@ltx/en_us_goadedes/he.h.m4:heHE.OPataxasAigypton.incipit
ltx/en_us_goadedes/pe.d099:peMA.Ode1C1H.melody	@ltx/en_us_goadedes/he.h.m4:heHE.OPataxasAigypton.melody
ltx/en_us_goadedes/pe.d099:peMA.Ode1C1H.mode	@ltx/en_us_goadedes/miscellanea:misc.Mode4
ltx/en_us_goadedes/pe.d099:peMA.Ode1C1H.ode	@ltx/en_us_goadedes/miscellanea:misc.Ode1
ltx/en_us_goadedes/pe.d099:peMA.Ode1C1H.text	@ltx/en_us_goadedes/he.h.m4:heHE.OPataxasAigypton.text
ltx/en_us_goadedes/pe.d099:peMA.Ode1C1T.incipit	…
ltx/en_us_goadedes/pe.d099:peMA.Ode1C1T.melody	@ltx/en_us_goadedes/he.h.m4:heHE.OPataxasAigypton.name
ltx/en_us_goadedes/pe.d099:peMA.Ode1C1T.mode	@ltx/en_us_goadedes/miscellanea:misc.Mode4
ltx/en_us_goadedes/pe.d099:peMA.Ode1C1T.ode	@ltx/en_us_goadedes/miscellanea:misc.Ode1
ltx/en_us_goadedes/pe.d099:peMA.Ode1C1T.text	
ltx/en_us_goadedes/pe.d099:peMA.Ode1C1Tr.incipit	…
ltx/en_us_goadedes/pe.d099:peMA.Ode1C1Tr.melody	@ltx/en_us_goadedes/he.h.m4:heHE.OPataxasAigypton.name
ltx/en_us_goadedes/pe.d099:peMA.Ode1C1Tr.mode	@ltx/en_us_goadedes/miscellanea:misc.Mode4
ltx/en_us_goadedes/pe.d099:peMA.Ode1C1Tr.ode	@ltx/en_us_goadedes/miscellanea:misc.Ode1
ltx/en_us_goadedes/pe.d099:peMA.Ode1C1Tr.text	
ltx/en_us_goadedes/pe.d099:peMA.Ode3C11.greekmelody	@ltx/en_us_goadedes/he.h.m4:heHE.EstereothiIKardiaMouEnKyrio.greekname
ltx/en_us_goadedes/pe.d099:peMA.Ode3C11.incipit	…
ltx/en_us_goadedes/pe.d099:peMA.Ode3C11.melody	@ltx/en_us_goadedes/he.h.m4:heHE.EstereothiIKardiaMouEnKyrio.name
ltx/en_us_goadedes/pe.d099:peMA.Ode3C11.mode	@ltx/en_us_goadedes/miscellanea:misc.Mode4
ltx/en_us_goadedes/pe.d099:peMA.Ode3C11.ode	@ltx/en_us_goadedes/miscellanea:misc.Ode3
ltx/en_us_goadedes/pe.d099:peMA.Ode3C11.text	
ltx/en_us_goadedes/pe.d099:peMA.Ode3C12.incipit	…
ltx/en_us_goadedes/pe.d099:peMA.Ode3C12.melody	@ltx/en_us_goadedes/he.h.m4:heHE.EstereothiIKardiaMouEnKyrio.name
ltx/en_us_goadedes/pe.d099:peMA.Ode3C12.mode	@ltx/en_us_goadedes/miscellanea:misc.Mode4
ltx/en_us_goadedes/pe.d099:peMA.Ode3C12.ode	@ltx/en_us_goadedes/miscellanea:misc.Ode3
ltx/en_us_goadedes/pe.d099:peMA.Ode3C12.text	
ltx/en_us_goadedes/pe.d099:peMA.Ode3C13.incipit	…
ltx/en_us_goadedes/pe.d099:peMA.Ode3C13.melody	@ltx/en_us_goadedes/he.h.m4:heHE.EstereothiIKardiaMouEnKyrio.name
ltx/en_us_goadedes/pe.d099:peMA.Ode3C13.mode	@ltx/en_us_goadedes/miscellanea:misc.Mode4
ltx/en_us_goadedes/pe.d099:peMA.Ode3C13.ode	@ltx/en_us_goadedes/miscellanea:misc.Ode3
ltx/en_us_goadedes/pe.d099:peMA.Ode3C13.text	
ltx/en_us_goadedes/pe.d099:peMA.Ode3C1F1.greekmelody	@ltx/en_us_goadedes/he.h.m4:heHE.EstereothiIKardiaMouEnKyrio.greekname
ltx/en_us_goadedes/pe.d099:peMA.Ode3C1F1.incipit	…
ltx/en_us_goadedes/pe.d099:peMA.Ode3C1F1.melody	@ltx/en_us_goadedes/he.h.m4:heHE.EstereothiIKardiaMouEnKyrio.name
ltx/en_us_goadedes/pe.d099:peMA.Ode3C1F1.mode	@ltx/en_us_goadedes/miscellanea:misc.Mode4
ltx/en_us_goadedes/pe.d099:peMA.Ode3C1F1.ode	@ltx/en_us_goadedes/miscellanea:misc.Ode3
ltx/en_us_goadedes/pe.d099:peMA.Ode3C1F1.text	
ltx/en_us_goadedes/pe.d099:peMA.Ode3C1H.greekmelody	@ltx/en_us_goadedes/he.h.m4:heHE.EstereothiIKardiaMouEnKyrio.greekname
ltx/en_us_goadedes/pe.d099:peMA.Ode3C1H.incipit	@ltx/en_us_goadedes/he.h.m4:heHE.EstereothiIKardiaMouEnKyrio.incipit
ltx/en_us_goadedes/pe.d099:peMA.Ode3C1H.melody	@ltx/en_us_goadedes/he.h.m4:heHE.EstereothiIKardiaMouEnKyrio.melody
ltx/en_us_goadedes/pe.d099:peMA.Ode3C1H.mode	@ltx/en_us_goadedes/miscellanea:misc.Mode4
ltx/en_us_goadedes/pe.d099:peMA.Ode3C1H.ode	@ltx/en_us_goadedes/miscellanea:misc.Ode3
ltx/en_us_goadedes/pe.d099:peMA.Ode3C1H.text	@ltx/en_us_goadedes/he.h.m4:heHE.EstereothiIKardiaMouEnKyrio.text
ltx/en_us_goadedes/pe.d099:peMA.Ode3C1T.incipit	…
ltx/en_us_goadedes/pe.d099:peMA.Ode3C1T.melody	@ltx/en_us_goadedes/he.h.m4:heHE.EstereothiIKardiaMouEnKyrio.name
ltx/en_us_goadedes/pe.d099:peMA.Ode3C1T.mode	@ltx/en_us_goadedes/miscellanea:misc.Mode4
ltx/en_us_goadedes/pe.d099:peMA.Ode3C1T.ode	@ltx/en_us_goadedes/miscellanea:misc.Ode3
ltx/en_us_goadedes/pe.d099:peMA.Ode3C1T.text	
ltx/en_us_goadedes/pe.d099:peMA.Ode3C1Tr.incipit	…
ltx/en_us_goadedes/pe.d099:peMA.Ode3C1Tr.melody	@ltx/en_us_goadedes/he.h.m4:heHE.EstereothiIKardiaMouEnKyrio.name
ltx/en_us_goadedes/pe.d099:peMA.Ode3C1Tr.mode	@ltx/en_us_goadedes/miscellanea:misc.Mode4
ltx/en_us_goadedes/pe.d099:peMA.Ode3C1Tr.ode	@ltx/en_us_goadedes/miscellanea:misc.Ode3
ltx/en_us_goadedes/pe.d099:peMA.Ode3C1Tr.text	
ltx/en_us_goadedes/pe.d099:peMA.Ode3Kathisma1.greekmelody	@ltx/en_us_goadedes/he.a.m4:heAU.OYpsotheisEnToStavro.greekname
ltx/en_us_goadedes/pe.d099:peMA.Ode3Kathisma1.incipit	…
ltx/en_us_goadedes/pe.d099:peMA.Ode3Kathisma1.melody	@ltx/en_us_goadedes/he.a.m4:heAU.OYpsotheisEnToStavro.name
ltx/en_us_goadedes/pe.d099:peMA.Ode3Kathisma1.mode	@ltx/en_us_goadedes/miscellanea:misc.Mode4
ltx/en_us_goadedes/pe.d099:peMA.Ode3Kathisma1.text	
ltx/en_us_goadedes/pe.d099:peMA.Ode3Kathisma2.greekmelody	@ltx/en_us_goadedes/he.a.m4:heAU.OYpsotheisEnToStavro.greekname
ltx/en_us_goadedes/pe.d099:peMA.Ode3Kathisma2.incipit	O Lord and Master…
ltx/en_us_goadedes/pe.d099:peMA.Ode3Kathisma2.melody	@ltx/en_us_goadedes/he.a.m4:heAU.OYpsotheisEnToStavro.name
ltx/en_us_goadedes/pe.d099:peMA.Ode3Kathisma2.mode	@ltx/en_us_goadedes/miscellanea:misc.Mode4
ltx/en_us_goadedes/pe.d099:peMA.Ode3Kathisma2.text	O Lord and Master and the Giver of wisdom, * about the middle of the feast, as is written, * You went up to the Temple in Jerusalem and taught. * You proclaimed to everyone, “Come to me, all you thirsty. * Drink the water I myself provide to all people, * through which you will receive eternal life * and the enjoyment of rivers of divine delight.”
ltx/en_us_goadedes/pe.d099:peMA.Ode4C11.greekmelody	@ltx/en_us_goadedes/he.h.m4:heHE.EisakikoaKyrie.greekname
ltx/en_us_goadedes/pe.d099:peMA.Ode4C11.incipit	…
ltx/en_us_goadedes/pe.d099:peMA.Ode4C11.melody	@ltx/en_us_goadedes/he.h.m4:heHE.EisakikoaKyrie.name
ltx/en_us_goadedes/pe.d099:peMA.Ode4C11.mode	@ltx/en_us_goadedes/miscellanea:misc.Mode4
ltx/en_us_goadedes/pe.d099:peMA.Ode4C11.ode	@ltx/en_us_goadedes/miscellanea:misc.Ode4
ltx/en_us_goadedes/pe.d099:peMA.Ode4C11.text	
ltx/en_us_goadedes/pe.d099:peMA.Ode4C12.incipit	…
ltx/en_us_goadedes/pe.d099:peMA.Ode4C12.melody	@ltx/en_us_goadedes/he.h.m4:heHE.EisakikoaKyrie.name
ltx/en_us_goadedes/pe.d099:peMA.Ode4C12.mode	@ltx/en_us_goadedes/miscellanea:misc.Mode4
ltx/en_us_goadedes/pe.d099:peMA.Ode4C12.ode	@ltx/en_us_goadedes/miscellanea:misc.Ode4
ltx/en_us_goadedes/pe.d099:peMA.Ode4C12.text	
ltx/en_us_goadedes/pe.d099:peMA.Ode4C13.incipit	…
ltx/en_us_goadedes/pe.d099:peMA.Ode4C13.melody	@ltx/en_us_goadedes/he.h.m4:heHE.EisakikoaKyrie.name
ltx/en_us_goadedes/pe.d099:peMA.Ode4C13.mode	@ltx/en_us_goadedes/miscellanea:misc.Mode4
ltx/en_us_goadedes/pe.d099:peMA.Ode4C13.ode	@ltx/en_us_goadedes/miscellanea:misc.Ode4
ltx/en_us_goadedes/pe.d099:peMA.Ode4C13.text	
ltx/en_us_goadedes/pe.d099:peMA.Ode4C1F1.greekmelody	@ltx/en_us_goadedes/he.h.m4:heHE.EisakikoaKyrie.greekname
ltx/en_us_goadedes/pe.d099:peMA.Ode4C1F1.incipit	…
ltx/en_us_goadedes/pe.d099:peMA.Ode4C1F1.melody	@ltx/en_us_goadedes/he.h.m4:heHE.EisakikoaKyrie.name
ltx/en_us_goadedes/pe.d099:peMA.Ode4C1F1.mode	@ltx/en_us_goadedes/miscellanea:misc.Mode4
ltx/en_us_goadedes/pe.d099:peMA.Ode4C1F1.ode	@ltx/en_us_goadedes/miscellanea:misc.Ode4
ltx/en_us_goadedes/pe.d099:peMA.Ode4C1F1.text	
ltx/en_us_goadedes/pe.d099:peMA.Ode4C1H.greekmelody	@ltx/en_us_goadedes/he.h.m4:heHE.EisakikoaKyrie.greekname
ltx/en_us_goadedes/pe.d099:peMA.Ode4C1H.incipit	@ltx/en_us_goadedes/he.h.m4:heHE.EisakikoaKyrie.incipit
ltx/en_us_goadedes/pe.d099:peMA.Ode4C1H.melody	@ltx/en_us_goadedes/he.h.m4:heHE.EisakikoaKyrie.melody
ltx/en_us_goadedes/pe.d099:peMA.Ode4C1H.mode	@ltx/en_us_goadedes/miscellanea:misc.Mode4
ltx/en_us_goadedes/pe.d099:peMA.Ode4C1H.ode	@ltx/en_us_goadedes/miscellanea:misc.Ode4
ltx/en_us_goadedes/pe.d099:peMA.Ode4C1H.text	@ltx/en_us_goadedes/he.h.m4:heHE.EisakikoaKyrie.text
ltx/en_us_goadedes/pe.d099:peMA.Ode4C1T.incipit	…
ltx/en_us_goadedes/pe.d099:peMA.Ode4C1T.melody	@ltx/en_us_goadedes/he.h.m4:heHE.EisakikoaKyrie.name
ltx/en_us_goadedes/pe.d099:peMA.Ode4C1T.mode	@ltx/en_us_goadedes/miscellanea:misc.Mode4
ltx/en_us_goadedes/pe.d099:peMA.Ode4C1T.ode	@ltx/en_us_goadedes/miscellanea:misc.Ode4
ltx/en_us_goadedes/pe.d099:peMA.Ode4C1T.text	
ltx/en_us_goadedes/pe.d099:peMA.Ode4C1Tr.incipit	…
ltx/en_us_goadedes/pe.d099:peMA.Ode4C1Tr.melody	@ltx/en_us_goadedes/he.h.m4:heHE.EisakikoaKyrie.name
ltx/en_us_goadedes/pe.d099:peMA.Ode4C1Tr.mode	@ltx/en_us_goadedes/miscellanea:misc.Mode4
ltx/en_us_goadedes/pe.d099:peMA.Ode4C1Tr.ode	@ltx/en_us_goadedes/miscellanea:misc.Ode4
ltx/en_us_goadedes/pe.d099:peMA.Ode4C1Tr.text	
ltx/en_us_goadedes/pe.d099:peMA.Ode5C11.greekmelody	@ltx/en_us_goadedes/he.h.m4:heHE.AnateilonMoiKyrie.greekname
ltx/en_us_goadedes/pe.d099:peMA.Ode5C11.incipit	…
ltx/en_us_goadedes/pe.d099:peMA.Ode5C11.melody	@ltx/en_us_goadedes/he.h.m4:heHE.AnateilonMoiKyrie.name
ltx/en_us_goadedes/pe.d099:peMA.Ode5C11.mode	@ltx/en_us_goadedes/miscellanea:misc.Mode4
ltx/en_us_goadedes/pe.d099:peMA.Ode5C11.ode	@ltx/en_us_goadedes/miscellanea:misc.Ode5
ltx/en_us_goadedes/pe.d099:peMA.Ode5C11.text	
ltx/en_us_goadedes/pe.d099:peMA.Ode5C12.incipit	…
ltx/en_us_goadedes/pe.d099:peMA.Ode5C12.melody	@ltx/en_us_goadedes/he.h.m4:heHE.AnateilonMoiKyrie.name
ltx/en_us_goadedes/pe.d099:peMA.Ode5C12.mode	@ltx/en_us_goadedes/miscellanea:misc.Mode4
ltx/en_us_goadedes/pe.d099:peMA.Ode5C12.ode	@ltx/en_us_goadedes/miscellanea:misc.Ode5
ltx/en_us_goadedes/pe.d099:peMA.Ode5C12.text	
ltx/en_us_goadedes/pe.d099:peMA.Ode5C13.incipit	…
ltx/en_us_goadedes/pe.d099:peMA.Ode5C13.melody	@ltx/en_us_goadedes/he.h.m4:heHE.AnateilonMoiKyrie.name
ltx/en_us_goadedes/pe.d099:peMA.Ode5C13.mode	@ltx/en_us_goadedes/miscellanea:misc.Mode4
ltx/en_us_goadedes/pe.d099:peMA.Ode5C13.ode	@ltx/en_us_goadedes/miscellanea:misc.Ode5
ltx/en_us_goadedes/pe.d099:peMA.Ode5C13.text	
ltx/en_us_goadedes/pe.d099:peMA.Ode5C1F1.greekmelody	@ltx/en_us_goadedes/he.h.m4:heHE.AnateilonMoiKyrie.greekname
ltx/en_us_goadedes/pe.d099:peMA.Ode5C1F1.incipit	…
ltx/en_us_goadedes/pe.d099:peMA.Ode5C1F1.melody	@ltx/en_us_goadedes/he.h.m4:heHE.AnateilonMoiKyrie.name
ltx/en_us_goadedes/pe.d099:peMA.Ode5C1F1.mode	@ltx/en_us_goadedes/miscellanea:misc.Mode4
ltx/en_us_goadedes/pe.d099:peMA.Ode5C1F1.ode	@ltx/en_us_goadedes/miscellanea:misc.Ode5
ltx/en_us_goadedes/pe.d099:peMA.Ode5C1F1.text	
ltx/en_us_goadedes/pe.d099:peMA.Ode5C1H.greekmelody	@ltx/en_us_goadedes/he.h.m4:heHE.AnateilonMoiKyrie.greekname
ltx/en_us_goadedes/pe.d099:peMA.Ode5C1H.incipit	@ltx/en_us_goadedes/he.h.m4:heHE.AnateilonMoiKyrie.incipit
ltx/en_us_goadedes/pe.d099:peMA.Ode5C1H.melody	@ltx/en_us_goadedes/he.h.m4:heHE.AnateilonMoiKyrie.melody
ltx/en_us_goadedes/pe.d099:peMA.Ode5C1H.mode	@ltx/en_us_goadedes/miscellanea:misc.Mode4
ltx/en_us_goadedes/pe.d099:peMA.Ode5C1H.ode	@ltx/en_us_goadedes/miscellanea:misc.Ode5
ltx/en_us_goadedes/pe.d099:peMA.Ode5C1H.text	@ltx/en_us_goadedes/he.h.m4:heHE.AnateilonMoiKyrie.text
ltx/en_us_goadedes/pe.d099:peMA.Ode5C1T.incipit	…
ltx/en_us_goadedes/pe.d099:peMA.Ode5C1T.melody	@ltx/en_us_goadedes/he.h.m4:heHE.AnateilonMoiKyrie.name
ltx/en_us_goadedes/pe.d099:peMA.Ode5C1T.mode	@ltx/en_us_goadedes/miscellanea:misc.Mode4
ltx/en_us_goadedes/pe.d099:peMA.Ode5C1T.ode	@ltx/en_us_goadedes/miscellanea:misc.Ode5
ltx/en_us_goadedes/pe.d099:peMA.Ode5C1T.text	
ltx/en_us_goadedes/pe.d099:peMA.Ode5C1Tr.incipit	…
ltx/en_us_goadedes/pe.d099:peMA.Ode5C1Tr.melody	@ltx/en_us_goadedes/he.h.m4:heHE.AnateilonMoiKyrie.name
ltx/en_us_goadedes/pe.d099:peMA.Ode5C1Tr.mode	@ltx/en_us_goadedes/miscellanea:misc.Mode4
ltx/en_us_goadedes/pe.d099:peMA.Ode5C1Tr.ode	@ltx/en_us_goadedes/miscellanea:misc.Ode5
ltx/en_us_goadedes/pe.d099:peMA.Ode5C1Tr.text	
ltx/en_us_goadedes/pe.d099:peMA.Ode6C11.greekmelody	@ltx/en_us_goadedes/he.h.m4:heHE.MiKatapontisato.greekname
ltx/en_us_goadedes/pe.d099:peMA.Ode6C11.incipit	Transgressors of the Law…
ltx/en_us_goadedes/pe.d099:peMA.Ode6C11.melody	@ltx/en_us_goadedes/he.h.m4:heHE.MiKatapontisato.name
ltx/en_us_goadedes/pe.d099:peMA.Ode6C11.mode	@ltx/en_us_goadedes/miscellanea:misc.Mode4
ltx/en_us_goadedes/pe.d099:peMA.Ode6C11.ode	@ltx/en_us_goadedes/miscellanea:misc.Ode6
ltx/en_us_goadedes/pe.d099:peMA.Ode6C11.text	Transgressors of the Law had You, Jesus Christ, crucified; * a Roman soldier pierced You in the side, * and You were buried in a new, unused tomb by the respected Joseph. * O Savior, when with glory You arose, * with yourself You also raised all creation, which lauded Your might, O Lord.
ltx/en_us_goadedes/pe.d099:peMA.Ode6C12.incipit	…
ltx/en_us_goadedes/pe.d099:peMA.Ode6C12.melody	@ltx/en_us_goadedes/he.h.m4:heHE.MiKatapontisato.name
ltx/en_us_goadedes/pe.d099:peMA.Ode6C12.mode	@ltx/en_us_goadedes/miscellanea:misc.Mode4
ltx/en_us_goadedes/pe.d099:peMA.Ode6C12.ode	@ltx/en_us_goadedes/miscellanea:misc.Ode6
ltx/en_us_goadedes/pe.d099:peMA.Ode6C12.text	
ltx/en_us_goadedes/pe.d099:peMA.Ode6C13.incipit	…
ltx/en_us_goadedes/pe.d099:peMA.Ode6C13.melody	@ltx/en_us_goadedes/he.h.m4:heHE.MiKatapontisato.name
ltx/en_us_goadedes/pe.d099:peMA.Ode6C13.mode	@ltx/en_us_goadedes/miscellanea:misc.Mode4
ltx/en_us_goadedes/pe.d099:peMA.Ode6C13.ode	@ltx/en_us_goadedes/miscellanea:misc.Ode6
ltx/en_us_goadedes/pe.d099:peMA.Ode6C13.text	
ltx/en_us_goadedes/pe.d099:peMA.Ode6C1F1.greekmelody	@ltx/en_us_goadedes/he.h.m4:heHE.MiKatapontisato.greekname
ltx/en_us_goadedes/pe.d099:peMA.Ode6C1F1.incipit	…
ltx/en_us_goadedes/pe.d099:peMA.Ode6C1F1.melody	@ltx/en_us_goadedes/he.h.m4:heHE.MiKatapontisato.name
ltx/en_us_goadedes/pe.d099:peMA.Ode6C1F1.mode	@ltx/en_us_goadedes/miscellanea:misc.Mode4
ltx/en_us_goadedes/pe.d099:peMA.Ode6C1F1.ode	@ltx/en_us_goadedes/miscellanea:misc.Ode6
ltx/en_us_goadedes/pe.d099:peMA.Ode6C1F1.text	As You are the most copious stream of life, Lord our God, * and ocean of mercy and tender love, * and being wearied with Your journey, You sat down beside the well of Jacob. * To the Samaritan woman You said, * “Give me water to drink, that You may receive the waters of forgiveness.”
ltx/en_us_goadedes/pe.d099:peMA.Ode6C1H.greekmelody	@ltx/en_us_goadedes/he.h.m4:heHE.MiKatapontisato.greekname
ltx/en_us_goadedes/pe.d099:peMA.Ode6C1H.incipit	@ltx/en_us_goadedes/he.h.m4:heHE.MiKatapontisato.incipit
ltx/en_us_goadedes/pe.d099:peMA.Ode6C1H.melody	@ltx/en_us_goadedes/he.h.m4:heHE.MiKatapontisato.melody
ltx/en_us_goadedes/pe.d099:peMA.Ode6C1H.mode	@ltx/en_us_goadedes/miscellanea:misc.Mode4
ltx/en_us_goadedes/pe.d099:peMA.Ode6C1H.ode	@ltx/en_us_goadedes/miscellanea:misc.Ode6
ltx/en_us_goadedes/pe.d099:peMA.Ode6C1H.text	@ltx/en_us_goadedes/he.h.m4:heHE.MiKatapontisato.text
ltx/en_us_goadedes/pe.d099:peMA.Ode6C1T.incipit	…
ltx/en_us_goadedes/pe.d099:peMA.Ode6C1T.melody	@ltx/en_us_goadedes/he.h.m4:heHE.MiKatapontisato.name
ltx/en_us_goadedes/pe.d099:peMA.Ode6C1T.mode	@ltx/en_us_goadedes/miscellanea:misc.Mode4
ltx/en_us_goadedes/pe.d099:peMA.Ode6C1T.ode	@ltx/en_us_goadedes/miscellanea:misc.Ode6
ltx/en_us_goadedes/pe.d099:peMA.Ode6C1T.text	O Lady, we all sing your praise. Only you bore a child * and preserved your virginity intact. * You were prefigured by items in Scripture: * throne of the Lord, the mountain, the gate, the lamp, the bright chamber of God, * glorious Tabernacle, jar and table and Ark of the covenant.
ltx/en_us_goadedes/pe.d099:peMA.Ode6C1Tr.incipit	…
ltx/en_us_goadedes/pe.d099:peMA.Ode6C1Tr.melody	@ltx/en_us_goadedes/he.h.m4:heHE.MiKatapontisato.name
ltx/en_us_goadedes/pe.d099:peMA.Ode6C1Tr.mode	@ltx/en_us_goadedes/miscellanea:misc.Mode4
ltx/en_us_goadedes/pe.d099:peMA.Ode6C1Tr.ode	@ltx/en_us_goadedes/miscellanea:misc.Ode6
ltx/en_us_goadedes/pe.d099:peMA.Ode6C1Tr.text	Joining the incorporeal hosts on high, faithfully * I praise the Holy Trinity, one God, * creator and sustainer of the whole world: * unoriginate Father, His coequal and co-eternal Son, * and the consubstantial Spirit: the one essence, nature, glory, and rule.
ltx/en_us_goadedes/pe.d099:peMA.Ode7C11.greekmelody	@ltx/en_us_goadedes/he.h.m4:heHE.MiParadoisImas.greekname
ltx/en_us_goadedes/pe.d099:peMA.Ode7C11.incipit	…
ltx/en_us_goadedes/pe.d099:peMA.Ode7C11.melody	@ltx/en_us_goadedes/he.h.m4:heHE.MiParadoisImas.name
ltx/en_us_goadedes/pe.d099:peMA.Ode7C11.mode	@ltx/en_us_goadedes/miscellanea:misc.Mode4
ltx/en_us_goadedes/pe.d099:peMA.Ode7C11.ode	@ltx/en_us_goadedes/miscellanea:misc.Ode7
ltx/en_us_goadedes/pe.d099:peMA.Ode7C11.text	
ltx/en_us_goadedes/pe.d099:peMA.Ode7C12.incipit	…
ltx/en_us_goadedes/pe.d099:peMA.Ode7C12.melody	@ltx/en_us_goadedes/he.h.m4:heHE.MiParadoisImas.name
ltx/en_us_goadedes/pe.d099:peMA.Ode7C12.mode	@ltx/en_us_goadedes/miscellanea:misc.Mode4
ltx/en_us_goadedes/pe.d099:peMA.Ode7C12.ode	@ltx/en_us_goadedes/miscellanea:misc.Ode7
ltx/en_us_goadedes/pe.d099:peMA.Ode7C12.text	
ltx/en_us_goadedes/pe.d099:peMA.Ode7C13.incipit	…
ltx/en_us_goadedes/pe.d099:peMA.Ode7C13.melody	@ltx/en_us_goadedes/he.h.m4:heHE.MiParadoisImas.name
ltx/en_us_goadedes/pe.d099:peMA.Ode7C13.mode	@ltx/en_us_goadedes/miscellanea:misc.Mode4
ltx/en_us_goadedes/pe.d099:peMA.Ode7C13.ode	@ltx/en_us_goadedes/miscellanea:misc.Ode7
ltx/en_us_goadedes/pe.d099:peMA.Ode7C13.text	
ltx/en_us_goadedes/pe.d099:peMA.Ode7C1F1.greekmelody	@ltx/en_us_goadedes/he.h.m4:heHE.MiParadoisImas.greekname
ltx/en_us_goadedes/pe.d099:peMA.Ode7C1F1.incipit	…
ltx/en_us_goadedes/pe.d099:peMA.Ode7C1F1.melody	@ltx/en_us_goadedes/he.h.m4:heHE.MiParadoisImas.name
ltx/en_us_goadedes/pe.d099:peMA.Ode7C1F1.mode	@ltx/en_us_goadedes/miscellanea:misc.Mode4
ltx/en_us_goadedes/pe.d099:peMA.Ode7C1F1.ode	@ltx/en_us_goadedes/miscellanea:misc.Ode7
ltx/en_us_goadedes/pe.d099:peMA.Ode7C1F1.text	
ltx/en_us_goadedes/pe.d099:peMA.Ode7C1H.greekmelody	@ltx/en_us_goadedes/he.h.m4:heHE.MiParadoisImas.greekname
ltx/en_us_goadedes/pe.d099:peMA.Ode7C1H.incipit	@ltx/en_us_goadedes/he.h.m4:heHE.MiParadoisImas.incipit
ltx/en_us_goadedes/pe.d099:peMA.Ode7C1H.melody	@ltx/en_us_goadedes/he.h.m4:heHE.MiParadoisImas.melody
ltx/en_us_goadedes/pe.d099:peMA.Ode7C1H.mode	@ltx/en_us_goadedes/miscellanea:misc.Mode4
ltx/en_us_goadedes/pe.d099:peMA.Ode7C1H.ode	@ltx/en_us_goadedes/miscellanea:misc.Ode7
ltx/en_us_goadedes/pe.d099:peMA.Ode7C1H.text	@ltx/en_us_goadedes/he.h.m4:heHE.MiParadoisImas.text
ltx/en_us_goadedes/pe.d099:peMA.Ode7C1T.incipit	…
ltx/en_us_goadedes/pe.d099:peMA.Ode7C1T.melody	@ltx/en_us_goadedes/he.h.m4:heHE.MiParadoisImas.name
ltx/en_us_goadedes/pe.d099:peMA.Ode7C1T.mode	@ltx/en_us_goadedes/miscellanea:misc.Mode4
ltx/en_us_goadedes/pe.d099:peMA.Ode7C1T.ode	@ltx/en_us_goadedes/miscellanea:misc.Ode7
ltx/en_us_goadedes/pe.d099:peMA.Ode7C1T.text	
ltx/en_us_goadedes/pe.d099:peMA.Ode7C1Tr.incipit	…
ltx/en_us_goadedes/pe.d099:peMA.Ode7C1Tr.melody	@ltx/en_us_goadedes/he.h.m4:heHE.MiParadoisImas.name
ltx/en_us_goadedes/pe.d099:peMA.Ode7C1Tr.mode	@ltx/en_us_goadedes/miscellanea:misc.Mode4
ltx/en_us_goadedes/pe.d099:peMA.Ode7C1Tr.ode	@ltx/en_us_goadedes/miscellanea:misc.Ode7
ltx/en_us_goadedes/pe.d099:peMA.Ode7C1Tr.text	
ltx/en_us_goadedes/pe.d099:peMA.Ode8C11.greekmelody	@ltx/en_us_goadedes/he.h.m4:heHE.TaSympantaDespota.greekname
ltx/en_us_goadedes/pe.d099:peMA.Ode8C11.incipit	…
ltx/en_us_goadedes/pe.d099:peMA.Ode8C11.melody	@ltx/en_us_goadedes/he.h.m4:heHE.TaSympantaDespota.name
ltx/en_us_goadedes/pe.d099:peMA.Ode8C11.mode	@ltx/en_us_goadedes/miscellanea:misc.Mode4
ltx/en_us_goadedes/pe.d099:peMA.Ode8C11.ode	@ltx/en_us_goadedes/miscellanea:misc.Ode8
ltx/en_us_goadedes/pe.d099:peMA.Ode8C11.text	
ltx/en_us_goadedes/pe.d099:peMA.Ode8C12.incipit	…
ltx/en_us_goadedes/pe.d099:peMA.Ode8C12.melody	@ltx/en_us_goadedes/he.h.m4:heHE.TaSympantaDespota.name
ltx/en_us_goadedes/pe.d099:peMA.Ode8C12.mode	@ltx/en_us_goadedes/miscellanea:misc.Mode4
ltx/en_us_goadedes/pe.d099:peMA.Ode8C12.ode	@ltx/en_us_goadedes/miscellanea:misc.Ode8
ltx/en_us_goadedes/pe.d099:peMA.Ode8C12.text	
ltx/en_us_goadedes/pe.d099:peMA.Ode8C13.incipit	…
ltx/en_us_goadedes/pe.d099:peMA.Ode8C13.melody	@ltx/en_us_goadedes/he.h.m4:heHE.TaSympantaDespota.name
ltx/en_us_goadedes/pe.d099:peMA.Ode8C13.mode	@ltx/en_us_goadedes/miscellanea:misc.Mode4
ltx/en_us_goadedes/pe.d099:peMA.Ode8C13.ode	@ltx/en_us_goadedes/miscellanea:misc.Ode8
ltx/en_us_goadedes/pe.d099:peMA.Ode8C13.text	
ltx/en_us_goadedes/pe.d099:peMA.Ode8C1F1.greekmelody	@ltx/en_us_goadedes/he.h.m4:heHE.TaSympantaDespota.greekname
ltx/en_us_goadedes/pe.d099:peMA.Ode8C1F1.incipit	…
ltx/en_us_goadedes/pe.d099:peMA.Ode8C1F1.melody	@ltx/en_us_goadedes/he.h.m4:heHE.TaSympantaDespota.name
ltx/en_us_goadedes/pe.d099:peMA.Ode8C1F1.mode	@ltx/en_us_goadedes/miscellanea:misc.Mode4
ltx/en_us_goadedes/pe.d099:peMA.Ode8C1F1.ode	@ltx/en_us_goadedes/miscellanea:misc.Ode8
ltx/en_us_goadedes/pe.d099:peMA.Ode8C1F1.text	
ltx/en_us_goadedes/pe.d099:peMA.Ode8C1H.greekmelody	@ltx/en_us_goadedes/he.h.m4:heHE.TaSympantaDespota.greekname
ltx/en_us_goadedes/pe.d099:peMA.Ode8C1H.incipit	@ltx/en_us_goadedes/he.h.m4:heHE.TaSympantaDespota.incipit
ltx/en_us_goadedes/pe.d099:peMA.Ode8C1H.melody	@ltx/en_us_goadedes/he.h.m4:heHE.TaSympantaDespota.melody
ltx/en_us_goadedes/pe.d099:peMA.Ode8C1H.mode	@ltx/en_us_goadedes/miscellanea:misc.Mode4
ltx/en_us_goadedes/pe.d099:peMA.Ode8C1H.ode	@ltx/en_us_goadedes/miscellanea:misc.Ode8
ltx/en_us_goadedes/pe.d099:peMA.Ode8C1H.text	@ltx/en_us_goadedes/he.h.m4:heHE.TaSympantaDespota.text
ltx/en_us_goadedes/pe.d099:peMA.Ode8C1T.incipit	…
ltx/en_us_goadedes/pe.d099:peMA.Ode8C1T.melody	@ltx/en_us_goadedes/he.h.m4:heHE.TaSympantaDespota.name
ltx/en_us_goadedes/pe.d099:peMA.Ode8C1T.mode	@ltx/en_us_goadedes/miscellanea:misc.Mode4
ltx/en_us_goadedes/pe.d099:peMA.Ode8C1T.ode	@ltx/en_us_goadedes/miscellanea:misc.Ode8
ltx/en_us_goadedes/pe.d099:peMA.Ode8C1T.text	
ltx/en_us_goadedes/pe.d099:peMA.Ode8C1Tr.incipit	…
ltx/en_us_goadedes/pe.d099:peMA.Ode8C1Tr.melody	@ltx/en_us_goadedes/he.h.m4:heHE.TaSympantaDespota.name
ltx/en_us_goadedes/pe.d099:peMA.Ode8C1Tr.mode	@ltx/en_us_goadedes/miscellanea:misc.Mode4
ltx/en_us_goadedes/pe.d099:peMA.Ode8C1Tr.ode	@ltx/en_us_goadedes/miscellanea:misc.Ode8
ltx/en_us_goadedes/pe.d099:peMA.Ode8C1Tr.text	
ltx/en_us_goadedes/pe.d099:peMA.Ode9C11.greekmelody	@ltx/en_us_goadedes/he.h.m4:heHE.EpoiiseKratos.greekname
ltx/en_us_goadedes/pe.d099:peMA.Ode9C11.incipit	…
ltx/en_us_goadedes/pe.d099:peMA.Ode9C11.melody	@ltx/en_us_goadedes/he.h.m4:heHE.EpoiiseKratos.name
ltx/en_us_goadedes/pe.d099:peMA.Ode9C11.mode	@ltx/en_us_goadedes/miscellanea:misc.Mode4
ltx/en_us_goadedes/pe.d099:peMA.Ode9C11.ode	@ltx/en_us_goadedes/miscellanea:misc.Ode9
ltx/en_us_goadedes/pe.d099:peMA.Ode9C11.text	
ltx/en_us_goadedes/pe.d099:peMA.Ode9C12.incipit	…
ltx/en_us_goadedes/pe.d099:peMA.Ode9C12.melody	@ltx/en_us_goadedes/he.h.m4:heHE.EpoiiseKratos.name
ltx/en_us_goadedes/pe.d099:peMA.Ode9C12.mode	@ltx/en_us_goadedes/miscellanea:misc.Mode4
ltx/en_us_goadedes/pe.d099:peMA.Ode9C12.ode	@ltx/en_us_goadedes/miscellanea:misc.Ode9
ltx/en_us_goadedes/pe.d099:peMA.Ode9C12.text	
ltx/en_us_goadedes/pe.d099:peMA.Ode9C13.incipit	…
ltx/en_us_goadedes/pe.d099:peMA.Ode9C13.melody	@ltx/en_us_goadedes/he.h.m4:heHE.EpoiiseKratos.name
ltx/en_us_goadedes/pe.d099:peMA.Ode9C13.mode	@ltx/en_us_goadedes/miscellanea:misc.Mode4
ltx/en_us_goadedes/pe.d099:peMA.Ode9C13.ode	@ltx/en_us_goadedes/miscellanea:misc.Ode9
ltx/en_us_goadedes/pe.d099:peMA.Ode9C13.text	
ltx/en_us_goadedes/pe.d099:peMA.Ode9C1F1.greekmelody	@ltx/en_us_goadedes/he.h.m4:heHE.EpoiiseKratos.greekname
ltx/en_us_goadedes/pe.d099:peMA.Ode9C1F1.incipit	…
ltx/en_us_goadedes/pe.d099:peMA.Ode9C1F1.melody	@ltx/en_us_goadedes/he.h.m4:heHE.EpoiiseKratos.name
ltx/en_us_goadedes/pe.d099:peMA.Ode9C1F1.mode	@ltx/en_us_goadedes/miscellanea:misc.Mode4
ltx/en_us_goadedes/pe.d099:peMA.Ode9C1F1.ode	@ltx/en_us_goadedes/miscellanea:misc.Ode9
ltx/en_us_goadedes/pe.d099:peMA.Ode9C1F1.text	
ltx/en_us_goadedes/pe.d099:peMA.Ode9C1H.greekmelody	@ltx/en_us_goadedes/he.h.m4:heHE.EpoiiseKratos.greekname
ltx/en_us_goadedes/pe.d099:peMA.Ode9C1H.incipit	@ltx/en_us_goadedes/he.h.m4:heHE.EpoiiseKratos.incipit
ltx/en_us_goadedes/pe.d099:peMA.Ode9C1H.melody	@ltx/en_us_goadedes/he.h.m4:heHE.EpoiiseKratos.melody
ltx/en_us_goadedes/pe.d099:peMA.Ode9C1H.mode	@ltx/en_us_goadedes/miscellanea:misc.Mode4
ltx/en_us_goadedes/pe.d099:peMA.Ode9C1H.ode	@ltx/en_us_goadedes/miscellanea:misc.Ode9
ltx/en_us_goadedes/pe.d099:peMA.Ode9C1H.text	@ltx/en_us_goadedes/he.h.m4:heHE.EpoiiseKratos.text
ltx/en_us_goadedes/pe.d099:peMA.Ode9C1T.incipit	…
ltx/en_us_goadedes/pe.d099:peMA.Ode9C1T.melody	@ltx/en_us_goadedes/he.h.m4:heHE.EpoiiseKratos.name
ltx/en_us_goadedes/pe.d099:peMA.Ode9C1T.mode	@ltx/en_us_goadedes/miscellanea:misc.Mode4
ltx/en_us_goadedes/pe.d099:peMA.Ode9C1T.ode	@ltx/en_us_goadedes/miscellanea:misc.Ode9
ltx/en_us_goadedes/pe.d099:peMA.Ode9C1T.text	
ltx/en_us_goadedes/pe.d099:peMA.Ode9C1Tr.incipit	…
ltx/en_us_goadedes/pe.d099:peMA.Ode9C1Tr.melody	@ltx/en_us_goadedes/he.h.m4:heHE.EpoiiseKratos.name
ltx/en_us_goadedes/pe.d099:peMA.Ode9C1Tr.mode	@ltx/en_us_goadedes/miscellanea:misc.Mode4
ltx/en_us_goadedes/pe.d099:peMA.Ode9C1Tr.ode	@ltx/en_us_goadedes/miscellanea:misc.Ode9
ltx/en_us_goadedes/pe.d099:peMA.Ode9C1Tr.text	
ltx/en_us_goadedes/pe.d099:peMA.Oikos1.text	
ltx/en_us_goadedes/pe.d099:peSY.commemoration.couplet1.title	@ltx/en_us_goadedes/titles:ti.Verses
ltx/en_us_goadedes/pe.d099:peSY.commemoration.couplet1.verse1	
ltx/en_us_goadedes/pe.d099:peSY.commemoration.couplet1.verse2	
ltx/en_us_goadedes/pe.d099:peSY.commemoration.narration.p01	
ltx/en_us_goadedes/pe.d099:peSY.commemoration.narration.p02	
ltx/en_us_goadedes/pe.d099:peSY.commemoration.narration.p03	
ltx/en_us_goadedes/pe.d099:peSY.commemoration.narration.p04	
ltx/en_us_goadedes/pe.d099:peSY.commemoration.narration.p05	
ltx/en_us_goadedes/pe.d099:peSY.commemoration.narration.p06	
ltx/en_us_goadedes/pe.d099:peSY.commemoration.narration.p07	
ltx/en_us_goadedes/pe.d099:peSY.commemoration.text	
ltx/en_us_goadedes/pe.d099:peSY.lastline	
ltx/en_us_goadedes/pe.d099:peVE.Apolytikion1.incipit	@ltx/en_us_goadedes/oc.m4.d1:ocVE.Apolytikion.incipit
ltx/en_us_goadedes/pe.d099:peVE.Apolytikion1.melody	
ltx/en_us_goadedes/pe.d099:peVE.Apolytikion1.mode	@ltx/en_us_goadedes/miscellanea:misc.Mode4
ltx/en_us_goadedes/pe.d099:peVE.Apolytikion1.text	@ltx/en_us_goadedes/oc.m4.d1:ocVE.Apolytikion.text
ltx/en_us_goadedes/pe.d099:peVE.Apolytikion2.incipit	@ltx/en_us_goadedes/pe.d095:peVE.Apolytikion1.incipit
ltx/en_us_goadedes/pe.d099:peVE.Apolytikion2.melody	
ltx/en_us_goadedes/pe.d099:peVE.Apolytikion2.mode	@ltx/en_us_goadedes/miscellanea:misc.Mode8
ltx/en_us_goadedes/pe.d099:peVE.Apolytikion2.text	@ltx/en_us_goadedes/pe.d095:peVE.Apolytikion1.text
ltx/en_us_goadedes/pe.d099:peVE.AposGlory.incipit	…
ltx/en_us_goadedes/pe.d099:peVE.AposGlory.melody	@ltx/en_us_goadedes/miscellanea:misc.Idiomelon
ltx/en_us_goadedes/pe.d099:peVE.AposGlory.mode	@ltx/en_us_goadedes/miscellanea:misc.Mode8
ltx/en_us_goadedes/pe.d099:peVE.AposGlory.text	
ltx/en_us_goadedes/pe.d099:peVE.LityGlory.incipit	…
ltx/en_us_goadedes/pe.d099:peVE.LityGlory.melody	@ltx/en_us_goadedes/miscellanea:misc.Idiomelon
ltx/en_us_goadedes/pe.d099:peVE.LityGlory.mode	@ltx/en_us_goadedes/miscellanea:misc.Mode3
ltx/en_us_goadedes/pe.d099:peVE.LityGlory.text	
ltx/en_us_goadedes/pe.d099:peVE.SticGlory.incipit	…
ltx/en_us_goadedes/pe.d099:peVE.SticGlory.melody	@ltx/en_us_goadedes/miscellanea:misc.Idiomelon
ltx/en_us_goadedes/pe.d099:peVE.SticGlory.mode	@ltx/en_us_goadedes/miscellanea:misc.Mode6
ltx/en_us_goadedes/pe.d099:peVE.SticGlory.text	
ltx/en_us_goadedes/pe.d099:peVE.Stichera05.greekmelody	@ltx/en_us_goadedes/he.a.m4:heAU.KyrieAnelthonEnToStavro.greekname
ltx/en_us_goadedes/pe.d099:peVE.Stichera05.incipit	@ltx/en_us_goadedes/pe.d095:peVE.Stichera01.incipit
ltx/en_us_goadedes/pe.d099:peVE.Stichera05.melody	@ltx/en_us_goadedes/he.a.m4:heAU.KyrieAnelthonEnToStavro.name
ltx/en_us_goadedes/pe.d099:peVE.Stichera05.mode	@ltx/en_us_goadedes/miscellanea:misc.Mode4
ltx/en_us_goadedes/pe.d099:peVE.Stichera05.text	@ltx/en_us_goadedes/pe.d095:peVE.Stichera01.text
ltx/en_us_goadedes/pe.d099:peVE.Stichera06.incipit	@ltx/en_us_goadedes/pe.d095:peVE.Stichera02.incipit
ltx/en_us_goadedes/pe.d099:peVE.Stichera06.melody	@ltx/en_us_goadedes/he.a.m4:heAU.KyrieAnelthonEnToStavro.name
ltx/en_us_goadedes/pe.d099:peVE.Stichera06.mode	@ltx/en_us_goadedes/miscellanea:misc.Mode4
ltx/en_us_goadedes/pe.d099:peVE.Stichera06.text	@ltx/en_us_goadedes/pe.d095:peVE.Stichera02.text
ltx/en_us_goadedes/pe.d099:peVE.Stichera07.greekmelody	@ltx/en_us_goadedes/he.a.m4:heAU.KyrieAnelthonEnToStavro.greekname
ltx/en_us_goadedes/pe.d099:peVE.Stichera07.incipit	@ltx/en_us_goadedes/pe.d095:peVE.Stichera03.incipit
ltx/en_us_goadedes/pe.d099:peVE.Stichera07.melody	@ltx/en_us_goadedes/he.a.m4:heAU.KyrieAnelthonEnToStavro.name
ltx/en_us_goadedes/pe.d099:peVE.Stichera07.mode	@ltx/en_us_goadedes/miscellanea:misc.Mode4
ltx/en_us_goadedes/pe.d099:peVE.Stichera07.text	@ltx/en_us_goadedes/pe.d095:peVE.Stichera03.text
ltx/en_us_goadedes/pe.d099:peVE.Stichera08.incipit	…
ltx/en_us_goadedes/pe.d099:peVE.Stichera08.melody	@ltx/en_us_goadedes/miscellanea:misc.Idiomelon
ltx/en_us_goadedes/pe.d099:peVE.Stichera08.mode	@ltx/en_us_goadedes/miscellanea:misc.Mode1
ltx/en_us_goadedes/pe.d099:peVE.Stichera08.text	
ltx/en_us_goadedes/pe.d099:peVE.Stichera09.incipit	…
ltx/en_us_goadedes/pe.d099:peVE.Stichera09.melody	@ltx/en_us_goadedes/miscellanea:misc.Idiomelon
ltx/en_us_goadedes/pe.d099:peVE.Stichera09.mode	@ltx/en_us_goadedes/miscellanea:misc.Mode2
ltx/en_us_goadedes/pe.d099:peVE.Stichera09.text	
ltx/en_us_goadedes/pe.d099:peVE.Stichera10.incipit	…
ltx/en_us_goadedes/pe.d099:peVE.Stichera10.melody	@ltx/en_us_goadedes/miscellanea:misc.Idiomelon
ltx/en_us_goadedes/pe.d099:peVE.Stichera10.mode	@ltx/en_us_goadedes/miscellanea:misc.Mode2
ltx/en_us_goadedes/pe.d099:peVE.Stichera10.text	
