ltx/en_us_goadedes/me.m02.d13:meDA.commemoration.first	
ltx/en_us_goadedes/me.m02.d13:meDA.commemoration.first_name	
ltx/en_us_goadedes/me.m02.d13:meDA.commemoration.first_short	
ltx/en_us_goadedes/me.m02.d13:meDA.commemoration.first_title	@ltx/en_us_goadedes/titles:ti.DevoutSaintM
ltx/en_us_goadedes/me.m02.d13:meDA.commemoration.full	
ltx/en_us_goadedes/me.m02.d13:meDA.commemoration.second_name	
ltx/en_us_goadedes/me.m02.d13:meDA.commemoration.second_title	
ltx/en_us_goadedes/me.m02.d13:meDA.date	
ltx/en_us_goadedes/me.m02.d13:meDA.fordate	
ltx/en_us_goadedes/me.m02.d13:meDA.insert1	
ltx/en_us_goadedes/me.m02.d13:meDA.insert2	
ltx/en_us_goadedes/me.m02.d13:meDA.note	
ltx/en_us_goadedes/me.m02.d13:meDA.pdfcoverdate	
ltx/en_us_goadedes/me.m02.d13:meDA.pdfheaderdate	
ltx/en_us_goadedes/me.m02.d13:meHO.commemorations	
ltx/en_us_goadedes/me.m02.d13:meHO.note1	
ltx/en_us_goadedes/me.m02.d13:meHO.note2	
ltx/en_us_goadedes/me.m02.d13:meHO.number	
ltx/en_us_goadedes/me.m02.d13:meHO.rank	
ltx/en_us_goadedes/me.m02.d13:meLE.commemoration1	
ltx/en_us_goadedes/me.m02.d13:meLE.commemoration2	
ltx/en_us_goadedes/me.m02.d13:meLI.Kontakion1.greekmelody	@ltx/en_us_goadedes/me.m02.d13:meMA.Kontakion1.greekmelody
ltx/en_us_goadedes/me.m02.d13:meLI.Kontakion1.incipit	@ltx/en_us_goadedes/me.m02.d13:meMA.Kontakion1.incipit
ltx/en_us_goadedes/me.m02.d13:meLI.Kontakion1.melody	@ltx/en_us_goadedes/me.m02.d13:meMA.Kontakion1.melody
ltx/en_us_goadedes/me.m02.d13:meLI.Kontakion1.mode	@ltx/en_us_goadedes/me.m02.d13:meMA.Kontakion1.mode
ltx/en_us_goadedes/me.m02.d13:meLI.Kontakion1.text	@ltx/en_us_goadedes/me.m02.d13:meMA.Kontakion1.text
ltx/en_us_goadedes/me.m02.d13:meLI.Megalynarion.text	
ltx/en_us_goadedes/me.m02.d13:meMA.C1.acrostic.notice1	
ltx/en_us_goadedes/me.m02.d13:meMA.C1.acrostic.text	
ltx/en_us_goadedes/me.m02.d13:meMA.C1.acrostic.title	
ltx/en_us_goadedes/me.m02.d13:meMA.C1.poet	@ltx/en_us_goadedes/poets:po.Theofanous
ltx/en_us_goadedes/me.m02.d13:meMA.C1.title	@ltx/en_us_goadedes/titles:ti.CanonDevoutM
ltx/en_us_goadedes/me.m02.d13:meMA.C1.verse	@ltx/en_us_goadedes/prayers:pr.verse_DevoutMan.text
ltx/en_us_goadedes/me.m02.d13:meMA.ExapTheotokion.incipit	…
ltx/en_us_goadedes/me.m02.d13:meMA.ExapTheotokion.melody	@ltx/en_us_goadedes/he.a.m3:heAU.OOuranonToisAstrois.name
ltx/en_us_goadedes/me.m02.d13:meMA.ExapTheotokion.mode	@ltx/en_us_goadedes/miscellanea:misc.Mode3
ltx/en_us_goadedes/me.m02.d13:meMA.ExapTheotokion.text	
ltx/en_us_goadedes/me.m02.d13:meMA.Exaposteilarion1.greekmelody	@ltx/en_us_goadedes/he.a.m3:heAU.OOuranonToisAstrois.greekname
ltx/en_us_goadedes/me.m02.d13:meMA.Exaposteilarion1.incipit	…
ltx/en_us_goadedes/me.m02.d13:meMA.Exaposteilarion1.melody	@ltx/en_us_goadedes/he.a.m3:heAU.OOuranonToisAstrois.name
ltx/en_us_goadedes/me.m02.d13:meMA.Exaposteilarion1.mode	@ltx/en_us_goadedes/miscellanea:misc.Mode3
ltx/en_us_goadedes/me.m02.d13:meMA.Exaposteilarion1.text	
ltx/en_us_goadedes/me.m02.d13:meMA.Kontakion1.greekmelody	@ltx/en_us_goadedes/he.a.m2:heAU.TousAsfaleis.greekname
ltx/en_us_goadedes/me.m02.d13:meMA.Kontakion1.incipit	…
ltx/en_us_goadedes/me.m02.d13:meMA.Kontakion1.melody	@ltx/en_us_goadedes/he.a.m2:heAU.TousAsfaleis.name
ltx/en_us_goadedes/me.m02.d13:meMA.Kontakion1.mode	@ltx/en_us_goadedes/miscellanea:misc.Mode2
ltx/en_us_goadedes/me.m02.d13:meMA.Kontakion1.text	
ltx/en_us_goadedes/me.m02.d13:meMA.Ode1C11.greekmelody	@ltx/en_us_goadedes/he.h.m4:heHE.ThalassisToErythraion.greekname
ltx/en_us_goadedes/me.m02.d13:meMA.Ode1C11.incipit	…
ltx/en_us_goadedes/me.m02.d13:meMA.Ode1C11.melody	@ltx/en_us_goadedes/he.h.m4:heHE.ThalassisToErythraion.name
ltx/en_us_goadedes/me.m02.d13:meMA.Ode1C11.mode	@ltx/en_us_goadedes/miscellanea:misc.Mode4
ltx/en_us_goadedes/me.m02.d13:meMA.Ode1C11.ode	@ltx/en_us_goadedes/miscellanea:misc.Ode1
ltx/en_us_goadedes/me.m02.d13:meMA.Ode1C11.text	
ltx/en_us_goadedes/me.m02.d13:meMA.Ode1C12.incipit	…
ltx/en_us_goadedes/me.m02.d13:meMA.Ode1C12.melody	@ltx/en_us_goadedes/he.h.m4:heHE.ThalassisToErythraion.name
ltx/en_us_goadedes/me.m02.d13:meMA.Ode1C12.mode	@ltx/en_us_goadedes/miscellanea:misc.Mode4
ltx/en_us_goadedes/me.m02.d13:meMA.Ode1C12.ode	@ltx/en_us_goadedes/miscellanea:misc.Ode1
ltx/en_us_goadedes/me.m02.d13:meMA.Ode1C12.text	
ltx/en_us_goadedes/me.m02.d13:meMA.Ode1C13.incipit	…
ltx/en_us_goadedes/me.m02.d13:meMA.Ode1C13.melody	@ltx/en_us_goadedes/he.h.m4:heHE.ThalassisToErythraion.name
ltx/en_us_goadedes/me.m02.d13:meMA.Ode1C13.mode	@ltx/en_us_goadedes/miscellanea:misc.Mode4
ltx/en_us_goadedes/me.m02.d13:meMA.Ode1C13.ode	@ltx/en_us_goadedes/miscellanea:misc.Ode1
ltx/en_us_goadedes/me.m02.d13:meMA.Ode1C13.text	
ltx/en_us_goadedes/me.m02.d13:meMA.Ode1C1H.greekmelody	@ltx/en_us_goadedes/he.h.m4:heHE.ThalassisToErythraion.greekname
ltx/en_us_goadedes/me.m02.d13:meMA.Ode1C1H.incipit	@ltx/en_us_goadedes/he.h.m4:heHE.ThalassisToErythraion.incipit
ltx/en_us_goadedes/me.m02.d13:meMA.Ode1C1H.melody	@ltx/en_us_goadedes/he.h.m4:heHE.ThalassisToErythraion.melody
ltx/en_us_goadedes/me.m02.d13:meMA.Ode1C1H.mode	@ltx/en_us_goadedes/miscellanea:misc.Mode4
ltx/en_us_goadedes/me.m02.d13:meMA.Ode1C1H.ode	@ltx/en_us_goadedes/miscellanea:misc.Ode1
ltx/en_us_goadedes/me.m02.d13:meMA.Ode1C1H.text	@ltx/en_us_goadedes/he.h.m4:heHE.ThalassisToErythraion.text
ltx/en_us_goadedes/me.m02.d13:meMA.Ode1C1T.incipit	…
ltx/en_us_goadedes/me.m02.d13:meMA.Ode1C1T.melody	@ltx/en_us_goadedes/he.h.m4:heHE.ThalassisToErythraion.name
ltx/en_us_goadedes/me.m02.d13:meMA.Ode1C1T.mode	@ltx/en_us_goadedes/miscellanea:misc.Mode4
ltx/en_us_goadedes/me.m02.d13:meMA.Ode1C1T.ode	@ltx/en_us_goadedes/miscellanea:misc.Ode1
ltx/en_us_goadedes/me.m02.d13:meMA.Ode1C1T.text	
ltx/en_us_goadedes/me.m02.d13:meMA.Ode3C11.greekmelody	@ltx/en_us_goadedes/he.h.m4:heHE.EffrainetaiEpiSoi.greekname
ltx/en_us_goadedes/me.m02.d13:meMA.Ode3C11.incipit	…
ltx/en_us_goadedes/me.m02.d13:meMA.Ode3C11.melody	@ltx/en_us_goadedes/he.h.m4:heHE.EffrainetaiEpiSoi.name
ltx/en_us_goadedes/me.m02.d13:meMA.Ode3C11.mode	@ltx/en_us_goadedes/miscellanea:misc.Mode4
ltx/en_us_goadedes/me.m02.d13:meMA.Ode3C11.ode	@ltx/en_us_goadedes/miscellanea:misc.Ode3
ltx/en_us_goadedes/me.m02.d13:meMA.Ode3C11.text	
ltx/en_us_goadedes/me.m02.d13:meMA.Ode3C12.incipit	…
ltx/en_us_goadedes/me.m02.d13:meMA.Ode3C12.melody	@ltx/en_us_goadedes/he.h.m4:heHE.EffrainetaiEpiSoi.name
ltx/en_us_goadedes/me.m02.d13:meMA.Ode3C12.mode	@ltx/en_us_goadedes/miscellanea:misc.Mode4
ltx/en_us_goadedes/me.m02.d13:meMA.Ode3C12.ode	@ltx/en_us_goadedes/miscellanea:misc.Ode3
ltx/en_us_goadedes/me.m02.d13:meMA.Ode3C12.text	
ltx/en_us_goadedes/me.m02.d13:meMA.Ode3C13.incipit	…
ltx/en_us_goadedes/me.m02.d13:meMA.Ode3C13.melody	@ltx/en_us_goadedes/he.h.m4:heHE.EffrainetaiEpiSoi.name
ltx/en_us_goadedes/me.m02.d13:meMA.Ode3C13.mode	@ltx/en_us_goadedes/miscellanea:misc.Mode4
ltx/en_us_goadedes/me.m02.d13:meMA.Ode3C13.ode	@ltx/en_us_goadedes/miscellanea:misc.Ode3
ltx/en_us_goadedes/me.m02.d13:meMA.Ode3C13.text	
ltx/en_us_goadedes/me.m02.d13:meMA.Ode3C1H.greekmelody	@ltx/en_us_goadedes/he.h.m4:heHE.EffrainetaiEpiSoi.greekname
ltx/en_us_goadedes/me.m02.d13:meMA.Ode3C1H.incipit	@ltx/en_us_goadedes/he.h.m4:heHE.EffrainetaiEpiSoi.incipit
ltx/en_us_goadedes/me.m02.d13:meMA.Ode3C1H.melody	@ltx/en_us_goadedes/he.h.m4:heHE.EffrainetaiEpiSoi.melody
ltx/en_us_goadedes/me.m02.d13:meMA.Ode3C1H.mode	@ltx/en_us_goadedes/miscellanea:misc.Mode4
ltx/en_us_goadedes/me.m02.d13:meMA.Ode3C1H.ode	@ltx/en_us_goadedes/miscellanea:misc.Ode3
ltx/en_us_goadedes/me.m02.d13:meMA.Ode3C1H.text	@ltx/en_us_goadedes/he.h.m4:heHE.EffrainetaiEpiSoi.text
ltx/en_us_goadedes/me.m02.d13:meMA.Ode3C1T.incipit	…
ltx/en_us_goadedes/me.m02.d13:meMA.Ode3C1T.melody	@ltx/en_us_goadedes/he.h.m4:heHE.EffrainetaiEpiSoi.name
ltx/en_us_goadedes/me.m02.d13:meMA.Ode3C1T.mode	@ltx/en_us_goadedes/miscellanea:misc.Mode4
ltx/en_us_goadedes/me.m02.d13:meMA.Ode3C1T.ode	@ltx/en_us_goadedes/miscellanea:misc.Ode3
ltx/en_us_goadedes/me.m02.d13:meMA.Ode3C1T.text	
ltx/en_us_goadedes/me.m02.d13:meMA.Ode3Kathisma1.greekmelody	@ltx/en_us_goadedes/he.a.m1:heAU.TouLithouSfragisthentos.greekname
ltx/en_us_goadedes/me.m02.d13:meMA.Ode3Kathisma1.incipit	…
ltx/en_us_goadedes/me.m02.d13:meMA.Ode3Kathisma1.melody	@ltx/en_us_goadedes/he.a.m1:heAU.TouLithouSfragisthentos.name
ltx/en_us_goadedes/me.m02.d13:meMA.Ode3Kathisma1.mode	@ltx/en_us_goadedes/miscellanea:misc.Mode1
ltx/en_us_goadedes/me.m02.d13:meMA.Ode3Kathisma1.text	
ltx/en_us_goadedes/me.m02.d13:meMA.Ode3KathismaSt.incipit	…
ltx/en_us_goadedes/me.m02.d13:meMA.Ode3KathismaSt.melody	@ltx/en_us_goadedes/he.a.m1:heAU.TouLithouSfragisthentos.name
ltx/en_us_goadedes/me.m02.d13:meMA.Ode3KathismaSt.mode	@ltx/en_us_goadedes/miscellanea:misc.Mode1
ltx/en_us_goadedes/me.m02.d13:meMA.Ode3KathismaSt.text	
ltx/en_us_goadedes/me.m02.d13:meMA.Ode3KathismaT.incipit	…
ltx/en_us_goadedes/me.m02.d13:meMA.Ode3KathismaT.melody	@ltx/en_us_goadedes/he.a.m1:heAU.TouLithouSfragisthentos.name
ltx/en_us_goadedes/me.m02.d13:meMA.Ode3KathismaT.mode	@ltx/en_us_goadedes/miscellanea:misc.Mode1
ltx/en_us_goadedes/me.m02.d13:meMA.Ode3KathismaT.text	
ltx/en_us_goadedes/me.m02.d13:meMA.Ode4C11.greekmelody	@ltx/en_us_goadedes/he.h.m4:heHE.EparthentaSeIdousa.greekname
ltx/en_us_goadedes/me.m02.d13:meMA.Ode4C11.incipit	…
ltx/en_us_goadedes/me.m02.d13:meMA.Ode4C11.melody	@ltx/en_us_goadedes/he.h.m4:heHE.EparthentaSeIdousa.name
ltx/en_us_goadedes/me.m02.d13:meMA.Ode4C11.mode	@ltx/en_us_goadedes/miscellanea:misc.Mode4
ltx/en_us_goadedes/me.m02.d13:meMA.Ode4C11.ode	@ltx/en_us_goadedes/miscellanea:misc.Ode4
ltx/en_us_goadedes/me.m02.d13:meMA.Ode4C11.text	
ltx/en_us_goadedes/me.m02.d13:meMA.Ode4C12.incipit	…
ltx/en_us_goadedes/me.m02.d13:meMA.Ode4C12.melody	@ltx/en_us_goadedes/he.h.m4:heHE.EparthentaSeIdousa.name
ltx/en_us_goadedes/me.m02.d13:meMA.Ode4C12.mode	@ltx/en_us_goadedes/miscellanea:misc.Mode4
ltx/en_us_goadedes/me.m02.d13:meMA.Ode4C12.ode	@ltx/en_us_goadedes/miscellanea:misc.Ode4
ltx/en_us_goadedes/me.m02.d13:meMA.Ode4C12.text	
ltx/en_us_goadedes/me.m02.d13:meMA.Ode4C13.incipit	…
ltx/en_us_goadedes/me.m02.d13:meMA.Ode4C13.melody	@ltx/en_us_goadedes/he.h.m4:heHE.EparthentaSeIdousa.name
ltx/en_us_goadedes/me.m02.d13:meMA.Ode4C13.mode	@ltx/en_us_goadedes/miscellanea:misc.Mode4
ltx/en_us_goadedes/me.m02.d13:meMA.Ode4C13.ode	@ltx/en_us_goadedes/miscellanea:misc.Ode4
ltx/en_us_goadedes/me.m02.d13:meMA.Ode4C13.text	
ltx/en_us_goadedes/me.m02.d13:meMA.Ode4C1H.greekmelody	@ltx/en_us_goadedes/he.h.m4:heHE.EparthentaSeIdousa.greekname
ltx/en_us_goadedes/me.m02.d13:meMA.Ode4C1H.incipit	@ltx/en_us_goadedes/he.h.m4:heHE.EparthentaSeIdousa.incipit
ltx/en_us_goadedes/me.m02.d13:meMA.Ode4C1H.melody	@ltx/en_us_goadedes/he.h.m4:heHE.EparthentaSeIdousa.melody
ltx/en_us_goadedes/me.m02.d13:meMA.Ode4C1H.mode	@ltx/en_us_goadedes/miscellanea:misc.Mode4
ltx/en_us_goadedes/me.m02.d13:meMA.Ode4C1H.ode	@ltx/en_us_goadedes/miscellanea:misc.Ode4
ltx/en_us_goadedes/me.m02.d13:meMA.Ode4C1H.text	@ltx/en_us_goadedes/he.h.m4:heHE.EparthentaSeIdousa.text
ltx/en_us_goadedes/me.m02.d13:meMA.Ode4C1T.incipit	…
ltx/en_us_goadedes/me.m02.d13:meMA.Ode4C1T.melody	@ltx/en_us_goadedes/he.h.m4:heHE.EparthentaSeIdousa.name
ltx/en_us_goadedes/me.m02.d13:meMA.Ode4C1T.mode	@ltx/en_us_goadedes/miscellanea:misc.Mode4
ltx/en_us_goadedes/me.m02.d13:meMA.Ode4C1T.ode	@ltx/en_us_goadedes/miscellanea:misc.Ode4
ltx/en_us_goadedes/me.m02.d13:meMA.Ode4C1T.text	
ltx/en_us_goadedes/me.m02.d13:meMA.Ode5C11.greekmelody	@ltx/en_us_goadedes/he.h.m4:heHE.SyKyrieMouFos.greekname
ltx/en_us_goadedes/me.m02.d13:meMA.Ode5C11.incipit	…
ltx/en_us_goadedes/me.m02.d13:meMA.Ode5C11.melody	@ltx/en_us_goadedes/he.h.m4:heHE.SyKyrieMouFos.name
ltx/en_us_goadedes/me.m02.d13:meMA.Ode5C11.mode	@ltx/en_us_goadedes/miscellanea:misc.Mode4
ltx/en_us_goadedes/me.m02.d13:meMA.Ode5C11.ode	@ltx/en_us_goadedes/miscellanea:misc.Ode5
ltx/en_us_goadedes/me.m02.d13:meMA.Ode5C11.text	
ltx/en_us_goadedes/me.m02.d13:meMA.Ode5C12.incipit	…
ltx/en_us_goadedes/me.m02.d13:meMA.Ode5C12.melody	@ltx/en_us_goadedes/he.h.m4:heHE.SyKyrieMouFos.name
ltx/en_us_goadedes/me.m02.d13:meMA.Ode5C12.mode	@ltx/en_us_goadedes/miscellanea:misc.Mode4
ltx/en_us_goadedes/me.m02.d13:meMA.Ode5C12.ode	@ltx/en_us_goadedes/miscellanea:misc.Ode5
ltx/en_us_goadedes/me.m02.d13:meMA.Ode5C12.text	
ltx/en_us_goadedes/me.m02.d13:meMA.Ode5C13.incipit	…
ltx/en_us_goadedes/me.m02.d13:meMA.Ode5C13.melody	@ltx/en_us_goadedes/he.h.m4:heHE.SyKyrieMouFos.name
ltx/en_us_goadedes/me.m02.d13:meMA.Ode5C13.mode	@ltx/en_us_goadedes/miscellanea:misc.Mode4
ltx/en_us_goadedes/me.m02.d13:meMA.Ode5C13.ode	@ltx/en_us_goadedes/miscellanea:misc.Ode5
ltx/en_us_goadedes/me.m02.d13:meMA.Ode5C13.text	
ltx/en_us_goadedes/me.m02.d13:meMA.Ode5C1H.greekmelody	@ltx/en_us_goadedes/he.h.m4:heHE.SyKyrieMouFos.greekname
ltx/en_us_goadedes/me.m02.d13:meMA.Ode5C1H.incipit	@ltx/en_us_goadedes/he.h.m4:heHE.SyKyrieMouFos.incipit
ltx/en_us_goadedes/me.m02.d13:meMA.Ode5C1H.melody	@ltx/en_us_goadedes/he.h.m4:heHE.SyKyrieMouFos.melody
ltx/en_us_goadedes/me.m02.d13:meMA.Ode5C1H.mode	@ltx/en_us_goadedes/miscellanea:misc.Mode4
ltx/en_us_goadedes/me.m02.d13:meMA.Ode5C1H.ode	@ltx/en_us_goadedes/miscellanea:misc.Ode5
ltx/en_us_goadedes/me.m02.d13:meMA.Ode5C1H.text	@ltx/en_us_goadedes/he.h.m4:heHE.SyKyrieMouFos.text
ltx/en_us_goadedes/me.m02.d13:meMA.Ode5C1T.incipit	…
ltx/en_us_goadedes/me.m02.d13:meMA.Ode5C1T.melody	@ltx/en_us_goadedes/he.h.m4:heHE.SyKyrieMouFos.name
ltx/en_us_goadedes/me.m02.d13:meMA.Ode5C1T.mode	@ltx/en_us_goadedes/miscellanea:misc.Mode4
ltx/en_us_goadedes/me.m02.d13:meMA.Ode5C1T.ode	@ltx/en_us_goadedes/miscellanea:misc.Ode5
ltx/en_us_goadedes/me.m02.d13:meMA.Ode5C1T.text	
ltx/en_us_goadedes/me.m02.d13:meMA.Ode6C11.greekmelody	@ltx/en_us_goadedes/he.h.m4:heHE.ThysoSoiMetaFonis.greekname
ltx/en_us_goadedes/me.m02.d13:meMA.Ode6C11.incipit	…
ltx/en_us_goadedes/me.m02.d13:meMA.Ode6C11.melody	@ltx/en_us_goadedes/he.h.m4:heHE.ThysoSoiMetaFonis.name
ltx/en_us_goadedes/me.m02.d13:meMA.Ode6C11.mode	@ltx/en_us_goadedes/miscellanea:misc.Mode4
ltx/en_us_goadedes/me.m02.d13:meMA.Ode6C11.ode	@ltx/en_us_goadedes/miscellanea:misc.Ode6
ltx/en_us_goadedes/me.m02.d13:meMA.Ode6C11.text	
ltx/en_us_goadedes/me.m02.d13:meMA.Ode6C12.incipit	…
ltx/en_us_goadedes/me.m02.d13:meMA.Ode6C12.melody	@ltx/en_us_goadedes/he.h.m4:heHE.ThysoSoiMetaFonis.name
ltx/en_us_goadedes/me.m02.d13:meMA.Ode6C12.mode	@ltx/en_us_goadedes/miscellanea:misc.Mode4
ltx/en_us_goadedes/me.m02.d13:meMA.Ode6C12.ode	@ltx/en_us_goadedes/miscellanea:misc.Ode6
ltx/en_us_goadedes/me.m02.d13:meMA.Ode6C12.text	
ltx/en_us_goadedes/me.m02.d13:meMA.Ode6C13.incipit	…
ltx/en_us_goadedes/me.m02.d13:meMA.Ode6C13.melody	@ltx/en_us_goadedes/he.h.m4:heHE.ThysoSoiMetaFonis.name
ltx/en_us_goadedes/me.m02.d13:meMA.Ode6C13.mode	@ltx/en_us_goadedes/miscellanea:misc.Mode4
ltx/en_us_goadedes/me.m02.d13:meMA.Ode6C13.ode	@ltx/en_us_goadedes/miscellanea:misc.Ode6
ltx/en_us_goadedes/me.m02.d13:meMA.Ode6C13.text	
ltx/en_us_goadedes/me.m02.d13:meMA.Ode6C14.incipit	…
ltx/en_us_goadedes/me.m02.d13:meMA.Ode6C14.melody	@ltx/en_us_goadedes/he.h.m4:heHE.ThysoSoiMetaFonis.name
ltx/en_us_goadedes/me.m02.d13:meMA.Ode6C14.mode	@ltx/en_us_goadedes/miscellanea:misc.Mode4
ltx/en_us_goadedes/me.m02.d13:meMA.Ode6C14.ode	@ltx/en_us_goadedes/miscellanea:misc.Ode6
ltx/en_us_goadedes/me.m02.d13:meMA.Ode6C14.text	
ltx/en_us_goadedes/me.m02.d13:meMA.Ode6C1H.greekmelody	@ltx/en_us_goadedes/he.h.m4:heHE.ThysoSoiMetaFonis.greekname
ltx/en_us_goadedes/me.m02.d13:meMA.Ode6C1H.incipit	@ltx/en_us_goadedes/he.h.m4:heHE.ThysoSoiMetaFonis.incipit
ltx/en_us_goadedes/me.m02.d13:meMA.Ode6C1H.melody	@ltx/en_us_goadedes/he.h.m4:heHE.ThysoSoiMetaFonis.melody
ltx/en_us_goadedes/me.m02.d13:meMA.Ode6C1H.mode	@ltx/en_us_goadedes/miscellanea:misc.Mode4
ltx/en_us_goadedes/me.m02.d13:meMA.Ode6C1H.ode	@ltx/en_us_goadedes/miscellanea:misc.Ode6
ltx/en_us_goadedes/me.m02.d13:meMA.Ode6C1H.text	@ltx/en_us_goadedes/he.h.m4:heHE.ThysoSoiMetaFonis.text
ltx/en_us_goadedes/me.m02.d13:meMA.Ode6C1T.incipit	…
ltx/en_us_goadedes/me.m02.d13:meMA.Ode6C1T.melody	@ltx/en_us_goadedes/he.h.m4:heHE.ThysoSoiMetaFonis.name
ltx/en_us_goadedes/me.m02.d13:meMA.Ode6C1T.mode	@ltx/en_us_goadedes/miscellanea:misc.Mode4
ltx/en_us_goadedes/me.m02.d13:meMA.Ode6C1T.ode	@ltx/en_us_goadedes/miscellanea:misc.Ode6
ltx/en_us_goadedes/me.m02.d13:meMA.Ode6C1T.text	
ltx/en_us_goadedes/me.m02.d13:meMA.Ode7C11.greekmelody	@ltx/en_us_goadedes/he.h.m4:heHE.EnTiKaminoAvramiaioi.greekname
ltx/en_us_goadedes/me.m02.d13:meMA.Ode7C11.incipit	…
ltx/en_us_goadedes/me.m02.d13:meMA.Ode7C11.melody	@ltx/en_us_goadedes/he.h.m4:heHE.EnTiKaminoAvramiaioi.name
ltx/en_us_goadedes/me.m02.d13:meMA.Ode7C11.mode	@ltx/en_us_goadedes/miscellanea:misc.Mode4
ltx/en_us_goadedes/me.m02.d13:meMA.Ode7C11.ode	@ltx/en_us_goadedes/miscellanea:misc.Ode7
ltx/en_us_goadedes/me.m02.d13:meMA.Ode7C11.text	
ltx/en_us_goadedes/me.m02.d13:meMA.Ode7C12.incipit	…
ltx/en_us_goadedes/me.m02.d13:meMA.Ode7C12.melody	@ltx/en_us_goadedes/he.h.m4:heHE.EnTiKaminoAvramiaioi.name
ltx/en_us_goadedes/me.m02.d13:meMA.Ode7C12.mode	@ltx/en_us_goadedes/miscellanea:misc.Mode4
ltx/en_us_goadedes/me.m02.d13:meMA.Ode7C12.ode	@ltx/en_us_goadedes/miscellanea:misc.Ode7
ltx/en_us_goadedes/me.m02.d13:meMA.Ode7C12.text	
ltx/en_us_goadedes/me.m02.d13:meMA.Ode7C13.incipit	…
ltx/en_us_goadedes/me.m02.d13:meMA.Ode7C13.melody	@ltx/en_us_goadedes/he.h.m4:heHE.EnTiKaminoAvramiaioi.name
ltx/en_us_goadedes/me.m02.d13:meMA.Ode7C13.mode	@ltx/en_us_goadedes/miscellanea:misc.Mode4
ltx/en_us_goadedes/me.m02.d13:meMA.Ode7C13.ode	@ltx/en_us_goadedes/miscellanea:misc.Ode7
ltx/en_us_goadedes/me.m02.d13:meMA.Ode7C13.text	
ltx/en_us_goadedes/me.m02.d13:meMA.Ode7C1H.greekmelody	@ltx/en_us_goadedes/he.h.m4:heHE.EnTiKaminoAvramiaioi.greekname
ltx/en_us_goadedes/me.m02.d13:meMA.Ode7C1H.incipit	@ltx/en_us_goadedes/he.h.m4:heHE.EnTiKaminoAvramiaioi.incipit
ltx/en_us_goadedes/me.m02.d13:meMA.Ode7C1H.melody	@ltx/en_us_goadedes/he.h.m4:heHE.EnTiKaminoAvramiaioi.melody
ltx/en_us_goadedes/me.m02.d13:meMA.Ode7C1H.mode	@ltx/en_us_goadedes/miscellanea:misc.Mode4
ltx/en_us_goadedes/me.m02.d13:meMA.Ode7C1H.ode	@ltx/en_us_goadedes/miscellanea:misc.Ode7
ltx/en_us_goadedes/me.m02.d13:meMA.Ode7C1H.text	@ltx/en_us_goadedes/he.h.m4:heHE.EnTiKaminoAvramiaioi.text
ltx/en_us_goadedes/me.m02.d13:meMA.Ode7C1T.incipit	…
ltx/en_us_goadedes/me.m02.d13:meMA.Ode7C1T.melody	@ltx/en_us_goadedes/he.h.m4:heHE.EnTiKaminoAvramiaioi.name
ltx/en_us_goadedes/me.m02.d13:meMA.Ode7C1T.mode	@ltx/en_us_goadedes/miscellanea:misc.Mode4
ltx/en_us_goadedes/me.m02.d13:meMA.Ode7C1T.ode	@ltx/en_us_goadedes/miscellanea:misc.Ode7
ltx/en_us_goadedes/me.m02.d13:meMA.Ode7C1T.text	
ltx/en_us_goadedes/me.m02.d13:meMA.Ode8C11.greekmelody	@ltx/en_us_goadedes/he.h.m4:heHE.CheirasEkpetasasDaniil.greekname
ltx/en_us_goadedes/me.m02.d13:meMA.Ode8C11.incipit	…
ltx/en_us_goadedes/me.m02.d13:meMA.Ode8C11.melody	@ltx/en_us_goadedes/he.h.m4:heHE.CheirasEkpetasasDaniil.name
ltx/en_us_goadedes/me.m02.d13:meMA.Ode8C11.mode	@ltx/en_us_goadedes/miscellanea:misc.Mode4
ltx/en_us_goadedes/me.m02.d13:meMA.Ode8C11.ode	@ltx/en_us_goadedes/miscellanea:misc.Ode8
ltx/en_us_goadedes/me.m02.d13:meMA.Ode8C11.text	
ltx/en_us_goadedes/me.m02.d13:meMA.Ode8C12.incipit	…
ltx/en_us_goadedes/me.m02.d13:meMA.Ode8C12.melody	@ltx/en_us_goadedes/he.h.m4:heHE.CheirasEkpetasasDaniil.name
ltx/en_us_goadedes/me.m02.d13:meMA.Ode8C12.mode	@ltx/en_us_goadedes/miscellanea:misc.Mode4
ltx/en_us_goadedes/me.m02.d13:meMA.Ode8C12.ode	@ltx/en_us_goadedes/miscellanea:misc.Ode8
ltx/en_us_goadedes/me.m02.d13:meMA.Ode8C12.text	
ltx/en_us_goadedes/me.m02.d13:meMA.Ode8C13.incipit	…
ltx/en_us_goadedes/me.m02.d13:meMA.Ode8C13.melody	@ltx/en_us_goadedes/he.h.m4:heHE.CheirasEkpetasasDaniil.name
ltx/en_us_goadedes/me.m02.d13:meMA.Ode8C13.mode	@ltx/en_us_goadedes/miscellanea:misc.Mode4
ltx/en_us_goadedes/me.m02.d13:meMA.Ode8C13.ode	@ltx/en_us_goadedes/miscellanea:misc.Ode8
ltx/en_us_goadedes/me.m02.d13:meMA.Ode8C13.text	
ltx/en_us_goadedes/me.m02.d13:meMA.Ode8C14.incipit	…
ltx/en_us_goadedes/me.m02.d13:meMA.Ode8C14.melody	@ltx/en_us_goadedes/he.h.m4:heHE.CheirasEkpetasasDaniil.name
ltx/en_us_goadedes/me.m02.d13:meMA.Ode8C14.mode	@ltx/en_us_goadedes/miscellanea:misc.Mode4
ltx/en_us_goadedes/me.m02.d13:meMA.Ode8C14.ode	@ltx/en_us_goadedes/miscellanea:misc.Ode8
ltx/en_us_goadedes/me.m02.d13:meMA.Ode8C14.text	
ltx/en_us_goadedes/me.m02.d13:meMA.Ode8C1H.greekmelody	@ltx/en_us_goadedes/he.h.m4:heHE.CheirasEkpetasasDaniil.greekname
ltx/en_us_goadedes/me.m02.d13:meMA.Ode8C1H.incipit	@ltx/en_us_goadedes/he.h.m4:heHE.CheirasEkpetasasDaniil.incipit
ltx/en_us_goadedes/me.m02.d13:meMA.Ode8C1H.melody	@ltx/en_us_goadedes/he.h.m4:heHE.CheirasEkpetasasDaniil.melody
ltx/en_us_goadedes/me.m02.d13:meMA.Ode8C1H.mode	@ltx/en_us_goadedes/miscellanea:misc.Mode4
ltx/en_us_goadedes/me.m02.d13:meMA.Ode8C1H.ode	@ltx/en_us_goadedes/miscellanea:misc.Ode8
ltx/en_us_goadedes/me.m02.d13:meMA.Ode8C1H.text	@ltx/en_us_goadedes/he.h.m4:heHE.CheirasEkpetasasDaniil.text
ltx/en_us_goadedes/me.m02.d13:meMA.Ode8C1T.incipit	…
ltx/en_us_goadedes/me.m02.d13:meMA.Ode8C1T.melody	@ltx/en_us_goadedes/he.h.m4:heHE.CheirasEkpetasasDaniil.name
ltx/en_us_goadedes/me.m02.d13:meMA.Ode8C1T.mode	@ltx/en_us_goadedes/miscellanea:misc.Mode4
ltx/en_us_goadedes/me.m02.d13:meMA.Ode8C1T.ode	@ltx/en_us_goadedes/miscellanea:misc.Ode8
ltx/en_us_goadedes/me.m02.d13:meMA.Ode8C1T.text	
ltx/en_us_goadedes/me.m02.d13:meMA.Ode9C11.greekmelody	@ltx/en_us_goadedes/he.h.m4:heHE.LithosAcheirotmitos.greekname
ltx/en_us_goadedes/me.m02.d13:meMA.Ode9C11.incipit	…
ltx/en_us_goadedes/me.m02.d13:meMA.Ode9C11.melody	@ltx/en_us_goadedes/he.h.m4:heHE.LithosAcheirotmitos.name
ltx/en_us_goadedes/me.m02.d13:meMA.Ode9C11.mode	@ltx/en_us_goadedes/miscellanea:misc.Mode4
ltx/en_us_goadedes/me.m02.d13:meMA.Ode9C11.ode	@ltx/en_us_goadedes/miscellanea:misc.Ode9
ltx/en_us_goadedes/me.m02.d13:meMA.Ode9C11.text	
ltx/en_us_goadedes/me.m02.d13:meMA.Ode9C12.incipit	…
ltx/en_us_goadedes/me.m02.d13:meMA.Ode9C12.melody	@ltx/en_us_goadedes/he.h.m4:heHE.LithosAcheirotmitos.name
ltx/en_us_goadedes/me.m02.d13:meMA.Ode9C12.mode	@ltx/en_us_goadedes/miscellanea:misc.Mode4
ltx/en_us_goadedes/me.m02.d13:meMA.Ode9C12.ode	@ltx/en_us_goadedes/miscellanea:misc.Ode9
ltx/en_us_goadedes/me.m02.d13:meMA.Ode9C12.text	
ltx/en_us_goadedes/me.m02.d13:meMA.Ode9C13.incipit	…
ltx/en_us_goadedes/me.m02.d13:meMA.Ode9C13.melody	@ltx/en_us_goadedes/he.h.m4:heHE.LithosAcheirotmitos.name
ltx/en_us_goadedes/me.m02.d13:meMA.Ode9C13.mode	@ltx/en_us_goadedes/miscellanea:misc.Mode4
ltx/en_us_goadedes/me.m02.d13:meMA.Ode9C13.ode	@ltx/en_us_goadedes/miscellanea:misc.Ode9
ltx/en_us_goadedes/me.m02.d13:meMA.Ode9C13.text	
ltx/en_us_goadedes/me.m02.d13:meMA.Ode9C14.incipit	…
ltx/en_us_goadedes/me.m02.d13:meMA.Ode9C14.melody	@ltx/en_us_goadedes/he.h.m4:heHE.LithosAcheirotmitos.name
ltx/en_us_goadedes/me.m02.d13:meMA.Ode9C14.mode	@ltx/en_us_goadedes/miscellanea:misc.Mode4
ltx/en_us_goadedes/me.m02.d13:meMA.Ode9C14.ode	@ltx/en_us_goadedes/miscellanea:misc.Ode9
ltx/en_us_goadedes/me.m02.d13:meMA.Ode9C14.text	
ltx/en_us_goadedes/me.m02.d13:meMA.Ode9C1H.greekmelody	@ltx/en_us_goadedes/he.h.m4:heHE.LithosAcheirotmitos.greekname
ltx/en_us_goadedes/me.m02.d13:meMA.Ode9C1H.incipit	@ltx/en_us_goadedes/he.h.m4:heHE.LithosAcheirotmitos.incipit
ltx/en_us_goadedes/me.m02.d13:meMA.Ode9C1H.melody	@ltx/en_us_goadedes/he.h.m4:heHE.LithosAcheirotmitos.melody
ltx/en_us_goadedes/me.m02.d13:meMA.Ode9C1H.mode	@ltx/en_us_goadedes/miscellanea:misc.Mode4
ltx/en_us_goadedes/me.m02.d13:meMA.Ode9C1H.ode	@ltx/en_us_goadedes/miscellanea:misc.Ode9
ltx/en_us_goadedes/me.m02.d13:meMA.Ode9C1H.text	@ltx/en_us_goadedes/he.h.m4:heHE.LithosAcheirotmitos.text
ltx/en_us_goadedes/me.m02.d13:meMA.Ode9C1T.incipit	…
ltx/en_us_goadedes/me.m02.d13:meMA.Ode9C1T.melody	@ltx/en_us_goadedes/he.h.m4:heHE.LithosAcheirotmitos.name
ltx/en_us_goadedes/me.m02.d13:meMA.Ode9C1T.mode	@ltx/en_us_goadedes/miscellanea:misc.Mode4
ltx/en_us_goadedes/me.m02.d13:meMA.Ode9C1T.ode	@ltx/en_us_goadedes/miscellanea:misc.Ode9
ltx/en_us_goadedes/me.m02.d13:meMA.Ode9C1T.text	
ltx/en_us_goadedes/me.m02.d13:meMA.Oikos1.text	
ltx/en_us_goadedes/me.m02.d13:meVE.Apolytikion1.incipit	…
ltx/en_us_goadedes/me.m02.d13:meVE.Apolytikion1.melody	
ltx/en_us_goadedes/me.m02.d13:meVE.Apolytikion1.mode	@ltx/en_us_goadedes/miscellanea:misc.Mode8
ltx/en_us_goadedes/me.m02.d13:meVE.Apolytikion1.text	
ltx/en_us_goadedes/me.m02.d13:meVE.AposGlory.incipit	…
ltx/en_us_goadedes/me.m02.d13:meVE.AposGlory.melody	
ltx/en_us_goadedes/me.m02.d13:meVE.AposGlory.mode	@ltx/en_us_goadedes/miscellanea:misc.Mode2
ltx/en_us_goadedes/me.m02.d13:meVE.AposGlory.poet	@ltx/en_us_goadedes/poets:po.TheodorouTouStouditou
ltx/en_us_goadedes/me.m02.d13:meVE.AposGlory.text	
ltx/en_us_goadedes/me.m02.d13:meVE.AposStavrotheotokion.greekmelody	@ltx/en_us_goadedes/he.a.m2:heAU.OteEkTouXylou.greekname
ltx/en_us_goadedes/me.m02.d13:meVE.AposStavrotheotokion.incipit	…
ltx/en_us_goadedes/me.m02.d13:meVE.AposStavrotheotokion.melody	@ltx/en_us_goadedes/he.a.m2:heAU.OteEkTouXylou.name
ltx/en_us_goadedes/me.m02.d13:meVE.AposStavrotheotokion.mode	@ltx/en_us_goadedes/miscellanea:misc.Mode2
ltx/en_us_goadedes/me.m02.d13:meVE.AposStavrotheotokion.text	
ltx/en_us_goadedes/me.m02.d13:meVE.AposTheotokion.greekmelody	@ltx/en_us_goadedes/he.a.m2:heAU.OteEkTouXylou.greekname
ltx/en_us_goadedes/me.m02.d13:meVE.AposTheotokion.incipit	@ltx/en_us_goadedes/oc.m2.d6:ocVE.Stichera4.incipit
ltx/en_us_goadedes/me.m02.d13:meVE.AposTheotokion.melody	@ltx/en_us_goadedes/he.a.m2:heAU.OteEkTouXylou.name
ltx/en_us_goadedes/me.m02.d13:meVE.AposTheotokion.mode	@ltx/en_us_goadedes/miscellanea:misc.Mode2
ltx/en_us_goadedes/me.m02.d13:meVE.AposTheotokion.text	@ltx/en_us_goadedes/oc.m2.d6:ocVE.Stichera4.text
ltx/en_us_goadedes/me.m02.d13:meVE.SticGlory.incipit	…
ltx/en_us_goadedes/me.m02.d13:meVE.SticGlory.melody	
ltx/en_us_goadedes/me.m02.d13:meVE.SticGlory.mode	@ltx/en_us_goadedes/miscellanea:misc.Mode2
ltx/en_us_goadedes/me.m02.d13:meVE.SticGlory.poet	@ltx/en_us_goadedes/poets:po.TheodorouTouStouditou
ltx/en_us_goadedes/me.m02.d13:meVE.SticGlory.text	
ltx/en_us_goadedes/me.m02.d13:meVE.SticStavrotheotokion.greekmelody	@ltx/en_us_goadedes/he.a.m4:heAU.EdokasSimeiosin.greekname
ltx/en_us_goadedes/me.m02.d13:meVE.SticStavrotheotokion.incipit	@ltx/en_us_goadedes/me.m02.d03:meVE.SticStavrotheotokion.incipit
ltx/en_us_goadedes/me.m02.d13:meVE.SticStavrotheotokion.melody	@ltx/en_us_goadedes/he.a.m4:heAU.EdokasSimeiosin.name
ltx/en_us_goadedes/me.m02.d13:meVE.SticStavrotheotokion.mode	@ltx/en_us_goadedes/miscellanea:misc.Mode4
ltx/en_us_goadedes/me.m02.d13:meVE.SticStavrotheotokion.text	@ltx/en_us_goadedes/me.m02.d03:meVE.SticStavrotheotokion.text
ltx/en_us_goadedes/me.m02.d13:meVE.SticStavrotheotokion2.greekmelody	@ltx/en_us_goadedes/he.a.m2:heAU.OteEkTouXylou.greekname
ltx/en_us_goadedes/me.m02.d13:meVE.SticStavrotheotokion2.incipit	…
ltx/en_us_goadedes/me.m02.d13:meVE.SticStavrotheotokion2.melody	@ltx/en_us_goadedes/he.a.m2:heAU.OteEkTouXylou.name
ltx/en_us_goadedes/me.m02.d13:meVE.SticStavrotheotokion2.mode	@ltx/en_us_goadedes/miscellanea:misc.Mode2
ltx/en_us_goadedes/me.m02.d13:meVE.SticStavrotheotokion2.text	
ltx/en_us_goadedes/me.m02.d13:meVE.SticTheotokion.greekmelody	@ltx/en_us_goadedes/he.a.m4:heAU.EdokasSimeiosin.greekname
ltx/en_us_goadedes/me.m02.d13:meVE.SticTheotokion.incipit	@ltx/en_us_goadedes/me.m02.d03:meVE.SticTheotokion.incipit
ltx/en_us_goadedes/me.m02.d13:meVE.SticTheotokion.melody	@ltx/en_us_goadedes/he.a.m4:heAU.EdokasSimeiosin.name
ltx/en_us_goadedes/me.m02.d13:meVE.SticTheotokion.mode	@ltx/en_us_goadedes/miscellanea:misc.Mode4
ltx/en_us_goadedes/me.m02.d13:meVE.SticTheotokion.text	@ltx/en_us_goadedes/me.m02.d03:meVE.SticTheotokion.text
ltx/en_us_goadedes/me.m02.d13:meVE.SticTheotokion2.greekmelody	@ltx/en_us_goadedes/he.a.m2:heAU.OteEkTouXylou.greekname
ltx/en_us_goadedes/me.m02.d13:meVE.SticTheotokion2.incipit	…
ltx/en_us_goadedes/me.m02.d13:meVE.SticTheotokion2.melody	@ltx/en_us_goadedes/he.a.m2:heAU.OteEkTouXylou.name
ltx/en_us_goadedes/me.m02.d13:meVE.SticTheotokion2.mode	@ltx/en_us_goadedes/miscellanea:misc.Mode2
ltx/en_us_goadedes/me.m02.d13:meVE.SticTheotokion2.text	
ltx/en_us_goadedes/me.m02.d13:meVE.Stichera01.greekmelody	@ltx/en_us_goadedes/he.a.m4:heAU.EdokasSimeiosin.greekname
ltx/en_us_goadedes/me.m02.d13:meVE.Stichera01.incipit	…
ltx/en_us_goadedes/me.m02.d13:meVE.Stichera01.melody	@ltx/en_us_goadedes/he.a.m4:heAU.EdokasSimeiosin.name
ltx/en_us_goadedes/me.m02.d13:meVE.Stichera01.mode	@ltx/en_us_goadedes/miscellanea:misc.Mode4
ltx/en_us_goadedes/me.m02.d13:meVE.Stichera01.text	
ltx/en_us_goadedes/me.m02.d13:meVE.Stichera02.incipit	…
ltx/en_us_goadedes/me.m02.d13:meVE.Stichera02.melody	@ltx/en_us_goadedes/he.a.m4:heAU.EdokasSimeiosin.name
ltx/en_us_goadedes/me.m02.d13:meVE.Stichera02.mode	@ltx/en_us_goadedes/miscellanea:misc.Mode4
ltx/en_us_goadedes/me.m02.d13:meVE.Stichera02.text	
ltx/en_us_goadedes/me.m02.d13:meVE.Stichera03.incipit	…
ltx/en_us_goadedes/me.m02.d13:meVE.Stichera03.melody	@ltx/en_us_goadedes/he.a.m4:heAU.EdokasSimeiosin.name
ltx/en_us_goadedes/me.m02.d13:meVE.Stichera03.mode	@ltx/en_us_goadedes/miscellanea:misc.Mode4
ltx/en_us_goadedes/me.m02.d13:meVE.Stichera03.text	
