ltx/en_us_goadedes/me.m06.d27:meDA.commemoration.first	
ltx/en_us_goadedes/me.m06.d27:meDA.commemoration.first_name	
ltx/en_us_goadedes/me.m06.d27:meDA.commemoration.first_short	
ltx/en_us_goadedes/me.m06.d27:meDA.commemoration.first_title	@ltx/en_us_goadedes/titles:ti.SaintM
ltx/en_us_goadedes/me.m06.d27:meDA.commemoration.full	
ltx/en_us_goadedes/me.m06.d27:meDA.commemoration.second_name	
ltx/en_us_goadedes/me.m06.d27:meDA.commemoration.second_title	
ltx/en_us_goadedes/me.m06.d27:meDA.date	
ltx/en_us_goadedes/me.m06.d27:meDA.dismissal	
ltx/en_us_goadedes/me.m06.d27:meDA.fordate	
ltx/en_us_goadedes/me.m06.d27:meDA.insert1	
ltx/en_us_goadedes/me.m06.d27:meDA.insert2	
ltx/en_us_goadedes/me.m06.d27:meDA.note	
ltx/en_us_goadedes/me.m06.d27:meDA.pdfcoverdate	
ltx/en_us_goadedes/me.m06.d27:meDA.pdfheaderdate	
ltx/en_us_goadedes/me.m06.d27:meHO.commemorations	
ltx/en_us_goadedes/me.m06.d27:meHO.note1	
ltx/en_us_goadedes/me.m06.d27:meHO.note2	
ltx/en_us_goadedes/me.m06.d27:meHO.number	
ltx/en_us_goadedes/me.m06.d27:meHO.rank	
ltx/en_us_goadedes/me.m06.d27:meLE.commemoration1	
ltx/en_us_goadedes/me.m06.d27:meLE.commemoration2	
ltx/en_us_goadedes/me.m06.d27:meLI.Kontakion1.greekmelody	@ltx/en_us_goadedes/me.m06.d27:meMA.Kontakion1.greekmelody
ltx/en_us_goadedes/me.m06.d27:meLI.Kontakion1.incipit	@ltx/en_us_goadedes/me.m06.d27:meMA.Kontakion1.incipit
ltx/en_us_goadedes/me.m06.d27:meLI.Kontakion1.melody	@ltx/en_us_goadedes/me.m06.d27:meMA.Kontakion1.melody
ltx/en_us_goadedes/me.m06.d27:meLI.Kontakion1.mode	@ltx/en_us_goadedes/me.m06.d27:meMA.Kontakion1.mode
ltx/en_us_goadedes/me.m06.d27:meLI.Kontakion1.text	@ltx/en_us_goadedes/me.m06.d27:meMA.Kontakion1.text
ltx/en_us_goadedes/me.m06.d27:meLI.MM.CommunionHymn.text	@ltx/en_us_goadedes/properties:media.key
ltx/en_us_goadedes/me.m06.d27:meLI.Megalynarion.text	
ltx/en_us_goadedes/me.m06.d27:meMA.C1.acrostic.notice1	
ltx/en_us_goadedes/me.m06.d27:meMA.C1.acrostic.text	
ltx/en_us_goadedes/me.m06.d27:meMA.C1.acrostic.title	
ltx/en_us_goadedes/me.m06.d27:meMA.C1.title	@ltx/en_us_goadedes/titles:ti.CanonSaintM
ltx/en_us_goadedes/me.m06.d27:meMA.C1.verse	@ltx/en_us_goadedes/prayers:pr.verse_SaintM.text
ltx/en_us_goadedes/me.m06.d27:meMA.Kontakion1.greekmelody	@ltx/en_us_goadedes/he.a.m8:heAU.OsAparchas.greekname
ltx/en_us_goadedes/me.m06.d27:meMA.Kontakion1.incipit	…
ltx/en_us_goadedes/me.m06.d27:meMA.Kontakion1.melody	@ltx/en_us_goadedes/he.a.m8:heAU.OsAparchas.name
ltx/en_us_goadedes/me.m06.d27:meMA.Kontakion1.mode	@ltx/en_us_goadedes/miscellanea:misc.Mode4
ltx/en_us_goadedes/me.m06.d27:meMA.Kontakion1.text	
ltx/en_us_goadedes/me.m06.d27:meMA.Ode1C11.greekmelody	@ltx/en_us_goadedes/he.h.m2:heHE.DefteLaoi.greekname
ltx/en_us_goadedes/me.m06.d27:meMA.Ode1C11.incipit	…
ltx/en_us_goadedes/me.m06.d27:meMA.Ode1C11.melody	@ltx/en_us_goadedes/he.h.m2:heHE.DefteLaoi.name
ltx/en_us_goadedes/me.m06.d27:meMA.Ode1C11.mode	@ltx/en_us_goadedes/miscellanea:misc.Mode2
ltx/en_us_goadedes/me.m06.d27:meMA.Ode1C11.ode	@ltx/en_us_goadedes/miscellanea:misc.Ode1
ltx/en_us_goadedes/me.m06.d27:meMA.Ode1C11.text	
ltx/en_us_goadedes/me.m06.d27:meMA.Ode1C12.incipit	…
ltx/en_us_goadedes/me.m06.d27:meMA.Ode1C12.melody	@ltx/en_us_goadedes/he.h.m2:heHE.DefteLaoi.name
ltx/en_us_goadedes/me.m06.d27:meMA.Ode1C12.mode	@ltx/en_us_goadedes/miscellanea:misc.Mode2
ltx/en_us_goadedes/me.m06.d27:meMA.Ode1C12.ode	@ltx/en_us_goadedes/miscellanea:misc.Ode1
ltx/en_us_goadedes/me.m06.d27:meMA.Ode1C12.text	
ltx/en_us_goadedes/me.m06.d27:meMA.Ode1C13.incipit	…
ltx/en_us_goadedes/me.m06.d27:meMA.Ode1C13.melody	@ltx/en_us_goadedes/he.h.m2:heHE.DefteLaoi.name
ltx/en_us_goadedes/me.m06.d27:meMA.Ode1C13.mode	@ltx/en_us_goadedes/miscellanea:misc.Mode2
ltx/en_us_goadedes/me.m06.d27:meMA.Ode1C13.ode	@ltx/en_us_goadedes/miscellanea:misc.Ode1
ltx/en_us_goadedes/me.m06.d27:meMA.Ode1C13.text	
ltx/en_us_goadedes/me.m06.d27:meMA.Ode1C14.incipit	…
ltx/en_us_goadedes/me.m06.d27:meMA.Ode1C14.melody	@ltx/en_us_goadedes/he.h.m2:heHE.DefteLaoi.name
ltx/en_us_goadedes/me.m06.d27:meMA.Ode1C14.mode	@ltx/en_us_goadedes/miscellanea:misc.Mode2
ltx/en_us_goadedes/me.m06.d27:meMA.Ode1C14.ode	@ltx/en_us_goadedes/miscellanea:misc.Ode1
ltx/en_us_goadedes/me.m06.d27:meMA.Ode1C14.text	
ltx/en_us_goadedes/me.m06.d27:meMA.Ode1C1T.incipit	…
ltx/en_us_goadedes/me.m06.d27:meMA.Ode1C1T.melody	@ltx/en_us_goadedes/he.h.m2:heHE.DefteLaoi.name
ltx/en_us_goadedes/me.m06.d27:meMA.Ode1C1T.mode	@ltx/en_us_goadedes/miscellanea:misc.Mode2
ltx/en_us_goadedes/me.m06.d27:meMA.Ode1C1T.ode	@ltx/en_us_goadedes/miscellanea:misc.Ode1
ltx/en_us_goadedes/me.m06.d27:meMA.Ode1C1T.text	
ltx/en_us_goadedes/me.m06.d27:meMA.Ode3C11.greekmelody	@ltx/en_us_goadedes/he.h.m2:heHE.StereosonImasEnSoiKyrie.greekname
ltx/en_us_goadedes/me.m06.d27:meMA.Ode3C11.incipit	…
ltx/en_us_goadedes/me.m06.d27:meMA.Ode3C11.melody	@ltx/en_us_goadedes/he.h.m2:heHE.StereosonImasEnSoiKyrie.name
ltx/en_us_goadedes/me.m06.d27:meMA.Ode3C11.mode	@ltx/en_us_goadedes/miscellanea:misc.Mode2
ltx/en_us_goadedes/me.m06.d27:meMA.Ode3C11.ode	@ltx/en_us_goadedes/miscellanea:misc.Ode3
ltx/en_us_goadedes/me.m06.d27:meMA.Ode3C11.text	
ltx/en_us_goadedes/me.m06.d27:meMA.Ode3C12.incipit	…
ltx/en_us_goadedes/me.m06.d27:meMA.Ode3C12.melody	@ltx/en_us_goadedes/he.h.m2:heHE.StereosonImasEnSoiKyrie.name
ltx/en_us_goadedes/me.m06.d27:meMA.Ode3C12.mode	@ltx/en_us_goadedes/miscellanea:misc.Mode2
ltx/en_us_goadedes/me.m06.d27:meMA.Ode3C12.ode	@ltx/en_us_goadedes/miscellanea:misc.Ode3
ltx/en_us_goadedes/me.m06.d27:meMA.Ode3C12.text	
ltx/en_us_goadedes/me.m06.d27:meMA.Ode3C13.incipit	…
ltx/en_us_goadedes/me.m06.d27:meMA.Ode3C13.melody	@ltx/en_us_goadedes/he.h.m2:heHE.StereosonImasEnSoiKyrie.name
ltx/en_us_goadedes/me.m06.d27:meMA.Ode3C13.mode	@ltx/en_us_goadedes/miscellanea:misc.Mode2
ltx/en_us_goadedes/me.m06.d27:meMA.Ode3C13.ode	@ltx/en_us_goadedes/miscellanea:misc.Ode3
ltx/en_us_goadedes/me.m06.d27:meMA.Ode3C13.text	
ltx/en_us_goadedes/me.m06.d27:meMA.Ode3C14.incipit	…
ltx/en_us_goadedes/me.m06.d27:meMA.Ode3C14.melody	@ltx/en_us_goadedes/he.h.m2:heHE.StereosonImasEnSoiKyrie.name
ltx/en_us_goadedes/me.m06.d27:meMA.Ode3C14.mode	@ltx/en_us_goadedes/miscellanea:misc.Mode2
ltx/en_us_goadedes/me.m06.d27:meMA.Ode3C14.ode	@ltx/en_us_goadedes/miscellanea:misc.Ode3
ltx/en_us_goadedes/me.m06.d27:meMA.Ode3C14.text	
ltx/en_us_goadedes/me.m06.d27:meMA.Ode3C1T.incipit	…
ltx/en_us_goadedes/me.m06.d27:meMA.Ode3C1T.melody	@ltx/en_us_goadedes/he.h.m2:heHE.StereosonImasEnSoiKyrie.name
ltx/en_us_goadedes/me.m06.d27:meMA.Ode3C1T.mode	@ltx/en_us_goadedes/miscellanea:misc.Mode2
ltx/en_us_goadedes/me.m06.d27:meMA.Ode3C1T.ode	@ltx/en_us_goadedes/miscellanea:misc.Ode3
ltx/en_us_goadedes/me.m06.d27:meMA.Ode3C1T.text	
ltx/en_us_goadedes/me.m06.d27:meMA.Ode3H.greekmelody	@ltx/en_us_goadedes/he.h.m2:heHE.StereosonImasEnSoiKyrie.greekname
ltx/en_us_goadedes/me.m06.d27:meMA.Ode3H.incipit	@ltx/en_us_goadedes/he.h.m2:heHE.StereosonImasEnSoiKyrie.incipit
ltx/en_us_goadedes/me.m06.d27:meMA.Ode3H.melody	@ltx/en_us_goadedes/he.h.m2:heHE.StereosonImasEnSoiKyrie.melody
ltx/en_us_goadedes/me.m06.d27:meMA.Ode3H.mode	@ltx/en_us_goadedes/miscellanea:misc.Mode2
ltx/en_us_goadedes/me.m06.d27:meMA.Ode3H.ode	@ltx/en_us_goadedes/miscellanea:misc.Ode3
ltx/en_us_goadedes/me.m06.d27:meMA.Ode3H.text	@ltx/en_us_goadedes/he.h.m2:heHE.StereosonImasEnSoiKyrie.text
ltx/en_us_goadedes/me.m06.d27:meMA.Ode3Kathisma1.greekmelody	@ltx/en_us_goadedes/he.a.m1:heAU.TonTafonSouSotir.greekname
ltx/en_us_goadedes/me.m06.d27:meMA.Ode3Kathisma1.incipit	…
ltx/en_us_goadedes/me.m06.d27:meMA.Ode3Kathisma1.melody	@ltx/en_us_goadedes/he.a.m1:heAU.TonTafonSouSotir.name
ltx/en_us_goadedes/me.m06.d27:meMA.Ode3Kathisma1.mode	@ltx/en_us_goadedes/miscellanea:misc.Mode1
ltx/en_us_goadedes/me.m06.d27:meMA.Ode3Kathisma1.text	
ltx/en_us_goadedes/me.m06.d27:meMA.Ode3KathismaSt.incipit	…
ltx/en_us_goadedes/me.m06.d27:meMA.Ode3KathismaSt.melody	@ltx/en_us_goadedes/he.a.m1:heAU.TonTafonSouSotir.name
ltx/en_us_goadedes/me.m06.d27:meMA.Ode3KathismaSt.mode	@ltx/en_us_goadedes/miscellanea:misc.Mode1
ltx/en_us_goadedes/me.m06.d27:meMA.Ode3KathismaSt.text	
ltx/en_us_goadedes/me.m06.d27:meMA.Ode3KathismaT.incipit	…
ltx/en_us_goadedes/me.m06.d27:meMA.Ode3KathismaT.melody	@ltx/en_us_goadedes/he.a.m1:heAU.TonTafonSouSotir.name
ltx/en_us_goadedes/me.m06.d27:meMA.Ode3KathismaT.mode	@ltx/en_us_goadedes/miscellanea:misc.Mode1
ltx/en_us_goadedes/me.m06.d27:meMA.Ode3KathismaT.text	
ltx/en_us_goadedes/me.m06.d27:meMA.Ode4C11.greekmelody	@ltx/en_us_goadedes/he.h.m2:heHE.EisakikoaKyrieTinAkoin.greekname
ltx/en_us_goadedes/me.m06.d27:meMA.Ode4C11.incipit	…
ltx/en_us_goadedes/me.m06.d27:meMA.Ode4C11.melody	@ltx/en_us_goadedes/he.h.m2:heHE.EisakikoaKyrieTinAkoin.name
ltx/en_us_goadedes/me.m06.d27:meMA.Ode4C11.mode	@ltx/en_us_goadedes/miscellanea:misc.Mode2
ltx/en_us_goadedes/me.m06.d27:meMA.Ode4C11.ode	@ltx/en_us_goadedes/miscellanea:misc.Ode4
ltx/en_us_goadedes/me.m06.d27:meMA.Ode4C11.text	
ltx/en_us_goadedes/me.m06.d27:meMA.Ode4C12.incipit	…
ltx/en_us_goadedes/me.m06.d27:meMA.Ode4C12.melody	@ltx/en_us_goadedes/he.h.m2:heHE.EisakikoaKyrieTinAkoin.name
ltx/en_us_goadedes/me.m06.d27:meMA.Ode4C12.mode	@ltx/en_us_goadedes/miscellanea:misc.Mode2
ltx/en_us_goadedes/me.m06.d27:meMA.Ode4C12.ode	@ltx/en_us_goadedes/miscellanea:misc.Ode4
ltx/en_us_goadedes/me.m06.d27:meMA.Ode4C12.text	
ltx/en_us_goadedes/me.m06.d27:meMA.Ode4C13.incipit	…
ltx/en_us_goadedes/me.m06.d27:meMA.Ode4C13.melody	@ltx/en_us_goadedes/he.h.m2:heHE.EisakikoaKyrieTinAkoin.name
ltx/en_us_goadedes/me.m06.d27:meMA.Ode4C13.mode	@ltx/en_us_goadedes/miscellanea:misc.Mode2
ltx/en_us_goadedes/me.m06.d27:meMA.Ode4C13.ode	@ltx/en_us_goadedes/miscellanea:misc.Ode4
ltx/en_us_goadedes/me.m06.d27:meMA.Ode4C13.text	
ltx/en_us_goadedes/me.m06.d27:meMA.Ode4C14.incipit	…
ltx/en_us_goadedes/me.m06.d27:meMA.Ode4C14.melody	@ltx/en_us_goadedes/he.h.m2:heHE.EisakikoaKyrieTinAkoin.name
ltx/en_us_goadedes/me.m06.d27:meMA.Ode4C14.mode	@ltx/en_us_goadedes/miscellanea:misc.Mode2
ltx/en_us_goadedes/me.m06.d27:meMA.Ode4C14.ode	@ltx/en_us_goadedes/miscellanea:misc.Ode4
ltx/en_us_goadedes/me.m06.d27:meMA.Ode4C14.text	
ltx/en_us_goadedes/me.m06.d27:meMA.Ode4C1T.incipit	…
ltx/en_us_goadedes/me.m06.d27:meMA.Ode4C1T.melody	@ltx/en_us_goadedes/he.h.m2:heHE.EisakikoaKyrieTinAkoin.name
ltx/en_us_goadedes/me.m06.d27:meMA.Ode4C1T.mode	@ltx/en_us_goadedes/miscellanea:misc.Mode2
ltx/en_us_goadedes/me.m06.d27:meMA.Ode4C1T.ode	@ltx/en_us_goadedes/miscellanea:misc.Ode4
ltx/en_us_goadedes/me.m06.d27:meMA.Ode4C1T.text	
ltx/en_us_goadedes/me.m06.d27:meMA.Ode5C11.greekmelody	@ltx/en_us_goadedes/he.h.m2:heHE.OTouFotosChorigos.greekname
ltx/en_us_goadedes/me.m06.d27:meMA.Ode5C11.incipit	…
ltx/en_us_goadedes/me.m06.d27:meMA.Ode5C11.melody	@ltx/en_us_goadedes/he.h.m2:heHE.OTouFotosChorigos.name
ltx/en_us_goadedes/me.m06.d27:meMA.Ode5C11.mode	@ltx/en_us_goadedes/miscellanea:misc.Mode2
ltx/en_us_goadedes/me.m06.d27:meMA.Ode5C11.ode	@ltx/en_us_goadedes/miscellanea:misc.Ode5
ltx/en_us_goadedes/me.m06.d27:meMA.Ode5C11.text	
ltx/en_us_goadedes/me.m06.d27:meMA.Ode5C12.incipit	…
ltx/en_us_goadedes/me.m06.d27:meMA.Ode5C12.melody	@ltx/en_us_goadedes/he.h.m2:heHE.OTouFotosChorigos.name
ltx/en_us_goadedes/me.m06.d27:meMA.Ode5C12.mode	@ltx/en_us_goadedes/miscellanea:misc.Mode2
ltx/en_us_goadedes/me.m06.d27:meMA.Ode5C12.ode	@ltx/en_us_goadedes/miscellanea:misc.Ode5
ltx/en_us_goadedes/me.m06.d27:meMA.Ode5C12.text	
ltx/en_us_goadedes/me.m06.d27:meMA.Ode5C13.incipit	…
ltx/en_us_goadedes/me.m06.d27:meMA.Ode5C13.melody	@ltx/en_us_goadedes/he.h.m2:heHE.OTouFotosChorigos.name
ltx/en_us_goadedes/me.m06.d27:meMA.Ode5C13.mode	@ltx/en_us_goadedes/miscellanea:misc.Mode2
ltx/en_us_goadedes/me.m06.d27:meMA.Ode5C13.ode	@ltx/en_us_goadedes/miscellanea:misc.Ode5
ltx/en_us_goadedes/me.m06.d27:meMA.Ode5C13.text	
ltx/en_us_goadedes/me.m06.d27:meMA.Ode5C1T.incipit	…
ltx/en_us_goadedes/me.m06.d27:meMA.Ode5C1T.melody	@ltx/en_us_goadedes/he.h.m2:heHE.OTouFotosChorigos.name
ltx/en_us_goadedes/me.m06.d27:meMA.Ode5C1T.mode	@ltx/en_us_goadedes/miscellanea:misc.Mode2
ltx/en_us_goadedes/me.m06.d27:meMA.Ode5C1T.ode	@ltx/en_us_goadedes/miscellanea:misc.Ode5
ltx/en_us_goadedes/me.m06.d27:meMA.Ode5C1T.text	
ltx/en_us_goadedes/me.m06.d27:meMA.Ode6C11.greekmelody	@ltx/en_us_goadedes/he.h.m2:heHE.EnAvyssoPtaismaton.greekname
ltx/en_us_goadedes/me.m06.d27:meMA.Ode6C11.incipit	…
ltx/en_us_goadedes/me.m06.d27:meMA.Ode6C11.melody	@ltx/en_us_goadedes/he.h.m2:heHE.EnAvyssoPtaismaton.name
ltx/en_us_goadedes/me.m06.d27:meMA.Ode6C11.mode	@ltx/en_us_goadedes/miscellanea:misc.Mode2
ltx/en_us_goadedes/me.m06.d27:meMA.Ode6C11.ode	@ltx/en_us_goadedes/miscellanea:misc.Ode6
ltx/en_us_goadedes/me.m06.d27:meMA.Ode6C11.text	
ltx/en_us_goadedes/me.m06.d27:meMA.Ode6C12.incipit	…
ltx/en_us_goadedes/me.m06.d27:meMA.Ode6C12.melody	@ltx/en_us_goadedes/he.h.m2:heHE.EnAvyssoPtaismaton.name
ltx/en_us_goadedes/me.m06.d27:meMA.Ode6C12.mode	@ltx/en_us_goadedes/miscellanea:misc.Mode2
ltx/en_us_goadedes/me.m06.d27:meMA.Ode6C12.ode	@ltx/en_us_goadedes/miscellanea:misc.Ode6
ltx/en_us_goadedes/me.m06.d27:meMA.Ode6C12.text	
ltx/en_us_goadedes/me.m06.d27:meMA.Ode6C13.incipit	…
ltx/en_us_goadedes/me.m06.d27:meMA.Ode6C13.melody	@ltx/en_us_goadedes/he.h.m2:heHE.EnAvyssoPtaismaton.name
ltx/en_us_goadedes/me.m06.d27:meMA.Ode6C13.mode	@ltx/en_us_goadedes/miscellanea:misc.Mode2
ltx/en_us_goadedes/me.m06.d27:meMA.Ode6C13.ode	@ltx/en_us_goadedes/miscellanea:misc.Ode6
ltx/en_us_goadedes/me.m06.d27:meMA.Ode6C13.text	
ltx/en_us_goadedes/me.m06.d27:meMA.Ode6C1T.incipit	…
ltx/en_us_goadedes/me.m06.d27:meMA.Ode6C1T.melody	@ltx/en_us_goadedes/he.h.m2:heHE.EnAvyssoPtaismaton.name
ltx/en_us_goadedes/me.m06.d27:meMA.Ode6C1T.mode	@ltx/en_us_goadedes/miscellanea:misc.Mode2
ltx/en_us_goadedes/me.m06.d27:meMA.Ode6C1T.ode	@ltx/en_us_goadedes/miscellanea:misc.Ode6
ltx/en_us_goadedes/me.m06.d27:meMA.Ode6C1T.text	
ltx/en_us_goadedes/me.m06.d27:meMA.Ode6H.greekmelody	@ltx/en_us_goadedes/he.h.m2:heHE.EnAvyssoPtaismaton.greekname
ltx/en_us_goadedes/me.m06.d27:meMA.Ode6H.incipit	@ltx/en_us_goadedes/he.h.m2:heHE.EnAvyssoPtaismaton.incipit
ltx/en_us_goadedes/me.m06.d27:meMA.Ode6H.melody	@ltx/en_us_goadedes/he.h.m2:heHE.EnAvyssoPtaismaton.melody
ltx/en_us_goadedes/me.m06.d27:meMA.Ode6H.mode	@ltx/en_us_goadedes/miscellanea:misc.Mode2
ltx/en_us_goadedes/me.m06.d27:meMA.Ode6H.ode	@ltx/en_us_goadedes/miscellanea:misc.Ode6
ltx/en_us_goadedes/me.m06.d27:meMA.Ode6H.text	@ltx/en_us_goadedes/he.h.m2:heHE.EnAvyssoPtaismaton.text
ltx/en_us_goadedes/me.m06.d27:meMA.Ode7C11.greekmelody	@ltx/en_us_goadedes/he.h.m2:heHE.EikonosChrysis.greekname
ltx/en_us_goadedes/me.m06.d27:meMA.Ode7C11.incipit	…
ltx/en_us_goadedes/me.m06.d27:meMA.Ode7C11.melody	@ltx/en_us_goadedes/he.h.m2:heHE.EikonosChrysis.name
ltx/en_us_goadedes/me.m06.d27:meMA.Ode7C11.mode	@ltx/en_us_goadedes/miscellanea:misc.Mode2
ltx/en_us_goadedes/me.m06.d27:meMA.Ode7C11.ode	@ltx/en_us_goadedes/miscellanea:misc.Ode7
ltx/en_us_goadedes/me.m06.d27:meMA.Ode7C11.text	
ltx/en_us_goadedes/me.m06.d27:meMA.Ode7C12.incipit	…
ltx/en_us_goadedes/me.m06.d27:meMA.Ode7C12.melody	@ltx/en_us_goadedes/he.h.m2:heHE.EikonosChrysis.name
ltx/en_us_goadedes/me.m06.d27:meMA.Ode7C12.mode	@ltx/en_us_goadedes/miscellanea:misc.Mode2
ltx/en_us_goadedes/me.m06.d27:meMA.Ode7C12.ode	@ltx/en_us_goadedes/miscellanea:misc.Ode7
ltx/en_us_goadedes/me.m06.d27:meMA.Ode7C12.text	
ltx/en_us_goadedes/me.m06.d27:meMA.Ode7C13.incipit	…
ltx/en_us_goadedes/me.m06.d27:meMA.Ode7C13.melody	@ltx/en_us_goadedes/he.h.m2:heHE.EikonosChrysis.name
ltx/en_us_goadedes/me.m06.d27:meMA.Ode7C13.mode	@ltx/en_us_goadedes/miscellanea:misc.Mode2
ltx/en_us_goadedes/me.m06.d27:meMA.Ode7C13.ode	@ltx/en_us_goadedes/miscellanea:misc.Ode7
ltx/en_us_goadedes/me.m06.d27:meMA.Ode7C13.text	
ltx/en_us_goadedes/me.m06.d27:meMA.Ode7C1T.incipit	…
ltx/en_us_goadedes/me.m06.d27:meMA.Ode7C1T.melody	@ltx/en_us_goadedes/he.h.m2:heHE.EikonosChrysis.name
ltx/en_us_goadedes/me.m06.d27:meMA.Ode7C1T.mode	@ltx/en_us_goadedes/miscellanea:misc.Mode2
ltx/en_us_goadedes/me.m06.d27:meMA.Ode7C1T.ode	@ltx/en_us_goadedes/miscellanea:misc.Ode7
ltx/en_us_goadedes/me.m06.d27:meMA.Ode7C1T.text	
ltx/en_us_goadedes/me.m06.d27:meMA.Ode8C11.greekmelody	@ltx/en_us_goadedes/he.h.m2:heHE.TonEnKaminoTouPyros.greekname
ltx/en_us_goadedes/me.m06.d27:meMA.Ode8C11.incipit	…
ltx/en_us_goadedes/me.m06.d27:meMA.Ode8C11.melody	@ltx/en_us_goadedes/he.h.m2:heHE.TonEnKaminoTouPyros.name
ltx/en_us_goadedes/me.m06.d27:meMA.Ode8C11.mode	@ltx/en_us_goadedes/miscellanea:misc.Mode2
ltx/en_us_goadedes/me.m06.d27:meMA.Ode8C11.ode	@ltx/en_us_goadedes/miscellanea:misc.Ode8
ltx/en_us_goadedes/me.m06.d27:meMA.Ode8C11.text	
ltx/en_us_goadedes/me.m06.d27:meMA.Ode8C12.incipit	…
ltx/en_us_goadedes/me.m06.d27:meMA.Ode8C12.melody	@ltx/en_us_goadedes/he.h.m2:heHE.TonEnKaminoTouPyros.name
ltx/en_us_goadedes/me.m06.d27:meMA.Ode8C12.mode	@ltx/en_us_goadedes/miscellanea:misc.Mode2
ltx/en_us_goadedes/me.m06.d27:meMA.Ode8C12.ode	@ltx/en_us_goadedes/miscellanea:misc.Ode8
ltx/en_us_goadedes/me.m06.d27:meMA.Ode8C12.text	
ltx/en_us_goadedes/me.m06.d27:meMA.Ode8C13.incipit	…
ltx/en_us_goadedes/me.m06.d27:meMA.Ode8C13.melody	@ltx/en_us_goadedes/he.h.m2:heHE.TonEnKaminoTouPyros.name
ltx/en_us_goadedes/me.m06.d27:meMA.Ode8C13.mode	@ltx/en_us_goadedes/miscellanea:misc.Mode2
ltx/en_us_goadedes/me.m06.d27:meMA.Ode8C13.ode	@ltx/en_us_goadedes/miscellanea:misc.Ode8
ltx/en_us_goadedes/me.m06.d27:meMA.Ode8C13.text	
ltx/en_us_goadedes/me.m06.d27:meMA.Ode8C1T.incipit	…
ltx/en_us_goadedes/me.m06.d27:meMA.Ode8C1T.melody	@ltx/en_us_goadedes/he.h.m2:heHE.TonEnKaminoTouPyros.name
ltx/en_us_goadedes/me.m06.d27:meMA.Ode8C1T.mode	@ltx/en_us_goadedes/miscellanea:misc.Mode2
ltx/en_us_goadedes/me.m06.d27:meMA.Ode8C1T.ode	@ltx/en_us_goadedes/miscellanea:misc.Ode8
ltx/en_us_goadedes/me.m06.d27:meMA.Ode8C1T.text	
ltx/en_us_goadedes/me.m06.d27:meMA.Ode8H.greekmelody	@ltx/en_us_goadedes/he.h.m2:heHE.TonEnKaminoTouPyros.greekname
ltx/en_us_goadedes/me.m06.d27:meMA.Ode8H.incipit	@ltx/en_us_goadedes/he.h.m2:heHE.TonEnKaminoTouPyros.incipit
ltx/en_us_goadedes/me.m06.d27:meMA.Ode8H.melody	@ltx/en_us_goadedes/he.h.m2:heHE.TonEnKaminoTouPyros.melody
ltx/en_us_goadedes/me.m06.d27:meMA.Ode8H.mode	@ltx/en_us_goadedes/miscellanea:misc.Mode2
ltx/en_us_goadedes/me.m06.d27:meMA.Ode8H.ode	@ltx/en_us_goadedes/miscellanea:misc.Ode8
ltx/en_us_goadedes/me.m06.d27:meMA.Ode8H.text	@ltx/en_us_goadedes/he.h.m2:heHE.TonEnKaminoTouPyros.text
ltx/en_us_goadedes/me.m06.d27:meMA.Ode9C11.greekmelody	@ltx/en_us_goadedes/he.h.m2:heHE.TonEkTheouTheonLogon.greekname
ltx/en_us_goadedes/me.m06.d27:meMA.Ode9C11.incipit	…
ltx/en_us_goadedes/me.m06.d27:meMA.Ode9C11.melody	@ltx/en_us_goadedes/he.h.m2:heHE.TonEkTheouTheonLogon.name
ltx/en_us_goadedes/me.m06.d27:meMA.Ode9C11.mode	@ltx/en_us_goadedes/miscellanea:misc.Mode2
ltx/en_us_goadedes/me.m06.d27:meMA.Ode9C11.ode	@ltx/en_us_goadedes/miscellanea:misc.Ode9
ltx/en_us_goadedes/me.m06.d27:meMA.Ode9C11.text	
ltx/en_us_goadedes/me.m06.d27:meMA.Ode9C12.incipit	…
ltx/en_us_goadedes/me.m06.d27:meMA.Ode9C12.melody	@ltx/en_us_goadedes/he.h.m2:heHE.TonEkTheouTheonLogon.name
ltx/en_us_goadedes/me.m06.d27:meMA.Ode9C12.mode	@ltx/en_us_goadedes/miscellanea:misc.Mode2
ltx/en_us_goadedes/me.m06.d27:meMA.Ode9C12.ode	@ltx/en_us_goadedes/miscellanea:misc.Ode9
ltx/en_us_goadedes/me.m06.d27:meMA.Ode9C12.text	
ltx/en_us_goadedes/me.m06.d27:meMA.Ode9C13.incipit	…
ltx/en_us_goadedes/me.m06.d27:meMA.Ode9C13.melody	@ltx/en_us_goadedes/he.h.m2:heHE.TonEkTheouTheonLogon.name
ltx/en_us_goadedes/me.m06.d27:meMA.Ode9C13.mode	@ltx/en_us_goadedes/miscellanea:misc.Mode2
ltx/en_us_goadedes/me.m06.d27:meMA.Ode9C13.ode	@ltx/en_us_goadedes/miscellanea:misc.Ode9
ltx/en_us_goadedes/me.m06.d27:meMA.Ode9C13.text	
ltx/en_us_goadedes/me.m06.d27:meMA.Ode9C14.incipit	…
ltx/en_us_goadedes/me.m06.d27:meMA.Ode9C14.melody	@ltx/en_us_goadedes/he.h.m2:heHE.TonEkTheouTheonLogon.name
ltx/en_us_goadedes/me.m06.d27:meMA.Ode9C14.mode	@ltx/en_us_goadedes/miscellanea:misc.Mode2
ltx/en_us_goadedes/me.m06.d27:meMA.Ode9C14.ode	@ltx/en_us_goadedes/miscellanea:misc.Ode9
ltx/en_us_goadedes/me.m06.d27:meMA.Ode9C14.text	
ltx/en_us_goadedes/me.m06.d27:meMA.Ode9C1T.incipit	…
ltx/en_us_goadedes/me.m06.d27:meMA.Ode9C1T.melody	@ltx/en_us_goadedes/he.h.m2:heHE.TonEkTheouTheonLogon.name
ltx/en_us_goadedes/me.m06.d27:meMA.Ode9C1T.mode	@ltx/en_us_goadedes/miscellanea:misc.Mode2
ltx/en_us_goadedes/me.m06.d27:meMA.Ode9C1T.ode	@ltx/en_us_goadedes/miscellanea:misc.Ode9
ltx/en_us_goadedes/me.m06.d27:meMA.Ode9C1T.text	
ltx/en_us_goadedes/me.m06.d27:meMA.Ode9H.greekmelody	@ltx/en_us_goadedes/he.h.m2:heHE.TonEkTheouTheonLogon.greekname
ltx/en_us_goadedes/me.m06.d27:meMA.Ode9H.incipit	@ltx/en_us_goadedes/he.h.m2:heHE.TonEkTheouTheonLogon.incipit
ltx/en_us_goadedes/me.m06.d27:meMA.Ode9H.melody	@ltx/en_us_goadedes/he.h.m2:heHE.TonEkTheouTheonLogon.melody
ltx/en_us_goadedes/me.m06.d27:meMA.Ode9H.mode	@ltx/en_us_goadedes/miscellanea:misc.Mode2
ltx/en_us_goadedes/me.m06.d27:meMA.Ode9H.ode	@ltx/en_us_goadedes/miscellanea:misc.Ode9
ltx/en_us_goadedes/me.m06.d27:meMA.Ode9H.text	@ltx/en_us_goadedes/he.h.m2:heHE.TonEkTheouTheonLogon.text
ltx/en_us_goadedes/me.m06.d27:meVE.Apolytikion1.incipit	…
ltx/en_us_goadedes/me.m06.d27:meVE.Apolytikion1.melody	
ltx/en_us_goadedes/me.m06.d27:meVE.Apolytikion1.mode	@ltx/en_us_goadedes/miscellanea:misc.Mode8
ltx/en_us_goadedes/me.m06.d27:meVE.Apolytikion1.text	
ltx/en_us_goadedes/me.m06.d27:meVE.Apolytikion2ger.greekmelody	@ltx/en_us_goadedes/he.a.m4:heAU.TachyProkatalave.greekname
ltx/en_us_goadedes/me.m06.d27:meVE.Apolytikion2ger.incipit	…
ltx/en_us_goadedes/me.m06.d27:meVE.Apolytikion2ger.melody	@ltx/en_us_goadedes/he.a.m4:heAU.TachyProkatalave.name
ltx/en_us_goadedes/me.m06.d27:meVE.Apolytikion2ger.mode	@ltx/en_us_goadedes/miscellanea:misc.Mode4
ltx/en_us_goadedes/me.m06.d27:meVE.Apolytikion2ger.poet	@ltx/en_us_goadedes/poets:po.Gerasimou
ltx/en_us_goadedes/me.m06.d27:meVE.Apolytikion2ger.text	
ltx/en_us_goadedes/me.m06.d27:meVE.SticStavrotheotokion.greekmelody	@ltx/en_us_goadedes/he.a.m1:heAU.PaneffimoiMartyres.greekname
ltx/en_us_goadedes/me.m06.d27:meVE.SticStavrotheotokion.incipit	@ltx/en_us_goadedes/me.m03.d05:meVE.SticStavrotheotokion.incipit
ltx/en_us_goadedes/me.m06.d27:meVE.SticStavrotheotokion.melody	@ltx/en_us_goadedes/he.a.m1:heAU.PaneffimoiMartyres.name
ltx/en_us_goadedes/me.m06.d27:meVE.SticStavrotheotokion.mode	@ltx/en_us_goadedes/miscellanea:misc.Mode1
ltx/en_us_goadedes/me.m06.d27:meVE.SticStavrotheotokion.text	@ltx/en_us_goadedes/me.m03.d05:meVE.SticStavrotheotokion.text
ltx/en_us_goadedes/me.m06.d27:meVE.SticTheotokion.greekmelody	@ltx/en_us_goadedes/he.a.m1:heAU.PaneffimoiMartyres.greekname
ltx/en_us_goadedes/me.m06.d27:meVE.SticTheotokion.incipit	@ltx/en_us_goadedes/oc.m1.d2:ocVE.SticTheotokion.incipit
ltx/en_us_goadedes/me.m06.d27:meVE.SticTheotokion.melody	@ltx/en_us_goadedes/he.a.m1:heAU.PaneffimoiMartyres.name
ltx/en_us_goadedes/me.m06.d27:meVE.SticTheotokion.mode	@ltx/en_us_goadedes/miscellanea:misc.Mode1
ltx/en_us_goadedes/me.m06.d27:meVE.SticTheotokion.text	@ltx/en_us_goadedes/oc.m1.d2:ocVE.SticTheotokion.text
ltx/en_us_goadedes/me.m06.d27:meVE.Stichera01.greekmelody	@ltx/en_us_goadedes/he.a.m1:heAU.PaneffimoiMartyres.greekname
ltx/en_us_goadedes/me.m06.d27:meVE.Stichera01.incipit	…
ltx/en_us_goadedes/me.m06.d27:meVE.Stichera01.melody	@ltx/en_us_goadedes/he.a.m1:heAU.PaneffimoiMartyres.name
ltx/en_us_goadedes/me.m06.d27:meVE.Stichera01.mode	@ltx/en_us_goadedes/miscellanea:misc.Mode1
ltx/en_us_goadedes/me.m06.d27:meVE.Stichera01.text	
ltx/en_us_goadedes/me.m06.d27:meVE.Stichera02.incipit	…
ltx/en_us_goadedes/me.m06.d27:meVE.Stichera02.melody	@ltx/en_us_goadedes/he.a.m1:heAU.PaneffimoiMartyres.name
ltx/en_us_goadedes/me.m06.d27:meVE.Stichera02.mode	@ltx/en_us_goadedes/miscellanea:misc.Mode1
ltx/en_us_goadedes/me.m06.d27:meVE.Stichera02.text	
ltx/en_us_goadedes/me.m06.d27:meVE.Stichera03.incipit	…
ltx/en_us_goadedes/me.m06.d27:meVE.Stichera03.melody	@ltx/en_us_goadedes/he.a.m1:heAU.PaneffimoiMartyres.name
ltx/en_us_goadedes/me.m06.d27:meVE.Stichera03.mode	@ltx/en_us_goadedes/miscellanea:misc.Mode1
ltx/en_us_goadedes/me.m06.d27:meVE.Stichera03.text	
