ltx/en_us_goadedes/me.m07.d28:alt1.meDA.commemoration.first_short	Memory of St. Irene Chrysobalantos
ltx/en_us_goadedes/me.m07.d28:alt1.meDA.commemoration.full	
ltx/en_us_goadedes/me.m07.d28:alt1.meDA.commemoration.second	
ltx/en_us_goadedes/me.m07.d28:alt1.meDA.date	July 28
ltx/en_us_goadedes/me.m07.d28:alt1.meLI.Megalynarion.text	
ltx/en_us_goadedes/me.m07.d28:meDA.commemoration.first	
ltx/en_us_goadedes/me.m07.d28:meDA.commemoration.first_name	
ltx/en_us_goadedes/me.m07.d28:meDA.commemoration.first_short	
ltx/en_us_goadedes/me.m07.d28:meDA.commemoration.first_title	@ltx/en_us_goadedes/titles:ti.Saints
ltx/en_us_goadedes/me.m07.d28:meDA.commemoration.full	
ltx/en_us_goadedes/me.m07.d28:meDA.commemoration.second_name	
ltx/en_us_goadedes/me.m07.d28:meDA.commemoration.second_title	
ltx/en_us_goadedes/me.m07.d28:meDA.date	
ltx/en_us_goadedes/me.m07.d28:meDA.fordate	
ltx/en_us_goadedes/me.m07.d28:meDA.insert1	
ltx/en_us_goadedes/me.m07.d28:meDA.insert2	
ltx/en_us_goadedes/me.m07.d28:meDA.note	
ltx/en_us_goadedes/me.m07.d28:meDA.pdfcoverdate	
ltx/en_us_goadedes/me.m07.d28:meDA.pdfheaderdate	
ltx/en_us_goadedes/me.m07.d28:meHO.commemorations	
ltx/en_us_goadedes/me.m07.d28:meHO.note1	
ltx/en_us_goadedes/me.m07.d28:meHO.note2	
ltx/en_us_goadedes/me.m07.d28:meHO.number	
ltx/en_us_goadedes/me.m07.d28:meHO.rank	
ltx/en_us_goadedes/me.m07.d28:meLE.commemoration1	
ltx/en_us_goadedes/me.m07.d28:meLE.commemoration2	
ltx/en_us_goadedes/me.m07.d28:meLI.Kontakion1.incipit	…
ltx/en_us_goadedes/me.m07.d28:meLI.Kontakion1.melody	
ltx/en_us_goadedes/me.m07.d28:meLI.Kontakion1.mode	
ltx/en_us_goadedes/me.m07.d28:meLI.Kontakion1.text	
ltx/en_us_goadedes/me.m07.d28:meLI.Megalynarion.text	
ltx/en_us_goadedes/me.m07.d28:meMA.C1.acrostic.notice1	
ltx/en_us_goadedes/me.m07.d28:meMA.C1.acrostic.text	
ltx/en_us_goadedes/me.m07.d28:meMA.C1.acrostic.title	
ltx/en_us_goadedes/me.m07.d28:meMA.C1.title	@ltx/en_us_goadedes/titles:ti.CanonApostles
ltx/en_us_goadedes/me.m07.d28:meMA.C1.verse	@ltx/en_us_goadedes/prayers:pr.verse_Apostles.text
ltx/en_us_goadedes/me.m07.d28:meMA.Ode1C11.greekmelody	@ltx/en_us_goadedes/he.h.m4:heHE.ThalassisToErythraion.greekname
ltx/en_us_goadedes/me.m07.d28:meMA.Ode1C11.incipit	…
ltx/en_us_goadedes/me.m07.d28:meMA.Ode1C11.melody	@ltx/en_us_goadedes/he.h.m4:heHE.ThalassisToErythraion.name
ltx/en_us_goadedes/me.m07.d28:meMA.Ode1C11.mode	@ltx/en_us_goadedes/miscellanea:misc.Mode4
ltx/en_us_goadedes/me.m07.d28:meMA.Ode1C11.ode	@ltx/en_us_goadedes/miscellanea:misc.Ode1
ltx/en_us_goadedes/me.m07.d28:meMA.Ode1C11.text	
ltx/en_us_goadedes/me.m07.d28:meMA.Ode1C12.incipit	…
ltx/en_us_goadedes/me.m07.d28:meMA.Ode1C12.melody	@ltx/en_us_goadedes/he.h.m4:heHE.ThalassisToErythraion.name
ltx/en_us_goadedes/me.m07.d28:meMA.Ode1C12.mode	@ltx/en_us_goadedes/miscellanea:misc.Mode4
ltx/en_us_goadedes/me.m07.d28:meMA.Ode1C12.ode	@ltx/en_us_goadedes/miscellanea:misc.Ode1
ltx/en_us_goadedes/me.m07.d28:meMA.Ode1C12.text	
ltx/en_us_goadedes/me.m07.d28:meMA.Ode1C13.incipit	…
ltx/en_us_goadedes/me.m07.d28:meMA.Ode1C13.melody	@ltx/en_us_goadedes/he.h.m4:heHE.ThalassisToErythraion.name
ltx/en_us_goadedes/me.m07.d28:meMA.Ode1C13.mode	@ltx/en_us_goadedes/miscellanea:misc.Mode4
ltx/en_us_goadedes/me.m07.d28:meMA.Ode1C13.ode	@ltx/en_us_goadedes/miscellanea:misc.Ode1
ltx/en_us_goadedes/me.m07.d28:meMA.Ode1C13.text	
ltx/en_us_goadedes/me.m07.d28:meMA.Ode1C1T.incipit	…
ltx/en_us_goadedes/me.m07.d28:meMA.Ode1C1T.melody	@ltx/en_us_goadedes/he.h.m4:heHE.ThalassisToErythraion.name
ltx/en_us_goadedes/me.m07.d28:meMA.Ode1C1T.mode	@ltx/en_us_goadedes/miscellanea:misc.Mode4
ltx/en_us_goadedes/me.m07.d28:meMA.Ode1C1T.ode	@ltx/en_us_goadedes/miscellanea:misc.Ode1
ltx/en_us_goadedes/me.m07.d28:meMA.Ode1C1T.text	
ltx/en_us_goadedes/me.m07.d28:meMA.Ode3C11.greekmelody	@ltx/en_us_goadedes/he.h.m4:heHE.EffrainetaiEpiSoi.greekname
ltx/en_us_goadedes/me.m07.d28:meMA.Ode3C11.incipit	…
ltx/en_us_goadedes/me.m07.d28:meMA.Ode3C11.melody	@ltx/en_us_goadedes/he.h.m4:heHE.EffrainetaiEpiSoi.name
ltx/en_us_goadedes/me.m07.d28:meMA.Ode3C11.mode	@ltx/en_us_goadedes/miscellanea:misc.Mode4
ltx/en_us_goadedes/me.m07.d28:meMA.Ode3C11.ode	@ltx/en_us_goadedes/miscellanea:misc.Ode3
ltx/en_us_goadedes/me.m07.d28:meMA.Ode3C11.text	
ltx/en_us_goadedes/me.m07.d28:meMA.Ode3C12.incipit	…
ltx/en_us_goadedes/me.m07.d28:meMA.Ode3C12.melody	@ltx/en_us_goadedes/he.h.m4:heHE.EffrainetaiEpiSoi.name
ltx/en_us_goadedes/me.m07.d28:meMA.Ode3C12.mode	@ltx/en_us_goadedes/miscellanea:misc.Mode4
ltx/en_us_goadedes/me.m07.d28:meMA.Ode3C12.ode	@ltx/en_us_goadedes/miscellanea:misc.Ode3
ltx/en_us_goadedes/me.m07.d28:meMA.Ode3C12.text	
ltx/en_us_goadedes/me.m07.d28:meMA.Ode3C13.incipit	…
ltx/en_us_goadedes/me.m07.d28:meMA.Ode3C13.melody	@ltx/en_us_goadedes/he.h.m4:heHE.EffrainetaiEpiSoi.name
ltx/en_us_goadedes/me.m07.d28:meMA.Ode3C13.mode	@ltx/en_us_goadedes/miscellanea:misc.Mode4
ltx/en_us_goadedes/me.m07.d28:meMA.Ode3C13.ode	@ltx/en_us_goadedes/miscellanea:misc.Ode3
ltx/en_us_goadedes/me.m07.d28:meMA.Ode3C13.text	
ltx/en_us_goadedes/me.m07.d28:meMA.Ode3C1T.incipit	…
ltx/en_us_goadedes/me.m07.d28:meMA.Ode3C1T.melody	@ltx/en_us_goadedes/he.h.m4:heHE.EffrainetaiEpiSoi.name
ltx/en_us_goadedes/me.m07.d28:meMA.Ode3C1T.mode	@ltx/en_us_goadedes/miscellanea:misc.Mode4
ltx/en_us_goadedes/me.m07.d28:meMA.Ode3C1T.ode	@ltx/en_us_goadedes/miscellanea:misc.Ode3
ltx/en_us_goadedes/me.m07.d28:meMA.Ode3C1T.text	
ltx/en_us_goadedes/me.m07.d28:meMA.Ode3H.greekmelody	@ltx/en_us_goadedes/he.h.m4:heHE.EffrainetaiEpiSoi.greekname
ltx/en_us_goadedes/me.m07.d28:meMA.Ode3H.incipit	@ltx/en_us_goadedes/he.h.m4:heHE.EffrainetaiEpiSoi.incipit
ltx/en_us_goadedes/me.m07.d28:meMA.Ode3H.melody	@ltx/en_us_goadedes/he.h.m4:heHE.EffrainetaiEpiSoi.melody
ltx/en_us_goadedes/me.m07.d28:meMA.Ode3H.mode	@ltx/en_us_goadedes/miscellanea:misc.Mode4
ltx/en_us_goadedes/me.m07.d28:meMA.Ode3H.ode	@ltx/en_us_goadedes/miscellanea:misc.Ode3
ltx/en_us_goadedes/me.m07.d28:meMA.Ode3H.text	@ltx/en_us_goadedes/he.h.m4:heHE.EffrainetaiEpiSoi.text
ltx/en_us_goadedes/me.m07.d28:meMA.Ode3Kathisma1.greekmelody	@ltx/en_us_goadedes/he.a.m1:heAU.TonTafonSouSotir.greekname
ltx/en_us_goadedes/me.m07.d28:meMA.Ode3Kathisma1.incipit	…
ltx/en_us_goadedes/me.m07.d28:meMA.Ode3Kathisma1.melody	@ltx/en_us_goadedes/he.a.m1:heAU.TonTafonSouSotir.name
ltx/en_us_goadedes/me.m07.d28:meMA.Ode3Kathisma1.mode	@ltx/en_us_goadedes/miscellanea:misc.Mode1
ltx/en_us_goadedes/me.m07.d28:meMA.Ode3Kathisma1.text	
ltx/en_us_goadedes/me.m07.d28:meMA.Ode3KathismaSt.incipit	@ltx/en_us_goadedes/me.m03.d18:meMA.Ode3KathismaSt.incipit
ltx/en_us_goadedes/me.m07.d28:meMA.Ode3KathismaSt.melody	@ltx/en_us_goadedes/he.a.m1:heAU.TonTafonSouSotir.name
ltx/en_us_goadedes/me.m07.d28:meMA.Ode3KathismaSt.mode	@ltx/en_us_goadedes/miscellanea:misc.Mode1
ltx/en_us_goadedes/me.m07.d28:meMA.Ode3KathismaSt.text	@ltx/en_us_goadedes/me.m03.d18:meMA.Ode3KathismaSt.text
ltx/en_us_goadedes/me.m07.d28:meMA.Ode3KathismaT.incipit	…
ltx/en_us_goadedes/me.m07.d28:meMA.Ode3KathismaT.melody	@ltx/en_us_goadedes/he.a.m1:heAU.TonTafonSouSotir.name
ltx/en_us_goadedes/me.m07.d28:meMA.Ode3KathismaT.mode	@ltx/en_us_goadedes/miscellanea:misc.Mode1
ltx/en_us_goadedes/me.m07.d28:meMA.Ode3KathismaT.text	
ltx/en_us_goadedes/me.m07.d28:meMA.Ode4C11.greekmelody	@ltx/en_us_goadedes/he.h.m4:heHE.EparthentaSeIdousa.greekname
ltx/en_us_goadedes/me.m07.d28:meMA.Ode4C11.incipit	…
ltx/en_us_goadedes/me.m07.d28:meMA.Ode4C11.melody	@ltx/en_us_goadedes/he.h.m4:heHE.EparthentaSeIdousa.name
ltx/en_us_goadedes/me.m07.d28:meMA.Ode4C11.mode	@ltx/en_us_goadedes/miscellanea:misc.Mode4
ltx/en_us_goadedes/me.m07.d28:meMA.Ode4C11.ode	@ltx/en_us_goadedes/miscellanea:misc.Ode4
ltx/en_us_goadedes/me.m07.d28:meMA.Ode4C11.text	
ltx/en_us_goadedes/me.m07.d28:meMA.Ode4C12.incipit	…
ltx/en_us_goadedes/me.m07.d28:meMA.Ode4C12.melody	@ltx/en_us_goadedes/he.h.m4:heHE.EparthentaSeIdousa.name
ltx/en_us_goadedes/me.m07.d28:meMA.Ode4C12.mode	@ltx/en_us_goadedes/miscellanea:misc.Mode4
ltx/en_us_goadedes/me.m07.d28:meMA.Ode4C12.ode	@ltx/en_us_goadedes/miscellanea:misc.Ode4
ltx/en_us_goadedes/me.m07.d28:meMA.Ode4C12.text	
ltx/en_us_goadedes/me.m07.d28:meMA.Ode4C13.incipit	…
ltx/en_us_goadedes/me.m07.d28:meMA.Ode4C13.melody	@ltx/en_us_goadedes/he.h.m4:heHE.EparthentaSeIdousa.name
ltx/en_us_goadedes/me.m07.d28:meMA.Ode4C13.mode	@ltx/en_us_goadedes/miscellanea:misc.Mode4
ltx/en_us_goadedes/me.m07.d28:meMA.Ode4C13.ode	@ltx/en_us_goadedes/miscellanea:misc.Ode4
ltx/en_us_goadedes/me.m07.d28:meMA.Ode4C13.text	
ltx/en_us_goadedes/me.m07.d28:meMA.Ode4C1T.incipit	…
ltx/en_us_goadedes/me.m07.d28:meMA.Ode4C1T.melody	@ltx/en_us_goadedes/he.h.m4:heHE.EparthentaSeIdousa.name
ltx/en_us_goadedes/me.m07.d28:meMA.Ode4C1T.mode	@ltx/en_us_goadedes/miscellanea:misc.Mode4
ltx/en_us_goadedes/me.m07.d28:meMA.Ode4C1T.ode	@ltx/en_us_goadedes/miscellanea:misc.Ode4
ltx/en_us_goadedes/me.m07.d28:meMA.Ode4C1T.text	
ltx/en_us_goadedes/me.m07.d28:meMA.Ode5C11.greekmelody	@ltx/en_us_goadedes/he.h.m4:heHE.SyKyrieMouFos.greekname
ltx/en_us_goadedes/me.m07.d28:meMA.Ode5C11.incipit	…
ltx/en_us_goadedes/me.m07.d28:meMA.Ode5C11.melody	@ltx/en_us_goadedes/he.h.m4:heHE.SyKyrieMouFos.name
ltx/en_us_goadedes/me.m07.d28:meMA.Ode5C11.mode	@ltx/en_us_goadedes/miscellanea:misc.Mode4
ltx/en_us_goadedes/me.m07.d28:meMA.Ode5C11.ode	@ltx/en_us_goadedes/miscellanea:misc.Ode5
ltx/en_us_goadedes/me.m07.d28:meMA.Ode5C11.text	
ltx/en_us_goadedes/me.m07.d28:meMA.Ode5C12.incipit	…
ltx/en_us_goadedes/me.m07.d28:meMA.Ode5C12.melody	@ltx/en_us_goadedes/he.h.m4:heHE.SyKyrieMouFos.name
ltx/en_us_goadedes/me.m07.d28:meMA.Ode5C12.mode	@ltx/en_us_goadedes/miscellanea:misc.Mode4
ltx/en_us_goadedes/me.m07.d28:meMA.Ode5C12.ode	@ltx/en_us_goadedes/miscellanea:misc.Ode5
ltx/en_us_goadedes/me.m07.d28:meMA.Ode5C12.text	
ltx/en_us_goadedes/me.m07.d28:meMA.Ode5C13.incipit	…
ltx/en_us_goadedes/me.m07.d28:meMA.Ode5C13.melody	@ltx/en_us_goadedes/he.h.m4:heHE.SyKyrieMouFos.name
ltx/en_us_goadedes/me.m07.d28:meMA.Ode5C13.mode	@ltx/en_us_goadedes/miscellanea:misc.Mode4
ltx/en_us_goadedes/me.m07.d28:meMA.Ode5C13.ode	@ltx/en_us_goadedes/miscellanea:misc.Ode5
ltx/en_us_goadedes/me.m07.d28:meMA.Ode5C13.text	
ltx/en_us_goadedes/me.m07.d28:meMA.Ode5C1T.incipit	…
ltx/en_us_goadedes/me.m07.d28:meMA.Ode5C1T.melody	@ltx/en_us_goadedes/he.h.m4:heHE.SyKyrieMouFos.name
ltx/en_us_goadedes/me.m07.d28:meMA.Ode5C1T.mode	@ltx/en_us_goadedes/miscellanea:misc.Mode4
ltx/en_us_goadedes/me.m07.d28:meMA.Ode5C1T.ode	@ltx/en_us_goadedes/miscellanea:misc.Ode5
ltx/en_us_goadedes/me.m07.d28:meMA.Ode5C1T.text	
ltx/en_us_goadedes/me.m07.d28:meMA.Ode6C11.greekmelody	@ltx/en_us_goadedes/he.h.m4:heHE.ThysoSoiMetaFonis.greekname
ltx/en_us_goadedes/me.m07.d28:meMA.Ode6C11.incipit	…
ltx/en_us_goadedes/me.m07.d28:meMA.Ode6C11.melody	@ltx/en_us_goadedes/he.h.m4:heHE.ThysoSoiMetaFonis.name
ltx/en_us_goadedes/me.m07.d28:meMA.Ode6C11.mode	@ltx/en_us_goadedes/miscellanea:misc.Mode4
ltx/en_us_goadedes/me.m07.d28:meMA.Ode6C11.ode	@ltx/en_us_goadedes/miscellanea:misc.Ode6
ltx/en_us_goadedes/me.m07.d28:meMA.Ode6C11.text	
ltx/en_us_goadedes/me.m07.d28:meMA.Ode6C12.incipit	…
ltx/en_us_goadedes/me.m07.d28:meMA.Ode6C12.melody	@ltx/en_us_goadedes/he.h.m4:heHE.ThysoSoiMetaFonis.name
ltx/en_us_goadedes/me.m07.d28:meMA.Ode6C12.mode	@ltx/en_us_goadedes/miscellanea:misc.Mode4
ltx/en_us_goadedes/me.m07.d28:meMA.Ode6C12.ode	@ltx/en_us_goadedes/miscellanea:misc.Ode6
ltx/en_us_goadedes/me.m07.d28:meMA.Ode6C12.text	
ltx/en_us_goadedes/me.m07.d28:meMA.Ode6C13.incipit	…
ltx/en_us_goadedes/me.m07.d28:meMA.Ode6C13.melody	@ltx/en_us_goadedes/he.h.m4:heHE.ThysoSoiMetaFonis.name
ltx/en_us_goadedes/me.m07.d28:meMA.Ode6C13.mode	@ltx/en_us_goadedes/miscellanea:misc.Mode4
ltx/en_us_goadedes/me.m07.d28:meMA.Ode6C13.ode	@ltx/en_us_goadedes/miscellanea:misc.Ode6
ltx/en_us_goadedes/me.m07.d28:meMA.Ode6C13.text	
ltx/en_us_goadedes/me.m07.d28:meMA.Ode6C1T.incipit	…
ltx/en_us_goadedes/me.m07.d28:meMA.Ode6C1T.melody	@ltx/en_us_goadedes/he.h.m4:heHE.ThysoSoiMetaFonis.name
ltx/en_us_goadedes/me.m07.d28:meMA.Ode6C1T.mode	@ltx/en_us_goadedes/miscellanea:misc.Mode4
ltx/en_us_goadedes/me.m07.d28:meMA.Ode6C1T.ode	@ltx/en_us_goadedes/miscellanea:misc.Ode6
ltx/en_us_goadedes/me.m07.d28:meMA.Ode6C1T.text	
ltx/en_us_goadedes/me.m07.d28:meMA.Ode6H.greekmelody	@ltx/en_us_goadedes/he.h.m4:heHE.ThysoSoiMetaFonis.greekname
ltx/en_us_goadedes/me.m07.d28:meMA.Ode6H.incipit	@ltx/en_us_goadedes/he.h.m4:heHE.ThysoSoiMetaFonis.incipit
ltx/en_us_goadedes/me.m07.d28:meMA.Ode6H.melody	@ltx/en_us_goadedes/he.h.m4:heHE.ThysoSoiMetaFonis.melody
ltx/en_us_goadedes/me.m07.d28:meMA.Ode6H.mode	@ltx/en_us_goadedes/miscellanea:misc.Mode4
ltx/en_us_goadedes/me.m07.d28:meMA.Ode6H.ode	@ltx/en_us_goadedes/miscellanea:misc.Ode6
ltx/en_us_goadedes/me.m07.d28:meMA.Ode6H.text	@ltx/en_us_goadedes/he.h.m4:heHE.ThysoSoiMetaFonis.text
ltx/en_us_goadedes/me.m07.d28:meMA.Ode7C11.greekmelody	@ltx/en_us_goadedes/he.h.m4:heHE.EnTiKaminoAvramiaioi.greekname
ltx/en_us_goadedes/me.m07.d28:meMA.Ode7C11.incipit	…
ltx/en_us_goadedes/me.m07.d28:meMA.Ode7C11.melody	@ltx/en_us_goadedes/he.h.m4:heHE.EnTiKaminoAvramiaioi.name
ltx/en_us_goadedes/me.m07.d28:meMA.Ode7C11.mode	@ltx/en_us_goadedes/miscellanea:misc.Mode4
ltx/en_us_goadedes/me.m07.d28:meMA.Ode7C11.ode	@ltx/en_us_goadedes/miscellanea:misc.Ode7
ltx/en_us_goadedes/me.m07.d28:meMA.Ode7C11.text	
ltx/en_us_goadedes/me.m07.d28:meMA.Ode7C12.incipit	…
ltx/en_us_goadedes/me.m07.d28:meMA.Ode7C12.melody	@ltx/en_us_goadedes/he.h.m4:heHE.EnTiKaminoAvramiaioi.name
ltx/en_us_goadedes/me.m07.d28:meMA.Ode7C12.mode	@ltx/en_us_goadedes/miscellanea:misc.Mode4
ltx/en_us_goadedes/me.m07.d28:meMA.Ode7C12.ode	@ltx/en_us_goadedes/miscellanea:misc.Ode7
ltx/en_us_goadedes/me.m07.d28:meMA.Ode7C12.text	
ltx/en_us_goadedes/me.m07.d28:meMA.Ode7C13.incipit	…
ltx/en_us_goadedes/me.m07.d28:meMA.Ode7C13.melody	@ltx/en_us_goadedes/he.h.m4:heHE.EnTiKaminoAvramiaioi.name
ltx/en_us_goadedes/me.m07.d28:meMA.Ode7C13.mode	@ltx/en_us_goadedes/miscellanea:misc.Mode4
ltx/en_us_goadedes/me.m07.d28:meMA.Ode7C13.ode	@ltx/en_us_goadedes/miscellanea:misc.Ode7
ltx/en_us_goadedes/me.m07.d28:meMA.Ode7C13.text	
ltx/en_us_goadedes/me.m07.d28:meMA.Ode7C1T.incipit	…
ltx/en_us_goadedes/me.m07.d28:meMA.Ode7C1T.melody	@ltx/en_us_goadedes/he.h.m4:heHE.EnTiKaminoAvramiaioi.name
ltx/en_us_goadedes/me.m07.d28:meMA.Ode7C1T.mode	@ltx/en_us_goadedes/miscellanea:misc.Mode4
ltx/en_us_goadedes/me.m07.d28:meMA.Ode7C1T.ode	@ltx/en_us_goadedes/miscellanea:misc.Ode7
ltx/en_us_goadedes/me.m07.d28:meMA.Ode7C1T.text	
ltx/en_us_goadedes/me.m07.d28:meMA.Ode8C11.greekmelody	@ltx/en_us_goadedes/he.h.m4:heHE.CheirasEkpetasasDaniil.greekname
ltx/en_us_goadedes/me.m07.d28:meMA.Ode8C11.incipit	…
ltx/en_us_goadedes/me.m07.d28:meMA.Ode8C11.melody	@ltx/en_us_goadedes/he.h.m4:heHE.CheirasEkpetasasDaniil.name
ltx/en_us_goadedes/me.m07.d28:meMA.Ode8C11.mode	@ltx/en_us_goadedes/miscellanea:misc.Mode4
ltx/en_us_goadedes/me.m07.d28:meMA.Ode8C11.ode	@ltx/en_us_goadedes/miscellanea:misc.Ode8
ltx/en_us_goadedes/me.m07.d28:meMA.Ode8C11.text	
ltx/en_us_goadedes/me.m07.d28:meMA.Ode8C12.incipit	…
ltx/en_us_goadedes/me.m07.d28:meMA.Ode8C12.melody	@ltx/en_us_goadedes/he.h.m4:heHE.CheirasEkpetasasDaniil.name
ltx/en_us_goadedes/me.m07.d28:meMA.Ode8C12.mode	@ltx/en_us_goadedes/miscellanea:misc.Mode4
ltx/en_us_goadedes/me.m07.d28:meMA.Ode8C12.ode	@ltx/en_us_goadedes/miscellanea:misc.Ode8
ltx/en_us_goadedes/me.m07.d28:meMA.Ode8C12.text	
ltx/en_us_goadedes/me.m07.d28:meMA.Ode8C13.incipit	…
ltx/en_us_goadedes/me.m07.d28:meMA.Ode8C13.melody	@ltx/en_us_goadedes/he.h.m4:heHE.CheirasEkpetasasDaniil.name
ltx/en_us_goadedes/me.m07.d28:meMA.Ode8C13.mode	@ltx/en_us_goadedes/miscellanea:misc.Mode4
ltx/en_us_goadedes/me.m07.d28:meMA.Ode8C13.ode	@ltx/en_us_goadedes/miscellanea:misc.Ode8
ltx/en_us_goadedes/me.m07.d28:meMA.Ode8C13.text	
ltx/en_us_goadedes/me.m07.d28:meMA.Ode8C1T.incipit	…
ltx/en_us_goadedes/me.m07.d28:meMA.Ode8C1T.melody	@ltx/en_us_goadedes/he.h.m4:heHE.CheirasEkpetasasDaniil.name
ltx/en_us_goadedes/me.m07.d28:meMA.Ode8C1T.mode	@ltx/en_us_goadedes/miscellanea:misc.Mode4
ltx/en_us_goadedes/me.m07.d28:meMA.Ode8C1T.ode	@ltx/en_us_goadedes/miscellanea:misc.Ode8
ltx/en_us_goadedes/me.m07.d28:meMA.Ode8C1T.text	
ltx/en_us_goadedes/me.m07.d28:meMA.Ode8H.greekmelody	@ltx/en_us_goadedes/he.h.m4:heHE.CheirasEkpetasasDaniil.greekname
ltx/en_us_goadedes/me.m07.d28:meMA.Ode8H.incipit	@ltx/en_us_goadedes/he.h.m4:heHE.CheirasEkpetasasDaniil.incipit
ltx/en_us_goadedes/me.m07.d28:meMA.Ode8H.melody	@ltx/en_us_goadedes/he.h.m4:heHE.CheirasEkpetasasDaniil.melody
ltx/en_us_goadedes/me.m07.d28:meMA.Ode8H.mode	@ltx/en_us_goadedes/miscellanea:misc.Mode4
ltx/en_us_goadedes/me.m07.d28:meMA.Ode8H.ode	@ltx/en_us_goadedes/miscellanea:misc.Ode8
ltx/en_us_goadedes/me.m07.d28:meMA.Ode8H.text	@ltx/en_us_goadedes/he.h.m4:heHE.CheirasEkpetasasDaniil.text
ltx/en_us_goadedes/me.m07.d28:meMA.Ode9C11.greekmelody	@ltx/en_us_goadedes/he.h.m4:heHE.LithosAcheirotmitos.greekname
ltx/en_us_goadedes/me.m07.d28:meMA.Ode9C11.incipit	…
ltx/en_us_goadedes/me.m07.d28:meMA.Ode9C11.melody	@ltx/en_us_goadedes/he.h.m4:heHE.LithosAcheirotmitos.name
ltx/en_us_goadedes/me.m07.d28:meMA.Ode9C11.mode	@ltx/en_us_goadedes/miscellanea:misc.Mode4
ltx/en_us_goadedes/me.m07.d28:meMA.Ode9C11.ode	@ltx/en_us_goadedes/miscellanea:misc.Ode9
ltx/en_us_goadedes/me.m07.d28:meMA.Ode9C11.text	
ltx/en_us_goadedes/me.m07.d28:meMA.Ode9C12.incipit	…
ltx/en_us_goadedes/me.m07.d28:meMA.Ode9C12.melody	@ltx/en_us_goadedes/he.h.m4:heHE.LithosAcheirotmitos.name
ltx/en_us_goadedes/me.m07.d28:meMA.Ode9C12.mode	@ltx/en_us_goadedes/miscellanea:misc.Mode4
ltx/en_us_goadedes/me.m07.d28:meMA.Ode9C12.ode	@ltx/en_us_goadedes/miscellanea:misc.Ode9
ltx/en_us_goadedes/me.m07.d28:meMA.Ode9C12.text	
ltx/en_us_goadedes/me.m07.d28:meMA.Ode9C13.incipit	…
ltx/en_us_goadedes/me.m07.d28:meMA.Ode9C13.melody	@ltx/en_us_goadedes/he.h.m4:heHE.LithosAcheirotmitos.name
ltx/en_us_goadedes/me.m07.d28:meMA.Ode9C13.mode	@ltx/en_us_goadedes/miscellanea:misc.Mode4
ltx/en_us_goadedes/me.m07.d28:meMA.Ode9C13.ode	@ltx/en_us_goadedes/miscellanea:misc.Ode9
ltx/en_us_goadedes/me.m07.d28:meMA.Ode9C13.text	
ltx/en_us_goadedes/me.m07.d28:meMA.Ode9C1T.incipit	…
ltx/en_us_goadedes/me.m07.d28:meMA.Ode9C1T.melody	@ltx/en_us_goadedes/he.h.m4:heHE.LithosAcheirotmitos.name
ltx/en_us_goadedes/me.m07.d28:meMA.Ode9C1T.mode	@ltx/en_us_goadedes/miscellanea:misc.Mode4
ltx/en_us_goadedes/me.m07.d28:meMA.Ode9C1T.ode	@ltx/en_us_goadedes/miscellanea:misc.Ode9
ltx/en_us_goadedes/me.m07.d28:meMA.Ode9C1T.text	
ltx/en_us_goadedes/me.m07.d28:meMA.Ode9H.greekmelody	@ltx/en_us_goadedes/he.h.m4:heHE.LithosAcheirotmitos.greekname
ltx/en_us_goadedes/me.m07.d28:meMA.Ode9H.incipit	@ltx/en_us_goadedes/he.h.m4:heHE.LithosAcheirotmitos.incipit
ltx/en_us_goadedes/me.m07.d28:meMA.Ode9H.melody	@ltx/en_us_goadedes/he.h.m4:heHE.LithosAcheirotmitos.melody
ltx/en_us_goadedes/me.m07.d28:meMA.Ode9H.mode	@ltx/en_us_goadedes/miscellanea:misc.Mode4
ltx/en_us_goadedes/me.m07.d28:meMA.Ode9H.ode	@ltx/en_us_goadedes/miscellanea:misc.Ode9
ltx/en_us_goadedes/me.m07.d28:meMA.Ode9H.text	@ltx/en_us_goadedes/he.h.m4:heHE.LithosAcheirotmitos.text
ltx/en_us_goadedes/me.m07.d28:meVE.Apolytikion1.greekmelody	@ltx/en_us_goadedes/he.a.m4:heAU.TachyProkatalave.greekname
ltx/en_us_goadedes/me.m07.d28:meVE.Apolytikion1.incipit	…
ltx/en_us_goadedes/me.m07.d28:meVE.Apolytikion1.melody	@ltx/en_us_goadedes/he.a.m4:heAU.TachyProkatalave.name
ltx/en_us_goadedes/me.m07.d28:meVE.Apolytikion1.mode	@ltx/en_us_goadedes/miscellanea:misc.Mode4
ltx/en_us_goadedes/me.m07.d28:meVE.Apolytikion1.text	
ltx/en_us_goadedes/me.m07.d28:meVE.Apolytikion2.greekmelody	@ltx/en_us_goadedes/he.a.m5:heAU.TonSynanarchonLogon.greekname
ltx/en_us_goadedes/me.m07.d28:meVE.Apolytikion2.incipit	…
ltx/en_us_goadedes/me.m07.d28:meVE.Apolytikion2.melody	@ltx/en_us_goadedes/he.a.m5:heAU.TonSynanarchonLogon.name
ltx/en_us_goadedes/me.m07.d28:meVE.Apolytikion2.mode	@ltx/en_us_goadedes/miscellanea:misc.Mode5
ltx/en_us_goadedes/me.m07.d28:meVE.Apolytikion2.text	
ltx/en_us_goadedes/me.m07.d28:meVE.SticStavrotheotokion.greekmelody	@ltx/en_us_goadedes/he.a.m1:heAU.TonOuranionTagmaton.greekname
ltx/en_us_goadedes/me.m07.d28:meVE.SticStavrotheotokion.incipit	@ltx/en_us_goadedes/me.m01.d23:meVE.AposStavrotheotokion.incipit
ltx/en_us_goadedes/me.m07.d28:meVE.SticStavrotheotokion.melody	@ltx/en_us_goadedes/he.a.m1:heAU.TonOuranionTagmaton.name
ltx/en_us_goadedes/me.m07.d28:meVE.SticStavrotheotokion.mode	@ltx/en_us_goadedes/miscellanea:misc.Mode1
ltx/en_us_goadedes/me.m07.d28:meVE.SticStavrotheotokion.text	@ltx/en_us_goadedes/me.m01.d23:meVE.AposStavrotheotokion.text
ltx/en_us_goadedes/me.m07.d28:meVE.SticTheotokion.greekmelody	@ltx/en_us_goadedes/he.a.m1:heAU.TonOuranionTagmaton.greekname
ltx/en_us_goadedes/me.m07.d28:meVE.SticTheotokion.incipit	@ltx/en_us_goadedes/me.m07.d12:meVE.SticTheotokion.incipit
ltx/en_us_goadedes/me.m07.d28:meVE.SticTheotokion.melody	@ltx/en_us_goadedes/he.a.m1:heAU.TonOuranionTagmaton.name
ltx/en_us_goadedes/me.m07.d28:meVE.SticTheotokion.mode	@ltx/en_us_goadedes/miscellanea:misc.Mode1
ltx/en_us_goadedes/me.m07.d28:meVE.SticTheotokion.text	@ltx/en_us_goadedes/me.m07.d12:meVE.SticTheotokion.text
ltx/en_us_goadedes/me.m07.d28:meVE.Stichera01.greekmelody	@ltx/en_us_goadedes/he.a.m1:heAU.TonOuranionTagmaton.greekname
ltx/en_us_goadedes/me.m07.d28:meVE.Stichera01.incipit	…
ltx/en_us_goadedes/me.m07.d28:meVE.Stichera01.melody	@ltx/en_us_goadedes/he.a.m1:heAU.TonOuranionTagmaton.name
ltx/en_us_goadedes/me.m07.d28:meVE.Stichera01.mode	@ltx/en_us_goadedes/miscellanea:misc.Mode1
ltx/en_us_goadedes/me.m07.d28:meVE.Stichera01.text	
ltx/en_us_goadedes/me.m07.d28:meVE.Stichera02.incipit	…
ltx/en_us_goadedes/me.m07.d28:meVE.Stichera02.melody	@ltx/en_us_goadedes/he.a.m1:heAU.TonOuranionTagmaton.name
ltx/en_us_goadedes/me.m07.d28:meVE.Stichera02.mode	@ltx/en_us_goadedes/miscellanea:misc.Mode1
ltx/en_us_goadedes/me.m07.d28:meVE.Stichera02.text	
ltx/en_us_goadedes/me.m07.d28:meVE.Stichera03.incipit	…
ltx/en_us_goadedes/me.m07.d28:meVE.Stichera03.melody	@ltx/en_us_goadedes/he.a.m1:heAU.TonOuranionTagmaton.name
ltx/en_us_goadedes/me.m07.d28:meVE.Stichera03.mode	@ltx/en_us_goadedes/miscellanea:misc.Mode1
ltx/en_us_goadedes/me.m07.d28:meVE.Stichera03.text	
