ltx/en_us_goadedes/me.m12.dBC:meDA.commemoration.first	
ltx/en_us_goadedes/me.m12.dBC:meDA.commemoration.first_name	
ltx/en_us_goadedes/me.m12.dBC:meDA.commemoration.first_short	
ltx/en_us_goadedes/me.m12.dBC:meDA.commemoration.first_title	@ltx/en_us_goadedes/titles:ti.Fathers
ltx/en_us_goadedes/me.m12.dBC:meDA.commemoration.full	
ltx/en_us_goadedes/me.m12.dBC:meDA.commemoration.second_name	
ltx/en_us_goadedes/me.m12.dBC:meDA.commemoration.second_title	
ltx/en_us_goadedes/me.m12.dBC:meDA.date	
ltx/en_us_goadedes/me.m12.dBC:meDA.fordate	
ltx/en_us_goadedes/me.m12.dBC:meDA.insert1	
ltx/en_us_goadedes/me.m12.dBC:meDA.insert2	
ltx/en_us_goadedes/me.m12.dBC:meDA.note	
ltx/en_us_goadedes/me.m12.dBC:meDA.pdfcoverdate	
ltx/en_us_goadedes/me.m12.dBC:meDA.pdfheaderdate	
ltx/en_us_goadedes/me.m12.dBC:meHO.commemorations	
ltx/en_us_goadedes/me.m12.dBC:meHO.note1	
ltx/en_us_goadedes/me.m12.dBC:meHO.note2	
ltx/en_us_goadedes/me.m12.dBC:meHO.number	
ltx/en_us_goadedes/me.m12.dBC:meHO.rank	
ltx/en_us_goadedes/me.m12.dBC:meLE.commemoration1	
ltx/en_us_goadedes/me.m12.dBC:meLE.commemoration2	
ltx/en_us_goadedes/me.m12.dBC:meLI.Kontakion1.incipit	@ltx/en_us_goadedes/me.m12.dBC:meMA.Kontakion1.incipit
ltx/en_us_goadedes/me.m12.dBC:meLI.Kontakion1.melody	@ltx/en_us_goadedes/me.m12.dBC:meMA.Kontakion1.melody
ltx/en_us_goadedes/me.m12.dBC:meLI.Kontakion1.mode	@ltx/en_us_goadedes/me.m12.dBC:meMA.Kontakion1.mode
ltx/en_us_goadedes/me.m12.dBC:meLI.Kontakion1.text	@ltx/en_us_goadedes/me.m12.dBC:meMA.Kontakion1.text
ltx/en_us_goadedes/me.m12.dBC:meLI.Megalynarion.text	
ltx/en_us_goadedes/me.m12.dBC:meMA.C1.title	@ltx/en_us_goadedes/titles:ti.CanonFathers
ltx/en_us_goadedes/me.m12.dBC:meMA.C1.verse	@ltx/en_us_goadedes/prayers:pr.verse_SaintsM.text
ltx/en_us_goadedes/me.m12.dBC:meMA.C2.title	@ltx/en_us_goadedes/titles:ti.CanonForefeast
ltx/en_us_goadedes/me.m12.dBC:meMA.C2.verse	@ltx/en_us_goadedes/prayers:pr.verse_God.text
ltx/en_us_goadedes/me.m12.dBC:meMA.Exaposteilarion1.greekmelody	@ltx/en_us_goadedes/he.a.m2:heAU.ToisMathitaisSynelthomen.greekname
ltx/en_us_goadedes/me.m12.dBC:meMA.Exaposteilarion1.incipit	…
ltx/en_us_goadedes/me.m12.dBC:meMA.Exaposteilarion1.melody	@ltx/en_us_goadedes/he.a.m2:heAU.ToisMathitaisSynelthomen.name
ltx/en_us_goadedes/me.m12.dBC:meMA.Exaposteilarion1.mode	@ltx/en_us_goadedes/miscellanea:misc.Mode2
ltx/en_us_goadedes/me.m12.dBC:meMA.Exaposteilarion1.text	
ltx/en_us_goadedes/me.m12.dBC:meMA.Exaposteilarion2.greekmelody	@ltx/en_us_goadedes/he.a.m2:heAU.ToisMathitaisSynelthomen.greekname
ltx/en_us_goadedes/me.m12.dBC:meMA.Exaposteilarion2.incipit	…
ltx/en_us_goadedes/me.m12.dBC:meMA.Exaposteilarion2.melody	@ltx/en_us_goadedes/he.a.m2:heAU.ToisMathitaisSynelthomen.name
ltx/en_us_goadedes/me.m12.dBC:meMA.Exaposteilarion2.mode	@ltx/en_us_goadedes/miscellanea:misc.Mode2
ltx/en_us_goadedes/me.m12.dBC:meMA.Exaposteilarion2.text	
ltx/en_us_goadedes/me.m12.dBC:meMA.Hypakoe.incipit	The Angel made the furnace…
ltx/en_us_goadedes/me.m12.dBC:meMA.Hypakoe.melody	
ltx/en_us_goadedes/me.m12.dBC:meMA.Hypakoe.mode	@ltx/en_us_goadedes/miscellanea:misc.Mode8
ltx/en_us_goadedes/me.m12.dBC:meMA.Hypakoe.text	The Angel made the furnace like a moist whistling wind for the three Servants. Now an Angel stops the weeping of the Myrrh-bearing women, saying, “Why do you bring ointments? Whom do you seek in the sepulcher? Christ God has risen! For He is the life and the salvation of the human race.”
ltx/en_us_goadedes/me.m12.dBC:meMA.Kontakion1.incipit	@ltx/en_us_goadedes/me.m12.d17:meMA.Kontakion2.incipit
ltx/en_us_goadedes/me.m12.dBC:meMA.Kontakion1.melody	
ltx/en_us_goadedes/me.m12.dBC:meMA.Kontakion1.mode	@ltx/en_us_goadedes/miscellanea:misc.Mode6
ltx/en_us_goadedes/me.m12.dBC:meMA.Kontakion1.text	@ltx/en_us_goadedes/me.m12.d17:meMA.Kontakion2.text
ltx/en_us_goadedes/me.m12.dBC:meMA.Kontakion2.greekmelody	@ltx/en_us_goadedes/he.a.m1:heAU.ChorosAngelikos.greekname
ltx/en_us_goadedes/me.m12.dBC:meMA.Kontakion2.incipit	…
ltx/en_us_goadedes/me.m12.dBC:meMA.Kontakion2.melody	@ltx/en_us_goadedes/he.a.m1:heAU.ChorosAngelikos.name
ltx/en_us_goadedes/me.m12.dBC:meMA.Kontakion2.mode	@ltx/en_us_goadedes/miscellanea:misc.Mode1
ltx/en_us_goadedes/me.m12.dBC:meMA.Kontakion2.text	
ltx/en_us_goadedes/me.m12.dBC:meMA.Lauds1.greekmelody	@ltx/en_us_goadedes/he.a.m5:heAU.ChairoisAskitikon.greekname
ltx/en_us_goadedes/me.m12.dBC:meMA.Lauds1.incipit	…
ltx/en_us_goadedes/me.m12.dBC:meMA.Lauds1.melody	@ltx/en_us_goadedes/he.a.m5:heAU.ChairoisAskitikon.name
ltx/en_us_goadedes/me.m12.dBC:meMA.Lauds1.mode	@ltx/en_us_goadedes/miscellanea:misc.Mode5
ltx/en_us_goadedes/me.m12.dBC:meMA.Lauds1.text	
ltx/en_us_goadedes/me.m12.dBC:meMA.Lauds2.incipit	…
ltx/en_us_goadedes/me.m12.dBC:meMA.Lauds2.melody	@ltx/en_us_goadedes/he.a.m5:heAU.ChairoisAskitikon.name
ltx/en_us_goadedes/me.m12.dBC:meMA.Lauds2.mode	@ltx/en_us_goadedes/miscellanea:misc.Mode5
ltx/en_us_goadedes/me.m12.dBC:meMA.Lauds2.text	
ltx/en_us_goadedes/me.m12.dBC:meMA.Lauds3.incipit	…
ltx/en_us_goadedes/me.m12.dBC:meMA.Lauds3.melody	@ltx/en_us_goadedes/he.a.m5:heAU.ChairoisAskitikon.name
ltx/en_us_goadedes/me.m12.dBC:meMA.Lauds3.mode	@ltx/en_us_goadedes/miscellanea:misc.Mode5
ltx/en_us_goadedes/me.m12.dBC:meMA.Lauds3.text	
ltx/en_us_goadedes/me.m12.dBC:meMA.LaudsGlory.incipit	…
ltx/en_us_goadedes/me.m12.dBC:meMA.LaudsGlory.melody	
ltx/en_us_goadedes/me.m12.dBC:meMA.LaudsGlory.mode	@ltx/en_us_goadedes/miscellanea:misc.Mode8
ltx/en_us_goadedes/me.m12.dBC:meMA.LaudsGlory.text	
ltx/en_us_goadedes/me.m12.dBC:meMA.MM.Lauds1123as5678.text	@ltx/en_us_goadedes/properties:media.key
ltx/en_us_goadedes/me.m12.dBC:meMA.Ode1C11.greekmelody	@ltx/en_us_goadedes/he.h.m6:heHE.KymatiThalassis.greekname
ltx/en_us_goadedes/me.m12.dBC:meMA.Ode1C11.incipit	The gates of death…
ltx/en_us_goadedes/me.m12.dBC:meMA.Ode1C11.melody	@ltx/en_us_goadedes/he.h.m6:heHE.KymatiThalassis.notmetered
ltx/en_us_goadedes/me.m12.dBC:meMA.Ode1C11.mode	@ltx/en_us_goadedes/miscellanea:misc.Mode6
ltx/en_us_goadedes/me.m12.dBC:meMA.Ode1C11.ode	@ltx/en_us_goadedes/miscellanea:misc.Ode1
ltx/en_us_goadedes/me.m12.dBC:meMA.Ode1C11.text	The gates of death open to You in fear, and the eternal bars are shattered. For at Your divine descent, the people who died long ago rose, and with joy they extolled Your resurrection, O Christ.
ltx/en_us_goadedes/me.m12.dBC:meMA.Ode1C12.incipit	Today, the godly fathers…
ltx/en_us_goadedes/me.m12.dBC:meMA.Ode1C12.melody	@ltx/en_us_goadedes/he.h.m6:heHE.KymatiThalassis.notmetered
ltx/en_us_goadedes/me.m12.dBC:meMA.Ode1C12.mode	@ltx/en_us_goadedes/miscellanea:misc.Mode6
ltx/en_us_goadedes/me.m12.dBC:meMA.Ode1C12.ode	@ltx/en_us_goadedes/miscellanea:misc.Ode1
ltx/en_us_goadedes/me.m12.dBC:meMA.Ode1C12.text	Today, the godly fathers splendidly celebrate, in anticipation of the birth of Christ. They underscore this extraordinary grace; for Abraham and the three Servants are all a symbol of the Law.
ltx/en_us_goadedes/me.m12.dBC:meMA.Ode1C13.incipit	Long ago, saintly Abraham…
ltx/en_us_goadedes/me.m12.dBC:meMA.Ode1C13.melody	@ltx/en_us_goadedes/he.h.m6:heHE.KymatiThalassis.notmetered
ltx/en_us_goadedes/me.m12.dBC:meMA.Ode1C13.mode	@ltx/en_us_goadedes/miscellanea:misc.Mode6
ltx/en_us_goadedes/me.m12.dBC:meMA.Ode1C13.ode	@ltx/en_us_goadedes/miscellanea:misc.Ode1
ltx/en_us_goadedes/me.m12.dBC:meMA.Ode1C13.text	Long ago, saintly Abraham showed hospitality to the one Godhead in three persons. Now the Logos, the coequal of the Father and the Holy Spirit, appears to the three Servants, and He is greatly glorified.
ltx/en_us_goadedes/me.m12.dBC:meMA.Ode1C14.incipit	Abraham was rescued…
ltx/en_us_goadedes/me.m12.dBC:meMA.Ode1C14.melody	@ltx/en_us_goadedes/he.h.m6:heHE.KymatiThalassis.notmetered
ltx/en_us_goadedes/me.m12.dBC:meMA.Ode1C14.mode	@ltx/en_us_goadedes/miscellanea:misc.Mode6
ltx/en_us_goadedes/me.m12.dBC:meMA.Ode1C14.ode	@ltx/en_us_goadedes/miscellanea:misc.Ode1
ltx/en_us_goadedes/me.m12.dBC:meMA.Ode1C14.text	Abraham was rescued from unjust treatment; the godly Servants, from the furnace fire; and Prophet Daniel, from the lions in the den. Now they celebrate in anticipation of the birth of Christ.
ltx/en_us_goadedes/me.m12.dBC:meMA.Ode1C15.incipit	The three Servants…
ltx/en_us_goadedes/me.m12.dBC:meMA.Ode1C15.melody	@ltx/en_us_goadedes/he.h.m6:heHE.KymatiThalassis.notmetered
ltx/en_us_goadedes/me.m12.dBC:meMA.Ode1C15.mode	@ltx/en_us_goadedes/miscellanea:misc.Mode6
ltx/en_us_goadedes/me.m12.dBC:meMA.Ode1C15.ode	@ltx/en_us_goadedes/miscellanea:misc.Ode1
ltx/en_us_goadedes/me.m12.dBC:meMA.Ode1C15.text	The three Servants in the furnace, with faith in the Holy Trinity, stamped out godlessness; and to the world they symbolically revealed the mysteries of God that would come to pass.
ltx/en_us_goadedes/me.m12.dBC:meMA.Ode1C1H.greekmelody	@ltx/en_us_goadedes/he.h.m6:heHE.KymatiThalassis.greekname
ltx/en_us_goadedes/me.m12.dBC:meMA.Ode1C1H.incipit	@ltx/en_us_goadedes/he.h.m6:heHE.KymatiThalassis.incipit
ltx/en_us_goadedes/me.m12.dBC:meMA.Ode1C1H.melody	@ltx/en_us_goadedes/he.h.m6:heHE.KymatiThalassis.melody
ltx/en_us_goadedes/me.m12.dBC:meMA.Ode1C1H.mode	@ltx/en_us_goadedes/miscellanea:misc.Mode6
ltx/en_us_goadedes/me.m12.dBC:meMA.Ode1C1H.ode	@ltx/en_us_goadedes/miscellanea:misc.Ode1
ltx/en_us_goadedes/me.m12.dBC:meMA.Ode1C1H.text	@ltx/en_us_goadedes/he.h.m6:heHE.KymatiThalassis.text
ltx/en_us_goadedes/me.m12.dBC:meMA.Ode1C1T.incipit	O unwedded, undefiled…
ltx/en_us_goadedes/me.m12.dBC:meMA.Ode1C1T.melody	@ltx/en_us_goadedes/he.h.m6:heHE.KymatiThalassis.notmetered
ltx/en_us_goadedes/me.m12.dBC:meMA.Ode1C1T.mode	@ltx/en_us_goadedes/miscellanea:misc.Mode6
ltx/en_us_goadedes/me.m12.dBC:meMA.Ode1C1T.ode	@ltx/en_us_goadedes/miscellanea:misc.Ode1
ltx/en_us_goadedes/me.m12.dBC:meMA.Ode1C1T.text	O unwedded, undefiled, Virgin Mother full of grace, we call you blessed; for you descended from the line of Abraham and from the tribe of David, and you gave birth to Christ, who was proclaimed by the Prophets long before.
ltx/en_us_goadedes/me.m12.dBC:meMA.Ode1C21.greekmelody	@ltx/en_us_goadedes/he.h.m1:heHE.ChristosGennatai.greekname
ltx/en_us_goadedes/me.m12.dBC:meMA.Ode1C21.incipit	…
ltx/en_us_goadedes/me.m12.dBC:meMA.Ode1C21.melody	@ltx/en_us_goadedes/he.h.m1:heHE.ChristosGennatai.name
ltx/en_us_goadedes/me.m12.dBC:meMA.Ode1C21.mode	@ltx/en_us_goadedes/miscellanea:misc.Mode1
ltx/en_us_goadedes/me.m12.dBC:meMA.Ode1C21.ode	@ltx/en_us_goadedes/miscellanea:misc.Ode1
ltx/en_us_goadedes/me.m12.dBC:meMA.Ode1C21.text	
ltx/en_us_goadedes/me.m12.dBC:meMA.Ode1C22.incipit	…
ltx/en_us_goadedes/me.m12.dBC:meMA.Ode1C22.melody	@ltx/en_us_goadedes/he.h.m1:heHE.ChristosGennatai.name
ltx/en_us_goadedes/me.m12.dBC:meMA.Ode1C22.mode	@ltx/en_us_goadedes/miscellanea:misc.Mode1
ltx/en_us_goadedes/me.m12.dBC:meMA.Ode1C22.ode	@ltx/en_us_goadedes/miscellanea:misc.Ode1
ltx/en_us_goadedes/me.m12.dBC:meMA.Ode1C22.text	
ltx/en_us_goadedes/me.m12.dBC:meMA.Ode1C2T.incipit	…
ltx/en_us_goadedes/me.m12.dBC:meMA.Ode1C2T.melody	@ltx/en_us_goadedes/he.h.m1:heHE.ChristosGennatai.name
ltx/en_us_goadedes/me.m12.dBC:meMA.Ode1C2T.mode	@ltx/en_us_goadedes/miscellanea:misc.Mode1
ltx/en_us_goadedes/me.m12.dBC:meMA.Ode1C2T.ode	@ltx/en_us_goadedes/miscellanea:misc.Ode1
ltx/en_us_goadedes/me.m12.dBC:meMA.Ode1C2T.text	
ltx/en_us_goadedes/me.m12.dBC:meMA.Ode3C11.greekmelody	@ltx/en_us_goadedes/he.h.m6:heHE.SeTonEpiYdaton.greekname
ltx/en_us_goadedes/me.m12.dBC:meMA.Ode3C11.incipit	Lying three days in the sepulcher…
ltx/en_us_goadedes/me.m12.dBC:meMA.Ode3C11.melody	@ltx/en_us_goadedes/he.h.m6:heHE.SeTonEpiYdaton.notmetered
ltx/en_us_goadedes/me.m12.dBC:meMA.Ode3C11.mode	@ltx/en_us_goadedes/miscellanea:misc.Mode6
ltx/en_us_goadedes/me.m12.dBC:meMA.Ode3C11.ode	@ltx/en_us_goadedes/miscellanea:misc.Ode3
ltx/en_us_goadedes/me.m12.dBC:meMA.Ode3C11.text	Lying three days in the sepulcher, by Your vivifying resurrection You raised those who had died from the beginning of time. Released from condemnation, they greatly rejoiced and sang to You: “Behold, You have come, O Lord, our redemption!”
ltx/en_us_goadedes/me.m12.dBC:meMA.Ode3C12.incipit	Mindful of the glory…
ltx/en_us_goadedes/me.m12.dBC:meMA.Ode3C12.melody	@ltx/en_us_goadedes/he.h.m6:heHE.SeTonEpiYdaton.notmetered
ltx/en_us_goadedes/me.m12.dBC:meMA.Ode3C12.mode	@ltx/en_us_goadedes/miscellanea:misc.Mode6
ltx/en_us_goadedes/me.m12.dBC:meMA.Ode3C12.ode	@ltx/en_us_goadedes/miscellanea:misc.Ode3
ltx/en_us_goadedes/me.m12.dBC:meMA.Ode3C12.text	Mindful of the glory in the image and likeness of God, those Servants, like athletes, extinguished the flame of the image of gold. And with faith they sang: “We know no other Lord but You.”
ltx/en_us_goadedes/me.m12.dBC:meMA.Ode3C13.incipit	The Servants had superior wisdom…
ltx/en_us_goadedes/me.m12.dBC:meMA.Ode3C13.melody	@ltx/en_us_goadedes/he.h.m6:heHE.SeTonEpiYdaton.notmetered
ltx/en_us_goadedes/me.m12.dBC:meMA.Ode3C13.mode	@ltx/en_us_goadedes/miscellanea:misc.Mode6
ltx/en_us_goadedes/me.m12.dBC:meMA.Ode3C13.ode	@ltx/en_us_goadedes/miscellanea:misc.Ode3
ltx/en_us_goadedes/me.m12.dBC:meMA.Ode3C13.text	The Servants had superior wisdom and the power of the Spirit, by which they ambushed and embarrassed the wise men of Babylon. And with confidence they sang: “No one is holy except for You, O Lord who love humanity.”
ltx/en_us_goadedes/me.m12.dBC:meMA.Ode3C14.incipit	The characters in the Torah…
ltx/en_us_goadedes/me.m12.dBC:meMA.Ode3C14.melody	@ltx/en_us_goadedes/he.h.m6:heHE.SeTonEpiYdaton.notmetered
ltx/en_us_goadedes/me.m12.dBC:meMA.Ode3C14.mode	@ltx/en_us_goadedes/miscellanea:misc.Mode6
ltx/en_us_goadedes/me.m12.dBC:meMA.Ode3C14.ode	@ltx/en_us_goadedes/miscellanea:misc.Ode3
ltx/en_us_goadedes/me.m12.dBC:meMA.Ode3C14.text	The characters in the Torah rejoice and celebrate with the Servants and the Prophets, and they are exultant today, anticipating the divine and luminous emergence of the Lord. Abraham rejoices greatly, because he saw the Lord, incarnate from his progeny.
ltx/en_us_goadedes/me.m12.dBC:meMA.Ode3C1H.greekmelody	@ltx/en_us_goadedes/he.h.m6:heHE.SeTonEpiYdaton.greekname
ltx/en_us_goadedes/me.m12.dBC:meMA.Ode3C1H.incipit	@ltx/en_us_goadedes/he.h.m6:heHE.SeTonEpiYdaton.incipit
ltx/en_us_goadedes/me.m12.dBC:meMA.Ode3C1H.melody	@ltx/en_us_goadedes/he.h.m6:heHE.SeTonEpiYdaton.melody
ltx/en_us_goadedes/me.m12.dBC:meMA.Ode3C1H.mode	@ltx/en_us_goadedes/miscellanea:misc.Mode6
ltx/en_us_goadedes/me.m12.dBC:meMA.Ode3C1H.ode	@ltx/en_us_goadedes/miscellanea:misc.Ode3
ltx/en_us_goadedes/me.m12.dBC:meMA.Ode3C1H.text	@ltx/en_us_goadedes/he.h.m6:heHE.SeTonEpiYdaton.text
ltx/en_us_goadedes/me.m12.dBC:meMA.Ode3C1T.incipit	Without passion…
ltx/en_us_goadedes/me.m12.dBC:meMA.Ode3C1T.melody	@ltx/en_us_goadedes/he.h.m6:heHE.SeTonEpiYdaton.notmetered
ltx/en_us_goadedes/me.m12.dBC:meMA.Ode3C1T.mode	@ltx/en_us_goadedes/miscellanea:misc.Mode6
ltx/en_us_goadedes/me.m12.dBC:meMA.Ode3C1T.ode	@ltx/en_us_goadedes/miscellanea:misc.Ode3
ltx/en_us_goadedes/me.m12.dBC:meMA.Ode3C1T.text	Without passion was the conception of your Son; and He was born in the flesh He ineffably and supernaturally assumed. The mystery that was constantly talked about by the Prophets is the Logos of God and Lord, and He has extraordinarily appeared to us. 
ltx/en_us_goadedes/me.m12.dBC:meMA.Ode3C21.greekmelody	@ltx/en_us_goadedes/he.h.m1:heHE.ToProTonAionon.greekname
ltx/en_us_goadedes/me.m12.dBC:meMA.Ode3C21.incipit	…
ltx/en_us_goadedes/me.m12.dBC:meMA.Ode3C21.melody	@ltx/en_us_goadedes/he.h.m1:heHE.ToProTonAionon.name
ltx/en_us_goadedes/me.m12.dBC:meMA.Ode3C21.mode	@ltx/en_us_goadedes/miscellanea:misc.Mode1
ltx/en_us_goadedes/me.m12.dBC:meMA.Ode3C21.ode	@ltx/en_us_goadedes/miscellanea:misc.Ode3
ltx/en_us_goadedes/me.m12.dBC:meMA.Ode3C21.text	
ltx/en_us_goadedes/me.m12.dBC:meMA.Ode3C22.incipit	…
ltx/en_us_goadedes/me.m12.dBC:meMA.Ode3C22.melody	@ltx/en_us_goadedes/he.h.m1:heHE.ToProTonAionon.name
ltx/en_us_goadedes/me.m12.dBC:meMA.Ode3C22.mode	@ltx/en_us_goadedes/miscellanea:misc.Mode1
ltx/en_us_goadedes/me.m12.dBC:meMA.Ode3C22.ode	@ltx/en_us_goadedes/miscellanea:misc.Ode3
ltx/en_us_goadedes/me.m12.dBC:meMA.Ode3C22.text	
ltx/en_us_goadedes/me.m12.dBC:meMA.Ode3C2T.incipit	…
ltx/en_us_goadedes/me.m12.dBC:meMA.Ode3C2T.melody	@ltx/en_us_goadedes/he.h.m1:heHE.ToProTonAionon.name
ltx/en_us_goadedes/me.m12.dBC:meMA.Ode3C2T.mode	@ltx/en_us_goadedes/miscellanea:misc.Mode1
ltx/en_us_goadedes/me.m12.dBC:meMA.Ode3C2T.ode	@ltx/en_us_goadedes/miscellanea:misc.Ode3
ltx/en_us_goadedes/me.m12.dBC:meMA.Ode3C2T.text	
ltx/en_us_goadedes/me.m12.dBC:meMA.Ode4C11.greekmelody	@ltx/en_us_goadedes/he.h.m6:heHE.TinEnStavroSou.greekname
ltx/en_us_goadedes/me.m12.dBC:meMA.Ode4C11.incipit	O Christ God, Your divine descent…
ltx/en_us_goadedes/me.m12.dBC:meMA.Ode4C11.melody	@ltx/en_us_goadedes/he.h.m6:heHE.TinEnStavroSou.notmetered
ltx/en_us_goadedes/me.m12.dBC:meMA.Ode4C11.mode	@ltx/en_us_goadedes/miscellanea:misc.Mode6
ltx/en_us_goadedes/me.m12.dBC:meMA.Ode4C11.ode	@ltx/en_us_goadedes/miscellanea:misc.Ode4
ltx/en_us_goadedes/me.m12.dBC:meMA.Ode4C11.text	O Christ God, Your divine descent into Hades proved to be life to the dead; for You, O good One, bound the enemies below, and You opened the path to heaven for humanity.
ltx/en_us_goadedes/me.m12.dBC:meMA.Ode4C12.incipit	We are honoring the cream…
ltx/en_us_goadedes/me.m12.dBC:meMA.Ode4C12.melody	@ltx/en_us_goadedes/he.h.m6:heHE.TinEnStavroSou.notmetered
ltx/en_us_goadedes/me.m12.dBC:meMA.Ode4C12.mode	@ltx/en_us_goadedes/miscellanea:misc.Mode6
ltx/en_us_goadedes/me.m12.dBC:meMA.Ode4C12.ode	@ltx/en_us_goadedes/miscellanea:misc.Ode4
ltx/en_us_goadedes/me.m12.dBC:meMA.Ode4C12.text	We are honoring the cream of the Fathers: Abraham, Isaac and Jacob; for it was from their seed that Christ Almighty shone forth, incarnate from a Virgin.
ltx/en_us_goadedes/me.m12.dBC:meMA.Ode4C13.incipit	Daniel made the lions…
ltx/en_us_goadedes/me.m12.dBC:meMA.Ode4C13.melody	@ltx/en_us_goadedes/he.h.m6:heHE.TinEnStavroSou.notmetered
ltx/en_us_goadedes/me.m12.dBC:meMA.Ode4C13.mode	@ltx/en_us_goadedes/miscellanea:misc.Mode6
ltx/en_us_goadedes/me.m12.dBC:meMA.Ode4C13.ode	@ltx/en_us_goadedes/miscellanea:misc.Ode4
ltx/en_us_goadedes/me.m12.dBC:meMA.Ode4C13.text	Daniel made the lions be like lambs for all to see, and thus he prefigured what would happen at Christ’s descent. As a Prophet of God, he foreknew the future.
ltx/en_us_goadedes/me.m12.dBC:meMA.Ode4C14.incipit	Those Servants had not ingested…
ltx/en_us_goadedes/me.m12.dBC:meMA.Ode4C14.melody	@ltx/en_us_goadedes/he.h.m6:heHE.TinEnStavroSou.notmetered
ltx/en_us_goadedes/me.m12.dBC:meMA.Ode4C14.mode	@ltx/en_us_goadedes/miscellanea:misc.Mode6
ltx/en_us_goadedes/me.m12.dBC:meMA.Ode4C14.ode	@ltx/en_us_goadedes/miscellanea:misc.Ode4
ltx/en_us_goadedes/me.m12.dBC:meMA.Ode4C14.text	Those Servants had not ingested the poison of sin, and thus they were rescued from the flames. For they were truly more precious than gold, and they did not melt in the pagans’ furnace.
ltx/en_us_goadedes/me.m12.dBC:meMA.Ode4C1H.greekmelody	@ltx/en_us_goadedes/he.h.m6:heHE.TinEnStavroSou.greekname
ltx/en_us_goadedes/me.m12.dBC:meMA.Ode4C1H.incipit	@ltx/en_us_goadedes/he.h.m6:heHE.TinEnStavroSou.incipit
ltx/en_us_goadedes/me.m12.dBC:meMA.Ode4C1H.melody	@ltx/en_us_goadedes/he.h.m6:heHE.TinEnStavroSou.melody
ltx/en_us_goadedes/me.m12.dBC:meMA.Ode4C1H.mode	@ltx/en_us_goadedes/miscellanea:misc.Mode6
ltx/en_us_goadedes/me.m12.dBC:meMA.Ode4C1H.ode	@ltx/en_us_goadedes/miscellanea:misc.Ode4
ltx/en_us_goadedes/me.m12.dBC:meMA.Ode4C1H.text	@ltx/en_us_goadedes/he.h.m6:heHE.TinEnStavroSou.text
ltx/en_us_goadedes/me.m12.dBC:meMA.Ode4C1T.incipit	O immaculate and noble Lady…
ltx/en_us_goadedes/me.m12.dBC:meMA.Ode4C1T.melody	@ltx/en_us_goadedes/he.h.m6:heHE.TinEnStavroSou.notmetered
ltx/en_us_goadedes/me.m12.dBC:meMA.Ode4C1T.mode	@ltx/en_us_goadedes/miscellanea:misc.Mode6
ltx/en_us_goadedes/me.m12.dBC:meMA.Ode4C1T.ode	@ltx/en_us_goadedes/miscellanea:misc.Ode4
ltx/en_us_goadedes/me.m12.dBC:meMA.Ode4C1T.text	O immaculate and noble Lady, your Son, who is the expectation of the Gentiles and salvation of the world, is loudly announced. The assemblage of the Fathers extols Him today.
ltx/en_us_goadedes/me.m12.dBC:meMA.Ode4C21.greekmelody	@ltx/en_us_goadedes/he.h.m1:heHE.RavdosEkTisRizis.greekname
ltx/en_us_goadedes/me.m12.dBC:meMA.Ode4C21.incipit	…
ltx/en_us_goadedes/me.m12.dBC:meMA.Ode4C21.melody	@ltx/en_us_goadedes/he.h.m1:heHE.RavdosEkTisRizis.name
ltx/en_us_goadedes/me.m12.dBC:meMA.Ode4C21.mode	@ltx/en_us_goadedes/miscellanea:misc.Mode1
ltx/en_us_goadedes/me.m12.dBC:meMA.Ode4C21.ode	@ltx/en_us_goadedes/miscellanea:misc.Ode4
ltx/en_us_goadedes/me.m12.dBC:meMA.Ode4C21.text	
ltx/en_us_goadedes/me.m12.dBC:meMA.Ode4C22.incipit	…
ltx/en_us_goadedes/me.m12.dBC:meMA.Ode4C22.melody	@ltx/en_us_goadedes/he.h.m1:heHE.RavdosEkTisRizis.name
ltx/en_us_goadedes/me.m12.dBC:meMA.Ode4C22.mode	@ltx/en_us_goadedes/miscellanea:misc.Mode1
ltx/en_us_goadedes/me.m12.dBC:meMA.Ode4C22.ode	@ltx/en_us_goadedes/miscellanea:misc.Ode4
ltx/en_us_goadedes/me.m12.dBC:meMA.Ode4C22.text	
ltx/en_us_goadedes/me.m12.dBC:meMA.Ode4C2T.incipit	…
ltx/en_us_goadedes/me.m12.dBC:meMA.Ode4C2T.melody	@ltx/en_us_goadedes/he.h.m1:heHE.RavdosEkTisRizis.name
ltx/en_us_goadedes/me.m12.dBC:meMA.Ode4C2T.mode	@ltx/en_us_goadedes/miscellanea:misc.Mode1
ltx/en_us_goadedes/me.m12.dBC:meMA.Ode4C2T.ode	@ltx/en_us_goadedes/miscellanea:misc.Ode4
ltx/en_us_goadedes/me.m12.dBC:meMA.Ode4C2T.text	
ltx/en_us_goadedes/me.m12.dBC:meMA.Ode5C11.greekmelody	@ltx/en_us_goadedes/he.h.m6:heHE.TheofaneiasSouChriste.greekname
ltx/en_us_goadedes/me.m12.dBC:meMA.Ode5C11.incipit	Visually symbolizing…
ltx/en_us_goadedes/me.m12.dBC:meMA.Ode5C11.melody	@ltx/en_us_goadedes/he.h.m6:heHE.TheofaneiasSouChriste.notmetered
ltx/en_us_goadedes/me.m12.dBC:meMA.Ode5C11.mode	@ltx/en_us_goadedes/miscellanea:misc.Mode6
ltx/en_us_goadedes/me.m12.dBC:meMA.Ode5C11.ode	@ltx/en_us_goadedes/miscellanea:misc.Ode5
ltx/en_us_goadedes/me.m12.dBC:meMA.Ode5C11.text	Visually symbolizing the explosion of joy, the radiant Angel at the sepulcher appeared to the women and proclaimed the resurrection. They ceased weeping and greatly rejoiced, and they announced to the Apostles that the risen Christ had said, “Rejoice!” to them.
ltx/en_us_goadedes/me.m12.dBC:meMA.Ode5C12.incipit	As we assemble today…
ltx/en_us_goadedes/me.m12.dBC:meMA.Ode5C12.melody	@ltx/en_us_goadedes/he.h.m6:heHE.TheofaneiasSouChriste.notmetered
ltx/en_us_goadedes/me.m12.dBC:meMA.Ode5C12.mode	@ltx/en_us_goadedes/miscellanea:misc.Mode6
ltx/en_us_goadedes/me.m12.dBC:meMA.Ode5C12.ode	@ltx/en_us_goadedes/miscellanea:misc.Ode5
ltx/en_us_goadedes/me.m12.dBC:meMA.Ode5C12.text	As we assemble today, let us faithfully honor the Patriarch Abraham, the cream of the Fathers, as the author of both the Law and Grace. For as a Prophet of God, he foretold that Christ would be born from a Virgin. And today he comes to salute the Lord’s divine Nativity.
ltx/en_us_goadedes/me.m12.dBC:meMA.Ode5C13.incipit	Those Servants…
ltx/en_us_goadedes/me.m12.dBC:meMA.Ode5C13.melody	@ltx/en_us_goadedes/he.h.m6:heHE.TheofaneiasSouChriste.notmetered
ltx/en_us_goadedes/me.m12.dBC:meMA.Ode5C13.mode	@ltx/en_us_goadedes/miscellanea:misc.Mode6
ltx/en_us_goadedes/me.m12.dBC:meMA.Ode5C13.ode	@ltx/en_us_goadedes/miscellanea:misc.Ode5
ltx/en_us_goadedes/me.m12.dBC:meMA.Ode5C13.text	Those Servants clearly foreshadowed the Lord’s coming to us. For those descendants of Abraham extinguished the furnace through the presence of the Angel, and turned the fire into a dewy breeze, and thus by faith they melted the glory of the golden image.
ltx/en_us_goadedes/me.m12.dBC:meMA.Ode5C14.incipit	By the Spirit…
ltx/en_us_goadedes/me.m12.dBC:meMA.Ode5C14.melody	@ltx/en_us_goadedes/he.h.m6:heHE.TheofaneiasSouChriste.notmetered
ltx/en_us_goadedes/me.m12.dBC:meMA.Ode5C14.mode	@ltx/en_us_goadedes/miscellanea:misc.Mode6
ltx/en_us_goadedes/me.m12.dBC:meMA.Ode5C14.ode	@ltx/en_us_goadedes/miscellanea:misc.Ode5
ltx/en_us_goadedes/me.m12.dBC:meMA.Ode5C14.text	By the Spirit, Daniel in the den stopped the mouths of lions; and by grace, the Servants, descendants of Abraham, extinguished the force of the fire. Saved from destruction, they foretold that Christ would be born from a Virgin. Now they implore Him, our Redeemer, for our salvation.
ltx/en_us_goadedes/me.m12.dBC:meMA.Ode5C1H.greekmelody	@ltx/en_us_goadedes/he.h.m6:heHE.TheofaneiasSouChriste.greekname
ltx/en_us_goadedes/me.m12.dBC:meMA.Ode5C1H.incipit	@ltx/en_us_goadedes/he.h.m6:heHE.TheofaneiasSouChriste.incipit
ltx/en_us_goadedes/me.m12.dBC:meMA.Ode5C1H.melody	@ltx/en_us_goadedes/he.h.m6:heHE.TheofaneiasSouChriste.melody
ltx/en_us_goadedes/me.m12.dBC:meMA.Ode5C1H.mode	@ltx/en_us_goadedes/miscellanea:misc.Mode6
ltx/en_us_goadedes/me.m12.dBC:meMA.Ode5C1H.ode	@ltx/en_us_goadedes/miscellanea:misc.Ode5
ltx/en_us_goadedes/me.m12.dBC:meMA.Ode5C1H.text	@ltx/en_us_goadedes/he.h.m6:heHE.TheofaneiasSouChriste.text
ltx/en_us_goadedes/me.m12.dBC:meMA.Ode5C1T.incipit	O Lord, Isaiah was moved…
ltx/en_us_goadedes/me.m12.dBC:meMA.Ode5C1T.melody	@ltx/en_us_goadedes/he.h.m6:heHE.TheofaneiasSouChriste.notmetered
ltx/en_us_goadedes/me.m12.dBC:meMA.Ode5C1T.mode	@ltx/en_us_goadedes/miscellanea:misc.Mode6
ltx/en_us_goadedes/me.m12.dBC:meMA.Ode5C1T.ode	@ltx/en_us_goadedes/miscellanea:misc.Ode5
ltx/en_us_goadedes/me.m12.dBC:meMA.Ode5C1T.text	O Lord, Isaiah was moved by the Holy Spirit to announce that You would assume our nature impassibly. And as he watched for the Law of grace, he said that a Virgin is coming to give birth without seed to One who, according to the flesh, will be a descendant of Abraham from the tribe of Judah.
ltx/en_us_goadedes/me.m12.dBC:meMA.Ode5C21.greekmelody	@ltx/en_us_goadedes/he.h.m1:heHE.TheosOnEirinis.greekname
ltx/en_us_goadedes/me.m12.dBC:meMA.Ode5C21.incipit	…
ltx/en_us_goadedes/me.m12.dBC:meMA.Ode5C21.melody	@ltx/en_us_goadedes/he.h.m1:heHE.TheosOnEirinis.name
ltx/en_us_goadedes/me.m12.dBC:meMA.Ode5C21.mode	@ltx/en_us_goadedes/miscellanea:misc.Mode1
ltx/en_us_goadedes/me.m12.dBC:meMA.Ode5C21.ode	@ltx/en_us_goadedes/miscellanea:misc.Ode5
ltx/en_us_goadedes/me.m12.dBC:meMA.Ode5C21.text	
ltx/en_us_goadedes/me.m12.dBC:meMA.Ode5C22.incipit	…
ltx/en_us_goadedes/me.m12.dBC:meMA.Ode5C22.melody	@ltx/en_us_goadedes/he.h.m1:heHE.TheosOnEirinis.name
ltx/en_us_goadedes/me.m12.dBC:meMA.Ode5C22.mode	@ltx/en_us_goadedes/miscellanea:misc.Mode1
ltx/en_us_goadedes/me.m12.dBC:meMA.Ode5C22.ode	@ltx/en_us_goadedes/miscellanea:misc.Ode5
ltx/en_us_goadedes/me.m12.dBC:meMA.Ode5C22.text	
ltx/en_us_goadedes/me.m12.dBC:meMA.Ode5C2T.incipit	…
ltx/en_us_goadedes/me.m12.dBC:meMA.Ode5C2T.melody	@ltx/en_us_goadedes/he.h.m1:heHE.TheosOnEirinis.name
ltx/en_us_goadedes/me.m12.dBC:meMA.Ode5C2T.mode	@ltx/en_us_goadedes/miscellanea:misc.Mode1
ltx/en_us_goadedes/me.m12.dBC:meMA.Ode5C2T.ode	@ltx/en_us_goadedes/miscellanea:misc.Ode5
ltx/en_us_goadedes/me.m12.dBC:meMA.Ode5C2T.text	
ltx/en_us_goadedes/me.m12.dBC:meMA.Ode6C11.greekmelody	@ltx/en_us_goadedes/he.h.m6:heHE.TouViouTinThalassan.greekname
ltx/en_us_goadedes/me.m12.dBC:meMA.Ode6C11.incipit	O good One…
ltx/en_us_goadedes/me.m12.dBC:meMA.Ode6C11.melody	@ltx/en_us_goadedes/he.h.m6:heHE.TouViouTinThalassan.notmetered
ltx/en_us_goadedes/me.m12.dBC:meMA.Ode6C11.mode	@ltx/en_us_goadedes/miscellanea:misc.Mode6
ltx/en_us_goadedes/me.m12.dBC:meMA.Ode6C11.ode	@ltx/en_us_goadedes/miscellanea:misc.Ode6
ltx/en_us_goadedes/me.m12.dBC:meMA.Ode6C11.text	O good One, by Your three-day burial, as God You neutralized death and demolished Hades. O King Jesus, by Your resurrection, You poured out life to people in the world.
ltx/en_us_goadedes/me.m12.dBC:meMA.Ode6C12.incipit	Forefather Abraham…
ltx/en_us_goadedes/me.m12.dBC:meMA.Ode6C12.melody	@ltx/en_us_goadedes/he.h.m6:heHE.TouViouTinThalassan.notmetered
ltx/en_us_goadedes/me.m12.dBC:meMA.Ode6C12.mode	@ltx/en_us_goadedes/miscellanea:misc.Mode6
ltx/en_us_goadedes/me.m12.dBC:meMA.Ode6C12.ode	@ltx/en_us_goadedes/miscellanea:misc.Ode6
ltx/en_us_goadedes/me.m12.dBC:meMA.Ode6C12.text	Forefather Abraham was hospitable and he had great faith. He rejoiced when he symbolically received the divine mystery. Anticipating Christ, he now celebrates.
ltx/en_us_goadedes/me.m12.dBC:meMA.Ode6C13.incipit	For the Servants…
ltx/en_us_goadedes/me.m12.dBC:meMA.Ode6C13.melody	@ltx/en_us_goadedes/he.h.m6:heHE.TouViouTinThalassan.notmetered
ltx/en_us_goadedes/me.m12.dBC:meMA.Ode6C13.mode	@ltx/en_us_goadedes/miscellanea:misc.Mode6
ltx/en_us_goadedes/me.m12.dBC:meMA.Ode6C13.ode	@ltx/en_us_goadedes/miscellanea:misc.Ode6
ltx/en_us_goadedes/me.m12.dBC:meMA.Ode6C13.text	For the Servants, faith subordinated creation, by the gift of the Spirit. For the brazen and devouring fire respected those who worshiped the Maker of fire, namely Jesus Christ.
ltx/en_us_goadedes/me.m12.dBC:meMA.Ode6C14.incipit	Long ago, Prophet Daniel…
ltx/en_us_goadedes/me.m12.dBC:meMA.Ode6C14.melody	@ltx/en_us_goadedes/he.h.m6:heHE.TouViouTinThalassan.notmetered
ltx/en_us_goadedes/me.m12.dBC:meMA.Ode6C14.mode	@ltx/en_us_goadedes/miscellanea:misc.Mode6
ltx/en_us_goadedes/me.m12.dBC:meMA.Ode6C14.ode	@ltx/en_us_goadedes/miscellanea:misc.Ode6
ltx/en_us_goadedes/me.m12.dBC:meMA.Ode6C14.text	Long ago, Prophet Daniel shut the mouths of lions in the den. By this he prophesied that the savagery of the world would be trained for divine peace by the advent of Christ.
ltx/en_us_goadedes/me.m12.dBC:meMA.Ode6C1H.greekmelody	@ltx/en_us_goadedes/he.h.m6:heHE.TouViouTinThalassan.greekname
ltx/en_us_goadedes/me.m12.dBC:meMA.Ode6C1H.incipit	@ltx/en_us_goadedes/he.h.m6:heHE.TouViouTinThalassan.incipit
ltx/en_us_goadedes/me.m12.dBC:meMA.Ode6C1H.melody	@ltx/en_us_goadedes/he.h.m6:heHE.TouViouTinThalassan.melody
ltx/en_us_goadedes/me.m12.dBC:meMA.Ode6C1H.mode	@ltx/en_us_goadedes/miscellanea:misc.Mode6
ltx/en_us_goadedes/me.m12.dBC:meMA.Ode6C1H.ode	@ltx/en_us_goadedes/miscellanea:misc.Ode6
ltx/en_us_goadedes/me.m12.dBC:meMA.Ode6C1H.text	@ltx/en_us_goadedes/he.h.m6:heHE.TouViouTinThalassan.text
ltx/en_us_goadedes/me.m12.dBC:meMA.Ode6C1T.incipit	O perpetually virgin…
ltx/en_us_goadedes/me.m12.dBC:meMA.Ode6C1T.melody	@ltx/en_us_goadedes/he.h.m6:heHE.TouViouTinThalassan.notmetered
ltx/en_us_goadedes/me.m12.dBC:meMA.Ode6C1T.mode	@ltx/en_us_goadedes/miscellanea:misc.Mode6
ltx/en_us_goadedes/me.m12.dBC:meMA.Ode6C1T.ode	@ltx/en_us_goadedes/miscellanea:misc.Ode6
ltx/en_us_goadedes/me.m12.dBC:meMA.Ode6C1T.text	O perpetually virgin Mother Mary, you carried Christ in your virgin womb. The Prophets and the Fathers, inspired by God, saw Him; and now they celebrate in anticipation of Christmas.
ltx/en_us_goadedes/me.m12.dBC:meMA.Ode6C21.greekmelody	@ltx/en_us_goadedes/he.h.m1:heHE.SplanchnonIonan.greekname
ltx/en_us_goadedes/me.m12.dBC:meMA.Ode6C21.incipit	…
ltx/en_us_goadedes/me.m12.dBC:meMA.Ode6C21.melody	@ltx/en_us_goadedes/he.h.m1:heHE.SplanchnonIonan.name
ltx/en_us_goadedes/me.m12.dBC:meMA.Ode6C21.mode	@ltx/en_us_goadedes/miscellanea:misc.Mode1
ltx/en_us_goadedes/me.m12.dBC:meMA.Ode6C21.ode	@ltx/en_us_goadedes/miscellanea:misc.Ode6
ltx/en_us_goadedes/me.m12.dBC:meMA.Ode6C21.text	
ltx/en_us_goadedes/me.m12.dBC:meMA.Ode6C22.incipit	…
ltx/en_us_goadedes/me.m12.dBC:meMA.Ode6C22.melody	@ltx/en_us_goadedes/he.h.m1:heHE.SplanchnonIonan.name
ltx/en_us_goadedes/me.m12.dBC:meMA.Ode6C22.mode	@ltx/en_us_goadedes/miscellanea:misc.Mode1
ltx/en_us_goadedes/me.m12.dBC:meMA.Ode6C22.ode	@ltx/en_us_goadedes/miscellanea:misc.Ode6
ltx/en_us_goadedes/me.m12.dBC:meMA.Ode6C22.text	
ltx/en_us_goadedes/me.m12.dBC:meMA.Ode6C2T.incipit	…
ltx/en_us_goadedes/me.m12.dBC:meMA.Ode6C2T.melody	@ltx/en_us_goadedes/he.h.m1:heHE.SplanchnonIonan.name
ltx/en_us_goadedes/me.m12.dBC:meMA.Ode6C2T.mode	@ltx/en_us_goadedes/miscellanea:misc.Mode1
ltx/en_us_goadedes/me.m12.dBC:meMA.Ode6C2T.ode	@ltx/en_us_goadedes/miscellanea:misc.Ode6
ltx/en_us_goadedes/me.m12.dBC:meMA.Ode6C2T.text	
ltx/en_us_goadedes/me.m12.dBC:meMA.Ode7C11.greekmelody	@ltx/en_us_goadedes/he.h.m6:heHE.AfrastonThavma.greekname
ltx/en_us_goadedes/me.m12.dBC:meMA.Ode7C11.incipit	Oh strange miracle…
ltx/en_us_goadedes/me.m12.dBC:meMA.Ode7C11.melody	@ltx/en_us_goadedes/he.h.m6:heHE.AfrastonThavma.notmetered
ltx/en_us_goadedes/me.m12.dBC:meMA.Ode7C11.mode	@ltx/en_us_goadedes/miscellanea:misc.Mode6
ltx/en_us_goadedes/me.m12.dBC:meMA.Ode7C11.ode	@ltx/en_us_goadedes/miscellanea:misc.Ode7
ltx/en_us_goadedes/me.m12.dBC:meMA.Ode7C11.text	Oh strange miracle! The Lord who sits on a throne in the heights underwent death in the flesh He assumed. But in the might of His divinity He rose, and with himself He raised those who had died from the beginning of time.
ltx/en_us_goadedes/me.m12.dBC:meMA.Ode7C12.incipit	O Father Abraham…
ltx/en_us_goadedes/me.m12.dBC:meMA.Ode7C12.melody	@ltx/en_us_goadedes/he.h.m6:heHE.AfrastonThavma.notmetered
ltx/en_us_goadedes/me.m12.dBC:meMA.Ode7C12.mode	@ltx/en_us_goadedes/miscellanea:misc.Mode6
ltx/en_us_goadedes/me.m12.dBC:meMA.Ode7C12.ode	@ltx/en_us_goadedes/miscellanea:misc.Ode7
ltx/en_us_goadedes/me.m12.dBC:meMA.Ode7C12.text	O Father Abraham, author of the faith, by begetting Christ according to the flesh, you were clearly shown to be the father of the Gentiles by the Spirit, for the salvation of us who sing, “O our God and Redeemer, You are blessed.”
ltx/en_us_goadedes/me.m12.dBC:meMA.Ode7C13.incipit	The hymn of the living…
ltx/en_us_goadedes/me.m12.dBC:meMA.Ode7C13.melody	@ltx/en_us_goadedes/he.h.m6:heHE.AfrastonThavma.notmetered
ltx/en_us_goadedes/me.m12.dBC:meMA.Ode7C13.mode	@ltx/en_us_goadedes/miscellanea:misc.Mode6
ltx/en_us_goadedes/me.m12.dBC:meMA.Ode7C13.ode	@ltx/en_us_goadedes/miscellanea:misc.Ode7
ltx/en_us_goadedes/me.m12.dBC:meMA.Ode7C13.text	The hymn of the living overpowered the din of the inanimate instruments sounding in vain; for the Servants, with their bodies in the flames, trampled the fire in the furnace as they sang, “O our God, You are blessed.”
ltx/en_us_goadedes/me.m12.dBC:meMA.Ode7C14.incipit	Long ago, Prophet Daniel…
ltx/en_us_goadedes/me.m12.dBC:meMA.Ode7C14.melody	@ltx/en_us_goadedes/he.h.m6:heHE.AfrastonThavma.notmetered
ltx/en_us_goadedes/me.m12.dBC:meMA.Ode7C14.mode	@ltx/en_us_goadedes/miscellanea:misc.Mode6
ltx/en_us_goadedes/me.m12.dBC:meMA.Ode7C14.ode	@ltx/en_us_goadedes/miscellanea:misc.Ode7
ltx/en_us_goadedes/me.m12.dBC:meMA.Ode7C14.text	Long ago, Prophet Daniel concentrated on the contemplation of the Spirit, and he foreshadowed the Second Coming of Christ. He foretold the frightful events that will surround it, and he sang, “O our God, You are blessed.”
ltx/en_us_goadedes/me.m12.dBC:meMA.Ode7C1H.greekmelody	@ltx/en_us_goadedes/he.h.m6:heHE.AfrastonThavma.greekname
ltx/en_us_goadedes/me.m12.dBC:meMA.Ode7C1H.incipit	@ltx/en_us_goadedes/he.h.m6:heHE.AfrastonThavma.incipit
ltx/en_us_goadedes/me.m12.dBC:meMA.Ode7C1H.melody	@ltx/en_us_goadedes/he.h.m6:heHE.AfrastonThavma.melody
ltx/en_us_goadedes/me.m12.dBC:meMA.Ode7C1H.mode	@ltx/en_us_goadedes/miscellanea:misc.Mode6
ltx/en_us_goadedes/me.m12.dBC:meMA.Ode7C1H.ode	@ltx/en_us_goadedes/miscellanea:misc.Ode7
ltx/en_us_goadedes/me.m12.dBC:meMA.Ode7C1H.text	@ltx/en_us_goadedes/he.h.m6:heHE.AfrastonThavma.text
ltx/en_us_goadedes/me.m12.dBC:meMA.Ode7C1T.incipit	The strange miracle…
ltx/en_us_goadedes/me.m12.dBC:meMA.Ode7C1T.melody	@ltx/en_us_goadedes/he.h.m6:heHE.AfrastonThavma.notmetered
ltx/en_us_goadedes/me.m12.dBC:meMA.Ode7C1T.mode	@ltx/en_us_goadedes/miscellanea:misc.Mode6
ltx/en_us_goadedes/me.m12.dBC:meMA.Ode7C1T.ode	@ltx/en_us_goadedes/miscellanea:misc.Ode7
ltx/en_us_goadedes/me.m12.dBC:meMA.Ode7C1T.text	The strange miracle, spoken of by prophets and by fathers long ago, that a pure Virgin would give birth, has come to pass, for the salvation of us who sing, “O our God and Redeemer, You are blessed.”
ltx/en_us_goadedes/me.m12.dBC:meMA.Ode7C21.greekmelody	@ltx/en_us_goadedes/he.h.m1:heHE.OiPaidesEfseveia.greekname
ltx/en_us_goadedes/me.m12.dBC:meMA.Ode7C21.incipit	…
ltx/en_us_goadedes/me.m12.dBC:meMA.Ode7C21.melody	@ltx/en_us_goadedes/he.h.m1:heHE.OiPaidesEfseveia.name
ltx/en_us_goadedes/me.m12.dBC:meMA.Ode7C21.mode	@ltx/en_us_goadedes/miscellanea:misc.Mode1
ltx/en_us_goadedes/me.m12.dBC:meMA.Ode7C21.ode	@ltx/en_us_goadedes/miscellanea:misc.Ode7
ltx/en_us_goadedes/me.m12.dBC:meMA.Ode7C21.text	
ltx/en_us_goadedes/me.m12.dBC:meMA.Ode7C22.incipit	…
ltx/en_us_goadedes/me.m12.dBC:meMA.Ode7C22.melody	@ltx/en_us_goadedes/he.h.m1:heHE.OiPaidesEfseveia.name
ltx/en_us_goadedes/me.m12.dBC:meMA.Ode7C22.mode	@ltx/en_us_goadedes/miscellanea:misc.Mode1
ltx/en_us_goadedes/me.m12.dBC:meMA.Ode7C22.ode	@ltx/en_us_goadedes/miscellanea:misc.Ode7
ltx/en_us_goadedes/me.m12.dBC:meMA.Ode7C22.text	
ltx/en_us_goadedes/me.m12.dBC:meMA.Ode7C2T.incipit	…
ltx/en_us_goadedes/me.m12.dBC:meMA.Ode7C2T.melody	@ltx/en_us_goadedes/he.h.m1:heHE.OiPaidesEfseveia.name
ltx/en_us_goadedes/me.m12.dBC:meMA.Ode7C2T.mode	@ltx/en_us_goadedes/miscellanea:misc.Mode1
ltx/en_us_goadedes/me.m12.dBC:meMA.Ode7C2T.ode	@ltx/en_us_goadedes/miscellanea:misc.Ode7
ltx/en_us_goadedes/me.m12.dBC:meMA.Ode7C2T.text	
ltx/en_us_goadedes/me.m12.dBC:meMA.Ode8C11.greekmelody	@ltx/en_us_goadedes/he.h.m6:heHE.EkstithiFrittonOurane.greekname
ltx/en_us_goadedes/me.m12.dBC:meMA.Ode8C11.incipit	We marvel at Your ineffable…
ltx/en_us_goadedes/me.m12.dBC:meMA.Ode8C11.melody	@ltx/en_us_goadedes/he.h.m6:heHE.EkstithiFrittonOurane.notmetered
ltx/en_us_goadedes/me.m12.dBC:meMA.Ode8C11.mode	@ltx/en_us_goadedes/miscellanea:misc.Mode6
ltx/en_us_goadedes/me.m12.dBC:meMA.Ode8C11.ode	@ltx/en_us_goadedes/miscellanea:misc.Ode8
ltx/en_us_goadedes/me.m12.dBC:meMA.Ode8C11.text	We marvel at Your ineffable condescension for us lowly creatures, O Christ! Behold, You tasted death, though You are immortal God, and You were laid as a mortal in a sepulcher. Then You rose, O Logos, and with yourself raised those below. And they exalt You beyond measure unto all the ages.
ltx/en_us_goadedes/me.m12.dBC:meMA.Ode8C12.incipit	O Christ, Abraham was prefiguring…
ltx/en_us_goadedes/me.m12.dBC:meMA.Ode8C12.melody	@ltx/en_us_goadedes/he.h.m6:heHE.EkstithiFrittonOurane.notmetered
ltx/en_us_goadedes/me.m12.dBC:meMA.Ode8C12.mode	@ltx/en_us_goadedes/miscellanea:misc.Mode6
ltx/en_us_goadedes/me.m12.dBC:meMA.Ode8C12.ode	@ltx/en_us_goadedes/miscellanea:misc.Ode8
ltx/en_us_goadedes/me.m12.dBC:meMA.Ode8C12.text	O Christ, Abraham was prefiguring Your slaughter when in obedience to You, his Master, he went up the mountain in faith to sacrifice like a sheep the son he had begotten. But the old man returned with Isaac rejoicing, and they exalt You beyond measure unto all the ages.
ltx/en_us_goadedes/me.m12.dBC:meMA.Ode8C13.incipit	O Christ, the unflagging flame…
ltx/en_us_goadedes/me.m12.dBC:meMA.Ode8C13.melody	@ltx/en_us_goadedes/he.h.m6:heHE.EkstithiFrittonOurane.notmetered
ltx/en_us_goadedes/me.m12.dBC:meMA.Ode8C13.mode	@ltx/en_us_goadedes/miscellanea:misc.Mode6
ltx/en_us_goadedes/me.m12.dBC:meMA.Ode8C13.ode	@ltx/en_us_goadedes/miscellanea:misc.Ode8
ltx/en_us_goadedes/me.m12.dBC:meMA.Ode8C13.text	O Christ, the unflagging flame was quite subdued, when the holy Servants donned You, the divine fire, as a garment; and by Your condescension, the dew whistled round them as they sang, “Bless Him, Priests; and People, exalt Him beyond measure unto all the ages.”
ltx/en_us_goadedes/me.m12.dBC:meMA.Ode8C14.incipit	By inscrutable judgments…
ltx/en_us_goadedes/me.m12.dBC:meMA.Ode8C14.melody	@ltx/en_us_goadedes/he.h.m6:heHE.EkstithiFrittonOurane.notmetered
ltx/en_us_goadedes/me.m12.dBC:meMA.Ode8C14.mode	@ltx/en_us_goadedes/miscellanea:misc.Mode6
ltx/en_us_goadedes/me.m12.dBC:meMA.Ode8C14.ode	@ltx/en_us_goadedes/miscellanea:misc.Ode8
ltx/en_us_goadedes/me.m12.dBC:meMA.Ode8C14.text	By inscrutable judgments, Prophet Daniel was given to be food for lions. But the beasts in the den joined him in fasting piously, in accordance with the teachings of self-control. At his entreaties and those of Abraham and the Servants, preserve in peace those who sing a hymn to You.
ltx/en_us_goadedes/me.m12.dBC:meMA.Ode8C1H.greekmelody	@ltx/en_us_goadedes/he.h.m6:heHE.EkstithiFrittonOurane.greekname
ltx/en_us_goadedes/me.m12.dBC:meMA.Ode8C1H.incipit	@ltx/en_us_goadedes/he.h.m6:heHE.EkstithiFrittonOurane.incipit
ltx/en_us_goadedes/me.m12.dBC:meMA.Ode8C1H.melody	@ltx/en_us_goadedes/he.h.m6:heHE.EkstithiFrittonOurane.melody
ltx/en_us_goadedes/me.m12.dBC:meMA.Ode8C1H.mode	@ltx/en_us_goadedes/miscellanea:misc.Mode6
ltx/en_us_goadedes/me.m12.dBC:meMA.Ode8C1H.ode	@ltx/en_us_goadedes/miscellanea:misc.Ode8
ltx/en_us_goadedes/me.m12.dBC:meMA.Ode8C1H.text	@ltx/en_us_goadedes/he.h.m6:heHE.EkstithiFrittonOurane.text
ltx/en_us_goadedes/me.m12.dBC:meMA.Ode8C1T.incipit	Prophetic sayings…
ltx/en_us_goadedes/me.m12.dBC:meMA.Ode8C1T.melody	@ltx/en_us_goadedes/he.h.m6:heHE.EkstithiFrittonOurane.notmetered
ltx/en_us_goadedes/me.m12.dBC:meMA.Ode8C1T.mode	@ltx/en_us_goadedes/miscellanea:misc.Mode6
ltx/en_us_goadedes/me.m12.dBC:meMA.Ode8C1T.ode	@ltx/en_us_goadedes/miscellanea:misc.Ode8
ltx/en_us_goadedes/me.m12.dBC:meMA.Ode8C1T.text	Prophetic sayings faithfully foretold the coming in human form of Jesus Emmanuel, the Son and Logos of God, unoriginate with the Father. The Virgin Mary conceived Him by the Holy Spirit, and in perpetual virginity she gave birth to Him in the city of Bethlehem.
ltx/en_us_goadedes/me.m12.dBC:meMA.Ode8C21.greekmelody	@ltx/en_us_goadedes/he.h.m1:heHE.ThavmatosYperfyous.greekname
ltx/en_us_goadedes/me.m12.dBC:meMA.Ode8C21.incipit	…
ltx/en_us_goadedes/me.m12.dBC:meMA.Ode8C21.melody	@ltx/en_us_goadedes/he.h.m1:heHE.ThavmatosYperfyous.name
ltx/en_us_goadedes/me.m12.dBC:meMA.Ode8C21.mode	@ltx/en_us_goadedes/miscellanea:misc.Mode1
ltx/en_us_goadedes/me.m12.dBC:meMA.Ode8C21.ode	@ltx/en_us_goadedes/miscellanea:misc.Ode8
ltx/en_us_goadedes/me.m12.dBC:meMA.Ode8C21.text	
ltx/en_us_goadedes/me.m12.dBC:meMA.Ode8C22.incipit	…
ltx/en_us_goadedes/me.m12.dBC:meMA.Ode8C22.melody	@ltx/en_us_goadedes/he.h.m1:heHE.ThavmatosYperfyous.name
ltx/en_us_goadedes/me.m12.dBC:meMA.Ode8C22.mode	@ltx/en_us_goadedes/miscellanea:misc.Mode1
ltx/en_us_goadedes/me.m12.dBC:meMA.Ode8C22.ode	@ltx/en_us_goadedes/miscellanea:misc.Ode8
ltx/en_us_goadedes/me.m12.dBC:meMA.Ode8C22.text	
ltx/en_us_goadedes/me.m12.dBC:meMA.Ode8C2T.incipit	…
ltx/en_us_goadedes/me.m12.dBC:meMA.Ode8C2T.melody	@ltx/en_us_goadedes/he.h.m1:heHE.ThavmatosYperfyous.name
ltx/en_us_goadedes/me.m12.dBC:meMA.Ode8C2T.mode	@ltx/en_us_goadedes/miscellanea:misc.Mode1
ltx/en_us_goadedes/me.m12.dBC:meMA.Ode8C2T.ode	@ltx/en_us_goadedes/miscellanea:misc.Ode8
ltx/en_us_goadedes/me.m12.dBC:meMA.Ode8C2T.text	
ltx/en_us_goadedes/me.m12.dBC:meMA.Ode9C11.greekmelody	@ltx/en_us_goadedes/he.h.m6:heHE.MiEpodyrouMouMiter.greekname
ltx/en_us_goadedes/me.m12.dBC:meMA.Ode9C11.incipit	O creation, why do you lament…
ltx/en_us_goadedes/me.m12.dBC:meMA.Ode9C11.melody	@ltx/en_us_goadedes/he.h.m6:heHE.MiEpodyrouMouMiter.notmetered
ltx/en_us_goadedes/me.m12.dBC:meMA.Ode9C11.mode	@ltx/en_us_goadedes/miscellanea:misc.Mode6
ltx/en_us_goadedes/me.m12.dBC:meMA.Ode9C11.ode	@ltx/en_us_goadedes/miscellanea:misc.Ode9
ltx/en_us_goadedes/me.m12.dBC:meMA.Ode9C11.text	O creation, why do you lament as you behold the Master of life and your God crucified and buried? He will rise and radiantly renew you by His resurrection within three days, and He will destroy death and with himself raise those who extol Him.
ltx/en_us_goadedes/me.m12.dBC:meMA.Ode9C12.incipit	As we celebrate the feast…
ltx/en_us_goadedes/me.m12.dBC:meMA.Ode9C12.melody	@ltx/en_us_goadedes/he.h.m6:heHE.MiEpodyrouMouMiter.notmetered
ltx/en_us_goadedes/me.m12.dBC:meMA.Ode9C12.mode	@ltx/en_us_goadedes/miscellanea:misc.Mode6
ltx/en_us_goadedes/me.m12.dBC:meMA.Ode9C12.ode	@ltx/en_us_goadedes/miscellanea:misc.Ode9
ltx/en_us_goadedes/me.m12.dBC:meMA.Ode9C12.text	As we celebrate the feast of the Forefathers who were before the Law, we honor as God their descendant Jesus. Abraham, Isaac, and Jacob have been shown to be the pedestal of the Prophets and the Law, and by faith they are the spiritual first-fruits of Grace.
ltx/en_us_goadedes/me.m12.dBC:meMA.Ode9C13.incipit	God showed Moses…
ltx/en_us_goadedes/me.m12.dBC:meMA.Ode9C13.melody	@ltx/en_us_goadedes/he.h.m6:heHE.MiEpodyrouMouMiter.notmetered
ltx/en_us_goadedes/me.m12.dBC:meMA.Ode9C13.mode	@ltx/en_us_goadedes/miscellanea:misc.Mode6
ltx/en_us_goadedes/me.m12.dBC:meMA.Ode9C13.ode	@ltx/en_us_goadedes/miscellanea:misc.Ode9
ltx/en_us_goadedes/me.m12.dBC:meMA.Ode9C13.text	God showed Moses the incomprehensible mystery, in a divine vision in the bush. The same God came down to the Servants in the fire; and by the fire of His divinity, He made the furnace flame to be as though a dew-laden breeze.
ltx/en_us_goadedes/me.m12.dBC:meMA.Ode9C14.incipit	Abraham is joined…
ltx/en_us_goadedes/me.m12.dBC:meMA.Ode9C14.melody	@ltx/en_us_goadedes/he.h.m6:heHE.MiEpodyrouMouMiter.notmetered
ltx/en_us_goadedes/me.m12.dBC:meMA.Ode9C14.mode	@ltx/en_us_goadedes/miscellanea:misc.Mode6
ltx/en_us_goadedes/me.m12.dBC:meMA.Ode9C14.ode	@ltx/en_us_goadedes/miscellanea:misc.Ode9
ltx/en_us_goadedes/me.m12.dBC:meMA.Ode9C14.text	Abraham is joined by the all-holy Servants and God’s wondrous Prophet Daniel, Isaac and Jacob, Moses and Aaron. They all faithfully celebrate before Christ’s birth, and they unceasingly implore Him for our salvation.
ltx/en_us_goadedes/me.m12.dBC:meMA.Ode9C1H.greekmelody	@ltx/en_us_goadedes/he.h.m6:heHE.MiEpodyrouMouMiter.greekname
ltx/en_us_goadedes/me.m12.dBC:meMA.Ode9C1H.incipit	@ltx/en_us_goadedes/he.h.m6:heHE.MiEpodyrouMouMiter.incipit
ltx/en_us_goadedes/me.m12.dBC:meMA.Ode9C1H.melody	@ltx/en_us_goadedes/he.h.m6:heHE.MiEpodyrouMouMiter.melody
ltx/en_us_goadedes/me.m12.dBC:meMA.Ode9C1H.mode	@ltx/en_us_goadedes/miscellanea:misc.Mode6
ltx/en_us_goadedes/me.m12.dBC:meMA.Ode9C1H.ode	@ltx/en_us_goadedes/miscellanea:misc.Ode9
ltx/en_us_goadedes/me.m12.dBC:meMA.Ode9C1H.text	@ltx/en_us_goadedes/he.h.m6:heHE.MiEpodyrouMouMiter.text
ltx/en_us_goadedes/me.m12.dBC:meMA.Ode9C1T.incipit	O Virgin, all creation…
ltx/en_us_goadedes/me.m12.dBC:meMA.Ode9C1T.melody	@ltx/en_us_goadedes/he.h.m6:heHE.MiEpodyrouMouMiter.notmetered
ltx/en_us_goadedes/me.m12.dBC:meMA.Ode9C1T.mode	@ltx/en_us_goadedes/miscellanea:misc.Mode6
ltx/en_us_goadedes/me.m12.dBC:meMA.Ode9C1T.ode	@ltx/en_us_goadedes/miscellanea:misc.Ode9
ltx/en_us_goadedes/me.m12.dBC:meMA.Ode9C1T.text	O Virgin, all creation congratulates you for your childbirth. Bethlehem has opened Eden to us. And behold, we all enjoy the tree of life, and with faith we earnestly pray, “O Master, please fulfill our petitions!”
ltx/en_us_goadedes/me.m12.dBC:meMA.Ode9C21.greekmelody	@ltx/en_us_goadedes/he.h.m1:heHE.MystirionXenon.greekname
ltx/en_us_goadedes/me.m12.dBC:meMA.Ode9C21.incipit	…
ltx/en_us_goadedes/me.m12.dBC:meMA.Ode9C21.melody	@ltx/en_us_goadedes/he.h.m1:heHE.MystirionXenon.name
ltx/en_us_goadedes/me.m12.dBC:meMA.Ode9C21.mode	@ltx/en_us_goadedes/miscellanea:misc.Mode1
ltx/en_us_goadedes/me.m12.dBC:meMA.Ode9C21.ode	@ltx/en_us_goadedes/miscellanea:misc.Ode9
ltx/en_us_goadedes/me.m12.dBC:meMA.Ode9C21.text	
ltx/en_us_goadedes/me.m12.dBC:meMA.Ode9C22.incipit	…
ltx/en_us_goadedes/me.m12.dBC:meMA.Ode9C22.melody	@ltx/en_us_goadedes/he.h.m1:heHE.MystirionXenon.name
ltx/en_us_goadedes/me.m12.dBC:meMA.Ode9C22.mode	@ltx/en_us_goadedes/miscellanea:misc.Mode1
ltx/en_us_goadedes/me.m12.dBC:meMA.Ode9C22.ode	@ltx/en_us_goadedes/miscellanea:misc.Ode9
ltx/en_us_goadedes/me.m12.dBC:meMA.Ode9C22.text	
ltx/en_us_goadedes/me.m12.dBC:meMA.Ode9C2T.incipit	…
ltx/en_us_goadedes/me.m12.dBC:meMA.Ode9C2T.melody	@ltx/en_us_goadedes/he.h.m1:heHE.MystirionXenon.name
ltx/en_us_goadedes/me.m12.dBC:meMA.Ode9C2T.mode	@ltx/en_us_goadedes/miscellanea:misc.Mode1
ltx/en_us_goadedes/me.m12.dBC:meMA.Ode9C2T.ode	@ltx/en_us_goadedes/miscellanea:misc.Ode9
ltx/en_us_goadedes/me.m12.dBC:meMA.Ode9C2T.text	
ltx/en_us_goadedes/me.m12.dBC:meMA.Oikos1.text	@ltx/en_us_goadedes/me.m12.d17:meMA.Oikos2.text
ltx/en_us_goadedes/me.m12.dBC:meMA.Oikos2.text	
ltx/en_us_goadedes/me.m12.dBC:meVE.Apolytikion1.incipit	@ltx/en_us_goadedes/me.m12.d17:meVE.Apolytikion1.incipit
ltx/en_us_goadedes/me.m12.dBC:meVE.Apolytikion1.melody	
ltx/en_us_goadedes/me.m12.dBC:meVE.Apolytikion1.mode	@ltx/en_us_goadedes/miscellanea:misc.Mode2
ltx/en_us_goadedes/me.m12.dBC:meVE.Apolytikion1.text	@ltx/en_us_goadedes/me.m12.d17:meVE.Apolytikion1.text
ltx/en_us_goadedes/me.m12.dBC:meVE.AposBoth.incipit	@ltx/en_us_goadedes/me.m12.d12:meVE.AposBoth.incipit
ltx/en_us_goadedes/me.m12.dBC:meVE.AposBoth.melody	
ltx/en_us_goadedes/me.m12.dBC:meVE.AposBoth.mode	@ltx/en_us_goadedes/miscellanea:misc.Mode2
ltx/en_us_goadedes/me.m12.dBC:meVE.AposBoth.text	@ltx/en_us_goadedes/me.m12.d12:meVE.AposBoth.text
ltx/en_us_goadedes/me.m12.dBC:meVE.AposGlory.incipit	…
ltx/en_us_goadedes/me.m12.dBC:meVE.AposGlory.melody	
ltx/en_us_goadedes/me.m12.dBC:meVE.AposGlory.mode	@ltx/en_us_goadedes/miscellanea:misc.Mode2
ltx/en_us_goadedes/me.m12.dBC:meVE.AposGlory.poet	@ltx/en_us_goadedes/poets:po.Kyprianou
ltx/en_us_goadedes/me.m12.dBC:meVE.AposGlory.text	
ltx/en_us_goadedes/me.m12.dBC:meVE.LityBoth.incipit	@ltx/en_us_goadedes/me.m12.d20:meVE.Stichera03.incipit
ltx/en_us_goadedes/me.m12.dBC:meVE.LityBoth.melody	
ltx/en_us_goadedes/me.m12.dBC:meVE.LityBoth.mode	@ltx/en_us_goadedes/miscellanea:misc.Mode1
ltx/en_us_goadedes/me.m12.dBC:meVE.LityBoth.text	@ltx/en_us_goadedes/me.m12.d20:meVE.Stichera03.text
ltx/en_us_goadedes/me.m12.dBC:meVE.LityGlory.incipit	The famous Prophets…
ltx/en_us_goadedes/me.m12.dBC:meVE.LityGlory.melody	
ltx/en_us_goadedes/me.m12.dBC:meVE.LityGlory.mode	@ltx/en_us_goadedes/miscellanea:misc.Mode1
ltx/en_us_goadedes/me.m12.dBC:meVE.LityGlory.text	The famous Prophets are forever called blessed, for they shined brilliantly with flashes of God-inspired utterances. They garnered messages from the Spirit, and they proclaimed to all the inexplicable birth of Christ our God. They lived a most marvelous life, and they had a righteous demise.
ltx/en_us_goadedes/me.m12.dBC:meVE.SticBoth.incipit	@ltx/en_us_goadedes/me.m12.d06:meVE.SticBoth.incipit
ltx/en_us_goadedes/me.m12.dBC:meVE.SticBoth.melody	
ltx/en_us_goadedes/me.m12.dBC:meVE.SticBoth.mode	@ltx/en_us_goadedes/miscellanea:misc.Mode6
ltx/en_us_goadedes/me.m12.dBC:meVE.SticBoth.text	@ltx/en_us_goadedes/me.m12.d06:meVE.SticBoth.text
ltx/en_us_goadedes/me.m12.dBC:meVE.SticGlory.incipit	@ltx/en_us_goadedes/me.m12.d17:meVE.AposBoth.incipit
ltx/en_us_goadedes/me.m12.dBC:meVE.SticGlory.melody	
ltx/en_us_goadedes/me.m12.dBC:meVE.SticGlory.mode	@ltx/en_us_goadedes/miscellanea:misc.Mode6
ltx/en_us_goadedes/me.m12.dBC:meVE.SticGlory.text	@ltx/en_us_goadedes/me.m12.d17:meVE.AposBoth.text
ltx/en_us_goadedes/me.m12.dBC:meVE.Stichera01.greekmelody	@ltx/en_us_goadedes/he.a.m1:heAU.PaneffimoiMartyres.greekname
ltx/en_us_goadedes/me.m12.dBC:meVE.Stichera01.incipit	O all-blameless Virgin…
ltx/en_us_goadedes/me.m12.dBC:meVE.Stichera01.melody	@ltx/en_us_goadedes/he.a.m1:heAU.PaneffimoiMartyres.name
ltx/en_us_goadedes/me.m12.dBC:meVE.Stichera01.mode	@ltx/en_us_goadedes/miscellanea:misc.Mode1
ltx/en_us_goadedes/me.m12.dBC:meVE.Stichera01.text	O all-blameless Virgin, you are called * Palace of our God, for you contained the One whom the heavens are unable to contain. * In the grotto you bore Him incomprehensibly. * And He became incarnate and poor so that He might make me divine * and enrich man, who was destitute * after eating that bitterest fruit of old.
ltx/en_us_goadedes/me.m12.dBC:meVE.Stichera02.incipit	By Caesar’s decree…
ltx/en_us_goadedes/me.m12.dBC:meVE.Stichera02.melody	@ltx/en_us_goadedes/he.a.m1:heAU.PaneffimoiMartyres.name
ltx/en_us_goadedes/me.m12.dBC:meVE.Stichera02.mode	@ltx/en_us_goadedes/miscellanea:misc.Mode1
ltx/en_us_goadedes/me.m12.dBC:meVE.Stichera02.text	By Caesar’s decree, You were enrolled * with Your servants, when You came to earth, O Christ, in Your tender love, in order to bestow * liberty and freedom, redemption and life, O God, * on Your ungrateful servants who worship You, forbearing Lord of all, * and who honor Your Nativity, * O our Savior, who came here to save our souls.
ltx/en_us_goadedes/me.m12.dBC:meVE.Stichera03.incipit	The all-holy Virgin…
ltx/en_us_goadedes/me.m12.dBC:meVE.Stichera03.melody	@ltx/en_us_goadedes/he.a.m1:heAU.PaneffimoiMartyres.name
ltx/en_us_goadedes/me.m12.dBC:meVE.Stichera03.mode	@ltx/en_us_goadedes/miscellanea:misc.Mode1
ltx/en_us_goadedes/me.m12.dBC:meVE.Stichera03.text	The all-holy Virgin understood * that her inconceivable, all-blameless childbirth had altered laws of nature; and she said * to her Son and Maker, “O beloved Child of mine, * I marvel at this greatest of mysteries, that I have given birth * while retaining my virginity, * by Your power; for You do all things by Your will!”
ltx/en_us_goadedes/me.m12.dBC:meVE.Stichera04.greekmelody	@ltx/en_us_goadedes/he.a.m8:heAU.OEnEdemParadeisos.greekname
ltx/en_us_goadedes/me.m12.dBC:meVE.Stichera04.incipit	O believers, today as we observe…
ltx/en_us_goadedes/me.m12.dBC:meVE.Stichera04.melody	@ltx/en_us_goadedes/he.a.m8:heAU.OEnEdemParadeisos.notmetered
ltx/en_us_goadedes/me.m12.dBC:meVE.Stichera04.mode	@ltx/en_us_goadedes/miscellanea:misc.Mode8
ltx/en_us_goadedes/me.m12.dBC:meVE.Stichera04.text	O believers, today as we observe the memory of the fathers, let us extol Christ our Redeemer, who magnified them among all nations, and who faithfully performed those extraordinary miracles, as powerful and mighty Lord. From them He produced the rod of power for us, namely Mary, the only perpetually virgin pure Mother of God. From her came forth the flower, namely Christ, who blossomed life for all, never-ending delight, and the salvation of our souls.
ltx/en_us_goadedes/me.m12.dBC:meVE.Stichera05.incipit	@ltx/en_us_goadedes/me.m12.dFF:meVE.Stichera03.incipit
ltx/en_us_goadedes/me.m12.dBC:meVE.Stichera05.melody	@ltx/en_us_goadedes/he.a.m8:heAU.OEnEdemParadeisos.name
ltx/en_us_goadedes/me.m12.dBC:meVE.Stichera05.mode	@ltx/en_us_goadedes/miscellanea:misc.Mode8
ltx/en_us_goadedes/me.m12.dBC:meVE.Stichera05.text	@ltx/en_us_goadedes/me.m12.dFF:meVE.Stichera03.text
ltx/en_us_goadedes/me.m12.dBC:meVE.Stichera06.incipit	@ltx/en_us_goadedes/me.m12.dFF:meVE.Stichera04.incipit
ltx/en_us_goadedes/me.m12.dBC:meVE.Stichera06.melody	@ltx/en_us_goadedes/he.a.m8:heAU.OEnEdemParadeisos.name
ltx/en_us_goadedes/me.m12.dBC:meVE.Stichera06.mode	@ltx/en_us_goadedes/miscellanea:misc.Mode8
ltx/en_us_goadedes/me.m12.dBC:meVE.Stichera06.text	@ltx/en_us_goadedes/me.m12.dFF:meVE.Stichera04.text
