ltx/en_us_goadedes/oc.m5.d4:ocBK.ModeNaked	@ltx/en_us_goadedes/miscellanea:misc.Mode5.naked
ltx/en_us_goadedes/oc.m5.d4:ocLI.Beatitudes1.incipit	@ltx/en_us_goadedes/oc.m5.d1:ocLI.Beatitudes1.incipit
ltx/en_us_goadedes/oc.m5.d4:ocLI.Beatitudes1.melody	
ltx/en_us_goadedes/oc.m5.d4:ocLI.Beatitudes1.mode	@ltx/en_us_goadedes/miscellanea:misc.Mode5
ltx/en_us_goadedes/oc.m5.d4:ocLI.Beatitudes1.text	@ltx/en_us_goadedes/oc.m5.d1:ocLI.Beatitudes1.text
ltx/en_us_goadedes/oc.m5.d4:ocLI.Beatitudes2.incipit	…
ltx/en_us_goadedes/oc.m5.d4:ocLI.Beatitudes2.melody	
ltx/en_us_goadedes/oc.m5.d4:ocLI.Beatitudes2.mode	@ltx/en_us_goadedes/miscellanea:misc.Mode5
ltx/en_us_goadedes/oc.m5.d4:ocLI.Beatitudes2.text	
ltx/en_us_goadedes/oc.m5.d4:ocLI.Beatitudes3.incipit	…
ltx/en_us_goadedes/oc.m5.d4:ocLI.Beatitudes3.melody	
ltx/en_us_goadedes/oc.m5.d4:ocLI.Beatitudes3.mode	@ltx/en_us_goadedes/miscellanea:misc.Mode5
ltx/en_us_goadedes/oc.m5.d4:ocLI.Beatitudes3.text	
ltx/en_us_goadedes/oc.m5.d4:ocLI.Beatitudes4.incipit	…
ltx/en_us_goadedes/oc.m5.d4:ocLI.Beatitudes4.melody	
ltx/en_us_goadedes/oc.m5.d4:ocLI.Beatitudes4.mode	@ltx/en_us_goadedes/miscellanea:misc.Mode5
ltx/en_us_goadedes/oc.m5.d4:ocLI.Beatitudes4.text	
ltx/en_us_goadedes/oc.m5.d4:ocLI.BeatitudesT.incipit	…
ltx/en_us_goadedes/oc.m5.d4:ocLI.BeatitudesT.melody	
ltx/en_us_goadedes/oc.m5.d4:ocLI.BeatitudesT.mode	@ltx/en_us_goadedes/miscellanea:misc.Mode5
ltx/en_us_goadedes/oc.m5.d4:ocLI.BeatitudesT.text	
ltx/en_us_goadedes/oc.m5.d4:ocLI.BeatitudesTr.incipit	…
ltx/en_us_goadedes/oc.m5.d4:ocLI.BeatitudesTr.melody	
ltx/en_us_goadedes/oc.m5.d4:ocLI.BeatitudesTr.mode	@ltx/en_us_goadedes/miscellanea:misc.Mode5
ltx/en_us_goadedes/oc.m5.d4:ocLI.BeatitudesTr.text	
ltx/en_us_goadedes/oc.m5.d4:ocLI.MM.Beatitudes1234TrTas78910GB.text	@ltx/en_us_goadedes/properties:media.key
ltx/en_us_goadedes/oc.m5.d4:ocMA.ApolTheotokion.incipit	@ltx/en_us_goadedes/oc.m5.d2:ocMA.ApolTheotokion.incipit
ltx/en_us_goadedes/oc.m5.d4:ocMA.ApolTheotokion.melody	
ltx/en_us_goadedes/oc.m5.d4:ocMA.ApolTheotokion.mode	@ltx/en_us_goadedes/miscellanea:misc.Mode5
ltx/en_us_goadedes/oc.m5.d4:ocMA.ApolTheotokion.text	@ltx/en_us_goadedes/oc.m5.d2:ocMA.ApolTheotokion.text
ltx/en_us_goadedes/oc.m5.d4:ocMA.AposTheotokion.incipit	…
ltx/en_us_goadedes/oc.m5.d4:ocMA.AposTheotokion.melody	
ltx/en_us_goadedes/oc.m5.d4:ocMA.AposTheotokion.mode	@ltx/en_us_goadedes/miscellanea:misc.Mode5
ltx/en_us_goadedes/oc.m5.d4:ocMA.AposTheotokion.text	
ltx/en_us_goadedes/oc.m5.d4:ocMA.Aposticha1.incipit	In the days of Prophet Moses…
ltx/en_us_goadedes/oc.m5.d4:ocMA.Aposticha1.melody	
ltx/en_us_goadedes/oc.m5.d4:ocMA.Aposticha1.mode	@ltx/en_us_goadedes/miscellanea:misc.Mode5
ltx/en_us_goadedes/oc.m5.d4:ocMA.Aposticha1.text	In the days of Prophet Moses, O Lord, merely the figure of Your Cross was displayed, and it defeated Your enemies. And now that we possess Your very Cross itself, we entreat You to help us. Strengthen Your Church, and grant success to our government, as You did long ago to Constantine, in Your abundant mercy, Ο benevolent God.
ltx/en_us_goadedes/oc.m5.d4:ocMA.Aposticha2.incipit	Your Cross destroyed…
ltx/en_us_goadedes/oc.m5.d4:ocMA.Aposticha2.melody	
ltx/en_us_goadedes/oc.m5.d4:ocMA.Aposticha2.mode	@ltx/en_us_goadedes/miscellanea:misc.Mode5
ltx/en_us_goadedes/oc.m5.d4:ocMA.Aposticha2.text	Your Cross destroyed the power of Hades, and it rescued the human race, O Christ. It freed the world from disintegration, and it opened Paradise to the robber. As we now venerate it now, we glorify You, O Savior. Have mercy on us!
ltx/en_us_goadedes/oc.m5.d4:ocMA.Aposticha3.incipit	…
ltx/en_us_goadedes/oc.m5.d4:ocMA.Aposticha3.melody	
ltx/en_us_goadedes/oc.m5.d4:ocMA.Aposticha3.mode	@ltx/en_us_goadedes/miscellanea:misc.Mode5
ltx/en_us_goadedes/oc.m5.d4:ocMA.Aposticha3.text	
ltx/en_us_goadedes/oc.m5.d4:ocMA.C1.acrostic.notice1	
ltx/en_us_goadedes/oc.m5.d4:ocMA.C1.acrostic.text	
ltx/en_us_goadedes/oc.m5.d4:ocMA.C1.acrostic.title	Canon for the Cross.
ltx/en_us_goadedes/oc.m5.d4:ocMA.C2.acrostic.notice1	
ltx/en_us_goadedes/oc.m5.d4:ocMA.C2.acrostic.text	
ltx/en_us_goadedes/oc.m5.d4:ocMA.C2.acrostic.title	Canon for the Theotokos.
ltx/en_us_goadedes/oc.m5.d4:ocMA.CA.notice	
ltx/en_us_goadedes/oc.m5.d4:ocMA.Kathisma11.incipit	…
ltx/en_us_goadedes/oc.m5.d4:ocMA.Kathisma11.melody	
ltx/en_us_goadedes/oc.m5.d4:ocMA.Kathisma11.mode	@ltx/en_us_goadedes/miscellanea:misc.Mode5
ltx/en_us_goadedes/oc.m5.d4:ocMA.Kathisma11.text	
ltx/en_us_goadedes/oc.m5.d4:ocMA.Kathisma12.incipit	…
ltx/en_us_goadedes/oc.m5.d4:ocMA.Kathisma12.melody	
ltx/en_us_goadedes/oc.m5.d4:ocMA.Kathisma12.mode	@ltx/en_us_goadedes/miscellanea:misc.Mode5
ltx/en_us_goadedes/oc.m5.d4:ocMA.Kathisma12.text	
ltx/en_us_goadedes/oc.m5.d4:ocMA.Kathisma13.greekmelody	@ltx/en_us_goadedes/he.a.m5:heAU.TonSynanarchonLogon.greekname
ltx/en_us_goadedes/oc.m5.d4:ocMA.Kathisma13.incipit	As Your Mother was watching…
ltx/en_us_goadedes/oc.m5.d4:ocMA.Kathisma13.melody	@ltx/en_us_goadedes/he.a.m5:heAU.TonSynanarchonLogon.name
ltx/en_us_goadedes/oc.m5.d4:ocMA.Kathisma13.mode	@ltx/en_us_goadedes/miscellanea:misc.Mode5
ltx/en_us_goadedes/oc.m5.d4:ocMA.Kathisma13.text	As Your Mother was watching You, voluntarily * crucified with the robbers on either side, O Christ, * she was cut to the quick, and as a mother and she said, * “O my sinless Son, alas, You were nailed to the Cross, unjustly, as if a convict, * O most benevolent Savior, in order to give life to humanity.”
ltx/en_us_goadedes/oc.m5.d4:ocMA.Kathisma21.greekmelody	@ltx/en_us_goadedes/he.a.m5:heAU.TonSynanarchonLogon.greekname
ltx/en_us_goadedes/oc.m5.d4:ocMA.Kathisma21.incipit	Come, believers…
ltx/en_us_goadedes/oc.m5.d4:ocMA.Kathisma21.melody	@ltx/en_us_goadedes/he.a.m5:heAU.TonSynanarchonLogon.name
ltx/en_us_goadedes/oc.m5.d4:ocMA.Kathisma21.mode	@ltx/en_us_goadedes/miscellanea:misc.Mode5
ltx/en_us_goadedes/oc.m5.d4:ocMA.Kathisma21.text	Come, believers, and let us all worship and extol * our Redeemer and Savior, for He was crucified * voluntarily and knowingly, according to His will. * When He had freed the human race from the error and deceit, * He nailed our sins and transgressions * to the Cross; and to humanity * He granted access to His kingdom and rule.
ltx/en_us_goadedes/oc.m5.d4:ocMA.Kathisma22.greekmelody	@ltx/en_us_goadedes/he.a.m5:heAU.TonSynanarchonLogon.greekname
ltx/en_us_goadedes/oc.m5.d4:ocMA.Kathisma22.incipit	You endured crucifixion…
ltx/en_us_goadedes/oc.m5.d4:ocMA.Kathisma22.melody	@ltx/en_us_goadedes/he.a.m5:heAU.TonSynanarchonLogon.name
ltx/en_us_goadedes/oc.m5.d4:ocMA.Kathisma22.mode	@ltx/en_us_goadedes/miscellanea:misc.Mode5
ltx/en_us_goadedes/oc.m5.d4:ocMA.Kathisma22.text	You endured crucifixion deliberately, * and from death and decay You have freed humanity. * Christ our Savior, we believers extol You and worship You, * for by the power of the Cross You illumined us. And now with fear we all glorify You, * as the Giver of life and Lord, * O benevolent and merciful God.
ltx/en_us_goadedes/oc.m5.d4:ocMA.Kathisma23.greekmelody	@ltx/en_us_goadedes/he.a.m5:heAU.TonSynanarchonLogon.greekname
ltx/en_us_goadedes/oc.m5.d4:ocMA.Kathisma23.incipit	By the Cross of your Son…
ltx/en_us_goadedes/oc.m5.d4:ocMA.Kathisma23.melody	@ltx/en_us_goadedes/he.a.m5:heAU.TonSynanarchonLogon.name
ltx/en_us_goadedes/oc.m5.d4:ocMA.Kathisma23.mode	@ltx/en_us_goadedes/miscellanea:misc.Mode5
ltx/en_us_goadedes/oc.m5.d4:ocMA.Kathisma23.text	By the Cross of your Son, holy Virgin full of grace, * the deceit of the idols has all come to an end, * and the power of the demons has been trampled down. * We the faithful now in gratitude ever sing your praise and call you blessed, O Lady. * We magnify you, confessing that you are truly the Mother of God.
ltx/en_us_goadedes/oc.m5.d4:ocMA.Kathisma31.greekmelody	@ltx/en_us_goadedes/he.a.m5:heAU.TonSynanarchonLogon.greekname
ltx/en_us_goadedes/oc.m5.d4:ocMA.Kathisma31.incipit	We behold how Your prophets’ predictions…
ltx/en_us_goadedes/oc.m5.d4:ocMA.Kathisma31.melody	@ltx/en_us_goadedes/he.a.m5:heAU.TonSynanarchonLogon.name
ltx/en_us_goadedes/oc.m5.d4:ocMA.Kathisma31.mode	@ltx/en_us_goadedes/miscellanea:misc.Mode5
ltx/en_us_goadedes/oc.m5.d4:ocMA.Kathisma31.text	We behold how Your prophets’ predictions were fulfilled. * Your original plan for our salvation came to pass. * King of all, You voluntarily became poor in the flesh, * and You accepted to ascend the Cross and undergo death, for us, O Christ our Savior. * We glorify Your ineffable condescension, O Logos of God.
ltx/en_us_goadedes/oc.m5.d4:ocMA.Kathisma32.incipit	…
ltx/en_us_goadedes/oc.m5.d4:ocMA.Kathisma32.melody	
ltx/en_us_goadedes/oc.m5.d4:ocMA.Kathisma32.mode	@ltx/en_us_goadedes/miscellanea:misc.Mode5
ltx/en_us_goadedes/oc.m5.d4:ocMA.Kathisma32.text	
ltx/en_us_goadedes/oc.m5.d4:ocMA.Kathisma33.greekmelody	@ltx/en_us_goadedes/he.a.m5:heAU.TonSynanarchonLogon.greekname
ltx/en_us_goadedes/oc.m5.d4:ocMA.Kathisma33.incipit	I observe with my own eyes…
ltx/en_us_goadedes/oc.m5.d4:ocMA.Kathisma33.melody	@ltx/en_us_goadedes/he.a.m5:heAU.TonSynanarchonLogon.name
ltx/en_us_goadedes/oc.m5.d4:ocMA.Kathisma33.mode	@ltx/en_us_goadedes/miscellanea:misc.Mode5
ltx/en_us_goadedes/oc.m5.d4:ocMA.Kathisma33.text	I observe with my own eyes that You have closed Your eyes. * Now the light has gone out of my eyes, beloved Son. * I refuse to see the light of the sun in the sky. * How I wish now that my eyes would be gouged out, O Word. “O light of the sun, be darkened! * For He who spoke and you received your light * is on the Cross, and He has closed His eyes.”
ltx/en_us_goadedes/oc.m5.d4:ocMA.OdeW1C11.incipit	…
ltx/en_us_goadedes/oc.m5.d4:ocMA.OdeW1C11.melody	@ltx/en_us_goadedes/he.h.m5:heHE.IpponKaiAnavatin.name
ltx/en_us_goadedes/oc.m5.d4:ocMA.OdeW1C11.mode	@ltx/en_us_goadedes/miscellanea:misc.Mode5
ltx/en_us_goadedes/oc.m5.d4:ocMA.OdeW1C11.ode	@ltx/en_us_goadedes/miscellanea:misc.Ode1
ltx/en_us_goadedes/oc.m5.d4:ocMA.OdeW1C11.text	
ltx/en_us_goadedes/oc.m5.d4:ocMA.OdeW1C12.incipit	…
ltx/en_us_goadedes/oc.m5.d4:ocMA.OdeW1C12.melody	@ltx/en_us_goadedes/he.h.m5:heHE.IpponKaiAnavatin.name
ltx/en_us_goadedes/oc.m5.d4:ocMA.OdeW1C12.mode	@ltx/en_us_goadedes/miscellanea:misc.Mode5
ltx/en_us_goadedes/oc.m5.d4:ocMA.OdeW1C12.ode	@ltx/en_us_goadedes/miscellanea:misc.Ode1
ltx/en_us_goadedes/oc.m5.d4:ocMA.OdeW1C12.text	
ltx/en_us_goadedes/oc.m5.d4:ocMA.OdeW1C13.incipit	…
ltx/en_us_goadedes/oc.m5.d4:ocMA.OdeW1C13.melody	@ltx/en_us_goadedes/he.h.m5:heHE.IpponKaiAnavatin.name
ltx/en_us_goadedes/oc.m5.d4:ocMA.OdeW1C13.mode	@ltx/en_us_goadedes/miscellanea:misc.Mode5
ltx/en_us_goadedes/oc.m5.d4:ocMA.OdeW1C13.ode	@ltx/en_us_goadedes/miscellanea:misc.Ode1
ltx/en_us_goadedes/oc.m5.d4:ocMA.OdeW1C13.text	
ltx/en_us_goadedes/oc.m5.d4:ocMA.OdeW1C14.incipit	…
ltx/en_us_goadedes/oc.m5.d4:ocMA.OdeW1C14.melody	@ltx/en_us_goadedes/he.h.m5:heHE.IpponKaiAnavatin.name
ltx/en_us_goadedes/oc.m5.d4:ocMA.OdeW1C14.mode	@ltx/en_us_goadedes/miscellanea:misc.Mode5
ltx/en_us_goadedes/oc.m5.d4:ocMA.OdeW1C14.ode	@ltx/en_us_goadedes/miscellanea:misc.Ode1
ltx/en_us_goadedes/oc.m5.d4:ocMA.OdeW1C14.text	
ltx/en_us_goadedes/oc.m5.d4:ocMA.OdeW1C1H.greekmelody	@ltx/en_us_goadedes/he.h.m5:heHE.IpponKaiAnavatin.greekname
ltx/en_us_goadedes/oc.m5.d4:ocMA.OdeW1C1H.incipit	@ltx/en_us_goadedes/he.h.m5:heHE.IpponKaiAnavatin.incipit
ltx/en_us_goadedes/oc.m5.d4:ocMA.OdeW1C1H.melody	@ltx/en_us_goadedes/he.h.m5:heHE.IpponKaiAnavatin.melody
ltx/en_us_goadedes/oc.m5.d4:ocMA.OdeW1C1H.mode	@ltx/en_us_goadedes/miscellanea:misc.Mode5
ltx/en_us_goadedes/oc.m5.d4:ocMA.OdeW1C1H.ode	@ltx/en_us_goadedes/miscellanea:misc.Ode1
ltx/en_us_goadedes/oc.m5.d4:ocMA.OdeW1C1H.text	@ltx/en_us_goadedes/he.h.m5:heHE.IpponKaiAnavatin.text
ltx/en_us_goadedes/oc.m5.d4:ocMA.OdeW1C1T.incipit	…
ltx/en_us_goadedes/oc.m5.d4:ocMA.OdeW1C1T.melody	@ltx/en_us_goadedes/he.h.m5:heHE.IpponKaiAnavatin.name
ltx/en_us_goadedes/oc.m5.d4:ocMA.OdeW1C1T.mode	@ltx/en_us_goadedes/miscellanea:misc.Mode5
ltx/en_us_goadedes/oc.m5.d4:ocMA.OdeW1C1T.ode	@ltx/en_us_goadedes/miscellanea:misc.Ode1
ltx/en_us_goadedes/oc.m5.d4:ocMA.OdeW1C1T.text	
ltx/en_us_goadedes/oc.m5.d4:ocMA.OdeW1C21.greekmelody	@ltx/en_us_goadedes/he.h.m5:heHE.IpponKaiAnavatin.greekname
ltx/en_us_goadedes/oc.m5.d4:ocMA.OdeW1C21.incipit	…
ltx/en_us_goadedes/oc.m5.d4:ocMA.OdeW1C21.melody	@ltx/en_us_goadedes/he.h.m5:heHE.IpponKaiAnavatin.name
ltx/en_us_goadedes/oc.m5.d4:ocMA.OdeW1C21.mode	@ltx/en_us_goadedes/miscellanea:misc.Mode5
ltx/en_us_goadedes/oc.m5.d4:ocMA.OdeW1C21.ode	@ltx/en_us_goadedes/miscellanea:misc.Ode1
ltx/en_us_goadedes/oc.m5.d4:ocMA.OdeW1C21.text	
ltx/en_us_goadedes/oc.m5.d4:ocMA.OdeW1C22.incipit	…
ltx/en_us_goadedes/oc.m5.d4:ocMA.OdeW1C22.melody	@ltx/en_us_goadedes/he.h.m5:heHE.IpponKaiAnavatin.name
ltx/en_us_goadedes/oc.m5.d4:ocMA.OdeW1C22.mode	@ltx/en_us_goadedes/miscellanea:misc.Mode5
ltx/en_us_goadedes/oc.m5.d4:ocMA.OdeW1C22.ode	@ltx/en_us_goadedes/miscellanea:misc.Ode1
ltx/en_us_goadedes/oc.m5.d4:ocMA.OdeW1C22.text	
ltx/en_us_goadedes/oc.m5.d4:ocMA.OdeW1C23.incipit	…
ltx/en_us_goadedes/oc.m5.d4:ocMA.OdeW1C23.melody	@ltx/en_us_goadedes/he.h.m5:heHE.IpponKaiAnavatin.name
ltx/en_us_goadedes/oc.m5.d4:ocMA.OdeW1C23.mode	@ltx/en_us_goadedes/miscellanea:misc.Mode5
ltx/en_us_goadedes/oc.m5.d4:ocMA.OdeW1C23.ode	@ltx/en_us_goadedes/miscellanea:misc.Ode1
ltx/en_us_goadedes/oc.m5.d4:ocMA.OdeW1C23.text	
ltx/en_us_goadedes/oc.m5.d4:ocMA.OdeW1C24.incipit	…
ltx/en_us_goadedes/oc.m5.d4:ocMA.OdeW1C24.melody	@ltx/en_us_goadedes/he.h.m5:heHE.IpponKaiAnavatin.name
ltx/en_us_goadedes/oc.m5.d4:ocMA.OdeW1C24.mode	@ltx/en_us_goadedes/miscellanea:misc.Mode5
ltx/en_us_goadedes/oc.m5.d4:ocMA.OdeW1C24.ode	@ltx/en_us_goadedes/miscellanea:misc.Ode1
ltx/en_us_goadedes/oc.m5.d4:ocMA.OdeW1C24.text	
ltx/en_us_goadedes/oc.m5.d4:ocMA.OdeW3C11.incipit	…
ltx/en_us_goadedes/oc.m5.d4:ocMA.OdeW3C11.melody	@ltx/en_us_goadedes/he.h.m5:heHE.OPixasEpOudenos.name
ltx/en_us_goadedes/oc.m5.d4:ocMA.OdeW3C11.mode	@ltx/en_us_goadedes/miscellanea:misc.Mode5
ltx/en_us_goadedes/oc.m5.d4:ocMA.OdeW3C11.ode	@ltx/en_us_goadedes/miscellanea:misc.Ode3
ltx/en_us_goadedes/oc.m5.d4:ocMA.OdeW3C11.text	
ltx/en_us_goadedes/oc.m5.d4:ocMA.OdeW3C12.incipit	…
ltx/en_us_goadedes/oc.m5.d4:ocMA.OdeW3C12.melody	@ltx/en_us_goadedes/he.h.m5:heHE.OPixasEpOudenos.name
ltx/en_us_goadedes/oc.m5.d4:ocMA.OdeW3C12.mode	@ltx/en_us_goadedes/miscellanea:misc.Mode5
ltx/en_us_goadedes/oc.m5.d4:ocMA.OdeW3C12.ode	@ltx/en_us_goadedes/miscellanea:misc.Ode3
ltx/en_us_goadedes/oc.m5.d4:ocMA.OdeW3C12.text	
ltx/en_us_goadedes/oc.m5.d4:ocMA.OdeW3C13.incipit	…
ltx/en_us_goadedes/oc.m5.d4:ocMA.OdeW3C13.melody	@ltx/en_us_goadedes/he.h.m5:heHE.OPixasEpOudenos.name
ltx/en_us_goadedes/oc.m5.d4:ocMA.OdeW3C13.mode	@ltx/en_us_goadedes/miscellanea:misc.Mode5
ltx/en_us_goadedes/oc.m5.d4:ocMA.OdeW3C13.ode	@ltx/en_us_goadedes/miscellanea:misc.Ode3
ltx/en_us_goadedes/oc.m5.d4:ocMA.OdeW3C13.text	
ltx/en_us_goadedes/oc.m5.d4:ocMA.OdeW3C14.incipit	…
ltx/en_us_goadedes/oc.m5.d4:ocMA.OdeW3C14.melody	@ltx/en_us_goadedes/he.h.m5:heHE.OPixasEpOudenos.name
ltx/en_us_goadedes/oc.m5.d4:ocMA.OdeW3C14.mode	@ltx/en_us_goadedes/miscellanea:misc.Mode5
ltx/en_us_goadedes/oc.m5.d4:ocMA.OdeW3C14.ode	@ltx/en_us_goadedes/miscellanea:misc.Ode3
ltx/en_us_goadedes/oc.m5.d4:ocMA.OdeW3C14.text	
ltx/en_us_goadedes/oc.m5.d4:ocMA.OdeW3C1H.greekmelody	@ltx/en_us_goadedes/he.h.m5:heHE.OPixasEpOudenos.greekname
ltx/en_us_goadedes/oc.m5.d4:ocMA.OdeW3C1H.incipit	@ltx/en_us_goadedes/he.h.m5:heHE.OPixasEpOudenos.incipit
ltx/en_us_goadedes/oc.m5.d4:ocMA.OdeW3C1H.melody	@ltx/en_us_goadedes/he.h.m5:heHE.OPixasEpOudenos.melody
ltx/en_us_goadedes/oc.m5.d4:ocMA.OdeW3C1H.mode	@ltx/en_us_goadedes/miscellanea:misc.Mode5
ltx/en_us_goadedes/oc.m5.d4:ocMA.OdeW3C1H.ode	@ltx/en_us_goadedes/miscellanea:misc.Ode3
ltx/en_us_goadedes/oc.m5.d4:ocMA.OdeW3C1H.text	@ltx/en_us_goadedes/he.h.m5:heHE.OPixasEpOudenos.text
ltx/en_us_goadedes/oc.m5.d4:ocMA.OdeW3C1T.incipit	…
ltx/en_us_goadedes/oc.m5.d4:ocMA.OdeW3C1T.melody	@ltx/en_us_goadedes/he.h.m5:heHE.OPixasEpOudenos.name
ltx/en_us_goadedes/oc.m5.d4:ocMA.OdeW3C1T.mode	@ltx/en_us_goadedes/miscellanea:misc.Mode5
ltx/en_us_goadedes/oc.m5.d4:ocMA.OdeW3C1T.ode	@ltx/en_us_goadedes/miscellanea:misc.Ode3
ltx/en_us_goadedes/oc.m5.d4:ocMA.OdeW3C1T.text	
ltx/en_us_goadedes/oc.m5.d4:ocMA.OdeW3C21.greekmelody	@ltx/en_us_goadedes/he.h.m5:heHE.OPixasEpOudenos.greekname
ltx/en_us_goadedes/oc.m5.d4:ocMA.OdeW3C21.incipit	…
ltx/en_us_goadedes/oc.m5.d4:ocMA.OdeW3C21.melody	@ltx/en_us_goadedes/he.h.m5:heHE.OPixasEpOudenos.name
ltx/en_us_goadedes/oc.m5.d4:ocMA.OdeW3C21.mode	@ltx/en_us_goadedes/miscellanea:misc.Mode5
ltx/en_us_goadedes/oc.m5.d4:ocMA.OdeW3C21.ode	@ltx/en_us_goadedes/miscellanea:misc.Ode3
ltx/en_us_goadedes/oc.m5.d4:ocMA.OdeW3C21.text	
ltx/en_us_goadedes/oc.m5.d4:ocMA.OdeW3C22.incipit	…
ltx/en_us_goadedes/oc.m5.d4:ocMA.OdeW3C22.melody	@ltx/en_us_goadedes/he.h.m5:heHE.OPixasEpOudenos.name
ltx/en_us_goadedes/oc.m5.d4:ocMA.OdeW3C22.mode	@ltx/en_us_goadedes/miscellanea:misc.Mode5
ltx/en_us_goadedes/oc.m5.d4:ocMA.OdeW3C22.ode	@ltx/en_us_goadedes/miscellanea:misc.Ode3
ltx/en_us_goadedes/oc.m5.d4:ocMA.OdeW3C22.text	
ltx/en_us_goadedes/oc.m5.d4:ocMA.OdeW3C23.incipit	…
ltx/en_us_goadedes/oc.m5.d4:ocMA.OdeW3C23.melody	@ltx/en_us_goadedes/he.h.m5:heHE.OPixasEpOudenos.name
ltx/en_us_goadedes/oc.m5.d4:ocMA.OdeW3C23.mode	@ltx/en_us_goadedes/miscellanea:misc.Mode5
ltx/en_us_goadedes/oc.m5.d4:ocMA.OdeW3C23.ode	@ltx/en_us_goadedes/miscellanea:misc.Ode3
ltx/en_us_goadedes/oc.m5.d4:ocMA.OdeW3C23.text	
ltx/en_us_goadedes/oc.m5.d4:ocMA.OdeW3C24.incipit	…
ltx/en_us_goadedes/oc.m5.d4:ocMA.OdeW3C24.melody	@ltx/en_us_goadedes/he.h.m5:heHE.OPixasEpOudenos.name
ltx/en_us_goadedes/oc.m5.d4:ocMA.OdeW3C24.mode	@ltx/en_us_goadedes/miscellanea:misc.Mode5
ltx/en_us_goadedes/oc.m5.d4:ocMA.OdeW3C24.ode	@ltx/en_us_goadedes/miscellanea:misc.Ode3
ltx/en_us_goadedes/oc.m5.d4:ocMA.OdeW3C24.text	
ltx/en_us_goadedes/oc.m5.d4:ocMA.OdeW4C11.incipit	…
ltx/en_us_goadedes/oc.m5.d4:ocMA.OdeW4C11.melody	@ltx/en_us_goadedes/he.h.m5:heHE.TinTheianEnnoisas.name
ltx/en_us_goadedes/oc.m5.d4:ocMA.OdeW4C11.mode	@ltx/en_us_goadedes/miscellanea:misc.Mode5
ltx/en_us_goadedes/oc.m5.d4:ocMA.OdeW4C11.ode	@ltx/en_us_goadedes/miscellanea:misc.Ode4
ltx/en_us_goadedes/oc.m5.d4:ocMA.OdeW4C11.text	
ltx/en_us_goadedes/oc.m5.d4:ocMA.OdeW4C12.incipit	…
ltx/en_us_goadedes/oc.m5.d4:ocMA.OdeW4C12.melody	@ltx/en_us_goadedes/he.h.m5:heHE.TinTheianEnnoisas.name
ltx/en_us_goadedes/oc.m5.d4:ocMA.OdeW4C12.mode	@ltx/en_us_goadedes/miscellanea:misc.Mode5
ltx/en_us_goadedes/oc.m5.d4:ocMA.OdeW4C12.ode	@ltx/en_us_goadedes/miscellanea:misc.Ode4
ltx/en_us_goadedes/oc.m5.d4:ocMA.OdeW4C12.text	
ltx/en_us_goadedes/oc.m5.d4:ocMA.OdeW4C13.incipit	…
ltx/en_us_goadedes/oc.m5.d4:ocMA.OdeW4C13.melody	@ltx/en_us_goadedes/he.h.m5:heHE.TinTheianEnnoisas.name
ltx/en_us_goadedes/oc.m5.d4:ocMA.OdeW4C13.mode	@ltx/en_us_goadedes/miscellanea:misc.Mode5
ltx/en_us_goadedes/oc.m5.d4:ocMA.OdeW4C13.ode	@ltx/en_us_goadedes/miscellanea:misc.Ode4
ltx/en_us_goadedes/oc.m5.d4:ocMA.OdeW4C13.text	
ltx/en_us_goadedes/oc.m5.d4:ocMA.OdeW4C14.incipit	…
ltx/en_us_goadedes/oc.m5.d4:ocMA.OdeW4C14.melody	@ltx/en_us_goadedes/he.h.m5:heHE.TinTheianEnnoisas.name
ltx/en_us_goadedes/oc.m5.d4:ocMA.OdeW4C14.mode	@ltx/en_us_goadedes/miscellanea:misc.Mode5
ltx/en_us_goadedes/oc.m5.d4:ocMA.OdeW4C14.ode	@ltx/en_us_goadedes/miscellanea:misc.Ode4
ltx/en_us_goadedes/oc.m5.d4:ocMA.OdeW4C14.text	
ltx/en_us_goadedes/oc.m5.d4:ocMA.OdeW4C1H.greekmelody	@ltx/en_us_goadedes/he.h.m5:heHE.TinTheianEnnoisas.greekname
ltx/en_us_goadedes/oc.m5.d4:ocMA.OdeW4C1H.incipit	@ltx/en_us_goadedes/he.h.m5:heHE.TinTheianEnnoisas.incipit
ltx/en_us_goadedes/oc.m5.d4:ocMA.OdeW4C1H.melody	@ltx/en_us_goadedes/he.h.m5:heHE.TinTheianEnnoisas.melody
ltx/en_us_goadedes/oc.m5.d4:ocMA.OdeW4C1H.mode	@ltx/en_us_goadedes/miscellanea:misc.Mode5
ltx/en_us_goadedes/oc.m5.d4:ocMA.OdeW4C1H.ode	@ltx/en_us_goadedes/miscellanea:misc.Ode4
ltx/en_us_goadedes/oc.m5.d4:ocMA.OdeW4C1H.text	@ltx/en_us_goadedes/he.h.m5:heHE.TinTheianEnnoisas.text
ltx/en_us_goadedes/oc.m5.d4:ocMA.OdeW4C1T.incipit	…
ltx/en_us_goadedes/oc.m5.d4:ocMA.OdeW4C1T.melody	@ltx/en_us_goadedes/he.h.m5:heHE.TinTheianEnnoisas.name
ltx/en_us_goadedes/oc.m5.d4:ocMA.OdeW4C1T.mode	@ltx/en_us_goadedes/miscellanea:misc.Mode5
ltx/en_us_goadedes/oc.m5.d4:ocMA.OdeW4C1T.ode	@ltx/en_us_goadedes/miscellanea:misc.Ode4
ltx/en_us_goadedes/oc.m5.d4:ocMA.OdeW4C1T.text	
ltx/en_us_goadedes/oc.m5.d4:ocMA.OdeW4C21.greekmelody	@ltx/en_us_goadedes/he.h.m5:heHE.TinTheianEnnoisas.greekname
ltx/en_us_goadedes/oc.m5.d4:ocMA.OdeW4C21.incipit	…
ltx/en_us_goadedes/oc.m5.d4:ocMA.OdeW4C21.melody	@ltx/en_us_goadedes/he.h.m5:heHE.TinTheianEnnoisas.name
ltx/en_us_goadedes/oc.m5.d4:ocMA.OdeW4C21.mode	@ltx/en_us_goadedes/miscellanea:misc.Mode5
ltx/en_us_goadedes/oc.m5.d4:ocMA.OdeW4C21.ode	@ltx/en_us_goadedes/miscellanea:misc.Ode4
ltx/en_us_goadedes/oc.m5.d4:ocMA.OdeW4C21.text	
ltx/en_us_goadedes/oc.m5.d4:ocMA.OdeW4C22.incipit	…
ltx/en_us_goadedes/oc.m5.d4:ocMA.OdeW4C22.melody	@ltx/en_us_goadedes/he.h.m5:heHE.TinTheianEnnoisas.name
ltx/en_us_goadedes/oc.m5.d4:ocMA.OdeW4C22.mode	@ltx/en_us_goadedes/miscellanea:misc.Mode5
ltx/en_us_goadedes/oc.m5.d4:ocMA.OdeW4C22.ode	@ltx/en_us_goadedes/miscellanea:misc.Ode4
ltx/en_us_goadedes/oc.m5.d4:ocMA.OdeW4C22.text	
ltx/en_us_goadedes/oc.m5.d4:ocMA.OdeW4C23.incipit	…
ltx/en_us_goadedes/oc.m5.d4:ocMA.OdeW4C23.melody	@ltx/en_us_goadedes/he.h.m5:heHE.TinTheianEnnoisas.name
ltx/en_us_goadedes/oc.m5.d4:ocMA.OdeW4C23.mode	@ltx/en_us_goadedes/miscellanea:misc.Mode5
ltx/en_us_goadedes/oc.m5.d4:ocMA.OdeW4C23.ode	@ltx/en_us_goadedes/miscellanea:misc.Ode4
ltx/en_us_goadedes/oc.m5.d4:ocMA.OdeW4C23.text	
ltx/en_us_goadedes/oc.m5.d4:ocMA.OdeW4C24.incipit	…
ltx/en_us_goadedes/oc.m5.d4:ocMA.OdeW4C24.melody	@ltx/en_us_goadedes/he.h.m5:heHE.TinTheianEnnoisas.name
ltx/en_us_goadedes/oc.m5.d4:ocMA.OdeW4C24.mode	@ltx/en_us_goadedes/miscellanea:misc.Mode5
ltx/en_us_goadedes/oc.m5.d4:ocMA.OdeW4C24.ode	@ltx/en_us_goadedes/miscellanea:misc.Ode4
ltx/en_us_goadedes/oc.m5.d4:ocMA.OdeW4C24.text	
ltx/en_us_goadedes/oc.m5.d4:ocMA.OdeW5C11.incipit	…
ltx/en_us_goadedes/oc.m5.d4:ocMA.OdeW5C11.melody	@ltx/en_us_goadedes/he.h.m5:heHE.OAnavallomenos.name
ltx/en_us_goadedes/oc.m5.d4:ocMA.OdeW5C11.mode	@ltx/en_us_goadedes/miscellanea:misc.Mode5
ltx/en_us_goadedes/oc.m5.d4:ocMA.OdeW5C11.ode	@ltx/en_us_goadedes/miscellanea:misc.Ode5
ltx/en_us_goadedes/oc.m5.d4:ocMA.OdeW5C11.text	
ltx/en_us_goadedes/oc.m5.d4:ocMA.OdeW5C12.incipit	…
ltx/en_us_goadedes/oc.m5.d4:ocMA.OdeW5C12.melody	@ltx/en_us_goadedes/he.h.m5:heHE.OAnavallomenos.name
ltx/en_us_goadedes/oc.m5.d4:ocMA.OdeW5C12.mode	@ltx/en_us_goadedes/miscellanea:misc.Mode5
ltx/en_us_goadedes/oc.m5.d4:ocMA.OdeW5C12.ode	@ltx/en_us_goadedes/miscellanea:misc.Ode5
ltx/en_us_goadedes/oc.m5.d4:ocMA.OdeW5C12.text	
ltx/en_us_goadedes/oc.m5.d4:ocMA.OdeW5C13.incipit	…
ltx/en_us_goadedes/oc.m5.d4:ocMA.OdeW5C13.melody	@ltx/en_us_goadedes/he.h.m5:heHE.OAnavallomenos.name
ltx/en_us_goadedes/oc.m5.d4:ocMA.OdeW5C13.mode	@ltx/en_us_goadedes/miscellanea:misc.Mode5
ltx/en_us_goadedes/oc.m5.d4:ocMA.OdeW5C13.ode	@ltx/en_us_goadedes/miscellanea:misc.Ode5
ltx/en_us_goadedes/oc.m5.d4:ocMA.OdeW5C13.text	
ltx/en_us_goadedes/oc.m5.d4:ocMA.OdeW5C14.incipit	…
ltx/en_us_goadedes/oc.m5.d4:ocMA.OdeW5C14.melody	@ltx/en_us_goadedes/he.h.m5:heHE.OAnavallomenos.name
ltx/en_us_goadedes/oc.m5.d4:ocMA.OdeW5C14.mode	@ltx/en_us_goadedes/miscellanea:misc.Mode5
ltx/en_us_goadedes/oc.m5.d4:ocMA.OdeW5C14.ode	@ltx/en_us_goadedes/miscellanea:misc.Ode5
ltx/en_us_goadedes/oc.m5.d4:ocMA.OdeW5C14.text	
ltx/en_us_goadedes/oc.m5.d4:ocMA.OdeW5C1H.greekmelody	@ltx/en_us_goadedes/he.h.m5:heHE.OAnavallomenos.greekname
ltx/en_us_goadedes/oc.m5.d4:ocMA.OdeW5C1H.incipit	@ltx/en_us_goadedes/he.h.m5:heHE.OAnavallomenos.incipit
ltx/en_us_goadedes/oc.m5.d4:ocMA.OdeW5C1H.melody	@ltx/en_us_goadedes/he.h.m5:heHE.OAnavallomenos.melody
ltx/en_us_goadedes/oc.m5.d4:ocMA.OdeW5C1H.mode	@ltx/en_us_goadedes/miscellanea:misc.Mode5
ltx/en_us_goadedes/oc.m5.d4:ocMA.OdeW5C1H.ode	@ltx/en_us_goadedes/miscellanea:misc.Ode5
ltx/en_us_goadedes/oc.m5.d4:ocMA.OdeW5C1H.text	@ltx/en_us_goadedes/he.h.m5:heHE.OAnavallomenos.text
ltx/en_us_goadedes/oc.m5.d4:ocMA.OdeW5C1T.incipit	…
ltx/en_us_goadedes/oc.m5.d4:ocMA.OdeW5C1T.melody	@ltx/en_us_goadedes/he.h.m5:heHE.OAnavallomenos.name
ltx/en_us_goadedes/oc.m5.d4:ocMA.OdeW5C1T.mode	@ltx/en_us_goadedes/miscellanea:misc.Mode5
ltx/en_us_goadedes/oc.m5.d4:ocMA.OdeW5C1T.ode	@ltx/en_us_goadedes/miscellanea:misc.Ode5
ltx/en_us_goadedes/oc.m5.d4:ocMA.OdeW5C1T.text	
ltx/en_us_goadedes/oc.m5.d4:ocMA.OdeW5C21.greekmelody	@ltx/en_us_goadedes/he.h.m5:heHE.OAnavallomenos.greekname
ltx/en_us_goadedes/oc.m5.d4:ocMA.OdeW5C21.incipit	…
ltx/en_us_goadedes/oc.m5.d4:ocMA.OdeW5C21.melody	@ltx/en_us_goadedes/he.h.m5:heHE.OAnavallomenos.name
ltx/en_us_goadedes/oc.m5.d4:ocMA.OdeW5C21.mode	@ltx/en_us_goadedes/miscellanea:misc.Mode5
ltx/en_us_goadedes/oc.m5.d4:ocMA.OdeW5C21.ode	@ltx/en_us_goadedes/miscellanea:misc.Ode5
ltx/en_us_goadedes/oc.m5.d4:ocMA.OdeW5C21.text	
ltx/en_us_goadedes/oc.m5.d4:ocMA.OdeW5C22.incipit	…
ltx/en_us_goadedes/oc.m5.d4:ocMA.OdeW5C22.melody	@ltx/en_us_goadedes/he.h.m5:heHE.OAnavallomenos.name
ltx/en_us_goadedes/oc.m5.d4:ocMA.OdeW5C22.mode	@ltx/en_us_goadedes/miscellanea:misc.Mode5
ltx/en_us_goadedes/oc.m5.d4:ocMA.OdeW5C22.ode	@ltx/en_us_goadedes/miscellanea:misc.Ode5
ltx/en_us_goadedes/oc.m5.d4:ocMA.OdeW5C22.text	
ltx/en_us_goadedes/oc.m5.d4:ocMA.OdeW5C23.incipit	…
ltx/en_us_goadedes/oc.m5.d4:ocMA.OdeW5C23.melody	@ltx/en_us_goadedes/he.h.m5:heHE.OAnavallomenos.name
ltx/en_us_goadedes/oc.m5.d4:ocMA.OdeW5C23.mode	@ltx/en_us_goadedes/miscellanea:misc.Mode5
ltx/en_us_goadedes/oc.m5.d4:ocMA.OdeW5C23.ode	@ltx/en_us_goadedes/miscellanea:misc.Ode5
ltx/en_us_goadedes/oc.m5.d4:ocMA.OdeW5C23.text	
ltx/en_us_goadedes/oc.m5.d4:ocMA.OdeW5C24.incipit	…
ltx/en_us_goadedes/oc.m5.d4:ocMA.OdeW5C24.melody	@ltx/en_us_goadedes/he.h.m5:heHE.OAnavallomenos.name
ltx/en_us_goadedes/oc.m5.d4:ocMA.OdeW5C24.mode	@ltx/en_us_goadedes/miscellanea:misc.Mode5
ltx/en_us_goadedes/oc.m5.d4:ocMA.OdeW5C24.ode	@ltx/en_us_goadedes/miscellanea:misc.Ode5
ltx/en_us_goadedes/oc.m5.d4:ocMA.OdeW5C24.text	
ltx/en_us_goadedes/oc.m5.d4:ocMA.OdeW6C11.incipit	…
ltx/en_us_goadedes/oc.m5.d4:ocMA.OdeW6C11.melody	@ltx/en_us_goadedes/he.h.m5:heHE.MainomeninKlydoni.name
ltx/en_us_goadedes/oc.m5.d4:ocMA.OdeW6C11.mode	@ltx/en_us_goadedes/miscellanea:misc.Mode5
ltx/en_us_goadedes/oc.m5.d4:ocMA.OdeW6C11.ode	@ltx/en_us_goadedes/miscellanea:misc.Ode6
ltx/en_us_goadedes/oc.m5.d4:ocMA.OdeW6C11.text	
ltx/en_us_goadedes/oc.m5.d4:ocMA.OdeW6C12.incipit	…
ltx/en_us_goadedes/oc.m5.d4:ocMA.OdeW6C12.melody	@ltx/en_us_goadedes/he.h.m5:heHE.MainomeninKlydoni.name
ltx/en_us_goadedes/oc.m5.d4:ocMA.OdeW6C12.mode	@ltx/en_us_goadedes/miscellanea:misc.Mode5
ltx/en_us_goadedes/oc.m5.d4:ocMA.OdeW6C12.ode	@ltx/en_us_goadedes/miscellanea:misc.Ode6
ltx/en_us_goadedes/oc.m5.d4:ocMA.OdeW6C12.text	
ltx/en_us_goadedes/oc.m5.d4:ocMA.OdeW6C13.incipit	…
ltx/en_us_goadedes/oc.m5.d4:ocMA.OdeW6C13.melody	@ltx/en_us_goadedes/he.h.m5:heHE.MainomeninKlydoni.name
ltx/en_us_goadedes/oc.m5.d4:ocMA.OdeW6C13.mode	@ltx/en_us_goadedes/miscellanea:misc.Mode5
ltx/en_us_goadedes/oc.m5.d4:ocMA.OdeW6C13.ode	@ltx/en_us_goadedes/miscellanea:misc.Ode6
ltx/en_us_goadedes/oc.m5.d4:ocMA.OdeW6C13.text	
ltx/en_us_goadedes/oc.m5.d4:ocMA.OdeW6C1H.greekmelody	@ltx/en_us_goadedes/he.h.m5:heHE.MainomeninKlydoni.greekname
ltx/en_us_goadedes/oc.m5.d4:ocMA.OdeW6C1H.incipit	@ltx/en_us_goadedes/he.h.m5:heHE.MainomeninKlydoni.incipit
ltx/en_us_goadedes/oc.m5.d4:ocMA.OdeW6C1H.melody	@ltx/en_us_goadedes/he.h.m5:heHE.MainomeninKlydoni.melody
ltx/en_us_goadedes/oc.m5.d4:ocMA.OdeW6C1H.mode	@ltx/en_us_goadedes/miscellanea:misc.Mode5
ltx/en_us_goadedes/oc.m5.d4:ocMA.OdeW6C1H.ode	@ltx/en_us_goadedes/miscellanea:misc.Ode6
ltx/en_us_goadedes/oc.m5.d4:ocMA.OdeW6C1H.text	@ltx/en_us_goadedes/he.h.m5:heHE.MainomeninKlydoni.text
ltx/en_us_goadedes/oc.m5.d4:ocMA.OdeW6C1T.incipit	…
ltx/en_us_goadedes/oc.m5.d4:ocMA.OdeW6C1T.melody	@ltx/en_us_goadedes/he.h.m5:heHE.MainomeninKlydoni.name
ltx/en_us_goadedes/oc.m5.d4:ocMA.OdeW6C1T.mode	@ltx/en_us_goadedes/miscellanea:misc.Mode5
ltx/en_us_goadedes/oc.m5.d4:ocMA.OdeW6C1T.ode	@ltx/en_us_goadedes/miscellanea:misc.Ode6
ltx/en_us_goadedes/oc.m5.d4:ocMA.OdeW6C1T.text	
ltx/en_us_goadedes/oc.m5.d4:ocMA.OdeW6C21.greekmelody	@ltx/en_us_goadedes/he.h.m5:heHE.MainomeninKlydoni.greekname
ltx/en_us_goadedes/oc.m5.d4:ocMA.OdeW6C21.incipit	…
ltx/en_us_goadedes/oc.m5.d4:ocMA.OdeW6C21.melody	@ltx/en_us_goadedes/he.h.m5:heHE.MainomeninKlydoni.name
ltx/en_us_goadedes/oc.m5.d4:ocMA.OdeW6C21.mode	@ltx/en_us_goadedes/miscellanea:misc.Mode5
ltx/en_us_goadedes/oc.m5.d4:ocMA.OdeW6C21.ode	@ltx/en_us_goadedes/miscellanea:misc.Ode6
ltx/en_us_goadedes/oc.m5.d4:ocMA.OdeW6C21.text	
ltx/en_us_goadedes/oc.m5.d4:ocMA.OdeW6C22.incipit	…
ltx/en_us_goadedes/oc.m5.d4:ocMA.OdeW6C22.melody	@ltx/en_us_goadedes/he.h.m5:heHE.MainomeninKlydoni.name
ltx/en_us_goadedes/oc.m5.d4:ocMA.OdeW6C22.mode	@ltx/en_us_goadedes/miscellanea:misc.Mode5
ltx/en_us_goadedes/oc.m5.d4:ocMA.OdeW6C22.ode	@ltx/en_us_goadedes/miscellanea:misc.Ode6
ltx/en_us_goadedes/oc.m5.d4:ocMA.OdeW6C22.text	
ltx/en_us_goadedes/oc.m5.d4:ocMA.OdeW6C23.incipit	…
ltx/en_us_goadedes/oc.m5.d4:ocMA.OdeW6C23.melody	@ltx/en_us_goadedes/he.h.m5:heHE.MainomeninKlydoni.name
ltx/en_us_goadedes/oc.m5.d4:ocMA.OdeW6C23.mode	@ltx/en_us_goadedes/miscellanea:misc.Mode5
ltx/en_us_goadedes/oc.m5.d4:ocMA.OdeW6C23.ode	@ltx/en_us_goadedes/miscellanea:misc.Ode6
ltx/en_us_goadedes/oc.m5.d4:ocMA.OdeW6C23.text	
ltx/en_us_goadedes/oc.m5.d4:ocMA.OdeW7C11.incipit	…
ltx/en_us_goadedes/oc.m5.d4:ocMA.OdeW7C11.melody	@ltx/en_us_goadedes/he.h.m5:heHE.OYperypsoumenos.name
ltx/en_us_goadedes/oc.m5.d4:ocMA.OdeW7C11.mode	@ltx/en_us_goadedes/miscellanea:misc.Mode5
ltx/en_us_goadedes/oc.m5.d4:ocMA.OdeW7C11.ode	@ltx/en_us_goadedes/miscellanea:misc.Ode7
ltx/en_us_goadedes/oc.m5.d4:ocMA.OdeW7C11.text	
ltx/en_us_goadedes/oc.m5.d4:ocMA.OdeW7C12.incipit	…
ltx/en_us_goadedes/oc.m5.d4:ocMA.OdeW7C12.melody	@ltx/en_us_goadedes/he.h.m5:heHE.OYperypsoumenos.name
ltx/en_us_goadedes/oc.m5.d4:ocMA.OdeW7C12.mode	@ltx/en_us_goadedes/miscellanea:misc.Mode5
ltx/en_us_goadedes/oc.m5.d4:ocMA.OdeW7C12.ode	@ltx/en_us_goadedes/miscellanea:misc.Ode7
ltx/en_us_goadedes/oc.m5.d4:ocMA.OdeW7C12.text	
ltx/en_us_goadedes/oc.m5.d4:ocMA.OdeW7C13.incipit	…
ltx/en_us_goadedes/oc.m5.d4:ocMA.OdeW7C13.melody	@ltx/en_us_goadedes/he.h.m5:heHE.OYperypsoumenos.name
ltx/en_us_goadedes/oc.m5.d4:ocMA.OdeW7C13.mode	@ltx/en_us_goadedes/miscellanea:misc.Mode5
ltx/en_us_goadedes/oc.m5.d4:ocMA.OdeW7C13.ode	@ltx/en_us_goadedes/miscellanea:misc.Ode7
ltx/en_us_goadedes/oc.m5.d4:ocMA.OdeW7C13.text	
ltx/en_us_goadedes/oc.m5.d4:ocMA.OdeW7C14.incipit	…
ltx/en_us_goadedes/oc.m5.d4:ocMA.OdeW7C14.melody	@ltx/en_us_goadedes/he.h.m5:heHE.OYperypsoumenos.name
ltx/en_us_goadedes/oc.m5.d4:ocMA.OdeW7C14.mode	@ltx/en_us_goadedes/miscellanea:misc.Mode5
ltx/en_us_goadedes/oc.m5.d4:ocMA.OdeW7C14.ode	@ltx/en_us_goadedes/miscellanea:misc.Ode7
ltx/en_us_goadedes/oc.m5.d4:ocMA.OdeW7C14.text	
ltx/en_us_goadedes/oc.m5.d4:ocMA.OdeW7C1H.greekmelody	@ltx/en_us_goadedes/he.h.m5:heHE.OYperypsoumenos.greekname
ltx/en_us_goadedes/oc.m5.d4:ocMA.OdeW7C1H.incipit	@ltx/en_us_goadedes/he.h.m5:heHE.OYperypsoumenos.incipit
ltx/en_us_goadedes/oc.m5.d4:ocMA.OdeW7C1H.melody	@ltx/en_us_goadedes/he.h.m5:heHE.OYperypsoumenos.melody
ltx/en_us_goadedes/oc.m5.d4:ocMA.OdeW7C1H.mode	@ltx/en_us_goadedes/miscellanea:misc.Mode5
ltx/en_us_goadedes/oc.m5.d4:ocMA.OdeW7C1H.ode	@ltx/en_us_goadedes/miscellanea:misc.Ode7
ltx/en_us_goadedes/oc.m5.d4:ocMA.OdeW7C1H.text	@ltx/en_us_goadedes/he.h.m5:heHE.OYperypsoumenos.text
ltx/en_us_goadedes/oc.m5.d4:ocMA.OdeW7C1T.incipit	…
ltx/en_us_goadedes/oc.m5.d4:ocMA.OdeW7C1T.melody	@ltx/en_us_goadedes/he.h.m5:heHE.OYperypsoumenos.name
ltx/en_us_goadedes/oc.m5.d4:ocMA.OdeW7C1T.mode	@ltx/en_us_goadedes/miscellanea:misc.Mode5
ltx/en_us_goadedes/oc.m5.d4:ocMA.OdeW7C1T.ode	@ltx/en_us_goadedes/miscellanea:misc.Ode7
ltx/en_us_goadedes/oc.m5.d4:ocMA.OdeW7C1T.text	
ltx/en_us_goadedes/oc.m5.d4:ocMA.OdeW7C21.greekmelody	@ltx/en_us_goadedes/he.h.m5:heHE.OYperypsoumenos.greekname
ltx/en_us_goadedes/oc.m5.d4:ocMA.OdeW7C21.incipit	…
ltx/en_us_goadedes/oc.m5.d4:ocMA.OdeW7C21.melody	@ltx/en_us_goadedes/he.h.m5:heHE.OYperypsoumenos.name
ltx/en_us_goadedes/oc.m5.d4:ocMA.OdeW7C21.mode	@ltx/en_us_goadedes/miscellanea:misc.Mode5
ltx/en_us_goadedes/oc.m5.d4:ocMA.OdeW7C21.ode	@ltx/en_us_goadedes/miscellanea:misc.Ode7
ltx/en_us_goadedes/oc.m5.d4:ocMA.OdeW7C21.text	
ltx/en_us_goadedes/oc.m5.d4:ocMA.OdeW7C22.incipit	…
ltx/en_us_goadedes/oc.m5.d4:ocMA.OdeW7C22.melody	@ltx/en_us_goadedes/he.h.m5:heHE.OYperypsoumenos.name
ltx/en_us_goadedes/oc.m5.d4:ocMA.OdeW7C22.mode	@ltx/en_us_goadedes/miscellanea:misc.Mode5
ltx/en_us_goadedes/oc.m5.d4:ocMA.OdeW7C22.ode	@ltx/en_us_goadedes/miscellanea:misc.Ode7
ltx/en_us_goadedes/oc.m5.d4:ocMA.OdeW7C22.text	
ltx/en_us_goadedes/oc.m5.d4:ocMA.OdeW7C23.incipit	…
ltx/en_us_goadedes/oc.m5.d4:ocMA.OdeW7C23.melody	@ltx/en_us_goadedes/he.h.m5:heHE.OYperypsoumenos.name
ltx/en_us_goadedes/oc.m5.d4:ocMA.OdeW7C23.mode	@ltx/en_us_goadedes/miscellanea:misc.Mode5
ltx/en_us_goadedes/oc.m5.d4:ocMA.OdeW7C23.ode	@ltx/en_us_goadedes/miscellanea:misc.Ode7
ltx/en_us_goadedes/oc.m5.d4:ocMA.OdeW7C23.text	
ltx/en_us_goadedes/oc.m5.d4:ocMA.OdeW8C11.incipit	…
ltx/en_us_goadedes/oc.m5.d4:ocMA.OdeW8C11.melody	@ltx/en_us_goadedes/he.h.m5:heHE.SoiToPantourgo.name
ltx/en_us_goadedes/oc.m5.d4:ocMA.OdeW8C11.mode	@ltx/en_us_goadedes/miscellanea:misc.Mode5
ltx/en_us_goadedes/oc.m5.d4:ocMA.OdeW8C11.ode	@ltx/en_us_goadedes/miscellanea:misc.Ode8
ltx/en_us_goadedes/oc.m5.d4:ocMA.OdeW8C11.text	
ltx/en_us_goadedes/oc.m5.d4:ocMA.OdeW8C12.incipit	…
ltx/en_us_goadedes/oc.m5.d4:ocMA.OdeW8C12.melody	@ltx/en_us_goadedes/he.h.m5:heHE.SoiToPantourgo.name
ltx/en_us_goadedes/oc.m5.d4:ocMA.OdeW8C12.mode	@ltx/en_us_goadedes/miscellanea:misc.Mode5
ltx/en_us_goadedes/oc.m5.d4:ocMA.OdeW8C12.ode	@ltx/en_us_goadedes/miscellanea:misc.Ode8
ltx/en_us_goadedes/oc.m5.d4:ocMA.OdeW8C12.text	
ltx/en_us_goadedes/oc.m5.d4:ocMA.OdeW8C13.incipit	…
ltx/en_us_goadedes/oc.m5.d4:ocMA.OdeW8C13.melody	@ltx/en_us_goadedes/he.h.m5:heHE.SoiToPantourgo.name
ltx/en_us_goadedes/oc.m5.d4:ocMA.OdeW8C13.mode	@ltx/en_us_goadedes/miscellanea:misc.Mode5
ltx/en_us_goadedes/oc.m5.d4:ocMA.OdeW8C13.ode	@ltx/en_us_goadedes/miscellanea:misc.Ode8
ltx/en_us_goadedes/oc.m5.d4:ocMA.OdeW8C13.text	
ltx/en_us_goadedes/oc.m5.d4:ocMA.OdeW8C14.incipit	…
ltx/en_us_goadedes/oc.m5.d4:ocMA.OdeW8C14.melody	@ltx/en_us_goadedes/he.h.m5:heHE.SoiToPantourgo.name
ltx/en_us_goadedes/oc.m5.d4:ocMA.OdeW8C14.mode	@ltx/en_us_goadedes/miscellanea:misc.Mode5
ltx/en_us_goadedes/oc.m5.d4:ocMA.OdeW8C14.ode	@ltx/en_us_goadedes/miscellanea:misc.Ode8
ltx/en_us_goadedes/oc.m5.d4:ocMA.OdeW8C14.text	
ltx/en_us_goadedes/oc.m5.d4:ocMA.OdeW8C1H.greekmelody	@ltx/en_us_goadedes/he.h.m5:heHE.SoiToPantourgo.greekname
ltx/en_us_goadedes/oc.m5.d4:ocMA.OdeW8C1H.incipit	@ltx/en_us_goadedes/he.h.m5:heHE.SoiToPantourgo.incipit
ltx/en_us_goadedes/oc.m5.d4:ocMA.OdeW8C1H.melody	@ltx/en_us_goadedes/he.h.m5:heHE.SoiToPantourgo.melody
ltx/en_us_goadedes/oc.m5.d4:ocMA.OdeW8C1H.mode	@ltx/en_us_goadedes/miscellanea:misc.Mode5
ltx/en_us_goadedes/oc.m5.d4:ocMA.OdeW8C1H.ode	@ltx/en_us_goadedes/miscellanea:misc.Ode8
ltx/en_us_goadedes/oc.m5.d4:ocMA.OdeW8C1H.text	@ltx/en_us_goadedes/he.h.m5:heHE.SoiToPantourgo.text
ltx/en_us_goadedes/oc.m5.d4:ocMA.OdeW8C1T.incipit	…
ltx/en_us_goadedes/oc.m5.d4:ocMA.OdeW8C1T.melody	@ltx/en_us_goadedes/he.h.m5:heHE.SoiToPantourgo.name
ltx/en_us_goadedes/oc.m5.d4:ocMA.OdeW8C1T.mode	@ltx/en_us_goadedes/miscellanea:misc.Mode5
ltx/en_us_goadedes/oc.m5.d4:ocMA.OdeW8C1T.ode	@ltx/en_us_goadedes/miscellanea:misc.Ode8
ltx/en_us_goadedes/oc.m5.d4:ocMA.OdeW8C1T.text	
ltx/en_us_goadedes/oc.m5.d4:ocMA.OdeW8C21.greekmelody	@ltx/en_us_goadedes/he.h.m5:heHE.SoiToPantourgo.greekname
ltx/en_us_goadedes/oc.m5.d4:ocMA.OdeW8C21.incipit	…
ltx/en_us_goadedes/oc.m5.d4:ocMA.OdeW8C21.melody	@ltx/en_us_goadedes/he.h.m5:heHE.SoiToPantourgo.name
ltx/en_us_goadedes/oc.m5.d4:ocMA.OdeW8C21.mode	@ltx/en_us_goadedes/miscellanea:misc.Mode5
ltx/en_us_goadedes/oc.m5.d4:ocMA.OdeW8C21.ode	@ltx/en_us_goadedes/miscellanea:misc.Ode8
ltx/en_us_goadedes/oc.m5.d4:ocMA.OdeW8C21.text	
ltx/en_us_goadedes/oc.m5.d4:ocMA.OdeW8C22.incipit	…
ltx/en_us_goadedes/oc.m5.d4:ocMA.OdeW8C22.melody	@ltx/en_us_goadedes/he.h.m5:heHE.SoiToPantourgo.name
ltx/en_us_goadedes/oc.m5.d4:ocMA.OdeW8C22.mode	@ltx/en_us_goadedes/miscellanea:misc.Mode5
ltx/en_us_goadedes/oc.m5.d4:ocMA.OdeW8C22.ode	@ltx/en_us_goadedes/miscellanea:misc.Ode8
ltx/en_us_goadedes/oc.m5.d4:ocMA.OdeW8C22.text	
ltx/en_us_goadedes/oc.m5.d4:ocMA.OdeW8C23.incipit	…
ltx/en_us_goadedes/oc.m5.d4:ocMA.OdeW8C23.melody	@ltx/en_us_goadedes/he.h.m5:heHE.SoiToPantourgo.name
ltx/en_us_goadedes/oc.m5.d4:ocMA.OdeW8C23.mode	@ltx/en_us_goadedes/miscellanea:misc.Mode5
ltx/en_us_goadedes/oc.m5.d4:ocMA.OdeW8C23.ode	@ltx/en_us_goadedes/miscellanea:misc.Ode8
ltx/en_us_goadedes/oc.m5.d4:ocMA.OdeW8C23.text	
ltx/en_us_goadedes/oc.m5.d4:ocMA.OdeW8C24.incipit	…
ltx/en_us_goadedes/oc.m5.d4:ocMA.OdeW8C24.melody	@ltx/en_us_goadedes/he.h.m5:heHE.SoiToPantourgo.name
ltx/en_us_goadedes/oc.m5.d4:ocMA.OdeW8C24.mode	@ltx/en_us_goadedes/miscellanea:misc.Mode5
ltx/en_us_goadedes/oc.m5.d4:ocMA.OdeW8C24.ode	@ltx/en_us_goadedes/miscellanea:misc.Ode8
ltx/en_us_goadedes/oc.m5.d4:ocMA.OdeW8C24.text	
ltx/en_us_goadedes/oc.m5.d4:ocMA.OdeW9C11.incipit	…
ltx/en_us_goadedes/oc.m5.d4:ocMA.OdeW9C11.melody	@ltx/en_us_goadedes/he.h.m5:heHE.IsaiaChoreve.name
ltx/en_us_goadedes/oc.m5.d4:ocMA.OdeW9C11.mode	@ltx/en_us_goadedes/miscellanea:misc.Mode5
ltx/en_us_goadedes/oc.m5.d4:ocMA.OdeW9C11.ode	@ltx/en_us_goadedes/miscellanea:misc.Ode9
ltx/en_us_goadedes/oc.m5.d4:ocMA.OdeW9C11.text	
ltx/en_us_goadedes/oc.m5.d4:ocMA.OdeW9C12.incipit	…
ltx/en_us_goadedes/oc.m5.d4:ocMA.OdeW9C12.melody	@ltx/en_us_goadedes/he.h.m5:heHE.IsaiaChoreve.name
ltx/en_us_goadedes/oc.m5.d4:ocMA.OdeW9C12.mode	@ltx/en_us_goadedes/miscellanea:misc.Mode5
ltx/en_us_goadedes/oc.m5.d4:ocMA.OdeW9C12.ode	@ltx/en_us_goadedes/miscellanea:misc.Ode9
ltx/en_us_goadedes/oc.m5.d4:ocMA.OdeW9C12.text	
ltx/en_us_goadedes/oc.m5.d4:ocMA.OdeW9C13.incipit	…
ltx/en_us_goadedes/oc.m5.d4:ocMA.OdeW9C13.melody	@ltx/en_us_goadedes/he.h.m5:heHE.IsaiaChoreve.name
ltx/en_us_goadedes/oc.m5.d4:ocMA.OdeW9C13.mode	@ltx/en_us_goadedes/miscellanea:misc.Mode5
ltx/en_us_goadedes/oc.m5.d4:ocMA.OdeW9C13.ode	@ltx/en_us_goadedes/miscellanea:misc.Ode9
ltx/en_us_goadedes/oc.m5.d4:ocMA.OdeW9C13.text	
ltx/en_us_goadedes/oc.m5.d4:ocMA.OdeW9C14.incipit	…
ltx/en_us_goadedes/oc.m5.d4:ocMA.OdeW9C14.melody	@ltx/en_us_goadedes/he.h.m5:heHE.IsaiaChoreve.name
ltx/en_us_goadedes/oc.m5.d4:ocMA.OdeW9C14.mode	@ltx/en_us_goadedes/miscellanea:misc.Mode5
ltx/en_us_goadedes/oc.m5.d4:ocMA.OdeW9C14.ode	@ltx/en_us_goadedes/miscellanea:misc.Ode9
ltx/en_us_goadedes/oc.m5.d4:ocMA.OdeW9C14.text	
ltx/en_us_goadedes/oc.m5.d4:ocMA.OdeW9C1H.greekmelody	@ltx/en_us_goadedes/he.h.m5:heHE.IsaiaChoreve.greekname
ltx/en_us_goadedes/oc.m5.d4:ocMA.OdeW9C1H.incipit	@ltx/en_us_goadedes/he.h.m5:heHE.IsaiaChoreve.incipit
ltx/en_us_goadedes/oc.m5.d4:ocMA.OdeW9C1H.melody	@ltx/en_us_goadedes/he.h.m5:heHE.IsaiaChoreve.melody
ltx/en_us_goadedes/oc.m5.d4:ocMA.OdeW9C1H.mode	@ltx/en_us_goadedes/miscellanea:misc.Mode5
ltx/en_us_goadedes/oc.m5.d4:ocMA.OdeW9C1H.ode	@ltx/en_us_goadedes/miscellanea:misc.Ode9
ltx/en_us_goadedes/oc.m5.d4:ocMA.OdeW9C1H.text	@ltx/en_us_goadedes/he.h.m5:heHE.IsaiaChoreve.text
ltx/en_us_goadedes/oc.m5.d4:ocMA.OdeW9C1T.incipit	…
ltx/en_us_goadedes/oc.m5.d4:ocMA.OdeW9C1T.melody	@ltx/en_us_goadedes/he.h.m5:heHE.IsaiaChoreve.name
ltx/en_us_goadedes/oc.m5.d4:ocMA.OdeW9C1T.mode	@ltx/en_us_goadedes/miscellanea:misc.Mode5
ltx/en_us_goadedes/oc.m5.d4:ocMA.OdeW9C1T.ode	@ltx/en_us_goadedes/miscellanea:misc.Ode9
ltx/en_us_goadedes/oc.m5.d4:ocMA.OdeW9C1T.text	
ltx/en_us_goadedes/oc.m5.d4:ocMA.OdeW9C21.greekmelody	@ltx/en_us_goadedes/he.h.m5:heHE.IsaiaChoreve.greekname
ltx/en_us_goadedes/oc.m5.d4:ocMA.OdeW9C21.incipit	…
ltx/en_us_goadedes/oc.m5.d4:ocMA.OdeW9C21.melody	@ltx/en_us_goadedes/he.h.m5:heHE.IsaiaChoreve.name
ltx/en_us_goadedes/oc.m5.d4:ocMA.OdeW9C21.mode	@ltx/en_us_goadedes/miscellanea:misc.Mode5
ltx/en_us_goadedes/oc.m5.d4:ocMA.OdeW9C21.ode	@ltx/en_us_goadedes/miscellanea:misc.Ode9
ltx/en_us_goadedes/oc.m5.d4:ocMA.OdeW9C21.text	
ltx/en_us_goadedes/oc.m5.d4:ocMA.OdeW9C22.incipit	…
ltx/en_us_goadedes/oc.m5.d4:ocMA.OdeW9C22.melody	@ltx/en_us_goadedes/he.h.m5:heHE.IsaiaChoreve.name
ltx/en_us_goadedes/oc.m5.d4:ocMA.OdeW9C22.mode	@ltx/en_us_goadedes/miscellanea:misc.Mode5
ltx/en_us_goadedes/oc.m5.d4:ocMA.OdeW9C22.ode	@ltx/en_us_goadedes/miscellanea:misc.Ode9
ltx/en_us_goadedes/oc.m5.d4:ocMA.OdeW9C22.text	
ltx/en_us_goadedes/oc.m5.d4:ocMA.OdeW9C23.incipit	…
ltx/en_us_goadedes/oc.m5.d4:ocMA.OdeW9C23.melody	@ltx/en_us_goadedes/he.h.m5:heHE.IsaiaChoreve.name
ltx/en_us_goadedes/oc.m5.d4:ocMA.OdeW9C23.mode	@ltx/en_us_goadedes/miscellanea:misc.Mode5
ltx/en_us_goadedes/oc.m5.d4:ocMA.OdeW9C23.ode	@ltx/en_us_goadedes/miscellanea:misc.Ode9
ltx/en_us_goadedes/oc.m5.d4:ocMA.OdeW9C23.text	
ltx/en_us_goadedes/oc.m5.d4:ocMA.OdeW9C24.incipit	…
ltx/en_us_goadedes/oc.m5.d4:ocMA.OdeW9C24.melody	@ltx/en_us_goadedes/he.h.m5:heHE.IsaiaChoreve.name
ltx/en_us_goadedes/oc.m5.d4:ocMA.OdeW9C24.mode	@ltx/en_us_goadedes/miscellanea:misc.Mode5
ltx/en_us_goadedes/oc.m5.d4:ocMA.OdeW9C24.ode	@ltx/en_us_goadedes/miscellanea:misc.Ode9
ltx/en_us_goadedes/oc.m5.d4:ocMA.OdeW9C24.text	
ltx/en_us_goadedes/oc.m5.d4:ocVE.ApolTheotokionVM.greekmelody	@ltx/en_us_goadedes/he.a.m5:heAU.TonSynanarchonLogon.greekname
ltx/en_us_goadedes/oc.m5.d4:ocVE.ApolTheotokionVM.incipit	@ltx/en_us_goadedes/oc.m5.d4:ocMA.Kathisma23.incipit
ltx/en_us_goadedes/oc.m5.d4:ocVE.ApolTheotokionVM.melody	@ltx/en_us_goadedes/he.a.m5:heAU.TonSynanarchonLogon.name
ltx/en_us_goadedes/oc.m5.d4:ocVE.ApolTheotokionVM.mode	@ltx/en_us_goadedes/miscellanea:misc.Mode5
ltx/en_us_goadedes/oc.m5.d4:ocVE.ApolTheotokionVM.text	@ltx/en_us_goadedes/oc.m5.d4:ocMA.Kathisma23.text
ltx/en_us_goadedes/oc.m5.d4:ocVE.AposTheotokion.greekmelody	@ltx/en_us_goadedes/he.a.m5:heAU.ChairoisAskitikon.greekname
ltx/en_us_goadedes/oc.m5.d4:ocVE.AposTheotokion.incipit	…
ltx/en_us_goadedes/oc.m5.d4:ocVE.AposTheotokion.melody	@ltx/en_us_goadedes/he.a.m5:heAU.ChairoisAskitikon.name
ltx/en_us_goadedes/oc.m5.d4:ocVE.AposTheotokion.mode	@ltx/en_us_goadedes/miscellanea:misc.Mode5
ltx/en_us_goadedes/oc.m5.d4:ocVE.AposTheotokion.text	
ltx/en_us_goadedes/oc.m5.d4:ocVE.Aposticha1.incipit	…
ltx/en_us_goadedes/oc.m5.d4:ocVE.Aposticha1.melody	
ltx/en_us_goadedes/oc.m5.d4:ocVE.Aposticha1.mode	@ltx/en_us_goadedes/miscellanea:misc.Mode5
ltx/en_us_goadedes/oc.m5.d4:ocVE.Aposticha1.text	
ltx/en_us_goadedes/oc.m5.d4:ocVE.Aposticha2.incipit	…
ltx/en_us_goadedes/oc.m5.d4:ocVE.Aposticha2.melody	
ltx/en_us_goadedes/oc.m5.d4:ocVE.Aposticha2.mode	@ltx/en_us_goadedes/miscellanea:misc.Mode5
ltx/en_us_goadedes/oc.m5.d4:ocVE.Aposticha2.text	
ltx/en_us_goadedes/oc.m5.d4:ocVE.Aposticha3.incipit	…
ltx/en_us_goadedes/oc.m5.d4:ocVE.Aposticha3.melody	
ltx/en_us_goadedes/oc.m5.d4:ocVE.Aposticha3.mode	@ltx/en_us_goadedes/miscellanea:misc.Mode5
ltx/en_us_goadedes/oc.m5.d4:ocVE.Aposticha3.text	
ltx/en_us_goadedes/oc.m5.d4:ocVE.SticTheotokion.greekmelody	@ltx/en_us_goadedes/he.a.m5:heAU.ChairoisAskitikon.greekname
ltx/en_us_goadedes/oc.m5.d4:ocVE.SticTheotokion.incipit	…
ltx/en_us_goadedes/oc.m5.d4:ocVE.SticTheotokion.melody	@ltx/en_us_goadedes/he.a.m5:heAU.ChairoisAskitikon.name
ltx/en_us_goadedes/oc.m5.d4:ocVE.SticTheotokion.mode	@ltx/en_us_goadedes/miscellanea:misc.Mode5
ltx/en_us_goadedes/oc.m5.d4:ocVE.SticTheotokion.text	
ltx/en_us_goadedes/oc.m5.d4:ocVE.Stichera1.greekmelody	@ltx/en_us_goadedes/he.a.m5:heAU.ChairoisAskitikon.greekname
ltx/en_us_goadedes/oc.m5.d4:ocVE.Stichera1.incipit	Savior and most benevolent Lord…
ltx/en_us_goadedes/oc.m5.d4:ocVE.Stichera1.melody	@ltx/en_us_goadedes/he.a.m5:heAU.ChairoisAskitikon.name
ltx/en_us_goadedes/oc.m5.d4:ocVE.Stichera1.mode	@ltx/en_us_goadedes/miscellanea:misc.Mode5
ltx/en_us_goadedes/oc.m5.d4:ocVE.Stichera1.text	Savior and most benevolent Lord, * I pray You block all the assaults that the demons launch * against me, for they are seeking to kill my humble soul * and to drag me down to everlasting hell. * Frustrate their intentions and all the traps that they lay for me, * for they are trying every day to entangle me, * night and day. O Master, from all these deliver me. * Quiet the tempestuous storm of life and its turbulence, * and rescue me from the darkness and from the hellfire that never ends, * O Christ, my most good God, * when You come again in glory as Judge of all the world.
ltx/en_us_goadedes/oc.m5.d4:ocVE.Stichera2.incipit	…
ltx/en_us_goadedes/oc.m5.d4:ocVE.Stichera2.melody	@ltx/en_us_goadedes/he.a.m5:heAU.ChairoisAskitikon.name
ltx/en_us_goadedes/oc.m5.d4:ocVE.Stichera2.mode	@ltx/en_us_goadedes/miscellanea:misc.Mode5
ltx/en_us_goadedes/oc.m5.d4:ocVE.Stichera2.text	
ltx/en_us_goadedes/oc.m5.d4:ocVE.Stichera3.incipit	…
ltx/en_us_goadedes/oc.m5.d4:ocVE.Stichera3.melody	@ltx/en_us_goadedes/he.a.m5:heAU.ChairoisAskitikon.name
ltx/en_us_goadedes/oc.m5.d4:ocVE.Stichera3.mode	@ltx/en_us_goadedes/miscellanea:misc.Mode5
ltx/en_us_goadedes/oc.m5.d4:ocVE.Stichera3.text	
ltx/en_us_goadedes/oc.m5.d4:ocVE.Stichera4.greekmelody	@ltx/en_us_goadedes/he.a.m5:heAU.ChairoisAskitikon.greekname
ltx/en_us_goadedes/oc.m5.d4:ocVE.Stichera4.incipit	…
ltx/en_us_goadedes/oc.m5.d4:ocVE.Stichera4.melody	@ltx/en_us_goadedes/he.a.m5:heAU.ChairoisAskitikon.name
ltx/en_us_goadedes/oc.m5.d4:ocVE.Stichera4.mode	@ltx/en_us_goadedes/miscellanea:misc.Mode5
ltx/en_us_goadedes/oc.m5.d4:ocVE.Stichera4.text	
ltx/en_us_goadedes/oc.m5.d4:ocVE.Stichera5.incipit	…
ltx/en_us_goadedes/oc.m5.d4:ocVE.Stichera5.melody	@ltx/en_us_goadedes/he.a.m5:heAU.ChairoisAskitikon.name
ltx/en_us_goadedes/oc.m5.d4:ocVE.Stichera5.mode	@ltx/en_us_goadedes/miscellanea:misc.Mode5
ltx/en_us_goadedes/oc.m5.d4:ocVE.Stichera5.text	
ltx/en_us_goadedes/oc.m5.d4:ocVE.Stichera6.incipit	…
ltx/en_us_goadedes/oc.m5.d4:ocVE.Stichera6.melody	@ltx/en_us_goadedes/he.a.m5:heAU.ChairoisAskitikon.name
ltx/en_us_goadedes/oc.m5.d4:ocVE.Stichera6.mode	@ltx/en_us_goadedes/miscellanea:misc.Mode5
ltx/en_us_goadedes/oc.m5.d4:ocVE.Stichera6.text	
ltx/en_us_goadedes/oc.m5.d4:octrMA.Kathisma11.greekmelody	@ltx/en_us_goadedes/oc.m5.d4:ocMA.Kathisma21.greekmelody
ltx/en_us_goadedes/oc.m5.d4:octrMA.Kathisma11.incipit	@ltx/en_us_goadedes/oc.m5.d4:ocMA.Kathisma21.incipit
ltx/en_us_goadedes/oc.m5.d4:octrMA.Kathisma11.melody	@ltx/en_us_goadedes/oc.m5.d4:ocMA.Kathisma21.melody
ltx/en_us_goadedes/oc.m5.d4:octrMA.Kathisma11.mode	@ltx/en_us_goadedes/miscellanea:misc.Mode5
ltx/en_us_goadedes/oc.m5.d4:octrMA.Kathisma11.text	@ltx/en_us_goadedes/oc.m5.d4:ocMA.Kathisma21.text
ltx/en_us_goadedes/oc.m5.d4:octrMA.Kathisma12.greekmelody	@ltx/en_us_goadedes/oc.m5.d4:ocMA.Kathisma21.greekmelody
ltx/en_us_goadedes/oc.m5.d4:octrMA.Kathisma12.incipit	@ltx/en_us_goadedes/oc.m5.d4:ocMA.Kathisma22.incipit
ltx/en_us_goadedes/oc.m5.d4:octrMA.Kathisma12.melody	@ltx/en_us_goadedes/oc.m5.d4:ocMA.Kathisma21.melody
ltx/en_us_goadedes/oc.m5.d4:octrMA.Kathisma12.mode	@ltx/en_us_goadedes/miscellanea:misc.Mode5
ltx/en_us_goadedes/oc.m5.d4:octrMA.Kathisma12.text	@ltx/en_us_goadedes/oc.m5.d4:ocMA.Kathisma22.text
ltx/en_us_goadedes/oc.m5.d4:octrMA.Kathisma1T.greekmelody	@ltx/en_us_goadedes/oc.m5.d6:ocMA.Kathisma13.greekmelody
ltx/en_us_goadedes/oc.m5.d4:octrMA.Kathisma1T.incipit	@ltx/en_us_goadedes/oc.m5.d6:ocMA.Kathisma13.incipit
ltx/en_us_goadedes/oc.m5.d4:octrMA.Kathisma1T.melody	@ltx/en_us_goadedes/oc.m5.d6:ocMA.Kathisma13.melody
ltx/en_us_goadedes/oc.m5.d4:octrMA.Kathisma1T.mode	@ltx/en_us_goadedes/miscellanea:misc.Mode5
ltx/en_us_goadedes/oc.m5.d4:octrMA.Kathisma1T.text	@ltx/en_us_goadedes/oc.m5.d6:ocMA.Kathisma13.text
ltx/en_us_goadedes/oc.m5.d4:octrMA.Ode7Martyricon.incipit	…
ltx/en_us_goadedes/oc.m5.d4:octrMA.Ode7Martyricon.melody	
ltx/en_us_goadedes/oc.m5.d4:octrMA.Ode7Martyricon.mode	@ltx/en_us_goadedes/miscellanea:misc.Mode5
ltx/en_us_goadedes/oc.m5.d4:octrMA.Ode7Martyricon.text	
ltx/en_us_goadedes/oc.m5.d4:octrMA.Photogogic.incipit	@ltx/en_us_goadedes/oc.m5.d2:octrMA.Photagogic.incipit
ltx/en_us_goadedes/oc.m5.d4:octrMA.Photogogic.mode	@ltx/en_us_goadedes/miscellanea:misc.Mode5
ltx/en_us_goadedes/oc.m5.d4:octrMA.Photogogic.text	@ltx/en_us_goadedes/oc.m5.d2:octrMA.Photagogic.text
ltx/en_us_goadedes/oc.m5.d4:octrMA.Triadic1.incipit	@ltx/en_us_goadedes/oc.m5.d2:octrMA.Triadic1.incipit
ltx/en_us_goadedes/oc.m5.d4:octrMA.Triadic1.mode	@ltx/en_us_goadedes/miscellanea:misc.Mode5
ltx/en_us_goadedes/oc.m5.d4:octrMA.Triadic1.text	@ltx/en_us_goadedes/oc.m5.d2:octrMA.Triadic1.text
ltx/en_us_goadedes/oc.m5.d4:octrMA.Triadic2.incipit	@ltx/en_us_goadedes/oc.m5.d2:octrMA.Triadic2.incipit
ltx/en_us_goadedes/oc.m5.d4:octrMA.Triadic2.mode	@ltx/en_us_goadedes/miscellanea:misc.Mode5
ltx/en_us_goadedes/oc.m5.d4:octrMA.Triadic2.text	@ltx/en_us_goadedes/oc.m5.d2:octrMA.Triadic2.text
ltx/en_us_goadedes/oc.m5.d4:octrMA.Triadic3.incipit	@ltx/en_us_goadedes/oc.m5.d2:octrMA.Triadic3.incipit
ltx/en_us_goadedes/oc.m5.d4:octrMA.Triadic3.mode	@ltx/en_us_goadedes/miscellanea:misc.Mode5
ltx/en_us_goadedes/oc.m5.d4:octrMA.Triadic3.text	@ltx/en_us_goadedes/oc.m5.d2:octrMA.Triadic3.text
