ltx/en_us_goadedes/me.m01.d26:meDA.commemoration.first	
ltx/en_us_goadedes/me.m01.d26:meDA.commemoration.first_name	
ltx/en_us_goadedes/me.m01.d26:meDA.commemoration.first_short	
ltx/en_us_goadedes/me.m01.d26:meDA.commemoration.first_title	@ltx/en_us_goadedes/titles:ti.Saints
ltx/en_us_goadedes/me.m01.d26:meDA.commemoration.full	
ltx/en_us_goadedes/me.m01.d26:meDA.commemoration.second_name	
ltx/en_us_goadedes/me.m01.d26:meDA.commemoration.second_title	
ltx/en_us_goadedes/me.m01.d26:meDA.date	
ltx/en_us_goadedes/me.m01.d26:meDA.fordate	
ltx/en_us_goadedes/me.m01.d26:meDA.insert1	
ltx/en_us_goadedes/me.m01.d26:meDA.insert2	
ltx/en_us_goadedes/me.m01.d26:meDA.note	
ltx/en_us_goadedes/me.m01.d26:meDA.pdfcoverdate	
ltx/en_us_goadedes/me.m01.d26:meDA.pdfheaderdate	
ltx/en_us_goadedes/me.m01.d26:meHO.commemorations	
ltx/en_us_goadedes/me.m01.d26:meHO.note1	
ltx/en_us_goadedes/me.m01.d26:meHO.note2	
ltx/en_us_goadedes/me.m01.d26:meHO.number	
ltx/en_us_goadedes/me.m01.d26:meHO.rank	
ltx/en_us_goadedes/me.m01.d26:meLE.commemoration1	
ltx/en_us_goadedes/me.m01.d26:meLE.commemoration2	
ltx/en_us_goadedes/me.m01.d26:meLI.Kontakion1.greekmelody	@ltx/en_us_goadedes/me.m01.d26:meMA.Kontakion1.greekmelody
ltx/en_us_goadedes/me.m01.d26:meLI.Kontakion1.incipit	@ltx/en_us_goadedes/me.m01.d26:meMA.Kontakion1.incipit
ltx/en_us_goadedes/me.m01.d26:meLI.Kontakion1.melody	@ltx/en_us_goadedes/me.m01.d26:meMA.Kontakion1.melody
ltx/en_us_goadedes/me.m01.d26:meLI.Kontakion1.mode	@ltx/en_us_goadedes/me.m01.d26:meMA.Kontakion1.mode
ltx/en_us_goadedes/me.m01.d26:meLI.Kontakion1.text	@ltx/en_us_goadedes/me.m01.d26:meMA.Kontakion1.text
ltx/en_us_goadedes/me.m01.d26:meLI.MM.CommunionHymn.text	@ltx/en_us_goadedes/properties:media.key
ltx/en_us_goadedes/me.m01.d26:meLI.Megalynarion.text	
ltx/en_us_goadedes/me.m01.d26:meMA.C1.acrostic.notice1	
ltx/en_us_goadedes/me.m01.d26:meMA.C1.acrostic.text	
ltx/en_us_goadedes/me.m01.d26:meMA.C1.acrostic.title	Canon for the Saints.
ltx/en_us_goadedes/me.m01.d26:meMA.C1.poet	@ltx/en_us_goadedes/poets:po.Theofanous
ltx/en_us_goadedes/me.m01.d26:meMA.C1.title	@ltx/en_us_goadedes/titles:ti.CanonSaints
ltx/en_us_goadedes/me.m01.d26:meMA.C1.verse	@ltx/en_us_goadedes/prayers:pr.verse_SaintsM.text
ltx/en_us_goadedes/me.m01.d26:meMA.ExapTheotokion.incipit	…
ltx/en_us_goadedes/me.m01.d26:meMA.ExapTheotokion.melody	@ltx/en_us_goadedes/he.a.m3:heAU.OOuranonToisAstrois.name
ltx/en_us_goadedes/me.m01.d26:meMA.ExapTheotokion.mode	@ltx/en_us_goadedes/miscellanea:misc.Mode3
ltx/en_us_goadedes/me.m01.d26:meMA.ExapTheotokion.text	
ltx/en_us_goadedes/me.m01.d26:meMA.Exaposteilarion1.greekmelody	@ltx/en_us_goadedes/he.a.m3:heAU.OOuranonToisAstrois.greekname
ltx/en_us_goadedes/me.m01.d26:meMA.Exaposteilarion1.incipit	…
ltx/en_us_goadedes/me.m01.d26:meMA.Exaposteilarion1.melody	@ltx/en_us_goadedes/he.a.m3:heAU.OOuranonToisAstrois.name
ltx/en_us_goadedes/me.m01.d26:meMA.Exaposteilarion1.mode	@ltx/en_us_goadedes/miscellanea:misc.Mode3
ltx/en_us_goadedes/me.m01.d26:meMA.Exaposteilarion1.text	
ltx/en_us_goadedes/me.m01.d26:meMA.Kontakion1.greekmelody	@ltx/en_us_goadedes/he.a.m4:heAU.EpefanisSimeron.greekname
ltx/en_us_goadedes/me.m01.d26:meMA.Kontakion1.incipit	…
ltx/en_us_goadedes/me.m01.d26:meMA.Kontakion1.melody	@ltx/en_us_goadedes/he.a.m4:heAU.EpefanisSimeron.name
ltx/en_us_goadedes/me.m01.d26:meMA.Kontakion1.mode	@ltx/en_us_goadedes/miscellanea:misc.Mode4
ltx/en_us_goadedes/me.m01.d26:meMA.Kontakion1.text	
ltx/en_us_goadedes/me.m01.d26:meMA.Ode1C11.greekmelody	@ltx/en_us_goadedes/he.h.m2:heHE.DefteLaoi.greekname
ltx/en_us_goadedes/me.m01.d26:meMA.Ode1C11.incipit	…
ltx/en_us_goadedes/me.m01.d26:meMA.Ode1C11.melody	@ltx/en_us_goadedes/he.h.m2:heHE.DefteLaoi.name
ltx/en_us_goadedes/me.m01.d26:meMA.Ode1C11.mode	@ltx/en_us_goadedes/miscellanea:misc.Mode2
ltx/en_us_goadedes/me.m01.d26:meMA.Ode1C11.ode	@ltx/en_us_goadedes/miscellanea:misc.Ode1
ltx/en_us_goadedes/me.m01.d26:meMA.Ode1C11.text	
ltx/en_us_goadedes/me.m01.d26:meMA.Ode1C12.incipit	…
ltx/en_us_goadedes/me.m01.d26:meMA.Ode1C12.melody	@ltx/en_us_goadedes/he.h.m2:heHE.DefteLaoi.name
ltx/en_us_goadedes/me.m01.d26:meMA.Ode1C12.mode	@ltx/en_us_goadedes/miscellanea:misc.Mode2
ltx/en_us_goadedes/me.m01.d26:meMA.Ode1C12.ode	@ltx/en_us_goadedes/miscellanea:misc.Ode1
ltx/en_us_goadedes/me.m01.d26:meMA.Ode1C12.text	
ltx/en_us_goadedes/me.m01.d26:meMA.Ode1C13.incipit	…
ltx/en_us_goadedes/me.m01.d26:meMA.Ode1C13.melody	@ltx/en_us_goadedes/he.h.m2:heHE.DefteLaoi.name
ltx/en_us_goadedes/me.m01.d26:meMA.Ode1C13.mode	@ltx/en_us_goadedes/miscellanea:misc.Mode2
ltx/en_us_goadedes/me.m01.d26:meMA.Ode1C13.ode	@ltx/en_us_goadedes/miscellanea:misc.Ode1
ltx/en_us_goadedes/me.m01.d26:meMA.Ode1C13.text	
ltx/en_us_goadedes/me.m01.d26:meMA.Ode1C1T.incipit	…
ltx/en_us_goadedes/me.m01.d26:meMA.Ode1C1T.melody	@ltx/en_us_goadedes/he.h.m2:heHE.DefteLaoi.name
ltx/en_us_goadedes/me.m01.d26:meMA.Ode1C1T.mode	@ltx/en_us_goadedes/miscellanea:misc.Mode2
ltx/en_us_goadedes/me.m01.d26:meMA.Ode1C1T.ode	@ltx/en_us_goadedes/miscellanea:misc.Ode1
ltx/en_us_goadedes/me.m01.d26:meMA.Ode1C1T.text	
ltx/en_us_goadedes/me.m01.d26:meMA.Ode3C11.greekmelody	@ltx/en_us_goadedes/he.h.m2:heHE.EnPetraMeTisPisteos.greekname
ltx/en_us_goadedes/me.m01.d26:meMA.Ode3C11.incipit	…
ltx/en_us_goadedes/me.m01.d26:meMA.Ode3C11.melody	@ltx/en_us_goadedes/he.h.m2:heHE.EnPetraMeTisPisteos.name
ltx/en_us_goadedes/me.m01.d26:meMA.Ode3C11.mode	@ltx/en_us_goadedes/miscellanea:misc.Mode2
ltx/en_us_goadedes/me.m01.d26:meMA.Ode3C11.ode	@ltx/en_us_goadedes/miscellanea:misc.Ode3
ltx/en_us_goadedes/me.m01.d26:meMA.Ode3C11.text	
ltx/en_us_goadedes/me.m01.d26:meMA.Ode3C12.incipit	…
ltx/en_us_goadedes/me.m01.d26:meMA.Ode3C12.melody	@ltx/en_us_goadedes/he.h.m2:heHE.EnPetraMeTisPisteos.name
ltx/en_us_goadedes/me.m01.d26:meMA.Ode3C12.mode	@ltx/en_us_goadedes/miscellanea:misc.Mode2
ltx/en_us_goadedes/me.m01.d26:meMA.Ode3C12.ode	@ltx/en_us_goadedes/miscellanea:misc.Ode3
ltx/en_us_goadedes/me.m01.d26:meMA.Ode3C12.text	
ltx/en_us_goadedes/me.m01.d26:meMA.Ode3C13.incipit	…
ltx/en_us_goadedes/me.m01.d26:meMA.Ode3C13.melody	@ltx/en_us_goadedes/he.h.m2:heHE.EnPetraMeTisPisteos.name
ltx/en_us_goadedes/me.m01.d26:meMA.Ode3C13.mode	@ltx/en_us_goadedes/miscellanea:misc.Mode2
ltx/en_us_goadedes/me.m01.d26:meMA.Ode3C13.ode	@ltx/en_us_goadedes/miscellanea:misc.Ode3
ltx/en_us_goadedes/me.m01.d26:meMA.Ode3C13.text	
ltx/en_us_goadedes/me.m01.d26:meMA.Ode3C1T.incipit	…
ltx/en_us_goadedes/me.m01.d26:meMA.Ode3C1T.melody	@ltx/en_us_goadedes/he.h.m2:heHE.EnPetraMeTisPisteos.name
ltx/en_us_goadedes/me.m01.d26:meMA.Ode3C1T.mode	@ltx/en_us_goadedes/miscellanea:misc.Mode2
ltx/en_us_goadedes/me.m01.d26:meMA.Ode3C1T.ode	@ltx/en_us_goadedes/miscellanea:misc.Ode3
ltx/en_us_goadedes/me.m01.d26:meMA.Ode3C1T.text	
ltx/en_us_goadedes/me.m01.d26:meMA.Ode3H.greekmelody	@ltx/en_us_goadedes/he.h.m2:heHE.EnPetraMeTisPisteos.greekname
ltx/en_us_goadedes/me.m01.d26:meMA.Ode3H.incipit	@ltx/en_us_goadedes/he.h.m2:heHE.EnPetraMeTisPisteos.incipit
ltx/en_us_goadedes/me.m01.d26:meMA.Ode3H.melody	@ltx/en_us_goadedes/he.h.m2:heHE.EnPetraMeTisPisteos.melody
ltx/en_us_goadedes/me.m01.d26:meMA.Ode3H.mode	@ltx/en_us_goadedes/miscellanea:misc.Mode2
ltx/en_us_goadedes/me.m01.d26:meMA.Ode3H.ode	@ltx/en_us_goadedes/miscellanea:misc.Ode3
ltx/en_us_goadedes/me.m01.d26:meMA.Ode3H.text	@ltx/en_us_goadedes/he.h.m2:heHE.EnPetraMeTisPisteos.text
ltx/en_us_goadedes/me.m01.d26:meMA.Ode3Kathisma1.greekmelody	@ltx/en_us_goadedes/he.a.m8:heAU.TinSofianKaiLogon.greekname
ltx/en_us_goadedes/me.m01.d26:meMA.Ode3Kathisma1.incipit	…
ltx/en_us_goadedes/me.m01.d26:meMA.Ode3Kathisma1.melody	@ltx/en_us_goadedes/he.a.m8:heAU.TinSofianKaiLogon.name
ltx/en_us_goadedes/me.m01.d26:meMA.Ode3Kathisma1.mode	@ltx/en_us_goadedes/miscellanea:misc.Mode8
ltx/en_us_goadedes/me.m01.d26:meMA.Ode3Kathisma1.text	
ltx/en_us_goadedes/me.m01.d26:meMA.Ode3KathismaSt.incipit	@ltx/en_us_goadedes/me.m01.d24:meMA.Ode3KathismaSt.incipit
ltx/en_us_goadedes/me.m01.d26:meMA.Ode3KathismaSt.melody	@ltx/en_us_goadedes/he.a.m8:heAU.TinSofianKaiLogon.name
ltx/en_us_goadedes/me.m01.d26:meMA.Ode3KathismaSt.mode	@ltx/en_us_goadedes/miscellanea:misc.Mode8
ltx/en_us_goadedes/me.m01.d26:meMA.Ode3KathismaSt.text	@ltx/en_us_goadedes/me.m01.d24:meMA.Ode3KathismaSt.text
ltx/en_us_goadedes/me.m01.d26:meMA.Ode3KathismaT.incipit	…
ltx/en_us_goadedes/me.m01.d26:meMA.Ode3KathismaT.melody	@ltx/en_us_goadedes/he.a.m8:heAU.TinSofianKaiLogon.name
ltx/en_us_goadedes/me.m01.d26:meMA.Ode3KathismaT.mode	@ltx/en_us_goadedes/miscellanea:misc.Mode8
ltx/en_us_goadedes/me.m01.d26:meMA.Ode3KathismaT.text	
ltx/en_us_goadedes/me.m01.d26:meMA.Ode4C11.greekmelody	@ltx/en_us_goadedes/he.h.m2:heHE.EisakikoaKyrieTinAkoin.greekname
ltx/en_us_goadedes/me.m01.d26:meMA.Ode4C11.incipit	…
ltx/en_us_goadedes/me.m01.d26:meMA.Ode4C11.melody	@ltx/en_us_goadedes/he.h.m2:heHE.EisakikoaKyrieTinAkoin.name
ltx/en_us_goadedes/me.m01.d26:meMA.Ode4C11.mode	@ltx/en_us_goadedes/miscellanea:misc.Mode2
ltx/en_us_goadedes/me.m01.d26:meMA.Ode4C11.ode	@ltx/en_us_goadedes/miscellanea:misc.Ode4
ltx/en_us_goadedes/me.m01.d26:meMA.Ode4C11.text	
ltx/en_us_goadedes/me.m01.d26:meMA.Ode4C12.incipit	…
ltx/en_us_goadedes/me.m01.d26:meMA.Ode4C12.melody	@ltx/en_us_goadedes/he.h.m2:heHE.EisakikoaKyrieTinAkoin.name
ltx/en_us_goadedes/me.m01.d26:meMA.Ode4C12.mode	@ltx/en_us_goadedes/miscellanea:misc.Mode2
ltx/en_us_goadedes/me.m01.d26:meMA.Ode4C12.ode	@ltx/en_us_goadedes/miscellanea:misc.Ode4
ltx/en_us_goadedes/me.m01.d26:meMA.Ode4C12.text	
ltx/en_us_goadedes/me.m01.d26:meMA.Ode4C13.incipit	…
ltx/en_us_goadedes/me.m01.d26:meMA.Ode4C13.melody	@ltx/en_us_goadedes/he.h.m2:heHE.EisakikoaKyrieTinAkoin.name
ltx/en_us_goadedes/me.m01.d26:meMA.Ode4C13.mode	@ltx/en_us_goadedes/miscellanea:misc.Mode2
ltx/en_us_goadedes/me.m01.d26:meMA.Ode4C13.ode	@ltx/en_us_goadedes/miscellanea:misc.Ode4
ltx/en_us_goadedes/me.m01.d26:meMA.Ode4C13.text	
ltx/en_us_goadedes/me.m01.d26:meMA.Ode4C1T.incipit	…
ltx/en_us_goadedes/me.m01.d26:meMA.Ode4C1T.melody	@ltx/en_us_goadedes/he.h.m2:heHE.EisakikoaKyrieTinAkoin.name
ltx/en_us_goadedes/me.m01.d26:meMA.Ode4C1T.mode	@ltx/en_us_goadedes/miscellanea:misc.Mode2
ltx/en_us_goadedes/me.m01.d26:meMA.Ode4C1T.ode	@ltx/en_us_goadedes/miscellanea:misc.Ode4
ltx/en_us_goadedes/me.m01.d26:meMA.Ode4C1T.text	
ltx/en_us_goadedes/me.m01.d26:meMA.Ode5C11.greekmelody	@ltx/en_us_goadedes/he.h.m2:heHE.OTouFotosChorigos.greekname
ltx/en_us_goadedes/me.m01.d26:meMA.Ode5C11.incipit	…
ltx/en_us_goadedes/me.m01.d26:meMA.Ode5C11.melody	@ltx/en_us_goadedes/he.h.m2:heHE.OTouFotosChorigos.name
ltx/en_us_goadedes/me.m01.d26:meMA.Ode5C11.mode	@ltx/en_us_goadedes/miscellanea:misc.Mode2
ltx/en_us_goadedes/me.m01.d26:meMA.Ode5C11.ode	@ltx/en_us_goadedes/miscellanea:misc.Ode5
ltx/en_us_goadedes/me.m01.d26:meMA.Ode5C11.text	
ltx/en_us_goadedes/me.m01.d26:meMA.Ode5C12.incipit	…
ltx/en_us_goadedes/me.m01.d26:meMA.Ode5C12.melody	@ltx/en_us_goadedes/he.h.m2:heHE.OTouFotosChorigos.name
ltx/en_us_goadedes/me.m01.d26:meMA.Ode5C12.mode	@ltx/en_us_goadedes/miscellanea:misc.Mode2
ltx/en_us_goadedes/me.m01.d26:meMA.Ode5C12.ode	@ltx/en_us_goadedes/miscellanea:misc.Ode5
ltx/en_us_goadedes/me.m01.d26:meMA.Ode5C12.text	
ltx/en_us_goadedes/me.m01.d26:meMA.Ode5C13.incipit	…
ltx/en_us_goadedes/me.m01.d26:meMA.Ode5C13.melody	@ltx/en_us_goadedes/he.h.m2:heHE.OTouFotosChorigos.name
ltx/en_us_goadedes/me.m01.d26:meMA.Ode5C13.mode	@ltx/en_us_goadedes/miscellanea:misc.Mode2
ltx/en_us_goadedes/me.m01.d26:meMA.Ode5C13.ode	@ltx/en_us_goadedes/miscellanea:misc.Ode5
ltx/en_us_goadedes/me.m01.d26:meMA.Ode5C13.text	
ltx/en_us_goadedes/me.m01.d26:meMA.Ode5C1T.incipit	…
ltx/en_us_goadedes/me.m01.d26:meMA.Ode5C1T.melody	@ltx/en_us_goadedes/he.h.m2:heHE.OTouFotosChorigos.name
ltx/en_us_goadedes/me.m01.d26:meMA.Ode5C1T.mode	@ltx/en_us_goadedes/miscellanea:misc.Mode2
ltx/en_us_goadedes/me.m01.d26:meMA.Ode5C1T.ode	@ltx/en_us_goadedes/miscellanea:misc.Ode5
ltx/en_us_goadedes/me.m01.d26:meMA.Ode5C1T.text	
ltx/en_us_goadedes/me.m01.d26:meMA.Ode6C11.greekmelody	@ltx/en_us_goadedes/he.h.m2:heHE.EnAvyssoPtaismaton.greekname
ltx/en_us_goadedes/me.m01.d26:meMA.Ode6C11.incipit	…
ltx/en_us_goadedes/me.m01.d26:meMA.Ode6C11.melody	@ltx/en_us_goadedes/he.h.m2:heHE.EnAvyssoPtaismaton.name
ltx/en_us_goadedes/me.m01.d26:meMA.Ode6C11.mode	@ltx/en_us_goadedes/miscellanea:misc.Mode2
ltx/en_us_goadedes/me.m01.d26:meMA.Ode6C11.ode	@ltx/en_us_goadedes/miscellanea:misc.Ode6
ltx/en_us_goadedes/me.m01.d26:meMA.Ode6C11.text	
ltx/en_us_goadedes/me.m01.d26:meMA.Ode6C12.incipit	…
ltx/en_us_goadedes/me.m01.d26:meMA.Ode6C12.melody	@ltx/en_us_goadedes/he.h.m2:heHE.EnAvyssoPtaismaton.name
ltx/en_us_goadedes/me.m01.d26:meMA.Ode6C12.mode	@ltx/en_us_goadedes/miscellanea:misc.Mode2
ltx/en_us_goadedes/me.m01.d26:meMA.Ode6C12.ode	@ltx/en_us_goadedes/miscellanea:misc.Ode6
ltx/en_us_goadedes/me.m01.d26:meMA.Ode6C12.text	
ltx/en_us_goadedes/me.m01.d26:meMA.Ode6C13.incipit	…
ltx/en_us_goadedes/me.m01.d26:meMA.Ode6C13.melody	@ltx/en_us_goadedes/he.h.m2:heHE.EnAvyssoPtaismaton.name
ltx/en_us_goadedes/me.m01.d26:meMA.Ode6C13.mode	@ltx/en_us_goadedes/miscellanea:misc.Mode2
ltx/en_us_goadedes/me.m01.d26:meMA.Ode6C13.ode	@ltx/en_us_goadedes/miscellanea:misc.Ode6
ltx/en_us_goadedes/me.m01.d26:meMA.Ode6C13.text	
ltx/en_us_goadedes/me.m01.d26:meMA.Ode6C1T.incipit	…
ltx/en_us_goadedes/me.m01.d26:meMA.Ode6C1T.melody	@ltx/en_us_goadedes/he.h.m2:heHE.EnAvyssoPtaismaton.name
ltx/en_us_goadedes/me.m01.d26:meMA.Ode6C1T.mode	@ltx/en_us_goadedes/miscellanea:misc.Mode2
ltx/en_us_goadedes/me.m01.d26:meMA.Ode6C1T.ode	@ltx/en_us_goadedes/miscellanea:misc.Ode6
ltx/en_us_goadedes/me.m01.d26:meMA.Ode6C1T.text	
ltx/en_us_goadedes/me.m01.d26:meMA.Ode6H.greekmelody	@ltx/en_us_goadedes/he.h.m2:heHE.EnAvyssoPtaismaton.greekname
ltx/en_us_goadedes/me.m01.d26:meMA.Ode6H.incipit	@ltx/en_us_goadedes/he.h.m2:heHE.EnAvyssoPtaismaton.incipit
ltx/en_us_goadedes/me.m01.d26:meMA.Ode6H.melody	@ltx/en_us_goadedes/he.h.m2:heHE.EnAvyssoPtaismaton.melody
ltx/en_us_goadedes/me.m01.d26:meMA.Ode6H.mode	@ltx/en_us_goadedes/miscellanea:misc.Mode2
ltx/en_us_goadedes/me.m01.d26:meMA.Ode6H.ode	@ltx/en_us_goadedes/miscellanea:misc.Ode6
ltx/en_us_goadedes/me.m01.d26:meMA.Ode6H.text	@ltx/en_us_goadedes/he.h.m2:heHE.EnAvyssoPtaismaton.text
ltx/en_us_goadedes/me.m01.d26:meMA.Ode7C11.greekmelody	@ltx/en_us_goadedes/he.h.m2:heHE.AntitheonProstagma.greekname
ltx/en_us_goadedes/me.m01.d26:meMA.Ode7C11.incipit	…
ltx/en_us_goadedes/me.m01.d26:meMA.Ode7C11.melody	@ltx/en_us_goadedes/he.h.m2:heHE.AntitheonProstagma.name
ltx/en_us_goadedes/me.m01.d26:meMA.Ode7C11.mode	@ltx/en_us_goadedes/miscellanea:misc.Mode2
ltx/en_us_goadedes/me.m01.d26:meMA.Ode7C11.ode	@ltx/en_us_goadedes/miscellanea:misc.Ode7
ltx/en_us_goadedes/me.m01.d26:meMA.Ode7C11.text	
ltx/en_us_goadedes/me.m01.d26:meMA.Ode7C12.incipit	…
ltx/en_us_goadedes/me.m01.d26:meMA.Ode7C12.melody	@ltx/en_us_goadedes/he.h.m2:heHE.AntitheonProstagma.name
ltx/en_us_goadedes/me.m01.d26:meMA.Ode7C12.mode	@ltx/en_us_goadedes/miscellanea:misc.Mode2
ltx/en_us_goadedes/me.m01.d26:meMA.Ode7C12.ode	@ltx/en_us_goadedes/miscellanea:misc.Ode7
ltx/en_us_goadedes/me.m01.d26:meMA.Ode7C12.text	
ltx/en_us_goadedes/me.m01.d26:meMA.Ode7C1T.incipit	…
ltx/en_us_goadedes/me.m01.d26:meMA.Ode7C1T.melody	@ltx/en_us_goadedes/he.h.m2:heHE.AntitheonProstagma.name
ltx/en_us_goadedes/me.m01.d26:meMA.Ode7C1T.mode	@ltx/en_us_goadedes/miscellanea:misc.Mode2
ltx/en_us_goadedes/me.m01.d26:meMA.Ode7C1T.ode	@ltx/en_us_goadedes/miscellanea:misc.Ode7
ltx/en_us_goadedes/me.m01.d26:meMA.Ode7C1T.text	
ltx/en_us_goadedes/me.m01.d26:meMA.Ode8C11.greekmelody	@ltx/en_us_goadedes/he.h.m2:heHE.KaminosPote.greekname
ltx/en_us_goadedes/me.m01.d26:meMA.Ode8C11.incipit	…
ltx/en_us_goadedes/me.m01.d26:meMA.Ode8C11.melody	@ltx/en_us_goadedes/he.h.m2:heHE.KaminosPote.name
ltx/en_us_goadedes/me.m01.d26:meMA.Ode8C11.mode	@ltx/en_us_goadedes/miscellanea:misc.Mode2
ltx/en_us_goadedes/me.m01.d26:meMA.Ode8C11.ode	@ltx/en_us_goadedes/miscellanea:misc.Ode8
ltx/en_us_goadedes/me.m01.d26:meMA.Ode8C11.text	
ltx/en_us_goadedes/me.m01.d26:meMA.Ode8C12.incipit	…
ltx/en_us_goadedes/me.m01.d26:meMA.Ode8C12.melody	@ltx/en_us_goadedes/he.h.m2:heHE.KaminosPote.name
ltx/en_us_goadedes/me.m01.d26:meMA.Ode8C12.mode	@ltx/en_us_goadedes/miscellanea:misc.Mode2
ltx/en_us_goadedes/me.m01.d26:meMA.Ode8C12.ode	@ltx/en_us_goadedes/miscellanea:misc.Ode8
ltx/en_us_goadedes/me.m01.d26:meMA.Ode8C12.text	
ltx/en_us_goadedes/me.m01.d26:meMA.Ode8C13.incipit	…
ltx/en_us_goadedes/me.m01.d26:meMA.Ode8C13.melody	@ltx/en_us_goadedes/he.h.m2:heHE.KaminosPote.name
ltx/en_us_goadedes/me.m01.d26:meMA.Ode8C13.mode	@ltx/en_us_goadedes/miscellanea:misc.Mode2
ltx/en_us_goadedes/me.m01.d26:meMA.Ode8C13.ode	@ltx/en_us_goadedes/miscellanea:misc.Ode8
ltx/en_us_goadedes/me.m01.d26:meMA.Ode8C13.text	
ltx/en_us_goadedes/me.m01.d26:meMA.Ode8C1T.incipit	…
ltx/en_us_goadedes/me.m01.d26:meMA.Ode8C1T.melody	@ltx/en_us_goadedes/he.h.m2:heHE.KaminosPote.name
ltx/en_us_goadedes/me.m01.d26:meMA.Ode8C1T.mode	@ltx/en_us_goadedes/miscellanea:misc.Mode2
ltx/en_us_goadedes/me.m01.d26:meMA.Ode8C1T.ode	@ltx/en_us_goadedes/miscellanea:misc.Ode8
ltx/en_us_goadedes/me.m01.d26:meMA.Ode8C1T.text	
ltx/en_us_goadedes/me.m01.d26:meMA.Ode8H.greekmelody	@ltx/en_us_goadedes/he.h.m2:heHE.KaminosPote.greekname
ltx/en_us_goadedes/me.m01.d26:meMA.Ode8H.incipit	@ltx/en_us_goadedes/he.h.m2:heHE.KaminosPote.incipit
ltx/en_us_goadedes/me.m01.d26:meMA.Ode8H.melody	@ltx/en_us_goadedes/he.h.m2:heHE.KaminosPote.melody
ltx/en_us_goadedes/me.m01.d26:meMA.Ode8H.mode	@ltx/en_us_goadedes/miscellanea:misc.Mode2
ltx/en_us_goadedes/me.m01.d26:meMA.Ode8H.ode	@ltx/en_us_goadedes/miscellanea:misc.Ode8
ltx/en_us_goadedes/me.m01.d26:meMA.Ode8H.text	@ltx/en_us_goadedes/he.h.m2:heHE.KaminosPote.text
ltx/en_us_goadedes/me.m01.d26:meMA.Ode9C11.greekmelody	@ltx/en_us_goadedes/he.h.m2:heHE.AnarchouGennitoros.greekname
ltx/en_us_goadedes/me.m01.d26:meMA.Ode9C11.incipit	…
ltx/en_us_goadedes/me.m01.d26:meMA.Ode9C11.melody	@ltx/en_us_goadedes/he.h.m2:heHE.AnarchouGennitoros.name
ltx/en_us_goadedes/me.m01.d26:meMA.Ode9C11.mode	@ltx/en_us_goadedes/miscellanea:misc.Mode2
ltx/en_us_goadedes/me.m01.d26:meMA.Ode9C11.ode	@ltx/en_us_goadedes/miscellanea:misc.Ode9
ltx/en_us_goadedes/me.m01.d26:meMA.Ode9C11.text	
ltx/en_us_goadedes/me.m01.d26:meMA.Ode9C12.incipit	…
ltx/en_us_goadedes/me.m01.d26:meMA.Ode9C12.melody	@ltx/en_us_goadedes/he.h.m2:heHE.AnarchouGennitoros.name
ltx/en_us_goadedes/me.m01.d26:meMA.Ode9C12.mode	@ltx/en_us_goadedes/miscellanea:misc.Mode2
ltx/en_us_goadedes/me.m01.d26:meMA.Ode9C12.ode	@ltx/en_us_goadedes/miscellanea:misc.Ode9
ltx/en_us_goadedes/me.m01.d26:meMA.Ode9C12.text	
ltx/en_us_goadedes/me.m01.d26:meMA.Ode9C13.incipit	…
ltx/en_us_goadedes/me.m01.d26:meMA.Ode9C13.melody	@ltx/en_us_goadedes/he.h.m2:heHE.AnarchouGennitoros.name
ltx/en_us_goadedes/me.m01.d26:meMA.Ode9C13.mode	@ltx/en_us_goadedes/miscellanea:misc.Mode2
ltx/en_us_goadedes/me.m01.d26:meMA.Ode9C13.ode	@ltx/en_us_goadedes/miscellanea:misc.Ode9
ltx/en_us_goadedes/me.m01.d26:meMA.Ode9C13.text	
ltx/en_us_goadedes/me.m01.d26:meMA.Ode9C1T.incipit	…
ltx/en_us_goadedes/me.m01.d26:meMA.Ode9C1T.melody	@ltx/en_us_goadedes/he.h.m2:heHE.AnarchouGennitoros.name
ltx/en_us_goadedes/me.m01.d26:meMA.Ode9C1T.mode	@ltx/en_us_goadedes/miscellanea:misc.Mode2
ltx/en_us_goadedes/me.m01.d26:meMA.Ode9C1T.ode	@ltx/en_us_goadedes/miscellanea:misc.Ode9
ltx/en_us_goadedes/me.m01.d26:meMA.Ode9C1T.text	
ltx/en_us_goadedes/me.m01.d26:meMA.Ode9H.greekmelody	@ltx/en_us_goadedes/he.h.m2:heHE.AnarchouGennitoros.greekname
ltx/en_us_goadedes/me.m01.d26:meMA.Ode9H.incipit	@ltx/en_us_goadedes/he.h.m2:heHE.AnarchouGennitoros.incipit
ltx/en_us_goadedes/me.m01.d26:meMA.Ode9H.melody	@ltx/en_us_goadedes/he.h.m2:heHE.AnarchouGennitoros.melody
ltx/en_us_goadedes/me.m01.d26:meMA.Ode9H.mode	@ltx/en_us_goadedes/miscellanea:misc.Mode2
ltx/en_us_goadedes/me.m01.d26:meMA.Ode9H.ode	@ltx/en_us_goadedes/miscellanea:misc.Ode9
ltx/en_us_goadedes/me.m01.d26:meMA.Ode9H.text	@ltx/en_us_goadedes/he.h.m2:heHE.AnarchouGennitoros.text
ltx/en_us_goadedes/me.m01.d26:meMA.Oikos1.text	
ltx/en_us_goadedes/me.m01.d26:meVE.Apolytikion1.incipit	@ltx/en_us_goadedes/he.ga:heGA.OTheosTonPateronImon.incipit
ltx/en_us_goadedes/me.m01.d26:meVE.Apolytikion1.melody	
ltx/en_us_goadedes/me.m01.d26:meVE.Apolytikion1.mode	@ltx/en_us_goadedes/miscellanea:misc.Mode4
ltx/en_us_goadedes/me.m01.d26:meVE.Apolytikion1.text	@ltx/en_us_goadedes/he.ga:heGA.OTheosTonPateronImon.text
ltx/en_us_goadedes/me.m01.d26:meVE.SticStavrotheotokion.greekmelody	@ltx/en_us_goadedes/he.a.m2:heAU.OteEkTouXylou.greekname
ltx/en_us_goadedes/me.m01.d26:meVE.SticStavrotheotokion.incipit	@ltx/en_us_goadedes/oc.m2.d4:ocVE.SticTheotokion.incipit
ltx/en_us_goadedes/me.m01.d26:meVE.SticStavrotheotokion.melody	@ltx/en_us_goadedes/he.a.m2:heAU.OteEkTouXylou.name
ltx/en_us_goadedes/me.m01.d26:meVE.SticStavrotheotokion.mode	@ltx/en_us_goadedes/miscellanea:misc.Mode2
ltx/en_us_goadedes/me.m01.d26:meVE.SticStavrotheotokion.text	@ltx/en_us_goadedes/oc.m2.d4:ocVE.SticTheotokion.text
ltx/en_us_goadedes/me.m01.d26:meVE.SticTheotokion.greekmelody	@ltx/en_us_goadedes/he.a.m2:heAU.OteEkTouXylou.greekname
ltx/en_us_goadedes/me.m01.d26:meVE.SticTheotokion.incipit	@ltx/en_us_goadedes/me.m01.d22:meVE.AposTheotokion.incipit
ltx/en_us_goadedes/me.m01.d26:meVE.SticTheotokion.melody	@ltx/en_us_goadedes/he.a.m2:heAU.OteEkTouXylou.name
ltx/en_us_goadedes/me.m01.d26:meVE.SticTheotokion.mode	@ltx/en_us_goadedes/miscellanea:misc.Mode2
ltx/en_us_goadedes/me.m01.d26:meVE.SticTheotokion.text	@ltx/en_us_goadedes/me.m01.d22:meVE.AposTheotokion.text
ltx/en_us_goadedes/me.m01.d26:meVE.Stichera01.greekmelody	@ltx/en_us_goadedes/he.a.m2:heAU.OteEkTouXylou.greekname
ltx/en_us_goadedes/me.m01.d26:meVE.Stichera01.incipit	…
ltx/en_us_goadedes/me.m01.d26:meVE.Stichera01.melody	@ltx/en_us_goadedes/he.a.m2:heAU.OteEkTouXylou.name
ltx/en_us_goadedes/me.m01.d26:meVE.Stichera01.mode	@ltx/en_us_goadedes/miscellanea:misc.Mode2
ltx/en_us_goadedes/me.m01.d26:meVE.Stichera01.text	
ltx/en_us_goadedes/me.m01.d26:meVE.Stichera02.incipit	…
ltx/en_us_goadedes/me.m01.d26:meVE.Stichera02.melody	@ltx/en_us_goadedes/he.a.m2:heAU.OteEkTouXylou.name
ltx/en_us_goadedes/me.m01.d26:meVE.Stichera02.mode	@ltx/en_us_goadedes/miscellanea:misc.Mode2
ltx/en_us_goadedes/me.m01.d26:meVE.Stichera02.text	
ltx/en_us_goadedes/me.m01.d26:meVE.Stichera03.incipit	…
ltx/en_us_goadedes/me.m01.d26:meVE.Stichera03.melody	@ltx/en_us_goadedes/he.a.m2:heAU.OteEkTouXylou.name
ltx/en_us_goadedes/me.m01.d26:meVE.Stichera03.mode	@ltx/en_us_goadedes/miscellanea:misc.Mode2
ltx/en_us_goadedes/me.m01.d26:meVE.Stichera03.text	
