ltx/en_us_goadedes/me.m01.d27:meDA.commemoration.first	
ltx/en_us_goadedes/me.m01.d27:meDA.commemoration.first_name	
ltx/en_us_goadedes/me.m01.d27:meDA.commemoration.first_short	
ltx/en_us_goadedes/me.m01.d27:meDA.commemoration.first_title	@ltx/en_us_goadedes/titles:ti.SaintM
ltx/en_us_goadedes/me.m01.d27:meDA.commemoration.full	
ltx/en_us_goadedes/me.m01.d27:meDA.commemoration.second_name	
ltx/en_us_goadedes/me.m01.d27:meDA.commemoration.second_title	
ltx/en_us_goadedes/me.m01.d27:meDA.date	
ltx/en_us_goadedes/me.m01.d27:meDA.fordate	
ltx/en_us_goadedes/me.m01.d27:meDA.insert1	
ltx/en_us_goadedes/me.m01.d27:meDA.insert2	
ltx/en_us_goadedes/me.m01.d27:meDA.note	
ltx/en_us_goadedes/me.m01.d27:meDA.pdfcoverdate	
ltx/en_us_goadedes/me.m01.d27:meDA.pdfheaderdate	
ltx/en_us_goadedes/me.m01.d27:meHO.commemorations	
ltx/en_us_goadedes/me.m01.d27:meHO.note1	@ltx/en_us_goadedes/rubrical:ru.HolidayWineOil
ltx/en_us_goadedes/me.m01.d27:meHO.note2	
ltx/en_us_goadedes/me.m01.d27:meHO.number	
ltx/en_us_goadedes/me.m01.d27:meHO.rank	
ltx/en_us_goadedes/me.m01.d27:meLE.commemoration1	
ltx/en_us_goadedes/me.m01.d27:meLE.commemoration2	
ltx/en_us_goadedes/me.m01.d27:meLI.Kontakion1.greekmelody	@ltx/en_us_goadedes/me.m01.d27:meMA.Kontakion1.greekmelody
ltx/en_us_goadedes/me.m01.d27:meLI.Kontakion1.incipit	@ltx/en_us_goadedes/me.m01.d27:meMA.Kontakion1.incipit
ltx/en_us_goadedes/me.m01.d27:meLI.Kontakion1.melody	@ltx/en_us_goadedes/me.m01.d27:meMA.Kontakion1.melody
ltx/en_us_goadedes/me.m01.d27:meLI.Kontakion1.mode	@ltx/en_us_goadedes/me.m01.d27:meMA.Kontakion1.mode
ltx/en_us_goadedes/me.m01.d27:meLI.Kontakion1.text	@ltx/en_us_goadedes/me.m01.d27:meMA.Kontakion1.text
ltx/en_us_goadedes/me.m01.d27:meLI.MM.CommunionHymn.text	@ltx/en_us_goadedes/properties:media.key
ltx/en_us_goadedes/me.m01.d27:meLI.Megalynarion.text	
ltx/en_us_goadedes/me.m01.d27:meMA.C1.acrostic.notice1	
ltx/en_us_goadedes/me.m01.d27:meMA.C1.acrostic.text	
ltx/en_us_goadedes/me.m01.d27:meMA.C1.acrostic.title	Canon for the Theotokos.
ltx/en_us_goadedes/me.m01.d27:meMA.C1.title	@ltx/en_us_goadedes/titles:ti.CanonTheotokos
ltx/en_us_goadedes/me.m01.d27:meMA.C1.verse	@ltx/en_us_goadedes/prayers:pr.verse_Theotokos.text
ltx/en_us_goadedes/me.m01.d27:meMA.C2.poet	@ltx/en_us_goadedes/poets:po.Theofanous
ltx/en_us_goadedes/me.m01.d27:meMA.C2.title	@ltx/en_us_goadedes/titles:ti.Canon1SaintM
ltx/en_us_goadedes/me.m01.d27:meMA.C2.verse	@ltx/en_us_goadedes/prayers:pr.verse_SaintM.text
ltx/en_us_goadedes/me.m01.d27:meMA.C3.acrostic.notice1	
ltx/en_us_goadedes/me.m01.d27:meMA.C3.acrostic.text	
ltx/en_us_goadedes/me.m01.d27:meMA.C3.acrostic.title	Another Canon for the Saint.
ltx/en_us_goadedes/me.m01.d27:meMA.C3.title	@ltx/en_us_goadedes/titles:ti.Canon2SaintM
ltx/en_us_goadedes/me.m01.d27:meMA.C3.verse	@ltx/en_us_goadedes/prayers:pr.verse_SaintM.text
ltx/en_us_goadedes/me.m01.d27:meMA.ExapTheotokion.incipit	…
ltx/en_us_goadedes/me.m01.d27:meMA.ExapTheotokion.melody	@ltx/en_us_goadedes/he.a.m2:heAU.GynaikesAkoutisthite.name
ltx/en_us_goadedes/me.m01.d27:meMA.ExapTheotokion.mode	@ltx/en_us_goadedes/miscellanea:misc.Mode2
ltx/en_us_goadedes/me.m01.d27:meMA.ExapTheotokion.text	
ltx/en_us_goadedes/me.m01.d27:meMA.Exaposteilarion1.greekmelody	@ltx/en_us_goadedes/he.a.m2:heAU.GynaikesAkoutisthite.greekname
ltx/en_us_goadedes/me.m01.d27:meMA.Exaposteilarion1.incipit	…
ltx/en_us_goadedes/me.m01.d27:meMA.Exaposteilarion1.melody	@ltx/en_us_goadedes/he.a.m2:heAU.GynaikesAkoutisthite.name
ltx/en_us_goadedes/me.m01.d27:meMA.Exaposteilarion1.mode	@ltx/en_us_goadedes/miscellanea:misc.Mode2
ltx/en_us_goadedes/me.m01.d27:meMA.Exaposteilarion1.text	
ltx/en_us_goadedes/me.m01.d27:meMA.Kathisma11.greekmelody	@ltx/en_us_goadedes/he.a.m1:heAU.TonTafonSouSotir.greekname
ltx/en_us_goadedes/me.m01.d27:meMA.Kathisma11.incipit	…
ltx/en_us_goadedes/me.m01.d27:meMA.Kathisma11.melody	@ltx/en_us_goadedes/he.a.m1:heAU.TonTafonSouSotir.name
ltx/en_us_goadedes/me.m01.d27:meMA.Kathisma11.mode	@ltx/en_us_goadedes/miscellanea:misc.Mode1
ltx/en_us_goadedes/me.m01.d27:meMA.Kathisma11.text	
ltx/en_us_goadedes/me.m01.d27:meMA.Kathisma1T.incipit	The miracle transcends mind and…
ltx/en_us_goadedes/me.m01.d27:meMA.Kathisma1T.melody	@ltx/en_us_goadedes/he.a.m1:heAU.TonTafonSouSotir.name
ltx/en_us_goadedes/me.m01.d27:meMA.Kathisma1T.mode	@ltx/en_us_goadedes/miscellanea:misc.Mode1
ltx/en_us_goadedes/me.m01.d27:meMA.Kathisma1T.text	The miracle transcends mind and thought, how you only * have seedlessly borne Christ, and are Virgin and Mother. * And therefore we glorify you as Mother of God and true * Theotokos, for you bore the King of glory. * Pray Him earnestly to grant His peace to the world * and also to save our souls.
ltx/en_us_goadedes/me.m01.d27:meMA.Kathisma21.greekmelody	@ltx/en_us_goadedes/he.a.m4:heAU.OYpsotheisEnToStavro.greekname
ltx/en_us_goadedes/me.m01.d27:meMA.Kathisma21.incipit	…
ltx/en_us_goadedes/me.m01.d27:meMA.Kathisma21.melody	@ltx/en_us_goadedes/he.a.m4:heAU.OYpsotheisEnToStavro.name
ltx/en_us_goadedes/me.m01.d27:meMA.Kathisma21.mode	@ltx/en_us_goadedes/miscellanea:misc.Mode4
ltx/en_us_goadedes/me.m01.d27:meMA.Kathisma21.text	
ltx/en_us_goadedes/me.m01.d27:meMA.Kathisma2T.incipit	@ltx/en_us_goadedes/me.m01.d21:meMA.Ode3KathismaT.incipit
ltx/en_us_goadedes/me.m01.d27:meMA.Kathisma2T.melody	@ltx/en_us_goadedes/he.a.m4:heAU.OYpsotheisEnToStavro.name
ltx/en_us_goadedes/me.m01.d27:meMA.Kathisma2T.mode	@ltx/en_us_goadedes/miscellanea:misc.Mode4
ltx/en_us_goadedes/me.m01.d27:meMA.Kathisma2T.text	@ltx/en_us_goadedes/me.m01.d21:meMA.Ode3KathismaT.text
ltx/en_us_goadedes/me.m01.d27:meMA.Kathisma31.greekmelody	@ltx/en_us_goadedes/he.a.m4:heAU.KateplagiIosif.greekname
ltx/en_us_goadedes/me.m01.d27:meMA.Kathisma31.incipit	…
ltx/en_us_goadedes/me.m01.d27:meMA.Kathisma31.melody	@ltx/en_us_goadedes/he.a.m4:heAU.KateplagiIosif.name
ltx/en_us_goadedes/me.m01.d27:meMA.Kathisma31.mode	@ltx/en_us_goadedes/miscellanea:misc.Mode4
ltx/en_us_goadedes/me.m01.d27:meMA.Kathisma31.text	
ltx/en_us_goadedes/me.m01.d27:meMA.Kathisma3T.incipit	@ltx/en_us_goadedes/he.a.m4:heAU.KateplagiIosif.incipit
ltx/en_us_goadedes/me.m01.d27:meMA.Kathisma3T.melody	@ltx/en_us_goadedes/he.a.m4:heAU.KateplagiIosif.melody
ltx/en_us_goadedes/me.m01.d27:meMA.Kathisma3T.mode	@ltx/en_us_goadedes/miscellanea:misc.Mode4
ltx/en_us_goadedes/me.m01.d27:meMA.Kathisma3T.text	@ltx/en_us_goadedes/he.a.m4:heAU.KateplagiIosif.text
ltx/en_us_goadedes/me.m01.d27:meMA.Kontakion1.greekmelody	@ltx/en_us_goadedes/he.a.m1:heAU.ChorosAngelikos.greekname
ltx/en_us_goadedes/me.m01.d27:meMA.Kontakion1.incipit	…
ltx/en_us_goadedes/me.m01.d27:meMA.Kontakion1.melody	@ltx/en_us_goadedes/he.a.m1:heAU.ChorosAngelikos.name
ltx/en_us_goadedes/me.m01.d27:meMA.Kontakion1.mode	@ltx/en_us_goadedes/miscellanea:misc.Mode1
ltx/en_us_goadedes/me.m01.d27:meMA.Kontakion1.text	
ltx/en_us_goadedes/me.m01.d27:meMA.Lauds1.greekmelody	@ltx/en_us_goadedes/he.a.m4:heAU.EdokasSimeiosin.greekname
ltx/en_us_goadedes/me.m01.d27:meMA.Lauds1.incipit	…
ltx/en_us_goadedes/me.m01.d27:meMA.Lauds1.melody	@ltx/en_us_goadedes/he.a.m4:heAU.EdokasSimeiosin.name
ltx/en_us_goadedes/me.m01.d27:meMA.Lauds1.mode	@ltx/en_us_goadedes/miscellanea:misc.Mode4
ltx/en_us_goadedes/me.m01.d27:meMA.Lauds1.text	
ltx/en_us_goadedes/me.m01.d27:meMA.Lauds2.incipit	…
ltx/en_us_goadedes/me.m01.d27:meMA.Lauds2.melody	@ltx/en_us_goadedes/he.a.m4:heAU.EdokasSimeiosin.name
ltx/en_us_goadedes/me.m01.d27:meMA.Lauds2.mode	@ltx/en_us_goadedes/miscellanea:misc.Mode4
ltx/en_us_goadedes/me.m01.d27:meMA.Lauds2.text	
ltx/en_us_goadedes/me.m01.d27:meMA.Lauds3.incipit	…
ltx/en_us_goadedes/me.m01.d27:meMA.Lauds3.melody	@ltx/en_us_goadedes/he.a.m4:heAU.EdokasSimeiosin.name
ltx/en_us_goadedes/me.m01.d27:meMA.Lauds3.mode	@ltx/en_us_goadedes/miscellanea:misc.Mode4
ltx/en_us_goadedes/me.m01.d27:meMA.Lauds3.text	
ltx/en_us_goadedes/me.m01.d27:meMA.Lauds4.greekmelody	@ltx/en_us_goadedes/he.a.m4:heAU.EdokasSimeiosin.greekname
ltx/en_us_goadedes/me.m01.d27:meMA.Lauds4.incipit	…
ltx/en_us_goadedes/me.m01.d27:meMA.Lauds4.melody	@ltx/en_us_goadedes/he.a.m4:heAU.EdokasSimeiosin.name
ltx/en_us_goadedes/me.m01.d27:meMA.Lauds4.mode	@ltx/en_us_goadedes/miscellanea:misc.Mode4
ltx/en_us_goadedes/me.m01.d27:meMA.Lauds4.text	
ltx/en_us_goadedes/me.m01.d27:meMA.LaudsGlory.incipit	…
ltx/en_us_goadedes/me.m01.d27:meMA.LaudsGlory.melody	
ltx/en_us_goadedes/me.m01.d27:meMA.LaudsGlory.mode	@ltx/en_us_goadedes/miscellanea:misc.Mode4
ltx/en_us_goadedes/me.m01.d27:meMA.LaudsGlory.poet	@ltx/en_us_goadedes/poets:po.Germanou
ltx/en_us_goadedes/me.m01.d27:meMA.LaudsGlory.text	
ltx/en_us_goadedes/me.m01.d27:meMA.LaudsTheotokion.incipit	@ltx/en_us_goadedes/oc.m4.d2:ocMA.AposTheotokion.incipit
ltx/en_us_goadedes/me.m01.d27:meMA.LaudsTheotokion.melody	
ltx/en_us_goadedes/me.m01.d27:meMA.LaudsTheotokion.mode	@ltx/en_us_goadedes/miscellanea:misc.Mode4
ltx/en_us_goadedes/me.m01.d27:meMA.LaudsTheotokion.text	@ltx/en_us_goadedes/oc.m4.d2:ocMA.AposTheotokion.text
ltx/en_us_goadedes/me.m01.d27:meMA.MM.Lauds1234as5678.text	@ltx/en_us_goadedes/properties:media.key
ltx/en_us_goadedes/me.m01.d27:meMA.Ode1C11.greekmelody	@ltx/en_us_goadedes/he.h.m8:heHE.ArmatilatinFarao.greekname
ltx/en_us_goadedes/me.m01.d27:meMA.Ode1C11.incipit	…
ltx/en_us_goadedes/me.m01.d27:meMA.Ode1C11.melody	@ltx/en_us_goadedes/he.h.m8:heHE.ArmatilatinFarao.name
ltx/en_us_goadedes/me.m01.d27:meMA.Ode1C11.mode	@ltx/en_us_goadedes/miscellanea:misc.Mode8
ltx/en_us_goadedes/me.m01.d27:meMA.Ode1C11.ode	@ltx/en_us_goadedes/miscellanea:misc.Ode1
ltx/en_us_goadedes/me.m01.d27:meMA.Ode1C11.text	
ltx/en_us_goadedes/me.m01.d27:meMA.Ode1C12.incipit	…
ltx/en_us_goadedes/me.m01.d27:meMA.Ode1C12.melody	@ltx/en_us_goadedes/he.h.m8:heHE.ArmatilatinFarao.name
ltx/en_us_goadedes/me.m01.d27:meMA.Ode1C12.mode	@ltx/en_us_goadedes/miscellanea:misc.Mode8
ltx/en_us_goadedes/me.m01.d27:meMA.Ode1C12.ode	@ltx/en_us_goadedes/miscellanea:misc.Ode1
ltx/en_us_goadedes/me.m01.d27:meMA.Ode1C12.text	
ltx/en_us_goadedes/me.m01.d27:meMA.Ode1C13.incipit	…
ltx/en_us_goadedes/me.m01.d27:meMA.Ode1C13.melody	@ltx/en_us_goadedes/he.h.m8:heHE.ArmatilatinFarao.name
ltx/en_us_goadedes/me.m01.d27:meMA.Ode1C13.mode	@ltx/en_us_goadedes/miscellanea:misc.Mode8
ltx/en_us_goadedes/me.m01.d27:meMA.Ode1C13.ode	@ltx/en_us_goadedes/miscellanea:misc.Ode1
ltx/en_us_goadedes/me.m01.d27:meMA.Ode1C13.text	
ltx/en_us_goadedes/me.m01.d27:meMA.Ode1C14.incipit	…
ltx/en_us_goadedes/me.m01.d27:meMA.Ode1C14.melody	@ltx/en_us_goadedes/he.h.m8:heHE.ArmatilatinFarao.name
ltx/en_us_goadedes/me.m01.d27:meMA.Ode1C14.mode	@ltx/en_us_goadedes/miscellanea:misc.Mode8
ltx/en_us_goadedes/me.m01.d27:meMA.Ode1C14.ode	@ltx/en_us_goadedes/miscellanea:misc.Ode1
ltx/en_us_goadedes/me.m01.d27:meMA.Ode1C14.text	
ltx/en_us_goadedes/me.m01.d27:meMA.Ode1C1H.greekmelody	@ltx/en_us_goadedes/he.h.m8:heHE.ArmatilatinFarao.greekname
ltx/en_us_goadedes/me.m01.d27:meMA.Ode1C1H.incipit	@ltx/en_us_goadedes/he.h.m8:heHE.ArmatilatinFarao.incipit
ltx/en_us_goadedes/me.m01.d27:meMA.Ode1C1H.melody	@ltx/en_us_goadedes/he.h.m8:heHE.ArmatilatinFarao.melody
ltx/en_us_goadedes/me.m01.d27:meMA.Ode1C1H.mode	@ltx/en_us_goadedes/miscellanea:misc.Mode8
ltx/en_us_goadedes/me.m01.d27:meMA.Ode1C1H.ode	@ltx/en_us_goadedes/miscellanea:misc.Ode1
ltx/en_us_goadedes/me.m01.d27:meMA.Ode1C1H.text	@ltx/en_us_goadedes/he.h.m8:heHE.ArmatilatinFarao.text
ltx/en_us_goadedes/me.m01.d27:meMA.Ode1C21.greekmelody	@ltx/en_us_goadedes/he.h.m8:heHE.AsmaAnapempsomen.greekname
ltx/en_us_goadedes/me.m01.d27:meMA.Ode1C21.incipit	…
ltx/en_us_goadedes/me.m01.d27:meMA.Ode1C21.melody	@ltx/en_us_goadedes/he.h.m8:heHE.AsmaAnapempsomen.name
ltx/en_us_goadedes/me.m01.d27:meMA.Ode1C21.mode	@ltx/en_us_goadedes/miscellanea:misc.Mode8
ltx/en_us_goadedes/me.m01.d27:meMA.Ode1C21.ode	@ltx/en_us_goadedes/miscellanea:misc.Ode1
ltx/en_us_goadedes/me.m01.d27:meMA.Ode1C21.text	
ltx/en_us_goadedes/me.m01.d27:meMA.Ode1C22.incipit	…
ltx/en_us_goadedes/me.m01.d27:meMA.Ode1C22.melody	@ltx/en_us_goadedes/he.h.m8:heHE.AsmaAnapempsomen.name
ltx/en_us_goadedes/me.m01.d27:meMA.Ode1C22.mode	@ltx/en_us_goadedes/miscellanea:misc.Mode8
ltx/en_us_goadedes/me.m01.d27:meMA.Ode1C22.ode	@ltx/en_us_goadedes/miscellanea:misc.Ode1
ltx/en_us_goadedes/me.m01.d27:meMA.Ode1C22.text	
ltx/en_us_goadedes/me.m01.d27:meMA.Ode1C23.incipit	…
ltx/en_us_goadedes/me.m01.d27:meMA.Ode1C23.melody	@ltx/en_us_goadedes/he.h.m8:heHE.AsmaAnapempsomen.name
ltx/en_us_goadedes/me.m01.d27:meMA.Ode1C23.mode	@ltx/en_us_goadedes/miscellanea:misc.Mode8
ltx/en_us_goadedes/me.m01.d27:meMA.Ode1C23.ode	@ltx/en_us_goadedes/miscellanea:misc.Ode1
ltx/en_us_goadedes/me.m01.d27:meMA.Ode1C23.text	
ltx/en_us_goadedes/me.m01.d27:meMA.Ode1C2T.incipit	…
ltx/en_us_goadedes/me.m01.d27:meMA.Ode1C2T.melody	@ltx/en_us_goadedes/he.h.m8:heHE.AsmaAnapempsomen.name
ltx/en_us_goadedes/me.m01.d27:meMA.Ode1C2T.mode	@ltx/en_us_goadedes/miscellanea:misc.Mode8
ltx/en_us_goadedes/me.m01.d27:meMA.Ode1C2T.ode	@ltx/en_us_goadedes/miscellanea:misc.Ode1
ltx/en_us_goadedes/me.m01.d27:meMA.Ode1C2T.text	
ltx/en_us_goadedes/me.m01.d27:meMA.Ode1C31.greekmelody	@ltx/en_us_goadedes/he.h.m3:heHE.OTaYdata.greekname
ltx/en_us_goadedes/me.m01.d27:meMA.Ode1C31.incipit	…
ltx/en_us_goadedes/me.m01.d27:meMA.Ode1C31.melody	@ltx/en_us_goadedes/he.h.m3:heHE.OTaYdata.name
ltx/en_us_goadedes/me.m01.d27:meMA.Ode1C31.mode	@ltx/en_us_goadedes/miscellanea:misc.Mode3
ltx/en_us_goadedes/me.m01.d27:meMA.Ode1C31.ode	@ltx/en_us_goadedes/miscellanea:misc.Ode1
ltx/en_us_goadedes/me.m01.d27:meMA.Ode1C31.text	
ltx/en_us_goadedes/me.m01.d27:meMA.Ode1C32.incipit	…
ltx/en_us_goadedes/me.m01.d27:meMA.Ode1C32.melody	@ltx/en_us_goadedes/he.h.m3:heHE.OTaYdata.name
ltx/en_us_goadedes/me.m01.d27:meMA.Ode1C32.mode	@ltx/en_us_goadedes/miscellanea:misc.Mode3
ltx/en_us_goadedes/me.m01.d27:meMA.Ode1C32.ode	@ltx/en_us_goadedes/miscellanea:misc.Ode1
ltx/en_us_goadedes/me.m01.d27:meMA.Ode1C32.text	
ltx/en_us_goadedes/me.m01.d27:meMA.Ode1C33.incipit	…
ltx/en_us_goadedes/me.m01.d27:meMA.Ode1C33.melody	@ltx/en_us_goadedes/he.h.m3:heHE.OTaYdata.name
ltx/en_us_goadedes/me.m01.d27:meMA.Ode1C33.mode	@ltx/en_us_goadedes/miscellanea:misc.Mode3
ltx/en_us_goadedes/me.m01.d27:meMA.Ode1C33.ode	@ltx/en_us_goadedes/miscellanea:misc.Ode1
ltx/en_us_goadedes/me.m01.d27:meMA.Ode1C33.text	
ltx/en_us_goadedes/me.m01.d27:meMA.Ode1C3T.incipit	…
ltx/en_us_goadedes/me.m01.d27:meMA.Ode1C3T.melody	@ltx/en_us_goadedes/he.h.m3:heHE.OTaYdata.name
ltx/en_us_goadedes/me.m01.d27:meMA.Ode1C3T.mode	@ltx/en_us_goadedes/miscellanea:misc.Mode3
ltx/en_us_goadedes/me.m01.d27:meMA.Ode1C3T.ode	@ltx/en_us_goadedes/miscellanea:misc.Ode1
ltx/en_us_goadedes/me.m01.d27:meMA.Ode1C3T.text	
ltx/en_us_goadedes/me.m01.d27:meMA.Ode3C11.greekmelody	@ltx/en_us_goadedes/he.h.m8:heHE.OuraniasApsidos.greekname
ltx/en_us_goadedes/me.m01.d27:meMA.Ode3C11.incipit	…
ltx/en_us_goadedes/me.m01.d27:meMA.Ode3C11.melody	@ltx/en_us_goadedes/he.h.m8:heHE.OuraniasApsidos.name
ltx/en_us_goadedes/me.m01.d27:meMA.Ode3C11.mode	@ltx/en_us_goadedes/miscellanea:misc.Mode8
ltx/en_us_goadedes/me.m01.d27:meMA.Ode3C11.ode	@ltx/en_us_goadedes/miscellanea:misc.Ode3
ltx/en_us_goadedes/me.m01.d27:meMA.Ode3C11.text	
ltx/en_us_goadedes/me.m01.d27:meMA.Ode3C12.incipit	…
ltx/en_us_goadedes/me.m01.d27:meMA.Ode3C12.melody	@ltx/en_us_goadedes/he.h.m8:heHE.OuraniasApsidos.name
ltx/en_us_goadedes/me.m01.d27:meMA.Ode3C12.mode	@ltx/en_us_goadedes/miscellanea:misc.Mode8
ltx/en_us_goadedes/me.m01.d27:meMA.Ode3C12.ode	@ltx/en_us_goadedes/miscellanea:misc.Ode3
ltx/en_us_goadedes/me.m01.d27:meMA.Ode3C12.text	
ltx/en_us_goadedes/me.m01.d27:meMA.Ode3C13.incipit	…
ltx/en_us_goadedes/me.m01.d27:meMA.Ode3C13.melody	@ltx/en_us_goadedes/he.h.m8:heHE.OuraniasApsidos.name
ltx/en_us_goadedes/me.m01.d27:meMA.Ode3C13.mode	@ltx/en_us_goadedes/miscellanea:misc.Mode8
ltx/en_us_goadedes/me.m01.d27:meMA.Ode3C13.ode	@ltx/en_us_goadedes/miscellanea:misc.Ode3
ltx/en_us_goadedes/me.m01.d27:meMA.Ode3C13.text	
ltx/en_us_goadedes/me.m01.d27:meMA.Ode3C14.incipit	…
ltx/en_us_goadedes/me.m01.d27:meMA.Ode3C14.melody	@ltx/en_us_goadedes/he.h.m8:heHE.OuraniasApsidos.name
ltx/en_us_goadedes/me.m01.d27:meMA.Ode3C14.mode	@ltx/en_us_goadedes/miscellanea:misc.Mode8
ltx/en_us_goadedes/me.m01.d27:meMA.Ode3C14.ode	@ltx/en_us_goadedes/miscellanea:misc.Ode3
ltx/en_us_goadedes/me.m01.d27:meMA.Ode3C14.text	
ltx/en_us_goadedes/me.m01.d27:meMA.Ode3C1H.greekmelody	@ltx/en_us_goadedes/he.h.m8:heHE.OuraniasApsidos.greekname
ltx/en_us_goadedes/me.m01.d27:meMA.Ode3C1H.incipit	@ltx/en_us_goadedes/he.h.m8:heHE.OuraniasApsidos.incipit
ltx/en_us_goadedes/me.m01.d27:meMA.Ode3C1H.melody	@ltx/en_us_goadedes/he.h.m8:heHE.OuraniasApsidos.melody
ltx/en_us_goadedes/me.m01.d27:meMA.Ode3C1H.mode	@ltx/en_us_goadedes/miscellanea:misc.Mode8
ltx/en_us_goadedes/me.m01.d27:meMA.Ode3C1H.ode	@ltx/en_us_goadedes/miscellanea:misc.Ode3
ltx/en_us_goadedes/me.m01.d27:meMA.Ode3C1H.text	@ltx/en_us_goadedes/he.h.m8:heHE.OuraniasApsidos.text
ltx/en_us_goadedes/me.m01.d27:meMA.Ode3C21.greekmelody	@ltx/en_us_goadedes/he.h.m8:heHE.OukEstinAgios.greekname
ltx/en_us_goadedes/me.m01.d27:meMA.Ode3C21.incipit	…
ltx/en_us_goadedes/me.m01.d27:meMA.Ode3C21.melody	@ltx/en_us_goadedes/he.h.m8:heHE.OukEstinAgios.name
ltx/en_us_goadedes/me.m01.d27:meMA.Ode3C21.mode	@ltx/en_us_goadedes/miscellanea:misc.Mode8
ltx/en_us_goadedes/me.m01.d27:meMA.Ode3C21.ode	@ltx/en_us_goadedes/miscellanea:misc.Ode3
ltx/en_us_goadedes/me.m01.d27:meMA.Ode3C21.text	
ltx/en_us_goadedes/me.m01.d27:meMA.Ode3C22.incipit	…
ltx/en_us_goadedes/me.m01.d27:meMA.Ode3C22.melody	@ltx/en_us_goadedes/he.h.m8:heHE.OukEstinAgios.name
ltx/en_us_goadedes/me.m01.d27:meMA.Ode3C22.mode	@ltx/en_us_goadedes/miscellanea:misc.Mode8
ltx/en_us_goadedes/me.m01.d27:meMA.Ode3C22.ode	@ltx/en_us_goadedes/miscellanea:misc.Ode3
ltx/en_us_goadedes/me.m01.d27:meMA.Ode3C22.text	
ltx/en_us_goadedes/me.m01.d27:meMA.Ode3C23.incipit	…
ltx/en_us_goadedes/me.m01.d27:meMA.Ode3C23.melody	@ltx/en_us_goadedes/he.h.m8:heHE.OukEstinAgios.name
ltx/en_us_goadedes/me.m01.d27:meMA.Ode3C23.mode	@ltx/en_us_goadedes/miscellanea:misc.Mode8
ltx/en_us_goadedes/me.m01.d27:meMA.Ode3C23.ode	@ltx/en_us_goadedes/miscellanea:misc.Ode3
ltx/en_us_goadedes/me.m01.d27:meMA.Ode3C23.text	
ltx/en_us_goadedes/me.m01.d27:meMA.Ode3C2T.incipit	…
ltx/en_us_goadedes/me.m01.d27:meMA.Ode3C2T.melody	@ltx/en_us_goadedes/he.h.m8:heHE.OukEstinAgios.name
ltx/en_us_goadedes/me.m01.d27:meMA.Ode3C2T.mode	@ltx/en_us_goadedes/miscellanea:misc.Mode8
ltx/en_us_goadedes/me.m01.d27:meMA.Ode3C2T.ode	@ltx/en_us_goadedes/miscellanea:misc.Ode3
ltx/en_us_goadedes/me.m01.d27:meMA.Ode3C2T.text	
ltx/en_us_goadedes/me.m01.d27:meMA.Ode3C31.greekmelody	@ltx/en_us_goadedes/he.h.m3:heHE.OEkMiOnton.greekname
ltx/en_us_goadedes/me.m01.d27:meMA.Ode3C31.incipit	…
ltx/en_us_goadedes/me.m01.d27:meMA.Ode3C31.melody	@ltx/en_us_goadedes/he.h.m3:heHE.OEkMiOnton.name
ltx/en_us_goadedes/me.m01.d27:meMA.Ode3C31.mode	@ltx/en_us_goadedes/miscellanea:misc.Mode3
ltx/en_us_goadedes/me.m01.d27:meMA.Ode3C31.ode	@ltx/en_us_goadedes/miscellanea:misc.Ode3
ltx/en_us_goadedes/me.m01.d27:meMA.Ode3C31.text	
ltx/en_us_goadedes/me.m01.d27:meMA.Ode3C32.incipit	…
ltx/en_us_goadedes/me.m01.d27:meMA.Ode3C32.melody	@ltx/en_us_goadedes/he.h.m3:heHE.OEkMiOnton.name
ltx/en_us_goadedes/me.m01.d27:meMA.Ode3C32.mode	@ltx/en_us_goadedes/miscellanea:misc.Mode3
ltx/en_us_goadedes/me.m01.d27:meMA.Ode3C32.ode	@ltx/en_us_goadedes/miscellanea:misc.Ode3
ltx/en_us_goadedes/me.m01.d27:meMA.Ode3C32.text	
ltx/en_us_goadedes/me.m01.d27:meMA.Ode3C33.incipit	…
ltx/en_us_goadedes/me.m01.d27:meMA.Ode3C33.melody	@ltx/en_us_goadedes/he.h.m3:heHE.OEkMiOnton.name
ltx/en_us_goadedes/me.m01.d27:meMA.Ode3C33.mode	@ltx/en_us_goadedes/miscellanea:misc.Mode3
ltx/en_us_goadedes/me.m01.d27:meMA.Ode3C33.ode	@ltx/en_us_goadedes/miscellanea:misc.Ode3
ltx/en_us_goadedes/me.m01.d27:meMA.Ode3C33.text	
ltx/en_us_goadedes/me.m01.d27:meMA.Ode3C3T.incipit	…
ltx/en_us_goadedes/me.m01.d27:meMA.Ode3C3T.melody	@ltx/en_us_goadedes/he.h.m3:heHE.OEkMiOnton.name
ltx/en_us_goadedes/me.m01.d27:meMA.Ode3C3T.mode	@ltx/en_us_goadedes/miscellanea:misc.Mode3
ltx/en_us_goadedes/me.m01.d27:meMA.Ode3C3T.ode	@ltx/en_us_goadedes/miscellanea:misc.Ode3
ltx/en_us_goadedes/me.m01.d27:meMA.Ode3C3T.text	
ltx/en_us_goadedes/me.m01.d27:meMA.Ode3Kathisma1.greekmelody	@ltx/en_us_goadedes/he.a.m8:heAU.TinSofianKaiLogon.greekname
ltx/en_us_goadedes/me.m01.d27:meMA.Ode3Kathisma1.incipit	…
ltx/en_us_goadedes/me.m01.d27:meMA.Ode3Kathisma1.melody	@ltx/en_us_goadedes/he.a.m8:heAU.TinSofianKaiLogon.name
ltx/en_us_goadedes/me.m01.d27:meMA.Ode3Kathisma1.mode	@ltx/en_us_goadedes/miscellanea:misc.Mode8
ltx/en_us_goadedes/me.m01.d27:meMA.Ode3Kathisma1.text	
ltx/en_us_goadedes/me.m01.d27:meMA.Ode3KathismaT.incipit	…
ltx/en_us_goadedes/me.m01.d27:meMA.Ode3KathismaT.melody	@ltx/en_us_goadedes/he.a.m8:heAU.TinSofianKaiLogon.name
ltx/en_us_goadedes/me.m01.d27:meMA.Ode3KathismaT.mode	@ltx/en_us_goadedes/miscellanea:misc.Mode8
ltx/en_us_goadedes/me.m01.d27:meMA.Ode3KathismaT.text	
ltx/en_us_goadedes/me.m01.d27:meMA.Ode4C11.greekmelody	@ltx/en_us_goadedes/he.h.m8:heHE.SyMouIschys.greekname
ltx/en_us_goadedes/me.m01.d27:meMA.Ode4C11.incipit	…
ltx/en_us_goadedes/me.m01.d27:meMA.Ode4C11.melody	@ltx/en_us_goadedes/he.h.m8:heHE.SyMouIschys.name
ltx/en_us_goadedes/me.m01.d27:meMA.Ode4C11.mode	@ltx/en_us_goadedes/miscellanea:misc.Mode8
ltx/en_us_goadedes/me.m01.d27:meMA.Ode4C11.ode	@ltx/en_us_goadedes/miscellanea:misc.Ode4
ltx/en_us_goadedes/me.m01.d27:meMA.Ode4C11.text	
ltx/en_us_goadedes/me.m01.d27:meMA.Ode4C12.incipit	…
ltx/en_us_goadedes/me.m01.d27:meMA.Ode4C12.melody	@ltx/en_us_goadedes/he.h.m8:heHE.SyMouIschys.name
ltx/en_us_goadedes/me.m01.d27:meMA.Ode4C12.mode	@ltx/en_us_goadedes/miscellanea:misc.Mode8
ltx/en_us_goadedes/me.m01.d27:meMA.Ode4C12.ode	@ltx/en_us_goadedes/miscellanea:misc.Ode4
ltx/en_us_goadedes/me.m01.d27:meMA.Ode4C12.text	
ltx/en_us_goadedes/me.m01.d27:meMA.Ode4C13.incipit	…
ltx/en_us_goadedes/me.m01.d27:meMA.Ode4C13.melody	@ltx/en_us_goadedes/he.h.m8:heHE.SyMouIschys.name
ltx/en_us_goadedes/me.m01.d27:meMA.Ode4C13.mode	@ltx/en_us_goadedes/miscellanea:misc.Mode8
ltx/en_us_goadedes/me.m01.d27:meMA.Ode4C13.ode	@ltx/en_us_goadedes/miscellanea:misc.Ode4
ltx/en_us_goadedes/me.m01.d27:meMA.Ode4C13.text	
ltx/en_us_goadedes/me.m01.d27:meMA.Ode4C14.incipit	…
ltx/en_us_goadedes/me.m01.d27:meMA.Ode4C14.melody	@ltx/en_us_goadedes/he.h.m8:heHE.SyMouIschys.name
ltx/en_us_goadedes/me.m01.d27:meMA.Ode4C14.mode	@ltx/en_us_goadedes/miscellanea:misc.Mode8
ltx/en_us_goadedes/me.m01.d27:meMA.Ode4C14.ode	@ltx/en_us_goadedes/miscellanea:misc.Ode4
ltx/en_us_goadedes/me.m01.d27:meMA.Ode4C14.text	
ltx/en_us_goadedes/me.m01.d27:meMA.Ode4C1H.greekmelody	@ltx/en_us_goadedes/he.h.m8:heHE.SyMouIschys.greekname
ltx/en_us_goadedes/me.m01.d27:meMA.Ode4C1H.incipit	@ltx/en_us_goadedes/he.h.m8:heHE.SyMouIschys.incipit
ltx/en_us_goadedes/me.m01.d27:meMA.Ode4C1H.melody	@ltx/en_us_goadedes/he.h.m8:heHE.SyMouIschys.melody
ltx/en_us_goadedes/me.m01.d27:meMA.Ode4C1H.mode	@ltx/en_us_goadedes/miscellanea:misc.Mode8
ltx/en_us_goadedes/me.m01.d27:meMA.Ode4C1H.ode	@ltx/en_us_goadedes/miscellanea:misc.Ode4
ltx/en_us_goadedes/me.m01.d27:meMA.Ode4C1H.text	@ltx/en_us_goadedes/he.h.m8:heHE.SyMouIschys.text
ltx/en_us_goadedes/me.m01.d27:meMA.Ode4C21.greekmelody	@ltx/en_us_goadedes/he.h.m8:heHE.ExOrousKataskiou.greekname
ltx/en_us_goadedes/me.m01.d27:meMA.Ode4C21.incipit	…
ltx/en_us_goadedes/me.m01.d27:meMA.Ode4C21.melody	@ltx/en_us_goadedes/he.h.m8:heHE.ExOrousKataskiou.name
ltx/en_us_goadedes/me.m01.d27:meMA.Ode4C21.mode	@ltx/en_us_goadedes/miscellanea:misc.Mode8
ltx/en_us_goadedes/me.m01.d27:meMA.Ode4C21.ode	@ltx/en_us_goadedes/miscellanea:misc.Ode4
ltx/en_us_goadedes/me.m01.d27:meMA.Ode4C21.text	
ltx/en_us_goadedes/me.m01.d27:meMA.Ode4C22.incipit	…
ltx/en_us_goadedes/me.m01.d27:meMA.Ode4C22.melody	@ltx/en_us_goadedes/he.h.m8:heHE.ExOrousKataskiou.name
ltx/en_us_goadedes/me.m01.d27:meMA.Ode4C22.mode	@ltx/en_us_goadedes/miscellanea:misc.Mode8
ltx/en_us_goadedes/me.m01.d27:meMA.Ode4C22.ode	@ltx/en_us_goadedes/miscellanea:misc.Ode4
ltx/en_us_goadedes/me.m01.d27:meMA.Ode4C22.text	
ltx/en_us_goadedes/me.m01.d27:meMA.Ode4C23.incipit	…
ltx/en_us_goadedes/me.m01.d27:meMA.Ode4C23.melody	@ltx/en_us_goadedes/he.h.m8:heHE.ExOrousKataskiou.name
ltx/en_us_goadedes/me.m01.d27:meMA.Ode4C23.mode	@ltx/en_us_goadedes/miscellanea:misc.Mode8
ltx/en_us_goadedes/me.m01.d27:meMA.Ode4C23.ode	@ltx/en_us_goadedes/miscellanea:misc.Ode4
ltx/en_us_goadedes/me.m01.d27:meMA.Ode4C23.text	
ltx/en_us_goadedes/me.m01.d27:meMA.Ode4C2T.incipit	…
ltx/en_us_goadedes/me.m01.d27:meMA.Ode4C2T.melody	@ltx/en_us_goadedes/he.h.m8:heHE.ExOrousKataskiou.name
ltx/en_us_goadedes/me.m01.d27:meMA.Ode4C2T.mode	@ltx/en_us_goadedes/miscellanea:misc.Mode8
ltx/en_us_goadedes/me.m01.d27:meMA.Ode4C2T.ode	@ltx/en_us_goadedes/miscellanea:misc.Ode4
ltx/en_us_goadedes/me.m01.d27:meMA.Ode4C2T.text	
ltx/en_us_goadedes/me.m01.d27:meMA.Ode4C31.greekmelody	@ltx/en_us_goadedes/he.h.m3:heHE.EthouProsImas.greekname
ltx/en_us_goadedes/me.m01.d27:meMA.Ode4C31.incipit	…
ltx/en_us_goadedes/me.m01.d27:meMA.Ode4C31.melody	@ltx/en_us_goadedes/he.h.m3:heHE.EthouProsImas.name
ltx/en_us_goadedes/me.m01.d27:meMA.Ode4C31.mode	@ltx/en_us_goadedes/miscellanea:misc.Mode3
ltx/en_us_goadedes/me.m01.d27:meMA.Ode4C31.ode	@ltx/en_us_goadedes/miscellanea:misc.Ode4
ltx/en_us_goadedes/me.m01.d27:meMA.Ode4C31.text	
ltx/en_us_goadedes/me.m01.d27:meMA.Ode4C32.incipit	…
ltx/en_us_goadedes/me.m01.d27:meMA.Ode4C32.melody	@ltx/en_us_goadedes/he.h.m3:heHE.EthouProsImas.name
ltx/en_us_goadedes/me.m01.d27:meMA.Ode4C32.mode	@ltx/en_us_goadedes/miscellanea:misc.Mode3
ltx/en_us_goadedes/me.m01.d27:meMA.Ode4C32.ode	@ltx/en_us_goadedes/miscellanea:misc.Ode4
ltx/en_us_goadedes/me.m01.d27:meMA.Ode4C32.text	
ltx/en_us_goadedes/me.m01.d27:meMA.Ode4C33.incipit	…
ltx/en_us_goadedes/me.m01.d27:meMA.Ode4C33.melody	@ltx/en_us_goadedes/he.h.m3:heHE.EthouProsImas.name
ltx/en_us_goadedes/me.m01.d27:meMA.Ode4C33.mode	@ltx/en_us_goadedes/miscellanea:misc.Mode3
ltx/en_us_goadedes/me.m01.d27:meMA.Ode4C33.ode	@ltx/en_us_goadedes/miscellanea:misc.Ode4
ltx/en_us_goadedes/me.m01.d27:meMA.Ode4C33.text	
ltx/en_us_goadedes/me.m01.d27:meMA.Ode4C3T.incipit	…
ltx/en_us_goadedes/me.m01.d27:meMA.Ode4C3T.melody	@ltx/en_us_goadedes/he.h.m3:heHE.EthouProsImas.name
ltx/en_us_goadedes/me.m01.d27:meMA.Ode4C3T.mode	@ltx/en_us_goadedes/miscellanea:misc.Mode3
ltx/en_us_goadedes/me.m01.d27:meMA.Ode4C3T.ode	@ltx/en_us_goadedes/miscellanea:misc.Ode4
ltx/en_us_goadedes/me.m01.d27:meMA.Ode4C3T.text	
ltx/en_us_goadedes/me.m01.d27:meMA.Ode5C11.greekmelody	@ltx/en_us_goadedes/he.h.m8:heHE.InaTiMeAposo.greekname
ltx/en_us_goadedes/me.m01.d27:meMA.Ode5C11.incipit	…
ltx/en_us_goadedes/me.m01.d27:meMA.Ode5C11.melody	@ltx/en_us_goadedes/he.h.m8:heHE.InaTiMeAposo.name
ltx/en_us_goadedes/me.m01.d27:meMA.Ode5C11.mode	@ltx/en_us_goadedes/miscellanea:misc.Mode8
ltx/en_us_goadedes/me.m01.d27:meMA.Ode5C11.ode	@ltx/en_us_goadedes/miscellanea:misc.Ode5
ltx/en_us_goadedes/me.m01.d27:meMA.Ode5C11.text	
ltx/en_us_goadedes/me.m01.d27:meMA.Ode5C12.incipit	…
ltx/en_us_goadedes/me.m01.d27:meMA.Ode5C12.melody	@ltx/en_us_goadedes/he.h.m8:heHE.InaTiMeAposo.name
ltx/en_us_goadedes/me.m01.d27:meMA.Ode5C12.mode	@ltx/en_us_goadedes/miscellanea:misc.Mode8
ltx/en_us_goadedes/me.m01.d27:meMA.Ode5C12.ode	@ltx/en_us_goadedes/miscellanea:misc.Ode5
ltx/en_us_goadedes/me.m01.d27:meMA.Ode5C12.text	
ltx/en_us_goadedes/me.m01.d27:meMA.Ode5C13.incipit	…
ltx/en_us_goadedes/me.m01.d27:meMA.Ode5C13.melody	@ltx/en_us_goadedes/he.h.m8:heHE.InaTiMeAposo.name
ltx/en_us_goadedes/me.m01.d27:meMA.Ode5C13.mode	@ltx/en_us_goadedes/miscellanea:misc.Mode8
ltx/en_us_goadedes/me.m01.d27:meMA.Ode5C13.ode	@ltx/en_us_goadedes/miscellanea:misc.Ode5
ltx/en_us_goadedes/me.m01.d27:meMA.Ode5C13.text	
ltx/en_us_goadedes/me.m01.d27:meMA.Ode5C14.incipit	…
ltx/en_us_goadedes/me.m01.d27:meMA.Ode5C14.melody	@ltx/en_us_goadedes/he.h.m8:heHE.InaTiMeAposo.name
ltx/en_us_goadedes/me.m01.d27:meMA.Ode5C14.mode	@ltx/en_us_goadedes/miscellanea:misc.Mode8
ltx/en_us_goadedes/me.m01.d27:meMA.Ode5C14.ode	@ltx/en_us_goadedes/miscellanea:misc.Ode5
ltx/en_us_goadedes/me.m01.d27:meMA.Ode5C14.text	
ltx/en_us_goadedes/me.m01.d27:meMA.Ode5C1H.greekmelody	@ltx/en_us_goadedes/he.h.m8:heHE.InaTiMeAposo.greekname
ltx/en_us_goadedes/me.m01.d27:meMA.Ode5C1H.incipit	@ltx/en_us_goadedes/he.h.m8:heHE.InaTiMeAposo.incipit
ltx/en_us_goadedes/me.m01.d27:meMA.Ode5C1H.melody	@ltx/en_us_goadedes/he.h.m8:heHE.InaTiMeAposo.melody
ltx/en_us_goadedes/me.m01.d27:meMA.Ode5C1H.mode	@ltx/en_us_goadedes/miscellanea:misc.Mode8
ltx/en_us_goadedes/me.m01.d27:meMA.Ode5C1H.ode	@ltx/en_us_goadedes/miscellanea:misc.Ode5
ltx/en_us_goadedes/me.m01.d27:meMA.Ode5C1H.text	@ltx/en_us_goadedes/he.h.m8:heHE.InaTiMeAposo.text
ltx/en_us_goadedes/me.m01.d27:meMA.Ode5C21.greekmelody	@ltx/en_us_goadedes/he.h.m8:heHE.OEkNyktosAgnoias.greekname
ltx/en_us_goadedes/me.m01.d27:meMA.Ode5C21.incipit	…
ltx/en_us_goadedes/me.m01.d27:meMA.Ode5C21.melody	@ltx/en_us_goadedes/he.h.m8:heHE.OEkNyktosAgnoias.name
ltx/en_us_goadedes/me.m01.d27:meMA.Ode5C21.mode	@ltx/en_us_goadedes/miscellanea:misc.Mode8
ltx/en_us_goadedes/me.m01.d27:meMA.Ode5C21.ode	@ltx/en_us_goadedes/miscellanea:misc.Ode5
ltx/en_us_goadedes/me.m01.d27:meMA.Ode5C21.text	
ltx/en_us_goadedes/me.m01.d27:meMA.Ode5C22.incipit	…
ltx/en_us_goadedes/me.m01.d27:meMA.Ode5C22.melody	@ltx/en_us_goadedes/he.h.m8:heHE.OEkNyktosAgnoias.name
ltx/en_us_goadedes/me.m01.d27:meMA.Ode5C22.mode	@ltx/en_us_goadedes/miscellanea:misc.Mode8
ltx/en_us_goadedes/me.m01.d27:meMA.Ode5C22.ode	@ltx/en_us_goadedes/miscellanea:misc.Ode5
ltx/en_us_goadedes/me.m01.d27:meMA.Ode5C22.text	
ltx/en_us_goadedes/me.m01.d27:meMA.Ode5C23.incipit	…
ltx/en_us_goadedes/me.m01.d27:meMA.Ode5C23.melody	@ltx/en_us_goadedes/he.h.m8:heHE.OEkNyktosAgnoias.name
ltx/en_us_goadedes/me.m01.d27:meMA.Ode5C23.mode	@ltx/en_us_goadedes/miscellanea:misc.Mode8
ltx/en_us_goadedes/me.m01.d27:meMA.Ode5C23.ode	@ltx/en_us_goadedes/miscellanea:misc.Ode5
ltx/en_us_goadedes/me.m01.d27:meMA.Ode5C23.text	
ltx/en_us_goadedes/me.m01.d27:meMA.Ode5C2T.incipit	…
ltx/en_us_goadedes/me.m01.d27:meMA.Ode5C2T.melody	@ltx/en_us_goadedes/he.h.m8:heHE.OEkNyktosAgnoias.name
ltx/en_us_goadedes/me.m01.d27:meMA.Ode5C2T.mode	@ltx/en_us_goadedes/miscellanea:misc.Mode8
ltx/en_us_goadedes/me.m01.d27:meMA.Ode5C2T.ode	@ltx/en_us_goadedes/miscellanea:misc.Ode5
ltx/en_us_goadedes/me.m01.d27:meMA.Ode5C2T.text	
ltx/en_us_goadedes/me.m01.d27:meMA.Ode5C31.greekmelody	@ltx/en_us_goadedes/he.h.m3:heHE.ProsSeOrthrizo.greekname
ltx/en_us_goadedes/me.m01.d27:meMA.Ode5C31.incipit	…
ltx/en_us_goadedes/me.m01.d27:meMA.Ode5C31.melody	@ltx/en_us_goadedes/he.h.m3:heHE.ProsSeOrthrizo.name
ltx/en_us_goadedes/me.m01.d27:meMA.Ode5C31.mode	@ltx/en_us_goadedes/miscellanea:misc.Mode3
ltx/en_us_goadedes/me.m01.d27:meMA.Ode5C31.ode	@ltx/en_us_goadedes/miscellanea:misc.Ode5
ltx/en_us_goadedes/me.m01.d27:meMA.Ode5C31.text	
ltx/en_us_goadedes/me.m01.d27:meMA.Ode5C32.incipit	…
ltx/en_us_goadedes/me.m01.d27:meMA.Ode5C32.melody	@ltx/en_us_goadedes/he.h.m3:heHE.ProsSeOrthrizo.name
ltx/en_us_goadedes/me.m01.d27:meMA.Ode5C32.mode	@ltx/en_us_goadedes/miscellanea:misc.Mode3
ltx/en_us_goadedes/me.m01.d27:meMA.Ode5C32.ode	@ltx/en_us_goadedes/miscellanea:misc.Ode5
ltx/en_us_goadedes/me.m01.d27:meMA.Ode5C32.text	
ltx/en_us_goadedes/me.m01.d27:meMA.Ode5C33.incipit	…
ltx/en_us_goadedes/me.m01.d27:meMA.Ode5C33.melody	@ltx/en_us_goadedes/he.h.m3:heHE.ProsSeOrthrizo.name
ltx/en_us_goadedes/me.m01.d27:meMA.Ode5C33.mode	@ltx/en_us_goadedes/miscellanea:misc.Mode3
ltx/en_us_goadedes/me.m01.d27:meMA.Ode5C33.ode	@ltx/en_us_goadedes/miscellanea:misc.Ode5
ltx/en_us_goadedes/me.m01.d27:meMA.Ode5C33.text	
ltx/en_us_goadedes/me.m01.d27:meMA.Ode5C3T.incipit	…
ltx/en_us_goadedes/me.m01.d27:meMA.Ode5C3T.melody	@ltx/en_us_goadedes/he.h.m3:heHE.ProsSeOrthrizo.name
ltx/en_us_goadedes/me.m01.d27:meMA.Ode5C3T.mode	@ltx/en_us_goadedes/miscellanea:misc.Mode3
ltx/en_us_goadedes/me.m01.d27:meMA.Ode5C3T.ode	@ltx/en_us_goadedes/miscellanea:misc.Ode5
ltx/en_us_goadedes/me.m01.d27:meMA.Ode5C3T.text	
ltx/en_us_goadedes/me.m01.d27:meMA.Ode6C11.greekmelody	@ltx/en_us_goadedes/he.h.m8:heHE.TinDeisinEkcheo.greekname
ltx/en_us_goadedes/me.m01.d27:meMA.Ode6C11.incipit	…
ltx/en_us_goadedes/me.m01.d27:meMA.Ode6C11.melody	@ltx/en_us_goadedes/he.h.m8:heHE.TinDeisinEkcheo.name
ltx/en_us_goadedes/me.m01.d27:meMA.Ode6C11.mode	@ltx/en_us_goadedes/miscellanea:misc.Mode8
ltx/en_us_goadedes/me.m01.d27:meMA.Ode6C11.ode	@ltx/en_us_goadedes/miscellanea:misc.Ode6
ltx/en_us_goadedes/me.m01.d27:meMA.Ode6C11.text	
ltx/en_us_goadedes/me.m01.d27:meMA.Ode6C12.incipit	…
ltx/en_us_goadedes/me.m01.d27:meMA.Ode6C12.melody	@ltx/en_us_goadedes/he.h.m8:heHE.TinDeisinEkcheo.name
ltx/en_us_goadedes/me.m01.d27:meMA.Ode6C12.mode	@ltx/en_us_goadedes/miscellanea:misc.Mode8
ltx/en_us_goadedes/me.m01.d27:meMA.Ode6C12.ode	@ltx/en_us_goadedes/miscellanea:misc.Ode6
ltx/en_us_goadedes/me.m01.d27:meMA.Ode6C12.text	
ltx/en_us_goadedes/me.m01.d27:meMA.Ode6C13.incipit	…
ltx/en_us_goadedes/me.m01.d27:meMA.Ode6C13.melody	@ltx/en_us_goadedes/he.h.m8:heHE.TinDeisinEkcheo.name
ltx/en_us_goadedes/me.m01.d27:meMA.Ode6C13.mode	@ltx/en_us_goadedes/miscellanea:misc.Mode8
ltx/en_us_goadedes/me.m01.d27:meMA.Ode6C13.ode	@ltx/en_us_goadedes/miscellanea:misc.Ode6
ltx/en_us_goadedes/me.m01.d27:meMA.Ode6C13.text	
ltx/en_us_goadedes/me.m01.d27:meMA.Ode6C14.incipit	…
ltx/en_us_goadedes/me.m01.d27:meMA.Ode6C14.melody	@ltx/en_us_goadedes/he.h.m8:heHE.TinDeisinEkcheo.name
ltx/en_us_goadedes/me.m01.d27:meMA.Ode6C14.mode	@ltx/en_us_goadedes/miscellanea:misc.Mode8
ltx/en_us_goadedes/me.m01.d27:meMA.Ode6C14.ode	@ltx/en_us_goadedes/miscellanea:misc.Ode6
ltx/en_us_goadedes/me.m01.d27:meMA.Ode6C14.text	
ltx/en_us_goadedes/me.m01.d27:meMA.Ode6C1H.greekmelody	@ltx/en_us_goadedes/he.h.m8:heHE.TinDeisinEkcheo.greekname
ltx/en_us_goadedes/me.m01.d27:meMA.Ode6C1H.incipit	@ltx/en_us_goadedes/he.h.m8:heHE.TinDeisinEkcheo.incipit
ltx/en_us_goadedes/me.m01.d27:meMA.Ode6C1H.melody	@ltx/en_us_goadedes/he.h.m8:heHE.TinDeisinEkcheo.melody
ltx/en_us_goadedes/me.m01.d27:meMA.Ode6C1H.mode	@ltx/en_us_goadedes/miscellanea:misc.Mode8
ltx/en_us_goadedes/me.m01.d27:meMA.Ode6C1H.ode	@ltx/en_us_goadedes/miscellanea:misc.Ode6
ltx/en_us_goadedes/me.m01.d27:meMA.Ode6C1H.text	@ltx/en_us_goadedes/he.h.m8:heHE.TinDeisinEkcheo.text
ltx/en_us_goadedes/me.m01.d27:meMA.Ode6C21.greekmelody	@ltx/en_us_goadedes/he.h.m8:heHE.OsTonProfitinErryso.greekname
ltx/en_us_goadedes/me.m01.d27:meMA.Ode6C21.incipit	…
ltx/en_us_goadedes/me.m01.d27:meMA.Ode6C21.melody	@ltx/en_us_goadedes/he.h.m8:heHE.OsTonProfitinErryso.name
ltx/en_us_goadedes/me.m01.d27:meMA.Ode6C21.mode	@ltx/en_us_goadedes/miscellanea:misc.Mode8
ltx/en_us_goadedes/me.m01.d27:meMA.Ode6C21.ode	@ltx/en_us_goadedes/miscellanea:misc.Ode6
ltx/en_us_goadedes/me.m01.d27:meMA.Ode6C21.text	
ltx/en_us_goadedes/me.m01.d27:meMA.Ode6C22.incipit	…
ltx/en_us_goadedes/me.m01.d27:meMA.Ode6C22.melody	@ltx/en_us_goadedes/he.h.m8:heHE.OsTonProfitinErryso.name
ltx/en_us_goadedes/me.m01.d27:meMA.Ode6C22.mode	@ltx/en_us_goadedes/miscellanea:misc.Mode8
ltx/en_us_goadedes/me.m01.d27:meMA.Ode6C22.ode	@ltx/en_us_goadedes/miscellanea:misc.Ode6
ltx/en_us_goadedes/me.m01.d27:meMA.Ode6C22.text	
ltx/en_us_goadedes/me.m01.d27:meMA.Ode6C23.incipit	…
ltx/en_us_goadedes/me.m01.d27:meMA.Ode6C23.melody	@ltx/en_us_goadedes/he.h.m8:heHE.OsTonProfitinErryso.name
ltx/en_us_goadedes/me.m01.d27:meMA.Ode6C23.mode	@ltx/en_us_goadedes/miscellanea:misc.Mode8
ltx/en_us_goadedes/me.m01.d27:meMA.Ode6C23.ode	@ltx/en_us_goadedes/miscellanea:misc.Ode6
ltx/en_us_goadedes/me.m01.d27:meMA.Ode6C23.text	
ltx/en_us_goadedes/me.m01.d27:meMA.Ode6C2T.incipit	…
ltx/en_us_goadedes/me.m01.d27:meMA.Ode6C2T.melody	@ltx/en_us_goadedes/he.h.m8:heHE.OsTonProfitinErryso.name
ltx/en_us_goadedes/me.m01.d27:meMA.Ode6C2T.mode	@ltx/en_us_goadedes/miscellanea:misc.Mode8
ltx/en_us_goadedes/me.m01.d27:meMA.Ode6C2T.ode	@ltx/en_us_goadedes/miscellanea:misc.Ode6
ltx/en_us_goadedes/me.m01.d27:meMA.Ode6C2T.text	
ltx/en_us_goadedes/me.m01.d27:meMA.Ode6C31.greekmelody	@ltx/en_us_goadedes/he.h.m3:heHE.AvyssosEschati.greekname
ltx/en_us_goadedes/me.m01.d27:meMA.Ode6C31.incipit	…
ltx/en_us_goadedes/me.m01.d27:meMA.Ode6C31.melody	@ltx/en_us_goadedes/he.h.m3:heHE.AvyssosEschati.name
ltx/en_us_goadedes/me.m01.d27:meMA.Ode6C31.mode	@ltx/en_us_goadedes/miscellanea:misc.Mode3
ltx/en_us_goadedes/me.m01.d27:meMA.Ode6C31.ode	@ltx/en_us_goadedes/miscellanea:misc.Ode6
ltx/en_us_goadedes/me.m01.d27:meMA.Ode6C31.text	
ltx/en_us_goadedes/me.m01.d27:meMA.Ode6C32.incipit	…
ltx/en_us_goadedes/me.m01.d27:meMA.Ode6C32.melody	@ltx/en_us_goadedes/he.h.m3:heHE.AvyssosEschati.name
ltx/en_us_goadedes/me.m01.d27:meMA.Ode6C32.mode	@ltx/en_us_goadedes/miscellanea:misc.Mode3
ltx/en_us_goadedes/me.m01.d27:meMA.Ode6C32.ode	@ltx/en_us_goadedes/miscellanea:misc.Ode6
ltx/en_us_goadedes/me.m01.d27:meMA.Ode6C32.text	
ltx/en_us_goadedes/me.m01.d27:meMA.Ode6C33.incipit	…
ltx/en_us_goadedes/me.m01.d27:meMA.Ode6C33.melody	@ltx/en_us_goadedes/he.h.m3:heHE.AvyssosEschati.name
ltx/en_us_goadedes/me.m01.d27:meMA.Ode6C33.mode	@ltx/en_us_goadedes/miscellanea:misc.Mode3
ltx/en_us_goadedes/me.m01.d27:meMA.Ode6C33.ode	@ltx/en_us_goadedes/miscellanea:misc.Ode6
ltx/en_us_goadedes/me.m01.d27:meMA.Ode6C33.text	
ltx/en_us_goadedes/me.m01.d27:meMA.Ode6C3T.incipit	…
ltx/en_us_goadedes/me.m01.d27:meMA.Ode6C3T.melody	@ltx/en_us_goadedes/he.h.m3:heHE.AvyssosEschati.name
ltx/en_us_goadedes/me.m01.d27:meMA.Ode6C3T.mode	@ltx/en_us_goadedes/miscellanea:misc.Mode3
ltx/en_us_goadedes/me.m01.d27:meMA.Ode6C3T.ode	@ltx/en_us_goadedes/miscellanea:misc.Ode6
ltx/en_us_goadedes/me.m01.d27:meMA.Ode6C3T.text	
ltx/en_us_goadedes/me.m01.d27:meMA.Ode7C11.greekmelody	@ltx/en_us_goadedes/he.h.m8:heHE.TheouSynkatavasin.greekname
ltx/en_us_goadedes/me.m01.d27:meMA.Ode7C11.incipit	…
ltx/en_us_goadedes/me.m01.d27:meMA.Ode7C11.melody	@ltx/en_us_goadedes/he.h.m8:heHE.TheouSynkatavasin.name
ltx/en_us_goadedes/me.m01.d27:meMA.Ode7C11.mode	@ltx/en_us_goadedes/miscellanea:misc.Mode8
ltx/en_us_goadedes/me.m01.d27:meMA.Ode7C11.ode	@ltx/en_us_goadedes/miscellanea:misc.Ode7
ltx/en_us_goadedes/me.m01.d27:meMA.Ode7C11.text	
ltx/en_us_goadedes/me.m01.d27:meMA.Ode7C12.incipit	…
ltx/en_us_goadedes/me.m01.d27:meMA.Ode7C12.melody	@ltx/en_us_goadedes/he.h.m8:heHE.TheouSynkatavasin.name
ltx/en_us_goadedes/me.m01.d27:meMA.Ode7C12.mode	@ltx/en_us_goadedes/miscellanea:misc.Mode8
ltx/en_us_goadedes/me.m01.d27:meMA.Ode7C12.ode	@ltx/en_us_goadedes/miscellanea:misc.Ode7
ltx/en_us_goadedes/me.m01.d27:meMA.Ode7C12.text	
ltx/en_us_goadedes/me.m01.d27:meMA.Ode7C13.incipit	…
ltx/en_us_goadedes/me.m01.d27:meMA.Ode7C13.melody	@ltx/en_us_goadedes/he.h.m8:heHE.TheouSynkatavasin.name
ltx/en_us_goadedes/me.m01.d27:meMA.Ode7C13.mode	@ltx/en_us_goadedes/miscellanea:misc.Mode8
ltx/en_us_goadedes/me.m01.d27:meMA.Ode7C13.ode	@ltx/en_us_goadedes/miscellanea:misc.Ode7
ltx/en_us_goadedes/me.m01.d27:meMA.Ode7C13.text	
ltx/en_us_goadedes/me.m01.d27:meMA.Ode7C14.incipit	…
ltx/en_us_goadedes/me.m01.d27:meMA.Ode7C14.melody	@ltx/en_us_goadedes/he.h.m8:heHE.TheouSynkatavasin.name
ltx/en_us_goadedes/me.m01.d27:meMA.Ode7C14.mode	@ltx/en_us_goadedes/miscellanea:misc.Mode8
ltx/en_us_goadedes/me.m01.d27:meMA.Ode7C14.ode	@ltx/en_us_goadedes/miscellanea:misc.Ode7
ltx/en_us_goadedes/me.m01.d27:meMA.Ode7C14.text	
ltx/en_us_goadedes/me.m01.d27:meMA.Ode7C1H.greekmelody	@ltx/en_us_goadedes/he.h.m8:heHE.TheouSynkatavasin.greekname
ltx/en_us_goadedes/me.m01.d27:meMA.Ode7C1H.incipit	@ltx/en_us_goadedes/he.h.m8:heHE.TheouSynkatavasin.incipit
ltx/en_us_goadedes/me.m01.d27:meMA.Ode7C1H.melody	@ltx/en_us_goadedes/he.h.m8:heHE.TheouSynkatavasin.melody
ltx/en_us_goadedes/me.m01.d27:meMA.Ode7C1H.mode	@ltx/en_us_goadedes/miscellanea:misc.Mode8
ltx/en_us_goadedes/me.m01.d27:meMA.Ode7C1H.ode	@ltx/en_us_goadedes/miscellanea:misc.Ode7
ltx/en_us_goadedes/me.m01.d27:meMA.Ode7C1H.text	@ltx/en_us_goadedes/he.h.m8:heHE.TheouSynkatavasin.text
ltx/en_us_goadedes/me.m01.d27:meMA.Ode7C21.greekmelody	@ltx/en_us_goadedes/he.h.m8:heHE.OTousPaidasDrosisas.greekname
ltx/en_us_goadedes/me.m01.d27:meMA.Ode7C21.incipit	…
ltx/en_us_goadedes/me.m01.d27:meMA.Ode7C21.melody	@ltx/en_us_goadedes/he.h.m8:heHE.OTousPaidasDrosisas.name
ltx/en_us_goadedes/me.m01.d27:meMA.Ode7C21.mode	@ltx/en_us_goadedes/miscellanea:misc.Mode8
ltx/en_us_goadedes/me.m01.d27:meMA.Ode7C21.ode	@ltx/en_us_goadedes/miscellanea:misc.Ode7
ltx/en_us_goadedes/me.m01.d27:meMA.Ode7C21.text	
ltx/en_us_goadedes/me.m01.d27:meMA.Ode7C22.incipit	…
ltx/en_us_goadedes/me.m01.d27:meMA.Ode7C22.melody	@ltx/en_us_goadedes/he.h.m8:heHE.OTousPaidasDrosisas.name
ltx/en_us_goadedes/me.m01.d27:meMA.Ode7C22.mode	@ltx/en_us_goadedes/miscellanea:misc.Mode8
ltx/en_us_goadedes/me.m01.d27:meMA.Ode7C22.ode	@ltx/en_us_goadedes/miscellanea:misc.Ode7
ltx/en_us_goadedes/me.m01.d27:meMA.Ode7C22.text	
ltx/en_us_goadedes/me.m01.d27:meMA.Ode7C23.incipit	…
ltx/en_us_goadedes/me.m01.d27:meMA.Ode7C23.melody	@ltx/en_us_goadedes/he.h.m8:heHE.OTousPaidasDrosisas.name
ltx/en_us_goadedes/me.m01.d27:meMA.Ode7C23.mode	@ltx/en_us_goadedes/miscellanea:misc.Mode8
ltx/en_us_goadedes/me.m01.d27:meMA.Ode7C23.ode	@ltx/en_us_goadedes/miscellanea:misc.Ode7
ltx/en_us_goadedes/me.m01.d27:meMA.Ode7C23.text	
ltx/en_us_goadedes/me.m01.d27:meMA.Ode7C2T.incipit	…
ltx/en_us_goadedes/me.m01.d27:meMA.Ode7C2T.melody	@ltx/en_us_goadedes/he.h.m8:heHE.OTousPaidasDrosisas.name
ltx/en_us_goadedes/me.m01.d27:meMA.Ode7C2T.mode	@ltx/en_us_goadedes/miscellanea:misc.Mode8
ltx/en_us_goadedes/me.m01.d27:meMA.Ode7C2T.ode	@ltx/en_us_goadedes/miscellanea:misc.Ode7
ltx/en_us_goadedes/me.m01.d27:meMA.Ode7C2T.text	
ltx/en_us_goadedes/me.m01.d27:meMA.Ode7C31.greekmelody	@ltx/en_us_goadedes/he.h.m3:heHE.OsPalaiTousEfseveis.greekname
ltx/en_us_goadedes/me.m01.d27:meMA.Ode7C31.incipit	…
ltx/en_us_goadedes/me.m01.d27:meMA.Ode7C31.melody	@ltx/en_us_goadedes/he.h.m3:heHE.OsPalaiTousEfseveis.name
ltx/en_us_goadedes/me.m01.d27:meMA.Ode7C31.mode	@ltx/en_us_goadedes/miscellanea:misc.Mode3
ltx/en_us_goadedes/me.m01.d27:meMA.Ode7C31.ode	@ltx/en_us_goadedes/miscellanea:misc.Ode7
ltx/en_us_goadedes/me.m01.d27:meMA.Ode7C31.text	
ltx/en_us_goadedes/me.m01.d27:meMA.Ode7C32.incipit	…
ltx/en_us_goadedes/me.m01.d27:meMA.Ode7C32.melody	@ltx/en_us_goadedes/he.h.m3:heHE.OsPalaiTousEfseveis.name
ltx/en_us_goadedes/me.m01.d27:meMA.Ode7C32.mode	@ltx/en_us_goadedes/miscellanea:misc.Mode3
ltx/en_us_goadedes/me.m01.d27:meMA.Ode7C32.ode	@ltx/en_us_goadedes/miscellanea:misc.Ode7
ltx/en_us_goadedes/me.m01.d27:meMA.Ode7C32.text	
ltx/en_us_goadedes/me.m01.d27:meMA.Ode7C33.incipit	…
ltx/en_us_goadedes/me.m01.d27:meMA.Ode7C33.melody	@ltx/en_us_goadedes/he.h.m3:heHE.OsPalaiTousEfseveis.name
ltx/en_us_goadedes/me.m01.d27:meMA.Ode7C33.mode	@ltx/en_us_goadedes/miscellanea:misc.Mode3
ltx/en_us_goadedes/me.m01.d27:meMA.Ode7C33.ode	@ltx/en_us_goadedes/miscellanea:misc.Ode7
ltx/en_us_goadedes/me.m01.d27:meMA.Ode7C33.text	
ltx/en_us_goadedes/me.m01.d27:meMA.Ode7C3T.incipit	…
ltx/en_us_goadedes/me.m01.d27:meMA.Ode7C3T.melody	@ltx/en_us_goadedes/he.h.m3:heHE.OsPalaiTousEfseveis.name
ltx/en_us_goadedes/me.m01.d27:meMA.Ode7C3T.mode	@ltx/en_us_goadedes/miscellanea:misc.Mode3
ltx/en_us_goadedes/me.m01.d27:meMA.Ode7C3T.ode	@ltx/en_us_goadedes/miscellanea:misc.Ode7
ltx/en_us_goadedes/me.m01.d27:meMA.Ode7C3T.text	
ltx/en_us_goadedes/me.m01.d27:meMA.Ode8C11.greekmelody	@ltx/en_us_goadedes/he.h.m8:heHE.EvlogeitePaides.greekname
ltx/en_us_goadedes/me.m01.d27:meMA.Ode8C11.incipit	…
ltx/en_us_goadedes/me.m01.d27:meMA.Ode8C11.melody	@ltx/en_us_goadedes/he.h.m8:heHE.EvlogeitePaides.name
ltx/en_us_goadedes/me.m01.d27:meMA.Ode8C11.mode	@ltx/en_us_goadedes/miscellanea:misc.Mode8
ltx/en_us_goadedes/me.m01.d27:meMA.Ode8C11.ode	@ltx/en_us_goadedes/miscellanea:misc.Ode8
ltx/en_us_goadedes/me.m01.d27:meMA.Ode8C11.text	
ltx/en_us_goadedes/me.m01.d27:meMA.Ode8C12.incipit	…
ltx/en_us_goadedes/me.m01.d27:meMA.Ode8C12.melody	@ltx/en_us_goadedes/he.h.m8:heHE.EvlogeitePaides.name
ltx/en_us_goadedes/me.m01.d27:meMA.Ode8C12.mode	@ltx/en_us_goadedes/miscellanea:misc.Mode8
ltx/en_us_goadedes/me.m01.d27:meMA.Ode8C12.ode	@ltx/en_us_goadedes/miscellanea:misc.Ode8
ltx/en_us_goadedes/me.m01.d27:meMA.Ode8C12.text	
ltx/en_us_goadedes/me.m01.d27:meMA.Ode8C13.incipit	…
ltx/en_us_goadedes/me.m01.d27:meMA.Ode8C13.melody	@ltx/en_us_goadedes/he.h.m8:heHE.EvlogeitePaides.name
ltx/en_us_goadedes/me.m01.d27:meMA.Ode8C13.mode	@ltx/en_us_goadedes/miscellanea:misc.Mode8
ltx/en_us_goadedes/me.m01.d27:meMA.Ode8C13.ode	@ltx/en_us_goadedes/miscellanea:misc.Ode8
ltx/en_us_goadedes/me.m01.d27:meMA.Ode8C13.text	
ltx/en_us_goadedes/me.m01.d27:meMA.Ode8C14.incipit	…
ltx/en_us_goadedes/me.m01.d27:meMA.Ode8C14.melody	@ltx/en_us_goadedes/he.h.m8:heHE.EvlogeitePaides.name
ltx/en_us_goadedes/me.m01.d27:meMA.Ode8C14.mode	@ltx/en_us_goadedes/miscellanea:misc.Mode8
ltx/en_us_goadedes/me.m01.d27:meMA.Ode8C14.ode	@ltx/en_us_goadedes/miscellanea:misc.Ode8
ltx/en_us_goadedes/me.m01.d27:meMA.Ode8C14.text	
ltx/en_us_goadedes/me.m01.d27:meMA.Ode8C1H.greekmelody	@ltx/en_us_goadedes/he.h.m8:heHE.EvlogeitePaides.greekname
ltx/en_us_goadedes/me.m01.d27:meMA.Ode8C1H.incipit	@ltx/en_us_goadedes/he.h.m8:heHE.EvlogeitePaides.incipit
ltx/en_us_goadedes/me.m01.d27:meMA.Ode8C1H.melody	@ltx/en_us_goadedes/he.h.m8:heHE.EvlogeitePaides.melody
ltx/en_us_goadedes/me.m01.d27:meMA.Ode8C1H.mode	@ltx/en_us_goadedes/miscellanea:misc.Mode8
ltx/en_us_goadedes/me.m01.d27:meMA.Ode8C1H.ode	@ltx/en_us_goadedes/miscellanea:misc.Ode8
ltx/en_us_goadedes/me.m01.d27:meMA.Ode8C1H.text	@ltx/en_us_goadedes/he.h.m8:heHE.EvlogeitePaides.text
ltx/en_us_goadedes/me.m01.d27:meMA.Ode8C21.greekmelody	@ltx/en_us_goadedes/he.h.m8:heHE.OiTheorrimonesPaides.greekname
ltx/en_us_goadedes/me.m01.d27:meMA.Ode8C21.incipit	…
ltx/en_us_goadedes/me.m01.d27:meMA.Ode8C21.melody	@ltx/en_us_goadedes/he.h.m8:heHE.OiTheorrimonesPaides.name
ltx/en_us_goadedes/me.m01.d27:meMA.Ode8C21.mode	@ltx/en_us_goadedes/miscellanea:misc.Mode8
ltx/en_us_goadedes/me.m01.d27:meMA.Ode8C21.ode	@ltx/en_us_goadedes/miscellanea:misc.Ode8
ltx/en_us_goadedes/me.m01.d27:meMA.Ode8C21.text	
ltx/en_us_goadedes/me.m01.d27:meMA.Ode8C22.incipit	…
ltx/en_us_goadedes/me.m01.d27:meMA.Ode8C22.melody	@ltx/en_us_goadedes/he.h.m8:heHE.OiTheorrimonesPaides.name
ltx/en_us_goadedes/me.m01.d27:meMA.Ode8C22.mode	@ltx/en_us_goadedes/miscellanea:misc.Mode8
ltx/en_us_goadedes/me.m01.d27:meMA.Ode8C22.ode	@ltx/en_us_goadedes/miscellanea:misc.Ode8
ltx/en_us_goadedes/me.m01.d27:meMA.Ode8C22.text	
ltx/en_us_goadedes/me.m01.d27:meMA.Ode8C23.incipit	…
ltx/en_us_goadedes/me.m01.d27:meMA.Ode8C23.melody	@ltx/en_us_goadedes/he.h.m8:heHE.OiTheorrimonesPaides.name
ltx/en_us_goadedes/me.m01.d27:meMA.Ode8C23.mode	@ltx/en_us_goadedes/miscellanea:misc.Mode8
ltx/en_us_goadedes/me.m01.d27:meMA.Ode8C23.ode	@ltx/en_us_goadedes/miscellanea:misc.Ode8
ltx/en_us_goadedes/me.m01.d27:meMA.Ode8C23.text	
ltx/en_us_goadedes/me.m01.d27:meMA.Ode8C2T.incipit	…
ltx/en_us_goadedes/me.m01.d27:meMA.Ode8C2T.melody	@ltx/en_us_goadedes/he.h.m8:heHE.OiTheorrimonesPaides.name
ltx/en_us_goadedes/me.m01.d27:meMA.Ode8C2T.mode	@ltx/en_us_goadedes/miscellanea:misc.Mode8
ltx/en_us_goadedes/me.m01.d27:meMA.Ode8C2T.ode	@ltx/en_us_goadedes/miscellanea:misc.Ode8
ltx/en_us_goadedes/me.m01.d27:meMA.Ode8C2T.text	
ltx/en_us_goadedes/me.m01.d27:meMA.Ode8C31.greekmelody	@ltx/en_us_goadedes/he.h.m3:heHE.AstektoPyri.greekname
ltx/en_us_goadedes/me.m01.d27:meMA.Ode8C31.incipit	…
ltx/en_us_goadedes/me.m01.d27:meMA.Ode8C31.melody	@ltx/en_us_goadedes/he.h.m3:heHE.AstektoPyri.name
ltx/en_us_goadedes/me.m01.d27:meMA.Ode8C31.mode	@ltx/en_us_goadedes/miscellanea:misc.Mode3
ltx/en_us_goadedes/me.m01.d27:meMA.Ode8C31.ode	@ltx/en_us_goadedes/miscellanea:misc.Ode8
ltx/en_us_goadedes/me.m01.d27:meMA.Ode8C31.text	
ltx/en_us_goadedes/me.m01.d27:meMA.Ode8C32.incipit	…
ltx/en_us_goadedes/me.m01.d27:meMA.Ode8C32.melody	@ltx/en_us_goadedes/he.h.m3:heHE.AstektoPyri.name
ltx/en_us_goadedes/me.m01.d27:meMA.Ode8C32.mode	@ltx/en_us_goadedes/miscellanea:misc.Mode3
ltx/en_us_goadedes/me.m01.d27:meMA.Ode8C32.ode	@ltx/en_us_goadedes/miscellanea:misc.Ode8
ltx/en_us_goadedes/me.m01.d27:meMA.Ode8C32.text	
ltx/en_us_goadedes/me.m01.d27:meMA.Ode8C33.incipit	…
ltx/en_us_goadedes/me.m01.d27:meMA.Ode8C33.melody	@ltx/en_us_goadedes/he.h.m3:heHE.AstektoPyri.name
ltx/en_us_goadedes/me.m01.d27:meMA.Ode8C33.mode	@ltx/en_us_goadedes/miscellanea:misc.Mode3
ltx/en_us_goadedes/me.m01.d27:meMA.Ode8C33.ode	@ltx/en_us_goadedes/miscellanea:misc.Ode8
ltx/en_us_goadedes/me.m01.d27:meMA.Ode8C33.text	
ltx/en_us_goadedes/me.m01.d27:meMA.Ode8C3T.incipit	…
ltx/en_us_goadedes/me.m01.d27:meMA.Ode8C3T.melody	@ltx/en_us_goadedes/he.h.m3:heHE.AstektoPyri.name
ltx/en_us_goadedes/me.m01.d27:meMA.Ode8C3T.mode	@ltx/en_us_goadedes/miscellanea:misc.Mode3
ltx/en_us_goadedes/me.m01.d27:meMA.Ode8C3T.ode	@ltx/en_us_goadedes/miscellanea:misc.Ode8
ltx/en_us_goadedes/me.m01.d27:meMA.Ode8C3T.text	
ltx/en_us_goadedes/me.m01.d27:meMA.Ode9C11.greekmelody	@ltx/en_us_goadedes/he.h.m8:heHE.EfrixePasaAkoi.greekname
ltx/en_us_goadedes/me.m01.d27:meMA.Ode9C11.incipit	…
ltx/en_us_goadedes/me.m01.d27:meMA.Ode9C11.melody	@ltx/en_us_goadedes/he.h.m8:heHE.EfrixePasaAkoi.name
ltx/en_us_goadedes/me.m01.d27:meMA.Ode9C11.mode	@ltx/en_us_goadedes/miscellanea:misc.Mode8
ltx/en_us_goadedes/me.m01.d27:meMA.Ode9C11.ode	@ltx/en_us_goadedes/miscellanea:misc.Ode9
ltx/en_us_goadedes/me.m01.d27:meMA.Ode9C11.text	
ltx/en_us_goadedes/me.m01.d27:meMA.Ode9C12.incipit	…
ltx/en_us_goadedes/me.m01.d27:meMA.Ode9C12.melody	@ltx/en_us_goadedes/he.h.m8:heHE.EfrixePasaAkoi.name
ltx/en_us_goadedes/me.m01.d27:meMA.Ode9C12.mode	@ltx/en_us_goadedes/miscellanea:misc.Mode8
ltx/en_us_goadedes/me.m01.d27:meMA.Ode9C12.ode	@ltx/en_us_goadedes/miscellanea:misc.Ode9
ltx/en_us_goadedes/me.m01.d27:meMA.Ode9C12.text	
ltx/en_us_goadedes/me.m01.d27:meMA.Ode9C13.incipit	…
ltx/en_us_goadedes/me.m01.d27:meMA.Ode9C13.melody	@ltx/en_us_goadedes/he.h.m8:heHE.EfrixePasaAkoi.name
ltx/en_us_goadedes/me.m01.d27:meMA.Ode9C13.mode	@ltx/en_us_goadedes/miscellanea:misc.Mode8
ltx/en_us_goadedes/me.m01.d27:meMA.Ode9C13.ode	@ltx/en_us_goadedes/miscellanea:misc.Ode9
ltx/en_us_goadedes/me.m01.d27:meMA.Ode9C13.text	
ltx/en_us_goadedes/me.m01.d27:meMA.Ode9C14.incipit	…
ltx/en_us_goadedes/me.m01.d27:meMA.Ode9C14.melody	@ltx/en_us_goadedes/he.h.m8:heHE.EfrixePasaAkoi.name
ltx/en_us_goadedes/me.m01.d27:meMA.Ode9C14.mode	@ltx/en_us_goadedes/miscellanea:misc.Mode8
ltx/en_us_goadedes/me.m01.d27:meMA.Ode9C14.ode	@ltx/en_us_goadedes/miscellanea:misc.Ode9
ltx/en_us_goadedes/me.m01.d27:meMA.Ode9C14.text	
ltx/en_us_goadedes/me.m01.d27:meMA.Ode9C1H.greekmelody	@ltx/en_us_goadedes/he.h.m8:heHE.EfrixePasaAkoi.greekname
ltx/en_us_goadedes/me.m01.d27:meMA.Ode9C1H.incipit	@ltx/en_us_goadedes/he.h.m8:heHE.EfrixePasaAkoi.incipit
ltx/en_us_goadedes/me.m01.d27:meMA.Ode9C1H.melody	@ltx/en_us_goadedes/he.h.m8:heHE.EfrixePasaAkoi.melody
ltx/en_us_goadedes/me.m01.d27:meMA.Ode9C1H.mode	@ltx/en_us_goadedes/miscellanea:misc.Mode8
ltx/en_us_goadedes/me.m01.d27:meMA.Ode9C1H.ode	@ltx/en_us_goadedes/miscellanea:misc.Ode9
ltx/en_us_goadedes/me.m01.d27:meMA.Ode9C1H.text	@ltx/en_us_goadedes/he.h.m8:heHE.EfrixePasaAkoi.text
ltx/en_us_goadedes/me.m01.d27:meMA.Ode9C21.greekmelody	@ltx/en_us_goadedes/he.h.m8:heHE.TonProdilothenta.greekname
ltx/en_us_goadedes/me.m01.d27:meMA.Ode9C21.incipit	…
ltx/en_us_goadedes/me.m01.d27:meMA.Ode9C21.melody	@ltx/en_us_goadedes/he.h.m8:heHE.TonProdilothenta.name
ltx/en_us_goadedes/me.m01.d27:meMA.Ode9C21.mode	@ltx/en_us_goadedes/miscellanea:misc.Mode8
ltx/en_us_goadedes/me.m01.d27:meMA.Ode9C21.ode	@ltx/en_us_goadedes/miscellanea:misc.Ode9
ltx/en_us_goadedes/me.m01.d27:meMA.Ode9C21.text	
ltx/en_us_goadedes/me.m01.d27:meMA.Ode9C22.incipit	…
ltx/en_us_goadedes/me.m01.d27:meMA.Ode9C22.melody	@ltx/en_us_goadedes/he.h.m8:heHE.TonProdilothenta.name
ltx/en_us_goadedes/me.m01.d27:meMA.Ode9C22.mode	@ltx/en_us_goadedes/miscellanea:misc.Mode8
ltx/en_us_goadedes/me.m01.d27:meMA.Ode9C22.ode	@ltx/en_us_goadedes/miscellanea:misc.Ode9
ltx/en_us_goadedes/me.m01.d27:meMA.Ode9C22.text	
ltx/en_us_goadedes/me.m01.d27:meMA.Ode9C23.incipit	…
ltx/en_us_goadedes/me.m01.d27:meMA.Ode9C23.melody	@ltx/en_us_goadedes/he.h.m8:heHE.TonProdilothenta.name
ltx/en_us_goadedes/me.m01.d27:meMA.Ode9C23.mode	@ltx/en_us_goadedes/miscellanea:misc.Mode8
ltx/en_us_goadedes/me.m01.d27:meMA.Ode9C23.ode	@ltx/en_us_goadedes/miscellanea:misc.Ode9
ltx/en_us_goadedes/me.m01.d27:meMA.Ode9C23.text	
ltx/en_us_goadedes/me.m01.d27:meMA.Ode9C2T.incipit	…
ltx/en_us_goadedes/me.m01.d27:meMA.Ode9C2T.melody	@ltx/en_us_goadedes/he.h.m8:heHE.TonProdilothenta.name
ltx/en_us_goadedes/me.m01.d27:meMA.Ode9C2T.mode	@ltx/en_us_goadedes/miscellanea:misc.Mode8
ltx/en_us_goadedes/me.m01.d27:meMA.Ode9C2T.ode	@ltx/en_us_goadedes/miscellanea:misc.Ode9
ltx/en_us_goadedes/me.m01.d27:meMA.Ode9C2T.text	
ltx/en_us_goadedes/me.m01.d27:meMA.Ode9C31.greekmelody	@ltx/en_us_goadedes/he.h.m3:heHE.KainonToThavma.greekname
ltx/en_us_goadedes/me.m01.d27:meMA.Ode9C31.incipit	…
ltx/en_us_goadedes/me.m01.d27:meMA.Ode9C31.melody	@ltx/en_us_goadedes/he.h.m3:heHE.KainonToThavma.name
ltx/en_us_goadedes/me.m01.d27:meMA.Ode9C31.mode	@ltx/en_us_goadedes/miscellanea:misc.Mode3
ltx/en_us_goadedes/me.m01.d27:meMA.Ode9C31.ode	@ltx/en_us_goadedes/miscellanea:misc.Ode9
ltx/en_us_goadedes/me.m01.d27:meMA.Ode9C31.text	
ltx/en_us_goadedes/me.m01.d27:meMA.Ode9C32.incipit	…
ltx/en_us_goadedes/me.m01.d27:meMA.Ode9C32.melody	@ltx/en_us_goadedes/he.h.m3:heHE.KainonToThavma.name
ltx/en_us_goadedes/me.m01.d27:meMA.Ode9C32.mode	@ltx/en_us_goadedes/miscellanea:misc.Mode3
ltx/en_us_goadedes/me.m01.d27:meMA.Ode9C32.ode	@ltx/en_us_goadedes/miscellanea:misc.Ode9
ltx/en_us_goadedes/me.m01.d27:meMA.Ode9C32.text	
ltx/en_us_goadedes/me.m01.d27:meMA.Ode9C33.incipit	…
ltx/en_us_goadedes/me.m01.d27:meMA.Ode9C33.melody	@ltx/en_us_goadedes/he.h.m3:heHE.KainonToThavma.name
ltx/en_us_goadedes/me.m01.d27:meMA.Ode9C33.mode	@ltx/en_us_goadedes/miscellanea:misc.Mode3
ltx/en_us_goadedes/me.m01.d27:meMA.Ode9C33.ode	@ltx/en_us_goadedes/miscellanea:misc.Ode9
ltx/en_us_goadedes/me.m01.d27:meMA.Ode9C33.text	
ltx/en_us_goadedes/me.m01.d27:meMA.Ode9C3T.incipit	…
ltx/en_us_goadedes/me.m01.d27:meMA.Ode9C3T.melody	@ltx/en_us_goadedes/he.h.m3:heHE.KainonToThavma.name
ltx/en_us_goadedes/me.m01.d27:meMA.Ode9C3T.mode	@ltx/en_us_goadedes/miscellanea:misc.Mode3
ltx/en_us_goadedes/me.m01.d27:meMA.Ode9C3T.ode	@ltx/en_us_goadedes/miscellanea:misc.Ode9
ltx/en_us_goadedes/me.m01.d27:meMA.Ode9C3T.text	
ltx/en_us_goadedes/me.m01.d27:meMA.Oikos1.text	
ltx/en_us_goadedes/me.m01.d27:meMA.PostGospelBoth.incipit	@ltx/en_us_goadedes/ho.ho03:hoMA.PostGospelTheotokos.incipit
ltx/en_us_goadedes/me.m01.d27:meMA.PostGospelBoth.melody	
ltx/en_us_goadedes/me.m01.d27:meMA.PostGospelBoth.mode	@ltx/en_us_goadedes/miscellanea:misc.Mode2
ltx/en_us_goadedes/me.m01.d27:meMA.PostGospelBoth.text	@ltx/en_us_goadedes/ho.ho03:hoMA.PostGospelTheotokos.text
ltx/en_us_goadedes/me.m01.d27:meMA.PostGospelGlory.incipit	…
ltx/en_us_goadedes/me.m01.d27:meMA.PostGospelGlory.melody	
ltx/en_us_goadedes/me.m01.d27:meMA.PostGospelGlory.mode	@ltx/en_us_goadedes/miscellanea:misc.Mode2
ltx/en_us_goadedes/me.m01.d27:meMA.PostGospelGlory.text	
ltx/en_us_goadedes/me.m01.d27:meMA.PostGospelIdiomelon.incipit	…
ltx/en_us_goadedes/me.m01.d27:meMA.PostGospelIdiomelon.melody	
ltx/en_us_goadedes/me.m01.d27:meMA.PostGospelIdiomelon.mode	@ltx/en_us_goadedes/miscellanea:misc.Mode6
ltx/en_us_goadedes/me.m01.d27:meMA.PostGospelIdiomelon.text	
ltx/en_us_goadedes/me.m01.d27:meVE.Apolytikion1.incipit	@ltx/en_us_goadedes/me.m11.d13:meVE.Apolytikion1.incipit
ltx/en_us_goadedes/me.m01.d27:meVE.Apolytikion1.melody	
ltx/en_us_goadedes/me.m01.d27:meVE.Apolytikion1.mode	@ltx/en_us_goadedes/miscellanea:misc.Mode8
ltx/en_us_goadedes/me.m01.d27:meVE.Apolytikion1.text	@ltx/en_us_goadedes/me.m11.d13:meVE.Apolytikion1.text
ltx/en_us_goadedes/me.m01.d27:meVE.AposGlory.incipit	@ltx/en_us_goadedes/me.m11.d13:meVE.SticGlory.incipit
ltx/en_us_goadedes/me.m01.d27:meVE.AposGlory.melody	
ltx/en_us_goadedes/me.m01.d27:meVE.AposGlory.mode	@ltx/en_us_goadedes/miscellanea:misc.Mode6
ltx/en_us_goadedes/me.m01.d27:meVE.AposGlory.text	@ltx/en_us_goadedes/me.m11.d13:meVE.SticGlory.text
ltx/en_us_goadedes/me.m01.d27:meVE.AposTheotokion.incipit	@ltx/en_us_goadedes/he.o:heOT.TheotokeSyEi.incipit
ltx/en_us_goadedes/me.m01.d27:meVE.AposTheotokion.melody	@ltx/en_us_goadedes/he.o:heOT.TheotokeSyEi.name
ltx/en_us_goadedes/me.m01.d27:meVE.AposTheotokion.mode	@ltx/en_us_goadedes/miscellanea:misc.Mode6
ltx/en_us_goadedes/me.m01.d27:meVE.AposTheotokion.text	@ltx/en_us_goadedes/he.o:heOT.TheotokeSyEiIerarchou.text
ltx/en_us_goadedes/me.m01.d27:meVE.Aposticha1.greekmelody	@ltx/en_us_goadedes/he.a.m5:heAU.ChairoisAskitikon.greekname
ltx/en_us_goadedes/me.m01.d27:meVE.Aposticha1.incipit	…
ltx/en_us_goadedes/me.m01.d27:meVE.Aposticha1.melody	@ltx/en_us_goadedes/he.a.m5:heAU.ChairoisAskitikon.name
ltx/en_us_goadedes/me.m01.d27:meVE.Aposticha1.mode	@ltx/en_us_goadedes/miscellanea:misc.Mode5
ltx/en_us_goadedes/me.m01.d27:meVE.Aposticha1.text	
ltx/en_us_goadedes/me.m01.d27:meVE.Aposticha2.incipit	…
ltx/en_us_goadedes/me.m01.d27:meVE.Aposticha2.melody	@ltx/en_us_goadedes/he.a.m5:heAU.ChairoisAskitikon.name
ltx/en_us_goadedes/me.m01.d27:meVE.Aposticha2.mode	@ltx/en_us_goadedes/miscellanea:misc.Mode5
ltx/en_us_goadedes/me.m01.d27:meVE.Aposticha2.text	
ltx/en_us_goadedes/me.m01.d27:meVE.Aposticha3.incipit	…
ltx/en_us_goadedes/me.m01.d27:meVE.Aposticha3.melody	@ltx/en_us_goadedes/he.a.m5:heAU.ChairoisAskitikon.name
ltx/en_us_goadedes/me.m01.d27:meVE.Aposticha3.mode	@ltx/en_us_goadedes/miscellanea:misc.Mode5
ltx/en_us_goadedes/me.m01.d27:meVE.Aposticha3.text	
ltx/en_us_goadedes/me.m01.d27:meVE.SticGlory.incipit	…
ltx/en_us_goadedes/me.m01.d27:meVE.SticGlory.melody	
ltx/en_us_goadedes/me.m01.d27:meVE.SticGlory.mode	@ltx/en_us_goadedes/miscellanea:misc.Mode4
ltx/en_us_goadedes/me.m01.d27:meVE.SticGlory.poet	
ltx/en_us_goadedes/me.m01.d27:meVE.SticGlory.text	
ltx/en_us_goadedes/me.m01.d27:meVE.SticTheotokion.incipit	@ltx/en_us_goadedes/oc.m4.d1:ocVE.SticTheotokion.incipit
ltx/en_us_goadedes/me.m01.d27:meVE.SticTheotokion.melody	
ltx/en_us_goadedes/me.m01.d27:meVE.SticTheotokion.mode	@ltx/en_us_goadedes/miscellanea:misc.Mode4
ltx/en_us_goadedes/me.m01.d27:meVE.SticTheotokion.text	@ltx/en_us_goadedes/oc.m4.d1:ocVE.SticTheotokion.text
ltx/en_us_goadedes/me.m01.d27:meVE.Stichera01.greekmelody	@ltx/en_us_goadedes/he.a.m4:heAU.OsGennaionEnMartysi.greekname
ltx/en_us_goadedes/me.m01.d27:meVE.Stichera01.incipit	To that trumpet…
ltx/en_us_goadedes/me.m01.d27:meVE.Stichera01.melody	@ltx/en_us_goadedes/he.a.m4:heAU.OsGennaionEnMartysi.name
ltx/en_us_goadedes/me.m01.d27:meVE.Stichera01.mode	@ltx/en_us_goadedes/miscellanea:misc.Mode4
ltx/en_us_goadedes/me.m01.d27:meVE.Stichera01.text	To that trumpet of hammered gold and the flute that is God-inspired, * let us sing our praises. He is a bottomless * ocean of doctrines, the Church’s strong support and the heavenly * intellect and the profound * depth of wisdom, a solid gold chalice pouring out * sacred teachings like rivers that are flowing as with honey, irrigating * our hearts and minds and creation all.
ltx/en_us_goadedes/me.m01.d27:meVE.Stichera02.incipit	Let us worthily honor …
ltx/en_us_goadedes/me.m01.d27:meVE.Stichera02.melody	@ltx/en_us_goadedes/he.a.m4:heAU.OsGennaionEnMartysi.name
ltx/en_us_goadedes/me.m01.d27:meVE.Stichera02.mode	@ltx/en_us_goadedes/miscellanea:misc.Mode4
ltx/en_us_goadedes/me.m01.d27:meVE.Stichera02.text	Let us worthily honor him, whom call an unsetting star, * for like rays his teachings illumine all the earth. * He preached repentence to everyone. His words had the good effect * of removing any trace * of despair from his listeners, like a golden sponge, * that refreshes the hearts, even of readers, that because of sin are pining. * Let us extol John of golden words.
ltx/en_us_goadedes/me.m01.d27:meVE.Stichera03.incipit	Let us magnify Chrysostom…
ltx/en_us_goadedes/me.m01.d27:meVE.Stichera03.melody	@ltx/en_us_goadedes/he.a.m4:heAU.OsGennaionEnMartysi.name
ltx/en_us_goadedes/me.m01.d27:meVE.Stichera03.mode	@ltx/en_us_goadedes/miscellanea:misc.Mode4
ltx/en_us_goadedes/me.m01.d27:meVE.Stichera03.text	Let us magnify Chrysostom and extol him with sacred hymns. * Though he was a man who was dwelling here on earth, * he was angelic and heavenly. The virtues were stored in him. * He was sturdy as a rock; * for the faithful, a paragon of the Christian life; * and on par with the Martyrs, and a peer of holy Angels, and an equal * to the Apostles in way of life.
ltx/en_us_goadedes/me.m01.d27:meVE.Stichera04.greekmelody	@ltx/en_us_goadedes/he.a.m4:heAU.OExYpsistouKlitheis.greekname
ltx/en_us_goadedes/me.m01.d27:meVE.Stichera04.incipit	…
ltx/en_us_goadedes/me.m01.d27:meVE.Stichera04.melody	@ltx/en_us_goadedes/he.a.m4:heAU.OExYpsistouKlitheis.name
ltx/en_us_goadedes/me.m01.d27:meVE.Stichera04.mode	@ltx/en_us_goadedes/miscellanea:misc.Mode4
ltx/en_us_goadedes/me.m01.d27:meVE.Stichera04.text	
ltx/en_us_goadedes/me.m01.d27:meVE.Stichera05.incipit	…
ltx/en_us_goadedes/me.m01.d27:meVE.Stichera05.melody	@ltx/en_us_goadedes/he.a.m4:heAU.OExYpsistouKlitheis.name
ltx/en_us_goadedes/me.m01.d27:meVE.Stichera05.mode	@ltx/en_us_goadedes/miscellanea:misc.Mode4
ltx/en_us_goadedes/me.m01.d27:meVE.Stichera05.text	
ltx/en_us_goadedes/me.m01.d27:meVE.Stichera06.incipit	…
ltx/en_us_goadedes/me.m01.d27:meVE.Stichera06.melody	@ltx/en_us_goadedes/he.a.m4:heAU.OExYpsistouKlitheis.name
ltx/en_us_goadedes/me.m01.d27:meVE.Stichera06.mode	@ltx/en_us_goadedes/miscellanea:misc.Mode4
ltx/en_us_goadedes/me.m01.d27:meVE.Stichera06.text	
