ltx/en_us_goadedes/ho.ho21:R01	
ltx/en_us_goadedes/ho.ho21:R02	
ltx/en_us_goadedes/ho.ho21:R03	
ltx/en_us_goadedes/ho.ho21:R04	
ltx/en_us_goadedes/ho.ho21:ho.title	
ltx/en_us_goadedes/ho.ho21:ho.title2	
ltx/en_us_goadedes/ho.ho21:hoCA.Kontakion.incipit	…
ltx/en_us_goadedes/ho.ho21:hoCA.Kontakion.melody	@ltx/en_us_goadedes/he.a.m2:heAU.TaAnoZiton.name
ltx/en_us_goadedes/ho.ho21:hoCA.Kontakion.mode	@ltx/en_us_goadedes/miscellanea:misc.Mode2
ltx/en_us_goadedes/ho.ho21:hoCA.Kontakion.text	
ltx/en_us_goadedes/ho.ho21:hoCA.Ode11.greekmelody	@ltx/en_us_goadedes/he.h.m2:heHE.DefteLaoi.greekname
ltx/en_us_goadedes/ho.ho21:hoCA.Ode11.incipit	…
ltx/en_us_goadedes/ho.ho21:hoCA.Ode11.melody	@ltx/en_us_goadedes/he.h.m2:heHE.DefteLaoi.name
ltx/en_us_goadedes/ho.ho21:hoCA.Ode11.mode	@ltx/en_us_goadedes/miscellanea:misc.Mode2
ltx/en_us_goadedes/ho.ho21:hoCA.Ode11.ode	@ltx/en_us_goadedes/miscellanea:misc.Ode1
ltx/en_us_goadedes/ho.ho21:hoCA.Ode11.text	
ltx/en_us_goadedes/ho.ho21:hoCA.Ode12.incipit	…
ltx/en_us_goadedes/ho.ho21:hoCA.Ode12.melody	@ltx/en_us_goadedes/he.h.m2:heHE.DefteLaoi.name
ltx/en_us_goadedes/ho.ho21:hoCA.Ode12.mode	@ltx/en_us_goadedes/miscellanea:misc.Mode2
ltx/en_us_goadedes/ho.ho21:hoCA.Ode12.ode	@ltx/en_us_goadedes/miscellanea:misc.Ode1
ltx/en_us_goadedes/ho.ho21:hoCA.Ode12.text	
ltx/en_us_goadedes/ho.ho21:hoCA.Ode1T.incipit	…
ltx/en_us_goadedes/ho.ho21:hoCA.Ode1T.melody	@ltx/en_us_goadedes/he.h.m2:heHE.DefteLaoi.name
ltx/en_us_goadedes/ho.ho21:hoCA.Ode1T.mode	@ltx/en_us_goadedes/miscellanea:misc.Mode2
ltx/en_us_goadedes/ho.ho21:hoCA.Ode1T.ode	@ltx/en_us_goadedes/miscellanea:misc.Ode1
ltx/en_us_goadedes/ho.ho21:hoCA.Ode1T.text	
ltx/en_us_goadedes/ho.ho21:hoCA.Ode31.greekmelody	@ltx/en_us_goadedes/he.h.m2:heHE.EnPetraMeTisPisteos.greekname
ltx/en_us_goadedes/ho.ho21:hoCA.Ode31.incipit	…
ltx/en_us_goadedes/ho.ho21:hoCA.Ode31.melody	@ltx/en_us_goadedes/he.h.m2:heHE.EnPetraMeTisPisteos.name
ltx/en_us_goadedes/ho.ho21:hoCA.Ode31.mode	@ltx/en_us_goadedes/miscellanea:misc.Mode2
ltx/en_us_goadedes/ho.ho21:hoCA.Ode31.ode	@ltx/en_us_goadedes/miscellanea:misc.Ode3
ltx/en_us_goadedes/ho.ho21:hoCA.Ode31.text	
ltx/en_us_goadedes/ho.ho21:hoCA.Ode32.incipit	…
ltx/en_us_goadedes/ho.ho21:hoCA.Ode32.melody	@ltx/en_us_goadedes/he.h.m2:heHE.EnPetraMeTisPisteos.name
ltx/en_us_goadedes/ho.ho21:hoCA.Ode32.mode	@ltx/en_us_goadedes/miscellanea:misc.Mode2
ltx/en_us_goadedes/ho.ho21:hoCA.Ode32.ode	@ltx/en_us_goadedes/miscellanea:misc.Ode3
ltx/en_us_goadedes/ho.ho21:hoCA.Ode32.text	
ltx/en_us_goadedes/ho.ho21:hoCA.Ode3T.incipit	…
ltx/en_us_goadedes/ho.ho21:hoCA.Ode3T.melody	@ltx/en_us_goadedes/he.h.m2:heHE.EnPetraMeTisPisteos.name
ltx/en_us_goadedes/ho.ho21:hoCA.Ode3T.mode	@ltx/en_us_goadedes/miscellanea:misc.Mode2
ltx/en_us_goadedes/ho.ho21:hoCA.Ode3T.ode	@ltx/en_us_goadedes/miscellanea:misc.Ode3
ltx/en_us_goadedes/ho.ho21:hoCA.Ode3T.text	
ltx/en_us_goadedes/ho.ho21:hoCA.Ode41.greekmelody	@ltx/en_us_goadedes/he.h.m2:heHE.ElilythasEkParthenou.greekname
ltx/en_us_goadedes/ho.ho21:hoCA.Ode41.incipit	…
ltx/en_us_goadedes/ho.ho21:hoCA.Ode41.melody	@ltx/en_us_goadedes/he.h.m2:heHE.ElilythasEkParthenou.name
ltx/en_us_goadedes/ho.ho21:hoCA.Ode41.mode	@ltx/en_us_goadedes/miscellanea:misc.Mode2
ltx/en_us_goadedes/ho.ho21:hoCA.Ode41.ode	@ltx/en_us_goadedes/miscellanea:misc.Ode4
ltx/en_us_goadedes/ho.ho21:hoCA.Ode41.text	
ltx/en_us_goadedes/ho.ho21:hoCA.Ode42.incipit	…
ltx/en_us_goadedes/ho.ho21:hoCA.Ode42.melody	@ltx/en_us_goadedes/he.h.m2:heHE.ElilythasEkParthenou.name
ltx/en_us_goadedes/ho.ho21:hoCA.Ode42.mode	@ltx/en_us_goadedes/miscellanea:misc.Mode2
ltx/en_us_goadedes/ho.ho21:hoCA.Ode42.ode	@ltx/en_us_goadedes/miscellanea:misc.Ode4
ltx/en_us_goadedes/ho.ho21:hoCA.Ode42.text	
ltx/en_us_goadedes/ho.ho21:hoCA.Ode4T.incipit	…
ltx/en_us_goadedes/ho.ho21:hoCA.Ode4T.melody	@ltx/en_us_goadedes/he.h.m2:heHE.ElilythasEkParthenou.name
ltx/en_us_goadedes/ho.ho21:hoCA.Ode4T.mode	@ltx/en_us_goadedes/miscellanea:misc.Mode2
ltx/en_us_goadedes/ho.ho21:hoCA.Ode4T.ode	@ltx/en_us_goadedes/miscellanea:misc.Ode4
ltx/en_us_goadedes/ho.ho21:hoCA.Ode4T.text	
ltx/en_us_goadedes/ho.ho21:hoCA.Ode51.greekmelody	@ltx/en_us_goadedes/he.h.m2:heHE.OTouFotosChorigos.greekname
ltx/en_us_goadedes/ho.ho21:hoCA.Ode51.incipit	…
ltx/en_us_goadedes/ho.ho21:hoCA.Ode51.melody	@ltx/en_us_goadedes/he.h.m2:heHE.OTouFotosChorigos.name
ltx/en_us_goadedes/ho.ho21:hoCA.Ode51.mode	@ltx/en_us_goadedes/miscellanea:misc.Mode2
ltx/en_us_goadedes/ho.ho21:hoCA.Ode51.ode	@ltx/en_us_goadedes/miscellanea:misc.Ode5
ltx/en_us_goadedes/ho.ho21:hoCA.Ode51.text	
ltx/en_us_goadedes/ho.ho21:hoCA.Ode52.incipit	…
ltx/en_us_goadedes/ho.ho21:hoCA.Ode52.melody	@ltx/en_us_goadedes/he.h.m2:heHE.OTouFotosChorigos.name
ltx/en_us_goadedes/ho.ho21:hoCA.Ode52.mode	@ltx/en_us_goadedes/miscellanea:misc.Mode2
ltx/en_us_goadedes/ho.ho21:hoCA.Ode52.ode	@ltx/en_us_goadedes/miscellanea:misc.Ode5
ltx/en_us_goadedes/ho.ho21:hoCA.Ode52.text	
ltx/en_us_goadedes/ho.ho21:hoCA.Ode5T.incipit	…
ltx/en_us_goadedes/ho.ho21:hoCA.Ode5T.melody	@ltx/en_us_goadedes/he.h.m2:heHE.OTouFotosChorigos.name
ltx/en_us_goadedes/ho.ho21:hoCA.Ode5T.mode	@ltx/en_us_goadedes/miscellanea:misc.Mode2
ltx/en_us_goadedes/ho.ho21:hoCA.Ode5T.ode	@ltx/en_us_goadedes/miscellanea:misc.Ode5
ltx/en_us_goadedes/ho.ho21:hoCA.Ode5T.text	
ltx/en_us_goadedes/ho.ho21:hoCA.Ode61.greekmelody	@ltx/en_us_goadedes/he.h.m2:heHE.EnAvyssoPtaismaton.greekname
ltx/en_us_goadedes/ho.ho21:hoCA.Ode61.incipit	…
ltx/en_us_goadedes/ho.ho21:hoCA.Ode61.melody	@ltx/en_us_goadedes/he.h.m2:heHE.EnAvyssoPtaismaton.name
ltx/en_us_goadedes/ho.ho21:hoCA.Ode61.mode	@ltx/en_us_goadedes/miscellanea:misc.Mode2
ltx/en_us_goadedes/ho.ho21:hoCA.Ode61.ode	@ltx/en_us_goadedes/miscellanea:misc.Ode6
ltx/en_us_goadedes/ho.ho21:hoCA.Ode61.text	
ltx/en_us_goadedes/ho.ho21:hoCA.Ode62.incipit	…
ltx/en_us_goadedes/ho.ho21:hoCA.Ode62.melody	@ltx/en_us_goadedes/he.h.m2:heHE.EnAvyssoPtaismaton.name
ltx/en_us_goadedes/ho.ho21:hoCA.Ode62.mode	@ltx/en_us_goadedes/miscellanea:misc.Mode2
ltx/en_us_goadedes/ho.ho21:hoCA.Ode62.ode	@ltx/en_us_goadedes/miscellanea:misc.Ode6
ltx/en_us_goadedes/ho.ho21:hoCA.Ode62.text	
ltx/en_us_goadedes/ho.ho21:hoCA.Ode6T.incipit	…
ltx/en_us_goadedes/ho.ho21:hoCA.Ode6T.melody	@ltx/en_us_goadedes/he.h.m2:heHE.EnAvyssoPtaismaton.name
ltx/en_us_goadedes/ho.ho21:hoCA.Ode6T.mode	@ltx/en_us_goadedes/miscellanea:misc.Mode2
ltx/en_us_goadedes/ho.ho21:hoCA.Ode6T.ode	@ltx/en_us_goadedes/miscellanea:misc.Ode6
ltx/en_us_goadedes/ho.ho21:hoCA.Ode6T.text	
ltx/en_us_goadedes/ho.ho21:hoCA.Ode71.greekmelody	@ltx/en_us_goadedes/he.h.m2:heHE.EikonosChrysis.greekname
ltx/en_us_goadedes/ho.ho21:hoCA.Ode71.incipit	…
ltx/en_us_goadedes/ho.ho21:hoCA.Ode71.melody	@ltx/en_us_goadedes/he.h.m2:heHE.EikonosChrysis.name
ltx/en_us_goadedes/ho.ho21:hoCA.Ode71.mode	@ltx/en_us_goadedes/miscellanea:misc.Mode2
ltx/en_us_goadedes/ho.ho21:hoCA.Ode71.ode	@ltx/en_us_goadedes/miscellanea:misc.Ode7
ltx/en_us_goadedes/ho.ho21:hoCA.Ode71.text	
ltx/en_us_goadedes/ho.ho21:hoCA.Ode72.incipit	…
ltx/en_us_goadedes/ho.ho21:hoCA.Ode72.melody	@ltx/en_us_goadedes/he.h.m2:heHE.EikonosChrysis.name
ltx/en_us_goadedes/ho.ho21:hoCA.Ode72.mode	@ltx/en_us_goadedes/miscellanea:misc.Mode2
ltx/en_us_goadedes/ho.ho21:hoCA.Ode72.ode	@ltx/en_us_goadedes/miscellanea:misc.Ode7
ltx/en_us_goadedes/ho.ho21:hoCA.Ode72.text	
ltx/en_us_goadedes/ho.ho21:hoCA.Ode7T.incipit	…
ltx/en_us_goadedes/ho.ho21:hoCA.Ode7T.melody	@ltx/en_us_goadedes/he.h.m2:heHE.EikonosChrysis.name
ltx/en_us_goadedes/ho.ho21:hoCA.Ode7T.mode	@ltx/en_us_goadedes/miscellanea:misc.Mode2
ltx/en_us_goadedes/ho.ho21:hoCA.Ode7T.ode	@ltx/en_us_goadedes/miscellanea:misc.Ode7
ltx/en_us_goadedes/ho.ho21:hoCA.Ode7T.text	
ltx/en_us_goadedes/ho.ho21:hoCA.Ode81.greekmelody	@ltx/en_us_goadedes/he.h.m2:heHE.TonEnKaminoTouPyros.greekname
ltx/en_us_goadedes/ho.ho21:hoCA.Ode81.incipit	…
ltx/en_us_goadedes/ho.ho21:hoCA.Ode81.melody	@ltx/en_us_goadedes/he.h.m2:heHE.TonEnKaminoTouPyros.name
ltx/en_us_goadedes/ho.ho21:hoCA.Ode81.mode	@ltx/en_us_goadedes/miscellanea:misc.Mode2
ltx/en_us_goadedes/ho.ho21:hoCA.Ode81.ode	@ltx/en_us_goadedes/miscellanea:misc.Ode8
ltx/en_us_goadedes/ho.ho21:hoCA.Ode81.text	
ltx/en_us_goadedes/ho.ho21:hoCA.Ode82.incipit	…
ltx/en_us_goadedes/ho.ho21:hoCA.Ode82.melody	@ltx/en_us_goadedes/he.h.m2:heHE.TonEnKaminoTouPyros.name
ltx/en_us_goadedes/ho.ho21:hoCA.Ode82.mode	@ltx/en_us_goadedes/miscellanea:misc.Mode2
ltx/en_us_goadedes/ho.ho21:hoCA.Ode82.ode	@ltx/en_us_goadedes/miscellanea:misc.Ode8
ltx/en_us_goadedes/ho.ho21:hoCA.Ode82.text	
ltx/en_us_goadedes/ho.ho21:hoCA.Ode8T.incipit	…
ltx/en_us_goadedes/ho.ho21:hoCA.Ode8T.melody	@ltx/en_us_goadedes/he.h.m2:heHE.TonEnKaminoTouPyros.name
ltx/en_us_goadedes/ho.ho21:hoCA.Ode8T.mode	@ltx/en_us_goadedes/miscellanea:misc.Mode2
ltx/en_us_goadedes/ho.ho21:hoCA.Ode8T.ode	@ltx/en_us_goadedes/miscellanea:misc.Ode8
ltx/en_us_goadedes/ho.ho21:hoCA.Ode8T.text	
ltx/en_us_goadedes/ho.ho21:hoCA.Ode91.greekmelody	@ltx/en_us_goadedes/he.h.m2:heHE.AnarchouGennitoros.greekname
ltx/en_us_goadedes/ho.ho21:hoCA.Ode91.incipit	…
ltx/en_us_goadedes/ho.ho21:hoCA.Ode91.melody	@ltx/en_us_goadedes/he.h.m2:heHE.AnarchouGennitoros.name
ltx/en_us_goadedes/ho.ho21:hoCA.Ode91.mode	@ltx/en_us_goadedes/miscellanea:misc.Mode2
ltx/en_us_goadedes/ho.ho21:hoCA.Ode91.ode	@ltx/en_us_goadedes/miscellanea:misc.Ode9
ltx/en_us_goadedes/ho.ho21:hoCA.Ode91.text	
ltx/en_us_goadedes/ho.ho21:hoCA.Ode92.incipit	…
ltx/en_us_goadedes/ho.ho21:hoCA.Ode92.melody	@ltx/en_us_goadedes/he.h.m2:heHE.AnarchouGennitoros.name
ltx/en_us_goadedes/ho.ho21:hoCA.Ode92.mode	@ltx/en_us_goadedes/miscellanea:misc.Mode2
ltx/en_us_goadedes/ho.ho21:hoCA.Ode92.ode	@ltx/en_us_goadedes/miscellanea:misc.Ode9
ltx/en_us_goadedes/ho.ho21:hoCA.Ode92.text	
ltx/en_us_goadedes/ho.ho21:hoCA.Ode93.incipit	…
ltx/en_us_goadedes/ho.ho21:hoCA.Ode93.melody	@ltx/en_us_goadedes/he.h.m2:heHE.AnarchouGennitoros.name
ltx/en_us_goadedes/ho.ho21:hoCA.Ode93.mode	@ltx/en_us_goadedes/miscellanea:misc.Mode2
ltx/en_us_goadedes/ho.ho21:hoCA.Ode93.ode	@ltx/en_us_goadedes/miscellanea:misc.Ode9
ltx/en_us_goadedes/ho.ho21:hoCA.Ode93.text	
ltx/en_us_goadedes/ho.ho21:hoCA.Ode9T.incipit	…
ltx/en_us_goadedes/ho.ho21:hoCA.Ode9T.melody	@ltx/en_us_goadedes/he.h.m2:heHE.AnarchouGennitoros.name
ltx/en_us_goadedes/ho.ho21:hoCA.Ode9T.mode	@ltx/en_us_goadedes/miscellanea:misc.Mode2
ltx/en_us_goadedes/ho.ho21:hoCA.Ode9T.ode	@ltx/en_us_goadedes/miscellanea:misc.Ode9
ltx/en_us_goadedes/ho.ho21:hoCA.Ode9T.text	
ltx/en_us_goadedes/ho.ho21:hoCA.media.text	
ltx/en_us_goadedes/ho.ho21:hoCA.poet	
ltx/en_us_goadedes/ho.ho21:hoCA.title	
ltx/en_us_goadedes/ho.ho21:hoPrayer.Key000.title	
ltx/en_us_goadedes/ho.ho21:hoPrayer.Key001.incipit	@ltx/en_us_goadedes/oc.m2.d2:ocMA.Aposticha2.incipit
ltx/en_us_goadedes/ho.ho21:hoPrayer.Key001.text	@ltx/en_us_goadedes/oc.m2.d2:ocMA.Aposticha2.text
ltx/en_us_goadedes/ho.ho21:hoPrayer.Key001.title	
ltx/en_us_goadedes/ho.ho21:hoPrayer.Key002.incipit	…
ltx/en_us_goadedes/ho.ho21:hoPrayer.Key002.text	
ltx/en_us_goadedes/ho.ho21:hoPrayer.Key003.incipit	@ltx/en_us_goadedes/oc.m6.d3:ocMA.Kathisma33.incipit
ltx/en_us_goadedes/ho.ho21:hoPrayer.Key003.text	@ltx/en_us_goadedes/oc.m6.d3:ocMA.Kathisma33.text
ltx/en_us_goadedes/ho.ho21:hoPrayer.Key004.incipit	@ltx/en_us_goadedes/tr.d068:trMA.Troparion.incipit
ltx/en_us_goadedes/ho.ho21:hoPrayer.Key004.text	@ltx/en_us_goadedes/tr.d068:trMA.Troparion.text
ltx/en_us_goadedes/ho.ho21:hoPrayer.Key004.title	
ltx/en_us_goadedes/ho.ho21:hoPrayer.Key005.poet	
ltx/en_us_goadedes/ho.ho21:hoPrayer.Key005.text	
ltx/en_us_goadedes/ho.ho21:hoPrayer.Key005.title	
ltx/en_us_goadedes/ho.ho21:hoPrayer.Key005.title2	
ltx/en_us_goadedes/ho.ho21:hoPrayer.Key005_1.text	
ltx/en_us_goadedes/ho.ho21:hoPrayer.Key005_2.text	
ltx/en_us_goadedes/ho.ho21:hoPrayer.Key005_3.text	
ltx/en_us_goadedes/ho.ho21:hoPrayer.Key005_4.text	
ltx/en_us_goadedes/ho.ho21:hoPrayer.Key005_5.text	
ltx/en_us_goadedes/ho.ho21:hoPrayer.Key006.text	
ltx/en_us_goadedes/ho.ho21:hoPrayer.Key006.title	
ltx/en_us_goadedes/ho.ho21:hoPrayer.Key006_1.text	
ltx/en_us_goadedes/ho.ho21:hoPrayer.Key006_2.text	
ltx/en_us_goadedes/ho.ho21:hoPrayer.Key006_3.text	
ltx/en_us_goadedes/ho.ho21:hoPrayer.Key011.poet	
ltx/en_us_goadedes/ho.ho21:hoPrayer.Key011.text	
ltx/en_us_goadedes/ho.ho21:hoPrayer.Key011.title	
ltx/en_us_goadedes/ho.ho21:hoPrayer.Key021.poet	
ltx/en_us_goadedes/ho.ho21:hoPrayer.Key021.text	
ltx/en_us_goadedes/ho.ho21:hoPrayer.Key021.title	
ltx/en_us_goadedes/ho.ho21:hoPrayer.Key031.poet	
ltx/en_us_goadedes/ho.ho21:hoPrayer.Key031.text	
ltx/en_us_goadedes/ho.ho21:hoPrayer.Key031.title	
ltx/en_us_goadedes/ho.ho21:hoPrayer.Key041.poet	
ltx/en_us_goadedes/ho.ho21:hoPrayer.Key041.text	
ltx/en_us_goadedes/ho.ho21:hoPrayer.Key041.title	
ltx/en_us_goadedes/ho.ho21:hoPrayer.Key051.poet	
ltx/en_us_goadedes/ho.ho21:hoPrayer.Key051.text	
ltx/en_us_goadedes/ho.ho21:hoPrayer.Key051.title	
ltx/en_us_goadedes/ho.ho21:hoPrayer.Key061.poet	
ltx/en_us_goadedes/ho.ho21:hoPrayer.Key061.text	
ltx/en_us_goadedes/ho.ho21:hoPrayer.Key061.title	
ltx/en_us_goadedes/ho.ho21:hoPrayer.Key071.poet	
ltx/en_us_goadedes/ho.ho21:hoPrayer.Key071.text	
ltx/en_us_goadedes/ho.ho21:hoPrayer.Key071.title	
ltx/en_us_goadedes/ho.ho21:hoPrayer.Key071_001.text	
ltx/en_us_goadedes/ho.ho21:hoPrayer.Key071_002.text	
ltx/en_us_goadedes/ho.ho21:hoPrayer.Key071_003.text	
ltx/en_us_goadedes/ho.ho21:hoPrayer.Key071_004.text	
ltx/en_us_goadedes/ho.ho21:hoPrayer.Key071_005.text	
ltx/en_us_goadedes/ho.ho21:hoPrayer.Key071_006.text	
ltx/en_us_goadedes/ho.ho21:hoPrayer.Key071_007.text	
ltx/en_us_goadedes/ho.ho21:hoPrayer.Key071_008.text	
ltx/en_us_goadedes/ho.ho21:hoPrayer.Key071_009.text	
ltx/en_us_goadedes/ho.ho21:hoPrayer.Key071_010.text	
ltx/en_us_goadedes/ho.ho21:hoPrayer.Key071_011.text	
ltx/en_us_goadedes/ho.ho21:hoPrayer.Key071_012.text	
ltx/en_us_goadedes/ho.ho21:hoPrayer.Key071_013.text	
ltx/en_us_goadedes/ho.ho21:hoPrayer.Key071_014.text	
ltx/en_us_goadedes/ho.ho21:hoPrayer.Key071_015.text	
ltx/en_us_goadedes/ho.ho21:hoPrayer.Key071_016.text	
ltx/en_us_goadedes/ho.ho21:hoPrayer.Key071_017.text	
ltx/en_us_goadedes/ho.ho21:hoPrayer.Key071_018.text	
ltx/en_us_goadedes/ho.ho21:hoPrayer.Key071_019.text	
ltx/en_us_goadedes/ho.ho21:hoPrayer.Key071_020.text	
ltx/en_us_goadedes/ho.ho21:hoPrayer.Key071_021.text	
ltx/en_us_goadedes/ho.ho21:hoPrayer.Key071_022.text	
ltx/en_us_goadedes/ho.ho21:hoPrayer.Key071_023.text	
ltx/en_us_goadedes/ho.ho21:hoPrayer.Key071_024.text	
ltx/en_us_goadedes/ho.ho21:hoPrayer.Key071_025.text	
ltx/en_us_goadedes/ho.ho21:hoPrayer.Key071_026.text	
ltx/en_us_goadedes/ho.ho21:hoPrayer.Key071_027.text	
ltx/en_us_goadedes/ho.ho21:hoPrayer.Key071_028.text	
ltx/en_us_goadedes/ho.ho21:hoPrayer.Key071_029.text	
ltx/en_us_goadedes/ho.ho21:hoPrayer.Key071_030.text	
ltx/en_us_goadedes/ho.ho21:hoPrayer.Key071_031.text	
ltx/en_us_goadedes/ho.ho21:hoPrayer.Key071_032.text	
ltx/en_us_goadedes/ho.ho21:hoPrayer.Key071_033.text	
ltx/en_us_goadedes/ho.ho21:hoPrayer.Key071_034.text	
ltx/en_us_goadedes/ho.ho21:hoPrayer.Key071_035.text	
ltx/en_us_goadedes/ho.ho21:hoPrayer.Key071_036.text	
ltx/en_us_goadedes/ho.ho21:hoPrayer.Key071_037.text	
ltx/en_us_goadedes/ho.ho21:hoPrayer.Key071_038.text	
ltx/en_us_goadedes/ho.ho21:hoPrayer.Key071_039.text	
ltx/en_us_goadedes/ho.ho21:hoPrayer.Key071_040.text	
ltx/en_us_goadedes/ho.ho21:hoPrayer.Key071_041.text	
ltx/en_us_goadedes/ho.ho21:hoPrayer.Key071_042.text	
ltx/en_us_goadedes/ho.ho21:hoPrayer.Key071_043.text	
ltx/en_us_goadedes/ho.ho21:hoPrayer.Key071_044.text	
ltx/en_us_goadedes/ho.ho21:hoPrayer.Key071_045.text	
ltx/en_us_goadedes/ho.ho21:hoPrayer.Key071_046.text	
ltx/en_us_goadedes/ho.ho21:hoPrayer.Key071_047.text	
ltx/en_us_goadedes/ho.ho21:hoPrayer.Key071_048.text	
ltx/en_us_goadedes/ho.ho21:hoPrayer.Key071_049.text	
ltx/en_us_goadedes/ho.ho21:hoPrayer.Key071_050.text	
ltx/en_us_goadedes/ho.ho21:hoPrayer.Key071_051.text	
ltx/en_us_goadedes/ho.ho21:hoPrayer.Key071_052.text	
ltx/en_us_goadedes/ho.ho21:hoPrayer.Key071_053.text	
ltx/en_us_goadedes/ho.ho21:hoPrayer.Key071_054.text	
ltx/en_us_goadedes/ho.ho21:hoPrayer.Key071_055.text	
ltx/en_us_goadedes/ho.ho21:hoPrayer.Key071_056.text	
ltx/en_us_goadedes/ho.ho21:hoPrayer.Key071_057.text	
ltx/en_us_goadedes/ho.ho21:hoPrayer.Key071_058.text	
ltx/en_us_goadedes/ho.ho21:hoPrayer.Key071_059.text	
ltx/en_us_goadedes/ho.ho21:hoPrayer.Key071_060.text	
ltx/en_us_goadedes/ho.ho21:hoPrayer.Key071_061.text	
ltx/en_us_goadedes/ho.ho21:hoPrayer.Key071_062.text	
ltx/en_us_goadedes/ho.ho21:hoPrayer.Key071_063.text	
ltx/en_us_goadedes/ho.ho21:hoPrayer.Key071_064.text	
ltx/en_us_goadedes/ho.ho21:hoPrayer.Key071_065.text	
ltx/en_us_goadedes/ho.ho21:hoPrayer.Key071_066.text	
ltx/en_us_goadedes/ho.ho21:hoPrayer.Key071_067.text	
ltx/en_us_goadedes/ho.ho21:hoPrayer.Key071_068.text	
ltx/en_us_goadedes/ho.ho21:hoPrayer.Key071_069.text	
ltx/en_us_goadedes/ho.ho21:hoPrayer.Key071_070.text	
ltx/en_us_goadedes/ho.ho21:hoPrayer.Key071_071.text	
ltx/en_us_goadedes/ho.ho21:hoPrayer.Key071_072.text	
ltx/en_us_goadedes/ho.ho21:hoPrayer.Key071_073.text	
ltx/en_us_goadedes/ho.ho21:hoPrayer.Key071_074.text	
ltx/en_us_goadedes/ho.ho21:hoPrayer.Key071_075.text	
ltx/en_us_goadedes/ho.ho21:hoPrayer.Key071_076.text	
ltx/en_us_goadedes/ho.ho21:hoPrayer.Key071_077.text	
ltx/en_us_goadedes/ho.ho21:hoPrayer.Key071_078.text	
ltx/en_us_goadedes/ho.ho21:hoPrayer.Key071_079.text	
ltx/en_us_goadedes/ho.ho21:hoPrayer.Key071_080.text	
ltx/en_us_goadedes/ho.ho21:hoPrayer.Key071_081.text	
ltx/en_us_goadedes/ho.ho21:hoPrayer.Key071_082.text	
ltx/en_us_goadedes/ho.ho21:hoPrayer.Key071_083.text	
ltx/en_us_goadedes/ho.ho21:hoPrayer.Key071_084.text	
ltx/en_us_goadedes/ho.ho21:hoPrayer.Key071_085.text	
ltx/en_us_goadedes/ho.ho21:hoPrayer.Key071_086.text	
ltx/en_us_goadedes/ho.ho21:hoPrayer.Key071_087.text	
ltx/en_us_goadedes/ho.ho21:hoPrayer.Key071_088.text	
ltx/en_us_goadedes/ho.ho21:hoPrayer.Key071_089.text	
ltx/en_us_goadedes/ho.ho21:hoPrayer.Key071_090.text	
ltx/en_us_goadedes/ho.ho21:hoPrayer.Key071_091.text	
ltx/en_us_goadedes/ho.ho21:hoPrayer.Key071_092.text	
ltx/en_us_goadedes/ho.ho21:hoPrayer.Key071_093.text	
ltx/en_us_goadedes/ho.ho21:hoPrayer.Key071_094.text	
ltx/en_us_goadedes/ho.ho21:hoPrayer.Key071_095.text	
ltx/en_us_goadedes/ho.ho21:hoPrayer.Key071_096.text	
ltx/en_us_goadedes/ho.ho21:hoPrayer.Key071_097.text	
ltx/en_us_goadedes/ho.ho21:hoPrayer.Key071_098.text	
ltx/en_us_goadedes/ho.ho21:hoPrayer.Key071_099.text	
ltx/en_us_goadedes/ho.ho21:hoPrayer.Key071_100.text	
ltx/en_us_goadedes/ho.ho21:hoPrayer.Key071_101.text	
ltx/en_us_goadedes/ho.ho21:hoPrayer.Key071_102.text	
ltx/en_us_goadedes/ho.ho21:hoPrayer.Key071_103.text	
ltx/en_us_goadedes/ho.ho21:hoPrayer.Key071_104.text	
ltx/en_us_goadedes/ho.ho21:hoPrayer.Key071_105.text	
ltx/en_us_goadedes/ho.ho21:hoPrayer.Key071_106.text	
ltx/en_us_goadedes/ho.ho21:hoPrayer.Key071_107.text	
ltx/en_us_goadedes/ho.ho21:hoPrayer.Key071_108.text	
ltx/en_us_goadedes/ho.ho21:hoPrayer.Key071_109.text	
ltx/en_us_goadedes/ho.ho21:hoPrayer.Key071_110.text	
ltx/en_us_goadedes/ho.ho21:hoPrayer.Key071_111.text	
ltx/en_us_goadedes/ho.ho21:hoPrayer.Key071_112.text	
ltx/en_us_goadedes/ho.ho21:hoPrayer.Key071_113.text	
ltx/en_us_goadedes/ho.ho21:hoPrayer.Key071_114.text	
ltx/en_us_goadedes/ho.ho21:hoPrayer.Key071_115.text	
ltx/en_us_goadedes/ho.ho21:hoPrayer.Key071_116.text	
ltx/en_us_goadedes/ho.ho21:hoPrayer.Key071_117.text	
ltx/en_us_goadedes/ho.ho21:hoPrayer.Key071_118.text	
ltx/en_us_goadedes/ho.ho21:hoPrayer.Key071_119.text	
ltx/en_us_goadedes/ho.ho21:hoPrayer.Key071_120.text	
ltx/en_us_goadedes/ho.ho21:hoPrayer.Key071_121.text	
ltx/en_us_goadedes/ho.ho21:hoPrayer.Key071_122.text	
ltx/en_us_goadedes/ho.ho21:hoPrayer.Key071_123.text	
ltx/en_us_goadedes/ho.ho21:hoPrayer.Key071_124.text	
ltx/en_us_goadedes/ho.ho21:hoPrayer.Key071_125.text	
ltx/en_us_goadedes/ho.ho21:hoPrayer.Key071_126.text	
ltx/en_us_goadedes/ho.ho21:hoPrayer.Key071_127.text	
ltx/en_us_goadedes/ho.ho21:hoPrayer.Key071_128.text	
ltx/en_us_goadedes/ho.ho21:hoPrayer.Key071_129.text	
ltx/en_us_goadedes/ho.ho21:hoPrayer.Key071_130.text	
ltx/en_us_goadedes/ho.ho21:hoPrayer.Key071_131.text	
ltx/en_us_goadedes/ho.ho21:hoPrayer.Key071_132.text	
ltx/en_us_goadedes/ho.ho21:hoPrayer.Key071_133.text	
ltx/en_us_goadedes/ho.ho21:hoPrayer.Key071_134.text	
ltx/en_us_goadedes/ho.ho21:hoPrayer.Key071_135.text	
ltx/en_us_goadedes/ho.ho21:hoPrayer.Key071_136.text	
ltx/en_us_goadedes/ho.ho21:hoPrayer.Key081.poet	
ltx/en_us_goadedes/ho.ho21:hoPrayer.Key081.text	
ltx/en_us_goadedes/ho.ho21:hoPrayer.Key081.title	
ltx/en_us_goadedes/ho.ho21:hoPrayer.Key091.poet	
ltx/en_us_goadedes/ho.ho21:hoPrayer.Key091.text	
ltx/en_us_goadedes/ho.ho21:hoPrayer.Key091.title	
ltx/en_us_goadedes/ho.ho21:hoPrayer.Key100.title	
ltx/en_us_goadedes/ho.ho21:hoPrayer.Key101.poet	
ltx/en_us_goadedes/ho.ho21:hoPrayer.Key101.text	
ltx/en_us_goadedes/ho.ho21:hoPrayer.Key101.title	
ltx/en_us_goadedes/ho.ho21:hoPrayer.Key110.text	As I am about to receive holy communion, * O Maker, I pray You not burn me partaking, * since You are fire consuming the unworthy, * but rather purge me of any defilement.
ltx/en_us_goadedes/ho.ho21:hoPrayer.Key111.rubric	When you get in line to receive holy Communion, recite these verses by Symeon the Translator.
ltx/en_us_goadedes/ho.ho21:hoPrayer.Key111.text	As I am about to receive holy communion,
ltx/en_us_goadedes/ho.ho21:hoPrayer.Key111.title	Verses by Symeon the Translator
ltx/en_us_goadedes/ho.ho21:hoPrayer.Key112.text	O Maker, I pray You not burn me partaking,
ltx/en_us_goadedes/ho.ho21:hoPrayer.Key113.text	since You are a fire consuming the unworthy,
ltx/en_us_goadedes/ho.ho21:hoPrayer.Key114.text	but rather purge me of any defilement.
ltx/en_us_goadedes/ho.ho21:hoPrayer.Key121.text	@ltx/en_us_goadedes/tr.d069:trLI.CommunionHymn.text
ltx/en_us_goadedes/ho.ho21:hoPrayer.Key121.title	Then recite this hymn:
ltx/en_us_goadedes/ho.ho21:hoPrayer.Key130.text	Seeing the deifying Blood, O human, shudder, * for it is a live coal that burns the unworthy. * The Body of God both deifies my spirit * and feeds my mind in extraordinary manner.
ltx/en_us_goadedes/ho.ho21:hoPrayer.Key131.text	Seeing the deifying Blood, O human, shudder,
ltx/en_us_goadedes/ho.ho21:hoPrayer.Key131.title	Then recite the following verses:
ltx/en_us_goadedes/ho.ho21:hoPrayer.Key132.text	for it is a live coal that burns the unworthy.
ltx/en_us_goadedes/ho.ho21:hoPrayer.Key133.text	The Body of God both deifies my spirit
ltx/en_us_goadedes/ho.ho21:hoPrayer.Key134.text	and feeds my mind in extraordinary manner.
ltx/en_us_goadedes/ho.ho21:hoPrayer.Key141.incipit	@ltx/en_us_goadedes/me.m08.d06:meMA.Ode9C23.incipit
ltx/en_us_goadedes/ho.ho21:hoPrayer.Key141.text	@ltx/en_us_goadedes/me.m08.d06:meMA.Ode9C23.text
ltx/en_us_goadedes/ho.ho21:hoPrayer.Key141.title	
ltx/en_us_goadedes/ho.ho21:hoPrayer.Key151.incipit	@ltx/en_us_goadedes/tr.d066:trMA.Lauds1.incipit
ltx/en_us_goadedes/ho.ho21:hoPrayer.Key151.text	@ltx/en_us_goadedes/tr.d066:trMA.Lauds1.text
ltx/en_us_goadedes/ho.ho21:hoPrayer.Key151.title	
ltx/en_us_goadedes/ho.ho21:hoPrayer.Key161.text	
ltx/en_us_goadedes/ho.ho21:hoPrayer.Key161.title	
ltx/en_us_goadedes/ho.ho21:hoPrayer.Key200.title	
ltx/en_us_goadedes/ho.ho21:hoPrayer.Key200.title2	
ltx/en_us_goadedes/ho.ho21:hoPrayer.Key201.text	Whenever you are blessed by rightly partaking * of the life-creating, mystical gifts of communion, * immediately offer up praise and thanksgiving, * and soulfully utter what follows with fervor: * Glory to You, O God! Glory to You, O God! Glory to You, O God!
ltx/en_us_goadedes/ho.ho21:hoPrayer.Key201.title	Exhortatory Verses
ltx/en_us_goadedes/ho.ho21:hoPrayer.Key201_1.text	Whenever you are blessed by rightly partaking
ltx/en_us_goadedes/ho.ho21:hoPrayer.Key201_2.text	of the life-creating, mystical gifts of communion,
ltx/en_us_goadedes/ho.ho21:hoPrayer.Key201_3.text	immediately offer up praise and thanksgiving,
ltx/en_us_goadedes/ho.ho21:hoPrayer.Key201_4.text	and soulfully utter the what follows with fervor:
ltx/en_us_goadedes/ho.ho21:hoPrayer.Key201_5.text	Glory to You, O God! Glory to You, O God! Glory to You, O God!
ltx/en_us_goadedes/ho.ho21:hoPrayer.Key202.text	
ltx/en_us_goadedes/ho.ho21:hoPrayer.Key202.title	
ltx/en_us_goadedes/ho.ho21:hoPrayer.Key203.text	
ltx/en_us_goadedes/ho.ho21:hoPrayer.Key203.title	
ltx/en_us_goadedes/ho.ho21:hoPrayer.Key204.text	
ltx/en_us_goadedes/ho.ho21:hoPrayer.Key204.title	
ltx/en_us_goadedes/ho.ho21:hoPrayer.Key204_001.text	
ltx/en_us_goadedes/ho.ho21:hoPrayer.Key204_002.text	
ltx/en_us_goadedes/ho.ho21:hoPrayer.Key204_003.text	
ltx/en_us_goadedes/ho.ho21:hoPrayer.Key204_004.text	
ltx/en_us_goadedes/ho.ho21:hoPrayer.Key204_005.text	
ltx/en_us_goadedes/ho.ho21:hoPrayer.Key204_006.text	
ltx/en_us_goadedes/ho.ho21:hoPrayer.Key204_007.text	
ltx/en_us_goadedes/ho.ho21:hoPrayer.Key204_008.text	
ltx/en_us_goadedes/ho.ho21:hoPrayer.Key204_009.text	
ltx/en_us_goadedes/ho.ho21:hoPrayer.Key204_010.text	
ltx/en_us_goadedes/ho.ho21:hoPrayer.Key204_011.text	
ltx/en_us_goadedes/ho.ho21:hoPrayer.Key204_012.text	
ltx/en_us_goadedes/ho.ho21:hoPrayer.Key204_013.text	
ltx/en_us_goadedes/ho.ho21:hoPrayer.Key204_014.text	
ltx/en_us_goadedes/ho.ho21:hoPrayer.Key204_015.text	
ltx/en_us_goadedes/ho.ho21:hoPrayer.Key204_016.text	
ltx/en_us_goadedes/ho.ho21:hoPrayer.Key204_017.text	
ltx/en_us_goadedes/ho.ho21:hoPrayer.Key204_018.text	
ltx/en_us_goadedes/ho.ho21:hoPrayer.Key204_019.text	
ltx/en_us_goadedes/ho.ho21:hoPrayer.Key204_020.text	
ltx/en_us_goadedes/ho.ho21:hoPrayer.Key204_021.text	
ltx/en_us_goadedes/ho.ho21:hoPrayer.Key204_022.text	
ltx/en_us_goadedes/ho.ho21:hoPrayer.Key204_023.text	
ltx/en_us_goadedes/ho.ho21:hoPrayer.Key204_024.text	
ltx/en_us_goadedes/ho.ho21:hoPrayer.Key204_025.text	
ltx/en_us_goadedes/ho.ho21:hoPrayer.Key204_026.text	
ltx/en_us_goadedes/ho.ho21:hoPrayer.Key204_027.text	
ltx/en_us_goadedes/ho.ho21:hoPrayer.Key204_028.text	
ltx/en_us_goadedes/ho.ho21:hoPrayer.Key205.text	
ltx/en_us_goadedes/ho.ho21:hoPrayer.Key205.title	
ltx/en_us_goadedes/ho.ho21:hoPrayer.Key206.text	
ltx/en_us_goadedes/ho.ho21:hoPrayer.Key206.title	
ltx/en_us_goadedes/ho.ho21:hoPrayer.Key206.title2	
ltx/en_us_goadedes/ho.ho21:hoPrayer.Key300.title	
ltx/en_us_goadedes/ho.ho21:hoPrayer.Key400.title	
ltx/en_us_goadedes/ho.ho21:hoPrayer.Key500.title	
ltx/en_us_goadedes/ho.ho21:hoPrayer.note1	
ltx/en_us_goadedes/ho.ho21:hoPrayer.title	
