ltx/en_us_goadedes/skeletons:skLI.Acclamation.rubric	The clergy and choirs ought to be advised beforehand regarding which acclamations are appropriate.
ltx/en_us_goadedes/skeletons:skLI.Acclamation.text	(The appropriate hierarchical acclamation.)
ltx/en_us_goadedes/skeletons:skLI.Acclamation.title	The Acclamations
ltx/en_us_goadedes/skeletons:skLI.AfterCommunion.pagenumber	32
ltx/en_us_goadedes/skeletons:skLI.AfterCommunion.text	(See Liturgy Variables.)
ltx/en_us_goadedes/skeletons:skLI.AfterCommunion.title	Hymn after Holy Communion
ltx/en_us_goadedes/skeletons:skLI.Alleluia.text	(See Liturgy Variables.)
ltx/en_us_goadedes/skeletons:skLI.Alleluia.title	Alleluia before Gospel
ltx/en_us_goadedes/skeletons:skLI.Antiphon1.pagenumber	
ltx/en_us_goadedes/skeletons:skLI.Antiphon1.text	(See Liturgy Variables.)
ltx/en_us_goadedes/skeletons:skLI.Antiphon1.title	The 1st Antiphon
ltx/en_us_goadedes/skeletons:skLI.Antiphon2.pagenumber	
ltx/en_us_goadedes/skeletons:skLI.Antiphon2.text	(See Liturgy Variables.)
ltx/en_us_goadedes/skeletons:skLI.Antiphon2.title	The 2nd Antiphon
ltx/en_us_goadedes/skeletons:skLI.Antiphon3.pagenumber	
ltx/en_us_goadedes/skeletons:skLI.Antiphon3.text	(See Liturgy Variables.)
ltx/en_us_goadedes/skeletons:skLI.Antiphon3.title	The 3rd Antiphon.
ltx/en_us_goadedes/skeletons:skLI.CommunionHymn.pagenumber	29
ltx/en_us_goadedes/skeletons:skLI.CommunionHymn.text	(See Liturgy Variables.)
ltx/en_us_goadedes/skeletons:skLI.CommunionHymn.title	Communion Hymn
ltx/en_us_goadedes/skeletons:skLI.CommunionPrayers.pagenumber	29
ltx/en_us_goadedes/skeletons:skLI.CommunionPrayers.rubric	(Read aloud by the Congregation)
ltx/en_us_goadedes/skeletons:skLI.CommunionPrayers.title	Communion Prayers
ltx/en_us_goadedes/skeletons:skLI.Creed.pagenumber	18
ltx/en_us_goadedes/skeletons:skLI.Creed.title	The Creed
ltx/en_us_goadedes/skeletons:skLI.Dismissal.pagenumber	34
ltx/en_us_goadedes/skeletons:skLI.Dismissal.text	(See Liturgy Variables.)
ltx/en_us_goadedes/skeletons:skLI.Dismissal.title	The Dismissal
ltx/en_us_goadedes/skeletons:skLI.EpistleReading.pagenumber	
ltx/en_us_goadedes/skeletons:skLI.EpistleReading.text	(See Liturgy Variables.)
ltx/en_us_goadedes/skeletons:skLI.EpistleReading.title	Epistle Reading
ltx/en_us_goadedes/skeletons:skLI.GospelReading.text	(See Liturgy Variables.)
ltx/en_us_goadedes/skeletons:skLI.GospelReading.title	Gospel Reading
ltx/en_us_goadedes/skeletons:skLI.GreatEntrance.pagenumber	12
ltx/en_us_goadedes/skeletons:skLI.GreatEntrance.title	The Great Entrance
ltx/en_us_goadedes/skeletons:skLI.HolyCommunion.rubric	Orthodox Christians prepared to receive Holy Communion come forward quietly and reverently at the direction of the ushers.
ltx/en_us_goadedes/skeletons:skLI.HolyCommunion.title	Holy Communion:
ltx/en_us_goadedes/skeletons:skLI.HymnsAfterSmallEntrance.rubric	The clergy sing the first Apolytikion
ltx/en_us_goadedes/skeletons:skLI.HymnsAfterSmallEntrance.text	(See Liturgy Variables.)
ltx/en_us_goadedes/skeletons:skLI.HymnsAfterSmallEntrance.title	Hymns After Small Entrance
ltx/en_us_goadedes/skeletons:skLI.Kontakion.rubric	The clergy begin the Kontakion, and the choir usually sings the last line.
ltx/en_us_goadedes/skeletons:skLI.Kontakion.text	(See Liturgy Variables.)
ltx/en_us_goadedes/skeletons:skLI.Kontakion.title	The Kontakion.
ltx/en_us_goadedes/skeletons:skLI.LordsPrayer.pagenumber	26
ltx/en_us_goadedes/skeletons:skLI.LordsPrayer.title	The Lord’s Prayer
ltx/en_us_goadedes/skeletons:skLI.Notice1.text	This is the text of the Divine Liturgy of St. John Chrysostom, as it is celebrated throughout most of the year. The variable parts have been omitted. It is intended to be used in conjunction with the “Liturgy - Variable Parts” files available each day on the GOA DCS.
ltx/en_us_goadedes/skeletons:skLI.Notice2.text	This is the text of the Divine Liturgy of St. Basil the Great, as it is celebrated on January 1 and the Sundays of Lent. The variable parts have been omitted. It is intended to be used in conjunction with the “Liturgy - Variable Parts” files available each day on the GOA DCS.
ltx/en_us_goadedes/skeletons:skLI.SmallEntrance.pagenumber	
ltx/en_us_goadedes/skeletons:skLI.SmallEntrance.rubric	The choir repeats the end of the Entrance Hymn: “Save us…”
ltx/en_us_goadedes/skeletons:skLI.SmallEntrance.text	(See Liturgy Variables.)
ltx/en_us_goadedes/skeletons:skLI.SmallEntrance.title	The Small Entrance
ltx/en_us_goadedes/skeletons:skLI.Thanksgiving.rubric	Prayers of Thanksgiving after Holy Communion can be found on pages 40-42.
ltx/en_us_goadedes/skeletons:skLI.TheotokosHymn.pagenumber	23
ltx/en_us_goadedes/skeletons:skLI.TheotokosHymn.text	(See Liturgy Variables.)
ltx/en_us_goadedes/skeletons:skLI.TheotokosHymn.title	Hymn to the Theotokos
ltx/en_us_goadedes/skeletons:skLI.Trisagion.pagenumber	
ltx/en_us_goadedes/skeletons:skLI.Trisagion.text	(See Liturgy Variables.)
ltx/en_us_goadedes/skeletons:skLI.Trisagion.title	Trisagion Hymn
