ltx/en_us_goadedes/tr.d048:trCO.header	
ltx/en_us_goadedes/tr.d048:trDA.commemoration.full	
ltx/en_us_goadedes/tr.d048:trDA.commemoration.short	
ltx/en_us_goadedes/tr.d048:trDA.insert1	
ltx/en_us_goadedes/tr.d048:trDA.insert2	
ltx/en_us_goadedes/tr.d048:trDA.note	
ltx/en_us_goadedes/tr.d048:trDA.title	
ltx/en_us_goadedes/tr.d048:trHO.commemorations	
ltx/en_us_goadedes/tr.d048:trHO.daytitle	
ltx/en_us_goadedes/tr.d048:trHO.description1	
ltx/en_us_goadedes/tr.d048:trHO.description2	
ltx/en_us_goadedes/tr.d048:trHO.note1	
ltx/en_us_goadedes/tr.d048:trHO.note2	
ltx/en_us_goadedes/tr.d048:trMA.AposGlory.incipit	@ltx/en_us_goadedes/tr.d043:trMA.AdditionalIdiomelon2.incipit
ltx/en_us_goadedes/tr.d048:trMA.AposGlory.melody	@ltx/en_us_goadedes/miscellanea:misc.Idiomelon
ltx/en_us_goadedes/tr.d048:trMA.AposGlory.mode	@ltx/en_us_goadedes/miscellanea:misc.Mode8
ltx/en_us_goadedes/tr.d048:trMA.AposGlory.text	@ltx/en_us_goadedes/tr.d043:trMA.AdditionalIdiomelon2.text
ltx/en_us_goadedes/tr.d048:trMA.AposIdiomelon1.incipit	…
ltx/en_us_goadedes/tr.d048:trMA.AposIdiomelon1.melody	@ltx/en_us_goadedes/miscellanea:misc.Idiomelon
ltx/en_us_goadedes/tr.d048:trMA.AposIdiomelon1.mode	@ltx/en_us_goadedes/miscellanea:misc.Mode4
ltx/en_us_goadedes/tr.d048:trMA.AposIdiomelon1.text	
ltx/en_us_goadedes/tr.d048:trMA.AposMartyric.incipit	…
ltx/en_us_goadedes/tr.d048:trMA.AposMartyric.melody	
ltx/en_us_goadedes/tr.d048:trMA.AposMartyric.mode	@ltx/en_us_goadedes/miscellanea:misc.Mode4
ltx/en_us_goadedes/tr.d048:trMA.AposMartyric.text	
ltx/en_us_goadedes/tr.d048:trMA.C1.acrostic.notice1	
ltx/en_us_goadedes/tr.d048:trMA.C1.acrostic.text	
ltx/en_us_goadedes/tr.d048:trMA.C1.acrostic.title	Canon for the precious Cross.
ltx/en_us_goadedes/tr.d048:trMA.C1.title	@ltx/en_us_goadedes/titles:ti.Canon1Triodion
ltx/en_us_goadedes/tr.d048:trMA.C1.verse	@ltx/en_us_goadedes/prayers:pr.verse_Cross.text
ltx/en_us_goadedes/tr.d048:trMA.C2.poet	@ltx/en_us_goadedes/poets:po.Iosif
ltx/en_us_goadedes/tr.d048:trMA.C2.title	The three-ode Canon.
ltx/en_us_goadedes/tr.d048:trMA.C2.verse	@ltx/en_us_goadedes/prayers:pr.verse_Cross.text
ltx/en_us_goadedes/tr.d048:trMA.C3.poet	@ltx/en_us_goadedes/poets:po.Theodorou
ltx/en_us_goadedes/tr.d048:trMA.C3.title	Another three-ode Canon.
ltx/en_us_goadedes/tr.d048:trMA.C3.verse	@ltx/en_us_goadedes/prayers:pr.verse_Cross.text
ltx/en_us_goadedes/tr.d048:trMA.Kathisma21.greekmelody	@ltx/en_us_goadedes/he.a.m4:heAU.OYpsotheisEnToStavro.greekname
ltx/en_us_goadedes/tr.d048:trMA.Kathisma21.incipit	…
ltx/en_us_goadedes/tr.d048:trMA.Kathisma21.melody	@ltx/en_us_goadedes/he.a.m4:heAU.OYpsotheisEnToStavro.name
ltx/en_us_goadedes/tr.d048:trMA.Kathisma21.mode	@ltx/en_us_goadedes/miscellanea:misc.Mode4
ltx/en_us_goadedes/tr.d048:trMA.Kathisma21.text	
ltx/en_us_goadedes/tr.d048:trMA.Kathisma22.greekmelody	@ltx/en_us_goadedes/he.a.m4:heAU.OYpsotheisEnToStavro.greekname
ltx/en_us_goadedes/tr.d048:trMA.Kathisma22.incipit	…
ltx/en_us_goadedes/tr.d048:trMA.Kathisma22.melody	@ltx/en_us_goadedes/he.a.m4:heAU.OYpsotheisEnToStavro.name
ltx/en_us_goadedes/tr.d048:trMA.Kathisma22.mode	@ltx/en_us_goadedes/miscellanea:misc.Mode4
ltx/en_us_goadedes/tr.d048:trMA.Kathisma22.text	
ltx/en_us_goadedes/tr.d048:trMA.Kathisma31.greekmelody	@ltx/en_us_goadedes/he.a.m4:heAU.TachyProkatalave.greekname
ltx/en_us_goadedes/tr.d048:trMA.Kathisma31.incipit	…
ltx/en_us_goadedes/tr.d048:trMA.Kathisma31.melody	@ltx/en_us_goadedes/he.a.m4:heAU.TachyProkatalave.name
ltx/en_us_goadedes/tr.d048:trMA.Kathisma31.mode	@ltx/en_us_goadedes/miscellanea:misc.Mode4
ltx/en_us_goadedes/tr.d048:trMA.Kathisma31.text	
ltx/en_us_goadedes/tr.d048:trMA.Kathisma32.greekmelody	@ltx/en_us_goadedes/he.a.m4:heAU.TachyProkatalave.greekname
ltx/en_us_goadedes/tr.d048:trMA.Kathisma32.incipit	…
ltx/en_us_goadedes/tr.d048:trMA.Kathisma32.melody	@ltx/en_us_goadedes/he.a.m4:heAU.TachyProkatalave.name
ltx/en_us_goadedes/tr.d048:trMA.Kathisma32.mode	@ltx/en_us_goadedes/miscellanea:misc.Mode4
ltx/en_us_goadedes/tr.d048:trMA.Kathisma32.text	
ltx/en_us_goadedes/tr.d048:trMA.Kontakion1.incipit	@ltx/en_us_goadedes/tr.d043:trMA.Kontakion1.incipit
ltx/en_us_goadedes/tr.d048:trMA.Kontakion1.melody	@ltx/en_us_goadedes/miscellanea:misc.Automelon
ltx/en_us_goadedes/tr.d048:trMA.Kontakion1.mode	@ltx/en_us_goadedes/miscellanea:misc.Mode7
ltx/en_us_goadedes/tr.d048:trMA.Kontakion1.text	@ltx/en_us_goadedes/tr.d043:trMA.Kontakion1.text
ltx/en_us_goadedes/tr.d048:trMA.Ode1C11.greekmelody	@ltx/en_us_goadedes/he.h.m8:heHE.ArmatilatinFarao.greekname
ltx/en_us_goadedes/tr.d048:trMA.Ode1C11.incipit	…
ltx/en_us_goadedes/tr.d048:trMA.Ode1C11.melody	@ltx/en_us_goadedes/he.h.m8:heHE.ArmatilatinFarao.name
ltx/en_us_goadedes/tr.d048:trMA.Ode1C11.mode	@ltx/en_us_goadedes/miscellanea:misc.Mode8
ltx/en_us_goadedes/tr.d048:trMA.Ode1C11.ode	@ltx/en_us_goadedes/miscellanea:misc.Ode1
ltx/en_us_goadedes/tr.d048:trMA.Ode1C11.text	
ltx/en_us_goadedes/tr.d048:trMA.Ode1C12.incipit	…
ltx/en_us_goadedes/tr.d048:trMA.Ode1C12.melody	@ltx/en_us_goadedes/he.h.m8:heHE.ArmatilatinFarao.name
ltx/en_us_goadedes/tr.d048:trMA.Ode1C12.mode	@ltx/en_us_goadedes/miscellanea:misc.Mode8
ltx/en_us_goadedes/tr.d048:trMA.Ode1C12.ode	@ltx/en_us_goadedes/miscellanea:misc.Ode1
ltx/en_us_goadedes/tr.d048:trMA.Ode1C12.text	
ltx/en_us_goadedes/tr.d048:trMA.Ode1C13.incipit	…
ltx/en_us_goadedes/tr.d048:trMA.Ode1C13.melody	@ltx/en_us_goadedes/he.h.m8:heHE.ArmatilatinFarao.name
ltx/en_us_goadedes/tr.d048:trMA.Ode1C13.mode	@ltx/en_us_goadedes/miscellanea:misc.Mode8
ltx/en_us_goadedes/tr.d048:trMA.Ode1C13.ode	@ltx/en_us_goadedes/miscellanea:misc.Ode1
ltx/en_us_goadedes/tr.d048:trMA.Ode1C13.text	
ltx/en_us_goadedes/tr.d048:trMA.Ode1C14.incipit	…
ltx/en_us_goadedes/tr.d048:trMA.Ode1C14.melody	@ltx/en_us_goadedes/he.h.m8:heHE.ArmatilatinFarao.name
ltx/en_us_goadedes/tr.d048:trMA.Ode1C14.mode	@ltx/en_us_goadedes/miscellanea:misc.Mode8
ltx/en_us_goadedes/tr.d048:trMA.Ode1C14.ode	@ltx/en_us_goadedes/miscellanea:misc.Ode1
ltx/en_us_goadedes/tr.d048:trMA.Ode1C14.text	
ltx/en_us_goadedes/tr.d048:trMA.Ode1C1H.greekmelody	@ltx/en_us_goadedes/he.h.m8:heHE.ArmatilatinFarao.greekname
ltx/en_us_goadedes/tr.d048:trMA.Ode1C1H.incipit	@ltx/en_us_goadedes/he.h.m8:heHE.ArmatilatinFarao.incipit
ltx/en_us_goadedes/tr.d048:trMA.Ode1C1H.melody	@ltx/en_us_goadedes/he.h.m8:heHE.ArmatilatinFarao.melody
ltx/en_us_goadedes/tr.d048:trMA.Ode1C1H.mode	@ltx/en_us_goadedes/miscellanea:misc.Mode8
ltx/en_us_goadedes/tr.d048:trMA.Ode1C1H.ode	@ltx/en_us_goadedes/miscellanea:misc.Ode1
ltx/en_us_goadedes/tr.d048:trMA.Ode1C1H.text	@ltx/en_us_goadedes/he.h.m8:heHE.ArmatilatinFarao.text
ltx/en_us_goadedes/tr.d048:trMA.Ode1C1T.incipit	…
ltx/en_us_goadedes/tr.d048:trMA.Ode1C1T.melody	@ltx/en_us_goadedes/he.h.m8:heHE.ArmatilatinFarao.name
ltx/en_us_goadedes/tr.d048:trMA.Ode1C1T.mode	@ltx/en_us_goadedes/miscellanea:misc.Mode8
ltx/en_us_goadedes/tr.d048:trMA.Ode1C1T.ode	@ltx/en_us_goadedes/miscellanea:misc.Ode1
ltx/en_us_goadedes/tr.d048:trMA.Ode1C1T.text	
ltx/en_us_goadedes/tr.d048:trMA.Ode3C11.greekmelody	@ltx/en_us_goadedes/he.h.m8:heHE.OStereosasKatArchas.greekname
ltx/en_us_goadedes/tr.d048:trMA.Ode3C11.incipit	…
ltx/en_us_goadedes/tr.d048:trMA.Ode3C11.melody	@ltx/en_us_goadedes/he.h.m8:heHE.OStereosasKatArchas.name
ltx/en_us_goadedes/tr.d048:trMA.Ode3C11.mode	@ltx/en_us_goadedes/miscellanea:misc.Mode8
ltx/en_us_goadedes/tr.d048:trMA.Ode3C11.ode	@ltx/en_us_goadedes/miscellanea:misc.Ode3
ltx/en_us_goadedes/tr.d048:trMA.Ode3C11.text	
ltx/en_us_goadedes/tr.d048:trMA.Ode3C12.incipit	…
ltx/en_us_goadedes/tr.d048:trMA.Ode3C12.melody	@ltx/en_us_goadedes/he.h.m8:heHE.OStereosasKatArchas.name
ltx/en_us_goadedes/tr.d048:trMA.Ode3C12.mode	@ltx/en_us_goadedes/miscellanea:misc.Mode8
ltx/en_us_goadedes/tr.d048:trMA.Ode3C12.ode	@ltx/en_us_goadedes/miscellanea:misc.Ode3
ltx/en_us_goadedes/tr.d048:trMA.Ode3C12.text	
ltx/en_us_goadedes/tr.d048:trMA.Ode3C13.incipit	…
ltx/en_us_goadedes/tr.d048:trMA.Ode3C13.melody	@ltx/en_us_goadedes/he.h.m8:heHE.OStereosasKatArchas.name
ltx/en_us_goadedes/tr.d048:trMA.Ode3C13.mode	@ltx/en_us_goadedes/miscellanea:misc.Mode8
ltx/en_us_goadedes/tr.d048:trMA.Ode3C13.ode	@ltx/en_us_goadedes/miscellanea:misc.Ode3
ltx/en_us_goadedes/tr.d048:trMA.Ode3C13.text	
ltx/en_us_goadedes/tr.d048:trMA.Ode3C1H.greekmelody	@ltx/en_us_goadedes/he.h.m8:heHE.OStereosasKatArchas.greekname
ltx/en_us_goadedes/tr.d048:trMA.Ode3C1H.incipit	@ltx/en_us_goadedes/he.h.m8:heHE.OStereosasKatArchas.incipit
ltx/en_us_goadedes/tr.d048:trMA.Ode3C1H.melody	@ltx/en_us_goadedes/he.h.m8:heHE.OStereosasKatArchas.melody
ltx/en_us_goadedes/tr.d048:trMA.Ode3C1H.mode	@ltx/en_us_goadedes/miscellanea:misc.Mode8
ltx/en_us_goadedes/tr.d048:trMA.Ode3C1H.ode	@ltx/en_us_goadedes/miscellanea:misc.Ode3
ltx/en_us_goadedes/tr.d048:trMA.Ode3C1H.text	@ltx/en_us_goadedes/he.h.m8:heHE.OStereosasKatArchas.text
ltx/en_us_goadedes/tr.d048:trMA.Ode3C1T.incipit	…
ltx/en_us_goadedes/tr.d048:trMA.Ode3C1T.melody	@ltx/en_us_goadedes/he.h.m8:heHE.OStereosasKatArchas.name
ltx/en_us_goadedes/tr.d048:trMA.Ode3C1T.mode	@ltx/en_us_goadedes/miscellanea:misc.Mode8
ltx/en_us_goadedes/tr.d048:trMA.Ode3C1T.ode	@ltx/en_us_goadedes/miscellanea:misc.Ode3
ltx/en_us_goadedes/tr.d048:trMA.Ode3C1T.text	
ltx/en_us_goadedes/tr.d048:trMA.Ode3Kathisma1.incipit	…
ltx/en_us_goadedes/tr.d048:trMA.Ode3Kathisma1.melody	
ltx/en_us_goadedes/tr.d048:trMA.Ode3Kathisma1.mode	@ltx/en_us_goadedes/miscellanea:misc.Mode6
ltx/en_us_goadedes/tr.d048:trMA.Ode3Kathisma1.text	
ltx/en_us_goadedes/tr.d048:trMA.Ode3Kathisma2.incipit	…
ltx/en_us_goadedes/tr.d048:trMA.Ode3Kathisma2.melody	
ltx/en_us_goadedes/tr.d048:trMA.Ode3Kathisma2.mode	@ltx/en_us_goadedes/miscellanea:misc.Mode6
ltx/en_us_goadedes/tr.d048:trMA.Ode3Kathisma2.text	
ltx/en_us_goadedes/tr.d048:trMA.Ode4C11.greekmelody	@ltx/en_us_goadedes/he.h.m8:heHE.SyMouIschys.greekname
ltx/en_us_goadedes/tr.d048:trMA.Ode4C11.incipit	…
ltx/en_us_goadedes/tr.d048:trMA.Ode4C11.melody	@ltx/en_us_goadedes/he.h.m8:heHE.SyMouIschys.name
ltx/en_us_goadedes/tr.d048:trMA.Ode4C11.mode	@ltx/en_us_goadedes/miscellanea:misc.Mode6
ltx/en_us_goadedes/tr.d048:trMA.Ode4C11.ode	@ltx/en_us_goadedes/miscellanea:misc.Ode4
ltx/en_us_goadedes/tr.d048:trMA.Ode4C11.text	
ltx/en_us_goadedes/tr.d048:trMA.Ode4C12.incipit	…
ltx/en_us_goadedes/tr.d048:trMA.Ode4C12.melody	@ltx/en_us_goadedes/he.h.m8:heHE.SyMouIschys.name
ltx/en_us_goadedes/tr.d048:trMA.Ode4C12.mode	@ltx/en_us_goadedes/miscellanea:misc.Mode6
ltx/en_us_goadedes/tr.d048:trMA.Ode4C12.ode	@ltx/en_us_goadedes/miscellanea:misc.Ode4
ltx/en_us_goadedes/tr.d048:trMA.Ode4C12.text	
ltx/en_us_goadedes/tr.d048:trMA.Ode4C13.incipit	…
ltx/en_us_goadedes/tr.d048:trMA.Ode4C13.melody	@ltx/en_us_goadedes/he.h.m8:heHE.SyMouIschys.name
ltx/en_us_goadedes/tr.d048:trMA.Ode4C13.mode	@ltx/en_us_goadedes/miscellanea:misc.Mode6
ltx/en_us_goadedes/tr.d048:trMA.Ode4C13.ode	@ltx/en_us_goadedes/miscellanea:misc.Ode4
ltx/en_us_goadedes/tr.d048:trMA.Ode4C13.text	
ltx/en_us_goadedes/tr.d048:trMA.Ode4C14.incipit	…
ltx/en_us_goadedes/tr.d048:trMA.Ode4C14.melody	@ltx/en_us_goadedes/he.h.m8:heHE.SyMouIschys.name
ltx/en_us_goadedes/tr.d048:trMA.Ode4C14.mode	@ltx/en_us_goadedes/miscellanea:misc.Mode6
ltx/en_us_goadedes/tr.d048:trMA.Ode4C14.ode	@ltx/en_us_goadedes/miscellanea:misc.Ode4
ltx/en_us_goadedes/tr.d048:trMA.Ode4C14.text	
ltx/en_us_goadedes/tr.d048:trMA.Ode4C1H.greekmelody	@ltx/en_us_goadedes/he.h.m8:heHE.SyMouIschys.greekname
ltx/en_us_goadedes/tr.d048:trMA.Ode4C1H.incipit	@ltx/en_us_goadedes/he.h.m8:heHE.SyMouIschys.incipit
ltx/en_us_goadedes/tr.d048:trMA.Ode4C1H.melody	@ltx/en_us_goadedes/he.h.m8:heHE.SyMouIschys.melody
ltx/en_us_goadedes/tr.d048:trMA.Ode4C1H.mode	@ltx/en_us_goadedes/miscellanea:misc.Mode8
ltx/en_us_goadedes/tr.d048:trMA.Ode4C1H.ode	@ltx/en_us_goadedes/miscellanea:misc.Ode4
ltx/en_us_goadedes/tr.d048:trMA.Ode4C1H.text	@ltx/en_us_goadedes/he.h.m8:heHE.SyMouIschys.text
ltx/en_us_goadedes/tr.d048:trMA.Ode4C1T.incipit	…
ltx/en_us_goadedes/tr.d048:trMA.Ode4C1T.melody	@ltx/en_us_goadedes/he.h.m8:heHE.SyMouIschys.name
ltx/en_us_goadedes/tr.d048:trMA.Ode4C1T.mode	@ltx/en_us_goadedes/miscellanea:misc.Mode6
ltx/en_us_goadedes/tr.d048:trMA.Ode4C1T.ode	@ltx/en_us_goadedes/miscellanea:misc.Ode4
ltx/en_us_goadedes/tr.d048:trMA.Ode4C1T.text	
ltx/en_us_goadedes/tr.d048:trMA.Ode5C11.greekmelody	@ltx/en_us_goadedes/he.h.m8:heHE.InaTiMeAposo.greekname
ltx/en_us_goadedes/tr.d048:trMA.Ode5C11.incipit	…
ltx/en_us_goadedes/tr.d048:trMA.Ode5C11.melody	@ltx/en_us_goadedes/he.h.m8:heHE.InaTiMeAposo.name
ltx/en_us_goadedes/tr.d048:trMA.Ode5C11.mode	@ltx/en_us_goadedes/miscellanea:misc.Mode6
ltx/en_us_goadedes/tr.d048:trMA.Ode5C11.ode	@ltx/en_us_goadedes/miscellanea:misc.Ode5
ltx/en_us_goadedes/tr.d048:trMA.Ode5C11.text	
ltx/en_us_goadedes/tr.d048:trMA.Ode5C12.incipit	…
ltx/en_us_goadedes/tr.d048:trMA.Ode5C12.melody	@ltx/en_us_goadedes/he.h.m8:heHE.InaTiMeAposo.name
ltx/en_us_goadedes/tr.d048:trMA.Ode5C12.mode	@ltx/en_us_goadedes/miscellanea:misc.Mode6
ltx/en_us_goadedes/tr.d048:trMA.Ode5C12.ode	@ltx/en_us_goadedes/miscellanea:misc.Ode5
ltx/en_us_goadedes/tr.d048:trMA.Ode5C12.text	
ltx/en_us_goadedes/tr.d048:trMA.Ode5C13.incipit	…
ltx/en_us_goadedes/tr.d048:trMA.Ode5C13.melody	@ltx/en_us_goadedes/he.h.m8:heHE.InaTiMeAposo.name
ltx/en_us_goadedes/tr.d048:trMA.Ode5C13.mode	@ltx/en_us_goadedes/miscellanea:misc.Mode6
ltx/en_us_goadedes/tr.d048:trMA.Ode5C13.ode	@ltx/en_us_goadedes/miscellanea:misc.Ode5
ltx/en_us_goadedes/tr.d048:trMA.Ode5C13.text	
ltx/en_us_goadedes/tr.d048:trMA.Ode5C1H.greekmelody	@ltx/en_us_goadedes/he.h.m8:heHE.InaTiMeAposo.greekname
ltx/en_us_goadedes/tr.d048:trMA.Ode5C1H.incipit	@ltx/en_us_goadedes/he.h.m8:heHE.InaTiMeAposo.incipit
ltx/en_us_goadedes/tr.d048:trMA.Ode5C1H.melody	@ltx/en_us_goadedes/he.h.m8:heHE.InaTiMeAposo.melody
ltx/en_us_goadedes/tr.d048:trMA.Ode5C1H.mode	@ltx/en_us_goadedes/miscellanea:misc.Mode8
ltx/en_us_goadedes/tr.d048:trMA.Ode5C1H.ode	@ltx/en_us_goadedes/miscellanea:misc.Ode5
ltx/en_us_goadedes/tr.d048:trMA.Ode5C1H.text	@ltx/en_us_goadedes/he.h.m8:heHE.InaTiMeAposo.text
ltx/en_us_goadedes/tr.d048:trMA.Ode5C1T.incipit	…
ltx/en_us_goadedes/tr.d048:trMA.Ode5C1T.melody	@ltx/en_us_goadedes/he.h.m8:heHE.InaTiMeAposo.name
ltx/en_us_goadedes/tr.d048:trMA.Ode5C1T.mode	@ltx/en_us_goadedes/miscellanea:misc.Mode6
ltx/en_us_goadedes/tr.d048:trMA.Ode5C1T.ode	@ltx/en_us_goadedes/miscellanea:misc.Ode5
ltx/en_us_goadedes/tr.d048:trMA.Ode5C1T.text	
ltx/en_us_goadedes/tr.d048:trMA.Ode5C21.greekmelody	@ltx/en_us_goadedes/he.h.m4:heHE.ExestiTaSympanta.greekname
ltx/en_us_goadedes/tr.d048:trMA.Ode5C21.incipit	…
ltx/en_us_goadedes/tr.d048:trMA.Ode5C21.melody	@ltx/en_us_goadedes/he.h.m4:heHE.ExestiTaSympanta.name
ltx/en_us_goadedes/tr.d048:trMA.Ode5C21.mode	@ltx/en_us_goadedes/miscellanea:misc.Mode4
ltx/en_us_goadedes/tr.d048:trMA.Ode5C21.ode	@ltx/en_us_goadedes/miscellanea:misc.Ode5
ltx/en_us_goadedes/tr.d048:trMA.Ode5C21.text	
ltx/en_us_goadedes/tr.d048:trMA.Ode5C22.incipit	…
ltx/en_us_goadedes/tr.d048:trMA.Ode5C22.melody	@ltx/en_us_goadedes/he.h.m4:heHE.ExestiTaSympanta.name
ltx/en_us_goadedes/tr.d048:trMA.Ode5C22.mode	@ltx/en_us_goadedes/miscellanea:misc.Mode4
ltx/en_us_goadedes/tr.d048:trMA.Ode5C22.ode	@ltx/en_us_goadedes/miscellanea:misc.Ode5
ltx/en_us_goadedes/tr.d048:trMA.Ode5C22.text	
ltx/en_us_goadedes/tr.d048:trMA.Ode5C23.incipit	…
ltx/en_us_goadedes/tr.d048:trMA.Ode5C23.melody	@ltx/en_us_goadedes/he.h.m4:heHE.ExestiTaSympanta.name
ltx/en_us_goadedes/tr.d048:trMA.Ode5C23.mode	@ltx/en_us_goadedes/miscellanea:misc.Mode4
ltx/en_us_goadedes/tr.d048:trMA.Ode5C23.ode	@ltx/en_us_goadedes/miscellanea:misc.Ode5
ltx/en_us_goadedes/tr.d048:trMA.Ode5C23.text	
ltx/en_us_goadedes/tr.d048:trMA.Ode5C2T.incipit	…
ltx/en_us_goadedes/tr.d048:trMA.Ode5C2T.melody	@ltx/en_us_goadedes/he.h.m4:heHE.ExestiTaSympanta.name
ltx/en_us_goadedes/tr.d048:trMA.Ode5C2T.mode	@ltx/en_us_goadedes/miscellanea:misc.Mode4
ltx/en_us_goadedes/tr.d048:trMA.Ode5C2T.ode	@ltx/en_us_goadedes/miscellanea:misc.Ode5
ltx/en_us_goadedes/tr.d048:trMA.Ode5C2T.text	
ltx/en_us_goadedes/tr.d048:trMA.Ode5C31.greekmelody	@ltx/en_us_goadedes/he.h.m4:heHE.EkNyktosOrthrizonta.greekname
ltx/en_us_goadedes/tr.d048:trMA.Ode5C31.incipit	…
ltx/en_us_goadedes/tr.d048:trMA.Ode5C31.melody	@ltx/en_us_goadedes/he.h.m4:heHE.EkNyktosOrthrizonta.name
ltx/en_us_goadedes/tr.d048:trMA.Ode5C31.mode	@ltx/en_us_goadedes/miscellanea:misc.Mode4
ltx/en_us_goadedes/tr.d048:trMA.Ode5C31.ode	@ltx/en_us_goadedes/miscellanea:misc.Ode5
ltx/en_us_goadedes/tr.d048:trMA.Ode5C31.text	
ltx/en_us_goadedes/tr.d048:trMA.Ode5C32.incipit	…
ltx/en_us_goadedes/tr.d048:trMA.Ode5C32.melody	@ltx/en_us_goadedes/he.h.m4:heHE.EkNyktosOrthrizonta.name
ltx/en_us_goadedes/tr.d048:trMA.Ode5C32.mode	@ltx/en_us_goadedes/miscellanea:misc.Mode4
ltx/en_us_goadedes/tr.d048:trMA.Ode5C32.ode	@ltx/en_us_goadedes/miscellanea:misc.Ode5
ltx/en_us_goadedes/tr.d048:trMA.Ode5C32.text	
ltx/en_us_goadedes/tr.d048:trMA.Ode5C3A1.incipit	…
ltx/en_us_goadedes/tr.d048:trMA.Ode5C3A1.melody	@ltx/en_us_goadedes/he.h.m4:heHE.EkNyktosOrthrizonta.name
ltx/en_us_goadedes/tr.d048:trMA.Ode5C3A1.mode	@ltx/en_us_goadedes/miscellanea:misc.Mode4
ltx/en_us_goadedes/tr.d048:trMA.Ode5C3A1.ode	@ltx/en_us_goadedes/miscellanea:misc.Ode5
ltx/en_us_goadedes/tr.d048:trMA.Ode5C3A1.text	
ltx/en_us_goadedes/tr.d048:trMA.Ode5C3H.greekmelody	@ltx/en_us_goadedes/he.h.m4:heHE.EkNyktosOrthrizonta.greekname
ltx/en_us_goadedes/tr.d048:trMA.Ode5C3H.incipit	@ltx/en_us_goadedes/he.h.m4:heHE.EkNyktosOrthrizonta.incipit
ltx/en_us_goadedes/tr.d048:trMA.Ode5C3H.melody	@ltx/en_us_goadedes/he.h.m4:heHE.EkNyktosOrthrizonta.melody
ltx/en_us_goadedes/tr.d048:trMA.Ode5C3H.mode	@ltx/en_us_goadedes/miscellanea:misc.Mode4
ltx/en_us_goadedes/tr.d048:trMA.Ode5C3H.ode	@ltx/en_us_goadedes/miscellanea:misc.Ode5
ltx/en_us_goadedes/tr.d048:trMA.Ode5C3H.text	@ltx/en_us_goadedes/he.h.m4:heHE.EkNyktosOrthrizonta.text
ltx/en_us_goadedes/tr.d048:trMA.Ode5C3T.incipit	…
ltx/en_us_goadedes/tr.d048:trMA.Ode5C3T.melody	@ltx/en_us_goadedes/he.h.m4:heHE.EkNyktosOrthrizonta.name
ltx/en_us_goadedes/tr.d048:trMA.Ode5C3T.mode	@ltx/en_us_goadedes/miscellanea:misc.Mode4
ltx/en_us_goadedes/tr.d048:trMA.Ode5C3T.ode	@ltx/en_us_goadedes/miscellanea:misc.Ode5
ltx/en_us_goadedes/tr.d048:trMA.Ode5C3T.text	
ltx/en_us_goadedes/tr.d048:trMA.Ode5C3Tr.incipit	…
ltx/en_us_goadedes/tr.d048:trMA.Ode5C3Tr.melody	@ltx/en_us_goadedes/he.h.m4:heHE.EkNyktosOrthrizonta.name
ltx/en_us_goadedes/tr.d048:trMA.Ode5C3Tr.mode	@ltx/en_us_goadedes/miscellanea:misc.Mode4
ltx/en_us_goadedes/tr.d048:trMA.Ode5C3Tr.ode	@ltx/en_us_goadedes/miscellanea:misc.Ode5
ltx/en_us_goadedes/tr.d048:trMA.Ode5C3Tr.text	
ltx/en_us_goadedes/tr.d048:trMA.Ode6C11.greekmelody	@ltx/en_us_goadedes/he.h.m8:heHE.IlasthitiMoiSotir.greekname
ltx/en_us_goadedes/tr.d048:trMA.Ode6C11.incipit	…
ltx/en_us_goadedes/tr.d048:trMA.Ode6C11.melody	@ltx/en_us_goadedes/he.h.m8:heHE.IlasthitiMoiSotir.name
ltx/en_us_goadedes/tr.d048:trMA.Ode6C11.mode	@ltx/en_us_goadedes/miscellanea:misc.Mode4
ltx/en_us_goadedes/tr.d048:trMA.Ode6C11.ode	@ltx/en_us_goadedes/miscellanea:misc.Ode6
ltx/en_us_goadedes/tr.d048:trMA.Ode6C11.text	
ltx/en_us_goadedes/tr.d048:trMA.Ode6C12.incipit	…
ltx/en_us_goadedes/tr.d048:trMA.Ode6C12.melody	@ltx/en_us_goadedes/he.h.m8:heHE.IlasthitiMoiSotir.name
ltx/en_us_goadedes/tr.d048:trMA.Ode6C12.mode	@ltx/en_us_goadedes/miscellanea:misc.Mode4
ltx/en_us_goadedes/tr.d048:trMA.Ode6C12.ode	@ltx/en_us_goadedes/miscellanea:misc.Ode6
ltx/en_us_goadedes/tr.d048:trMA.Ode6C12.text	
ltx/en_us_goadedes/tr.d048:trMA.Ode6C13.incipit	…
ltx/en_us_goadedes/tr.d048:trMA.Ode6C13.melody	@ltx/en_us_goadedes/he.h.m8:heHE.IlasthitiMoiSotir.name
ltx/en_us_goadedes/tr.d048:trMA.Ode6C13.mode	@ltx/en_us_goadedes/miscellanea:misc.Mode4
ltx/en_us_goadedes/tr.d048:trMA.Ode6C13.ode	@ltx/en_us_goadedes/miscellanea:misc.Ode6
ltx/en_us_goadedes/tr.d048:trMA.Ode6C13.text	
ltx/en_us_goadedes/tr.d048:trMA.Ode6C1H.greekmelody	@ltx/en_us_goadedes/he.h.m8:heHE.IlasthitiMoiSotir.greekname
ltx/en_us_goadedes/tr.d048:trMA.Ode6C1H.incipit	@ltx/en_us_goadedes/he.h.m8:heHE.IlasthitiMoiSotir.incipit
ltx/en_us_goadedes/tr.d048:trMA.Ode6C1H.melody	@ltx/en_us_goadedes/he.h.m8:heHE.IlasthitiMoiSotir.melody
ltx/en_us_goadedes/tr.d048:trMA.Ode6C1H.mode	@ltx/en_us_goadedes/miscellanea:misc.Mode8
ltx/en_us_goadedes/tr.d048:trMA.Ode6C1H.ode	@ltx/en_us_goadedes/miscellanea:misc.Ode6
ltx/en_us_goadedes/tr.d048:trMA.Ode6C1H.text	@ltx/en_us_goadedes/he.h.m8:heHE.IlasthitiMoiSotir.text
ltx/en_us_goadedes/tr.d048:trMA.Ode6C1T.incipit	…
ltx/en_us_goadedes/tr.d048:trMA.Ode6C1T.melody	@ltx/en_us_goadedes/he.h.m8:heHE.IlasthitiMoiSotir.name
ltx/en_us_goadedes/tr.d048:trMA.Ode6C1T.mode	@ltx/en_us_goadedes/miscellanea:misc.Mode4
ltx/en_us_goadedes/tr.d048:trMA.Ode6C1T.ode	@ltx/en_us_goadedes/miscellanea:misc.Ode6
ltx/en_us_goadedes/tr.d048:trMA.Ode6C1T.text	
ltx/en_us_goadedes/tr.d048:trMA.Ode7C11.greekmelody	@ltx/en_us_goadedes/he.h.m8:heHE.TheouSynkatavasin.greekname
ltx/en_us_goadedes/tr.d048:trMA.Ode7C11.incipit	…
ltx/en_us_goadedes/tr.d048:trMA.Ode7C11.melody	@ltx/en_us_goadedes/he.h.m8:heHE.TheouSynkatavasin.name
ltx/en_us_goadedes/tr.d048:trMA.Ode7C11.mode	@ltx/en_us_goadedes/miscellanea:misc.Mode8
ltx/en_us_goadedes/tr.d048:trMA.Ode7C11.ode	@ltx/en_us_goadedes/miscellanea:misc.Ode7
ltx/en_us_goadedes/tr.d048:trMA.Ode7C11.text	
ltx/en_us_goadedes/tr.d048:trMA.Ode7C12.incipit	…
ltx/en_us_goadedes/tr.d048:trMA.Ode7C12.melody	@ltx/en_us_goadedes/he.h.m8:heHE.TheouSynkatavasin.name
ltx/en_us_goadedes/tr.d048:trMA.Ode7C12.mode	@ltx/en_us_goadedes/miscellanea:misc.Mode8
ltx/en_us_goadedes/tr.d048:trMA.Ode7C12.ode	@ltx/en_us_goadedes/miscellanea:misc.Ode7
ltx/en_us_goadedes/tr.d048:trMA.Ode7C12.text	
ltx/en_us_goadedes/tr.d048:trMA.Ode7C13.incipit	…
ltx/en_us_goadedes/tr.d048:trMA.Ode7C13.melody	@ltx/en_us_goadedes/he.h.m8:heHE.TheouSynkatavasin.name
ltx/en_us_goadedes/tr.d048:trMA.Ode7C13.mode	@ltx/en_us_goadedes/miscellanea:misc.Mode8
ltx/en_us_goadedes/tr.d048:trMA.Ode7C13.ode	@ltx/en_us_goadedes/miscellanea:misc.Ode7
ltx/en_us_goadedes/tr.d048:trMA.Ode7C13.text	
ltx/en_us_goadedes/tr.d048:trMA.Ode7C14.incipit	…
ltx/en_us_goadedes/tr.d048:trMA.Ode7C14.melody	@ltx/en_us_goadedes/he.h.m8:heHE.TheouSynkatavasin.name
ltx/en_us_goadedes/tr.d048:trMA.Ode7C14.mode	@ltx/en_us_goadedes/miscellanea:misc.Mode8
ltx/en_us_goadedes/tr.d048:trMA.Ode7C14.ode	@ltx/en_us_goadedes/miscellanea:misc.Ode7
ltx/en_us_goadedes/tr.d048:trMA.Ode7C14.text	
ltx/en_us_goadedes/tr.d048:trMA.Ode7C1H.greekmelody	@ltx/en_us_goadedes/he.h.m8:heHE.TheouSynkatavasin.greekname
ltx/en_us_goadedes/tr.d048:trMA.Ode7C1H.incipit	@ltx/en_us_goadedes/he.h.m8:heHE.TheouSynkatavasin.incipit
ltx/en_us_goadedes/tr.d048:trMA.Ode7C1H.melody	@ltx/en_us_goadedes/he.h.m8:heHE.TheouSynkatavasin.melody
ltx/en_us_goadedes/tr.d048:trMA.Ode7C1H.mode	@ltx/en_us_goadedes/miscellanea:misc.Mode8
ltx/en_us_goadedes/tr.d048:trMA.Ode7C1H.ode	@ltx/en_us_goadedes/miscellanea:misc.Ode7
ltx/en_us_goadedes/tr.d048:trMA.Ode7C1H.text	@ltx/en_us_goadedes/he.h.m8:heHE.TheouSynkatavasin.text
ltx/en_us_goadedes/tr.d048:trMA.Ode7C1T.incipit	…
ltx/en_us_goadedes/tr.d048:trMA.Ode7C1T.melody	@ltx/en_us_goadedes/he.h.m8:heHE.TheouSynkatavasin.name
ltx/en_us_goadedes/tr.d048:trMA.Ode7C1T.mode	@ltx/en_us_goadedes/miscellanea:misc.Mode8
ltx/en_us_goadedes/tr.d048:trMA.Ode7C1T.ode	@ltx/en_us_goadedes/miscellanea:misc.Ode7
ltx/en_us_goadedes/tr.d048:trMA.Ode7C1T.text	
ltx/en_us_goadedes/tr.d048:trMA.Ode8C11.greekmelody	@ltx/en_us_goadedes/he.h.m8:heHE.EptaplasiosKaminon.greekname
ltx/en_us_goadedes/tr.d048:trMA.Ode8C11.incipit	…
ltx/en_us_goadedes/tr.d048:trMA.Ode8C11.melody	@ltx/en_us_goadedes/he.h.m8:heHE.EptaplasiosKaminon.name
ltx/en_us_goadedes/tr.d048:trMA.Ode8C11.mode	@ltx/en_us_goadedes/miscellanea:misc.Mode8
ltx/en_us_goadedes/tr.d048:trMA.Ode8C11.ode	@ltx/en_us_goadedes/miscellanea:misc.Ode8
ltx/en_us_goadedes/tr.d048:trMA.Ode8C11.text	
ltx/en_us_goadedes/tr.d048:trMA.Ode8C12.incipit	…
ltx/en_us_goadedes/tr.d048:trMA.Ode8C12.melody	@ltx/en_us_goadedes/he.h.m8:heHE.EptaplasiosKaminon.name
ltx/en_us_goadedes/tr.d048:trMA.Ode8C12.mode	@ltx/en_us_goadedes/miscellanea:misc.Mode8
ltx/en_us_goadedes/tr.d048:trMA.Ode8C12.ode	@ltx/en_us_goadedes/miscellanea:misc.Ode8
ltx/en_us_goadedes/tr.d048:trMA.Ode8C12.text	
ltx/en_us_goadedes/tr.d048:trMA.Ode8C13.incipit	…
ltx/en_us_goadedes/tr.d048:trMA.Ode8C13.melody	@ltx/en_us_goadedes/he.h.m8:heHE.EptaplasiosKaminon.name
ltx/en_us_goadedes/tr.d048:trMA.Ode8C13.mode	@ltx/en_us_goadedes/miscellanea:misc.Mode8
ltx/en_us_goadedes/tr.d048:trMA.Ode8C13.ode	@ltx/en_us_goadedes/miscellanea:misc.Ode8
ltx/en_us_goadedes/tr.d048:trMA.Ode8C13.text	
ltx/en_us_goadedes/tr.d048:trMA.Ode8C1H.greekmelody	@ltx/en_us_goadedes/he.h.m8:heHE.EptaplasiosKaminon.greekname
ltx/en_us_goadedes/tr.d048:trMA.Ode8C1H.incipit	@ltx/en_us_goadedes/he.h.m8:heHE.EptaplasiosKaminon.incipit
ltx/en_us_goadedes/tr.d048:trMA.Ode8C1H.melody	@ltx/en_us_goadedes/he.h.m8:heHE.EptaplasiosKaminon.melody
ltx/en_us_goadedes/tr.d048:trMA.Ode8C1H.mode	@ltx/en_us_goadedes/miscellanea:misc.Mode8
ltx/en_us_goadedes/tr.d048:trMA.Ode8C1H.ode	@ltx/en_us_goadedes/miscellanea:misc.Ode8
ltx/en_us_goadedes/tr.d048:trMA.Ode8C1H.text	@ltx/en_us_goadedes/he.h.m8:heHE.EptaplasiosKaminon.text
ltx/en_us_goadedes/tr.d048:trMA.Ode8C1T.incipit	…
ltx/en_us_goadedes/tr.d048:trMA.Ode8C1T.melody	@ltx/en_us_goadedes/he.h.m8:heHE.EptaplasiosKaminon.name
ltx/en_us_goadedes/tr.d048:trMA.Ode8C1T.mode	@ltx/en_us_goadedes/miscellanea:misc.Mode8
ltx/en_us_goadedes/tr.d048:trMA.Ode8C1T.ode	@ltx/en_us_goadedes/miscellanea:misc.Ode8
ltx/en_us_goadedes/tr.d048:trMA.Ode8C1T.text	
ltx/en_us_goadedes/tr.d048:trMA.Ode8C1Tr.incipit	…
ltx/en_us_goadedes/tr.d048:trMA.Ode8C1Tr.melody	@ltx/en_us_goadedes/he.h.m8:heHE.EptaplasiosKaminon.name
ltx/en_us_goadedes/tr.d048:trMA.Ode8C1Tr.mode	@ltx/en_us_goadedes/miscellanea:misc.Mode8
ltx/en_us_goadedes/tr.d048:trMA.Ode8C1Tr.ode	@ltx/en_us_goadedes/miscellanea:misc.Ode8
ltx/en_us_goadedes/tr.d048:trMA.Ode8C1Tr.text	
ltx/en_us_goadedes/tr.d048:trMA.Ode8C21.greekmelody	@ltx/en_us_goadedes/he.h.m4:heHE.PaidasEvageis.greekname
ltx/en_us_goadedes/tr.d048:trMA.Ode8C21.incipit	…
ltx/en_us_goadedes/tr.d048:trMA.Ode8C21.melody	@ltx/en_us_goadedes/he.h.m4:heHE.PaidasEvageis.name
ltx/en_us_goadedes/tr.d048:trMA.Ode8C21.mode	@ltx/en_us_goadedes/miscellanea:misc.Mode4
ltx/en_us_goadedes/tr.d048:trMA.Ode8C21.ode	@ltx/en_us_goadedes/miscellanea:misc.Ode8
ltx/en_us_goadedes/tr.d048:trMA.Ode8C21.text	
ltx/en_us_goadedes/tr.d048:trMA.Ode8C22.incipit	…
ltx/en_us_goadedes/tr.d048:trMA.Ode8C22.melody	@ltx/en_us_goadedes/he.h.m4:heHE.PaidasEvageis.name
ltx/en_us_goadedes/tr.d048:trMA.Ode8C22.mode	@ltx/en_us_goadedes/miscellanea:misc.Mode4
ltx/en_us_goadedes/tr.d048:trMA.Ode8C22.ode	@ltx/en_us_goadedes/miscellanea:misc.Ode8
ltx/en_us_goadedes/tr.d048:trMA.Ode8C22.text	
ltx/en_us_goadedes/tr.d048:trMA.Ode8C23.incipit	…
ltx/en_us_goadedes/tr.d048:trMA.Ode8C23.melody	@ltx/en_us_goadedes/he.h.m4:heHE.PaidasEvageis.name
ltx/en_us_goadedes/tr.d048:trMA.Ode8C23.mode	@ltx/en_us_goadedes/miscellanea:misc.Mode4
ltx/en_us_goadedes/tr.d048:trMA.Ode8C23.ode	@ltx/en_us_goadedes/miscellanea:misc.Ode8
ltx/en_us_goadedes/tr.d048:trMA.Ode8C23.text	
ltx/en_us_goadedes/tr.d048:trMA.Ode8C2T.incipit	…
ltx/en_us_goadedes/tr.d048:trMA.Ode8C2T.melody	@ltx/en_us_goadedes/he.h.m4:heHE.PaidasEvageis.name
ltx/en_us_goadedes/tr.d048:trMA.Ode8C2T.mode	@ltx/en_us_goadedes/miscellanea:misc.Mode4
ltx/en_us_goadedes/tr.d048:trMA.Ode8C2T.ode	@ltx/en_us_goadedes/miscellanea:misc.Ode8
ltx/en_us_goadedes/tr.d048:trMA.Ode8C2T.text	
ltx/en_us_goadedes/tr.d048:trMA.Ode8C31.greekmelody	@ltx/en_us_goadedes/he.h.m4:heHE.PantaTaErgaTouTheou.greekname
ltx/en_us_goadedes/tr.d048:trMA.Ode8C31.incipit	…
ltx/en_us_goadedes/tr.d048:trMA.Ode8C31.melody	@ltx/en_us_goadedes/he.h.m4:heHE.PantaTaErgaTouTheou.name
ltx/en_us_goadedes/tr.d048:trMA.Ode8C31.mode	@ltx/en_us_goadedes/miscellanea:misc.Mode4
ltx/en_us_goadedes/tr.d048:trMA.Ode8C31.ode	@ltx/en_us_goadedes/miscellanea:misc.Ode8
ltx/en_us_goadedes/tr.d048:trMA.Ode8C31.text	
ltx/en_us_goadedes/tr.d048:trMA.Ode8C32.incipit	…
ltx/en_us_goadedes/tr.d048:trMA.Ode8C32.melody	@ltx/en_us_goadedes/he.h.m4:heHE.PantaTaErgaTouTheou.name
ltx/en_us_goadedes/tr.d048:trMA.Ode8C32.mode	@ltx/en_us_goadedes/miscellanea:misc.Mode4
ltx/en_us_goadedes/tr.d048:trMA.Ode8C32.ode	@ltx/en_us_goadedes/miscellanea:misc.Ode8
ltx/en_us_goadedes/tr.d048:trMA.Ode8C32.text	
ltx/en_us_goadedes/tr.d048:trMA.Ode8C3A1.incipit	…
ltx/en_us_goadedes/tr.d048:trMA.Ode8C3A1.melody	@ltx/en_us_goadedes/he.h.m4:heHE.PantaTaErgaTouTheou.name
ltx/en_us_goadedes/tr.d048:trMA.Ode8C3A1.mode	@ltx/en_us_goadedes/miscellanea:misc.Mode4
ltx/en_us_goadedes/tr.d048:trMA.Ode8C3A1.ode	@ltx/en_us_goadedes/miscellanea:misc.Ode8
ltx/en_us_goadedes/tr.d048:trMA.Ode8C3A1.text	
ltx/en_us_goadedes/tr.d048:trMA.Ode8C3H.greekmelody	@ltx/en_us_goadedes/he.h.m4:heHE.PantaTaErgaTouTheou.greekname
ltx/en_us_goadedes/tr.d048:trMA.Ode8C3H.incipit	@ltx/en_us_goadedes/he.h.m4:heHE.PantaTaErgaTouTheou.incipit
ltx/en_us_goadedes/tr.d048:trMA.Ode8C3H.melody	@ltx/en_us_goadedes/he.h.m4:heHE.PantaTaErgaTouTheou.melody
ltx/en_us_goadedes/tr.d048:trMA.Ode8C3H.mode	@ltx/en_us_goadedes/miscellanea:misc.Mode4
ltx/en_us_goadedes/tr.d048:trMA.Ode8C3H.ode	@ltx/en_us_goadedes/miscellanea:misc.Ode8
ltx/en_us_goadedes/tr.d048:trMA.Ode8C3H.text	@ltx/en_us_goadedes/he.h.m4:heHE.PantaTaErgaTouTheou.text
ltx/en_us_goadedes/tr.d048:trMA.Ode8C3T.incipit	…
ltx/en_us_goadedes/tr.d048:trMA.Ode8C3T.melody	@ltx/en_us_goadedes/he.h.m4:heHE.PantaTaErgaTouTheou.name
ltx/en_us_goadedes/tr.d048:trMA.Ode8C3T.mode	@ltx/en_us_goadedes/miscellanea:misc.Mode4
ltx/en_us_goadedes/tr.d048:trMA.Ode8C3T.ode	@ltx/en_us_goadedes/miscellanea:misc.Ode8
ltx/en_us_goadedes/tr.d048:trMA.Ode8C3T.text	
ltx/en_us_goadedes/tr.d048:trMA.Ode8C3Tr.incipit	…
ltx/en_us_goadedes/tr.d048:trMA.Ode8C3Tr.melody	@ltx/en_us_goadedes/he.h.m4:heHE.PantaTaErgaTouTheou.name
ltx/en_us_goadedes/tr.d048:trMA.Ode8C3Tr.mode	@ltx/en_us_goadedes/miscellanea:misc.Mode4
ltx/en_us_goadedes/tr.d048:trMA.Ode8C3Tr.ode	@ltx/en_us_goadedes/miscellanea:misc.Ode8
ltx/en_us_goadedes/tr.d048:trMA.Ode8C3Tr.text	
ltx/en_us_goadedes/tr.d048:trMA.Ode9C11.greekmelody	@ltx/en_us_goadedes/he.h.m8:heHE.ExestiEpiTouto.greekname
ltx/en_us_goadedes/tr.d048:trMA.Ode9C11.incipit	…
ltx/en_us_goadedes/tr.d048:trMA.Ode9C11.melody	@ltx/en_us_goadedes/he.h.m8:heHE.ExestiEpiTouto.name
ltx/en_us_goadedes/tr.d048:trMA.Ode9C11.mode	@ltx/en_us_goadedes/miscellanea:misc.Mode8
ltx/en_us_goadedes/tr.d048:trMA.Ode9C11.ode	@ltx/en_us_goadedes/miscellanea:misc.Ode9
ltx/en_us_goadedes/tr.d048:trMA.Ode9C11.text	
ltx/en_us_goadedes/tr.d048:trMA.Ode9C12.incipit	…
ltx/en_us_goadedes/tr.d048:trMA.Ode9C12.melody	@ltx/en_us_goadedes/he.h.m8:heHE.ExestiEpiTouto.name
ltx/en_us_goadedes/tr.d048:trMA.Ode9C12.mode	@ltx/en_us_goadedes/miscellanea:misc.Mode8
ltx/en_us_goadedes/tr.d048:trMA.Ode9C12.ode	@ltx/en_us_goadedes/miscellanea:misc.Ode9
ltx/en_us_goadedes/tr.d048:trMA.Ode9C12.text	
ltx/en_us_goadedes/tr.d048:trMA.Ode9C13.incipit	…
ltx/en_us_goadedes/tr.d048:trMA.Ode9C13.melody	@ltx/en_us_goadedes/he.h.m8:heHE.ExestiEpiTouto.name
ltx/en_us_goadedes/tr.d048:trMA.Ode9C13.mode	@ltx/en_us_goadedes/miscellanea:misc.Mode8
ltx/en_us_goadedes/tr.d048:trMA.Ode9C13.ode	@ltx/en_us_goadedes/miscellanea:misc.Ode9
ltx/en_us_goadedes/tr.d048:trMA.Ode9C13.text	
ltx/en_us_goadedes/tr.d048:trMA.Ode9C14.incipit	…
ltx/en_us_goadedes/tr.d048:trMA.Ode9C14.melody	@ltx/en_us_goadedes/he.h.m8:heHE.ExestiEpiTouto.name
ltx/en_us_goadedes/tr.d048:trMA.Ode9C14.mode	@ltx/en_us_goadedes/miscellanea:misc.Mode8
ltx/en_us_goadedes/tr.d048:trMA.Ode9C14.ode	@ltx/en_us_goadedes/miscellanea:misc.Ode9
ltx/en_us_goadedes/tr.d048:trMA.Ode9C14.text	
ltx/en_us_goadedes/tr.d048:trMA.Ode9C1H.greekmelody	@ltx/en_us_goadedes/he.h.m8:heHE.ExestiEpiTouto.greekname
ltx/en_us_goadedes/tr.d048:trMA.Ode9C1H.incipit	@ltx/en_us_goadedes/he.h.m8:heHE.ExestiEpiTouto.incipit
ltx/en_us_goadedes/tr.d048:trMA.Ode9C1H.melody	@ltx/en_us_goadedes/he.h.m8:heHE.ExestiEpiTouto.melody
ltx/en_us_goadedes/tr.d048:trMA.Ode9C1H.mode	@ltx/en_us_goadedes/miscellanea:misc.Mode8
ltx/en_us_goadedes/tr.d048:trMA.Ode9C1H.ode	@ltx/en_us_goadedes/miscellanea:misc.Ode9
ltx/en_us_goadedes/tr.d048:trMA.Ode9C1H.text	@ltx/en_us_goadedes/he.h.m8:heHE.ExestiEpiTouto.text
ltx/en_us_goadedes/tr.d048:trMA.Ode9C1T.incipit	…
ltx/en_us_goadedes/tr.d048:trMA.Ode9C1T.melody	@ltx/en_us_goadedes/he.h.m8:heHE.ExestiEpiTouto.name
ltx/en_us_goadedes/tr.d048:trMA.Ode9C1T.mode	@ltx/en_us_goadedes/miscellanea:misc.Mode8
ltx/en_us_goadedes/tr.d048:trMA.Ode9C1T.ode	@ltx/en_us_goadedes/miscellanea:misc.Ode9
ltx/en_us_goadedes/tr.d048:trMA.Ode9C1T.text	
ltx/en_us_goadedes/tr.d048:trMA.Ode9C21.greekmelody	@ltx/en_us_goadedes/he.h.m4:heHE.ApasGigenis.greekname
ltx/en_us_goadedes/tr.d048:trMA.Ode9C21.incipit	…
ltx/en_us_goadedes/tr.d048:trMA.Ode9C21.melody	@ltx/en_us_goadedes/he.h.m4:heHE.ApasGigenis.name
ltx/en_us_goadedes/tr.d048:trMA.Ode9C21.mode	@ltx/en_us_goadedes/miscellanea:misc.Mode4
ltx/en_us_goadedes/tr.d048:trMA.Ode9C21.ode	@ltx/en_us_goadedes/miscellanea:misc.Ode9
ltx/en_us_goadedes/tr.d048:trMA.Ode9C21.text	
ltx/en_us_goadedes/tr.d048:trMA.Ode9C22.incipit	…
ltx/en_us_goadedes/tr.d048:trMA.Ode9C22.melody	@ltx/en_us_goadedes/he.h.m4:heHE.ApasGigenis.name
ltx/en_us_goadedes/tr.d048:trMA.Ode9C22.mode	@ltx/en_us_goadedes/miscellanea:misc.Mode4
ltx/en_us_goadedes/tr.d048:trMA.Ode9C22.ode	@ltx/en_us_goadedes/miscellanea:misc.Ode9
ltx/en_us_goadedes/tr.d048:trMA.Ode9C22.text	
ltx/en_us_goadedes/tr.d048:trMA.Ode9C23.incipit	…
ltx/en_us_goadedes/tr.d048:trMA.Ode9C23.melody	@ltx/en_us_goadedes/he.h.m4:heHE.ApasGigenis.name
ltx/en_us_goadedes/tr.d048:trMA.Ode9C23.mode	@ltx/en_us_goadedes/miscellanea:misc.Mode4
ltx/en_us_goadedes/tr.d048:trMA.Ode9C23.ode	@ltx/en_us_goadedes/miscellanea:misc.Ode9
ltx/en_us_goadedes/tr.d048:trMA.Ode9C23.text	
ltx/en_us_goadedes/tr.d048:trMA.Ode9C2T.incipit	…
ltx/en_us_goadedes/tr.d048:trMA.Ode9C2T.melody	@ltx/en_us_goadedes/he.h.m4:heHE.ApasGigenis.name
ltx/en_us_goadedes/tr.d048:trMA.Ode9C2T.mode	@ltx/en_us_goadedes/miscellanea:misc.Mode4
ltx/en_us_goadedes/tr.d048:trMA.Ode9C2T.ode	@ltx/en_us_goadedes/miscellanea:misc.Ode9
ltx/en_us_goadedes/tr.d048:trMA.Ode9C2T.text	
ltx/en_us_goadedes/tr.d048:trMA.Ode9C31.greekmelody	@ltx/en_us_goadedes/he.h.m4:heHE.TonAsporonTokonSou.greekname
ltx/en_us_goadedes/tr.d048:trMA.Ode9C31.incipit	…
ltx/en_us_goadedes/tr.d048:trMA.Ode9C31.melody	@ltx/en_us_goadedes/he.h.m4:heHE.TonAsporonTokonSou.name
ltx/en_us_goadedes/tr.d048:trMA.Ode9C31.mode	@ltx/en_us_goadedes/miscellanea:misc.Mode4
ltx/en_us_goadedes/tr.d048:trMA.Ode9C31.ode	@ltx/en_us_goadedes/miscellanea:misc.Ode9
ltx/en_us_goadedes/tr.d048:trMA.Ode9C31.text	
ltx/en_us_goadedes/tr.d048:trMA.Ode9C32.incipit	…
ltx/en_us_goadedes/tr.d048:trMA.Ode9C32.melody	@ltx/en_us_goadedes/he.h.m4:heHE.TonAsporonTokonSou.name
ltx/en_us_goadedes/tr.d048:trMA.Ode9C32.mode	@ltx/en_us_goadedes/miscellanea:misc.Mode4
ltx/en_us_goadedes/tr.d048:trMA.Ode9C32.ode	@ltx/en_us_goadedes/miscellanea:misc.Ode9
ltx/en_us_goadedes/tr.d048:trMA.Ode9C32.text	
ltx/en_us_goadedes/tr.d048:trMA.Ode9C3A1.incipit	…
ltx/en_us_goadedes/tr.d048:trMA.Ode9C3A1.melody	@ltx/en_us_goadedes/he.h.m4:heHE.TonAsporonTokonSou.name
ltx/en_us_goadedes/tr.d048:trMA.Ode9C3A1.mode	@ltx/en_us_goadedes/miscellanea:misc.Mode4
ltx/en_us_goadedes/tr.d048:trMA.Ode9C3A1.ode	@ltx/en_us_goadedes/miscellanea:misc.Ode9
ltx/en_us_goadedes/tr.d048:trMA.Ode9C3A1.text	
ltx/en_us_goadedes/tr.d048:trMA.Ode9C3H.greekmelody	@ltx/en_us_goadedes/he.h.m4:heHE.TonAsporonTokonSou.greekname
ltx/en_us_goadedes/tr.d048:trMA.Ode9C3H.incipit	@ltx/en_us_goadedes/he.h.m4:heHE.TonAsporonTokonSou.incipit
ltx/en_us_goadedes/tr.d048:trMA.Ode9C3H.melody	@ltx/en_us_goadedes/he.h.m4:heHE.TonAsporonTokonSou.melody
ltx/en_us_goadedes/tr.d048:trMA.Ode9C3H.mode	@ltx/en_us_goadedes/miscellanea:misc.Mode4
ltx/en_us_goadedes/tr.d048:trMA.Ode9C3H.ode	@ltx/en_us_goadedes/miscellanea:misc.Ode9
ltx/en_us_goadedes/tr.d048:trMA.Ode9C3H.text	@ltx/en_us_goadedes/he.h.m4:heHE.TonAsporonTokonSou.text
ltx/en_us_goadedes/tr.d048:trMA.Ode9C3T.incipit	…
ltx/en_us_goadedes/tr.d048:trMA.Ode9C3T.melody	@ltx/en_us_goadedes/he.h.m4:heHE.TonAsporonTokonSou.name
ltx/en_us_goadedes/tr.d048:trMA.Ode9C3T.mode	@ltx/en_us_goadedes/miscellanea:misc.Mode4
ltx/en_us_goadedes/tr.d048:trMA.Ode9C3T.ode	@ltx/en_us_goadedes/miscellanea:misc.Ode9
ltx/en_us_goadedes/tr.d048:trMA.Ode9C3T.text	
ltx/en_us_goadedes/tr.d048:trMA.Ode9C3Tr.incipit	…
ltx/en_us_goadedes/tr.d048:trMA.Ode9C3Tr.melody	@ltx/en_us_goadedes/he.h.m4:heHE.TonAsporonTokonSou.name
ltx/en_us_goadedes/tr.d048:trMA.Ode9C3Tr.mode	@ltx/en_us_goadedes/miscellanea:misc.Mode4
ltx/en_us_goadedes/tr.d048:trMA.Ode9C3Tr.ode	@ltx/en_us_goadedes/miscellanea:misc.Ode9
ltx/en_us_goadedes/tr.d048:trMA.Ode9C3Tr.text	
ltx/en_us_goadedes/tr.d048:trTE.Troparion.incipit	@ltx/en_us_goadedes/ho.ho07:hoLI.TonStavronSou.incipit
ltx/en_us_goadedes/tr.d048:trTE.Troparion.melody	
ltx/en_us_goadedes/tr.d048:trTE.Troparion.mode	@ltx/en_us_goadedes/miscellanea:misc.Mode6
ltx/en_us_goadedes/tr.d048:trTE.Troparion.text	@ltx/en_us_goadedes/ho.ho07:hoLI.TonStavronSou.text
ltx/en_us_goadedes/tr.d048:trTE.Troparion2.incipit	…
ltx/en_us_goadedes/tr.d048:trTE.Troparion2.text	
ltx/en_us_goadedes/tr.d048:trVE.AposIdiomelon1.incipit	…
ltx/en_us_goadedes/tr.d048:trVE.AposIdiomelon1.melody	@ltx/en_us_goadedes/miscellanea:misc.Idiomelon
ltx/en_us_goadedes/tr.d048:trVE.AposIdiomelon1.mode	@ltx/en_us_goadedes/miscellanea:misc.Mode6
ltx/en_us_goadedes/tr.d048:trVE.AposIdiomelon1.text	
ltx/en_us_goadedes/tr.d048:trVE.AposMartyric.incipit	@ltx/en_us_goadedes/oc.m6.d2:ocVE.Aposticha3.incipit
ltx/en_us_goadedes/tr.d048:trVE.AposMartyric.melody	
ltx/en_us_goadedes/tr.d048:trVE.AposMartyric.mode	@ltx/en_us_goadedes/miscellanea:misc.Mode6
ltx/en_us_goadedes/tr.d048:trVE.AposMartyric.text	@ltx/en_us_goadedes/oc.m6.d2:ocVE.Aposticha3.text
ltx/en_us_goadedes/tr.d048:trVE.AposTheotokion.greekmelody	@ltx/en_us_goadedes/he.a.m6:heAU.TriimerosAnestis.greekname
ltx/en_us_goadedes/tr.d048:trVE.AposTheotokion.incipit	…
ltx/en_us_goadedes/tr.d048:trVE.AposTheotokion.melody	@ltx/en_us_goadedes/he.a.m6:heAU.TriimerosAnestis.name
ltx/en_us_goadedes/tr.d048:trVE.AposTheotokion.mode	@ltx/en_us_goadedes/miscellanea:misc.Mode6
ltx/en_us_goadedes/tr.d048:trVE.AposTheotokion.text	
ltx/en_us_goadedes/tr.d048:trVE.Stichera01.greekmelody	@ltx/en_us_goadedes/he.a.m4:heAU.EdokasSimeiosin.greekname
ltx/en_us_goadedes/tr.d048:trVE.Stichera01.incipit	…
ltx/en_us_goadedes/tr.d048:trVE.Stichera01.melody	@ltx/en_us_goadedes/he.a.m4:heAU.EdokasSimeiosin.name
ltx/en_us_goadedes/tr.d048:trVE.Stichera01.mode	@ltx/en_us_goadedes/miscellanea:misc.Mode4
ltx/en_us_goadedes/tr.d048:trVE.Stichera01.text	
ltx/en_us_goadedes/tr.d048:trVE.Stichera02.greekmelody	@ltx/en_us_goadedes/he.a.m4:heAU.EdokasSimeiosin.greekname
ltx/en_us_goadedes/tr.d048:trVE.Stichera02.incipit	…
ltx/en_us_goadedes/tr.d048:trVE.Stichera02.melody	@ltx/en_us_goadedes/he.a.m4:heAU.EdokasSimeiosin.name
ltx/en_us_goadedes/tr.d048:trVE.Stichera02.mode	@ltx/en_us_goadedes/miscellanea:misc.Mode4
ltx/en_us_goadedes/tr.d048:trVE.Stichera02.text	
ltx/en_us_goadedes/tr.d048:trVE.Stichera03.incipit	…
ltx/en_us_goadedes/tr.d048:trVE.Stichera03.melody	
ltx/en_us_goadedes/tr.d048:trVE.Stichera03.mode	@ltx/en_us_goadedes/miscellanea:misc.Mode4
ltx/en_us_goadedes/tr.d048:trVE.Stichera03.text	
