ltx/en_us_goadedes/me.m11.d04:meDA.commemoration.first	
ltx/en_us_goadedes/me.m11.d04:meDA.commemoration.first_name	
ltx/en_us_goadedes/me.m11.d04:meDA.commemoration.first_short	
ltx/en_us_goadedes/me.m11.d04:meDA.commemoration.first_title	For St. Joannicius.
ltx/en_us_goadedes/me.m11.d04:meDA.commemoration.full	
ltx/en_us_goadedes/me.m11.d04:meDA.commemoration.second_name	
ltx/en_us_goadedes/me.m11.d04:meDA.commemoration.second_title	For St. Nicander.
ltx/en_us_goadedes/me.m11.d04:meDA.date	
ltx/en_us_goadedes/me.m11.d04:meDA.fordate	
ltx/en_us_goadedes/me.m11.d04:meDA.insert1	
ltx/en_us_goadedes/me.m11.d04:meDA.insert2	
ltx/en_us_goadedes/me.m11.d04:meDA.note	
ltx/en_us_goadedes/me.m11.d04:meDA.pdfcoverdate	
ltx/en_us_goadedes/me.m11.d04:meDA.pdfheaderdate	
ltx/en_us_goadedes/me.m11.d04:meHO.commemorations	
ltx/en_us_goadedes/me.m11.d04:meHO.note1	
ltx/en_us_goadedes/me.m11.d04:meHO.note2	
ltx/en_us_goadedes/me.m11.d04:meHO.number	
ltx/en_us_goadedes/me.m11.d04:meHO.rank	
ltx/en_us_goadedes/me.m11.d04:meLE.commemoration1	
ltx/en_us_goadedes/me.m11.d04:meLE.commemoration2	
ltx/en_us_goadedes/me.m11.d04:meLI.Kontakion1.greekmelody	@ltx/en_us_goadedes/me.m11.d04:meMA.Kontakion1.greekmelody
ltx/en_us_goadedes/me.m11.d04:meLI.Kontakion1.incipit	@ltx/en_us_goadedes/me.m11.d04:meMA.Kontakion1.incipit
ltx/en_us_goadedes/me.m11.d04:meLI.Kontakion1.melody	@ltx/en_us_goadedes/me.m11.d04:meMA.Kontakion1.melody
ltx/en_us_goadedes/me.m11.d04:meLI.Kontakion1.mode	@ltx/en_us_goadedes/me.m11.d04:meMA.Kontakion1.mode
ltx/en_us_goadedes/me.m11.d04:meLI.Kontakion1.text	@ltx/en_us_goadedes/me.m11.d04:meMA.Kontakion1.text
ltx/en_us_goadedes/me.m11.d04:meLI.Megalynarion.text	
ltx/en_us_goadedes/me.m11.d04:meMA.C1.acrostic.notice1	
ltx/en_us_goadedes/me.m11.d04:meMA.C1.acrostic.text	
ltx/en_us_goadedes/me.m11.d04:meMA.C1.acrostic.title	
ltx/en_us_goadedes/me.m11.d04:meMA.C1.title	@ltx/en_us_goadedes/titles:ti.CanonDevoutM
ltx/en_us_goadedes/me.m11.d04:meMA.C1.verse	@ltx/en_us_goadedes/prayers:pr.verse_DevoutMan.text
ltx/en_us_goadedes/me.m11.d04:meMA.C2.poet	@ltx/en_us_goadedes/poets:po.Iosif
ltx/en_us_goadedes/me.m11.d04:meMA.C2.title	@ltx/en_us_goadedes/titles:ti.CanonHieromartyrs
ltx/en_us_goadedes/me.m11.d04:meMA.C2.verse	@ltx/en_us_goadedes/prayers:pr.verse_SaintsM.text
ltx/en_us_goadedes/me.m11.d04:meMA.ExapTheotokion.incipit	…
ltx/en_us_goadedes/me.m11.d04:meMA.ExapTheotokion.melody	@ltx/en_us_goadedes/he.a.m2:heAU.GynaikesAkoutisthite.name
ltx/en_us_goadedes/me.m11.d04:meMA.ExapTheotokion.mode	@ltx/en_us_goadedes/miscellanea:misc.Mode2
ltx/en_us_goadedes/me.m11.d04:meMA.ExapTheotokion.text	
ltx/en_us_goadedes/me.m11.d04:meMA.Exaposteilarion1.greekmelody	@ltx/en_us_goadedes/he.a.m2:heAU.GynaikesAkoutisthite.greekname
ltx/en_us_goadedes/me.m11.d04:meMA.Exaposteilarion1.incipit	…
ltx/en_us_goadedes/me.m11.d04:meMA.Exaposteilarion1.melody	@ltx/en_us_goadedes/he.a.m2:heAU.GynaikesAkoutisthite.name
ltx/en_us_goadedes/me.m11.d04:meMA.Exaposteilarion1.mode	@ltx/en_us_goadedes/miscellanea:misc.Mode2
ltx/en_us_goadedes/me.m11.d04:meMA.Exaposteilarion1.text	
ltx/en_us_goadedes/me.m11.d04:meMA.Exaposteilarion2.greekmelody	@ltx/en_us_goadedes/he.a.m2:heAU.GynaikesAkoutisthite.greekname
ltx/en_us_goadedes/me.m11.d04:meMA.Exaposteilarion2.incipit	…
ltx/en_us_goadedes/me.m11.d04:meMA.Exaposteilarion2.melody	@ltx/en_us_goadedes/he.a.m2:heAU.GynaikesAkoutisthite.name
ltx/en_us_goadedes/me.m11.d04:meMA.Exaposteilarion2.mode	@ltx/en_us_goadedes/miscellanea:misc.Mode2
ltx/en_us_goadedes/me.m11.d04:meMA.Exaposteilarion2.text	
ltx/en_us_goadedes/me.m11.d04:meMA.Kontakion1.greekmelody	@ltx/en_us_goadedes/he.a.m8:heAU.TiYpermacho.greekname
ltx/en_us_goadedes/me.m11.d04:meMA.Kontakion1.incipit	…
ltx/en_us_goadedes/me.m11.d04:meMA.Kontakion1.melody	@ltx/en_us_goadedes/he.a.m8:heAU.TiYpermacho.name
ltx/en_us_goadedes/me.m11.d04:meMA.Kontakion1.mode	@ltx/en_us_goadedes/miscellanea:misc.Mode8
ltx/en_us_goadedes/me.m11.d04:meMA.Kontakion1.text	
ltx/en_us_goadedes/me.m11.d04:meMA.Ode1C11.greekmelody	@ltx/en_us_goadedes/he.h.m4:heHE.AnoixoToStomaMou.greekname
ltx/en_us_goadedes/me.m11.d04:meMA.Ode1C11.incipit	…
ltx/en_us_goadedes/me.m11.d04:meMA.Ode1C11.melody	@ltx/en_us_goadedes/he.h.m4:heHE.AnoixoToStomaMou.name
ltx/en_us_goadedes/me.m11.d04:meMA.Ode1C11.mode	@ltx/en_us_goadedes/miscellanea:misc.Mode4
ltx/en_us_goadedes/me.m11.d04:meMA.Ode1C11.ode	@ltx/en_us_goadedes/miscellanea:misc.Ode1
ltx/en_us_goadedes/me.m11.d04:meMA.Ode1C11.text	
ltx/en_us_goadedes/me.m11.d04:meMA.Ode1C12.incipit	…
ltx/en_us_goadedes/me.m11.d04:meMA.Ode1C12.melody	@ltx/en_us_goadedes/he.h.m4:heHE.AnoixoToStomaMou.name
ltx/en_us_goadedes/me.m11.d04:meMA.Ode1C12.mode	@ltx/en_us_goadedes/miscellanea:misc.Mode4
ltx/en_us_goadedes/me.m11.d04:meMA.Ode1C12.ode	@ltx/en_us_goadedes/miscellanea:misc.Ode1
ltx/en_us_goadedes/me.m11.d04:meMA.Ode1C12.text	
ltx/en_us_goadedes/me.m11.d04:meMA.Ode1C13.incipit	…
ltx/en_us_goadedes/me.m11.d04:meMA.Ode1C13.melody	@ltx/en_us_goadedes/he.h.m4:heHE.AnoixoToStomaMou.name
ltx/en_us_goadedes/me.m11.d04:meMA.Ode1C13.mode	@ltx/en_us_goadedes/miscellanea:misc.Mode4
ltx/en_us_goadedes/me.m11.d04:meMA.Ode1C13.ode	@ltx/en_us_goadedes/miscellanea:misc.Ode1
ltx/en_us_goadedes/me.m11.d04:meMA.Ode1C13.text	
ltx/en_us_goadedes/me.m11.d04:meMA.Ode1C1T.incipit	…
ltx/en_us_goadedes/me.m11.d04:meMA.Ode1C1T.melody	@ltx/en_us_goadedes/he.h.m4:heHE.AnoixoToStomaMou.name
ltx/en_us_goadedes/me.m11.d04:meMA.Ode1C1T.mode	@ltx/en_us_goadedes/miscellanea:misc.Mode4
ltx/en_us_goadedes/me.m11.d04:meMA.Ode1C1T.ode	@ltx/en_us_goadedes/miscellanea:misc.Ode1
ltx/en_us_goadedes/me.m11.d04:meMA.Ode1C1T.text	
ltx/en_us_goadedes/me.m11.d04:meMA.Ode1C21.greekmelody	@ltx/en_us_goadedes/he.h.m4:heHE.ChoroiIsrail.greekname
ltx/en_us_goadedes/me.m11.d04:meMA.Ode1C21.incipit	…
ltx/en_us_goadedes/me.m11.d04:meMA.Ode1C21.melody	@ltx/en_us_goadedes/he.h.m4:heHE.ChoroiIsrail.name
ltx/en_us_goadedes/me.m11.d04:meMA.Ode1C21.mode	@ltx/en_us_goadedes/miscellanea:misc.Mode4
ltx/en_us_goadedes/me.m11.d04:meMA.Ode1C21.ode	@ltx/en_us_goadedes/miscellanea:misc.Ode1
ltx/en_us_goadedes/me.m11.d04:meMA.Ode1C21.text	
ltx/en_us_goadedes/me.m11.d04:meMA.Ode1C22.incipit	…
ltx/en_us_goadedes/me.m11.d04:meMA.Ode1C22.melody	@ltx/en_us_goadedes/he.h.m4:heHE.ChoroiIsrail.name
ltx/en_us_goadedes/me.m11.d04:meMA.Ode1C22.mode	@ltx/en_us_goadedes/miscellanea:misc.Mode4
ltx/en_us_goadedes/me.m11.d04:meMA.Ode1C22.ode	@ltx/en_us_goadedes/miscellanea:misc.Ode1
ltx/en_us_goadedes/me.m11.d04:meMA.Ode1C22.text	
ltx/en_us_goadedes/me.m11.d04:meMA.Ode1C23.incipit	…
ltx/en_us_goadedes/me.m11.d04:meMA.Ode1C23.melody	@ltx/en_us_goadedes/he.h.m4:heHE.ChoroiIsrail.name
ltx/en_us_goadedes/me.m11.d04:meMA.Ode1C23.mode	@ltx/en_us_goadedes/miscellanea:misc.Mode4
ltx/en_us_goadedes/me.m11.d04:meMA.Ode1C23.ode	@ltx/en_us_goadedes/miscellanea:misc.Ode1
ltx/en_us_goadedes/me.m11.d04:meMA.Ode1C23.text	
ltx/en_us_goadedes/me.m11.d04:meMA.Ode1C2T.incipit	…
ltx/en_us_goadedes/me.m11.d04:meMA.Ode1C2T.melody	@ltx/en_us_goadedes/he.h.m4:heHE.ChoroiIsrail.name
ltx/en_us_goadedes/me.m11.d04:meMA.Ode1C2T.mode	@ltx/en_us_goadedes/miscellanea:misc.Mode4
ltx/en_us_goadedes/me.m11.d04:meMA.Ode1C2T.ode	@ltx/en_us_goadedes/miscellanea:misc.Ode1
ltx/en_us_goadedes/me.m11.d04:meMA.Ode1C2T.text	
ltx/en_us_goadedes/me.m11.d04:meMA.Ode3C11.greekmelody	@ltx/en_us_goadedes/he.h.m4:heHE.TousSousYmnologous.greekname
ltx/en_us_goadedes/me.m11.d04:meMA.Ode3C11.incipit	…
ltx/en_us_goadedes/me.m11.d04:meMA.Ode3C11.melody	@ltx/en_us_goadedes/he.h.m4:heHE.TousSousYmnologous.name
ltx/en_us_goadedes/me.m11.d04:meMA.Ode3C11.mode	@ltx/en_us_goadedes/miscellanea:misc.Mode4
ltx/en_us_goadedes/me.m11.d04:meMA.Ode3C11.ode	@ltx/en_us_goadedes/miscellanea:misc.Ode3
ltx/en_us_goadedes/me.m11.d04:meMA.Ode3C11.text	
ltx/en_us_goadedes/me.m11.d04:meMA.Ode3C12.incipit	…
ltx/en_us_goadedes/me.m11.d04:meMA.Ode3C12.melody	@ltx/en_us_goadedes/he.h.m4:heHE.TousSousYmnologous.name
ltx/en_us_goadedes/me.m11.d04:meMA.Ode3C12.mode	@ltx/en_us_goadedes/miscellanea:misc.Mode4
ltx/en_us_goadedes/me.m11.d04:meMA.Ode3C12.ode	@ltx/en_us_goadedes/miscellanea:misc.Ode3
ltx/en_us_goadedes/me.m11.d04:meMA.Ode3C12.text	
ltx/en_us_goadedes/me.m11.d04:meMA.Ode3C13.incipit	…
ltx/en_us_goadedes/me.m11.d04:meMA.Ode3C13.melody	@ltx/en_us_goadedes/he.h.m4:heHE.TousSousYmnologous.name
ltx/en_us_goadedes/me.m11.d04:meMA.Ode3C13.mode	@ltx/en_us_goadedes/miscellanea:misc.Mode4
ltx/en_us_goadedes/me.m11.d04:meMA.Ode3C13.ode	@ltx/en_us_goadedes/miscellanea:misc.Ode3
ltx/en_us_goadedes/me.m11.d04:meMA.Ode3C13.text	
ltx/en_us_goadedes/me.m11.d04:meMA.Ode3C1T.incipit	…
ltx/en_us_goadedes/me.m11.d04:meMA.Ode3C1T.melody	@ltx/en_us_goadedes/he.h.m4:heHE.TousSousYmnologous.name
ltx/en_us_goadedes/me.m11.d04:meMA.Ode3C1T.mode	@ltx/en_us_goadedes/miscellanea:misc.Mode4
ltx/en_us_goadedes/me.m11.d04:meMA.Ode3C1T.ode	@ltx/en_us_goadedes/miscellanea:misc.Ode3
ltx/en_us_goadedes/me.m11.d04:meMA.Ode3C1T.text	
ltx/en_us_goadedes/me.m11.d04:meMA.Ode3C21.greekmelody	@ltx/en_us_goadedes/he.h.m4:heHE.OtiSteiraEteken.greekname
ltx/en_us_goadedes/me.m11.d04:meMA.Ode3C21.incipit	…
ltx/en_us_goadedes/me.m11.d04:meMA.Ode3C21.melody	@ltx/en_us_goadedes/he.h.m4:heHE.OtiSteiraEteken.name
ltx/en_us_goadedes/me.m11.d04:meMA.Ode3C21.mode	@ltx/en_us_goadedes/miscellanea:misc.Mode4
ltx/en_us_goadedes/me.m11.d04:meMA.Ode3C21.ode	@ltx/en_us_goadedes/miscellanea:misc.Ode3
ltx/en_us_goadedes/me.m11.d04:meMA.Ode3C21.text	
ltx/en_us_goadedes/me.m11.d04:meMA.Ode3C22.incipit	…
ltx/en_us_goadedes/me.m11.d04:meMA.Ode3C22.melody	@ltx/en_us_goadedes/he.h.m4:heHE.OtiSteiraEteken.name
ltx/en_us_goadedes/me.m11.d04:meMA.Ode3C22.mode	@ltx/en_us_goadedes/miscellanea:misc.Mode4
ltx/en_us_goadedes/me.m11.d04:meMA.Ode3C22.ode	@ltx/en_us_goadedes/miscellanea:misc.Ode3
ltx/en_us_goadedes/me.m11.d04:meMA.Ode3C22.text	
ltx/en_us_goadedes/me.m11.d04:meMA.Ode3C23.incipit	…
ltx/en_us_goadedes/me.m11.d04:meMA.Ode3C23.melody	@ltx/en_us_goadedes/he.h.m4:heHE.OtiSteiraEteken.name
ltx/en_us_goadedes/me.m11.d04:meMA.Ode3C23.mode	@ltx/en_us_goadedes/miscellanea:misc.Mode4
ltx/en_us_goadedes/me.m11.d04:meMA.Ode3C23.ode	@ltx/en_us_goadedes/miscellanea:misc.Ode3
ltx/en_us_goadedes/me.m11.d04:meMA.Ode3C23.text	
ltx/en_us_goadedes/me.m11.d04:meMA.Ode3C2T.incipit	…
ltx/en_us_goadedes/me.m11.d04:meMA.Ode3C2T.melody	@ltx/en_us_goadedes/he.h.m4:heHE.OtiSteiraEteken.name
ltx/en_us_goadedes/me.m11.d04:meMA.Ode3C2T.mode	@ltx/en_us_goadedes/miscellanea:misc.Mode4
ltx/en_us_goadedes/me.m11.d04:meMA.Ode3C2T.ode	@ltx/en_us_goadedes/miscellanea:misc.Ode3
ltx/en_us_goadedes/me.m11.d04:meMA.Ode3C2T.text	
ltx/en_us_goadedes/me.m11.d04:meMA.Ode3H.greekmelody	@ltx/en_us_goadedes/he.h.m4:heHE.OtiSteiraEteken.greekname
ltx/en_us_goadedes/me.m11.d04:meMA.Ode3H.incipit	@ltx/en_us_goadedes/he.h.m4:heHE.OtiSteiraEteken.incipit
ltx/en_us_goadedes/me.m11.d04:meMA.Ode3H.melody	@ltx/en_us_goadedes/he.h.m4:heHE.OtiSteiraEteken.melody
ltx/en_us_goadedes/me.m11.d04:meMA.Ode3H.mode	@ltx/en_us_goadedes/miscellanea:misc.Mode4
ltx/en_us_goadedes/me.m11.d04:meMA.Ode3H.ode	@ltx/en_us_goadedes/miscellanea:misc.Ode3
ltx/en_us_goadedes/me.m11.d04:meMA.Ode3H.text	@ltx/en_us_goadedes/he.h.m4:heHE.OtiSteiraEteken.text
ltx/en_us_goadedes/me.m11.d04:meMA.Ode3Kathisma1.greekmelody	@ltx/en_us_goadedes/he.a.m3:heAU.TinOraiotita.greekname
ltx/en_us_goadedes/me.m11.d04:meMA.Ode3Kathisma1.incipit	…
ltx/en_us_goadedes/me.m11.d04:meMA.Ode3Kathisma1.melody	@ltx/en_us_goadedes/he.a.m3:heAU.TinOraiotita.name
ltx/en_us_goadedes/me.m11.d04:meMA.Ode3Kathisma1.mode	@ltx/en_us_goadedes/miscellanea:misc.Mode3
ltx/en_us_goadedes/me.m11.d04:meMA.Ode3Kathisma1.text	
ltx/en_us_goadedes/me.m11.d04:meMA.Ode3Kathisma2.greekmelody	@ltx/en_us_goadedes/he.a.m3:heAU.TinOraiotita.greekname
ltx/en_us_goadedes/me.m11.d04:meMA.Ode3Kathisma2.incipit	…
ltx/en_us_goadedes/me.m11.d04:meMA.Ode3Kathisma2.melody	@ltx/en_us_goadedes/he.a.m3:heAU.TinOraiotita.name
ltx/en_us_goadedes/me.m11.d04:meMA.Ode3Kathisma2.mode	@ltx/en_us_goadedes/miscellanea:misc.Mode3
ltx/en_us_goadedes/me.m11.d04:meMA.Ode3Kathisma2.text	
ltx/en_us_goadedes/me.m11.d04:meMA.Ode3KathismaSt.incipit	@ltx/en_us_goadedes/me.m06.d16:meMA.Ode3KathismaSt.incipit
ltx/en_us_goadedes/me.m11.d04:meMA.Ode3KathismaSt.melody	@ltx/en_us_goadedes/he.a.m3:heAU.TinOraiotita.name
ltx/en_us_goadedes/me.m11.d04:meMA.Ode3KathismaSt.mode	@ltx/en_us_goadedes/miscellanea:misc.Mode3
ltx/en_us_goadedes/me.m11.d04:meMA.Ode3KathismaSt.text	@ltx/en_us_goadedes/me.m06.d16:meMA.Ode3KathismaSt.text
ltx/en_us_goadedes/me.m11.d04:meMA.Ode3KathismaT.incipit	…
ltx/en_us_goadedes/me.m11.d04:meMA.Ode3KathismaT.melody	@ltx/en_us_goadedes/he.a.m3:heAU.TinOraiotita.name
ltx/en_us_goadedes/me.m11.d04:meMA.Ode3KathismaT.mode	@ltx/en_us_goadedes/miscellanea:misc.Mode3
ltx/en_us_goadedes/me.m11.d04:meMA.Ode3KathismaT.text	
ltx/en_us_goadedes/me.m11.d04:meMA.Ode4C11.greekmelody	@ltx/en_us_goadedes/he.h.m4:heHE.TinAnexichniaston.greekname
ltx/en_us_goadedes/me.m11.d04:meMA.Ode4C11.incipit	…
ltx/en_us_goadedes/me.m11.d04:meMA.Ode4C11.melody	@ltx/en_us_goadedes/he.h.m4:heHE.TinAnexichniaston.name
ltx/en_us_goadedes/me.m11.d04:meMA.Ode4C11.mode	@ltx/en_us_goadedes/miscellanea:misc.Mode4
ltx/en_us_goadedes/me.m11.d04:meMA.Ode4C11.ode	@ltx/en_us_goadedes/miscellanea:misc.Ode4
ltx/en_us_goadedes/me.m11.d04:meMA.Ode4C11.text	
ltx/en_us_goadedes/me.m11.d04:meMA.Ode4C12.incipit	…
ltx/en_us_goadedes/me.m11.d04:meMA.Ode4C12.melody	@ltx/en_us_goadedes/he.h.m4:heHE.TinAnexichniaston.name
ltx/en_us_goadedes/me.m11.d04:meMA.Ode4C12.mode	@ltx/en_us_goadedes/miscellanea:misc.Mode4
ltx/en_us_goadedes/me.m11.d04:meMA.Ode4C12.ode	@ltx/en_us_goadedes/miscellanea:misc.Ode4
ltx/en_us_goadedes/me.m11.d04:meMA.Ode4C12.text	
ltx/en_us_goadedes/me.m11.d04:meMA.Ode4C13.incipit	…
ltx/en_us_goadedes/me.m11.d04:meMA.Ode4C13.melody	@ltx/en_us_goadedes/he.h.m4:heHE.TinAnexichniaston.name
ltx/en_us_goadedes/me.m11.d04:meMA.Ode4C13.mode	@ltx/en_us_goadedes/miscellanea:misc.Mode4
ltx/en_us_goadedes/me.m11.d04:meMA.Ode4C13.ode	@ltx/en_us_goadedes/miscellanea:misc.Ode4
ltx/en_us_goadedes/me.m11.d04:meMA.Ode4C13.text	
ltx/en_us_goadedes/me.m11.d04:meMA.Ode4C14.incipit	…
ltx/en_us_goadedes/me.m11.d04:meMA.Ode4C14.melody	@ltx/en_us_goadedes/he.h.m4:heHE.TinAnexichniaston.name
ltx/en_us_goadedes/me.m11.d04:meMA.Ode4C14.mode	@ltx/en_us_goadedes/miscellanea:misc.Mode4
ltx/en_us_goadedes/me.m11.d04:meMA.Ode4C14.ode	@ltx/en_us_goadedes/miscellanea:misc.Ode4
ltx/en_us_goadedes/me.m11.d04:meMA.Ode4C14.text	
ltx/en_us_goadedes/me.m11.d04:meMA.Ode4C1T.incipit	…
ltx/en_us_goadedes/me.m11.d04:meMA.Ode4C1T.melody	@ltx/en_us_goadedes/he.h.m4:heHE.TinAnexichniaston.name
ltx/en_us_goadedes/me.m11.d04:meMA.Ode4C1T.mode	@ltx/en_us_goadedes/miscellanea:misc.Mode4
ltx/en_us_goadedes/me.m11.d04:meMA.Ode4C1T.ode	@ltx/en_us_goadedes/miscellanea:misc.Ode4
ltx/en_us_goadedes/me.m11.d04:meMA.Ode4C1T.text	
ltx/en_us_goadedes/me.m11.d04:meMA.Ode4C21.greekmelody	@ltx/en_us_goadedes/he.h.m4:heHE.OKathimenosEnDoxi.greekname
ltx/en_us_goadedes/me.m11.d04:meMA.Ode4C21.incipit	…
ltx/en_us_goadedes/me.m11.d04:meMA.Ode4C21.melody	@ltx/en_us_goadedes/he.h.m4:heHE.OKathimenosEnDoxi.name
ltx/en_us_goadedes/me.m11.d04:meMA.Ode4C21.mode	@ltx/en_us_goadedes/miscellanea:misc.Mode4
ltx/en_us_goadedes/me.m11.d04:meMA.Ode4C21.ode	@ltx/en_us_goadedes/miscellanea:misc.Ode4
ltx/en_us_goadedes/me.m11.d04:meMA.Ode4C21.text	
ltx/en_us_goadedes/me.m11.d04:meMA.Ode4C22.incipit	…
ltx/en_us_goadedes/me.m11.d04:meMA.Ode4C22.melody	@ltx/en_us_goadedes/he.h.m4:heHE.OKathimenosEnDoxi.name
ltx/en_us_goadedes/me.m11.d04:meMA.Ode4C22.mode	@ltx/en_us_goadedes/miscellanea:misc.Mode4
ltx/en_us_goadedes/me.m11.d04:meMA.Ode4C22.ode	@ltx/en_us_goadedes/miscellanea:misc.Ode4
ltx/en_us_goadedes/me.m11.d04:meMA.Ode4C22.text	
ltx/en_us_goadedes/me.m11.d04:meMA.Ode4C23.incipit	…
ltx/en_us_goadedes/me.m11.d04:meMA.Ode4C23.melody	@ltx/en_us_goadedes/he.h.m4:heHE.OKathimenosEnDoxi.name
ltx/en_us_goadedes/me.m11.d04:meMA.Ode4C23.mode	@ltx/en_us_goadedes/miscellanea:misc.Mode4
ltx/en_us_goadedes/me.m11.d04:meMA.Ode4C23.ode	@ltx/en_us_goadedes/miscellanea:misc.Ode4
ltx/en_us_goadedes/me.m11.d04:meMA.Ode4C23.text	
ltx/en_us_goadedes/me.m11.d04:meMA.Ode4C2T.incipit	…
ltx/en_us_goadedes/me.m11.d04:meMA.Ode4C2T.melody	@ltx/en_us_goadedes/he.h.m4:heHE.OKathimenosEnDoxi.name
ltx/en_us_goadedes/me.m11.d04:meMA.Ode4C2T.mode	@ltx/en_us_goadedes/miscellanea:misc.Mode4
ltx/en_us_goadedes/me.m11.d04:meMA.Ode4C2T.ode	@ltx/en_us_goadedes/miscellanea:misc.Ode4
ltx/en_us_goadedes/me.m11.d04:meMA.Ode4C2T.text	
ltx/en_us_goadedes/me.m11.d04:meMA.Ode5C11.greekmelody	@ltx/en_us_goadedes/he.h.m4:heHE.ExestiTaSympanta.greekname
ltx/en_us_goadedes/me.m11.d04:meMA.Ode5C11.incipit	…
ltx/en_us_goadedes/me.m11.d04:meMA.Ode5C11.melody	@ltx/en_us_goadedes/he.h.m4:heHE.ExestiTaSympanta.name
ltx/en_us_goadedes/me.m11.d04:meMA.Ode5C11.mode	@ltx/en_us_goadedes/miscellanea:misc.Mode4
ltx/en_us_goadedes/me.m11.d04:meMA.Ode5C11.ode	@ltx/en_us_goadedes/miscellanea:misc.Ode5
ltx/en_us_goadedes/me.m11.d04:meMA.Ode5C11.text	
ltx/en_us_goadedes/me.m11.d04:meMA.Ode5C12.incipit	…
ltx/en_us_goadedes/me.m11.d04:meMA.Ode5C12.melody	@ltx/en_us_goadedes/he.h.m4:heHE.ExestiTaSympanta.name
ltx/en_us_goadedes/me.m11.d04:meMA.Ode5C12.mode	@ltx/en_us_goadedes/miscellanea:misc.Mode4
ltx/en_us_goadedes/me.m11.d04:meMA.Ode5C12.ode	@ltx/en_us_goadedes/miscellanea:misc.Ode5
ltx/en_us_goadedes/me.m11.d04:meMA.Ode5C12.text	
ltx/en_us_goadedes/me.m11.d04:meMA.Ode5C13.incipit	…
ltx/en_us_goadedes/me.m11.d04:meMA.Ode5C13.melody	@ltx/en_us_goadedes/he.h.m4:heHE.ExestiTaSympanta.name
ltx/en_us_goadedes/me.m11.d04:meMA.Ode5C13.mode	@ltx/en_us_goadedes/miscellanea:misc.Mode4
ltx/en_us_goadedes/me.m11.d04:meMA.Ode5C13.ode	@ltx/en_us_goadedes/miscellanea:misc.Ode5
ltx/en_us_goadedes/me.m11.d04:meMA.Ode5C13.text	
ltx/en_us_goadedes/me.m11.d04:meMA.Ode5C1T.incipit	…
ltx/en_us_goadedes/me.m11.d04:meMA.Ode5C1T.melody	@ltx/en_us_goadedes/he.h.m4:heHE.ExestiTaSympanta.name
ltx/en_us_goadedes/me.m11.d04:meMA.Ode5C1T.mode	@ltx/en_us_goadedes/miscellanea:misc.Mode4
ltx/en_us_goadedes/me.m11.d04:meMA.Ode5C1T.ode	@ltx/en_us_goadedes/miscellanea:misc.Ode5
ltx/en_us_goadedes/me.m11.d04:meMA.Ode5C1T.text	
ltx/en_us_goadedes/me.m11.d04:meMA.Ode5C21.greekmelody	@ltx/en_us_goadedes/he.h.m4:heHE.TonFotismonSouKyrie.greekname
ltx/en_us_goadedes/me.m11.d04:meMA.Ode5C21.incipit	…
ltx/en_us_goadedes/me.m11.d04:meMA.Ode5C21.melody	@ltx/en_us_goadedes/he.h.m4:heHE.TonFotismonSouKyrie.name
ltx/en_us_goadedes/me.m11.d04:meMA.Ode5C21.mode	@ltx/en_us_goadedes/miscellanea:misc.Mode4
ltx/en_us_goadedes/me.m11.d04:meMA.Ode5C21.ode	@ltx/en_us_goadedes/miscellanea:misc.Ode5
ltx/en_us_goadedes/me.m11.d04:meMA.Ode5C21.text	
ltx/en_us_goadedes/me.m11.d04:meMA.Ode5C22.incipit	…
ltx/en_us_goadedes/me.m11.d04:meMA.Ode5C22.melody	@ltx/en_us_goadedes/he.h.m4:heHE.TonFotismonSouKyrie.name
ltx/en_us_goadedes/me.m11.d04:meMA.Ode5C22.mode	@ltx/en_us_goadedes/miscellanea:misc.Mode4
ltx/en_us_goadedes/me.m11.d04:meMA.Ode5C22.ode	@ltx/en_us_goadedes/miscellanea:misc.Ode5
ltx/en_us_goadedes/me.m11.d04:meMA.Ode5C22.text	
ltx/en_us_goadedes/me.m11.d04:meMA.Ode5C23.incipit	…
ltx/en_us_goadedes/me.m11.d04:meMA.Ode5C23.melody	@ltx/en_us_goadedes/he.h.m4:heHE.TonFotismonSouKyrie.name
ltx/en_us_goadedes/me.m11.d04:meMA.Ode5C23.mode	@ltx/en_us_goadedes/miscellanea:misc.Mode4
ltx/en_us_goadedes/me.m11.d04:meMA.Ode5C23.ode	@ltx/en_us_goadedes/miscellanea:misc.Ode5
ltx/en_us_goadedes/me.m11.d04:meMA.Ode5C23.text	
ltx/en_us_goadedes/me.m11.d04:meMA.Ode5C2T.incipit	…
ltx/en_us_goadedes/me.m11.d04:meMA.Ode5C2T.melody	@ltx/en_us_goadedes/he.h.m4:heHE.TonFotismonSouKyrie.name
ltx/en_us_goadedes/me.m11.d04:meMA.Ode5C2T.mode	@ltx/en_us_goadedes/miscellanea:misc.Mode4
ltx/en_us_goadedes/me.m11.d04:meMA.Ode5C2T.ode	@ltx/en_us_goadedes/miscellanea:misc.Ode5
ltx/en_us_goadedes/me.m11.d04:meMA.Ode5C2T.text	
ltx/en_us_goadedes/me.m11.d04:meMA.Ode6C11.greekmelody	@ltx/en_us_goadedes/he.h.m4:heHE.TinTheianTaftin.greekname
ltx/en_us_goadedes/me.m11.d04:meMA.Ode6C11.incipit	…
ltx/en_us_goadedes/me.m11.d04:meMA.Ode6C11.melody	@ltx/en_us_goadedes/he.h.m4:heHE.TinTheianTaftin.name
ltx/en_us_goadedes/me.m11.d04:meMA.Ode6C11.mode	@ltx/en_us_goadedes/miscellanea:misc.Mode4
ltx/en_us_goadedes/me.m11.d04:meMA.Ode6C11.ode	@ltx/en_us_goadedes/miscellanea:misc.Ode6
ltx/en_us_goadedes/me.m11.d04:meMA.Ode6C11.text	
ltx/en_us_goadedes/me.m11.d04:meMA.Ode6C12.incipit	…
ltx/en_us_goadedes/me.m11.d04:meMA.Ode6C12.melody	@ltx/en_us_goadedes/he.h.m4:heHE.TinTheianTaftin.name
ltx/en_us_goadedes/me.m11.d04:meMA.Ode6C12.mode	@ltx/en_us_goadedes/miscellanea:misc.Mode4
ltx/en_us_goadedes/me.m11.d04:meMA.Ode6C12.ode	@ltx/en_us_goadedes/miscellanea:misc.Ode6
ltx/en_us_goadedes/me.m11.d04:meMA.Ode6C12.text	
ltx/en_us_goadedes/me.m11.d04:meMA.Ode6C13.incipit	…
ltx/en_us_goadedes/me.m11.d04:meMA.Ode6C13.melody	@ltx/en_us_goadedes/he.h.m4:heHE.TinTheianTaftin.name
ltx/en_us_goadedes/me.m11.d04:meMA.Ode6C13.mode	@ltx/en_us_goadedes/miscellanea:misc.Mode4
ltx/en_us_goadedes/me.m11.d04:meMA.Ode6C13.ode	@ltx/en_us_goadedes/miscellanea:misc.Ode6
ltx/en_us_goadedes/me.m11.d04:meMA.Ode6C13.text	
ltx/en_us_goadedes/me.m11.d04:meMA.Ode6C1T.incipit	…
ltx/en_us_goadedes/me.m11.d04:meMA.Ode6C1T.melody	@ltx/en_us_goadedes/he.h.m4:heHE.TinTheianTaftin.name
ltx/en_us_goadedes/me.m11.d04:meMA.Ode6C1T.mode	@ltx/en_us_goadedes/miscellanea:misc.Mode4
ltx/en_us_goadedes/me.m11.d04:meMA.Ode6C1T.ode	@ltx/en_us_goadedes/miscellanea:misc.Ode6
ltx/en_us_goadedes/me.m11.d04:meMA.Ode6C1T.text	
ltx/en_us_goadedes/me.m11.d04:meMA.Ode6C21.greekmelody	@ltx/en_us_goadedes/he.h.m4:heHE.EvoiseProtypon.greekname
ltx/en_us_goadedes/me.m11.d04:meMA.Ode6C21.incipit	…
ltx/en_us_goadedes/me.m11.d04:meMA.Ode6C21.melody	@ltx/en_us_goadedes/he.h.m4:heHE.EvoiseProtypon.name
ltx/en_us_goadedes/me.m11.d04:meMA.Ode6C21.mode	@ltx/en_us_goadedes/miscellanea:misc.Mode4
ltx/en_us_goadedes/me.m11.d04:meMA.Ode6C21.ode	@ltx/en_us_goadedes/miscellanea:misc.Ode6
ltx/en_us_goadedes/me.m11.d04:meMA.Ode6C21.text	
ltx/en_us_goadedes/me.m11.d04:meMA.Ode6C22.incipit	…
ltx/en_us_goadedes/me.m11.d04:meMA.Ode6C22.melody	@ltx/en_us_goadedes/he.h.m4:heHE.EvoiseProtypon.name
ltx/en_us_goadedes/me.m11.d04:meMA.Ode6C22.mode	@ltx/en_us_goadedes/miscellanea:misc.Mode4
ltx/en_us_goadedes/me.m11.d04:meMA.Ode6C22.ode	@ltx/en_us_goadedes/miscellanea:misc.Ode6
ltx/en_us_goadedes/me.m11.d04:meMA.Ode6C22.text	
ltx/en_us_goadedes/me.m11.d04:meMA.Ode6C23.incipit	…
ltx/en_us_goadedes/me.m11.d04:meMA.Ode6C23.melody	@ltx/en_us_goadedes/he.h.m4:heHE.EvoiseProtypon.name
ltx/en_us_goadedes/me.m11.d04:meMA.Ode6C23.mode	@ltx/en_us_goadedes/miscellanea:misc.Mode4
ltx/en_us_goadedes/me.m11.d04:meMA.Ode6C23.ode	@ltx/en_us_goadedes/miscellanea:misc.Ode6
ltx/en_us_goadedes/me.m11.d04:meMA.Ode6C23.text	
ltx/en_us_goadedes/me.m11.d04:meMA.Ode6C2T.incipit	…
ltx/en_us_goadedes/me.m11.d04:meMA.Ode6C2T.melody	@ltx/en_us_goadedes/he.h.m4:heHE.EvoiseProtypon.name
ltx/en_us_goadedes/me.m11.d04:meMA.Ode6C2T.mode	@ltx/en_us_goadedes/miscellanea:misc.Mode4
ltx/en_us_goadedes/me.m11.d04:meMA.Ode6C2T.ode	@ltx/en_us_goadedes/miscellanea:misc.Ode6
ltx/en_us_goadedes/me.m11.d04:meMA.Ode6C2T.text	
ltx/en_us_goadedes/me.m11.d04:meMA.Ode6H.greekmelody	@ltx/en_us_goadedes/he.h.m4:heHE.EvoiseProtypon.greekname
ltx/en_us_goadedes/me.m11.d04:meMA.Ode6H.incipit	@ltx/en_us_goadedes/he.h.m4:heHE.EvoiseProtypon.incipit
ltx/en_us_goadedes/me.m11.d04:meMA.Ode6H.melody	@ltx/en_us_goadedes/he.h.m4:heHE.EvoiseProtypon.melody
ltx/en_us_goadedes/me.m11.d04:meMA.Ode6H.mode	@ltx/en_us_goadedes/miscellanea:misc.Mode4
ltx/en_us_goadedes/me.m11.d04:meMA.Ode6H.ode	@ltx/en_us_goadedes/miscellanea:misc.Ode6
ltx/en_us_goadedes/me.m11.d04:meMA.Ode6H.text	@ltx/en_us_goadedes/he.h.m4:heHE.EvoiseProtypon.text
ltx/en_us_goadedes/me.m11.d04:meMA.Ode7C11.greekmelody	@ltx/en_us_goadedes/he.h.m4:heHE.OukElatrefsan.greekname
ltx/en_us_goadedes/me.m11.d04:meMA.Ode7C11.incipit	…
ltx/en_us_goadedes/me.m11.d04:meMA.Ode7C11.melody	@ltx/en_us_goadedes/he.h.m4:heHE.OukElatrefsan.name
ltx/en_us_goadedes/me.m11.d04:meMA.Ode7C11.mode	@ltx/en_us_goadedes/miscellanea:misc.Mode4
ltx/en_us_goadedes/me.m11.d04:meMA.Ode7C11.ode	@ltx/en_us_goadedes/miscellanea:misc.Ode7
ltx/en_us_goadedes/me.m11.d04:meMA.Ode7C11.text	
ltx/en_us_goadedes/me.m11.d04:meMA.Ode7C12.incipit	…
ltx/en_us_goadedes/me.m11.d04:meMA.Ode7C12.melody	@ltx/en_us_goadedes/he.h.m4:heHE.OukElatrefsan.name
ltx/en_us_goadedes/me.m11.d04:meMA.Ode7C12.mode	@ltx/en_us_goadedes/miscellanea:misc.Mode4
ltx/en_us_goadedes/me.m11.d04:meMA.Ode7C12.ode	@ltx/en_us_goadedes/miscellanea:misc.Ode7
ltx/en_us_goadedes/me.m11.d04:meMA.Ode7C12.text	
ltx/en_us_goadedes/me.m11.d04:meMA.Ode7C13.incipit	…
ltx/en_us_goadedes/me.m11.d04:meMA.Ode7C13.melody	@ltx/en_us_goadedes/he.h.m4:heHE.OukElatrefsan.name
ltx/en_us_goadedes/me.m11.d04:meMA.Ode7C13.mode	@ltx/en_us_goadedes/miscellanea:misc.Mode4
ltx/en_us_goadedes/me.m11.d04:meMA.Ode7C13.ode	@ltx/en_us_goadedes/miscellanea:misc.Ode7
ltx/en_us_goadedes/me.m11.d04:meMA.Ode7C13.text	
ltx/en_us_goadedes/me.m11.d04:meMA.Ode7C1T.incipit	…
ltx/en_us_goadedes/me.m11.d04:meMA.Ode7C1T.melody	@ltx/en_us_goadedes/he.h.m4:heHE.OukElatrefsan.name
ltx/en_us_goadedes/me.m11.d04:meMA.Ode7C1T.mode	@ltx/en_us_goadedes/miscellanea:misc.Mode4
ltx/en_us_goadedes/me.m11.d04:meMA.Ode7C1T.ode	@ltx/en_us_goadedes/miscellanea:misc.Ode7
ltx/en_us_goadedes/me.m11.d04:meMA.Ode7C1T.text	
ltx/en_us_goadedes/me.m11.d04:meMA.Ode7C21.greekmelody	@ltx/en_us_goadedes/he.h.m4:heHE.AvramiaioiPote.greekname
ltx/en_us_goadedes/me.m11.d04:meMA.Ode7C21.incipit	…
ltx/en_us_goadedes/me.m11.d04:meMA.Ode7C21.melody	@ltx/en_us_goadedes/he.h.m4:heHE.AvramiaioiPote.name
ltx/en_us_goadedes/me.m11.d04:meMA.Ode7C21.mode	@ltx/en_us_goadedes/miscellanea:misc.Mode4
ltx/en_us_goadedes/me.m11.d04:meMA.Ode7C21.ode	@ltx/en_us_goadedes/miscellanea:misc.Ode7
ltx/en_us_goadedes/me.m11.d04:meMA.Ode7C21.text	
ltx/en_us_goadedes/me.m11.d04:meMA.Ode7C22.incipit	…
ltx/en_us_goadedes/me.m11.d04:meMA.Ode7C22.melody	@ltx/en_us_goadedes/he.h.m4:heHE.AvramiaioiPote.name
ltx/en_us_goadedes/me.m11.d04:meMA.Ode7C22.mode	@ltx/en_us_goadedes/miscellanea:misc.Mode4
ltx/en_us_goadedes/me.m11.d04:meMA.Ode7C22.ode	@ltx/en_us_goadedes/miscellanea:misc.Ode7
ltx/en_us_goadedes/me.m11.d04:meMA.Ode7C22.text	
ltx/en_us_goadedes/me.m11.d04:meMA.Ode7C23.incipit	…
ltx/en_us_goadedes/me.m11.d04:meMA.Ode7C23.melody	@ltx/en_us_goadedes/he.h.m4:heHE.AvramiaioiPote.name
ltx/en_us_goadedes/me.m11.d04:meMA.Ode7C23.mode	@ltx/en_us_goadedes/miscellanea:misc.Mode4
ltx/en_us_goadedes/me.m11.d04:meMA.Ode7C23.ode	@ltx/en_us_goadedes/miscellanea:misc.Ode7
ltx/en_us_goadedes/me.m11.d04:meMA.Ode7C23.text	
ltx/en_us_goadedes/me.m11.d04:meMA.Ode7C2T.incipit	…
ltx/en_us_goadedes/me.m11.d04:meMA.Ode7C2T.melody	@ltx/en_us_goadedes/he.h.m4:heHE.AvramiaioiPote.name
ltx/en_us_goadedes/me.m11.d04:meMA.Ode7C2T.mode	@ltx/en_us_goadedes/miscellanea:misc.Mode4
ltx/en_us_goadedes/me.m11.d04:meMA.Ode7C2T.ode	@ltx/en_us_goadedes/miscellanea:misc.Ode7
ltx/en_us_goadedes/me.m11.d04:meMA.Ode7C2T.text	
ltx/en_us_goadedes/me.m11.d04:meMA.Ode8C11.greekmelody	@ltx/en_us_goadedes/he.h.m4:heHE.PaidasEvageis.greekname
ltx/en_us_goadedes/me.m11.d04:meMA.Ode8C11.incipit	…
ltx/en_us_goadedes/me.m11.d04:meMA.Ode8C11.melody	@ltx/en_us_goadedes/he.h.m4:heHE.PaidasEvageis.name
ltx/en_us_goadedes/me.m11.d04:meMA.Ode8C11.mode	@ltx/en_us_goadedes/miscellanea:misc.Mode4
ltx/en_us_goadedes/me.m11.d04:meMA.Ode8C11.ode	@ltx/en_us_goadedes/miscellanea:misc.Ode8
ltx/en_us_goadedes/me.m11.d04:meMA.Ode8C11.text	
ltx/en_us_goadedes/me.m11.d04:meMA.Ode8C12.incipit	…
ltx/en_us_goadedes/me.m11.d04:meMA.Ode8C12.melody	@ltx/en_us_goadedes/he.h.m4:heHE.PaidasEvageis.name
ltx/en_us_goadedes/me.m11.d04:meMA.Ode8C12.mode	@ltx/en_us_goadedes/miscellanea:misc.Mode4
ltx/en_us_goadedes/me.m11.d04:meMA.Ode8C12.ode	@ltx/en_us_goadedes/miscellanea:misc.Ode8
ltx/en_us_goadedes/me.m11.d04:meMA.Ode8C12.text	
ltx/en_us_goadedes/me.m11.d04:meMA.Ode8C13.incipit	…
ltx/en_us_goadedes/me.m11.d04:meMA.Ode8C13.melody	@ltx/en_us_goadedes/he.h.m4:heHE.PaidasEvageis.name
ltx/en_us_goadedes/me.m11.d04:meMA.Ode8C13.mode	@ltx/en_us_goadedes/miscellanea:misc.Mode4
ltx/en_us_goadedes/me.m11.d04:meMA.Ode8C13.ode	@ltx/en_us_goadedes/miscellanea:misc.Ode8
ltx/en_us_goadedes/me.m11.d04:meMA.Ode8C13.text	
ltx/en_us_goadedes/me.m11.d04:meMA.Ode8C1T.incipit	…
ltx/en_us_goadedes/me.m11.d04:meMA.Ode8C1T.melody	@ltx/en_us_goadedes/he.h.m4:heHE.PaidasEvageis.name
ltx/en_us_goadedes/me.m11.d04:meMA.Ode8C1T.mode	@ltx/en_us_goadedes/miscellanea:misc.Mode4
ltx/en_us_goadedes/me.m11.d04:meMA.Ode8C1T.ode	@ltx/en_us_goadedes/miscellanea:misc.Ode8
ltx/en_us_goadedes/me.m11.d04:meMA.Ode8C1T.text	
ltx/en_us_goadedes/me.m11.d04:meMA.Ode8C1Tr.incipit	…
ltx/en_us_goadedes/me.m11.d04:meMA.Ode8C1Tr.melody	@ltx/en_us_goadedes/he.h.m4:heHE.PaidasEvageis.name
ltx/en_us_goadedes/me.m11.d04:meMA.Ode8C1Tr.mode	@ltx/en_us_goadedes/miscellanea:misc.Mode4
ltx/en_us_goadedes/me.m11.d04:meMA.Ode8C1Tr.ode	@ltx/en_us_goadedes/miscellanea:misc.Ode8
ltx/en_us_goadedes/me.m11.d04:meMA.Ode8C1Tr.text	
ltx/en_us_goadedes/me.m11.d04:meMA.Ode8C21.greekmelody	@ltx/en_us_goadedes/he.h.m4:heHE.LytrotaTouPantos.greekname
ltx/en_us_goadedes/me.m11.d04:meMA.Ode8C21.incipit	…
ltx/en_us_goadedes/me.m11.d04:meMA.Ode8C21.melody	@ltx/en_us_goadedes/he.h.m4:heHE.LytrotaTouPantos.name
ltx/en_us_goadedes/me.m11.d04:meMA.Ode8C21.mode	@ltx/en_us_goadedes/miscellanea:misc.Mode4
ltx/en_us_goadedes/me.m11.d04:meMA.Ode8C21.ode	@ltx/en_us_goadedes/miscellanea:misc.Ode8
ltx/en_us_goadedes/me.m11.d04:meMA.Ode8C21.text	
ltx/en_us_goadedes/me.m11.d04:meMA.Ode8C22.incipit	…
ltx/en_us_goadedes/me.m11.d04:meMA.Ode8C22.melody	@ltx/en_us_goadedes/he.h.m4:heHE.LytrotaTouPantos.name
ltx/en_us_goadedes/me.m11.d04:meMA.Ode8C22.mode	@ltx/en_us_goadedes/miscellanea:misc.Mode4
ltx/en_us_goadedes/me.m11.d04:meMA.Ode8C22.ode	@ltx/en_us_goadedes/miscellanea:misc.Ode8
ltx/en_us_goadedes/me.m11.d04:meMA.Ode8C22.text	
ltx/en_us_goadedes/me.m11.d04:meMA.Ode8C23.incipit	…
ltx/en_us_goadedes/me.m11.d04:meMA.Ode8C23.melody	@ltx/en_us_goadedes/he.h.m4:heHE.LytrotaTouPantos.name
ltx/en_us_goadedes/me.m11.d04:meMA.Ode8C23.mode	@ltx/en_us_goadedes/miscellanea:misc.Mode4
ltx/en_us_goadedes/me.m11.d04:meMA.Ode8C23.ode	@ltx/en_us_goadedes/miscellanea:misc.Ode8
ltx/en_us_goadedes/me.m11.d04:meMA.Ode8C23.text	
ltx/en_us_goadedes/me.m11.d04:meMA.Ode8C2T.incipit	…
ltx/en_us_goadedes/me.m11.d04:meMA.Ode8C2T.melody	@ltx/en_us_goadedes/he.h.m4:heHE.LytrotaTouPantos.name
ltx/en_us_goadedes/me.m11.d04:meMA.Ode8C2T.mode	@ltx/en_us_goadedes/miscellanea:misc.Mode4
ltx/en_us_goadedes/me.m11.d04:meMA.Ode8C2T.ode	@ltx/en_us_goadedes/miscellanea:misc.Ode8
ltx/en_us_goadedes/me.m11.d04:meMA.Ode8C2T.text	
ltx/en_us_goadedes/me.m11.d04:meMA.Ode8H.greekmelody	@ltx/en_us_goadedes/he.h.m4:heHE.LytrotaTouPantos.greekname
ltx/en_us_goadedes/me.m11.d04:meMA.Ode8H.incipit	@ltx/en_us_goadedes/he.h.m4:heHE.LytrotaTouPantos.incipit
ltx/en_us_goadedes/me.m11.d04:meMA.Ode8H.melody	@ltx/en_us_goadedes/he.h.m4:heHE.LytrotaTouPantos.melody
ltx/en_us_goadedes/me.m11.d04:meMA.Ode8H.mode	@ltx/en_us_goadedes/miscellanea:misc.Mode4
ltx/en_us_goadedes/me.m11.d04:meMA.Ode8H.ode	@ltx/en_us_goadedes/miscellanea:misc.Ode8
ltx/en_us_goadedes/me.m11.d04:meMA.Ode8H.text	@ltx/en_us_goadedes/he.h.m4:heHE.LytrotaTouPantos.text
ltx/en_us_goadedes/me.m11.d04:meMA.Ode9C11.greekmelody	@ltx/en_us_goadedes/he.h.m4:heHE.ApasGigenis.greekname
ltx/en_us_goadedes/me.m11.d04:meMA.Ode9C11.incipit	…
ltx/en_us_goadedes/me.m11.d04:meMA.Ode9C11.melody	@ltx/en_us_goadedes/he.h.m4:heHE.ApasGigenis.name
ltx/en_us_goadedes/me.m11.d04:meMA.Ode9C11.mode	@ltx/en_us_goadedes/miscellanea:misc.Mode4
ltx/en_us_goadedes/me.m11.d04:meMA.Ode9C11.ode	@ltx/en_us_goadedes/miscellanea:misc.Ode9
ltx/en_us_goadedes/me.m11.d04:meMA.Ode9C11.text	
ltx/en_us_goadedes/me.m11.d04:meMA.Ode9C12.incipit	…
ltx/en_us_goadedes/me.m11.d04:meMA.Ode9C12.melody	@ltx/en_us_goadedes/he.h.m4:heHE.ApasGigenis.name
ltx/en_us_goadedes/me.m11.d04:meMA.Ode9C12.mode	@ltx/en_us_goadedes/miscellanea:misc.Mode4
ltx/en_us_goadedes/me.m11.d04:meMA.Ode9C12.ode	@ltx/en_us_goadedes/miscellanea:misc.Ode9
ltx/en_us_goadedes/me.m11.d04:meMA.Ode9C12.text	
ltx/en_us_goadedes/me.m11.d04:meMA.Ode9C13.incipit	…
ltx/en_us_goadedes/me.m11.d04:meMA.Ode9C13.melody	@ltx/en_us_goadedes/he.h.m4:heHE.ApasGigenis.name
ltx/en_us_goadedes/me.m11.d04:meMA.Ode9C13.mode	@ltx/en_us_goadedes/miscellanea:misc.Mode4
ltx/en_us_goadedes/me.m11.d04:meMA.Ode9C13.ode	@ltx/en_us_goadedes/miscellanea:misc.Ode9
ltx/en_us_goadedes/me.m11.d04:meMA.Ode9C13.text	
ltx/en_us_goadedes/me.m11.d04:meMA.Ode9C14.incipit	…
ltx/en_us_goadedes/me.m11.d04:meMA.Ode9C14.melody	@ltx/en_us_goadedes/he.h.m4:heHE.ApasGigenis.name
ltx/en_us_goadedes/me.m11.d04:meMA.Ode9C14.mode	@ltx/en_us_goadedes/miscellanea:misc.Mode4
ltx/en_us_goadedes/me.m11.d04:meMA.Ode9C14.ode	@ltx/en_us_goadedes/miscellanea:misc.Ode9
ltx/en_us_goadedes/me.m11.d04:meMA.Ode9C14.text	
ltx/en_us_goadedes/me.m11.d04:meMA.Ode9C1T.incipit	…
ltx/en_us_goadedes/me.m11.d04:meMA.Ode9C1T.melody	@ltx/en_us_goadedes/he.h.m4:heHE.ApasGigenis.name
ltx/en_us_goadedes/me.m11.d04:meMA.Ode9C1T.mode	@ltx/en_us_goadedes/miscellanea:misc.Mode4
ltx/en_us_goadedes/me.m11.d04:meMA.Ode9C1T.ode	@ltx/en_us_goadedes/miscellanea:misc.Ode9
ltx/en_us_goadedes/me.m11.d04:meMA.Ode9C1T.text	
ltx/en_us_goadedes/me.m11.d04:meMA.Ode9C21.greekmelody	@ltx/en_us_goadedes/he.h.m4:heHE.EvaMenToTisParakois.greekname
ltx/en_us_goadedes/me.m11.d04:meMA.Ode9C21.incipit	…
ltx/en_us_goadedes/me.m11.d04:meMA.Ode9C21.melody	@ltx/en_us_goadedes/he.h.m4:heHE.EvaMenToTisParakois.name
ltx/en_us_goadedes/me.m11.d04:meMA.Ode9C21.mode	@ltx/en_us_goadedes/miscellanea:misc.Mode4
ltx/en_us_goadedes/me.m11.d04:meMA.Ode9C21.ode	@ltx/en_us_goadedes/miscellanea:misc.Ode9
ltx/en_us_goadedes/me.m11.d04:meMA.Ode9C21.text	
ltx/en_us_goadedes/me.m11.d04:meMA.Ode9C22.incipit	…
ltx/en_us_goadedes/me.m11.d04:meMA.Ode9C22.melody	@ltx/en_us_goadedes/he.h.m4:heHE.EvaMenToTisParakois.name
ltx/en_us_goadedes/me.m11.d04:meMA.Ode9C22.mode	@ltx/en_us_goadedes/miscellanea:misc.Mode4
ltx/en_us_goadedes/me.m11.d04:meMA.Ode9C22.ode	@ltx/en_us_goadedes/miscellanea:misc.Ode9
ltx/en_us_goadedes/me.m11.d04:meMA.Ode9C22.text	
ltx/en_us_goadedes/me.m11.d04:meMA.Ode9C23.incipit	…
ltx/en_us_goadedes/me.m11.d04:meMA.Ode9C23.melody	@ltx/en_us_goadedes/he.h.m4:heHE.EvaMenToTisParakois.name
ltx/en_us_goadedes/me.m11.d04:meMA.Ode9C23.mode	@ltx/en_us_goadedes/miscellanea:misc.Mode4
ltx/en_us_goadedes/me.m11.d04:meMA.Ode9C23.ode	@ltx/en_us_goadedes/miscellanea:misc.Ode9
ltx/en_us_goadedes/me.m11.d04:meMA.Ode9C23.text	
ltx/en_us_goadedes/me.m11.d04:meMA.Ode9C24.incipit	…
ltx/en_us_goadedes/me.m11.d04:meMA.Ode9C24.melody	@ltx/en_us_goadedes/he.h.m4:heHE.EvaMenToTisParakois.name
ltx/en_us_goadedes/me.m11.d04:meMA.Ode9C24.mode	@ltx/en_us_goadedes/miscellanea:misc.Mode4
ltx/en_us_goadedes/me.m11.d04:meMA.Ode9C24.ode	@ltx/en_us_goadedes/miscellanea:misc.Ode9
ltx/en_us_goadedes/me.m11.d04:meMA.Ode9C24.text	
ltx/en_us_goadedes/me.m11.d04:meMA.Ode9C2T.incipit	…
ltx/en_us_goadedes/me.m11.d04:meMA.Ode9C2T.melody	@ltx/en_us_goadedes/he.h.m4:heHE.EvaMenToTisParakois.name
ltx/en_us_goadedes/me.m11.d04:meMA.Ode9C2T.mode	@ltx/en_us_goadedes/miscellanea:misc.Mode4
ltx/en_us_goadedes/me.m11.d04:meMA.Ode9C2T.ode	@ltx/en_us_goadedes/miscellanea:misc.Ode9
ltx/en_us_goadedes/me.m11.d04:meMA.Ode9C2T.text	
ltx/en_us_goadedes/me.m11.d04:meMA.Ode9H.greekmelody	@ltx/en_us_goadedes/he.h.m4:heHE.EvaMenToTisParakois.greekname
ltx/en_us_goadedes/me.m11.d04:meMA.Ode9H.incipit	@ltx/en_us_goadedes/he.h.m4:heHE.EvaMenToTisParakois.incipit
ltx/en_us_goadedes/me.m11.d04:meMA.Ode9H.melody	@ltx/en_us_goadedes/he.h.m4:heHE.EvaMenToTisParakois.melody
ltx/en_us_goadedes/me.m11.d04:meMA.Ode9H.mode	@ltx/en_us_goadedes/miscellanea:misc.Mode4
ltx/en_us_goadedes/me.m11.d04:meMA.Ode9H.ode	@ltx/en_us_goadedes/miscellanea:misc.Ode9
ltx/en_us_goadedes/me.m11.d04:meMA.Ode9H.text	@ltx/en_us_goadedes/he.h.m4:heHE.EvaMenToTisParakois.text
ltx/en_us_goadedes/me.m11.d04:meMA.Oikos1.text	
ltx/en_us_goadedes/me.m11.d04:meMA.Oikos12.text	
ltx/en_us_goadedes/me.m11.d04:meMA.Oikos13.text	
ltx/en_us_goadedes/me.m11.d04:meMA.Oikos14.text	
ltx/en_us_goadedes/me.m11.d04:meMA.Oikos15.text	
ltx/en_us_goadedes/me.m11.d04:meMA.Oikos16.text	
ltx/en_us_goadedes/me.m11.d04:meMA.Oikos17.text	
ltx/en_us_goadedes/me.m11.d04:meMA.Oikos18.text	
ltx/en_us_goadedes/me.m11.d04:meVE.Apolytikion1ger.greekmelody	@ltx/en_us_goadedes/he.a.m5:heAU.TonSynanarchonLogon.greekname
ltx/en_us_goadedes/me.m11.d04:meVE.Apolytikion1ger.incipit	…
ltx/en_us_goadedes/me.m11.d04:meVE.Apolytikion1ger.melody	@ltx/en_us_goadedes/he.a.m5:heAU.TonSynanarchonLogon.name
ltx/en_us_goadedes/me.m11.d04:meVE.Apolytikion1ger.mode	@ltx/en_us_goadedes/miscellanea:misc.Mode5
ltx/en_us_goadedes/me.m11.d04:meVE.Apolytikion1ger.poet	@ltx/en_us_goadedes/poets:po.Gerasimou
ltx/en_us_goadedes/me.m11.d04:meVE.Apolytikion1ger.text	
ltx/en_us_goadedes/me.m11.d04:meVE.Apolytikion2ger.greekmelody	@ltx/en_us_goadedes/he.a.m3:heAU.TheiasPisteos.greekname
ltx/en_us_goadedes/me.m11.d04:meVE.Apolytikion2ger.incipit	…
ltx/en_us_goadedes/me.m11.d04:meVE.Apolytikion2ger.melody	@ltx/en_us_goadedes/he.a.m3:heAU.TheiasPisteos.name
ltx/en_us_goadedes/me.m11.d04:meVE.Apolytikion2ger.mode	@ltx/en_us_goadedes/miscellanea:misc.Mode3
ltx/en_us_goadedes/me.m11.d04:meVE.Apolytikion2ger.poet	@ltx/en_us_goadedes/poets:po.Gerasimou
ltx/en_us_goadedes/me.m11.d04:meVE.Apolytikion2ger.text	
ltx/en_us_goadedes/me.m11.d04:meVE.AposGlory.incipit	…
ltx/en_us_goadedes/me.m11.d04:meVE.AposGlory.melody	
ltx/en_us_goadedes/me.m11.d04:meVE.AposGlory.mode	@ltx/en_us_goadedes/miscellanea:misc.Mode6
ltx/en_us_goadedes/me.m11.d04:meVE.AposGlory.text	
ltx/en_us_goadedes/me.m11.d04:meVE.AposStavrotheotokion.greekmelody	@ltx/en_us_goadedes/he.a.m6:heAU.OlinApothemenoi.greekname
ltx/en_us_goadedes/me.m11.d04:meVE.AposStavrotheotokion.incipit	@ltx/en_us_goadedes/oc.m6.d4:ocVE.SticTheotokion.incipit
ltx/en_us_goadedes/me.m11.d04:meVE.AposStavrotheotokion.melody	@ltx/en_us_goadedes/he.a.m6:heAU.OlinApothemenoi.name
ltx/en_us_goadedes/me.m11.d04:meVE.AposStavrotheotokion.mode	@ltx/en_us_goadedes/miscellanea:misc.Mode6
ltx/en_us_goadedes/me.m11.d04:meVE.AposStavrotheotokion.text	@ltx/en_us_goadedes/oc.m6.d4:ocVE.SticTheotokion.text
ltx/en_us_goadedes/me.m11.d04:meVE.AposTheotokion.greekmelody	@ltx/en_us_goadedes/he.a.m6:heAU.OlinApothemenoi.greekname
ltx/en_us_goadedes/me.m11.d04:meVE.AposTheotokion.incipit	@ltx/en_us_goadedes/oc.m6.d1:ocSV.Aposticha2.incipit
ltx/en_us_goadedes/me.m11.d04:meVE.AposTheotokion.melody	@ltx/en_us_goadedes/he.a.m6:heAU.OlinApothemenoi.name
ltx/en_us_goadedes/me.m11.d04:meVE.AposTheotokion.mode	@ltx/en_us_goadedes/miscellanea:misc.Mode6
ltx/en_us_goadedes/me.m11.d04:meVE.AposTheotokion.text	@ltx/en_us_goadedes/oc.m6.d1:ocSV.Aposticha2.text
ltx/en_us_goadedes/me.m11.d04:meVE.GeneralApolytikion1.name	
ltx/en_us_goadedes/me.m11.d04:meVE.MM.GeneralApolytikion1.text	@ltx/en_us_goadedes/properties:media.key
ltx/en_us_goadedes/me.m11.d04:meVE.SticGlory.incipit	…
ltx/en_us_goadedes/me.m11.d04:meVE.SticGlory.melody	
ltx/en_us_goadedes/me.m11.d04:meVE.SticGlory.mode	@ltx/en_us_goadedes/miscellanea:misc.Mode2
ltx/en_us_goadedes/me.m11.d04:meVE.SticGlory.text	
ltx/en_us_goadedes/me.m11.d04:meVE.SticStavrotheotokion.greekmelody	@ltx/en_us_goadedes/he.a.m2:heAU.OteEkTouXylou.greekname
ltx/en_us_goadedes/me.m11.d04:meVE.SticStavrotheotokion.incipit	@ltx/en_us_goadedes/oc.m2.d4:ocVE.AposTheotokion.incipit
ltx/en_us_goadedes/me.m11.d04:meVE.SticStavrotheotokion.melody	@ltx/en_us_goadedes/he.a.m2:heAU.OteEkTouXylou.name
ltx/en_us_goadedes/me.m11.d04:meVE.SticStavrotheotokion.mode	@ltx/en_us_goadedes/miscellanea:misc.Mode2
ltx/en_us_goadedes/me.m11.d04:meVE.SticStavrotheotokion.text	@ltx/en_us_goadedes/oc.m2.d4:ocVE.AposTheotokion.text
ltx/en_us_goadedes/me.m11.d04:meVE.SticTheotokion.greekmelody	@ltx/en_us_goadedes/he.a.m2:heAU.OteEkTouXylou.greekname
ltx/en_us_goadedes/me.m11.d04:meVE.SticTheotokion.incipit	…
ltx/en_us_goadedes/me.m11.d04:meVE.SticTheotokion.melody	@ltx/en_us_goadedes/he.a.m2:heAU.OteEkTouXylou.name
ltx/en_us_goadedes/me.m11.d04:meVE.SticTheotokion.mode	@ltx/en_us_goadedes/miscellanea:misc.Mode2
ltx/en_us_goadedes/me.m11.d04:meVE.SticTheotokion.text	
ltx/en_us_goadedes/me.m11.d04:meVE.Stichera01.greekmelody	@ltx/en_us_goadedes/he.a.m4:heAU.OsGennaionEnMartysi.greekname
ltx/en_us_goadedes/me.m11.d04:meVE.Stichera01.incipit	…
ltx/en_us_goadedes/me.m11.d04:meVE.Stichera01.melody	@ltx/en_us_goadedes/he.a.m4:heAU.OsGennaionEnMartysi.name
ltx/en_us_goadedes/me.m11.d04:meVE.Stichera01.mode	@ltx/en_us_goadedes/miscellanea:misc.Mode4
ltx/en_us_goadedes/me.m11.d04:meVE.Stichera01.text	
ltx/en_us_goadedes/me.m11.d04:meVE.Stichera02.incipit	…
ltx/en_us_goadedes/me.m11.d04:meVE.Stichera02.melody	@ltx/en_us_goadedes/he.a.m4:heAU.OsGennaionEnMartysi.name
ltx/en_us_goadedes/me.m11.d04:meVE.Stichera02.mode	@ltx/en_us_goadedes/miscellanea:misc.Mode4
ltx/en_us_goadedes/me.m11.d04:meVE.Stichera02.text	
ltx/en_us_goadedes/me.m11.d04:meVE.Stichera03.incipit	…
ltx/en_us_goadedes/me.m11.d04:meVE.Stichera03.melody	@ltx/en_us_goadedes/he.a.m4:heAU.OsGennaionEnMartysi.name
ltx/en_us_goadedes/me.m11.d04:meVE.Stichera03.mode	@ltx/en_us_goadedes/miscellanea:misc.Mode4
ltx/en_us_goadedes/me.m11.d04:meVE.Stichera03.text	
ltx/en_us_goadedes/me.m11.d04:meVE.Stichera04.greekmelody	@ltx/en_us_goadedes/he.a.m2:heAU.OteEkTouXylou.greekname
ltx/en_us_goadedes/me.m11.d04:meVE.Stichera04.incipit	…
ltx/en_us_goadedes/me.m11.d04:meVE.Stichera04.melody	@ltx/en_us_goadedes/he.a.m2:heAU.OteEkTouXylou.name
ltx/en_us_goadedes/me.m11.d04:meVE.Stichera04.mode	@ltx/en_us_goadedes/miscellanea:misc.Mode2
ltx/en_us_goadedes/me.m11.d04:meVE.Stichera04.text	
ltx/en_us_goadedes/me.m11.d04:meVE.Stichera05.incipit	…
ltx/en_us_goadedes/me.m11.d04:meVE.Stichera05.melody	@ltx/en_us_goadedes/he.a.m2:heAU.OteEkTouXylou.name
ltx/en_us_goadedes/me.m11.d04:meVE.Stichera05.mode	@ltx/en_us_goadedes/miscellanea:misc.Mode2
ltx/en_us_goadedes/me.m11.d04:meVE.Stichera05.text	
ltx/en_us_goadedes/me.m11.d04:meVE.Stichera06.incipit	…
ltx/en_us_goadedes/me.m11.d04:meVE.Stichera06.melody	@ltx/en_us_goadedes/he.a.m2:heAU.OteEkTouXylou.name
ltx/en_us_goadedes/me.m11.d04:meVE.Stichera06.mode	@ltx/en_us_goadedes/miscellanea:misc.Mode2
ltx/en_us_goadedes/me.m11.d04:meVE.Stichera06.text	
