ltx/en_us_goadedes/me.m04.d12:meDA.commemoration.first	
ltx/en_us_goadedes/me.m04.d12:meDA.commemoration.first_name	
ltx/en_us_goadedes/me.m04.d12:meDA.commemoration.first_short	
ltx/en_us_goadedes/me.m04.d12:meDA.commemoration.first_title	@ltx/en_us_goadedes/titles:ti.SaintM
ltx/en_us_goadedes/me.m04.d12:meDA.commemoration.full	
ltx/en_us_goadedes/me.m04.d12:meDA.commemoration.second_name	
ltx/en_us_goadedes/me.m04.d12:meDA.commemoration.second_title	
ltx/en_us_goadedes/me.m04.d12:meDA.date	
ltx/en_us_goadedes/me.m04.d12:meDA.fordate	
ltx/en_us_goadedes/me.m04.d12:meDA.insert1	
ltx/en_us_goadedes/me.m04.d12:meDA.insert2	
ltx/en_us_goadedes/me.m04.d12:meDA.note	
ltx/en_us_goadedes/me.m04.d12:meDA.pdfcoverdate	
ltx/en_us_goadedes/me.m04.d12:meDA.pdfheaderdate	
ltx/en_us_goadedes/me.m04.d12:meHO.commemorations	
ltx/en_us_goadedes/me.m04.d12:meHO.note1	
ltx/en_us_goadedes/me.m04.d12:meHO.note2	
ltx/en_us_goadedes/me.m04.d12:meHO.number	
ltx/en_us_goadedes/me.m04.d12:meHO.rank	
ltx/en_us_goadedes/me.m04.d12:meLE.commemoration1	
ltx/en_us_goadedes/me.m04.d12:meLE.commemoration2	
ltx/en_us_goadedes/me.m04.d12:meLI.Kontakion1.incipit	@ltx/en_us_goadedes/me.m04.d12:meMA.Kontakion1ger.incipit
ltx/en_us_goadedes/me.m04.d12:meLI.Kontakion1.melody	@ltx/en_us_goadedes/me.m04.d12:meMA.Kontakion1ger.melody
ltx/en_us_goadedes/me.m04.d12:meLI.Kontakion1.mode	@ltx/en_us_goadedes/me.m04.d12:meMA.Kontakion1ger.mode
ltx/en_us_goadedes/me.m04.d12:meLI.Kontakion1.text	@ltx/en_us_goadedes/me.m04.d12:meMA.Kontakion1ger.text
ltx/en_us_goadedes/me.m04.d12:meLI.MM.CommunionHymn.text	@ltx/en_us_goadedes/properties:media.key
ltx/en_us_goadedes/me.m04.d12:meLI.Megalynarion.text	
ltx/en_us_goadedes/me.m04.d12:meMA.C1.acrostic.notice1	
ltx/en_us_goadedes/me.m04.d12:meMA.C1.acrostic.text	
ltx/en_us_goadedes/me.m04.d12:meMA.C1.acrostic.title	
ltx/en_us_goadedes/me.m04.d12:meMA.C1.poet	@ltx/en_us_goadedes/poets:po.Theofanous
ltx/en_us_goadedes/me.m04.d12:meMA.C1.title	@ltx/en_us_goadedes/titles:ti.CanonSaintM
ltx/en_us_goadedes/me.m04.d12:meMA.C1.verse	@ltx/en_us_goadedes/prayers:pr.verse_SaintM.text
ltx/en_us_goadedes/me.m04.d12:meMA.Kontakion1ger.incipit	…
ltx/en_us_goadedes/me.m04.d12:meMA.Kontakion1ger.melody	@ltx/en_us_goadedes/he.a.m6:heAU.TinYperImon.name
ltx/en_us_goadedes/me.m04.d12:meMA.Kontakion1ger.mode	@ltx/en_us_goadedes/miscellanea:misc.Mode6
ltx/en_us_goadedes/me.m04.d12:meMA.Kontakion1ger.poet	@ltx/en_us_goadedes/poets:po.Gerasimou
ltx/en_us_goadedes/me.m04.d12:meMA.Kontakion1ger.text	
ltx/en_us_goadedes/me.m04.d12:meMA.Ode1C11.greekmelody	@ltx/en_us_goadedes/he.h.m8:heHE.YgranDiodefsas.greekname
ltx/en_us_goadedes/me.m04.d12:meMA.Ode1C11.incipit	…
ltx/en_us_goadedes/me.m04.d12:meMA.Ode1C11.melody	@ltx/en_us_goadedes/he.h.m8:heHE.YgranDiodefsas.name
ltx/en_us_goadedes/me.m04.d12:meMA.Ode1C11.mode	@ltx/en_us_goadedes/miscellanea:misc.Mode8
ltx/en_us_goadedes/me.m04.d12:meMA.Ode1C11.ode	@ltx/en_us_goadedes/miscellanea:misc.Ode1
ltx/en_us_goadedes/me.m04.d12:meMA.Ode1C11.text	
ltx/en_us_goadedes/me.m04.d12:meMA.Ode1C12.incipit	…
ltx/en_us_goadedes/me.m04.d12:meMA.Ode1C12.melody	@ltx/en_us_goadedes/he.h.m8:heHE.YgranDiodefsas.name
ltx/en_us_goadedes/me.m04.d12:meMA.Ode1C12.mode	@ltx/en_us_goadedes/miscellanea:misc.Mode8
ltx/en_us_goadedes/me.m04.d12:meMA.Ode1C12.ode	@ltx/en_us_goadedes/miscellanea:misc.Ode1
ltx/en_us_goadedes/me.m04.d12:meMA.Ode1C12.text	
ltx/en_us_goadedes/me.m04.d12:meMA.Ode1C13.incipit	…
ltx/en_us_goadedes/me.m04.d12:meMA.Ode1C13.melody	@ltx/en_us_goadedes/he.h.m8:heHE.YgranDiodefsas.name
ltx/en_us_goadedes/me.m04.d12:meMA.Ode1C13.mode	@ltx/en_us_goadedes/miscellanea:misc.Mode8
ltx/en_us_goadedes/me.m04.d12:meMA.Ode1C13.ode	@ltx/en_us_goadedes/miscellanea:misc.Ode1
ltx/en_us_goadedes/me.m04.d12:meMA.Ode1C13.text	
ltx/en_us_goadedes/me.m04.d12:meMA.Ode1C1H.greekmelody	@ltx/en_us_goadedes/he.h.m8:heHE.YgranDiodefsas.greekname
ltx/en_us_goadedes/me.m04.d12:meMA.Ode1C1H.incipit	@ltx/en_us_goadedes/he.h.m8:heHE.YgranDiodefsas.incipit
ltx/en_us_goadedes/me.m04.d12:meMA.Ode1C1H.melody	@ltx/en_us_goadedes/he.h.m8:heHE.YgranDiodefsas.melody
ltx/en_us_goadedes/me.m04.d12:meMA.Ode1C1H.mode	@ltx/en_us_goadedes/miscellanea:misc.Mode8
ltx/en_us_goadedes/me.m04.d12:meMA.Ode1C1H.ode	@ltx/en_us_goadedes/miscellanea:misc.Ode1
ltx/en_us_goadedes/me.m04.d12:meMA.Ode1C1H.text	@ltx/en_us_goadedes/he.h.m8:heHE.YgranDiodefsas.text
ltx/en_us_goadedes/me.m04.d12:meMA.Ode1C1T.incipit	…
ltx/en_us_goadedes/me.m04.d12:meMA.Ode1C1T.melody	@ltx/en_us_goadedes/he.h.m8:heHE.YgranDiodefsas.name
ltx/en_us_goadedes/me.m04.d12:meMA.Ode1C1T.mode	@ltx/en_us_goadedes/miscellanea:misc.Mode8
ltx/en_us_goadedes/me.m04.d12:meMA.Ode1C1T.ode	@ltx/en_us_goadedes/miscellanea:misc.Ode1
ltx/en_us_goadedes/me.m04.d12:meMA.Ode1C1T.text	
ltx/en_us_goadedes/me.m04.d12:meMA.Ode3C11.greekmelody	@ltx/en_us_goadedes/he.h.m8:heHE.SyEiToStereoma.greekname
ltx/en_us_goadedes/me.m04.d12:meMA.Ode3C11.incipit	…
ltx/en_us_goadedes/me.m04.d12:meMA.Ode3C11.melody	@ltx/en_us_goadedes/he.h.m8:heHE.SyEiToStereoma.name
ltx/en_us_goadedes/me.m04.d12:meMA.Ode3C11.mode	@ltx/en_us_goadedes/miscellanea:misc.Mode8
ltx/en_us_goadedes/me.m04.d12:meMA.Ode3C11.ode	@ltx/en_us_goadedes/miscellanea:misc.Ode3
ltx/en_us_goadedes/me.m04.d12:meMA.Ode3C11.text	
ltx/en_us_goadedes/me.m04.d12:meMA.Ode3C12.incipit	…
ltx/en_us_goadedes/me.m04.d12:meMA.Ode3C12.melody	@ltx/en_us_goadedes/he.h.m8:heHE.SyEiToStereoma.name
ltx/en_us_goadedes/me.m04.d12:meMA.Ode3C12.mode	@ltx/en_us_goadedes/miscellanea:misc.Mode8
ltx/en_us_goadedes/me.m04.d12:meMA.Ode3C12.ode	@ltx/en_us_goadedes/miscellanea:misc.Ode3
ltx/en_us_goadedes/me.m04.d12:meMA.Ode3C12.text	
ltx/en_us_goadedes/me.m04.d12:meMA.Ode3C13.incipit	…
ltx/en_us_goadedes/me.m04.d12:meMA.Ode3C13.melody	@ltx/en_us_goadedes/he.h.m8:heHE.SyEiToStereoma.name
ltx/en_us_goadedes/me.m04.d12:meMA.Ode3C13.mode	@ltx/en_us_goadedes/miscellanea:misc.Mode8
ltx/en_us_goadedes/me.m04.d12:meMA.Ode3C13.ode	@ltx/en_us_goadedes/miscellanea:misc.Ode3
ltx/en_us_goadedes/me.m04.d12:meMA.Ode3C13.text	
ltx/en_us_goadedes/me.m04.d12:meMA.Ode3C1H.greekmelody	@ltx/en_us_goadedes/he.h.m8:heHE.SyEiToStereoma.greekname
ltx/en_us_goadedes/me.m04.d12:meMA.Ode3C1H.incipit	@ltx/en_us_goadedes/he.h.m8:heHE.SyEiToStereoma.incipit
ltx/en_us_goadedes/me.m04.d12:meMA.Ode3C1H.melody	@ltx/en_us_goadedes/he.h.m8:heHE.SyEiToStereoma.melody
ltx/en_us_goadedes/me.m04.d12:meMA.Ode3C1H.mode	@ltx/en_us_goadedes/miscellanea:misc.Mode8
ltx/en_us_goadedes/me.m04.d12:meMA.Ode3C1H.ode	@ltx/en_us_goadedes/miscellanea:misc.Ode3
ltx/en_us_goadedes/me.m04.d12:meMA.Ode3C1H.text	@ltx/en_us_goadedes/he.h.m8:heHE.SyEiToStereoma.text
ltx/en_us_goadedes/me.m04.d12:meMA.Ode3C1T.incipit	…
ltx/en_us_goadedes/me.m04.d12:meMA.Ode3C1T.melody	@ltx/en_us_goadedes/he.h.m8:heHE.SyEiToStereoma.name
ltx/en_us_goadedes/me.m04.d12:meMA.Ode3C1T.mode	@ltx/en_us_goadedes/miscellanea:misc.Mode8
ltx/en_us_goadedes/me.m04.d12:meMA.Ode3C1T.ode	@ltx/en_us_goadedes/miscellanea:misc.Ode3
ltx/en_us_goadedes/me.m04.d12:meMA.Ode3C1T.text	
ltx/en_us_goadedes/me.m04.d12:meMA.Ode3Kathisma1.greekmelody	@ltx/en_us_goadedes/he.a.m1:heAU.TonTafonSouSotir.greekname
ltx/en_us_goadedes/me.m04.d12:meMA.Ode3Kathisma1.incipit	…
ltx/en_us_goadedes/me.m04.d12:meMA.Ode3Kathisma1.melody	@ltx/en_us_goadedes/he.a.m1:heAU.TonTafonSouSotir.name
ltx/en_us_goadedes/me.m04.d12:meMA.Ode3Kathisma1.mode	@ltx/en_us_goadedes/miscellanea:misc.Mode1
ltx/en_us_goadedes/me.m04.d12:meMA.Ode3Kathisma1.text	
ltx/en_us_goadedes/me.m04.d12:meMA.Ode3KathismaSt.incipit	…
ltx/en_us_goadedes/me.m04.d12:meMA.Ode3KathismaSt.melody	@ltx/en_us_goadedes/he.a.m1:heAU.TonTafonSouSotir.name
ltx/en_us_goadedes/me.m04.d12:meMA.Ode3KathismaSt.mode	@ltx/en_us_goadedes/miscellanea:misc.Mode1
ltx/en_us_goadedes/me.m04.d12:meMA.Ode3KathismaSt.text	
ltx/en_us_goadedes/me.m04.d12:meMA.Ode3KathismaT.incipit	The multitude of all…
ltx/en_us_goadedes/me.m04.d12:meMA.Ode3KathismaT.melody	@ltx/en_us_goadedes/he.a.m1:heAU.TonTafonSouSotir.name
ltx/en_us_goadedes/me.m04.d12:meMA.Ode3KathismaT.mode	@ltx/en_us_goadedes/miscellanea:misc.Mode1
ltx/en_us_goadedes/me.m04.d12:meMA.Ode3KathismaT.text	The multitude of all the believers rejoices * in calling out your name every day, Theotokos. * With longing we glorify your exalted magnificence. * We who faithfully extol you boast that we have you * as our patroness and unassailable helper, * O Virgin immaculate.
ltx/en_us_goadedes/me.m04.d12:meMA.Ode4C11.greekmelody	@ltx/en_us_goadedes/he.h.m8:heHE.EisakikoaKyrie.greekname
ltx/en_us_goadedes/me.m04.d12:meMA.Ode4C11.incipit	…
ltx/en_us_goadedes/me.m04.d12:meMA.Ode4C11.melody	@ltx/en_us_goadedes/he.h.m8:heHE.EisakikoaKyrie.name
ltx/en_us_goadedes/me.m04.d12:meMA.Ode4C11.mode	@ltx/en_us_goadedes/miscellanea:misc.Mode8
ltx/en_us_goadedes/me.m04.d12:meMA.Ode4C11.ode	@ltx/en_us_goadedes/miscellanea:misc.Ode4
ltx/en_us_goadedes/me.m04.d12:meMA.Ode4C11.text	
ltx/en_us_goadedes/me.m04.d12:meMA.Ode4C12.incipit	…
ltx/en_us_goadedes/me.m04.d12:meMA.Ode4C12.melody	@ltx/en_us_goadedes/he.h.m8:heHE.EisakikoaKyrie.name
ltx/en_us_goadedes/me.m04.d12:meMA.Ode4C12.mode	@ltx/en_us_goadedes/miscellanea:misc.Mode8
ltx/en_us_goadedes/me.m04.d12:meMA.Ode4C12.ode	@ltx/en_us_goadedes/miscellanea:misc.Ode4
ltx/en_us_goadedes/me.m04.d12:meMA.Ode4C12.text	
ltx/en_us_goadedes/me.m04.d12:meMA.Ode4C13.incipit	…
ltx/en_us_goadedes/me.m04.d12:meMA.Ode4C13.melody	@ltx/en_us_goadedes/he.h.m8:heHE.EisakikoaKyrie.name
ltx/en_us_goadedes/me.m04.d12:meMA.Ode4C13.mode	@ltx/en_us_goadedes/miscellanea:misc.Mode8
ltx/en_us_goadedes/me.m04.d12:meMA.Ode4C13.ode	@ltx/en_us_goadedes/miscellanea:misc.Ode4
ltx/en_us_goadedes/me.m04.d12:meMA.Ode4C13.text	
ltx/en_us_goadedes/me.m04.d12:meMA.Ode4C1H.greekmelody	@ltx/en_us_goadedes/he.h.m8:heHE.EisakikoaKyrie.greekname
ltx/en_us_goadedes/me.m04.d12:meMA.Ode4C1H.incipit	@ltx/en_us_goadedes/he.h.m8:heHE.EisakikoaKyrie.incipit
ltx/en_us_goadedes/me.m04.d12:meMA.Ode4C1H.melody	@ltx/en_us_goadedes/he.h.m8:heHE.EisakikoaKyrie.melody
ltx/en_us_goadedes/me.m04.d12:meMA.Ode4C1H.mode	@ltx/en_us_goadedes/miscellanea:misc.Mode8
ltx/en_us_goadedes/me.m04.d12:meMA.Ode4C1H.ode	@ltx/en_us_goadedes/miscellanea:misc.Ode4
ltx/en_us_goadedes/me.m04.d12:meMA.Ode4C1H.text	@ltx/en_us_goadedes/he.h.m8:heHE.EisakikoaKyrie.text
ltx/en_us_goadedes/me.m04.d12:meMA.Ode4C1T.incipit	…
ltx/en_us_goadedes/me.m04.d12:meMA.Ode4C1T.melody	@ltx/en_us_goadedes/he.h.m8:heHE.EisakikoaKyrie.name
ltx/en_us_goadedes/me.m04.d12:meMA.Ode4C1T.mode	@ltx/en_us_goadedes/miscellanea:misc.Mode8
ltx/en_us_goadedes/me.m04.d12:meMA.Ode4C1T.ode	@ltx/en_us_goadedes/miscellanea:misc.Ode4
ltx/en_us_goadedes/me.m04.d12:meMA.Ode4C1T.text	
ltx/en_us_goadedes/me.m04.d12:meMA.Ode5C11.greekmelody	@ltx/en_us_goadedes/he.h.m8:heHE.OrthrizontesVoomenSoi.greekname
ltx/en_us_goadedes/me.m04.d12:meMA.Ode5C11.incipit	…
ltx/en_us_goadedes/me.m04.d12:meMA.Ode5C11.melody	@ltx/en_us_goadedes/he.h.m8:heHE.OrthrizontesVoomenSoi.name
ltx/en_us_goadedes/me.m04.d12:meMA.Ode5C11.mode	@ltx/en_us_goadedes/miscellanea:misc.Mode8
ltx/en_us_goadedes/me.m04.d12:meMA.Ode5C11.ode	@ltx/en_us_goadedes/miscellanea:misc.Ode5
ltx/en_us_goadedes/me.m04.d12:meMA.Ode5C11.text	
ltx/en_us_goadedes/me.m04.d12:meMA.Ode5C12.incipit	…
ltx/en_us_goadedes/me.m04.d12:meMA.Ode5C12.melody	@ltx/en_us_goadedes/he.h.m8:heHE.OrthrizontesVoomenSoi.name
ltx/en_us_goadedes/me.m04.d12:meMA.Ode5C12.mode	@ltx/en_us_goadedes/miscellanea:misc.Mode8
ltx/en_us_goadedes/me.m04.d12:meMA.Ode5C12.ode	@ltx/en_us_goadedes/miscellanea:misc.Ode5
ltx/en_us_goadedes/me.m04.d12:meMA.Ode5C12.text	
ltx/en_us_goadedes/me.m04.d12:meMA.Ode5C13.incipit	…
ltx/en_us_goadedes/me.m04.d12:meMA.Ode5C13.melody	@ltx/en_us_goadedes/he.h.m8:heHE.OrthrizontesVoomenSoi.name
ltx/en_us_goadedes/me.m04.d12:meMA.Ode5C13.mode	@ltx/en_us_goadedes/miscellanea:misc.Mode8
ltx/en_us_goadedes/me.m04.d12:meMA.Ode5C13.ode	@ltx/en_us_goadedes/miscellanea:misc.Ode5
ltx/en_us_goadedes/me.m04.d12:meMA.Ode5C13.text	
ltx/en_us_goadedes/me.m04.d12:meMA.Ode5C1H.greekmelody	@ltx/en_us_goadedes/he.h.m8:heHE.OrthrizontesVoomenSoi.greekname
ltx/en_us_goadedes/me.m04.d12:meMA.Ode5C1H.incipit	@ltx/en_us_goadedes/he.h.m8:heHE.OrthrizontesVoomenSoi.incipit
ltx/en_us_goadedes/me.m04.d12:meMA.Ode5C1H.melody	@ltx/en_us_goadedes/he.h.m8:heHE.OrthrizontesVoomenSoi.melody
ltx/en_us_goadedes/me.m04.d12:meMA.Ode5C1H.mode	@ltx/en_us_goadedes/miscellanea:misc.Mode8
ltx/en_us_goadedes/me.m04.d12:meMA.Ode5C1H.ode	@ltx/en_us_goadedes/miscellanea:misc.Ode5
ltx/en_us_goadedes/me.m04.d12:meMA.Ode5C1H.text	@ltx/en_us_goadedes/he.h.m8:heHE.OrthrizontesVoomenSoi.text
ltx/en_us_goadedes/me.m04.d12:meMA.Ode5C1T.incipit	…
ltx/en_us_goadedes/me.m04.d12:meMA.Ode5C1T.melody	@ltx/en_us_goadedes/he.h.m8:heHE.OrthrizontesVoomenSoi.name
ltx/en_us_goadedes/me.m04.d12:meMA.Ode5C1T.mode	@ltx/en_us_goadedes/miscellanea:misc.Mode8
ltx/en_us_goadedes/me.m04.d12:meMA.Ode5C1T.ode	@ltx/en_us_goadedes/miscellanea:misc.Ode5
ltx/en_us_goadedes/me.m04.d12:meMA.Ode5C1T.text	
ltx/en_us_goadedes/me.m04.d12:meMA.Ode6C11.greekmelody	@ltx/en_us_goadedes/he.h.m8:heHE.IlasthitiMoiSotir.greekname
ltx/en_us_goadedes/me.m04.d12:meMA.Ode6C11.incipit	…
ltx/en_us_goadedes/me.m04.d12:meMA.Ode6C11.melody	@ltx/en_us_goadedes/he.h.m8:heHE.IlasthitiMoiSotir.name
ltx/en_us_goadedes/me.m04.d12:meMA.Ode6C11.mode	@ltx/en_us_goadedes/miscellanea:misc.Mode8
ltx/en_us_goadedes/me.m04.d12:meMA.Ode6C11.ode	@ltx/en_us_goadedes/miscellanea:misc.Ode6
ltx/en_us_goadedes/me.m04.d12:meMA.Ode6C11.text	
ltx/en_us_goadedes/me.m04.d12:meMA.Ode6C12.incipit	…
ltx/en_us_goadedes/me.m04.d12:meMA.Ode6C12.melody	@ltx/en_us_goadedes/he.h.m8:heHE.IlasthitiMoiSotir.name
ltx/en_us_goadedes/me.m04.d12:meMA.Ode6C12.mode	@ltx/en_us_goadedes/miscellanea:misc.Mode8
ltx/en_us_goadedes/me.m04.d12:meMA.Ode6C12.ode	@ltx/en_us_goadedes/miscellanea:misc.Ode6
ltx/en_us_goadedes/me.m04.d12:meMA.Ode6C12.text	
ltx/en_us_goadedes/me.m04.d12:meMA.Ode6C13.incipit	…
ltx/en_us_goadedes/me.m04.d12:meMA.Ode6C13.melody	@ltx/en_us_goadedes/he.h.m8:heHE.IlasthitiMoiSotir.name
ltx/en_us_goadedes/me.m04.d12:meMA.Ode6C13.mode	@ltx/en_us_goadedes/miscellanea:misc.Mode8
ltx/en_us_goadedes/me.m04.d12:meMA.Ode6C13.ode	@ltx/en_us_goadedes/miscellanea:misc.Ode6
ltx/en_us_goadedes/me.m04.d12:meMA.Ode6C13.text	
ltx/en_us_goadedes/me.m04.d12:meMA.Ode6C1H.greekmelody	@ltx/en_us_goadedes/he.h.m8:heHE.IlasthitiMoiSotir.greekname
ltx/en_us_goadedes/me.m04.d12:meMA.Ode6C1H.incipit	@ltx/en_us_goadedes/he.h.m8:heHE.IlasthitiMoiSotir.incipit
ltx/en_us_goadedes/me.m04.d12:meMA.Ode6C1H.melody	@ltx/en_us_goadedes/he.h.m8:heHE.IlasthitiMoiSotir.melody
ltx/en_us_goadedes/me.m04.d12:meMA.Ode6C1H.mode	@ltx/en_us_goadedes/miscellanea:misc.Mode8
ltx/en_us_goadedes/me.m04.d12:meMA.Ode6C1H.ode	@ltx/en_us_goadedes/miscellanea:misc.Ode6
ltx/en_us_goadedes/me.m04.d12:meMA.Ode6C1H.text	@ltx/en_us_goadedes/he.h.m8:heHE.IlasthitiMoiSotir.text
ltx/en_us_goadedes/me.m04.d12:meMA.Ode6C1T.incipit	…
ltx/en_us_goadedes/me.m04.d12:meMA.Ode6C1T.melody	@ltx/en_us_goadedes/he.h.m8:heHE.IlasthitiMoiSotir.name
ltx/en_us_goadedes/me.m04.d12:meMA.Ode6C1T.mode	@ltx/en_us_goadedes/miscellanea:misc.Mode8
ltx/en_us_goadedes/me.m04.d12:meMA.Ode6C1T.ode	@ltx/en_us_goadedes/miscellanea:misc.Ode6
ltx/en_us_goadedes/me.m04.d12:meMA.Ode6C1T.text	
ltx/en_us_goadedes/me.m04.d12:meMA.Ode7C11.greekmelody	@ltx/en_us_goadedes/he.h.m8:heHE.PaidesEvraion.greekname
ltx/en_us_goadedes/me.m04.d12:meMA.Ode7C11.incipit	…
ltx/en_us_goadedes/me.m04.d12:meMA.Ode7C11.melody	@ltx/en_us_goadedes/he.h.m8:heHE.PaidesEvraion.name
ltx/en_us_goadedes/me.m04.d12:meMA.Ode7C11.mode	@ltx/en_us_goadedes/miscellanea:misc.Mode8
ltx/en_us_goadedes/me.m04.d12:meMA.Ode7C11.ode	@ltx/en_us_goadedes/miscellanea:misc.Ode7
ltx/en_us_goadedes/me.m04.d12:meMA.Ode7C11.text	
ltx/en_us_goadedes/me.m04.d12:meMA.Ode7C12.incipit	…
ltx/en_us_goadedes/me.m04.d12:meMA.Ode7C12.melody	@ltx/en_us_goadedes/he.h.m8:heHE.PaidesEvraion.name
ltx/en_us_goadedes/me.m04.d12:meMA.Ode7C12.mode	@ltx/en_us_goadedes/miscellanea:misc.Mode8
ltx/en_us_goadedes/me.m04.d12:meMA.Ode7C12.ode	@ltx/en_us_goadedes/miscellanea:misc.Ode7
ltx/en_us_goadedes/me.m04.d12:meMA.Ode7C12.text	
ltx/en_us_goadedes/me.m04.d12:meMA.Ode7C13.incipit	…
ltx/en_us_goadedes/me.m04.d12:meMA.Ode7C13.melody	@ltx/en_us_goadedes/he.h.m8:heHE.PaidesEvraion.name
ltx/en_us_goadedes/me.m04.d12:meMA.Ode7C13.mode	@ltx/en_us_goadedes/miscellanea:misc.Mode8
ltx/en_us_goadedes/me.m04.d12:meMA.Ode7C13.ode	@ltx/en_us_goadedes/miscellanea:misc.Ode7
ltx/en_us_goadedes/me.m04.d12:meMA.Ode7C13.text	
ltx/en_us_goadedes/me.m04.d12:meMA.Ode7C1H.greekmelody	@ltx/en_us_goadedes/he.h.m8:heHE.PaidesEvraion.greekname
ltx/en_us_goadedes/me.m04.d12:meMA.Ode7C1H.incipit	@ltx/en_us_goadedes/he.h.m8:heHE.PaidesEvraion.incipit
ltx/en_us_goadedes/me.m04.d12:meMA.Ode7C1H.melody	@ltx/en_us_goadedes/he.h.m8:heHE.PaidesEvraion.melody
ltx/en_us_goadedes/me.m04.d12:meMA.Ode7C1H.mode	@ltx/en_us_goadedes/miscellanea:misc.Mode8
ltx/en_us_goadedes/me.m04.d12:meMA.Ode7C1H.ode	@ltx/en_us_goadedes/miscellanea:misc.Ode7
ltx/en_us_goadedes/me.m04.d12:meMA.Ode7C1H.text	@ltx/en_us_goadedes/he.h.m8:heHE.PaidesEvraion.text
ltx/en_us_goadedes/me.m04.d12:meMA.Ode7C1T.incipit	…
ltx/en_us_goadedes/me.m04.d12:meMA.Ode7C1T.melody	@ltx/en_us_goadedes/he.h.m8:heHE.PaidesEvraion.name
ltx/en_us_goadedes/me.m04.d12:meMA.Ode7C1T.mode	@ltx/en_us_goadedes/miscellanea:misc.Mode8
ltx/en_us_goadedes/me.m04.d12:meMA.Ode7C1T.ode	@ltx/en_us_goadedes/miscellanea:misc.Ode7
ltx/en_us_goadedes/me.m04.d12:meMA.Ode7C1T.text	
ltx/en_us_goadedes/me.m04.d12:meMA.Ode8C11.greekmelody	@ltx/en_us_goadedes/he.h.m8:heHE.NikitaiTyrannou.greekname
ltx/en_us_goadedes/me.m04.d12:meMA.Ode8C11.incipit	…
ltx/en_us_goadedes/me.m04.d12:meMA.Ode8C11.melody	@ltx/en_us_goadedes/he.h.m8:heHE.NikitaiTyrannou.name
ltx/en_us_goadedes/me.m04.d12:meMA.Ode8C11.mode	@ltx/en_us_goadedes/miscellanea:misc.Mode8
ltx/en_us_goadedes/me.m04.d12:meMA.Ode8C11.ode	@ltx/en_us_goadedes/miscellanea:misc.Ode8
ltx/en_us_goadedes/me.m04.d12:meMA.Ode8C11.text	
ltx/en_us_goadedes/me.m04.d12:meMA.Ode8C12.incipit	…
ltx/en_us_goadedes/me.m04.d12:meMA.Ode8C12.melody	@ltx/en_us_goadedes/he.h.m8:heHE.NikitaiTyrannou.name
ltx/en_us_goadedes/me.m04.d12:meMA.Ode8C12.mode	@ltx/en_us_goadedes/miscellanea:misc.Mode8
ltx/en_us_goadedes/me.m04.d12:meMA.Ode8C12.ode	@ltx/en_us_goadedes/miscellanea:misc.Ode8
ltx/en_us_goadedes/me.m04.d12:meMA.Ode8C12.text	
ltx/en_us_goadedes/me.m04.d12:meMA.Ode8C13.incipit	…
ltx/en_us_goadedes/me.m04.d12:meMA.Ode8C13.melody	@ltx/en_us_goadedes/he.h.m8:heHE.NikitaiTyrannou.name
ltx/en_us_goadedes/me.m04.d12:meMA.Ode8C13.mode	@ltx/en_us_goadedes/miscellanea:misc.Mode8
ltx/en_us_goadedes/me.m04.d12:meMA.Ode8C13.ode	@ltx/en_us_goadedes/miscellanea:misc.Ode8
ltx/en_us_goadedes/me.m04.d12:meMA.Ode8C13.text	
ltx/en_us_goadedes/me.m04.d12:meMA.Ode8C1H.greekmelody	@ltx/en_us_goadedes/he.h.m8:heHE.NikitaiTyrannou.greekname
ltx/en_us_goadedes/me.m04.d12:meMA.Ode8C1H.incipit	@ltx/en_us_goadedes/he.h.m8:heHE.NikitaiTyrannou.incipit
ltx/en_us_goadedes/me.m04.d12:meMA.Ode8C1H.melody	@ltx/en_us_goadedes/he.h.m8:heHE.NikitaiTyrannou.melody
ltx/en_us_goadedes/me.m04.d12:meMA.Ode8C1H.mode	@ltx/en_us_goadedes/miscellanea:misc.Mode8
ltx/en_us_goadedes/me.m04.d12:meMA.Ode8C1H.ode	@ltx/en_us_goadedes/miscellanea:misc.Ode8
ltx/en_us_goadedes/me.m04.d12:meMA.Ode8C1H.text	@ltx/en_us_goadedes/he.h.m8:heHE.NikitaiTyrannou.text
ltx/en_us_goadedes/me.m04.d12:meMA.Ode8C1T.incipit	…
ltx/en_us_goadedes/me.m04.d12:meMA.Ode8C1T.melody	@ltx/en_us_goadedes/he.h.m8:heHE.NikitaiTyrannou.name
ltx/en_us_goadedes/me.m04.d12:meMA.Ode8C1T.mode	@ltx/en_us_goadedes/miscellanea:misc.Mode8
ltx/en_us_goadedes/me.m04.d12:meMA.Ode8C1T.ode	@ltx/en_us_goadedes/miscellanea:misc.Ode8
ltx/en_us_goadedes/me.m04.d12:meMA.Ode8C1T.text	
ltx/en_us_goadedes/me.m04.d12:meMA.Ode9C11.greekmelody	@ltx/en_us_goadedes/he.h.m8:heHE.KyriosTheotokon.greekname
ltx/en_us_goadedes/me.m04.d12:meMA.Ode9C11.incipit	…
ltx/en_us_goadedes/me.m04.d12:meMA.Ode9C11.melody	@ltx/en_us_goadedes/he.h.m8:heHE.KyriosTheotokon.name
ltx/en_us_goadedes/me.m04.d12:meMA.Ode9C11.mode	@ltx/en_us_goadedes/miscellanea:misc.Mode8
ltx/en_us_goadedes/me.m04.d12:meMA.Ode9C11.ode	@ltx/en_us_goadedes/miscellanea:misc.Ode9
ltx/en_us_goadedes/me.m04.d12:meMA.Ode9C11.text	
ltx/en_us_goadedes/me.m04.d12:meMA.Ode9C12.incipit	…
ltx/en_us_goadedes/me.m04.d12:meMA.Ode9C12.melody	@ltx/en_us_goadedes/he.h.m8:heHE.KyriosTheotokon.name
ltx/en_us_goadedes/me.m04.d12:meMA.Ode9C12.mode	@ltx/en_us_goadedes/miscellanea:misc.Mode8
ltx/en_us_goadedes/me.m04.d12:meMA.Ode9C12.ode	@ltx/en_us_goadedes/miscellanea:misc.Ode9
ltx/en_us_goadedes/me.m04.d12:meMA.Ode9C12.text	
ltx/en_us_goadedes/me.m04.d12:meMA.Ode9C13.incipit	…
ltx/en_us_goadedes/me.m04.d12:meMA.Ode9C13.melody	@ltx/en_us_goadedes/he.h.m8:heHE.KyriosTheotokon.name
ltx/en_us_goadedes/me.m04.d12:meMA.Ode9C13.mode	@ltx/en_us_goadedes/miscellanea:misc.Mode8
ltx/en_us_goadedes/me.m04.d12:meMA.Ode9C13.ode	@ltx/en_us_goadedes/miscellanea:misc.Ode9
ltx/en_us_goadedes/me.m04.d12:meMA.Ode9C13.text	
ltx/en_us_goadedes/me.m04.d12:meMA.Ode9C1H.greekmelody	@ltx/en_us_goadedes/he.h.m8:heHE.KyriosTheotokon.greekname
ltx/en_us_goadedes/me.m04.d12:meMA.Ode9C1H.incipit	@ltx/en_us_goadedes/he.h.m8:heHE.KyriosTheotokon.incipit
ltx/en_us_goadedes/me.m04.d12:meMA.Ode9C1H.melody	@ltx/en_us_goadedes/he.h.m8:heHE.KyriosTheotokon.melody
ltx/en_us_goadedes/me.m04.d12:meMA.Ode9C1H.mode	@ltx/en_us_goadedes/miscellanea:misc.Mode8
ltx/en_us_goadedes/me.m04.d12:meMA.Ode9C1H.ode	@ltx/en_us_goadedes/miscellanea:misc.Ode9
ltx/en_us_goadedes/me.m04.d12:meMA.Ode9C1H.text	@ltx/en_us_goadedes/he.h.m8:heHE.KyriosTheotokon.text
ltx/en_us_goadedes/me.m04.d12:meMA.Ode9C1T.incipit	…
ltx/en_us_goadedes/me.m04.d12:meMA.Ode9C1T.melody	@ltx/en_us_goadedes/he.h.m8:heHE.KyriosTheotokon.name
ltx/en_us_goadedes/me.m04.d12:meMA.Ode9C1T.mode	@ltx/en_us_goadedes/miscellanea:misc.Mode8
ltx/en_us_goadedes/me.m04.d12:meMA.Ode9C1T.ode	@ltx/en_us_goadedes/miscellanea:misc.Ode9
ltx/en_us_goadedes/me.m04.d12:meMA.Ode9C1T.text	
ltx/en_us_goadedes/me.m04.d12:meVE.Apolytikion1ger.greekmelody	@ltx/en_us_goadedes/he.a.m4:heAU.OYpsotheisEnToStavro.greekname
ltx/en_us_goadedes/me.m04.d12:meVE.Apolytikion1ger.incipit	…
ltx/en_us_goadedes/me.m04.d12:meVE.Apolytikion1ger.melody	@ltx/en_us_goadedes/he.a.m4:heAU.OYpsotheisEnToStavro.name
ltx/en_us_goadedes/me.m04.d12:meVE.Apolytikion1ger.mode	@ltx/en_us_goadedes/miscellanea:misc.Mode4
ltx/en_us_goadedes/me.m04.d12:meVE.Apolytikion1ger.poet	@ltx/en_us_goadedes/poets:po.Gerasimou
ltx/en_us_goadedes/me.m04.d12:meVE.Apolytikion1ger.text	
ltx/en_us_goadedes/me.m04.d12:meVE.SticStavrotheotokion.greekmelody	@ltx/en_us_goadedes/he.a.m4:heAU.EdokasSimeiosin.greekname
ltx/en_us_goadedes/me.m04.d12:meVE.SticStavrotheotokion.incipit	…
ltx/en_us_goadedes/me.m04.d12:meVE.SticStavrotheotokion.melody	@ltx/en_us_goadedes/he.a.m4:heAU.EdokasSimeiosin.name
ltx/en_us_goadedes/me.m04.d12:meVE.SticStavrotheotokion.mode	@ltx/en_us_goadedes/miscellanea:misc.Mode4
ltx/en_us_goadedes/me.m04.d12:meVE.SticStavrotheotokion.text	
ltx/en_us_goadedes/me.m04.d12:meVE.SticTheotokion.greekmelody	@ltx/en_us_goadedes/he.a.m4:heAU.EdokasSimeiosin.greekname
ltx/en_us_goadedes/me.m04.d12:meVE.SticTheotokion.incipit	…
ltx/en_us_goadedes/me.m04.d12:meVE.SticTheotokion.melody	@ltx/en_us_goadedes/he.a.m4:heAU.EdokasSimeiosin.name
ltx/en_us_goadedes/me.m04.d12:meVE.SticTheotokion.mode	@ltx/en_us_goadedes/miscellanea:misc.Mode4
ltx/en_us_goadedes/me.m04.d12:meVE.SticTheotokion.text	
ltx/en_us_goadedes/me.m04.d12:meVE.Stichera01.greekmelody	@ltx/en_us_goadedes/he.a.m4:heAU.EdokasSimeiosin.greekname
ltx/en_us_goadedes/me.m04.d12:meVE.Stichera01.incipit	…
ltx/en_us_goadedes/me.m04.d12:meVE.Stichera01.melody	@ltx/en_us_goadedes/he.a.m4:heAU.EdokasSimeiosin.name
ltx/en_us_goadedes/me.m04.d12:meVE.Stichera01.mode	@ltx/en_us_goadedes/miscellanea:misc.Mode4
ltx/en_us_goadedes/me.m04.d12:meVE.Stichera01.text	
ltx/en_us_goadedes/me.m04.d12:meVE.Stichera02.incipit	…
ltx/en_us_goadedes/me.m04.d12:meVE.Stichera02.melody	@ltx/en_us_goadedes/he.a.m4:heAU.EdokasSimeiosin.name
ltx/en_us_goadedes/me.m04.d12:meVE.Stichera02.mode	@ltx/en_us_goadedes/miscellanea:misc.Mode4
ltx/en_us_goadedes/me.m04.d12:meVE.Stichera02.text	
ltx/en_us_goadedes/me.m04.d12:meVE.Stichera03.incipit	…
ltx/en_us_goadedes/me.m04.d12:meVE.Stichera03.melody	@ltx/en_us_goadedes/he.a.m4:heAU.EdokasSimeiosin.name
ltx/en_us_goadedes/me.m04.d12:meVE.Stichera03.mode	@ltx/en_us_goadedes/miscellanea:misc.Mode4
ltx/en_us_goadedes/me.m04.d12:meVE.Stichera03.text	
