ltx/en_us_goadedes/me.m12.d13:meDA.commemoration.first	
ltx/en_us_goadedes/me.m12.d13:meDA.commemoration.first_name	
ltx/en_us_goadedes/me.m12.d13:meDA.commemoration.first_short	
ltx/en_us_goadedes/me.m12.d13:meDA.commemoration.first_title	@ltx/en_us_goadedes/titles:ti.Saints
ltx/en_us_goadedes/me.m12.d13:meDA.commemoration.full	
ltx/en_us_goadedes/me.m12.d13:meDA.commemoration.second_name	
ltx/en_us_goadedes/me.m12.d13:meDA.commemoration.second_title	
ltx/en_us_goadedes/me.m12.d13:meDA.date	
ltx/en_us_goadedes/me.m12.d13:meDA.fordate	
ltx/en_us_goadedes/me.m12.d13:meDA.insert1	
ltx/en_us_goadedes/me.m12.d13:meDA.insert2	
ltx/en_us_goadedes/me.m12.d13:meDA.note	
ltx/en_us_goadedes/me.m12.d13:meDA.pdfcoverdate	
ltx/en_us_goadedes/me.m12.d13:meDA.pdfheaderdate	
ltx/en_us_goadedes/me.m12.d13:meHO.commemorations	
ltx/en_us_goadedes/me.m12.d13:meHO.note1	
ltx/en_us_goadedes/me.m12.d13:meHO.note2	
ltx/en_us_goadedes/me.m12.d13:meHO.number	
ltx/en_us_goadedes/me.m12.d13:meHO.rank	
ltx/en_us_goadedes/me.m12.d13:meLE.commemoration1	
ltx/en_us_goadedes/me.m12.d13:meLE.commemoration2	
ltx/en_us_goadedes/me.m12.d13:meLI.Kontakion1.greekmelody	@ltx/en_us_goadedes/me.m12.d13:meMA.Kontakion1.greekmelody
ltx/en_us_goadedes/me.m12.d13:meLI.Kontakion1.incipit	@ltx/en_us_goadedes/me.m12.d13:meMA.Kontakion1.incipit
ltx/en_us_goadedes/me.m12.d13:meLI.Kontakion1.melody	@ltx/en_us_goadedes/me.m12.d13:meMA.Kontakion1.melody
ltx/en_us_goadedes/me.m12.d13:meLI.Kontakion1.mode	@ltx/en_us_goadedes/me.m12.d13:meMA.Kontakion1.mode
ltx/en_us_goadedes/me.m12.d13:meLI.Kontakion1.text	@ltx/en_us_goadedes/me.m12.d13:meMA.Kontakion1.text
ltx/en_us_goadedes/me.m12.d13:meLI.Megalynarion.text	
ltx/en_us_goadedes/me.m12.d13:meMA.AposGlory.incipit	…
ltx/en_us_goadedes/me.m12.d13:meMA.AposGlory.melody	
ltx/en_us_goadedes/me.m12.d13:meMA.AposGlory.mode	@ltx/en_us_goadedes/miscellanea:misc.Mode4
ltx/en_us_goadedes/me.m12.d13:meMA.AposGlory.poet	@ltx/en_us_goadedes/poets:po.IkasiasMonachis
ltx/en_us_goadedes/me.m12.d13:meMA.AposGlory.text	
ltx/en_us_goadedes/me.m12.d13:meMA.AposStavrotheotokion.greekmelody	@ltx/en_us_goadedes/he.a.m4:heAU.OsGennaionEnMartysi.greekname
ltx/en_us_goadedes/me.m12.d13:meMA.AposStavrotheotokion.incipit	…
ltx/en_us_goadedes/me.m12.d13:meMA.AposStavrotheotokion.melody	@ltx/en_us_goadedes/he.a.m4:heAU.OsGennaionEnMartysi.name
ltx/en_us_goadedes/me.m12.d13:meMA.AposStavrotheotokion.mode	@ltx/en_us_goadedes/miscellanea:misc.Mode4
ltx/en_us_goadedes/me.m12.d13:meMA.AposStavrotheotokion.text	
ltx/en_us_goadedes/me.m12.d13:meMA.AposTheotokion.greekmelody	@ltx/en_us_goadedes/he.a.m4:heAU.OsGennaionEnMartysi.greekname
ltx/en_us_goadedes/me.m12.d13:meMA.AposTheotokion.incipit	…
ltx/en_us_goadedes/me.m12.d13:meMA.AposTheotokion.melody	@ltx/en_us_goadedes/he.a.m4:heAU.OsGennaionEnMartysi.name
ltx/en_us_goadedes/me.m12.d13:meMA.AposTheotokion.mode	@ltx/en_us_goadedes/miscellanea:misc.Mode4
ltx/en_us_goadedes/me.m12.d13:meMA.AposTheotokion.text	
ltx/en_us_goadedes/me.m12.d13:meMA.C1.poet	@ltx/en_us_goadedes/poets:po.IoannouMonachou
ltx/en_us_goadedes/me.m12.d13:meMA.C1.title	@ltx/en_us_goadedes/titles:ti.CanonSaints
ltx/en_us_goadedes/me.m12.d13:meMA.C1.verse	@ltx/en_us_goadedes/prayers:pr.verse_SaintsM.text
ltx/en_us_goadedes/me.m12.d13:meMA.ExapTheotokion.incipit	…
ltx/en_us_goadedes/me.m12.d13:meMA.ExapTheotokion.melody	@ltx/en_us_goadedes/he.a.m2:heAU.GynaikesAkoutisthite.name
ltx/en_us_goadedes/me.m12.d13:meMA.ExapTheotokion.mode	@ltx/en_us_goadedes/miscellanea:misc.Mode2
ltx/en_us_goadedes/me.m12.d13:meMA.ExapTheotokion.text	
ltx/en_us_goadedes/me.m12.d13:meMA.Exaposteilarion1.greekmelody	@ltx/en_us_goadedes/he.a.m2:heAU.GynaikesAkoutisthite.greekname
ltx/en_us_goadedes/me.m12.d13:meMA.Exaposteilarion1.incipit	…
ltx/en_us_goadedes/me.m12.d13:meMA.Exaposteilarion1.melody	@ltx/en_us_goadedes/he.a.m2:heAU.GynaikesAkoutisthite.name
ltx/en_us_goadedes/me.m12.d13:meMA.Exaposteilarion1.mode	@ltx/en_us_goadedes/miscellanea:misc.Mode2
ltx/en_us_goadedes/me.m12.d13:meMA.Exaposteilarion1.text	
ltx/en_us_goadedes/me.m12.d13:meMA.Kontakion1.greekmelody	@ltx/en_us_goadedes/he.a.m6:heAU.TinEnPresveiais.greekname
ltx/en_us_goadedes/me.m12.d13:meMA.Kontakion1.incipit	…
ltx/en_us_goadedes/me.m12.d13:meMA.Kontakion1.melody	@ltx/en_us_goadedes/he.a.m6:heAU.TinEnPresveiais.name
ltx/en_us_goadedes/me.m12.d13:meMA.Kontakion1.mode	@ltx/en_us_goadedes/miscellanea:misc.Mode6
ltx/en_us_goadedes/me.m12.d13:meMA.Kontakion1.text	
ltx/en_us_goadedes/me.m12.d13:meMA.Lauds1.incipit	…
ltx/en_us_goadedes/me.m12.d13:meMA.Lauds1.melody	
ltx/en_us_goadedes/me.m12.d13:meMA.Lauds1.mode	@ltx/en_us_goadedes/miscellanea:misc.Mode1
ltx/en_us_goadedes/me.m12.d13:meMA.Lauds1.poet	@ltx/en_us_goadedes/poets:po.Vyzantos
ltx/en_us_goadedes/me.m12.d13:meMA.Lauds1.text	
ltx/en_us_goadedes/me.m12.d13:meMA.Lauds2.incipit	…
ltx/en_us_goadedes/me.m12.d13:meMA.Lauds2.melody	
ltx/en_us_goadedes/me.m12.d13:meMA.Lauds2.mode	@ltx/en_us_goadedes/miscellanea:misc.Mode3
ltx/en_us_goadedes/me.m12.d13:meMA.Lauds2.poet	@ltx/en_us_goadedes/poets:po.Germanou
ltx/en_us_goadedes/me.m12.d13:meMA.Lauds2.text	
ltx/en_us_goadedes/me.m12.d13:meMA.Lauds3.incipit	…
ltx/en_us_goadedes/me.m12.d13:meMA.Lauds3.melody	
ltx/en_us_goadedes/me.m12.d13:meMA.Lauds3.mode	@ltx/en_us_goadedes/miscellanea:misc.Mode3
ltx/en_us_goadedes/me.m12.d13:meMA.Lauds3.poet	@ltx/en_us_goadedes/poets:po.Germanou
ltx/en_us_goadedes/me.m12.d13:meMA.Lauds3.text	
ltx/en_us_goadedes/me.m12.d13:meMA.Lauds4.incipit	…
ltx/en_us_goadedes/me.m12.d13:meMA.Lauds4.melody	
ltx/en_us_goadedes/me.m12.d13:meMA.Lauds4.mode	@ltx/en_us_goadedes/miscellanea:misc.Mode4
ltx/en_us_goadedes/me.m12.d13:meMA.Lauds4.poet	@ltx/en_us_goadedes/poets:po.IoannouMonachou
ltx/en_us_goadedes/me.m12.d13:meMA.Lauds4.text	
ltx/en_us_goadedes/me.m12.d13:meMA.LaudsGlory.incipit	…
ltx/en_us_goadedes/me.m12.d13:meMA.LaudsGlory.melody	
ltx/en_us_goadedes/me.m12.d13:meMA.LaudsGlory.mode	@ltx/en_us_goadedes/miscellanea:misc.Mode4
ltx/en_us_goadedes/me.m12.d13:meMA.LaudsGlory.poet	@ltx/en_us_goadedes/poets:po.IkasiasMonachis
ltx/en_us_goadedes/me.m12.d13:meMA.LaudsGlory.text	
ltx/en_us_goadedes/me.m12.d13:meMA.LaudsStavrotheotokion.greekmelody	@ltx/en_us_goadedes/he.a.m4:heAU.EdokasSimeiosin.greekname
ltx/en_us_goadedes/me.m12.d13:meMA.LaudsStavrotheotokion.incipit	@ltx/en_us_goadedes/me.m07.d18:meVE.SticStavrotheotokion.incipit
ltx/en_us_goadedes/me.m12.d13:meMA.LaudsStavrotheotokion.melody	@ltx/en_us_goadedes/he.a.m4:heAU.EdokasSimeiosin.name
ltx/en_us_goadedes/me.m12.d13:meMA.LaudsStavrotheotokion.mode	@ltx/en_us_goadedes/miscellanea:misc.Mode4
ltx/en_us_goadedes/me.m12.d13:meMA.LaudsStavrotheotokion.text	@ltx/en_us_goadedes/me.m07.d18:meVE.SticStavrotheotokion.text
ltx/en_us_goadedes/me.m12.d13:meMA.LaudsTheotokion.greekmelody	@ltx/en_us_goadedes/he.a.m4:heAU.EdokasSimeiosin.greekname
ltx/en_us_goadedes/me.m12.d13:meMA.LaudsTheotokion.incipit	…
ltx/en_us_goadedes/me.m12.d13:meMA.LaudsTheotokion.melody	@ltx/en_us_goadedes/he.a.m4:heAU.EdokasSimeiosin.name
ltx/en_us_goadedes/me.m12.d13:meMA.LaudsTheotokion.mode	@ltx/en_us_goadedes/miscellanea:misc.Mode4
ltx/en_us_goadedes/me.m12.d13:meMA.LaudsTheotokion.text	
ltx/en_us_goadedes/me.m12.d13:meMA.Ode1C11.greekmelody	@ltx/en_us_goadedes/he.h.m4:heHE.ThalassisToErythraion.greekname
ltx/en_us_goadedes/me.m12.d13:meMA.Ode1C11.incipit	…
ltx/en_us_goadedes/me.m12.d13:meMA.Ode1C11.melody	@ltx/en_us_goadedes/he.h.m4:heHE.ThalassisToErythraion.name
ltx/en_us_goadedes/me.m12.d13:meMA.Ode1C11.mode	@ltx/en_us_goadedes/miscellanea:misc.Mode4
ltx/en_us_goadedes/me.m12.d13:meMA.Ode1C11.ode	@ltx/en_us_goadedes/miscellanea:misc.Ode1
ltx/en_us_goadedes/me.m12.d13:meMA.Ode1C11.text	
ltx/en_us_goadedes/me.m12.d13:meMA.Ode1C12.incipit	…
ltx/en_us_goadedes/me.m12.d13:meMA.Ode1C12.melody	@ltx/en_us_goadedes/he.h.m4:heHE.ThalassisToErythraion.name
ltx/en_us_goadedes/me.m12.d13:meMA.Ode1C12.mode	@ltx/en_us_goadedes/miscellanea:misc.Mode4
ltx/en_us_goadedes/me.m12.d13:meMA.Ode1C12.ode	@ltx/en_us_goadedes/miscellanea:misc.Ode1
ltx/en_us_goadedes/me.m12.d13:meMA.Ode1C12.text	
ltx/en_us_goadedes/me.m12.d13:meMA.Ode1C13.incipit	…
ltx/en_us_goadedes/me.m12.d13:meMA.Ode1C13.melody	@ltx/en_us_goadedes/he.h.m4:heHE.ThalassisToErythraion.name
ltx/en_us_goadedes/me.m12.d13:meMA.Ode1C13.mode	@ltx/en_us_goadedes/miscellanea:misc.Mode4
ltx/en_us_goadedes/me.m12.d13:meMA.Ode1C13.ode	@ltx/en_us_goadedes/miscellanea:misc.Ode1
ltx/en_us_goadedes/me.m12.d13:meMA.Ode1C13.text	
ltx/en_us_goadedes/me.m12.d13:meMA.Ode1C14.incipit	…
ltx/en_us_goadedes/me.m12.d13:meMA.Ode1C14.melody	@ltx/en_us_goadedes/he.h.m4:heHE.ThalassisToErythraion.name
ltx/en_us_goadedes/me.m12.d13:meMA.Ode1C14.mode	@ltx/en_us_goadedes/miscellanea:misc.Mode4
ltx/en_us_goadedes/me.m12.d13:meMA.Ode1C14.ode	@ltx/en_us_goadedes/miscellanea:misc.Ode1
ltx/en_us_goadedes/me.m12.d13:meMA.Ode1C14.text	
ltx/en_us_goadedes/me.m12.d13:meMA.Ode1C15.incipit	…
ltx/en_us_goadedes/me.m12.d13:meMA.Ode1C15.melody	@ltx/en_us_goadedes/he.h.m4:heHE.ThalassisToErythraion.name
ltx/en_us_goadedes/me.m12.d13:meMA.Ode1C15.mode	@ltx/en_us_goadedes/miscellanea:misc.Mode4
ltx/en_us_goadedes/me.m12.d13:meMA.Ode1C15.ode	@ltx/en_us_goadedes/miscellanea:misc.Ode1
ltx/en_us_goadedes/me.m12.d13:meMA.Ode1C15.text	
ltx/en_us_goadedes/me.m12.d13:meMA.Ode1C1T.incipit	…
ltx/en_us_goadedes/me.m12.d13:meMA.Ode1C1T.melody	@ltx/en_us_goadedes/he.h.m4:heHE.ThalassisToErythraion.name
ltx/en_us_goadedes/me.m12.d13:meMA.Ode1C1T.mode	@ltx/en_us_goadedes/miscellanea:misc.Mode4
ltx/en_us_goadedes/me.m12.d13:meMA.Ode1C1T.ode	@ltx/en_us_goadedes/miscellanea:misc.Ode1
ltx/en_us_goadedes/me.m12.d13:meMA.Ode1C1T.text	
ltx/en_us_goadedes/me.m12.d13:meMA.Ode3C11.greekmelody	@ltx/en_us_goadedes/he.h.m4:heHE.EffrainetaiEpiSoi.greekname
ltx/en_us_goadedes/me.m12.d13:meMA.Ode3C11.incipit	…
ltx/en_us_goadedes/me.m12.d13:meMA.Ode3C11.melody	@ltx/en_us_goadedes/he.h.m4:heHE.EffrainetaiEpiSoi.name
ltx/en_us_goadedes/me.m12.d13:meMA.Ode3C11.mode	@ltx/en_us_goadedes/miscellanea:misc.Mode4
ltx/en_us_goadedes/me.m12.d13:meMA.Ode3C11.ode	@ltx/en_us_goadedes/miscellanea:misc.Ode3
ltx/en_us_goadedes/me.m12.d13:meMA.Ode3C11.text	
ltx/en_us_goadedes/me.m12.d13:meMA.Ode3C12.incipit	…
ltx/en_us_goadedes/me.m12.d13:meMA.Ode3C12.melody	@ltx/en_us_goadedes/he.h.m4:heHE.EffrainetaiEpiSoi.name
ltx/en_us_goadedes/me.m12.d13:meMA.Ode3C12.mode	@ltx/en_us_goadedes/miscellanea:misc.Mode4
ltx/en_us_goadedes/me.m12.d13:meMA.Ode3C12.ode	@ltx/en_us_goadedes/miscellanea:misc.Ode3
ltx/en_us_goadedes/me.m12.d13:meMA.Ode3C12.text	
ltx/en_us_goadedes/me.m12.d13:meMA.Ode3C13.incipit	…
ltx/en_us_goadedes/me.m12.d13:meMA.Ode3C13.melody	@ltx/en_us_goadedes/he.h.m4:heHE.EffrainetaiEpiSoi.name
ltx/en_us_goadedes/me.m12.d13:meMA.Ode3C13.mode	@ltx/en_us_goadedes/miscellanea:misc.Mode4
ltx/en_us_goadedes/me.m12.d13:meMA.Ode3C13.ode	@ltx/en_us_goadedes/miscellanea:misc.Ode3
ltx/en_us_goadedes/me.m12.d13:meMA.Ode3C13.text	
ltx/en_us_goadedes/me.m12.d13:meMA.Ode3C14.incipit	…
ltx/en_us_goadedes/me.m12.d13:meMA.Ode3C14.melody	@ltx/en_us_goadedes/he.h.m4:heHE.EffrainetaiEpiSoi.name
ltx/en_us_goadedes/me.m12.d13:meMA.Ode3C14.mode	@ltx/en_us_goadedes/miscellanea:misc.Mode4
ltx/en_us_goadedes/me.m12.d13:meMA.Ode3C14.ode	@ltx/en_us_goadedes/miscellanea:misc.Ode3
ltx/en_us_goadedes/me.m12.d13:meMA.Ode3C14.text	
ltx/en_us_goadedes/me.m12.d13:meMA.Ode3C15.incipit	…
ltx/en_us_goadedes/me.m12.d13:meMA.Ode3C15.melody	@ltx/en_us_goadedes/he.h.m4:heHE.EffrainetaiEpiSoi.name
ltx/en_us_goadedes/me.m12.d13:meMA.Ode3C15.mode	@ltx/en_us_goadedes/miscellanea:misc.Mode4
ltx/en_us_goadedes/me.m12.d13:meMA.Ode3C15.ode	@ltx/en_us_goadedes/miscellanea:misc.Ode3
ltx/en_us_goadedes/me.m12.d13:meMA.Ode3C15.text	
ltx/en_us_goadedes/me.m12.d13:meMA.Ode3C1T.incipit	…
ltx/en_us_goadedes/me.m12.d13:meMA.Ode3C1T.melody	@ltx/en_us_goadedes/he.h.m4:heHE.EffrainetaiEpiSoi.name
ltx/en_us_goadedes/me.m12.d13:meMA.Ode3C1T.mode	@ltx/en_us_goadedes/miscellanea:misc.Mode4
ltx/en_us_goadedes/me.m12.d13:meMA.Ode3C1T.ode	@ltx/en_us_goadedes/miscellanea:misc.Ode3
ltx/en_us_goadedes/me.m12.d13:meMA.Ode3C1T.text	
ltx/en_us_goadedes/me.m12.d13:meMA.Ode3H.greekmelody	@ltx/en_us_goadedes/he.h.m4:heHE.EffrainetaiEpiSoi.greekname
ltx/en_us_goadedes/me.m12.d13:meMA.Ode3H.incipit	@ltx/en_us_goadedes/he.h.m4:heHE.EffrainetaiEpiSoi.incipit
ltx/en_us_goadedes/me.m12.d13:meMA.Ode3H.melody	@ltx/en_us_goadedes/he.h.m4:heHE.EffrainetaiEpiSoi.melody
ltx/en_us_goadedes/me.m12.d13:meMA.Ode3H.mode	@ltx/en_us_goadedes/miscellanea:misc.Mode4
ltx/en_us_goadedes/me.m12.d13:meMA.Ode3H.ode	@ltx/en_us_goadedes/miscellanea:misc.Ode3
ltx/en_us_goadedes/me.m12.d13:meMA.Ode3H.text	@ltx/en_us_goadedes/he.h.m4:heHE.EffrainetaiEpiSoi.text
ltx/en_us_goadedes/me.m12.d13:meMA.Ode3Kathisma1.greekmelody	@ltx/en_us_goadedes/he.a.m8:heAU.TinSofianKaiLogon.greekname
ltx/en_us_goadedes/me.m12.d13:meMA.Ode3Kathisma1.incipit	…
ltx/en_us_goadedes/me.m12.d13:meMA.Ode3Kathisma1.melody	@ltx/en_us_goadedes/he.a.m8:heAU.TinSofianKaiLogon.name
ltx/en_us_goadedes/me.m12.d13:meMA.Ode3Kathisma1.mode	@ltx/en_us_goadedes/miscellanea:misc.Mode8
ltx/en_us_goadedes/me.m12.d13:meMA.Ode3Kathisma1.text	
ltx/en_us_goadedes/me.m12.d13:meMA.Ode3Kathisma2.greekmelody	@ltx/en_us_goadedes/he.a.m4:heAU.EpefanisSimeron.greekname
ltx/en_us_goadedes/me.m12.d13:meMA.Ode3Kathisma2.incipit	…
ltx/en_us_goadedes/me.m12.d13:meMA.Ode3Kathisma2.melody	@ltx/en_us_goadedes/he.a.m4:heAU.EpefanisSimeron.name
ltx/en_us_goadedes/me.m12.d13:meMA.Ode3Kathisma2.mode	@ltx/en_us_goadedes/miscellanea:misc.Mode4
ltx/en_us_goadedes/me.m12.d13:meMA.Ode3Kathisma2.text	
ltx/en_us_goadedes/me.m12.d13:meMA.Ode3KathismaSt.incipit	…
ltx/en_us_goadedes/me.m12.d13:meMA.Ode3KathismaSt.melody	@ltx/en_us_goadedes/he.a.m4:heAU.EpefanisSimeron.name
ltx/en_us_goadedes/me.m12.d13:meMA.Ode3KathismaSt.mode	@ltx/en_us_goadedes/miscellanea:misc.Mode4
ltx/en_us_goadedes/me.m12.d13:meMA.Ode3KathismaSt.text	
ltx/en_us_goadedes/me.m12.d13:meMA.Ode3KathismaT.incipit	…
ltx/en_us_goadedes/me.m12.d13:meMA.Ode3KathismaT.melody	@ltx/en_us_goadedes/he.a.m4:heAU.EpefanisSimeron.name
ltx/en_us_goadedes/me.m12.d13:meMA.Ode3KathismaT.mode	@ltx/en_us_goadedes/miscellanea:misc.Mode4
ltx/en_us_goadedes/me.m12.d13:meMA.Ode3KathismaT.text	
ltx/en_us_goadedes/me.m12.d13:meMA.Ode4C11.greekmelody	@ltx/en_us_goadedes/he.h.m4:heHE.DiAgapisinOiktirmon.greekname
ltx/en_us_goadedes/me.m12.d13:meMA.Ode4C11.incipit	…
ltx/en_us_goadedes/me.m12.d13:meMA.Ode4C11.melody	@ltx/en_us_goadedes/he.h.m4:heHE.DiAgapisinOiktirmon.name
ltx/en_us_goadedes/me.m12.d13:meMA.Ode4C11.mode	@ltx/en_us_goadedes/miscellanea:misc.Mode4
ltx/en_us_goadedes/me.m12.d13:meMA.Ode4C11.ode	@ltx/en_us_goadedes/miscellanea:misc.Ode4
ltx/en_us_goadedes/me.m12.d13:meMA.Ode4C11.text	
ltx/en_us_goadedes/me.m12.d13:meMA.Ode4C12.incipit	…
ltx/en_us_goadedes/me.m12.d13:meMA.Ode4C12.melody	@ltx/en_us_goadedes/he.h.m4:heHE.DiAgapisinOiktirmon.name
ltx/en_us_goadedes/me.m12.d13:meMA.Ode4C12.mode	@ltx/en_us_goadedes/miscellanea:misc.Mode4
ltx/en_us_goadedes/me.m12.d13:meMA.Ode4C12.ode	@ltx/en_us_goadedes/miscellanea:misc.Ode4
ltx/en_us_goadedes/me.m12.d13:meMA.Ode4C12.text	
ltx/en_us_goadedes/me.m12.d13:meMA.Ode4C13.incipit	…
ltx/en_us_goadedes/me.m12.d13:meMA.Ode4C13.melody	@ltx/en_us_goadedes/he.h.m4:heHE.DiAgapisinOiktirmon.name
ltx/en_us_goadedes/me.m12.d13:meMA.Ode4C13.mode	@ltx/en_us_goadedes/miscellanea:misc.Mode4
ltx/en_us_goadedes/me.m12.d13:meMA.Ode4C13.ode	@ltx/en_us_goadedes/miscellanea:misc.Ode4
ltx/en_us_goadedes/me.m12.d13:meMA.Ode4C13.text	
ltx/en_us_goadedes/me.m12.d13:meMA.Ode4C14.incipit	…
ltx/en_us_goadedes/me.m12.d13:meMA.Ode4C14.melody	@ltx/en_us_goadedes/he.h.m4:heHE.DiAgapisinOiktirmon.name
ltx/en_us_goadedes/me.m12.d13:meMA.Ode4C14.mode	@ltx/en_us_goadedes/miscellanea:misc.Mode4
ltx/en_us_goadedes/me.m12.d13:meMA.Ode4C14.ode	@ltx/en_us_goadedes/miscellanea:misc.Ode4
ltx/en_us_goadedes/me.m12.d13:meMA.Ode4C14.text	
ltx/en_us_goadedes/me.m12.d13:meMA.Ode4C15.incipit	…
ltx/en_us_goadedes/me.m12.d13:meMA.Ode4C15.melody	@ltx/en_us_goadedes/he.h.m4:heHE.DiAgapisinOiktirmon.name
ltx/en_us_goadedes/me.m12.d13:meMA.Ode4C15.mode	@ltx/en_us_goadedes/miscellanea:misc.Mode4
ltx/en_us_goadedes/me.m12.d13:meMA.Ode4C15.ode	@ltx/en_us_goadedes/miscellanea:misc.Ode4
ltx/en_us_goadedes/me.m12.d13:meMA.Ode4C15.text	
ltx/en_us_goadedes/me.m12.d13:meMA.Ode4C1T.incipit	…
ltx/en_us_goadedes/me.m12.d13:meMA.Ode4C1T.melody	@ltx/en_us_goadedes/he.h.m4:heHE.DiAgapisinOiktirmon.name
ltx/en_us_goadedes/me.m12.d13:meMA.Ode4C1T.mode	@ltx/en_us_goadedes/miscellanea:misc.Mode4
ltx/en_us_goadedes/me.m12.d13:meMA.Ode4C1T.ode	@ltx/en_us_goadedes/miscellanea:misc.Ode4
ltx/en_us_goadedes/me.m12.d13:meMA.Ode4C1T.text	
ltx/en_us_goadedes/me.m12.d13:meMA.Ode5C11.greekmelody	@ltx/en_us_goadedes/he.h.m4:heHE.SyKyrieMouFos.greekname
ltx/en_us_goadedes/me.m12.d13:meMA.Ode5C11.incipit	…
ltx/en_us_goadedes/me.m12.d13:meMA.Ode5C11.melody	@ltx/en_us_goadedes/he.h.m4:heHE.SyKyrieMouFos.name
ltx/en_us_goadedes/me.m12.d13:meMA.Ode5C11.mode	@ltx/en_us_goadedes/miscellanea:misc.Mode4
ltx/en_us_goadedes/me.m12.d13:meMA.Ode5C11.ode	@ltx/en_us_goadedes/miscellanea:misc.Ode5
ltx/en_us_goadedes/me.m12.d13:meMA.Ode5C11.text	
ltx/en_us_goadedes/me.m12.d13:meMA.Ode5C12.incipit	…
ltx/en_us_goadedes/me.m12.d13:meMA.Ode5C12.melody	@ltx/en_us_goadedes/he.h.m4:heHE.SyKyrieMouFos.name
ltx/en_us_goadedes/me.m12.d13:meMA.Ode5C12.mode	@ltx/en_us_goadedes/miscellanea:misc.Mode4
ltx/en_us_goadedes/me.m12.d13:meMA.Ode5C12.ode	@ltx/en_us_goadedes/miscellanea:misc.Ode5
ltx/en_us_goadedes/me.m12.d13:meMA.Ode5C12.text	
ltx/en_us_goadedes/me.m12.d13:meMA.Ode5C13.incipit	…
ltx/en_us_goadedes/me.m12.d13:meMA.Ode5C13.melody	@ltx/en_us_goadedes/he.h.m4:heHE.SyKyrieMouFos.name
ltx/en_us_goadedes/me.m12.d13:meMA.Ode5C13.mode	@ltx/en_us_goadedes/miscellanea:misc.Mode4
ltx/en_us_goadedes/me.m12.d13:meMA.Ode5C13.ode	@ltx/en_us_goadedes/miscellanea:misc.Ode5
ltx/en_us_goadedes/me.m12.d13:meMA.Ode5C13.text	
ltx/en_us_goadedes/me.m12.d13:meMA.Ode5C14.incipit	…
ltx/en_us_goadedes/me.m12.d13:meMA.Ode5C14.melody	@ltx/en_us_goadedes/he.h.m4:heHE.SyKyrieMouFos.name
ltx/en_us_goadedes/me.m12.d13:meMA.Ode5C14.mode	@ltx/en_us_goadedes/miscellanea:misc.Mode4
ltx/en_us_goadedes/me.m12.d13:meMA.Ode5C14.ode	@ltx/en_us_goadedes/miscellanea:misc.Ode5
ltx/en_us_goadedes/me.m12.d13:meMA.Ode5C14.text	
ltx/en_us_goadedes/me.m12.d13:meMA.Ode5C15.incipit	…
ltx/en_us_goadedes/me.m12.d13:meMA.Ode5C15.melody	@ltx/en_us_goadedes/he.h.m4:heHE.SyKyrieMouFos.name
ltx/en_us_goadedes/me.m12.d13:meMA.Ode5C15.mode	@ltx/en_us_goadedes/miscellanea:misc.Mode4
ltx/en_us_goadedes/me.m12.d13:meMA.Ode5C15.ode	@ltx/en_us_goadedes/miscellanea:misc.Ode5
ltx/en_us_goadedes/me.m12.d13:meMA.Ode5C15.text	
ltx/en_us_goadedes/me.m12.d13:meMA.Ode5C1T.incipit	…
ltx/en_us_goadedes/me.m12.d13:meMA.Ode5C1T.melody	@ltx/en_us_goadedes/he.h.m4:heHE.SyKyrieMouFos.name
ltx/en_us_goadedes/me.m12.d13:meMA.Ode5C1T.mode	@ltx/en_us_goadedes/miscellanea:misc.Mode4
ltx/en_us_goadedes/me.m12.d13:meMA.Ode5C1T.ode	@ltx/en_us_goadedes/miscellanea:misc.Ode5
ltx/en_us_goadedes/me.m12.d13:meMA.Ode5C1T.text	
ltx/en_us_goadedes/me.m12.d13:meMA.Ode6C11.greekmelody	@ltx/en_us_goadedes/he.h.m4:heHE.ThysoSoiMetaFonis.greekname
ltx/en_us_goadedes/me.m12.d13:meMA.Ode6C11.incipit	…
ltx/en_us_goadedes/me.m12.d13:meMA.Ode6C11.melody	@ltx/en_us_goadedes/he.h.m4:heHE.ThysoSoiMetaFonis.name
ltx/en_us_goadedes/me.m12.d13:meMA.Ode6C11.mode	@ltx/en_us_goadedes/miscellanea:misc.Mode4
ltx/en_us_goadedes/me.m12.d13:meMA.Ode6C11.ode	@ltx/en_us_goadedes/miscellanea:misc.Ode6
ltx/en_us_goadedes/me.m12.d13:meMA.Ode6C11.text	
ltx/en_us_goadedes/me.m12.d13:meMA.Ode6C12.incipit	…
ltx/en_us_goadedes/me.m12.d13:meMA.Ode6C12.melody	@ltx/en_us_goadedes/he.h.m4:heHE.ThysoSoiMetaFonis.name
ltx/en_us_goadedes/me.m12.d13:meMA.Ode6C12.mode	@ltx/en_us_goadedes/miscellanea:misc.Mode4
ltx/en_us_goadedes/me.m12.d13:meMA.Ode6C12.ode	@ltx/en_us_goadedes/miscellanea:misc.Ode6
ltx/en_us_goadedes/me.m12.d13:meMA.Ode6C12.text	
ltx/en_us_goadedes/me.m12.d13:meMA.Ode6C13.incipit	…
ltx/en_us_goadedes/me.m12.d13:meMA.Ode6C13.melody	@ltx/en_us_goadedes/he.h.m4:heHE.ThysoSoiMetaFonis.name
ltx/en_us_goadedes/me.m12.d13:meMA.Ode6C13.mode	@ltx/en_us_goadedes/miscellanea:misc.Mode4
ltx/en_us_goadedes/me.m12.d13:meMA.Ode6C13.ode	@ltx/en_us_goadedes/miscellanea:misc.Ode6
ltx/en_us_goadedes/me.m12.d13:meMA.Ode6C13.text	
ltx/en_us_goadedes/me.m12.d13:meMA.Ode6C14.incipit	…
ltx/en_us_goadedes/me.m12.d13:meMA.Ode6C14.melody	@ltx/en_us_goadedes/he.h.m4:heHE.ThysoSoiMetaFonis.name
ltx/en_us_goadedes/me.m12.d13:meMA.Ode6C14.mode	@ltx/en_us_goadedes/miscellanea:misc.Mode4
ltx/en_us_goadedes/me.m12.d13:meMA.Ode6C14.ode	@ltx/en_us_goadedes/miscellanea:misc.Ode6
ltx/en_us_goadedes/me.m12.d13:meMA.Ode6C14.text	
ltx/en_us_goadedes/me.m12.d13:meMA.Ode6C1T.incipit	…
ltx/en_us_goadedes/me.m12.d13:meMA.Ode6C1T.melody	@ltx/en_us_goadedes/he.h.m4:heHE.ThysoSoiMetaFonis.name
ltx/en_us_goadedes/me.m12.d13:meMA.Ode6C1T.mode	@ltx/en_us_goadedes/miscellanea:misc.Mode4
ltx/en_us_goadedes/me.m12.d13:meMA.Ode6C1T.ode	@ltx/en_us_goadedes/miscellanea:misc.Ode6
ltx/en_us_goadedes/me.m12.d13:meMA.Ode6C1T.text	
ltx/en_us_goadedes/me.m12.d13:meMA.Ode6H.greekmelody	@ltx/en_us_goadedes/he.h.m4:heHE.ThysoSoiMetaFonis.greekname
ltx/en_us_goadedes/me.m12.d13:meMA.Ode6H.incipit	@ltx/en_us_goadedes/he.h.m4:heHE.ThysoSoiMetaFonis.incipit
ltx/en_us_goadedes/me.m12.d13:meMA.Ode6H.melody	@ltx/en_us_goadedes/he.h.m4:heHE.ThysoSoiMetaFonis.melody
ltx/en_us_goadedes/me.m12.d13:meMA.Ode6H.mode	@ltx/en_us_goadedes/miscellanea:misc.Mode4
ltx/en_us_goadedes/me.m12.d13:meMA.Ode6H.ode	@ltx/en_us_goadedes/miscellanea:misc.Ode6
ltx/en_us_goadedes/me.m12.d13:meMA.Ode6H.text	@ltx/en_us_goadedes/he.h.m4:heHE.ThysoSoiMetaFonis.text
ltx/en_us_goadedes/me.m12.d13:meMA.Ode7C11.greekmelody	@ltx/en_us_goadedes/he.h.m4:heHE.EnTiKaminoAvramiaioi.greekname
ltx/en_us_goadedes/me.m12.d13:meMA.Ode7C11.incipit	…
ltx/en_us_goadedes/me.m12.d13:meMA.Ode7C11.melody	@ltx/en_us_goadedes/he.h.m4:heHE.EnTiKaminoAvramiaioi.name
ltx/en_us_goadedes/me.m12.d13:meMA.Ode7C11.mode	@ltx/en_us_goadedes/miscellanea:misc.Mode4
ltx/en_us_goadedes/me.m12.d13:meMA.Ode7C11.ode	@ltx/en_us_goadedes/miscellanea:misc.Ode7
ltx/en_us_goadedes/me.m12.d13:meMA.Ode7C11.text	
ltx/en_us_goadedes/me.m12.d13:meMA.Ode7C12.incipit	…
ltx/en_us_goadedes/me.m12.d13:meMA.Ode7C12.melody	@ltx/en_us_goadedes/he.h.m4:heHE.EnTiKaminoAvramiaioi.name
ltx/en_us_goadedes/me.m12.d13:meMA.Ode7C12.mode	@ltx/en_us_goadedes/miscellanea:misc.Mode4
ltx/en_us_goadedes/me.m12.d13:meMA.Ode7C12.ode	@ltx/en_us_goadedes/miscellanea:misc.Ode7
ltx/en_us_goadedes/me.m12.d13:meMA.Ode7C12.text	
ltx/en_us_goadedes/me.m12.d13:meMA.Ode7C13.incipit	…
ltx/en_us_goadedes/me.m12.d13:meMA.Ode7C13.melody	@ltx/en_us_goadedes/he.h.m4:heHE.EnTiKaminoAvramiaioi.name
ltx/en_us_goadedes/me.m12.d13:meMA.Ode7C13.mode	@ltx/en_us_goadedes/miscellanea:misc.Mode4
ltx/en_us_goadedes/me.m12.d13:meMA.Ode7C13.ode	@ltx/en_us_goadedes/miscellanea:misc.Ode7
ltx/en_us_goadedes/me.m12.d13:meMA.Ode7C13.text	
ltx/en_us_goadedes/me.m12.d13:meMA.Ode7C14.incipit	…
ltx/en_us_goadedes/me.m12.d13:meMA.Ode7C14.melody	@ltx/en_us_goadedes/he.h.m4:heHE.EnTiKaminoAvramiaioi.name
ltx/en_us_goadedes/me.m12.d13:meMA.Ode7C14.mode	@ltx/en_us_goadedes/miscellanea:misc.Mode4
ltx/en_us_goadedes/me.m12.d13:meMA.Ode7C14.ode	@ltx/en_us_goadedes/miscellanea:misc.Ode7
ltx/en_us_goadedes/me.m12.d13:meMA.Ode7C14.text	
ltx/en_us_goadedes/me.m12.d13:meMA.Ode7C15.incipit	…
ltx/en_us_goadedes/me.m12.d13:meMA.Ode7C15.melody	@ltx/en_us_goadedes/he.h.m4:heHE.EnTiKaminoAvramiaioi.name
ltx/en_us_goadedes/me.m12.d13:meMA.Ode7C15.mode	@ltx/en_us_goadedes/miscellanea:misc.Mode4
ltx/en_us_goadedes/me.m12.d13:meMA.Ode7C15.ode	@ltx/en_us_goadedes/miscellanea:misc.Ode7
ltx/en_us_goadedes/me.m12.d13:meMA.Ode7C15.text	
ltx/en_us_goadedes/me.m12.d13:meMA.Ode7C1T.incipit	…
ltx/en_us_goadedes/me.m12.d13:meMA.Ode7C1T.melody	@ltx/en_us_goadedes/he.h.m4:heHE.EnTiKaminoAvramiaioi.name
ltx/en_us_goadedes/me.m12.d13:meMA.Ode7C1T.mode	@ltx/en_us_goadedes/miscellanea:misc.Mode4
ltx/en_us_goadedes/me.m12.d13:meMA.Ode7C1T.ode	@ltx/en_us_goadedes/miscellanea:misc.Ode7
ltx/en_us_goadedes/me.m12.d13:meMA.Ode7C1T.text	
ltx/en_us_goadedes/me.m12.d13:meMA.Ode8C11.greekmelody	@ltx/en_us_goadedes/he.h.m4:heHE.CheirasEkpetasasDaniil.greekname
ltx/en_us_goadedes/me.m12.d13:meMA.Ode8C11.incipit	…
ltx/en_us_goadedes/me.m12.d13:meMA.Ode8C11.melody	@ltx/en_us_goadedes/he.h.m4:heHE.CheirasEkpetasasDaniil.name
ltx/en_us_goadedes/me.m12.d13:meMA.Ode8C11.mode	@ltx/en_us_goadedes/miscellanea:misc.Mode4
ltx/en_us_goadedes/me.m12.d13:meMA.Ode8C11.ode	@ltx/en_us_goadedes/miscellanea:misc.Ode8
ltx/en_us_goadedes/me.m12.d13:meMA.Ode8C11.text	
ltx/en_us_goadedes/me.m12.d13:meMA.Ode8C12.incipit	…
ltx/en_us_goadedes/me.m12.d13:meMA.Ode8C12.melody	@ltx/en_us_goadedes/he.h.m4:heHE.CheirasEkpetasasDaniil.name
ltx/en_us_goadedes/me.m12.d13:meMA.Ode8C12.mode	@ltx/en_us_goadedes/miscellanea:misc.Mode4
ltx/en_us_goadedes/me.m12.d13:meMA.Ode8C12.ode	@ltx/en_us_goadedes/miscellanea:misc.Ode8
ltx/en_us_goadedes/me.m12.d13:meMA.Ode8C12.text	
ltx/en_us_goadedes/me.m12.d13:meMA.Ode8C13.incipit	…
ltx/en_us_goadedes/me.m12.d13:meMA.Ode8C13.melody	@ltx/en_us_goadedes/he.h.m4:heHE.CheirasEkpetasasDaniil.name
ltx/en_us_goadedes/me.m12.d13:meMA.Ode8C13.mode	@ltx/en_us_goadedes/miscellanea:misc.Mode4
ltx/en_us_goadedes/me.m12.d13:meMA.Ode8C13.ode	@ltx/en_us_goadedes/miscellanea:misc.Ode8
ltx/en_us_goadedes/me.m12.d13:meMA.Ode8C13.text	
ltx/en_us_goadedes/me.m12.d13:meMA.Ode8C14.incipit	…
ltx/en_us_goadedes/me.m12.d13:meMA.Ode8C14.melody	@ltx/en_us_goadedes/he.h.m4:heHE.CheirasEkpetasasDaniil.name
ltx/en_us_goadedes/me.m12.d13:meMA.Ode8C14.mode	@ltx/en_us_goadedes/miscellanea:misc.Mode4
ltx/en_us_goadedes/me.m12.d13:meMA.Ode8C14.ode	@ltx/en_us_goadedes/miscellanea:misc.Ode8
ltx/en_us_goadedes/me.m12.d13:meMA.Ode8C14.text	
ltx/en_us_goadedes/me.m12.d13:meMA.Ode8C15.incipit	…
ltx/en_us_goadedes/me.m12.d13:meMA.Ode8C15.melody	@ltx/en_us_goadedes/he.h.m4:heHE.CheirasEkpetasasDaniil.name
ltx/en_us_goadedes/me.m12.d13:meMA.Ode8C15.mode	@ltx/en_us_goadedes/miscellanea:misc.Mode4
ltx/en_us_goadedes/me.m12.d13:meMA.Ode8C15.ode	@ltx/en_us_goadedes/miscellanea:misc.Ode8
ltx/en_us_goadedes/me.m12.d13:meMA.Ode8C15.text	
ltx/en_us_goadedes/me.m12.d13:meMA.Ode8C1T.incipit	…
ltx/en_us_goadedes/me.m12.d13:meMA.Ode8C1T.melody	@ltx/en_us_goadedes/he.h.m4:heHE.CheirasEkpetasasDaniil.name
ltx/en_us_goadedes/me.m12.d13:meMA.Ode8C1T.mode	@ltx/en_us_goadedes/miscellanea:misc.Mode4
ltx/en_us_goadedes/me.m12.d13:meMA.Ode8C1T.ode	@ltx/en_us_goadedes/miscellanea:misc.Ode8
ltx/en_us_goadedes/me.m12.d13:meMA.Ode8C1T.text	
ltx/en_us_goadedes/me.m12.d13:meMA.Ode8H.greekmelody	@ltx/en_us_goadedes/he.h.m4:heHE.CheirasEkpetasasDaniil.greekname
ltx/en_us_goadedes/me.m12.d13:meMA.Ode8H.incipit	@ltx/en_us_goadedes/he.h.m4:heHE.CheirasEkpetasasDaniil.incipit
ltx/en_us_goadedes/me.m12.d13:meMA.Ode8H.melody	@ltx/en_us_goadedes/he.h.m4:heHE.CheirasEkpetasasDaniil.melody
ltx/en_us_goadedes/me.m12.d13:meMA.Ode8H.mode	@ltx/en_us_goadedes/miscellanea:misc.Mode4
ltx/en_us_goadedes/me.m12.d13:meMA.Ode8H.ode	@ltx/en_us_goadedes/miscellanea:misc.Ode8
ltx/en_us_goadedes/me.m12.d13:meMA.Ode8H.text	@ltx/en_us_goadedes/he.h.m4:heHE.CheirasEkpetasasDaniil.text
ltx/en_us_goadedes/me.m12.d13:meMA.Ode9C11.greekmelody	@ltx/en_us_goadedes/he.h.m4:heHE.LithosAcheirotmitos.greekname
ltx/en_us_goadedes/me.m12.d13:meMA.Ode9C11.incipit	…
ltx/en_us_goadedes/me.m12.d13:meMA.Ode9C11.melody	@ltx/en_us_goadedes/he.h.m4:heHE.LithosAcheirotmitos.name
ltx/en_us_goadedes/me.m12.d13:meMA.Ode9C11.mode	@ltx/en_us_goadedes/miscellanea:misc.Mode4
ltx/en_us_goadedes/me.m12.d13:meMA.Ode9C11.ode	@ltx/en_us_goadedes/miscellanea:misc.Ode9
ltx/en_us_goadedes/me.m12.d13:meMA.Ode9C11.text	
ltx/en_us_goadedes/me.m12.d13:meMA.Ode9C12.incipit	…
ltx/en_us_goadedes/me.m12.d13:meMA.Ode9C12.melody	@ltx/en_us_goadedes/he.h.m4:heHE.LithosAcheirotmitos.name
ltx/en_us_goadedes/me.m12.d13:meMA.Ode9C12.mode	@ltx/en_us_goadedes/miscellanea:misc.Mode4
ltx/en_us_goadedes/me.m12.d13:meMA.Ode9C12.ode	@ltx/en_us_goadedes/miscellanea:misc.Ode9
ltx/en_us_goadedes/me.m12.d13:meMA.Ode9C12.text	
ltx/en_us_goadedes/me.m12.d13:meMA.Ode9C13.incipit	…
ltx/en_us_goadedes/me.m12.d13:meMA.Ode9C13.melody	@ltx/en_us_goadedes/he.h.m4:heHE.LithosAcheirotmitos.name
ltx/en_us_goadedes/me.m12.d13:meMA.Ode9C13.mode	@ltx/en_us_goadedes/miscellanea:misc.Mode4
ltx/en_us_goadedes/me.m12.d13:meMA.Ode9C13.ode	@ltx/en_us_goadedes/miscellanea:misc.Ode9
ltx/en_us_goadedes/me.m12.d13:meMA.Ode9C13.text	
ltx/en_us_goadedes/me.m12.d13:meMA.Ode9C14.incipit	…
ltx/en_us_goadedes/me.m12.d13:meMA.Ode9C14.melody	@ltx/en_us_goadedes/he.h.m4:heHE.LithosAcheirotmitos.name
ltx/en_us_goadedes/me.m12.d13:meMA.Ode9C14.mode	@ltx/en_us_goadedes/miscellanea:misc.Mode4
ltx/en_us_goadedes/me.m12.d13:meMA.Ode9C14.ode	@ltx/en_us_goadedes/miscellanea:misc.Ode9
ltx/en_us_goadedes/me.m12.d13:meMA.Ode9C14.text	
ltx/en_us_goadedes/me.m12.d13:meMA.Ode9C15.incipit	…
ltx/en_us_goadedes/me.m12.d13:meMA.Ode9C15.melody	@ltx/en_us_goadedes/he.h.m4:heHE.LithosAcheirotmitos.name
ltx/en_us_goadedes/me.m12.d13:meMA.Ode9C15.mode	@ltx/en_us_goadedes/miscellanea:misc.Mode4
ltx/en_us_goadedes/me.m12.d13:meMA.Ode9C15.ode	@ltx/en_us_goadedes/miscellanea:misc.Ode9
ltx/en_us_goadedes/me.m12.d13:meMA.Ode9C15.text	
ltx/en_us_goadedes/me.m12.d13:meMA.Ode9C1T.incipit	…
ltx/en_us_goadedes/me.m12.d13:meMA.Ode9C1T.melody	@ltx/en_us_goadedes/he.h.m4:heHE.LithosAcheirotmitos.name
ltx/en_us_goadedes/me.m12.d13:meMA.Ode9C1T.mode	@ltx/en_us_goadedes/miscellanea:misc.Mode4
ltx/en_us_goadedes/me.m12.d13:meMA.Ode9C1T.ode	@ltx/en_us_goadedes/miscellanea:misc.Ode9
ltx/en_us_goadedes/me.m12.d13:meMA.Ode9C1T.text	
ltx/en_us_goadedes/me.m12.d13:meMA.Ode9H.greekmelody	@ltx/en_us_goadedes/he.h.m4:heHE.LithosAcheirotmitos.greekname
ltx/en_us_goadedes/me.m12.d13:meMA.Ode9H.incipit	@ltx/en_us_goadedes/he.h.m4:heHE.LithosAcheirotmitos.incipit
ltx/en_us_goadedes/me.m12.d13:meMA.Ode9H.melody	@ltx/en_us_goadedes/he.h.m4:heHE.LithosAcheirotmitos.melody
ltx/en_us_goadedes/me.m12.d13:meMA.Ode9H.mode	@ltx/en_us_goadedes/miscellanea:misc.Mode4
ltx/en_us_goadedes/me.m12.d13:meMA.Ode9H.ode	@ltx/en_us_goadedes/miscellanea:misc.Ode9
ltx/en_us_goadedes/me.m12.d13:meMA.Ode9H.text	@ltx/en_us_goadedes/he.h.m4:heHE.LithosAcheirotmitos.text
ltx/en_us_goadedes/me.m12.d13:meMA.Oikos1.text	
ltx/en_us_goadedes/me.m12.d13:meVE.Apolytikion1ger.greekmelody	@ltx/en_us_goadedes/he.a.m4:heAU.OYpsotheisEnToStavro.greekname
ltx/en_us_goadedes/me.m12.d13:meVE.Apolytikion1ger.incipit	…
ltx/en_us_goadedes/me.m12.d13:meVE.Apolytikion1ger.melody	@ltx/en_us_goadedes/he.a.m4:heAU.OYpsotheisEnToStavro.name
ltx/en_us_goadedes/me.m12.d13:meVE.Apolytikion1ger.mode	@ltx/en_us_goadedes/miscellanea:misc.Mode4
ltx/en_us_goadedes/me.m12.d13:meVE.Apolytikion1ger.poet	@ltx/en_us_goadedes/poets:po.Gerasimou
ltx/en_us_goadedes/me.m12.d13:meVE.Apolytikion1ger.text	
ltx/en_us_goadedes/me.m12.d13:meVE.Apolytikion2ger.greekmelody	@ltx/en_us_goadedes/he.a.m5:heAU.TonSynanarchonLogon.greekname
ltx/en_us_goadedes/me.m12.d13:meVE.Apolytikion2ger.incipit	…
ltx/en_us_goadedes/me.m12.d13:meVE.Apolytikion2ger.melody	@ltx/en_us_goadedes/he.a.m5:heAU.TonSynanarchonLogon.name
ltx/en_us_goadedes/me.m12.d13:meVE.Apolytikion2ger.mode	@ltx/en_us_goadedes/miscellanea:misc.Mode5
ltx/en_us_goadedes/me.m12.d13:meVE.Apolytikion2ger.poet	@ltx/en_us_goadedes/poets:po.Gerasimou
ltx/en_us_goadedes/me.m12.d13:meVE.Apolytikion2ger.text	
ltx/en_us_goadedes/me.m12.d13:meVE.AposGlory.incipit	…
ltx/en_us_goadedes/me.m12.d13:meVE.AposGlory.melody	
ltx/en_us_goadedes/me.m12.d13:meVE.AposGlory.mode	@ltx/en_us_goadedes/miscellanea:misc.Mode5
ltx/en_us_goadedes/me.m12.d13:meVE.AposGlory.text	
ltx/en_us_goadedes/me.m12.d13:meVE.AposStavrotheotokion.incipit	…
ltx/en_us_goadedes/me.m12.d13:meVE.AposStavrotheotokion.melody	
ltx/en_us_goadedes/me.m12.d13:meVE.AposStavrotheotokion.mode	@ltx/en_us_goadedes/miscellanea:misc.Mode5
ltx/en_us_goadedes/me.m12.d13:meVE.AposStavrotheotokion.text	
ltx/en_us_goadedes/me.m12.d13:meVE.AposTheotokion.incipit	…
ltx/en_us_goadedes/me.m12.d13:meVE.AposTheotokion.melody	
ltx/en_us_goadedes/me.m12.d13:meVE.AposTheotokion.mode	@ltx/en_us_goadedes/miscellanea:misc.Mode5
ltx/en_us_goadedes/me.m12.d13:meVE.AposTheotokion.text	
ltx/en_us_goadedes/me.m12.d13:meVE.Aposticha1.greekmelody	@ltx/en_us_goadedes/he.a.m1:heAU.TonOuranionTagmaton.greekname
ltx/en_us_goadedes/me.m12.d13:meVE.Aposticha1.incipit	…
ltx/en_us_goadedes/me.m12.d13:meVE.Aposticha1.melody	@ltx/en_us_goadedes/he.a.m1:heAU.TonOuranionTagmaton.name
ltx/en_us_goadedes/me.m12.d13:meVE.Aposticha1.mode	@ltx/en_us_goadedes/miscellanea:misc.Mode1
ltx/en_us_goadedes/me.m12.d13:meVE.Aposticha1.text	
ltx/en_us_goadedes/me.m12.d13:meVE.Aposticha2.incipit	…
ltx/en_us_goadedes/me.m12.d13:meVE.Aposticha2.melody	@ltx/en_us_goadedes/he.a.m1:heAU.TonOuranionTagmaton.name
ltx/en_us_goadedes/me.m12.d13:meVE.Aposticha2.mode	@ltx/en_us_goadedes/miscellanea:misc.Mode1
ltx/en_us_goadedes/me.m12.d13:meVE.Aposticha2.text	
ltx/en_us_goadedes/me.m12.d13:meVE.Aposticha3.incipit	…
ltx/en_us_goadedes/me.m12.d13:meVE.Aposticha3.melody	@ltx/en_us_goadedes/he.a.m1:heAU.TonOuranionTagmaton.name
ltx/en_us_goadedes/me.m12.d13:meVE.Aposticha3.mode	@ltx/en_us_goadedes/miscellanea:misc.Mode1
ltx/en_us_goadedes/me.m12.d13:meVE.Aposticha3.text	
ltx/en_us_goadedes/me.m12.d13:meVE.SticGlory.incipit	…
ltx/en_us_goadedes/me.m12.d13:meVE.SticGlory.melody	
ltx/en_us_goadedes/me.m12.d13:meVE.SticGlory.mode	@ltx/en_us_goadedes/miscellanea:misc.Mode6
ltx/en_us_goadedes/me.m12.d13:meVE.SticGlory.text	
ltx/en_us_goadedes/me.m12.d13:meVE.SticStavrotheotokion.greekmelody	@ltx/en_us_goadedes/he.a.m6:heAU.TriimerosAnestis.greekname
ltx/en_us_goadedes/me.m12.d13:meVE.SticStavrotheotokion.incipit	@ltx/en_us_goadedes/me.m01.d16:meVE.SticStavrotheotokion.incipit
ltx/en_us_goadedes/me.m12.d13:meVE.SticStavrotheotokion.melody	@ltx/en_us_goadedes/he.a.m6:heAU.TriimerosAnestis.name
ltx/en_us_goadedes/me.m12.d13:meVE.SticStavrotheotokion.mode	@ltx/en_us_goadedes/miscellanea:misc.Mode6
ltx/en_us_goadedes/me.m12.d13:meVE.SticStavrotheotokion.text	@ltx/en_us_goadedes/me.m01.d16:meVE.SticStavrotheotokion.text
ltx/en_us_goadedes/me.m12.d13:meVE.SticTheotokion.incipit	@ltx/en_us_goadedes/oc.m6.d3:ocMA.AposTheotokion.incipit
ltx/en_us_goadedes/me.m12.d13:meVE.SticTheotokion.melody	
ltx/en_us_goadedes/me.m12.d13:meVE.SticTheotokion.mode	@ltx/en_us_goadedes/miscellanea:misc.Mode6
ltx/en_us_goadedes/me.m12.d13:meVE.SticTheotokion.text	@ltx/en_us_goadedes/oc.m6.d3:ocMA.AposTheotokion.text
ltx/en_us_goadedes/me.m12.d13:meVE.Stichera01.greekmelody	@ltx/en_us_goadedes/he.a.m4:heAU.EdokasSimeiosin.greekname
ltx/en_us_goadedes/me.m12.d13:meVE.Stichera01.incipit	…
ltx/en_us_goadedes/me.m12.d13:meVE.Stichera01.melody	@ltx/en_us_goadedes/he.a.m4:heAU.EdokasSimeiosin.name
ltx/en_us_goadedes/me.m12.d13:meVE.Stichera01.mode	@ltx/en_us_goadedes/miscellanea:misc.Mode4
ltx/en_us_goadedes/me.m12.d13:meVE.Stichera01.text	
ltx/en_us_goadedes/me.m12.d13:meVE.Stichera02.incipit	…
ltx/en_us_goadedes/me.m12.d13:meVE.Stichera02.melody	@ltx/en_us_goadedes/he.a.m4:heAU.EdokasSimeiosin.name
ltx/en_us_goadedes/me.m12.d13:meVE.Stichera02.mode	@ltx/en_us_goadedes/miscellanea:misc.Mode4
ltx/en_us_goadedes/me.m12.d13:meVE.Stichera02.text	
ltx/en_us_goadedes/me.m12.d13:meVE.Stichera03.incipit	…
ltx/en_us_goadedes/me.m12.d13:meVE.Stichera03.melody	@ltx/en_us_goadedes/he.a.m4:heAU.EdokasSimeiosin.name
ltx/en_us_goadedes/me.m12.d13:meVE.Stichera03.mode	@ltx/en_us_goadedes/miscellanea:misc.Mode4
ltx/en_us_goadedes/me.m12.d13:meVE.Stichera03.text	
ltx/en_us_goadedes/me.m12.d13:meVE.Stichera04.greekmelody	@ltx/en_us_goadedes/he.a.m4:heAU.OsGennaionEnMartysi.greekname
ltx/en_us_goadedes/me.m12.d13:meVE.Stichera04.incipit	…
ltx/en_us_goadedes/me.m12.d13:meVE.Stichera04.melody	@ltx/en_us_goadedes/he.a.m4:heAU.OsGennaionEnMartysi.name
ltx/en_us_goadedes/me.m12.d13:meVE.Stichera04.mode	@ltx/en_us_goadedes/miscellanea:misc.Mode4
ltx/en_us_goadedes/me.m12.d13:meVE.Stichera04.text	
ltx/en_us_goadedes/me.m12.d13:meVE.Stichera05.incipit	…
ltx/en_us_goadedes/me.m12.d13:meVE.Stichera05.melody	@ltx/en_us_goadedes/he.a.m4:heAU.OsGennaionEnMartysi.name
ltx/en_us_goadedes/me.m12.d13:meVE.Stichera05.mode	@ltx/en_us_goadedes/miscellanea:misc.Mode4
ltx/en_us_goadedes/me.m12.d13:meVE.Stichera05.text	
ltx/en_us_goadedes/me.m12.d13:meVE.Stichera06.incipit	…
ltx/en_us_goadedes/me.m12.d13:meVE.Stichera06.melody	@ltx/en_us_goadedes/he.a.m4:heAU.OsGennaionEnMartysi.name
ltx/en_us_goadedes/me.m12.d13:meVE.Stichera06.mode	@ltx/en_us_goadedes/miscellanea:misc.Mode4
ltx/en_us_goadedes/me.m12.d13:meVE.Stichera06.text	
