ltx/en_us_goadedes/me.m11.d02:meDA.commemoration.first	
ltx/en_us_goadedes/me.m11.d02:meDA.commemoration.first_name	
ltx/en_us_goadedes/me.m11.d02:meDA.commemoration.first_short	
ltx/en_us_goadedes/me.m11.d02:meDA.commemoration.first_title	@ltx/en_us_goadedes/titles:ti.Saints
ltx/en_us_goadedes/me.m11.d02:meDA.commemoration.full	
ltx/en_us_goadedes/me.m11.d02:meDA.commemoration.second_name	
ltx/en_us_goadedes/me.m11.d02:meDA.commemoration.second_title	
ltx/en_us_goadedes/me.m11.d02:meDA.date	
ltx/en_us_goadedes/me.m11.d02:meDA.fordate	
ltx/en_us_goadedes/me.m11.d02:meDA.insert1	
ltx/en_us_goadedes/me.m11.d02:meDA.insert2	
ltx/en_us_goadedes/me.m11.d02:meDA.note	
ltx/en_us_goadedes/me.m11.d02:meDA.pdfcoverdate	
ltx/en_us_goadedes/me.m11.d02:meDA.pdfheaderdate	
ltx/en_us_goadedes/me.m11.d02:meHO.commemorations	
ltx/en_us_goadedes/me.m11.d02:meHO.note1	
ltx/en_us_goadedes/me.m11.d02:meHO.note2	
ltx/en_us_goadedes/me.m11.d02:meHO.number	
ltx/en_us_goadedes/me.m11.d02:meHO.rank	
ltx/en_us_goadedes/me.m11.d02:meLE.commemoration1	
ltx/en_us_goadedes/me.m11.d02:meLE.commemoration2	
ltx/en_us_goadedes/me.m11.d02:meLI.Kontakion1.greekmelody	@ltx/en_us_goadedes/me.m11.d02:meMA.Kontakion1.greekmelody
ltx/en_us_goadedes/me.m11.d02:meLI.Kontakion1.incipit	@ltx/en_us_goadedes/me.m11.d02:meMA.Kontakion1.incipit
ltx/en_us_goadedes/me.m11.d02:meLI.Kontakion1.melody	@ltx/en_us_goadedes/me.m11.d02:meMA.Kontakion1.melody
ltx/en_us_goadedes/me.m11.d02:meLI.Kontakion1.mode	@ltx/en_us_goadedes/me.m11.d02:meMA.Kontakion1.mode
ltx/en_us_goadedes/me.m11.d02:meLI.Kontakion1.text	@ltx/en_us_goadedes/me.m11.d02:meMA.Kontakion1.text
ltx/en_us_goadedes/me.m11.d02:meLI.Megalynarion.text	
ltx/en_us_goadedes/me.m11.d02:meMA.AposGlory.incipit	…
ltx/en_us_goadedes/me.m11.d02:meMA.AposGlory.melody	
ltx/en_us_goadedes/me.m11.d02:meMA.AposGlory.mode	@ltx/en_us_goadedes/miscellanea:misc.Mode4
ltx/en_us_goadedes/me.m11.d02:meMA.AposGlory.text	
ltx/en_us_goadedes/me.m11.d02:meMA.AposStavrotheotokion.greekmelody	@ltx/en_us_goadedes/he.a.m4:heAU.OsGennaionEnMartysi.greekname
ltx/en_us_goadedes/me.m11.d02:meMA.AposStavrotheotokion.incipit	@ltx/en_us_goadedes/me.m02.d27:meVE.SticStavrotheotokion.incipit
ltx/en_us_goadedes/me.m11.d02:meMA.AposStavrotheotokion.melody	@ltx/en_us_goadedes/he.a.m4:heAU.OsGennaionEnMartysi.name
ltx/en_us_goadedes/me.m11.d02:meMA.AposStavrotheotokion.mode	@ltx/en_us_goadedes/miscellanea:misc.Mode4
ltx/en_us_goadedes/me.m11.d02:meMA.AposStavrotheotokion.text	@ltx/en_us_goadedes/me.m02.d27:meVE.SticStavrotheotokion.text
ltx/en_us_goadedes/me.m11.d02:meMA.AposTheotokion.greekmelody	@ltx/en_us_goadedes/he.a.m4:heAU.OsGennaionEnMartysi.greekname
ltx/en_us_goadedes/me.m11.d02:meMA.AposTheotokion.incipit	@ltx/en_us_goadedes/me.m06.d02:meVE.SticTheotokion.incipit
ltx/en_us_goadedes/me.m11.d02:meMA.AposTheotokion.melody	@ltx/en_us_goadedes/he.a.m4:heAU.OsGennaionEnMartysi.name
ltx/en_us_goadedes/me.m11.d02:meMA.AposTheotokion.mode	@ltx/en_us_goadedes/miscellanea:misc.Mode4
ltx/en_us_goadedes/me.m11.d02:meMA.AposTheotokion.text	@ltx/en_us_goadedes/me.m06.d02:meVE.SticTheotokion.text
ltx/en_us_goadedes/me.m11.d02:meMA.Aposticha4.incipit	With your body dyed red…
ltx/en_us_goadedes/me.m11.d02:meMA.Aposticha4.melody	
ltx/en_us_goadedes/me.m11.d02:meMA.Aposticha4.mode	@ltx/en_us_goadedes/miscellanea:misc.Mode2
ltx/en_us_goadedes/me.m11.d02:meMA.Aposticha4.text	With your body dyed red in the streams of your blood, you unhazardously proceeded down the path of martyrdom, O medaled martyr Acindynos. Girded as your were with divine strength, you broke the devices of the enemy. And now you intercede with Christ God on our behalf, entreating Him to save our souls.
ltx/en_us_goadedes/me.m11.d02:meMA.C1.acrostic.notice1	
ltx/en_us_goadedes/me.m11.d02:meMA.C1.acrostic.text	
ltx/en_us_goadedes/me.m11.d02:meMA.C1.acrostic.title	
ltx/en_us_goadedes/me.m11.d02:meMA.C1.poet	@ltx/en_us_goadedes/poets:po.Theofanous
ltx/en_us_goadedes/me.m11.d02:meMA.C1.title	@ltx/en_us_goadedes/titles:ti.CanonSaints
ltx/en_us_goadedes/me.m11.d02:meMA.C1.verse	@ltx/en_us_goadedes/prayers:pr.verse_SaintsM.text
ltx/en_us_goadedes/me.m11.d02:meMA.ExapTheotokion.incipit	…
ltx/en_us_goadedes/me.m11.d02:meMA.ExapTheotokion.melody	@ltx/en_us_goadedes/he.a.m2:heAU.GynaikesAkoutisthite.name
ltx/en_us_goadedes/me.m11.d02:meMA.ExapTheotokion.mode	@ltx/en_us_goadedes/miscellanea:misc.Mode2
ltx/en_us_goadedes/me.m11.d02:meMA.ExapTheotokion.text	
ltx/en_us_goadedes/me.m11.d02:meMA.Exaposteilarion1.greekmelody	@ltx/en_us_goadedes/he.a.m2:heAU.GynaikesAkoutisthite.greekname
ltx/en_us_goadedes/me.m11.d02:meMA.Exaposteilarion1.incipit	…
ltx/en_us_goadedes/me.m11.d02:meMA.Exaposteilarion1.melody	@ltx/en_us_goadedes/he.a.m2:heAU.GynaikesAkoutisthite.name
ltx/en_us_goadedes/me.m11.d02:meMA.Exaposteilarion1.mode	@ltx/en_us_goadedes/miscellanea:misc.Mode2
ltx/en_us_goadedes/me.m11.d02:meMA.Exaposteilarion1.text	
ltx/en_us_goadedes/me.m11.d02:meMA.Kathisma11.greekmelody	@ltx/en_us_goadedes/he.a.m1:heAU.TonTafonSouSotir.greekname
ltx/en_us_goadedes/me.m11.d02:meMA.Kathisma11.incipit	Today let us extol…
ltx/en_us_goadedes/me.m11.d02:meMA.Kathisma11.melody	@ltx/en_us_goadedes/he.a.m1:heAU.TonTafonSouSotir.name
ltx/en_us_goadedes/me.m11.d02:meMA.Kathisma11.mode	@ltx/en_us_goadedes/miscellanea:misc.Mode1
ltx/en_us_goadedes/me.m11.d02:meMA.Kathisma11.text	Today let us extol holy Elpidophoros, * Acindynos as well, and Pegasios also, * and holy Aphthonios and divine Anempodistos. * They competed well against the tyrants as martyrs. * They dispelled the gloom of godless pagan religion. * The faithful now honor them.
ltx/en_us_goadedes/me.m11.d02:meMA.Kathisma1T.incipit	@ltx/en_us_goadedes/oc.m1.d1:ocMA.Kathisma13.incipit
ltx/en_us_goadedes/me.m11.d02:meMA.Kathisma1T.melody	@ltx/en_us_goadedes/he.a.m1:heAU.TonTafonSouSotir.name
ltx/en_us_goadedes/me.m11.d02:meMA.Kathisma1T.mode	@ltx/en_us_goadedes/miscellanea:misc.Mode1
ltx/en_us_goadedes/me.m11.d02:meMA.Kathisma1T.text	@ltx/en_us_goadedes/oc.m1.d1:ocMA.Kathisma13.text
ltx/en_us_goadedes/me.m11.d02:meMA.Kathisma21.greekmelody	@ltx/en_us_goadedes/he.a.m4:heAU.TachyProkatalave.greekname
ltx/en_us_goadedes/me.m11.d02:meMA.Kathisma21.incipit	The choir of martyr Saints…
ltx/en_us_goadedes/me.m11.d02:meMA.Kathisma21.melody	@ltx/en_us_goadedes/he.a.m4:heAU.TachyProkatalave.name
ltx/en_us_goadedes/me.m11.d02:meMA.Kathisma21.mode	@ltx/en_us_goadedes/miscellanea:misc.Mode4
ltx/en_us_goadedes/me.m11.d02:meMA.Kathisma21.text	The choir of martyr Saints that was assembled by God * invites us to celebrate their sacred feast now with joy * and sing of their miracles. * They were invigorated by the might of the Most High; * thus for their Maker’s glory and in tribute to faith in Him, * they performed many wonderful feats in their martyrdom.
ltx/en_us_goadedes/me.m11.d02:meMA.Kathisma2T.incipit	@ltx/en_us_goadedes/he.a.m4:heAU.TachyProkatalave.incipit
ltx/en_us_goadedes/me.m11.d02:meMA.Kathisma2T.melody	@ltx/en_us_goadedes/he.a.m4:heAU.TachyProkatalave.melody
ltx/en_us_goadedes/me.m11.d02:meMA.Kathisma2T.mode	@ltx/en_us_goadedes/miscellanea:misc.Mode4
ltx/en_us_goadedes/me.m11.d02:meMA.Kathisma2T.text	@ltx/en_us_goadedes/he.a.m4:heAU.TachyProkatalave.text
ltx/en_us_goadedes/me.m11.d02:meMA.Kathisma31.greekmelody	@ltx/en_us_goadedes/he.a.m5:heAU.TonSynanarchonLogon.greekname
ltx/en_us_goadedes/me.m11.d02:meMA.Kathisma31.incipit	…
ltx/en_us_goadedes/me.m11.d02:meMA.Kathisma31.melody	@ltx/en_us_goadedes/he.a.m5:heAU.TonSynanarchonLogon.name
ltx/en_us_goadedes/me.m11.d02:meMA.Kathisma31.mode	@ltx/en_us_goadedes/miscellanea:misc.Mode5
ltx/en_us_goadedes/me.m11.d02:meMA.Kathisma31.text	All aflame with a love for correct belief in God, * you brought down the delusions of Persian king Shapur; * and you were not afraid when he interrogated you, * but rather you attracted many to believe the truth of Christ, * O God-bearing holy Martyrs * Pegasios and Anempodistos * and godly-minded Acindynos.
ltx/en_us_goadedes/me.m11.d02:meMA.Kathisma3T.incipit	@ltx/en_us_goadedes/oc.m5.d3:ocVE.ApolTheotokionVM.incipit
ltx/en_us_goadedes/me.m11.d02:meMA.Kathisma3T.melody	@ltx/en_us_goadedes/he.a.m5:heAU.TonSynanarchonLogon.name
ltx/en_us_goadedes/me.m11.d02:meMA.Kathisma3T.mode	@ltx/en_us_goadedes/miscellanea:misc.Mode5
ltx/en_us_goadedes/me.m11.d02:meMA.Kathisma3T.text	@ltx/en_us_goadedes/oc.m5.d3:ocVE.ApolTheotokionVM.text
ltx/en_us_goadedes/me.m11.d02:meMA.Kontakion1.greekmelody	@ltx/en_us_goadedes/he.a.m4:heAU.OYpsotheisEnToStavro.greekname
ltx/en_us_goadedes/me.m11.d02:meMA.Kontakion1.incipit	…
ltx/en_us_goadedes/me.m11.d02:meMA.Kontakion1.melody	@ltx/en_us_goadedes/he.a.m4:heAU.OYpsotheisEnToStavro.name
ltx/en_us_goadedes/me.m11.d02:meMA.Kontakion1.mode	@ltx/en_us_goadedes/miscellanea:misc.Mode4
ltx/en_us_goadedes/me.m11.d02:meMA.Kontakion1.text	
ltx/en_us_goadedes/me.m11.d02:meMA.Lauds1.greekmelody	@ltx/en_us_goadedes/he.a.m8:heAU.OTouParadoxou.greekname
ltx/en_us_goadedes/me.m11.d02:meMA.Lauds1.incipit	What a paradoxal miracle…
ltx/en_us_goadedes/me.m11.d02:meMA.Lauds1.melody	@ltx/en_us_goadedes/he.a.m8:heAU.OTouParadoxou.name
ltx/en_us_goadedes/me.m11.d02:meMA.Lauds1.mode	@ltx/en_us_goadedes/miscellanea:misc.Mode8
ltx/en_us_goadedes/me.m11.d02:meMA.Lauds1.text	What a paradoxal miracle! * For Anempodistos * and the great St. Acindynos * and the wise Pegasios, * bravely entered the contest of faith, * and they at once drew to Christianity * Elpidophoros and Afthonios. * They all competed well, * being fellow martyrs. By the grace of Christ, * being full of wisdom, they proclaimed the true faith in Him.
ltx/en_us_goadedes/me.m11.d02:meMA.Lauds2.incipit	What a paradoxal…
ltx/en_us_goadedes/me.m11.d02:meMA.Lauds2.melody	@ltx/en_us_goadedes/he.a.m8:heAU.OTouParadoxou.name
ltx/en_us_goadedes/me.m11.d02:meMA.Lauds2.mode	@ltx/en_us_goadedes/miscellanea:misc.Mode8
ltx/en_us_goadedes/me.m11.d02:meMA.Lauds2.text	What a paradoxal miracle! * How the victorious Saints * were so steadfast in martyrdom; * how they drew to faith in Christ * such a numerous multitude; * how they endured the painful dismemberment; * how they rejoiced together in martyrdom! * Even as they were thrown * into prison and finally burned to death, * by the grace of Christ, the Martyrs were unfaltering.
ltx/en_us_goadedes/me.m11.d02:meMA.Lauds3.incipit	Everyone in heaven…
ltx/en_us_goadedes/me.m11.d02:meMA.Lauds3.melody	@ltx/en_us_goadedes/he.a.m8:heAU.OTouParadoxou.name
ltx/en_us_goadedes/me.m11.d02:meMA.Lauds3.mode	@ltx/en_us_goadedes/miscellanea:misc.Mode8
ltx/en_us_goadedes/me.m11.d02:meMA.Lauds3.text	Everyone in heaven and on earth * is celebrating today, * and the orders of martyr saints * with the faithful Christians all * are together exultant in soul. * For the illustrious, solemn memory * of the all-holy Martyrs is here at last. * Come, fans of holidays, * see how Christ from heaven splendidly bestows * crowns of victory upon the holy Martyrs of Christ.
ltx/en_us_goadedes/me.m11.d02:meMA.LaudsGlory.incipit	In Shapur the Second’s kingdom…
ltx/en_us_goadedes/me.m11.d02:meMA.LaudsGlory.melody	
ltx/en_us_goadedes/me.m11.d02:meMA.LaudsGlory.mode	@ltx/en_us_goadedes/miscellanea:misc.Mode5
ltx/en_us_goadedes/me.m11.d02:meMA.LaudsGlory.text	In Shapur the Second’s kingdom, and the homeland of the Athletes, a marvelous wonder occurred. For there the brutal king tormented the Martyrs, whereas in heaven Christ cemented their martyrdom. At that time the famous Saints took part in the grueling ordeal, and now they ceaselessly sing the hymn of Sabaoth. The sea of godlessness has completely vanished, though it seemed interminable, whereas remaining intact is the blameless and divine faith of Emmanuel. O God, the One who is and ever was, at the entreaties of Your Saints, have mercy on us.
ltx/en_us_goadedes/me.m11.d02:meMA.Ode1C11.greekmelody	@ltx/en_us_goadedes/he.h.m4:heHE.AnoixoToStomaMou.greekname
ltx/en_us_goadedes/me.m11.d02:meMA.Ode1C11.incipit	…
ltx/en_us_goadedes/me.m11.d02:meMA.Ode1C11.melody	@ltx/en_us_goadedes/he.h.m4:heHE.AnoixoToStomaMou.name
ltx/en_us_goadedes/me.m11.d02:meMA.Ode1C11.mode	@ltx/en_us_goadedes/miscellanea:misc.Mode4
ltx/en_us_goadedes/me.m11.d02:meMA.Ode1C11.ode	@ltx/en_us_goadedes/miscellanea:misc.Ode1
ltx/en_us_goadedes/me.m11.d02:meMA.Ode1C11.text	
ltx/en_us_goadedes/me.m11.d02:meMA.Ode1C12.incipit	…
ltx/en_us_goadedes/me.m11.d02:meMA.Ode1C12.melody	@ltx/en_us_goadedes/he.h.m4:heHE.AnoixoToStomaMou.name
ltx/en_us_goadedes/me.m11.d02:meMA.Ode1C12.mode	@ltx/en_us_goadedes/miscellanea:misc.Mode4
ltx/en_us_goadedes/me.m11.d02:meMA.Ode1C12.ode	@ltx/en_us_goadedes/miscellanea:misc.Ode1
ltx/en_us_goadedes/me.m11.d02:meMA.Ode1C12.text	
ltx/en_us_goadedes/me.m11.d02:meMA.Ode1C13.incipit	…
ltx/en_us_goadedes/me.m11.d02:meMA.Ode1C13.melody	@ltx/en_us_goadedes/he.h.m4:heHE.AnoixoToStomaMou.name
ltx/en_us_goadedes/me.m11.d02:meMA.Ode1C13.mode	@ltx/en_us_goadedes/miscellanea:misc.Mode4
ltx/en_us_goadedes/me.m11.d02:meMA.Ode1C13.ode	@ltx/en_us_goadedes/miscellanea:misc.Ode1
ltx/en_us_goadedes/me.m11.d02:meMA.Ode1C13.text	
ltx/en_us_goadedes/me.m11.d02:meMA.Ode1C1T.incipit	…
ltx/en_us_goadedes/me.m11.d02:meMA.Ode1C1T.melody	@ltx/en_us_goadedes/he.h.m4:heHE.AnoixoToStomaMou.name
ltx/en_us_goadedes/me.m11.d02:meMA.Ode1C1T.mode	@ltx/en_us_goadedes/miscellanea:misc.Mode4
ltx/en_us_goadedes/me.m11.d02:meMA.Ode1C1T.ode	@ltx/en_us_goadedes/miscellanea:misc.Ode1
ltx/en_us_goadedes/me.m11.d02:meMA.Ode1C1T.text	
ltx/en_us_goadedes/me.m11.d02:meMA.Ode3C11.greekmelody	@ltx/en_us_goadedes/he.h.m4:heHE.OukEnSofia.greekname
ltx/en_us_goadedes/me.m11.d02:meMA.Ode3C11.incipit	When you were strengthened…
ltx/en_us_goadedes/me.m11.d02:meMA.Ode3C11.melody	@ltx/en_us_goadedes/he.h.m4:heHE.OukEnSofia.name
ltx/en_us_goadedes/me.m11.d02:meMA.Ode3C11.mode	@ltx/en_us_goadedes/miscellanea:misc.Mode4
ltx/en_us_goadedes/me.m11.d02:meMA.Ode3C11.ode	@ltx/en_us_goadedes/miscellanea:misc.Ode3
ltx/en_us_goadedes/me.m11.d02:meMA.Ode3C11.text	When you were strengthened * by the power of Christ, O most excellent * holy Athletes, with your mind * resolute, you competed and went * to heaven through fire and water of martyrdom.
ltx/en_us_goadedes/me.m11.d02:meMA.Ode3C12.incipit	Being encouraged…
ltx/en_us_goadedes/me.m11.d02:meMA.Ode3C12.melody	@ltx/en_us_goadedes/he.h.m4:heHE.OukEnSofia.name
ltx/en_us_goadedes/me.m11.d02:meMA.Ode3C12.mode	@ltx/en_us_goadedes/miscellanea:misc.Mode4
ltx/en_us_goadedes/me.m11.d02:meMA.Ode3C12.ode	@ltx/en_us_goadedes/miscellanea:misc.Ode3
ltx/en_us_goadedes/me.m11.d02:meMA.Ode3C12.text	Being encouraged * by the unyielding hope in the life to come, * you, O glorious quintet * of holy Martyrs of Christ our God, * with manful resolve disdained the present suffering.
ltx/en_us_goadedes/me.m11.d02:meMA.Ode3C13.incipit	O famous Martyrs,…
ltx/en_us_goadedes/me.m11.d02:meMA.Ode3C13.melody	@ltx/en_us_goadedes/he.h.m4:heHE.OukEnSofia.name
ltx/en_us_goadedes/me.m11.d02:meMA.Ode3C13.mode	@ltx/en_us_goadedes/miscellanea:misc.Mode4
ltx/en_us_goadedes/me.m11.d02:meMA.Ode3C13.ode	@ltx/en_us_goadedes/miscellanea:misc.Ode3
ltx/en_us_goadedes/me.m11.d02:meMA.Ode3C13.text	O famous Martyrs, * as you shared the beliefs of the Three Young Men, * and the Spirit’s whistling wind * surrounded you, you demonstrably * extinguished the fire of the Persians’ misbelief.
ltx/en_us_goadedes/me.m11.d02:meMA.Ode3C1T.incipit	O Theotokos…
ltx/en_us_goadedes/me.m11.d02:meMA.Ode3C1T.melody	@ltx/en_us_goadedes/he.h.m4:heHE.OukEnSofia.name
ltx/en_us_goadedes/me.m11.d02:meMA.Ode3C1T.mode	@ltx/en_us_goadedes/miscellanea:misc.Mode4
ltx/en_us_goadedes/me.m11.d02:meMA.Ode3C1T.ode	@ltx/en_us_goadedes/miscellanea:misc.Ode3
ltx/en_us_goadedes/me.m11.d02:meMA.Ode3C1T.text	O Theotokos, * we have you for unfaltering patronage; * and entrusting all our hopes * to you, O Mother of God, we are saved. * In you taking refuge, we are safe on every side.
ltx/en_us_goadedes/me.m11.d02:meMA.Ode3H.greekmelody	@ltx/en_us_goadedes/he.h.m4:heHE.OukEnSofia.greekname
ltx/en_us_goadedes/me.m11.d02:meMA.Ode3H.incipit	@ltx/en_us_goadedes/he.h.m4:heHE.OukEnSofia.incipit
ltx/en_us_goadedes/me.m11.d02:meMA.Ode3H.melody	@ltx/en_us_goadedes/he.h.m4:heHE.OukEnSofia.melody
ltx/en_us_goadedes/me.m11.d02:meMA.Ode3H.mode	@ltx/en_us_goadedes/miscellanea:misc.Mode4
ltx/en_us_goadedes/me.m11.d02:meMA.Ode3H.ode	@ltx/en_us_goadedes/miscellanea:misc.Ode3
ltx/en_us_goadedes/me.m11.d02:meMA.Ode3H.text	@ltx/en_us_goadedes/he.h.m4:heHE.OukEnSofia.text
ltx/en_us_goadedes/me.m11.d02:meMA.Ode3Kathisma1.greekmelody	@ltx/en_us_goadedes/he.a.m4:heAU.KateplagiIosif.greekname
ltx/en_us_goadedes/me.m11.d02:meMA.Ode3Kathisma1.incipit	…
ltx/en_us_goadedes/me.m11.d02:meMA.Ode3Kathisma1.melody	@ltx/en_us_goadedes/he.a.m4:heAU.KateplagiIosif.name
ltx/en_us_goadedes/me.m11.d02:meMA.Ode3Kathisma1.mode	@ltx/en_us_goadedes/miscellanea:misc.Mode4
ltx/en_us_goadedes/me.m11.d02:meMA.Ode3Kathisma1.text	
ltx/en_us_goadedes/me.m11.d02:meMA.Ode3Kathisma2.greekmelody	@ltx/en_us_goadedes/he.a.m8:heAU.TinSofianKaiLogon.greekname
ltx/en_us_goadedes/me.m11.d02:meMA.Ode3Kathisma2.incipit	…
ltx/en_us_goadedes/me.m11.d02:meMA.Ode3Kathisma2.melody	@ltx/en_us_goadedes/he.a.m8:heAU.TinSofianKaiLogon.name
ltx/en_us_goadedes/me.m11.d02:meMA.Ode3Kathisma2.mode	@ltx/en_us_goadedes/miscellanea:misc.Mode8
ltx/en_us_goadedes/me.m11.d02:meMA.Ode3Kathisma2.text	
ltx/en_us_goadedes/me.m11.d02:meMA.Ode3KathismaSt.incipit	@ltx/en_us_goadedes/oc.m8.d4:ocMA.Kathisma13.incipit
ltx/en_us_goadedes/me.m11.d02:meMA.Ode3KathismaSt.melody	@ltx/en_us_goadedes/he.a.m8:heAU.TinSofianKaiLogon.name
ltx/en_us_goadedes/me.m11.d02:meMA.Ode3KathismaSt.mode	@ltx/en_us_goadedes/miscellanea:misc.Mode8
ltx/en_us_goadedes/me.m11.d02:meMA.Ode3KathismaSt.text	@ltx/en_us_goadedes/oc.m8.d4:ocMA.Kathisma13.text
ltx/en_us_goadedes/me.m11.d02:meMA.Ode3KathismaT.incipit	@ltx/en_us_goadedes/he.a.m8:heAU.TinSofianKaiLogon.incipit
ltx/en_us_goadedes/me.m11.d02:meMA.Ode3KathismaT.melody	@ltx/en_us_goadedes/he.a.m8:heAU.TinSofianKaiLogon.melody
ltx/en_us_goadedes/me.m11.d02:meMA.Ode3KathismaT.mode	@ltx/en_us_goadedes/miscellanea:misc.Mode8
ltx/en_us_goadedes/me.m11.d02:meMA.Ode3KathismaT.text	@ltx/en_us_goadedes/he.a.m8:heAU.TinSofianKaiLogon.text
ltx/en_us_goadedes/me.m11.d02:meMA.Ode4C11.greekmelody	@ltx/en_us_goadedes/he.h.m4:heHE.OKathimenosEnDoxi.greekname
ltx/en_us_goadedes/me.m11.d02:meMA.Ode4C11.incipit	…
ltx/en_us_goadedes/me.m11.d02:meMA.Ode4C11.melody	@ltx/en_us_goadedes/he.h.m4:heHE.OKathimenosEnDoxi.name
ltx/en_us_goadedes/me.m11.d02:meMA.Ode4C11.mode	@ltx/en_us_goadedes/miscellanea:misc.Mode4
ltx/en_us_goadedes/me.m11.d02:meMA.Ode4C11.ode	@ltx/en_us_goadedes/miscellanea:misc.Ode4
ltx/en_us_goadedes/me.m11.d02:meMA.Ode4C11.text	
ltx/en_us_goadedes/me.m11.d02:meMA.Ode4C12.incipit	…
ltx/en_us_goadedes/me.m11.d02:meMA.Ode4C12.melody	@ltx/en_us_goadedes/he.h.m4:heHE.OKathimenosEnDoxi.name
ltx/en_us_goadedes/me.m11.d02:meMA.Ode4C12.mode	@ltx/en_us_goadedes/miscellanea:misc.Mode4
ltx/en_us_goadedes/me.m11.d02:meMA.Ode4C12.ode	@ltx/en_us_goadedes/miscellanea:misc.Ode4
ltx/en_us_goadedes/me.m11.d02:meMA.Ode4C12.text	
ltx/en_us_goadedes/me.m11.d02:meMA.Ode4C13.incipit	…
ltx/en_us_goadedes/me.m11.d02:meMA.Ode4C13.melody	@ltx/en_us_goadedes/he.h.m4:heHE.OKathimenosEnDoxi.name
ltx/en_us_goadedes/me.m11.d02:meMA.Ode4C13.mode	@ltx/en_us_goadedes/miscellanea:misc.Mode4
ltx/en_us_goadedes/me.m11.d02:meMA.Ode4C13.ode	@ltx/en_us_goadedes/miscellanea:misc.Ode4
ltx/en_us_goadedes/me.m11.d02:meMA.Ode4C13.text	
ltx/en_us_goadedes/me.m11.d02:meMA.Ode4C14.incipit	…
ltx/en_us_goadedes/me.m11.d02:meMA.Ode4C14.melody	@ltx/en_us_goadedes/he.h.m4:heHE.OKathimenosEnDoxi.name
ltx/en_us_goadedes/me.m11.d02:meMA.Ode4C14.mode	@ltx/en_us_goadedes/miscellanea:misc.Mode4
ltx/en_us_goadedes/me.m11.d02:meMA.Ode4C14.ode	@ltx/en_us_goadedes/miscellanea:misc.Ode4
ltx/en_us_goadedes/me.m11.d02:meMA.Ode4C14.text	
ltx/en_us_goadedes/me.m11.d02:meMA.Ode4C1T.incipit	…
ltx/en_us_goadedes/me.m11.d02:meMA.Ode4C1T.melody	@ltx/en_us_goadedes/he.h.m4:heHE.OKathimenosEnDoxi.name
ltx/en_us_goadedes/me.m11.d02:meMA.Ode4C1T.mode	@ltx/en_us_goadedes/miscellanea:misc.Mode4
ltx/en_us_goadedes/me.m11.d02:meMA.Ode4C1T.ode	@ltx/en_us_goadedes/miscellanea:misc.Ode4
ltx/en_us_goadedes/me.m11.d02:meMA.Ode4C1T.text	
ltx/en_us_goadedes/me.m11.d02:meMA.Ode5C11.greekmelody	@ltx/en_us_goadedes/he.h.m4:heHE.AseveisOukOpsontai.greekname
ltx/en_us_goadedes/me.m11.d02:meMA.Ode5C11.incipit	…
ltx/en_us_goadedes/me.m11.d02:meMA.Ode5C11.melody	@ltx/en_us_goadedes/he.h.m4:heHE.AseveisOukOpsontai.name
ltx/en_us_goadedes/me.m11.d02:meMA.Ode5C11.mode	@ltx/en_us_goadedes/miscellanea:misc.Mode4
ltx/en_us_goadedes/me.m11.d02:meMA.Ode5C11.ode	@ltx/en_us_goadedes/miscellanea:misc.Ode5
ltx/en_us_goadedes/me.m11.d02:meMA.Ode5C11.text	
ltx/en_us_goadedes/me.m11.d02:meMA.Ode5C12.incipit	…
ltx/en_us_goadedes/me.m11.d02:meMA.Ode5C12.melody	@ltx/en_us_goadedes/he.h.m4:heHE.AseveisOukOpsontai.name
ltx/en_us_goadedes/me.m11.d02:meMA.Ode5C12.mode	@ltx/en_us_goadedes/miscellanea:misc.Mode4
ltx/en_us_goadedes/me.m11.d02:meMA.Ode5C12.ode	@ltx/en_us_goadedes/miscellanea:misc.Ode5
ltx/en_us_goadedes/me.m11.d02:meMA.Ode5C12.text	
ltx/en_us_goadedes/me.m11.d02:meMA.Ode5C13.incipit	…
ltx/en_us_goadedes/me.m11.d02:meMA.Ode5C13.melody	@ltx/en_us_goadedes/he.h.m4:heHE.AseveisOukOpsontai.name
ltx/en_us_goadedes/me.m11.d02:meMA.Ode5C13.mode	@ltx/en_us_goadedes/miscellanea:misc.Mode4
ltx/en_us_goadedes/me.m11.d02:meMA.Ode5C13.ode	@ltx/en_us_goadedes/miscellanea:misc.Ode5
ltx/en_us_goadedes/me.m11.d02:meMA.Ode5C13.text	
ltx/en_us_goadedes/me.m11.d02:meMA.Ode5C14.incipit	…
ltx/en_us_goadedes/me.m11.d02:meMA.Ode5C14.melody	@ltx/en_us_goadedes/he.h.m4:heHE.AseveisOukOpsontai.name
ltx/en_us_goadedes/me.m11.d02:meMA.Ode5C14.mode	@ltx/en_us_goadedes/miscellanea:misc.Mode4
ltx/en_us_goadedes/me.m11.d02:meMA.Ode5C14.ode	@ltx/en_us_goadedes/miscellanea:misc.Ode5
ltx/en_us_goadedes/me.m11.d02:meMA.Ode5C14.text	
ltx/en_us_goadedes/me.m11.d02:meMA.Ode5C1T.incipit	…
ltx/en_us_goadedes/me.m11.d02:meMA.Ode5C1T.melody	@ltx/en_us_goadedes/he.h.m4:heHE.AseveisOukOpsontai.name
ltx/en_us_goadedes/me.m11.d02:meMA.Ode5C1T.mode	@ltx/en_us_goadedes/miscellanea:misc.Mode4
ltx/en_us_goadedes/me.m11.d02:meMA.Ode5C1T.ode	@ltx/en_us_goadedes/miscellanea:misc.Ode5
ltx/en_us_goadedes/me.m11.d02:meMA.Ode5C1T.text	
ltx/en_us_goadedes/me.m11.d02:meMA.Ode6C11.greekmelody	@ltx/en_us_goadedes/he.h.m4:heHE.ThysoSoiMetaFonis.greekname
ltx/en_us_goadedes/me.m11.d02:meMA.Ode6C11.incipit	Disdaining things…
ltx/en_us_goadedes/me.m11.d02:meMA.Ode6C11.melody	@ltx/en_us_goadedes/he.h.m4:heHE.ThysoSoiMetaFonis.name
ltx/en_us_goadedes/me.m11.d02:meMA.Ode6C11.mode	@ltx/en_us_goadedes/miscellanea:misc.Mode4
ltx/en_us_goadedes/me.m11.d02:meMA.Ode6C11.ode	@ltx/en_us_goadedes/miscellanea:misc.Ode6
ltx/en_us_goadedes/me.m11.d02:meMA.Ode6C11.text	Disdaining things that change, you were granted to see the things * that eternally remain. * Undefeated Martyrs, keep us from danger * and temptation, * for we are invoking you with ardent faith.
ltx/en_us_goadedes/me.m11.d02:meMA.Ode6C12.incipit	All-glorious Martyrs…
ltx/en_us_goadedes/me.m11.d02:meMA.Ode6C12.melody	@ltx/en_us_goadedes/he.h.m4:heHE.ThysoSoiMetaFonis.name
ltx/en_us_goadedes/me.m11.d02:meMA.Ode6C12.mode	@ltx/en_us_goadedes/miscellanea:misc.Mode4
ltx/en_us_goadedes/me.m11.d02:meMA.Ode6C12.ode	@ltx/en_us_goadedes/miscellanea:misc.Ode6
ltx/en_us_goadedes/me.m11.d02:meMA.Ode6C12.text	All-glorious Martyrs of the all-holy Trinity, * entreat the Lord with compassion, * to have all the innocent freed from prison, * and the faithful * from the bonds of their sins, by your holy prayers.
ltx/en_us_goadedes/me.m11.d02:meMA.Ode6C13.incipit	The brave men…
ltx/en_us_goadedes/me.m11.d02:meMA.Ode6C13.melody	@ltx/en_us_goadedes/he.h.m4:heHE.ThysoSoiMetaFonis.name
ltx/en_us_goadedes/me.m11.d02:meMA.Ode6C13.mode	@ltx/en_us_goadedes/miscellanea:misc.Mode4
ltx/en_us_goadedes/me.m11.d02:meMA.Ode6C13.ode	@ltx/en_us_goadedes/miscellanea:misc.Ode6
ltx/en_us_goadedes/me.m11.d02:meMA.Ode6C13.text	The brave men gave themselves up to death for the love of You, * O Christ my Lord and my Savior. * You gave them immortal life, and You made them * to be saviors * of those who are in trouble and need their help.
ltx/en_us_goadedes/me.m11.d02:meMA.Ode6C1T.incipit	O Virgin, I implore you…
ltx/en_us_goadedes/me.m11.d02:meMA.Ode6C1T.melody	@ltx/en_us_goadedes/he.h.m4:heHE.ThysoSoiMetaFonis.name
ltx/en_us_goadedes/me.m11.d02:meMA.Ode6C1T.mode	@ltx/en_us_goadedes/miscellanea:misc.Mode4
ltx/en_us_goadedes/me.m11.d02:meMA.Ode6C1T.ode	@ltx/en_us_goadedes/miscellanea:misc.Ode6
ltx/en_us_goadedes/me.m11.d02:meMA.Ode6C1T.text	O Virgin, I implore you to shred every record of * my many sins and to grant me * release from the passions and from the sorrow * that consumes me, * O Lady, and ever keep me safe and sound.
ltx/en_us_goadedes/me.m11.d02:meMA.Ode6H.greekmelody	@ltx/en_us_goadedes/he.h.m4:heHE.ThysoSoiMetaFonis.greekname
ltx/en_us_goadedes/me.m11.d02:meMA.Ode6H.incipit	@ltx/en_us_goadedes/he.h.m4:heHE.ThysoSoiMetaFonis.incipit
ltx/en_us_goadedes/me.m11.d02:meMA.Ode6H.melody	@ltx/en_us_goadedes/he.h.m4:heHE.ThysoSoiMetaFonis.melody
ltx/en_us_goadedes/me.m11.d02:meMA.Ode6H.mode	@ltx/en_us_goadedes/miscellanea:misc.Mode4
ltx/en_us_goadedes/me.m11.d02:meMA.Ode6H.ode	@ltx/en_us_goadedes/miscellanea:misc.Ode6
ltx/en_us_goadedes/me.m11.d02:meMA.Ode6H.text	@ltx/en_us_goadedes/he.h.m4:heHE.ThysoSoiMetaFonis.text
ltx/en_us_goadedes/me.m11.d02:meMA.Ode7C11.greekmelody	@ltx/en_us_goadedes/he.h.m4:heHE.ODiasosasEnPyri.greekname
ltx/en_us_goadedes/me.m11.d02:meMA.Ode7C11.incipit	…
ltx/en_us_goadedes/me.m11.d02:meMA.Ode7C11.melody	@ltx/en_us_goadedes/he.h.m4:heHE.ODiasosasEnPyri.name
ltx/en_us_goadedes/me.m11.d02:meMA.Ode7C11.mode	@ltx/en_us_goadedes/miscellanea:misc.Mode4
ltx/en_us_goadedes/me.m11.d02:meMA.Ode7C11.ode	@ltx/en_us_goadedes/miscellanea:misc.Ode7
ltx/en_us_goadedes/me.m11.d02:meMA.Ode7C11.text	
ltx/en_us_goadedes/me.m11.d02:meMA.Ode7C12.incipit	…
ltx/en_us_goadedes/me.m11.d02:meMA.Ode7C12.melody	@ltx/en_us_goadedes/he.h.m4:heHE.ODiasosasEnPyri.name
ltx/en_us_goadedes/me.m11.d02:meMA.Ode7C12.mode	@ltx/en_us_goadedes/miscellanea:misc.Mode4
ltx/en_us_goadedes/me.m11.d02:meMA.Ode7C12.ode	@ltx/en_us_goadedes/miscellanea:misc.Ode7
ltx/en_us_goadedes/me.m11.d02:meMA.Ode7C12.text	
ltx/en_us_goadedes/me.m11.d02:meMA.Ode7C13.incipit	…
ltx/en_us_goadedes/me.m11.d02:meMA.Ode7C13.melody	@ltx/en_us_goadedes/he.h.m4:heHE.ODiasosasEnPyri.name
ltx/en_us_goadedes/me.m11.d02:meMA.Ode7C13.mode	@ltx/en_us_goadedes/miscellanea:misc.Mode4
ltx/en_us_goadedes/me.m11.d02:meMA.Ode7C13.ode	@ltx/en_us_goadedes/miscellanea:misc.Ode7
ltx/en_us_goadedes/me.m11.d02:meMA.Ode7C13.text	
ltx/en_us_goadedes/me.m11.d02:meMA.Ode7C1T.incipit	…
ltx/en_us_goadedes/me.m11.d02:meMA.Ode7C1T.melody	@ltx/en_us_goadedes/he.h.m4:heHE.ODiasosasEnPyri.name
ltx/en_us_goadedes/me.m11.d02:meMA.Ode7C1T.mode	@ltx/en_us_goadedes/miscellanea:misc.Mode4
ltx/en_us_goadedes/me.m11.d02:meMA.Ode7C1T.ode	@ltx/en_us_goadedes/miscellanea:misc.Ode7
ltx/en_us_goadedes/me.m11.d02:meMA.Ode7C1T.text	
ltx/en_us_goadedes/me.m11.d02:meMA.Ode8C11.greekmelody	@ltx/en_us_goadedes/he.h.m4:heHE.PaidasEvageis.greekname
ltx/en_us_goadedes/me.m11.d02:meMA.Ode8C11.incipit	…
ltx/en_us_goadedes/me.m11.d02:meMA.Ode8C11.melody	@ltx/en_us_goadedes/he.h.m4:heHE.PaidasEvageis.name
ltx/en_us_goadedes/me.m11.d02:meMA.Ode8C11.mode	@ltx/en_us_goadedes/miscellanea:misc.Mode4
ltx/en_us_goadedes/me.m11.d02:meMA.Ode8C11.ode	@ltx/en_us_goadedes/miscellanea:misc.Ode8
ltx/en_us_goadedes/me.m11.d02:meMA.Ode8C11.text	
ltx/en_us_goadedes/me.m11.d02:meMA.Ode8C12.incipit	…
ltx/en_us_goadedes/me.m11.d02:meMA.Ode8C12.melody	@ltx/en_us_goadedes/he.h.m4:heHE.PaidasEvageis.name
ltx/en_us_goadedes/me.m11.d02:meMA.Ode8C12.mode	@ltx/en_us_goadedes/miscellanea:misc.Mode4
ltx/en_us_goadedes/me.m11.d02:meMA.Ode8C12.ode	@ltx/en_us_goadedes/miscellanea:misc.Ode8
ltx/en_us_goadedes/me.m11.d02:meMA.Ode8C12.text	
ltx/en_us_goadedes/me.m11.d02:meMA.Ode8C13.incipit	…
ltx/en_us_goadedes/me.m11.d02:meMA.Ode8C13.melody	@ltx/en_us_goadedes/he.h.m4:heHE.PaidasEvageis.name
ltx/en_us_goadedes/me.m11.d02:meMA.Ode8C13.mode	@ltx/en_us_goadedes/miscellanea:misc.Mode4
ltx/en_us_goadedes/me.m11.d02:meMA.Ode8C13.ode	@ltx/en_us_goadedes/miscellanea:misc.Ode8
ltx/en_us_goadedes/me.m11.d02:meMA.Ode8C13.text	
ltx/en_us_goadedes/me.m11.d02:meMA.Ode8C14.incipit	…
ltx/en_us_goadedes/me.m11.d02:meMA.Ode8C14.melody	@ltx/en_us_goadedes/he.h.m4:heHE.PaidasEvageis.name
ltx/en_us_goadedes/me.m11.d02:meMA.Ode8C14.mode	@ltx/en_us_goadedes/miscellanea:misc.Mode4
ltx/en_us_goadedes/me.m11.d02:meMA.Ode8C14.ode	@ltx/en_us_goadedes/miscellanea:misc.Ode8
ltx/en_us_goadedes/me.m11.d02:meMA.Ode8C14.text	
ltx/en_us_goadedes/me.m11.d02:meMA.Ode8C1T.incipit	…
ltx/en_us_goadedes/me.m11.d02:meMA.Ode8C1T.melody	@ltx/en_us_goadedes/he.h.m4:heHE.PaidasEvageis.name
ltx/en_us_goadedes/me.m11.d02:meMA.Ode8C1T.mode	@ltx/en_us_goadedes/miscellanea:misc.Mode4
ltx/en_us_goadedes/me.m11.d02:meMA.Ode8C1T.ode	@ltx/en_us_goadedes/miscellanea:misc.Ode8
ltx/en_us_goadedes/me.m11.d02:meMA.Ode8C1T.text	
ltx/en_us_goadedes/me.m11.d02:meMA.Ode8H.greekmelody	@ltx/en_us_goadedes/he.h.m4:heHE.PaidasEvageis.greekname
ltx/en_us_goadedes/me.m11.d02:meMA.Ode8H.incipit	@ltx/en_us_goadedes/he.h.m4:heHE.PaidasEvageis.incipit
ltx/en_us_goadedes/me.m11.d02:meMA.Ode8H.melody	@ltx/en_us_goadedes/he.h.m4:heHE.PaidasEvageis.melody
ltx/en_us_goadedes/me.m11.d02:meMA.Ode8H.mode	@ltx/en_us_goadedes/miscellanea:misc.Mode4
ltx/en_us_goadedes/me.m11.d02:meMA.Ode8H.ode	@ltx/en_us_goadedes/miscellanea:misc.Ode8
ltx/en_us_goadedes/me.m11.d02:meMA.Ode8H.text	@ltx/en_us_goadedes/he.h.m4:heHE.PaidasEvageis.text
ltx/en_us_goadedes/me.m11.d02:meMA.Ode9C11.greekmelody	@ltx/en_us_goadedes/he.h.m4:heHE.EvaMenToTisParakois.greekname
ltx/en_us_goadedes/me.m11.d02:meMA.Ode9C11.incipit	…
ltx/en_us_goadedes/me.m11.d02:meMA.Ode9C11.melody	@ltx/en_us_goadedes/he.h.m4:heHE.EvaMenToTisParakois.name
ltx/en_us_goadedes/me.m11.d02:meMA.Ode9C11.mode	@ltx/en_us_goadedes/miscellanea:misc.Mode4
ltx/en_us_goadedes/me.m11.d02:meMA.Ode9C11.ode	@ltx/en_us_goadedes/miscellanea:misc.Ode9
ltx/en_us_goadedes/me.m11.d02:meMA.Ode9C11.text	
ltx/en_us_goadedes/me.m11.d02:meMA.Ode9C12.incipit	…
ltx/en_us_goadedes/me.m11.d02:meMA.Ode9C12.melody	@ltx/en_us_goadedes/he.h.m4:heHE.EvaMenToTisParakois.name
ltx/en_us_goadedes/me.m11.d02:meMA.Ode9C12.mode	@ltx/en_us_goadedes/miscellanea:misc.Mode4
ltx/en_us_goadedes/me.m11.d02:meMA.Ode9C12.ode	@ltx/en_us_goadedes/miscellanea:misc.Ode9
ltx/en_us_goadedes/me.m11.d02:meMA.Ode9C12.text	
ltx/en_us_goadedes/me.m11.d02:meMA.Ode9C13.incipit	…
ltx/en_us_goadedes/me.m11.d02:meMA.Ode9C13.melody	@ltx/en_us_goadedes/he.h.m4:heHE.EvaMenToTisParakois.name
ltx/en_us_goadedes/me.m11.d02:meMA.Ode9C13.mode	@ltx/en_us_goadedes/miscellanea:misc.Mode4
ltx/en_us_goadedes/me.m11.d02:meMA.Ode9C13.ode	@ltx/en_us_goadedes/miscellanea:misc.Ode9
ltx/en_us_goadedes/me.m11.d02:meMA.Ode9C13.text	
ltx/en_us_goadedes/me.m11.d02:meMA.Ode9C1T.incipit	…
ltx/en_us_goadedes/me.m11.d02:meMA.Ode9C1T.melody	@ltx/en_us_goadedes/he.h.m4:heHE.EvaMenToTisParakois.name
ltx/en_us_goadedes/me.m11.d02:meMA.Ode9C1T.mode	@ltx/en_us_goadedes/miscellanea:misc.Mode4
ltx/en_us_goadedes/me.m11.d02:meMA.Ode9C1T.ode	@ltx/en_us_goadedes/miscellanea:misc.Ode9
ltx/en_us_goadedes/me.m11.d02:meMA.Ode9C1T.text	
ltx/en_us_goadedes/me.m11.d02:meMA.Ode9H.greekmelody	@ltx/en_us_goadedes/he.h.m4:heHE.EvaMenToTisParakois.greekname
ltx/en_us_goadedes/me.m11.d02:meMA.Ode9H.incipit	@ltx/en_us_goadedes/he.h.m4:heHE.EvaMenToTisParakois.incipit
ltx/en_us_goadedes/me.m11.d02:meMA.Ode9H.melody	@ltx/en_us_goadedes/he.h.m4:heHE.EvaMenToTisParakois.melody
ltx/en_us_goadedes/me.m11.d02:meMA.Ode9H.mode	@ltx/en_us_goadedes/miscellanea:misc.Mode4
ltx/en_us_goadedes/me.m11.d02:meMA.Ode9H.ode	@ltx/en_us_goadedes/miscellanea:misc.Ode9
ltx/en_us_goadedes/me.m11.d02:meMA.Ode9H.text	@ltx/en_us_goadedes/he.h.m4:heHE.EvaMenToTisParakois.text
ltx/en_us_goadedes/me.m11.d02:meMA.Oikos1.text	
ltx/en_us_goadedes/me.m11.d02:meMA.PostGospelBoth.incipit	@ltx/en_us_goadedes/ho.ho03:hoMA.PostGospelTheotokos.incipit
ltx/en_us_goadedes/me.m11.d02:meMA.PostGospelBoth.melody	
ltx/en_us_goadedes/me.m11.d02:meMA.PostGospelBoth.mode	@ltx/en_us_goadedes/miscellanea:misc.Mode2
ltx/en_us_goadedes/me.m11.d02:meMA.PostGospelBoth.text	@ltx/en_us_goadedes/ho.ho03:hoMA.PostGospelTheotokos.text
ltx/en_us_goadedes/me.m11.d02:meMA.PostGospelGlory.incipit	@ltx/en_us_goadedes/ho.ho03:hoMA.PostGospelMartyrs.incipit
ltx/en_us_goadedes/me.m11.d02:meMA.PostGospelGlory.melody	
ltx/en_us_goadedes/me.m11.d02:meMA.PostGospelGlory.mode	@ltx/en_us_goadedes/miscellanea:misc.Mode2
ltx/en_us_goadedes/me.m11.d02:meMA.PostGospelGlory.text	@ltx/en_us_goadedes/ho.ho03:hoMA.PostGospelMartyrs.text
ltx/en_us_goadedes/me.m11.d02:meMA.PostGospelIdiomelon.incipit	@ltx/en_us_goadedes/me.m11.d02:meMA.Aposticha4.incipit
ltx/en_us_goadedes/me.m11.d02:meMA.PostGospelIdiomelon.melody	
ltx/en_us_goadedes/me.m11.d02:meMA.PostGospelIdiomelon.mode	@ltx/en_us_goadedes/miscellanea:misc.Mode2
ltx/en_us_goadedes/me.m11.d02:meMA.PostGospelIdiomelon.text	@ltx/en_us_goadedes/me.m11.d02:meMA.Aposticha4.text
ltx/en_us_goadedes/me.m11.d02:meVE.Apolytikion1.incipit	@ltx/en_us_goadedes/oc.m2.d4:ocMA.Kathisma32.incipit
ltx/en_us_goadedes/me.m11.d02:meVE.Apolytikion1.melody	
ltx/en_us_goadedes/me.m11.d02:meVE.Apolytikion1.mode	@ltx/en_us_goadedes/miscellanea:misc.Mode2
ltx/en_us_goadedes/me.m11.d02:meVE.Apolytikion1.text	@ltx/en_us_goadedes/oc.m2.d4:ocMA.Kathisma32.text
ltx/en_us_goadedes/me.m11.d02:meVE.Apolytikion2ger.greekmelody	@ltx/en_us_goadedes/he.a.m4:heAU.TachyProkatalave.greekname
ltx/en_us_goadedes/me.m11.d02:meVE.Apolytikion2ger.incipit	…
ltx/en_us_goadedes/me.m11.d02:meVE.Apolytikion2ger.melody	@ltx/en_us_goadedes/he.a.m4:heAU.TachyProkatalave.name
ltx/en_us_goadedes/me.m11.d02:meVE.Apolytikion2ger.mode	@ltx/en_us_goadedes/miscellanea:misc.Mode4
ltx/en_us_goadedes/me.m11.d02:meVE.Apolytikion2ger.poet	@ltx/en_us_goadedes/poets:po.Gerasimou
ltx/en_us_goadedes/me.m11.d02:meVE.Apolytikion2ger.text	
ltx/en_us_goadedes/me.m11.d02:meVE.Apolytikion3.greekmelody	@ltx/en_us_goadedes/he.a.m4:heAU.TachyProkatalave.greekname
ltx/en_us_goadedes/me.m11.d02:meVE.Apolytikion3.incipit	O steadfast and mighty…
ltx/en_us_goadedes/me.m11.d02:meVE.Apolytikion3.melody	@ltx/en_us_goadedes/he.a.m4:heAU.TachyProkatalave.name
ltx/en_us_goadedes/me.m11.d02:meVE.Apolytikion3.mode	@ltx/en_us_goadedes/miscellanea:misc.Mode4
ltx/en_us_goadedes/me.m11.d02:meVE.Apolytikion3.text	O steadfast and mighty Witnesses and Martyrs of Christ, * glorious Pegasios and wise Acindynos * and strong Anempodistos, * blessed Afthonios and divine Elpidophoros, * you five medaled Athletes ever guard us and save us * from perils and disasters when we pray to you.
ltx/en_us_goadedes/me.m11.d02:meVE.AposGlory.incipit	Come, let us rejoice…
ltx/en_us_goadedes/me.m11.d02:meVE.AposGlory.melody	
ltx/en_us_goadedes/me.m11.d02:meVE.AposGlory.mode	@ltx/en_us_goadedes/miscellanea:misc.Mode2
ltx/en_us_goadedes/me.m11.d02:meVE.AposGlory.text	Come, let us rejoice in the Lord today, as we observe the memory of the medaled Athletes, of fans of the Church’s feasts. Come, let us mystically extol them and sing their praises, and let us salute them and say, “Rejoice, Acindynos! Rejoice, Pegasios! Rejoice, Anempodistos! Rejoice, Elpidophoros! Rejoice, Afthonios! During your contest, you publicly proclaimed Christ the Lord, and you plunged paganism into chaos. We all call you blessed for your herculean labors, and we pray you never cease to intercede on behalf of our souls.”
ltx/en_us_goadedes/me.m11.d02:meVE.AposStavrotheotokion.greekmelody	@ltx/en_us_goadedes/he.a.m2:heAU.OteEkTouXylou.greekname
ltx/en_us_goadedes/me.m11.d02:meVE.AposStavrotheotokion.incipit	@ltx/en_us_goadedes/me.m10.d02:meVE.SticStavrotheotokion.incipit
ltx/en_us_goadedes/me.m11.d02:meVE.AposStavrotheotokion.melody	@ltx/en_us_goadedes/he.a.m2:heAU.OteEkTouXylou.name
ltx/en_us_goadedes/me.m11.d02:meVE.AposStavrotheotokion.mode	@ltx/en_us_goadedes/miscellanea:misc.Mode2
ltx/en_us_goadedes/me.m11.d02:meVE.AposStavrotheotokion.text	@ltx/en_us_goadedes/me.m10.d02:meVE.SticStavrotheotokion.text
ltx/en_us_goadedes/me.m11.d02:meVE.AposTheotokion.incipit	@ltx/en_us_goadedes/ho.ho23:hoCA.Troparion7.incipit
ltx/en_us_goadedes/me.m11.d02:meVE.AposTheotokion.melody	
ltx/en_us_goadedes/me.m11.d02:meVE.AposTheotokion.mode	@ltx/en_us_goadedes/miscellanea:misc.Mode2
ltx/en_us_goadedes/me.m11.d02:meVE.AposTheotokion.text	@ltx/en_us_goadedes/ho.ho23:hoCA.Troparion7.text
ltx/en_us_goadedes/me.m11.d02:meVE.Aposticha1.greekmelody	@ltx/en_us_goadedes/he.a.m6:heAU.TriimerosAnestis.greekname
ltx/en_us_goadedes/me.m11.d02:meVE.Aposticha1.incipit	Quintet of splendid Athletes…
ltx/en_us_goadedes/me.m11.d02:meVE.Aposticha1.melody	@ltx/en_us_goadedes/he.a.m6:heAU.TriimerosAnestis.name
ltx/en_us_goadedes/me.m11.d02:meVE.Aposticha1.mode	@ltx/en_us_goadedes/miscellanea:misc.Mode6
ltx/en_us_goadedes/me.m11.d02:meVE.Aposticha1.text	Quintet of splendid Athletes of God, * who blissfully are standing near Christ, * we entreat you to present a fervent prayer * on behalf of the faithful, * who praise and glorify you * and praise your celebrated martyrdom.
ltx/en_us_goadedes/me.m11.d02:meVE.Aposticha2.incipit	…
ltx/en_us_goadedes/me.m11.d02:meVE.Aposticha2.melody	@ltx/en_us_goadedes/he.a.m6:heAU.TriimerosAnestis.name
ltx/en_us_goadedes/me.m11.d02:meVE.Aposticha2.mode	@ltx/en_us_goadedes/miscellanea:misc.Mode6
ltx/en_us_goadedes/me.m11.d02:meVE.Aposticha2.text	O Martyrs of the Lord, shield our souls * from arrows that the evil one shoots, * so that we may be attentive as we keep * the sacred celebration * of your divine achievements * and all your struggles for the sake of Christ.
ltx/en_us_goadedes/me.m11.d02:meVE.Aposticha3.incipit	O people everywhere…
ltx/en_us_goadedes/me.m11.d02:meVE.Aposticha3.melody	@ltx/en_us_goadedes/he.a.m6:heAU.TriimerosAnestis.name
ltx/en_us_goadedes/me.m11.d02:meVE.Aposticha3.mode	@ltx/en_us_goadedes/miscellanea:misc.Mode6
ltx/en_us_goadedes/me.m11.d02:meVE.Aposticha3.text	O people everywhere, celebrate * exultantly and sing to the Lord; * for the feast day of the martyr Saints of Christ * has risen like the morning, * which splendidly illumines * the congregations of the Orthodox.
ltx/en_us_goadedes/me.m11.d02:meVE.MM.Stichera1123as78910.text	
ltx/en_us_goadedes/me.m11.d02:meVE.SticGlory.incipit	Today, that splendid cohort…
ltx/en_us_goadedes/me.m11.d02:meVE.SticGlory.melody	
ltx/en_us_goadedes/me.m11.d02:meVE.SticGlory.mode	@ltx/en_us_goadedes/miscellanea:misc.Mode6
ltx/en_us_goadedes/me.m11.d02:meVE.SticGlory.poet	@ltx/en_us_goadedes/poets:po.Antoniou
ltx/en_us_goadedes/me.m11.d02:meVE.SticGlory.text	Today, that splendid cohort of five Martyrs, like a constellation of luminous stars, illumines the faithful. They invite us all to a mystical celebration. These servants of the noetic Sun refuted the religion of the Persians, who had devotion for the visible sun and worshiped fire; and they guided them to the true faith in God. The Martyrs have mixed and filled their proverbial cup, and they have wreathed it with the blood they shed for Christ; and they encourage us, their pious fans, saying, “Come to the banquet of our contests. Look at the medals and honors. Indeed, as Christ who is the truth once said, that he who endures to the end will be saved. And you will share our awards, and you will have us as intercessors before the Lord.”
ltx/en_us_goadedes/me.m11.d02:meVE.SticStavrotheotokion.greekmelody	@ltx/en_us_goadedes/he.a.m6:heAU.OlinApothemenoi.greekname
ltx/en_us_goadedes/me.m11.d02:meVE.SticStavrotheotokion.incipit	@ltx/en_us_goadedes/me.m02.d17:meMA.LaudsStavrotheotokion.incipit
ltx/en_us_goadedes/me.m11.d02:meVE.SticStavrotheotokion.melody	@ltx/en_us_goadedes/he.a.m6:heAU.OlinApothemenoi.name
ltx/en_us_goadedes/me.m11.d02:meVE.SticStavrotheotokion.mode	@ltx/en_us_goadedes/miscellanea:misc.Mode6
ltx/en_us_goadedes/me.m11.d02:meVE.SticStavrotheotokion.text	@ltx/en_us_goadedes/me.m02.d17:meMA.LaudsStavrotheotokion.text
ltx/en_us_goadedes/me.m11.d02:meVE.SticTheotokion.greekmelody	@ltx/en_us_goadedes/he.a.m6:heAU.OlinApothemenoi.greekname
ltx/en_us_goadedes/me.m11.d02:meVE.SticTheotokion.incipit	@ltx/en_us_goadedes/me.m01.d21:meVE.SticTheotokion.incipit
ltx/en_us_goadedes/me.m11.d02:meVE.SticTheotokion.melody	@ltx/en_us_goadedes/he.a.m6:heAU.OlinApothemenoi.name
ltx/en_us_goadedes/me.m11.d02:meVE.SticTheotokion.mode	@ltx/en_us_goadedes/miscellanea:misc.Mode6
ltx/en_us_goadedes/me.m11.d02:meVE.SticTheotokion.text	@ltx/en_us_goadedes/me.m01.d21:meVE.SticTheotokion.text
ltx/en_us_goadedes/me.m11.d02:meVE.Stichera01.greekmelody	@ltx/en_us_goadedes/he.a.m4:heAU.OsGennaionEnMartysi.greekname
ltx/en_us_goadedes/me.m11.d02:meVE.Stichera01.incipit	Let us sing sacred hymns…
ltx/en_us_goadedes/me.m11.d02:meVE.Stichera01.melody	@ltx/en_us_goadedes/he.a.m4:heAU.OsGennaionEnMartysi.name
ltx/en_us_goadedes/me.m11.d02:meVE.Stichera01.mode	@ltx/en_us_goadedes/miscellanea:misc.Mode4
ltx/en_us_goadedes/me.m11.d02:meVE.Stichera01.text	Let us sing sacred hymns and praise * that quintet of the martyr Saints, * namely wise Acindynos, Anempodistos, * Elpidophoros, Pegasios, * and blessed Afthonios, * holy Athletes, brave and strong. * They are earnest in helping all * people everywhere, * as they gush forth with unobstructed grace, and they unhazardously grant us * Orthodox Christians abundant hope.
ltx/en_us_goadedes/me.m11.d02:meVE.Stichera02.incipit	Truly nothing could separate…
ltx/en_us_goadedes/me.m11.d02:meVE.Stichera02.melody	@ltx/en_us_goadedes/he.a.m4:heAU.OsGennaionEnMartysi.name
ltx/en_us_goadedes/me.m11.d02:meVE.Stichera02.mode	@ltx/en_us_goadedes/miscellanea:misc.Mode4
ltx/en_us_goadedes/me.m11.d02:meVE.Stichera02.text	Truly nothing could separate * you, O Saints, from the love of Christ, * neither famine nor peril, neither life nor death, * not even cauldrons of boiling pitch, * nor mouths of ferocious beasts, * neither ditches nor mass graves, * being stout-hearted, resolute, brave, and valorous. * By unceasingly focusing on Him, and Him alone, with love and longing, * you overcame the antagonists.
ltx/en_us_goadedes/me.m11.d02:meVE.Stichera03.incipit	You enjoy the delights…
ltx/en_us_goadedes/me.m11.d02:meVE.Stichera03.melody	@ltx/en_us_goadedes/he.a.m4:heAU.OsGennaionEnMartysi.name
ltx/en_us_goadedes/me.m11.d02:meVE.Stichera03.mode	@ltx/en_us_goadedes/miscellanea:misc.Mode4
ltx/en_us_goadedes/me.m11.d02:meVE.Stichera03.text	You enjoy the delights on high, * you are filled with the light of God, * and you have inherited everlasting life. * And now when we come to you in need, * you save us from every kind * of oppression and abuse * and from unjust imprisonment sympathetically, * for you have godly confidence in praying to the Master, demonstrating * your truly Christ-like benevolence.
