ltx/en_us_goadedes/me.m10.d17:meDA.commemoration.first	
ltx/en_us_goadedes/me.m10.d17:meDA.commemoration.first_name	
ltx/en_us_goadedes/me.m10.d17:meDA.commemoration.first_short	
ltx/en_us_goadedes/me.m10.d17:meDA.commemoration.first_title	@ltx/en_us_goadedes/titles:ti.Prophet
ltx/en_us_goadedes/me.m10.d17:meDA.commemoration.full	
ltx/en_us_goadedes/me.m10.d17:meDA.commemoration.second_name	
ltx/en_us_goadedes/me.m10.d17:meDA.commemoration.second_title	@ltx/en_us_goadedes/titles:ti.DevoutMartyrM
ltx/en_us_goadedes/me.m10.d17:meDA.date	
ltx/en_us_goadedes/me.m10.d17:meDA.fordate	
ltx/en_us_goadedes/me.m10.d17:meDA.insert1	
ltx/en_us_goadedes/me.m10.d17:meDA.insert2	
ltx/en_us_goadedes/me.m10.d17:meDA.note	
ltx/en_us_goadedes/me.m10.d17:meDA.pdfcoverdate	
ltx/en_us_goadedes/me.m10.d17:meDA.pdfheaderdate	
ltx/en_us_goadedes/me.m10.d17:meHO.commemorations	
ltx/en_us_goadedes/me.m10.d17:meHO.note1	
ltx/en_us_goadedes/me.m10.d17:meHO.note2	
ltx/en_us_goadedes/me.m10.d17:meHO.number	
ltx/en_us_goadedes/me.m10.d17:meHO.rank	
ltx/en_us_goadedes/me.m10.d17:meLE.commemoration1	
ltx/en_us_goadedes/me.m10.d17:meLE.commemoration2	
ltx/en_us_goadedes/me.m10.d17:meLI.Kontakion1.greekmelody	@ltx/en_us_goadedes/me.m10.d17:meMA.Kontakion1.greekmelody
ltx/en_us_goadedes/me.m10.d17:meLI.Kontakion1.incipit	@ltx/en_us_goadedes/me.m10.d17:meMA.Kontakion1.incipit
ltx/en_us_goadedes/me.m10.d17:meLI.Kontakion1.melody	@ltx/en_us_goadedes/me.m10.d17:meMA.Kontakion1.melody
ltx/en_us_goadedes/me.m10.d17:meLI.Kontakion1.mode	@ltx/en_us_goadedes/me.m10.d17:meMA.Kontakion1.mode
ltx/en_us_goadedes/me.m10.d17:meLI.Kontakion1.text	@ltx/en_us_goadedes/me.m10.d17:meMA.Kontakion1.text
ltx/en_us_goadedes/me.m10.d17:meLI.Megalynarion.text	
ltx/en_us_goadedes/me.m10.d17:meMA.C1.acrostic.notice1	
ltx/en_us_goadedes/me.m10.d17:meMA.C1.acrostic.text	
ltx/en_us_goadedes/me.m10.d17:meMA.C1.acrostic.title	
ltx/en_us_goadedes/me.m10.d17:meMA.C1.poet	@ltx/en_us_goadedes/poets:po.Theofanous
ltx/en_us_goadedes/me.m10.d17:meMA.C1.title	@ltx/en_us_goadedes/titles:ti.CanonProphet
ltx/en_us_goadedes/me.m10.d17:meMA.C1.verse	@ltx/en_us_goadedes/prayers:pr.verse_Prophet.text
ltx/en_us_goadedes/me.m10.d17:meMA.C2.acrostic.notice1	
ltx/en_us_goadedes/me.m10.d17:meMA.C2.acrostic.text	
ltx/en_us_goadedes/me.m10.d17:meMA.C2.acrostic.title	
ltx/en_us_goadedes/me.m10.d17:meMA.C2.title	@ltx/en_us_goadedes/titles:ti.CanonDevoutMartyrM
ltx/en_us_goadedes/me.m10.d17:meMA.C2.verse	@ltx/en_us_goadedes/prayers:pr.verse_SaintM.text
ltx/en_us_goadedes/me.m10.d17:meMA.ExapTheotokion.incipit	…
ltx/en_us_goadedes/me.m10.d17:meMA.ExapTheotokion.melody	@ltx/en_us_goadedes/he.a.m2:heAU.ToisMathitaisSynelthomen.name
ltx/en_us_goadedes/me.m10.d17:meMA.ExapTheotokion.mode	@ltx/en_us_goadedes/miscellanea:misc.Mode2
ltx/en_us_goadedes/me.m10.d17:meMA.ExapTheotokion.text	
ltx/en_us_goadedes/me.m10.d17:meMA.Exaposteilarion1.greekmelody	@ltx/en_us_goadedes/he.a.m2:heAU.ToisMathitaisSynelthomen.greekname
ltx/en_us_goadedes/me.m10.d17:meMA.Exaposteilarion1.incipit	…
ltx/en_us_goadedes/me.m10.d17:meMA.Exaposteilarion1.melody	@ltx/en_us_goadedes/he.a.m2:heAU.ToisMathitaisSynelthomen.name
ltx/en_us_goadedes/me.m10.d17:meMA.Exaposteilarion1.mode	@ltx/en_us_goadedes/miscellanea:misc.Mode2
ltx/en_us_goadedes/me.m10.d17:meMA.Exaposteilarion1.text	
ltx/en_us_goadedes/me.m10.d17:meMA.Exaposteilarion2.greekmelody	@ltx/en_us_goadedes/he.a.m2:heAU.ToisMathitaisSynelthomen.greekname
ltx/en_us_goadedes/me.m10.d17:meMA.Exaposteilarion2.incipit	…
ltx/en_us_goadedes/me.m10.d17:meMA.Exaposteilarion2.melody	@ltx/en_us_goadedes/he.a.m2:heAU.ToisMathitaisSynelthomen.name
ltx/en_us_goadedes/me.m10.d17:meMA.Exaposteilarion2.mode	@ltx/en_us_goadedes/miscellanea:misc.Mode2
ltx/en_us_goadedes/me.m10.d17:meMA.Exaposteilarion2.text	
ltx/en_us_goadedes/me.m10.d17:meMA.Kontakion1.greekmelody	@ltx/en_us_goadedes/he.a.m3:heAU.IParthenosSimeron.greekname
ltx/en_us_goadedes/me.m10.d17:meMA.Kontakion1.incipit	…
ltx/en_us_goadedes/me.m10.d17:meMA.Kontakion1.melody	@ltx/en_us_goadedes/he.a.m3:heAU.IParthenosSimeron.name
ltx/en_us_goadedes/me.m10.d17:meMA.Kontakion1.mode	@ltx/en_us_goadedes/miscellanea:misc.Mode3
ltx/en_us_goadedes/me.m10.d17:meMA.Kontakion1.text	
ltx/en_us_goadedes/me.m10.d17:meMA.Ode1C11.greekmelody	@ltx/en_us_goadedes/he.h.m1:heHE.ToVoithisantiTheo.greekname
ltx/en_us_goadedes/me.m10.d17:meMA.Ode1C11.incipit	…
ltx/en_us_goadedes/me.m10.d17:meMA.Ode1C11.melody	@ltx/en_us_goadedes/he.h.m1:heHE.ToVoithisantiTheo.name
ltx/en_us_goadedes/me.m10.d17:meMA.Ode1C11.mode	@ltx/en_us_goadedes/miscellanea:misc.Mode1
ltx/en_us_goadedes/me.m10.d17:meMA.Ode1C11.ode	@ltx/en_us_goadedes/miscellanea:misc.Ode1
ltx/en_us_goadedes/me.m10.d17:meMA.Ode1C11.text	
ltx/en_us_goadedes/me.m10.d17:meMA.Ode1C12.incipit	…
ltx/en_us_goadedes/me.m10.d17:meMA.Ode1C12.melody	@ltx/en_us_goadedes/he.h.m1:heHE.ToVoithisantiTheo.name
ltx/en_us_goadedes/me.m10.d17:meMA.Ode1C12.mode	@ltx/en_us_goadedes/miscellanea:misc.Mode1
ltx/en_us_goadedes/me.m10.d17:meMA.Ode1C12.ode	@ltx/en_us_goadedes/miscellanea:misc.Ode1
ltx/en_us_goadedes/me.m10.d17:meMA.Ode1C12.text	
ltx/en_us_goadedes/me.m10.d17:meMA.Ode1C13.incipit	…
ltx/en_us_goadedes/me.m10.d17:meMA.Ode1C13.melody	@ltx/en_us_goadedes/he.h.m1:heHE.ToVoithisantiTheo.name
ltx/en_us_goadedes/me.m10.d17:meMA.Ode1C13.mode	@ltx/en_us_goadedes/miscellanea:misc.Mode1
ltx/en_us_goadedes/me.m10.d17:meMA.Ode1C13.ode	@ltx/en_us_goadedes/miscellanea:misc.Ode1
ltx/en_us_goadedes/me.m10.d17:meMA.Ode1C13.text	
ltx/en_us_goadedes/me.m10.d17:meMA.Ode1C1T.incipit	…
ltx/en_us_goadedes/me.m10.d17:meMA.Ode1C1T.melody	@ltx/en_us_goadedes/he.h.m1:heHE.ToVoithisantiTheo.name
ltx/en_us_goadedes/me.m10.d17:meMA.Ode1C1T.mode	@ltx/en_us_goadedes/miscellanea:misc.Mode1
ltx/en_us_goadedes/me.m10.d17:meMA.Ode1C1T.ode	@ltx/en_us_goadedes/miscellanea:misc.Ode1
ltx/en_us_goadedes/me.m10.d17:meMA.Ode1C1T.text	
ltx/en_us_goadedes/me.m10.d17:meMA.Ode1C21.greekmelody	@ltx/en_us_goadedes/he.h.m2:heHE.EnVythoKatestrose.greekname
ltx/en_us_goadedes/me.m10.d17:meMA.Ode1C21.incipit	…
ltx/en_us_goadedes/me.m10.d17:meMA.Ode1C21.melody	@ltx/en_us_goadedes/he.h.m2:heHE.EnVythoKatestrose.name
ltx/en_us_goadedes/me.m10.d17:meMA.Ode1C21.mode	@ltx/en_us_goadedes/miscellanea:misc.Mode2
ltx/en_us_goadedes/me.m10.d17:meMA.Ode1C21.ode	@ltx/en_us_goadedes/miscellanea:misc.Ode1
ltx/en_us_goadedes/me.m10.d17:meMA.Ode1C21.text	
ltx/en_us_goadedes/me.m10.d17:meMA.Ode1C22.incipit	…
ltx/en_us_goadedes/me.m10.d17:meMA.Ode1C22.melody	@ltx/en_us_goadedes/he.h.m2:heHE.EnVythoKatestrose.name
ltx/en_us_goadedes/me.m10.d17:meMA.Ode1C22.mode	@ltx/en_us_goadedes/miscellanea:misc.Mode2
ltx/en_us_goadedes/me.m10.d17:meMA.Ode1C22.ode	@ltx/en_us_goadedes/miscellanea:misc.Ode1
ltx/en_us_goadedes/me.m10.d17:meMA.Ode1C22.text	
ltx/en_us_goadedes/me.m10.d17:meMA.Ode1C23.incipit	…
ltx/en_us_goadedes/me.m10.d17:meMA.Ode1C23.melody	@ltx/en_us_goadedes/he.h.m2:heHE.EnVythoKatestrose.name
ltx/en_us_goadedes/me.m10.d17:meMA.Ode1C23.mode	@ltx/en_us_goadedes/miscellanea:misc.Mode2
ltx/en_us_goadedes/me.m10.d17:meMA.Ode1C23.ode	@ltx/en_us_goadedes/miscellanea:misc.Ode1
ltx/en_us_goadedes/me.m10.d17:meMA.Ode1C23.text	
ltx/en_us_goadedes/me.m10.d17:meMA.Ode1C2T.incipit	…
ltx/en_us_goadedes/me.m10.d17:meMA.Ode1C2T.melody	@ltx/en_us_goadedes/he.h.m2:heHE.EnVythoKatestrose.name
ltx/en_us_goadedes/me.m10.d17:meMA.Ode1C2T.mode	@ltx/en_us_goadedes/miscellanea:misc.Mode2
ltx/en_us_goadedes/me.m10.d17:meMA.Ode1C2T.ode	@ltx/en_us_goadedes/miscellanea:misc.Ode1
ltx/en_us_goadedes/me.m10.d17:meMA.Ode1C2T.text	
ltx/en_us_goadedes/me.m10.d17:meMA.Ode3C11.greekmelody	@ltx/en_us_goadedes/he.h.m1:heHE.StereosonMeChriste.greekname
ltx/en_us_goadedes/me.m10.d17:meMA.Ode3C11.incipit	…
ltx/en_us_goadedes/me.m10.d17:meMA.Ode3C11.melody	@ltx/en_us_goadedes/he.h.m1:heHE.StereosonMeChriste.name
ltx/en_us_goadedes/me.m10.d17:meMA.Ode3C11.mode	@ltx/en_us_goadedes/miscellanea:misc.Mode1
ltx/en_us_goadedes/me.m10.d17:meMA.Ode3C11.ode	@ltx/en_us_goadedes/miscellanea:misc.Ode3
ltx/en_us_goadedes/me.m10.d17:meMA.Ode3C11.text	
ltx/en_us_goadedes/me.m10.d17:meMA.Ode3C12.incipit	…
ltx/en_us_goadedes/me.m10.d17:meMA.Ode3C12.melody	@ltx/en_us_goadedes/he.h.m1:heHE.StereosonMeChriste.name
ltx/en_us_goadedes/me.m10.d17:meMA.Ode3C12.mode	@ltx/en_us_goadedes/miscellanea:misc.Mode1
ltx/en_us_goadedes/me.m10.d17:meMA.Ode3C12.ode	@ltx/en_us_goadedes/miscellanea:misc.Ode3
ltx/en_us_goadedes/me.m10.d17:meMA.Ode3C12.text	
ltx/en_us_goadedes/me.m10.d17:meMA.Ode3C13.incipit	…
ltx/en_us_goadedes/me.m10.d17:meMA.Ode3C13.melody	@ltx/en_us_goadedes/he.h.m1:heHE.StereosonMeChriste.name
ltx/en_us_goadedes/me.m10.d17:meMA.Ode3C13.mode	@ltx/en_us_goadedes/miscellanea:misc.Mode1
ltx/en_us_goadedes/me.m10.d17:meMA.Ode3C13.ode	@ltx/en_us_goadedes/miscellanea:misc.Ode3
ltx/en_us_goadedes/me.m10.d17:meMA.Ode3C13.text	
ltx/en_us_goadedes/me.m10.d17:meMA.Ode3C1T.incipit	…
ltx/en_us_goadedes/me.m10.d17:meMA.Ode3C1T.melody	@ltx/en_us_goadedes/he.h.m1:heHE.StereosonMeChriste.name
ltx/en_us_goadedes/me.m10.d17:meMA.Ode3C1T.mode	@ltx/en_us_goadedes/miscellanea:misc.Mode1
ltx/en_us_goadedes/me.m10.d17:meMA.Ode3C1T.ode	@ltx/en_us_goadedes/miscellanea:misc.Ode3
ltx/en_us_goadedes/me.m10.d17:meMA.Ode3C1T.text	
ltx/en_us_goadedes/me.m10.d17:meMA.Ode3C21.greekmelody	@ltx/en_us_goadedes/he.h.m2:heHE.EnPetraMeTisPisteos.greekname
ltx/en_us_goadedes/me.m10.d17:meMA.Ode3C21.incipit	…
ltx/en_us_goadedes/me.m10.d17:meMA.Ode3C21.melody	@ltx/en_us_goadedes/he.h.m2:heHE.EnPetraMeTisPisteos.name
ltx/en_us_goadedes/me.m10.d17:meMA.Ode3C21.mode	@ltx/en_us_goadedes/miscellanea:misc.Mode2
ltx/en_us_goadedes/me.m10.d17:meMA.Ode3C21.ode	@ltx/en_us_goadedes/miscellanea:misc.Ode3
ltx/en_us_goadedes/me.m10.d17:meMA.Ode3C21.text	
ltx/en_us_goadedes/me.m10.d17:meMA.Ode3C22.incipit	…
ltx/en_us_goadedes/me.m10.d17:meMA.Ode3C22.melody	@ltx/en_us_goadedes/he.h.m2:heHE.EnPetraMeTisPisteos.name
ltx/en_us_goadedes/me.m10.d17:meMA.Ode3C22.mode	@ltx/en_us_goadedes/miscellanea:misc.Mode2
ltx/en_us_goadedes/me.m10.d17:meMA.Ode3C22.ode	@ltx/en_us_goadedes/miscellanea:misc.Ode3
ltx/en_us_goadedes/me.m10.d17:meMA.Ode3C22.text	
ltx/en_us_goadedes/me.m10.d17:meMA.Ode3C23.incipit	…
ltx/en_us_goadedes/me.m10.d17:meMA.Ode3C23.melody	@ltx/en_us_goadedes/he.h.m2:heHE.EnPetraMeTisPisteos.name
ltx/en_us_goadedes/me.m10.d17:meMA.Ode3C23.mode	@ltx/en_us_goadedes/miscellanea:misc.Mode2
ltx/en_us_goadedes/me.m10.d17:meMA.Ode3C23.ode	@ltx/en_us_goadedes/miscellanea:misc.Ode3
ltx/en_us_goadedes/me.m10.d17:meMA.Ode3C23.text	
ltx/en_us_goadedes/me.m10.d17:meMA.Ode3C2T.incipit	…
ltx/en_us_goadedes/me.m10.d17:meMA.Ode3C2T.melody	@ltx/en_us_goadedes/he.h.m2:heHE.EnPetraMeTisPisteos.name
ltx/en_us_goadedes/me.m10.d17:meMA.Ode3C2T.mode	@ltx/en_us_goadedes/miscellanea:misc.Mode2
ltx/en_us_goadedes/me.m10.d17:meMA.Ode3C2T.ode	@ltx/en_us_goadedes/miscellanea:misc.Ode3
ltx/en_us_goadedes/me.m10.d17:meMA.Ode3C2T.text	
ltx/en_us_goadedes/me.m10.d17:meMA.Ode3H.greekmelody	@ltx/en_us_goadedes/he.h.m2:heHE.EnPetraMeTisPisteos.greekname
ltx/en_us_goadedes/me.m10.d17:meMA.Ode3H.incipit	@ltx/en_us_goadedes/he.h.m2:heHE.EnPetraMeTisPisteos.incipit
ltx/en_us_goadedes/me.m10.d17:meMA.Ode3H.melody	@ltx/en_us_goadedes/he.h.m2:heHE.EnPetraMeTisPisteos.melody
ltx/en_us_goadedes/me.m10.d17:meMA.Ode3H.mode	@ltx/en_us_goadedes/miscellanea:misc.Mode2
ltx/en_us_goadedes/me.m10.d17:meMA.Ode3H.ode	@ltx/en_us_goadedes/miscellanea:misc.Ode3
ltx/en_us_goadedes/me.m10.d17:meMA.Ode3H.text	@ltx/en_us_goadedes/he.h.m2:heHE.EnPetraMeTisPisteos.text
ltx/en_us_goadedes/me.m10.d17:meMA.Ode3Kathisma1.greekmelody	@ltx/en_us_goadedes/he.a.m1:heAU.TonTafonSouSotir.greekname
ltx/en_us_goadedes/me.m10.d17:meMA.Ode3Kathisma1.incipit	…
ltx/en_us_goadedes/me.m10.d17:meMA.Ode3Kathisma1.melody	@ltx/en_us_goadedes/he.a.m1:heAU.TonTafonSouSotir.name
ltx/en_us_goadedes/me.m10.d17:meMA.Ode3Kathisma1.mode	@ltx/en_us_goadedes/miscellanea:misc.Mode1
ltx/en_us_goadedes/me.m10.d17:meMA.Ode3Kathisma1.text	
ltx/en_us_goadedes/me.m10.d17:meMA.Ode3Kathisma2.greekmelody	@ltx/en_us_goadedes/he.a.m8:heAU.TinSofianKaiLogon.greekname
ltx/en_us_goadedes/me.m10.d17:meMA.Ode3Kathisma2.incipit	…
ltx/en_us_goadedes/me.m10.d17:meMA.Ode3Kathisma2.melody	@ltx/en_us_goadedes/he.a.m8:heAU.TinSofianKaiLogon.name
ltx/en_us_goadedes/me.m10.d17:meMA.Ode3Kathisma2.mode	@ltx/en_us_goadedes/miscellanea:misc.Mode8
ltx/en_us_goadedes/me.m10.d17:meMA.Ode3Kathisma2.text	
ltx/en_us_goadedes/me.m10.d17:meMA.Ode3KathismaSt.incipit	…
ltx/en_us_goadedes/me.m10.d17:meMA.Ode3KathismaSt.melody	@ltx/en_us_goadedes/he.a.m8:heAU.TinSofianKaiLogon.name
ltx/en_us_goadedes/me.m10.d17:meMA.Ode3KathismaSt.mode	@ltx/en_us_goadedes/miscellanea:misc.Mode8
ltx/en_us_goadedes/me.m10.d17:meMA.Ode3KathismaSt.text	
ltx/en_us_goadedes/me.m10.d17:meMA.Ode3KathismaT.incipit	@ltx/en_us_goadedes/me.m09.d28:meMA.Kathisma1T.incipit
ltx/en_us_goadedes/me.m10.d17:meMA.Ode3KathismaT.melody	@ltx/en_us_goadedes/he.a.m8:heAU.TinSofianKaiLogon.name
ltx/en_us_goadedes/me.m10.d17:meMA.Ode3KathismaT.mode	@ltx/en_us_goadedes/miscellanea:misc.Mode8
ltx/en_us_goadedes/me.m10.d17:meMA.Ode3KathismaT.text	@ltx/en_us_goadedes/me.m09.d28:meMA.Kathisma1T.text
ltx/en_us_goadedes/me.m10.d17:meMA.Ode4C11.greekmelody	@ltx/en_us_goadedes/he.h.m1:heHE.KatenoisaPantodyname.greekname
ltx/en_us_goadedes/me.m10.d17:meMA.Ode4C11.incipit	…
ltx/en_us_goadedes/me.m10.d17:meMA.Ode4C11.melody	@ltx/en_us_goadedes/he.h.m1:heHE.KatenoisaPantodyname.name
ltx/en_us_goadedes/me.m10.d17:meMA.Ode4C11.mode	@ltx/en_us_goadedes/miscellanea:misc.Mode1
ltx/en_us_goadedes/me.m10.d17:meMA.Ode4C11.ode	@ltx/en_us_goadedes/miscellanea:misc.Ode4
ltx/en_us_goadedes/me.m10.d17:meMA.Ode4C11.text	
ltx/en_us_goadedes/me.m10.d17:meMA.Ode4C12.incipit	…
ltx/en_us_goadedes/me.m10.d17:meMA.Ode4C12.melody	@ltx/en_us_goadedes/he.h.m1:heHE.KatenoisaPantodyname.name
ltx/en_us_goadedes/me.m10.d17:meMA.Ode4C12.mode	@ltx/en_us_goadedes/miscellanea:misc.Mode1
ltx/en_us_goadedes/me.m10.d17:meMA.Ode4C12.ode	@ltx/en_us_goadedes/miscellanea:misc.Ode4
ltx/en_us_goadedes/me.m10.d17:meMA.Ode4C12.text	
ltx/en_us_goadedes/me.m10.d17:meMA.Ode4C13.incipit	…
ltx/en_us_goadedes/me.m10.d17:meMA.Ode4C13.melody	@ltx/en_us_goadedes/he.h.m1:heHE.KatenoisaPantodyname.name
ltx/en_us_goadedes/me.m10.d17:meMA.Ode4C13.mode	@ltx/en_us_goadedes/miscellanea:misc.Mode1
ltx/en_us_goadedes/me.m10.d17:meMA.Ode4C13.ode	@ltx/en_us_goadedes/miscellanea:misc.Ode4
ltx/en_us_goadedes/me.m10.d17:meMA.Ode4C13.text	
ltx/en_us_goadedes/me.m10.d17:meMA.Ode4C1T.incipit	…
ltx/en_us_goadedes/me.m10.d17:meMA.Ode4C1T.melody	@ltx/en_us_goadedes/he.h.m1:heHE.KatenoisaPantodyname.name
ltx/en_us_goadedes/me.m10.d17:meMA.Ode4C1T.mode	@ltx/en_us_goadedes/miscellanea:misc.Mode1
ltx/en_us_goadedes/me.m10.d17:meMA.Ode4C1T.ode	@ltx/en_us_goadedes/miscellanea:misc.Ode4
ltx/en_us_goadedes/me.m10.d17:meMA.Ode4C1T.text	
ltx/en_us_goadedes/me.m10.d17:meMA.Ode4C21.greekmelody	@ltx/en_us_goadedes/he.h.m2:heHE.ElilythasEkParthenou.greekname
ltx/en_us_goadedes/me.m10.d17:meMA.Ode4C21.incipit	…
ltx/en_us_goadedes/me.m10.d17:meMA.Ode4C21.melody	@ltx/en_us_goadedes/he.h.m2:heHE.ElilythasEkParthenou.name
ltx/en_us_goadedes/me.m10.d17:meMA.Ode4C21.mode	@ltx/en_us_goadedes/miscellanea:misc.Mode2
ltx/en_us_goadedes/me.m10.d17:meMA.Ode4C21.ode	@ltx/en_us_goadedes/miscellanea:misc.Ode4
ltx/en_us_goadedes/me.m10.d17:meMA.Ode4C21.text	
ltx/en_us_goadedes/me.m10.d17:meMA.Ode4C22.incipit	…
ltx/en_us_goadedes/me.m10.d17:meMA.Ode4C22.melody	@ltx/en_us_goadedes/he.h.m2:heHE.ElilythasEkParthenou.name
ltx/en_us_goadedes/me.m10.d17:meMA.Ode4C22.mode	@ltx/en_us_goadedes/miscellanea:misc.Mode2
ltx/en_us_goadedes/me.m10.d17:meMA.Ode4C22.ode	@ltx/en_us_goadedes/miscellanea:misc.Ode4
ltx/en_us_goadedes/me.m10.d17:meMA.Ode4C22.text	
ltx/en_us_goadedes/me.m10.d17:meMA.Ode4C23.incipit	…
ltx/en_us_goadedes/me.m10.d17:meMA.Ode4C23.melody	@ltx/en_us_goadedes/he.h.m2:heHE.ElilythasEkParthenou.name
ltx/en_us_goadedes/me.m10.d17:meMA.Ode4C23.mode	@ltx/en_us_goadedes/miscellanea:misc.Mode2
ltx/en_us_goadedes/me.m10.d17:meMA.Ode4C23.ode	@ltx/en_us_goadedes/miscellanea:misc.Ode4
ltx/en_us_goadedes/me.m10.d17:meMA.Ode4C23.text	
ltx/en_us_goadedes/me.m10.d17:meMA.Ode4C2T.incipit	…
ltx/en_us_goadedes/me.m10.d17:meMA.Ode4C2T.melody	@ltx/en_us_goadedes/he.h.m2:heHE.ElilythasEkParthenou.name
ltx/en_us_goadedes/me.m10.d17:meMA.Ode4C2T.mode	@ltx/en_us_goadedes/miscellanea:misc.Mode2
ltx/en_us_goadedes/me.m10.d17:meMA.Ode4C2T.ode	@ltx/en_us_goadedes/miscellanea:misc.Ode4
ltx/en_us_goadedes/me.m10.d17:meMA.Ode4C2T.text	
ltx/en_us_goadedes/me.m10.d17:meMA.Ode5C11.greekmelody	@ltx/en_us_goadedes/he.h.m1:heHE.EkNyktosOrthrizontes.greekname
ltx/en_us_goadedes/me.m10.d17:meMA.Ode5C11.incipit	…
ltx/en_us_goadedes/me.m10.d17:meMA.Ode5C11.melody	@ltx/en_us_goadedes/he.h.m1:heHE.EkNyktosOrthrizontes.name
ltx/en_us_goadedes/me.m10.d17:meMA.Ode5C11.mode	@ltx/en_us_goadedes/miscellanea:misc.Mode1
ltx/en_us_goadedes/me.m10.d17:meMA.Ode5C11.ode	@ltx/en_us_goadedes/miscellanea:misc.Ode5
ltx/en_us_goadedes/me.m10.d17:meMA.Ode5C11.text	
ltx/en_us_goadedes/me.m10.d17:meMA.Ode5C12.incipit	…
ltx/en_us_goadedes/me.m10.d17:meMA.Ode5C12.melody	@ltx/en_us_goadedes/he.h.m1:heHE.EkNyktosOrthrizontes.name
ltx/en_us_goadedes/me.m10.d17:meMA.Ode5C12.mode	@ltx/en_us_goadedes/miscellanea:misc.Mode1
ltx/en_us_goadedes/me.m10.d17:meMA.Ode5C12.ode	@ltx/en_us_goadedes/miscellanea:misc.Ode5
ltx/en_us_goadedes/me.m10.d17:meMA.Ode5C12.text	
ltx/en_us_goadedes/me.m10.d17:meMA.Ode5C13.incipit	…
ltx/en_us_goadedes/me.m10.d17:meMA.Ode5C13.melody	@ltx/en_us_goadedes/he.h.m1:heHE.EkNyktosOrthrizontes.name
ltx/en_us_goadedes/me.m10.d17:meMA.Ode5C13.mode	@ltx/en_us_goadedes/miscellanea:misc.Mode1
ltx/en_us_goadedes/me.m10.d17:meMA.Ode5C13.ode	@ltx/en_us_goadedes/miscellanea:misc.Ode5
ltx/en_us_goadedes/me.m10.d17:meMA.Ode5C13.text	
ltx/en_us_goadedes/me.m10.d17:meMA.Ode5C1T.incipit	…
ltx/en_us_goadedes/me.m10.d17:meMA.Ode5C1T.melody	@ltx/en_us_goadedes/he.h.m1:heHE.EkNyktosOrthrizontes.name
ltx/en_us_goadedes/me.m10.d17:meMA.Ode5C1T.mode	@ltx/en_us_goadedes/miscellanea:misc.Mode1
ltx/en_us_goadedes/me.m10.d17:meMA.Ode5C1T.ode	@ltx/en_us_goadedes/miscellanea:misc.Ode5
ltx/en_us_goadedes/me.m10.d17:meMA.Ode5C1T.text	
ltx/en_us_goadedes/me.m10.d17:meMA.Ode5C21.greekmelody	@ltx/en_us_goadedes/he.h.m2:heHE.OFotismos.greekname
ltx/en_us_goadedes/me.m10.d17:meMA.Ode5C21.incipit	…
ltx/en_us_goadedes/me.m10.d17:meMA.Ode5C21.melody	@ltx/en_us_goadedes/he.h.m2:heHE.OFotismos.name
ltx/en_us_goadedes/me.m10.d17:meMA.Ode5C21.mode	@ltx/en_us_goadedes/miscellanea:misc.Mode2
ltx/en_us_goadedes/me.m10.d17:meMA.Ode5C21.ode	@ltx/en_us_goadedes/miscellanea:misc.Ode5
ltx/en_us_goadedes/me.m10.d17:meMA.Ode5C21.text	
ltx/en_us_goadedes/me.m10.d17:meMA.Ode5C22.incipit	…
ltx/en_us_goadedes/me.m10.d17:meMA.Ode5C22.melody	@ltx/en_us_goadedes/he.h.m2:heHE.OFotismos.name
ltx/en_us_goadedes/me.m10.d17:meMA.Ode5C22.mode	@ltx/en_us_goadedes/miscellanea:misc.Mode2
ltx/en_us_goadedes/me.m10.d17:meMA.Ode5C22.ode	@ltx/en_us_goadedes/miscellanea:misc.Ode5
ltx/en_us_goadedes/me.m10.d17:meMA.Ode5C22.text	
ltx/en_us_goadedes/me.m10.d17:meMA.Ode5C23.incipit	…
ltx/en_us_goadedes/me.m10.d17:meMA.Ode5C23.melody	@ltx/en_us_goadedes/he.h.m2:heHE.OFotismos.name
ltx/en_us_goadedes/me.m10.d17:meMA.Ode5C23.mode	@ltx/en_us_goadedes/miscellanea:misc.Mode2
ltx/en_us_goadedes/me.m10.d17:meMA.Ode5C23.ode	@ltx/en_us_goadedes/miscellanea:misc.Ode5
ltx/en_us_goadedes/me.m10.d17:meMA.Ode5C23.text	
ltx/en_us_goadedes/me.m10.d17:meMA.Ode5C2T.incipit	…
ltx/en_us_goadedes/me.m10.d17:meMA.Ode5C2T.melody	@ltx/en_us_goadedes/he.h.m2:heHE.OFotismos.name
ltx/en_us_goadedes/me.m10.d17:meMA.Ode5C2T.mode	@ltx/en_us_goadedes/miscellanea:misc.Mode2
ltx/en_us_goadedes/me.m10.d17:meMA.Ode5C2T.ode	@ltx/en_us_goadedes/miscellanea:misc.Ode5
ltx/en_us_goadedes/me.m10.d17:meMA.Ode5C2T.text	
ltx/en_us_goadedes/me.m10.d17:meMA.Ode6C11.greekmelody	@ltx/en_us_goadedes/he.h.m1:heHE.TonProfitinDiesosas.greekname
ltx/en_us_goadedes/me.m10.d17:meMA.Ode6C11.incipit	…
ltx/en_us_goadedes/me.m10.d17:meMA.Ode6C11.melody	@ltx/en_us_goadedes/he.h.m1:heHE.TonProfitinDiesosas.name
ltx/en_us_goadedes/me.m10.d17:meMA.Ode6C11.mode	@ltx/en_us_goadedes/miscellanea:misc.Mode1
ltx/en_us_goadedes/me.m10.d17:meMA.Ode6C11.ode	@ltx/en_us_goadedes/miscellanea:misc.Ode6
ltx/en_us_goadedes/me.m10.d17:meMA.Ode6C11.text	
ltx/en_us_goadedes/me.m10.d17:meMA.Ode6C12.incipit	…
ltx/en_us_goadedes/me.m10.d17:meMA.Ode6C12.melody	@ltx/en_us_goadedes/he.h.m1:heHE.TonProfitinDiesosas.name
ltx/en_us_goadedes/me.m10.d17:meMA.Ode6C12.mode	@ltx/en_us_goadedes/miscellanea:misc.Mode1
ltx/en_us_goadedes/me.m10.d17:meMA.Ode6C12.ode	@ltx/en_us_goadedes/miscellanea:misc.Ode6
ltx/en_us_goadedes/me.m10.d17:meMA.Ode6C12.text	
ltx/en_us_goadedes/me.m10.d17:meMA.Ode6C13.incipit	…
ltx/en_us_goadedes/me.m10.d17:meMA.Ode6C13.melody	@ltx/en_us_goadedes/he.h.m1:heHE.TonProfitinDiesosas.name
ltx/en_us_goadedes/me.m10.d17:meMA.Ode6C13.mode	@ltx/en_us_goadedes/miscellanea:misc.Mode1
ltx/en_us_goadedes/me.m10.d17:meMA.Ode6C13.ode	@ltx/en_us_goadedes/miscellanea:misc.Ode6
ltx/en_us_goadedes/me.m10.d17:meMA.Ode6C13.text	
ltx/en_us_goadedes/me.m10.d17:meMA.Ode6C1T.incipit	…
ltx/en_us_goadedes/me.m10.d17:meMA.Ode6C1T.melody	@ltx/en_us_goadedes/he.h.m1:heHE.TonProfitinDiesosas.name
ltx/en_us_goadedes/me.m10.d17:meMA.Ode6C1T.mode	@ltx/en_us_goadedes/miscellanea:misc.Mode1
ltx/en_us_goadedes/me.m10.d17:meMA.Ode6C1T.ode	@ltx/en_us_goadedes/miscellanea:misc.Ode6
ltx/en_us_goadedes/me.m10.d17:meMA.Ode6C1T.text	
ltx/en_us_goadedes/me.m10.d17:meMA.Ode6C21.greekmelody	@ltx/en_us_goadedes/he.h.m2:heHE.EnAvyssoPtaismaton.greekname
ltx/en_us_goadedes/me.m10.d17:meMA.Ode6C21.incipit	…
ltx/en_us_goadedes/me.m10.d17:meMA.Ode6C21.melody	@ltx/en_us_goadedes/he.h.m2:heHE.EnAvyssoPtaismaton.name
ltx/en_us_goadedes/me.m10.d17:meMA.Ode6C21.mode	@ltx/en_us_goadedes/miscellanea:misc.Mode2
ltx/en_us_goadedes/me.m10.d17:meMA.Ode6C21.ode	@ltx/en_us_goadedes/miscellanea:misc.Ode6
ltx/en_us_goadedes/me.m10.d17:meMA.Ode6C21.text	
ltx/en_us_goadedes/me.m10.d17:meMA.Ode6C22.incipit	…
ltx/en_us_goadedes/me.m10.d17:meMA.Ode6C22.melody	@ltx/en_us_goadedes/he.h.m2:heHE.EnAvyssoPtaismaton.name
ltx/en_us_goadedes/me.m10.d17:meMA.Ode6C22.mode	@ltx/en_us_goadedes/miscellanea:misc.Mode2
ltx/en_us_goadedes/me.m10.d17:meMA.Ode6C22.ode	@ltx/en_us_goadedes/miscellanea:misc.Ode6
ltx/en_us_goadedes/me.m10.d17:meMA.Ode6C22.text	
ltx/en_us_goadedes/me.m10.d17:meMA.Ode6C23.incipit	…
ltx/en_us_goadedes/me.m10.d17:meMA.Ode6C23.melody	@ltx/en_us_goadedes/he.h.m2:heHE.EnAvyssoPtaismaton.name
ltx/en_us_goadedes/me.m10.d17:meMA.Ode6C23.mode	@ltx/en_us_goadedes/miscellanea:misc.Mode2
ltx/en_us_goadedes/me.m10.d17:meMA.Ode6C23.ode	@ltx/en_us_goadedes/miscellanea:misc.Ode6
ltx/en_us_goadedes/me.m10.d17:meMA.Ode6C23.text	
ltx/en_us_goadedes/me.m10.d17:meMA.Ode6C2T.incipit	…
ltx/en_us_goadedes/me.m10.d17:meMA.Ode6C2T.melody	@ltx/en_us_goadedes/he.h.m2:heHE.EnAvyssoPtaismaton.name
ltx/en_us_goadedes/me.m10.d17:meMA.Ode6C2T.mode	@ltx/en_us_goadedes/miscellanea:misc.Mode2
ltx/en_us_goadedes/me.m10.d17:meMA.Ode6C2T.ode	@ltx/en_us_goadedes/miscellanea:misc.Ode6
ltx/en_us_goadedes/me.m10.d17:meMA.Ode6C2T.text	
ltx/en_us_goadedes/me.m10.d17:meMA.Ode6H.greekmelody	@ltx/en_us_goadedes/he.h.m2:heHE.EnAvyssoPtaismaton.greekname
ltx/en_us_goadedes/me.m10.d17:meMA.Ode6H.incipit	@ltx/en_us_goadedes/he.h.m2:heHE.EnAvyssoPtaismaton.incipit
ltx/en_us_goadedes/me.m10.d17:meMA.Ode6H.melody	@ltx/en_us_goadedes/he.h.m2:heHE.EnAvyssoPtaismaton.melody
ltx/en_us_goadedes/me.m10.d17:meMA.Ode6H.mode	@ltx/en_us_goadedes/miscellanea:misc.Mode2
ltx/en_us_goadedes/me.m10.d17:meMA.Ode6H.ode	@ltx/en_us_goadedes/miscellanea:misc.Ode6
ltx/en_us_goadedes/me.m10.d17:meMA.Ode6H.text	@ltx/en_us_goadedes/he.h.m2:heHE.EnAvyssoPtaismaton.text
ltx/en_us_goadedes/me.m10.d17:meMA.Ode7C11.greekmelody	@ltx/en_us_goadedes/he.h.m1:heHE.AvramiaioiPaides.greekname
ltx/en_us_goadedes/me.m10.d17:meMA.Ode7C11.incipit	…
ltx/en_us_goadedes/me.m10.d17:meMA.Ode7C11.melody	@ltx/en_us_goadedes/he.h.m1:heHE.AvramiaioiPaides.name
ltx/en_us_goadedes/me.m10.d17:meMA.Ode7C11.mode	@ltx/en_us_goadedes/miscellanea:misc.Mode1
ltx/en_us_goadedes/me.m10.d17:meMA.Ode7C11.ode	@ltx/en_us_goadedes/miscellanea:misc.Ode7
ltx/en_us_goadedes/me.m10.d17:meMA.Ode7C11.text	
ltx/en_us_goadedes/me.m10.d17:meMA.Ode7C12.incipit	…
ltx/en_us_goadedes/me.m10.d17:meMA.Ode7C12.melody	@ltx/en_us_goadedes/he.h.m1:heHE.AvramiaioiPaides.name
ltx/en_us_goadedes/me.m10.d17:meMA.Ode7C12.mode	@ltx/en_us_goadedes/miscellanea:misc.Mode1
ltx/en_us_goadedes/me.m10.d17:meMA.Ode7C12.ode	@ltx/en_us_goadedes/miscellanea:misc.Ode7
ltx/en_us_goadedes/me.m10.d17:meMA.Ode7C12.text	
ltx/en_us_goadedes/me.m10.d17:meMA.Ode7C13.incipit	…
ltx/en_us_goadedes/me.m10.d17:meMA.Ode7C13.melody	@ltx/en_us_goadedes/he.h.m1:heHE.AvramiaioiPaides.name
ltx/en_us_goadedes/me.m10.d17:meMA.Ode7C13.mode	@ltx/en_us_goadedes/miscellanea:misc.Mode1
ltx/en_us_goadedes/me.m10.d17:meMA.Ode7C13.ode	@ltx/en_us_goadedes/miscellanea:misc.Ode7
ltx/en_us_goadedes/me.m10.d17:meMA.Ode7C13.text	
ltx/en_us_goadedes/me.m10.d17:meMA.Ode7C1T.incipit	…
ltx/en_us_goadedes/me.m10.d17:meMA.Ode7C1T.melody	@ltx/en_us_goadedes/he.h.m1:heHE.AvramiaioiPaides.name
ltx/en_us_goadedes/me.m10.d17:meMA.Ode7C1T.mode	@ltx/en_us_goadedes/miscellanea:misc.Mode1
ltx/en_us_goadedes/me.m10.d17:meMA.Ode7C1T.ode	@ltx/en_us_goadedes/miscellanea:misc.Ode7
ltx/en_us_goadedes/me.m10.d17:meMA.Ode7C1T.text	
ltx/en_us_goadedes/me.m10.d17:meMA.Ode7C21.greekmelody	@ltx/en_us_goadedes/he.h.m2:heHE.AntitheonProstagma.greekname
ltx/en_us_goadedes/me.m10.d17:meMA.Ode7C21.incipit	…
ltx/en_us_goadedes/me.m10.d17:meMA.Ode7C21.melody	@ltx/en_us_goadedes/he.h.m2:heHE.AntitheonProstagma.name
ltx/en_us_goadedes/me.m10.d17:meMA.Ode7C21.mode	@ltx/en_us_goadedes/miscellanea:misc.Mode2
ltx/en_us_goadedes/me.m10.d17:meMA.Ode7C21.ode	@ltx/en_us_goadedes/miscellanea:misc.Ode7
ltx/en_us_goadedes/me.m10.d17:meMA.Ode7C21.text	
ltx/en_us_goadedes/me.m10.d17:meMA.Ode7C22.incipit	…
ltx/en_us_goadedes/me.m10.d17:meMA.Ode7C22.melody	@ltx/en_us_goadedes/he.h.m2:heHE.AntitheonProstagma.name
ltx/en_us_goadedes/me.m10.d17:meMA.Ode7C22.mode	@ltx/en_us_goadedes/miscellanea:misc.Mode2
ltx/en_us_goadedes/me.m10.d17:meMA.Ode7C22.ode	@ltx/en_us_goadedes/miscellanea:misc.Ode7
ltx/en_us_goadedes/me.m10.d17:meMA.Ode7C22.text	
ltx/en_us_goadedes/me.m10.d17:meMA.Ode7C23.incipit	…
ltx/en_us_goadedes/me.m10.d17:meMA.Ode7C23.melody	@ltx/en_us_goadedes/he.h.m2:heHE.AntitheonProstagma.name
ltx/en_us_goadedes/me.m10.d17:meMA.Ode7C23.mode	@ltx/en_us_goadedes/miscellanea:misc.Mode2
ltx/en_us_goadedes/me.m10.d17:meMA.Ode7C23.ode	@ltx/en_us_goadedes/miscellanea:misc.Ode7
ltx/en_us_goadedes/me.m10.d17:meMA.Ode7C23.text	
ltx/en_us_goadedes/me.m10.d17:meMA.Ode7C2T.incipit	…
ltx/en_us_goadedes/me.m10.d17:meMA.Ode7C2T.melody	@ltx/en_us_goadedes/he.h.m2:heHE.AntitheonProstagma.name
ltx/en_us_goadedes/me.m10.d17:meMA.Ode7C2T.mode	@ltx/en_us_goadedes/miscellanea:misc.Mode2
ltx/en_us_goadedes/me.m10.d17:meMA.Ode7C2T.ode	@ltx/en_us_goadedes/miscellanea:misc.Ode7
ltx/en_us_goadedes/me.m10.d17:meMA.Ode7C2T.text	
ltx/en_us_goadedes/me.m10.d17:meMA.Ode8C11.greekmelody	@ltx/en_us_goadedes/he.h.m1:heHE.TonEnFlogiPyros.greekname
ltx/en_us_goadedes/me.m10.d17:meMA.Ode8C11.incipit	…
ltx/en_us_goadedes/me.m10.d17:meMA.Ode8C11.melody	@ltx/en_us_goadedes/he.h.m1:heHE.TonEnFlogiPyros.name
ltx/en_us_goadedes/me.m10.d17:meMA.Ode8C11.mode	@ltx/en_us_goadedes/miscellanea:misc.Mode1
ltx/en_us_goadedes/me.m10.d17:meMA.Ode8C11.ode	@ltx/en_us_goadedes/miscellanea:misc.Ode8
ltx/en_us_goadedes/me.m10.d17:meMA.Ode8C11.text	
ltx/en_us_goadedes/me.m10.d17:meMA.Ode8C12.incipit	…
ltx/en_us_goadedes/me.m10.d17:meMA.Ode8C12.melody	@ltx/en_us_goadedes/he.h.m1:heHE.TonEnFlogiPyros.name
ltx/en_us_goadedes/me.m10.d17:meMA.Ode8C12.mode	@ltx/en_us_goadedes/miscellanea:misc.Mode1
ltx/en_us_goadedes/me.m10.d17:meMA.Ode8C12.ode	@ltx/en_us_goadedes/miscellanea:misc.Ode8
ltx/en_us_goadedes/me.m10.d17:meMA.Ode8C12.text	
ltx/en_us_goadedes/me.m10.d17:meMA.Ode8C13.incipit	…
ltx/en_us_goadedes/me.m10.d17:meMA.Ode8C13.melody	@ltx/en_us_goadedes/he.h.m1:heHE.TonEnFlogiPyros.name
ltx/en_us_goadedes/me.m10.d17:meMA.Ode8C13.mode	@ltx/en_us_goadedes/miscellanea:misc.Mode1
ltx/en_us_goadedes/me.m10.d17:meMA.Ode8C13.ode	@ltx/en_us_goadedes/miscellanea:misc.Ode8
ltx/en_us_goadedes/me.m10.d17:meMA.Ode8C13.text	
ltx/en_us_goadedes/me.m10.d17:meMA.Ode8C1T.incipit	…
ltx/en_us_goadedes/me.m10.d17:meMA.Ode8C1T.melody	@ltx/en_us_goadedes/he.h.m1:heHE.TonEnFlogiPyros.name
ltx/en_us_goadedes/me.m10.d17:meMA.Ode8C1T.mode	@ltx/en_us_goadedes/miscellanea:misc.Mode1
ltx/en_us_goadedes/me.m10.d17:meMA.Ode8C1T.ode	@ltx/en_us_goadedes/miscellanea:misc.Ode8
ltx/en_us_goadedes/me.m10.d17:meMA.Ode8C1T.text	
ltx/en_us_goadedes/me.m10.d17:meMA.Ode8C21.greekmelody	@ltx/en_us_goadedes/he.h.m2:heHE.KaminosPote.greekname
ltx/en_us_goadedes/me.m10.d17:meMA.Ode8C21.incipit	…
ltx/en_us_goadedes/me.m10.d17:meMA.Ode8C21.melody	@ltx/en_us_goadedes/he.h.m2:heHE.KaminosPote.name
ltx/en_us_goadedes/me.m10.d17:meMA.Ode8C21.mode	@ltx/en_us_goadedes/miscellanea:misc.Mode2
ltx/en_us_goadedes/me.m10.d17:meMA.Ode8C21.ode	@ltx/en_us_goadedes/miscellanea:misc.Ode8
ltx/en_us_goadedes/me.m10.d17:meMA.Ode8C21.text	
ltx/en_us_goadedes/me.m10.d17:meMA.Ode8C22.incipit	…
ltx/en_us_goadedes/me.m10.d17:meMA.Ode8C22.melody	@ltx/en_us_goadedes/he.h.m2:heHE.KaminosPote.name
ltx/en_us_goadedes/me.m10.d17:meMA.Ode8C22.mode	@ltx/en_us_goadedes/miscellanea:misc.Mode2
ltx/en_us_goadedes/me.m10.d17:meMA.Ode8C22.ode	@ltx/en_us_goadedes/miscellanea:misc.Ode8
ltx/en_us_goadedes/me.m10.d17:meMA.Ode8C22.text	
ltx/en_us_goadedes/me.m10.d17:meMA.Ode8C23.incipit	…
ltx/en_us_goadedes/me.m10.d17:meMA.Ode8C23.melody	@ltx/en_us_goadedes/he.h.m2:heHE.KaminosPote.name
ltx/en_us_goadedes/me.m10.d17:meMA.Ode8C23.mode	@ltx/en_us_goadedes/miscellanea:misc.Mode2
ltx/en_us_goadedes/me.m10.d17:meMA.Ode8C23.ode	@ltx/en_us_goadedes/miscellanea:misc.Ode8
ltx/en_us_goadedes/me.m10.d17:meMA.Ode8C23.text	
ltx/en_us_goadedes/me.m10.d17:meMA.Ode8C2T.incipit	…
ltx/en_us_goadedes/me.m10.d17:meMA.Ode8C2T.melody	@ltx/en_us_goadedes/he.h.m2:heHE.KaminosPote.name
ltx/en_us_goadedes/me.m10.d17:meMA.Ode8C2T.mode	@ltx/en_us_goadedes/miscellanea:misc.Mode2
ltx/en_us_goadedes/me.m10.d17:meMA.Ode8C2T.ode	@ltx/en_us_goadedes/miscellanea:misc.Ode8
ltx/en_us_goadedes/me.m10.d17:meMA.Ode8C2T.text	
ltx/en_us_goadedes/me.m10.d17:meMA.Ode8H.greekmelody	@ltx/en_us_goadedes/he.h.m2:heHE.KaminosPote.greekname
ltx/en_us_goadedes/me.m10.d17:meMA.Ode8H.incipit	@ltx/en_us_goadedes/he.h.m2:heHE.KaminosPote.incipit
ltx/en_us_goadedes/me.m10.d17:meMA.Ode8H.melody	@ltx/en_us_goadedes/he.h.m2:heHE.KaminosPote.melody
ltx/en_us_goadedes/me.m10.d17:meMA.Ode8H.mode	@ltx/en_us_goadedes/miscellanea:misc.Mode2
ltx/en_us_goadedes/me.m10.d17:meMA.Ode8H.ode	@ltx/en_us_goadedes/miscellanea:misc.Ode8
ltx/en_us_goadedes/me.m10.d17:meMA.Ode8H.text	@ltx/en_us_goadedes/he.h.m2:heHE.KaminosPote.text
ltx/en_us_goadedes/me.m10.d17:meMA.Ode9C11.greekmelody	@ltx/en_us_goadedes/he.h.m1:heHE.ChaireParthenias.greekname
ltx/en_us_goadedes/me.m10.d17:meMA.Ode9C11.incipit	…
ltx/en_us_goadedes/me.m10.d17:meMA.Ode9C11.melody	@ltx/en_us_goadedes/he.h.m1:heHE.ChaireParthenias.name
ltx/en_us_goadedes/me.m10.d17:meMA.Ode9C11.mode	@ltx/en_us_goadedes/miscellanea:misc.Mode1
ltx/en_us_goadedes/me.m10.d17:meMA.Ode9C11.ode	@ltx/en_us_goadedes/miscellanea:misc.Ode9
ltx/en_us_goadedes/me.m10.d17:meMA.Ode9C11.text	
ltx/en_us_goadedes/me.m10.d17:meMA.Ode9C12.incipit	…
ltx/en_us_goadedes/me.m10.d17:meMA.Ode9C12.melody	@ltx/en_us_goadedes/he.h.m1:heHE.ChaireParthenias.name
ltx/en_us_goadedes/me.m10.d17:meMA.Ode9C12.mode	@ltx/en_us_goadedes/miscellanea:misc.Mode1
ltx/en_us_goadedes/me.m10.d17:meMA.Ode9C12.ode	@ltx/en_us_goadedes/miscellanea:misc.Ode9
ltx/en_us_goadedes/me.m10.d17:meMA.Ode9C12.text	
ltx/en_us_goadedes/me.m10.d17:meMA.Ode9C13.incipit	…
ltx/en_us_goadedes/me.m10.d17:meMA.Ode9C13.melody	@ltx/en_us_goadedes/he.h.m1:heHE.ChaireParthenias.name
ltx/en_us_goadedes/me.m10.d17:meMA.Ode9C13.mode	@ltx/en_us_goadedes/miscellanea:misc.Mode1
ltx/en_us_goadedes/me.m10.d17:meMA.Ode9C13.ode	@ltx/en_us_goadedes/miscellanea:misc.Ode9
ltx/en_us_goadedes/me.m10.d17:meMA.Ode9C13.text	
ltx/en_us_goadedes/me.m10.d17:meMA.Ode9C1T.incipit	…
ltx/en_us_goadedes/me.m10.d17:meMA.Ode9C1T.melody	@ltx/en_us_goadedes/he.h.m1:heHE.ChaireParthenias.name
ltx/en_us_goadedes/me.m10.d17:meMA.Ode9C1T.mode	@ltx/en_us_goadedes/miscellanea:misc.Mode1
ltx/en_us_goadedes/me.m10.d17:meMA.Ode9C1T.ode	@ltx/en_us_goadedes/miscellanea:misc.Ode9
ltx/en_us_goadedes/me.m10.d17:meMA.Ode9C1T.text	
ltx/en_us_goadedes/me.m10.d17:meMA.Ode9C21.greekmelody	@ltx/en_us_goadedes/he.h.m2:heHE.AnarchouGennitoros.greekname
ltx/en_us_goadedes/me.m10.d17:meMA.Ode9C21.incipit	…
ltx/en_us_goadedes/me.m10.d17:meMA.Ode9C21.melody	@ltx/en_us_goadedes/he.h.m2:heHE.AnarchouGennitoros.name
ltx/en_us_goadedes/me.m10.d17:meMA.Ode9C21.mode	@ltx/en_us_goadedes/miscellanea:misc.Mode2
ltx/en_us_goadedes/me.m10.d17:meMA.Ode9C21.ode	@ltx/en_us_goadedes/miscellanea:misc.Ode9
ltx/en_us_goadedes/me.m10.d17:meMA.Ode9C21.text	
ltx/en_us_goadedes/me.m10.d17:meMA.Ode9C22.incipit	…
ltx/en_us_goadedes/me.m10.d17:meMA.Ode9C22.melody	@ltx/en_us_goadedes/he.h.m2:heHE.AnarchouGennitoros.name
ltx/en_us_goadedes/me.m10.d17:meMA.Ode9C22.mode	@ltx/en_us_goadedes/miscellanea:misc.Mode2
ltx/en_us_goadedes/me.m10.d17:meMA.Ode9C22.ode	@ltx/en_us_goadedes/miscellanea:misc.Ode9
ltx/en_us_goadedes/me.m10.d17:meMA.Ode9C22.text	
ltx/en_us_goadedes/me.m10.d17:meMA.Ode9C23.incipit	…
ltx/en_us_goadedes/me.m10.d17:meMA.Ode9C23.melody	@ltx/en_us_goadedes/he.h.m2:heHE.AnarchouGennitoros.name
ltx/en_us_goadedes/me.m10.d17:meMA.Ode9C23.mode	@ltx/en_us_goadedes/miscellanea:misc.Mode2
ltx/en_us_goadedes/me.m10.d17:meMA.Ode9C23.ode	@ltx/en_us_goadedes/miscellanea:misc.Ode9
ltx/en_us_goadedes/me.m10.d17:meMA.Ode9C23.text	
ltx/en_us_goadedes/me.m10.d17:meMA.Ode9C24.incipit	…
ltx/en_us_goadedes/me.m10.d17:meMA.Ode9C24.melody	@ltx/en_us_goadedes/he.h.m2:heHE.AnarchouGennitoros.name
ltx/en_us_goadedes/me.m10.d17:meMA.Ode9C24.mode	@ltx/en_us_goadedes/miscellanea:misc.Mode2
ltx/en_us_goadedes/me.m10.d17:meMA.Ode9C24.ode	@ltx/en_us_goadedes/miscellanea:misc.Ode9
ltx/en_us_goadedes/me.m10.d17:meMA.Ode9C24.text	
ltx/en_us_goadedes/me.m10.d17:meMA.Ode9C2T.incipit	…
ltx/en_us_goadedes/me.m10.d17:meMA.Ode9C2T.melody	@ltx/en_us_goadedes/he.h.m2:heHE.AnarchouGennitoros.name
ltx/en_us_goadedes/me.m10.d17:meMA.Ode9C2T.mode	@ltx/en_us_goadedes/miscellanea:misc.Mode2
ltx/en_us_goadedes/me.m10.d17:meMA.Ode9C2T.ode	@ltx/en_us_goadedes/miscellanea:misc.Ode9
ltx/en_us_goadedes/me.m10.d17:meMA.Ode9C2T.text	
ltx/en_us_goadedes/me.m10.d17:meMA.Ode9H.greekmelody	@ltx/en_us_goadedes/he.h.m2:heHE.AnarchouGennitoros.greekname
ltx/en_us_goadedes/me.m10.d17:meMA.Ode9H.incipit	@ltx/en_us_goadedes/he.h.m2:heHE.AnarchouGennitoros.incipit
ltx/en_us_goadedes/me.m10.d17:meMA.Ode9H.melody	@ltx/en_us_goadedes/he.h.m2:heHE.AnarchouGennitoros.melody
ltx/en_us_goadedes/me.m10.d17:meMA.Ode9H.mode	@ltx/en_us_goadedes/miscellanea:misc.Mode2
ltx/en_us_goadedes/me.m10.d17:meMA.Ode9H.ode	@ltx/en_us_goadedes/miscellanea:misc.Ode9
ltx/en_us_goadedes/me.m10.d17:meMA.Ode9H.text	@ltx/en_us_goadedes/he.h.m2:heHE.AnarchouGennitoros.text
ltx/en_us_goadedes/me.m10.d17:meMA.Oikos1.text	
ltx/en_us_goadedes/me.m10.d17:meVE.Apolytikion1.melody	@ltx/en_us_goadedes/he.ga:heGA.TouProfitouSou.name
ltx/en_us_goadedes/me.m10.d17:meVE.Apolytikion1.mode	@ltx/en_us_goadedes/miscellanea:misc.Mode2
ltx/en_us_goadedes/me.m10.d17:meVE.Apolytikion2.greekmelody	@ltx/en_us_goadedes/he.a.m4:heAU.OYpsotheisEnToStavro.greekname
ltx/en_us_goadedes/me.m10.d17:meVE.Apolytikion2.incipit	…
ltx/en_us_goadedes/me.m10.d17:meVE.Apolytikion2.melody	@ltx/en_us_goadedes/he.a.m4:heAU.OYpsotheisEnToStavro.name
ltx/en_us_goadedes/me.m10.d17:meVE.Apolytikion2.mode	@ltx/en_us_goadedes/miscellanea:misc.Mode4
ltx/en_us_goadedes/me.m10.d17:meVE.Apolytikion2.text	
ltx/en_us_goadedes/me.m10.d17:meVE.GeneralApolytikion1.name	
ltx/en_us_goadedes/me.m10.d17:meVE.SticStavrotheotokion.greekmelody	@ltx/en_us_goadedes/he.a.m4:heAU.OsGennaionEnMartysi.greekname
ltx/en_us_goadedes/me.m10.d17:meVE.SticStavrotheotokion.incipit	@ltx/en_us_goadedes/me.m10.d09:meVE.SticStavrotheotokion.incipit
ltx/en_us_goadedes/me.m10.d17:meVE.SticStavrotheotokion.melody	@ltx/en_us_goadedes/he.a.m4:heAU.OsGennaionEnMartysi.name
ltx/en_us_goadedes/me.m10.d17:meVE.SticStavrotheotokion.mode	@ltx/en_us_goadedes/miscellanea:misc.Mode4
ltx/en_us_goadedes/me.m10.d17:meVE.SticStavrotheotokion.text	@ltx/en_us_goadedes/me.m10.d09:meVE.SticStavrotheotokion.text
ltx/en_us_goadedes/me.m10.d17:meVE.SticTheotokion.greekmelody	@ltx/en_us_goadedes/he.a.m4:heAU.OsGennaionEnMartysi.greekname
ltx/en_us_goadedes/me.m10.d17:meVE.SticTheotokion.incipit	O immaculate Virgin pure…
ltx/en_us_goadedes/me.m10.d17:meVE.SticTheotokion.melody	@ltx/en_us_goadedes/he.a.m4:heAU.OsGennaionEnMartysi.name
ltx/en_us_goadedes/me.m10.d17:meVE.SticTheotokion.mode	@ltx/en_us_goadedes/miscellanea:misc.Mode4
ltx/en_us_goadedes/me.m10.d17:meVE.SticTheotokion.text	O immaculate Virgin pure, * many times I have promised God, * that I would repent of my trespasses and sins. * But I am hampered from doing this * by bad habits I acquired. * That is why on bended knees * I implore you and cry aloud: * O my Lady, please, * get me out of this bondage, and direct me to the ways of self-improvement * and to whatever will save my soul.
ltx/en_us_goadedes/me.m10.d17:meVE.Stichera01.greekmelody	@ltx/en_us_goadedes/he.a.m1:heAU.PaneffimoiMartyres.greekname
ltx/en_us_goadedes/me.m10.d17:meVE.Stichera01.incipit	…
ltx/en_us_goadedes/me.m10.d17:meVE.Stichera01.melody	@ltx/en_us_goadedes/he.a.m1:heAU.PaneffimoiMartyres.name
ltx/en_us_goadedes/me.m10.d17:meVE.Stichera01.mode	@ltx/en_us_goadedes/miscellanea:misc.Mode1
ltx/en_us_goadedes/me.m10.d17:meVE.Stichera01.text	
ltx/en_us_goadedes/me.m10.d17:meVE.Stichera02.incipit	…
ltx/en_us_goadedes/me.m10.d17:meVE.Stichera02.melody	@ltx/en_us_goadedes/he.a.m1:heAU.PaneffimoiMartyres.name
ltx/en_us_goadedes/me.m10.d17:meVE.Stichera02.mode	@ltx/en_us_goadedes/miscellanea:misc.Mode1
ltx/en_us_goadedes/me.m10.d17:meVE.Stichera02.text	
ltx/en_us_goadedes/me.m10.d17:meVE.Stichera03.incipit	…
ltx/en_us_goadedes/me.m10.d17:meVE.Stichera03.melody	@ltx/en_us_goadedes/he.a.m1:heAU.PaneffimoiMartyres.name
ltx/en_us_goadedes/me.m10.d17:meVE.Stichera03.mode	@ltx/en_us_goadedes/miscellanea:misc.Mode1
ltx/en_us_goadedes/me.m10.d17:meVE.Stichera03.text	
ltx/en_us_goadedes/me.m10.d17:meVE.Stichera04.greekmelody	@ltx/en_us_goadedes/he.a.m4:heAU.OsGennaionEnMartysi.greekname
ltx/en_us_goadedes/me.m10.d17:meVE.Stichera04.incipit	…
ltx/en_us_goadedes/me.m10.d17:meVE.Stichera04.melody	@ltx/en_us_goadedes/he.a.m4:heAU.OsGennaionEnMartysi.name
ltx/en_us_goadedes/me.m10.d17:meVE.Stichera04.mode	@ltx/en_us_goadedes/miscellanea:misc.Mode4
ltx/en_us_goadedes/me.m10.d17:meVE.Stichera04.text	
ltx/en_us_goadedes/me.m10.d17:meVE.Stichera05.incipit	…
ltx/en_us_goadedes/me.m10.d17:meVE.Stichera05.melody	@ltx/en_us_goadedes/he.a.m4:heAU.OsGennaionEnMartysi.name
ltx/en_us_goadedes/me.m10.d17:meVE.Stichera05.mode	@ltx/en_us_goadedes/miscellanea:misc.Mode4
ltx/en_us_goadedes/me.m10.d17:meVE.Stichera05.text	
ltx/en_us_goadedes/me.m10.d17:meVE.Stichera06.incipit	…
ltx/en_us_goadedes/me.m10.d17:meVE.Stichera06.melody	@ltx/en_us_goadedes/he.a.m4:heAU.OsGennaionEnMartysi.name
ltx/en_us_goadedes/me.m10.d17:meVE.Stichera06.mode	@ltx/en_us_goadedes/miscellanea:misc.Mode4
ltx/en_us_goadedes/me.m10.d17:meVE.Stichera06.text	
