ltx/en_us_goadedes/me.m05.d10:meDA.commemoration.first	
ltx/en_us_goadedes/me.m05.d10:meDA.commemoration.first_name	
ltx/en_us_goadedes/me.m05.d10:meDA.commemoration.first_short	
ltx/en_us_goadedes/me.m05.d10:meDA.commemoration.first_title	@ltx/en_us_goadedes/titles:ti.Apostle
ltx/en_us_goadedes/me.m05.d10:meDA.commemoration.full	
ltx/en_us_goadedes/me.m05.d10:meDA.commemoration.second_name	
ltx/en_us_goadedes/me.m05.d10:meDA.commemoration.second_title	
ltx/en_us_goadedes/me.m05.d10:meDA.date	
ltx/en_us_goadedes/me.m05.d10:meDA.fordate	
ltx/en_us_goadedes/me.m05.d10:meDA.insert1	
ltx/en_us_goadedes/me.m05.d10:meDA.insert2	
ltx/en_us_goadedes/me.m05.d10:meDA.note	
ltx/en_us_goadedes/me.m05.d10:meDA.pdfcoverdate	
ltx/en_us_goadedes/me.m05.d10:meDA.pdfheaderdate	
ltx/en_us_goadedes/me.m05.d10:meHO.commemorations	
ltx/en_us_goadedes/me.m05.d10:meHO.note1	
ltx/en_us_goadedes/me.m05.d10:meHO.note2	
ltx/en_us_goadedes/me.m05.d10:meHO.number	
ltx/en_us_goadedes/me.m05.d10:meHO.rank	
ltx/en_us_goadedes/me.m05.d10:meLE.commemoration1	
ltx/en_us_goadedes/me.m05.d10:meLE.commemoration2	
ltx/en_us_goadedes/me.m05.d10:meLI.Kontakion1.greekmelody	@ltx/en_us_goadedes/me.m05.d10:meMA.Kontakion1.greekmelody
ltx/en_us_goadedes/me.m05.d10:meLI.Kontakion1.incipit	@ltx/en_us_goadedes/me.m05.d10:meMA.Kontakion1.incipit
ltx/en_us_goadedes/me.m05.d10:meLI.Kontakion1.melody	@ltx/en_us_goadedes/me.m05.d10:meMA.Kontakion1.melody
ltx/en_us_goadedes/me.m05.d10:meLI.Kontakion1.mode	@ltx/en_us_goadedes/me.m05.d10:meMA.Kontakion1.mode
ltx/en_us_goadedes/me.m05.d10:meLI.Kontakion1.text	@ltx/en_us_goadedes/me.m05.d10:meMA.Kontakion1.text
ltx/en_us_goadedes/me.m05.d10:meLI.MM.CommunionHymn.text	@ltx/en_us_goadedes/properties:media.key
ltx/en_us_goadedes/me.m05.d10:meLI.Megalynarion.text	
ltx/en_us_goadedes/me.m05.d10:meMA.C1.acrostic.notice1	
ltx/en_us_goadedes/me.m05.d10:meMA.C1.acrostic.text	
ltx/en_us_goadedes/me.m05.d10:meMA.C1.acrostic.title	
ltx/en_us_goadedes/me.m05.d10:meMA.C1.poet	@ltx/en_us_goadedes/poets:po.Theofanous
ltx/en_us_goadedes/me.m05.d10:meMA.C1.title	@ltx/en_us_goadedes/titles:ti.CanonApostle
ltx/en_us_goadedes/me.m05.d10:meMA.C1.verse	@ltx/en_us_goadedes/prayers:pr.verse_Apostle.text
ltx/en_us_goadedes/me.m05.d10:meMA.Exaposteilarion1.greekmelody	@ltx/en_us_goadedes/he.a.m2:heAU.GynaikesAkoutisthite.greekname
ltx/en_us_goadedes/me.m05.d10:meMA.Exaposteilarion1.incipit	…
ltx/en_us_goadedes/me.m05.d10:meMA.Exaposteilarion1.melody	@ltx/en_us_goadedes/he.a.m2:heAU.GynaikesAkoutisthite.name
ltx/en_us_goadedes/me.m05.d10:meMA.Exaposteilarion1.mode	@ltx/en_us_goadedes/miscellanea:misc.Mode2
ltx/en_us_goadedes/me.m05.d10:meMA.Exaposteilarion1.text	
ltx/en_us_goadedes/me.m05.d10:meMA.Kontakion1.greekmelody	@ltx/en_us_goadedes/he.a.m2:heAU.TousAsfaleis.greekname
ltx/en_us_goadedes/me.m05.d10:meMA.Kontakion1.incipit	…
ltx/en_us_goadedes/me.m05.d10:meMA.Kontakion1.melody	@ltx/en_us_goadedes/he.a.m2:heAU.TousAsfaleis.name
ltx/en_us_goadedes/me.m05.d10:meMA.Kontakion1.mode	@ltx/en_us_goadedes/miscellanea:misc.Mode2
ltx/en_us_goadedes/me.m05.d10:meMA.Kontakion1.text	
ltx/en_us_goadedes/me.m05.d10:meMA.Lauds1.greekmelody	@ltx/en_us_goadedes/he.a.m4:heAU.OsGennaionEnMartysi.greekname
ltx/en_us_goadedes/me.m05.d10:meMA.Lauds1.incipit	…
ltx/en_us_goadedes/me.m05.d10:meMA.Lauds1.melody	@ltx/en_us_goadedes/he.a.m4:heAU.OsGennaionEnMartysi.name
ltx/en_us_goadedes/me.m05.d10:meMA.Lauds1.mode	@ltx/en_us_goadedes/miscellanea:misc.Mode4
ltx/en_us_goadedes/me.m05.d10:meMA.Lauds1.text	
ltx/en_us_goadedes/me.m05.d10:meMA.Lauds2.incipit	…
ltx/en_us_goadedes/me.m05.d10:meMA.Lauds2.melody	@ltx/en_us_goadedes/he.a.m4:heAU.OsGennaionEnMartysi.name
ltx/en_us_goadedes/me.m05.d10:meMA.Lauds2.mode	@ltx/en_us_goadedes/miscellanea:misc.Mode4
ltx/en_us_goadedes/me.m05.d10:meMA.Lauds2.text	
ltx/en_us_goadedes/me.m05.d10:meMA.Lauds3.incipit	…
ltx/en_us_goadedes/me.m05.d10:meMA.Lauds3.melody	@ltx/en_us_goadedes/he.a.m4:heAU.OsGennaionEnMartysi.name
ltx/en_us_goadedes/me.m05.d10:meMA.Lauds3.mode	@ltx/en_us_goadedes/miscellanea:misc.Mode4
ltx/en_us_goadedes/me.m05.d10:meMA.Lauds3.text	
ltx/en_us_goadedes/me.m05.d10:meMA.LaudsGlory.incipit	…
ltx/en_us_goadedes/me.m05.d10:meMA.LaudsGlory.melody	
ltx/en_us_goadedes/me.m05.d10:meMA.LaudsGlory.mode	@ltx/en_us_goadedes/miscellanea:misc.Mode8
ltx/en_us_goadedes/me.m05.d10:meMA.LaudsGlory.text	
ltx/en_us_goadedes/me.m05.d10:meMA.Ode1C11.greekmelody	@ltx/en_us_goadedes/he.h.m8:heHE.AsmaAnapempsomen.greekname
ltx/en_us_goadedes/me.m05.d10:meMA.Ode1C11.incipit	…
ltx/en_us_goadedes/me.m05.d10:meMA.Ode1C11.melody	@ltx/en_us_goadedes/he.h.m8:heHE.AsmaAnapempsomen.name
ltx/en_us_goadedes/me.m05.d10:meMA.Ode1C11.mode	@ltx/en_us_goadedes/miscellanea:misc.Mode8
ltx/en_us_goadedes/me.m05.d10:meMA.Ode1C11.ode	@ltx/en_us_goadedes/miscellanea:misc.Ode1
ltx/en_us_goadedes/me.m05.d10:meMA.Ode1C11.text	
ltx/en_us_goadedes/me.m05.d10:meMA.Ode1C12.incipit	…
ltx/en_us_goadedes/me.m05.d10:meMA.Ode1C12.melody	@ltx/en_us_goadedes/he.h.m8:heHE.AsmaAnapempsomen.name
ltx/en_us_goadedes/me.m05.d10:meMA.Ode1C12.mode	@ltx/en_us_goadedes/miscellanea:misc.Mode8
ltx/en_us_goadedes/me.m05.d10:meMA.Ode1C12.ode	@ltx/en_us_goadedes/miscellanea:misc.Ode1
ltx/en_us_goadedes/me.m05.d10:meMA.Ode1C12.text	
ltx/en_us_goadedes/me.m05.d10:meMA.Ode1C13.incipit	…
ltx/en_us_goadedes/me.m05.d10:meMA.Ode1C13.melody	@ltx/en_us_goadedes/he.h.m8:heHE.AsmaAnapempsomen.name
ltx/en_us_goadedes/me.m05.d10:meMA.Ode1C13.mode	@ltx/en_us_goadedes/miscellanea:misc.Mode8
ltx/en_us_goadedes/me.m05.d10:meMA.Ode1C13.ode	@ltx/en_us_goadedes/miscellanea:misc.Ode1
ltx/en_us_goadedes/me.m05.d10:meMA.Ode1C13.text	
ltx/en_us_goadedes/me.m05.d10:meMA.Ode1C1T.incipit	…
ltx/en_us_goadedes/me.m05.d10:meMA.Ode1C1T.melody	@ltx/en_us_goadedes/he.h.m8:heHE.AsmaAnapempsomen.name
ltx/en_us_goadedes/me.m05.d10:meMA.Ode1C1T.mode	@ltx/en_us_goadedes/miscellanea:misc.Mode8
ltx/en_us_goadedes/me.m05.d10:meMA.Ode1C1T.ode	@ltx/en_us_goadedes/miscellanea:misc.Ode1
ltx/en_us_goadedes/me.m05.d10:meMA.Ode1C1T.text	
ltx/en_us_goadedes/me.m05.d10:meMA.Ode3C11.greekmelody	@ltx/en_us_goadedes/he.h.m8:heHE.OukEstinAgios.greekname
ltx/en_us_goadedes/me.m05.d10:meMA.Ode3C11.incipit	…
ltx/en_us_goadedes/me.m05.d10:meMA.Ode3C11.melody	@ltx/en_us_goadedes/he.h.m8:heHE.OukEstinAgios.name
ltx/en_us_goadedes/me.m05.d10:meMA.Ode3C11.mode	@ltx/en_us_goadedes/miscellanea:misc.Mode8
ltx/en_us_goadedes/me.m05.d10:meMA.Ode3C11.ode	@ltx/en_us_goadedes/miscellanea:misc.Ode3
ltx/en_us_goadedes/me.m05.d10:meMA.Ode3C11.text	
ltx/en_us_goadedes/me.m05.d10:meMA.Ode3C12.incipit	…
ltx/en_us_goadedes/me.m05.d10:meMA.Ode3C12.melody	@ltx/en_us_goadedes/he.h.m8:heHE.OukEstinAgios.name
ltx/en_us_goadedes/me.m05.d10:meMA.Ode3C12.mode	@ltx/en_us_goadedes/miscellanea:misc.Mode8
ltx/en_us_goadedes/me.m05.d10:meMA.Ode3C12.ode	@ltx/en_us_goadedes/miscellanea:misc.Ode3
ltx/en_us_goadedes/me.m05.d10:meMA.Ode3C12.text	
ltx/en_us_goadedes/me.m05.d10:meMA.Ode3C1T.incipit	…
ltx/en_us_goadedes/me.m05.d10:meMA.Ode3C1T.melody	@ltx/en_us_goadedes/he.h.m8:heHE.OukEstinAgios.name
ltx/en_us_goadedes/me.m05.d10:meMA.Ode3C1T.mode	@ltx/en_us_goadedes/miscellanea:misc.Mode8
ltx/en_us_goadedes/me.m05.d10:meMA.Ode3C1T.ode	@ltx/en_us_goadedes/miscellanea:misc.Ode3
ltx/en_us_goadedes/me.m05.d10:meMA.Ode3C1T.text	
ltx/en_us_goadedes/me.m05.d10:meMA.Ode3H.greekmelody	@ltx/en_us_goadedes/he.h.m8:heHE.OukEstinAgios.greekname
ltx/en_us_goadedes/me.m05.d10:meMA.Ode3H.incipit	@ltx/en_us_goadedes/he.h.m8:heHE.OukEstinAgios.incipit
ltx/en_us_goadedes/me.m05.d10:meMA.Ode3H.melody	@ltx/en_us_goadedes/he.h.m8:heHE.OukEstinAgios.melody
ltx/en_us_goadedes/me.m05.d10:meMA.Ode3H.mode	@ltx/en_us_goadedes/miscellanea:misc.Mode8
ltx/en_us_goadedes/me.m05.d10:meMA.Ode3H.ode	@ltx/en_us_goadedes/miscellanea:misc.Ode3
ltx/en_us_goadedes/me.m05.d10:meMA.Ode3H.text	@ltx/en_us_goadedes/he.h.m8:heHE.OukEstinAgios.text
ltx/en_us_goadedes/me.m05.d10:meMA.Ode3Kathisma1.greekmelody	@ltx/en_us_goadedes/he.a.m3:heAU.TheiasPisteos.greekname
ltx/en_us_goadedes/me.m05.d10:meMA.Ode3Kathisma1.incipit	…
ltx/en_us_goadedes/me.m05.d10:meMA.Ode3Kathisma1.melody	@ltx/en_us_goadedes/he.a.m3:heAU.TheiasPisteos.name
ltx/en_us_goadedes/me.m05.d10:meMA.Ode3Kathisma1.mode	@ltx/en_us_goadedes/miscellanea:misc.Mode3
ltx/en_us_goadedes/me.m05.d10:meMA.Ode3Kathisma1.text	
ltx/en_us_goadedes/me.m05.d10:meMA.Ode4C11.greekmelody	@ltx/en_us_goadedes/he.h.m8:heHE.ExOrousKataskiou.greekname
ltx/en_us_goadedes/me.m05.d10:meMA.Ode4C11.incipit	…
ltx/en_us_goadedes/me.m05.d10:meMA.Ode4C11.melody	@ltx/en_us_goadedes/he.h.m8:heHE.ExOrousKataskiou.name
ltx/en_us_goadedes/me.m05.d10:meMA.Ode4C11.mode	@ltx/en_us_goadedes/miscellanea:misc.Mode8
ltx/en_us_goadedes/me.m05.d10:meMA.Ode4C11.ode	@ltx/en_us_goadedes/miscellanea:misc.Ode4
ltx/en_us_goadedes/me.m05.d10:meMA.Ode4C11.text	
ltx/en_us_goadedes/me.m05.d10:meMA.Ode4C12.incipit	…
ltx/en_us_goadedes/me.m05.d10:meMA.Ode4C12.melody	@ltx/en_us_goadedes/he.h.m8:heHE.ExOrousKataskiou.name
ltx/en_us_goadedes/me.m05.d10:meMA.Ode4C12.mode	@ltx/en_us_goadedes/miscellanea:misc.Mode8
ltx/en_us_goadedes/me.m05.d10:meMA.Ode4C12.ode	@ltx/en_us_goadedes/miscellanea:misc.Ode4
ltx/en_us_goadedes/me.m05.d10:meMA.Ode4C12.text	
ltx/en_us_goadedes/me.m05.d10:meMA.Ode4C13.incipit	…
ltx/en_us_goadedes/me.m05.d10:meMA.Ode4C13.melody	@ltx/en_us_goadedes/he.h.m8:heHE.ExOrousKataskiou.name
ltx/en_us_goadedes/me.m05.d10:meMA.Ode4C13.mode	@ltx/en_us_goadedes/miscellanea:misc.Mode8
ltx/en_us_goadedes/me.m05.d10:meMA.Ode4C13.ode	@ltx/en_us_goadedes/miscellanea:misc.Ode4
ltx/en_us_goadedes/me.m05.d10:meMA.Ode4C13.text	
ltx/en_us_goadedes/me.m05.d10:meMA.Ode4C1T.incipit	…
ltx/en_us_goadedes/me.m05.d10:meMA.Ode4C1T.melody	@ltx/en_us_goadedes/he.h.m8:heHE.ExOrousKataskiou.name
ltx/en_us_goadedes/me.m05.d10:meMA.Ode4C1T.mode	@ltx/en_us_goadedes/miscellanea:misc.Mode8
ltx/en_us_goadedes/me.m05.d10:meMA.Ode4C1T.ode	@ltx/en_us_goadedes/miscellanea:misc.Ode4
ltx/en_us_goadedes/me.m05.d10:meMA.Ode4C1T.text	
ltx/en_us_goadedes/me.m05.d10:meMA.Ode5C11.greekmelody	@ltx/en_us_goadedes/he.h.m8:heHE.OEkNyktosAgnoias.greekname
ltx/en_us_goadedes/me.m05.d10:meMA.Ode5C11.incipit	…
ltx/en_us_goadedes/me.m05.d10:meMA.Ode5C11.melody	@ltx/en_us_goadedes/he.h.m8:heHE.OEkNyktosAgnoias.name
ltx/en_us_goadedes/me.m05.d10:meMA.Ode5C11.mode	@ltx/en_us_goadedes/miscellanea:misc.Mode8
ltx/en_us_goadedes/me.m05.d10:meMA.Ode5C11.ode	@ltx/en_us_goadedes/miscellanea:misc.Ode5
ltx/en_us_goadedes/me.m05.d10:meMA.Ode5C11.text	
ltx/en_us_goadedes/me.m05.d10:meMA.Ode5C12.incipit	…
ltx/en_us_goadedes/me.m05.d10:meMA.Ode5C12.melody	@ltx/en_us_goadedes/he.h.m8:heHE.OEkNyktosAgnoias.name
ltx/en_us_goadedes/me.m05.d10:meMA.Ode5C12.mode	@ltx/en_us_goadedes/miscellanea:misc.Mode8
ltx/en_us_goadedes/me.m05.d10:meMA.Ode5C12.ode	@ltx/en_us_goadedes/miscellanea:misc.Ode5
ltx/en_us_goadedes/me.m05.d10:meMA.Ode5C12.text	
ltx/en_us_goadedes/me.m05.d10:meMA.Ode5C1T.incipit	…
ltx/en_us_goadedes/me.m05.d10:meMA.Ode5C1T.melody	@ltx/en_us_goadedes/he.h.m8:heHE.OEkNyktosAgnoias.name
ltx/en_us_goadedes/me.m05.d10:meMA.Ode5C1T.mode	@ltx/en_us_goadedes/miscellanea:misc.Mode8
ltx/en_us_goadedes/me.m05.d10:meMA.Ode5C1T.ode	@ltx/en_us_goadedes/miscellanea:misc.Ode5
ltx/en_us_goadedes/me.m05.d10:meMA.Ode5C1T.text	
ltx/en_us_goadedes/me.m05.d10:meMA.Ode6C11.greekmelody	@ltx/en_us_goadedes/he.h.m8:heHE.ChitonaMoiParaschou.greekname
ltx/en_us_goadedes/me.m05.d10:meMA.Ode6C11.incipit	…
ltx/en_us_goadedes/me.m05.d10:meMA.Ode6C11.melody	@ltx/en_us_goadedes/he.h.m8:heHE.ChitonaMoiParaschou.name
ltx/en_us_goadedes/me.m05.d10:meMA.Ode6C11.mode	@ltx/en_us_goadedes/miscellanea:misc.Mode8
ltx/en_us_goadedes/me.m05.d10:meMA.Ode6C11.ode	@ltx/en_us_goadedes/miscellanea:misc.Ode6
ltx/en_us_goadedes/me.m05.d10:meMA.Ode6C11.text	
ltx/en_us_goadedes/me.m05.d10:meMA.Ode6C12.incipit	…
ltx/en_us_goadedes/me.m05.d10:meMA.Ode6C12.melody	@ltx/en_us_goadedes/he.h.m8:heHE.ChitonaMoiParaschou.name
ltx/en_us_goadedes/me.m05.d10:meMA.Ode6C12.mode	@ltx/en_us_goadedes/miscellanea:misc.Mode8
ltx/en_us_goadedes/me.m05.d10:meMA.Ode6C12.ode	@ltx/en_us_goadedes/miscellanea:misc.Ode6
ltx/en_us_goadedes/me.m05.d10:meMA.Ode6C12.text	
ltx/en_us_goadedes/me.m05.d10:meMA.Ode6C1T.incipit	…
ltx/en_us_goadedes/me.m05.d10:meMA.Ode6C1T.melody	@ltx/en_us_goadedes/he.h.m8:heHE.ChitonaMoiParaschou.name
ltx/en_us_goadedes/me.m05.d10:meMA.Ode6C1T.mode	@ltx/en_us_goadedes/miscellanea:misc.Mode8
ltx/en_us_goadedes/me.m05.d10:meMA.Ode6C1T.ode	@ltx/en_us_goadedes/miscellanea:misc.Ode6
ltx/en_us_goadedes/me.m05.d10:meMA.Ode6C1T.text	
ltx/en_us_goadedes/me.m05.d10:meMA.Ode6H.greekmelody	@ltx/en_us_goadedes/he.h.m8:heHE.ChitonaMoiParaschou.greekname
ltx/en_us_goadedes/me.m05.d10:meMA.Ode6H.incipit	@ltx/en_us_goadedes/he.h.m8:heHE.ChitonaMoiParaschou.incipit
ltx/en_us_goadedes/me.m05.d10:meMA.Ode6H.melody	@ltx/en_us_goadedes/he.h.m8:heHE.ChitonaMoiParaschou.melody
ltx/en_us_goadedes/me.m05.d10:meMA.Ode6H.mode	@ltx/en_us_goadedes/miscellanea:misc.Mode8
ltx/en_us_goadedes/me.m05.d10:meMA.Ode6H.ode	@ltx/en_us_goadedes/miscellanea:misc.Ode6
ltx/en_us_goadedes/me.m05.d10:meMA.Ode6H.text	@ltx/en_us_goadedes/he.h.m8:heHE.ChitonaMoiParaschou.text
ltx/en_us_goadedes/me.m05.d10:meMA.Ode7C11.greekmelody	@ltx/en_us_goadedes/he.h.m8:heHE.PaidesEvraion.greekname
ltx/en_us_goadedes/me.m05.d10:meMA.Ode7C11.incipit	…
ltx/en_us_goadedes/me.m05.d10:meMA.Ode7C11.melody	@ltx/en_us_goadedes/he.h.m8:heHE.PaidesEvraion.name
ltx/en_us_goadedes/me.m05.d10:meMA.Ode7C11.mode	@ltx/en_us_goadedes/miscellanea:misc.Mode8
ltx/en_us_goadedes/me.m05.d10:meMA.Ode7C11.ode	@ltx/en_us_goadedes/miscellanea:misc.Ode7
ltx/en_us_goadedes/me.m05.d10:meMA.Ode7C11.text	
ltx/en_us_goadedes/me.m05.d10:meMA.Ode7C12.incipit	…
ltx/en_us_goadedes/me.m05.d10:meMA.Ode7C12.melody	@ltx/en_us_goadedes/he.h.m8:heHE.PaidesEvraion.name
ltx/en_us_goadedes/me.m05.d10:meMA.Ode7C12.mode	@ltx/en_us_goadedes/miscellanea:misc.Mode8
ltx/en_us_goadedes/me.m05.d10:meMA.Ode7C12.ode	@ltx/en_us_goadedes/miscellanea:misc.Ode7
ltx/en_us_goadedes/me.m05.d10:meMA.Ode7C12.text	
ltx/en_us_goadedes/me.m05.d10:meMA.Ode7C1T.incipit	…
ltx/en_us_goadedes/me.m05.d10:meMA.Ode7C1T.melody	@ltx/en_us_goadedes/he.h.m8:heHE.PaidesEvraion.name
ltx/en_us_goadedes/me.m05.d10:meMA.Ode7C1T.mode	@ltx/en_us_goadedes/miscellanea:misc.Mode8
ltx/en_us_goadedes/me.m05.d10:meMA.Ode7C1T.ode	@ltx/en_us_goadedes/miscellanea:misc.Ode7
ltx/en_us_goadedes/me.m05.d10:meMA.Ode7C1T.text	
ltx/en_us_goadedes/me.m05.d10:meMA.Ode8C11.greekmelody	@ltx/en_us_goadedes/he.h.m8:heHE.MousikonOrganon.greekname
ltx/en_us_goadedes/me.m05.d10:meMA.Ode8C11.incipit	…
ltx/en_us_goadedes/me.m05.d10:meMA.Ode8C11.melody	@ltx/en_us_goadedes/he.h.m8:heHE.MousikonOrganon.name
ltx/en_us_goadedes/me.m05.d10:meMA.Ode8C11.mode	@ltx/en_us_goadedes/miscellanea:misc.Mode8
ltx/en_us_goadedes/me.m05.d10:meMA.Ode8C11.ode	@ltx/en_us_goadedes/miscellanea:misc.Ode8
ltx/en_us_goadedes/me.m05.d10:meMA.Ode8C11.text	
ltx/en_us_goadedes/me.m05.d10:meMA.Ode8C12.incipit	…
ltx/en_us_goadedes/me.m05.d10:meMA.Ode8C12.melody	@ltx/en_us_goadedes/he.h.m8:heHE.MousikonOrganon.name
ltx/en_us_goadedes/me.m05.d10:meMA.Ode8C12.mode	@ltx/en_us_goadedes/miscellanea:misc.Mode8
ltx/en_us_goadedes/me.m05.d10:meMA.Ode8C12.ode	@ltx/en_us_goadedes/miscellanea:misc.Ode8
ltx/en_us_goadedes/me.m05.d10:meMA.Ode8C12.text	
ltx/en_us_goadedes/me.m05.d10:meMA.Ode8C1T.incipit	…
ltx/en_us_goadedes/me.m05.d10:meMA.Ode8C1T.melody	@ltx/en_us_goadedes/he.h.m8:heHE.MousikonOrganon.name
ltx/en_us_goadedes/me.m05.d10:meMA.Ode8C1T.mode	@ltx/en_us_goadedes/miscellanea:misc.Mode8
ltx/en_us_goadedes/me.m05.d10:meMA.Ode8C1T.ode	@ltx/en_us_goadedes/miscellanea:misc.Ode8
ltx/en_us_goadedes/me.m05.d10:meMA.Ode8C1T.text	
ltx/en_us_goadedes/me.m05.d10:meMA.Ode8H.greekmelody	@ltx/en_us_goadedes/he.h.m8:heHE.MousikonOrganon.greekname
ltx/en_us_goadedes/me.m05.d10:meMA.Ode8H.incipit	@ltx/en_us_goadedes/he.h.m8:heHE.MousikonOrganon.incipit
ltx/en_us_goadedes/me.m05.d10:meMA.Ode8H.melody	@ltx/en_us_goadedes/he.h.m8:heHE.MousikonOrganon.melody
ltx/en_us_goadedes/me.m05.d10:meMA.Ode8H.mode	@ltx/en_us_goadedes/miscellanea:misc.Mode8
ltx/en_us_goadedes/me.m05.d10:meMA.Ode8H.ode	@ltx/en_us_goadedes/miscellanea:misc.Ode8
ltx/en_us_goadedes/me.m05.d10:meMA.Ode8H.text	@ltx/en_us_goadedes/he.h.m8:heHE.MousikonOrganon.text
ltx/en_us_goadedes/me.m05.d10:meMA.Ode9C11.greekmelody	@ltx/en_us_goadedes/he.h.m8:heHE.TinAgninEndoxos.greekname
ltx/en_us_goadedes/me.m05.d10:meMA.Ode9C11.incipit	…
ltx/en_us_goadedes/me.m05.d10:meMA.Ode9C11.melody	@ltx/en_us_goadedes/he.h.m8:heHE.TinAgninEndoxos.name
ltx/en_us_goadedes/me.m05.d10:meMA.Ode9C11.mode	@ltx/en_us_goadedes/miscellanea:misc.Mode8
ltx/en_us_goadedes/me.m05.d10:meMA.Ode9C11.ode	@ltx/en_us_goadedes/miscellanea:misc.Ode9
ltx/en_us_goadedes/me.m05.d10:meMA.Ode9C11.text	
ltx/en_us_goadedes/me.m05.d10:meMA.Ode9C12.incipit	…
ltx/en_us_goadedes/me.m05.d10:meMA.Ode9C12.melody	@ltx/en_us_goadedes/he.h.m8:heHE.TinAgninEndoxos.name
ltx/en_us_goadedes/me.m05.d10:meMA.Ode9C12.mode	@ltx/en_us_goadedes/miscellanea:misc.Mode8
ltx/en_us_goadedes/me.m05.d10:meMA.Ode9C12.ode	@ltx/en_us_goadedes/miscellanea:misc.Ode9
ltx/en_us_goadedes/me.m05.d10:meMA.Ode9C12.text	
ltx/en_us_goadedes/me.m05.d10:meMA.Ode9C1T.incipit	…
ltx/en_us_goadedes/me.m05.d10:meMA.Ode9C1T.melody	@ltx/en_us_goadedes/he.h.m8:heHE.TinAgninEndoxos.name
ltx/en_us_goadedes/me.m05.d10:meMA.Ode9C1T.mode	@ltx/en_us_goadedes/miscellanea:misc.Mode8
ltx/en_us_goadedes/me.m05.d10:meMA.Ode9C1T.ode	@ltx/en_us_goadedes/miscellanea:misc.Ode9
ltx/en_us_goadedes/me.m05.d10:meMA.Ode9C1T.text	
ltx/en_us_goadedes/me.m05.d10:meMA.Ode9H.greekmelody	@ltx/en_us_goadedes/he.h.m8:heHE.TinAgninEndoxos.greekname
ltx/en_us_goadedes/me.m05.d10:meMA.Ode9H.incipit	@ltx/en_us_goadedes/he.h.m8:heHE.TinAgninEndoxos.incipit
ltx/en_us_goadedes/me.m05.d10:meMA.Ode9H.melody	@ltx/en_us_goadedes/he.h.m8:heHE.TinAgninEndoxos.melody
ltx/en_us_goadedes/me.m05.d10:meMA.Ode9H.mode	@ltx/en_us_goadedes/miscellanea:misc.Mode8
ltx/en_us_goadedes/me.m05.d10:meMA.Ode9H.ode	@ltx/en_us_goadedes/miscellanea:misc.Ode9
ltx/en_us_goadedes/me.m05.d10:meMA.Ode9H.text	@ltx/en_us_goadedes/he.h.m8:heHE.TinAgninEndoxos.text
ltx/en_us_goadedes/me.m05.d10:meMA.Oikos1.text	
ltx/en_us_goadedes/me.m05.d10:meVE.Apolytikion1.melody	@ltx/en_us_goadedes/he.ga:heGA.ApostoleAgie.name
ltx/en_us_goadedes/me.m05.d10:meVE.Apolytikion1.mode	@ltx/en_us_goadedes/miscellanea:misc.Mode3
ltx/en_us_goadedes/me.m05.d10:meVE.AposGlory.incipit	…
ltx/en_us_goadedes/me.m05.d10:meVE.AposGlory.melody	
ltx/en_us_goadedes/me.m05.d10:meVE.AposGlory.mode	@ltx/en_us_goadedes/miscellanea:misc.Mode6
ltx/en_us_goadedes/me.m05.d10:meVE.AposGlory.text	
ltx/en_us_goadedes/me.m05.d10:meVE.Aposticha1.greekmelody	@ltx/en_us_goadedes/he.a.m1:heAU.PaneffimoiMartyres.greekname
ltx/en_us_goadedes/me.m05.d10:meVE.Aposticha1.incipit	…
ltx/en_us_goadedes/me.m05.d10:meVE.Aposticha1.melody	@ltx/en_us_goadedes/he.a.m1:heAU.PaneffimoiMartyres.name
ltx/en_us_goadedes/me.m05.d10:meVE.Aposticha1.mode	@ltx/en_us_goadedes/miscellanea:misc.Mode1
ltx/en_us_goadedes/me.m05.d10:meVE.Aposticha1.text	
ltx/en_us_goadedes/me.m05.d10:meVE.Aposticha2.incipit	…
ltx/en_us_goadedes/me.m05.d10:meVE.Aposticha2.melody	@ltx/en_us_goadedes/he.a.m1:heAU.PaneffimoiMartyres.name
ltx/en_us_goadedes/me.m05.d10:meVE.Aposticha2.mode	@ltx/en_us_goadedes/miscellanea:misc.Mode1
ltx/en_us_goadedes/me.m05.d10:meVE.Aposticha2.text	
ltx/en_us_goadedes/me.m05.d10:meVE.Aposticha3.incipit	…
ltx/en_us_goadedes/me.m05.d10:meVE.Aposticha3.melody	@ltx/en_us_goadedes/he.a.m1:heAU.PaneffimoiMartyres.name
ltx/en_us_goadedes/me.m05.d10:meVE.Aposticha3.mode	@ltx/en_us_goadedes/miscellanea:misc.Mode1
ltx/en_us_goadedes/me.m05.d10:meVE.Aposticha3.text	
ltx/en_us_goadedes/me.m05.d10:meVE.GeneralApolytikion1.name	
ltx/en_us_goadedes/me.m05.d10:meVE.SticGlory.incipit	…
ltx/en_us_goadedes/me.m05.d10:meVE.SticGlory.melody	
ltx/en_us_goadedes/me.m05.d10:meVE.SticGlory.mode	@ltx/en_us_goadedes/miscellanea:misc.Mode2
ltx/en_us_goadedes/me.m05.d10:meVE.SticGlory.text	
ltx/en_us_goadedes/me.m05.d10:meVE.Stichera01.greekmelody	@ltx/en_us_goadedes/he.a.m4:heAU.EdokasSimeiosin.greekname
ltx/en_us_goadedes/me.m05.d10:meVE.Stichera01.incipit	…
ltx/en_us_goadedes/me.m05.d10:meVE.Stichera01.melody	@ltx/en_us_goadedes/he.a.m4:heAU.EdokasSimeiosin.name
ltx/en_us_goadedes/me.m05.d10:meVE.Stichera01.mode	@ltx/en_us_goadedes/miscellanea:misc.Mode4
ltx/en_us_goadedes/me.m05.d10:meVE.Stichera01.text	
ltx/en_us_goadedes/me.m05.d10:meVE.Stichera02.incipit	…
ltx/en_us_goadedes/me.m05.d10:meVE.Stichera02.melody	@ltx/en_us_goadedes/he.a.m4:heAU.EdokasSimeiosin.name
ltx/en_us_goadedes/me.m05.d10:meVE.Stichera02.mode	@ltx/en_us_goadedes/miscellanea:misc.Mode4
ltx/en_us_goadedes/me.m05.d10:meVE.Stichera02.text	
ltx/en_us_goadedes/me.m05.d10:meVE.Stichera03.incipit	…
ltx/en_us_goadedes/me.m05.d10:meVE.Stichera03.melody	@ltx/en_us_goadedes/he.a.m4:heAU.EdokasSimeiosin.name
ltx/en_us_goadedes/me.m05.d10:meVE.Stichera03.mode	@ltx/en_us_goadedes/miscellanea:misc.Mode4
ltx/en_us_goadedes/me.m05.d10:meVE.Stichera03.text	
