ltx/en_us_goadedes/me.m02.d04:meDA.commemoration.first	
ltx/en_us_goadedes/me.m02.d04:meDA.commemoration.first_name	
ltx/en_us_goadedes/me.m02.d04:meDA.commemoration.first_short	
ltx/en_us_goadedes/me.m02.d04:meDA.commemoration.first_title	@ltx/en_us_goadedes/titles:ti.Feast
ltx/en_us_goadedes/me.m02.d04:meDA.commemoration.full	
ltx/en_us_goadedes/me.m02.d04:meDA.commemoration.second_name	
ltx/en_us_goadedes/me.m02.d04:meDA.commemoration.second_title	@ltx/en_us_goadedes/titles:ti.SaintM
ltx/en_us_goadedes/me.m02.d04:meDA.date	
ltx/en_us_goadedes/me.m02.d04:meDA.dismissal	@ltx/en_us_goadedes/dismissals:dis00.meeting
ltx/en_us_goadedes/me.m02.d04:meDA.fordate	
ltx/en_us_goadedes/me.m02.d04:meDA.insert1	
ltx/en_us_goadedes/me.m02.d04:meDA.insert2	
ltx/en_us_goadedes/me.m02.d04:meDA.note	
ltx/en_us_goadedes/me.m02.d04:meDA.pdfcoverdate	
ltx/en_us_goadedes/me.m02.d04:meDA.pdfheaderdate	
ltx/en_us_goadedes/me.m02.d04:meHO.commemorations	
ltx/en_us_goadedes/me.m02.d04:meHO.note1	
ltx/en_us_goadedes/me.m02.d04:meHO.note2	
ltx/en_us_goadedes/me.m02.d04:meHO.number	
ltx/en_us_goadedes/me.m02.d04:meHO.rank	
ltx/en_us_goadedes/me.m02.d04:meLE.commemoration1	
ltx/en_us_goadedes/me.m02.d04:meLE.commemoration2	
ltx/en_us_goadedes/me.m02.d04:meLI.Kontakion1.incipit	@ltx/en_us_goadedes/me.m02.d04:meMA.Kontakion1.incipit
ltx/en_us_goadedes/me.m02.d04:meLI.Kontakion1.melody	@ltx/en_us_goadedes/me.m02.d04:meMA.Kontakion1.melody
ltx/en_us_goadedes/me.m02.d04:meLI.Kontakion1.mode	@ltx/en_us_goadedes/me.m02.d04:meMA.Kontakion1.mode
ltx/en_us_goadedes/me.m02.d04:meLI.Kontakion1.text	@ltx/en_us_goadedes/me.m02.d04:meMA.Kontakion1.text
ltx/en_us_goadedes/me.m02.d04:meLI.Megalynarion.text	
ltx/en_us_goadedes/me.m02.d04:meMA.AposGlory.incipit	@ltx/en_us_goadedes/me.m02.d04:meVE.Aposticha2.incipit
ltx/en_us_goadedes/me.m02.d04:meMA.AposGlory.melody	@ltx/en_us_goadedes/he.a.m2:heAU.OikosTouEfratha.name
ltx/en_us_goadedes/me.m02.d04:meMA.AposGlory.mode	@ltx/en_us_goadedes/miscellanea:misc.Mode2
ltx/en_us_goadedes/me.m02.d04:meMA.AposGlory.text	@ltx/en_us_goadedes/me.m02.d04:meVE.Aposticha2.text
ltx/en_us_goadedes/me.m02.d04:meMA.Aposticha1.greekmelody	@ltx/en_us_goadedes/he.a.m2:heAU.OikosTouEfratha.greekname
ltx/en_us_goadedes/me.m02.d04:meMA.Aposticha1.incipit	@ltx/en_us_goadedes/me.m02.d01:meMA.Aposticha1.incipit
ltx/en_us_goadedes/me.m02.d04:meMA.Aposticha1.melody	@ltx/en_us_goadedes/he.a.m2:heAU.OikosTouEfratha.name
ltx/en_us_goadedes/me.m02.d04:meMA.Aposticha1.mode	@ltx/en_us_goadedes/miscellanea:misc.Mode2
ltx/en_us_goadedes/me.m02.d04:meMA.Aposticha1.text	@ltx/en_us_goadedes/me.m02.d01:meMA.Aposticha1.text
ltx/en_us_goadedes/me.m02.d04:meMA.Aposticha2.incipit	@ltx/en_us_goadedes/me.m02.d01:meMA.Aposticha2.incipit
ltx/en_us_goadedes/me.m02.d04:meMA.Aposticha2.melody	@ltx/en_us_goadedes/he.a.m2:heAU.OikosTouEfratha.name
ltx/en_us_goadedes/me.m02.d04:meMA.Aposticha2.mode	@ltx/en_us_goadedes/miscellanea:misc.Mode2
ltx/en_us_goadedes/me.m02.d04:meMA.Aposticha2.text	@ltx/en_us_goadedes/me.m02.d01:meMA.Aposticha2.text
ltx/en_us_goadedes/me.m02.d04:meMA.Aposticha3.incipit	@ltx/en_us_goadedes/me.m02.d04:meVE.Aposticha3.incipit
ltx/en_us_goadedes/me.m02.d04:meMA.Aposticha3.melody	@ltx/en_us_goadedes/he.a.m2:heAU.OikosTouEfratha.name
ltx/en_us_goadedes/me.m02.d04:meMA.Aposticha3.mode	@ltx/en_us_goadedes/miscellanea:misc.Mode2
ltx/en_us_goadedes/me.m02.d04:meMA.Aposticha3.text	@ltx/en_us_goadedes/me.m02.d04:meVE.Aposticha3.text
ltx/en_us_goadedes/me.m02.d04:meMA.C1.acrostic.notice1	
ltx/en_us_goadedes/me.m02.d04:meMA.C1.acrostic.text	
ltx/en_us_goadedes/me.m02.d04:meMA.C1.acrostic.title	
ltx/en_us_goadedes/me.m02.d04:meMA.C1.poet	@ltx/en_us_goadedes/poets:po.Theofanous
ltx/en_us_goadedes/me.m02.d04:meMA.C1.title	@ltx/en_us_goadedes/titles:ti.CanonDevoutM
ltx/en_us_goadedes/me.m02.d04:meMA.C1.verse	@ltx/en_us_goadedes/prayers:pr.verse_DevoutMan.text
ltx/en_us_goadedes/me.m02.d04:meMA.Exaposteilarion1.greekmelody	@ltx/en_us_goadedes/he.a.m2:heAU.GynaikesAkoutisthite.greekname
ltx/en_us_goadedes/me.m02.d04:meMA.Exaposteilarion1.incipit	…
ltx/en_us_goadedes/me.m02.d04:meMA.Exaposteilarion1.melody	@ltx/en_us_goadedes/he.a.m2:heAU.GynaikesAkoutisthite.name
ltx/en_us_goadedes/me.m02.d04:meMA.Exaposteilarion1.mode	@ltx/en_us_goadedes/miscellanea:misc.Mode2
ltx/en_us_goadedes/me.m02.d04:meMA.Exaposteilarion1.text	
ltx/en_us_goadedes/me.m02.d04:meMA.Exaposteilarion2.greekmelody	@ltx/en_us_goadedes/he.a.m2:heAU.GynaikesAkoutisthite.greekname
ltx/en_us_goadedes/me.m02.d04:meMA.Exaposteilarion2.incipit	…
ltx/en_us_goadedes/me.m02.d04:meMA.Exaposteilarion2.melody	@ltx/en_us_goadedes/he.a.m2:heAU.GynaikesAkoutisthite.name
ltx/en_us_goadedes/me.m02.d04:meMA.Exaposteilarion2.mode	@ltx/en_us_goadedes/miscellanea:misc.Mode2
ltx/en_us_goadedes/me.m02.d04:meMA.Exaposteilarion2.text	
ltx/en_us_goadedes/me.m02.d04:meMA.Kathisma11.greekmelody	@ltx/en_us_goadedes/he.a.m1:heAU.ChorosAngelikos.greekname
ltx/en_us_goadedes/me.m02.d04:meMA.Kathisma11.incipit	@ltx/en_us_goadedes/me.m02.d02:meMA.Kathisma21.incipit
ltx/en_us_goadedes/me.m02.d04:meMA.Kathisma11.melody	@ltx/en_us_goadedes/he.a.m1:heAU.ChorosAngelikos.name
ltx/en_us_goadedes/me.m02.d04:meMA.Kathisma11.mode	@ltx/en_us_goadedes/miscellanea:misc.Mode1
ltx/en_us_goadedes/me.m02.d04:meMA.Kathisma11.text	@ltx/en_us_goadedes/me.m02.d02:meMA.Kathisma21.text
ltx/en_us_goadedes/me.m02.d04:meMA.Kathisma21.greekmelody	@ltx/en_us_goadedes/he.a.m4:heAU.TachyProkatalave.greekname
ltx/en_us_goadedes/me.m02.d04:meMA.Kathisma21.incipit	@ltx/en_us_goadedes/me.m02.d01:meMA.Kathisma21.incipit
ltx/en_us_goadedes/me.m02.d04:meMA.Kathisma21.melody	@ltx/en_us_goadedes/he.a.m4:heAU.TachyProkatalave.name
ltx/en_us_goadedes/me.m02.d04:meMA.Kathisma21.mode	@ltx/en_us_goadedes/miscellanea:misc.Mode4
ltx/en_us_goadedes/me.m02.d04:meMA.Kathisma21.text	@ltx/en_us_goadedes/me.m02.d01:meMA.Kathisma21.text
ltx/en_us_goadedes/me.m02.d04:meMA.Kontakion1.incipit	@ltx/en_us_goadedes/me.m02.d02:meMA.Kontakion1.incipit
ltx/en_us_goadedes/me.m02.d04:meMA.Kontakion1.melody	
ltx/en_us_goadedes/me.m02.d04:meMA.Kontakion1.mode	@ltx/en_us_goadedes/miscellanea:misc.Mode1
ltx/en_us_goadedes/me.m02.d04:meMA.Kontakion1.text	@ltx/en_us_goadedes/me.m02.d02:meMA.Kontakion1.text
ltx/en_us_goadedes/me.m02.d04:meMA.Ode1C11.greekmelody	@ltx/en_us_goadedes/he.h.m6:heHE.OsEnIpeiroPezefsas.greekname
ltx/en_us_goadedes/me.m02.d04:meMA.Ode1C11.incipit	…
ltx/en_us_goadedes/me.m02.d04:meMA.Ode1C11.melody	@ltx/en_us_goadedes/he.h.m6:heHE.OsEnIpeiroPezefsas.name
ltx/en_us_goadedes/me.m02.d04:meMA.Ode1C11.mode	@ltx/en_us_goadedes/miscellanea:misc.Mode6
ltx/en_us_goadedes/me.m02.d04:meMA.Ode1C11.ode	@ltx/en_us_goadedes/miscellanea:misc.Ode1
ltx/en_us_goadedes/me.m02.d04:meMA.Ode1C11.text	
ltx/en_us_goadedes/me.m02.d04:meMA.Ode1C12.incipit	…
ltx/en_us_goadedes/me.m02.d04:meMA.Ode1C12.melody	@ltx/en_us_goadedes/he.h.m6:heHE.OsEnIpeiroPezefsas.name
ltx/en_us_goadedes/me.m02.d04:meMA.Ode1C12.mode	@ltx/en_us_goadedes/miscellanea:misc.Mode6
ltx/en_us_goadedes/me.m02.d04:meMA.Ode1C12.ode	@ltx/en_us_goadedes/miscellanea:misc.Ode1
ltx/en_us_goadedes/me.m02.d04:meMA.Ode1C12.text	
ltx/en_us_goadedes/me.m02.d04:meMA.Ode1C13.incipit	…
ltx/en_us_goadedes/me.m02.d04:meMA.Ode1C13.melody	@ltx/en_us_goadedes/he.h.m6:heHE.OsEnIpeiroPezefsas.name
ltx/en_us_goadedes/me.m02.d04:meMA.Ode1C13.mode	@ltx/en_us_goadedes/miscellanea:misc.Mode6
ltx/en_us_goadedes/me.m02.d04:meMA.Ode1C13.ode	@ltx/en_us_goadedes/miscellanea:misc.Ode1
ltx/en_us_goadedes/me.m02.d04:meMA.Ode1C13.text	
ltx/en_us_goadedes/me.m02.d04:meMA.Ode1C1H.greekmelody	@ltx/en_us_goadedes/he.h.m6:heHE.OsEnIpeiroPezefsas.greekname
ltx/en_us_goadedes/me.m02.d04:meMA.Ode1C1H.incipit	@ltx/en_us_goadedes/he.h.m6:heHE.OsEnIpeiroPezefsas.incipit
ltx/en_us_goadedes/me.m02.d04:meMA.Ode1C1H.melody	@ltx/en_us_goadedes/he.h.m6:heHE.OsEnIpeiroPezefsas.melody
ltx/en_us_goadedes/me.m02.d04:meMA.Ode1C1H.mode	@ltx/en_us_goadedes/miscellanea:misc.Mode6
ltx/en_us_goadedes/me.m02.d04:meMA.Ode1C1H.ode	@ltx/en_us_goadedes/miscellanea:misc.Ode1
ltx/en_us_goadedes/me.m02.d04:meMA.Ode1C1H.text	@ltx/en_us_goadedes/he.h.m6:heHE.OsEnIpeiroPezefsas.text
ltx/en_us_goadedes/me.m02.d04:meMA.Ode1C1T.incipit	…
ltx/en_us_goadedes/me.m02.d04:meMA.Ode1C1T.melody	@ltx/en_us_goadedes/he.h.m6:heHE.OsEnIpeiroPezefsas.name
ltx/en_us_goadedes/me.m02.d04:meMA.Ode1C1T.mode	@ltx/en_us_goadedes/miscellanea:misc.Mode6
ltx/en_us_goadedes/me.m02.d04:meMA.Ode1C1T.ode	@ltx/en_us_goadedes/miscellanea:misc.Ode1
ltx/en_us_goadedes/me.m02.d04:meMA.Ode1C1T.text	
ltx/en_us_goadedes/me.m02.d04:meMA.Ode3C11.greekmelody	@ltx/en_us_goadedes/he.h.m6:heHE.OukEstinAgios.greekname
ltx/en_us_goadedes/me.m02.d04:meMA.Ode3C11.incipit	…
ltx/en_us_goadedes/me.m02.d04:meMA.Ode3C11.melody	@ltx/en_us_goadedes/he.h.m6:heHE.OukEstinAgios.name
ltx/en_us_goadedes/me.m02.d04:meMA.Ode3C11.mode	@ltx/en_us_goadedes/miscellanea:misc.Mode6
ltx/en_us_goadedes/me.m02.d04:meMA.Ode3C11.ode	@ltx/en_us_goadedes/miscellanea:misc.Ode3
ltx/en_us_goadedes/me.m02.d04:meMA.Ode3C11.text	
ltx/en_us_goadedes/me.m02.d04:meMA.Ode3C12.incipit	…
ltx/en_us_goadedes/me.m02.d04:meMA.Ode3C12.melody	@ltx/en_us_goadedes/he.h.m6:heHE.OukEstinAgios.name
ltx/en_us_goadedes/me.m02.d04:meMA.Ode3C12.mode	@ltx/en_us_goadedes/miscellanea:misc.Mode6
ltx/en_us_goadedes/me.m02.d04:meMA.Ode3C12.ode	@ltx/en_us_goadedes/miscellanea:misc.Ode3
ltx/en_us_goadedes/me.m02.d04:meMA.Ode3C12.text	
ltx/en_us_goadedes/me.m02.d04:meMA.Ode3C13.incipit	…
ltx/en_us_goadedes/me.m02.d04:meMA.Ode3C13.melody	@ltx/en_us_goadedes/he.h.m6:heHE.OukEstinAgios.name
ltx/en_us_goadedes/me.m02.d04:meMA.Ode3C13.mode	@ltx/en_us_goadedes/miscellanea:misc.Mode6
ltx/en_us_goadedes/me.m02.d04:meMA.Ode3C13.ode	@ltx/en_us_goadedes/miscellanea:misc.Ode3
ltx/en_us_goadedes/me.m02.d04:meMA.Ode3C13.text	
ltx/en_us_goadedes/me.m02.d04:meMA.Ode3C1H.greekmelody	@ltx/en_us_goadedes/he.h.m6:heHE.OukEstinAgios.greekname
ltx/en_us_goadedes/me.m02.d04:meMA.Ode3C1H.incipit	@ltx/en_us_goadedes/he.h.m6:heHE.OukEstinAgios.incipit
ltx/en_us_goadedes/me.m02.d04:meMA.Ode3C1H.melody	@ltx/en_us_goadedes/he.h.m6:heHE.OukEstinAgios.melody
ltx/en_us_goadedes/me.m02.d04:meMA.Ode3C1H.mode	@ltx/en_us_goadedes/miscellanea:misc.Mode6
ltx/en_us_goadedes/me.m02.d04:meMA.Ode3C1H.ode	@ltx/en_us_goadedes/miscellanea:misc.Ode3
ltx/en_us_goadedes/me.m02.d04:meMA.Ode3C1H.text	@ltx/en_us_goadedes/he.h.m6:heHE.OukEstinAgios.text
ltx/en_us_goadedes/me.m02.d04:meMA.Ode3C1T.incipit	…
ltx/en_us_goadedes/me.m02.d04:meMA.Ode3C1T.melody	@ltx/en_us_goadedes/he.h.m6:heHE.OukEstinAgios.name
ltx/en_us_goadedes/me.m02.d04:meMA.Ode3C1T.mode	@ltx/en_us_goadedes/miscellanea:misc.Mode6
ltx/en_us_goadedes/me.m02.d04:meMA.Ode3C1T.ode	@ltx/en_us_goadedes/miscellanea:misc.Ode3
ltx/en_us_goadedes/me.m02.d04:meMA.Ode3C1T.text	
ltx/en_us_goadedes/me.m02.d04:meMA.Ode3Kathisma1.greekmelody	@ltx/en_us_goadedes/he.a.m3:heAU.TheiasPisteos.greekname
ltx/en_us_goadedes/me.m02.d04:meMA.Ode3Kathisma1.incipit	…
ltx/en_us_goadedes/me.m02.d04:meMA.Ode3Kathisma1.melody	@ltx/en_us_goadedes/he.a.m3:heAU.TheiasPisteos.name
ltx/en_us_goadedes/me.m02.d04:meMA.Ode3Kathisma1.mode	@ltx/en_us_goadedes/miscellanea:misc.Mode3
ltx/en_us_goadedes/me.m02.d04:meMA.Ode3Kathisma1.text	
ltx/en_us_goadedes/me.m02.d04:meMA.Ode3Kathisma2.greekmelody	@ltx/en_us_goadedes/he.a.m8:heAU.AnestisEkNekron.greekname
ltx/en_us_goadedes/me.m02.d04:meMA.Ode3Kathisma2.incipit	…
ltx/en_us_goadedes/me.m02.d04:meMA.Ode3Kathisma2.melody	@ltx/en_us_goadedes/he.a.m8:heAU.AnestisEkNekron.name
ltx/en_us_goadedes/me.m02.d04:meMA.Ode3Kathisma2.mode	@ltx/en_us_goadedes/miscellanea:misc.Mode4
ltx/en_us_goadedes/me.m02.d04:meMA.Ode3Kathisma2.text	
ltx/en_us_goadedes/me.m02.d04:meMA.Ode3KathismaSt.incipit	…
ltx/en_us_goadedes/me.m02.d04:meMA.Ode3KathismaSt.melody	@ltx/en_us_goadedes/he.a.m3:heAU.TheiasPisteos.name
ltx/en_us_goadedes/me.m02.d04:meMA.Ode3KathismaSt.mode	@ltx/en_us_goadedes/miscellanea:misc.Mode3
ltx/en_us_goadedes/me.m02.d04:meMA.Ode3KathismaSt.text	
ltx/en_us_goadedes/me.m02.d04:meMA.Ode3KathismaT.incipit	@ltx/en_us_goadedes/oc.m3.d2:ocMA.Kathisma23.incipit
ltx/en_us_goadedes/me.m02.d04:meMA.Ode3KathismaT.melody	@ltx/en_us_goadedes/he.a.m3:heAU.TheiasPisteos.name
ltx/en_us_goadedes/me.m02.d04:meMA.Ode3KathismaT.mode	@ltx/en_us_goadedes/miscellanea:misc.Mode3
ltx/en_us_goadedes/me.m02.d04:meMA.Ode3KathismaT.text	@ltx/en_us_goadedes/oc.m3.d2:ocMA.Kathisma23.text
ltx/en_us_goadedes/me.m02.d04:meMA.Ode4C11.greekmelody	@ltx/en_us_goadedes/he.h.m6:heHE.ChristosMouDynamis.greekname
ltx/en_us_goadedes/me.m02.d04:meMA.Ode4C11.incipit	…
ltx/en_us_goadedes/me.m02.d04:meMA.Ode4C11.melody	@ltx/en_us_goadedes/he.h.m6:heHE.ChristosMouDynamis.name
ltx/en_us_goadedes/me.m02.d04:meMA.Ode4C11.mode	@ltx/en_us_goadedes/miscellanea:misc.Mode6
ltx/en_us_goadedes/me.m02.d04:meMA.Ode4C11.ode	@ltx/en_us_goadedes/miscellanea:misc.Ode4
ltx/en_us_goadedes/me.m02.d04:meMA.Ode4C11.text	
ltx/en_us_goadedes/me.m02.d04:meMA.Ode4C12.incipit	…
ltx/en_us_goadedes/me.m02.d04:meMA.Ode4C12.melody	@ltx/en_us_goadedes/he.h.m6:heHE.ChristosMouDynamis.name
ltx/en_us_goadedes/me.m02.d04:meMA.Ode4C12.mode	@ltx/en_us_goadedes/miscellanea:misc.Mode6
ltx/en_us_goadedes/me.m02.d04:meMA.Ode4C12.ode	@ltx/en_us_goadedes/miscellanea:misc.Ode4
ltx/en_us_goadedes/me.m02.d04:meMA.Ode4C12.text	
ltx/en_us_goadedes/me.m02.d04:meMA.Ode4C13.incipit	…
ltx/en_us_goadedes/me.m02.d04:meMA.Ode4C13.melody	@ltx/en_us_goadedes/he.h.m6:heHE.ChristosMouDynamis.name
ltx/en_us_goadedes/me.m02.d04:meMA.Ode4C13.mode	@ltx/en_us_goadedes/miscellanea:misc.Mode6
ltx/en_us_goadedes/me.m02.d04:meMA.Ode4C13.ode	@ltx/en_us_goadedes/miscellanea:misc.Ode4
ltx/en_us_goadedes/me.m02.d04:meMA.Ode4C13.text	
ltx/en_us_goadedes/me.m02.d04:meMA.Ode4C1H.greekmelody	@ltx/en_us_goadedes/he.h.m6:heHE.ChristosMouDynamis.greekname
ltx/en_us_goadedes/me.m02.d04:meMA.Ode4C1H.incipit	@ltx/en_us_goadedes/he.h.m6:heHE.ChristosMouDynamis.incipit
ltx/en_us_goadedes/me.m02.d04:meMA.Ode4C1H.melody	@ltx/en_us_goadedes/he.h.m6:heHE.ChristosMouDynamis.melody
ltx/en_us_goadedes/me.m02.d04:meMA.Ode4C1H.mode	@ltx/en_us_goadedes/miscellanea:misc.Mode6
ltx/en_us_goadedes/me.m02.d04:meMA.Ode4C1H.ode	@ltx/en_us_goadedes/miscellanea:misc.Ode4
ltx/en_us_goadedes/me.m02.d04:meMA.Ode4C1H.text	@ltx/en_us_goadedes/he.h.m6:heHE.ChristosMouDynamis.text
ltx/en_us_goadedes/me.m02.d04:meMA.Ode4C1T.incipit	…
ltx/en_us_goadedes/me.m02.d04:meMA.Ode4C1T.melody	@ltx/en_us_goadedes/he.h.m6:heHE.ChristosMouDynamis.name
ltx/en_us_goadedes/me.m02.d04:meMA.Ode4C1T.mode	@ltx/en_us_goadedes/miscellanea:misc.Mode6
ltx/en_us_goadedes/me.m02.d04:meMA.Ode4C1T.ode	@ltx/en_us_goadedes/miscellanea:misc.Ode4
ltx/en_us_goadedes/me.m02.d04:meMA.Ode4C1T.text	
ltx/en_us_goadedes/me.m02.d04:meMA.Ode5C11.greekmelody	@ltx/en_us_goadedes/he.h.m6:heHE.ToTheioFengeiSou.greekname
ltx/en_us_goadedes/me.m02.d04:meMA.Ode5C11.incipit	…
ltx/en_us_goadedes/me.m02.d04:meMA.Ode5C11.melody	@ltx/en_us_goadedes/he.h.m6:heHE.ToTheioFengeiSou.name
ltx/en_us_goadedes/me.m02.d04:meMA.Ode5C11.mode	@ltx/en_us_goadedes/miscellanea:misc.Mode6
ltx/en_us_goadedes/me.m02.d04:meMA.Ode5C11.ode	@ltx/en_us_goadedes/miscellanea:misc.Ode5
ltx/en_us_goadedes/me.m02.d04:meMA.Ode5C11.text	
ltx/en_us_goadedes/me.m02.d04:meMA.Ode5C12.incipit	…
ltx/en_us_goadedes/me.m02.d04:meMA.Ode5C12.melody	@ltx/en_us_goadedes/he.h.m6:heHE.ToTheioFengeiSou.name
ltx/en_us_goadedes/me.m02.d04:meMA.Ode5C12.mode	@ltx/en_us_goadedes/miscellanea:misc.Mode6
ltx/en_us_goadedes/me.m02.d04:meMA.Ode5C12.ode	@ltx/en_us_goadedes/miscellanea:misc.Ode5
ltx/en_us_goadedes/me.m02.d04:meMA.Ode5C12.text	
ltx/en_us_goadedes/me.m02.d04:meMA.Ode5C13.incipit	…
ltx/en_us_goadedes/me.m02.d04:meMA.Ode5C13.melody	@ltx/en_us_goadedes/he.h.m6:heHE.ToTheioFengeiSou.name
ltx/en_us_goadedes/me.m02.d04:meMA.Ode5C13.mode	@ltx/en_us_goadedes/miscellanea:misc.Mode6
ltx/en_us_goadedes/me.m02.d04:meMA.Ode5C13.ode	@ltx/en_us_goadedes/miscellanea:misc.Ode5
ltx/en_us_goadedes/me.m02.d04:meMA.Ode5C13.text	
ltx/en_us_goadedes/me.m02.d04:meMA.Ode5C1H.greekmelody	@ltx/en_us_goadedes/he.h.m6:heHE.ToTheioFengeiSou.greekname
ltx/en_us_goadedes/me.m02.d04:meMA.Ode5C1H.incipit	@ltx/en_us_goadedes/he.h.m6:heHE.ToTheioFengeiSou.incipit
ltx/en_us_goadedes/me.m02.d04:meMA.Ode5C1H.melody	@ltx/en_us_goadedes/he.h.m6:heHE.ToTheioFengeiSou.melody
ltx/en_us_goadedes/me.m02.d04:meMA.Ode5C1H.mode	@ltx/en_us_goadedes/miscellanea:misc.Mode6
ltx/en_us_goadedes/me.m02.d04:meMA.Ode5C1H.ode	@ltx/en_us_goadedes/miscellanea:misc.Ode5
ltx/en_us_goadedes/me.m02.d04:meMA.Ode5C1H.text	@ltx/en_us_goadedes/he.h.m6:heHE.ToTheioFengeiSou.text
ltx/en_us_goadedes/me.m02.d04:meMA.Ode5C1T.incipit	…
ltx/en_us_goadedes/me.m02.d04:meMA.Ode5C1T.melody	@ltx/en_us_goadedes/he.h.m6:heHE.ToTheioFengeiSou.name
ltx/en_us_goadedes/me.m02.d04:meMA.Ode5C1T.mode	@ltx/en_us_goadedes/miscellanea:misc.Mode6
ltx/en_us_goadedes/me.m02.d04:meMA.Ode5C1T.ode	@ltx/en_us_goadedes/miscellanea:misc.Ode5
ltx/en_us_goadedes/me.m02.d04:meMA.Ode5C1T.text	
ltx/en_us_goadedes/me.m02.d04:meMA.Ode6C11.greekmelody	@ltx/en_us_goadedes/he.h.m6:heHE.TouViouTinThalassan.greekname
ltx/en_us_goadedes/me.m02.d04:meMA.Ode6C11.incipit	…
ltx/en_us_goadedes/me.m02.d04:meMA.Ode6C11.melody	@ltx/en_us_goadedes/he.h.m6:heHE.TouViouTinThalassan.name
ltx/en_us_goadedes/me.m02.d04:meMA.Ode6C11.mode	@ltx/en_us_goadedes/miscellanea:misc.Mode6
ltx/en_us_goadedes/me.m02.d04:meMA.Ode6C11.ode	@ltx/en_us_goadedes/miscellanea:misc.Ode6
ltx/en_us_goadedes/me.m02.d04:meMA.Ode6C11.text	
ltx/en_us_goadedes/me.m02.d04:meMA.Ode6C12.incipit	…
ltx/en_us_goadedes/me.m02.d04:meMA.Ode6C12.melody	@ltx/en_us_goadedes/he.h.m6:heHE.TouViouTinThalassan.name
ltx/en_us_goadedes/me.m02.d04:meMA.Ode6C12.mode	@ltx/en_us_goadedes/miscellanea:misc.Mode6
ltx/en_us_goadedes/me.m02.d04:meMA.Ode6C12.ode	@ltx/en_us_goadedes/miscellanea:misc.Ode6
ltx/en_us_goadedes/me.m02.d04:meMA.Ode6C12.text	
ltx/en_us_goadedes/me.m02.d04:meMA.Ode6C1H.greekmelody	@ltx/en_us_goadedes/he.h.m6:heHE.TouViouTinThalassan.greekname
ltx/en_us_goadedes/me.m02.d04:meMA.Ode6C1H.incipit	@ltx/en_us_goadedes/he.h.m6:heHE.TouViouTinThalassan.incipit
ltx/en_us_goadedes/me.m02.d04:meMA.Ode6C1H.melody	@ltx/en_us_goadedes/he.h.m6:heHE.TouViouTinThalassan.melody
ltx/en_us_goadedes/me.m02.d04:meMA.Ode6C1H.mode	@ltx/en_us_goadedes/miscellanea:misc.Mode6
ltx/en_us_goadedes/me.m02.d04:meMA.Ode6C1H.ode	@ltx/en_us_goadedes/miscellanea:misc.Ode6
ltx/en_us_goadedes/me.m02.d04:meMA.Ode6C1H.text	@ltx/en_us_goadedes/he.h.m6:heHE.TouViouTinThalassan.text
ltx/en_us_goadedes/me.m02.d04:meMA.Ode6C1T.incipit	…
ltx/en_us_goadedes/me.m02.d04:meMA.Ode6C1T.melody	@ltx/en_us_goadedes/he.h.m6:heHE.TouViouTinThalassan.name
ltx/en_us_goadedes/me.m02.d04:meMA.Ode6C1T.mode	@ltx/en_us_goadedes/miscellanea:misc.Mode6
ltx/en_us_goadedes/me.m02.d04:meMA.Ode6C1T.ode	@ltx/en_us_goadedes/miscellanea:misc.Ode6
ltx/en_us_goadedes/me.m02.d04:meMA.Ode6C1T.text	
ltx/en_us_goadedes/me.m02.d04:meMA.Ode7C11.greekmelody	@ltx/en_us_goadedes/he.h.m6:heHE.DrosovolonMenTinKaminon.greekname
ltx/en_us_goadedes/me.m02.d04:meMA.Ode7C11.incipit	…
ltx/en_us_goadedes/me.m02.d04:meMA.Ode7C11.melody	@ltx/en_us_goadedes/he.h.m6:heHE.DrosovolonMenTinKaminon.name
ltx/en_us_goadedes/me.m02.d04:meMA.Ode7C11.mode	@ltx/en_us_goadedes/miscellanea:misc.Mode6
ltx/en_us_goadedes/me.m02.d04:meMA.Ode7C11.ode	@ltx/en_us_goadedes/miscellanea:misc.Ode7
ltx/en_us_goadedes/me.m02.d04:meMA.Ode7C11.text	
ltx/en_us_goadedes/me.m02.d04:meMA.Ode7C12.incipit	…
ltx/en_us_goadedes/me.m02.d04:meMA.Ode7C12.melody	@ltx/en_us_goadedes/he.h.m6:heHE.DrosovolonMenTinKaminon.name
ltx/en_us_goadedes/me.m02.d04:meMA.Ode7C12.mode	@ltx/en_us_goadedes/miscellanea:misc.Mode6
ltx/en_us_goadedes/me.m02.d04:meMA.Ode7C12.ode	@ltx/en_us_goadedes/miscellanea:misc.Ode7
ltx/en_us_goadedes/me.m02.d04:meMA.Ode7C12.text	
ltx/en_us_goadedes/me.m02.d04:meMA.Ode7C1H.greekmelody	@ltx/en_us_goadedes/he.h.m6:heHE.DrosovolonMenTinKaminon.greekname
ltx/en_us_goadedes/me.m02.d04:meMA.Ode7C1H.incipit	@ltx/en_us_goadedes/he.h.m6:heHE.DrosovolonMenTinKaminon.incipit
ltx/en_us_goadedes/me.m02.d04:meMA.Ode7C1H.melody	@ltx/en_us_goadedes/he.h.m6:heHE.DrosovolonMenTinKaminon.melody
ltx/en_us_goadedes/me.m02.d04:meMA.Ode7C1H.mode	@ltx/en_us_goadedes/miscellanea:misc.Mode6
ltx/en_us_goadedes/me.m02.d04:meMA.Ode7C1H.ode	@ltx/en_us_goadedes/miscellanea:misc.Ode7
ltx/en_us_goadedes/me.m02.d04:meMA.Ode7C1H.text	@ltx/en_us_goadedes/he.h.m6:heHE.DrosovolonMenTinKaminon.text
ltx/en_us_goadedes/me.m02.d04:meMA.Ode7C1T.incipit	…
ltx/en_us_goadedes/me.m02.d04:meMA.Ode7C1T.melody	@ltx/en_us_goadedes/he.h.m6:heHE.DrosovolonMenTinKaminon.name
ltx/en_us_goadedes/me.m02.d04:meMA.Ode7C1T.mode	@ltx/en_us_goadedes/miscellanea:misc.Mode6
ltx/en_us_goadedes/me.m02.d04:meMA.Ode7C1T.ode	@ltx/en_us_goadedes/miscellanea:misc.Ode7
ltx/en_us_goadedes/me.m02.d04:meMA.Ode7C1T.text	
ltx/en_us_goadedes/me.m02.d04:meMA.Ode8C11.greekmelody	@ltx/en_us_goadedes/he.h.m6:heHE.EkFlogosToisOsiois.greekname
ltx/en_us_goadedes/me.m02.d04:meMA.Ode8C11.incipit	…
ltx/en_us_goadedes/me.m02.d04:meMA.Ode8C11.melody	@ltx/en_us_goadedes/he.h.m6:heHE.EkFlogosToisOsiois.name
ltx/en_us_goadedes/me.m02.d04:meMA.Ode8C11.mode	@ltx/en_us_goadedes/miscellanea:misc.Mode6
ltx/en_us_goadedes/me.m02.d04:meMA.Ode8C11.ode	@ltx/en_us_goadedes/miscellanea:misc.Ode8
ltx/en_us_goadedes/me.m02.d04:meMA.Ode8C11.text	
ltx/en_us_goadedes/me.m02.d04:meMA.Ode8C12.incipit	…
ltx/en_us_goadedes/me.m02.d04:meMA.Ode8C12.melody	@ltx/en_us_goadedes/he.h.m6:heHE.EkFlogosToisOsiois.name
ltx/en_us_goadedes/me.m02.d04:meMA.Ode8C12.mode	@ltx/en_us_goadedes/miscellanea:misc.Mode6
ltx/en_us_goadedes/me.m02.d04:meMA.Ode8C12.ode	@ltx/en_us_goadedes/miscellanea:misc.Ode8
ltx/en_us_goadedes/me.m02.d04:meMA.Ode8C12.text	
ltx/en_us_goadedes/me.m02.d04:meMA.Ode8C13.incipit	…
ltx/en_us_goadedes/me.m02.d04:meMA.Ode8C13.melody	@ltx/en_us_goadedes/he.h.m6:heHE.EkFlogosToisOsiois.name
ltx/en_us_goadedes/me.m02.d04:meMA.Ode8C13.mode	@ltx/en_us_goadedes/miscellanea:misc.Mode6
ltx/en_us_goadedes/me.m02.d04:meMA.Ode8C13.ode	@ltx/en_us_goadedes/miscellanea:misc.Ode8
ltx/en_us_goadedes/me.m02.d04:meMA.Ode8C13.text	
ltx/en_us_goadedes/me.m02.d04:meMA.Ode8C1H.greekmelody	@ltx/en_us_goadedes/he.h.m6:heHE.EkFlogosToisOsiois.greekname
ltx/en_us_goadedes/me.m02.d04:meMA.Ode8C1H.incipit	@ltx/en_us_goadedes/he.h.m6:heHE.EkFlogosToisOsiois.incipit
ltx/en_us_goadedes/me.m02.d04:meMA.Ode8C1H.melody	@ltx/en_us_goadedes/he.h.m6:heHE.EkFlogosToisOsiois.melody
ltx/en_us_goadedes/me.m02.d04:meMA.Ode8C1H.mode	@ltx/en_us_goadedes/miscellanea:misc.Mode6
ltx/en_us_goadedes/me.m02.d04:meMA.Ode8C1H.ode	@ltx/en_us_goadedes/miscellanea:misc.Ode8
ltx/en_us_goadedes/me.m02.d04:meMA.Ode8C1H.text	@ltx/en_us_goadedes/he.h.m6:heHE.EkFlogosToisOsiois.text
ltx/en_us_goadedes/me.m02.d04:meMA.Ode8C1T.incipit	…
ltx/en_us_goadedes/me.m02.d04:meMA.Ode8C1T.melody	@ltx/en_us_goadedes/he.h.m6:heHE.EkFlogosToisOsiois.name
ltx/en_us_goadedes/me.m02.d04:meMA.Ode8C1T.mode	@ltx/en_us_goadedes/miscellanea:misc.Mode6
ltx/en_us_goadedes/me.m02.d04:meMA.Ode8C1T.ode	@ltx/en_us_goadedes/miscellanea:misc.Ode8
ltx/en_us_goadedes/me.m02.d04:meMA.Ode8C1T.text	
ltx/en_us_goadedes/me.m02.d04:meMA.Ode9C11.greekmelody	@ltx/en_us_goadedes/he.h.m6:heHE.TheonAnthropois.greekname
ltx/en_us_goadedes/me.m02.d04:meMA.Ode9C11.incipit	…
ltx/en_us_goadedes/me.m02.d04:meMA.Ode9C11.melody	@ltx/en_us_goadedes/he.h.m6:heHE.TheonAnthropois.name
ltx/en_us_goadedes/me.m02.d04:meMA.Ode9C11.mode	@ltx/en_us_goadedes/miscellanea:misc.Mode6
ltx/en_us_goadedes/me.m02.d04:meMA.Ode9C11.ode	@ltx/en_us_goadedes/miscellanea:misc.Ode9
ltx/en_us_goadedes/me.m02.d04:meMA.Ode9C11.text	
ltx/en_us_goadedes/me.m02.d04:meMA.Ode9C12.incipit	…
ltx/en_us_goadedes/me.m02.d04:meMA.Ode9C12.melody	@ltx/en_us_goadedes/he.h.m6:heHE.TheonAnthropois.name
ltx/en_us_goadedes/me.m02.d04:meMA.Ode9C12.mode	@ltx/en_us_goadedes/miscellanea:misc.Mode6
ltx/en_us_goadedes/me.m02.d04:meMA.Ode9C12.ode	@ltx/en_us_goadedes/miscellanea:misc.Ode9
ltx/en_us_goadedes/me.m02.d04:meMA.Ode9C12.text	
ltx/en_us_goadedes/me.m02.d04:meMA.Ode9C13.incipit	…
ltx/en_us_goadedes/me.m02.d04:meMA.Ode9C13.melody	@ltx/en_us_goadedes/he.h.m6:heHE.TheonAnthropois.name
ltx/en_us_goadedes/me.m02.d04:meMA.Ode9C13.mode	@ltx/en_us_goadedes/miscellanea:misc.Mode6
ltx/en_us_goadedes/me.m02.d04:meMA.Ode9C13.ode	@ltx/en_us_goadedes/miscellanea:misc.Ode9
ltx/en_us_goadedes/me.m02.d04:meMA.Ode9C13.text	
ltx/en_us_goadedes/me.m02.d04:meMA.Ode9C1H.greekmelody	@ltx/en_us_goadedes/he.h.m6:heHE.TheonAnthropois.greekname
ltx/en_us_goadedes/me.m02.d04:meMA.Ode9C1H.incipit	@ltx/en_us_goadedes/he.h.m6:heHE.TheonAnthropois.incipit
ltx/en_us_goadedes/me.m02.d04:meMA.Ode9C1H.melody	@ltx/en_us_goadedes/he.h.m6:heHE.TheonAnthropois.melody
ltx/en_us_goadedes/me.m02.d04:meMA.Ode9C1H.mode	@ltx/en_us_goadedes/miscellanea:misc.Mode6
ltx/en_us_goadedes/me.m02.d04:meMA.Ode9C1H.ode	@ltx/en_us_goadedes/miscellanea:misc.Ode9
ltx/en_us_goadedes/me.m02.d04:meMA.Ode9C1H.text	@ltx/en_us_goadedes/he.h.m6:heHE.TheonAnthropois.text
ltx/en_us_goadedes/me.m02.d04:meMA.Ode9C1T.incipit	…
ltx/en_us_goadedes/me.m02.d04:meMA.Ode9C1T.melody	@ltx/en_us_goadedes/he.h.m6:heHE.TheonAnthropois.name
ltx/en_us_goadedes/me.m02.d04:meMA.Ode9C1T.mode	@ltx/en_us_goadedes/miscellanea:misc.Mode6
ltx/en_us_goadedes/me.m02.d04:meMA.Ode9C1T.ode	@ltx/en_us_goadedes/miscellanea:misc.Ode9
ltx/en_us_goadedes/me.m02.d04:meMA.Ode9C1T.text	
ltx/en_us_goadedes/me.m02.d04:meVE.Apolytikion1.incipit	@ltx/en_us_goadedes/me.m02.d02:meVE.Apolytikion1.incipit
ltx/en_us_goadedes/me.m02.d04:meVE.Apolytikion1.melody	
ltx/en_us_goadedes/me.m02.d04:meVE.Apolytikion1.mode	@ltx/en_us_goadedes/miscellanea:misc.Mode1
ltx/en_us_goadedes/me.m02.d04:meVE.Apolytikion1.text	@ltx/en_us_goadedes/me.m02.d02:meVE.Apolytikion1.text
ltx/en_us_goadedes/me.m02.d04:meVE.Apolytikion2ger.greekmelody	@ltx/en_us_goadedes/he.a.m4:heAU.TachyProkatalave.greekname
ltx/en_us_goadedes/me.m02.d04:meVE.Apolytikion2ger.incipit	…
ltx/en_us_goadedes/me.m02.d04:meVE.Apolytikion2ger.melody	@ltx/en_us_goadedes/he.a.m4:heAU.TachyProkatalave.name
ltx/en_us_goadedes/me.m02.d04:meVE.Apolytikion2ger.mode	@ltx/en_us_goadedes/miscellanea:misc.Mode4
ltx/en_us_goadedes/me.m02.d04:meVE.Apolytikion2ger.poet	@ltx/en_us_goadedes/poets:po.Gerasimou
ltx/en_us_goadedes/me.m02.d04:meVE.Apolytikion2ger.text	
ltx/en_us_goadedes/me.m02.d04:meVE.AposGlory.incipit	@ltx/en_us_goadedes/me.m02.d01:meVE.SticBoth.incipit
ltx/en_us_goadedes/me.m02.d04:meVE.AposGlory.melody	
ltx/en_us_goadedes/me.m02.d04:meVE.AposGlory.mode	@ltx/en_us_goadedes/miscellanea:misc.Mode2
ltx/en_us_goadedes/me.m02.d04:meVE.AposGlory.poet	@ltx/en_us_goadedes/poets:po.Germanou
ltx/en_us_goadedes/me.m02.d04:meVE.AposGlory.text	@ltx/en_us_goadedes/me.m02.d01:meVE.SticBoth.text
ltx/en_us_goadedes/me.m02.d04:meVE.Aposticha1.greekmelody	@ltx/en_us_goadedes/he.a.m2:heAU.OikosTouEfratha.greekname
ltx/en_us_goadedes/me.m02.d04:meVE.Aposticha1.incipit	@ltx/en_us_goadedes/me.m02.d01:meMA.Aposticha3.incipit
ltx/en_us_goadedes/me.m02.d04:meVE.Aposticha1.melody	@ltx/en_us_goadedes/he.a.m2:heAU.OikosTouEfratha.name
ltx/en_us_goadedes/me.m02.d04:meVE.Aposticha1.mode	@ltx/en_us_goadedes/miscellanea:misc.Mode2
ltx/en_us_goadedes/me.m02.d04:meVE.Aposticha1.text	@ltx/en_us_goadedes/me.m02.d01:meMA.Aposticha3.text
ltx/en_us_goadedes/me.m02.d04:meVE.Aposticha2.incipit	…
ltx/en_us_goadedes/me.m02.d04:meVE.Aposticha2.melody	@ltx/en_us_goadedes/he.a.m2:heAU.OikosTouEfratha.name
ltx/en_us_goadedes/me.m02.d04:meVE.Aposticha2.mode	@ltx/en_us_goadedes/miscellanea:misc.Mode2
ltx/en_us_goadedes/me.m02.d04:meVE.Aposticha2.text	
ltx/en_us_goadedes/me.m02.d04:meVE.Aposticha3.incipit	…
ltx/en_us_goadedes/me.m02.d04:meVE.Aposticha3.melody	@ltx/en_us_goadedes/he.a.m2:heAU.OikosTouEfratha.name
ltx/en_us_goadedes/me.m02.d04:meVE.Aposticha3.mode	@ltx/en_us_goadedes/miscellanea:misc.Mode2
ltx/en_us_goadedes/me.m02.d04:meVE.Aposticha3.text	
ltx/en_us_goadedes/me.m02.d04:meVE.SticGlory.incipit	…
ltx/en_us_goadedes/me.m02.d04:meVE.SticGlory.melody	
ltx/en_us_goadedes/me.m02.d04:meVE.SticGlory.mode	@ltx/en_us_goadedes/miscellanea:misc.Mode7
ltx/en_us_goadedes/me.m02.d04:meVE.SticGlory.text	
ltx/en_us_goadedes/me.m02.d04:meVE.SticStavrotheotokion.greekmelody	@ltx/en_us_goadedes/he.a.m4:heAU.OsGennaionEnMartysi.greekname
ltx/en_us_goadedes/me.m02.d04:meVE.SticStavrotheotokion.incipit	@ltx/en_us_goadedes/me.m01.d19:meMA.AposStavrotheotokion.incipit
ltx/en_us_goadedes/me.m02.d04:meVE.SticStavrotheotokion.melody	@ltx/en_us_goadedes/he.a.m4:heAU.OsGennaionEnMartysi.name
ltx/en_us_goadedes/me.m02.d04:meVE.SticStavrotheotokion.mode	@ltx/en_us_goadedes/miscellanea:misc.Mode4
ltx/en_us_goadedes/me.m02.d04:meVE.SticStavrotheotokion.text	@ltx/en_us_goadedes/me.m01.d19:meMA.AposStavrotheotokion.text
ltx/en_us_goadedes/me.m02.d04:meVE.SticTheotokion.greekmelody	@ltx/en_us_goadedes/he.a.m4:heAU.OsGennaionEnMartysi.greekname
ltx/en_us_goadedes/me.m02.d04:meVE.SticTheotokion.incipit	…
ltx/en_us_goadedes/me.m02.d04:meVE.SticTheotokion.melody	@ltx/en_us_goadedes/he.a.m4:heAU.OsGennaionEnMartysi.name
ltx/en_us_goadedes/me.m02.d04:meVE.SticTheotokion.mode	@ltx/en_us_goadedes/miscellanea:misc.Mode4
ltx/en_us_goadedes/me.m02.d04:meVE.SticTheotokion.text	
ltx/en_us_goadedes/me.m02.d04:meVE.Stichera01.greekmelody	@ltx/en_us_goadedes/he.a.m1:heAU.TonOuranionTagmaton.greekname
ltx/en_us_goadedes/me.m02.d04:meVE.Stichera01.incipit	…
ltx/en_us_goadedes/me.m02.d04:meVE.Stichera01.melody	@ltx/en_us_goadedes/he.a.m1:heAU.TonOuranionTagmaton.name
ltx/en_us_goadedes/me.m02.d04:meVE.Stichera01.mode	@ltx/en_us_goadedes/miscellanea:misc.Mode1
ltx/en_us_goadedes/me.m02.d04:meVE.Stichera01.text	
ltx/en_us_goadedes/me.m02.d04:meVE.Stichera02.incipit	…
ltx/en_us_goadedes/me.m02.d04:meVE.Stichera02.melody	@ltx/en_us_goadedes/he.a.m1:heAU.TonOuranionTagmaton.name
ltx/en_us_goadedes/me.m02.d04:meVE.Stichera02.mode	@ltx/en_us_goadedes/miscellanea:misc.Mode1
ltx/en_us_goadedes/me.m02.d04:meVE.Stichera02.text	
ltx/en_us_goadedes/me.m02.d04:meVE.Stichera03.incipit	…
ltx/en_us_goadedes/me.m02.d04:meVE.Stichera03.melody	@ltx/en_us_goadedes/he.a.m1:heAU.TonOuranionTagmaton.name
ltx/en_us_goadedes/me.m02.d04:meVE.Stichera03.mode	@ltx/en_us_goadedes/miscellanea:misc.Mode1
ltx/en_us_goadedes/me.m02.d04:meVE.Stichera03.text	
ltx/en_us_goadedes/me.m02.d04:meVE.Stichera04.greekmelody	@ltx/en_us_goadedes/he.a.m4:heAU.OsGennaionEnMartysi.greekname
ltx/en_us_goadedes/me.m02.d04:meVE.Stichera04.incipit	…
ltx/en_us_goadedes/me.m02.d04:meVE.Stichera04.melody	@ltx/en_us_goadedes/he.a.m4:heAU.OsGennaionEnMartysi.name
ltx/en_us_goadedes/me.m02.d04:meVE.Stichera04.mode	@ltx/en_us_goadedes/miscellanea:misc.Mode4
ltx/en_us_goadedes/me.m02.d04:meVE.Stichera04.text	
ltx/en_us_goadedes/me.m02.d04:meVE.Stichera05.incipit	…
ltx/en_us_goadedes/me.m02.d04:meVE.Stichera05.melody	@ltx/en_us_goadedes/he.a.m4:heAU.OsGennaionEnMartysi.name
ltx/en_us_goadedes/me.m02.d04:meVE.Stichera05.mode	@ltx/en_us_goadedes/miscellanea:misc.Mode4
ltx/en_us_goadedes/me.m02.d04:meVE.Stichera05.text	
ltx/en_us_goadedes/me.m02.d04:meVE.Stichera06.incipit	…
ltx/en_us_goadedes/me.m02.d04:meVE.Stichera06.melody	@ltx/en_us_goadedes/he.a.m4:heAU.OsGennaionEnMartysi.name
ltx/en_us_goadedes/me.m02.d04:meVE.Stichera06.mode	@ltx/en_us_goadedes/miscellanea:misc.Mode4
ltx/en_us_goadedes/me.m02.d04:meVE.Stichera06.text	
