ltx/en_us_goadedes/pe.d120:peDA.commemoration.full	
ltx/en_us_goadedes/pe.d120:peDA.commemoration.name	Holy Trinity
ltx/en_us_goadedes/pe.d120:peDA.commemoration.short	Pentecost Sunday
ltx/en_us_goadedes/pe.d120:peDA.commemoration.title	For Pentecost.
ltx/en_us_goadedes/pe.d120:peDA.dismissal	@ltx/en_us_goadedes/dismissals:dis00.pentecost
ltx/en_us_goadedes/pe.d120:peDA.insert1	
ltx/en_us_goadedes/pe.d120:peDA.insert2	
ltx/en_us_goadedes/pe.d120:peDA.note	
ltx/en_us_goadedes/pe.d120:peHO.commemorations	
ltx/en_us_goadedes/pe.d120:peHO.daytitle	
ltx/en_us_goadedes/pe.d120:peHO.description1	
ltx/en_us_goadedes/pe.d120:peHO.description2	
ltx/en_us_goadedes/pe.d120:peHO.note1	
ltx/en_us_goadedes/pe.d120:peHO.note2	
ltx/en_us_goadedes/pe.d120:peLI.AfterCommunion.incipit	@ltx/en_us_goadedes/pe.d120:peVE.Apolytikion1.incipit
ltx/en_us_goadedes/pe.d120:peLI.AfterCommunion.mode	@ltx/en_us_goadedes/pe.d120:peVE.Apolytikion1.mode
ltx/en_us_goadedes/pe.d120:peLI.AfterCommunion.text	@ltx/en_us_goadedes/pe.d120:peVE.Apolytikion1.text
ltx/en_us_goadedes/pe.d120:peLI.Kontakion1.incipit	@ltx/en_us_goadedes/pe.d120:peMA.Kontakion1.incipit
ltx/en_us_goadedes/pe.d120:peLI.Kontakion1.melody	@ltx/en_us_goadedes/pe.d120:peMA.Kontakion1.melody
ltx/en_us_goadedes/pe.d120:peLI.Kontakion1.mode	@ltx/en_us_goadedes/pe.d120:peMA.Kontakion1.mode
ltx/en_us_goadedes/pe.d120:peLI.Kontakion1.text	@ltx/en_us_goadedes/pe.d120:peMA.Kontakion1.text
ltx/en_us_goadedes/pe.d120:peLI.MM.Antiphon2.text	@ltx/en_us_goadedes/properties:media.key
ltx/en_us_goadedes/pe.d120:peLI.MM.CommunionHymn.text	@ltx/en_us_goadedes/properties:media.key
ltx/en_us_goadedes/pe.d120:peLI.MM.EntranceHymn.text	@ltx/en_us_goadedes/properties:media.key
ltx/en_us_goadedes/pe.d120:peLI.MM.EntranceHymnAF.text	@ltx/en_us_goadedes/properties:media.key
ltx/en_us_goadedes/pe.d120:peLI.Megalynarion.text	As the Lord’s Disciples awaited Him * in the upper room, the Holy Spirit was sent by God * in fiery tongues, to equip them all with wisdom * to preach the holy Gospel of Christ to the nations all.
ltx/en_us_goadedes/pe.d120:peLI.TheotokosHymn.incipit	@ltx/en_us_goadedes/pe.d120:peMA.Ode9C1H.incipit
ltx/en_us_goadedes/pe.d120:peLI.TheotokosHymn.mode	@ltx/en_us_goadedes/pe.d120:peMA.Ode9C1H.mode
ltx/en_us_goadedes/pe.d120:peLI.TheotokosHymn.text	@ltx/en_us_goadedes/pe.d120:peMA.Ode9C1H.text
ltx/en_us_goadedes/pe.d120:peMA.C1.acrostic.notice1	
ltx/en_us_goadedes/pe.d120:peMA.C1.acrostic.notice2	
ltx/en_us_goadedes/pe.d120:peMA.C1.acrostic.text	
ltx/en_us_goadedes/pe.d120:peMA.C1.acrostic.title	The Canon in Grave Mode.
ltx/en_us_goadedes/pe.d120:peMA.C1.poet	@ltx/en_us_goadedes/poets:po.KosmaMonachou
ltx/en_us_goadedes/pe.d120:peMA.C1.title	@ltx/en_us_goadedes/titles:ti.Canon1Feast
ltx/en_us_goadedes/pe.d120:peMA.C1.translator	The metrical translation by Fr. Seraphim Dedes
ltx/en_us_goadedes/pe.d120:peMA.C1.verse	@ltx/en_us_goadedes/prayers:pr.verse_God.text
ltx/en_us_goadedes/pe.d120:peMA.C2.acrostic.line1.text	Logos Son of God, You sent the Spirit,
ltx/en_us_goadedes/pe.d120:peMA.C2.acrostic.line2.text	another Advocate, from the Father’s bosom
ltx/en_us_goadedes/pe.d120:peMA.C2.acrostic.line3.text	to those on earth in fiery tongues, sign of
ltx/en_us_goadedes/pe.d120:peMA.C2.acrostic.line4.text	inherent Godhead, and grace to the translator.
ltx/en_us_goadedes/pe.d120:peMA.C2.acrostic.notice1	The Acrostic formed by the first letter of each line is as follows:
ltx/en_us_goadedes/pe.d120:peMA.C2.acrostic.notice2	
ltx/en_us_goadedes/pe.d120:peMA.C2.acrostic.text	Logos Son of God, You sent the Spirit, another Advocate, from the Father’s bosom to those on earth in fiery tongues, sign of inherent Godhead, and grace to the translator.
ltx/en_us_goadedes/pe.d120:peMA.C2.acrostic.title	Another Canon.
ltx/en_us_goadedes/pe.d120:peMA.C2.poet	@ltx/en_us_goadedes/poets:po.KyriouIoannouArkla
ltx/en_us_goadedes/pe.d120:peMA.C2.title	@ltx/en_us_goadedes/titles:ti.Canon2Feast
ltx/en_us_goadedes/pe.d120:peMA.C2.translator	The Canon with the acrostic was translated by Fr. Seraphim Dedes.
ltx/en_us_goadedes/pe.d120:peMA.C2.verse	@ltx/en_us_goadedes/prayers:pr.verse_God.text
ltx/en_us_goadedes/pe.d120:peMA.Exaposteilarion1.greekmelody	@ltx/en_us_goadedes/he.a.m3:heAU.OOuranonToisAstrois.greekname
ltx/en_us_goadedes/pe.d120:peMA.Exaposteilarion1.incipit	…
ltx/en_us_goadedes/pe.d120:peMA.Exaposteilarion1.melody	@ltx/en_us_goadedes/he.a.m3:heAU.OOuranonToisAstrois.name
ltx/en_us_goadedes/pe.d120:peMA.Exaposteilarion1.mode	@ltx/en_us_goadedes/miscellanea:misc.Mode3
ltx/en_us_goadedes/pe.d120:peMA.Exaposteilarion1.text	
ltx/en_us_goadedes/pe.d120:peMA.Exaposteilarion2.greekmelody	@ltx/en_us_goadedes/he.a.m3:heAU.OOuranonToisAstrois.greekname
ltx/en_us_goadedes/pe.d120:peMA.Exaposteilarion2.incipit	…
ltx/en_us_goadedes/pe.d120:peMA.Exaposteilarion2.melody	@ltx/en_us_goadedes/he.a.m3:heAU.OOuranonToisAstrois.name
ltx/en_us_goadedes/pe.d120:peMA.Exaposteilarion2.mode	@ltx/en_us_goadedes/miscellanea:misc.Mode3
ltx/en_us_goadedes/pe.d120:peMA.Exaposteilarion2.text	
ltx/en_us_goadedes/pe.d120:peMA.Kathisma11.greekmelody	@ltx/en_us_goadedes/he.a.m4:heAU.KateplagiIosif.greekname
ltx/en_us_goadedes/pe.d120:peMA.Kathisma11.incipit	…
ltx/en_us_goadedes/pe.d120:peMA.Kathisma11.melody	@ltx/en_us_goadedes/he.a.m4:heAU.KateplagiIosif.name
ltx/en_us_goadedes/pe.d120:peMA.Kathisma11.mode	@ltx/en_us_goadedes/miscellanea:misc.Mode4
ltx/en_us_goadedes/pe.d120:peMA.Kathisma11.text	
ltx/en_us_goadedes/pe.d120:peMA.Kathisma21.greekmelody	@ltx/en_us_goadedes/he.a.m4:heAU.KateplagiIosif.greekname
ltx/en_us_goadedes/pe.d120:peMA.Kathisma21.incipit	…
ltx/en_us_goadedes/pe.d120:peMA.Kathisma21.melody	@ltx/en_us_goadedes/he.a.m4:heAU.KateplagiIosif.name
ltx/en_us_goadedes/pe.d120:peMA.Kathisma21.mode	@ltx/en_us_goadedes/miscellanea:misc.Mode4
ltx/en_us_goadedes/pe.d120:peMA.Kathisma21.text	
ltx/en_us_goadedes/pe.d120:peMA.Kathisma31.greekmelody	@ltx/en_us_goadedes/he.a.m8:heAU.ToProstachthen.greekname
ltx/en_us_goadedes/pe.d120:peMA.Kathisma31.incipit	…
ltx/en_us_goadedes/pe.d120:peMA.Kathisma31.melody	@ltx/en_us_goadedes/he.a.m8:heAU.ToProstachthen.name
ltx/en_us_goadedes/pe.d120:peMA.Kathisma31.mode	@ltx/en_us_goadedes/miscellanea:misc.Mode8
ltx/en_us_goadedes/pe.d120:peMA.Kathisma31.text	
ltx/en_us_goadedes/pe.d120:peMA.Kontakion1.incipit	…
ltx/en_us_goadedes/pe.d120:peMA.Kontakion1.melody	
ltx/en_us_goadedes/pe.d120:peMA.Kontakion1.mode	@ltx/en_us_goadedes/miscellanea:misc.Mode8
ltx/en_us_goadedes/pe.d120:peMA.Kontakion1.text	
ltx/en_us_goadedes/pe.d120:peMA.Lauds1.incipit	…
ltx/en_us_goadedes/pe.d120:peMA.Lauds1.melody	
ltx/en_us_goadedes/pe.d120:peMA.Lauds1.mode	@ltx/en_us_goadedes/miscellanea:misc.Mode4
ltx/en_us_goadedes/pe.d120:peMA.Lauds1.text	
ltx/en_us_goadedes/pe.d120:peMA.Lauds2.incipit	…
ltx/en_us_goadedes/pe.d120:peMA.Lauds2.melody	
ltx/en_us_goadedes/pe.d120:peMA.Lauds2.mode	@ltx/en_us_goadedes/miscellanea:misc.Mode4
ltx/en_us_goadedes/pe.d120:peMA.Lauds2.text	
ltx/en_us_goadedes/pe.d120:peMA.Lauds3.incipit	…
ltx/en_us_goadedes/pe.d120:peMA.Lauds3.melody	
ltx/en_us_goadedes/pe.d120:peMA.Lauds3.mode	@ltx/en_us_goadedes/miscellanea:misc.Mode4
ltx/en_us_goadedes/pe.d120:peMA.Lauds3.text	
ltx/en_us_goadedes/pe.d120:peMA.LaudsGlory.incipit	@ltx/en_us_goadedes/pe.d120:peVE.Aposticha3.incipit
ltx/en_us_goadedes/pe.d120:peMA.LaudsGlory.melody	
ltx/en_us_goadedes/pe.d120:peMA.LaudsGlory.mode	@ltx/en_us_goadedes/miscellanea:misc.Mode6
ltx/en_us_goadedes/pe.d120:peMA.LaudsGlory.text	@ltx/en_us_goadedes/pe.d120:peVE.Aposticha3.text
ltx/en_us_goadedes/pe.d120:peMA.MM.Lauds123as123.text	@ltx/en_us_goadedes/properties:media.key
ltx/en_us_goadedes/pe.d120:peMA.MM.Prokeimenon.text	@ltx/en_us_goadedes/properties:media.key
ltx/en_us_goadedes/pe.d120:peMA.Ode1C11.greekmelody	@ltx/en_us_goadedes/he.h.m7:heHE.PontoEkalypse.greekname
ltx/en_us_goadedes/pe.d120:peMA.Ode1C11.incipit	Christ, You have done…
ltx/en_us_goadedes/pe.d120:peMA.Ode1C11.melody	@ltx/en_us_goadedes/he.h.m7:heHE.PontoEkalypse.name
ltx/en_us_goadedes/pe.d120:peMA.Ode1C11.mode	@ltx/en_us_goadedes/miscellanea:misc.Mode7
ltx/en_us_goadedes/pe.d120:peMA.Ode1C11.ode	@ltx/en_us_goadedes/miscellanea:misc.Ode1
ltx/en_us_goadedes/pe.d120:peMA.Ode1C11.text	Christ, You have done what You once promised Your Disciples, * for You sent out the Paraclete Spirit and You shone * light into the world, O Lord who love mankind.
ltx/en_us_goadedes/pe.d120:peMA.Ode1C12.incipit	That which of old…
ltx/en_us_goadedes/pe.d120:peMA.Ode1C12.melody	@ltx/en_us_goadedes/he.h.m7:heHE.PontoEkalypse.name
ltx/en_us_goadedes/pe.d120:peMA.Ode1C12.mode	@ltx/en_us_goadedes/miscellanea:misc.Mode7
ltx/en_us_goadedes/pe.d120:peMA.Ode1C12.ode	@ltx/en_us_goadedes/miscellanea:misc.Ode1
ltx/en_us_goadedes/pe.d120:peMA.Ode1C12.text	That which of old was proclaimed in the Law and Prophets * was fulfilled; for today was the Holy Spirit’s divine * grace was poured on all have believed in Christ.
ltx/en_us_goadedes/pe.d120:peMA.Ode1C1H.greekmelody	@ltx/en_us_goadedes/he.h.m7:heHE.PontoEkalypse.greekname
ltx/en_us_goadedes/pe.d120:peMA.Ode1C1H.incipit	@ltx/en_us_goadedes/he.h.m7:heHE.PontoEkalypse.incipit
ltx/en_us_goadedes/pe.d120:peMA.Ode1C1H.melody	@ltx/en_us_goadedes/he.h.m7:heHE.PontoEkalypse.melody
ltx/en_us_goadedes/pe.d120:peMA.Ode1C1H.mode	@ltx/en_us_goadedes/miscellanea:misc.Mode7
ltx/en_us_goadedes/pe.d120:peMA.Ode1C1H.ode	@ltx/en_us_goadedes/miscellanea:misc.Ode1
ltx/en_us_goadedes/pe.d120:peMA.Ode1C1H.text	@ltx/en_us_goadedes/he.h.m7:heHE.PontoEkalypse.text
ltx/en_us_goadedes/pe.d120:peMA.Ode1C21.greekmelody	@ltx/en_us_goadedes/he.h.m4:heHE.TheioKalyftheis.greekname
ltx/en_us_goadedes/pe.d120:peMA.Ode1C21.incipit	So said the divine mouth…
ltx/en_us_goadedes/pe.d120:peMA.Ode1C21.melody	@ltx/en_us_goadedes/he.h.m4:heHE.TheioKalyftheis.name
ltx/en_us_goadedes/pe.d120:peMA.Ode1C21.mode	@ltx/en_us_goadedes/miscellanea:misc.Mode4
ltx/en_us_goadedes/pe.d120:peMA.Ode1C21.ode	@ltx/en_us_goadedes/miscellanea:misc.Ode1
ltx/en_us_goadedes/pe.d120:peMA.Ode1C21.text	So said the divine mouth of Christ to His Disciples, * “O friends, when I am seated on the throne in heaven * Next to my Father, I will pour out abundant grace * Of the Spirit into souls who long for it to shine. * From My love you shall thus never be separated.”
ltx/en_us_goadedes/pe.d120:peMA.Ode1C211.text	So said the divine mouth of Christ to His Disciples,
ltx/en_us_goadedes/pe.d120:peMA.Ode1C211a.text	S
ltx/en_us_goadedes/pe.d120:peMA.Ode1C211b.text	o said the divine mouth of Christ to His Disciples,
ltx/en_us_goadedes/pe.d120:peMA.Ode1C212.text	“O friends, when I am seated on the throne in heaven
ltx/en_us_goadedes/pe.d120:peMA.Ode1C212a.text	“O
ltx/en_us_goadedes/pe.d120:peMA.Ode1C212b.text	 friends, when I am seated on the throne in heaven
ltx/en_us_goadedes/pe.d120:peMA.Ode1C213.text	Next to my Father, I will pour out abundant grace
ltx/en_us_goadedes/pe.d120:peMA.Ode1C213a.text	N
ltx/en_us_goadedes/pe.d120:peMA.Ode1C213b.text	ext to my Father, I will pour out abundant grace
ltx/en_us_goadedes/pe.d120:peMA.Ode1C214.text	Of the Spirit into souls who long for it to shine.
ltx/en_us_goadedes/pe.d120:peMA.Ode1C214a.text	O
ltx/en_us_goadedes/pe.d120:peMA.Ode1C214b.text	f the Spirit into souls who long for it to shine.
ltx/en_us_goadedes/pe.d120:peMA.Ode1C215.text	From My love you shall thus never be separated.”
ltx/en_us_goadedes/pe.d120:peMA.Ode1C215a.text	F
ltx/en_us_goadedes/pe.d120:peMA.Ode1C215b.text	rom My love you shall thus never be separated.”
ltx/en_us_goadedes/pe.d120:peMA.Ode1C22.incipit	God the Father’s Definition…
ltx/en_us_goadedes/pe.d120:peMA.Ode1C22.melody	@ltx/en_us_goadedes/he.h.m4:heHE.TheioKalyftheis.name
ltx/en_us_goadedes/pe.d120:peMA.Ode1C22.mode	@ltx/en_us_goadedes/miscellanea:misc.Mode4
ltx/en_us_goadedes/pe.d120:peMA.Ode1C22.ode	@ltx/en_us_goadedes/miscellanea:misc.Ode1
ltx/en_us_goadedes/pe.d120:peMA.Ode1C22.text	God the Father’s Definition, Christ the Logos, * On completing His work, granted joy to His friends, * Distributing the Spirit, as He had promised, * Yes, with a rush of mighty wind and tongues of fire. * Oh, how He strengthens hearts to be calm and untroubled!
ltx/en_us_goadedes/pe.d120:peMA.Ode1C221.text	God the Father’s Definition, Christ the Logos,
ltx/en_us_goadedes/pe.d120:peMA.Ode1C221a.text	G
ltx/en_us_goadedes/pe.d120:peMA.Ode1C221b.text	od the Father’s Definition, Christ the Logos,
ltx/en_us_goadedes/pe.d120:peMA.Ode1C222.text	On completing His work, granted joy to His friends,
ltx/en_us_goadedes/pe.d120:peMA.Ode1C222a.text	O
ltx/en_us_goadedes/pe.d120:peMA.Ode1C222b.text	n completing His work, granted joy to His friends,
ltx/en_us_goadedes/pe.d120:peMA.Ode1C223.text	Distributing the Spirit, as He had promised,
ltx/en_us_goadedes/pe.d120:peMA.Ode1C223a.text	D
ltx/en_us_goadedes/pe.d120:peMA.Ode1C223b.text	istributing the Spirit, as He had promised,
ltx/en_us_goadedes/pe.d120:peMA.Ode1C224.text	Yes, with a rush of mighty wind and tongues of fire.
ltx/en_us_goadedes/pe.d120:peMA.Ode1C224a.text	Y
ltx/en_us_goadedes/pe.d120:peMA.Ode1C224b.text	es, with a rush of mighty wind and tongues of fire.
ltx/en_us_goadedes/pe.d120:peMA.Ode1C225.text	Oh, how He strengthens hearts to be calm and untroubled!
ltx/en_us_goadedes/pe.d120:peMA.Ode1C225a.text	O
ltx/en_us_goadedes/pe.d120:peMA.Ode1C225b.text	h, how He strengthens hearts to be calm and untroubled!
ltx/en_us_goadedes/pe.d120:peMA.Ode1C2H.greekmelody	@ltx/en_us_goadedes/he.h.m4:heHE.TheioKalyftheis.greekname
ltx/en_us_goadedes/pe.d120:peMA.Ode1C2H.incipit	@ltx/en_us_goadedes/he.h.m4:heHE.TheioKalyftheis.incipit
ltx/en_us_goadedes/pe.d120:peMA.Ode1C2H.melody	@ltx/en_us_goadedes/he.h.m4:heHE.TheioKalyftheis.melody
ltx/en_us_goadedes/pe.d120:peMA.Ode1C2H.mode	@ltx/en_us_goadedes/miscellanea:misc.Mode4
ltx/en_us_goadedes/pe.d120:peMA.Ode1C2H.ode	@ltx/en_us_goadedes/miscellanea:misc.Ode1
ltx/en_us_goadedes/pe.d120:peMA.Ode1C2H.text	@ltx/en_us_goadedes/he.h.m4:heHE.TheioKalyftheis.text
ltx/en_us_goadedes/pe.d120:peMA.Ode1C2H1.text	@ltx/en_us_goadedes/he.h.m4:heHE.TheioKalyftheis1.text
ltx/en_us_goadedes/pe.d120:peMA.Ode1C2H1a.text	@ltx/en_us_goadedes/he.h.m4:heHE.TheioKalyftheis1a.text
ltx/en_us_goadedes/pe.d120:peMA.Ode1C2H1b.text	@ltx/en_us_goadedes/he.h.m4:heHE.TheioKalyftheis1b.text
ltx/en_us_goadedes/pe.d120:peMA.Ode1C2H2.text	@ltx/en_us_goadedes/he.h.m4:heHE.TheioKalyftheis2.text
ltx/en_us_goadedes/pe.d120:peMA.Ode1C2H2a.text	@ltx/en_us_goadedes/he.h.m4:heHE.TheioKalyftheis2a.text
ltx/en_us_goadedes/pe.d120:peMA.Ode1C2H2b.text	@ltx/en_us_goadedes/he.h.m4:heHE.TheioKalyftheis2b.text
ltx/en_us_goadedes/pe.d120:peMA.Ode1C2H3.text	@ltx/en_us_goadedes/he.h.m4:heHE.TheioKalyftheis3.text
ltx/en_us_goadedes/pe.d120:peMA.Ode1C2H3a.text	@ltx/en_us_goadedes/he.h.m4:heHE.TheioKalyftheis3a.text
ltx/en_us_goadedes/pe.d120:peMA.Ode1C2H3b.text	@ltx/en_us_goadedes/he.h.m4:heHE.TheioKalyftheis3b.text
ltx/en_us_goadedes/pe.d120:peMA.Ode1C2H4.text	@ltx/en_us_goadedes/he.h.m4:heHE.TheioKalyftheis4.text
ltx/en_us_goadedes/pe.d120:peMA.Ode1C2H4a.text	@ltx/en_us_goadedes/he.h.m4:heHE.TheioKalyftheis4a.text
ltx/en_us_goadedes/pe.d120:peMA.Ode1C2H4b.text	@ltx/en_us_goadedes/he.h.m4:heHE.TheioKalyftheis4b.text
ltx/en_us_goadedes/pe.d120:peMA.Ode1C2H5.text	@ltx/en_us_goadedes/he.h.m4:heHE.TheioKalyftheis5.text
ltx/en_us_goadedes/pe.d120:peMA.Ode1C2H5a.text	@ltx/en_us_goadedes/he.h.m4:heHE.TheioKalyftheis5a.text
ltx/en_us_goadedes/pe.d120:peMA.Ode1C2H5b.text	@ltx/en_us_goadedes/he.h.m4:heHE.TheioKalyftheis5b.text
ltx/en_us_goadedes/pe.d120:peMA.Ode3C11.greekmelody	@ltx/en_us_goadedes/he.h.m7:heHE.TinExYpsousDynamin.greekname
ltx/en_us_goadedes/pe.d120:peMA.Ode3C11.incipit	When the grace and power…
ltx/en_us_goadedes/pe.d120:peMA.Ode3C11.melody	@ltx/en_us_goadedes/he.h.m7:heHE.TinExYpsousDynamin.name
ltx/en_us_goadedes/pe.d120:peMA.Ode3C11.mode	@ltx/en_us_goadedes/miscellanea:misc.Mode7
ltx/en_us_goadedes/pe.d120:peMA.Ode3C11.ode	@ltx/en_us_goadedes/miscellanea:misc.Ode3
ltx/en_us_goadedes/pe.d120:peMA.Ode3C11.text	When the grace and power of the Holy Spirit came, * it united in holy concord * the language that was divided of old * when men badly agreed. It gives understanding * and knowledge of the Trinity to the believers, * in which we are confirmed in faith.
ltx/en_us_goadedes/pe.d120:peMA.Ode3C1H.greekmelody	@ltx/en_us_goadedes/he.h.m7:heHE.TinExYpsousDynamin.greekname
ltx/en_us_goadedes/pe.d120:peMA.Ode3C1H.incipit	@ltx/en_us_goadedes/he.h.m7:heHE.TinExYpsousDynamin.incipit
ltx/en_us_goadedes/pe.d120:peMA.Ode3C1H.melody	@ltx/en_us_goadedes/he.h.m7:heHE.TinExYpsousDynamin.melody
ltx/en_us_goadedes/pe.d120:peMA.Ode3C1H.mode	@ltx/en_us_goadedes/miscellanea:misc.Mode7
ltx/en_us_goadedes/pe.d120:peMA.Ode3C1H.ode	@ltx/en_us_goadedes/miscellanea:misc.Ode3
ltx/en_us_goadedes/pe.d120:peMA.Ode3C1H.text	@ltx/en_us_goadedes/he.h.m7:heHE.TinExYpsousDynamin.text
ltx/en_us_goadedes/pe.d120:peMA.Ode3C21.greekmelody	@ltx/en_us_goadedes/he.h.m4:heHE.ErrixeGastros.greekname
ltx/en_us_goadedes/pe.d120:peMA.Ode3C21.incipit	Truly incomprehensible…
ltx/en_us_goadedes/pe.d120:peMA.Ode3C21.melody	@ltx/en_us_goadedes/he.h.m4:heHE.ErrixeGastros.name
ltx/en_us_goadedes/pe.d120:peMA.Ode3C21.mode	@ltx/en_us_goadedes/miscellanea:misc.Mode4
ltx/en_us_goadedes/pe.d120:peMA.Ode3C21.ode	@ltx/en_us_goadedes/miscellanea:misc.Ode3
ltx/en_us_goadedes/pe.d120:peMA.Ode3C21.text	Truly incomprehensible is the most divine * Holy Spirit’s grace! It made unlettered fishermen * Erudite speakers, who by their brilliant preaching * Stifled many sophists, and who drew out countless * People from the deep and dark night of ignorance.
ltx/en_us_goadedes/pe.d120:peMA.Ode3C211.text	Truly incomprehensible is the most divine
ltx/en_us_goadedes/pe.d120:peMA.Ode3C211a.text	T
ltx/en_us_goadedes/pe.d120:peMA.Ode3C211b.text	ruly incomprehensible is the most divine
ltx/en_us_goadedes/pe.d120:peMA.Ode3C212.text	Holy Spirit’s grace! It made unlettered fishermen
ltx/en_us_goadedes/pe.d120:peMA.Ode3C212a.text	H
ltx/en_us_goadedes/pe.d120:peMA.Ode3C212b.text	oly Spirit’s grace! It made unlettered fishermen
ltx/en_us_goadedes/pe.d120:peMA.Ode3C213.text	Erudite speakers, who by their brilliant preaching 
ltx/en_us_goadedes/pe.d120:peMA.Ode3C213a.text	E
ltx/en_us_goadedes/pe.d120:peMA.Ode3C213b.text	rudite speakers, who by their brilliant preaching 
ltx/en_us_goadedes/pe.d120:peMA.Ode3C214.text	Stifled many sophists, and who drew out countless
ltx/en_us_goadedes/pe.d120:peMA.Ode3C214a.text	S
ltx/en_us_goadedes/pe.d120:peMA.Ode3C214b.text	tifled many sophists, and who drew out countless
ltx/en_us_goadedes/pe.d120:peMA.Ode3C215.text	People from the deep and dark night of ignorance.
ltx/en_us_goadedes/pe.d120:peMA.Ode3C215a.text	P
ltx/en_us_goadedes/pe.d120:peMA.Ode3C215b.text	eople from the deep and dark night of ignorance.
ltx/en_us_goadedes/pe.d120:peMA.Ode3C22.incipit	Immortal, almighty…
ltx/en_us_goadedes/pe.d120:peMA.Ode3C22.melody	@ltx/en_us_goadedes/he.h.m4:heHE.ErrixeGastros.name
ltx/en_us_goadedes/pe.d120:peMA.Ode3C22.mode	@ltx/en_us_goadedes/miscellanea:misc.Mode4
ltx/en_us_goadedes/pe.d120:peMA.Ode3C22.ode	@ltx/en_us_goadedes/miscellanea:misc.Ode3
ltx/en_us_goadedes/pe.d120:peMA.Ode3C22.text	Immortal, almighty, the light-creating Splendor * Receives by procession from Light unbegotten * Its being. Now Its fiery sound reveals that It is * The consubstantial Beacon of God the Father’s * Authority through the Son, to the nations in Zion.
ltx/en_us_goadedes/pe.d120:peMA.Ode3C221.text	Immortal, almighty, the light-creating Splendor
ltx/en_us_goadedes/pe.d120:peMA.Ode3C221a.text	I
ltx/en_us_goadedes/pe.d120:peMA.Ode3C221b.text	mmortal, almighty, the light-creating Splendor
ltx/en_us_goadedes/pe.d120:peMA.Ode3C222.text	Receives by procession from Light unbegotten
ltx/en_us_goadedes/pe.d120:peMA.Ode3C222a.text	R
ltx/en_us_goadedes/pe.d120:peMA.Ode3C222b.text	eceives by procession from Light unbegotten
ltx/en_us_goadedes/pe.d120:peMA.Ode3C223.text	Its being. Now Its fiery sound reveals that It is
ltx/en_us_goadedes/pe.d120:peMA.Ode3C223a.text	I
ltx/en_us_goadedes/pe.d120:peMA.Ode3C223b.text	ts being. Now Its fiery sound reveals that It is
ltx/en_us_goadedes/pe.d120:peMA.Ode3C224.text	The consubstantial Beacon of God the Father’s
ltx/en_us_goadedes/pe.d120:peMA.Ode3C224a.text	T
ltx/en_us_goadedes/pe.d120:peMA.Ode3C224b.text	he consubstantial Beacon of God the Father’s
ltx/en_us_goadedes/pe.d120:peMA.Ode3C225.text	Authority through the Son, to the nations in Zion.
ltx/en_us_goadedes/pe.d120:peMA.Ode3C225a.text	A
ltx/en_us_goadedes/pe.d120:peMA.Ode3C225b.text	uthority through the Son, to the nations in Zion.
ltx/en_us_goadedes/pe.d120:peMA.Ode3C2H.greekmelody	@ltx/en_us_goadedes/he.h.m4:heHE.ErrixeGastros.greekname
ltx/en_us_goadedes/pe.d120:peMA.Ode3C2H.incipit	@ltx/en_us_goadedes/he.h.m4:heHE.ErrixeGastros.incipit
ltx/en_us_goadedes/pe.d120:peMA.Ode3C2H.melody	@ltx/en_us_goadedes/he.h.m4:heHE.ErrixeGastros.melody
ltx/en_us_goadedes/pe.d120:peMA.Ode3C2H.mode	@ltx/en_us_goadedes/miscellanea:misc.Mode4
ltx/en_us_goadedes/pe.d120:peMA.Ode3C2H.ode	@ltx/en_us_goadedes/miscellanea:misc.Ode3
ltx/en_us_goadedes/pe.d120:peMA.Ode3C2H.text	@ltx/en_us_goadedes/he.h.m4:heHE.ErrixeGastros.text
ltx/en_us_goadedes/pe.d120:peMA.Ode3C2H1.text	@ltx/en_us_goadedes/he.h.m4:heHE.ErrixeGastros1.text
ltx/en_us_goadedes/pe.d120:peMA.Ode3C2H1a.text	@ltx/en_us_goadedes/he.h.m4:heHE.ErrixeGastros1a.text
ltx/en_us_goadedes/pe.d120:peMA.Ode3C2H1b.text	@ltx/en_us_goadedes/he.h.m4:heHE.ErrixeGastros1b.text
ltx/en_us_goadedes/pe.d120:peMA.Ode3C2H2.text	@ltx/en_us_goadedes/he.h.m4:heHE.ErrixeGastros2.text
ltx/en_us_goadedes/pe.d120:peMA.Ode3C2H2a.text	@ltx/en_us_goadedes/he.h.m4:heHE.ErrixeGastros2a.text
ltx/en_us_goadedes/pe.d120:peMA.Ode3C2H2b.text	@ltx/en_us_goadedes/he.h.m4:heHE.ErrixeGastros2b.text
ltx/en_us_goadedes/pe.d120:peMA.Ode3C2H3.text	@ltx/en_us_goadedes/he.h.m4:heHE.ErrixeGastros3.text
ltx/en_us_goadedes/pe.d120:peMA.Ode3C2H3a.text	@ltx/en_us_goadedes/he.h.m4:heHE.ErrixeGastros3a.text
ltx/en_us_goadedes/pe.d120:peMA.Ode3C2H3b.text	@ltx/en_us_goadedes/he.h.m4:heHE.ErrixeGastros3b.text
ltx/en_us_goadedes/pe.d120:peMA.Ode3C2H4.text	@ltx/en_us_goadedes/he.h.m4:heHE.ErrixeGastros4.text
ltx/en_us_goadedes/pe.d120:peMA.Ode3C2H4a.text	@ltx/en_us_goadedes/he.h.m4:heHE.ErrixeGastros4a.text
ltx/en_us_goadedes/pe.d120:peMA.Ode3C2H4b.text	@ltx/en_us_goadedes/he.h.m4:heHE.ErrixeGastros4b.text
ltx/en_us_goadedes/pe.d120:peMA.Ode3C2H5.text	@ltx/en_us_goadedes/he.h.m4:heHE.ErrixeGastros5.text
ltx/en_us_goadedes/pe.d120:peMA.Ode3C2H5a.text	@ltx/en_us_goadedes/he.h.m4:heHE.ErrixeGastros5a.text
ltx/en_us_goadedes/pe.d120:peMA.Ode3C2H5b.text	@ltx/en_us_goadedes/he.h.m4:heHE.ErrixeGastros5b.text
ltx/en_us_goadedes/pe.d120:peMA.Ode3Kathisma1.greekmelody	@ltx/en_us_goadedes/he.a.m8:heAU.ToProstachthen.greekname
ltx/en_us_goadedes/pe.d120:peMA.Ode3Kathisma1.incipit	The Savior’s friends…
ltx/en_us_goadedes/pe.d120:peMA.Ode3Kathisma1.melody	@ltx/en_us_goadedes/he.a.m8:heAU.ToProstachthen.name
ltx/en_us_goadedes/pe.d120:peMA.Ode3Kathisma1.mode	@ltx/en_us_goadedes/miscellanea:misc.Mode8
ltx/en_us_goadedes/pe.d120:peMA.Ode3Kathisma1.text	The Savior’s friends, who loved Him very much, were filled with joy, * receiving courage, they who formerly were frightened, * on this day, when the Holy Spirit from on high descended * upon the Disciples’ house in the upper room, * with each speaking to the people in different tongues. * For the tongues that appeared as fire were distributed to them, * and they were not consumed by the flames, * but instead were refreshed by them.
ltx/en_us_goadedes/pe.d120:peMA.Ode4C11.greekmelody	@ltx/en_us_goadedes/he.h.m7:heHE.KatanoonOProfitis.greekname
ltx/en_us_goadedes/pe.d120:peMA.Ode4C11.incipit	Today the Comforter Spirit…
ltx/en_us_goadedes/pe.d120:peMA.Ode4C11.melody	@ltx/en_us_goadedes/he.h.m7:heHE.KatanoonOProfitis.name
ltx/en_us_goadedes/pe.d120:peMA.Ode4C11.mode	@ltx/en_us_goadedes/miscellanea:misc.Mode7
ltx/en_us_goadedes/pe.d120:peMA.Ode4C11.ode	@ltx/en_us_goadedes/miscellanea:misc.Ode4
ltx/en_us_goadedes/pe.d120:peMA.Ode4C11.text	Today the Comforter Spirit, who through the Law had been declared * and who spoke in the Prophets * of old to the imperfect, is recognized as true God * by those were eyewitnesses and ministers of the Word.
ltx/en_us_goadedes/pe.d120:peMA.Ode4C12.incipit	Bearing the sign…
ltx/en_us_goadedes/pe.d120:peMA.Ode4C12.melody	@ltx/en_us_goadedes/he.h.m7:heHE.KatanoonOProfitis.name
ltx/en_us_goadedes/pe.d120:peMA.Ode4C12.mode	@ltx/en_us_goadedes/miscellanea:misc.Mode7
ltx/en_us_goadedes/pe.d120:peMA.Ode4C12.ode	@ltx/en_us_goadedes/miscellanea:misc.Ode4
ltx/en_us_goadedes/pe.d120:peMA.Ode4C12.text	Bearing the sign of the Godhead, on the Apostles as if fire * the Spirit was divided; * and in the foreign languages He was manifested, * coming as divine might from the Father of His own accord.
ltx/en_us_goadedes/pe.d120:peMA.Ode4C1H.greekmelody	@ltx/en_us_goadedes/he.h.m7:heHE.KatanoonOProfitis.greekname
ltx/en_us_goadedes/pe.d120:peMA.Ode4C1H.incipit	@ltx/en_us_goadedes/he.h.m7:heHE.KatanoonOProfitis.incipit
ltx/en_us_goadedes/pe.d120:peMA.Ode4C1H.melody	@ltx/en_us_goadedes/he.h.m7:heHE.KatanoonOProfitis.melody
ltx/en_us_goadedes/pe.d120:peMA.Ode4C1H.mode	@ltx/en_us_goadedes/miscellanea:misc.Mode7
ltx/en_us_goadedes/pe.d120:peMA.Ode4C1H.ode	@ltx/en_us_goadedes/miscellanea:misc.Ode4
ltx/en_us_goadedes/pe.d120:peMA.Ode4C1H.text	@ltx/en_us_goadedes/he.h.m7:heHE.KatanoonOProfitis.text
ltx/en_us_goadedes/pe.d120:peMA.Ode4C21.greekmelody	@ltx/en_us_goadedes/he.h.m4:heHE.AnaxAnakton.greekname
ltx/en_us_goadedes/pe.d120:peMA.Ode4C21.incipit	Regarding the divine bath…
ltx/en_us_goadedes/pe.d120:peMA.Ode4C21.melody	@ltx/en_us_goadedes/he.h.m4:heHE.AnaxAnakton.name
ltx/en_us_goadedes/pe.d120:peMA.Ode4C21.mode	@ltx/en_us_goadedes/miscellanea:misc.Mode4
ltx/en_us_goadedes/pe.d120:peMA.Ode4C21.ode	@ltx/en_us_goadedes/miscellanea:misc.Ode4
ltx/en_us_goadedes/pe.d120:peMA.Ode4C21.text	Regarding the divine bath of regeneration, * At night You spoke to one of composite nature, * Divine Logos; then on the Cross You poured out for me * Vital water from Your most pure side that was pierced. * On this day You complete it with the Spirit’s fire.
ltx/en_us_goadedes/pe.d120:peMA.Ode4C211.text	Regarding the divine bath of regeneration,
ltx/en_us_goadedes/pe.d120:peMA.Ode4C211a.text	R
ltx/en_us_goadedes/pe.d120:peMA.Ode4C211b.text	egarding the divine bath of regeneration,
ltx/en_us_goadedes/pe.d120:peMA.Ode4C212.text	At night You spoke to one of composite nature,
ltx/en_us_goadedes/pe.d120:peMA.Ode4C212a.text	A
ltx/en_us_goadedes/pe.d120:peMA.Ode4C212b.text	t night You spoke to one of composite nature,
ltx/en_us_goadedes/pe.d120:peMA.Ode4C213.text	Divine Logos; then on the Cross You poured out for me
ltx/en_us_goadedes/pe.d120:peMA.Ode4C213a.text	D
ltx/en_us_goadedes/pe.d120:peMA.Ode4C213b.text	ivine Logos; then on the Cross You poured out for me
ltx/en_us_goadedes/pe.d120:peMA.Ode4C214.text	Vital water from Your most pure side that was pierced.
ltx/en_us_goadedes/pe.d120:peMA.Ode4C214a.text	V
ltx/en_us_goadedes/pe.d120:peMA.Ode4C214b.text	ital water from Your most pure side that was pierced.
ltx/en_us_goadedes/pe.d120:peMA.Ode4C215.text	On this day You complete it with the Spirit’s fire.
ltx/en_us_goadedes/pe.d120:peMA.Ode4C215a.text	O
ltx/en_us_goadedes/pe.d120:peMA.Ode4C215b.text	n this day You complete it with the Spirit’s fire.
ltx/en_us_goadedes/pe.d120:peMA.Ode4C22.incipit	Creation all bends the knee…
ltx/en_us_goadedes/pe.d120:peMA.Ode4C22.melody	@ltx/en_us_goadedes/he.h.m4:heHE.AnaxAnakton.name
ltx/en_us_goadedes/pe.d120:peMA.Ode4C22.mode	@ltx/en_us_goadedes/miscellanea:misc.Mode4
ltx/en_us_goadedes/pe.d120:peMA.Ode4C22.ode	@ltx/en_us_goadedes/miscellanea:misc.Ode4
ltx/en_us_goadedes/pe.d120:peMA.Ode4C22.text	Creation all bends the knee to the Advocate * And the Father’s Son and the consubstantial Father, * The three hypostases in the single essence, * Eternal, unapproachable, infallible. * For the Spirit’s grace has shone as light and knowledge.
ltx/en_us_goadedes/pe.d120:peMA.Ode4C221.text	Creation all bends the knee to the Advocate
ltx/en_us_goadedes/pe.d120:peMA.Ode4C221a.text	C
ltx/en_us_goadedes/pe.d120:peMA.Ode4C221b.text	reation all bends the knee to the Advocate
ltx/en_us_goadedes/pe.d120:peMA.Ode4C222.text	And the Father’s Son and the consubstantial Father,
ltx/en_us_goadedes/pe.d120:peMA.Ode4C222a.text	A
ltx/en_us_goadedes/pe.d120:peMA.Ode4C222b.text	nd the Father’s Son and the consubstantial Father,
ltx/en_us_goadedes/pe.d120:peMA.Ode4C223.text	The three hypostases in the single essence,
ltx/en_us_goadedes/pe.d120:peMA.Ode4C223a.text	T
ltx/en_us_goadedes/pe.d120:peMA.Ode4C223b.text	he three hypostases in the single essence,
ltx/en_us_goadedes/pe.d120:peMA.Ode4C224.text	Eternal, unapproachable, infallible.
ltx/en_us_goadedes/pe.d120:peMA.Ode4C224a.text	E
ltx/en_us_goadedes/pe.d120:peMA.Ode4C224b.text	ternal, unapproachable, infallible.
ltx/en_us_goadedes/pe.d120:peMA.Ode4C225.text	For the Spirit’s grace has shone as light and knowledge.
ltx/en_us_goadedes/pe.d120:peMA.Ode4C225a.text	F
ltx/en_us_goadedes/pe.d120:peMA.Ode4C225b.text	or the Spirit’s grace has shone as light and knowledge.
ltx/en_us_goadedes/pe.d120:peMA.Ode4C23.incipit	Ritually worship God…
ltx/en_us_goadedes/pe.d120:peMA.Ode4C23.melody	@ltx/en_us_goadedes/he.h.m4:heHE.AnaxAnakton.name
ltx/en_us_goadedes/pe.d120:peMA.Ode4C23.mode	@ltx/en_us_goadedes/miscellanea:misc.Mode4
ltx/en_us_goadedes/pe.d120:peMA.Ode4C23.ode	@ltx/en_us_goadedes/miscellanea:misc.Ode4
ltx/en_us_goadedes/pe.d120:peMA.Ode4C23.text	Ritually worship God, the Holy Trinity, * O all you servants of the tri-solar essence. * Munificent Christ supernaturally perfects * The faithful; and lighting the way to salvation, * He richly supplies all the grace of the Spirit.
ltx/en_us_goadedes/pe.d120:peMA.Ode4C231.text	Ritually worship God, the Holy Trinity,
ltx/en_us_goadedes/pe.d120:peMA.Ode4C231a.text	R
ltx/en_us_goadedes/pe.d120:peMA.Ode4C231b.text	itually worship God, the Holy Trinity,
ltx/en_us_goadedes/pe.d120:peMA.Ode4C232.text	O all you servants of the tri-solar essence.
ltx/en_us_goadedes/pe.d120:peMA.Ode4C232a.text	O
ltx/en_us_goadedes/pe.d120:peMA.Ode4C232b.text	 all you servants of the tri-solar essence.
ltx/en_us_goadedes/pe.d120:peMA.Ode4C233.text	Munificent Christ supernaturally perfects
ltx/en_us_goadedes/pe.d120:peMA.Ode4C233a.text	M
ltx/en_us_goadedes/pe.d120:peMA.Ode4C233b.text	unificent Christ supernaturally perfects
ltx/en_us_goadedes/pe.d120:peMA.Ode4C234.text	The faithful; and lighting the way to salvation,
ltx/en_us_goadedes/pe.d120:peMA.Ode4C234a.text	T
ltx/en_us_goadedes/pe.d120:peMA.Ode4C234b.text	he faithful; and lighting the way to salvation,
ltx/en_us_goadedes/pe.d120:peMA.Ode4C235.text	He richly supplies all the grace of the Spirit.
ltx/en_us_goadedes/pe.d120:peMA.Ode4C235a.text	H
ltx/en_us_goadedes/pe.d120:peMA.Ode4C235b.text	e richly supplies all the grace of the Spirit.
ltx/en_us_goadedes/pe.d120:peMA.Ode4C2H.greekmelody	@ltx/en_us_goadedes/he.h.m4:heHE.AnaxAnakton.greekname
ltx/en_us_goadedes/pe.d120:peMA.Ode4C2H.incipit	@ltx/en_us_goadedes/he.h.m4:heHE.AnaxAnakton.incipit
ltx/en_us_goadedes/pe.d120:peMA.Ode4C2H.melody	@ltx/en_us_goadedes/he.h.m4:heHE.AnaxAnakton.melody
ltx/en_us_goadedes/pe.d120:peMA.Ode4C2H.mode	@ltx/en_us_goadedes/miscellanea:misc.Mode4
ltx/en_us_goadedes/pe.d120:peMA.Ode4C2H.ode	@ltx/en_us_goadedes/miscellanea:misc.Ode4
ltx/en_us_goadedes/pe.d120:peMA.Ode4C2H.text	@ltx/en_us_goadedes/he.h.m4:heHE.AnaxAnakton.text
ltx/en_us_goadedes/pe.d120:peMA.Ode4C2H1.text	@ltx/en_us_goadedes/he.h.m4:heHE.AnaxAnakton1.text
ltx/en_us_goadedes/pe.d120:peMA.Ode4C2H1a.text	@ltx/en_us_goadedes/he.h.m4:heHE.AnaxAnakton1a.text
ltx/en_us_goadedes/pe.d120:peMA.Ode4C2H1b.text	@ltx/en_us_goadedes/he.h.m4:heHE.AnaxAnakton1b.text
ltx/en_us_goadedes/pe.d120:peMA.Ode4C2H2.text	@ltx/en_us_goadedes/he.h.m4:heHE.AnaxAnakton2.text
ltx/en_us_goadedes/pe.d120:peMA.Ode4C2H2a.text	@ltx/en_us_goadedes/he.h.m4:heHE.AnaxAnakton2a.text
ltx/en_us_goadedes/pe.d120:peMA.Ode4C2H2b.text	@ltx/en_us_goadedes/he.h.m4:heHE.AnaxAnakton2b.text
ltx/en_us_goadedes/pe.d120:peMA.Ode4C2H3.text	@ltx/en_us_goadedes/he.h.m4:heHE.AnaxAnakton3.text
ltx/en_us_goadedes/pe.d120:peMA.Ode4C2H3a.text	@ltx/en_us_goadedes/he.h.m4:heHE.AnaxAnakton3a.text
ltx/en_us_goadedes/pe.d120:peMA.Ode4C2H3b.text	@ltx/en_us_goadedes/he.h.m4:heHE.AnaxAnakton3b.text
ltx/en_us_goadedes/pe.d120:peMA.Ode4C2H4.text	@ltx/en_us_goadedes/he.h.m4:heHE.AnaxAnakton4.text
ltx/en_us_goadedes/pe.d120:peMA.Ode4C2H4a.text	@ltx/en_us_goadedes/he.h.m4:heHE.AnaxAnakton4a.text
ltx/en_us_goadedes/pe.d120:peMA.Ode4C2H4b.text	@ltx/en_us_goadedes/he.h.m4:heHE.AnaxAnakton4b.text
ltx/en_us_goadedes/pe.d120:peMA.Ode4C2H5.text	@ltx/en_us_goadedes/he.h.m4:heHE.AnaxAnakton5.text
ltx/en_us_goadedes/pe.d120:peMA.Ode4C2H5a.text	@ltx/en_us_goadedes/he.h.m4:heHE.AnaxAnakton5a.text
ltx/en_us_goadedes/pe.d120:peMA.Ode4C2H5b.text	@ltx/en_us_goadedes/he.h.m4:heHE.AnaxAnakton5b.text
ltx/en_us_goadedes/pe.d120:peMA.Ode5C11.greekmelody	@ltx/en_us_goadedes/he.h.m7:heHE.ToDiaTonFovonSou.greekname
ltx/en_us_goadedes/pe.d120:peMA.Ode5C11.incipit	That which on this day…
ltx/en_us_goadedes/pe.d120:peMA.Ode5C11.melody	@ltx/en_us_goadedes/he.h.m7:heHE.ToDiaTonFovonSou.name
ltx/en_us_goadedes/pe.d120:peMA.Ode5C11.mode	@ltx/en_us_goadedes/miscellanea:misc.Mode7
ltx/en_us_goadedes/pe.d120:peMA.Ode5C11.ode	@ltx/en_us_goadedes/miscellanea:misc.Ode5
ltx/en_us_goadedes/pe.d120:peMA.Ode5C11.text	That which on this day has come down is strength divine: * the Spirit who is good, the Spirit of the wisdom of God, * the Spirit who proceeds from the Father * and is revealed to us believers through the Son. * To those in whom He dwells He imparts the holiness, * in which He is perceived by them to have it naturally.
ltx/en_us_goadedes/pe.d120:peMA.Ode5C1H.greekmelody	@ltx/en_us_goadedes/he.h.m7:heHE.ToDiaTonFovonSou.greekname
ltx/en_us_goadedes/pe.d120:peMA.Ode5C1H.incipit	@ltx/en_us_goadedes/he.h.m7:heHE.ToDiaTonFovonSou.incipit
ltx/en_us_goadedes/pe.d120:peMA.Ode5C1H.melody	@ltx/en_us_goadedes/he.h.m7:heHE.ToDiaTonFovonSou.melody
ltx/en_us_goadedes/pe.d120:peMA.Ode5C1H.mode	@ltx/en_us_goadedes/miscellanea:misc.Mode7
ltx/en_us_goadedes/pe.d120:peMA.Ode5C1H.ode	@ltx/en_us_goadedes/miscellanea:misc.Ode5
ltx/en_us_goadedes/pe.d120:peMA.Ode5C1H.text	@ltx/en_us_goadedes/he.h.m7:heHE.ToDiaTonFovonSou.text
ltx/en_us_goadedes/pe.d120:peMA.Ode5C21.greekmelody	@ltx/en_us_goadedes/he.h.m4:heHE.LytirionKatharsin.greekname
ltx/en_us_goadedes/pe.d120:peMA.Ode5C21.incipit	Essentially one…
ltx/en_us_goadedes/pe.d120:peMA.Ode5C21.melody	@ltx/en_us_goadedes/he.h.m4:heHE.LytirionKatharsin.name
ltx/en_us_goadedes/pe.d120:peMA.Ode5C21.mode	@ltx/en_us_goadedes/miscellanea:misc.Mode4
ltx/en_us_goadedes/pe.d120:peMA.Ode5C21.ode	@ltx/en_us_goadedes/miscellanea:misc.Ode5
ltx/en_us_goadedes/pe.d120:peMA.Ode5C21.text	Essentially one with the Father, the Spirit * Readily not servilely, as He was pleased, descended, * Supplying, by the tongues, the Apostles with knowledge. * By this He confirmed the vital words and the promise * Of the Savior, being himself the Father’s power.
ltx/en_us_goadedes/pe.d120:peMA.Ode5C211.text	Essentially one with the Father, the Spirit
ltx/en_us_goadedes/pe.d120:peMA.Ode5C211a.text	E
ltx/en_us_goadedes/pe.d120:peMA.Ode5C211b.text	ssentially one with the Father, the Spirit
ltx/en_us_goadedes/pe.d120:peMA.Ode5C212.text	Readily not servilely, as He was pleased, descended,
ltx/en_us_goadedes/pe.d120:peMA.Ode5C212a.text	R
ltx/en_us_goadedes/pe.d120:peMA.Ode5C212b.text	eadily not servilely, as He was pleased, descended,
ltx/en_us_goadedes/pe.d120:peMA.Ode5C213.text	Supplying, by the tongues, the Apostles with knowledge.
ltx/en_us_goadedes/pe.d120:peMA.Ode5C213a.text	S
ltx/en_us_goadedes/pe.d120:peMA.Ode5C213b.text	upplying, by the tongues, the Apostles with knowledge.
ltx/en_us_goadedes/pe.d120:peMA.Ode5C214.text	By this He confirmed the vital words and the promise
ltx/en_us_goadedes/pe.d120:peMA.Ode5C214a.text	B
ltx/en_us_goadedes/pe.d120:peMA.Ode5C214b.text	y this He confirmed the vital words and the promise
ltx/en_us_goadedes/pe.d120:peMA.Ode5C215.text	Of the Savior, being himself the Father’s power.
ltx/en_us_goadedes/pe.d120:peMA.Ode5C215a.text	O
ltx/en_us_goadedes/pe.d120:peMA.Ode5C215b.text	f the Savior, being himself the Father’s power.
ltx/en_us_goadedes/pe.d120:peMA.Ode5C22.incipit	Sovereign God and Logos…
ltx/en_us_goadedes/pe.d120:peMA.Ode5C22.melody	@ltx/en_us_goadedes/he.h.m4:heHE.LytirionKatharsin.name
ltx/en_us_goadedes/pe.d120:peMA.Ode5C22.mode	@ltx/en_us_goadedes/miscellanea:misc.Mode4
ltx/en_us_goadedes/pe.d120:peMA.Ode5C22.ode	@ltx/en_us_goadedes/miscellanea:misc.Ode5
ltx/en_us_goadedes/pe.d120:peMA.Ode5C22.text	Sovereign God and Logos, Christ cured the minds and hearts * Of His Apostles of every sin and thereby * Made them into immaculate dwellings for himself. * Today to dwell in them forever has the light * Of His coequal and consubstantial Spirit come.
ltx/en_us_goadedes/pe.d120:peMA.Ode5C221.text	Sovereign God and Logos, Christ cured the minds and hearts
ltx/en_us_goadedes/pe.d120:peMA.Ode5C221a.text	S
ltx/en_us_goadedes/pe.d120:peMA.Ode5C221b.text	overeign God and Logos, Christ cured the minds and hearts
ltx/en_us_goadedes/pe.d120:peMA.Ode5C222.text	Of His Apostles of every sin and thereby
ltx/en_us_goadedes/pe.d120:peMA.Ode5C222a.text	O
ltx/en_us_goadedes/pe.d120:peMA.Ode5C222b.text	f His Apostles of every sin and thereby
ltx/en_us_goadedes/pe.d120:peMA.Ode5C223.text	Made them into immaculate dwellings for himself.
ltx/en_us_goadedes/pe.d120:peMA.Ode5C223a.text	M
ltx/en_us_goadedes/pe.d120:peMA.Ode5C223b.text	ade them into immaculate dwellings for himself.
ltx/en_us_goadedes/pe.d120:peMA.Ode5C224.text	Today to dwell in them forever has the light
ltx/en_us_goadedes/pe.d120:peMA.Ode5C224a.text	T
ltx/en_us_goadedes/pe.d120:peMA.Ode5C224b.text	oday to dwell in them forever has the light
ltx/en_us_goadedes/pe.d120:peMA.Ode5C225.text	Of His coequal and consubstantial Spirit come.
ltx/en_us_goadedes/pe.d120:peMA.Ode5C225a.text	O
ltx/en_us_goadedes/pe.d120:peMA.Ode5C225b.text	f His coequal and consubstantial Spirit come.
ltx/en_us_goadedes/pe.d120:peMA.Ode5C2H.greekmelody	@ltx/en_us_goadedes/he.h.m4:heHE.LytirionKatharsin.greekname
ltx/en_us_goadedes/pe.d120:peMA.Ode5C2H.incipit	@ltx/en_us_goadedes/he.h.m4:heHE.LytirionKatharsin.incipit
ltx/en_us_goadedes/pe.d120:peMA.Ode5C2H.melody	@ltx/en_us_goadedes/he.h.m4:heHE.LytirionKatharsin.melody
ltx/en_us_goadedes/pe.d120:peMA.Ode5C2H.mode	@ltx/en_us_goadedes/miscellanea:misc.Mode4
ltx/en_us_goadedes/pe.d120:peMA.Ode5C2H.ode	@ltx/en_us_goadedes/miscellanea:misc.Ode5
ltx/en_us_goadedes/pe.d120:peMA.Ode5C2H.text	@ltx/en_us_goadedes/he.h.m4:heHE.LytirionKatharsin.text
ltx/en_us_goadedes/pe.d120:peMA.Ode5C2H1.text	@ltx/en_us_goadedes/he.h.m4:heHE.LytirionKatharsin1.text
ltx/en_us_goadedes/pe.d120:peMA.Ode5C2H1a.text	@ltx/en_us_goadedes/he.h.m4:heHE.LytirionKatharsin1a.text
ltx/en_us_goadedes/pe.d120:peMA.Ode5C2H1b.text	@ltx/en_us_goadedes/he.h.m4:heHE.LytirionKatharsin1b.text
ltx/en_us_goadedes/pe.d120:peMA.Ode5C2H2.text	@ltx/en_us_goadedes/he.h.m4:heHE.LytirionKatharsin2.text
ltx/en_us_goadedes/pe.d120:peMA.Ode5C2H2a.text	@ltx/en_us_goadedes/he.h.m4:heHE.LytirionKatharsin2a.text
ltx/en_us_goadedes/pe.d120:peMA.Ode5C2H2b.text	@ltx/en_us_goadedes/he.h.m4:heHE.LytirionKatharsin2b.text
ltx/en_us_goadedes/pe.d120:peMA.Ode5C2H3.text	@ltx/en_us_goadedes/he.h.m4:heHE.LytirionKatharsin3.text
ltx/en_us_goadedes/pe.d120:peMA.Ode5C2H3a.text	@ltx/en_us_goadedes/he.h.m4:heHE.LytirionKatharsin3a.text
ltx/en_us_goadedes/pe.d120:peMA.Ode5C2H3b.text	@ltx/en_us_goadedes/he.h.m4:heHE.LytirionKatharsin3b.text
ltx/en_us_goadedes/pe.d120:peMA.Ode5C2H4.text	@ltx/en_us_goadedes/he.h.m4:heHE.LytirionKatharsin4.text
ltx/en_us_goadedes/pe.d120:peMA.Ode5C2H4a.text	@ltx/en_us_goadedes/he.h.m4:heHE.LytirionKatharsin4a.text
ltx/en_us_goadedes/pe.d120:peMA.Ode5C2H4b.text	@ltx/en_us_goadedes/he.h.m4:heHE.LytirionKatharsin4b.text
ltx/en_us_goadedes/pe.d120:peMA.Ode5C2H5.text	@ltx/en_us_goadedes/he.h.m4:heHE.LytirionKatharsin5.text
ltx/en_us_goadedes/pe.d120:peMA.Ode5C2H5a.text	@ltx/en_us_goadedes/he.h.m4:heHE.LytirionKatharsin5a.text
ltx/en_us_goadedes/pe.d120:peMA.Ode5C2H5b.text	@ltx/en_us_goadedes/he.h.m4:heHE.LytirionKatharsin5b.text
ltx/en_us_goadedes/pe.d120:peMA.Ode6C11.greekmelody	@ltx/en_us_goadedes/he.h.m7:heHE.NaftionToSalo.greekname
ltx/en_us_goadedes/pe.d120:peMA.Ode6C11.incipit	Even as You promised…
ltx/en_us_goadedes/pe.d120:peMA.Ode6C11.melody	@ltx/en_us_goadedes/he.h.m7:heHE.NaftionToSalo.name
ltx/en_us_goadedes/pe.d120:peMA.Ode6C11.mode	@ltx/en_us_goadedes/miscellanea:misc.Mode7
ltx/en_us_goadedes/pe.d120:peMA.Ode6C11.ode	@ltx/en_us_goadedes/miscellanea:misc.Ode6
ltx/en_us_goadedes/pe.d120:peMA.Ode6C11.text	Even as You promised, You have richly poured out Your Spirit * on all flesh, according to Your holy Prophets, * and all the earth has been filled with Your knowledge, O Lord: * From the Father You the Son are without change * begotten, and the Spirit proceeds indivisibly.
ltx/en_us_goadedes/pe.d120:peMA.Ode6C1H.greekmelody	@ltx/en_us_goadedes/he.h.m7:heHE.NaftionToSalo.greekname
ltx/en_us_goadedes/pe.d120:peMA.Ode6C1H.incipit	@ltx/en_us_goadedes/he.h.m7:heHE.NaftionToSalo.incipit
ltx/en_us_goadedes/pe.d120:peMA.Ode6C1H.melody	@ltx/en_us_goadedes/he.h.m7:heHE.NaftionToSalo.melody
ltx/en_us_goadedes/pe.d120:peMA.Ode6C1H.mode	@ltx/en_us_goadedes/miscellanea:misc.Mode7
ltx/en_us_goadedes/pe.d120:peMA.Ode6C1H.ode	@ltx/en_us_goadedes/miscellanea:misc.Ode6
ltx/en_us_goadedes/pe.d120:peMA.Ode6C1H.text	@ltx/en_us_goadedes/he.h.m7:heHE.NaftionToSalo.text
ltx/en_us_goadedes/pe.d120:peMA.Ode6C21.greekmelody	@ltx/en_us_goadedes/he.h.m4:heHE.IlasmosIminChriste.greekname
ltx/en_us_goadedes/pe.d120:peMA.Ode6C21.incipit	O almighty Lord…
ltx/en_us_goadedes/pe.d120:peMA.Ode6C21.melody	@ltx/en_us_goadedes/he.h.m4:heHE.IlasmosIminChriste.name
ltx/en_us_goadedes/pe.d120:peMA.Ode6C21.mode	@ltx/en_us_goadedes/miscellanea:misc.Mode4
ltx/en_us_goadedes/pe.d120:peMA.Ode6C21.ode	@ltx/en_us_goadedes/miscellanea:misc.Ode6
ltx/en_us_goadedes/pe.d120:peMA.Ode6C21.text	O almighty Lord, put a right and cherished Spirit * Newly deep into our souls to have forever, * Even Your Spirit who proceeds from Your Father, * Always united to You, and from our minds purges * Rotten images and all defiling matter.
ltx/en_us_goadedes/pe.d120:peMA.Ode6C211.text	O almighty Lord, put a right and cherished Spirit
ltx/en_us_goadedes/pe.d120:peMA.Ode6C211a.text	O
ltx/en_us_goadedes/pe.d120:peMA.Ode6C211b.text	 almighty Lord, put a right and cherished Spirit
ltx/en_us_goadedes/pe.d120:peMA.Ode6C212.text	Newly deep into our souls to have forever,
ltx/en_us_goadedes/pe.d120:peMA.Ode6C212a.text	N
ltx/en_us_goadedes/pe.d120:peMA.Ode6C212b.text	ewly deep into our souls to have forever,
ltx/en_us_goadedes/pe.d120:peMA.Ode6C213.text	Even Your Spirit who proceeds from Your Father,
ltx/en_us_goadedes/pe.d120:peMA.Ode6C213a.text	E
ltx/en_us_goadedes/pe.d120:peMA.Ode6C213b.text	ven Your Spirit who proceeds from Your Father,
ltx/en_us_goadedes/pe.d120:peMA.Ode6C214.text	Always united to You, and from our minds purges
ltx/en_us_goadedes/pe.d120:peMA.Ode6C214a.text	A
ltx/en_us_goadedes/pe.d120:peMA.Ode6C214b.text	lways united to You, and from our minds purges
ltx/en_us_goadedes/pe.d120:peMA.Ode6C215.text	Rotten images and all defiling matter.
ltx/en_us_goadedes/pe.d120:peMA.Ode6C215a.text	R
ltx/en_us_goadedes/pe.d120:peMA.Ode6C215b.text	otten images and all defiling matter.
ltx/en_us_goadedes/pe.d120:peMA.Ode6C22.incipit	The Apostles of Christ…
ltx/en_us_goadedes/pe.d120:peMA.Ode6C22.melody	@ltx/en_us_goadedes/he.h.m4:heHE.IlasmosIminChriste.name
ltx/en_us_goadedes/pe.d120:peMA.Ode6C22.mode	@ltx/en_us_goadedes/miscellanea:misc.Mode4
ltx/en_us_goadedes/pe.d120:peMA.Ode6C22.ode	@ltx/en_us_goadedes/miscellanea:misc.Ode6
ltx/en_us_goadedes/pe.d120:peMA.Ode6C22.text	The Apostles of Christ awaited the cherished * Honor of Your coming on them with wind and fire * In Zion, O Spirit, token of the Word and Son * Naturally begotten of the consubstantial * Father; and You censured the babbling of the pagans.
ltx/en_us_goadedes/pe.d120:peMA.Ode6C221.text	The Apostles of Christ awaited the cherished
ltx/en_us_goadedes/pe.d120:peMA.Ode6C221a.text	T
ltx/en_us_goadedes/pe.d120:peMA.Ode6C221b.text	he Apostles of Christ awaited the cherished
ltx/en_us_goadedes/pe.d120:peMA.Ode6C222.text	Honor of Your coming on them with wind and fire
ltx/en_us_goadedes/pe.d120:peMA.Ode6C222a.text	H
ltx/en_us_goadedes/pe.d120:peMA.Ode6C222b.text	onor of Your coming on them with wind and fire
ltx/en_us_goadedes/pe.d120:peMA.Ode6C223.text	In Zion, O Spirit, token of the Word and Son
ltx/en_us_goadedes/pe.d120:peMA.Ode6C223a.text	I
ltx/en_us_goadedes/pe.d120:peMA.Ode6C223b.text	n Zion, O Spirit, token of the Word and Son
ltx/en_us_goadedes/pe.d120:peMA.Ode6C224.text	Naturally begotten of the consubstantial
ltx/en_us_goadedes/pe.d120:peMA.Ode6C224a.text	N
ltx/en_us_goadedes/pe.d120:peMA.Ode6C224b.text	aturally begotten of the consubstantial
ltx/en_us_goadedes/pe.d120:peMA.Ode6C225.text	Father; and You censured the babbling of the pagans.
ltx/en_us_goadedes/pe.d120:peMA.Ode6C225a.text	F
ltx/en_us_goadedes/pe.d120:peMA.Ode6C225b.text	ather; and You censured the babbling of the pagans.
ltx/en_us_goadedes/pe.d120:peMA.Ode6C2H.greekmelody	@ltx/en_us_goadedes/he.h.m4:heHE.IlasmosIminChriste.greekname
ltx/en_us_goadedes/pe.d120:peMA.Ode6C2H.incipit	@ltx/en_us_goadedes/he.h.m4:heHE.IlasmosIminChriste.incipit
ltx/en_us_goadedes/pe.d120:peMA.Ode6C2H.melody	@ltx/en_us_goadedes/he.h.m4:heHE.IlasmosIminChriste.melody
ltx/en_us_goadedes/pe.d120:peMA.Ode6C2H.mode	@ltx/en_us_goadedes/miscellanea:misc.Mode4
ltx/en_us_goadedes/pe.d120:peMA.Ode6C2H.ode	@ltx/en_us_goadedes/miscellanea:misc.Ode6
ltx/en_us_goadedes/pe.d120:peMA.Ode6C2H.text	@ltx/en_us_goadedes/he.h.m4:heHE.IlasmosIminChriste.text
ltx/en_us_goadedes/pe.d120:peMA.Ode6C2H1.text	@ltx/en_us_goadedes/he.h.m4:heHE.IlasmosIminChriste1.text
ltx/en_us_goadedes/pe.d120:peMA.Ode6C2H1a.text	@ltx/en_us_goadedes/he.h.m4:heHE.IlasmosIminChriste1a.text
ltx/en_us_goadedes/pe.d120:peMA.Ode6C2H1b.text	@ltx/en_us_goadedes/he.h.m4:heHE.IlasmosIminChriste1b.text
ltx/en_us_goadedes/pe.d120:peMA.Ode6C2H2.text	@ltx/en_us_goadedes/he.h.m4:heHE.IlasmosIminChriste2.text
ltx/en_us_goadedes/pe.d120:peMA.Ode6C2H2a.text	@ltx/en_us_goadedes/he.h.m4:heHE.IlasmosIminChriste2a.text
ltx/en_us_goadedes/pe.d120:peMA.Ode6C2H2b.text	@ltx/en_us_goadedes/he.h.m4:heHE.IlasmosIminChriste2b.text
ltx/en_us_goadedes/pe.d120:peMA.Ode6C2H3.text	@ltx/en_us_goadedes/he.h.m4:heHE.IlasmosIminChriste3.text
ltx/en_us_goadedes/pe.d120:peMA.Ode6C2H3a.text	@ltx/en_us_goadedes/he.h.m4:heHE.IlasmosIminChriste3a.text
ltx/en_us_goadedes/pe.d120:peMA.Ode6C2H3b.text	@ltx/en_us_goadedes/he.h.m4:heHE.IlasmosIminChriste3b.text
ltx/en_us_goadedes/pe.d120:peMA.Ode6C2H4.text	@ltx/en_us_goadedes/he.h.m4:heHE.IlasmosIminChriste4.text
ltx/en_us_goadedes/pe.d120:peMA.Ode6C2H4a.text	@ltx/en_us_goadedes/he.h.m4:heHE.IlasmosIminChriste4a.text
ltx/en_us_goadedes/pe.d120:peMA.Ode6C2H4b.text	@ltx/en_us_goadedes/he.h.m4:heHE.IlasmosIminChriste4b.text
ltx/en_us_goadedes/pe.d120:peMA.Ode6C2H5.text	@ltx/en_us_goadedes/he.h.m4:heHE.IlasmosIminChriste5.text
ltx/en_us_goadedes/pe.d120:peMA.Ode6C2H5a.text	@ltx/en_us_goadedes/he.h.m4:heHE.IlasmosIminChriste5a.text
ltx/en_us_goadedes/pe.d120:peMA.Ode6C2H5b.text	@ltx/en_us_goadedes/he.h.m4:heHE.IlasmosIminChriste5b.text
ltx/en_us_goadedes/pe.d120:peMA.Ode7C11.greekmelody	@ltx/en_us_goadedes/he.h.m7:heHE.OiEnKaminoTouPyros.greekname
ltx/en_us_goadedes/pe.d120:peMA.Ode7C11.incipit	As the Apostles proclaimed…
ltx/en_us_goadedes/pe.d120:peMA.Ode7C11.melody	@ltx/en_us_goadedes/he.h.m7:heHE.OiEnKaminoTouPyros.name
ltx/en_us_goadedes/pe.d120:peMA.Ode7C11.mode	@ltx/en_us_goadedes/miscellanea:misc.Mode7
ltx/en_us_goadedes/pe.d120:peMA.Ode7C11.ode	@ltx/en_us_goadedes/miscellanea:misc.Ode7
ltx/en_us_goadedes/pe.d120:peMA.Ode7C11.text	As the Apostles proclaimed the mighty works of God to the large crowd, * the Holy Spirit’s activity * was considered drunkenness by unbelievers. * Through it we know the one true God of our fathers is the Trinity.
ltx/en_us_goadedes/pe.d120:peMA.Ode7C12.incipit	Professing Orthodox doctrine…
ltx/en_us_goadedes/pe.d120:peMA.Ode7C12.melody	@ltx/en_us_goadedes/he.h.m7:heHE.OiEnKaminoTouPyros.name
ltx/en_us_goadedes/pe.d120:peMA.Ode7C12.mode	@ltx/en_us_goadedes/miscellanea:misc.Mode7
ltx/en_us_goadedes/pe.d120:peMA.Ode7C12.ode	@ltx/en_us_goadedes/miscellanea:misc.Ode7
ltx/en_us_goadedes/pe.d120:peMA.Ode7C12.text	Professing Orthodox doctrine, we say one undivided nature, * God the Father unoriginate * and coequal with the Logos and the Spirit. * We cry out, “You, O Lord, are God of our fathers, and blessed are You!”
ltx/en_us_goadedes/pe.d120:peMA.Ode7C1H.greekmelody	@ltx/en_us_goadedes/he.h.m7:heHE.OiEnKaminoTouPyros.greekname
ltx/en_us_goadedes/pe.d120:peMA.Ode7C1H.incipit	@ltx/en_us_goadedes/he.h.m7:heHE.OiEnKaminoTouPyros.incipit
ltx/en_us_goadedes/pe.d120:peMA.Ode7C1H.melody	@ltx/en_us_goadedes/he.h.m7:heHE.OiEnKaminoTouPyros.melody
ltx/en_us_goadedes/pe.d120:peMA.Ode7C1H.mode	@ltx/en_us_goadedes/miscellanea:misc.Mode7
ltx/en_us_goadedes/pe.d120:peMA.Ode7C1H.ode	@ltx/en_us_goadedes/miscellanea:misc.Ode7
ltx/en_us_goadedes/pe.d120:peMA.Ode7C1H.text	@ltx/en_us_goadedes/he.h.m7:heHE.OiEnKaminoTouPyros.text
ltx/en_us_goadedes/pe.d120:peMA.Ode7C21.greekmelody	@ltx/en_us_goadedes/he.h.m4:heHE.SymfononEthroisen.greekname
ltx/en_us_goadedes/pe.d120:peMA.Ode7C21.incipit	On hearing the Apostles…
ltx/en_us_goadedes/pe.d120:peMA.Ode7C21.melody	@ltx/en_us_goadedes/he.h.m4:heHE.SymfononEthroisen.name
ltx/en_us_goadedes/pe.d120:peMA.Ode7C21.mode	@ltx/en_us_goadedes/miscellanea:misc.Mode4
ltx/en_us_goadedes/pe.d120:peMA.Ode7C21.ode	@ltx/en_us_goadedes/miscellanea:misc.Ode7
ltx/en_us_goadedes/pe.d120:peMA.Ode7C21.text	On hearing the Apostles speaking in foreign tongues, * Not aware it was fulfillment of prophecy, * Grossly mistaken men said they were filled with new wine. * Unto You, Lord, we faithful filled with the Spirit sing: * Ever blessed are You, who renew the universe!
ltx/en_us_goadedes/pe.d120:peMA.Ode7C211.text	On hearing the Apostles speaking in foreign tongues,
ltx/en_us_goadedes/pe.d120:peMA.Ode7C211a.text	O
ltx/en_us_goadedes/pe.d120:peMA.Ode7C211b.text	n hearing the Apostles speaking in foreign tongues,
ltx/en_us_goadedes/pe.d120:peMA.Ode7C212.text	Not aware it was fulfillment of prophecy,
ltx/en_us_goadedes/pe.d120:peMA.Ode7C212a.text	N
ltx/en_us_goadedes/pe.d120:peMA.Ode7C212b.text	ot aware it was fulfillment of prophecy,
ltx/en_us_goadedes/pe.d120:peMA.Ode7C213.text	Grossly mistaken men said they were filled with new wine.
ltx/en_us_goadedes/pe.d120:peMA.Ode7C213a.text	G
ltx/en_us_goadedes/pe.d120:peMA.Ode7C213b.text	rossly mistaken men said they were filled with new wine.
ltx/en_us_goadedes/pe.d120:peMA.Ode7C214.text	Unto You, Lord, we faithful filled with the Spirit sing:
ltx/en_us_goadedes/pe.d120:peMA.Ode7C214a.text	U
ltx/en_us_goadedes/pe.d120:peMA.Ode7C214b.text	nto You, Lord, we faithful filled with the Spirit sing:
ltx/en_us_goadedes/pe.d120:peMA.Ode7C215.text	Ever blessed are You, who renew the universe!
ltx/en_us_goadedes/pe.d120:peMA.Ode7C215a.text	E
ltx/en_us_goadedes/pe.d120:peMA.Ode7C215b.text	ver blessed are You, who renew the universe!
ltx/en_us_goadedes/pe.d120:peMA.Ode7C22.incipit	Seer and Prophet…
ltx/en_us_goadedes/pe.d120:peMA.Ode7C22.melody	@ltx/en_us_goadedes/he.h.m4:heHE.SymfononEthroisen.name
ltx/en_us_goadedes/pe.d120:peMA.Ode7C22.mode	@ltx/en_us_goadedes/miscellanea:misc.Mode4
ltx/en_us_goadedes/pe.d120:peMA.Ode7C22.ode	@ltx/en_us_goadedes/miscellanea:misc.Ode7
ltx/en_us_goadedes/pe.d120:peMA.Ode7C22.text	Seer and Prophet Joel thundered an oracle, * Spoken on behalf of the most divine Logos: * I will pour out on all flesh my Spirit’s divine * Grace, and all who receive it will cry out together: * “Nature shining with triple splendor, You are blessed.”
ltx/en_us_goadedes/pe.d120:peMA.Ode7C221.text	Seer and Prophet Joel thundered an oracle,
ltx/en_us_goadedes/pe.d120:peMA.Ode7C221a.text	S
ltx/en_us_goadedes/pe.d120:peMA.Ode7C221b.text	eer and Prophet Joel thundered an oracle,
ltx/en_us_goadedes/pe.d120:peMA.Ode7C222.text	Spoken on behalf of the most divine Logos:
ltx/en_us_goadedes/pe.d120:peMA.Ode7C222a.text	S
ltx/en_us_goadedes/pe.d120:peMA.Ode7C222b.text	poken on behalf of the most divine Logos:
ltx/en_us_goadedes/pe.d120:peMA.Ode7C223.text	I will pour out on all flesh my Spirit’s divine
ltx/en_us_goadedes/pe.d120:peMA.Ode7C223a.text	I
ltx/en_us_goadedes/pe.d120:peMA.Ode7C223b.text	 will pour out on all flesh my Spirit’s divine
ltx/en_us_goadedes/pe.d120:peMA.Ode7C224.text	Grace, and all who receive it will cry out together:
ltx/en_us_goadedes/pe.d120:peMA.Ode7C224a.text	G
ltx/en_us_goadedes/pe.d120:peMA.Ode7C224b.text	race, and all who receive it will cry out together:
ltx/en_us_goadedes/pe.d120:peMA.Ode7C225.text	“Nature shining with triple splendor, You are blessed.”
ltx/en_us_goadedes/pe.d120:peMA.Ode7C225a.text	“N
ltx/en_us_goadedes/pe.d120:peMA.Ode7C225b.text	ature shining with triple splendor, You are blessed.”
ltx/en_us_goadedes/pe.d120:peMA.Ode7C23.incipit	Oh how enriched…
ltx/en_us_goadedes/pe.d120:peMA.Ode7C23.melody	@ltx/en_us_goadedes/he.h.m4:heHE.SymfononEthroisen.name
ltx/en_us_goadedes/pe.d120:peMA.Ode7C23.mode	@ltx/en_us_goadedes/miscellanea:misc.Mode4
ltx/en_us_goadedes/pe.d120:peMA.Ode7C23.ode	@ltx/en_us_goadedes/miscellanea:misc.Ode7
ltx/en_us_goadedes/pe.d120:peMA.Ode7C23.text	Oh how enriched with grace divine was the third hour! * For it indicated that three hypostases * In oneness of dominion ought to be worshiped. * Now on Day One of the Lord, Father, Son, and Spirit, * Holy Trinity, one essence, You are blessed.
ltx/en_us_goadedes/pe.d120:peMA.Ode7C231.text	Oh how enriched with grace divine was the third hour!
ltx/en_us_goadedes/pe.d120:peMA.Ode7C231a.text	O
ltx/en_us_goadedes/pe.d120:peMA.Ode7C231b.text	h how enriched with grace divine was the third hour!
ltx/en_us_goadedes/pe.d120:peMA.Ode7C232.text	For it indicated that three hypostases
ltx/en_us_goadedes/pe.d120:peMA.Ode7C232a.text	F
ltx/en_us_goadedes/pe.d120:peMA.Ode7C232b.text	or it indicated that three hypostases
ltx/en_us_goadedes/pe.d120:peMA.Ode7C233.text	In oneness of dominion ought to be worshiped.
ltx/en_us_goadedes/pe.d120:peMA.Ode7C233a.text	I
ltx/en_us_goadedes/pe.d120:peMA.Ode7C233b.text	n oneness of dominion ought to be worshiped.
ltx/en_us_goadedes/pe.d120:peMA.Ode7C234.text	Now on Day One of the Lord, Father, Son, and Spirit,
ltx/en_us_goadedes/pe.d120:peMA.Ode7C234a.text	N
ltx/en_us_goadedes/pe.d120:peMA.Ode7C234b.text	ow on Day One of the Lord, Father, Son, and Spirit,
ltx/en_us_goadedes/pe.d120:peMA.Ode7C235.text	Holy Trinity, one essence, You are blessed.
ltx/en_us_goadedes/pe.d120:peMA.Ode7C235a.text	H
ltx/en_us_goadedes/pe.d120:peMA.Ode7C235b.text	oly Trinity, one essence, You are blessed.
ltx/en_us_goadedes/pe.d120:peMA.Ode7C2H.greekmelody	@ltx/en_us_goadedes/he.h.m4:heHE.SymfononEthroisen.greekname
ltx/en_us_goadedes/pe.d120:peMA.Ode7C2H.incipit	@ltx/en_us_goadedes/he.h.m4:heHE.SymfononEthroisen.incipit
ltx/en_us_goadedes/pe.d120:peMA.Ode7C2H.melody	@ltx/en_us_goadedes/he.h.m4:heHE.SymfononEthroisen.melody
ltx/en_us_goadedes/pe.d120:peMA.Ode7C2H.mode	@ltx/en_us_goadedes/miscellanea:misc.Mode4
ltx/en_us_goadedes/pe.d120:peMA.Ode7C2H.ode	@ltx/en_us_goadedes/miscellanea:misc.Ode7
ltx/en_us_goadedes/pe.d120:peMA.Ode7C2H.text	@ltx/en_us_goadedes/he.h.m4:heHE.SymfononEthroisen.text
ltx/en_us_goadedes/pe.d120:peMA.Ode7C2H1.text	@ltx/en_us_goadedes/he.h.m4:heHE.SymfononEthroisen1.text
ltx/en_us_goadedes/pe.d120:peMA.Ode7C2H1a.text	@ltx/en_us_goadedes/he.h.m4:heHE.SymfononEthroisen1a.text
ltx/en_us_goadedes/pe.d120:peMA.Ode7C2H1b.text	@ltx/en_us_goadedes/he.h.m4:heHE.SymfononEthroisen1b.text
ltx/en_us_goadedes/pe.d120:peMA.Ode7C2H2.text	@ltx/en_us_goadedes/he.h.m4:heHE.SymfononEthroisen2.text
ltx/en_us_goadedes/pe.d120:peMA.Ode7C2H2a.text	@ltx/en_us_goadedes/he.h.m4:heHE.SymfononEthroisen2a.text
ltx/en_us_goadedes/pe.d120:peMA.Ode7C2H2b.text	@ltx/en_us_goadedes/he.h.m4:heHE.SymfononEthroisen2b.text
ltx/en_us_goadedes/pe.d120:peMA.Ode7C2H3.text	@ltx/en_us_goadedes/he.h.m4:heHE.SymfononEthroisen3.text
ltx/en_us_goadedes/pe.d120:peMA.Ode7C2H3a.text	@ltx/en_us_goadedes/he.h.m4:heHE.SymfononEthroisen3a.text
ltx/en_us_goadedes/pe.d120:peMA.Ode7C2H3b.text	@ltx/en_us_goadedes/he.h.m4:heHE.SymfononEthroisen3b.text
ltx/en_us_goadedes/pe.d120:peMA.Ode7C2H4.text	@ltx/en_us_goadedes/he.h.m4:heHE.SymfononEthroisen4.text
ltx/en_us_goadedes/pe.d120:peMA.Ode7C2H4a.text	@ltx/en_us_goadedes/he.h.m4:heHE.SymfononEthroisen4a.text
ltx/en_us_goadedes/pe.d120:peMA.Ode7C2H4b.text	@ltx/en_us_goadedes/he.h.m4:heHE.SymfononEthroisen4b.text
ltx/en_us_goadedes/pe.d120:peMA.Ode7C2H5.text	@ltx/en_us_goadedes/he.h.m4:heHE.SymfononEthroisen5.text
ltx/en_us_goadedes/pe.d120:peMA.Ode7C2H5a.text	@ltx/en_us_goadedes/he.h.m4:heHE.SymfononEthroisen5a.text
ltx/en_us_goadedes/pe.d120:peMA.Ode7C2H5b.text	@ltx/en_us_goadedes/he.h.m4:heHE.SymfononEthroisen5b.text
ltx/en_us_goadedes/pe.d120:peMA.Ode8C11.greekmelody	@ltx/en_us_goadedes/he.h.m7:heHE.AflektosPyri.greekname
ltx/en_us_goadedes/pe.d120:peMA.Ode8C11.incipit	Suddenly a sound came…
ltx/en_us_goadedes/pe.d120:peMA.Ode8C11.melody	@ltx/en_us_goadedes/he.h.m7:heHE.AflektosPyri.name
ltx/en_us_goadedes/pe.d120:peMA.Ode8C11.mode	@ltx/en_us_goadedes/miscellanea:misc.Mode7
ltx/en_us_goadedes/pe.d120:peMA.Ode8C11.ode	@ltx/en_us_goadedes/miscellanea:misc.Ode8
ltx/en_us_goadedes/pe.d120:peMA.Ode8C11.text	Suddenly a sound came from heaven like the rush of a mighty, * energizing wind of the all-holy Spirit, * and there appeared divided tongues as of fire * on the fishermen, who proclaimed the mighty works of God. * “O all you works of the Lord, sing a hymn to the Lord, * and exalt Him beyond measure unto all the ages.”
ltx/en_us_goadedes/pe.d120:peMA.Ode8C12.incipit	We who have not come…
ltx/en_us_goadedes/pe.d120:peMA.Ode8C12.melody	@ltx/en_us_goadedes/he.h.m7:heHE.AflektosPyri.name
ltx/en_us_goadedes/pe.d120:peMA.Ode8C12.mode	@ltx/en_us_goadedes/miscellanea:misc.Mode7
ltx/en_us_goadedes/pe.d120:peMA.Ode8C12.ode	@ltx/en_us_goadedes/miscellanea:misc.Ode8
ltx/en_us_goadedes/pe.d120:peMA.Ode8C12.text	We who have not come now to a tangible mountain * nor are afraid of a blazing fire, * come and let us stand on Mt. Zion, in the city of the living God, * and join the Spirit-bearing Disciples and celebrate. * “O all you works of the Lord, sing a hymn to the Lord, * and exalt Him beyond measure unto all the ages.”
ltx/en_us_goadedes/pe.d120:peMA.Ode8C1H.greekmelody	@ltx/en_us_goadedes/he.h.m7:heHE.AflektosPyri.greekname
ltx/en_us_goadedes/pe.d120:peMA.Ode8C1H.incipit	@ltx/en_us_goadedes/he.h.m7:heHE.AflektosPyri.incipit
ltx/en_us_goadedes/pe.d120:peMA.Ode8C1H.melody	@ltx/en_us_goadedes/he.h.m7:heHE.AflektosPyri.melody
ltx/en_us_goadedes/pe.d120:peMA.Ode8C1H.mode	@ltx/en_us_goadedes/miscellanea:misc.Mode7
ltx/en_us_goadedes/pe.d120:peMA.Ode8C1H.ode	@ltx/en_us_goadedes/miscellanea:misc.Ode8
ltx/en_us_goadedes/pe.d120:peMA.Ode8C1H.text	@ltx/en_us_goadedes/he.h.m7:heHE.AflektosPyri.text
ltx/en_us_goadedes/pe.d120:peMA.Ode8C21.greekmelody	@ltx/en_us_goadedes/he.h.m4:heHE.LyeiTaDesma.greekname
ltx/en_us_goadedes/pe.d120:peMA.Ode8C21.incipit	God the Spirit…
ltx/en_us_goadedes/pe.d120:peMA.Ode8C21.melody	@ltx/en_us_goadedes/he.h.m4:heHE.LyeiTaDesma.name
ltx/en_us_goadedes/pe.d120:peMA.Ode8C21.mode	@ltx/en_us_goadedes/miscellanea:misc.Mode4
ltx/en_us_goadedes/pe.d120:peMA.Ode8C21.ode	@ltx/en_us_goadedes/miscellanea:misc.Ode8
ltx/en_us_goadedes/pe.d120:peMA.Ode8C21.text	God the Spirit, You came in tongues of fire and rested * On the Apostles, and You brought to their remembrance * Divine and saving words that Christ from His Father * Heard and made known to them. And now all creation, * Estranged once, now reconciled, sings, “You are blessed.”
ltx/en_us_goadedes/pe.d120:peMA.Ode8C211.text	God the Spirit, You came in tongues of fire and rested
ltx/en_us_goadedes/pe.d120:peMA.Ode8C211a.text	G
ltx/en_us_goadedes/pe.d120:peMA.Ode8C211b.text	od the Spirit, You came in tongues of fire and rested
ltx/en_us_goadedes/pe.d120:peMA.Ode8C212.text	On the Apostles, and You brought to their remembrance
ltx/en_us_goadedes/pe.d120:peMA.Ode8C212a.text	O
ltx/en_us_goadedes/pe.d120:peMA.Ode8C212b.text	n the Apostles, and You brought to their remembrance
ltx/en_us_goadedes/pe.d120:peMA.Ode8C213.text	Divine and saving words that Christ from His Father
ltx/en_us_goadedes/pe.d120:peMA.Ode8C213a.text	D
ltx/en_us_goadedes/pe.d120:peMA.Ode8C213b.text	ivine and saving words that Christ from His Father
ltx/en_us_goadedes/pe.d120:peMA.Ode8C214.text	Heard and made known to them. And now all creation,
ltx/en_us_goadedes/pe.d120:peMA.Ode8C214a.text	H
ltx/en_us_goadedes/pe.d120:peMA.Ode8C214b.text	eard and made known to them. And now all creation,
ltx/en_us_goadedes/pe.d120:peMA.Ode8C215.text	Estranged once, now reconciled, sings, “You are blessed.”
ltx/en_us_goadedes/pe.d120:peMA.Ode8C215a.text	E
ltx/en_us_goadedes/pe.d120:peMA.Ode8C215b.text	stranged once, now reconciled, sings, “You are blessed.”
ltx/en_us_goadedes/pe.d120:peMA.Ode8C22.incipit	Another Advocate…
ltx/en_us_goadedes/pe.d120:peMA.Ode8C22.melody	@ltx/en_us_goadedes/he.h.m4:heHE.LyeiTaDesma.name
ltx/en_us_goadedes/pe.d120:peMA.Ode8C22.mode	@ltx/en_us_goadedes/miscellanea:misc.Mode4
ltx/en_us_goadedes/pe.d120:peMA.Ode8C22.ode	@ltx/en_us_goadedes/miscellanea:misc.Ode8
ltx/en_us_goadedes/pe.d120:peMA.Ode8C22.text	Another Advocate is the Father’s Spirit; * Divine Light and giver of light, He is Savior, * And He comes at His own will. O Christ, You sent Him * Now as holy wind on Your Apostles to fill them. * Distribute Him, who hears us, also on Your servants.
ltx/en_us_goadedes/pe.d120:peMA.Ode8C221.text	Another Advocate is the Father’s Spirit;
ltx/en_us_goadedes/pe.d120:peMA.Ode8C221a.text	A
ltx/en_us_goadedes/pe.d120:peMA.Ode8C221b.text	nother Advocate is the Father’s Spirit;
ltx/en_us_goadedes/pe.d120:peMA.Ode8C222.text	Divine Light and giver of light, He is Savior,
ltx/en_us_goadedes/pe.d120:peMA.Ode8C222a.text	D
ltx/en_us_goadedes/pe.d120:peMA.Ode8C222b.text	ivine Light and giver of light, He is Savior,
ltx/en_us_goadedes/pe.d120:peMA.Ode8C223.text	And He comes at His own will. O Christ, You sent Him
ltx/en_us_goadedes/pe.d120:peMA.Ode8C223a.text	A
ltx/en_us_goadedes/pe.d120:peMA.Ode8C223b.text	nd He comes at His own will. O Christ, You sent Him
ltx/en_us_goadedes/pe.d120:peMA.Ode8C224.text	Now as holy wind on Your Apostles to fill them.
ltx/en_us_goadedes/pe.d120:peMA.Ode8C224a.text	N
ltx/en_us_goadedes/pe.d120:peMA.Ode8C224b.text	ow as holy wind on Your Apostles to fill them.
ltx/en_us_goadedes/pe.d120:peMA.Ode8C225.text	Distribute Him, who hears us, also on Your servants.
ltx/en_us_goadedes/pe.d120:peMA.Ode8C225a.text	D
ltx/en_us_goadedes/pe.d120:peMA.Ode8C225b.text	istribute Him, who hears us, also on Your servants.
ltx/en_us_goadedes/pe.d120:peMA.Ode8C23.incipit	God-inspired mouths…
ltx/en_us_goadedes/pe.d120:peMA.Ode8C23.melody	@ltx/en_us_goadedes/he.h.m4:heHE.LyeiTaDesma.name
ltx/en_us_goadedes/pe.d120:peMA.Ode8C23.mode	@ltx/en_us_goadedes/miscellanea:misc.Mode4
ltx/en_us_goadedes/pe.d120:peMA.Ode8C23.ode	@ltx/en_us_goadedes/miscellanea:misc.Ode8
ltx/en_us_goadedes/pe.d120:peMA.Ode8C23.text	God-inspired mouths of the Prophets proclaimed You, * Ruler, as the One who would come to earth in body, * And the Spirit, who proceeds from the Father’s bosom, * Coequal, uncreated co-creator, whom You sent * Evincing the doctrine of Your Incarnation.
ltx/en_us_goadedes/pe.d120:peMA.Ode8C231.text	God-inspired mouths of the Prophets proclaimed You,
ltx/en_us_goadedes/pe.d120:peMA.Ode8C231a.text	G
ltx/en_us_goadedes/pe.d120:peMA.Ode8C231b.text	od-inspired mouths of the Prophets proclaimed You,
ltx/en_us_goadedes/pe.d120:peMA.Ode8C232.text	Ruler, as the One who would come to earth in body,
ltx/en_us_goadedes/pe.d120:peMA.Ode8C232a.text	R
ltx/en_us_goadedes/pe.d120:peMA.Ode8C232b.text	uler, as the One who would come to earth in body,
ltx/en_us_goadedes/pe.d120:peMA.Ode8C233.text	And the Spirit, who proceeds from the Father’s bosom,
ltx/en_us_goadedes/pe.d120:peMA.Ode8C233a.text	A
ltx/en_us_goadedes/pe.d120:peMA.Ode8C233b.text	nd the Spirit, who proceeds from the Father’s bosom,
ltx/en_us_goadedes/pe.d120:peMA.Ode8C234.text	Coequal, uncreated co-creator, whom You sent
ltx/en_us_goadedes/pe.d120:peMA.Ode8C234a.text	C
ltx/en_us_goadedes/pe.d120:peMA.Ode8C234b.text	oequal, uncreated co-creator, whom You sent
ltx/en_us_goadedes/pe.d120:peMA.Ode8C235.text	Evincing the doctrine of Your Incarnation.
ltx/en_us_goadedes/pe.d120:peMA.Ode8C235a.text	E
ltx/en_us_goadedes/pe.d120:peMA.Ode8C235b.text	vincing the doctrine of Your Incarnation.
ltx/en_us_goadedes/pe.d120:peMA.Ode8C2H.greekmelody	@ltx/en_us_goadedes/he.h.m4:heHE.LyeiTaDesma.greekname
ltx/en_us_goadedes/pe.d120:peMA.Ode8C2H.incipit	@ltx/en_us_goadedes/he.h.m4:heHE.LyeiTaDesma.incipit
ltx/en_us_goadedes/pe.d120:peMA.Ode8C2H.melody	@ltx/en_us_goadedes/he.h.m4:heHE.LyeiTaDesma.melody
ltx/en_us_goadedes/pe.d120:peMA.Ode8C2H.mode	@ltx/en_us_goadedes/miscellanea:misc.Mode4
ltx/en_us_goadedes/pe.d120:peMA.Ode8C2H.ode	@ltx/en_us_goadedes/miscellanea:misc.Ode8
ltx/en_us_goadedes/pe.d120:peMA.Ode8C2H.text	@ltx/en_us_goadedes/he.h.m4:heHE.LyeiTaDesma.text
ltx/en_us_goadedes/pe.d120:peMA.Ode8C2H1.text	@ltx/en_us_goadedes/he.h.m4:heHE.LyeiTaDesma1.text
ltx/en_us_goadedes/pe.d120:peMA.Ode8C2H1a.text	@ltx/en_us_goadedes/he.h.m4:heHE.LyeiTaDesma1a.text
ltx/en_us_goadedes/pe.d120:peMA.Ode8C2H1b.text	@ltx/en_us_goadedes/he.h.m4:heHE.LyeiTaDesma1b.text
ltx/en_us_goadedes/pe.d120:peMA.Ode8C2H2.text	@ltx/en_us_goadedes/he.h.m4:heHE.LyeiTaDesma2.text
ltx/en_us_goadedes/pe.d120:peMA.Ode8C2H2a.text	@ltx/en_us_goadedes/he.h.m4:heHE.LyeiTaDesma2a.text
ltx/en_us_goadedes/pe.d120:peMA.Ode8C2H2b.text	@ltx/en_us_goadedes/he.h.m4:heHE.LyeiTaDesma2b.text
ltx/en_us_goadedes/pe.d120:peMA.Ode8C2H3.text	@ltx/en_us_goadedes/he.h.m4:heHE.LyeiTaDesma3.text
ltx/en_us_goadedes/pe.d120:peMA.Ode8C2H3a.text	@ltx/en_us_goadedes/he.h.m4:heHE.LyeiTaDesma3a.text
ltx/en_us_goadedes/pe.d120:peMA.Ode8C2H3b.text	@ltx/en_us_goadedes/he.h.m4:heHE.LyeiTaDesma3b.text
ltx/en_us_goadedes/pe.d120:peMA.Ode8C2H4.text	@ltx/en_us_goadedes/he.h.m4:heHE.LyeiTaDesma4.text
ltx/en_us_goadedes/pe.d120:peMA.Ode8C2H4a.text	@ltx/en_us_goadedes/he.h.m4:heHE.LyeiTaDesma4a.text
ltx/en_us_goadedes/pe.d120:peMA.Ode8C2H4b.text	@ltx/en_us_goadedes/he.h.m4:heHE.LyeiTaDesma4b.text
ltx/en_us_goadedes/pe.d120:peMA.Ode8C2H5.text	@ltx/en_us_goadedes/he.h.m4:heHE.LyeiTaDesma5.text
ltx/en_us_goadedes/pe.d120:peMA.Ode8C2H5a.text	@ltx/en_us_goadedes/he.h.m4:heHE.LyeiTaDesma5a.text
ltx/en_us_goadedes/pe.d120:peMA.Ode8C2H5b.text	@ltx/en_us_goadedes/he.h.m4:heHE.LyeiTaDesma5b.text
ltx/en_us_goadedes/pe.d120:peMA.Ode9C11.greekmelody	@ltx/en_us_goadedes/he.h.m7:heHE.MiTisFthoras.greekname
ltx/en_us_goadedes/pe.d120:peMA.Ode9C11.incipit	That fire breathing…
ltx/en_us_goadedes/pe.d120:peMA.Ode9C11.melody	@ltx/en_us_goadedes/he.h.m7:heHE.MiTisFthoras.name
ltx/en_us_goadedes/pe.d120:peMA.Ode9C11.mode	@ltx/en_us_goadedes/miscellanea:misc.Mode7
ltx/en_us_goadedes/pe.d120:peMA.Ode9C11.ode	@ltx/en_us_goadedes/miscellanea:misc.Ode9
ltx/en_us_goadedes/pe.d120:peMA.Ode9C11.text	That fire breathing and zealot Elijah joyfully * boarded the blazing and fiery chariot of old, * prefiguring fiery tongues, the Spirit who from heaven * inspired the Apostles, who being thus illumined made the Trinity known to everyone.
ltx/en_us_goadedes/pe.d120:peMA.Ode9C12.incipit	Something unnatural…
ltx/en_us_goadedes/pe.d120:peMA.Ode9C12.melody	@ltx/en_us_goadedes/he.h.m7:heHE.MiTisFthoras.name
ltx/en_us_goadedes/pe.d120:peMA.Ode9C12.mode	@ltx/en_us_goadedes/miscellanea:misc.Mode7
ltx/en_us_goadedes/pe.d120:peMA.Ode9C12.ode	@ltx/en_us_goadedes/miscellanea:misc.Ode9
ltx/en_us_goadedes/pe.d120:peMA.Ode9C12.text	Something unnatural and uncommon was heard today. * For by the grace of the Spirit, the voice of each Disciple * spoke a variety of languages. And therefore * the peoples, tongues, and races heard the mighty works of God and learned about the Holy Trinity.
ltx/en_us_goadedes/pe.d120:peMA.Ode9C1H.greekmelody	@ltx/en_us_goadedes/he.h.m7:heHE.MiTisFthoras.greekname
ltx/en_us_goadedes/pe.d120:peMA.Ode9C1H.incipit	@ltx/en_us_goadedes/he.h.m7:heHE.MiTisFthoras.incipit
ltx/en_us_goadedes/pe.d120:peMA.Ode9C1H.melody	@ltx/en_us_goadedes/he.h.m7:heHE.MiTisFthoras.melody
ltx/en_us_goadedes/pe.d120:peMA.Ode9C1H.mode	@ltx/en_us_goadedes/miscellanea:misc.Mode7
ltx/en_us_goadedes/pe.d120:peMA.Ode9C1H.ode	@ltx/en_us_goadedes/miscellanea:misc.Ode9
ltx/en_us_goadedes/pe.d120:peMA.Ode9C1H.text	@ltx/en_us_goadedes/he.h.m7:heHE.MiTisFthoras.text
ltx/en_us_goadedes/pe.d120:peMA.Ode9C21.greekmelody	@ltx/en_us_goadedes/he.h.m4:heHE.ChairoisAnassa.greekname
ltx/en_us_goadedes/pe.d120:peMA.Ode9C21.incipit	To extol the Virgin…
ltx/en_us_goadedes/pe.d120:peMA.Ode9C21.melody	@ltx/en_us_goadedes/he.h.m4:heHE.ChairoisAnassa.name
ltx/en_us_goadedes/pe.d120:peMA.Ode9C21.mode	@ltx/en_us_goadedes/miscellanea:misc.Mode4
ltx/en_us_goadedes/pe.d120:peMA.Ode9C21.ode	@ltx/en_us_goadedes/miscellanea:misc.Ode9
ltx/en_us_goadedes/pe.d120:peMA.Ode9C21.text	To extol the Virgin who mothered Life is truly * Right, for only she in her womb held the Logos. * Assuming flesh, He healed our ailing human nature. * Now in heaven, at the right hand of the Father * Seated, He has sent down the grace of the Spirit.
ltx/en_us_goadedes/pe.d120:peMA.Ode9C211.text	To extol the Virgin who mothered Life is truly
ltx/en_us_goadedes/pe.d120:peMA.Ode9C211a.text	T
ltx/en_us_goadedes/pe.d120:peMA.Ode9C211b.text	o extol the Virgin who mothered Life is truly
ltx/en_us_goadedes/pe.d120:peMA.Ode9C212.text	Right, for only she in her womb held the Logos.
ltx/en_us_goadedes/pe.d120:peMA.Ode9C212a.text	R
ltx/en_us_goadedes/pe.d120:peMA.Ode9C212b.text	ight, for only she in her womb held the Logos.
ltx/en_us_goadedes/pe.d120:peMA.Ode9C213.text	Assuming flesh, He healed our ailing human nature.
ltx/en_us_goadedes/pe.d120:peMA.Ode9C213a.text	A
ltx/en_us_goadedes/pe.d120:peMA.Ode9C213b.text	ssuming flesh, He healed our ailing human nature.
ltx/en_us_goadedes/pe.d120:peMA.Ode9C214.text	Now in heaven, at the right hand of the Father
ltx/en_us_goadedes/pe.d120:peMA.Ode9C214a.text	N
ltx/en_us_goadedes/pe.d120:peMA.Ode9C214b.text	ow in heaven, at the right hand of the Father
ltx/en_us_goadedes/pe.d120:peMA.Ode9C215.text	Seated, He has sent down the grace of the Spirit.
ltx/en_us_goadedes/pe.d120:peMA.Ode9C215a.text	S
ltx/en_us_goadedes/pe.d120:peMA.Ode9C215b.text	eated, He has sent down the grace of the Spirit.
ltx/en_us_goadedes/pe.d120:peMA.Ode9C22.incipit	Let us glorify…
ltx/en_us_goadedes/pe.d120:peMA.Ode9C22.melody	@ltx/en_us_goadedes/he.h.m4:heHE.ChairoisAnassa.name
ltx/en_us_goadedes/pe.d120:peMA.Ode9C22.mode	@ltx/en_us_goadedes/miscellanea:misc.Mode4
ltx/en_us_goadedes/pe.d120:peMA.Ode9C22.ode	@ltx/en_us_goadedes/miscellanea:misc.Ode9
ltx/en_us_goadedes/pe.d120:peMA.Ode9C22.text	Let us glorify the tri-luminous Essence * As being wise, indivisible, equipotent, * The Godhead, from which we have received the divine breath * Of dazzling grace that flows therefrom and that has made us * Resplendent through a mystical transformation.
ltx/en_us_goadedes/pe.d120:peMA.Ode9C221.text	Let us glorify the tri-luminous Essence
ltx/en_us_goadedes/pe.d120:peMA.Ode9C221a.text	L
ltx/en_us_goadedes/pe.d120:peMA.Ode9C221b.text	et us glorify the tri-luminous Essence
ltx/en_us_goadedes/pe.d120:peMA.Ode9C222.text	As being wise, indivisible, equipotent,
ltx/en_us_goadedes/pe.d120:peMA.Ode9C222a.text	A
ltx/en_us_goadedes/pe.d120:peMA.Ode9C222b.text	s being wise, indivisible, equipotent,
ltx/en_us_goadedes/pe.d120:peMA.Ode9C223.text	The Godhead, from which we have received the divine breath
ltx/en_us_goadedes/pe.d120:peMA.Ode9C223a.text	T
ltx/en_us_goadedes/pe.d120:peMA.Ode9C223b.text	he Godhead, from which we have received the divine breath
ltx/en_us_goadedes/pe.d120:peMA.Ode9C224.text	Of dazzling grace that flows therefrom and that has made us
ltx/en_us_goadedes/pe.d120:peMA.Ode9C224a.text	O
ltx/en_us_goadedes/pe.d120:peMA.Ode9C224b.text	f dazzling grace that flows therefrom and that has made us
ltx/en_us_goadedes/pe.d120:peMA.Ode9C225.text	Resplendent through a mystical transformation.
ltx/en_us_goadedes/pe.d120:peMA.Ode9C225a.text	R
ltx/en_us_goadedes/pe.d120:peMA.Ode9C225b.text	esplendent through a mystical transformation.
ltx/en_us_goadedes/pe.d120:peMA.Ode9C2H.greekmelody	@ltx/en_us_goadedes/he.h.m4:heHE.ChairoisAnassa.greekname
ltx/en_us_goadedes/pe.d120:peMA.Ode9C2H.incipit	@ltx/en_us_goadedes/he.h.m4:heHE.ChairoisAnassa.incipit
ltx/en_us_goadedes/pe.d120:peMA.Ode9C2H.melody	@ltx/en_us_goadedes/he.h.m4:heHE.ChairoisAnassa.melody
ltx/en_us_goadedes/pe.d120:peMA.Ode9C2H.mode	@ltx/en_us_goadedes/miscellanea:misc.Mode4
ltx/en_us_goadedes/pe.d120:peMA.Ode9C2H.ode	@ltx/en_us_goadedes/miscellanea:misc.Ode9
ltx/en_us_goadedes/pe.d120:peMA.Ode9C2H.text	@ltx/en_us_goadedes/he.h.m4:heHE.ChairoisAnassa.text
ltx/en_us_goadedes/pe.d120:peMA.Ode9C2H1.text	@ltx/en_us_goadedes/he.h.m4:heHE.ChairoisAnassa1.text
ltx/en_us_goadedes/pe.d120:peMA.Ode9C2H1a.text	@ltx/en_us_goadedes/he.h.m4:heHE.ChairoisAnassa1a.text
ltx/en_us_goadedes/pe.d120:peMA.Ode9C2H1b.text	@ltx/en_us_goadedes/he.h.m4:heHE.ChairoisAnassa1b.text
ltx/en_us_goadedes/pe.d120:peMA.Ode9C2H2.text	@ltx/en_us_goadedes/he.h.m4:heHE.ChairoisAnassa2.text
ltx/en_us_goadedes/pe.d120:peMA.Ode9C2H2a.text	@ltx/en_us_goadedes/he.h.m4:heHE.ChairoisAnassa2a.text
ltx/en_us_goadedes/pe.d120:peMA.Ode9C2H2b.text	@ltx/en_us_goadedes/he.h.m4:heHE.ChairoisAnassa2b.text
ltx/en_us_goadedes/pe.d120:peMA.Ode9C2H3.text	@ltx/en_us_goadedes/he.h.m4:heHE.ChairoisAnassa3.text
ltx/en_us_goadedes/pe.d120:peMA.Ode9C2H3a.text	@ltx/en_us_goadedes/he.h.m4:heHE.ChairoisAnassa3a.text
ltx/en_us_goadedes/pe.d120:peMA.Ode9C2H3b.text	@ltx/en_us_goadedes/he.h.m4:heHE.ChairoisAnassa3b.text
ltx/en_us_goadedes/pe.d120:peMA.Ode9C2H4.text	@ltx/en_us_goadedes/he.h.m4:heHE.ChairoisAnassa4.text
ltx/en_us_goadedes/pe.d120:peMA.Ode9C2H4a.text	@ltx/en_us_goadedes/he.h.m4:heHE.ChairoisAnassa4a.text
ltx/en_us_goadedes/pe.d120:peMA.Ode9C2H4b.text	@ltx/en_us_goadedes/he.h.m4:heHE.ChairoisAnassa4b.text
ltx/en_us_goadedes/pe.d120:peMA.Ode9C2H5.text	@ltx/en_us_goadedes/he.h.m4:heHE.ChairoisAnassa5.text
ltx/en_us_goadedes/pe.d120:peMA.Ode9C2H5a.text	@ltx/en_us_goadedes/he.h.m4:heHE.ChairoisAnassa5a.text
ltx/en_us_goadedes/pe.d120:peMA.Ode9C2H5b.text	@ltx/en_us_goadedes/he.h.m4:heHE.ChairoisAnassa5b.text
ltx/en_us_goadedes/pe.d120:peMA.Oikos1.incipit	…
ltx/en_us_goadedes/pe.d120:peMA.Oikos1.text	
ltx/en_us_goadedes/pe.d120:peMA.PostGospelBoth.incipit	@ltx/en_us_goadedes/ho.ho03:hoMA.PostGospelTheotokos.incipit
ltx/en_us_goadedes/pe.d120:peMA.PostGospelBoth.melody	
ltx/en_us_goadedes/pe.d120:peMA.PostGospelBoth.mode	@ltx/en_us_goadedes/miscellanea:misc.Mode2
ltx/en_us_goadedes/pe.d120:peMA.PostGospelBoth.text	@ltx/en_us_goadedes/ho.ho03:hoMA.PostGospelTheotokos.text
ltx/en_us_goadedes/pe.d120:peMA.PostGospelGlory.incipit	@ltx/en_us_goadedes/ho.ho03:hoMA.PostGospelApostles.incipit
ltx/en_us_goadedes/pe.d120:peMA.PostGospelGlory.melody	
ltx/en_us_goadedes/pe.d120:peMA.PostGospelGlory.mode	@ltx/en_us_goadedes/miscellanea:misc.Mode2
ltx/en_us_goadedes/pe.d120:peMA.PostGospelGlory.text	@ltx/en_us_goadedes/ho.ho03:hoMA.PostGospelApostles.text
ltx/en_us_goadedes/pe.d120:peMA.PostGospelIdiomelon.incipit	@ltx/en_us_goadedes/pe.d120:peVE.Aposticha3.incipit
ltx/en_us_goadedes/pe.d120:peMA.PostGospelIdiomelon.melody	@ltx/en_us_goadedes/miscellanea:misc.Idiomelon
ltx/en_us_goadedes/pe.d120:peMA.PostGospelIdiomelon.mode	@ltx/en_us_goadedes/miscellanea:misc.Mode6
ltx/en_us_goadedes/pe.d120:peMA.PostGospelIdiomelon.text	@ltx/en_us_goadedes/pe.d120:peVE.Aposticha3.text
ltx/en_us_goadedes/pe.d120:peSY.commemoration.couplet1.title	@ltx/en_us_goadedes/titles:ti.Verses
ltx/en_us_goadedes/pe.d120:peSY.commemoration.couplet1.verse1	
ltx/en_us_goadedes/pe.d120:peSY.commemoration.couplet1.verse2	
ltx/en_us_goadedes/pe.d120:peSY.commemoration.narration.p01	
ltx/en_us_goadedes/pe.d120:peSY.commemoration.narration.p02	
ltx/en_us_goadedes/pe.d120:peSY.commemoration.narration.p03	
ltx/en_us_goadedes/pe.d120:peSY.commemoration.narration.p04	
ltx/en_us_goadedes/pe.d120:peSY.commemoration.narration.p05	
ltx/en_us_goadedes/pe.d120:peSY.commemoration.narration.p06	
ltx/en_us_goadedes/pe.d120:peSY.commemoration.narration.p07	
ltx/en_us_goadedes/pe.d120:peSY.commemoration.single1	
ltx/en_us_goadedes/pe.d120:peSY.commemoration.text	
ltx/en_us_goadedes/pe.d120:peSY.lastline	
ltx/en_us_goadedes/pe.d120:peVE.Apolytikion1.incipit	…
ltx/en_us_goadedes/pe.d120:peVE.Apolytikion1.melody	
ltx/en_us_goadedes/pe.d120:peVE.Apolytikion1.mode	@ltx/en_us_goadedes/miscellanea:misc.Mode8
ltx/en_us_goadedes/pe.d120:peVE.Apolytikion1.text	
ltx/en_us_goadedes/pe.d120:peVE.AposGlory.incipit	…
ltx/en_us_goadedes/pe.d120:peVE.AposGlory.melody	@ltx/en_us_goadedes/miscellanea:misc.Idiomelon
ltx/en_us_goadedes/pe.d120:peVE.AposGlory.mode	@ltx/en_us_goadedes/miscellanea:misc.Mode8
ltx/en_us_goadedes/pe.d120:peVE.AposGlory.text	
ltx/en_us_goadedes/pe.d120:peVE.Aposticha1.incipit	…
ltx/en_us_goadedes/pe.d120:peVE.Aposticha1.melody	@ltx/en_us_goadedes/miscellanea:misc.Idiomelon
ltx/en_us_goadedes/pe.d120:peVE.Aposticha1.mode	@ltx/en_us_goadedes/miscellanea:misc.Mode6
ltx/en_us_goadedes/pe.d120:peVE.Aposticha1.text	
ltx/en_us_goadedes/pe.d120:peVE.Aposticha2.incipit	…
ltx/en_us_goadedes/pe.d120:peVE.Aposticha2.melody	@ltx/en_us_goadedes/miscellanea:misc.Idiomelon
ltx/en_us_goadedes/pe.d120:peVE.Aposticha2.mode	@ltx/en_us_goadedes/miscellanea:misc.Mode6
ltx/en_us_goadedes/pe.d120:peVE.Aposticha2.text	
ltx/en_us_goadedes/pe.d120:peVE.Aposticha3.incipit	…
ltx/en_us_goadedes/pe.d120:peVE.Aposticha3.melody	@ltx/en_us_goadedes/miscellanea:misc.Idiomelon
ltx/en_us_goadedes/pe.d120:peVE.Aposticha3.mode	@ltx/en_us_goadedes/miscellanea:misc.Mode6
ltx/en_us_goadedes/pe.d120:peVE.Aposticha3.text	
ltx/en_us_goadedes/pe.d120:peVE.Lity1.incipit	@ltx/en_us_goadedes/pe.d120:peVE.Stichera05.incipit
ltx/en_us_goadedes/pe.d120:peVE.Lity1.melody	@ltx/en_us_goadedes/miscellanea:misc.Idiomelon
ltx/en_us_goadedes/pe.d120:peVE.Lity1.mode	@ltx/en_us_goadedes/miscellanea:misc.Mode2
ltx/en_us_goadedes/pe.d120:peVE.Lity1.text	@ltx/en_us_goadedes/pe.d120:peVE.Stichera05.text
ltx/en_us_goadedes/pe.d120:peVE.Lity2.incipit	@ltx/en_us_goadedes/pe.d120:peVE.Stichera06.incipit
ltx/en_us_goadedes/pe.d120:peVE.Lity2.melody	@ltx/en_us_goadedes/miscellanea:misc.Idiomelon
ltx/en_us_goadedes/pe.d120:peVE.Lity2.mode	@ltx/en_us_goadedes/miscellanea:misc.Mode2
ltx/en_us_goadedes/pe.d120:peVE.Lity2.text	@ltx/en_us_goadedes/pe.d120:peVE.Stichera06.text
ltx/en_us_goadedes/pe.d120:peVE.Lity3.incipit	@ltx/en_us_goadedes/pe.d120:peVE.Stichera07.incipit
ltx/en_us_goadedes/pe.d120:peVE.Lity3.melody	@ltx/en_us_goadedes/miscellanea:misc.Idiomelon
ltx/en_us_goadedes/pe.d120:peVE.Lity3.mode	@ltx/en_us_goadedes/miscellanea:misc.Mode2
ltx/en_us_goadedes/pe.d120:peVE.Lity3.text	@ltx/en_us_goadedes/pe.d120:peVE.Stichera07.text
ltx/en_us_goadedes/pe.d120:peVE.LityGlory.incipit	…
ltx/en_us_goadedes/pe.d120:peVE.LityGlory.melody	@ltx/en_us_goadedes/miscellanea:misc.Idiomelon
ltx/en_us_goadedes/pe.d120:peVE.LityGlory.mode	@ltx/en_us_goadedes/miscellanea:misc.Mode8
ltx/en_us_goadedes/pe.d120:peVE.LityGlory.text	
ltx/en_us_goadedes/pe.d120:peVE.MM.Stichera1234as3456.text	@ltx/en_us_goadedes/properties:media.key
ltx/en_us_goadedes/pe.d120:peVE.SticGlory.incipit	…
ltx/en_us_goadedes/pe.d120:peVE.SticGlory.melody	@ltx/en_us_goadedes/miscellanea:misc.Idiomelon
ltx/en_us_goadedes/pe.d120:peVE.SticGlory.mode	@ltx/en_us_goadedes/miscellanea:misc.Mode8
ltx/en_us_goadedes/pe.d120:peVE.SticGlory.poet	@ltx/en_us_goadedes/poets:po.LeontosDespotou
ltx/en_us_goadedes/pe.d120:peVE.SticGlory.text	
ltx/en_us_goadedes/pe.d120:peVE.Stichera01.incipit	…
ltx/en_us_goadedes/pe.d120:peVE.Stichera01.melody	@ltx/en_us_goadedes/miscellanea:misc.Idiomelon
ltx/en_us_goadedes/pe.d120:peVE.Stichera01.mode	@ltx/en_us_goadedes/miscellanea:misc.Mode1
ltx/en_us_goadedes/pe.d120:peVE.Stichera01.text	
ltx/en_us_goadedes/pe.d120:peVE.Stichera02.incipit	…
ltx/en_us_goadedes/pe.d120:peVE.Stichera02.melody	@ltx/en_us_goadedes/miscellanea:misc.Idiomelon
ltx/en_us_goadedes/pe.d120:peVE.Stichera02.mode	@ltx/en_us_goadedes/miscellanea:misc.Mode1
ltx/en_us_goadedes/pe.d120:peVE.Stichera02.text	
ltx/en_us_goadedes/pe.d120:peVE.Stichera03.incipit	…
ltx/en_us_goadedes/pe.d120:peVE.Stichera03.melody	@ltx/en_us_goadedes/miscellanea:misc.Idiomelon
ltx/en_us_goadedes/pe.d120:peVE.Stichera03.mode	@ltx/en_us_goadedes/miscellanea:misc.Mode1
ltx/en_us_goadedes/pe.d120:peVE.Stichera03.text	
ltx/en_us_goadedes/pe.d120:peVE.Stichera04.incipit	…
ltx/en_us_goadedes/pe.d120:peVE.Stichera04.melody	@ltx/en_us_goadedes/miscellanea:misc.Idiomelon
ltx/en_us_goadedes/pe.d120:peVE.Stichera04.mode	@ltx/en_us_goadedes/miscellanea:misc.Mode2
ltx/en_us_goadedes/pe.d120:peVE.Stichera04.text	
ltx/en_us_goadedes/pe.d120:peVE.Stichera05.incipit	…
ltx/en_us_goadedes/pe.d120:peVE.Stichera05.melody	@ltx/en_us_goadedes/miscellanea:misc.Idiomelon
ltx/en_us_goadedes/pe.d120:peVE.Stichera05.mode	@ltx/en_us_goadedes/miscellanea:misc.Mode2
ltx/en_us_goadedes/pe.d120:peVE.Stichera05.text	
ltx/en_us_goadedes/pe.d120:peVE.Stichera06.incipit	…
ltx/en_us_goadedes/pe.d120:peVE.Stichera06.melody	@ltx/en_us_goadedes/miscellanea:misc.Idiomelon
ltx/en_us_goadedes/pe.d120:peVE.Stichera06.mode	@ltx/en_us_goadedes/miscellanea:misc.Mode2
ltx/en_us_goadedes/pe.d120:peVE.Stichera06.text	
ltx/en_us_goadedes/pe.d120:peVE.Stichera07.incipit	…
ltx/en_us_goadedes/pe.d120:peVE.Stichera07.melody	@ltx/en_us_goadedes/miscellanea:misc.Idiomelon
ltx/en_us_goadedes/pe.d120:peVE.Stichera07.mode	@ltx/en_us_goadedes/miscellanea:misc.Mode2
ltx/en_us_goadedes/pe.d120:peVE.Stichera07.text	
ltx/en_us_goadedes/pe.d120:peVE.Stichera08.incipit	…
ltx/en_us_goadedes/pe.d120:peVE.Stichera08.melody	@ltx/en_us_goadedes/miscellanea:misc.Idiomelon
ltx/en_us_goadedes/pe.d120:peVE.Stichera08.mode	@ltx/en_us_goadedes/miscellanea:misc.Mode2
ltx/en_us_goadedes/pe.d120:peVE.Stichera08.text	
