ltx/en_us_goadedes/he.a.m2:heAU.EfsplagchniasYparchousa.greekname	Εὐσπλαγχνίας ὑπάρχουσα.
ltx/en_us_goadedes/he.a.m2:heAU.EfsplagchniasYparchousa.incipit	As the Mother of God…
ltx/en_us_goadedes/he.a.m2:heAU.EfsplagchniasYparchousa.melody	@ltx/en_us_goadedes/miscellanea:misc.Automelon
ltx/en_us_goadedes/he.a.m2:heAU.EfsplagchniasYparchousa.mode	@ltx/en_us_goadedes/miscellanea:misc.Mode2
ltx/en_us_goadedes/he.a.m2:heAU.EfsplagchniasYparchousa.name	As the Mother of God.
ltx/en_us_goadedes/he.a.m2:heAU.EfsplagchniasYparchousa.notmetered	N/M (As the Mother of God.)
ltx/en_us_goadedes/he.a.m2:heAU.EfsplagchniasYparchousa.text	As the Mother of God, you are the source * of compassion. O Lady, count us worthy of pity. * Look upon us graciously, though we have sinned. * Demonstrate your power, as you always do. * For, placing our hope in you, * we cry out, Rejoice, to you, * as did Gabriel of old, * as the chief commander of the bodiless hosts.
ltx/en_us_goadedes/he.a.m2:heAU.GynaikesAkoutisthite.greekname	Γυναῖκες ἀκουτίσθητε.
ltx/en_us_goadedes/he.a.m2:heAU.GynaikesAkoutisthite.incipit	O Women, hearken…
ltx/en_us_goadedes/he.a.m2:heAU.GynaikesAkoutisthite.melody	@ltx/en_us_goadedes/miscellanea:misc.Automelon
ltx/en_us_goadedes/he.a.m2:heAU.GynaikesAkoutisthite.mode	@ltx/en_us_goadedes/miscellanea:misc.Mode2
ltx/en_us_goadedes/he.a.m2:heAU.GynaikesAkoutisthite.name	O Women, hearken.
ltx/en_us_goadedes/he.a.m2:heAU.GynaikesAkoutisthite.notmetered	N/M (O Women, hearken.)
ltx/en_us_goadedes/he.a.m2:heAU.GynaikesAkoutisthite.text	O Women, hearken to the voice * that echoes with exultant joy. * Trampling on Hades, that tyrant, * I raised up all from corruption. * Run now with haste and tell my friends * good tidings as evangelists. * For I will that my creature see * joy distinctly arising * from woman, from whom came sorrow.
ltx/en_us_goadedes/he.a.m2:heAU.OikosTouEfratha.greekname	Οἶκος τοῦ Ἐφραθᾶ.
ltx/en_us_goadedes/he.a.m2:heAU.OikosTouEfratha.incipit	O House of Ephratha…
ltx/en_us_goadedes/he.a.m2:heAU.OikosTouEfratha.melody	@ltx/en_us_goadedes/miscellanea:misc.Automelon
ltx/en_us_goadedes/he.a.m2:heAU.OikosTouEfratha.mode	@ltx/en_us_goadedes/miscellanea:misc.Mode2
ltx/en_us_goadedes/he.a.m2:heAU.OikosTouEfratha.name	O House of Ephratha.
ltx/en_us_goadedes/he.a.m2:heAU.OikosTouEfratha.notmetered	N/M (O House of Ephratha.)
ltx/en_us_goadedes/he.a.m2:heAU.OikosTouEfratha.text	O House of Ephratha, * the city that is holy, * the glory of the Prophets, * prepare your house, for therein * the Virgin will give birth to God.
ltx/en_us_goadedes/he.a.m2:heAU.OteEkTouXylou.greekname	Ὅτε ἐκ τοῦ ξύλου.
ltx/en_us_goadedes/he.a.m2:heAU.OteEkTouXylou.incipit	Joseph took You down…
ltx/en_us_goadedes/he.a.m2:heAU.OteEkTouXylou.melody	@ltx/en_us_goadedes/miscellanea:misc.Automelon
ltx/en_us_goadedes/he.a.m2:heAU.OteEkTouXylou.mode	@ltx/en_us_goadedes/miscellanea:misc.Mode2
ltx/en_us_goadedes/he.a.m2:heAU.OteEkTouXylou.name	Joseph took You down.
ltx/en_us_goadedes/he.a.m2:heAU.OteEkTouXylou.notmetered	N/M (Joseph took You.)
ltx/en_us_goadedes/he.a.m2:heAU.OteEkTouXylou.text	Joseph took You down from the Cross * after You had died, and prepared You, O Christ, for burial. * Using myrrh, he wrapped you in a shroud, O Life of all. * And constrained by his ardent love, * he longed to embrace You, * pressing to Your spotless body his own heart and lips. * But restrained by fear, yet rejoicing, * he cried out, “Benevolent Savior, * glory be to You for coming down to us!”
ltx/en_us_goadedes/he.a.m2:heAU.PoioisEffimionStemmasin.greekname	Ποίοις εὐφημιῶν στέμμασιν.
ltx/en_us_goadedes/he.a.m2:heAU.PoioisEffimionStemmasin.incipit	Are there any worthy crowns…
ltx/en_us_goadedes/he.a.m2:heAU.PoioisEffimionStemmasin.melody	@ltx/en_us_goadedes/miscellanea:misc.Automelon
ltx/en_us_goadedes/he.a.m2:heAU.PoioisEffimionStemmasin.mode	@ltx/en_us_goadedes/miscellanea:misc.Mode2
ltx/en_us_goadedes/he.a.m2:heAU.PoioisEffimionStemmasin.name	Are there any worthy crowns.
ltx/en_us_goadedes/he.a.m2:heAU.PoioisEffimionStemmasin.notmetered	N/M (Are there any worthy crowns.)
ltx/en_us_goadedes/he.a.m2:heAU.PoioisEffimionStemmasin.text	Are there any worthy crowns of praise * for Sts. Peter and Paul the Apostles? * Although they were physically separate, * yet in the Spirit they were unified. * They were the premiers among God’s heralds: * the one, who was the leader of the Apostles’ band; * the other, who truly labored more than all the rest. * They have been crowned with the halos * of immortal glory -- * being worthy of them indeed -- * by Christ our Lord and God, * the Savior who has the great mercy.
ltx/en_us_goadedes/he.a.m2:heAU.SarkiYpnosas.greekname	Σαρκὶ ὑπνώσας.
ltx/en_us_goadedes/he.a.m2:heAU.SarkiYpnosas.incipit	When You had slumbered…
ltx/en_us_goadedes/he.a.m2:heAU.SarkiYpnosas.melody	@ltx/en_us_goadedes/miscellanea:misc.Automelon
ltx/en_us_goadedes/he.a.m2:heAU.SarkiYpnosas.mode	@ltx/en_us_goadedes/miscellanea:misc.Mode2
ltx/en_us_goadedes/he.a.m2:heAU.SarkiYpnosas.name	When You had slumbered.
ltx/en_us_goadedes/he.a.m2:heAU.SarkiYpnosas.notmetered	N/M (When You had slumbered.)
ltx/en_us_goadedes/he.a.m2:heAU.SarkiYpnosas.text	When You had slumbered in the flesh as one mortal, O King and Lord, You rose again on the third day, and raised up Adam from decay and rendered death of no effect. Pascha of incorruption, salvation of the world.
ltx/en_us_goadedes/he.a.m2:heAU.StavrosOFylax.greekname	Σταυρός, ὁ φύλαξ.
ltx/en_us_goadedes/he.a.m2:heAU.StavrosOFylax.incipit	O Cross, you are the guardian…
ltx/en_us_goadedes/he.a.m2:heAU.StavrosOFylax.melody	@ltx/en_us_goadedes/miscellanea:misc.Automelon
ltx/en_us_goadedes/he.a.m2:heAU.StavrosOFylax.mode	@ltx/en_us_goadedes/miscellanea:misc.Mode2
ltx/en_us_goadedes/he.a.m2:heAU.StavrosOFylax.name	O Cross, you are the guardian.
ltx/en_us_goadedes/he.a.m2:heAU.StavrosOFylax.notmetered	N/M (O Cross, you are the guardian.)
ltx/en_us_goadedes/he.a.m2:heAU.StavrosOFylax.text	O Cross, you are the guardian of the whole world. * O Cross, you are the height of the Church’s beauty. * O Cross, you are what strengthens the Emperors. * O Cross, believers’ firm support. * O Cross, the glory of Angels * and the defeat of the demons.
ltx/en_us_goadedes/he.a.m2:heAU.TaAnoZiton.greekname	Τὰ ἄνω ζητῶν.
ltx/en_us_goadedes/he.a.m2:heAU.TaAnoZiton.incipit	In seeking the heights…
ltx/en_us_goadedes/he.a.m2:heAU.TaAnoZiton.melody	@ltx/en_us_goadedes/miscellanea:misc.Automelon
ltx/en_us_goadedes/he.a.m2:heAU.TaAnoZiton.mode	@ltx/en_us_goadedes/miscellanea:misc.Mode2
ltx/en_us_goadedes/he.a.m2:heAU.TaAnoZiton.name	In seeking the heights.
ltx/en_us_goadedes/he.a.m2:heAU.TaAnoZiton.notmetered	N/M (In seeking the heights.)
ltx/en_us_goadedes/he.a.m2:heAU.TaAnoZiton.text	In seeking the heights, connected to the things below, * and making your pillar a fiery chariot, * O Devout one, you became conversant with Angels by means thereof, * and with them on our behalf * you ceaselessly intercede with Christ our God.
ltx/en_us_goadedes/he.a.m2:heAU.ToisMathitaisSynelthomen.greekname	Τοῖς Μαθηταῖς συνέλθωμεν.
ltx/en_us_goadedes/he.a.m2:heAU.ToisMathitaisSynelthomen.incipit	Let us in faith…
ltx/en_us_goadedes/he.a.m2:heAU.ToisMathitaisSynelthomen.melody	@ltx/en_us_goadedes/miscellanea:misc.Automelon
ltx/en_us_goadedes/he.a.m2:heAU.ToisMathitaisSynelthomen.mode	@ltx/en_us_goadedes/miscellanea:misc.Mode2
ltx/en_us_goadedes/he.a.m2:heAU.ToisMathitaisSynelthomen.name	Let us in faith.
ltx/en_us_goadedes/he.a.m2:heAU.ToisMathitaisSynelthomen.notmetered	N/M (Let us in faith.)
ltx/en_us_goadedes/he.a.m2:heAU.ToisMathitaisSynelthomen.text	Let us in faith now join the Lord’s * disciples on the mountain * in Galilee, and we shall see * Christ saying He was given * all authority, both on high * and below. We shall hear Him * teach how to baptize nations all, * in the name of the Father and of the Son * and the Holy Spirit, and say He always * is with believers to the close * of the age, as He promised.
ltx/en_us_goadedes/he.a.m2:heAU.ToisTonAimatonSou.greekname	Τοῖς τῶν αἱμάτων σου.
ltx/en_us_goadedes/he.a.m2:heAU.ToisTonAimatonSou.incipit	In the pools of your blood…
ltx/en_us_goadedes/he.a.m2:heAU.ToisTonAimatonSou.melody	@ltx/en_us_goadedes/miscellanea:misc.Automelon
ltx/en_us_goadedes/he.a.m2:heAU.ToisTonAimatonSou.mode	@ltx/en_us_goadedes/miscellanea:misc.Mode2
ltx/en_us_goadedes/he.a.m2:heAU.ToisTonAimatonSou.name	In the pools of your blood.
ltx/en_us_goadedes/he.a.m2:heAU.ToisTonAimatonSou.notmetered	N/M (In the pools of your blood.)
ltx/en_us_goadedes/he.a.m2:heAU.ToisTonAimatonSou.text	In the pools of your blood, O Demetrius, with royal purple God has robed His holy Church. He gave you dominion invincible, thereby preserving your city invulnerable; for you are her bulwark and patron saint.
ltx/en_us_goadedes/he.a.m2:heAU.TonMathitonOrontonSe.greekname	Τῶν Μαθητῶν ὁρώντων σε.
ltx/en_us_goadedes/he.a.m2:heAU.TonMathitonOrontonSe.incipit	With the disciples…
ltx/en_us_goadedes/he.a.m2:heAU.TonMathitonOrontonSe.melody	@ltx/en_us_goadedes/miscellanea:misc.Automelon
ltx/en_us_goadedes/he.a.m2:heAU.TonMathitonOrontonSe.mode	@ltx/en_us_goadedes/miscellanea:misc.Mode2
ltx/en_us_goadedes/he.a.m2:heAU.TonMathitonOrontonSe.name	With the disciples.
ltx/en_us_goadedes/he.a.m2:heAU.TonMathitonOrontonSe.notmetered	N/M (With the disciples.)
ltx/en_us_goadedes/he.a.m2:heAU.TonMathitonOrontonSe.text	With the disciples witnessing, You ascended, * O Christ, unto the Father, to sit beside Him. * Angels ran before You and they cried aloud, * Lift up the gates, O lift them up. * Behold the King has ascended * to light-principial glory.
ltx/en_us_goadedes/he.a.m2:heAU.TousAsfaleis.greekname	Τοὺς ἀσφαλεῖς.
ltx/en_us_goadedes/he.a.m2:heAU.TousAsfaleis.incipit	You have taken…
ltx/en_us_goadedes/he.a.m2:heAU.TousAsfaleis.melody	@ltx/en_us_goadedes/miscellanea:misc.Automelon
ltx/en_us_goadedes/he.a.m2:heAU.TousAsfaleis.mode	@ltx/en_us_goadedes/miscellanea:misc.Mode2
ltx/en_us_goadedes/he.a.m2:heAU.TousAsfaleis.name	You have taken.
ltx/en_us_goadedes/he.a.m2:heAU.TousAsfaleis.notmetered	N/M (You have taken.)
ltx/en_us_goadedes/he.a.m2:heAU.TousAsfaleis.text	You have taken to yourself, O Lord, the pinnacles of Your Disciples, those unerring theologians and preachers, to enjoy Your blessings and repose. For You accepted their labors and their death as being higher than any whole-burnt offering, for only You know what is in the heart.
ltx/en_us_goadedes/he.a.m2:heAU.title	Automela of Mode 2
