ltx/en_us_goadedes/oc.m5.d7:ocBK.ModeNaked	@ltx/en_us_goadedes/miscellanea:misc.Mode5.naked
ltx/en_us_goadedes/oc.m5.d7:ocBK.end.title	
ltx/en_us_goadedes/oc.m5.d7:ocBK.end.verse1.text	
ltx/en_us_goadedes/oc.m5.d7:ocBK.end.verse2.text	
ltx/en_us_goadedes/oc.m5.d7:ocBK.end.verse3.text	
ltx/en_us_goadedes/oc.m5.d7:ocBK.end.verse4.text	
ltx/en_us_goadedes/oc.m5.d7:ocBK.end.verse5.text	
ltx/en_us_goadedes/oc.m5.d7:ocBK.end.verse6.text	
ltx/en_us_goadedes/oc.m5.d7:ocLI.Beatitudes1.incipit	@ltx/en_us_goadedes/oc.m5.d1:ocLI.Beatitudes1.incipit
ltx/en_us_goadedes/oc.m5.d7:ocLI.Beatitudes1.melody	
ltx/en_us_goadedes/oc.m5.d7:ocLI.Beatitudes1.mode	@ltx/en_us_goadedes/miscellanea:misc.Mode5
ltx/en_us_goadedes/oc.m5.d7:ocLI.Beatitudes1.text	@ltx/en_us_goadedes/oc.m5.d1:ocLI.Beatitudes1.text
ltx/en_us_goadedes/oc.m5.d7:ocLI.Beatitudes2.incipit	…
ltx/en_us_goadedes/oc.m5.d7:ocLI.Beatitudes2.melody	
ltx/en_us_goadedes/oc.m5.d7:ocLI.Beatitudes2.mode	@ltx/en_us_goadedes/miscellanea:misc.Mode5
ltx/en_us_goadedes/oc.m5.d7:ocLI.Beatitudes2.text	
ltx/en_us_goadedes/oc.m5.d7:ocLI.Beatitudes3.incipit	…
ltx/en_us_goadedes/oc.m5.d7:ocLI.Beatitudes3.melody	
ltx/en_us_goadedes/oc.m5.d7:ocLI.Beatitudes3.mode	@ltx/en_us_goadedes/miscellanea:misc.Mode5
ltx/en_us_goadedes/oc.m5.d7:ocLI.Beatitudes3.text	
ltx/en_us_goadedes/oc.m5.d7:ocLI.Beatitudes4.incipit	…
ltx/en_us_goadedes/oc.m5.d7:ocLI.Beatitudes4.melody	
ltx/en_us_goadedes/oc.m5.d7:ocLI.Beatitudes4.mode	@ltx/en_us_goadedes/miscellanea:misc.Mode5
ltx/en_us_goadedes/oc.m5.d7:ocLI.Beatitudes4.text	
ltx/en_us_goadedes/oc.m5.d7:ocLI.BeatitudesT.incipit	…
ltx/en_us_goadedes/oc.m5.d7:ocLI.BeatitudesT.melody	
ltx/en_us_goadedes/oc.m5.d7:ocLI.BeatitudesT.mode	@ltx/en_us_goadedes/miscellanea:misc.Mode5
ltx/en_us_goadedes/oc.m5.d7:ocLI.BeatitudesT.text	
ltx/en_us_goadedes/oc.m5.d7:ocLI.BeatitudesTr.incipit	…
ltx/en_us_goadedes/oc.m5.d7:ocLI.BeatitudesTr.melody	
ltx/en_us_goadedes/oc.m5.d7:ocLI.BeatitudesTr.mode	@ltx/en_us_goadedes/miscellanea:misc.Mode5
ltx/en_us_goadedes/oc.m5.d7:ocLI.BeatitudesTr.text	
ltx/en_us_goadedes/oc.m5.d7:ocLI.MM.Beatitudes1234TrTas78910GB.text	@ltx/en_us_goadedes/properties:media.key
ltx/en_us_goadedes/oc.m5.d7:ocMA.ApolTheotokion.incipit	@ltx/en_us_goadedes/oc.m5.d2:ocMA.ApolTheotokion.incipit
ltx/en_us_goadedes/oc.m5.d7:ocMA.ApolTheotokion.melody	
ltx/en_us_goadedes/oc.m5.d7:ocMA.ApolTheotokion.mode	@ltx/en_us_goadedes/miscellanea:misc.Mode5
ltx/en_us_goadedes/oc.m5.d7:ocMA.ApolTheotokion.text	@ltx/en_us_goadedes/oc.m5.d2:ocMA.ApolTheotokion.text
ltx/en_us_goadedes/oc.m5.d7:ocMA.AposTheotokion.greekmelody	@ltx/en_us_goadedes/he.a.m5:heAU.ChairoisAskitikon.greekname
ltx/en_us_goadedes/oc.m5.d7:ocMA.AposTheotokion.incipit	…
ltx/en_us_goadedes/oc.m5.d7:ocMA.AposTheotokion.melody	@ltx/en_us_goadedes/he.a.m5:heAU.ChairoisAskitikon.name
ltx/en_us_goadedes/oc.m5.d7:ocMA.AposTheotokion.mode	@ltx/en_us_goadedes/miscellanea:misc.Mode5
ltx/en_us_goadedes/oc.m5.d7:ocMA.AposTheotokion.text	
ltx/en_us_goadedes/oc.m5.d7:ocMA.Aposticha1.greekmelody	@ltx/en_us_goadedes/he.a.m5:heAU.ChairoisAskitikon.greekname
ltx/en_us_goadedes/oc.m5.d7:ocMA.Aposticha1.incipit	Settle the souls…
ltx/en_us_goadedes/oc.m5.d7:ocMA.Aposticha1.melody	@ltx/en_us_goadedes/he.a.m5:heAU.ChairoisAskitikon.name
ltx/en_us_goadedes/oc.m5.d7:ocMA.Aposticha1.mode	@ltx/en_us_goadedes/miscellanea:misc.Mode5
ltx/en_us_goadedes/oc.m5.d7:ocMA.Aposticha1.text	Settle the souls of those who have passed * where the resplendence of Your countenance shines on them, * to lie down in greenest pastures, O most compassionate Christ, * beside the still waters of divine delight. * And grant them to be at rest in the bosom of Abraham, * there where Your light is most especially visible, * and the fountains of Your benevolence overflow, * there where the choirs of the just continually celebrate, * ever extolling Your goodness, in exultation and songs of joy. * We pray You have mercy * on Your servants and You grant them to dwell with all Your saints.
ltx/en_us_goadedes/oc.m5.d7:ocMA.Aposticha2.greekmelody	@ltx/en_us_goadedes/he.a.m5:heAU.ChairoisAskitikon.greekname
ltx/en_us_goadedes/oc.m5.d7:ocMA.Aposticha2.incipit	…
ltx/en_us_goadedes/oc.m5.d7:ocMA.Aposticha2.melody	@ltx/en_us_goadedes/he.a.m5:heAU.ChairoisAskitikon.name
ltx/en_us_goadedes/oc.m5.d7:ocMA.Aposticha2.mode	@ltx/en_us_goadedes/miscellanea:misc.Mode5
ltx/en_us_goadedes/oc.m5.d7:ocMA.Aposticha2.text	
ltx/en_us_goadedes/oc.m5.d7:ocMA.Aposticha3.greekmelody	@ltx/en_us_goadedes/he.a.m5:heAU.ChairoisAskitikon.greekname
ltx/en_us_goadedes/oc.m5.d7:ocMA.Aposticha3.incipit	…
ltx/en_us_goadedes/oc.m5.d7:ocMA.Aposticha3.melody	@ltx/en_us_goadedes/he.a.m5:heAU.ChairoisAskitikon.name
ltx/en_us_goadedes/oc.m5.d7:ocMA.Aposticha3.mode	@ltx/en_us_goadedes/miscellanea:misc.Mode5
ltx/en_us_goadedes/oc.m5.d7:ocMA.Aposticha3.text	
ltx/en_us_goadedes/oc.m5.d7:ocMA.C1.acrostic.notice1	
ltx/en_us_goadedes/oc.m5.d7:ocMA.C1.acrostic.text	
ltx/en_us_goadedes/oc.m5.d7:ocMA.C1.acrostic.title	Canon for all the Saints.
ltx/en_us_goadedes/oc.m5.d7:ocMA.C2.acrostic.notice1	
ltx/en_us_goadedes/oc.m5.d7:ocMA.C2.acrostic.text	
ltx/en_us_goadedes/oc.m5.d7:ocMA.C2.acrostic.title	Canon for the Deceased.
ltx/en_us_goadedes/oc.m5.d7:ocMA.CA.notice	
ltx/en_us_goadedes/oc.m5.d7:ocMA.Kathisma11.greekmelody	@ltx/en_us_goadedes/he.a.m5:heAU.TonSynanarchonLogon.greekname
ltx/en_us_goadedes/oc.m5.d7:ocMA.Kathisma11.incipit	@ltx/en_us_goadedes/oc.m5.d3:ocMA.Kathisma32.incipit
ltx/en_us_goadedes/oc.m5.d7:ocMA.Kathisma11.melody	@ltx/en_us_goadedes/he.a.m5:heAU.TonSynanarchonLogon.name
ltx/en_us_goadedes/oc.m5.d7:ocMA.Kathisma11.mode	@ltx/en_us_goadedes/miscellanea:misc.Mode5
ltx/en_us_goadedes/oc.m5.d7:ocMA.Kathisma11.text	@ltx/en_us_goadedes/oc.m5.d3:ocMA.Kathisma32.text
ltx/en_us_goadedes/oc.m5.d7:ocMA.Kathisma12.incipit	@ltx/en_us_goadedes/oc.m5.d4:ocMA.Kathisma32.incipit
ltx/en_us_goadedes/oc.m5.d7:ocMA.Kathisma12.melody	
ltx/en_us_goadedes/oc.m5.d7:ocMA.Kathisma12.mode	@ltx/en_us_goadedes/miscellanea:misc.Mode5
ltx/en_us_goadedes/oc.m5.d7:ocMA.Kathisma12.text	@ltx/en_us_goadedes/oc.m5.d4:ocMA.Kathisma32.text
ltx/en_us_goadedes/oc.m5.d7:ocMA.Kathisma13.incipit	@ltx/en_us_goadedes/oc.m5.d5:ocMA.Kathisma32.incipit
ltx/en_us_goadedes/oc.m5.d7:ocMA.Kathisma13.melody	
ltx/en_us_goadedes/oc.m5.d7:ocMA.Kathisma13.mode	@ltx/en_us_goadedes/miscellanea:misc.Mode5
ltx/en_us_goadedes/oc.m5.d7:ocMA.Kathisma13.text	@ltx/en_us_goadedes/oc.m5.d5:ocMA.Kathisma32.text
ltx/en_us_goadedes/oc.m5.d7:ocMA.Kathisma14.greekmelody	@ltx/en_us_goadedes/he.a.m5:heAU.TonSynanarchonLogon.greekname
ltx/en_us_goadedes/oc.m5.d7:ocMA.Kathisma14.incipit	@ltx/en_us_goadedes/oc.m5.d1:ocVE.ApolTheotokionVM.incipit
ltx/en_us_goadedes/oc.m5.d7:ocMA.Kathisma14.melody	@ltx/en_us_goadedes/he.a.m5:heAU.TonSynanarchonLogon.name
ltx/en_us_goadedes/oc.m5.d7:ocMA.Kathisma14.mode	@ltx/en_us_goadedes/miscellanea:misc.Mode5
ltx/en_us_goadedes/oc.m5.d7:ocMA.Kathisma14.text	@ltx/en_us_goadedes/oc.m5.d1:ocVE.ApolTheotokionVM.text
ltx/en_us_goadedes/oc.m5.d7:ocMA.Kathisma21.incipit	@ltx/en_us_goadedes/oc.m5.d2:ocMA.Kathisma32.incipit
ltx/en_us_goadedes/oc.m5.d7:ocMA.Kathisma21.melody	
ltx/en_us_goadedes/oc.m5.d7:ocMA.Kathisma21.mode	@ltx/en_us_goadedes/miscellanea:misc.Mode5
ltx/en_us_goadedes/oc.m5.d7:ocMA.Kathisma21.text	@ltx/en_us_goadedes/oc.m5.d2:ocMA.Kathisma32.text
ltx/en_us_goadedes/oc.m5.d7:ocMA.Kathisma22.incipit	O Savior, let Your servants repose…
ltx/en_us_goadedes/oc.m5.d7:ocMA.Kathisma22.melody	
ltx/en_us_goadedes/oc.m5.d7:ocMA.Kathisma22.mode	@ltx/en_us_goadedes/miscellanea:misc.Mode5
ltx/en_us_goadedes/oc.m5.d7:ocMA.Kathisma22.text	O Savior, let Your servants repose with the righteous, and let them dwell in Your courts, according to the Scriptures. Overlook their voluntary and involuntary offenses, every sin committed knowingly or unknowingly, benevolent Lord.
ltx/en_us_goadedes/oc.m5.d7:ocMA.Kathisma23.greekmelody	@ltx/en_us_goadedes/he.a.m5:heAU.TonSynanarchonLogon.greekname
ltx/en_us_goadedes/oc.m5.d7:ocMA.Kathisma23.incipit	You conceived and you carried…
ltx/en_us_goadedes/oc.m5.d7:ocMA.Kathisma23.melody	@ltx/en_us_goadedes/he.a.m5:heAU.TonSynanarchonLogon.name
ltx/en_us_goadedes/oc.m5.d7:ocMA.Kathisma23.mode	@ltx/en_us_goadedes/miscellanea:misc.Mode5
ltx/en_us_goadedes/oc.m5.d7:ocMA.Kathisma23.text	You conceived and you carried the Savior of the world, * born in two perfect natures in one hypostasis, * O all-holy, ever-virgin Mother of God. * Pray to Him as do the Prophets, the Martyrs, and devout * monastic Saints, and implore Him * for lasting peace in the whole world, * and entreat Him to save our souls.
ltx/en_us_goadedes/oc.m5.d7:ocMA.Lauds1.incipit	@ltx/en_us_goadedes/oc.m5.d3:ocMA.Aposticha3.incipit
ltx/en_us_goadedes/oc.m5.d7:ocMA.Lauds1.melody	
ltx/en_us_goadedes/oc.m5.d7:ocMA.Lauds1.mode	@ltx/en_us_goadedes/miscellanea:misc.Mode5
ltx/en_us_goadedes/oc.m5.d7:ocMA.Lauds1.text	@ltx/en_us_goadedes/oc.m5.d3:ocMA.Aposticha3.text
ltx/en_us_goadedes/oc.m5.d7:ocMA.Lauds2.incipit	@ltx/en_us_goadedes/oc.m5.d4:ocMA.Aposticha3.incipit
ltx/en_us_goadedes/oc.m5.d7:ocMA.Lauds2.melody	
ltx/en_us_goadedes/oc.m5.d7:ocMA.Lauds2.mode	@ltx/en_us_goadedes/miscellanea:misc.Mode5
ltx/en_us_goadedes/oc.m5.d7:ocMA.Lauds2.text	@ltx/en_us_goadedes/oc.m5.d4:ocMA.Aposticha3.text
ltx/en_us_goadedes/oc.m5.d7:ocMA.Lauds3.incipit	@ltx/en_us_goadedes/oc.m5.d5:ocMA.Aposticha3.incipit
ltx/en_us_goadedes/oc.m5.d7:ocMA.Lauds3.melody	
ltx/en_us_goadedes/oc.m5.d7:ocMA.Lauds3.mode	@ltx/en_us_goadedes/miscellanea:misc.Mode5
ltx/en_us_goadedes/oc.m5.d7:ocMA.Lauds3.text	@ltx/en_us_goadedes/oc.m5.d5:ocMA.Aposticha3.text
ltx/en_us_goadedes/oc.m5.d7:ocMA.Lauds4.incipit	…
ltx/en_us_goadedes/oc.m5.d7:ocMA.Lauds4.melody	
ltx/en_us_goadedes/oc.m5.d7:ocMA.Lauds4.mode	@ltx/en_us_goadedes/miscellanea:misc.Mode5
ltx/en_us_goadedes/oc.m5.d7:ocMA.Lauds4.text	
ltx/en_us_goadedes/oc.m5.d7:ocMA.LaudsRubric1.text	@ltx/en_us_goadedes/oc.m1.d7:ocMA.LaudsRubric1.text
ltx/en_us_goadedes/oc.m5.d7:ocMA.LaudsTheotokion.incipit	…
ltx/en_us_goadedes/oc.m5.d7:ocMA.LaudsTheotokion.melody	
ltx/en_us_goadedes/oc.m5.d7:ocMA.LaudsTheotokion.mode	@ltx/en_us_goadedes/miscellanea:misc.Mode5
ltx/en_us_goadedes/oc.m5.d7:ocMA.LaudsTheotokion.text	
ltx/en_us_goadedes/oc.m5.d7:ocMA.MM.Alleluia.text	@ltx/en_us_goadedes/properties:media.key
ltx/en_us_goadedes/oc.m5.d7:ocMA.OdeW1C11.incipit	…
ltx/en_us_goadedes/oc.m5.d7:ocMA.OdeW1C11.melody	@ltx/en_us_goadedes/he.h.m5:heHE.GinEfInOukElampsen.name
ltx/en_us_goadedes/oc.m5.d7:ocMA.OdeW1C11.mode	@ltx/en_us_goadedes/miscellanea:misc.Mode5
ltx/en_us_goadedes/oc.m5.d7:ocMA.OdeW1C11.ode	@ltx/en_us_goadedes/miscellanea:misc.Ode1
ltx/en_us_goadedes/oc.m5.d7:ocMA.OdeW1C11.text	
ltx/en_us_goadedes/oc.m5.d7:ocMA.OdeW1C12.incipit	…
ltx/en_us_goadedes/oc.m5.d7:ocMA.OdeW1C12.melody	@ltx/en_us_goadedes/he.h.m5:heHE.GinEfInOukElampsen.name
ltx/en_us_goadedes/oc.m5.d7:ocMA.OdeW1C12.mode	@ltx/en_us_goadedes/miscellanea:misc.Mode5
ltx/en_us_goadedes/oc.m5.d7:ocMA.OdeW1C12.ode	@ltx/en_us_goadedes/miscellanea:misc.Ode1
ltx/en_us_goadedes/oc.m5.d7:ocMA.OdeW1C12.text	
ltx/en_us_goadedes/oc.m5.d7:ocMA.OdeW1C13.incipit	…
ltx/en_us_goadedes/oc.m5.d7:ocMA.OdeW1C13.melody	@ltx/en_us_goadedes/he.h.m5:heHE.GinEfInOukElampsen.name
ltx/en_us_goadedes/oc.m5.d7:ocMA.OdeW1C13.mode	@ltx/en_us_goadedes/miscellanea:misc.Mode5
ltx/en_us_goadedes/oc.m5.d7:ocMA.OdeW1C13.ode	@ltx/en_us_goadedes/miscellanea:misc.Ode1
ltx/en_us_goadedes/oc.m5.d7:ocMA.OdeW1C13.text	
ltx/en_us_goadedes/oc.m5.d7:ocMA.OdeW1C14.incipit	…
ltx/en_us_goadedes/oc.m5.d7:ocMA.OdeW1C14.melody	@ltx/en_us_goadedes/he.h.m5:heHE.GinEfInOukElampsen.name
ltx/en_us_goadedes/oc.m5.d7:ocMA.OdeW1C14.mode	@ltx/en_us_goadedes/miscellanea:misc.Mode5
ltx/en_us_goadedes/oc.m5.d7:ocMA.OdeW1C14.ode	@ltx/en_us_goadedes/miscellanea:misc.Ode1
ltx/en_us_goadedes/oc.m5.d7:ocMA.OdeW1C14.text	
ltx/en_us_goadedes/oc.m5.d7:ocMA.OdeW1C1H.greekmelody	@ltx/en_us_goadedes/he.h.m5:heHE.GinEfInOukElampsen.greekname
ltx/en_us_goadedes/oc.m5.d7:ocMA.OdeW1C1H.incipit	@ltx/en_us_goadedes/he.h.m5:heHE.GinEfInOukElampsen.incipit
ltx/en_us_goadedes/oc.m5.d7:ocMA.OdeW1C1H.melody	@ltx/en_us_goadedes/he.h.m5:heHE.GinEfInOukElampsen.melody
ltx/en_us_goadedes/oc.m5.d7:ocMA.OdeW1C1H.mode	@ltx/en_us_goadedes/miscellanea:misc.Mode5
ltx/en_us_goadedes/oc.m5.d7:ocMA.OdeW1C1H.ode	@ltx/en_us_goadedes/miscellanea:misc.Ode1
ltx/en_us_goadedes/oc.m5.d7:ocMA.OdeW1C1H.text	@ltx/en_us_goadedes/he.h.m5:heHE.GinEfInOukElampsen.text
ltx/en_us_goadedes/oc.m5.d7:ocMA.OdeW1C1T.incipit	…
ltx/en_us_goadedes/oc.m5.d7:ocMA.OdeW1C1T.melody	@ltx/en_us_goadedes/he.h.m5:heHE.GinEfInOukElampsen.name
ltx/en_us_goadedes/oc.m5.d7:ocMA.OdeW1C1T.mode	@ltx/en_us_goadedes/miscellanea:misc.Mode5
ltx/en_us_goadedes/oc.m5.d7:ocMA.OdeW1C1T.ode	@ltx/en_us_goadedes/miscellanea:misc.Ode1
ltx/en_us_goadedes/oc.m5.d7:ocMA.OdeW1C1T.text	
ltx/en_us_goadedes/oc.m5.d7:ocMA.OdeW1C21.greekmelody	@ltx/en_us_goadedes/he.h.m5:heHE.ToSotiriTheo.greekname
ltx/en_us_goadedes/oc.m5.d7:ocMA.OdeW1C21.incipit	…
ltx/en_us_goadedes/oc.m5.d7:ocMA.OdeW1C21.melody	@ltx/en_us_goadedes/he.h.m5:heHE.ToSotiriTheo.name
ltx/en_us_goadedes/oc.m5.d7:ocMA.OdeW1C21.mode	@ltx/en_us_goadedes/miscellanea:misc.Mode5
ltx/en_us_goadedes/oc.m5.d7:ocMA.OdeW1C21.ode	@ltx/en_us_goadedes/miscellanea:misc.Ode1
ltx/en_us_goadedes/oc.m5.d7:ocMA.OdeW1C21.text	
ltx/en_us_goadedes/oc.m5.d7:ocMA.OdeW1C22.incipit	…
ltx/en_us_goadedes/oc.m5.d7:ocMA.OdeW1C22.melody	@ltx/en_us_goadedes/he.h.m5:heHE.ToSotiriTheo.name
ltx/en_us_goadedes/oc.m5.d7:ocMA.OdeW1C22.mode	@ltx/en_us_goadedes/miscellanea:misc.Mode5
ltx/en_us_goadedes/oc.m5.d7:ocMA.OdeW1C22.ode	@ltx/en_us_goadedes/miscellanea:misc.Ode1
ltx/en_us_goadedes/oc.m5.d7:ocMA.OdeW1C22.text	
ltx/en_us_goadedes/oc.m5.d7:ocMA.OdeW1C23.incipit	…
ltx/en_us_goadedes/oc.m5.d7:ocMA.OdeW1C23.melody	@ltx/en_us_goadedes/he.h.m5:heHE.ToSotiriTheo.name
ltx/en_us_goadedes/oc.m5.d7:ocMA.OdeW1C23.mode	@ltx/en_us_goadedes/miscellanea:misc.Mode5
ltx/en_us_goadedes/oc.m5.d7:ocMA.OdeW1C23.ode	@ltx/en_us_goadedes/miscellanea:misc.Ode1
ltx/en_us_goadedes/oc.m5.d7:ocMA.OdeW1C23.text	
ltx/en_us_goadedes/oc.m5.d7:ocMA.OdeW1C2T.incipit	…
ltx/en_us_goadedes/oc.m5.d7:ocMA.OdeW1C2T.melody	@ltx/en_us_goadedes/he.h.m5:heHE.ToSotiriTheo.name
ltx/en_us_goadedes/oc.m5.d7:ocMA.OdeW1C2T.mode	@ltx/en_us_goadedes/miscellanea:misc.Mode5
ltx/en_us_goadedes/oc.m5.d7:ocMA.OdeW1C2T.ode	@ltx/en_us_goadedes/miscellanea:misc.Ode1
ltx/en_us_goadedes/oc.m5.d7:ocMA.OdeW1C2T.text	
ltx/en_us_goadedes/oc.m5.d7:ocMA.OdeW3C11.incipit	…
ltx/en_us_goadedes/oc.m5.d7:ocMA.OdeW3C11.melody	@ltx/en_us_goadedes/he.h.m5:heHE.SalevomeninTinKardian.name
ltx/en_us_goadedes/oc.m5.d7:ocMA.OdeW3C11.mode	@ltx/en_us_goadedes/miscellanea:misc.Mode5
ltx/en_us_goadedes/oc.m5.d7:ocMA.OdeW3C11.ode	@ltx/en_us_goadedes/miscellanea:misc.Ode3
ltx/en_us_goadedes/oc.m5.d7:ocMA.OdeW3C11.text	
ltx/en_us_goadedes/oc.m5.d7:ocMA.OdeW3C12.incipit	…
ltx/en_us_goadedes/oc.m5.d7:ocMA.OdeW3C12.melody	@ltx/en_us_goadedes/he.h.m5:heHE.SalevomeninTinKardian.name
ltx/en_us_goadedes/oc.m5.d7:ocMA.OdeW3C12.mode	@ltx/en_us_goadedes/miscellanea:misc.Mode5
ltx/en_us_goadedes/oc.m5.d7:ocMA.OdeW3C12.ode	@ltx/en_us_goadedes/miscellanea:misc.Ode3
ltx/en_us_goadedes/oc.m5.d7:ocMA.OdeW3C12.text	
ltx/en_us_goadedes/oc.m5.d7:ocMA.OdeW3C13.incipit	…
ltx/en_us_goadedes/oc.m5.d7:ocMA.OdeW3C13.melody	@ltx/en_us_goadedes/he.h.m5:heHE.SalevomeninTinKardian.name
ltx/en_us_goadedes/oc.m5.d7:ocMA.OdeW3C13.mode	@ltx/en_us_goadedes/miscellanea:misc.Mode5
ltx/en_us_goadedes/oc.m5.d7:ocMA.OdeW3C13.ode	@ltx/en_us_goadedes/miscellanea:misc.Ode3
ltx/en_us_goadedes/oc.m5.d7:ocMA.OdeW3C13.text	
ltx/en_us_goadedes/oc.m5.d7:ocMA.OdeW3C14.incipit	…
ltx/en_us_goadedes/oc.m5.d7:ocMA.OdeW3C14.melody	@ltx/en_us_goadedes/he.h.m5:heHE.SalevomeninTinKardian.name
ltx/en_us_goadedes/oc.m5.d7:ocMA.OdeW3C14.mode	@ltx/en_us_goadedes/miscellanea:misc.Mode5
ltx/en_us_goadedes/oc.m5.d7:ocMA.OdeW3C14.ode	@ltx/en_us_goadedes/miscellanea:misc.Ode3
ltx/en_us_goadedes/oc.m5.d7:ocMA.OdeW3C14.text	
ltx/en_us_goadedes/oc.m5.d7:ocMA.OdeW3C1H.greekmelody	@ltx/en_us_goadedes/he.h.m5:heHE.SalevomeninTinKardian.greekname
ltx/en_us_goadedes/oc.m5.d7:ocMA.OdeW3C1H.incipit	@ltx/en_us_goadedes/he.h.m5:heHE.SalevomeninTinKardian.incipit
ltx/en_us_goadedes/oc.m5.d7:ocMA.OdeW3C1H.melody	@ltx/en_us_goadedes/he.h.m5:heHE.SalevomeninTinKardian.melody
ltx/en_us_goadedes/oc.m5.d7:ocMA.OdeW3C1H.mode	@ltx/en_us_goadedes/miscellanea:misc.Mode5
ltx/en_us_goadedes/oc.m5.d7:ocMA.OdeW3C1H.ode	@ltx/en_us_goadedes/miscellanea:misc.Ode3
ltx/en_us_goadedes/oc.m5.d7:ocMA.OdeW3C1H.text	@ltx/en_us_goadedes/he.h.m5:heHE.SalevomeninTinKardian.text
ltx/en_us_goadedes/oc.m5.d7:ocMA.OdeW3C1T.incipit	…
ltx/en_us_goadedes/oc.m5.d7:ocMA.OdeW3C1T.melody	@ltx/en_us_goadedes/he.h.m5:heHE.SalevomeninTinKardian.name
ltx/en_us_goadedes/oc.m5.d7:ocMA.OdeW3C1T.mode	@ltx/en_us_goadedes/miscellanea:misc.Mode5
ltx/en_us_goadedes/oc.m5.d7:ocMA.OdeW3C1T.ode	@ltx/en_us_goadedes/miscellanea:misc.Ode3
ltx/en_us_goadedes/oc.m5.d7:ocMA.OdeW3C1T.text	
ltx/en_us_goadedes/oc.m5.d7:ocMA.OdeW3C21.greekmelody	@ltx/en_us_goadedes/he.h.m5:heHE.StereosonImasOTheos.greekname
ltx/en_us_goadedes/oc.m5.d7:ocMA.OdeW3C21.incipit	…
ltx/en_us_goadedes/oc.m5.d7:ocMA.OdeW3C21.melody	@ltx/en_us_goadedes/he.h.m5:heHE.StereosonImasOTheos.name
ltx/en_us_goadedes/oc.m5.d7:ocMA.OdeW3C21.mode	@ltx/en_us_goadedes/miscellanea:misc.Mode5
ltx/en_us_goadedes/oc.m5.d7:ocMA.OdeW3C21.ode	@ltx/en_us_goadedes/miscellanea:misc.Ode3
ltx/en_us_goadedes/oc.m5.d7:ocMA.OdeW3C21.text	
ltx/en_us_goadedes/oc.m5.d7:ocMA.OdeW3C22.incipit	…
ltx/en_us_goadedes/oc.m5.d7:ocMA.OdeW3C22.melody	@ltx/en_us_goadedes/he.h.m5:heHE.StereosonImasOTheos.name
ltx/en_us_goadedes/oc.m5.d7:ocMA.OdeW3C22.mode	@ltx/en_us_goadedes/miscellanea:misc.Mode5
ltx/en_us_goadedes/oc.m5.d7:ocMA.OdeW3C22.ode	@ltx/en_us_goadedes/miscellanea:misc.Ode3
ltx/en_us_goadedes/oc.m5.d7:ocMA.OdeW3C22.text	
ltx/en_us_goadedes/oc.m5.d7:ocMA.OdeW3C23.incipit	…
ltx/en_us_goadedes/oc.m5.d7:ocMA.OdeW3C23.melody	@ltx/en_us_goadedes/he.h.m5:heHE.StereosonImasOTheos.name
ltx/en_us_goadedes/oc.m5.d7:ocMA.OdeW3C23.mode	@ltx/en_us_goadedes/miscellanea:misc.Mode5
ltx/en_us_goadedes/oc.m5.d7:ocMA.OdeW3C23.ode	@ltx/en_us_goadedes/miscellanea:misc.Ode3
ltx/en_us_goadedes/oc.m5.d7:ocMA.OdeW3C23.text	
ltx/en_us_goadedes/oc.m5.d7:ocMA.OdeW3C2T.incipit	…
ltx/en_us_goadedes/oc.m5.d7:ocMA.OdeW3C2T.melody	@ltx/en_us_goadedes/he.h.m5:heHE.StereosonImasOTheos.name
ltx/en_us_goadedes/oc.m5.d7:ocMA.OdeW3C2T.mode	@ltx/en_us_goadedes/miscellanea:misc.Mode5
ltx/en_us_goadedes/oc.m5.d7:ocMA.OdeW3C2T.ode	@ltx/en_us_goadedes/miscellanea:misc.Ode3
ltx/en_us_goadedes/oc.m5.d7:ocMA.OdeW3C2T.text	
ltx/en_us_goadedes/oc.m5.d7:ocMA.OdeW4C11.incipit	…
ltx/en_us_goadedes/oc.m5.d7:ocMA.OdeW4C11.melody	@ltx/en_us_goadedes/he.h.m5:heHE.AkikoaKyrieTinAkoin.name
ltx/en_us_goadedes/oc.m5.d7:ocMA.OdeW4C11.mode	@ltx/en_us_goadedes/miscellanea:misc.Mode5
ltx/en_us_goadedes/oc.m5.d7:ocMA.OdeW4C11.ode	@ltx/en_us_goadedes/miscellanea:misc.Ode4
ltx/en_us_goadedes/oc.m5.d7:ocMA.OdeW4C11.text	
ltx/en_us_goadedes/oc.m5.d7:ocMA.OdeW4C12.incipit	…
ltx/en_us_goadedes/oc.m5.d7:ocMA.OdeW4C12.melody	@ltx/en_us_goadedes/he.h.m5:heHE.AkikoaKyrieTinAkoin.name
ltx/en_us_goadedes/oc.m5.d7:ocMA.OdeW4C12.mode	@ltx/en_us_goadedes/miscellanea:misc.Mode5
ltx/en_us_goadedes/oc.m5.d7:ocMA.OdeW4C12.ode	@ltx/en_us_goadedes/miscellanea:misc.Ode4
ltx/en_us_goadedes/oc.m5.d7:ocMA.OdeW4C12.text	
ltx/en_us_goadedes/oc.m5.d7:ocMA.OdeW4C13.incipit	…
ltx/en_us_goadedes/oc.m5.d7:ocMA.OdeW4C13.melody	@ltx/en_us_goadedes/he.h.m5:heHE.AkikoaKyrieTinAkoin.name
ltx/en_us_goadedes/oc.m5.d7:ocMA.OdeW4C13.mode	@ltx/en_us_goadedes/miscellanea:misc.Mode5
ltx/en_us_goadedes/oc.m5.d7:ocMA.OdeW4C13.ode	@ltx/en_us_goadedes/miscellanea:misc.Ode4
ltx/en_us_goadedes/oc.m5.d7:ocMA.OdeW4C13.text	
ltx/en_us_goadedes/oc.m5.d7:ocMA.OdeW4C14.incipit	…
ltx/en_us_goadedes/oc.m5.d7:ocMA.OdeW4C14.melody	@ltx/en_us_goadedes/he.h.m5:heHE.AkikoaKyrieTinAkoin.name
ltx/en_us_goadedes/oc.m5.d7:ocMA.OdeW4C14.mode	@ltx/en_us_goadedes/miscellanea:misc.Mode5
ltx/en_us_goadedes/oc.m5.d7:ocMA.OdeW4C14.ode	@ltx/en_us_goadedes/miscellanea:misc.Ode4
ltx/en_us_goadedes/oc.m5.d7:ocMA.OdeW4C14.text	
ltx/en_us_goadedes/oc.m5.d7:ocMA.OdeW4C1H.greekmelody	@ltx/en_us_goadedes/he.h.m5:heHE.AkikoaKyrieTinAkoin.greekname
ltx/en_us_goadedes/oc.m5.d7:ocMA.OdeW4C1H.incipit	@ltx/en_us_goadedes/he.h.m5:heHE.AkikoaKyrieTinAkoin.incipit
ltx/en_us_goadedes/oc.m5.d7:ocMA.OdeW4C1H.melody	@ltx/en_us_goadedes/he.h.m5:heHE.AkikoaKyrieTinAkoin.melody
ltx/en_us_goadedes/oc.m5.d7:ocMA.OdeW4C1H.mode	@ltx/en_us_goadedes/miscellanea:misc.Mode5
ltx/en_us_goadedes/oc.m5.d7:ocMA.OdeW4C1H.ode	@ltx/en_us_goadedes/miscellanea:misc.Ode4
ltx/en_us_goadedes/oc.m5.d7:ocMA.OdeW4C1H.text	@ltx/en_us_goadedes/he.h.m5:heHE.AkikoaKyrieTinAkoin.text
ltx/en_us_goadedes/oc.m5.d7:ocMA.OdeW4C1T.incipit	…
ltx/en_us_goadedes/oc.m5.d7:ocMA.OdeW4C1T.melody	@ltx/en_us_goadedes/he.h.m5:heHE.AkikoaKyrieTinAkoin.name
ltx/en_us_goadedes/oc.m5.d7:ocMA.OdeW4C1T.mode	@ltx/en_us_goadedes/miscellanea:misc.Mode5
ltx/en_us_goadedes/oc.m5.d7:ocMA.OdeW4C1T.ode	@ltx/en_us_goadedes/miscellanea:misc.Ode4
ltx/en_us_goadedes/oc.m5.d7:ocMA.OdeW4C1T.text	
ltx/en_us_goadedes/oc.m5.d7:ocMA.OdeW4C21.greekmelody	@ltx/en_us_goadedes/he.h.m5:heHE.AkikoaKyrieTinAkoin.greekname
ltx/en_us_goadedes/oc.m5.d7:ocMA.OdeW4C21.incipit	…
ltx/en_us_goadedes/oc.m5.d7:ocMA.OdeW4C21.melody	@ltx/en_us_goadedes/he.h.m5:heHE.AkikoaKyrieTinAkoin.name
ltx/en_us_goadedes/oc.m5.d7:ocMA.OdeW4C21.mode	@ltx/en_us_goadedes/miscellanea:misc.Mode5
ltx/en_us_goadedes/oc.m5.d7:ocMA.OdeW4C21.ode	@ltx/en_us_goadedes/miscellanea:misc.Ode4
ltx/en_us_goadedes/oc.m5.d7:ocMA.OdeW4C21.text	
ltx/en_us_goadedes/oc.m5.d7:ocMA.OdeW4C22.incipit	…
ltx/en_us_goadedes/oc.m5.d7:ocMA.OdeW4C22.melody	@ltx/en_us_goadedes/he.h.m5:heHE.AkikoaKyrieTinAkoin.name
ltx/en_us_goadedes/oc.m5.d7:ocMA.OdeW4C22.mode	@ltx/en_us_goadedes/miscellanea:misc.Mode5
ltx/en_us_goadedes/oc.m5.d7:ocMA.OdeW4C22.ode	@ltx/en_us_goadedes/miscellanea:misc.Ode4
ltx/en_us_goadedes/oc.m5.d7:ocMA.OdeW4C22.text	
ltx/en_us_goadedes/oc.m5.d7:ocMA.OdeW4C23.incipit	…
ltx/en_us_goadedes/oc.m5.d7:ocMA.OdeW4C23.melody	@ltx/en_us_goadedes/he.h.m5:heHE.AkikoaKyrieTinAkoin.name
ltx/en_us_goadedes/oc.m5.d7:ocMA.OdeW4C23.mode	@ltx/en_us_goadedes/miscellanea:misc.Mode5
ltx/en_us_goadedes/oc.m5.d7:ocMA.OdeW4C23.ode	@ltx/en_us_goadedes/miscellanea:misc.Ode4
ltx/en_us_goadedes/oc.m5.d7:ocMA.OdeW4C23.text	
ltx/en_us_goadedes/oc.m5.d7:ocMA.OdeW4C2T.incipit	…
ltx/en_us_goadedes/oc.m5.d7:ocMA.OdeW4C2T.melody	@ltx/en_us_goadedes/he.h.m5:heHE.AkikoaKyrieTinAkoin.name
ltx/en_us_goadedes/oc.m5.d7:ocMA.OdeW4C2T.mode	@ltx/en_us_goadedes/miscellanea:misc.Mode5
ltx/en_us_goadedes/oc.m5.d7:ocMA.OdeW4C2T.ode	@ltx/en_us_goadedes/miscellanea:misc.Ode4
ltx/en_us_goadedes/oc.m5.d7:ocMA.OdeW4C2T.text	
ltx/en_us_goadedes/oc.m5.d7:ocMA.OdeW5C11.incipit	…
ltx/en_us_goadedes/oc.m5.d7:ocMA.OdeW5C11.melody	@ltx/en_us_goadedes/he.h.m5:heHE.TinTalainanPsychinMou.name
ltx/en_us_goadedes/oc.m5.d7:ocMA.OdeW5C11.mode	@ltx/en_us_goadedes/miscellanea:misc.Mode5
ltx/en_us_goadedes/oc.m5.d7:ocMA.OdeW5C11.ode	@ltx/en_us_goadedes/miscellanea:misc.Ode5
ltx/en_us_goadedes/oc.m5.d7:ocMA.OdeW5C11.text	
ltx/en_us_goadedes/oc.m5.d7:ocMA.OdeW5C12.incipit	…
ltx/en_us_goadedes/oc.m5.d7:ocMA.OdeW5C12.melody	@ltx/en_us_goadedes/he.h.m5:heHE.TinTalainanPsychinMou.name
ltx/en_us_goadedes/oc.m5.d7:ocMA.OdeW5C12.mode	@ltx/en_us_goadedes/miscellanea:misc.Mode5
ltx/en_us_goadedes/oc.m5.d7:ocMA.OdeW5C12.ode	@ltx/en_us_goadedes/miscellanea:misc.Ode5
ltx/en_us_goadedes/oc.m5.d7:ocMA.OdeW5C12.text	
ltx/en_us_goadedes/oc.m5.d7:ocMA.OdeW5C13.incipit	…
ltx/en_us_goadedes/oc.m5.d7:ocMA.OdeW5C13.melody	@ltx/en_us_goadedes/he.h.m5:heHE.TinTalainanPsychinMou.name
ltx/en_us_goadedes/oc.m5.d7:ocMA.OdeW5C13.mode	@ltx/en_us_goadedes/miscellanea:misc.Mode5
ltx/en_us_goadedes/oc.m5.d7:ocMA.OdeW5C13.ode	@ltx/en_us_goadedes/miscellanea:misc.Ode5
ltx/en_us_goadedes/oc.m5.d7:ocMA.OdeW5C13.text	
ltx/en_us_goadedes/oc.m5.d7:ocMA.OdeW5C14.incipit	…
ltx/en_us_goadedes/oc.m5.d7:ocMA.OdeW5C14.melody	@ltx/en_us_goadedes/he.h.m5:heHE.TinTalainanPsychinMou.name
ltx/en_us_goadedes/oc.m5.d7:ocMA.OdeW5C14.mode	@ltx/en_us_goadedes/miscellanea:misc.Mode5
ltx/en_us_goadedes/oc.m5.d7:ocMA.OdeW5C14.ode	@ltx/en_us_goadedes/miscellanea:misc.Ode5
ltx/en_us_goadedes/oc.m5.d7:ocMA.OdeW5C14.text	
ltx/en_us_goadedes/oc.m5.d7:ocMA.OdeW5C1H.greekmelody	@ltx/en_us_goadedes/he.h.m5:heHE.TinTalainanPsychinMou.greekname
ltx/en_us_goadedes/oc.m5.d7:ocMA.OdeW5C1H.incipit	@ltx/en_us_goadedes/he.h.m5:heHE.TinTalainanPsychinMou.incipit
ltx/en_us_goadedes/oc.m5.d7:ocMA.OdeW5C1H.melody	@ltx/en_us_goadedes/he.h.m5:heHE.TinTalainanPsychinMou.melody
ltx/en_us_goadedes/oc.m5.d7:ocMA.OdeW5C1H.mode	@ltx/en_us_goadedes/miscellanea:misc.Mode5
ltx/en_us_goadedes/oc.m5.d7:ocMA.OdeW5C1H.ode	@ltx/en_us_goadedes/miscellanea:misc.Ode5
ltx/en_us_goadedes/oc.m5.d7:ocMA.OdeW5C1H.text	@ltx/en_us_goadedes/he.h.m5:heHE.TinTalainanPsychinMou.text
ltx/en_us_goadedes/oc.m5.d7:ocMA.OdeW5C1T.incipit	…
ltx/en_us_goadedes/oc.m5.d7:ocMA.OdeW5C1T.melody	@ltx/en_us_goadedes/he.h.m5:heHE.TinTalainanPsychinMou.name
ltx/en_us_goadedes/oc.m5.d7:ocMA.OdeW5C1T.mode	@ltx/en_us_goadedes/miscellanea:misc.Mode5
ltx/en_us_goadedes/oc.m5.d7:ocMA.OdeW5C1T.ode	@ltx/en_us_goadedes/miscellanea:misc.Ode5
ltx/en_us_goadedes/oc.m5.d7:ocMA.OdeW5C1T.text	
ltx/en_us_goadedes/oc.m5.d7:ocMA.OdeW5C21.greekmelody	@ltx/en_us_goadedes/he.h.m5:heHE.OrthrizontesVoomenSoi.greekname
ltx/en_us_goadedes/oc.m5.d7:ocMA.OdeW5C21.incipit	…
ltx/en_us_goadedes/oc.m5.d7:ocMA.OdeW5C21.melody	@ltx/en_us_goadedes/he.h.m5:heHE.OrthrizontesVoomenSoi.name
ltx/en_us_goadedes/oc.m5.d7:ocMA.OdeW5C21.mode	@ltx/en_us_goadedes/miscellanea:misc.Mode5
ltx/en_us_goadedes/oc.m5.d7:ocMA.OdeW5C21.ode	@ltx/en_us_goadedes/miscellanea:misc.Ode5
ltx/en_us_goadedes/oc.m5.d7:ocMA.OdeW5C21.text	
ltx/en_us_goadedes/oc.m5.d7:ocMA.OdeW5C22.incipit	…
ltx/en_us_goadedes/oc.m5.d7:ocMA.OdeW5C22.melody	@ltx/en_us_goadedes/he.h.m5:heHE.OrthrizontesVoomenSoi.name
ltx/en_us_goadedes/oc.m5.d7:ocMA.OdeW5C22.mode	@ltx/en_us_goadedes/miscellanea:misc.Mode5
ltx/en_us_goadedes/oc.m5.d7:ocMA.OdeW5C22.ode	@ltx/en_us_goadedes/miscellanea:misc.Ode5
ltx/en_us_goadedes/oc.m5.d7:ocMA.OdeW5C22.text	
ltx/en_us_goadedes/oc.m5.d7:ocMA.OdeW5C23.incipit	…
ltx/en_us_goadedes/oc.m5.d7:ocMA.OdeW5C23.melody	@ltx/en_us_goadedes/he.h.m5:heHE.OrthrizontesVoomenSoi.name
ltx/en_us_goadedes/oc.m5.d7:ocMA.OdeW5C23.mode	@ltx/en_us_goadedes/miscellanea:misc.Mode5
ltx/en_us_goadedes/oc.m5.d7:ocMA.OdeW5C23.ode	@ltx/en_us_goadedes/miscellanea:misc.Ode5
ltx/en_us_goadedes/oc.m5.d7:ocMA.OdeW5C23.text	
ltx/en_us_goadedes/oc.m5.d7:ocMA.OdeW5C2T.incipit	…
ltx/en_us_goadedes/oc.m5.d7:ocMA.OdeW5C2T.melody	@ltx/en_us_goadedes/he.h.m5:heHE.OrthrizontesVoomenSoi.name
ltx/en_us_goadedes/oc.m5.d7:ocMA.OdeW5C2T.mode	@ltx/en_us_goadedes/miscellanea:misc.Mode5
ltx/en_us_goadedes/oc.m5.d7:ocMA.OdeW5C2T.ode	@ltx/en_us_goadedes/miscellanea:misc.Ode5
ltx/en_us_goadedes/oc.m5.d7:ocMA.OdeW5C2T.text	
ltx/en_us_goadedes/oc.m5.d7:ocMA.OdeW6C11.incipit	…
ltx/en_us_goadedes/oc.m5.d7:ocMA.OdeW6C11.melody	@ltx/en_us_goadedes/he.h.m5:heHE.OsTonProfitinTouThiros.name
ltx/en_us_goadedes/oc.m5.d7:ocMA.OdeW6C11.mode	@ltx/en_us_goadedes/miscellanea:misc.Mode5
ltx/en_us_goadedes/oc.m5.d7:ocMA.OdeW6C11.ode	@ltx/en_us_goadedes/miscellanea:misc.Ode6
ltx/en_us_goadedes/oc.m5.d7:ocMA.OdeW6C11.text	
ltx/en_us_goadedes/oc.m5.d7:ocMA.OdeW6C12.incipit	…
ltx/en_us_goadedes/oc.m5.d7:ocMA.OdeW6C12.melody	@ltx/en_us_goadedes/he.h.m5:heHE.OsTonProfitinTouThiros.name
ltx/en_us_goadedes/oc.m5.d7:ocMA.OdeW6C12.mode	@ltx/en_us_goadedes/miscellanea:misc.Mode5
ltx/en_us_goadedes/oc.m5.d7:ocMA.OdeW6C12.ode	@ltx/en_us_goadedes/miscellanea:misc.Ode6
ltx/en_us_goadedes/oc.m5.d7:ocMA.OdeW6C12.text	
ltx/en_us_goadedes/oc.m5.d7:ocMA.OdeW6C13.incipit	…
ltx/en_us_goadedes/oc.m5.d7:ocMA.OdeW6C13.melody	@ltx/en_us_goadedes/he.h.m5:heHE.OsTonProfitinTouThiros.name
ltx/en_us_goadedes/oc.m5.d7:ocMA.OdeW6C13.mode	@ltx/en_us_goadedes/miscellanea:misc.Mode5
ltx/en_us_goadedes/oc.m5.d7:ocMA.OdeW6C13.ode	@ltx/en_us_goadedes/miscellanea:misc.Ode6
ltx/en_us_goadedes/oc.m5.d7:ocMA.OdeW6C13.text	
ltx/en_us_goadedes/oc.m5.d7:ocMA.OdeW6C14.incipit	…
ltx/en_us_goadedes/oc.m5.d7:ocMA.OdeW6C14.melody	@ltx/en_us_goadedes/he.h.m5:heHE.OsTonProfitinTouThiros.name
ltx/en_us_goadedes/oc.m5.d7:ocMA.OdeW6C14.mode	@ltx/en_us_goadedes/miscellanea:misc.Mode5
ltx/en_us_goadedes/oc.m5.d7:ocMA.OdeW6C14.ode	@ltx/en_us_goadedes/miscellanea:misc.Ode6
ltx/en_us_goadedes/oc.m5.d7:ocMA.OdeW6C14.text	
ltx/en_us_goadedes/oc.m5.d7:ocMA.OdeW6C1H.greekmelody	@ltx/en_us_goadedes/he.h.m5:heHE.OsTonProfitinTouThiros.greekname
ltx/en_us_goadedes/oc.m5.d7:ocMA.OdeW6C1H.incipit	@ltx/en_us_goadedes/he.h.m5:heHE.OsTonProfitinTouThiros.incipit
ltx/en_us_goadedes/oc.m5.d7:ocMA.OdeW6C1H.melody	@ltx/en_us_goadedes/he.h.m5:heHE.OsTonProfitinTouThiros.melody
ltx/en_us_goadedes/oc.m5.d7:ocMA.OdeW6C1H.mode	@ltx/en_us_goadedes/miscellanea:misc.Mode5
ltx/en_us_goadedes/oc.m5.d7:ocMA.OdeW6C1H.ode	@ltx/en_us_goadedes/miscellanea:misc.Ode6
ltx/en_us_goadedes/oc.m5.d7:ocMA.OdeW6C1H.text	@ltx/en_us_goadedes/he.h.m5:heHE.OsTonProfitinTouThiros.text
ltx/en_us_goadedes/oc.m5.d7:ocMA.OdeW6C1T.incipit	…
ltx/en_us_goadedes/oc.m5.d7:ocMA.OdeW6C1T.melody	@ltx/en_us_goadedes/he.h.m5:heHE.OsTonProfitinTouThiros.name
ltx/en_us_goadedes/oc.m5.d7:ocMA.OdeW6C1T.mode	@ltx/en_us_goadedes/miscellanea:misc.Mode5
ltx/en_us_goadedes/oc.m5.d7:ocMA.OdeW6C1T.ode	@ltx/en_us_goadedes/miscellanea:misc.Ode6
ltx/en_us_goadedes/oc.m5.d7:ocMA.OdeW6C1T.text	
ltx/en_us_goadedes/oc.m5.d7:ocMA.OdeW6C21.greekmelody	@ltx/en_us_goadedes/he.h.m5:heHE.EkykloseMeAvyssos.greekname
ltx/en_us_goadedes/oc.m5.d7:ocMA.OdeW6C21.incipit	…
ltx/en_us_goadedes/oc.m5.d7:ocMA.OdeW6C21.melody	@ltx/en_us_goadedes/he.h.m5:heHE.EkykloseMeAvyssos.name
ltx/en_us_goadedes/oc.m5.d7:ocMA.OdeW6C21.mode	@ltx/en_us_goadedes/miscellanea:misc.Mode5
ltx/en_us_goadedes/oc.m5.d7:ocMA.OdeW6C21.ode	@ltx/en_us_goadedes/miscellanea:misc.Ode6
ltx/en_us_goadedes/oc.m5.d7:ocMA.OdeW6C21.text	
ltx/en_us_goadedes/oc.m5.d7:ocMA.OdeW6C22.incipit	…
ltx/en_us_goadedes/oc.m5.d7:ocMA.OdeW6C22.melody	@ltx/en_us_goadedes/he.h.m5:heHE.EkykloseMeAvyssos.name
ltx/en_us_goadedes/oc.m5.d7:ocMA.OdeW6C22.mode	@ltx/en_us_goadedes/miscellanea:misc.Mode5
ltx/en_us_goadedes/oc.m5.d7:ocMA.OdeW6C22.ode	@ltx/en_us_goadedes/miscellanea:misc.Ode6
ltx/en_us_goadedes/oc.m5.d7:ocMA.OdeW6C22.text	
ltx/en_us_goadedes/oc.m5.d7:ocMA.OdeW6C23.incipit	…
ltx/en_us_goadedes/oc.m5.d7:ocMA.OdeW6C23.melody	@ltx/en_us_goadedes/he.h.m5:heHE.EkykloseMeAvyssos.name
ltx/en_us_goadedes/oc.m5.d7:ocMA.OdeW6C23.mode	@ltx/en_us_goadedes/miscellanea:misc.Mode5
ltx/en_us_goadedes/oc.m5.d7:ocMA.OdeW6C23.ode	@ltx/en_us_goadedes/miscellanea:misc.Ode6
ltx/en_us_goadedes/oc.m5.d7:ocMA.OdeW6C23.text	
ltx/en_us_goadedes/oc.m5.d7:ocMA.OdeW6C2T.incipit	…
ltx/en_us_goadedes/oc.m5.d7:ocMA.OdeW6C2T.melody	@ltx/en_us_goadedes/he.h.m5:heHE.EkykloseMeAvyssos.name
ltx/en_us_goadedes/oc.m5.d7:ocMA.OdeW6C2T.mode	@ltx/en_us_goadedes/miscellanea:misc.Mode5
ltx/en_us_goadedes/oc.m5.d7:ocMA.OdeW6C2T.ode	@ltx/en_us_goadedes/miscellanea:misc.Ode6
ltx/en_us_goadedes/oc.m5.d7:ocMA.OdeW6C2T.text	
ltx/en_us_goadedes/oc.m5.d7:ocMA.OdeW7C11.incipit	…
ltx/en_us_goadedes/oc.m5.d7:ocMA.OdeW7C11.melody	@ltx/en_us_goadedes/he.h.m5:heHE.PyrosSvestirion.name
ltx/en_us_goadedes/oc.m5.d7:ocMA.OdeW7C11.mode	@ltx/en_us_goadedes/miscellanea:misc.Mode5
ltx/en_us_goadedes/oc.m5.d7:ocMA.OdeW7C11.ode	@ltx/en_us_goadedes/miscellanea:misc.Ode7
ltx/en_us_goadedes/oc.m5.d7:ocMA.OdeW7C11.text	
ltx/en_us_goadedes/oc.m5.d7:ocMA.OdeW7C12.incipit	…
ltx/en_us_goadedes/oc.m5.d7:ocMA.OdeW7C12.melody	@ltx/en_us_goadedes/he.h.m5:heHE.PyrosSvestirion.name
ltx/en_us_goadedes/oc.m5.d7:ocMA.OdeW7C12.mode	@ltx/en_us_goadedes/miscellanea:misc.Mode5
ltx/en_us_goadedes/oc.m5.d7:ocMA.OdeW7C12.ode	@ltx/en_us_goadedes/miscellanea:misc.Ode7
ltx/en_us_goadedes/oc.m5.d7:ocMA.OdeW7C12.text	
ltx/en_us_goadedes/oc.m5.d7:ocMA.OdeW7C13.incipit	…
ltx/en_us_goadedes/oc.m5.d7:ocMA.OdeW7C13.melody	@ltx/en_us_goadedes/he.h.m5:heHE.PyrosSvestirion.name
ltx/en_us_goadedes/oc.m5.d7:ocMA.OdeW7C13.mode	@ltx/en_us_goadedes/miscellanea:misc.Mode5
ltx/en_us_goadedes/oc.m5.d7:ocMA.OdeW7C13.ode	@ltx/en_us_goadedes/miscellanea:misc.Ode7
ltx/en_us_goadedes/oc.m5.d7:ocMA.OdeW7C13.text	
ltx/en_us_goadedes/oc.m5.d7:ocMA.OdeW7C14.incipit	…
ltx/en_us_goadedes/oc.m5.d7:ocMA.OdeW7C14.melody	@ltx/en_us_goadedes/he.h.m5:heHE.PyrosSvestirion.name
ltx/en_us_goadedes/oc.m5.d7:ocMA.OdeW7C14.mode	@ltx/en_us_goadedes/miscellanea:misc.Mode5
ltx/en_us_goadedes/oc.m5.d7:ocMA.OdeW7C14.ode	@ltx/en_us_goadedes/miscellanea:misc.Ode7
ltx/en_us_goadedes/oc.m5.d7:ocMA.OdeW7C14.text	
ltx/en_us_goadedes/oc.m5.d7:ocMA.OdeW7C15.incipit	…
ltx/en_us_goadedes/oc.m5.d7:ocMA.OdeW7C15.melody	@ltx/en_us_goadedes/he.h.m5:heHE.PyrosSvestirion.name
ltx/en_us_goadedes/oc.m5.d7:ocMA.OdeW7C15.mode	@ltx/en_us_goadedes/miscellanea:misc.Mode5
ltx/en_us_goadedes/oc.m5.d7:ocMA.OdeW7C15.ode	@ltx/en_us_goadedes/miscellanea:misc.Ode7
ltx/en_us_goadedes/oc.m5.d7:ocMA.OdeW7C15.text	
ltx/en_us_goadedes/oc.m5.d7:ocMA.OdeW7C1H.greekmelody	@ltx/en_us_goadedes/he.h.m5:heHE.PyrosSvestirion.greekname
ltx/en_us_goadedes/oc.m5.d7:ocMA.OdeW7C1H.incipit	@ltx/en_us_goadedes/he.h.m5:heHE.PyrosSvestirion.incipit
ltx/en_us_goadedes/oc.m5.d7:ocMA.OdeW7C1H.melody	@ltx/en_us_goadedes/he.h.m5:heHE.PyrosSvestirion.melody
ltx/en_us_goadedes/oc.m5.d7:ocMA.OdeW7C1H.mode	@ltx/en_us_goadedes/miscellanea:misc.Mode5
ltx/en_us_goadedes/oc.m5.d7:ocMA.OdeW7C1H.ode	@ltx/en_us_goadedes/miscellanea:misc.Ode7
ltx/en_us_goadedes/oc.m5.d7:ocMA.OdeW7C1H.text	@ltx/en_us_goadedes/he.h.m5:heHE.PyrosSvestirion.text
ltx/en_us_goadedes/oc.m5.d7:ocMA.OdeW7C1T.incipit	…
ltx/en_us_goadedes/oc.m5.d7:ocMA.OdeW7C1T.melody	@ltx/en_us_goadedes/he.h.m5:heHE.PyrosSvestirion.name
ltx/en_us_goadedes/oc.m5.d7:ocMA.OdeW7C1T.mode	@ltx/en_us_goadedes/miscellanea:misc.Mode5
ltx/en_us_goadedes/oc.m5.d7:ocMA.OdeW7C1T.ode	@ltx/en_us_goadedes/miscellanea:misc.Ode7
ltx/en_us_goadedes/oc.m5.d7:ocMA.OdeW7C1T.text	
ltx/en_us_goadedes/oc.m5.d7:ocMA.OdeW7C21.greekmelody	@ltx/en_us_goadedes/he.h.m5:heHE.OEnKaminoPyros.greekname
ltx/en_us_goadedes/oc.m5.d7:ocMA.OdeW7C21.incipit	…
ltx/en_us_goadedes/oc.m5.d7:ocMA.OdeW7C21.melody	@ltx/en_us_goadedes/he.h.m5:heHE.OEnKaminoPyros.name
ltx/en_us_goadedes/oc.m5.d7:ocMA.OdeW7C21.mode	@ltx/en_us_goadedes/miscellanea:misc.Mode5
ltx/en_us_goadedes/oc.m5.d7:ocMA.OdeW7C21.ode	@ltx/en_us_goadedes/miscellanea:misc.Ode7
ltx/en_us_goadedes/oc.m5.d7:ocMA.OdeW7C21.text	
ltx/en_us_goadedes/oc.m5.d7:ocMA.OdeW7C22.incipit	…
ltx/en_us_goadedes/oc.m5.d7:ocMA.OdeW7C22.melody	@ltx/en_us_goadedes/he.h.m5:heHE.OEnKaminoPyros.name
ltx/en_us_goadedes/oc.m5.d7:ocMA.OdeW7C22.mode	@ltx/en_us_goadedes/miscellanea:misc.Mode5
ltx/en_us_goadedes/oc.m5.d7:ocMA.OdeW7C22.ode	@ltx/en_us_goadedes/miscellanea:misc.Ode7
ltx/en_us_goadedes/oc.m5.d7:ocMA.OdeW7C22.text	
ltx/en_us_goadedes/oc.m5.d7:ocMA.OdeW7C23.incipit	…
ltx/en_us_goadedes/oc.m5.d7:ocMA.OdeW7C23.melody	@ltx/en_us_goadedes/he.h.m5:heHE.OEnKaminoPyros.name
ltx/en_us_goadedes/oc.m5.d7:ocMA.OdeW7C23.mode	@ltx/en_us_goadedes/miscellanea:misc.Mode5
ltx/en_us_goadedes/oc.m5.d7:ocMA.OdeW7C23.ode	@ltx/en_us_goadedes/miscellanea:misc.Ode7
ltx/en_us_goadedes/oc.m5.d7:ocMA.OdeW7C23.text	
ltx/en_us_goadedes/oc.m5.d7:ocMA.OdeW7C2T.incipit	…
ltx/en_us_goadedes/oc.m5.d7:ocMA.OdeW7C2T.melody	@ltx/en_us_goadedes/he.h.m5:heHE.OEnKaminoPyros.name
ltx/en_us_goadedes/oc.m5.d7:ocMA.OdeW7C2T.mode	@ltx/en_us_goadedes/miscellanea:misc.Mode5
ltx/en_us_goadedes/oc.m5.d7:ocMA.OdeW7C2T.ode	@ltx/en_us_goadedes/miscellanea:misc.Ode7
ltx/en_us_goadedes/oc.m5.d7:ocMA.OdeW7C2T.text	
ltx/en_us_goadedes/oc.m5.d7:ocMA.OdeW8C11.incipit	…
ltx/en_us_goadedes/oc.m5.d7:ocMA.OdeW8C11.melody	@ltx/en_us_goadedes/he.h.m5:heHE.AngelonSystima.name
ltx/en_us_goadedes/oc.m5.d7:ocMA.OdeW8C11.mode	@ltx/en_us_goadedes/miscellanea:misc.Mode5
ltx/en_us_goadedes/oc.m5.d7:ocMA.OdeW8C11.ode	@ltx/en_us_goadedes/miscellanea:misc.Ode8
ltx/en_us_goadedes/oc.m5.d7:ocMA.OdeW8C11.text	
ltx/en_us_goadedes/oc.m5.d7:ocMA.OdeW8C12.incipit	…
ltx/en_us_goadedes/oc.m5.d7:ocMA.OdeW8C12.melody	@ltx/en_us_goadedes/he.h.m5:heHE.AngelonSystima.name
ltx/en_us_goadedes/oc.m5.d7:ocMA.OdeW8C12.mode	@ltx/en_us_goadedes/miscellanea:misc.Mode5
ltx/en_us_goadedes/oc.m5.d7:ocMA.OdeW8C12.ode	@ltx/en_us_goadedes/miscellanea:misc.Ode8
ltx/en_us_goadedes/oc.m5.d7:ocMA.OdeW8C12.text	
ltx/en_us_goadedes/oc.m5.d7:ocMA.OdeW8C13.incipit	…
ltx/en_us_goadedes/oc.m5.d7:ocMA.OdeW8C13.melody	@ltx/en_us_goadedes/he.h.m5:heHE.AngelonSystima.name
ltx/en_us_goadedes/oc.m5.d7:ocMA.OdeW8C13.mode	@ltx/en_us_goadedes/miscellanea:misc.Mode5
ltx/en_us_goadedes/oc.m5.d7:ocMA.OdeW8C13.ode	@ltx/en_us_goadedes/miscellanea:misc.Ode8
ltx/en_us_goadedes/oc.m5.d7:ocMA.OdeW8C13.text	
ltx/en_us_goadedes/oc.m5.d7:ocMA.OdeW8C14.incipit	…
ltx/en_us_goadedes/oc.m5.d7:ocMA.OdeW8C14.melody	@ltx/en_us_goadedes/he.h.m5:heHE.AngelonSystima.name
ltx/en_us_goadedes/oc.m5.d7:ocMA.OdeW8C14.mode	@ltx/en_us_goadedes/miscellanea:misc.Mode5
ltx/en_us_goadedes/oc.m5.d7:ocMA.OdeW8C14.ode	@ltx/en_us_goadedes/miscellanea:misc.Ode8
ltx/en_us_goadedes/oc.m5.d7:ocMA.OdeW8C14.text	
ltx/en_us_goadedes/oc.m5.d7:ocMA.OdeW8C15.incipit	…
ltx/en_us_goadedes/oc.m5.d7:ocMA.OdeW8C15.melody	@ltx/en_us_goadedes/he.h.m5:heHE.AngelonSystima.name
ltx/en_us_goadedes/oc.m5.d7:ocMA.OdeW8C15.mode	@ltx/en_us_goadedes/miscellanea:misc.Mode5
ltx/en_us_goadedes/oc.m5.d7:ocMA.OdeW8C15.ode	@ltx/en_us_goadedes/miscellanea:misc.Ode8
ltx/en_us_goadedes/oc.m5.d7:ocMA.OdeW8C15.text	
ltx/en_us_goadedes/oc.m5.d7:ocMA.OdeW8C1H.greekmelody	@ltx/en_us_goadedes/he.h.m5:heHE.AngelonSystima.greekname
ltx/en_us_goadedes/oc.m5.d7:ocMA.OdeW8C1H.incipit	@ltx/en_us_goadedes/he.h.m5:heHE.AngelonSystima.incipit
ltx/en_us_goadedes/oc.m5.d7:ocMA.OdeW8C1H.melody	@ltx/en_us_goadedes/he.h.m5:heHE.AngelonSystima.melody
ltx/en_us_goadedes/oc.m5.d7:ocMA.OdeW8C1H.mode	@ltx/en_us_goadedes/miscellanea:misc.Mode5
ltx/en_us_goadedes/oc.m5.d7:ocMA.OdeW8C1H.ode	@ltx/en_us_goadedes/miscellanea:misc.Ode8
ltx/en_us_goadedes/oc.m5.d7:ocMA.OdeW8C1H.text	@ltx/en_us_goadedes/he.h.m5:heHE.AngelonSystima.text
ltx/en_us_goadedes/oc.m5.d7:ocMA.OdeW8C1T.incipit	…
ltx/en_us_goadedes/oc.m5.d7:ocMA.OdeW8C1T.melody	@ltx/en_us_goadedes/he.h.m5:heHE.AngelonSystima.name
ltx/en_us_goadedes/oc.m5.d7:ocMA.OdeW8C1T.mode	@ltx/en_us_goadedes/miscellanea:misc.Mode5
ltx/en_us_goadedes/oc.m5.d7:ocMA.OdeW8C1T.ode	@ltx/en_us_goadedes/miscellanea:misc.Ode8
ltx/en_us_goadedes/oc.m5.d7:ocMA.OdeW8C1T.text	
ltx/en_us_goadedes/oc.m5.d7:ocMA.OdeW8C21.greekmelody	@ltx/en_us_goadedes/he.h.m5:heHE.TonEkPatrosProAionon.greekname
ltx/en_us_goadedes/oc.m5.d7:ocMA.OdeW8C21.incipit	…
ltx/en_us_goadedes/oc.m5.d7:ocMA.OdeW8C21.melody	@ltx/en_us_goadedes/he.h.m5:heHE.TonEkPatrosProAionon.name
ltx/en_us_goadedes/oc.m5.d7:ocMA.OdeW8C21.mode	@ltx/en_us_goadedes/miscellanea:misc.Mode5
ltx/en_us_goadedes/oc.m5.d7:ocMA.OdeW8C21.ode	@ltx/en_us_goadedes/miscellanea:misc.Ode8
ltx/en_us_goadedes/oc.m5.d7:ocMA.OdeW8C21.text	
ltx/en_us_goadedes/oc.m5.d7:ocMA.OdeW8C22.incipit	…
ltx/en_us_goadedes/oc.m5.d7:ocMA.OdeW8C22.melody	@ltx/en_us_goadedes/he.h.m5:heHE.TonEkPatrosProAionon.name
ltx/en_us_goadedes/oc.m5.d7:ocMA.OdeW8C22.mode	@ltx/en_us_goadedes/miscellanea:misc.Mode5
ltx/en_us_goadedes/oc.m5.d7:ocMA.OdeW8C22.ode	@ltx/en_us_goadedes/miscellanea:misc.Ode8
ltx/en_us_goadedes/oc.m5.d7:ocMA.OdeW8C22.text	
ltx/en_us_goadedes/oc.m5.d7:ocMA.OdeW8C23.incipit	…
ltx/en_us_goadedes/oc.m5.d7:ocMA.OdeW8C23.melody	@ltx/en_us_goadedes/he.h.m5:heHE.TonEkPatrosProAionon.name
ltx/en_us_goadedes/oc.m5.d7:ocMA.OdeW8C23.mode	@ltx/en_us_goadedes/miscellanea:misc.Mode5
ltx/en_us_goadedes/oc.m5.d7:ocMA.OdeW8C23.ode	@ltx/en_us_goadedes/miscellanea:misc.Ode8
ltx/en_us_goadedes/oc.m5.d7:ocMA.OdeW8C23.text	
ltx/en_us_goadedes/oc.m5.d7:ocMA.OdeW8C2T.incipit	…
ltx/en_us_goadedes/oc.m5.d7:ocMA.OdeW8C2T.melody	@ltx/en_us_goadedes/he.h.m5:heHE.TonEkPatrosProAionon.name
ltx/en_us_goadedes/oc.m5.d7:ocMA.OdeW8C2T.mode	@ltx/en_us_goadedes/miscellanea:misc.Mode5
ltx/en_us_goadedes/oc.m5.d7:ocMA.OdeW8C2T.ode	@ltx/en_us_goadedes/miscellanea:misc.Ode8
ltx/en_us_goadedes/oc.m5.d7:ocMA.OdeW8C2T.text	
ltx/en_us_goadedes/oc.m5.d7:ocMA.OdeW9C11.incipit	…
ltx/en_us_goadedes/oc.m5.d7:ocMA.OdeW9C11.melody	@ltx/en_us_goadedes/he.h.m4:heHE.OtiEpoiiseMoiMegaleia.name
ltx/en_us_goadedes/oc.m5.d7:ocMA.OdeW9C11.mode	@ltx/en_us_goadedes/miscellanea:misc.Mode5
ltx/en_us_goadedes/oc.m5.d7:ocMA.OdeW9C11.ode	@ltx/en_us_goadedes/miscellanea:misc.Ode9
ltx/en_us_goadedes/oc.m5.d7:ocMA.OdeW9C11.text	
ltx/en_us_goadedes/oc.m5.d7:ocMA.OdeW9C12.incipit	…
ltx/en_us_goadedes/oc.m5.d7:ocMA.OdeW9C12.melody	@ltx/en_us_goadedes/he.h.m4:heHE.OtiEpoiiseMoiMegaleia.name
ltx/en_us_goadedes/oc.m5.d7:ocMA.OdeW9C12.mode	@ltx/en_us_goadedes/miscellanea:misc.Mode5
ltx/en_us_goadedes/oc.m5.d7:ocMA.OdeW9C12.ode	@ltx/en_us_goadedes/miscellanea:misc.Ode9
ltx/en_us_goadedes/oc.m5.d7:ocMA.OdeW9C12.text	
ltx/en_us_goadedes/oc.m5.d7:ocMA.OdeW9C13.incipit	…
ltx/en_us_goadedes/oc.m5.d7:ocMA.OdeW9C13.melody	@ltx/en_us_goadedes/he.h.m4:heHE.OtiEpoiiseMoiMegaleia.name
ltx/en_us_goadedes/oc.m5.d7:ocMA.OdeW9C13.mode	@ltx/en_us_goadedes/miscellanea:misc.Mode5
ltx/en_us_goadedes/oc.m5.d7:ocMA.OdeW9C13.ode	@ltx/en_us_goadedes/miscellanea:misc.Ode9
ltx/en_us_goadedes/oc.m5.d7:ocMA.OdeW9C13.text	
ltx/en_us_goadedes/oc.m5.d7:ocMA.OdeW9C14.incipit	…
ltx/en_us_goadedes/oc.m5.d7:ocMA.OdeW9C14.melody	@ltx/en_us_goadedes/he.h.m4:heHE.OtiEpoiiseMoiMegaleia.name
ltx/en_us_goadedes/oc.m5.d7:ocMA.OdeW9C14.mode	@ltx/en_us_goadedes/miscellanea:misc.Mode5
ltx/en_us_goadedes/oc.m5.d7:ocMA.OdeW9C14.ode	@ltx/en_us_goadedes/miscellanea:misc.Ode9
ltx/en_us_goadedes/oc.m5.d7:ocMA.OdeW9C14.text	
ltx/en_us_goadedes/oc.m5.d7:ocMA.OdeW9C1H.greekmelody	@ltx/en_us_goadedes/he.h.m4:heHE.OtiEpoiiseMoiMegaleia.greekname
ltx/en_us_goadedes/oc.m5.d7:ocMA.OdeW9C1H.incipit	@ltx/en_us_goadedes/he.h.m4:heHE.OtiEpoiiseMoiMegaleia.incipit
ltx/en_us_goadedes/oc.m5.d7:ocMA.OdeW9C1H.melody	@ltx/en_us_goadedes/he.h.m4:heHE.OtiEpoiiseMoiMegaleia.melody
ltx/en_us_goadedes/oc.m5.d7:ocMA.OdeW9C1H.mode	@ltx/en_us_goadedes/miscellanea:misc.Mode5
ltx/en_us_goadedes/oc.m5.d7:ocMA.OdeW9C1H.ode	@ltx/en_us_goadedes/miscellanea:misc.Ode9
ltx/en_us_goadedes/oc.m5.d7:ocMA.OdeW9C1H.text	@ltx/en_us_goadedes/he.h.m4:heHE.OtiEpoiiseMoiMegaleia.text
ltx/en_us_goadedes/oc.m5.d7:ocMA.OdeW9C1T.incipit	…
ltx/en_us_goadedes/oc.m5.d7:ocMA.OdeW9C1T.melody	@ltx/en_us_goadedes/he.h.m4:heHE.OtiEpoiiseMoiMegaleia.name
ltx/en_us_goadedes/oc.m5.d7:ocMA.OdeW9C1T.mode	@ltx/en_us_goadedes/miscellanea:misc.Mode5
ltx/en_us_goadedes/oc.m5.d7:ocMA.OdeW9C1T.ode	@ltx/en_us_goadedes/miscellanea:misc.Ode9
ltx/en_us_goadedes/oc.m5.d7:ocMA.OdeW9C1T.text	
ltx/en_us_goadedes/oc.m5.d7:ocMA.OdeW9C21.greekmelody	@ltx/en_us_goadedes/he.h.m5:heHE.SeTinYperNoun.greekname
ltx/en_us_goadedes/oc.m5.d7:ocMA.OdeW9C21.incipit	…
ltx/en_us_goadedes/oc.m5.d7:ocMA.OdeW9C21.melody	@ltx/en_us_goadedes/he.h.m5:heHE.SeTinYperNoun.name
ltx/en_us_goadedes/oc.m5.d7:ocMA.OdeW9C21.mode	@ltx/en_us_goadedes/miscellanea:misc.Mode5
ltx/en_us_goadedes/oc.m5.d7:ocMA.OdeW9C21.ode	@ltx/en_us_goadedes/miscellanea:misc.Ode9
ltx/en_us_goadedes/oc.m5.d7:ocMA.OdeW9C21.text	
ltx/en_us_goadedes/oc.m5.d7:ocMA.OdeW9C22.incipit	…
ltx/en_us_goadedes/oc.m5.d7:ocMA.OdeW9C22.melody	@ltx/en_us_goadedes/he.h.m5:heHE.SeTinYperNoun.name
ltx/en_us_goadedes/oc.m5.d7:ocMA.OdeW9C22.mode	@ltx/en_us_goadedes/miscellanea:misc.Mode5
ltx/en_us_goadedes/oc.m5.d7:ocMA.OdeW9C22.ode	@ltx/en_us_goadedes/miscellanea:misc.Ode9
ltx/en_us_goadedes/oc.m5.d7:ocMA.OdeW9C22.text	
ltx/en_us_goadedes/oc.m5.d7:ocMA.OdeW9C23.incipit	…
ltx/en_us_goadedes/oc.m5.d7:ocMA.OdeW9C23.melody	@ltx/en_us_goadedes/he.h.m5:heHE.SeTinYperNoun.name
ltx/en_us_goadedes/oc.m5.d7:ocMA.OdeW9C23.mode	@ltx/en_us_goadedes/miscellanea:misc.Mode5
ltx/en_us_goadedes/oc.m5.d7:ocMA.OdeW9C23.ode	@ltx/en_us_goadedes/miscellanea:misc.Ode9
ltx/en_us_goadedes/oc.m5.d7:ocMA.OdeW9C23.text	
ltx/en_us_goadedes/oc.m5.d7:ocMA.OdeW9C2T.incipit	…
ltx/en_us_goadedes/oc.m5.d7:ocMA.OdeW9C2T.melody	@ltx/en_us_goadedes/he.h.m5:heHE.SeTinYperNoun.name
ltx/en_us_goadedes/oc.m5.d7:ocMA.OdeW9C2T.mode	@ltx/en_us_goadedes/miscellanea:misc.Mode5
ltx/en_us_goadedes/oc.m5.d7:ocMA.OdeW9C2T.ode	@ltx/en_us_goadedes/miscellanea:misc.Ode9
ltx/en_us_goadedes/oc.m5.d7:ocMA.OdeW9C2T.text	
ltx/en_us_goadedes/oc.m5.d7:ocVE.ApolTheotokionVM.greekmelody	@ltx/en_us_goadedes/he.a.m5:heAU.TonSynanarchonLogon.greekname
ltx/en_us_goadedes/oc.m5.d7:ocVE.ApolTheotokionVM.incipit	@ltx/en_us_goadedes/oc.m5.d1:ocVE.ApolTheotokionVM.incipit
ltx/en_us_goadedes/oc.m5.d7:ocVE.ApolTheotokionVM.melody	@ltx/en_us_goadedes/he.a.m5:heAU.TonSynanarchonLogon.name
ltx/en_us_goadedes/oc.m5.d7:ocVE.ApolTheotokionVM.mode	@ltx/en_us_goadedes/miscellanea:misc.Mode5
ltx/en_us_goadedes/oc.m5.d7:ocVE.ApolTheotokionVM.text	@ltx/en_us_goadedes/oc.m5.d1:ocVE.ApolTheotokionVM.text
ltx/en_us_goadedes/oc.m5.d7:ocVE.AposTheotokion.incipit	…
ltx/en_us_goadedes/oc.m5.d7:ocVE.AposTheotokion.melody	
ltx/en_us_goadedes/oc.m5.d7:ocVE.AposTheotokion.mode	@ltx/en_us_goadedes/miscellanea:misc.Mode5
ltx/en_us_goadedes/oc.m5.d7:ocVE.AposTheotokion.text	
ltx/en_us_goadedes/oc.m5.d7:ocVE.Aposticha1.incipit	@ltx/en_us_goadedes/oc.m5.d2:ocVE.Aposticha3.incipit
ltx/en_us_goadedes/oc.m5.d7:ocVE.Aposticha1.melody	
ltx/en_us_goadedes/oc.m5.d7:ocVE.Aposticha1.mode	@ltx/en_us_goadedes/miscellanea:misc.Mode5
ltx/en_us_goadedes/oc.m5.d7:ocVE.Aposticha1.text	@ltx/en_us_goadedes/oc.m5.d2:ocVE.Aposticha3.text
ltx/en_us_goadedes/oc.m5.d7:ocVE.Aposticha2.incipit	…
ltx/en_us_goadedes/oc.m5.d7:ocVE.Aposticha2.melody	
ltx/en_us_goadedes/oc.m5.d7:ocVE.Aposticha2.mode	@ltx/en_us_goadedes/miscellanea:misc.Mode5
ltx/en_us_goadedes/oc.m5.d7:ocVE.Aposticha2.text	
ltx/en_us_goadedes/oc.m5.d7:ocVE.Aposticha3.incipit	…
ltx/en_us_goadedes/oc.m5.d7:ocVE.Aposticha3.melody	
ltx/en_us_goadedes/oc.m5.d7:ocVE.Aposticha3.mode	@ltx/en_us_goadedes/miscellanea:misc.Mode5
ltx/en_us_goadedes/oc.m5.d7:ocVE.Aposticha3.text	
ltx/en_us_goadedes/oc.m5.d7:ocVE.SticTheotokion.incipit	@ltx/en_us_goadedes/oc.m5.d1:ocVE.SticTheotokion.incipit
ltx/en_us_goadedes/oc.m5.d7:ocVE.SticTheotokion.melody	
ltx/en_us_goadedes/oc.m5.d7:ocVE.SticTheotokion.mode	@ltx/en_us_goadedes/miscellanea:misc.Mode5
ltx/en_us_goadedes/oc.m5.d7:ocVE.SticTheotokion.text	@ltx/en_us_goadedes/oc.m5.d1:ocVE.SticTheotokion.text
ltx/en_us_goadedes/oc.m5.d7:ocVE.Stichera1.greekmelody	@ltx/en_us_goadedes/he.a.m5:heAU.ChairoisAskitikon.greekname
ltx/en_us_goadedes/oc.m5.d7:ocVE.Stichera1.incipit	Spare me, who now implore You…
ltx/en_us_goadedes/oc.m5.d7:ocVE.Stichera1.melody	@ltx/en_us_goadedes/he.a.m5:heAU.ChairoisAskitikon.name
ltx/en_us_goadedes/oc.m5.d7:ocVE.Stichera1.mode	@ltx/en_us_goadedes/miscellanea:misc.Mode5
ltx/en_us_goadedes/oc.m5.d7:ocVE.Stichera1.text	Spare me, who now implore You, O Christ, * when You command it and my soul will be parted from * my body, since it was You, Lord, who in Your wisdom as God * joined the earth and spirit and created man. * I pray You to rescue me from invisible enemies, * when they attack me and attempt to lay hold of me, * and to do me harm, and to catch and devour me. * Please count me worthy to attain refreshment forevermore, * where there is no pain, nor sighing, nor any sorry, but only joy, * where there is the water * of delight and voices echo of those who celebrate.
ltx/en_us_goadedes/oc.m5.d7:ocVE.Stichera2.incipit	Fearing my final hour…
ltx/en_us_goadedes/oc.m5.d7:ocVE.Stichera2.melody	@ltx/en_us_goadedes/he.a.m5:heAU.ChairoisAskitikon.name
ltx/en_us_goadedes/oc.m5.d7:ocVE.Stichera2.mode	@ltx/en_us_goadedes/miscellanea:misc.Mode5
ltx/en_us_goadedes/oc.m5.d7:ocVE.Stichera2.text	Fearing my final hour, O Lord, * when frightful demons will be fiercely attacking me, * with pain in my sorry soul, I cry out to You and implore: * Crush the traps and hurdles they will lay for me, * by Your divine power, O God and Master, I pray to You, * and please do not let me, Your servant, be victimized * by their wickedness, lest they gleefully injure me. * See how dejected I become. Take notice of my distress, * and free my pitiful soul from the pain and sorrow afflicting me, * in Your great compassion, O my God, as He who gives the great mercy to the world.
ltx/en_us_goadedes/oc.m5.d7:ocVE.Stichera3.incipit	…
ltx/en_us_goadedes/oc.m5.d7:ocVE.Stichera3.melody	@ltx/en_us_goadedes/he.a.m5:heAU.ChairoisAskitikon.name
ltx/en_us_goadedes/oc.m5.d7:ocVE.Stichera3.mode	@ltx/en_us_goadedes/miscellanea:misc.Mode5
ltx/en_us_goadedes/oc.m5.d7:ocVE.Stichera3.text	
ltx/en_us_goadedes/oc.m5.d7:ocVE.Stichera4.incipit	@ltx/en_us_goadedes/oc.m5.d3:ocVE.Aposticha3.incipit
ltx/en_us_goadedes/oc.m5.d7:ocVE.Stichera4.melody	
ltx/en_us_goadedes/oc.m5.d7:ocVE.Stichera4.mode	@ltx/en_us_goadedes/miscellanea:misc.Mode5
ltx/en_us_goadedes/oc.m5.d7:ocVE.Stichera4.text	@ltx/en_us_goadedes/oc.m5.d3:ocVE.Aposticha3.text
ltx/en_us_goadedes/oc.m5.d7:ocVE.Stichera5.incipit	@ltx/en_us_goadedes/oc.m5.d4:ocVE.Aposticha3.incipit
ltx/en_us_goadedes/oc.m5.d7:ocVE.Stichera5.melody	
ltx/en_us_goadedes/oc.m5.d7:ocVE.Stichera5.mode	@ltx/en_us_goadedes/miscellanea:misc.Mode5
ltx/en_us_goadedes/oc.m5.d7:ocVE.Stichera5.text	@ltx/en_us_goadedes/oc.m5.d4:ocVE.Aposticha3.text
ltx/en_us_goadedes/oc.m5.d7:ocVE.Stichera6.incipit	@ltx/en_us_goadedes/oc.m5.d5:ocVE.Aposticha3.incipit
ltx/en_us_goadedes/oc.m5.d7:ocVE.Stichera6.melody	
ltx/en_us_goadedes/oc.m5.d7:ocVE.Stichera6.mode	@ltx/en_us_goadedes/miscellanea:misc.Mode5
ltx/en_us_goadedes/oc.m5.d7:ocVE.Stichera6.text	@ltx/en_us_goadedes/oc.m5.d5:ocVE.Aposticha3.text
ltx/en_us_goadedes/oc.m5.d7:octrMA.AposTheotokion.incipit	@ltx/en_us_goadedes/oc.m5.d7:ocMA.AposTheotokion.incipit
ltx/en_us_goadedes/oc.m5.d7:octrMA.AposTheotokion.melody	@ltx/en_us_goadedes/oc.m5.d7:ocMA.AposTheotokion.melody
ltx/en_us_goadedes/oc.m5.d7:octrMA.AposTheotokion.mode	@ltx/en_us_goadedes/miscellanea:misc.Mode5
ltx/en_us_goadedes/oc.m5.d7:octrMA.AposTheotokion.text	@ltx/en_us_goadedes/oc.m5.d7:ocMA.AposTheotokion.text
ltx/en_us_goadedes/oc.m5.d7:octrMA.Aposticha1.greekmelody	@ltx/en_us_goadedes/oc.m5.d7:ocMA.Aposticha1.greekmelody
ltx/en_us_goadedes/oc.m5.d7:octrMA.Aposticha1.incipit	@ltx/en_us_goadedes/oc.m5.d7:ocMA.Aposticha1.incipit
ltx/en_us_goadedes/oc.m5.d7:octrMA.Aposticha1.melody	@ltx/en_us_goadedes/oc.m5.d7:ocMA.Aposticha1.melody
ltx/en_us_goadedes/oc.m5.d7:octrMA.Aposticha1.mode	@ltx/en_us_goadedes/miscellanea:misc.Mode5
ltx/en_us_goadedes/oc.m5.d7:octrMA.Aposticha1.text	@ltx/en_us_goadedes/oc.m5.d7:ocMA.Aposticha1.text
ltx/en_us_goadedes/oc.m5.d7:octrMA.Aposticha2.incipit	@ltx/en_us_goadedes/oc.m5.d7:ocMA.Aposticha2.incipit
ltx/en_us_goadedes/oc.m5.d7:octrMA.Aposticha2.melody	@ltx/en_us_goadedes/oc.m5.d7:ocMA.Aposticha2.melody
ltx/en_us_goadedes/oc.m5.d7:octrMA.Aposticha2.mode	@ltx/en_us_goadedes/miscellanea:misc.Mode5
ltx/en_us_goadedes/oc.m5.d7:octrMA.Aposticha2.text	@ltx/en_us_goadedes/oc.m5.d7:ocMA.Aposticha2.text
ltx/en_us_goadedes/oc.m5.d7:octrMA.Aposticha3.incipit	@ltx/en_us_goadedes/oc.m5.d7:ocMA.Aposticha3.incipit
ltx/en_us_goadedes/oc.m5.d7:octrMA.Aposticha3.melody	@ltx/en_us_goadedes/oc.m5.d7:ocMA.Aposticha3.melody
ltx/en_us_goadedes/oc.m5.d7:octrMA.Aposticha3.mode	@ltx/en_us_goadedes/miscellanea:misc.Mode5
ltx/en_us_goadedes/oc.m5.d7:octrMA.Aposticha3.text	@ltx/en_us_goadedes/oc.m5.d7:ocMA.Aposticha3.text
ltx/en_us_goadedes/oc.m5.d7:octrMA.Kathisma11.incipit	@ltx/en_us_goadedes/oc.m5.d7:ocMA.Kathisma13.incipit
ltx/en_us_goadedes/oc.m5.d7:octrMA.Kathisma11.melody	
ltx/en_us_goadedes/oc.m5.d7:octrMA.Kathisma11.mode	@ltx/en_us_goadedes/miscellanea:misc.Mode5
ltx/en_us_goadedes/oc.m5.d7:octrMA.Kathisma11.text	@ltx/en_us_goadedes/oc.m5.d7:ocMA.Kathisma13.text
ltx/en_us_goadedes/oc.m5.d7:octrMA.Kathisma12.incipit	@ltx/en_us_goadedes/oc.m5.d7:ocMA.Kathisma12.incipit
ltx/en_us_goadedes/oc.m5.d7:octrMA.Kathisma12.melody	
ltx/en_us_goadedes/oc.m5.d7:octrMA.Kathisma12.mode	@ltx/en_us_goadedes/miscellanea:misc.Mode5
ltx/en_us_goadedes/oc.m5.d7:octrMA.Kathisma12.text	@ltx/en_us_goadedes/oc.m5.d7:ocMA.Kathisma12.text
ltx/en_us_goadedes/oc.m5.d7:octrMA.Kathisma13.greekmelody	@ltx/en_us_goadedes/he.a.m5:heAU.TonSynanarchonLogon.greekname
ltx/en_us_goadedes/oc.m5.d7:octrMA.Kathisma13.incipit	…
ltx/en_us_goadedes/oc.m5.d7:octrMA.Kathisma13.melody	@ltx/en_us_goadedes/he.a.m5:heAU.TonSynanarchonLogon.name
ltx/en_us_goadedes/oc.m5.d7:octrMA.Kathisma13.mode	@ltx/en_us_goadedes/miscellanea:misc.Mode5
ltx/en_us_goadedes/oc.m5.d7:octrMA.Kathisma13.text	
ltx/en_us_goadedes/oc.m5.d7:octrMA.Kathisma14.incipit	@ltx/en_us_goadedes/oc.m5.d7:ocMA.Kathisma22.incipit
ltx/en_us_goadedes/oc.m5.d7:octrMA.Kathisma14.melody	
ltx/en_us_goadedes/oc.m5.d7:octrMA.Kathisma14.mode	@ltx/en_us_goadedes/miscellanea:misc.Mode5
ltx/en_us_goadedes/oc.m5.d7:octrMA.Kathisma14.text	@ltx/en_us_goadedes/oc.m5.d7:ocMA.Kathisma22.text
ltx/en_us_goadedes/oc.m5.d7:octrMA.Kathisma1T.incipit	@ltx/en_us_goadedes/oc.m5.d2:ocMA.ApolTheotokion.incipit
ltx/en_us_goadedes/oc.m5.d7:octrMA.Kathisma1T.melody	
ltx/en_us_goadedes/oc.m5.d7:octrMA.Kathisma1T.mode	@ltx/en_us_goadedes/miscellanea:misc.Mode5
ltx/en_us_goadedes/oc.m5.d7:octrMA.Kathisma1T.text	@ltx/en_us_goadedes/oc.m5.d2:ocMA.ApolTheotokion.text
ltx/en_us_goadedes/oc.m5.d7:octrMA.Lauds1.incipit	@ltx/en_us_goadedes/oc.m5.d2:ocMA.Aposticha3.incipit
ltx/en_us_goadedes/oc.m5.d7:octrMA.Lauds1.melody	
ltx/en_us_goadedes/oc.m5.d7:octrMA.Lauds1.mode	@ltx/en_us_goadedes/miscellanea:misc.Mode5
ltx/en_us_goadedes/oc.m5.d7:octrMA.Lauds1.text	@ltx/en_us_goadedes/oc.m5.d2:ocMA.Aposticha3.text
ltx/en_us_goadedes/oc.m5.d7:octrMA.Lauds2.incipit	@ltx/en_us_goadedes/oc.m5.d4:ocMA.Aposticha3.incipit
ltx/en_us_goadedes/oc.m5.d7:octrMA.Lauds2.melody	
ltx/en_us_goadedes/oc.m5.d7:octrMA.Lauds2.mode	@ltx/en_us_goadedes/miscellanea:misc.Mode5
ltx/en_us_goadedes/oc.m5.d7:octrMA.Lauds2.text	@ltx/en_us_goadedes/oc.m5.d4:ocMA.Aposticha3.text
ltx/en_us_goadedes/oc.m5.d7:octrMA.Lauds3.incipit	@ltx/en_us_goadedes/oc.m5.d3:ocMA.Aposticha3.incipit
ltx/en_us_goadedes/oc.m5.d7:octrMA.Lauds3.melody	
ltx/en_us_goadedes/oc.m5.d7:octrMA.Lauds3.mode	@ltx/en_us_goadedes/miscellanea:misc.Mode5
ltx/en_us_goadedes/oc.m5.d7:octrMA.Lauds3.text	@ltx/en_us_goadedes/oc.m5.d3:ocMA.Aposticha3.text
ltx/en_us_goadedes/oc.m5.d7:octrMA.Lauds4.incipit	@ltx/en_us_goadedes/oc.m5.d5:ocMA.Aposticha3.incipit
ltx/en_us_goadedes/oc.m5.d7:octrMA.Lauds4.melody	
ltx/en_us_goadedes/oc.m5.d7:octrMA.Lauds4.mode	@ltx/en_us_goadedes/miscellanea:misc.Mode5
ltx/en_us_goadedes/oc.m5.d7:octrMA.Lauds4.text	@ltx/en_us_goadedes/oc.m5.d5:ocMA.Aposticha3.text
ltx/en_us_goadedes/oc.m5.d7:octrMA.LaudsGlory.incipit	@ltx/en_us_goadedes/oc.m5.d7:ocVE.Aposticha3.incipit
ltx/en_us_goadedes/oc.m5.d7:octrMA.LaudsGlory.melody	
ltx/en_us_goadedes/oc.m5.d7:octrMA.LaudsGlory.mode	@ltx/en_us_goadedes/miscellanea:misc.Mode5
ltx/en_us_goadedes/oc.m5.d7:octrMA.LaudsGlory.text	@ltx/en_us_goadedes/oc.m5.d7:ocVE.Aposticha3.text
ltx/en_us_goadedes/oc.m5.d7:octrMA.LaudsTheotokion.incipit	…
ltx/en_us_goadedes/oc.m5.d7:octrMA.LaudsTheotokion.melody	
ltx/en_us_goadedes/oc.m5.d7:octrMA.LaudsTheotokion.mode	@ltx/en_us_goadedes/miscellanea:misc.Mode5
ltx/en_us_goadedes/oc.m5.d7:octrMA.LaudsTheotokion.text	
ltx/en_us_goadedes/oc.m5.d7:octrMA.Photogogic.incipit	@ltx/en_us_goadedes/oc.m5.d2:octrMA.Photagogic.incipit
ltx/en_us_goadedes/oc.m5.d7:octrMA.Photogogic.mode	@ltx/en_us_goadedes/miscellanea:misc.Mode5
ltx/en_us_goadedes/oc.m5.d7:octrMA.Photogogic.text	@ltx/en_us_goadedes/oc.m5.d2:octrMA.Photagogic.text
ltx/en_us_goadedes/oc.m5.d7:octrVE.SticBoth.incipit	@ltx/en_us_goadedes/oc.m5.d7:ocVE.SticTheotokion.incipit
ltx/en_us_goadedes/oc.m5.d7:octrVE.SticBoth.melody	
ltx/en_us_goadedes/oc.m5.d7:octrVE.SticBoth.mode	@ltx/en_us_goadedes/miscellanea:misc.Mode5
ltx/en_us_goadedes/oc.m5.d7:octrVE.SticBoth.text	@ltx/en_us_goadedes/oc.m5.d7:ocVE.SticTheotokion.text
ltx/en_us_goadedes/oc.m5.d7:octrVE.SticGlory.incipit	@ltx/en_us_goadedes/oc.m5.d7:ocVE.Aposticha2.incipit
ltx/en_us_goadedes/oc.m5.d7:octrVE.SticGlory.melody	
ltx/en_us_goadedes/oc.m5.d7:octrVE.SticGlory.mode	@ltx/en_us_goadedes/miscellanea:misc.Mode5
ltx/en_us_goadedes/oc.m5.d7:octrVE.SticGlory.text	@ltx/en_us_goadedes/oc.m5.d7:ocVE.Aposticha2.text
ltx/en_us_goadedes/oc.m5.d7:octrVE.Stichera1.incipit	@ltx/en_us_goadedes/oc.m5.d7:ocVE.Aposticha1.incipit
ltx/en_us_goadedes/oc.m5.d7:octrVE.Stichera1.melody	
ltx/en_us_goadedes/oc.m5.d7:octrVE.Stichera1.mode	@ltx/en_us_goadedes/miscellanea:misc.Mode5
ltx/en_us_goadedes/oc.m5.d7:octrVE.Stichera1.text	@ltx/en_us_goadedes/oc.m5.d7:ocVE.Aposticha1.text
ltx/en_us_goadedes/oc.m5.d7:octrVE.Stichera2.incipit	@ltx/en_us_goadedes/oc.m5.d3:ocVE.Aposticha3.incipit
ltx/en_us_goadedes/oc.m5.d7:octrVE.Stichera2.melody	
ltx/en_us_goadedes/oc.m5.d7:octrVE.Stichera2.mode	@ltx/en_us_goadedes/miscellanea:misc.Mode5
ltx/en_us_goadedes/oc.m5.d7:octrVE.Stichera2.text	@ltx/en_us_goadedes/oc.m5.d3:ocVE.Aposticha3.text
ltx/en_us_goadedes/oc.m5.d7:octrVE.Stichera3.incipit	@ltx/en_us_goadedes/oc.m5.d4:ocVE.Aposticha3.incipit
ltx/en_us_goadedes/oc.m5.d7:octrVE.Stichera3.melody	
ltx/en_us_goadedes/oc.m5.d7:octrVE.Stichera3.mode	@ltx/en_us_goadedes/miscellanea:misc.Mode5
ltx/en_us_goadedes/oc.m5.d7:octrVE.Stichera3.text	@ltx/en_us_goadedes/oc.m5.d4:ocVE.Aposticha3.text
ltx/en_us_goadedes/oc.m5.d7:octrVE.Stichera4.incipit	@ltx/en_us_goadedes/oc.m5.d5:ocVE.Aposticha3.incipit
ltx/en_us_goadedes/oc.m5.d7:octrVE.Stichera4.melody	
ltx/en_us_goadedes/oc.m5.d7:octrVE.Stichera4.mode	@ltx/en_us_goadedes/miscellanea:misc.Mode5
ltx/en_us_goadedes/oc.m5.d7:octrVE.Stichera4.text	@ltx/en_us_goadedes/oc.m5.d5:ocVE.Aposticha3.text
