ltx/en_us_goadedes/oc.m7.d6:ocBK.ModeNaked	@ltx/en_us_goadedes/miscellanea:misc.Mode7.naked
ltx/en_us_goadedes/oc.m7.d6:ocLI.Beatitudes1.incipit	@ltx/en_us_goadedes/oc.m7.d1:ocLI.Beatitudes1.incipit
ltx/en_us_goadedes/oc.m7.d6:ocLI.Beatitudes1.melody	
ltx/en_us_goadedes/oc.m7.d6:ocLI.Beatitudes1.mode	@ltx/en_us_goadedes/miscellanea:misc.Mode7
ltx/en_us_goadedes/oc.m7.d6:ocLI.Beatitudes1.text	@ltx/en_us_goadedes/oc.m7.d1:ocLI.Beatitudes1.text
ltx/en_us_goadedes/oc.m7.d6:ocLI.Beatitudes2.incipit	…
ltx/en_us_goadedes/oc.m7.d6:ocLI.Beatitudes2.melody	
ltx/en_us_goadedes/oc.m7.d6:ocLI.Beatitudes2.mode	@ltx/en_us_goadedes/miscellanea:misc.Mode7
ltx/en_us_goadedes/oc.m7.d6:ocLI.Beatitudes2.text	
ltx/en_us_goadedes/oc.m7.d6:ocLI.Beatitudes3.incipit	…
ltx/en_us_goadedes/oc.m7.d6:ocLI.Beatitudes3.melody	
ltx/en_us_goadedes/oc.m7.d6:ocLI.Beatitudes3.mode	@ltx/en_us_goadedes/miscellanea:misc.Mode7
ltx/en_us_goadedes/oc.m7.d6:ocLI.Beatitudes3.text	
ltx/en_us_goadedes/oc.m7.d6:ocLI.Beatitudes4.incipit	…
ltx/en_us_goadedes/oc.m7.d6:ocLI.Beatitudes4.melody	
ltx/en_us_goadedes/oc.m7.d6:ocLI.Beatitudes4.mode	@ltx/en_us_goadedes/miscellanea:misc.Mode7
ltx/en_us_goadedes/oc.m7.d6:ocLI.Beatitudes4.text	
ltx/en_us_goadedes/oc.m7.d6:ocLI.BeatitudesT.incipit	…
ltx/en_us_goadedes/oc.m7.d6:ocLI.BeatitudesT.melody	
ltx/en_us_goadedes/oc.m7.d6:ocLI.BeatitudesT.mode	@ltx/en_us_goadedes/miscellanea:misc.Mode7
ltx/en_us_goadedes/oc.m7.d6:ocLI.BeatitudesT.text	
ltx/en_us_goadedes/oc.m7.d6:ocLI.BeatitudesTr.incipit	…
ltx/en_us_goadedes/oc.m7.d6:ocLI.BeatitudesTr.melody	
ltx/en_us_goadedes/oc.m7.d6:ocLI.BeatitudesTr.mode	@ltx/en_us_goadedes/miscellanea:misc.Mode7
ltx/en_us_goadedes/oc.m7.d6:ocLI.BeatitudesTr.text	
ltx/en_us_goadedes/oc.m7.d6:ocLI.MM.Beatitudes1234TrTas78910GB.text	@ltx/en_us_goadedes/properties:media.key
ltx/en_us_goadedes/oc.m7.d6:ocMA.ApolTheotokion.incipit	@ltx/en_us_goadedes/oc.m7.d5:ocVE.AposTheotokion.incipit
ltx/en_us_goadedes/oc.m7.d6:ocMA.ApolTheotokion.melody	
ltx/en_us_goadedes/oc.m7.d6:ocMA.ApolTheotokion.mode	@ltx/en_us_goadedes/miscellanea:misc.Mode7
ltx/en_us_goadedes/oc.m7.d6:ocMA.ApolTheotokion.text	@ltx/en_us_goadedes/oc.m7.d5:ocVE.AposTheotokion.text
ltx/en_us_goadedes/oc.m7.d6:ocMA.AposTheotokion.greekmelody	@ltx/en_us_goadedes/he.a.m7:heAU.SimeronGrigoreiOIoudas.greekname
ltx/en_us_goadedes/oc.m7.d6:ocMA.AposTheotokion.incipit	…
ltx/en_us_goadedes/oc.m7.d6:ocMA.AposTheotokion.melody	@ltx/en_us_goadedes/he.a.m7:heAU.SimeronGrigoreiOIoudas.name
ltx/en_us_goadedes/oc.m7.d6:ocMA.AposTheotokion.mode	@ltx/en_us_goadedes/miscellanea:misc.Mode7
ltx/en_us_goadedes/oc.m7.d6:ocMA.AposTheotokion.text	
ltx/en_us_goadedes/oc.m7.d6:ocMA.Aposticha1.greekmelody	@ltx/en_us_goadedes/he.a.m7:heAU.OukEtiKolyometha.greekname
ltx/en_us_goadedes/oc.m7.d6:ocMA.Aposticha1.incipit	@ltx/en_us_goadedes/oc.m7.d4:ocMA.Aposticha1.incipit
ltx/en_us_goadedes/oc.m7.d6:ocMA.Aposticha1.melody	@ltx/en_us_goadedes/he.a.m7:heAU.OukEtiKolyometha.name
ltx/en_us_goadedes/oc.m7.d6:ocMA.Aposticha1.mode	@ltx/en_us_goadedes/miscellanea:misc.Mode7
ltx/en_us_goadedes/oc.m7.d6:ocMA.Aposticha1.text	@ltx/en_us_goadedes/oc.m7.d4:ocMA.Aposticha1.text
ltx/en_us_goadedes/oc.m7.d6:ocMA.Aposticha2.incipit	@ltx/en_us_goadedes/oc.m7.d4:ocMA.Aposticha2.incipit
ltx/en_us_goadedes/oc.m7.d6:ocMA.Aposticha2.melody	
ltx/en_us_goadedes/oc.m7.d6:ocMA.Aposticha2.mode	@ltx/en_us_goadedes/miscellanea:misc.Mode7
ltx/en_us_goadedes/oc.m7.d6:ocMA.Aposticha2.text	@ltx/en_us_goadedes/oc.m7.d4:ocMA.Aposticha2.text
ltx/en_us_goadedes/oc.m7.d6:ocMA.Aposticha3.greekmelody	@ltx/en_us_goadedes/he.a.m7:heAU.OukEtiKolyometha.greekname
ltx/en_us_goadedes/oc.m7.d6:ocMA.Aposticha3.incipit	@ltx/en_us_goadedes/oc.m7.d2:ocMA.Aposticha3.incipit
ltx/en_us_goadedes/oc.m7.d6:ocMA.Aposticha3.melody	@ltx/en_us_goadedes/he.a.m7:heAU.OukEtiKolyometha.name
ltx/en_us_goadedes/oc.m7.d6:ocMA.Aposticha3.mode	@ltx/en_us_goadedes/miscellanea:misc.Mode7
ltx/en_us_goadedes/oc.m7.d6:ocMA.Aposticha3.text	@ltx/en_us_goadedes/oc.m7.d2:ocMA.Aposticha3.text
ltx/en_us_goadedes/oc.m7.d6:ocMA.C1.acrostic.notice1	
ltx/en_us_goadedes/oc.m7.d6:ocMA.C1.acrostic.text	
ltx/en_us_goadedes/oc.m7.d6:ocMA.C1.acrostic.title	Canon for the Cross.
ltx/en_us_goadedes/oc.m7.d6:ocMA.CA.notice	
ltx/en_us_goadedes/oc.m7.d6:ocMA.Kathisma11.incipit	@ltx/en_us_goadedes/oc.m7.d4:ocMA.Kathisma11.incipit
ltx/en_us_goadedes/oc.m7.d6:ocMA.Kathisma11.melody	
ltx/en_us_goadedes/oc.m7.d6:ocMA.Kathisma11.mode	@ltx/en_us_goadedes/miscellanea:misc.Mode7
ltx/en_us_goadedes/oc.m7.d6:ocMA.Kathisma11.text	@ltx/en_us_goadedes/oc.m7.d4:ocMA.Kathisma11.text
ltx/en_us_goadedes/oc.m7.d6:ocMA.Kathisma12.incipit	@ltx/en_us_goadedes/oc.m7.d4:ocMA.Kathisma12.incipit
ltx/en_us_goadedes/oc.m7.d6:ocMA.Kathisma12.melody	
ltx/en_us_goadedes/oc.m7.d6:ocMA.Kathisma12.mode	@ltx/en_us_goadedes/miscellanea:misc.Mode7
ltx/en_us_goadedes/oc.m7.d6:ocMA.Kathisma12.text	@ltx/en_us_goadedes/oc.m7.d4:ocMA.Kathisma12.text
ltx/en_us_goadedes/oc.m7.d6:ocMA.Kathisma13.incipit	…
ltx/en_us_goadedes/oc.m7.d6:ocMA.Kathisma13.melody	
ltx/en_us_goadedes/oc.m7.d6:ocMA.Kathisma13.mode	@ltx/en_us_goadedes/miscellanea:misc.Mode7
ltx/en_us_goadedes/oc.m7.d6:ocMA.Kathisma13.text	
ltx/en_us_goadedes/oc.m7.d6:ocMA.Kathisma21.incipit	@ltx/en_us_goadedes/oc.m7.d4:ocMA.Kathisma21.incipit
ltx/en_us_goadedes/oc.m7.d6:ocMA.Kathisma21.melody	
ltx/en_us_goadedes/oc.m7.d6:ocMA.Kathisma21.mode	@ltx/en_us_goadedes/miscellanea:misc.Mode7
ltx/en_us_goadedes/oc.m7.d6:ocMA.Kathisma21.text	@ltx/en_us_goadedes/oc.m7.d4:ocMA.Kathisma21.text
ltx/en_us_goadedes/oc.m7.d6:ocMA.Kathisma22.incipit	@ltx/en_us_goadedes/oc.m7.d4:ocMA.Kathisma22.incipit
ltx/en_us_goadedes/oc.m7.d6:ocMA.Kathisma22.melody	
ltx/en_us_goadedes/oc.m7.d6:ocMA.Kathisma22.mode	@ltx/en_us_goadedes/miscellanea:misc.Mode7
ltx/en_us_goadedes/oc.m7.d6:ocMA.Kathisma22.text	@ltx/en_us_goadedes/oc.m7.d4:ocMA.Kathisma22.text
ltx/en_us_goadedes/oc.m7.d6:ocMA.Kathisma23.incipit	…
ltx/en_us_goadedes/oc.m7.d6:ocMA.Kathisma23.melody	
ltx/en_us_goadedes/oc.m7.d6:ocMA.Kathisma23.mode	@ltx/en_us_goadedes/miscellanea:misc.Mode7
ltx/en_us_goadedes/oc.m7.d6:ocMA.Kathisma23.text	
ltx/en_us_goadedes/oc.m7.d6:ocMA.Kathisma31.incipit	You cured the damages…
ltx/en_us_goadedes/oc.m7.d6:ocMA.Kathisma31.melody	
ltx/en_us_goadedes/oc.m7.d6:ocMA.Kathisma31.mode	@ltx/en_us_goadedes/miscellanea:misc.Mode7
ltx/en_us_goadedes/oc.m7.d6:ocMA.Kathisma31.text	You cured the damages of Adam, by the tree of Your Cross. We pray You cure our hearts that are shattered, and save us, O Lord.
ltx/en_us_goadedes/oc.m7.d6:ocMA.Kathisma32.incipit	@ltx/en_us_goadedes/oc.m7.d2:ocMA.Kathisma32.incipit
ltx/en_us_goadedes/oc.m7.d6:ocMA.Kathisma32.melody	
ltx/en_us_goadedes/oc.m7.d6:ocMA.Kathisma32.mode	@ltx/en_us_goadedes/miscellanea:misc.Mode7
ltx/en_us_goadedes/oc.m7.d6:ocMA.Kathisma32.text	@ltx/en_us_goadedes/oc.m7.d2:ocMA.Kathisma32.text
ltx/en_us_goadedes/oc.m7.d6:ocMA.Kathisma33.incipit	You conceived in your womb…
ltx/en_us_goadedes/oc.m7.d6:ocMA.Kathisma33.melody	
ltx/en_us_goadedes/oc.m7.d6:ocMA.Kathisma33.mode	@ltx/en_us_goadedes/miscellanea:misc.Mode7
ltx/en_us_goadedes/oc.m7.d6:ocMA.Kathisma33.text	You conceived in your womb without seed, O Virgin Theotokos, Your Son, whom saw as He hung on the Cross. Entreat Him unceasingly, on behalf of our souls.
ltx/en_us_goadedes/oc.m7.d6:ocMA.OdeW1C11.incipit	…
ltx/en_us_goadedes/oc.m7.d6:ocMA.OdeW1C11.melody	@ltx/en_us_goadedes/he.h.m7:heHE.ToEktinaxantiTheo.name
ltx/en_us_goadedes/oc.m7.d6:ocMA.OdeW1C11.mode	@ltx/en_us_goadedes/miscellanea:misc.Mode7
ltx/en_us_goadedes/oc.m7.d6:ocMA.OdeW1C11.ode	@ltx/en_us_goadedes/miscellanea:misc.Ode1
ltx/en_us_goadedes/oc.m7.d6:ocMA.OdeW1C11.text	
ltx/en_us_goadedes/oc.m7.d6:ocMA.OdeW1C12.incipit	…
ltx/en_us_goadedes/oc.m7.d6:ocMA.OdeW1C12.melody	@ltx/en_us_goadedes/he.h.m7:heHE.ToEktinaxantiTheo.name
ltx/en_us_goadedes/oc.m7.d6:ocMA.OdeW1C12.mode	@ltx/en_us_goadedes/miscellanea:misc.Mode7
ltx/en_us_goadedes/oc.m7.d6:ocMA.OdeW1C12.ode	@ltx/en_us_goadedes/miscellanea:misc.Ode1
ltx/en_us_goadedes/oc.m7.d6:ocMA.OdeW1C12.text	
ltx/en_us_goadedes/oc.m7.d6:ocMA.OdeW1C13.incipit	…
ltx/en_us_goadedes/oc.m7.d6:ocMA.OdeW1C13.melody	@ltx/en_us_goadedes/he.h.m7:heHE.ToEktinaxantiTheo.name
ltx/en_us_goadedes/oc.m7.d6:ocMA.OdeW1C13.mode	@ltx/en_us_goadedes/miscellanea:misc.Mode7
ltx/en_us_goadedes/oc.m7.d6:ocMA.OdeW1C13.ode	@ltx/en_us_goadedes/miscellanea:misc.Ode1
ltx/en_us_goadedes/oc.m7.d6:ocMA.OdeW1C13.text	
ltx/en_us_goadedes/oc.m7.d6:ocMA.OdeW1C14.incipit	…
ltx/en_us_goadedes/oc.m7.d6:ocMA.OdeW1C14.melody	@ltx/en_us_goadedes/he.h.m7:heHE.ToEktinaxantiTheo.name
ltx/en_us_goadedes/oc.m7.d6:ocMA.OdeW1C14.mode	@ltx/en_us_goadedes/miscellanea:misc.Mode7
ltx/en_us_goadedes/oc.m7.d6:ocMA.OdeW1C14.ode	@ltx/en_us_goadedes/miscellanea:misc.Ode1
ltx/en_us_goadedes/oc.m7.d6:ocMA.OdeW1C14.text	
ltx/en_us_goadedes/oc.m7.d6:ocMA.OdeW1C1H.greekmelody	@ltx/en_us_goadedes/he.h.m7:heHE.ToEktinaxantiTheo.greekname
ltx/en_us_goadedes/oc.m7.d6:ocMA.OdeW1C1H.incipit	@ltx/en_us_goadedes/he.h.m7:heHE.ToEktinaxantiTheo.incipit
ltx/en_us_goadedes/oc.m7.d6:ocMA.OdeW1C1H.melody	@ltx/en_us_goadedes/he.h.m7:heHE.ToEktinaxantiTheo.melody
ltx/en_us_goadedes/oc.m7.d6:ocMA.OdeW1C1H.mode	@ltx/en_us_goadedes/miscellanea:misc.Mode7
ltx/en_us_goadedes/oc.m7.d6:ocMA.OdeW1C1H.ode	@ltx/en_us_goadedes/miscellanea:misc.Ode1
ltx/en_us_goadedes/oc.m7.d6:ocMA.OdeW1C1H.text	@ltx/en_us_goadedes/he.h.m7:heHE.ToEktinaxantiTheo.text
ltx/en_us_goadedes/oc.m7.d6:ocMA.OdeW1C1T.incipit	…
ltx/en_us_goadedes/oc.m7.d6:ocMA.OdeW1C1T.melody	@ltx/en_us_goadedes/he.h.m7:heHE.ToEktinaxantiTheo.name
ltx/en_us_goadedes/oc.m7.d6:ocMA.OdeW1C1T.mode	@ltx/en_us_goadedes/miscellanea:misc.Mode7
ltx/en_us_goadedes/oc.m7.d6:ocMA.OdeW1C1T.ode	@ltx/en_us_goadedes/miscellanea:misc.Ode1
ltx/en_us_goadedes/oc.m7.d6:ocMA.OdeW1C1T.text	
ltx/en_us_goadedes/oc.m7.d6:ocMA.OdeW1C21.greekmelody	@ltx/en_us_goadedes/he.h.m7:heHE.ToSyntripsantiPolemous.greekname
ltx/en_us_goadedes/oc.m7.d6:ocMA.OdeW1C21.incipit	…
ltx/en_us_goadedes/oc.m7.d6:ocMA.OdeW1C21.melody	@ltx/en_us_goadedes/he.h.m7:heHE.ToSyntripsantiPolemous.name
ltx/en_us_goadedes/oc.m7.d6:ocMA.OdeW1C21.mode	@ltx/en_us_goadedes/miscellanea:misc.Mode7
ltx/en_us_goadedes/oc.m7.d6:ocMA.OdeW1C21.ode	@ltx/en_us_goadedes/miscellanea:misc.Ode1
ltx/en_us_goadedes/oc.m7.d6:ocMA.OdeW1C21.text	
ltx/en_us_goadedes/oc.m7.d6:ocMA.OdeW1C22.incipit	…
ltx/en_us_goadedes/oc.m7.d6:ocMA.OdeW1C22.melody	@ltx/en_us_goadedes/he.h.m7:heHE.ToSyntripsantiPolemous.name
ltx/en_us_goadedes/oc.m7.d6:ocMA.OdeW1C22.mode	@ltx/en_us_goadedes/miscellanea:misc.Mode7
ltx/en_us_goadedes/oc.m7.d6:ocMA.OdeW1C22.ode	@ltx/en_us_goadedes/miscellanea:misc.Ode1
ltx/en_us_goadedes/oc.m7.d6:ocMA.OdeW1C22.text	
ltx/en_us_goadedes/oc.m7.d6:ocMA.OdeW1C23.incipit	…
ltx/en_us_goadedes/oc.m7.d6:ocMA.OdeW1C23.melody	@ltx/en_us_goadedes/he.h.m7:heHE.ToSyntripsantiPolemous.name
ltx/en_us_goadedes/oc.m7.d6:ocMA.OdeW1C23.mode	@ltx/en_us_goadedes/miscellanea:misc.Mode7
ltx/en_us_goadedes/oc.m7.d6:ocMA.OdeW1C23.ode	@ltx/en_us_goadedes/miscellanea:misc.Ode1
ltx/en_us_goadedes/oc.m7.d6:ocMA.OdeW1C23.text	
ltx/en_us_goadedes/oc.m7.d6:ocMA.OdeW1C24.incipit	…
ltx/en_us_goadedes/oc.m7.d6:ocMA.OdeW1C24.melody	@ltx/en_us_goadedes/he.h.m7:heHE.ToSyntripsantiPolemous.name
ltx/en_us_goadedes/oc.m7.d6:ocMA.OdeW1C24.mode	@ltx/en_us_goadedes/miscellanea:misc.Mode7
ltx/en_us_goadedes/oc.m7.d6:ocMA.OdeW1C24.ode	@ltx/en_us_goadedes/miscellanea:misc.Ode1
ltx/en_us_goadedes/oc.m7.d6:ocMA.OdeW1C24.text	
ltx/en_us_goadedes/oc.m7.d6:ocMA.OdeW3C11.incipit	…
ltx/en_us_goadedes/oc.m7.d6:ocMA.OdeW3C11.melody	@ltx/en_us_goadedes/he.h.m7:heHE.EstereothiTiPistei.name
ltx/en_us_goadedes/oc.m7.d6:ocMA.OdeW3C11.mode	@ltx/en_us_goadedes/miscellanea:misc.Mode7
ltx/en_us_goadedes/oc.m7.d6:ocMA.OdeW3C11.ode	@ltx/en_us_goadedes/miscellanea:misc.Ode3
ltx/en_us_goadedes/oc.m7.d6:ocMA.OdeW3C11.text	
ltx/en_us_goadedes/oc.m7.d6:ocMA.OdeW3C12.incipit	…
ltx/en_us_goadedes/oc.m7.d6:ocMA.OdeW3C12.melody	@ltx/en_us_goadedes/he.h.m7:heHE.EstereothiTiPistei.name
ltx/en_us_goadedes/oc.m7.d6:ocMA.OdeW3C12.mode	@ltx/en_us_goadedes/miscellanea:misc.Mode7
ltx/en_us_goadedes/oc.m7.d6:ocMA.OdeW3C12.ode	@ltx/en_us_goadedes/miscellanea:misc.Ode3
ltx/en_us_goadedes/oc.m7.d6:ocMA.OdeW3C12.text	
ltx/en_us_goadedes/oc.m7.d6:ocMA.OdeW3C13.incipit	…
ltx/en_us_goadedes/oc.m7.d6:ocMA.OdeW3C13.melody	@ltx/en_us_goadedes/he.h.m7:heHE.EstereothiTiPistei.name
ltx/en_us_goadedes/oc.m7.d6:ocMA.OdeW3C13.mode	@ltx/en_us_goadedes/miscellanea:misc.Mode7
ltx/en_us_goadedes/oc.m7.d6:ocMA.OdeW3C13.ode	@ltx/en_us_goadedes/miscellanea:misc.Ode3
ltx/en_us_goadedes/oc.m7.d6:ocMA.OdeW3C13.text	
ltx/en_us_goadedes/oc.m7.d6:ocMA.OdeW3C14.incipit	…
ltx/en_us_goadedes/oc.m7.d6:ocMA.OdeW3C14.melody	@ltx/en_us_goadedes/he.h.m7:heHE.EstereothiTiPistei.name
ltx/en_us_goadedes/oc.m7.d6:ocMA.OdeW3C14.mode	@ltx/en_us_goadedes/miscellanea:misc.Mode7
ltx/en_us_goadedes/oc.m7.d6:ocMA.OdeW3C14.ode	@ltx/en_us_goadedes/miscellanea:misc.Ode3
ltx/en_us_goadedes/oc.m7.d6:ocMA.OdeW3C14.text	
ltx/en_us_goadedes/oc.m7.d6:ocMA.OdeW3C1H.greekmelody	@ltx/en_us_goadedes/he.h.m7:heHE.EstereothiTiPistei.greekname
ltx/en_us_goadedes/oc.m7.d6:ocMA.OdeW3C1H.incipit	@ltx/en_us_goadedes/he.h.m7:heHE.EstereothiTiPistei.incipit
ltx/en_us_goadedes/oc.m7.d6:ocMA.OdeW3C1H.melody	@ltx/en_us_goadedes/he.h.m7:heHE.EstereothiTiPistei.melody
ltx/en_us_goadedes/oc.m7.d6:ocMA.OdeW3C1H.mode	@ltx/en_us_goadedes/miscellanea:misc.Mode7
ltx/en_us_goadedes/oc.m7.d6:ocMA.OdeW3C1H.ode	@ltx/en_us_goadedes/miscellanea:misc.Ode3
ltx/en_us_goadedes/oc.m7.d6:ocMA.OdeW3C1H.text	@ltx/en_us_goadedes/he.h.m7:heHE.EstereothiTiPistei.text
ltx/en_us_goadedes/oc.m7.d6:ocMA.OdeW3C1T.incipit	…
ltx/en_us_goadedes/oc.m7.d6:ocMA.OdeW3C1T.melody	@ltx/en_us_goadedes/he.h.m7:heHE.EstereothiTiPistei.name
ltx/en_us_goadedes/oc.m7.d6:ocMA.OdeW3C1T.mode	@ltx/en_us_goadedes/miscellanea:misc.Mode7
ltx/en_us_goadedes/oc.m7.d6:ocMA.OdeW3C1T.ode	@ltx/en_us_goadedes/miscellanea:misc.Ode3
ltx/en_us_goadedes/oc.m7.d6:ocMA.OdeW3C1T.text	
ltx/en_us_goadedes/oc.m7.d6:ocMA.OdeW3C21.greekmelody	@ltx/en_us_goadedes/he.h.m7:heHE.OOuranousToLogo.greekname
ltx/en_us_goadedes/oc.m7.d6:ocMA.OdeW3C21.incipit	…
ltx/en_us_goadedes/oc.m7.d6:ocMA.OdeW3C21.melody	@ltx/en_us_goadedes/he.h.m7:heHE.OOuranousToLogo.name
ltx/en_us_goadedes/oc.m7.d6:ocMA.OdeW3C21.mode	@ltx/en_us_goadedes/miscellanea:misc.Mode7
ltx/en_us_goadedes/oc.m7.d6:ocMA.OdeW3C21.ode	@ltx/en_us_goadedes/miscellanea:misc.Ode3
ltx/en_us_goadedes/oc.m7.d6:ocMA.OdeW3C21.text	
ltx/en_us_goadedes/oc.m7.d6:ocMA.OdeW3C22.incipit	…
ltx/en_us_goadedes/oc.m7.d6:ocMA.OdeW3C22.melody	@ltx/en_us_goadedes/he.h.m7:heHE.OOuranousToLogo.name
ltx/en_us_goadedes/oc.m7.d6:ocMA.OdeW3C22.mode	@ltx/en_us_goadedes/miscellanea:misc.Mode7
ltx/en_us_goadedes/oc.m7.d6:ocMA.OdeW3C22.ode	@ltx/en_us_goadedes/miscellanea:misc.Ode3
ltx/en_us_goadedes/oc.m7.d6:ocMA.OdeW3C22.text	
ltx/en_us_goadedes/oc.m7.d6:ocMA.OdeW3C23.incipit	…
ltx/en_us_goadedes/oc.m7.d6:ocMA.OdeW3C23.melody	@ltx/en_us_goadedes/he.h.m7:heHE.OOuranousToLogo.name
ltx/en_us_goadedes/oc.m7.d6:ocMA.OdeW3C23.mode	@ltx/en_us_goadedes/miscellanea:misc.Mode7
ltx/en_us_goadedes/oc.m7.d6:ocMA.OdeW3C23.ode	@ltx/en_us_goadedes/miscellanea:misc.Ode3
ltx/en_us_goadedes/oc.m7.d6:ocMA.OdeW3C23.text	
ltx/en_us_goadedes/oc.m7.d6:ocMA.OdeW3C24.incipit	…
ltx/en_us_goadedes/oc.m7.d6:ocMA.OdeW3C24.melody	@ltx/en_us_goadedes/he.h.m7:heHE.OOuranousToLogo.name
ltx/en_us_goadedes/oc.m7.d6:ocMA.OdeW3C24.mode	@ltx/en_us_goadedes/miscellanea:misc.Mode7
ltx/en_us_goadedes/oc.m7.d6:ocMA.OdeW3C24.ode	@ltx/en_us_goadedes/miscellanea:misc.Ode3
ltx/en_us_goadedes/oc.m7.d6:ocMA.OdeW3C24.text	
ltx/en_us_goadedes/oc.m7.d6:ocMA.OdeW4C11.incipit	…
ltx/en_us_goadedes/oc.m7.d6:ocMA.OdeW4C11.melody	@ltx/en_us_goadedes/he.h.m7:heHE.EisakikoaTinAkoin.name
ltx/en_us_goadedes/oc.m7.d6:ocMA.OdeW4C11.mode	@ltx/en_us_goadedes/miscellanea:misc.Mode7
ltx/en_us_goadedes/oc.m7.d6:ocMA.OdeW4C11.ode	@ltx/en_us_goadedes/miscellanea:misc.Ode4
ltx/en_us_goadedes/oc.m7.d6:ocMA.OdeW4C11.text	
ltx/en_us_goadedes/oc.m7.d6:ocMA.OdeW4C12.incipit	…
ltx/en_us_goadedes/oc.m7.d6:ocMA.OdeW4C12.melody	@ltx/en_us_goadedes/he.h.m7:heHE.EisakikoaTinAkoin.name
ltx/en_us_goadedes/oc.m7.d6:ocMA.OdeW4C12.mode	@ltx/en_us_goadedes/miscellanea:misc.Mode7
ltx/en_us_goadedes/oc.m7.d6:ocMA.OdeW4C12.ode	@ltx/en_us_goadedes/miscellanea:misc.Ode4
ltx/en_us_goadedes/oc.m7.d6:ocMA.OdeW4C12.text	
ltx/en_us_goadedes/oc.m7.d6:ocMA.OdeW4C13.incipit	…
ltx/en_us_goadedes/oc.m7.d6:ocMA.OdeW4C13.melody	@ltx/en_us_goadedes/he.h.m7:heHE.EisakikoaTinAkoin.name
ltx/en_us_goadedes/oc.m7.d6:ocMA.OdeW4C13.mode	@ltx/en_us_goadedes/miscellanea:misc.Mode7
ltx/en_us_goadedes/oc.m7.d6:ocMA.OdeW4C13.ode	@ltx/en_us_goadedes/miscellanea:misc.Ode4
ltx/en_us_goadedes/oc.m7.d6:ocMA.OdeW4C13.text	
ltx/en_us_goadedes/oc.m7.d6:ocMA.OdeW4C14.incipit	…
ltx/en_us_goadedes/oc.m7.d6:ocMA.OdeW4C14.melody	@ltx/en_us_goadedes/he.h.m7:heHE.EisakikoaTinAkoin.name
ltx/en_us_goadedes/oc.m7.d6:ocMA.OdeW4C14.mode	@ltx/en_us_goadedes/miscellanea:misc.Mode7
ltx/en_us_goadedes/oc.m7.d6:ocMA.OdeW4C14.ode	@ltx/en_us_goadedes/miscellanea:misc.Ode4
ltx/en_us_goadedes/oc.m7.d6:ocMA.OdeW4C14.text	
ltx/en_us_goadedes/oc.m7.d6:ocMA.OdeW4C1H.greekmelody	@ltx/en_us_goadedes/he.h.m7:heHE.EisakikoaTinAkoin.greekname
ltx/en_us_goadedes/oc.m7.d6:ocMA.OdeW4C1H.incipit	@ltx/en_us_goadedes/he.h.m7:heHE.EisakikoaTinAkoin.incipit
ltx/en_us_goadedes/oc.m7.d6:ocMA.OdeW4C1H.melody	@ltx/en_us_goadedes/he.h.m7:heHE.EisakikoaTinAkoin.melody
ltx/en_us_goadedes/oc.m7.d6:ocMA.OdeW4C1H.mode	@ltx/en_us_goadedes/miscellanea:misc.Mode7
ltx/en_us_goadedes/oc.m7.d6:ocMA.OdeW4C1H.ode	@ltx/en_us_goadedes/miscellanea:misc.Ode4
ltx/en_us_goadedes/oc.m7.d6:ocMA.OdeW4C1H.text	@ltx/en_us_goadedes/he.h.m7:heHE.EisakikoaTinAkoin.text
ltx/en_us_goadedes/oc.m7.d6:ocMA.OdeW4C1T.incipit	…
ltx/en_us_goadedes/oc.m7.d6:ocMA.OdeW4C1T.melody	@ltx/en_us_goadedes/he.h.m7:heHE.EisakikoaTinAkoin.name
ltx/en_us_goadedes/oc.m7.d6:ocMA.OdeW4C1T.mode	@ltx/en_us_goadedes/miscellanea:misc.Mode7
ltx/en_us_goadedes/oc.m7.d6:ocMA.OdeW4C1T.ode	@ltx/en_us_goadedes/miscellanea:misc.Ode4
ltx/en_us_goadedes/oc.m7.d6:ocMA.OdeW4C1T.text	
ltx/en_us_goadedes/oc.m7.d6:ocMA.OdeW4C21.greekmelody	@ltx/en_us_goadedes/he.h.m3:heHE.EkalypsenOuranous.greekname
ltx/en_us_goadedes/oc.m7.d6:ocMA.OdeW4C21.incipit	…
ltx/en_us_goadedes/oc.m7.d6:ocMA.OdeW4C21.melody	@ltx/en_us_goadedes/he.h.m3:heHE.EkalypsenOuranous.name
ltx/en_us_goadedes/oc.m7.d6:ocMA.OdeW4C21.mode	@ltx/en_us_goadedes/miscellanea:misc.Mode7
ltx/en_us_goadedes/oc.m7.d6:ocMA.OdeW4C21.ode	@ltx/en_us_goadedes/miscellanea:misc.Ode4
ltx/en_us_goadedes/oc.m7.d6:ocMA.OdeW4C21.text	
ltx/en_us_goadedes/oc.m7.d6:ocMA.OdeW4C22.incipit	…
ltx/en_us_goadedes/oc.m7.d6:ocMA.OdeW4C22.melody	@ltx/en_us_goadedes/he.h.m3:heHE.EkalypsenOuranous.name
ltx/en_us_goadedes/oc.m7.d6:ocMA.OdeW4C22.mode	@ltx/en_us_goadedes/miscellanea:misc.Mode7
ltx/en_us_goadedes/oc.m7.d6:ocMA.OdeW4C22.ode	@ltx/en_us_goadedes/miscellanea:misc.Ode4
ltx/en_us_goadedes/oc.m7.d6:ocMA.OdeW4C22.text	
ltx/en_us_goadedes/oc.m7.d6:ocMA.OdeW4C23.incipit	…
ltx/en_us_goadedes/oc.m7.d6:ocMA.OdeW4C23.melody	@ltx/en_us_goadedes/he.h.m3:heHE.EkalypsenOuranous.name
ltx/en_us_goadedes/oc.m7.d6:ocMA.OdeW4C23.mode	@ltx/en_us_goadedes/miscellanea:misc.Mode7
ltx/en_us_goadedes/oc.m7.d6:ocMA.OdeW4C23.ode	@ltx/en_us_goadedes/miscellanea:misc.Ode4
ltx/en_us_goadedes/oc.m7.d6:ocMA.OdeW4C23.text	
ltx/en_us_goadedes/oc.m7.d6:ocMA.OdeW4C24.incipit	…
ltx/en_us_goadedes/oc.m7.d6:ocMA.OdeW4C24.melody	@ltx/en_us_goadedes/he.h.m3:heHE.EkalypsenOuranous.name
ltx/en_us_goadedes/oc.m7.d6:ocMA.OdeW4C24.mode	@ltx/en_us_goadedes/miscellanea:misc.Mode7
ltx/en_us_goadedes/oc.m7.d6:ocMA.OdeW4C24.ode	@ltx/en_us_goadedes/miscellanea:misc.Ode4
ltx/en_us_goadedes/oc.m7.d6:ocMA.OdeW4C24.text	
ltx/en_us_goadedes/oc.m7.d6:ocMA.OdeW5C11.incipit	…
ltx/en_us_goadedes/oc.m7.d6:ocMA.OdeW5C11.melody	@ltx/en_us_goadedes/he.h.m7:heHE.OrthrizeiToPnevmaMou.name
ltx/en_us_goadedes/oc.m7.d6:ocMA.OdeW5C11.mode	@ltx/en_us_goadedes/miscellanea:misc.Mode7
ltx/en_us_goadedes/oc.m7.d6:ocMA.OdeW5C11.ode	@ltx/en_us_goadedes/miscellanea:misc.Ode5
ltx/en_us_goadedes/oc.m7.d6:ocMA.OdeW5C11.text	
ltx/en_us_goadedes/oc.m7.d6:ocMA.OdeW5C12.incipit	…
ltx/en_us_goadedes/oc.m7.d6:ocMA.OdeW5C12.melody	@ltx/en_us_goadedes/he.h.m7:heHE.OrthrizeiToPnevmaMou.name
ltx/en_us_goadedes/oc.m7.d6:ocMA.OdeW5C12.mode	@ltx/en_us_goadedes/miscellanea:misc.Mode7
ltx/en_us_goadedes/oc.m7.d6:ocMA.OdeW5C12.ode	@ltx/en_us_goadedes/miscellanea:misc.Ode5
ltx/en_us_goadedes/oc.m7.d6:ocMA.OdeW5C12.text	
ltx/en_us_goadedes/oc.m7.d6:ocMA.OdeW5C13.incipit	…
ltx/en_us_goadedes/oc.m7.d6:ocMA.OdeW5C13.melody	@ltx/en_us_goadedes/he.h.m7:heHE.OrthrizeiToPnevmaMou.name
ltx/en_us_goadedes/oc.m7.d6:ocMA.OdeW5C13.mode	@ltx/en_us_goadedes/miscellanea:misc.Mode7
ltx/en_us_goadedes/oc.m7.d6:ocMA.OdeW5C13.ode	@ltx/en_us_goadedes/miscellanea:misc.Ode5
ltx/en_us_goadedes/oc.m7.d6:ocMA.OdeW5C13.text	
ltx/en_us_goadedes/oc.m7.d6:ocMA.OdeW5C14.incipit	…
ltx/en_us_goadedes/oc.m7.d6:ocMA.OdeW5C14.melody	@ltx/en_us_goadedes/he.h.m7:heHE.OrthrizeiToPnevmaMou.name
ltx/en_us_goadedes/oc.m7.d6:ocMA.OdeW5C14.mode	@ltx/en_us_goadedes/miscellanea:misc.Mode7
ltx/en_us_goadedes/oc.m7.d6:ocMA.OdeW5C14.ode	@ltx/en_us_goadedes/miscellanea:misc.Ode5
ltx/en_us_goadedes/oc.m7.d6:ocMA.OdeW5C14.text	
ltx/en_us_goadedes/oc.m7.d6:ocMA.OdeW5C1H.greekmelody	@ltx/en_us_goadedes/he.h.m7:heHE.OrthrizeiToPnevmaMou.greekname
ltx/en_us_goadedes/oc.m7.d6:ocMA.OdeW5C1H.incipit	@ltx/en_us_goadedes/he.h.m7:heHE.OrthrizeiToPnevmaMou.incipit
ltx/en_us_goadedes/oc.m7.d6:ocMA.OdeW5C1H.melody	@ltx/en_us_goadedes/he.h.m7:heHE.OrthrizeiToPnevmaMou.melody
ltx/en_us_goadedes/oc.m7.d6:ocMA.OdeW5C1H.mode	@ltx/en_us_goadedes/miscellanea:misc.Mode7
ltx/en_us_goadedes/oc.m7.d6:ocMA.OdeW5C1H.ode	@ltx/en_us_goadedes/miscellanea:misc.Ode5
ltx/en_us_goadedes/oc.m7.d6:ocMA.OdeW5C1H.text	@ltx/en_us_goadedes/he.h.m7:heHE.OrthrizeiToPnevmaMou.text
ltx/en_us_goadedes/oc.m7.d6:ocMA.OdeW5C1T.incipit	…
ltx/en_us_goadedes/oc.m7.d6:ocMA.OdeW5C1T.melody	@ltx/en_us_goadedes/he.h.m7:heHE.OrthrizeiToPnevmaMou.name
ltx/en_us_goadedes/oc.m7.d6:ocMA.OdeW5C1T.mode	@ltx/en_us_goadedes/miscellanea:misc.Mode7
ltx/en_us_goadedes/oc.m7.d6:ocMA.OdeW5C1T.ode	@ltx/en_us_goadedes/miscellanea:misc.Ode5
ltx/en_us_goadedes/oc.m7.d6:ocMA.OdeW5C1T.text	
ltx/en_us_goadedes/oc.m7.d6:ocMA.OdeW5C21.greekmelody	@ltx/en_us_goadedes/he.h.m7:heHE.DiaskedasasTinNykta.greekname
ltx/en_us_goadedes/oc.m7.d6:ocMA.OdeW5C21.incipit	…
ltx/en_us_goadedes/oc.m7.d6:ocMA.OdeW5C21.melody	@ltx/en_us_goadedes/he.h.m7:heHE.DiaskedasasTinNykta.name
ltx/en_us_goadedes/oc.m7.d6:ocMA.OdeW5C21.mode	@ltx/en_us_goadedes/miscellanea:misc.Mode7
ltx/en_us_goadedes/oc.m7.d6:ocMA.OdeW5C21.ode	@ltx/en_us_goadedes/miscellanea:misc.Ode5
ltx/en_us_goadedes/oc.m7.d6:ocMA.OdeW5C21.text	
ltx/en_us_goadedes/oc.m7.d6:ocMA.OdeW5C22.incipit	…
ltx/en_us_goadedes/oc.m7.d6:ocMA.OdeW5C22.melody	@ltx/en_us_goadedes/he.h.m7:heHE.DiaskedasasTinNykta.name
ltx/en_us_goadedes/oc.m7.d6:ocMA.OdeW5C22.mode	@ltx/en_us_goadedes/miscellanea:misc.Mode7
ltx/en_us_goadedes/oc.m7.d6:ocMA.OdeW5C22.ode	@ltx/en_us_goadedes/miscellanea:misc.Ode5
ltx/en_us_goadedes/oc.m7.d6:ocMA.OdeW5C22.text	
ltx/en_us_goadedes/oc.m7.d6:ocMA.OdeW5C23.incipit	…
ltx/en_us_goadedes/oc.m7.d6:ocMA.OdeW5C23.melody	@ltx/en_us_goadedes/he.h.m7:heHE.DiaskedasasTinNykta.name
ltx/en_us_goadedes/oc.m7.d6:ocMA.OdeW5C23.mode	@ltx/en_us_goadedes/miscellanea:misc.Mode7
ltx/en_us_goadedes/oc.m7.d6:ocMA.OdeW5C23.ode	@ltx/en_us_goadedes/miscellanea:misc.Ode5
ltx/en_us_goadedes/oc.m7.d6:ocMA.OdeW5C23.text	
ltx/en_us_goadedes/oc.m7.d6:ocMA.OdeW5C24.incipit	…
ltx/en_us_goadedes/oc.m7.d6:ocMA.OdeW5C24.melody	@ltx/en_us_goadedes/he.h.m7:heHE.DiaskedasasTinNykta.name
ltx/en_us_goadedes/oc.m7.d6:ocMA.OdeW5C24.mode	@ltx/en_us_goadedes/miscellanea:misc.Mode7
ltx/en_us_goadedes/oc.m7.d6:ocMA.OdeW5C24.ode	@ltx/en_us_goadedes/miscellanea:misc.Ode5
ltx/en_us_goadedes/oc.m7.d6:ocMA.OdeW5C24.text	
ltx/en_us_goadedes/oc.m7.d6:ocMA.OdeW6C11.incipit	…
ltx/en_us_goadedes/oc.m7.d6:ocMA.OdeW6C11.melody	@ltx/en_us_goadedes/he.h.m7:heHE.OIonasEkKoilias.name
ltx/en_us_goadedes/oc.m7.d6:ocMA.OdeW6C11.mode	@ltx/en_us_goadedes/miscellanea:misc.Mode7
ltx/en_us_goadedes/oc.m7.d6:ocMA.OdeW6C11.ode	@ltx/en_us_goadedes/miscellanea:misc.Ode6
ltx/en_us_goadedes/oc.m7.d6:ocMA.OdeW6C11.text	
ltx/en_us_goadedes/oc.m7.d6:ocMA.OdeW6C12.incipit	…
ltx/en_us_goadedes/oc.m7.d6:ocMA.OdeW6C12.melody	@ltx/en_us_goadedes/he.h.m7:heHE.OIonasEkKoilias.name
ltx/en_us_goadedes/oc.m7.d6:ocMA.OdeW6C12.mode	@ltx/en_us_goadedes/miscellanea:misc.Mode7
ltx/en_us_goadedes/oc.m7.d6:ocMA.OdeW6C12.ode	@ltx/en_us_goadedes/miscellanea:misc.Ode6
ltx/en_us_goadedes/oc.m7.d6:ocMA.OdeW6C12.text	
ltx/en_us_goadedes/oc.m7.d6:ocMA.OdeW6C13.incipit	…
ltx/en_us_goadedes/oc.m7.d6:ocMA.OdeW6C13.melody	@ltx/en_us_goadedes/he.h.m7:heHE.OIonasEkKoilias.name
ltx/en_us_goadedes/oc.m7.d6:ocMA.OdeW6C13.mode	@ltx/en_us_goadedes/miscellanea:misc.Mode7
ltx/en_us_goadedes/oc.m7.d6:ocMA.OdeW6C13.ode	@ltx/en_us_goadedes/miscellanea:misc.Ode6
ltx/en_us_goadedes/oc.m7.d6:ocMA.OdeW6C13.text	
ltx/en_us_goadedes/oc.m7.d6:ocMA.OdeW6C14.incipit	…
ltx/en_us_goadedes/oc.m7.d6:ocMA.OdeW6C14.melody	@ltx/en_us_goadedes/he.h.m7:heHE.OIonasEkKoilias.name
ltx/en_us_goadedes/oc.m7.d6:ocMA.OdeW6C14.mode	@ltx/en_us_goadedes/miscellanea:misc.Mode7
ltx/en_us_goadedes/oc.m7.d6:ocMA.OdeW6C14.ode	@ltx/en_us_goadedes/miscellanea:misc.Ode6
ltx/en_us_goadedes/oc.m7.d6:ocMA.OdeW6C14.text	
ltx/en_us_goadedes/oc.m7.d6:ocMA.OdeW6C15.incipit	…
ltx/en_us_goadedes/oc.m7.d6:ocMA.OdeW6C15.melody	@ltx/en_us_goadedes/he.h.m7:heHE.OIonasEkKoilias.name
ltx/en_us_goadedes/oc.m7.d6:ocMA.OdeW6C15.mode	@ltx/en_us_goadedes/miscellanea:misc.Mode7
ltx/en_us_goadedes/oc.m7.d6:ocMA.OdeW6C15.ode	@ltx/en_us_goadedes/miscellanea:misc.Ode6
ltx/en_us_goadedes/oc.m7.d6:ocMA.OdeW6C15.text	
ltx/en_us_goadedes/oc.m7.d6:ocMA.OdeW6C1H.greekmelody	@ltx/en_us_goadedes/he.h.m7:heHE.OIonasEkKoilias.greekname
ltx/en_us_goadedes/oc.m7.d6:ocMA.OdeW6C1H.incipit	@ltx/en_us_goadedes/he.h.m7:heHE.OIonasEkKoilias.incipit
ltx/en_us_goadedes/oc.m7.d6:ocMA.OdeW6C1H.melody	@ltx/en_us_goadedes/he.h.m7:heHE.OIonasEkKoilias.melody
ltx/en_us_goadedes/oc.m7.d6:ocMA.OdeW6C1H.mode	@ltx/en_us_goadedes/miscellanea:misc.Mode7
ltx/en_us_goadedes/oc.m7.d6:ocMA.OdeW6C1H.ode	@ltx/en_us_goadedes/miscellanea:misc.Ode6
ltx/en_us_goadedes/oc.m7.d6:ocMA.OdeW6C1H.text	@ltx/en_us_goadedes/he.h.m7:heHE.OIonasEkKoilias.text
ltx/en_us_goadedes/oc.m7.d6:ocMA.OdeW6C1T.incipit	…
ltx/en_us_goadedes/oc.m7.d6:ocMA.OdeW6C1T.melody	@ltx/en_us_goadedes/he.h.m7:heHE.OIonasEkKoilias.name
ltx/en_us_goadedes/oc.m7.d6:ocMA.OdeW6C1T.mode	@ltx/en_us_goadedes/miscellanea:misc.Mode7
ltx/en_us_goadedes/oc.m7.d6:ocMA.OdeW6C1T.ode	@ltx/en_us_goadedes/miscellanea:misc.Ode6
ltx/en_us_goadedes/oc.m7.d6:ocMA.OdeW6C1T.text	
ltx/en_us_goadedes/oc.m7.d6:ocMA.OdeW6C21.greekmelody	@ltx/en_us_goadedes/he.h.m7:heHE.VythoAmartimaton.greekname
ltx/en_us_goadedes/oc.m7.d6:ocMA.OdeW6C21.incipit	…
ltx/en_us_goadedes/oc.m7.d6:ocMA.OdeW6C21.melody	@ltx/en_us_goadedes/he.h.m7:heHE.VythoAmartimaton.name
ltx/en_us_goadedes/oc.m7.d6:ocMA.OdeW6C21.mode	@ltx/en_us_goadedes/miscellanea:misc.Mode7
ltx/en_us_goadedes/oc.m7.d6:ocMA.OdeW6C21.ode	@ltx/en_us_goadedes/miscellanea:misc.Ode6
ltx/en_us_goadedes/oc.m7.d6:ocMA.OdeW6C21.text	
ltx/en_us_goadedes/oc.m7.d6:ocMA.OdeW6C22.incipit	…
ltx/en_us_goadedes/oc.m7.d6:ocMA.OdeW6C22.melody	@ltx/en_us_goadedes/he.h.m7:heHE.VythoAmartimaton.name
ltx/en_us_goadedes/oc.m7.d6:ocMA.OdeW6C22.mode	@ltx/en_us_goadedes/miscellanea:misc.Mode7
ltx/en_us_goadedes/oc.m7.d6:ocMA.OdeW6C22.ode	@ltx/en_us_goadedes/miscellanea:misc.Ode6
ltx/en_us_goadedes/oc.m7.d6:ocMA.OdeW6C22.text	
ltx/en_us_goadedes/oc.m7.d6:ocMA.OdeW6C23.incipit	…
ltx/en_us_goadedes/oc.m7.d6:ocMA.OdeW6C23.melody	@ltx/en_us_goadedes/he.h.m7:heHE.VythoAmartimaton.name
ltx/en_us_goadedes/oc.m7.d6:ocMA.OdeW6C23.mode	@ltx/en_us_goadedes/miscellanea:misc.Mode7
ltx/en_us_goadedes/oc.m7.d6:ocMA.OdeW6C23.ode	@ltx/en_us_goadedes/miscellanea:misc.Ode6
ltx/en_us_goadedes/oc.m7.d6:ocMA.OdeW6C23.text	
ltx/en_us_goadedes/oc.m7.d6:ocMA.OdeW6C24.incipit	…
ltx/en_us_goadedes/oc.m7.d6:ocMA.OdeW6C24.melody	@ltx/en_us_goadedes/he.h.m7:heHE.VythoAmartimaton.name
ltx/en_us_goadedes/oc.m7.d6:ocMA.OdeW6C24.mode	@ltx/en_us_goadedes/miscellanea:misc.Mode7
ltx/en_us_goadedes/oc.m7.d6:ocMA.OdeW6C24.ode	@ltx/en_us_goadedes/miscellanea:misc.Ode6
ltx/en_us_goadedes/oc.m7.d6:ocMA.OdeW6C24.text	
ltx/en_us_goadedes/oc.m7.d6:ocMA.OdeW7C11.incipit	…
ltx/en_us_goadedes/oc.m7.d6:ocMA.OdeW7C11.melody	@ltx/en_us_goadedes/he.h.m7:heHE.KaminonPaides.name
ltx/en_us_goadedes/oc.m7.d6:ocMA.OdeW7C11.mode	@ltx/en_us_goadedes/miscellanea:misc.Mode7
ltx/en_us_goadedes/oc.m7.d6:ocMA.OdeW7C11.ode	@ltx/en_us_goadedes/miscellanea:misc.Ode7
ltx/en_us_goadedes/oc.m7.d6:ocMA.OdeW7C11.text	
ltx/en_us_goadedes/oc.m7.d6:ocMA.OdeW7C12.incipit	…
ltx/en_us_goadedes/oc.m7.d6:ocMA.OdeW7C12.melody	@ltx/en_us_goadedes/he.h.m7:heHE.KaminonPaides.name
ltx/en_us_goadedes/oc.m7.d6:ocMA.OdeW7C12.mode	@ltx/en_us_goadedes/miscellanea:misc.Mode7
ltx/en_us_goadedes/oc.m7.d6:ocMA.OdeW7C12.ode	@ltx/en_us_goadedes/miscellanea:misc.Ode7
ltx/en_us_goadedes/oc.m7.d6:ocMA.OdeW7C12.text	
ltx/en_us_goadedes/oc.m7.d6:ocMA.OdeW7C13.incipit	…
ltx/en_us_goadedes/oc.m7.d6:ocMA.OdeW7C13.melody	@ltx/en_us_goadedes/he.h.m7:heHE.KaminonPaides.name
ltx/en_us_goadedes/oc.m7.d6:ocMA.OdeW7C13.mode	@ltx/en_us_goadedes/miscellanea:misc.Mode7
ltx/en_us_goadedes/oc.m7.d6:ocMA.OdeW7C13.ode	@ltx/en_us_goadedes/miscellanea:misc.Ode7
ltx/en_us_goadedes/oc.m7.d6:ocMA.OdeW7C13.text	
ltx/en_us_goadedes/oc.m7.d6:ocMA.OdeW7C14.incipit	…
ltx/en_us_goadedes/oc.m7.d6:ocMA.OdeW7C14.melody	@ltx/en_us_goadedes/he.h.m7:heHE.KaminonPaides.name
ltx/en_us_goadedes/oc.m7.d6:ocMA.OdeW7C14.mode	@ltx/en_us_goadedes/miscellanea:misc.Mode7
ltx/en_us_goadedes/oc.m7.d6:ocMA.OdeW7C14.ode	@ltx/en_us_goadedes/miscellanea:misc.Ode7
ltx/en_us_goadedes/oc.m7.d6:ocMA.OdeW7C14.text	
ltx/en_us_goadedes/oc.m7.d6:ocMA.OdeW7C1H.greekmelody	@ltx/en_us_goadedes/he.h.m7:heHE.KaminonPaides.greekname
ltx/en_us_goadedes/oc.m7.d6:ocMA.OdeW7C1H.incipit	@ltx/en_us_goadedes/he.h.m7:heHE.KaminonPaides.incipit
ltx/en_us_goadedes/oc.m7.d6:ocMA.OdeW7C1H.melody	@ltx/en_us_goadedes/he.h.m7:heHE.KaminonPaides.melody
ltx/en_us_goadedes/oc.m7.d6:ocMA.OdeW7C1H.mode	@ltx/en_us_goadedes/miscellanea:misc.Mode7
ltx/en_us_goadedes/oc.m7.d6:ocMA.OdeW7C1H.ode	@ltx/en_us_goadedes/miscellanea:misc.Ode7
ltx/en_us_goadedes/oc.m7.d6:ocMA.OdeW7C1H.text	@ltx/en_us_goadedes/he.h.m7:heHE.KaminonPaides.text
ltx/en_us_goadedes/oc.m7.d6:ocMA.OdeW7C1T.incipit	…
ltx/en_us_goadedes/oc.m7.d6:ocMA.OdeW7C1T.melody	@ltx/en_us_goadedes/he.h.m7:heHE.KaminonPaides.name
ltx/en_us_goadedes/oc.m7.d6:ocMA.OdeW7C1T.mode	@ltx/en_us_goadedes/miscellanea:misc.Mode7
ltx/en_us_goadedes/oc.m7.d6:ocMA.OdeW7C1T.ode	@ltx/en_us_goadedes/miscellanea:misc.Ode7
ltx/en_us_goadedes/oc.m7.d6:ocMA.OdeW7C1T.text	
ltx/en_us_goadedes/oc.m7.d6:ocMA.OdeW7C21.greekmelody	@ltx/en_us_goadedes/he.h.m7:heHE.TousEnKaminoPaidasMimoumenoi.greekname
ltx/en_us_goadedes/oc.m7.d6:ocMA.OdeW7C21.incipit	…
ltx/en_us_goadedes/oc.m7.d6:ocMA.OdeW7C21.melody	@ltx/en_us_goadedes/he.h.m7:heHE.TousEnKaminoPaidasMimoumenoi.name
ltx/en_us_goadedes/oc.m7.d6:ocMA.OdeW7C21.mode	@ltx/en_us_goadedes/miscellanea:misc.Mode7
ltx/en_us_goadedes/oc.m7.d6:ocMA.OdeW7C21.ode	@ltx/en_us_goadedes/miscellanea:misc.Ode7
ltx/en_us_goadedes/oc.m7.d6:ocMA.OdeW7C21.text	
ltx/en_us_goadedes/oc.m7.d6:ocMA.OdeW7C22.incipit	…
ltx/en_us_goadedes/oc.m7.d6:ocMA.OdeW7C22.melody	@ltx/en_us_goadedes/he.h.m7:heHE.TousEnKaminoPaidasMimoumenoi.name
ltx/en_us_goadedes/oc.m7.d6:ocMA.OdeW7C22.mode	@ltx/en_us_goadedes/miscellanea:misc.Mode7
ltx/en_us_goadedes/oc.m7.d6:ocMA.OdeW7C22.ode	@ltx/en_us_goadedes/miscellanea:misc.Ode7
ltx/en_us_goadedes/oc.m7.d6:ocMA.OdeW7C22.text	
ltx/en_us_goadedes/oc.m7.d6:ocMA.OdeW7C23.incipit	…
ltx/en_us_goadedes/oc.m7.d6:ocMA.OdeW7C23.melody	@ltx/en_us_goadedes/he.h.m7:heHE.TousEnKaminoPaidasMimoumenoi.name
ltx/en_us_goadedes/oc.m7.d6:ocMA.OdeW7C23.mode	@ltx/en_us_goadedes/miscellanea:misc.Mode7
ltx/en_us_goadedes/oc.m7.d6:ocMA.OdeW7C23.ode	@ltx/en_us_goadedes/miscellanea:misc.Ode7
ltx/en_us_goadedes/oc.m7.d6:ocMA.OdeW7C23.text	
ltx/en_us_goadedes/oc.m7.d6:ocMA.OdeW7C24.incipit	…
ltx/en_us_goadedes/oc.m7.d6:ocMA.OdeW7C24.melody	@ltx/en_us_goadedes/he.h.m7:heHE.TousEnKaminoPaidasMimoumenoi.name
ltx/en_us_goadedes/oc.m7.d6:ocMA.OdeW7C24.mode	@ltx/en_us_goadedes/miscellanea:misc.Mode7
ltx/en_us_goadedes/oc.m7.d6:ocMA.OdeW7C24.ode	@ltx/en_us_goadedes/miscellanea:misc.Ode7
ltx/en_us_goadedes/oc.m7.d6:ocMA.OdeW7C24.text	
ltx/en_us_goadedes/oc.m7.d6:ocMA.OdeW8C11.incipit	…
ltx/en_us_goadedes/oc.m7.d6:ocMA.OdeW8C11.melody	@ltx/en_us_goadedes/he.h.m7:heHE.TonMononAnarchon.name
ltx/en_us_goadedes/oc.m7.d6:ocMA.OdeW8C11.mode	@ltx/en_us_goadedes/miscellanea:misc.Mode7
ltx/en_us_goadedes/oc.m7.d6:ocMA.OdeW8C11.ode	@ltx/en_us_goadedes/miscellanea:misc.Ode8
ltx/en_us_goadedes/oc.m7.d6:ocMA.OdeW8C11.text	
ltx/en_us_goadedes/oc.m7.d6:ocMA.OdeW8C12.incipit	…
ltx/en_us_goadedes/oc.m7.d6:ocMA.OdeW8C12.melody	@ltx/en_us_goadedes/he.h.m7:heHE.TonMononAnarchon.name
ltx/en_us_goadedes/oc.m7.d6:ocMA.OdeW8C12.mode	@ltx/en_us_goadedes/miscellanea:misc.Mode7
ltx/en_us_goadedes/oc.m7.d6:ocMA.OdeW8C12.ode	@ltx/en_us_goadedes/miscellanea:misc.Ode8
ltx/en_us_goadedes/oc.m7.d6:ocMA.OdeW8C12.text	
ltx/en_us_goadedes/oc.m7.d6:ocMA.OdeW8C13.incipit	…
ltx/en_us_goadedes/oc.m7.d6:ocMA.OdeW8C13.melody	@ltx/en_us_goadedes/he.h.m7:heHE.TonMononAnarchon.name
ltx/en_us_goadedes/oc.m7.d6:ocMA.OdeW8C13.mode	@ltx/en_us_goadedes/miscellanea:misc.Mode7
ltx/en_us_goadedes/oc.m7.d6:ocMA.OdeW8C13.ode	@ltx/en_us_goadedes/miscellanea:misc.Ode8
ltx/en_us_goadedes/oc.m7.d6:ocMA.OdeW8C13.text	
ltx/en_us_goadedes/oc.m7.d6:ocMA.OdeW8C14.incipit	…
ltx/en_us_goadedes/oc.m7.d6:ocMA.OdeW8C14.melody	@ltx/en_us_goadedes/he.h.m7:heHE.TonMononAnarchon.name
ltx/en_us_goadedes/oc.m7.d6:ocMA.OdeW8C14.mode	@ltx/en_us_goadedes/miscellanea:misc.Mode7
ltx/en_us_goadedes/oc.m7.d6:ocMA.OdeW8C14.ode	@ltx/en_us_goadedes/miscellanea:misc.Ode8
ltx/en_us_goadedes/oc.m7.d6:ocMA.OdeW8C14.text	
ltx/en_us_goadedes/oc.m7.d6:ocMA.OdeW8C1H.greekmelody	@ltx/en_us_goadedes/he.h.m7:heHE.TonMononAnarchon.greekname
ltx/en_us_goadedes/oc.m7.d6:ocMA.OdeW8C1H.incipit	@ltx/en_us_goadedes/he.h.m7:heHE.TonMononAnarchon.incipit
ltx/en_us_goadedes/oc.m7.d6:ocMA.OdeW8C1H.melody	@ltx/en_us_goadedes/he.h.m7:heHE.TonMononAnarchon.melody
ltx/en_us_goadedes/oc.m7.d6:ocMA.OdeW8C1H.mode	@ltx/en_us_goadedes/miscellanea:misc.Mode7
ltx/en_us_goadedes/oc.m7.d6:ocMA.OdeW8C1H.ode	@ltx/en_us_goadedes/miscellanea:misc.Ode8
ltx/en_us_goadedes/oc.m7.d6:ocMA.OdeW8C1H.text	@ltx/en_us_goadedes/he.h.m7:heHE.TonMononAnarchon.text
ltx/en_us_goadedes/oc.m7.d6:ocMA.OdeW8C1T.incipit	…
ltx/en_us_goadedes/oc.m7.d6:ocMA.OdeW8C1T.melody	@ltx/en_us_goadedes/he.h.m7:heHE.TonMononAnarchon.name
ltx/en_us_goadedes/oc.m7.d6:ocMA.OdeW8C1T.mode	@ltx/en_us_goadedes/miscellanea:misc.Mode7
ltx/en_us_goadedes/oc.m7.d6:ocMA.OdeW8C1T.ode	@ltx/en_us_goadedes/miscellanea:misc.Ode8
ltx/en_us_goadedes/oc.m7.d6:ocMA.OdeW8C1T.text	
ltx/en_us_goadedes/oc.m7.d6:ocMA.OdeW8C21.greekmelody	@ltx/en_us_goadedes/he.h.m7:heHE.TonYpAngelonAsigitos.greekname
ltx/en_us_goadedes/oc.m7.d6:ocMA.OdeW8C21.incipit	…
ltx/en_us_goadedes/oc.m7.d6:ocMA.OdeW8C21.melody	@ltx/en_us_goadedes/he.h.m7:heHE.TonYpAngelonAsigitos.name
ltx/en_us_goadedes/oc.m7.d6:ocMA.OdeW8C21.mode	@ltx/en_us_goadedes/miscellanea:misc.Mode7
ltx/en_us_goadedes/oc.m7.d6:ocMA.OdeW8C21.ode	@ltx/en_us_goadedes/miscellanea:misc.Ode8
ltx/en_us_goadedes/oc.m7.d6:ocMA.OdeW8C21.text	
ltx/en_us_goadedes/oc.m7.d6:ocMA.OdeW8C22.incipit	…
ltx/en_us_goadedes/oc.m7.d6:ocMA.OdeW8C22.melody	@ltx/en_us_goadedes/he.h.m7:heHE.TonYpAngelonAsigitos.name
ltx/en_us_goadedes/oc.m7.d6:ocMA.OdeW8C22.mode	@ltx/en_us_goadedes/miscellanea:misc.Mode7
ltx/en_us_goadedes/oc.m7.d6:ocMA.OdeW8C22.ode	@ltx/en_us_goadedes/miscellanea:misc.Ode8
ltx/en_us_goadedes/oc.m7.d6:ocMA.OdeW8C22.text	
ltx/en_us_goadedes/oc.m7.d6:ocMA.OdeW8C23.incipit	…
ltx/en_us_goadedes/oc.m7.d6:ocMA.OdeW8C23.melody	@ltx/en_us_goadedes/he.h.m7:heHE.TonYpAngelonAsigitos.name
ltx/en_us_goadedes/oc.m7.d6:ocMA.OdeW8C23.mode	@ltx/en_us_goadedes/miscellanea:misc.Mode7
ltx/en_us_goadedes/oc.m7.d6:ocMA.OdeW8C23.ode	@ltx/en_us_goadedes/miscellanea:misc.Ode8
ltx/en_us_goadedes/oc.m7.d6:ocMA.OdeW8C23.text	
ltx/en_us_goadedes/oc.m7.d6:ocMA.OdeW8C24.incipit	…
ltx/en_us_goadedes/oc.m7.d6:ocMA.OdeW8C24.melody	@ltx/en_us_goadedes/he.h.m7:heHE.TonYpAngelonAsigitos.name
ltx/en_us_goadedes/oc.m7.d6:ocMA.OdeW8C24.mode	@ltx/en_us_goadedes/miscellanea:misc.Mode7
ltx/en_us_goadedes/oc.m7.d6:ocMA.OdeW8C24.ode	@ltx/en_us_goadedes/miscellanea:misc.Ode8
ltx/en_us_goadedes/oc.m7.d6:ocMA.OdeW8C24.text	
ltx/en_us_goadedes/oc.m7.d6:ocMA.OdeW9C11.incipit	…
ltx/en_us_goadedes/oc.m7.d6:ocMA.OdeW9C11.melody	@ltx/en_us_goadedes/he.h.m7:heHE.PanymniteTonOuranonYpsilotera.name
ltx/en_us_goadedes/oc.m7.d6:ocMA.OdeW9C11.mode	@ltx/en_us_goadedes/miscellanea:misc.Mode7
ltx/en_us_goadedes/oc.m7.d6:ocMA.OdeW9C11.ode	@ltx/en_us_goadedes/miscellanea:misc.Ode9
ltx/en_us_goadedes/oc.m7.d6:ocMA.OdeW9C11.text	
ltx/en_us_goadedes/oc.m7.d6:ocMA.OdeW9C12.incipit	…
ltx/en_us_goadedes/oc.m7.d6:ocMA.OdeW9C12.melody	@ltx/en_us_goadedes/he.h.m7:heHE.PanymniteTonOuranonYpsilotera.name
ltx/en_us_goadedes/oc.m7.d6:ocMA.OdeW9C12.mode	@ltx/en_us_goadedes/miscellanea:misc.Mode7
ltx/en_us_goadedes/oc.m7.d6:ocMA.OdeW9C12.ode	@ltx/en_us_goadedes/miscellanea:misc.Ode9
ltx/en_us_goadedes/oc.m7.d6:ocMA.OdeW9C12.text	
ltx/en_us_goadedes/oc.m7.d6:ocMA.OdeW9C13.incipit	…
ltx/en_us_goadedes/oc.m7.d6:ocMA.OdeW9C13.melody	@ltx/en_us_goadedes/he.h.m7:heHE.PanymniteTonOuranonYpsilotera.name
ltx/en_us_goadedes/oc.m7.d6:ocMA.OdeW9C13.mode	@ltx/en_us_goadedes/miscellanea:misc.Mode7
ltx/en_us_goadedes/oc.m7.d6:ocMA.OdeW9C13.ode	@ltx/en_us_goadedes/miscellanea:misc.Ode9
ltx/en_us_goadedes/oc.m7.d6:ocMA.OdeW9C13.text	
ltx/en_us_goadedes/oc.m7.d6:ocMA.OdeW9C14.incipit	…
ltx/en_us_goadedes/oc.m7.d6:ocMA.OdeW9C14.melody	@ltx/en_us_goadedes/he.h.m7:heHE.PanymniteTonOuranonYpsilotera.name
ltx/en_us_goadedes/oc.m7.d6:ocMA.OdeW9C14.mode	@ltx/en_us_goadedes/miscellanea:misc.Mode7
ltx/en_us_goadedes/oc.m7.d6:ocMA.OdeW9C14.ode	@ltx/en_us_goadedes/miscellanea:misc.Ode9
ltx/en_us_goadedes/oc.m7.d6:ocMA.OdeW9C14.text	
ltx/en_us_goadedes/oc.m7.d6:ocMA.OdeW9C1H.greekmelody	@ltx/en_us_goadedes/he.h.m7:heHE.PanymniteTonOuranonYpsilotera.greekname
ltx/en_us_goadedes/oc.m7.d6:ocMA.OdeW9C1H.incipit	@ltx/en_us_goadedes/he.h.m7:heHE.PanymniteTonOuranonYpsilotera.incipit
ltx/en_us_goadedes/oc.m7.d6:ocMA.OdeW9C1H.melody	@ltx/en_us_goadedes/he.h.m7:heHE.PanymniteTonOuranonYpsilotera.melody
ltx/en_us_goadedes/oc.m7.d6:ocMA.OdeW9C1H.mode	@ltx/en_us_goadedes/miscellanea:misc.Mode7
ltx/en_us_goadedes/oc.m7.d6:ocMA.OdeW9C1H.ode	@ltx/en_us_goadedes/miscellanea:misc.Ode9
ltx/en_us_goadedes/oc.m7.d6:ocMA.OdeW9C1H.text	@ltx/en_us_goadedes/he.h.m7:heHE.PanymniteTonOuranonYpsilotera.text
ltx/en_us_goadedes/oc.m7.d6:ocMA.OdeW9C1T.incipit	…
ltx/en_us_goadedes/oc.m7.d6:ocMA.OdeW9C1T.melody	@ltx/en_us_goadedes/he.h.m7:heHE.PanymniteTonOuranonYpsilotera.name
ltx/en_us_goadedes/oc.m7.d6:ocMA.OdeW9C1T.mode	@ltx/en_us_goadedes/miscellanea:misc.Mode7
ltx/en_us_goadedes/oc.m7.d6:ocMA.OdeW9C1T.ode	@ltx/en_us_goadedes/miscellanea:misc.Ode9
ltx/en_us_goadedes/oc.m7.d6:ocMA.OdeW9C1T.text	
ltx/en_us_goadedes/oc.m7.d6:ocMA.OdeW9C21.greekmelody	@ltx/en_us_goadedes/he.h.m7:heHE.AsporouTokouSyllipsin.greekname
ltx/en_us_goadedes/oc.m7.d6:ocMA.OdeW9C21.incipit	…
ltx/en_us_goadedes/oc.m7.d6:ocMA.OdeW9C21.melody	@ltx/en_us_goadedes/he.h.m7:heHE.AsporouTokouSyllipsin.name
ltx/en_us_goadedes/oc.m7.d6:ocMA.OdeW9C21.mode	@ltx/en_us_goadedes/miscellanea:misc.Mode7
ltx/en_us_goadedes/oc.m7.d6:ocMA.OdeW9C21.ode	@ltx/en_us_goadedes/miscellanea:misc.Ode9
ltx/en_us_goadedes/oc.m7.d6:ocMA.OdeW9C21.text	
ltx/en_us_goadedes/oc.m7.d6:ocMA.OdeW9C22.incipit	…
ltx/en_us_goadedes/oc.m7.d6:ocMA.OdeW9C22.melody	@ltx/en_us_goadedes/he.h.m7:heHE.AsporouTokouSyllipsin.name
ltx/en_us_goadedes/oc.m7.d6:ocMA.OdeW9C22.mode	@ltx/en_us_goadedes/miscellanea:misc.Mode7
ltx/en_us_goadedes/oc.m7.d6:ocMA.OdeW9C22.ode	@ltx/en_us_goadedes/miscellanea:misc.Ode9
ltx/en_us_goadedes/oc.m7.d6:ocMA.OdeW9C22.text	
ltx/en_us_goadedes/oc.m7.d6:ocMA.OdeW9C23.incipit	…
ltx/en_us_goadedes/oc.m7.d6:ocMA.OdeW9C23.melody	@ltx/en_us_goadedes/he.h.m7:heHE.AsporouTokouSyllipsin.name
ltx/en_us_goadedes/oc.m7.d6:ocMA.OdeW9C23.mode	@ltx/en_us_goadedes/miscellanea:misc.Mode7
ltx/en_us_goadedes/oc.m7.d6:ocMA.OdeW9C23.ode	@ltx/en_us_goadedes/miscellanea:misc.Ode9
ltx/en_us_goadedes/oc.m7.d6:ocMA.OdeW9C23.text	
ltx/en_us_goadedes/oc.m7.d6:ocMA.OdeW9C24.incipit	…
ltx/en_us_goadedes/oc.m7.d6:ocMA.OdeW9C24.melody	@ltx/en_us_goadedes/he.h.m7:heHE.AsporouTokouSyllipsin.name
ltx/en_us_goadedes/oc.m7.d6:ocMA.OdeW9C24.mode	@ltx/en_us_goadedes/miscellanea:misc.Mode7
ltx/en_us_goadedes/oc.m7.d6:ocMA.OdeW9C24.ode	@ltx/en_us_goadedes/miscellanea:misc.Ode9
ltx/en_us_goadedes/oc.m7.d6:ocMA.OdeW9C24.text	
ltx/en_us_goadedes/oc.m7.d6:ocVE.ApolTheotokionVM.incipit	@ltx/en_us_goadedes/oc.m7.d4:ocMA.Kathisma33.incipit
ltx/en_us_goadedes/oc.m7.d6:ocVE.ApolTheotokionVM.melody	
ltx/en_us_goadedes/oc.m7.d6:ocVE.ApolTheotokionVM.mode	@ltx/en_us_goadedes/miscellanea:misc.Mode7
ltx/en_us_goadedes/oc.m7.d6:ocVE.ApolTheotokionVM.text	@ltx/en_us_goadedes/oc.m7.d4:ocMA.Kathisma33.text
ltx/en_us_goadedes/oc.m7.d6:ocVE.AposTheotokion.greekmelody	@ltx/en_us_goadedes/he.a.m7:heAU.SimeronGrigoreiOIoudas.greekname
ltx/en_us_goadedes/oc.m7.d6:ocVE.AposTheotokion.incipit	…
ltx/en_us_goadedes/oc.m7.d6:ocVE.AposTheotokion.melody	@ltx/en_us_goadedes/he.a.m7:heAU.SimeronGrigoreiOIoudas.name
ltx/en_us_goadedes/oc.m7.d6:ocVE.AposTheotokion.mode	@ltx/en_us_goadedes/miscellanea:misc.Mode7
ltx/en_us_goadedes/oc.m7.d6:ocVE.AposTheotokion.text	
ltx/en_us_goadedes/oc.m7.d6:ocVE.Aposticha1.greekmelody	@ltx/en_us_goadedes/he.a.m7:heAU.OukEtiKolyometha.greekname
ltx/en_us_goadedes/oc.m7.d6:ocVE.Aposticha1.incipit	@ltx/en_us_goadedes/he.a.m7:heAU.OukEtiKolyometha.incipit
ltx/en_us_goadedes/oc.m7.d6:ocVE.Aposticha1.melody	@ltx/en_us_goadedes/he.a.m7:heAU.OukEtiKolyometha.melody
ltx/en_us_goadedes/oc.m7.d6:ocVE.Aposticha1.mode	@ltx/en_us_goadedes/miscellanea:misc.Mode7
ltx/en_us_goadedes/oc.m7.d6:ocVE.Aposticha1.text	@ltx/en_us_goadedes/he.a.m7:heAU.OukEtiKolyometha.text
ltx/en_us_goadedes/oc.m7.d6:ocVE.Aposticha2.incipit	@ltx/en_us_goadedes/oc.m7.d4:ocVE.Aposticha2.incipit
ltx/en_us_goadedes/oc.m7.d6:ocVE.Aposticha2.melody	
ltx/en_us_goadedes/oc.m7.d6:ocVE.Aposticha2.mode	@ltx/en_us_goadedes/miscellanea:misc.Mode7
ltx/en_us_goadedes/oc.m7.d6:ocVE.Aposticha2.text	@ltx/en_us_goadedes/oc.m7.d4:ocVE.Aposticha2.text
ltx/en_us_goadedes/oc.m7.d6:ocVE.Aposticha3.incipit	@ltx/en_us_goadedes/oc.m7.d2:ocVE.Aposticha3.incipit
ltx/en_us_goadedes/oc.m7.d6:ocVE.Aposticha3.melody	
ltx/en_us_goadedes/oc.m7.d6:ocVE.Aposticha3.mode	@ltx/en_us_goadedes/miscellanea:misc.Mode7
ltx/en_us_goadedes/oc.m7.d6:ocVE.Aposticha3.text	@ltx/en_us_goadedes/oc.m7.d2:ocVE.Aposticha3.text
ltx/en_us_goadedes/oc.m7.d6:ocVE.SticTheotokion.greekmelody	@ltx/en_us_goadedes/he.a.m7:heAU.SimeronGrigoreiOIoudas.greekname
ltx/en_us_goadedes/oc.m7.d6:ocVE.SticTheotokion.incipit	…
ltx/en_us_goadedes/oc.m7.d6:ocVE.SticTheotokion.melody	@ltx/en_us_goadedes/he.a.m7:heAU.SimeronGrigoreiOIoudas.name
ltx/en_us_goadedes/oc.m7.d6:ocVE.SticTheotokion.mode	@ltx/en_us_goadedes/miscellanea:misc.Mode7
ltx/en_us_goadedes/oc.m7.d6:ocVE.SticTheotokion.text	
ltx/en_us_goadedes/oc.m7.d6:ocVE.Stichera1.greekmelody	@ltx/en_us_goadedes/he.a.m7:heAU.OukEtiKolyometha.greekname
ltx/en_us_goadedes/oc.m7.d6:ocVE.Stichera1.incipit	…
ltx/en_us_goadedes/oc.m7.d6:ocVE.Stichera1.melody	@ltx/en_us_goadedes/he.a.m7:heAU.OukEtiKolyometha.name
ltx/en_us_goadedes/oc.m7.d6:ocVE.Stichera1.mode	@ltx/en_us_goadedes/miscellanea:misc.Mode7
ltx/en_us_goadedes/oc.m7.d6:ocVE.Stichera1.text	
ltx/en_us_goadedes/oc.m7.d6:ocVE.Stichera2.incipit	O Logos, when the Jewish leaders…
ltx/en_us_goadedes/oc.m7.d6:ocVE.Stichera2.melody	@ltx/en_us_goadedes/he.a.m7:heAU.OukEtiKolyometha.name
ltx/en_us_goadedes/oc.m7.d6:ocVE.Stichera2.mode	@ltx/en_us_goadedes/miscellanea:misc.Mode7
ltx/en_us_goadedes/oc.m7.d6:ocVE.Stichera2.text	O Logos, when the Jewish leaders condemned You * to be crucified, the earth shook, and sunshine, * horrified, hid itself.
ltx/en_us_goadedes/oc.m7.d6:ocVE.Stichera3.incipit	…
ltx/en_us_goadedes/oc.m7.d6:ocVE.Stichera3.melody	@ltx/en_us_goadedes/he.a.m7:heAU.OukEtiKolyometha.name
ltx/en_us_goadedes/oc.m7.d6:ocVE.Stichera3.mode	@ltx/en_us_goadedes/miscellanea:misc.Mode7
ltx/en_us_goadedes/oc.m7.d6:ocVE.Stichera3.text	
ltx/en_us_goadedes/oc.m7.d6:ocVE.Stichera4.greekmelody	@ltx/en_us_goadedes/he.a.m7:heAU.SimeronGrigoreiOIoudas.greekname
ltx/en_us_goadedes/oc.m7.d6:ocVE.Stichera4.incipit	…
ltx/en_us_goadedes/oc.m7.d6:ocVE.Stichera4.melody	@ltx/en_us_goadedes/he.a.m7:heAU.SimeronGrigoreiOIoudas.name
ltx/en_us_goadedes/oc.m7.d6:ocVE.Stichera4.mode	@ltx/en_us_goadedes/miscellanea:misc.Mode7
ltx/en_us_goadedes/oc.m7.d6:ocVE.Stichera4.text	
ltx/en_us_goadedes/oc.m7.d6:ocVE.Stichera5.incipit	…
ltx/en_us_goadedes/oc.m7.d6:ocVE.Stichera5.melody	@ltx/en_us_goadedes/he.a.m7:heAU.SimeronGrigoreiOIoudas.name
ltx/en_us_goadedes/oc.m7.d6:ocVE.Stichera5.mode	@ltx/en_us_goadedes/miscellanea:misc.Mode7
ltx/en_us_goadedes/oc.m7.d6:ocVE.Stichera5.text	
ltx/en_us_goadedes/oc.m7.d6:ocVE.Stichera6.incipit	…
ltx/en_us_goadedes/oc.m7.d6:ocVE.Stichera6.melody	@ltx/en_us_goadedes/he.a.m7:heAU.SimeronGrigoreiOIoudas.name
ltx/en_us_goadedes/oc.m7.d6:ocVE.Stichera6.mode	@ltx/en_us_goadedes/miscellanea:misc.Mode7
ltx/en_us_goadedes/oc.m7.d6:ocVE.Stichera6.text	
ltx/en_us_goadedes/oc.m7.d6:octrMA.Kathisma11.incipit	@ltx/en_us_goadedes/oc.m7.d6:ocMA.Kathisma21.incipit
ltx/en_us_goadedes/oc.m7.d6:octrMA.Kathisma11.melody	
ltx/en_us_goadedes/oc.m7.d6:octrMA.Kathisma11.mode	@ltx/en_us_goadedes/miscellanea:misc.Mode7
ltx/en_us_goadedes/oc.m7.d6:octrMA.Kathisma11.text	@ltx/en_us_goadedes/oc.m7.d6:ocMA.Kathisma21.text
ltx/en_us_goadedes/oc.m7.d6:octrMA.Kathisma12.incipit	@ltx/en_us_goadedes/oc.m7.d6:ocMA.Kathisma12.incipit
ltx/en_us_goadedes/oc.m7.d6:octrMA.Kathisma12.melody	
ltx/en_us_goadedes/oc.m7.d6:octrMA.Kathisma12.mode	@ltx/en_us_goadedes/miscellanea:misc.Mode7
ltx/en_us_goadedes/oc.m7.d6:octrMA.Kathisma12.text	@ltx/en_us_goadedes/oc.m7.d6:ocMA.Kathisma12.text
ltx/en_us_goadedes/oc.m7.d6:octrMA.Kathisma1T.incipit	@ltx/en_us_goadedes/oc.m7.d4:ocMA.Kathisma33.incipit
ltx/en_us_goadedes/oc.m7.d6:octrMA.Kathisma1T.melody	
ltx/en_us_goadedes/oc.m7.d6:octrMA.Kathisma1T.mode	@ltx/en_us_goadedes/miscellanea:misc.Mode7
ltx/en_us_goadedes/oc.m7.d6:octrMA.Kathisma1T.text	@ltx/en_us_goadedes/oc.m7.d4:ocMA.Kathisma33.text
ltx/en_us_goadedes/oc.m7.d6:octrMA.Ode7Martyricon.incipit	@ltx/en_us_goadedes/oc.m7.d5:ocMA.Kathisma32.incipit
ltx/en_us_goadedes/oc.m7.d6:octrMA.Ode7Martyricon.melody	
ltx/en_us_goadedes/oc.m7.d6:octrMA.Ode7Martyricon.mode	@ltx/en_us_goadedes/miscellanea:misc.Mode7
ltx/en_us_goadedes/oc.m7.d6:octrMA.Ode7Martyricon.text	@ltx/en_us_goadedes/oc.m7.d5:ocMA.Kathisma32.text
ltx/en_us_goadedes/oc.m7.d6:octrMA.Photogogic.incipit	@ltx/en_us_goadedes/oc.m7.d2:octrMA.Photagogic.incipit
ltx/en_us_goadedes/oc.m7.d6:octrMA.Photogogic.mode	@ltx/en_us_goadedes/miscellanea:misc.Mode7
ltx/en_us_goadedes/oc.m7.d6:octrMA.Photogogic.text	@ltx/en_us_goadedes/oc.m7.d2:octrMA.Photagogic.text
ltx/en_us_goadedes/oc.m7.d6:octrMA.Triadic1.incipit	@ltx/en_us_goadedes/oc.m7.d2:octrMA.Triadic1.incipit
ltx/en_us_goadedes/oc.m7.d6:octrMA.Triadic1.mode	@ltx/en_us_goadedes/miscellanea:misc.Mode7
ltx/en_us_goadedes/oc.m7.d6:octrMA.Triadic1.text	@ltx/en_us_goadedes/oc.m7.d2:octrMA.Triadic1.text
ltx/en_us_goadedes/oc.m7.d6:octrMA.Triadic2.incipit	@ltx/en_us_goadedes/oc.m7.d2:octrMA.Triadic2.incipit
ltx/en_us_goadedes/oc.m7.d6:octrMA.Triadic2.mode	@ltx/en_us_goadedes/miscellanea:misc.Mode7
ltx/en_us_goadedes/oc.m7.d6:octrMA.Triadic2.text	@ltx/en_us_goadedes/oc.m7.d2:octrMA.Triadic2.text
ltx/en_us_goadedes/oc.m7.d6:octrMA.Triadic3.incipit	@ltx/en_us_goadedes/oc.m7.d2:octrMA.Triadic3.incipit
ltx/en_us_goadedes/oc.m7.d6:octrMA.Triadic3.mode	@ltx/en_us_goadedes/miscellanea:misc.Mode7
ltx/en_us_goadedes/oc.m7.d6:octrMA.Triadic3.text	@ltx/en_us_goadedes/oc.m7.d2:octrMA.Triadic3.text
