ltx/en_us_goadedes/tr.d017:trCO.header	
ltx/en_us_goadedes/tr.d017:trDA.commemoration.full	
ltx/en_us_goadedes/tr.d017:trDA.commemoration.short	
ltx/en_us_goadedes/tr.d017:trDA.insert1	
ltx/en_us_goadedes/tr.d017:trDA.insert2	
ltx/en_us_goadedes/tr.d017:trDA.note	
ltx/en_us_goadedes/tr.d017:trDA.title	
ltx/en_us_goadedes/tr.d017:trHO.commemorations	
ltx/en_us_goadedes/tr.d017:trHO.daytitle	
ltx/en_us_goadedes/tr.d017:trHO.description1	
ltx/en_us_goadedes/tr.d017:trHO.description2	
ltx/en_us_goadedes/tr.d017:trHO.note1	
ltx/en_us_goadedes/tr.d017:trHO.note2	
ltx/en_us_goadedes/tr.d017:trMA.AposIdiomelon1.incipit	…
ltx/en_us_goadedes/tr.d017:trMA.AposIdiomelon1.melody	@ltx/en_us_goadedes/miscellanea:misc.Idiomelon
ltx/en_us_goadedes/tr.d017:trMA.AposIdiomelon1.mode	@ltx/en_us_goadedes/miscellanea:misc.Mode3
ltx/en_us_goadedes/tr.d017:trMA.AposIdiomelon1.text	
ltx/en_us_goadedes/tr.d017:trMA.AposMartyric.incipit	@ltx/en_us_goadedes/oc.m3.d3:ocMA.Aposticha3.incipit
ltx/en_us_goadedes/tr.d017:trMA.AposMartyric.melody	
ltx/en_us_goadedes/tr.d017:trMA.AposMartyric.mode	@ltx/en_us_goadedes/miscellanea:misc.Mode3
ltx/en_us_goadedes/tr.d017:trMA.AposMartyric.text	@ltx/en_us_goadedes/oc.m3.d3:ocMA.Aposticha3.text
ltx/en_us_goadedes/tr.d017:trMA.AposTheotokion.incipit	@ltx/en_us_goadedes/oc.m3.d3:ocVE.AposTheotokion.incipit
ltx/en_us_goadedes/tr.d017:trMA.AposTheotokion.melody	
ltx/en_us_goadedes/tr.d017:trMA.AposTheotokion.mode	@ltx/en_us_goadedes/miscellanea:misc.Mode3
ltx/en_us_goadedes/tr.d017:trMA.AposTheotokion.text	@ltx/en_us_goadedes/oc.m3.d3:ocVE.AposTheotokion.text
ltx/en_us_goadedes/tr.d017:trMA.C1.poet	@ltx/en_us_goadedes/poets:po.KyriouIosif
ltx/en_us_goadedes/tr.d017:trMA.C2.poet	@ltx/en_us_goadedes/poets:po.KyriouIosif
ltx/en_us_goadedes/tr.d017:trMA.Kathisma21.greekmelody	@ltx/en_us_goadedes/he.a.m8:heAU.TinSofianKaiLogon.greekname
ltx/en_us_goadedes/tr.d017:trMA.Kathisma21.incipit	…
ltx/en_us_goadedes/tr.d017:trMA.Kathisma21.melody	@ltx/en_us_goadedes/he.a.m8:heAU.TinSofianKaiLogon.name
ltx/en_us_goadedes/tr.d017:trMA.Kathisma21.mode	@ltx/en_us_goadedes/miscellanea:misc.Mode8
ltx/en_us_goadedes/tr.d017:trMA.Kathisma21.text	
ltx/en_us_goadedes/tr.d017:trMA.Kathisma22.greekmelody	@ltx/en_us_goadedes/he.a.m8:heAU.TinSofianKaiLogon.greekname
ltx/en_us_goadedes/tr.d017:trMA.Kathisma22.incipit	@ltx/en_us_goadedes/he.a.m8:heAU.TinSofianKaiLogon.incipit
ltx/en_us_goadedes/tr.d017:trMA.Kathisma22.melody	@ltx/en_us_goadedes/he.a.m8:heAU.TinSofianKaiLogon.melody
ltx/en_us_goadedes/tr.d017:trMA.Kathisma22.mode	@ltx/en_us_goadedes/miscellanea:misc.Mode8
ltx/en_us_goadedes/tr.d017:trMA.Kathisma22.text	@ltx/en_us_goadedes/he.a.m8:heAU.TinSofianKaiLogon.text
ltx/en_us_goadedes/tr.d017:trMA.Ode2C11.greekmelody	@ltx/en_us_goadedes/he.h.m3:heHE.OsOmvrosEpAgrostin.greekname
ltx/en_us_goadedes/tr.d017:trMA.Ode2C11.incipit	…
ltx/en_us_goadedes/tr.d017:trMA.Ode2C11.melody	@ltx/en_us_goadedes/he.h.m3:heHE.OsOmvrosEpAgrostin.name
ltx/en_us_goadedes/tr.d017:trMA.Ode2C11.mode	@ltx/en_us_goadedes/miscellanea:misc.Mode3
ltx/en_us_goadedes/tr.d017:trMA.Ode2C11.ode	@ltx/en_us_goadedes/miscellanea:misc.Ode2
ltx/en_us_goadedes/tr.d017:trMA.Ode2C11.text	
ltx/en_us_goadedes/tr.d017:trMA.Ode2C12.incipit	…
ltx/en_us_goadedes/tr.d017:trMA.Ode2C12.melody	@ltx/en_us_goadedes/he.h.m3:heHE.OsOmvrosEpAgrostin.name
ltx/en_us_goadedes/tr.d017:trMA.Ode2C12.mode	@ltx/en_us_goadedes/miscellanea:misc.Mode3
ltx/en_us_goadedes/tr.d017:trMA.Ode2C12.ode	@ltx/en_us_goadedes/miscellanea:misc.Ode2
ltx/en_us_goadedes/tr.d017:trMA.Ode2C12.text	
ltx/en_us_goadedes/tr.d017:trMA.Ode2C13.incipit	…
ltx/en_us_goadedes/tr.d017:trMA.Ode2C13.melody	@ltx/en_us_goadedes/he.h.m3:heHE.OsOmvrosEpAgrostin.name
ltx/en_us_goadedes/tr.d017:trMA.Ode2C13.mode	@ltx/en_us_goadedes/miscellanea:misc.Mode3
ltx/en_us_goadedes/tr.d017:trMA.Ode2C13.ode	@ltx/en_us_goadedes/miscellanea:misc.Ode2
ltx/en_us_goadedes/tr.d017:trMA.Ode2C13.text	
ltx/en_us_goadedes/tr.d017:trMA.Ode2C1H.greekmelody	@ltx/en_us_goadedes/he.h.m3:heHE.OsOmvrosEpAgrostin.greekname
ltx/en_us_goadedes/tr.d017:trMA.Ode2C1H.incipit	@ltx/en_us_goadedes/he.h.m3:heHE.OsOmvrosEpAgrostin.incipit
ltx/en_us_goadedes/tr.d017:trMA.Ode2C1H.melody	@ltx/en_us_goadedes/he.h.m3:heHE.OsOmvrosEpAgrostin.melody
ltx/en_us_goadedes/tr.d017:trMA.Ode2C1H.mode	@ltx/en_us_goadedes/miscellanea:misc.Mode3
ltx/en_us_goadedes/tr.d017:trMA.Ode2C1H.ode	@ltx/en_us_goadedes/miscellanea:misc.Ode2
ltx/en_us_goadedes/tr.d017:trMA.Ode2C1H.text	@ltx/en_us_goadedes/he.h.m3:heHE.OsOmvrosEpAgrostin.text
ltx/en_us_goadedes/tr.d017:trMA.Ode2C1T.incipit	…
ltx/en_us_goadedes/tr.d017:trMA.Ode2C1T.melody	@ltx/en_us_goadedes/he.h.m3:heHE.OsOmvrosEpAgrostin.name
ltx/en_us_goadedes/tr.d017:trMA.Ode2C1T.mode	@ltx/en_us_goadedes/miscellanea:misc.Mode3
ltx/en_us_goadedes/tr.d017:trMA.Ode2C1T.ode	@ltx/en_us_goadedes/miscellanea:misc.Ode2
ltx/en_us_goadedes/tr.d017:trMA.Ode2C1T.text	
ltx/en_us_goadedes/tr.d017:trMA.Ode2C21.greekmelody	@ltx/en_us_goadedes/he.h.m2:heHE.ProsecheteLaosMou.greekname
ltx/en_us_goadedes/tr.d017:trMA.Ode2C21.incipit	…
ltx/en_us_goadedes/tr.d017:trMA.Ode2C21.melody	@ltx/en_us_goadedes/he.h.m2:heHE.ProsecheteLaosMou.name
ltx/en_us_goadedes/tr.d017:trMA.Ode2C21.mode	@ltx/en_us_goadedes/miscellanea:misc.Mode2
ltx/en_us_goadedes/tr.d017:trMA.Ode2C21.ode	@ltx/en_us_goadedes/miscellanea:misc.Ode2
ltx/en_us_goadedes/tr.d017:trMA.Ode2C21.text	
ltx/en_us_goadedes/tr.d017:trMA.Ode2C22.incipit	…
ltx/en_us_goadedes/tr.d017:trMA.Ode2C22.melody	@ltx/en_us_goadedes/he.h.m2:heHE.ProsecheteLaosMou.name
ltx/en_us_goadedes/tr.d017:trMA.Ode2C22.mode	@ltx/en_us_goadedes/miscellanea:misc.Mode2
ltx/en_us_goadedes/tr.d017:trMA.Ode2C22.ode	@ltx/en_us_goadedes/miscellanea:misc.Ode2
ltx/en_us_goadedes/tr.d017:trMA.Ode2C22.text	
ltx/en_us_goadedes/tr.d017:trMA.Ode2C23.incipit	…
ltx/en_us_goadedes/tr.d017:trMA.Ode2C23.melody	@ltx/en_us_goadedes/he.h.m2:heHE.ProsecheteLaosMou.name
ltx/en_us_goadedes/tr.d017:trMA.Ode2C23.mode	@ltx/en_us_goadedes/miscellanea:misc.Mode2
ltx/en_us_goadedes/tr.d017:trMA.Ode2C23.ode	@ltx/en_us_goadedes/miscellanea:misc.Ode2
ltx/en_us_goadedes/tr.d017:trMA.Ode2C23.text	
ltx/en_us_goadedes/tr.d017:trMA.Ode2C2H.greekmelody	@ltx/en_us_goadedes/he.h.m2:heHE.ProsecheteLaosMou.greekname
ltx/en_us_goadedes/tr.d017:trMA.Ode2C2H.incipit	@ltx/en_us_goadedes/he.h.m2:heHE.ProsecheteLaosMou.incipit
ltx/en_us_goadedes/tr.d017:trMA.Ode2C2H.melody	@ltx/en_us_goadedes/he.h.m2:heHE.ProsecheteLaosMou.melody
ltx/en_us_goadedes/tr.d017:trMA.Ode2C2H.mode	@ltx/en_us_goadedes/miscellanea:misc.Mode2
ltx/en_us_goadedes/tr.d017:trMA.Ode2C2H.ode	@ltx/en_us_goadedes/miscellanea:misc.Ode2
ltx/en_us_goadedes/tr.d017:trMA.Ode2C2H.text	@ltx/en_us_goadedes/he.h.m2:heHE.ProsecheteLaosMou.text
ltx/en_us_goadedes/tr.d017:trMA.Ode2C2T.incipit	…
ltx/en_us_goadedes/tr.d017:trMA.Ode2C2T.melody	@ltx/en_us_goadedes/he.h.m2:heHE.ProsecheteLaosMou.name
ltx/en_us_goadedes/tr.d017:trMA.Ode2C2T.mode	@ltx/en_us_goadedes/miscellanea:misc.Mode2
ltx/en_us_goadedes/tr.d017:trMA.Ode2C2T.ode	@ltx/en_us_goadedes/miscellanea:misc.Ode2
ltx/en_us_goadedes/tr.d017:trMA.Ode2C2T.text	
ltx/en_us_goadedes/tr.d017:trMA.Ode2C2Tr.incipit	…
ltx/en_us_goadedes/tr.d017:trMA.Ode2C2Tr.melody	@ltx/en_us_goadedes/he.h.m2:heHE.ProsecheteLaosMou.name
ltx/en_us_goadedes/tr.d017:trMA.Ode2C2Tr.mode	@ltx/en_us_goadedes/miscellanea:misc.Mode2
ltx/en_us_goadedes/tr.d017:trMA.Ode2C2Tr.ode	@ltx/en_us_goadedes/miscellanea:misc.Ode2
ltx/en_us_goadedes/tr.d017:trMA.Ode2C2Tr.text	
ltx/en_us_goadedes/tr.d017:trMA.Ode8C11.greekmelody	@ltx/en_us_goadedes/he.h.m3:heHE.TonExAnarchou.greekname
ltx/en_us_goadedes/tr.d017:trMA.Ode8C11.incipit	…
ltx/en_us_goadedes/tr.d017:trMA.Ode8C11.melody	@ltx/en_us_goadedes/he.h.m3:heHE.TonExAnarchou.name
ltx/en_us_goadedes/tr.d017:trMA.Ode8C11.mode	@ltx/en_us_goadedes/miscellanea:misc.Mode3
ltx/en_us_goadedes/tr.d017:trMA.Ode8C11.ode	@ltx/en_us_goadedes/miscellanea:misc.Ode8
ltx/en_us_goadedes/tr.d017:trMA.Ode8C11.text	
ltx/en_us_goadedes/tr.d017:trMA.Ode8C12.incipit	…
ltx/en_us_goadedes/tr.d017:trMA.Ode8C12.melody	@ltx/en_us_goadedes/he.h.m3:heHE.TonExAnarchou.name
ltx/en_us_goadedes/tr.d017:trMA.Ode8C12.mode	@ltx/en_us_goadedes/miscellanea:misc.Mode3
ltx/en_us_goadedes/tr.d017:trMA.Ode8C12.ode	@ltx/en_us_goadedes/miscellanea:misc.Ode8
ltx/en_us_goadedes/tr.d017:trMA.Ode8C12.text	
ltx/en_us_goadedes/tr.d017:trMA.Ode8C13.incipit	…
ltx/en_us_goadedes/tr.d017:trMA.Ode8C13.melody	@ltx/en_us_goadedes/he.h.m3:heHE.TonExAnarchou.name
ltx/en_us_goadedes/tr.d017:trMA.Ode8C13.mode	@ltx/en_us_goadedes/miscellanea:misc.Mode3
ltx/en_us_goadedes/tr.d017:trMA.Ode8C13.ode	@ltx/en_us_goadedes/miscellanea:misc.Ode8
ltx/en_us_goadedes/tr.d017:trMA.Ode8C13.text	
ltx/en_us_goadedes/tr.d017:trMA.Ode8C1T.incipit	…
ltx/en_us_goadedes/tr.d017:trMA.Ode8C1T.melody	@ltx/en_us_goadedes/he.h.m3:heHE.TonExAnarchou.name
ltx/en_us_goadedes/tr.d017:trMA.Ode8C1T.mode	@ltx/en_us_goadedes/miscellanea:misc.Mode3
ltx/en_us_goadedes/tr.d017:trMA.Ode8C1T.ode	@ltx/en_us_goadedes/miscellanea:misc.Ode8
ltx/en_us_goadedes/tr.d017:trMA.Ode8C1T.text	
ltx/en_us_goadedes/tr.d017:trMA.Ode8C21.greekmelody	@ltx/en_us_goadedes/he.h.m2:heHE.TonEnTiVatoMosi.greekname
ltx/en_us_goadedes/tr.d017:trMA.Ode8C21.incipit	…
ltx/en_us_goadedes/tr.d017:trMA.Ode8C21.melody	@ltx/en_us_goadedes/he.h.m2:heHE.TonEnTiVatoMosi.name
ltx/en_us_goadedes/tr.d017:trMA.Ode8C21.mode	@ltx/en_us_goadedes/miscellanea:misc.Mode2
ltx/en_us_goadedes/tr.d017:trMA.Ode8C21.ode	@ltx/en_us_goadedes/miscellanea:misc.Ode8
ltx/en_us_goadedes/tr.d017:trMA.Ode8C21.text	
ltx/en_us_goadedes/tr.d017:trMA.Ode8C22.incipit	…
ltx/en_us_goadedes/tr.d017:trMA.Ode8C22.melody	@ltx/en_us_goadedes/he.h.m2:heHE.TonEnTiVatoMosi.name
ltx/en_us_goadedes/tr.d017:trMA.Ode8C22.mode	@ltx/en_us_goadedes/miscellanea:misc.Mode2
ltx/en_us_goadedes/tr.d017:trMA.Ode8C22.ode	@ltx/en_us_goadedes/miscellanea:misc.Ode8
ltx/en_us_goadedes/tr.d017:trMA.Ode8C22.text	
ltx/en_us_goadedes/tr.d017:trMA.Ode8C23.incipit	…
ltx/en_us_goadedes/tr.d017:trMA.Ode8C23.melody	@ltx/en_us_goadedes/he.h.m2:heHE.TonEnTiVatoMosi.name
ltx/en_us_goadedes/tr.d017:trMA.Ode8C23.mode	@ltx/en_us_goadedes/miscellanea:misc.Mode2
ltx/en_us_goadedes/tr.d017:trMA.Ode8C23.ode	@ltx/en_us_goadedes/miscellanea:misc.Ode8
ltx/en_us_goadedes/tr.d017:trMA.Ode8C23.text	
ltx/en_us_goadedes/tr.d017:trMA.Ode8C2H.greekmelody	@ltx/en_us_goadedes/he.h.m2:heHE.TonEnTiVatoMosi.greekname
ltx/en_us_goadedes/tr.d017:trMA.Ode8C2H.incipit	@ltx/en_us_goadedes/he.h.m2:heHE.TonEnTiVatoMosi.incipit
ltx/en_us_goadedes/tr.d017:trMA.Ode8C2H.melody	@ltx/en_us_goadedes/he.h.m2:heHE.TonEnTiVatoMosi.melody
ltx/en_us_goadedes/tr.d017:trMA.Ode8C2H.mode	@ltx/en_us_goadedes/miscellanea:misc.Mode2
ltx/en_us_goadedes/tr.d017:trMA.Ode8C2H.ode	@ltx/en_us_goadedes/miscellanea:misc.Ode8
ltx/en_us_goadedes/tr.d017:trMA.Ode8C2H.text	@ltx/en_us_goadedes/he.h.m2:heHE.TonEnTiVatoMosi.text
ltx/en_us_goadedes/tr.d017:trMA.Ode8C2T.incipit	…
ltx/en_us_goadedes/tr.d017:trMA.Ode8C2T.melody	@ltx/en_us_goadedes/he.h.m2:heHE.TonEnTiVatoMosi.name
ltx/en_us_goadedes/tr.d017:trMA.Ode8C2T.mode	@ltx/en_us_goadedes/miscellanea:misc.Mode2
ltx/en_us_goadedes/tr.d017:trMA.Ode8C2T.ode	@ltx/en_us_goadedes/miscellanea:misc.Ode8
ltx/en_us_goadedes/tr.d017:trMA.Ode8C2T.text	
ltx/en_us_goadedes/tr.d017:trMA.Ode8C2Tr.incipit	…
ltx/en_us_goadedes/tr.d017:trMA.Ode8C2Tr.melody	@ltx/en_us_goadedes/he.h.m2:heHE.TonEnTiVatoMosi.name
ltx/en_us_goadedes/tr.d017:trMA.Ode8C2Tr.mode	@ltx/en_us_goadedes/miscellanea:misc.Mode2
ltx/en_us_goadedes/tr.d017:trMA.Ode8C2Tr.ode	@ltx/en_us_goadedes/miscellanea:misc.Ode8
ltx/en_us_goadedes/tr.d017:trMA.Ode8C2Tr.text	
ltx/en_us_goadedes/tr.d017:trMA.Ode9C11.greekmelody	@ltx/en_us_goadedes/he.h.m3:heHE.SeTinAkataflekton.greekname
ltx/en_us_goadedes/tr.d017:trMA.Ode9C11.incipit	…
ltx/en_us_goadedes/tr.d017:trMA.Ode9C11.melody	@ltx/en_us_goadedes/he.h.m3:heHE.SeTinAkataflekton.name
ltx/en_us_goadedes/tr.d017:trMA.Ode9C11.mode	@ltx/en_us_goadedes/miscellanea:misc.Mode3
ltx/en_us_goadedes/tr.d017:trMA.Ode9C11.ode	@ltx/en_us_goadedes/miscellanea:misc.Ode9
ltx/en_us_goadedes/tr.d017:trMA.Ode9C11.text	
ltx/en_us_goadedes/tr.d017:trMA.Ode9C12.incipit	…
ltx/en_us_goadedes/tr.d017:trMA.Ode9C12.melody	@ltx/en_us_goadedes/he.h.m3:heHE.SeTinAkataflekton.name
ltx/en_us_goadedes/tr.d017:trMA.Ode9C12.mode	@ltx/en_us_goadedes/miscellanea:misc.Mode3
ltx/en_us_goadedes/tr.d017:trMA.Ode9C12.ode	@ltx/en_us_goadedes/miscellanea:misc.Ode9
ltx/en_us_goadedes/tr.d017:trMA.Ode9C12.text	
ltx/en_us_goadedes/tr.d017:trMA.Ode9C13.incipit	…
ltx/en_us_goadedes/tr.d017:trMA.Ode9C13.melody	@ltx/en_us_goadedes/he.h.m3:heHE.SeTinAkataflekton.name
ltx/en_us_goadedes/tr.d017:trMA.Ode9C13.mode	@ltx/en_us_goadedes/miscellanea:misc.Mode3
ltx/en_us_goadedes/tr.d017:trMA.Ode9C13.ode	@ltx/en_us_goadedes/miscellanea:misc.Ode9
ltx/en_us_goadedes/tr.d017:trMA.Ode9C13.text	
ltx/en_us_goadedes/tr.d017:trMA.Ode9C14.incipit	…
ltx/en_us_goadedes/tr.d017:trMA.Ode9C14.melody	@ltx/en_us_goadedes/he.h.m3:heHE.SeTinAkataflekton.name
ltx/en_us_goadedes/tr.d017:trMA.Ode9C14.mode	@ltx/en_us_goadedes/miscellanea:misc.Mode3
ltx/en_us_goadedes/tr.d017:trMA.Ode9C14.ode	@ltx/en_us_goadedes/miscellanea:misc.Ode9
ltx/en_us_goadedes/tr.d017:trMA.Ode9C14.text	
ltx/en_us_goadedes/tr.d017:trMA.Ode9C1T.incipit	…
ltx/en_us_goadedes/tr.d017:trMA.Ode9C1T.melody	@ltx/en_us_goadedes/he.h.m3:heHE.SeTinAkataflekton.name
ltx/en_us_goadedes/tr.d017:trMA.Ode9C1T.mode	@ltx/en_us_goadedes/miscellanea:misc.Mode3
ltx/en_us_goadedes/tr.d017:trMA.Ode9C1T.ode	@ltx/en_us_goadedes/miscellanea:misc.Ode9
ltx/en_us_goadedes/tr.d017:trMA.Ode9C1T.text	
ltx/en_us_goadedes/tr.d017:trMA.Ode9C21.greekmelody	@ltx/en_us_goadedes/he.h.m2:heHE.TinParthenianSou.greekname
ltx/en_us_goadedes/tr.d017:trMA.Ode9C21.incipit	…
ltx/en_us_goadedes/tr.d017:trMA.Ode9C21.melody	@ltx/en_us_goadedes/he.h.m2:heHE.TinParthenianSou.name
ltx/en_us_goadedes/tr.d017:trMA.Ode9C21.mode	@ltx/en_us_goadedes/miscellanea:misc.Mode2
ltx/en_us_goadedes/tr.d017:trMA.Ode9C21.ode	@ltx/en_us_goadedes/miscellanea:misc.Ode9
ltx/en_us_goadedes/tr.d017:trMA.Ode9C21.text	
ltx/en_us_goadedes/tr.d017:trMA.Ode9C22.incipit	…
ltx/en_us_goadedes/tr.d017:trMA.Ode9C22.melody	@ltx/en_us_goadedes/he.h.m2:heHE.TinParthenianSou.name
ltx/en_us_goadedes/tr.d017:trMA.Ode9C22.mode	@ltx/en_us_goadedes/miscellanea:misc.Mode2
ltx/en_us_goadedes/tr.d017:trMA.Ode9C22.ode	@ltx/en_us_goadedes/miscellanea:misc.Ode9
ltx/en_us_goadedes/tr.d017:trMA.Ode9C22.text	
ltx/en_us_goadedes/tr.d017:trMA.Ode9C23.incipit	…
ltx/en_us_goadedes/tr.d017:trMA.Ode9C23.melody	@ltx/en_us_goadedes/he.h.m2:heHE.TinParthenianSou.name
ltx/en_us_goadedes/tr.d017:trMA.Ode9C23.mode	@ltx/en_us_goadedes/miscellanea:misc.Mode2
ltx/en_us_goadedes/tr.d017:trMA.Ode9C23.ode	@ltx/en_us_goadedes/miscellanea:misc.Ode9
ltx/en_us_goadedes/tr.d017:trMA.Ode9C23.text	
ltx/en_us_goadedes/tr.d017:trMA.Ode9C2H.greekmelody	@ltx/en_us_goadedes/he.h.m2:heHE.TinParthenianSou.greekname
ltx/en_us_goadedes/tr.d017:trMA.Ode9C2H.incipit	@ltx/en_us_goadedes/he.h.m2:heHE.TinParthenianSou.incipit
ltx/en_us_goadedes/tr.d017:trMA.Ode9C2H.melody	@ltx/en_us_goadedes/he.h.m2:heHE.TinParthenianSou.melody
ltx/en_us_goadedes/tr.d017:trMA.Ode9C2H.mode	@ltx/en_us_goadedes/miscellanea:misc.Mode2
ltx/en_us_goadedes/tr.d017:trMA.Ode9C2H.ode	@ltx/en_us_goadedes/miscellanea:misc.Ode9
ltx/en_us_goadedes/tr.d017:trMA.Ode9C2H.text	@ltx/en_us_goadedes/he.h.m2:heHE.TinParthenianSou.text
ltx/en_us_goadedes/tr.d017:trMA.Ode9C2T.incipit	…
ltx/en_us_goadedes/tr.d017:trMA.Ode9C2T.melody	@ltx/en_us_goadedes/he.h.m2:heHE.TinParthenianSou.name
ltx/en_us_goadedes/tr.d017:trMA.Ode9C2T.mode	@ltx/en_us_goadedes/miscellanea:misc.Mode2
ltx/en_us_goadedes/tr.d017:trMA.Ode9C2T.ode	@ltx/en_us_goadedes/miscellanea:misc.Ode9
ltx/en_us_goadedes/tr.d017:trMA.Ode9C2T.text	
ltx/en_us_goadedes/tr.d017:trMA.Ode9C2Tr.incipit	…
ltx/en_us_goadedes/tr.d017:trMA.Ode9C2Tr.melody	@ltx/en_us_goadedes/he.h.m2:heHE.TinParthenianSou.name
ltx/en_us_goadedes/tr.d017:trMA.Ode9C2Tr.mode	@ltx/en_us_goadedes/miscellanea:misc.Mode2
ltx/en_us_goadedes/tr.d017:trMA.Ode9C2Tr.ode	@ltx/en_us_goadedes/miscellanea:misc.Ode9
ltx/en_us_goadedes/tr.d017:trMA.Ode9C2Tr.text	
ltx/en_us_goadedes/tr.d017:trVE.AposIdiomelon1.incipit	…
ltx/en_us_goadedes/tr.d017:trVE.AposIdiomelon1.melody	@ltx/en_us_goadedes/miscellanea:misc.Idiomelon
ltx/en_us_goadedes/tr.d017:trVE.AposIdiomelon1.mode	@ltx/en_us_goadedes/miscellanea:misc.Mode8
ltx/en_us_goadedes/tr.d017:trVE.AposIdiomelon1.text	
ltx/en_us_goadedes/tr.d017:trVE.AposMartyric.incipit	@ltx/en_us_goadedes/oc.m8.d3:ocVE.Aposticha3.incipit
ltx/en_us_goadedes/tr.d017:trVE.AposMartyric.melody	
ltx/en_us_goadedes/tr.d017:trVE.AposMartyric.mode	@ltx/en_us_goadedes/miscellanea:misc.Mode8
ltx/en_us_goadedes/tr.d017:trVE.AposMartyric.text	@ltx/en_us_goadedes/oc.m8.d3:ocVE.Aposticha3.text
ltx/en_us_goadedes/tr.d017:trVE.AposTheotokion.incipit	…
ltx/en_us_goadedes/tr.d017:trVE.AposTheotokion.melody	
ltx/en_us_goadedes/tr.d017:trVE.AposTheotokion.mode	@ltx/en_us_goadedes/miscellanea:misc.Mode8
ltx/en_us_goadedes/tr.d017:trVE.AposTheotokion.text	
