ltx/en_us_goadedes/he.ga:heGA.ApostoleAgie.incipit	O holy Apostle…
ltx/en_us_goadedes/he.ga:heGA.ApostoleAgie.melody	
ltx/en_us_goadedes/he.ga:heGA.ApostoleAgie.mode	@ltx/en_us_goadedes/miscellanea:misc.Mode3
ltx/en_us_goadedes/he.ga:heGA.ApostoleAgie.name	O holy Apostle.
ltx/en_us_goadedes/he.ga:heGA.ApostoleAgie.text1	O holy Apostle
ltx/en_us_goadedes/he.ga:heGA.ApostoleAgie.text1a	and Evangelist
ltx/en_us_goadedes/he.ga:heGA.ApostoleAgie.text2	make intercession to our merciful God, that He grant our souls forgiveness of offenses.
ltx/en_us_goadedes/he.ga:heGA.ApostoloiAgioi.incipit	O holy Apostles…
ltx/en_us_goadedes/he.ga:heGA.ApostoloiAgioi.melody	
ltx/en_us_goadedes/he.ga:heGA.ApostoloiAgioi.mode	@ltx/en_us_goadedes/miscellanea:misc.Mode3
ltx/en_us_goadedes/he.ga:heGA.ApostoloiAgioi.name	O holy Apostles.
ltx/en_us_goadedes/he.ga:heGA.ApostoloiAgioi.text	O holy Apostles, make intercession to our merciful God, that He grant our souls forgiveness of offenses.
ltx/en_us_goadedes/he.ga:heGA.ChristotitaEkdidachtheis.incipit	Having learnt kindness…
ltx/en_us_goadedes/he.ga:heGA.ChristotitaEkdidachtheis.melody	
ltx/en_us_goadedes/he.ga:heGA.ChristotitaEkdidachtheis.mode	@ltx/en_us_goadedes/miscellanea:misc.Mode4
ltx/en_us_goadedes/he.ga:heGA.ChristotitaEkdidachtheis.name	Having learnt kindness.
ltx/en_us_goadedes/he.ga:heGA.ChristotitaEkdidachtheis.text1	Having learnt kindness, and being always steady and sober, vested with a good conscience as befits a priest, you drew out from the Chosen Vessel the secrets of God. And having kept the faith, you have finished the fair race, O Hieromartyr
ltx/en_us_goadedes/he.ga:heGA.ChristotitaEkdidachtheis.text2	Intercede with Christ our God, entreating Him to save our souls.
ltx/en_us_goadedes/he.ga:heGA.EnSoiMiterAkrivos.incipit	In you, O Mother…
ltx/en_us_goadedes/he.ga:heGA.EnSoiMiterAkrivos.melody	
ltx/en_us_goadedes/he.ga:heGA.EnSoiMiterAkrivos.mode	@ltx/en_us_goadedes/miscellanea:misc.Mode8
ltx/en_us_goadedes/he.ga:heGA.EnSoiMiterAkrivos.name	In you, O Mother.
ltx/en_us_goadedes/he.ga:heGA.EnSoiMiterAkrivos.text1	In you, O Mother, is preserved undistorted what was made in the image of God; for taking up the cross, you followed Christ and by example taught, that we should overlook the flesh, since it passes away, and instead look after the soul, since it is immortal. And therefore, O devout
ltx/en_us_goadedes/he.ga:heGA.EnSoiMiterAkrivos.text2	your spirit rejoices with the angels.
ltx/en_us_goadedes/he.ga:heGA.EnSoiPaterAkrivos.incipit	In you, O Father…
ltx/en_us_goadedes/he.ga:heGA.EnSoiPaterAkrivos.melody	
ltx/en_us_goadedes/he.ga:heGA.EnSoiPaterAkrivos.mode	@ltx/en_us_goadedes/miscellanea:misc.Mode8
ltx/en_us_goadedes/he.ga:heGA.EnSoiPaterAkrivos.name	In you, O Father.
ltx/en_us_goadedes/he.ga:heGA.EnSoiPaterAkrivos.text1	In you, O Father, is preserved undistorted what was made in the image of God; for taking up the cross, you followed Christ and by example taught, that we should overlook the flesh, since it passes away, and instead look after the soul, since it is immortal. And therefore, O devout
ltx/en_us_goadedes/he.ga:heGA.EnSoiPaterAkrivos.text2	your spirit rejoices with the angels.
ltx/en_us_goadedes/he.ga:heGA.IAmnasSou.greekmelody	@ltx/en_us_goadedes/he.a.m4:heAU.KateplagiIosif.greekname
ltx/en_us_goadedes/he.ga:heGA.IAmnasSou.incipit	Your maiden Martyr, like a lamb…
ltx/en_us_goadedes/he.ga:heGA.IAmnasSou.melody	@ltx/en_us_goadedes/he.a.m4:heAU.KateplagiIosif.name
ltx/en_us_goadedes/he.ga:heGA.IAmnasSou.mode	@ltx/en_us_goadedes/miscellanea:misc.Mode4
ltx/en_us_goadedes/he.ga:heGA.IAmnasSou.name	Your maiden Martyr.
ltx/en_us_goadedes/he.ga:heGA.IAmnasSou.text	Your maiden Martyr, like a lamb, cries out, “O Jesus, for You, * my pure Bridegroom, I long; and seeking You I compete; * and I am crucified and buried with You in Your baptism. * I suffer for Your sake, that I may reign with You. * I die for You that I may also live in You. * Accept me as an unblemished sacrifice * as I offer myself to You with love.” * At her entreaties and intercessions, * save our souls, O Merciful Lord.
ltx/en_us_goadedes/he.ga:heGA.KaiTroponMetochos.incipit	Becoming a partner…
ltx/en_us_goadedes/he.ga:heGA.KaiTroponMetochos.melody	
ltx/en_us_goadedes/he.ga:heGA.KaiTroponMetochos.mode	@ltx/en_us_goadedes/miscellanea:misc.Mode4
ltx/en_us_goadedes/he.ga:heGA.KaiTroponMetochos.name	Becoming a partner.
ltx/en_us_goadedes/he.ga:heGA.KaiTroponMetochos.text1	Becoming a partner with the Apostles in way of life and successor to their thrones, O God-inspired Saint, in the active life you found an entrance to contemplation. Hence you rightly expounded the word of truth, and you shed your blood in struggling for the faith, O Hieromartyr
ltx/en_us_goadedes/he.ga:heGA.KaiTroponMetochos.text2	Intercede with Christ our God, beseeching Him to save our souls.
ltx/en_us_goadedes/he.ga:heGA.KanonaPisteos.incipit	The actual facts…
ltx/en_us_goadedes/he.ga:heGA.KanonaPisteos.melody	
ltx/en_us_goadedes/he.ga:heGA.KanonaPisteos.mode	@ltx/en_us_goadedes/miscellanea:misc.Mode4
ltx/en_us_goadedes/he.ga:heGA.KanonaPisteos.name	The actual facts.
ltx/en_us_goadedes/he.ga:heGA.KanonaPisteos.text1	A rule of faith are you, and an icon of gentleness, and a teacher of self-control. And to your flock this was evident, by the truth of your life and deeds. You were humble and therefore you acquired exalted gifts, treasure in heaven for being poor.
ltx/en_us_goadedes/he.ga:heGA.KanonaPisteos.text2	intercede with Christ our God, and entreat Him to save our souls.
ltx/en_us_goadedes/he.ga:heGA.OMartysSouKyrie.greekmelody	@ltx/en_us_goadedes/he.a.m4:heAU.TachyProkatalave.greekname
ltx/en_us_goadedes/he.ga:heGA.OMartysSouKyrie.incipit	You Martyr, O Lord…
ltx/en_us_goadedes/he.ga:heGA.OMartysSouKyrie.melody	@ltx/en_us_goadedes/he.a.m4:heAU.TachyProkatalave.name
ltx/en_us_goadedes/he.ga:heGA.OMartysSouKyrie.mode	@ltx/en_us_goadedes/miscellanea:misc.Mode4
ltx/en_us_goadedes/he.ga:heGA.OMartysSouKyrie.name	You Martyr, O Lord.
ltx/en_us_goadedes/he.ga:heGA.OMartysSouKyrie.text	Your Martyr, O Lord, was worthily awarded by You * the crown of incorruption, in that he contested for You our immortal God. * Since he possessed Your power, he defeated the tyrants, * dashing the demons’ powerless displays of defiance. * O Christ God, at his fervent entreaties, save our souls.
ltx/en_us_goadedes/he.ga:heGA.OTheosTonPateronImon.incipit	O God of our Fathers…
ltx/en_us_goadedes/he.ga:heGA.OTheosTonPateronImon.melody	
ltx/en_us_goadedes/he.ga:heGA.OTheosTonPateronImon.mode	@ltx/en_us_goadedes/miscellanea:misc.Mode4
ltx/en_us_goadedes/he.ga:heGA.OTheosTonPateronImon.name	O God of our Fathers.
ltx/en_us_goadedes/he.ga:heGA.OTheosTonPateronImon.text	O God of our Fathers, since You always deal with us in accordance with Your gentleness, do not withdraw Your mercy from us, but at their fervent entreaties, pilot our life in peace.
ltx/en_us_goadedes/he.ga:heGA.OiMartyresSouKyrie.greekmelody	@ltx/en_us_goadedes/he.a.m4:heAU.TachyProkatalave.greekname
ltx/en_us_goadedes/he.ga:heGA.OiMartyresSouKyrie.incipit	Your Martyrs, O Lord…
ltx/en_us_goadedes/he.ga:heGA.OiMartyresSouKyrie.melody	@ltx/en_us_goadedes/he.a.m4:heAU.TachyProkatalave.name
ltx/en_us_goadedes/he.ga:heGA.OiMartyresSouKyrie.mode	@ltx/en_us_goadedes/miscellanea:misc.Mode4
ltx/en_us_goadedes/he.ga:heGA.OiMartyresSouKyrie.name	Your Martyrs, O Lord.
ltx/en_us_goadedes/he.ga:heGA.OiMartyresSouKyrie.text	Your Martyrs, O Lord, were worthily awarded by You * the crowns of incorruption, in that they contested for You our immortal God. * Since they possessed Your power, they defeated the tyrants, * dashing the demons’ powerless displays of defiance. * O Christ God, at their fervent entreaties, save our souls.
ltx/en_us_goadedes/he.ga:heGA.OrthodoxiasOdigeH.incipit	Guide of Orthodoxy…
ltx/en_us_goadedes/he.ga:heGA.OrthodoxiasOdigeH.melody	
ltx/en_us_goadedes/he.ga:heGA.OrthodoxiasOdigeH.mode	@ltx/en_us_goadedes/miscellanea:misc.Mode8
ltx/en_us_goadedes/he.ga:heGA.OrthodoxiasOdigeH.name	Guide of Orthodoxy.
ltx/en_us_goadedes/he.ga:heGA.OrthodoxiasOdigeH.text1	Guide of Orthodoxy and a sacred teacher of piety and dignity, luminary of the world, and God-inspired jewel of the episcopate, O wise
ltx/en_us_goadedes/he.ga:heGA.OrthodoxiasOdigeH.text2	the Spirit’s instrument: by your teachings you enlightened all. Intercede with Christ our God for the salvation of our souls.
ltx/en_us_goadedes/he.ga:heGA.OrthodoxiasOdigeM.incipit	Guide of Orthodoxy…
ltx/en_us_goadedes/he.ga:heGA.OrthodoxiasOdigeM.melody	
ltx/en_us_goadedes/he.ga:heGA.OrthodoxiasOdigeM.mode	@ltx/en_us_goadedes/miscellanea:misc.Mode8
ltx/en_us_goadedes/he.ga:heGA.OrthodoxiasOdigeM.name	Guide of Orthodoxy.
ltx/en_us_goadedes/he.ga:heGA.OrthodoxiasOdigeM.text1	Guide of Orthodoxy and a sacred teacher of piety and dignity, luminary of the world, and God-inspired jewel of monastics, O wise
ltx/en_us_goadedes/he.ga:heGA.OrthodoxiasOdigeM.text2	the Spirit’s instrument: by your teachings you enlightened all. Intercede with Christ our God for the salvation of our souls.
ltx/en_us_goadedes/he.ga:heGA.TaisTonDakryonSou.incipit	With the rivers of your tears…
ltx/en_us_goadedes/he.ga:heGA.TaisTonDakryonSou.melody	
ltx/en_us_goadedes/he.ga:heGA.TaisTonDakryonSou.mode	@ltx/en_us_goadedes/miscellanea:misc.Mode8
ltx/en_us_goadedes/he.ga:heGA.TaisTonDakryonSou.name	With the rivers of your tears.
ltx/en_us_goadedes/he.ga:heGA.TaisTonDakryonSou.text1	With the rivers of your tears you made the barren desert bloom; and with your sighs from deep within, you made your labors bear their fruits a hundredfold; and you became a star, illuminating the world by your miracles, O
ltx/en_us_goadedes/he.ga:heGA.TaisTonDakryonSou.text2	our devout father. Intercede with Christ our God, for the salvation of our souls.
ltx/en_us_goadedes/he.ga:heGA.TasAlgidonas.incipit	The holy martyrs suffered…
ltx/en_us_goadedes/he.ga:heGA.TasAlgidonas.melody	
ltx/en_us_goadedes/he.ga:heGA.TasAlgidonas.mode	@ltx/en_us_goadedes/miscellanea:misc.Mode1
ltx/en_us_goadedes/he.ga:heGA.TasAlgidonas.name	The holy martyrs suffered.
ltx/en_us_goadedes/he.ga:heGA.TasAlgidonas.text	The holy martyrs suffered painful tortures for Your sake, O Lord; be compelled by what they endured, and heal our every pain, we entreat You, O only benevolent God.
ltx/en_us_goadedes/he.ga:heGA.TisErimouPolitis.greekmelody	@ltx/en_us_goadedes/he.a.m1:heAU.TisErimouPolitis.greekname
ltx/en_us_goadedes/he.ga:heGA.TisErimouPolitis.incipit	As a citizen of the desert…
ltx/en_us_goadedes/he.ga:heGA.TisErimouPolitis.melody	@ltx/en_us_goadedes/miscellanea:misc.Automelon
ltx/en_us_goadedes/he.ga:heGA.TisErimouPolitis.mode	@ltx/en_us_goadedes/miscellanea:misc.Mode1
ltx/en_us_goadedes/he.ga:heGA.TisErimouPolitis.name	As a citizen of the desert.
ltx/en_us_goadedes/he.ga:heGA.TisErimouPolitis.text1	As a citizen of the desert and an angel incarnate * and a wonder-worker you shone forth, O
ltx/en_us_goadedes/he.ga:heGA.TisErimouPolitis.text2	our God-bearing father. * Since you received the spiritual gifts * by fasting and vigilance and prayer, * you can cure those who are ailing and heal the souls * of those who run to you with faith. * Glory to Him who gave His might to you; * glory to Him who placed a crown on you; * glory to Him who operates through you, providing cures to all.
ltx/en_us_goadedes/he.ga:heGA.TouProfitouSou.incipit	As we celebrate…
ltx/en_us_goadedes/he.ga:heGA.TouProfitouSou.melody	
ltx/en_us_goadedes/he.ga:heGA.TouProfitouSou.mode	@ltx/en_us_goadedes/miscellanea:misc.Mode2
ltx/en_us_goadedes/he.ga:heGA.TouProfitouSou.name	As we celebrate.
ltx/en_us_goadedes/he.ga:heGA.TouProfitouSou.text1	As we celebrate the memory of Your Prophet
ltx/en_us_goadedes/he.ga:heGA.TouProfitouSou.text2	through him we importune You, O Lord, that You save our souls.
ltx/en_us_goadedes/he.ga:heGA.YpomonisStylos.incipit	You became a pillar…
ltx/en_us_goadedes/he.ga:heGA.YpomonisStylos.melody	
ltx/en_us_goadedes/he.ga:heGA.YpomonisStylos.mode	@ltx/en_us_goadedes/miscellanea:misc.Mode1
ltx/en_us_goadedes/he.ga:heGA.YpomonisStylos.name	You became a pillar.
ltx/en_us_goadedes/he.ga:heGA.YpomonisStylos.text1	You became a pillar of patience, O devout one, emulating the forefathers, Job in his sufferings and Joseph in his temptations, and the manner of the bodiless, though you were still in body. O devout father
ltx/en_us_goadedes/he.ga:heGA.YpomonisStylos.text2	intercede with Christ God, to save our souls.
ltx/en_us_goadedes/he.ga:heGA.title	General Apolytikia
