ltx/en_us_goadedes/eu.smallblessingofwater:euSWB.Key0100.title	The Service of the Small Blessing of Water
ltx/en_us_goadedes/eu.smallblessingofwater:euSWB.Key0201.incipit	@ltx/en_us_goadedes/he.h.m6:heHE.IToChaireDiAngelou.incipit
ltx/en_us_goadedes/eu.smallblessingofwater:euSWB.Key0201.melody	@ltx/en_us_goadedes/he.h.m6:heHE.IToChaireDiAngelou.melody
ltx/en_us_goadedes/eu.smallblessingofwater:euSWB.Key0201.mode	@ltx/en_us_goadedes/miscellanea:misc.Mode6
ltx/en_us_goadedes/eu.smallblessingofwater:euSWB.Key0201.text	@ltx/en_us_goadedes/he.h.m6:heHE.IToChaireDiAngelou.text
ltx/en_us_goadedes/eu.smallblessingofwater:euSWB.Key0202.incipit	…
ltx/en_us_goadedes/eu.smallblessingofwater:euSWB.Key0202.melody	@ltx/en_us_goadedes/he.h.m6:heHE.IToChaireDiAngelou.name
ltx/en_us_goadedes/eu.smallblessingofwater:euSWB.Key0202.mode	@ltx/en_us_goadedes/miscellanea:misc.Mode6
ltx/en_us_goadedes/eu.smallblessingofwater:euSWB.Key0202.text	
ltx/en_us_goadedes/eu.smallblessingofwater:euSWB.Key0203.incipit	…
ltx/en_us_goadedes/eu.smallblessingofwater:euSWB.Key0203.melody	@ltx/en_us_goadedes/he.h.m6:heHE.IToChaireDiAngelou.name
ltx/en_us_goadedes/eu.smallblessingofwater:euSWB.Key0203.mode	@ltx/en_us_goadedes/miscellanea:misc.Mode6
ltx/en_us_goadedes/eu.smallblessingofwater:euSWB.Key0203.text	
ltx/en_us_goadedes/eu.smallblessingofwater:euSWB.Key0204.incipit	…
ltx/en_us_goadedes/eu.smallblessingofwater:euSWB.Key0204.melody	@ltx/en_us_goadedes/he.h.m6:heHE.IToChaireDiAngelou.name
ltx/en_us_goadedes/eu.smallblessingofwater:euSWB.Key0204.mode	@ltx/en_us_goadedes/miscellanea:misc.Mode6
ltx/en_us_goadedes/eu.smallblessingofwater:euSWB.Key0204.text	
ltx/en_us_goadedes/eu.smallblessingofwater:euSWB.Key0205.incipit	…
ltx/en_us_goadedes/eu.smallblessingofwater:euSWB.Key0205.melody	@ltx/en_us_goadedes/he.h.m6:heHE.IToChaireDiAngelou.name
ltx/en_us_goadedes/eu.smallblessingofwater:euSWB.Key0205.mode	@ltx/en_us_goadedes/miscellanea:misc.Mode6
ltx/en_us_goadedes/eu.smallblessingofwater:euSWB.Key0205.text	
ltx/en_us_goadedes/eu.smallblessingofwater:euSWB.Key0206.incipit	…
ltx/en_us_goadedes/eu.smallblessingofwater:euSWB.Key0206.melody	@ltx/en_us_goadedes/he.h.m6:heHE.IToChaireDiAngelou.name
ltx/en_us_goadedes/eu.smallblessingofwater:euSWB.Key0206.mode	@ltx/en_us_goadedes/miscellanea:misc.Mode6
ltx/en_us_goadedes/eu.smallblessingofwater:euSWB.Key0206.text	
ltx/en_us_goadedes/eu.smallblessingofwater:euSWB.Key0207.incipit	…
ltx/en_us_goadedes/eu.smallblessingofwater:euSWB.Key0207.melody	@ltx/en_us_goadedes/he.h.m6:heHE.IToChaireDiAngelou.name
ltx/en_us_goadedes/eu.smallblessingofwater:euSWB.Key0207.mode	@ltx/en_us_goadedes/miscellanea:misc.Mode6
ltx/en_us_goadedes/eu.smallblessingofwater:euSWB.Key0207.text	
ltx/en_us_goadedes/eu.smallblessingofwater:euSWB.Key0208.incipit	…
ltx/en_us_goadedes/eu.smallblessingofwater:euSWB.Key0208.melody	@ltx/en_us_goadedes/he.h.m6:heHE.IToChaireDiAngelou.name
ltx/en_us_goadedes/eu.smallblessingofwater:euSWB.Key0208.mode	@ltx/en_us_goadedes/miscellanea:misc.Mode6
ltx/en_us_goadedes/eu.smallblessingofwater:euSWB.Key0208.text	
ltx/en_us_goadedes/eu.smallblessingofwater:euSWB.Key0209.incipit	…
ltx/en_us_goadedes/eu.smallblessingofwater:euSWB.Key0209.melody	@ltx/en_us_goadedes/he.h.m6:heHE.IToChaireDiAngelou.name
ltx/en_us_goadedes/eu.smallblessingofwater:euSWB.Key0209.mode	@ltx/en_us_goadedes/miscellanea:misc.Mode6
ltx/en_us_goadedes/eu.smallblessingofwater:euSWB.Key0209.text	
ltx/en_us_goadedes/eu.smallblessingofwater:euSWB.Key0210.incipit	…
ltx/en_us_goadedes/eu.smallblessingofwater:euSWB.Key0210.melody	@ltx/en_us_goadedes/he.h.m6:heHE.IToChaireDiAngelou.name
ltx/en_us_goadedes/eu.smallblessingofwater:euSWB.Key0210.mode	@ltx/en_us_goadedes/miscellanea:misc.Mode6
ltx/en_us_goadedes/eu.smallblessingofwater:euSWB.Key0210.text	
ltx/en_us_goadedes/eu.smallblessingofwater:euSWB.Key0211.incipit	…
ltx/en_us_goadedes/eu.smallblessingofwater:euSWB.Key0211.melody	@ltx/en_us_goadedes/he.h.m6:heHE.IToChaireDiAngelou.name
ltx/en_us_goadedes/eu.smallblessingofwater:euSWB.Key0211.mode	@ltx/en_us_goadedes/miscellanea:misc.Mode6
ltx/en_us_goadedes/eu.smallblessingofwater:euSWB.Key0211.text	
ltx/en_us_goadedes/eu.smallblessingofwater:euSWB.Key0212.incipit	…
ltx/en_us_goadedes/eu.smallblessingofwater:euSWB.Key0212.melody	@ltx/en_us_goadedes/he.h.m6:heHE.IToChaireDiAngelou.name
ltx/en_us_goadedes/eu.smallblessingofwater:euSWB.Key0212.mode	@ltx/en_us_goadedes/miscellanea:misc.Mode6
ltx/en_us_goadedes/eu.smallblessingofwater:euSWB.Key0212.text	
ltx/en_us_goadedes/eu.smallblessingofwater:euSWB.Key0213.incipit	…
ltx/en_us_goadedes/eu.smallblessingofwater:euSWB.Key0213.melody	@ltx/en_us_goadedes/he.h.m6:heHE.IToChaireDiAngelou.name
ltx/en_us_goadedes/eu.smallblessingofwater:euSWB.Key0213.mode	@ltx/en_us_goadedes/miscellanea:misc.Mode6
ltx/en_us_goadedes/eu.smallblessingofwater:euSWB.Key0213.text	
ltx/en_us_goadedes/eu.smallblessingofwater:euSWB.Key0214.incipit	…
ltx/en_us_goadedes/eu.smallblessingofwater:euSWB.Key0214.melody	@ltx/en_us_goadedes/he.h.m6:heHE.IToChaireDiAngelou.name
ltx/en_us_goadedes/eu.smallblessingofwater:euSWB.Key0214.mode	@ltx/en_us_goadedes/miscellanea:misc.Mode6
ltx/en_us_goadedes/eu.smallblessingofwater:euSWB.Key0214.text	
ltx/en_us_goadedes/eu.smallblessingofwater:euSWB.Key0215.incipit	…
ltx/en_us_goadedes/eu.smallblessingofwater:euSWB.Key0215.melody	@ltx/en_us_goadedes/he.h.m6:heHE.IToChaireDiAngelou.name
ltx/en_us_goadedes/eu.smallblessingofwater:euSWB.Key0215.mode	@ltx/en_us_goadedes/miscellanea:misc.Mode6
ltx/en_us_goadedes/eu.smallblessingofwater:euSWB.Key0215.text	
ltx/en_us_goadedes/eu.smallblessingofwater:euSWB.Key0216.incipit	…
ltx/en_us_goadedes/eu.smallblessingofwater:euSWB.Key0216.melody	@ltx/en_us_goadedes/he.h.m6:heHE.IToChaireDiAngelou.name
ltx/en_us_goadedes/eu.smallblessingofwater:euSWB.Key0216.mode	@ltx/en_us_goadedes/miscellanea:misc.Mode6
ltx/en_us_goadedes/eu.smallblessingofwater:euSWB.Key0216.text	
ltx/en_us_goadedes/eu.smallblessingofwater:euSWB.Key0217.incipit	…
ltx/en_us_goadedes/eu.smallblessingofwater:euSWB.Key0217.melody	@ltx/en_us_goadedes/he.h.m6:heHE.IToChaireDiAngelou.name
ltx/en_us_goadedes/eu.smallblessingofwater:euSWB.Key0217.mode	@ltx/en_us_goadedes/miscellanea:misc.Mode6
ltx/en_us_goadedes/eu.smallblessingofwater:euSWB.Key0217.text	
ltx/en_us_goadedes/eu.smallblessingofwater:euSWB.Key0218.incipit	…
ltx/en_us_goadedes/eu.smallblessingofwater:euSWB.Key0218.melody	@ltx/en_us_goadedes/he.h.m6:heHE.IToChaireDiAngelou.name
ltx/en_us_goadedes/eu.smallblessingofwater:euSWB.Key0218.mode	@ltx/en_us_goadedes/miscellanea:misc.Mode6
ltx/en_us_goadedes/eu.smallblessingofwater:euSWB.Key0218.text	
ltx/en_us_goadedes/eu.smallblessingofwater:euSWB.Key0219.incipit	…
ltx/en_us_goadedes/eu.smallblessingofwater:euSWB.Key0219.melody	@ltx/en_us_goadedes/he.h.m6:heHE.IToChaireDiAngelou.name
ltx/en_us_goadedes/eu.smallblessingofwater:euSWB.Key0219.mode	@ltx/en_us_goadedes/miscellanea:misc.Mode6
ltx/en_us_goadedes/eu.smallblessingofwater:euSWB.Key0219.text	
ltx/en_us_goadedes/eu.smallblessingofwater:euSWB.Key0220.incipit	…
ltx/en_us_goadedes/eu.smallblessingofwater:euSWB.Key0220.melody	@ltx/en_us_goadedes/he.h.m6:heHE.IToChaireDiAngelou.name
ltx/en_us_goadedes/eu.smallblessingofwater:euSWB.Key0220.mode	@ltx/en_us_goadedes/miscellanea:misc.Mode6
ltx/en_us_goadedes/eu.smallblessingofwater:euSWB.Key0220.text	
ltx/en_us_goadedes/eu.smallblessingofwater:euSWB.Key0221.incipit	…
ltx/en_us_goadedes/eu.smallblessingofwater:euSWB.Key0221.melody	@ltx/en_us_goadedes/he.h.m6:heHE.IToChaireDiAngelou.name
ltx/en_us_goadedes/eu.smallblessingofwater:euSWB.Key0221.mode	@ltx/en_us_goadedes/miscellanea:misc.Mode6
ltx/en_us_goadedes/eu.smallblessingofwater:euSWB.Key0221.text	
ltx/en_us_goadedes/eu.smallblessingofwater:euSWB.Key0222.incipit	…
ltx/en_us_goadedes/eu.smallblessingofwater:euSWB.Key0222.melody	@ltx/en_us_goadedes/he.h.m6:heHE.IToChaireDiAngelou.name
ltx/en_us_goadedes/eu.smallblessingofwater:euSWB.Key0222.mode	@ltx/en_us_goadedes/miscellanea:misc.Mode6
ltx/en_us_goadedes/eu.smallblessingofwater:euSWB.Key0222.text	
ltx/en_us_goadedes/eu.smallblessingofwater:euSWB.Key0223.incipit	…
ltx/en_us_goadedes/eu.smallblessingofwater:euSWB.Key0223.melody	@ltx/en_us_goadedes/he.h.m6:heHE.IToChaireDiAngelou.name
ltx/en_us_goadedes/eu.smallblessingofwater:euSWB.Key0223.mode	@ltx/en_us_goadedes/miscellanea:misc.Mode6
ltx/en_us_goadedes/eu.smallblessingofwater:euSWB.Key0223.text	
ltx/en_us_goadedes/eu.smallblessingofwater:euSWB.Key0224.incipit	…
ltx/en_us_goadedes/eu.smallblessingofwater:euSWB.Key0224.melody	@ltx/en_us_goadedes/he.h.m6:heHE.IToChaireDiAngelou.name
ltx/en_us_goadedes/eu.smallblessingofwater:euSWB.Key0224.mode	@ltx/en_us_goadedes/miscellanea:misc.Mode6
ltx/en_us_goadedes/eu.smallblessingofwater:euSWB.Key0224.text	
ltx/en_us_goadedes/eu.smallblessingofwater:euSWB.Key0225.incipit	…
ltx/en_us_goadedes/eu.smallblessingofwater:euSWB.Key0225.melody	@ltx/en_us_goadedes/he.h.m6:heHE.IToChaireDiAngelou.name
ltx/en_us_goadedes/eu.smallblessingofwater:euSWB.Key0225.mode	@ltx/en_us_goadedes/miscellanea:misc.Mode6
ltx/en_us_goadedes/eu.smallblessingofwater:euSWB.Key0225.text	
ltx/en_us_goadedes/eu.smallblessingofwater:euSWB.Key0226.incipit	…
ltx/en_us_goadedes/eu.smallblessingofwater:euSWB.Key0226.melody	@ltx/en_us_goadedes/he.h.m6:heHE.IToChaireDiAngelou.name
ltx/en_us_goadedes/eu.smallblessingofwater:euSWB.Key0226.mode	@ltx/en_us_goadedes/miscellanea:misc.Mode6
ltx/en_us_goadedes/eu.smallblessingofwater:euSWB.Key0226.text	
ltx/en_us_goadedes/eu.smallblessingofwater:euSWB.Key0227.incipit	…
ltx/en_us_goadedes/eu.smallblessingofwater:euSWB.Key0227.melody	@ltx/en_us_goadedes/he.h.m6:heHE.IToChaireDiAngelou.name
ltx/en_us_goadedes/eu.smallblessingofwater:euSWB.Key0227.mode	@ltx/en_us_goadedes/miscellanea:misc.Mode6
ltx/en_us_goadedes/eu.smallblessingofwater:euSWB.Key0227.text	
ltx/en_us_goadedes/eu.smallblessingofwater:euSWB.Key0228.incipit	…
ltx/en_us_goadedes/eu.smallblessingofwater:euSWB.Key0228.melody	@ltx/en_us_goadedes/he.h.m6:heHE.IToChaireDiAngelou.name
ltx/en_us_goadedes/eu.smallblessingofwater:euSWB.Key0228.mode	@ltx/en_us_goadedes/miscellanea:misc.Mode6
ltx/en_us_goadedes/eu.smallblessingofwater:euSWB.Key0228.text	
ltx/en_us_goadedes/eu.smallblessingofwater:euSWB.Key0229.incipit	…
ltx/en_us_goadedes/eu.smallblessingofwater:euSWB.Key0229.melody	@ltx/en_us_goadedes/he.h.m6:heHE.IToChaireDiAngelou.name
ltx/en_us_goadedes/eu.smallblessingofwater:euSWB.Key0229.mode	@ltx/en_us_goadedes/miscellanea:misc.Mode6
ltx/en_us_goadedes/eu.smallblessingofwater:euSWB.Key0229.text	
ltx/en_us_goadedes/eu.smallblessingofwater:euSWB.Key0230.incipit	…
ltx/en_us_goadedes/eu.smallblessingofwater:euSWB.Key0230.melody	@ltx/en_us_goadedes/he.h.m6:heHE.IToChaireDiAngelou.name
ltx/en_us_goadedes/eu.smallblessingofwater:euSWB.Key0230.mode	@ltx/en_us_goadedes/miscellanea:misc.Mode6
ltx/en_us_goadedes/eu.smallblessingofwater:euSWB.Key0230.text	
ltx/en_us_goadedes/eu.smallblessingofwater:euSWB.Key0231.incipit	…
ltx/en_us_goadedes/eu.smallblessingofwater:euSWB.Key0231.melody	@ltx/en_us_goadedes/he.h.m6:heHE.IToChaireDiAngelou.name
ltx/en_us_goadedes/eu.smallblessingofwater:euSWB.Key0231.mode	@ltx/en_us_goadedes/miscellanea:misc.Mode6
ltx/en_us_goadedes/eu.smallblessingofwater:euSWB.Key0231.text	
ltx/en_us_goadedes/eu.smallblessingofwater:euSWB.Key0232.incipit	…
ltx/en_us_goadedes/eu.smallblessingofwater:euSWB.Key0232.melody	@ltx/en_us_goadedes/he.h.m6:heHE.IToChaireDiAngelou.name
ltx/en_us_goadedes/eu.smallblessingofwater:euSWB.Key0232.mode	@ltx/en_us_goadedes/miscellanea:misc.Mode6
ltx/en_us_goadedes/eu.smallblessingofwater:euSWB.Key0232.text	
ltx/en_us_goadedes/eu.smallblessingofwater:euSWB.Key0233.incipit	…
ltx/en_us_goadedes/eu.smallblessingofwater:euSWB.Key0233.melody	@ltx/en_us_goadedes/he.h.m6:heHE.IToChaireDiAngelou.name
ltx/en_us_goadedes/eu.smallblessingofwater:euSWB.Key0233.mode	@ltx/en_us_goadedes/miscellanea:misc.Mode6
ltx/en_us_goadedes/eu.smallblessingofwater:euSWB.Key0233.text	
ltx/en_us_goadedes/eu.smallblessingofwater:euSWB.Key0234.incipit	…
ltx/en_us_goadedes/eu.smallblessingofwater:euSWB.Key0234.melody	@ltx/en_us_goadedes/he.h.m6:heHE.IToChaireDiAngelou.name
ltx/en_us_goadedes/eu.smallblessingofwater:euSWB.Key0234.mode	@ltx/en_us_goadedes/miscellanea:misc.Mode6
ltx/en_us_goadedes/eu.smallblessingofwater:euSWB.Key0234.text	
ltx/en_us_goadedes/eu.smallblessingofwater:euSWB.Key0235.incipit	…
ltx/en_us_goadedes/eu.smallblessingofwater:euSWB.Key0235.melody	@ltx/en_us_goadedes/he.h.m6:heHE.IToChaireDiAngelou.name
ltx/en_us_goadedes/eu.smallblessingofwater:euSWB.Key0235.mode	@ltx/en_us_goadedes/miscellanea:misc.Mode6
ltx/en_us_goadedes/eu.smallblessingofwater:euSWB.Key0235.text	
ltx/en_us_goadedes/eu.smallblessingofwater:euSWB.Key0236.incipit	…
ltx/en_us_goadedes/eu.smallblessingofwater:euSWB.Key0236.melody	@ltx/en_us_goadedes/he.h.m6:heHE.IToChaireDiAngelou.name
ltx/en_us_goadedes/eu.smallblessingofwater:euSWB.Key0236.mode	@ltx/en_us_goadedes/miscellanea:misc.Mode6
ltx/en_us_goadedes/eu.smallblessingofwater:euSWB.Key0236.text	
ltx/en_us_goadedes/eu.smallblessingofwater:euSWB.Key0237.incipit	…
ltx/en_us_goadedes/eu.smallblessingofwater:euSWB.Key0237.melody	@ltx/en_us_goadedes/he.h.m6:heHE.IToChaireDiAngelou.name
ltx/en_us_goadedes/eu.smallblessingofwater:euSWB.Key0237.mode	@ltx/en_us_goadedes/miscellanea:misc.Mode6
ltx/en_us_goadedes/eu.smallblessingofwater:euSWB.Key0237.text	
ltx/en_us_goadedes/eu.smallblessingofwater:euSWB.Key0238.incipit	…
ltx/en_us_goadedes/eu.smallblessingofwater:euSWB.Key0238.melody	@ltx/en_us_goadedes/he.h.m6:heHE.IToChaireDiAngelou.name
ltx/en_us_goadedes/eu.smallblessingofwater:euSWB.Key0238.mode	@ltx/en_us_goadedes/miscellanea:misc.Mode6
ltx/en_us_goadedes/eu.smallblessingofwater:euSWB.Key0238.text	
ltx/en_us_goadedes/eu.smallblessingofwater:euSWB.Key0239.incipit	…
ltx/en_us_goadedes/eu.smallblessingofwater:euSWB.Key0239.melody	@ltx/en_us_goadedes/he.h.m6:heHE.IToChaireDiAngelou.name
ltx/en_us_goadedes/eu.smallblessingofwater:euSWB.Key0239.mode	@ltx/en_us_goadedes/miscellanea:misc.Mode6
ltx/en_us_goadedes/eu.smallblessingofwater:euSWB.Key0239.text	
ltx/en_us_goadedes/eu.smallblessingofwater:euSWB.Key0240.incipit	@ltx/en_us_goadedes/oc.m6.d5:ocMA.Kathisma13.incipit
ltx/en_us_goadedes/eu.smallblessingofwater:euSWB.Key0240.text	@ltx/en_us_goadedes/oc.m6.d5:ocMA.Kathisma13.text
ltx/en_us_goadedes/eu.smallblessingofwater:euSWB.Key0301.incipit	…
ltx/en_us_goadedes/eu.smallblessingofwater:euSWB.Key0301.mode	@ltx/en_us_goadedes/miscellanea:misc.Mode8
ltx/en_us_goadedes/eu.smallblessingofwater:euSWB.Key0301.text	
ltx/en_us_goadedes/eu.smallblessingofwater:euSWB.Key0302.incipit	…
ltx/en_us_goadedes/eu.smallblessingofwater:euSWB.Key0302.mode	@ltx/en_us_goadedes/miscellanea:misc.Mode8
ltx/en_us_goadedes/eu.smallblessingofwater:euSWB.Key0302.text	
ltx/en_us_goadedes/eu.smallblessingofwater:euSWB.Key0303.incipit	…
ltx/en_us_goadedes/eu.smallblessingofwater:euSWB.Key0303.melody	@ltx/en_us_goadedes/he.h.m8:heHE.OukEstinAgios.name
ltx/en_us_goadedes/eu.smallblessingofwater:euSWB.Key0303.mode	@ltx/en_us_goadedes/miscellanea:misc.Mode8
ltx/en_us_goadedes/eu.smallblessingofwater:euSWB.Key0303.text	
ltx/en_us_goadedes/eu.smallblessingofwater:euSWB.Key0304.incipit	…
ltx/en_us_goadedes/eu.smallblessingofwater:euSWB.Key0304.mode	@ltx/en_us_goadedes/miscellanea:misc.Mode8
ltx/en_us_goadedes/eu.smallblessingofwater:euSWB.Key0304.text	
ltx/en_us_goadedes/eu.smallblessingofwater:euSWB.Key0401a.text	Lord our God, great in counsel and marvelous in works, maker of all creation, visible and invisible, You keep Your covenant and mercy with those who love You and keep Your commandments, and You consider the pitiable tears of everyone in distress, since this is why You came in the form of a servant, not to frighten us with apparitions, but rather to grant real physical health, saying, “See, you are well! Sin no more.” Indeed, You revitalized eyes with clay, and giving the word that they be washed, You enabled them to dwell in light. You dislodge the heavy rocks of adverse passions. You calm the briny sea of this life. You suppress the violent waves of pleasures. And so we pray, benevolent King, who gave us to wear a snow-white garment by water and the Spirit, send down Your blessing to us as we drink and are sprinkled with this water, and wipe away the filth caused by illnesses and passions.
ltx/en_us_goadedes/eu.smallblessingofwater:euSWB.Key0401b.text	Yes, good Master, we are praying that You consider our infirmity, and that in Your mercy You cure the ailments of our souls and bodies,
ltx/en_us_goadedes/eu.smallblessingofwater:euSWB.Key0402.text	(the saint of the day), whose memory we are observing; and all Your saints.
ltx/en_us_goadedes/eu.smallblessingofwater:euSWB.Key0403.text	Lord, we also pray that You guard Your servants our government officials. Grant them health of soul and body, and move them to be favorably disposed in every respect towards us Christian citizens who are Your servants.
ltx/en_us_goadedes/eu.smallblessingofwater:euSWB.Key0404.text	Remember, O Lord, every Orthodox bishop who rightly teaches the word of Your truth, and all the clergy, and keep them safe and sound. Remember, O Lord, those who hate us and those who love us, our brethren who serve us, the people here in attendance and those who are absent with good cause, and everyone who has asked us the unworthy to pray for them. Remember, O Lord, our brethren who are hostages or refugees and in affliction, and have mercy on them and on us, according to Your great mercy, and deliver us from all distress.
ltx/en_us_goadedes/eu.smallblessingofwater:euSWB.Key0405.text	For You are the source of cures and healings, O Christ our God, and we offer up glory to You and Your Father, who is without beginning, and Your all-holy, good, and life-creating Spirit, now and ever and to the ages of ages.
ltx/en_us_goadedes/eu.smallblessingofwater:euSWB.Key0501.incipit	O God, renowned for doing wonders…
ltx/en_us_goadedes/eu.smallblessingofwater:euSWB.Key0501.text	O God, renowned for doing wonders without number, we Your servants call upon You to come to us now. Send out Your Holy Spirit and bless this water. And as we drink it and are sprinkled with it, release us from every evil, strengthen and cleanse our houses, and expel every demonic activity.
ltx/en_us_goadedes/eu.smallblessingofwater:euSWB.Key0501a.text	O God, renowned for doing wonders without number, we Your servants call upon You to come to us now. 
ltx/en_us_goadedes/eu.smallblessingofwater:euSWB.Key0501b.text	Send forth Your Holy Spirit and bless this water.
ltx/en_us_goadedes/eu.smallblessingofwater:euSWB.Key0501c.text	And as we drink it and are sprinkled with it, release us from every evil, strengthen and cleanse our houses, and expel every demonic activity.
ltx/en_us_goadedes/eu.smallblessingofwater:euSWB.Key0502.incipit	Lord our God, in the days of Moses…
ltx/en_us_goadedes/eu.smallblessingofwater:euSWB.Key0502.text	Lord our God, in the days of Moses, You made the bitter water sweet for the people; in the days of Elisha You healed the bad water with salt. You also sanctified the River Jordan at Your immaculate epiphany. And now, Master, we pray that You bless this water, by the action and descent of Your Holy Spirit. Make it be a source of blessings for all who take it and drink it. May it cure ailments, bless houses, and protect against any assault, seen or unseen.
ltx/en_us_goadedes/eu.smallblessingofwater:euSWB.Key0502.title	Another Prayer.
ltx/en_us_goadedes/eu.smallblessingofwater:euSWB.Key0503.inicpit	Creator of water…
ltx/en_us_goadedes/eu.smallblessingofwater:euSWB.Key0503.title	Prayer to Bless Water
ltx/en_us_goadedes/eu.smallblessingofwater:euSWB.Key0503a.text	Creator of water, Maker of the universe, omnipotent Lord and God who fashion and transform all things, we pray You refashion and transform and bless this water, by the power and action and descent of Your Holy Spirit.
ltx/en_us_goadedes/eu.smallblessingofwater:euSWB.Key0503b.text	(As he says this, he blesses the water crosswise with his hand.)
ltx/en_us_goadedes/eu.smallblessingofwater:euSWB.Key0503c.text	Give it the power to repel any hostile actions. Make it be a source of blessings for all who take it and drink it. May it cure ailments, bless houses, and protect against any assault, seen or unseen. Also bless and sanctify this edifice that is dedicated now by being sprinkled, and preserve it unshaken forever.
ltx/en_us_goadedes/eu.smallblessingofwater:euSWB.Key0504.text	For You are the illumination, the Savior, and the guardian of our souls and bodies, and we offer up glory to You, the Father and the Son and the Holy Spirit, now and ever and to the ages of ages.
ltx/en_us_goadedes/eu.smallblessingofwater:euSWB.Key0601.text	@ltx/en_us_goadedes/eu.greatblessingofwater:euGW.Prayer41.text
ltx/en_us_goadedes/eu.smallblessingofwater:euSWB.Key0602.incipit	…
ltx/en_us_goadedes/eu.smallblessingofwater:euSWB.Key0602.mode	@ltx/en_us_goadedes/miscellanea:misc.Mode2
ltx/en_us_goadedes/eu.smallblessingofwater:euSWB.Key0602.text	
ltx/en_us_goadedes/eu.smallblessingofwater:euSWB.R101	Items needed for the celebration of the Blessing of Water are a small table, upon which the Priest places the Gospel book; a silver-plated wooden Cross, a censer; a bowl of water; two candlesticks with their candles; a few branches of basil, and a clean white towel. The Priest should wear a stole, as he does for any priestly function, and the Deacon, a sticharion and orarion. Once the congregation has assembled, the service begins.
ltx/en_us_goadedes/eu.smallblessingofwater:euSWB.R102	The hymn of the local church.
ltx/en_us_goadedes/eu.smallblessingofwater:euSWB.R201	
ltx/en_us_goadedes/eu.smallblessingofwater:euSWB.R301	
ltx/en_us_goadedes/eu.smallblessingofwater:euSWB.R401	The celebrant says the following prayer:
ltx/en_us_goadedes/eu.smallblessingofwater:euSWB.R501	Alternative Prayer said instead of the usual long one for the sake of time.
ltx/en_us_goadedes/eu.smallblessingofwater:euSWB.R601	The celebrant bows his head and quietly says the following prayer:
ltx/en_us_goadedes/eu.smallblessingofwater:euSWB.R602	The celebrant takes the precious Cross and blesses the water by immersing the Cross upright and lifting it three times, as he sings the following hymn:
ltx/en_us_goadedes/eu.smallblessingofwater:euSWB.R603	Then the celebrant sprinkles crosswise and sings the following hymn:
ltx/en_us_goadedes/eu.smallblessingofwater:euSWB.R604	Then the celebrant kisses the precious Cross, and so do the rest of those in attendance, whom the celebrant sprinkles individually on the forehead; and then he proceeds to sprinkle the church (or the house) with holy water.
ltx/en_us_goadedes/eu.smallblessingofwater:euSWB.R605	The Priest [or the Choir] sings the following hymn, repeating it as many times as needed until the sprinkling is finished.
