ltx/en_us_goadedes/me.m01.d02:meCO.C1.acrostic.notice1	
ltx/en_us_goadedes/me.m01.d02:meCO.C1.acrostic.text	
ltx/en_us_goadedes/me.m01.d02:meCO.C1.acrostic.title	
ltx/en_us_goadedes/me.m01.d02:meCO.C1.poet	@ltx/en_us_goadedes/poets:po.SymeonTouLogothetou
ltx/en_us_goadedes/me.m01.d02:meCO.C1.title	
ltx/en_us_goadedes/me.m01.d02:meCO.C1.verse	@ltx/en_us_goadedes/prayers:pr.verse_God.text
ltx/en_us_goadedes/me.m01.d02:meCO.C2.acrostic.notice1	
ltx/en_us_goadedes/me.m01.d02:meCO.C2.acrostic.text	
ltx/en_us_goadedes/me.m01.d02:meCO.C2.acrostic.title	Another Two-ode Canon.
ltx/en_us_goadedes/me.m01.d02:meCO.C2.title	Another Two-ode Canon.
ltx/en_us_goadedes/me.m01.d02:meCO.C2.verse	@ltx/en_us_goadedes/prayers:pr.verse_God.text
ltx/en_us_goadedes/me.m01.d02:meCO.Ode1C11.incipit	…
ltx/en_us_goadedes/me.m01.d02:meCO.Ode1C11.melody	@ltx/en_us_goadedes/he.h.m2:heHE.ToTinAvaton.name
ltx/en_us_goadedes/me.m01.d02:meCO.Ode1C11.mode	@ltx/en_us_goadedes/miscellanea:misc.Mode2
ltx/en_us_goadedes/me.m01.d02:meCO.Ode1C11.ode	@ltx/en_us_goadedes/miscellanea:misc.Ode1
ltx/en_us_goadedes/me.m01.d02:meCO.Ode1C11.text	
ltx/en_us_goadedes/me.m01.d02:meCO.Ode1C12.incipit	…
ltx/en_us_goadedes/me.m01.d02:meCO.Ode1C12.melody	@ltx/en_us_goadedes/he.h.m2:heHE.ToTinAvaton.name
ltx/en_us_goadedes/me.m01.d02:meCO.Ode1C12.mode	@ltx/en_us_goadedes/miscellanea:misc.Mode2
ltx/en_us_goadedes/me.m01.d02:meCO.Ode1C12.ode	@ltx/en_us_goadedes/miscellanea:misc.Ode1
ltx/en_us_goadedes/me.m01.d02:meCO.Ode1C12.text	
ltx/en_us_goadedes/me.m01.d02:meCO.Ode1C1H.incipit	@ltx/en_us_goadedes/he.h.m2:heHE.ToTinAvaton.incipit
ltx/en_us_goadedes/me.m01.d02:meCO.Ode1C1H.melody	@ltx/en_us_goadedes/he.h.m2:heHE.ToTinAvaton.melody
ltx/en_us_goadedes/me.m01.d02:meCO.Ode1C1H.mode	@ltx/en_us_goadedes/miscellanea:misc.Mode2
ltx/en_us_goadedes/me.m01.d02:meCO.Ode1C1H.ode	@ltx/en_us_goadedes/miscellanea:misc.Ode1
ltx/en_us_goadedes/me.m01.d02:meCO.Ode1C1H.text	@ltx/en_us_goadedes/he.h.m2:heHE.ToTinAvaton.text
ltx/en_us_goadedes/me.m01.d02:meCO.Ode8C11.incipit	…
ltx/en_us_goadedes/me.m01.d02:meCO.Ode8C11.melody	@ltx/en_us_goadedes/he.h.m2:heHE.EfrixePaidonEvagon.name
ltx/en_us_goadedes/me.m01.d02:meCO.Ode8C11.mode	@ltx/en_us_goadedes/miscellanea:misc.Mode2
ltx/en_us_goadedes/me.m01.d02:meCO.Ode8C11.ode	@ltx/en_us_goadedes/miscellanea:misc.Ode8
ltx/en_us_goadedes/me.m01.d02:meCO.Ode8C11.text	
ltx/en_us_goadedes/me.m01.d02:meCO.Ode8C12.incipit	…
ltx/en_us_goadedes/me.m01.d02:meCO.Ode8C12.melody	@ltx/en_us_goadedes/he.h.m2:heHE.EfrixePaidonEvagon.name
ltx/en_us_goadedes/me.m01.d02:meCO.Ode8C12.mode	@ltx/en_us_goadedes/miscellanea:misc.Mode2
ltx/en_us_goadedes/me.m01.d02:meCO.Ode8C12.ode	@ltx/en_us_goadedes/miscellanea:misc.Ode8
ltx/en_us_goadedes/me.m01.d02:meCO.Ode8C12.text	
ltx/en_us_goadedes/me.m01.d02:meCO.Ode8C1H.incipit	@ltx/en_us_goadedes/he.h.m2:heHE.EfrixePaidonEvagon.incipit
ltx/en_us_goadedes/me.m01.d02:meCO.Ode8C1H.melody	@ltx/en_us_goadedes/he.h.m2:heHE.EfrixePaidonEvagon.melody
ltx/en_us_goadedes/me.m01.d02:meCO.Ode8C1H.mode	@ltx/en_us_goadedes/miscellanea:misc.Mode2
ltx/en_us_goadedes/me.m01.d02:meCO.Ode8C1H.ode	@ltx/en_us_goadedes/miscellanea:misc.Ode8
ltx/en_us_goadedes/me.m01.d02:meCO.Ode8C1H.text	@ltx/en_us_goadedes/he.h.m2:heHE.EfrixePaidonEvagon.text
ltx/en_us_goadedes/me.m01.d02:meCO.Ode8C21.incipit	Let us shed the sleep…
ltx/en_us_goadedes/me.m01.d02:meCO.Ode8C21.melody	@ltx/en_us_goadedes/he.h.m2:heHE.ToDogmatiToTyranniko.notmetered
ltx/en_us_goadedes/me.m01.d02:meCO.Ode8C21.mode	@ltx/en_us_goadedes/miscellanea:misc.Mode2
ltx/en_us_goadedes/me.m01.d02:meCO.Ode8C21.ode	@ltx/en_us_goadedes/miscellanea:misc.Ode8
ltx/en_us_goadedes/me.m01.d02:meCO.Ode8C21.text	Let us shed the sleep of laziness from our souls through vigilance of heart. And to Him who comes to wash our souls in the river, let us cry aloud, “Bless the Lord, all you works of the Lord.”
ltx/en_us_goadedes/me.m01.d02:meCO.Ode8C22.incipit	Let action abound…
ltx/en_us_goadedes/me.m01.d02:meCO.Ode8C22.melody	@ltx/en_us_goadedes/he.h.m2:heHE.ToDogmatiToTyranniko.notmetered
ltx/en_us_goadedes/me.m01.d02:meCO.Ode8C22.mode	@ltx/en_us_goadedes/miscellanea:misc.Mode2
ltx/en_us_goadedes/me.m01.d02:meCO.Ode8C22.ode	@ltx/en_us_goadedes/miscellanea:misc.Ode8
ltx/en_us_goadedes/me.m01.d02:meCO.Ode8C22.text	Let action abound in us, with exalted contemplation of soul, so that we may shine in both, for Him who washes all. “Bless the Lord, all you works of the Lord.”
ltx/en_us_goadedes/me.m01.d02:meCO.Ode8C23.incipit	O believers, who have worked…
ltx/en_us_goadedes/me.m01.d02:meCO.Ode8C23.melody	@ltx/en_us_goadedes/he.h.m2:heHE.ToDogmatiToTyranniko.notmetered
ltx/en_us_goadedes/me.m01.d02:meCO.Ode8C23.mode	@ltx/en_us_goadedes/miscellanea:misc.Mode2
ltx/en_us_goadedes/me.m01.d02:meCO.Ode8C23.ode	@ltx/en_us_goadedes/miscellanea:misc.Ode8
ltx/en_us_goadedes/me.m01.d02:meCO.Ode8C23.text	O believers, who have worked twice as hard to embellish our talent with practical reason, let us as servants bring it with faith to the Master, who comes be baptized to refashion our souls.
ltx/en_us_goadedes/me.m01.d02:meCO.Ode8C2H.incipit	@ltx/en_us_goadedes/he.h.m2:heHE.ToDogmatiToTyranniko.incipit
ltx/en_us_goadedes/me.m01.d02:meCO.Ode8C2H.melody	@ltx/en_us_goadedes/he.h.m2:heHE.ToDogmatiToTyranniko.melody
ltx/en_us_goadedes/me.m01.d02:meCO.Ode8C2H.mode	@ltx/en_us_goadedes/miscellanea:misc.Mode2
ltx/en_us_goadedes/me.m01.d02:meCO.Ode8C2H.ode	@ltx/en_us_goadedes/miscellanea:misc.Ode8
ltx/en_us_goadedes/me.m01.d02:meCO.Ode8C2H.text	@ltx/en_us_goadedes/he.h.m2:heHE.ToDogmatiToTyranniko.text
ltx/en_us_goadedes/me.m01.d02:meCO.Ode9C11.incipit	…
ltx/en_us_goadedes/me.m01.d02:meCO.Ode9C11.melody	@ltx/en_us_goadedes/he.h.m2:heHE.EmegalynasChriste.name
ltx/en_us_goadedes/me.m01.d02:meCO.Ode9C11.mode	@ltx/en_us_goadedes/miscellanea:misc.Mode2
ltx/en_us_goadedes/me.m01.d02:meCO.Ode9C11.ode	@ltx/en_us_goadedes/miscellanea:misc.Ode9
ltx/en_us_goadedes/me.m01.d02:meCO.Ode9C11.text	
ltx/en_us_goadedes/me.m01.d02:meCO.Ode9C12.incipit	…
ltx/en_us_goadedes/me.m01.d02:meCO.Ode9C12.melody	@ltx/en_us_goadedes/he.h.m2:heHE.EmegalynasChriste.name
ltx/en_us_goadedes/me.m01.d02:meCO.Ode9C12.mode	@ltx/en_us_goadedes/miscellanea:misc.Mode2
ltx/en_us_goadedes/me.m01.d02:meCO.Ode9C12.ode	@ltx/en_us_goadedes/miscellanea:misc.Ode9
ltx/en_us_goadedes/me.m01.d02:meCO.Ode9C12.text	
ltx/en_us_goadedes/me.m01.d02:meCO.Ode9C1H.incipit	@ltx/en_us_goadedes/he.h.m2:heHE.EmegalynasChriste.incipit
ltx/en_us_goadedes/me.m01.d02:meCO.Ode9C1H.melody	@ltx/en_us_goadedes/he.h.m2:heHE.EmegalynasChriste.melody
ltx/en_us_goadedes/me.m01.d02:meCO.Ode9C1H.mode	@ltx/en_us_goadedes/miscellanea:misc.Mode2
ltx/en_us_goadedes/me.m01.d02:meCO.Ode9C1H.ode	@ltx/en_us_goadedes/miscellanea:misc.Ode9
ltx/en_us_goadedes/me.m01.d02:meCO.Ode9C1H.text	@ltx/en_us_goadedes/he.h.m2:heHE.EmegalynasChriste.text
ltx/en_us_goadedes/me.m01.d02:meCO.Ode9C21.incipit	Let us cast aside…
ltx/en_us_goadedes/me.m01.d02:meCO.Ode9C21.melody	@ltx/en_us_goadedes/he.h.m2:heHE.ITonAchoritonTheon.notmetered
ltx/en_us_goadedes/me.m01.d02:meCO.Ode9C21.mode	@ltx/en_us_goadedes/miscellanea:misc.Mode2
ltx/en_us_goadedes/me.m01.d02:meCO.Ode9C21.ode	@ltx/en_us_goadedes/miscellanea:misc.Ode9
ltx/en_us_goadedes/me.m01.d02:meCO.Ode9C21.text	Let us cast aside the heavy stain of sin, and let us appear clean to the Master who purifies all in divine waters.
ltx/en_us_goadedes/me.m01.d02:meCO.Ode9C22.incipit	Having purified ourselves…
ltx/en_us_goadedes/me.m01.d02:meCO.Ode9C22.melody	@ltx/en_us_goadedes/he.h.m2:heHE.ITonAchoritonTheon.notmetered
ltx/en_us_goadedes/me.m01.d02:meCO.Ode9C22.mode	@ltx/en_us_goadedes/miscellanea:misc.Mode2
ltx/en_us_goadedes/me.m01.d02:meCO.Ode9C22.ode	@ltx/en_us_goadedes/miscellanea:misc.Ode9
ltx/en_us_goadedes/me.m01.d02:meCO.Ode9C22.text	Having purified ourselves with streams of tears, come, let us now approach Christ, who has come to be baptized in the River Jordan.
ltx/en_us_goadedes/me.m01.d02:meCO.Ode9C23.incipit	O Savior, we celebrated…
ltx/en_us_goadedes/me.m01.d02:meCO.Ode9C23.melody	@ltx/en_us_goadedes/he.h.m2:heHE.ITonAchoritonTheon.notmetered
ltx/en_us_goadedes/me.m01.d02:meCO.Ode9C23.mode	@ltx/en_us_goadedes/miscellanea:misc.Mode2
ltx/en_us_goadedes/me.m01.d02:meCO.Ode9C23.ode	@ltx/en_us_goadedes/miscellanea:misc.Ode9
ltx/en_us_goadedes/me.m01.d02:meCO.Ode9C23.text	O Savior, we celebrated Your Nativity with the Magi and the Shepherds. Accept us now, as we honor You who come to be baptized. 
ltx/en_us_goadedes/me.m01.d02:meCO.Ode9C2H.incipit	@ltx/en_us_goadedes/he.h.m2:heHE.ITonAchoritonTheon.incipit
ltx/en_us_goadedes/me.m01.d02:meCO.Ode9C2H.melody	@ltx/en_us_goadedes/he.h.m2:heHE.ITonAchoritonTheon.melody
ltx/en_us_goadedes/me.m01.d02:meCO.Ode9C2H.mode	@ltx/en_us_goadedes/miscellanea:misc.Mode2
ltx/en_us_goadedes/me.m01.d02:meCO.Ode9C2H.ode	@ltx/en_us_goadedes/miscellanea:misc.Ode9
ltx/en_us_goadedes/me.m01.d02:meCO.Ode9C2H.text	@ltx/en_us_goadedes/he.h.m2:heHE.ITonAchoritonTheon.text
ltx/en_us_goadedes/me.m01.d02:meDA.commemoration.first	
ltx/en_us_goadedes/me.m01.d02:meDA.commemoration.first_name	
ltx/en_us_goadedes/me.m01.d02:meDA.commemoration.first_short	
ltx/en_us_goadedes/me.m01.d02:meDA.commemoration.first_title	@ltx/en_us_goadedes/titles:ti.Forefestal_hymns
ltx/en_us_goadedes/me.m01.d02:meDA.commemoration.full	
ltx/en_us_goadedes/me.m01.d02:meDA.commemoration.second_name	
ltx/en_us_goadedes/me.m01.d02:meDA.commemoration.second_title	@ltx/en_us_goadedes/titles:ti.SaintM
ltx/en_us_goadedes/me.m01.d02:meDA.date	
ltx/en_us_goadedes/me.m01.d02:meDA.fordate	
ltx/en_us_goadedes/me.m01.d02:meDA.insert1	
ltx/en_us_goadedes/me.m01.d02:meDA.insert2	
ltx/en_us_goadedes/me.m01.d02:meDA.note	
ltx/en_us_goadedes/me.m01.d02:meDA.pdfcoverdate	
ltx/en_us_goadedes/me.m01.d02:meDA.pdfheaderdate	
ltx/en_us_goadedes/me.m01.d02:meHO.commemorations	
ltx/en_us_goadedes/me.m01.d02:meHO.note1	
ltx/en_us_goadedes/me.m01.d02:meHO.note2	
ltx/en_us_goadedes/me.m01.d02:meHO.number	
ltx/en_us_goadedes/me.m01.d02:meHO.rank	
ltx/en_us_goadedes/me.m01.d02:meLE.commemoration1	
ltx/en_us_goadedes/me.m01.d02:meLE.commemoration2	
ltx/en_us_goadedes/me.m01.d02:meLI.Kontakion1.greekmelody	@ltx/en_us_goadedes/me.m01.d02:meMA.Kontakion1.greekmelody
ltx/en_us_goadedes/me.m01.d02:meLI.Kontakion1.incipit	@ltx/en_us_goadedes/me.m01.d02:meMA.Kontakion1.incipit
ltx/en_us_goadedes/me.m01.d02:meLI.Kontakion1.melody	@ltx/en_us_goadedes/me.m01.d02:meMA.Kontakion1.melody
ltx/en_us_goadedes/me.m01.d02:meLI.Kontakion1.mode	@ltx/en_us_goadedes/me.m01.d02:meMA.Kontakion1.mode
ltx/en_us_goadedes/me.m01.d02:meLI.Kontakion1.text	@ltx/en_us_goadedes/me.m01.d02:meMA.Kontakion1.text
ltx/en_us_goadedes/me.m01.d02:meLI.Megalynarion.text	
ltx/en_us_goadedes/me.m01.d02:meMA.AposGlory.incipit	…
ltx/en_us_goadedes/me.m01.d02:meMA.AposGlory.melody	
ltx/en_us_goadedes/me.m01.d02:meMA.AposGlory.mode	@ltx/en_us_goadedes/miscellanea:misc.Mode8
ltx/en_us_goadedes/me.m01.d02:meMA.AposGlory.poet	@ltx/en_us_goadedes/poets:po.Anatoliou
ltx/en_us_goadedes/me.m01.d02:meMA.AposGlory.text	
ltx/en_us_goadedes/me.m01.d02:meMA.Aposticha1.incipit	…
ltx/en_us_goadedes/me.m01.d02:meMA.Aposticha1.melody	
ltx/en_us_goadedes/me.m01.d02:meMA.Aposticha1.mode	@ltx/en_us_goadedes/miscellanea:misc.Mode6
ltx/en_us_goadedes/me.m01.d02:meMA.Aposticha1.poet	@ltx/en_us_goadedes/poets:po.Germanou
ltx/en_us_goadedes/me.m01.d02:meMA.Aposticha1.text	
ltx/en_us_goadedes/me.m01.d02:meMA.Aposticha2.incipit	…
ltx/en_us_goadedes/me.m01.d02:meMA.Aposticha2.melody	
ltx/en_us_goadedes/me.m01.d02:meMA.Aposticha2.mode	@ltx/en_us_goadedes/miscellanea:misc.Mode6
ltx/en_us_goadedes/me.m01.d02:meMA.Aposticha2.poet	@ltx/en_us_goadedes/poets:po.Germanou
ltx/en_us_goadedes/me.m01.d02:meMA.Aposticha2.text	
ltx/en_us_goadedes/me.m01.d02:meMA.Aposticha3.incipit	…
ltx/en_us_goadedes/me.m01.d02:meMA.Aposticha3.melody	
ltx/en_us_goadedes/me.m01.d02:meMA.Aposticha3.mode	@ltx/en_us_goadedes/miscellanea:misc.Mode6
ltx/en_us_goadedes/me.m01.d02:meMA.Aposticha3.poet	@ltx/en_us_goadedes/poets:po.Germanou
ltx/en_us_goadedes/me.m01.d02:meMA.Aposticha3.text	
ltx/en_us_goadedes/me.m01.d02:meMA.C1.acrostic.notice1	
ltx/en_us_goadedes/me.m01.d02:meMA.C1.acrostic.title	
ltx/en_us_goadedes/me.m01.d02:meMA.C1.poet	@ltx/en_us_goadedes/poets:po.Iosif
ltx/en_us_goadedes/me.m01.d02:meMA.C1.title	@ltx/en_us_goadedes/titles:ti.CanonForefeast
ltx/en_us_goadedes/me.m01.d02:meMA.C1.verse	@ltx/en_us_goadedes/prayers:pr.verse_God.text
ltx/en_us_goadedes/me.m01.d02:meMA.C2.acrostic.notice1	
ltx/en_us_goadedes/me.m01.d02:meMA.C2.acrostic.text	
ltx/en_us_goadedes/me.m01.d02:meMA.C2.acrostic.title	
ltx/en_us_goadedes/me.m01.d02:meMA.C2.title	@ltx/en_us_goadedes/titles:ti.CanonSaintM
ltx/en_us_goadedes/me.m01.d02:meMA.C2.verse	@ltx/en_us_goadedes/prayers:pr.verse_SaintM.text
ltx/en_us_goadedes/me.m01.d02:meMA.Exaposteilarion1.greekmelody	@ltx/en_us_goadedes/he.a.m2:heAU.GynaikesAkoutisthite.greekname
ltx/en_us_goadedes/me.m01.d02:meMA.Exaposteilarion1.incipit	…
ltx/en_us_goadedes/me.m01.d02:meMA.Exaposteilarion1.melody	@ltx/en_us_goadedes/he.a.m2:heAU.GynaikesAkoutisthite.name
ltx/en_us_goadedes/me.m01.d02:meMA.Exaposteilarion1.mode	@ltx/en_us_goadedes/miscellanea:misc.Mode2
ltx/en_us_goadedes/me.m01.d02:meMA.Exaposteilarion1.text	
ltx/en_us_goadedes/me.m01.d02:meMA.Exaposteilarion2.greekmelody	@ltx/en_us_goadedes/he.a.m2:heAU.GynaikesAkoutisthite.greekname
ltx/en_us_goadedes/me.m01.d02:meMA.Exaposteilarion2.incipit	Amazing, how the river…
ltx/en_us_goadedes/me.m01.d02:meMA.Exaposteilarion2.melody	@ltx/en_us_goadedes/he.a.m2:heAU.GynaikesAkoutisthite.name
ltx/en_us_goadedes/me.m01.d02:meMA.Exaposteilarion2.mode	@ltx/en_us_goadedes/miscellanea:misc.Mode2
ltx/en_us_goadedes/me.m01.d02:meMA.Exaposteilarion2.text	Amazing, how the river has received You in its streams, O Word, * who brought all the seas and rivers * to being from non-existence, * and also how the Forerunner has dared to lay his hand on Your * immaculate head, O Master! * Benevolent Lord, astounded, * we praise Your poverty’s grandeur.
ltx/en_us_goadedes/me.m01.d02:meMA.Kathisma11.greekmelody	@ltx/en_us_goadedes/he.a.m1:heAU.TonTafonSouSotir.greekname
ltx/en_us_goadedes/me.m01.d02:meMA.Kathisma11.incipit	…
ltx/en_us_goadedes/me.m01.d02:meMA.Kathisma11.melody	@ltx/en_us_goadedes/he.a.m1:heAU.TonTafonSouSotir.name
ltx/en_us_goadedes/me.m01.d02:meMA.Kathisma11.mode	@ltx/en_us_goadedes/miscellanea:misc.Mode1
ltx/en_us_goadedes/me.m01.d02:meMA.Kathisma11.text	
ltx/en_us_goadedes/me.m01.d02:meMA.Kathisma12.greekmelody	@ltx/en_us_goadedes/he.a.m1:heAU.TonTafonSouSotir.greekname
ltx/en_us_goadedes/me.m01.d02:meMA.Kathisma12.incipit	…
ltx/en_us_goadedes/me.m01.d02:meMA.Kathisma12.melody	@ltx/en_us_goadedes/he.a.m1:heAU.TonTafonSouSotir.name
ltx/en_us_goadedes/me.m01.d02:meMA.Kathisma12.mode	@ltx/en_us_goadedes/miscellanea:misc.Mode1
ltx/en_us_goadedes/me.m01.d02:meMA.Kathisma12.text	
ltx/en_us_goadedes/me.m01.d02:meMA.Kathisma21.greekmelody	@ltx/en_us_goadedes/he.a.m4:heAU.TachyProkatalave.greekname
ltx/en_us_goadedes/me.m01.d02:meMA.Kathisma21.incipit	…
ltx/en_us_goadedes/me.m01.d02:meMA.Kathisma21.melody	@ltx/en_us_goadedes/he.a.m4:heAU.TachyProkatalave.name
ltx/en_us_goadedes/me.m01.d02:meMA.Kathisma21.mode	@ltx/en_us_goadedes/miscellanea:misc.Mode4
ltx/en_us_goadedes/me.m01.d02:meMA.Kathisma21.text	
ltx/en_us_goadedes/me.m01.d02:meMA.Kathisma22.greekmelody	@ltx/en_us_goadedes/he.a.m4:heAU.TachyProkatalave.greekname
ltx/en_us_goadedes/me.m01.d02:meMA.Kathisma22.incipit	…
ltx/en_us_goadedes/me.m01.d02:meMA.Kathisma22.melody	@ltx/en_us_goadedes/he.a.m4:heAU.TachyProkatalave.name
ltx/en_us_goadedes/me.m01.d02:meMA.Kathisma22.mode	@ltx/en_us_goadedes/miscellanea:misc.Mode4
ltx/en_us_goadedes/me.m01.d02:meMA.Kathisma22.text	
ltx/en_us_goadedes/me.m01.d02:meMA.Kontakion1.greekmelody	@ltx/en_us_goadedes/he.a.m4:heAU.EpefanisSimeron.greekname
ltx/en_us_goadedes/me.m01.d02:meMA.Kontakion1.incipit	…
ltx/en_us_goadedes/me.m01.d02:meMA.Kontakion1.melody	@ltx/en_us_goadedes/he.a.m4:heAU.EpefanisSimeron.name
ltx/en_us_goadedes/me.m01.d02:meMA.Kontakion1.mode	@ltx/en_us_goadedes/miscellanea:misc.Mode4
ltx/en_us_goadedes/me.m01.d02:meMA.Kontakion1.text	
ltx/en_us_goadedes/me.m01.d02:meMA.Kontakion2.greekmelody	@ltx/en_us_goadedes/he.a.m2:heAU.TaAnoZiton.greekname
ltx/en_us_goadedes/me.m01.d02:meMA.Kontakion2.incipit	Your mouth being filled…
ltx/en_us_goadedes/me.m01.d02:meMA.Kontakion2.melody	@ltx/en_us_goadedes/he.a.m2:heAU.TaAnoZiton.name
ltx/en_us_goadedes/me.m01.d02:meMA.Kontakion2.mode	@ltx/en_us_goadedes/miscellanea:misc.Mode4
ltx/en_us_goadedes/me.m01.d02:meMA.Kontakion2.text	Your mouth being filled with wisdom that comes from God * you declared to us the knowledge of the Trinity. * O Silvester, you brought down the tyrants’ ungodliness, * with the sling of your God-inspired words * And now implore the Master on our behalf.
ltx/en_us_goadedes/me.m01.d02:meMA.Lauds.acrostic.notice1	
ltx/en_us_goadedes/me.m01.d02:meMA.Lauds.acrostic.text	
ltx/en_us_goadedes/me.m01.d02:meMA.Lauds.acrostic.title	
ltx/en_us_goadedes/me.m01.d02:meMA.Lauds.poet	@ltx/en_us_goadedes/poets:po.Theofanous
ltx/en_us_goadedes/me.m01.d02:meMA.Lauds1.greekmelody	@ltx/en_us_goadedes/he.a.m6:heAU.AiAngelikai.greekname
ltx/en_us_goadedes/me.m01.d02:meMA.Lauds1.incipit	…
ltx/en_us_goadedes/me.m01.d02:meMA.Lauds1.melody	@ltx/en_us_goadedes/he.a.m6:heAU.AiAngelikai.name
ltx/en_us_goadedes/me.m01.d02:meMA.Lauds1.mode	@ltx/en_us_goadedes/miscellanea:misc.Mode6
ltx/en_us_goadedes/me.m01.d02:meMA.Lauds1.text	
ltx/en_us_goadedes/me.m01.d02:meMA.Lauds2.incipit	…
ltx/en_us_goadedes/me.m01.d02:meMA.Lauds2.melody	@ltx/en_us_goadedes/he.a.m6:heAU.AiAngelikai.name
ltx/en_us_goadedes/me.m01.d02:meMA.Lauds2.mode	@ltx/en_us_goadedes/miscellanea:misc.Mode6
ltx/en_us_goadedes/me.m01.d02:meMA.Lauds2.text	
ltx/en_us_goadedes/me.m01.d02:meMA.Lauds3.incipit	…
ltx/en_us_goadedes/me.m01.d02:meMA.Lauds3.melody	@ltx/en_us_goadedes/he.a.m6:heAU.AiAngelikai.name
ltx/en_us_goadedes/me.m01.d02:meMA.Lauds3.mode	@ltx/en_us_goadedes/miscellanea:misc.Mode6
ltx/en_us_goadedes/me.m01.d02:meMA.Lauds3.text	
ltx/en_us_goadedes/me.m01.d02:meMA.Lauds4.greekmelody	@ltx/en_us_goadedes/he.a.m6:heAU.AiAngelikai.greekname
ltx/en_us_goadedes/me.m01.d02:meMA.Lauds4.incipit	…
ltx/en_us_goadedes/me.m01.d02:meMA.Lauds4.melody	@ltx/en_us_goadedes/he.a.m6:heAU.AiAngelikai.name
ltx/en_us_goadedes/me.m01.d02:meMA.Lauds4.mode	@ltx/en_us_goadedes/miscellanea:misc.Mode6
ltx/en_us_goadedes/me.m01.d02:meMA.Lauds4.text	
ltx/en_us_goadedes/me.m01.d02:meMA.LaudsBoth.incipit	…
ltx/en_us_goadedes/me.m01.d02:meMA.LaudsBoth.melody	@ltx/en_us_goadedes/he.a.m6:heAU.AiAngelikai.name
ltx/en_us_goadedes/me.m01.d02:meMA.LaudsBoth.mode	@ltx/en_us_goadedes/miscellanea:misc.Mode6
ltx/en_us_goadedes/me.m01.d02:meMA.LaudsBoth.text	
ltx/en_us_goadedes/me.m01.d02:meMA.LaudsGlory.incipit	…
ltx/en_us_goadedes/me.m01.d02:meMA.LaudsGlory.melody	@ltx/en_us_goadedes/he.a.m6:heAU.AiAngelikai.name
ltx/en_us_goadedes/me.m01.d02:meMA.LaudsGlory.mode	@ltx/en_us_goadedes/miscellanea:misc.Mode6
ltx/en_us_goadedes/me.m01.d02:meMA.LaudsGlory.text	
ltx/en_us_goadedes/me.m01.d02:meMA.MM.Lauds1234as5678.text	@ltx/en_us_goadedes/properties:media.key
ltx/en_us_goadedes/me.m01.d02:meMA.Ode1C11.greekmelody	@ltx/en_us_goadedes/he.h.m2:heHE.ToTinAvaton.greekname
ltx/en_us_goadedes/me.m01.d02:meMA.Ode1C11.incipit	…
ltx/en_us_goadedes/me.m01.d02:meMA.Ode1C11.melody	@ltx/en_us_goadedes/he.h.m2:heHE.ToTinAvaton.name
ltx/en_us_goadedes/me.m01.d02:meMA.Ode1C11.mode	@ltx/en_us_goadedes/miscellanea:misc.Mode2
ltx/en_us_goadedes/me.m01.d02:meMA.Ode1C11.ode	@ltx/en_us_goadedes/miscellanea:misc.Ode1
ltx/en_us_goadedes/me.m01.d02:meMA.Ode1C11.text	
ltx/en_us_goadedes/me.m01.d02:meMA.Ode1C12.incipit	…
ltx/en_us_goadedes/me.m01.d02:meMA.Ode1C12.melody	@ltx/en_us_goadedes/he.h.m2:heHE.ToTinAvaton.name
ltx/en_us_goadedes/me.m01.d02:meMA.Ode1C12.mode	@ltx/en_us_goadedes/miscellanea:misc.Mode2
ltx/en_us_goadedes/me.m01.d02:meMA.Ode1C12.ode	@ltx/en_us_goadedes/miscellanea:misc.Ode1
ltx/en_us_goadedes/me.m01.d02:meMA.Ode1C12.text	
ltx/en_us_goadedes/me.m01.d02:meMA.Ode1C13.incipit	…
ltx/en_us_goadedes/me.m01.d02:meMA.Ode1C13.melody	@ltx/en_us_goadedes/he.h.m2:heHE.ToTinAvaton.name
ltx/en_us_goadedes/me.m01.d02:meMA.Ode1C13.mode	@ltx/en_us_goadedes/miscellanea:misc.Mode2
ltx/en_us_goadedes/me.m01.d02:meMA.Ode1C13.ode	@ltx/en_us_goadedes/miscellanea:misc.Ode1
ltx/en_us_goadedes/me.m01.d02:meMA.Ode1C13.text	
ltx/en_us_goadedes/me.m01.d02:meMA.Ode1C14.incipit	…
ltx/en_us_goadedes/me.m01.d02:meMA.Ode1C14.melody	@ltx/en_us_goadedes/he.h.m2:heHE.ToTinAvaton.name
ltx/en_us_goadedes/me.m01.d02:meMA.Ode1C14.mode	@ltx/en_us_goadedes/miscellanea:misc.Mode2
ltx/en_us_goadedes/me.m01.d02:meMA.Ode1C14.ode	@ltx/en_us_goadedes/miscellanea:misc.Ode1
ltx/en_us_goadedes/me.m01.d02:meMA.Ode1C14.text	
ltx/en_us_goadedes/me.m01.d02:meMA.Ode1C1H.greekmelody	@ltx/en_us_goadedes/he.h.m2:heHE.ToTinAvaton.greekname
ltx/en_us_goadedes/me.m01.d02:meMA.Ode1C1H.incipit	@ltx/en_us_goadedes/he.h.m2:heHE.ToTinAvaton.incipit
ltx/en_us_goadedes/me.m01.d02:meMA.Ode1C1H.melody	@ltx/en_us_goadedes/he.h.m2:heHE.ToTinAvaton.melody
ltx/en_us_goadedes/me.m01.d02:meMA.Ode1C1H.mode	@ltx/en_us_goadedes/miscellanea:misc.Mode2
ltx/en_us_goadedes/me.m01.d02:meMA.Ode1C1H.ode	@ltx/en_us_goadedes/miscellanea:misc.Ode1
ltx/en_us_goadedes/me.m01.d02:meMA.Ode1C1H.text	@ltx/en_us_goadedes/he.h.m2:heHE.ToTinAvaton.text
ltx/en_us_goadedes/me.m01.d02:meMA.Ode1C21.greekmelody	@ltx/en_us_goadedes/he.h.m8:heHE.IKekommeni.greekname
ltx/en_us_goadedes/me.m01.d02:meMA.Ode1C21.incipit	…
ltx/en_us_goadedes/me.m01.d02:meMA.Ode1C21.melody	@ltx/en_us_goadedes/he.h.m8:heHE.IKekommeni.name
ltx/en_us_goadedes/me.m01.d02:meMA.Ode1C21.mode	@ltx/en_us_goadedes/miscellanea:misc.Mode8
ltx/en_us_goadedes/me.m01.d02:meMA.Ode1C21.ode	@ltx/en_us_goadedes/miscellanea:misc.Ode1
ltx/en_us_goadedes/me.m01.d02:meMA.Ode1C21.text	
ltx/en_us_goadedes/me.m01.d02:meMA.Ode1C22.incipit	…
ltx/en_us_goadedes/me.m01.d02:meMA.Ode1C22.melody	@ltx/en_us_goadedes/he.h.m8:heHE.IKekommeni.name
ltx/en_us_goadedes/me.m01.d02:meMA.Ode1C22.mode	@ltx/en_us_goadedes/miscellanea:misc.Mode8
ltx/en_us_goadedes/me.m01.d02:meMA.Ode1C22.ode	@ltx/en_us_goadedes/miscellanea:misc.Ode1
ltx/en_us_goadedes/me.m01.d02:meMA.Ode1C22.text	
ltx/en_us_goadedes/me.m01.d02:meMA.Ode1C23.incipit	…
ltx/en_us_goadedes/me.m01.d02:meMA.Ode1C23.melody	@ltx/en_us_goadedes/he.h.m8:heHE.IKekommeni.name
ltx/en_us_goadedes/me.m01.d02:meMA.Ode1C23.mode	@ltx/en_us_goadedes/miscellanea:misc.Mode8
ltx/en_us_goadedes/me.m01.d02:meMA.Ode1C23.ode	@ltx/en_us_goadedes/miscellanea:misc.Ode1
ltx/en_us_goadedes/me.m01.d02:meMA.Ode1C23.text	
ltx/en_us_goadedes/me.m01.d02:meMA.Ode1C24.incipit	…
ltx/en_us_goadedes/me.m01.d02:meMA.Ode1C24.melody	@ltx/en_us_goadedes/he.h.m8:heHE.IKekommeni.name
ltx/en_us_goadedes/me.m01.d02:meMA.Ode1C24.mode	@ltx/en_us_goadedes/miscellanea:misc.Mode8
ltx/en_us_goadedes/me.m01.d02:meMA.Ode1C24.ode	@ltx/en_us_goadedes/miscellanea:misc.Ode1
ltx/en_us_goadedes/me.m01.d02:meMA.Ode1C24.text	
ltx/en_us_goadedes/me.m01.d02:meMA.Ode1C2T.incipit	…
ltx/en_us_goadedes/me.m01.d02:meMA.Ode1C2T.melody	@ltx/en_us_goadedes/he.h.m8:heHE.IKekommeni.name
ltx/en_us_goadedes/me.m01.d02:meMA.Ode1C2T.mode	@ltx/en_us_goadedes/miscellanea:misc.Mode8
ltx/en_us_goadedes/me.m01.d02:meMA.Ode1C2T.ode	@ltx/en_us_goadedes/miscellanea:misc.Ode1
ltx/en_us_goadedes/me.m01.d02:meMA.Ode1C2T.text	
ltx/en_us_goadedes/me.m01.d02:meMA.Ode3C11.greekmelody	@ltx/en_us_goadedes/he.h.m2:heHE.StereosonImasEnSoiKyrie.greekname
ltx/en_us_goadedes/me.m01.d02:meMA.Ode3C11.incipit	…
ltx/en_us_goadedes/me.m01.d02:meMA.Ode3C11.melody	@ltx/en_us_goadedes/he.h.m2:heHE.StereosonImasEnSoiKyrie.name
ltx/en_us_goadedes/me.m01.d02:meMA.Ode3C11.mode	@ltx/en_us_goadedes/miscellanea:misc.Mode2
ltx/en_us_goadedes/me.m01.d02:meMA.Ode3C11.ode	@ltx/en_us_goadedes/miscellanea:misc.Ode3
ltx/en_us_goadedes/me.m01.d02:meMA.Ode3C11.text	
ltx/en_us_goadedes/me.m01.d02:meMA.Ode3C12.incipit	…
ltx/en_us_goadedes/me.m01.d02:meMA.Ode3C12.melody	@ltx/en_us_goadedes/he.h.m2:heHE.StereosonImasEnSoiKyrie.name
ltx/en_us_goadedes/me.m01.d02:meMA.Ode3C12.mode	@ltx/en_us_goadedes/miscellanea:misc.Mode2
ltx/en_us_goadedes/me.m01.d02:meMA.Ode3C12.ode	@ltx/en_us_goadedes/miscellanea:misc.Ode3
ltx/en_us_goadedes/me.m01.d02:meMA.Ode3C12.text	
ltx/en_us_goadedes/me.m01.d02:meMA.Ode3C13.incipit	…
ltx/en_us_goadedes/me.m01.d02:meMA.Ode3C13.melody	@ltx/en_us_goadedes/he.h.m2:heHE.StereosonImasEnSoiKyrie.name
ltx/en_us_goadedes/me.m01.d02:meMA.Ode3C13.mode	@ltx/en_us_goadedes/miscellanea:misc.Mode2
ltx/en_us_goadedes/me.m01.d02:meMA.Ode3C13.ode	@ltx/en_us_goadedes/miscellanea:misc.Ode3
ltx/en_us_goadedes/me.m01.d02:meMA.Ode3C13.text	
ltx/en_us_goadedes/me.m01.d02:meMA.Ode3C1H.greekmelody	@ltx/en_us_goadedes/he.h.m2:heHE.StereosonImasEnSoiKyrie.greekname
ltx/en_us_goadedes/me.m01.d02:meMA.Ode3C1H.incipit	@ltx/en_us_goadedes/he.h.m2:heHE.StereosonImasEnSoiKyrie.incipit
ltx/en_us_goadedes/me.m01.d02:meMA.Ode3C1H.melody	@ltx/en_us_goadedes/he.h.m2:heHE.StereosonImasEnSoiKyrie.melody
ltx/en_us_goadedes/me.m01.d02:meMA.Ode3C1H.mode	@ltx/en_us_goadedes/miscellanea:misc.Mode2
ltx/en_us_goadedes/me.m01.d02:meMA.Ode3C1H.ode	@ltx/en_us_goadedes/miscellanea:misc.Ode3
ltx/en_us_goadedes/me.m01.d02:meMA.Ode3C1H.text	@ltx/en_us_goadedes/he.h.m2:heHE.StereosonImasEnSoiKyrie.text
ltx/en_us_goadedes/me.m01.d02:meMA.Ode3C21.greekmelody	@ltx/en_us_goadedes/he.h.m8:heHE.TonFovonSouKyrie.greekname
ltx/en_us_goadedes/me.m01.d02:meMA.Ode3C21.incipit	…
ltx/en_us_goadedes/me.m01.d02:meMA.Ode3C21.melody	@ltx/en_us_goadedes/he.h.m8:heHE.TonFovonSouKyrie.name
ltx/en_us_goadedes/me.m01.d02:meMA.Ode3C21.mode	@ltx/en_us_goadedes/miscellanea:misc.Mode8
ltx/en_us_goadedes/me.m01.d02:meMA.Ode3C21.ode	@ltx/en_us_goadedes/miscellanea:misc.Ode3
ltx/en_us_goadedes/me.m01.d02:meMA.Ode3C21.text	
ltx/en_us_goadedes/me.m01.d02:meMA.Ode3C22.incipit	…
ltx/en_us_goadedes/me.m01.d02:meMA.Ode3C22.melody	@ltx/en_us_goadedes/he.h.m8:heHE.TonFovonSouKyrie.name
ltx/en_us_goadedes/me.m01.d02:meMA.Ode3C22.mode	@ltx/en_us_goadedes/miscellanea:misc.Mode8
ltx/en_us_goadedes/me.m01.d02:meMA.Ode3C22.ode	@ltx/en_us_goadedes/miscellanea:misc.Ode3
ltx/en_us_goadedes/me.m01.d02:meMA.Ode3C22.text	
ltx/en_us_goadedes/me.m01.d02:meMA.Ode3C23.incipit	…
ltx/en_us_goadedes/me.m01.d02:meMA.Ode3C23.melody	@ltx/en_us_goadedes/he.h.m8:heHE.TonFovonSouKyrie.name
ltx/en_us_goadedes/me.m01.d02:meMA.Ode3C23.mode	@ltx/en_us_goadedes/miscellanea:misc.Mode8
ltx/en_us_goadedes/me.m01.d02:meMA.Ode3C23.ode	@ltx/en_us_goadedes/miscellanea:misc.Ode3
ltx/en_us_goadedes/me.m01.d02:meMA.Ode3C23.text	
ltx/en_us_goadedes/me.m01.d02:meMA.Ode3C2T.incipit	…
ltx/en_us_goadedes/me.m01.d02:meMA.Ode3C2T.melody	@ltx/en_us_goadedes/he.h.m8:heHE.TonFovonSouKyrie.name
ltx/en_us_goadedes/me.m01.d02:meMA.Ode3C2T.mode	@ltx/en_us_goadedes/miscellanea:misc.Mode8
ltx/en_us_goadedes/me.m01.d02:meMA.Ode3C2T.ode	@ltx/en_us_goadedes/miscellanea:misc.Ode3
ltx/en_us_goadedes/me.m01.d02:meMA.Ode3C2T.text	
ltx/en_us_goadedes/me.m01.d02:meMA.Ode3H.greekmelody	@ltx/en_us_goadedes/he.h.m8:heHE.TonFovonSouKyrie.greekname
ltx/en_us_goadedes/me.m01.d02:meMA.Ode3H.incipit	@ltx/en_us_goadedes/he.h.m8:heHE.TonFovonSouKyrie.incipit
ltx/en_us_goadedes/me.m01.d02:meMA.Ode3H.melody	@ltx/en_us_goadedes/he.h.m8:heHE.TonFovonSouKyrie.melody
ltx/en_us_goadedes/me.m01.d02:meMA.Ode3H.mode	@ltx/en_us_goadedes/miscellanea:misc.Mode8
ltx/en_us_goadedes/me.m01.d02:meMA.Ode3H.ode	@ltx/en_us_goadedes/miscellanea:misc.Ode3
ltx/en_us_goadedes/me.m01.d02:meMA.Ode3H.text	@ltx/en_us_goadedes/he.h.m8:heHE.TonFovonSouKyrie.text
ltx/en_us_goadedes/me.m01.d02:meMA.Ode3Kathisma1.greekmelody	@ltx/en_us_goadedes/he.a.m8:heAU.TinSofianKaiLogon.greekname
ltx/en_us_goadedes/me.m01.d02:meMA.Ode3Kathisma1.incipit	…
ltx/en_us_goadedes/me.m01.d02:meMA.Ode3Kathisma1.melody	@ltx/en_us_goadedes/he.a.m8:heAU.TinSofianKaiLogon.name
ltx/en_us_goadedes/me.m01.d02:meMA.Ode3Kathisma1.mode	@ltx/en_us_goadedes/miscellanea:misc.Mode8
ltx/en_us_goadedes/me.m01.d02:meMA.Ode3Kathisma1.text	
ltx/en_us_goadedes/me.m01.d02:meMA.Ode3Kathisma2.greekmelody	@ltx/en_us_goadedes/he.a.m8:heAU.AnestisEkNekron.greekname
ltx/en_us_goadedes/me.m01.d02:meMA.Ode3Kathisma2.incipit	Invisible God…
ltx/en_us_goadedes/me.m01.d02:meMA.Ode3Kathisma2.melody	@ltx/en_us_goadedes/he.a.m8:heAU.AnestisEkNekron.notmetered
ltx/en_us_goadedes/me.m01.d02:meMA.Ode3Kathisma2.mode	@ltx/en_us_goadedes/miscellanea:misc.Mode8
ltx/en_us_goadedes/me.m01.d02:meMA.Ode3Kathisma2.text	Invisible God, incomprehensible Logos, You were begotten of the Father in a manner passing nature and reason. Again, in later times, You were born of the Virgin, without altering what You were. Now You come to the River Jordan to be baptized in the flesh, as God who was well pleased to save the human race.
ltx/en_us_goadedes/me.m01.d02:meMA.Ode4C11.greekmelody	@ltx/en_us_goadedes/he.h.m2:heHE.ElilythasEkParthenou.greekname
ltx/en_us_goadedes/me.m01.d02:meMA.Ode4C11.incipit	…
ltx/en_us_goadedes/me.m01.d02:meMA.Ode4C11.melody	@ltx/en_us_goadedes/he.h.m2:heHE.ElilythasEkParthenou.name
ltx/en_us_goadedes/me.m01.d02:meMA.Ode4C11.mode	@ltx/en_us_goadedes/miscellanea:misc.Mode2
ltx/en_us_goadedes/me.m01.d02:meMA.Ode4C11.ode	@ltx/en_us_goadedes/miscellanea:misc.Ode4
ltx/en_us_goadedes/me.m01.d02:meMA.Ode4C11.text	
ltx/en_us_goadedes/me.m01.d02:meMA.Ode4C12.incipit	…
ltx/en_us_goadedes/me.m01.d02:meMA.Ode4C12.melody	@ltx/en_us_goadedes/he.h.m2:heHE.ElilythasEkParthenou.name
ltx/en_us_goadedes/me.m01.d02:meMA.Ode4C12.mode	@ltx/en_us_goadedes/miscellanea:misc.Mode2
ltx/en_us_goadedes/me.m01.d02:meMA.Ode4C12.ode	@ltx/en_us_goadedes/miscellanea:misc.Ode4
ltx/en_us_goadedes/me.m01.d02:meMA.Ode4C12.text	
ltx/en_us_goadedes/me.m01.d02:meMA.Ode4C13.incipit	…
ltx/en_us_goadedes/me.m01.d02:meMA.Ode4C13.melody	@ltx/en_us_goadedes/he.h.m2:heHE.ElilythasEkParthenou.name
ltx/en_us_goadedes/me.m01.d02:meMA.Ode4C13.mode	@ltx/en_us_goadedes/miscellanea:misc.Mode2
ltx/en_us_goadedes/me.m01.d02:meMA.Ode4C13.ode	@ltx/en_us_goadedes/miscellanea:misc.Ode4
ltx/en_us_goadedes/me.m01.d02:meMA.Ode4C13.text	
ltx/en_us_goadedes/me.m01.d02:meMA.Ode4C14.incipit	…
ltx/en_us_goadedes/me.m01.d02:meMA.Ode4C14.melody	@ltx/en_us_goadedes/he.h.m2:heHE.ElilythasEkParthenou.name
ltx/en_us_goadedes/me.m01.d02:meMA.Ode4C14.mode	@ltx/en_us_goadedes/miscellanea:misc.Mode2
ltx/en_us_goadedes/me.m01.d02:meMA.Ode4C14.ode	@ltx/en_us_goadedes/miscellanea:misc.Ode4
ltx/en_us_goadedes/me.m01.d02:meMA.Ode4C14.text	
ltx/en_us_goadedes/me.m01.d02:meMA.Ode4C1H.greekmelody	@ltx/en_us_goadedes/he.h.m2:heHE.ElilythasEkParthenou.greekname
ltx/en_us_goadedes/me.m01.d02:meMA.Ode4C1H.incipit	@ltx/en_us_goadedes/he.h.m2:heHE.ElilythasEkParthenou.incipit
ltx/en_us_goadedes/me.m01.d02:meMA.Ode4C1H.melody	@ltx/en_us_goadedes/he.h.m2:heHE.ElilythasEkParthenou.melody
ltx/en_us_goadedes/me.m01.d02:meMA.Ode4C1H.mode	@ltx/en_us_goadedes/miscellanea:misc.Mode2
ltx/en_us_goadedes/me.m01.d02:meMA.Ode4C1H.ode	@ltx/en_us_goadedes/miscellanea:misc.Ode4
ltx/en_us_goadedes/me.m01.d02:meMA.Ode4C1H.text	@ltx/en_us_goadedes/he.h.m2:heHE.ElilythasEkParthenou.text
ltx/en_us_goadedes/me.m01.d02:meMA.Ode4C21.greekmelody	@ltx/en_us_goadedes/he.h.m8:heHE.EisakikoaKyrie.greekname
ltx/en_us_goadedes/me.m01.d02:meMA.Ode4C21.incipit	…
ltx/en_us_goadedes/me.m01.d02:meMA.Ode4C21.melody	@ltx/en_us_goadedes/he.h.m8:heHE.EisakikoaKyrie.name
ltx/en_us_goadedes/me.m01.d02:meMA.Ode4C21.mode	@ltx/en_us_goadedes/miscellanea:misc.Mode8
ltx/en_us_goadedes/me.m01.d02:meMA.Ode4C21.ode	@ltx/en_us_goadedes/miscellanea:misc.Ode4
ltx/en_us_goadedes/me.m01.d02:meMA.Ode4C21.text	
ltx/en_us_goadedes/me.m01.d02:meMA.Ode4C22.incipit	…
ltx/en_us_goadedes/me.m01.d02:meMA.Ode4C22.melody	@ltx/en_us_goadedes/he.h.m8:heHE.EisakikoaKyrie.name
ltx/en_us_goadedes/me.m01.d02:meMA.Ode4C22.mode	@ltx/en_us_goadedes/miscellanea:misc.Mode8
ltx/en_us_goadedes/me.m01.d02:meMA.Ode4C22.ode	@ltx/en_us_goadedes/miscellanea:misc.Ode4
ltx/en_us_goadedes/me.m01.d02:meMA.Ode4C22.text	
ltx/en_us_goadedes/me.m01.d02:meMA.Ode4C23.incipit	…
ltx/en_us_goadedes/me.m01.d02:meMA.Ode4C23.melody	@ltx/en_us_goadedes/he.h.m8:heHE.EisakikoaKyrie.name
ltx/en_us_goadedes/me.m01.d02:meMA.Ode4C23.mode	@ltx/en_us_goadedes/miscellanea:misc.Mode8
ltx/en_us_goadedes/me.m01.d02:meMA.Ode4C23.ode	@ltx/en_us_goadedes/miscellanea:misc.Ode4
ltx/en_us_goadedes/me.m01.d02:meMA.Ode4C23.text	
ltx/en_us_goadedes/me.m01.d02:meMA.Ode4C24.incipit	…
ltx/en_us_goadedes/me.m01.d02:meMA.Ode4C24.melody	@ltx/en_us_goadedes/he.h.m8:heHE.EisakikoaKyrie.name
ltx/en_us_goadedes/me.m01.d02:meMA.Ode4C24.mode	@ltx/en_us_goadedes/miscellanea:misc.Mode8
ltx/en_us_goadedes/me.m01.d02:meMA.Ode4C24.ode	@ltx/en_us_goadedes/miscellanea:misc.Ode4
ltx/en_us_goadedes/me.m01.d02:meMA.Ode4C24.text	
ltx/en_us_goadedes/me.m01.d02:meMA.Ode4C2T.incipit	…
ltx/en_us_goadedes/me.m01.d02:meMA.Ode4C2T.melody	@ltx/en_us_goadedes/he.h.m8:heHE.EisakikoaKyrie.name
ltx/en_us_goadedes/me.m01.d02:meMA.Ode4C2T.mode	@ltx/en_us_goadedes/miscellanea:misc.Mode8
ltx/en_us_goadedes/me.m01.d02:meMA.Ode4C2T.ode	@ltx/en_us_goadedes/miscellanea:misc.Ode4
ltx/en_us_goadedes/me.m01.d02:meMA.Ode4C2T.text	
ltx/en_us_goadedes/me.m01.d02:meMA.Ode5C11.greekmelody	@ltx/en_us_goadedes/he.h.m2:heHE.OTouFotosChorigos.greekname
ltx/en_us_goadedes/me.m01.d02:meMA.Ode5C11.incipit	…
ltx/en_us_goadedes/me.m01.d02:meMA.Ode5C11.melody	@ltx/en_us_goadedes/he.h.m2:heHE.OTouFotosChorigos.name
ltx/en_us_goadedes/me.m01.d02:meMA.Ode5C11.mode	@ltx/en_us_goadedes/miscellanea:misc.Mode2
ltx/en_us_goadedes/me.m01.d02:meMA.Ode5C11.ode	@ltx/en_us_goadedes/miscellanea:misc.Ode5
ltx/en_us_goadedes/me.m01.d02:meMA.Ode5C11.text	
ltx/en_us_goadedes/me.m01.d02:meMA.Ode5C12.incipit	…
ltx/en_us_goadedes/me.m01.d02:meMA.Ode5C12.melody	@ltx/en_us_goadedes/he.h.m2:heHE.OTouFotosChorigos.name
ltx/en_us_goadedes/me.m01.d02:meMA.Ode5C12.mode	@ltx/en_us_goadedes/miscellanea:misc.Mode2
ltx/en_us_goadedes/me.m01.d02:meMA.Ode5C12.ode	@ltx/en_us_goadedes/miscellanea:misc.Ode5
ltx/en_us_goadedes/me.m01.d02:meMA.Ode5C12.text	
ltx/en_us_goadedes/me.m01.d02:meMA.Ode5C13.incipit	…
ltx/en_us_goadedes/me.m01.d02:meMA.Ode5C13.melody	@ltx/en_us_goadedes/he.h.m2:heHE.OTouFotosChorigos.name
ltx/en_us_goadedes/me.m01.d02:meMA.Ode5C13.mode	@ltx/en_us_goadedes/miscellanea:misc.Mode2
ltx/en_us_goadedes/me.m01.d02:meMA.Ode5C13.ode	@ltx/en_us_goadedes/miscellanea:misc.Ode5
ltx/en_us_goadedes/me.m01.d02:meMA.Ode5C13.text	
ltx/en_us_goadedes/me.m01.d02:meMA.Ode5C1H.greekmelody	@ltx/en_us_goadedes/he.h.m2:heHE.OTouFotosChorigos.greekname
ltx/en_us_goadedes/me.m01.d02:meMA.Ode5C1H.incipit	@ltx/en_us_goadedes/he.h.m2:heHE.OTouFotosChorigos.incipit
ltx/en_us_goadedes/me.m01.d02:meMA.Ode5C1H.melody	@ltx/en_us_goadedes/he.h.m2:heHE.OTouFotosChorigos.melody
ltx/en_us_goadedes/me.m01.d02:meMA.Ode5C1H.mode	@ltx/en_us_goadedes/miscellanea:misc.Mode2
ltx/en_us_goadedes/me.m01.d02:meMA.Ode5C1H.ode	@ltx/en_us_goadedes/miscellanea:misc.Ode5
ltx/en_us_goadedes/me.m01.d02:meMA.Ode5C1H.text	@ltx/en_us_goadedes/he.h.m2:heHE.OTouFotosChorigos.text
ltx/en_us_goadedes/me.m01.d02:meMA.Ode5C21.greekmelody	@ltx/en_us_goadedes/he.h.m8:heHE.InaTiMeAposo.greekname
ltx/en_us_goadedes/me.m01.d02:meMA.Ode5C21.incipit	…
ltx/en_us_goadedes/me.m01.d02:meMA.Ode5C21.melody	@ltx/en_us_goadedes/he.h.m8:heHE.InaTiMeAposo.name
ltx/en_us_goadedes/me.m01.d02:meMA.Ode5C21.mode	@ltx/en_us_goadedes/miscellanea:misc.Mode8
ltx/en_us_goadedes/me.m01.d02:meMA.Ode5C21.ode	@ltx/en_us_goadedes/miscellanea:misc.Ode5
ltx/en_us_goadedes/me.m01.d02:meMA.Ode5C21.text	
ltx/en_us_goadedes/me.m01.d02:meMA.Ode5C22.incipit	…
ltx/en_us_goadedes/me.m01.d02:meMA.Ode5C22.melody	@ltx/en_us_goadedes/he.h.m8:heHE.InaTiMeAposo.name
ltx/en_us_goadedes/me.m01.d02:meMA.Ode5C22.mode	@ltx/en_us_goadedes/miscellanea:misc.Mode8
ltx/en_us_goadedes/me.m01.d02:meMA.Ode5C22.ode	@ltx/en_us_goadedes/miscellanea:misc.Ode5
ltx/en_us_goadedes/me.m01.d02:meMA.Ode5C22.text	
ltx/en_us_goadedes/me.m01.d02:meMA.Ode5C23.incipit	…
ltx/en_us_goadedes/me.m01.d02:meMA.Ode5C23.melody	@ltx/en_us_goadedes/he.h.m8:heHE.InaTiMeAposo.name
ltx/en_us_goadedes/me.m01.d02:meMA.Ode5C23.mode	@ltx/en_us_goadedes/miscellanea:misc.Mode8
ltx/en_us_goadedes/me.m01.d02:meMA.Ode5C23.ode	@ltx/en_us_goadedes/miscellanea:misc.Ode5
ltx/en_us_goadedes/me.m01.d02:meMA.Ode5C23.text	
ltx/en_us_goadedes/me.m01.d02:meMA.Ode5C2T.incipit	…
ltx/en_us_goadedes/me.m01.d02:meMA.Ode5C2T.melody	@ltx/en_us_goadedes/he.h.m8:heHE.InaTiMeAposo.name
ltx/en_us_goadedes/me.m01.d02:meMA.Ode5C2T.mode	@ltx/en_us_goadedes/miscellanea:misc.Mode8
ltx/en_us_goadedes/me.m01.d02:meMA.Ode5C2T.ode	@ltx/en_us_goadedes/miscellanea:misc.Ode5
ltx/en_us_goadedes/me.m01.d02:meMA.Ode5C2T.text	
ltx/en_us_goadedes/me.m01.d02:meMA.Ode6C11.greekmelody	@ltx/en_us_goadedes/he.h.m2:heHE.AvyssosAmartimaton.greekname
ltx/en_us_goadedes/me.m01.d02:meMA.Ode6C11.incipit	…
ltx/en_us_goadedes/me.m01.d02:meMA.Ode6C11.melody	@ltx/en_us_goadedes/he.h.m2:heHE.AvyssosAmartimaton.name
ltx/en_us_goadedes/me.m01.d02:meMA.Ode6C11.mode	@ltx/en_us_goadedes/miscellanea:misc.Mode2
ltx/en_us_goadedes/me.m01.d02:meMA.Ode6C11.ode	@ltx/en_us_goadedes/miscellanea:misc.Ode6
ltx/en_us_goadedes/me.m01.d02:meMA.Ode6C11.text	
ltx/en_us_goadedes/me.m01.d02:meMA.Ode6C12.incipit	…
ltx/en_us_goadedes/me.m01.d02:meMA.Ode6C12.melody	@ltx/en_us_goadedes/he.h.m2:heHE.AvyssosAmartimaton.name
ltx/en_us_goadedes/me.m01.d02:meMA.Ode6C12.mode	@ltx/en_us_goadedes/miscellanea:misc.Mode2
ltx/en_us_goadedes/me.m01.d02:meMA.Ode6C12.ode	@ltx/en_us_goadedes/miscellanea:misc.Ode6
ltx/en_us_goadedes/me.m01.d02:meMA.Ode6C12.text	
ltx/en_us_goadedes/me.m01.d02:meMA.Ode6C13.incipit	…
ltx/en_us_goadedes/me.m01.d02:meMA.Ode6C13.melody	@ltx/en_us_goadedes/he.h.m2:heHE.AvyssosAmartimaton.name
ltx/en_us_goadedes/me.m01.d02:meMA.Ode6C13.mode	@ltx/en_us_goadedes/miscellanea:misc.Mode2
ltx/en_us_goadedes/me.m01.d02:meMA.Ode6C13.ode	@ltx/en_us_goadedes/miscellanea:misc.Ode6
ltx/en_us_goadedes/me.m01.d02:meMA.Ode6C13.text	
ltx/en_us_goadedes/me.m01.d02:meMA.Ode6C1H.greekmelody	@ltx/en_us_goadedes/he.h.m2:heHE.AvyssosAmartimaton.greekname
ltx/en_us_goadedes/me.m01.d02:meMA.Ode6C1H.incipit	@ltx/en_us_goadedes/he.h.m2:heHE.AvyssosAmartimaton.incipit
ltx/en_us_goadedes/me.m01.d02:meMA.Ode6C1H.melody	@ltx/en_us_goadedes/he.h.m2:heHE.AvyssosAmartimaton.melody
ltx/en_us_goadedes/me.m01.d02:meMA.Ode6C1H.mode	@ltx/en_us_goadedes/miscellanea:misc.Mode2
ltx/en_us_goadedes/me.m01.d02:meMA.Ode6C1H.ode	@ltx/en_us_goadedes/miscellanea:misc.Ode6
ltx/en_us_goadedes/me.m01.d02:meMA.Ode6C1H.text	@ltx/en_us_goadedes/he.h.m2:heHE.AvyssosAmartimaton.text
ltx/en_us_goadedes/me.m01.d02:meMA.Ode6C21.greekmelody	@ltx/en_us_goadedes/he.h.m8:heHE.TinDeisinEkcheo.greekname
ltx/en_us_goadedes/me.m01.d02:meMA.Ode6C21.incipit	…
ltx/en_us_goadedes/me.m01.d02:meMA.Ode6C21.melody	@ltx/en_us_goadedes/he.h.m8:heHE.TinDeisinEkcheo.name
ltx/en_us_goadedes/me.m01.d02:meMA.Ode6C21.mode	@ltx/en_us_goadedes/miscellanea:misc.Mode8
ltx/en_us_goadedes/me.m01.d02:meMA.Ode6C21.ode	@ltx/en_us_goadedes/miscellanea:misc.Ode6
ltx/en_us_goadedes/me.m01.d02:meMA.Ode6C21.text	
ltx/en_us_goadedes/me.m01.d02:meMA.Ode6C22.incipit	…
ltx/en_us_goadedes/me.m01.d02:meMA.Ode6C22.melody	@ltx/en_us_goadedes/he.h.m8:heHE.TinDeisinEkcheo.name
ltx/en_us_goadedes/me.m01.d02:meMA.Ode6C22.mode	@ltx/en_us_goadedes/miscellanea:misc.Mode8
ltx/en_us_goadedes/me.m01.d02:meMA.Ode6C22.ode	@ltx/en_us_goadedes/miscellanea:misc.Ode6
ltx/en_us_goadedes/me.m01.d02:meMA.Ode6C22.text	
ltx/en_us_goadedes/me.m01.d02:meMA.Ode6C23.incipit	…
ltx/en_us_goadedes/me.m01.d02:meMA.Ode6C23.melody	@ltx/en_us_goadedes/he.h.m8:heHE.TinDeisinEkcheo.name
ltx/en_us_goadedes/me.m01.d02:meMA.Ode6C23.mode	@ltx/en_us_goadedes/miscellanea:misc.Mode8
ltx/en_us_goadedes/me.m01.d02:meMA.Ode6C23.ode	@ltx/en_us_goadedes/miscellanea:misc.Ode6
ltx/en_us_goadedes/me.m01.d02:meMA.Ode6C23.text	
ltx/en_us_goadedes/me.m01.d02:meMA.Ode6C2T.incipit	…
ltx/en_us_goadedes/me.m01.d02:meMA.Ode6C2T.melody	@ltx/en_us_goadedes/he.h.m8:heHE.TinDeisinEkcheo.name
ltx/en_us_goadedes/me.m01.d02:meMA.Ode6C2T.mode	@ltx/en_us_goadedes/miscellanea:misc.Mode8
ltx/en_us_goadedes/me.m01.d02:meMA.Ode6C2T.ode	@ltx/en_us_goadedes/miscellanea:misc.Ode6
ltx/en_us_goadedes/me.m01.d02:meMA.Ode6C2T.text	
ltx/en_us_goadedes/me.m01.d02:meMA.Ode6H.greekmelody	@ltx/en_us_goadedes/he.h.m8:heHE.TinDeisinEkcheo.greekname
ltx/en_us_goadedes/me.m01.d02:meMA.Ode6H.incipit	@ltx/en_us_goadedes/he.h.m8:heHE.TinDeisinEkcheo.incipit
ltx/en_us_goadedes/me.m01.d02:meMA.Ode6H.melody	@ltx/en_us_goadedes/he.h.m8:heHE.TinDeisinEkcheo.melody
ltx/en_us_goadedes/me.m01.d02:meMA.Ode6H.mode	@ltx/en_us_goadedes/miscellanea:misc.Mode8
ltx/en_us_goadedes/me.m01.d02:meMA.Ode6H.ode	@ltx/en_us_goadedes/miscellanea:misc.Ode6
ltx/en_us_goadedes/me.m01.d02:meMA.Ode6H.text	@ltx/en_us_goadedes/he.h.m8:heHE.TinDeisinEkcheo.text
ltx/en_us_goadedes/me.m01.d02:meMA.Ode7C11.greekmelody	@ltx/en_us_goadedes/he.h.m2:heHE.EikonosChrysis.greekname
ltx/en_us_goadedes/me.m01.d02:meMA.Ode7C11.incipit	…
ltx/en_us_goadedes/me.m01.d02:meMA.Ode7C11.melody	@ltx/en_us_goadedes/he.h.m2:heHE.EikonosChrysis.name
ltx/en_us_goadedes/me.m01.d02:meMA.Ode7C11.mode	@ltx/en_us_goadedes/miscellanea:misc.Mode2
ltx/en_us_goadedes/me.m01.d02:meMA.Ode7C11.ode	@ltx/en_us_goadedes/miscellanea:misc.Ode7
ltx/en_us_goadedes/me.m01.d02:meMA.Ode7C11.text	
ltx/en_us_goadedes/me.m01.d02:meMA.Ode7C12.incipit	…
ltx/en_us_goadedes/me.m01.d02:meMA.Ode7C12.melody	@ltx/en_us_goadedes/he.h.m2:heHE.EikonosChrysis.name
ltx/en_us_goadedes/me.m01.d02:meMA.Ode7C12.mode	@ltx/en_us_goadedes/miscellanea:misc.Mode2
ltx/en_us_goadedes/me.m01.d02:meMA.Ode7C12.ode	@ltx/en_us_goadedes/miscellanea:misc.Ode7
ltx/en_us_goadedes/me.m01.d02:meMA.Ode7C12.text	
ltx/en_us_goadedes/me.m01.d02:meMA.Ode7C13.incipit	…
ltx/en_us_goadedes/me.m01.d02:meMA.Ode7C13.melody	@ltx/en_us_goadedes/he.h.m2:heHE.EikonosChrysis.name
ltx/en_us_goadedes/me.m01.d02:meMA.Ode7C13.mode	@ltx/en_us_goadedes/miscellanea:misc.Mode2
ltx/en_us_goadedes/me.m01.d02:meMA.Ode7C13.ode	@ltx/en_us_goadedes/miscellanea:misc.Ode7
ltx/en_us_goadedes/me.m01.d02:meMA.Ode7C13.text	
ltx/en_us_goadedes/me.m01.d02:meMA.Ode7C1H.greekmelody	@ltx/en_us_goadedes/he.h.m2:heHE.EikonosChrysis.greekname
ltx/en_us_goadedes/me.m01.d02:meMA.Ode7C1H.incipit	@ltx/en_us_goadedes/he.h.m2:heHE.EikonosChrysis.incipit
ltx/en_us_goadedes/me.m01.d02:meMA.Ode7C1H.melody	@ltx/en_us_goadedes/he.h.m2:heHE.EikonosChrysis.melody
ltx/en_us_goadedes/me.m01.d02:meMA.Ode7C1H.mode	@ltx/en_us_goadedes/miscellanea:misc.Mode2
ltx/en_us_goadedes/me.m01.d02:meMA.Ode7C1H.ode	@ltx/en_us_goadedes/miscellanea:misc.Ode7
ltx/en_us_goadedes/me.m01.d02:meMA.Ode7C1H.text	@ltx/en_us_goadedes/he.h.m2:heHE.EikonosChrysis.text
ltx/en_us_goadedes/me.m01.d02:meMA.Ode7C21.greekmelody	@ltx/en_us_goadedes/he.h.m8:heHE.OiEkTisIoudaias.greekname
ltx/en_us_goadedes/me.m01.d02:meMA.Ode7C21.incipit	…
ltx/en_us_goadedes/me.m01.d02:meMA.Ode7C21.melody	@ltx/en_us_goadedes/he.h.m8:heHE.OiEkTisIoudaias.name
ltx/en_us_goadedes/me.m01.d02:meMA.Ode7C21.mode	@ltx/en_us_goadedes/miscellanea:misc.Mode8
ltx/en_us_goadedes/me.m01.d02:meMA.Ode7C21.ode	@ltx/en_us_goadedes/miscellanea:misc.Ode7
ltx/en_us_goadedes/me.m01.d02:meMA.Ode7C21.text	
ltx/en_us_goadedes/me.m01.d02:meMA.Ode7C22.incipit	…
ltx/en_us_goadedes/me.m01.d02:meMA.Ode7C22.melody	@ltx/en_us_goadedes/he.h.m8:heHE.OiEkTisIoudaias.name
ltx/en_us_goadedes/me.m01.d02:meMA.Ode7C22.mode	@ltx/en_us_goadedes/miscellanea:misc.Mode8
ltx/en_us_goadedes/me.m01.d02:meMA.Ode7C22.ode	@ltx/en_us_goadedes/miscellanea:misc.Ode7
ltx/en_us_goadedes/me.m01.d02:meMA.Ode7C22.text	
ltx/en_us_goadedes/me.m01.d02:meMA.Ode7C23.incipit	…
ltx/en_us_goadedes/me.m01.d02:meMA.Ode7C23.melody	@ltx/en_us_goadedes/he.h.m8:heHE.OiEkTisIoudaias.name
ltx/en_us_goadedes/me.m01.d02:meMA.Ode7C23.mode	@ltx/en_us_goadedes/miscellanea:misc.Mode8
ltx/en_us_goadedes/me.m01.d02:meMA.Ode7C23.ode	@ltx/en_us_goadedes/miscellanea:misc.Ode7
ltx/en_us_goadedes/me.m01.d02:meMA.Ode7C23.text	
ltx/en_us_goadedes/me.m01.d02:meMA.Ode7C24.incipit	…
ltx/en_us_goadedes/me.m01.d02:meMA.Ode7C24.melody	@ltx/en_us_goadedes/he.h.m8:heHE.OiEkTisIoudaias.name
ltx/en_us_goadedes/me.m01.d02:meMA.Ode7C24.mode	@ltx/en_us_goadedes/miscellanea:misc.Mode8
ltx/en_us_goadedes/me.m01.d02:meMA.Ode7C24.ode	@ltx/en_us_goadedes/miscellanea:misc.Ode7
ltx/en_us_goadedes/me.m01.d02:meMA.Ode7C24.text	
ltx/en_us_goadedes/me.m01.d02:meMA.Ode7C2T.incipit	…
ltx/en_us_goadedes/me.m01.d02:meMA.Ode7C2T.melody	@ltx/en_us_goadedes/he.h.m8:heHE.OiEkTisIoudaias.name
ltx/en_us_goadedes/me.m01.d02:meMA.Ode7C2T.mode	@ltx/en_us_goadedes/miscellanea:misc.Mode8
ltx/en_us_goadedes/me.m01.d02:meMA.Ode7C2T.ode	@ltx/en_us_goadedes/miscellanea:misc.Ode7
ltx/en_us_goadedes/me.m01.d02:meMA.Ode7C2T.text	
ltx/en_us_goadedes/me.m01.d02:meMA.Ode8C11.greekmelody	@ltx/en_us_goadedes/he.h.m2:heHE.TonEnKaminoTouPyros.greekname
ltx/en_us_goadedes/me.m01.d02:meMA.Ode8C11.incipit	…
ltx/en_us_goadedes/me.m01.d02:meMA.Ode8C11.melody	@ltx/en_us_goadedes/he.h.m2:heHE.TonEnKaminoTouPyros.name
ltx/en_us_goadedes/me.m01.d02:meMA.Ode8C11.mode	@ltx/en_us_goadedes/miscellanea:misc.Mode2
ltx/en_us_goadedes/me.m01.d02:meMA.Ode8C11.ode	@ltx/en_us_goadedes/miscellanea:misc.Ode8
ltx/en_us_goadedes/me.m01.d02:meMA.Ode8C11.text	
ltx/en_us_goadedes/me.m01.d02:meMA.Ode8C12.incipit	…
ltx/en_us_goadedes/me.m01.d02:meMA.Ode8C12.melody	@ltx/en_us_goadedes/he.h.m2:heHE.TonEnKaminoTouPyros.name
ltx/en_us_goadedes/me.m01.d02:meMA.Ode8C12.mode	@ltx/en_us_goadedes/miscellanea:misc.Mode2
ltx/en_us_goadedes/me.m01.d02:meMA.Ode8C12.ode	@ltx/en_us_goadedes/miscellanea:misc.Ode8
ltx/en_us_goadedes/me.m01.d02:meMA.Ode8C12.text	
ltx/en_us_goadedes/me.m01.d02:meMA.Ode8C13.incipit	…
ltx/en_us_goadedes/me.m01.d02:meMA.Ode8C13.melody	@ltx/en_us_goadedes/he.h.m2:heHE.TonEnKaminoTouPyros.name
ltx/en_us_goadedes/me.m01.d02:meMA.Ode8C13.mode	@ltx/en_us_goadedes/miscellanea:misc.Mode2
ltx/en_us_goadedes/me.m01.d02:meMA.Ode8C13.ode	@ltx/en_us_goadedes/miscellanea:misc.Ode8
ltx/en_us_goadedes/me.m01.d02:meMA.Ode8C13.text	
ltx/en_us_goadedes/me.m01.d02:meMA.Ode8C14.incipit	…
ltx/en_us_goadedes/me.m01.d02:meMA.Ode8C14.melody	@ltx/en_us_goadedes/he.h.m2:heHE.TonEnKaminoTouPyros.name
ltx/en_us_goadedes/me.m01.d02:meMA.Ode8C14.mode	@ltx/en_us_goadedes/miscellanea:misc.Mode2
ltx/en_us_goadedes/me.m01.d02:meMA.Ode8C14.ode	@ltx/en_us_goadedes/miscellanea:misc.Ode8
ltx/en_us_goadedes/me.m01.d02:meMA.Ode8C14.text	
ltx/en_us_goadedes/me.m01.d02:meMA.Ode8C1H.greekmelody	@ltx/en_us_goadedes/he.h.m2:heHE.TonEnKaminoTouPyros.greekname
ltx/en_us_goadedes/me.m01.d02:meMA.Ode8C1H.incipit	@ltx/en_us_goadedes/he.h.m2:heHE.TonEnKaminoTouPyros.incipit
ltx/en_us_goadedes/me.m01.d02:meMA.Ode8C1H.melody	@ltx/en_us_goadedes/he.h.m2:heHE.TonEnKaminoTouPyros.melody
ltx/en_us_goadedes/me.m01.d02:meMA.Ode8C1H.mode	@ltx/en_us_goadedes/miscellanea:misc.Mode2
ltx/en_us_goadedes/me.m01.d02:meMA.Ode8C1H.ode	@ltx/en_us_goadedes/miscellanea:misc.Ode8
ltx/en_us_goadedes/me.m01.d02:meMA.Ode8C1H.text	@ltx/en_us_goadedes/he.h.m2:heHE.TonEnKaminoTouPyros.text
ltx/en_us_goadedes/me.m01.d02:meMA.Ode8C21.greekmelody	@ltx/en_us_goadedes/he.h.m8:heHE.NikitaiTyrannou.greekname
ltx/en_us_goadedes/me.m01.d02:meMA.Ode8C21.incipit	…
ltx/en_us_goadedes/me.m01.d02:meMA.Ode8C21.melody	@ltx/en_us_goadedes/he.h.m8:heHE.NikitaiTyrannou.name
ltx/en_us_goadedes/me.m01.d02:meMA.Ode8C21.mode	@ltx/en_us_goadedes/miscellanea:misc.Mode8
ltx/en_us_goadedes/me.m01.d02:meMA.Ode8C21.ode	@ltx/en_us_goadedes/miscellanea:misc.Ode8
ltx/en_us_goadedes/me.m01.d02:meMA.Ode8C21.text	
ltx/en_us_goadedes/me.m01.d02:meMA.Ode8C22.incipit	…
ltx/en_us_goadedes/me.m01.d02:meMA.Ode8C22.melody	@ltx/en_us_goadedes/he.h.m8:heHE.NikitaiTyrannou.name
ltx/en_us_goadedes/me.m01.d02:meMA.Ode8C22.mode	@ltx/en_us_goadedes/miscellanea:misc.Mode8
ltx/en_us_goadedes/me.m01.d02:meMA.Ode8C22.ode	@ltx/en_us_goadedes/miscellanea:misc.Ode8
ltx/en_us_goadedes/me.m01.d02:meMA.Ode8C22.text	
ltx/en_us_goadedes/me.m01.d02:meMA.Ode8C23.incipit	…
ltx/en_us_goadedes/me.m01.d02:meMA.Ode8C23.melody	@ltx/en_us_goadedes/he.h.m8:heHE.NikitaiTyrannou.name
ltx/en_us_goadedes/me.m01.d02:meMA.Ode8C23.mode	@ltx/en_us_goadedes/miscellanea:misc.Mode8
ltx/en_us_goadedes/me.m01.d02:meMA.Ode8C23.ode	@ltx/en_us_goadedes/miscellanea:misc.Ode8
ltx/en_us_goadedes/me.m01.d02:meMA.Ode8C23.text	
ltx/en_us_goadedes/me.m01.d02:meMA.Ode8C24.incipit	…
ltx/en_us_goadedes/me.m01.d02:meMA.Ode8C24.melody	@ltx/en_us_goadedes/he.h.m8:heHE.NikitaiTyrannou.name
ltx/en_us_goadedes/me.m01.d02:meMA.Ode8C24.mode	@ltx/en_us_goadedes/miscellanea:misc.Mode8
ltx/en_us_goadedes/me.m01.d02:meMA.Ode8C24.ode	@ltx/en_us_goadedes/miscellanea:misc.Ode8
ltx/en_us_goadedes/me.m01.d02:meMA.Ode8C24.text	
ltx/en_us_goadedes/me.m01.d02:meMA.Ode8C2T.incipit	…
ltx/en_us_goadedes/me.m01.d02:meMA.Ode8C2T.melody	@ltx/en_us_goadedes/he.h.m8:heHE.NikitaiTyrannou.name
ltx/en_us_goadedes/me.m01.d02:meMA.Ode8C2T.mode	@ltx/en_us_goadedes/miscellanea:misc.Mode8
ltx/en_us_goadedes/me.m01.d02:meMA.Ode8C2T.ode	@ltx/en_us_goadedes/miscellanea:misc.Ode8
ltx/en_us_goadedes/me.m01.d02:meMA.Ode8C2T.text	
ltx/en_us_goadedes/me.m01.d02:meMA.Ode8H.greekmelody	@ltx/en_us_goadedes/he.h.m8:heHE.NikitaiTyrannou.greekname
ltx/en_us_goadedes/me.m01.d02:meMA.Ode8H.incipit	@ltx/en_us_goadedes/he.h.m8:heHE.NikitaiTyrannou.incipit
ltx/en_us_goadedes/me.m01.d02:meMA.Ode8H.melody	@ltx/en_us_goadedes/he.h.m8:heHE.NikitaiTyrannou.melody
ltx/en_us_goadedes/me.m01.d02:meMA.Ode8H.mode	@ltx/en_us_goadedes/miscellanea:misc.Mode8
ltx/en_us_goadedes/me.m01.d02:meMA.Ode8H.ode	@ltx/en_us_goadedes/miscellanea:misc.Ode8
ltx/en_us_goadedes/me.m01.d02:meMA.Ode8H.text	@ltx/en_us_goadedes/he.h.m8:heHE.NikitaiTyrannou.text
ltx/en_us_goadedes/me.m01.d02:meMA.Ode9C11.greekmelody	@ltx/en_us_goadedes/he.h.m2:heHE.TonEkTheouTheonLogon.greekname
ltx/en_us_goadedes/me.m01.d02:meMA.Ode9C11.incipit	…
ltx/en_us_goadedes/me.m01.d02:meMA.Ode9C11.melody	@ltx/en_us_goadedes/he.h.m2:heHE.TonEkTheouTheonLogon.name
ltx/en_us_goadedes/me.m01.d02:meMA.Ode9C11.mode	@ltx/en_us_goadedes/miscellanea:misc.Mode2
ltx/en_us_goadedes/me.m01.d02:meMA.Ode9C11.ode	@ltx/en_us_goadedes/miscellanea:misc.Ode9
ltx/en_us_goadedes/me.m01.d02:meMA.Ode9C11.text	
ltx/en_us_goadedes/me.m01.d02:meMA.Ode9C12.incipit	…
ltx/en_us_goadedes/me.m01.d02:meMA.Ode9C12.melody	@ltx/en_us_goadedes/he.h.m2:heHE.TonEkTheouTheonLogon.name
ltx/en_us_goadedes/me.m01.d02:meMA.Ode9C12.mode	@ltx/en_us_goadedes/miscellanea:misc.Mode2
ltx/en_us_goadedes/me.m01.d02:meMA.Ode9C12.ode	@ltx/en_us_goadedes/miscellanea:misc.Ode9
ltx/en_us_goadedes/me.m01.d02:meMA.Ode9C12.text	
ltx/en_us_goadedes/me.m01.d02:meMA.Ode9C13.incipit	…
ltx/en_us_goadedes/me.m01.d02:meMA.Ode9C13.melody	@ltx/en_us_goadedes/he.h.m2:heHE.TonEkTheouTheonLogon.name
ltx/en_us_goadedes/me.m01.d02:meMA.Ode9C13.mode	@ltx/en_us_goadedes/miscellanea:misc.Mode2
ltx/en_us_goadedes/me.m01.d02:meMA.Ode9C13.ode	@ltx/en_us_goadedes/miscellanea:misc.Ode9
ltx/en_us_goadedes/me.m01.d02:meMA.Ode9C13.text	
ltx/en_us_goadedes/me.m01.d02:meMA.Ode9C14.incipit	…
ltx/en_us_goadedes/me.m01.d02:meMA.Ode9C14.melody	@ltx/en_us_goadedes/he.h.m2:heHE.TonEkTheouTheonLogon.name
ltx/en_us_goadedes/me.m01.d02:meMA.Ode9C14.mode	@ltx/en_us_goadedes/miscellanea:misc.Mode2
ltx/en_us_goadedes/me.m01.d02:meMA.Ode9C14.ode	@ltx/en_us_goadedes/miscellanea:misc.Ode9
ltx/en_us_goadedes/me.m01.d02:meMA.Ode9C14.text	
ltx/en_us_goadedes/me.m01.d02:meMA.Ode9C15.incipit	…
ltx/en_us_goadedes/me.m01.d02:meMA.Ode9C15.melody	@ltx/en_us_goadedes/he.h.m2:heHE.TonEkTheouTheonLogon.name
ltx/en_us_goadedes/me.m01.d02:meMA.Ode9C15.mode	@ltx/en_us_goadedes/miscellanea:misc.Mode2
ltx/en_us_goadedes/me.m01.d02:meMA.Ode9C15.ode	@ltx/en_us_goadedes/miscellanea:misc.Ode9
ltx/en_us_goadedes/me.m01.d02:meMA.Ode9C15.text	
ltx/en_us_goadedes/me.m01.d02:meMA.Ode9C1H.greekmelody	@ltx/en_us_goadedes/he.h.m2:heHE.TonEkTheouTheonLogon.greekname
ltx/en_us_goadedes/me.m01.d02:meMA.Ode9C1H.incipit	@ltx/en_us_goadedes/he.h.m2:heHE.TonEkTheouTheonLogon.incipit
ltx/en_us_goadedes/me.m01.d02:meMA.Ode9C1H.melody	@ltx/en_us_goadedes/he.h.m2:heHE.TonEkTheouTheonLogon.melody
ltx/en_us_goadedes/me.m01.d02:meMA.Ode9C1H.mode	@ltx/en_us_goadedes/miscellanea:misc.Mode2
ltx/en_us_goadedes/me.m01.d02:meMA.Ode9C1H.ode	@ltx/en_us_goadedes/miscellanea:misc.Ode9
ltx/en_us_goadedes/me.m01.d02:meMA.Ode9C1H.text	@ltx/en_us_goadedes/he.h.m2:heHE.TonEkTheouTheonLogon.text
ltx/en_us_goadedes/me.m01.d02:meMA.Ode9C21.greekmelody	@ltx/en_us_goadedes/he.h.m8:heHE.KyriosTheotokon.greekname
ltx/en_us_goadedes/me.m01.d02:meMA.Ode9C21.incipit	…
ltx/en_us_goadedes/me.m01.d02:meMA.Ode9C21.melody	@ltx/en_us_goadedes/he.h.m8:heHE.KyriosTheotokon.name
ltx/en_us_goadedes/me.m01.d02:meMA.Ode9C21.mode	@ltx/en_us_goadedes/miscellanea:misc.Mode8
ltx/en_us_goadedes/me.m01.d02:meMA.Ode9C21.ode	@ltx/en_us_goadedes/miscellanea:misc.Ode9
ltx/en_us_goadedes/me.m01.d02:meMA.Ode9C21.text	
ltx/en_us_goadedes/me.m01.d02:meMA.Ode9C22.incipit	…
ltx/en_us_goadedes/me.m01.d02:meMA.Ode9C22.melody	@ltx/en_us_goadedes/he.h.m8:heHE.KyriosTheotokon.name
ltx/en_us_goadedes/me.m01.d02:meMA.Ode9C22.mode	@ltx/en_us_goadedes/miscellanea:misc.Mode8
ltx/en_us_goadedes/me.m01.d02:meMA.Ode9C22.ode	@ltx/en_us_goadedes/miscellanea:misc.Ode9
ltx/en_us_goadedes/me.m01.d02:meMA.Ode9C22.text	
ltx/en_us_goadedes/me.m01.d02:meMA.Ode9C23.incipit	…
ltx/en_us_goadedes/me.m01.d02:meMA.Ode9C23.melody	@ltx/en_us_goadedes/he.h.m8:heHE.KyriosTheotokon.name
ltx/en_us_goadedes/me.m01.d02:meMA.Ode9C23.mode	@ltx/en_us_goadedes/miscellanea:misc.Mode8
ltx/en_us_goadedes/me.m01.d02:meMA.Ode9C23.ode	@ltx/en_us_goadedes/miscellanea:misc.Ode9
ltx/en_us_goadedes/me.m01.d02:meMA.Ode9C23.text	
ltx/en_us_goadedes/me.m01.d02:meMA.Ode9C24.incipit	…
ltx/en_us_goadedes/me.m01.d02:meMA.Ode9C24.melody	@ltx/en_us_goadedes/he.h.m8:heHE.KyriosTheotokon.name
ltx/en_us_goadedes/me.m01.d02:meMA.Ode9C24.mode	@ltx/en_us_goadedes/miscellanea:misc.Mode8
ltx/en_us_goadedes/me.m01.d02:meMA.Ode9C24.ode	@ltx/en_us_goadedes/miscellanea:misc.Ode9
ltx/en_us_goadedes/me.m01.d02:meMA.Ode9C24.text	
ltx/en_us_goadedes/me.m01.d02:meMA.Ode9C2T.incipit	…
ltx/en_us_goadedes/me.m01.d02:meMA.Ode9C2T.melody	@ltx/en_us_goadedes/he.h.m8:heHE.KyriosTheotokon.name
ltx/en_us_goadedes/me.m01.d02:meMA.Ode9C2T.mode	@ltx/en_us_goadedes/miscellanea:misc.Mode8
ltx/en_us_goadedes/me.m01.d02:meMA.Ode9C2T.ode	@ltx/en_us_goadedes/miscellanea:misc.Ode9
ltx/en_us_goadedes/me.m01.d02:meMA.Ode9C2T.text	
ltx/en_us_goadedes/me.m01.d02:meMA.Ode9H.greekmelody	@ltx/en_us_goadedes/he.h.m8:heHE.KyriosTheotokon.greekname
ltx/en_us_goadedes/me.m01.d02:meMA.Ode9H.incipit	@ltx/en_us_goadedes/he.h.m8:heHE.KyriosTheotokon.incipit
ltx/en_us_goadedes/me.m01.d02:meMA.Ode9H.melody	@ltx/en_us_goadedes/he.h.m8:heHE.KyriosTheotokon.melody
ltx/en_us_goadedes/me.m01.d02:meMA.Ode9H.mode	@ltx/en_us_goadedes/miscellanea:misc.Mode8
ltx/en_us_goadedes/me.m01.d02:meMA.Ode9H.ode	@ltx/en_us_goadedes/miscellanea:misc.Ode9
ltx/en_us_goadedes/me.m01.d02:meMA.Ode9H.text	@ltx/en_us_goadedes/he.h.m8:heHE.KyriosTheotokon.text
ltx/en_us_goadedes/me.m01.d02:meMA.Oikos1.text	
ltx/en_us_goadedes/me.m01.d02:meMA.Oikos2.text	Endowed with the episcopal seat of the paramount Apostle Peter, you were a marvelous minister of God, beautifying, strengthening, and magnifying the Church with your divine doctrines. Radiating like a star, and shining with the light of virtue, you teach that the Trinity should be worshiped as one indivisible Godhead. And you banished the heresies of the enemies. And now implore the Master on our behalf.
ltx/en_us_goadedes/me.m01.d02:meVE.Apolytikion1.greekmelody	@ltx/en_us_goadedes/he.a.m4:heAU.KateplagiIosif.greekname
ltx/en_us_goadedes/me.m01.d02:meVE.Apolytikion1.incipit	…
ltx/en_us_goadedes/me.m01.d02:meVE.Apolytikion1.melody	@ltx/en_us_goadedes/he.a.m4:heAU.KateplagiIosif.name
ltx/en_us_goadedes/me.m01.d02:meVE.Apolytikion1.mode	@ltx/en_us_goadedes/miscellanea:misc.Mode4
ltx/en_us_goadedes/me.m01.d02:meVE.Apolytikion1.text	
ltx/en_us_goadedes/me.m01.d02:meVE.AposGlory.incipit	…
ltx/en_us_goadedes/me.m01.d02:meVE.AposGlory.melody	
ltx/en_us_goadedes/me.m01.d02:meVE.AposGlory.mode	@ltx/en_us_goadedes/miscellanea:misc.Mode3
ltx/en_us_goadedes/me.m01.d02:meVE.AposGlory.poet	@ltx/en_us_goadedes/poets:po.AndreouIerosolymitou
ltx/en_us_goadedes/me.m01.d02:meVE.AposGlory.text	
ltx/en_us_goadedes/me.m01.d02:meVE.Aposticha1.incipit	…
ltx/en_us_goadedes/me.m01.d02:meVE.Aposticha1.melody	
ltx/en_us_goadedes/me.m01.d02:meVE.Aposticha1.mode	@ltx/en_us_goadedes/miscellanea:misc.Mode1
ltx/en_us_goadedes/me.m01.d02:meVE.Aposticha1.poet	@ltx/en_us_goadedes/poets:po.IoannouMonachou
ltx/en_us_goadedes/me.m01.d02:meVE.Aposticha1.text	
ltx/en_us_goadedes/me.m01.d02:meVE.Aposticha2.incipit	…
ltx/en_us_goadedes/me.m01.d02:meVE.Aposticha2.melody	
ltx/en_us_goadedes/me.m01.d02:meVE.Aposticha2.mode	@ltx/en_us_goadedes/miscellanea:misc.Mode2
ltx/en_us_goadedes/me.m01.d02:meVE.Aposticha2.poet	@ltx/en_us_goadedes/poets:po.AndreouIerosolymitou
ltx/en_us_goadedes/me.m01.d02:meVE.Aposticha2.text	
ltx/en_us_goadedes/me.m01.d02:meVE.Aposticha3.incipit	…
ltx/en_us_goadedes/me.m01.d02:meVE.Aposticha3.melody	
ltx/en_us_goadedes/me.m01.d02:meVE.Aposticha3.mode	@ltx/en_us_goadedes/miscellanea:misc.Mode3
ltx/en_us_goadedes/me.m01.d02:meVE.Aposticha3.poet	@ltx/en_us_goadedes/poets:po.AndreouIerosolymitou
ltx/en_us_goadedes/me.m01.d02:meVE.Aposticha3.text	
ltx/en_us_goadedes/me.m01.d02:meVE.SticGlory.incipit	…
ltx/en_us_goadedes/me.m01.d02:meVE.SticGlory.melody	
ltx/en_us_goadedes/me.m01.d02:meVE.SticGlory.mode	@ltx/en_us_goadedes/miscellanea:misc.Mode6
ltx/en_us_goadedes/me.m01.d02:meVE.SticGlory.poet	@ltx/en_us_goadedes/poets:po.Vyzantiou
ltx/en_us_goadedes/me.m01.d02:meVE.SticGlory.text	
ltx/en_us_goadedes/me.m01.d02:meVE.Stichera01.greekmelody	@ltx/en_us_goadedes/he.a.m4:heAU.OsGennaionEnMartysi.greekname
ltx/en_us_goadedes/me.m01.d02:meVE.Stichera01.incipit	…
ltx/en_us_goadedes/me.m01.d02:meVE.Stichera01.melody	@ltx/en_us_goadedes/he.a.m4:heAU.OsGennaionEnMartysi.name
ltx/en_us_goadedes/me.m01.d02:meVE.Stichera01.mode	@ltx/en_us_goadedes/miscellanea:misc.Mode4
ltx/en_us_goadedes/me.m01.d02:meVE.Stichera01.text	
ltx/en_us_goadedes/me.m01.d02:meVE.Stichera02.incipit	…
ltx/en_us_goadedes/me.m01.d02:meVE.Stichera02.melody	@ltx/en_us_goadedes/he.a.m4:heAU.OsGennaionEnMartysi.name
ltx/en_us_goadedes/me.m01.d02:meVE.Stichera02.mode	@ltx/en_us_goadedes/miscellanea:misc.Mode4
ltx/en_us_goadedes/me.m01.d02:meVE.Stichera02.text	
ltx/en_us_goadedes/me.m01.d02:meVE.Stichera03.incipit	…
ltx/en_us_goadedes/me.m01.d02:meVE.Stichera03.melody	@ltx/en_us_goadedes/he.a.m4:heAU.OsGennaionEnMartysi.name
ltx/en_us_goadedes/me.m01.d02:meVE.Stichera03.mode	@ltx/en_us_goadedes/miscellanea:misc.Mode4
ltx/en_us_goadedes/me.m01.d02:meVE.Stichera03.text	
ltx/en_us_goadedes/me.m01.d02:meVE.Stichera04.greekmelody	@ltx/en_us_goadedes/he.a.m8:heAU.OTouParadoxou.greekname
ltx/en_us_goadedes/me.m01.d02:meVE.Stichera04.incipit	…
ltx/en_us_goadedes/me.m01.d02:meVE.Stichera04.melody	@ltx/en_us_goadedes/he.a.m8:heAU.OTouParadoxou.name
ltx/en_us_goadedes/me.m01.d02:meVE.Stichera04.mode	@ltx/en_us_goadedes/miscellanea:misc.Mode8
ltx/en_us_goadedes/me.m01.d02:meVE.Stichera04.text	
ltx/en_us_goadedes/me.m01.d02:meVE.Stichera05.incipit	…
ltx/en_us_goadedes/me.m01.d02:meVE.Stichera05.melody	@ltx/en_us_goadedes/he.a.m8:heAU.OTouParadoxou.name
ltx/en_us_goadedes/me.m01.d02:meVE.Stichera05.mode	@ltx/en_us_goadedes/miscellanea:misc.Mode8
ltx/en_us_goadedes/me.m01.d02:meVE.Stichera05.text	
ltx/en_us_goadedes/me.m01.d02:meVE.Stichera06.incipit	…
ltx/en_us_goadedes/me.m01.d02:meVE.Stichera06.melody	@ltx/en_us_goadedes/he.a.m8:heAU.OTouParadoxou.name
ltx/en_us_goadedes/me.m01.d02:meVE.Stichera06.mode	@ltx/en_us_goadedes/miscellanea:misc.Mode8
ltx/en_us_goadedes/me.m01.d02:meVE.Stichera06.text	
