ltx/en_us_goadedes/me.m12.d06:meDA.commemoration.first	
ltx/en_us_goadedes/me.m12.d06:meDA.commemoration.first_name	
ltx/en_us_goadedes/me.m12.d06:meDA.commemoration.first_short	
ltx/en_us_goadedes/me.m12.d06:meDA.commemoration.first_title	@ltx/en_us_goadedes/titles:ti.SaintM
ltx/en_us_goadedes/me.m12.d06:meDA.commemoration.full	
ltx/en_us_goadedes/me.m12.d06:meDA.commemoration.second_name	
ltx/en_us_goadedes/me.m12.d06:meDA.commemoration.second_title	
ltx/en_us_goadedes/me.m12.d06:meDA.date	
ltx/en_us_goadedes/me.m12.d06:meDA.fordate	
ltx/en_us_goadedes/me.m12.d06:meDA.insert1	
ltx/en_us_goadedes/me.m12.d06:meDA.insert2	
ltx/en_us_goadedes/me.m12.d06:meDA.note	
ltx/en_us_goadedes/me.m12.d06:meDA.pdfcoverdate	
ltx/en_us_goadedes/me.m12.d06:meDA.pdfheaderdate	
ltx/en_us_goadedes/me.m12.d06:meHO.commemorations	
ltx/en_us_goadedes/me.m12.d06:meHO.note1	
ltx/en_us_goadedes/me.m12.d06:meHO.note2	
ltx/en_us_goadedes/me.m12.d06:meHO.number	
ltx/en_us_goadedes/me.m12.d06:meHO.rank	
ltx/en_us_goadedes/me.m12.d06:meLE.commemoration1	
ltx/en_us_goadedes/me.m12.d06:meLE.commemoration2	
ltx/en_us_goadedes/me.m12.d06:meLI.Kontakion1.greekmelody	@ltx/en_us_goadedes/me.m12.d06:meMA.Kontakion1.greekmelody
ltx/en_us_goadedes/me.m12.d06:meLI.Kontakion1.incipit	@ltx/en_us_goadedes/me.m12.d06:meMA.Kontakion1.incipit
ltx/en_us_goadedes/me.m12.d06:meLI.Kontakion1.melody	@ltx/en_us_goadedes/me.m12.d06:meMA.Kontakion1.melody
ltx/en_us_goadedes/me.m12.d06:meLI.Kontakion1.mode	@ltx/en_us_goadedes/me.m12.d06:meMA.Kontakion1.mode
ltx/en_us_goadedes/me.m12.d06:meLI.Kontakion1.text	@ltx/en_us_goadedes/me.m12.d06:meMA.Kontakion1.text
ltx/en_us_goadedes/me.m12.d06:meLI.MM.CommunionHymn.text	@ltx/en_us_goadedes/properties:media.key
ltx/en_us_goadedes/me.m12.d06:meLI.Megalynarion.text	Protector of orphans are you, O Saint, * defender of widows, the provider for those in need, * the freer of captives, the rescuer of sailors * and travelers, all-blessed and wise father Nicholas.
ltx/en_us_goadedes/me.m12.d06:meMA.AdditionalIdiomelon1.incipit	@ltx/en_us_goadedes/me.m12.d06:meVE.Lity7.incipit
ltx/en_us_goadedes/me.m12.d06:meMA.AdditionalIdiomelon1.melody	
ltx/en_us_goadedes/me.m12.d06:meMA.AdditionalIdiomelon1.mode	@ltx/en_us_goadedes/miscellanea:misc.Mode6
ltx/en_us_goadedes/me.m12.d06:meMA.AdditionalIdiomelon1.poet	@ltx/en_us_goadedes/poets:po.Sergiou
ltx/en_us_goadedes/me.m12.d06:meMA.AdditionalIdiomelon1.text	@ltx/en_us_goadedes/me.m12.d06:meVE.Lity7.text
ltx/en_us_goadedes/me.m12.d06:meMA.AdditionalIdiomelon2.incipit	@ltx/en_us_goadedes/me.m12.d06:meVE.Lity8.incipit
ltx/en_us_goadedes/me.m12.d06:meMA.AdditionalIdiomelon2.melody	
ltx/en_us_goadedes/me.m12.d06:meMA.AdditionalIdiomelon2.mode	@ltx/en_us_goadedes/miscellanea:misc.Mode8
ltx/en_us_goadedes/me.m12.d06:meMA.AdditionalIdiomelon2.text	@ltx/en_us_goadedes/me.m12.d06:meVE.Lity8.text
ltx/en_us_goadedes/me.m12.d06:meMA.AdditionalIdiomelonBoth.incipit	@ltx/en_us_goadedes/oc.m8.d5:ocMA.AposTheotokion.incipit
ltx/en_us_goadedes/me.m12.d06:meMA.AdditionalIdiomelonBoth.melody	
ltx/en_us_goadedes/me.m12.d06:meMA.AdditionalIdiomelonBoth.mode	@ltx/en_us_goadedes/miscellanea:misc.Mode8
ltx/en_us_goadedes/me.m12.d06:meMA.AdditionalIdiomelonBoth.text	@ltx/en_us_goadedes/oc.m8.d5:ocMA.AposTheotokion.text
ltx/en_us_goadedes/me.m12.d06:meMA.AdditionalIdiomelonGlory.incipit	@ltx/en_us_goadedes/me.m12.d06:meVE.LityGlory.incipit
ltx/en_us_goadedes/me.m12.d06:meMA.AdditionalIdiomelonGlory.melody	
ltx/en_us_goadedes/me.m12.d06:meMA.AdditionalIdiomelonGlory.mode	@ltx/en_us_goadedes/miscellanea:misc.Mode8
ltx/en_us_goadedes/me.m12.d06:meMA.AdditionalIdiomelonGlory.text	@ltx/en_us_goadedes/me.m12.d06:meVE.LityGlory.text
ltx/en_us_goadedes/me.m12.d06:meMA.C1.acrostic.notice1	
ltx/en_us_goadedes/me.m12.d06:meMA.C1.acrostic.text	
ltx/en_us_goadedes/me.m12.d06:meMA.C1.acrostic.title	
ltx/en_us_goadedes/me.m12.d06:meMA.C1.title	@ltx/en_us_goadedes/titles:ti.CanonTheotokos
ltx/en_us_goadedes/me.m12.d06:meMA.C1.verse	@ltx/en_us_goadedes/prayers:pr.verse_Theotokos.text
ltx/en_us_goadedes/me.m12.d06:meMA.C2.acrostic.notice1	
ltx/en_us_goadedes/me.m12.d06:meMA.C2.acrostic.text	
ltx/en_us_goadedes/me.m12.d06:meMA.C2.acrostic.title	
ltx/en_us_goadedes/me.m12.d06:meMA.C2.poet	@ltx/en_us_goadedes/poets:po.Theofanous
ltx/en_us_goadedes/me.m12.d06:meMA.C2.title	@ltx/en_us_goadedes/titles:ti.Canon1SaintM
ltx/en_us_goadedes/me.m12.d06:meMA.C2.verse	@ltx/en_us_goadedes/prayers:pr.verse_SaintM.text
ltx/en_us_goadedes/me.m12.d06:meMA.C3.acrostic.notice1	
ltx/en_us_goadedes/me.m12.d06:meMA.C3.acrostic.title	
ltx/en_us_goadedes/me.m12.d06:meMA.C3.title	@ltx/en_us_goadedes/titles:ti.Canon2SaintM
ltx/en_us_goadedes/me.m12.d06:meMA.C3.verse	@ltx/en_us_goadedes/prayers:pr.verse_SaintM.text
ltx/en_us_goadedes/me.m12.d06:meMA.ExapTheotokion.incipit	…
ltx/en_us_goadedes/me.m12.d06:meMA.ExapTheotokion.melody	@ltx/en_us_goadedes/he.a.m2:heAU.GynaikesAkoutisthite.name
ltx/en_us_goadedes/me.m12.d06:meMA.ExapTheotokion.mode	@ltx/en_us_goadedes/miscellanea:misc.Mode2
ltx/en_us_goadedes/me.m12.d06:meMA.ExapTheotokion.text	
ltx/en_us_goadedes/me.m12.d06:meMA.Exaposteilarion1.greekmelody	@ltx/en_us_goadedes/he.a.m2:heAU.GynaikesAkoutisthite.greekname
ltx/en_us_goadedes/me.m12.d06:meMA.Exaposteilarion1.incipit	…
ltx/en_us_goadedes/me.m12.d06:meMA.Exaposteilarion1.melody	@ltx/en_us_goadedes/he.a.m2:heAU.GynaikesAkoutisthite.name
ltx/en_us_goadedes/me.m12.d06:meMA.Exaposteilarion1.mode	@ltx/en_us_goadedes/miscellanea:misc.Mode2
ltx/en_us_goadedes/me.m12.d06:meMA.Exaposteilarion1.text	
ltx/en_us_goadedes/me.m12.d06:meMA.Exaposteilarion2.greekmelody	@ltx/en_us_goadedes/he.a.m2:heAU.GynaikesAkoutisthite.greekname
ltx/en_us_goadedes/me.m12.d06:meMA.Exaposteilarion2.incipit	…
ltx/en_us_goadedes/me.m12.d06:meMA.Exaposteilarion2.melody	@ltx/en_us_goadedes/he.a.m2:heAU.GynaikesAkoutisthite.name
ltx/en_us_goadedes/me.m12.d06:meMA.Exaposteilarion2.mode	@ltx/en_us_goadedes/miscellanea:misc.Mode2
ltx/en_us_goadedes/me.m12.d06:meMA.Exaposteilarion2.text	
ltx/en_us_goadedes/me.m12.d06:meMA.FestalMagnification.incipit	…
ltx/en_us_goadedes/me.m12.d06:meMA.FestalMagnification.text	
ltx/en_us_goadedes/me.m12.d06:meMA.Kathisma11.greekmelody	@ltx/en_us_goadedes/he.a.m1:heAU.TonTafonSouSotir.greekname
ltx/en_us_goadedes/me.m12.d06:meMA.Kathisma11.incipit	…
ltx/en_us_goadedes/me.m12.d06:meMA.Kathisma11.melody	@ltx/en_us_goadedes/he.a.m1:heAU.TonTafonSouSotir.name
ltx/en_us_goadedes/me.m12.d06:meMA.Kathisma11.mode	@ltx/en_us_goadedes/miscellanea:misc.Mode1
ltx/en_us_goadedes/me.m12.d06:meMA.Kathisma11.text	
ltx/en_us_goadedes/me.m12.d06:meMA.Kathisma1T.incipit	@ltx/en_us_goadedes/oc.m1.d1:ocMA.Kathisma23.incipit
ltx/en_us_goadedes/me.m12.d06:meMA.Kathisma1T.melody	@ltx/en_us_goadedes/he.a.m1:heAU.TonTafonSouSotir.name
ltx/en_us_goadedes/me.m12.d06:meMA.Kathisma1T.mode	@ltx/en_us_goadedes/miscellanea:misc.Mode1
ltx/en_us_goadedes/me.m12.d06:meMA.Kathisma1T.text	@ltx/en_us_goadedes/oc.m1.d1:ocMA.Kathisma23.text
ltx/en_us_goadedes/me.m12.d06:meMA.Kathisma21.greekmelody	@ltx/en_us_goadedes/he.a.m4:heAU.EpefanisSimeron.greekname
ltx/en_us_goadedes/me.m12.d06:meMA.Kathisma21.incipit	…
ltx/en_us_goadedes/me.m12.d06:meMA.Kathisma21.melody	@ltx/en_us_goadedes/he.a.m4:heAU.EpefanisSimeron.name
ltx/en_us_goadedes/me.m12.d06:meMA.Kathisma21.mode	@ltx/en_us_goadedes/miscellanea:misc.Mode4
ltx/en_us_goadedes/me.m12.d06:meMA.Kathisma21.text	
ltx/en_us_goadedes/me.m12.d06:meMA.Kathisma2T.incipit	@ltx/en_us_goadedes/me.m07.d05:meMA.Kathisma2T.incipit
ltx/en_us_goadedes/me.m12.d06:meMA.Kathisma2T.melody	@ltx/en_us_goadedes/he.a.m4:heAU.EpefanisSimeron.name
ltx/en_us_goadedes/me.m12.d06:meMA.Kathisma2T.mode	@ltx/en_us_goadedes/miscellanea:misc.Mode4
ltx/en_us_goadedes/me.m12.d06:meMA.Kathisma2T.text	@ltx/en_us_goadedes/me.m07.d05:meMA.Kathisma2T.text
ltx/en_us_goadedes/me.m12.d06:meMA.Kathisma31.greekmelody	@ltx/en_us_goadedes/he.a.m4:heAU.TachyProkatalave.greekname
ltx/en_us_goadedes/me.m12.d06:meMA.Kathisma31.incipit	…
ltx/en_us_goadedes/me.m12.d06:meMA.Kathisma31.melody	@ltx/en_us_goadedes/he.a.m4:heAU.TachyProkatalave.name
ltx/en_us_goadedes/me.m12.d06:meMA.Kathisma31.mode	@ltx/en_us_goadedes/miscellanea:misc.Mode4
ltx/en_us_goadedes/me.m12.d06:meMA.Kathisma31.text	
ltx/en_us_goadedes/me.m12.d06:meMA.Kathisma3T.incipit	…
ltx/en_us_goadedes/me.m12.d06:meMA.Kathisma3T.melody	@ltx/en_us_goadedes/he.a.m4:heAU.TachyProkatalave.name
ltx/en_us_goadedes/me.m12.d06:meMA.Kathisma3T.mode	@ltx/en_us_goadedes/miscellanea:misc.Mode4
ltx/en_us_goadedes/me.m12.d06:meMA.Kathisma3T.text	
ltx/en_us_goadedes/me.m12.d06:meMA.Kontakion1.greekmelody	@ltx/en_us_goadedes/he.a.m3:heAU.IParthenosSimeron.greekname
ltx/en_us_goadedes/me.m12.d06:meMA.Kontakion1.incipit	…
ltx/en_us_goadedes/me.m12.d06:meMA.Kontakion1.melody	@ltx/en_us_goadedes/he.a.m3:heAU.IParthenosSimeron.name
ltx/en_us_goadedes/me.m12.d06:meMA.Kontakion1.mode	@ltx/en_us_goadedes/miscellanea:misc.Mode3
ltx/en_us_goadedes/me.m12.d06:meMA.Kontakion1.text	
ltx/en_us_goadedes/me.m12.d06:meMA.Lauds1.greekmelody	@ltx/en_us_goadedes/he.a.m1:heAU.TonOuranionTagmaton.greekname
ltx/en_us_goadedes/me.m12.d06:meMA.Lauds1.incipit	…
ltx/en_us_goadedes/me.m12.d06:meMA.Lauds1.melody	@ltx/en_us_goadedes/he.a.m1:heAU.TonOuranionTagmaton.name
ltx/en_us_goadedes/me.m12.d06:meMA.Lauds1.mode	@ltx/en_us_goadedes/miscellanea:misc.Mode1
ltx/en_us_goadedes/me.m12.d06:meMA.Lauds1.text	
ltx/en_us_goadedes/me.m12.d06:meMA.Lauds2.incipit	…
ltx/en_us_goadedes/me.m12.d06:meMA.Lauds2.melody	@ltx/en_us_goadedes/he.a.m1:heAU.TonOuranionTagmaton.name
ltx/en_us_goadedes/me.m12.d06:meMA.Lauds2.mode	@ltx/en_us_goadedes/miscellanea:misc.Mode1
ltx/en_us_goadedes/me.m12.d06:meMA.Lauds2.text	
ltx/en_us_goadedes/me.m12.d06:meMA.Lauds3.incipit	…
ltx/en_us_goadedes/me.m12.d06:meMA.Lauds3.melody	@ltx/en_us_goadedes/he.a.m1:heAU.TonOuranionTagmaton.name
ltx/en_us_goadedes/me.m12.d06:meMA.Lauds3.mode	@ltx/en_us_goadedes/miscellanea:misc.Mode1
ltx/en_us_goadedes/me.m12.d06:meMA.Lauds3.text	
ltx/en_us_goadedes/me.m12.d06:meMA.Lauds4.greekmelody	@ltx/en_us_goadedes/he.a.m1:heAU.TonOuranionTagmaton.greekname
ltx/en_us_goadedes/me.m12.d06:meMA.Lauds4.incipit	…
ltx/en_us_goadedes/me.m12.d06:meMA.Lauds4.melody	@ltx/en_us_goadedes/he.a.m1:heAU.TonOuranionTagmaton.name
ltx/en_us_goadedes/me.m12.d06:meMA.Lauds4.mode	@ltx/en_us_goadedes/miscellanea:misc.Mode1
ltx/en_us_goadedes/me.m12.d06:meMA.Lauds4.text	
ltx/en_us_goadedes/me.m12.d06:meMA.LaudsGlory.incipit	…
ltx/en_us_goadedes/me.m12.d06:meMA.LaudsGlory.melody	
ltx/en_us_goadedes/me.m12.d06:meMA.LaudsGlory.mode	@ltx/en_us_goadedes/miscellanea:misc.Mode5
ltx/en_us_goadedes/me.m12.d06:meMA.LaudsGlory.text	
ltx/en_us_goadedes/me.m12.d06:meMA.LaudsTheotokion.incipit	…
ltx/en_us_goadedes/me.m12.d06:meMA.LaudsTheotokion.melody	
ltx/en_us_goadedes/me.m12.d06:meMA.LaudsTheotokion.mode	@ltx/en_us_goadedes/miscellanea:misc.Mode5
ltx/en_us_goadedes/me.m12.d06:meMA.LaudsTheotokion.text	
ltx/en_us_goadedes/me.m12.d06:meMA.MM.Lauds1234as5678.text	@ltx/en_us_goadedes/properties:media.key
ltx/en_us_goadedes/me.m12.d06:meMA.Ode1C11.greekmelody	@ltx/en_us_goadedes/he.h.m1:heHE.OdinEpinikion.greekname
ltx/en_us_goadedes/me.m12.d06:meMA.Ode1C11.incipit	…
ltx/en_us_goadedes/me.m12.d06:meMA.Ode1C11.melody	@ltx/en_us_goadedes/he.h.m1:heHE.OdinEpinikion.name
ltx/en_us_goadedes/me.m12.d06:meMA.Ode1C11.mode	@ltx/en_us_goadedes/miscellanea:misc.Mode1
ltx/en_us_goadedes/me.m12.d06:meMA.Ode1C11.ode	@ltx/en_us_goadedes/miscellanea:misc.Ode1
ltx/en_us_goadedes/me.m12.d06:meMA.Ode1C11.text	
ltx/en_us_goadedes/me.m12.d06:meMA.Ode1C12.incipit	…
ltx/en_us_goadedes/me.m12.d06:meMA.Ode1C12.melody	@ltx/en_us_goadedes/he.h.m1:heHE.OdinEpinikion.name
ltx/en_us_goadedes/me.m12.d06:meMA.Ode1C12.mode	@ltx/en_us_goadedes/miscellanea:misc.Mode1
ltx/en_us_goadedes/me.m12.d06:meMA.Ode1C12.ode	@ltx/en_us_goadedes/miscellanea:misc.Ode1
ltx/en_us_goadedes/me.m12.d06:meMA.Ode1C12.text	
ltx/en_us_goadedes/me.m12.d06:meMA.Ode1C1H.greekmelody	@ltx/en_us_goadedes/he.h.m1:heHE.OdinEpinikion.greekname
ltx/en_us_goadedes/me.m12.d06:meMA.Ode1C1H.incipit	@ltx/en_us_goadedes/he.h.m1:heHE.OdinEpinikion.incipit
ltx/en_us_goadedes/me.m12.d06:meMA.Ode1C1H.melody	@ltx/en_us_goadedes/he.h.m1:heHE.OdinEpinikion.melody
ltx/en_us_goadedes/me.m12.d06:meMA.Ode1C1H.mode	@ltx/en_us_goadedes/miscellanea:misc.Mode1
ltx/en_us_goadedes/me.m12.d06:meMA.Ode1C1H.ode	@ltx/en_us_goadedes/miscellanea:misc.Ode1
ltx/en_us_goadedes/me.m12.d06:meMA.Ode1C1H.text	@ltx/en_us_goadedes/he.h.m1:heHE.OdinEpinikion.text
ltx/en_us_goadedes/me.m12.d06:meMA.Ode1C21.greekmelody	@ltx/en_us_goadedes/he.h.m2:heHE.EnVythoKatestrose.greekname
ltx/en_us_goadedes/me.m12.d06:meMA.Ode1C21.incipit	…
ltx/en_us_goadedes/me.m12.d06:meMA.Ode1C21.melody	@ltx/en_us_goadedes/he.h.m2:heHE.EnVythoKatestrose.name
ltx/en_us_goadedes/me.m12.d06:meMA.Ode1C21.mode	@ltx/en_us_goadedes/miscellanea:misc.Mode2
ltx/en_us_goadedes/me.m12.d06:meMA.Ode1C21.ode	@ltx/en_us_goadedes/miscellanea:misc.Ode1
ltx/en_us_goadedes/me.m12.d06:meMA.Ode1C21.text	
ltx/en_us_goadedes/me.m12.d06:meMA.Ode1C22.incipit	…
ltx/en_us_goadedes/me.m12.d06:meMA.Ode1C22.melody	@ltx/en_us_goadedes/he.h.m2:heHE.EnVythoKatestrose.name
ltx/en_us_goadedes/me.m12.d06:meMA.Ode1C22.mode	@ltx/en_us_goadedes/miscellanea:misc.Mode2
ltx/en_us_goadedes/me.m12.d06:meMA.Ode1C22.ode	@ltx/en_us_goadedes/miscellanea:misc.Ode1
ltx/en_us_goadedes/me.m12.d06:meMA.Ode1C22.text	
ltx/en_us_goadedes/me.m12.d06:meMA.Ode1C2T.incipit	…
ltx/en_us_goadedes/me.m12.d06:meMA.Ode1C2T.melody	@ltx/en_us_goadedes/he.h.m2:heHE.EnVythoKatestrose.name
ltx/en_us_goadedes/me.m12.d06:meMA.Ode1C2T.mode	@ltx/en_us_goadedes/miscellanea:misc.Mode2
ltx/en_us_goadedes/me.m12.d06:meMA.Ode1C2T.ode	@ltx/en_us_goadedes/miscellanea:misc.Ode1
ltx/en_us_goadedes/me.m12.d06:meMA.Ode1C2T.text	
ltx/en_us_goadedes/me.m12.d06:meMA.Ode1C31.greekmelody	@ltx/en_us_goadedes/he.h.m1:heHE.ChristosGennatai.greekname
ltx/en_us_goadedes/me.m12.d06:meMA.Ode1C31.incipit	…
ltx/en_us_goadedes/me.m12.d06:meMA.Ode1C31.melody	@ltx/en_us_goadedes/he.h.m1:heHE.ChristosGennatai.name
ltx/en_us_goadedes/me.m12.d06:meMA.Ode1C31.mode	@ltx/en_us_goadedes/miscellanea:misc.Mode1
ltx/en_us_goadedes/me.m12.d06:meMA.Ode1C31.ode	@ltx/en_us_goadedes/miscellanea:misc.Ode1
ltx/en_us_goadedes/me.m12.d06:meMA.Ode1C31.text	
ltx/en_us_goadedes/me.m12.d06:meMA.Ode1C32.incipit	…
ltx/en_us_goadedes/me.m12.d06:meMA.Ode1C32.melody	@ltx/en_us_goadedes/he.h.m1:heHE.ChristosGennatai.name
ltx/en_us_goadedes/me.m12.d06:meMA.Ode1C32.mode	@ltx/en_us_goadedes/miscellanea:misc.Mode1
ltx/en_us_goadedes/me.m12.d06:meMA.Ode1C32.ode	@ltx/en_us_goadedes/miscellanea:misc.Ode1
ltx/en_us_goadedes/me.m12.d06:meMA.Ode1C32.text	
ltx/en_us_goadedes/me.m12.d06:meMA.Ode1C33.incipit	…
ltx/en_us_goadedes/me.m12.d06:meMA.Ode1C33.melody	@ltx/en_us_goadedes/he.h.m1:heHE.ChristosGennatai.name
ltx/en_us_goadedes/me.m12.d06:meMA.Ode1C33.mode	@ltx/en_us_goadedes/miscellanea:misc.Mode1
ltx/en_us_goadedes/me.m12.d06:meMA.Ode1C33.ode	@ltx/en_us_goadedes/miscellanea:misc.Ode1
ltx/en_us_goadedes/me.m12.d06:meMA.Ode1C33.text	
ltx/en_us_goadedes/me.m12.d06:meMA.Ode1C3T.incipit	…
ltx/en_us_goadedes/me.m12.d06:meMA.Ode1C3T.melody	@ltx/en_us_goadedes/he.h.m1:heHE.ChristosGennatai.name
ltx/en_us_goadedes/me.m12.d06:meMA.Ode1C3T.mode	@ltx/en_us_goadedes/miscellanea:misc.Mode1
ltx/en_us_goadedes/me.m12.d06:meMA.Ode1C3T.ode	@ltx/en_us_goadedes/miscellanea:misc.Ode1
ltx/en_us_goadedes/me.m12.d06:meMA.Ode1C3T.text	
ltx/en_us_goadedes/me.m12.d06:meMA.Ode1C3Tr.incipit	…
ltx/en_us_goadedes/me.m12.d06:meMA.Ode1C3Tr.melody	@ltx/en_us_goadedes/he.h.m1:heHE.ChristosGennatai.name
ltx/en_us_goadedes/me.m12.d06:meMA.Ode1C3Tr.mode	@ltx/en_us_goadedes/miscellanea:misc.Mode1
ltx/en_us_goadedes/me.m12.d06:meMA.Ode1C3Tr.ode	@ltx/en_us_goadedes/miscellanea:misc.Ode1
ltx/en_us_goadedes/me.m12.d06:meMA.Ode1C3Tr.text	
ltx/en_us_goadedes/me.m12.d06:meMA.Ode3C11.greekmelody	@ltx/en_us_goadedes/he.h.m1:heHE.StereothitoIKardiaMou.greekname
ltx/en_us_goadedes/me.m12.d06:meMA.Ode3C11.incipit	…
ltx/en_us_goadedes/me.m12.d06:meMA.Ode3C11.melody	@ltx/en_us_goadedes/he.h.m1:heHE.StereothitoIKardiaMou.name
ltx/en_us_goadedes/me.m12.d06:meMA.Ode3C11.mode	@ltx/en_us_goadedes/miscellanea:misc.Mode1
ltx/en_us_goadedes/me.m12.d06:meMA.Ode3C11.ode	@ltx/en_us_goadedes/miscellanea:misc.Ode3
ltx/en_us_goadedes/me.m12.d06:meMA.Ode3C11.text	
ltx/en_us_goadedes/me.m12.d06:meMA.Ode3C12.incipit	…
ltx/en_us_goadedes/me.m12.d06:meMA.Ode3C12.melody	@ltx/en_us_goadedes/he.h.m1:heHE.StereothitoIKardiaMou.name
ltx/en_us_goadedes/me.m12.d06:meMA.Ode3C12.mode	@ltx/en_us_goadedes/miscellanea:misc.Mode1
ltx/en_us_goadedes/me.m12.d06:meMA.Ode3C12.ode	@ltx/en_us_goadedes/miscellanea:misc.Ode3
ltx/en_us_goadedes/me.m12.d06:meMA.Ode3C12.text	
ltx/en_us_goadedes/me.m12.d06:meMA.Ode3C1H.greekmelody	@ltx/en_us_goadedes/he.h.m1:heHE.StereothitoIKardiaMou.greekname
ltx/en_us_goadedes/me.m12.d06:meMA.Ode3C1H.incipit	@ltx/en_us_goadedes/he.h.m1:heHE.StereothitoIKardiaMou.incipit
ltx/en_us_goadedes/me.m12.d06:meMA.Ode3C1H.melody	@ltx/en_us_goadedes/he.h.m1:heHE.StereothitoIKardiaMou.melody
ltx/en_us_goadedes/me.m12.d06:meMA.Ode3C1H.mode	@ltx/en_us_goadedes/miscellanea:misc.Mode1
ltx/en_us_goadedes/me.m12.d06:meMA.Ode3C1H.ode	@ltx/en_us_goadedes/miscellanea:misc.Ode3
ltx/en_us_goadedes/me.m12.d06:meMA.Ode3C1H.text	@ltx/en_us_goadedes/he.h.m1:heHE.StereothitoIKardiaMou.text
ltx/en_us_goadedes/me.m12.d06:meMA.Ode3C21.greekmelody	@ltx/en_us_goadedes/he.h.m2:heHE.ExinthisenIErimos.greekname
ltx/en_us_goadedes/me.m12.d06:meMA.Ode3C21.incipit	…
ltx/en_us_goadedes/me.m12.d06:meMA.Ode3C21.melody	@ltx/en_us_goadedes/he.h.m2:heHE.ExinthisenIErimos.name
ltx/en_us_goadedes/me.m12.d06:meMA.Ode3C21.mode	@ltx/en_us_goadedes/miscellanea:misc.Mode2
ltx/en_us_goadedes/me.m12.d06:meMA.Ode3C21.ode	@ltx/en_us_goadedes/miscellanea:misc.Ode3
ltx/en_us_goadedes/me.m12.d06:meMA.Ode3C21.text	
ltx/en_us_goadedes/me.m12.d06:meMA.Ode3C22.incipit	…
ltx/en_us_goadedes/me.m12.d06:meMA.Ode3C22.melody	@ltx/en_us_goadedes/he.h.m2:heHE.ExinthisenIErimos.name
ltx/en_us_goadedes/me.m12.d06:meMA.Ode3C22.mode	@ltx/en_us_goadedes/miscellanea:misc.Mode2
ltx/en_us_goadedes/me.m12.d06:meMA.Ode3C22.ode	@ltx/en_us_goadedes/miscellanea:misc.Ode3
ltx/en_us_goadedes/me.m12.d06:meMA.Ode3C22.text	
ltx/en_us_goadedes/me.m12.d06:meMA.Ode3C2T.incipit	…
ltx/en_us_goadedes/me.m12.d06:meMA.Ode3C2T.melody	@ltx/en_us_goadedes/he.h.m2:heHE.ExinthisenIErimos.name
ltx/en_us_goadedes/me.m12.d06:meMA.Ode3C2T.mode	@ltx/en_us_goadedes/miscellanea:misc.Mode2
ltx/en_us_goadedes/me.m12.d06:meMA.Ode3C2T.ode	@ltx/en_us_goadedes/miscellanea:misc.Ode3
ltx/en_us_goadedes/me.m12.d06:meMA.Ode3C2T.text	
ltx/en_us_goadedes/me.m12.d06:meMA.Ode3C31.greekmelody	@ltx/en_us_goadedes/he.h.m1:heHE.ToProTonAionon.greekname
ltx/en_us_goadedes/me.m12.d06:meMA.Ode3C31.incipit	…
ltx/en_us_goadedes/me.m12.d06:meMA.Ode3C31.melody	@ltx/en_us_goadedes/he.h.m1:heHE.ToProTonAionon.name
ltx/en_us_goadedes/me.m12.d06:meMA.Ode3C31.mode	@ltx/en_us_goadedes/miscellanea:misc.Mode1
ltx/en_us_goadedes/me.m12.d06:meMA.Ode3C31.ode	@ltx/en_us_goadedes/miscellanea:misc.Ode3
ltx/en_us_goadedes/me.m12.d06:meMA.Ode3C31.text	
ltx/en_us_goadedes/me.m12.d06:meMA.Ode3C32.incipit	…
ltx/en_us_goadedes/me.m12.d06:meMA.Ode3C32.melody	@ltx/en_us_goadedes/he.h.m1:heHE.ToProTonAionon.name
ltx/en_us_goadedes/me.m12.d06:meMA.Ode3C32.mode	@ltx/en_us_goadedes/miscellanea:misc.Mode1
ltx/en_us_goadedes/me.m12.d06:meMA.Ode3C32.ode	@ltx/en_us_goadedes/miscellanea:misc.Ode3
ltx/en_us_goadedes/me.m12.d06:meMA.Ode3C32.text	
ltx/en_us_goadedes/me.m12.d06:meMA.Ode3C33.incipit	…
ltx/en_us_goadedes/me.m12.d06:meMA.Ode3C33.melody	@ltx/en_us_goadedes/he.h.m1:heHE.ToProTonAionon.name
ltx/en_us_goadedes/me.m12.d06:meMA.Ode3C33.mode	@ltx/en_us_goadedes/miscellanea:misc.Mode1
ltx/en_us_goadedes/me.m12.d06:meMA.Ode3C33.ode	@ltx/en_us_goadedes/miscellanea:misc.Ode3
ltx/en_us_goadedes/me.m12.d06:meMA.Ode3C33.text	
ltx/en_us_goadedes/me.m12.d06:meMA.Ode3C3T.incipit	…
ltx/en_us_goadedes/me.m12.d06:meMA.Ode3C3T.melody	@ltx/en_us_goadedes/he.h.m1:heHE.ToProTonAionon.name
ltx/en_us_goadedes/me.m12.d06:meMA.Ode3C3T.mode	@ltx/en_us_goadedes/miscellanea:misc.Mode1
ltx/en_us_goadedes/me.m12.d06:meMA.Ode3C3T.ode	@ltx/en_us_goadedes/miscellanea:misc.Ode3
ltx/en_us_goadedes/me.m12.d06:meMA.Ode3C3T.text	
ltx/en_us_goadedes/me.m12.d06:meMA.Ode3C3Tr.incipit	…
ltx/en_us_goadedes/me.m12.d06:meMA.Ode3C3Tr.melody	@ltx/en_us_goadedes/he.h.m1:heHE.ToProTonAionon.name
ltx/en_us_goadedes/me.m12.d06:meMA.Ode3C3Tr.mode	@ltx/en_us_goadedes/miscellanea:misc.Mode1
ltx/en_us_goadedes/me.m12.d06:meMA.Ode3C3Tr.ode	@ltx/en_us_goadedes/miscellanea:misc.Ode3
ltx/en_us_goadedes/me.m12.d06:meMA.Ode3C3Tr.text	
ltx/en_us_goadedes/me.m12.d06:meMA.Ode3Kathisma1.greekmelody	@ltx/en_us_goadedes/he.a.m8:heAU.TinSofianKaiLogon.greekname
ltx/en_us_goadedes/me.m12.d06:meMA.Ode3Kathisma1.incipit	…
ltx/en_us_goadedes/me.m12.d06:meMA.Ode3Kathisma1.melody	@ltx/en_us_goadedes/he.a.m8:heAU.TinSofianKaiLogon.name
ltx/en_us_goadedes/me.m12.d06:meMA.Ode3Kathisma1.mode	@ltx/en_us_goadedes/miscellanea:misc.Mode8
ltx/en_us_goadedes/me.m12.d06:meMA.Ode3Kathisma1.text	
ltx/en_us_goadedes/me.m12.d06:meMA.Ode3KathismaT.incipit	@ltx/en_us_goadedes/he.a.m8:heAU.TinSofianKaiLogon.incipit
ltx/en_us_goadedes/me.m12.d06:meMA.Ode3KathismaT.melody	@ltx/en_us_goadedes/he.a.m8:heAU.TinSofianKaiLogon.melody
ltx/en_us_goadedes/me.m12.d06:meMA.Ode3KathismaT.mode	@ltx/en_us_goadedes/miscellanea:misc.Mode8
ltx/en_us_goadedes/me.m12.d06:meMA.Ode3KathismaT.text	@ltx/en_us_goadedes/he.a.m8:heAU.TinSofianKaiLogon.text
ltx/en_us_goadedes/me.m12.d06:meMA.Ode4C11.greekmelody	@ltx/en_us_goadedes/he.h.m1:heHE.EnPnevmatiProvlepon.greekname
ltx/en_us_goadedes/me.m12.d06:meMA.Ode4C11.incipit	…
ltx/en_us_goadedes/me.m12.d06:meMA.Ode4C11.melody	@ltx/en_us_goadedes/he.h.m1:heHE.EnPnevmatiProvlepon.name
ltx/en_us_goadedes/me.m12.d06:meMA.Ode4C11.mode	@ltx/en_us_goadedes/miscellanea:misc.Mode1
ltx/en_us_goadedes/me.m12.d06:meMA.Ode4C11.ode	@ltx/en_us_goadedes/miscellanea:misc.Ode4
ltx/en_us_goadedes/me.m12.d06:meMA.Ode4C11.text	
ltx/en_us_goadedes/me.m12.d06:meMA.Ode4C12.incipit	…
ltx/en_us_goadedes/me.m12.d06:meMA.Ode4C12.melody	@ltx/en_us_goadedes/he.h.m1:heHE.EnPnevmatiProvlepon.name
ltx/en_us_goadedes/me.m12.d06:meMA.Ode4C12.mode	@ltx/en_us_goadedes/miscellanea:misc.Mode1
ltx/en_us_goadedes/me.m12.d06:meMA.Ode4C12.ode	@ltx/en_us_goadedes/miscellanea:misc.Ode4
ltx/en_us_goadedes/me.m12.d06:meMA.Ode4C12.text	
ltx/en_us_goadedes/me.m12.d06:meMA.Ode4C1H.greekmelody	@ltx/en_us_goadedes/he.h.m1:heHE.EnPnevmatiProvlepon.greekname
ltx/en_us_goadedes/me.m12.d06:meMA.Ode4C1H.incipit	@ltx/en_us_goadedes/he.h.m1:heHE.EnPnevmatiProvlepon.incipit
ltx/en_us_goadedes/me.m12.d06:meMA.Ode4C1H.melody	@ltx/en_us_goadedes/he.h.m1:heHE.EnPnevmatiProvlepon.melody
ltx/en_us_goadedes/me.m12.d06:meMA.Ode4C1H.mode	@ltx/en_us_goadedes/miscellanea:misc.Mode1
ltx/en_us_goadedes/me.m12.d06:meMA.Ode4C1H.ode	@ltx/en_us_goadedes/miscellanea:misc.Ode4
ltx/en_us_goadedes/me.m12.d06:meMA.Ode4C1H.text	@ltx/en_us_goadedes/he.h.m1:heHE.EnPnevmatiProvlepon.text
ltx/en_us_goadedes/me.m12.d06:meMA.Ode4C21.greekmelody	@ltx/en_us_goadedes/he.h.m2:heHE.ElilythasEkParthenou.greekname
ltx/en_us_goadedes/me.m12.d06:meMA.Ode4C21.incipit	…
ltx/en_us_goadedes/me.m12.d06:meMA.Ode4C21.melody	@ltx/en_us_goadedes/he.h.m2:heHE.ElilythasEkParthenou.name
ltx/en_us_goadedes/me.m12.d06:meMA.Ode4C21.mode	@ltx/en_us_goadedes/miscellanea:misc.Mode2
ltx/en_us_goadedes/me.m12.d06:meMA.Ode4C21.ode	@ltx/en_us_goadedes/miscellanea:misc.Ode4
ltx/en_us_goadedes/me.m12.d06:meMA.Ode4C21.text	
ltx/en_us_goadedes/me.m12.d06:meMA.Ode4C22.incipit	…
ltx/en_us_goadedes/me.m12.d06:meMA.Ode4C22.melody	@ltx/en_us_goadedes/he.h.m2:heHE.ElilythasEkParthenou.name
ltx/en_us_goadedes/me.m12.d06:meMA.Ode4C22.mode	@ltx/en_us_goadedes/miscellanea:misc.Mode2
ltx/en_us_goadedes/me.m12.d06:meMA.Ode4C22.ode	@ltx/en_us_goadedes/miscellanea:misc.Ode4
ltx/en_us_goadedes/me.m12.d06:meMA.Ode4C22.text	
ltx/en_us_goadedes/me.m12.d06:meMA.Ode4C23.incipit	…
ltx/en_us_goadedes/me.m12.d06:meMA.Ode4C23.melody	@ltx/en_us_goadedes/he.h.m2:heHE.ElilythasEkParthenou.name
ltx/en_us_goadedes/me.m12.d06:meMA.Ode4C23.mode	@ltx/en_us_goadedes/miscellanea:misc.Mode2
ltx/en_us_goadedes/me.m12.d06:meMA.Ode4C23.ode	@ltx/en_us_goadedes/miscellanea:misc.Ode4
ltx/en_us_goadedes/me.m12.d06:meMA.Ode4C23.text	
ltx/en_us_goadedes/me.m12.d06:meMA.Ode4C2T.incipit	…
ltx/en_us_goadedes/me.m12.d06:meMA.Ode4C2T.melody	@ltx/en_us_goadedes/he.h.m2:heHE.ElilythasEkParthenou.name
ltx/en_us_goadedes/me.m12.d06:meMA.Ode4C2T.mode	@ltx/en_us_goadedes/miscellanea:misc.Mode2
ltx/en_us_goadedes/me.m12.d06:meMA.Ode4C2T.ode	@ltx/en_us_goadedes/miscellanea:misc.Ode4
ltx/en_us_goadedes/me.m12.d06:meMA.Ode4C2T.text	
ltx/en_us_goadedes/me.m12.d06:meMA.Ode4C31.greekmelody	@ltx/en_us_goadedes/he.h.m1:heHE.RavdosEkTisRizis.greekname
ltx/en_us_goadedes/me.m12.d06:meMA.Ode4C31.incipit	…
ltx/en_us_goadedes/me.m12.d06:meMA.Ode4C31.melody	@ltx/en_us_goadedes/he.h.m1:heHE.RavdosEkTisRizis.name
ltx/en_us_goadedes/me.m12.d06:meMA.Ode4C31.mode	@ltx/en_us_goadedes/miscellanea:misc.Mode1
ltx/en_us_goadedes/me.m12.d06:meMA.Ode4C31.ode	@ltx/en_us_goadedes/miscellanea:misc.Ode4
ltx/en_us_goadedes/me.m12.d06:meMA.Ode4C31.text	
ltx/en_us_goadedes/me.m12.d06:meMA.Ode4C32.incipit	…
ltx/en_us_goadedes/me.m12.d06:meMA.Ode4C32.melody	@ltx/en_us_goadedes/he.h.m1:heHE.RavdosEkTisRizis.name
ltx/en_us_goadedes/me.m12.d06:meMA.Ode4C32.mode	@ltx/en_us_goadedes/miscellanea:misc.Mode1
ltx/en_us_goadedes/me.m12.d06:meMA.Ode4C32.ode	@ltx/en_us_goadedes/miscellanea:misc.Ode4
ltx/en_us_goadedes/me.m12.d06:meMA.Ode4C32.text	
ltx/en_us_goadedes/me.m12.d06:meMA.Ode4C33.incipit	…
ltx/en_us_goadedes/me.m12.d06:meMA.Ode4C33.melody	@ltx/en_us_goadedes/he.h.m1:heHE.RavdosEkTisRizis.name
ltx/en_us_goadedes/me.m12.d06:meMA.Ode4C33.mode	@ltx/en_us_goadedes/miscellanea:misc.Mode1
ltx/en_us_goadedes/me.m12.d06:meMA.Ode4C33.ode	@ltx/en_us_goadedes/miscellanea:misc.Ode4
ltx/en_us_goadedes/me.m12.d06:meMA.Ode4C33.text	
ltx/en_us_goadedes/me.m12.d06:meMA.Ode4C3T.incipit	…
ltx/en_us_goadedes/me.m12.d06:meMA.Ode4C3T.melody	@ltx/en_us_goadedes/he.h.m1:heHE.RavdosEkTisRizis.name
ltx/en_us_goadedes/me.m12.d06:meMA.Ode4C3T.mode	@ltx/en_us_goadedes/miscellanea:misc.Mode1
ltx/en_us_goadedes/me.m12.d06:meMA.Ode4C3T.ode	@ltx/en_us_goadedes/miscellanea:misc.Ode4
ltx/en_us_goadedes/me.m12.d06:meMA.Ode4C3T.text	
ltx/en_us_goadedes/me.m12.d06:meMA.Ode4C3Tr.incipit	…
ltx/en_us_goadedes/me.m12.d06:meMA.Ode4C3Tr.melody	@ltx/en_us_goadedes/he.h.m1:heHE.RavdosEkTisRizis.name
ltx/en_us_goadedes/me.m12.d06:meMA.Ode4C3Tr.mode	@ltx/en_us_goadedes/miscellanea:misc.Mode1
ltx/en_us_goadedes/me.m12.d06:meMA.Ode4C3Tr.ode	@ltx/en_us_goadedes/miscellanea:misc.Ode4
ltx/en_us_goadedes/me.m12.d06:meMA.Ode4C3Tr.text	
ltx/en_us_goadedes/me.m12.d06:meMA.Ode5C11.greekmelody	@ltx/en_us_goadedes/he.h.m1:heHE.ToFaeinonIminExanateilon.greekname
ltx/en_us_goadedes/me.m12.d06:meMA.Ode5C11.incipit	…
ltx/en_us_goadedes/me.m12.d06:meMA.Ode5C11.melody	@ltx/en_us_goadedes/he.h.m1:heHE.ToFaeinonIminExanateilon.name
ltx/en_us_goadedes/me.m12.d06:meMA.Ode5C11.mode	@ltx/en_us_goadedes/miscellanea:misc.Mode1
ltx/en_us_goadedes/me.m12.d06:meMA.Ode5C11.ode	@ltx/en_us_goadedes/miscellanea:misc.Ode5
ltx/en_us_goadedes/me.m12.d06:meMA.Ode5C11.text	
ltx/en_us_goadedes/me.m12.d06:meMA.Ode5C12.incipit	…
ltx/en_us_goadedes/me.m12.d06:meMA.Ode5C12.melody	@ltx/en_us_goadedes/he.h.m1:heHE.ToFaeinonIminExanateilon.name
ltx/en_us_goadedes/me.m12.d06:meMA.Ode5C12.mode	@ltx/en_us_goadedes/miscellanea:misc.Mode1
ltx/en_us_goadedes/me.m12.d06:meMA.Ode5C12.ode	@ltx/en_us_goadedes/miscellanea:misc.Ode5
ltx/en_us_goadedes/me.m12.d06:meMA.Ode5C12.text	
ltx/en_us_goadedes/me.m12.d06:meMA.Ode5C1H.greekmelody	@ltx/en_us_goadedes/he.h.m1:heHE.ToFaeinonIminExanateilon.greekname
ltx/en_us_goadedes/me.m12.d06:meMA.Ode5C1H.incipit	@ltx/en_us_goadedes/he.h.m1:heHE.ToFaeinonIminExanateilon.incipit
ltx/en_us_goadedes/me.m12.d06:meMA.Ode5C1H.melody	@ltx/en_us_goadedes/he.h.m1:heHE.ToFaeinonIminExanateilon.melody
ltx/en_us_goadedes/me.m12.d06:meMA.Ode5C1H.mode	@ltx/en_us_goadedes/miscellanea:misc.Mode1
ltx/en_us_goadedes/me.m12.d06:meMA.Ode5C1H.ode	@ltx/en_us_goadedes/miscellanea:misc.Ode5
ltx/en_us_goadedes/me.m12.d06:meMA.Ode5C1H.text	@ltx/en_us_goadedes/he.h.m1:heHE.ToFaeinonIminExanateilon.text
ltx/en_us_goadedes/me.m12.d06:meMA.Ode5C21.greekmelody	@ltx/en_us_goadedes/he.h.m2:heHE.OFotismos.greekname
ltx/en_us_goadedes/me.m12.d06:meMA.Ode5C21.incipit	…
ltx/en_us_goadedes/me.m12.d06:meMA.Ode5C21.melody	@ltx/en_us_goadedes/he.h.m2:heHE.OFotismos.name
ltx/en_us_goadedes/me.m12.d06:meMA.Ode5C21.mode	@ltx/en_us_goadedes/miscellanea:misc.Mode2
ltx/en_us_goadedes/me.m12.d06:meMA.Ode5C21.ode	@ltx/en_us_goadedes/miscellanea:misc.Ode5
ltx/en_us_goadedes/me.m12.d06:meMA.Ode5C21.text	
ltx/en_us_goadedes/me.m12.d06:meMA.Ode5C22.incipit	…
ltx/en_us_goadedes/me.m12.d06:meMA.Ode5C22.melody	@ltx/en_us_goadedes/he.h.m2:heHE.OFotismos.name
ltx/en_us_goadedes/me.m12.d06:meMA.Ode5C22.mode	@ltx/en_us_goadedes/miscellanea:misc.Mode2
ltx/en_us_goadedes/me.m12.d06:meMA.Ode5C22.ode	@ltx/en_us_goadedes/miscellanea:misc.Ode5
ltx/en_us_goadedes/me.m12.d06:meMA.Ode5C22.text	
ltx/en_us_goadedes/me.m12.d06:meMA.Ode5C2T.incipit	…
ltx/en_us_goadedes/me.m12.d06:meMA.Ode5C2T.melody	@ltx/en_us_goadedes/he.h.m2:heHE.OFotismos.name
ltx/en_us_goadedes/me.m12.d06:meMA.Ode5C2T.mode	@ltx/en_us_goadedes/miscellanea:misc.Mode2
ltx/en_us_goadedes/me.m12.d06:meMA.Ode5C2T.ode	@ltx/en_us_goadedes/miscellanea:misc.Ode5
ltx/en_us_goadedes/me.m12.d06:meMA.Ode5C2T.text	
ltx/en_us_goadedes/me.m12.d06:meMA.Ode5C31.greekmelody	@ltx/en_us_goadedes/he.h.m1:heHE.TheosOnEirinis.greekname
ltx/en_us_goadedes/me.m12.d06:meMA.Ode5C31.incipit	…
ltx/en_us_goadedes/me.m12.d06:meMA.Ode5C31.melody	@ltx/en_us_goadedes/he.h.m1:heHE.TheosOnEirinis.name
ltx/en_us_goadedes/me.m12.d06:meMA.Ode5C31.mode	@ltx/en_us_goadedes/miscellanea:misc.Mode1
ltx/en_us_goadedes/me.m12.d06:meMA.Ode5C31.ode	@ltx/en_us_goadedes/miscellanea:misc.Ode5
ltx/en_us_goadedes/me.m12.d06:meMA.Ode5C31.text	
ltx/en_us_goadedes/me.m12.d06:meMA.Ode5C32.incipit	…
ltx/en_us_goadedes/me.m12.d06:meMA.Ode5C32.melody	@ltx/en_us_goadedes/he.h.m1:heHE.TheosOnEirinis.name
ltx/en_us_goadedes/me.m12.d06:meMA.Ode5C32.mode	@ltx/en_us_goadedes/miscellanea:misc.Mode1
ltx/en_us_goadedes/me.m12.d06:meMA.Ode5C32.ode	@ltx/en_us_goadedes/miscellanea:misc.Ode5
ltx/en_us_goadedes/me.m12.d06:meMA.Ode5C32.text	
ltx/en_us_goadedes/me.m12.d06:meMA.Ode5C33.incipit	…
ltx/en_us_goadedes/me.m12.d06:meMA.Ode5C33.melody	@ltx/en_us_goadedes/he.h.m1:heHE.TheosOnEirinis.name
ltx/en_us_goadedes/me.m12.d06:meMA.Ode5C33.mode	@ltx/en_us_goadedes/miscellanea:misc.Mode1
ltx/en_us_goadedes/me.m12.d06:meMA.Ode5C33.ode	@ltx/en_us_goadedes/miscellanea:misc.Ode5
ltx/en_us_goadedes/me.m12.d06:meMA.Ode5C33.text	
ltx/en_us_goadedes/me.m12.d06:meMA.Ode5C3T.incipit	…
ltx/en_us_goadedes/me.m12.d06:meMA.Ode5C3T.melody	@ltx/en_us_goadedes/he.h.m1:heHE.TheosOnEirinis.name
ltx/en_us_goadedes/me.m12.d06:meMA.Ode5C3T.mode	@ltx/en_us_goadedes/miscellanea:misc.Mode1
ltx/en_us_goadedes/me.m12.d06:meMA.Ode5C3T.ode	@ltx/en_us_goadedes/miscellanea:misc.Ode5
ltx/en_us_goadedes/me.m12.d06:meMA.Ode5C3T.text	
ltx/en_us_goadedes/me.m12.d06:meMA.Ode5C3Tr.incipit	…
ltx/en_us_goadedes/me.m12.d06:meMA.Ode5C3Tr.melody	@ltx/en_us_goadedes/he.h.m1:heHE.TheosOnEirinis.name
ltx/en_us_goadedes/me.m12.d06:meMA.Ode5C3Tr.mode	@ltx/en_us_goadedes/miscellanea:misc.Mode1
ltx/en_us_goadedes/me.m12.d06:meMA.Ode5C3Tr.ode	@ltx/en_us_goadedes/miscellanea:misc.Ode5
ltx/en_us_goadedes/me.m12.d06:meMA.Ode5C3Tr.text	
ltx/en_us_goadedes/me.m12.d06:meMA.Ode6C11.greekmelody	@ltx/en_us_goadedes/he.h.m1:heHE.TonProfitinIonan.greekname
ltx/en_us_goadedes/me.m12.d06:meMA.Ode6C11.incipit	…
ltx/en_us_goadedes/me.m12.d06:meMA.Ode6C11.melody	@ltx/en_us_goadedes/he.h.m1:heHE.TonProfitinIonan.name
ltx/en_us_goadedes/me.m12.d06:meMA.Ode6C11.mode	@ltx/en_us_goadedes/miscellanea:misc.Mode1
ltx/en_us_goadedes/me.m12.d06:meMA.Ode6C11.ode	@ltx/en_us_goadedes/miscellanea:misc.Ode6
ltx/en_us_goadedes/me.m12.d06:meMA.Ode6C11.text	
ltx/en_us_goadedes/me.m12.d06:meMA.Ode6C12.incipit	…
ltx/en_us_goadedes/me.m12.d06:meMA.Ode6C12.melody	@ltx/en_us_goadedes/he.h.m1:heHE.TonProfitinIonan.name
ltx/en_us_goadedes/me.m12.d06:meMA.Ode6C12.mode	@ltx/en_us_goadedes/miscellanea:misc.Mode1
ltx/en_us_goadedes/me.m12.d06:meMA.Ode6C12.ode	@ltx/en_us_goadedes/miscellanea:misc.Ode6
ltx/en_us_goadedes/me.m12.d06:meMA.Ode6C12.text	
ltx/en_us_goadedes/me.m12.d06:meMA.Ode6C1H.greekmelody	@ltx/en_us_goadedes/he.h.m1:heHE.TonProfitinIonan.greekname
ltx/en_us_goadedes/me.m12.d06:meMA.Ode6C1H.incipit	@ltx/en_us_goadedes/he.h.m1:heHE.TonProfitinIonan.incipit
ltx/en_us_goadedes/me.m12.d06:meMA.Ode6C1H.melody	@ltx/en_us_goadedes/he.h.m1:heHE.TonProfitinIonan.melody
ltx/en_us_goadedes/me.m12.d06:meMA.Ode6C1H.mode	@ltx/en_us_goadedes/miscellanea:misc.Mode1
ltx/en_us_goadedes/me.m12.d06:meMA.Ode6C1H.ode	@ltx/en_us_goadedes/miscellanea:misc.Ode6
ltx/en_us_goadedes/me.m12.d06:meMA.Ode6C1H.text	@ltx/en_us_goadedes/he.h.m1:heHE.TonProfitinIonan.text
ltx/en_us_goadedes/me.m12.d06:meMA.Ode6C21.greekmelody	@ltx/en_us_goadedes/he.h.m2:heHE.EnAvyssoPtaismaton.greekname
ltx/en_us_goadedes/me.m12.d06:meMA.Ode6C21.incipit	…
ltx/en_us_goadedes/me.m12.d06:meMA.Ode6C21.melody	@ltx/en_us_goadedes/he.h.m2:heHE.EnAvyssoPtaismaton.name
ltx/en_us_goadedes/me.m12.d06:meMA.Ode6C21.mode	@ltx/en_us_goadedes/miscellanea:misc.Mode2
ltx/en_us_goadedes/me.m12.d06:meMA.Ode6C21.ode	@ltx/en_us_goadedes/miscellanea:misc.Ode6
ltx/en_us_goadedes/me.m12.d06:meMA.Ode6C21.text	
ltx/en_us_goadedes/me.m12.d06:meMA.Ode6C22.incipit	…
ltx/en_us_goadedes/me.m12.d06:meMA.Ode6C22.melody	@ltx/en_us_goadedes/he.h.m2:heHE.EnAvyssoPtaismaton.name
ltx/en_us_goadedes/me.m12.d06:meMA.Ode6C22.mode	@ltx/en_us_goadedes/miscellanea:misc.Mode2
ltx/en_us_goadedes/me.m12.d06:meMA.Ode6C22.ode	@ltx/en_us_goadedes/miscellanea:misc.Ode6
ltx/en_us_goadedes/me.m12.d06:meMA.Ode6C22.text	
ltx/en_us_goadedes/me.m12.d06:meMA.Ode6C2T.incipit	…
ltx/en_us_goadedes/me.m12.d06:meMA.Ode6C2T.melody	@ltx/en_us_goadedes/he.h.m2:heHE.EnAvyssoPtaismaton.name
ltx/en_us_goadedes/me.m12.d06:meMA.Ode6C2T.mode	@ltx/en_us_goadedes/miscellanea:misc.Mode2
ltx/en_us_goadedes/me.m12.d06:meMA.Ode6C2T.ode	@ltx/en_us_goadedes/miscellanea:misc.Ode6
ltx/en_us_goadedes/me.m12.d06:meMA.Ode6C2T.text	
ltx/en_us_goadedes/me.m12.d06:meMA.Ode6C31.greekmelody	@ltx/en_us_goadedes/he.h.m1:heHE.SplanchnonIonan.greekname
ltx/en_us_goadedes/me.m12.d06:meMA.Ode6C31.incipit	…
ltx/en_us_goadedes/me.m12.d06:meMA.Ode6C31.melody	@ltx/en_us_goadedes/he.h.m1:heHE.SplanchnonIonan.name
ltx/en_us_goadedes/me.m12.d06:meMA.Ode6C31.mode	@ltx/en_us_goadedes/miscellanea:misc.Mode1
ltx/en_us_goadedes/me.m12.d06:meMA.Ode6C31.ode	@ltx/en_us_goadedes/miscellanea:misc.Ode6
ltx/en_us_goadedes/me.m12.d06:meMA.Ode6C31.text	
ltx/en_us_goadedes/me.m12.d06:meMA.Ode6C32.incipit	…
ltx/en_us_goadedes/me.m12.d06:meMA.Ode6C32.melody	@ltx/en_us_goadedes/he.h.m1:heHE.SplanchnonIonan.name
ltx/en_us_goadedes/me.m12.d06:meMA.Ode6C32.mode	@ltx/en_us_goadedes/miscellanea:misc.Mode1
ltx/en_us_goadedes/me.m12.d06:meMA.Ode6C32.ode	@ltx/en_us_goadedes/miscellanea:misc.Ode6
ltx/en_us_goadedes/me.m12.d06:meMA.Ode6C32.text	
ltx/en_us_goadedes/me.m12.d06:meMA.Ode6C33.incipit	…
ltx/en_us_goadedes/me.m12.d06:meMA.Ode6C33.melody	@ltx/en_us_goadedes/he.h.m1:heHE.SplanchnonIonan.name
ltx/en_us_goadedes/me.m12.d06:meMA.Ode6C33.mode	@ltx/en_us_goadedes/miscellanea:misc.Mode1
ltx/en_us_goadedes/me.m12.d06:meMA.Ode6C33.ode	@ltx/en_us_goadedes/miscellanea:misc.Ode6
ltx/en_us_goadedes/me.m12.d06:meMA.Ode6C33.text	
ltx/en_us_goadedes/me.m12.d06:meMA.Ode6C3T.incipit	…
ltx/en_us_goadedes/me.m12.d06:meMA.Ode6C3T.melody	@ltx/en_us_goadedes/he.h.m1:heHE.SplanchnonIonan.name
ltx/en_us_goadedes/me.m12.d06:meMA.Ode6C3T.mode	@ltx/en_us_goadedes/miscellanea:misc.Mode1
ltx/en_us_goadedes/me.m12.d06:meMA.Ode6C3T.ode	@ltx/en_us_goadedes/miscellanea:misc.Ode6
ltx/en_us_goadedes/me.m12.d06:meMA.Ode6C3T.text	
ltx/en_us_goadedes/me.m12.d06:meMA.Ode6C3Tr.incipit	…
ltx/en_us_goadedes/me.m12.d06:meMA.Ode6C3Tr.melody	@ltx/en_us_goadedes/he.h.m1:heHE.SplanchnonIonan.name
ltx/en_us_goadedes/me.m12.d06:meMA.Ode6C3Tr.mode	@ltx/en_us_goadedes/miscellanea:misc.Mode1
ltx/en_us_goadedes/me.m12.d06:meMA.Ode6C3Tr.ode	@ltx/en_us_goadedes/miscellanea:misc.Ode6
ltx/en_us_goadedes/me.m12.d06:meMA.Ode6C3Tr.text	
ltx/en_us_goadedes/me.m12.d06:meMA.Ode7C11.greekmelody	@ltx/en_us_goadedes/he.h.m1:heHE.IKaminosSotirEdrosizeto.greekname
ltx/en_us_goadedes/me.m12.d06:meMA.Ode7C11.incipit	…
ltx/en_us_goadedes/me.m12.d06:meMA.Ode7C11.melody	@ltx/en_us_goadedes/he.h.m1:heHE.IKaminosSotirEdrosizeto.name
ltx/en_us_goadedes/me.m12.d06:meMA.Ode7C11.mode	@ltx/en_us_goadedes/miscellanea:misc.Mode1
ltx/en_us_goadedes/me.m12.d06:meMA.Ode7C11.ode	@ltx/en_us_goadedes/miscellanea:misc.Ode7
ltx/en_us_goadedes/me.m12.d06:meMA.Ode7C11.text	
ltx/en_us_goadedes/me.m12.d06:meMA.Ode7C12.incipit	…
ltx/en_us_goadedes/me.m12.d06:meMA.Ode7C12.melody	@ltx/en_us_goadedes/he.h.m1:heHE.IKaminosSotirEdrosizeto.name
ltx/en_us_goadedes/me.m12.d06:meMA.Ode7C12.mode	@ltx/en_us_goadedes/miscellanea:misc.Mode1
ltx/en_us_goadedes/me.m12.d06:meMA.Ode7C12.ode	@ltx/en_us_goadedes/miscellanea:misc.Ode7
ltx/en_us_goadedes/me.m12.d06:meMA.Ode7C12.text	
ltx/en_us_goadedes/me.m12.d06:meMA.Ode7C1H.greekmelody	@ltx/en_us_goadedes/he.h.m1:heHE.IKaminosSotirEdrosizeto.greekname
ltx/en_us_goadedes/me.m12.d06:meMA.Ode7C1H.incipit	@ltx/en_us_goadedes/he.h.m1:heHE.IKaminosSotirEdrosizeto.incipit
ltx/en_us_goadedes/me.m12.d06:meMA.Ode7C1H.melody	@ltx/en_us_goadedes/he.h.m1:heHE.IKaminosSotirEdrosizeto.melody
ltx/en_us_goadedes/me.m12.d06:meMA.Ode7C1H.mode	@ltx/en_us_goadedes/miscellanea:misc.Mode1
ltx/en_us_goadedes/me.m12.d06:meMA.Ode7C1H.ode	@ltx/en_us_goadedes/miscellanea:misc.Ode7
ltx/en_us_goadedes/me.m12.d06:meMA.Ode7C1H.text	@ltx/en_us_goadedes/he.h.m1:heHE.IKaminosSotirEdrosizeto.text
ltx/en_us_goadedes/me.m12.d06:meMA.Ode7C21.greekmelody	@ltx/en_us_goadedes/he.h.m2:heHE.EikonosChrysis.greekname
ltx/en_us_goadedes/me.m12.d06:meMA.Ode7C21.incipit	…
ltx/en_us_goadedes/me.m12.d06:meMA.Ode7C21.melody	@ltx/en_us_goadedes/he.h.m2:heHE.EikonosChrysis.name
ltx/en_us_goadedes/me.m12.d06:meMA.Ode7C21.mode	@ltx/en_us_goadedes/miscellanea:misc.Mode2
ltx/en_us_goadedes/me.m12.d06:meMA.Ode7C21.ode	@ltx/en_us_goadedes/miscellanea:misc.Ode7
ltx/en_us_goadedes/me.m12.d06:meMA.Ode7C21.text	
ltx/en_us_goadedes/me.m12.d06:meMA.Ode7C22.incipit	…
ltx/en_us_goadedes/me.m12.d06:meMA.Ode7C22.melody	@ltx/en_us_goadedes/he.h.m2:heHE.EikonosChrysis.name
ltx/en_us_goadedes/me.m12.d06:meMA.Ode7C22.mode	@ltx/en_us_goadedes/miscellanea:misc.Mode2
ltx/en_us_goadedes/me.m12.d06:meMA.Ode7C22.ode	@ltx/en_us_goadedes/miscellanea:misc.Ode7
ltx/en_us_goadedes/me.m12.d06:meMA.Ode7C22.text	
ltx/en_us_goadedes/me.m12.d06:meMA.Ode7C2T.incipit	…
ltx/en_us_goadedes/me.m12.d06:meMA.Ode7C2T.melody	@ltx/en_us_goadedes/he.h.m2:heHE.EikonosChrysis.name
ltx/en_us_goadedes/me.m12.d06:meMA.Ode7C2T.mode	@ltx/en_us_goadedes/miscellanea:misc.Mode2
ltx/en_us_goadedes/me.m12.d06:meMA.Ode7C2T.ode	@ltx/en_us_goadedes/miscellanea:misc.Ode7
ltx/en_us_goadedes/me.m12.d06:meMA.Ode7C2T.text	
ltx/en_us_goadedes/me.m12.d06:meMA.Ode7C31.greekmelody	@ltx/en_us_goadedes/he.h.m1:heHE.OiPaidesEfseveia.greekname
ltx/en_us_goadedes/me.m12.d06:meMA.Ode7C31.incipit	…
ltx/en_us_goadedes/me.m12.d06:meMA.Ode7C31.melody	@ltx/en_us_goadedes/he.h.m1:heHE.OiPaidesEfseveia.name
ltx/en_us_goadedes/me.m12.d06:meMA.Ode7C31.mode	@ltx/en_us_goadedes/miscellanea:misc.Mode1
ltx/en_us_goadedes/me.m12.d06:meMA.Ode7C31.ode	@ltx/en_us_goadedes/miscellanea:misc.Ode7
ltx/en_us_goadedes/me.m12.d06:meMA.Ode7C31.text	
ltx/en_us_goadedes/me.m12.d06:meMA.Ode7C32.incipit	…
ltx/en_us_goadedes/me.m12.d06:meMA.Ode7C32.melody	@ltx/en_us_goadedes/he.h.m1:heHE.OiPaidesEfseveia.name
ltx/en_us_goadedes/me.m12.d06:meMA.Ode7C32.mode	@ltx/en_us_goadedes/miscellanea:misc.Mode1
ltx/en_us_goadedes/me.m12.d06:meMA.Ode7C32.ode	@ltx/en_us_goadedes/miscellanea:misc.Ode7
ltx/en_us_goadedes/me.m12.d06:meMA.Ode7C32.text	
ltx/en_us_goadedes/me.m12.d06:meMA.Ode7C33.incipit	…
ltx/en_us_goadedes/me.m12.d06:meMA.Ode7C33.melody	@ltx/en_us_goadedes/he.h.m1:heHE.OiPaidesEfseveia.name
ltx/en_us_goadedes/me.m12.d06:meMA.Ode7C33.mode	@ltx/en_us_goadedes/miscellanea:misc.Mode1
ltx/en_us_goadedes/me.m12.d06:meMA.Ode7C33.ode	@ltx/en_us_goadedes/miscellanea:misc.Ode7
ltx/en_us_goadedes/me.m12.d06:meMA.Ode7C33.text	
ltx/en_us_goadedes/me.m12.d06:meMA.Ode7C3T.incipit	…
ltx/en_us_goadedes/me.m12.d06:meMA.Ode7C3T.melody	@ltx/en_us_goadedes/he.h.m1:heHE.OiPaidesEfseveia.name
ltx/en_us_goadedes/me.m12.d06:meMA.Ode7C3T.mode	@ltx/en_us_goadedes/miscellanea:misc.Mode1
ltx/en_us_goadedes/me.m12.d06:meMA.Ode7C3T.ode	@ltx/en_us_goadedes/miscellanea:misc.Ode7
ltx/en_us_goadedes/me.m12.d06:meMA.Ode7C3T.text	
ltx/en_us_goadedes/me.m12.d06:meMA.Ode7C3Tr.incipit	…
ltx/en_us_goadedes/me.m12.d06:meMA.Ode7C3Tr.melody	@ltx/en_us_goadedes/he.h.m1:heHE.OiPaidesEfseveia.name
ltx/en_us_goadedes/me.m12.d06:meMA.Ode7C3Tr.mode	@ltx/en_us_goadedes/miscellanea:misc.Mode1
ltx/en_us_goadedes/me.m12.d06:meMA.Ode7C3Tr.ode	@ltx/en_us_goadedes/miscellanea:misc.Ode7
ltx/en_us_goadedes/me.m12.d06:meMA.Ode7C3Tr.text	
ltx/en_us_goadedes/me.m12.d06:meMA.Ode8C11.greekmelody	@ltx/en_us_goadedes/he.h.m1:heHE.OnFrittousinAngeloi.greekname
ltx/en_us_goadedes/me.m12.d06:meMA.Ode8C11.incipit	…
ltx/en_us_goadedes/me.m12.d06:meMA.Ode8C11.melody	@ltx/en_us_goadedes/he.h.m1:heHE.OnFrittousinAngeloi.name
ltx/en_us_goadedes/me.m12.d06:meMA.Ode8C11.mode	@ltx/en_us_goadedes/miscellanea:misc.Mode1
ltx/en_us_goadedes/me.m12.d06:meMA.Ode8C11.ode	@ltx/en_us_goadedes/miscellanea:misc.Ode8
ltx/en_us_goadedes/me.m12.d06:meMA.Ode8C11.text	
ltx/en_us_goadedes/me.m12.d06:meMA.Ode8C12.incipit	…
ltx/en_us_goadedes/me.m12.d06:meMA.Ode8C12.melody	@ltx/en_us_goadedes/he.h.m1:heHE.OnFrittousinAngeloi.name
ltx/en_us_goadedes/me.m12.d06:meMA.Ode8C12.mode	@ltx/en_us_goadedes/miscellanea:misc.Mode1
ltx/en_us_goadedes/me.m12.d06:meMA.Ode8C12.ode	@ltx/en_us_goadedes/miscellanea:misc.Ode8
ltx/en_us_goadedes/me.m12.d06:meMA.Ode8C12.text	
ltx/en_us_goadedes/me.m12.d06:meMA.Ode8C1H.greekmelody	@ltx/en_us_goadedes/he.h.m1:heHE.OnFrittousinAngeloi.greekname
ltx/en_us_goadedes/me.m12.d06:meMA.Ode8C1H.incipit	@ltx/en_us_goadedes/he.h.m1:heHE.OnFrittousinAngeloi.incipit
ltx/en_us_goadedes/me.m12.d06:meMA.Ode8C1H.melody	@ltx/en_us_goadedes/he.h.m1:heHE.OnFrittousinAngeloi.melody
ltx/en_us_goadedes/me.m12.d06:meMA.Ode8C1H.mode	@ltx/en_us_goadedes/miscellanea:misc.Mode1
ltx/en_us_goadedes/me.m12.d06:meMA.Ode8C1H.ode	@ltx/en_us_goadedes/miscellanea:misc.Ode8
ltx/en_us_goadedes/me.m12.d06:meMA.Ode8C1H.text	@ltx/en_us_goadedes/he.h.m1:heHE.OnFrittousinAngeloi.text
ltx/en_us_goadedes/me.m12.d06:meMA.Ode8C21.greekmelody	@ltx/en_us_goadedes/he.h.m2:heHE.TonEnKaminoTouPyros.greekname
ltx/en_us_goadedes/me.m12.d06:meMA.Ode8C21.incipit	…
ltx/en_us_goadedes/me.m12.d06:meMA.Ode8C21.melody	@ltx/en_us_goadedes/he.h.m2:heHE.TonEnKaminoTouPyros.name
ltx/en_us_goadedes/me.m12.d06:meMA.Ode8C21.mode	@ltx/en_us_goadedes/miscellanea:misc.Mode2
ltx/en_us_goadedes/me.m12.d06:meMA.Ode8C21.ode	@ltx/en_us_goadedes/miscellanea:misc.Ode8
ltx/en_us_goadedes/me.m12.d06:meMA.Ode8C21.text	
ltx/en_us_goadedes/me.m12.d06:meMA.Ode8C22.incipit	…
ltx/en_us_goadedes/me.m12.d06:meMA.Ode8C22.melody	@ltx/en_us_goadedes/he.h.m2:heHE.TonEnKaminoTouPyros.name
ltx/en_us_goadedes/me.m12.d06:meMA.Ode8C22.mode	@ltx/en_us_goadedes/miscellanea:misc.Mode2
ltx/en_us_goadedes/me.m12.d06:meMA.Ode8C22.ode	@ltx/en_us_goadedes/miscellanea:misc.Ode8
ltx/en_us_goadedes/me.m12.d06:meMA.Ode8C22.text	
ltx/en_us_goadedes/me.m12.d06:meMA.Ode8C2T.incipit	…
ltx/en_us_goadedes/me.m12.d06:meMA.Ode8C2T.melody	@ltx/en_us_goadedes/he.h.m2:heHE.TonEnKaminoTouPyros.name
ltx/en_us_goadedes/me.m12.d06:meMA.Ode8C2T.mode	@ltx/en_us_goadedes/miscellanea:misc.Mode2
ltx/en_us_goadedes/me.m12.d06:meMA.Ode8C2T.ode	@ltx/en_us_goadedes/miscellanea:misc.Ode8
ltx/en_us_goadedes/me.m12.d06:meMA.Ode8C2T.text	
ltx/en_us_goadedes/me.m12.d06:meMA.Ode8C31.greekmelody	@ltx/en_us_goadedes/he.h.m1:heHE.ThavmatosYperfyous.greekname
ltx/en_us_goadedes/me.m12.d06:meMA.Ode8C31.incipit	…
ltx/en_us_goadedes/me.m12.d06:meMA.Ode8C31.melody	@ltx/en_us_goadedes/he.h.m1:heHE.ThavmatosYperfyous.name
ltx/en_us_goadedes/me.m12.d06:meMA.Ode8C31.mode	@ltx/en_us_goadedes/miscellanea:misc.Mode1
ltx/en_us_goadedes/me.m12.d06:meMA.Ode8C31.ode	@ltx/en_us_goadedes/miscellanea:misc.Ode8
ltx/en_us_goadedes/me.m12.d06:meMA.Ode8C31.text	
ltx/en_us_goadedes/me.m12.d06:meMA.Ode8C32.incipit	…
ltx/en_us_goadedes/me.m12.d06:meMA.Ode8C32.melody	@ltx/en_us_goadedes/he.h.m1:heHE.ThavmatosYperfyous.name
ltx/en_us_goadedes/me.m12.d06:meMA.Ode8C32.mode	@ltx/en_us_goadedes/miscellanea:misc.Mode1
ltx/en_us_goadedes/me.m12.d06:meMA.Ode8C32.ode	@ltx/en_us_goadedes/miscellanea:misc.Ode8
ltx/en_us_goadedes/me.m12.d06:meMA.Ode8C32.text	
ltx/en_us_goadedes/me.m12.d06:meMA.Ode8C33.incipit	…
ltx/en_us_goadedes/me.m12.d06:meMA.Ode8C33.melody	@ltx/en_us_goadedes/he.h.m1:heHE.ThavmatosYperfyous.name
ltx/en_us_goadedes/me.m12.d06:meMA.Ode8C33.mode	@ltx/en_us_goadedes/miscellanea:misc.Mode1
ltx/en_us_goadedes/me.m12.d06:meMA.Ode8C33.ode	@ltx/en_us_goadedes/miscellanea:misc.Ode8
ltx/en_us_goadedes/me.m12.d06:meMA.Ode8C33.text	
ltx/en_us_goadedes/me.m12.d06:meMA.Ode8C3T.incipit	…
ltx/en_us_goadedes/me.m12.d06:meMA.Ode8C3T.melody	@ltx/en_us_goadedes/he.h.m1:heHE.ThavmatosYperfyous.name
ltx/en_us_goadedes/me.m12.d06:meMA.Ode8C3T.mode	@ltx/en_us_goadedes/miscellanea:misc.Mode1
ltx/en_us_goadedes/me.m12.d06:meMA.Ode8C3T.ode	@ltx/en_us_goadedes/miscellanea:misc.Ode8
ltx/en_us_goadedes/me.m12.d06:meMA.Ode8C3T.text	
ltx/en_us_goadedes/me.m12.d06:meMA.Ode8C3Tr.incipit	…
ltx/en_us_goadedes/me.m12.d06:meMA.Ode8C3Tr.melody	@ltx/en_us_goadedes/he.h.m1:heHE.ThavmatosYperfyous.name
ltx/en_us_goadedes/me.m12.d06:meMA.Ode8C3Tr.mode	@ltx/en_us_goadedes/miscellanea:misc.Mode1
ltx/en_us_goadedes/me.m12.d06:meMA.Ode8C3Tr.ode	@ltx/en_us_goadedes/miscellanea:misc.Ode8
ltx/en_us_goadedes/me.m12.d06:meMA.Ode8C3Tr.text	
ltx/en_us_goadedes/me.m12.d06:meMA.Ode9C11.greekmelody	@ltx/en_us_goadedes/he.h.m1:heHE.TinZoodochonPigin.greekname
ltx/en_us_goadedes/me.m12.d06:meMA.Ode9C11.incipit	…
ltx/en_us_goadedes/me.m12.d06:meMA.Ode9C11.melody	@ltx/en_us_goadedes/he.h.m1:heHE.TinZoodochonPigin.name
ltx/en_us_goadedes/me.m12.d06:meMA.Ode9C11.mode	@ltx/en_us_goadedes/miscellanea:misc.Mode1
ltx/en_us_goadedes/me.m12.d06:meMA.Ode9C11.ode	@ltx/en_us_goadedes/miscellanea:misc.Ode9
ltx/en_us_goadedes/me.m12.d06:meMA.Ode9C11.text	
ltx/en_us_goadedes/me.m12.d06:meMA.Ode9C12.incipit	…
ltx/en_us_goadedes/me.m12.d06:meMA.Ode9C12.melody	@ltx/en_us_goadedes/he.h.m1:heHE.TinZoodochonPigin.name
ltx/en_us_goadedes/me.m12.d06:meMA.Ode9C12.mode	@ltx/en_us_goadedes/miscellanea:misc.Mode1
ltx/en_us_goadedes/me.m12.d06:meMA.Ode9C12.ode	@ltx/en_us_goadedes/miscellanea:misc.Ode9
ltx/en_us_goadedes/me.m12.d06:meMA.Ode9C12.text	
ltx/en_us_goadedes/me.m12.d06:meMA.Ode9C1H.greekmelody	@ltx/en_us_goadedes/he.h.m1:heHE.TinZoodochonPigin.greekname
ltx/en_us_goadedes/me.m12.d06:meMA.Ode9C1H.incipit	@ltx/en_us_goadedes/he.h.m1:heHE.TinZoodochonPigin.incipit
ltx/en_us_goadedes/me.m12.d06:meMA.Ode9C1H.melody	@ltx/en_us_goadedes/he.h.m1:heHE.TinZoodochonPigin.melody
ltx/en_us_goadedes/me.m12.d06:meMA.Ode9C1H.mode	@ltx/en_us_goadedes/miscellanea:misc.Mode1
ltx/en_us_goadedes/me.m12.d06:meMA.Ode9C1H.ode	@ltx/en_us_goadedes/miscellanea:misc.Ode9
ltx/en_us_goadedes/me.m12.d06:meMA.Ode9C1H.text	@ltx/en_us_goadedes/he.h.m1:heHE.TinZoodochonPigin.text
ltx/en_us_goadedes/me.m12.d06:meMA.Ode9C21.greekmelody	@ltx/en_us_goadedes/he.h.m2:heHE.AnarchouGennitoros.greekname
ltx/en_us_goadedes/me.m12.d06:meMA.Ode9C21.incipit	…
ltx/en_us_goadedes/me.m12.d06:meMA.Ode9C21.melody	@ltx/en_us_goadedes/he.h.m2:heHE.AnarchouGennitoros.name
ltx/en_us_goadedes/me.m12.d06:meMA.Ode9C21.mode	@ltx/en_us_goadedes/miscellanea:misc.Mode2
ltx/en_us_goadedes/me.m12.d06:meMA.Ode9C21.ode	@ltx/en_us_goadedes/miscellanea:misc.Ode9
ltx/en_us_goadedes/me.m12.d06:meMA.Ode9C21.text	
ltx/en_us_goadedes/me.m12.d06:meMA.Ode9C22.incipit	…
ltx/en_us_goadedes/me.m12.d06:meMA.Ode9C22.melody	@ltx/en_us_goadedes/he.h.m2:heHE.AnarchouGennitoros.name
ltx/en_us_goadedes/me.m12.d06:meMA.Ode9C22.mode	@ltx/en_us_goadedes/miscellanea:misc.Mode2
ltx/en_us_goadedes/me.m12.d06:meMA.Ode9C22.ode	@ltx/en_us_goadedes/miscellanea:misc.Ode9
ltx/en_us_goadedes/me.m12.d06:meMA.Ode9C22.text	
ltx/en_us_goadedes/me.m12.d06:meMA.Ode9C2T.incipit	…
ltx/en_us_goadedes/me.m12.d06:meMA.Ode9C2T.melody	@ltx/en_us_goadedes/he.h.m2:heHE.AnarchouGennitoros.name
ltx/en_us_goadedes/me.m12.d06:meMA.Ode9C2T.mode	@ltx/en_us_goadedes/miscellanea:misc.Mode2
ltx/en_us_goadedes/me.m12.d06:meMA.Ode9C2T.ode	@ltx/en_us_goadedes/miscellanea:misc.Ode9
ltx/en_us_goadedes/me.m12.d06:meMA.Ode9C2T.text	
ltx/en_us_goadedes/me.m12.d06:meMA.Ode9C31.greekmelody	@ltx/en_us_goadedes/he.h.m1:heHE.MystirionXenon.greekname
ltx/en_us_goadedes/me.m12.d06:meMA.Ode9C31.incipit	…
ltx/en_us_goadedes/me.m12.d06:meMA.Ode9C31.melody	@ltx/en_us_goadedes/he.h.m1:heHE.MystirionXenon.name
ltx/en_us_goadedes/me.m12.d06:meMA.Ode9C31.mode	@ltx/en_us_goadedes/miscellanea:misc.Mode1
ltx/en_us_goadedes/me.m12.d06:meMA.Ode9C31.ode	@ltx/en_us_goadedes/miscellanea:misc.Ode9
ltx/en_us_goadedes/me.m12.d06:meMA.Ode9C31.text	
ltx/en_us_goadedes/me.m12.d06:meMA.Ode9C32.incipit	…
ltx/en_us_goadedes/me.m12.d06:meMA.Ode9C32.melody	@ltx/en_us_goadedes/he.h.m1:heHE.MystirionXenon.name
ltx/en_us_goadedes/me.m12.d06:meMA.Ode9C32.mode	@ltx/en_us_goadedes/miscellanea:misc.Mode1
ltx/en_us_goadedes/me.m12.d06:meMA.Ode9C32.ode	@ltx/en_us_goadedes/miscellanea:misc.Ode9
ltx/en_us_goadedes/me.m12.d06:meMA.Ode9C32.text	
ltx/en_us_goadedes/me.m12.d06:meMA.Ode9C33.incipit	…
ltx/en_us_goadedes/me.m12.d06:meMA.Ode9C33.melody	@ltx/en_us_goadedes/he.h.m1:heHE.MystirionXenon.name
ltx/en_us_goadedes/me.m12.d06:meMA.Ode9C33.mode	@ltx/en_us_goadedes/miscellanea:misc.Mode1
ltx/en_us_goadedes/me.m12.d06:meMA.Ode9C33.ode	@ltx/en_us_goadedes/miscellanea:misc.Ode9
ltx/en_us_goadedes/me.m12.d06:meMA.Ode9C33.text	
ltx/en_us_goadedes/me.m12.d06:meMA.Ode9C3T.incipit	…
ltx/en_us_goadedes/me.m12.d06:meMA.Ode9C3T.melody	@ltx/en_us_goadedes/he.h.m1:heHE.MystirionXenon.name
ltx/en_us_goadedes/me.m12.d06:meMA.Ode9C3T.mode	@ltx/en_us_goadedes/miscellanea:misc.Mode1
ltx/en_us_goadedes/me.m12.d06:meMA.Ode9C3T.ode	@ltx/en_us_goadedes/miscellanea:misc.Ode9
ltx/en_us_goadedes/me.m12.d06:meMA.Ode9C3T.text	
ltx/en_us_goadedes/me.m12.d06:meMA.Ode9C3Tr.incipit	…
ltx/en_us_goadedes/me.m12.d06:meMA.Ode9C3Tr.melody	@ltx/en_us_goadedes/he.h.m1:heHE.MystirionXenon.name
ltx/en_us_goadedes/me.m12.d06:meMA.Ode9C3Tr.mode	@ltx/en_us_goadedes/miscellanea:misc.Mode1
ltx/en_us_goadedes/me.m12.d06:meMA.Ode9C3Tr.ode	@ltx/en_us_goadedes/miscellanea:misc.Ode9
ltx/en_us_goadedes/me.m12.d06:meMA.Ode9C3Tr.text	
ltx/en_us_goadedes/me.m12.d06:meMA.Oikos1.text	
ltx/en_us_goadedes/me.m12.d06:meMA.PostGospelBoth.incipit	@ltx/en_us_goadedes/ho.ho03:hoMA.PostGospelTheotokos.incipit
ltx/en_us_goadedes/me.m12.d06:meMA.PostGospelBoth.melody	
ltx/en_us_goadedes/me.m12.d06:meMA.PostGospelBoth.mode	@ltx/en_us_goadedes/miscellanea:misc.Mode2
ltx/en_us_goadedes/me.m12.d06:meMA.PostGospelBoth.text	@ltx/en_us_goadedes/ho.ho03:hoMA.PostGospelTheotokos.text
ltx/en_us_goadedes/me.m12.d06:meMA.PostGospelGlory.incipit	@ltx/en_us_goadedes/ho.ho03:hoMA.PostGospelHierarch.incipit
ltx/en_us_goadedes/me.m12.d06:meMA.PostGospelGlory.melody	
ltx/en_us_goadedes/me.m12.d06:meMA.PostGospelGlory.mode	@ltx/en_us_goadedes/miscellanea:misc.Mode2
ltx/en_us_goadedes/me.m12.d06:meMA.PostGospelGlory.text	@ltx/en_us_goadedes/ho.ho03:hoMA.PostGospelHierarch.text
ltx/en_us_goadedes/me.m12.d06:meMA.PostGospelIdiomelon.incipit	@ltx/en_us_goadedes/me.m12.d06:meVE.Lity7.incipit
ltx/en_us_goadedes/me.m12.d06:meMA.PostGospelIdiomelon.melody	
ltx/en_us_goadedes/me.m12.d06:meMA.PostGospelIdiomelon.mode	@ltx/en_us_goadedes/miscellanea:misc.Mode6
ltx/en_us_goadedes/me.m12.d06:meMA.PostGospelIdiomelon.text	@ltx/en_us_goadedes/me.m12.d06:meVE.Lity7.text
ltx/en_us_goadedes/me.m12.d06:meSV.AposGlory.incipit	…
ltx/en_us_goadedes/me.m12.d06:meSV.AposGlory.melody	@ltx/en_us_goadedes/he.a.m6:heAU.TriimerosAnestis.name
ltx/en_us_goadedes/me.m12.d06:meSV.AposGlory.mode	@ltx/en_us_goadedes/miscellanea:misc.Mode6
ltx/en_us_goadedes/me.m12.d06:meSV.AposGlory.text	
ltx/en_us_goadedes/me.m12.d06:meSV.Aposticha1.incipit	…
ltx/en_us_goadedes/me.m12.d06:meSV.Aposticha1.melody	@ltx/en_us_goadedes/he.a.m6:heAU.TriimerosAnestis.name
ltx/en_us_goadedes/me.m12.d06:meSV.Aposticha1.mode	@ltx/en_us_goadedes/miscellanea:misc.Mode6
ltx/en_us_goadedes/me.m12.d06:meSV.Aposticha1.text	
ltx/en_us_goadedes/me.m12.d06:meSV.Aposticha2.incipit	…
ltx/en_us_goadedes/me.m12.d06:meSV.Aposticha2.melody	@ltx/en_us_goadedes/he.a.m6:heAU.TriimerosAnestis.name
ltx/en_us_goadedes/me.m12.d06:meSV.Aposticha2.mode	@ltx/en_us_goadedes/miscellanea:misc.Mode6
ltx/en_us_goadedes/me.m12.d06:meSV.Aposticha2.text	
ltx/en_us_goadedes/me.m12.d06:meSV.Aposticha3.incipit	…
ltx/en_us_goadedes/me.m12.d06:meSV.Aposticha3.melody	@ltx/en_us_goadedes/he.a.m6:heAU.TriimerosAnestis.name
ltx/en_us_goadedes/me.m12.d06:meSV.Aposticha3.mode	@ltx/en_us_goadedes/miscellanea:misc.Mode6
ltx/en_us_goadedes/me.m12.d06:meSV.Aposticha3.text	
ltx/en_us_goadedes/me.m12.d06:meSV.SticBoth.incipit	@ltx/en_us_goadedes/he.o:heOT.TheotokeSyEi.incipit
ltx/en_us_goadedes/me.m12.d06:meSV.SticBoth.melody	@ltx/en_us_goadedes/he.o:heOT.TheotokeSyEi.name
ltx/en_us_goadedes/me.m12.d06:meSV.SticBoth.mode	@ltx/en_us_goadedes/miscellanea:misc.Mode6
ltx/en_us_goadedes/me.m12.d06:meSV.SticBoth.text	@ltx/en_us_goadedes/he.o:heOT.TheotokeSyEiIerarchou.text
ltx/en_us_goadedes/me.m12.d06:meSV.SticGlory.incipit	…
ltx/en_us_goadedes/me.m12.d06:meSV.SticGlory.melody	
ltx/en_us_goadedes/me.m12.d06:meSV.SticGlory.mode	@ltx/en_us_goadedes/miscellanea:misc.Mode6
ltx/en_us_goadedes/me.m12.d06:meSV.SticGlory.text	
ltx/en_us_goadedes/me.m12.d06:meSV.Stichera1.incipit	…
ltx/en_us_goadedes/me.m12.d06:meSV.Stichera1.melody	@ltx/en_us_goadedes/he.a.m4:heAU.OsGennaionEnMartysi.name
ltx/en_us_goadedes/me.m12.d06:meSV.Stichera1.mode	@ltx/en_us_goadedes/miscellanea:misc.Mode4
ltx/en_us_goadedes/me.m12.d06:meSV.Stichera1.text	
ltx/en_us_goadedes/me.m12.d06:meSV.Stichera2.incipit	…
ltx/en_us_goadedes/me.m12.d06:meSV.Stichera2.melody	@ltx/en_us_goadedes/he.a.m4:heAU.OsGennaionEnMartysi.name
ltx/en_us_goadedes/me.m12.d06:meSV.Stichera2.mode	@ltx/en_us_goadedes/miscellanea:misc.Mode4
ltx/en_us_goadedes/me.m12.d06:meSV.Stichera2.text	
ltx/en_us_goadedes/me.m12.d06:meSV.Stichera3.incipit	…
ltx/en_us_goadedes/me.m12.d06:meSV.Stichera3.melody	@ltx/en_us_goadedes/he.a.m4:heAU.OsGennaionEnMartysi.name
ltx/en_us_goadedes/me.m12.d06:meSV.Stichera3.mode	@ltx/en_us_goadedes/miscellanea:misc.Mode4
ltx/en_us_goadedes/me.m12.d06:meSV.Stichera3.text	
ltx/en_us_goadedes/me.m12.d06:meVE.AposBoth.incipit	…
ltx/en_us_goadedes/me.m12.d06:meVE.AposBoth.melody	
ltx/en_us_goadedes/me.m12.d06:meVE.AposBoth.mode	@ltx/en_us_goadedes/miscellanea:misc.Mode6
ltx/en_us_goadedes/me.m12.d06:meVE.AposBoth.text	
ltx/en_us_goadedes/me.m12.d06:meVE.AposGlory.incipit	…
ltx/en_us_goadedes/me.m12.d06:meVE.AposGlory.melody	
ltx/en_us_goadedes/me.m12.d06:meVE.AposGlory.mode	@ltx/en_us_goadedes/miscellanea:misc.Mode6
ltx/en_us_goadedes/me.m12.d06:meVE.AposGlory.text	
ltx/en_us_goadedes/me.m12.d06:meVE.Aposticha1.greekmelody	@ltx/en_us_goadedes/he.a.m5:heAU.ChairoisAskitikon.greekname
ltx/en_us_goadedes/me.m12.d06:meVE.Aposticha1.incipit	…
ltx/en_us_goadedes/me.m12.d06:meVE.Aposticha1.melody	@ltx/en_us_goadedes/he.a.m5:heAU.ChairoisAskitikon.name
ltx/en_us_goadedes/me.m12.d06:meVE.Aposticha1.mode	@ltx/en_us_goadedes/miscellanea:misc.Mode5
ltx/en_us_goadedes/me.m12.d06:meVE.Aposticha1.text	
ltx/en_us_goadedes/me.m12.d06:meVE.Aposticha2.incipit	…
ltx/en_us_goadedes/me.m12.d06:meVE.Aposticha2.melody	@ltx/en_us_goadedes/he.a.m5:heAU.ChairoisAskitikon.name
ltx/en_us_goadedes/me.m12.d06:meVE.Aposticha2.mode	@ltx/en_us_goadedes/miscellanea:misc.Mode5
ltx/en_us_goadedes/me.m12.d06:meVE.Aposticha2.text	
ltx/en_us_goadedes/me.m12.d06:meVE.Aposticha3.incipit	…
ltx/en_us_goadedes/me.m12.d06:meVE.Aposticha3.melody	@ltx/en_us_goadedes/he.a.m5:heAU.ChairoisAskitikon.name
ltx/en_us_goadedes/me.m12.d06:meVE.Aposticha3.mode	@ltx/en_us_goadedes/miscellanea:misc.Mode5
ltx/en_us_goadedes/me.m12.d06:meVE.Aposticha3.text	
ltx/en_us_goadedes/me.m12.d06:meVE.GeneralApolytikion1.melody	@ltx/en_us_goadedes/he.ga:heGA.KanonaPisteos.name
ltx/en_us_goadedes/me.m12.d06:meVE.GeneralApolytikion1.mode	@ltx/en_us_goadedes/miscellanea:misc.Mode4
ltx/en_us_goadedes/me.m12.d06:meVE.GeneralApolytikion1.name	
ltx/en_us_goadedes/me.m12.d06:meVE.Lity1.incipit	…
ltx/en_us_goadedes/me.m12.d06:meVE.Lity1.melody	
ltx/en_us_goadedes/me.m12.d06:meVE.Lity1.mode	@ltx/en_us_goadedes/miscellanea:misc.Mode1
ltx/en_us_goadedes/me.m12.d06:meVE.Lity1.text	
ltx/en_us_goadedes/me.m12.d06:meVE.Lity2.incipit	…
ltx/en_us_goadedes/me.m12.d06:meVE.Lity2.melody	
ltx/en_us_goadedes/me.m12.d06:meVE.Lity2.mode	@ltx/en_us_goadedes/miscellanea:misc.Mode1
ltx/en_us_goadedes/me.m12.d06:meVE.Lity2.text	
ltx/en_us_goadedes/me.m12.d06:meVE.Lity3.incipit	…
ltx/en_us_goadedes/me.m12.d06:meVE.Lity3.melody	
ltx/en_us_goadedes/me.m12.d06:meVE.Lity3.mode	@ltx/en_us_goadedes/miscellanea:misc.Mode2
ltx/en_us_goadedes/me.m12.d06:meVE.Lity3.text	
ltx/en_us_goadedes/me.m12.d06:meVE.Lity4.incipit	…
ltx/en_us_goadedes/me.m12.d06:meVE.Lity4.melody	
ltx/en_us_goadedes/me.m12.d06:meVE.Lity4.mode	@ltx/en_us_goadedes/miscellanea:misc.Mode2
ltx/en_us_goadedes/me.m12.d06:meVE.Lity4.text	
ltx/en_us_goadedes/me.m12.d06:meVE.Lity5.incipit	…
ltx/en_us_goadedes/me.m12.d06:meVE.Lity5.melody	
ltx/en_us_goadedes/me.m12.d06:meVE.Lity5.mode	@ltx/en_us_goadedes/miscellanea:misc.Mode2
ltx/en_us_goadedes/me.m12.d06:meVE.Lity5.text	
ltx/en_us_goadedes/me.m12.d06:meVE.Lity6.incipit	…
ltx/en_us_goadedes/me.m12.d06:meVE.Lity6.melody	
ltx/en_us_goadedes/me.m12.d06:meVE.Lity6.mode	@ltx/en_us_goadedes/miscellanea:misc.Mode4
ltx/en_us_goadedes/me.m12.d06:meVE.Lity6.text	
ltx/en_us_goadedes/me.m12.d06:meVE.Lity7.incipit	…
ltx/en_us_goadedes/me.m12.d06:meVE.Lity7.melody	
ltx/en_us_goadedes/me.m12.d06:meVE.Lity7.mode	@ltx/en_us_goadedes/miscellanea:misc.Mode6
ltx/en_us_goadedes/me.m12.d06:meVE.Lity7.text	
ltx/en_us_goadedes/me.m12.d06:meVE.Lity8.incipit	…
ltx/en_us_goadedes/me.m12.d06:meVE.Lity8.melody	
ltx/en_us_goadedes/me.m12.d06:meVE.Lity8.mode	@ltx/en_us_goadedes/miscellanea:misc.Mode8
ltx/en_us_goadedes/me.m12.d06:meVE.Lity8.text	
ltx/en_us_goadedes/me.m12.d06:meVE.LityBoth.incipit	@ltx/en_us_goadedes/me.m12.d24:meH1.Idiomelon1.incipit
ltx/en_us_goadedes/me.m12.d06:meVE.LityBoth.melody	
ltx/en_us_goadedes/me.m12.d06:meVE.LityBoth.mode	@ltx/en_us_goadedes/miscellanea:misc.Mode8
ltx/en_us_goadedes/me.m12.d06:meVE.LityBoth.text	@ltx/en_us_goadedes/me.m12.d24:meH1.Idiomelon1.text
ltx/en_us_goadedes/me.m12.d06:meVE.LityGlory.incipit	…
ltx/en_us_goadedes/me.m12.d06:meVE.LityGlory.melody	
ltx/en_us_goadedes/me.m12.d06:meVE.LityGlory.mode	@ltx/en_us_goadedes/miscellanea:misc.Mode8
ltx/en_us_goadedes/me.m12.d06:meVE.LityGlory.text	
ltx/en_us_goadedes/me.m12.d06:meVE.MM.GeneralApolytikion1.text	
ltx/en_us_goadedes/me.m12.d06:meVE.SticBoth.incipit	…
ltx/en_us_goadedes/me.m12.d06:meVE.SticBoth.melody	
ltx/en_us_goadedes/me.m12.d06:meVE.SticBoth.mode	@ltx/en_us_goadedes/miscellanea:misc.Mode6
ltx/en_us_goadedes/me.m12.d06:meVE.SticBoth.text	
ltx/en_us_goadedes/me.m12.d06:meVE.SticGlory.incipit	…
ltx/en_us_goadedes/me.m12.d06:meVE.SticGlory.melody	
ltx/en_us_goadedes/me.m12.d06:meVE.SticGlory.mode	@ltx/en_us_goadedes/miscellanea:misc.Mode6
ltx/en_us_goadedes/me.m12.d06:meVE.SticGlory.text	
ltx/en_us_goadedes/me.m12.d06:meVE.Stichera01.greekmelody	@ltx/en_us_goadedes/he.a.m2:heAU.OteEkTouXylou.greekname
ltx/en_us_goadedes/me.m12.d06:meVE.Stichera01.incipit	…
ltx/en_us_goadedes/me.m12.d06:meVE.Stichera01.melody	@ltx/en_us_goadedes/he.a.m2:heAU.OteEkTouXylou.name
ltx/en_us_goadedes/me.m12.d06:meVE.Stichera01.mode	@ltx/en_us_goadedes/miscellanea:misc.Mode2
ltx/en_us_goadedes/me.m12.d06:meVE.Stichera01.text	
ltx/en_us_goadedes/me.m12.d06:meVE.Stichera02.incipit	…
ltx/en_us_goadedes/me.m12.d06:meVE.Stichera02.melody	@ltx/en_us_goadedes/he.a.m2:heAU.OteEkTouXylou.name
ltx/en_us_goadedes/me.m12.d06:meVE.Stichera02.mode	@ltx/en_us_goadedes/miscellanea:misc.Mode2
ltx/en_us_goadedes/me.m12.d06:meVE.Stichera02.text	
ltx/en_us_goadedes/me.m12.d06:meVE.Stichera03.incipit	…
ltx/en_us_goadedes/me.m12.d06:meVE.Stichera03.melody	@ltx/en_us_goadedes/he.a.m2:heAU.OteEkTouXylou.name
ltx/en_us_goadedes/me.m12.d06:meVE.Stichera03.mode	@ltx/en_us_goadedes/miscellanea:misc.Mode2
ltx/en_us_goadedes/me.m12.d06:meVE.Stichera03.text	
ltx/en_us_goadedes/me.m12.d06:meVE.Stichera04.greekmelody	@ltx/en_us_goadedes/he.a.m2:heAU.OteEkTouXylou.greekname
ltx/en_us_goadedes/me.m12.d06:meVE.Stichera04.incipit	…
ltx/en_us_goadedes/me.m12.d06:meVE.Stichera04.melody	@ltx/en_us_goadedes/he.a.m2:heAU.OteEkTouXylou.name
ltx/en_us_goadedes/me.m12.d06:meVE.Stichera04.mode	@ltx/en_us_goadedes/miscellanea:misc.Mode2
ltx/en_us_goadedes/me.m12.d06:meVE.Stichera04.text	
ltx/en_us_goadedes/me.m12.d06:meVE.Stichera05.incipit	…
ltx/en_us_goadedes/me.m12.d06:meVE.Stichera05.melody	@ltx/en_us_goadedes/he.a.m2:heAU.PoioisEffimionStemmasin.name
ltx/en_us_goadedes/me.m12.d06:meVE.Stichera05.mode	@ltx/en_us_goadedes/miscellanea:misc.Mode2
ltx/en_us_goadedes/me.m12.d06:meVE.Stichera05.text	
ltx/en_us_goadedes/me.m12.d06:meVE.Stichera06.incipit	…
ltx/en_us_goadedes/me.m12.d06:meVE.Stichera06.melody	@ltx/en_us_goadedes/he.a.m2:heAU.PoioisEffimionStemmasin.name
ltx/en_us_goadedes/me.m12.d06:meVE.Stichera06.mode	@ltx/en_us_goadedes/miscellanea:misc.Mode2
ltx/en_us_goadedes/me.m12.d06:meVE.Stichera06.text	
ltx/en_us_goadedes/me.m12.d06:meVE.Stichera07.incipit	…
ltx/en_us_goadedes/me.m12.d06:meVE.Stichera07.melody	@ltx/en_us_goadedes/he.a.m2:heAU.PoioisEffimionStemmasin.name
ltx/en_us_goadedes/me.m12.d06:meVE.Stichera07.mode	@ltx/en_us_goadedes/miscellanea:misc.Mode2
ltx/en_us_goadedes/me.m12.d06:meVE.Stichera07.text	
