ltx/en_us_goadedes/pe.d119:peDA.commemoration.full	
ltx/en_us_goadedes/pe.d119:peDA.commemoration.short	
ltx/en_us_goadedes/pe.d119:peDA.insert1	
ltx/en_us_goadedes/pe.d119:peDA.insert2	
ltx/en_us_goadedes/pe.d119:peDA.note	
ltx/en_us_goadedes/pe.d119:peHO.commemorations	
ltx/en_us_goadedes/pe.d119:peHO.daytitle	
ltx/en_us_goadedes/pe.d119:peHO.description1	
ltx/en_us_goadedes/pe.d119:peHO.description2	
ltx/en_us_goadedes/pe.d119:peHO.note1	
ltx/en_us_goadedes/pe.d119:peHO.note2	
ltx/en_us_goadedes/pe.d119:peLI.MM.CommunionHymn.text	@ltx/en_us_goadedes/properties:media.key
ltx/en_us_goadedes/pe.d119:peLI.Megalynarion.text	
ltx/en_us_goadedes/pe.d119:peMA.AposGlory.incipit	@ltx/en_us_goadedes/oc.m6.d7:ocVE.Aposticha3.incipit
ltx/en_us_goadedes/pe.d119:peMA.AposGlory.melody	
ltx/en_us_goadedes/pe.d119:peMA.AposGlory.mode	@ltx/en_us_goadedes/miscellanea:misc.Mode6
ltx/en_us_goadedes/pe.d119:peMA.AposGlory.text	@ltx/en_us_goadedes/oc.m6.d7:ocVE.Aposticha3.text
ltx/en_us_goadedes/pe.d119:peMA.AposTheotokion.incipit	@ltx/en_us_goadedes/oc.m6.d7:ocMA.AposTheotokion.incipit
ltx/en_us_goadedes/pe.d119:peMA.AposTheotokion.melody	@ltx/en_us_goadedes/he.a.m6:heAU.OlinApothemenoi.name
ltx/en_us_goadedes/pe.d119:peMA.AposTheotokion.mode	@ltx/en_us_goadedes/miscellanea:misc.Mode6
ltx/en_us_goadedes/pe.d119:peMA.AposTheotokion.text	@ltx/en_us_goadedes/oc.m6.d7:ocMA.AposTheotokion.text
ltx/en_us_goadedes/pe.d119:peMA.Aposticha1.greekmelody	@ltx/en_us_goadedes/he.a.m6:heAU.OlinApothemenoi.greekname
ltx/en_us_goadedes/pe.d119:peMA.Aposticha1.incipit	@ltx/en_us_goadedes/oc.m6.d7:ocMA.Aposticha1.incipit
ltx/en_us_goadedes/pe.d119:peMA.Aposticha1.melody	@ltx/en_us_goadedes/he.a.m6:heAU.OlinApothemenoi.name
ltx/en_us_goadedes/pe.d119:peMA.Aposticha1.mode	@ltx/en_us_goadedes/miscellanea:misc.Mode6
ltx/en_us_goadedes/pe.d119:peMA.Aposticha1.text	@ltx/en_us_goadedes/oc.m6.d7:ocMA.Aposticha1.text
ltx/en_us_goadedes/pe.d119:peMA.Aposticha2.incipit	@ltx/en_us_goadedes/oc.m6.d7:ocMA.Aposticha2.incipit
ltx/en_us_goadedes/pe.d119:peMA.Aposticha2.melody	
ltx/en_us_goadedes/pe.d119:peMA.Aposticha2.mode	@ltx/en_us_goadedes/miscellanea:misc.Mode6
ltx/en_us_goadedes/pe.d119:peMA.Aposticha2.text	@ltx/en_us_goadedes/oc.m6.d7:ocMA.Aposticha2.text
ltx/en_us_goadedes/pe.d119:peMA.Aposticha3.incipit	@ltx/en_us_goadedes/oc.m6.d7:ocMA.Aposticha3.incipit
ltx/en_us_goadedes/pe.d119:peMA.Aposticha3.melody	
ltx/en_us_goadedes/pe.d119:peMA.Aposticha3.mode	@ltx/en_us_goadedes/miscellanea:misc.Mode6
ltx/en_us_goadedes/pe.d119:peMA.Aposticha3.text	@ltx/en_us_goadedes/oc.m6.d7:ocMA.Aposticha3.text
ltx/en_us_goadedes/pe.d119:peMA.C1.acrostic.notice1	
ltx/en_us_goadedes/pe.d119:peMA.C1.acrostic.notice2	
ltx/en_us_goadedes/pe.d119:peMA.C1.acrostic.text	
ltx/en_us_goadedes/pe.d119:peMA.C1.acrostic.title	
ltx/en_us_goadedes/pe.d119:peMA.C1.poet	
ltx/en_us_goadedes/pe.d119:peMA.C1.title	@ltx/en_us_goadedes/titles:ti.CanonDead
ltx/en_us_goadedes/pe.d119:peMA.C1.verse	@ltx/en_us_goadedes/prayers:pr.verse_God.text
ltx/en_us_goadedes/pe.d119:peMA.ExapTheotokion.incipit	@ltx/en_us_goadedes/da.d7:daMA.ExapTheotokion1.incipit
ltx/en_us_goadedes/pe.d119:peMA.ExapTheotokion.melody	@ltx/en_us_goadedes/he.a.m3:heAU.OOuranonToisAstrois.name
ltx/en_us_goadedes/pe.d119:peMA.ExapTheotokion.mode	@ltx/en_us_goadedes/miscellanea:misc.Mode3
ltx/en_us_goadedes/pe.d119:peMA.ExapTheotokion.text	@ltx/en_us_goadedes/da.d7:daMA.ExapTheotokion1.text
ltx/en_us_goadedes/pe.d119:peMA.Exaposteilarion1.greekmelody	@ltx/en_us_goadedes/he.a.m3:heAU.OOuranonToisAstrois.greekname
ltx/en_us_goadedes/pe.d119:peMA.Exaposteilarion1.incipit	…
ltx/en_us_goadedes/pe.d119:peMA.Exaposteilarion1.melody	@ltx/en_us_goadedes/he.a.m3:heAU.OOuranonToisAstrois.name
ltx/en_us_goadedes/pe.d119:peMA.Exaposteilarion1.mode	@ltx/en_us_goadedes/miscellanea:misc.Mode3
ltx/en_us_goadedes/pe.d119:peMA.Exaposteilarion1.text	
ltx/en_us_goadedes/pe.d119:peMA.Kathisma11.greekmelody	@ltx/en_us_goadedes/he.a.m6:heAU.AngelikaiDynameis.greekname
ltx/en_us_goadedes/pe.d119:peMA.Kathisma11.incipit	@ltx/en_us_goadedes/oc.m6.d3:ocMA.Kathisma32.incipit
ltx/en_us_goadedes/pe.d119:peMA.Kathisma11.melody	@ltx/en_us_goadedes/he.a.m6:heAU.AngelikaiDynameis.name
ltx/en_us_goadedes/pe.d119:peMA.Kathisma11.mode	@ltx/en_us_goadedes/miscellanea:misc.Mode6
ltx/en_us_goadedes/pe.d119:peMA.Kathisma11.text	@ltx/en_us_goadedes/oc.m6.d3:ocMA.Kathisma32.text
ltx/en_us_goadedes/pe.d119:peMA.Kathisma12.incipit	@ltx/en_us_goadedes/oc.m6.d4:ocMA.Kathisma32.incipit
ltx/en_us_goadedes/pe.d119:peMA.Kathisma12.melody	
ltx/en_us_goadedes/pe.d119:peMA.Kathisma12.mode	@ltx/en_us_goadedes/miscellanea:misc.Mode6
ltx/en_us_goadedes/pe.d119:peMA.Kathisma12.text	@ltx/en_us_goadedes/oc.m6.d4:ocMA.Kathisma32.text
ltx/en_us_goadedes/pe.d119:peMA.Kathisma13.incipit	@ltx/en_us_goadedes/oc.m6.d5:ocMA.Kathisma32.incipit
ltx/en_us_goadedes/pe.d119:peMA.Kathisma13.melody	
ltx/en_us_goadedes/pe.d119:peMA.Kathisma13.mode	@ltx/en_us_goadedes/miscellanea:misc.Mode6
ltx/en_us_goadedes/pe.d119:peMA.Kathisma13.text	@ltx/en_us_goadedes/oc.m6.d5:ocMA.Kathisma32.text
ltx/en_us_goadedes/pe.d119:peMA.Kathisma14.incipit	…
ltx/en_us_goadedes/pe.d119:peMA.Kathisma14.melody	
ltx/en_us_goadedes/pe.d119:peMA.Kathisma14.mode	@ltx/en_us_goadedes/miscellanea:misc.Mode6
ltx/en_us_goadedes/pe.d119:peMA.Kathisma14.text	
ltx/en_us_goadedes/pe.d119:peMA.Kathisma1T.incipit	@ltx/en_us_goadedes/oc.m6.d1:ocVE.ApolTheotokionVM.incipit
ltx/en_us_goadedes/pe.d119:peMA.Kathisma1T.melody	
ltx/en_us_goadedes/pe.d119:peMA.Kathisma1T.mode	@ltx/en_us_goadedes/miscellanea:misc.Mode6
ltx/en_us_goadedes/pe.d119:peMA.Kathisma1T.text	@ltx/en_us_goadedes/oc.m6.d1:ocVE.ApolTheotokionVM.text
ltx/en_us_goadedes/pe.d119:peMA.Kathisma21.incipit	@ltx/en_us_goadedes/tr.d014:trMA.Kathisma21.incipit
ltx/en_us_goadedes/pe.d119:peMA.Kathisma21.melody	
ltx/en_us_goadedes/pe.d119:peMA.Kathisma21.mode	@ltx/en_us_goadedes/miscellanea:misc.Mode5
ltx/en_us_goadedes/pe.d119:peMA.Kathisma21.text	@ltx/en_us_goadedes/tr.d014:trMA.Kathisma21.text
ltx/en_us_goadedes/pe.d119:peMA.Kathisma21b.incipit	@ltx/en_us_goadedes/tr.d014:trMA.Kathisma21b.incipit
ltx/en_us_goadedes/pe.d119:peMA.Kathisma21b.melody	
ltx/en_us_goadedes/pe.d119:peMA.Kathisma21b.mode	@ltx/en_us_goadedes/miscellanea:misc.Mode5
ltx/en_us_goadedes/pe.d119:peMA.Kathisma21b.text	@ltx/en_us_goadedes/tr.d014:trMA.Kathisma21b.text
ltx/en_us_goadedes/pe.d119:peMA.Kathisma22.incipit	@ltx/en_us_goadedes/tr.d014:trMA.Kathisma22.incipit
ltx/en_us_goadedes/pe.d119:peMA.Kathisma22.melody	
ltx/en_us_goadedes/pe.d119:peMA.Kathisma22.mode	@ltx/en_us_goadedes/miscellanea:misc.Mode5
ltx/en_us_goadedes/pe.d119:peMA.Kathisma22.text	@ltx/en_us_goadedes/tr.d014:trMA.Kathisma22.text
ltx/en_us_goadedes/pe.d119:peMA.Kontakion1.incipit	…
ltx/en_us_goadedes/pe.d119:peMA.Kontakion1.melody	
ltx/en_us_goadedes/pe.d119:peMA.Kontakion1.mode	@ltx/en_us_goadedes/miscellanea:misc.Mode8
ltx/en_us_goadedes/pe.d119:peMA.Kontakion1.text	
ltx/en_us_goadedes/pe.d119:peMA.Lauds1.greekmelody	@ltx/en_us_goadedes/he.a.m6:heAU.IApegnosmeni.greekname
ltx/en_us_goadedes/pe.d119:peMA.Lauds1.incipit	…
ltx/en_us_goadedes/pe.d119:peMA.Lauds1.melody	@ltx/en_us_goadedes/he.a.m6:heAU.IApegnosmeni.name
ltx/en_us_goadedes/pe.d119:peMA.Lauds1.mode	@ltx/en_us_goadedes/miscellanea:misc.Mode6
ltx/en_us_goadedes/pe.d119:peMA.Lauds1.text	
ltx/en_us_goadedes/pe.d119:peMA.Lauds2.greekmelody	@ltx/en_us_goadedes/he.a.m6:heAU.IApegnosmeni.greekname
ltx/en_us_goadedes/pe.d119:peMA.Lauds2.incipit	…
ltx/en_us_goadedes/pe.d119:peMA.Lauds2.melody	@ltx/en_us_goadedes/he.a.m6:heAU.IApegnosmeni.name
ltx/en_us_goadedes/pe.d119:peMA.Lauds2.mode	@ltx/en_us_goadedes/miscellanea:misc.Mode6
ltx/en_us_goadedes/pe.d119:peMA.Lauds2.text	
ltx/en_us_goadedes/pe.d119:peMA.Lauds3.greekmelody	@ltx/en_us_goadedes/he.a.m6:heAU.IApegnosmeni.greekname
ltx/en_us_goadedes/pe.d119:peMA.Lauds3.incipit	…
ltx/en_us_goadedes/pe.d119:peMA.Lauds3.melody	@ltx/en_us_goadedes/he.a.m6:heAU.IApegnosmeni.name
ltx/en_us_goadedes/pe.d119:peMA.Lauds3.mode	@ltx/en_us_goadedes/miscellanea:misc.Mode6
ltx/en_us_goadedes/pe.d119:peMA.Lauds3.text	
ltx/en_us_goadedes/pe.d119:peMA.Lauds4.incipit	…
ltx/en_us_goadedes/pe.d119:peMA.Lauds4.melody	@ltx/en_us_goadedes/he.a.m6:heAU.IApegnosmeni.name
ltx/en_us_goadedes/pe.d119:peMA.Lauds4.mode	@ltx/en_us_goadedes/miscellanea:misc.Mode6
ltx/en_us_goadedes/pe.d119:peMA.Lauds4.text	
ltx/en_us_goadedes/pe.d119:peMA.LaudsBoth.incipit	@ltx/en_us_goadedes/oc.m6.d7:ocMA.LaudsTheotokion.incipit
ltx/en_us_goadedes/pe.d119:peMA.LaudsBoth.melody	
ltx/en_us_goadedes/pe.d119:peMA.LaudsBoth.mode	@ltx/en_us_goadedes/miscellanea:misc.Mode6
ltx/en_us_goadedes/pe.d119:peMA.LaudsBoth.text	@ltx/en_us_goadedes/oc.m6.d7:ocMA.LaudsTheotokion.text
ltx/en_us_goadedes/pe.d119:peMA.LaudsGlory.incipit	@ltx/en_us_goadedes/oc.m2.d7:ocVE.Aposticha4.incipit
ltx/en_us_goadedes/pe.d119:peMA.LaudsGlory.melody	
ltx/en_us_goadedes/pe.d119:peMA.LaudsGlory.mode	@ltx/en_us_goadedes/miscellanea:misc.Mode2
ltx/en_us_goadedes/pe.d119:peMA.LaudsGlory.text	@ltx/en_us_goadedes/oc.m2.d7:ocVE.Aposticha4.text
ltx/en_us_goadedes/pe.d119:peMA.Ode1C11.greekmelody	@ltx/en_us_goadedes/he.h.m6:heHE.OsEnIpeiroPezefsas.greekname
ltx/en_us_goadedes/pe.d119:peMA.Ode1C11.incipit	…
ltx/en_us_goadedes/pe.d119:peMA.Ode1C11.melody	@ltx/en_us_goadedes/he.h.m6:heHE.OsEnIpeiroPezefsas.name
ltx/en_us_goadedes/pe.d119:peMA.Ode1C11.mode	@ltx/en_us_goadedes/miscellanea:misc.Mode6
ltx/en_us_goadedes/pe.d119:peMA.Ode1C11.ode	@ltx/en_us_goadedes/miscellanea:misc.Ode1
ltx/en_us_goadedes/pe.d119:peMA.Ode1C11.text	
ltx/en_us_goadedes/pe.d119:peMA.Ode1C12.incipit	…
ltx/en_us_goadedes/pe.d119:peMA.Ode1C12.melody	@ltx/en_us_goadedes/he.h.m6:heHE.OsEnIpeiroPezefsas.name
ltx/en_us_goadedes/pe.d119:peMA.Ode1C12.mode	@ltx/en_us_goadedes/miscellanea:misc.Mode6
ltx/en_us_goadedes/pe.d119:peMA.Ode1C12.ode	@ltx/en_us_goadedes/miscellanea:misc.Ode1
ltx/en_us_goadedes/pe.d119:peMA.Ode1C12.text	
ltx/en_us_goadedes/pe.d119:peMA.Ode1C13.incipit	…
ltx/en_us_goadedes/pe.d119:peMA.Ode1C13.melody	@ltx/en_us_goadedes/he.h.m6:heHE.OsEnIpeiroPezefsas.name
ltx/en_us_goadedes/pe.d119:peMA.Ode1C13.mode	@ltx/en_us_goadedes/miscellanea:misc.Mode6
ltx/en_us_goadedes/pe.d119:peMA.Ode1C13.ode	@ltx/en_us_goadedes/miscellanea:misc.Ode1
ltx/en_us_goadedes/pe.d119:peMA.Ode1C13.text	
ltx/en_us_goadedes/pe.d119:peMA.Ode1C1H.greekmelody	@ltx/en_us_goadedes/he.h.m6:heHE.OsEnIpeiroPezefsas.greekname
ltx/en_us_goadedes/pe.d119:peMA.Ode1C1H.incipit	@ltx/en_us_goadedes/he.h.m6:heHE.OsEnIpeiroPezefsas.incipit
ltx/en_us_goadedes/pe.d119:peMA.Ode1C1H.melody	@ltx/en_us_goadedes/he.h.m6:heHE.OsEnIpeiroPezefsas.melody
ltx/en_us_goadedes/pe.d119:peMA.Ode1C1H.mode	@ltx/en_us_goadedes/miscellanea:misc.Mode6
ltx/en_us_goadedes/pe.d119:peMA.Ode1C1H.ode	@ltx/en_us_goadedes/miscellanea:misc.Ode1
ltx/en_us_goadedes/pe.d119:peMA.Ode1C1H.text	@ltx/en_us_goadedes/he.h.m6:heHE.OsEnIpeiroPezefsas.text
ltx/en_us_goadedes/pe.d119:peMA.Ode1C1T.incipit	…
ltx/en_us_goadedes/pe.d119:peMA.Ode1C1T.melody	@ltx/en_us_goadedes/he.h.m6:heHE.OsEnIpeiroPezefsas.name
ltx/en_us_goadedes/pe.d119:peMA.Ode1C1T.mode	@ltx/en_us_goadedes/miscellanea:misc.Mode6
ltx/en_us_goadedes/pe.d119:peMA.Ode1C1T.ode	@ltx/en_us_goadedes/miscellanea:misc.Ode1
ltx/en_us_goadedes/pe.d119:peMA.Ode1C1T.text	
ltx/en_us_goadedes/pe.d119:peMA.Ode3C11.greekmelody	@ltx/en_us_goadedes/he.h.m6:heHE.OukEstinAgios.greekname
ltx/en_us_goadedes/pe.d119:peMA.Ode3C11.incipit	…
ltx/en_us_goadedes/pe.d119:peMA.Ode3C11.melody	@ltx/en_us_goadedes/he.h.m6:heHE.OukEstinAgios.name
ltx/en_us_goadedes/pe.d119:peMA.Ode3C11.mode	@ltx/en_us_goadedes/miscellanea:misc.Mode6
ltx/en_us_goadedes/pe.d119:peMA.Ode3C11.ode	@ltx/en_us_goadedes/miscellanea:misc.Ode3
ltx/en_us_goadedes/pe.d119:peMA.Ode3C11.text	
ltx/en_us_goadedes/pe.d119:peMA.Ode3C12.incipit	…
ltx/en_us_goadedes/pe.d119:peMA.Ode3C12.melody	@ltx/en_us_goadedes/he.h.m6:heHE.OukEstinAgios.name
ltx/en_us_goadedes/pe.d119:peMA.Ode3C12.mode	@ltx/en_us_goadedes/miscellanea:misc.Mode6
ltx/en_us_goadedes/pe.d119:peMA.Ode3C12.ode	@ltx/en_us_goadedes/miscellanea:misc.Ode3
ltx/en_us_goadedes/pe.d119:peMA.Ode3C12.text	
ltx/en_us_goadedes/pe.d119:peMA.Ode3C13.incipit	…
ltx/en_us_goadedes/pe.d119:peMA.Ode3C13.melody	@ltx/en_us_goadedes/he.h.m6:heHE.OukEstinAgios.name
ltx/en_us_goadedes/pe.d119:peMA.Ode3C13.mode	@ltx/en_us_goadedes/miscellanea:misc.Mode6
ltx/en_us_goadedes/pe.d119:peMA.Ode3C13.ode	@ltx/en_us_goadedes/miscellanea:misc.Ode3
ltx/en_us_goadedes/pe.d119:peMA.Ode3C13.text	
ltx/en_us_goadedes/pe.d119:peMA.Ode3C1H.greekmelody	@ltx/en_us_goadedes/he.h.m6:heHE.OukEstinAgios.greekname
ltx/en_us_goadedes/pe.d119:peMA.Ode3C1H.incipit	@ltx/en_us_goadedes/he.h.m6:heHE.OukEstinAgios.incipit
ltx/en_us_goadedes/pe.d119:peMA.Ode3C1H.melody	@ltx/en_us_goadedes/he.h.m6:heHE.OukEstinAgios.melody
ltx/en_us_goadedes/pe.d119:peMA.Ode3C1H.mode	@ltx/en_us_goadedes/miscellanea:misc.Mode6
ltx/en_us_goadedes/pe.d119:peMA.Ode3C1H.ode	@ltx/en_us_goadedes/miscellanea:misc.Ode3
ltx/en_us_goadedes/pe.d119:peMA.Ode3C1H.text	@ltx/en_us_goadedes/he.h.m6:heHE.OukEstinAgios.text
ltx/en_us_goadedes/pe.d119:peMA.Ode3C1T.incipit	…
ltx/en_us_goadedes/pe.d119:peMA.Ode3C1T.melody	@ltx/en_us_goadedes/he.h.m6:heHE.OukEstinAgios.name
ltx/en_us_goadedes/pe.d119:peMA.Ode3C1T.mode	@ltx/en_us_goadedes/miscellanea:misc.Mode6
ltx/en_us_goadedes/pe.d119:peMA.Ode3C1T.ode	@ltx/en_us_goadedes/miscellanea:misc.Ode3
ltx/en_us_goadedes/pe.d119:peMA.Ode3C1T.text	
ltx/en_us_goadedes/pe.d119:peMA.Ode3Kathisma1.greekmelody	@ltx/en_us_goadedes/he.a.m8:heAU.TinSofianKaiLogon.greekname
ltx/en_us_goadedes/pe.d119:peMA.Ode3Kathisma1.incipit	…
ltx/en_us_goadedes/pe.d119:peMA.Ode3Kathisma1.melody	@ltx/en_us_goadedes/he.a.m8:heAU.TinSofianKaiLogon.name
ltx/en_us_goadedes/pe.d119:peMA.Ode3Kathisma1.mode	@ltx/en_us_goadedes/miscellanea:misc.Mode8
ltx/en_us_goadedes/pe.d119:peMA.Ode3Kathisma1.text	
ltx/en_us_goadedes/pe.d119:peMA.Ode3Kathisma2.greekmelody	@ltx/en_us_goadedes/he.a.m8:heAU.TinSofianKaiLogon.greekname
ltx/en_us_goadedes/pe.d119:peMA.Ode3Kathisma2.incipit	@ltx/en_us_goadedes/me.m06.d29:meMA.Kathisma2T.incipit
ltx/en_us_goadedes/pe.d119:peMA.Ode3Kathisma2.melody	@ltx/en_us_goadedes/he.a.m8:heAU.TinSofianKaiLogon.name
ltx/en_us_goadedes/pe.d119:peMA.Ode3Kathisma2.mode	@ltx/en_us_goadedes/miscellanea:misc.Mode8
ltx/en_us_goadedes/pe.d119:peMA.Ode3Kathisma2.text	@ltx/en_us_goadedes/me.m06.d29:meMA.Kathisma2T.text
ltx/en_us_goadedes/pe.d119:peMA.Ode4C11.greekmelody	@ltx/en_us_goadedes/he.h.m6:heHE.ChristosMouDynamis.greekname
ltx/en_us_goadedes/pe.d119:peMA.Ode4C11.incipit	…
ltx/en_us_goadedes/pe.d119:peMA.Ode4C11.melody	@ltx/en_us_goadedes/he.h.m6:heHE.ChristosMouDynamis.name
ltx/en_us_goadedes/pe.d119:peMA.Ode4C11.mode	@ltx/en_us_goadedes/miscellanea:misc.Mode6
ltx/en_us_goadedes/pe.d119:peMA.Ode4C11.ode	@ltx/en_us_goadedes/miscellanea:misc.Ode4
ltx/en_us_goadedes/pe.d119:peMA.Ode4C11.text	
ltx/en_us_goadedes/pe.d119:peMA.Ode4C12.incipit	…
ltx/en_us_goadedes/pe.d119:peMA.Ode4C12.melody	@ltx/en_us_goadedes/he.h.m6:heHE.ChristosMouDynamis.name
ltx/en_us_goadedes/pe.d119:peMA.Ode4C12.mode	@ltx/en_us_goadedes/miscellanea:misc.Mode6
ltx/en_us_goadedes/pe.d119:peMA.Ode4C12.ode	@ltx/en_us_goadedes/miscellanea:misc.Ode4
ltx/en_us_goadedes/pe.d119:peMA.Ode4C12.text	
ltx/en_us_goadedes/pe.d119:peMA.Ode4C13.incipit	…
ltx/en_us_goadedes/pe.d119:peMA.Ode4C13.melody	@ltx/en_us_goadedes/he.h.m6:heHE.ChristosMouDynamis.name
ltx/en_us_goadedes/pe.d119:peMA.Ode4C13.mode	@ltx/en_us_goadedes/miscellanea:misc.Mode6
ltx/en_us_goadedes/pe.d119:peMA.Ode4C13.ode	@ltx/en_us_goadedes/miscellanea:misc.Ode4
ltx/en_us_goadedes/pe.d119:peMA.Ode4C13.text	
ltx/en_us_goadedes/pe.d119:peMA.Ode4C1H.greekmelody	@ltx/en_us_goadedes/he.h.m6:heHE.ChristosMouDynamis.greekname
ltx/en_us_goadedes/pe.d119:peMA.Ode4C1H.incipit	@ltx/en_us_goadedes/he.h.m6:heHE.ChristosMouDynamis.incipit
ltx/en_us_goadedes/pe.d119:peMA.Ode4C1H.melody	@ltx/en_us_goadedes/he.h.m6:heHE.ChristosMouDynamis.melody
ltx/en_us_goadedes/pe.d119:peMA.Ode4C1H.mode	@ltx/en_us_goadedes/miscellanea:misc.Mode6
ltx/en_us_goadedes/pe.d119:peMA.Ode4C1H.ode	@ltx/en_us_goadedes/miscellanea:misc.Ode4
ltx/en_us_goadedes/pe.d119:peMA.Ode4C1H.text	@ltx/en_us_goadedes/he.h.m6:heHE.ChristosMouDynamis.text
ltx/en_us_goadedes/pe.d119:peMA.Ode4C1T.incipit	…
ltx/en_us_goadedes/pe.d119:peMA.Ode4C1T.melody	@ltx/en_us_goadedes/he.h.m6:heHE.ChristosMouDynamis.name
ltx/en_us_goadedes/pe.d119:peMA.Ode4C1T.mode	@ltx/en_us_goadedes/miscellanea:misc.Mode6
ltx/en_us_goadedes/pe.d119:peMA.Ode4C1T.ode	@ltx/en_us_goadedes/miscellanea:misc.Ode4
ltx/en_us_goadedes/pe.d119:peMA.Ode4C1T.text	
ltx/en_us_goadedes/pe.d119:peMA.Ode5C11.greekmelody	@ltx/en_us_goadedes/he.h.m6:heHE.ToTheioFengeiSou.greekname
ltx/en_us_goadedes/pe.d119:peMA.Ode5C11.incipit	…
ltx/en_us_goadedes/pe.d119:peMA.Ode5C11.melody	@ltx/en_us_goadedes/he.h.m6:heHE.ToTheioFengeiSou.name
ltx/en_us_goadedes/pe.d119:peMA.Ode5C11.mode	@ltx/en_us_goadedes/miscellanea:misc.Mode6
ltx/en_us_goadedes/pe.d119:peMA.Ode5C11.ode	@ltx/en_us_goadedes/miscellanea:misc.Ode5
ltx/en_us_goadedes/pe.d119:peMA.Ode5C11.text	
ltx/en_us_goadedes/pe.d119:peMA.Ode5C12.incipit	…
ltx/en_us_goadedes/pe.d119:peMA.Ode5C12.melody	@ltx/en_us_goadedes/he.h.m6:heHE.ToTheioFengeiSou.name
ltx/en_us_goadedes/pe.d119:peMA.Ode5C12.mode	@ltx/en_us_goadedes/miscellanea:misc.Mode6
ltx/en_us_goadedes/pe.d119:peMA.Ode5C12.ode	@ltx/en_us_goadedes/miscellanea:misc.Ode5
ltx/en_us_goadedes/pe.d119:peMA.Ode5C12.text	
ltx/en_us_goadedes/pe.d119:peMA.Ode5C13.incipit	…
ltx/en_us_goadedes/pe.d119:peMA.Ode5C13.melody	@ltx/en_us_goadedes/he.h.m6:heHE.ToTheioFengeiSou.name
ltx/en_us_goadedes/pe.d119:peMA.Ode5C13.mode	@ltx/en_us_goadedes/miscellanea:misc.Mode6
ltx/en_us_goadedes/pe.d119:peMA.Ode5C13.ode	@ltx/en_us_goadedes/miscellanea:misc.Ode5
ltx/en_us_goadedes/pe.d119:peMA.Ode5C13.text	
ltx/en_us_goadedes/pe.d119:peMA.Ode5C1H.greekmelody	@ltx/en_us_goadedes/he.h.m6:heHE.ToTheioFengeiSou.greekname
ltx/en_us_goadedes/pe.d119:peMA.Ode5C1H.incipit	@ltx/en_us_goadedes/he.h.m6:heHE.ToTheioFengeiSou.incipit
ltx/en_us_goadedes/pe.d119:peMA.Ode5C1H.melody	@ltx/en_us_goadedes/he.h.m6:heHE.ToTheioFengeiSou.melody
ltx/en_us_goadedes/pe.d119:peMA.Ode5C1H.mode	@ltx/en_us_goadedes/miscellanea:misc.Mode6
ltx/en_us_goadedes/pe.d119:peMA.Ode5C1H.ode	@ltx/en_us_goadedes/miscellanea:misc.Ode5
ltx/en_us_goadedes/pe.d119:peMA.Ode5C1H.text	@ltx/en_us_goadedes/he.h.m6:heHE.ToTheioFengeiSou.text
ltx/en_us_goadedes/pe.d119:peMA.Ode5C1T.incipit	…
ltx/en_us_goadedes/pe.d119:peMA.Ode5C1T.melody	@ltx/en_us_goadedes/he.h.m6:heHE.ToTheioFengeiSou.name
ltx/en_us_goadedes/pe.d119:peMA.Ode5C1T.mode	@ltx/en_us_goadedes/miscellanea:misc.Mode6
ltx/en_us_goadedes/pe.d119:peMA.Ode5C1T.ode	@ltx/en_us_goadedes/miscellanea:misc.Ode5
ltx/en_us_goadedes/pe.d119:peMA.Ode5C1T.text	
ltx/en_us_goadedes/pe.d119:peMA.Ode6C11.greekmelody	@ltx/en_us_goadedes/he.h.m6:heHE.TouViouTinThalassan.greekname
ltx/en_us_goadedes/pe.d119:peMA.Ode6C11.incipit	…
ltx/en_us_goadedes/pe.d119:peMA.Ode6C11.melody	@ltx/en_us_goadedes/he.h.m6:heHE.TouViouTinThalassan.name
ltx/en_us_goadedes/pe.d119:peMA.Ode6C11.mode	@ltx/en_us_goadedes/miscellanea:misc.Mode6
ltx/en_us_goadedes/pe.d119:peMA.Ode6C11.ode	@ltx/en_us_goadedes/miscellanea:misc.Ode6
ltx/en_us_goadedes/pe.d119:peMA.Ode6C11.text	
ltx/en_us_goadedes/pe.d119:peMA.Ode6C12.incipit	…
ltx/en_us_goadedes/pe.d119:peMA.Ode6C12.melody	@ltx/en_us_goadedes/he.h.m6:heHE.TouViouTinThalassan.name
ltx/en_us_goadedes/pe.d119:peMA.Ode6C12.mode	@ltx/en_us_goadedes/miscellanea:misc.Mode6
ltx/en_us_goadedes/pe.d119:peMA.Ode6C12.ode	@ltx/en_us_goadedes/miscellanea:misc.Ode6
ltx/en_us_goadedes/pe.d119:peMA.Ode6C12.text	
ltx/en_us_goadedes/pe.d119:peMA.Ode6C13.incipit	…
ltx/en_us_goadedes/pe.d119:peMA.Ode6C13.melody	@ltx/en_us_goadedes/he.h.m6:heHE.TouViouTinThalassan.name
ltx/en_us_goadedes/pe.d119:peMA.Ode6C13.mode	@ltx/en_us_goadedes/miscellanea:misc.Mode6
ltx/en_us_goadedes/pe.d119:peMA.Ode6C13.ode	@ltx/en_us_goadedes/miscellanea:misc.Ode6
ltx/en_us_goadedes/pe.d119:peMA.Ode6C13.text	
ltx/en_us_goadedes/pe.d119:peMA.Ode6C1H.greekmelody	@ltx/en_us_goadedes/he.h.m6:heHE.TouViouTinThalassan.greekname
ltx/en_us_goadedes/pe.d119:peMA.Ode6C1H.incipit	@ltx/en_us_goadedes/he.h.m6:heHE.TouViouTinThalassan.incipit
ltx/en_us_goadedes/pe.d119:peMA.Ode6C1H.melody	@ltx/en_us_goadedes/he.h.m6:heHE.TouViouTinThalassan.melody
ltx/en_us_goadedes/pe.d119:peMA.Ode6C1H.mode	@ltx/en_us_goadedes/miscellanea:misc.Mode6
ltx/en_us_goadedes/pe.d119:peMA.Ode6C1H.ode	@ltx/en_us_goadedes/miscellanea:misc.Ode6
ltx/en_us_goadedes/pe.d119:peMA.Ode6C1H.text	@ltx/en_us_goadedes/he.h.m6:heHE.TouViouTinThalassan.text
ltx/en_us_goadedes/pe.d119:peMA.Ode6C1T.incipit	…
ltx/en_us_goadedes/pe.d119:peMA.Ode6C1T.melody	@ltx/en_us_goadedes/he.h.m6:heHE.TouViouTinThalassan.name
ltx/en_us_goadedes/pe.d119:peMA.Ode6C1T.mode	@ltx/en_us_goadedes/miscellanea:misc.Mode6
ltx/en_us_goadedes/pe.d119:peMA.Ode6C1T.ode	@ltx/en_us_goadedes/miscellanea:misc.Ode6
ltx/en_us_goadedes/pe.d119:peMA.Ode6C1T.text	
ltx/en_us_goadedes/pe.d119:peMA.Ode7C11.greekmelody	@ltx/en_us_goadedes/he.h.m6:heHE.DrosovolonMenTinKaminon.greekname
ltx/en_us_goadedes/pe.d119:peMA.Ode7C11.incipit	…
ltx/en_us_goadedes/pe.d119:peMA.Ode7C11.melody	@ltx/en_us_goadedes/he.h.m6:heHE.DrosovolonMenTinKaminon.name
ltx/en_us_goadedes/pe.d119:peMA.Ode7C11.mode	@ltx/en_us_goadedes/miscellanea:misc.Mode6
ltx/en_us_goadedes/pe.d119:peMA.Ode7C11.ode	@ltx/en_us_goadedes/miscellanea:misc.Ode7
ltx/en_us_goadedes/pe.d119:peMA.Ode7C11.text	
ltx/en_us_goadedes/pe.d119:peMA.Ode7C12.incipit	…
ltx/en_us_goadedes/pe.d119:peMA.Ode7C12.melody	@ltx/en_us_goadedes/he.h.m6:heHE.DrosovolonMenTinKaminon.name
ltx/en_us_goadedes/pe.d119:peMA.Ode7C12.mode	@ltx/en_us_goadedes/miscellanea:misc.Mode6
ltx/en_us_goadedes/pe.d119:peMA.Ode7C12.ode	@ltx/en_us_goadedes/miscellanea:misc.Ode7
ltx/en_us_goadedes/pe.d119:peMA.Ode7C12.text	
ltx/en_us_goadedes/pe.d119:peMA.Ode7C13.incipit	…
ltx/en_us_goadedes/pe.d119:peMA.Ode7C13.melody	@ltx/en_us_goadedes/he.h.m6:heHE.DrosovolonMenTinKaminon.name
ltx/en_us_goadedes/pe.d119:peMA.Ode7C13.mode	@ltx/en_us_goadedes/miscellanea:misc.Mode6
ltx/en_us_goadedes/pe.d119:peMA.Ode7C13.ode	@ltx/en_us_goadedes/miscellanea:misc.Ode7
ltx/en_us_goadedes/pe.d119:peMA.Ode7C13.text	
ltx/en_us_goadedes/pe.d119:peMA.Ode7C1H.greekmelody	@ltx/en_us_goadedes/he.h.m6:heHE.DrosovolonMenTinKaminon.greekname
ltx/en_us_goadedes/pe.d119:peMA.Ode7C1H.incipit	@ltx/en_us_goadedes/he.h.m6:heHE.DrosovolonMenTinKaminon.incipit
ltx/en_us_goadedes/pe.d119:peMA.Ode7C1H.melody	@ltx/en_us_goadedes/he.h.m6:heHE.DrosovolonMenTinKaminon.melody
ltx/en_us_goadedes/pe.d119:peMA.Ode7C1H.mode	@ltx/en_us_goadedes/miscellanea:misc.Mode6
ltx/en_us_goadedes/pe.d119:peMA.Ode7C1H.ode	@ltx/en_us_goadedes/miscellanea:misc.Ode7
ltx/en_us_goadedes/pe.d119:peMA.Ode7C1H.text	@ltx/en_us_goadedes/he.h.m6:heHE.DrosovolonMenTinKaminon.text
ltx/en_us_goadedes/pe.d119:peMA.Ode7C1T.incipit	…
ltx/en_us_goadedes/pe.d119:peMA.Ode7C1T.melody	@ltx/en_us_goadedes/he.h.m6:heHE.DrosovolonMenTinKaminon.name
ltx/en_us_goadedes/pe.d119:peMA.Ode7C1T.mode	@ltx/en_us_goadedes/miscellanea:misc.Mode6
ltx/en_us_goadedes/pe.d119:peMA.Ode7C1T.ode	@ltx/en_us_goadedes/miscellanea:misc.Ode7
ltx/en_us_goadedes/pe.d119:peMA.Ode7C1T.text	
ltx/en_us_goadedes/pe.d119:peMA.Ode8C11.greekmelody	@ltx/en_us_goadedes/he.h.m6:heHE.EkstithiFrittonOurane.greekname
ltx/en_us_goadedes/pe.d119:peMA.Ode8C11.incipit	…
ltx/en_us_goadedes/pe.d119:peMA.Ode8C11.melody	@ltx/en_us_goadedes/he.h.m6:heHE.EkstithiFrittonOurane.name
ltx/en_us_goadedes/pe.d119:peMA.Ode8C11.mode	@ltx/en_us_goadedes/miscellanea:misc.Mode6
ltx/en_us_goadedes/pe.d119:peMA.Ode8C11.ode	@ltx/en_us_goadedes/miscellanea:misc.Ode8
ltx/en_us_goadedes/pe.d119:peMA.Ode8C11.text	
ltx/en_us_goadedes/pe.d119:peMA.Ode8C12.incipit	…
ltx/en_us_goadedes/pe.d119:peMA.Ode8C12.melody	@ltx/en_us_goadedes/he.h.m6:heHE.EkstithiFrittonOurane.name
ltx/en_us_goadedes/pe.d119:peMA.Ode8C12.mode	@ltx/en_us_goadedes/miscellanea:misc.Mode6
ltx/en_us_goadedes/pe.d119:peMA.Ode8C12.ode	@ltx/en_us_goadedes/miscellanea:misc.Ode8
ltx/en_us_goadedes/pe.d119:peMA.Ode8C12.text	
ltx/en_us_goadedes/pe.d119:peMA.Ode8C13.incipit	…
ltx/en_us_goadedes/pe.d119:peMA.Ode8C13.melody	@ltx/en_us_goadedes/he.h.m6:heHE.EkstithiFrittonOurane.name
ltx/en_us_goadedes/pe.d119:peMA.Ode8C13.mode	@ltx/en_us_goadedes/miscellanea:misc.Mode6
ltx/en_us_goadedes/pe.d119:peMA.Ode8C13.ode	@ltx/en_us_goadedes/miscellanea:misc.Ode8
ltx/en_us_goadedes/pe.d119:peMA.Ode8C13.text	
ltx/en_us_goadedes/pe.d119:peMA.Ode8C1H.greekmelody	@ltx/en_us_goadedes/he.h.m6:heHE.EkstithiFrittonOurane.greekname
ltx/en_us_goadedes/pe.d119:peMA.Ode8C1H.incipit	@ltx/en_us_goadedes/he.h.m6:heHE.EkstithiFrittonOurane.incipit
ltx/en_us_goadedes/pe.d119:peMA.Ode8C1H.melody	@ltx/en_us_goadedes/he.h.m6:heHE.EkstithiFrittonOurane.melody
ltx/en_us_goadedes/pe.d119:peMA.Ode8C1H.mode	@ltx/en_us_goadedes/miscellanea:misc.Mode6
ltx/en_us_goadedes/pe.d119:peMA.Ode8C1H.ode	@ltx/en_us_goadedes/miscellanea:misc.Ode8
ltx/en_us_goadedes/pe.d119:peMA.Ode8C1H.text	@ltx/en_us_goadedes/he.h.m6:heHE.EkstithiFrittonOurane.text
ltx/en_us_goadedes/pe.d119:peMA.Ode8C1T.incipit	…
ltx/en_us_goadedes/pe.d119:peMA.Ode8C1T.melody	@ltx/en_us_goadedes/he.h.m6:heHE.EkstithiFrittonOurane.name
ltx/en_us_goadedes/pe.d119:peMA.Ode8C1T.mode	@ltx/en_us_goadedes/miscellanea:misc.Mode6
ltx/en_us_goadedes/pe.d119:peMA.Ode8C1T.ode	@ltx/en_us_goadedes/miscellanea:misc.Ode8
ltx/en_us_goadedes/pe.d119:peMA.Ode8C1T.text	
ltx/en_us_goadedes/pe.d119:peMA.Ode9C11.greekmelody	@ltx/en_us_goadedes/he.h.m6:heHE.AporeiPasaGlossa.greekname
ltx/en_us_goadedes/pe.d119:peMA.Ode9C11.incipit	…
ltx/en_us_goadedes/pe.d119:peMA.Ode9C11.melody	@ltx/en_us_goadedes/he.h.m6:heHE.AporeiPasaGlossa.name
ltx/en_us_goadedes/pe.d119:peMA.Ode9C11.mode	@ltx/en_us_goadedes/miscellanea:misc.Mode6
ltx/en_us_goadedes/pe.d119:peMA.Ode9C11.ode	@ltx/en_us_goadedes/miscellanea:misc.Ode9
ltx/en_us_goadedes/pe.d119:peMA.Ode9C11.text	
ltx/en_us_goadedes/pe.d119:peMA.Ode9C12.incipit	…
ltx/en_us_goadedes/pe.d119:peMA.Ode9C12.melody	@ltx/en_us_goadedes/he.h.m6:heHE.AporeiPasaGlossa.name
ltx/en_us_goadedes/pe.d119:peMA.Ode9C12.mode	@ltx/en_us_goadedes/miscellanea:misc.Mode6
ltx/en_us_goadedes/pe.d119:peMA.Ode9C12.ode	@ltx/en_us_goadedes/miscellanea:misc.Ode9
ltx/en_us_goadedes/pe.d119:peMA.Ode9C12.text	
ltx/en_us_goadedes/pe.d119:peMA.Ode9C13.incipit	…
ltx/en_us_goadedes/pe.d119:peMA.Ode9C13.melody	@ltx/en_us_goadedes/he.h.m6:heHE.AporeiPasaGlossa.name
ltx/en_us_goadedes/pe.d119:peMA.Ode9C13.mode	@ltx/en_us_goadedes/miscellanea:misc.Mode6
ltx/en_us_goadedes/pe.d119:peMA.Ode9C13.ode	@ltx/en_us_goadedes/miscellanea:misc.Ode9
ltx/en_us_goadedes/pe.d119:peMA.Ode9C13.text	
ltx/en_us_goadedes/pe.d119:peMA.Ode9C1H.greekmelody	@ltx/en_us_goadedes/he.h.m6:heHE.AporeiPasaGlossa.greekname
ltx/en_us_goadedes/pe.d119:peMA.Ode9C1H.incipit	@ltx/en_us_goadedes/he.h.m6:heHE.AporeiPasaGlossa.incipit
ltx/en_us_goadedes/pe.d119:peMA.Ode9C1H.melody	@ltx/en_us_goadedes/he.h.m6:heHE.AporeiPasaGlossa.melody
ltx/en_us_goadedes/pe.d119:peMA.Ode9C1H.mode	@ltx/en_us_goadedes/miscellanea:misc.Mode6
ltx/en_us_goadedes/pe.d119:peMA.Ode9C1H.ode	@ltx/en_us_goadedes/miscellanea:misc.Ode9
ltx/en_us_goadedes/pe.d119:peMA.Ode9C1H.text	@ltx/en_us_goadedes/he.h.m6:heHE.AporeiPasaGlossa.text
ltx/en_us_goadedes/pe.d119:peMA.Ode9C1T.incipit	…
ltx/en_us_goadedes/pe.d119:peMA.Ode9C1T.melody	@ltx/en_us_goadedes/he.h.m6:heHE.AporeiPasaGlossa.name
ltx/en_us_goadedes/pe.d119:peMA.Ode9C1T.mode	@ltx/en_us_goadedes/miscellanea:misc.Mode6
ltx/en_us_goadedes/pe.d119:peMA.Ode9C1T.ode	@ltx/en_us_goadedes/miscellanea:misc.Ode9
ltx/en_us_goadedes/pe.d119:peMA.Ode9C1T.text	
ltx/en_us_goadedes/pe.d119:peMA.Oikos1.text	@ltx/en_us_goadedes/tr.d014:trMA.Oikos1.text
ltx/en_us_goadedes/pe.d119:peSY.commemoration.narration.p01	
ltx/en_us_goadedes/pe.d119:peSY.commemoration.narration.p02	
ltx/en_us_goadedes/pe.d119:peSY.commemoration.narration.p03	
ltx/en_us_goadedes/pe.d119:peSY.commemoration.narration.p04	
ltx/en_us_goadedes/pe.d119:peSY.commemoration.narration.p05	
ltx/en_us_goadedes/pe.d119:peSY.commemoration.narration.p06	
ltx/en_us_goadedes/pe.d119:peSY.commemoration.narration.p07	
ltx/en_us_goadedes/pe.d119:peSY.commemoration.text	
ltx/en_us_goadedes/pe.d119:peSY.lastline	
ltx/en_us_goadedes/pe.d119:peVE.ApolTheotokion.incipit	@ltx/en_us_goadedes/tr.d014:trVE.ApolTheotokion.incipit
ltx/en_us_goadedes/pe.d119:peVE.ApolTheotokion.melody	
ltx/en_us_goadedes/pe.d119:peVE.ApolTheotokion.mode	@ltx/en_us_goadedes/miscellanea:misc.Mode8
ltx/en_us_goadedes/pe.d119:peVE.ApolTheotokion.text	@ltx/en_us_goadedes/tr.d014:trVE.ApolTheotokion.text
ltx/en_us_goadedes/pe.d119:peVE.Apolytikion1.incipit	@ltx/en_us_goadedes/tr.d014:trVE.Apolytikion1.incipit
ltx/en_us_goadedes/pe.d119:peVE.Apolytikion1.melody	
ltx/en_us_goadedes/pe.d119:peVE.Apolytikion1.mode	@ltx/en_us_goadedes/miscellanea:misc.Mode8
ltx/en_us_goadedes/pe.d119:peVE.Apolytikion1.text	@ltx/en_us_goadedes/tr.d014:trVE.Apolytikion1.text
ltx/en_us_goadedes/pe.d119:peVE.Apolytikion2.incipit	@ltx/en_us_goadedes/tr.d014:trVE.Apolytikion2.incipit
ltx/en_us_goadedes/pe.d119:peVE.Apolytikion2.melody	
ltx/en_us_goadedes/pe.d119:peVE.Apolytikion2.mode	@ltx/en_us_goadedes/miscellanea:misc.Mode8
ltx/en_us_goadedes/pe.d119:peVE.Apolytikion2.text	@ltx/en_us_goadedes/tr.d014:trVE.Apolytikion2.text
ltx/en_us_goadedes/pe.d119:peVE.AposBoth.incipit	@ltx/en_us_goadedes/oc.m6.d7:ocVE.AposTheotokion.incipit
ltx/en_us_goadedes/pe.d119:peVE.AposBoth.melody	@ltx/en_us_goadedes/he.a.m6:heAU.TriimerosAnestis.name
ltx/en_us_goadedes/pe.d119:peVE.AposBoth.mode	@ltx/en_us_goadedes/miscellanea:misc.Mode6
ltx/en_us_goadedes/pe.d119:peVE.AposBoth.text	@ltx/en_us_goadedes/oc.m6.d7:ocVE.AposTheotokion.text
ltx/en_us_goadedes/pe.d119:peVE.AposGlory.incipit	@ltx/en_us_goadedes/oc.m6.d7:ocVE.Aposticha2.incipit
ltx/en_us_goadedes/pe.d119:peVE.AposGlory.melody	
ltx/en_us_goadedes/pe.d119:peVE.AposGlory.mode	@ltx/en_us_goadedes/miscellanea:misc.Mode6
ltx/en_us_goadedes/pe.d119:peVE.AposGlory.text	@ltx/en_us_goadedes/oc.m6.d7:ocVE.Aposticha2.text
ltx/en_us_goadedes/pe.d119:peVE.Aposticha1.incipit	@ltx/en_us_goadedes/oc.m6.d5:ocVE.Aposticha3.incipit
ltx/en_us_goadedes/pe.d119:peVE.Aposticha1.melody	
ltx/en_us_goadedes/pe.d119:peVE.Aposticha1.mode	@ltx/en_us_goadedes/miscellanea:misc.Mode6
ltx/en_us_goadedes/pe.d119:peVE.Aposticha1.text	@ltx/en_us_goadedes/oc.m6.d5:ocVE.Aposticha3.text
ltx/en_us_goadedes/pe.d119:peVE.Aposticha2.incipit	@ltx/en_us_goadedes/oc.m6.d7:ocMA.LaudsGlory.incipit
ltx/en_us_goadedes/pe.d119:peVE.Aposticha2.melody	
ltx/en_us_goadedes/pe.d119:peVE.Aposticha2.mode	@ltx/en_us_goadedes/miscellanea:misc.Mode6
ltx/en_us_goadedes/pe.d119:peVE.Aposticha2.text	@ltx/en_us_goadedes/oc.m6.d7:ocMA.LaudsGlory.text
ltx/en_us_goadedes/pe.d119:peVE.Aposticha3.incipit	…
ltx/en_us_goadedes/pe.d119:peVE.Aposticha3.melody	
ltx/en_us_goadedes/pe.d119:peVE.Aposticha3.mode	@ltx/en_us_goadedes/miscellanea:misc.Mode6
ltx/en_us_goadedes/pe.d119:peVE.Aposticha3.text	
ltx/en_us_goadedes/pe.d119:peVE.SticBoth.incipit	@ltx/en_us_goadedes/oc.m6.d1:ocVE.SticTheotokion.incipit
ltx/en_us_goadedes/pe.d119:peVE.SticBoth.melody	
ltx/en_us_goadedes/pe.d119:peVE.SticBoth.mode	@ltx/en_us_goadedes/miscellanea:misc.Mode6
ltx/en_us_goadedes/pe.d119:peVE.SticBoth.text	@ltx/en_us_goadedes/oc.m6.d1:ocVE.SticTheotokion.text
ltx/en_us_goadedes/pe.d119:peVE.SticGlory.incipit	@ltx/en_us_goadedes/tr.d014:trVE.SticGlory.incipit
ltx/en_us_goadedes/pe.d119:peVE.SticGlory.melody	
ltx/en_us_goadedes/pe.d119:peVE.SticGlory.mode	@ltx/en_us_goadedes/miscellanea:misc.Mode8
ltx/en_us_goadedes/pe.d119:peVE.SticGlory.text	@ltx/en_us_goadedes/tr.d014:trVE.SticGlory.text
ltx/en_us_goadedes/pe.d119:peVE.Stichera01.incipit	@ltx/en_us_goadedes/oc.m6.d2:ocVE.Aposticha3.incipit
ltx/en_us_goadedes/pe.d119:peVE.Stichera01.melody	
ltx/en_us_goadedes/pe.d119:peVE.Stichera01.mode	@ltx/en_us_goadedes/miscellanea:misc.Mode6
ltx/en_us_goadedes/pe.d119:peVE.Stichera01.text	@ltx/en_us_goadedes/oc.m6.d2:ocVE.Aposticha3.text
ltx/en_us_goadedes/pe.d119:peVE.Stichera02.incipit	@ltx/en_us_goadedes/oc.m6.d3:ocVE.Aposticha3.incipit
ltx/en_us_goadedes/pe.d119:peVE.Stichera02.melody	
ltx/en_us_goadedes/pe.d119:peVE.Stichera02.mode	@ltx/en_us_goadedes/miscellanea:misc.Mode6
ltx/en_us_goadedes/pe.d119:peVE.Stichera02.text	@ltx/en_us_goadedes/oc.m6.d3:ocVE.Aposticha3.text
ltx/en_us_goadedes/pe.d119:peVE.Stichera03.incipit	@ltx/en_us_goadedes/oc.m6.d4:ocVE.Aposticha3.incipit
ltx/en_us_goadedes/pe.d119:peVE.Stichera03.melody	
ltx/en_us_goadedes/pe.d119:peVE.Stichera03.mode	@ltx/en_us_goadedes/miscellanea:misc.Mode6
ltx/en_us_goadedes/pe.d119:peVE.Stichera03.text	@ltx/en_us_goadedes/oc.m6.d4:ocVE.Aposticha3.text
ltx/en_us_goadedes/pe.d119:peVE.Stichera04.greekmelody	@ltx/en_us_goadedes/he.a.m8:heAU.OEnEdemParadeisos.greekname
ltx/en_us_goadedes/pe.d119:peVE.Stichera04.incipit	@ltx/en_us_goadedes/tr.d014:trVE.Stichera01.incipit
ltx/en_us_goadedes/pe.d119:peVE.Stichera04.melody	@ltx/en_us_goadedes/he.a.m8:heAU.OEnEdemParadeisos.name
ltx/en_us_goadedes/pe.d119:peVE.Stichera04.mode	@ltx/en_us_goadedes/miscellanea:misc.Mode8
ltx/en_us_goadedes/pe.d119:peVE.Stichera04.text	@ltx/en_us_goadedes/tr.d014:trVE.Stichera01.text
ltx/en_us_goadedes/pe.d119:peVE.Stichera05.greekmelody	@ltx/en_us_goadedes/he.a.m8:heAU.OEnEdemParadeisos.greekname
ltx/en_us_goadedes/pe.d119:peVE.Stichera05.incipit	@ltx/en_us_goadedes/tr.d014:trVE.Stichera02.incipit
ltx/en_us_goadedes/pe.d119:peVE.Stichera05.melody	@ltx/en_us_goadedes/he.a.m8:heAU.OEnEdemParadeisos.name
ltx/en_us_goadedes/pe.d119:peVE.Stichera05.mode	@ltx/en_us_goadedes/miscellanea:misc.Mode8
ltx/en_us_goadedes/pe.d119:peVE.Stichera05.text	@ltx/en_us_goadedes/tr.d014:trVE.Stichera02.text
ltx/en_us_goadedes/pe.d119:peVE.Stichera06.incipit	@ltx/en_us_goadedes/tr.d014:trVE.Stichera03.incipit
ltx/en_us_goadedes/pe.d119:peVE.Stichera06.melody	@ltx/en_us_goadedes/he.a.m8:heAU.OEnEdemParadeisos.name
ltx/en_us_goadedes/pe.d119:peVE.Stichera06.mode	@ltx/en_us_goadedes/miscellanea:misc.Mode8
ltx/en_us_goadedes/pe.d119:peVE.Stichera06.text	@ltx/en_us_goadedes/tr.d014:trVE.Stichera03.text
