ltx/en_us_goadedes/me.m03.d10:meDA.commemoration.first	
ltx/en_us_goadedes/me.m03.d10:meDA.commemoration.first_name	
ltx/en_us_goadedes/me.m03.d10:meDA.commemoration.first_short	
ltx/en_us_goadedes/me.m03.d10:meDA.commemoration.first_title	@ltx/en_us_goadedes/titles:ti.Saints
ltx/en_us_goadedes/me.m03.d10:meDA.commemoration.full	
ltx/en_us_goadedes/me.m03.d10:meDA.commemoration.second_name	
ltx/en_us_goadedes/me.m03.d10:meDA.commemoration.second_title	
ltx/en_us_goadedes/me.m03.d10:meDA.date	
ltx/en_us_goadedes/me.m03.d10:meDA.fordate	
ltx/en_us_goadedes/me.m03.d10:meDA.insert1	
ltx/en_us_goadedes/me.m03.d10:meDA.insert2	
ltx/en_us_goadedes/me.m03.d10:meDA.note	
ltx/en_us_goadedes/me.m03.d10:meDA.pdfcoverdate	
ltx/en_us_goadedes/me.m03.d10:meDA.pdfheaderdate	
ltx/en_us_goadedes/me.m03.d10:meHO.commemorations	
ltx/en_us_goadedes/me.m03.d10:meHO.note1	
ltx/en_us_goadedes/me.m03.d10:meHO.note2	
ltx/en_us_goadedes/me.m03.d10:meHO.number	
ltx/en_us_goadedes/me.m03.d10:meHO.rank	
ltx/en_us_goadedes/me.m03.d10:meLE.commemoration1	
ltx/en_us_goadedes/me.m03.d10:meLE.commemoration2	
ltx/en_us_goadedes/me.m03.d10:meLI.Kontakion1.incipit	@ltx/en_us_goadedes/me.m03.d10:meMA.Kontakion1ger.incipit
ltx/en_us_goadedes/me.m03.d10:meLI.Kontakion1.melody	@ltx/en_us_goadedes/me.m03.d10:meMA.Kontakion1ger.melody
ltx/en_us_goadedes/me.m03.d10:meLI.Kontakion1.mode	@ltx/en_us_goadedes/me.m03.d10:meMA.Kontakion1ger.mode
ltx/en_us_goadedes/me.m03.d10:meLI.Kontakion1.text	@ltx/en_us_goadedes/me.m03.d10:meMA.Kontakion1ger.text
ltx/en_us_goadedes/me.m03.d10:meLI.Megalynarion.text	
ltx/en_us_goadedes/me.m03.d10:meMA.C1.poet	@ltx/en_us_goadedes/poets:po.Iosif
ltx/en_us_goadedes/me.m03.d10:meMA.C1.title	@ltx/en_us_goadedes/titles:ti.CanonSaints
ltx/en_us_goadedes/me.m03.d10:meMA.C1.verse	@ltx/en_us_goadedes/prayers:pr.verse_SaintsM.text
ltx/en_us_goadedes/me.m03.d10:meMA.Kontakion1ger.incipit	…
ltx/en_us_goadedes/me.m03.d10:meMA.Kontakion1ger.melody	@ltx/en_us_goadedes/he.a.m4:heAU.EpefanisSimeron.name
ltx/en_us_goadedes/me.m03.d10:meMA.Kontakion1ger.mode	@ltx/en_us_goadedes/miscellanea:misc.Mode4
ltx/en_us_goadedes/me.m03.d10:meMA.Kontakion1ger.poet	@ltx/en_us_goadedes/poets:po.Gerasimou
ltx/en_us_goadedes/me.m03.d10:meMA.Kontakion1ger.text	
ltx/en_us_goadedes/me.m03.d10:meMA.Ode1C11.greekmelody	@ltx/en_us_goadedes/he.h.m4:heHE.TristatasKrataious.greekname
ltx/en_us_goadedes/me.m03.d10:meMA.Ode1C11.incipit	…
ltx/en_us_goadedes/me.m03.d10:meMA.Ode1C11.melody	@ltx/en_us_goadedes/he.h.m4:heHE.TristatasKrataious.name
ltx/en_us_goadedes/me.m03.d10:meMA.Ode1C11.mode	@ltx/en_us_goadedes/miscellanea:misc.Mode4
ltx/en_us_goadedes/me.m03.d10:meMA.Ode1C11.ode	@ltx/en_us_goadedes/miscellanea:misc.Ode1
ltx/en_us_goadedes/me.m03.d10:meMA.Ode1C11.text	
ltx/en_us_goadedes/me.m03.d10:meMA.Ode1C12.incipit	…
ltx/en_us_goadedes/me.m03.d10:meMA.Ode1C12.melody	@ltx/en_us_goadedes/he.h.m4:heHE.TristatasKrataious.name
ltx/en_us_goadedes/me.m03.d10:meMA.Ode1C12.mode	@ltx/en_us_goadedes/miscellanea:misc.Mode4
ltx/en_us_goadedes/me.m03.d10:meMA.Ode1C12.ode	@ltx/en_us_goadedes/miscellanea:misc.Ode1
ltx/en_us_goadedes/me.m03.d10:meMA.Ode1C12.text	
ltx/en_us_goadedes/me.m03.d10:meMA.Ode1C13.incipit	…
ltx/en_us_goadedes/me.m03.d10:meMA.Ode1C13.melody	@ltx/en_us_goadedes/he.h.m4:heHE.TristatasKrataious.name
ltx/en_us_goadedes/me.m03.d10:meMA.Ode1C13.mode	@ltx/en_us_goadedes/miscellanea:misc.Mode4
ltx/en_us_goadedes/me.m03.d10:meMA.Ode1C13.ode	@ltx/en_us_goadedes/miscellanea:misc.Ode1
ltx/en_us_goadedes/me.m03.d10:meMA.Ode1C13.text	
ltx/en_us_goadedes/me.m03.d10:meMA.Ode1C1H.greekmelody	@ltx/en_us_goadedes/he.h.m4:heHE.TristatasKrataious.greekname
ltx/en_us_goadedes/me.m03.d10:meMA.Ode1C1H.incipit	@ltx/en_us_goadedes/he.h.m4:heHE.TristatasKrataious.incipit
ltx/en_us_goadedes/me.m03.d10:meMA.Ode1C1H.melody	@ltx/en_us_goadedes/he.h.m4:heHE.TristatasKrataious.melody
ltx/en_us_goadedes/me.m03.d10:meMA.Ode1C1H.mode	@ltx/en_us_goadedes/miscellanea:misc.Mode4
ltx/en_us_goadedes/me.m03.d10:meMA.Ode1C1H.ode	@ltx/en_us_goadedes/miscellanea:misc.Ode1
ltx/en_us_goadedes/me.m03.d10:meMA.Ode1C1H.text	@ltx/en_us_goadedes/he.h.m4:heHE.TristatasKrataious.text
ltx/en_us_goadedes/me.m03.d10:meMA.Ode1C1T.incipit	…
ltx/en_us_goadedes/me.m03.d10:meMA.Ode1C1T.melody	@ltx/en_us_goadedes/he.h.m4:heHE.TristatasKrataious.name
ltx/en_us_goadedes/me.m03.d10:meMA.Ode1C1T.mode	@ltx/en_us_goadedes/miscellanea:misc.Mode4
ltx/en_us_goadedes/me.m03.d10:meMA.Ode1C1T.ode	@ltx/en_us_goadedes/miscellanea:misc.Ode1
ltx/en_us_goadedes/me.m03.d10:meMA.Ode1C1T.text	
ltx/en_us_goadedes/me.m03.d10:meMA.Ode3C11.greekmelody	@ltx/en_us_goadedes/he.h.m4:heHE.OtiSteiraEteken.greekname
ltx/en_us_goadedes/me.m03.d10:meMA.Ode3C11.incipit	…
ltx/en_us_goadedes/me.m03.d10:meMA.Ode3C11.melody	@ltx/en_us_goadedes/he.h.m4:heHE.OtiSteiraEteken.name
ltx/en_us_goadedes/me.m03.d10:meMA.Ode3C11.mode	@ltx/en_us_goadedes/miscellanea:misc.Mode4
ltx/en_us_goadedes/me.m03.d10:meMA.Ode3C11.ode	@ltx/en_us_goadedes/miscellanea:misc.Ode3
ltx/en_us_goadedes/me.m03.d10:meMA.Ode3C11.text	
ltx/en_us_goadedes/me.m03.d10:meMA.Ode3C12.incipit	…
ltx/en_us_goadedes/me.m03.d10:meMA.Ode3C12.melody	@ltx/en_us_goadedes/he.h.m4:heHE.OtiSteiraEteken.name
ltx/en_us_goadedes/me.m03.d10:meMA.Ode3C12.mode	@ltx/en_us_goadedes/miscellanea:misc.Mode4
ltx/en_us_goadedes/me.m03.d10:meMA.Ode3C12.ode	@ltx/en_us_goadedes/miscellanea:misc.Ode3
ltx/en_us_goadedes/me.m03.d10:meMA.Ode3C12.text	
ltx/en_us_goadedes/me.m03.d10:meMA.Ode3C13.incipit	…
ltx/en_us_goadedes/me.m03.d10:meMA.Ode3C13.melody	@ltx/en_us_goadedes/he.h.m4:heHE.OtiSteiraEteken.name
ltx/en_us_goadedes/me.m03.d10:meMA.Ode3C13.mode	@ltx/en_us_goadedes/miscellanea:misc.Mode4
ltx/en_us_goadedes/me.m03.d10:meMA.Ode3C13.ode	@ltx/en_us_goadedes/miscellanea:misc.Ode3
ltx/en_us_goadedes/me.m03.d10:meMA.Ode3C13.text	
ltx/en_us_goadedes/me.m03.d10:meMA.Ode3C1H.greekmelody	@ltx/en_us_goadedes/he.h.m4:heHE.OtiSteiraEteken.greekname
ltx/en_us_goadedes/me.m03.d10:meMA.Ode3C1H.incipit	@ltx/en_us_goadedes/he.h.m4:heHE.OtiSteiraEteken.incipit
ltx/en_us_goadedes/me.m03.d10:meMA.Ode3C1H.melody	@ltx/en_us_goadedes/he.h.m4:heHE.OtiSteiraEteken.melody
ltx/en_us_goadedes/me.m03.d10:meMA.Ode3C1H.mode	@ltx/en_us_goadedes/miscellanea:misc.Mode4
ltx/en_us_goadedes/me.m03.d10:meMA.Ode3C1H.ode	@ltx/en_us_goadedes/miscellanea:misc.Ode3
ltx/en_us_goadedes/me.m03.d10:meMA.Ode3C1H.text	@ltx/en_us_goadedes/he.h.m4:heHE.OtiSteiraEteken.text
ltx/en_us_goadedes/me.m03.d10:meMA.Ode3C1T.incipit	…
ltx/en_us_goadedes/me.m03.d10:meMA.Ode3C1T.melody	@ltx/en_us_goadedes/he.h.m4:heHE.OtiSteiraEteken.name
ltx/en_us_goadedes/me.m03.d10:meMA.Ode3C1T.mode	@ltx/en_us_goadedes/miscellanea:misc.Mode4
ltx/en_us_goadedes/me.m03.d10:meMA.Ode3C1T.ode	@ltx/en_us_goadedes/miscellanea:misc.Ode3
ltx/en_us_goadedes/me.m03.d10:meMA.Ode3C1T.text	
ltx/en_us_goadedes/me.m03.d10:meMA.Ode3Kathisma1.greekmelody	@ltx/en_us_goadedes/he.a.m4:heAU.OYpsotheisEnToStavro.greekname
ltx/en_us_goadedes/me.m03.d10:meMA.Ode3Kathisma1.incipit	…
ltx/en_us_goadedes/me.m03.d10:meMA.Ode3Kathisma1.melody	@ltx/en_us_goadedes/he.a.m4:heAU.OYpsotheisEnToStavro.name
ltx/en_us_goadedes/me.m03.d10:meMA.Ode3Kathisma1.mode	@ltx/en_us_goadedes/miscellanea:misc.Mode4
ltx/en_us_goadedes/me.m03.d10:meMA.Ode3Kathisma1.text	
ltx/en_us_goadedes/me.m03.d10:meMA.Ode3KathismaSt.incipit	…
ltx/en_us_goadedes/me.m03.d10:meMA.Ode3KathismaSt.melody	@ltx/en_us_goadedes/he.a.m4:heAU.OYpsotheisEnToStavro.name
ltx/en_us_goadedes/me.m03.d10:meMA.Ode3KathismaSt.mode	@ltx/en_us_goadedes/miscellanea:misc.Mode4
ltx/en_us_goadedes/me.m03.d10:meMA.Ode3KathismaSt.text	
ltx/en_us_goadedes/me.m03.d10:meMA.Ode3KathismaT.incipit	@ltx/en_us_goadedes/ho.ho23:hoCA.Apolytikion2.incipit
ltx/en_us_goadedes/me.m03.d10:meMA.Ode3KathismaT.melody	@ltx/en_us_goadedes/he.a.m4:heAU.OYpsotheisEnToStavro.name
ltx/en_us_goadedes/me.m03.d10:meMA.Ode3KathismaT.mode	@ltx/en_us_goadedes/miscellanea:misc.Mode4
ltx/en_us_goadedes/me.m03.d10:meMA.Ode3KathismaT.text	@ltx/en_us_goadedes/ho.ho23:hoCA.Apolytikion2.text
ltx/en_us_goadedes/me.m03.d10:meMA.Ode4C11.greekmelody	@ltx/en_us_goadedes/he.h.m4:heHE.OKathimenosEnDoxi.greekname
ltx/en_us_goadedes/me.m03.d10:meMA.Ode4C11.incipit	…
ltx/en_us_goadedes/me.m03.d10:meMA.Ode4C11.melody	@ltx/en_us_goadedes/he.h.m4:heHE.OKathimenosEnDoxi.name
ltx/en_us_goadedes/me.m03.d10:meMA.Ode4C11.mode	@ltx/en_us_goadedes/miscellanea:misc.Mode4
ltx/en_us_goadedes/me.m03.d10:meMA.Ode4C11.ode	@ltx/en_us_goadedes/miscellanea:misc.Ode4
ltx/en_us_goadedes/me.m03.d10:meMA.Ode4C11.text	
ltx/en_us_goadedes/me.m03.d10:meMA.Ode4C12.incipit	…
ltx/en_us_goadedes/me.m03.d10:meMA.Ode4C12.melody	@ltx/en_us_goadedes/he.h.m4:heHE.OKathimenosEnDoxi.name
ltx/en_us_goadedes/me.m03.d10:meMA.Ode4C12.mode	@ltx/en_us_goadedes/miscellanea:misc.Mode4
ltx/en_us_goadedes/me.m03.d10:meMA.Ode4C12.ode	@ltx/en_us_goadedes/miscellanea:misc.Ode4
ltx/en_us_goadedes/me.m03.d10:meMA.Ode4C12.text	
ltx/en_us_goadedes/me.m03.d10:meMA.Ode4C13.incipit	…
ltx/en_us_goadedes/me.m03.d10:meMA.Ode4C13.melody	@ltx/en_us_goadedes/he.h.m4:heHE.OKathimenosEnDoxi.name
ltx/en_us_goadedes/me.m03.d10:meMA.Ode4C13.mode	@ltx/en_us_goadedes/miscellanea:misc.Mode4
ltx/en_us_goadedes/me.m03.d10:meMA.Ode4C13.ode	@ltx/en_us_goadedes/miscellanea:misc.Ode4
ltx/en_us_goadedes/me.m03.d10:meMA.Ode4C13.text	
ltx/en_us_goadedes/me.m03.d10:meMA.Ode4C1H.greekmelody	@ltx/en_us_goadedes/he.h.m4:heHE.OKathimenosEnDoxi.greekname
ltx/en_us_goadedes/me.m03.d10:meMA.Ode4C1H.incipit	@ltx/en_us_goadedes/he.h.m4:heHE.OKathimenosEnDoxi.incipit
ltx/en_us_goadedes/me.m03.d10:meMA.Ode4C1H.melody	@ltx/en_us_goadedes/he.h.m4:heHE.OKathimenosEnDoxi.melody
ltx/en_us_goadedes/me.m03.d10:meMA.Ode4C1H.mode	@ltx/en_us_goadedes/miscellanea:misc.Mode4
ltx/en_us_goadedes/me.m03.d10:meMA.Ode4C1H.ode	@ltx/en_us_goadedes/miscellanea:misc.Ode4
ltx/en_us_goadedes/me.m03.d10:meMA.Ode4C1H.text	@ltx/en_us_goadedes/he.h.m4:heHE.OKathimenosEnDoxi.text
ltx/en_us_goadedes/me.m03.d10:meMA.Ode4C1T.incipit	…
ltx/en_us_goadedes/me.m03.d10:meMA.Ode4C1T.melody	@ltx/en_us_goadedes/he.h.m4:heHE.OKathimenosEnDoxi.name
ltx/en_us_goadedes/me.m03.d10:meMA.Ode4C1T.mode	@ltx/en_us_goadedes/miscellanea:misc.Mode4
ltx/en_us_goadedes/me.m03.d10:meMA.Ode4C1T.ode	@ltx/en_us_goadedes/miscellanea:misc.Ode4
ltx/en_us_goadedes/me.m03.d10:meMA.Ode4C1T.text	
ltx/en_us_goadedes/me.m03.d10:meMA.Ode5C11.greekmelody	@ltx/en_us_goadedes/he.h.m4:heHE.TonFotismonSouKyrie.greekname
ltx/en_us_goadedes/me.m03.d10:meMA.Ode5C11.incipit	…
ltx/en_us_goadedes/me.m03.d10:meMA.Ode5C11.melody	@ltx/en_us_goadedes/he.h.m4:heHE.TonFotismonSouKyrie.name
ltx/en_us_goadedes/me.m03.d10:meMA.Ode5C11.mode	@ltx/en_us_goadedes/miscellanea:misc.Mode4
ltx/en_us_goadedes/me.m03.d10:meMA.Ode5C11.ode	@ltx/en_us_goadedes/miscellanea:misc.Ode5
ltx/en_us_goadedes/me.m03.d10:meMA.Ode5C11.text	
ltx/en_us_goadedes/me.m03.d10:meMA.Ode5C12.incipit	…
ltx/en_us_goadedes/me.m03.d10:meMA.Ode5C12.melody	@ltx/en_us_goadedes/he.h.m4:heHE.TonFotismonSouKyrie.name
ltx/en_us_goadedes/me.m03.d10:meMA.Ode5C12.mode	@ltx/en_us_goadedes/miscellanea:misc.Mode4
ltx/en_us_goadedes/me.m03.d10:meMA.Ode5C12.ode	@ltx/en_us_goadedes/miscellanea:misc.Ode5
ltx/en_us_goadedes/me.m03.d10:meMA.Ode5C12.text	
ltx/en_us_goadedes/me.m03.d10:meMA.Ode5C13.incipit	…
ltx/en_us_goadedes/me.m03.d10:meMA.Ode5C13.melody	@ltx/en_us_goadedes/he.h.m4:heHE.TonFotismonSouKyrie.name
ltx/en_us_goadedes/me.m03.d10:meMA.Ode5C13.mode	@ltx/en_us_goadedes/miscellanea:misc.Mode4
ltx/en_us_goadedes/me.m03.d10:meMA.Ode5C13.ode	@ltx/en_us_goadedes/miscellanea:misc.Ode5
ltx/en_us_goadedes/me.m03.d10:meMA.Ode5C13.text	
ltx/en_us_goadedes/me.m03.d10:meMA.Ode5C1H.greekmelody	@ltx/en_us_goadedes/he.h.m4:heHE.TonFotismonSouKyrie.greekname
ltx/en_us_goadedes/me.m03.d10:meMA.Ode5C1H.incipit	@ltx/en_us_goadedes/he.h.m4:heHE.TonFotismonSouKyrie.incipit
ltx/en_us_goadedes/me.m03.d10:meMA.Ode5C1H.melody	@ltx/en_us_goadedes/he.h.m4:heHE.TonFotismonSouKyrie.melody
ltx/en_us_goadedes/me.m03.d10:meMA.Ode5C1H.mode	@ltx/en_us_goadedes/miscellanea:misc.Mode4
ltx/en_us_goadedes/me.m03.d10:meMA.Ode5C1H.ode	@ltx/en_us_goadedes/miscellanea:misc.Ode5
ltx/en_us_goadedes/me.m03.d10:meMA.Ode5C1H.text	@ltx/en_us_goadedes/he.h.m4:heHE.TonFotismonSouKyrie.text
ltx/en_us_goadedes/me.m03.d10:meMA.Ode5C1T.incipit	…
ltx/en_us_goadedes/me.m03.d10:meMA.Ode5C1T.melody	@ltx/en_us_goadedes/he.h.m4:heHE.TonFotismonSouKyrie.name
ltx/en_us_goadedes/me.m03.d10:meMA.Ode5C1T.mode	@ltx/en_us_goadedes/miscellanea:misc.Mode4
ltx/en_us_goadedes/me.m03.d10:meMA.Ode5C1T.ode	@ltx/en_us_goadedes/miscellanea:misc.Ode5
ltx/en_us_goadedes/me.m03.d10:meMA.Ode5C1T.text	
ltx/en_us_goadedes/me.m03.d10:meMA.Ode6C11.greekmelody	@ltx/en_us_goadedes/he.h.m4:heHE.EvoiseProtypon.greekname
ltx/en_us_goadedes/me.m03.d10:meMA.Ode6C11.incipit	…
ltx/en_us_goadedes/me.m03.d10:meMA.Ode6C11.melody	@ltx/en_us_goadedes/he.h.m4:heHE.EvoiseProtypon.name
ltx/en_us_goadedes/me.m03.d10:meMA.Ode6C11.mode	@ltx/en_us_goadedes/miscellanea:misc.Mode4
ltx/en_us_goadedes/me.m03.d10:meMA.Ode6C11.ode	@ltx/en_us_goadedes/miscellanea:misc.Ode6
ltx/en_us_goadedes/me.m03.d10:meMA.Ode6C11.text	
ltx/en_us_goadedes/me.m03.d10:meMA.Ode6C12.incipit	…
ltx/en_us_goadedes/me.m03.d10:meMA.Ode6C12.melody	@ltx/en_us_goadedes/he.h.m4:heHE.EvoiseProtypon.name
ltx/en_us_goadedes/me.m03.d10:meMA.Ode6C12.mode	@ltx/en_us_goadedes/miscellanea:misc.Mode4
ltx/en_us_goadedes/me.m03.d10:meMA.Ode6C12.ode	@ltx/en_us_goadedes/miscellanea:misc.Ode6
ltx/en_us_goadedes/me.m03.d10:meMA.Ode6C12.text	
ltx/en_us_goadedes/me.m03.d10:meMA.Ode6C13.incipit	…
ltx/en_us_goadedes/me.m03.d10:meMA.Ode6C13.melody	@ltx/en_us_goadedes/he.h.m4:heHE.EvoiseProtypon.name
ltx/en_us_goadedes/me.m03.d10:meMA.Ode6C13.mode	@ltx/en_us_goadedes/miscellanea:misc.Mode4
ltx/en_us_goadedes/me.m03.d10:meMA.Ode6C13.ode	@ltx/en_us_goadedes/miscellanea:misc.Ode6
ltx/en_us_goadedes/me.m03.d10:meMA.Ode6C13.text	
ltx/en_us_goadedes/me.m03.d10:meMA.Ode6C1H.greekmelody	@ltx/en_us_goadedes/he.h.m4:heHE.EvoiseProtypon.greekname
ltx/en_us_goadedes/me.m03.d10:meMA.Ode6C1H.incipit	@ltx/en_us_goadedes/he.h.m4:heHE.EvoiseProtypon.incipit
ltx/en_us_goadedes/me.m03.d10:meMA.Ode6C1H.melody	@ltx/en_us_goadedes/he.h.m4:heHE.EvoiseProtypon.melody
ltx/en_us_goadedes/me.m03.d10:meMA.Ode6C1H.mode	@ltx/en_us_goadedes/miscellanea:misc.Mode4
ltx/en_us_goadedes/me.m03.d10:meMA.Ode6C1H.ode	@ltx/en_us_goadedes/miscellanea:misc.Ode6
ltx/en_us_goadedes/me.m03.d10:meMA.Ode6C1H.text	@ltx/en_us_goadedes/he.h.m4:heHE.EvoiseProtypon.text
ltx/en_us_goadedes/me.m03.d10:meMA.Ode6C1T.incipit	…
ltx/en_us_goadedes/me.m03.d10:meMA.Ode6C1T.melody	@ltx/en_us_goadedes/he.h.m4:heHE.EvoiseProtypon.name
ltx/en_us_goadedes/me.m03.d10:meMA.Ode6C1T.mode	@ltx/en_us_goadedes/miscellanea:misc.Mode4
ltx/en_us_goadedes/me.m03.d10:meMA.Ode6C1T.ode	@ltx/en_us_goadedes/miscellanea:misc.Ode6
ltx/en_us_goadedes/me.m03.d10:meMA.Ode6C1T.text	
ltx/en_us_goadedes/me.m03.d10:meMA.Ode7C11.greekmelody	@ltx/en_us_goadedes/he.h.m4:heHE.ODiasosasEnPyri.greekname
ltx/en_us_goadedes/me.m03.d10:meMA.Ode7C11.incipit	…
ltx/en_us_goadedes/me.m03.d10:meMA.Ode7C11.melody	@ltx/en_us_goadedes/he.h.m4:heHE.ODiasosasEnPyri.name
ltx/en_us_goadedes/me.m03.d10:meMA.Ode7C11.mode	@ltx/en_us_goadedes/miscellanea:misc.Mode4
ltx/en_us_goadedes/me.m03.d10:meMA.Ode7C11.ode	@ltx/en_us_goadedes/miscellanea:misc.Ode7
ltx/en_us_goadedes/me.m03.d10:meMA.Ode7C11.text	
ltx/en_us_goadedes/me.m03.d10:meMA.Ode7C12.incipit	…
ltx/en_us_goadedes/me.m03.d10:meMA.Ode7C12.melody	@ltx/en_us_goadedes/he.h.m4:heHE.ODiasosasEnPyri.name
ltx/en_us_goadedes/me.m03.d10:meMA.Ode7C12.mode	@ltx/en_us_goadedes/miscellanea:misc.Mode4
ltx/en_us_goadedes/me.m03.d10:meMA.Ode7C12.ode	@ltx/en_us_goadedes/miscellanea:misc.Ode7
ltx/en_us_goadedes/me.m03.d10:meMA.Ode7C12.text	
ltx/en_us_goadedes/me.m03.d10:meMA.Ode7C13.incipit	…
ltx/en_us_goadedes/me.m03.d10:meMA.Ode7C13.melody	@ltx/en_us_goadedes/he.h.m4:heHE.ODiasosasEnPyri.name
ltx/en_us_goadedes/me.m03.d10:meMA.Ode7C13.mode	@ltx/en_us_goadedes/miscellanea:misc.Mode4
ltx/en_us_goadedes/me.m03.d10:meMA.Ode7C13.ode	@ltx/en_us_goadedes/miscellanea:misc.Ode7
ltx/en_us_goadedes/me.m03.d10:meMA.Ode7C13.text	
ltx/en_us_goadedes/me.m03.d10:meMA.Ode7C1H.greekmelody	@ltx/en_us_goadedes/he.h.m4:heHE.ODiasosasEnPyri.greekname
ltx/en_us_goadedes/me.m03.d10:meMA.Ode7C1H.incipit	@ltx/en_us_goadedes/he.h.m4:heHE.ODiasosasEnPyri.incipit
ltx/en_us_goadedes/me.m03.d10:meMA.Ode7C1H.melody	@ltx/en_us_goadedes/he.h.m4:heHE.ODiasosasEnPyri.melody
ltx/en_us_goadedes/me.m03.d10:meMA.Ode7C1H.mode	@ltx/en_us_goadedes/miscellanea:misc.Mode4
ltx/en_us_goadedes/me.m03.d10:meMA.Ode7C1H.ode	@ltx/en_us_goadedes/miscellanea:misc.Ode7
ltx/en_us_goadedes/me.m03.d10:meMA.Ode7C1H.text	@ltx/en_us_goadedes/he.h.m4:heHE.ODiasosasEnPyri.text
ltx/en_us_goadedes/me.m03.d10:meMA.Ode7C1T.incipit	…
ltx/en_us_goadedes/me.m03.d10:meMA.Ode7C1T.melody	@ltx/en_us_goadedes/he.h.m4:heHE.ODiasosasEnPyri.name
ltx/en_us_goadedes/me.m03.d10:meMA.Ode7C1T.mode	@ltx/en_us_goadedes/miscellanea:misc.Mode4
ltx/en_us_goadedes/me.m03.d10:meMA.Ode7C1T.ode	@ltx/en_us_goadedes/miscellanea:misc.Ode7
ltx/en_us_goadedes/me.m03.d10:meMA.Ode7C1T.text	
ltx/en_us_goadedes/me.m03.d10:meMA.Ode8C11.greekmelody	@ltx/en_us_goadedes/he.h.m4:heHE.LytrotaTouPantos.greekname
ltx/en_us_goadedes/me.m03.d10:meMA.Ode8C11.incipit	…
ltx/en_us_goadedes/me.m03.d10:meMA.Ode8C11.melody	@ltx/en_us_goadedes/he.h.m4:heHE.LytrotaTouPantos.name
ltx/en_us_goadedes/me.m03.d10:meMA.Ode8C11.mode	@ltx/en_us_goadedes/miscellanea:misc.Mode4
ltx/en_us_goadedes/me.m03.d10:meMA.Ode8C11.ode	@ltx/en_us_goadedes/miscellanea:misc.Ode8
ltx/en_us_goadedes/me.m03.d10:meMA.Ode8C11.text	
ltx/en_us_goadedes/me.m03.d10:meMA.Ode8C12.incipit	…
ltx/en_us_goadedes/me.m03.d10:meMA.Ode8C12.melody	@ltx/en_us_goadedes/he.h.m4:heHE.LytrotaTouPantos.name
ltx/en_us_goadedes/me.m03.d10:meMA.Ode8C12.mode	@ltx/en_us_goadedes/miscellanea:misc.Mode4
ltx/en_us_goadedes/me.m03.d10:meMA.Ode8C12.ode	@ltx/en_us_goadedes/miscellanea:misc.Ode8
ltx/en_us_goadedes/me.m03.d10:meMA.Ode8C12.text	
ltx/en_us_goadedes/me.m03.d10:meMA.Ode8C13.incipit	…
ltx/en_us_goadedes/me.m03.d10:meMA.Ode8C13.melody	@ltx/en_us_goadedes/he.h.m4:heHE.LytrotaTouPantos.name
ltx/en_us_goadedes/me.m03.d10:meMA.Ode8C13.mode	@ltx/en_us_goadedes/miscellanea:misc.Mode4
ltx/en_us_goadedes/me.m03.d10:meMA.Ode8C13.ode	@ltx/en_us_goadedes/miscellanea:misc.Ode8
ltx/en_us_goadedes/me.m03.d10:meMA.Ode8C13.text	
ltx/en_us_goadedes/me.m03.d10:meMA.Ode8C1H.greekmelody	@ltx/en_us_goadedes/he.h.m4:heHE.LytrotaTouPantos.greekname
ltx/en_us_goadedes/me.m03.d10:meMA.Ode8C1H.incipit	@ltx/en_us_goadedes/he.h.m4:heHE.LytrotaTouPantos.incipit
ltx/en_us_goadedes/me.m03.d10:meMA.Ode8C1H.melody	@ltx/en_us_goadedes/he.h.m4:heHE.LytrotaTouPantos.melody
ltx/en_us_goadedes/me.m03.d10:meMA.Ode8C1H.mode	@ltx/en_us_goadedes/miscellanea:misc.Mode4
ltx/en_us_goadedes/me.m03.d10:meMA.Ode8C1H.ode	@ltx/en_us_goadedes/miscellanea:misc.Ode8
ltx/en_us_goadedes/me.m03.d10:meMA.Ode8C1H.text	@ltx/en_us_goadedes/he.h.m4:heHE.LytrotaTouPantos.text
ltx/en_us_goadedes/me.m03.d10:meMA.Ode8C1T.incipit	…
ltx/en_us_goadedes/me.m03.d10:meMA.Ode8C1T.melody	@ltx/en_us_goadedes/he.h.m4:heHE.LytrotaTouPantos.name
ltx/en_us_goadedes/me.m03.d10:meMA.Ode8C1T.mode	@ltx/en_us_goadedes/miscellanea:misc.Mode4
ltx/en_us_goadedes/me.m03.d10:meMA.Ode8C1T.ode	@ltx/en_us_goadedes/miscellanea:misc.Ode8
ltx/en_us_goadedes/me.m03.d10:meMA.Ode8C1T.text	
ltx/en_us_goadedes/me.m03.d10:meMA.Ode9C11.greekmelody	@ltx/en_us_goadedes/he.h.m4:heHE.EvaMenToTisParakois.greekname
ltx/en_us_goadedes/me.m03.d10:meMA.Ode9C11.incipit	…
ltx/en_us_goadedes/me.m03.d10:meMA.Ode9C11.melody	@ltx/en_us_goadedes/he.h.m4:heHE.EvaMenToTisParakois.name
ltx/en_us_goadedes/me.m03.d10:meMA.Ode9C11.mode	@ltx/en_us_goadedes/miscellanea:misc.Mode4
ltx/en_us_goadedes/me.m03.d10:meMA.Ode9C11.ode	@ltx/en_us_goadedes/miscellanea:misc.Ode9
ltx/en_us_goadedes/me.m03.d10:meMA.Ode9C11.text	
ltx/en_us_goadedes/me.m03.d10:meMA.Ode9C12.incipit	…
ltx/en_us_goadedes/me.m03.d10:meMA.Ode9C12.melody	@ltx/en_us_goadedes/he.h.m4:heHE.EvaMenToTisParakois.name
ltx/en_us_goadedes/me.m03.d10:meMA.Ode9C12.mode	@ltx/en_us_goadedes/miscellanea:misc.Mode4
ltx/en_us_goadedes/me.m03.d10:meMA.Ode9C12.ode	@ltx/en_us_goadedes/miscellanea:misc.Ode9
ltx/en_us_goadedes/me.m03.d10:meMA.Ode9C12.text	
ltx/en_us_goadedes/me.m03.d10:meMA.Ode9C13.incipit	…
ltx/en_us_goadedes/me.m03.d10:meMA.Ode9C13.melody	@ltx/en_us_goadedes/he.h.m4:heHE.EvaMenToTisParakois.name
ltx/en_us_goadedes/me.m03.d10:meMA.Ode9C13.mode	@ltx/en_us_goadedes/miscellanea:misc.Mode4
ltx/en_us_goadedes/me.m03.d10:meMA.Ode9C13.ode	@ltx/en_us_goadedes/miscellanea:misc.Ode9
ltx/en_us_goadedes/me.m03.d10:meMA.Ode9C13.text	
ltx/en_us_goadedes/me.m03.d10:meMA.Ode9C14.incipit	…
ltx/en_us_goadedes/me.m03.d10:meMA.Ode9C14.melody	@ltx/en_us_goadedes/he.h.m4:heHE.EvaMenToTisParakois.name
ltx/en_us_goadedes/me.m03.d10:meMA.Ode9C14.mode	@ltx/en_us_goadedes/miscellanea:misc.Mode4
ltx/en_us_goadedes/me.m03.d10:meMA.Ode9C14.ode	@ltx/en_us_goadedes/miscellanea:misc.Ode9
ltx/en_us_goadedes/me.m03.d10:meMA.Ode9C14.text	
ltx/en_us_goadedes/me.m03.d10:meMA.Ode9C1H.greekmelody	@ltx/en_us_goadedes/he.h.m4:heHE.EvaMenToTisParakois.greekname
ltx/en_us_goadedes/me.m03.d10:meMA.Ode9C1H.incipit	@ltx/en_us_goadedes/he.h.m4:heHE.EvaMenToTisParakois.incipit
ltx/en_us_goadedes/me.m03.d10:meMA.Ode9C1H.melody	@ltx/en_us_goadedes/he.h.m4:heHE.EvaMenToTisParakois.melody
ltx/en_us_goadedes/me.m03.d10:meMA.Ode9C1H.mode	@ltx/en_us_goadedes/miscellanea:misc.Mode4
ltx/en_us_goadedes/me.m03.d10:meMA.Ode9C1H.ode	@ltx/en_us_goadedes/miscellanea:misc.Ode9
ltx/en_us_goadedes/me.m03.d10:meMA.Ode9C1H.text	@ltx/en_us_goadedes/he.h.m4:heHE.EvaMenToTisParakois.text
ltx/en_us_goadedes/me.m03.d10:meMA.Ode9C1T.incipit	…
ltx/en_us_goadedes/me.m03.d10:meMA.Ode9C1T.melody	@ltx/en_us_goadedes/he.h.m4:heHE.EvaMenToTisParakois.name
ltx/en_us_goadedes/me.m03.d10:meMA.Ode9C1T.mode	@ltx/en_us_goadedes/miscellanea:misc.Mode4
ltx/en_us_goadedes/me.m03.d10:meMA.Ode9C1T.ode	@ltx/en_us_goadedes/miscellanea:misc.Ode9
ltx/en_us_goadedes/me.m03.d10:meMA.Ode9C1T.text	
ltx/en_us_goadedes/me.m03.d10:meVE.Apolytikion1ger.greekmelody	@ltx/en_us_goadedes/he.a.m1:heAU.TonTafonSouSotir.greekname
ltx/en_us_goadedes/me.m03.d10:meVE.Apolytikion1ger.incipit	…
ltx/en_us_goadedes/me.m03.d10:meVE.Apolytikion1ger.melody	@ltx/en_us_goadedes/he.a.m1:heAU.TonTafonSouSotir.name
ltx/en_us_goadedes/me.m03.d10:meVE.Apolytikion1ger.mode	@ltx/en_us_goadedes/miscellanea:misc.Mode1
ltx/en_us_goadedes/me.m03.d10:meVE.Apolytikion1ger.poet	@ltx/en_us_goadedes/poets:po.Gerasimou
ltx/en_us_goadedes/me.m03.d10:meVE.Apolytikion1ger.text	
ltx/en_us_goadedes/me.m03.d10:meVE.SticStavrotheotokion.greekmelody	@ltx/en_us_goadedes/he.a.m1:heAU.PaneffimoiMartyres.greekname
ltx/en_us_goadedes/me.m03.d10:meVE.SticStavrotheotokion.incipit	@ltx/en_us_goadedes/oc.m1.d4:ocVE.SticTheotokion.incipit
ltx/en_us_goadedes/me.m03.d10:meVE.SticStavrotheotokion.melody	@ltx/en_us_goadedes/he.a.m1:heAU.PaneffimoiMartyres.name
ltx/en_us_goadedes/me.m03.d10:meVE.SticStavrotheotokion.mode	@ltx/en_us_goadedes/miscellanea:misc.Mode1
ltx/en_us_goadedes/me.m03.d10:meVE.SticStavrotheotokion.text	@ltx/en_us_goadedes/oc.m1.d4:ocVE.SticTheotokion.text
ltx/en_us_goadedes/me.m03.d10:meVE.SticTheotokion.greekmelody	@ltx/en_us_goadedes/he.a.m1:heAU.PaneffimoiMartyres.greekname
ltx/en_us_goadedes/me.m03.d10:meVE.SticTheotokion.incipit	@ltx/en_us_goadedes/me.m03.d05:meVE.SticTheotokion.incipit
ltx/en_us_goadedes/me.m03.d10:meVE.SticTheotokion.melody	@ltx/en_us_goadedes/he.a.m1:heAU.PaneffimoiMartyres.name
ltx/en_us_goadedes/me.m03.d10:meVE.SticTheotokion.mode	@ltx/en_us_goadedes/miscellanea:misc.Mode1
ltx/en_us_goadedes/me.m03.d10:meVE.SticTheotokion.text	@ltx/en_us_goadedes/me.m03.d05:meVE.SticTheotokion.text
ltx/en_us_goadedes/me.m03.d10:meVE.Stichera01.greekmelody	@ltx/en_us_goadedes/he.a.m1:heAU.PaneffimoiMartyres.greekname
ltx/en_us_goadedes/me.m03.d10:meVE.Stichera01.incipit	…
ltx/en_us_goadedes/me.m03.d10:meVE.Stichera01.melody	@ltx/en_us_goadedes/he.a.m1:heAU.PaneffimoiMartyres.name
ltx/en_us_goadedes/me.m03.d10:meVE.Stichera01.mode	@ltx/en_us_goadedes/miscellanea:misc.Mode1
ltx/en_us_goadedes/me.m03.d10:meVE.Stichera01.text	
ltx/en_us_goadedes/me.m03.d10:meVE.Stichera02.incipit	…
ltx/en_us_goadedes/me.m03.d10:meVE.Stichera02.melody	@ltx/en_us_goadedes/he.a.m1:heAU.PaneffimoiMartyres.name
ltx/en_us_goadedes/me.m03.d10:meVE.Stichera02.mode	@ltx/en_us_goadedes/miscellanea:misc.Mode1
ltx/en_us_goadedes/me.m03.d10:meVE.Stichera02.text	
ltx/en_us_goadedes/me.m03.d10:meVE.Stichera03.incipit	…
ltx/en_us_goadedes/me.m03.d10:meVE.Stichera03.melody	@ltx/en_us_goadedes/he.a.m1:heAU.PaneffimoiMartyres.name
ltx/en_us_goadedes/me.m03.d10:meVE.Stichera03.mode	@ltx/en_us_goadedes/miscellanea:misc.Mode1
ltx/en_us_goadedes/me.m03.d10:meVE.Stichera03.text	
