ltx/en_us_goadedes/tr.d044:trCO.header	
ltx/en_us_goadedes/tr.d044:trDA.commemoration.full	
ltx/en_us_goadedes/tr.d044:trDA.commemoration.short	
ltx/en_us_goadedes/tr.d044:trDA.insert1	
ltx/en_us_goadedes/tr.d044:trDA.insert2	
ltx/en_us_goadedes/tr.d044:trDA.note	
ltx/en_us_goadedes/tr.d044:trDA.title	
ltx/en_us_goadedes/tr.d044:trHO.commemorations	
ltx/en_us_goadedes/tr.d044:trHO.daytitle	
ltx/en_us_goadedes/tr.d044:trHO.description1	
ltx/en_us_goadedes/tr.d044:trHO.description2	
ltx/en_us_goadedes/tr.d044:trHO.note1	
ltx/en_us_goadedes/tr.d044:trHO.note2	
ltx/en_us_goadedes/tr.d044:trMA.AposIdiomelon1.incipit	…
ltx/en_us_goadedes/tr.d044:trMA.AposIdiomelon1.melody	@ltx/en_us_goadedes/miscellanea:misc.Idiomelon
ltx/en_us_goadedes/tr.d044:trMA.AposIdiomelon1.mode	@ltx/en_us_goadedes/miscellanea:misc.Mode6
ltx/en_us_goadedes/tr.d044:trMA.AposIdiomelon1.text	
ltx/en_us_goadedes/tr.d044:trMA.AposMartyric.incipit	…
ltx/en_us_goadedes/tr.d044:trMA.AposMartyric.melody	
ltx/en_us_goadedes/tr.d044:trMA.AposMartyric.mode	@ltx/en_us_goadedes/miscellanea:misc.Mode6
ltx/en_us_goadedes/tr.d044:trMA.AposMartyric.text	
ltx/en_us_goadedes/tr.d044:trMA.AposTheotokion.incipit	…
ltx/en_us_goadedes/tr.d044:trMA.AposTheotokion.melody	
ltx/en_us_goadedes/tr.d044:trMA.AposTheotokion.mode	@ltx/en_us_goadedes/miscellanea:misc.Mode6
ltx/en_us_goadedes/tr.d044:trMA.AposTheotokion.text	
ltx/en_us_goadedes/tr.d044:trMA.C1.poet	@ltx/en_us_goadedes/poets:po.KyriouIoannou
ltx/en_us_goadedes/tr.d044:trMA.C1.title	
ltx/en_us_goadedes/tr.d044:trMA.C1.verse	
ltx/en_us_goadedes/tr.d044:trMA.C2.poet	@ltx/en_us_goadedes/poets:po.KyriouTheodorou
ltx/en_us_goadedes/tr.d044:trMA.C2.title	
ltx/en_us_goadedes/tr.d044:trMA.C2.verse	
ltx/en_us_goadedes/tr.d044:trMA.Kathisma21.greekmelody	@ltx/en_us_goadedes/he.a.m8:heAU.AnestisEkNekron.greekname
ltx/en_us_goadedes/tr.d044:trMA.Kathisma21.incipit	…
ltx/en_us_goadedes/tr.d044:trMA.Kathisma21.melody	@ltx/en_us_goadedes/he.a.m8:heAU.AnestisEkNekron.name
ltx/en_us_goadedes/tr.d044:trMA.Kathisma21.mode	@ltx/en_us_goadedes/miscellanea:misc.Mode8
ltx/en_us_goadedes/tr.d044:trMA.Kathisma21.text	
ltx/en_us_goadedes/tr.d044:trMA.Kathisma22.greekmelody	@ltx/en_us_goadedes/he.a.m8:heAU.AnestisEkNekron.greekname
ltx/en_us_goadedes/tr.d044:trMA.Kathisma22.incipit	…
ltx/en_us_goadedes/tr.d044:trMA.Kathisma22.melody	@ltx/en_us_goadedes/he.a.m8:heAU.AnestisEkNekron.name
ltx/en_us_goadedes/tr.d044:trMA.Kathisma22.mode	@ltx/en_us_goadedes/miscellanea:misc.Mode8
ltx/en_us_goadedes/tr.d044:trMA.Kathisma22.text	
ltx/en_us_goadedes/tr.d044:trMA.Kathisma31.greekmelody	@ltx/en_us_goadedes/he.a.m3:heAU.TinOraiotita.greekname
ltx/en_us_goadedes/tr.d044:trMA.Kathisma31.incipit	…
ltx/en_us_goadedes/tr.d044:trMA.Kathisma31.melody	@ltx/en_us_goadedes/he.a.m3:heAU.TinOraiotita.name
ltx/en_us_goadedes/tr.d044:trMA.Kathisma31.mode	@ltx/en_us_goadedes/miscellanea:misc.Mode3
ltx/en_us_goadedes/tr.d044:trMA.Kathisma31.text	
ltx/en_us_goadedes/tr.d044:trMA.Kathisma32.greekmelody	@ltx/en_us_goadedes/he.a.m3:heAU.TinOraiotita.greekname
ltx/en_us_goadedes/tr.d044:trMA.Kathisma32.incipit	@ltx/en_us_goadedes/oc.m3.d5:octrMA.Kathisma1T.incipit
ltx/en_us_goadedes/tr.d044:trMA.Kathisma32.melody	@ltx/en_us_goadedes/he.a.m3:heAU.TinOraiotita.name
ltx/en_us_goadedes/tr.d044:trMA.Kathisma32.mode	@ltx/en_us_goadedes/miscellanea:misc.Mode3
ltx/en_us_goadedes/tr.d044:trMA.Kathisma32.text	@ltx/en_us_goadedes/oc.m3.d5:octrMA.Kathisma1T.text
ltx/en_us_goadedes/tr.d044:trMA.Ode1C11.greekmelody	@ltx/en_us_goadedes/he.h.m8:heHE.ArmatilatinFarao.greekname
ltx/en_us_goadedes/tr.d044:trMA.Ode1C11.incipit	…
ltx/en_us_goadedes/tr.d044:trMA.Ode1C11.melody	@ltx/en_us_goadedes/he.h.m8:heHE.ArmatilatinFarao.name
ltx/en_us_goadedes/tr.d044:trMA.Ode1C11.mode	@ltx/en_us_goadedes/miscellanea:misc.Mode8
ltx/en_us_goadedes/tr.d044:trMA.Ode1C11.ode	@ltx/en_us_goadedes/miscellanea:misc.Ode1
ltx/en_us_goadedes/tr.d044:trMA.Ode1C11.text	
ltx/en_us_goadedes/tr.d044:trMA.Ode1C12.incipit	…
ltx/en_us_goadedes/tr.d044:trMA.Ode1C12.melody	@ltx/en_us_goadedes/he.h.m8:heHE.ArmatilatinFarao.name
ltx/en_us_goadedes/tr.d044:trMA.Ode1C12.mode	@ltx/en_us_goadedes/miscellanea:misc.Mode8
ltx/en_us_goadedes/tr.d044:trMA.Ode1C12.ode	@ltx/en_us_goadedes/miscellanea:misc.Ode1
ltx/en_us_goadedes/tr.d044:trMA.Ode1C12.text	
ltx/en_us_goadedes/tr.d044:trMA.Ode1C13.incipit	…
ltx/en_us_goadedes/tr.d044:trMA.Ode1C13.melody	@ltx/en_us_goadedes/he.h.m8:heHE.ArmatilatinFarao.name
ltx/en_us_goadedes/tr.d044:trMA.Ode1C13.mode	@ltx/en_us_goadedes/miscellanea:misc.Mode8
ltx/en_us_goadedes/tr.d044:trMA.Ode1C13.ode	@ltx/en_us_goadedes/miscellanea:misc.Ode1
ltx/en_us_goadedes/tr.d044:trMA.Ode1C13.text	
ltx/en_us_goadedes/tr.d044:trMA.Ode1C1T.incipit	…
ltx/en_us_goadedes/tr.d044:trMA.Ode1C1T.melody	@ltx/en_us_goadedes/he.h.m8:heHE.ArmatilatinFarao.name
ltx/en_us_goadedes/tr.d044:trMA.Ode1C1T.mode	@ltx/en_us_goadedes/miscellanea:misc.Mode8
ltx/en_us_goadedes/tr.d044:trMA.Ode1C1T.ode	@ltx/en_us_goadedes/miscellanea:misc.Ode1
ltx/en_us_goadedes/tr.d044:trMA.Ode1C1T.text	
ltx/en_us_goadedes/tr.d044:trMA.Ode1C21.greekmelody	@ltx/en_us_goadedes/he.h.m3:heHE.AsomenToKyrio.greekname
ltx/en_us_goadedes/tr.d044:trMA.Ode1C21.incipit	…
ltx/en_us_goadedes/tr.d044:trMA.Ode1C21.melody	@ltx/en_us_goadedes/he.h.m3:heHE.AsomenToKyrio.name
ltx/en_us_goadedes/tr.d044:trMA.Ode1C21.mode	@ltx/en_us_goadedes/miscellanea:misc.Mode3
ltx/en_us_goadedes/tr.d044:trMA.Ode1C21.ode	@ltx/en_us_goadedes/miscellanea:misc.Ode1
ltx/en_us_goadedes/tr.d044:trMA.Ode1C21.text	
ltx/en_us_goadedes/tr.d044:trMA.Ode1C22.incipit	…
ltx/en_us_goadedes/tr.d044:trMA.Ode1C22.melody	@ltx/en_us_goadedes/he.h.m3:heHE.AsomenToKyrio.name
ltx/en_us_goadedes/tr.d044:trMA.Ode1C22.mode	@ltx/en_us_goadedes/miscellanea:misc.Mode3
ltx/en_us_goadedes/tr.d044:trMA.Ode1C22.ode	@ltx/en_us_goadedes/miscellanea:misc.Ode1
ltx/en_us_goadedes/tr.d044:trMA.Ode1C22.text	
ltx/en_us_goadedes/tr.d044:trMA.Ode1C2A1.incipit	…
ltx/en_us_goadedes/tr.d044:trMA.Ode1C2A1.melody	@ltx/en_us_goadedes/he.h.m3:heHE.AsomenToKyrio.name
ltx/en_us_goadedes/tr.d044:trMA.Ode1C2A1.mode	@ltx/en_us_goadedes/miscellanea:misc.Mode3
ltx/en_us_goadedes/tr.d044:trMA.Ode1C2A1.ode	@ltx/en_us_goadedes/miscellanea:misc.Ode1
ltx/en_us_goadedes/tr.d044:trMA.Ode1C2A1.text	
ltx/en_us_goadedes/tr.d044:trMA.Ode1C2H.greekmelody	@ltx/en_us_goadedes/he.h.m3:heHE.AsomenToKyrio.greekname
ltx/en_us_goadedes/tr.d044:trMA.Ode1C2H.incipit	@ltx/en_us_goadedes/he.h.m3:heHE.AsomenToKyrio.incipit
ltx/en_us_goadedes/tr.d044:trMA.Ode1C2H.melody	@ltx/en_us_goadedes/he.h.m3:heHE.AsomenToKyrio.melody
ltx/en_us_goadedes/tr.d044:trMA.Ode1C2H.mode	@ltx/en_us_goadedes/miscellanea:misc.Mode3
ltx/en_us_goadedes/tr.d044:trMA.Ode1C2H.ode	@ltx/en_us_goadedes/miscellanea:misc.Ode1
ltx/en_us_goadedes/tr.d044:trMA.Ode1C2H.text	@ltx/en_us_goadedes/he.h.m3:heHE.AsomenToKyrio.text
ltx/en_us_goadedes/tr.d044:trMA.Ode1C2T.incipit	…
ltx/en_us_goadedes/tr.d044:trMA.Ode1C2T.melody	@ltx/en_us_goadedes/he.h.m3:heHE.AsomenToKyrio.name
ltx/en_us_goadedes/tr.d044:trMA.Ode1C2T.mode	@ltx/en_us_goadedes/miscellanea:misc.Mode3
ltx/en_us_goadedes/tr.d044:trMA.Ode1C2T.ode	@ltx/en_us_goadedes/miscellanea:misc.Ode1
ltx/en_us_goadedes/tr.d044:trMA.Ode1C2T.text	
ltx/en_us_goadedes/tr.d044:trMA.Ode1C2Tr.incipit	…
ltx/en_us_goadedes/tr.d044:trMA.Ode1C2Tr.melody	@ltx/en_us_goadedes/he.h.m3:heHE.AsomenToKyrio.name
ltx/en_us_goadedes/tr.d044:trMA.Ode1C2Tr.mode	@ltx/en_us_goadedes/miscellanea:misc.Mode3
ltx/en_us_goadedes/tr.d044:trMA.Ode1C2Tr.ode	@ltx/en_us_goadedes/miscellanea:misc.Ode1
ltx/en_us_goadedes/tr.d044:trMA.Ode1C2Tr.text	
ltx/en_us_goadedes/tr.d044:trMA.Ode8C11.greekmelody	@ltx/en_us_goadedes/he.h.m8:heHE.EptaplasiosKaminon.greekname
ltx/en_us_goadedes/tr.d044:trMA.Ode8C11.incipit	…
ltx/en_us_goadedes/tr.d044:trMA.Ode8C11.melody	@ltx/en_us_goadedes/he.h.m8:heHE.EptaplasiosKaminon.name
ltx/en_us_goadedes/tr.d044:trMA.Ode8C11.mode	@ltx/en_us_goadedes/miscellanea:misc.Mode8
ltx/en_us_goadedes/tr.d044:trMA.Ode8C11.ode	@ltx/en_us_goadedes/miscellanea:misc.Ode8
ltx/en_us_goadedes/tr.d044:trMA.Ode8C11.text	
ltx/en_us_goadedes/tr.d044:trMA.Ode8C12.incipit	…
ltx/en_us_goadedes/tr.d044:trMA.Ode8C12.melody	@ltx/en_us_goadedes/he.h.m8:heHE.EptaplasiosKaminon.name
ltx/en_us_goadedes/tr.d044:trMA.Ode8C12.mode	@ltx/en_us_goadedes/miscellanea:misc.Mode8
ltx/en_us_goadedes/tr.d044:trMA.Ode8C12.ode	@ltx/en_us_goadedes/miscellanea:misc.Ode8
ltx/en_us_goadedes/tr.d044:trMA.Ode8C12.text	
ltx/en_us_goadedes/tr.d044:trMA.Ode8C13.incipit	…
ltx/en_us_goadedes/tr.d044:trMA.Ode8C13.melody	@ltx/en_us_goadedes/he.h.m8:heHE.EptaplasiosKaminon.name
ltx/en_us_goadedes/tr.d044:trMA.Ode8C13.mode	@ltx/en_us_goadedes/miscellanea:misc.Mode8
ltx/en_us_goadedes/tr.d044:trMA.Ode8C13.ode	@ltx/en_us_goadedes/miscellanea:misc.Ode8
ltx/en_us_goadedes/tr.d044:trMA.Ode8C13.text	
ltx/en_us_goadedes/tr.d044:trMA.Ode8C1T.incipit	…
ltx/en_us_goadedes/tr.d044:trMA.Ode8C1T.melody	@ltx/en_us_goadedes/he.h.m8:heHE.EptaplasiosKaminon.name
ltx/en_us_goadedes/tr.d044:trMA.Ode8C1T.mode	@ltx/en_us_goadedes/miscellanea:misc.Mode8
ltx/en_us_goadedes/tr.d044:trMA.Ode8C1T.ode	@ltx/en_us_goadedes/miscellanea:misc.Ode8
ltx/en_us_goadedes/tr.d044:trMA.Ode8C1T.text	
ltx/en_us_goadedes/tr.d044:trMA.Ode8C21.greekmelody	@ltx/en_us_goadedes/he.h.m3:heHE.TonYpAngelon.greekname
ltx/en_us_goadedes/tr.d044:trMA.Ode8C21.incipit	…
ltx/en_us_goadedes/tr.d044:trMA.Ode8C21.melody	@ltx/en_us_goadedes/he.h.m3:heHE.TonYpAngelon.name
ltx/en_us_goadedes/tr.d044:trMA.Ode8C21.mode	@ltx/en_us_goadedes/miscellanea:misc.Mode3
ltx/en_us_goadedes/tr.d044:trMA.Ode8C21.ode	@ltx/en_us_goadedes/miscellanea:misc.Ode8
ltx/en_us_goadedes/tr.d044:trMA.Ode8C21.text	
ltx/en_us_goadedes/tr.d044:trMA.Ode8C22.incipit	…
ltx/en_us_goadedes/tr.d044:trMA.Ode8C22.melody	@ltx/en_us_goadedes/he.h.m3:heHE.TonYpAngelon.name
ltx/en_us_goadedes/tr.d044:trMA.Ode8C22.mode	@ltx/en_us_goadedes/miscellanea:misc.Mode3
ltx/en_us_goadedes/tr.d044:trMA.Ode8C22.ode	@ltx/en_us_goadedes/miscellanea:misc.Ode8
ltx/en_us_goadedes/tr.d044:trMA.Ode8C22.text	
ltx/en_us_goadedes/tr.d044:trMA.Ode8C2A1.incipit	…
ltx/en_us_goadedes/tr.d044:trMA.Ode8C2A1.melody	@ltx/en_us_goadedes/he.h.m3:heHE.TonYpAngelon.name
ltx/en_us_goadedes/tr.d044:trMA.Ode8C2A1.mode	@ltx/en_us_goadedes/miscellanea:misc.Mode3
ltx/en_us_goadedes/tr.d044:trMA.Ode8C2A1.ode	@ltx/en_us_goadedes/miscellanea:misc.Ode8
ltx/en_us_goadedes/tr.d044:trMA.Ode8C2A1.text	
ltx/en_us_goadedes/tr.d044:trMA.Ode8C2H.greekmelody	@ltx/en_us_goadedes/he.h.m3:heHE.TonYpAngelon.greekname
ltx/en_us_goadedes/tr.d044:trMA.Ode8C2H.incipit	@ltx/en_us_goadedes/he.h.m3:heHE.TonYpAngelon.incipit
ltx/en_us_goadedes/tr.d044:trMA.Ode8C2H.melody	@ltx/en_us_goadedes/he.h.m3:heHE.TonYpAngelon.melody
ltx/en_us_goadedes/tr.d044:trMA.Ode8C2H.mode	@ltx/en_us_goadedes/miscellanea:misc.Mode3
ltx/en_us_goadedes/tr.d044:trMA.Ode8C2H.ode	@ltx/en_us_goadedes/miscellanea:misc.Ode8
ltx/en_us_goadedes/tr.d044:trMA.Ode8C2H.text	@ltx/en_us_goadedes/he.h.m3:heHE.TonYpAngelon.text
ltx/en_us_goadedes/tr.d044:trMA.Ode8C2T.incipit	…
ltx/en_us_goadedes/tr.d044:trMA.Ode8C2T.melody	@ltx/en_us_goadedes/he.h.m3:heHE.TonYpAngelon.name
ltx/en_us_goadedes/tr.d044:trMA.Ode8C2T.mode	@ltx/en_us_goadedes/miscellanea:misc.Mode3
ltx/en_us_goadedes/tr.d044:trMA.Ode8C2T.ode	@ltx/en_us_goadedes/miscellanea:misc.Ode8
ltx/en_us_goadedes/tr.d044:trMA.Ode8C2T.text	
ltx/en_us_goadedes/tr.d044:trMA.Ode8C2Tr.incipit	…
ltx/en_us_goadedes/tr.d044:trMA.Ode8C2Tr.melody	@ltx/en_us_goadedes/he.h.m3:heHE.TonYpAngelon.name
ltx/en_us_goadedes/tr.d044:trMA.Ode8C2Tr.mode	@ltx/en_us_goadedes/miscellanea:misc.Mode3
ltx/en_us_goadedes/tr.d044:trMA.Ode8C2Tr.ode	@ltx/en_us_goadedes/miscellanea:misc.Ode8
ltx/en_us_goadedes/tr.d044:trMA.Ode8C2Tr.text	
ltx/en_us_goadedes/tr.d044:trMA.Ode9C11.greekmelody	@ltx/en_us_goadedes/he.h.m8:heHE.EfrixePasaAkoi.greekname
ltx/en_us_goadedes/tr.d044:trMA.Ode9C11.incipit	…
ltx/en_us_goadedes/tr.d044:trMA.Ode9C11.melody	@ltx/en_us_goadedes/he.h.m8:heHE.EfrixePasaAkoi.name
ltx/en_us_goadedes/tr.d044:trMA.Ode9C11.mode	@ltx/en_us_goadedes/miscellanea:misc.Mode8
ltx/en_us_goadedes/tr.d044:trMA.Ode9C11.ode	@ltx/en_us_goadedes/miscellanea:misc.Ode9
ltx/en_us_goadedes/tr.d044:trMA.Ode9C11.text	
ltx/en_us_goadedes/tr.d044:trMA.Ode9C12.incipit	…
ltx/en_us_goadedes/tr.d044:trMA.Ode9C12.melody	@ltx/en_us_goadedes/he.h.m8:heHE.EfrixePasaAkoi.name
ltx/en_us_goadedes/tr.d044:trMA.Ode9C12.mode	@ltx/en_us_goadedes/miscellanea:misc.Mode8
ltx/en_us_goadedes/tr.d044:trMA.Ode9C12.ode	@ltx/en_us_goadedes/miscellanea:misc.Ode9
ltx/en_us_goadedes/tr.d044:trMA.Ode9C12.text	
ltx/en_us_goadedes/tr.d044:trMA.Ode9C13.incipit	…
ltx/en_us_goadedes/tr.d044:trMA.Ode9C13.melody	@ltx/en_us_goadedes/he.h.m8:heHE.EfrixePasaAkoi.name
ltx/en_us_goadedes/tr.d044:trMA.Ode9C13.mode	@ltx/en_us_goadedes/miscellanea:misc.Mode8
ltx/en_us_goadedes/tr.d044:trMA.Ode9C13.ode	@ltx/en_us_goadedes/miscellanea:misc.Ode9
ltx/en_us_goadedes/tr.d044:trMA.Ode9C13.text	
ltx/en_us_goadedes/tr.d044:trMA.Ode9C1T.incipit	…
ltx/en_us_goadedes/tr.d044:trMA.Ode9C1T.melody	@ltx/en_us_goadedes/he.h.m8:heHE.EfrixePasaAkoi.name
ltx/en_us_goadedes/tr.d044:trMA.Ode9C1T.mode	@ltx/en_us_goadedes/miscellanea:misc.Mode8
ltx/en_us_goadedes/tr.d044:trMA.Ode9C1T.ode	@ltx/en_us_goadedes/miscellanea:misc.Ode9
ltx/en_us_goadedes/tr.d044:trMA.Ode9C1T.text	
ltx/en_us_goadedes/tr.d044:trMA.Ode9C21.greekmelody	@ltx/en_us_goadedes/he.h.m3:heHE.EnSinaioToOrei.greekname
ltx/en_us_goadedes/tr.d044:trMA.Ode9C21.incipit	…
ltx/en_us_goadedes/tr.d044:trMA.Ode9C21.melody	@ltx/en_us_goadedes/he.h.m3:heHE.EnSinaioToOrei.name
ltx/en_us_goadedes/tr.d044:trMA.Ode9C21.mode	@ltx/en_us_goadedes/miscellanea:misc.Mode3
ltx/en_us_goadedes/tr.d044:trMA.Ode9C21.ode	@ltx/en_us_goadedes/miscellanea:misc.Ode9
ltx/en_us_goadedes/tr.d044:trMA.Ode9C21.text	
ltx/en_us_goadedes/tr.d044:trMA.Ode9C22.incipit	…
ltx/en_us_goadedes/tr.d044:trMA.Ode9C22.melody	@ltx/en_us_goadedes/he.h.m3:heHE.EnSinaioToOrei.name
ltx/en_us_goadedes/tr.d044:trMA.Ode9C22.mode	@ltx/en_us_goadedes/miscellanea:misc.Mode3
ltx/en_us_goadedes/tr.d044:trMA.Ode9C22.ode	@ltx/en_us_goadedes/miscellanea:misc.Ode9
ltx/en_us_goadedes/tr.d044:trMA.Ode9C22.text	
ltx/en_us_goadedes/tr.d044:trMA.Ode9C2A1.incipit	…
ltx/en_us_goadedes/tr.d044:trMA.Ode9C2A1.melody	@ltx/en_us_goadedes/he.h.m3:heHE.EnSinaioToOrei.name
ltx/en_us_goadedes/tr.d044:trMA.Ode9C2A1.mode	@ltx/en_us_goadedes/miscellanea:misc.Mode3
ltx/en_us_goadedes/tr.d044:trMA.Ode9C2A1.ode	@ltx/en_us_goadedes/miscellanea:misc.Ode9
ltx/en_us_goadedes/tr.d044:trMA.Ode9C2A1.text	
ltx/en_us_goadedes/tr.d044:trMA.Ode9C2H.greekmelody	@ltx/en_us_goadedes/he.h.m3:heHE.EnSinaioToOrei.greekname
ltx/en_us_goadedes/tr.d044:trMA.Ode9C2H.incipit	@ltx/en_us_goadedes/he.h.m3:heHE.EnSinaioToOrei.incipit
ltx/en_us_goadedes/tr.d044:trMA.Ode9C2H.melody	@ltx/en_us_goadedes/he.h.m3:heHE.EnSinaioToOrei.melody
ltx/en_us_goadedes/tr.d044:trMA.Ode9C2H.mode	@ltx/en_us_goadedes/miscellanea:misc.Mode3
ltx/en_us_goadedes/tr.d044:trMA.Ode9C2H.ode	@ltx/en_us_goadedes/miscellanea:misc.Ode9
ltx/en_us_goadedes/tr.d044:trMA.Ode9C2H.text	@ltx/en_us_goadedes/he.h.m3:heHE.EnSinaioToOrei.text
ltx/en_us_goadedes/tr.d044:trMA.Ode9C2T.incipit	…
ltx/en_us_goadedes/tr.d044:trMA.Ode9C2T.melody	@ltx/en_us_goadedes/he.h.m3:heHE.EnSinaioToOrei.name
ltx/en_us_goadedes/tr.d044:trMA.Ode9C2T.mode	@ltx/en_us_goadedes/miscellanea:misc.Mode3
ltx/en_us_goadedes/tr.d044:trMA.Ode9C2T.ode	@ltx/en_us_goadedes/miscellanea:misc.Ode9
ltx/en_us_goadedes/tr.d044:trMA.Ode9C2T.text	
ltx/en_us_goadedes/tr.d044:trMA.Ode9C2Tr.incipit	…
ltx/en_us_goadedes/tr.d044:trMA.Ode9C2Tr.melody	@ltx/en_us_goadedes/he.h.m3:heHE.EnSinaioToOrei.name
ltx/en_us_goadedes/tr.d044:trMA.Ode9C2Tr.mode	@ltx/en_us_goadedes/miscellanea:misc.Mode3
ltx/en_us_goadedes/tr.d044:trMA.Ode9C2Tr.ode	@ltx/en_us_goadedes/miscellanea:misc.Ode9
ltx/en_us_goadedes/tr.d044:trMA.Ode9C2Tr.text	
ltx/en_us_goadedes/tr.d044:trTE.Troparion.incipit	…
ltx/en_us_goadedes/tr.d044:trTE.Troparion.melody	
ltx/en_us_goadedes/tr.d044:trTE.Troparion.mode	@ltx/en_us_goadedes/miscellanea:misc.Mode7
ltx/en_us_goadedes/tr.d044:trTE.Troparion.text	
ltx/en_us_goadedes/tr.d044:trTE.Troparion2.incipit	…
ltx/en_us_goadedes/tr.d044:trTE.Troparion2.text	
ltx/en_us_goadedes/tr.d044:trVE.AposIdiomelon1.incipit	…
ltx/en_us_goadedes/tr.d044:trVE.AposIdiomelon1.melody	@ltx/en_us_goadedes/miscellanea:misc.Idiomelon
ltx/en_us_goadedes/tr.d044:trVE.AposIdiomelon1.mode	@ltx/en_us_goadedes/miscellanea:misc.Mode8
ltx/en_us_goadedes/tr.d044:trVE.AposIdiomelon1.text	
ltx/en_us_goadedes/tr.d044:trVE.AposMartyric.incipit	@ltx/en_us_goadedes/oc.m8.d2:ocVE.Aposticha3.incipit
ltx/en_us_goadedes/tr.d044:trVE.AposMartyric.melody	
ltx/en_us_goadedes/tr.d044:trVE.AposMartyric.mode	@ltx/en_us_goadedes/miscellanea:misc.Mode8
ltx/en_us_goadedes/tr.d044:trVE.AposMartyric.text	@ltx/en_us_goadedes/oc.m8.d2:ocVE.Aposticha3.text
ltx/en_us_goadedes/tr.d044:trVE.AposTheotokion.incipit	@ltx/en_us_goadedes/tr.d030:trVE.AposTheotokion.incipit
ltx/en_us_goadedes/tr.d044:trVE.AposTheotokion.melody	
ltx/en_us_goadedes/tr.d044:trVE.AposTheotokion.mode	@ltx/en_us_goadedes/miscellanea:misc.Mode8
ltx/en_us_goadedes/tr.d044:trVE.AposTheotokion.text	@ltx/en_us_goadedes/tr.d030:trVE.AposTheotokion.text
ltx/en_us_goadedes/tr.d044:trVE.Stichera01.greekmelody	@ltx/en_us_goadedes/he.a.m8:heAU.KyrieEiKaiKritirio.greekname
ltx/en_us_goadedes/tr.d044:trVE.Stichera01.incipit	Lord our God…
ltx/en_us_goadedes/tr.d044:trVE.Stichera01.melody	@ltx/en_us_goadedes/he.a.m8:heAU.KyrieEiKaiKritirio.name
ltx/en_us_goadedes/tr.d044:trVE.Stichera01.mode	@ltx/en_us_goadedes/miscellanea:misc.Mode8
ltx/en_us_goadedes/tr.d044:trVE.Stichera01.text	Lord our God, willingly You spread Your divine hands * to be nailed on the holy Cross. * Count us worthy to venerate it * with a heart contrite and penitent, * and with our bodies and souls * aglow through self-control and prayer * and good deeds and from fasting, for You are good and love humanity.
ltx/en_us_goadedes/tr.d044:trVE.Stichera02.greekmelody	@ltx/en_us_goadedes/he.a.m8:heAU.KyrieEiKaiKritirio.greekname
ltx/en_us_goadedes/tr.d044:trVE.Stichera02.incipit	Lord, I pray…
ltx/en_us_goadedes/tr.d044:trVE.Stichera02.melody	@ltx/en_us_goadedes/he.a.m8:heAU.KyrieEiKaiKritirio.name
ltx/en_us_goadedes/tr.d044:trVE.Stichera02.mode	@ltx/en_us_goadedes/miscellanea:misc.Mode8
ltx/en_us_goadedes/tr.d044:trVE.Stichera02.text	Lord, I pray, blot out my abundant transgressions * according to the abundance of * Your compassion, merciful Savior. * And in Your love for humanity, * account me worthy to see * and venerate You holy Cross, * during this fourth week of Lenten fasting, * with my soul and body purified.
ltx/en_us_goadedes/tr.d044:trVE.Stichera03.incipit	Truly amazing…
ltx/en_us_goadedes/tr.d044:trVE.Stichera03.melody	Truly amazing.
ltx/en_us_goadedes/tr.d044:trVE.Stichera03.mode	@ltx/en_us_goadedes/miscellanea:misc.Mode3
ltx/en_us_goadedes/tr.d044:trVE.Stichera03.text	Truly amazing! On view is the Tree on which Christ was physically crucified. * The world venerates it, and illumined cries out: * “How great is the Cross’s power! * When demons simply look at it, it burns them. * We make the sign of it, and indeed it scorches them. * O immaculate Tree, I extol you; * with fear I venerate and honor. * And I send up glory to God my Savior, who through you to me has granted never-ending life.
