ltx/en_us_goa/actors:ac.Archbishop	ARCHBISHOP
ltx/en_us_goa/actors:ac.Archdeacon	ARCHDEACON
ltx/en_us_goa/actors:ac.Bishop_Elect	BISHOP-ELECT
ltx/en_us_goa/actors:ac.Candidate_Sponsor	CANDIDATE/SPONSOR
ltx/en_us_goa/actors:ac.Chanter	CHANTER
ltx/en_us_goa/actors:ac.ChanterOrReader	CHANTER/READER
ltx/en_us_goa/actors:ac.Chanters	CHANTERS
ltx/en_us_goa/actors:ac.Choir	CHOIR
ltx/en_us_goa/actors:ac.ChoirL	LEFT CHOIR
ltx/en_us_goa/actors:ac.ChoirOrClergy	CHOIR/CLERGY
ltx/en_us_goa/actors:ac.ChoirR	RIGHT CHOIR
ltx/en_us_goa/actors:ac.Clergy	CLERGY
ltx/en_us_goa/actors:ac.ClergyAndPeople	CLERGY AND PEOPLE
ltx/en_us_goa/actors:ac.Deacon	DEACON
ltx/en_us_goa/actors:ac.Deacon1	1st DEACON
ltx/en_us_goa/actors:ac.Deacon2	2nd DEACON
ltx/en_us_goa/actors:ac.Hierarch	HIERARCH
ltx/en_us_goa/actors:ac.HierarchOrPriest	HIERARCH/PRIEST
ltx/en_us_goa/actors:ac.Hierarchs	HIERARCHS
ltx/en_us_goa/actors:ac.IL.Archbishop	ARCHBISHOP:
ltx/en_us_goa/actors:ac.IL.Archdeacon	ARCHDEACON:
ltx/en_us_goa/actors:ac.IL.Bishop_Elect	BISHOP-ELECT:
ltx/en_us_goa/actors:ac.IL.Candidate_Sponsor	CANDIDATE/SPONSOR:
ltx/en_us_goa/actors:ac.IL.Chanter	CHANTER:
ltx/en_us_goa/actors:ac.IL.ChanterOrReader	CHANTER/READER:
ltx/en_us_goa/actors:ac.IL.Chanters	CHANTERS:
ltx/en_us_goa/actors:ac.IL.Choir	CHOIR:
ltx/en_us_goa/actors:ac.IL.ChoirL	LEFT CHOIR:
ltx/en_us_goa/actors:ac.IL.ChoirOrClergy	CHOIR/CLERGY:
ltx/en_us_goa/actors:ac.IL.ChoirR	RIGHT CHOIR:
ltx/en_us_goa/actors:ac.IL.Clergy	CLERGY:
ltx/en_us_goa/actors:ac.IL.ClergyAndPeople	CLERGY AND PEOPLE:
ltx/en_us_goa/actors:ac.IL.Deacon	DEACON:
ltx/en_us_goa/actors:ac.IL.Deacon1	1st DEACON:
ltx/en_us_goa/actors:ac.IL.Deacon2	2nd DEACON:
ltx/en_us_goa/actors:ac.IL.Hierarch	HIERARCH:
ltx/en_us_goa/actors:ac.IL.HierarchOrPriest	HIERARCH/PRIEST:
ltx/en_us_goa/actors:ac.IL.Hierarchs	HIERARCHS:
ltx/en_us_goa/actors:ac.IL.Metropolitan	METROPOLITAN:
ltx/en_us_goa/actors:ac.IL.Metropolitans	METROPOLITANS:
ltx/en_us_goa/actors:ac.IL.Patriarch	PATRIARCH:
ltx/en_us_goa/actors:ac.IL.People	PEOPLE:
ltx/en_us_goa/actors:ac.IL.Priest	PRIEST:
ltx/en_us_goa/actors:ac.IL.Priest1	1st PRIEST:
ltx/en_us_goa/actors:ac.IL.Priest2	2nd PRIEST:
ltx/en_us_goa/actors:ac.IL.PriestOrDeacon	PRIEST/DEACON:
ltx/en_us_goa/actors:ac.IL.Priests	PRIESTS:
ltx/en_us_goa/actors:ac.IL.Reader	READER:
ltx/en_us_goa/actors:ac.IL.Respondent	RESPONDENT:
ltx/en_us_goa/actors:ac.IL.Subdeacon	SUB-DEACON:
ltx/en_us_goa/actors:ac.IL.Superior	SUPERIOR:
ltx/en_us_goa/actors:ac.IL.SuperiorOrReader	HIERARCH or READER:
ltx/en_us_goa/actors:ac.IL.clChoirL	CHOIR:
ltx/en_us_goa/actors:ac.IL.clChoirR	CHOIR:
ltx/en_us_goa/actors:ac.Metropolitan	METROPOLITAN
ltx/en_us_goa/actors:ac.Metropolitans	METROPOLITANS
ltx/en_us_goa/actors:ac.Patriarch	PATRIARCH
ltx/en_us_goa/actors:ac.People	PEOPLE
ltx/en_us_goa/actors:ac.Priest	PRIEST
ltx/en_us_goa/actors:ac.Priest1	1st PRIEST
ltx/en_us_goa/actors:ac.Priest2	2nd PRIEST
ltx/en_us_goa/actors:ac.PriestOrDeacon	PRIEST/DEACON
ltx/en_us_goa/actors:ac.Priests	PRIESTS
ltx/en_us_goa/actors:ac.Reader	READER
ltx/en_us_goa/actors:ac.Respondent	RESPONDENT
ltx/en_us_goa/actors:ac.Subdeacon	SUB-DEACON
ltx/en_us_goa/actors:ac.Superior	SUPERIOR
ltx/en_us_goa/actors:ac.SuperiorOrReader	HIERARCH or READER
ltx/en_us_goa/actors:ac.clChoirL	CHOIR
ltx/en_us_goa/actors:ac.clChoirR	CHOIR
