ltx/en_us_eob/le.ep.mc.d269:lemcLI.Epistle.book_abbr	@ltx/en_us_eob/bible:Colossians.abbr
ltx/en_us_eob/le.ep.mc.d269:lemcLI.Epistle.book_string	@ltx/en_us_eob/bible:Colossians.text
ltx/en_us_eob/le.ep.mc.d269:lemcLI.Epistle.chapverse	2:20 – 23; 3:1 – 3
ltx/en_us_eob/le.ep.mc.d269:lemcLI.Epistle.incipit	Brethren, if you died with Christ as regards these…
ltx/en_us_eob/le.ep.mc.d269:lemcLI.Epistle.text	Brethren, if you died with Christ as regards these basic principles of the world, why do you subject yourselves to [these] commandments, as though you were still living in the world? “Do not handle, do not taste, do not touch!” These things are all destined to perish with use! These are merely human commands and teachings! Indeed, these things have an appearance of wisdom in self-imposed religion, humility, and severe treatment of the body; but they have no value against the indulgence of the flesh. If you were raised together with Christ, seek the things that are above, where Christ is, seated at the right hand of God! Set your mind on the things that are above, not on the things that are on the earth. For you died, and your life is hidden with Christ in God.
ltx/en_us_eob/le.ep.mc.d269:lemcLI.Epistle.title	TUESDAY OF THE TWENTY-SECOND WEEK
ltx/en_us_eob/le.ep.mc.d269:lemcLI.Epistle.title_abbr	TUESDAY OF THE TWENTY-SECOND WEEK
ltx/en_us_eob/le.ep.mc.d269:lemcLI.Epistle.version	@ltx/en_us_eob/properties:version.designation
