ltx/en_us_eob/le.ep.mc.d010:lemcLI.Epistle.book_abbr	@ltx/en_us_eob/bible:John1.abbr
ltx/en_us_eob/le.ep.mc.d010:lemcLI.Epistle.book_string	@ltx/en_us_eob/bible:John1.text
ltx/en_us_eob/le.ep.mc.d010:lemcLI.Epistle.chapverse	3:9 – 22
ltx/en_us_eob/le.ep.mc.d010:lemcLI.Epistle.text	
ltx/en_us_eob/le.ep.mc.d010:lemcLI.Epistle.title	TUESDAY OF MEAT-FARE WEEK
ltx/en_us_eob/le.ep.mc.d010:lemcLI.Epistle.title_abbr	TUESDAY OF MEAT-FARE WEEK
ltx/en_us_eob/le.ep.mc.d010:lemcLI.Epistle.version	@ltx/en_us_eob/properties:version.designation
