ltx/en_us_eob/le.go.mc.d209:lemcLI.Gospel.book_abbr	@ltx/en_us_eob/bible:Mark.abbr
ltx/en_us_eob/le.go.mc.d209:lemcLI.Gospel.book_string	@ltx/en_us_eob/bible:Mark.text
ltx/en_us_eob/le.go.mc.d209:lemcLI.Gospel.chapverse	4:1 – 9
ltx/en_us_eob/le.go.mc.d209:lemcLI.Gospel.incipit	At that time, Jesus began to teach by the…
ltx/en_us_eob/le.go.mc.d209:lemcLI.Gospel.text	At that time, Jesus began to teach by the seaside. A great crowd was gathered close to him, so that he got into a boat in the lake and sat down while the people were on the shore. He taught them many things in parables, saying, “Listen! A farmer went out to sow. As he sowed, some seed fell on the road and the birds came and devoured it. Others fell on the rocky ground where it had little soil and it sprang up right away. Because the soil was shallow, when the sun came, it was scorched; and since it had no root, it withered away. Others fell among the thorns, and the thorns grew up, choked it, and it produced no fruit. Others fell into the good ground and produced fruit, growing up and increasing, some multiplying thirty times, some sixty times, and some a hundred times.” Then Jesus said to them, “Anyone who has ears for listening should listen!”
ltx/en_us_eob/le.go.mc.d209:lemcLI.Gospel.title	Friday of the Thirteenth Week
ltx/en_us_eob/le.go.mc.d209:lemcLI.Gospel.title_abbr	Friday of the Thirteenth Week
ltx/en_us_eob/le.go.mc.d209:lemcLI.Gospel.version	@ltx/en_us_eob/properties:version.designation
