ltx/en_us_eob/le.ep.me.m02.d26:lemeLI.Epistle.book_abbr	@ltx/en_us_eob/le.ep.me.m12.d06:lemeLI.Epistle.book_abbr
ltx/en_us_eob/le.ep.me.m02.d26:lemeLI.Epistle.book_string	@ltx/en_us_eob/le.ep.me.m12.d06:lemeLI.Epistle.book_string
ltx/en_us_eob/le.ep.me.m02.d26:lemeLI.Epistle.chapverse	@ltx/en_us_eob/le.ep.me.m12.d06:lemeLI.Epistle.chapverse
ltx/en_us_eob/le.ep.me.m02.d26:lemeLI.Epistle.incipit	@ltx/en_us_eob/le.ep.me.m12.d06:lemeLI.Epistle.incipit
ltx/en_us_eob/le.ep.me.m02.d26:lemeLI.Epistle.text	@ltx/en_us_eob/le.ep.me.m12.d06:lemeLI.Epistle.text
ltx/en_us_eob/le.ep.me.m02.d26:lemeLI.Epistle.title	For the Saint
ltx/en_us_eob/le.ep.me.m02.d26:lemeLI.Epistle.title_abbr	For the Saint
ltx/en_us_eob/le.ep.me.m02.d26:lemeLI.Epistle.version	@ltx/en_us_eob/le.ep.me.m12.d06:lemeLI.Epistle.version
