ltx/en_us_eob/le.ep.me.m08.d16:lemeLI.Epistle.book_abbr	@ltx/en_us_eob/le.ep.me.m12.dSatBE:lemeLI.Epistle.book_abbr
ltx/en_us_eob/le.ep.me.m08.d16:lemeLI.Epistle.book_string	@ltx/en_us_eob/le.ep.me.m12.dSatBE:lemeLI.Epistle.book_string
ltx/en_us_eob/le.ep.me.m08.d16:lemeLI.Epistle.chapverse	@ltx/en_us_eob/le.ep.me.m12.dSatBE:lemeLI.Epistle.chapverse
ltx/en_us_eob/le.ep.me.m08.d16:lemeLI.Epistle.incipit	@ltx/en_us_eob/le.ep.me.m12.dSatBE:lemeLI.Epistle.incipit
ltx/en_us_eob/le.ep.me.m08.d16:lemeLI.Epistle.text	@ltx/en_us_eob/le.ep.me.m12.dSatBE:lemeLI.Epistle.text
ltx/en_us_eob/le.ep.me.m08.d16:lemeLI.Epistle.title	For the Holy Mandelion
ltx/en_us_eob/le.ep.me.m08.d16:lemeLI.Epistle.title_abbr	For the Holy Mandelion
ltx/en_us_eob/le.ep.me.m08.d16:lemeLI.Epistle.version	@ltx/en_us_eob/le.ep.me.m12.dSatBE:lemeLI.Epistle.version
