ltx/en_us_eob/le.ep.me.m01.d06:lemeGW.Epistle.book_abbr	@ltx/en_us_eob/bible:Corinthians1.abbr
ltx/en_us_eob/le.ep.me.m01.d06:lemeGW.Epistle.book_string	@ltx/en_us_eob/bible:Corinthians1.text
ltx/en_us_eob/le.ep.me.m01.d06:lemeGW.Epistle.chapverse	10:1 – 4
ltx/en_us_eob/le.ep.me.m01.d06:lemeGW.Epistle.incipit	Brethren, I do not want you to be ignorant…
ltx/en_us_eob/le.ep.me.m01.d06:lemeGW.Epistle.text	Brethren, I do not want you to be ignorant that our forefathers were all under the cloud: all passed through the sea; and they were all baptized into Moses in the cloud and in the sea. They all ate the same spiritual food and drank the same spiritual drink. They drank from a spiritual rock that followed them, and that rock was Christ.
ltx/en_us_eob/le.ep.me.m01.d06:lemeGW.Epistle.title	For the Blessing of Water
ltx/en_us_eob/le.ep.me.m01.d06:lemeGW.Epistle.title_abbr	For the Blessing of Water
ltx/en_us_eob/le.ep.me.m01.d06:lemeGW.Epistle.version	@ltx/en_us_eob/properties:version.designation
ltx/en_us_eob/le.ep.me.m01.d06:lemeLI.Epistle.book_abbr	@ltx/en_us_eob/le.ep.me.m01.d05:lemeH9.Epistle.book_abbr
ltx/en_us_eob/le.ep.me.m01.d06:lemeLI.Epistle.book_string	@ltx/en_us_eob/le.ep.me.m01.d05:lemeH9.Epistle.book_string
ltx/en_us_eob/le.ep.me.m01.d06:lemeLI.Epistle.chapverse	@ltx/en_us_eob/le.ep.me.m01.d05:lemeH9.Epistle.chapverse
ltx/en_us_eob/le.ep.me.m01.d06:lemeLI.Epistle.incipit	@ltx/en_us_eob/le.ep.me.m01.d05:lemeH9.Epistle.incipit
ltx/en_us_eob/le.ep.me.m01.d06:lemeLI.Epistle.text	@ltx/en_us_eob/le.ep.me.m01.d05:lemeH9.Epistle.text
ltx/en_us_eob/le.ep.me.m01.d06:lemeLI.Epistle.title	For the Feast
ltx/en_us_eob/le.ep.me.m01.d06:lemeLI.Epistle.title_abbr	For the Feast
ltx/en_us_eob/le.ep.me.m01.d06:lemeLI.Epistle.version	@ltx/en_us_eob/properties:version.designation
ltx/en_us_eob/le.ep.me.m01.d06:lemeVE.Epistle.book_abbr	@ltx/en_us_eob/bible:Corinthians1.abbr
ltx/en_us_eob/le.ep.me.m01.d06:lemeVE.Epistle.book_string	@ltx/en_us_eob/bible:Corinthians1.text
ltx/en_us_eob/le.ep.me.m01.d06:lemeVE.Epistle.chapverse	9:19 – 27
ltx/en_us_eob/le.ep.me.m01.d06:lemeVE.Epistle.incipit	Brethren, although I was free from all, I brought…
ltx/en_us_eob/le.ep.me.m01.d06:lemeVE.Epistle.text	Brethren, although I was free from all, I brought myself in obedience to all, so that I might gain even more. To the Jews I became as a Jew, so that I might win over the Jews. To those who are under the law, [I became] as under the law, so that I might gain those who are under the law. To those who are without law, [I became] as one without law (not being without law toward God, but under law toward Christ), so that I might win those who are without law. To the weak I became as weak, that I might gain the weak. I have become all things to all people, so that I may by all means save some. Now I do this for the sake of the Good News, so that I may be a joint partaker of it. Do you not know that those who run in a race run with everyone else, but that only one receives the prize? Run like that, in order to win! Everyone who competes in the games exercises self-control in all things. Now they do it in order to receive a corruptible crown, but we [seek] an incorruptible crown. This is how I run, not without a goal. This is how I fight, not beating the air! Instead, I chastise my body and bring it into submission, for fear that after having preached to others, I myself should be disqualified.
ltx/en_us_eob/le.ep.me.m01.d06:lemeVE.Epistle.title	For the Feast.
ltx/en_us_eob/le.ep.me.m01.d06:lemeVE.Epistle.title_abbr	For the Feast
ltx/en_us_eob/le.ep.me.m01.d06:lemeVE.Epistle.version	@ltx/en_us_eob/properties:version.designation
