ltx/en_us_eob/le.go.me.m09.d16:lemeLI.Gospel.book_abbr	@ltx/en_us_eob/le.go.lu.d022:leluLI.Gospel.book_abbr
ltx/en_us_eob/le.go.me.m09.d16:lemeLI.Gospel.book_string	@ltx/en_us_eob/le.go.lu.d022:leluLI.Gospel.book_string
ltx/en_us_eob/le.go.me.m09.d16:lemeLI.Gospel.chapverse	@ltx/en_us_eob/le.go.lu.d022:leluLI.Gospel.chapverse
ltx/en_us_eob/le.go.me.m09.d16:lemeLI.Gospel.incipit	@ltx/en_us_eob/le.go.lu.d022:leluLI.Gospel.incipit
ltx/en_us_eob/le.go.me.m09.d16:lemeLI.Gospel.text	@ltx/en_us_eob/le.go.lu.d022:leluLI.Gospel.text
ltx/en_us_eob/le.go.me.m09.d16:lemeLI.Gospel.title	For the Martyr
ltx/en_us_eob/le.go.me.m09.d16:lemeLI.Gospel.title_abbr	For the Martyr
ltx/en_us_eob/le.go.me.m09.d16:lemeLI.Gospel.version	@ltx/en_us_eob/le.go.lu.d022:leluLI.Gospel.version
