ltx/en_us_eob/le.ep.me.m07.d14:lemeLI.Epistle.book_abbr	@ltx/en_us_eob/le.ep.mc.d190:lemcLI.Epistle.book_abbr
ltx/en_us_eob/le.ep.me.m07.d14:lemeLI.Epistle.book_string	@ltx/en_us_eob/le.ep.mc.d190:lemcLI.Epistle.book_string
ltx/en_us_eob/le.ep.me.m07.d14:lemeLI.Epistle.chapverse	@ltx/en_us_eob/le.ep.mc.d190:lemcLI.Epistle.chapverse
ltx/en_us_eob/le.ep.me.m07.d14:lemeLI.Epistle.incipit	@ltx/en_us_eob/le.ep.mc.d190:lemcLI.Epistle.incipit
ltx/en_us_eob/le.ep.me.m07.d14:lemeLI.Epistle.text	@ltx/en_us_eob/le.ep.mc.d190:lemcLI.Epistle.text
ltx/en_us_eob/le.ep.me.m07.d14:lemeLI.Epistle.title	For the Apostle
ltx/en_us_eob/le.ep.me.m07.d14:lemeLI.Epistle.title_abbr	For the Apostle
ltx/en_us_eob/le.ep.me.m07.d14:lemeLI.Epistle.version	@ltx/en_us_eob/le.ep.mc.d190:lemcLI.Epistle.version
