ltx/en_us_eob/le.ep.mc.d337:lemcLI.Epistle.book_abbr	@ltx/en_us_eob/bible:Timothy1.abbr
ltx/en_us_eob/le.ep.mc.d337:lemcLI.Epistle.book_string	@ltx/en_us_eob/bible:Timothy1.text
ltx/en_us_eob/le.ep.mc.d337:lemcLI.Epistle.chapverse	1:15 – 17
ltx/en_us_eob/le.ep.mc.d337:lemcLI.Epistle.incipit	Timothy, my child, this saying is faithful and worthy…
ltx/en_us_eob/le.ep.mc.d337:lemcLI.Epistle.text	Timothy, my child, this saying is faithful and worthy of all acceptance: that Christ Jesus came into the world to save sinners of whom I am the first. This is how I obtained mercy, so that in me as ‘the first,’ Jesus Christ might show all his patience as an example for those who would believe in him for eternal life. Now to the eternal King, immortal, invisible, to God who alone is wise, be honor and glory unto ages of ages. Amen.
ltx/en_us_eob/le.ep.mc.d337:lemcLI.Epistle.title	THIRTY-FIRST SUNDAY
ltx/en_us_eob/le.ep.mc.d337:lemcLI.Epistle.title_abbr	THIRTY-FIRST SUNDAY
ltx/en_us_eob/le.ep.mc.d337:lemcLI.Epistle.version	@ltx/en_us_eob/properties:version.designation
