ltx/en_us_eob/le.ep.va.consecration:levaCON.Epistle1.book_abbr	@ltx/en_us_eob/le.ep.me.m03.d25:lemeLI.Epistle.book_abbr
ltx/en_us_eob/le.ep.va.consecration:levaCON.Epistle1.book_string	@ltx/en_us_eob/le.ep.me.m03.d25:lemeLI.Epistle.book_string
ltx/en_us_eob/le.ep.va.consecration:levaCON.Epistle1.chapverse	@ltx/en_us_eob/le.ep.me.m03.d25:lemeLI.Epistle.chapverse
ltx/en_us_eob/le.ep.va.consecration:levaCON.Epistle1.incipit	@ltx/en_us_eob/le.ep.me.m03.d25:lemeLI.Epistle.incipit
ltx/en_us_eob/le.ep.va.consecration:levaCON.Epistle1.text	@ltx/en_us_eob/le.ep.me.m03.d25:lemeLI.Epistle.text
ltx/en_us_eob/le.ep.va.consecration:levaCON.Epistle1.title	At the Consecration of a Church.
ltx/en_us_eob/le.ep.va.consecration:levaCON.Epistle1.title_abbr	At the Consecration of a Church
ltx/en_us_eob/le.ep.va.consecration:levaCON.Epistle1.version	@ltx/en_us_eob/properties:version.designation
ltx/en_us_eob/le.ep.va.consecration:levaCON.Epistle2.book_abbr	@ltx/en_us_eob/le.ep.ge.theotokos:legeLI.Epistle2.book_abbr
ltx/en_us_eob/le.ep.va.consecration:levaCON.Epistle2.book_string	@ltx/en_us_eob/le.ep.ge.theotokos:legeLI.Epistle2.book_string
ltx/en_us_eob/le.ep.va.consecration:levaCON.Epistle2.chapverse	@ltx/en_us_eob/le.ep.ge.theotokos:legeLI.Epistle2.chapverse
ltx/en_us_eob/le.ep.va.consecration:levaCON.Epistle2.incipit	@ltx/en_us_eob/le.ep.ge.theotokos:legeLI.Epistle2.incipit
ltx/en_us_eob/le.ep.va.consecration:levaCON.Epistle2.text	@ltx/en_us_eob/le.ep.ge.theotokos:legeLI.Epistle2.text
ltx/en_us_eob/le.ep.va.consecration:levaCON.Epistle2.title	Another.
ltx/en_us_eob/le.ep.va.consecration:levaCON.Epistle2.title_abbr	Another
ltx/en_us_eob/le.ep.va.consecration:levaCON.Epistle2.version	@ltx/en_us_eob/le.ep.ge.theotokos:legeLI.Epistle2.version
ltx/en_us_eob/le.ep.va.consecration:levaLI.Epistle.book_abbr	@ltx/en_us_eob/le.ep.me.m09.d13:lemeLI.Epistle.book_abbr
ltx/en_us_eob/le.ep.va.consecration:levaLI.Epistle.book_string	@ltx/en_us_eob/le.ep.me.m09.d13:lemeLI.Epistle.book_string
ltx/en_us_eob/le.ep.va.consecration:levaLI.Epistle.chapverse	@ltx/en_us_eob/le.ep.me.m09.d13:lemeLI.Epistle.chapverse
ltx/en_us_eob/le.ep.va.consecration:levaLI.Epistle.incipit	@ltx/en_us_eob/le.ep.me.m09.d13:lemeLI.Epistle.incipit
ltx/en_us_eob/le.ep.va.consecration:levaLI.Epistle.text	@ltx/en_us_eob/le.ep.me.m09.d13:lemeLI.Epistle.text
ltx/en_us_eob/le.ep.va.consecration:levaLI.Epistle.title	Another.
ltx/en_us_eob/le.ep.va.consecration:levaLI.Epistle.title_abbr	Another
ltx/en_us_eob/le.ep.va.consecration:levaLI.Epistle.version	@ltx/en_us_eob/properties:version.designation
