ltx/en_us_eob/le.go.me.m12.d25:lemeLI.Gospel.book_abbr	@ltx/en_us_eob/le.go.me.m12.d24:lemeH6.Gospel.book_abbr
ltx/en_us_eob/le.go.me.m12.d25:lemeLI.Gospel.book_string	@ltx/en_us_eob/le.go.me.m12.d24:lemeH6.Gospel.book_string
ltx/en_us_eob/le.go.me.m12.d25:lemeLI.Gospel.chapverse	@ltx/en_us_eob/le.go.me.m12.d24:lemeH6.Gospel.chapverse
ltx/en_us_eob/le.go.me.m12.d25:lemeLI.Gospel.incipit	@ltx/en_us_eob/le.go.me.m12.d24:lemeH6.Gospel.incipit
ltx/en_us_eob/le.go.me.m12.d25:lemeLI.Gospel.text	@ltx/en_us_eob/le.go.me.m12.d24:lemeH6.Gospel.text
ltx/en_us_eob/le.go.me.m12.d25:lemeLI.Gospel.title	For the Feast
ltx/en_us_eob/le.go.me.m12.d25:lemeLI.Gospel.title_abbr	For the Feast
ltx/en_us_eob/le.go.me.m12.d25:lemeLI.Gospel.version	@ltx/en_us_eob/le.go.me.m12.d24:lemeH6.Gospel.version
ltx/en_us_eob/le.go.me.m12.d25:lemeMA.Gospel.book_abbr	@ltx/en_us_eob/le.go.me.m12.d24:lemeH1.Gospel.book_abbr
ltx/en_us_eob/le.go.me.m12.d25:lemeMA.Gospel.book_string	@ltx/en_us_eob/le.go.me.m12.d24:lemeH1.Gospel.book_string
ltx/en_us_eob/le.go.me.m12.d25:lemeMA.Gospel.chapverse	@ltx/en_us_eob/le.go.me.m12.d24:lemeH1.Gospel.chapverse
ltx/en_us_eob/le.go.me.m12.d25:lemeMA.Gospel.incipit	@ltx/en_us_eob/le.go.me.m12.d24:lemeH1.Gospel.incipit
ltx/en_us_eob/le.go.me.m12.d25:lemeMA.Gospel.text	@ltx/en_us_eob/le.go.me.m12.d24:lemeH1.Gospel.text
ltx/en_us_eob/le.go.me.m12.d25:lemeMA.Gospel.title	For the Feast
ltx/en_us_eob/le.go.me.m12.d25:lemeMA.Gospel.title_abbr	For the Feast
ltx/en_us_eob/le.go.me.m12.d25:lemeMA.Gospel.version	@ltx/en_us_eob/le.go.me.m12.d24:lemeH1.Gospel.version
ltx/en_us_eob/le.go.me.m12.d25:lemeVE.Gospel.book_abbr	@ltx/en_us_eob/le.go.me.m12.d24:lemeH3.Gospel.book_abbr
ltx/en_us_eob/le.go.me.m12.d25:lemeVE.Gospel.book_string	@ltx/en_us_eob/le.go.me.m12.d24:lemeH3.Gospel.book_string
ltx/en_us_eob/le.go.me.m12.d25:lemeVE.Gospel.chapverse	@ltx/en_us_eob/le.go.me.m12.d24:lemeH3.Gospel.chapverse
ltx/en_us_eob/le.go.me.m12.d25:lemeVE.Gospel.incipit	@ltx/en_us_eob/le.go.me.m12.d24:lemeH3.Gospel.incipit
ltx/en_us_eob/le.go.me.m12.d25:lemeVE.Gospel.text	@ltx/en_us_eob/le.go.me.m12.d24:lemeH3.Gospel.text
ltx/en_us_eob/le.go.me.m12.d25:lemeVE.Gospel.title	For the Feast
ltx/en_us_eob/le.go.me.m12.d25:lemeVE.Gospel.title_abbr	For the Feast
ltx/en_us_eob/le.go.me.m12.d25:lemeVE.Gospel.version	@ltx/en_us_eob/le.go.me.m12.d24:lemeH3.Gospel.version
