ltx/en_us_eob/le.go.me.m06.d09:lemeLI.Gospel.book_abbr	@ltx/en_us_eob/le.go.ge.hierarch:legeLI.Gospel2.book_abbr
ltx/en_us_eob/le.go.me.m06.d09:lemeLI.Gospel.book_string	@ltx/en_us_eob/le.go.ge.hierarch:legeLI.Gospel2.book_string
ltx/en_us_eob/le.go.me.m06.d09:lemeLI.Gospel.chapverse	@ltx/en_us_eob/le.go.ge.hierarch:legeLI.Gospel2.chapverse
ltx/en_us_eob/le.go.me.m06.d09:lemeLI.Gospel.incipit	@ltx/en_us_eob/le.go.ge.hierarch:legeLI.Gospel2.incipit
ltx/en_us_eob/le.go.me.m06.d09:lemeLI.Gospel.text	@ltx/en_us_eob/le.go.ge.hierarch:legeLI.Gospel2.text
ltx/en_us_eob/le.go.me.m06.d09:lemeLI.Gospel.title	For the Hierarch
ltx/en_us_eob/le.go.me.m06.d09:lemeLI.Gospel.title_abbr	For the Hierarch
ltx/en_us_eob/le.go.me.m06.d09:lemeLI.Gospel.version	@ltx/en_us_eob/le.go.ge.hierarch:legeLI.Gospel2.version
