ltx/en_us_eob/le.ep.mc.d127:lemcLI.Epistle.book_abbr	@ltx/en_us_eob/bible:Hebrews.abbr
ltx/en_us_eob/le.ep.mc.d127:lemcLI.Epistle.book_string	@ltx/en_us_eob/bible:Hebrews.text
ltx/en_us_eob/le.ep.mc.d127:lemcLI.Epistle.chapverse	11:33 – 40; 12:1 – 2
ltx/en_us_eob/le.ep.mc.d127:lemcLI.Epistle.incipit	Brethren, through faith, all the saints overpowered kingdoms, administered…
ltx/en_us_eob/le.ep.mc.d127:lemcLI.Epistle.text	Brethren, through faith, all the saints overpowered kingdoms, administered justice, obtained promises, stopped the mouths of lions, quenched the power of fire, escaped the edge of the sword, became strong in weakness, grew mighty in war and caused foreign armies to flee. Women received their dead by resurrection. Others were tortured, not accepting their deliverance, that they might obtain a better resurrection. Others were tried by mocking and scourging, yes, by chains and imprisonment. They were stoned, they were sawn apart, they were tempted and they were slain with the sword. They went around in sheep and goat skins, being destitute, afflicted, and ill-treated. And yet the world was not worthy of them! They wandered in deserts, mountains, caves, and the holes of the earth. All of them received a testimony through their faith but they did not receive the promise because God had made provision for us to have something better, and they were not to reach perfection apart from us. And so, seeing that we are surrounded by such a great a cloud of witnesses, let us lay aside every weight and the sin which so easily entangles us. Let us run with endurance the race that is set before us, fixing our eyes on Jesus, the author and perfecter of faith.
ltx/en_us_eob/le.ep.mc.d127:lemcLI.Epistle.title	FIRST SUNDAY, SUNDAY OF ALL SAINTS
ltx/en_us_eob/le.ep.mc.d127:lemcLI.Epistle.title_abbr	FIRST SUNDAY, SUNDAY OF ALL SAINTS
ltx/en_us_eob/le.ep.mc.d127:lemcLI.Epistle.version	@ltx/en_us_eob/properties:version.designation
