ltx/en_us_eob/le.go.me.m09.dSunBC:lemeLI.Gospel.book_abbr	@ltx/en_us_eob/bible:John.abbr
ltx/en_us_eob/le.go.me.m09.dSunBC:lemeLI.Gospel.book_string	@ltx/en_us_eob/bible:John.text
ltx/en_us_eob/le.go.me.m09.dSunBC:lemeLI.Gospel.chapverse	3:13 – 17
ltx/en_us_eob/le.go.me.m09.dSunBC:lemeLI.Gospel.incipit	The Lord said: “No one has ascended into heaven,…
ltx/en_us_eob/le.go.me.m09.dSunBC:lemeLI.Gospel.text	The Lord said: “No one has ascended into heaven, except for the one who came down out of heaven, the Son of Man who is in heaven. And as Moses lifted up the serpent in the wilderness, likewise, the Son of Man must be lifted up, so that everyone believing in him should not perish but have eternal life. Indeed, God so loved the world that he gave his uniquely-begotten Son, so that everyone who believes in him should not perish but have eternal life. Certainly, God did not send his Son into the world to judge the world, but so that the world should be saved through him.”
ltx/en_us_eob/le.go.me.m09.dSunBC:lemeLI.Gospel.title	Sunday before the Exaltation
ltx/en_us_eob/le.go.me.m09.dSunBC:lemeLI.Gospel.title_abbr	Sunday before the Exaltation
ltx/en_us_eob/le.go.me.m09.dSunBC:lemeLI.Gospel.version	@ltx/en_us_eob/properties:version.designation
