ltx/en_us_eob/le.go.lu.d111:leluLI.Gospel.book_abbr	@ltx/en_us_eob/bible:Luke.abbr
ltx/en_us_eob/le.go.lu.d111:leluLI.Gospel.book_string	@ltx/en_us_eob/bible:Luke.text
ltx/en_us_eob/le.go.lu.d111:leluLI.Gospel.chapverse	18:2 – 8
ltx/en_us_eob/le.go.lu.d111:leluLI.Gospel.incipit	The Lord said this parable: “In a certain city,…
ltx/en_us_eob/le.go.lu.d111:leluLI.Gospel.text	The Lord said this parable: “In a certain city, there was a judge who did not fear God and did not care [about anyone]. A widow lived in that city, and she often came to him, saying: ‘Defend me from my adversary!’ For a time, he would not [do anything], but after a while, he said to himself, ‘Although I neither fear God nor care for anyone, yet because this widow is bothering me, I will defend her, or else she will wear me out by her continual visits.’” The Lord said, “Listen to what the unrighteous judge has to say! Will not God grant justice to his elect who are crying out to him day and night, although he exercises patience regarding them? I tell you that he will avenge them quickly!”
ltx/en_us_eob/le.go.lu.d111:leluLI.Gospel.title	Saturday of the Sixeenth Week
ltx/en_us_eob/le.go.lu.d111:leluLI.Gospel.title_abbr	Saturday of the Sixeenth Week
ltx/en_us_eob/le.go.lu.d111:leluLI.Gospel.version	@ltx/en_us_eob/properties:version.designation
