ltx/en_us_eob/le.go.mc.d022:lemcLI.Gospel.book_abbr	@ltx/en_us_eob/bible:Matthew.abbr
ltx/en_us_eob/le.go.mc.d022:lemcLI.Gospel.book_string	@ltx/en_us_eob/bible:Matthew.text
ltx/en_us_eob/le.go.mc.d022:lemcLI.Gospel.chapverse	6:14 – 21
ltx/en_us_eob/le.go.mc.d022:lemcLI.Gospel.incipit	The Lord said: “If you forgive people their offenses,…
ltx/en_us_eob/le.go.mc.d022:lemcLI.Gospel.text	The Lord said: “If you forgive people their offenses, your heavenly Father will also forgive you. But if you do not forgive people their offenses, neither will your Father forgive your offenses. Moreover, when you fast, do not be like the hypocrites with their gloomy faces: they disfigure their faces so that people may see that they are fasting! Amen, I tell you: they have received their reward. But you, when you fast, anoint your head and wash your face so that people may not see that you are fasting. Only your Father who is in secret will see, and your Father, who sees in secret, will reward you openly. Do not store up treasures for yourselves on the earth, where moth and rust consume and where thieves break in and steal. Instead, store for yourselves treasures in heaven, where neither moth nor rust consume, and where thieves do not break in and steal. Indeed, where your treasure is, there your heart will be also.”
ltx/en_us_eob/le.go.mc.d022:lemcLI.Gospel.title	Cheesefare Sunday
ltx/en_us_eob/le.go.mc.d022:lemcLI.Gospel.title_abbr	Cheesefare Sunday
ltx/en_us_eob/le.go.mc.d022:lemcLI.Gospel.version	@ltx/en_us_eob/properties:version.designation
