ltx/en_us_eob/le.go.mc.d155:lemcLI.Gospel.book_abbr	@ltx/en_us_eob/bible:Matthew.abbr
ltx/en_us_eob/le.go.mc.d155:lemcLI.Gospel.book_string	@ltx/en_us_eob/bible:Matthew.text
ltx/en_us_eob/le.go.mc.d155:lemcLI.Gospel.chapverse	8:28 – 34, 9:1
ltx/en_us_eob/le.go.mc.d155:lemcLI.Gospel.incipit	At that time, when Jesus arrived on the other…
ltx/en_us_eob/le.go.mc.d155:lemcLI.Gospel.text	At that time, when Jesus arrived on the other side, into the country of the Gergesenes, two men possessed by demons met him there, coming out of the tombs. They were extremely violent, so much that nobody could pass that way. Behold, they cried out, saying, “What do we have to do with you, Jesus, Son of God? Have you come here to torment us before the time?” Now there was a herd of many pigs feeding at some distance from them. The demons begged him, saying, “If you cast us out, allow us to go away into the herd of pigs.” He said to them, “Go!” The demons came out and went into the herd of pigs: and behold, the whole herd of pigs rushed down the cliff into the sea and died in the water. Those who fed them fled and went into the city where they told everything, including what had happened to those who were possessed with demons. Behold, the entire city came out to meet Jesus. When they saw him, they begged that he would depart from their borders. Jesus entered into a boat, crossed over [the lake] and came into his own town.
ltx/en_us_eob/le.go.mc.d155:lemcLI.Gospel.title	Fifth Sunday
ltx/en_us_eob/le.go.mc.d155:lemcLI.Gospel.title_abbr	Fifth Sunday
ltx/en_us_eob/le.go.mc.d155:lemcLI.Gospel.version	@ltx/en_us_eob/properties:version.designation
