ltx/en_us_eob/le.ep.me.m11.d04:lemeLI.Epistle.book_abbr	@ltx/en_us_eob/le.ep.mc.d246:lemcLI.Epistle.book_abbr
ltx/en_us_eob/le.ep.me.m11.d04:lemeLI.Epistle.book_string	@ltx/en_us_eob/le.ep.mc.d246:lemcLI.Epistle.book_string
ltx/en_us_eob/le.ep.me.m11.d04:lemeLI.Epistle.chapverse	@ltx/en_us_eob/le.ep.mc.d246:lemcLI.Epistle.chapverse
ltx/en_us_eob/le.ep.me.m11.d04:lemeLI.Epistle.incipit	@ltx/en_us_eob/le.ep.mc.d246:lemcLI.Epistle.incipit
ltx/en_us_eob/le.ep.me.m11.d04:lemeLI.Epistle.text	@ltx/en_us_eob/le.ep.mc.d246:lemcLI.Epistle.text
ltx/en_us_eob/le.ep.me.m11.d04:lemeLI.Epistle.title	For the Saints
ltx/en_us_eob/le.ep.me.m11.d04:lemeLI.Epistle.title_abbr	For the Saints
ltx/en_us_eob/le.ep.me.m11.d04:lemeLI.Epistle.version	@ltx/en_us_eob/le.ep.mc.d246:lemcLI.Epistle.version
