ltx/en_us_eob/le.ep.mc.d258:lemcLI.Epistle.book_abbr	@ltx/en_us_eob/bible:Philippians.abbr
ltx/en_us_eob/le.ep.mc.d258:lemcLI.Epistle.book_string	@ltx/en_us_eob/bible:Philippians.text
ltx/en_us_eob/le.ep.mc.d258:lemcLI.Epistle.chapverse	3:8 – 19
ltx/en_us_eob/le.ep.mc.d258:lemcLI.Epistle.incipit	Brethren, I consider all things as loss in view…
ltx/en_us_eob/le.ep.mc.d258:lemcLI.Epistle.text	Brethren, I consider all things as loss in view of the surpassing value of knowing Christ Jesus, my Lord, for whom I suffered the loss of all things. I consider them as dung, so that I may gain Christ and be found in him, not having a righteousness of my own (from the law), but through faith in Christ (the righteousness which is from God by faith). Yes, may I know him, and the power of his resurrection, and the communion of his sufferings, becoming conformed to his death, if by any means I may attain to the resurrection from the dead. I am not saying that I have already obtained these things or that I am already made perfect; but I press on to take hold of [the prize] for which Christ Jesus took hold of me. Brethren, I do yet not regard myself as having obtained these things just yet, but I do this: forgetting the things which are now behind and reaching forward to the things which are before [me], I press on toward the goal; and the prize is the high calling of God in Christ Jesus. Let us who are mature, therefore, think this way, and if you think differently in some way, God will also reveal that to you. Nevertheless, to whatever [point] we have already reached, let us walk by the same rule. Brethren, be united in imitating me, and keep your eyes fixed on those who live this way, even as you have us as an example. But there are many who live as enemies of the cross of Christ, as I remind you often, as I do [even] now with tears. Their end is destruction, their god is the belly, and their glory is in their shame as they think about earthly things.
ltx/en_us_eob/le.ep.mc.d258:lemcLI.Epistle.title	FRIDAY OF THE TWENTIETH WEEK
ltx/en_us_eob/le.ep.mc.d258:lemcLI.Epistle.title_abbr	FRIDAY OF THE TWENTIETH WEEK
ltx/en_us_eob/le.ep.mc.d258:lemcLI.Epistle.version	@ltx/en_us_eob/properties:version.designation
