ltx/en_us_eob/le.ep.me.m06.d02:lemeLI.Epistle.book_abbr	@ltx/en_us_eob/le.ep.me.m11.d06:lemeLI.Epistle.book_abbr
ltx/en_us_eob/le.ep.me.m06.d02:lemeLI.Epistle.book_string	@ltx/en_us_eob/le.ep.me.m11.d06:lemeLI.Epistle.book_string
ltx/en_us_eob/le.ep.me.m06.d02:lemeLI.Epistle.chapverse	@ltx/en_us_eob/le.ep.me.m11.d06:lemeLI.Epistle.chapverse
ltx/en_us_eob/le.ep.me.m06.d02:lemeLI.Epistle.incipit	@ltx/en_us_eob/le.ep.me.m11.d06:lemeLI.Epistle.incipit
ltx/en_us_eob/le.ep.me.m06.d02:lemeLI.Epistle.text	@ltx/en_us_eob/le.ep.me.m11.d06:lemeLI.Epistle.text
ltx/en_us_eob/le.ep.me.m06.d02:lemeLI.Epistle.title	For the Hierarch
ltx/en_us_eob/le.ep.me.m06.d02:lemeLI.Epistle.title_abbr	For the Hierarch
ltx/en_us_eob/le.ep.me.m06.d02:lemeLI.Epistle.version	@ltx/en_us_eob/le.ep.me.m11.d06:lemeLI.Epistle.version
