ltx/en_us_eob/le.go.mc.d235:lemcLI.Gospel.book_abbr	
ltx/en_us_eob/le.go.mc.d235:lemcLI.Gospel.book_string	
ltx/en_us_eob/le.go.mc.d235:lemcLI.Gospel.chapverse	
ltx/en_us_eob/le.go.mc.d235:lemcLI.Gospel.text	
ltx/en_us_eob/le.go.mc.d235:lemcLI.Gospel.title	
ltx/en_us_eob/le.go.mc.d235:lemcLI.Gospel.title_abbr	
ltx/en_us_eob/le.go.mc.d235:lemcLI.Gospel.version	
