ltx/en_us_eob/le.go.mc.d218:lemcLI.Gospel.book_abbr	@ltx/en_us_eob/bible:Matthew.abbr
ltx/en_us_eob/le.go.mc.d218:lemcLI.Gospel.book_string	@ltx/en_us_eob/bible:Matthew.text
ltx/en_us_eob/le.go.mc.d218:lemcLI.Gospel.chapverse	22:2 – 14
ltx/en_us_eob/le.go.mc.d218:lemcLI.Gospel.incipit	The Lord said this parable: “The Kingdom of Heaven…
ltx/en_us_eob/le.go.mc.d218:lemcLI.Gospel.text	The Lord said this parable: “The Kingdom of Heaven is like a king who planned a wedding feast for his son. He then sent out his slaves to call those who were invited to the wedding feast, but they refused to come. Again, the king sent out other slaves, saying: ‘Tell those who are invited, “Behold, I have prepared my dinner! My cattle and my fatted calves have been killed and everything is ready. Come to the wedding feast!”’ But those who were invited made light of it and went off, one to his own farm, another to his merchandise, and the others seized the king’s slaves, treated them shamefully, and killed them. But when the king heard about it, he was furious. He sent out his soldiers to destroy those murderers and to burn their city. Then the king said to his servants, ‘The wedding is ready, but those who were invited were not worthy. Go therefore to the crossroads of the highways, and as many people as you may find, invite to the wedding feast.’ Those slaves went out into the highways and gathered as many people as they could find, both good and bad. Thus, the wedding [hall] was filled with guests. But when the king came in to see the guests, he saw a man who was not wearing a wedding garment. He asked him, ‘Friend, how did you come in here, not wearing a wedding garment?’ And the man was speechless. Then the king said to the servants, ‘Bind him hand and foot, take him away, and throw him into the outer darkness where there will be weeping and grinding of teeth.’ Indeed, many are called, but few are chosen!”
ltx/en_us_eob/le.go.mc.d218:lemcLI.Gospel.title	Fourteenth Sunday
ltx/en_us_eob/le.go.mc.d218:lemcLI.Gospel.title_abbr	Fourteenth Sunday
ltx/en_us_eob/le.go.mc.d218:lemcLI.Gospel.version	@ltx/en_us_eob/properties:version.designation
