ltx/en_us_eob/le.go.me.m05.d10:lemeLI.Gospel.book_abbr	@ltx/en_us_eob/le.go.lu.d011:leluLI.Gospel.book_abbr
ltx/en_us_eob/le.go.me.m05.d10:lemeLI.Gospel.book_string	@ltx/en_us_eob/le.go.lu.d011:leluLI.Gospel.book_string
ltx/en_us_eob/le.go.me.m05.d10:lemeLI.Gospel.chapverse	@ltx/en_us_eob/le.go.lu.d011:leluLI.Gospel.chapverse
ltx/en_us_eob/le.go.me.m05.d10:lemeLI.Gospel.incipit	@ltx/en_us_eob/le.go.lu.d011:leluLI.Gospel.incipit
ltx/en_us_eob/le.go.me.m05.d10:lemeLI.Gospel.text	@ltx/en_us_eob/le.go.lu.d011:leluLI.Gospel.text
ltx/en_us_eob/le.go.me.m05.d10:lemeLI.Gospel.title	For the Apostle
ltx/en_us_eob/le.go.me.m05.d10:lemeLI.Gospel.title_abbr	For the Apostle
ltx/en_us_eob/le.go.me.m05.d10:lemeLI.Gospel.version	@ltx/en_us_eob/le.go.lu.d011:leluLI.Gospel.version
