ltx/en_us_eob/le.ep.me.m09.d30:lemeLI.Epistle.book_abbr	@ltx/en_us_eob/le.ep.mc.d211:lemcLI.Epistle.book_abbr
ltx/en_us_eob/le.ep.me.m09.d30:lemeLI.Epistle.book_string	@ltx/en_us_eob/le.ep.mc.d211:lemcLI.Epistle.book_string
ltx/en_us_eob/le.ep.me.m09.d30:lemeLI.Epistle.chapverse	@ltx/en_us_eob/le.ep.mc.d211:lemcLI.Epistle.chapverse
ltx/en_us_eob/le.ep.me.m09.d30:lemeLI.Epistle.incipit	@ltx/en_us_eob/le.ep.mc.d211:lemcLI.Epistle.incipit
ltx/en_us_eob/le.ep.me.m09.d30:lemeLI.Epistle.text	@ltx/en_us_eob/le.ep.mc.d211:lemcLI.Epistle.text
ltx/en_us_eob/le.ep.me.m09.d30:lemeLI.Epistle.title	For the Hieromartyr
ltx/en_us_eob/le.ep.me.m09.d30:lemeLI.Epistle.title_abbr	For the Hieromartyr
ltx/en_us_eob/le.ep.me.m09.d30:lemeLI.Epistle.version	@ltx/en_us_eob/le.ep.mc.d211:lemcLI.Epistle.version
