ltx/en_us_eob/le.ep.mc.d157:lemcLI.Epistle.book_abbr	@ltx/en_us_eob/bible:Corinthians1.abbr
ltx/en_us_eob/le.ep.mc.d157:lemcLI.Epistle.book_string	@ltx/en_us_eob/bible:Corinthians1.text
ltx/en_us_eob/le.ep.mc.d157:lemcLI.Epistle.chapverse	1:1 – 9
ltx/en_us_eob/le.ep.mc.d157:lemcLI.Epistle.incipit	Paul, called to be an apostle of Jesus Christ…
ltx/en_us_eob/le.ep.mc.d157:lemcLI.Epistle.text	Paul, called to be an apostle of Jesus Christ through the will of God, and our brother Sosthenes, to the Church of God which is at Corinth. [You are] those who are sanctified in Christ Jesus, called to be saints, with all those who call upon the Name of our Lord Jesus Christ in every place, both theirs and ours: Grace to you and peace from God our Father and the Lord Jesus Christ. I always give thanks to my God concerning you for the grace of God which was given to you in Christ Jesus; that in everything you have been enriched in him, in all [manner of] speech and knowledge; even as the testimony of Christ was confirmed in you. And so, you lack no gift as you wait for the revelation of our Lord Jesus Christ; who will also confirm you until the end, blameless in the day of our Lord Jesus Christ. God is faithful, through whom you were called into the fellowship of his Son Jesus Christ, our Lord.
ltx/en_us_eob/le.ep.mc.d157:lemcLI.Epistle.title	TUESDAY OF THE SIXTH WEEK
ltx/en_us_eob/le.ep.mc.d157:lemcLI.Epistle.title_abbr	TUESDAY OF THE SIXTH WEEK
ltx/en_us_eob/le.ep.mc.d157:lemcLI.Epistle.version	@ltx/en_us_eob/properties:version.designation
