ltx/en_us_eob/le.go.me.m01.d30:lemeLI.Gospel.book_abbr	@ltx/en_us_eob/le.go.ge.hierarch:legeLI.Gospel2.book_abbr
ltx/en_us_eob/le.go.me.m01.d30:lemeLI.Gospel.book_string	@ltx/en_us_eob/le.go.ge.hierarch:legeLI.Gospel2.book_string
ltx/en_us_eob/le.go.me.m01.d30:lemeLI.Gospel.chapverse	@ltx/en_us_eob/le.go.ge.hierarch:legeLI.Gospel2.chapverse
ltx/en_us_eob/le.go.me.m01.d30:lemeLI.Gospel.incipit	@ltx/en_us_eob/le.go.ge.hierarch:legeLI.Gospel2.incipit
ltx/en_us_eob/le.go.me.m01.d30:lemeLI.Gospel.text	@ltx/en_us_eob/le.go.ge.hierarch:legeLI.Gospel2.text
ltx/en_us_eob/le.go.me.m01.d30:lemeLI.Gospel.title	For the Saints
ltx/en_us_eob/le.go.me.m01.d30:lemeLI.Gospel.title_abbr	For the Saints
ltx/en_us_eob/le.go.me.m01.d30:lemeLI.Gospel.version	@ltx/en_us_eob/le.go.ge.hierarch:legeLI.Gospel2.version
ltx/en_us_eob/le.go.me.m01.d30:lemeMA.Gospel.book_abbr	@ltx/en_us_eob/le.go.ge.hierarch:legeLI.Gospel.book_abbr
ltx/en_us_eob/le.go.me.m01.d30:lemeMA.Gospel.book_string	@ltx/en_us_eob/le.go.ge.hierarch:legeLI.Gospel.book_string
ltx/en_us_eob/le.go.me.m01.d30:lemeMA.Gospel.chapverse	@ltx/en_us_eob/le.go.ge.hierarch:legeLI.Gospel.chapverse
ltx/en_us_eob/le.go.me.m01.d30:lemeMA.Gospel.incipit	@ltx/en_us_eob/le.go.ge.hierarch:legeLI.Gospel.incipit
ltx/en_us_eob/le.go.me.m01.d30:lemeMA.Gospel.text	@ltx/en_us_eob/le.go.ge.hierarch:legeLI.Gospel.text
ltx/en_us_eob/le.go.me.m01.d30:lemeMA.Gospel.title	For the Saints
ltx/en_us_eob/le.go.me.m01.d30:lemeMA.Gospel.title_abbr	For the Saints
ltx/en_us_eob/le.go.me.m01.d30:lemeMA.Gospel.version	@ltx/en_us_eob/le.go.ge.hierarch:legeLI.Gospel.version
