ltx/en_us_eob/le.ep.me.m11.d30:lemeLI.Epistle.book_abbr	@ltx/en_us_eob/le.ep.mc.d190:lemcLI.Epistle.book_abbr
ltx/en_us_eob/le.ep.me.m11.d30:lemeLI.Epistle.book_string	@ltx/en_us_eob/le.ep.mc.d190:lemcLI.Epistle.book_string
ltx/en_us_eob/le.ep.me.m11.d30:lemeLI.Epistle.chapverse	@ltx/en_us_eob/le.ep.mc.d190:lemcLI.Epistle.chapverse
ltx/en_us_eob/le.ep.me.m11.d30:lemeLI.Epistle.incipit	@ltx/en_us_eob/le.ep.mc.d190:lemcLI.Epistle.incipit
ltx/en_us_eob/le.ep.me.m11.d30:lemeLI.Epistle.text	@ltx/en_us_eob/le.ep.mc.d190:lemcLI.Epistle.text
ltx/en_us_eob/le.ep.me.m11.d30:lemeLI.Epistle.title	For the Apostle
ltx/en_us_eob/le.ep.me.m11.d30:lemeLI.Epistle.title_abbr	For the Apostle
ltx/en_us_eob/le.ep.me.m11.d30:lemeLI.Epistle.version	@ltx/en_us_eob/le.ep.mc.d190:lemcLI.Epistle.version
ltx/en_us_eob/le.ep.me.m11.d30:lemeVE.Reading1.book_string	@ltx/en_us_eob/le.ep.me.m06.d29:lemeVE.Reading1.book_string
ltx/en_us_eob/le.ep.me.m11.d30:lemeVE.Reading1.chapverse	@ltx/en_us_eob/le.ep.me.m06.d29:lemeVE.Reading1.chapverse
ltx/en_us_eob/le.ep.me.m11.d30:lemeVE.Reading1.incipit	@ltx/en_us_eob/le.ep.me.m06.d29:lemeVE.Reading1.incipit
ltx/en_us_eob/le.ep.me.m11.d30:lemeVE.Reading1.text	@ltx/en_us_eob/le.ep.me.m06.d29:lemeVE.Reading1.text
ltx/en_us_eob/le.ep.me.m11.d30:lemeVE.Reading1.title	
ltx/en_us_eob/le.ep.me.m11.d30:lemeVE.Reading1.title_abbr	
ltx/en_us_eob/le.ep.me.m11.d30:lemeVE.Reading1.version	@ltx/en_us_eob/properties:version.designation
ltx/en_us_eob/le.ep.me.m11.d30:lemeVE.Reading2.book_string	@ltx/en_us_eob/le.ep.me.m06.d29:lemeVE.Reading2.book_string
ltx/en_us_eob/le.ep.me.m11.d30:lemeVE.Reading2.chapverse	@ltx/en_us_eob/le.ep.me.m06.d29:lemeVE.Reading2.chapverse
ltx/en_us_eob/le.ep.me.m11.d30:lemeVE.Reading2.incipit	@ltx/en_us_eob/le.ep.me.m06.d29:lemeVE.Reading2.incipit
ltx/en_us_eob/le.ep.me.m11.d30:lemeVE.Reading2.text	@ltx/en_us_eob/le.ep.me.m06.d29:lemeVE.Reading2.text
ltx/en_us_eob/le.ep.me.m11.d30:lemeVE.Reading2.title	
ltx/en_us_eob/le.ep.me.m11.d30:lemeVE.Reading2.title_abbr	
ltx/en_us_eob/le.ep.me.m11.d30:lemeVE.Reading2.version	@ltx/en_us_eob/properties:version.designation
ltx/en_us_eob/le.ep.me.m11.d30:lemeVE.Reading3.book_string	@ltx/en_us_eob/le.ep.me.m06.d29:lemeVE.Reading3.book_string
ltx/en_us_eob/le.ep.me.m11.d30:lemeVE.Reading3.chapverse	@ltx/en_us_eob/le.ep.me.m06.d29:lemeVE.Reading3.chapverse
ltx/en_us_eob/le.ep.me.m11.d30:lemeVE.Reading3.incipit	@ltx/en_us_eob/le.ep.me.m06.d29:lemeVE.Reading3.incipit
ltx/en_us_eob/le.ep.me.m11.d30:lemeVE.Reading3.text	@ltx/en_us_eob/le.ep.me.m06.d29:lemeVE.Reading3.text
ltx/en_us_eob/le.ep.me.m11.d30:lemeVE.Reading3.title	
ltx/en_us_eob/le.ep.me.m11.d30:lemeVE.Reading3.title_abbr	
ltx/en_us_eob/le.ep.me.m11.d30:lemeVE.Reading3.version	@ltx/en_us_eob/properties:version.designation
