ltx/en_us_eob/le.ep.me.m08.d20:lemeLI.Epistle.book_abbr	@ltx/en_us_eob/le.ep.mc.d238:lemcLI.Epistle.book_abbr
ltx/en_us_eob/le.ep.me.m08.d20:lemeLI.Epistle.book_string	@ltx/en_us_eob/le.ep.mc.d238:lemcLI.Epistle.book_string
ltx/en_us_eob/le.ep.me.m08.d20:lemeLI.Epistle.chapverse	@ltx/en_us_eob/le.ep.mc.d238:lemcLI.Epistle.chapverse
ltx/en_us_eob/le.ep.me.m08.d20:lemeLI.Epistle.incipit	@ltx/en_us_eob/le.ep.mc.d238:lemcLI.Epistle.incipit
ltx/en_us_eob/le.ep.me.m08.d20:lemeLI.Epistle.text	@ltx/en_us_eob/le.ep.mc.d238:lemcLI.Epistle.text
ltx/en_us_eob/le.ep.me.m08.d20:lemeLI.Epistle.title	For the Prophet
ltx/en_us_eob/le.ep.me.m08.d20:lemeLI.Epistle.title_abbr	For the Prophet
ltx/en_us_eob/le.ep.me.m08.d20:lemeLI.Epistle.version	@ltx/en_us_eob/le.ep.mc.d238:lemcLI.Epistle.version
