ltx/en_us_eob/le.go.lu.d048:leluLI.Gospel.book_abbr	@ltx/en_us_eob/bible:Luke.abbr
ltx/en_us_eob/le.go.lu.d048:leluLI.Gospel.book_string	@ltx/en_us_eob/bible:Luke.text
ltx/en_us_eob/le.go.lu.d048:leluLI.Gospel.chapverse	9:1 – 6
ltx/en_us_eob/le.go.lu.d048:leluLI.Gospel.incipit	At that time, calling his twelve disciples together, Jesus…
ltx/en_us_eob/le.go.lu.d048:leluLI.Gospel.text	At that time, calling his twelve disciples together, Jesus gave them power and authority over all demons, and [power] to cure diseases. He then sent them forth to preach the Kingdom of God and to heal the sick. Jesus said to them, “Do not take anything for the journey – no staffs, no bag, no bread, no money, no extra tunic. Whatever house you enter, stay there until you leave from that place. Wherever people do not welcome you, shake the very dust off your feet when you leave their town, as a testimony against them.” They departed and went throughout the villages, preaching the Good News, and healing everywhere.
ltx/en_us_eob/le.go.lu.d048:leluLI.Gospel.title	Saturday of the Seventh Week
ltx/en_us_eob/le.go.lu.d048:leluLI.Gospel.title_abbr	Saturday of the Seventh Week
ltx/en_us_eob/le.go.lu.d048:leluLI.Gospel.version	@ltx/en_us_eob/properties:version.designation
