ltx/en_us_eob/le.ep.me.m10.d25:lemeLI.Epistle.book_abbr	@ltx/en_us_eob/le.ep.mc.d323:lemcLI.Epistle.book_abbr
ltx/en_us_eob/le.ep.me.m10.d25:lemeLI.Epistle.book_string	@ltx/en_us_eob/le.ep.mc.d323:lemcLI.Epistle.book_string
ltx/en_us_eob/le.ep.me.m10.d25:lemeLI.Epistle.chapverse	@ltx/en_us_eob/le.ep.mc.d323:lemcLI.Epistle.chapverse
ltx/en_us_eob/le.ep.me.m10.d25:lemeLI.Epistle.incipit	@ltx/en_us_eob/le.ep.mc.d323:lemcLI.Epistle.incipit
ltx/en_us_eob/le.ep.me.m10.d25:lemeLI.Epistle.text	@ltx/en_us_eob/le.ep.mc.d323:lemcLI.Epistle.text
ltx/en_us_eob/le.ep.me.m10.d25:lemeLI.Epistle.title	For the Martyrs
ltx/en_us_eob/le.ep.me.m10.d25:lemeLI.Epistle.title_abbr	For the Martyrs
ltx/en_us_eob/le.ep.me.m10.d25:lemeLI.Epistle.version	@ltx/en_us_eob/le.ep.mc.d323:lemcLI.Epistle.version
