ltx/en_us_eob/le.ep.me.m08.d02:lemeLI.Epistle.book_abbr	@ltx/en_us_eob/le.ep.mc.d086:lemcLI.Epistle.book_abbr
ltx/en_us_eob/le.ep.me.m08.d02:lemeLI.Epistle.book_string	@ltx/en_us_eob/le.ep.mc.d086:lemcLI.Epistle.book_string
ltx/en_us_eob/le.ep.me.m08.d02:lemeLI.Epistle.chapverse	@ltx/en_us_eob/le.ep.mc.d086:lemcLI.Epistle.chapverse
ltx/en_us_eob/le.ep.me.m08.d02:lemeLI.Epistle.incipit	@ltx/en_us_eob/le.ep.mc.d086:lemcLI.Epistle.incipit
ltx/en_us_eob/le.ep.me.m08.d02:lemeLI.Epistle.text	@ltx/en_us_eob/le.ep.mc.d086:lemcLI.Epistle.text
ltx/en_us_eob/le.ep.me.m08.d02:lemeLI.Epistle.title	For the Protomartyr
ltx/en_us_eob/le.ep.me.m08.d02:lemeLI.Epistle.title_abbr	For the Protomartyr
ltx/en_us_eob/le.ep.me.m08.d02:lemeLI.Epistle.version	@ltx/en_us_eob/le.ep.mc.d086:lemcLI.Epistle.version
