ltx/en_us_eob/le.go.lu.d036:leluLI.Gospel.book_abbr	@ltx/en_us_eob/bible:Luke.abbr
ltx/en_us_eob/le.go.lu.d036:leluLI.Gospel.book_string	@ltx/en_us_eob/bible:Luke.text
ltx/en_us_eob/le.go.lu.d036:leluLI.Gospel.chapverse	10:22 – 24
ltx/en_us_eob/le.go.lu.d036:leluLI.Gospel.incipit	The Lord said: “All things have been delivered to…
ltx/en_us_eob/le.go.lu.d036:leluLI.Gospel.text	The Lord said: “All things have been delivered to me by my Father. No one knows who the Son is, except the Father, or who the Father is, except the Son, and those to whom the Son chooses to reveal him.” Turning to the disciples, Jesus said privately, “Blessed are the eyes which see the things that you see! For I tell you that many prophets and kings desired to see what you see, but they did not see them; and to hear what you hear, but they did not hear them.”
ltx/en_us_eob/le.go.lu.d036:leluLI.Gospel.title	Monday of the Sixth Week
ltx/en_us_eob/le.go.lu.d036:leluLI.Gospel.title_abbr	Monday of the Sixth Week
ltx/en_us_eob/le.go.lu.d036:leluLI.Gospel.version	@ltx/en_us_eob/properties:version.designation
