ltx/en_us_eob/le.go.me.m10.d26:lemeLI.Gospel.book_abbr	@ltx/en_us_eob/le.go.mc.d091:lemcLI.Gospel.book_abbr
ltx/en_us_eob/le.go.me.m10.d26:lemeLI.Gospel.book_string	@ltx/en_us_eob/le.go.mc.d091:lemcLI.Gospel.book_string
ltx/en_us_eob/le.go.me.m10.d26:lemeLI.Gospel.chapverse	@ltx/en_us_eob/le.go.mc.d091:lemcLI.Gospel.chapverse
ltx/en_us_eob/le.go.me.m10.d26:lemeLI.Gospel.incipit	@ltx/en_us_eob/le.go.mc.d091:lemcLI.Gospel.incipit
ltx/en_us_eob/le.go.me.m10.d26:lemeLI.Gospel.text	@ltx/en_us_eob/le.go.mc.d091:lemcLI.Gospel.text
ltx/en_us_eob/le.go.me.m10.d26:lemeLI.Gospel.title	For the Saint
ltx/en_us_eob/le.go.me.m10.d26:lemeLI.Gospel.title_abbr	For the Saint
ltx/en_us_eob/le.go.me.m10.d26:lemeLI.Gospel.version	@ltx/en_us_eob/le.go.mc.d091:lemcLI.Gospel.version
ltx/en_us_eob/le.go.me.m10.d26:lemeLI.Gospel2.book_abbr	@ltx/en_us_eob/le.go.mc.d131:lemcLI.Gospel.book_abbr
ltx/en_us_eob/le.go.me.m10.d26:lemeLI.Gospel2.book_string	@ltx/en_us_eob/le.go.mc.d131:lemcLI.Gospel.book_string
ltx/en_us_eob/le.go.me.m10.d26:lemeLI.Gospel2.chapverse	@ltx/en_us_eob/le.go.mc.d131:lemcLI.Gospel.chapverse
ltx/en_us_eob/le.go.me.m10.d26:lemeLI.Gospel2.incipit	@ltx/en_us_eob/le.go.mc.d131:lemcLI.Gospel.incipit
ltx/en_us_eob/le.go.me.m10.d26:lemeLI.Gospel2.text	@ltx/en_us_eob/le.go.mc.d131:lemcLI.Gospel.text
ltx/en_us_eob/le.go.me.m10.d26:lemeLI.Gospel2.title	For the Earthquake
ltx/en_us_eob/le.go.me.m10.d26:lemeLI.Gospel2.title_abbr	For the Earthquake
ltx/en_us_eob/le.go.me.m10.d26:lemeLI.Gospel2.version	@ltx/en_us_eob/le.go.mc.d131:lemcLI.Gospel.version
ltx/en_us_eob/le.go.me.m10.d26:lemeMA.Gospel.book_abbr	@ltx/en_us_eob/le.go.lu.d079:leluLI.Gospel.book_abbr
ltx/en_us_eob/le.go.me.m10.d26:lemeMA.Gospel.book_string	@ltx/en_us_eob/le.go.lu.d079:leluLI.Gospel.book_string
ltx/en_us_eob/le.go.me.m10.d26:lemeMA.Gospel.chapverse	@ltx/en_us_eob/le.go.lu.d079:leluLI.Gospel.chapverse
ltx/en_us_eob/le.go.me.m10.d26:lemeMA.Gospel.incipit	@ltx/en_us_eob/le.go.lu.d079:leluLI.Gospel.incipit
ltx/en_us_eob/le.go.me.m10.d26:lemeMA.Gospel.text	@ltx/en_us_eob/le.go.lu.d079:leluLI.Gospel.text
ltx/en_us_eob/le.go.me.m10.d26:lemeMA.Gospel.title	For the Saint
ltx/en_us_eob/le.go.me.m10.d26:lemeMA.Gospel.title_abbr	For the Saint
ltx/en_us_eob/le.go.me.m10.d26:lemeMA.Gospel.version	@ltx/en_us_eob/le.go.lu.d079:leluLI.Gospel.version
