ltx/en_us_eob/le.go.me.m10.d02:lemeLI.Gospel.book_abbr	@ltx/en_us_eob/le.go.ge.hierarch:legeLI.Gospel.book_abbr
ltx/en_us_eob/le.go.me.m10.d02:lemeLI.Gospel.book_string	@ltx/en_us_eob/le.go.ge.hierarch:legeLI.Gospel.book_string
ltx/en_us_eob/le.go.me.m10.d02:lemeLI.Gospel.chapverse	@ltx/en_us_eob/le.go.ge.hierarch:legeLI.Gospel.chapverse
ltx/en_us_eob/le.go.me.m10.d02:lemeLI.Gospel.incipit	@ltx/en_us_eob/le.go.ge.hierarch:legeLI.Gospel.incipit
ltx/en_us_eob/le.go.me.m10.d02:lemeLI.Gospel.text	@ltx/en_us_eob/le.go.ge.hierarch:legeLI.Gospel.text
ltx/en_us_eob/le.go.me.m10.d02:lemeLI.Gospel.title	For the Hieromartyr
ltx/en_us_eob/le.go.me.m10.d02:lemeLI.Gospel.title_abbr	For the Hieromartyr
ltx/en_us_eob/le.go.me.m10.d02:lemeLI.Gospel.version	@ltx/en_us_eob/le.go.ge.hierarch:legeLI.Gospel.version
