ltx/en_us_eob/le.go.va.water:levaSW.Gospel.book_abbr	@ltx/en_us_eob/bible:John.abbr
ltx/en_us_eob/le.go.va.water:levaSW.Gospel.book_string	@ltx/en_us_eob/bible:John.text
ltx/en_us_eob/le.go.va.water:levaSW.Gospel.chapverse	5:1 – 4
ltx/en_us_eob/le.go.va.water:levaSW.Gospel.text	
ltx/en_us_eob/le.go.va.water:levaSW.Gospel.title	At Small Blessing of Water
ltx/en_us_eob/le.go.va.water:levaSW.Gospel.title_abbr	At Small Blessing of Water
ltx/en_us_eob/le.go.va.water:levaSW.Gospel.version	@ltx/en_us_eob/properties:version.designation
