ltx/en_us_eob/le.go.lu.d071:leluLI.Gospel.book_abbr	@ltx/en_us_eob/bible:Luke.abbr
ltx/en_us_eob/le.go.lu.d071:leluLI.Gospel.book_string	@ltx/en_us_eob/bible:Luke.text
ltx/en_us_eob/le.go.lu.d071:leluLI.Gospel.chapverse	19:37 – 44
ltx/en_us_eob/le.go.lu.d071:leluLI.Gospel.incipit	At that time, as Jesus was now approaching, at…
ltx/en_us_eob/le.go.lu.d071:leluLI.Gospel.text	At that time, as Jesus was now approaching, at the descent of the Mount of Olives, the whole multitude of the disciples began to rejoice and praise God with a loud voice for all the deeds of power which they had seen. [They were] saying, “Blessed is he who is coming, a King in the Name of the Lord! Peace in heaven, and glory in the highest!” And from the multitude, some of the Pharisees said to Jesus, “Teacher, rebuke your disciples!” But he answered them, “I tell you that if these were silent, the stones would cry out!” As Jesus was drawing near, he saw the city and began to weep over it, saying, “If you, even you, had today recognized what is for your peace! But now those things are hidden from your eyes! For the days will come upon you when your enemies will throw up a fortification around you, surround you, and hem you in on every side. They will crush you and your children within you to the ground. They will not leave in you one stone [standing] on another, because you did not know the time of your visitation.”
ltx/en_us_eob/le.go.lu.d071:leluLI.Gospel.title	Monday of the Eleventh Week
ltx/en_us_eob/le.go.lu.d071:leluLI.Gospel.title_abbr	Monday of the Eleventh Week
ltx/en_us_eob/le.go.lu.d071:leluLI.Gospel.version	@ltx/en_us_eob/properties:version.designation
