ltx/en_us_eob/le.go.mc.d211:lemcLI.Gospel.book_abbr	@ltx/en_us_eob/bible:Matthew.abbr
ltx/en_us_eob/le.go.mc.d211:lemcLI.Gospel.book_string	@ltx/en_us_eob/bible:Matthew.text
ltx/en_us_eob/le.go.mc.d211:lemcLI.Gospel.chapverse	21:33 – 42
ltx/en_us_eob/le.go.mc.d211:lemcLI.Gospel.incipit	The Lord said this parable: “There was a man…
ltx/en_us_eob/le.go.mc.d211:lemcLI.Gospel.text	The Lord said this parable: “There was a man who was the owner of a household. He planted a vineyard, put a fence around it, dug a winepress in it, built a tower, and leased it out to farmers. He then left for another country. When the season for the fruit drew near, he sent his slaves to the farmers, to receive his fruit. But the farmers took his slaves, beat one, killed another, and stoned yet another. Again, the owner sent other slaves, even more than the first time; and they treated them in the same way. Then he sent his son to them, saying: ‘They will respect my son!’ But the farmers, when they saw the son, said to each other, ‘This is the heir! Come, let us kill him and seize his inheritance.’ And so they seized him, threw him out of the vineyard, and killed him. Therefore, when the lord of the vineyard returns, what will he do with those farmers?” They answered him, “He will bring those wretches to a wretched end and he will lease out the vineyard to other farmers who will give him the fruit in its season.” Jesus said to them, “Have you never read in the Scriptures: ‘The [very] stone which the builders rejected was made the head of the corner. This was from the Lord and it is marvelous in our eyes?’”
ltx/en_us_eob/le.go.mc.d211:lemcLI.Gospel.title	Thirteenth Sunday
ltx/en_us_eob/le.go.mc.d211:lemcLI.Gospel.title_abbr	Thirteenth Sunday
ltx/en_us_eob/le.go.mc.d211:lemcLI.Gospel.version	@ltx/en_us_eob/properties:version.designation
