ltx/en_us_eob/le.ep.mc.d291:lemcLI.Epistle.book_abbr	@ltx/en_us_eob/bible:Thessalonians2.abbr
ltx/en_us_eob/le.ep.mc.d291:lemcLI.Epistle.book_string	@ltx/en_us_eob/bible:Thessalonians2.text
ltx/en_us_eob/le.ep.mc.d291:lemcLI.Epistle.chapverse	2:1 – 12
ltx/en_us_eob/le.ep.mc.d291:lemcLI.Epistle.incipit	Now, brethren, concerning the coming of our Lord Jesus…
ltx/en_us_eob/le.ep.mc.d291:lemcLI.Epistle.text	Now, brethren, concerning the coming of our Lord Jesus Christ and our gathering to him, we ask you not to be quickly shaken in your mind. Do not be troubled by a prophecy, report, or letter allegedly from us, saying that the day of Christ has come. Let no one deceive you in any way! This will not take place unless the apostasy comes first and the man of sin is revealed, the son of destruction. He opposes and exalts himself over all that is called God or that is an object of religion to take his seat as God in the sanctuary of God, presenting himself as a god! Do you not remember that when I was still with you, I told you these things? Now you know what is restraining him, so that he may be revealed in his own time. The mystery of lawlessness is already at work! But now, there is one who restrains, until he is taken out of the way. Then the lawless one will be revealed, whom the Lord will kill with the breath of his mouth and destroy by the manifestation of his coming. The coming [of the lawless one] is according to Satan’s operation with all kinds of power, miracles and lying wonders, and with all deception of wickedness among those who are being lost, because they did not receive the love of the truth so that they might be saved. Because of this, God will send them a strong delusion so that they should believe a lie and those who did not believe the truth but had pleasure in unrighteousness shall all be judged.
ltx/en_us_eob/le.ep.mc.d291:lemcLI.Epistle.title	WEDNESDAY OF THE TWENTY-FIFTH WEEK
ltx/en_us_eob/le.ep.mc.d291:lemcLI.Epistle.title_abbr	WEDNESDAY OF THE TWENTY-FIFTH WEEK
ltx/en_us_eob/le.ep.mc.d291:lemcLI.Epistle.version	@ltx/en_us_eob/properties:version.designation
