ltx/en_us_eob/le.go.mc.d001:lemcLI.Gospel.book_abbr	@ltx/en_us_eob/bible:Luke.abbr
ltx/en_us_eob/le.go.mc.d001:lemcLI.Gospel.book_string	@ltx/en_us_eob/bible:Luke.text
ltx/en_us_eob/le.go.mc.d001:lemcLI.Gospel.chapverse	18:10 – 14
ltx/en_us_eob/le.go.mc.d001:lemcLI.Gospel.incipit	@ltx/en_us_eob/le.go.lu.d112:leluLI.Gospel.incipit
ltx/en_us_eob/le.go.mc.d001:lemcLI.Gospel.text	@ltx/en_us_eob/le.go.lu.d112:leluLI.Gospel.text
ltx/en_us_eob/le.go.mc.d001:lemcLI.Gospel.title	Sunday of the Publican and Pharisee
ltx/en_us_eob/le.go.mc.d001:lemcLI.Gospel.title_abbr	Sunday of the Publican and Pharisee
ltx/en_us_eob/le.go.mc.d001:lemcLI.Gospel.version	@ltx/en_us_eob/properties:version.designation
