ltx/en_us_eob/le.ep.mc.d253:lemcLI.Epistle.book_abbr	@ltx/en_us_eob/bible:Corinthians2.abbr
ltx/en_us_eob/le.ep.mc.d253:lemcLI.Epistle.book_string	@ltx/en_us_eob/bible:Corinthians2.text
ltx/en_us_eob/le.ep.mc.d253:lemcLI.Epistle.chapverse	11:31 – 33; 12:1 – 9
ltx/en_us_eob/le.ep.mc.d253:lemcLI.Epistle.incipit	Brethren, the God and Father of our Lord Jesus…
ltx/en_us_eob/le.ep.mc.d253:lemcLI.Epistle.text	Brethren, the God and Father of our Lord Jesus Christ, he who is blessed unto the ages, knows that I do not lie. In Damascus, the governor of King Aretas guarded the city, desiring to arrest me. But I was let down in a basket along the wall through a window, and this is how I escaped from his hands. Without a doubt, it is not profitable for me to boast, but I will now discuss visions and revelations from the Lord. I know a man in Christ who fourteen years ago was caught up into the third heaven (whether [it was] in the body, I do not know, or whether out of the body, I do not know; God knows). [Yes], I know such a man (whether in the body, or outside of the body, I do not know; God knows), how he was caught up into Paradise, and heard ineffable words, which it is not lawful for anyone to utter. On behalf of such a person, I will boast, but on my own behalf I will not boast, except in my weaknesses. If my intention is to boast, I will not be foolish: I will speak the truth. But now, I shall stop, so that no one may think more of me than what is seen in me or heard from me. Because of the tremendous greatness of these revelations, a thorn in the flesh was given to me, a messenger of Satan that torments me, so that I would not be too exalted. Concerning this thing, I begged the Lord three times that it might depart from me, but he replied to me, “My grace is sufficient for you, for my power is made perfect in weakness.” And so, it is with joy that I would rather [find] glory in my weaknesses, so that the power of Christ may rest on me.
ltx/en_us_eob/le.ep.mc.d253:lemcLI.Epistle.title	NINETEENTH SUNDAY
ltx/en_us_eob/le.ep.mc.d253:lemcLI.Epistle.title_abbr	NINETEENTH SUNDAY
ltx/en_us_eob/le.ep.mc.d253:lemcLI.Epistle.version	@ltx/en_us_eob/properties:version.designation
