ltx/en_us_eob/le.go.lu.d098:leluLI.Gospel.book_abbr	@ltx/en_us_eob/bible:Luke.abbr
ltx/en_us_eob/le.go.lu.d098:leluLI.Gospel.book_string	@ltx/en_us_eob/bible:Luke.text
ltx/en_us_eob/le.go.lu.d098:leluLI.Gospel.chapverse	18:35 – 43
ltx/en_us_eob/le.go.lu.d098:leluLI.Gospel.incipit	At that time, as Jesus was approaching Jericho, a…
ltx/en_us_eob/le.go.lu.d098:leluLI.Gospel.text	At that time, as Jesus was approaching Jericho, a certain blind man sat by the road, begging. Hearing a crowd going by, he asked what this meant. People told him that Jesus of Nazareth was passing by. He began to cry out, “Jesus, son of David, have mercy on me!” Then those who led the way rebuked him, ordering him to be quiet. But the blind man cried out all the more, “Son of David, have mercy on me!” Standing still, Jesus commanded that the blind man be brought to him. When the man had come near, Jesus asked him, ”What do you want me to do?” The man replied, “Lord, that I may see again!” Jesus said to him, “Receive your sight. Your faith has healed you.” Immediately, the man received his sight and began to follow Jesus, glorifying God. When all the people saw this, they praised God.
ltx/en_us_eob/le.go.lu.d098:leluLI.Gospel.title	Sunday of the Fourteenth Week
ltx/en_us_eob/le.go.lu.d098:leluLI.Gospel.title_abbr	Sunday of the Fourteenth Week
ltx/en_us_eob/le.go.lu.d098:leluLI.Gospel.version	@ltx/en_us_eob/properties:version.designation
