ltx/en_us_eob/le.go.me.m01.d16:lemeLI.Gospel.book_abbr	@ltx/en_us_eob/le.go.eo.w11:leeoMA.Gospel.book_abbr
ltx/en_us_eob/le.go.me.m01.d16:lemeLI.Gospel.book_string	@ltx/en_us_eob/le.go.eo.w11:leeoMA.Gospel.book_string
ltx/en_us_eob/le.go.me.m01.d16:lemeLI.Gospel.chapverse	@ltx/en_us_eob/le.go.eo.w11:leeoMA.Gospel.chapverse
ltx/en_us_eob/le.go.me.m01.d16:lemeLI.Gospel.incipit	@ltx/en_us_eob/le.go.eo.w11:leeoMA.Gospel.incipit
ltx/en_us_eob/le.go.me.m01.d16:lemeLI.Gospel.text	@ltx/en_us_eob/le.go.eo.w11:leeoMA.Gospel.text
ltx/en_us_eob/le.go.me.m01.d16:lemeLI.Gospel.title	For the Apostle
ltx/en_us_eob/le.go.me.m01.d16:lemeLI.Gospel.title_abbr	For the Apostle
ltx/en_us_eob/le.go.me.m01.d16:lemeLI.Gospel.version	@ltx/en_us_eob/le.go.eo.w11:leeoMA.Gospel.version
