ltx/en_us_eob/le.go.mc.d056:lemcLI.Gospel.book_abbr	@ltx/en_us_eob/bible:Mark.abbr
ltx/en_us_eob/le.go.mc.d056:lemcLI.Gospel.book_string	@ltx/en_us_eob/bible:Mark.text
ltx/en_us_eob/le.go.mc.d056:lemcLI.Gospel.chapverse	8:27 – 31
ltx/en_us_eob/le.go.mc.d056:lemcLI.Gospel.incipit	At that time, Jesus went out with his disciples…
ltx/en_us_eob/le.go.mc.d056:lemcLI.Gospel.text	At that time, Jesus went out with his disciples into the villages of Caesarea Philippi. On the way, he asked his disciples, “Who do people say that I am?” They answered, “John the Baptizer, and others say Elias, but others yet [say that you are] one of the prophets.” Jesus said to them, “But you, who do you say that I am?” And Peter answered, “You are the Christ!” Jesus commanded them not to tell anyone who he was. He began to teach them that the Son of Man must suffer many things, and be rejected by the presbyters, the chief priests and the scribes, and be killed, and after three days rise again.
ltx/en_us_eob/le.go.mc.d056:lemcLI.Gospel.title	Saturday of the Fifth Week of Lent
ltx/en_us_eob/le.go.mc.d056:lemcLI.Gospel.title_abbr	Saturday of the Fifth Week of Lent
ltx/en_us_eob/le.go.mc.d056:lemcLI.Gospel.version	@ltx/en_us_eob/properties:version.designation
