ltx/en_us_eob/le.ep.mc.d329:lemcLI.Epistle.book_abbr	@ltx/en_us_eob/bible:Ephesians.abbr
ltx/en_us_eob/le.ep.mc.d329:lemcLI.Epistle.book_string	@ltx/en_us_eob/bible:Ephesians.text
ltx/en_us_eob/le.ep.mc.d329:lemcLI.Epistle.chapverse	5:1 – 8
ltx/en_us_eob/le.ep.mc.d329:lemcLI.Epistle.incipit	Brethren, be imitators of God, as beloved children. Walk…
ltx/en_us_eob/le.ep.mc.d329:lemcLI.Epistle.text	Brethren, be imitators of God, as beloved children. Walk in love, even as Christ also loved us and gave himself up for us as an offering and a sacrifice to God, a sweet-smelling fragrance. But sexual immorality and all forms of impurity and greed should not even be mentioned among you, as is fitting for saints. The same is true regarding filthy and foolish conversations as well as jokes which are not appropriate; instead, give thanks! Know this for sure: no one who is sexually immoral, involved in impurity, greedy, or an idolater has any inheritance in the Kingdom of Christ and God. Let no one deceive you with empty words; because of these things, the wrath of God is coming on the children of disobedience. Therefore, do not share in their lot. Indeed, you used to be in darkness, but now, you are light in the Lord.
ltx/en_us_eob/le.ep.mc.d329:lemcLI.Epistle.title	SATURDAY OF THE THIRTIETH WEEK
ltx/en_us_eob/le.ep.mc.d329:lemcLI.Epistle.title_abbr	SATURDAY OF THE THIRTIETH WEEK
ltx/en_us_eob/le.ep.mc.d329:lemcLI.Epistle.version	@ltx/en_us_eob/properties:version.designation
