ltx/en_us_duvall/me.m02.d07:alt1.meVE.SticBoth.incipit	@ltx/en_us_duvall/me.m02.d02:meVE.SticGlory.incipit
ltx/en_us_duvall/me.m02.d07:alt1.meVE.SticBoth.melody	
ltx/en_us_duvall/me.m02.d07:alt1.meVE.SticBoth.mode	@ltx/en_us_duvall/miscellanea:misc.Mode6
ltx/en_us_duvall/me.m02.d07:alt1.meVE.SticBoth.text	@ltx/en_us_duvall/me.m02.d02:meVE.SticGlory.text
