ltx/en_us_duvall/me.m02.d02:meLI.TheotokosHymn.incipit	@ltx/en_us_duvall/he.h.m3:heHE.EnNomoSkia.incipit
ltx/en_us_duvall/me.m02.d02:meLI.TheotokosHymn.mode	@ltx/en_us_duvall/miscellanea:misc.Mode3
ltx/en_us_duvall/me.m02.d02:meLI.TheotokosHymn.text	@ltx/en_us_duvall/he.h.m3:heHE.EnNomoSkia.text
ltx/en_us_duvall/me.m02.d02:meLI.TheotokosHymnVerse.incipit	@ltx/en_us_duvall/me.m02.d02:meMA.Ode9C1MTh.incipit
ltx/en_us_duvall/me.m02.d02:meLI.TheotokosHymnVerse.text	@ltx/en_us_duvall/me.m02.d02:meMA.Ode9C1MTh.text
ltx/en_us_duvall/me.m02.d02:meMA.Ode9C1M01.incipit	…
ltx/en_us_duvall/me.m02.d02:meMA.Ode9C1M01.text	Past the understanding of * all the angels, mortals, too, * Virgin Mother, Lady pure, * is that which occurred in you.
ltx/en_us_duvall/me.m02.d02:meMA.Ode9C1M02.incipit	…
ltx/en_us_duvall/me.m02.d02:meMA.Ode9C1M02.text	In his arms the Elder one, * Symeon, embraces You, * the Creator of the Law * and the Governor of All.
ltx/en_us_duvall/me.m02.d02:meMA.Ode9C1M03.incipit	…
ltx/en_us_duvall/me.m02.d02:meMA.Ode9C1M03.text	Wishing Adam to be saved, * He who fashioned us abode * in the womb immaculate * of the Virgin Lady pure.
ltx/en_us_duvall/me.m02.d02:meMA.Ode9C1M04.incipit	…
ltx/en_us_duvall/me.m02.d02:meMA.Ode9C1M04.text	Every generation of * mortal nature blesses you, * and, as Mother of our God, * gives you glory, Lady pure.
ltx/en_us_duvall/me.m02.d02:meMA.Ode9C1M05.incipit	…
ltx/en_us_duvall/me.m02.d02:meMA.Ode9C1M05.text	Come and see the Christ who is * Lord and Master of all things, * who today by Symeon * to the Temple now is borne.
ltx/en_us_duvall/me.m02.d02:meMA.Ode9C1M06.incipit	…
ltx/en_us_duvall/me.m02.d02:meMA.Ode9C1M06.text	You look down upon the earth * and thereby You make it quake; * how then does a worn old man * hold You now within his arms?
ltx/en_us_duvall/me.m02.d02:meMA.Ode9C1M07.incipit	…
ltx/en_us_duvall/me.m02.d02:meMA.Ode9C1M07.text	Symeon lived many years, * till the Christ he was to see, * then to Him he called aloud, * “My departure now I seek.”
ltx/en_us_duvall/me.m02.d02:meMA.Ode9C1M08.incipit	…
ltx/en_us_duvall/me.m02.d02:meMA.Ode9C1M08.text	You indeed, O Mariam, * have become the mystic tongs, * which enclosed the burning coal, * Christ conceived within your womb.
ltx/en_us_duvall/me.m02.d02:meMA.Ode9C1M09.incipit	…
ltx/en_us_duvall/me.m02.d02:meMA.Ode9C1M09.text	You, the pre-eternal God, * willed that You would take on flesh; * and so after forty days, * to the Temple You are brought.
ltx/en_us_duvall/me.m02.d02:meMA.Ode9C1M10.incipit	…
ltx/en_us_duvall/me.m02.d02:meMA.Ode9C1M10.text	Having come from heav’n above * is the Master of all things; * He is welcomed to His home * by the priest called Symeon.
ltx/en_us_duvall/me.m02.d02:meMA.Ode9C1M11.incipit	…
ltx/en_us_duvall/me.m02.d02:meMA.Ode9C1M11.text	Make my soul to shine, O Lord, * with the light perceptible, * that I purely look on You, * and proclaim You as my God.
ltx/en_us_duvall/me.m02.d02:meMA.Ode9C1M12.incipit	…
ltx/en_us_duvall/me.m02.d02:meMA.Ode9C1M12.text	Virgin Mother, Lady pure, * to the Temple what bring you? * “I now offer my new babe * to the arms of Symeon.”
ltx/en_us_duvall/me.m02.d02:meMA.Ode9C1M13.incipit	…
ltx/en_us_duvall/me.m02.d02:meMA.Ode9C1M13.text	Now departure do I seek * from my Lord and Fashioner, * for I saw You, O my Christ, * You, who are my saving Light.
ltx/en_us_duvall/me.m02.d02:meMA.Ode9C1M14.incipit	…
ltx/en_us_duvall/me.m02.d02:meMA.Ode9C1M14.text	Him, whom liturgists above * trembling praise in litany, * now below does Symeon * hold, embracing in his arms.
ltx/en_us_duvall/me.m02.d02:meMA.Ode9C1MTh.incipit	…
ltx/en_us_duvall/me.m02.d02:meMA.Ode9C1MTh.text	Theotokos, as the hope * of us Christians, one and all, * guard and shelter and protect * those who put their hope in you.
ltx/en_us_duvall/me.m02.d02:meMA.Ode9C1MTr.incipit	…
ltx/en_us_duvall/me.m02.d02:meMA.Ode9C1MTr.text	You by nature are but One, * yet in persons Trinity; * set a guard around those who, * serving, do believe in You.
ltx/en_us_duvall/me.m02.d02:meMA.Oikos1.text	To the Theotokos let us run, who desire to look upon her Son, being led to Symeon, and whom the angels in heaven above, scrutinizing in amazement aver, “Wondrous paradoxes we now ponder, inconceivable! inexpressible! He, who fashioned Adam, is held as a babe. He, the uncontainable, is by the Elder embraced. He, the uncircumscript in the bosom of His Father, is willingly delimited by flesh, not divinity, the only one who loves humanity.”
ltx/en_us_duvall/me.m02.d02:meMA.PostGospelIdiomelon.incipit	@ltx/en_us_duvall/me.m02.d02:meVE.SticGlory.incipit
ltx/en_us_duvall/me.m02.d02:meMA.PostGospelIdiomelon.melody	
ltx/en_us_duvall/me.m02.d02:meMA.PostGospelIdiomelon.mode	@ltx/en_us_duvall/miscellanea:misc.Mode6
ltx/en_us_duvall/me.m02.d02:meMA.PostGospelIdiomelon.poet	
ltx/en_us_duvall/me.m02.d02:meMA.PostGospelIdiomelon.text	@ltx/en_us_duvall/me.m02.d02:meVE.SticGlory.text
ltx/en_us_duvall/me.m02.d02:meVE.SticGlory.incipit	Let the gate of heaven…
ltx/en_us_duvall/me.m02.d02:meVE.SticGlory.melody	
ltx/en_us_duvall/me.m02.d02:meVE.SticGlory.mode	@ltx/en_us_duvall/miscellanea:misc.Mode6
ltx/en_us_duvall/me.m02.d02:meVE.SticGlory.poet	
ltx/en_us_duvall/me.m02.d02:meVE.SticGlory.text	Let the gate of heaven open today. For the Father’s beginningless Logos, having taken a beginning in time and not separated from His divinity, is willingly offered as a forty-day old infant, in the Temple of the Law, by His virgin Mother. And the Elder receives Him in his arms. “Let me depart,” cries the servant to the Master. “For my eyes have seen Your salvation.” O Lord, who came to the world to save the human race, glory to You!
