ltx/en_us_dedes/sy.m12.d02:alt1.syMA.commemoration01.couplet1.title	@ltx/en_us_dedes/titles:ti.Verses
ltx/en_us_dedes/sy.m12.d02:alt1.syMA.commemoration01.couplet1.verse1	Porphyrios, you wished to emulate the Hut Dweller,
ltx/en_us_dedes/sy.m12.d02:alt1.syMA.commemoration01.couplet1.verse2	so you ran to Athos and lived as an ascetic.
ltx/en_us_dedes/sy.m12.d02:alt1.syMA.commemoration01.narration.p01	
ltx/en_us_dedes/sy.m12.d02:alt1.syMA.commemoration01.single1	On the second, Porphyrios exchanged earth for Paradise.
ltx/en_us_dedes/sy.m12.d02:alt1.syMA.commemoration01.text	On December 2, we commemorate our devout and God-bearing father Porphyrios of Kafsokalyvia, the clairvoyant and miracle-worker.
ltx/en_us_dedes/sy.m12.d02:syMA.commemoration01.couplet1.title	@ltx/en_us_dedes/titles:ti.Verses
ltx/en_us_dedes/sy.m12.d02:syMA.commemoration01.couplet1.verse1	
ltx/en_us_dedes/sy.m12.d02:syMA.commemoration01.couplet1.verse2	
ltx/en_us_dedes/sy.m12.d02:syMA.commemoration01.narration.p01	
ltx/en_us_dedes/sy.m12.d02:syMA.commemoration01.narration.p02	
ltx/en_us_dedes/sy.m12.d02:syMA.commemoration01.single1	
ltx/en_us_dedes/sy.m12.d02:syMA.commemoration01.text	On December 2, we commemorate the holy Prophet Habakkuk.
ltx/en_us_dedes/sy.m12.d02:syMA.commemoration01as02.text	On this day we also commemorate the holy Prophet Habakkuk.
ltx/en_us_dedes/sy.m12.d02:syMA.commemoration02.couplet1.title	@ltx/en_us_dedes/titles:ti.Verses
ltx/en_us_dedes/sy.m12.d02:syMA.commemoration02.couplet1.verse1	
ltx/en_us_dedes/sy.m12.d02:syMA.commemoration02.couplet1.verse2	
ltx/en_us_dedes/sy.m12.d02:syMA.commemoration02.narration.p01	
ltx/en_us_dedes/sy.m12.d02:syMA.commemoration02.text	On this day we also commemorate our devout fathers the hermits John, Heraklaemon, Andrew, and Theophilos.
ltx/en_us_dedes/sy.m12.d02:syMA.commemoration03.couplet1.title	@ltx/en_us_dedes/titles:ti.Verses
ltx/en_us_dedes/sy.m12.d02:syMA.commemoration03.couplet1.verse1	
ltx/en_us_dedes/sy.m12.d02:syMA.commemoration03.couplet1.verse2	
ltx/en_us_dedes/sy.m12.d02:syMA.commemoration03.narration.p01	
ltx/en_us_dedes/sy.m12.d02:syMA.commemoration03.narration.p02	
ltx/en_us_dedes/sy.m12.d02:syMA.commemoration03.narration.p03	
ltx/en_us_dedes/sy.m12.d02:syMA.commemoration03.narration.p04	
ltx/en_us_dedes/sy.m12.d02:syMA.commemoration03.narration.p05	
ltx/en_us_dedes/sy.m12.d02:syMA.commemoration03.text	On this day we also commemorate the holy martyr Myropi.
ltx/en_us_dedes/sy.m12.d02:syMA.commemoration04.couplet1.title	@ltx/en_us_dedes/titles:ti.Verses
ltx/en_us_dedes/sy.m12.d02:syMA.commemoration04.couplet1.verse1	
ltx/en_us_dedes/sy.m12.d02:syMA.commemoration04.couplet1.verse2	
ltx/en_us_dedes/sy.m12.d02:syMA.commemoration04.text	We also commemorate our devout father Cyril Phileotis, who was an ascetic in the year 1060.
ltx/en_us_dedes/sy.m12.d02:syMA.commemoration05.couplet1.title	@ltx/en_us_dedes/titles:ti.Verses
ltx/en_us_dedes/sy.m12.d02:syMA.commemoration05.couplet1.verse1	
ltx/en_us_dedes/sy.m12.d02:syMA.commemoration05.couplet1.verse2	
ltx/en_us_dedes/sy.m12.d02:syMA.commemoration05.text	Saint Habib the New, died by fire.
ltx/en_us_dedes/sy.m12.d02:syMA.commemoration06.couplet1.title	@ltx/en_us_dedes/titles:ti.Verses
ltx/en_us_dedes/sy.m12.d02:syMA.commemoration06.couplet1.verse1	
ltx/en_us_dedes/sy.m12.d02:syMA.commemoration06.couplet1.verse2	
ltx/en_us_dedes/sy.m12.d02:syMA.commemoration06.text	Our father among the saints Solomon, Archbishop of Ephesus, died in peace.
ltx/en_us_dedes/sy.m12.d02:syMA.commemoration07.couplet1.title	@ltx/en_us_dedes/titles:ti.Verses
ltx/en_us_dedes/sy.m12.d02:syMA.commemoration07.couplet1.verse1	Porphyrios, you wished to emulate the Hut Dweller,
ltx/en_us_dedes/sy.m12.d02:syMA.commemoration07.couplet1.verse2	so you ran to Athos and lived as an ascetic.
ltx/en_us_dedes/sy.m12.d02:syMA.commemoration07.narration.p01	
ltx/en_us_dedes/sy.m12.d02:syMA.commemoration07.single1	On the second, Porphyrios exchanged earth for Paradise.
ltx/en_us_dedes/sy.m12.d02:syMA.commemoration07.text	On this day we also commemorate our devout and God-bearing father Porphyrios of Kafsokalyvia, the clairvoyant and miracle-worker.
ltx/en_us_dedes/sy.m12.d02:syMA.lastline	By their holy intercessions, O God, have mercy on us. Amen.
