ltx/en_us_dedes/ho.ho21:R01	
ltx/en_us_dedes/ho.ho21:R02	
ltx/en_us_dedes/ho.ho21:R03	
ltx/en_us_dedes/ho.ho21:R04	
ltx/en_us_dedes/ho.ho21:ho.title	Service of Preparation for Holy Communion
ltx/en_us_dedes/ho.ho21:ho.title2	
ltx/en_us_dedes/ho.ho21:hoCA.Kontakion.incipit	I pray you do not…
ltx/en_us_dedes/ho.ho21:hoCA.Kontakion.melody	@ltx/en_us_dedes/he.a.m2:heAU.TaAnoZiton.name
ltx/en_us_dedes/ho.ho21:hoCA.Kontakion.mode	@ltx/en_us_dedes/miscellanea:misc.Mode2
ltx/en_us_dedes/ho.ho21:hoCA.Kontakion.text	I pray you do not forbid me to receive the Bread, Your Body, O Christ, nor deny me Your holy Blood. May receiving Your awe-inspiring, immaculate Mysteries be to me, wretched sinner, not for judgment, O loving Lord; may it rather be to me for immortal and everlasting life.
ltx/en_us_dedes/ho.ho21:hoCA.Ode11.greekmelody	@ltx/en_us_dedes/he.h.m2:heHE.DefteLaoi.greekname
ltx/en_us_dedes/ho.ho21:hoCA.Ode11.incipit	Merciful Lord, may Your holy…
ltx/en_us_dedes/ho.ho21:hoCA.Ode11.melody	@ltx/en_us_dedes/he.h.m2:heHE.DefteLaoi.name
ltx/en_us_dedes/ho.ho21:hoCA.Ode11.mode	@ltx/en_us_dedes/miscellanea:misc.Mode2
ltx/en_us_dedes/ho.ho21:hoCA.Ode11.ode	@ltx/en_us_dedes/miscellanea:misc.Ode1
ltx/en_us_dedes/ho.ho21:hoCA.Ode11.text	Merciful Lord, may Your holy body be for me the bread of everlasting life; and may Your precious blood, O compassionate Master, prevent me from succumbing to illness of any kind.
ltx/en_us_dedes/ho.ho21:hoCA.Ode12.incipit	I am defiled by my…
ltx/en_us_dedes/ho.ho21:hoCA.Ode12.melody	@ltx/en_us_dedes/he.h.m2:heHE.DefteLaoi.name
ltx/en_us_dedes/ho.ho21:hoCA.Ode12.mode	@ltx/en_us_dedes/miscellanea:misc.Mode2
ltx/en_us_dedes/ho.ho21:hoCA.Ode12.ode	@ltx/en_us_dedes/miscellanea:misc.Ode1
ltx/en_us_dedes/ho.ho21:hoCA.Ode12.text	I am defiled by my inappropriate deeds, for which I am unworthy of the most pure body and divine blood of my Savior. O Christ, I entreat You, let me partake of them.
ltx/en_us_dedes/ho.ho21:hoCA.Ode1T.incipit	Bride of God, you are…
ltx/en_us_dedes/ho.ho21:hoCA.Ode1T.melody	@ltx/en_us_dedes/he.h.m2:heHE.DefteLaoi.name
ltx/en_us_dedes/ho.ho21:hoCA.Ode1T.mode	@ltx/en_us_dedes/miscellanea:misc.Mode2
ltx/en_us_dedes/ho.ho21:hoCA.Ode1T.ode	@ltx/en_us_dedes/miscellanea:misc.Ode1
ltx/en_us_dedes/ho.ho21:hoCA.Ode1T.text	Bride of God, you are the blessed good earth that produced the ear of grain, which no man sowed and which became the world’s salvation. And now, as I eat it, grant that I be saved by it.
ltx/en_us_dedes/ho.ho21:hoCA.Ode31.greekmelody	@ltx/en_us_dedes/he.h.m2:heHE.EnPetraMeTisPisteos.greekname
ltx/en_us_dedes/ho.ho21:hoCA.Ode31.incipit	O Christ, grant me a…
ltx/en_us_dedes/ho.ho21:hoCA.Ode31.melody	@ltx/en_us_dedes/he.h.m2:heHE.EnPetraMeTisPisteos.name
ltx/en_us_dedes/ho.ho21:hoCA.Ode31.mode	@ltx/en_us_dedes/miscellanea:misc.Mode2
ltx/en_us_dedes/ho.ho21:hoCA.Ode31.ode	@ltx/en_us_dedes/miscellanea:misc.Ode3
ltx/en_us_dedes/ho.ho21:hoCA.Ode31.text	O Christ, grant me a faucet of cleansing teardrops to wash away the stain of my heart’s defilement, that purified by them and with a good conscience, O Master, I may come to You with fear and faith, and with love partake of Your holy gifts, O Lord.
ltx/en_us_dedes/ho.ho21:hoCA.Ode32.incipit	For pardon of the multitude…
ltx/en_us_dedes/ho.ho21:hoCA.Ode32.melody	@ltx/en_us_dedes/he.h.m2:heHE.EnPetraMeTisPisteos.name
ltx/en_us_dedes/ho.ho21:hoCA.Ode32.mode	@ltx/en_us_dedes/miscellanea:misc.Mode2
ltx/en_us_dedes/ho.ho21:hoCA.Ode32.ode	@ltx/en_us_dedes/miscellanea:misc.Ode3
ltx/en_us_dedes/ho.ho21:hoCA.Ode32.text	For pardon of the multitude of transgressions, communion with the life-giving Holy Spirit, eternal life, and freedom from all afflictions and passions troubling me be Your immaculate body and divine blood, O benevolent Lord.
ltx/en_us_dedes/ho.ho21:hoCA.Ode3T.incipit	O Virgin Maid, you are…
ltx/en_us_dedes/ho.ho21:hoCA.Ode3T.melody	@ltx/en_us_dedes/he.h.m2:heHE.EnPetraMeTisPisteos.name
ltx/en_us_dedes/ho.ho21:hoCA.Ode3T.mode	@ltx/en_us_dedes/miscellanea:misc.Mode2
ltx/en_us_dedes/ho.ho21:hoCA.Ode3T.ode	@ltx/en_us_dedes/miscellanea:misc.Ode3
ltx/en_us_dedes/ho.ho21:hoCA.Ode3T.text	O Virgin Maid, you are the all-holy table of the Bread of life, the Son of God, who for mercy came down and gave new life to the world and saved it. Now I who am unworthy earnestly entreat that you count me worthy to eat it and to live.
ltx/en_us_dedes/ho.ho21:hoCA.Ode41.greekmelody	@ltx/en_us_dedes/he.h.m2:heHE.ElilythasEkParthenou.greekname
ltx/en_us_dedes/ho.ho21:hoCA.Ode41.incipit	You willed to become incarnate…
ltx/en_us_dedes/ho.ho21:hoCA.Ode41.melody	@ltx/en_us_dedes/he.h.m2:heHE.ElilythasEkParthenou.name
ltx/en_us_dedes/ho.ho21:hoCA.Ode41.mode	@ltx/en_us_dedes/miscellanea:misc.Mode2
ltx/en_us_dedes/ho.ho21:hoCA.Ode41.ode	@ltx/en_us_dedes/miscellanea:misc.Ode4
ltx/en_us_dedes/ho.ho21:hoCA.Ode41.text	You willed to become incarnate for us, Lord most merciful, and as a Lamb be sacrificed for all the sins of humanity. Therefore I implore You now, to blot out my offenses and to wash me from my lawlessness.
ltx/en_us_dedes/ho.ho21:hoCA.Ode42.incipit	O Master, I pray You…
ltx/en_us_dedes/ho.ho21:hoCA.Ode42.melody	@ltx/en_us_dedes/he.h.m2:heHE.ElilythasEkParthenou.name
ltx/en_us_dedes/ho.ho21:hoCA.Ode42.mode	@ltx/en_us_dedes/miscellanea:misc.Mode2
ltx/en_us_dedes/ho.ho21:hoCA.Ode42.ode	@ltx/en_us_dedes/miscellanea:misc.Ode4
ltx/en_us_dedes/ho.ho21:hoCA.Ode42.text	O Master, I pray You, heal the wounds of my sorry soul, and though I am wretched, sanctify me, body and soul alike. Make me worthy to partake of Your divine and most mystical supper, O gracious Lord.
ltx/en_us_dedes/ho.ho21:hoCA.Ode4T.incipit	O Lady, implore your Son…
ltx/en_us_dedes/ho.ho21:hoCA.Ode4T.melody	@ltx/en_us_dedes/he.h.m2:heHE.ElilythasEkParthenou.name
ltx/en_us_dedes/ho.ho21:hoCA.Ode4T.mode	@ltx/en_us_dedes/miscellanea:misc.Mode2
ltx/en_us_dedes/ho.ho21:hoCA.Ode4T.ode	@ltx/en_us_dedes/miscellanea:misc.Ode4
ltx/en_us_dedes/ho.ho21:hoCA.Ode4T.text	O Lady, implore your Son to be merciful unto me. I entreat you, keep me free of every sin and impurity, so that when I dare receive the holy pearl of communion, I may truly be sanctified.
ltx/en_us_dedes/ho.ho21:hoCA.Ode51.greekmelody	@ltx/en_us_dedes/he.h.m2:heHE.OTouFotosChorigos.greekname
ltx/en_us_dedes/ho.ho21:hoCA.Ode51.incipit	As You once said it…
ltx/en_us_dedes/ho.ho21:hoCA.Ode51.melody	@ltx/en_us_dedes/he.h.m2:heHE.OTouFotosChorigos.name
ltx/en_us_dedes/ho.ho21:hoCA.Ode51.mode	@ltx/en_us_dedes/miscellanea:misc.Mode2
ltx/en_us_dedes/ho.ho21:hoCA.Ode51.ode	@ltx/en_us_dedes/miscellanea:misc.Ode5
ltx/en_us_dedes/ho.ho21:hoCA.Ode51.text	As You once said it, O Christ, so let it be to me Your worthless servant: Abide in me, even as you promised. For now I am about to eat Your holy body and drink Your most precious blood.
ltx/en_us_dedes/ho.ho21:hoCA.Ode52.incipit	O Word of God and…
ltx/en_us_dedes/ho.ho21:hoCA.Ode52.melody	@ltx/en_us_dedes/he.h.m2:heHE.OTouFotosChorigos.name
ltx/en_us_dedes/ho.ho21:hoCA.Ode52.mode	@ltx/en_us_dedes/miscellanea:misc.Mode2
ltx/en_us_dedes/ho.ho21:hoCA.Ode52.ode	@ltx/en_us_dedes/miscellanea:misc.Ode5
ltx/en_us_dedes/ho.ho21:hoCA.Ode52.text	O Word of God and God, may the live coal of Your divine body be illumination to me, bedarkened, and may Your holy blood be purification for my defiled soul.
ltx/en_us_dedes/ho.ho21:hoCA.Ode5T.incipit	O Mary, Mother of God…
ltx/en_us_dedes/ho.ho21:hoCA.Ode5T.melody	@ltx/en_us_dedes/he.h.m2:heHE.OTouFotosChorigos.name
ltx/en_us_dedes/ho.ho21:hoCA.Ode5T.mode	@ltx/en_us_dedes/miscellanea:misc.Mode2
ltx/en_us_dedes/ho.ho21:hoCA.Ode5T.ode	@ltx/en_us_dedes/miscellanea:misc.Ode5
ltx/en_us_dedes/ho.ho21:hoCA.Ode5T.text	O Mary, Mother of God, the tabernacle of the fragrance of God, I pray you make me a chosen vessel, by your almighty prayers, that I may partake of your Son’s holy Sacrament.
ltx/en_us_dedes/ho.ho21:hoCA.Ode61.greekmelody	@ltx/en_us_dedes/he.h.m2:heHE.EnAvyssoPtaismaton.greekname
ltx/en_us_dedes/ho.ho21:hoCA.Ode61.incipit	Savior, hallow my intellect, soul…
ltx/en_us_dedes/ho.ho21:hoCA.Ode61.melody	@ltx/en_us_dedes/he.h.m2:heHE.EnAvyssoPtaismaton.name
ltx/en_us_dedes/ho.ho21:hoCA.Ode61.mode	@ltx/en_us_dedes/miscellanea:misc.Mode2
ltx/en_us_dedes/ho.ho21:hoCA.Ode61.ode	@ltx/en_us_dedes/miscellanea:misc.Ode6
ltx/en_us_dedes/ho.ho21:hoCA.Ode61.text	Savior, hallow my intellect, soul and heart, and my body, so that I may worthily approach Your awe-inspiring Mysteries, and not eat and drink judgment upon myself.
ltx/en_us_dedes/ho.ho21:hoCA.Ode62.incipit	Through communion of Your holy…
ltx/en_us_dedes/ho.ho21:hoCA.Ode62.melody	@ltx/en_us_dedes/he.h.m2:heHE.EnAvyssoPtaismaton.name
ltx/en_us_dedes/ho.ho21:hoCA.Ode62.mode	@ltx/en_us_dedes/miscellanea:misc.Mode2
ltx/en_us_dedes/ho.ho21:hoCA.Ode62.ode	@ltx/en_us_dedes/miscellanea:misc.Ode6
ltx/en_us_dedes/ho.ho21:hoCA.Ode62.text	Through communion of Your holy Mysteries, may I become a stranger to the sinful passions, may grace be added unto me, and may I have assurance of life, O Christ.
ltx/en_us_dedes/ho.ho21:hoCA.Ode6T.incipit	Being holy, as God and…
ltx/en_us_dedes/ho.ho21:hoCA.Ode6T.melody	@ltx/en_us_dedes/he.h.m2:heHE.EnAvyssoPtaismaton.name
ltx/en_us_dedes/ho.ho21:hoCA.Ode6T.mode	@ltx/en_us_dedes/miscellanea:misc.Mode2
ltx/en_us_dedes/ho.ho21:hoCA.Ode6T.ode	@ltx/en_us_dedes/miscellanea:misc.Ode6
ltx/en_us_dedes/ho.ho21:hoCA.Ode6T.text	Being holy, as God and the Word of God, through Your holy Mother’s intercession, sanctify the whole of me as I approach Your divine and immaculate Mysteries.
ltx/en_us_dedes/ho.ho21:hoCA.Ode71.greekmelody	@ltx/en_us_dedes/he.h.m2:heHE.EikonosChrysis.greekname
ltx/en_us_dedes/ho.ho21:hoCA.Ode71.incipit	Immortal, O Christ, are Your…
ltx/en_us_dedes/ho.ho21:hoCA.Ode71.melody	@ltx/en_us_dedes/he.h.m2:heHE.EikonosChrysis.name
ltx/en_us_dedes/ho.ho21:hoCA.Ode71.mode	@ltx/en_us_dedes/miscellanea:misc.Mode2
ltx/en_us_dedes/ho.ho21:hoCA.Ode71.ode	@ltx/en_us_dedes/miscellanea:misc.Ode7
ltx/en_us_dedes/ho.ho21:hoCA.Ode71.text	Immortal, O Christ, are Your Mysteries, of which I am partaking. May this become for me the source of light and life, dispassion and every good; may it give me growth and advancement in divine virtue by Your grace, that I may glorify You, only good and merciful Lord.
ltx/en_us_dedes/ho.ho21:hoCA.Ode72.incipit	From passions and foes, from…
ltx/en_us_dedes/ho.ho21:hoCA.Ode72.melody	@ltx/en_us_dedes/he.h.m2:heHE.EikonosChrysis.name
ltx/en_us_dedes/ho.ho21:hoCA.Ode72.mode	@ltx/en_us_dedes/miscellanea:misc.Mode2
ltx/en_us_dedes/ho.ho21:hoCA.Ode72.ode	@ltx/en_us_dedes/miscellanea:misc.Ode7
ltx/en_us_dedes/ho.ho21:hoCA.Ode72.text	From passions and foes, from necessity and every tribulation, may I be rescued as I come to Your divine, immortal Mysteries reverently with trembling and longing, O benevolent Lord of all, to sing to You, “O God of our Fathers, glory to You.”
ltx/en_us_dedes/ho.ho21:hoCA.Ode7T.incipit	O Maid full of grace…
ltx/en_us_dedes/ho.ho21:hoCA.Ode7T.melody	@ltx/en_us_dedes/he.h.m2:heHE.EikonosChrysis.name
ltx/en_us_dedes/ho.ho21:hoCA.Ode7T.mode	@ltx/en_us_dedes/miscellanea:misc.Mode2
ltx/en_us_dedes/ho.ho21:hoCA.Ode7T.ode	@ltx/en_us_dedes/miscellanea:misc.Ode7
ltx/en_us_dedes/ho.ho21:hoCA.Ode7T.text	O Maid full of grace, you ineffably gave birth to Christ the Savior. Now I, your unclean servant pray to you who are most pure and immaculate: As I now prepare to go forward to receive the Holy Eucharist, completely cleanse me of impurities of body and soul.
ltx/en_us_dedes/ho.ho21:hoCA.Ode81.greekmelody	@ltx/en_us_dedes/he.h.m2:heHE.TonEnKaminoTouPyros.greekname
ltx/en_us_dedes/ho.ho21:hoCA.Ode81.incipit	Your holy Mysteries, O Christ…
ltx/en_us_dedes/ho.ho21:hoCA.Ode81.melody	@ltx/en_us_dedes/he.h.m2:heHE.TonEnKaminoTouPyros.name
ltx/en_us_dedes/ho.ho21:hoCA.Ode81.mode	@ltx/en_us_dedes/miscellanea:misc.Mode2
ltx/en_us_dedes/ho.ho21:hoCA.Ode81.ode	@ltx/en_us_dedes/miscellanea:misc.Ode8
ltx/en_us_dedes/ho.ho21:hoCA.Ode81.text	Your holy Mysteries, O Christ, are from heaven and are therefore awe-inspiring. And the mystical Supper that You prepared is divine. Now I who am desperate pray to You: Grant me to partake of it, O my God and Savior.
ltx/en_us_dedes/ho.ho21:hoCA.Ode82.incipit	To Your compassion I have…
ltx/en_us_dedes/ho.ho21:hoCA.Ode82.melody	@ltx/en_us_dedes/he.h.m2:heHE.TonEnKaminoTouPyros.name
ltx/en_us_dedes/ho.ho21:hoCA.Ode82.mode	@ltx/en_us_dedes/miscellanea:misc.Mode2
ltx/en_us_dedes/ho.ho21:hoCA.Ode82.ode	@ltx/en_us_dedes/miscellanea:misc.Ode8
ltx/en_us_dedes/ho.ho21:hoCA.Ode82.text	To Your compassion I have run, and with fear I cry to You the only Good One: As You said, so abide in me and let me abide in You. For trusting in Your mercy, behold, I eat Your all-holy Body and drink Your Blood, O Savior.
ltx/en_us_dedes/ho.ho21:hoCA.Ode8T.incipit	I am afraid as I…
ltx/en_us_dedes/ho.ho21:hoCA.Ode8T.melody	@ltx/en_us_dedes/he.h.m2:heHE.TonEnKaminoTouPyros.name
ltx/en_us_dedes/ho.ho21:hoCA.Ode8T.mode	@ltx/en_us_dedes/miscellanea:misc.Mode2
ltx/en_us_dedes/ho.ho21:hoCA.Ode8T.ode	@ltx/en_us_dedes/miscellanea:misc.Ode8
ltx/en_us_dedes/ho.ho21:hoCA.Ode8T.text	I am afraid as I partake of the fire, lest I burn like wax and hay do. Awesome Mystery! Wonderful is the mercy of God! How I, who am clay, can partake of God’s Body and His Blood and can thus become immortal!
ltx/en_us_dedes/ho.ho21:hoCA.Ode91.greekmelody	@ltx/en_us_dedes/he.h.m2:heHE.AnarchouGennitoros.greekname
ltx/en_us_dedes/ho.ho21:hoCA.Ode91.incipit	Yes, Christ is the Lord…
ltx/en_us_dedes/ho.ho21:hoCA.Ode91.melody	@ltx/en_us_dedes/he.h.m2:heHE.AnarchouGennitoros.name
ltx/en_us_dedes/ho.ho21:hoCA.Ode91.mode	@ltx/en_us_dedes/miscellanea:misc.Mode2
ltx/en_us_dedes/ho.ho21:hoCA.Ode91.ode	@ltx/en_us_dedes/miscellanea:misc.Ode9
ltx/en_us_dedes/ho.ho21:hoCA.Ode91.text	Yes, Christ is the Lord; and therefore taste and see that He is good. For of old He came down and became like us for us. Only once He offered himself as a sacrifice to His God and Father, yet He is forever slain, sanctifying us communicants.
ltx/en_us_dedes/ho.ho21:hoCA.Ode92.incipit	O Lord, may my body…
ltx/en_us_dedes/ho.ho21:hoCA.Ode92.melody	@ltx/en_us_dedes/he.h.m2:heHE.AnarchouGennitoros.name
ltx/en_us_dedes/ho.ho21:hoCA.Ode92.mode	@ltx/en_us_dedes/miscellanea:misc.Mode2
ltx/en_us_dedes/ho.ho21:hoCA.Ode92.ode	@ltx/en_us_dedes/miscellanea:misc.Ode9
ltx/en_us_dedes/ho.ho21:hoCA.Ode92.text	O Lord, may my body with my soul alike be sanctified, and illumined and saved and become Your dwelling place, through participation in Your sacred and divine Mysteries, O Master. May You and the Father and the Holy Spirit also dwell in me.
ltx/en_us_dedes/ho.ho21:hoCA.Ode93.incipit	O Savior most merciful, I…
ltx/en_us_dedes/ho.ho21:hoCA.Ode93.melody	@ltx/en_us_dedes/he.h.m2:heHE.AnarchouGennitoros.name
ltx/en_us_dedes/ho.ho21:hoCA.Ode93.mode	@ltx/en_us_dedes/miscellanea:misc.Mode2
ltx/en_us_dedes/ho.ho21:hoCA.Ode93.ode	@ltx/en_us_dedes/miscellanea:misc.Ode9
ltx/en_us_dedes/ho.ho21:hoCA.Ode93.text	O Savior most merciful, I pray to You that Your divine precious Body and Blood be for me both light and fire, burning up the causes of sin and also the thorns of the sinful passions, and fully enlightening me to worship Your Divinity.
ltx/en_us_dedes/ho.ho21:hoCA.Ode9T.incipit	When God formed a body…
ltx/en_us_dedes/ho.ho21:hoCA.Ode9T.melody	@ltx/en_us_dedes/he.h.m2:heHE.AnarchouGennitoros.name
ltx/en_us_dedes/ho.ho21:hoCA.Ode9T.mode	@ltx/en_us_dedes/miscellanea:misc.Mode2
ltx/en_us_dedes/ho.ho21:hoCA.Ode9T.ode	@ltx/en_us_dedes/miscellanea:misc.Ode9
ltx/en_us_dedes/ho.ho21:hoCA.Ode9T.text	When God formed a body for himself, He did it in your womb. Therefore all generations, O Lady, sing your praise. Multitudes of Angels give glory, for now through you they can clearly see Him, the Lord of the universe, one in essence with humanity.
ltx/en_us_dedes/ho.ho21:hoCA.media.text	@ltx/en_us_dedes/properties:media.key
ltx/en_us_dedes/ho.ho21:hoCA.poet	
ltx/en_us_dedes/ho.ho21:hoCA.title	The Canon of Preparation for Holy Communion
ltx/en_us_dedes/ho.ho21:hoPrayer.Key000.title	On the next day.
ltx/en_us_dedes/ho.ho21:hoPrayer.Key001.incipit	@ltx/en_us_dedes/oc.m2.d2:ocMA.Aposticha2.incipit
ltx/en_us_dedes/ho.ho21:hoPrayer.Key001.text	@ltx/en_us_dedes/oc.m2.d2:ocMA.Aposticha2.text
ltx/en_us_dedes/ho.ho21:hoPrayer.Key001.title	The following Troparia.
ltx/en_us_dedes/ho.ho21:hoPrayer.Key002.incipit	How shall I, who am unworthy…
ltx/en_us_dedes/ho.ho21:hoPrayer.Key002.text	How shall I, who am unworthy, shamelessly commune Your holy Mysteries? If I dare to approach You with those who are worthy, my clothing will accuse me, since it is not fit for the banquet, and I shall bring condemnation upon my very sinful soul. O benevolent Lord, cleanse the filth of my soul and save me.
ltx/en_us_dedes/ho.ho21:hoPrayer.Key003.incipit	@ltx/en_us_dedes/oc.m6.d3:ocMA.Kathisma33.incipit
ltx/en_us_dedes/ho.ho21:hoPrayer.Key003.text	@ltx/en_us_dedes/oc.m6.d3:ocMA.Kathisma33.text
ltx/en_us_dedes/ho.ho21:hoPrayer.Key004.incipit	@ltx/en_us_dedes/tr.d068:trMA.Troparion.incipit
ltx/en_us_dedes/ho.ho21:hoPrayer.Key004.text	@ltx/en_us_dedes/tr.d068:trMA.Troparion.text
ltx/en_us_dedes/ho.ho21:hoPrayer.Key004.title	On Holy and Great Thursday, the following:
ltx/en_us_dedes/ho.ho21:hoPrayer.Key005.poet	
ltx/en_us_dedes/ho.ho21:hoPrayer.Key005.text	
ltx/en_us_dedes/ho.ho21:hoPrayer.Key005.title	
ltx/en_us_dedes/ho.ho21:hoPrayer.Key005.title2	
ltx/en_us_dedes/ho.ho21:hoPrayer.Key005_1.text	
ltx/en_us_dedes/ho.ho21:hoPrayer.Key005_2.text	
ltx/en_us_dedes/ho.ho21:hoPrayer.Key005_3.text	
ltx/en_us_dedes/ho.ho21:hoPrayer.Key005_4.text	
ltx/en_us_dedes/ho.ho21:hoPrayer.Key005_5.text	
ltx/en_us_dedes/ho.ho21:hoPrayer.Key006.text	
ltx/en_us_dedes/ho.ho21:hoPrayer.Key006.title	
ltx/en_us_dedes/ho.ho21:hoPrayer.Key006_1.text	
ltx/en_us_dedes/ho.ho21:hoPrayer.Key006_2.text	
ltx/en_us_dedes/ho.ho21:hoPrayer.Key006_3.text	
ltx/en_us_dedes/ho.ho21:hoPrayer.Key011.poet	
ltx/en_us_dedes/ho.ho21:hoPrayer.Key011.text	
ltx/en_us_dedes/ho.ho21:hoPrayer.Key011.title	
ltx/en_us_dedes/ho.ho21:hoPrayer.Key021.poet	
ltx/en_us_dedes/ho.ho21:hoPrayer.Key021.text	
ltx/en_us_dedes/ho.ho21:hoPrayer.Key021.title	
ltx/en_us_dedes/ho.ho21:hoPrayer.Key031.poet	
ltx/en_us_dedes/ho.ho21:hoPrayer.Key031.text	
ltx/en_us_dedes/ho.ho21:hoPrayer.Key031.title	
ltx/en_us_dedes/ho.ho21:hoPrayer.Key041.poet	
ltx/en_us_dedes/ho.ho21:hoPrayer.Key041.text	
ltx/en_us_dedes/ho.ho21:hoPrayer.Key041.title	
ltx/en_us_dedes/ho.ho21:hoPrayer.Key051.incipit	@ltx/en_us_dedes/tr.d066:trMA.Lauds1.incipit
ltx/en_us_dedes/ho.ho21:hoPrayer.Key051.poet	
ltx/en_us_dedes/ho.ho21:hoPrayer.Key051.text	@ltx/en_us_dedes/tr.d066:trMA.Lauds1.text
ltx/en_us_dedes/ho.ho21:hoPrayer.Key051.title	
ltx/en_us_dedes/ho.ho21:hoPrayer.Key061.poet	
ltx/en_us_dedes/ho.ho21:hoPrayer.Key061.text	
ltx/en_us_dedes/ho.ho21:hoPrayer.Key061.title	
ltx/en_us_dedes/ho.ho21:hoPrayer.Key071.poet	
ltx/en_us_dedes/ho.ho21:hoPrayer.Key071.text	
ltx/en_us_dedes/ho.ho21:hoPrayer.Key071.title	
ltx/en_us_dedes/ho.ho21:hoPrayer.Key071_001.text	
ltx/en_us_dedes/ho.ho21:hoPrayer.Key071_002.text	
ltx/en_us_dedes/ho.ho21:hoPrayer.Key071_003.text	
ltx/en_us_dedes/ho.ho21:hoPrayer.Key071_004.text	
ltx/en_us_dedes/ho.ho21:hoPrayer.Key071_005.text	
ltx/en_us_dedes/ho.ho21:hoPrayer.Key071_006.text	
ltx/en_us_dedes/ho.ho21:hoPrayer.Key071_007.text	
ltx/en_us_dedes/ho.ho21:hoPrayer.Key071_008.text	
ltx/en_us_dedes/ho.ho21:hoPrayer.Key071_009.text	
ltx/en_us_dedes/ho.ho21:hoPrayer.Key071_010.text	
ltx/en_us_dedes/ho.ho21:hoPrayer.Key071_011.text	
ltx/en_us_dedes/ho.ho21:hoPrayer.Key071_012.text	
ltx/en_us_dedes/ho.ho21:hoPrayer.Key071_013.text	
ltx/en_us_dedes/ho.ho21:hoPrayer.Key071_014.text	
ltx/en_us_dedes/ho.ho21:hoPrayer.Key071_015.text	
ltx/en_us_dedes/ho.ho21:hoPrayer.Key071_016.text	
ltx/en_us_dedes/ho.ho21:hoPrayer.Key071_017.text	
ltx/en_us_dedes/ho.ho21:hoPrayer.Key071_018.text	
ltx/en_us_dedes/ho.ho21:hoPrayer.Key071_019.text	
ltx/en_us_dedes/ho.ho21:hoPrayer.Key071_020.text	
ltx/en_us_dedes/ho.ho21:hoPrayer.Key071_021.text	
ltx/en_us_dedes/ho.ho21:hoPrayer.Key071_022.text	
ltx/en_us_dedes/ho.ho21:hoPrayer.Key071_023.text	
ltx/en_us_dedes/ho.ho21:hoPrayer.Key071_024.text	
ltx/en_us_dedes/ho.ho21:hoPrayer.Key071_025.text	
ltx/en_us_dedes/ho.ho21:hoPrayer.Key071_026.text	
ltx/en_us_dedes/ho.ho21:hoPrayer.Key071_027.text	
ltx/en_us_dedes/ho.ho21:hoPrayer.Key071_028.text	
ltx/en_us_dedes/ho.ho21:hoPrayer.Key071_029.text	
ltx/en_us_dedes/ho.ho21:hoPrayer.Key071_030.text	
ltx/en_us_dedes/ho.ho21:hoPrayer.Key071_031.text	
ltx/en_us_dedes/ho.ho21:hoPrayer.Key071_032.text	
ltx/en_us_dedes/ho.ho21:hoPrayer.Key071_033.text	
ltx/en_us_dedes/ho.ho21:hoPrayer.Key071_034.text	
ltx/en_us_dedes/ho.ho21:hoPrayer.Key071_035.text	
ltx/en_us_dedes/ho.ho21:hoPrayer.Key071_036.text	
ltx/en_us_dedes/ho.ho21:hoPrayer.Key071_037.text	
ltx/en_us_dedes/ho.ho21:hoPrayer.Key071_038.text	
ltx/en_us_dedes/ho.ho21:hoPrayer.Key071_039.text	
ltx/en_us_dedes/ho.ho21:hoPrayer.Key071_040.text	
ltx/en_us_dedes/ho.ho21:hoPrayer.Key071_041.text	
ltx/en_us_dedes/ho.ho21:hoPrayer.Key071_042.text	
ltx/en_us_dedes/ho.ho21:hoPrayer.Key071_043.text	
ltx/en_us_dedes/ho.ho21:hoPrayer.Key071_044.text	
ltx/en_us_dedes/ho.ho21:hoPrayer.Key071_045.text	
ltx/en_us_dedes/ho.ho21:hoPrayer.Key071_046.text	
ltx/en_us_dedes/ho.ho21:hoPrayer.Key071_047.text	
ltx/en_us_dedes/ho.ho21:hoPrayer.Key071_048.text	
ltx/en_us_dedes/ho.ho21:hoPrayer.Key071_049.text	
ltx/en_us_dedes/ho.ho21:hoPrayer.Key071_050.text	
ltx/en_us_dedes/ho.ho21:hoPrayer.Key071_051.text	
ltx/en_us_dedes/ho.ho21:hoPrayer.Key071_052.text	
ltx/en_us_dedes/ho.ho21:hoPrayer.Key071_053.text	
ltx/en_us_dedes/ho.ho21:hoPrayer.Key071_054.text	
ltx/en_us_dedes/ho.ho21:hoPrayer.Key071_055.text	
ltx/en_us_dedes/ho.ho21:hoPrayer.Key071_056.text	
ltx/en_us_dedes/ho.ho21:hoPrayer.Key071_057.text	
ltx/en_us_dedes/ho.ho21:hoPrayer.Key071_058.text	
ltx/en_us_dedes/ho.ho21:hoPrayer.Key071_059.text	
ltx/en_us_dedes/ho.ho21:hoPrayer.Key071_060.text	
ltx/en_us_dedes/ho.ho21:hoPrayer.Key071_061.text	
ltx/en_us_dedes/ho.ho21:hoPrayer.Key071_062.text	
ltx/en_us_dedes/ho.ho21:hoPrayer.Key071_063.text	
ltx/en_us_dedes/ho.ho21:hoPrayer.Key071_064.text	
ltx/en_us_dedes/ho.ho21:hoPrayer.Key071_065.text	
ltx/en_us_dedes/ho.ho21:hoPrayer.Key071_066.text	
ltx/en_us_dedes/ho.ho21:hoPrayer.Key071_067.text	
ltx/en_us_dedes/ho.ho21:hoPrayer.Key071_068.text	
ltx/en_us_dedes/ho.ho21:hoPrayer.Key071_069.text	
ltx/en_us_dedes/ho.ho21:hoPrayer.Key071_070.text	
ltx/en_us_dedes/ho.ho21:hoPrayer.Key071_071.text	
ltx/en_us_dedes/ho.ho21:hoPrayer.Key071_072.text	
ltx/en_us_dedes/ho.ho21:hoPrayer.Key071_073.text	
ltx/en_us_dedes/ho.ho21:hoPrayer.Key071_074.text	
ltx/en_us_dedes/ho.ho21:hoPrayer.Key071_075.text	
ltx/en_us_dedes/ho.ho21:hoPrayer.Key071_076.text	
ltx/en_us_dedes/ho.ho21:hoPrayer.Key071_077.text	
ltx/en_us_dedes/ho.ho21:hoPrayer.Key071_078.text	
ltx/en_us_dedes/ho.ho21:hoPrayer.Key071_079.text	
ltx/en_us_dedes/ho.ho21:hoPrayer.Key071_080.text	
ltx/en_us_dedes/ho.ho21:hoPrayer.Key071_081.text	
ltx/en_us_dedes/ho.ho21:hoPrayer.Key071_082.text	
ltx/en_us_dedes/ho.ho21:hoPrayer.Key071_083.text	
ltx/en_us_dedes/ho.ho21:hoPrayer.Key071_084.text	
ltx/en_us_dedes/ho.ho21:hoPrayer.Key071_085.text	
ltx/en_us_dedes/ho.ho21:hoPrayer.Key071_086.text	
ltx/en_us_dedes/ho.ho21:hoPrayer.Key071_087.text	
ltx/en_us_dedes/ho.ho21:hoPrayer.Key071_088.text	
ltx/en_us_dedes/ho.ho21:hoPrayer.Key071_089.text	
ltx/en_us_dedes/ho.ho21:hoPrayer.Key071_090.text	
ltx/en_us_dedes/ho.ho21:hoPrayer.Key071_091.text	
ltx/en_us_dedes/ho.ho21:hoPrayer.Key071_092.text	
ltx/en_us_dedes/ho.ho21:hoPrayer.Key071_093.text	
ltx/en_us_dedes/ho.ho21:hoPrayer.Key071_094.text	
ltx/en_us_dedes/ho.ho21:hoPrayer.Key071_095.text	
ltx/en_us_dedes/ho.ho21:hoPrayer.Key071_096.text	
ltx/en_us_dedes/ho.ho21:hoPrayer.Key071_097.text	
ltx/en_us_dedes/ho.ho21:hoPrayer.Key071_098.text	
ltx/en_us_dedes/ho.ho21:hoPrayer.Key071_099.text	
ltx/en_us_dedes/ho.ho21:hoPrayer.Key071_100.text	
ltx/en_us_dedes/ho.ho21:hoPrayer.Key071_101.text	
ltx/en_us_dedes/ho.ho21:hoPrayer.Key071_102.text	
ltx/en_us_dedes/ho.ho21:hoPrayer.Key071_103.text	
ltx/en_us_dedes/ho.ho21:hoPrayer.Key071_104.text	
ltx/en_us_dedes/ho.ho21:hoPrayer.Key071_105.text	
ltx/en_us_dedes/ho.ho21:hoPrayer.Key071_106.text	
ltx/en_us_dedes/ho.ho21:hoPrayer.Key071_107.text	
ltx/en_us_dedes/ho.ho21:hoPrayer.Key071_108.text	
ltx/en_us_dedes/ho.ho21:hoPrayer.Key071_109.text	
ltx/en_us_dedes/ho.ho21:hoPrayer.Key071_110.text	
ltx/en_us_dedes/ho.ho21:hoPrayer.Key071_111.text	
ltx/en_us_dedes/ho.ho21:hoPrayer.Key071_112.text	
ltx/en_us_dedes/ho.ho21:hoPrayer.Key071_113.text	
ltx/en_us_dedes/ho.ho21:hoPrayer.Key071_114.text	
ltx/en_us_dedes/ho.ho21:hoPrayer.Key071_115.text	
ltx/en_us_dedes/ho.ho21:hoPrayer.Key071_116.text	
ltx/en_us_dedes/ho.ho21:hoPrayer.Key071_117.text	
ltx/en_us_dedes/ho.ho21:hoPrayer.Key071_118.text	
ltx/en_us_dedes/ho.ho21:hoPrayer.Key071_119.text	
ltx/en_us_dedes/ho.ho21:hoPrayer.Key071_120.text	
ltx/en_us_dedes/ho.ho21:hoPrayer.Key071_121.text	
ltx/en_us_dedes/ho.ho21:hoPrayer.Key071_122.text	
ltx/en_us_dedes/ho.ho21:hoPrayer.Key071_123.text	
ltx/en_us_dedes/ho.ho21:hoPrayer.Key071_124.text	
ltx/en_us_dedes/ho.ho21:hoPrayer.Key071_125.text	
ltx/en_us_dedes/ho.ho21:hoPrayer.Key071_126.text	
ltx/en_us_dedes/ho.ho21:hoPrayer.Key071_127.text	
ltx/en_us_dedes/ho.ho21:hoPrayer.Key071_128.text	
ltx/en_us_dedes/ho.ho21:hoPrayer.Key071_129.text	
ltx/en_us_dedes/ho.ho21:hoPrayer.Key071_130.text	
ltx/en_us_dedes/ho.ho21:hoPrayer.Key071_131.text	
ltx/en_us_dedes/ho.ho21:hoPrayer.Key071_132.text	
ltx/en_us_dedes/ho.ho21:hoPrayer.Key071_133.text	
ltx/en_us_dedes/ho.ho21:hoPrayer.Key071_134.text	
ltx/en_us_dedes/ho.ho21:hoPrayer.Key071_135.text	
ltx/en_us_dedes/ho.ho21:hoPrayer.Key071_136.text	
ltx/en_us_dedes/ho.ho21:hoPrayer.Key081.poet	
ltx/en_us_dedes/ho.ho21:hoPrayer.Key081.text	
ltx/en_us_dedes/ho.ho21:hoPrayer.Key081.title	
ltx/en_us_dedes/ho.ho21:hoPrayer.Key091.poet	
ltx/en_us_dedes/ho.ho21:hoPrayer.Key091.text	
ltx/en_us_dedes/ho.ho21:hoPrayer.Key091.title	
ltx/en_us_dedes/ho.ho21:hoPrayer.Key100.title	
ltx/en_us_dedes/ho.ho21:hoPrayer.Key101.poet	
ltx/en_us_dedes/ho.ho21:hoPrayer.Key101.text	
ltx/en_us_dedes/ho.ho21:hoPrayer.Key101.title	
ltx/en_us_dedes/ho.ho21:hoPrayer.Key111.rubric	
ltx/en_us_dedes/ho.ho21:hoPrayer.Key111.text	
ltx/en_us_dedes/ho.ho21:hoPrayer.Key111.title	
ltx/en_us_dedes/ho.ho21:hoPrayer.Key112.text	
ltx/en_us_dedes/ho.ho21:hoPrayer.Key113.text	
ltx/en_us_dedes/ho.ho21:hoPrayer.Key114.text	
ltx/en_us_dedes/ho.ho21:hoPrayer.Key121.text	@ltx/en_us_dedes/tr.d069:trLI.CommunionHymn.text
ltx/en_us_dedes/ho.ho21:hoPrayer.Key121.title	
ltx/en_us_dedes/ho.ho21:hoPrayer.Key131.text	
ltx/en_us_dedes/ho.ho21:hoPrayer.Key131.title	
ltx/en_us_dedes/ho.ho21:hoPrayer.Key132.text	
ltx/en_us_dedes/ho.ho21:hoPrayer.Key133.text	
ltx/en_us_dedes/ho.ho21:hoPrayer.Key134.text	
ltx/en_us_dedes/ho.ho21:hoPrayer.Key141.incipit	@ltx/en_us_dedes/me.m08.d06:meMA.Ode9C23.incipit
ltx/en_us_dedes/ho.ho21:hoPrayer.Key141.text	@ltx/en_us_dedes/me.m08.d06:meMA.Ode9C23.text
ltx/en_us_dedes/ho.ho21:hoPrayer.Key141.title	
ltx/en_us_dedes/ho.ho21:hoPrayer.Key151.incipit	@ltx/en_us_dedes/tr.d066:trMA.Lauds1.incipit
ltx/en_us_dedes/ho.ho21:hoPrayer.Key151.text	@ltx/en_us_dedes/tr.d066:trMA.Lauds1.text
ltx/en_us_dedes/ho.ho21:hoPrayer.Key151.title	
ltx/en_us_dedes/ho.ho21:hoPrayer.Key161.text	
ltx/en_us_dedes/ho.ho21:hoPrayer.Key161.title	
ltx/en_us_dedes/ho.ho21:hoPrayer.Key200.title	
ltx/en_us_dedes/ho.ho21:hoPrayer.Key200.title2	
ltx/en_us_dedes/ho.ho21:hoPrayer.Key201.title	
ltx/en_us_dedes/ho.ho21:hoPrayer.Key201_1.text	
ltx/en_us_dedes/ho.ho21:hoPrayer.Key201_2.text	
ltx/en_us_dedes/ho.ho21:hoPrayer.Key201_3.text	
ltx/en_us_dedes/ho.ho21:hoPrayer.Key201_4.text	
ltx/en_us_dedes/ho.ho21:hoPrayer.Key201_5.text	
ltx/en_us_dedes/ho.ho21:hoPrayer.Key202.text	
ltx/en_us_dedes/ho.ho21:hoPrayer.Key202.title	
ltx/en_us_dedes/ho.ho21:hoPrayer.Key203.text	
ltx/en_us_dedes/ho.ho21:hoPrayer.Key203.title	
ltx/en_us_dedes/ho.ho21:hoPrayer.Key204.text	
ltx/en_us_dedes/ho.ho21:hoPrayer.Key204.title	
ltx/en_us_dedes/ho.ho21:hoPrayer.Key204_001.text	
ltx/en_us_dedes/ho.ho21:hoPrayer.Key204_002.text	
ltx/en_us_dedes/ho.ho21:hoPrayer.Key204_003.text	
ltx/en_us_dedes/ho.ho21:hoPrayer.Key204_004.text	
ltx/en_us_dedes/ho.ho21:hoPrayer.Key204_005.text	
ltx/en_us_dedes/ho.ho21:hoPrayer.Key204_006.text	
ltx/en_us_dedes/ho.ho21:hoPrayer.Key204_007.text	
ltx/en_us_dedes/ho.ho21:hoPrayer.Key204_008.text	
ltx/en_us_dedes/ho.ho21:hoPrayer.Key204_009.text	
ltx/en_us_dedes/ho.ho21:hoPrayer.Key204_010.text	
ltx/en_us_dedes/ho.ho21:hoPrayer.Key204_011.text	
ltx/en_us_dedes/ho.ho21:hoPrayer.Key204_012.text	
ltx/en_us_dedes/ho.ho21:hoPrayer.Key204_013.text	
ltx/en_us_dedes/ho.ho21:hoPrayer.Key204_014.text	
ltx/en_us_dedes/ho.ho21:hoPrayer.Key204_015.text	
ltx/en_us_dedes/ho.ho21:hoPrayer.Key204_016.text	
ltx/en_us_dedes/ho.ho21:hoPrayer.Key204_017.text	
ltx/en_us_dedes/ho.ho21:hoPrayer.Key204_018.text	
ltx/en_us_dedes/ho.ho21:hoPrayer.Key204_019.text	
ltx/en_us_dedes/ho.ho21:hoPrayer.Key204_020.text	
ltx/en_us_dedes/ho.ho21:hoPrayer.Key204_021.text	
ltx/en_us_dedes/ho.ho21:hoPrayer.Key204_022.text	
ltx/en_us_dedes/ho.ho21:hoPrayer.Key204_023.text	
ltx/en_us_dedes/ho.ho21:hoPrayer.Key204_024.text	
ltx/en_us_dedes/ho.ho21:hoPrayer.Key204_025.text	
ltx/en_us_dedes/ho.ho21:hoPrayer.Key204_026.text	
ltx/en_us_dedes/ho.ho21:hoPrayer.Key204_027.text	
ltx/en_us_dedes/ho.ho21:hoPrayer.Key204_028.text	
ltx/en_us_dedes/ho.ho21:hoPrayer.Key205.text	
ltx/en_us_dedes/ho.ho21:hoPrayer.Key205.title	
ltx/en_us_dedes/ho.ho21:hoPrayer.Key206.text	
ltx/en_us_dedes/ho.ho21:hoPrayer.Key206.title	
ltx/en_us_dedes/ho.ho21:hoPrayer.Key206.title2	
ltx/en_us_dedes/ho.ho21:hoPrayer.Key300.title	After the Liturgy of St. John Chrysostom:
ltx/en_us_dedes/ho.ho21:hoPrayer.Key400.title	After the Liturgy of St. Basil:
ltx/en_us_dedes/ho.ho21:hoPrayer.Key500.title	After the Presanctified Liturgy:
ltx/en_us_dedes/ho.ho21:hoPrayer.note1	The selection and text of the following prayers may be different from what is used in your parish.
ltx/en_us_dedes/ho.ho21:hoPrayer.title	PRAYERS BEFORE HOLY COMMUNION
