ltx/en_us_dedes/other.pandemicparaklesis:hoCA.Apolytikion1.incipit	As the physician of the…
ltx/en_us_dedes/other.pandemicparaklesis:hoCA.Apolytikion1.melody	@ltx/en_us_dedes/he.a.m4:heAU.OYpsotheisEnToStavro.name
ltx/en_us_dedes/other.pandemicparaklesis:hoCA.Apolytikion1.mode	@ltx/en_us_dedes/miscellanea:misc.Mode4
ltx/en_us_dedes/other.pandemicparaklesis:hoCA.Apolytikion1.text	As the physician of the sick and the suffering, * and as the helper of the faithful who hope in You, * O gracious Lord, who wills that all humanity be saved, * from Your throne of majesty, look upon us with mercy; * hear our voice out of the depths, as we cry to You saying: * We all entreat You, free us from the threat * of this pandemic, O God most compassionate.
ltx/en_us_dedes/other.pandemicparaklesis:hoCA.Apolytikion2.incipit	@ltx/en_us_dedes/ho.ho23:hoCA.Apolytikion2.incipit
ltx/en_us_dedes/other.pandemicparaklesis:hoCA.Apolytikion2.melody	@ltx/en_us_dedes/he.a.m4:heAU.OYpsotheisEnToStavro.name
ltx/en_us_dedes/other.pandemicparaklesis:hoCA.Apolytikion2.mode	@ltx/en_us_dedes/miscellanea:misc.Mode4
ltx/en_us_dedes/other.pandemicparaklesis:hoCA.Apolytikion2.text	@ltx/en_us_dedes/ho.ho23:hoCA.Apolytikion2.text
ltx/en_us_dedes/other.pandemicparaklesis:hoCA.Insert1	
ltx/en_us_dedes/other.pandemicparaklesis:hoCA.Kathisma11.incipit	Our one God and Lord…
ltx/en_us_dedes/other.pandemicparaklesis:hoCA.Kathisma11.melody	@ltx/en_us_dedes/he.a.m2:heAU.TaAnoZiton.name
ltx/en_us_dedes/other.pandemicparaklesis:hoCA.Kathisma11.mode	@ltx/en_us_dedes/miscellanea:misc.Mode2
ltx/en_us_dedes/other.pandemicparaklesis:hoCA.Kathisma11.text	Our one God and Lord, O all-holy Trinity, * this deadly pandemic has spread throughout the world. * We Your people pray to You: * Rescue us, and make everyone well again. * For Your mercy abounds throughout the earth, * and we worship only You, O almighty God.
ltx/en_us_dedes/other.pandemicparaklesis:hoCA.Kontakion.incipit	Almighty Lord, we entreat You…
ltx/en_us_dedes/other.pandemicparaklesis:hoCA.Kontakion.melody	@ltx/en_us_dedes/he.a.m2:heAU.ToisTonAimatonSou.name
ltx/en_us_dedes/other.pandemicparaklesis:hoCA.Kontakion.mode	@ltx/en_us_dedes/miscellanea:misc.Mode2
ltx/en_us_dedes/other.pandemicparaklesis:hoCA.Kontakion.text	Almighty Lord, we entreat You to demonstrate * that truly great and immense is Your benevolence . * Be merciful, save us and pity us, * Your faithful people who sing prayerful hymns to You, * and free us from plague and calamity.
ltx/en_us_dedes/other.pandemicparaklesis:hoCA.Meg00.incipit	@ltx/en_us_dedes/ho.ho03:hoMA.Ode9.Meg00.incipit
ltx/en_us_dedes/other.pandemicparaklesis:hoCA.Meg00.text	@ltx/en_us_dedes/ho.ho03:hoMA.Ode9.Meg00.text
ltx/en_us_dedes/other.pandemicparaklesis:hoCA.Meg01.incipit	@ltx/en_us_dedes/he.h.m6:heHE.TinTimioteran.incipit
ltx/en_us_dedes/other.pandemicparaklesis:hoCA.Meg01.melody	@ltx/en_us_dedes/he.h.m6:heHE.TinTimioteran.melody
ltx/en_us_dedes/other.pandemicparaklesis:hoCA.Meg01.text	@ltx/en_us_dedes/he.h.m6:heHE.TinTimioteran.text
ltx/en_us_dedes/other.pandemicparaklesis:hoCA.Meg02.incipit	Physician of bodies and souls…
ltx/en_us_dedes/other.pandemicparaklesis:hoCA.Meg02.melody	@ltx/en_us_dedes/he.h.m6:heHE.TinTimioteran.name
ltx/en_us_dedes/other.pandemicparaklesis:hoCA.Meg02.text	Physician of bodies and souls alike, * compassionate Master, we implore You and we entreat, * forgive and remit every sin of ours, O Savior, * and rescue us Your servants from the pandemic’s wrath.
ltx/en_us_dedes/other.pandemicparaklesis:hoCA.Meg03.incipit	Fear of the pandemic has…
ltx/en_us_dedes/other.pandemicparaklesis:hoCA.Meg03.melody	@ltx/en_us_dedes/he.h.m6:heHE.TinTimioteran.name
ltx/en_us_dedes/other.pandemicparaklesis:hoCA.Meg03.text	Fear of the pandemic has gripped the hearts * of all of Your servants, O compassionate Lord and God. * Quickly come and save us, we earnestly entreat You, * invoking Your great mercy, Savior most merciful.
ltx/en_us_dedes/other.pandemicparaklesis:hoCA.Meg04.incipit	Savior, we will all never…
ltx/en_us_dedes/other.pandemicparaklesis:hoCA.Meg04.melody	@ltx/en_us_dedes/he.h.m6:heHE.TinTimioteran.name
ltx/en_us_dedes/other.pandemicparaklesis:hoCA.Meg04.text	Savior, we will all never cease to be * the sheep of Your pasture, even though we have many sins. * Please do not despise or ignore our supplication; * end, rather, the upheaval caused by the current plague.
ltx/en_us_dedes/other.pandemicparaklesis:hoCA.Meg05.incipit	Truly from the ages, O…
ltx/en_us_dedes/other.pandemicparaklesis:hoCA.Meg05.melody	@ltx/en_us_dedes/he.h.m6:heHE.TinTimioteran.name
ltx/en_us_dedes/other.pandemicparaklesis:hoCA.Meg05.text	Truly from the ages, O gracious God, * and unto the ages are Your mercy and tender love. * Therefore, now, according to its abundance, rescue * a multitude of people from the impending plague.
ltx/en_us_dedes/other.pandemicparaklesis:hoCA.Meg06.incipit	Lord, do not ignore us…
ltx/en_us_dedes/other.pandemicparaklesis:hoCA.Meg06.melody	@ltx/en_us_dedes/he.h.m6:heHE.TinTimioteran.name
ltx/en_us_dedes/other.pandemicparaklesis:hoCA.Meg06.text	Lord, do not ignore us in our distress, * anxious as we are now, and beside ourselves with the fear * of catching a painful disease that may be fatal. * We pray You quickly save us from this calamity.
ltx/en_us_dedes/other.pandemicparaklesis:hoCA.Meg0F.incipit	@ltx/en_us_dedes/ho.ho23:hoCA.Meg0F.incipit
ltx/en_us_dedes/other.pandemicparaklesis:hoCA.Meg0F.melody	@ltx/en_us_dedes/he.h.m6:heHE.TinTimioteran.name
ltx/en_us_dedes/other.pandemicparaklesis:hoCA.Meg0F.text	@ltx/en_us_dedes/ho.ho23:hoCA.Meg0F.text
ltx/en_us_dedes/other.pandemicparaklesis:hoCA.Ode11.incipit	O all-holy Trinity, our one…
ltx/en_us_dedes/other.pandemicparaklesis:hoCA.Ode11.melody	@ltx/en_us_dedes/he.h.m8:heHE.YgranDiodefsas.name
ltx/en_us_dedes/other.pandemicparaklesis:hoCA.Ode11.mode	@ltx/en_us_dedes/miscellanea:misc.Mode8
ltx/en_us_dedes/other.pandemicparaklesis:hoCA.Ode11.ode	@ltx/en_us_dedes/miscellanea:misc.Ode1
ltx/en_us_dedes/other.pandemicparaklesis:hoCA.Ode11.text	O all-holy Trinity, our one God, * show Your great compassion towards us who have been debased. * Drive away the awful scourge that found us, * and end the deadly pandemic afflicting us.
ltx/en_us_dedes/other.pandemicparaklesis:hoCA.Ode12.incipit	Compassionate Master, the current plague…
ltx/en_us_dedes/other.pandemicparaklesis:hoCA.Ode12.melody	@ltx/en_us_dedes/he.h.m8:heHE.YgranDiodefsas.name
ltx/en_us_dedes/other.pandemicparaklesis:hoCA.Ode12.mode	@ltx/en_us_dedes/miscellanea:misc.Mode8
ltx/en_us_dedes/other.pandemicparaklesis:hoCA.Ode12.ode	@ltx/en_us_dedes/miscellanea:misc.Ode1
ltx/en_us_dedes/other.pandemicparaklesis:hoCA.Ode12.text	Compassionate Master, the current plague * suddenly assailed us; it afflicts us in heart and soul. * Come quickly, deliver us and save us. * We are Your people, whose hope rests in You alone.
ltx/en_us_dedes/other.pandemicparaklesis:hoCA.Ode13.incipit	Hear the prayers of God-bearing…
ltx/en_us_dedes/other.pandemicparaklesis:hoCA.Ode13.melody	@ltx/en_us_dedes/he.h.m8:heHE.YgranDiodefsas.name
ltx/en_us_dedes/other.pandemicparaklesis:hoCA.Ode13.mode	@ltx/en_us_dedes/miscellanea:misc.Mode8
ltx/en_us_dedes/other.pandemicparaklesis:hoCA.Ode13.ode	@ltx/en_us_dedes/miscellanea:misc.Ode1
ltx/en_us_dedes/other.pandemicparaklesis:hoCA.Ode13.text	Hear the prayers of God-bearing Hierarchs * Apostles and Prophets, holy Martyrs and the Devout, * and save us Your people from the dangers * of the pandemic, O merciful Lord of all.
ltx/en_us_dedes/other.pandemicparaklesis:hoCA.Ode1T.incipit	Sweet refuge are you for…
ltx/en_us_dedes/other.pandemicparaklesis:hoCA.Ode1T.melody	@ltx/en_us_dedes/he.h.m8:heHE.YgranDiodefsas.name
ltx/en_us_dedes/other.pandemicparaklesis:hoCA.Ode1T.mode	@ltx/en_us_dedes/miscellanea:misc.Mode8
ltx/en_us_dedes/other.pandemicparaklesis:hoCA.Ode1T.ode	@ltx/en_us_dedes/miscellanea:misc.Ode1
ltx/en_us_dedes/other.pandemicparaklesis:hoCA.Ode1T.text	Sweet refuge are you for us in despair, * Lady Theotokos. Blessed Virgin, we pray to you: * Comfort us as we are now enduring * the current plague and pandemic afflicting us.
ltx/en_us_dedes/other.pandemicparaklesis:hoCA.Ode31.incipit	We Your servants are weeping…
ltx/en_us_dedes/other.pandemicparaklesis:hoCA.Ode31.melody	@ltx/en_us_dedes/he.h.m8:heHE.OuraniasApsidos.name
ltx/en_us_dedes/other.pandemicparaklesis:hoCA.Ode31.mode	@ltx/en_us_dedes/miscellanea:misc.Mode8
ltx/en_us_dedes/other.pandemicparaklesis:hoCA.Ode31.ode	@ltx/en_us_dedes/miscellanea:misc.Ode3
ltx/en_us_dedes/other.pandemicparaklesis:hoCA.Ode31.text	We Your servants are weeping within our hearts. Hear our sighs, * in Your tender love and great mercy, Lord, most compassionate. * Obliterate the threat of the pandemic and virus * quickly from the cities of Your children everywhere.
ltx/en_us_dedes/other.pandemicparaklesis:hoCA.Ode32.incipit	Holy Trinity, one God, O…
ltx/en_us_dedes/other.pandemicparaklesis:hoCA.Ode32.melody	@ltx/en_us_dedes/he.h.m8:heHE.OuraniasApsidos.name
ltx/en_us_dedes/other.pandemicparaklesis:hoCA.Ode32.mode	@ltx/en_us_dedes/miscellanea:misc.Mode8
ltx/en_us_dedes/other.pandemicparaklesis:hoCA.Ode32.ode	@ltx/en_us_dedes/miscellanea:misc.Ode3
ltx/en_us_dedes/other.pandemicparaklesis:hoCA.Ode32.text	Holy Trinity, one God, O most benevolent Lord, * faithfully we fall to our knees and implore You earnestly. * Come to us, whom you made, in Your compassion have mercy. * Free us from the injury and hardship of the plague.
ltx/en_us_dedes/other.pandemicparaklesis:hoCA.Ode33.incipit	You behold now Your servants’…
ltx/en_us_dedes/other.pandemicparaklesis:hoCA.Ode33.melody	@ltx/en_us_dedes/he.h.m8:heHE.OuraniasApsidos.name
ltx/en_us_dedes/other.pandemicparaklesis:hoCA.Ode33.mode	@ltx/en_us_dedes/miscellanea:misc.Mode8
ltx/en_us_dedes/other.pandemicparaklesis:hoCA.Ode33.ode	@ltx/en_us_dedes/miscellanea:misc.Ode3
ltx/en_us_dedes/other.pandemicparaklesis:hoCA.Ode33.text	You behold now Your servants’ humiliation, O Lord. * Hear us as we pray, and forgive us our many trespasses. * O Master, in Your great and most abundant compassion, * rescue all humanity from this calamity.
ltx/en_us_dedes/other.pandemicparaklesis:hoCA.Ode3T.incipit	Ever keep us the faithful…
ltx/en_us_dedes/other.pandemicparaklesis:hoCA.Ode3T.melody	@ltx/en_us_dedes/he.h.m8:heHE.OuraniasApsidos.name
ltx/en_us_dedes/other.pandemicparaklesis:hoCA.Ode3T.mode	@ltx/en_us_dedes/miscellanea:misc.Mode8
ltx/en_us_dedes/other.pandemicparaklesis:hoCA.Ode3T.ode	@ltx/en_us_dedes/miscellanea:misc.Ode3
ltx/en_us_dedes/other.pandemicparaklesis:hoCA.Ode3T.text	Ever keep us the faithful, who pray to you earnestly, * safe from all disease and the virus that plagues us even now. * You are the most extolled Virgin who bore God our Savior, * who has borne the weaknesses and ills of all mankind.
ltx/en_us_dedes/other.pandemicparaklesis:hoCA.Ode41.incipit	O compassionate Lord and God…
ltx/en_us_dedes/other.pandemicparaklesis:hoCA.Ode41.melody	@ltx/en_us_dedes/he.h.m8:heHE.EisakikoaKyrie.name
ltx/en_us_dedes/other.pandemicparaklesis:hoCA.Ode41.mode	@ltx/en_us_dedes/miscellanea:misc.Mode8
ltx/en_us_dedes/other.pandemicparaklesis:hoCA.Ode41.ode	@ltx/en_us_dedes/miscellanea:misc.Ode4
ltx/en_us_dedes/other.pandemicparaklesis:hoCA.Ode41.text	O compassionate Lord and God, * as an inexhaustible sea of tender love, * please do not allow humanity * to languish and perish from contagious disease.
ltx/en_us_dedes/other.pandemicparaklesis:hoCA.Ode42.incipit	Now we tearfully pray to…
ltx/en_us_dedes/other.pandemicparaklesis:hoCA.Ode42.melody	@ltx/en_us_dedes/he.h.m8:heHE.EisakikoaKyrie.name
ltx/en_us_dedes/other.pandemicparaklesis:hoCA.Ode42.mode	@ltx/en_us_dedes/miscellanea:misc.Mode8
ltx/en_us_dedes/other.pandemicparaklesis:hoCA.Ode42.ode	@ltx/en_us_dedes/miscellanea:misc.Ode4
ltx/en_us_dedes/other.pandemicparaklesis:hoCA.Ode42.text	Now we tearfully pray to You: * Savior, have compassion on our society, * and eventually change the grief * of this deadly outbreak of disease to joy.
ltx/en_us_dedes/other.pandemicparaklesis:hoCA.Ode43.incipit	In Your gracious benevolence…
ltx/en_us_dedes/other.pandemicparaklesis:hoCA.Ode43.melody	@ltx/en_us_dedes/he.h.m8:heHE.EisakikoaKyrie.name
ltx/en_us_dedes/other.pandemicparaklesis:hoCA.Ode43.mode	@ltx/en_us_dedes/miscellanea:misc.Mode8
ltx/en_us_dedes/other.pandemicparaklesis:hoCA.Ode43.ode	@ltx/en_us_dedes/miscellanea:misc.Ode4
ltx/en_us_dedes/other.pandemicparaklesis:hoCA.Ode43.text	In Your gracious benevolence, * take pity on us, Lord, and hear us when we pray. * Being merciful, deliver us * from the great distress that has befallen us.
ltx/en_us_dedes/other.pandemicparaklesis:hoCA.Ode4T.incipit	Reinvigorate everyone * during this…
ltx/en_us_dedes/other.pandemicparaklesis:hoCA.Ode4T.melody	@ltx/en_us_dedes/he.h.m8:heHE.EisakikoaKyrie.name
ltx/en_us_dedes/other.pandemicparaklesis:hoCA.Ode4T.mode	@ltx/en_us_dedes/miscellanea:misc.Mode8
ltx/en_us_dedes/other.pandemicparaklesis:hoCA.Ode4T.ode	@ltx/en_us_dedes/miscellanea:misc.Ode4
ltx/en_us_dedes/other.pandemicparaklesis:hoCA.Ode4T.text	Reinvigorate everyone * during this pandemic, and make us strong again, * O pure Maiden, as we turn to you * for protection, ever-virgin Mother of God.
ltx/en_us_dedes/other.pandemicparaklesis:hoCA.Ode51.incipit	Earnestly we pray, * O…
ltx/en_us_dedes/other.pandemicparaklesis:hoCA.Ode51.melody	@ltx/en_us_dedes/he.h.m8:heHE.FotisonImas.name
ltx/en_us_dedes/other.pandemicparaklesis:hoCA.Ode51.mode	@ltx/en_us_dedes/miscellanea:misc.Mode8
ltx/en_us_dedes/other.pandemicparaklesis:hoCA.Ode51.ode	@ltx/en_us_dedes/miscellanea:misc.Ode5
ltx/en_us_dedes/other.pandemicparaklesis:hoCA.Ode51.text	Earnestly we pray, * O our Savior very merciful: * Straight away avert the spread of the disease, * for we know no other God and Lord except for You.
ltx/en_us_dedes/other.pandemicparaklesis:hoCA.Ode52.incipit	Shelter us, we pray, *…
ltx/en_us_dedes/other.pandemicparaklesis:hoCA.Ode52.melody	@ltx/en_us_dedes/he.h.m8:heHE.FotisonImas.name
ltx/en_us_dedes/other.pandemicparaklesis:hoCA.Ode52.mode	@ltx/en_us_dedes/miscellanea:misc.Mode8
ltx/en_us_dedes/other.pandemicparaklesis:hoCA.Ode52.ode	@ltx/en_us_dedes/miscellanea:misc.Ode5
ltx/en_us_dedes/other.pandemicparaklesis:hoCA.Ode52.text	Shelter us, we pray, * in the shelter of Your wings, O Lord, * and preserve our life in happiness and health, * in the wealth of Your compassion, O almighty God.
ltx/en_us_dedes/other.pandemicparaklesis:hoCA.Ode53.incipit	Righteous are You, Lord, *…
ltx/en_us_dedes/other.pandemicparaklesis:hoCA.Ode53.melody	@ltx/en_us_dedes/he.h.m8:heHE.FotisonImas.name
ltx/en_us_dedes/other.pandemicparaklesis:hoCA.Ode53.mode	@ltx/en_us_dedes/miscellanea:misc.Mode8
ltx/en_us_dedes/other.pandemicparaklesis:hoCA.Ode53.ode	@ltx/en_us_dedes/miscellanea:misc.Ode5
ltx/en_us_dedes/other.pandemicparaklesis:hoCA.Ode53.text	Righteous are You, Lord, * and Your judgment is upright as well. * Yet, we pray You quickly rescue all mankind, * O benevolent Redeemer, from the deadly plague.
ltx/en_us_dedes/other.pandemicparaklesis:hoCA.Ode5T.incipit	All-immaculate, * virgin Maiden, kindly…
ltx/en_us_dedes/other.pandemicparaklesis:hoCA.Ode5T.melody	@ltx/en_us_dedes/he.h.m8:heHE.FotisonImas.name
ltx/en_us_dedes/other.pandemicparaklesis:hoCA.Ode5T.mode	@ltx/en_us_dedes/miscellanea:misc.Mode8
ltx/en_us_dedes/other.pandemicparaklesis:hoCA.Ode5T.ode	@ltx/en_us_dedes/miscellanea:misc.Ode5
ltx/en_us_dedes/other.pandemicparaklesis:hoCA.Ode5T.text	All-immaculate, * virgin Maiden, kindly look on us, * and preserve our life, and grant that we escape * the impending threat of deadly virus and disease.
ltx/en_us_dedes/other.pandemicparaklesis:hoCA.Ode61.incipit	Ineffable is Your great…
ltx/en_us_dedes/other.pandemicparaklesis:hoCA.Ode61.melody	@ltx/en_us_dedes/he.h.m8:heHE.TinDeisinEkcheo.name
ltx/en_us_dedes/other.pandemicparaklesis:hoCA.Ode61.mode	@ltx/en_us_dedes/miscellanea:misc.Mode8
ltx/en_us_dedes/other.pandemicparaklesis:hoCA.Ode61.ode	@ltx/en_us_dedes/miscellanea:misc.Ode6
ltx/en_us_dedes/other.pandemicparaklesis:hoCA.Ode61.text	Ineffable is Your great benevolence, * whereby You took our infirmities, O Savior. * We now entreat You, O good One, to free us * from the pandemic and thoughts of complete despair * that we inevitably have; * and we pray You forgive our offenses all.
ltx/en_us_dedes/other.pandemicparaklesis:hoCA.Ode62.incipit	The marvelous signs and wonders…
ltx/en_us_dedes/other.pandemicparaklesis:hoCA.Ode62.melody	@ltx/en_us_dedes/he.h.m8:heHE.TinDeisinEkcheo.name
ltx/en_us_dedes/other.pandemicparaklesis:hoCA.Ode62.mode	@ltx/en_us_dedes/miscellanea:misc.Mode8
ltx/en_us_dedes/other.pandemicparaklesis:hoCA.Ode62.ode	@ltx/en_us_dedes/miscellanea:misc.Ode6
ltx/en_us_dedes/other.pandemicparaklesis:hoCA.Ode62.text	The marvelous signs and wonders that You do * are innumerable, merciful Master. * We pray You stop the onset of pandemic * as You rebuked winds and sea and You calmed the storm; * and navigate us back to health, * like a ship to a calm port and anchorage.
ltx/en_us_dedes/other.pandemicparaklesis:hoCA.Ode63.incipit	Confronted with the likelihood of…
ltx/en_us_dedes/other.pandemicparaklesis:hoCA.Ode63.melody	@ltx/en_us_dedes/he.h.m8:heHE.TinDeisinEkcheo.name
ltx/en_us_dedes/other.pandemicparaklesis:hoCA.Ode63.mode	@ltx/en_us_dedes/miscellanea:misc.Mode8
ltx/en_us_dedes/other.pandemicparaklesis:hoCA.Ode63.ode	@ltx/en_us_dedes/miscellanea:misc.Ode6
ltx/en_us_dedes/other.pandemicparaklesis:hoCA.Ode63.text	Confronted with the likelihood of widespread death * from the current epidemic, O Savior, * we turn to You, and with tears we implore You * with hands uplifted, and cry out, O loving Lord, * as Your disciples did of old, * “Master, help us, for now we are perishing!”
ltx/en_us_dedes/other.pandemicparaklesis:hoCA.Ode6T.incipit	Protect us, who accurately glorify…
ltx/en_us_dedes/other.pandemicparaklesis:hoCA.Ode6T.melody	@ltx/en_us_dedes/he.h.m8:heHE.TinDeisinEkcheo.name
ltx/en_us_dedes/other.pandemicparaklesis:hoCA.Ode6T.mode	@ltx/en_us_dedes/miscellanea:misc.Mode8
ltx/en_us_dedes/other.pandemicparaklesis:hoCA.Ode6T.ode	@ltx/en_us_dedes/miscellanea:misc.Ode6
ltx/en_us_dedes/other.pandemicparaklesis:hoCA.Ode6T.text	Protect us, who accurately glorify * Christ as God, whom you ineffably mothered. * Being maternal in love and affection, * O Theotokos, convince Him to pity us * and to deliver from the plague * all your people, for whom He became a man.
ltx/en_us_dedes/other.pandemicparaklesis:hoCA.Ode71.incipit	We entrust to You only…
ltx/en_us_dedes/other.pandemicparaklesis:hoCA.Ode71.melody	@ltx/en_us_dedes/he.h.m8:heHE.OiEkTisIoudaias.name
ltx/en_us_dedes/other.pandemicparaklesis:hoCA.Ode71.mode	@ltx/en_us_dedes/miscellanea:misc.Mode8
ltx/en_us_dedes/other.pandemicparaklesis:hoCA.Ode71.ode	@ltx/en_us_dedes/miscellanea:misc.Ode7
ltx/en_us_dedes/other.pandemicparaklesis:hoCA.Ode71.text	We entrust to You only * every hope of salvation, O Lord who gives us life. * We pray that You will save us * from this deadly pandemic, * in Your mercy, as we cry out * and say: “O blessed are You * the God of our fathers.”
ltx/en_us_dedes/other.pandemicparaklesis:hoCA.Ode72.incipit	O benevolent Master…
ltx/en_us_dedes/other.pandemicparaklesis:hoCA.Ode72.melody	@ltx/en_us_dedes/he.h.m8:heHE.OiEkTisIoudaias.name
ltx/en_us_dedes/other.pandemicparaklesis:hoCA.Ode72.mode	@ltx/en_us_dedes/miscellanea:misc.Mode8
ltx/en_us_dedes/other.pandemicparaklesis:hoCA.Ode72.ode	@ltx/en_us_dedes/miscellanea:misc.Ode7
ltx/en_us_dedes/other.pandemicparaklesis:hoCA.Ode72.text	O benevolent Master, * You have worked many wonders to save humanity. * We pray You now deliver * Your people from this current * epidemic, as we cry out * and sing: “O blessed are You * the God of our fathers.”
ltx/en_us_dedes/other.pandemicparaklesis:hoCA.Ode73.incipit	Under threat of a deadly…
ltx/en_us_dedes/other.pandemicparaklesis:hoCA.Ode73.melody	@ltx/en_us_dedes/he.h.m8:heHE.OiEkTisIoudaias.name
ltx/en_us_dedes/other.pandemicparaklesis:hoCA.Ode73.mode	@ltx/en_us_dedes/miscellanea:misc.Mode8
ltx/en_us_dedes/other.pandemicparaklesis:hoCA.Ode73.ode	@ltx/en_us_dedes/miscellanea:misc.Ode7
ltx/en_us_dedes/other.pandemicparaklesis:hoCA.Ode73.text	Under threat of a deadly * epidemic, we find ourselves in profound distress. * We pray to You: Have mercy, * O Life-Giver, and save us! * We Your people cry out to You * and say: “O blessed are You * the God of our fathers.”
ltx/en_us_dedes/other.pandemicparaklesis:hoCA.Ode7T.incipit	Having borne the Redeemer *…
ltx/en_us_dedes/other.pandemicparaklesis:hoCA.Ode7T.melody	@ltx/en_us_dedes/he.h.m8:heHE.OiEkTisIoudaias.name
ltx/en_us_dedes/other.pandemicparaklesis:hoCA.Ode7T.mode	@ltx/en_us_dedes/miscellanea:misc.Mode8
ltx/en_us_dedes/other.pandemicparaklesis:hoCA.Ode7T.ode	@ltx/en_us_dedes/miscellanea:misc.Ode7
ltx/en_us_dedes/other.pandemicparaklesis:hoCA.Ode7T.text	Having borne the Redeemer * of humanity, Virgin most pure, ineffably, * entreat Him to inhibit * the spread of the pandemic * that has plagued the entire world; * and with your motherly grace, * give us your calming comfort.
ltx/en_us_dedes/other.pandemicparaklesis:hoCA.Ode81.incipit	Merciful Savior, * we hope…
ltx/en_us_dedes/other.pandemicparaklesis:hoCA.Ode81.melody	@ltx/en_us_dedes/he.h.m8:heHE.TonVasileaTonOuranon.name
ltx/en_us_dedes/other.pandemicparaklesis:hoCA.Ode81.mode	@ltx/en_us_dedes/miscellanea:misc.Mode8
ltx/en_us_dedes/other.pandemicparaklesis:hoCA.Ode81.ode	@ltx/en_us_dedes/miscellanea:misc.Ode8
ltx/en_us_dedes/other.pandemicparaklesis:hoCA.Ode81.text	Merciful Savior, * we hope and trust in You only, * and we pray to You and earnestly implore You: * Save us from the harm of the deadly epidemic.
ltx/en_us_dedes/other.pandemicparaklesis:hoCA.Ode82.incipit	Arise, O Master, * and…
ltx/en_us_dedes/other.pandemicparaklesis:hoCA.Ode82.melody	@ltx/en_us_dedes/he.h.m8:heHE.TonVasileaTonOuranon.name
ltx/en_us_dedes/other.pandemicparaklesis:hoCA.Ode82.mode	@ltx/en_us_dedes/miscellanea:misc.Mode8
ltx/en_us_dedes/other.pandemicparaklesis:hoCA.Ode82.ode	@ltx/en_us_dedes/miscellanea:misc.Ode8
ltx/en_us_dedes/other.pandemicparaklesis:hoCA.Ode82.text	Arise, O Master, * and save mankind from this crisis * that befell us. You, O Savior, are the only * hope of those who suffer from illness and misfortune.
ltx/en_us_dedes/other.pandemicparaklesis:hoCA.Ode83.incipit	Grant us forgiveness * of…
ltx/en_us_dedes/other.pandemicparaklesis:hoCA.Ode83.melody	@ltx/en_us_dedes/he.h.m8:heHE.TonVasileaTonOuranon.name
ltx/en_us_dedes/other.pandemicparaklesis:hoCA.Ode83.mode	@ltx/en_us_dedes/miscellanea:misc.Mode8
ltx/en_us_dedes/other.pandemicparaklesis:hoCA.Ode83.ode	@ltx/en_us_dedes/miscellanea:misc.Ode8
ltx/en_us_dedes/other.pandemicparaklesis:hoCA.Ode83.text	Grant us forgiveness * of sins, O Lord and Life-giver, * and take pity on us now humiliated. * Grant to us, your people, Your grace as health insurance.
ltx/en_us_dedes/other.pandemicparaklesis:hoCA.Ode8T.incipit	In this pandemic, * which…
ltx/en_us_dedes/other.pandemicparaklesis:hoCA.Ode8T.melody	@ltx/en_us_dedes/he.h.m8:heHE.TonVasileaTonOuranon.name
ltx/en_us_dedes/other.pandemicparaklesis:hoCA.Ode8T.mode	@ltx/en_us_dedes/miscellanea:misc.Mode8
ltx/en_us_dedes/other.pandemicparaklesis:hoCA.Ode8T.ode	@ltx/en_us_dedes/miscellanea:misc.Ode8
ltx/en_us_dedes/other.pandemicparaklesis:hoCA.Ode8T.text	In this pandemic, * which like a storm has disturbed us, * may the grace of your divine intercession * be for us haven of calm, O Theotokos.
ltx/en_us_dedes/other.pandemicparaklesis:hoCA.Ode91.incipit	O Savior, hear our voices…
ltx/en_us_dedes/other.pandemicparaklesis:hoCA.Ode91.melody	@ltx/en_us_dedes/he.h.m8:heHE.KyriosTheotokon.name
ltx/en_us_dedes/other.pandemicparaklesis:hoCA.Ode91.mode	@ltx/en_us_dedes/miscellanea:misc.Mode8
ltx/en_us_dedes/other.pandemicparaklesis:hoCA.Ode91.ode	@ltx/en_us_dedes/miscellanea:misc.Ode9
ltx/en_us_dedes/other.pandemicparaklesis:hoCA.Ode91.text	O Savior, hear our voices * when we call upon You; * for we Your servants are troubled and cry to You. * Deliver us from the danger of a contagious disease.
ltx/en_us_dedes/other.pandemicparaklesis:hoCA.Ode92.incipit	O Lord, display the ocean…
ltx/en_us_dedes/other.pandemicparaklesis:hoCA.Ode92.melody	@ltx/en_us_dedes/he.h.m8:heHE.KyriosTheotokon.name
ltx/en_us_dedes/other.pandemicparaklesis:hoCA.Ode92.mode	@ltx/en_us_dedes/miscellanea:misc.Mode8
ltx/en_us_dedes/other.pandemicparaklesis:hoCA.Ode92.ode	@ltx/en_us_dedes/miscellanea:misc.Ode9
ltx/en_us_dedes/other.pandemicparaklesis:hoCA.Ode92.text	O Lord, display the ocean * of Your loving kindness, * and let Your mercies, O Savior, be magnified; * and from the plague and contagious diseases rescue us.
ltx/en_us_dedes/other.pandemicparaklesis:hoCA.Ode93.incipit	Haralambos the Martyr * is…
ltx/en_us_dedes/other.pandemicparaklesis:hoCA.Ode93.melody	@ltx/en_us_dedes/he.h.m8:heHE.KyriosTheotokon.name
ltx/en_us_dedes/other.pandemicparaklesis:hoCA.Ode93.mode	@ltx/en_us_dedes/miscellanea:misc.Mode8
ltx/en_us_dedes/other.pandemicparaklesis:hoCA.Ode93.ode	@ltx/en_us_dedes/miscellanea:misc.Ode9
ltx/en_us_dedes/other.pandemicparaklesis:hoCA.Ode93.text	Haralambos the Martyr * is known for combating * the plague. O Lord, by his prayers rescue us from it, * and we shall sing, glorifying your mighty power, O God.
ltx/en_us_dedes/other.pandemicparaklesis:hoCA.Ode9T.incipit	My Lady, Virgin Mary, *…
ltx/en_us_dedes/other.pandemicparaklesis:hoCA.Ode9T.melody	@ltx/en_us_dedes/he.h.m8:heHE.KyriosTheotokon.name
ltx/en_us_dedes/other.pandemicparaklesis:hoCA.Ode9T.mode	@ltx/en_us_dedes/miscellanea:misc.Mode8
ltx/en_us_dedes/other.pandemicparaklesis:hoCA.Ode9T.ode	@ltx/en_us_dedes/miscellanea:misc.Ode9
ltx/en_us_dedes/other.pandemicparaklesis:hoCA.Ode9T.text	My Lady, Virgin Mary, * full of grace and most pure, * you are the ready assistance for all mankind. * We pray you grant perfect health to those who are suffering.
ltx/en_us_dedes/other.pandemicparaklesis:hoCA.Petition1	Again we pray for mercy, life, peace, health, salvation, protection, forgiveness, and remission of the sins of the servants of God, all pious Orthodox Christians (and the servants of God [names],) all our brethren who are suffering from diseases, plagues and afflictions.
ltx/en_us_dedes/other.pandemicparaklesis:hoCA.PostGospelBoth.incipit	@ltx/en_us_dedes/ho.ho03:hoMA.PostGospelTheotokos.incipit
ltx/en_us_dedes/other.pandemicparaklesis:hoCA.PostGospelBoth.melody	
ltx/en_us_dedes/other.pandemicparaklesis:hoCA.PostGospelBoth.mode	@ltx/en_us_dedes/miscellanea:misc.Mode2
ltx/en_us_dedes/other.pandemicparaklesis:hoCA.PostGospelBoth.text	@ltx/en_us_dedes/ho.ho03:hoMA.PostGospelTheotokos.text
ltx/en_us_dedes/other.pandemicparaklesis:hoCA.PostGospelGlory.incipit	@ltx/en_us_dedes/ho.ho03:hoMA.PostGospelTrinity.incipit
ltx/en_us_dedes/other.pandemicparaklesis:hoCA.PostGospelGlory.melody	
ltx/en_us_dedes/other.pandemicparaklesis:hoCA.PostGospelGlory.mode	@ltx/en_us_dedes/miscellanea:misc.Mode2
ltx/en_us_dedes/other.pandemicparaklesis:hoCA.PostGospelGlory.text	@ltx/en_us_dedes/ho.ho03:hoMA.PostGospelTrinity.text
ltx/en_us_dedes/other.pandemicparaklesis:hoCA.PostGospelHymn1.incipit	Loving Lord, whose will it…
ltx/en_us_dedes/other.pandemicparaklesis:hoCA.PostGospelHymn1.melody	@ltx/en_us_dedes/he.a.m6:heAU.OlinApothemenoi.name
ltx/en_us_dedes/other.pandemicparaklesis:hoCA.PostGospelHymn1.mode	@ltx/en_us_dedes/miscellanea:misc.Mode6
ltx/en_us_dedes/other.pandemicparaklesis:hoCA.PostGospelHymn1.text	Loving Lord, whose will it is that all be saved, O humane God, * You came that we may have life, * and have it abundantly. * You do not want death. * We, who are wretched now, * often have provoked You; * but we worship You exclusively. * We hope in You alone; * we have no protector except for You. * And so we run to You for help. * Praying in repentance, we cry to You: * Loving Lord, be gracious to us who have committed many sins, * and save Your people, and rescue us, * from the storm of deadly plague.
ltx/en_us_dedes/other.pandemicparaklesis:hoCA.Troparion1.incipit	Hold us, O our tender-loving…
ltx/en_us_dedes/other.pandemicparaklesis:hoCA.Troparion1.melody	@ltx/en_us_dedes/he.a.m2:heAU.OteEkTouXylou.name
ltx/en_us_dedes/other.pandemicparaklesis:hoCA.Troparion1.mode	@ltx/en_us_dedes/miscellanea:misc.Mode2
ltx/en_us_dedes/other.pandemicparaklesis:hoCA.Troparion1.text	Hold us, O our tender-loving God, * in this time when we are unsettled for fear of threatening plague. * We implore You be there for us, O benevolent Lord, * and protect us according to Your great and rich mercy. * Graciously accept our voices as we sing these prayers. * And give heed to helping Your people, * in the wealth of Your tender-mercies; * for with ardent faith we put our hope in You.
ltx/en_us_dedes/other.pandemicparaklesis:hoCA.Troparion2.incipit	@ltx/en_us_dedes/ho.ho23:hoCA.Troparion6.incipit
ltx/en_us_dedes/other.pandemicparaklesis:hoCA.Troparion2.melody	
ltx/en_us_dedes/other.pandemicparaklesis:hoCA.Troparion2.mode	@ltx/en_us_dedes/miscellanea:misc.Mode2
ltx/en_us_dedes/other.pandemicparaklesis:hoCA.Troparion2.text	@ltx/en_us_dedes/ho.ho23:hoCA.Troparion6.text
ltx/en_us_dedes/other.pandemicparaklesis:hoCA.Troparion3.incipit	@ltx/en_us_dedes/ho.ho23:hoCA.Troparion7.incipit
ltx/en_us_dedes/other.pandemicparaklesis:hoCA.Troparion3.melody	
ltx/en_us_dedes/other.pandemicparaklesis:hoCA.Troparion3.mode	@ltx/en_us_dedes/miscellanea:misc.Mode2
ltx/en_us_dedes/other.pandemicparaklesis:hoCA.Troparion3.text	@ltx/en_us_dedes/ho.ho23:hoCA.Troparion7.text
ltx/en_us_dedes/other.pandemicparaklesis:hoCA.Troparion31.incipit	Deliver us, O Holy Trinity…
ltx/en_us_dedes/other.pandemicparaklesis:hoCA.Troparion31.melody	
ltx/en_us_dedes/other.pandemicparaklesis:hoCA.Troparion31.mode	@ltx/en_us_dedes/miscellanea:misc.Mode8
ltx/en_us_dedes/other.pandemicparaklesis:hoCA.Troparion31.text	Deliver us, O Holy Trinity. Save us, O Lord of mercy, * from the distress and affliction the plague has caused, * for in Your benevolence You wish to save all.
ltx/en_us_dedes/other.pandemicparaklesis:hoCA.Troparion32.incipit	@ltx/en_us_dedes/ho.ho23:hoCA.Troparion32.incipit
ltx/en_us_dedes/other.pandemicparaklesis:hoCA.Troparion32.melody	
ltx/en_us_dedes/other.pandemicparaklesis:hoCA.Troparion32.mode	@ltx/en_us_dedes/miscellanea:misc.Mode8
ltx/en_us_dedes/other.pandemicparaklesis:hoCA.Troparion32.text	@ltx/en_us_dedes/ho.ho23:hoCA.Troparion32.text
ltx/en_us_dedes/other.pandemicparaklesis:hoCA.Troparion61.incipit	@ltx/en_us_dedes/other.pandemicparaklesis:hoCA.Troparion31.incipit
ltx/en_us_dedes/other.pandemicparaklesis:hoCA.Troparion61.melody	
ltx/en_us_dedes/other.pandemicparaklesis:hoCA.Troparion61.mode	@ltx/en_us_dedes/miscellanea:misc.Mode8
ltx/en_us_dedes/other.pandemicparaklesis:hoCA.Troparion61.text	@ltx/en_us_dedes/other.pandemicparaklesis:hoCA.Troparion31.text
ltx/en_us_dedes/other.pandemicparaklesis:hoCA.Troparion62.incipit	@ltx/en_us_dedes/ho.ho23:hoCA.Troparion62.incipit
ltx/en_us_dedes/other.pandemicparaklesis:hoCA.Troparion62.melody	
ltx/en_us_dedes/other.pandemicparaklesis:hoCA.Troparion62.mode	@ltx/en_us_dedes/miscellanea:misc.Mode8
ltx/en_us_dedes/other.pandemicparaklesis:hoCA.Troparion62.text	@ltx/en_us_dedes/ho.ho23:hoCA.Troparion62.text
ltx/en_us_dedes/other.pandemicparaklesis:hoCA.acrostic	which has as an Acrostic, using the Theotokion of each Ode: “Seraphim.”
ltx/en_us_dedes/other.pandemicparaklesis:hoCA.media.text	
ltx/en_us_dedes/other.pandemicparaklesis:hoCA.poet	Composed in Greek by Metropolitan Cyril of Rhodes
ltx/en_us_dedes/other.pandemicparaklesis:hoCA.title	Supplication Service
ltx/en_us_dedes/other.pandemicparaklesis:hoCA.title2	Sung during a Threatening Pandemic
ltx/en_us_dedes/other.pandemicparaklesis:hoCA.translator	Translated in meter by Fr. Seraphim Dedes
ltx/en_us_dedes/other.pandemicparaklesis:hoCA.verse	@ltx/en_us_dedes/prayers:pr.verse_Trinity.text
