ltx/en_us_dedes/sy.m07.d11:syMA.commemoration01.couplet1.title	@ltx/en_us_dedes/titles:ti.Verses
ltx/en_us_dedes/sy.m07.d11:syMA.commemoration01.couplet1.verse1	
ltx/en_us_dedes/sy.m07.d11:syMA.commemoration01.couplet1.verse2	
ltx/en_us_dedes/sy.m07.d11:syMA.commemoration01.narration.p01	
ltx/en_us_dedes/sy.m07.d11:syMA.commemoration01.narration.p02	
ltx/en_us_dedes/sy.m07.d11:syMA.commemoration01.narration.p03	
ltx/en_us_dedes/sy.m07.d11:syMA.commemoration01.narration.p04	
ltx/en_us_dedes/sy.m07.d11:syMA.commemoration01.single1	
ltx/en_us_dedes/sy.m07.d11:syMA.commemoration01.text	On July 11, we commemorate the Holy Great-martyr and all-famed Euphemia.
ltx/en_us_dedes/sy.m07.d11:syMA.commemoration02.couplet1.title	@ltx/en_us_dedes/titles:ti.Verses
ltx/en_us_dedes/sy.m07.d11:syMA.commemoration02.couplet1.verse1	
ltx/en_us_dedes/sy.m07.d11:syMA.commemoration02.couplet1.verse2	
ltx/en_us_dedes/sy.m07.d11:syMA.commemoration02.text	On this day we also commemorate the holy Martyr Cindeus the Presbyter.
ltx/en_us_dedes/sy.m07.d11:syMA.commemoration03.couplet1.title	@ltx/en_us_dedes/titles:ti.Verses
ltx/en_us_dedes/sy.m07.d11:syMA.commemoration03.couplet1.verse1	
ltx/en_us_dedes/sy.m07.d11:syMA.commemoration03.couplet1.verse2	
ltx/en_us_dedes/sy.m07.d11:syMA.commemoration03.text	The devout Leo of the Sheepfold, reposed in peace.
ltx/en_us_dedes/sy.m07.d11:syMA.commemoration04.couplet1.title	@ltx/en_us_dedes/titles:ti.Verses
ltx/en_us_dedes/sy.m07.d11:syMA.commemoration04.couplet1.verse1	
ltx/en_us_dedes/sy.m07.d11:syMA.commemoration04.couplet1.verse2	
ltx/en_us_dedes/sy.m07.d11:syMA.commemoration04.couplet2.verse1	
ltx/en_us_dedes/sy.m07.d11:syMA.commemoration04.couplet2.verse2	
ltx/en_us_dedes/sy.m07.d11:syMA.commemoration04.text	The holy Martyrs Marcian and Martyrocles died by the sword and by arrows respectively.
ltx/en_us_dedes/sy.m07.d11:syMA.commemoration05.couplet1.title	@ltx/en_us_dedes/titles:ti.Verses
ltx/en_us_dedes/sy.m07.d11:syMA.commemoration05.couplet1.verse1	
ltx/en_us_dedes/sy.m07.d11:syMA.commemoration05.couplet1.verse2	
ltx/en_us_dedes/sy.m07.d11:syMA.commemoration05.text	The devout Nicodemus, who lived in asceticism near the holy Monastery of Vatopedi (on Mt. Athos), and who was the teacher of St. Gregory Palamas in Christian philosophy, reposed in peace.
ltx/en_us_dedes/sy.m07.d11:syMA.commemoration06.couplet1.title	@ltx/en_us_dedes/titles:ti.Verses
ltx/en_us_dedes/sy.m07.d11:syMA.commemoration06.couplet1.verse1	
ltx/en_us_dedes/sy.m07.d11:syMA.commemoration06.couplet1.verse2	
ltx/en_us_dedes/sy.m07.d11:syMA.commemoration06.text	The New Monastic Martyr Nicodemus, who witnessed in Elesvan, Albania in the year 1722, died by the sword.
ltx/en_us_dedes/sy.m07.d11:syMA.commemoration07.couplet1.title	@ltx/en_us_dedes/titles:ti.Verses
ltx/en_us_dedes/sy.m07.d11:syMA.commemoration07.couplet1.verse1	
ltx/en_us_dedes/sy.m07.d11:syMA.commemoration07.couplet1.verse2	
ltx/en_us_dedes/sy.m07.d11:syMA.commemoration07.text	The holy New Monastic Martyr Nektarios, who was from Vryoulla, and who witnessed in 1820, died by the sword.
ltx/en_us_dedes/sy.m07.d11:syMA.commemoration08.couplet1.title	@ltx/en_us_dedes/titles:ti.Verses
ltx/en_us_dedes/sy.m07.d11:syMA.commemoration08.couplet1.verse1	
ltx/en_us_dedes/sy.m07.d11:syMA.commemoration08.couplet1.verse2	
ltx/en_us_dedes/sy.m07.d11:syMA.commemoration08.text	We also commemorate St. Olga, the Great Princess and Equal to the Apostles.
ltx/en_us_dedes/sy.m07.d11:syMA.lastline	By their holy intercessions, O God, have mercy on us. Amen.
