ltx/en_us_dedes/me.m04.d20:meDA.commemoration.first	Memory of St. Theodore the Trichinas
ltx/en_us_dedes/me.m04.d20:meDA.commemoration.first_name	
ltx/en_us_dedes/me.m04.d20:meDA.commemoration.first_short	Memory of St. Theodore the Trichinas
ltx/en_us_dedes/me.m04.d20:meDA.commemoration.first_title	@ltx/en_us_dedes/titles:ti.SaintM
ltx/en_us_dedes/me.m04.d20:meDA.commemoration.full	Memory of our Devout Father Theodore the Trichinas
ltx/en_us_dedes/me.m04.d20:meDA.commemoration.second_name	
ltx/en_us_dedes/me.m04.d20:meDA.commemoration.second_title	
ltx/en_us_dedes/me.m04.d20:meDA.date	April 20
ltx/en_us_dedes/me.m04.d20:meDA.fordate	for April 20
ltx/en_us_dedes/me.m04.d20:meDA.insert1	
ltx/en_us_dedes/me.m04.d20:meDA.insert2	
ltx/en_us_dedes/me.m04.d20:meDA.note	
ltx/en_us_dedes/me.m04.d20:meDA.pdfcoverdate	April 20,
ltx/en_us_dedes/me.m04.d20:meDA.pdfheaderdate	April 20
ltx/en_us_dedes/me.m04.d20:meHO.commemorations	
ltx/en_us_dedes/me.m04.d20:meHO.note1	
ltx/en_us_dedes/me.m04.d20:meHO.note2	
ltx/en_us_dedes/me.m04.d20:meHO.number	
ltx/en_us_dedes/me.m04.d20:meHO.rank	
ltx/en_us_dedes/me.m04.d20:meLE.commemoration1	
ltx/en_us_dedes/me.m04.d20:meLE.commemoration2	
ltx/en_us_dedes/me.m04.d20:meLI.Kontakion1.incipit	@ltx/en_us_dedes/me.m04.d20:meMA.Kontakion1ger.incipit
ltx/en_us_dedes/me.m04.d20:meLI.Kontakion1.melody	@ltx/en_us_dedes/me.m04.d20:meMA.Kontakion1ger.melody
ltx/en_us_dedes/me.m04.d20:meLI.Kontakion1.mode	@ltx/en_us_dedes/me.m04.d20:meMA.Kontakion1ger.mode
ltx/en_us_dedes/me.m04.d20:meLI.Kontakion1.text	@ltx/en_us_dedes/me.m04.d20:meMA.Kontakion1ger.text
ltx/en_us_dedes/me.m04.d20:meLI.MM.CommunionHymn.text	@ltx/en_us_dedes/properties:media.key
ltx/en_us_dedes/me.m04.d20:meLI.Megalynarion.text	
ltx/en_us_dedes/me.m04.d20:meMA.C1.title	@ltx/en_us_dedes/titles:ti.CanonSaintM
ltx/en_us_dedes/me.m04.d20:meMA.C1.verse	@ltx/en_us_dedes/prayers:pr.verse_SaintM.text
ltx/en_us_dedes/me.m04.d20:meMA.Kontakion1ger.incipit	…
ltx/en_us_dedes/me.m04.d20:meMA.Kontakion1ger.melody	@ltx/en_us_dedes/he.a.m1:heAU.TonTafonSouSotir.name
ltx/en_us_dedes/me.m04.d20:meMA.Kontakion1ger.mode	@ltx/en_us_dedes/miscellanea:misc.Mode1
ltx/en_us_dedes/me.m04.d20:meMA.Kontakion1ger.poet	@ltx/en_us_dedes/poets:po.Gerasimou
ltx/en_us_dedes/me.m04.d20:meMA.Kontakion1ger.text	
ltx/en_us_dedes/me.m04.d20:meMA.Ode1C11.greekmelody	@ltx/en_us_dedes/he.h.m4:heHE.ThalassisToErythraion.greekname
ltx/en_us_dedes/me.m04.d20:meMA.Ode1C11.incipit	…
ltx/en_us_dedes/me.m04.d20:meMA.Ode1C11.melody	@ltx/en_us_dedes/he.h.m4:heHE.ThalassisToErythraion.name
ltx/en_us_dedes/me.m04.d20:meMA.Ode1C11.mode	@ltx/en_us_dedes/miscellanea:misc.Mode4
ltx/en_us_dedes/me.m04.d20:meMA.Ode1C11.ode	@ltx/en_us_dedes/miscellanea:misc.Ode1
ltx/en_us_dedes/me.m04.d20:meMA.Ode1C11.text	
ltx/en_us_dedes/me.m04.d20:meMA.Ode1C12.incipit	…
ltx/en_us_dedes/me.m04.d20:meMA.Ode1C12.melody	@ltx/en_us_dedes/he.h.m4:heHE.ThalassisToErythraion.name
ltx/en_us_dedes/me.m04.d20:meMA.Ode1C12.mode	@ltx/en_us_dedes/miscellanea:misc.Mode4
ltx/en_us_dedes/me.m04.d20:meMA.Ode1C12.ode	@ltx/en_us_dedes/miscellanea:misc.Ode1
ltx/en_us_dedes/me.m04.d20:meMA.Ode1C12.text	
ltx/en_us_dedes/me.m04.d20:meMA.Ode1C13.incipit	…
ltx/en_us_dedes/me.m04.d20:meMA.Ode1C13.melody	@ltx/en_us_dedes/he.h.m4:heHE.ThalassisToErythraion.name
ltx/en_us_dedes/me.m04.d20:meMA.Ode1C13.mode	@ltx/en_us_dedes/miscellanea:misc.Mode4
ltx/en_us_dedes/me.m04.d20:meMA.Ode1C13.ode	@ltx/en_us_dedes/miscellanea:misc.Ode1
ltx/en_us_dedes/me.m04.d20:meMA.Ode1C13.text	
ltx/en_us_dedes/me.m04.d20:meMA.Ode1C1H.greekmelody	@ltx/en_us_dedes/he.h.m4:heHE.ThalassisToErythraion.greekname
ltx/en_us_dedes/me.m04.d20:meMA.Ode1C1H.incipit	@ltx/en_us_dedes/he.h.m4:heHE.ThalassisToErythraion.incipit
ltx/en_us_dedes/me.m04.d20:meMA.Ode1C1H.melody	@ltx/en_us_dedes/he.h.m4:heHE.ThalassisToErythraion.melody
ltx/en_us_dedes/me.m04.d20:meMA.Ode1C1H.mode	@ltx/en_us_dedes/miscellanea:misc.Mode4
ltx/en_us_dedes/me.m04.d20:meMA.Ode1C1H.ode	@ltx/en_us_dedes/miscellanea:misc.Ode1
ltx/en_us_dedes/me.m04.d20:meMA.Ode1C1H.text	@ltx/en_us_dedes/he.h.m4:heHE.ThalassisToErythraion.text
ltx/en_us_dedes/me.m04.d20:meMA.Ode1C1T.incipit	…
ltx/en_us_dedes/me.m04.d20:meMA.Ode1C1T.melody	@ltx/en_us_dedes/he.h.m4:heHE.ThalassisToErythraion.name
ltx/en_us_dedes/me.m04.d20:meMA.Ode1C1T.mode	@ltx/en_us_dedes/miscellanea:misc.Mode4
ltx/en_us_dedes/me.m04.d20:meMA.Ode1C1T.ode	@ltx/en_us_dedes/miscellanea:misc.Ode1
ltx/en_us_dedes/me.m04.d20:meMA.Ode1C1T.text	
ltx/en_us_dedes/me.m04.d20:meMA.Ode3C11.greekmelody	@ltx/en_us_dedes/he.h.m4:heHE.EffrainetaiEpiSoi.greekname
ltx/en_us_dedes/me.m04.d20:meMA.Ode3C11.incipit	…
ltx/en_us_dedes/me.m04.d20:meMA.Ode3C11.melody	@ltx/en_us_dedes/he.h.m4:heHE.EffrainetaiEpiSoi.name
ltx/en_us_dedes/me.m04.d20:meMA.Ode3C11.mode	@ltx/en_us_dedes/miscellanea:misc.Mode4
ltx/en_us_dedes/me.m04.d20:meMA.Ode3C11.ode	@ltx/en_us_dedes/miscellanea:misc.Ode3
ltx/en_us_dedes/me.m04.d20:meMA.Ode3C11.text	
ltx/en_us_dedes/me.m04.d20:meMA.Ode3C12.incipit	…
ltx/en_us_dedes/me.m04.d20:meMA.Ode3C12.melody	@ltx/en_us_dedes/he.h.m4:heHE.EffrainetaiEpiSoi.name
ltx/en_us_dedes/me.m04.d20:meMA.Ode3C12.mode	@ltx/en_us_dedes/miscellanea:misc.Mode4
ltx/en_us_dedes/me.m04.d20:meMA.Ode3C12.ode	@ltx/en_us_dedes/miscellanea:misc.Ode3
ltx/en_us_dedes/me.m04.d20:meMA.Ode3C12.text	
ltx/en_us_dedes/me.m04.d20:meMA.Ode3C13.incipit	…
ltx/en_us_dedes/me.m04.d20:meMA.Ode3C13.melody	@ltx/en_us_dedes/he.h.m4:heHE.EffrainetaiEpiSoi.name
ltx/en_us_dedes/me.m04.d20:meMA.Ode3C13.mode	@ltx/en_us_dedes/miscellanea:misc.Mode4
ltx/en_us_dedes/me.m04.d20:meMA.Ode3C13.ode	@ltx/en_us_dedes/miscellanea:misc.Ode3
ltx/en_us_dedes/me.m04.d20:meMA.Ode3C13.text	
ltx/en_us_dedes/me.m04.d20:meMA.Ode3C1H.greekmelody	@ltx/en_us_dedes/he.h.m4:heHE.EffrainetaiEpiSoi.greekname
ltx/en_us_dedes/me.m04.d20:meMA.Ode3C1H.incipit	@ltx/en_us_dedes/he.h.m4:heHE.EffrainetaiEpiSoi.incipit
ltx/en_us_dedes/me.m04.d20:meMA.Ode3C1H.melody	@ltx/en_us_dedes/he.h.m4:heHE.EffrainetaiEpiSoi.melody
ltx/en_us_dedes/me.m04.d20:meMA.Ode3C1H.mode	@ltx/en_us_dedes/miscellanea:misc.Mode4
ltx/en_us_dedes/me.m04.d20:meMA.Ode3C1H.ode	@ltx/en_us_dedes/miscellanea:misc.Ode3
ltx/en_us_dedes/me.m04.d20:meMA.Ode3C1H.text	@ltx/en_us_dedes/he.h.m4:heHE.EffrainetaiEpiSoi.text
ltx/en_us_dedes/me.m04.d20:meMA.Ode3C1T.incipit	…
ltx/en_us_dedes/me.m04.d20:meMA.Ode3C1T.melody	@ltx/en_us_dedes/he.h.m4:heHE.EffrainetaiEpiSoi.name
ltx/en_us_dedes/me.m04.d20:meMA.Ode3C1T.mode	@ltx/en_us_dedes/miscellanea:misc.Mode4
ltx/en_us_dedes/me.m04.d20:meMA.Ode3C1T.ode	@ltx/en_us_dedes/miscellanea:misc.Ode3
ltx/en_us_dedes/me.m04.d20:meMA.Ode3C1T.text	
ltx/en_us_dedes/me.m04.d20:meMA.Ode3Kathisma1.greekmelody	@ltx/en_us_dedes/he.a.m4:heAU.OYpsotheisEnToStavro.greekname
ltx/en_us_dedes/me.m04.d20:meMA.Ode3Kathisma1.incipit	…
ltx/en_us_dedes/me.m04.d20:meMA.Ode3Kathisma1.melody	@ltx/en_us_dedes/he.a.m4:heAU.OYpsotheisEnToStavro.name
ltx/en_us_dedes/me.m04.d20:meMA.Ode3Kathisma1.mode	@ltx/en_us_dedes/miscellanea:misc.Mode4
ltx/en_us_dedes/me.m04.d20:meMA.Ode3Kathisma1.text	
ltx/en_us_dedes/me.m04.d20:meMA.Ode3KathismaSt.incipit	…
ltx/en_us_dedes/me.m04.d20:meMA.Ode3KathismaSt.melody	@ltx/en_us_dedes/he.a.m4:heAU.OYpsotheisEnToStavro.name
ltx/en_us_dedes/me.m04.d20:meMA.Ode3KathismaSt.mode	@ltx/en_us_dedes/miscellanea:misc.Mode4
ltx/en_us_dedes/me.m04.d20:meMA.Ode3KathismaSt.text	
ltx/en_us_dedes/me.m04.d20:meMA.Ode3KathismaT.incipit	@ltx/en_us_dedes/oc.m4.d3:ocVE.ApolTheotokionVM.incipit
ltx/en_us_dedes/me.m04.d20:meMA.Ode3KathismaT.melody	@ltx/en_us_dedes/he.a.m4:heAU.OYpsotheisEnToStavro.name
ltx/en_us_dedes/me.m04.d20:meMA.Ode3KathismaT.mode	@ltx/en_us_dedes/miscellanea:misc.Mode4
ltx/en_us_dedes/me.m04.d20:meMA.Ode3KathismaT.text	@ltx/en_us_dedes/oc.m4.d3:ocVE.ApolTheotokionVM.text
ltx/en_us_dedes/me.m04.d20:meMA.Ode4C11.greekmelody	@ltx/en_us_dedes/he.h.m4:heHE.EparthentaSeIdousa.greekname
ltx/en_us_dedes/me.m04.d20:meMA.Ode4C11.incipit	…
ltx/en_us_dedes/me.m04.d20:meMA.Ode4C11.melody	@ltx/en_us_dedes/he.h.m4:heHE.EparthentaSeIdousa.name
ltx/en_us_dedes/me.m04.d20:meMA.Ode4C11.mode	@ltx/en_us_dedes/miscellanea:misc.Mode4
ltx/en_us_dedes/me.m04.d20:meMA.Ode4C11.ode	@ltx/en_us_dedes/miscellanea:misc.Ode4
ltx/en_us_dedes/me.m04.d20:meMA.Ode4C11.text	
ltx/en_us_dedes/me.m04.d20:meMA.Ode4C12.incipit	…
ltx/en_us_dedes/me.m04.d20:meMA.Ode4C12.melody	@ltx/en_us_dedes/he.h.m4:heHE.EparthentaSeIdousa.name
ltx/en_us_dedes/me.m04.d20:meMA.Ode4C12.mode	@ltx/en_us_dedes/miscellanea:misc.Mode4
ltx/en_us_dedes/me.m04.d20:meMA.Ode4C12.ode	@ltx/en_us_dedes/miscellanea:misc.Ode4
ltx/en_us_dedes/me.m04.d20:meMA.Ode4C12.text	
ltx/en_us_dedes/me.m04.d20:meMA.Ode4C13.incipit	…
ltx/en_us_dedes/me.m04.d20:meMA.Ode4C13.melody	@ltx/en_us_dedes/he.h.m4:heHE.EparthentaSeIdousa.name
ltx/en_us_dedes/me.m04.d20:meMA.Ode4C13.mode	@ltx/en_us_dedes/miscellanea:misc.Mode4
ltx/en_us_dedes/me.m04.d20:meMA.Ode4C13.ode	@ltx/en_us_dedes/miscellanea:misc.Ode4
ltx/en_us_dedes/me.m04.d20:meMA.Ode4C13.text	
ltx/en_us_dedes/me.m04.d20:meMA.Ode4C1H.greekmelody	@ltx/en_us_dedes/he.h.m4:heHE.EparthentaSeIdousa.greekname
ltx/en_us_dedes/me.m04.d20:meMA.Ode4C1H.incipit	@ltx/en_us_dedes/he.h.m4:heHE.EparthentaSeIdousa.incipit
ltx/en_us_dedes/me.m04.d20:meMA.Ode4C1H.melody	@ltx/en_us_dedes/he.h.m4:heHE.EparthentaSeIdousa.melody
ltx/en_us_dedes/me.m04.d20:meMA.Ode4C1H.mode	@ltx/en_us_dedes/miscellanea:misc.Mode4
ltx/en_us_dedes/me.m04.d20:meMA.Ode4C1H.ode	@ltx/en_us_dedes/miscellanea:misc.Ode4
ltx/en_us_dedes/me.m04.d20:meMA.Ode4C1H.text	@ltx/en_us_dedes/he.h.m4:heHE.EparthentaSeIdousa.text
ltx/en_us_dedes/me.m04.d20:meMA.Ode4C1T.incipit	…
ltx/en_us_dedes/me.m04.d20:meMA.Ode4C1T.melody	@ltx/en_us_dedes/he.h.m4:heHE.EparthentaSeIdousa.name
ltx/en_us_dedes/me.m04.d20:meMA.Ode4C1T.mode	@ltx/en_us_dedes/miscellanea:misc.Mode4
ltx/en_us_dedes/me.m04.d20:meMA.Ode4C1T.ode	@ltx/en_us_dedes/miscellanea:misc.Ode4
ltx/en_us_dedes/me.m04.d20:meMA.Ode4C1T.text	
ltx/en_us_dedes/me.m04.d20:meMA.Ode5C11.greekmelody	@ltx/en_us_dedes/he.h.m4:heHE.SyKyrieMouFos.greekname
ltx/en_us_dedes/me.m04.d20:meMA.Ode5C11.incipit	…
ltx/en_us_dedes/me.m04.d20:meMA.Ode5C11.melody	@ltx/en_us_dedes/he.h.m4:heHE.SyKyrieMouFos.name
ltx/en_us_dedes/me.m04.d20:meMA.Ode5C11.mode	@ltx/en_us_dedes/miscellanea:misc.Mode4
ltx/en_us_dedes/me.m04.d20:meMA.Ode5C11.ode	@ltx/en_us_dedes/miscellanea:misc.Ode5
ltx/en_us_dedes/me.m04.d20:meMA.Ode5C11.text	
ltx/en_us_dedes/me.m04.d20:meMA.Ode5C12.incipit	…
ltx/en_us_dedes/me.m04.d20:meMA.Ode5C12.melody	@ltx/en_us_dedes/he.h.m4:heHE.SyKyrieMouFos.name
ltx/en_us_dedes/me.m04.d20:meMA.Ode5C12.mode	@ltx/en_us_dedes/miscellanea:misc.Mode4
ltx/en_us_dedes/me.m04.d20:meMA.Ode5C12.ode	@ltx/en_us_dedes/miscellanea:misc.Ode5
ltx/en_us_dedes/me.m04.d20:meMA.Ode5C12.text	
ltx/en_us_dedes/me.m04.d20:meMA.Ode5C13.incipit	…
ltx/en_us_dedes/me.m04.d20:meMA.Ode5C13.melody	@ltx/en_us_dedes/he.h.m4:heHE.SyKyrieMouFos.name
ltx/en_us_dedes/me.m04.d20:meMA.Ode5C13.mode	@ltx/en_us_dedes/miscellanea:misc.Mode4
ltx/en_us_dedes/me.m04.d20:meMA.Ode5C13.ode	@ltx/en_us_dedes/miscellanea:misc.Ode5
ltx/en_us_dedes/me.m04.d20:meMA.Ode5C13.text	
ltx/en_us_dedes/me.m04.d20:meMA.Ode5C1H.greekmelody	@ltx/en_us_dedes/he.h.m4:heHE.SyKyrieMouFos.greekname
ltx/en_us_dedes/me.m04.d20:meMA.Ode5C1H.incipit	@ltx/en_us_dedes/he.h.m4:heHE.SyKyrieMouFos.incipit
ltx/en_us_dedes/me.m04.d20:meMA.Ode5C1H.melody	@ltx/en_us_dedes/he.h.m4:heHE.SyKyrieMouFos.melody
ltx/en_us_dedes/me.m04.d20:meMA.Ode5C1H.mode	@ltx/en_us_dedes/miscellanea:misc.Mode4
ltx/en_us_dedes/me.m04.d20:meMA.Ode5C1H.ode	@ltx/en_us_dedes/miscellanea:misc.Ode5
ltx/en_us_dedes/me.m04.d20:meMA.Ode5C1H.text	@ltx/en_us_dedes/he.h.m4:heHE.SyKyrieMouFos.text
ltx/en_us_dedes/me.m04.d20:meMA.Ode5C1T.incipit	…
ltx/en_us_dedes/me.m04.d20:meMA.Ode5C1T.melody	@ltx/en_us_dedes/he.h.m4:heHE.SyKyrieMouFos.name
ltx/en_us_dedes/me.m04.d20:meMA.Ode5C1T.mode	@ltx/en_us_dedes/miscellanea:misc.Mode4
ltx/en_us_dedes/me.m04.d20:meMA.Ode5C1T.ode	@ltx/en_us_dedes/miscellanea:misc.Ode5
ltx/en_us_dedes/me.m04.d20:meMA.Ode5C1T.text	
ltx/en_us_dedes/me.m04.d20:meMA.Ode6C11.greekmelody	@ltx/en_us_dedes/he.h.m4:heHE.ThysoSoiMetaFonis.greekname
ltx/en_us_dedes/me.m04.d20:meMA.Ode6C11.incipit	…
ltx/en_us_dedes/me.m04.d20:meMA.Ode6C11.melody	@ltx/en_us_dedes/he.h.m4:heHE.ThysoSoiMetaFonis.name
ltx/en_us_dedes/me.m04.d20:meMA.Ode6C11.mode	@ltx/en_us_dedes/miscellanea:misc.Mode4
ltx/en_us_dedes/me.m04.d20:meMA.Ode6C11.ode	@ltx/en_us_dedes/miscellanea:misc.Ode6
ltx/en_us_dedes/me.m04.d20:meMA.Ode6C11.text	
ltx/en_us_dedes/me.m04.d20:meMA.Ode6C12.incipit	…
ltx/en_us_dedes/me.m04.d20:meMA.Ode6C12.melody	@ltx/en_us_dedes/he.h.m4:heHE.ThysoSoiMetaFonis.name
ltx/en_us_dedes/me.m04.d20:meMA.Ode6C12.mode	@ltx/en_us_dedes/miscellanea:misc.Mode4
ltx/en_us_dedes/me.m04.d20:meMA.Ode6C12.ode	@ltx/en_us_dedes/miscellanea:misc.Ode6
ltx/en_us_dedes/me.m04.d20:meMA.Ode6C12.text	
ltx/en_us_dedes/me.m04.d20:meMA.Ode6C13.incipit	…
ltx/en_us_dedes/me.m04.d20:meMA.Ode6C13.melody	@ltx/en_us_dedes/he.h.m4:heHE.ThysoSoiMetaFonis.name
ltx/en_us_dedes/me.m04.d20:meMA.Ode6C13.mode	@ltx/en_us_dedes/miscellanea:misc.Mode4
ltx/en_us_dedes/me.m04.d20:meMA.Ode6C13.ode	@ltx/en_us_dedes/miscellanea:misc.Ode6
ltx/en_us_dedes/me.m04.d20:meMA.Ode6C13.text	
ltx/en_us_dedes/me.m04.d20:meMA.Ode6C1H.greekmelody	@ltx/en_us_dedes/he.h.m4:heHE.ThysoSoiMetaFonis.greekname
ltx/en_us_dedes/me.m04.d20:meMA.Ode6C1H.incipit	@ltx/en_us_dedes/he.h.m4:heHE.ThysoSoiMetaFonis.incipit
ltx/en_us_dedes/me.m04.d20:meMA.Ode6C1H.melody	@ltx/en_us_dedes/he.h.m4:heHE.ThysoSoiMetaFonis.melody
ltx/en_us_dedes/me.m04.d20:meMA.Ode6C1H.mode	@ltx/en_us_dedes/miscellanea:misc.Mode4
ltx/en_us_dedes/me.m04.d20:meMA.Ode6C1H.ode	@ltx/en_us_dedes/miscellanea:misc.Ode6
ltx/en_us_dedes/me.m04.d20:meMA.Ode6C1H.text	@ltx/en_us_dedes/he.h.m4:heHE.ThysoSoiMetaFonis.text
ltx/en_us_dedes/me.m04.d20:meMA.Ode6C1T.incipit	…
ltx/en_us_dedes/me.m04.d20:meMA.Ode6C1T.melody	@ltx/en_us_dedes/he.h.m4:heHE.ThysoSoiMetaFonis.name
ltx/en_us_dedes/me.m04.d20:meMA.Ode6C1T.mode	@ltx/en_us_dedes/miscellanea:misc.Mode4
ltx/en_us_dedes/me.m04.d20:meMA.Ode6C1T.ode	@ltx/en_us_dedes/miscellanea:misc.Ode6
ltx/en_us_dedes/me.m04.d20:meMA.Ode6C1T.text	
ltx/en_us_dedes/me.m04.d20:meMA.Ode7C11.greekmelody	@ltx/en_us_dedes/he.h.m4:heHE.EnTiKaminoAvramiaioi.greekname
ltx/en_us_dedes/me.m04.d20:meMA.Ode7C11.incipit	…
ltx/en_us_dedes/me.m04.d20:meMA.Ode7C11.melody	@ltx/en_us_dedes/he.h.m4:heHE.EnTiKaminoAvramiaioi.name
ltx/en_us_dedes/me.m04.d20:meMA.Ode7C11.mode	@ltx/en_us_dedes/miscellanea:misc.Mode4
ltx/en_us_dedes/me.m04.d20:meMA.Ode7C11.ode	@ltx/en_us_dedes/miscellanea:misc.Ode7
ltx/en_us_dedes/me.m04.d20:meMA.Ode7C11.text	
ltx/en_us_dedes/me.m04.d20:meMA.Ode7C12.incipit	…
ltx/en_us_dedes/me.m04.d20:meMA.Ode7C12.melody	@ltx/en_us_dedes/he.h.m4:heHE.EnTiKaminoAvramiaioi.name
ltx/en_us_dedes/me.m04.d20:meMA.Ode7C12.mode	@ltx/en_us_dedes/miscellanea:misc.Mode4
ltx/en_us_dedes/me.m04.d20:meMA.Ode7C12.ode	@ltx/en_us_dedes/miscellanea:misc.Ode7
ltx/en_us_dedes/me.m04.d20:meMA.Ode7C12.text	
ltx/en_us_dedes/me.m04.d20:meMA.Ode7C13.incipit	…
ltx/en_us_dedes/me.m04.d20:meMA.Ode7C13.melody	@ltx/en_us_dedes/he.h.m4:heHE.EnTiKaminoAvramiaioi.name
ltx/en_us_dedes/me.m04.d20:meMA.Ode7C13.mode	@ltx/en_us_dedes/miscellanea:misc.Mode4
ltx/en_us_dedes/me.m04.d20:meMA.Ode7C13.ode	@ltx/en_us_dedes/miscellanea:misc.Ode7
ltx/en_us_dedes/me.m04.d20:meMA.Ode7C13.text	
ltx/en_us_dedes/me.m04.d20:meMA.Ode7C1H.greekmelody	@ltx/en_us_dedes/he.h.m4:heHE.EnTiKaminoAvramiaioi.greekname
ltx/en_us_dedes/me.m04.d20:meMA.Ode7C1H.incipit	@ltx/en_us_dedes/he.h.m4:heHE.EnTiKaminoAvramiaioi.incipit
ltx/en_us_dedes/me.m04.d20:meMA.Ode7C1H.melody	@ltx/en_us_dedes/he.h.m4:heHE.EnTiKaminoAvramiaioi.melody
ltx/en_us_dedes/me.m04.d20:meMA.Ode7C1H.mode	@ltx/en_us_dedes/miscellanea:misc.Mode4
ltx/en_us_dedes/me.m04.d20:meMA.Ode7C1H.ode	@ltx/en_us_dedes/miscellanea:misc.Ode7
ltx/en_us_dedes/me.m04.d20:meMA.Ode7C1H.text	@ltx/en_us_dedes/he.h.m4:heHE.EnTiKaminoAvramiaioi.text
ltx/en_us_dedes/me.m04.d20:meMA.Ode7C1T.incipit	…
ltx/en_us_dedes/me.m04.d20:meMA.Ode7C1T.melody	@ltx/en_us_dedes/he.h.m4:heHE.EnTiKaminoAvramiaioi.name
ltx/en_us_dedes/me.m04.d20:meMA.Ode7C1T.mode	@ltx/en_us_dedes/miscellanea:misc.Mode4
ltx/en_us_dedes/me.m04.d20:meMA.Ode7C1T.ode	@ltx/en_us_dedes/miscellanea:misc.Ode7
ltx/en_us_dedes/me.m04.d20:meMA.Ode7C1T.text	
ltx/en_us_dedes/me.m04.d20:meMA.Ode8C11.greekmelody	@ltx/en_us_dedes/he.h.m4:heHE.CheirasEkpetasasDaniil.greekname
ltx/en_us_dedes/me.m04.d20:meMA.Ode8C11.incipit	…
ltx/en_us_dedes/me.m04.d20:meMA.Ode8C11.melody	@ltx/en_us_dedes/he.h.m4:heHE.CheirasEkpetasasDaniil.name
ltx/en_us_dedes/me.m04.d20:meMA.Ode8C11.mode	@ltx/en_us_dedes/miscellanea:misc.Mode4
ltx/en_us_dedes/me.m04.d20:meMA.Ode8C11.ode	@ltx/en_us_dedes/miscellanea:misc.Ode8
ltx/en_us_dedes/me.m04.d20:meMA.Ode8C11.text	
ltx/en_us_dedes/me.m04.d20:meMA.Ode8C12.incipit	…
ltx/en_us_dedes/me.m04.d20:meMA.Ode8C12.melody	@ltx/en_us_dedes/he.h.m4:heHE.CheirasEkpetasasDaniil.name
ltx/en_us_dedes/me.m04.d20:meMA.Ode8C12.mode	@ltx/en_us_dedes/miscellanea:misc.Mode4
ltx/en_us_dedes/me.m04.d20:meMA.Ode8C12.ode	@ltx/en_us_dedes/miscellanea:misc.Ode8
ltx/en_us_dedes/me.m04.d20:meMA.Ode8C12.text	
ltx/en_us_dedes/me.m04.d20:meMA.Ode8C13.incipit	…
ltx/en_us_dedes/me.m04.d20:meMA.Ode8C13.melody	@ltx/en_us_dedes/he.h.m4:heHE.CheirasEkpetasasDaniil.name
ltx/en_us_dedes/me.m04.d20:meMA.Ode8C13.mode	@ltx/en_us_dedes/miscellanea:misc.Mode4
ltx/en_us_dedes/me.m04.d20:meMA.Ode8C13.ode	@ltx/en_us_dedes/miscellanea:misc.Ode8
ltx/en_us_dedes/me.m04.d20:meMA.Ode8C13.text	
ltx/en_us_dedes/me.m04.d20:meMA.Ode8C1H.greekmelody	@ltx/en_us_dedes/he.h.m4:heHE.CheirasEkpetasasDaniil.greekname
ltx/en_us_dedes/me.m04.d20:meMA.Ode8C1H.incipit	@ltx/en_us_dedes/he.h.m4:heHE.CheirasEkpetasasDaniil.incipit
ltx/en_us_dedes/me.m04.d20:meMA.Ode8C1H.melody	@ltx/en_us_dedes/he.h.m4:heHE.CheirasEkpetasasDaniil.melody
ltx/en_us_dedes/me.m04.d20:meMA.Ode8C1H.mode	@ltx/en_us_dedes/miscellanea:misc.Mode4
ltx/en_us_dedes/me.m04.d20:meMA.Ode8C1H.ode	@ltx/en_us_dedes/miscellanea:misc.Ode8
ltx/en_us_dedes/me.m04.d20:meMA.Ode8C1H.text	@ltx/en_us_dedes/he.h.m4:heHE.CheirasEkpetasasDaniil.text
ltx/en_us_dedes/me.m04.d20:meMA.Ode8C1T.incipit	…
ltx/en_us_dedes/me.m04.d20:meMA.Ode8C1T.melody	@ltx/en_us_dedes/he.h.m4:heHE.CheirasEkpetasasDaniil.name
ltx/en_us_dedes/me.m04.d20:meMA.Ode8C1T.mode	@ltx/en_us_dedes/miscellanea:misc.Mode4
ltx/en_us_dedes/me.m04.d20:meMA.Ode8C1T.ode	@ltx/en_us_dedes/miscellanea:misc.Ode8
ltx/en_us_dedes/me.m04.d20:meMA.Ode8C1T.text	
ltx/en_us_dedes/me.m04.d20:meMA.Ode9C11.greekmelody	@ltx/en_us_dedes/he.h.m4:heHE.LithosAcheirotmitos.greekname
ltx/en_us_dedes/me.m04.d20:meMA.Ode9C11.incipit	…
ltx/en_us_dedes/me.m04.d20:meMA.Ode9C11.melody	@ltx/en_us_dedes/he.h.m4:heHE.LithosAcheirotmitos.name
ltx/en_us_dedes/me.m04.d20:meMA.Ode9C11.mode	@ltx/en_us_dedes/miscellanea:misc.Mode4
ltx/en_us_dedes/me.m04.d20:meMA.Ode9C11.ode	@ltx/en_us_dedes/miscellanea:misc.Ode9
ltx/en_us_dedes/me.m04.d20:meMA.Ode9C11.text	
ltx/en_us_dedes/me.m04.d20:meMA.Ode9C12.incipit	…
ltx/en_us_dedes/me.m04.d20:meMA.Ode9C12.melody	@ltx/en_us_dedes/he.h.m4:heHE.LithosAcheirotmitos.name
ltx/en_us_dedes/me.m04.d20:meMA.Ode9C12.mode	@ltx/en_us_dedes/miscellanea:misc.Mode4
ltx/en_us_dedes/me.m04.d20:meMA.Ode9C12.ode	@ltx/en_us_dedes/miscellanea:misc.Ode9
ltx/en_us_dedes/me.m04.d20:meMA.Ode9C12.text	
ltx/en_us_dedes/me.m04.d20:meMA.Ode9C13.incipit	…
ltx/en_us_dedes/me.m04.d20:meMA.Ode9C13.melody	@ltx/en_us_dedes/he.h.m4:heHE.LithosAcheirotmitos.name
ltx/en_us_dedes/me.m04.d20:meMA.Ode9C13.mode	@ltx/en_us_dedes/miscellanea:misc.Mode4
ltx/en_us_dedes/me.m04.d20:meMA.Ode9C13.ode	@ltx/en_us_dedes/miscellanea:misc.Ode9
ltx/en_us_dedes/me.m04.d20:meMA.Ode9C13.text	
ltx/en_us_dedes/me.m04.d20:meMA.Ode9C1H.greekmelody	@ltx/en_us_dedes/he.h.m4:heHE.LithosAcheirotmitos.greekname
ltx/en_us_dedes/me.m04.d20:meMA.Ode9C1H.incipit	@ltx/en_us_dedes/he.h.m4:heHE.LithosAcheirotmitos.incipit
ltx/en_us_dedes/me.m04.d20:meMA.Ode9C1H.melody	@ltx/en_us_dedes/he.h.m4:heHE.LithosAcheirotmitos.melody
ltx/en_us_dedes/me.m04.d20:meMA.Ode9C1H.mode	@ltx/en_us_dedes/miscellanea:misc.Mode4
ltx/en_us_dedes/me.m04.d20:meMA.Ode9C1H.ode	@ltx/en_us_dedes/miscellanea:misc.Ode9
ltx/en_us_dedes/me.m04.d20:meMA.Ode9C1H.text	@ltx/en_us_dedes/he.h.m4:heHE.LithosAcheirotmitos.text
ltx/en_us_dedes/me.m04.d20:meMA.Ode9C1T.incipit	…
ltx/en_us_dedes/me.m04.d20:meMA.Ode9C1T.melody	@ltx/en_us_dedes/he.h.m4:heHE.LithosAcheirotmitos.name
ltx/en_us_dedes/me.m04.d20:meMA.Ode9C1T.mode	@ltx/en_us_dedes/miscellanea:misc.Mode4
ltx/en_us_dedes/me.m04.d20:meMA.Ode9C1T.ode	@ltx/en_us_dedes/miscellanea:misc.Ode9
ltx/en_us_dedes/me.m04.d20:meMA.Ode9C1T.text	
ltx/en_us_dedes/me.m04.d20:meVE.Apolytikion1ger.greekmelody	@ltx/en_us_dedes/he.a.m3:heAU.TheiasPisteos.greekname
ltx/en_us_dedes/me.m04.d20:meVE.Apolytikion1ger.incipit	…
ltx/en_us_dedes/me.m04.d20:meVE.Apolytikion1ger.melody	@ltx/en_us_dedes/he.a.m3:heAU.TheiasPisteos.name
ltx/en_us_dedes/me.m04.d20:meVE.Apolytikion1ger.mode	@ltx/en_us_dedes/miscellanea:misc.Mode3
ltx/en_us_dedes/me.m04.d20:meVE.Apolytikion1ger.poet	@ltx/en_us_dedes/poets:po.Gerasimou
ltx/en_us_dedes/me.m04.d20:meVE.Apolytikion1ger.text	
ltx/en_us_dedes/me.m04.d20:meVE.SticStavrotheotokion.greekmelody	@ltx/en_us_dedes/he.a.m8:heAU.OTouParadoxou.greekname
ltx/en_us_dedes/me.m04.d20:meVE.SticStavrotheotokion.incipit	@ltx/en_us_dedes/me.m04.d02:meVE.SticStavrotheotokion.incipit
ltx/en_us_dedes/me.m04.d20:meVE.SticStavrotheotokion.melody	@ltx/en_us_dedes/he.a.m8:heAU.OTouParadoxou.name
ltx/en_us_dedes/me.m04.d20:meVE.SticStavrotheotokion.mode	@ltx/en_us_dedes/miscellanea:misc.Mode8
ltx/en_us_dedes/me.m04.d20:meVE.SticStavrotheotokion.text	@ltx/en_us_dedes/me.m04.d02:meVE.SticStavrotheotokion.text
ltx/en_us_dedes/me.m04.d20:meVE.SticTheotokion.greekmelody	@ltx/en_us_dedes/he.a.m8:heAU.OTouParadoxou.greekname
ltx/en_us_dedes/me.m04.d20:meVE.SticTheotokion.incipit	@ltx/en_us_dedes/me.m04.d02:meVE.SticTheotokion.incipit
ltx/en_us_dedes/me.m04.d20:meVE.SticTheotokion.melody	@ltx/en_us_dedes/he.a.m8:heAU.OTouParadoxou.name
ltx/en_us_dedes/me.m04.d20:meVE.SticTheotokion.mode	@ltx/en_us_dedes/miscellanea:misc.Mode8
ltx/en_us_dedes/me.m04.d20:meVE.SticTheotokion.text	@ltx/en_us_dedes/me.m04.d02:meVE.SticTheotokion.text
ltx/en_us_dedes/me.m04.d20:meVE.Stichera01.greekmelody	@ltx/en_us_dedes/he.a.m8:heAU.OTouParadoxou.greekname
ltx/en_us_dedes/me.m04.d20:meVE.Stichera01.incipit	…
ltx/en_us_dedes/me.m04.d20:meVE.Stichera01.melody	@ltx/en_us_dedes/he.a.m8:heAU.OTouParadoxou.name
ltx/en_us_dedes/me.m04.d20:meVE.Stichera01.mode	@ltx/en_us_dedes/miscellanea:misc.Mode8
ltx/en_us_dedes/me.m04.d20:meVE.Stichera01.text	
ltx/en_us_dedes/me.m04.d20:meVE.Stichera02.incipit	…
ltx/en_us_dedes/me.m04.d20:meVE.Stichera02.melody	@ltx/en_us_dedes/he.a.m8:heAU.OTouParadoxou.name
ltx/en_us_dedes/me.m04.d20:meVE.Stichera02.mode	@ltx/en_us_dedes/miscellanea:misc.Mode8
ltx/en_us_dedes/me.m04.d20:meVE.Stichera02.text	
ltx/en_us_dedes/me.m04.d20:meVE.Stichera03.incipit	…
ltx/en_us_dedes/me.m04.d20:meVE.Stichera03.melody	@ltx/en_us_dedes/he.a.m8:heAU.OTouParadoxou.name
ltx/en_us_dedes/me.m04.d20:meVE.Stichera03.mode	@ltx/en_us_dedes/miscellanea:misc.Mode8
ltx/en_us_dedes/me.m04.d20:meVE.Stichera03.text	
