ltx/en_us_dedes/me.m09.d04:meDA.commemoration.first	Memory of the Holy Hieromartyr Babylas, Bishop of Antioch
ltx/en_us_dedes/me.m09.d04:meDA.commemoration.first_name	
ltx/en_us_dedes/me.m09.d04:meDA.commemoration.first_short	Memory of the Holy Hieromartyr Babylas, Bishop of Antioch
ltx/en_us_dedes/me.m09.d04:meDA.commemoration.first_title	@ltx/en_us_dedes/titles:ti.SaintM
ltx/en_us_dedes/me.m09.d04:meDA.commemoration.full	Memory of the Holy Hieromartyr Babylas, Bishop of Antioch; and the Holy Prophet and God-seer Moses.
ltx/en_us_dedes/me.m09.d04:meDA.commemoration.second_name	
ltx/en_us_dedes/me.m09.d04:meDA.commemoration.second_title	
ltx/en_us_dedes/me.m09.d04:meDA.date	September 4
ltx/en_us_dedes/me.m09.d04:meDA.fordate	for September 4
ltx/en_us_dedes/me.m09.d04:meDA.insert1	and the holy hieromartyr Babylas,
ltx/en_us_dedes/me.m09.d04:meDA.insert2	whose memory we observe,
ltx/en_us_dedes/me.m09.d04:meDA.note	
ltx/en_us_dedes/me.m09.d04:meDA.pdfcoverdate	September 4,
ltx/en_us_dedes/me.m09.d04:meDA.pdfheaderdate	September 4
ltx/en_us_dedes/me.m09.d04:meHO.commemorations	
ltx/en_us_dedes/me.m09.d04:meHO.note1	
ltx/en_us_dedes/me.m09.d04:meHO.note2	
ltx/en_us_dedes/me.m09.d04:meHO.number	
ltx/en_us_dedes/me.m09.d04:meHO.rank	
ltx/en_us_dedes/me.m09.d04:meLE.commemoration1	The Holy Hieromartyr Babylas, Bishop of Antioch; and the Holy Prophet Moses.
ltx/en_us_dedes/me.m09.d04:meLE.commemoration2	
ltx/en_us_dedes/me.m09.d04:meLI.Kontakion1.greekmelody	@ltx/en_us_dedes/me.m09.d04:meMA.Kontakion1.greekmelody
ltx/en_us_dedes/me.m09.d04:meLI.Kontakion1.incipit	@ltx/en_us_dedes/me.m09.d04:meMA.Kontakion1.incipit
ltx/en_us_dedes/me.m09.d04:meLI.Kontakion1.melody	@ltx/en_us_dedes/me.m09.d04:meMA.Kontakion1.melody
ltx/en_us_dedes/me.m09.d04:meLI.Kontakion1.mode	@ltx/en_us_dedes/me.m09.d04:meMA.Kontakion1.mode
ltx/en_us_dedes/me.m09.d04:meLI.Kontakion1.text	@ltx/en_us_dedes/me.m09.d04:meMA.Kontakion1.text
ltx/en_us_dedes/me.m09.d04:meLI.MM.CommunionHymn.text	@ltx/en_us_dedes/properties:media.key
ltx/en_us_dedes/me.m09.d04:meLI.Megalynarion.text	
ltx/en_us_dedes/me.m09.d04:meMA.C1.poet	
ltx/en_us_dedes/me.m09.d04:meMA.C1.title	@ltx/en_us_dedes/titles:ti.CanonHieromartyr
ltx/en_us_dedes/me.m09.d04:meMA.C1.verse	@ltx/en_us_dedes/prayers:pr.verse_SaintM.text
ltx/en_us_dedes/me.m09.d04:meMA.C2.acrostic.notice1	
ltx/en_us_dedes/me.m09.d04:meMA.C2.acrostic.notice2	
ltx/en_us_dedes/me.m09.d04:meMA.C2.acrostic.text	
ltx/en_us_dedes/me.m09.d04:meMA.C2.acrostic.title	
ltx/en_us_dedes/me.m09.d04:meMA.C2.title	@ltx/en_us_dedes/titles:ti.CanonProphet
ltx/en_us_dedes/me.m09.d04:meMA.C2.verse	@ltx/en_us_dedes/prayers:pr.verse_Prophet.text
ltx/en_us_dedes/me.m09.d04:meMA.ExapTheotokion.incipit	O Virgin, strike down all…
ltx/en_us_dedes/me.m09.d04:meMA.ExapTheotokion.melody	@ltx/en_us_dedes/he.a.m3:heAU.OOuranonToisAstrois.name
ltx/en_us_dedes/me.m09.d04:meMA.ExapTheotokion.mode	@ltx/en_us_dedes/miscellanea:misc.Mode3
ltx/en_us_dedes/me.m09.d04:meMA.ExapTheotokion.text	O Virgin, strike down all those * who fail to salute your icon * and that of your Son and God as well * sincerely and with correct faith; * and also, since they are godless, * deliver them to Gehenna.
ltx/en_us_dedes/me.m09.d04:meMA.Exaposteilarion1.greekmelody	@ltx/en_us_dedes/he.a.m3:heAU.OOuranonToisAstrois.greekname
ltx/en_us_dedes/me.m09.d04:meMA.Exaposteilarion1.incipit	You were God’s priest and…
ltx/en_us_dedes/me.m09.d04:meMA.Exaposteilarion1.melody	@ltx/en_us_dedes/he.a.m3:heAU.OOuranonToisAstrois.name
ltx/en_us_dedes/me.m09.d04:meMA.Exaposteilarion1.mode	@ltx/en_us_dedes/miscellanea:misc.Mode3
ltx/en_us_dedes/me.m09.d04:meMA.Exaposteilarion1.text	You were God’s priest and victim, * O Hieromartyr Babylas; * you served the bloodless oblation,* and with your blood were offered up, * along with the perfect infants. * We praise you and them together.
ltx/en_us_dedes/me.m09.d04:meMA.Kontakion1.greekmelody	@ltx/en_us_dedes/he.a.m8:heAU.OsAparchas.greekname
ltx/en_us_dedes/me.m09.d04:meMA.Kontakion1.incipit	The Church is shining brilliantly…
ltx/en_us_dedes/me.m09.d04:meMA.Kontakion1.melody	@ltx/en_us_dedes/he.a.m8:heAU.OsAparchas.notmetered
ltx/en_us_dedes/me.m09.d04:meMA.Kontakion1.mode	@ltx/en_us_dedes/miscellanea:misc.Mode8
ltx/en_us_dedes/me.m09.d04:meMA.Kontakion1.text	The Church is shining brilliantly today as she glorifies you, the preacher of the true faith and the support of martyr athletes. Since you have confidence in prayer, we who extol you ask you to implore Christ, to preserve us in perfect peace, O glorious Martyr who suffered much.
ltx/en_us_dedes/me.m09.d04:meMA.Ode1C11.greekmelody	@ltx/en_us_dedes/he.h.m6:heHE.OsEnIpeiroPezefsas.greekname
ltx/en_us_dedes/me.m09.d04:meMA.Ode1C11.incipit	…
ltx/en_us_dedes/me.m09.d04:meMA.Ode1C11.melody	@ltx/en_us_dedes/he.h.m6:heHE.OsEnIpeiroPezefsas.name
ltx/en_us_dedes/me.m09.d04:meMA.Ode1C11.mode	@ltx/en_us_dedes/miscellanea:misc.Mode6
ltx/en_us_dedes/me.m09.d04:meMA.Ode1C11.ode	@ltx/en_us_dedes/miscellanea:misc.Ode1
ltx/en_us_dedes/me.m09.d04:meMA.Ode1C11.text	
ltx/en_us_dedes/me.m09.d04:meMA.Ode1C12.incipit	…
ltx/en_us_dedes/me.m09.d04:meMA.Ode1C12.melody	@ltx/en_us_dedes/he.h.m6:heHE.OsEnIpeiroPezefsas.name
ltx/en_us_dedes/me.m09.d04:meMA.Ode1C12.mode	@ltx/en_us_dedes/miscellanea:misc.Mode6
ltx/en_us_dedes/me.m09.d04:meMA.Ode1C12.ode	@ltx/en_us_dedes/miscellanea:misc.Ode1
ltx/en_us_dedes/me.m09.d04:meMA.Ode1C12.text	
ltx/en_us_dedes/me.m09.d04:meMA.Ode1C13.incipit	…
ltx/en_us_dedes/me.m09.d04:meMA.Ode1C13.melody	@ltx/en_us_dedes/he.h.m6:heHE.OsEnIpeiroPezefsas.name
ltx/en_us_dedes/me.m09.d04:meMA.Ode1C13.mode	@ltx/en_us_dedes/miscellanea:misc.Mode6
ltx/en_us_dedes/me.m09.d04:meMA.Ode1C13.ode	@ltx/en_us_dedes/miscellanea:misc.Ode1
ltx/en_us_dedes/me.m09.d04:meMA.Ode1C13.text	
ltx/en_us_dedes/me.m09.d04:meMA.Ode1C1T.incipit	…
ltx/en_us_dedes/me.m09.d04:meMA.Ode1C1T.melody	@ltx/en_us_dedes/he.h.m6:heHE.OsEnIpeiroPezefsas.name
ltx/en_us_dedes/me.m09.d04:meMA.Ode1C1T.mode	@ltx/en_us_dedes/miscellanea:misc.Mode6
ltx/en_us_dedes/me.m09.d04:meMA.Ode1C1T.ode	@ltx/en_us_dedes/miscellanea:misc.Ode1
ltx/en_us_dedes/me.m09.d04:meMA.Ode1C1T.text	
ltx/en_us_dedes/me.m09.d04:meMA.Ode1C21.greekmelody	@ltx/en_us_dedes/he.h.m4:heHE.ThalassisToErythraion.greekname
ltx/en_us_dedes/me.m09.d04:meMA.Ode1C21.incipit	…
ltx/en_us_dedes/me.m09.d04:meMA.Ode1C21.melody	@ltx/en_us_dedes/he.h.m4:heHE.ThalassisToErythraion.name
ltx/en_us_dedes/me.m09.d04:meMA.Ode1C21.mode	@ltx/en_us_dedes/miscellanea:misc.Mode4
ltx/en_us_dedes/me.m09.d04:meMA.Ode1C21.ode	@ltx/en_us_dedes/miscellanea:misc.Ode1
ltx/en_us_dedes/me.m09.d04:meMA.Ode1C21.text	
ltx/en_us_dedes/me.m09.d04:meMA.Ode1C22.incipit	…
ltx/en_us_dedes/me.m09.d04:meMA.Ode1C22.melody	@ltx/en_us_dedes/he.h.m4:heHE.ThalassisToErythraion.name
ltx/en_us_dedes/me.m09.d04:meMA.Ode1C22.mode	@ltx/en_us_dedes/miscellanea:misc.Mode4
ltx/en_us_dedes/me.m09.d04:meMA.Ode1C22.ode	@ltx/en_us_dedes/miscellanea:misc.Ode1
ltx/en_us_dedes/me.m09.d04:meMA.Ode1C22.text	
ltx/en_us_dedes/me.m09.d04:meMA.Ode1C23.incipit	…
ltx/en_us_dedes/me.m09.d04:meMA.Ode1C23.melody	@ltx/en_us_dedes/he.h.m4:heHE.ThalassisToErythraion.name
ltx/en_us_dedes/me.m09.d04:meMA.Ode1C23.mode	@ltx/en_us_dedes/miscellanea:misc.Mode4
ltx/en_us_dedes/me.m09.d04:meMA.Ode1C23.ode	@ltx/en_us_dedes/miscellanea:misc.Ode1
ltx/en_us_dedes/me.m09.d04:meMA.Ode1C23.text	
ltx/en_us_dedes/me.m09.d04:meMA.Ode1C24.incipit	…
ltx/en_us_dedes/me.m09.d04:meMA.Ode1C24.melody	@ltx/en_us_dedes/he.h.m4:heHE.ThalassisToErythraion.name
ltx/en_us_dedes/me.m09.d04:meMA.Ode1C24.mode	@ltx/en_us_dedes/miscellanea:misc.Mode4
ltx/en_us_dedes/me.m09.d04:meMA.Ode1C24.ode	@ltx/en_us_dedes/miscellanea:misc.Ode1
ltx/en_us_dedes/me.m09.d04:meMA.Ode1C24.text	
ltx/en_us_dedes/me.m09.d04:meMA.Ode1C2T.incipit	…
ltx/en_us_dedes/me.m09.d04:meMA.Ode1C2T.melody	@ltx/en_us_dedes/he.h.m4:heHE.ThalassisToErythraion.name
ltx/en_us_dedes/me.m09.d04:meMA.Ode1C2T.mode	@ltx/en_us_dedes/miscellanea:misc.Mode4
ltx/en_us_dedes/me.m09.d04:meMA.Ode1C2T.ode	@ltx/en_us_dedes/miscellanea:misc.Ode1
ltx/en_us_dedes/me.m09.d04:meMA.Ode1C2T.text	
ltx/en_us_dedes/me.m09.d04:meMA.Ode3C11.greekmelody	@ltx/en_us_dedes/he.h.m6:heHE.OukEstinAgios.greekname
ltx/en_us_dedes/me.m09.d04:meMA.Ode3C11.incipit	…
ltx/en_us_dedes/me.m09.d04:meMA.Ode3C11.melody	@ltx/en_us_dedes/he.h.m6:heHE.OukEstinAgios.name
ltx/en_us_dedes/me.m09.d04:meMA.Ode3C11.mode	@ltx/en_us_dedes/miscellanea:misc.Mode6
ltx/en_us_dedes/me.m09.d04:meMA.Ode3C11.ode	@ltx/en_us_dedes/miscellanea:misc.Ode3
ltx/en_us_dedes/me.m09.d04:meMA.Ode3C11.text	
ltx/en_us_dedes/me.m09.d04:meMA.Ode3C12.incipit	…
ltx/en_us_dedes/me.m09.d04:meMA.Ode3C12.melody	@ltx/en_us_dedes/he.h.m6:heHE.OukEstinAgios.name
ltx/en_us_dedes/me.m09.d04:meMA.Ode3C12.mode	@ltx/en_us_dedes/miscellanea:misc.Mode6
ltx/en_us_dedes/me.m09.d04:meMA.Ode3C12.ode	@ltx/en_us_dedes/miscellanea:misc.Ode3
ltx/en_us_dedes/me.m09.d04:meMA.Ode3C12.text	
ltx/en_us_dedes/me.m09.d04:meMA.Ode3C13.incipit	…
ltx/en_us_dedes/me.m09.d04:meMA.Ode3C13.melody	@ltx/en_us_dedes/he.h.m6:heHE.OukEstinAgios.name
ltx/en_us_dedes/me.m09.d04:meMA.Ode3C13.mode	@ltx/en_us_dedes/miscellanea:misc.Mode6
ltx/en_us_dedes/me.m09.d04:meMA.Ode3C13.ode	@ltx/en_us_dedes/miscellanea:misc.Ode3
ltx/en_us_dedes/me.m09.d04:meMA.Ode3C13.text	
ltx/en_us_dedes/me.m09.d04:meMA.Ode3C1T.incipit	…
ltx/en_us_dedes/me.m09.d04:meMA.Ode3C1T.melody	@ltx/en_us_dedes/he.h.m6:heHE.OukEstinAgios.name
ltx/en_us_dedes/me.m09.d04:meMA.Ode3C1T.mode	@ltx/en_us_dedes/miscellanea:misc.Mode6
ltx/en_us_dedes/me.m09.d04:meMA.Ode3C1T.ode	@ltx/en_us_dedes/miscellanea:misc.Ode3
ltx/en_us_dedes/me.m09.d04:meMA.Ode3C1T.text	
ltx/en_us_dedes/me.m09.d04:meMA.Ode3C21.greekmelody	@ltx/en_us_dedes/he.h.m4:heHE.ToxonDynatonIsthenise.greekname
ltx/en_us_dedes/me.m09.d04:meMA.Ode3C21.incipit	…
ltx/en_us_dedes/me.m09.d04:meMA.Ode3C21.melody	@ltx/en_us_dedes/he.h.m4:heHE.ToxonDynatonIsthenise.name
ltx/en_us_dedes/me.m09.d04:meMA.Ode3C21.mode	@ltx/en_us_dedes/miscellanea:misc.Mode4
ltx/en_us_dedes/me.m09.d04:meMA.Ode3C21.ode	@ltx/en_us_dedes/miscellanea:misc.Ode3
ltx/en_us_dedes/me.m09.d04:meMA.Ode3C21.text	
ltx/en_us_dedes/me.m09.d04:meMA.Ode3C22.incipit	…
ltx/en_us_dedes/me.m09.d04:meMA.Ode3C22.melody	@ltx/en_us_dedes/he.h.m4:heHE.ToxonDynatonIsthenise.name
ltx/en_us_dedes/me.m09.d04:meMA.Ode3C22.mode	@ltx/en_us_dedes/miscellanea:misc.Mode4
ltx/en_us_dedes/me.m09.d04:meMA.Ode3C22.ode	@ltx/en_us_dedes/miscellanea:misc.Ode3
ltx/en_us_dedes/me.m09.d04:meMA.Ode3C22.text	
ltx/en_us_dedes/me.m09.d04:meMA.Ode3C23.incipit	…
ltx/en_us_dedes/me.m09.d04:meMA.Ode3C23.melody	@ltx/en_us_dedes/he.h.m4:heHE.ToxonDynatonIsthenise.name
ltx/en_us_dedes/me.m09.d04:meMA.Ode3C23.mode	@ltx/en_us_dedes/miscellanea:misc.Mode4
ltx/en_us_dedes/me.m09.d04:meMA.Ode3C23.ode	@ltx/en_us_dedes/miscellanea:misc.Ode3
ltx/en_us_dedes/me.m09.d04:meMA.Ode3C23.text	
ltx/en_us_dedes/me.m09.d04:meMA.Ode3C2T.incipit	…
ltx/en_us_dedes/me.m09.d04:meMA.Ode3C2T.melody	@ltx/en_us_dedes/he.h.m4:heHE.ToxonDynatonIsthenise.name
ltx/en_us_dedes/me.m09.d04:meMA.Ode3C2T.mode	@ltx/en_us_dedes/miscellanea:misc.Mode4
ltx/en_us_dedes/me.m09.d04:meMA.Ode3C2T.ode	@ltx/en_us_dedes/miscellanea:misc.Ode3
ltx/en_us_dedes/me.m09.d04:meMA.Ode3C2T.text	
ltx/en_us_dedes/me.m09.d04:meMA.Ode3H.greekmelody	@ltx/en_us_dedes/he.h.m4:heHE.ToxonDynatonIsthenise.greekname
ltx/en_us_dedes/me.m09.d04:meMA.Ode3H.incipit	@ltx/en_us_dedes/he.h.m4:heHE.ToxonDynatonIsthenise.incipit
ltx/en_us_dedes/me.m09.d04:meMA.Ode3H.melody	@ltx/en_us_dedes/he.h.m4:heHE.ToxonDynatonIsthenise.melody
ltx/en_us_dedes/me.m09.d04:meMA.Ode3H.mode	@ltx/en_us_dedes/miscellanea:misc.Mode4
ltx/en_us_dedes/me.m09.d04:meMA.Ode3H.ode	@ltx/en_us_dedes/miscellanea:misc.Ode3
ltx/en_us_dedes/me.m09.d04:meMA.Ode3H.text	@ltx/en_us_dedes/he.h.m4:heHE.ToxonDynatonIsthenise.text
ltx/en_us_dedes/me.m09.d04:meMA.Ode3Kathisma1.greekmelody	@ltx/en_us_dedes/he.a.m3:heAU.TheiasPisteos.greekname
ltx/en_us_dedes/me.m09.d04:meMA.Ode3Kathisma1.incipit	…
ltx/en_us_dedes/me.m09.d04:meMA.Ode3Kathisma1.melody	@ltx/en_us_dedes/he.a.m3:heAU.TheiasPisteos.name
ltx/en_us_dedes/me.m09.d04:meMA.Ode3Kathisma1.mode	@ltx/en_us_dedes/miscellanea:misc.Mode3
ltx/en_us_dedes/me.m09.d04:meMA.Ode3Kathisma1.text	
ltx/en_us_dedes/me.m09.d04:meMA.Ode3Kathisma2.greekmelody	@ltx/en_us_dedes/he.a.m4:heAU.EpefanisSimeron.greekname
ltx/en_us_dedes/me.m09.d04:meMA.Ode3Kathisma2.incipit	…
ltx/en_us_dedes/me.m09.d04:meMA.Ode3Kathisma2.melody	@ltx/en_us_dedes/he.a.m4:heAU.EpefanisSimeron.name
ltx/en_us_dedes/me.m09.d04:meMA.Ode3Kathisma2.mode	@ltx/en_us_dedes/miscellanea:misc.Mode4
ltx/en_us_dedes/me.m09.d04:meMA.Ode3Kathisma2.text	
ltx/en_us_dedes/me.m09.d04:meMA.Ode3KathismaSt.incipit	…
ltx/en_us_dedes/me.m09.d04:meMA.Ode3KathismaSt.melody	@ltx/en_us_dedes/he.a.m4:heAU.EpefanisSimeron.name
ltx/en_us_dedes/me.m09.d04:meMA.Ode3KathismaSt.mode	@ltx/en_us_dedes/miscellanea:misc.Mode4
ltx/en_us_dedes/me.m09.d04:meMA.Ode3KathismaSt.text	
ltx/en_us_dedes/me.m09.d04:meMA.Ode3KathismaT.incipit	…
ltx/en_us_dedes/me.m09.d04:meMA.Ode3KathismaT.melody	@ltx/en_us_dedes/he.a.m4:heAU.EpefanisSimeron.name
ltx/en_us_dedes/me.m09.d04:meMA.Ode3KathismaT.mode	@ltx/en_us_dedes/miscellanea:misc.Mode4
ltx/en_us_dedes/me.m09.d04:meMA.Ode3KathismaT.text	
ltx/en_us_dedes/me.m09.d04:meMA.Ode4C11.greekmelody	@ltx/en_us_dedes/he.h.m6:heHE.ChristosMouDynamis.greekname
ltx/en_us_dedes/me.m09.d04:meMA.Ode4C11.incipit	…
ltx/en_us_dedes/me.m09.d04:meMA.Ode4C11.melody	@ltx/en_us_dedes/he.h.m6:heHE.ChristosMouDynamis.name
ltx/en_us_dedes/me.m09.d04:meMA.Ode4C11.mode	@ltx/en_us_dedes/miscellanea:misc.Mode6
ltx/en_us_dedes/me.m09.d04:meMA.Ode4C11.ode	@ltx/en_us_dedes/miscellanea:misc.Ode4
ltx/en_us_dedes/me.m09.d04:meMA.Ode4C11.text	
ltx/en_us_dedes/me.m09.d04:meMA.Ode4C12.incipit	…
ltx/en_us_dedes/me.m09.d04:meMA.Ode4C12.melody	@ltx/en_us_dedes/he.h.m6:heHE.ChristosMouDynamis.name
ltx/en_us_dedes/me.m09.d04:meMA.Ode4C12.mode	@ltx/en_us_dedes/miscellanea:misc.Mode6
ltx/en_us_dedes/me.m09.d04:meMA.Ode4C12.ode	@ltx/en_us_dedes/miscellanea:misc.Ode4
ltx/en_us_dedes/me.m09.d04:meMA.Ode4C12.text	
ltx/en_us_dedes/me.m09.d04:meMA.Ode4C13.incipit	…
ltx/en_us_dedes/me.m09.d04:meMA.Ode4C13.melody	@ltx/en_us_dedes/he.h.m6:heHE.ChristosMouDynamis.name
ltx/en_us_dedes/me.m09.d04:meMA.Ode4C13.mode	@ltx/en_us_dedes/miscellanea:misc.Mode6
ltx/en_us_dedes/me.m09.d04:meMA.Ode4C13.ode	@ltx/en_us_dedes/miscellanea:misc.Ode4
ltx/en_us_dedes/me.m09.d04:meMA.Ode4C13.text	
ltx/en_us_dedes/me.m09.d04:meMA.Ode4C1T.incipit	…
ltx/en_us_dedes/me.m09.d04:meMA.Ode4C1T.melody	@ltx/en_us_dedes/he.h.m6:heHE.ChristosMouDynamis.name
ltx/en_us_dedes/me.m09.d04:meMA.Ode4C1T.mode	@ltx/en_us_dedes/miscellanea:misc.Mode6
ltx/en_us_dedes/me.m09.d04:meMA.Ode4C1T.ode	@ltx/en_us_dedes/miscellanea:misc.Ode4
ltx/en_us_dedes/me.m09.d04:meMA.Ode4C1T.text	
ltx/en_us_dedes/me.m09.d04:meMA.Ode4C21.greekmelody	@ltx/en_us_dedes/he.h.m4:heHE.EparthentaSeIdousa.greekname
ltx/en_us_dedes/me.m09.d04:meMA.Ode4C21.incipit	…
ltx/en_us_dedes/me.m09.d04:meMA.Ode4C21.melody	@ltx/en_us_dedes/he.h.m4:heHE.EparthentaSeIdousa.name
ltx/en_us_dedes/me.m09.d04:meMA.Ode4C21.mode	@ltx/en_us_dedes/miscellanea:misc.Mode4
ltx/en_us_dedes/me.m09.d04:meMA.Ode4C21.ode	@ltx/en_us_dedes/miscellanea:misc.Ode4
ltx/en_us_dedes/me.m09.d04:meMA.Ode4C21.text	
ltx/en_us_dedes/me.m09.d04:meMA.Ode4C22.incipit	…
ltx/en_us_dedes/me.m09.d04:meMA.Ode4C22.melody	@ltx/en_us_dedes/he.h.m4:heHE.EparthentaSeIdousa.name
ltx/en_us_dedes/me.m09.d04:meMA.Ode4C22.mode	@ltx/en_us_dedes/miscellanea:misc.Mode4
ltx/en_us_dedes/me.m09.d04:meMA.Ode4C22.ode	@ltx/en_us_dedes/miscellanea:misc.Ode4
ltx/en_us_dedes/me.m09.d04:meMA.Ode4C22.text	
ltx/en_us_dedes/me.m09.d04:meMA.Ode4C23.incipit	…
ltx/en_us_dedes/me.m09.d04:meMA.Ode4C23.melody	@ltx/en_us_dedes/he.h.m4:heHE.EparthentaSeIdousa.name
ltx/en_us_dedes/me.m09.d04:meMA.Ode4C23.mode	@ltx/en_us_dedes/miscellanea:misc.Mode4
ltx/en_us_dedes/me.m09.d04:meMA.Ode4C23.ode	@ltx/en_us_dedes/miscellanea:misc.Ode4
ltx/en_us_dedes/me.m09.d04:meMA.Ode4C23.text	
ltx/en_us_dedes/me.m09.d04:meMA.Ode4C24.incipit	…
ltx/en_us_dedes/me.m09.d04:meMA.Ode4C24.melody	@ltx/en_us_dedes/he.h.m4:heHE.EparthentaSeIdousa.name
ltx/en_us_dedes/me.m09.d04:meMA.Ode4C24.mode	@ltx/en_us_dedes/miscellanea:misc.Mode4
ltx/en_us_dedes/me.m09.d04:meMA.Ode4C24.ode	@ltx/en_us_dedes/miscellanea:misc.Ode4
ltx/en_us_dedes/me.m09.d04:meMA.Ode4C24.text	
ltx/en_us_dedes/me.m09.d04:meMA.Ode4C2T.incipit	…
ltx/en_us_dedes/me.m09.d04:meMA.Ode4C2T.melody	@ltx/en_us_dedes/he.h.m4:heHE.EparthentaSeIdousa.name
ltx/en_us_dedes/me.m09.d04:meMA.Ode4C2T.mode	@ltx/en_us_dedes/miscellanea:misc.Mode4
ltx/en_us_dedes/me.m09.d04:meMA.Ode4C2T.ode	@ltx/en_us_dedes/miscellanea:misc.Ode4
ltx/en_us_dedes/me.m09.d04:meMA.Ode4C2T.text	
ltx/en_us_dedes/me.m09.d04:meMA.Ode5C11.greekmelody	@ltx/en_us_dedes/he.h.m6:heHE.ToTheioFengeiSou.greekname
ltx/en_us_dedes/me.m09.d04:meMA.Ode5C11.incipit	…
ltx/en_us_dedes/me.m09.d04:meMA.Ode5C11.melody	@ltx/en_us_dedes/he.h.m6:heHE.ToTheioFengeiSou.name
ltx/en_us_dedes/me.m09.d04:meMA.Ode5C11.mode	@ltx/en_us_dedes/miscellanea:misc.Mode6
ltx/en_us_dedes/me.m09.d04:meMA.Ode5C11.ode	@ltx/en_us_dedes/miscellanea:misc.Ode5
ltx/en_us_dedes/me.m09.d04:meMA.Ode5C11.text	
ltx/en_us_dedes/me.m09.d04:meMA.Ode5C12.incipit	…
ltx/en_us_dedes/me.m09.d04:meMA.Ode5C12.melody	@ltx/en_us_dedes/he.h.m6:heHE.ToTheioFengeiSou.name
ltx/en_us_dedes/me.m09.d04:meMA.Ode5C12.mode	@ltx/en_us_dedes/miscellanea:misc.Mode6
ltx/en_us_dedes/me.m09.d04:meMA.Ode5C12.ode	@ltx/en_us_dedes/miscellanea:misc.Ode5
ltx/en_us_dedes/me.m09.d04:meMA.Ode5C12.text	
ltx/en_us_dedes/me.m09.d04:meMA.Ode5C13.incipit	…
ltx/en_us_dedes/me.m09.d04:meMA.Ode5C13.melody	@ltx/en_us_dedes/he.h.m6:heHE.ToTheioFengeiSou.name
ltx/en_us_dedes/me.m09.d04:meMA.Ode5C13.mode	@ltx/en_us_dedes/miscellanea:misc.Mode6
ltx/en_us_dedes/me.m09.d04:meMA.Ode5C13.ode	@ltx/en_us_dedes/miscellanea:misc.Ode5
ltx/en_us_dedes/me.m09.d04:meMA.Ode5C13.text	
ltx/en_us_dedes/me.m09.d04:meMA.Ode5C1T.incipit	…
ltx/en_us_dedes/me.m09.d04:meMA.Ode5C1T.melody	@ltx/en_us_dedes/he.h.m6:heHE.ToTheioFengeiSou.name
ltx/en_us_dedes/me.m09.d04:meMA.Ode5C1T.mode	@ltx/en_us_dedes/miscellanea:misc.Mode6
ltx/en_us_dedes/me.m09.d04:meMA.Ode5C1T.ode	@ltx/en_us_dedes/miscellanea:misc.Ode5
ltx/en_us_dedes/me.m09.d04:meMA.Ode5C1T.text	
ltx/en_us_dedes/me.m09.d04:meMA.Ode5C21.greekmelody	@ltx/en_us_dedes/he.h.m4:heHE.SyKyrieMouFos.greekname
ltx/en_us_dedes/me.m09.d04:meMA.Ode5C21.incipit	…
ltx/en_us_dedes/me.m09.d04:meMA.Ode5C21.melody	@ltx/en_us_dedes/he.h.m4:heHE.SyKyrieMouFos.name
ltx/en_us_dedes/me.m09.d04:meMA.Ode5C21.mode	@ltx/en_us_dedes/miscellanea:misc.Mode4
ltx/en_us_dedes/me.m09.d04:meMA.Ode5C21.ode	@ltx/en_us_dedes/miscellanea:misc.Ode5
ltx/en_us_dedes/me.m09.d04:meMA.Ode5C21.text	
ltx/en_us_dedes/me.m09.d04:meMA.Ode5C22.incipit	…
ltx/en_us_dedes/me.m09.d04:meMA.Ode5C22.melody	@ltx/en_us_dedes/he.h.m4:heHE.SyKyrieMouFos.name
ltx/en_us_dedes/me.m09.d04:meMA.Ode5C22.mode	@ltx/en_us_dedes/miscellanea:misc.Mode4
ltx/en_us_dedes/me.m09.d04:meMA.Ode5C22.ode	@ltx/en_us_dedes/miscellanea:misc.Ode5
ltx/en_us_dedes/me.m09.d04:meMA.Ode5C22.text	
ltx/en_us_dedes/me.m09.d04:meMA.Ode5C23.incipit	…
ltx/en_us_dedes/me.m09.d04:meMA.Ode5C23.melody	@ltx/en_us_dedes/he.h.m4:heHE.SyKyrieMouFos.name
ltx/en_us_dedes/me.m09.d04:meMA.Ode5C23.mode	@ltx/en_us_dedes/miscellanea:misc.Mode4
ltx/en_us_dedes/me.m09.d04:meMA.Ode5C23.ode	@ltx/en_us_dedes/miscellanea:misc.Ode5
ltx/en_us_dedes/me.m09.d04:meMA.Ode5C23.text	
ltx/en_us_dedes/me.m09.d04:meMA.Ode5C24.incipit	…
ltx/en_us_dedes/me.m09.d04:meMA.Ode5C24.melody	@ltx/en_us_dedes/he.h.m4:heHE.SyKyrieMouFos.name
ltx/en_us_dedes/me.m09.d04:meMA.Ode5C24.mode	@ltx/en_us_dedes/miscellanea:misc.Mode4
ltx/en_us_dedes/me.m09.d04:meMA.Ode5C24.ode	@ltx/en_us_dedes/miscellanea:misc.Ode5
ltx/en_us_dedes/me.m09.d04:meMA.Ode5C24.text	
ltx/en_us_dedes/me.m09.d04:meMA.Ode5C2T.incipit	…
ltx/en_us_dedes/me.m09.d04:meMA.Ode5C2T.melody	@ltx/en_us_dedes/he.h.m4:heHE.SyKyrieMouFos.name
ltx/en_us_dedes/me.m09.d04:meMA.Ode5C2T.mode	@ltx/en_us_dedes/miscellanea:misc.Mode4
ltx/en_us_dedes/me.m09.d04:meMA.Ode5C2T.ode	@ltx/en_us_dedes/miscellanea:misc.Ode5
ltx/en_us_dedes/me.m09.d04:meMA.Ode5C2T.text	
ltx/en_us_dedes/me.m09.d04:meMA.Ode6C11.greekmelody	@ltx/en_us_dedes/he.h.m6:heHE.TouViouTinThalassan.greekname
ltx/en_us_dedes/me.m09.d04:meMA.Ode6C11.incipit	…
ltx/en_us_dedes/me.m09.d04:meMA.Ode6C11.melody	@ltx/en_us_dedes/he.h.m6:heHE.TouViouTinThalassan.name
ltx/en_us_dedes/me.m09.d04:meMA.Ode6C11.mode	@ltx/en_us_dedes/miscellanea:misc.Mode6
ltx/en_us_dedes/me.m09.d04:meMA.Ode6C11.ode	@ltx/en_us_dedes/miscellanea:misc.Ode6
ltx/en_us_dedes/me.m09.d04:meMA.Ode6C11.text	
ltx/en_us_dedes/me.m09.d04:meMA.Ode6C12.incipit	…
ltx/en_us_dedes/me.m09.d04:meMA.Ode6C12.melody	@ltx/en_us_dedes/he.h.m6:heHE.TouViouTinThalassan.name
ltx/en_us_dedes/me.m09.d04:meMA.Ode6C12.mode	@ltx/en_us_dedes/miscellanea:misc.Mode6
ltx/en_us_dedes/me.m09.d04:meMA.Ode6C12.ode	@ltx/en_us_dedes/miscellanea:misc.Ode6
ltx/en_us_dedes/me.m09.d04:meMA.Ode6C12.text	
ltx/en_us_dedes/me.m09.d04:meMA.Ode6C13.incipit	…
ltx/en_us_dedes/me.m09.d04:meMA.Ode6C13.melody	@ltx/en_us_dedes/he.h.m6:heHE.TouViouTinThalassan.name
ltx/en_us_dedes/me.m09.d04:meMA.Ode6C13.mode	@ltx/en_us_dedes/miscellanea:misc.Mode6
ltx/en_us_dedes/me.m09.d04:meMA.Ode6C13.ode	@ltx/en_us_dedes/miscellanea:misc.Ode6
ltx/en_us_dedes/me.m09.d04:meMA.Ode6C13.text	
ltx/en_us_dedes/me.m09.d04:meMA.Ode6C1T.incipit	…
ltx/en_us_dedes/me.m09.d04:meMA.Ode6C1T.melody	@ltx/en_us_dedes/he.h.m6:heHE.TouViouTinThalassan.name
ltx/en_us_dedes/me.m09.d04:meMA.Ode6C1T.mode	@ltx/en_us_dedes/miscellanea:misc.Mode6
ltx/en_us_dedes/me.m09.d04:meMA.Ode6C1T.ode	@ltx/en_us_dedes/miscellanea:misc.Ode6
ltx/en_us_dedes/me.m09.d04:meMA.Ode6C1T.text	
ltx/en_us_dedes/me.m09.d04:meMA.Ode6C21.greekmelody	@ltx/en_us_dedes/he.h.m4:heHE.ThysoSoiMetaFonis.greekname
ltx/en_us_dedes/me.m09.d04:meMA.Ode6C21.incipit	…
ltx/en_us_dedes/me.m09.d04:meMA.Ode6C21.melody	@ltx/en_us_dedes/he.h.m4:heHE.ThysoSoiMetaFonis.name
ltx/en_us_dedes/me.m09.d04:meMA.Ode6C21.mode	@ltx/en_us_dedes/miscellanea:misc.Mode4
ltx/en_us_dedes/me.m09.d04:meMA.Ode6C21.ode	@ltx/en_us_dedes/miscellanea:misc.Ode6
ltx/en_us_dedes/me.m09.d04:meMA.Ode6C21.text	
ltx/en_us_dedes/me.m09.d04:meMA.Ode6C22.incipit	…
ltx/en_us_dedes/me.m09.d04:meMA.Ode6C22.melody	@ltx/en_us_dedes/he.h.m4:heHE.ThysoSoiMetaFonis.name
ltx/en_us_dedes/me.m09.d04:meMA.Ode6C22.mode	@ltx/en_us_dedes/miscellanea:misc.Mode4
ltx/en_us_dedes/me.m09.d04:meMA.Ode6C22.ode	@ltx/en_us_dedes/miscellanea:misc.Ode6
ltx/en_us_dedes/me.m09.d04:meMA.Ode6C22.text	
ltx/en_us_dedes/me.m09.d04:meMA.Ode6C23.incipit	…
ltx/en_us_dedes/me.m09.d04:meMA.Ode6C23.melody	@ltx/en_us_dedes/he.h.m4:heHE.ThysoSoiMetaFonis.name
ltx/en_us_dedes/me.m09.d04:meMA.Ode6C23.mode	@ltx/en_us_dedes/miscellanea:misc.Mode4
ltx/en_us_dedes/me.m09.d04:meMA.Ode6C23.ode	@ltx/en_us_dedes/miscellanea:misc.Ode6
ltx/en_us_dedes/me.m09.d04:meMA.Ode6C23.text	
ltx/en_us_dedes/me.m09.d04:meMA.Ode6C24.incipit	…
ltx/en_us_dedes/me.m09.d04:meMA.Ode6C24.melody	@ltx/en_us_dedes/he.h.m4:heHE.ThysoSoiMetaFonis.name
ltx/en_us_dedes/me.m09.d04:meMA.Ode6C24.mode	@ltx/en_us_dedes/miscellanea:misc.Mode4
ltx/en_us_dedes/me.m09.d04:meMA.Ode6C24.ode	@ltx/en_us_dedes/miscellanea:misc.Ode6
ltx/en_us_dedes/me.m09.d04:meMA.Ode6C24.text	
ltx/en_us_dedes/me.m09.d04:meMA.Ode6C2T.incipit	…
ltx/en_us_dedes/me.m09.d04:meMA.Ode6C2T.melody	@ltx/en_us_dedes/he.h.m4:heHE.ThysoSoiMetaFonis.name
ltx/en_us_dedes/me.m09.d04:meMA.Ode6C2T.mode	@ltx/en_us_dedes/miscellanea:misc.Mode4
ltx/en_us_dedes/me.m09.d04:meMA.Ode6C2T.ode	@ltx/en_us_dedes/miscellanea:misc.Ode6
ltx/en_us_dedes/me.m09.d04:meMA.Ode6C2T.text	
ltx/en_us_dedes/me.m09.d04:meMA.Ode6H.greekmelody	@ltx/en_us_dedes/he.h.m4:heHE.ThysoSoiMetaFonis.greekname
ltx/en_us_dedes/me.m09.d04:meMA.Ode6H.incipit	@ltx/en_us_dedes/he.h.m4:heHE.ThysoSoiMetaFonis.incipit
ltx/en_us_dedes/me.m09.d04:meMA.Ode6H.melody	@ltx/en_us_dedes/he.h.m4:heHE.ThysoSoiMetaFonis.melody
ltx/en_us_dedes/me.m09.d04:meMA.Ode6H.mode	@ltx/en_us_dedes/miscellanea:misc.Mode4
ltx/en_us_dedes/me.m09.d04:meMA.Ode6H.ode	@ltx/en_us_dedes/miscellanea:misc.Ode6
ltx/en_us_dedes/me.m09.d04:meMA.Ode6H.text	@ltx/en_us_dedes/he.h.m4:heHE.ThysoSoiMetaFonis.text
ltx/en_us_dedes/me.m09.d04:meMA.Ode7C11.greekmelody	@ltx/en_us_dedes/he.h.m6:heHE.DrosovolonMenTinKaminon.greekname
ltx/en_us_dedes/me.m09.d04:meMA.Ode7C11.incipit	…
ltx/en_us_dedes/me.m09.d04:meMA.Ode7C11.melody	@ltx/en_us_dedes/he.h.m6:heHE.DrosovolonMenTinKaminon.name
ltx/en_us_dedes/me.m09.d04:meMA.Ode7C11.mode	@ltx/en_us_dedes/miscellanea:misc.Mode6
ltx/en_us_dedes/me.m09.d04:meMA.Ode7C11.ode	@ltx/en_us_dedes/miscellanea:misc.Ode7
ltx/en_us_dedes/me.m09.d04:meMA.Ode7C11.text	
ltx/en_us_dedes/me.m09.d04:meMA.Ode7C12.incipit	…
ltx/en_us_dedes/me.m09.d04:meMA.Ode7C12.melody	@ltx/en_us_dedes/he.h.m6:heHE.DrosovolonMenTinKaminon.name
ltx/en_us_dedes/me.m09.d04:meMA.Ode7C12.mode	@ltx/en_us_dedes/miscellanea:misc.Mode6
ltx/en_us_dedes/me.m09.d04:meMA.Ode7C12.ode	@ltx/en_us_dedes/miscellanea:misc.Ode7
ltx/en_us_dedes/me.m09.d04:meMA.Ode7C12.text	
ltx/en_us_dedes/me.m09.d04:meMA.Ode7C13.incipit	…
ltx/en_us_dedes/me.m09.d04:meMA.Ode7C13.melody	@ltx/en_us_dedes/he.h.m6:heHE.DrosovolonMenTinKaminon.name
ltx/en_us_dedes/me.m09.d04:meMA.Ode7C13.mode	@ltx/en_us_dedes/miscellanea:misc.Mode6
ltx/en_us_dedes/me.m09.d04:meMA.Ode7C13.ode	@ltx/en_us_dedes/miscellanea:misc.Ode7
ltx/en_us_dedes/me.m09.d04:meMA.Ode7C13.text	
ltx/en_us_dedes/me.m09.d04:meMA.Ode7C1T.incipit	…
ltx/en_us_dedes/me.m09.d04:meMA.Ode7C1T.melody	@ltx/en_us_dedes/he.h.m6:heHE.DrosovolonMenTinKaminon.name
ltx/en_us_dedes/me.m09.d04:meMA.Ode7C1T.mode	@ltx/en_us_dedes/miscellanea:misc.Mode6
ltx/en_us_dedes/me.m09.d04:meMA.Ode7C1T.ode	@ltx/en_us_dedes/miscellanea:misc.Ode7
ltx/en_us_dedes/me.m09.d04:meMA.Ode7C1T.text	
ltx/en_us_dedes/me.m09.d04:meMA.Ode7C21.greekmelody	@ltx/en_us_dedes/he.h.m2:heHE.EnTiKamino.greekname
ltx/en_us_dedes/me.m09.d04:meMA.Ode7C21.incipit	…
ltx/en_us_dedes/me.m09.d04:meMA.Ode7C21.melody	@ltx/en_us_dedes/he.h.m2:heHE.EnTiKamino.name
ltx/en_us_dedes/me.m09.d04:meMA.Ode7C21.mode	@ltx/en_us_dedes/miscellanea:misc.Mode4
ltx/en_us_dedes/me.m09.d04:meMA.Ode7C21.ode	@ltx/en_us_dedes/miscellanea:misc.Ode7
ltx/en_us_dedes/me.m09.d04:meMA.Ode7C21.text	
ltx/en_us_dedes/me.m09.d04:meMA.Ode7C22.incipit	…
ltx/en_us_dedes/me.m09.d04:meMA.Ode7C22.melody	@ltx/en_us_dedes/he.h.m2:heHE.EnTiKamino.name
ltx/en_us_dedes/me.m09.d04:meMA.Ode7C22.mode	@ltx/en_us_dedes/miscellanea:misc.Mode4
ltx/en_us_dedes/me.m09.d04:meMA.Ode7C22.ode	@ltx/en_us_dedes/miscellanea:misc.Ode7
ltx/en_us_dedes/me.m09.d04:meMA.Ode7C22.text	
ltx/en_us_dedes/me.m09.d04:meMA.Ode7C23.incipit	…
ltx/en_us_dedes/me.m09.d04:meMA.Ode7C23.melody	@ltx/en_us_dedes/he.h.m2:heHE.EnTiKamino.name
ltx/en_us_dedes/me.m09.d04:meMA.Ode7C23.mode	@ltx/en_us_dedes/miscellanea:misc.Mode4
ltx/en_us_dedes/me.m09.d04:meMA.Ode7C23.ode	@ltx/en_us_dedes/miscellanea:misc.Ode7
ltx/en_us_dedes/me.m09.d04:meMA.Ode7C23.text	
ltx/en_us_dedes/me.m09.d04:meMA.Ode7C2T.incipit	…
ltx/en_us_dedes/me.m09.d04:meMA.Ode7C2T.melody	@ltx/en_us_dedes/he.h.m2:heHE.EnTiKamino.name
ltx/en_us_dedes/me.m09.d04:meMA.Ode7C2T.mode	@ltx/en_us_dedes/miscellanea:misc.Mode4
ltx/en_us_dedes/me.m09.d04:meMA.Ode7C2T.ode	@ltx/en_us_dedes/miscellanea:misc.Ode7
ltx/en_us_dedes/me.m09.d04:meMA.Ode7C2T.text	
ltx/en_us_dedes/me.m09.d04:meMA.Ode8C11.greekmelody	@ltx/en_us_dedes/he.h.m6:heHE.TheonPateraDimiourgon.greekname
ltx/en_us_dedes/me.m09.d04:meMA.Ode8C11.incipit	…
ltx/en_us_dedes/me.m09.d04:meMA.Ode8C11.melody	@ltx/en_us_dedes/he.h.m6:heHE.TheonPateraDimiourgon.name
ltx/en_us_dedes/me.m09.d04:meMA.Ode8C11.mode	@ltx/en_us_dedes/miscellanea:misc.Mode6
ltx/en_us_dedes/me.m09.d04:meMA.Ode8C11.ode	@ltx/en_us_dedes/miscellanea:misc.Ode8
ltx/en_us_dedes/me.m09.d04:meMA.Ode8C11.text	
ltx/en_us_dedes/me.m09.d04:meMA.Ode8C12.incipit	…
ltx/en_us_dedes/me.m09.d04:meMA.Ode8C12.melody	@ltx/en_us_dedes/he.h.m6:heHE.TheonPateraDimiourgon.name
ltx/en_us_dedes/me.m09.d04:meMA.Ode8C12.mode	@ltx/en_us_dedes/miscellanea:misc.Mode6
ltx/en_us_dedes/me.m09.d04:meMA.Ode8C12.ode	@ltx/en_us_dedes/miscellanea:misc.Ode8
ltx/en_us_dedes/me.m09.d04:meMA.Ode8C12.text	
ltx/en_us_dedes/me.m09.d04:meMA.Ode8C13.incipit	…
ltx/en_us_dedes/me.m09.d04:meMA.Ode8C13.melody	@ltx/en_us_dedes/he.h.m6:heHE.TheonPateraDimiourgon.name
ltx/en_us_dedes/me.m09.d04:meMA.Ode8C13.mode	@ltx/en_us_dedes/miscellanea:misc.Mode6
ltx/en_us_dedes/me.m09.d04:meMA.Ode8C13.ode	@ltx/en_us_dedes/miscellanea:misc.Ode8
ltx/en_us_dedes/me.m09.d04:meMA.Ode8C13.text	
ltx/en_us_dedes/me.m09.d04:meMA.Ode8C1T.incipit	…
ltx/en_us_dedes/me.m09.d04:meMA.Ode8C1T.melody	@ltx/en_us_dedes/he.h.m6:heHE.TheonPateraDimiourgon.name
ltx/en_us_dedes/me.m09.d04:meMA.Ode8C1T.mode	@ltx/en_us_dedes/miscellanea:misc.Mode6
ltx/en_us_dedes/me.m09.d04:meMA.Ode8C1T.ode	@ltx/en_us_dedes/miscellanea:misc.Ode8
ltx/en_us_dedes/me.m09.d04:meMA.Ode8C1T.text	
ltx/en_us_dedes/me.m09.d04:meMA.Ode8C21.greekmelody	@ltx/en_us_dedes/he.h.m4:heHE.CheirasEkpetasasDaniil.greekname
ltx/en_us_dedes/me.m09.d04:meMA.Ode8C21.incipit	…
ltx/en_us_dedes/me.m09.d04:meMA.Ode8C21.melody	@ltx/en_us_dedes/he.h.m4:heHE.CheirasEkpetasasDaniil.name
ltx/en_us_dedes/me.m09.d04:meMA.Ode8C21.mode	@ltx/en_us_dedes/miscellanea:misc.Mode4
ltx/en_us_dedes/me.m09.d04:meMA.Ode8C21.ode	@ltx/en_us_dedes/miscellanea:misc.Ode8
ltx/en_us_dedes/me.m09.d04:meMA.Ode8C21.text	
ltx/en_us_dedes/me.m09.d04:meMA.Ode8C22.incipit	…
ltx/en_us_dedes/me.m09.d04:meMA.Ode8C22.melody	@ltx/en_us_dedes/he.h.m4:heHE.CheirasEkpetasasDaniil.name
ltx/en_us_dedes/me.m09.d04:meMA.Ode8C22.mode	@ltx/en_us_dedes/miscellanea:misc.Mode4
ltx/en_us_dedes/me.m09.d04:meMA.Ode8C22.ode	@ltx/en_us_dedes/miscellanea:misc.Ode8
ltx/en_us_dedes/me.m09.d04:meMA.Ode8C22.text	
ltx/en_us_dedes/me.m09.d04:meMA.Ode8C23.incipit	…
ltx/en_us_dedes/me.m09.d04:meMA.Ode8C23.melody	@ltx/en_us_dedes/he.h.m4:heHE.CheirasEkpetasasDaniil.name
ltx/en_us_dedes/me.m09.d04:meMA.Ode8C23.mode	@ltx/en_us_dedes/miscellanea:misc.Mode4
ltx/en_us_dedes/me.m09.d04:meMA.Ode8C23.ode	@ltx/en_us_dedes/miscellanea:misc.Ode8
ltx/en_us_dedes/me.m09.d04:meMA.Ode8C23.text	
ltx/en_us_dedes/me.m09.d04:meMA.Ode8C24.incipit	…
ltx/en_us_dedes/me.m09.d04:meMA.Ode8C24.melody	@ltx/en_us_dedes/he.h.m4:heHE.CheirasEkpetasasDaniil.name
ltx/en_us_dedes/me.m09.d04:meMA.Ode8C24.mode	@ltx/en_us_dedes/miscellanea:misc.Mode4
ltx/en_us_dedes/me.m09.d04:meMA.Ode8C24.ode	@ltx/en_us_dedes/miscellanea:misc.Ode8
ltx/en_us_dedes/me.m09.d04:meMA.Ode8C24.text	
ltx/en_us_dedes/me.m09.d04:meMA.Ode8C2T.incipit	…
ltx/en_us_dedes/me.m09.d04:meMA.Ode8C2T.melody	@ltx/en_us_dedes/he.h.m4:heHE.CheirasEkpetasasDaniil.name
ltx/en_us_dedes/me.m09.d04:meMA.Ode8C2T.mode	@ltx/en_us_dedes/miscellanea:misc.Mode4
ltx/en_us_dedes/me.m09.d04:meMA.Ode8C2T.ode	@ltx/en_us_dedes/miscellanea:misc.Ode8
ltx/en_us_dedes/me.m09.d04:meMA.Ode8C2T.text	
ltx/en_us_dedes/me.m09.d04:meMA.Ode8H.greekmelody	@ltx/en_us_dedes/he.h.m4:heHE.CheirasEkpetasasDaniil.greekname
ltx/en_us_dedes/me.m09.d04:meMA.Ode8H.incipit	@ltx/en_us_dedes/he.h.m4:heHE.CheirasEkpetasasDaniil.incipit
ltx/en_us_dedes/me.m09.d04:meMA.Ode8H.melody	@ltx/en_us_dedes/he.h.m4:heHE.CheirasEkpetasasDaniil.melody
ltx/en_us_dedes/me.m09.d04:meMA.Ode8H.mode	@ltx/en_us_dedes/miscellanea:misc.Mode4
ltx/en_us_dedes/me.m09.d04:meMA.Ode8H.ode	@ltx/en_us_dedes/miscellanea:misc.Ode8
ltx/en_us_dedes/me.m09.d04:meMA.Ode8H.text	@ltx/en_us_dedes/he.h.m4:heHE.CheirasEkpetasasDaniil.text
ltx/en_us_dedes/me.m09.d04:meMA.Ode9C11.greekmelody	@ltx/en_us_dedes/he.h.m6:heHE.TheonAnthropois.greekname
ltx/en_us_dedes/me.m09.d04:meMA.Ode9C11.incipit	…
ltx/en_us_dedes/me.m09.d04:meMA.Ode9C11.melody	@ltx/en_us_dedes/he.h.m6:heHE.TheonAnthropois.name
ltx/en_us_dedes/me.m09.d04:meMA.Ode9C11.mode	@ltx/en_us_dedes/miscellanea:misc.Mode6
ltx/en_us_dedes/me.m09.d04:meMA.Ode9C11.ode	@ltx/en_us_dedes/miscellanea:misc.Ode9
ltx/en_us_dedes/me.m09.d04:meMA.Ode9C11.text	
ltx/en_us_dedes/me.m09.d04:meMA.Ode9C12.incipit	…
ltx/en_us_dedes/me.m09.d04:meMA.Ode9C12.melody	@ltx/en_us_dedes/he.h.m6:heHE.TheonAnthropois.name
ltx/en_us_dedes/me.m09.d04:meMA.Ode9C12.mode	@ltx/en_us_dedes/miscellanea:misc.Mode6
ltx/en_us_dedes/me.m09.d04:meMA.Ode9C12.ode	@ltx/en_us_dedes/miscellanea:misc.Ode9
ltx/en_us_dedes/me.m09.d04:meMA.Ode9C12.text	
ltx/en_us_dedes/me.m09.d04:meMA.Ode9C13.incipit	…
ltx/en_us_dedes/me.m09.d04:meMA.Ode9C13.melody	@ltx/en_us_dedes/he.h.m6:heHE.TheonAnthropois.name
ltx/en_us_dedes/me.m09.d04:meMA.Ode9C13.mode	@ltx/en_us_dedes/miscellanea:misc.Mode6
ltx/en_us_dedes/me.m09.d04:meMA.Ode9C13.ode	@ltx/en_us_dedes/miscellanea:misc.Ode9
ltx/en_us_dedes/me.m09.d04:meMA.Ode9C13.text	
ltx/en_us_dedes/me.m09.d04:meMA.Ode9C1T.incipit	…
ltx/en_us_dedes/me.m09.d04:meMA.Ode9C1T.melody	@ltx/en_us_dedes/he.h.m6:heHE.TheonAnthropois.name
ltx/en_us_dedes/me.m09.d04:meMA.Ode9C1T.mode	@ltx/en_us_dedes/miscellanea:misc.Mode6
ltx/en_us_dedes/me.m09.d04:meMA.Ode9C1T.ode	@ltx/en_us_dedes/miscellanea:misc.Ode9
ltx/en_us_dedes/me.m09.d04:meMA.Ode9C1T.text	
ltx/en_us_dedes/me.m09.d04:meMA.Ode9C21.greekmelody	@ltx/en_us_dedes/he.h.m4:heHE.LithosAcheirotmitos.greekname
ltx/en_us_dedes/me.m09.d04:meMA.Ode9C21.incipit	…
ltx/en_us_dedes/me.m09.d04:meMA.Ode9C21.melody	@ltx/en_us_dedes/he.h.m4:heHE.LithosAcheirotmitos.name
ltx/en_us_dedes/me.m09.d04:meMA.Ode9C21.mode	@ltx/en_us_dedes/miscellanea:misc.Mode4
ltx/en_us_dedes/me.m09.d04:meMA.Ode9C21.ode	@ltx/en_us_dedes/miscellanea:misc.Ode9
ltx/en_us_dedes/me.m09.d04:meMA.Ode9C21.text	
ltx/en_us_dedes/me.m09.d04:meMA.Ode9C22.incipit	…
ltx/en_us_dedes/me.m09.d04:meMA.Ode9C22.melody	@ltx/en_us_dedes/he.h.m4:heHE.LithosAcheirotmitos.name
ltx/en_us_dedes/me.m09.d04:meMA.Ode9C22.mode	@ltx/en_us_dedes/miscellanea:misc.Mode4
ltx/en_us_dedes/me.m09.d04:meMA.Ode9C22.ode	@ltx/en_us_dedes/miscellanea:misc.Ode9
ltx/en_us_dedes/me.m09.d04:meMA.Ode9C22.text	
ltx/en_us_dedes/me.m09.d04:meMA.Ode9C23.incipit	…
ltx/en_us_dedes/me.m09.d04:meMA.Ode9C23.melody	@ltx/en_us_dedes/he.h.m4:heHE.LithosAcheirotmitos.name
ltx/en_us_dedes/me.m09.d04:meMA.Ode9C23.mode	@ltx/en_us_dedes/miscellanea:misc.Mode4
ltx/en_us_dedes/me.m09.d04:meMA.Ode9C23.ode	@ltx/en_us_dedes/miscellanea:misc.Ode9
ltx/en_us_dedes/me.m09.d04:meMA.Ode9C23.text	
ltx/en_us_dedes/me.m09.d04:meMA.Ode9C2T.incipit	…
ltx/en_us_dedes/me.m09.d04:meMA.Ode9C2T.melody	@ltx/en_us_dedes/he.h.m4:heHE.LithosAcheirotmitos.name
ltx/en_us_dedes/me.m09.d04:meMA.Ode9C2T.mode	@ltx/en_us_dedes/miscellanea:misc.Mode4
ltx/en_us_dedes/me.m09.d04:meMA.Ode9C2T.ode	@ltx/en_us_dedes/miscellanea:misc.Ode9
ltx/en_us_dedes/me.m09.d04:meMA.Ode9C2T.text	
ltx/en_us_dedes/me.m09.d04:meMA.Ode9H.greekmelody	@ltx/en_us_dedes/he.h.m4:heHE.LithosAcheirotmitos.greekname
ltx/en_us_dedes/me.m09.d04:meMA.Ode9H.incipit	@ltx/en_us_dedes/he.h.m4:heHE.LithosAcheirotmitos.incipit
ltx/en_us_dedes/me.m09.d04:meMA.Ode9H.melody	@ltx/en_us_dedes/he.h.m4:heHE.LithosAcheirotmitos.melody
ltx/en_us_dedes/me.m09.d04:meMA.Ode9H.mode	@ltx/en_us_dedes/miscellanea:misc.Mode4
ltx/en_us_dedes/me.m09.d04:meMA.Ode9H.ode	@ltx/en_us_dedes/miscellanea:misc.Ode9
ltx/en_us_dedes/me.m09.d04:meMA.Ode9H.text	@ltx/en_us_dedes/he.h.m4:heHE.LithosAcheirotmitos.text
ltx/en_us_dedes/me.m09.d04:meMA.Oikos1.text	Clearly perceiving the vanity of the world, being a stranger in the world, and imitating the Passion of Christ, you put to death the passions of the body; and taking up your cross, you followed your Creator. As you are with Him now, entreat Him on behalf of us who truly honor you, O glorious Martyr who suffered much.
ltx/en_us_dedes/me.m09.d04:meVE.Apolytikion1ger.greekmelody	@ltx/en_us_dedes/he.a.m4:heAU.OYpsotheisEnToStavro.greekname
ltx/en_us_dedes/me.m09.d04:meVE.Apolytikion1ger.incipit	…
ltx/en_us_dedes/me.m09.d04:meVE.Apolytikion1ger.melody	@ltx/en_us_dedes/he.a.m4:heAU.OYpsotheisEnToStavro.name
ltx/en_us_dedes/me.m09.d04:meVE.Apolytikion1ger.mode	@ltx/en_us_dedes/miscellanea:misc.Mode4
ltx/en_us_dedes/me.m09.d04:meVE.Apolytikion1ger.poet	@ltx/en_us_dedes/poets:po.Gerasimou
ltx/en_us_dedes/me.m09.d04:meVE.Apolytikion1ger.text	
ltx/en_us_dedes/me.m09.d04:meVE.AposGlory.incipit	As you stood at the…
ltx/en_us_dedes/me.m09.d04:meVE.AposGlory.melody	
ltx/en_us_dedes/me.m09.d04:meVE.AposGlory.mode	@ltx/en_us_dedes/miscellanea:misc.Mode6
ltx/en_us_dedes/me.m09.d04:meVE.AposGlory.text	As you stood at the tribunal of the tyrant, and as you competed for the sake of true belief in God, you cried out and said: “Behold, I and the children God has given me.” Together with them you were crowned in heaven, O Hieromartyr Babylas. And now you unceasingly intercede and pray, that our souls be delivered from the snares of the enemy.
ltx/en_us_dedes/me.m09.d04:meVE.AposStavrotheotokion.greekmelody	@ltx/en_us_dedes/he.a.m6:heAU.TriimerosAnestis.greekname
ltx/en_us_dedes/me.m09.d04:meVE.AposStavrotheotokion.incipit	@ltx/en_us_dedes/me.m01.d21:meVE.SticStavrotheotokion.incipit
ltx/en_us_dedes/me.m09.d04:meVE.AposStavrotheotokion.melody	@ltx/en_us_dedes/he.a.m6:heAU.TriimerosAnestis.name
ltx/en_us_dedes/me.m09.d04:meVE.AposStavrotheotokion.mode	@ltx/en_us_dedes/miscellanea:misc.Mode6
ltx/en_us_dedes/me.m09.d04:meVE.AposStavrotheotokion.text	@ltx/en_us_dedes/me.m01.d21:meVE.SticStavrotheotokion.text
ltx/en_us_dedes/me.m09.d04:meVE.AposTheotokion.greekmelody	@ltx/en_us_dedes/he.a.m6:heAU.TriimerosAnestis.greekname
ltx/en_us_dedes/me.m09.d04:meVE.AposTheotokion.incipit	O Virgin and all-blameless Maid…
ltx/en_us_dedes/me.m09.d04:meVE.AposTheotokion.melody	@ltx/en_us_dedes/he.a.m6:heAU.TriimerosAnestis.name
ltx/en_us_dedes/me.m09.d04:meVE.AposTheotokion.mode	@ltx/en_us_dedes/miscellanea:misc.Mode6
ltx/en_us_dedes/me.m09.d04:meVE.AposTheotokion.text	O Virgin and all-blameless Maid, * we pray you to entreat your Son, * that He save us, * the entire human race, * as we, O virgin Mother, * with heart and tongue confess you to be the Theotokos indeed.
ltx/en_us_dedes/me.m09.d04:meVE.GeneralApolytikion1.name	Babylas.
ltx/en_us_dedes/me.m09.d04:meVE.GeneralApolytikion2.name	Moses,
ltx/en_us_dedes/me.m09.d04:meVE.MM.GeneralApolytikion1.text	@ltx/en_us_dedes/properties:media.key
ltx/en_us_dedes/me.m09.d04:meVE.MM.GeneralApolytikion2.text	@ltx/en_us_dedes/properties:media.key
ltx/en_us_dedes/me.m09.d04:meVE.MM.Stichera1123as78910.text	@ltx/en_us_dedes/properties:media.key
ltx/en_us_dedes/me.m09.d04:meVE.SticGlory.incipit	O Hieromartyr Babylas, your contests…
ltx/en_us_dedes/me.m09.d04:meVE.SticGlory.melody	
ltx/en_us_dedes/me.m09.d04:meVE.SticGlory.mode	@ltx/en_us_dedes/miscellanea:misc.Mode6
ltx/en_us_dedes/me.m09.d04:meVE.SticGlory.text	O Hieromartyr Babylas, your contests have become another stable pedestal for the Church, which you guard and keep unshaken and safe from mighty wolves. And she proclaims your excellent victories, and magnifies you and the young children who with you were sacrificed for Christ, O blessed Saint.
ltx/en_us_dedes/me.m09.d04:meVE.SticStavrotheotokion.greekmelody	@ltx/en_us_dedes/he.a.m6:heAU.TriimerosAnestis.greekname
ltx/en_us_dedes/me.m09.d04:meVE.SticStavrotheotokion.incipit	@ltx/en_us_dedes/me.m01.d16:meVE.SticStavrotheotokion.incipit
ltx/en_us_dedes/me.m09.d04:meVE.SticStavrotheotokion.melody	@ltx/en_us_dedes/he.a.m6:heAU.TriimerosAnestis.name
ltx/en_us_dedes/me.m09.d04:meVE.SticStavrotheotokion.mode	@ltx/en_us_dedes/miscellanea:misc.Mode6
ltx/en_us_dedes/me.m09.d04:meVE.SticStavrotheotokion.text	@ltx/en_us_dedes/me.m01.d16:meVE.SticStavrotheotokion.text
ltx/en_us_dedes/me.m09.d04:meVE.SticTheotokion.greekmelody	@ltx/en_us_dedes/he.a.m6:heAU.TriimerosAnestis.greekname
ltx/en_us_dedes/me.m09.d04:meVE.SticTheotokion.incipit	@ltx/en_us_dedes/me.m03.d01:meVE.SticTheotokion2.incipit
ltx/en_us_dedes/me.m09.d04:meVE.SticTheotokion.melody	@ltx/en_us_dedes/he.a.m6:heAU.TriimerosAnestis.name
ltx/en_us_dedes/me.m09.d04:meVE.SticTheotokion.mode	@ltx/en_us_dedes/miscellanea:misc.Mode6
ltx/en_us_dedes/me.m09.d04:meVE.SticTheotokion.text	@ltx/en_us_dedes/me.m03.d01:meVE.SticTheotokion2.text
ltx/en_us_dedes/me.m09.d04:meVE.Stichera01.greekmelody	@ltx/en_us_dedes/he.a.m6:heAU.OlinApothemenoi.greekname
ltx/en_us_dedes/me.m09.d04:meVE.Stichera01.incipit	Babylas, with vestments dyed in…
ltx/en_us_dedes/me.m09.d04:meVE.Stichera01.melody	@ltx/en_us_dedes/he.a.m6:heAU.OlinApothemenoi.name
ltx/en_us_dedes/me.m09.d04:meVE.Stichera01.mode	@ltx/en_us_dedes/miscellanea:misc.Mode6
ltx/en_us_dedes/me.m09.d04:meVE.Stichera01.text	Babylas, with vestments dyed in your own blood as a martyr, * you entered the holy of holies having now become a holy one yourself, * O glorious martyr Saint. * And you do at all times * manifestly enjoy theosis, * thus rendered beautiful, * radiating brightly through martyrdom; * you proved to be an angel by * your participation in purity. * Therefore we extol you, * and longingly we celebrate your own * most sacred feast, and we honor you, * O Hieromartyr worthily blest.
ltx/en_us_dedes/me.m09.d04:meVE.Stichera02.incipit	O all-wise one, even as…
ltx/en_us_dedes/me.m09.d04:meVE.Stichera02.melody	@ltx/en_us_dedes/he.a.m6:heAU.OlinApothemenoi.name
ltx/en_us_dedes/me.m09.d04:meVE.Stichera02.mode	@ltx/en_us_dedes/miscellanea:misc.Mode6
ltx/en_us_dedes/me.m09.d04:meVE.Stichera02.text	O all-wise one, even as you were adorned with the sacred * scars of tortures you endured, and your feet were manacled, blessed Babylas, * unimpeded you walked * up the path that led you * to the heavenly city on high. * There as a genuine * victor and a Martyr immovable * and as a sacred and devout * celebrant of most holy sacraments, * now you join the Angels and sing the most divine Thrice-holy Hymn: * All holy, holy, holy are You, * consubstantial Trinity.
ltx/en_us_dedes/me.m09.d04:meVE.Stichera03.incipit	As the shepherd of the…
ltx/en_us_dedes/me.m09.d04:meVE.Stichera03.melody	@ltx/en_us_dedes/he.a.m6:heAU.OlinApothemenoi.name
ltx/en_us_dedes/me.m09.d04:meVE.Stichera03.mode	@ltx/en_us_dedes/miscellanea:misc.Mode6
ltx/en_us_dedes/me.m09.d04:meVE.Stichera03.text	As the shepherd of the flock endowed with reason, O Hierarch, * with the staff of spiritual knowledge you fed it on green pastures with faith. * You saved it from wild beasts, * and you also gladdened * God who shepherded you from on high. * And in proclaiming Him * before the extremely ungodly ones, * rejoicing you were slaughtered as * an innocent lamb with the innocent * children, O all blest one. * With them you were together offered up * as a sweet smelling whole sacrifice, * God-inspired Babylas.
ltx/en_us_dedes/me.m09.d04:meVE.Stichera04.greekmelody	@ltx/en_us_dedes/he.a.m4:heAU.OsGennaionEnMartysi.greekname
ltx/en_us_dedes/me.m09.d04:meVE.Stichera04.incipit	In the whirlwind and cloud…
ltx/en_us_dedes/me.m09.d04:meVE.Stichera04.melody	@ltx/en_us_dedes/he.a.m4:heAU.OsGennaionEnMartysi.name
ltx/en_us_dedes/me.m09.d04:meVE.Stichera04.mode	@ltx/en_us_dedes/miscellanea:misc.Mode4
ltx/en_us_dedes/me.m09.d04:meVE.Stichera04.text	In the whirlwind and cloud you saw * immaterial, fleshless God, * Moses, insofar as you were able to do. * Becoming god-like and shining with the glory of grace divine, * you laid down the Law of God * for the physical Israel. * But an earthly mind * cannot fathom the mysteries of God, for grace is given the ones who * see what is very superior.
ltx/en_us_dedes/me.m09.d04:meVE.Stichera05.incipit	You were Law-giver and a…
ltx/en_us_dedes/me.m09.d04:meVE.Stichera05.melody	@ltx/en_us_dedes/he.a.m4:heAU.OsGennaionEnMartysi.name
ltx/en_us_dedes/me.m09.d04:meVE.Stichera05.mode	@ltx/en_us_dedes/miscellanea:misc.Mode4
ltx/en_us_dedes/me.m09.d04:meVE.Stichera05.text	You were Law-giver and a priest * and commander most valorous * for the stiff-necked people who had embittered God. * For you, O Moses, did smite the land of Egypt, and split the Sea * with your wonder-working rod, * and sank haughty and arrogant * Pharaoh in the deep * with his hosts and his chariots. Then, living in the desert, you provided * for the ungrateful of Israel.
ltx/en_us_dedes/me.m09.d04:meVE.Stichera06.incipit	When to Moses the Lord…
ltx/en_us_dedes/me.m09.d04:meVE.Stichera06.melody	@ltx/en_us_dedes/he.a.m4:heAU.OsGennaionEnMartysi.name
ltx/en_us_dedes/me.m09.d04:meVE.Stichera06.mode	@ltx/en_us_dedes/miscellanea:misc.Mode4
ltx/en_us_dedes/me.m09.d04:meVE.Stichera06.text	When to Moses the Lord appeared on Mt. Horeb, He said to him, * “Moses, do not come any closer, but at once * remove your sandals of leather from your feet, for the place where you * stand is holy ground indeed. * And let nothing symbolic of death now cling to you. * For to you is the paradoxal wonder of the Virgin Theotokos * mystically shown in the bush and fire.”
