ltx/en_us_dedes/me.m06.d28:meDA.commemoration.first	Transfer of the Relics of the Holy Unmercenaries Cyrus and John
ltx/en_us_dedes/me.m06.d28:meDA.commemoration.first_name	
ltx/en_us_dedes/me.m06.d28:meDA.commemoration.first_short	Transfer of the Relics of the Holy Unmercenaries Cyrus and John
ltx/en_us_dedes/me.m06.d28:meDA.commemoration.first_title	@ltx/en_us_dedes/titles:ti.Saints
ltx/en_us_dedes/me.m06.d28:meDA.commemoration.full	Commemoration of the Transfer of the Relics of the Holy Unmercenaries Cyrus and John, the Wonder-workers
ltx/en_us_dedes/me.m06.d28:meDA.commemoration.second_name	
ltx/en_us_dedes/me.m06.d28:meDA.commemoration.second_title	
ltx/en_us_dedes/me.m06.d28:meDA.date	June 28
ltx/en_us_dedes/me.m06.d28:meDA.dismissal	
ltx/en_us_dedes/me.m06.d28:meDA.fordate	for June 28
ltx/en_us_dedes/me.m06.d28:meDA.insert1	
ltx/en_us_dedes/me.m06.d28:meDA.insert2	
ltx/en_us_dedes/me.m06.d28:meDA.note	
ltx/en_us_dedes/me.m06.d28:meDA.pdfcoverdate	June 28,
ltx/en_us_dedes/me.m06.d28:meDA.pdfheaderdate	June 28
ltx/en_us_dedes/me.m06.d28:meHO.commemorations	
ltx/en_us_dedes/me.m06.d28:meHO.note1	
ltx/en_us_dedes/me.m06.d28:meHO.note2	
ltx/en_us_dedes/me.m06.d28:meHO.number	
ltx/en_us_dedes/me.m06.d28:meHO.rank	
ltx/en_us_dedes/me.m06.d28:meLE.commemoration1	The Commemoration of the Translation of the Relics of the Holy and Wonder-Working Kyros and John, the Unmercenaries.
ltx/en_us_dedes/me.m06.d28:meLE.commemoration2	
ltx/en_us_dedes/me.m06.d28:meLI.Kontakion1.greekmelody	@ltx/en_us_dedes/me.m06.d28:meMA.Kontakion1.greekmelody
ltx/en_us_dedes/me.m06.d28:meLI.Kontakion1.incipit	@ltx/en_us_dedes/me.m06.d28:meMA.Kontakion1.incipit
ltx/en_us_dedes/me.m06.d28:meLI.Kontakion1.melody	@ltx/en_us_dedes/me.m06.d28:meMA.Kontakion1.melody
ltx/en_us_dedes/me.m06.d28:meLI.Kontakion1.mode	@ltx/en_us_dedes/me.m06.d28:meMA.Kontakion1.mode
ltx/en_us_dedes/me.m06.d28:meLI.Kontakion1.text	@ltx/en_us_dedes/me.m06.d28:meMA.Kontakion1.text
ltx/en_us_dedes/me.m06.d28:meLI.MM.CommunionHymn.text	@ltx/en_us_dedes/properties:media.key
ltx/en_us_dedes/me.m06.d28:meLI.Megalynarion.text	
ltx/en_us_dedes/me.m06.d28:meMA.C1.acrostic.notice1	
ltx/en_us_dedes/me.m06.d28:meMA.C1.acrostic.text	
ltx/en_us_dedes/me.m06.d28:meMA.C1.acrostic.title	
ltx/en_us_dedes/me.m06.d28:meMA.C1.title	@ltx/en_us_dedes/titles:ti.CanonSaints
ltx/en_us_dedes/me.m06.d28:meMA.C1.verse	@ltx/en_us_dedes/prayers:pr.verse_SaintsM.text
ltx/en_us_dedes/me.m06.d28:meMA.Kontakion1.greekmelody	@ltx/en_us_dedes/he.a.m3:heAU.IParthenosSimeron.greekname
ltx/en_us_dedes/me.m06.d28:meMA.Kontakion1.incipit	Grace divine gave you the…
ltx/en_us_dedes/me.m06.d28:meMA.Kontakion1.melody	@ltx/en_us_dedes/he.a.m3:heAU.IParthenosSimeron.name
ltx/en_us_dedes/me.m06.d28:meMA.Kontakion1.mode	@ltx/en_us_dedes/miscellanea:misc.Mode3
ltx/en_us_dedes/me.m06.d28:meMA.Kontakion1.text	Grace divine gave you the gift * to do miraculous healings; * and you work your miracles * throughout the world, O divine Saints. * You remove all of our ailments and all our passions, * using your mystical surgery. You are truly * our divine and godly-minded * holy physicians and doctors, Cyrus and John.
ltx/en_us_dedes/me.m06.d28:meMA.Ode1C11.greekmelody	@ltx/en_us_dedes/he.h.m2:heHE.DefteLaoi.greekname
ltx/en_us_dedes/me.m06.d28:meMA.Ode1C11.incipit	…
ltx/en_us_dedes/me.m06.d28:meMA.Ode1C11.melody	@ltx/en_us_dedes/he.h.m2:heHE.DefteLaoi.name
ltx/en_us_dedes/me.m06.d28:meMA.Ode1C11.mode	@ltx/en_us_dedes/miscellanea:misc.Mode2
ltx/en_us_dedes/me.m06.d28:meMA.Ode1C11.ode	@ltx/en_us_dedes/miscellanea:misc.Ode1
ltx/en_us_dedes/me.m06.d28:meMA.Ode1C11.text	
ltx/en_us_dedes/me.m06.d28:meMA.Ode1C12.incipit	…
ltx/en_us_dedes/me.m06.d28:meMA.Ode1C12.melody	@ltx/en_us_dedes/he.h.m2:heHE.DefteLaoi.name
ltx/en_us_dedes/me.m06.d28:meMA.Ode1C12.mode	@ltx/en_us_dedes/miscellanea:misc.Mode2
ltx/en_us_dedes/me.m06.d28:meMA.Ode1C12.ode	@ltx/en_us_dedes/miscellanea:misc.Ode1
ltx/en_us_dedes/me.m06.d28:meMA.Ode1C12.text	
ltx/en_us_dedes/me.m06.d28:meMA.Ode1C13.incipit	…
ltx/en_us_dedes/me.m06.d28:meMA.Ode1C13.melody	@ltx/en_us_dedes/he.h.m2:heHE.DefteLaoi.name
ltx/en_us_dedes/me.m06.d28:meMA.Ode1C13.mode	@ltx/en_us_dedes/miscellanea:misc.Mode2
ltx/en_us_dedes/me.m06.d28:meMA.Ode1C13.ode	@ltx/en_us_dedes/miscellanea:misc.Ode1
ltx/en_us_dedes/me.m06.d28:meMA.Ode1C13.text	
ltx/en_us_dedes/me.m06.d28:meMA.Ode1C1T.incipit	…
ltx/en_us_dedes/me.m06.d28:meMA.Ode1C1T.melody	@ltx/en_us_dedes/he.h.m2:heHE.DefteLaoi.name
ltx/en_us_dedes/me.m06.d28:meMA.Ode1C1T.mode	@ltx/en_us_dedes/miscellanea:misc.Mode2
ltx/en_us_dedes/me.m06.d28:meMA.Ode1C1T.ode	@ltx/en_us_dedes/miscellanea:misc.Ode1
ltx/en_us_dedes/me.m06.d28:meMA.Ode1C1T.text	
ltx/en_us_dedes/me.m06.d28:meMA.Ode3C11.greekmelody	@ltx/en_us_dedes/he.h.m2:heHE.StereosonImasEnSoiKyrie.greekname
ltx/en_us_dedes/me.m06.d28:meMA.Ode3C11.incipit	…
ltx/en_us_dedes/me.m06.d28:meMA.Ode3C11.melody	@ltx/en_us_dedes/he.h.m2:heHE.StereosonImasEnSoiKyrie.name
ltx/en_us_dedes/me.m06.d28:meMA.Ode3C11.mode	@ltx/en_us_dedes/miscellanea:misc.Mode2
ltx/en_us_dedes/me.m06.d28:meMA.Ode3C11.ode	@ltx/en_us_dedes/miscellanea:misc.Ode3
ltx/en_us_dedes/me.m06.d28:meMA.Ode3C11.text	
ltx/en_us_dedes/me.m06.d28:meMA.Ode3C12.incipit	…
ltx/en_us_dedes/me.m06.d28:meMA.Ode3C12.melody	@ltx/en_us_dedes/he.h.m2:heHE.StereosonImasEnSoiKyrie.name
ltx/en_us_dedes/me.m06.d28:meMA.Ode3C12.mode	@ltx/en_us_dedes/miscellanea:misc.Mode2
ltx/en_us_dedes/me.m06.d28:meMA.Ode3C12.ode	@ltx/en_us_dedes/miscellanea:misc.Ode3
ltx/en_us_dedes/me.m06.d28:meMA.Ode3C12.text	
ltx/en_us_dedes/me.m06.d28:meMA.Ode3C13.incipit	…
ltx/en_us_dedes/me.m06.d28:meMA.Ode3C13.melody	@ltx/en_us_dedes/he.h.m2:heHE.StereosonImasEnSoiKyrie.name
ltx/en_us_dedes/me.m06.d28:meMA.Ode3C13.mode	@ltx/en_us_dedes/miscellanea:misc.Mode2
ltx/en_us_dedes/me.m06.d28:meMA.Ode3C13.ode	@ltx/en_us_dedes/miscellanea:misc.Ode3
ltx/en_us_dedes/me.m06.d28:meMA.Ode3C13.text	
ltx/en_us_dedes/me.m06.d28:meMA.Ode3C1T.incipit	…
ltx/en_us_dedes/me.m06.d28:meMA.Ode3C1T.melody	@ltx/en_us_dedes/he.h.m2:heHE.StereosonImasEnSoiKyrie.name
ltx/en_us_dedes/me.m06.d28:meMA.Ode3C1T.mode	@ltx/en_us_dedes/miscellanea:misc.Mode2
ltx/en_us_dedes/me.m06.d28:meMA.Ode3C1T.ode	@ltx/en_us_dedes/miscellanea:misc.Ode3
ltx/en_us_dedes/me.m06.d28:meMA.Ode3C1T.text	
ltx/en_us_dedes/me.m06.d28:meMA.Ode3H.greekmelody	@ltx/en_us_dedes/he.h.m2:heHE.StereosonImasEnSoiKyrie.greekname
ltx/en_us_dedes/me.m06.d28:meMA.Ode3H.incipit	@ltx/en_us_dedes/he.h.m2:heHE.StereosonImasEnSoiKyrie.incipit
ltx/en_us_dedes/me.m06.d28:meMA.Ode3H.melody	@ltx/en_us_dedes/he.h.m2:heHE.StereosonImasEnSoiKyrie.melody
ltx/en_us_dedes/me.m06.d28:meMA.Ode3H.mode	@ltx/en_us_dedes/miscellanea:misc.Mode2
ltx/en_us_dedes/me.m06.d28:meMA.Ode3H.ode	@ltx/en_us_dedes/miscellanea:misc.Ode3
ltx/en_us_dedes/me.m06.d28:meMA.Ode3H.text	@ltx/en_us_dedes/he.h.m2:heHE.StereosonImasEnSoiKyrie.text
ltx/en_us_dedes/me.m06.d28:meMA.Ode3Kathisma1.greekmelody	@ltx/en_us_dedes/he.a.m4:heAU.OYpsotheisEnToStavro.greekname
ltx/en_us_dedes/me.m06.d28:meMA.Ode3Kathisma1.incipit	When you had trampled on…
ltx/en_us_dedes/me.m06.d28:meMA.Ode3Kathisma1.melody	@ltx/en_us_dedes/he.a.m4:heAU.OYpsotheisEnToStavro.name
ltx/en_us_dedes/me.m06.d28:meMA.Ode3Kathisma1.mode	@ltx/en_us_dedes/miscellanea:misc.Mode4
ltx/en_us_dedes/me.m06.d28:meMA.Ode3Kathisma1.text	When you had trampled on the base carnal pleasures, * O holy Athletes, you in grace were exalted * to godly heights of martyrdom, for which you are well known, * blessed Cyrus and St. John, as the world’s luminaries. * Therefore we implore you to deliver us from darkness * of sin and from all manner of disease, * by interceding for us with the God of all.
ltx/en_us_dedes/me.m06.d28:meMA.Ode3KathismaSt.incipit	…
ltx/en_us_dedes/me.m06.d28:meMA.Ode3KathismaSt.melody	@ltx/en_us_dedes/he.a.m4:heAU.OYpsotheisEnToStavro.name
ltx/en_us_dedes/me.m06.d28:meMA.Ode3KathismaSt.mode	@ltx/en_us_dedes/miscellanea:misc.Mode4
ltx/en_us_dedes/me.m06.d28:meMA.Ode3KathismaSt.text	
ltx/en_us_dedes/me.m06.d28:meMA.Ode3KathismaT.incipit	Who can relate my many…
ltx/en_us_dedes/me.m06.d28:meMA.Ode3KathismaT.melody	@ltx/en_us_dedes/he.a.m4:heAU.OYpsotheisEnToStavro.name
ltx/en_us_dedes/me.m06.d28:meMA.Ode3KathismaT.mode	@ltx/en_us_dedes/miscellanea:misc.Mode4
ltx/en_us_dedes/me.m06.d28:meMA.Ode3KathismaT.text	Who can relate my many sordid ideas * and my unseemly thoughts that rage like a blizzard, * for they should not be uttered, All-blameless One? * Also the disturbances from my bodiless opponents, * and their awful wickedness: who can fully describe them? * But I implore you to deliver me * from them, O Good One, * by your intercessory prayers.
ltx/en_us_dedes/me.m06.d28:meMA.Ode4C11.greekmelody	@ltx/en_us_dedes/he.h.m2:heHE.YmnoSeAkoi.greekname
ltx/en_us_dedes/me.m06.d28:meMA.Ode4C11.incipit	…
ltx/en_us_dedes/me.m06.d28:meMA.Ode4C11.melody	@ltx/en_us_dedes/he.h.m2:heHE.YmnoSeAkoi.name
ltx/en_us_dedes/me.m06.d28:meMA.Ode4C11.mode	@ltx/en_us_dedes/miscellanea:misc.Mode2
ltx/en_us_dedes/me.m06.d28:meMA.Ode4C11.ode	@ltx/en_us_dedes/miscellanea:misc.Ode4
ltx/en_us_dedes/me.m06.d28:meMA.Ode4C11.text	
ltx/en_us_dedes/me.m06.d28:meMA.Ode4C12.incipit	…
ltx/en_us_dedes/me.m06.d28:meMA.Ode4C12.melody	@ltx/en_us_dedes/he.h.m2:heHE.YmnoSeAkoi.name
ltx/en_us_dedes/me.m06.d28:meMA.Ode4C12.mode	@ltx/en_us_dedes/miscellanea:misc.Mode2
ltx/en_us_dedes/me.m06.d28:meMA.Ode4C12.ode	@ltx/en_us_dedes/miscellanea:misc.Ode4
ltx/en_us_dedes/me.m06.d28:meMA.Ode4C12.text	
ltx/en_us_dedes/me.m06.d28:meMA.Ode4C13.incipit	…
ltx/en_us_dedes/me.m06.d28:meMA.Ode4C13.melody	@ltx/en_us_dedes/he.h.m2:heHE.YmnoSeAkoi.name
ltx/en_us_dedes/me.m06.d28:meMA.Ode4C13.mode	@ltx/en_us_dedes/miscellanea:misc.Mode2
ltx/en_us_dedes/me.m06.d28:meMA.Ode4C13.ode	@ltx/en_us_dedes/miscellanea:misc.Ode4
ltx/en_us_dedes/me.m06.d28:meMA.Ode4C13.text	
ltx/en_us_dedes/me.m06.d28:meMA.Ode4C1T.incipit	…
ltx/en_us_dedes/me.m06.d28:meMA.Ode4C1T.melody	@ltx/en_us_dedes/he.h.m2:heHE.YmnoSeAkoi.name
ltx/en_us_dedes/me.m06.d28:meMA.Ode4C1T.mode	@ltx/en_us_dedes/miscellanea:misc.Mode2
ltx/en_us_dedes/me.m06.d28:meMA.Ode4C1T.ode	@ltx/en_us_dedes/miscellanea:misc.Ode4
ltx/en_us_dedes/me.m06.d28:meMA.Ode4C1T.text	
ltx/en_us_dedes/me.m06.d28:meMA.Ode5C11.greekmelody	@ltx/en_us_dedes/he.h.m2:heHE.OTouFotosChorigos.greekname
ltx/en_us_dedes/me.m06.d28:meMA.Ode5C11.incipit	…
ltx/en_us_dedes/me.m06.d28:meMA.Ode5C11.melody	@ltx/en_us_dedes/he.h.m2:heHE.OTouFotosChorigos.name
ltx/en_us_dedes/me.m06.d28:meMA.Ode5C11.mode	@ltx/en_us_dedes/miscellanea:misc.Mode2
ltx/en_us_dedes/me.m06.d28:meMA.Ode5C11.ode	@ltx/en_us_dedes/miscellanea:misc.Ode5
ltx/en_us_dedes/me.m06.d28:meMA.Ode5C11.text	
ltx/en_us_dedes/me.m06.d28:meMA.Ode5C12.incipit	…
ltx/en_us_dedes/me.m06.d28:meMA.Ode5C12.melody	@ltx/en_us_dedes/he.h.m2:heHE.OTouFotosChorigos.name
ltx/en_us_dedes/me.m06.d28:meMA.Ode5C12.mode	@ltx/en_us_dedes/miscellanea:misc.Mode2
ltx/en_us_dedes/me.m06.d28:meMA.Ode5C12.ode	@ltx/en_us_dedes/miscellanea:misc.Ode5
ltx/en_us_dedes/me.m06.d28:meMA.Ode5C12.text	
ltx/en_us_dedes/me.m06.d28:meMA.Ode5C13.incipit	…
ltx/en_us_dedes/me.m06.d28:meMA.Ode5C13.melody	@ltx/en_us_dedes/he.h.m2:heHE.OTouFotosChorigos.name
ltx/en_us_dedes/me.m06.d28:meMA.Ode5C13.mode	@ltx/en_us_dedes/miscellanea:misc.Mode2
ltx/en_us_dedes/me.m06.d28:meMA.Ode5C13.ode	@ltx/en_us_dedes/miscellanea:misc.Ode5
ltx/en_us_dedes/me.m06.d28:meMA.Ode5C13.text	
ltx/en_us_dedes/me.m06.d28:meMA.Ode5C1T.incipit	…
ltx/en_us_dedes/me.m06.d28:meMA.Ode5C1T.melody	@ltx/en_us_dedes/he.h.m2:heHE.OTouFotosChorigos.name
ltx/en_us_dedes/me.m06.d28:meMA.Ode5C1T.mode	@ltx/en_us_dedes/miscellanea:misc.Mode2
ltx/en_us_dedes/me.m06.d28:meMA.Ode5C1T.ode	@ltx/en_us_dedes/miscellanea:misc.Ode5
ltx/en_us_dedes/me.m06.d28:meMA.Ode5C1T.text	
ltx/en_us_dedes/me.m06.d28:meMA.Ode6C11.greekmelody	@ltx/en_us_dedes/he.h.m2:heHE.EnAvyssoPtaismaton.greekname
ltx/en_us_dedes/me.m06.d28:meMA.Ode6C11.incipit	…
ltx/en_us_dedes/me.m06.d28:meMA.Ode6C11.melody	@ltx/en_us_dedes/he.h.m2:heHE.EnAvyssoPtaismaton.name
ltx/en_us_dedes/me.m06.d28:meMA.Ode6C11.mode	@ltx/en_us_dedes/miscellanea:misc.Mode2
ltx/en_us_dedes/me.m06.d28:meMA.Ode6C11.ode	@ltx/en_us_dedes/miscellanea:misc.Ode6
ltx/en_us_dedes/me.m06.d28:meMA.Ode6C11.text	
ltx/en_us_dedes/me.m06.d28:meMA.Ode6C12.incipit	…
ltx/en_us_dedes/me.m06.d28:meMA.Ode6C12.melody	@ltx/en_us_dedes/he.h.m2:heHE.EnAvyssoPtaismaton.name
ltx/en_us_dedes/me.m06.d28:meMA.Ode6C12.mode	@ltx/en_us_dedes/miscellanea:misc.Mode2
ltx/en_us_dedes/me.m06.d28:meMA.Ode6C12.ode	@ltx/en_us_dedes/miscellanea:misc.Ode6
ltx/en_us_dedes/me.m06.d28:meMA.Ode6C12.text	
ltx/en_us_dedes/me.m06.d28:meMA.Ode6C13.incipit	…
ltx/en_us_dedes/me.m06.d28:meMA.Ode6C13.melody	@ltx/en_us_dedes/he.h.m2:heHE.EnAvyssoPtaismaton.name
ltx/en_us_dedes/me.m06.d28:meMA.Ode6C13.mode	@ltx/en_us_dedes/miscellanea:misc.Mode2
ltx/en_us_dedes/me.m06.d28:meMA.Ode6C13.ode	@ltx/en_us_dedes/miscellanea:misc.Ode6
ltx/en_us_dedes/me.m06.d28:meMA.Ode6C13.text	
ltx/en_us_dedes/me.m06.d28:meMA.Ode6C1T.incipit	…
ltx/en_us_dedes/me.m06.d28:meMA.Ode6C1T.melody	@ltx/en_us_dedes/he.h.m2:heHE.EnAvyssoPtaismaton.name
ltx/en_us_dedes/me.m06.d28:meMA.Ode6C1T.mode	@ltx/en_us_dedes/miscellanea:misc.Mode2
ltx/en_us_dedes/me.m06.d28:meMA.Ode6C1T.ode	@ltx/en_us_dedes/miscellanea:misc.Ode6
ltx/en_us_dedes/me.m06.d28:meMA.Ode6C1T.text	
ltx/en_us_dedes/me.m06.d28:meMA.Ode6H.greekmelody	@ltx/en_us_dedes/he.h.m2:heHE.EnAvyssoPtaismaton.greekname
ltx/en_us_dedes/me.m06.d28:meMA.Ode6H.incipit	@ltx/en_us_dedes/he.h.m2:heHE.EnAvyssoPtaismaton.incipit
ltx/en_us_dedes/me.m06.d28:meMA.Ode6H.melody	@ltx/en_us_dedes/he.h.m2:heHE.EnAvyssoPtaismaton.melody
ltx/en_us_dedes/me.m06.d28:meMA.Ode6H.mode	@ltx/en_us_dedes/miscellanea:misc.Mode2
ltx/en_us_dedes/me.m06.d28:meMA.Ode6H.ode	@ltx/en_us_dedes/miscellanea:misc.Ode6
ltx/en_us_dedes/me.m06.d28:meMA.Ode6H.text	@ltx/en_us_dedes/he.h.m2:heHE.EnAvyssoPtaismaton.text
ltx/en_us_dedes/me.m06.d28:meMA.Ode7C11.greekmelody	@ltx/en_us_dedes/he.h.m2:heHE.EikonosChrysis.greekname
ltx/en_us_dedes/me.m06.d28:meMA.Ode7C11.incipit	…
ltx/en_us_dedes/me.m06.d28:meMA.Ode7C11.melody	@ltx/en_us_dedes/he.h.m2:heHE.EikonosChrysis.name
ltx/en_us_dedes/me.m06.d28:meMA.Ode7C11.mode	@ltx/en_us_dedes/miscellanea:misc.Mode2
ltx/en_us_dedes/me.m06.d28:meMA.Ode7C11.ode	@ltx/en_us_dedes/miscellanea:misc.Ode7
ltx/en_us_dedes/me.m06.d28:meMA.Ode7C11.text	
ltx/en_us_dedes/me.m06.d28:meMA.Ode7C12.incipit	…
ltx/en_us_dedes/me.m06.d28:meMA.Ode7C12.melody	@ltx/en_us_dedes/he.h.m2:heHE.EikonosChrysis.name
ltx/en_us_dedes/me.m06.d28:meMA.Ode7C12.mode	@ltx/en_us_dedes/miscellanea:misc.Mode2
ltx/en_us_dedes/me.m06.d28:meMA.Ode7C12.ode	@ltx/en_us_dedes/miscellanea:misc.Ode7
ltx/en_us_dedes/me.m06.d28:meMA.Ode7C12.text	
ltx/en_us_dedes/me.m06.d28:meMA.Ode7C13.incipit	…
ltx/en_us_dedes/me.m06.d28:meMA.Ode7C13.melody	@ltx/en_us_dedes/he.h.m2:heHE.EikonosChrysis.name
ltx/en_us_dedes/me.m06.d28:meMA.Ode7C13.mode	@ltx/en_us_dedes/miscellanea:misc.Mode2
ltx/en_us_dedes/me.m06.d28:meMA.Ode7C13.ode	@ltx/en_us_dedes/miscellanea:misc.Ode7
ltx/en_us_dedes/me.m06.d28:meMA.Ode7C13.text	
ltx/en_us_dedes/me.m06.d28:meMA.Ode7C1T.incipit	…
ltx/en_us_dedes/me.m06.d28:meMA.Ode7C1T.melody	@ltx/en_us_dedes/he.h.m2:heHE.EikonosChrysis.name
ltx/en_us_dedes/me.m06.d28:meMA.Ode7C1T.mode	@ltx/en_us_dedes/miscellanea:misc.Mode2
ltx/en_us_dedes/me.m06.d28:meMA.Ode7C1T.ode	@ltx/en_us_dedes/miscellanea:misc.Ode7
ltx/en_us_dedes/me.m06.d28:meMA.Ode7C1T.text	
ltx/en_us_dedes/me.m06.d28:meMA.Ode8C11.greekmelody	@ltx/en_us_dedes/he.h.m2:heHE.TonEnKaminoTouPyros.greekname
ltx/en_us_dedes/me.m06.d28:meMA.Ode8C11.incipit	…
ltx/en_us_dedes/me.m06.d28:meMA.Ode8C11.melody	@ltx/en_us_dedes/he.h.m2:heHE.TonEnKaminoTouPyros.name
ltx/en_us_dedes/me.m06.d28:meMA.Ode8C11.mode	@ltx/en_us_dedes/miscellanea:misc.Mode2
ltx/en_us_dedes/me.m06.d28:meMA.Ode8C11.ode	@ltx/en_us_dedes/miscellanea:misc.Ode8
ltx/en_us_dedes/me.m06.d28:meMA.Ode8C11.text	
ltx/en_us_dedes/me.m06.d28:meMA.Ode8C12.incipit	…
ltx/en_us_dedes/me.m06.d28:meMA.Ode8C12.melody	@ltx/en_us_dedes/he.h.m2:heHE.TonEnKaminoTouPyros.name
ltx/en_us_dedes/me.m06.d28:meMA.Ode8C12.mode	@ltx/en_us_dedes/miscellanea:misc.Mode2
ltx/en_us_dedes/me.m06.d28:meMA.Ode8C12.ode	@ltx/en_us_dedes/miscellanea:misc.Ode8
ltx/en_us_dedes/me.m06.d28:meMA.Ode8C12.text	
ltx/en_us_dedes/me.m06.d28:meMA.Ode8C13.incipit	…
ltx/en_us_dedes/me.m06.d28:meMA.Ode8C13.melody	@ltx/en_us_dedes/he.h.m2:heHE.TonEnKaminoTouPyros.name
ltx/en_us_dedes/me.m06.d28:meMA.Ode8C13.mode	@ltx/en_us_dedes/miscellanea:misc.Mode2
ltx/en_us_dedes/me.m06.d28:meMA.Ode8C13.ode	@ltx/en_us_dedes/miscellanea:misc.Ode8
ltx/en_us_dedes/me.m06.d28:meMA.Ode8C13.text	
ltx/en_us_dedes/me.m06.d28:meMA.Ode8C1T.incipit	…
ltx/en_us_dedes/me.m06.d28:meMA.Ode8C1T.melody	@ltx/en_us_dedes/he.h.m2:heHE.TonEnKaminoTouPyros.name
ltx/en_us_dedes/me.m06.d28:meMA.Ode8C1T.mode	@ltx/en_us_dedes/miscellanea:misc.Mode2
ltx/en_us_dedes/me.m06.d28:meMA.Ode8C1T.ode	@ltx/en_us_dedes/miscellanea:misc.Ode8
ltx/en_us_dedes/me.m06.d28:meMA.Ode8C1T.text	
ltx/en_us_dedes/me.m06.d28:meMA.Ode8C1Tr.incipit	…
ltx/en_us_dedes/me.m06.d28:meMA.Ode8C1Tr.melody	@ltx/en_us_dedes/he.h.m2:heHE.TonEnKaminoTouPyros.name
ltx/en_us_dedes/me.m06.d28:meMA.Ode8C1Tr.mode	@ltx/en_us_dedes/miscellanea:misc.Mode2
ltx/en_us_dedes/me.m06.d28:meMA.Ode8C1Tr.ode	@ltx/en_us_dedes/miscellanea:misc.Ode8
ltx/en_us_dedes/me.m06.d28:meMA.Ode8C1Tr.text	
ltx/en_us_dedes/me.m06.d28:meMA.Ode8H.greekmelody	@ltx/en_us_dedes/he.h.m2:heHE.TonEnKaminoTouPyros.greekname
ltx/en_us_dedes/me.m06.d28:meMA.Ode8H.incipit	@ltx/en_us_dedes/he.h.m2:heHE.TonEnKaminoTouPyros.incipit
ltx/en_us_dedes/me.m06.d28:meMA.Ode8H.melody	@ltx/en_us_dedes/he.h.m2:heHE.TonEnKaminoTouPyros.melody
ltx/en_us_dedes/me.m06.d28:meMA.Ode8H.mode	@ltx/en_us_dedes/miscellanea:misc.Mode2
ltx/en_us_dedes/me.m06.d28:meMA.Ode8H.ode	@ltx/en_us_dedes/miscellanea:misc.Ode8
ltx/en_us_dedes/me.m06.d28:meMA.Ode8H.text	@ltx/en_us_dedes/he.h.m2:heHE.TonEnKaminoTouPyros.text
ltx/en_us_dedes/me.m06.d28:meMA.Ode9C11.greekmelody	@ltx/en_us_dedes/he.h.m2:heHE.TonEkTheouTheonLogon.greekname
ltx/en_us_dedes/me.m06.d28:meMA.Ode9C11.incipit	…
ltx/en_us_dedes/me.m06.d28:meMA.Ode9C11.melody	@ltx/en_us_dedes/he.h.m2:heHE.TonEkTheouTheonLogon.name
ltx/en_us_dedes/me.m06.d28:meMA.Ode9C11.mode	@ltx/en_us_dedes/miscellanea:misc.Mode2
ltx/en_us_dedes/me.m06.d28:meMA.Ode9C11.ode	@ltx/en_us_dedes/miscellanea:misc.Ode9
ltx/en_us_dedes/me.m06.d28:meMA.Ode9C11.text	
ltx/en_us_dedes/me.m06.d28:meMA.Ode9C12.incipit	…
ltx/en_us_dedes/me.m06.d28:meMA.Ode9C12.melody	@ltx/en_us_dedes/he.h.m2:heHE.TonEkTheouTheonLogon.name
ltx/en_us_dedes/me.m06.d28:meMA.Ode9C12.mode	@ltx/en_us_dedes/miscellanea:misc.Mode2
ltx/en_us_dedes/me.m06.d28:meMA.Ode9C12.ode	@ltx/en_us_dedes/miscellanea:misc.Ode9
ltx/en_us_dedes/me.m06.d28:meMA.Ode9C12.text	
ltx/en_us_dedes/me.m06.d28:meMA.Ode9C13.incipit	…
ltx/en_us_dedes/me.m06.d28:meMA.Ode9C13.melody	@ltx/en_us_dedes/he.h.m2:heHE.TonEkTheouTheonLogon.name
ltx/en_us_dedes/me.m06.d28:meMA.Ode9C13.mode	@ltx/en_us_dedes/miscellanea:misc.Mode2
ltx/en_us_dedes/me.m06.d28:meMA.Ode9C13.ode	@ltx/en_us_dedes/miscellanea:misc.Ode9
ltx/en_us_dedes/me.m06.d28:meMA.Ode9C13.text	
ltx/en_us_dedes/me.m06.d28:meMA.Ode9C14.incipit	…
ltx/en_us_dedes/me.m06.d28:meMA.Ode9C14.melody	@ltx/en_us_dedes/he.h.m2:heHE.TonEkTheouTheonLogon.name
ltx/en_us_dedes/me.m06.d28:meMA.Ode9C14.mode	@ltx/en_us_dedes/miscellanea:misc.Mode2
ltx/en_us_dedes/me.m06.d28:meMA.Ode9C14.ode	@ltx/en_us_dedes/miscellanea:misc.Ode9
ltx/en_us_dedes/me.m06.d28:meMA.Ode9C14.text	
ltx/en_us_dedes/me.m06.d28:meMA.Ode9C1T.incipit	…
ltx/en_us_dedes/me.m06.d28:meMA.Ode9C1T.melody	@ltx/en_us_dedes/he.h.m2:heHE.TonEkTheouTheonLogon.name
ltx/en_us_dedes/me.m06.d28:meMA.Ode9C1T.mode	@ltx/en_us_dedes/miscellanea:misc.Mode2
ltx/en_us_dedes/me.m06.d28:meMA.Ode9C1T.ode	@ltx/en_us_dedes/miscellanea:misc.Ode9
ltx/en_us_dedes/me.m06.d28:meMA.Ode9C1T.text	
ltx/en_us_dedes/me.m06.d28:meMA.Ode9H.greekmelody	@ltx/en_us_dedes/he.h.m2:heHE.TonEkTheouTheonLogon.greekname
ltx/en_us_dedes/me.m06.d28:meMA.Ode9H.incipit	@ltx/en_us_dedes/he.h.m2:heHE.TonEkTheouTheonLogon.incipit
ltx/en_us_dedes/me.m06.d28:meMA.Ode9H.melody	@ltx/en_us_dedes/he.h.m2:heHE.TonEkTheouTheonLogon.melody
ltx/en_us_dedes/me.m06.d28:meMA.Ode9H.mode	@ltx/en_us_dedes/miscellanea:misc.Mode2
ltx/en_us_dedes/me.m06.d28:meMA.Ode9H.ode	@ltx/en_us_dedes/miscellanea:misc.Ode9
ltx/en_us_dedes/me.m06.d28:meMA.Ode9H.text	@ltx/en_us_dedes/he.h.m2:heHE.TonEkTheouTheonLogon.text
ltx/en_us_dedes/me.m06.d28:meMA.Oikos1.text	O Saints, when you dedicated yourselves to God, you endured all pain and torture, and you eagerly died for His sake, as brave Martyrs. Since your death, you are a source of divine gifts for all who suffer from various diseases and who are afflicted by many evils. I, the wretch, am chief among them, for I live with terrible pain of body and soul. But with faith I call out to you: Heal me! You are my holy physicians and doctors, Cyrus and John.
ltx/en_us_dedes/me.m06.d28:meVE.Apolytikion1ger.greekmelody	@ltx/en_us_dedes/he.a.m3:heAU.TheiasPisteos.greekname
ltx/en_us_dedes/me.m06.d28:meVE.Apolytikion1ger.incipit	…
ltx/en_us_dedes/me.m06.d28:meVE.Apolytikion1ger.melody	@ltx/en_us_dedes/he.a.m3:heAU.TheiasPisteos.name
ltx/en_us_dedes/me.m06.d28:meVE.Apolytikion1ger.mode	@ltx/en_us_dedes/miscellanea:misc.Mode3
ltx/en_us_dedes/me.m06.d28:meVE.Apolytikion1ger.poet	@ltx/en_us_dedes/poets:po.Gerasimou
ltx/en_us_dedes/me.m06.d28:meVE.Apolytikion1ger.text	
ltx/en_us_dedes/me.m06.d28:meVE.SticStavrotheotokion.greekmelody	@ltx/en_us_dedes/he.a.m4:heAU.OsGennaionEnMartysi.greekname
ltx/en_us_dedes/me.m06.d28:meVE.SticStavrotheotokion.incipit	@ltx/en_us_dedes/me.m02.d11:meVE.AposStavrotheotokion.incipit
ltx/en_us_dedes/me.m06.d28:meVE.SticStavrotheotokion.melody	@ltx/en_us_dedes/he.a.m4:heAU.OsGennaionEnMartysi.name
ltx/en_us_dedes/me.m06.d28:meVE.SticStavrotheotokion.mode	@ltx/en_us_dedes/miscellanea:misc.Mode4
ltx/en_us_dedes/me.m06.d28:meVE.SticStavrotheotokion.text	@ltx/en_us_dedes/me.m02.d11:meVE.AposStavrotheotokion.text
ltx/en_us_dedes/me.m06.d28:meVE.SticTheotokion.greekmelody	@ltx/en_us_dedes/he.a.m4:heAU.OsGennaionEnMartysi.greekname
ltx/en_us_dedes/me.m06.d28:meVE.SticTheotokion.incipit	@ltx/en_us_dedes/me.m06.d09:meVE.SticTheotokion.incipit
ltx/en_us_dedes/me.m06.d28:meVE.SticTheotokion.melody	@ltx/en_us_dedes/he.a.m4:heAU.OsGennaionEnMartysi.name
ltx/en_us_dedes/me.m06.d28:meVE.SticTheotokion.mode	@ltx/en_us_dedes/miscellanea:misc.Mode4
ltx/en_us_dedes/me.m06.d28:meVE.SticTheotokion.text	@ltx/en_us_dedes/me.m06.d09:meVE.SticTheotokion.text
ltx/en_us_dedes/me.m06.d28:meVE.Stichera01.greekmelody	@ltx/en_us_dedes/he.a.m4:heAU.OsGennaionEnMartysi.greekname
ltx/en_us_dedes/me.m06.d28:meVE.Stichera01.incipit	Let us honor those two…
ltx/en_us_dedes/me.m06.d28:meVE.Stichera01.melody	@ltx/en_us_dedes/he.a.m4:heAU.OsGennaionEnMartysi.name
ltx/en_us_dedes/me.m06.d28:meVE.Stichera01.mode	@ltx/en_us_dedes/miscellanea:misc.Mode4
ltx/en_us_dedes/me.m06.d28:meVE.Stichera01.text	Let us honor those two divine * holy Martyrs with songs of praise. * They possessed the radiance of the Trinity; * they are the pedestals of the faith, the flowers that give the true * sweetest fragrance from on high * of the knowledge of God indeed. * Let us all extol * blessed Cyrus and holy John together, as they intercede without cease * with the benevolent Lord for us.
ltx/en_us_dedes/me.m06.d28:meVE.Stichera02.incipit	You were truly illustrious *…
ltx/en_us_dedes/me.m06.d28:meVE.Stichera02.melody	@ltx/en_us_dedes/he.a.m4:heAU.OsGennaionEnMartysi.name
ltx/en_us_dedes/me.m06.d28:meVE.Stichera02.mode	@ltx/en_us_dedes/miscellanea:misc.Mode4
ltx/en_us_dedes/me.m06.d28:meVE.Stichera02.text	You were truly illustrious * in your life and ascetic feats, * glorious St. Cyrus, and later you adorned * your soul with contests of martyrdom. * And you, holy John most wise, * left the army here below * and instead joined the regiments * that are heavenly. * Now together, O blessed men, in earnest pray the Savior without ceasing * for us observing your memory.
ltx/en_us_dedes/me.m06.d28:meVE.Stichera03.incipit	Blessed men, you were shown…
ltx/en_us_dedes/me.m06.d28:meVE.Stichera03.melody	@ltx/en_us_dedes/he.a.m4:heAU.OsGennaionEnMartysi.name
ltx/en_us_dedes/me.m06.d28:meVE.Stichera03.mode	@ltx/en_us_dedes/miscellanea:misc.Mode4
ltx/en_us_dedes/me.m06.d28:meVE.Stichera03.text	Blessed men, you were shown to be * the physicians of the infirm, * never-setting stars of the true belief in God, * and with the martyrs you joined in their confession and martyrdom, * and you truly have received * crowns of victory from our God, * wise and glorious * holy Cyrus and John. And now we pray you ever supplicate the Savior * for us who faithfully sing your praise.
