ltx/en_us_dedes/pe.d122:peDA.commemoration.full	
ltx/en_us_dedes/pe.d122:peDA.commemoration.short	Tuesday after Pentecost
ltx/en_us_dedes/pe.d122:peDA.dismissal	@ltx/en_us_dedes/dismissals:dis00.pentecost
ltx/en_us_dedes/pe.d122:peDA.insert1	
ltx/en_us_dedes/pe.d122:peDA.insert2	
ltx/en_us_dedes/pe.d122:peDA.note	
ltx/en_us_dedes/pe.d122:peHO.commemorations	
ltx/en_us_dedes/pe.d122:peHO.daytitle	
ltx/en_us_dedes/pe.d122:peHO.description1	
ltx/en_us_dedes/pe.d122:peHO.description2	
ltx/en_us_dedes/pe.d122:peHO.note1	
ltx/en_us_dedes/pe.d122:peHO.note2	
ltx/en_us_dedes/pe.d122:peMA.AposGlory.incipit	@ltx/en_us_dedes/pe.d120:peVE.Stichera03.incipit
ltx/en_us_dedes/pe.d122:peMA.AposGlory.melody	@ltx/en_us_dedes/pe.d120:peVE.Stichera03.melody
ltx/en_us_dedes/pe.d122:peMA.AposGlory.mode	@ltx/en_us_dedes/pe.d120:peVE.Stichera03.mode
ltx/en_us_dedes/pe.d122:peMA.AposGlory.text	@ltx/en_us_dedes/pe.d120:peVE.Stichera03.text
ltx/en_us_dedes/pe.d122:peMA.Aposticha1.greekmelody	@ltx/en_us_dedes/he.a.m2:heAU.OikosTouEfratha.greekname
ltx/en_us_dedes/pe.d122:peMA.Aposticha1.incipit	Having essentially received * the…
ltx/en_us_dedes/pe.d122:peMA.Aposticha1.melody	@ltx/en_us_dedes/he.a.m2:heAU.OikosTouEfratha.name
ltx/en_us_dedes/pe.d122:peMA.Aposticha1.mode	@ltx/en_us_dedes/miscellanea:misc.Mode2
ltx/en_us_dedes/pe.d122:peMA.Aposticha1.text	Having essentially received * the Holy Spirit, * O Logos, Your Disciples * were totally illumined by brilliant light that comes from God.
ltx/en_us_dedes/pe.d122:peMA.Aposticha2.incipit	Tongues as of fire appeared…
ltx/en_us_dedes/pe.d122:peMA.Aposticha2.melody	@ltx/en_us_dedes/he.a.m2:heAU.OikosTouEfratha.name
ltx/en_us_dedes/pe.d122:peMA.Aposticha2.mode	@ltx/en_us_dedes/miscellanea:misc.Mode2
ltx/en_us_dedes/pe.d122:peMA.Aposticha2.text	Tongues as of fire appeared, * with mighty sound from heaven, * distributed and resting * on each of the Apostles, illumining, not burning them.
ltx/en_us_dedes/pe.d122:peMA.Aposticha3.incipit	Comforter, as You came *…
ltx/en_us_dedes/pe.d122:peMA.Aposticha3.melody	@ltx/en_us_dedes/he.a.m2:heAU.OikosTouEfratha.name
ltx/en_us_dedes/pe.d122:peMA.Aposticha3.mode	@ltx/en_us_dedes/miscellanea:misc.Mode2
ltx/en_us_dedes/pe.d122:peMA.Aposticha3.text	Comforter, as You came * before to the Apostles, * come now to us from heaven, * and sanctify and save us who say that You are truly God.
ltx/en_us_dedes/pe.d122:peMA.Kathisma11.greekmelody	@ltx/en_us_dedes/he.a.m1:heAU.TonTafonSouSotir.greekname
ltx/en_us_dedes/pe.d122:peMA.Kathisma11.incipit	I glorify, extol, and I…
ltx/en_us_dedes/pe.d122:peMA.Kathisma11.melody	@ltx/en_us_dedes/he.a.m1:heAU.TonTafonSouSotir.name
ltx/en_us_dedes/pe.d122:peMA.Kathisma11.mode	@ltx/en_us_dedes/miscellanea:misc.Mode1
ltx/en_us_dedes/pe.d122:peMA.Kathisma11.text	I glorify, extol, and I worship together * the Father and the Son * and the all-holy Spirit, * as one in divinity and distinct in their attributes. * With this wisdom now the Spirit filled the Apostles * of the Savior Christ, in order that they might preach it * to all men throughout the world.
ltx/en_us_dedes/pe.d122:peMA.Kathisma21.greekmelody	@ltx/en_us_dedes/he.a.m1:heAU.TonTafonSouSotir.greekname
ltx/en_us_dedes/pe.d122:peMA.Kathisma21.incipit	Amazingly the grace of the…
ltx/en_us_dedes/pe.d122:peMA.Kathisma21.melody	@ltx/en_us_dedes/he.a.m1:heAU.TonTafonSouSotir.name
ltx/en_us_dedes/pe.d122:peMA.Kathisma21.mode	@ltx/en_us_dedes/miscellanea:misc.Mode1
ltx/en_us_dedes/pe.d122:peMA.Kathisma21.text	Amazingly the grace of the Spirit from heaven * came down in fiery form on the Savior’s Disciples, * and fully enlightened them and it made them most luminous, * as they went and preached the Holy Trinity’s oneness, * single power, and single dominion and kingdom, * which we faithfully glorify.
ltx/en_us_dedes/pe.d122:peVE.AposGlory.incipit	@ltx/en_us_dedes/pe.d120:peVE.Stichera02.incipit
ltx/en_us_dedes/pe.d122:peVE.AposGlory.melody	@ltx/en_us_dedes/pe.d120:peVE.Stichera02.melody
ltx/en_us_dedes/pe.d122:peVE.AposGlory.mode	@ltx/en_us_dedes/pe.d120:peVE.Stichera02.mode
ltx/en_us_dedes/pe.d122:peVE.AposGlory.text	@ltx/en_us_dedes/pe.d120:peVE.Stichera02.text
ltx/en_us_dedes/pe.d122:peVE.Aposticha1.greekmelody	@ltx/en_us_dedes/he.a.m2:heAU.OikosTouEfratha.greekname
ltx/en_us_dedes/pe.d122:peVE.Aposticha1.incipit	Logos and Son of God…
ltx/en_us_dedes/pe.d122:peVE.Aposticha1.melody	@ltx/en_us_dedes/he.a.m2:heAU.OikosTouEfratha.name
ltx/en_us_dedes/pe.d122:peVE.Aposticha1.mode	@ltx/en_us_dedes/miscellanea:misc.Mode2
ltx/en_us_dedes/pe.d122:peVE.Aposticha1.text	Logos and Son of God, * indeed as You had promised, * You sent to Your Disciples * Your divine Holy Spirit, and thereby You illumined them.
ltx/en_us_dedes/pe.d122:peVE.Aposticha2.incipit	Suddenly from on high, *…
ltx/en_us_dedes/pe.d122:peVE.Aposticha2.melody	@ltx/en_us_dedes/he.a.m2:heAU.OikosTouEfratha.name
ltx/en_us_dedes/pe.d122:peVE.Aposticha2.mode	@ltx/en_us_dedes/miscellanea:misc.Mode2
ltx/en_us_dedes/pe.d122:peVE.Aposticha2.text	Suddenly from on high, * the full and promised power * of the all-holy Spirit * made the Apostles all wise * and theologians God-inspired.
ltx/en_us_dedes/pe.d122:peVE.Aposticha3.incipit	When the foreigners heard *…
ltx/en_us_dedes/pe.d122:peVE.Aposticha3.melody	@ltx/en_us_dedes/he.a.m2:heAU.OikosTouEfratha.name
ltx/en_us_dedes/pe.d122:peVE.Aposticha3.mode	@ltx/en_us_dedes/miscellanea:misc.Mode2
ltx/en_us_dedes/pe.d122:peVE.Aposticha3.text	When the foreigners heard * the Lord’s divine Apostles * speaking in their own language, * they were bewildered hearing them magnify the Trinity.
ltx/en_us_dedes/pe.d122:peVE.SticGlory.incipit	@ltx/en_us_dedes/pe.d120:peVE.Stichera01.incipit
ltx/en_us_dedes/pe.d122:peVE.SticGlory.melody	@ltx/en_us_dedes/pe.d120:peVE.Stichera01.melody
ltx/en_us_dedes/pe.d122:peVE.SticGlory.mode	@ltx/en_us_dedes/pe.d120:peVE.Stichera01.mode
ltx/en_us_dedes/pe.d122:peVE.SticGlory.text	@ltx/en_us_dedes/pe.d120:peVE.Stichera01.text
ltx/en_us_dedes/pe.d122:peVE.Stichera01.greekmelody	@ltx/en_us_dedes/he.a.m1:heAU.TonOuranionTagmaton.greekname
ltx/en_us_dedes/pe.d122:peVE.Stichera01.incipit	Restored and now consecrated *…
ltx/en_us_dedes/pe.d122:peVE.Stichera01.melody	@ltx/en_us_dedes/he.a.m1:heAU.TonOuranionTagmaton.name
ltx/en_us_dedes/pe.d122:peVE.Stichera01.mode	@ltx/en_us_dedes/miscellanea:misc.Mode1
ltx/en_us_dedes/pe.d122:peVE.Stichera01.text	Restored and now consecrated * are the Apostles’ tongues, * that all might hear them telling * in their own tongues the mighty * works of God, so that all who dwell on the earth * be through strange words and tongues of fire * assured that truly salvation has come to us, * as a sign now to the nations all.
ltx/en_us_dedes/pe.d122:peVE.Stichera02.incipit	O Christ our God, as…
ltx/en_us_dedes/pe.d122:peVE.Stichera02.melody	@ltx/en_us_dedes/he.a.m1:heAU.TonOuranionTagmaton.name
ltx/en_us_dedes/pe.d122:peVE.Stichera02.mode	@ltx/en_us_dedes/miscellanea:misc.Mode1
ltx/en_us_dedes/pe.d122:peVE.Stichera02.text	O Christ our God, as You promised * to Your Disciples, that You * would send them power from heaven, * in fulfillment You send it, * that is Your Holy Spirit, thus proving to us * that indeed Your are Truth itself, * and that no one who invests all their hope in You * will regret it, O benevolent Lord.
ltx/en_us_dedes/pe.d122:peVE.Stichera03.incipit	The time had come and…
ltx/en_us_dedes/pe.d122:peVE.Stichera03.melody	@ltx/en_us_dedes/he.a.m1:heAU.TonOuranionTagmaton.name
ltx/en_us_dedes/pe.d122:peVE.Stichera03.mode	@ltx/en_us_dedes/miscellanea:misc.Mode1
ltx/en_us_dedes/pe.d122:peVE.Stichera03.text	The time had come and You sent down * Your holy Paraclete * into the world, O Savior, * in tongues like as of fire, * to burn up all the sins and transgressions of all * in divine fire, and to give * to us who faithfully say He is truly God * genuine communion with Him.
