ltx/en_us_dedes/me.m10.d18:alt1.meMA.Kathisma11.greekmelody	@ltx/en_us_dedes/he.a.m8:heAU.TinSofianKaiLogon.greekname
ltx/en_us_dedes/me.m10.d18:alt1.meMA.Kathisma11.incipit	You shine forth to the…
ltx/en_us_dedes/me.m10.d18:alt1.meMA.Kathisma11.melody	@ltx/en_us_dedes/he.a.m8:heAU.TinSofianKaiLogon.name
ltx/en_us_dedes/me.m10.d18:alt1.meMA.Kathisma11.mode	@ltx/en_us_dedes/miscellanea:misc.Mode8
ltx/en_us_dedes/me.m10.d18:alt1.meMA.Kathisma11.text	You shine forth to the worthy the words of life * and the teachings that save, by your fiery tongue, * enriching believer’s hearts, O Apostle inspired by God. * But from the unbelievers, the same words, like fireballs, * cut down the thorns of darkness, completely uprooting them. * Therefore by the whole world you are highly regarded, * for you, O Evangelist, wrote the Gospel of Jesus Christ, O all-holy and blessed Luke. * Intercede with Christ our God * that He grant forgiveness of offenses * to those who with longing observe your holy memory.
ltx/en_us_dedes/me.m10.d18:alt1.meMA.Kathisma12.greekmelody	@ltx/en_us_dedes/he.a.m8:heAU.TinSofianKaiLogon.greekname
ltx/en_us_dedes/me.m10.d18:alt1.meMA.Kathisma12.incipit	When the grace of the…
ltx/en_us_dedes/me.m10.d18:alt1.meMA.Kathisma12.melody	@ltx/en_us_dedes/he.a.m8:heAU.TinSofianKaiLogon.name
ltx/en_us_dedes/me.m10.d18:alt1.meMA.Kathisma12.mode	@ltx/en_us_dedes/miscellanea:misc.Mode8
ltx/en_us_dedes/me.m10.d18:alt1.meMA.Kathisma12.text	When the grace of the Spirit was richly poured * on your head, it made you a herald of peace. * O blessed one, being thus illumined by the light of grace, * you were counted worthy to write down in your own hand * the Gospel for the lovers of God, like Theophilus. * Wisely you recorded the divine holy secrets. * Your tongue thus became the pen of a swift-writing scribe, O Luke, * even as the Psalmist said. * Intercede with Christ our God * that He grant forgiveness of offenses * to those who with longing observe your holy memory.
ltx/en_us_dedes/me.m10.d18:alt1.meMA.Kathisma1T.incipit	@ltx/en_us_dedes/me.m06.d29:meMA.Kathisma2T.incipit
ltx/en_us_dedes/me.m10.d18:alt1.meMA.Kathisma1T.melody	@ltx/en_us_dedes/me.m06.d29:meMA.Kathisma2T.melody
ltx/en_us_dedes/me.m10.d18:alt1.meMA.Kathisma1T.mode	@ltx/en_us_dedes/me.m06.d29:meMA.Kathisma2T.mode
ltx/en_us_dedes/me.m10.d18:alt1.meMA.Kathisma1T.text	@ltx/en_us_dedes/me.m06.d29:meMA.Kathisma2T.text
ltx/en_us_dedes/me.m10.d18:alt1.meMA.Kathisma21.greekmelody	@ltx/en_us_dedes/he.a.m4:heAU.KateplagiIosif.greekname
ltx/en_us_dedes/me.m10.d18:alt1.meMA.Kathisma21.incipit	Is there any human tongue…
ltx/en_us_dedes/me.m10.d18:alt1.meMA.Kathisma21.melody	@ltx/en_us_dedes/he.a.m4:heAU.KateplagiIosif.name
ltx/en_us_dedes/me.m10.d18:alt1.meMA.Kathisma21.mode	@ltx/en_us_dedes/miscellanea:misc.Mode4
ltx/en_us_dedes/me.m10.d18:alt1.meMA.Kathisma21.text	Is there any human tongue that can extol you as is right? * Surely not, except for that of the most wise Apostle Paul. * For he made mention of you in his Epistles, * calling you, O Luke, his fellow laborer * and beloved Physician, O Evangelist. * You were together with him in his struggles, * and you share the crowns with him as well. * And now with one voice, to you we cry out: * Pray to the Lord to save our souls.
ltx/en_us_dedes/me.m10.d18:alt1.meMA.Kathisma2T.greekmelody	@ltx/en_us_dedes/he.a.m4:heAU.KateplagiIosif.greekname
ltx/en_us_dedes/me.m10.d18:alt1.meMA.Kathisma2T.incipit	@ltx/en_us_dedes/he.a.m4:heAU.KateplagiIosif.incipit
ltx/en_us_dedes/me.m10.d18:alt1.meMA.Kathisma2T.melody	@ltx/en_us_dedes/he.a.m4:heAU.KateplagiIosif.melody
ltx/en_us_dedes/me.m10.d18:alt1.meMA.Kathisma2T.mode	@ltx/en_us_dedes/miscellanea:misc.Mode4
ltx/en_us_dedes/me.m10.d18:alt1.meMA.Kathisma2T.text	@ltx/en_us_dedes/he.a.m4:heAU.KateplagiIosif.text
ltx/en_us_dedes/me.m10.d18:alt1.meMA.Kathisma31.greekmelody	@ltx/en_us_dedes/he.a.m8:heAU.TinSofianKaiLogon.greekname
ltx/en_us_dedes/me.m10.d18:alt1.meMA.Kathisma31.incipit	With the net of your…
ltx/en_us_dedes/me.m10.d18:alt1.meMA.Kathisma31.melody	@ltx/en_us_dedes/he.a.m8:heAU.TinSofianKaiLogon.name
ltx/en_us_dedes/me.m10.d18:alt1.meMA.Kathisma31.mode	@ltx/en_us_dedes/miscellanea:misc.Mode8
ltx/en_us_dedes/me.m10.d18:alt1.meMA.Kathisma31.text	With the net of your sacred and godly words * O Apostle, you caught the rational fish. * You offered them to our God as the first-fruits, O blessed one. * And you taught and wrote down the Gospel of Jesus Christ, * and you authored the Acts of the Apostles for us to read. * Therefore bound by duty we assemble to honor * the feast of your memory, O Saint Luke the Evangelist, * and together we cry to you: * Intercede with Christ our God * that He grant forgiveness of offenses * to those who with longing observe your holy memory.
ltx/en_us_dedes/me.m10.d18:alt1.meMA.Kathisma32.greekmelody	@ltx/en_us_dedes/he.a.m8:heAU.TinSofianKaiLogon.greekname
ltx/en_us_dedes/me.m10.d18:alt1.meMA.Kathisma32.incipit	O Apostle, the Savior opened…
ltx/en_us_dedes/me.m10.d18:alt1.meMA.Kathisma32.melody	@ltx/en_us_dedes/he.a.m8:heAU.TinSofianKaiLogon.name
ltx/en_us_dedes/me.m10.d18:alt1.meMA.Kathisma32.mode	@ltx/en_us_dedes/miscellanea:misc.Mode8
ltx/en_us_dedes/me.m10.d18:alt1.meMA.Kathisma32.text	O Apostle, the Savior opened your mind * on the road, and directly you understood * the words that were God-inspired. * And when Christ had instructed you * in all heavenly wisdom, He made you an initiate * of grace divine, for He found your mind to be excellent. * Therefore He appointed you as principal herald, * to shine with His beautiful * rays of light, O Evangelist * all-admired Apostle Luke. * Intercede with Christ our God * that He grant forgiveness of offenses * to those who with longing observe your holy memory.
ltx/en_us_dedes/me.m10.d18:alt1.meMA.Kathisma3T.incipit	@ltx/en_us_dedes/me.m12.d12:meMA.Kathisma3T.incipit
ltx/en_us_dedes/me.m10.d18:alt1.meMA.Kathisma3T.melody	@ltx/en_us_dedes/me.m12.d12:meMA.Kathisma3T.melody
ltx/en_us_dedes/me.m10.d18:alt1.meMA.Kathisma3T.mode	@ltx/en_us_dedes/me.m12.d12:meMA.Kathisma3T.mode
ltx/en_us_dedes/me.m10.d18:alt1.meMA.Kathisma3T.text	@ltx/en_us_dedes/me.m12.d12:meMA.Kathisma3T.text
ltx/en_us_dedes/me.m10.d18:alt1.meMA.Lauds1.greekmelody	@ltx/en_us_dedes/he.a.m1:heAU.TonOuranionTagmaton.greekname
ltx/en_us_dedes/me.m10.d18:alt1.meMA.Lauds1.incipit	O congregations of Christians, come…
ltx/en_us_dedes/me.m10.d18:alt1.meMA.Lauds1.melody	@ltx/en_us_dedes/he.a.m1:heAU.TonOuranionTagmaton.name
ltx/en_us_dedes/me.m10.d18:alt1.meMA.Lauds1.mode	@ltx/en_us_dedes/miscellanea:misc.Mode1
ltx/en_us_dedes/me.m10.d18:alt1.meMA.Lauds1.text	O congregations of Christians, come let us celebrate * this sacred feast, and cry out * psalms and hymns as we honor * Luke, the God-inspired disciple of Christ, * and extol him with godly songs. * For he is always entreating on our behalf, * and he prays the Lord to save our souls.
ltx/en_us_dedes/me.m10.d18:alt1.meMA.Lauds2.incipit	Glorious Luke, you were truly…
ltx/en_us_dedes/me.m10.d18:alt1.meMA.Lauds2.melody	@ltx/en_us_dedes/he.a.m1:heAU.TonOuranionTagmaton.name
ltx/en_us_dedes/me.m10.d18:alt1.meMA.Lauds2.mode	@ltx/en_us_dedes/miscellanea:misc.Mode1
ltx/en_us_dedes/me.m10.d18:alt1.meMA.Lauds2.text	Glorious Luke, you were truly in the Apostles’ choir, * as a physician, disciple, * and trustworthy eyewitness, * mystic of the myst’ries of God; and you led * all the earth to the light of God. * You were the travel companion of holy Paul. * Ever pray with him that we be saved.
ltx/en_us_dedes/me.m10.d18:alt1.meMA.Lauds3.incipit	Blessed Apostle, you stand now…
ltx/en_us_dedes/me.m10.d18:alt1.meMA.Lauds3.melody	@ltx/en_us_dedes/he.a.m1:heAU.TonOuranionTagmaton.name
ltx/en_us_dedes/me.m10.d18:alt1.meMA.Lauds3.mode	@ltx/en_us_dedes/miscellanea:misc.Mode1
ltx/en_us_dedes/me.m10.d18:alt1.meMA.Lauds3.text	Blessed Apostle, you stand now * within the Trinity’s light. * Therefore as we observe now * your divine and all-holy * splendid feast, illumine our hearts with that light, * O inspired Evangelist. * And with your earnest entreaties on our behalf, * pray to God that He be merciful.
ltx/en_us_dedes/me.m10.d18:alt1.meMA.MM.Lauds123as456.text	@ltx/en_us_dedes/properties:media.key
ltx/en_us_dedes/me.m10.d18:alt1.meMA.PostGospelBoth.incipit	@ltx/en_us_dedes/ho.ho03:hoMA.PostGospelTheotokos.incipit
ltx/en_us_dedes/me.m10.d18:alt1.meMA.PostGospelBoth.melody	
ltx/en_us_dedes/me.m10.d18:alt1.meMA.PostGospelBoth.mode	@ltx/en_us_dedes/miscellanea:misc.Mode2
ltx/en_us_dedes/me.m10.d18:alt1.meMA.PostGospelBoth.text	@ltx/en_us_dedes/ho.ho03:hoMA.PostGospelTheotokos.text
ltx/en_us_dedes/me.m10.d18:alt1.meMA.PostGospelGlory.incipit	@ltx/en_us_dedes/ho.ho03:hoMA.PostGospelApostle.incipit
ltx/en_us_dedes/me.m10.d18:alt1.meMA.PostGospelGlory.melody	
ltx/en_us_dedes/me.m10.d18:alt1.meMA.PostGospelGlory.mode	@ltx/en_us_dedes/miscellanea:misc.Mode2
ltx/en_us_dedes/me.m10.d18:alt1.meMA.PostGospelGlory.text	@ltx/en_us_dedes/ho.ho03:hoMA.PostGospelApostle.text
ltx/en_us_dedes/me.m10.d18:alt1.meMA.PostGospelIdiomelon.incipit	@ltx/en_us_dedes/me.m10.d18:meVE.AposGlory.incipit
ltx/en_us_dedes/me.m10.d18:alt1.meMA.PostGospelIdiomelon.melody	
ltx/en_us_dedes/me.m10.d18:alt1.meMA.PostGospelIdiomelon.mode	@ltx/en_us_dedes/miscellanea:misc.Mode6
ltx/en_us_dedes/me.m10.d18:alt1.meMA.PostGospelIdiomelon.text	@ltx/en_us_dedes/me.m10.d18:meVE.AposGlory.text
ltx/en_us_dedes/me.m10.d18:alt1.meVE.Apolytikion3.greekmelody	@ltx/en_us_dedes/he.a.m1:heAU.TisErimouPolitis.greekname
ltx/en_us_dedes/me.m10.d18:alt1.meVE.Apolytikion3.incipit	The offspring of Antioch are…
ltx/en_us_dedes/me.m10.d18:alt1.meVE.Apolytikion3.melody	@ltx/en_us_dedes/he.a.m1:heAU.TisErimouPolitis.name
ltx/en_us_dedes/me.m10.d18:alt1.meVE.Apolytikion3.mode	@ltx/en_us_dedes/miscellanea:misc.Mode1
ltx/en_us_dedes/me.m10.d18:alt1.meVE.Apolytikion3.text	The offspring of Antioch are you and the pride and joy * of the world, O holy physician, Apostle Luke the Evangelist. * Moreover you were first to depict * the icon of the Mother of God. * Glory to Christ who glorified you! * Glory to Him who made you marvelous! * Glory to Him who through you grants * healings of every kind.
ltx/en_us_dedes/me.m10.d18:alt1.meVE.Lity1.incipit	O Apostle Luke, you dismissed…
ltx/en_us_dedes/me.m10.d18:alt1.meVE.Lity1.melody	@ltx/en_us_dedes/miscellanea:misc.Idiomelon
ltx/en_us_dedes/me.m10.d18:alt1.meVE.Lity1.mode	@ltx/en_us_dedes/miscellanea:misc.Mode2
ltx/en_us_dedes/me.m10.d18:alt1.meVE.Lity1.text	O Apostle Luke, you dismissed the world and followed Christ. You hid His teachings in the room of your heart and became an Apostle. Therefore you went among the nations, whose souls were darkened by error and the sinful passions; and with the Savior’s commandments you enlightened them to believe in the consubstantial Trinity.
ltx/en_us_dedes/me.m10.d18:alt1.meVE.Lity2.incipit	@ltx/en_us_dedes/me.m10.d18:meVE.Aposticha4.incipit
ltx/en_us_dedes/me.m10.d18:alt1.meVE.Lity2.melody	@ltx/en_us_dedes/miscellanea:misc.Idiomelon
ltx/en_us_dedes/me.m10.d18:alt1.meVE.Lity2.mode	@ltx/en_us_dedes/miscellanea:misc.Mode4
ltx/en_us_dedes/me.m10.d18:alt1.meVE.Lity2.text	@ltx/en_us_dedes/me.m10.d18:meVE.Aposticha4.text
ltx/en_us_dedes/me.m10.d18:alt1.meVE.Lity3.incipit	@ltx/en_us_dedes/me.m10.d18:meMA.Lauds4.incipit
ltx/en_us_dedes/me.m10.d18:alt1.meVE.Lity3.melody	@ltx/en_us_dedes/miscellanea:misc.Idiomelon
ltx/en_us_dedes/me.m10.d18:alt1.meVE.Lity3.mode	@ltx/en_us_dedes/miscellanea:misc.Mode8
ltx/en_us_dedes/me.m10.d18:alt1.meVE.Lity3.text	@ltx/en_us_dedes/me.m10.d18:meMA.Lauds4.text
ltx/en_us_dedes/me.m10.d18:alt1.meVE.LityBoth.incipit	Lady and Mother of God…
ltx/en_us_dedes/me.m10.d18:alt1.meVE.LityBoth.melody	@ltx/en_us_dedes/he.a.m8:heAU.OTouParadoxou.name
ltx/en_us_dedes/me.m10.d18:alt1.meVE.LityBoth.mode	@ltx/en_us_dedes/miscellanea:misc.Mode8
ltx/en_us_dedes/me.m10.d18:alt1.meVE.LityBoth.text	Lady and Mother of God, rejoice! * Rejoice, the singular hope * and the help of humanity. * Shelter of the world, rejoice! * Golden lampstand of light, rejoice! * The decorated palace of God, rejoice! * Rejoice, the torch that is shining brilliantly! * O all-immaculate * jewel of virginity! Rejoice, the spring * gushing forth with cures to all who come to you with faith.
ltx/en_us_dedes/me.m10.d18:alt1.meVE.LityGlory.incipit	When you were filled with…
ltx/en_us_dedes/me.m10.d18:alt1.meVE.LityGlory.melody	@ltx/en_us_dedes/miscellanea:misc.Idiomelon
ltx/en_us_dedes/me.m10.d18:alt1.meVE.LityGlory.mode	@ltx/en_us_dedes/miscellanea:misc.Mode8
ltx/en_us_dedes/me.m10.d18:alt1.meVE.LityGlory.text	When you were filled with the Holy Spirit, and on fire with the brightness of the uncreated Trinity, like a brilliant star you illumined the entire earth, O Luke, as one who speaks the words of God. Armed with the Cross, you cured all diseases by word alone, healing the passions of the soul and every sickness of body. By his intercessions, O Christ our God, send down to us Your mercies, in Your benevolence.
ltx/en_us_dedes/me.m10.d18:meDA.commemoration.first	Memory of the Holy Apostle and Evangelist Luke
ltx/en_us_dedes/me.m10.d18:meDA.commemoration.first_name	St. Luke
ltx/en_us_dedes/me.m10.d18:meDA.commemoration.first_short	Memory of the Holy Apostle and Evangelist Luke
ltx/en_us_dedes/me.m10.d18:meDA.commemoration.first_title	@ltx/en_us_dedes/titles:ti.Evangelist
ltx/en_us_dedes/me.m10.d18:meDA.commemoration.full	Memory of the Holy Apostle and Evangelist Luke
ltx/en_us_dedes/me.m10.d18:meDA.commemoration.second_name	
ltx/en_us_dedes/me.m10.d18:meDA.commemoration.second_title	
ltx/en_us_dedes/me.m10.d18:meDA.date	October 18
ltx/en_us_dedes/me.m10.d18:meDA.fordate	for October 18
ltx/en_us_dedes/me.m10.d18:meDA.insert1	of the holy and glorious Apostle and Evangelist Luke,
ltx/en_us_dedes/me.m10.d18:meDA.insert2	whose memory we celebrate;
ltx/en_us_dedes/me.m10.d18:meDA.note	
ltx/en_us_dedes/me.m10.d18:meDA.pdfcoverdate	October 18,
ltx/en_us_dedes/me.m10.d18:meDA.pdfheaderdate	October 18
ltx/en_us_dedes/me.m10.d18:meHO.commemorations	
ltx/en_us_dedes/me.m10.d18:meHO.note1	
ltx/en_us_dedes/me.m10.d18:meHO.note2	
ltx/en_us_dedes/me.m10.d18:meHO.number	
ltx/en_us_dedes/me.m10.d18:meHO.rank	
ltx/en_us_dedes/me.m10.d18:meLE.commemoration1	The Holy Apostle and Evangelist Luke.
ltx/en_us_dedes/me.m10.d18:meLE.commemoration2	
ltx/en_us_dedes/me.m10.d18:meLI.Kontakion1.greekmelody	@ltx/en_us_dedes/me.m10.d18:meMA.Kontakion1.greekmelody
ltx/en_us_dedes/me.m10.d18:meLI.Kontakion1.incipit	@ltx/en_us_dedes/me.m10.d18:meMA.Kontakion1.incipit
ltx/en_us_dedes/me.m10.d18:meLI.Kontakion1.melody	@ltx/en_us_dedes/me.m10.d18:meMA.Kontakion1.melody
ltx/en_us_dedes/me.m10.d18:meLI.Kontakion1.mode	@ltx/en_us_dedes/me.m10.d18:meMA.Kontakion1.mode
ltx/en_us_dedes/me.m10.d18:meLI.Kontakion1.text	@ltx/en_us_dedes/me.m10.d18:meMA.Kontakion1.text
ltx/en_us_dedes/me.m10.d18:meLI.MM.CommunionHymn.text	@ltx/en_us_dedes/properties:media.key
ltx/en_us_dedes/me.m10.d18:meLI.Megalynarion.text	
ltx/en_us_dedes/me.m10.d18:meMA.C1.poet	@ltx/en_us_dedes/poets:po.Theofanous
ltx/en_us_dedes/me.m10.d18:meMA.C1.title	@ltx/en_us_dedes/titles:ti.CanonEvangelist
ltx/en_us_dedes/me.m10.d18:meMA.C1.verse	@ltx/en_us_dedes/prayers:pr.verse_Apostle.text
ltx/en_us_dedes/me.m10.d18:meMA.ExapTheotokion.incipit	All-holy Lady, Queen of all…
ltx/en_us_dedes/me.m10.d18:meMA.ExapTheotokion.melody	@ltx/en_us_dedes/he.a.m2:heAU.ToisMathitaisSynelthomen.name
ltx/en_us_dedes/me.m10.d18:meMA.ExapTheotokion.mode	@ltx/en_us_dedes/miscellanea:misc.Mode2
ltx/en_us_dedes/me.m10.d18:meMA.ExapTheotokion.text	All-holy Lady, Queen of all, * anticipate our perils, * anticipate our troubles all. * Be with us when we need you, * especially on our last day, * lest Satan or perdition * or Hades take us unopposed. * Rather may we without guilt on Judgment Day * stand before your Son’s frightening tribunal. * For, as God’s Mother, you can do * whatever you desire.
ltx/en_us_dedes/me.m10.d18:meMA.Exaposteilarion1.greekmelody	@ltx/en_us_dedes/he.a.m2:heAU.ToisMathitaisSynelthomen.greekname
ltx/en_us_dedes/me.m10.d18:meMA.Exaposteilarion1.incipit	Seer of God and oracle…
ltx/en_us_dedes/me.m10.d18:meMA.Exaposteilarion1.melody	@ltx/en_us_dedes/he.a.m2:heAU.ToisMathitaisSynelthomen.name
ltx/en_us_dedes/me.m10.d18:meMA.Exaposteilarion1.mode	@ltx/en_us_dedes/miscellanea:misc.Mode2
ltx/en_us_dedes/me.m10.d18:meMA.Exaposteilarion1.text	Seer of God and oracle, * mystic of holy secrets, * Teacher of Gentiles everywhere, * join Saint Paul and the Virgin, most holy pure Theotokos, * whose icon you, with much love, * depicted first and left to us, * and all together earnestly pray for us * who now call you blessed and yearly honor * the sacred day of your repose, * Luke, the Lord Christ’s Apostle.
ltx/en_us_dedes/me.m10.d18:meMA.Kontakion1.greekmelody	@ltx/en_us_dedes/he.a.m4:heAU.EpefanisSimeron.greekname
ltx/en_us_dedes/me.m10.d18:meMA.Kontakion1.incipit	A disciple you became of…
ltx/en_us_dedes/me.m10.d18:meMA.Kontakion1.melody	@ltx/en_us_dedes/he.a.m4:heAU.EpefanisSimeron.name
ltx/en_us_dedes/me.m10.d18:meMA.Kontakion1.mode	@ltx/en_us_dedes/miscellanea:misc.Mode4
ltx/en_us_dedes/me.m10.d18:meMA.Kontakion1.text	A disciple you became of the divine Word. And with Paul, the chosen one, you led the world into the light and drove the darkness of ignorance away by writing the Gospel of Christ our God.
ltx/en_us_dedes/me.m10.d18:meMA.Lauds1.greekmelody	@ltx/en_us_dedes/he.a.m1:heAU.PaneffimoiMartyres.greekname
ltx/en_us_dedes/me.m10.d18:meMA.Lauds1.incipit	With hymns, O believers, let…
ltx/en_us_dedes/me.m10.d18:meMA.Lauds1.melody	@ltx/en_us_dedes/he.a.m1:heAU.PaneffimoiMartyres.name
ltx/en_us_dedes/me.m10.d18:meMA.Lauds1.mode	@ltx/en_us_dedes/miscellanea:misc.Mode1
ltx/en_us_dedes/me.m10.d18:meMA.Lauds1.note	The Lauds prosomoia in English were recast in the meter of a more familiar Original Melody in Mode 1.
ltx/en_us_dedes/me.m10.d18:meMA.Lauds1.text	With hymns, O believers, let us praise * the divine Apostle Luke. * He was a wise Gospel writer, a disciple of the Lord, * and a living image * of the Chosen Vessel Paul, * he publicized the wonders of God. And now all churches honor him. * He enlightened us who dwell on earth, * through divine grace, * with rays of theology.
ltx/en_us_dedes/me.m10.d18:meMA.Lauds2.incipit	You mastered the medicine of…
ltx/en_us_dedes/me.m10.d18:meMA.Lauds2.melody	@ltx/en_us_dedes/he.a.m1:heAU.PaneffimoiMartyres.name
ltx/en_us_dedes/me.m10.d18:meMA.Lauds2.mode	@ltx/en_us_dedes/miscellanea:misc.Mode1
ltx/en_us_dedes/me.m10.d18:meMA.Lauds2.text	You mastered the medicine of souls * even better than of bodies; and, inspired by God’s wisdom, you appeared adept in both. * Healing souls and bodies, * O all-blest Apostle Luke, * you call us all to spiritual knowledge, every day and lift us up * to the heavens, to the love for God; * and you pray Him * for all those who honor you.
ltx/en_us_dedes/me.m10.d18:meMA.Lauds3.incipit	O all-blessed Luke, using your…
ltx/en_us_dedes/me.m10.d18:meMA.Lauds3.melody	@ltx/en_us_dedes/he.a.m1:heAU.PaneffimoiMartyres.name
ltx/en_us_dedes/me.m10.d18:meMA.Lauds3.mode	@ltx/en_us_dedes/miscellanea:misc.Mode1
ltx/en_us_dedes/me.m10.d18:meMA.Lauds3.text	O all-blessed Luke, using your words * like a hook, you drew to Christ those, who like fish had sunk down into the depth of ignorance, * up to godly knowledge, * thus procuring for yourself * the worthy wage of honor, and they received undying endless life, * O Apostle, wise Evangelist, * and the author * of Acts and the actions of grace.
ltx/en_us_dedes/me.m10.d18:meMA.Lauds4.incipit	Come, all creation, and with…
ltx/en_us_dedes/me.m10.d18:meMA.Lauds4.melody	@ltx/en_us_dedes/miscellanea:misc.Idiomelon
ltx/en_us_dedes/me.m10.d18:meMA.Lauds4.mode	@ltx/en_us_dedes/miscellanea:misc.Mode8
ltx/en_us_dedes/me.m10.d18:meMA.Lauds4.poet	@ltx/en_us_dedes/poets:po.LeontosMaistoros
ltx/en_us_dedes/me.m10.d18:meMA.Lauds4.text	Come, all creation, and with songs let us extol the famous Saint Luke, who was truly a spiritual physician, and a disciple of the Savior. For he cured the sickness of godlessness with the salve of Christian baptism. He irrigated souls, like fields, with the Gospel that flowed from his mouth like divine rivers. And, as the Prophet said, his proclamation went forth into all the earth. And he intercedes for our salvation.
ltx/en_us_dedes/me.m10.d18:meMA.LaudsGlory.incipit	Let us the Faithful come…
ltx/en_us_dedes/me.m10.d18:meMA.LaudsGlory.melody	
ltx/en_us_dedes/me.m10.d18:meMA.LaudsGlory.mode	@ltx/en_us_dedes/miscellanea:misc.Mode8
ltx/en_us_dedes/me.m10.d18:meMA.LaudsGlory.text	Let us the Faithful come together, and with songs let us cry out to Luke, that mystical preacher of the Word, using the words of David: “Your tongue became the pen of Christ, the swift-writing scribe. It made the faces of the Gentiles beautiful, when they received divine knowledge. With your tongue you preached the Gospel. You wrote the Acts of your fellow Apostles. Now, as you stand in the presence of God the Trinity, intercede for our souls.”
ltx/en_us_dedes/me.m10.d18:meMA.LaudsTheotokion.incipit	@ltx/en_us_dedes/oc.m8.d5:ocMA.AposTheotokion.incipit
ltx/en_us_dedes/me.m10.d18:meMA.LaudsTheotokion.melody	
ltx/en_us_dedes/me.m10.d18:meMA.LaudsTheotokion.mode	@ltx/en_us_dedes/miscellanea:misc.Mode8
ltx/en_us_dedes/me.m10.d18:meMA.LaudsTheotokion.text	@ltx/en_us_dedes/oc.m8.d5:ocMA.AposTheotokion.text
ltx/en_us_dedes/me.m10.d18:meMA.MM.Lauds1123as5678.text	@ltx/en_us_dedes/properties:media.key
ltx/en_us_dedes/me.m10.d18:meMA.MM.Lauds123as123.text	@ltx/en_us_dedes/properties:media.key
ltx/en_us_dedes/me.m10.d18:meMA.Ode1C11.greekmelody	@ltx/en_us_dedes/he.h.m8:heHE.IKekommeni.greekname
ltx/en_us_dedes/me.m10.d18:meMA.Ode1C11.incipit	…
ltx/en_us_dedes/me.m10.d18:meMA.Ode1C11.melody	@ltx/en_us_dedes/he.h.m8:heHE.IKekommeni.name
ltx/en_us_dedes/me.m10.d18:meMA.Ode1C11.mode	@ltx/en_us_dedes/miscellanea:misc.Mode8
ltx/en_us_dedes/me.m10.d18:meMA.Ode1C11.ode	@ltx/en_us_dedes/miscellanea:misc.Ode1
ltx/en_us_dedes/me.m10.d18:meMA.Ode1C11.text	
ltx/en_us_dedes/me.m10.d18:meMA.Ode1C12.incipit	…
ltx/en_us_dedes/me.m10.d18:meMA.Ode1C12.melody	@ltx/en_us_dedes/he.h.m8:heHE.IKekommeni.name
ltx/en_us_dedes/me.m10.d18:meMA.Ode1C12.mode	@ltx/en_us_dedes/miscellanea:misc.Mode8
ltx/en_us_dedes/me.m10.d18:meMA.Ode1C12.ode	@ltx/en_us_dedes/miscellanea:misc.Ode1
ltx/en_us_dedes/me.m10.d18:meMA.Ode1C12.text	
ltx/en_us_dedes/me.m10.d18:meMA.Ode1C13.incipit	…
ltx/en_us_dedes/me.m10.d18:meMA.Ode1C13.melody	@ltx/en_us_dedes/he.h.m8:heHE.IKekommeni.name
ltx/en_us_dedes/me.m10.d18:meMA.Ode1C13.mode	@ltx/en_us_dedes/miscellanea:misc.Mode8
ltx/en_us_dedes/me.m10.d18:meMA.Ode1C13.ode	@ltx/en_us_dedes/miscellanea:misc.Ode1
ltx/en_us_dedes/me.m10.d18:meMA.Ode1C13.text	
ltx/en_us_dedes/me.m10.d18:meMA.Ode1C1T.incipit	…
ltx/en_us_dedes/me.m10.d18:meMA.Ode1C1T.melody	@ltx/en_us_dedes/he.h.m8:heHE.IKekommeni.name
ltx/en_us_dedes/me.m10.d18:meMA.Ode1C1T.mode	@ltx/en_us_dedes/miscellanea:misc.Mode8
ltx/en_us_dedes/me.m10.d18:meMA.Ode1C1T.ode	@ltx/en_us_dedes/miscellanea:misc.Ode1
ltx/en_us_dedes/me.m10.d18:meMA.Ode1C1T.text	
ltx/en_us_dedes/me.m10.d18:meMA.Ode3C11.greekmelody	@ltx/en_us_dedes/he.h.m8:heHE.SyEiToStereoma.greekname
ltx/en_us_dedes/me.m10.d18:meMA.Ode3C11.incipit	…
ltx/en_us_dedes/me.m10.d18:meMA.Ode3C11.melody	@ltx/en_us_dedes/he.h.m8:heHE.SyEiToStereoma.name
ltx/en_us_dedes/me.m10.d18:meMA.Ode3C11.mode	@ltx/en_us_dedes/miscellanea:misc.Mode8
ltx/en_us_dedes/me.m10.d18:meMA.Ode3C11.ode	@ltx/en_us_dedes/miscellanea:misc.Ode3
ltx/en_us_dedes/me.m10.d18:meMA.Ode3C11.text	
ltx/en_us_dedes/me.m10.d18:meMA.Ode3C12.incipit	…
ltx/en_us_dedes/me.m10.d18:meMA.Ode3C12.melody	@ltx/en_us_dedes/he.h.m8:heHE.SyEiToStereoma.name
ltx/en_us_dedes/me.m10.d18:meMA.Ode3C12.mode	@ltx/en_us_dedes/miscellanea:misc.Mode8
ltx/en_us_dedes/me.m10.d18:meMA.Ode3C12.ode	@ltx/en_us_dedes/miscellanea:misc.Ode3
ltx/en_us_dedes/me.m10.d18:meMA.Ode3C12.text	
ltx/en_us_dedes/me.m10.d18:meMA.Ode3C13.incipit	…
ltx/en_us_dedes/me.m10.d18:meMA.Ode3C13.melody	@ltx/en_us_dedes/he.h.m8:heHE.SyEiToStereoma.name
ltx/en_us_dedes/me.m10.d18:meMA.Ode3C13.mode	@ltx/en_us_dedes/miscellanea:misc.Mode8
ltx/en_us_dedes/me.m10.d18:meMA.Ode3C13.ode	@ltx/en_us_dedes/miscellanea:misc.Ode3
ltx/en_us_dedes/me.m10.d18:meMA.Ode3C13.text	
ltx/en_us_dedes/me.m10.d18:meMA.Ode3C1T.incipit	…
ltx/en_us_dedes/me.m10.d18:meMA.Ode3C1T.melody	@ltx/en_us_dedes/he.h.m8:heHE.SyEiToStereoma.name
ltx/en_us_dedes/me.m10.d18:meMA.Ode3C1T.mode	@ltx/en_us_dedes/miscellanea:misc.Mode8
ltx/en_us_dedes/me.m10.d18:meMA.Ode3C1T.ode	@ltx/en_us_dedes/miscellanea:misc.Ode3
ltx/en_us_dedes/me.m10.d18:meMA.Ode3C1T.text	
ltx/en_us_dedes/me.m10.d18:meMA.Ode3H.greekmelody	@ltx/en_us_dedes/he.h.m8:heHE.SyEiToStereoma.greekname
ltx/en_us_dedes/me.m10.d18:meMA.Ode3H.incipit	@ltx/en_us_dedes/he.h.m8:heHE.SyEiToStereoma.incipit
ltx/en_us_dedes/me.m10.d18:meMA.Ode3H.melody	@ltx/en_us_dedes/he.h.m8:heHE.SyEiToStereoma.melody
ltx/en_us_dedes/me.m10.d18:meMA.Ode3H.mode	@ltx/en_us_dedes/miscellanea:misc.Mode8
ltx/en_us_dedes/me.m10.d18:meMA.Ode3H.ode	@ltx/en_us_dedes/miscellanea:misc.Ode3
ltx/en_us_dedes/me.m10.d18:meMA.Ode3H.text	@ltx/en_us_dedes/he.h.m8:heHE.SyEiToStereoma.text
ltx/en_us_dedes/me.m10.d18:meMA.Ode3Kathisma1.greekmelody	@ltx/en_us_dedes/he.a.m8:heAU.TinSofianKaiLogon.greekname
ltx/en_us_dedes/me.m10.d18:meMA.Ode3Kathisma1.incipit	…
ltx/en_us_dedes/me.m10.d18:meMA.Ode3Kathisma1.melody	@ltx/en_us_dedes/he.a.m8:heAU.TinSofianKaiLogon.name
ltx/en_us_dedes/me.m10.d18:meMA.Ode3Kathisma1.mode	@ltx/en_us_dedes/miscellanea:misc.Mode8
ltx/en_us_dedes/me.m10.d18:meMA.Ode3Kathisma1.text	
ltx/en_us_dedes/me.m10.d18:meMA.Ode3KathismaT.incipit	Let us sing hymns in…
ltx/en_us_dedes/me.m10.d18:meMA.Ode3KathismaT.melody	@ltx/en_us_dedes/he.a.m8:heAU.TinSofianKaiLogon.name
ltx/en_us_dedes/me.m10.d18:meMA.Ode3KathismaT.mode	@ltx/en_us_dedes/miscellanea:misc.Mode8
ltx/en_us_dedes/me.m10.d18:meMA.Ode3KathismaT.text	Let us sing hymns in praise of the holy ark * and the heavenly gate and the shining cloud, * the all-holy mountain and the bush that was not consumed, * the rational Paradise, the restoration of Eve, * the magnificent treasure of the entire universe. * For in her and through her for the world was salvation * accomplished and forgiveness of its ancient transgressions. * Let us therefore cry out to her, * “Intercede with your Son and our God * that remission of offenses be bestowed * on those who faithfully honor your immaculate childbirth.”
ltx/en_us_dedes/me.m10.d18:meMA.Ode4C11.greekmelody	@ltx/en_us_dedes/he.h.m8:heHE.EpevisEfIppous.greekname
ltx/en_us_dedes/me.m10.d18:meMA.Ode4C11.incipit	…
ltx/en_us_dedes/me.m10.d18:meMA.Ode4C11.melody	@ltx/en_us_dedes/he.h.m8:heHE.EpevisEfIppous.name
ltx/en_us_dedes/me.m10.d18:meMA.Ode4C11.mode	@ltx/en_us_dedes/miscellanea:misc.Mode8
ltx/en_us_dedes/me.m10.d18:meMA.Ode4C11.ode	@ltx/en_us_dedes/miscellanea:misc.Ode4
ltx/en_us_dedes/me.m10.d18:meMA.Ode4C11.text	
ltx/en_us_dedes/me.m10.d18:meMA.Ode4C12.incipit	…
ltx/en_us_dedes/me.m10.d18:meMA.Ode4C12.melody	@ltx/en_us_dedes/he.h.m8:heHE.EpevisEfIppous.name
ltx/en_us_dedes/me.m10.d18:meMA.Ode4C12.mode	@ltx/en_us_dedes/miscellanea:misc.Mode8
ltx/en_us_dedes/me.m10.d18:meMA.Ode4C12.ode	@ltx/en_us_dedes/miscellanea:misc.Ode4
ltx/en_us_dedes/me.m10.d18:meMA.Ode4C12.text	
ltx/en_us_dedes/me.m10.d18:meMA.Ode4C13.incipit	…
ltx/en_us_dedes/me.m10.d18:meMA.Ode4C13.melody	@ltx/en_us_dedes/he.h.m8:heHE.EpevisEfIppous.name
ltx/en_us_dedes/me.m10.d18:meMA.Ode4C13.mode	@ltx/en_us_dedes/miscellanea:misc.Mode8
ltx/en_us_dedes/me.m10.d18:meMA.Ode4C13.ode	@ltx/en_us_dedes/miscellanea:misc.Ode4
ltx/en_us_dedes/me.m10.d18:meMA.Ode4C13.text	
ltx/en_us_dedes/me.m10.d18:meMA.Ode4C14.incipit	…
ltx/en_us_dedes/me.m10.d18:meMA.Ode4C14.melody	@ltx/en_us_dedes/he.h.m8:heHE.EpevisEfIppous.name
ltx/en_us_dedes/me.m10.d18:meMA.Ode4C14.mode	@ltx/en_us_dedes/miscellanea:misc.Mode8
ltx/en_us_dedes/me.m10.d18:meMA.Ode4C14.ode	@ltx/en_us_dedes/miscellanea:misc.Ode4
ltx/en_us_dedes/me.m10.d18:meMA.Ode4C14.text	
ltx/en_us_dedes/me.m10.d18:meMA.Ode4C1T.incipit	…
ltx/en_us_dedes/me.m10.d18:meMA.Ode4C1T.melody	@ltx/en_us_dedes/he.h.m8:heHE.EpevisEfIppous.name
ltx/en_us_dedes/me.m10.d18:meMA.Ode4C1T.mode	@ltx/en_us_dedes/miscellanea:misc.Mode8
ltx/en_us_dedes/me.m10.d18:meMA.Ode4C1T.ode	@ltx/en_us_dedes/miscellanea:misc.Ode4
ltx/en_us_dedes/me.m10.d18:meMA.Ode4C1T.text	
ltx/en_us_dedes/me.m10.d18:meMA.Ode5C11.greekmelody	@ltx/en_us_dedes/he.h.m8:heHE.FotisonImas.greekname
ltx/en_us_dedes/me.m10.d18:meMA.Ode5C11.incipit	…
ltx/en_us_dedes/me.m10.d18:meMA.Ode5C11.melody	@ltx/en_us_dedes/he.h.m8:heHE.FotisonImas.name
ltx/en_us_dedes/me.m10.d18:meMA.Ode5C11.mode	@ltx/en_us_dedes/miscellanea:misc.Mode8
ltx/en_us_dedes/me.m10.d18:meMA.Ode5C11.ode	@ltx/en_us_dedes/miscellanea:misc.Ode5
ltx/en_us_dedes/me.m10.d18:meMA.Ode5C11.text	
ltx/en_us_dedes/me.m10.d18:meMA.Ode5C12.incipit	…
ltx/en_us_dedes/me.m10.d18:meMA.Ode5C12.melody	@ltx/en_us_dedes/he.h.m8:heHE.FotisonImas.name
ltx/en_us_dedes/me.m10.d18:meMA.Ode5C12.mode	@ltx/en_us_dedes/miscellanea:misc.Mode8
ltx/en_us_dedes/me.m10.d18:meMA.Ode5C12.ode	@ltx/en_us_dedes/miscellanea:misc.Ode5
ltx/en_us_dedes/me.m10.d18:meMA.Ode5C12.text	
ltx/en_us_dedes/me.m10.d18:meMA.Ode5C13.incipit	…
ltx/en_us_dedes/me.m10.d18:meMA.Ode5C13.melody	@ltx/en_us_dedes/he.h.m8:heHE.FotisonImas.name
ltx/en_us_dedes/me.m10.d18:meMA.Ode5C13.mode	@ltx/en_us_dedes/miscellanea:misc.Mode8
ltx/en_us_dedes/me.m10.d18:meMA.Ode5C13.ode	@ltx/en_us_dedes/miscellanea:misc.Ode5
ltx/en_us_dedes/me.m10.d18:meMA.Ode5C13.text	
ltx/en_us_dedes/me.m10.d18:meMA.Ode5C1T.incipit	…
ltx/en_us_dedes/me.m10.d18:meMA.Ode5C1T.melody	@ltx/en_us_dedes/he.h.m8:heHE.FotisonImas.name
ltx/en_us_dedes/me.m10.d18:meMA.Ode5C1T.mode	@ltx/en_us_dedes/miscellanea:misc.Mode8
ltx/en_us_dedes/me.m10.d18:meMA.Ode5C1T.ode	@ltx/en_us_dedes/miscellanea:misc.Ode5
ltx/en_us_dedes/me.m10.d18:meMA.Ode5C1T.text	
ltx/en_us_dedes/me.m10.d18:meMA.Ode6C11.greekmelody	@ltx/en_us_dedes/he.h.m8:heHE.TinDeisinEkcheo.greekname
ltx/en_us_dedes/me.m10.d18:meMA.Ode6C11.incipit	…
ltx/en_us_dedes/me.m10.d18:meMA.Ode6C11.melody	@ltx/en_us_dedes/he.h.m8:heHE.TinDeisinEkcheo.name
ltx/en_us_dedes/me.m10.d18:meMA.Ode6C11.mode	@ltx/en_us_dedes/miscellanea:misc.Mode8
ltx/en_us_dedes/me.m10.d18:meMA.Ode6C11.ode	@ltx/en_us_dedes/miscellanea:misc.Ode6
ltx/en_us_dedes/me.m10.d18:meMA.Ode6C11.text	
ltx/en_us_dedes/me.m10.d18:meMA.Ode6C12.incipit	…
ltx/en_us_dedes/me.m10.d18:meMA.Ode6C12.melody	@ltx/en_us_dedes/he.h.m8:heHE.TinDeisinEkcheo.name
ltx/en_us_dedes/me.m10.d18:meMA.Ode6C12.mode	@ltx/en_us_dedes/miscellanea:misc.Mode8
ltx/en_us_dedes/me.m10.d18:meMA.Ode6C12.ode	@ltx/en_us_dedes/miscellanea:misc.Ode6
ltx/en_us_dedes/me.m10.d18:meMA.Ode6C12.text	
ltx/en_us_dedes/me.m10.d18:meMA.Ode6C13.incipit	…
ltx/en_us_dedes/me.m10.d18:meMA.Ode6C13.melody	@ltx/en_us_dedes/he.h.m8:heHE.TinDeisinEkcheo.name
ltx/en_us_dedes/me.m10.d18:meMA.Ode6C13.mode	@ltx/en_us_dedes/miscellanea:misc.Mode8
ltx/en_us_dedes/me.m10.d18:meMA.Ode6C13.ode	@ltx/en_us_dedes/miscellanea:misc.Ode6
ltx/en_us_dedes/me.m10.d18:meMA.Ode6C13.text	
ltx/en_us_dedes/me.m10.d18:meMA.Ode6C1T.incipit	…
ltx/en_us_dedes/me.m10.d18:meMA.Ode6C1T.melody	@ltx/en_us_dedes/he.h.m8:heHE.TinDeisinEkcheo.name
ltx/en_us_dedes/me.m10.d18:meMA.Ode6C1T.mode	@ltx/en_us_dedes/miscellanea:misc.Mode8
ltx/en_us_dedes/me.m10.d18:meMA.Ode6C1T.ode	@ltx/en_us_dedes/miscellanea:misc.Ode6
ltx/en_us_dedes/me.m10.d18:meMA.Ode6C1T.text	
ltx/en_us_dedes/me.m10.d18:meMA.Ode6H.greekmelody	@ltx/en_us_dedes/he.h.m8:heHE.TinDeisinEkcheo.greekname
ltx/en_us_dedes/me.m10.d18:meMA.Ode6H.incipit	@ltx/en_us_dedes/he.h.m8:heHE.TinDeisinEkcheo.incipit
ltx/en_us_dedes/me.m10.d18:meMA.Ode6H.melody	@ltx/en_us_dedes/he.h.m8:heHE.TinDeisinEkcheo.melody
ltx/en_us_dedes/me.m10.d18:meMA.Ode6H.mode	@ltx/en_us_dedes/miscellanea:misc.Mode8
ltx/en_us_dedes/me.m10.d18:meMA.Ode6H.ode	@ltx/en_us_dedes/miscellanea:misc.Ode6
ltx/en_us_dedes/me.m10.d18:meMA.Ode6H.text	@ltx/en_us_dedes/he.h.m8:heHE.TinDeisinEkcheo.text
ltx/en_us_dedes/me.m10.d18:meMA.Ode7C11.greekmelody	@ltx/en_us_dedes/he.h.m8:heHE.PaidesEvraion.greekname
ltx/en_us_dedes/me.m10.d18:meMA.Ode7C11.incipit	…
ltx/en_us_dedes/me.m10.d18:meMA.Ode7C11.melody	@ltx/en_us_dedes/he.h.m8:heHE.PaidesEvraion.name
ltx/en_us_dedes/me.m10.d18:meMA.Ode7C11.mode	@ltx/en_us_dedes/miscellanea:misc.Mode8
ltx/en_us_dedes/me.m10.d18:meMA.Ode7C11.ode	@ltx/en_us_dedes/miscellanea:misc.Ode7
ltx/en_us_dedes/me.m10.d18:meMA.Ode7C11.text	
ltx/en_us_dedes/me.m10.d18:meMA.Ode7C12.incipit	…
ltx/en_us_dedes/me.m10.d18:meMA.Ode7C12.melody	@ltx/en_us_dedes/he.h.m8:heHE.PaidesEvraion.name
ltx/en_us_dedes/me.m10.d18:meMA.Ode7C12.mode	@ltx/en_us_dedes/miscellanea:misc.Mode8
ltx/en_us_dedes/me.m10.d18:meMA.Ode7C12.ode	@ltx/en_us_dedes/miscellanea:misc.Ode7
ltx/en_us_dedes/me.m10.d18:meMA.Ode7C12.text	
ltx/en_us_dedes/me.m10.d18:meMA.Ode7C13.incipit	…
ltx/en_us_dedes/me.m10.d18:meMA.Ode7C13.melody	@ltx/en_us_dedes/he.h.m8:heHE.PaidesEvraion.name
ltx/en_us_dedes/me.m10.d18:meMA.Ode7C13.mode	@ltx/en_us_dedes/miscellanea:misc.Mode8
ltx/en_us_dedes/me.m10.d18:meMA.Ode7C13.ode	@ltx/en_us_dedes/miscellanea:misc.Ode7
ltx/en_us_dedes/me.m10.d18:meMA.Ode7C13.text	
ltx/en_us_dedes/me.m10.d18:meMA.Ode7C1T.incipit	…
ltx/en_us_dedes/me.m10.d18:meMA.Ode7C1T.melody	@ltx/en_us_dedes/he.h.m8:heHE.PaidesEvraion.name
ltx/en_us_dedes/me.m10.d18:meMA.Ode7C1T.mode	@ltx/en_us_dedes/miscellanea:misc.Mode8
ltx/en_us_dedes/me.m10.d18:meMA.Ode7C1T.ode	@ltx/en_us_dedes/miscellanea:misc.Ode7
ltx/en_us_dedes/me.m10.d18:meMA.Ode7C1T.text	
ltx/en_us_dedes/me.m10.d18:meMA.Ode8C11.greekmelody	@ltx/en_us_dedes/he.h.m8:heHE.TonEnOreiAgio.greekname
ltx/en_us_dedes/me.m10.d18:meMA.Ode8C11.incipit	…
ltx/en_us_dedes/me.m10.d18:meMA.Ode8C11.melody	@ltx/en_us_dedes/he.h.m8:heHE.TonEnOreiAgio.name
ltx/en_us_dedes/me.m10.d18:meMA.Ode8C11.mode	@ltx/en_us_dedes/miscellanea:misc.Mode8
ltx/en_us_dedes/me.m10.d18:meMA.Ode8C11.ode	@ltx/en_us_dedes/miscellanea:misc.Ode8
ltx/en_us_dedes/me.m10.d18:meMA.Ode8C11.text	
ltx/en_us_dedes/me.m10.d18:meMA.Ode8C12.incipit	…
ltx/en_us_dedes/me.m10.d18:meMA.Ode8C12.melody	@ltx/en_us_dedes/he.h.m8:heHE.TonEnOreiAgio.name
ltx/en_us_dedes/me.m10.d18:meMA.Ode8C12.mode	@ltx/en_us_dedes/miscellanea:misc.Mode8
ltx/en_us_dedes/me.m10.d18:meMA.Ode8C12.ode	@ltx/en_us_dedes/miscellanea:misc.Ode8
ltx/en_us_dedes/me.m10.d18:meMA.Ode8C12.text	
ltx/en_us_dedes/me.m10.d18:meMA.Ode8C13.incipit	…
ltx/en_us_dedes/me.m10.d18:meMA.Ode8C13.melody	@ltx/en_us_dedes/he.h.m8:heHE.TonEnOreiAgio.name
ltx/en_us_dedes/me.m10.d18:meMA.Ode8C13.mode	@ltx/en_us_dedes/miscellanea:misc.Mode8
ltx/en_us_dedes/me.m10.d18:meMA.Ode8C13.ode	@ltx/en_us_dedes/miscellanea:misc.Ode8
ltx/en_us_dedes/me.m10.d18:meMA.Ode8C13.text	
ltx/en_us_dedes/me.m10.d18:meMA.Ode8C14.incipit	…
ltx/en_us_dedes/me.m10.d18:meMA.Ode8C14.melody	@ltx/en_us_dedes/he.h.m8:heHE.TonEnOreiAgio.name
ltx/en_us_dedes/me.m10.d18:meMA.Ode8C14.mode	@ltx/en_us_dedes/miscellanea:misc.Mode8
ltx/en_us_dedes/me.m10.d18:meMA.Ode8C14.ode	@ltx/en_us_dedes/miscellanea:misc.Ode8
ltx/en_us_dedes/me.m10.d18:meMA.Ode8C14.text	
ltx/en_us_dedes/me.m10.d18:meMA.Ode8C1T.incipit	…
ltx/en_us_dedes/me.m10.d18:meMA.Ode8C1T.melody	@ltx/en_us_dedes/he.h.m8:heHE.TonEnOreiAgio.name
ltx/en_us_dedes/me.m10.d18:meMA.Ode8C1T.mode	@ltx/en_us_dedes/miscellanea:misc.Mode8
ltx/en_us_dedes/me.m10.d18:meMA.Ode8C1T.ode	@ltx/en_us_dedes/miscellanea:misc.Ode8
ltx/en_us_dedes/me.m10.d18:meMA.Ode8C1T.text	
ltx/en_us_dedes/me.m10.d18:meMA.Ode8H.greekmelody	@ltx/en_us_dedes/he.h.m8:heHE.TonEnOreiAgio.greekname
ltx/en_us_dedes/me.m10.d18:meMA.Ode8H.incipit	@ltx/en_us_dedes/he.h.m8:heHE.TonEnOreiAgio.incipit
ltx/en_us_dedes/me.m10.d18:meMA.Ode8H.melody	@ltx/en_us_dedes/he.h.m8:heHE.TonEnOreiAgio.melody
ltx/en_us_dedes/me.m10.d18:meMA.Ode8H.mode	@ltx/en_us_dedes/miscellanea:misc.Mode8
ltx/en_us_dedes/me.m10.d18:meMA.Ode8H.ode	@ltx/en_us_dedes/miscellanea:misc.Ode8
ltx/en_us_dedes/me.m10.d18:meMA.Ode8H.text	@ltx/en_us_dedes/he.h.m8:heHE.TonEnOreiAgio.text
ltx/en_us_dedes/me.m10.d18:meMA.Ode9C11.greekmelody	@ltx/en_us_dedes/he.h.m8:heHE.OrousParilthes.greekname
ltx/en_us_dedes/me.m10.d18:meMA.Ode9C11.incipit	…
ltx/en_us_dedes/me.m10.d18:meMA.Ode9C11.melody	@ltx/en_us_dedes/he.h.m8:heHE.OrousParilthes.name
ltx/en_us_dedes/me.m10.d18:meMA.Ode9C11.mode	@ltx/en_us_dedes/miscellanea:misc.Mode8
ltx/en_us_dedes/me.m10.d18:meMA.Ode9C11.ode	@ltx/en_us_dedes/miscellanea:misc.Ode9
ltx/en_us_dedes/me.m10.d18:meMA.Ode9C11.text	
ltx/en_us_dedes/me.m10.d18:meMA.Ode9C12.incipit	…
ltx/en_us_dedes/me.m10.d18:meMA.Ode9C12.melody	@ltx/en_us_dedes/he.h.m8:heHE.OrousParilthes.name
ltx/en_us_dedes/me.m10.d18:meMA.Ode9C12.mode	@ltx/en_us_dedes/miscellanea:misc.Mode8
ltx/en_us_dedes/me.m10.d18:meMA.Ode9C12.ode	@ltx/en_us_dedes/miscellanea:misc.Ode9
ltx/en_us_dedes/me.m10.d18:meMA.Ode9C12.text	
ltx/en_us_dedes/me.m10.d18:meMA.Ode9C13.incipit	…
ltx/en_us_dedes/me.m10.d18:meMA.Ode9C13.melody	@ltx/en_us_dedes/he.h.m8:heHE.OrousParilthes.name
ltx/en_us_dedes/me.m10.d18:meMA.Ode9C13.mode	@ltx/en_us_dedes/miscellanea:misc.Mode8
ltx/en_us_dedes/me.m10.d18:meMA.Ode9C13.ode	@ltx/en_us_dedes/miscellanea:misc.Ode9
ltx/en_us_dedes/me.m10.d18:meMA.Ode9C13.text	
ltx/en_us_dedes/me.m10.d18:meMA.Ode9C14.incipit	…
ltx/en_us_dedes/me.m10.d18:meMA.Ode9C14.melody	@ltx/en_us_dedes/he.h.m8:heHE.OrousParilthes.name
ltx/en_us_dedes/me.m10.d18:meMA.Ode9C14.mode	@ltx/en_us_dedes/miscellanea:misc.Mode8
ltx/en_us_dedes/me.m10.d18:meMA.Ode9C14.ode	@ltx/en_us_dedes/miscellanea:misc.Ode9
ltx/en_us_dedes/me.m10.d18:meMA.Ode9C14.text	
ltx/en_us_dedes/me.m10.d18:meMA.Ode9C1T.incipit	…
ltx/en_us_dedes/me.m10.d18:meMA.Ode9C1T.melody	@ltx/en_us_dedes/he.h.m8:heHE.OrousParilthes.name
ltx/en_us_dedes/me.m10.d18:meMA.Ode9C1T.mode	@ltx/en_us_dedes/miscellanea:misc.Mode8
ltx/en_us_dedes/me.m10.d18:meMA.Ode9C1T.ode	@ltx/en_us_dedes/miscellanea:misc.Ode9
ltx/en_us_dedes/me.m10.d18:meMA.Ode9C1T.text	
ltx/en_us_dedes/me.m10.d18:meMA.Ode9H.greekmelody	@ltx/en_us_dedes/he.h.m8:heHE.OrousParilthes.greekname
ltx/en_us_dedes/me.m10.d18:meMA.Ode9H.incipit	@ltx/en_us_dedes/he.h.m8:heHE.OrousParilthes.incipit
ltx/en_us_dedes/me.m10.d18:meMA.Ode9H.melody	@ltx/en_us_dedes/he.h.m8:heHE.OrousParilthes.melody
ltx/en_us_dedes/me.m10.d18:meMA.Ode9H.mode	@ltx/en_us_dedes/miscellanea:misc.Mode8
ltx/en_us_dedes/me.m10.d18:meMA.Ode9H.ode	@ltx/en_us_dedes/miscellanea:misc.Ode9
ltx/en_us_dedes/me.m10.d18:meMA.Ode9H.text	@ltx/en_us_dedes/he.h.m8:heHE.OrousParilthes.text
ltx/en_us_dedes/me.m10.d18:meMA.Oikos1.text	As a beloved physician and disciple, O Luke, with mystical surgery heal the passions of my soul and body alike, and grant me to enjoy complete health. May I joyously honor your solemn feast, and shower your holy and all-honored body with tears instead of perfume. For it is an engraved monument of life in the marvelous church of the Apostles, and it proclaims to all, as you did before when you wrote it, the Gospel of Christ our God.
ltx/en_us_dedes/me.m10.d18:meVE.Apolytikion2ger.greekmelody	@ltx/en_us_dedes/he.a.m4:heAU.TachyProkatalave.greekname
ltx/en_us_dedes/me.m10.d18:meVE.Apolytikion2ger.incipit	…
ltx/en_us_dedes/me.m10.d18:meVE.Apolytikion2ger.melody	@ltx/en_us_dedes/he.a.m4:heAU.TachyProkatalave.name
ltx/en_us_dedes/me.m10.d18:meVE.Apolytikion2ger.mode	@ltx/en_us_dedes/miscellanea:misc.Mode4
ltx/en_us_dedes/me.m10.d18:meVE.Apolytikion2ger.poet	@ltx/en_us_dedes/poets:po.Gerasimou
ltx/en_us_dedes/me.m10.d18:meVE.Apolytikion2ger.text	
ltx/en_us_dedes/me.m10.d18:meVE.AposGlory.incipit	All-wise Fisherman, holy Disciple and…
ltx/en_us_dedes/me.m10.d18:meVE.AposGlory.melody	
ltx/en_us_dedes/me.m10.d18:meVE.AposGlory.mode	@ltx/en_us_dedes/miscellanea:misc.Mode6
ltx/en_us_dedes/me.m10.d18:meVE.AposGlory.text	All-wise Fisherman, holy Disciple and laborer of the Savior, you publicized His sufferings, you traveled the world over for the Faith, and you gathered the Gentiles, who had been in error, and offered them to God as fine incense. And now you have made your way to heaven. As you stand near the Judge, intercede for us, that He free us from our iniquities, and that He deliver us from hell on Judgment Day.
ltx/en_us_dedes/me.m10.d18:meVE.AposTheotokion.incipit	@ltx/en_us_dedes/oc.m6.d1:ocVE.AposTheotokion.incipit
ltx/en_us_dedes/me.m10.d18:meVE.AposTheotokion.melody	
ltx/en_us_dedes/me.m10.d18:meVE.AposTheotokion.mode	@ltx/en_us_dedes/miscellanea:misc.Mode6
ltx/en_us_dedes/me.m10.d18:meVE.AposTheotokion.text	@ltx/en_us_dedes/oc.m6.d1:ocVE.AposTheotokion.text
ltx/en_us_dedes/me.m10.d18:meVE.Aposticha1.greekmelody	@ltx/en_us_dedes/he.a.m5:heAU.ChairoisAskitikon.greekname
ltx/en_us_dedes/me.m10.d18:meVE.Aposticha1.incipit	Holy Apostle Luke, grace divine…
ltx/en_us_dedes/me.m10.d18:meVE.Aposticha1.melody	@ltx/en_us_dedes/he.a.m5:heAU.ChairoisAskitikon.name
ltx/en_us_dedes/me.m10.d18:meVE.Aposticha1.mode	@ltx/en_us_dedes/miscellanea:misc.Mode5
ltx/en_us_dedes/me.m10.d18:meVE.Aposticha1.text	Holy Apostle Luke, grace divine * was poured upon your sacred lips by the fiery tongue, * which made you a tongue of fire; for when you preached you sent forth * words of light to those who were worthy of light, * but also to those who longed for the darkness sent balls of fire; * this, by your teaching of the Gospel and writing it. * And as your own teacher, the blessed Saint Paul, had said, * you became the fragrance of life * to those who indeed want life, * again for those who prefer death, * you are the fragrance of death to them. * To us who extol you, * grant us peace and life and light, and great mercy on our souls.
ltx/en_us_dedes/me.m10.d18:meVE.Aposticha2.incipit	We know the truth concerning…
ltx/en_us_dedes/me.m10.d18:meVE.Aposticha2.melody	@ltx/en_us_dedes/he.a.m5:heAU.ChairoisAskitikon.name
ltx/en_us_dedes/me.m10.d18:meVE.Aposticha2.mode	@ltx/en_us_dedes/miscellanea:misc.Mode5
ltx/en_us_dedes/me.m10.d18:meVE.Aposticha2.text	We know the truth concerning those things * that were accomplished, inasmuch as you undertook * to write down a God-inspired account in your own words, * as it was delivered unto you by those * who from the beginning were the eyewitnesses of the Word. * You are their equal and their peer, as a minister * of the Incarnation of God the eternal Word. * After His rising from the dead, * you saw Him and ate with Him * when in Emmaus with Clopas, * saying your hearts were burning within. * O Luke, we entreat you, * fill our souls with His divine heat, as we now honor you.
ltx/en_us_dedes/me.m10.d18:meVE.Aposticha3.incipit	Rejoice, for only you wrote…
ltx/en_us_dedes/me.m10.d18:meVE.Aposticha3.melody	@ltx/en_us_dedes/he.a.m5:heAU.ChairoisAskitikon.name
ltx/en_us_dedes/me.m10.d18:meVE.Aposticha3.mode	@ltx/en_us_dedes/miscellanea:misc.Mode5
ltx/en_us_dedes/me.m10.d18:meVE.Aposticha3.text	Rejoice, for only you wrote with joy * the salutation of “Rejoice!” to the Virgin pure, * and also how John the Baptist was born, how he from the womb * recognized and called her Mother of the Lord. * You wrote of our Savior’s birth, the temptations, the miracles, * His words, His Passion, crucifixion and death as well, * resurrection, and the ascension, which you beheld. * And you recorded the descent * of the Spirit, and wrote the Acts * of the Apostles, and mainly of your companion, the great Saint Paul. * O Luke, the Physician, * as the Church’s luminary, * protect her evermore.
ltx/en_us_dedes/me.m10.d18:meVE.Aposticha4.incipit	You searched the depths of…
ltx/en_us_dedes/me.m10.d18:meVE.Aposticha4.melody	
ltx/en_us_dedes/me.m10.d18:meVE.Aposticha4.mode	@ltx/en_us_dedes/miscellanea:misc.Mode4
ltx/en_us_dedes/me.m10.d18:meVE.Aposticha4.poet	@ltx/en_us_dedes/poets:po.Vasileiou
ltx/en_us_dedes/me.m10.d18:meVE.Aposticha4.text	You searched the depths of the noetic sea, and using the fishing rod of wisdom, you caught the souls of the believers out of that deathly deep, O all-blessed Luke. You became a disciple of Paul, and you purified your heart completely, by the Spirit’s illumination. You enlightened the nations with your teachings, and by your miracles you cured the sick passions. And you continually pray for us to Christ our God, to save our souls.
ltx/en_us_dedes/me.m10.d18:meVE.GeneralApolytikion1.melody	@ltx/en_us_dedes/he.ga:heGA.ApostoleAgie.name
ltx/en_us_dedes/me.m10.d18:meVE.GeneralApolytikion1.mode	@ltx/en_us_dedes/miscellanea:misc.Mode3
ltx/en_us_dedes/me.m10.d18:meVE.GeneralApolytikion1.name	Luke,
ltx/en_us_dedes/me.m10.d18:meVE.MM.GeneralApolytikion1.text	
ltx/en_us_dedes/me.m10.d18:meVE.MM.Stichera1234as78910.text	@ltx/en_us_dedes/properties:media.key
ltx/en_us_dedes/me.m10.d18:meVE.SticGlory.incipit	O Apostle of Christ, you…
ltx/en_us_dedes/me.m10.d18:meVE.SticGlory.melody	
ltx/en_us_dedes/me.m10.d18:meVE.SticGlory.mode	@ltx/en_us_dedes/miscellanea:misc.Mode6
ltx/en_us_dedes/me.m10.d18:meVE.SticGlory.poet	@ltx/en_us_dedes/poets:po.Anatoliou
ltx/en_us_dedes/me.m10.d18:meVE.SticGlory.text	O Apostle of Christ, you are the writer of divine doctrines, and a firm support of the Church. When you became a follower of Paul, that chosen vessel, you also imitated him. You saved the hearts, darkened by ignorance, that had fallen into the depths of perdition; for you pulled them up by your godly words, as if out of the stormy sea. Therefore we pray to you, O praiseworthy Luke, the pride and joy of the people of Antioch. Intercede with our Savior and God, for us who faithfully observe your ever-venerable memory.
ltx/en_us_dedes/me.m10.d18:meVE.SticTheotokion.greekmelody	@ltx/en_us_dedes/he.a.m6:heAU.TriimerosAnestis.greekname
ltx/en_us_dedes/me.m10.d18:meVE.SticTheotokion.incipit	O Trinity omnipotent, * one…
ltx/en_us_dedes/me.m10.d18:meVE.SticTheotokion.melody	@ltx/en_us_dedes/he.a.m6:heAU.TriimerosAnestis.name
ltx/en_us_dedes/me.m10.d18:meVE.SticTheotokion.mode	@ltx/en_us_dedes/miscellanea:misc.Mode6
ltx/en_us_dedes/me.m10.d18:meVE.SticTheotokion.text	O Trinity omnipotent, * one God in three hypostases, * we extol You, * and entreat You, “By the strong * intercessions of Your holy * Disciple and Apostle, * and the Ever-Virgin, save us all.”
ltx/en_us_dedes/me.m10.d18:meVE.Stichera01.greekmelody	@ltx/en_us_dedes/he.a.m8:heAU.TiYmasKalesomen.greekname
ltx/en_us_dedes/me.m10.d18:meVE.Stichera01.incipit	What shall I now call…
ltx/en_us_dedes/me.m10.d18:meVE.Stichera01.melody	@ltx/en_us_dedes/he.a.m8:heAU.TiYmasKalesomen.name
ltx/en_us_dedes/me.m10.d18:meVE.Stichera01.mode	@ltx/en_us_dedes/miscellanea:misc.Mode8
ltx/en_us_dedes/me.m10.d18:meVE.Stichera01.text	What shall I now call you, Apostle Luke? * Since you rain down the divine and saving waters, you are Cloud. * You are Lightning for illumining the world with light divine; * and Heaven, for declaring the glory of God; * and Wine Bowl, pouring forth to us abundantly * the wine of wisdom inspired by God, * which truly gladdens believers’ hearts. * So intercede, we entreat you, that our souls be saved.
ltx/en_us_dedes/me.m10.d18:meVE.Stichera02.incipit	How shall I address you…
ltx/en_us_dedes/me.m10.d18:meVE.Stichera02.melody	@ltx/en_us_dedes/he.a.m8:heAU.TiYmasKalesomen.name
ltx/en_us_dedes/me.m10.d18:meVE.Stichera02.mode	@ltx/en_us_dedes/miscellanea:misc.Mode8
ltx/en_us_dedes/me.m10.d18:meVE.Stichera02.text	How shall I address you, O man of God? * River flowing out from Paradise and coming down to us; * or the Ark of the new Covenant that Christ has made with us; * a glowing luminary of noetic light; * a lampstand shining brightly on the Church of Christ; * the holy table, the bread of life, * the cup containing the Spirit’s grace. * So intercede, we entreat you, that our souls be saved.
ltx/en_us_dedes/me.m10.d18:meVE.Stichera03.incipit	What shall we call you…
ltx/en_us_dedes/me.m10.d18:meVE.Stichera03.melody	@ltx/en_us_dedes/he.a.m8:heAU.TiYmasKalesomen.name
ltx/en_us_dedes/me.m10.d18:meVE.Stichera03.mode	@ltx/en_us_dedes/miscellanea:misc.Mode8
ltx/en_us_dedes/me.m10.d18:meVE.Stichera03.text	What shall we call you, O seer of God? * Most effective priest and server of the mysteries of Christ; * skillful builder of the Lord’s noetic Tabernacle; * inscriber of the tablets of the grace of God; * recorder of the new and holy Law of God, * which out of Zion has come to us * and was proclaimed to the world through you. * So intercede, we entreat you, that our souls be saved.
ltx/en_us_dedes/me.m10.d18:meVE.Stichera04.greekmelody	@ltx/en_us_dedes/he.a.m8:heAU.TiYmasKalesomen.greekname
ltx/en_us_dedes/me.m10.d18:meVE.Stichera04.incipit	What shall we call you…
ltx/en_us_dedes/me.m10.d18:meVE.Stichera04.melody	@ltx/en_us_dedes/he.a.m8:heAU.TiYmasKalesomen.name
ltx/en_us_dedes/me.m10.d18:meVE.Stichera04.mode	@ltx/en_us_dedes/miscellanea:misc.Mode8
ltx/en_us_dedes/me.m10.d18:meVE.Stichera04.text	What shall we call you, O glorious one? * The securest store and treasure of celestial gifts of grace. * The experienced physician of our bodies and our souls, * who worked with and accompanied Apostle Paul, * and wrote down the Apostles’ Acts for all to read. * Virtue procured many names for you, * O Luke, by which we now honor you. * So intercede, we entreat you, that our souls be saved.
ltx/en_us_dedes/me.m10.d18:meVE.Stichera05.incipit	How shall I address you…
ltx/en_us_dedes/me.m10.d18:meVE.Stichera05.melody	@ltx/en_us_dedes/he.a.m8:heAU.TiYmasKalesomen.name
ltx/en_us_dedes/me.m10.d18:meVE.Stichera05.mode	@ltx/en_us_dedes/miscellanea:misc.Mode8
ltx/en_us_dedes/me.m10.d18:meVE.Stichera05.text	How shall I address you who speak from God? * True Disciple and Evangelist for preaching Christ to us, * and Physician for you cure the many ailments of the soul; * a Lampstand, shining brightly with noetic light; * foundation of the Faith, on which it firmly stands. * For us your wrote down the most divine * and holy Gospel of Christ our God. * So intercede, we entreat you, that our souls be saved.
ltx/en_us_dedes/me.m10.d18:meVE.Stichera06.incipit	How shall I address you…
ltx/en_us_dedes/me.m10.d18:meVE.Stichera06.melody	@ltx/en_us_dedes/he.a.m8:heAU.TiYmasKalesomen.name
ltx/en_us_dedes/me.m10.d18:meVE.Stichera06.mode	@ltx/en_us_dedes/miscellanea:misc.Mode8
ltx/en_us_dedes/me.m10.d18:meVE.Stichera06.text	How shall I address you, O wondrous Luke? * The unerring trusted envoy of the wisdom taught by God; * and the scribe who has recorded the Apostles’ words and acts. * Unshaken pillar of the true belief in God; * the Church’s indestructible tower and wall. * Your strengths are many and marvelous, * and even more so the gifts of grace. * So intercede, we entreat you, that our souls be saved.
