ltx/en_us_dedes/me.m07.d02:meDA.commemoration.first	Commemoration of the Placement in Blachernai of the Precious Garment of the Most Holy Theotokos
ltx/en_us_dedes/me.m07.d02:meDA.commemoration.first_name	
ltx/en_us_dedes/me.m07.d02:meDA.commemoration.first_short	Commemoration of the Placement in Blachernai of the Precious Garment of the Most Holy Theotokos
ltx/en_us_dedes/me.m07.d02:meDA.commemoration.first_title	@ltx/en_us_dedes/titles:ti.Theotokos
ltx/en_us_dedes/me.m07.d02:meDA.commemoration.full	Commemoration of the Placement in Blachernai of the Precious Garment of the Most Holy Theotokos
ltx/en_us_dedes/me.m07.d02:meDA.commemoration.second_name	
ltx/en_us_dedes/me.m07.d02:meDA.commemoration.second_title	
ltx/en_us_dedes/me.m07.d02:meDA.date	July 2
ltx/en_us_dedes/me.m07.d02:meDA.fordate	for July 2
ltx/en_us_dedes/me.m07.d02:meDA.insert1	
ltx/en_us_dedes/me.m07.d02:meDA.insert2	the placing of whose precious Garment at Blacherai we commemorate,
ltx/en_us_dedes/me.m07.d02:meDA.note	
ltx/en_us_dedes/me.m07.d02:meDA.pdfcoverdate	July 2,
ltx/en_us_dedes/me.m07.d02:meDA.pdfheaderdate	July 2
ltx/en_us_dedes/me.m07.d02:meHO.commemorations	
ltx/en_us_dedes/me.m07.d02:meHO.note1	
ltx/en_us_dedes/me.m07.d02:meHO.note2	
ltx/en_us_dedes/me.m07.d02:meHO.number	
ltx/en_us_dedes/me.m07.d02:meHO.rank	
ltx/en_us_dedes/me.m07.d02:meLE.commemoration1	The Placing of the Venerable Robe of the Theotokos at Blachernai.
ltx/en_us_dedes/me.m07.d02:meLE.commemoration2	
ltx/en_us_dedes/me.m07.d02:meLI.Kontakion1.greekmelody	@ltx/en_us_dedes/me.m07.d02:meMA.Kontakion1.greekmelody
ltx/en_us_dedes/me.m07.d02:meLI.Kontakion1.incipit	@ltx/en_us_dedes/me.m07.d02:meMA.Kontakion1.incipit
ltx/en_us_dedes/me.m07.d02:meLI.Kontakion1.melody	@ltx/en_us_dedes/me.m07.d02:meMA.Kontakion1.melody
ltx/en_us_dedes/me.m07.d02:meLI.Kontakion1.mode	@ltx/en_us_dedes/me.m07.d02:meMA.Kontakion1.mode
ltx/en_us_dedes/me.m07.d02:meLI.Kontakion1.text	@ltx/en_us_dedes/me.m07.d02:meMA.Kontakion1.text
ltx/en_us_dedes/me.m07.d02:meLI.MM.CommunionHymn.text	@ltx/en_us_dedes/properties:media.key
ltx/en_us_dedes/me.m07.d02:meLI.Megalynarion.text	
ltx/en_us_dedes/me.m07.d02:meMA.C1.acrostic.notice1	
ltx/en_us_dedes/me.m07.d02:meMA.C1.acrostic.text	
ltx/en_us_dedes/me.m07.d02:meMA.C1.acrostic.title	The Canon for the Most Holy Theotokos.
ltx/en_us_dedes/me.m07.d02:meMA.C1.title	@ltx/en_us_dedes/titles:ti.Canon1Theotokos
ltx/en_us_dedes/me.m07.d02:meMA.C1.verse	@ltx/en_us_dedes/prayers:pr.verse_Theotokos.text
ltx/en_us_dedes/me.m07.d02:meMA.C2.title	@ltx/en_us_dedes/titles:ti.Canon2Theotokos
ltx/en_us_dedes/me.m07.d02:meMA.C2.verse	@ltx/en_us_dedes/prayers:pr.verse_Theotokos.text
ltx/en_us_dedes/me.m07.d02:meMA.Exaposteilarion1.greekmelody	@ltx/en_us_dedes/he.a.m3:heAU.FosAnalloioton.greekname
ltx/en_us_dedes/me.m07.d02:meMA.Exaposteilarion1.incipit	Only you, O Theotokos, *…
ltx/en_us_dedes/me.m07.d02:meMA.Exaposteilarion1.melody	@ltx/en_us_dedes/he.a.m3:heAU.FosAnalloioton.name
ltx/en_us_dedes/me.m07.d02:meMA.Exaposteilarion1.mode	@ltx/en_us_dedes/miscellanea:misc.Mode3
ltx/en_us_dedes/me.m07.d02:meMA.Exaposteilarion1.text	Only you, O Theotokos, * made novel both time and nature. * Your childbirth had no corruption, * and your Dress is incorrupt. * By it you shelter your city; * by it you strengthen * the scepters of pious rulers.
ltx/en_us_dedes/me.m07.d02:meMA.Kathisma11.greekmelody	@ltx/en_us_dedes/he.a.m4:heAU.EpefanisSimeron.greekname
ltx/en_us_dedes/me.m07.d02:meMA.Kathisma11.incipit	On this day, All-lauded One…
ltx/en_us_dedes/me.m07.d02:meMA.Kathisma11.melody	@ltx/en_us_dedes/he.a.m4:heAU.EpefanisSimeron.name
ltx/en_us_dedes/me.m07.d02:meMA.Kathisma11.mode	@ltx/en_us_dedes/miscellanea:misc.Mode4
ltx/en_us_dedes/me.m07.d02:meMA.Kathisma11.text	On this day, All-lauded One, your faithful people * gaily celebrate the feast of the Bestowal of your Dress, * and we intently cry out to you; * Rejoice, O Virgin, the boast of Christians everywhere.
ltx/en_us_dedes/me.m07.d02:meMA.Kathisma21.greekmelody	@ltx/en_us_dedes/he.a.m4:heAU.EpefanisSimeron.greekname
ltx/en_us_dedes/me.m07.d02:meMA.Kathisma21.incipit	The entire world today is…
ltx/en_us_dedes/me.m07.d02:meMA.Kathisma21.melody	@ltx/en_us_dedes/he.a.m4:heAU.EpefanisSimeron.name
ltx/en_us_dedes/me.m07.d02:meMA.Kathisma21.mode	@ltx/en_us_dedes/miscellanea:misc.Mode4
ltx/en_us_dedes/me.m07.d02:meMA.Kathisma21.text	The entire world today is celebrating * the bestowal of your Dress, O Lady modest and all-pure, * and it cries out to you longingly: * Rejoice, O Virgin, the help of believers all.
ltx/en_us_dedes/me.m07.d02:meMA.Kontakion1.greekmelody	@ltx/en_us_dedes/he.a.m4:heAU.OYpsotheisEnToStavro.greekname
ltx/en_us_dedes/me.m07.d02:meMA.Kontakion1.incipit	You have bestowed your sacred…
ltx/en_us_dedes/me.m07.d02:meMA.Kontakion1.melody	@ltx/en_us_dedes/he.a.m4:heAU.OYpsotheisEnToStavro.name
ltx/en_us_dedes/me.m07.d02:meMA.Kontakion1.mode	@ltx/en_us_dedes/miscellanea:misc.Mode4
ltx/en_us_dedes/me.m07.d02:meMA.Kontakion1.text	You have bestowed your sacred Garment, O Lady, * to be a robe of incorruption, O pure one, * for all the faithful, O divine protection of mankind; * for with it you had arrayed your most pure sacred body. * Now with longing we observe the feast of its bestowal, * and in a loud voice we cry out with faith: * Rejoice, O Virgin, the boast of Christians everywhere.
ltx/en_us_dedes/me.m07.d02:meMA.Lauds1.greekmelody	@ltx/en_us_dedes/he.a.m4:heAU.OsGennaionEnMartysi.greekname
ltx/en_us_dedes/me.m07.d02:meMA.Lauds1.incipit	Now the case that contains…
ltx/en_us_dedes/me.m07.d02:meMA.Lauds1.melody	@ltx/en_us_dedes/he.a.m4:heAU.OsGennaionEnMartysi.name
ltx/en_us_dedes/me.m07.d02:meMA.Lauds1.mode	@ltx/en_us_dedes/miscellanea:misc.Mode4
ltx/en_us_dedes/me.m07.d02:meMA.Lauds1.text	Now the case that contains your Dress, * O immaculate Lady pure, * is for us your servants an ark of holiness, * a sacred wall that surrounds us all, * our glory and pride and joy, * and the source of many cures. * Every day we acknowledge this; and therefore today * we have solemnly gathered to extol you, and your great deeds which are many * and inexhaustible miracles.
ltx/en_us_dedes/me.m07.d02:meMA.Lauds2.incipit	See the place that is…
ltx/en_us_dedes/me.m07.d02:meMA.Lauds2.melody	@ltx/en_us_dedes/he.a.m4:heAU.OsGennaionEnMartysi.name
ltx/en_us_dedes/me.m07.d02:meMA.Lauds2.mode	@ltx/en_us_dedes/miscellanea:misc.Mode4
ltx/en_us_dedes/me.m07.d02:meMA.Lauds2.text	See the place that is glorious, * see the house ever luminous, * in which is the graced treasure of the honored Dress, * which once belonged to the Maid of God. * O people, approach today * and draw from it for yourselves * lumination and clemency, and cry out to her * with a heart full of gratitude: We bless you, O all-holy Virgin Lady, * for we were saved by the Son you bore.
ltx/en_us_dedes/me.m07.d02:meMA.Lauds3.incipit	With great joy we commemorate…
ltx/en_us_dedes/me.m07.d02:meMA.Lauds3.melody	@ltx/en_us_dedes/he.a.m4:heAU.OsGennaionEnMartysi.name
ltx/en_us_dedes/me.m07.d02:meMA.Lauds3.mode	@ltx/en_us_dedes/miscellanea:misc.Mode4
ltx/en_us_dedes/me.m07.d02:meMA.Lauds3.text	With great joy we commemorate * the bestowal of your august * Garment in your city, O Lady, with a feast. * For you have counted it worthy of * receiving it on this day * as a wall for our defense, * as protection inviolate, as a precious gift, * as immovable wealth of cures and healings, and a river that is teaming * with all the gifts of the Spirit of God.
ltx/en_us_dedes/me.m07.d02:meMA.LaudsGlory.incipit	@ltx/en_us_dedes/me.m07.d02:meVE.SticGlory.incipit
ltx/en_us_dedes/me.m07.d02:meMA.LaudsGlory.melody	
ltx/en_us_dedes/me.m07.d02:meMA.LaudsGlory.mode	@ltx/en_us_dedes/miscellanea:misc.Mode2
ltx/en_us_dedes/me.m07.d02:meMA.LaudsGlory.text	@ltx/en_us_dedes/me.m07.d02:meVE.SticGlory.text
ltx/en_us_dedes/me.m07.d02:meMA.MM.Lauds1123as5678.text	@ltx/en_us_dedes/properties:media.key
ltx/en_us_dedes/me.m07.d02:meMA.Ode1C11.greekmelody	@ltx/en_us_dedes/he.h.m4:heHE.TristatasKrataious.greekname
ltx/en_us_dedes/me.m07.d02:meMA.Ode1C11.incipit	…
ltx/en_us_dedes/me.m07.d02:meMA.Ode1C11.melody	@ltx/en_us_dedes/he.h.m4:heHE.TristatasKrataious.name
ltx/en_us_dedes/me.m07.d02:meMA.Ode1C11.mode	@ltx/en_us_dedes/miscellanea:misc.Mode4
ltx/en_us_dedes/me.m07.d02:meMA.Ode1C11.ode	@ltx/en_us_dedes/miscellanea:misc.Ode1
ltx/en_us_dedes/me.m07.d02:meMA.Ode1C11.text	
ltx/en_us_dedes/me.m07.d02:meMA.Ode1C12.incipit	…
ltx/en_us_dedes/me.m07.d02:meMA.Ode1C12.melody	@ltx/en_us_dedes/he.h.m4:heHE.TristatasKrataious.name
ltx/en_us_dedes/me.m07.d02:meMA.Ode1C12.mode	@ltx/en_us_dedes/miscellanea:misc.Mode4
ltx/en_us_dedes/me.m07.d02:meMA.Ode1C12.ode	@ltx/en_us_dedes/miscellanea:misc.Ode1
ltx/en_us_dedes/me.m07.d02:meMA.Ode1C12.text	
ltx/en_us_dedes/me.m07.d02:meMA.Ode1C13.incipit	…
ltx/en_us_dedes/me.m07.d02:meMA.Ode1C13.melody	@ltx/en_us_dedes/he.h.m4:heHE.TristatasKrataious.name
ltx/en_us_dedes/me.m07.d02:meMA.Ode1C13.mode	@ltx/en_us_dedes/miscellanea:misc.Mode4
ltx/en_us_dedes/me.m07.d02:meMA.Ode1C13.ode	@ltx/en_us_dedes/miscellanea:misc.Ode1
ltx/en_us_dedes/me.m07.d02:meMA.Ode1C13.text	
ltx/en_us_dedes/me.m07.d02:meMA.Ode1C14.incipit	…
ltx/en_us_dedes/me.m07.d02:meMA.Ode1C14.melody	@ltx/en_us_dedes/he.h.m4:heHE.TristatasKrataious.name
ltx/en_us_dedes/me.m07.d02:meMA.Ode1C14.mode	@ltx/en_us_dedes/miscellanea:misc.Mode4
ltx/en_us_dedes/me.m07.d02:meMA.Ode1C14.ode	@ltx/en_us_dedes/miscellanea:misc.Ode1
ltx/en_us_dedes/me.m07.d02:meMA.Ode1C14.text	
ltx/en_us_dedes/me.m07.d02:meMA.Ode1C1H.greekmelody	@ltx/en_us_dedes/he.h.m4:heHE.TristatasKrataious.greekname
ltx/en_us_dedes/me.m07.d02:meMA.Ode1C1H.incipit	@ltx/en_us_dedes/he.h.m4:heHE.TristatasKrataious.incipit
ltx/en_us_dedes/me.m07.d02:meMA.Ode1C1H.melody	@ltx/en_us_dedes/he.h.m4:heHE.TristatasKrataious.melody
ltx/en_us_dedes/me.m07.d02:meMA.Ode1C1H.mode	@ltx/en_us_dedes/miscellanea:misc.Mode4
ltx/en_us_dedes/me.m07.d02:meMA.Ode1C1H.ode	@ltx/en_us_dedes/miscellanea:misc.Ode1
ltx/en_us_dedes/me.m07.d02:meMA.Ode1C1H.text	@ltx/en_us_dedes/he.h.m4:heHE.TristatasKrataious.text
ltx/en_us_dedes/me.m07.d02:meMA.Ode1C21.greekmelody	@ltx/en_us_dedes/he.h.m4:heHE.ThalassisToErythraion.greekname
ltx/en_us_dedes/me.m07.d02:meMA.Ode1C21.incipit	…
ltx/en_us_dedes/me.m07.d02:meMA.Ode1C21.melody	@ltx/en_us_dedes/he.h.m4:heHE.ThalassisToErythraion.name
ltx/en_us_dedes/me.m07.d02:meMA.Ode1C21.mode	@ltx/en_us_dedes/miscellanea:misc.Mode4
ltx/en_us_dedes/me.m07.d02:meMA.Ode1C21.ode	@ltx/en_us_dedes/miscellanea:misc.Ode1
ltx/en_us_dedes/me.m07.d02:meMA.Ode1C21.text	
ltx/en_us_dedes/me.m07.d02:meMA.Ode1C22.incipit	…
ltx/en_us_dedes/me.m07.d02:meMA.Ode1C22.melody	@ltx/en_us_dedes/he.h.m4:heHE.ThalassisToErythraion.name
ltx/en_us_dedes/me.m07.d02:meMA.Ode1C22.mode	@ltx/en_us_dedes/miscellanea:misc.Mode4
ltx/en_us_dedes/me.m07.d02:meMA.Ode1C22.ode	@ltx/en_us_dedes/miscellanea:misc.Ode1
ltx/en_us_dedes/me.m07.d02:meMA.Ode1C22.text	
ltx/en_us_dedes/me.m07.d02:meMA.Ode1C23.incipit	…
ltx/en_us_dedes/me.m07.d02:meMA.Ode1C23.melody	@ltx/en_us_dedes/he.h.m4:heHE.ThalassisToErythraion.name
ltx/en_us_dedes/me.m07.d02:meMA.Ode1C23.mode	@ltx/en_us_dedes/miscellanea:misc.Mode4
ltx/en_us_dedes/me.m07.d02:meMA.Ode1C23.ode	@ltx/en_us_dedes/miscellanea:misc.Ode1
ltx/en_us_dedes/me.m07.d02:meMA.Ode1C23.text	
ltx/en_us_dedes/me.m07.d02:meMA.Ode3C11.greekmelody	@ltx/en_us_dedes/he.h.m4:heHE.OtiSteiraEteken.greekname
ltx/en_us_dedes/me.m07.d02:meMA.Ode3C11.incipit	Let us sing in praise…
ltx/en_us_dedes/me.m07.d02:meMA.Ode3C11.melody	@ltx/en_us_dedes/he.h.m4:heHE.OtiSteiraEteken.name
ltx/en_us_dedes/me.m07.d02:meMA.Ode3C11.mode	@ltx/en_us_dedes/miscellanea:misc.Mode4
ltx/en_us_dedes/me.m07.d02:meMA.Ode3C11.ode	@ltx/en_us_dedes/miscellanea:misc.Ode3
ltx/en_us_dedes/me.m07.d02:meMA.Ode3C11.text	Let us sing in praise of her who is the gateway to heaven, * the lovely sanctuary, the holy Mother of our God, * and spiritually venerate her sacred Dress, which pours out gifts of grace divine.
ltx/en_us_dedes/me.m07.d02:meMA.Ode3C12.incipit	By your virgin childbirth, we…
ltx/en_us_dedes/me.m07.d02:meMA.Ode3C12.melody	@ltx/en_us_dedes/he.h.m4:heHE.OtiSteiraEteken.name
ltx/en_us_dedes/me.m07.d02:meMA.Ode3C12.mode	@ltx/en_us_dedes/miscellanea:misc.Mode4
ltx/en_us_dedes/me.m07.d02:meMA.Ode3C12.ode	@ltx/en_us_dedes/miscellanea:misc.Ode3
ltx/en_us_dedes/me.m07.d02:meMA.Ode3C12.text	By your virgin childbirth, we whom corruption denuded * were clothed in the garment of incorruption, O Lady pure. * You gave to us the gift of your all-holy Dress and joy that will never end.
ltx/en_us_dedes/me.m07.d02:meMA.Ode3C13.incipit	Immaculate Virgin, in your holy…
ltx/en_us_dedes/me.m07.d02:meMA.Ode3C13.melody	@ltx/en_us_dedes/he.h.m4:heHE.OtiSteiraEteken.name
ltx/en_us_dedes/me.m07.d02:meMA.Ode3C13.mode	@ltx/en_us_dedes/miscellanea:misc.Mode4
ltx/en_us_dedes/me.m07.d02:meMA.Ode3C13.ode	@ltx/en_us_dedes/miscellanea:misc.Ode3
ltx/en_us_dedes/me.m07.d02:meMA.Ode3C13.text	Immaculate Virgin, in your holy Garment you covered * your Son and Lord, who covers the sky above us with the clouds. * With faith we venerate it and we glorify you, the shelter of our souls.
ltx/en_us_dedes/me.m07.d02:meMA.Ode3C14.incipit	Virgin, your divine and holy…
ltx/en_us_dedes/me.m07.d02:meMA.Ode3C14.melody	@ltx/en_us_dedes/he.h.m4:heHE.OtiSteiraEteken.name
ltx/en_us_dedes/me.m07.d02:meMA.Ode3C14.mode	@ltx/en_us_dedes/miscellanea:misc.Mode4
ltx/en_us_dedes/me.m07.d02:meMA.Ode3C14.ode	@ltx/en_us_dedes/miscellanea:misc.Ode3
ltx/en_us_dedes/me.m07.d02:meMA.Ode3C14.text	Virgin, your divine and holy house was once a free clinic * for the infirm who went there, wherein your Garment was enshrined, * which proved to be a never ending fountain of healing, O all-blameless one.
ltx/en_us_dedes/me.m07.d02:meMA.Ode3C1H.greekmelody	@ltx/en_us_dedes/he.h.m4:heHE.OtiSteiraEteken.greekname
ltx/en_us_dedes/me.m07.d02:meMA.Ode3C1H.incipit	@ltx/en_us_dedes/he.h.m4:heHE.OtiSteiraEteken.incipit
ltx/en_us_dedes/me.m07.d02:meMA.Ode3C1H.melody	@ltx/en_us_dedes/he.h.m4:heHE.OtiSteiraEteken.melody
ltx/en_us_dedes/me.m07.d02:meMA.Ode3C1H.mode	@ltx/en_us_dedes/miscellanea:misc.Mode4
ltx/en_us_dedes/me.m07.d02:meMA.Ode3C1H.ode	@ltx/en_us_dedes/miscellanea:misc.Ode3
ltx/en_us_dedes/me.m07.d02:meMA.Ode3C1H.text	@ltx/en_us_dedes/he.h.m4:heHE.OtiSteiraEteken.text
ltx/en_us_dedes/me.m07.d02:meMA.Ode3C21.greekmelody	@ltx/en_us_dedes/he.h.m4:heHE.EffrainetaiEpiSoi.greekname
ltx/en_us_dedes/me.m07.d02:meMA.Ode3C21.incipit	…
ltx/en_us_dedes/me.m07.d02:meMA.Ode3C21.melody	@ltx/en_us_dedes/he.h.m4:heHE.EffrainetaiEpiSoi.name
ltx/en_us_dedes/me.m07.d02:meMA.Ode3C21.mode	@ltx/en_us_dedes/miscellanea:misc.Mode4
ltx/en_us_dedes/me.m07.d02:meMA.Ode3C21.ode	@ltx/en_us_dedes/miscellanea:misc.Ode3
ltx/en_us_dedes/me.m07.d02:meMA.Ode3C21.text	
ltx/en_us_dedes/me.m07.d02:meMA.Ode3C22.incipit	…
ltx/en_us_dedes/me.m07.d02:meMA.Ode3C22.melody	@ltx/en_us_dedes/he.h.m4:heHE.EffrainetaiEpiSoi.name
ltx/en_us_dedes/me.m07.d02:meMA.Ode3C22.mode	@ltx/en_us_dedes/miscellanea:misc.Mode4
ltx/en_us_dedes/me.m07.d02:meMA.Ode3C22.ode	@ltx/en_us_dedes/miscellanea:misc.Ode3
ltx/en_us_dedes/me.m07.d02:meMA.Ode3C22.text	
ltx/en_us_dedes/me.m07.d02:meMA.Ode3C23.incipit	…
ltx/en_us_dedes/me.m07.d02:meMA.Ode3C23.melody	@ltx/en_us_dedes/he.h.m4:heHE.EffrainetaiEpiSoi.name
ltx/en_us_dedes/me.m07.d02:meMA.Ode3C23.mode	@ltx/en_us_dedes/miscellanea:misc.Mode4
ltx/en_us_dedes/me.m07.d02:meMA.Ode3C23.ode	@ltx/en_us_dedes/miscellanea:misc.Ode3
ltx/en_us_dedes/me.m07.d02:meMA.Ode3C23.text	
ltx/en_us_dedes/me.m07.d02:meMA.Ode3H.greekmelody	@ltx/en_us_dedes/he.h.m4:heHE.EffrainetaiEpiSoi.greekname
ltx/en_us_dedes/me.m07.d02:meMA.Ode3H.incipit	@ltx/en_us_dedes/he.h.m4:heHE.EffrainetaiEpiSoi.incipit
ltx/en_us_dedes/me.m07.d02:meMA.Ode3H.melody	@ltx/en_us_dedes/he.h.m4:heHE.EffrainetaiEpiSoi.melody
ltx/en_us_dedes/me.m07.d02:meMA.Ode3H.mode	@ltx/en_us_dedes/miscellanea:misc.Mode4
ltx/en_us_dedes/me.m07.d02:meMA.Ode3H.ode	@ltx/en_us_dedes/miscellanea:misc.Ode3
ltx/en_us_dedes/me.m07.d02:meMA.Ode3H.text	@ltx/en_us_dedes/he.h.m4:heHE.EffrainetaiEpiSoi.text
ltx/en_us_dedes/me.m07.d02:meMA.Ode3Kathisma1.greekmelody	@ltx/en_us_dedes/he.a.m4:heAU.OYpsotheisEnToStavro.greekname
ltx/en_us_dedes/me.m07.d02:meMA.Ode3Kathisma1.incipit	…
ltx/en_us_dedes/me.m07.d02:meMA.Ode3Kathisma1.melody	@ltx/en_us_dedes/he.a.m4:heAU.OYpsotheisEnToStavro.name
ltx/en_us_dedes/me.m07.d02:meMA.Ode3Kathisma1.mode	@ltx/en_us_dedes/miscellanea:misc.Mode4
ltx/en_us_dedes/me.m07.d02:meMA.Ode3Kathisma1.text	
ltx/en_us_dedes/me.m07.d02:meMA.Ode4C11.greekmelody	@ltx/en_us_dedes/he.h.m4:heHE.DiAgapisinOiktirmon.greekname
ltx/en_us_dedes/me.m07.d02:meMA.Ode4C11.incipit	…
ltx/en_us_dedes/me.m07.d02:meMA.Ode4C11.melody	@ltx/en_us_dedes/he.h.m4:heHE.DiAgapisinOiktirmon.name
ltx/en_us_dedes/me.m07.d02:meMA.Ode4C11.mode	@ltx/en_us_dedes/miscellanea:misc.Mode4
ltx/en_us_dedes/me.m07.d02:meMA.Ode4C11.ode	@ltx/en_us_dedes/miscellanea:misc.Ode4
ltx/en_us_dedes/me.m07.d02:meMA.Ode4C11.text	
ltx/en_us_dedes/me.m07.d02:meMA.Ode4C12.incipit	…
ltx/en_us_dedes/me.m07.d02:meMA.Ode4C12.melody	@ltx/en_us_dedes/he.h.m4:heHE.DiAgapisinOiktirmon.name
ltx/en_us_dedes/me.m07.d02:meMA.Ode4C12.mode	@ltx/en_us_dedes/miscellanea:misc.Mode4
ltx/en_us_dedes/me.m07.d02:meMA.Ode4C12.ode	@ltx/en_us_dedes/miscellanea:misc.Ode4
ltx/en_us_dedes/me.m07.d02:meMA.Ode4C12.text	
ltx/en_us_dedes/me.m07.d02:meMA.Ode4C13.incipit	…
ltx/en_us_dedes/me.m07.d02:meMA.Ode4C13.melody	@ltx/en_us_dedes/he.h.m4:heHE.DiAgapisinOiktirmon.name
ltx/en_us_dedes/me.m07.d02:meMA.Ode4C13.mode	@ltx/en_us_dedes/miscellanea:misc.Mode4
ltx/en_us_dedes/me.m07.d02:meMA.Ode4C13.ode	@ltx/en_us_dedes/miscellanea:misc.Ode4
ltx/en_us_dedes/me.m07.d02:meMA.Ode4C13.text	
ltx/en_us_dedes/me.m07.d02:meMA.Ode4C14.incipit	…
ltx/en_us_dedes/me.m07.d02:meMA.Ode4C14.melody	@ltx/en_us_dedes/he.h.m4:heHE.DiAgapisinOiktirmon.name
ltx/en_us_dedes/me.m07.d02:meMA.Ode4C14.mode	@ltx/en_us_dedes/miscellanea:misc.Mode4
ltx/en_us_dedes/me.m07.d02:meMA.Ode4C14.ode	@ltx/en_us_dedes/miscellanea:misc.Ode4
ltx/en_us_dedes/me.m07.d02:meMA.Ode4C14.text	
ltx/en_us_dedes/me.m07.d02:meMA.Ode4C1H.greekmelody	@ltx/en_us_dedes/he.h.m4:heHE.DiAgapisinOiktirmon.greekname
ltx/en_us_dedes/me.m07.d02:meMA.Ode4C1H.incipit	@ltx/en_us_dedes/he.h.m4:heHE.DiAgapisinOiktirmon.incipit
ltx/en_us_dedes/me.m07.d02:meMA.Ode4C1H.melody	@ltx/en_us_dedes/he.h.m4:heHE.DiAgapisinOiktirmon.melody
ltx/en_us_dedes/me.m07.d02:meMA.Ode4C1H.mode	@ltx/en_us_dedes/miscellanea:misc.Mode4
ltx/en_us_dedes/me.m07.d02:meMA.Ode4C1H.ode	@ltx/en_us_dedes/miscellanea:misc.Ode4
ltx/en_us_dedes/me.m07.d02:meMA.Ode4C1H.text	@ltx/en_us_dedes/he.h.m4:heHE.DiAgapisinOiktirmon.text
ltx/en_us_dedes/me.m07.d02:meMA.Ode4C21.greekmelody	@ltx/en_us_dedes/he.h.m4:heHE.EparthentaSeIdousa.greekname
ltx/en_us_dedes/me.m07.d02:meMA.Ode4C21.incipit	…
ltx/en_us_dedes/me.m07.d02:meMA.Ode4C21.melody	@ltx/en_us_dedes/he.h.m4:heHE.EparthentaSeIdousa.name
ltx/en_us_dedes/me.m07.d02:meMA.Ode4C21.mode	@ltx/en_us_dedes/miscellanea:misc.Mode4
ltx/en_us_dedes/me.m07.d02:meMA.Ode4C21.ode	@ltx/en_us_dedes/miscellanea:misc.Ode4
ltx/en_us_dedes/me.m07.d02:meMA.Ode4C21.text	
ltx/en_us_dedes/me.m07.d02:meMA.Ode4C22.incipit	…
ltx/en_us_dedes/me.m07.d02:meMA.Ode4C22.melody	@ltx/en_us_dedes/he.h.m4:heHE.EparthentaSeIdousa.name
ltx/en_us_dedes/me.m07.d02:meMA.Ode4C22.mode	@ltx/en_us_dedes/miscellanea:misc.Mode4
ltx/en_us_dedes/me.m07.d02:meMA.Ode4C22.ode	@ltx/en_us_dedes/miscellanea:misc.Ode4
ltx/en_us_dedes/me.m07.d02:meMA.Ode4C22.text	
ltx/en_us_dedes/me.m07.d02:meMA.Ode4C23.incipit	…
ltx/en_us_dedes/me.m07.d02:meMA.Ode4C23.melody	@ltx/en_us_dedes/he.h.m4:heHE.EparthentaSeIdousa.name
ltx/en_us_dedes/me.m07.d02:meMA.Ode4C23.mode	@ltx/en_us_dedes/miscellanea:misc.Mode4
ltx/en_us_dedes/me.m07.d02:meMA.Ode4C23.ode	@ltx/en_us_dedes/miscellanea:misc.Ode4
ltx/en_us_dedes/me.m07.d02:meMA.Ode4C23.text	
ltx/en_us_dedes/me.m07.d02:meMA.Ode5C11.greekmelody	@ltx/en_us_dedes/he.h.m4:heHE.SyKyrieMouFos.greekname
ltx/en_us_dedes/me.m07.d02:meMA.Ode5C11.incipit	…
ltx/en_us_dedes/me.m07.d02:meMA.Ode5C11.melody	@ltx/en_us_dedes/he.h.m4:heHE.SyKyrieMouFos.name
ltx/en_us_dedes/me.m07.d02:meMA.Ode5C11.mode	@ltx/en_us_dedes/miscellanea:misc.Mode4
ltx/en_us_dedes/me.m07.d02:meMA.Ode5C11.ode	@ltx/en_us_dedes/miscellanea:misc.Ode5
ltx/en_us_dedes/me.m07.d02:meMA.Ode5C11.text	
ltx/en_us_dedes/me.m07.d02:meMA.Ode5C12.incipit	…
ltx/en_us_dedes/me.m07.d02:meMA.Ode5C12.melody	@ltx/en_us_dedes/he.h.m4:heHE.SyKyrieMouFos.name
ltx/en_us_dedes/me.m07.d02:meMA.Ode5C12.mode	@ltx/en_us_dedes/miscellanea:misc.Mode4
ltx/en_us_dedes/me.m07.d02:meMA.Ode5C12.ode	@ltx/en_us_dedes/miscellanea:misc.Ode5
ltx/en_us_dedes/me.m07.d02:meMA.Ode5C12.text	
ltx/en_us_dedes/me.m07.d02:meMA.Ode5C13.incipit	…
ltx/en_us_dedes/me.m07.d02:meMA.Ode5C13.melody	@ltx/en_us_dedes/he.h.m4:heHE.SyKyrieMouFos.name
ltx/en_us_dedes/me.m07.d02:meMA.Ode5C13.mode	@ltx/en_us_dedes/miscellanea:misc.Mode4
ltx/en_us_dedes/me.m07.d02:meMA.Ode5C13.ode	@ltx/en_us_dedes/miscellanea:misc.Ode5
ltx/en_us_dedes/me.m07.d02:meMA.Ode5C13.text	
ltx/en_us_dedes/me.m07.d02:meMA.Ode5C14.incipit	…
ltx/en_us_dedes/me.m07.d02:meMA.Ode5C14.melody	@ltx/en_us_dedes/he.h.m4:heHE.SyKyrieMouFos.name
ltx/en_us_dedes/me.m07.d02:meMA.Ode5C14.mode	@ltx/en_us_dedes/miscellanea:misc.Mode4
ltx/en_us_dedes/me.m07.d02:meMA.Ode5C14.ode	@ltx/en_us_dedes/miscellanea:misc.Ode5
ltx/en_us_dedes/me.m07.d02:meMA.Ode5C14.text	
ltx/en_us_dedes/me.m07.d02:meMA.Ode5C1H.greekmelody	@ltx/en_us_dedes/he.h.m4:heHE.SyKyrieMouFos.greekname
ltx/en_us_dedes/me.m07.d02:meMA.Ode5C1H.incipit	@ltx/en_us_dedes/he.h.m4:heHE.SyKyrieMouFos.incipit
ltx/en_us_dedes/me.m07.d02:meMA.Ode5C1H.melody	@ltx/en_us_dedes/he.h.m4:heHE.SyKyrieMouFos.melody
ltx/en_us_dedes/me.m07.d02:meMA.Ode5C1H.mode	@ltx/en_us_dedes/miscellanea:misc.Mode4
ltx/en_us_dedes/me.m07.d02:meMA.Ode5C1H.ode	@ltx/en_us_dedes/miscellanea:misc.Ode5
ltx/en_us_dedes/me.m07.d02:meMA.Ode5C1H.text	@ltx/en_us_dedes/he.h.m4:heHE.SyKyrieMouFos.text
ltx/en_us_dedes/me.m07.d02:meMA.Ode5C21.greekmelody	@ltx/en_us_dedes/he.h.m4:heHE.SyKyrieMouFos.greekname
ltx/en_us_dedes/me.m07.d02:meMA.Ode5C21.incipit	…
ltx/en_us_dedes/me.m07.d02:meMA.Ode5C21.melody	@ltx/en_us_dedes/he.h.m4:heHE.SyKyrieMouFos.name
ltx/en_us_dedes/me.m07.d02:meMA.Ode5C21.mode	@ltx/en_us_dedes/miscellanea:misc.Mode4
ltx/en_us_dedes/me.m07.d02:meMA.Ode5C21.ode	@ltx/en_us_dedes/miscellanea:misc.Ode5
ltx/en_us_dedes/me.m07.d02:meMA.Ode5C21.text	
ltx/en_us_dedes/me.m07.d02:meMA.Ode5C22.incipit	…
ltx/en_us_dedes/me.m07.d02:meMA.Ode5C22.melody	@ltx/en_us_dedes/he.h.m4:heHE.SyKyrieMouFos.name
ltx/en_us_dedes/me.m07.d02:meMA.Ode5C22.mode	@ltx/en_us_dedes/miscellanea:misc.Mode4
ltx/en_us_dedes/me.m07.d02:meMA.Ode5C22.ode	@ltx/en_us_dedes/miscellanea:misc.Ode5
ltx/en_us_dedes/me.m07.d02:meMA.Ode5C22.text	
ltx/en_us_dedes/me.m07.d02:meMA.Ode5C23.incipit	…
ltx/en_us_dedes/me.m07.d02:meMA.Ode5C23.melody	@ltx/en_us_dedes/he.h.m4:heHE.SyKyrieMouFos.name
ltx/en_us_dedes/me.m07.d02:meMA.Ode5C23.mode	@ltx/en_us_dedes/miscellanea:misc.Mode4
ltx/en_us_dedes/me.m07.d02:meMA.Ode5C23.ode	@ltx/en_us_dedes/miscellanea:misc.Ode5
ltx/en_us_dedes/me.m07.d02:meMA.Ode5C23.text	
ltx/en_us_dedes/me.m07.d02:meMA.Ode6C11.greekmelody	@ltx/en_us_dedes/he.h.m4:heHE.EvoiseProtypon.greekname
ltx/en_us_dedes/me.m07.d02:meMA.Ode6C11.incipit	…
ltx/en_us_dedes/me.m07.d02:meMA.Ode6C11.melody	@ltx/en_us_dedes/he.h.m4:heHE.EvoiseProtypon.name
ltx/en_us_dedes/me.m07.d02:meMA.Ode6C11.mode	@ltx/en_us_dedes/miscellanea:misc.Mode4
ltx/en_us_dedes/me.m07.d02:meMA.Ode6C11.ode	@ltx/en_us_dedes/miscellanea:misc.Ode6
ltx/en_us_dedes/me.m07.d02:meMA.Ode6C11.text	
ltx/en_us_dedes/me.m07.d02:meMA.Ode6C12.incipit	…
ltx/en_us_dedes/me.m07.d02:meMA.Ode6C12.melody	@ltx/en_us_dedes/he.h.m4:heHE.EvoiseProtypon.name
ltx/en_us_dedes/me.m07.d02:meMA.Ode6C12.mode	@ltx/en_us_dedes/miscellanea:misc.Mode4
ltx/en_us_dedes/me.m07.d02:meMA.Ode6C12.ode	@ltx/en_us_dedes/miscellanea:misc.Ode6
ltx/en_us_dedes/me.m07.d02:meMA.Ode6C12.text	
ltx/en_us_dedes/me.m07.d02:meMA.Ode6C13.incipit	…
ltx/en_us_dedes/me.m07.d02:meMA.Ode6C13.melody	@ltx/en_us_dedes/he.h.m4:heHE.EvoiseProtypon.name
ltx/en_us_dedes/me.m07.d02:meMA.Ode6C13.mode	@ltx/en_us_dedes/miscellanea:misc.Mode4
ltx/en_us_dedes/me.m07.d02:meMA.Ode6C13.ode	@ltx/en_us_dedes/miscellanea:misc.Ode6
ltx/en_us_dedes/me.m07.d02:meMA.Ode6C13.text	
ltx/en_us_dedes/me.m07.d02:meMA.Ode6C14.incipit	…
ltx/en_us_dedes/me.m07.d02:meMA.Ode6C14.melody	@ltx/en_us_dedes/he.h.m4:heHE.EvoiseProtypon.name
ltx/en_us_dedes/me.m07.d02:meMA.Ode6C14.mode	@ltx/en_us_dedes/miscellanea:misc.Mode4
ltx/en_us_dedes/me.m07.d02:meMA.Ode6C14.ode	@ltx/en_us_dedes/miscellanea:misc.Ode6
ltx/en_us_dedes/me.m07.d02:meMA.Ode6C14.text	
ltx/en_us_dedes/me.m07.d02:meMA.Ode6C1H.greekmelody	@ltx/en_us_dedes/he.h.m4:heHE.EvoiseProtypon.greekname
ltx/en_us_dedes/me.m07.d02:meMA.Ode6C1H.incipit	@ltx/en_us_dedes/he.h.m4:heHE.EvoiseProtypon.incipit
ltx/en_us_dedes/me.m07.d02:meMA.Ode6C1H.melody	@ltx/en_us_dedes/he.h.m4:heHE.EvoiseProtypon.melody
ltx/en_us_dedes/me.m07.d02:meMA.Ode6C1H.mode	@ltx/en_us_dedes/miscellanea:misc.Mode4
ltx/en_us_dedes/me.m07.d02:meMA.Ode6C1H.ode	@ltx/en_us_dedes/miscellanea:misc.Ode6
ltx/en_us_dedes/me.m07.d02:meMA.Ode6C1H.text	@ltx/en_us_dedes/he.h.m4:heHE.EvoiseProtypon.text
ltx/en_us_dedes/me.m07.d02:meMA.Ode6C21.greekmelody	@ltx/en_us_dedes/he.h.m4:heHE.ThysoSoiMetaFonis.greekname
ltx/en_us_dedes/me.m07.d02:meMA.Ode6C21.incipit	The Lord has completely glorified…
ltx/en_us_dedes/me.m07.d02:meMA.Ode6C21.melody	@ltx/en_us_dedes/he.h.m4:heHE.ThysoSoiMetaFonis.name
ltx/en_us_dedes/me.m07.d02:meMA.Ode6C21.mode	@ltx/en_us_dedes/miscellanea:misc.Mode4
ltx/en_us_dedes/me.m07.d02:meMA.Ode6C21.ode	@ltx/en_us_dedes/miscellanea:misc.Ode6
ltx/en_us_dedes/me.m07.d02:meMA.Ode6C21.text	The Lord has completely glorified you exceedingly. * He made you very distinguished. * He ineffably honored you, O Virgin * Theotokos, * in your church, where your Belt and Garment were enshrined.
ltx/en_us_dedes/me.m07.d02:meMA.Ode6C22.incipit	The faithful have obtained you…
ltx/en_us_dedes/me.m07.d02:meMA.Ode6C22.melody	@ltx/en_us_dedes/he.h.m4:heHE.ThysoSoiMetaFonis.name
ltx/en_us_dedes/me.m07.d02:meMA.Ode6C22.mode	@ltx/en_us_dedes/miscellanea:misc.Mode4
ltx/en_us_dedes/me.m07.d02:meMA.Ode6C22.ode	@ltx/en_us_dedes/miscellanea:misc.Ode6
ltx/en_us_dedes/me.m07.d02:meMA.Ode6C22.text	The faithful have obtained you as their might and pride and joy, * and they are girded in glory, * being in possession of your all-holy * Belt and Garment, * as a splendid adornment, O Mother of God.
ltx/en_us_dedes/me.m07.d02:meMA.Ode6C23.incipit	Of old all the divinely…
ltx/en_us_dedes/me.m07.d02:meMA.Ode6C23.melody	@ltx/en_us_dedes/he.h.m4:heHE.ThysoSoiMetaFonis.name
ltx/en_us_dedes/me.m07.d02:meMA.Ode6C23.mode	@ltx/en_us_dedes/miscellanea:misc.Mode4
ltx/en_us_dedes/me.m07.d02:meMA.Ode6C23.ode	@ltx/en_us_dedes/miscellanea:misc.Ode6
ltx/en_us_dedes/me.m07.d02:meMA.Ode6C23.text	Of old all the divinely inspired Prophets travailed * to behold, O Theotokos, * your ineffable glory. But in these last times, * He who transcends * days and years, and all time, has appeared to us.
ltx/en_us_dedes/me.m07.d02:meMA.Ode6H.greekmelody	@ltx/en_us_dedes/he.h.m4:heHE.ThysoSoiMetaFonis.greekname
ltx/en_us_dedes/me.m07.d02:meMA.Ode6H.incipit	@ltx/en_us_dedes/he.h.m4:heHE.ThysoSoiMetaFonis.incipit
ltx/en_us_dedes/me.m07.d02:meMA.Ode6H.melody	@ltx/en_us_dedes/he.h.m4:heHE.ThysoSoiMetaFonis.melody
ltx/en_us_dedes/me.m07.d02:meMA.Ode6H.mode	@ltx/en_us_dedes/miscellanea:misc.Mode4
ltx/en_us_dedes/me.m07.d02:meMA.Ode6H.ode	@ltx/en_us_dedes/miscellanea:misc.Ode6
ltx/en_us_dedes/me.m07.d02:meMA.Ode6H.text	@ltx/en_us_dedes/he.h.m4:heHE.ThysoSoiMetaFonis.text
ltx/en_us_dedes/me.m07.d02:meMA.Ode7C11.greekmelody	@ltx/en_us_dedes/he.h.m4:heHE.AvramiaioiPote.greekname
ltx/en_us_dedes/me.m07.d02:meMA.Ode7C11.incipit	…
ltx/en_us_dedes/me.m07.d02:meMA.Ode7C11.melody	@ltx/en_us_dedes/he.h.m4:heHE.AvramiaioiPote.name
ltx/en_us_dedes/me.m07.d02:meMA.Ode7C11.mode	@ltx/en_us_dedes/miscellanea:misc.Mode4
ltx/en_us_dedes/me.m07.d02:meMA.Ode7C11.ode	@ltx/en_us_dedes/miscellanea:misc.Ode7
ltx/en_us_dedes/me.m07.d02:meMA.Ode7C11.text	
ltx/en_us_dedes/me.m07.d02:meMA.Ode7C12.incipit	…
ltx/en_us_dedes/me.m07.d02:meMA.Ode7C12.melody	@ltx/en_us_dedes/he.h.m4:heHE.AvramiaioiPote.name
ltx/en_us_dedes/me.m07.d02:meMA.Ode7C12.mode	@ltx/en_us_dedes/miscellanea:misc.Mode4
ltx/en_us_dedes/me.m07.d02:meMA.Ode7C12.ode	@ltx/en_us_dedes/miscellanea:misc.Ode7
ltx/en_us_dedes/me.m07.d02:meMA.Ode7C12.text	
ltx/en_us_dedes/me.m07.d02:meMA.Ode7C13.incipit	…
ltx/en_us_dedes/me.m07.d02:meMA.Ode7C13.melody	@ltx/en_us_dedes/he.h.m4:heHE.AvramiaioiPote.name
ltx/en_us_dedes/me.m07.d02:meMA.Ode7C13.mode	@ltx/en_us_dedes/miscellanea:misc.Mode4
ltx/en_us_dedes/me.m07.d02:meMA.Ode7C13.ode	@ltx/en_us_dedes/miscellanea:misc.Ode7
ltx/en_us_dedes/me.m07.d02:meMA.Ode7C13.text	
ltx/en_us_dedes/me.m07.d02:meMA.Ode7C14.incipit	…
ltx/en_us_dedes/me.m07.d02:meMA.Ode7C14.melody	@ltx/en_us_dedes/he.h.m4:heHE.AvramiaioiPote.name
ltx/en_us_dedes/me.m07.d02:meMA.Ode7C14.mode	@ltx/en_us_dedes/miscellanea:misc.Mode4
ltx/en_us_dedes/me.m07.d02:meMA.Ode7C14.ode	@ltx/en_us_dedes/miscellanea:misc.Ode7
ltx/en_us_dedes/me.m07.d02:meMA.Ode7C14.text	
ltx/en_us_dedes/me.m07.d02:meMA.Ode7C15.incipit	…
ltx/en_us_dedes/me.m07.d02:meMA.Ode7C15.melody	@ltx/en_us_dedes/he.h.m4:heHE.AvramiaioiPote.name
ltx/en_us_dedes/me.m07.d02:meMA.Ode7C15.mode	@ltx/en_us_dedes/miscellanea:misc.Mode4
ltx/en_us_dedes/me.m07.d02:meMA.Ode7C15.ode	@ltx/en_us_dedes/miscellanea:misc.Ode7
ltx/en_us_dedes/me.m07.d02:meMA.Ode7C15.text	
ltx/en_us_dedes/me.m07.d02:meMA.Ode7C1H.greekmelody	@ltx/en_us_dedes/he.h.m4:heHE.AvramiaioiPote.greekname
ltx/en_us_dedes/me.m07.d02:meMA.Ode7C1H.incipit	@ltx/en_us_dedes/he.h.m4:heHE.AvramiaioiPote.incipit
ltx/en_us_dedes/me.m07.d02:meMA.Ode7C1H.melody	@ltx/en_us_dedes/he.h.m4:heHE.AvramiaioiPote.melody
ltx/en_us_dedes/me.m07.d02:meMA.Ode7C1H.mode	@ltx/en_us_dedes/miscellanea:misc.Mode4
ltx/en_us_dedes/me.m07.d02:meMA.Ode7C1H.ode	@ltx/en_us_dedes/miscellanea:misc.Ode7
ltx/en_us_dedes/me.m07.d02:meMA.Ode7C1H.text	@ltx/en_us_dedes/he.h.m4:heHE.AvramiaioiPote.text
ltx/en_us_dedes/me.m07.d02:meMA.Ode7C21.greekmelody	@ltx/en_us_dedes/he.h.m4:heHE.EnTiKaminoAvramiaioi.greekname
ltx/en_us_dedes/me.m07.d02:meMA.Ode7C21.incipit	…
ltx/en_us_dedes/me.m07.d02:meMA.Ode7C21.melody	@ltx/en_us_dedes/he.h.m4:heHE.EnTiKaminoAvramiaioi.name
ltx/en_us_dedes/me.m07.d02:meMA.Ode7C21.mode	@ltx/en_us_dedes/miscellanea:misc.Mode4
ltx/en_us_dedes/me.m07.d02:meMA.Ode7C21.ode	@ltx/en_us_dedes/miscellanea:misc.Ode7
ltx/en_us_dedes/me.m07.d02:meMA.Ode7C21.text	
ltx/en_us_dedes/me.m07.d02:meMA.Ode7C22.incipit	…
ltx/en_us_dedes/me.m07.d02:meMA.Ode7C22.melody	@ltx/en_us_dedes/he.h.m4:heHE.EnTiKaminoAvramiaioi.name
ltx/en_us_dedes/me.m07.d02:meMA.Ode7C22.mode	@ltx/en_us_dedes/miscellanea:misc.Mode4
ltx/en_us_dedes/me.m07.d02:meMA.Ode7C22.ode	@ltx/en_us_dedes/miscellanea:misc.Ode7
ltx/en_us_dedes/me.m07.d02:meMA.Ode7C22.text	
ltx/en_us_dedes/me.m07.d02:meMA.Ode7C23.incipit	…
ltx/en_us_dedes/me.m07.d02:meMA.Ode7C23.melody	@ltx/en_us_dedes/he.h.m4:heHE.EnTiKaminoAvramiaioi.name
ltx/en_us_dedes/me.m07.d02:meMA.Ode7C23.mode	@ltx/en_us_dedes/miscellanea:misc.Mode4
ltx/en_us_dedes/me.m07.d02:meMA.Ode7C23.ode	@ltx/en_us_dedes/miscellanea:misc.Ode7
ltx/en_us_dedes/me.m07.d02:meMA.Ode7C23.text	
ltx/en_us_dedes/me.m07.d02:meMA.Ode8C11.greekmelody	@ltx/en_us_dedes/he.h.m4:heHE.LytrotaTouPantos.greekname
ltx/en_us_dedes/me.m07.d02:meMA.Ode8C11.incipit	…
ltx/en_us_dedes/me.m07.d02:meMA.Ode8C11.melody	@ltx/en_us_dedes/he.h.m4:heHE.LytrotaTouPantos.name
ltx/en_us_dedes/me.m07.d02:meMA.Ode8C11.mode	@ltx/en_us_dedes/miscellanea:misc.Mode4
ltx/en_us_dedes/me.m07.d02:meMA.Ode8C11.ode	@ltx/en_us_dedes/miscellanea:misc.Ode8
ltx/en_us_dedes/me.m07.d02:meMA.Ode8C11.text	
ltx/en_us_dedes/me.m07.d02:meMA.Ode8C12.incipit	…
ltx/en_us_dedes/me.m07.d02:meMA.Ode8C12.melody	@ltx/en_us_dedes/he.h.m4:heHE.LytrotaTouPantos.name
ltx/en_us_dedes/me.m07.d02:meMA.Ode8C12.mode	@ltx/en_us_dedes/miscellanea:misc.Mode4
ltx/en_us_dedes/me.m07.d02:meMA.Ode8C12.ode	@ltx/en_us_dedes/miscellanea:misc.Ode8
ltx/en_us_dedes/me.m07.d02:meMA.Ode8C12.text	
ltx/en_us_dedes/me.m07.d02:meMA.Ode8C13.incipit	…
ltx/en_us_dedes/me.m07.d02:meMA.Ode8C13.melody	@ltx/en_us_dedes/he.h.m4:heHE.LytrotaTouPantos.name
ltx/en_us_dedes/me.m07.d02:meMA.Ode8C13.mode	@ltx/en_us_dedes/miscellanea:misc.Mode4
ltx/en_us_dedes/me.m07.d02:meMA.Ode8C13.ode	@ltx/en_us_dedes/miscellanea:misc.Ode8
ltx/en_us_dedes/me.m07.d02:meMA.Ode8C13.text	
ltx/en_us_dedes/me.m07.d02:meMA.Ode8C14.incipit	…
ltx/en_us_dedes/me.m07.d02:meMA.Ode8C14.melody	@ltx/en_us_dedes/he.h.m4:heHE.LytrotaTouPantos.name
ltx/en_us_dedes/me.m07.d02:meMA.Ode8C14.mode	@ltx/en_us_dedes/miscellanea:misc.Mode4
ltx/en_us_dedes/me.m07.d02:meMA.Ode8C14.ode	@ltx/en_us_dedes/miscellanea:misc.Ode8
ltx/en_us_dedes/me.m07.d02:meMA.Ode8C14.text	
ltx/en_us_dedes/me.m07.d02:meMA.Ode8C1H.greekmelody	@ltx/en_us_dedes/he.h.m4:heHE.LytrotaTouPantos.greekname
ltx/en_us_dedes/me.m07.d02:meMA.Ode8C1H.incipit	@ltx/en_us_dedes/he.h.m4:heHE.LytrotaTouPantos.incipit
ltx/en_us_dedes/me.m07.d02:meMA.Ode8C1H.melody	@ltx/en_us_dedes/he.h.m4:heHE.LytrotaTouPantos.melody
ltx/en_us_dedes/me.m07.d02:meMA.Ode8C1H.mode	@ltx/en_us_dedes/miscellanea:misc.Mode4
ltx/en_us_dedes/me.m07.d02:meMA.Ode8C1H.ode	@ltx/en_us_dedes/miscellanea:misc.Ode8
ltx/en_us_dedes/me.m07.d02:meMA.Ode8C1H.text	@ltx/en_us_dedes/he.h.m4:heHE.LytrotaTouPantos.text
ltx/en_us_dedes/me.m07.d02:meMA.Ode8C21.greekmelody	@ltx/en_us_dedes/he.h.m4:heHE.CheirasEkpetasasDaniil.greekname
ltx/en_us_dedes/me.m07.d02:meMA.Ode8C21.incipit	…
ltx/en_us_dedes/me.m07.d02:meMA.Ode8C21.melody	@ltx/en_us_dedes/he.h.m4:heHE.CheirasEkpetasasDaniil.name
ltx/en_us_dedes/me.m07.d02:meMA.Ode8C21.mode	@ltx/en_us_dedes/miscellanea:misc.Mode4
ltx/en_us_dedes/me.m07.d02:meMA.Ode8C21.ode	@ltx/en_us_dedes/miscellanea:misc.Ode8
ltx/en_us_dedes/me.m07.d02:meMA.Ode8C21.text	
ltx/en_us_dedes/me.m07.d02:meMA.Ode8C22.incipit	…
ltx/en_us_dedes/me.m07.d02:meMA.Ode8C22.melody	@ltx/en_us_dedes/he.h.m4:heHE.CheirasEkpetasasDaniil.name
ltx/en_us_dedes/me.m07.d02:meMA.Ode8C22.mode	@ltx/en_us_dedes/miscellanea:misc.Mode4
ltx/en_us_dedes/me.m07.d02:meMA.Ode8C22.ode	@ltx/en_us_dedes/miscellanea:misc.Ode8
ltx/en_us_dedes/me.m07.d02:meMA.Ode8C22.text	
ltx/en_us_dedes/me.m07.d02:meMA.Ode8C23.incipit	…
ltx/en_us_dedes/me.m07.d02:meMA.Ode8C23.melody	@ltx/en_us_dedes/he.h.m4:heHE.CheirasEkpetasasDaniil.name
ltx/en_us_dedes/me.m07.d02:meMA.Ode8C23.mode	@ltx/en_us_dedes/miscellanea:misc.Mode4
ltx/en_us_dedes/me.m07.d02:meMA.Ode8C23.ode	@ltx/en_us_dedes/miscellanea:misc.Ode8
ltx/en_us_dedes/me.m07.d02:meMA.Ode8C23.text	
ltx/en_us_dedes/me.m07.d02:meMA.Ode8H.greekmelody	@ltx/en_us_dedes/he.h.m4:heHE.CheirasEkpetasasDaniil.greekname
ltx/en_us_dedes/me.m07.d02:meMA.Ode8H.incipit	@ltx/en_us_dedes/he.h.m4:heHE.CheirasEkpetasasDaniil.incipit
ltx/en_us_dedes/me.m07.d02:meMA.Ode8H.melody	@ltx/en_us_dedes/he.h.m4:heHE.CheirasEkpetasasDaniil.melody
ltx/en_us_dedes/me.m07.d02:meMA.Ode8H.mode	@ltx/en_us_dedes/miscellanea:misc.Mode4
ltx/en_us_dedes/me.m07.d02:meMA.Ode8H.ode	@ltx/en_us_dedes/miscellanea:misc.Ode8
ltx/en_us_dedes/me.m07.d02:meMA.Ode8H.text	@ltx/en_us_dedes/he.h.m4:heHE.CheirasEkpetasasDaniil.text
ltx/en_us_dedes/me.m07.d02:meMA.Ode9C11.greekmelody	@ltx/en_us_dedes/he.h.m4:heHE.EvaMenToTisParakois.greekname
ltx/en_us_dedes/me.m07.d02:meMA.Ode9C11.incipit	…
ltx/en_us_dedes/me.m07.d02:meMA.Ode9C11.melody	@ltx/en_us_dedes/he.h.m4:heHE.EvaMenToTisParakois.name
ltx/en_us_dedes/me.m07.d02:meMA.Ode9C11.mode	@ltx/en_us_dedes/miscellanea:misc.Mode4
ltx/en_us_dedes/me.m07.d02:meMA.Ode9C11.ode	@ltx/en_us_dedes/miscellanea:misc.Ode9
ltx/en_us_dedes/me.m07.d02:meMA.Ode9C11.text	
ltx/en_us_dedes/me.m07.d02:meMA.Ode9C12.incipit	…
ltx/en_us_dedes/me.m07.d02:meMA.Ode9C12.melody	@ltx/en_us_dedes/he.h.m4:heHE.EvaMenToTisParakois.name
ltx/en_us_dedes/me.m07.d02:meMA.Ode9C12.mode	@ltx/en_us_dedes/miscellanea:misc.Mode4
ltx/en_us_dedes/me.m07.d02:meMA.Ode9C12.ode	@ltx/en_us_dedes/miscellanea:misc.Ode9
ltx/en_us_dedes/me.m07.d02:meMA.Ode9C12.text	
ltx/en_us_dedes/me.m07.d02:meMA.Ode9C13.incipit	…
ltx/en_us_dedes/me.m07.d02:meMA.Ode9C13.melody	@ltx/en_us_dedes/he.h.m4:heHE.EvaMenToTisParakois.name
ltx/en_us_dedes/me.m07.d02:meMA.Ode9C13.mode	@ltx/en_us_dedes/miscellanea:misc.Mode4
ltx/en_us_dedes/me.m07.d02:meMA.Ode9C13.ode	@ltx/en_us_dedes/miscellanea:misc.Ode9
ltx/en_us_dedes/me.m07.d02:meMA.Ode9C13.text	
ltx/en_us_dedes/me.m07.d02:meMA.Ode9C14.incipit	…
ltx/en_us_dedes/me.m07.d02:meMA.Ode9C14.melody	@ltx/en_us_dedes/he.h.m4:heHE.EvaMenToTisParakois.name
ltx/en_us_dedes/me.m07.d02:meMA.Ode9C14.mode	@ltx/en_us_dedes/miscellanea:misc.Mode4
ltx/en_us_dedes/me.m07.d02:meMA.Ode9C14.ode	@ltx/en_us_dedes/miscellanea:misc.Ode9
ltx/en_us_dedes/me.m07.d02:meMA.Ode9C14.text	
ltx/en_us_dedes/me.m07.d02:meMA.Ode9C15.incipit	…
ltx/en_us_dedes/me.m07.d02:meMA.Ode9C15.melody	@ltx/en_us_dedes/he.h.m4:heHE.EvaMenToTisParakois.name
ltx/en_us_dedes/me.m07.d02:meMA.Ode9C15.mode	@ltx/en_us_dedes/miscellanea:misc.Mode4
ltx/en_us_dedes/me.m07.d02:meMA.Ode9C15.ode	@ltx/en_us_dedes/miscellanea:misc.Ode9
ltx/en_us_dedes/me.m07.d02:meMA.Ode9C15.text	
ltx/en_us_dedes/me.m07.d02:meMA.Ode9C1H.greekmelody	@ltx/en_us_dedes/he.h.m4:heHE.EvaMenToTisParakois.greekname
ltx/en_us_dedes/me.m07.d02:meMA.Ode9C1H.incipit	@ltx/en_us_dedes/he.h.m4:heHE.EvaMenToTisParakois.incipit
ltx/en_us_dedes/me.m07.d02:meMA.Ode9C1H.melody	@ltx/en_us_dedes/he.h.m4:heHE.EvaMenToTisParakois.melody
ltx/en_us_dedes/me.m07.d02:meMA.Ode9C1H.mode	@ltx/en_us_dedes/miscellanea:misc.Mode4
ltx/en_us_dedes/me.m07.d02:meMA.Ode9C1H.ode	@ltx/en_us_dedes/miscellanea:misc.Ode9
ltx/en_us_dedes/me.m07.d02:meMA.Ode9C1H.text	@ltx/en_us_dedes/he.h.m4:heHE.EvaMenToTisParakois.text
ltx/en_us_dedes/me.m07.d02:meMA.Ode9C21.greekmelody	@ltx/en_us_dedes/he.h.m4:heHE.LithosAcheirotmitos.greekname
ltx/en_us_dedes/me.m07.d02:meMA.Ode9C21.incipit	…
ltx/en_us_dedes/me.m07.d02:meMA.Ode9C21.melody	@ltx/en_us_dedes/he.h.m4:heHE.LithosAcheirotmitos.name
ltx/en_us_dedes/me.m07.d02:meMA.Ode9C21.mode	@ltx/en_us_dedes/miscellanea:misc.Mode4
ltx/en_us_dedes/me.m07.d02:meMA.Ode9C21.ode	@ltx/en_us_dedes/miscellanea:misc.Ode9
ltx/en_us_dedes/me.m07.d02:meMA.Ode9C21.text	
ltx/en_us_dedes/me.m07.d02:meMA.Ode9C22.incipit	…
ltx/en_us_dedes/me.m07.d02:meMA.Ode9C22.melody	@ltx/en_us_dedes/he.h.m4:heHE.LithosAcheirotmitos.name
ltx/en_us_dedes/me.m07.d02:meMA.Ode9C22.mode	@ltx/en_us_dedes/miscellanea:misc.Mode4
ltx/en_us_dedes/me.m07.d02:meMA.Ode9C22.ode	@ltx/en_us_dedes/miscellanea:misc.Ode9
ltx/en_us_dedes/me.m07.d02:meMA.Ode9C22.text	
ltx/en_us_dedes/me.m07.d02:meMA.Ode9C23.incipit	…
ltx/en_us_dedes/me.m07.d02:meMA.Ode9C23.melody	@ltx/en_us_dedes/he.h.m4:heHE.LithosAcheirotmitos.name
ltx/en_us_dedes/me.m07.d02:meMA.Ode9C23.mode	@ltx/en_us_dedes/miscellanea:misc.Mode4
ltx/en_us_dedes/me.m07.d02:meMA.Ode9C23.ode	@ltx/en_us_dedes/miscellanea:misc.Ode9
ltx/en_us_dedes/me.m07.d02:meMA.Ode9C23.text	
ltx/en_us_dedes/me.m07.d02:meMA.Ode9C24.incipit	…
ltx/en_us_dedes/me.m07.d02:meMA.Ode9C24.melody	@ltx/en_us_dedes/he.h.m4:heHE.LithosAcheirotmitos.name
ltx/en_us_dedes/me.m07.d02:meMA.Ode9C24.mode	@ltx/en_us_dedes/miscellanea:misc.Mode4
ltx/en_us_dedes/me.m07.d02:meMA.Ode9C24.ode	@ltx/en_us_dedes/miscellanea:misc.Ode9
ltx/en_us_dedes/me.m07.d02:meMA.Ode9C24.text	
ltx/en_us_dedes/me.m07.d02:meMA.Ode9H.greekmelody	@ltx/en_us_dedes/he.h.m4:heHE.LithosAcheirotmitos.greekname
ltx/en_us_dedes/me.m07.d02:meMA.Ode9H.incipit	@ltx/en_us_dedes/he.h.m4:heHE.LithosAcheirotmitos.incipit
ltx/en_us_dedes/me.m07.d02:meMA.Ode9H.melody	@ltx/en_us_dedes/he.h.m4:heHE.LithosAcheirotmitos.melody
ltx/en_us_dedes/me.m07.d02:meMA.Ode9H.mode	@ltx/en_us_dedes/miscellanea:misc.Mode4
ltx/en_us_dedes/me.m07.d02:meMA.Ode9H.ode	@ltx/en_us_dedes/miscellanea:misc.Ode9
ltx/en_us_dedes/me.m07.d02:meMA.Ode9H.text	@ltx/en_us_dedes/he.h.m4:heHE.LithosAcheirotmitos.text
ltx/en_us_dedes/me.m07.d02:meMA.Oikos1.text	The pure and true tabernacle of God the Logos, the animate cloud, and the jar of Manna, Mary the Theotokos: let us all who were saved by her child in faith call her blessed; and let us carress her august Garment in which she wrapped the Master and held Him as an infant, when He had put on flesh. Through her, our human nature was lifted to supernal life and kingdom. Therefore in a loud voice we cry out to her with joy: Rejoice, O Virgin, the boast of Christians everywhere.
ltx/en_us_dedes/me.m07.d02:meVE.Apolytikion1.incipit	Ever-virgin Theotokos…
ltx/en_us_dedes/me.m07.d02:meVE.Apolytikion1.melody	
ltx/en_us_dedes/me.m07.d02:meVE.Apolytikion1.mode	@ltx/en_us_dedes/miscellanea:misc.Mode8
ltx/en_us_dedes/me.m07.d02:meVE.Apolytikion1.text	Ever-virgin Theotokos, the shelter of mankind, you have given to your City as a protective wall the clothing and garment that you wore on your immaculate body. By your seedless childbirth, they have remained incorrupt. For in you both nature and time are made novel. Therefore we implore you, grant peace to your commonwealth, and great mercy to our souls.
ltx/en_us_dedes/me.m07.d02:meVE.AposGlory.incipit	All-immaculate Theotokos, the Church of…
ltx/en_us_dedes/me.m07.d02:meVE.AposGlory.melody	
ltx/en_us_dedes/me.m07.d02:meVE.AposGlory.mode	@ltx/en_us_dedes/miscellanea:misc.Mode2
ltx/en_us_dedes/me.m07.d02:meVE.AposGlory.text	All-immaculate Theotokos, the Church of God dons your holy Garment as though a most splendid crown. Today she is exultant and beams with joy, as she dances mystically, crying out to you, O Lady. “Rejoice, O precious diadem and crown of divine glory. Rejoice, the only glory and eternal joy of my complement. Rejoice, O haven and protection and salvation for us who run to you.”
ltx/en_us_dedes/me.m07.d02:meVE.Aposticha1.greekmelody	@ltx/en_us_dedes/he.a.m1:heAU.PaneffimoiMartyres.greekname
ltx/en_us_dedes/me.m07.d02:meVE.Aposticha1.incipit	You alone of humankind became…
ltx/en_us_dedes/me.m07.d02:meVE.Aposticha1.melody	@ltx/en_us_dedes/he.a.m1:heAU.PaneffimoiMartyres.name
ltx/en_us_dedes/me.m07.d02:meVE.Aposticha1.mode	@ltx/en_us_dedes/miscellanea:misc.Mode1
ltx/en_us_dedes/me.m07.d02:meVE.Aposticha1.text	You alone of humankind became * the palace of God Most High. * And you have gifted your precious Garment, which was once enshrined * in your holy temple, to the faithful, blessing them, * to be a mighty fortress protecting them, * and through which you of old * saved your City, Mother of our God. * Now you save us, * who honor your God-given might.
ltx/en_us_dedes/me.m07.d02:meVE.Aposticha2.incipit	O Mother of God, you…
ltx/en_us_dedes/me.m07.d02:meVE.Aposticha2.melody	@ltx/en_us_dedes/he.a.m1:heAU.PaneffimoiMartyres.name
ltx/en_us_dedes/me.m07.d02:meVE.Aposticha2.mode	@ltx/en_us_dedes/miscellanea:misc.Mode1
ltx/en_us_dedes/me.m07.d02:meVE.Aposticha2.text	O Mother of God, you wrapped around * your honored and holy body the now hon’rable Garment, and you gifted it to all * as a source of glory * and a spring that gushes forth * the ever-living waters of grace divine. We honor you today, * celebrating when it was installed * in your temple, * O Lady, who honored us all.
ltx/en_us_dedes/me.m07.d02:meVE.Aposticha3.incipit	O Lady, the church that…
ltx/en_us_dedes/me.m07.d02:meVE.Aposticha3.melody	@ltx/en_us_dedes/he.a.m1:heAU.PaneffimoiMartyres.name
ltx/en_us_dedes/me.m07.d02:meVE.Aposticha3.mode	@ltx/en_us_dedes/miscellanea:misc.Mode1
ltx/en_us_dedes/me.m07.d02:meVE.Aposticha3.text	O Lady, the church that was your house * once enshrined your sacred Dress, which was a treasure of sanctity. Believers used to go * venerate it daily; * and it sanctified them all. * And they would call you blessed, as it was right, for they had placed the hope * of their souls in it, as being yours, * O protection * and mighty defense of us all.
ltx/en_us_dedes/me.m07.d02:meVE.SticGlory.incipit	…
ltx/en_us_dedes/me.m07.d02:meVE.SticGlory.melody	
ltx/en_us_dedes/me.m07.d02:meVE.SticGlory.mode	@ltx/en_us_dedes/miscellanea:misc.Mode2
ltx/en_us_dedes/me.m07.d02:meVE.SticGlory.text	
ltx/en_us_dedes/me.m07.d02:meVE.Stichera01.greekmelody	@ltx/en_us_dedes/he.a.m4:heAU.EdokasSimeiosin.greekname
ltx/en_us_dedes/me.m07.d02:meVE.Stichera01.incipit	…
ltx/en_us_dedes/me.m07.d02:meVE.Stichera01.melody	@ltx/en_us_dedes/he.a.m4:heAU.EdokasSimeiosin.name
ltx/en_us_dedes/me.m07.d02:meVE.Stichera01.mode	@ltx/en_us_dedes/miscellanea:misc.Mode4
ltx/en_us_dedes/me.m07.d02:meVE.Stichera01.text	
ltx/en_us_dedes/me.m07.d02:meVE.Stichera02.incipit	…
ltx/en_us_dedes/me.m07.d02:meVE.Stichera02.melody	@ltx/en_us_dedes/he.a.m4:heAU.EdokasSimeiosin.name
ltx/en_us_dedes/me.m07.d02:meVE.Stichera02.mode	@ltx/en_us_dedes/miscellanea:misc.Mode4
ltx/en_us_dedes/me.m07.d02:meVE.Stichera02.text	
ltx/en_us_dedes/me.m07.d02:meVE.Stichera03.incipit	…
ltx/en_us_dedes/me.m07.d02:meVE.Stichera03.melody	@ltx/en_us_dedes/he.a.m4:heAU.EdokasSimeiosin.name
ltx/en_us_dedes/me.m07.d02:meVE.Stichera03.mode	@ltx/en_us_dedes/miscellanea:misc.Mode4
ltx/en_us_dedes/me.m07.d02:meVE.Stichera03.text	
