ltx/en_us_dedes/me.m09.d07:alt1.meDA.commemoration.first_name	
ltx/en_us_dedes/me.m09.d07:alt1.meDA.commemoration.first_short	
ltx/en_us_dedes/me.m09.d07:alt1.meDA.commemoration.first_title	
ltx/en_us_dedes/me.m09.d07:alt1.meDA.commemoration.full	
ltx/en_us_dedes/me.m09.d07:alt1.meDA.commemoration.second_name	
ltx/en_us_dedes/me.m09.d07:alt1.meDA.commemoration.second_title	
ltx/en_us_dedes/me.m09.d07:alt1.meDA.date	September 7
ltx/en_us_dedes/me.m09.d07:alt1.meDA.dismissal	
ltx/en_us_dedes/me.m09.d07:alt1.meDA.insert1	
ltx/en_us_dedes/me.m09.d07:alt1.meDA.insert2	
ltx/en_us_dedes/me.m09.d07:alt1.meDA.note	
ltx/en_us_dedes/me.m09.d07:alt1.meDA.poet	
ltx/en_us_dedes/me.m09.d07:alt1.meHO.commemorations	
ltx/en_us_dedes/me.m09.d07:alt1.meHO.note1	
ltx/en_us_dedes/me.m09.d07:alt1.meHO.note2	
ltx/en_us_dedes/me.m09.d07:alt1.meHO.number	
ltx/en_us_dedes/me.m09.d07:alt1.meHO.rank	
ltx/en_us_dedes/me.m09.d07:alt1.meLE.commemoration1	
ltx/en_us_dedes/me.m09.d07:alt1.meLE.commemoration2	
ltx/en_us_dedes/me.m09.d07:alt1.meLI.Kontakion1.incipit	@ltx/en_us_dedes/me.m09.d07:alt1.meMA.Kontakion1.incipit
ltx/en_us_dedes/me.m09.d07:alt1.meLI.Kontakion1.melody	@ltx/en_us_dedes/me.m09.d07:alt1.meMA.Kontakion1.melody
ltx/en_us_dedes/me.m09.d07:alt1.meLI.Kontakion1.mode	@ltx/en_us_dedes/me.m09.d07:alt1.meMA.Kontakion1.mode
ltx/en_us_dedes/me.m09.d07:alt1.meLI.Kontakion1.text	@ltx/en_us_dedes/me.m09.d07:alt1.meMA.Kontakion1.text
ltx/en_us_dedes/me.m09.d07:alt1.meLI.MM.CommunionHymn.text	@ltx/en_us_dedes/properties:media.key
ltx/en_us_dedes/me.m09.d07:alt1.meLI.Megalynarion.text	
ltx/en_us_dedes/me.m09.d07:alt1.meMA.C1.acrostic.notice1	
ltx/en_us_dedes/me.m09.d07:alt1.meMA.C1.acrostic.text	
ltx/en_us_dedes/me.m09.d07:alt1.meMA.C1.acrostic.title	
ltx/en_us_dedes/me.m09.d07:alt1.meMA.C1.poet	
ltx/en_us_dedes/me.m09.d07:alt1.meMA.C1.title	@ltx/en_us_dedes/titles:ti.Canon2DevoutW
ltx/en_us_dedes/me.m09.d07:alt1.meMA.C1.verse	@ltx/en_us_dedes/prayers:pr.verse_DevoutWoman.text
ltx/en_us_dedes/me.m09.d07:alt1.meMA.ExapTheotokion.incipit	…
ltx/en_us_dedes/me.m09.d07:alt1.meMA.ExapTheotokion.melody	@ltx/en_us_dedes/he.a.m2:heAU.GynaikesAkoutisthite.name
ltx/en_us_dedes/me.m09.d07:alt1.meMA.ExapTheotokion.mode	@ltx/en_us_dedes/miscellanea:misc.Mode2
ltx/en_us_dedes/me.m09.d07:alt1.meMA.ExapTheotokion.text	
ltx/en_us_dedes/me.m09.d07:alt1.meMA.Exaposteilarion1.greekmelody	@ltx/en_us_dedes/he.a.m2:heAU.GynaikesAkoutisthite.greekname
ltx/en_us_dedes/me.m09.d07:alt1.meMA.Exaposteilarion1.incipit	…
ltx/en_us_dedes/me.m09.d07:alt1.meMA.Exaposteilarion1.melody	@ltx/en_us_dedes/he.a.m2:heAU.GynaikesAkoutisthite.name
ltx/en_us_dedes/me.m09.d07:alt1.meMA.Exaposteilarion1.mode	@ltx/en_us_dedes/miscellanea:misc.Mode2
ltx/en_us_dedes/me.m09.d07:alt1.meMA.Exaposteilarion1.text	
ltx/en_us_dedes/me.m09.d07:alt1.meMA.Kathisma11.greekmelody	@ltx/en_us_dedes/he.a.m1:heAU.TonTafonSouSotir.greekname
ltx/en_us_dedes/me.m09.d07:alt1.meMA.Kathisma11.incipit	…
ltx/en_us_dedes/me.m09.d07:alt1.meMA.Kathisma11.melody	@ltx/en_us_dedes/he.a.m1:heAU.TonTafonSouSotir.name
ltx/en_us_dedes/me.m09.d07:alt1.meMA.Kathisma11.mode	@ltx/en_us_dedes/miscellanea:misc.Mode1
ltx/en_us_dedes/me.m09.d07:alt1.meMA.Kathisma11.text	
ltx/en_us_dedes/me.m09.d07:alt1.meMA.Kathisma12.greekmelody	@ltx/en_us_dedes/he.a.m1:heAU.TonTafonSouSotir.greekname
ltx/en_us_dedes/me.m09.d07:alt1.meMA.Kathisma12.incipit	…
ltx/en_us_dedes/me.m09.d07:alt1.meMA.Kathisma12.melody	@ltx/en_us_dedes/he.a.m1:heAU.TonTafonSouSotir.name
ltx/en_us_dedes/me.m09.d07:alt1.meMA.Kathisma12.mode	@ltx/en_us_dedes/miscellanea:misc.Mode1
ltx/en_us_dedes/me.m09.d07:alt1.meMA.Kathisma12.text	
ltx/en_us_dedes/me.m09.d07:alt1.meMA.Kathisma21.greekmelody	@ltx/en_us_dedes/he.a.m4:heAU.TachyProkatalave.greekname
ltx/en_us_dedes/me.m09.d07:alt1.meMA.Kathisma21.incipit	…
ltx/en_us_dedes/me.m09.d07:alt1.meMA.Kathisma21.melody	@ltx/en_us_dedes/he.a.m4:heAU.TachyProkatalave.name
ltx/en_us_dedes/me.m09.d07:alt1.meMA.Kathisma21.mode	@ltx/en_us_dedes/miscellanea:misc.Mode4
ltx/en_us_dedes/me.m09.d07:alt1.meMA.Kathisma21.text	
ltx/en_us_dedes/me.m09.d07:alt1.meMA.Kathisma22.greekmelody	@ltx/en_us_dedes/he.a.m4:heAU.TachyProkatalave.greekname
ltx/en_us_dedes/me.m09.d07:alt1.meMA.Kathisma22.incipit	…
ltx/en_us_dedes/me.m09.d07:alt1.meMA.Kathisma22.melody	@ltx/en_us_dedes/he.a.m4:heAU.TachyProkatalave.name
ltx/en_us_dedes/me.m09.d07:alt1.meMA.Kathisma22.mode	@ltx/en_us_dedes/miscellanea:misc.Mode4
ltx/en_us_dedes/me.m09.d07:alt1.meMA.Kathisma22.text	
ltx/en_us_dedes/me.m09.d07:alt1.meMA.Kathisma31.greekmelody	@ltx/en_us_dedes/he.a.m3:heAU.TinOraiotita.greekname
ltx/en_us_dedes/me.m09.d07:alt1.meMA.Kathisma31.incipit	…
ltx/en_us_dedes/me.m09.d07:alt1.meMA.Kathisma31.melody	@ltx/en_us_dedes/he.a.m3:heAU.TinOraiotita.name
ltx/en_us_dedes/me.m09.d07:alt1.meMA.Kathisma31.mode	@ltx/en_us_dedes/miscellanea:misc.Mode3
ltx/en_us_dedes/me.m09.d07:alt1.meMA.Kathisma31.text	
ltx/en_us_dedes/me.m09.d07:alt1.meMA.Kathisma3T.greekmelody	@ltx/en_us_dedes/he.a.m3:heAU.TinOraiotita.greekname
ltx/en_us_dedes/me.m09.d07:alt1.meMA.Kathisma3T.incipit	…
ltx/en_us_dedes/me.m09.d07:alt1.meMA.Kathisma3T.melody	@ltx/en_us_dedes/he.a.m3:heAU.TinOraiotita.name
ltx/en_us_dedes/me.m09.d07:alt1.meMA.Kathisma3T.mode	@ltx/en_us_dedes/miscellanea:misc.Mode3
ltx/en_us_dedes/me.m09.d07:alt1.meMA.Kathisma3T.text	
ltx/en_us_dedes/me.m09.d07:alt1.meMA.Kontakion1.greekmelody	@ltx/en_us_dedes/he.a.m8:heAU.TiYpermacho.greekname
ltx/en_us_dedes/me.m09.d07:alt1.meMA.Kontakion1.incipit	…
ltx/en_us_dedes/me.m09.d07:alt1.meMA.Kontakion1.melody	@ltx/en_us_dedes/he.a.m8:heAU.TiYpermacho.name
ltx/en_us_dedes/me.m09.d07:alt1.meMA.Kontakion1.mode	@ltx/en_us_dedes/miscellanea:misc.Mode8
ltx/en_us_dedes/me.m09.d07:alt1.meMA.Kontakion1.text	
ltx/en_us_dedes/me.m09.d07:alt1.meMA.Lauds1.greekmelody	@ltx/en_us_dedes/he.a.m8:heAU.OTouParadoxou.greekname
ltx/en_us_dedes/me.m09.d07:alt1.meMA.Lauds1.incipit	…
ltx/en_us_dedes/me.m09.d07:alt1.meMA.Lauds1.melody	@ltx/en_us_dedes/he.a.m8:heAU.OTouParadoxou.name
ltx/en_us_dedes/me.m09.d07:alt1.meMA.Lauds1.mode	@ltx/en_us_dedes/miscellanea:misc.Mode8
ltx/en_us_dedes/me.m09.d07:alt1.meMA.Lauds1.text	
ltx/en_us_dedes/me.m09.d07:alt1.meMA.Lauds2.incipit	…
ltx/en_us_dedes/me.m09.d07:alt1.meMA.Lauds2.melody	@ltx/en_us_dedes/he.a.m8:heAU.OTouParadoxou.name
ltx/en_us_dedes/me.m09.d07:alt1.meMA.Lauds2.mode	@ltx/en_us_dedes/miscellanea:misc.Mode8
ltx/en_us_dedes/me.m09.d07:alt1.meMA.Lauds2.text	
ltx/en_us_dedes/me.m09.d07:alt1.meMA.Lauds3.incipit	…
ltx/en_us_dedes/me.m09.d07:alt1.meMA.Lauds3.melody	@ltx/en_us_dedes/he.a.m8:heAU.OTouParadoxou.name
ltx/en_us_dedes/me.m09.d07:alt1.meMA.Lauds3.mode	@ltx/en_us_dedes/miscellanea:misc.Mode8
ltx/en_us_dedes/me.m09.d07:alt1.meMA.Lauds3.text	
ltx/en_us_dedes/me.m09.d07:alt1.meMA.Lauds4.incipit	…
ltx/en_us_dedes/me.m09.d07:alt1.meMA.Lauds4.melody	@ltx/en_us_dedes/he.a.m8:heAU.OTouParadoxou.name
ltx/en_us_dedes/me.m09.d07:alt1.meMA.Lauds4.mode	@ltx/en_us_dedes/miscellanea:misc.Mode8
ltx/en_us_dedes/me.m09.d07:alt1.meMA.Lauds4.text	
ltx/en_us_dedes/me.m09.d07:alt1.meMA.LaudsGlory.incipit	…
ltx/en_us_dedes/me.m09.d07:alt1.meMA.LaudsGlory.melody	
ltx/en_us_dedes/me.m09.d07:alt1.meMA.LaudsGlory.mode	@ltx/en_us_dedes/miscellanea:misc.Mode5
ltx/en_us_dedes/me.m09.d07:alt1.meMA.LaudsGlory.text	
ltx/en_us_dedes/me.m09.d07:alt1.meMA.LaudsTheotokion.incipit	@ltx/en_us_dedes/oc.m5.d3:ocVE.AposTheotokion.incipit
ltx/en_us_dedes/me.m09.d07:alt1.meMA.LaudsTheotokion.melody	
ltx/en_us_dedes/me.m09.d07:alt1.meMA.LaudsTheotokion.mode	@ltx/en_us_dedes/miscellanea:misc.Mode5
ltx/en_us_dedes/me.m09.d07:alt1.meMA.LaudsTheotokion.text	@ltx/en_us_dedes/oc.m5.d3:ocVE.AposTheotokion.text
ltx/en_us_dedes/me.m09.d07:alt1.meMA.Ode1C11.greekmelody	@ltx/en_us_dedes/he.h.m4:heHE.AnoixoToStomaMou.greekname
ltx/en_us_dedes/me.m09.d07:alt1.meMA.Ode1C11.incipit	…
ltx/en_us_dedes/me.m09.d07:alt1.meMA.Ode1C11.melody	@ltx/en_us_dedes/he.h.m4:heHE.AnoixoToStomaMou.name
ltx/en_us_dedes/me.m09.d07:alt1.meMA.Ode1C11.mode	@ltx/en_us_dedes/miscellanea:misc.Mode4
ltx/en_us_dedes/me.m09.d07:alt1.meMA.Ode1C11.ode	@ltx/en_us_dedes/miscellanea:misc.Ode1
ltx/en_us_dedes/me.m09.d07:alt1.meMA.Ode1C11.text	
ltx/en_us_dedes/me.m09.d07:alt1.meMA.Ode1C12.incipit	…
ltx/en_us_dedes/me.m09.d07:alt1.meMA.Ode1C12.melody	@ltx/en_us_dedes/he.h.m4:heHE.AnoixoToStomaMou.name
ltx/en_us_dedes/me.m09.d07:alt1.meMA.Ode1C12.mode	@ltx/en_us_dedes/miscellanea:misc.Mode4
ltx/en_us_dedes/me.m09.d07:alt1.meMA.Ode1C12.ode	@ltx/en_us_dedes/miscellanea:misc.Ode1
ltx/en_us_dedes/me.m09.d07:alt1.meMA.Ode1C12.text	
ltx/en_us_dedes/me.m09.d07:alt1.meMA.Ode1C13.incipit	…
ltx/en_us_dedes/me.m09.d07:alt1.meMA.Ode1C13.melody	@ltx/en_us_dedes/he.h.m4:heHE.AnoixoToStomaMou.name
ltx/en_us_dedes/me.m09.d07:alt1.meMA.Ode1C13.mode	@ltx/en_us_dedes/miscellanea:misc.Mode4
ltx/en_us_dedes/me.m09.d07:alt1.meMA.Ode1C13.ode	@ltx/en_us_dedes/miscellanea:misc.Ode1
ltx/en_us_dedes/me.m09.d07:alt1.meMA.Ode1C13.text	
ltx/en_us_dedes/me.m09.d07:alt1.meMA.Ode1C1T.incipit	…
ltx/en_us_dedes/me.m09.d07:alt1.meMA.Ode1C1T.melody	@ltx/en_us_dedes/he.h.m4:heHE.AnoixoToStomaMou.name
ltx/en_us_dedes/me.m09.d07:alt1.meMA.Ode1C1T.mode	@ltx/en_us_dedes/miscellanea:misc.Mode4
ltx/en_us_dedes/me.m09.d07:alt1.meMA.Ode1C1T.ode	@ltx/en_us_dedes/miscellanea:misc.Ode1
ltx/en_us_dedes/me.m09.d07:alt1.meMA.Ode1C1T.text	
ltx/en_us_dedes/me.m09.d07:alt1.meMA.Ode3C11.greekmelody	@ltx/en_us_dedes/he.h.m4:heHE.TousSousYmnologous.greekname
ltx/en_us_dedes/me.m09.d07:alt1.meMA.Ode3C11.incipit	…
ltx/en_us_dedes/me.m09.d07:alt1.meMA.Ode3C11.melody	@ltx/en_us_dedes/he.h.m4:heHE.TousSousYmnologous.name
ltx/en_us_dedes/me.m09.d07:alt1.meMA.Ode3C11.mode	@ltx/en_us_dedes/miscellanea:misc.Mode4
ltx/en_us_dedes/me.m09.d07:alt1.meMA.Ode3C11.ode	@ltx/en_us_dedes/miscellanea:misc.Ode3
ltx/en_us_dedes/me.m09.d07:alt1.meMA.Ode3C11.text	
ltx/en_us_dedes/me.m09.d07:alt1.meMA.Ode3C12.incipit	…
ltx/en_us_dedes/me.m09.d07:alt1.meMA.Ode3C12.melody	@ltx/en_us_dedes/he.h.m4:heHE.TousSousYmnologous.name
ltx/en_us_dedes/me.m09.d07:alt1.meMA.Ode3C12.mode	@ltx/en_us_dedes/miscellanea:misc.Mode4
ltx/en_us_dedes/me.m09.d07:alt1.meMA.Ode3C12.ode	@ltx/en_us_dedes/miscellanea:misc.Ode3
ltx/en_us_dedes/me.m09.d07:alt1.meMA.Ode3C12.text	
ltx/en_us_dedes/me.m09.d07:alt1.meMA.Ode3C13.incipit	…
ltx/en_us_dedes/me.m09.d07:alt1.meMA.Ode3C13.melody	@ltx/en_us_dedes/he.h.m4:heHE.TousSousYmnologous.name
ltx/en_us_dedes/me.m09.d07:alt1.meMA.Ode3C13.mode	@ltx/en_us_dedes/miscellanea:misc.Mode4
ltx/en_us_dedes/me.m09.d07:alt1.meMA.Ode3C13.ode	@ltx/en_us_dedes/miscellanea:misc.Ode3
ltx/en_us_dedes/me.m09.d07:alt1.meMA.Ode3C13.text	
ltx/en_us_dedes/me.m09.d07:alt1.meMA.Ode3C1T.incipit	…
ltx/en_us_dedes/me.m09.d07:alt1.meMA.Ode3C1T.melody	@ltx/en_us_dedes/he.h.m4:heHE.TousSousYmnologous.name
ltx/en_us_dedes/me.m09.d07:alt1.meMA.Ode3C1T.mode	@ltx/en_us_dedes/miscellanea:misc.Mode4
ltx/en_us_dedes/me.m09.d07:alt1.meMA.Ode3C1T.ode	@ltx/en_us_dedes/miscellanea:misc.Ode3
ltx/en_us_dedes/me.m09.d07:alt1.meMA.Ode3C1T.text	
ltx/en_us_dedes/me.m09.d07:alt1.meMA.Ode3Kathisma1.greekmelody	@ltx/en_us_dedes/he.a.m3:heAU.TheiasPisteos.greekname
ltx/en_us_dedes/me.m09.d07:alt1.meMA.Ode3Kathisma1.incipit	…
ltx/en_us_dedes/me.m09.d07:alt1.meMA.Ode3Kathisma1.melody	@ltx/en_us_dedes/he.a.m3:heAU.TheiasPisteos.name
ltx/en_us_dedes/me.m09.d07:alt1.meMA.Ode3Kathisma1.mode	@ltx/en_us_dedes/miscellanea:misc.Mode3
ltx/en_us_dedes/me.m09.d07:alt1.meMA.Ode3Kathisma1.text	
ltx/en_us_dedes/me.m09.d07:alt1.meMA.Ode3Kathisma2.greekmelody	@ltx/en_us_dedes/he.a.m3:heAU.TheiasPisteos.greekname
ltx/en_us_dedes/me.m09.d07:alt1.meMA.Ode3Kathisma2.incipit	…
ltx/en_us_dedes/me.m09.d07:alt1.meMA.Ode3Kathisma2.melody	@ltx/en_us_dedes/he.a.m3:heAU.TheiasPisteos.name
ltx/en_us_dedes/me.m09.d07:alt1.meMA.Ode3Kathisma2.mode	@ltx/en_us_dedes/miscellanea:misc.Mode3
ltx/en_us_dedes/me.m09.d07:alt1.meMA.Ode3Kathisma2.text	
ltx/en_us_dedes/me.m09.d07:alt1.meMA.Ode4C11.greekmelody	@ltx/en_us_dedes/he.h.m4:heHE.OKathimenosEnDoxi.greekname
ltx/en_us_dedes/me.m09.d07:alt1.meMA.Ode4C11.incipit	…
ltx/en_us_dedes/me.m09.d07:alt1.meMA.Ode4C11.melody	@ltx/en_us_dedes/he.h.m4:heHE.OKathimenosEnDoxi.name
ltx/en_us_dedes/me.m09.d07:alt1.meMA.Ode4C11.mode	@ltx/en_us_dedes/miscellanea:misc.Mode4
ltx/en_us_dedes/me.m09.d07:alt1.meMA.Ode4C11.ode	@ltx/en_us_dedes/miscellanea:misc.Ode4
ltx/en_us_dedes/me.m09.d07:alt1.meMA.Ode4C11.text	
ltx/en_us_dedes/me.m09.d07:alt1.meMA.Ode4C12.incipit	…
ltx/en_us_dedes/me.m09.d07:alt1.meMA.Ode4C12.melody	@ltx/en_us_dedes/he.h.m4:heHE.OKathimenosEnDoxi.name
ltx/en_us_dedes/me.m09.d07:alt1.meMA.Ode4C12.mode	@ltx/en_us_dedes/miscellanea:misc.Mode4
ltx/en_us_dedes/me.m09.d07:alt1.meMA.Ode4C12.ode	@ltx/en_us_dedes/miscellanea:misc.Ode4
ltx/en_us_dedes/me.m09.d07:alt1.meMA.Ode4C12.text	
ltx/en_us_dedes/me.m09.d07:alt1.meMA.Ode4C13.incipit	…
ltx/en_us_dedes/me.m09.d07:alt1.meMA.Ode4C13.melody	@ltx/en_us_dedes/he.h.m4:heHE.OKathimenosEnDoxi.name
ltx/en_us_dedes/me.m09.d07:alt1.meMA.Ode4C13.mode	@ltx/en_us_dedes/miscellanea:misc.Mode4
ltx/en_us_dedes/me.m09.d07:alt1.meMA.Ode4C13.ode	@ltx/en_us_dedes/miscellanea:misc.Ode4
ltx/en_us_dedes/me.m09.d07:alt1.meMA.Ode4C13.text	
ltx/en_us_dedes/me.m09.d07:alt1.meMA.Ode4C1T.incipit	…
ltx/en_us_dedes/me.m09.d07:alt1.meMA.Ode4C1T.melody	@ltx/en_us_dedes/he.h.m4:heHE.OKathimenosEnDoxi.name
ltx/en_us_dedes/me.m09.d07:alt1.meMA.Ode4C1T.mode	@ltx/en_us_dedes/miscellanea:misc.Mode4
ltx/en_us_dedes/me.m09.d07:alt1.meMA.Ode4C1T.ode	@ltx/en_us_dedes/miscellanea:misc.Ode4
ltx/en_us_dedes/me.m09.d07:alt1.meMA.Ode4C1T.text	
ltx/en_us_dedes/me.m09.d07:alt1.meMA.Ode5C11.greekmelody	@ltx/en_us_dedes/he.h.m4:heHE.ExestiTaSympanta.greekname
ltx/en_us_dedes/me.m09.d07:alt1.meMA.Ode5C11.incipit	…
ltx/en_us_dedes/me.m09.d07:alt1.meMA.Ode5C11.melody	@ltx/en_us_dedes/he.h.m4:heHE.ExestiTaSympanta.name
ltx/en_us_dedes/me.m09.d07:alt1.meMA.Ode5C11.mode	@ltx/en_us_dedes/miscellanea:misc.Mode4
ltx/en_us_dedes/me.m09.d07:alt1.meMA.Ode5C11.ode	@ltx/en_us_dedes/miscellanea:misc.Ode5
ltx/en_us_dedes/me.m09.d07:alt1.meMA.Ode5C11.text	
ltx/en_us_dedes/me.m09.d07:alt1.meMA.Ode5C12.incipit	…
ltx/en_us_dedes/me.m09.d07:alt1.meMA.Ode5C12.melody	@ltx/en_us_dedes/he.h.m4:heHE.ExestiTaSympanta.name
ltx/en_us_dedes/me.m09.d07:alt1.meMA.Ode5C12.mode	@ltx/en_us_dedes/miscellanea:misc.Mode4
ltx/en_us_dedes/me.m09.d07:alt1.meMA.Ode5C12.ode	@ltx/en_us_dedes/miscellanea:misc.Ode5
ltx/en_us_dedes/me.m09.d07:alt1.meMA.Ode5C12.text	
ltx/en_us_dedes/me.m09.d07:alt1.meMA.Ode5C13.incipit	…
ltx/en_us_dedes/me.m09.d07:alt1.meMA.Ode5C13.melody	@ltx/en_us_dedes/he.h.m4:heHE.ExestiTaSympanta.name
ltx/en_us_dedes/me.m09.d07:alt1.meMA.Ode5C13.mode	@ltx/en_us_dedes/miscellanea:misc.Mode4
ltx/en_us_dedes/me.m09.d07:alt1.meMA.Ode5C13.ode	@ltx/en_us_dedes/miscellanea:misc.Ode5
ltx/en_us_dedes/me.m09.d07:alt1.meMA.Ode5C13.text	
ltx/en_us_dedes/me.m09.d07:alt1.meMA.Ode5C1T.incipit	…
ltx/en_us_dedes/me.m09.d07:alt1.meMA.Ode5C1T.melody	@ltx/en_us_dedes/he.h.m4:heHE.ExestiTaSympanta.name
ltx/en_us_dedes/me.m09.d07:alt1.meMA.Ode5C1T.mode	@ltx/en_us_dedes/miscellanea:misc.Mode4
ltx/en_us_dedes/me.m09.d07:alt1.meMA.Ode5C1T.ode	@ltx/en_us_dedes/miscellanea:misc.Ode5
ltx/en_us_dedes/me.m09.d07:alt1.meMA.Ode5C1T.text	
ltx/en_us_dedes/me.m09.d07:alt1.meMA.Ode6C11.greekmelody	@ltx/en_us_dedes/he.h.m4:heHE.TinTheianTaftin.greekname
ltx/en_us_dedes/me.m09.d07:alt1.meMA.Ode6C11.incipit	…
ltx/en_us_dedes/me.m09.d07:alt1.meMA.Ode6C11.melody	@ltx/en_us_dedes/he.h.m4:heHE.TinTheianTaftin.name
ltx/en_us_dedes/me.m09.d07:alt1.meMA.Ode6C11.mode	@ltx/en_us_dedes/miscellanea:misc.Mode4
ltx/en_us_dedes/me.m09.d07:alt1.meMA.Ode6C11.ode	@ltx/en_us_dedes/miscellanea:misc.Ode6
ltx/en_us_dedes/me.m09.d07:alt1.meMA.Ode6C11.text	
ltx/en_us_dedes/me.m09.d07:alt1.meMA.Ode6C12.incipit	…
ltx/en_us_dedes/me.m09.d07:alt1.meMA.Ode6C12.melody	@ltx/en_us_dedes/he.h.m4:heHE.TinTheianTaftin.name
ltx/en_us_dedes/me.m09.d07:alt1.meMA.Ode6C12.mode	@ltx/en_us_dedes/miscellanea:misc.Mode4
ltx/en_us_dedes/me.m09.d07:alt1.meMA.Ode6C12.ode	@ltx/en_us_dedes/miscellanea:misc.Ode6
ltx/en_us_dedes/me.m09.d07:alt1.meMA.Ode6C12.text	
ltx/en_us_dedes/me.m09.d07:alt1.meMA.Ode6C13.incipit	…
ltx/en_us_dedes/me.m09.d07:alt1.meMA.Ode6C13.melody	@ltx/en_us_dedes/he.h.m4:heHE.TinTheianTaftin.name
ltx/en_us_dedes/me.m09.d07:alt1.meMA.Ode6C13.mode	@ltx/en_us_dedes/miscellanea:misc.Mode4
ltx/en_us_dedes/me.m09.d07:alt1.meMA.Ode6C13.ode	@ltx/en_us_dedes/miscellanea:misc.Ode6
ltx/en_us_dedes/me.m09.d07:alt1.meMA.Ode6C13.text	
ltx/en_us_dedes/me.m09.d07:alt1.meMA.Ode6C1T.incipit	…
ltx/en_us_dedes/me.m09.d07:alt1.meMA.Ode6C1T.melody	@ltx/en_us_dedes/he.h.m4:heHE.TinTheianTaftin.name
ltx/en_us_dedes/me.m09.d07:alt1.meMA.Ode6C1T.mode	@ltx/en_us_dedes/miscellanea:misc.Mode4
ltx/en_us_dedes/me.m09.d07:alt1.meMA.Ode6C1T.ode	@ltx/en_us_dedes/miscellanea:misc.Ode6
ltx/en_us_dedes/me.m09.d07:alt1.meMA.Ode6C1T.text	
ltx/en_us_dedes/me.m09.d07:alt1.meMA.Ode7C11.greekmelody	@ltx/en_us_dedes/he.h.m4:heHE.OukElatrefsan.greekname
ltx/en_us_dedes/me.m09.d07:alt1.meMA.Ode7C11.incipit	…
ltx/en_us_dedes/me.m09.d07:alt1.meMA.Ode7C11.melody	@ltx/en_us_dedes/he.h.m4:heHE.OukElatrefsan.name
ltx/en_us_dedes/me.m09.d07:alt1.meMA.Ode7C11.mode	@ltx/en_us_dedes/miscellanea:misc.Mode4
ltx/en_us_dedes/me.m09.d07:alt1.meMA.Ode7C11.ode	@ltx/en_us_dedes/miscellanea:misc.Ode7
ltx/en_us_dedes/me.m09.d07:alt1.meMA.Ode7C11.text	
ltx/en_us_dedes/me.m09.d07:alt1.meMA.Ode7C12.incipit	…
ltx/en_us_dedes/me.m09.d07:alt1.meMA.Ode7C12.melody	@ltx/en_us_dedes/he.h.m4:heHE.OukElatrefsan.name
ltx/en_us_dedes/me.m09.d07:alt1.meMA.Ode7C12.mode	@ltx/en_us_dedes/miscellanea:misc.Mode4
ltx/en_us_dedes/me.m09.d07:alt1.meMA.Ode7C12.ode	@ltx/en_us_dedes/miscellanea:misc.Ode7
ltx/en_us_dedes/me.m09.d07:alt1.meMA.Ode7C12.text	
ltx/en_us_dedes/me.m09.d07:alt1.meMA.Ode7C13.incipit	…
ltx/en_us_dedes/me.m09.d07:alt1.meMA.Ode7C13.melody	@ltx/en_us_dedes/he.h.m4:heHE.OukElatrefsan.name
ltx/en_us_dedes/me.m09.d07:alt1.meMA.Ode7C13.mode	@ltx/en_us_dedes/miscellanea:misc.Mode4
ltx/en_us_dedes/me.m09.d07:alt1.meMA.Ode7C13.ode	@ltx/en_us_dedes/miscellanea:misc.Ode7
ltx/en_us_dedes/me.m09.d07:alt1.meMA.Ode7C13.text	
ltx/en_us_dedes/me.m09.d07:alt1.meMA.Ode7C1T.incipit	…
ltx/en_us_dedes/me.m09.d07:alt1.meMA.Ode7C1T.melody	@ltx/en_us_dedes/he.h.m4:heHE.OukElatrefsan.name
ltx/en_us_dedes/me.m09.d07:alt1.meMA.Ode7C1T.mode	@ltx/en_us_dedes/miscellanea:misc.Mode4
ltx/en_us_dedes/me.m09.d07:alt1.meMA.Ode7C1T.ode	@ltx/en_us_dedes/miscellanea:misc.Ode7
ltx/en_us_dedes/me.m09.d07:alt1.meMA.Ode7C1T.text	
ltx/en_us_dedes/me.m09.d07:alt1.meMA.Ode8C11.greekmelody	@ltx/en_us_dedes/he.h.m4:heHE.PaidasEvageis.greekname
ltx/en_us_dedes/me.m09.d07:alt1.meMA.Ode8C11.incipit	…
ltx/en_us_dedes/me.m09.d07:alt1.meMA.Ode8C11.melody	@ltx/en_us_dedes/he.h.m4:heHE.PaidasEvageis.name
ltx/en_us_dedes/me.m09.d07:alt1.meMA.Ode8C11.mode	@ltx/en_us_dedes/miscellanea:misc.Mode4
ltx/en_us_dedes/me.m09.d07:alt1.meMA.Ode8C11.ode	@ltx/en_us_dedes/miscellanea:misc.Ode8
ltx/en_us_dedes/me.m09.d07:alt1.meMA.Ode8C11.text	
ltx/en_us_dedes/me.m09.d07:alt1.meMA.Ode8C12.incipit	…
ltx/en_us_dedes/me.m09.d07:alt1.meMA.Ode8C12.melody	@ltx/en_us_dedes/he.h.m4:heHE.PaidasEvageis.name
ltx/en_us_dedes/me.m09.d07:alt1.meMA.Ode8C12.mode	@ltx/en_us_dedes/miscellanea:misc.Mode4
ltx/en_us_dedes/me.m09.d07:alt1.meMA.Ode8C12.ode	@ltx/en_us_dedes/miscellanea:misc.Ode8
ltx/en_us_dedes/me.m09.d07:alt1.meMA.Ode8C12.text	
ltx/en_us_dedes/me.m09.d07:alt1.meMA.Ode8C13.incipit	…
ltx/en_us_dedes/me.m09.d07:alt1.meMA.Ode8C13.melody	@ltx/en_us_dedes/he.h.m4:heHE.PaidasEvageis.name
ltx/en_us_dedes/me.m09.d07:alt1.meMA.Ode8C13.mode	@ltx/en_us_dedes/miscellanea:misc.Mode4
ltx/en_us_dedes/me.m09.d07:alt1.meMA.Ode8C13.ode	@ltx/en_us_dedes/miscellanea:misc.Ode8
ltx/en_us_dedes/me.m09.d07:alt1.meMA.Ode8C13.text	
ltx/en_us_dedes/me.m09.d07:alt1.meMA.Ode8C1T.incipit	…
ltx/en_us_dedes/me.m09.d07:alt1.meMA.Ode8C1T.melody	@ltx/en_us_dedes/he.h.m4:heHE.PaidasEvageis.name
ltx/en_us_dedes/me.m09.d07:alt1.meMA.Ode8C1T.mode	@ltx/en_us_dedes/miscellanea:misc.Mode4
ltx/en_us_dedes/me.m09.d07:alt1.meMA.Ode8C1T.ode	@ltx/en_us_dedes/miscellanea:misc.Ode8
ltx/en_us_dedes/me.m09.d07:alt1.meMA.Ode8C1T.text	
ltx/en_us_dedes/me.m09.d07:alt1.meMA.Ode9C11.greekmelody	@ltx/en_us_dedes/he.h.m4:heHE.ApasGigenis.greekname
ltx/en_us_dedes/me.m09.d07:alt1.meMA.Ode9C11.incipit	…
ltx/en_us_dedes/me.m09.d07:alt1.meMA.Ode9C11.melody	@ltx/en_us_dedes/he.h.m4:heHE.ApasGigenis.name
ltx/en_us_dedes/me.m09.d07:alt1.meMA.Ode9C11.mode	@ltx/en_us_dedes/miscellanea:misc.Mode4
ltx/en_us_dedes/me.m09.d07:alt1.meMA.Ode9C11.ode	@ltx/en_us_dedes/miscellanea:misc.Ode9
ltx/en_us_dedes/me.m09.d07:alt1.meMA.Ode9C11.text	
ltx/en_us_dedes/me.m09.d07:alt1.meMA.Ode9C12.incipit	…
ltx/en_us_dedes/me.m09.d07:alt1.meMA.Ode9C12.melody	@ltx/en_us_dedes/he.h.m4:heHE.ApasGigenis.name
ltx/en_us_dedes/me.m09.d07:alt1.meMA.Ode9C12.mode	@ltx/en_us_dedes/miscellanea:misc.Mode4
ltx/en_us_dedes/me.m09.d07:alt1.meMA.Ode9C12.ode	@ltx/en_us_dedes/miscellanea:misc.Ode9
ltx/en_us_dedes/me.m09.d07:alt1.meMA.Ode9C12.text	
ltx/en_us_dedes/me.m09.d07:alt1.meMA.Ode9C13.incipit	…
ltx/en_us_dedes/me.m09.d07:alt1.meMA.Ode9C13.melody	@ltx/en_us_dedes/he.h.m4:heHE.ApasGigenis.name
ltx/en_us_dedes/me.m09.d07:alt1.meMA.Ode9C13.mode	@ltx/en_us_dedes/miscellanea:misc.Mode4
ltx/en_us_dedes/me.m09.d07:alt1.meMA.Ode9C13.ode	@ltx/en_us_dedes/miscellanea:misc.Ode9
ltx/en_us_dedes/me.m09.d07:alt1.meMA.Ode9C13.text	
ltx/en_us_dedes/me.m09.d07:alt1.meMA.Ode9C1T.incipit	…
ltx/en_us_dedes/me.m09.d07:alt1.meMA.Ode9C1T.melody	@ltx/en_us_dedes/he.h.m4:heHE.ApasGigenis.name
ltx/en_us_dedes/me.m09.d07:alt1.meMA.Ode9C1T.mode	@ltx/en_us_dedes/miscellanea:misc.Mode4
ltx/en_us_dedes/me.m09.d07:alt1.meMA.Ode9C1T.ode	@ltx/en_us_dedes/miscellanea:misc.Ode9
ltx/en_us_dedes/me.m09.d07:alt1.meMA.Ode9C1T.text	
ltx/en_us_dedes/me.m09.d07:alt1.meMA.Oikos1.text	
ltx/en_us_dedes/me.m09.d07:alt1.meMA.Oikos12.text	
ltx/en_us_dedes/me.m09.d07:alt1.meMA.Oikos13.text	
ltx/en_us_dedes/me.m09.d07:alt1.meMA.Oikos14.text	
ltx/en_us_dedes/me.m09.d07:alt1.meMA.Oikos15.text	
ltx/en_us_dedes/me.m09.d07:alt1.meMA.Oikos16.text	
ltx/en_us_dedes/me.m09.d07:alt1.meMA.Oikos17.text	
ltx/en_us_dedes/me.m09.d07:alt1.meMA.Oikos18.text	
ltx/en_us_dedes/me.m09.d07:alt1.meMA.PostGospelBoth.incipit	@ltx/en_us_dedes/ho.ho03:hoMA.PostGospelTheotokos.incipit
ltx/en_us_dedes/me.m09.d07:alt1.meMA.PostGospelBoth.melody	
ltx/en_us_dedes/me.m09.d07:alt1.meMA.PostGospelBoth.mode	@ltx/en_us_dedes/miscellanea:misc.Mode2
ltx/en_us_dedes/me.m09.d07:alt1.meMA.PostGospelBoth.text	@ltx/en_us_dedes/ho.ho03:hoMA.PostGospelTheotokos.text
ltx/en_us_dedes/me.m09.d07:alt1.meMA.PostGospelGlory.incipit	@ltx/en_us_dedes/ho.ho03:hoMA.PostGospelWomanMonastic.incipit
ltx/en_us_dedes/me.m09.d07:alt1.meMA.PostGospelGlory.melody	
ltx/en_us_dedes/me.m09.d07:alt1.meMA.PostGospelGlory.mode	@ltx/en_us_dedes/miscellanea:misc.Mode2
ltx/en_us_dedes/me.m09.d07:alt1.meMA.PostGospelGlory.text	@ltx/en_us_dedes/ho.ho03:hoMA.PostGospelWomanMonastic.text
ltx/en_us_dedes/me.m09.d07:alt1.meMA.PostGospelIdiomelon.incipit	…
ltx/en_us_dedes/me.m09.d07:alt1.meMA.PostGospelIdiomelon.melody	
ltx/en_us_dedes/me.m09.d07:alt1.meMA.PostGospelIdiomelon.mode	@ltx/en_us_dedes/miscellanea:misc.Mode6
ltx/en_us_dedes/me.m09.d07:alt1.meMA.PostGospelIdiomelon.text	
ltx/en_us_dedes/me.m09.d07:alt1.meSV.AposBoth.incipit	…
ltx/en_us_dedes/me.m09.d07:alt1.meSV.AposBoth.melody	@ltx/en_us_dedes/he.a.m2:heAU.OikosTouEfratha.name
ltx/en_us_dedes/me.m09.d07:alt1.meSV.AposBoth.mode	@ltx/en_us_dedes/miscellanea:misc.Mode2
ltx/en_us_dedes/me.m09.d07:alt1.meSV.AposBoth.text	
ltx/en_us_dedes/me.m09.d07:alt1.meSV.AposGlory.incipit	…
ltx/en_us_dedes/me.m09.d07:alt1.meSV.AposGlory.melody	@ltx/en_us_dedes/he.a.m2:heAU.OikosTouEfratha.name
ltx/en_us_dedes/me.m09.d07:alt1.meSV.AposGlory.mode	@ltx/en_us_dedes/miscellanea:misc.Mode2
ltx/en_us_dedes/me.m09.d07:alt1.meSV.AposGlory.text	
ltx/en_us_dedes/me.m09.d07:alt1.meSV.Aposticha1.greekmelody	@ltx/en_us_dedes/he.a.m2:heAU.OikosTouEfratha.greekname
ltx/en_us_dedes/me.m09.d07:alt1.meSV.Aposticha1.incipit	…
ltx/en_us_dedes/me.m09.d07:alt1.meSV.Aposticha1.melody	@ltx/en_us_dedes/he.a.m2:heAU.OikosTouEfratha.name
ltx/en_us_dedes/me.m09.d07:alt1.meSV.Aposticha1.mode	@ltx/en_us_dedes/miscellanea:misc.Mode2
ltx/en_us_dedes/me.m09.d07:alt1.meSV.Aposticha1.text	
ltx/en_us_dedes/me.m09.d07:alt1.meSV.Aposticha2.incipit	…
ltx/en_us_dedes/me.m09.d07:alt1.meSV.Aposticha2.melody	@ltx/en_us_dedes/he.a.m2:heAU.OikosTouEfratha.name
ltx/en_us_dedes/me.m09.d07:alt1.meSV.Aposticha2.mode	@ltx/en_us_dedes/miscellanea:misc.Mode2
ltx/en_us_dedes/me.m09.d07:alt1.meSV.Aposticha2.text	
ltx/en_us_dedes/me.m09.d07:alt1.meSV.Aposticha3.incipit	…
ltx/en_us_dedes/me.m09.d07:alt1.meSV.Aposticha3.melody	@ltx/en_us_dedes/he.a.m2:heAU.OikosTouEfratha.name
ltx/en_us_dedes/me.m09.d07:alt1.meSV.Aposticha3.mode	@ltx/en_us_dedes/miscellanea:misc.Mode2
ltx/en_us_dedes/me.m09.d07:alt1.meSV.Aposticha3.text	
ltx/en_us_dedes/me.m09.d07:alt1.meSV.SticBoth.incipit	@ltx/en_us_dedes/me.m09.d07:meMA.AposGlory.incipit
ltx/en_us_dedes/me.m09.d07:alt1.meSV.SticBoth.melody	
ltx/en_us_dedes/me.m09.d07:alt1.meSV.SticBoth.mode	@ltx/en_us_dedes/miscellanea:misc.Mode2
ltx/en_us_dedes/me.m09.d07:alt1.meSV.SticBoth.text	@ltx/en_us_dedes/me.m09.d07:meMA.AposGlory.text
ltx/en_us_dedes/me.m09.d07:alt1.meSV.SticGlory.incipit	…
ltx/en_us_dedes/me.m09.d07:alt1.meSV.SticGlory.melody	
ltx/en_us_dedes/me.m09.d07:alt1.meSV.SticGlory.mode	@ltx/en_us_dedes/miscellanea:misc.Mode2
ltx/en_us_dedes/me.m09.d07:alt1.meSV.SticGlory.text	
ltx/en_us_dedes/me.m09.d07:alt1.meSV.Stichera1.greekmelody	@ltx/en_us_dedes/he.a.m4:heAU.EdokasSimeiosin.greekname
ltx/en_us_dedes/me.m09.d07:alt1.meSV.Stichera1.incipit	…
ltx/en_us_dedes/me.m09.d07:alt1.meSV.Stichera1.melody	@ltx/en_us_dedes/he.a.m4:heAU.EdokasSimeiosin.name
ltx/en_us_dedes/me.m09.d07:alt1.meSV.Stichera1.mode	@ltx/en_us_dedes/miscellanea:misc.Mode4
ltx/en_us_dedes/me.m09.d07:alt1.meSV.Stichera1.text	
ltx/en_us_dedes/me.m09.d07:alt1.meSV.Stichera2.incipit	…
ltx/en_us_dedes/me.m09.d07:alt1.meSV.Stichera2.melody	@ltx/en_us_dedes/he.a.m4:heAU.EdokasSimeiosin.name
ltx/en_us_dedes/me.m09.d07:alt1.meSV.Stichera2.mode	@ltx/en_us_dedes/miscellanea:misc.Mode4
ltx/en_us_dedes/me.m09.d07:alt1.meSV.Stichera2.text	
ltx/en_us_dedes/me.m09.d07:alt1.meSV.Stichera3.incipit	…
ltx/en_us_dedes/me.m09.d07:alt1.meSV.Stichera3.melody	@ltx/en_us_dedes/he.a.m4:heAU.EdokasSimeiosin.name
ltx/en_us_dedes/me.m09.d07:alt1.meSV.Stichera3.mode	@ltx/en_us_dedes/miscellanea:misc.Mode4
ltx/en_us_dedes/me.m09.d07:alt1.meSV.Stichera3.text	
ltx/en_us_dedes/me.m09.d07:alt1.meSV.Stichera4.greekmelody	@ltx/en_us_dedes/he.a.m4:heAU.EdokasSimeiosin.greekname
ltx/en_us_dedes/me.m09.d07:alt1.meSV.Stichera4.incipit	…
ltx/en_us_dedes/me.m09.d07:alt1.meSV.Stichera4.melody	@ltx/en_us_dedes/he.a.m4:heAU.EdokasSimeiosin.name
ltx/en_us_dedes/me.m09.d07:alt1.meSV.Stichera4.mode	@ltx/en_us_dedes/miscellanea:misc.Mode4
ltx/en_us_dedes/me.m09.d07:alt1.meSV.Stichera4.text	
ltx/en_us_dedes/me.m09.d07:alt1.meVE.Apolytikion1.greekmelody	@ltx/en_us_dedes/he.a.m5:heAU.TonSynanarchonLogon.greekname
ltx/en_us_dedes/me.m09.d07:alt1.meVE.Apolytikion1.incipit	…
ltx/en_us_dedes/me.m09.d07:alt1.meVE.Apolytikion1.melody	@ltx/en_us_dedes/he.a.m5:heAU.TonSynanarchonLogon.name
ltx/en_us_dedes/me.m09.d07:alt1.meVE.Apolytikion1.mode	@ltx/en_us_dedes/miscellanea:misc.Mode5
ltx/en_us_dedes/me.m09.d07:alt1.meVE.Apolytikion1.text	
ltx/en_us_dedes/me.m09.d07:alt1.meVE.Apolytikion2.greekmelody	@ltx/en_us_dedes/he.a.m4:heAU.KateplagiIosif.greekname
ltx/en_us_dedes/me.m09.d07:alt1.meVE.Apolytikion2.incipit	@ltx/en_us_dedes/me.m09.d07:meVE.Apolytikion1.incipit
ltx/en_us_dedes/me.m09.d07:alt1.meVE.Apolytikion2.melody	@ltx/en_us_dedes/he.a.m4:heAU.KateplagiIosif.name
ltx/en_us_dedes/me.m09.d07:alt1.meVE.Apolytikion2.mode	@ltx/en_us_dedes/miscellanea:misc.Mode4
ltx/en_us_dedes/me.m09.d07:alt1.meVE.Apolytikion2.text	@ltx/en_us_dedes/me.m09.d07:meVE.Apolytikion1.text
ltx/en_us_dedes/me.m09.d07:alt1.meVE.AposBoth.incipit	@ltx/en_us_dedes/me.m09.d08:meVE.LityGlory.incipit
ltx/en_us_dedes/me.m09.d07:alt1.meVE.AposBoth.melody	
ltx/en_us_dedes/me.m09.d07:alt1.meVE.AposBoth.mode	@ltx/en_us_dedes/miscellanea:misc.Mode8
ltx/en_us_dedes/me.m09.d07:alt1.meVE.AposBoth.text	@ltx/en_us_dedes/me.m09.d08:meVE.LityGlory.text
ltx/en_us_dedes/me.m09.d07:alt1.meVE.AposGlory.incipit	…
ltx/en_us_dedes/me.m09.d07:alt1.meVE.AposGlory.melody	
ltx/en_us_dedes/me.m09.d07:alt1.meVE.AposGlory.mode	@ltx/en_us_dedes/miscellanea:misc.Mode8
ltx/en_us_dedes/me.m09.d07:alt1.meVE.AposGlory.text	
ltx/en_us_dedes/me.m09.d07:alt1.meVE.Aposticha1.greekmelody	@ltx/en_us_dedes/he.a.m5:heAU.ChairoisAskitikon.greekname
ltx/en_us_dedes/me.m09.d07:alt1.meVE.Aposticha1.incipit	…
ltx/en_us_dedes/me.m09.d07:alt1.meVE.Aposticha1.melody	@ltx/en_us_dedes/he.a.m5:heAU.ChairoisAskitikon.name
ltx/en_us_dedes/me.m09.d07:alt1.meVE.Aposticha1.mode	@ltx/en_us_dedes/miscellanea:misc.Mode5
ltx/en_us_dedes/me.m09.d07:alt1.meVE.Aposticha1.text	
ltx/en_us_dedes/me.m09.d07:alt1.meVE.Aposticha2.incipit	…
ltx/en_us_dedes/me.m09.d07:alt1.meVE.Aposticha2.melody	@ltx/en_us_dedes/he.a.m5:heAU.ChairoisAskitikon.name
ltx/en_us_dedes/me.m09.d07:alt1.meVE.Aposticha2.mode	@ltx/en_us_dedes/miscellanea:misc.Mode5
ltx/en_us_dedes/me.m09.d07:alt1.meVE.Aposticha2.text	
ltx/en_us_dedes/me.m09.d07:alt1.meVE.Aposticha3.incipit	…
ltx/en_us_dedes/me.m09.d07:alt1.meVE.Aposticha3.melody	@ltx/en_us_dedes/he.a.m5:heAU.ChairoisAskitikon.name
ltx/en_us_dedes/me.m09.d07:alt1.meVE.Aposticha3.mode	@ltx/en_us_dedes/miscellanea:misc.Mode5
ltx/en_us_dedes/me.m09.d07:alt1.meVE.Aposticha3.text	
ltx/en_us_dedes/me.m09.d07:alt1.meVE.Lity1.incipit	…
ltx/en_us_dedes/me.m09.d07:alt1.meVE.Lity1.melody	
ltx/en_us_dedes/me.m09.d07:alt1.meVE.Lity1.mode	@ltx/en_us_dedes/miscellanea:misc.Mode1
ltx/en_us_dedes/me.m09.d07:alt1.meVE.Lity1.text	
ltx/en_us_dedes/me.m09.d07:alt1.meVE.Lity2.incipit	…
ltx/en_us_dedes/me.m09.d07:alt1.meVE.Lity2.melody	
ltx/en_us_dedes/me.m09.d07:alt1.meVE.Lity2.mode	@ltx/en_us_dedes/miscellanea:misc.Mode2
ltx/en_us_dedes/me.m09.d07:alt1.meVE.Lity2.text	
ltx/en_us_dedes/me.m09.d07:alt1.meVE.Lity3.incipit	…
ltx/en_us_dedes/me.m09.d07:alt1.meVE.Lity3.melody	
ltx/en_us_dedes/me.m09.d07:alt1.meVE.Lity3.mode	@ltx/en_us_dedes/miscellanea:misc.Mode3
ltx/en_us_dedes/me.m09.d07:alt1.meVE.Lity3.text	
ltx/en_us_dedes/me.m09.d07:alt1.meVE.Lity4.incipit	…
ltx/en_us_dedes/me.m09.d07:alt1.meVE.Lity4.melody	
ltx/en_us_dedes/me.m09.d07:alt1.meVE.Lity4.mode	@ltx/en_us_dedes/miscellanea:misc.Mode4
ltx/en_us_dedes/me.m09.d07:alt1.meVE.Lity4.text	
ltx/en_us_dedes/me.m09.d07:alt1.meVE.LityBoth.incipit	@ltx/en_us_dedes/me.m09.d07:meVE.AposGlory.incipit
ltx/en_us_dedes/me.m09.d07:alt1.meVE.LityBoth.melody	
ltx/en_us_dedes/me.m09.d07:alt1.meVE.LityBoth.mode	@ltx/en_us_dedes/miscellanea:misc.Mode4
ltx/en_us_dedes/me.m09.d07:alt1.meVE.LityBoth.text	@ltx/en_us_dedes/me.m09.d07:meVE.AposGlory.text
ltx/en_us_dedes/me.m09.d07:alt1.meVE.LityGlory.incipit	…
ltx/en_us_dedes/me.m09.d07:alt1.meVE.LityGlory.melody	
ltx/en_us_dedes/me.m09.d07:alt1.meVE.LityGlory.mode	@ltx/en_us_dedes/miscellanea:misc.Mode4
ltx/en_us_dedes/me.m09.d07:alt1.meVE.LityGlory.text	
ltx/en_us_dedes/me.m09.d07:alt1.meVE.SticBoth.incipit	@ltx/en_us_dedes/me.m09.d08:meVE.Stichera01.incipit
ltx/en_us_dedes/me.m09.d07:alt1.meVE.SticBoth.melody	
ltx/en_us_dedes/me.m09.d07:alt1.meVE.SticBoth.mode	@ltx/en_us_dedes/miscellanea:misc.Mode6
ltx/en_us_dedes/me.m09.d07:alt1.meVE.SticBoth.text	@ltx/en_us_dedes/me.m09.d08:meVE.Stichera01.text
ltx/en_us_dedes/me.m09.d07:alt1.meVE.SticGlory.incipit	…
ltx/en_us_dedes/me.m09.d07:alt1.meVE.SticGlory.melody	
ltx/en_us_dedes/me.m09.d07:alt1.meVE.SticGlory.mode	@ltx/en_us_dedes/miscellanea:misc.Mode6
ltx/en_us_dedes/me.m09.d07:alt1.meVE.SticGlory.text	
ltx/en_us_dedes/me.m09.d07:alt1.meVE.Stichera01.greekmelody	@ltx/en_us_dedes/he.a.m1:heAU.TonOuranionTagmaton.greekname
ltx/en_us_dedes/me.m09.d07:alt1.meVE.Stichera01.incipit	…
ltx/en_us_dedes/me.m09.d07:alt1.meVE.Stichera01.melody	@ltx/en_us_dedes/he.a.m1:heAU.TonOuranionTagmaton.name
ltx/en_us_dedes/me.m09.d07:alt1.meVE.Stichera01.mode	@ltx/en_us_dedes/miscellanea:misc.Mode1
ltx/en_us_dedes/me.m09.d07:alt1.meVE.Stichera01.text	
ltx/en_us_dedes/me.m09.d07:alt1.meVE.Stichera02.incipit	…
ltx/en_us_dedes/me.m09.d07:alt1.meVE.Stichera02.melody	@ltx/en_us_dedes/he.a.m1:heAU.TonOuranionTagmaton.name
ltx/en_us_dedes/me.m09.d07:alt1.meVE.Stichera02.mode	@ltx/en_us_dedes/miscellanea:misc.Mode1
ltx/en_us_dedes/me.m09.d07:alt1.meVE.Stichera02.text	
ltx/en_us_dedes/me.m09.d07:alt1.meVE.Stichera03.incipit	…
ltx/en_us_dedes/me.m09.d07:alt1.meVE.Stichera03.melody	@ltx/en_us_dedes/he.a.m1:heAU.TonOuranionTagmaton.name
ltx/en_us_dedes/me.m09.d07:alt1.meVE.Stichera03.mode	@ltx/en_us_dedes/miscellanea:misc.Mode1
ltx/en_us_dedes/me.m09.d07:alt1.meVE.Stichera03.text	
ltx/en_us_dedes/me.m09.d07:alt1.meVE.Stichera04.greekmelody	@ltx/en_us_dedes/he.a.m1:heAU.TonOuranionTagmaton.greekname
ltx/en_us_dedes/me.m09.d07:alt1.meVE.Stichera04.incipit	…
ltx/en_us_dedes/me.m09.d07:alt1.meVE.Stichera04.melody	@ltx/en_us_dedes/he.a.m1:heAU.TonOuranionTagmaton.name
ltx/en_us_dedes/me.m09.d07:alt1.meVE.Stichera04.mode	@ltx/en_us_dedes/miscellanea:misc.Mode1
ltx/en_us_dedes/me.m09.d07:alt1.meVE.Stichera04.text	
ltx/en_us_dedes/me.m09.d07:alt1.meVE.Stichera05.greekmelody	@ltx/en_us_dedes/he.a.m1:heAU.TonOuranionTagmaton.greekname
ltx/en_us_dedes/me.m09.d07:alt1.meVE.Stichera05.incipit	…
ltx/en_us_dedes/me.m09.d07:alt1.meVE.Stichera05.melody	@ltx/en_us_dedes/he.a.m1:heAU.TonOuranionTagmaton.name
ltx/en_us_dedes/me.m09.d07:alt1.meVE.Stichera05.mode	@ltx/en_us_dedes/miscellanea:misc.Mode1
ltx/en_us_dedes/me.m09.d07:alt1.meVE.Stichera05.text	
ltx/en_us_dedes/me.m09.d07:alt1.meVE.Stichera06.incipit	…
ltx/en_us_dedes/me.m09.d07:alt1.meVE.Stichera06.melody	@ltx/en_us_dedes/he.a.m1:heAU.TonOuranionTagmaton.name
ltx/en_us_dedes/me.m09.d07:alt1.meVE.Stichera06.mode	@ltx/en_us_dedes/miscellanea:misc.Mode1
ltx/en_us_dedes/me.m09.d07:alt1.meVE.Stichera06.text	
ltx/en_us_dedes/me.m09.d07:meDA.commemoration.first	Forefeast of the Nativity of the Most Holy Theotokos
ltx/en_us_dedes/me.m09.d07:meDA.commemoration.first_name	
ltx/en_us_dedes/me.m09.d07:meDA.commemoration.first_short	Forefeast of the Nativity of the Most Holy Theotokos
ltx/en_us_dedes/me.m09.d07:meDA.commemoration.first_title	@ltx/en_us_dedes/titles:ti.Theotokos
ltx/en_us_dedes/me.m09.d07:meDA.commemoration.full	Forefeast of the Nativity of the Most Holy Theotokos; and Memory of the Holy Martyr Sozon.
ltx/en_us_dedes/me.m09.d07:meDA.commemoration.second_name	
ltx/en_us_dedes/me.m09.d07:meDA.commemoration.second_short	Memory of the Holy Martyr Sozon
ltx/en_us_dedes/me.m09.d07:meDA.commemoration.second_title	@ltx/en_us_dedes/titles:ti.SaintM
ltx/en_us_dedes/me.m09.d07:meDA.date	September 7
ltx/en_us_dedes/me.m09.d07:meDA.fordate	for September 7
ltx/en_us_dedes/me.m09.d07:meDA.insert1	
ltx/en_us_dedes/me.m09.d07:meDA.insert2	
ltx/en_us_dedes/me.m09.d07:meDA.note	
ltx/en_us_dedes/me.m09.d07:meDA.pdfcoverdate	September 7,
ltx/en_us_dedes/me.m09.d07:meDA.pdfheaderdate	September 7
ltx/en_us_dedes/me.m09.d07:meHO.commemorations	
ltx/en_us_dedes/me.m09.d07:meHO.note1	
ltx/en_us_dedes/me.m09.d07:meHO.note2	
ltx/en_us_dedes/me.m09.d07:meHO.number	
ltx/en_us_dedes/me.m09.d07:meHO.rank	
ltx/en_us_dedes/me.m09.d07:meLE.commemoration1	The Holy Martyr Sozon.
ltx/en_us_dedes/me.m09.d07:meLE.commemoration2	
ltx/en_us_dedes/me.m09.d07:meLI.Kontakion1.greekmelody	@ltx/en_us_dedes/me.m09.d07:meMA.Kontakion1.greekmelody
ltx/en_us_dedes/me.m09.d07:meLI.Kontakion1.incipit	@ltx/en_us_dedes/me.m09.d07:meMA.Kontakion1.incipit
ltx/en_us_dedes/me.m09.d07:meLI.Kontakion1.melody	@ltx/en_us_dedes/me.m09.d07:meMA.Kontakion1.melody
ltx/en_us_dedes/me.m09.d07:meLI.Kontakion1.mode	@ltx/en_us_dedes/me.m09.d07:meMA.Kontakion1.mode
ltx/en_us_dedes/me.m09.d07:meLI.Kontakion1.text	@ltx/en_us_dedes/me.m09.d07:meMA.Kontakion1.text
ltx/en_us_dedes/me.m09.d07:meLI.MM.CommunionHymn.text	@ltx/en_us_dedes/properties:media.key
ltx/en_us_dedes/me.m09.d07:meLI.Megalynarion.text	
ltx/en_us_dedes/me.m09.d07:meLI.Megalynarion2.text	
ltx/en_us_dedes/me.m09.d07:meMA.AposGlory.incipit	She who was destined to…
ltx/en_us_dedes/me.m09.d07:meMA.AposGlory.melody	
ltx/en_us_dedes/me.m09.d07:meMA.AposGlory.mode	@ltx/en_us_dedes/miscellanea:misc.Mode2
ltx/en_us_dedes/me.m09.d07:meMA.AposGlory.text	She who was destined to become the Queen of all, the dwelling place of God, and the divine shrine of the eternal essence, has come forth today from the womb of Anna, who is delighted. Voracious Hades has been trampled through her; and Eve and her whole race are given entrance to life, safe and secure. Let us worthily sing to her, “Blessed are you among women, and blessed is the fruit of your womb!”
ltx/en_us_dedes/me.m09.d07:meMA.Aposticha1.greekmelody	@ltx/en_us_dedes/he.a.m2:heAU.OikosTouEfratha.greekname
ltx/en_us_dedes/me.m09.d07:meMA.Aposticha1.incipit	Children of Adam, come, *…
ltx/en_us_dedes/me.m09.d07:meMA.Aposticha1.melody	@ltx/en_us_dedes/he.a.m2:heAU.OikosTouEfratha.name
ltx/en_us_dedes/me.m09.d07:meMA.Aposticha1.mode	@ltx/en_us_dedes/miscellanea:misc.Mode2
ltx/en_us_dedes/me.m09.d07:meMA.Aposticha1.text	Children of Adam, come, * with hymns let us extol now * the all-pure Virgin Mary, * the descendant of David and Mother of the Savior Christ.
ltx/en_us_dedes/me.m09.d07:meMA.Aposticha2.incipit	Let us present our praise…
ltx/en_us_dedes/me.m09.d07:meMA.Aposticha2.melody	@ltx/en_us_dedes/he.a.m2:heAU.OikosTouEfratha.name
ltx/en_us_dedes/me.m09.d07:meMA.Aposticha2.mode	@ltx/en_us_dedes/miscellanea:misc.Mode2
ltx/en_us_dedes/me.m09.d07:meMA.Aposticha2.text	Let us present our praise * unto our Lord Redeemer, * who from a barren woman * gave us the Theotokos, the only ever-virgin Maid.
ltx/en_us_dedes/me.m09.d07:meMA.Aposticha3.incipit	She who will be the…
ltx/en_us_dedes/me.m09.d07:meMA.Aposticha3.melody	@ltx/en_us_dedes/he.a.m2:heAU.OikosTouEfratha.name
ltx/en_us_dedes/me.m09.d07:meMA.Aposticha3.mode	@ltx/en_us_dedes/miscellanea:misc.Mode2
ltx/en_us_dedes/me.m09.d07:meMA.Aposticha3.text	She who will be the Joy * of all the world, the Mother * of Christ my Lord and Savior, * is from a barren mother miraculously born today.
ltx/en_us_dedes/me.m09.d07:meMA.C1.acrostic.notice1	
ltx/en_us_dedes/me.m09.d07:meMA.C1.acrostic.text	
ltx/en_us_dedes/me.m09.d07:meMA.C1.acrostic.title	
ltx/en_us_dedes/me.m09.d07:meMA.C1.title	@ltx/en_us_dedes/titles:ti.CanonForefeast
ltx/en_us_dedes/me.m09.d07:meMA.C1.verse	@ltx/en_us_dedes/prayers:pr.verse_Theotokos.text
ltx/en_us_dedes/me.m09.d07:meMA.C2.poet	@ltx/en_us_dedes/poets:po.Theofanous
ltx/en_us_dedes/me.m09.d07:meMA.C2.title	@ltx/en_us_dedes/titles:ti.CanonSaintM
ltx/en_us_dedes/me.m09.d07:meMA.C2.verse	@ltx/en_us_dedes/prayers:pr.verse_SaintM.text
ltx/en_us_dedes/me.m09.d07:meMA.ExapTheotokion.incipit	O all creation, leap for…
ltx/en_us_dedes/me.m09.d07:meMA.ExapTheotokion.melody	@ltx/en_us_dedes/he.a.m2:heAU.ToisMathitaisSynelthomen.name
ltx/en_us_dedes/me.m09.d07:meMA.ExapTheotokion.mode	@ltx/en_us_dedes/miscellanea:misc.Mode2
ltx/en_us_dedes/me.m09.d07:meMA.ExapTheotokion.text	O all creation, leap for joy * and exult with rejoicing. * For from the Godly-minded Anne, * whose name means Grace, and from Joachim her most Godly husband * born is the all-pure Mary, * thereby exceeding all their hopes. * She is the Theotokos, whose blessed Fruit * has become salvation for all of mankind, * Christ our God, who ineffably * from her became incarnate.
ltx/en_us_dedes/me.m09.d07:meMA.Exaposteilarion1.greekmelody	@ltx/en_us_dedes/he.a.m2:heAU.GynaikesAkoutisthite.greekname
ltx/en_us_dedes/me.m09.d07:meMA.Exaposteilarion1.incipit	Your Martyr wore Your precious…
ltx/en_us_dedes/me.m09.d07:meMA.Exaposteilarion1.melody	@ltx/en_us_dedes/he.a.m2:heAU.GynaikesAkoutisthite.name
ltx/en_us_dedes/me.m09.d07:meMA.Exaposteilarion1.mode	@ltx/en_us_dedes/miscellanea:misc.Mode2
ltx/en_us_dedes/me.m09.d07:meMA.Exaposteilarion1.text	Your Martyr wore Your precious cross * upon his chest and thus was armed * for battle against the hostile * opponents, O Christ the Logos; * and he prevailed triumphantly, * embarrassing the tyrants all. * And now he reigns unceasingly * with You the King of all ages, * for whose sake he had competed.
ltx/en_us_dedes/me.m09.d07:meMA.Kathisma11.greekmelody	@ltx/en_us_dedes/he.a.m1:heAU.TouLithouSfragisthentos.greekname
ltx/en_us_dedes/me.m09.d07:meMA.Kathisma11.incipit	Being born paradoxically from a…
ltx/en_us_dedes/me.m09.d07:meMA.Kathisma11.melody	@ltx/en_us_dedes/he.a.m1:heAU.TouLithouSfragisthentos.name
ltx/en_us_dedes/me.m09.d07:meMA.Kathisma11.mode	@ltx/en_us_dedes/miscellanea:misc.Mode1
ltx/en_us_dedes/me.m09.d07:meMA.Kathisma11.text	Being born paradoxically from a barren mother, * you gave birth supernaturally from your virginal body. * You appeared as a beautiful branch, you produced life for the world. * And therefore the powers of heaven cried to You, O Theotokos. * Glory to your birth today, O Chaste One; * glory to your virginity; * glory to your childbirth, only Immaculate One.
ltx/en_us_dedes/me.m09.d07:meMA.Kathisma21.greekmelody	@ltx/en_us_dedes/he.a.m5:heAU.TonSynanarchonLogon.greekname
ltx/en_us_dedes/me.m09.d07:meMA.Kathisma21.incipit	All the Angels in heaven…
ltx/en_us_dedes/me.m09.d07:meMA.Kathisma21.melody	@ltx/en_us_dedes/he.a.m5:heAU.TonSynanarchonLogon.name
ltx/en_us_dedes/me.m09.d07:meMA.Kathisma21.mode	@ltx/en_us_dedes/miscellanea:misc.Mode5
ltx/en_us_dedes/me.m09.d07:meMA.Kathisma21.text	All the Angels in heaven are exultant today; * and humanity joins them on earth and celebrates. * And the Prophets from of old rejoice mystically; * because the one whom they foresaw in ancient times symbolically * as a bush, jar and rod, * and as a cloud, gate and throne * and great mountain is born today.
ltx/en_us_dedes/me.m09.d07:meMA.Kontakion1.greekmelody	@ltx/en_us_dedes/he.a.m3:heAU.IParthenosSimeron.greekname
ltx/en_us_dedes/me.m09.d07:meMA.Kontakion1.incipit	On this day the virgin…
ltx/en_us_dedes/me.m09.d07:meMA.Kontakion1.melody	@ltx/en_us_dedes/he.a.m3:heAU.IParthenosSimeron.name
ltx/en_us_dedes/me.m09.d07:meMA.Kontakion1.mode	@ltx/en_us_dedes/miscellanea:misc.Mode3
ltx/en_us_dedes/me.m09.d07:meMA.Kontakion1.text	On this day the virgin Maid, Mary the true Theotokos, * the inviolate bridal room of the heavenly Bridegroom, * by the will of God is born of a barren woman, * to prepare to be the carriage of God the Logos, * as for this she had been destined, * to be the gateway of God and Mother of Life.
ltx/en_us_dedes/me.m09.d07:meMA.MM.Apos1123as5678.text	@ltx/en_us_dedes/properties:media.key
ltx/en_us_dedes/me.m09.d07:meMA.Ode1C11.greekmelody	@ltx/en_us_dedes/he.h.m4:heHE.AnoixoToStomaMou.greekname
ltx/en_us_dedes/me.m09.d07:meMA.Ode1C11.incipit	…
ltx/en_us_dedes/me.m09.d07:meMA.Ode1C11.melody	@ltx/en_us_dedes/he.h.m4:heHE.AnoixoToStomaMou.name
ltx/en_us_dedes/me.m09.d07:meMA.Ode1C11.mode	@ltx/en_us_dedes/miscellanea:misc.Mode4
ltx/en_us_dedes/me.m09.d07:meMA.Ode1C11.ode	@ltx/en_us_dedes/miscellanea:misc.Ode1
ltx/en_us_dedes/me.m09.d07:meMA.Ode1C11.text	
ltx/en_us_dedes/me.m09.d07:meMA.Ode1C12.incipit	…
ltx/en_us_dedes/me.m09.d07:meMA.Ode1C12.melody	@ltx/en_us_dedes/he.h.m4:heHE.AnoixoToStomaMou.name
ltx/en_us_dedes/me.m09.d07:meMA.Ode1C12.mode	@ltx/en_us_dedes/miscellanea:misc.Mode4
ltx/en_us_dedes/me.m09.d07:meMA.Ode1C12.ode	@ltx/en_us_dedes/miscellanea:misc.Ode1
ltx/en_us_dedes/me.m09.d07:meMA.Ode1C12.text	
ltx/en_us_dedes/me.m09.d07:meMA.Ode1C13.incipit	…
ltx/en_us_dedes/me.m09.d07:meMA.Ode1C13.melody	@ltx/en_us_dedes/he.h.m4:heHE.AnoixoToStomaMou.name
ltx/en_us_dedes/me.m09.d07:meMA.Ode1C13.mode	@ltx/en_us_dedes/miscellanea:misc.Mode4
ltx/en_us_dedes/me.m09.d07:meMA.Ode1C13.ode	@ltx/en_us_dedes/miscellanea:misc.Ode1
ltx/en_us_dedes/me.m09.d07:meMA.Ode1C13.text	
ltx/en_us_dedes/me.m09.d07:meMA.Ode1C14.incipit	…
ltx/en_us_dedes/me.m09.d07:meMA.Ode1C14.melody	@ltx/en_us_dedes/he.h.m4:heHE.AnoixoToStomaMou.name
ltx/en_us_dedes/me.m09.d07:meMA.Ode1C14.mode	@ltx/en_us_dedes/miscellanea:misc.Mode4
ltx/en_us_dedes/me.m09.d07:meMA.Ode1C14.ode	@ltx/en_us_dedes/miscellanea:misc.Ode1
ltx/en_us_dedes/me.m09.d07:meMA.Ode1C14.text	
ltx/en_us_dedes/me.m09.d07:meMA.Ode1C21.greekmelody	@ltx/en_us_dedes/he.h.m4:heHE.ThalassisToErythraion.greekname
ltx/en_us_dedes/me.m09.d07:meMA.Ode1C21.incipit	…
ltx/en_us_dedes/me.m09.d07:meMA.Ode1C21.melody	@ltx/en_us_dedes/he.h.m4:heHE.ThalassisToErythraion.name
ltx/en_us_dedes/me.m09.d07:meMA.Ode1C21.mode	@ltx/en_us_dedes/miscellanea:misc.Mode4
ltx/en_us_dedes/me.m09.d07:meMA.Ode1C21.ode	@ltx/en_us_dedes/miscellanea:misc.Ode1
ltx/en_us_dedes/me.m09.d07:meMA.Ode1C21.text	
ltx/en_us_dedes/me.m09.d07:meMA.Ode1C22.incipit	…
ltx/en_us_dedes/me.m09.d07:meMA.Ode1C22.melody	@ltx/en_us_dedes/he.h.m4:heHE.ThalassisToErythraion.name
ltx/en_us_dedes/me.m09.d07:meMA.Ode1C22.mode	@ltx/en_us_dedes/miscellanea:misc.Mode4
ltx/en_us_dedes/me.m09.d07:meMA.Ode1C22.ode	@ltx/en_us_dedes/miscellanea:misc.Ode1
ltx/en_us_dedes/me.m09.d07:meMA.Ode1C22.text	
ltx/en_us_dedes/me.m09.d07:meMA.Ode1C23.incipit	…
ltx/en_us_dedes/me.m09.d07:meMA.Ode1C23.melody	@ltx/en_us_dedes/he.h.m4:heHE.ThalassisToErythraion.name
ltx/en_us_dedes/me.m09.d07:meMA.Ode1C23.mode	@ltx/en_us_dedes/miscellanea:misc.Mode4
ltx/en_us_dedes/me.m09.d07:meMA.Ode1C23.ode	@ltx/en_us_dedes/miscellanea:misc.Ode1
ltx/en_us_dedes/me.m09.d07:meMA.Ode1C23.text	
ltx/en_us_dedes/me.m09.d07:meMA.Ode1C2T.incipit	…
ltx/en_us_dedes/me.m09.d07:meMA.Ode1C2T.melody	@ltx/en_us_dedes/he.h.m4:heHE.ThalassisToErythraion.name
ltx/en_us_dedes/me.m09.d07:meMA.Ode1C2T.mode	@ltx/en_us_dedes/miscellanea:misc.Mode4
ltx/en_us_dedes/me.m09.d07:meMA.Ode1C2T.ode	@ltx/en_us_dedes/miscellanea:misc.Ode1
ltx/en_us_dedes/me.m09.d07:meMA.Ode1C2T.text	
ltx/en_us_dedes/me.m09.d07:meMA.Ode3C11.greekmelody	@ltx/en_us_dedes/he.h.m4:heHE.OtiSteiraEteken.greekname
ltx/en_us_dedes/me.m09.d07:meMA.Ode3C11.incipit	From fruitless earth is born…
ltx/en_us_dedes/me.m09.d07:meMA.Ode3C11.melody	@ltx/en_us_dedes/he.h.m4:heHE.OtiSteiraEteken.notmetered
ltx/en_us_dedes/me.m09.d07:meMA.Ode3C11.mode	@ltx/en_us_dedes/miscellanea:misc.Mode4
ltx/en_us_dedes/me.m09.d07:meMA.Ode3C11.ode	@ltx/en_us_dedes/miscellanea:misc.Ode3
ltx/en_us_dedes/me.m09.d07:meMA.Ode3C11.text	From fruitless earth is born the very fruitful earth, which will produce the Farmer of blessings, the vivifying ear of grain that feeds all by the command of God.
ltx/en_us_dedes/me.m09.d07:meMA.Ode3C12.incipit	The rod of virginity has…
ltx/en_us_dedes/me.m09.d07:meMA.Ode3C12.melody	@ltx/en_us_dedes/he.h.m4:heHE.OtiSteiraEteken.notmetered
ltx/en_us_dedes/me.m09.d07:meMA.Ode3C12.mode	@ltx/en_us_dedes/miscellanea:misc.Mode4
ltx/en_us_dedes/me.m09.d07:meMA.Ode3C12.ode	@ltx/en_us_dedes/miscellanea:misc.Ode3
ltx/en_us_dedes/me.m09.d07:meMA.Ode3C12.text	The rod of virginity has blossomed forth today, and from it will bloom a flower, namely our God and Planter, who in supreme benevolence cuts down the outgrowths of evil.
ltx/en_us_dedes/me.m09.d07:meMA.Ode3C13.incipit	Behold, born from a childless…
ltx/en_us_dedes/me.m09.d07:meMA.Ode3C13.melody	@ltx/en_us_dedes/he.h.m4:heHE.OtiSteiraEteken.notmetered
ltx/en_us_dedes/me.m09.d07:meMA.Ode3C13.mode	@ltx/en_us_dedes/miscellanea:misc.Mode4
ltx/en_us_dedes/me.m09.d07:meMA.Ode3C13.ode	@ltx/en_us_dedes/miscellanea:misc.Ode3
ltx/en_us_dedes/me.m09.d07:meMA.Ode3C13.text	Behold, born from a childless rock is the unquarried mountain, which will produce the spiritual Stone, who will crush all the idols of the evil one.
ltx/en_us_dedes/me.m09.d07:meMA.Ode3C14.incipit	O Virgin, the writings in…
ltx/en_us_dedes/me.m09.d07:meMA.Ode3C14.melody	@ltx/en_us_dedes/he.h.m4:heHE.OtiSteiraEteken.notmetered
ltx/en_us_dedes/me.m09.d07:meMA.Ode3C14.mode	@ltx/en_us_dedes/miscellanea:misc.Mode4
ltx/en_us_dedes/me.m09.d07:meMA.Ode3C14.ode	@ltx/en_us_dedes/miscellanea:misc.Ode3
ltx/en_us_dedes/me.m09.d07:meMA.Ode3C14.text	O Virgin, the writings in the Law predicted you. You carry in your womb the Giver of the Law, without the laws of nature, and He ineffably preserved you unharmed and undefiled.
ltx/en_us_dedes/me.m09.d07:meMA.Ode3C21.greekmelody	@ltx/en_us_dedes/he.h.m4:heHE.EffrainetaiEpiSoi.greekname
ltx/en_us_dedes/me.m09.d07:meMA.Ode3C21.incipit	…
ltx/en_us_dedes/me.m09.d07:meMA.Ode3C21.melody	@ltx/en_us_dedes/he.h.m4:heHE.EffrainetaiEpiSoi.name
ltx/en_us_dedes/me.m09.d07:meMA.Ode3C21.mode	@ltx/en_us_dedes/miscellanea:misc.Mode4
ltx/en_us_dedes/me.m09.d07:meMA.Ode3C21.ode	@ltx/en_us_dedes/miscellanea:misc.Ode3
ltx/en_us_dedes/me.m09.d07:meMA.Ode3C21.text	
ltx/en_us_dedes/me.m09.d07:meMA.Ode3C22.incipit	…
ltx/en_us_dedes/me.m09.d07:meMA.Ode3C22.melody	@ltx/en_us_dedes/he.h.m4:heHE.EffrainetaiEpiSoi.name
ltx/en_us_dedes/me.m09.d07:meMA.Ode3C22.mode	@ltx/en_us_dedes/miscellanea:misc.Mode4
ltx/en_us_dedes/me.m09.d07:meMA.Ode3C22.ode	@ltx/en_us_dedes/miscellanea:misc.Ode3
ltx/en_us_dedes/me.m09.d07:meMA.Ode3C22.text	
ltx/en_us_dedes/me.m09.d07:meMA.Ode3C23.incipit	…
ltx/en_us_dedes/me.m09.d07:meMA.Ode3C23.melody	@ltx/en_us_dedes/he.h.m4:heHE.EffrainetaiEpiSoi.name
ltx/en_us_dedes/me.m09.d07:meMA.Ode3C23.mode	@ltx/en_us_dedes/miscellanea:misc.Mode4
ltx/en_us_dedes/me.m09.d07:meMA.Ode3C23.ode	@ltx/en_us_dedes/miscellanea:misc.Ode3
ltx/en_us_dedes/me.m09.d07:meMA.Ode3C23.text	
ltx/en_us_dedes/me.m09.d07:meMA.Ode3C2T.incipit	…
ltx/en_us_dedes/me.m09.d07:meMA.Ode3C2T.melody	@ltx/en_us_dedes/he.h.m4:heHE.EffrainetaiEpiSoi.name
ltx/en_us_dedes/me.m09.d07:meMA.Ode3C2T.mode	@ltx/en_us_dedes/miscellanea:misc.Mode4
ltx/en_us_dedes/me.m09.d07:meMA.Ode3C2T.ode	@ltx/en_us_dedes/miscellanea:misc.Ode3
ltx/en_us_dedes/me.m09.d07:meMA.Ode3C2T.text	
ltx/en_us_dedes/me.m09.d07:meMA.Ode3H.greekmelody	@ltx/en_us_dedes/he.h.m4:heHE.EffrainetaiEpiSoi.greekname
ltx/en_us_dedes/me.m09.d07:meMA.Ode3H.incipit	@ltx/en_us_dedes/he.h.m4:heHE.EffrainetaiEpiSoi.incipit
ltx/en_us_dedes/me.m09.d07:meMA.Ode3H.melody	@ltx/en_us_dedes/he.h.m4:heHE.EffrainetaiEpiSoi.melody
ltx/en_us_dedes/me.m09.d07:meMA.Ode3H.mode	@ltx/en_us_dedes/miscellanea:misc.Mode4
ltx/en_us_dedes/me.m09.d07:meMA.Ode3H.ode	@ltx/en_us_dedes/miscellanea:misc.Ode3
ltx/en_us_dedes/me.m09.d07:meMA.Ode3H.text	@ltx/en_us_dedes/he.h.m4:heHE.EffrainetaiEpiSoi.text
ltx/en_us_dedes/me.m09.d07:meMA.Ode3Kathisma1.greekmelody	@ltx/en_us_dedes/he.a.m4:heAU.TachyProkatalave.greekname
ltx/en_us_dedes/me.m09.d07:meMA.Ode3Kathisma1.incipit	…
ltx/en_us_dedes/me.m09.d07:meMA.Ode3Kathisma1.melody	@ltx/en_us_dedes/he.a.m4:heAU.TachyProkatalave.name
ltx/en_us_dedes/me.m09.d07:meMA.Ode3Kathisma1.mode	@ltx/en_us_dedes/miscellanea:misc.Mode4
ltx/en_us_dedes/me.m09.d07:meMA.Ode3Kathisma1.text	
ltx/en_us_dedes/me.m09.d07:meMA.Ode3Kathisma2.greekmelody	@ltx/en_us_dedes/he.a.m8:heAU.ToProstachthen.greekname
ltx/en_us_dedes/me.m09.d07:meMA.Ode3Kathisma2.incipit	…
ltx/en_us_dedes/me.m09.d07:meMA.Ode3Kathisma2.melody	@ltx/en_us_dedes/he.a.m8:heAU.ToProstachthen.name
ltx/en_us_dedes/me.m09.d07:meMA.Ode3Kathisma2.mode	@ltx/en_us_dedes/miscellanea:misc.Mode8
ltx/en_us_dedes/me.m09.d07:meMA.Ode3Kathisma2.text	
ltx/en_us_dedes/me.m09.d07:meMA.Ode4C11.greekmelody	@ltx/en_us_dedes/he.h.m4:heHE.OKathimenosEnDoxi.greekname
ltx/en_us_dedes/me.m09.d07:meMA.Ode4C11.incipit	…
ltx/en_us_dedes/me.m09.d07:meMA.Ode4C11.melody	@ltx/en_us_dedes/he.h.m4:heHE.OKathimenosEnDoxi.name
ltx/en_us_dedes/me.m09.d07:meMA.Ode4C11.mode	@ltx/en_us_dedes/miscellanea:misc.Mode4
ltx/en_us_dedes/me.m09.d07:meMA.Ode4C11.ode	@ltx/en_us_dedes/miscellanea:misc.Ode4
ltx/en_us_dedes/me.m09.d07:meMA.Ode4C11.text	
ltx/en_us_dedes/me.m09.d07:meMA.Ode4C12.incipit	…
ltx/en_us_dedes/me.m09.d07:meMA.Ode4C12.melody	@ltx/en_us_dedes/he.h.m4:heHE.OKathimenosEnDoxi.name
ltx/en_us_dedes/me.m09.d07:meMA.Ode4C12.mode	@ltx/en_us_dedes/miscellanea:misc.Mode4
ltx/en_us_dedes/me.m09.d07:meMA.Ode4C12.ode	@ltx/en_us_dedes/miscellanea:misc.Ode4
ltx/en_us_dedes/me.m09.d07:meMA.Ode4C12.text	
ltx/en_us_dedes/me.m09.d07:meMA.Ode4C13.incipit	…
ltx/en_us_dedes/me.m09.d07:meMA.Ode4C13.melody	@ltx/en_us_dedes/he.h.m4:heHE.OKathimenosEnDoxi.name
ltx/en_us_dedes/me.m09.d07:meMA.Ode4C13.mode	@ltx/en_us_dedes/miscellanea:misc.Mode4
ltx/en_us_dedes/me.m09.d07:meMA.Ode4C13.ode	@ltx/en_us_dedes/miscellanea:misc.Ode4
ltx/en_us_dedes/me.m09.d07:meMA.Ode4C13.text	
ltx/en_us_dedes/me.m09.d07:meMA.Ode4C14.incipit	…
ltx/en_us_dedes/me.m09.d07:meMA.Ode4C14.melody	@ltx/en_us_dedes/he.h.m4:heHE.OKathimenosEnDoxi.name
ltx/en_us_dedes/me.m09.d07:meMA.Ode4C14.mode	@ltx/en_us_dedes/miscellanea:misc.Mode4
ltx/en_us_dedes/me.m09.d07:meMA.Ode4C14.ode	@ltx/en_us_dedes/miscellanea:misc.Ode4
ltx/en_us_dedes/me.m09.d07:meMA.Ode4C14.text	
ltx/en_us_dedes/me.m09.d07:meMA.Ode4C21.greekmelody	@ltx/en_us_dedes/he.h.m4:heHE.EparthentaSeIdousa.greekname
ltx/en_us_dedes/me.m09.d07:meMA.Ode4C21.incipit	…
ltx/en_us_dedes/me.m09.d07:meMA.Ode4C21.melody	@ltx/en_us_dedes/he.h.m4:heHE.EparthentaSeIdousa.name
ltx/en_us_dedes/me.m09.d07:meMA.Ode4C21.mode	@ltx/en_us_dedes/miscellanea:misc.Mode4
ltx/en_us_dedes/me.m09.d07:meMA.Ode4C21.ode	@ltx/en_us_dedes/miscellanea:misc.Ode4
ltx/en_us_dedes/me.m09.d07:meMA.Ode4C21.text	
ltx/en_us_dedes/me.m09.d07:meMA.Ode4C22.incipit	…
ltx/en_us_dedes/me.m09.d07:meMA.Ode4C22.melody	@ltx/en_us_dedes/he.h.m4:heHE.EparthentaSeIdousa.name
ltx/en_us_dedes/me.m09.d07:meMA.Ode4C22.mode	@ltx/en_us_dedes/miscellanea:misc.Mode4
ltx/en_us_dedes/me.m09.d07:meMA.Ode4C22.ode	@ltx/en_us_dedes/miscellanea:misc.Ode4
ltx/en_us_dedes/me.m09.d07:meMA.Ode4C22.text	
ltx/en_us_dedes/me.m09.d07:meMA.Ode4C23.incipit	…
ltx/en_us_dedes/me.m09.d07:meMA.Ode4C23.melody	@ltx/en_us_dedes/he.h.m4:heHE.EparthentaSeIdousa.name
ltx/en_us_dedes/me.m09.d07:meMA.Ode4C23.mode	@ltx/en_us_dedes/miscellanea:misc.Mode4
ltx/en_us_dedes/me.m09.d07:meMA.Ode4C23.ode	@ltx/en_us_dedes/miscellanea:misc.Ode4
ltx/en_us_dedes/me.m09.d07:meMA.Ode4C23.text	
ltx/en_us_dedes/me.m09.d07:meMA.Ode4C2T.incipit	…
ltx/en_us_dedes/me.m09.d07:meMA.Ode4C2T.melody	@ltx/en_us_dedes/he.h.m4:heHE.EparthentaSeIdousa.name
ltx/en_us_dedes/me.m09.d07:meMA.Ode4C2T.mode	@ltx/en_us_dedes/miscellanea:misc.Mode4
ltx/en_us_dedes/me.m09.d07:meMA.Ode4C2T.ode	@ltx/en_us_dedes/miscellanea:misc.Ode4
ltx/en_us_dedes/me.m09.d07:meMA.Ode4C2T.text	
ltx/en_us_dedes/me.m09.d07:meMA.Ode5C11.greekmelody	@ltx/en_us_dedes/he.h.m4:heHE.ExestiTaSympanta.greekname
ltx/en_us_dedes/me.m09.d07:meMA.Ode5C11.incipit	…
ltx/en_us_dedes/me.m09.d07:meMA.Ode5C11.melody	@ltx/en_us_dedes/he.h.m4:heHE.ExestiTaSympanta.name
ltx/en_us_dedes/me.m09.d07:meMA.Ode5C11.mode	@ltx/en_us_dedes/miscellanea:misc.Mode4
ltx/en_us_dedes/me.m09.d07:meMA.Ode5C11.ode	@ltx/en_us_dedes/miscellanea:misc.Ode5
ltx/en_us_dedes/me.m09.d07:meMA.Ode5C11.text	
ltx/en_us_dedes/me.m09.d07:meMA.Ode5C12.incipit	…
ltx/en_us_dedes/me.m09.d07:meMA.Ode5C12.melody	@ltx/en_us_dedes/he.h.m4:heHE.ExestiTaSympanta.name
ltx/en_us_dedes/me.m09.d07:meMA.Ode5C12.mode	@ltx/en_us_dedes/miscellanea:misc.Mode4
ltx/en_us_dedes/me.m09.d07:meMA.Ode5C12.ode	@ltx/en_us_dedes/miscellanea:misc.Ode5
ltx/en_us_dedes/me.m09.d07:meMA.Ode5C12.text	
ltx/en_us_dedes/me.m09.d07:meMA.Ode5C13.incipit	…
ltx/en_us_dedes/me.m09.d07:meMA.Ode5C13.melody	@ltx/en_us_dedes/he.h.m4:heHE.ExestiTaSympanta.name
ltx/en_us_dedes/me.m09.d07:meMA.Ode5C13.mode	@ltx/en_us_dedes/miscellanea:misc.Mode4
ltx/en_us_dedes/me.m09.d07:meMA.Ode5C13.ode	@ltx/en_us_dedes/miscellanea:misc.Ode5
ltx/en_us_dedes/me.m09.d07:meMA.Ode5C13.text	
ltx/en_us_dedes/me.m09.d07:meMA.Ode5C14.incipit	…
ltx/en_us_dedes/me.m09.d07:meMA.Ode5C14.melody	@ltx/en_us_dedes/he.h.m4:heHE.ExestiTaSympanta.name
ltx/en_us_dedes/me.m09.d07:meMA.Ode5C14.mode	@ltx/en_us_dedes/miscellanea:misc.Mode4
ltx/en_us_dedes/me.m09.d07:meMA.Ode5C14.ode	@ltx/en_us_dedes/miscellanea:misc.Ode5
ltx/en_us_dedes/me.m09.d07:meMA.Ode5C14.text	
ltx/en_us_dedes/me.m09.d07:meMA.Ode5C21.greekmelody	@ltx/en_us_dedes/he.h.m4:heHE.SyKyrieMouFos.greekname
ltx/en_us_dedes/me.m09.d07:meMA.Ode5C21.incipit	…
ltx/en_us_dedes/me.m09.d07:meMA.Ode5C21.melody	@ltx/en_us_dedes/he.h.m4:heHE.SyKyrieMouFos.name
ltx/en_us_dedes/me.m09.d07:meMA.Ode5C21.mode	@ltx/en_us_dedes/miscellanea:misc.Mode4
ltx/en_us_dedes/me.m09.d07:meMA.Ode5C21.ode	@ltx/en_us_dedes/miscellanea:misc.Ode5
ltx/en_us_dedes/me.m09.d07:meMA.Ode5C21.text	
ltx/en_us_dedes/me.m09.d07:meMA.Ode5C22.incipit	…
ltx/en_us_dedes/me.m09.d07:meMA.Ode5C22.melody	@ltx/en_us_dedes/he.h.m4:heHE.SyKyrieMouFos.name
ltx/en_us_dedes/me.m09.d07:meMA.Ode5C22.mode	@ltx/en_us_dedes/miscellanea:misc.Mode4
ltx/en_us_dedes/me.m09.d07:meMA.Ode5C22.ode	@ltx/en_us_dedes/miscellanea:misc.Ode5
ltx/en_us_dedes/me.m09.d07:meMA.Ode5C22.text	
ltx/en_us_dedes/me.m09.d07:meMA.Ode5C23.incipit	…
ltx/en_us_dedes/me.m09.d07:meMA.Ode5C23.melody	@ltx/en_us_dedes/he.h.m4:heHE.SyKyrieMouFos.name
ltx/en_us_dedes/me.m09.d07:meMA.Ode5C23.mode	@ltx/en_us_dedes/miscellanea:misc.Mode4
ltx/en_us_dedes/me.m09.d07:meMA.Ode5C23.ode	@ltx/en_us_dedes/miscellanea:misc.Ode5
ltx/en_us_dedes/me.m09.d07:meMA.Ode5C23.text	
ltx/en_us_dedes/me.m09.d07:meMA.Ode5C2T.incipit	…
ltx/en_us_dedes/me.m09.d07:meMA.Ode5C2T.melody	@ltx/en_us_dedes/he.h.m4:heHE.SyKyrieMouFos.name
ltx/en_us_dedes/me.m09.d07:meMA.Ode5C2T.mode	@ltx/en_us_dedes/miscellanea:misc.Mode4
ltx/en_us_dedes/me.m09.d07:meMA.Ode5C2T.ode	@ltx/en_us_dedes/miscellanea:misc.Ode5
ltx/en_us_dedes/me.m09.d07:meMA.Ode5C2T.text	
ltx/en_us_dedes/me.m09.d07:meMA.Ode6C11.greekmelody	@ltx/en_us_dedes/he.h.m4:heHE.TinTheianTaftin.greekname
ltx/en_us_dedes/me.m09.d07:meMA.Ode6C11.incipit	The Maiden Theotokos was born…
ltx/en_us_dedes/me.m09.d07:meMA.Ode6C11.melody	@ltx/en_us_dedes/he.h.m4:heHE.TinTheianTaftin.notmetered
ltx/en_us_dedes/me.m09.d07:meMA.Ode6C11.mode	@ltx/en_us_dedes/miscellanea:misc.Mode4
ltx/en_us_dedes/me.m09.d07:meMA.Ode6C11.ode	@ltx/en_us_dedes/miscellanea:misc.Ode6
ltx/en_us_dedes/me.m09.d07:meMA.Ode6C11.text	The Maiden Theotokos was born today. She is the bridge that conveys humanity to the light, the ladder to heaven, and the manifest mountain of God. Therefore let us call here blessed.
ltx/en_us_dedes/me.m09.d07:meMA.Ode6C12.incipit	Anna is like a shell-fish…
ltx/en_us_dedes/me.m09.d07:meMA.Ode6C12.melody	@ltx/en_us_dedes/he.h.m4:heHE.TinTheianTaftin.notmetered
ltx/en_us_dedes/me.m09.d07:meMA.Ode6C12.mode	@ltx/en_us_dedes/miscellanea:misc.Mode4
ltx/en_us_dedes/me.m09.d07:meMA.Ode6C12.ode	@ltx/en_us_dedes/miscellanea:misc.Ode6
ltx/en_us_dedes/me.m09.d07:meMA.Ode6C12.text	Anna is like a shell-fish that produces royal purple dye. For Mary’s blood will dye the wool of the incarnation of the King. Let us all extol her worthily.
ltx/en_us_dedes/me.m09.d07:meMA.Ode6C13.incipit	From a small drop has…
ltx/en_us_dedes/me.m09.d07:meMA.Ode6C13.melody	@ltx/en_us_dedes/he.h.m4:heHE.TinTheianTaftin.notmetered
ltx/en_us_dedes/me.m09.d07:meMA.Ode6C13.mode	@ltx/en_us_dedes/miscellanea:misc.Mode4
ltx/en_us_dedes/me.m09.d07:meMA.Ode6C13.ode	@ltx/en_us_dedes/miscellanea:misc.Ode6
ltx/en_us_dedes/me.m09.d07:meMA.Ode6C13.text	From a small drop has now come the well, namely the all-blameless Virgin, who will give birth to the ocean of salvation and put an end to the many streams of paganism.
ltx/en_us_dedes/me.m09.d07:meMA.Ode6C14.incipit	O ever-blessed Maiden and Mother…
ltx/en_us_dedes/me.m09.d07:meMA.Ode6C14.melody	@ltx/en_us_dedes/he.h.m4:heHE.TinTheianTaftin.notmetered
ltx/en_us_dedes/me.m09.d07:meMA.Ode6C14.mode	@ltx/en_us_dedes/miscellanea:misc.Mode4
ltx/en_us_dedes/me.m09.d07:meMA.Ode6C14.ode	@ltx/en_us_dedes/miscellanea:misc.Ode6
ltx/en_us_dedes/me.m09.d07:meMA.Ode6C14.text	O ever-blessed Maiden and Mother of God, you came forth from a fruitless root; and by your own supernatural divine offspring, you uproot the thorns of wickedness.
ltx/en_us_dedes/me.m09.d07:meMA.Ode6C21.greekmelody	@ltx/en_us_dedes/he.h.m4:heHE.ThysoSoiMetaFonis.greekname
ltx/en_us_dedes/me.m09.d07:meMA.Ode6C21.incipit	…
ltx/en_us_dedes/me.m09.d07:meMA.Ode6C21.melody	@ltx/en_us_dedes/he.h.m4:heHE.ThysoSoiMetaFonis.name
ltx/en_us_dedes/me.m09.d07:meMA.Ode6C21.mode	@ltx/en_us_dedes/miscellanea:misc.Mode4
ltx/en_us_dedes/me.m09.d07:meMA.Ode6C21.ode	@ltx/en_us_dedes/miscellanea:misc.Ode6
ltx/en_us_dedes/me.m09.d07:meMA.Ode6C21.text	
ltx/en_us_dedes/me.m09.d07:meMA.Ode6C22.incipit	…
ltx/en_us_dedes/me.m09.d07:meMA.Ode6C22.melody	@ltx/en_us_dedes/he.h.m4:heHE.ThysoSoiMetaFonis.name
ltx/en_us_dedes/me.m09.d07:meMA.Ode6C22.mode	@ltx/en_us_dedes/miscellanea:misc.Mode4
ltx/en_us_dedes/me.m09.d07:meMA.Ode6C22.ode	@ltx/en_us_dedes/miscellanea:misc.Ode6
ltx/en_us_dedes/me.m09.d07:meMA.Ode6C22.text	
ltx/en_us_dedes/me.m09.d07:meMA.Ode6C23.incipit	…
ltx/en_us_dedes/me.m09.d07:meMA.Ode6C23.melody	@ltx/en_us_dedes/he.h.m4:heHE.ThysoSoiMetaFonis.name
ltx/en_us_dedes/me.m09.d07:meMA.Ode6C23.mode	@ltx/en_us_dedes/miscellanea:misc.Mode4
ltx/en_us_dedes/me.m09.d07:meMA.Ode6C23.ode	@ltx/en_us_dedes/miscellanea:misc.Ode6
ltx/en_us_dedes/me.m09.d07:meMA.Ode6C23.text	
ltx/en_us_dedes/me.m09.d07:meMA.Ode6C2T.incipit	…
ltx/en_us_dedes/me.m09.d07:meMA.Ode6C2T.melody	@ltx/en_us_dedes/he.h.m4:heHE.ThysoSoiMetaFonis.name
ltx/en_us_dedes/me.m09.d07:meMA.Ode6C2T.mode	@ltx/en_us_dedes/miscellanea:misc.Mode4
ltx/en_us_dedes/me.m09.d07:meMA.Ode6C2T.ode	@ltx/en_us_dedes/miscellanea:misc.Ode6
ltx/en_us_dedes/me.m09.d07:meMA.Ode6C2T.text	
ltx/en_us_dedes/me.m09.d07:meMA.Ode6H.greekmelody	@ltx/en_us_dedes/he.h.m4:heHE.ThysoSoiMetaFonis.greekname
ltx/en_us_dedes/me.m09.d07:meMA.Ode6H.incipit	@ltx/en_us_dedes/he.h.m4:heHE.ThysoSoiMetaFonis.incipit
ltx/en_us_dedes/me.m09.d07:meMA.Ode6H.melody	@ltx/en_us_dedes/he.h.m4:heHE.ThysoSoiMetaFonis.melody
ltx/en_us_dedes/me.m09.d07:meMA.Ode6H.mode	@ltx/en_us_dedes/miscellanea:misc.Mode4
ltx/en_us_dedes/me.m09.d07:meMA.Ode6H.ode	@ltx/en_us_dedes/miscellanea:misc.Ode6
ltx/en_us_dedes/me.m09.d07:meMA.Ode6H.text	@ltx/en_us_dedes/he.h.m4:heHE.ThysoSoiMetaFonis.text
ltx/en_us_dedes/me.m09.d07:meMA.Ode7C11.greekmelody	@ltx/en_us_dedes/he.h.m4:heHE.OukElatrefsan.greekname
ltx/en_us_dedes/me.m09.d07:meMA.Ode7C11.incipit	…
ltx/en_us_dedes/me.m09.d07:meMA.Ode7C11.melody	@ltx/en_us_dedes/he.h.m4:heHE.OukElatrefsan.name
ltx/en_us_dedes/me.m09.d07:meMA.Ode7C11.mode	@ltx/en_us_dedes/miscellanea:misc.Mode4
ltx/en_us_dedes/me.m09.d07:meMA.Ode7C11.ode	@ltx/en_us_dedes/miscellanea:misc.Ode7
ltx/en_us_dedes/me.m09.d07:meMA.Ode7C11.text	
ltx/en_us_dedes/me.m09.d07:meMA.Ode7C12.incipit	…
ltx/en_us_dedes/me.m09.d07:meMA.Ode7C12.melody	@ltx/en_us_dedes/he.h.m4:heHE.OukElatrefsan.name
ltx/en_us_dedes/me.m09.d07:meMA.Ode7C12.mode	@ltx/en_us_dedes/miscellanea:misc.Mode4
ltx/en_us_dedes/me.m09.d07:meMA.Ode7C12.ode	@ltx/en_us_dedes/miscellanea:misc.Ode7
ltx/en_us_dedes/me.m09.d07:meMA.Ode7C12.text	
ltx/en_us_dedes/me.m09.d07:meMA.Ode7C13.incipit	…
ltx/en_us_dedes/me.m09.d07:meMA.Ode7C13.melody	@ltx/en_us_dedes/he.h.m4:heHE.OukElatrefsan.name
ltx/en_us_dedes/me.m09.d07:meMA.Ode7C13.mode	@ltx/en_us_dedes/miscellanea:misc.Mode4
ltx/en_us_dedes/me.m09.d07:meMA.Ode7C13.ode	@ltx/en_us_dedes/miscellanea:misc.Ode7
ltx/en_us_dedes/me.m09.d07:meMA.Ode7C13.text	
ltx/en_us_dedes/me.m09.d07:meMA.Ode7C14.incipit	…
ltx/en_us_dedes/me.m09.d07:meMA.Ode7C14.melody	@ltx/en_us_dedes/he.h.m4:heHE.OukElatrefsan.name
ltx/en_us_dedes/me.m09.d07:meMA.Ode7C14.mode	@ltx/en_us_dedes/miscellanea:misc.Mode4
ltx/en_us_dedes/me.m09.d07:meMA.Ode7C14.ode	@ltx/en_us_dedes/miscellanea:misc.Ode7
ltx/en_us_dedes/me.m09.d07:meMA.Ode7C14.text	
ltx/en_us_dedes/me.m09.d07:meMA.Ode7C21.greekmelody	@ltx/en_us_dedes/he.h.m4:heHE.EnTiKaminoAvramiaioi.greekname
ltx/en_us_dedes/me.m09.d07:meMA.Ode7C21.incipit	…
ltx/en_us_dedes/me.m09.d07:meMA.Ode7C21.melody	@ltx/en_us_dedes/he.h.m4:heHE.EnTiKaminoAvramiaioi.name
ltx/en_us_dedes/me.m09.d07:meMA.Ode7C21.mode	@ltx/en_us_dedes/miscellanea:misc.Mode4
ltx/en_us_dedes/me.m09.d07:meMA.Ode7C21.ode	@ltx/en_us_dedes/miscellanea:misc.Ode7
ltx/en_us_dedes/me.m09.d07:meMA.Ode7C21.text	
ltx/en_us_dedes/me.m09.d07:meMA.Ode7C22.incipit	…
ltx/en_us_dedes/me.m09.d07:meMA.Ode7C22.melody	@ltx/en_us_dedes/he.h.m4:heHE.EnTiKaminoAvramiaioi.name
ltx/en_us_dedes/me.m09.d07:meMA.Ode7C22.mode	@ltx/en_us_dedes/miscellanea:misc.Mode4
ltx/en_us_dedes/me.m09.d07:meMA.Ode7C22.ode	@ltx/en_us_dedes/miscellanea:misc.Ode7
ltx/en_us_dedes/me.m09.d07:meMA.Ode7C22.text	
ltx/en_us_dedes/me.m09.d07:meMA.Ode7C23.incipit	…
ltx/en_us_dedes/me.m09.d07:meMA.Ode7C23.melody	@ltx/en_us_dedes/he.h.m4:heHE.EnTiKaminoAvramiaioi.name
ltx/en_us_dedes/me.m09.d07:meMA.Ode7C23.mode	@ltx/en_us_dedes/miscellanea:misc.Mode4
ltx/en_us_dedes/me.m09.d07:meMA.Ode7C23.ode	@ltx/en_us_dedes/miscellanea:misc.Ode7
ltx/en_us_dedes/me.m09.d07:meMA.Ode7C23.text	
ltx/en_us_dedes/me.m09.d07:meMA.Ode7C2T.incipit	…
ltx/en_us_dedes/me.m09.d07:meMA.Ode7C2T.melody	@ltx/en_us_dedes/he.h.m4:heHE.EnTiKaminoAvramiaioi.name
ltx/en_us_dedes/me.m09.d07:meMA.Ode7C2T.mode	@ltx/en_us_dedes/miscellanea:misc.Mode4
ltx/en_us_dedes/me.m09.d07:meMA.Ode7C2T.ode	@ltx/en_us_dedes/miscellanea:misc.Ode7
ltx/en_us_dedes/me.m09.d07:meMA.Ode7C2T.text	
ltx/en_us_dedes/me.m09.d07:meMA.Ode8C11.greekmelody	@ltx/en_us_dedes/he.h.m4:heHE.PaidasEvageis.greekname
ltx/en_us_dedes/me.m09.d07:meMA.Ode8C11.incipit	…
ltx/en_us_dedes/me.m09.d07:meMA.Ode8C11.melody	@ltx/en_us_dedes/he.h.m4:heHE.PaidasEvageis.name
ltx/en_us_dedes/me.m09.d07:meMA.Ode8C11.mode	@ltx/en_us_dedes/miscellanea:misc.Mode4
ltx/en_us_dedes/me.m09.d07:meMA.Ode8C11.ode	@ltx/en_us_dedes/miscellanea:misc.Ode8
ltx/en_us_dedes/me.m09.d07:meMA.Ode8C11.text	
ltx/en_us_dedes/me.m09.d07:meMA.Ode8C12.incipit	…
ltx/en_us_dedes/me.m09.d07:meMA.Ode8C12.melody	@ltx/en_us_dedes/he.h.m4:heHE.PaidasEvageis.name
ltx/en_us_dedes/me.m09.d07:meMA.Ode8C12.mode	@ltx/en_us_dedes/miscellanea:misc.Mode4
ltx/en_us_dedes/me.m09.d07:meMA.Ode8C12.ode	@ltx/en_us_dedes/miscellanea:misc.Ode8
ltx/en_us_dedes/me.m09.d07:meMA.Ode8C12.text	
ltx/en_us_dedes/me.m09.d07:meMA.Ode8C13.incipit	…
ltx/en_us_dedes/me.m09.d07:meMA.Ode8C13.melody	@ltx/en_us_dedes/he.h.m4:heHE.PaidasEvageis.name
ltx/en_us_dedes/me.m09.d07:meMA.Ode8C13.mode	@ltx/en_us_dedes/miscellanea:misc.Mode4
ltx/en_us_dedes/me.m09.d07:meMA.Ode8C13.ode	@ltx/en_us_dedes/miscellanea:misc.Ode8
ltx/en_us_dedes/me.m09.d07:meMA.Ode8C13.text	
ltx/en_us_dedes/me.m09.d07:meMA.Ode8C14.incipit	…
ltx/en_us_dedes/me.m09.d07:meMA.Ode8C14.melody	@ltx/en_us_dedes/he.h.m4:heHE.PaidasEvageis.name
ltx/en_us_dedes/me.m09.d07:meMA.Ode8C14.mode	@ltx/en_us_dedes/miscellanea:misc.Mode4
ltx/en_us_dedes/me.m09.d07:meMA.Ode8C14.ode	@ltx/en_us_dedes/miscellanea:misc.Ode8
ltx/en_us_dedes/me.m09.d07:meMA.Ode8C14.text	
ltx/en_us_dedes/me.m09.d07:meMA.Ode8C15.incipit	…
ltx/en_us_dedes/me.m09.d07:meMA.Ode8C15.melody	@ltx/en_us_dedes/he.h.m4:heHE.PaidasEvageis.name
ltx/en_us_dedes/me.m09.d07:meMA.Ode8C15.mode	@ltx/en_us_dedes/miscellanea:misc.Mode4
ltx/en_us_dedes/me.m09.d07:meMA.Ode8C15.ode	@ltx/en_us_dedes/miscellanea:misc.Ode8
ltx/en_us_dedes/me.m09.d07:meMA.Ode8C15.text	
ltx/en_us_dedes/me.m09.d07:meMA.Ode8C21.greekmelody	@ltx/en_us_dedes/he.h.m4:heHE.CheirasEkpetasasDaniil.greekname
ltx/en_us_dedes/me.m09.d07:meMA.Ode8C21.incipit	…
ltx/en_us_dedes/me.m09.d07:meMA.Ode8C21.melody	@ltx/en_us_dedes/he.h.m4:heHE.CheirasEkpetasasDaniil.name
ltx/en_us_dedes/me.m09.d07:meMA.Ode8C21.mode	@ltx/en_us_dedes/miscellanea:misc.Mode4
ltx/en_us_dedes/me.m09.d07:meMA.Ode8C21.ode	@ltx/en_us_dedes/miscellanea:misc.Ode8
ltx/en_us_dedes/me.m09.d07:meMA.Ode8C21.text	
ltx/en_us_dedes/me.m09.d07:meMA.Ode8C22.incipit	…
ltx/en_us_dedes/me.m09.d07:meMA.Ode8C22.melody	@ltx/en_us_dedes/he.h.m4:heHE.CheirasEkpetasasDaniil.name
ltx/en_us_dedes/me.m09.d07:meMA.Ode8C22.mode	@ltx/en_us_dedes/miscellanea:misc.Mode4
ltx/en_us_dedes/me.m09.d07:meMA.Ode8C22.ode	@ltx/en_us_dedes/miscellanea:misc.Ode8
ltx/en_us_dedes/me.m09.d07:meMA.Ode8C22.text	
ltx/en_us_dedes/me.m09.d07:meMA.Ode8C23.incipit	…
ltx/en_us_dedes/me.m09.d07:meMA.Ode8C23.melody	@ltx/en_us_dedes/he.h.m4:heHE.CheirasEkpetasasDaniil.name
ltx/en_us_dedes/me.m09.d07:meMA.Ode8C23.mode	@ltx/en_us_dedes/miscellanea:misc.Mode4
ltx/en_us_dedes/me.m09.d07:meMA.Ode8C23.ode	@ltx/en_us_dedes/miscellanea:misc.Ode8
ltx/en_us_dedes/me.m09.d07:meMA.Ode8C23.text	
ltx/en_us_dedes/me.m09.d07:meMA.Ode8C2T.incipit	…
ltx/en_us_dedes/me.m09.d07:meMA.Ode8C2T.melody	@ltx/en_us_dedes/he.h.m4:heHE.CheirasEkpetasasDaniil.name
ltx/en_us_dedes/me.m09.d07:meMA.Ode8C2T.mode	@ltx/en_us_dedes/miscellanea:misc.Mode4
ltx/en_us_dedes/me.m09.d07:meMA.Ode8C2T.ode	@ltx/en_us_dedes/miscellanea:misc.Ode8
ltx/en_us_dedes/me.m09.d07:meMA.Ode8C2T.text	
ltx/en_us_dedes/me.m09.d07:meMA.Ode8H.greekmelody	@ltx/en_us_dedes/he.h.m4:heHE.CheirasEkpetasasDaniil.greekname
ltx/en_us_dedes/me.m09.d07:meMA.Ode8H.incipit	@ltx/en_us_dedes/he.h.m4:heHE.CheirasEkpetasasDaniil.incipit
ltx/en_us_dedes/me.m09.d07:meMA.Ode8H.melody	@ltx/en_us_dedes/he.h.m4:heHE.CheirasEkpetasasDaniil.melody
ltx/en_us_dedes/me.m09.d07:meMA.Ode8H.mode	@ltx/en_us_dedes/miscellanea:misc.Mode4
ltx/en_us_dedes/me.m09.d07:meMA.Ode8H.ode	@ltx/en_us_dedes/miscellanea:misc.Ode8
ltx/en_us_dedes/me.m09.d07:meMA.Ode8H.text	@ltx/en_us_dedes/he.h.m4:heHE.CheirasEkpetasasDaniil.text
ltx/en_us_dedes/me.m09.d07:meMA.Ode9C11.greekmelody	@ltx/en_us_dedes/he.h.m4:heHE.ApasGigenis.greekname
ltx/en_us_dedes/me.m09.d07:meMA.Ode9C11.incipit	…
ltx/en_us_dedes/me.m09.d07:meMA.Ode9C11.melody	@ltx/en_us_dedes/he.h.m4:heHE.ApasGigenis.name
ltx/en_us_dedes/me.m09.d07:meMA.Ode9C11.mode	@ltx/en_us_dedes/miscellanea:misc.Mode4
ltx/en_us_dedes/me.m09.d07:meMA.Ode9C11.ode	@ltx/en_us_dedes/miscellanea:misc.Ode9
ltx/en_us_dedes/me.m09.d07:meMA.Ode9C11.text	
ltx/en_us_dedes/me.m09.d07:meMA.Ode9C12.incipit	…
ltx/en_us_dedes/me.m09.d07:meMA.Ode9C12.melody	@ltx/en_us_dedes/he.h.m4:heHE.ApasGigenis.name
ltx/en_us_dedes/me.m09.d07:meMA.Ode9C12.mode	@ltx/en_us_dedes/miscellanea:misc.Mode4
ltx/en_us_dedes/me.m09.d07:meMA.Ode9C12.ode	@ltx/en_us_dedes/miscellanea:misc.Ode9
ltx/en_us_dedes/me.m09.d07:meMA.Ode9C12.text	
ltx/en_us_dedes/me.m09.d07:meMA.Ode9C13.incipit	…
ltx/en_us_dedes/me.m09.d07:meMA.Ode9C13.melody	@ltx/en_us_dedes/he.h.m4:heHE.ApasGigenis.name
ltx/en_us_dedes/me.m09.d07:meMA.Ode9C13.mode	@ltx/en_us_dedes/miscellanea:misc.Mode4
ltx/en_us_dedes/me.m09.d07:meMA.Ode9C13.ode	@ltx/en_us_dedes/miscellanea:misc.Ode9
ltx/en_us_dedes/me.m09.d07:meMA.Ode9C13.text	
ltx/en_us_dedes/me.m09.d07:meMA.Ode9C14.incipit	…
ltx/en_us_dedes/me.m09.d07:meMA.Ode9C14.melody	@ltx/en_us_dedes/he.h.m4:heHE.ApasGigenis.name
ltx/en_us_dedes/me.m09.d07:meMA.Ode9C14.mode	@ltx/en_us_dedes/miscellanea:misc.Mode4
ltx/en_us_dedes/me.m09.d07:meMA.Ode9C14.ode	@ltx/en_us_dedes/miscellanea:misc.Ode9
ltx/en_us_dedes/me.m09.d07:meMA.Ode9C14.text	
ltx/en_us_dedes/me.m09.d07:meMA.Ode9C15.incipit	…
ltx/en_us_dedes/me.m09.d07:meMA.Ode9C15.melody	@ltx/en_us_dedes/he.h.m4:heHE.ApasGigenis.name
ltx/en_us_dedes/me.m09.d07:meMA.Ode9C15.mode	@ltx/en_us_dedes/miscellanea:misc.Mode4
ltx/en_us_dedes/me.m09.d07:meMA.Ode9C15.ode	@ltx/en_us_dedes/miscellanea:misc.Ode9
ltx/en_us_dedes/me.m09.d07:meMA.Ode9C15.text	
ltx/en_us_dedes/me.m09.d07:meMA.Ode9C21.greekmelody	@ltx/en_us_dedes/he.h.m4:heHE.LithosAcheirotmitos.greekname
ltx/en_us_dedes/me.m09.d07:meMA.Ode9C21.incipit	…
ltx/en_us_dedes/me.m09.d07:meMA.Ode9C21.melody	@ltx/en_us_dedes/he.h.m4:heHE.LithosAcheirotmitos.name
ltx/en_us_dedes/me.m09.d07:meMA.Ode9C21.mode	@ltx/en_us_dedes/miscellanea:misc.Mode4
ltx/en_us_dedes/me.m09.d07:meMA.Ode9C21.ode	@ltx/en_us_dedes/miscellanea:misc.Ode9
ltx/en_us_dedes/me.m09.d07:meMA.Ode9C21.text	
ltx/en_us_dedes/me.m09.d07:meMA.Ode9C22.incipit	…
ltx/en_us_dedes/me.m09.d07:meMA.Ode9C22.melody	@ltx/en_us_dedes/he.h.m4:heHE.LithosAcheirotmitos.name
ltx/en_us_dedes/me.m09.d07:meMA.Ode9C22.mode	@ltx/en_us_dedes/miscellanea:misc.Mode4
ltx/en_us_dedes/me.m09.d07:meMA.Ode9C22.ode	@ltx/en_us_dedes/miscellanea:misc.Ode9
ltx/en_us_dedes/me.m09.d07:meMA.Ode9C22.text	
ltx/en_us_dedes/me.m09.d07:meMA.Ode9C23.incipit	…
ltx/en_us_dedes/me.m09.d07:meMA.Ode9C23.melody	@ltx/en_us_dedes/he.h.m4:heHE.LithosAcheirotmitos.name
ltx/en_us_dedes/me.m09.d07:meMA.Ode9C23.mode	@ltx/en_us_dedes/miscellanea:misc.Mode4
ltx/en_us_dedes/me.m09.d07:meMA.Ode9C23.ode	@ltx/en_us_dedes/miscellanea:misc.Ode9
ltx/en_us_dedes/me.m09.d07:meMA.Ode9C23.text	
ltx/en_us_dedes/me.m09.d07:meMA.Ode9C2T.incipit	…
ltx/en_us_dedes/me.m09.d07:meMA.Ode9C2T.melody	@ltx/en_us_dedes/he.h.m4:heHE.LithosAcheirotmitos.name
ltx/en_us_dedes/me.m09.d07:meMA.Ode9C2T.mode	@ltx/en_us_dedes/miscellanea:misc.Mode4
ltx/en_us_dedes/me.m09.d07:meMA.Ode9C2T.ode	@ltx/en_us_dedes/miscellanea:misc.Ode9
ltx/en_us_dedes/me.m09.d07:meMA.Ode9C2T.text	
ltx/en_us_dedes/me.m09.d07:meMA.Ode9H.greekmelody	@ltx/en_us_dedes/he.h.m4:heHE.LithosAcheirotmitos.greekname
ltx/en_us_dedes/me.m09.d07:meMA.Ode9H.incipit	@ltx/en_us_dedes/he.h.m4:heHE.LithosAcheirotmitos.incipit
ltx/en_us_dedes/me.m09.d07:meMA.Ode9H.melody	@ltx/en_us_dedes/he.h.m4:heHE.LithosAcheirotmitos.melody
ltx/en_us_dedes/me.m09.d07:meMA.Ode9H.mode	@ltx/en_us_dedes/miscellanea:misc.Mode4
ltx/en_us_dedes/me.m09.d07:meMA.Ode9H.ode	@ltx/en_us_dedes/miscellanea:misc.Ode9
ltx/en_us_dedes/me.m09.d07:meMA.Ode9H.text	@ltx/en_us_dedes/he.h.m4:heHE.LithosAcheirotmitos.text
ltx/en_us_dedes/me.m09.d07:meMA.Oikos1.text	To the barren woman a child was given, Mary the Theotokos, whom divine Prophets foresaw in the Spirit. As we see her today, wriggling in Anna’s arms, let us mentally join faithful Joachim for a banquet and invite those near and far, saying, “From the fruitless womb has now come forth the restoration of the world, the gateway of God and Mother of Life.”
ltx/en_us_dedes/me.m09.d07:meVE.Apolytikion1.greekmelody	@ltx/en_us_dedes/he.a.m4:heAU.KateplagiIosif.greekname
ltx/en_us_dedes/me.m09.d07:meVE.Apolytikion1.incipit	Unto us is born today…
ltx/en_us_dedes/me.m09.d07:meVE.Apolytikion1.melody	@ltx/en_us_dedes/he.a.m4:heAU.KateplagiIosif.name
ltx/en_us_dedes/me.m09.d07:meVE.Apolytikion1.mode	@ltx/en_us_dedes/miscellanea:misc.Mode4
ltx/en_us_dedes/me.m09.d07:meVE.Apolytikion1.text	Unto us is born today Mary the child of God, * as the branch from Jesse’s root, and as the fruit of David’s loins, * and all creation is re-created and deified. * O heaven and the earth, rejoice in unison. * Sing praises unto her, O all you Gentile clans. * Joachim is exultant, and Anna is keeping festival, crying out: * “The barren woman bears the Theotokos, * the nourisher of our Life.”
ltx/en_us_dedes/me.m09.d07:meVE.AposGlory.incipit	…
ltx/en_us_dedes/me.m09.d07:meVE.AposGlory.melody	
ltx/en_us_dedes/me.m09.d07:meVE.AposGlory.mode	@ltx/en_us_dedes/miscellanea:misc.Mode4
ltx/en_us_dedes/me.m09.d07:meVE.AposGlory.poet	@ltx/en_us_dedes/poets:po.Germanou
ltx/en_us_dedes/me.m09.d07:meVE.AposGlory.text	
ltx/en_us_dedes/me.m09.d07:meVE.Aposticha1.greekmelody	@ltx/en_us_dedes/he.a.m8:heAU.OTouParadoxou.greekname
ltx/en_us_dedes/me.m09.d07:meVE.Aposticha1.incipit	…
ltx/en_us_dedes/me.m09.d07:meVE.Aposticha1.melody	@ltx/en_us_dedes/he.a.m8:heAU.OTouParadoxou.name
ltx/en_us_dedes/me.m09.d07:meVE.Aposticha1.mode	@ltx/en_us_dedes/miscellanea:misc.Mode8
ltx/en_us_dedes/me.m09.d07:meVE.Aposticha1.text	
ltx/en_us_dedes/me.m09.d07:meVE.Aposticha2.incipit	…
ltx/en_us_dedes/me.m09.d07:meVE.Aposticha2.melody	@ltx/en_us_dedes/he.a.m8:heAU.OTouParadoxou.name
ltx/en_us_dedes/me.m09.d07:meVE.Aposticha2.mode	@ltx/en_us_dedes/miscellanea:misc.Mode8
ltx/en_us_dedes/me.m09.d07:meVE.Aposticha2.text	
ltx/en_us_dedes/me.m09.d07:meVE.Aposticha3.incipit	…
ltx/en_us_dedes/me.m09.d07:meVE.Aposticha3.melody	@ltx/en_us_dedes/he.a.m8:heAU.OTouParadoxou.name
ltx/en_us_dedes/me.m09.d07:meVE.Aposticha3.mode	@ltx/en_us_dedes/miscellanea:misc.Mode8
ltx/en_us_dedes/me.m09.d07:meVE.Aposticha3.text	
ltx/en_us_dedes/me.m09.d07:meVE.MM.Stichera1123as78910.text	@ltx/en_us_dedes/properties:media.key
ltx/en_us_dedes/me.m09.d07:meVE.SticGlory.incipit	The multitude of Angels, in…
ltx/en_us_dedes/me.m09.d07:meVE.SticGlory.melody	
ltx/en_us_dedes/me.m09.d07:meVE.SticGlory.mode	@ltx/en_us_dedes/miscellanea:misc.Mode4
ltx/en_us_dedes/me.m09.d07:meVE.SticGlory.text	The multitude of Angels, in heaven, and we the human race, on earth, together extol your wholly august Nativity, O pure and all-holy Virgin; for you are the Mother of Christ our God, the Creator of all. We entreat you, cease not from praying for us who have set our hope after God in you, O all-laudable and unwedded Theotokos.
ltx/en_us_dedes/me.m09.d07:meVE.Stichera01.greekmelody	@ltx/en_us_dedes/he.a.m1:heAU.TonOuranionTagmaton.greekname
ltx/en_us_dedes/me.m09.d07:meVE.Stichera01.incipit	…
ltx/en_us_dedes/me.m09.d07:meVE.Stichera01.melody	@ltx/en_us_dedes/he.a.m1:heAU.TonOuranionTagmaton.name
ltx/en_us_dedes/me.m09.d07:meVE.Stichera01.mode	@ltx/en_us_dedes/miscellanea:misc.Mode1
ltx/en_us_dedes/me.m09.d07:meVE.Stichera01.text	
ltx/en_us_dedes/me.m09.d07:meVE.Stichera02.incipit	…
ltx/en_us_dedes/me.m09.d07:meVE.Stichera02.melody	@ltx/en_us_dedes/he.a.m1:heAU.TonOuranionTagmaton.name
ltx/en_us_dedes/me.m09.d07:meVE.Stichera02.mode	@ltx/en_us_dedes/miscellanea:misc.Mode1
ltx/en_us_dedes/me.m09.d07:meVE.Stichera02.text	
ltx/en_us_dedes/me.m09.d07:meVE.Stichera03.incipit	…
ltx/en_us_dedes/me.m09.d07:meVE.Stichera03.melody	@ltx/en_us_dedes/he.a.m1:heAU.TonOuranionTagmaton.name
ltx/en_us_dedes/me.m09.d07:meVE.Stichera03.mode	@ltx/en_us_dedes/miscellanea:misc.Mode1
ltx/en_us_dedes/me.m09.d07:meVE.Stichera03.text	
ltx/en_us_dedes/me.m09.d07:meVE.Stichera04.greekmelody	@ltx/en_us_dedes/he.a.m4:heAU.EdokasSimeiosin.greekname
ltx/en_us_dedes/me.m09.d07:meVE.Stichera04.incipit	…
ltx/en_us_dedes/me.m09.d07:meVE.Stichera04.melody	@ltx/en_us_dedes/he.a.m4:heAU.EdokasSimeiosin.name
ltx/en_us_dedes/me.m09.d07:meVE.Stichera04.mode	@ltx/en_us_dedes/miscellanea:misc.Mode4
ltx/en_us_dedes/me.m09.d07:meVE.Stichera04.text	
ltx/en_us_dedes/me.m09.d07:meVE.Stichera05.incipit	…
ltx/en_us_dedes/me.m09.d07:meVE.Stichera05.melody	@ltx/en_us_dedes/he.a.m4:heAU.EdokasSimeiosin.name
ltx/en_us_dedes/me.m09.d07:meVE.Stichera05.mode	@ltx/en_us_dedes/miscellanea:misc.Mode4
ltx/en_us_dedes/me.m09.d07:meVE.Stichera05.text	
ltx/en_us_dedes/me.m09.d07:meVE.Stichera06.incipit	…
ltx/en_us_dedes/me.m09.d07:meVE.Stichera06.melody	@ltx/en_us_dedes/he.a.m4:heAU.EdokasSimeiosin.name
ltx/en_us_dedes/me.m09.d07:meVE.Stichera06.mode	@ltx/en_us_dedes/miscellanea:misc.Mode4
ltx/en_us_dedes/me.m09.d07:meVE.Stichera06.text	
