ltx/en_us_dedes/tr.d055:trCO.header	(Great)
ltx/en_us_dedes/tr.d055:trDA.commemoration.full	
ltx/en_us_dedes/tr.d055:trDA.commemoration.short	Friday of the Fifth Week
ltx/en_us_dedes/tr.d055:trDA.insert1	
ltx/en_us_dedes/tr.d055:trDA.insert2	
ltx/en_us_dedes/tr.d055:trDA.note	
ltx/en_us_dedes/tr.d055:trDA.title	
ltx/en_us_dedes/tr.d055:trHO.commemorations	
ltx/en_us_dedes/tr.d055:trHO.daytitle	
ltx/en_us_dedes/tr.d055:trHO.description1	
ltx/en_us_dedes/tr.d055:trHO.description2	
ltx/en_us_dedes/tr.d055:trHO.note1	
ltx/en_us_dedes/tr.d055:trHO.note2	
ltx/en_us_dedes/tr.d055:trMA.AposIdiomelon1.incipit	…
ltx/en_us_dedes/tr.d055:trMA.AposIdiomelon1.melody	@ltx/en_us_dedes/miscellanea:misc.Idiomelon
ltx/en_us_dedes/tr.d055:trMA.AposIdiomelon1.mode	@ltx/en_us_dedes/miscellanea:misc.Mode8
ltx/en_us_dedes/tr.d055:trMA.AposIdiomelon1.text	
ltx/en_us_dedes/tr.d055:trMA.AposMartyric.greekmelody	@ltx/en_us_dedes/he.a.m8:heAU.TiYmasKalesomen.greekname
ltx/en_us_dedes/tr.d055:trMA.AposMartyric.incipit	@ltx/en_us_dedes/he.a.m8:heAU.TiYmasKalesomen.incipit
ltx/en_us_dedes/tr.d055:trMA.AposMartyric.melody	@ltx/en_us_dedes/he.a.m8:heAU.TiYmasKalesomen.melody
ltx/en_us_dedes/tr.d055:trMA.AposMartyric.mode	@ltx/en_us_dedes/miscellanea:misc.Mode8
ltx/en_us_dedes/tr.d055:trMA.AposMartyric.text	@ltx/en_us_dedes/he.a.m8:heAU.TiYmasKalesomen.text
ltx/en_us_dedes/tr.d055:trMA.AposTheotokion.greekmelody	@ltx/en_us_dedes/he.a.m8:heAU.OTouParadoxou.greekname
ltx/en_us_dedes/tr.d055:trMA.AposTheotokion.incipit	“What a paradoxal miracle; *…
ltx/en_us_dedes/tr.d055:trMA.AposTheotokion.melody	@ltx/en_us_dedes/he.a.m8:heAU.OTouParadoxou.name
ltx/en_us_dedes/tr.d055:trMA.AposTheotokion.mode	@ltx/en_us_dedes/miscellanea:misc.Mode8
ltx/en_us_dedes/tr.d055:trMA.AposTheotokion.text	“What a paradoxal miracle; * Oh, novel mystery! Oh, * what an awful event this is!” * So Your Virgin Mother spoke, * as she witnessed You hanging there, * between two robbers on Golgotha, O Lord, * whom with no pain nor corruption she had borne. * “How can these lawless men, these ungrateful people, nail You to a cross, * O my Son, You are my heart, O sweetest Jesus Christ!”
ltx/en_us_dedes/tr.d055:trMA.C1.poet	@ltx/en_us_dedes/poets:po.Iosif
ltx/en_us_dedes/tr.d055:trMA.C2.poet	@ltx/en_us_dedes/poets:po.Theodorou
ltx/en_us_dedes/tr.d055:trMA.Kathisma21.greekmelody	@ltx/en_us_dedes/he.a.m1:heAU.TonTafonSouSotir.greekname
ltx/en_us_dedes/tr.d055:trMA.Kathisma21.incipit	…
ltx/en_us_dedes/tr.d055:trMA.Kathisma21.melody	@ltx/en_us_dedes/he.a.m1:heAU.TonTafonSouSotir.name
ltx/en_us_dedes/tr.d055:trMA.Kathisma21.mode	@ltx/en_us_dedes/miscellanea:misc.Mode1
ltx/en_us_dedes/tr.d055:trMA.Kathisma21.text	
ltx/en_us_dedes/tr.d055:trMA.Kathisma22.greekmelody	@ltx/en_us_dedes/he.a.m1:heAU.TonTafonSouSotir.greekname
ltx/en_us_dedes/tr.d055:trMA.Kathisma22.incipit	@ltx/en_us_dedes/tr.d046:trMA.Kathisma32.incipit
ltx/en_us_dedes/tr.d055:trMA.Kathisma22.melody	@ltx/en_us_dedes/he.a.m1:heAU.TonTafonSouSotir.name
ltx/en_us_dedes/tr.d055:trMA.Kathisma22.mode	@ltx/en_us_dedes/miscellanea:misc.Mode1
ltx/en_us_dedes/tr.d055:trMA.Kathisma22.text	@ltx/en_us_dedes/tr.d046:trMA.Kathisma32.text
ltx/en_us_dedes/tr.d055:trMA.Kathisma31.greekmelody	@ltx/en_us_dedes/he.a.m6:heAU.ElpisTouKosmouAgathi.greekname
ltx/en_us_dedes/tr.d055:trMA.Kathisma31.incipit	…
ltx/en_us_dedes/tr.d055:trMA.Kathisma31.melody	@ltx/en_us_dedes/he.a.m6:heAU.ElpisTouKosmouAgathi.name
ltx/en_us_dedes/tr.d055:trMA.Kathisma31.mode	@ltx/en_us_dedes/miscellanea:misc.Mode6
ltx/en_us_dedes/tr.d055:trMA.Kathisma31.text	
ltx/en_us_dedes/tr.d055:trMA.Kathisma32.greekmelody	@ltx/en_us_dedes/he.a.m6:heAU.ElpisTouKosmouAgathi.greekname
ltx/en_us_dedes/tr.d055:trMA.Kathisma32.incipit	…
ltx/en_us_dedes/tr.d055:trMA.Kathisma32.melody	@ltx/en_us_dedes/he.a.m6:heAU.ElpisTouKosmouAgathi.name
ltx/en_us_dedes/tr.d055:trMA.Kathisma32.mode	@ltx/en_us_dedes/miscellanea:misc.Mode6
ltx/en_us_dedes/tr.d055:trMA.Kathisma32.text	
ltx/en_us_dedes/tr.d055:trMA.Ode5C11.greekmelody	@ltx/en_us_dedes/he.h.m1:heHE.OFotisasTiEllampsei.greekname
ltx/en_us_dedes/tr.d055:trMA.Ode5C11.incipit	…
ltx/en_us_dedes/tr.d055:trMA.Ode5C11.melody	@ltx/en_us_dedes/he.h.m1:heHE.OFotisasTiEllampsei.name
ltx/en_us_dedes/tr.d055:trMA.Ode5C11.mode	@ltx/en_us_dedes/miscellanea:misc.Mode1
ltx/en_us_dedes/tr.d055:trMA.Ode5C11.ode	@ltx/en_us_dedes/miscellanea:misc.Ode5
ltx/en_us_dedes/tr.d055:trMA.Ode5C11.text	
ltx/en_us_dedes/tr.d055:trMA.Ode5C12.incipit	…
ltx/en_us_dedes/tr.d055:trMA.Ode5C12.melody	@ltx/en_us_dedes/he.h.m1:heHE.OFotisasTiEllampsei.name
ltx/en_us_dedes/tr.d055:trMA.Ode5C12.mode	@ltx/en_us_dedes/miscellanea:misc.Mode1
ltx/en_us_dedes/tr.d055:trMA.Ode5C12.ode	@ltx/en_us_dedes/miscellanea:misc.Ode5
ltx/en_us_dedes/tr.d055:trMA.Ode5C12.text	
ltx/en_us_dedes/tr.d055:trMA.Ode5C13.incipit	…
ltx/en_us_dedes/tr.d055:trMA.Ode5C13.melody	@ltx/en_us_dedes/he.h.m1:heHE.OFotisasTiEllampsei.name
ltx/en_us_dedes/tr.d055:trMA.Ode5C13.mode	@ltx/en_us_dedes/miscellanea:misc.Mode1
ltx/en_us_dedes/tr.d055:trMA.Ode5C13.ode	@ltx/en_us_dedes/miscellanea:misc.Ode5
ltx/en_us_dedes/tr.d055:trMA.Ode5C13.text	
ltx/en_us_dedes/tr.d055:trMA.Ode5C1T.incipit	…
ltx/en_us_dedes/tr.d055:trMA.Ode5C1T.melody	@ltx/en_us_dedes/he.h.m1:heHE.OFotisasTiEllampsei.name
ltx/en_us_dedes/tr.d055:trMA.Ode5C1T.mode	@ltx/en_us_dedes/miscellanea:misc.Mode1
ltx/en_us_dedes/tr.d055:trMA.Ode5C1T.ode	@ltx/en_us_dedes/miscellanea:misc.Ode5
ltx/en_us_dedes/tr.d055:trMA.Ode5C1T.text	
ltx/en_us_dedes/tr.d055:trMA.Ode5C21.greekmelody	@ltx/en_us_dedes/he.h.m6:heHE.EkNyktosOrthrizonta.greekname
ltx/en_us_dedes/tr.d055:trMA.Ode5C21.incipit	…
ltx/en_us_dedes/tr.d055:trMA.Ode5C21.melody	@ltx/en_us_dedes/he.h.m6:heHE.EkNyktosOrthrizonta.name
ltx/en_us_dedes/tr.d055:trMA.Ode5C21.mode	@ltx/en_us_dedes/miscellanea:misc.Mode6
ltx/en_us_dedes/tr.d055:trMA.Ode5C21.ode	@ltx/en_us_dedes/miscellanea:misc.Ode5
ltx/en_us_dedes/tr.d055:trMA.Ode5C21.text	
ltx/en_us_dedes/tr.d055:trMA.Ode5C22.incipit	…
ltx/en_us_dedes/tr.d055:trMA.Ode5C22.melody	@ltx/en_us_dedes/he.h.m6:heHE.EkNyktosOrthrizonta.name
ltx/en_us_dedes/tr.d055:trMA.Ode5C22.mode	@ltx/en_us_dedes/miscellanea:misc.Mode6
ltx/en_us_dedes/tr.d055:trMA.Ode5C22.ode	@ltx/en_us_dedes/miscellanea:misc.Ode5
ltx/en_us_dedes/tr.d055:trMA.Ode5C22.text	
ltx/en_us_dedes/tr.d055:trMA.Ode5C2A1.incipit	…
ltx/en_us_dedes/tr.d055:trMA.Ode5C2A1.melody	@ltx/en_us_dedes/he.h.m6:heHE.EkNyktosOrthrizonta.name
ltx/en_us_dedes/tr.d055:trMA.Ode5C2A1.mode	@ltx/en_us_dedes/miscellanea:misc.Mode6
ltx/en_us_dedes/tr.d055:trMA.Ode5C2A1.ode	@ltx/en_us_dedes/miscellanea:misc.Ode5
ltx/en_us_dedes/tr.d055:trMA.Ode5C2A1.text	
ltx/en_us_dedes/tr.d055:trMA.Ode5C2H.greekmelody	@ltx/en_us_dedes/he.h.m6:heHE.EkNyktosOrthrizonta.greekname
ltx/en_us_dedes/tr.d055:trMA.Ode5C2H.incipit	@ltx/en_us_dedes/he.h.m6:heHE.EkNyktosOrthrizonta.incipit
ltx/en_us_dedes/tr.d055:trMA.Ode5C2H.melody	@ltx/en_us_dedes/he.h.m6:heHE.EkNyktosOrthrizonta.melody
ltx/en_us_dedes/tr.d055:trMA.Ode5C2H.mode	@ltx/en_us_dedes/miscellanea:misc.Mode6
ltx/en_us_dedes/tr.d055:trMA.Ode5C2H.ode	@ltx/en_us_dedes/miscellanea:misc.Ode5
ltx/en_us_dedes/tr.d055:trMA.Ode5C2H.text	@ltx/en_us_dedes/he.h.m6:heHE.EkNyktosOrthrizonta.text
ltx/en_us_dedes/tr.d055:trMA.Ode5C2T.incipit	…
ltx/en_us_dedes/tr.d055:trMA.Ode5C2T.melody	@ltx/en_us_dedes/he.h.m6:heHE.EkNyktosOrthrizonta.name
ltx/en_us_dedes/tr.d055:trMA.Ode5C2T.mode	@ltx/en_us_dedes/miscellanea:misc.Mode6
ltx/en_us_dedes/tr.d055:trMA.Ode5C2T.ode	@ltx/en_us_dedes/miscellanea:misc.Ode5
ltx/en_us_dedes/tr.d055:trMA.Ode5C2T.text	
ltx/en_us_dedes/tr.d055:trMA.Ode5C2Tr.incipit	…
ltx/en_us_dedes/tr.d055:trMA.Ode5C2Tr.melody	@ltx/en_us_dedes/he.h.m6:heHE.EkNyktosOrthrizonta.name
ltx/en_us_dedes/tr.d055:trMA.Ode5C2Tr.mode	@ltx/en_us_dedes/miscellanea:misc.Mode6
ltx/en_us_dedes/tr.d055:trMA.Ode5C2Tr.ode	@ltx/en_us_dedes/miscellanea:misc.Ode5
ltx/en_us_dedes/tr.d055:trMA.Ode5C2Tr.text	
ltx/en_us_dedes/tr.d055:trMA.Ode8C11.greekmelody	@ltx/en_us_dedes/he.h.m1:heHE.ThavmatosYperfyous.greekname
ltx/en_us_dedes/tr.d055:trMA.Ode8C11.incipit	…
ltx/en_us_dedes/tr.d055:trMA.Ode8C11.melody	@ltx/en_us_dedes/he.h.m1:heHE.ThavmatosYperfyous.name
ltx/en_us_dedes/tr.d055:trMA.Ode8C11.mode	@ltx/en_us_dedes/miscellanea:misc.Mode1
ltx/en_us_dedes/tr.d055:trMA.Ode8C11.ode	@ltx/en_us_dedes/miscellanea:misc.Ode8
ltx/en_us_dedes/tr.d055:trMA.Ode8C11.text	
ltx/en_us_dedes/tr.d055:trMA.Ode8C12.incipit	…
ltx/en_us_dedes/tr.d055:trMA.Ode8C12.melody	@ltx/en_us_dedes/he.h.m1:heHE.ThavmatosYperfyous.name
ltx/en_us_dedes/tr.d055:trMA.Ode8C12.mode	@ltx/en_us_dedes/miscellanea:misc.Mode1
ltx/en_us_dedes/tr.d055:trMA.Ode8C12.ode	@ltx/en_us_dedes/miscellanea:misc.Ode8
ltx/en_us_dedes/tr.d055:trMA.Ode8C12.text	
ltx/en_us_dedes/tr.d055:trMA.Ode8C13.incipit	…
ltx/en_us_dedes/tr.d055:trMA.Ode8C13.melody	@ltx/en_us_dedes/he.h.m1:heHE.ThavmatosYperfyous.name
ltx/en_us_dedes/tr.d055:trMA.Ode8C13.mode	@ltx/en_us_dedes/miscellanea:misc.Mode1
ltx/en_us_dedes/tr.d055:trMA.Ode8C13.ode	@ltx/en_us_dedes/miscellanea:misc.Ode8
ltx/en_us_dedes/tr.d055:trMA.Ode8C13.text	
ltx/en_us_dedes/tr.d055:trMA.Ode8C1T.incipit	…
ltx/en_us_dedes/tr.d055:trMA.Ode8C1T.melody	@ltx/en_us_dedes/he.h.m1:heHE.ThavmatosYperfyous.name
ltx/en_us_dedes/tr.d055:trMA.Ode8C1T.mode	@ltx/en_us_dedes/miscellanea:misc.Mode1
ltx/en_us_dedes/tr.d055:trMA.Ode8C1T.ode	@ltx/en_us_dedes/miscellanea:misc.Ode8
ltx/en_us_dedes/tr.d055:trMA.Ode8C1T.text	
ltx/en_us_dedes/tr.d055:trMA.Ode8C21.greekmelody	@ltx/en_us_dedes/he.h.m6:heHE.TonPaidonTinOdin.greekname
ltx/en_us_dedes/tr.d055:trMA.Ode8C21.incipit	…
ltx/en_us_dedes/tr.d055:trMA.Ode8C21.melody	@ltx/en_us_dedes/he.h.m6:heHE.TonPaidonTinOdin.name
ltx/en_us_dedes/tr.d055:trMA.Ode8C21.mode	@ltx/en_us_dedes/miscellanea:misc.Mode6
ltx/en_us_dedes/tr.d055:trMA.Ode8C21.ode	@ltx/en_us_dedes/miscellanea:misc.Ode8
ltx/en_us_dedes/tr.d055:trMA.Ode8C21.text	
ltx/en_us_dedes/tr.d055:trMA.Ode8C22.incipit	…
ltx/en_us_dedes/tr.d055:trMA.Ode8C22.melody	@ltx/en_us_dedes/he.h.m6:heHE.TonPaidonTinOdin.name
ltx/en_us_dedes/tr.d055:trMA.Ode8C22.mode	@ltx/en_us_dedes/miscellanea:misc.Mode6
ltx/en_us_dedes/tr.d055:trMA.Ode8C22.ode	@ltx/en_us_dedes/miscellanea:misc.Ode8
ltx/en_us_dedes/tr.d055:trMA.Ode8C22.text	
ltx/en_us_dedes/tr.d055:trMA.Ode8C2A1.incipit	…
ltx/en_us_dedes/tr.d055:trMA.Ode8C2A1.melody	@ltx/en_us_dedes/he.h.m6:heHE.TonPaidonTinOdin.name
ltx/en_us_dedes/tr.d055:trMA.Ode8C2A1.mode	@ltx/en_us_dedes/miscellanea:misc.Mode6
ltx/en_us_dedes/tr.d055:trMA.Ode8C2A1.ode	@ltx/en_us_dedes/miscellanea:misc.Ode8
ltx/en_us_dedes/tr.d055:trMA.Ode8C2A1.text	
ltx/en_us_dedes/tr.d055:trMA.Ode8C2H.greekmelody	@ltx/en_us_dedes/he.h.m6:heHE.TonPaidonTinOdin.greekname
ltx/en_us_dedes/tr.d055:trMA.Ode8C2H.incipit	@ltx/en_us_dedes/he.h.m6:heHE.TonPaidonTinOdin.incipit
ltx/en_us_dedes/tr.d055:trMA.Ode8C2H.melody	@ltx/en_us_dedes/he.h.m6:heHE.TonPaidonTinOdin.melody
ltx/en_us_dedes/tr.d055:trMA.Ode8C2H.mode	@ltx/en_us_dedes/miscellanea:misc.Mode6
ltx/en_us_dedes/tr.d055:trMA.Ode8C2H.ode	@ltx/en_us_dedes/miscellanea:misc.Ode8
ltx/en_us_dedes/tr.d055:trMA.Ode8C2H.text	@ltx/en_us_dedes/he.h.m6:heHE.TonPaidonTinOdin.text
ltx/en_us_dedes/tr.d055:trMA.Ode8C2T.incipit	…
ltx/en_us_dedes/tr.d055:trMA.Ode8C2T.melody	@ltx/en_us_dedes/he.h.m6:heHE.TonPaidonTinOdin.name
ltx/en_us_dedes/tr.d055:trMA.Ode8C2T.mode	@ltx/en_us_dedes/miscellanea:misc.Mode6
ltx/en_us_dedes/tr.d055:trMA.Ode8C2T.ode	@ltx/en_us_dedes/miscellanea:misc.Ode8
ltx/en_us_dedes/tr.d055:trMA.Ode8C2T.text	
ltx/en_us_dedes/tr.d055:trMA.Ode8C2Tr.incipit	…
ltx/en_us_dedes/tr.d055:trMA.Ode8C2Tr.melody	@ltx/en_us_dedes/he.h.m6:heHE.TonPaidonTinOdin.name
ltx/en_us_dedes/tr.d055:trMA.Ode8C2Tr.mode	@ltx/en_us_dedes/miscellanea:misc.Mode6
ltx/en_us_dedes/tr.d055:trMA.Ode8C2Tr.ode	@ltx/en_us_dedes/miscellanea:misc.Ode8
ltx/en_us_dedes/tr.d055:trMA.Ode8C2Tr.text	
ltx/en_us_dedes/tr.d055:trMA.Ode9C11.greekmelody	@ltx/en_us_dedes/he.h.m1:heHE.TyponTisAgnis.greekname
ltx/en_us_dedes/tr.d055:trMA.Ode9C11.incipit	…
ltx/en_us_dedes/tr.d055:trMA.Ode9C11.melody	@ltx/en_us_dedes/he.h.m1:heHE.TyponTisAgnis.name
ltx/en_us_dedes/tr.d055:trMA.Ode9C11.mode	@ltx/en_us_dedes/miscellanea:misc.Mode1
ltx/en_us_dedes/tr.d055:trMA.Ode9C11.ode	@ltx/en_us_dedes/miscellanea:misc.Ode9
ltx/en_us_dedes/tr.d055:trMA.Ode9C11.text	
ltx/en_us_dedes/tr.d055:trMA.Ode9C12.incipit	…
ltx/en_us_dedes/tr.d055:trMA.Ode9C12.melody	@ltx/en_us_dedes/he.h.m1:heHE.TyponTisAgnis.name
ltx/en_us_dedes/tr.d055:trMA.Ode9C12.mode	@ltx/en_us_dedes/miscellanea:misc.Mode1
ltx/en_us_dedes/tr.d055:trMA.Ode9C12.ode	@ltx/en_us_dedes/miscellanea:misc.Ode9
ltx/en_us_dedes/tr.d055:trMA.Ode9C12.text	
ltx/en_us_dedes/tr.d055:trMA.Ode9C13.incipit	…
ltx/en_us_dedes/tr.d055:trMA.Ode9C13.melody	@ltx/en_us_dedes/he.h.m1:heHE.TyponTisAgnis.name
ltx/en_us_dedes/tr.d055:trMA.Ode9C13.mode	@ltx/en_us_dedes/miscellanea:misc.Mode1
ltx/en_us_dedes/tr.d055:trMA.Ode9C13.ode	@ltx/en_us_dedes/miscellanea:misc.Ode9
ltx/en_us_dedes/tr.d055:trMA.Ode9C13.text	
ltx/en_us_dedes/tr.d055:trMA.Ode9C1T.incipit	…
ltx/en_us_dedes/tr.d055:trMA.Ode9C1T.melody	@ltx/en_us_dedes/he.h.m1:heHE.TyponTisAgnis.name
ltx/en_us_dedes/tr.d055:trMA.Ode9C1T.mode	@ltx/en_us_dedes/miscellanea:misc.Mode1
ltx/en_us_dedes/tr.d055:trMA.Ode9C1T.ode	@ltx/en_us_dedes/miscellanea:misc.Ode9
ltx/en_us_dedes/tr.d055:trMA.Ode9C1T.text	
ltx/en_us_dedes/tr.d055:trMA.Ode9C21.greekmelody	@ltx/en_us_dedes/he.h.m6:heHE.AsporouSyllipseos.greekname
ltx/en_us_dedes/tr.d055:trMA.Ode9C21.incipit	…
ltx/en_us_dedes/tr.d055:trMA.Ode9C21.melody	@ltx/en_us_dedes/he.h.m6:heHE.AsporouSyllipseos.name
ltx/en_us_dedes/tr.d055:trMA.Ode9C21.mode	@ltx/en_us_dedes/miscellanea:misc.Mode6
ltx/en_us_dedes/tr.d055:trMA.Ode9C21.ode	@ltx/en_us_dedes/miscellanea:misc.Ode9
ltx/en_us_dedes/tr.d055:trMA.Ode9C21.text	
ltx/en_us_dedes/tr.d055:trMA.Ode9C22.incipit	…
ltx/en_us_dedes/tr.d055:trMA.Ode9C22.melody	@ltx/en_us_dedes/he.h.m6:heHE.AsporouSyllipseos.name
ltx/en_us_dedes/tr.d055:trMA.Ode9C22.mode	@ltx/en_us_dedes/miscellanea:misc.Mode6
ltx/en_us_dedes/tr.d055:trMA.Ode9C22.ode	@ltx/en_us_dedes/miscellanea:misc.Ode9
ltx/en_us_dedes/tr.d055:trMA.Ode9C22.text	
ltx/en_us_dedes/tr.d055:trMA.Ode9C2A1.incipit	…
ltx/en_us_dedes/tr.d055:trMA.Ode9C2A1.melody	@ltx/en_us_dedes/he.h.m6:heHE.AsporouSyllipseos.name
ltx/en_us_dedes/tr.d055:trMA.Ode9C2A1.mode	@ltx/en_us_dedes/miscellanea:misc.Mode6
ltx/en_us_dedes/tr.d055:trMA.Ode9C2A1.ode	@ltx/en_us_dedes/miscellanea:misc.Ode9
ltx/en_us_dedes/tr.d055:trMA.Ode9C2A1.text	
ltx/en_us_dedes/tr.d055:trMA.Ode9C2H.greekmelody	@ltx/en_us_dedes/he.h.m6:heHE.AsporouSyllipseos.greekname
ltx/en_us_dedes/tr.d055:trMA.Ode9C2H.incipit	@ltx/en_us_dedes/he.h.m6:heHE.AsporouSyllipseos.incipit
ltx/en_us_dedes/tr.d055:trMA.Ode9C2H.melody	@ltx/en_us_dedes/he.h.m6:heHE.AsporouSyllipseos.melody
ltx/en_us_dedes/tr.d055:trMA.Ode9C2H.mode	@ltx/en_us_dedes/miscellanea:misc.Mode6
ltx/en_us_dedes/tr.d055:trMA.Ode9C2H.ode	@ltx/en_us_dedes/miscellanea:misc.Ode9
ltx/en_us_dedes/tr.d055:trMA.Ode9C2H.text	@ltx/en_us_dedes/he.h.m6:heHE.AsporouSyllipseos.text
ltx/en_us_dedes/tr.d055:trMA.Ode9C2T.incipit	…
ltx/en_us_dedes/tr.d055:trMA.Ode9C2T.melody	@ltx/en_us_dedes/he.h.m6:heHE.AsporouSyllipseos.name
ltx/en_us_dedes/tr.d055:trMA.Ode9C2T.mode	@ltx/en_us_dedes/miscellanea:misc.Mode6
ltx/en_us_dedes/tr.d055:trMA.Ode9C2T.ode	@ltx/en_us_dedes/miscellanea:misc.Ode9
ltx/en_us_dedes/tr.d055:trMA.Ode9C2T.text	
ltx/en_us_dedes/tr.d055:trMA.Ode9C2Tr.incipit	…
ltx/en_us_dedes/tr.d055:trMA.Ode9C2Tr.melody	@ltx/en_us_dedes/he.h.m6:heHE.AsporouSyllipseos.name
ltx/en_us_dedes/tr.d055:trMA.Ode9C2Tr.mode	@ltx/en_us_dedes/miscellanea:misc.Mode6
ltx/en_us_dedes/tr.d055:trMA.Ode9C2Tr.ode	@ltx/en_us_dedes/miscellanea:misc.Ode9
ltx/en_us_dedes/tr.d055:trMA.Ode9C2Tr.text	
ltx/en_us_dedes/tr.d055:trTE.Troparion.incipit	…
ltx/en_us_dedes/tr.d055:trTE.Troparion.melody	
ltx/en_us_dedes/tr.d055:trTE.Troparion.mode	@ltx/en_us_dedes/miscellanea:misc.Mode5
ltx/en_us_dedes/tr.d055:trTE.Troparion.text	
ltx/en_us_dedes/tr.d055:trVE.AposIdiomelon1.incipit	With my first transgression, of…
ltx/en_us_dedes/tr.d055:trVE.AposIdiomelon1.melody	@ltx/en_us_dedes/miscellanea:misc.Idiomelon
ltx/en_us_dedes/tr.d055:trVE.AposIdiomelon1.mode	@ltx/en_us_dedes/miscellanea:misc.Mode8
ltx/en_us_dedes/tr.d055:trVE.AposIdiomelon1.text	With my first transgression, of my own free will, I was stripped of the majesty of the virtues; but I have put it on again, because of Your condescension to me, O Logos of God. For You did not look away from me when I lay covered in terrible wounds, beaten by robbers on the road; but rather You took care of me with Your almighty power, and You granted me assistance, O very merciful Lord.
ltx/en_us_dedes/tr.d055:trVE.AposMartyric.incipit	@ltx/en_us_dedes/oc.m8.d2:ocVE.Aposticha3.incipit
ltx/en_us_dedes/tr.d055:trVE.AposMartyric.melody	
ltx/en_us_dedes/tr.d055:trVE.AposMartyric.mode	@ltx/en_us_dedes/miscellanea:misc.Mode8
ltx/en_us_dedes/tr.d055:trVE.AposMartyric.text	@ltx/en_us_dedes/oc.m8.d2:ocVE.Aposticha3.text
ltx/en_us_dedes/tr.d055:trVE.Stichera01.greekmelody	@ltx/en_us_dedes/he.a.m1:heAU.PaneffimoiMartyres.greekname
ltx/en_us_dedes/tr.d055:trVE.Stichera01.incipit	O Lord, You were nailed…
ltx/en_us_dedes/tr.d055:trVE.Stichera01.melody	@ltx/en_us_dedes/he.a.m1:heAU.PaneffimoiMartyres.name
ltx/en_us_dedes/tr.d055:trVE.Stichera01.mode	@ltx/en_us_dedes/miscellanea:misc.Mode1
ltx/en_us_dedes/tr.d055:trVE.Stichera01.text	O Lord, You were nailed on to the Cross * and were pierced, and thus by means of that divine spear tore up the bond on Adam. Therefore now * tear apart the shackles * that I wear, O Word of God, * that I in faith may joyfully offer You a sacrifice of praise, * having found Lent an acceptable * time, which You gave * to be for the salvation of all.
ltx/en_us_dedes/tr.d055:trVE.Stichera02.greekmelody	@ltx/en_us_dedes/he.a.m1:heAU.PaneffimoiMartyres.greekname
ltx/en_us_dedes/tr.d055:trVE.Stichera02.incipit	When Moses of old was…
ltx/en_us_dedes/tr.d055:trVE.Stichera02.melody	@ltx/en_us_dedes/he.a.m1:heAU.PaneffimoiMartyres.name
ltx/en_us_dedes/tr.d055:trVE.Stichera02.mode	@ltx/en_us_dedes/miscellanea:misc.Mode1
ltx/en_us_dedes/tr.d055:trVE.Stichera02.text	When Moses of old was shining bright * with the splendor of his fasting, he beheld the magnificence and glory of the Lord. * You, my humble soul, now * imitate him zealously, * and serve the One who for you was crucified in His benevolence * with your works of self-control and prayer, * so that you might * enjoy the divine rewards.
ltx/en_us_dedes/tr.d055:trVE.Stichera03.incipit	O Christ, as we venerate…
ltx/en_us_dedes/tr.d055:trVE.Stichera03.melody	@ltx/en_us_dedes/miscellanea:misc.NotMetered
ltx/en_us_dedes/tr.d055:trVE.Stichera03.mode	@ltx/en_us_dedes/miscellanea:misc.Mode6
ltx/en_us_dedes/tr.d055:trVE.Stichera03.text	O Christ, as we venerate the life-giving Cross of Your inexpressible immense goodness towards us, and as our souls are illumined by it, we unceasingly extol You; and we pray that we may cheerfully finish the race of Lent with joy, and be able to extol Your Passion, by which You saved us, O Lord.
ltx/en_us_dedes/tr.d055:trVL.header	Presanctified Liturgy on Thursday of the Fifth Week
