ltx/en_us_dedes/ho.ho15.m02:ho.Days	
ltx/en_us_dedes/ho.ho15.m02:ho.Hours	
ltx/en_us_dedes/ho.ho15.m02:ho.Month	
ltx/en_us_dedes/ho.ho15.m02:hoD01.Apolytikion2.greekmelody	@ltx/en_us_dedes/he.a.m4:heAU.TachyProkatalave.greekname
ltx/en_us_dedes/ho.ho15.m02:hoD01.Apolytikion2.incipit	…
ltx/en_us_dedes/ho.ho15.m02:hoD01.Apolytikion2.melody	@ltx/en_us_dedes/he.a.m4:heAU.TachyProkatalave.name
ltx/en_us_dedes/ho.ho15.m02:hoD01.Apolytikion2.mode	@ltx/en_us_dedes/miscellanea:misc.Mode4
ltx/en_us_dedes/ho.ho15.m02:hoD01.Apolytikion2.poet	
ltx/en_us_dedes/ho.ho15.m02:hoD01.Apolytikion2.text	
ltx/en_us_dedes/ho.ho15.m02:hoD01.Apolytikion2.title	@ltx/en_us_dedes/titles:ti.Martyr
ltx/en_us_dedes/ho.ho15.m02:hoD04.GeneralApolytikion1.name	Isidore,
ltx/en_us_dedes/ho.ho15.m02:hoD06.GeneralApolytikion1.name	Father holy hierarch Bukolus,
ltx/en_us_dedes/ho.ho15.m02:hoD08.GeneralApolytikion2.name	Zacharias
ltx/en_us_dedes/ho.ho15.m02:hoD08.GeneralApolytikion2.text	@ltx/en_us_dedes/properties:media.key
ltx/en_us_dedes/ho.ho15.m02:hoD10.Kontakion1.greekmelody	@ltx/en_us_dedes/he.a.m4:heAU.EpefanisSimeron.greekname
ltx/en_us_dedes/ho.ho15.m02:hoD10.Kontakion1.incipit	…
ltx/en_us_dedes/ho.ho15.m02:hoD10.Kontakion1.melody	@ltx/en_us_dedes/he.a.m4:heAU.EpefanisSimeron.name
ltx/en_us_dedes/ho.ho15.m02:hoD10.Kontakion1.mode	@ltx/en_us_dedes/miscellanea:misc.Mode4
ltx/en_us_dedes/ho.ho15.m02:hoD10.Kontakion1.poet	
ltx/en_us_dedes/ho.ho15.m02:hoD10.Kontakion1.text	
ltx/en_us_dedes/ho.ho15.m02:hoD10.Kontakion1.title	@ltx/en_us_dedes/titles:ti.Hieromartyr
ltx/en_us_dedes/ho.ho15.m02:hoD11.GeneralApolytikion1.name	Blaise,
ltx/en_us_dedes/ho.ho15.m02:hoD12.GeneralApolytikion1.name	Father holy hierarch Meletios,
ltx/en_us_dedes/ho.ho15.m02:hoD14.GeneralApolytikion1.name	Afxentios,
ltx/en_us_dedes/ho.ho15.m02:hoD15.GeneralApolytikion1.name	Onesimus,
ltx/en_us_dedes/ho.ho15.m02:hoD18.GeneralApolytikion1.name	Father holy hierarch Leo,
ltx/en_us_dedes/ho.ho15.m02:hoD19.GeneralApolytikion1.name	Archippus,
ltx/en_us_dedes/ho.ho15.m02:hoD20.GeneralApolytikion1.name	Father holy hierarch Leo,
ltx/en_us_dedes/ho.ho15.m02:hoD23.GeneralApolytikion1.name	Polycarp,
ltx/en_us_dedes/ho.ho15.m02:hoD25.GeneralApolytikion1.name	Father holy hierarch Tarasios,
ltx/en_us_dedes/ho.ho15.m02:hoD26.GeneralApolytikion1.name	Father holy hierarch Porphyrios,
ltx/en_us_dedes/ho.ho15.m02:hoD27.GeneralApolytikion1.name	Procopius,
ltx/en_us_dedes/ho.ho15.m02:hoD28.GeneralApolytikion1.name	Basil,
