ltx/en_us_dedes/eo.e02:eo.Doxasticon.incipit	The women with their ointments…
ltx/en_us_dedes/eo.e02:eo.Doxasticon.mode	@ltx/en_us_dedes/miscellanea:misc.Mode2
ltx/en_us_dedes/eo.e02:eo.Doxasticon.text	The women with their ointments went with Mary to the tomb, and they wondered how they would attain what they desired. Then they saw that the stone was rolled back, and also a godly young man who tried to quiet the disturbance of their souls. For he said, “The Lord Jesus has risen. Therefore, preach it to His Disciples and preachers, that they should go quickly to Galilee; and you will see Him, risen from the dead, as the Giver of Life and Lord.”
ltx/en_us_dedes/eo.e02:eo.Exaposteilarion.greekmelody	@ltx/en_us_dedes/he.a.m2:heAU.ToisMathitaisSynelthomen.greekname
ltx/en_us_dedes/eo.e02:eo.Exaposteilarion.incipit	The women with the myrrh…
ltx/en_us_dedes/eo.e02:eo.Exaposteilarion.melody	@ltx/en_us_dedes/he.a.m2:heAU.ToisMathitaisSynelthomen.name
ltx/en_us_dedes/eo.e02:eo.Exaposteilarion.mode	@ltx/en_us_dedes/miscellanea:misc.Mode2
ltx/en_us_dedes/eo.e02:eo.Exaposteilarion.text	The women with the myrrh rejoiced * when they saw that the great stone * had from the tomb been rolled away. * For they had seen a young man sitting within on the right side. * And he addressed them, saying: * “Lo, Christ has risen from the dead. * Go and tell His disciples and Peter too, * to proceed to Galilee on the mountain. * For He will there appear to you * His friends, as He foretold you.”
ltx/en_us_dedes/eo.e02:eo.Theotokion.incipit	The salutation of “Rejoice,”…
ltx/en_us_dedes/eo.e02:eo.Theotokion.melody	@ltx/en_us_dedes/he.a.m2:heAU.ToisMathitaisSynelthomen.name
ltx/en_us_dedes/eo.e02:eo.Theotokion.mode	@ltx/en_us_dedes/miscellanea:misc.Mode2
ltx/en_us_dedes/eo.e02:eo.Theotokion.text	The salutation of “Rejoice,” * prior to Your conception * an Angel to the Virgin brought. * Again, O Christ, an Angel * did from Your tomb roll the stone away. * The one, instead of sorrow, * tokens of joy ineffable; instead of death, the other heralded You * the Giver of life and he magnified You * and told the resurrection to * the women and Your mystics.
ltx/en_us_dedes/eo.e02:eo.title	Eothinon 2.
