ltx/en_us_dedes/me.m01.d08:meDA.commemoration.first	Memory of our St. George the Chozebite
ltx/en_us_dedes/me.m01.d08:meDA.commemoration.first_name	
ltx/en_us_dedes/me.m01.d08:meDA.commemoration.first_short	Memory of our St. George the Chozebite
ltx/en_us_dedes/me.m01.d08:meDA.commemoration.first_title	@ltx/en_us_dedes/titles:ti.DevoutSaintM
ltx/en_us_dedes/me.m01.d08:meDA.commemoration.full	Memory of our Devout Father George the Chozebite, and our Devout Mother Domnika
ltx/en_us_dedes/me.m01.d08:meDA.commemoration.second_name	
ltx/en_us_dedes/me.m01.d08:meDA.commemoration.second_title	@ltx/en_us_dedes/titles:ti.SaintW
ltx/en_us_dedes/me.m01.d08:meDA.date	January 8
ltx/en_us_dedes/me.m01.d08:meDA.dismissal	@ltx/en_us_dedes/dismissals:dis00.epiphany
ltx/en_us_dedes/me.m01.d08:meDA.fordate	for January 8
ltx/en_us_dedes/me.m01.d08:meDA.insert1	
ltx/en_us_dedes/me.m01.d08:meDA.insert2	
ltx/en_us_dedes/me.m01.d08:meDA.note	
ltx/en_us_dedes/me.m01.d08:meDA.pdfcoverdate	January 8,
ltx/en_us_dedes/me.m01.d08:meDA.pdfheaderdate	January 8
ltx/en_us_dedes/me.m01.d08:meHO.commemorations	
ltx/en_us_dedes/me.m01.d08:meHO.note1	
ltx/en_us_dedes/me.m01.d08:meHO.note2	
ltx/en_us_dedes/me.m01.d08:meHO.number	8.
ltx/en_us_dedes/me.m01.d08:meHO.rank	
ltx/en_us_dedes/me.m01.d08:meLE.commemoration1	
ltx/en_us_dedes/me.m01.d08:meLE.commemoration2	
ltx/en_us_dedes/me.m01.d08:meLI.Kontakion1.incipit	…
ltx/en_us_dedes/me.m01.d08:meLI.Kontakion1.melody	
ltx/en_us_dedes/me.m01.d08:meLI.Kontakion1.mode	
ltx/en_us_dedes/me.m01.d08:meLI.Kontakion1.text	
ltx/en_us_dedes/me.m01.d08:meLI.Megalynarion.text	
ltx/en_us_dedes/me.m01.d08:meMA.AposGlory.incipit	Our redemption has come *…
ltx/en_us_dedes/me.m01.d08:meMA.AposGlory.melody	@ltx/en_us_dedes/he.a.m2:heAU.OikosTouEfratha.name
ltx/en_us_dedes/me.m01.d08:meMA.AposGlory.mode	@ltx/en_us_dedes/miscellanea:misc.Mode2
ltx/en_us_dedes/me.m01.d08:meMA.AposGlory.text	Our redemption has come * and our illumination, * appearing at the Jordan. * Come let us all be washed there * together as we celebrate.
ltx/en_us_dedes/me.m01.d08:meMA.Aposticha1.greekmelody	@ltx/en_us_dedes/he.a.m2:heAU.OikosTouEfratha.greekname
ltx/en_us_dedes/me.m01.d08:meMA.Aposticha1.incipit	Great and terrific is *…
ltx/en_us_dedes/me.m01.d08:meMA.Aposticha1.melody	@ltx/en_us_dedes/he.a.m2:heAU.OikosTouEfratha.name
ltx/en_us_dedes/me.m01.d08:meMA.Aposticha1.mode	@ltx/en_us_dedes/miscellanea:misc.Mode2
ltx/en_us_dedes/me.m01.d08:meMA.Aposticha1.text	Great and terrific is * the mystery unfolding! * The Lord of all is baptized * at the hands of a servant * to wash all of humanity.
ltx/en_us_dedes/me.m01.d08:meMA.Aposticha2.incipit	God the Father cried out…
ltx/en_us_dedes/me.m01.d08:meMA.Aposticha2.melody	@ltx/en_us_dedes/he.a.m2:heAU.OikosTouEfratha.name
ltx/en_us_dedes/me.m01.d08:meMA.Aposticha2.mode	@ltx/en_us_dedes/miscellanea:misc.Mode2
ltx/en_us_dedes/me.m01.d08:meMA.Aposticha2.text	God the Father cried out * from heaven, “He who is now * physically being baptized * within the River Jordan * indeed is my beloved Son.”
ltx/en_us_dedes/me.m01.d08:meMA.Aposticha3.incipit	When the angelic hosts *…
ltx/en_us_dedes/me.m01.d08:meMA.Aposticha3.melody	@ltx/en_us_dedes/he.a.m2:heAU.OikosTouEfratha.name
ltx/en_us_dedes/me.m01.d08:meMA.Aposticha3.mode	@ltx/en_us_dedes/miscellanea:misc.Mode2
ltx/en_us_dedes/me.m01.d08:meMA.Aposticha3.text	When the angelic hosts * beheld their Lord and Master * in the form of as a servant * be baptized in the River, * they marveled as they sang His praise.
ltx/en_us_dedes/me.m01.d08:meMA.C1.title	@ltx/en_us_dedes/titles:ti.CanonDevoutM
ltx/en_us_dedes/me.m01.d08:meMA.C1.verse	@ltx/en_us_dedes/prayers:pr.verse_DevoutMan.text
ltx/en_us_dedes/me.m01.d08:meMA.C2.acrostic.notice1	
ltx/en_us_dedes/me.m01.d08:meMA.C2.acrostic.text	
ltx/en_us_dedes/me.m01.d08:meMA.C2.acrostic.title	
ltx/en_us_dedes/me.m01.d08:meMA.C2.title	@ltx/en_us_dedes/titles:ti.CanonDevoutW
ltx/en_us_dedes/me.m01.d08:meMA.C2.verse	@ltx/en_us_dedes/prayers:pr.verse_DevoutWoman.text
ltx/en_us_dedes/me.m01.d08:meMA.Exaposteilarion1.greekmelody	@ltx/en_us_dedes/he.a.m3:heAU.EpeskepsatoImas.greekname
ltx/en_us_dedes/me.m01.d08:meMA.Exaposteilarion1.incipit	Modest lady, you disdained *…
ltx/en_us_dedes/me.m01.d08:meMA.Exaposteilarion1.melody	@ltx/en_us_dedes/he.a.m3:heAU.EpeskepsatoImas.name
ltx/en_us_dedes/me.m01.d08:meMA.Exaposteilarion1.mode	@ltx/en_us_dedes/miscellanea:misc.Mode3
ltx/en_us_dedes/me.m01.d08:meMA.Exaposteilarion1.text	Modest lady, you disdained * all things corrupted and mundane. * You made things heavenly and incorrupt * the objects of your strong desire, * in your most ardent zeal for Christ. * And therefore He has crowned you * with incorruptible halos.
ltx/en_us_dedes/me.m01.d08:meMA.Exaposteilarion2.greekmelody	@ltx/en_us_dedes/he.a.m3:heAU.EpefaniOSotir.greekname
ltx/en_us_dedes/me.m01.d08:meMA.Exaposteilarion2.incipit	@ltx/en_us_dedes/he.a.m3:heAU.EpefaniOSotir.incipit
ltx/en_us_dedes/me.m01.d08:meMA.Exaposteilarion2.melody	@ltx/en_us_dedes/he.a.m3:heAU.EpefaniOSotir.melody
ltx/en_us_dedes/me.m01.d08:meMA.Exaposteilarion2.mode	@ltx/en_us_dedes/miscellanea:misc.Mode3
ltx/en_us_dedes/me.m01.d08:meMA.Exaposteilarion2.text	@ltx/en_us_dedes/he.a.m3:heAU.EpefaniOSotir.text
ltx/en_us_dedes/me.m01.d08:meMA.Kathisma11.greekmelody	@ltx/en_us_dedes/he.a.m4:heAU.KateplagiIosif.greekname
ltx/en_us_dedes/me.m01.d08:meMA.Kathisma11.incipit	When he led the Ark…
ltx/en_us_dedes/me.m01.d08:meMA.Kathisma11.melody	@ltx/en_us_dedes/he.a.m4:heAU.KateplagiIosif.name
ltx/en_us_dedes/me.m01.d08:meMA.Kathisma11.mode	@ltx/en_us_dedes/miscellanea:misc.Mode4
ltx/en_us_dedes/me.m01.d08:meMA.Kathisma11.text	When he led the Ark of God * and all the people across * River Jordan then of old, * Joshua the son of Nun * was foreshadowing the future blessing. * The passover of both, which was mystical, * was an image and a type truly infallible * that foreshadowed our re-formation * and regeneration in the Spirit. * Christ appeared in the Jordan River, * to sanctify the waters.
ltx/en_us_dedes/me.m01.d08:meMA.Kathisma21.greekmelody	@ltx/en_us_dedes/he.a.m8:heAU.AvlonPoimenikon.greekname
ltx/en_us_dedes/me.m01.d08:meMA.Kathisma21.incipit	…
ltx/en_us_dedes/me.m01.d08:meMA.Kathisma21.melody	@ltx/en_us_dedes/he.a.m8:heAU.AvlonPoimenikon.name
ltx/en_us_dedes/me.m01.d08:meMA.Kathisma21.mode	@ltx/en_us_dedes/miscellanea:misc.Mode8
ltx/en_us_dedes/me.m01.d08:meMA.Kathisma21.text	
ltx/en_us_dedes/me.m01.d08:meMA.Ode1C11.greekmelody	@ltx/en_us_dedes/he.h.m4:heHE.AnoixoToStomaMou.greekname
ltx/en_us_dedes/me.m01.d08:meMA.Ode1C11.incipit	…
ltx/en_us_dedes/me.m01.d08:meMA.Ode1C11.melody	@ltx/en_us_dedes/he.h.m4:heHE.AnoixoToStomaMou.name
ltx/en_us_dedes/me.m01.d08:meMA.Ode1C11.mode	@ltx/en_us_dedes/miscellanea:misc.Mode4
ltx/en_us_dedes/me.m01.d08:meMA.Ode1C11.ode	@ltx/en_us_dedes/miscellanea:misc.Ode1
ltx/en_us_dedes/me.m01.d08:meMA.Ode1C11.text	
ltx/en_us_dedes/me.m01.d08:meMA.Ode1C12.incipit	…
ltx/en_us_dedes/me.m01.d08:meMA.Ode1C12.melody	@ltx/en_us_dedes/he.h.m4:heHE.AnoixoToStomaMou.name
ltx/en_us_dedes/me.m01.d08:meMA.Ode1C12.mode	@ltx/en_us_dedes/miscellanea:misc.Mode4
ltx/en_us_dedes/me.m01.d08:meMA.Ode1C12.ode	@ltx/en_us_dedes/miscellanea:misc.Ode1
ltx/en_us_dedes/me.m01.d08:meMA.Ode1C12.text	
ltx/en_us_dedes/me.m01.d08:meMA.Ode1C13.incipit	…
ltx/en_us_dedes/me.m01.d08:meMA.Ode1C13.melody	@ltx/en_us_dedes/he.h.m4:heHE.AnoixoToStomaMou.name
ltx/en_us_dedes/me.m01.d08:meMA.Ode1C13.mode	@ltx/en_us_dedes/miscellanea:misc.Mode4
ltx/en_us_dedes/me.m01.d08:meMA.Ode1C13.ode	@ltx/en_us_dedes/miscellanea:misc.Ode1
ltx/en_us_dedes/me.m01.d08:meMA.Ode1C13.text	
ltx/en_us_dedes/me.m01.d08:meMA.Ode1C1T.incipit	…
ltx/en_us_dedes/me.m01.d08:meMA.Ode1C1T.melody	@ltx/en_us_dedes/he.h.m4:heHE.AnoixoToStomaMou.name
ltx/en_us_dedes/me.m01.d08:meMA.Ode1C1T.mode	@ltx/en_us_dedes/miscellanea:misc.Mode4
ltx/en_us_dedes/me.m01.d08:meMA.Ode1C1T.ode	@ltx/en_us_dedes/miscellanea:misc.Ode1
ltx/en_us_dedes/me.m01.d08:meMA.Ode1C1T.text	
ltx/en_us_dedes/me.m01.d08:meMA.Ode1C21.greekmelody	@ltx/en_us_dedes/he.h.m2:heHE.EnVythoKatestrose.greekname
ltx/en_us_dedes/me.m01.d08:meMA.Ode1C21.incipit	…
ltx/en_us_dedes/me.m01.d08:meMA.Ode1C21.melody	@ltx/en_us_dedes/he.h.m2:heHE.EnVythoKatestrose.name
ltx/en_us_dedes/me.m01.d08:meMA.Ode1C21.mode	@ltx/en_us_dedes/miscellanea:misc.Mode2
ltx/en_us_dedes/me.m01.d08:meMA.Ode1C21.ode	@ltx/en_us_dedes/miscellanea:misc.Ode1
ltx/en_us_dedes/me.m01.d08:meMA.Ode1C21.text	
ltx/en_us_dedes/me.m01.d08:meMA.Ode1C22.incipit	…
ltx/en_us_dedes/me.m01.d08:meMA.Ode1C22.melody	@ltx/en_us_dedes/he.h.m2:heHE.EnVythoKatestrose.name
ltx/en_us_dedes/me.m01.d08:meMA.Ode1C22.mode	@ltx/en_us_dedes/miscellanea:misc.Mode2
ltx/en_us_dedes/me.m01.d08:meMA.Ode1C22.ode	@ltx/en_us_dedes/miscellanea:misc.Ode1
ltx/en_us_dedes/me.m01.d08:meMA.Ode1C22.text	
ltx/en_us_dedes/me.m01.d08:meMA.Ode1C23.incipit	…
ltx/en_us_dedes/me.m01.d08:meMA.Ode1C23.melody	@ltx/en_us_dedes/he.h.m2:heHE.EnVythoKatestrose.name
ltx/en_us_dedes/me.m01.d08:meMA.Ode1C23.mode	@ltx/en_us_dedes/miscellanea:misc.Mode2
ltx/en_us_dedes/me.m01.d08:meMA.Ode1C23.ode	@ltx/en_us_dedes/miscellanea:misc.Ode1
ltx/en_us_dedes/me.m01.d08:meMA.Ode1C23.text	
ltx/en_us_dedes/me.m01.d08:meMA.Ode1C2T.incipit	…
ltx/en_us_dedes/me.m01.d08:meMA.Ode1C2T.melody	@ltx/en_us_dedes/he.h.m2:heHE.EnVythoKatestrose.name
ltx/en_us_dedes/me.m01.d08:meMA.Ode1C2T.mode	@ltx/en_us_dedes/miscellanea:misc.Mode2
ltx/en_us_dedes/me.m01.d08:meMA.Ode1C2T.ode	@ltx/en_us_dedes/miscellanea:misc.Ode1
ltx/en_us_dedes/me.m01.d08:meMA.Ode1C2T.text	
ltx/en_us_dedes/me.m01.d08:meMA.Ode3C11.greekmelody	@ltx/en_us_dedes/he.h.m4:heHE.TousSousYmnologous.greekname
ltx/en_us_dedes/me.m01.d08:meMA.Ode3C11.incipit	…
ltx/en_us_dedes/me.m01.d08:meMA.Ode3C11.melody	@ltx/en_us_dedes/he.h.m4:heHE.TousSousYmnologous.name
ltx/en_us_dedes/me.m01.d08:meMA.Ode3C11.mode	@ltx/en_us_dedes/miscellanea:misc.Mode4
ltx/en_us_dedes/me.m01.d08:meMA.Ode3C11.ode	@ltx/en_us_dedes/miscellanea:misc.Ode3
ltx/en_us_dedes/me.m01.d08:meMA.Ode3C11.text	
ltx/en_us_dedes/me.m01.d08:meMA.Ode3C12.incipit	…
ltx/en_us_dedes/me.m01.d08:meMA.Ode3C12.melody	@ltx/en_us_dedes/he.h.m4:heHE.TousSousYmnologous.name
ltx/en_us_dedes/me.m01.d08:meMA.Ode3C12.mode	@ltx/en_us_dedes/miscellanea:misc.Mode4
ltx/en_us_dedes/me.m01.d08:meMA.Ode3C12.ode	@ltx/en_us_dedes/miscellanea:misc.Ode3
ltx/en_us_dedes/me.m01.d08:meMA.Ode3C12.text	
ltx/en_us_dedes/me.m01.d08:meMA.Ode3C13.incipit	…
ltx/en_us_dedes/me.m01.d08:meMA.Ode3C13.melody	@ltx/en_us_dedes/he.h.m4:heHE.TousSousYmnologous.name
ltx/en_us_dedes/me.m01.d08:meMA.Ode3C13.mode	@ltx/en_us_dedes/miscellanea:misc.Mode4
ltx/en_us_dedes/me.m01.d08:meMA.Ode3C13.ode	@ltx/en_us_dedes/miscellanea:misc.Ode3
ltx/en_us_dedes/me.m01.d08:meMA.Ode3C13.text	
ltx/en_us_dedes/me.m01.d08:meMA.Ode3C1T.incipit	…
ltx/en_us_dedes/me.m01.d08:meMA.Ode3C1T.melody	@ltx/en_us_dedes/he.h.m4:heHE.TousSousYmnologous.name
ltx/en_us_dedes/me.m01.d08:meMA.Ode3C1T.mode	@ltx/en_us_dedes/miscellanea:misc.Mode4
ltx/en_us_dedes/me.m01.d08:meMA.Ode3C1T.ode	@ltx/en_us_dedes/miscellanea:misc.Ode3
ltx/en_us_dedes/me.m01.d08:meMA.Ode3C1T.text	
ltx/en_us_dedes/me.m01.d08:meMA.Ode3C21.greekmelody	@ltx/en_us_dedes/he.h.m2:heHE.ExinthisenIErimos.greekname
ltx/en_us_dedes/me.m01.d08:meMA.Ode3C21.incipit	…
ltx/en_us_dedes/me.m01.d08:meMA.Ode3C21.melody	@ltx/en_us_dedes/he.h.m2:heHE.ExinthisenIErimos.name
ltx/en_us_dedes/me.m01.d08:meMA.Ode3C21.mode	@ltx/en_us_dedes/miscellanea:misc.Mode2
ltx/en_us_dedes/me.m01.d08:meMA.Ode3C21.ode	@ltx/en_us_dedes/miscellanea:misc.Ode3
ltx/en_us_dedes/me.m01.d08:meMA.Ode3C21.text	
ltx/en_us_dedes/me.m01.d08:meMA.Ode3C22.incipit	…
ltx/en_us_dedes/me.m01.d08:meMA.Ode3C22.melody	@ltx/en_us_dedes/he.h.m2:heHE.ExinthisenIErimos.name
ltx/en_us_dedes/me.m01.d08:meMA.Ode3C22.mode	@ltx/en_us_dedes/miscellanea:misc.Mode2
ltx/en_us_dedes/me.m01.d08:meMA.Ode3C22.ode	@ltx/en_us_dedes/miscellanea:misc.Ode3
ltx/en_us_dedes/me.m01.d08:meMA.Ode3C22.text	
ltx/en_us_dedes/me.m01.d08:meMA.Ode3C23.incipit	…
ltx/en_us_dedes/me.m01.d08:meMA.Ode3C23.melody	@ltx/en_us_dedes/he.h.m2:heHE.ExinthisenIErimos.name
ltx/en_us_dedes/me.m01.d08:meMA.Ode3C23.mode	@ltx/en_us_dedes/miscellanea:misc.Mode2
ltx/en_us_dedes/me.m01.d08:meMA.Ode3C23.ode	@ltx/en_us_dedes/miscellanea:misc.Ode3
ltx/en_us_dedes/me.m01.d08:meMA.Ode3C23.text	
ltx/en_us_dedes/me.m01.d08:meMA.Ode3C2T.incipit	…
ltx/en_us_dedes/me.m01.d08:meMA.Ode3C2T.melody	@ltx/en_us_dedes/he.h.m2:heHE.ExinthisenIErimos.name
ltx/en_us_dedes/me.m01.d08:meMA.Ode3C2T.mode	@ltx/en_us_dedes/miscellanea:misc.Mode2
ltx/en_us_dedes/me.m01.d08:meMA.Ode3C2T.ode	@ltx/en_us_dedes/miscellanea:misc.Ode3
ltx/en_us_dedes/me.m01.d08:meMA.Ode3C2T.text	
ltx/en_us_dedes/me.m01.d08:meMA.Ode3H.greekmelody	@ltx/en_us_dedes/he.h.m2:heHE.ExinthisenIErimos.greekname
ltx/en_us_dedes/me.m01.d08:meMA.Ode3H.incipit	@ltx/en_us_dedes/he.h.m2:heHE.ExinthisenIErimos.incipit
ltx/en_us_dedes/me.m01.d08:meMA.Ode3H.melody	@ltx/en_us_dedes/he.h.m2:heHE.ExinthisenIErimos.melody
ltx/en_us_dedes/me.m01.d08:meMA.Ode3H.mode	@ltx/en_us_dedes/miscellanea:misc.Mode2
ltx/en_us_dedes/me.m01.d08:meMA.Ode3H.ode	@ltx/en_us_dedes/miscellanea:misc.Ode3
ltx/en_us_dedes/me.m01.d08:meMA.Ode3H.text	@ltx/en_us_dedes/he.h.m2:heHE.ExinthisenIErimos.text
ltx/en_us_dedes/me.m01.d08:meMA.Ode3Kathisma1.greekmelody	@ltx/en_us_dedes/he.a.m4:heAU.TachyProkatalave.greekname
ltx/en_us_dedes/me.m01.d08:meMA.Ode3Kathisma1.incipit	…
ltx/en_us_dedes/me.m01.d08:meMA.Ode3Kathisma1.melody	@ltx/en_us_dedes/he.a.m4:heAU.TachyProkatalave.name
ltx/en_us_dedes/me.m01.d08:meMA.Ode3Kathisma1.mode	@ltx/en_us_dedes/miscellanea:misc.Mode4
ltx/en_us_dedes/me.m01.d08:meMA.Ode3Kathisma1.text	
ltx/en_us_dedes/me.m01.d08:meMA.Ode3Kathisma2.greekmelody	@ltx/en_us_dedes/he.a.m4:heAU.TachyProkatalave.greekname
ltx/en_us_dedes/me.m01.d08:meMA.Ode3Kathisma2.incipit	@ltx/en_us_dedes/me.m01.d06:meMA.Kathisma31.incipit
ltx/en_us_dedes/me.m01.d08:meMA.Ode3Kathisma2.melody	@ltx/en_us_dedes/he.a.m4:heAU.TachyProkatalave.name
ltx/en_us_dedes/me.m01.d08:meMA.Ode3Kathisma2.mode	@ltx/en_us_dedes/miscellanea:misc.Mode4
ltx/en_us_dedes/me.m01.d08:meMA.Ode3Kathisma2.text	@ltx/en_us_dedes/me.m01.d06:meMA.Kathisma31.text
ltx/en_us_dedes/me.m01.d08:meMA.Ode4C11.greekmelody	@ltx/en_us_dedes/he.h.m4:heHE.OKathimenosEnDoxi.greekname
ltx/en_us_dedes/me.m01.d08:meMA.Ode4C11.incipit	…
ltx/en_us_dedes/me.m01.d08:meMA.Ode4C11.melody	@ltx/en_us_dedes/he.h.m4:heHE.OKathimenosEnDoxi.name
ltx/en_us_dedes/me.m01.d08:meMA.Ode4C11.mode	@ltx/en_us_dedes/miscellanea:misc.Mode4
ltx/en_us_dedes/me.m01.d08:meMA.Ode4C11.ode	@ltx/en_us_dedes/miscellanea:misc.Ode4
ltx/en_us_dedes/me.m01.d08:meMA.Ode4C11.text	
ltx/en_us_dedes/me.m01.d08:meMA.Ode4C12.incipit	…
ltx/en_us_dedes/me.m01.d08:meMA.Ode4C12.melody	@ltx/en_us_dedes/he.h.m4:heHE.OKathimenosEnDoxi.name
ltx/en_us_dedes/me.m01.d08:meMA.Ode4C12.mode	@ltx/en_us_dedes/miscellanea:misc.Mode4
ltx/en_us_dedes/me.m01.d08:meMA.Ode4C12.ode	@ltx/en_us_dedes/miscellanea:misc.Ode4
ltx/en_us_dedes/me.m01.d08:meMA.Ode4C12.text	
ltx/en_us_dedes/me.m01.d08:meMA.Ode4C13.incipit	…
ltx/en_us_dedes/me.m01.d08:meMA.Ode4C13.melody	@ltx/en_us_dedes/he.h.m4:heHE.OKathimenosEnDoxi.name
ltx/en_us_dedes/me.m01.d08:meMA.Ode4C13.mode	@ltx/en_us_dedes/miscellanea:misc.Mode4
ltx/en_us_dedes/me.m01.d08:meMA.Ode4C13.ode	@ltx/en_us_dedes/miscellanea:misc.Ode4
ltx/en_us_dedes/me.m01.d08:meMA.Ode4C13.text	
ltx/en_us_dedes/me.m01.d08:meMA.Ode4C1T.incipit	…
ltx/en_us_dedes/me.m01.d08:meMA.Ode4C1T.melody	@ltx/en_us_dedes/he.h.m4:heHE.OKathimenosEnDoxi.name
ltx/en_us_dedes/me.m01.d08:meMA.Ode4C1T.mode	@ltx/en_us_dedes/miscellanea:misc.Mode4
ltx/en_us_dedes/me.m01.d08:meMA.Ode4C1T.ode	@ltx/en_us_dedes/miscellanea:misc.Ode4
ltx/en_us_dedes/me.m01.d08:meMA.Ode4C1T.text	
ltx/en_us_dedes/me.m01.d08:meMA.Ode4C21.greekmelody	@ltx/en_us_dedes/he.h.m2:heHE.ElilythasEkParthenou.greekname
ltx/en_us_dedes/me.m01.d08:meMA.Ode4C21.incipit	…
ltx/en_us_dedes/me.m01.d08:meMA.Ode4C21.melody	@ltx/en_us_dedes/he.h.m2:heHE.ElilythasEkParthenou.name
ltx/en_us_dedes/me.m01.d08:meMA.Ode4C21.mode	@ltx/en_us_dedes/miscellanea:misc.Mode2
ltx/en_us_dedes/me.m01.d08:meMA.Ode4C21.ode	@ltx/en_us_dedes/miscellanea:misc.Ode4
ltx/en_us_dedes/me.m01.d08:meMA.Ode4C21.text	
ltx/en_us_dedes/me.m01.d08:meMA.Ode4C22.incipit	…
ltx/en_us_dedes/me.m01.d08:meMA.Ode4C22.melody	@ltx/en_us_dedes/he.h.m2:heHE.ElilythasEkParthenou.name
ltx/en_us_dedes/me.m01.d08:meMA.Ode4C22.mode	@ltx/en_us_dedes/miscellanea:misc.Mode2
ltx/en_us_dedes/me.m01.d08:meMA.Ode4C22.ode	@ltx/en_us_dedes/miscellanea:misc.Ode4
ltx/en_us_dedes/me.m01.d08:meMA.Ode4C22.text	
ltx/en_us_dedes/me.m01.d08:meMA.Ode4C23.incipit	…
ltx/en_us_dedes/me.m01.d08:meMA.Ode4C23.melody	@ltx/en_us_dedes/he.h.m2:heHE.ElilythasEkParthenou.name
ltx/en_us_dedes/me.m01.d08:meMA.Ode4C23.mode	@ltx/en_us_dedes/miscellanea:misc.Mode2
ltx/en_us_dedes/me.m01.d08:meMA.Ode4C23.ode	@ltx/en_us_dedes/miscellanea:misc.Ode4
ltx/en_us_dedes/me.m01.d08:meMA.Ode4C23.text	
ltx/en_us_dedes/me.m01.d08:meMA.Ode4C2T.incipit	…
ltx/en_us_dedes/me.m01.d08:meMA.Ode4C2T.melody	@ltx/en_us_dedes/he.h.m2:heHE.ElilythasEkParthenou.name
ltx/en_us_dedes/me.m01.d08:meMA.Ode4C2T.mode	@ltx/en_us_dedes/miscellanea:misc.Mode2
ltx/en_us_dedes/me.m01.d08:meMA.Ode4C2T.ode	@ltx/en_us_dedes/miscellanea:misc.Ode4
ltx/en_us_dedes/me.m01.d08:meMA.Ode4C2T.text	
ltx/en_us_dedes/me.m01.d08:meMA.Ode5C11.greekmelody	@ltx/en_us_dedes/he.h.m4:heHE.ExestiTaSympanta.greekname
ltx/en_us_dedes/me.m01.d08:meMA.Ode5C11.incipit	…
ltx/en_us_dedes/me.m01.d08:meMA.Ode5C11.melody	@ltx/en_us_dedes/he.h.m4:heHE.ExestiTaSympanta.name
ltx/en_us_dedes/me.m01.d08:meMA.Ode5C11.mode	@ltx/en_us_dedes/miscellanea:misc.Mode4
ltx/en_us_dedes/me.m01.d08:meMA.Ode5C11.ode	@ltx/en_us_dedes/miscellanea:misc.Ode5
ltx/en_us_dedes/me.m01.d08:meMA.Ode5C11.text	
ltx/en_us_dedes/me.m01.d08:meMA.Ode5C12.incipit	…
ltx/en_us_dedes/me.m01.d08:meMA.Ode5C12.melody	@ltx/en_us_dedes/he.h.m4:heHE.ExestiTaSympanta.name
ltx/en_us_dedes/me.m01.d08:meMA.Ode5C12.mode	@ltx/en_us_dedes/miscellanea:misc.Mode4
ltx/en_us_dedes/me.m01.d08:meMA.Ode5C12.ode	@ltx/en_us_dedes/miscellanea:misc.Ode5
ltx/en_us_dedes/me.m01.d08:meMA.Ode5C12.text	
ltx/en_us_dedes/me.m01.d08:meMA.Ode5C13.incipit	…
ltx/en_us_dedes/me.m01.d08:meMA.Ode5C13.melody	@ltx/en_us_dedes/he.h.m4:heHE.ExestiTaSympanta.name
ltx/en_us_dedes/me.m01.d08:meMA.Ode5C13.mode	@ltx/en_us_dedes/miscellanea:misc.Mode4
ltx/en_us_dedes/me.m01.d08:meMA.Ode5C13.ode	@ltx/en_us_dedes/miscellanea:misc.Ode5
ltx/en_us_dedes/me.m01.d08:meMA.Ode5C13.text	
ltx/en_us_dedes/me.m01.d08:meMA.Ode5C1T.incipit	…
ltx/en_us_dedes/me.m01.d08:meMA.Ode5C1T.melody	@ltx/en_us_dedes/he.h.m4:heHE.ExestiTaSympanta.name
ltx/en_us_dedes/me.m01.d08:meMA.Ode5C1T.mode	@ltx/en_us_dedes/miscellanea:misc.Mode4
ltx/en_us_dedes/me.m01.d08:meMA.Ode5C1T.ode	@ltx/en_us_dedes/miscellanea:misc.Ode5
ltx/en_us_dedes/me.m01.d08:meMA.Ode5C1T.text	
ltx/en_us_dedes/me.m01.d08:meMA.Ode5C21.greekmelody	@ltx/en_us_dedes/he.h.m2:heHE.OTouFotosChorigos.greekname
ltx/en_us_dedes/me.m01.d08:meMA.Ode5C21.incipit	…
ltx/en_us_dedes/me.m01.d08:meMA.Ode5C21.melody	@ltx/en_us_dedes/he.h.m2:heHE.OTouFotosChorigos.name
ltx/en_us_dedes/me.m01.d08:meMA.Ode5C21.mode	@ltx/en_us_dedes/miscellanea:misc.Mode2
ltx/en_us_dedes/me.m01.d08:meMA.Ode5C21.ode	@ltx/en_us_dedes/miscellanea:misc.Ode5
ltx/en_us_dedes/me.m01.d08:meMA.Ode5C21.text	
ltx/en_us_dedes/me.m01.d08:meMA.Ode5C22.incipit	…
ltx/en_us_dedes/me.m01.d08:meMA.Ode5C22.melody	@ltx/en_us_dedes/he.h.m2:heHE.OTouFotosChorigos.name
ltx/en_us_dedes/me.m01.d08:meMA.Ode5C22.mode	@ltx/en_us_dedes/miscellanea:misc.Mode2
ltx/en_us_dedes/me.m01.d08:meMA.Ode5C22.ode	@ltx/en_us_dedes/miscellanea:misc.Ode5
ltx/en_us_dedes/me.m01.d08:meMA.Ode5C22.text	
ltx/en_us_dedes/me.m01.d08:meMA.Ode5C23.incipit	…
ltx/en_us_dedes/me.m01.d08:meMA.Ode5C23.melody	@ltx/en_us_dedes/he.h.m2:heHE.OTouFotosChorigos.name
ltx/en_us_dedes/me.m01.d08:meMA.Ode5C23.mode	@ltx/en_us_dedes/miscellanea:misc.Mode2
ltx/en_us_dedes/me.m01.d08:meMA.Ode5C23.ode	@ltx/en_us_dedes/miscellanea:misc.Ode5
ltx/en_us_dedes/me.m01.d08:meMA.Ode5C23.text	
ltx/en_us_dedes/me.m01.d08:meMA.Ode5C2T.incipit	…
ltx/en_us_dedes/me.m01.d08:meMA.Ode5C2T.melody	@ltx/en_us_dedes/he.h.m2:heHE.OTouFotosChorigos.name
ltx/en_us_dedes/me.m01.d08:meMA.Ode5C2T.mode	@ltx/en_us_dedes/miscellanea:misc.Mode2
ltx/en_us_dedes/me.m01.d08:meMA.Ode5C2T.ode	@ltx/en_us_dedes/miscellanea:misc.Ode5
ltx/en_us_dedes/me.m01.d08:meMA.Ode5C2T.text	
ltx/en_us_dedes/me.m01.d08:meMA.Ode6C11.greekmelody	@ltx/en_us_dedes/he.h.m4:heHE.EvoiseProtypon.greekname
ltx/en_us_dedes/me.m01.d08:meMA.Ode6C11.incipit	…
ltx/en_us_dedes/me.m01.d08:meMA.Ode6C11.melody	@ltx/en_us_dedes/he.h.m4:heHE.EvoiseProtypon.name
ltx/en_us_dedes/me.m01.d08:meMA.Ode6C11.mode	@ltx/en_us_dedes/miscellanea:misc.Mode4
ltx/en_us_dedes/me.m01.d08:meMA.Ode6C11.ode	@ltx/en_us_dedes/miscellanea:misc.Ode6
ltx/en_us_dedes/me.m01.d08:meMA.Ode6C11.text	
ltx/en_us_dedes/me.m01.d08:meMA.Ode6C12.incipit	…
ltx/en_us_dedes/me.m01.d08:meMA.Ode6C12.melody	@ltx/en_us_dedes/he.h.m4:heHE.EvoiseProtypon.name
ltx/en_us_dedes/me.m01.d08:meMA.Ode6C12.mode	@ltx/en_us_dedes/miscellanea:misc.Mode4
ltx/en_us_dedes/me.m01.d08:meMA.Ode6C12.ode	@ltx/en_us_dedes/miscellanea:misc.Ode6
ltx/en_us_dedes/me.m01.d08:meMA.Ode6C12.text	
ltx/en_us_dedes/me.m01.d08:meMA.Ode6C13.incipit	…
ltx/en_us_dedes/me.m01.d08:meMA.Ode6C13.melody	@ltx/en_us_dedes/he.h.m4:heHE.EvoiseProtypon.name
ltx/en_us_dedes/me.m01.d08:meMA.Ode6C13.mode	@ltx/en_us_dedes/miscellanea:misc.Mode4
ltx/en_us_dedes/me.m01.d08:meMA.Ode6C13.ode	@ltx/en_us_dedes/miscellanea:misc.Ode6
ltx/en_us_dedes/me.m01.d08:meMA.Ode6C13.text	
ltx/en_us_dedes/me.m01.d08:meMA.Ode6C1T.incipit	…
ltx/en_us_dedes/me.m01.d08:meMA.Ode6C1T.melody	@ltx/en_us_dedes/he.h.m4:heHE.EvoiseProtypon.name
ltx/en_us_dedes/me.m01.d08:meMA.Ode6C1T.mode	@ltx/en_us_dedes/miscellanea:misc.Mode4
ltx/en_us_dedes/me.m01.d08:meMA.Ode6C1T.ode	@ltx/en_us_dedes/miscellanea:misc.Ode6
ltx/en_us_dedes/me.m01.d08:meMA.Ode6C1T.text	
ltx/en_us_dedes/me.m01.d08:meMA.Ode6C21.greekmelody	@ltx/en_us_dedes/he.h.m2:heHE.EnAvyssoPtaismaton.greekname
ltx/en_us_dedes/me.m01.d08:meMA.Ode6C21.incipit	…
ltx/en_us_dedes/me.m01.d08:meMA.Ode6C21.melody	@ltx/en_us_dedes/he.h.m2:heHE.EnAvyssoPtaismaton.name
ltx/en_us_dedes/me.m01.d08:meMA.Ode6C21.mode	@ltx/en_us_dedes/miscellanea:misc.Mode2
ltx/en_us_dedes/me.m01.d08:meMA.Ode6C21.ode	@ltx/en_us_dedes/miscellanea:misc.Ode6
ltx/en_us_dedes/me.m01.d08:meMA.Ode6C21.text	
ltx/en_us_dedes/me.m01.d08:meMA.Ode6C22.incipit	…
ltx/en_us_dedes/me.m01.d08:meMA.Ode6C22.melody	@ltx/en_us_dedes/he.h.m2:heHE.EnAvyssoPtaismaton.name
ltx/en_us_dedes/me.m01.d08:meMA.Ode6C22.mode	@ltx/en_us_dedes/miscellanea:misc.Mode2
ltx/en_us_dedes/me.m01.d08:meMA.Ode6C22.ode	@ltx/en_us_dedes/miscellanea:misc.Ode6
ltx/en_us_dedes/me.m01.d08:meMA.Ode6C22.text	
ltx/en_us_dedes/me.m01.d08:meMA.Ode6C23.incipit	…
ltx/en_us_dedes/me.m01.d08:meMA.Ode6C23.melody	@ltx/en_us_dedes/he.h.m2:heHE.EnAvyssoPtaismaton.name
ltx/en_us_dedes/me.m01.d08:meMA.Ode6C23.mode	@ltx/en_us_dedes/miscellanea:misc.Mode2
ltx/en_us_dedes/me.m01.d08:meMA.Ode6C23.ode	@ltx/en_us_dedes/miscellanea:misc.Ode6
ltx/en_us_dedes/me.m01.d08:meMA.Ode6C23.text	
ltx/en_us_dedes/me.m01.d08:meMA.Ode6C2T.incipit	…
ltx/en_us_dedes/me.m01.d08:meMA.Ode6C2T.melody	@ltx/en_us_dedes/he.h.m2:heHE.EnAvyssoPtaismaton.name
ltx/en_us_dedes/me.m01.d08:meMA.Ode6C2T.mode	@ltx/en_us_dedes/miscellanea:misc.Mode2
ltx/en_us_dedes/me.m01.d08:meMA.Ode6C2T.ode	@ltx/en_us_dedes/miscellanea:misc.Ode6
ltx/en_us_dedes/me.m01.d08:meMA.Ode6C2T.text	
ltx/en_us_dedes/me.m01.d08:meMA.Ode6H.greekmelody	@ltx/en_us_dedes/he.h.m2:heHE.EnAvyssoPtaismaton.greekname
ltx/en_us_dedes/me.m01.d08:meMA.Ode6H.incipit	@ltx/en_us_dedes/he.h.m2:heHE.EnAvyssoPtaismaton.incipit
ltx/en_us_dedes/me.m01.d08:meMA.Ode6H.melody	@ltx/en_us_dedes/he.h.m2:heHE.EnAvyssoPtaismaton.melody
ltx/en_us_dedes/me.m01.d08:meMA.Ode6H.mode	@ltx/en_us_dedes/miscellanea:misc.Mode2
ltx/en_us_dedes/me.m01.d08:meMA.Ode6H.ode	@ltx/en_us_dedes/miscellanea:misc.Ode6
ltx/en_us_dedes/me.m01.d08:meMA.Ode6H.text	@ltx/en_us_dedes/he.h.m2:heHE.EnAvyssoPtaismaton.text
ltx/en_us_dedes/me.m01.d08:meMA.Ode7C11.greekmelody	@ltx/en_us_dedes/he.h.m4:heHE.OukElatrefsan.greekname
ltx/en_us_dedes/me.m01.d08:meMA.Ode7C11.incipit	…
ltx/en_us_dedes/me.m01.d08:meMA.Ode7C11.melody	@ltx/en_us_dedes/he.h.m4:heHE.OukElatrefsan.name
ltx/en_us_dedes/me.m01.d08:meMA.Ode7C11.mode	@ltx/en_us_dedes/miscellanea:misc.Mode4
ltx/en_us_dedes/me.m01.d08:meMA.Ode7C11.ode	@ltx/en_us_dedes/miscellanea:misc.Ode7
ltx/en_us_dedes/me.m01.d08:meMA.Ode7C11.text	
ltx/en_us_dedes/me.m01.d08:meMA.Ode7C12.incipit	…
ltx/en_us_dedes/me.m01.d08:meMA.Ode7C12.melody	@ltx/en_us_dedes/he.h.m4:heHE.OukElatrefsan.name
ltx/en_us_dedes/me.m01.d08:meMA.Ode7C12.mode	@ltx/en_us_dedes/miscellanea:misc.Mode4
ltx/en_us_dedes/me.m01.d08:meMA.Ode7C12.ode	@ltx/en_us_dedes/miscellanea:misc.Ode7
ltx/en_us_dedes/me.m01.d08:meMA.Ode7C12.text	
ltx/en_us_dedes/me.m01.d08:meMA.Ode7C13.incipit	…
ltx/en_us_dedes/me.m01.d08:meMA.Ode7C13.melody	@ltx/en_us_dedes/he.h.m4:heHE.OukElatrefsan.name
ltx/en_us_dedes/me.m01.d08:meMA.Ode7C13.mode	@ltx/en_us_dedes/miscellanea:misc.Mode4
ltx/en_us_dedes/me.m01.d08:meMA.Ode7C13.ode	@ltx/en_us_dedes/miscellanea:misc.Ode7
ltx/en_us_dedes/me.m01.d08:meMA.Ode7C13.text	
ltx/en_us_dedes/me.m01.d08:meMA.Ode7C1T.incipit	…
ltx/en_us_dedes/me.m01.d08:meMA.Ode7C1T.melody	@ltx/en_us_dedes/he.h.m4:heHE.OukElatrefsan.name
ltx/en_us_dedes/me.m01.d08:meMA.Ode7C1T.mode	@ltx/en_us_dedes/miscellanea:misc.Mode4
ltx/en_us_dedes/me.m01.d08:meMA.Ode7C1T.ode	@ltx/en_us_dedes/miscellanea:misc.Ode7
ltx/en_us_dedes/me.m01.d08:meMA.Ode7C1T.text	
ltx/en_us_dedes/me.m01.d08:meMA.Ode7C21.greekmelody	@ltx/en_us_dedes/he.h.m2:heHE.AntitheonProstagma.greekname
ltx/en_us_dedes/me.m01.d08:meMA.Ode7C21.incipit	…
ltx/en_us_dedes/me.m01.d08:meMA.Ode7C21.melody	@ltx/en_us_dedes/he.h.m2:heHE.AntitheonProstagma.name
ltx/en_us_dedes/me.m01.d08:meMA.Ode7C21.mode	@ltx/en_us_dedes/miscellanea:misc.Mode2
ltx/en_us_dedes/me.m01.d08:meMA.Ode7C21.ode	@ltx/en_us_dedes/miscellanea:misc.Ode7
ltx/en_us_dedes/me.m01.d08:meMA.Ode7C21.text	
ltx/en_us_dedes/me.m01.d08:meMA.Ode7C22.incipit	…
ltx/en_us_dedes/me.m01.d08:meMA.Ode7C22.melody	@ltx/en_us_dedes/he.h.m2:heHE.AntitheonProstagma.name
ltx/en_us_dedes/me.m01.d08:meMA.Ode7C22.mode	@ltx/en_us_dedes/miscellanea:misc.Mode2
ltx/en_us_dedes/me.m01.d08:meMA.Ode7C22.ode	@ltx/en_us_dedes/miscellanea:misc.Ode7
ltx/en_us_dedes/me.m01.d08:meMA.Ode7C22.text	
ltx/en_us_dedes/me.m01.d08:meMA.Ode7C23.incipit	…
ltx/en_us_dedes/me.m01.d08:meMA.Ode7C23.melody	@ltx/en_us_dedes/he.h.m2:heHE.AntitheonProstagma.name
ltx/en_us_dedes/me.m01.d08:meMA.Ode7C23.mode	@ltx/en_us_dedes/miscellanea:misc.Mode2
ltx/en_us_dedes/me.m01.d08:meMA.Ode7C23.ode	@ltx/en_us_dedes/miscellanea:misc.Ode7
ltx/en_us_dedes/me.m01.d08:meMA.Ode7C23.text	
ltx/en_us_dedes/me.m01.d08:meMA.Ode7C2T.incipit	…
ltx/en_us_dedes/me.m01.d08:meMA.Ode7C2T.melody	@ltx/en_us_dedes/he.h.m2:heHE.AntitheonProstagma.name
ltx/en_us_dedes/me.m01.d08:meMA.Ode7C2T.mode	@ltx/en_us_dedes/miscellanea:misc.Mode2
ltx/en_us_dedes/me.m01.d08:meMA.Ode7C2T.ode	@ltx/en_us_dedes/miscellanea:misc.Ode7
ltx/en_us_dedes/me.m01.d08:meMA.Ode7C2T.text	
ltx/en_us_dedes/me.m01.d08:meMA.Ode8C11.greekmelody	@ltx/en_us_dedes/he.h.m4:heHE.PaidasEvageis.greekname
ltx/en_us_dedes/me.m01.d08:meMA.Ode8C11.incipit	…
ltx/en_us_dedes/me.m01.d08:meMA.Ode8C11.melody	@ltx/en_us_dedes/he.h.m4:heHE.PaidasEvageis.name
ltx/en_us_dedes/me.m01.d08:meMA.Ode8C11.mode	@ltx/en_us_dedes/miscellanea:misc.Mode4
ltx/en_us_dedes/me.m01.d08:meMA.Ode8C11.ode	@ltx/en_us_dedes/miscellanea:misc.Ode8
ltx/en_us_dedes/me.m01.d08:meMA.Ode8C11.text	
ltx/en_us_dedes/me.m01.d08:meMA.Ode8C12.incipit	…
ltx/en_us_dedes/me.m01.d08:meMA.Ode8C12.melody	@ltx/en_us_dedes/he.h.m4:heHE.PaidasEvageis.name
ltx/en_us_dedes/me.m01.d08:meMA.Ode8C12.mode	@ltx/en_us_dedes/miscellanea:misc.Mode4
ltx/en_us_dedes/me.m01.d08:meMA.Ode8C12.ode	@ltx/en_us_dedes/miscellanea:misc.Ode8
ltx/en_us_dedes/me.m01.d08:meMA.Ode8C12.text	
ltx/en_us_dedes/me.m01.d08:meMA.Ode8C13.incipit	…
ltx/en_us_dedes/me.m01.d08:meMA.Ode8C13.melody	@ltx/en_us_dedes/he.h.m4:heHE.PaidasEvageis.name
ltx/en_us_dedes/me.m01.d08:meMA.Ode8C13.mode	@ltx/en_us_dedes/miscellanea:misc.Mode4
ltx/en_us_dedes/me.m01.d08:meMA.Ode8C13.ode	@ltx/en_us_dedes/miscellanea:misc.Ode8
ltx/en_us_dedes/me.m01.d08:meMA.Ode8C13.text	
ltx/en_us_dedes/me.m01.d08:meMA.Ode8C1T.incipit	…
ltx/en_us_dedes/me.m01.d08:meMA.Ode8C1T.melody	@ltx/en_us_dedes/he.h.m4:heHE.PaidasEvageis.name
ltx/en_us_dedes/me.m01.d08:meMA.Ode8C1T.mode	@ltx/en_us_dedes/miscellanea:misc.Mode4
ltx/en_us_dedes/me.m01.d08:meMA.Ode8C1T.ode	@ltx/en_us_dedes/miscellanea:misc.Ode8
ltx/en_us_dedes/me.m01.d08:meMA.Ode8C1T.text	
ltx/en_us_dedes/me.m01.d08:meMA.Ode8C21.greekmelody	@ltx/en_us_dedes/he.h.m2:heHE.TonEnKaminoTouPyros.greekname
ltx/en_us_dedes/me.m01.d08:meMA.Ode8C21.incipit	…
ltx/en_us_dedes/me.m01.d08:meMA.Ode8C21.melody	@ltx/en_us_dedes/he.h.m2:heHE.TonEnKaminoTouPyros.name
ltx/en_us_dedes/me.m01.d08:meMA.Ode8C21.mode	@ltx/en_us_dedes/miscellanea:misc.Mode2
ltx/en_us_dedes/me.m01.d08:meMA.Ode8C21.ode	@ltx/en_us_dedes/miscellanea:misc.Ode8
ltx/en_us_dedes/me.m01.d08:meMA.Ode8C21.text	
ltx/en_us_dedes/me.m01.d08:meMA.Ode8C22.incipit	…
ltx/en_us_dedes/me.m01.d08:meMA.Ode8C22.melody	@ltx/en_us_dedes/he.h.m2:heHE.TonEnKaminoTouPyros.name
ltx/en_us_dedes/me.m01.d08:meMA.Ode8C22.mode	@ltx/en_us_dedes/miscellanea:misc.Mode2
ltx/en_us_dedes/me.m01.d08:meMA.Ode8C22.ode	@ltx/en_us_dedes/miscellanea:misc.Ode8
ltx/en_us_dedes/me.m01.d08:meMA.Ode8C22.text	
ltx/en_us_dedes/me.m01.d08:meMA.Ode8C23.incipit	…
ltx/en_us_dedes/me.m01.d08:meMA.Ode8C23.melody	@ltx/en_us_dedes/he.h.m2:heHE.TonEnKaminoTouPyros.name
ltx/en_us_dedes/me.m01.d08:meMA.Ode8C23.mode	@ltx/en_us_dedes/miscellanea:misc.Mode2
ltx/en_us_dedes/me.m01.d08:meMA.Ode8C23.ode	@ltx/en_us_dedes/miscellanea:misc.Ode8
ltx/en_us_dedes/me.m01.d08:meMA.Ode8C23.text	
ltx/en_us_dedes/me.m01.d08:meMA.Ode8C2T.incipit	…
ltx/en_us_dedes/me.m01.d08:meMA.Ode8C2T.melody	@ltx/en_us_dedes/he.h.m2:heHE.TonEnKaminoTouPyros.name
ltx/en_us_dedes/me.m01.d08:meMA.Ode8C2T.mode	@ltx/en_us_dedes/miscellanea:misc.Mode2
ltx/en_us_dedes/me.m01.d08:meMA.Ode8C2T.ode	@ltx/en_us_dedes/miscellanea:misc.Ode8
ltx/en_us_dedes/me.m01.d08:meMA.Ode8C2T.text	
ltx/en_us_dedes/me.m01.d08:meMA.Ode8H.greekmelody	@ltx/en_us_dedes/he.h.m2:heHE.TonEnKaminoTouPyros.greekname
ltx/en_us_dedes/me.m01.d08:meMA.Ode8H.incipit	@ltx/en_us_dedes/he.h.m2:heHE.TonEnKaminoTouPyros.incipit
ltx/en_us_dedes/me.m01.d08:meMA.Ode8H.melody	@ltx/en_us_dedes/he.h.m2:heHE.TonEnKaminoTouPyros.melody
ltx/en_us_dedes/me.m01.d08:meMA.Ode8H.mode	@ltx/en_us_dedes/miscellanea:misc.Mode2
ltx/en_us_dedes/me.m01.d08:meMA.Ode8H.ode	@ltx/en_us_dedes/miscellanea:misc.Ode8
ltx/en_us_dedes/me.m01.d08:meMA.Ode8H.text	@ltx/en_us_dedes/he.h.m2:heHE.TonEnKaminoTouPyros.text
ltx/en_us_dedes/me.m01.d08:meMA.Ode9C11.greekmelody	@ltx/en_us_dedes/he.h.m4:heHE.ApasGigenis.greekname
ltx/en_us_dedes/me.m01.d08:meMA.Ode9C11.incipit	…
ltx/en_us_dedes/me.m01.d08:meMA.Ode9C11.melody	@ltx/en_us_dedes/he.h.m4:heHE.ApasGigenis.name
ltx/en_us_dedes/me.m01.d08:meMA.Ode9C11.mode	@ltx/en_us_dedes/miscellanea:misc.Mode4
ltx/en_us_dedes/me.m01.d08:meMA.Ode9C11.ode	@ltx/en_us_dedes/miscellanea:misc.Ode9
ltx/en_us_dedes/me.m01.d08:meMA.Ode9C11.text	
ltx/en_us_dedes/me.m01.d08:meMA.Ode9C12.incipit	…
ltx/en_us_dedes/me.m01.d08:meMA.Ode9C12.melody	@ltx/en_us_dedes/he.h.m4:heHE.ApasGigenis.name
ltx/en_us_dedes/me.m01.d08:meMA.Ode9C12.mode	@ltx/en_us_dedes/miscellanea:misc.Mode4
ltx/en_us_dedes/me.m01.d08:meMA.Ode9C12.ode	@ltx/en_us_dedes/miscellanea:misc.Ode9
ltx/en_us_dedes/me.m01.d08:meMA.Ode9C12.text	
ltx/en_us_dedes/me.m01.d08:meMA.Ode9C13.incipit	…
ltx/en_us_dedes/me.m01.d08:meMA.Ode9C13.melody	@ltx/en_us_dedes/he.h.m4:heHE.ApasGigenis.name
ltx/en_us_dedes/me.m01.d08:meMA.Ode9C13.mode	@ltx/en_us_dedes/miscellanea:misc.Mode4
ltx/en_us_dedes/me.m01.d08:meMA.Ode9C13.ode	@ltx/en_us_dedes/miscellanea:misc.Ode9
ltx/en_us_dedes/me.m01.d08:meMA.Ode9C13.text	
ltx/en_us_dedes/me.m01.d08:meMA.Ode9C1T.incipit	…
ltx/en_us_dedes/me.m01.d08:meMA.Ode9C1T.melody	@ltx/en_us_dedes/he.h.m4:heHE.ApasGigenis.name
ltx/en_us_dedes/me.m01.d08:meMA.Ode9C1T.mode	@ltx/en_us_dedes/miscellanea:misc.Mode4
ltx/en_us_dedes/me.m01.d08:meMA.Ode9C1T.ode	@ltx/en_us_dedes/miscellanea:misc.Ode9
ltx/en_us_dedes/me.m01.d08:meMA.Ode9C1T.text	
ltx/en_us_dedes/me.m01.d08:meMA.Ode9C21.greekmelody	@ltx/en_us_dedes/he.h.m2:heHE.TonEkTheouTheonLogon.greekname
ltx/en_us_dedes/me.m01.d08:meMA.Ode9C21.incipit	…
ltx/en_us_dedes/me.m01.d08:meMA.Ode9C21.melody	@ltx/en_us_dedes/he.h.m2:heHE.TonEkTheouTheonLogon.name
ltx/en_us_dedes/me.m01.d08:meMA.Ode9C21.mode	@ltx/en_us_dedes/miscellanea:misc.Mode2
ltx/en_us_dedes/me.m01.d08:meMA.Ode9C21.ode	@ltx/en_us_dedes/miscellanea:misc.Ode9
ltx/en_us_dedes/me.m01.d08:meMA.Ode9C21.text	
ltx/en_us_dedes/me.m01.d08:meMA.Ode9C22.incipit	…
ltx/en_us_dedes/me.m01.d08:meMA.Ode9C22.melody	@ltx/en_us_dedes/he.h.m2:heHE.TonEkTheouTheonLogon.name
ltx/en_us_dedes/me.m01.d08:meMA.Ode9C22.mode	@ltx/en_us_dedes/miscellanea:misc.Mode2
ltx/en_us_dedes/me.m01.d08:meMA.Ode9C22.ode	@ltx/en_us_dedes/miscellanea:misc.Ode9
ltx/en_us_dedes/me.m01.d08:meMA.Ode9C22.text	
ltx/en_us_dedes/me.m01.d08:meMA.Ode9C23.incipit	…
ltx/en_us_dedes/me.m01.d08:meMA.Ode9C23.melody	@ltx/en_us_dedes/he.h.m2:heHE.TonEkTheouTheonLogon.name
ltx/en_us_dedes/me.m01.d08:meMA.Ode9C23.mode	@ltx/en_us_dedes/miscellanea:misc.Mode2
ltx/en_us_dedes/me.m01.d08:meMA.Ode9C23.ode	@ltx/en_us_dedes/miscellanea:misc.Ode9
ltx/en_us_dedes/me.m01.d08:meMA.Ode9C23.text	
ltx/en_us_dedes/me.m01.d08:meMA.Ode9C24.incipit	…
ltx/en_us_dedes/me.m01.d08:meMA.Ode9C24.melody	@ltx/en_us_dedes/he.h.m2:heHE.TonEkTheouTheonLogon.name
ltx/en_us_dedes/me.m01.d08:meMA.Ode9C24.mode	@ltx/en_us_dedes/miscellanea:misc.Mode2
ltx/en_us_dedes/me.m01.d08:meMA.Ode9C24.ode	@ltx/en_us_dedes/miscellanea:misc.Ode9
ltx/en_us_dedes/me.m01.d08:meMA.Ode9C24.text	
ltx/en_us_dedes/me.m01.d08:meMA.Ode9C2T.incipit	…
ltx/en_us_dedes/me.m01.d08:meMA.Ode9C2T.melody	@ltx/en_us_dedes/he.h.m2:heHE.TonEkTheouTheonLogon.name
ltx/en_us_dedes/me.m01.d08:meMA.Ode9C2T.mode	@ltx/en_us_dedes/miscellanea:misc.Mode2
ltx/en_us_dedes/me.m01.d08:meMA.Ode9C2T.ode	@ltx/en_us_dedes/miscellanea:misc.Ode9
ltx/en_us_dedes/me.m01.d08:meMA.Ode9C2T.text	
ltx/en_us_dedes/me.m01.d08:meMA.Ode9H.greekmelody	@ltx/en_us_dedes/he.h.m2:heHE.TonEkTheouTheonLogon.greekname
ltx/en_us_dedes/me.m01.d08:meMA.Ode9H.incipit	@ltx/en_us_dedes/he.h.m2:heHE.TonEkTheouTheonLogon.incipit
ltx/en_us_dedes/me.m01.d08:meMA.Ode9H.melody	@ltx/en_us_dedes/he.h.m2:heHE.TonEkTheouTheonLogon.melody
ltx/en_us_dedes/me.m01.d08:meMA.Ode9H.mode	@ltx/en_us_dedes/miscellanea:misc.Mode2
ltx/en_us_dedes/me.m01.d08:meMA.Ode9H.ode	@ltx/en_us_dedes/miscellanea:misc.Ode9
ltx/en_us_dedes/me.m01.d08:meMA.Ode9H.text	@ltx/en_us_dedes/he.h.m2:heHE.TonEkTheouTheonLogon.text
ltx/en_us_dedes/me.m01.d08:meVE.Apolytikion1.incipit	@ltx/en_us_dedes/me.m01.d06:meVE.Apolytikion1.incipit
ltx/en_us_dedes/me.m01.d08:meVE.Apolytikion1.melody	
ltx/en_us_dedes/me.m01.d08:meVE.Apolytikion1.mode	@ltx/en_us_dedes/miscellanea:misc.Mode1
ltx/en_us_dedes/me.m01.d08:meVE.Apolytikion1.text	@ltx/en_us_dedes/me.m01.d06:meVE.Apolytikion1.text
ltx/en_us_dedes/me.m01.d08:meVE.AposGlory.incipit	@ltx/en_us_dedes/me.m01.d06:meVE.Aposticha1.incipit
ltx/en_us_dedes/me.m01.d08:meVE.AposGlory.melody	
ltx/en_us_dedes/me.m01.d08:meVE.AposGlory.mode	@ltx/en_us_dedes/miscellanea:misc.Mode2
ltx/en_us_dedes/me.m01.d08:meVE.AposGlory.poet	@ltx/en_us_dedes/poets:po.Anatoliou
ltx/en_us_dedes/me.m01.d08:meVE.AposGlory.text	@ltx/en_us_dedes/me.m01.d06:meVE.Aposticha1.text
ltx/en_us_dedes/me.m01.d08:meVE.Aposticha1.greekmelody	@ltx/en_us_dedes/he.a.m6:heAU.AiAngelikai.greekname
ltx/en_us_dedes/me.m01.d08:meVE.Aposticha1.incipit	…
ltx/en_us_dedes/me.m01.d08:meVE.Aposticha1.melody	@ltx/en_us_dedes/he.a.m6:heAU.AiAngelikai.name
ltx/en_us_dedes/me.m01.d08:meVE.Aposticha1.mode	@ltx/en_us_dedes/miscellanea:misc.Mode6
ltx/en_us_dedes/me.m01.d08:meVE.Aposticha1.text	
ltx/en_us_dedes/me.m01.d08:meVE.Aposticha2.incipit	…
ltx/en_us_dedes/me.m01.d08:meVE.Aposticha2.melody	@ltx/en_us_dedes/he.a.m6:heAU.AiAngelikai.name
ltx/en_us_dedes/me.m01.d08:meVE.Aposticha2.mode	@ltx/en_us_dedes/miscellanea:misc.Mode6
ltx/en_us_dedes/me.m01.d08:meVE.Aposticha2.text	
ltx/en_us_dedes/me.m01.d08:meVE.Aposticha3.incipit	…
ltx/en_us_dedes/me.m01.d08:meVE.Aposticha3.melody	@ltx/en_us_dedes/he.a.m6:heAU.AiAngelikai.name
ltx/en_us_dedes/me.m01.d08:meVE.Aposticha3.mode	@ltx/en_us_dedes/miscellanea:misc.Mode6
ltx/en_us_dedes/me.m01.d08:meVE.Aposticha3.text	
ltx/en_us_dedes/me.m01.d08:meVE.SticGlory.incipit	@ltx/en_us_dedes/me.m01.d06:meMA.Lauds5.incipit
ltx/en_us_dedes/me.m01.d08:meVE.SticGlory.melody	
ltx/en_us_dedes/me.m01.d08:meVE.SticGlory.mode	@ltx/en_us_dedes/miscellanea:misc.Mode1
ltx/en_us_dedes/me.m01.d08:meVE.SticGlory.poet	@ltx/en_us_dedes/poets:po.AndreouIerosolymitou
ltx/en_us_dedes/me.m01.d08:meVE.SticGlory.text	@ltx/en_us_dedes/me.m01.d06:meMA.Lauds5.text
ltx/en_us_dedes/me.m01.d08:meVE.Stichera01.greekmelody	@ltx/en_us_dedes/he.a.m4:heAU.OsGennaionEnMartysi.greekname
ltx/en_us_dedes/me.m01.d08:meVE.Stichera01.incipit	The assaults of intrusive thoughts…
ltx/en_us_dedes/me.m01.d08:meVE.Stichera01.melody	@ltx/en_us_dedes/he.a.m4:heAU.OsGennaionEnMartysi.name
ltx/en_us_dedes/me.m01.d08:meVE.Stichera01.mode	@ltx/en_us_dedes/miscellanea:misc.Mode4
ltx/en_us_dedes/me.m01.d08:meVE.Stichera01.text	The assaults of intrusive thoughts * could not shake the acropolis * of your soul, O blessed one. For as a defense * you had established the rules of strict ascetical discipline, * by which you preserved yourself * uninjured and invulnerable * to any attacks * of the devil who warred with you. And thus you stood awarded as a victor * beside the Lord of the universe.
ltx/en_us_dedes/me.m01.d08:meVE.Stichera02.incipit	There was nothing that could…
ltx/en_us_dedes/me.m01.d08:meVE.Stichera02.melody	@ltx/en_us_dedes/he.a.m4:heAU.OsGennaionEnMartysi.name
ltx/en_us_dedes/me.m01.d08:meVE.Stichera02.mode	@ltx/en_us_dedes/miscellanea:misc.Mode4
ltx/en_us_dedes/me.m01.d08:meVE.Stichera02.text	There was nothing that could deter * or diminish your zeal to go * abroad for the sake of the love of God, O Saint, * neither the distance nor harsh terrain. * And when you at last arrived * in the Holy Lands and stood * on the ground that the feet of our * Lord and God had stepped, * you were not in the least remiss or lacking in ascetic feats and labors, * until you reached the Zion on high.
ltx/en_us_dedes/me.m01.d08:meVE.Stichera03.incipit	Demonstrating your heartfelt love *…
ltx/en_us_dedes/me.m01.d08:meVE.Stichera03.melody	@ltx/en_us_dedes/he.a.m4:heAU.OsGennaionEnMartysi.name
ltx/en_us_dedes/me.m01.d08:meVE.Stichera03.mode	@ltx/en_us_dedes/miscellanea:misc.Mode4
ltx/en_us_dedes/me.m01.d08:meVE.Stichera03.text	Demonstrating your heartfelt love * for the Lord by your many tears * shed with great compunction, O glorious St. George, * you wet the ground with them, and you wiped the footstool of Christ the Lord * with your hair, imagining * that you saw Him, for whom you longed, present sitting there. * As your soul was illumined, by your intellect’s most godly contemplations, * you touched the Lord’s feet noetically.
ltx/en_us_dedes/me.m01.d08:meVE.Stichera04.greekmelody	@ltx/en_us_dedes/he.a.m4:heAU.EdokasSimeiosin.greekname
ltx/en_us_dedes/me.m01.d08:meVE.Stichera04.incipit	O devout all-blessed Saint, you…
ltx/en_us_dedes/me.m01.d08:meVE.Stichera04.melody	@ltx/en_us_dedes/he.a.m4:heAU.EdokasSimeiosin.name
ltx/en_us_dedes/me.m01.d08:meVE.Stichera04.mode	@ltx/en_us_dedes/miscellanea:misc.Mode4
ltx/en_us_dedes/me.m01.d08:meVE.Stichera04.text	O devout all-blessed Saint, you like a bright star have from the West * risen, shining upon the East. * Your virtuous words and deeds are like rays of sunshine, * flashing forth. And you have illumined the believers’ minds * with all your miracles glowing splendidly. * We therefore call you blessed, and today we honor your memory, * as we magnify Christ who has glorified you majestically.
ltx/en_us_dedes/me.m01.d08:meVE.Stichera05.incipit	Smitten with ecstatic longing…
ltx/en_us_dedes/me.m01.d08:meVE.Stichera05.melody	@ltx/en_us_dedes/he.a.m4:heAU.EdokasSimeiosin.name
ltx/en_us_dedes/me.m01.d08:meVE.Stichera05.mode	@ltx/en_us_dedes/miscellanea:misc.Mode4
ltx/en_us_dedes/me.m01.d08:meVE.Stichera05.text	Smitten with ecstatic longing for your Bridegroom were you indeed, O Domnika, extolled by all; * and you followed after Him, through renunciation * of temporal glory and of the pleasures of the flesh * and every other enjoyment of this life. * And therefore by the Savior of our souls, benevolent Jesus Christ, * you were granted admission to His most luminous bridal room.
ltx/en_us_dedes/me.m01.d08:meVE.Stichera06.incipit	In yourself you replicated what…
ltx/en_us_dedes/me.m01.d08:meVE.Stichera06.melody	@ltx/en_us_dedes/he.a.m4:heAU.EdokasSimeiosin.name
ltx/en_us_dedes/me.m01.d08:meVE.Stichera06.mode	@ltx/en_us_dedes/miscellanea:misc.Mode4
ltx/en_us_dedes/me.m01.d08:meVE.Stichera06.text	In yourself you replicated what your Lord and Creator bore * in His Passion, and thus became * a rational creature of the Logos, O Virgin. * Through your use of reason, * all deviations were subdued * of the irrational passions of the flesh. * And thus as you progressed toward the divine likeness, O famous Saint, * you were seen as a genuine and true image of God indeed.
