ltx/en_us_dedes/me.m02.d09:meDA.commemoration.first	Memory of the Holy Martyr Nikephoros
ltx/en_us_dedes/me.m02.d09:meDA.commemoration.first_name	
ltx/en_us_dedes/me.m02.d09:meDA.commemoration.first_short	Memory of the Holy Martyr Nikephoros
ltx/en_us_dedes/me.m02.d09:meDA.commemoration.first_title	@ltx/en_us_dedes/titles:ti.SaintM
ltx/en_us_dedes/me.m02.d09:meDA.commemoration.full	Memory of the Holy Martyr Nikephoros
ltx/en_us_dedes/me.m02.d09:meDA.commemoration.second_name	
ltx/en_us_dedes/me.m02.d09:meDA.commemoration.second_short	Leave-taking of the Feast of the Meeting
ltx/en_us_dedes/me.m02.d09:meDA.commemoration.second_title	
ltx/en_us_dedes/me.m02.d09:meDA.date	February 9
ltx/en_us_dedes/me.m02.d09:meDA.dismissal	@ltx/en_us_dedes/dismissals:dis00.meeting
ltx/en_us_dedes/me.m02.d09:meDA.fordate	for February 9
ltx/en_us_dedes/me.m02.d09:meDA.insert1	
ltx/en_us_dedes/me.m02.d09:meDA.insert2	
ltx/en_us_dedes/me.m02.d09:meDA.note	Leavetaking of the Meeting
ltx/en_us_dedes/me.m02.d09:meDA.pdfcoverdate	February 9,
ltx/en_us_dedes/me.m02.d09:meDA.pdfheaderdate	February 9
ltx/en_us_dedes/me.m02.d09:meHO.commemorations	
ltx/en_us_dedes/me.m02.d09:meHO.note1	
ltx/en_us_dedes/me.m02.d09:meHO.note2	
ltx/en_us_dedes/me.m02.d09:meHO.number	
ltx/en_us_dedes/me.m02.d09:meHO.rank	
ltx/en_us_dedes/me.m02.d09:meLE.commemoration1	The Holy Martyr Nikephoros.
ltx/en_us_dedes/me.m02.d09:meLE.commemoration2	
ltx/en_us_dedes/me.m02.d09:meLI.Kontakion1.greekmelody	@ltx/en_us_dedes/me.m02.d09:meMA.Kontakion1.greekmelody
ltx/en_us_dedes/me.m02.d09:meLI.Kontakion1.incipit	@ltx/en_us_dedes/me.m02.d09:meMA.Kontakion1.incipit
ltx/en_us_dedes/me.m02.d09:meLI.Kontakion1.melody	@ltx/en_us_dedes/me.m02.d09:meMA.Kontakion1.melody
ltx/en_us_dedes/me.m02.d09:meLI.Kontakion1.mode	@ltx/en_us_dedes/me.m02.d09:meMA.Kontakion1.mode
ltx/en_us_dedes/me.m02.d09:meLI.Kontakion1.text	@ltx/en_us_dedes/me.m02.d09:meMA.Kontakion1.text
ltx/en_us_dedes/me.m02.d09:meLI.MM.EntranceHymn.text	@ltx/en_us_dedes/properties:media.key
ltx/en_us_dedes/me.m02.d09:meMA.C1.acrostic.notice1	
ltx/en_us_dedes/me.m02.d09:meMA.C1.acrostic.text	
ltx/en_us_dedes/me.m02.d09:meMA.C1.acrostic.title	
ltx/en_us_dedes/me.m02.d09:meMA.C1.poet	@ltx/en_us_dedes/poets:po.Theofanous
ltx/en_us_dedes/me.m02.d09:meMA.C1.title	@ltx/en_us_dedes/titles:ti.CanonMartyrM
ltx/en_us_dedes/me.m02.d09:meMA.C1.verse	@ltx/en_us_dedes/prayers:pr.verse_SaintM.text
ltx/en_us_dedes/me.m02.d09:meMA.ExapTheotokion.incipit	…
ltx/en_us_dedes/me.m02.d09:meMA.ExapTheotokion.melody	@ltx/en_us_dedes/he.a.m3:heAU.OOuranonToisAstrois.name
ltx/en_us_dedes/me.m02.d09:meMA.ExapTheotokion.mode	@ltx/en_us_dedes/miscellanea:misc.Mode3
ltx/en_us_dedes/me.m02.d09:meMA.ExapTheotokion.text	
ltx/en_us_dedes/me.m02.d09:meMA.Exaposteilarion1.greekmelody	@ltx/en_us_dedes/he.a.m3:heAU.OOuranonToisAstrois.greekname
ltx/en_us_dedes/me.m02.d09:meMA.Exaposteilarion1.incipit	…
ltx/en_us_dedes/me.m02.d09:meMA.Exaposteilarion1.melody	@ltx/en_us_dedes/he.a.m3:heAU.OOuranonToisAstrois.name
ltx/en_us_dedes/me.m02.d09:meMA.Exaposteilarion1.mode	@ltx/en_us_dedes/miscellanea:misc.Mode3
ltx/en_us_dedes/me.m02.d09:meMA.Exaposteilarion1.text	
ltx/en_us_dedes/me.m02.d09:meMA.Kontakion1.greekmelody	@ltx/en_us_dedes/he.a.m3:heAU.IParthenosSimeron.greekname
ltx/en_us_dedes/me.m02.d09:meMA.Kontakion1.incipit	…
ltx/en_us_dedes/me.m02.d09:meMA.Kontakion1.melody	@ltx/en_us_dedes/he.a.m3:heAU.IParthenosSimeron.name
ltx/en_us_dedes/me.m02.d09:meMA.Kontakion1.mode	@ltx/en_us_dedes/miscellanea:misc.Mode3
ltx/en_us_dedes/me.m02.d09:meMA.Kontakion1.text	
ltx/en_us_dedes/me.m02.d09:meMA.Ode1C11.greekmelody	@ltx/en_us_dedes/he.h.m8:heHE.ArmatilatinFarao.greekname
ltx/en_us_dedes/me.m02.d09:meMA.Ode1C11.incipit	…
ltx/en_us_dedes/me.m02.d09:meMA.Ode1C11.melody	@ltx/en_us_dedes/he.h.m8:heHE.ArmatilatinFarao.name
ltx/en_us_dedes/me.m02.d09:meMA.Ode1C11.mode	@ltx/en_us_dedes/miscellanea:misc.Mode8
ltx/en_us_dedes/me.m02.d09:meMA.Ode1C11.ode	@ltx/en_us_dedes/miscellanea:misc.Ode1
ltx/en_us_dedes/me.m02.d09:meMA.Ode1C11.text	
ltx/en_us_dedes/me.m02.d09:meMA.Ode1C12.incipit	…
ltx/en_us_dedes/me.m02.d09:meMA.Ode1C12.melody	@ltx/en_us_dedes/he.h.m8:heHE.ArmatilatinFarao.name
ltx/en_us_dedes/me.m02.d09:meMA.Ode1C12.mode	@ltx/en_us_dedes/miscellanea:misc.Mode8
ltx/en_us_dedes/me.m02.d09:meMA.Ode1C12.ode	@ltx/en_us_dedes/miscellanea:misc.Ode1
ltx/en_us_dedes/me.m02.d09:meMA.Ode1C12.text	
ltx/en_us_dedes/me.m02.d09:meMA.Ode1C13.incipit	…
ltx/en_us_dedes/me.m02.d09:meMA.Ode1C13.melody	@ltx/en_us_dedes/he.h.m8:heHE.ArmatilatinFarao.name
ltx/en_us_dedes/me.m02.d09:meMA.Ode1C13.mode	@ltx/en_us_dedes/miscellanea:misc.Mode8
ltx/en_us_dedes/me.m02.d09:meMA.Ode1C13.ode	@ltx/en_us_dedes/miscellanea:misc.Ode1
ltx/en_us_dedes/me.m02.d09:meMA.Ode1C13.text	
ltx/en_us_dedes/me.m02.d09:meMA.Ode1C1H.greekmelody	@ltx/en_us_dedes/he.h.m8:heHE.ArmatilatinFarao.greekname
ltx/en_us_dedes/me.m02.d09:meMA.Ode1C1H.incipit	@ltx/en_us_dedes/he.h.m8:heHE.ArmatilatinFarao.incipit
ltx/en_us_dedes/me.m02.d09:meMA.Ode1C1H.melody	@ltx/en_us_dedes/he.h.m8:heHE.ArmatilatinFarao.melody
ltx/en_us_dedes/me.m02.d09:meMA.Ode1C1H.mode	@ltx/en_us_dedes/miscellanea:misc.Mode8
ltx/en_us_dedes/me.m02.d09:meMA.Ode1C1H.ode	@ltx/en_us_dedes/miscellanea:misc.Ode1
ltx/en_us_dedes/me.m02.d09:meMA.Ode1C1H.text	@ltx/en_us_dedes/he.h.m8:heHE.ArmatilatinFarao.text
ltx/en_us_dedes/me.m02.d09:meMA.Ode1C1T.incipit	…
ltx/en_us_dedes/me.m02.d09:meMA.Ode1C1T.melody	@ltx/en_us_dedes/he.h.m8:heHE.ArmatilatinFarao.name
ltx/en_us_dedes/me.m02.d09:meMA.Ode1C1T.mode	@ltx/en_us_dedes/miscellanea:misc.Mode8
ltx/en_us_dedes/me.m02.d09:meMA.Ode1C1T.ode	@ltx/en_us_dedes/miscellanea:misc.Ode1
ltx/en_us_dedes/me.m02.d09:meMA.Ode1C1T.text	
ltx/en_us_dedes/me.m02.d09:meMA.Ode1C1Tr.incipit	…
ltx/en_us_dedes/me.m02.d09:meMA.Ode1C1Tr.melody	@ltx/en_us_dedes/he.h.m8:heHE.ArmatilatinFarao.name
ltx/en_us_dedes/me.m02.d09:meMA.Ode1C1Tr.mode	@ltx/en_us_dedes/miscellanea:misc.Mode8
ltx/en_us_dedes/me.m02.d09:meMA.Ode1C1Tr.ode	@ltx/en_us_dedes/miscellanea:misc.Ode1
ltx/en_us_dedes/me.m02.d09:meMA.Ode1C1Tr.text	
ltx/en_us_dedes/me.m02.d09:meMA.Ode3C11.greekmelody	@ltx/en_us_dedes/he.h.m8:heHE.OStereosasKatArchas.greekname
ltx/en_us_dedes/me.m02.d09:meMA.Ode3C11.incipit	…
ltx/en_us_dedes/me.m02.d09:meMA.Ode3C11.melody	@ltx/en_us_dedes/he.h.m8:heHE.OStereosasKatArchas.name
ltx/en_us_dedes/me.m02.d09:meMA.Ode3C11.mode	@ltx/en_us_dedes/miscellanea:misc.Mode8
ltx/en_us_dedes/me.m02.d09:meMA.Ode3C11.ode	@ltx/en_us_dedes/miscellanea:misc.Ode3
ltx/en_us_dedes/me.m02.d09:meMA.Ode3C11.text	
ltx/en_us_dedes/me.m02.d09:meMA.Ode3C12.incipit	…
ltx/en_us_dedes/me.m02.d09:meMA.Ode3C12.melody	@ltx/en_us_dedes/he.h.m8:heHE.OStereosasKatArchas.name
ltx/en_us_dedes/me.m02.d09:meMA.Ode3C12.mode	@ltx/en_us_dedes/miscellanea:misc.Mode8
ltx/en_us_dedes/me.m02.d09:meMA.Ode3C12.ode	@ltx/en_us_dedes/miscellanea:misc.Ode3
ltx/en_us_dedes/me.m02.d09:meMA.Ode3C12.text	
ltx/en_us_dedes/me.m02.d09:meMA.Ode3C13.incipit	…
ltx/en_us_dedes/me.m02.d09:meMA.Ode3C13.melody	@ltx/en_us_dedes/he.h.m8:heHE.OStereosasKatArchas.name
ltx/en_us_dedes/me.m02.d09:meMA.Ode3C13.mode	@ltx/en_us_dedes/miscellanea:misc.Mode8
ltx/en_us_dedes/me.m02.d09:meMA.Ode3C13.ode	@ltx/en_us_dedes/miscellanea:misc.Ode3
ltx/en_us_dedes/me.m02.d09:meMA.Ode3C13.text	
ltx/en_us_dedes/me.m02.d09:meMA.Ode3C1H.greekmelody	@ltx/en_us_dedes/he.h.m8:heHE.OStereosasKatArchas.greekname
ltx/en_us_dedes/me.m02.d09:meMA.Ode3C1H.incipit	@ltx/en_us_dedes/he.h.m8:heHE.OStereosasKatArchas.incipit
ltx/en_us_dedes/me.m02.d09:meMA.Ode3C1H.melody	@ltx/en_us_dedes/he.h.m8:heHE.OStereosasKatArchas.melody
ltx/en_us_dedes/me.m02.d09:meMA.Ode3C1H.mode	@ltx/en_us_dedes/miscellanea:misc.Mode8
ltx/en_us_dedes/me.m02.d09:meMA.Ode3C1H.ode	@ltx/en_us_dedes/miscellanea:misc.Ode3
ltx/en_us_dedes/me.m02.d09:meMA.Ode3C1H.text	@ltx/en_us_dedes/he.h.m8:heHE.OStereosasKatArchas.text
ltx/en_us_dedes/me.m02.d09:meMA.Ode3C1T.incipit	…
ltx/en_us_dedes/me.m02.d09:meMA.Ode3C1T.melody	@ltx/en_us_dedes/he.h.m8:heHE.OStereosasKatArchas.name
ltx/en_us_dedes/me.m02.d09:meMA.Ode3C1T.mode	@ltx/en_us_dedes/miscellanea:misc.Mode8
ltx/en_us_dedes/me.m02.d09:meMA.Ode3C1T.ode	@ltx/en_us_dedes/miscellanea:misc.Ode3
ltx/en_us_dedes/me.m02.d09:meMA.Ode3C1T.text	
ltx/en_us_dedes/me.m02.d09:meMA.Ode3C1Tr.incipit	…
ltx/en_us_dedes/me.m02.d09:meMA.Ode3C1Tr.melody	@ltx/en_us_dedes/he.h.m8:heHE.OStereosasKatArchas.name
ltx/en_us_dedes/me.m02.d09:meMA.Ode3C1Tr.mode	@ltx/en_us_dedes/miscellanea:misc.Mode8
ltx/en_us_dedes/me.m02.d09:meMA.Ode3C1Tr.ode	@ltx/en_us_dedes/miscellanea:misc.Ode3
ltx/en_us_dedes/me.m02.d09:meMA.Ode3C1Tr.text	
ltx/en_us_dedes/me.m02.d09:meMA.Ode3Kathisma1.greekmelody	@ltx/en_us_dedes/he.a.m8:heAU.TinSofianKaiLogon.greekname
ltx/en_us_dedes/me.m02.d09:meMA.Ode3Kathisma1.incipit	…
ltx/en_us_dedes/me.m02.d09:meMA.Ode3Kathisma1.melody	@ltx/en_us_dedes/he.a.m8:heAU.TinSofianKaiLogon.name
ltx/en_us_dedes/me.m02.d09:meMA.Ode3Kathisma1.mode	@ltx/en_us_dedes/miscellanea:misc.Mode8
ltx/en_us_dedes/me.m02.d09:meMA.Ode3Kathisma1.text	
ltx/en_us_dedes/me.m02.d09:meMA.Ode3KathismaSt.incipit	@ltx/en_us_dedes/oc.m8.d4:ocMA.Kathisma13.incipit
ltx/en_us_dedes/me.m02.d09:meMA.Ode3KathismaSt.melody	@ltx/en_us_dedes/he.a.m8:heAU.TinSofianKaiLogon.name
ltx/en_us_dedes/me.m02.d09:meMA.Ode3KathismaSt.mode	@ltx/en_us_dedes/miscellanea:misc.Mode8
ltx/en_us_dedes/me.m02.d09:meMA.Ode3KathismaSt.text	@ltx/en_us_dedes/oc.m8.d4:ocMA.Kathisma13.text
ltx/en_us_dedes/me.m02.d09:meMA.Ode3KathismaT.incipit	@ltx/en_us_dedes/me.m06.d29:meMA.Kathisma2T.incipit
ltx/en_us_dedes/me.m02.d09:meMA.Ode3KathismaT.melody	@ltx/en_us_dedes/he.a.m8:heAU.TinSofianKaiLogon.name
ltx/en_us_dedes/me.m02.d09:meMA.Ode3KathismaT.mode	@ltx/en_us_dedes/miscellanea:misc.Mode8
ltx/en_us_dedes/me.m02.d09:meMA.Ode3KathismaT.text	@ltx/en_us_dedes/me.m06.d29:meMA.Kathisma2T.text
ltx/en_us_dedes/me.m02.d09:meMA.Ode4C11.greekmelody	@ltx/en_us_dedes/he.h.m8:heHE.SyMouIschys.greekname
ltx/en_us_dedes/me.m02.d09:meMA.Ode4C11.incipit	…
ltx/en_us_dedes/me.m02.d09:meMA.Ode4C11.melody	@ltx/en_us_dedes/he.h.m8:heHE.SyMouIschys.name
ltx/en_us_dedes/me.m02.d09:meMA.Ode4C11.mode	@ltx/en_us_dedes/miscellanea:misc.Mode8
ltx/en_us_dedes/me.m02.d09:meMA.Ode4C11.ode	@ltx/en_us_dedes/miscellanea:misc.Ode4
ltx/en_us_dedes/me.m02.d09:meMA.Ode4C11.text	
ltx/en_us_dedes/me.m02.d09:meMA.Ode4C12.incipit	…
ltx/en_us_dedes/me.m02.d09:meMA.Ode4C12.melody	@ltx/en_us_dedes/he.h.m8:heHE.SyMouIschys.name
ltx/en_us_dedes/me.m02.d09:meMA.Ode4C12.mode	@ltx/en_us_dedes/miscellanea:misc.Mode8
ltx/en_us_dedes/me.m02.d09:meMA.Ode4C12.ode	@ltx/en_us_dedes/miscellanea:misc.Ode4
ltx/en_us_dedes/me.m02.d09:meMA.Ode4C12.text	
ltx/en_us_dedes/me.m02.d09:meMA.Ode4C13.incipit	…
ltx/en_us_dedes/me.m02.d09:meMA.Ode4C13.melody	@ltx/en_us_dedes/he.h.m8:heHE.SyMouIschys.name
ltx/en_us_dedes/me.m02.d09:meMA.Ode4C13.mode	@ltx/en_us_dedes/miscellanea:misc.Mode8
ltx/en_us_dedes/me.m02.d09:meMA.Ode4C13.ode	@ltx/en_us_dedes/miscellanea:misc.Ode4
ltx/en_us_dedes/me.m02.d09:meMA.Ode4C13.text	
ltx/en_us_dedes/me.m02.d09:meMA.Ode4C1H.greekmelody	@ltx/en_us_dedes/he.h.m8:heHE.SyMouIschys.greekname
ltx/en_us_dedes/me.m02.d09:meMA.Ode4C1H.incipit	@ltx/en_us_dedes/he.h.m8:heHE.SyMouIschys.incipit
ltx/en_us_dedes/me.m02.d09:meMA.Ode4C1H.melody	@ltx/en_us_dedes/he.h.m8:heHE.SyMouIschys.melody
ltx/en_us_dedes/me.m02.d09:meMA.Ode4C1H.mode	@ltx/en_us_dedes/miscellanea:misc.Mode8
ltx/en_us_dedes/me.m02.d09:meMA.Ode4C1H.ode	@ltx/en_us_dedes/miscellanea:misc.Ode4
ltx/en_us_dedes/me.m02.d09:meMA.Ode4C1H.text	@ltx/en_us_dedes/he.h.m8:heHE.SyMouIschys.text
ltx/en_us_dedes/me.m02.d09:meMA.Ode4C1T.incipit	…
ltx/en_us_dedes/me.m02.d09:meMA.Ode4C1T.melody	@ltx/en_us_dedes/he.h.m8:heHE.SyMouIschys.name
ltx/en_us_dedes/me.m02.d09:meMA.Ode4C1T.mode	@ltx/en_us_dedes/miscellanea:misc.Mode8
ltx/en_us_dedes/me.m02.d09:meMA.Ode4C1T.ode	@ltx/en_us_dedes/miscellanea:misc.Ode4
ltx/en_us_dedes/me.m02.d09:meMA.Ode4C1T.text	
ltx/en_us_dedes/me.m02.d09:meMA.Ode4C1Tr.incipit	…
ltx/en_us_dedes/me.m02.d09:meMA.Ode4C1Tr.melody	@ltx/en_us_dedes/he.h.m8:heHE.SyMouIschys.name
ltx/en_us_dedes/me.m02.d09:meMA.Ode4C1Tr.mode	@ltx/en_us_dedes/miscellanea:misc.Mode8
ltx/en_us_dedes/me.m02.d09:meMA.Ode4C1Tr.ode	@ltx/en_us_dedes/miscellanea:misc.Ode4
ltx/en_us_dedes/me.m02.d09:meMA.Ode4C1Tr.text	
ltx/en_us_dedes/me.m02.d09:meMA.Ode5C11.greekmelody	@ltx/en_us_dedes/he.h.m8:heHE.InaTiMeAposo.greekname
ltx/en_us_dedes/me.m02.d09:meMA.Ode5C11.incipit	…
ltx/en_us_dedes/me.m02.d09:meMA.Ode5C11.melody	@ltx/en_us_dedes/he.h.m8:heHE.InaTiMeAposo.name
ltx/en_us_dedes/me.m02.d09:meMA.Ode5C11.mode	@ltx/en_us_dedes/miscellanea:misc.Mode8
ltx/en_us_dedes/me.m02.d09:meMA.Ode5C11.ode	@ltx/en_us_dedes/miscellanea:misc.Ode5
ltx/en_us_dedes/me.m02.d09:meMA.Ode5C11.text	
ltx/en_us_dedes/me.m02.d09:meMA.Ode5C12.incipit	…
ltx/en_us_dedes/me.m02.d09:meMA.Ode5C12.melody	@ltx/en_us_dedes/he.h.m8:heHE.InaTiMeAposo.name
ltx/en_us_dedes/me.m02.d09:meMA.Ode5C12.mode	@ltx/en_us_dedes/miscellanea:misc.Mode8
ltx/en_us_dedes/me.m02.d09:meMA.Ode5C12.ode	@ltx/en_us_dedes/miscellanea:misc.Ode5
ltx/en_us_dedes/me.m02.d09:meMA.Ode5C12.text	
ltx/en_us_dedes/me.m02.d09:meMA.Ode5C13.incipit	…
ltx/en_us_dedes/me.m02.d09:meMA.Ode5C13.melody	@ltx/en_us_dedes/he.h.m8:heHE.InaTiMeAposo.name
ltx/en_us_dedes/me.m02.d09:meMA.Ode5C13.mode	@ltx/en_us_dedes/miscellanea:misc.Mode8
ltx/en_us_dedes/me.m02.d09:meMA.Ode5C13.ode	@ltx/en_us_dedes/miscellanea:misc.Ode5
ltx/en_us_dedes/me.m02.d09:meMA.Ode5C13.text	
ltx/en_us_dedes/me.m02.d09:meMA.Ode5C1H.greekmelody	@ltx/en_us_dedes/he.h.m8:heHE.InaTiMeAposo.greekname
ltx/en_us_dedes/me.m02.d09:meMA.Ode5C1H.incipit	@ltx/en_us_dedes/he.h.m8:heHE.InaTiMeAposo.incipit
ltx/en_us_dedes/me.m02.d09:meMA.Ode5C1H.melody	@ltx/en_us_dedes/he.h.m8:heHE.InaTiMeAposo.melody
ltx/en_us_dedes/me.m02.d09:meMA.Ode5C1H.mode	@ltx/en_us_dedes/miscellanea:misc.Mode8
ltx/en_us_dedes/me.m02.d09:meMA.Ode5C1H.ode	@ltx/en_us_dedes/miscellanea:misc.Ode5
ltx/en_us_dedes/me.m02.d09:meMA.Ode5C1H.text	@ltx/en_us_dedes/he.h.m8:heHE.InaTiMeAposo.text
ltx/en_us_dedes/me.m02.d09:meMA.Ode5C1T.incipit	…
ltx/en_us_dedes/me.m02.d09:meMA.Ode5C1T.melody	@ltx/en_us_dedes/he.h.m8:heHE.InaTiMeAposo.name
ltx/en_us_dedes/me.m02.d09:meMA.Ode5C1T.mode	@ltx/en_us_dedes/miscellanea:misc.Mode8
ltx/en_us_dedes/me.m02.d09:meMA.Ode5C1T.ode	@ltx/en_us_dedes/miscellanea:misc.Ode5
ltx/en_us_dedes/me.m02.d09:meMA.Ode5C1T.text	
ltx/en_us_dedes/me.m02.d09:meMA.Ode5C1Tr.incipit	…
ltx/en_us_dedes/me.m02.d09:meMA.Ode5C1Tr.melody	@ltx/en_us_dedes/he.h.m8:heHE.InaTiMeAposo.name
ltx/en_us_dedes/me.m02.d09:meMA.Ode5C1Tr.mode	@ltx/en_us_dedes/miscellanea:misc.Mode8
ltx/en_us_dedes/me.m02.d09:meMA.Ode5C1Tr.ode	@ltx/en_us_dedes/miscellanea:misc.Ode5
ltx/en_us_dedes/me.m02.d09:meMA.Ode5C1Tr.text	
ltx/en_us_dedes/me.m02.d09:meMA.Ode6C11.greekmelody	@ltx/en_us_dedes/he.h.m8:heHE.AvyssosAmartion.greekname
ltx/en_us_dedes/me.m02.d09:meMA.Ode6C11.incipit	…
ltx/en_us_dedes/me.m02.d09:meMA.Ode6C11.melody	@ltx/en_us_dedes/he.h.m8:heHE.AvyssosAmartion.name
ltx/en_us_dedes/me.m02.d09:meMA.Ode6C11.mode	@ltx/en_us_dedes/miscellanea:misc.Mode8
ltx/en_us_dedes/me.m02.d09:meMA.Ode6C11.ode	@ltx/en_us_dedes/miscellanea:misc.Ode6
ltx/en_us_dedes/me.m02.d09:meMA.Ode6C11.text	
ltx/en_us_dedes/me.m02.d09:meMA.Ode6C12.incipit	…
ltx/en_us_dedes/me.m02.d09:meMA.Ode6C12.melody	@ltx/en_us_dedes/he.h.m8:heHE.AvyssosAmartion.name
ltx/en_us_dedes/me.m02.d09:meMA.Ode6C12.mode	@ltx/en_us_dedes/miscellanea:misc.Mode8
ltx/en_us_dedes/me.m02.d09:meMA.Ode6C12.ode	@ltx/en_us_dedes/miscellanea:misc.Ode6
ltx/en_us_dedes/me.m02.d09:meMA.Ode6C12.text	
ltx/en_us_dedes/me.m02.d09:meMA.Ode6C13.incipit	…
ltx/en_us_dedes/me.m02.d09:meMA.Ode6C13.melody	@ltx/en_us_dedes/he.h.m8:heHE.AvyssosAmartion.name
ltx/en_us_dedes/me.m02.d09:meMA.Ode6C13.mode	@ltx/en_us_dedes/miscellanea:misc.Mode8
ltx/en_us_dedes/me.m02.d09:meMA.Ode6C13.ode	@ltx/en_us_dedes/miscellanea:misc.Ode6
ltx/en_us_dedes/me.m02.d09:meMA.Ode6C13.text	
ltx/en_us_dedes/me.m02.d09:meMA.Ode6C1H.greekmelody	@ltx/en_us_dedes/he.h.m8:heHE.AvyssosAmartion.greekname
ltx/en_us_dedes/me.m02.d09:meMA.Ode6C1H.incipit	@ltx/en_us_dedes/he.h.m8:heHE.AvyssosAmartion.incipit
ltx/en_us_dedes/me.m02.d09:meMA.Ode6C1H.melody	@ltx/en_us_dedes/he.h.m8:heHE.AvyssosAmartion.melody
ltx/en_us_dedes/me.m02.d09:meMA.Ode6C1H.mode	@ltx/en_us_dedes/miscellanea:misc.Mode8
ltx/en_us_dedes/me.m02.d09:meMA.Ode6C1H.ode	@ltx/en_us_dedes/miscellanea:misc.Ode6
ltx/en_us_dedes/me.m02.d09:meMA.Ode6C1H.text	@ltx/en_us_dedes/he.h.m8:heHE.AvyssosAmartion.text
ltx/en_us_dedes/me.m02.d09:meMA.Ode6C1T.incipit	…
ltx/en_us_dedes/me.m02.d09:meMA.Ode6C1T.melody	@ltx/en_us_dedes/he.h.m8:heHE.AvyssosAmartion.name
ltx/en_us_dedes/me.m02.d09:meMA.Ode6C1T.mode	@ltx/en_us_dedes/miscellanea:misc.Mode8
ltx/en_us_dedes/me.m02.d09:meMA.Ode6C1T.ode	@ltx/en_us_dedes/miscellanea:misc.Ode6
ltx/en_us_dedes/me.m02.d09:meMA.Ode6C1T.text	
ltx/en_us_dedes/me.m02.d09:meMA.Ode7C11.greekmelody	@ltx/en_us_dedes/he.h.m8:heHE.TheouSynkatavasin.greekname
ltx/en_us_dedes/me.m02.d09:meMA.Ode7C11.incipit	…
ltx/en_us_dedes/me.m02.d09:meMA.Ode7C11.melody	@ltx/en_us_dedes/he.h.m8:heHE.TheouSynkatavasin.name
ltx/en_us_dedes/me.m02.d09:meMA.Ode7C11.mode	@ltx/en_us_dedes/miscellanea:misc.Mode8
ltx/en_us_dedes/me.m02.d09:meMA.Ode7C11.ode	@ltx/en_us_dedes/miscellanea:misc.Ode7
ltx/en_us_dedes/me.m02.d09:meMA.Ode7C11.text	
ltx/en_us_dedes/me.m02.d09:meMA.Ode7C12.incipit	…
ltx/en_us_dedes/me.m02.d09:meMA.Ode7C12.melody	@ltx/en_us_dedes/he.h.m8:heHE.TheouSynkatavasin.name
ltx/en_us_dedes/me.m02.d09:meMA.Ode7C12.mode	@ltx/en_us_dedes/miscellanea:misc.Mode8
ltx/en_us_dedes/me.m02.d09:meMA.Ode7C12.ode	@ltx/en_us_dedes/miscellanea:misc.Ode7
ltx/en_us_dedes/me.m02.d09:meMA.Ode7C12.text	
ltx/en_us_dedes/me.m02.d09:meMA.Ode7C13.incipit	…
ltx/en_us_dedes/me.m02.d09:meMA.Ode7C13.melody	@ltx/en_us_dedes/he.h.m8:heHE.TheouSynkatavasin.name
ltx/en_us_dedes/me.m02.d09:meMA.Ode7C13.mode	@ltx/en_us_dedes/miscellanea:misc.Mode8
ltx/en_us_dedes/me.m02.d09:meMA.Ode7C13.ode	@ltx/en_us_dedes/miscellanea:misc.Ode7
ltx/en_us_dedes/me.m02.d09:meMA.Ode7C13.text	
ltx/en_us_dedes/me.m02.d09:meMA.Ode7C1H.greekmelody	@ltx/en_us_dedes/he.h.m8:heHE.TheouSynkatavasin.greekname
ltx/en_us_dedes/me.m02.d09:meMA.Ode7C1H.incipit	@ltx/en_us_dedes/he.h.m8:heHE.TheouSynkatavasin.incipit
ltx/en_us_dedes/me.m02.d09:meMA.Ode7C1H.melody	@ltx/en_us_dedes/he.h.m8:heHE.TheouSynkatavasin.melody
ltx/en_us_dedes/me.m02.d09:meMA.Ode7C1H.mode	@ltx/en_us_dedes/miscellanea:misc.Mode8
ltx/en_us_dedes/me.m02.d09:meMA.Ode7C1H.ode	@ltx/en_us_dedes/miscellanea:misc.Ode7
ltx/en_us_dedes/me.m02.d09:meMA.Ode7C1H.text	@ltx/en_us_dedes/he.h.m8:heHE.TheouSynkatavasin.text
ltx/en_us_dedes/me.m02.d09:meMA.Ode7C1T.incipit	…
ltx/en_us_dedes/me.m02.d09:meMA.Ode7C1T.melody	@ltx/en_us_dedes/he.h.m8:heHE.TheouSynkatavasin.name
ltx/en_us_dedes/me.m02.d09:meMA.Ode7C1T.mode	@ltx/en_us_dedes/miscellanea:misc.Mode8
ltx/en_us_dedes/me.m02.d09:meMA.Ode7C1T.ode	@ltx/en_us_dedes/miscellanea:misc.Ode7
ltx/en_us_dedes/me.m02.d09:meMA.Ode7C1T.text	
ltx/en_us_dedes/me.m02.d09:meMA.Ode7C1Tr.incipit	…
ltx/en_us_dedes/me.m02.d09:meMA.Ode7C1Tr.melody	@ltx/en_us_dedes/he.h.m8:heHE.TheouSynkatavasin.name
ltx/en_us_dedes/me.m02.d09:meMA.Ode7C1Tr.mode	@ltx/en_us_dedes/miscellanea:misc.Mode8
ltx/en_us_dedes/me.m02.d09:meMA.Ode7C1Tr.ode	@ltx/en_us_dedes/miscellanea:misc.Ode7
ltx/en_us_dedes/me.m02.d09:meMA.Ode7C1Tr.text	
ltx/en_us_dedes/me.m02.d09:meMA.Ode8C11.greekmelody	@ltx/en_us_dedes/he.h.m8:heHE.EptaplasiosKaminon.greekname
ltx/en_us_dedes/me.m02.d09:meMA.Ode8C11.incipit	…
ltx/en_us_dedes/me.m02.d09:meMA.Ode8C11.melody	@ltx/en_us_dedes/he.h.m8:heHE.EptaplasiosKaminon.name
ltx/en_us_dedes/me.m02.d09:meMA.Ode8C11.mode	@ltx/en_us_dedes/miscellanea:misc.Mode8
ltx/en_us_dedes/me.m02.d09:meMA.Ode8C11.ode	@ltx/en_us_dedes/miscellanea:misc.Ode8
ltx/en_us_dedes/me.m02.d09:meMA.Ode8C11.text	
ltx/en_us_dedes/me.m02.d09:meMA.Ode8C12.incipit	…
ltx/en_us_dedes/me.m02.d09:meMA.Ode8C12.melody	@ltx/en_us_dedes/he.h.m8:heHE.EptaplasiosKaminon.name
ltx/en_us_dedes/me.m02.d09:meMA.Ode8C12.mode	@ltx/en_us_dedes/miscellanea:misc.Mode8
ltx/en_us_dedes/me.m02.d09:meMA.Ode8C12.ode	@ltx/en_us_dedes/miscellanea:misc.Ode8
ltx/en_us_dedes/me.m02.d09:meMA.Ode8C12.text	
ltx/en_us_dedes/me.m02.d09:meMA.Ode8C13.incipit	…
ltx/en_us_dedes/me.m02.d09:meMA.Ode8C13.melody	@ltx/en_us_dedes/he.h.m8:heHE.EptaplasiosKaminon.name
ltx/en_us_dedes/me.m02.d09:meMA.Ode8C13.mode	@ltx/en_us_dedes/miscellanea:misc.Mode8
ltx/en_us_dedes/me.m02.d09:meMA.Ode8C13.ode	@ltx/en_us_dedes/miscellanea:misc.Ode8
ltx/en_us_dedes/me.m02.d09:meMA.Ode8C13.text	
ltx/en_us_dedes/me.m02.d09:meMA.Ode8C1H.greekmelody	@ltx/en_us_dedes/he.h.m8:heHE.EptaplasiosKaminon.greekname
ltx/en_us_dedes/me.m02.d09:meMA.Ode8C1H.incipit	@ltx/en_us_dedes/he.h.m8:heHE.EptaplasiosKaminon.incipit
ltx/en_us_dedes/me.m02.d09:meMA.Ode8C1H.melody	@ltx/en_us_dedes/he.h.m8:heHE.EptaplasiosKaminon.melody
ltx/en_us_dedes/me.m02.d09:meMA.Ode8C1H.mode	@ltx/en_us_dedes/miscellanea:misc.Mode8
ltx/en_us_dedes/me.m02.d09:meMA.Ode8C1H.ode	@ltx/en_us_dedes/miscellanea:misc.Ode8
ltx/en_us_dedes/me.m02.d09:meMA.Ode8C1H.text	@ltx/en_us_dedes/he.h.m8:heHE.EptaplasiosKaminon.text
ltx/en_us_dedes/me.m02.d09:meMA.Ode8C1T.incipit	…
ltx/en_us_dedes/me.m02.d09:meMA.Ode8C1T.melody	@ltx/en_us_dedes/he.h.m8:heHE.EptaplasiosKaminon.name
ltx/en_us_dedes/me.m02.d09:meMA.Ode8C1T.mode	@ltx/en_us_dedes/miscellanea:misc.Mode8
ltx/en_us_dedes/me.m02.d09:meMA.Ode8C1T.ode	@ltx/en_us_dedes/miscellanea:misc.Ode8
ltx/en_us_dedes/me.m02.d09:meMA.Ode8C1T.text	
ltx/en_us_dedes/me.m02.d09:meMA.Ode8C1Tr.incipit	…
ltx/en_us_dedes/me.m02.d09:meMA.Ode8C1Tr.melody	@ltx/en_us_dedes/he.h.m8:heHE.EptaplasiosKaminon.name
ltx/en_us_dedes/me.m02.d09:meMA.Ode8C1Tr.mode	@ltx/en_us_dedes/miscellanea:misc.Mode8
ltx/en_us_dedes/me.m02.d09:meMA.Ode8C1Tr.ode	@ltx/en_us_dedes/miscellanea:misc.Ode8
ltx/en_us_dedes/me.m02.d09:meMA.Ode8C1Tr.text	
ltx/en_us_dedes/me.m02.d09:meMA.Ode9C11.greekmelody	@ltx/en_us_dedes/he.h.m8:heHE.ExestiEpiTouto.greekname
ltx/en_us_dedes/me.m02.d09:meMA.Ode9C11.incipit	…
ltx/en_us_dedes/me.m02.d09:meMA.Ode9C11.melody	@ltx/en_us_dedes/he.h.m8:heHE.ExestiEpiTouto.name
ltx/en_us_dedes/me.m02.d09:meMA.Ode9C11.mode	@ltx/en_us_dedes/miscellanea:misc.Mode8
ltx/en_us_dedes/me.m02.d09:meMA.Ode9C11.ode	@ltx/en_us_dedes/miscellanea:misc.Ode9
ltx/en_us_dedes/me.m02.d09:meMA.Ode9C11.text	
ltx/en_us_dedes/me.m02.d09:meMA.Ode9C12.incipit	…
ltx/en_us_dedes/me.m02.d09:meMA.Ode9C12.melody	@ltx/en_us_dedes/he.h.m8:heHE.ExestiEpiTouto.name
ltx/en_us_dedes/me.m02.d09:meMA.Ode9C12.mode	@ltx/en_us_dedes/miscellanea:misc.Mode8
ltx/en_us_dedes/me.m02.d09:meMA.Ode9C12.ode	@ltx/en_us_dedes/miscellanea:misc.Ode9
ltx/en_us_dedes/me.m02.d09:meMA.Ode9C12.text	
ltx/en_us_dedes/me.m02.d09:meMA.Ode9C13.incipit	…
ltx/en_us_dedes/me.m02.d09:meMA.Ode9C13.melody	@ltx/en_us_dedes/he.h.m8:heHE.ExestiEpiTouto.name
ltx/en_us_dedes/me.m02.d09:meMA.Ode9C13.mode	@ltx/en_us_dedes/miscellanea:misc.Mode8
ltx/en_us_dedes/me.m02.d09:meMA.Ode9C13.ode	@ltx/en_us_dedes/miscellanea:misc.Ode9
ltx/en_us_dedes/me.m02.d09:meMA.Ode9C13.text	
ltx/en_us_dedes/me.m02.d09:meMA.Ode9C1H.greekmelody	@ltx/en_us_dedes/he.h.m8:heHE.ExestiEpiTouto.greekname
ltx/en_us_dedes/me.m02.d09:meMA.Ode9C1H.incipit	@ltx/en_us_dedes/he.h.m8:heHE.ExestiEpiTouto.incipit
ltx/en_us_dedes/me.m02.d09:meMA.Ode9C1H.melody	@ltx/en_us_dedes/he.h.m8:heHE.ExestiEpiTouto.melody
ltx/en_us_dedes/me.m02.d09:meMA.Ode9C1H.mode	@ltx/en_us_dedes/miscellanea:misc.Mode8
ltx/en_us_dedes/me.m02.d09:meMA.Ode9C1H.ode	@ltx/en_us_dedes/miscellanea:misc.Ode9
ltx/en_us_dedes/me.m02.d09:meMA.Ode9C1H.text	@ltx/en_us_dedes/he.h.m8:heHE.ExestiEpiTouto.text
ltx/en_us_dedes/me.m02.d09:meMA.Ode9C1T.incipit	…
ltx/en_us_dedes/me.m02.d09:meMA.Ode9C1T.melody	@ltx/en_us_dedes/he.h.m8:heHE.ExestiEpiTouto.name
ltx/en_us_dedes/me.m02.d09:meMA.Ode9C1T.mode	@ltx/en_us_dedes/miscellanea:misc.Mode8
ltx/en_us_dedes/me.m02.d09:meMA.Ode9C1T.ode	@ltx/en_us_dedes/miscellanea:misc.Ode9
ltx/en_us_dedes/me.m02.d09:meMA.Ode9C1T.text	
ltx/en_us_dedes/me.m02.d09:meMA.Ode9C1Tr.incipit	…
ltx/en_us_dedes/me.m02.d09:meMA.Ode9C1Tr.melody	@ltx/en_us_dedes/he.h.m8:heHE.ExestiEpiTouto.name
ltx/en_us_dedes/me.m02.d09:meMA.Ode9C1Tr.mode	@ltx/en_us_dedes/miscellanea:misc.Mode8
ltx/en_us_dedes/me.m02.d09:meMA.Ode9C1Tr.ode	@ltx/en_us_dedes/miscellanea:misc.Ode9
ltx/en_us_dedes/me.m02.d09:meMA.Ode9C1Tr.text	
ltx/en_us_dedes/me.m02.d09:meMA.Oikos1.text	
ltx/en_us_dedes/me.m02.d09:meVE.Apolytikion1.greekmelody	@ltx/en_us_dedes/he.a.m4:heAU.TachyProkatalave.greekname
ltx/en_us_dedes/me.m02.d09:meVE.Apolytikion1.incipit	…
ltx/en_us_dedes/me.m02.d09:meVE.Apolytikion1.melody	@ltx/en_us_dedes/he.a.m4:heAU.TachyProkatalave.name
ltx/en_us_dedes/me.m02.d09:meVE.Apolytikion1.mode	@ltx/en_us_dedes/miscellanea:misc.Mode4
ltx/en_us_dedes/me.m02.d09:meVE.Apolytikion1.text	
ltx/en_us_dedes/me.m02.d09:meVE.SticGlory.incipit	…
ltx/en_us_dedes/me.m02.d09:meVE.SticGlory.melody	
ltx/en_us_dedes/me.m02.d09:meVE.SticGlory.mode	@ltx/en_us_dedes/miscellanea:misc.Mode6
ltx/en_us_dedes/me.m02.d09:meVE.SticGlory.poet	@ltx/en_us_dedes/poets:po.IoannouMonachou
ltx/en_us_dedes/me.m02.d09:meVE.SticGlory.text	
ltx/en_us_dedes/me.m02.d09:meVE.SticStavrotheotokion.greekmelody	@ltx/en_us_dedes/he.a.m2:heAU.OteEkTouXylou.greekname
ltx/en_us_dedes/me.m02.d09:meVE.SticStavrotheotokion.incipit	Savior, when the Ewe-lamb without…
ltx/en_us_dedes/me.m02.d09:meVE.SticStavrotheotokion.melody	@ltx/en_us_dedes/he.a.m2:heAU.OteEkTouXylou.name
ltx/en_us_dedes/me.m02.d09:meVE.SticStavrotheotokion.mode	@ltx/en_us_dedes/miscellanea:misc.Mode2
ltx/en_us_dedes/me.m02.d09:meVE.SticStavrotheotokion.text	Savior, when the Ewe-lamb without spot * watched as You her Lamb, like a ram, were willingly led away * to the slaughter, she lamented and she tearfully said, “Now You hasten, O Christ, to make * Your own Mother childless. * O Redeemer of the world, why have You done this to me? * Yet, I glorify and I honor * the extreme ineffable goodness * that is Yours, O Master most benevolent.”
ltx/en_us_dedes/me.m02.d09:meVE.SticStavrotheotokion2.greekmelody	@ltx/en_us_dedes/he.a.m6:heAU.OlinApothemenoi.greekname
ltx/en_us_dedes/me.m02.d09:meVE.SticStavrotheotokion2.incipit	@ltx/en_us_dedes/me.m01.d15:meVE.AposStavrotheotokion.incipit
ltx/en_us_dedes/me.m02.d09:meVE.SticStavrotheotokion2.melody	@ltx/en_us_dedes/he.a.m6:heAU.OlinApothemenoi.name
ltx/en_us_dedes/me.m02.d09:meVE.SticStavrotheotokion2.mode	@ltx/en_us_dedes/miscellanea:misc.Mode6
ltx/en_us_dedes/me.m02.d09:meVE.SticStavrotheotokion2.text	@ltx/en_us_dedes/me.m01.d15:meVE.AposStavrotheotokion.text
ltx/en_us_dedes/me.m02.d09:meVE.SticTheotokion.greekmelody	@ltx/en_us_dedes/he.a.m2:heAU.OteEkTouXylou.greekname
ltx/en_us_dedes/me.m02.d09:meVE.SticTheotokion.incipit	…
ltx/en_us_dedes/me.m02.d09:meVE.SticTheotokion.melody	@ltx/en_us_dedes/he.a.m2:heAU.OteEkTouXylou.name
ltx/en_us_dedes/me.m02.d09:meVE.SticTheotokion.mode	@ltx/en_us_dedes/miscellanea:misc.Mode2
ltx/en_us_dedes/me.m02.d09:meVE.SticTheotokion.text	
ltx/en_us_dedes/me.m02.d09:meVE.SticTheotokion2.greekmelody	@ltx/en_us_dedes/he.a.m6:heAU.OlinApothemenoi.greekname
ltx/en_us_dedes/me.m02.d09:meVE.SticTheotokion2.incipit	…
ltx/en_us_dedes/me.m02.d09:meVE.SticTheotokion2.melody	@ltx/en_us_dedes/he.a.m6:heAU.OlinApothemenoi.name
ltx/en_us_dedes/me.m02.d09:meVE.SticTheotokion2.mode	@ltx/en_us_dedes/miscellanea:misc.Mode6
ltx/en_us_dedes/me.m02.d09:meVE.SticTheotokion2.text	
ltx/en_us_dedes/me.m02.d09:meVE.Stichera01.greekmelody	@ltx/en_us_dedes/he.a.m2:heAU.OteEkTouXylou.greekname
ltx/en_us_dedes/me.m02.d09:meVE.Stichera01.incipit	…
ltx/en_us_dedes/me.m02.d09:meVE.Stichera01.melody	@ltx/en_us_dedes/he.a.m2:heAU.OteEkTouXylou.name
ltx/en_us_dedes/me.m02.d09:meVE.Stichera01.mode	@ltx/en_us_dedes/miscellanea:misc.Mode2
ltx/en_us_dedes/me.m02.d09:meVE.Stichera01.text	
ltx/en_us_dedes/me.m02.d09:meVE.Stichera02.incipit	…
ltx/en_us_dedes/me.m02.d09:meVE.Stichera02.melody	@ltx/en_us_dedes/he.a.m2:heAU.OteEkTouXylou.name
ltx/en_us_dedes/me.m02.d09:meVE.Stichera02.mode	@ltx/en_us_dedes/miscellanea:misc.Mode2
ltx/en_us_dedes/me.m02.d09:meVE.Stichera02.text	
ltx/en_us_dedes/me.m02.d09:meVE.Stichera03.incipit	…
ltx/en_us_dedes/me.m02.d09:meVE.Stichera03.melody	@ltx/en_us_dedes/he.a.m2:heAU.OteEkTouXylou.name
ltx/en_us_dedes/me.m02.d09:meVE.Stichera03.mode	@ltx/en_us_dedes/miscellanea:misc.Mode2
ltx/en_us_dedes/me.m02.d09:meVE.Stichera03.text	
