ltx/en_us_dedes/me.m10.d30:meDA.commemoration.first	Memory of Sts. Zenobius and Zenobia
ltx/en_us_dedes/me.m10.d30:meDA.commemoration.first_name	
ltx/en_us_dedes/me.m10.d30:meDA.commemoration.first_short	Memory of Sts. Zenobius and Zenobia
ltx/en_us_dedes/me.m10.d30:meDA.commemoration.first_title	@ltx/en_us_dedes/titles:ti.Saints
ltx/en_us_dedes/me.m10.d30:meDA.commemoration.full	Memory of the Holy Hieromartyr Zenobius and his Sister Zenobia
ltx/en_us_dedes/me.m10.d30:meDA.commemoration.second_name	
ltx/en_us_dedes/me.m10.d30:meDA.commemoration.second_title	
ltx/en_us_dedes/me.m10.d30:meDA.date	October 30
ltx/en_us_dedes/me.m10.d30:meDA.fordate	for October 30
ltx/en_us_dedes/me.m10.d30:meDA.insert1	and the holy hieromartyr Zenobius and his sister Zenobia,
ltx/en_us_dedes/me.m10.d30:meDA.insert2	whose memory we observe,
ltx/en_us_dedes/me.m10.d30:meDA.note	
ltx/en_us_dedes/me.m10.d30:meDA.pdfcoverdate	October 30,
ltx/en_us_dedes/me.m10.d30:meDA.pdfheaderdate	October 30
ltx/en_us_dedes/me.m10.d30:meHO.commemorations	
ltx/en_us_dedes/me.m10.d30:meHO.note1	
ltx/en_us_dedes/me.m10.d30:meHO.note2	
ltx/en_us_dedes/me.m10.d30:meHO.number	
ltx/en_us_dedes/me.m10.d30:meHO.rank	
ltx/en_us_dedes/me.m10.d30:meLE.commemoration1	
ltx/en_us_dedes/me.m10.d30:meLE.commemoration2	
ltx/en_us_dedes/me.m10.d30:meLI.Kontakion1.greekmelody	@ltx/en_us_dedes/me.m10.d30:meMA.Kontakion1.greekmelody
ltx/en_us_dedes/me.m10.d30:meLI.Kontakion1.incipit	@ltx/en_us_dedes/me.m10.d30:meMA.Kontakion1.incipit
ltx/en_us_dedes/me.m10.d30:meLI.Kontakion1.melody	@ltx/en_us_dedes/me.m10.d30:meMA.Kontakion1.melody
ltx/en_us_dedes/me.m10.d30:meLI.Kontakion1.mode	@ltx/en_us_dedes/me.m10.d30:meMA.Kontakion1.mode
ltx/en_us_dedes/me.m10.d30:meLI.Kontakion1.text	@ltx/en_us_dedes/me.m10.d30:meMA.Kontakion1.text
ltx/en_us_dedes/me.m10.d30:meLI.Megalynarion.text	
ltx/en_us_dedes/me.m10.d30:meMA.C1.poet	@ltx/en_us_dedes/poets:po.Iosif
ltx/en_us_dedes/me.m10.d30:meMA.C1.title	@ltx/en_us_dedes/titles:ti.CanonSaints
ltx/en_us_dedes/me.m10.d30:meMA.C1.verse	@ltx/en_us_dedes/prayers:pr.verse_SaintsM.text
ltx/en_us_dedes/me.m10.d30:meMA.ExapTheotokion.incipit	Of old the Prophets spoke…
ltx/en_us_dedes/me.m10.d30:meMA.ExapTheotokion.melody	@ltx/en_us_dedes/he.a.m2:heAU.GynaikesAkoutisthite.name
ltx/en_us_dedes/me.m10.d30:meMA.ExapTheotokion.mode	@ltx/en_us_dedes/miscellanea:misc.Mode2
ltx/en_us_dedes/me.m10.d30:meMA.ExapTheotokion.text	Of old the Prophets spoke of you * as holy Table and as Ark, * as Jar and Rod and as Mountain, * as Palace and as a Ladder, * the Scroll that had been written in, * and as a bridge that to the height * of divine knoweldge carries us; * while we, as is truly worthy, * extol you as Theotokos.
ltx/en_us_dedes/me.m10.d30:meMA.Exaposteilarion1.greekmelody	@ltx/en_us_dedes/he.a.m2:heAU.GynaikesAkoutisthite.greekname
ltx/en_us_dedes/me.m10.d30:meMA.Exaposteilarion1.incipit	You made your vestments redder…
ltx/en_us_dedes/me.m10.d30:meMA.Exaposteilarion1.melody	@ltx/en_us_dedes/he.a.m2:heAU.GynaikesAkoutisthite.name
ltx/en_us_dedes/me.m10.d30:meMA.Exaposteilarion1.mode	@ltx/en_us_dedes/miscellanea:misc.Mode2
ltx/en_us_dedes/me.m10.d30:meMA.Exaposteilarion1.text	You made your vestments redder by * your sacred blood, O blessed one; * and now you stand in the presence * of Christ the Savior, rejoicing, * O God-inspired hierarch * Zenobius, entreating Him * on our behalf together with * Zenobia, your own sister, * the martyr and sacred virgin.
ltx/en_us_dedes/me.m10.d30:meMA.Kontakion1.greekmelody	@ltx/en_us_dedes/he.a.m8:heAU.OsAparchas.greekname
ltx/en_us_dedes/me.m10.d30:meMA.Kontakion1.incipit	With God-inspired songs, let us…
ltx/en_us_dedes/me.m10.d30:meMA.Kontakion1.melody	@ltx/en_us_dedes/he.a.m8:heAU.OsAparchas.notmetered
ltx/en_us_dedes/me.m10.d30:meMA.Kontakion1.mode	@ltx/en_us_dedes/miscellanea:misc.Mode8
ltx/en_us_dedes/me.m10.d30:meMA.Kontakion1.text	With God-inspired songs, let us honor those two siblings, those witnesses of the truth and preachers of the correct faith, Saints Zenobius and Zenobia. They lived together, and through martyrdom together received the imperishable crown.
ltx/en_us_dedes/me.m10.d30:meMA.Ode1C11.greekmelody	@ltx/en_us_dedes/he.h.m8:heHE.AsmaAnapempsomen.greekname
ltx/en_us_dedes/me.m10.d30:meMA.Ode1C11.incipit	…
ltx/en_us_dedes/me.m10.d30:meMA.Ode1C11.melody	@ltx/en_us_dedes/he.h.m8:heHE.AsmaAnapempsomen.name
ltx/en_us_dedes/me.m10.d30:meMA.Ode1C11.mode	@ltx/en_us_dedes/miscellanea:misc.Mode8
ltx/en_us_dedes/me.m10.d30:meMA.Ode1C11.ode	@ltx/en_us_dedes/miscellanea:misc.Ode1
ltx/en_us_dedes/me.m10.d30:meMA.Ode1C11.text	
ltx/en_us_dedes/me.m10.d30:meMA.Ode1C12.incipit	…
ltx/en_us_dedes/me.m10.d30:meMA.Ode1C12.melody	@ltx/en_us_dedes/he.h.m8:heHE.AsmaAnapempsomen.name
ltx/en_us_dedes/me.m10.d30:meMA.Ode1C12.mode	@ltx/en_us_dedes/miscellanea:misc.Mode8
ltx/en_us_dedes/me.m10.d30:meMA.Ode1C12.ode	@ltx/en_us_dedes/miscellanea:misc.Ode1
ltx/en_us_dedes/me.m10.d30:meMA.Ode1C12.text	
ltx/en_us_dedes/me.m10.d30:meMA.Ode1C13.incipit	…
ltx/en_us_dedes/me.m10.d30:meMA.Ode1C13.melody	@ltx/en_us_dedes/he.h.m8:heHE.AsmaAnapempsomen.name
ltx/en_us_dedes/me.m10.d30:meMA.Ode1C13.mode	@ltx/en_us_dedes/miscellanea:misc.Mode8
ltx/en_us_dedes/me.m10.d30:meMA.Ode1C13.ode	@ltx/en_us_dedes/miscellanea:misc.Ode1
ltx/en_us_dedes/me.m10.d30:meMA.Ode1C13.text	
ltx/en_us_dedes/me.m10.d30:meMA.Ode1C1T.incipit	…
ltx/en_us_dedes/me.m10.d30:meMA.Ode1C1T.melody	@ltx/en_us_dedes/he.h.m8:heHE.AsmaAnapempsomen.name
ltx/en_us_dedes/me.m10.d30:meMA.Ode1C1T.mode	@ltx/en_us_dedes/miscellanea:misc.Mode8
ltx/en_us_dedes/me.m10.d30:meMA.Ode1C1T.ode	@ltx/en_us_dedes/miscellanea:misc.Ode1
ltx/en_us_dedes/me.m10.d30:meMA.Ode1C1T.text	
ltx/en_us_dedes/me.m10.d30:meMA.Ode3C11.greekmelody	@ltx/en_us_dedes/he.h.m8:heHE.TonFovonSouKyrie.greekname
ltx/en_us_dedes/me.m10.d30:meMA.Ode3C11.incipit	…
ltx/en_us_dedes/me.m10.d30:meMA.Ode3C11.melody	@ltx/en_us_dedes/he.h.m8:heHE.TonFovonSouKyrie.name
ltx/en_us_dedes/me.m10.d30:meMA.Ode3C11.mode	@ltx/en_us_dedes/miscellanea:misc.Mode8
ltx/en_us_dedes/me.m10.d30:meMA.Ode3C11.ode	@ltx/en_us_dedes/miscellanea:misc.Ode3
ltx/en_us_dedes/me.m10.d30:meMA.Ode3C11.text	
ltx/en_us_dedes/me.m10.d30:meMA.Ode3C12.incipit	…
ltx/en_us_dedes/me.m10.d30:meMA.Ode3C12.melody	@ltx/en_us_dedes/he.h.m8:heHE.TonFovonSouKyrie.name
ltx/en_us_dedes/me.m10.d30:meMA.Ode3C12.mode	@ltx/en_us_dedes/miscellanea:misc.Mode8
ltx/en_us_dedes/me.m10.d30:meMA.Ode3C12.ode	@ltx/en_us_dedes/miscellanea:misc.Ode3
ltx/en_us_dedes/me.m10.d30:meMA.Ode3C12.text	
ltx/en_us_dedes/me.m10.d30:meMA.Ode3C13.incipit	…
ltx/en_us_dedes/me.m10.d30:meMA.Ode3C13.melody	@ltx/en_us_dedes/he.h.m8:heHE.TonFovonSouKyrie.name
ltx/en_us_dedes/me.m10.d30:meMA.Ode3C13.mode	@ltx/en_us_dedes/miscellanea:misc.Mode8
ltx/en_us_dedes/me.m10.d30:meMA.Ode3C13.ode	@ltx/en_us_dedes/miscellanea:misc.Ode3
ltx/en_us_dedes/me.m10.d30:meMA.Ode3C13.text	
ltx/en_us_dedes/me.m10.d30:meMA.Ode3C1T.incipit	…
ltx/en_us_dedes/me.m10.d30:meMA.Ode3C1T.melody	@ltx/en_us_dedes/he.h.m8:heHE.TonFovonSouKyrie.name
ltx/en_us_dedes/me.m10.d30:meMA.Ode3C1T.mode	@ltx/en_us_dedes/miscellanea:misc.Mode8
ltx/en_us_dedes/me.m10.d30:meMA.Ode3C1T.ode	@ltx/en_us_dedes/miscellanea:misc.Ode3
ltx/en_us_dedes/me.m10.d30:meMA.Ode3C1T.text	
ltx/en_us_dedes/me.m10.d30:meMA.Ode3H.greekmelody	@ltx/en_us_dedes/he.h.m8:heHE.TonFovonSouKyrie.greekname
ltx/en_us_dedes/me.m10.d30:meMA.Ode3H.incipit	@ltx/en_us_dedes/he.h.m8:heHE.TonFovonSouKyrie.incipit
ltx/en_us_dedes/me.m10.d30:meMA.Ode3H.melody	@ltx/en_us_dedes/he.h.m8:heHE.TonFovonSouKyrie.melody
ltx/en_us_dedes/me.m10.d30:meMA.Ode3H.mode	@ltx/en_us_dedes/miscellanea:misc.Mode8
ltx/en_us_dedes/me.m10.d30:meMA.Ode3H.ode	@ltx/en_us_dedes/miscellanea:misc.Ode3
ltx/en_us_dedes/me.m10.d30:meMA.Ode3H.text	@ltx/en_us_dedes/he.h.m8:heHE.TonFovonSouKyrie.text
ltx/en_us_dedes/me.m10.d30:meMA.Ode3Kathisma1.greekmelody	@ltx/en_us_dedes/he.a.m8:heAU.TinSofianKaiLogon.greekname
ltx/en_us_dedes/me.m10.d30:meMA.Ode3Kathisma1.incipit	…
ltx/en_us_dedes/me.m10.d30:meMA.Ode3Kathisma1.melody	@ltx/en_us_dedes/he.a.m8:heAU.TinSofianKaiLogon.name
ltx/en_us_dedes/me.m10.d30:meMA.Ode3Kathisma1.mode	@ltx/en_us_dedes/miscellanea:misc.Mode8
ltx/en_us_dedes/me.m10.d30:meMA.Ode3Kathisma1.text	
ltx/en_us_dedes/me.m10.d30:meMA.Ode3KathismaSt.incipit	@ltx/en_us_dedes/me.m10.d12:meMA.Ode3KathismaSt.incipit
ltx/en_us_dedes/me.m10.d30:meMA.Ode3KathismaSt.melody	@ltx/en_us_dedes/he.a.m8:heAU.TinSofianKaiLogon.name
ltx/en_us_dedes/me.m10.d30:meMA.Ode3KathismaSt.mode	@ltx/en_us_dedes/miscellanea:misc.Mode8
ltx/en_us_dedes/me.m10.d30:meMA.Ode3KathismaSt.text	@ltx/en_us_dedes/me.m10.d12:meMA.Ode3KathismaSt.text
ltx/en_us_dedes/me.m10.d30:meMA.Ode3KathismaT.incipit	…
ltx/en_us_dedes/me.m10.d30:meMA.Ode3KathismaT.melody	@ltx/en_us_dedes/he.a.m8:heAU.TinSofianKaiLogon.name
ltx/en_us_dedes/me.m10.d30:meMA.Ode3KathismaT.mode	@ltx/en_us_dedes/miscellanea:misc.Mode8
ltx/en_us_dedes/me.m10.d30:meMA.Ode3KathismaT.text	
ltx/en_us_dedes/me.m10.d30:meMA.Ode4C11.greekmelody	@ltx/en_us_dedes/he.h.m8:heHE.EpevisEfIppous.greekname
ltx/en_us_dedes/me.m10.d30:meMA.Ode4C11.incipit	…
ltx/en_us_dedes/me.m10.d30:meMA.Ode4C11.melody	@ltx/en_us_dedes/he.h.m8:heHE.EpevisEfIppous.name
ltx/en_us_dedes/me.m10.d30:meMA.Ode4C11.mode	@ltx/en_us_dedes/miscellanea:misc.Mode8
ltx/en_us_dedes/me.m10.d30:meMA.Ode4C11.ode	@ltx/en_us_dedes/miscellanea:misc.Ode4
ltx/en_us_dedes/me.m10.d30:meMA.Ode4C11.text	
ltx/en_us_dedes/me.m10.d30:meMA.Ode4C12.incipit	…
ltx/en_us_dedes/me.m10.d30:meMA.Ode4C12.melody	@ltx/en_us_dedes/he.h.m8:heHE.EpevisEfIppous.name
ltx/en_us_dedes/me.m10.d30:meMA.Ode4C12.mode	@ltx/en_us_dedes/miscellanea:misc.Mode8
ltx/en_us_dedes/me.m10.d30:meMA.Ode4C12.ode	@ltx/en_us_dedes/miscellanea:misc.Ode4
ltx/en_us_dedes/me.m10.d30:meMA.Ode4C12.text	
ltx/en_us_dedes/me.m10.d30:meMA.Ode4C13.incipit	…
ltx/en_us_dedes/me.m10.d30:meMA.Ode4C13.melody	@ltx/en_us_dedes/he.h.m8:heHE.EpevisEfIppous.name
ltx/en_us_dedes/me.m10.d30:meMA.Ode4C13.mode	@ltx/en_us_dedes/miscellanea:misc.Mode8
ltx/en_us_dedes/me.m10.d30:meMA.Ode4C13.ode	@ltx/en_us_dedes/miscellanea:misc.Ode4
ltx/en_us_dedes/me.m10.d30:meMA.Ode4C13.text	
ltx/en_us_dedes/me.m10.d30:meMA.Ode4C1T.incipit	…
ltx/en_us_dedes/me.m10.d30:meMA.Ode4C1T.melody	@ltx/en_us_dedes/he.h.m8:heHE.EpevisEfIppous.name
ltx/en_us_dedes/me.m10.d30:meMA.Ode4C1T.mode	@ltx/en_us_dedes/miscellanea:misc.Mode8
ltx/en_us_dedes/me.m10.d30:meMA.Ode4C1T.ode	@ltx/en_us_dedes/miscellanea:misc.Ode4
ltx/en_us_dedes/me.m10.d30:meMA.Ode4C1T.text	
ltx/en_us_dedes/me.m10.d30:meMA.Ode5C11.greekmelody	@ltx/en_us_dedes/he.h.m8:heHE.InaTiMeAposo.greekname
ltx/en_us_dedes/me.m10.d30:meMA.Ode5C11.incipit	…
ltx/en_us_dedes/me.m10.d30:meMA.Ode5C11.melody	@ltx/en_us_dedes/he.h.m8:heHE.InaTiMeAposo.name
ltx/en_us_dedes/me.m10.d30:meMA.Ode5C11.mode	@ltx/en_us_dedes/miscellanea:misc.Mode8
ltx/en_us_dedes/me.m10.d30:meMA.Ode5C11.ode	@ltx/en_us_dedes/miscellanea:misc.Ode5
ltx/en_us_dedes/me.m10.d30:meMA.Ode5C11.text	
ltx/en_us_dedes/me.m10.d30:meMA.Ode5C12.incipit	…
ltx/en_us_dedes/me.m10.d30:meMA.Ode5C12.melody	@ltx/en_us_dedes/he.h.m8:heHE.InaTiMeAposo.name
ltx/en_us_dedes/me.m10.d30:meMA.Ode5C12.mode	@ltx/en_us_dedes/miscellanea:misc.Mode8
ltx/en_us_dedes/me.m10.d30:meMA.Ode5C12.ode	@ltx/en_us_dedes/miscellanea:misc.Ode5
ltx/en_us_dedes/me.m10.d30:meMA.Ode5C12.text	
ltx/en_us_dedes/me.m10.d30:meMA.Ode5C13.incipit	…
ltx/en_us_dedes/me.m10.d30:meMA.Ode5C13.melody	@ltx/en_us_dedes/he.h.m8:heHE.InaTiMeAposo.name
ltx/en_us_dedes/me.m10.d30:meMA.Ode5C13.mode	@ltx/en_us_dedes/miscellanea:misc.Mode8
ltx/en_us_dedes/me.m10.d30:meMA.Ode5C13.ode	@ltx/en_us_dedes/miscellanea:misc.Ode5
ltx/en_us_dedes/me.m10.d30:meMA.Ode5C13.text	
ltx/en_us_dedes/me.m10.d30:meMA.Ode5C1T.incipit	…
ltx/en_us_dedes/me.m10.d30:meMA.Ode5C1T.melody	@ltx/en_us_dedes/he.h.m8:heHE.InaTiMeAposo.name
ltx/en_us_dedes/me.m10.d30:meMA.Ode5C1T.mode	@ltx/en_us_dedes/miscellanea:misc.Mode8
ltx/en_us_dedes/me.m10.d30:meMA.Ode5C1T.ode	@ltx/en_us_dedes/miscellanea:misc.Ode5
ltx/en_us_dedes/me.m10.d30:meMA.Ode5C1T.text	
ltx/en_us_dedes/me.m10.d30:meMA.Ode6C11.greekmelody	@ltx/en_us_dedes/he.h.m8:heHE.TinDeisinEkcheo.greekname
ltx/en_us_dedes/me.m10.d30:meMA.Ode6C11.incipit	…
ltx/en_us_dedes/me.m10.d30:meMA.Ode6C11.melody	@ltx/en_us_dedes/he.h.m8:heHE.TinDeisinEkcheo.name
ltx/en_us_dedes/me.m10.d30:meMA.Ode6C11.mode	@ltx/en_us_dedes/miscellanea:misc.Mode8
ltx/en_us_dedes/me.m10.d30:meMA.Ode6C11.ode	@ltx/en_us_dedes/miscellanea:misc.Ode6
ltx/en_us_dedes/me.m10.d30:meMA.Ode6C11.text	
ltx/en_us_dedes/me.m10.d30:meMA.Ode6C12.incipit	…
ltx/en_us_dedes/me.m10.d30:meMA.Ode6C12.melody	@ltx/en_us_dedes/he.h.m8:heHE.TinDeisinEkcheo.name
ltx/en_us_dedes/me.m10.d30:meMA.Ode6C12.mode	@ltx/en_us_dedes/miscellanea:misc.Mode8
ltx/en_us_dedes/me.m10.d30:meMA.Ode6C12.ode	@ltx/en_us_dedes/miscellanea:misc.Ode6
ltx/en_us_dedes/me.m10.d30:meMA.Ode6C12.text	
ltx/en_us_dedes/me.m10.d30:meMA.Ode6C13.incipit	…
ltx/en_us_dedes/me.m10.d30:meMA.Ode6C13.melody	@ltx/en_us_dedes/he.h.m8:heHE.TinDeisinEkcheo.name
ltx/en_us_dedes/me.m10.d30:meMA.Ode6C13.mode	@ltx/en_us_dedes/miscellanea:misc.Mode8
ltx/en_us_dedes/me.m10.d30:meMA.Ode6C13.ode	@ltx/en_us_dedes/miscellanea:misc.Ode6
ltx/en_us_dedes/me.m10.d30:meMA.Ode6C13.text	
ltx/en_us_dedes/me.m10.d30:meMA.Ode6C1T.incipit	…
ltx/en_us_dedes/me.m10.d30:meMA.Ode6C1T.melody	@ltx/en_us_dedes/he.h.m8:heHE.TinDeisinEkcheo.name
ltx/en_us_dedes/me.m10.d30:meMA.Ode6C1T.mode	@ltx/en_us_dedes/miscellanea:misc.Mode8
ltx/en_us_dedes/me.m10.d30:meMA.Ode6C1T.ode	@ltx/en_us_dedes/miscellanea:misc.Ode6
ltx/en_us_dedes/me.m10.d30:meMA.Ode6C1T.text	
ltx/en_us_dedes/me.m10.d30:meMA.Ode6H.greekmelody	@ltx/en_us_dedes/he.h.m8:heHE.TinDeisinEkcheo.greekname
ltx/en_us_dedes/me.m10.d30:meMA.Ode6H.incipit	@ltx/en_us_dedes/he.h.m8:heHE.TinDeisinEkcheo.incipit
ltx/en_us_dedes/me.m10.d30:meMA.Ode6H.melody	@ltx/en_us_dedes/he.h.m8:heHE.TinDeisinEkcheo.melody
ltx/en_us_dedes/me.m10.d30:meMA.Ode6H.mode	@ltx/en_us_dedes/miscellanea:misc.Mode8
ltx/en_us_dedes/me.m10.d30:meMA.Ode6H.ode	@ltx/en_us_dedes/miscellanea:misc.Ode6
ltx/en_us_dedes/me.m10.d30:meMA.Ode6H.text	@ltx/en_us_dedes/he.h.m8:heHE.TinDeisinEkcheo.text
ltx/en_us_dedes/me.m10.d30:meMA.Ode7C11.greekmelody	@ltx/en_us_dedes/he.h.m8:heHE.PaidesEvraion.greekname
ltx/en_us_dedes/me.m10.d30:meMA.Ode7C11.incipit	…
ltx/en_us_dedes/me.m10.d30:meMA.Ode7C11.melody	@ltx/en_us_dedes/he.h.m8:heHE.PaidesEvraion.name
ltx/en_us_dedes/me.m10.d30:meMA.Ode7C11.mode	@ltx/en_us_dedes/miscellanea:misc.Mode8
ltx/en_us_dedes/me.m10.d30:meMA.Ode7C11.ode	@ltx/en_us_dedes/miscellanea:misc.Ode7
ltx/en_us_dedes/me.m10.d30:meMA.Ode7C11.text	
ltx/en_us_dedes/me.m10.d30:meMA.Ode7C12.incipit	…
ltx/en_us_dedes/me.m10.d30:meMA.Ode7C12.melody	@ltx/en_us_dedes/he.h.m8:heHE.PaidesEvraion.name
ltx/en_us_dedes/me.m10.d30:meMA.Ode7C12.mode	@ltx/en_us_dedes/miscellanea:misc.Mode8
ltx/en_us_dedes/me.m10.d30:meMA.Ode7C12.ode	@ltx/en_us_dedes/miscellanea:misc.Ode7
ltx/en_us_dedes/me.m10.d30:meMA.Ode7C12.text	
ltx/en_us_dedes/me.m10.d30:meMA.Ode7C13.incipit	…
ltx/en_us_dedes/me.m10.d30:meMA.Ode7C13.melody	@ltx/en_us_dedes/he.h.m8:heHE.PaidesEvraion.name
ltx/en_us_dedes/me.m10.d30:meMA.Ode7C13.mode	@ltx/en_us_dedes/miscellanea:misc.Mode8
ltx/en_us_dedes/me.m10.d30:meMA.Ode7C13.ode	@ltx/en_us_dedes/miscellanea:misc.Ode7
ltx/en_us_dedes/me.m10.d30:meMA.Ode7C13.text	
ltx/en_us_dedes/me.m10.d30:meMA.Ode7C1T.incipit	…
ltx/en_us_dedes/me.m10.d30:meMA.Ode7C1T.melody	@ltx/en_us_dedes/he.h.m8:heHE.PaidesEvraion.name
ltx/en_us_dedes/me.m10.d30:meMA.Ode7C1T.mode	@ltx/en_us_dedes/miscellanea:misc.Mode8
ltx/en_us_dedes/me.m10.d30:meMA.Ode7C1T.ode	@ltx/en_us_dedes/miscellanea:misc.Ode7
ltx/en_us_dedes/me.m10.d30:meMA.Ode7C1T.text	
ltx/en_us_dedes/me.m10.d30:meMA.Ode8C11.greekmelody	@ltx/en_us_dedes/he.h.m8:heHE.OiTheorrimonesPaides.greekname
ltx/en_us_dedes/me.m10.d30:meMA.Ode8C11.incipit	…
ltx/en_us_dedes/me.m10.d30:meMA.Ode8C11.melody	@ltx/en_us_dedes/he.h.m8:heHE.OiTheorrimonesPaides.name
ltx/en_us_dedes/me.m10.d30:meMA.Ode8C11.mode	@ltx/en_us_dedes/miscellanea:misc.Mode8
ltx/en_us_dedes/me.m10.d30:meMA.Ode8C11.ode	@ltx/en_us_dedes/miscellanea:misc.Ode8
ltx/en_us_dedes/me.m10.d30:meMA.Ode8C11.text	
ltx/en_us_dedes/me.m10.d30:meMA.Ode8C12.incipit	…
ltx/en_us_dedes/me.m10.d30:meMA.Ode8C12.melody	@ltx/en_us_dedes/he.h.m8:heHE.OiTheorrimonesPaides.name
ltx/en_us_dedes/me.m10.d30:meMA.Ode8C12.mode	@ltx/en_us_dedes/miscellanea:misc.Mode8
ltx/en_us_dedes/me.m10.d30:meMA.Ode8C12.ode	@ltx/en_us_dedes/miscellanea:misc.Ode8
ltx/en_us_dedes/me.m10.d30:meMA.Ode8C12.text	
ltx/en_us_dedes/me.m10.d30:meMA.Ode8C13.incipit	…
ltx/en_us_dedes/me.m10.d30:meMA.Ode8C13.melody	@ltx/en_us_dedes/he.h.m8:heHE.OiTheorrimonesPaides.name
ltx/en_us_dedes/me.m10.d30:meMA.Ode8C13.mode	@ltx/en_us_dedes/miscellanea:misc.Mode8
ltx/en_us_dedes/me.m10.d30:meMA.Ode8C13.ode	@ltx/en_us_dedes/miscellanea:misc.Ode8
ltx/en_us_dedes/me.m10.d30:meMA.Ode8C13.text	
ltx/en_us_dedes/me.m10.d30:meMA.Ode8C1T.incipit	…
ltx/en_us_dedes/me.m10.d30:meMA.Ode8C1T.melody	@ltx/en_us_dedes/he.h.m8:heHE.OiTheorrimonesPaides.name
ltx/en_us_dedes/me.m10.d30:meMA.Ode8C1T.mode	@ltx/en_us_dedes/miscellanea:misc.Mode8
ltx/en_us_dedes/me.m10.d30:meMA.Ode8C1T.ode	@ltx/en_us_dedes/miscellanea:misc.Ode8
ltx/en_us_dedes/me.m10.d30:meMA.Ode8C1T.text	
ltx/en_us_dedes/me.m10.d30:meMA.Ode8H.greekmelody	@ltx/en_us_dedes/he.h.m8:heHE.OiTheorrimonesPaides.greekname
ltx/en_us_dedes/me.m10.d30:meMA.Ode8H.incipit	@ltx/en_us_dedes/he.h.m8:heHE.OiTheorrimonesPaides.incipit
ltx/en_us_dedes/me.m10.d30:meMA.Ode8H.melody	@ltx/en_us_dedes/he.h.m8:heHE.OiTheorrimonesPaides.melody
ltx/en_us_dedes/me.m10.d30:meMA.Ode8H.mode	@ltx/en_us_dedes/miscellanea:misc.Mode8
ltx/en_us_dedes/me.m10.d30:meMA.Ode8H.ode	@ltx/en_us_dedes/miscellanea:misc.Ode8
ltx/en_us_dedes/me.m10.d30:meMA.Ode8H.text	@ltx/en_us_dedes/he.h.m8:heHE.OiTheorrimonesPaides.text
ltx/en_us_dedes/me.m10.d30:meMA.Ode9C11.greekmelody	@ltx/en_us_dedes/he.h.m8:heHE.EfrixePasaAkoi.greekname
ltx/en_us_dedes/me.m10.d30:meMA.Ode9C11.incipit	…
ltx/en_us_dedes/me.m10.d30:meMA.Ode9C11.melody	@ltx/en_us_dedes/he.h.m8:heHE.EfrixePasaAkoi.name
ltx/en_us_dedes/me.m10.d30:meMA.Ode9C11.mode	@ltx/en_us_dedes/miscellanea:misc.Mode8
ltx/en_us_dedes/me.m10.d30:meMA.Ode9C11.ode	@ltx/en_us_dedes/miscellanea:misc.Ode9
ltx/en_us_dedes/me.m10.d30:meMA.Ode9C11.text	
ltx/en_us_dedes/me.m10.d30:meMA.Ode9C12.incipit	…
ltx/en_us_dedes/me.m10.d30:meMA.Ode9C12.melody	@ltx/en_us_dedes/he.h.m8:heHE.EfrixePasaAkoi.name
ltx/en_us_dedes/me.m10.d30:meMA.Ode9C12.mode	@ltx/en_us_dedes/miscellanea:misc.Mode8
ltx/en_us_dedes/me.m10.d30:meMA.Ode9C12.ode	@ltx/en_us_dedes/miscellanea:misc.Ode9
ltx/en_us_dedes/me.m10.d30:meMA.Ode9C12.text	
ltx/en_us_dedes/me.m10.d30:meMA.Ode9C13.incipit	…
ltx/en_us_dedes/me.m10.d30:meMA.Ode9C13.melody	@ltx/en_us_dedes/he.h.m8:heHE.EfrixePasaAkoi.name
ltx/en_us_dedes/me.m10.d30:meMA.Ode9C13.mode	@ltx/en_us_dedes/miscellanea:misc.Mode8
ltx/en_us_dedes/me.m10.d30:meMA.Ode9C13.ode	@ltx/en_us_dedes/miscellanea:misc.Ode9
ltx/en_us_dedes/me.m10.d30:meMA.Ode9C13.text	
ltx/en_us_dedes/me.m10.d30:meMA.Ode9C14.incipit	…
ltx/en_us_dedes/me.m10.d30:meMA.Ode9C14.melody	@ltx/en_us_dedes/he.h.m8:heHE.EfrixePasaAkoi.name
ltx/en_us_dedes/me.m10.d30:meMA.Ode9C14.mode	@ltx/en_us_dedes/miscellanea:misc.Mode8
ltx/en_us_dedes/me.m10.d30:meMA.Ode9C14.ode	@ltx/en_us_dedes/miscellanea:misc.Ode9
ltx/en_us_dedes/me.m10.d30:meMA.Ode9C14.text	
ltx/en_us_dedes/me.m10.d30:meMA.Ode9C1T.incipit	…
ltx/en_us_dedes/me.m10.d30:meMA.Ode9C1T.melody	@ltx/en_us_dedes/he.h.m8:heHE.EfrixePasaAkoi.name
ltx/en_us_dedes/me.m10.d30:meMA.Ode9C1T.mode	@ltx/en_us_dedes/miscellanea:misc.Mode8
ltx/en_us_dedes/me.m10.d30:meMA.Ode9C1T.ode	@ltx/en_us_dedes/miscellanea:misc.Ode9
ltx/en_us_dedes/me.m10.d30:meMA.Ode9C1T.text	
ltx/en_us_dedes/me.m10.d30:meMA.Ode9H.greekmelody	@ltx/en_us_dedes/he.h.m8:heHE.EfrixePasaAkoi.greekname
ltx/en_us_dedes/me.m10.d30:meMA.Ode9H.incipit	@ltx/en_us_dedes/he.h.m8:heHE.EfrixePasaAkoi.incipit
ltx/en_us_dedes/me.m10.d30:meMA.Ode9H.melody	@ltx/en_us_dedes/he.h.m8:heHE.EfrixePasaAkoi.melody
ltx/en_us_dedes/me.m10.d30:meMA.Ode9H.mode	@ltx/en_us_dedes/miscellanea:misc.Mode8
ltx/en_us_dedes/me.m10.d30:meMA.Ode9H.ode	@ltx/en_us_dedes/miscellanea:misc.Ode9
ltx/en_us_dedes/me.m10.d30:meMA.Ode9H.text	@ltx/en_us_dedes/he.h.m8:heHE.EfrixePasaAkoi.text
ltx/en_us_dedes/me.m10.d30:meMA.Oikos1.text	With songs and poetry let us extol brave and great Zenobius, and with him the virgin and spotless Zenobia, who competed alongside him. They brought down the snorting arrogance of the foe, and they publicized the faith of Christ. Therefore they have famously and worthily received from God the imperishable crown.
ltx/en_us_dedes/me.m10.d30:meVE.Apolytikion1ger.greekmelody	@ltx/en_us_dedes/he.a.m4:heAU.TachyProkatalave.greekname
ltx/en_us_dedes/me.m10.d30:meVE.Apolytikion1ger.incipit	…
ltx/en_us_dedes/me.m10.d30:meVE.Apolytikion1ger.melody	@ltx/en_us_dedes/he.a.m4:heAU.TachyProkatalave.name
ltx/en_us_dedes/me.m10.d30:meVE.Apolytikion1ger.mode	@ltx/en_us_dedes/miscellanea:misc.Mode4
ltx/en_us_dedes/me.m10.d30:meVE.Apolytikion1ger.poet	@ltx/en_us_dedes/poets:po.Gerasimou
ltx/en_us_dedes/me.m10.d30:meVE.Apolytikion1ger.text	
ltx/en_us_dedes/me.m10.d30:meVE.SticGlory.incipit	…
ltx/en_us_dedes/me.m10.d30:meVE.SticGlory.melody	
ltx/en_us_dedes/me.m10.d30:meVE.SticGlory.mode	@ltx/en_us_dedes/miscellanea:misc.Mode6
ltx/en_us_dedes/me.m10.d30:meVE.SticGlory.poet	@ltx/en_us_dedes/poets:po.IoannouMonachou
ltx/en_us_dedes/me.m10.d30:meVE.SticGlory.text	
ltx/en_us_dedes/me.m10.d30:meVE.SticStavrotheotokion.greekmelody	@ltx/en_us_dedes/he.a.m6:heAU.TriimerosAnestis.greekname
ltx/en_us_dedes/me.m10.d30:meVE.SticStavrotheotokion.incipit	@ltx/en_us_dedes/me.m01.d16:meVE.SticStavrotheotokion.incipit
ltx/en_us_dedes/me.m10.d30:meVE.SticStavrotheotokion.melody	@ltx/en_us_dedes/he.a.m6:heAU.TriimerosAnestis.name
ltx/en_us_dedes/me.m10.d30:meVE.SticStavrotheotokion.mode	@ltx/en_us_dedes/miscellanea:misc.Mode6
ltx/en_us_dedes/me.m10.d30:meVE.SticStavrotheotokion.text	@ltx/en_us_dedes/me.m01.d16:meVE.SticStavrotheotokion.text
ltx/en_us_dedes/me.m10.d30:meVE.SticTheotokion.greekmelody	@ltx/en_us_dedes/he.a.m6:heAU.TriimerosAnestis.greekname
ltx/en_us_dedes/me.m10.d30:meVE.SticTheotokion.incipit	@ltx/en_us_dedes/me.m10.d01:meVE.AposTheotokion.incipit
ltx/en_us_dedes/me.m10.d30:meVE.SticTheotokion.melody	@ltx/en_us_dedes/he.a.m6:heAU.TriimerosAnestis.name
ltx/en_us_dedes/me.m10.d30:meVE.SticTheotokion.mode	@ltx/en_us_dedes/miscellanea:misc.Mode6
ltx/en_us_dedes/me.m10.d30:meVE.SticTheotokion.text	@ltx/en_us_dedes/me.m10.d01:meVE.AposTheotokion.text
ltx/en_us_dedes/me.m10.d30:meVE.Stichera01.greekmelody	@ltx/en_us_dedes/he.a.m4:heAU.OsGennaionEnMartysi.greekname
ltx/en_us_dedes/me.m10.d30:meVE.Stichera01.incipit	…
ltx/en_us_dedes/me.m10.d30:meVE.Stichera01.melody	@ltx/en_us_dedes/he.a.m4:heAU.OsGennaionEnMartysi.name
ltx/en_us_dedes/me.m10.d30:meVE.Stichera01.mode	@ltx/en_us_dedes/miscellanea:misc.Mode4
ltx/en_us_dedes/me.m10.d30:meVE.Stichera01.text	
ltx/en_us_dedes/me.m10.d30:meVE.Stichera02.incipit	…
ltx/en_us_dedes/me.m10.d30:meVE.Stichera02.melody	@ltx/en_us_dedes/he.a.m4:heAU.OsGennaionEnMartysi.name
ltx/en_us_dedes/me.m10.d30:meVE.Stichera02.mode	@ltx/en_us_dedes/miscellanea:misc.Mode4
ltx/en_us_dedes/me.m10.d30:meVE.Stichera02.text	
ltx/en_us_dedes/me.m10.d30:meVE.Stichera03.incipit	…
ltx/en_us_dedes/me.m10.d30:meVE.Stichera03.melody	@ltx/en_us_dedes/he.a.m4:heAU.OsGennaionEnMartysi.name
ltx/en_us_dedes/me.m10.d30:meVE.Stichera03.mode	@ltx/en_us_dedes/miscellanea:misc.Mode4
ltx/en_us_dedes/me.m10.d30:meVE.Stichera03.text	
