ltx/en_us_dedes/me.m02.d26:alt1.meDA.commemoration.first_name	
ltx/en_us_dedes/me.m02.d26:alt1.meDA.commemoration.first_short	Memory of the Holy Great-martyr Photini the Samaritan Woman
ltx/en_us_dedes/me.m02.d26:alt1.meDA.commemoration.first_title	@ltx/en_us_dedes/titles:ti.SaintW
ltx/en_us_dedes/me.m02.d26:alt1.meDA.commemoration.full	Memory of the Holy Great-martyr and Equal to the Apostles St. Photini the Samaritan Woman
ltx/en_us_dedes/me.m02.d26:alt1.meDA.commemoration.second_name	
ltx/en_us_dedes/me.m02.d26:alt1.meDA.commemoration.second_title	
ltx/en_us_dedes/me.m02.d26:alt1.meDA.date	February 26
ltx/en_us_dedes/me.m02.d26:alt1.meDA.insert1	and the holy and glorious Great-martyr Photini the Samaritan Woman,
ltx/en_us_dedes/me.m02.d26:alt1.meDA.insert2	whose memory we celebrate,
ltx/en_us_dedes/me.m02.d26:alt1.meDA.note	
ltx/en_us_dedes/me.m02.d26:alt1.meHO.commemorations	
ltx/en_us_dedes/me.m02.d26:alt1.meHO.note1	
ltx/en_us_dedes/me.m02.d26:alt1.meHO.note2	
ltx/en_us_dedes/me.m02.d26:alt1.meHO.number	
ltx/en_us_dedes/me.m02.d26:alt1.meHO.rank	
ltx/en_us_dedes/me.m02.d26:alt1.meLE.commemoration1	
ltx/en_us_dedes/me.m02.d26:alt1.meLE.commemoration2	
ltx/en_us_dedes/me.m02.d26:alt1.meLI.Kontakion1.incipit	@ltx/en_us_dedes/me.m02.d26:alt1.meMA.Kontakion1.incipit
ltx/en_us_dedes/me.m02.d26:alt1.meLI.Kontakion1.melody	@ltx/en_us_dedes/me.m02.d26:alt1.meMA.Kontakion1.melody
ltx/en_us_dedes/me.m02.d26:alt1.meLI.Kontakion1.mode	@ltx/en_us_dedes/me.m02.d26:alt1.meMA.Kontakion1.mode
ltx/en_us_dedes/me.m02.d26:alt1.meLI.Kontakion1.text	@ltx/en_us_dedes/me.m02.d26:alt1.meMA.Kontakion1.text
ltx/en_us_dedes/me.m02.d26:alt1.meLI.MM.CommunionHymn.text	@ltx/en_us_dedes/properties:media.key
ltx/en_us_dedes/me.m02.d26:alt1.meLI.Megalynarion.text	
ltx/en_us_dedes/me.m02.d26:alt1.meMA.C1.acrostic.notice1	
ltx/en_us_dedes/me.m02.d26:alt1.meMA.C1.acrostic.text	
ltx/en_us_dedes/me.m02.d26:alt1.meMA.C1.acrostic.title	
ltx/en_us_dedes/me.m02.d26:alt1.meMA.C1.title	@ltx/en_us_dedes/titles:ti.CanonSaintW
ltx/en_us_dedes/me.m02.d26:alt1.meMA.C1.verse	@ltx/en_us_dedes/prayers:pr.verse_SaintW.text
ltx/en_us_dedes/me.m02.d26:alt1.meMA.ExapTheotokion.incipit	@ltx/en_us_dedes/me.m11.d04:meMA.ExapTheotokion.incipit
ltx/en_us_dedes/me.m02.d26:alt1.meMA.ExapTheotokion.melody	@ltx/en_us_dedes/he.a.m2:heAU.GynaikesAkoutisthite.name
ltx/en_us_dedes/me.m02.d26:alt1.meMA.ExapTheotokion.mode	@ltx/en_us_dedes/miscellanea:misc.Mode2
ltx/en_us_dedes/me.m02.d26:alt1.meMA.ExapTheotokion.text	@ltx/en_us_dedes/me.m11.d04:meMA.ExapTheotokion.text
ltx/en_us_dedes/me.m02.d26:alt1.meMA.Exaposteilarion1.greekmelody	@ltx/en_us_dedes/he.a.m2:heAU.GynaikesAkoutisthite.greekname
ltx/en_us_dedes/me.m02.d26:alt1.meMA.Exaposteilarion1.incipit	…
ltx/en_us_dedes/me.m02.d26:alt1.meMA.Exaposteilarion1.melody	@ltx/en_us_dedes/he.a.m2:heAU.GynaikesAkoutisthite.name
ltx/en_us_dedes/me.m02.d26:alt1.meMA.Exaposteilarion1.mode	@ltx/en_us_dedes/miscellanea:misc.Mode2
ltx/en_us_dedes/me.m02.d26:alt1.meMA.Exaposteilarion1.text	
ltx/en_us_dedes/me.m02.d26:alt1.meMA.Kathisma11.greekmelody	@ltx/en_us_dedes/he.a.m4:heAU.OYpsotheisEnToStavro.greekname
ltx/en_us_dedes/me.m02.d26:alt1.meMA.Kathisma11.incipit	…
ltx/en_us_dedes/me.m02.d26:alt1.meMA.Kathisma11.melody	@ltx/en_us_dedes/he.a.m4:heAU.OYpsotheisEnToStavro.name
ltx/en_us_dedes/me.m02.d26:alt1.meMA.Kathisma11.mode	@ltx/en_us_dedes/miscellanea:misc.Mode4
ltx/en_us_dedes/me.m02.d26:alt1.meMA.Kathisma11.text	
ltx/en_us_dedes/me.m02.d26:alt1.meMA.Kathisma1T.greekmelody	@ltx/en_us_dedes/he.a.m4:heAU.OYpsotheisEnToStavro.greekname
ltx/en_us_dedes/me.m02.d26:alt1.meMA.Kathisma1T.incipit	@ltx/en_us_dedes/oc.m4.d3:ocVE.ApolTheotokionVM.incipit
ltx/en_us_dedes/me.m02.d26:alt1.meMA.Kathisma1T.melody	@ltx/en_us_dedes/he.a.m4:heAU.OYpsotheisEnToStavro.name
ltx/en_us_dedes/me.m02.d26:alt1.meMA.Kathisma1T.mode	@ltx/en_us_dedes/miscellanea:misc.Mode4
ltx/en_us_dedes/me.m02.d26:alt1.meMA.Kathisma1T.text	@ltx/en_us_dedes/oc.m4.d3:ocVE.ApolTheotokionVM.text
ltx/en_us_dedes/me.m02.d26:alt1.meMA.Kathisma21.greekmelody	@ltx/en_us_dedes/he.a.m8:heAU.TinSofianKaiLogon.greekname
ltx/en_us_dedes/me.m02.d26:alt1.meMA.Kathisma21.incipit	…
ltx/en_us_dedes/me.m02.d26:alt1.meMA.Kathisma21.melody	@ltx/en_us_dedes/he.a.m8:heAU.TinSofianKaiLogon.name
ltx/en_us_dedes/me.m02.d26:alt1.meMA.Kathisma21.mode	@ltx/en_us_dedes/miscellanea:misc.Mode8
ltx/en_us_dedes/me.m02.d26:alt1.meMA.Kathisma21.text	
ltx/en_us_dedes/me.m02.d26:alt1.meMA.Kathisma2T.greekmelody	@ltx/en_us_dedes/he.a.m8:heAU.TinSofianKaiLogon.greekname
ltx/en_us_dedes/me.m02.d26:alt1.meMA.Kathisma2T.incipit	@ltx/en_us_dedes/oc.m8.d1:ocMA.Kathisma13.incipit
ltx/en_us_dedes/me.m02.d26:alt1.meMA.Kathisma2T.melody	@ltx/en_us_dedes/he.a.m8:heAU.TinSofianKaiLogon.name
ltx/en_us_dedes/me.m02.d26:alt1.meMA.Kathisma2T.mode	@ltx/en_us_dedes/miscellanea:misc.Mode8
ltx/en_us_dedes/me.m02.d26:alt1.meMA.Kathisma2T.text	@ltx/en_us_dedes/oc.m8.d1:ocMA.Kathisma13.text
ltx/en_us_dedes/me.m02.d26:alt1.meMA.Kontakion1.greekmelody	@ltx/en_us_dedes/he.a.m3:heAU.IParthenosSimeron.greekname
ltx/en_us_dedes/me.m02.d26:alt1.meMA.Kontakion1.incipit	On this day, the glorious…
ltx/en_us_dedes/me.m02.d26:alt1.meMA.Kontakion1.melody	@ltx/en_us_dedes/he.a.m3:heAU.IParthenosSimeron.name
ltx/en_us_dedes/me.m02.d26:alt1.meMA.Kontakion1.mode	@ltx/en_us_dedes/miscellanea:misc.Mode3
ltx/en_us_dedes/me.m02.d26:alt1.meMA.Kontakion1.text	On this day, the glorious * garland and glory of Martyrs, * Photini, who clearly went * up to the heavens, invites us, * who enjoy the gifts of grace that she distributes, * to observe her holy feast day and celebrate it * with our joyful hymns. And therefore * let all the faithful extol and honor her.
ltx/en_us_dedes/me.m02.d26:alt1.meMA.Lauds1.greekmelody	@ltx/en_us_dedes/he.a.m2:heAU.OteEkTouXylou.greekname
ltx/en_us_dedes/me.m02.d26:alt1.meMA.Lauds1.incipit	…
ltx/en_us_dedes/me.m02.d26:alt1.meMA.Lauds1.melody	@ltx/en_us_dedes/he.a.m2:heAU.OteEkTouXylou.name
ltx/en_us_dedes/me.m02.d26:alt1.meMA.Lauds1.mode	@ltx/en_us_dedes/miscellanea:misc.Mode2
ltx/en_us_dedes/me.m02.d26:alt1.meMA.Lauds1.text	
ltx/en_us_dedes/me.m02.d26:alt1.meMA.Lauds2.incipit	…
ltx/en_us_dedes/me.m02.d26:alt1.meMA.Lauds2.melody	@ltx/en_us_dedes/he.a.m2:heAU.OteEkTouXylou.name
ltx/en_us_dedes/me.m02.d26:alt1.meMA.Lauds2.mode	@ltx/en_us_dedes/miscellanea:misc.Mode2
ltx/en_us_dedes/me.m02.d26:alt1.meMA.Lauds2.text	
ltx/en_us_dedes/me.m02.d26:alt1.meMA.Lauds3.incipit	…
ltx/en_us_dedes/me.m02.d26:alt1.meMA.Lauds3.melody	@ltx/en_us_dedes/he.a.m2:heAU.OteEkTouXylou.name
ltx/en_us_dedes/me.m02.d26:alt1.meMA.Lauds3.mode	@ltx/en_us_dedes/miscellanea:misc.Mode2
ltx/en_us_dedes/me.m02.d26:alt1.meMA.Lauds3.text	
ltx/en_us_dedes/me.m02.d26:alt1.meMA.LaudsGlory.incipit	…
ltx/en_us_dedes/me.m02.d26:alt1.meMA.LaudsGlory.melody	
ltx/en_us_dedes/me.m02.d26:alt1.meMA.LaudsGlory.mode	@ltx/en_us_dedes/miscellanea:misc.Mode6
ltx/en_us_dedes/me.m02.d26:alt1.meMA.LaudsGlory.text	
ltx/en_us_dedes/me.m02.d26:alt1.meMA.LaudsTheotokion.incipit	@ltx/en_us_dedes/oc.m6.d5:ocVE.AposTheotokion.incipit
ltx/en_us_dedes/me.m02.d26:alt1.meMA.LaudsTheotokion.melody	
ltx/en_us_dedes/me.m02.d26:alt1.meMA.LaudsTheotokion.mode	@ltx/en_us_dedes/miscellanea:misc.Mode6
ltx/en_us_dedes/me.m02.d26:alt1.meMA.LaudsTheotokion.text	@ltx/en_us_dedes/oc.m6.d5:ocVE.AposTheotokion.text
ltx/en_us_dedes/me.m02.d26:alt1.meMA.Ode1C11.greekmelody	@ltx/en_us_dedes/he.h.m4:heHE.AnoixoToStomaMou.greekname
ltx/en_us_dedes/me.m02.d26:alt1.meMA.Ode1C11.incipit	…
ltx/en_us_dedes/me.m02.d26:alt1.meMA.Ode1C11.melody	@ltx/en_us_dedes/he.h.m4:heHE.AnoixoToStomaMou.name
ltx/en_us_dedes/me.m02.d26:alt1.meMA.Ode1C11.mode	@ltx/en_us_dedes/miscellanea:misc.Mode4
ltx/en_us_dedes/me.m02.d26:alt1.meMA.Ode1C11.ode	@ltx/en_us_dedes/miscellanea:misc.Ode1
ltx/en_us_dedes/me.m02.d26:alt1.meMA.Ode1C11.text	
ltx/en_us_dedes/me.m02.d26:alt1.meMA.Ode1C12.incipit	…
ltx/en_us_dedes/me.m02.d26:alt1.meMA.Ode1C12.melody	@ltx/en_us_dedes/he.h.m4:heHE.AnoixoToStomaMou.name
ltx/en_us_dedes/me.m02.d26:alt1.meMA.Ode1C12.mode	@ltx/en_us_dedes/miscellanea:misc.Mode4
ltx/en_us_dedes/me.m02.d26:alt1.meMA.Ode1C12.ode	@ltx/en_us_dedes/miscellanea:misc.Ode1
ltx/en_us_dedes/me.m02.d26:alt1.meMA.Ode1C12.text	
ltx/en_us_dedes/me.m02.d26:alt1.meMA.Ode1C13.incipit	…
ltx/en_us_dedes/me.m02.d26:alt1.meMA.Ode1C13.melody	@ltx/en_us_dedes/he.h.m4:heHE.AnoixoToStomaMou.name
ltx/en_us_dedes/me.m02.d26:alt1.meMA.Ode1C13.mode	@ltx/en_us_dedes/miscellanea:misc.Mode4
ltx/en_us_dedes/me.m02.d26:alt1.meMA.Ode1C13.ode	@ltx/en_us_dedes/miscellanea:misc.Ode1
ltx/en_us_dedes/me.m02.d26:alt1.meMA.Ode1C13.text	
ltx/en_us_dedes/me.m02.d26:alt1.meMA.Ode1C1T.incipit	…
ltx/en_us_dedes/me.m02.d26:alt1.meMA.Ode1C1T.melody	@ltx/en_us_dedes/he.h.m4:heHE.AnoixoToStomaMou.name
ltx/en_us_dedes/me.m02.d26:alt1.meMA.Ode1C1T.mode	@ltx/en_us_dedes/miscellanea:misc.Mode4
ltx/en_us_dedes/me.m02.d26:alt1.meMA.Ode1C1T.ode	@ltx/en_us_dedes/miscellanea:misc.Ode1
ltx/en_us_dedes/me.m02.d26:alt1.meMA.Ode1C1T.text	
ltx/en_us_dedes/me.m02.d26:alt1.meMA.Ode3C11.greekmelody	@ltx/en_us_dedes/he.h.m4:heHE.TousSousYmnologous.greekname
ltx/en_us_dedes/me.m02.d26:alt1.meMA.Ode3C11.incipit	…
ltx/en_us_dedes/me.m02.d26:alt1.meMA.Ode3C11.melody	@ltx/en_us_dedes/he.h.m4:heHE.TousSousYmnologous.name
ltx/en_us_dedes/me.m02.d26:alt1.meMA.Ode3C11.mode	@ltx/en_us_dedes/miscellanea:misc.Mode4
ltx/en_us_dedes/me.m02.d26:alt1.meMA.Ode3C11.ode	@ltx/en_us_dedes/miscellanea:misc.Ode3
ltx/en_us_dedes/me.m02.d26:alt1.meMA.Ode3C11.text	
ltx/en_us_dedes/me.m02.d26:alt1.meMA.Ode3C12.incipit	…
ltx/en_us_dedes/me.m02.d26:alt1.meMA.Ode3C12.melody	@ltx/en_us_dedes/he.h.m4:heHE.TousSousYmnologous.name
ltx/en_us_dedes/me.m02.d26:alt1.meMA.Ode3C12.mode	@ltx/en_us_dedes/miscellanea:misc.Mode4
ltx/en_us_dedes/me.m02.d26:alt1.meMA.Ode3C12.ode	@ltx/en_us_dedes/miscellanea:misc.Ode3
ltx/en_us_dedes/me.m02.d26:alt1.meMA.Ode3C12.text	
ltx/en_us_dedes/me.m02.d26:alt1.meMA.Ode3C13.incipit	…
ltx/en_us_dedes/me.m02.d26:alt1.meMA.Ode3C13.melody	@ltx/en_us_dedes/he.h.m4:heHE.TousSousYmnologous.name
ltx/en_us_dedes/me.m02.d26:alt1.meMA.Ode3C13.mode	@ltx/en_us_dedes/miscellanea:misc.Mode4
ltx/en_us_dedes/me.m02.d26:alt1.meMA.Ode3C13.ode	@ltx/en_us_dedes/miscellanea:misc.Ode3
ltx/en_us_dedes/me.m02.d26:alt1.meMA.Ode3C13.text	
ltx/en_us_dedes/me.m02.d26:alt1.meMA.Ode3C1T.incipit	…
ltx/en_us_dedes/me.m02.d26:alt1.meMA.Ode3C1T.melody	@ltx/en_us_dedes/he.h.m4:heHE.TousSousYmnologous.name
ltx/en_us_dedes/me.m02.d26:alt1.meMA.Ode3C1T.mode	@ltx/en_us_dedes/miscellanea:misc.Mode4
ltx/en_us_dedes/me.m02.d26:alt1.meMA.Ode3C1T.ode	@ltx/en_us_dedes/miscellanea:misc.Ode3
ltx/en_us_dedes/me.m02.d26:alt1.meMA.Ode3C1T.text	
ltx/en_us_dedes/me.m02.d26:alt1.meMA.Ode3Kathisma1.greekmelody	@ltx/en_us_dedes/he.a.m8:heAU.ToProstachthen.greekname
ltx/en_us_dedes/me.m02.d26:alt1.meMA.Ode3Kathisma1.incipit	…
ltx/en_us_dedes/me.m02.d26:alt1.meMA.Ode3Kathisma1.melody	@ltx/en_us_dedes/he.a.m8:heAU.ToProstachthen.name
ltx/en_us_dedes/me.m02.d26:alt1.meMA.Ode3Kathisma1.mode	@ltx/en_us_dedes/miscellanea:misc.Mode8
ltx/en_us_dedes/me.m02.d26:alt1.meMA.Ode3Kathisma1.text	
ltx/en_us_dedes/me.m02.d26:alt1.meMA.Ode3KathismaT.incipit	…
ltx/en_us_dedes/me.m02.d26:alt1.meMA.Ode3KathismaT.melody	@ltx/en_us_dedes/he.a.m8:heAU.ToProstachthen.name
ltx/en_us_dedes/me.m02.d26:alt1.meMA.Ode3KathismaT.mode	@ltx/en_us_dedes/miscellanea:misc.Mode8
ltx/en_us_dedes/me.m02.d26:alt1.meMA.Ode3KathismaT.text	
ltx/en_us_dedes/me.m02.d26:alt1.meMA.Ode4C11.greekmelody	@ltx/en_us_dedes/he.h.m4:heHE.TinAnexichniaston.greekname
ltx/en_us_dedes/me.m02.d26:alt1.meMA.Ode4C11.incipit	…
ltx/en_us_dedes/me.m02.d26:alt1.meMA.Ode4C11.melody	@ltx/en_us_dedes/he.h.m4:heHE.TinAnexichniaston.name
ltx/en_us_dedes/me.m02.d26:alt1.meMA.Ode4C11.mode	@ltx/en_us_dedes/miscellanea:misc.Mode4
ltx/en_us_dedes/me.m02.d26:alt1.meMA.Ode4C11.ode	@ltx/en_us_dedes/miscellanea:misc.Ode4
ltx/en_us_dedes/me.m02.d26:alt1.meMA.Ode4C11.text	
ltx/en_us_dedes/me.m02.d26:alt1.meMA.Ode4C12.incipit	…
ltx/en_us_dedes/me.m02.d26:alt1.meMA.Ode4C12.melody	@ltx/en_us_dedes/he.h.m4:heHE.TinAnexichniaston.name
ltx/en_us_dedes/me.m02.d26:alt1.meMA.Ode4C12.mode	@ltx/en_us_dedes/miscellanea:misc.Mode4
ltx/en_us_dedes/me.m02.d26:alt1.meMA.Ode4C12.ode	@ltx/en_us_dedes/miscellanea:misc.Ode4
ltx/en_us_dedes/me.m02.d26:alt1.meMA.Ode4C12.text	
ltx/en_us_dedes/me.m02.d26:alt1.meMA.Ode4C13.incipit	…
ltx/en_us_dedes/me.m02.d26:alt1.meMA.Ode4C13.melody	@ltx/en_us_dedes/he.h.m4:heHE.TinAnexichniaston.name
ltx/en_us_dedes/me.m02.d26:alt1.meMA.Ode4C13.mode	@ltx/en_us_dedes/miscellanea:misc.Mode4
ltx/en_us_dedes/me.m02.d26:alt1.meMA.Ode4C13.ode	@ltx/en_us_dedes/miscellanea:misc.Ode4
ltx/en_us_dedes/me.m02.d26:alt1.meMA.Ode4C13.text	
ltx/en_us_dedes/me.m02.d26:alt1.meMA.Ode4C1T.incipit	…
ltx/en_us_dedes/me.m02.d26:alt1.meMA.Ode4C1T.melody	@ltx/en_us_dedes/he.h.m4:heHE.TinAnexichniaston.name
ltx/en_us_dedes/me.m02.d26:alt1.meMA.Ode4C1T.mode	@ltx/en_us_dedes/miscellanea:misc.Mode4
ltx/en_us_dedes/me.m02.d26:alt1.meMA.Ode4C1T.ode	@ltx/en_us_dedes/miscellanea:misc.Ode4
ltx/en_us_dedes/me.m02.d26:alt1.meMA.Ode4C1T.text	
ltx/en_us_dedes/me.m02.d26:alt1.meMA.Ode5C11.greekmelody	@ltx/en_us_dedes/he.h.m4:heHE.ExestiTaSympanta.greekname
ltx/en_us_dedes/me.m02.d26:alt1.meMA.Ode5C11.incipit	…
ltx/en_us_dedes/me.m02.d26:alt1.meMA.Ode5C11.melody	@ltx/en_us_dedes/he.h.m4:heHE.ExestiTaSympanta.name
ltx/en_us_dedes/me.m02.d26:alt1.meMA.Ode5C11.mode	@ltx/en_us_dedes/miscellanea:misc.Mode4
ltx/en_us_dedes/me.m02.d26:alt1.meMA.Ode5C11.ode	@ltx/en_us_dedes/miscellanea:misc.Ode5
ltx/en_us_dedes/me.m02.d26:alt1.meMA.Ode5C11.text	
ltx/en_us_dedes/me.m02.d26:alt1.meMA.Ode5C12.incipit	…
ltx/en_us_dedes/me.m02.d26:alt1.meMA.Ode5C12.melody	@ltx/en_us_dedes/he.h.m4:heHE.ExestiTaSympanta.name
ltx/en_us_dedes/me.m02.d26:alt1.meMA.Ode5C12.mode	@ltx/en_us_dedes/miscellanea:misc.Mode4
ltx/en_us_dedes/me.m02.d26:alt1.meMA.Ode5C12.ode	@ltx/en_us_dedes/miscellanea:misc.Ode5
ltx/en_us_dedes/me.m02.d26:alt1.meMA.Ode5C12.text	
ltx/en_us_dedes/me.m02.d26:alt1.meMA.Ode5C13.incipit	…
ltx/en_us_dedes/me.m02.d26:alt1.meMA.Ode5C13.melody	@ltx/en_us_dedes/he.h.m4:heHE.ExestiTaSympanta.name
ltx/en_us_dedes/me.m02.d26:alt1.meMA.Ode5C13.mode	@ltx/en_us_dedes/miscellanea:misc.Mode4
ltx/en_us_dedes/me.m02.d26:alt1.meMA.Ode5C13.ode	@ltx/en_us_dedes/miscellanea:misc.Ode5
ltx/en_us_dedes/me.m02.d26:alt1.meMA.Ode5C13.text	
ltx/en_us_dedes/me.m02.d26:alt1.meMA.Ode5C1T.incipit	…
ltx/en_us_dedes/me.m02.d26:alt1.meMA.Ode5C1T.melody	@ltx/en_us_dedes/he.h.m4:heHE.ExestiTaSympanta.name
ltx/en_us_dedes/me.m02.d26:alt1.meMA.Ode5C1T.mode	@ltx/en_us_dedes/miscellanea:misc.Mode4
ltx/en_us_dedes/me.m02.d26:alt1.meMA.Ode5C1T.ode	@ltx/en_us_dedes/miscellanea:misc.Ode5
ltx/en_us_dedes/me.m02.d26:alt1.meMA.Ode5C1T.text	
ltx/en_us_dedes/me.m02.d26:alt1.meMA.Ode6C11.greekmelody	@ltx/en_us_dedes/he.h.m4:heHE.TinTheianTaftin.greekname
ltx/en_us_dedes/me.m02.d26:alt1.meMA.Ode6C11.incipit	…
ltx/en_us_dedes/me.m02.d26:alt1.meMA.Ode6C11.melody	@ltx/en_us_dedes/he.h.m4:heHE.TinTheianTaftin.name
ltx/en_us_dedes/me.m02.d26:alt1.meMA.Ode6C11.mode	@ltx/en_us_dedes/miscellanea:misc.Mode4
ltx/en_us_dedes/me.m02.d26:alt1.meMA.Ode6C11.ode	@ltx/en_us_dedes/miscellanea:misc.Ode6
ltx/en_us_dedes/me.m02.d26:alt1.meMA.Ode6C11.text	
ltx/en_us_dedes/me.m02.d26:alt1.meMA.Ode6C12.incipit	…
ltx/en_us_dedes/me.m02.d26:alt1.meMA.Ode6C12.melody	@ltx/en_us_dedes/he.h.m4:heHE.TinTheianTaftin.name
ltx/en_us_dedes/me.m02.d26:alt1.meMA.Ode6C12.mode	@ltx/en_us_dedes/miscellanea:misc.Mode4
ltx/en_us_dedes/me.m02.d26:alt1.meMA.Ode6C12.ode	@ltx/en_us_dedes/miscellanea:misc.Ode6
ltx/en_us_dedes/me.m02.d26:alt1.meMA.Ode6C12.text	
ltx/en_us_dedes/me.m02.d26:alt1.meMA.Ode6C13.incipit	…
ltx/en_us_dedes/me.m02.d26:alt1.meMA.Ode6C13.melody	@ltx/en_us_dedes/he.h.m4:heHE.TinTheianTaftin.name
ltx/en_us_dedes/me.m02.d26:alt1.meMA.Ode6C13.mode	@ltx/en_us_dedes/miscellanea:misc.Mode4
ltx/en_us_dedes/me.m02.d26:alt1.meMA.Ode6C13.ode	@ltx/en_us_dedes/miscellanea:misc.Ode6
ltx/en_us_dedes/me.m02.d26:alt1.meMA.Ode6C13.text	
ltx/en_us_dedes/me.m02.d26:alt1.meMA.Ode6C1T.incipit	…
ltx/en_us_dedes/me.m02.d26:alt1.meMA.Ode6C1T.melody	@ltx/en_us_dedes/he.h.m4:heHE.TinTheianTaftin.name
ltx/en_us_dedes/me.m02.d26:alt1.meMA.Ode6C1T.mode	@ltx/en_us_dedes/miscellanea:misc.Mode4
ltx/en_us_dedes/me.m02.d26:alt1.meMA.Ode6C1T.ode	@ltx/en_us_dedes/miscellanea:misc.Ode6
ltx/en_us_dedes/me.m02.d26:alt1.meMA.Ode6C1T.text	
ltx/en_us_dedes/me.m02.d26:alt1.meMA.Ode7C11.greekmelody	@ltx/en_us_dedes/he.h.m4:heHE.OukElatrefsan.greekname
ltx/en_us_dedes/me.m02.d26:alt1.meMA.Ode7C11.incipit	…
ltx/en_us_dedes/me.m02.d26:alt1.meMA.Ode7C11.melody	@ltx/en_us_dedes/he.h.m4:heHE.OukElatrefsan.name
ltx/en_us_dedes/me.m02.d26:alt1.meMA.Ode7C11.mode	@ltx/en_us_dedes/miscellanea:misc.Mode4
ltx/en_us_dedes/me.m02.d26:alt1.meMA.Ode7C11.ode	@ltx/en_us_dedes/miscellanea:misc.Ode7
ltx/en_us_dedes/me.m02.d26:alt1.meMA.Ode7C11.text	
ltx/en_us_dedes/me.m02.d26:alt1.meMA.Ode7C12.incipit	…
ltx/en_us_dedes/me.m02.d26:alt1.meMA.Ode7C12.melody	@ltx/en_us_dedes/he.h.m4:heHE.OukElatrefsan.name
ltx/en_us_dedes/me.m02.d26:alt1.meMA.Ode7C12.mode	@ltx/en_us_dedes/miscellanea:misc.Mode4
ltx/en_us_dedes/me.m02.d26:alt1.meMA.Ode7C12.ode	@ltx/en_us_dedes/miscellanea:misc.Ode7
ltx/en_us_dedes/me.m02.d26:alt1.meMA.Ode7C12.text	
ltx/en_us_dedes/me.m02.d26:alt1.meMA.Ode7C13.incipit	…
ltx/en_us_dedes/me.m02.d26:alt1.meMA.Ode7C13.melody	@ltx/en_us_dedes/he.h.m4:heHE.OukElatrefsan.name
ltx/en_us_dedes/me.m02.d26:alt1.meMA.Ode7C13.mode	@ltx/en_us_dedes/miscellanea:misc.Mode4
ltx/en_us_dedes/me.m02.d26:alt1.meMA.Ode7C13.ode	@ltx/en_us_dedes/miscellanea:misc.Ode7
ltx/en_us_dedes/me.m02.d26:alt1.meMA.Ode7C13.text	
ltx/en_us_dedes/me.m02.d26:alt1.meMA.Ode7C1T.incipit	…
ltx/en_us_dedes/me.m02.d26:alt1.meMA.Ode7C1T.melody	@ltx/en_us_dedes/he.h.m4:heHE.OukElatrefsan.name
ltx/en_us_dedes/me.m02.d26:alt1.meMA.Ode7C1T.mode	@ltx/en_us_dedes/miscellanea:misc.Mode4
ltx/en_us_dedes/me.m02.d26:alt1.meMA.Ode7C1T.ode	@ltx/en_us_dedes/miscellanea:misc.Ode7
ltx/en_us_dedes/me.m02.d26:alt1.meMA.Ode7C1T.text	
ltx/en_us_dedes/me.m02.d26:alt1.meMA.Ode8C11.greekmelody	@ltx/en_us_dedes/he.h.m4:heHE.PaidasEvageis.greekname
ltx/en_us_dedes/me.m02.d26:alt1.meMA.Ode8C11.incipit	…
ltx/en_us_dedes/me.m02.d26:alt1.meMA.Ode8C11.melody	@ltx/en_us_dedes/he.h.m4:heHE.PaidasEvageis.name
ltx/en_us_dedes/me.m02.d26:alt1.meMA.Ode8C11.mode	@ltx/en_us_dedes/miscellanea:misc.Mode4
ltx/en_us_dedes/me.m02.d26:alt1.meMA.Ode8C11.ode	@ltx/en_us_dedes/miscellanea:misc.Ode8
ltx/en_us_dedes/me.m02.d26:alt1.meMA.Ode8C11.text	
ltx/en_us_dedes/me.m02.d26:alt1.meMA.Ode8C12.incipit	…
ltx/en_us_dedes/me.m02.d26:alt1.meMA.Ode8C12.melody	@ltx/en_us_dedes/he.h.m4:heHE.PaidasEvageis.name
ltx/en_us_dedes/me.m02.d26:alt1.meMA.Ode8C12.mode	@ltx/en_us_dedes/miscellanea:misc.Mode4
ltx/en_us_dedes/me.m02.d26:alt1.meMA.Ode8C12.ode	@ltx/en_us_dedes/miscellanea:misc.Ode8
ltx/en_us_dedes/me.m02.d26:alt1.meMA.Ode8C12.text	
ltx/en_us_dedes/me.m02.d26:alt1.meMA.Ode8C13.incipit	…
ltx/en_us_dedes/me.m02.d26:alt1.meMA.Ode8C13.melody	@ltx/en_us_dedes/he.h.m4:heHE.PaidasEvageis.name
ltx/en_us_dedes/me.m02.d26:alt1.meMA.Ode8C13.mode	@ltx/en_us_dedes/miscellanea:misc.Mode4
ltx/en_us_dedes/me.m02.d26:alt1.meMA.Ode8C13.ode	@ltx/en_us_dedes/miscellanea:misc.Ode8
ltx/en_us_dedes/me.m02.d26:alt1.meMA.Ode8C13.text	
ltx/en_us_dedes/me.m02.d26:alt1.meMA.Ode8C1T.incipit	…
ltx/en_us_dedes/me.m02.d26:alt1.meMA.Ode8C1T.melody	@ltx/en_us_dedes/he.h.m4:heHE.PaidasEvageis.name
ltx/en_us_dedes/me.m02.d26:alt1.meMA.Ode8C1T.mode	@ltx/en_us_dedes/miscellanea:misc.Mode4
ltx/en_us_dedes/me.m02.d26:alt1.meMA.Ode8C1T.ode	@ltx/en_us_dedes/miscellanea:misc.Ode8
ltx/en_us_dedes/me.m02.d26:alt1.meMA.Ode8C1T.text	
ltx/en_us_dedes/me.m02.d26:alt1.meMA.Ode9C11.greekmelody	@ltx/en_us_dedes/he.h.m4:heHE.ApasGigenis.greekname
ltx/en_us_dedes/me.m02.d26:alt1.meMA.Ode9C11.incipit	…
ltx/en_us_dedes/me.m02.d26:alt1.meMA.Ode9C11.melody	@ltx/en_us_dedes/he.h.m4:heHE.ApasGigenis.name
ltx/en_us_dedes/me.m02.d26:alt1.meMA.Ode9C11.mode	@ltx/en_us_dedes/miscellanea:misc.Mode4
ltx/en_us_dedes/me.m02.d26:alt1.meMA.Ode9C11.ode	@ltx/en_us_dedes/miscellanea:misc.Ode9
ltx/en_us_dedes/me.m02.d26:alt1.meMA.Ode9C11.text	
ltx/en_us_dedes/me.m02.d26:alt1.meMA.Ode9C12.incipit	…
ltx/en_us_dedes/me.m02.d26:alt1.meMA.Ode9C12.melody	@ltx/en_us_dedes/he.h.m4:heHE.ApasGigenis.name
ltx/en_us_dedes/me.m02.d26:alt1.meMA.Ode9C12.mode	@ltx/en_us_dedes/miscellanea:misc.Mode4
ltx/en_us_dedes/me.m02.d26:alt1.meMA.Ode9C12.ode	@ltx/en_us_dedes/miscellanea:misc.Ode9
ltx/en_us_dedes/me.m02.d26:alt1.meMA.Ode9C12.text	
ltx/en_us_dedes/me.m02.d26:alt1.meMA.Ode9C13.incipit	…
ltx/en_us_dedes/me.m02.d26:alt1.meMA.Ode9C13.melody	@ltx/en_us_dedes/he.h.m4:heHE.ApasGigenis.name
ltx/en_us_dedes/me.m02.d26:alt1.meMA.Ode9C13.mode	@ltx/en_us_dedes/miscellanea:misc.Mode4
ltx/en_us_dedes/me.m02.d26:alt1.meMA.Ode9C13.ode	@ltx/en_us_dedes/miscellanea:misc.Ode9
ltx/en_us_dedes/me.m02.d26:alt1.meMA.Ode9C13.text	
ltx/en_us_dedes/me.m02.d26:alt1.meMA.Ode9C1T.incipit	…
ltx/en_us_dedes/me.m02.d26:alt1.meMA.Ode9C1T.melody	@ltx/en_us_dedes/he.h.m4:heHE.ApasGigenis.name
ltx/en_us_dedes/me.m02.d26:alt1.meMA.Ode9C1T.mode	@ltx/en_us_dedes/miscellanea:misc.Mode4
ltx/en_us_dedes/me.m02.d26:alt1.meMA.Ode9C1T.ode	@ltx/en_us_dedes/miscellanea:misc.Ode9
ltx/en_us_dedes/me.m02.d26:alt1.meMA.Ode9C1T.text	
ltx/en_us_dedes/me.m02.d26:alt1.meMA.Oikos1.text	Today, I see a celebration of Martyrs, a solemn feast of a God-loving generation, here in the church of St. Photini, the glorious Great-martyr, and it is very bright, like the starry sky. In fact, those with her, being seven in number, shine on us brighter than any planet, and they send down gifts of illumination on those who faithfully honor them and annually celebrate their feast. And although I desire to translate their praises, I am unable. So, come and join me, all of you, and let us raise our hands in prayer, and let us cry out to her and say: “Rejoice, O Martyr of Christ. All we the faithful extol and honor you.”
ltx/en_us_dedes/me.m02.d26:alt1.meMA.PostGospelBoth.incipit	@ltx/en_us_dedes/ho.ho03:hoMA.PostGospelTheotokos.incipit
ltx/en_us_dedes/me.m02.d26:alt1.meMA.PostGospelBoth.melody	
ltx/en_us_dedes/me.m02.d26:alt1.meMA.PostGospelBoth.mode	@ltx/en_us_dedes/miscellanea:misc.Mode2
ltx/en_us_dedes/me.m02.d26:alt1.meMA.PostGospelBoth.text	@ltx/en_us_dedes/ho.ho03:hoMA.PostGospelTheotokos.text
ltx/en_us_dedes/me.m02.d26:alt1.meMA.PostGospelGlory.incipit	@ltx/en_us_dedes/ho.ho03:hoMA.PostGospelWomanMartyr.incipit
ltx/en_us_dedes/me.m02.d26:alt1.meMA.PostGospelGlory.melody	
ltx/en_us_dedes/me.m02.d26:alt1.meMA.PostGospelGlory.mode	@ltx/en_us_dedes/miscellanea:misc.Mode2
ltx/en_us_dedes/me.m02.d26:alt1.meMA.PostGospelGlory.text	@ltx/en_us_dedes/ho.ho03:hoMA.PostGospelWomanMartyr.text
ltx/en_us_dedes/me.m02.d26:alt1.meMA.PostGospelIdiomelon.incipit	…
ltx/en_us_dedes/me.m02.d26:alt1.meMA.PostGospelIdiomelon.melody	
ltx/en_us_dedes/me.m02.d26:alt1.meMA.PostGospelIdiomelon.mode	@ltx/en_us_dedes/miscellanea:misc.Mode2
ltx/en_us_dedes/me.m02.d26:alt1.meMA.PostGospelIdiomelon.text	
ltx/en_us_dedes/me.m02.d26:alt1.meMA.Synaxarion.text	
ltx/en_us_dedes/me.m02.d26:alt1.meMA.couplet1.title	@ltx/en_us_dedes/titles:ti.Verses
ltx/en_us_dedes/me.m02.d26:alt1.meMA.couplet1.verse1	
ltx/en_us_dedes/me.m02.d26:alt1.meMA.couplet1.verse2	
ltx/en_us_dedes/me.m02.d26:alt1.meMA.couplet2.verse1	
ltx/en_us_dedes/me.m02.d26:alt1.meMA.couplet2.verse2	
ltx/en_us_dedes/me.m02.d26:alt1.meVE.Apolytikion1.greekmelody	@ltx/en_us_dedes/he.a.m3:heAU.TheiasPisteos.greekname
ltx/en_us_dedes/me.m02.d26:alt1.meVE.Apolytikion1.incipit	All illumined by the Holy…
ltx/en_us_dedes/me.m02.d26:alt1.meVE.Apolytikion1.melody	@ltx/en_us_dedes/he.a.m3:heAU.TheiasPisteos.name
ltx/en_us_dedes/me.m02.d26:alt1.meVE.Apolytikion1.mode	@ltx/en_us_dedes/miscellanea:misc.Mode3
ltx/en_us_dedes/me.m02.d26:alt1.meVE.Apolytikion1.text	All illumined by the Holy Spirit, * irrigated by the living waters * that the Savior provides, O all-lauded Saint, * when you had drunk of the waters of salvation, * to those who thirsted you shared them abundantly. * O Great-martyr and Apostles’ equal, St. Photini, * to Christ our God pray fervently, * entreating Him to save our souls.
ltx/en_us_dedes/me.m02.d26:alt1.meVE.Apolytikion2.greekmelody	@ltx/en_us_dedes/he.a.m3:heAU.TheiasPisteos.greekname
ltx/en_us_dedes/me.m02.d26:alt1.meVE.Apolytikion2.incipit	…
ltx/en_us_dedes/me.m02.d26:alt1.meVE.Apolytikion2.melody	@ltx/en_us_dedes/he.a.m3:heAU.TheiasPisteos.name
ltx/en_us_dedes/me.m02.d26:alt1.meVE.Apolytikion2.mode	@ltx/en_us_dedes/miscellanea:misc.Mode3
ltx/en_us_dedes/me.m02.d26:alt1.meVE.Apolytikion2.text	
ltx/en_us_dedes/me.m02.d26:alt1.meVE.AposGlory.incipit	…
ltx/en_us_dedes/me.m02.d26:alt1.meVE.AposGlory.melody	
ltx/en_us_dedes/me.m02.d26:alt1.meVE.AposGlory.mode	@ltx/en_us_dedes/miscellanea:misc.Mode8
ltx/en_us_dedes/me.m02.d26:alt1.meVE.AposGlory.text	
ltx/en_us_dedes/me.m02.d26:alt1.meVE.AposTheotokion.incipit	@ltx/en_us_dedes/oc.m8.d5:ocMA.AposTheotokion.incipit
ltx/en_us_dedes/me.m02.d26:alt1.meVE.AposTheotokion.melody	
ltx/en_us_dedes/me.m02.d26:alt1.meVE.AposTheotokion.mode	@ltx/en_us_dedes/miscellanea:misc.Mode8
ltx/en_us_dedes/me.m02.d26:alt1.meVE.AposTheotokion.text	@ltx/en_us_dedes/oc.m8.d5:ocMA.AposTheotokion.text
ltx/en_us_dedes/me.m02.d26:alt1.meVE.Aposticha1.greekmelody	@ltx/en_us_dedes/he.a.m1:heAU.TonOuranionTagmaton.greekname
ltx/en_us_dedes/me.m02.d26:alt1.meVE.Aposticha1.incipit	…
ltx/en_us_dedes/me.m02.d26:alt1.meVE.Aposticha1.melody	@ltx/en_us_dedes/he.a.m1:heAU.TonOuranionTagmaton.name
ltx/en_us_dedes/me.m02.d26:alt1.meVE.Aposticha1.mode	@ltx/en_us_dedes/miscellanea:misc.Mode1
ltx/en_us_dedes/me.m02.d26:alt1.meVE.Aposticha1.text	
ltx/en_us_dedes/me.m02.d26:alt1.meVE.Aposticha2.incipit	…
ltx/en_us_dedes/me.m02.d26:alt1.meVE.Aposticha2.melody	@ltx/en_us_dedes/he.a.m1:heAU.TonOuranionTagmaton.name
ltx/en_us_dedes/me.m02.d26:alt1.meVE.Aposticha2.mode	@ltx/en_us_dedes/miscellanea:misc.Mode1
ltx/en_us_dedes/me.m02.d26:alt1.meVE.Aposticha2.text	
ltx/en_us_dedes/me.m02.d26:alt1.meVE.Aposticha3.incipit	…
ltx/en_us_dedes/me.m02.d26:alt1.meVE.Aposticha3.melody	@ltx/en_us_dedes/he.a.m1:heAU.TonOuranionTagmaton.name
ltx/en_us_dedes/me.m02.d26:alt1.meVE.Aposticha3.mode	@ltx/en_us_dedes/miscellanea:misc.Mode1
ltx/en_us_dedes/me.m02.d26:alt1.meVE.Aposticha3.text	
ltx/en_us_dedes/me.m02.d26:alt1.meVE.Lity1.incipit	…
ltx/en_us_dedes/me.m02.d26:alt1.meVE.Lity1.melody	
ltx/en_us_dedes/me.m02.d26:alt1.meVE.Lity1.mode	@ltx/en_us_dedes/miscellanea:misc.Mode1
ltx/en_us_dedes/me.m02.d26:alt1.meVE.Lity1.text	
ltx/en_us_dedes/me.m02.d26:alt1.meVE.Lity2.incipit	…
ltx/en_us_dedes/me.m02.d26:alt1.meVE.Lity2.melody	
ltx/en_us_dedes/me.m02.d26:alt1.meVE.Lity2.mode	@ltx/en_us_dedes/miscellanea:misc.Mode4
ltx/en_us_dedes/me.m02.d26:alt1.meVE.Lity2.text	
ltx/en_us_dedes/me.m02.d26:alt1.meVE.Lity3.incipit	…
ltx/en_us_dedes/me.m02.d26:alt1.meVE.Lity3.melody	
ltx/en_us_dedes/me.m02.d26:alt1.meVE.Lity3.mode	@ltx/en_us_dedes/miscellanea:misc.Mode4
ltx/en_us_dedes/me.m02.d26:alt1.meVE.Lity3.text	
ltx/en_us_dedes/me.m02.d26:alt1.meVE.LityBoth.incipit	@ltx/en_us_dedes/oc.m5.d3:ocVE.AposTheotokion.incipit
ltx/en_us_dedes/me.m02.d26:alt1.meVE.LityBoth.melody	
ltx/en_us_dedes/me.m02.d26:alt1.meVE.LityBoth.mode	@ltx/en_us_dedes/miscellanea:misc.Mode5
ltx/en_us_dedes/me.m02.d26:alt1.meVE.LityBoth.text	@ltx/en_us_dedes/oc.m5.d3:ocVE.AposTheotokion.text
ltx/en_us_dedes/me.m02.d26:alt1.meVE.LityGlory.incipit	…
ltx/en_us_dedes/me.m02.d26:alt1.meVE.LityGlory.melody	
ltx/en_us_dedes/me.m02.d26:alt1.meVE.LityGlory.mode	@ltx/en_us_dedes/miscellanea:misc.Mode5
ltx/en_us_dedes/me.m02.d26:alt1.meVE.LityGlory.text	
ltx/en_us_dedes/me.m02.d26:alt1.meVE.SticGlory.incipit	…
ltx/en_us_dedes/me.m02.d26:alt1.meVE.SticGlory.melody	
ltx/en_us_dedes/me.m02.d26:alt1.meVE.SticGlory.mode	@ltx/en_us_dedes/miscellanea:misc.Mode6
ltx/en_us_dedes/me.m02.d26:alt1.meVE.SticGlory.text	
ltx/en_us_dedes/me.m02.d26:alt1.meVE.SticTheotokion.incipit	@ltx/en_us_dedes/oc.m6.d1:ocVE.SticTheotokion.incipit
ltx/en_us_dedes/me.m02.d26:alt1.meVE.SticTheotokion.melody	
ltx/en_us_dedes/me.m02.d26:alt1.meVE.SticTheotokion.mode	@ltx/en_us_dedes/miscellanea:misc.Mode6
ltx/en_us_dedes/me.m02.d26:alt1.meVE.SticTheotokion.text	@ltx/en_us_dedes/oc.m6.d1:ocVE.SticTheotokion.text
ltx/en_us_dedes/me.m02.d26:alt1.meVE.Stichera01.greekmelody	@ltx/en_us_dedes/he.a.m4:heAU.OsGennaionEnMartysi.greekname
ltx/en_us_dedes/me.m02.d26:alt1.meVE.Stichera01.incipit	…
ltx/en_us_dedes/me.m02.d26:alt1.meVE.Stichera01.melody	@ltx/en_us_dedes/he.a.m4:heAU.OsGennaionEnMartysi.name
ltx/en_us_dedes/me.m02.d26:alt1.meVE.Stichera01.mode	@ltx/en_us_dedes/miscellanea:misc.Mode4
ltx/en_us_dedes/me.m02.d26:alt1.meVE.Stichera01.text	
ltx/en_us_dedes/me.m02.d26:alt1.meVE.Stichera02.incipit	…
ltx/en_us_dedes/me.m02.d26:alt1.meVE.Stichera02.melody	@ltx/en_us_dedes/he.a.m4:heAU.OsGennaionEnMartysi.name
ltx/en_us_dedes/me.m02.d26:alt1.meVE.Stichera02.mode	@ltx/en_us_dedes/miscellanea:misc.Mode4
ltx/en_us_dedes/me.m02.d26:alt1.meVE.Stichera02.text	
ltx/en_us_dedes/me.m02.d26:alt1.meVE.Stichera03.incipit	…
ltx/en_us_dedes/me.m02.d26:alt1.meVE.Stichera03.melody	@ltx/en_us_dedes/he.a.m4:heAU.OsGennaionEnMartysi.name
ltx/en_us_dedes/me.m02.d26:alt1.meVE.Stichera03.mode	@ltx/en_us_dedes/miscellanea:misc.Mode4
ltx/en_us_dedes/me.m02.d26:alt1.meVE.Stichera03.text	
ltx/en_us_dedes/me.m02.d26:meDA.commemoration.first	Memory of Saint Porphyrios, Bishop of Gaza
ltx/en_us_dedes/me.m02.d26:meDA.commemoration.first_name	
ltx/en_us_dedes/me.m02.d26:meDA.commemoration.first_short	Memory of Saint Porphyrios, Bishop of Gaza
ltx/en_us_dedes/me.m02.d26:meDA.commemoration.first_title	@ltx/en_us_dedes/titles:ti.SaintM
ltx/en_us_dedes/me.m02.d26:meDA.commemoration.full	Memory of Saint Porphyrios, Bishop of Gaza; and the Holy Great-martyr Photini the Samaritan Woman and Equal to the Apostles.
ltx/en_us_dedes/me.m02.d26:meDA.commemoration.second_name	
ltx/en_us_dedes/me.m02.d26:meDA.commemoration.second_title	
ltx/en_us_dedes/me.m02.d26:meDA.date	February 26
ltx/en_us_dedes/me.m02.d26:meDA.fordate	for February 26
ltx/en_us_dedes/me.m02.d26:meDA.insert1	
ltx/en_us_dedes/me.m02.d26:meDA.insert2	
ltx/en_us_dedes/me.m02.d26:meDA.note	
ltx/en_us_dedes/me.m02.d26:meDA.pdfcoverdate	February 26,
ltx/en_us_dedes/me.m02.d26:meDA.pdfheaderdate	February 26
ltx/en_us_dedes/me.m02.d26:meHO.commemorations	
ltx/en_us_dedes/me.m02.d26:meHO.note1	
ltx/en_us_dedes/me.m02.d26:meHO.note2	
ltx/en_us_dedes/me.m02.d26:meHO.number	
ltx/en_us_dedes/me.m02.d26:meHO.rank	
ltx/en_us_dedes/me.m02.d26:meLE.commemoration1	Our Father among the Saints Porphyrios, Bishop of Gaza.
ltx/en_us_dedes/me.m02.d26:meLE.commemoration2	
ltx/en_us_dedes/me.m02.d26:meLI.Kontakion1.greekmelody	@ltx/en_us_dedes/me.m02.d26:meMA.Kontakion1.greekmelody
ltx/en_us_dedes/me.m02.d26:meLI.Kontakion1.incipit	@ltx/en_us_dedes/me.m02.d26:meMA.Kontakion1.incipit
ltx/en_us_dedes/me.m02.d26:meLI.Kontakion1.melody	@ltx/en_us_dedes/me.m02.d26:meMA.Kontakion1.melody
ltx/en_us_dedes/me.m02.d26:meLI.Kontakion1.mode	@ltx/en_us_dedes/me.m02.d26:meMA.Kontakion1.mode
ltx/en_us_dedes/me.m02.d26:meLI.Kontakion1.text	@ltx/en_us_dedes/me.m02.d26:meMA.Kontakion1.text
ltx/en_us_dedes/me.m02.d26:meLI.Megalynarion.text	
ltx/en_us_dedes/me.m02.d26:meMA.C1.acrostic.notice1	
ltx/en_us_dedes/me.m02.d26:meMA.C1.acrostic.text	
ltx/en_us_dedes/me.m02.d26:meMA.C1.acrostic.title	
ltx/en_us_dedes/me.m02.d26:meMA.C1.title	@ltx/en_us_dedes/titles:ti.CanonSaintM
ltx/en_us_dedes/me.m02.d26:meMA.C1.verse	@ltx/en_us_dedes/prayers:pr.verse_SaintM.text
ltx/en_us_dedes/me.m02.d26:meMA.ExapTheotokion.incipit	After God we hope in…
ltx/en_us_dedes/me.m02.d26:meMA.ExapTheotokion.melody	@ltx/en_us_dedes/he.a.m3:heAU.EpeskepsatoImas.name
ltx/en_us_dedes/me.m02.d26:meMA.ExapTheotokion.mode	@ltx/en_us_dedes/miscellanea:misc.Mode3
ltx/en_us_dedes/me.m02.d26:meMA.ExapTheotokion.text	After God we hope in you, * O Lady all-immaculate. * And we are crucified with Christ, * who was truly born of you. * Now intercede with Him for us, * and to the end preserve us, * that we remain without offense.
ltx/en_us_dedes/me.m02.d26:meMA.Exaposteilarion1.greekmelody	@ltx/en_us_dedes/he.a.m3:heAU.EpeskepsatoImas.greekname
ltx/en_us_dedes/me.m02.d26:meMA.Exaposteilarion1.incipit	You left your homeland and…
ltx/en_us_dedes/me.m02.d26:meMA.Exaposteilarion1.melody	@ltx/en_us_dedes/he.a.m3:heAU.EpeskepsatoImas.name
ltx/en_us_dedes/me.m02.d26:meMA.Exaposteilarion1.mode	@ltx/en_us_dedes/miscellanea:misc.Mode3
ltx/en_us_dedes/me.m02.d26:meMA.Exaposteilarion1.text	You left your homeland and dispersed * your wealth and many possessions. * Like an Apostle you performed * miracles, by which you gathered * those scattered in idolatry. * Now pray for our salvation, * O father Porphyrius.
ltx/en_us_dedes/me.m02.d26:meMA.Kontakion1.greekmelody	@ltx/en_us_dedes/he.a.m2:heAU.ToisTonAimatonSou.greekname
ltx/en_us_dedes/me.m02.d26:meMA.Kontakion1.incipit	…
ltx/en_us_dedes/me.m02.d26:meMA.Kontakion1.melody	@ltx/en_us_dedes/he.a.m2:heAU.ToisTonAimatonSou.name
ltx/en_us_dedes/me.m02.d26:meMA.Kontakion1.mode	@ltx/en_us_dedes/miscellanea:misc.Mode2
ltx/en_us_dedes/me.m02.d26:meMA.Kontakion1.text	
ltx/en_us_dedes/me.m02.d26:meMA.Ode1C11.greekmelody	@ltx/en_us_dedes/he.h.m8:heHE.AsomenToKyrio.greekname
ltx/en_us_dedes/me.m02.d26:meMA.Ode1C11.incipit	…
ltx/en_us_dedes/me.m02.d26:meMA.Ode1C11.melody	@ltx/en_us_dedes/he.h.m8:heHE.AsomenToKyrio.name
ltx/en_us_dedes/me.m02.d26:meMA.Ode1C11.mode	@ltx/en_us_dedes/miscellanea:misc.Mode8
ltx/en_us_dedes/me.m02.d26:meMA.Ode1C11.ode	@ltx/en_us_dedes/miscellanea:misc.Ode1
ltx/en_us_dedes/me.m02.d26:meMA.Ode1C11.text	
ltx/en_us_dedes/me.m02.d26:meMA.Ode1C12.incipit	…
ltx/en_us_dedes/me.m02.d26:meMA.Ode1C12.melody	@ltx/en_us_dedes/he.h.m8:heHE.AsomenToKyrio.name
ltx/en_us_dedes/me.m02.d26:meMA.Ode1C12.mode	@ltx/en_us_dedes/miscellanea:misc.Mode8
ltx/en_us_dedes/me.m02.d26:meMA.Ode1C12.ode	@ltx/en_us_dedes/miscellanea:misc.Ode1
ltx/en_us_dedes/me.m02.d26:meMA.Ode1C12.text	
ltx/en_us_dedes/me.m02.d26:meMA.Ode1C13.incipit	…
ltx/en_us_dedes/me.m02.d26:meMA.Ode1C13.melody	@ltx/en_us_dedes/he.h.m8:heHE.AsomenToKyrio.name
ltx/en_us_dedes/me.m02.d26:meMA.Ode1C13.mode	@ltx/en_us_dedes/miscellanea:misc.Mode8
ltx/en_us_dedes/me.m02.d26:meMA.Ode1C13.ode	@ltx/en_us_dedes/miscellanea:misc.Ode1
ltx/en_us_dedes/me.m02.d26:meMA.Ode1C13.text	
ltx/en_us_dedes/me.m02.d26:meMA.Ode1C1H.greekmelody	@ltx/en_us_dedes/he.h.m8:heHE.AsomenToKyrio.greekname
ltx/en_us_dedes/me.m02.d26:meMA.Ode1C1H.incipit	@ltx/en_us_dedes/he.h.m8:heHE.AsomenToKyrio.incipit
ltx/en_us_dedes/me.m02.d26:meMA.Ode1C1H.melody	@ltx/en_us_dedes/he.h.m8:heHE.AsomenToKyrio.melody
ltx/en_us_dedes/me.m02.d26:meMA.Ode1C1H.mode	@ltx/en_us_dedes/miscellanea:misc.Mode8
ltx/en_us_dedes/me.m02.d26:meMA.Ode1C1H.ode	@ltx/en_us_dedes/miscellanea:misc.Ode1
ltx/en_us_dedes/me.m02.d26:meMA.Ode1C1H.text	@ltx/en_us_dedes/he.h.m8:heHE.AsomenToKyrio.text
ltx/en_us_dedes/me.m02.d26:meMA.Ode1C1T.incipit	…
ltx/en_us_dedes/me.m02.d26:meMA.Ode1C1T.melody	@ltx/en_us_dedes/he.h.m8:heHE.AsomenToKyrio.name
ltx/en_us_dedes/me.m02.d26:meMA.Ode1C1T.mode	@ltx/en_us_dedes/miscellanea:misc.Mode8
ltx/en_us_dedes/me.m02.d26:meMA.Ode1C1T.ode	@ltx/en_us_dedes/miscellanea:misc.Ode1
ltx/en_us_dedes/me.m02.d26:meMA.Ode1C1T.text	
ltx/en_us_dedes/me.m02.d26:meMA.Ode3C11.greekmelody	@ltx/en_us_dedes/he.h.m8:heHE.SyEiToStereoma.greekname
ltx/en_us_dedes/me.m02.d26:meMA.Ode3C11.incipit	…
ltx/en_us_dedes/me.m02.d26:meMA.Ode3C11.melody	@ltx/en_us_dedes/he.h.m8:heHE.SyEiToStereoma.name
ltx/en_us_dedes/me.m02.d26:meMA.Ode3C11.mode	@ltx/en_us_dedes/miscellanea:misc.Mode8
ltx/en_us_dedes/me.m02.d26:meMA.Ode3C11.ode	@ltx/en_us_dedes/miscellanea:misc.Ode3
ltx/en_us_dedes/me.m02.d26:meMA.Ode3C11.text	
ltx/en_us_dedes/me.m02.d26:meMA.Ode3C12.incipit	…
ltx/en_us_dedes/me.m02.d26:meMA.Ode3C12.melody	@ltx/en_us_dedes/he.h.m8:heHE.SyEiToStereoma.name
ltx/en_us_dedes/me.m02.d26:meMA.Ode3C12.mode	@ltx/en_us_dedes/miscellanea:misc.Mode8
ltx/en_us_dedes/me.m02.d26:meMA.Ode3C12.ode	@ltx/en_us_dedes/miscellanea:misc.Ode3
ltx/en_us_dedes/me.m02.d26:meMA.Ode3C12.text	
ltx/en_us_dedes/me.m02.d26:meMA.Ode3C13.incipit	…
ltx/en_us_dedes/me.m02.d26:meMA.Ode3C13.melody	@ltx/en_us_dedes/he.h.m8:heHE.SyEiToStereoma.name
ltx/en_us_dedes/me.m02.d26:meMA.Ode3C13.mode	@ltx/en_us_dedes/miscellanea:misc.Mode8
ltx/en_us_dedes/me.m02.d26:meMA.Ode3C13.ode	@ltx/en_us_dedes/miscellanea:misc.Ode3
ltx/en_us_dedes/me.m02.d26:meMA.Ode3C13.text	
ltx/en_us_dedes/me.m02.d26:meMA.Ode3C1H.greekmelody	@ltx/en_us_dedes/he.h.m8:heHE.SyEiToStereoma.greekname
ltx/en_us_dedes/me.m02.d26:meMA.Ode3C1H.incipit	@ltx/en_us_dedes/he.h.m8:heHE.SyEiToStereoma.incipit
ltx/en_us_dedes/me.m02.d26:meMA.Ode3C1H.melody	@ltx/en_us_dedes/he.h.m8:heHE.SyEiToStereoma.melody
ltx/en_us_dedes/me.m02.d26:meMA.Ode3C1H.mode	@ltx/en_us_dedes/miscellanea:misc.Mode8
ltx/en_us_dedes/me.m02.d26:meMA.Ode3C1H.ode	@ltx/en_us_dedes/miscellanea:misc.Ode3
ltx/en_us_dedes/me.m02.d26:meMA.Ode3C1H.text	@ltx/en_us_dedes/he.h.m8:heHE.SyEiToStereoma.text
ltx/en_us_dedes/me.m02.d26:meMA.Ode3C1T.incipit	…
ltx/en_us_dedes/me.m02.d26:meMA.Ode3C1T.melody	@ltx/en_us_dedes/he.h.m8:heHE.SyEiToStereoma.name
ltx/en_us_dedes/me.m02.d26:meMA.Ode3C1T.mode	@ltx/en_us_dedes/miscellanea:misc.Mode8
ltx/en_us_dedes/me.m02.d26:meMA.Ode3C1T.ode	@ltx/en_us_dedes/miscellanea:misc.Ode3
ltx/en_us_dedes/me.m02.d26:meMA.Ode3C1T.text	
ltx/en_us_dedes/me.m02.d26:meMA.Ode3Kathisma1.greekmelody	@ltx/en_us_dedes/he.a.m4:heAU.TachyProkatalave.greekname
ltx/en_us_dedes/me.m02.d26:meMA.Ode3Kathisma1.incipit	…
ltx/en_us_dedes/me.m02.d26:meMA.Ode3Kathisma1.melody	@ltx/en_us_dedes/he.a.m4:heAU.TachyProkatalave.name
ltx/en_us_dedes/me.m02.d26:meMA.Ode3Kathisma1.mode	@ltx/en_us_dedes/miscellanea:misc.Mode4
ltx/en_us_dedes/me.m02.d26:meMA.Ode3Kathisma1.text	
ltx/en_us_dedes/me.m02.d26:meMA.Ode3KathismaSt.incipit	…
ltx/en_us_dedes/me.m02.d26:meMA.Ode3KathismaSt.melody	@ltx/en_us_dedes/he.a.m4:heAU.TachyProkatalave.name
ltx/en_us_dedes/me.m02.d26:meMA.Ode3KathismaSt.mode	@ltx/en_us_dedes/miscellanea:misc.Mode4
ltx/en_us_dedes/me.m02.d26:meMA.Ode3KathismaSt.text	
ltx/en_us_dedes/me.m02.d26:meMA.Ode3KathismaT.incipit	…
ltx/en_us_dedes/me.m02.d26:meMA.Ode3KathismaT.melody	@ltx/en_us_dedes/he.a.m4:heAU.TachyProkatalave.name
ltx/en_us_dedes/me.m02.d26:meMA.Ode3KathismaT.mode	@ltx/en_us_dedes/miscellanea:misc.Mode4
ltx/en_us_dedes/me.m02.d26:meMA.Ode3KathismaT.text	
ltx/en_us_dedes/me.m02.d26:meMA.Ode4C11.greekmelody	@ltx/en_us_dedes/he.h.m8:heHE.EisakikoaKyrie.greekname
ltx/en_us_dedes/me.m02.d26:meMA.Ode4C11.incipit	…
ltx/en_us_dedes/me.m02.d26:meMA.Ode4C11.melody	@ltx/en_us_dedes/he.h.m8:heHE.EisakikoaKyrie.name
ltx/en_us_dedes/me.m02.d26:meMA.Ode4C11.mode	@ltx/en_us_dedes/miscellanea:misc.Mode8
ltx/en_us_dedes/me.m02.d26:meMA.Ode4C11.ode	@ltx/en_us_dedes/miscellanea:misc.Ode4
ltx/en_us_dedes/me.m02.d26:meMA.Ode4C11.text	
ltx/en_us_dedes/me.m02.d26:meMA.Ode4C12.incipit	…
ltx/en_us_dedes/me.m02.d26:meMA.Ode4C12.melody	@ltx/en_us_dedes/he.h.m8:heHE.EisakikoaKyrie.name
ltx/en_us_dedes/me.m02.d26:meMA.Ode4C12.mode	@ltx/en_us_dedes/miscellanea:misc.Mode8
ltx/en_us_dedes/me.m02.d26:meMA.Ode4C12.ode	@ltx/en_us_dedes/miscellanea:misc.Ode4
ltx/en_us_dedes/me.m02.d26:meMA.Ode4C12.text	
ltx/en_us_dedes/me.m02.d26:meMA.Ode4C13.incipit	…
ltx/en_us_dedes/me.m02.d26:meMA.Ode4C13.melody	@ltx/en_us_dedes/he.h.m8:heHE.EisakikoaKyrie.name
ltx/en_us_dedes/me.m02.d26:meMA.Ode4C13.mode	@ltx/en_us_dedes/miscellanea:misc.Mode8
ltx/en_us_dedes/me.m02.d26:meMA.Ode4C13.ode	@ltx/en_us_dedes/miscellanea:misc.Ode4
ltx/en_us_dedes/me.m02.d26:meMA.Ode4C13.text	
ltx/en_us_dedes/me.m02.d26:meMA.Ode4C1H.greekmelody	@ltx/en_us_dedes/he.h.m8:heHE.EisakikoaKyrie.greekname
ltx/en_us_dedes/me.m02.d26:meMA.Ode4C1H.incipit	@ltx/en_us_dedes/he.h.m8:heHE.EisakikoaKyrie.incipit
ltx/en_us_dedes/me.m02.d26:meMA.Ode4C1H.melody	@ltx/en_us_dedes/he.h.m8:heHE.EisakikoaKyrie.melody
ltx/en_us_dedes/me.m02.d26:meMA.Ode4C1H.mode	@ltx/en_us_dedes/miscellanea:misc.Mode8
ltx/en_us_dedes/me.m02.d26:meMA.Ode4C1H.ode	@ltx/en_us_dedes/miscellanea:misc.Ode4
ltx/en_us_dedes/me.m02.d26:meMA.Ode4C1H.text	@ltx/en_us_dedes/he.h.m8:heHE.EisakikoaKyrie.text
ltx/en_us_dedes/me.m02.d26:meMA.Ode4C1T.incipit	…
ltx/en_us_dedes/me.m02.d26:meMA.Ode4C1T.melody	@ltx/en_us_dedes/he.h.m8:heHE.EisakikoaKyrie.name
ltx/en_us_dedes/me.m02.d26:meMA.Ode4C1T.mode	@ltx/en_us_dedes/miscellanea:misc.Mode8
ltx/en_us_dedes/me.m02.d26:meMA.Ode4C1T.ode	@ltx/en_us_dedes/miscellanea:misc.Ode4
ltx/en_us_dedes/me.m02.d26:meMA.Ode4C1T.text	
ltx/en_us_dedes/me.m02.d26:meMA.Ode5C11.greekmelody	@ltx/en_us_dedes/he.h.m8:heHE.FotisonImas.greekname
ltx/en_us_dedes/me.m02.d26:meMA.Ode5C11.incipit	…
ltx/en_us_dedes/me.m02.d26:meMA.Ode5C11.melody	@ltx/en_us_dedes/he.h.m8:heHE.FotisonImas.name
ltx/en_us_dedes/me.m02.d26:meMA.Ode5C11.mode	@ltx/en_us_dedes/miscellanea:misc.Mode8
ltx/en_us_dedes/me.m02.d26:meMA.Ode5C11.ode	@ltx/en_us_dedes/miscellanea:misc.Ode5
ltx/en_us_dedes/me.m02.d26:meMA.Ode5C11.text	
ltx/en_us_dedes/me.m02.d26:meMA.Ode5C12.incipit	…
ltx/en_us_dedes/me.m02.d26:meMA.Ode5C12.melody	@ltx/en_us_dedes/he.h.m8:heHE.FotisonImas.name
ltx/en_us_dedes/me.m02.d26:meMA.Ode5C12.mode	@ltx/en_us_dedes/miscellanea:misc.Mode8
ltx/en_us_dedes/me.m02.d26:meMA.Ode5C12.ode	@ltx/en_us_dedes/miscellanea:misc.Ode5
ltx/en_us_dedes/me.m02.d26:meMA.Ode5C12.text	
ltx/en_us_dedes/me.m02.d26:meMA.Ode5C13.incipit	…
ltx/en_us_dedes/me.m02.d26:meMA.Ode5C13.melody	@ltx/en_us_dedes/he.h.m8:heHE.FotisonImas.name
ltx/en_us_dedes/me.m02.d26:meMA.Ode5C13.mode	@ltx/en_us_dedes/miscellanea:misc.Mode8
ltx/en_us_dedes/me.m02.d26:meMA.Ode5C13.ode	@ltx/en_us_dedes/miscellanea:misc.Ode5
ltx/en_us_dedes/me.m02.d26:meMA.Ode5C13.text	
ltx/en_us_dedes/me.m02.d26:meMA.Ode5C1H.greekmelody	@ltx/en_us_dedes/he.h.m8:heHE.FotisonImas.greekname
ltx/en_us_dedes/me.m02.d26:meMA.Ode5C1H.incipit	@ltx/en_us_dedes/he.h.m8:heHE.FotisonImas.incipit
ltx/en_us_dedes/me.m02.d26:meMA.Ode5C1H.melody	@ltx/en_us_dedes/he.h.m8:heHE.FotisonImas.melody
ltx/en_us_dedes/me.m02.d26:meMA.Ode5C1H.mode	@ltx/en_us_dedes/miscellanea:misc.Mode8
ltx/en_us_dedes/me.m02.d26:meMA.Ode5C1H.ode	@ltx/en_us_dedes/miscellanea:misc.Ode5
ltx/en_us_dedes/me.m02.d26:meMA.Ode5C1H.text	@ltx/en_us_dedes/he.h.m8:heHE.FotisonImas.text
ltx/en_us_dedes/me.m02.d26:meMA.Ode5C1T.incipit	…
ltx/en_us_dedes/me.m02.d26:meMA.Ode5C1T.melody	@ltx/en_us_dedes/he.h.m8:heHE.FotisonImas.name
ltx/en_us_dedes/me.m02.d26:meMA.Ode5C1T.mode	@ltx/en_us_dedes/miscellanea:misc.Mode8
ltx/en_us_dedes/me.m02.d26:meMA.Ode5C1T.ode	@ltx/en_us_dedes/miscellanea:misc.Ode5
ltx/en_us_dedes/me.m02.d26:meMA.Ode5C1T.text	
ltx/en_us_dedes/me.m02.d26:meMA.Ode6C11.greekmelody	@ltx/en_us_dedes/he.h.m8:heHE.TinDeisinEkcheo.greekname
ltx/en_us_dedes/me.m02.d26:meMA.Ode6C11.incipit	…
ltx/en_us_dedes/me.m02.d26:meMA.Ode6C11.melody	@ltx/en_us_dedes/he.h.m8:heHE.TinDeisinEkcheo.name
ltx/en_us_dedes/me.m02.d26:meMA.Ode6C11.mode	@ltx/en_us_dedes/miscellanea:misc.Mode8
ltx/en_us_dedes/me.m02.d26:meMA.Ode6C11.ode	@ltx/en_us_dedes/miscellanea:misc.Ode6
ltx/en_us_dedes/me.m02.d26:meMA.Ode6C11.text	
ltx/en_us_dedes/me.m02.d26:meMA.Ode6C12.incipit	…
ltx/en_us_dedes/me.m02.d26:meMA.Ode6C12.melody	@ltx/en_us_dedes/he.h.m8:heHE.TinDeisinEkcheo.name
ltx/en_us_dedes/me.m02.d26:meMA.Ode6C12.mode	@ltx/en_us_dedes/miscellanea:misc.Mode8
ltx/en_us_dedes/me.m02.d26:meMA.Ode6C12.ode	@ltx/en_us_dedes/miscellanea:misc.Ode6
ltx/en_us_dedes/me.m02.d26:meMA.Ode6C12.text	
ltx/en_us_dedes/me.m02.d26:meMA.Ode6C13.incipit	…
ltx/en_us_dedes/me.m02.d26:meMA.Ode6C13.melody	@ltx/en_us_dedes/he.h.m8:heHE.TinDeisinEkcheo.name
ltx/en_us_dedes/me.m02.d26:meMA.Ode6C13.mode	@ltx/en_us_dedes/miscellanea:misc.Mode8
ltx/en_us_dedes/me.m02.d26:meMA.Ode6C13.ode	@ltx/en_us_dedes/miscellanea:misc.Ode6
ltx/en_us_dedes/me.m02.d26:meMA.Ode6C13.text	
ltx/en_us_dedes/me.m02.d26:meMA.Ode6C1H.greekmelody	@ltx/en_us_dedes/he.h.m8:heHE.TinDeisinEkcheo.greekname
ltx/en_us_dedes/me.m02.d26:meMA.Ode6C1H.incipit	@ltx/en_us_dedes/he.h.m8:heHE.TinDeisinEkcheo.incipit
ltx/en_us_dedes/me.m02.d26:meMA.Ode6C1H.melody	@ltx/en_us_dedes/he.h.m8:heHE.TinDeisinEkcheo.melody
ltx/en_us_dedes/me.m02.d26:meMA.Ode6C1H.mode	@ltx/en_us_dedes/miscellanea:misc.Mode8
ltx/en_us_dedes/me.m02.d26:meMA.Ode6C1H.ode	@ltx/en_us_dedes/miscellanea:misc.Ode6
ltx/en_us_dedes/me.m02.d26:meMA.Ode6C1H.text	@ltx/en_us_dedes/he.h.m8:heHE.TinDeisinEkcheo.text
ltx/en_us_dedes/me.m02.d26:meMA.Ode6C1T.incipit	…
ltx/en_us_dedes/me.m02.d26:meMA.Ode6C1T.melody	@ltx/en_us_dedes/he.h.m8:heHE.TinDeisinEkcheo.name
ltx/en_us_dedes/me.m02.d26:meMA.Ode6C1T.mode	@ltx/en_us_dedes/miscellanea:misc.Mode8
ltx/en_us_dedes/me.m02.d26:meMA.Ode6C1T.ode	@ltx/en_us_dedes/miscellanea:misc.Ode6
ltx/en_us_dedes/me.m02.d26:meMA.Ode6C1T.text	
ltx/en_us_dedes/me.m02.d26:meMA.Ode7C11.greekmelody	@ltx/en_us_dedes/he.h.m8:heHE.PaidesEvraion.greekname
ltx/en_us_dedes/me.m02.d26:meMA.Ode7C11.incipit	…
ltx/en_us_dedes/me.m02.d26:meMA.Ode7C11.melody	@ltx/en_us_dedes/he.h.m8:heHE.PaidesEvraion.name
ltx/en_us_dedes/me.m02.d26:meMA.Ode7C11.mode	@ltx/en_us_dedes/miscellanea:misc.Mode8
ltx/en_us_dedes/me.m02.d26:meMA.Ode7C11.ode	@ltx/en_us_dedes/miscellanea:misc.Ode7
ltx/en_us_dedes/me.m02.d26:meMA.Ode7C11.text	
ltx/en_us_dedes/me.m02.d26:meMA.Ode7C12.incipit	…
ltx/en_us_dedes/me.m02.d26:meMA.Ode7C12.melody	@ltx/en_us_dedes/he.h.m8:heHE.PaidesEvraion.name
ltx/en_us_dedes/me.m02.d26:meMA.Ode7C12.mode	@ltx/en_us_dedes/miscellanea:misc.Mode8
ltx/en_us_dedes/me.m02.d26:meMA.Ode7C12.ode	@ltx/en_us_dedes/miscellanea:misc.Ode7
ltx/en_us_dedes/me.m02.d26:meMA.Ode7C12.text	
ltx/en_us_dedes/me.m02.d26:meMA.Ode7C13.incipit	…
ltx/en_us_dedes/me.m02.d26:meMA.Ode7C13.melody	@ltx/en_us_dedes/he.h.m8:heHE.PaidesEvraion.name
ltx/en_us_dedes/me.m02.d26:meMA.Ode7C13.mode	@ltx/en_us_dedes/miscellanea:misc.Mode8
ltx/en_us_dedes/me.m02.d26:meMA.Ode7C13.ode	@ltx/en_us_dedes/miscellanea:misc.Ode7
ltx/en_us_dedes/me.m02.d26:meMA.Ode7C13.text	
ltx/en_us_dedes/me.m02.d26:meMA.Ode7C1H.greekmelody	@ltx/en_us_dedes/he.h.m8:heHE.PaidesEvraion.greekname
ltx/en_us_dedes/me.m02.d26:meMA.Ode7C1H.incipit	@ltx/en_us_dedes/he.h.m8:heHE.PaidesEvraion.incipit
ltx/en_us_dedes/me.m02.d26:meMA.Ode7C1H.melody	@ltx/en_us_dedes/he.h.m8:heHE.PaidesEvraion.melody
ltx/en_us_dedes/me.m02.d26:meMA.Ode7C1H.mode	@ltx/en_us_dedes/miscellanea:misc.Mode8
ltx/en_us_dedes/me.m02.d26:meMA.Ode7C1H.ode	@ltx/en_us_dedes/miscellanea:misc.Ode7
ltx/en_us_dedes/me.m02.d26:meMA.Ode7C1H.text	@ltx/en_us_dedes/he.h.m8:heHE.PaidesEvraion.text
ltx/en_us_dedes/me.m02.d26:meMA.Ode7C1T.incipit	…
ltx/en_us_dedes/me.m02.d26:meMA.Ode7C1T.melody	@ltx/en_us_dedes/he.h.m8:heHE.PaidesEvraion.name
ltx/en_us_dedes/me.m02.d26:meMA.Ode7C1T.mode	@ltx/en_us_dedes/miscellanea:misc.Mode8
ltx/en_us_dedes/me.m02.d26:meMA.Ode7C1T.ode	@ltx/en_us_dedes/miscellanea:misc.Ode7
ltx/en_us_dedes/me.m02.d26:meMA.Ode7C1T.text	
ltx/en_us_dedes/me.m02.d26:meMA.Ode8C11.greekmelody	@ltx/en_us_dedes/he.h.m8:heHE.OiTheorrimonesPaides.greekname
ltx/en_us_dedes/me.m02.d26:meMA.Ode8C11.incipit	…
ltx/en_us_dedes/me.m02.d26:meMA.Ode8C11.melody	@ltx/en_us_dedes/he.h.m8:heHE.OiTheorrimonesPaides.name
ltx/en_us_dedes/me.m02.d26:meMA.Ode8C11.mode	@ltx/en_us_dedes/miscellanea:misc.Mode8
ltx/en_us_dedes/me.m02.d26:meMA.Ode8C11.ode	@ltx/en_us_dedes/miscellanea:misc.Ode8
ltx/en_us_dedes/me.m02.d26:meMA.Ode8C11.text	
ltx/en_us_dedes/me.m02.d26:meMA.Ode8C12.incipit	…
ltx/en_us_dedes/me.m02.d26:meMA.Ode8C12.melody	@ltx/en_us_dedes/he.h.m8:heHE.OiTheorrimonesPaides.name
ltx/en_us_dedes/me.m02.d26:meMA.Ode8C12.mode	@ltx/en_us_dedes/miscellanea:misc.Mode8
ltx/en_us_dedes/me.m02.d26:meMA.Ode8C12.ode	@ltx/en_us_dedes/miscellanea:misc.Ode8
ltx/en_us_dedes/me.m02.d26:meMA.Ode8C12.text	
ltx/en_us_dedes/me.m02.d26:meMA.Ode8C13.incipit	…
ltx/en_us_dedes/me.m02.d26:meMA.Ode8C13.melody	@ltx/en_us_dedes/he.h.m8:heHE.OiTheorrimonesPaides.name
ltx/en_us_dedes/me.m02.d26:meMA.Ode8C13.mode	@ltx/en_us_dedes/miscellanea:misc.Mode8
ltx/en_us_dedes/me.m02.d26:meMA.Ode8C13.ode	@ltx/en_us_dedes/miscellanea:misc.Ode8
ltx/en_us_dedes/me.m02.d26:meMA.Ode8C13.text	
ltx/en_us_dedes/me.m02.d26:meMA.Ode8C14.incipit	…
ltx/en_us_dedes/me.m02.d26:meMA.Ode8C14.melody	@ltx/en_us_dedes/he.h.m8:heHE.OiTheorrimonesPaides.name
ltx/en_us_dedes/me.m02.d26:meMA.Ode8C14.mode	@ltx/en_us_dedes/miscellanea:misc.Mode8
ltx/en_us_dedes/me.m02.d26:meMA.Ode8C14.ode	@ltx/en_us_dedes/miscellanea:misc.Ode8
ltx/en_us_dedes/me.m02.d26:meMA.Ode8C14.text	
ltx/en_us_dedes/me.m02.d26:meMA.Ode8C1H.greekmelody	@ltx/en_us_dedes/he.h.m8:heHE.OiTheorrimonesPaides.greekname
ltx/en_us_dedes/me.m02.d26:meMA.Ode8C1H.incipit	@ltx/en_us_dedes/he.h.m8:heHE.OiTheorrimonesPaides.incipit
ltx/en_us_dedes/me.m02.d26:meMA.Ode8C1H.melody	@ltx/en_us_dedes/he.h.m8:heHE.OiTheorrimonesPaides.melody
ltx/en_us_dedes/me.m02.d26:meMA.Ode8C1H.mode	@ltx/en_us_dedes/miscellanea:misc.Mode8
ltx/en_us_dedes/me.m02.d26:meMA.Ode8C1H.ode	@ltx/en_us_dedes/miscellanea:misc.Ode8
ltx/en_us_dedes/me.m02.d26:meMA.Ode8C1H.text	@ltx/en_us_dedes/he.h.m8:heHE.OiTheorrimonesPaides.text
ltx/en_us_dedes/me.m02.d26:meMA.Ode8C1T.incipit	…
ltx/en_us_dedes/me.m02.d26:meMA.Ode8C1T.melody	@ltx/en_us_dedes/he.h.m8:heHE.OiTheorrimonesPaides.name
ltx/en_us_dedes/me.m02.d26:meMA.Ode8C1T.mode	@ltx/en_us_dedes/miscellanea:misc.Mode8
ltx/en_us_dedes/me.m02.d26:meMA.Ode8C1T.ode	@ltx/en_us_dedes/miscellanea:misc.Ode8
ltx/en_us_dedes/me.m02.d26:meMA.Ode8C1T.text	
ltx/en_us_dedes/me.m02.d26:meMA.Ode9C11.greekmelody	@ltx/en_us_dedes/he.h.m8:heHE.EfrixePasaAkoi.greekname
ltx/en_us_dedes/me.m02.d26:meMA.Ode9C11.incipit	…
ltx/en_us_dedes/me.m02.d26:meMA.Ode9C11.melody	@ltx/en_us_dedes/he.h.m8:heHE.EfrixePasaAkoi.name
ltx/en_us_dedes/me.m02.d26:meMA.Ode9C11.mode	@ltx/en_us_dedes/miscellanea:misc.Mode8
ltx/en_us_dedes/me.m02.d26:meMA.Ode9C11.ode	@ltx/en_us_dedes/miscellanea:misc.Ode9
ltx/en_us_dedes/me.m02.d26:meMA.Ode9C11.text	
ltx/en_us_dedes/me.m02.d26:meMA.Ode9C12.incipit	…
ltx/en_us_dedes/me.m02.d26:meMA.Ode9C12.melody	@ltx/en_us_dedes/he.h.m8:heHE.EfrixePasaAkoi.name
ltx/en_us_dedes/me.m02.d26:meMA.Ode9C12.mode	@ltx/en_us_dedes/miscellanea:misc.Mode8
ltx/en_us_dedes/me.m02.d26:meMA.Ode9C12.ode	@ltx/en_us_dedes/miscellanea:misc.Ode9
ltx/en_us_dedes/me.m02.d26:meMA.Ode9C12.text	
ltx/en_us_dedes/me.m02.d26:meMA.Ode9C13.incipit	…
ltx/en_us_dedes/me.m02.d26:meMA.Ode9C13.melody	@ltx/en_us_dedes/he.h.m8:heHE.EfrixePasaAkoi.name
ltx/en_us_dedes/me.m02.d26:meMA.Ode9C13.mode	@ltx/en_us_dedes/miscellanea:misc.Mode8
ltx/en_us_dedes/me.m02.d26:meMA.Ode9C13.ode	@ltx/en_us_dedes/miscellanea:misc.Ode9
ltx/en_us_dedes/me.m02.d26:meMA.Ode9C13.text	
ltx/en_us_dedes/me.m02.d26:meMA.Ode9C14.incipit	…
ltx/en_us_dedes/me.m02.d26:meMA.Ode9C14.melody	@ltx/en_us_dedes/he.h.m8:heHE.EfrixePasaAkoi.name
ltx/en_us_dedes/me.m02.d26:meMA.Ode9C14.mode	@ltx/en_us_dedes/miscellanea:misc.Mode8
ltx/en_us_dedes/me.m02.d26:meMA.Ode9C14.ode	@ltx/en_us_dedes/miscellanea:misc.Ode9
ltx/en_us_dedes/me.m02.d26:meMA.Ode9C14.text	
ltx/en_us_dedes/me.m02.d26:meMA.Ode9C1H.greekmelody	@ltx/en_us_dedes/he.h.m8:heHE.EfrixePasaAkoi.greekname
ltx/en_us_dedes/me.m02.d26:meMA.Ode9C1H.incipit	@ltx/en_us_dedes/he.h.m8:heHE.EfrixePasaAkoi.incipit
ltx/en_us_dedes/me.m02.d26:meMA.Ode9C1H.melody	@ltx/en_us_dedes/he.h.m8:heHE.EfrixePasaAkoi.melody
ltx/en_us_dedes/me.m02.d26:meMA.Ode9C1H.mode	@ltx/en_us_dedes/miscellanea:misc.Mode8
ltx/en_us_dedes/me.m02.d26:meMA.Ode9C1H.ode	@ltx/en_us_dedes/miscellanea:misc.Ode9
ltx/en_us_dedes/me.m02.d26:meMA.Ode9C1H.text	@ltx/en_us_dedes/he.h.m8:heHE.EfrixePasaAkoi.text
ltx/en_us_dedes/me.m02.d26:meMA.Ode9C1T.incipit	…
ltx/en_us_dedes/me.m02.d26:meMA.Ode9C1T.melody	@ltx/en_us_dedes/he.h.m8:heHE.EfrixePasaAkoi.name
ltx/en_us_dedes/me.m02.d26:meMA.Ode9C1T.mode	@ltx/en_us_dedes/miscellanea:misc.Mode8
ltx/en_us_dedes/me.m02.d26:meMA.Ode9C1T.ode	@ltx/en_us_dedes/miscellanea:misc.Ode9
ltx/en_us_dedes/me.m02.d26:meMA.Ode9C1T.text	
ltx/en_us_dedes/me.m02.d26:meMA.Oikos1.text	With lightning bolts of miracles, the memory of wise Porphyrius shines brighter than the sun. It brings light to all creation and drives out the deceptive error of idolatry. It illumines the faithful and brings joy to all people. For the Saint was pleasing to God on the earth, and so he received the grace to work wonders and to heal everyone. He stands near the Trinity, full of light, ever praying on behalf of us all.
ltx/en_us_dedes/me.m02.d26:meVE.Apolytikion1ger.greekmelody	@ltx/en_us_dedes/he.a.m4:heAU.OYpsotheisEnToStavro.greekname
ltx/en_us_dedes/me.m02.d26:meVE.Apolytikion1ger.incipit	…
ltx/en_us_dedes/me.m02.d26:meVE.Apolytikion1ger.melody	@ltx/en_us_dedes/he.a.m4:heAU.OYpsotheisEnToStavro.name
ltx/en_us_dedes/me.m02.d26:meVE.Apolytikion1ger.mode	@ltx/en_us_dedes/miscellanea:misc.Mode4
ltx/en_us_dedes/me.m02.d26:meVE.Apolytikion1ger.poet	@ltx/en_us_dedes/poets:po.Gerasimou
ltx/en_us_dedes/me.m02.d26:meVE.Apolytikion1ger.text	
ltx/en_us_dedes/me.m02.d26:meVE.SticStavrotheotokion.greekmelody	@ltx/en_us_dedes/he.a.m1:heAU.TonOuranionTagmaton.greekname
ltx/en_us_dedes/me.m02.d26:meVE.SticStavrotheotokion.incipit	Behold, I now feel the…
ltx/en_us_dedes/me.m02.d26:meVE.SticStavrotheotokion.melody	@ltx/en_us_dedes/he.a.m1:heAU.TonOuranionTagmaton.notmetered
ltx/en_us_dedes/me.m02.d26:meVE.SticStavrotheotokion.mode	@ltx/en_us_dedes/miscellanea:misc.Mode1
ltx/en_us_dedes/me.m02.d26:meVE.SticStavrotheotokion.text	Behold, I now feel the sword piercing my heart, O Child, as they foretold to me of old, when they saw You, who are more beautiful than all the sons born on earth. For voluntarily You have been hung from a Cross with robbers, as if You were a criminal.
ltx/en_us_dedes/me.m02.d26:meVE.SticTheotokion.greekmelody	@ltx/en_us_dedes/he.a.m1:heAU.TonOuranionTagmaton.greekname
ltx/en_us_dedes/me.m02.d26:meVE.SticTheotokion.incipit	In the deep sea of…
ltx/en_us_dedes/me.m02.d26:meVE.SticTheotokion.melody	@ltx/en_us_dedes/he.a.m1:heAU.TonOuranionTagmaton.name
ltx/en_us_dedes/me.m02.d26:meVE.SticTheotokion.mode	@ltx/en_us_dedes/miscellanea:misc.Mode1
ltx/en_us_dedes/me.m02.d26:meVE.SticTheotokion.text	In the deep sea of transgressions * I am now tossed about; * therefore, O Theotokos, * I seek refuge and safety * in the waveless harbor of your most pure * intercession on my behalf. * I pray: Extend your almighty right hand and save * me your servant, O all-blameless one.
ltx/en_us_dedes/me.m02.d26:meVE.Stichera01.greekmelody	@ltx/en_us_dedes/he.a.m1:heAU.TonOuranionTagmaton.greekname
ltx/en_us_dedes/me.m02.d26:meVE.Stichera01.incipit	You washed your soul of…
ltx/en_us_dedes/me.m02.d26:meVE.Stichera01.melody	@ltx/en_us_dedes/he.a.m1:heAU.TonOuranionTagmaton.name
ltx/en_us_dedes/me.m02.d26:meVE.Stichera01.mode	@ltx/en_us_dedes/miscellanea:misc.Mode1
ltx/en_us_dedes/me.m02.d26:meVE.Stichera01.text	You washed your soul of uncleanness, * blessed Porphyrios, * with all those teardrops flowing * like a stream, and extinguished * the flame of sinful passions, and colored your robe * with the color of porphyry. * Now in the heavenly realm you forever live, * and you celebrate eternally.
ltx/en_us_dedes/me.m02.d26:meVE.Stichera02.incipit	Having excelled in divine heights…
ltx/en_us_dedes/me.m02.d26:meVE.Stichera02.melody	@ltx/en_us_dedes/he.a.m1:heAU.TonOuranionTagmaton.name
ltx/en_us_dedes/me.m02.d26:meVE.Stichera02.mode	@ltx/en_us_dedes/miscellanea:misc.Mode1
ltx/en_us_dedes/me.m02.d26:meVE.Stichera02.text	Having excelled in divine heights * of Orthodoxy, O Saint, * you are the pride of bishops; * you were set on the lamp-stand. * As a worthy laborer you have received * from the Lord the reward indeed * for all your labors, and thus you obtained from God * gifts of grace divine, all-blessed one.
ltx/en_us_dedes/me.m02.d26:meVE.Stichera03.incipit	He used to solemnize myst’ries…
ltx/en_us_dedes/me.m02.d26:meVE.Stichera03.melody	@ltx/en_us_dedes/he.a.m1:heAU.TonOuranionTagmaton.name
ltx/en_us_dedes/me.m02.d26:meVE.Stichera03.mode	@ltx/en_us_dedes/miscellanea:misc.Mode1
ltx/en_us_dedes/me.m02.d26:meVE.Stichera03.text	He used to solemnize myst’ries * upon the altar below; * now to the Lord forever * in the heavens sublimely * he offers the oblation, sublime and divine; * and from there St. Porphyrios * is watching over us, praying as a high-priest * to the consubstantial Trinity.
