ltx/en_us_dedes/me.m01.d30:alt1.meDA.commemoration.first_name	
ltx/en_us_dedes/me.m01.d30:alt1.meDA.commemoration.first_short	
ltx/en_us_dedes/me.m01.d30:alt1.meDA.commemoration.first_title	@ltx/en_us_dedes/titles:ti.SaintM
ltx/en_us_dedes/me.m01.d30:alt1.meDA.commemoration.full	
ltx/en_us_dedes/me.m01.d30:alt1.meDA.commemoration.second_name	
ltx/en_us_dedes/me.m01.d30:alt1.meDA.commemoration.second_title	
ltx/en_us_dedes/me.m01.d30:alt1.meDA.date	January 30
ltx/en_us_dedes/me.m01.d30:alt1.meDA.insert1	
ltx/en_us_dedes/me.m01.d30:alt1.meDA.insert2	
ltx/en_us_dedes/me.m01.d30:alt1.meDA.note	
ltx/en_us_dedes/me.m01.d30:alt1.meHO.commemorations	
ltx/en_us_dedes/me.m01.d30:alt1.meHO.note1	
ltx/en_us_dedes/me.m01.d30:alt1.meHO.note2	
ltx/en_us_dedes/me.m01.d30:alt1.meHO.number	
ltx/en_us_dedes/me.m01.d30:alt1.meHO.rank	
ltx/en_us_dedes/me.m01.d30:alt1.meLE.commemoration1	
ltx/en_us_dedes/me.m01.d30:alt1.meLE.commemoration2	
ltx/en_us_dedes/me.m01.d30:alt1.meMA.C1.poet	@ltx/en_us_dedes/poets:po.IoannouMonachou
ltx/en_us_dedes/me.m01.d30:alt1.meMA.C1.title	@ltx/en_us_dedes/titles:ti.CanonSaintM
ltx/en_us_dedes/me.m01.d30:alt1.meMA.C1.verse	@ltx/en_us_dedes/prayers:pr.verse_SaintM.text
ltx/en_us_dedes/me.m01.d30:alt1.meMA.Ode1C11.greekmelody	@ltx/en_us_dedes/he.h.m4:heHE.ArmataFarao.greekname
ltx/en_us_dedes/me.m01.d30:alt1.meMA.Ode1C11.incipit	…
ltx/en_us_dedes/me.m01.d30:alt1.meMA.Ode1C11.melody	@ltx/en_us_dedes/he.h.m4:heHE.ArmataFarao.name
ltx/en_us_dedes/me.m01.d30:alt1.meMA.Ode1C11.mode	@ltx/en_us_dedes/miscellanea:misc.Mode4
ltx/en_us_dedes/me.m01.d30:alt1.meMA.Ode1C11.ode	@ltx/en_us_dedes/miscellanea:misc.Ode1
ltx/en_us_dedes/me.m01.d30:alt1.meMA.Ode1C11.text	
ltx/en_us_dedes/me.m01.d30:alt1.meMA.Ode1C12.incipit	…
ltx/en_us_dedes/me.m01.d30:alt1.meMA.Ode1C12.melody	@ltx/en_us_dedes/he.h.m4:heHE.ArmataFarao.name
ltx/en_us_dedes/me.m01.d30:alt1.meMA.Ode1C12.mode	@ltx/en_us_dedes/miscellanea:misc.Mode4
ltx/en_us_dedes/me.m01.d30:alt1.meMA.Ode1C12.ode	@ltx/en_us_dedes/miscellanea:misc.Ode1
ltx/en_us_dedes/me.m01.d30:alt1.meMA.Ode1C12.text	
ltx/en_us_dedes/me.m01.d30:alt1.meMA.Ode1C13.incipit	…
ltx/en_us_dedes/me.m01.d30:alt1.meMA.Ode1C13.melody	@ltx/en_us_dedes/he.h.m4:heHE.ArmataFarao.name
ltx/en_us_dedes/me.m01.d30:alt1.meMA.Ode1C13.mode	@ltx/en_us_dedes/miscellanea:misc.Mode4
ltx/en_us_dedes/me.m01.d30:alt1.meMA.Ode1C13.ode	@ltx/en_us_dedes/miscellanea:misc.Ode1
ltx/en_us_dedes/me.m01.d30:alt1.meMA.Ode1C13.text	
ltx/en_us_dedes/me.m01.d30:alt1.meMA.Ode1C1T.incipit	…
ltx/en_us_dedes/me.m01.d30:alt1.meMA.Ode1C1T.melody	@ltx/en_us_dedes/he.h.m4:heHE.ArmataFarao.name
ltx/en_us_dedes/me.m01.d30:alt1.meMA.Ode1C1T.mode	@ltx/en_us_dedes/miscellanea:misc.Mode4
ltx/en_us_dedes/me.m01.d30:alt1.meMA.Ode1C1T.ode	@ltx/en_us_dedes/miscellanea:misc.Ode1
ltx/en_us_dedes/me.m01.d30:alt1.meMA.Ode1C1T.text	
ltx/en_us_dedes/me.m01.d30:alt1.meMA.Ode3C11.greekmelody	@ltx/en_us_dedes/he.h.m4:heHE.ToxonDynatonIsthenise.greekname
ltx/en_us_dedes/me.m01.d30:alt1.meMA.Ode3C11.incipit	…
ltx/en_us_dedes/me.m01.d30:alt1.meMA.Ode3C11.melody	@ltx/en_us_dedes/he.h.m4:heHE.ToxonDynatonIsthenise.name
ltx/en_us_dedes/me.m01.d30:alt1.meMA.Ode3C11.mode	@ltx/en_us_dedes/miscellanea:misc.Mode4
ltx/en_us_dedes/me.m01.d30:alt1.meMA.Ode3C11.ode	@ltx/en_us_dedes/miscellanea:misc.Ode3
ltx/en_us_dedes/me.m01.d30:alt1.meMA.Ode3C11.text	
ltx/en_us_dedes/me.m01.d30:alt1.meMA.Ode3C12.incipit	…
ltx/en_us_dedes/me.m01.d30:alt1.meMA.Ode3C12.melody	@ltx/en_us_dedes/he.h.m4:heHE.ToxonDynatonIsthenise.name
ltx/en_us_dedes/me.m01.d30:alt1.meMA.Ode3C12.mode	@ltx/en_us_dedes/miscellanea:misc.Mode4
ltx/en_us_dedes/me.m01.d30:alt1.meMA.Ode3C12.ode	@ltx/en_us_dedes/miscellanea:misc.Ode3
ltx/en_us_dedes/me.m01.d30:alt1.meMA.Ode3C12.text	
ltx/en_us_dedes/me.m01.d30:alt1.meMA.Ode3C13.incipit	…
ltx/en_us_dedes/me.m01.d30:alt1.meMA.Ode3C13.melody	@ltx/en_us_dedes/he.h.m4:heHE.ToxonDynatonIsthenise.name
ltx/en_us_dedes/me.m01.d30:alt1.meMA.Ode3C13.mode	@ltx/en_us_dedes/miscellanea:misc.Mode4
ltx/en_us_dedes/me.m01.d30:alt1.meMA.Ode3C13.ode	@ltx/en_us_dedes/miscellanea:misc.Ode3
ltx/en_us_dedes/me.m01.d30:alt1.meMA.Ode3C13.text	
ltx/en_us_dedes/me.m01.d30:alt1.meMA.Ode3C1T.incipit	…
ltx/en_us_dedes/me.m01.d30:alt1.meMA.Ode3C1T.melody	@ltx/en_us_dedes/he.h.m4:heHE.ToxonDynatonIsthenise.name
ltx/en_us_dedes/me.m01.d30:alt1.meMA.Ode3C1T.mode	@ltx/en_us_dedes/miscellanea:misc.Mode4
ltx/en_us_dedes/me.m01.d30:alt1.meMA.Ode3C1T.ode	@ltx/en_us_dedes/miscellanea:misc.Ode3
ltx/en_us_dedes/me.m01.d30:alt1.meMA.Ode3C1T.text	
ltx/en_us_dedes/me.m01.d30:alt1.meMA.Ode3Kathisma1.greekmelody	@ltx/en_us_dedes/he.a.m1:heAU.TonTafonSouSotir.greekname
ltx/en_us_dedes/me.m01.d30:alt1.meMA.Ode3Kathisma1.incipit	…
ltx/en_us_dedes/me.m01.d30:alt1.meMA.Ode3Kathisma1.melody	@ltx/en_us_dedes/he.a.m1:heAU.TonTafonSouSotir.name
ltx/en_us_dedes/me.m01.d30:alt1.meMA.Ode3Kathisma1.mode	@ltx/en_us_dedes/miscellanea:misc.Mode1
ltx/en_us_dedes/me.m01.d30:alt1.meMA.Ode3Kathisma1.text	
ltx/en_us_dedes/me.m01.d30:alt1.meMA.Ode4C11.greekmelody	@ltx/en_us_dedes/he.h.m4:heHE.TisSisEpiGis.greekname
ltx/en_us_dedes/me.m01.d30:alt1.meMA.Ode4C11.incipit	…
ltx/en_us_dedes/me.m01.d30:alt1.meMA.Ode4C11.melody	@ltx/en_us_dedes/he.h.m4:heHE.TisSisEpiGis.name
ltx/en_us_dedes/me.m01.d30:alt1.meMA.Ode4C11.mode	@ltx/en_us_dedes/miscellanea:misc.Mode4
ltx/en_us_dedes/me.m01.d30:alt1.meMA.Ode4C11.ode	@ltx/en_us_dedes/miscellanea:misc.Ode4
ltx/en_us_dedes/me.m01.d30:alt1.meMA.Ode4C11.text	
ltx/en_us_dedes/me.m01.d30:alt1.meMA.Ode4C12.incipit	…
ltx/en_us_dedes/me.m01.d30:alt1.meMA.Ode4C12.melody	@ltx/en_us_dedes/he.h.m4:heHE.TisSisEpiGis.name
ltx/en_us_dedes/me.m01.d30:alt1.meMA.Ode4C12.mode	@ltx/en_us_dedes/miscellanea:misc.Mode4
ltx/en_us_dedes/me.m01.d30:alt1.meMA.Ode4C12.ode	@ltx/en_us_dedes/miscellanea:misc.Ode4
ltx/en_us_dedes/me.m01.d30:alt1.meMA.Ode4C12.text	
ltx/en_us_dedes/me.m01.d30:alt1.meMA.Ode4C13.incipit	…
ltx/en_us_dedes/me.m01.d30:alt1.meMA.Ode4C13.melody	@ltx/en_us_dedes/he.h.m4:heHE.TisSisEpiGis.name
ltx/en_us_dedes/me.m01.d30:alt1.meMA.Ode4C13.mode	@ltx/en_us_dedes/miscellanea:misc.Mode4
ltx/en_us_dedes/me.m01.d30:alt1.meMA.Ode4C13.ode	@ltx/en_us_dedes/miscellanea:misc.Ode4
ltx/en_us_dedes/me.m01.d30:alt1.meMA.Ode4C13.text	
ltx/en_us_dedes/me.m01.d30:alt1.meMA.Ode4C1T.incipit	…
ltx/en_us_dedes/me.m01.d30:alt1.meMA.Ode4C1T.melody	@ltx/en_us_dedes/he.h.m4:heHE.TisSisEpiGis.name
ltx/en_us_dedes/me.m01.d30:alt1.meMA.Ode4C1T.mode	@ltx/en_us_dedes/miscellanea:misc.Mode4
ltx/en_us_dedes/me.m01.d30:alt1.meMA.Ode4C1T.ode	@ltx/en_us_dedes/miscellanea:misc.Ode4
ltx/en_us_dedes/me.m01.d30:alt1.meMA.Ode4C1T.text	
ltx/en_us_dedes/me.m01.d30:alt1.meMA.Ode5C11.greekmelody	@ltx/en_us_dedes/he.h.m4:heHE.SyKyrieMouFos.greekname
ltx/en_us_dedes/me.m01.d30:alt1.meMA.Ode5C11.incipit	…
ltx/en_us_dedes/me.m01.d30:alt1.meMA.Ode5C11.melody	@ltx/en_us_dedes/he.h.m4:heHE.SyKyrieMouFos.name
ltx/en_us_dedes/me.m01.d30:alt1.meMA.Ode5C11.mode	@ltx/en_us_dedes/miscellanea:misc.Mode4
ltx/en_us_dedes/me.m01.d30:alt1.meMA.Ode5C11.ode	@ltx/en_us_dedes/miscellanea:misc.Ode5
ltx/en_us_dedes/me.m01.d30:alt1.meMA.Ode5C11.text	
ltx/en_us_dedes/me.m01.d30:alt1.meMA.Ode5C12.incipit	…
ltx/en_us_dedes/me.m01.d30:alt1.meMA.Ode5C12.melody	@ltx/en_us_dedes/he.h.m4:heHE.SyKyrieMouFos.name
ltx/en_us_dedes/me.m01.d30:alt1.meMA.Ode5C12.mode	@ltx/en_us_dedes/miscellanea:misc.Mode4
ltx/en_us_dedes/me.m01.d30:alt1.meMA.Ode5C12.ode	@ltx/en_us_dedes/miscellanea:misc.Ode5
ltx/en_us_dedes/me.m01.d30:alt1.meMA.Ode5C12.text	
ltx/en_us_dedes/me.m01.d30:alt1.meMA.Ode5C13.incipit	…
ltx/en_us_dedes/me.m01.d30:alt1.meMA.Ode5C13.melody	@ltx/en_us_dedes/he.h.m4:heHE.SyKyrieMouFos.name
ltx/en_us_dedes/me.m01.d30:alt1.meMA.Ode5C13.mode	@ltx/en_us_dedes/miscellanea:misc.Mode4
ltx/en_us_dedes/me.m01.d30:alt1.meMA.Ode5C13.ode	@ltx/en_us_dedes/miscellanea:misc.Ode5
ltx/en_us_dedes/me.m01.d30:alt1.meMA.Ode5C13.text	
ltx/en_us_dedes/me.m01.d30:alt1.meMA.Ode5C1T.incipit	…
ltx/en_us_dedes/me.m01.d30:alt1.meMA.Ode5C1T.melody	@ltx/en_us_dedes/he.h.m4:heHE.SyKyrieMouFos.name
ltx/en_us_dedes/me.m01.d30:alt1.meMA.Ode5C1T.mode	@ltx/en_us_dedes/miscellanea:misc.Mode4
ltx/en_us_dedes/me.m01.d30:alt1.meMA.Ode5C1T.ode	@ltx/en_us_dedes/miscellanea:misc.Ode5
ltx/en_us_dedes/me.m01.d30:alt1.meMA.Ode5C1T.text	
ltx/en_us_dedes/me.m01.d30:alt1.meMA.Ode6C11.greekmelody	@ltx/en_us_dedes/he.h.m4:heHE.ThysoSoiMetaFonis.greekname
ltx/en_us_dedes/me.m01.d30:alt1.meMA.Ode6C11.incipit	…
ltx/en_us_dedes/me.m01.d30:alt1.meMA.Ode6C11.melody	@ltx/en_us_dedes/he.h.m4:heHE.ThysoSoiMetaFonis.name
ltx/en_us_dedes/me.m01.d30:alt1.meMA.Ode6C11.mode	@ltx/en_us_dedes/miscellanea:misc.Mode4
ltx/en_us_dedes/me.m01.d30:alt1.meMA.Ode6C11.ode	@ltx/en_us_dedes/miscellanea:misc.Ode6
ltx/en_us_dedes/me.m01.d30:alt1.meMA.Ode6C11.text	
ltx/en_us_dedes/me.m01.d30:alt1.meMA.Ode6C12.incipit	…
ltx/en_us_dedes/me.m01.d30:alt1.meMA.Ode6C12.melody	@ltx/en_us_dedes/he.h.m4:heHE.ThysoSoiMetaFonis.name
ltx/en_us_dedes/me.m01.d30:alt1.meMA.Ode6C12.mode	@ltx/en_us_dedes/miscellanea:misc.Mode4
ltx/en_us_dedes/me.m01.d30:alt1.meMA.Ode6C12.ode	@ltx/en_us_dedes/miscellanea:misc.Ode6
ltx/en_us_dedes/me.m01.d30:alt1.meMA.Ode6C12.text	
ltx/en_us_dedes/me.m01.d30:alt1.meMA.Ode6C13.incipit	…
ltx/en_us_dedes/me.m01.d30:alt1.meMA.Ode6C13.melody	@ltx/en_us_dedes/he.h.m4:heHE.ThysoSoiMetaFonis.name
ltx/en_us_dedes/me.m01.d30:alt1.meMA.Ode6C13.mode	@ltx/en_us_dedes/miscellanea:misc.Mode4
ltx/en_us_dedes/me.m01.d30:alt1.meMA.Ode6C13.ode	@ltx/en_us_dedes/miscellanea:misc.Ode6
ltx/en_us_dedes/me.m01.d30:alt1.meMA.Ode6C13.text	
ltx/en_us_dedes/me.m01.d30:alt1.meMA.Ode6C1T.incipit	…
ltx/en_us_dedes/me.m01.d30:alt1.meMA.Ode6C1T.melody	@ltx/en_us_dedes/he.h.m4:heHE.ThysoSoiMetaFonis.name
ltx/en_us_dedes/me.m01.d30:alt1.meMA.Ode6C1T.mode	@ltx/en_us_dedes/miscellanea:misc.Mode4
ltx/en_us_dedes/me.m01.d30:alt1.meMA.Ode6C1T.ode	@ltx/en_us_dedes/miscellanea:misc.Ode6
ltx/en_us_dedes/me.m01.d30:alt1.meMA.Ode6C1T.text	
ltx/en_us_dedes/me.m01.d30:alt1.meMA.Ode7C11.greekmelody	@ltx/en_us_dedes/he.h.m4:heHE.ODiasosasEnPyri.greekname
ltx/en_us_dedes/me.m01.d30:alt1.meMA.Ode7C11.incipit	…
ltx/en_us_dedes/me.m01.d30:alt1.meMA.Ode7C11.melody	@ltx/en_us_dedes/he.h.m4:heHE.ODiasosasEnPyri.name
ltx/en_us_dedes/me.m01.d30:alt1.meMA.Ode7C11.mode	@ltx/en_us_dedes/miscellanea:misc.Mode4
ltx/en_us_dedes/me.m01.d30:alt1.meMA.Ode7C11.ode	@ltx/en_us_dedes/miscellanea:misc.Ode7
ltx/en_us_dedes/me.m01.d30:alt1.meMA.Ode7C11.text	
ltx/en_us_dedes/me.m01.d30:alt1.meMA.Ode7C12.incipit	…
ltx/en_us_dedes/me.m01.d30:alt1.meMA.Ode7C12.melody	@ltx/en_us_dedes/he.h.m4:heHE.ODiasosasEnPyri.name
ltx/en_us_dedes/me.m01.d30:alt1.meMA.Ode7C12.mode	@ltx/en_us_dedes/miscellanea:misc.Mode4
ltx/en_us_dedes/me.m01.d30:alt1.meMA.Ode7C12.ode	@ltx/en_us_dedes/miscellanea:misc.Ode7
ltx/en_us_dedes/me.m01.d30:alt1.meMA.Ode7C12.text	
ltx/en_us_dedes/me.m01.d30:alt1.meMA.Ode7C13.incipit	…
ltx/en_us_dedes/me.m01.d30:alt1.meMA.Ode7C13.melody	@ltx/en_us_dedes/he.h.m4:heHE.ODiasosasEnPyri.name
ltx/en_us_dedes/me.m01.d30:alt1.meMA.Ode7C13.mode	@ltx/en_us_dedes/miscellanea:misc.Mode4
ltx/en_us_dedes/me.m01.d30:alt1.meMA.Ode7C13.ode	@ltx/en_us_dedes/miscellanea:misc.Ode7
ltx/en_us_dedes/me.m01.d30:alt1.meMA.Ode7C13.text	
ltx/en_us_dedes/me.m01.d30:alt1.meMA.Ode7C1T.incipit	…
ltx/en_us_dedes/me.m01.d30:alt1.meMA.Ode7C1T.melody	@ltx/en_us_dedes/he.h.m4:heHE.ODiasosasEnPyri.name
ltx/en_us_dedes/me.m01.d30:alt1.meMA.Ode7C1T.mode	@ltx/en_us_dedes/miscellanea:misc.Mode4
ltx/en_us_dedes/me.m01.d30:alt1.meMA.Ode7C1T.ode	@ltx/en_us_dedes/miscellanea:misc.Ode7
ltx/en_us_dedes/me.m01.d30:alt1.meMA.Ode7C1T.text	
ltx/en_us_dedes/me.m01.d30:alt1.meMA.Ode8C11.greekmelody	@ltx/en_us_dedes/he.h.m4:heHE.TonEnMorfiAngelou.greekname
ltx/en_us_dedes/me.m01.d30:alt1.meMA.Ode8C11.incipit	…
ltx/en_us_dedes/me.m01.d30:alt1.meMA.Ode8C11.melody	@ltx/en_us_dedes/he.h.m4:heHE.TonEnMorfiAngelou.name
ltx/en_us_dedes/me.m01.d30:alt1.meMA.Ode8C11.mode	@ltx/en_us_dedes/miscellanea:misc.Mode4
ltx/en_us_dedes/me.m01.d30:alt1.meMA.Ode8C11.ode	@ltx/en_us_dedes/miscellanea:misc.Ode8
ltx/en_us_dedes/me.m01.d30:alt1.meMA.Ode8C11.text	
ltx/en_us_dedes/me.m01.d30:alt1.meMA.Ode8C12.incipit	…
ltx/en_us_dedes/me.m01.d30:alt1.meMA.Ode8C12.melody	@ltx/en_us_dedes/he.h.m4:heHE.TonEnMorfiAngelou.name
ltx/en_us_dedes/me.m01.d30:alt1.meMA.Ode8C12.mode	@ltx/en_us_dedes/miscellanea:misc.Mode4
ltx/en_us_dedes/me.m01.d30:alt1.meMA.Ode8C12.ode	@ltx/en_us_dedes/miscellanea:misc.Ode8
ltx/en_us_dedes/me.m01.d30:alt1.meMA.Ode8C12.text	
ltx/en_us_dedes/me.m01.d30:alt1.meMA.Ode8C13.incipit	…
ltx/en_us_dedes/me.m01.d30:alt1.meMA.Ode8C13.melody	@ltx/en_us_dedes/he.h.m4:heHE.TonEnMorfiAngelou.name
ltx/en_us_dedes/me.m01.d30:alt1.meMA.Ode8C13.mode	@ltx/en_us_dedes/miscellanea:misc.Mode4
ltx/en_us_dedes/me.m01.d30:alt1.meMA.Ode8C13.ode	@ltx/en_us_dedes/miscellanea:misc.Ode8
ltx/en_us_dedes/me.m01.d30:alt1.meMA.Ode8C13.text	
ltx/en_us_dedes/me.m01.d30:alt1.meMA.Ode8C1T.incipit	…
ltx/en_us_dedes/me.m01.d30:alt1.meMA.Ode8C1T.melody	@ltx/en_us_dedes/he.h.m4:heHE.TonEnMorfiAngelou.name
ltx/en_us_dedes/me.m01.d30:alt1.meMA.Ode8C1T.mode	@ltx/en_us_dedes/miscellanea:misc.Mode4
ltx/en_us_dedes/me.m01.d30:alt1.meMA.Ode8C1T.ode	@ltx/en_us_dedes/miscellanea:misc.Ode8
ltx/en_us_dedes/me.m01.d30:alt1.meMA.Ode8C1T.text	
ltx/en_us_dedes/me.m01.d30:alt1.meMA.Ode9C11.greekmelody	@ltx/en_us_dedes/he.h.m4:heHE.OTokosSouAfthoros.greekname
ltx/en_us_dedes/me.m01.d30:alt1.meMA.Ode9C11.incipit	…
ltx/en_us_dedes/me.m01.d30:alt1.meMA.Ode9C11.melody	@ltx/en_us_dedes/he.h.m4:heHE.OTokosSouAfthoros.name
ltx/en_us_dedes/me.m01.d30:alt1.meMA.Ode9C11.mode	@ltx/en_us_dedes/miscellanea:misc.Mode4
ltx/en_us_dedes/me.m01.d30:alt1.meMA.Ode9C11.ode	@ltx/en_us_dedes/miscellanea:misc.Ode9
ltx/en_us_dedes/me.m01.d30:alt1.meMA.Ode9C11.text	
ltx/en_us_dedes/me.m01.d30:alt1.meMA.Ode9C12.incipit	…
ltx/en_us_dedes/me.m01.d30:alt1.meMA.Ode9C12.melody	@ltx/en_us_dedes/he.h.m4:heHE.OTokosSouAfthoros.name
ltx/en_us_dedes/me.m01.d30:alt1.meMA.Ode9C12.mode	@ltx/en_us_dedes/miscellanea:misc.Mode4
ltx/en_us_dedes/me.m01.d30:alt1.meMA.Ode9C12.ode	@ltx/en_us_dedes/miscellanea:misc.Ode9
ltx/en_us_dedes/me.m01.d30:alt1.meMA.Ode9C12.text	
ltx/en_us_dedes/me.m01.d30:alt1.meMA.Ode9C13.incipit	…
ltx/en_us_dedes/me.m01.d30:alt1.meMA.Ode9C13.melody	@ltx/en_us_dedes/he.h.m4:heHE.OTokosSouAfthoros.name
ltx/en_us_dedes/me.m01.d30:alt1.meMA.Ode9C13.mode	@ltx/en_us_dedes/miscellanea:misc.Mode4
ltx/en_us_dedes/me.m01.d30:alt1.meMA.Ode9C13.ode	@ltx/en_us_dedes/miscellanea:misc.Ode9
ltx/en_us_dedes/me.m01.d30:alt1.meMA.Ode9C13.text	
ltx/en_us_dedes/me.m01.d30:alt1.meMA.Ode9C1T.incipit	…
ltx/en_us_dedes/me.m01.d30:alt1.meMA.Ode9C1T.melody	@ltx/en_us_dedes/he.h.m4:heHE.OTokosSouAfthoros.name
ltx/en_us_dedes/me.m01.d30:alt1.meMA.Ode9C1T.mode	@ltx/en_us_dedes/miscellanea:misc.Mode4
ltx/en_us_dedes/me.m01.d30:alt1.meMA.Ode9C1T.ode	@ltx/en_us_dedes/miscellanea:misc.Ode9
ltx/en_us_dedes/me.m01.d30:alt1.meMA.Ode9C1T.text	
ltx/en_us_dedes/me.m01.d30:alt1.meVE.SticTheotokion.incipit	@ltx/en_us_dedes/me.m01.d23:meVE.AposTheotokion.incipit
ltx/en_us_dedes/me.m01.d30:alt1.meVE.SticTheotokion.melody	@ltx/en_us_dedes/he.a.m1:heAU.TonOuranionTagmaton.name
ltx/en_us_dedes/me.m01.d30:alt1.meVE.SticTheotokion.mode	@ltx/en_us_dedes/miscellanea:misc.Mode1
ltx/en_us_dedes/me.m01.d30:alt1.meVE.SticTheotokion.text	@ltx/en_us_dedes/me.m01.d23:meVE.AposTheotokion.text
ltx/en_us_dedes/me.m01.d30:alt1.meVE.Stichera01.greekmelody	@ltx/en_us_dedes/he.a.m1:heAU.TonOuranionTagmaton.greekname
ltx/en_us_dedes/me.m01.d30:alt1.meVE.Stichera01.incipit	…
ltx/en_us_dedes/me.m01.d30:alt1.meVE.Stichera01.melody	@ltx/en_us_dedes/he.a.m1:heAU.TonOuranionTagmaton.name
ltx/en_us_dedes/me.m01.d30:alt1.meVE.Stichera01.mode	@ltx/en_us_dedes/miscellanea:misc.Mode1
ltx/en_us_dedes/me.m01.d30:alt1.meVE.Stichera01.text	
ltx/en_us_dedes/me.m01.d30:alt1.meVE.Stichera02.incipit	…
ltx/en_us_dedes/me.m01.d30:alt1.meVE.Stichera02.melody	@ltx/en_us_dedes/he.a.m1:heAU.TonOuranionTagmaton.name
ltx/en_us_dedes/me.m01.d30:alt1.meVE.Stichera02.mode	@ltx/en_us_dedes/miscellanea:misc.Mode1
ltx/en_us_dedes/me.m01.d30:alt1.meVE.Stichera02.text	
ltx/en_us_dedes/me.m01.d30:alt1.meVE.Stichera03.incipit	…
ltx/en_us_dedes/me.m01.d30:alt1.meVE.Stichera03.melody	@ltx/en_us_dedes/he.a.m1:heAU.TonOuranionTagmaton.name
ltx/en_us_dedes/me.m01.d30:alt1.meVE.Stichera03.mode	@ltx/en_us_dedes/miscellanea:misc.Mode1
ltx/en_us_dedes/me.m01.d30:alt1.meVE.Stichera03.text	
ltx/en_us_dedes/me.m01.d30:meDA.commemoration.first	Memory of the Holy Three Hierarchs
ltx/en_us_dedes/me.m01.d30:meDA.commemoration.first_name	Three Hierarchs
ltx/en_us_dedes/me.m01.d30:meDA.commemoration.first_short	Memory of the Holy Three Hierarchs
ltx/en_us_dedes/me.m01.d30:meDA.commemoration.first_title	@ltx/en_us_dedes/titles:ti.Saints
ltx/en_us_dedes/me.m01.d30:meDA.commemoration.full	Memory of our Fathers among the Saints, great Ecumenical Teachers and Hierarchs, Basil the Great, Gregory the Theologian and John Chrysostom.
ltx/en_us_dedes/me.m01.d30:meDA.commemoration.second_name	
ltx/en_us_dedes/me.m01.d30:meDA.commemoration.second_title	
ltx/en_us_dedes/me.m01.d30:meDA.date	January 30
ltx/en_us_dedes/me.m01.d30:meDA.fordate	for January 30
ltx/en_us_dedes/me.m01.d30:meDA.insert1	our fathers among the saints, great Ecumenical Teachers and Hierarchs, Basil the Great, Gregory the Theologian and John Chrysostom,
ltx/en_us_dedes/me.m01.d30:meDA.insert2	whose memory we celebrate;
ltx/en_us_dedes/me.m01.d30:meDA.note	
ltx/en_us_dedes/me.m01.d30:meDA.pdfcoverdate	January 30,
ltx/en_us_dedes/me.m01.d30:meDA.pdfheaderdate	January 30
ltx/en_us_dedes/me.m01.d30:meHO.commemorations	
ltx/en_us_dedes/me.m01.d30:meHO.note1	@ltx/en_us_dedes/rubrical:ru.HolidayWineOil
ltx/en_us_dedes/me.m01.d30:meHO.note2	The service for the Hieromartyr is sung at Compline.
ltx/en_us_dedes/me.m01.d30:meHO.number	30.
ltx/en_us_dedes/me.m01.d30:meHO.rank	
ltx/en_us_dedes/me.m01.d30:meLE.commemoration1	Our Fathers among the Saints the Ecumenical Teachers Basil the Great, Gregory the Theologian and John Chrysostomos.
ltx/en_us_dedes/me.m01.d30:meLE.commemoration2	
ltx/en_us_dedes/me.m01.d30:meLI.Kontakion1.greekmelody	@ltx/en_us_dedes/me.m01.d30:meMA.Kontakion1.greekmelody
ltx/en_us_dedes/me.m01.d30:meLI.Kontakion1.incipit	@ltx/en_us_dedes/me.m01.d30:meMA.Kontakion1.incipit
ltx/en_us_dedes/me.m01.d30:meLI.Kontakion1.melody	@ltx/en_us_dedes/me.m01.d30:meMA.Kontakion1.melody
ltx/en_us_dedes/me.m01.d30:meLI.Kontakion1.mode	@ltx/en_us_dedes/me.m01.d30:meMA.Kontakion1.mode
ltx/en_us_dedes/me.m01.d30:meLI.Kontakion1.text	@ltx/en_us_dedes/me.m01.d30:meMA.Kontakion1.text
ltx/en_us_dedes/me.m01.d30:meLI.MM.CommunionHymn.text	@ltx/en_us_dedes/properties:media.key
ltx/en_us_dedes/me.m01.d30:meLI.Megalynarion.text	
ltx/en_us_dedes/me.m01.d30:meMA.C1.acrostic.notice1	
ltx/en_us_dedes/me.m01.d30:meMA.C1.acrostic.text	
ltx/en_us_dedes/me.m01.d30:meMA.C1.acrostic.title	Canon for the Theotokos.
ltx/en_us_dedes/me.m01.d30:meMA.C1.poet	@ltx/en_us_dedes/poets:po.IoannouEfchaiton
ltx/en_us_dedes/me.m01.d30:meMA.C1.title	@ltx/en_us_dedes/titles:ti.CanonTheotokos
ltx/en_us_dedes/me.m01.d30:meMA.C1.verse	@ltx/en_us_dedes/prayers:pr.verse_Theotokos.text
ltx/en_us_dedes/me.m01.d30:meMA.C2.acrostic.notice1	
ltx/en_us_dedes/me.m01.d30:meMA.C2.acrostic.text	
ltx/en_us_dedes/me.m01.d30:meMA.C2.acrostic.title	Canon for the Saints.
ltx/en_us_dedes/me.m01.d30:meMA.C2.poet	@ltx/en_us_dedes/poets:po.IoannouEfchaiton
ltx/en_us_dedes/me.m01.d30:meMA.C2.title	@ltx/en_us_dedes/titles:ti.Canon1Saints
ltx/en_us_dedes/me.m01.d30:meMA.C2.verse	@ltx/en_us_dedes/prayers:pr.verse_SaintsM.text
ltx/en_us_dedes/me.m01.d30:meMA.C3.poet	@ltx/en_us_dedes/poets:po.IoannouEfchaiton
ltx/en_us_dedes/me.m01.d30:meMA.C3.title	@ltx/en_us_dedes/titles:ti.Canon2Saints
ltx/en_us_dedes/me.m01.d30:meMA.C3.verse	@ltx/en_us_dedes/prayers:pr.verse_SaintsM.text
ltx/en_us_dedes/me.m01.d30:meMA.ExapTheotokion.incipit	@ltx/en_us_dedes/ho.ho23:hoCA.Exaposteilarion4.incipit
ltx/en_us_dedes/me.m01.d30:meMA.ExapTheotokion.melody	@ltx/en_us_dedes/he.a.m3:heAU.OOuranonToisAstrois.name
ltx/en_us_dedes/me.m01.d30:meMA.ExapTheotokion.mode	@ltx/en_us_dedes/miscellanea:misc.Mode3
ltx/en_us_dedes/me.m01.d30:meMA.ExapTheotokion.text	@ltx/en_us_dedes/ho.ho23:hoCA.Exaposteilarion4.text
ltx/en_us_dedes/me.m01.d30:meMA.Exaposteilarion1.greekmelody	@ltx/en_us_dedes/he.a.m3:heAU.OOuranonToisAstrois.greekname
ltx/en_us_dedes/me.m01.d30:meMA.Exaposteilarion1.incipit	Come let us all extol…
ltx/en_us_dedes/me.m01.d30:meMA.Exaposteilarion1.melody	@ltx/en_us_dedes/he.a.m3:heAU.OOuranonToisAstrois.name
ltx/en_us_dedes/me.m01.d30:meMA.Exaposteilarion1.mode	@ltx/en_us_dedes/miscellanea:misc.Mode3
ltx/en_us_dedes/me.m01.d30:meMA.Exaposteilarion1.text	Come let us all extol now * the holy vessels of the Light * those radiant bolts of lightning * namely that Great Saint Basil, * Gregory the Theologian, * as well as John the Golden Mouth.
ltx/en_us_dedes/me.m01.d30:meMA.Exaposteilarion2.greekmelody	@ltx/en_us_dedes/he.a.m3:heAU.OOuranonToisAstrois.greekname
ltx/en_us_dedes/me.m01.d30:meMA.Exaposteilarion2.incipit	O unitary Godhead, * Father…
ltx/en_us_dedes/me.m01.d30:meMA.Exaposteilarion2.melody	@ltx/en_us_dedes/he.a.m3:heAU.OOuranonToisAstrois.name
ltx/en_us_dedes/me.m01.d30:meMA.Exaposteilarion2.mode	@ltx/en_us_dedes/miscellanea:misc.Mode3
ltx/en_us_dedes/me.m01.d30:meMA.Exaposteilarion2.text	O unitary Godhead, * Father, Son and Holy Spirit, * at the divine intercession * of Basil, Gregory and John * and of the pure Theotokos, * may we not part from Your glory.
ltx/en_us_dedes/me.m01.d30:meMA.Kathisma11.greekmelody	@ltx/en_us_dedes/he.a.m4:heAU.TachyProkatalave.greekname
ltx/en_us_dedes/me.m01.d30:meMA.Kathisma11.incipit	Most radiant luminaries of the…
ltx/en_us_dedes/me.m01.d30:meMA.Kathisma11.melody	@ltx/en_us_dedes/he.a.m4:heAU.TachyProkatalave.name
ltx/en_us_dedes/me.m01.d30:meMA.Kathisma11.mode	@ltx/en_us_dedes/miscellanea:misc.Mode4
ltx/en_us_dedes/me.m01.d30:meMA.Kathisma11.text	Most radiant luminaries of the Church of Christ, * O Fathers made wise by God, you have enlightened the world * with your doctrines and treatises, * reducing every error and heretical teaching, * extinguishing the fiery confusion of blasphemers. * And therefore as Hierarchs of Christ * intercede that we be saved.
ltx/en_us_dedes/me.m01.d30:meMA.Kathisma1T.incipit	O Mother of Christ our…
ltx/en_us_dedes/me.m01.d30:meMA.Kathisma1T.melody	@ltx/en_us_dedes/he.a.m4:heAU.TachyProkatalave.name
ltx/en_us_dedes/me.m01.d30:meMA.Kathisma1T.mode	@ltx/en_us_dedes/miscellanea:misc.Mode4
ltx/en_us_dedes/me.m01.d30:meMA.Kathisma1T.text	O Mother of Christ our God, all-lauded Virgin most pure, * O Mary the Bride of God and unwed Maiden, the help of believers all, * save us from every danger and all manner of hardship, * O Lady Theotokos, as we run to your shelter * with ardent faith and longing, O only Bride of God.
ltx/en_us_dedes/me.m01.d30:meMA.Kathisma21.greekmelody	@ltx/en_us_dedes/he.a.m4:heAU.KateplagiIosif.greekname
ltx/en_us_dedes/me.m01.d30:meMA.Kathisma21.incipit	Having flown like bees within…
ltx/en_us_dedes/me.m01.d30:meMA.Kathisma21.melody	@ltx/en_us_dedes/he.a.m4:heAU.KateplagiIosif.name
ltx/en_us_dedes/me.m01.d30:meMA.Kathisma21.mode	@ltx/en_us_dedes/miscellanea:misc.Mode4
ltx/en_us_dedes/me.m01.d30:meMA.Kathisma21.text	Having flown like bees within * the field of Holy Writ, * you did skillfully select * from its flowers what was best, * and you produced the honey of your teachings; * and now you set them out * for all the faithful to feast * on the sweetness of your words * as on a full-course meal. * And therefore everyone who has been sweetened * cries out to you in gladness: * “Again be with us, who now extol you, * O blessed Fathers, even after death.”
ltx/en_us_dedes/me.m01.d30:meMA.Kathisma2T.incipit	Without conscience I am tossed…
ltx/en_us_dedes/me.m01.d30:meMA.Kathisma2T.melody	@ltx/en_us_dedes/he.a.m4:heAU.KateplagiIosif.name
ltx/en_us_dedes/me.m01.d30:meMA.Kathisma2T.mode	@ltx/en_us_dedes/miscellanea:misc.Mode4
ltx/en_us_dedes/me.m01.d30:meMA.Kathisma2T.text	Without conscience I am tossed * about by storms the passions bring; * hence I fervently invoke * you to assist me, O pure Maid. * Since you gave birth to the abyss of mercy, * leave me not to drown, wretched coward that I am, * for except for you I have no other hope. * Let me not become the laughing-stock of demons, * for I have placed my hope in you, * and you are able * to do as you will, * as the Mother of the God of all.
ltx/en_us_dedes/me.m01.d30:meMA.Kathisma31.greekmelody	@ltx/en_us_dedes/he.a.m4:heAU.EpefanisSimeron.greekname
ltx/en_us_dedes/me.m01.d30:meMA.Kathisma31.incipit	Let us faithful magnify *…
ltx/en_us_dedes/me.m01.d30:meMA.Kathisma31.melody	@ltx/en_us_dedes/he.a.m4:heAU.EpefanisSimeron.name
ltx/en_us_dedes/me.m01.d30:meMA.Kathisma31.mode	@ltx/en_us_dedes/miscellanea:misc.Mode4
ltx/en_us_dedes/me.m01.d30:meMA.Kathisma31.text	Let us faithful magnify * today those most wise * teachers of the universe, * for while on earth they glorified * the God of all by their deeds and words; * and they promoted salvation for all mankind.
ltx/en_us_dedes/me.m01.d30:meMA.Kathisma32.greekmelody	@ltx/en_us_dedes/he.a.m4:heAU.EpefanisSimeron.greekname
ltx/en_us_dedes/me.m01.d30:meMA.Kathisma32.incipit	On this day the Church…
ltx/en_us_dedes/me.m01.d30:meMA.Kathisma32.melody	@ltx/en_us_dedes/he.a.m4:heAU.EpefanisSimeron.name
ltx/en_us_dedes/me.m01.d30:meMA.Kathisma32.mode	@ltx/en_us_dedes/miscellanea:misc.Mode4
ltx/en_us_dedes/me.m01.d30:meMA.Kathisma32.text	On this day the Church of Christ * is celebrating * the august and gala feast * of three great Teachers of the Church; * for they supported and strengthened her * by their divine words and dogmas inspired by God.
ltx/en_us_dedes/me.m01.d30:meMA.Kathisma3T.incipit	Unassailable Guardian * of those…
ltx/en_us_dedes/me.m01.d30:meMA.Kathisma3T.melody	@ltx/en_us_dedes/he.a.m4:heAU.EpefanisSimeron.name
ltx/en_us_dedes/me.m01.d30:meMA.Kathisma3T.mode	@ltx/en_us_dedes/miscellanea:misc.Mode4
ltx/en_us_dedes/me.m01.d30:meMA.Kathisma3T.text	Unassailable Guardian * of those in trouble, * ardent Helper of the ones * who place their every hope on you, * from every danger deliver me. * You are the help and assistance of all in need.
ltx/en_us_dedes/me.m01.d30:meMA.Kontakion1.greekmelody	@ltx/en_us_dedes/he.a.m2:heAU.TousAsfaleis.greekname
ltx/en_us_dedes/me.m01.d30:meMA.Kontakion1.incipit	You have taken to yourself…
ltx/en_us_dedes/me.m01.d30:meMA.Kontakion1.melody	@ltx/en_us_dedes/he.a.m2:heAU.TousAsfaleis.notmetered
ltx/en_us_dedes/me.m01.d30:meMA.Kontakion1.mode	@ltx/en_us_dedes/miscellanea:misc.Mode2
ltx/en_us_dedes/me.m01.d30:meMA.Kontakion1.text	You have taken to yourself, O Lord, the pinnacles among Teachers, those sacred theologians and preachers, to enjoy Your blessings and repose. For You accepted their labors and their toil as being higher than any whole-burnt offering, for only You glorify Your Saints.
ltx/en_us_dedes/me.m01.d30:meMA.Lauds1.greekmelody	@ltx/en_us_dedes/he.a.m2:heAU.PoioisEffimionStemmasin.greekname
ltx/en_us_dedes/me.m01.d30:meMA.Lauds1.incipit	Are there any worthy crowns…
ltx/en_us_dedes/me.m01.d30:meMA.Lauds1.melody	@ltx/en_us_dedes/he.a.m2:heAU.PoioisEffimionStemmasin.name
ltx/en_us_dedes/me.m01.d30:meMA.Lauds1.mode	@ltx/en_us_dedes/miscellanea:misc.Mode2
ltx/en_us_dedes/me.m01.d30:meMA.Lauds1.text	Are there any worthy crowns of praise * so that we might lay them on the holy Teachers? * Although they were physically separate, * yet in the Spirit they were unified. * And they are the chiefs of the God-bearers: * the servants * and numeric equals of the Trinity; * they shone forth * as luminaries of the universe. * And they are the Church’s pillars;* and with crowns of glory * these three holy men have been crowned * as victors by Christ our God, * the Lord who possesses great mercy.
ltx/en_us_dedes/me.m01.d30:meMA.Lauds2.incipit	Are there any worthy songs…
ltx/en_us_dedes/me.m01.d30:meMA.Lauds2.melody	@ltx/en_us_dedes/he.a.m2:heAU.PoioisEffimionStemmasin.name
ltx/en_us_dedes/me.m01.d30:meMA.Lauds2.mode	@ltx/en_us_dedes/miscellanea:misc.Mode2
ltx/en_us_dedes/me.m01.d30:meMA.Lauds2.text	Are there any worthy songs of praise * so that we might sing them to the God-bearers? * They are known as heaven’s initiates * and renowned as preachers of sound doctrine; * unadulterated Theologians: * Saint Basil * the great expositor and hierophant; * and also * the divine herald of God, Gregory; * and also John who is famous, * for his tongue was golden. * These were glorified as is meet * by the Holy Trinity, * the Lord who possesses great mercy.
ltx/en_us_dedes/me.m01.d30:meMA.Lauds3.incipit	Are there any worthy words…
ltx/en_us_dedes/me.m01.d30:meMA.Lauds3.melody	@ltx/en_us_dedes/he.a.m2:heAU.PoioisEffimionStemmasin.name
ltx/en_us_dedes/me.m01.d30:meMA.Lauds3.mode	@ltx/en_us_dedes/miscellanea:misc.Mode2
ltx/en_us_dedes/me.m01.d30:meMA.Lauds3.text	Are there any worthy words of praise * so that we might say them to the Hierarchs? * Peers of the Apostles are they in grace, * and equal sharers in the Spirit’s gifts. * They are the destroyers of false doctrine, * the saviors * and trusty guides in word and actual deed, * the shepherds * who by their faith have imitated Christ. * They were on earth virtual Angels * and heavenly mortals. * They were greatly honored by Christ, * the glorious King of all, * the Lord who possesses great mercy.
ltx/en_us_dedes/me.m01.d30:meMA.Lauds4.greekmelody	@ltx/en_us_dedes/he.a.m2:heAU.PoioisEffimionStemmasin.greekname
ltx/en_us_dedes/me.m01.d30:meMA.Lauds4.incipit	Are there any worthy crowns…
ltx/en_us_dedes/me.m01.d30:meMA.Lauds4.melody	@ltx/en_us_dedes/he.a.m2:heAU.PoioisEffimionStemmasin.name
ltx/en_us_dedes/me.m01.d30:meMA.Lauds4.mode	@ltx/en_us_dedes/miscellanea:misc.Mode2
ltx/en_us_dedes/me.m01.d30:meMA.Lauds4.text	Are there any worthy crowns of praise * to lay on John whose words were golden, * with his fellows Basil and Gregory? * for they were the Spirit’s receptacles. * And they were the Faith’s strong defenders; * the pillars of the Church; believers’ firm support; * assuagement and also advocates for all who sin; * the wells effusing the water * that we draw and drink from * and are sweetened in our souls, * while earnestly praying for * forgiveness of sins and great mercy.
ltx/en_us_dedes/me.m01.d30:meMA.LaudsBoth.incipit	Today in the Temple, Christ…
ltx/en_us_dedes/me.m01.d30:meMA.LaudsBoth.melody	
ltx/en_us_dedes/me.m01.d30:meMA.LaudsBoth.mode	@ltx/en_us_dedes/miscellanea:misc.Mode2
ltx/en_us_dedes/me.m01.d30:meMA.LaudsBoth.text	Today in the Temple, Christ is brought as an infant. Today, He who gave the Law to Moses comes under the Law himself. The armies of Angels are struck with awe, seeing that He who holds the universe together is being held in the arms of an old man. Symeon, filled with reverence and joy cries out: “Now You release me, O Savior, from this mortal life to one that never ends; for I have seen You and I am glad.”
ltx/en_us_dedes/me.m01.d30:meMA.LaudsGlory.incipit	Today the souls of those…
ltx/en_us_dedes/me.m01.d30:meMA.LaudsGlory.melody	
ltx/en_us_dedes/me.m01.d30:meMA.LaudsGlory.mode	@ltx/en_us_dedes/miscellanea:misc.Mode2
ltx/en_us_dedes/me.m01.d30:meMA.LaudsGlory.text	Today the souls of those born on earth are exalted from things earthly. Today they become heavenly, in the memorial of the Saints. For the gates of the heavens are lifted up, and the affairs of the Master are made known to us. The words proclaim the words, and the tongues sing of the miracles. And we cry out to the Savior: “Glory to You, O Christ our God; for through them has peace been made among the Faithful.”
ltx/en_us_dedes/me.m01.d30:meMA.MM.Lauds1234as5678.text	@ltx/en_us_dedes/properties:media.key
ltx/en_us_dedes/me.m01.d30:meMA.Ode1C11.greekmelody	@ltx/en_us_dedes/he.h.m2:heHE.DefteLaoi.greekname
ltx/en_us_dedes/me.m01.d30:meMA.Ode1C11.incipit	Rescue me, O immaculate Virgin…
ltx/en_us_dedes/me.m01.d30:meMA.Ode1C11.melody	@ltx/en_us_dedes/he.h.m2:heHE.DefteLaoi.notmetered
ltx/en_us_dedes/me.m01.d30:meMA.Ode1C11.mode	@ltx/en_us_dedes/miscellanea:misc.Mode2
ltx/en_us_dedes/me.m01.d30:meMA.Ode1C11.ode	@ltx/en_us_dedes/miscellanea:misc.Ode1
ltx/en_us_dedes/me.m01.d30:meMA.Ode1C11.text	Rescue me, O immaculate Virgin, from grave dangers and diseases and offenses of both soul and body. I piously confess you to be literally pure Theotokos.
ltx/en_us_dedes/me.m01.d30:meMA.Ode1C12.incipit	We have come to know…
ltx/en_us_dedes/me.m01.d30:meMA.Ode1C12.melody	@ltx/en_us_dedes/he.h.m2:heHE.DefteLaoi.notmetered
ltx/en_us_dedes/me.m01.d30:meMA.Ode1C12.mode	@ltx/en_us_dedes/miscellanea:misc.Mode2
ltx/en_us_dedes/me.m01.d30:meMA.Ode1C12.ode	@ltx/en_us_dedes/miscellanea:misc.Ode1
ltx/en_us_dedes/me.m01.d30:meMA.Ode1C12.text	We have come to know that in you is stored the entire ocean of the gifts of grace. Therefore, O Theotokos, we are rescued when we earnestly run to you for protection.
ltx/en_us_dedes/me.m01.d30:meMA.Ode1C13.incipit	All-pure Virgin, insistently implore your…
ltx/en_us_dedes/me.m01.d30:meMA.Ode1C13.melody	@ltx/en_us_dedes/he.h.m2:heHE.DefteLaoi.notmetered
ltx/en_us_dedes/me.m01.d30:meMA.Ode1C13.mode	@ltx/en_us_dedes/miscellanea:misc.Mode2
ltx/en_us_dedes/me.m01.d30:meMA.Ode1C13.ode	@ltx/en_us_dedes/miscellanea:misc.Ode1
ltx/en_us_dedes/me.m01.d30:meMA.Ode1C13.text	All-pure Virgin, insistently implore your Son, who was incarnate of your immaculate and honorable blood, for us who extol you, to deliver us from offenses and from bitter illness.
ltx/en_us_dedes/me.m01.d30:meMA.Ode1C14.incipit	O Lady, graced by God…
ltx/en_us_dedes/me.m01.d30:meMA.Ode1C14.melody	@ltx/en_us_dedes/he.h.m2:heHE.DefteLaoi.notmetered
ltx/en_us_dedes/me.m01.d30:meMA.Ode1C14.mode	@ltx/en_us_dedes/miscellanea:misc.Mode2
ltx/en_us_dedes/me.m01.d30:meMA.Ode1C14.ode	@ltx/en_us_dedes/miscellanea:misc.Ode1
ltx/en_us_dedes/me.m01.d30:meMA.Ode1C14.text	O Lady, graced by God, we believers have you as our boast, our refuge and support, our exultant joy, our hope and fortress, and the salvation of our souls.
ltx/en_us_dedes/me.m01.d30:meMA.Ode1C1H.greekmelody	@ltx/en_us_dedes/he.h.m2:heHE.DefteLaoi.greekname
ltx/en_us_dedes/me.m01.d30:meMA.Ode1C1H.incipit	@ltx/en_us_dedes/he.h.m2:heHE.DefteLaoi.incipit
ltx/en_us_dedes/me.m01.d30:meMA.Ode1C1H.melody	@ltx/en_us_dedes/he.h.m2:heHE.DefteLaoi.melody
ltx/en_us_dedes/me.m01.d30:meMA.Ode1C1H.mode	@ltx/en_us_dedes/miscellanea:misc.Mode2
ltx/en_us_dedes/me.m01.d30:meMA.Ode1C1H.ode	@ltx/en_us_dedes/miscellanea:misc.Ode1
ltx/en_us_dedes/me.m01.d30:meMA.Ode1C1H.text	@ltx/en_us_dedes/he.h.m2:heHE.DefteLaoi.text
ltx/en_us_dedes/me.m01.d30:meMA.Ode1C21.greekmelody	@ltx/en_us_dedes/he.h.m2:heHE.DefteLaoi.greekname
ltx/en_us_dedes/me.m01.d30:meMA.Ode1C21.incipit	…
ltx/en_us_dedes/me.m01.d30:meMA.Ode1C21.melody	@ltx/en_us_dedes/he.h.m2:heHE.DefteLaoi.name
ltx/en_us_dedes/me.m01.d30:meMA.Ode1C21.mode	@ltx/en_us_dedes/miscellanea:misc.Mode2
ltx/en_us_dedes/me.m01.d30:meMA.Ode1C21.ode	@ltx/en_us_dedes/miscellanea:misc.Ode1
ltx/en_us_dedes/me.m01.d30:meMA.Ode1C21.text	
ltx/en_us_dedes/me.m01.d30:meMA.Ode1C22.incipit	…
ltx/en_us_dedes/me.m01.d30:meMA.Ode1C22.melody	@ltx/en_us_dedes/he.h.m2:heHE.DefteLaoi.name
ltx/en_us_dedes/me.m01.d30:meMA.Ode1C22.mode	@ltx/en_us_dedes/miscellanea:misc.Mode2
ltx/en_us_dedes/me.m01.d30:meMA.Ode1C22.ode	@ltx/en_us_dedes/miscellanea:misc.Ode1
ltx/en_us_dedes/me.m01.d30:meMA.Ode1C22.text	
ltx/en_us_dedes/me.m01.d30:meMA.Ode1C23.incipit	…
ltx/en_us_dedes/me.m01.d30:meMA.Ode1C23.melody	@ltx/en_us_dedes/he.h.m2:heHE.DefteLaoi.name
ltx/en_us_dedes/me.m01.d30:meMA.Ode1C23.mode	@ltx/en_us_dedes/miscellanea:misc.Mode2
ltx/en_us_dedes/me.m01.d30:meMA.Ode1C23.ode	@ltx/en_us_dedes/miscellanea:misc.Ode1
ltx/en_us_dedes/me.m01.d30:meMA.Ode1C23.text	
ltx/en_us_dedes/me.m01.d30:meMA.Ode1C2T.incipit	…
ltx/en_us_dedes/me.m01.d30:meMA.Ode1C2T.melody	@ltx/en_us_dedes/he.h.m2:heHE.DefteLaoi.name
ltx/en_us_dedes/me.m01.d30:meMA.Ode1C2T.mode	@ltx/en_us_dedes/miscellanea:misc.Mode2
ltx/en_us_dedes/me.m01.d30:meMA.Ode1C2T.ode	@ltx/en_us_dedes/miscellanea:misc.Ode1
ltx/en_us_dedes/me.m01.d30:meMA.Ode1C2T.text	
ltx/en_us_dedes/me.m01.d30:meMA.Ode1C31.greekmelody	@ltx/en_us_dedes/he.h.m8:heHE.ArmatilatinFarao.greekname
ltx/en_us_dedes/me.m01.d30:meMA.Ode1C31.incipit	…
ltx/en_us_dedes/me.m01.d30:meMA.Ode1C31.melody	@ltx/en_us_dedes/he.h.m8:heHE.ArmatilatinFarao.name
ltx/en_us_dedes/me.m01.d30:meMA.Ode1C31.mode	@ltx/en_us_dedes/miscellanea:misc.Mode8
ltx/en_us_dedes/me.m01.d30:meMA.Ode1C31.ode	@ltx/en_us_dedes/miscellanea:misc.Ode1
ltx/en_us_dedes/me.m01.d30:meMA.Ode1C31.text	
ltx/en_us_dedes/me.m01.d30:meMA.Ode1C32.incipit	…
ltx/en_us_dedes/me.m01.d30:meMA.Ode1C32.melody	@ltx/en_us_dedes/he.h.m8:heHE.ArmatilatinFarao.name
ltx/en_us_dedes/me.m01.d30:meMA.Ode1C32.mode	@ltx/en_us_dedes/miscellanea:misc.Mode8
ltx/en_us_dedes/me.m01.d30:meMA.Ode1C32.ode	@ltx/en_us_dedes/miscellanea:misc.Ode1
ltx/en_us_dedes/me.m01.d30:meMA.Ode1C32.text	
ltx/en_us_dedes/me.m01.d30:meMA.Ode1C33.incipit	…
ltx/en_us_dedes/me.m01.d30:meMA.Ode1C33.melody	@ltx/en_us_dedes/he.h.m8:heHE.ArmatilatinFarao.name
ltx/en_us_dedes/me.m01.d30:meMA.Ode1C33.mode	@ltx/en_us_dedes/miscellanea:misc.Mode8
ltx/en_us_dedes/me.m01.d30:meMA.Ode1C33.ode	@ltx/en_us_dedes/miscellanea:misc.Ode1
ltx/en_us_dedes/me.m01.d30:meMA.Ode1C33.text	
ltx/en_us_dedes/me.m01.d30:meMA.Ode1C3T.incipit	…
ltx/en_us_dedes/me.m01.d30:meMA.Ode1C3T.melody	@ltx/en_us_dedes/he.h.m8:heHE.ArmatilatinFarao.name
ltx/en_us_dedes/me.m01.d30:meMA.Ode1C3T.mode	@ltx/en_us_dedes/miscellanea:misc.Mode8
ltx/en_us_dedes/me.m01.d30:meMA.Ode1C3T.ode	@ltx/en_us_dedes/miscellanea:misc.Ode1
ltx/en_us_dedes/me.m01.d30:meMA.Ode1C3T.text	
ltx/en_us_dedes/me.m01.d30:meMA.Ode3C11.greekmelody	@ltx/en_us_dedes/he.h.m2:heHE.StereosonImasEnSoiKyrie.greekname
ltx/en_us_dedes/me.m01.d30:meMA.Ode3C11.incipit	O pure one, by your…
ltx/en_us_dedes/me.m01.d30:meMA.Ode3C11.melody	@ltx/en_us_dedes/he.h.m2:heHE.StereosonImasEnSoiKyrie.notmetered
ltx/en_us_dedes/me.m01.d30:meMA.Ode3C11.mode	@ltx/en_us_dedes/miscellanea:misc.Mode2
ltx/en_us_dedes/me.m01.d30:meMA.Ode3C11.ode	@ltx/en_us_dedes/miscellanea:misc.Ode3
ltx/en_us_dedes/me.m01.d30:meMA.Ode3C11.text	O pure one, by your intercessions, move your Son and our God to be merciful towards us who run to you for refuge, and who faithfully venerate your childbirth.
ltx/en_us_dedes/me.m01.d30:meMA.Ode3C12.incipit	O Virgin extolled by all…
ltx/en_us_dedes/me.m01.d30:meMA.Ode3C12.melody	@ltx/en_us_dedes/he.h.m2:heHE.StereosonImasEnSoiKyrie.notmetered
ltx/en_us_dedes/me.m01.d30:meMA.Ode3C12.mode	@ltx/en_us_dedes/miscellanea:misc.Mode2
ltx/en_us_dedes/me.m01.d30:meMA.Ode3C12.ode	@ltx/en_us_dedes/miscellanea:misc.Ode3
ltx/en_us_dedes/me.m01.d30:meMA.Ode3C12.text	O Virgin extolled by all, listen to the words of my soul that is severely disturbed; and ever rescue it from danger, and give it peace.
ltx/en_us_dedes/me.m01.d30:meMA.Ode3C13.incipit	O Virgin, pilot my entire…
ltx/en_us_dedes/me.m01.d30:meMA.Ode3C13.melody	@ltx/en_us_dedes/he.h.m2:heHE.StereosonImasEnSoiKyrie.notmetered
ltx/en_us_dedes/me.m01.d30:meMA.Ode3C13.mode	@ltx/en_us_dedes/miscellanea:misc.Mode2
ltx/en_us_dedes/me.m01.d30:meMA.Ode3C13.ode	@ltx/en_us_dedes/miscellanea:misc.Ode3
ltx/en_us_dedes/me.m01.d30:meMA.Ode3C13.text	O Virgin, pilot my entire life, for you are my hope and protection; you deliver me from temptations and difficult situations, O ever-virgin Maid.
ltx/en_us_dedes/me.m01.d30:meMA.Ode3C14.incipit	O Theotokos, you held in…
ltx/en_us_dedes/me.m01.d30:meMA.Ode3C14.melody	@ltx/en_us_dedes/he.h.m2:heHE.StereosonImasEnSoiKyrie.notmetered
ltx/en_us_dedes/me.m01.d30:meMA.Ode3C14.mode	@ltx/en_us_dedes/miscellanea:misc.Mode2
ltx/en_us_dedes/me.m01.d30:meMA.Ode3C14.ode	@ltx/en_us_dedes/miscellanea:misc.Ode3
ltx/en_us_dedes/me.m01.d30:meMA.Ode3C14.text	O Theotokos, you held in your arms the enhypostatic Wisdom of God; therefore pray that we who extol you may be freed from ignorance and from being led into error.
ltx/en_us_dedes/me.m01.d30:meMA.Ode3C1H.greekmelody	@ltx/en_us_dedes/he.h.m2:heHE.StereosonImasEnSoiKyrie.greekname
ltx/en_us_dedes/me.m01.d30:meMA.Ode3C1H.incipit	@ltx/en_us_dedes/he.h.m2:heHE.StereosonImasEnSoiKyrie.incipit
ltx/en_us_dedes/me.m01.d30:meMA.Ode3C1H.melody	@ltx/en_us_dedes/he.h.m2:heHE.StereosonImasEnSoiKyrie.melody
ltx/en_us_dedes/me.m01.d30:meMA.Ode3C1H.mode	@ltx/en_us_dedes/miscellanea:misc.Mode2
ltx/en_us_dedes/me.m01.d30:meMA.Ode3C1H.ode	@ltx/en_us_dedes/miscellanea:misc.Ode3
ltx/en_us_dedes/me.m01.d30:meMA.Ode3C1H.text	@ltx/en_us_dedes/he.h.m2:heHE.StereosonImasEnSoiKyrie.text
ltx/en_us_dedes/me.m01.d30:meMA.Ode3C21.greekmelody	@ltx/en_us_dedes/he.h.m2:heHE.EnPetraMeTisPisteos.greekname
ltx/en_us_dedes/me.m01.d30:meMA.Ode3C21.incipit	…
ltx/en_us_dedes/me.m01.d30:meMA.Ode3C21.melody	@ltx/en_us_dedes/he.h.m2:heHE.EnPetraMeTisPisteos.name
ltx/en_us_dedes/me.m01.d30:meMA.Ode3C21.mode	@ltx/en_us_dedes/miscellanea:misc.Mode2
ltx/en_us_dedes/me.m01.d30:meMA.Ode3C21.ode	@ltx/en_us_dedes/miscellanea:misc.Ode3
ltx/en_us_dedes/me.m01.d30:meMA.Ode3C21.text	
ltx/en_us_dedes/me.m01.d30:meMA.Ode3C22.incipit	…
ltx/en_us_dedes/me.m01.d30:meMA.Ode3C22.melody	@ltx/en_us_dedes/he.h.m2:heHE.EnPetraMeTisPisteos.name
ltx/en_us_dedes/me.m01.d30:meMA.Ode3C22.mode	@ltx/en_us_dedes/miscellanea:misc.Mode2
ltx/en_us_dedes/me.m01.d30:meMA.Ode3C22.ode	@ltx/en_us_dedes/miscellanea:misc.Ode3
ltx/en_us_dedes/me.m01.d30:meMA.Ode3C22.text	
ltx/en_us_dedes/me.m01.d30:meMA.Ode3C23.incipit	…
ltx/en_us_dedes/me.m01.d30:meMA.Ode3C23.melody	@ltx/en_us_dedes/he.h.m2:heHE.EnPetraMeTisPisteos.name
ltx/en_us_dedes/me.m01.d30:meMA.Ode3C23.mode	@ltx/en_us_dedes/miscellanea:misc.Mode2
ltx/en_us_dedes/me.m01.d30:meMA.Ode3C23.ode	@ltx/en_us_dedes/miscellanea:misc.Ode3
ltx/en_us_dedes/me.m01.d30:meMA.Ode3C23.text	
ltx/en_us_dedes/me.m01.d30:meMA.Ode3C2T.incipit	…
ltx/en_us_dedes/me.m01.d30:meMA.Ode3C2T.melody	@ltx/en_us_dedes/he.h.m2:heHE.EnPetraMeTisPisteos.name
ltx/en_us_dedes/me.m01.d30:meMA.Ode3C2T.mode	@ltx/en_us_dedes/miscellanea:misc.Mode2
ltx/en_us_dedes/me.m01.d30:meMA.Ode3C2T.ode	@ltx/en_us_dedes/miscellanea:misc.Ode3
ltx/en_us_dedes/me.m01.d30:meMA.Ode3C2T.text	
ltx/en_us_dedes/me.m01.d30:meMA.Ode3C31.greekmelody	@ltx/en_us_dedes/he.h.m8:heHE.OStereosasKatArchas.greekname
ltx/en_us_dedes/me.m01.d30:meMA.Ode3C31.incipit	…
ltx/en_us_dedes/me.m01.d30:meMA.Ode3C31.melody	@ltx/en_us_dedes/he.h.m8:heHE.OStereosasKatArchas.name
ltx/en_us_dedes/me.m01.d30:meMA.Ode3C31.mode	@ltx/en_us_dedes/miscellanea:misc.Mode8
ltx/en_us_dedes/me.m01.d30:meMA.Ode3C31.ode	@ltx/en_us_dedes/miscellanea:misc.Ode3
ltx/en_us_dedes/me.m01.d30:meMA.Ode3C31.text	
ltx/en_us_dedes/me.m01.d30:meMA.Ode3C32.incipit	…
ltx/en_us_dedes/me.m01.d30:meMA.Ode3C32.melody	@ltx/en_us_dedes/he.h.m8:heHE.OStereosasKatArchas.name
ltx/en_us_dedes/me.m01.d30:meMA.Ode3C32.mode	@ltx/en_us_dedes/miscellanea:misc.Mode8
ltx/en_us_dedes/me.m01.d30:meMA.Ode3C32.ode	@ltx/en_us_dedes/miscellanea:misc.Ode3
ltx/en_us_dedes/me.m01.d30:meMA.Ode3C32.text	
ltx/en_us_dedes/me.m01.d30:meMA.Ode3C33.incipit	…
ltx/en_us_dedes/me.m01.d30:meMA.Ode3C33.melody	@ltx/en_us_dedes/he.h.m8:heHE.OStereosasKatArchas.name
ltx/en_us_dedes/me.m01.d30:meMA.Ode3C33.mode	@ltx/en_us_dedes/miscellanea:misc.Mode8
ltx/en_us_dedes/me.m01.d30:meMA.Ode3C33.ode	@ltx/en_us_dedes/miscellanea:misc.Ode3
ltx/en_us_dedes/me.m01.d30:meMA.Ode3C33.text	
ltx/en_us_dedes/me.m01.d30:meMA.Ode3C3T.incipit	…
ltx/en_us_dedes/me.m01.d30:meMA.Ode3C3T.melody	@ltx/en_us_dedes/he.h.m8:heHE.OStereosasKatArchas.name
ltx/en_us_dedes/me.m01.d30:meMA.Ode3C3T.mode	@ltx/en_us_dedes/miscellanea:misc.Mode8
ltx/en_us_dedes/me.m01.d30:meMA.Ode3C3T.ode	@ltx/en_us_dedes/miscellanea:misc.Ode3
ltx/en_us_dedes/me.m01.d30:meMA.Ode3C3T.text	
ltx/en_us_dedes/me.m01.d30:meMA.Ode3Kathisma1.greekmelody	@ltx/en_us_dedes/he.a.m8:heAU.TinSofianKaiLogon.greekname
ltx/en_us_dedes/me.m01.d30:meMA.Ode3Kathisma1.incipit	…
ltx/en_us_dedes/me.m01.d30:meMA.Ode3Kathisma1.melody	@ltx/en_us_dedes/he.a.m8:heAU.TinSofianKaiLogon.name
ltx/en_us_dedes/me.m01.d30:meMA.Ode3Kathisma1.mode	@ltx/en_us_dedes/miscellanea:misc.Mode8
ltx/en_us_dedes/me.m01.d30:meMA.Ode3Kathisma1.text	
ltx/en_us_dedes/me.m01.d30:meMA.Ode3Kathisma2.greekmelody	@ltx/en_us_dedes/he.a.m8:heAU.TinSofianKaiLogon.greekname
ltx/en_us_dedes/me.m01.d30:meMA.Ode3Kathisma2.incipit	…
ltx/en_us_dedes/me.m01.d30:meMA.Ode3Kathisma2.melody	@ltx/en_us_dedes/he.a.m8:heAU.TinSofianKaiLogon.name
ltx/en_us_dedes/me.m01.d30:meMA.Ode3Kathisma2.mode	@ltx/en_us_dedes/miscellanea:misc.Mode8
ltx/en_us_dedes/me.m01.d30:meMA.Ode3Kathisma2.text	
ltx/en_us_dedes/me.m01.d30:meMA.Ode3KathismaT.incipit	Holy Virgin, you see that…
ltx/en_us_dedes/me.m01.d30:meMA.Ode3KathismaT.melody	@ltx/en_us_dedes/he.a.m8:heAU.TinSofianKaiLogon.name
ltx/en_us_dedes/me.m01.d30:meMA.Ode3KathismaT.mode	@ltx/en_us_dedes/miscellanea:misc.Mode8
ltx/en_us_dedes/me.m01.d30:meMA.Ode3KathismaT.text	Holy Virgin, you see that my humble soul * like a ship with no pilot is tossed about * in the storm of the present life, with temptations as turbulence, * and it is taking water because of the weight of sins; * and it is now in danger of entering the depth of Hell. * Come, O Theotokos, intercede in your mercy, * and grant me your calm, and from every danger deliver me; * for you are an untroubled port; * and with your Son and God intercede, * that He grant to me forgiveness of my sins. * I your servant, O Lady, have you as my only hope.
ltx/en_us_dedes/me.m01.d30:meMA.Ode4C11.greekmelody	@ltx/en_us_dedes/he.h.m2:heHE.EisakikoaKyrieTinAkoin.greekname
ltx/en_us_dedes/me.m01.d30:meMA.Ode4C11.incipit	O Lady, who gave birth…
ltx/en_us_dedes/me.m01.d30:meMA.Ode4C11.melody	@ltx/en_us_dedes/he.h.m2:heHE.EisakikoaKyrieTinAkoin.notmetered
ltx/en_us_dedes/me.m01.d30:meMA.Ode4C11.mode	@ltx/en_us_dedes/miscellanea:misc.Mode2
ltx/en_us_dedes/me.m01.d30:meMA.Ode4C11.ode	@ltx/en_us_dedes/miscellanea:misc.Ode4
ltx/en_us_dedes/me.m01.d30:meMA.Ode4C11.text	O Lady, who gave birth to God, grant me to be free of psychological trauma and bodily disease.
ltx/en_us_dedes/me.m01.d30:meMA.Ode4C12.incipit	O Virgin, confirm me in…
ltx/en_us_dedes/me.m01.d30:meMA.Ode4C12.melody	@ltx/en_us_dedes/he.h.m2:heHE.EisakikoaKyrieTinAkoin.notmetered
ltx/en_us_dedes/me.m01.d30:meMA.Ode4C12.mode	@ltx/en_us_dedes/miscellanea:misc.Mode2
ltx/en_us_dedes/me.m01.d30:meMA.Ode4C12.ode	@ltx/en_us_dedes/miscellanea:misc.Ode4
ltx/en_us_dedes/me.m01.d30:meMA.Ode4C12.text	O Virgin, confirm me in faith and hope, for I am being blown about by passions and thoughts, and the storms of life.
ltx/en_us_dedes/me.m01.d30:meMA.Ode4C13.incipit	O Mother of God, deliver…
ltx/en_us_dedes/me.m01.d30:meMA.Ode4C13.melody	@ltx/en_us_dedes/he.h.m2:heHE.EisakikoaKyrieTinAkoin.notmetered
ltx/en_us_dedes/me.m01.d30:meMA.Ode4C13.mode	@ltx/en_us_dedes/miscellanea:misc.Mode2
ltx/en_us_dedes/me.m01.d30:meMA.Ode4C13.ode	@ltx/en_us_dedes/miscellanea:misc.Ode4
ltx/en_us_dedes/me.m01.d30:meMA.Ode4C13.text	O Mother of God, deliver me from difficulties, and from confusion and danger, by your entreaties, O only all-laudable Lady.
ltx/en_us_dedes/me.m01.d30:meMA.Ode4C14.incipit	O Virgin, snatch me from…
ltx/en_us_dedes/me.m01.d30:meMA.Ode4C14.melody	@ltx/en_us_dedes/he.h.m2:heHE.EisakikoaKyrieTinAkoin.notmetered
ltx/en_us_dedes/me.m01.d30:meMA.Ode4C14.mode	@ltx/en_us_dedes/miscellanea:misc.Mode2
ltx/en_us_dedes/me.m01.d30:meMA.Ode4C14.ode	@ltx/en_us_dedes/miscellanea:misc.Ode4
ltx/en_us_dedes/me.m01.d30:meMA.Ode4C14.text	O Virgin, snatch me from the cares of life, for I am tossed about by the storm; and lead me to your harbor.
ltx/en_us_dedes/me.m01.d30:meMA.Ode4C1H.greekmelody	@ltx/en_us_dedes/he.h.m2:heHE.EisakikoaKyrieTinAkoin.greekname
ltx/en_us_dedes/me.m01.d30:meMA.Ode4C1H.incipit	@ltx/en_us_dedes/he.h.m2:heHE.EisakikoaKyrieTinAkoin.incipit
ltx/en_us_dedes/me.m01.d30:meMA.Ode4C1H.melody	@ltx/en_us_dedes/he.h.m2:heHE.EisakikoaKyrieTinAkoin.melody
ltx/en_us_dedes/me.m01.d30:meMA.Ode4C1H.mode	@ltx/en_us_dedes/miscellanea:misc.Mode2
ltx/en_us_dedes/me.m01.d30:meMA.Ode4C1H.ode	@ltx/en_us_dedes/miscellanea:misc.Ode4
ltx/en_us_dedes/me.m01.d30:meMA.Ode4C1H.text	@ltx/en_us_dedes/he.h.m2:heHE.EisakikoaKyrieTinAkoin.text
ltx/en_us_dedes/me.m01.d30:meMA.Ode4C21.greekmelody	@ltx/en_us_dedes/he.h.m2:heHE.ElilythasEkParthenou.greekname
ltx/en_us_dedes/me.m01.d30:meMA.Ode4C21.incipit	…
ltx/en_us_dedes/me.m01.d30:meMA.Ode4C21.melody	@ltx/en_us_dedes/he.h.m2:heHE.ElilythasEkParthenou.name
ltx/en_us_dedes/me.m01.d30:meMA.Ode4C21.mode	@ltx/en_us_dedes/miscellanea:misc.Mode2
ltx/en_us_dedes/me.m01.d30:meMA.Ode4C21.ode	@ltx/en_us_dedes/miscellanea:misc.Ode4
ltx/en_us_dedes/me.m01.d30:meMA.Ode4C21.text	
ltx/en_us_dedes/me.m01.d30:meMA.Ode4C22.incipit	…
ltx/en_us_dedes/me.m01.d30:meMA.Ode4C22.melody	@ltx/en_us_dedes/he.h.m2:heHE.ElilythasEkParthenou.name
ltx/en_us_dedes/me.m01.d30:meMA.Ode4C22.mode	@ltx/en_us_dedes/miscellanea:misc.Mode2
ltx/en_us_dedes/me.m01.d30:meMA.Ode4C22.ode	@ltx/en_us_dedes/miscellanea:misc.Ode4
ltx/en_us_dedes/me.m01.d30:meMA.Ode4C22.text	
ltx/en_us_dedes/me.m01.d30:meMA.Ode4C2T.incipit	…
ltx/en_us_dedes/me.m01.d30:meMA.Ode4C2T.melody	@ltx/en_us_dedes/he.h.m2:heHE.ElilythasEkParthenou.name
ltx/en_us_dedes/me.m01.d30:meMA.Ode4C2T.mode	@ltx/en_us_dedes/miscellanea:misc.Mode2
ltx/en_us_dedes/me.m01.d30:meMA.Ode4C2T.ode	@ltx/en_us_dedes/miscellanea:misc.Ode4
ltx/en_us_dedes/me.m01.d30:meMA.Ode4C2T.text	
ltx/en_us_dedes/me.m01.d30:meMA.Ode4C31.greekmelody	@ltx/en_us_dedes/he.h.m8:heHE.SyMouIschys.greekname
ltx/en_us_dedes/me.m01.d30:meMA.Ode4C31.incipit	…
ltx/en_us_dedes/me.m01.d30:meMA.Ode4C31.melody	@ltx/en_us_dedes/he.h.m8:heHE.SyMouIschys.name
ltx/en_us_dedes/me.m01.d30:meMA.Ode4C31.mode	@ltx/en_us_dedes/miscellanea:misc.Mode8
ltx/en_us_dedes/me.m01.d30:meMA.Ode4C31.ode	@ltx/en_us_dedes/miscellanea:misc.Ode4
ltx/en_us_dedes/me.m01.d30:meMA.Ode4C31.text	
ltx/en_us_dedes/me.m01.d30:meMA.Ode4C32.incipit	…
ltx/en_us_dedes/me.m01.d30:meMA.Ode4C32.melody	@ltx/en_us_dedes/he.h.m8:heHE.SyMouIschys.name
ltx/en_us_dedes/me.m01.d30:meMA.Ode4C32.mode	@ltx/en_us_dedes/miscellanea:misc.Mode8
ltx/en_us_dedes/me.m01.d30:meMA.Ode4C32.ode	@ltx/en_us_dedes/miscellanea:misc.Ode4
ltx/en_us_dedes/me.m01.d30:meMA.Ode4C32.text	
ltx/en_us_dedes/me.m01.d30:meMA.Ode4C33.incipit	…
ltx/en_us_dedes/me.m01.d30:meMA.Ode4C33.melody	@ltx/en_us_dedes/he.h.m8:heHE.SyMouIschys.name
ltx/en_us_dedes/me.m01.d30:meMA.Ode4C33.mode	@ltx/en_us_dedes/miscellanea:misc.Mode8
ltx/en_us_dedes/me.m01.d30:meMA.Ode4C33.ode	@ltx/en_us_dedes/miscellanea:misc.Ode4
ltx/en_us_dedes/me.m01.d30:meMA.Ode4C33.text	
ltx/en_us_dedes/me.m01.d30:meMA.Ode4C3T.incipit	…
ltx/en_us_dedes/me.m01.d30:meMA.Ode4C3T.melody	@ltx/en_us_dedes/he.h.m8:heHE.SyMouIschys.name
ltx/en_us_dedes/me.m01.d30:meMA.Ode4C3T.mode	@ltx/en_us_dedes/miscellanea:misc.Mode8
ltx/en_us_dedes/me.m01.d30:meMA.Ode4C3T.ode	@ltx/en_us_dedes/miscellanea:misc.Ode4
ltx/en_us_dedes/me.m01.d30:meMA.Ode4C3T.text	
ltx/en_us_dedes/me.m01.d30:meMA.Ode5C11.greekmelody	@ltx/en_us_dedes/he.h.m2:heHE.OTouFotosChorigos.greekname
ltx/en_us_dedes/me.m01.d30:meMA.Ode5C11.incipit	O pure Virgin, we who…
ltx/en_us_dedes/me.m01.d30:meMA.Ode5C11.melody	@ltx/en_us_dedes/he.h.m2:heHE.OTouFotosChorigos.notmetered
ltx/en_us_dedes/me.m01.d30:meMA.Ode5C11.mode	@ltx/en_us_dedes/miscellanea:misc.Mode2
ltx/en_us_dedes/me.m01.d30:meMA.Ode5C11.ode	@ltx/en_us_dedes/miscellanea:misc.Ode5
ltx/en_us_dedes/me.m01.d30:meMA.Ode5C11.text	O pure Virgin, we who know you to be Theotokos have you as an invincible shield against every temptation; and thus we are always delivered from every assault of our enemies.
ltx/en_us_dedes/me.m01.d30:meMA.Ode5C12.incipit	O Lady, who are higher…
ltx/en_us_dedes/me.m01.d30:meMA.Ode5C12.melody	@ltx/en_us_dedes/he.h.m2:heHE.OTouFotosChorigos.notmetered
ltx/en_us_dedes/me.m01.d30:meMA.Ode5C12.mode	@ltx/en_us_dedes/miscellanea:misc.Mode2
ltx/en_us_dedes/me.m01.d30:meMA.Ode5C12.ode	@ltx/en_us_dedes/miscellanea:misc.Ode5
ltx/en_us_dedes/me.m01.d30:meMA.Ode5C12.text	O Lady, who are higher than the Cherubim, you gave birth to God’s only-begotten Son, who was incarnate of you. Ever pray to Him on behalf of us your servants.
ltx/en_us_dedes/me.m01.d30:meMA.Ode5C13.incipit	O pure Virgin, who held…
ltx/en_us_dedes/me.m01.d30:meMA.Ode5C13.melody	@ltx/en_us_dedes/he.h.m2:heHE.OTouFotosChorigos.notmetered
ltx/en_us_dedes/me.m01.d30:meMA.Ode5C13.mode	@ltx/en_us_dedes/miscellanea:misc.Mode2
ltx/en_us_dedes/me.m01.d30:meMA.Ode5C13.ode	@ltx/en_us_dedes/miscellanea:misc.Ode5
ltx/en_us_dedes/me.m01.d30:meMA.Ode5C13.text	O pure Virgin, who held in your arms the Creator of all, by your entreaties make Him be merciful towards us, who with all our hearts now run to you for refuge.
ltx/en_us_dedes/me.m01.d30:meMA.Ode5C14.incipit	To you alone, O Lady…
ltx/en_us_dedes/me.m01.d30:meMA.Ode5C14.melody	@ltx/en_us_dedes/he.h.m2:heHE.OTouFotosChorigos.notmetered
ltx/en_us_dedes/me.m01.d30:meMA.Ode5C14.mode	@ltx/en_us_dedes/miscellanea:misc.Mode2
ltx/en_us_dedes/me.m01.d30:meMA.Ode5C14.ode	@ltx/en_us_dedes/miscellanea:misc.Ode5
ltx/en_us_dedes/me.m01.d30:meMA.Ode5C14.text	To you alone, O Lady who gave birth the Logos and cause, do I the wretch offer my petition from my strained and afflicted soul. Have compassion on me and save me.
ltx/en_us_dedes/me.m01.d30:meMA.Ode5C1H.greekmelody	@ltx/en_us_dedes/he.h.m2:heHE.OTouFotosChorigos.greekname
ltx/en_us_dedes/me.m01.d30:meMA.Ode5C1H.incipit	@ltx/en_us_dedes/he.h.m2:heHE.OTouFotosChorigos.incipit
ltx/en_us_dedes/me.m01.d30:meMA.Ode5C1H.melody	@ltx/en_us_dedes/he.h.m2:heHE.OTouFotosChorigos.melody
ltx/en_us_dedes/me.m01.d30:meMA.Ode5C1H.mode	@ltx/en_us_dedes/miscellanea:misc.Mode2
ltx/en_us_dedes/me.m01.d30:meMA.Ode5C1H.ode	@ltx/en_us_dedes/miscellanea:misc.Ode5
ltx/en_us_dedes/me.m01.d30:meMA.Ode5C1H.text	@ltx/en_us_dedes/he.h.m2:heHE.OTouFotosChorigos.text
ltx/en_us_dedes/me.m01.d30:meMA.Ode5C21.greekmelody	@ltx/en_us_dedes/he.h.m2:heHE.OFotismos.greekname
ltx/en_us_dedes/me.m01.d30:meMA.Ode5C21.incipit	…
ltx/en_us_dedes/me.m01.d30:meMA.Ode5C21.melody	@ltx/en_us_dedes/he.h.m2:heHE.OFotismos.name
ltx/en_us_dedes/me.m01.d30:meMA.Ode5C21.mode	@ltx/en_us_dedes/miscellanea:misc.Mode2
ltx/en_us_dedes/me.m01.d30:meMA.Ode5C21.ode	@ltx/en_us_dedes/miscellanea:misc.Ode5
ltx/en_us_dedes/me.m01.d30:meMA.Ode5C21.text	
ltx/en_us_dedes/me.m01.d30:meMA.Ode5C22.incipit	…
ltx/en_us_dedes/me.m01.d30:meMA.Ode5C22.melody	@ltx/en_us_dedes/he.h.m2:heHE.OFotismos.name
ltx/en_us_dedes/me.m01.d30:meMA.Ode5C22.mode	@ltx/en_us_dedes/miscellanea:misc.Mode2
ltx/en_us_dedes/me.m01.d30:meMA.Ode5C22.ode	@ltx/en_us_dedes/miscellanea:misc.Ode5
ltx/en_us_dedes/me.m01.d30:meMA.Ode5C22.text	
ltx/en_us_dedes/me.m01.d30:meMA.Ode5C23.incipit	…
ltx/en_us_dedes/me.m01.d30:meMA.Ode5C23.melody	@ltx/en_us_dedes/he.h.m2:heHE.OFotismos.name
ltx/en_us_dedes/me.m01.d30:meMA.Ode5C23.mode	@ltx/en_us_dedes/miscellanea:misc.Mode2
ltx/en_us_dedes/me.m01.d30:meMA.Ode5C23.ode	@ltx/en_us_dedes/miscellanea:misc.Ode5
ltx/en_us_dedes/me.m01.d30:meMA.Ode5C23.text	
ltx/en_us_dedes/me.m01.d30:meMA.Ode5C2T.incipit	…
ltx/en_us_dedes/me.m01.d30:meMA.Ode5C2T.melody	@ltx/en_us_dedes/he.h.m2:heHE.OFotismos.name
ltx/en_us_dedes/me.m01.d30:meMA.Ode5C2T.mode	@ltx/en_us_dedes/miscellanea:misc.Mode2
ltx/en_us_dedes/me.m01.d30:meMA.Ode5C2T.ode	@ltx/en_us_dedes/miscellanea:misc.Ode5
ltx/en_us_dedes/me.m01.d30:meMA.Ode5C2T.text	
ltx/en_us_dedes/me.m01.d30:meMA.Ode5C31.greekmelody	@ltx/en_us_dedes/he.h.m8:heHE.InaTiMeAposo.greekname
ltx/en_us_dedes/me.m01.d30:meMA.Ode5C31.incipit	…
ltx/en_us_dedes/me.m01.d30:meMA.Ode5C31.melody	@ltx/en_us_dedes/he.h.m8:heHE.InaTiMeAposo.name
ltx/en_us_dedes/me.m01.d30:meMA.Ode5C31.mode	@ltx/en_us_dedes/miscellanea:misc.Mode8
ltx/en_us_dedes/me.m01.d30:meMA.Ode5C31.ode	@ltx/en_us_dedes/miscellanea:misc.Ode5
ltx/en_us_dedes/me.m01.d30:meMA.Ode5C31.text	
ltx/en_us_dedes/me.m01.d30:meMA.Ode5C32.incipit	…
ltx/en_us_dedes/me.m01.d30:meMA.Ode5C32.melody	@ltx/en_us_dedes/he.h.m8:heHE.InaTiMeAposo.name
ltx/en_us_dedes/me.m01.d30:meMA.Ode5C32.mode	@ltx/en_us_dedes/miscellanea:misc.Mode8
ltx/en_us_dedes/me.m01.d30:meMA.Ode5C32.ode	@ltx/en_us_dedes/miscellanea:misc.Ode5
ltx/en_us_dedes/me.m01.d30:meMA.Ode5C32.text	
ltx/en_us_dedes/me.m01.d30:meMA.Ode5C33.incipit	…
ltx/en_us_dedes/me.m01.d30:meMA.Ode5C33.melody	@ltx/en_us_dedes/he.h.m8:heHE.InaTiMeAposo.name
ltx/en_us_dedes/me.m01.d30:meMA.Ode5C33.mode	@ltx/en_us_dedes/miscellanea:misc.Mode8
ltx/en_us_dedes/me.m01.d30:meMA.Ode5C33.ode	@ltx/en_us_dedes/miscellanea:misc.Ode5
ltx/en_us_dedes/me.m01.d30:meMA.Ode5C33.text	
ltx/en_us_dedes/me.m01.d30:meMA.Ode5C3T.incipit	…
ltx/en_us_dedes/me.m01.d30:meMA.Ode5C3T.melody	@ltx/en_us_dedes/he.h.m8:heHE.InaTiMeAposo.name
ltx/en_us_dedes/me.m01.d30:meMA.Ode5C3T.mode	@ltx/en_us_dedes/miscellanea:misc.Mode8
ltx/en_us_dedes/me.m01.d30:meMA.Ode5C3T.ode	@ltx/en_us_dedes/miscellanea:misc.Ode5
ltx/en_us_dedes/me.m01.d30:meMA.Ode5C3T.text	
ltx/en_us_dedes/me.m01.d30:meMA.Ode6C11.greekmelody	@ltx/en_us_dedes/he.h.m2:heHE.EnAvyssoPtaismaton.greekname
ltx/en_us_dedes/me.m01.d30:meMA.Ode6C11.incipit	O Lady, as I sail…
ltx/en_us_dedes/me.m01.d30:meMA.Ode6C11.melody	@ltx/en_us_dedes/he.h.m2:heHE.EnAvyssoPtaismaton.notmetered
ltx/en_us_dedes/me.m01.d30:meMA.Ode6C11.mode	@ltx/en_us_dedes/miscellanea:misc.Mode2
ltx/en_us_dedes/me.m01.d30:meMA.Ode6C11.ode	@ltx/en_us_dedes/miscellanea:misc.Ode6
ltx/en_us_dedes/me.m01.d30:meMA.Ode6C11.text	O Lady, as I sail on the ocean of life’s many cares, I know you to be the harbor of salvation. I call on you to be the pilot of my soul.
ltx/en_us_dedes/me.m01.d30:meMA.Ode6C12.incipit	Ever-virgin Mother, I am injured…
ltx/en_us_dedes/me.m01.d30:meMA.Ode6C12.melody	@ltx/en_us_dedes/he.h.m2:heHE.EnAvyssoPtaismaton.notmetered
ltx/en_us_dedes/me.m01.d30:meMA.Ode6C12.mode	@ltx/en_us_dedes/miscellanea:misc.Mode2
ltx/en_us_dedes/me.m01.d30:meMA.Ode6C12.ode	@ltx/en_us_dedes/miscellanea:misc.Ode6
ltx/en_us_dedes/me.m01.d30:meMA.Ode6C12.text	Ever-virgin Mother, I am injured and dressed in the garment of my foolishness. I pray you, who gave birth to God, give me instead the robe of joy.
ltx/en_us_dedes/me.m01.d30:meMA.Ode6C13.incipit	Wretched that I am, I…
ltx/en_us_dedes/me.m01.d30:meMA.Ode6C13.melody	@ltx/en_us_dedes/he.h.m2:heHE.EnAvyssoPtaismaton.notmetered
ltx/en_us_dedes/me.m01.d30:meMA.Ode6C13.mode	@ltx/en_us_dedes/miscellanea:misc.Mode2
ltx/en_us_dedes/me.m01.d30:meMA.Ode6C13.ode	@ltx/en_us_dedes/miscellanea:misc.Ode6
ltx/en_us_dedes/me.m01.d30:meMA.Ode6C13.text	Wretched that I am, I have fallen from the sacred way of life, because of laziness. O blessed Virgin, I pray you restore me, and regulate my life according to your Son’s commands.
ltx/en_us_dedes/me.m01.d30:meMA.Ode6C14.incipit	Count me worthy of sympathy…
ltx/en_us_dedes/me.m01.d30:meMA.Ode6C14.melody	@ltx/en_us_dedes/he.h.m2:heHE.EnAvyssoPtaismaton.notmetered
ltx/en_us_dedes/me.m01.d30:meMA.Ode6C14.mode	@ltx/en_us_dedes/miscellanea:misc.Mode2
ltx/en_us_dedes/me.m01.d30:meMA.Ode6C14.ode	@ltx/en_us_dedes/miscellanea:misc.Ode6
ltx/en_us_dedes/me.m01.d30:meMA.Ode6C14.text	Count me worthy of sympathy, O Lady, who gave birth to the most sympathetic Logos, who delivered humanity from corruption with His own blood.
ltx/en_us_dedes/me.m01.d30:meMA.Ode6C1H.greekmelody	@ltx/en_us_dedes/he.h.m2:heHE.EnAvyssoPtaismaton.greekname
ltx/en_us_dedes/me.m01.d30:meMA.Ode6C1H.incipit	@ltx/en_us_dedes/he.h.m2:heHE.EnAvyssoPtaismaton.incipit
ltx/en_us_dedes/me.m01.d30:meMA.Ode6C1H.melody	@ltx/en_us_dedes/he.h.m2:heHE.EnAvyssoPtaismaton.melody
ltx/en_us_dedes/me.m01.d30:meMA.Ode6C1H.mode	@ltx/en_us_dedes/miscellanea:misc.Mode2
ltx/en_us_dedes/me.m01.d30:meMA.Ode6C1H.ode	@ltx/en_us_dedes/miscellanea:misc.Ode6
ltx/en_us_dedes/me.m01.d30:meMA.Ode6C1H.text	@ltx/en_us_dedes/he.h.m2:heHE.EnAvyssoPtaismaton.text
ltx/en_us_dedes/me.m01.d30:meMA.Ode6C21.greekmelody	@ltx/en_us_dedes/he.h.m2:heHE.AvyssosAmartimaton.greekname
ltx/en_us_dedes/me.m01.d30:meMA.Ode6C21.incipit	…
ltx/en_us_dedes/me.m01.d30:meMA.Ode6C21.melody	@ltx/en_us_dedes/he.h.m2:heHE.AvyssosAmartimaton.name
ltx/en_us_dedes/me.m01.d30:meMA.Ode6C21.mode	@ltx/en_us_dedes/miscellanea:misc.Mode2
ltx/en_us_dedes/me.m01.d30:meMA.Ode6C21.ode	@ltx/en_us_dedes/miscellanea:misc.Ode6
ltx/en_us_dedes/me.m01.d30:meMA.Ode6C21.text	
ltx/en_us_dedes/me.m01.d30:meMA.Ode6C22.incipit	…
ltx/en_us_dedes/me.m01.d30:meMA.Ode6C22.melody	@ltx/en_us_dedes/he.h.m2:heHE.AvyssosAmartimaton.name
ltx/en_us_dedes/me.m01.d30:meMA.Ode6C22.mode	@ltx/en_us_dedes/miscellanea:misc.Mode2
ltx/en_us_dedes/me.m01.d30:meMA.Ode6C22.ode	@ltx/en_us_dedes/miscellanea:misc.Ode6
ltx/en_us_dedes/me.m01.d30:meMA.Ode6C22.text	
ltx/en_us_dedes/me.m01.d30:meMA.Ode6C23.incipit	…
ltx/en_us_dedes/me.m01.d30:meMA.Ode6C23.melody	@ltx/en_us_dedes/he.h.m2:heHE.AvyssosAmartimaton.name
ltx/en_us_dedes/me.m01.d30:meMA.Ode6C23.mode	@ltx/en_us_dedes/miscellanea:misc.Mode2
ltx/en_us_dedes/me.m01.d30:meMA.Ode6C23.ode	@ltx/en_us_dedes/miscellanea:misc.Ode6
ltx/en_us_dedes/me.m01.d30:meMA.Ode6C23.text	
ltx/en_us_dedes/me.m01.d30:meMA.Ode6C2T.incipit	…
ltx/en_us_dedes/me.m01.d30:meMA.Ode6C2T.melody	@ltx/en_us_dedes/he.h.m2:heHE.AvyssosAmartimaton.name
ltx/en_us_dedes/me.m01.d30:meMA.Ode6C2T.mode	@ltx/en_us_dedes/miscellanea:misc.Mode2
ltx/en_us_dedes/me.m01.d30:meMA.Ode6C2T.ode	@ltx/en_us_dedes/miscellanea:misc.Ode6
ltx/en_us_dedes/me.m01.d30:meMA.Ode6C2T.text	
ltx/en_us_dedes/me.m01.d30:meMA.Ode6C31.greekmelody	@ltx/en_us_dedes/he.h.m8:heHE.IlasthitiMoiSotir.greekname
ltx/en_us_dedes/me.m01.d30:meMA.Ode6C31.incipit	…
ltx/en_us_dedes/me.m01.d30:meMA.Ode6C31.melody	@ltx/en_us_dedes/he.h.m8:heHE.IlasthitiMoiSotir.name
ltx/en_us_dedes/me.m01.d30:meMA.Ode6C31.mode	@ltx/en_us_dedes/miscellanea:misc.Mode8
ltx/en_us_dedes/me.m01.d30:meMA.Ode6C31.ode	@ltx/en_us_dedes/miscellanea:misc.Ode6
ltx/en_us_dedes/me.m01.d30:meMA.Ode6C31.text	
ltx/en_us_dedes/me.m01.d30:meMA.Ode6C32.incipit	…
ltx/en_us_dedes/me.m01.d30:meMA.Ode6C32.melody	@ltx/en_us_dedes/he.h.m8:heHE.IlasthitiMoiSotir.name
ltx/en_us_dedes/me.m01.d30:meMA.Ode6C32.mode	@ltx/en_us_dedes/miscellanea:misc.Mode8
ltx/en_us_dedes/me.m01.d30:meMA.Ode6C32.ode	@ltx/en_us_dedes/miscellanea:misc.Ode6
ltx/en_us_dedes/me.m01.d30:meMA.Ode6C32.text	
ltx/en_us_dedes/me.m01.d30:meMA.Ode6C33.incipit	…
ltx/en_us_dedes/me.m01.d30:meMA.Ode6C33.melody	@ltx/en_us_dedes/he.h.m8:heHE.IlasthitiMoiSotir.name
ltx/en_us_dedes/me.m01.d30:meMA.Ode6C33.mode	@ltx/en_us_dedes/miscellanea:misc.Mode8
ltx/en_us_dedes/me.m01.d30:meMA.Ode6C33.ode	@ltx/en_us_dedes/miscellanea:misc.Ode6
ltx/en_us_dedes/me.m01.d30:meMA.Ode6C33.text	
ltx/en_us_dedes/me.m01.d30:meMA.Ode6C3T.incipit	…
ltx/en_us_dedes/me.m01.d30:meMA.Ode6C3T.melody	@ltx/en_us_dedes/he.h.m8:heHE.IlasthitiMoiSotir.name
ltx/en_us_dedes/me.m01.d30:meMA.Ode6C3T.mode	@ltx/en_us_dedes/miscellanea:misc.Mode8
ltx/en_us_dedes/me.m01.d30:meMA.Ode6C3T.ode	@ltx/en_us_dedes/miscellanea:misc.Ode6
ltx/en_us_dedes/me.m01.d30:meMA.Ode6C3T.text	
ltx/en_us_dedes/me.m01.d30:meMA.Ode7C11.greekmelody	@ltx/en_us_dedes/he.h.m2:heHE.EikonosChrysis.greekname
ltx/en_us_dedes/me.m01.d30:meMA.Ode7C11.incipit	O Mother of God, your…
ltx/en_us_dedes/me.m01.d30:meMA.Ode7C11.melody	@ltx/en_us_dedes/he.h.m2:heHE.EikonosChrysis.notmetered
ltx/en_us_dedes/me.m01.d30:meMA.Ode7C11.mode	@ltx/en_us_dedes/miscellanea:misc.Mode2
ltx/en_us_dedes/me.m01.d30:meMA.Ode7C11.ode	@ltx/en_us_dedes/miscellanea:misc.Ode7
ltx/en_us_dedes/me.m01.d30:meMA.Ode7C11.text	O Mother of God, your Son who took flesh from you was nailed to the Cross, and He tore up the indictment against Adam. Insistently entreat Him now, O all-blameless Maiden, that from danger He deliver all who in faith cry out: Blessed are You, O God of our fathers.
ltx/en_us_dedes/me.m01.d30:meMA.Ode7C12.incipit	O Lady, you are the…
ltx/en_us_dedes/me.m01.d30:meMA.Ode7C12.melody	@ltx/en_us_dedes/he.h.m2:heHE.EikonosChrysis.notmetered
ltx/en_us_dedes/me.m01.d30:meMA.Ode7C12.mode	@ltx/en_us_dedes/miscellanea:misc.Mode2
ltx/en_us_dedes/me.m01.d30:meMA.Ode7C12.ode	@ltx/en_us_dedes/miscellanea:misc.Ode7
ltx/en_us_dedes/me.m01.d30:meMA.Ode7C12.text	O Lady, you are the good hope and expectation of the faithful. We now entreat you to grant the ocean of your sympathy to all trust you and who to your Son cry out: Blessed are You, O God of our fathers.
ltx/en_us_dedes/me.m01.d30:meMA.Ode7C13.incipit	There is no one who…
ltx/en_us_dedes/me.m01.d30:meMA.Ode7C13.melody	@ltx/en_us_dedes/he.h.m2:heHE.EikonosChrysis.notmetered
ltx/en_us_dedes/me.m01.d30:meMA.Ode7C13.mode	@ltx/en_us_dedes/miscellanea:misc.Mode2
ltx/en_us_dedes/me.m01.d30:meMA.Ode7C13.ode	@ltx/en_us_dedes/miscellanea:misc.Ode7
ltx/en_us_dedes/me.m01.d30:meMA.Ode7C13.text	There is no one who will sympathize or commiserate with me, who am distressed by the awful darkness of life. O Virgin, with your splendor dispel the fog of my offenses and shine on me as I sing: Blessed are You, O God of our fathers.
ltx/en_us_dedes/me.m01.d30:meMA.Ode7C14.incipit	From carelessness, I the wretch…
ltx/en_us_dedes/me.m01.d30:meMA.Ode7C14.melody	@ltx/en_us_dedes/he.h.m2:heHE.EikonosChrysis.notmetered
ltx/en_us_dedes/me.m01.d30:meMA.Ode7C14.mode	@ltx/en_us_dedes/miscellanea:misc.Mode2
ltx/en_us_dedes/me.m01.d30:meMA.Ode7C14.ode	@ltx/en_us_dedes/miscellanea:misc.Ode7
ltx/en_us_dedes/me.m01.d30:meMA.Ode7C14.text	From carelessness, I the wretch have stained the lovely garment of the saving commandments that I was clothed in through Baptism. Now, O Virgin, I run to you, praying that through you I might again put on the robe of virtue.
ltx/en_us_dedes/me.m01.d30:meMA.Ode7C15.incipit	Adam, who of old fell…
ltx/en_us_dedes/me.m01.d30:meMA.Ode7C15.melody	@ltx/en_us_dedes/he.h.m2:heHE.EikonosChrysis.notmetered
ltx/en_us_dedes/me.m01.d30:meMA.Ode7C15.mode	@ltx/en_us_dedes/miscellanea:misc.Mode2
ltx/en_us_dedes/me.m01.d30:meMA.Ode7C15.ode	@ltx/en_us_dedes/miscellanea:misc.Ode7
ltx/en_us_dedes/me.m01.d30:meMA.Ode7C15.text	Adam, who of old fell from deathless life, has been saved. Now, all-pure Maiden, by virtue of your childbirth, save me who am held down by illness, and make me healthy, and count me worthy to sing to you: Blessed are you, who gave birth to God in the flesh.
ltx/en_us_dedes/me.m01.d30:meMA.Ode7C1H.greekmelody	@ltx/en_us_dedes/he.h.m2:heHE.EikonosChrysis.greekname
ltx/en_us_dedes/me.m01.d30:meMA.Ode7C1H.incipit	@ltx/en_us_dedes/he.h.m2:heHE.EikonosChrysis.incipit
ltx/en_us_dedes/me.m01.d30:meMA.Ode7C1H.melody	@ltx/en_us_dedes/he.h.m2:heHE.EikonosChrysis.melody
ltx/en_us_dedes/me.m01.d30:meMA.Ode7C1H.mode	@ltx/en_us_dedes/miscellanea:misc.Mode2
ltx/en_us_dedes/me.m01.d30:meMA.Ode7C1H.ode	@ltx/en_us_dedes/miscellanea:misc.Ode7
ltx/en_us_dedes/me.m01.d30:meMA.Ode7C1H.text	@ltx/en_us_dedes/he.h.m2:heHE.EikonosChrysis.text
ltx/en_us_dedes/me.m01.d30:meMA.Ode7C21.greekmelody	@ltx/en_us_dedes/he.h.m2:heHE.AntitheonProstagma.greekname
ltx/en_us_dedes/me.m01.d30:meMA.Ode7C21.incipit	…
ltx/en_us_dedes/me.m01.d30:meMA.Ode7C21.melody	@ltx/en_us_dedes/he.h.m2:heHE.AntitheonProstagma.name
ltx/en_us_dedes/me.m01.d30:meMA.Ode7C21.mode	@ltx/en_us_dedes/miscellanea:misc.Mode2
ltx/en_us_dedes/me.m01.d30:meMA.Ode7C21.ode	@ltx/en_us_dedes/miscellanea:misc.Ode7
ltx/en_us_dedes/me.m01.d30:meMA.Ode7C21.text	
ltx/en_us_dedes/me.m01.d30:meMA.Ode7C22.incipit	…
ltx/en_us_dedes/me.m01.d30:meMA.Ode7C22.melody	@ltx/en_us_dedes/he.h.m2:heHE.AntitheonProstagma.name
ltx/en_us_dedes/me.m01.d30:meMA.Ode7C22.mode	@ltx/en_us_dedes/miscellanea:misc.Mode2
ltx/en_us_dedes/me.m01.d30:meMA.Ode7C22.ode	@ltx/en_us_dedes/miscellanea:misc.Ode7
ltx/en_us_dedes/me.m01.d30:meMA.Ode7C22.text	
ltx/en_us_dedes/me.m01.d30:meMA.Ode7C2T.incipit	…
ltx/en_us_dedes/me.m01.d30:meMA.Ode7C2T.melody	@ltx/en_us_dedes/he.h.m2:heHE.AntitheonProstagma.name
ltx/en_us_dedes/me.m01.d30:meMA.Ode7C2T.mode	@ltx/en_us_dedes/miscellanea:misc.Mode2
ltx/en_us_dedes/me.m01.d30:meMA.Ode7C2T.ode	@ltx/en_us_dedes/miscellanea:misc.Ode7
ltx/en_us_dedes/me.m01.d30:meMA.Ode7C2T.text	
ltx/en_us_dedes/me.m01.d30:meMA.Ode7C31.greekmelody	@ltx/en_us_dedes/he.h.m8:heHE.TheouSynkatavasin.greekname
ltx/en_us_dedes/me.m01.d30:meMA.Ode7C31.incipit	…
ltx/en_us_dedes/me.m01.d30:meMA.Ode7C31.melody	@ltx/en_us_dedes/he.h.m8:heHE.TheouSynkatavasin.name
ltx/en_us_dedes/me.m01.d30:meMA.Ode7C31.mode	@ltx/en_us_dedes/miscellanea:misc.Mode8
ltx/en_us_dedes/me.m01.d30:meMA.Ode7C31.ode	@ltx/en_us_dedes/miscellanea:misc.Ode7
ltx/en_us_dedes/me.m01.d30:meMA.Ode7C31.text	
ltx/en_us_dedes/me.m01.d30:meMA.Ode7C32.incipit	…
ltx/en_us_dedes/me.m01.d30:meMA.Ode7C32.melody	@ltx/en_us_dedes/he.h.m8:heHE.TheouSynkatavasin.name
ltx/en_us_dedes/me.m01.d30:meMA.Ode7C32.mode	@ltx/en_us_dedes/miscellanea:misc.Mode8
ltx/en_us_dedes/me.m01.d30:meMA.Ode7C32.ode	@ltx/en_us_dedes/miscellanea:misc.Ode7
ltx/en_us_dedes/me.m01.d30:meMA.Ode7C32.text	
ltx/en_us_dedes/me.m01.d30:meMA.Ode7C33.incipit	…
ltx/en_us_dedes/me.m01.d30:meMA.Ode7C33.melody	@ltx/en_us_dedes/he.h.m8:heHE.TheouSynkatavasin.name
ltx/en_us_dedes/me.m01.d30:meMA.Ode7C33.mode	@ltx/en_us_dedes/miscellanea:misc.Mode8
ltx/en_us_dedes/me.m01.d30:meMA.Ode7C33.ode	@ltx/en_us_dedes/miscellanea:misc.Ode7
ltx/en_us_dedes/me.m01.d30:meMA.Ode7C33.text	
ltx/en_us_dedes/me.m01.d30:meMA.Ode7C3T.incipit	…
ltx/en_us_dedes/me.m01.d30:meMA.Ode7C3T.melody	@ltx/en_us_dedes/he.h.m8:heHE.TheouSynkatavasin.name
ltx/en_us_dedes/me.m01.d30:meMA.Ode7C3T.mode	@ltx/en_us_dedes/miscellanea:misc.Mode8
ltx/en_us_dedes/me.m01.d30:meMA.Ode7C3T.ode	@ltx/en_us_dedes/miscellanea:misc.Ode7
ltx/en_us_dedes/me.m01.d30:meMA.Ode7C3T.text	
ltx/en_us_dedes/me.m01.d30:meMA.Ode8C11.greekmelody	@ltx/en_us_dedes/he.h.m2:heHE.TonEnKaminoTouPyros.greekname
ltx/en_us_dedes/me.m01.d30:meMA.Ode8C11.incipit	My mind is now weak…
ltx/en_us_dedes/me.m01.d30:meMA.Ode8C11.melody	@ltx/en_us_dedes/he.h.m2:heHE.TonEnKaminoTouPyros.notmetered
ltx/en_us_dedes/me.m01.d30:meMA.Ode8C11.mode	@ltx/en_us_dedes/miscellanea:misc.Mode2
ltx/en_us_dedes/me.m01.d30:meMA.Ode8C11.ode	@ltx/en_us_dedes/miscellanea:misc.Ode8
ltx/en_us_dedes/me.m01.d30:meMA.Ode8C11.text	My mind is now weak, for it has fallen into the depths of dishonor, and therefore I am surrounded by every vice. O Virgin, heal me, and wrap in the light of dispassion.
ltx/en_us_dedes/me.m01.d30:meMA.Ode8C12.incipit	Having you, all-pure Lady, as…
ltx/en_us_dedes/me.m01.d30:meMA.Ode8C12.melody	@ltx/en_us_dedes/he.h.m2:heHE.TonEnKaminoTouPyros.notmetered
ltx/en_us_dedes/me.m01.d30:meMA.Ode8C12.mode	@ltx/en_us_dedes/miscellanea:misc.Mode2
ltx/en_us_dedes/me.m01.d30:meMA.Ode8C12.ode	@ltx/en_us_dedes/miscellanea:misc.Ode8
ltx/en_us_dedes/me.m01.d30:meMA.Ode8C12.text	Having you, all-pure Lady, as a secure and mighty fortress, embankment and protection, we are in faith delivered now, as we extol your Son, and exalt Him beyond measure, unto all the ages.
ltx/en_us_dedes/me.m01.d30:meMA.Ode8C13.incipit	O Theotokos, we know you…
ltx/en_us_dedes/me.m01.d30:meMA.Ode8C13.melody	@ltx/en_us_dedes/he.h.m2:heHE.TonEnKaminoTouPyros.notmetered
ltx/en_us_dedes/me.m01.d30:meMA.Ode8C13.mode	@ltx/en_us_dedes/miscellanea:misc.Mode2
ltx/en_us_dedes/me.m01.d30:meMA.Ode8C13.ode	@ltx/en_us_dedes/miscellanea:misc.Ode8
ltx/en_us_dedes/me.m01.d30:meMA.Ode8C13.text	O Theotokos, we know you to be the sparkling well of immortality, for you gave birth to the Logos of the immortal Father, who delivered from death all who exalt Him beyond measure, unto all the ages.
ltx/en_us_dedes/me.m01.d30:meMA.Ode8C14.incipit	O pure and immaculate Virgin…
ltx/en_us_dedes/me.m01.d30:meMA.Ode8C14.melody	@ltx/en_us_dedes/he.h.m2:heHE.TonEnKaminoTouPyros.notmetered
ltx/en_us_dedes/me.m01.d30:meMA.Ode8C14.mode	@ltx/en_us_dedes/miscellanea:misc.Mode2
ltx/en_us_dedes/me.m01.d30:meMA.Ode8C14.ode	@ltx/en_us_dedes/miscellanea:misc.Ode8
ltx/en_us_dedes/me.m01.d30:meMA.Ode8C14.text	O pure and immaculate Virgin, you profusely pour out to us the faithful a stream of cures and healing. And now as we draw abundant grace from it, we extol your Son, and exalt Him beyond measure, unto all the ages.
ltx/en_us_dedes/me.m01.d30:meMA.Ode8C1H.greekmelody	@ltx/en_us_dedes/he.h.m2:heHE.TonEnKaminoTouPyros.greekname
ltx/en_us_dedes/me.m01.d30:meMA.Ode8C1H.incipit	@ltx/en_us_dedes/he.h.m2:heHE.TonEnKaminoTouPyros.incipit
ltx/en_us_dedes/me.m01.d30:meMA.Ode8C1H.melody	@ltx/en_us_dedes/he.h.m2:heHE.TonEnKaminoTouPyros.melody
ltx/en_us_dedes/me.m01.d30:meMA.Ode8C1H.mode	@ltx/en_us_dedes/miscellanea:misc.Mode2
ltx/en_us_dedes/me.m01.d30:meMA.Ode8C1H.ode	@ltx/en_us_dedes/miscellanea:misc.Ode8
ltx/en_us_dedes/me.m01.d30:meMA.Ode8C1H.text	@ltx/en_us_dedes/he.h.m2:heHE.TonEnKaminoTouPyros.text
ltx/en_us_dedes/me.m01.d30:meMA.Ode8C21.greekmelody	@ltx/en_us_dedes/he.h.m2:heHE.IndalmatosChrysou.greekname
ltx/en_us_dedes/me.m01.d30:meMA.Ode8C21.incipit	…
ltx/en_us_dedes/me.m01.d30:meMA.Ode8C21.melody	@ltx/en_us_dedes/he.h.m2:heHE.IndalmatosChrysou.name
ltx/en_us_dedes/me.m01.d30:meMA.Ode8C21.mode	@ltx/en_us_dedes/miscellanea:misc.Mode2
ltx/en_us_dedes/me.m01.d30:meMA.Ode8C21.ode	@ltx/en_us_dedes/miscellanea:misc.Ode8
ltx/en_us_dedes/me.m01.d30:meMA.Ode8C21.text	
ltx/en_us_dedes/me.m01.d30:meMA.Ode8C22.incipit	…
ltx/en_us_dedes/me.m01.d30:meMA.Ode8C22.melody	@ltx/en_us_dedes/he.h.m2:heHE.IndalmatosChrysou.name
ltx/en_us_dedes/me.m01.d30:meMA.Ode8C22.mode	@ltx/en_us_dedes/miscellanea:misc.Mode2
ltx/en_us_dedes/me.m01.d30:meMA.Ode8C22.ode	@ltx/en_us_dedes/miscellanea:misc.Ode8
ltx/en_us_dedes/me.m01.d30:meMA.Ode8C22.text	
ltx/en_us_dedes/me.m01.d30:meMA.Ode8C2T.incipit	…
ltx/en_us_dedes/me.m01.d30:meMA.Ode8C2T.melody	@ltx/en_us_dedes/he.h.m2:heHE.IndalmatosChrysou.name
ltx/en_us_dedes/me.m01.d30:meMA.Ode8C2T.mode	@ltx/en_us_dedes/miscellanea:misc.Mode2
ltx/en_us_dedes/me.m01.d30:meMA.Ode8C2T.ode	@ltx/en_us_dedes/miscellanea:misc.Ode8
ltx/en_us_dedes/me.m01.d30:meMA.Ode8C2T.text	
ltx/en_us_dedes/me.m01.d30:meMA.Ode8C31.greekmelody	@ltx/en_us_dedes/he.h.m8:heHE.EptaplasiosKaminon.greekname
ltx/en_us_dedes/me.m01.d30:meMA.Ode8C31.incipit	…
ltx/en_us_dedes/me.m01.d30:meMA.Ode8C31.melody	@ltx/en_us_dedes/he.h.m8:heHE.EptaplasiosKaminon.name
ltx/en_us_dedes/me.m01.d30:meMA.Ode8C31.mode	@ltx/en_us_dedes/miscellanea:misc.Mode8
ltx/en_us_dedes/me.m01.d30:meMA.Ode8C31.ode	@ltx/en_us_dedes/miscellanea:misc.Ode8
ltx/en_us_dedes/me.m01.d30:meMA.Ode8C31.text	
ltx/en_us_dedes/me.m01.d30:meMA.Ode8C32.incipit	…
ltx/en_us_dedes/me.m01.d30:meMA.Ode8C32.melody	@ltx/en_us_dedes/he.h.m8:heHE.EptaplasiosKaminon.name
ltx/en_us_dedes/me.m01.d30:meMA.Ode8C32.mode	@ltx/en_us_dedes/miscellanea:misc.Mode8
ltx/en_us_dedes/me.m01.d30:meMA.Ode8C32.ode	@ltx/en_us_dedes/miscellanea:misc.Ode8
ltx/en_us_dedes/me.m01.d30:meMA.Ode8C32.text	
ltx/en_us_dedes/me.m01.d30:meMA.Ode8C33.incipit	…
ltx/en_us_dedes/me.m01.d30:meMA.Ode8C33.melody	@ltx/en_us_dedes/he.h.m8:heHE.EptaplasiosKaminon.name
ltx/en_us_dedes/me.m01.d30:meMA.Ode8C33.mode	@ltx/en_us_dedes/miscellanea:misc.Mode8
ltx/en_us_dedes/me.m01.d30:meMA.Ode8C33.ode	@ltx/en_us_dedes/miscellanea:misc.Ode8
ltx/en_us_dedes/me.m01.d30:meMA.Ode8C33.text	
ltx/en_us_dedes/me.m01.d30:meMA.Ode8C3T.incipit	…
ltx/en_us_dedes/me.m01.d30:meMA.Ode8C3T.melody	@ltx/en_us_dedes/he.h.m8:heHE.EptaplasiosKaminon.name
ltx/en_us_dedes/me.m01.d30:meMA.Ode8C3T.mode	@ltx/en_us_dedes/miscellanea:misc.Mode8
ltx/en_us_dedes/me.m01.d30:meMA.Ode8C3T.ode	@ltx/en_us_dedes/miscellanea:misc.Ode8
ltx/en_us_dedes/me.m01.d30:meMA.Ode8C3T.text	
ltx/en_us_dedes/me.m01.d30:meMA.Ode9C11.greekmelody	@ltx/en_us_dedes/he.h.m2:heHE.TonEkTheouTheonLogon.greekname
ltx/en_us_dedes/me.m01.d30:meMA.Ode9C11.incipit	Divinely blest holy Maiden, *…
ltx/en_us_dedes/me.m01.d30:meMA.Ode9C11.melody	@ltx/en_us_dedes/he.h.m2:heHE.TonEkTheouTheonLogon.name
ltx/en_us_dedes/me.m01.d30:meMA.Ode9C11.mode	@ltx/en_us_dedes/miscellanea:misc.Mode2
ltx/en_us_dedes/me.m01.d30:meMA.Ode9C11.ode	@ltx/en_us_dedes/miscellanea:misc.Ode9
ltx/en_us_dedes/me.m01.d30:meMA.Ode9C11.text	Divinely blest holy Maiden, * I entrust my petitions * and all my hopes wholeheartedly to you. * Save me, O Mother of genuine life; * and make earnest entreaty * that I be filled with everlasting joy, * for with faith I extol you and longingly I magnify.
ltx/en_us_dedes/me.m01.d30:meMA.Ode9C12.incipit	By your appearance, O Virgin…
ltx/en_us_dedes/me.m01.d30:meMA.Ode9C12.melody	@ltx/en_us_dedes/he.h.m2:heHE.TonEkTheouTheonLogon.name
ltx/en_us_dedes/me.m01.d30:meMA.Ode9C12.mode	@ltx/en_us_dedes/miscellanea:misc.Mode2
ltx/en_us_dedes/me.m01.d30:meMA.Ode9C12.ode	@ltx/en_us_dedes/miscellanea:misc.Ode9
ltx/en_us_dedes/me.m01.d30:meMA.Ode9C12.text	By your appearance, O Virgin, * as the gate of divine light, * illuminate the darkness of my soul * with immaterial flashes of your light. * I entreat you, O Pure One, * to rescue me from everlasting fire, * for with faith I extol you and longingly I magnify.
ltx/en_us_dedes/me.m01.d30:meMA.Ode9C13.incipit	As you observe us in…
ltx/en_us_dedes/me.m01.d30:meMA.Ode9C13.melody	@ltx/en_us_dedes/he.h.m2:heHE.TonEkTheouTheonLogon.name
ltx/en_us_dedes/me.m01.d30:meMA.Ode9C13.mode	@ltx/en_us_dedes/miscellanea:misc.Mode2
ltx/en_us_dedes/me.m01.d30:meMA.Ode9C13.ode	@ltx/en_us_dedes/miscellanea:misc.Ode9
ltx/en_us_dedes/me.m01.d30:meMA.Ode9C13.text	As you observe us in sickness * of the soul and the body * and bedridden with painful suffering, * O Lady, being compassionate * grant the cure and release us * from sorry troubles now besetting us, * so that we may extol you unceasingly and magnify.
ltx/en_us_dedes/me.m01.d30:meMA.Ode9C14.incipit	Before the ages the Father…
ltx/en_us_dedes/me.m01.d30:meMA.Ode9C14.melody	@ltx/en_us_dedes/he.h.m2:heHE.TonEkTheouTheonLogon.name
ltx/en_us_dedes/me.m01.d30:meMA.Ode9C14.mode	@ltx/en_us_dedes/miscellanea:misc.Mode2
ltx/en_us_dedes/me.m01.d30:meMA.Ode9C14.ode	@ltx/en_us_dedes/miscellanea:misc.Ode9
ltx/en_us_dedes/me.m01.d30:meMA.Ode9C14.text	Before the ages the Father * from the womb did beget Him, * the Son who dwelt within your virgin womb * and has become truly perfect man. * O all-pure Theotokos, * he gave you as a fount of gifts for us * who with faith duly worship your ineffable childbirth.
ltx/en_us_dedes/me.m01.d30:meMA.Ode9C1H.greekmelody	@ltx/en_us_dedes/he.h.m2:heHE.TonEkTheouTheonLogon.greekname
ltx/en_us_dedes/me.m01.d30:meMA.Ode9C1H.incipit	@ltx/en_us_dedes/he.h.m2:heHE.TonEkTheouTheonLogon.incipit
ltx/en_us_dedes/me.m01.d30:meMA.Ode9C1H.melody	@ltx/en_us_dedes/he.h.m2:heHE.TonEkTheouTheonLogon.melody
ltx/en_us_dedes/me.m01.d30:meMA.Ode9C1H.mode	@ltx/en_us_dedes/miscellanea:misc.Mode2
ltx/en_us_dedes/me.m01.d30:meMA.Ode9C1H.ode	@ltx/en_us_dedes/miscellanea:misc.Ode9
ltx/en_us_dedes/me.m01.d30:meMA.Ode9C1H.text	@ltx/en_us_dedes/he.h.m2:heHE.TonEkTheouTheonLogon.text
ltx/en_us_dedes/me.m01.d30:meMA.Ode9C21.greekmelody	@ltx/en_us_dedes/he.h.m2:heHE.AnarchouGennitoros.greekname
ltx/en_us_dedes/me.m01.d30:meMA.Ode9C21.incipit	Since we are your rational…
ltx/en_us_dedes/me.m01.d30:meMA.Ode9C21.melody	@ltx/en_us_dedes/he.h.m2:heHE.AnarchouGennitoros.name
ltx/en_us_dedes/me.m01.d30:meMA.Ode9C21.mode	@ltx/en_us_dedes/miscellanea:misc.Mode2
ltx/en_us_dedes/me.m01.d30:meMA.Ode9C21.ode	@ltx/en_us_dedes/miscellanea:misc.Ode9
ltx/en_us_dedes/me.m01.d30:meMA.Ode9C21.text	Since we are your rational and veritable farm and flock, * for the sake of whom you in your life went to great pains, * behold, we assemble in one group * and we include the three of you together * and hold your sweet unity * as a reason for communal praise.
ltx/en_us_dedes/me.m01.d30:meMA.Ode9C22.incipit	Against those opposing her has…
ltx/en_us_dedes/me.m01.d30:meMA.Ode9C22.melody	@ltx/en_us_dedes/he.h.m2:heHE.AnarchouGennitoros.name
ltx/en_us_dedes/me.m01.d30:meMA.Ode9C22.mode	@ltx/en_us_dedes/miscellanea:misc.Mode2
ltx/en_us_dedes/me.m01.d30:meMA.Ode9C22.ode	@ltx/en_us_dedes/miscellanea:misc.Ode9
ltx/en_us_dedes/me.m01.d30:meMA.Ode9C22.text	Against those opposing her has grace pulled out her cutting sword * which has not merely two edges but indeed has three; * a single sword founded in heaven * and furnished with three sharp cutting edges, * it champions the Divinity * that shines with threefold radiance.
ltx/en_us_dedes/me.m01.d30:meMA.Ode9C23.incipit	O glorious Hierarchs, while wearing…
ltx/en_us_dedes/me.m01.d30:meMA.Ode9C23.melody	@ltx/en_us_dedes/he.h.m2:heHE.AnarchouGennitoros.name
ltx/en_us_dedes/me.m01.d30:meMA.Ode9C23.mode	@ltx/en_us_dedes/miscellanea:misc.Mode2
ltx/en_us_dedes/me.m01.d30:meMA.Ode9C23.ode	@ltx/en_us_dedes/miscellanea:misc.Ode9
ltx/en_us_dedes/me.m01.d30:meMA.Ode9C23.text	O glorious Hierarchs, while wearing your unspotted flesh, * yet your citizenship was in heaven all the same. * Genuinely dwelling therein now, * do intercede for us who are ruling, * that we set our minds on things * above and act accordingly.
ltx/en_us_dedes/me.m01.d30:meMA.Ode9C2M01.incipit	…
ltx/en_us_dedes/me.m01.d30:meMA.Ode9C2M01.text	O my soul, magnify those three great luminaries among the Church’s Hierarchs.
ltx/en_us_dedes/me.m01.d30:meMA.Ode9C2M02.incipit	…
ltx/en_us_dedes/me.m01.d30:meMA.Ode9C2M02.text	O my soul, magnify the threefold shining lights of the Church of Christ the true Light.
ltx/en_us_dedes/me.m01.d30:meMA.Ode9C2M03.incipit	…
ltx/en_us_dedes/me.m01.d30:meMA.Ode9C2M03.text	O my soul, magnify those men who put in order the Church of Christ the Master.
ltx/en_us_dedes/me.m01.d30:meMA.Ode9C2MTh.incipit	…
ltx/en_us_dedes/me.m01.d30:meMA.Ode9C2MTh.text	O my soul, magnify her who is greater in honor and in glory than the armies of heaven
ltx/en_us_dedes/me.m01.d30:meMA.Ode9C2T.incipit	The breadth of your mighty…
ltx/en_us_dedes/me.m01.d30:meMA.Ode9C2T.melody	@ltx/en_us_dedes/he.h.m2:heHE.AnarchouGennitoros.name
ltx/en_us_dedes/me.m01.d30:meMA.Ode9C2T.mode	@ltx/en_us_dedes/miscellanea:misc.Mode2
ltx/en_us_dedes/me.m01.d30:meMA.Ode9C2T.ode	@ltx/en_us_dedes/miscellanea:misc.Ode9
ltx/en_us_dedes/me.m01.d30:meMA.Ode9C2T.text	The breadth of your mighty deeds, O Lady, has confounded me, * suffocating the discourse beneath its density. * And it paradoxally happens * that I am at a loss in front of plenty. * And therefore we glorify the Lord who magnified you so.
ltx/en_us_dedes/me.m01.d30:meMA.Ode9C31.greekmelody	@ltx/en_us_dedes/he.h.m8:heHE.ExestiEpiTouto.greekname
ltx/en_us_dedes/me.m01.d30:meMA.Ode9C31.incipit	The virtue of the Trinity…
ltx/en_us_dedes/me.m01.d30:meMA.Ode9C31.melody	@ltx/en_us_dedes/he.h.m8:heHE.ExestiEpiTouto.name
ltx/en_us_dedes/me.m01.d30:meMA.Ode9C31.mode	@ltx/en_us_dedes/miscellanea:misc.Mode8
ltx/en_us_dedes/me.m01.d30:meMA.Ode9C31.ode	@ltx/en_us_dedes/miscellanea:misc.Ode9
ltx/en_us_dedes/me.m01.d30:meMA.Ode9C31.text	The virtue of the Trinity is upraised; * it has filled with its glory the universe, for unto us * it has brightly shone forth another light * of threefold splendor like its own * effulgence, the heavenly mystagogues. * Through them we who are pious * and Orthodox are guided * to contemplation of the Trinity.
ltx/en_us_dedes/me.m01.d30:meMA.Ode9C32.incipit	There is no second best…
ltx/en_us_dedes/me.m01.d30:meMA.Ode9C32.melody	@ltx/en_us_dedes/he.h.m8:heHE.ExestiEpiTouto.name
ltx/en_us_dedes/me.m01.d30:meMA.Ode9C32.mode	@ltx/en_us_dedes/miscellanea:misc.Mode8
ltx/en_us_dedes/me.m01.d30:meMA.Ode9C32.ode	@ltx/en_us_dedes/miscellanea:misc.Ode9
ltx/en_us_dedes/me.m01.d30:meMA.Ode9C32.text	There is no second best in these sacred three. * Each is thought to be foremost in precedence and to prevail * over his corrivals of equal rank. * But rather each with joy has made * his own the success of the other two. * There is no room among them * to envy one another * and thus destroy their unanimity.
ltx/en_us_dedes/me.m01.d30:meMA.Ode9C3M01.incipit	…
ltx/en_us_dedes/me.m01.d30:meMA.Ode9C3M01.text	O my soul, magnify the three holy Shepherds of the all-holy Trinity.
ltx/en_us_dedes/me.m01.d30:meMA.Ode9C3M02.incipit	…
ltx/en_us_dedes/me.m01.d30:meMA.Ode9C3M02.text	O my soul, magnify the three great Luminaries from the tri-solar Godhead.
ltx/en_us_dedes/me.m01.d30:meMA.Ode9C3MTh.incipit	@ltx/en_us_dedes/me.m01.d01:meMA.Ode9C1M01.incipit
ltx/en_us_dedes/me.m01.d30:meMA.Ode9C3MTh.text	@ltx/en_us_dedes/me.m01.d01:meMA.Ode9C1M01.text
ltx/en_us_dedes/me.m01.d30:meMA.Ode9C3MTr.incipit	@ltx/en_us_dedes/me.m01.d01:meMA.Ode9C2MTr.incipit
ltx/en_us_dedes/me.m01.d30:meMA.Ode9C3MTr.text	@ltx/en_us_dedes/me.m01.d01:meMA.Ode9C2MTr.text
ltx/en_us_dedes/me.m01.d30:meMA.Ode9C3T.incipit	The summit of the wise…
ltx/en_us_dedes/me.m01.d30:meMA.Ode9C3T.melody	@ltx/en_us_dedes/he.h.m8:heHE.ExestiEpiTouto.name
ltx/en_us_dedes/me.m01.d30:meMA.Ode9C3T.mode	@ltx/en_us_dedes/miscellanea:misc.Mode8
ltx/en_us_dedes/me.m01.d30:meMA.Ode9C3T.ode	@ltx/en_us_dedes/miscellanea:misc.Ode9
ltx/en_us_dedes/me.m01.d30:meMA.Ode9C3T.text	The summit of the wise Teachers of the Church * clearly preached that your Son is the Son of the living God. * Their initiation into this truth * was by a revelation from * the eternal Father, not flesh and blood. * They taught that you, a Virgin, * were nonetheless a Mother * and Theotokos; whom they magnified.
ltx/en_us_dedes/me.m01.d30:meMA.Ode9C3Tr.incipit	Orthodoxy has brought forth her…
ltx/en_us_dedes/me.m01.d30:meMA.Ode9C3Tr.melody	@ltx/en_us_dedes/he.h.m8:heHE.ExestiEpiTouto.name
ltx/en_us_dedes/me.m01.d30:meMA.Ode9C3Tr.mode	@ltx/en_us_dedes/miscellanea:misc.Mode8
ltx/en_us_dedes/me.m01.d30:meMA.Ode9C3Tr.ode	@ltx/en_us_dedes/miscellanea:misc.Ode9
ltx/en_us_dedes/me.m01.d30:meMA.Ode9C3Tr.text	Orthodoxy has brought forth her firstborn sons, * namely these holy Fathers, through whom she now is giving birth * unto her legitimate undefiled * children who are perfected by * the Spirit who spoke in them of true life. * And now she is entreating * that peace endure forever, * since she received it as their legacy.
ltx/en_us_dedes/me.m01.d30:meMA.Oikos1.text	Who is fit to open his lips and move his tongue to speak about these men who breathed fire in the power of Word and Spirit? Yet I will dare to say this much, that these three men excelled beyond all human nature in their many and great spiritual gifts, and in the active life as well as in contemplation they surpassed even those who have proved illustrious in both. Therefore You counted them worthy of the greatest gifts, since they were Your faithful servants; for only You glorify Your Saints.
ltx/en_us_dedes/me.m01.d30:meMA.PostGospelBoth.incipit	@ltx/en_us_dedes/ho.ho03:hoMA.PostGospelTheotokos.incipit
ltx/en_us_dedes/me.m01.d30:meMA.PostGospelBoth.melody	
ltx/en_us_dedes/me.m01.d30:meMA.PostGospelBoth.mode	@ltx/en_us_dedes/miscellanea:misc.Mode2
ltx/en_us_dedes/me.m01.d30:meMA.PostGospelBoth.text	@ltx/en_us_dedes/ho.ho03:hoMA.PostGospelTheotokos.text
ltx/en_us_dedes/me.m01.d30:meMA.PostGospelGlory.incipit	@ltx/en_us_dedes/ho.ho03:hoMA.PostGospelTeachers.incipit
ltx/en_us_dedes/me.m01.d30:meMA.PostGospelGlory.melody	
ltx/en_us_dedes/me.m01.d30:meMA.PostGospelGlory.mode	@ltx/en_us_dedes/miscellanea:misc.Mode2
ltx/en_us_dedes/me.m01.d30:meMA.PostGospelGlory.text	@ltx/en_us_dedes/ho.ho03:hoMA.PostGospelTeachers.text
ltx/en_us_dedes/me.m01.d30:meMA.PostGospelIdiomelon.incipit	@ltx/en_us_dedes/me.m01.d18:meMA.PostGospelIdiomelon.incipit
ltx/en_us_dedes/me.m01.d30:meMA.PostGospelIdiomelon.melody	
ltx/en_us_dedes/me.m01.d30:meMA.PostGospelIdiomelon.mode	@ltx/en_us_dedes/miscellanea:misc.Mode6
ltx/en_us_dedes/me.m01.d30:meMA.PostGospelIdiomelon.text	@ltx/en_us_dedes/me.m01.d18:meMA.PostGospelIdiomelon.text
ltx/en_us_dedes/me.m01.d30:meSV.AposBoth.incipit	@ltx/en_us_dedes/oc.m6.d3:ocMA.AposTheotokion.incipit
ltx/en_us_dedes/me.m01.d30:meSV.AposBoth.melody	
ltx/en_us_dedes/me.m01.d30:meSV.AposBoth.mode	@ltx/en_us_dedes/miscellanea:misc.Mode6
ltx/en_us_dedes/me.m01.d30:meSV.AposBoth.text	@ltx/en_us_dedes/oc.m6.d3:ocMA.AposTheotokion.text
ltx/en_us_dedes/me.m01.d30:meSV.AposGlory.incipit	…
ltx/en_us_dedes/me.m01.d30:meSV.AposGlory.melody	
ltx/en_us_dedes/me.m01.d30:meSV.AposGlory.mode	@ltx/en_us_dedes/miscellanea:misc.Mode6
ltx/en_us_dedes/me.m01.d30:meSV.AposGlory.text	
ltx/en_us_dedes/me.m01.d30:meSV.Aposticha1.incipit	…
ltx/en_us_dedes/me.m01.d30:meSV.Aposticha1.melody	@ltx/en_us_dedes/he.a.m6:heAU.TriimerosAnestis.name
ltx/en_us_dedes/me.m01.d30:meSV.Aposticha1.mode	@ltx/en_us_dedes/miscellanea:misc.Mode6
ltx/en_us_dedes/me.m01.d30:meSV.Aposticha1.text	
ltx/en_us_dedes/me.m01.d30:meSV.Aposticha2.incipit	…
ltx/en_us_dedes/me.m01.d30:meSV.Aposticha2.melody	@ltx/en_us_dedes/he.a.m6:heAU.TriimerosAnestis.name
ltx/en_us_dedes/me.m01.d30:meSV.Aposticha2.mode	@ltx/en_us_dedes/miscellanea:misc.Mode6
ltx/en_us_dedes/me.m01.d30:meSV.Aposticha2.text	
ltx/en_us_dedes/me.m01.d30:meSV.Aposticha3.incipit	…
ltx/en_us_dedes/me.m01.d30:meSV.Aposticha3.melody	@ltx/en_us_dedes/he.a.m6:heAU.TriimerosAnestis.name
ltx/en_us_dedes/me.m01.d30:meSV.Aposticha3.mode	@ltx/en_us_dedes/miscellanea:misc.Mode6
ltx/en_us_dedes/me.m01.d30:meSV.Aposticha3.text	
ltx/en_us_dedes/me.m01.d30:meSV.SticBoth.incipit	@ltx/en_us_dedes/he.o:heOT.TheotokeSyEi.incipit
ltx/en_us_dedes/me.m01.d30:meSV.SticBoth.melody	@ltx/en_us_dedes/he.o:heOT.TheotokeSyEi.name
ltx/en_us_dedes/me.m01.d30:meSV.SticBoth.mode	@ltx/en_us_dedes/miscellanea:misc.Mode6
ltx/en_us_dedes/me.m01.d30:meSV.SticBoth.text	@ltx/en_us_dedes/he.o:heOT.TheotokeSyEiDidaskalon.text
ltx/en_us_dedes/me.m01.d30:meSV.SticGlory.incipit	…
ltx/en_us_dedes/me.m01.d30:meSV.SticGlory.melody	
ltx/en_us_dedes/me.m01.d30:meSV.SticGlory.mode	@ltx/en_us_dedes/miscellanea:misc.Mode6
ltx/en_us_dedes/me.m01.d30:meSV.SticGlory.text	
ltx/en_us_dedes/me.m01.d30:meSV.Stichera1.incipit	…
ltx/en_us_dedes/me.m01.d30:meSV.Stichera1.melody	@ltx/en_us_dedes/he.a.m4:heAU.OsGennaionEnMartysi.name
ltx/en_us_dedes/me.m01.d30:meSV.Stichera1.mode	@ltx/en_us_dedes/miscellanea:misc.Mode4
ltx/en_us_dedes/me.m01.d30:meSV.Stichera1.text	
ltx/en_us_dedes/me.m01.d30:meSV.Stichera2.incipit	…
ltx/en_us_dedes/me.m01.d30:meSV.Stichera2.melody	@ltx/en_us_dedes/he.a.m4:heAU.OsGennaionEnMartysi.name
ltx/en_us_dedes/me.m01.d30:meSV.Stichera2.mode	@ltx/en_us_dedes/miscellanea:misc.Mode4
ltx/en_us_dedes/me.m01.d30:meSV.Stichera2.text	
ltx/en_us_dedes/me.m01.d30:meSV.Stichera3.incipit	…
ltx/en_us_dedes/me.m01.d30:meSV.Stichera3.melody	@ltx/en_us_dedes/he.a.m4:heAU.OsGennaionEnMartysi.name
ltx/en_us_dedes/me.m01.d30:meSV.Stichera3.mode	@ltx/en_us_dedes/miscellanea:misc.Mode4
ltx/en_us_dedes/me.m01.d30:meSV.Stichera3.text	
ltx/en_us_dedes/me.m01.d30:meSV.Stichera4.incipit	…
ltx/en_us_dedes/me.m01.d30:meSV.Stichera4.melody	@ltx/en_us_dedes/he.a.m4:heAU.OsGennaionEnMartysi.name
ltx/en_us_dedes/me.m01.d30:meSV.Stichera4.mode	@ltx/en_us_dedes/miscellanea:misc.Mode4
ltx/en_us_dedes/me.m01.d30:meSV.Stichera4.text	
ltx/en_us_dedes/me.m01.d30:meVE.Apolytikion1.incipit	Those three magnificent…
ltx/en_us_dedes/me.m01.d30:meVE.Apolytikion1.melody	
ltx/en_us_dedes/me.m01.d30:meVE.Apolytikion1.mode	@ltx/en_us_dedes/miscellanea:misc.Mode1
ltx/en_us_dedes/me.m01.d30:meVE.Apolytikion1.text	Those three magnificent luminaries of the tri-solar Godhead, who lit up the whole world with rays of divine doctrines; those mellifluent rivers of wisdom, who irrigated all creation with the waters of the knowledge of God; Basil the Great, and Gregory the Theologian, and the illustrious John, whose tongue produced golden words! Let all of us who are enamored of their words come together and sing hymns to honor them. For they are ever interceding with the Trinity on our behalf.
ltx/en_us_dedes/me.m01.d30:meVE.Apolytikion2.incipit	As like-mannered to the Apostles…
ltx/en_us_dedes/me.m01.d30:meVE.Apolytikion2.melody	
ltx/en_us_dedes/me.m01.d30:meVE.Apolytikion2.mode	@ltx/en_us_dedes/miscellanea:misc.Mode4
ltx/en_us_dedes/me.m01.d30:meVE.Apolytikion2.text	As like-mannered to the Apostles and Teachers of the Christian world, intercede with the Master of all, to grant peace to the whole world, and great mercy to our souls.
ltx/en_us_dedes/me.m01.d30:meVE.AposBoth.incipit	@ltx/en_us_dedes/me.m12.d06:meMA.LaudsTheotokion.incipit
ltx/en_us_dedes/me.m01.d30:meVE.AposBoth.melody	
ltx/en_us_dedes/me.m01.d30:meVE.AposBoth.mode	@ltx/en_us_dedes/miscellanea:misc.Mode5
ltx/en_us_dedes/me.m01.d30:meVE.AposBoth.poet	@ltx/en_us_dedes/poets:po.GermanouPatriarchou
ltx/en_us_dedes/me.m01.d30:meVE.AposBoth.text	@ltx/en_us_dedes/me.m12.d06:meMA.LaudsTheotokion.text
ltx/en_us_dedes/me.m01.d30:meVE.AposGlory.incipit	Let us sound the trumpet…
ltx/en_us_dedes/me.m01.d30:meVE.AposGlory.melody	
ltx/en_us_dedes/me.m01.d30:meVE.AposGlory.mode	@ltx/en_us_dedes/miscellanea:misc.Mode5
ltx/en_us_dedes/me.m01.d30:meVE.AposGlory.text	Let us sound the trumpet with the clarion of song, and festively let us leap for joy, and exultantly let us join chorus for the annual celebration of the God-bearing Teachers. Let the kings and princes run to gather together, and with hymns let us extol the Three Hierarchs, who were like three massive rivers, mellifluous and perennial, cascading with the Spirit’s doctrines. O Shepherds and Teachers, let us come together and praise those three sacred mystics of the Holy Trinity. O philosophers, praise them who were wise; O priests, praise the pastors; and sinners, our defenders; you paupers, those who make you rich; you in tribulation, your consolation; your fellow travelers, you who travel; your pilots, you who fly and sail the seas. And everyone, extol them who anticipate everywhere, the most godly Hierarchs. And in lauding them, let us say to them, “All-holy Teachers, quickly come and deliver the faithful from the scandals of this life, and rescue us from everlasting punishment.”
ltx/en_us_dedes/me.m01.d30:meVE.AposTheotokion.incipit	@ltx/en_us_dedes/oc.m5.d3:ocVE.AposTheotokion.incipit
ltx/en_us_dedes/me.m01.d30:meVE.AposTheotokion.melody	
ltx/en_us_dedes/me.m01.d30:meVE.AposTheotokion.mode	@ltx/en_us_dedes/miscellanea:misc.Mode5
ltx/en_us_dedes/me.m01.d30:meVE.AposTheotokion.text	@ltx/en_us_dedes/oc.m5.d3:ocVE.AposTheotokion.text
ltx/en_us_dedes/me.m01.d30:meVE.Aposticha1.greekmelody	@ltx/en_us_dedes/he.a.m5:heAU.ChairoisAskitikon.greekname
ltx/en_us_dedes/me.m01.d30:meVE.Aposticha1.incipit	…
ltx/en_us_dedes/me.m01.d30:meVE.Aposticha1.melody	@ltx/en_us_dedes/he.a.m5:heAU.ChairoisAskitikon.name
ltx/en_us_dedes/me.m01.d30:meVE.Aposticha1.mode	@ltx/en_us_dedes/miscellanea:misc.Mode5
ltx/en_us_dedes/me.m01.d30:meVE.Aposticha1.poet	@ltx/en_us_dedes/poets:po.NeilouTouXanthopoulou
ltx/en_us_dedes/me.m01.d30:meVE.Aposticha1.text	
ltx/en_us_dedes/me.m01.d30:meVE.Aposticha2.incipit	…
ltx/en_us_dedes/me.m01.d30:meVE.Aposticha2.melody	@ltx/en_us_dedes/he.a.m5:heAU.ChairoisAskitikon.name
ltx/en_us_dedes/me.m01.d30:meVE.Aposticha2.mode	@ltx/en_us_dedes/miscellanea:misc.Mode5
ltx/en_us_dedes/me.m01.d30:meVE.Aposticha2.text	
ltx/en_us_dedes/me.m01.d30:meVE.Aposticha3.incipit	…
ltx/en_us_dedes/me.m01.d30:meVE.Aposticha3.melody	@ltx/en_us_dedes/he.a.m5:heAU.ChairoisAskitikon.name
ltx/en_us_dedes/me.m01.d30:meVE.Aposticha3.mode	@ltx/en_us_dedes/miscellanea:misc.Mode5
ltx/en_us_dedes/me.m01.d30:meVE.Aposticha3.text	
ltx/en_us_dedes/me.m01.d30:meVE.Lity1.incipit	…
ltx/en_us_dedes/me.m01.d30:meVE.Lity1.melody	
ltx/en_us_dedes/me.m01.d30:meVE.Lity1.mode	@ltx/en_us_dedes/miscellanea:misc.Mode2
ltx/en_us_dedes/me.m01.d30:meVE.Lity1.poet	@ltx/en_us_dedes/poets:po.NeilouTouXanthopoulou
ltx/en_us_dedes/me.m01.d30:meVE.Lity1.text	
ltx/en_us_dedes/me.m01.d30:meVE.Lity2.incipit	…
ltx/en_us_dedes/me.m01.d30:meVE.Lity2.melody	
ltx/en_us_dedes/me.m01.d30:meVE.Lity2.mode	@ltx/en_us_dedes/miscellanea:misc.Mode2
ltx/en_us_dedes/me.m01.d30:meVE.Lity2.text	
ltx/en_us_dedes/me.m01.d30:meVE.Lity3.incipit	…
ltx/en_us_dedes/me.m01.d30:meVE.Lity3.melody	
ltx/en_us_dedes/me.m01.d30:meVE.Lity3.mode	@ltx/en_us_dedes/miscellanea:misc.Mode6
ltx/en_us_dedes/me.m01.d30:meVE.Lity3.text	
ltx/en_us_dedes/me.m01.d30:meVE.Lity4.incipit	…
ltx/en_us_dedes/me.m01.d30:meVE.Lity4.melody	
ltx/en_us_dedes/me.m01.d30:meVE.Lity4.mode	@ltx/en_us_dedes/miscellanea:misc.Mode8
ltx/en_us_dedes/me.m01.d30:meVE.Lity4.text	
ltx/en_us_dedes/me.m01.d30:meVE.Lity5.incipit	…
ltx/en_us_dedes/me.m01.d30:meVE.Lity5.melody	
ltx/en_us_dedes/me.m01.d30:meVE.Lity5.mode	@ltx/en_us_dedes/miscellanea:misc.Mode6
ltx/en_us_dedes/me.m01.d30:meVE.Lity5.text	
ltx/en_us_dedes/me.m01.d30:meVE.LityBoth.incipit	…
ltx/en_us_dedes/me.m01.d30:meVE.LityBoth.melody	
ltx/en_us_dedes/me.m01.d30:meVE.LityBoth.mode	@ltx/en_us_dedes/miscellanea:misc.Mode6
ltx/en_us_dedes/me.m01.d30:meVE.LityBoth.text	
ltx/en_us_dedes/me.m01.d30:meVE.LityGlory.incipit	…
ltx/en_us_dedes/me.m01.d30:meVE.LityGlory.melody	
ltx/en_us_dedes/me.m01.d30:meVE.LityGlory.mode	@ltx/en_us_dedes/miscellanea:misc.Mode6
ltx/en_us_dedes/me.m01.d30:meVE.LityGlory.text	
ltx/en_us_dedes/me.m01.d30:meVE.SticGlory.incipit	@ltx/en_us_dedes/me.m10.dHF:meVE.SticGlory.incipit
ltx/en_us_dedes/me.m01.d30:meVE.SticGlory.melody	
ltx/en_us_dedes/me.m01.d30:meVE.SticGlory.mode	@ltx/en_us_dedes/miscellanea:misc.Mode6
ltx/en_us_dedes/me.m01.d30:meVE.SticGlory.poet	@ltx/en_us_dedes/poets:po.GeorgiouNikomideias
ltx/en_us_dedes/me.m01.d30:meVE.SticGlory.text	@ltx/en_us_dedes/me.m10.dHF:meVE.SticGlory.text
ltx/en_us_dedes/me.m01.d30:meVE.SticTheotokion.incipit	@ltx/en_us_dedes/oc.m6.d1:ocVE.SticTheotokion.incipit
ltx/en_us_dedes/me.m01.d30:meVE.SticTheotokion.melody	
ltx/en_us_dedes/me.m01.d30:meVE.SticTheotokion.mode	@ltx/en_us_dedes/miscellanea:misc.Mode6
ltx/en_us_dedes/me.m01.d30:meVE.SticTheotokion.text	@ltx/en_us_dedes/oc.m6.d1:ocVE.SticTheotokion.text
ltx/en_us_dedes/me.m01.d30:meVE.Stichera01.greekmelody	@ltx/en_us_dedes/he.a.m4:heAU.OsGennaionEnMartysi.greekname
ltx/en_us_dedes/me.m01.d30:meVE.Stichera01.incipit	…
ltx/en_us_dedes/me.m01.d30:meVE.Stichera01.melody	@ltx/en_us_dedes/he.a.m4:heAU.OsGennaionEnMartysi.name
ltx/en_us_dedes/me.m01.d30:meVE.Stichera01.mode	@ltx/en_us_dedes/miscellanea:misc.Mode4
ltx/en_us_dedes/me.m01.d30:meVE.Stichera01.text	
ltx/en_us_dedes/me.m01.d30:meVE.Stichera02.incipit	…
ltx/en_us_dedes/me.m01.d30:meVE.Stichera02.melody	@ltx/en_us_dedes/he.a.m4:heAU.OsGennaionEnMartysi.name
ltx/en_us_dedes/me.m01.d30:meVE.Stichera02.mode	@ltx/en_us_dedes/miscellanea:misc.Mode4
ltx/en_us_dedes/me.m01.d30:meVE.Stichera02.text	
ltx/en_us_dedes/me.m01.d30:meVE.Stichera03.incipit	…
ltx/en_us_dedes/me.m01.d30:meVE.Stichera03.melody	@ltx/en_us_dedes/he.a.m4:heAU.OsGennaionEnMartysi.name
ltx/en_us_dedes/me.m01.d30:meVE.Stichera03.mode	@ltx/en_us_dedes/miscellanea:misc.Mode4
ltx/en_us_dedes/me.m01.d30:meVE.Stichera03.text	
ltx/en_us_dedes/me.m01.d30:meVE.Stichera04.greekmelody	@ltx/en_us_dedes/he.a.m4:heAU.OsGennaionEnMartysi.greekname
ltx/en_us_dedes/me.m01.d30:meVE.Stichera04.incipit	…
ltx/en_us_dedes/me.m01.d30:meVE.Stichera04.melody	@ltx/en_us_dedes/he.a.m4:heAU.OsGennaionEnMartysi.name
ltx/en_us_dedes/me.m01.d30:meVE.Stichera04.mode	@ltx/en_us_dedes/miscellanea:misc.Mode4
ltx/en_us_dedes/me.m01.d30:meVE.Stichera04.text	
