ltx/en_us_dedes/me.m12.d26:alt1.meDA.commemoration.first_name	
ltx/en_us_dedes/me.m12.d26:alt1.meDA.commemoration.first_short	
ltx/en_us_dedes/me.m12.d26:alt1.meDA.commemoration.first_title	
ltx/en_us_dedes/me.m12.d26:alt1.meDA.commemoration.full	Holy Hieromartyr Efthymios
ltx/en_us_dedes/me.m12.d26:alt1.meDA.commemoration.second_name	
ltx/en_us_dedes/me.m12.d26:alt1.meDA.commemoration.second_title	
ltx/en_us_dedes/me.m12.d26:alt1.meDA.date	December 26
ltx/en_us_dedes/me.m12.d26:alt1.meDA.dismissal	@ltx/en_us_dedes/dismissals:dis00.christmas
ltx/en_us_dedes/me.m12.d26:alt1.meDA.insert1	
ltx/en_us_dedes/me.m12.d26:alt1.meDA.insert2	
ltx/en_us_dedes/me.m12.d26:alt1.meDA.note	
ltx/en_us_dedes/me.m12.d26:alt1.meHO.commemorations	
ltx/en_us_dedes/me.m12.d26:alt1.meHO.note1	
ltx/en_us_dedes/me.m12.d26:alt1.meHO.note2	
ltx/en_us_dedes/me.m12.d26:alt1.meHO.number	
ltx/en_us_dedes/me.m12.d26:alt1.meHO.rank	
ltx/en_us_dedes/me.m12.d26:alt1.meLE.commemoration1	Holy Hieromartyr Efthymios
ltx/en_us_dedes/me.m12.d26:alt1.meLE.commemoration2	
ltx/en_us_dedes/me.m12.d26:alt1.meMA.C1.acrostic.notice1	
ltx/en_us_dedes/me.m12.d26:alt1.meMA.C1.acrostic.text	
ltx/en_us_dedes/me.m12.d26:alt1.meMA.C1.acrostic.title	
ltx/en_us_dedes/me.m12.d26:alt1.meMA.C1.poet	@ltx/en_us_dedes/poets:po.Theofanous
ltx/en_us_dedes/me.m12.d26:alt1.meMA.C1.title	@ltx/en_us_dedes/titles:ti.CanonSaintM
ltx/en_us_dedes/me.m12.d26:alt1.meMA.C1.verse	@ltx/en_us_dedes/prayers:pr.verse_SaintM.text
ltx/en_us_dedes/me.m12.d26:alt1.meMA.Ode1C11.greekmelody	@ltx/en_us_dedes/he.h.m4:heHE.ThalassisToErythraion.greekname
ltx/en_us_dedes/me.m12.d26:alt1.meMA.Ode1C11.incipit	…
ltx/en_us_dedes/me.m12.d26:alt1.meMA.Ode1C11.melody	@ltx/en_us_dedes/he.h.m4:heHE.ThalassisToErythraion.name
ltx/en_us_dedes/me.m12.d26:alt1.meMA.Ode1C11.mode	@ltx/en_us_dedes/miscellanea:misc.Mode4
ltx/en_us_dedes/me.m12.d26:alt1.meMA.Ode1C11.ode	@ltx/en_us_dedes/miscellanea:misc.Ode1
ltx/en_us_dedes/me.m12.d26:alt1.meMA.Ode1C11.text	
ltx/en_us_dedes/me.m12.d26:alt1.meMA.Ode1C12.incipit	…
ltx/en_us_dedes/me.m12.d26:alt1.meMA.Ode1C12.melody	@ltx/en_us_dedes/he.h.m4:heHE.ThalassisToErythraion.name
ltx/en_us_dedes/me.m12.d26:alt1.meMA.Ode1C12.mode	@ltx/en_us_dedes/miscellanea:misc.Mode4
ltx/en_us_dedes/me.m12.d26:alt1.meMA.Ode1C12.ode	@ltx/en_us_dedes/miscellanea:misc.Ode1
ltx/en_us_dedes/me.m12.d26:alt1.meMA.Ode1C12.text	
ltx/en_us_dedes/me.m12.d26:alt1.meMA.Ode1C13.incipit	…
ltx/en_us_dedes/me.m12.d26:alt1.meMA.Ode1C13.melody	@ltx/en_us_dedes/he.h.m4:heHE.ThalassisToErythraion.name
ltx/en_us_dedes/me.m12.d26:alt1.meMA.Ode1C13.mode	@ltx/en_us_dedes/miscellanea:misc.Mode4
ltx/en_us_dedes/me.m12.d26:alt1.meMA.Ode1C13.ode	@ltx/en_us_dedes/miscellanea:misc.Ode1
ltx/en_us_dedes/me.m12.d26:alt1.meMA.Ode1C13.text	
ltx/en_us_dedes/me.m12.d26:alt1.meMA.Ode1C14.incipit	…
ltx/en_us_dedes/me.m12.d26:alt1.meMA.Ode1C14.melody	@ltx/en_us_dedes/he.h.m4:heHE.ThalassisToErythraion.name
ltx/en_us_dedes/me.m12.d26:alt1.meMA.Ode1C14.mode	@ltx/en_us_dedes/miscellanea:misc.Mode4
ltx/en_us_dedes/me.m12.d26:alt1.meMA.Ode1C14.ode	@ltx/en_us_dedes/miscellanea:misc.Ode1
ltx/en_us_dedes/me.m12.d26:alt1.meMA.Ode1C14.text	
ltx/en_us_dedes/me.m12.d26:alt1.meMA.Ode1C1T.incipit	…
ltx/en_us_dedes/me.m12.d26:alt1.meMA.Ode1C1T.melody	@ltx/en_us_dedes/he.h.m4:heHE.ThalassisToErythraion.name
ltx/en_us_dedes/me.m12.d26:alt1.meMA.Ode1C1T.mode	@ltx/en_us_dedes/miscellanea:misc.Mode4
ltx/en_us_dedes/me.m12.d26:alt1.meMA.Ode1C1T.ode	@ltx/en_us_dedes/miscellanea:misc.Ode1
ltx/en_us_dedes/me.m12.d26:alt1.meMA.Ode1C1T.text	
ltx/en_us_dedes/me.m12.d26:alt1.meMA.Ode3C11.greekmelody	@ltx/en_us_dedes/he.h.m4:heHE.EffrainetaiEpiSoi.greekname
ltx/en_us_dedes/me.m12.d26:alt1.meMA.Ode3C11.incipit	…
ltx/en_us_dedes/me.m12.d26:alt1.meMA.Ode3C11.melody	@ltx/en_us_dedes/he.h.m4:heHE.EffrainetaiEpiSoi.name
ltx/en_us_dedes/me.m12.d26:alt1.meMA.Ode3C11.mode	@ltx/en_us_dedes/miscellanea:misc.Mode4
ltx/en_us_dedes/me.m12.d26:alt1.meMA.Ode3C11.ode	@ltx/en_us_dedes/miscellanea:misc.Ode3
ltx/en_us_dedes/me.m12.d26:alt1.meMA.Ode3C11.text	
ltx/en_us_dedes/me.m12.d26:alt1.meMA.Ode3C12.incipit	…
ltx/en_us_dedes/me.m12.d26:alt1.meMA.Ode3C12.melody	@ltx/en_us_dedes/he.h.m4:heHE.EffrainetaiEpiSoi.name
ltx/en_us_dedes/me.m12.d26:alt1.meMA.Ode3C12.mode	@ltx/en_us_dedes/miscellanea:misc.Mode4
ltx/en_us_dedes/me.m12.d26:alt1.meMA.Ode3C12.ode	@ltx/en_us_dedes/miscellanea:misc.Ode3
ltx/en_us_dedes/me.m12.d26:alt1.meMA.Ode3C12.text	
ltx/en_us_dedes/me.m12.d26:alt1.meMA.Ode3C13.incipit	…
ltx/en_us_dedes/me.m12.d26:alt1.meMA.Ode3C13.melody	@ltx/en_us_dedes/he.h.m4:heHE.EffrainetaiEpiSoi.name
ltx/en_us_dedes/me.m12.d26:alt1.meMA.Ode3C13.mode	@ltx/en_us_dedes/miscellanea:misc.Mode4
ltx/en_us_dedes/me.m12.d26:alt1.meMA.Ode3C13.ode	@ltx/en_us_dedes/miscellanea:misc.Ode3
ltx/en_us_dedes/me.m12.d26:alt1.meMA.Ode3C13.text	
ltx/en_us_dedes/me.m12.d26:alt1.meMA.Ode3C14.incipit	…
ltx/en_us_dedes/me.m12.d26:alt1.meMA.Ode3C14.melody	@ltx/en_us_dedes/he.h.m4:heHE.EffrainetaiEpiSoi.name
ltx/en_us_dedes/me.m12.d26:alt1.meMA.Ode3C14.mode	@ltx/en_us_dedes/miscellanea:misc.Mode4
ltx/en_us_dedes/me.m12.d26:alt1.meMA.Ode3C14.ode	@ltx/en_us_dedes/miscellanea:misc.Ode3
ltx/en_us_dedes/me.m12.d26:alt1.meMA.Ode3C14.text	
ltx/en_us_dedes/me.m12.d26:alt1.meMA.Ode3C1T.incipit	…
ltx/en_us_dedes/me.m12.d26:alt1.meMA.Ode3C1T.melody	@ltx/en_us_dedes/he.h.m4:heHE.EffrainetaiEpiSoi.name
ltx/en_us_dedes/me.m12.d26:alt1.meMA.Ode3C1T.mode	@ltx/en_us_dedes/miscellanea:misc.Mode4
ltx/en_us_dedes/me.m12.d26:alt1.meMA.Ode3C1T.ode	@ltx/en_us_dedes/miscellanea:misc.Ode3
ltx/en_us_dedes/me.m12.d26:alt1.meMA.Ode3C1T.text	
ltx/en_us_dedes/me.m12.d26:alt1.meMA.Ode3Kathisma1.greekmelody	@ltx/en_us_dedes/he.a.m1:heAU.TonTafonSouSotir.greekname
ltx/en_us_dedes/me.m12.d26:alt1.meMA.Ode3Kathisma1.incipit	…
ltx/en_us_dedes/me.m12.d26:alt1.meMA.Ode3Kathisma1.melody	@ltx/en_us_dedes/he.a.m1:heAU.TonTafonSouSotir.name
ltx/en_us_dedes/me.m12.d26:alt1.meMA.Ode3Kathisma1.mode	@ltx/en_us_dedes/miscellanea:misc.Mode1
ltx/en_us_dedes/me.m12.d26:alt1.meMA.Ode3Kathisma1.text	
ltx/en_us_dedes/me.m12.d26:alt1.meMA.Ode4C11.greekmelody	@ltx/en_us_dedes/he.h.m4:heHE.EparthentaSeIdousa.greekname
ltx/en_us_dedes/me.m12.d26:alt1.meMA.Ode4C11.incipit	…
ltx/en_us_dedes/me.m12.d26:alt1.meMA.Ode4C11.melody	@ltx/en_us_dedes/he.h.m4:heHE.EparthentaSeIdousa.name
ltx/en_us_dedes/me.m12.d26:alt1.meMA.Ode4C11.mode	@ltx/en_us_dedes/miscellanea:misc.Mode4
ltx/en_us_dedes/me.m12.d26:alt1.meMA.Ode4C11.ode	@ltx/en_us_dedes/miscellanea:misc.Ode4
ltx/en_us_dedes/me.m12.d26:alt1.meMA.Ode4C11.text	
ltx/en_us_dedes/me.m12.d26:alt1.meMA.Ode4C12.incipit	…
ltx/en_us_dedes/me.m12.d26:alt1.meMA.Ode4C12.melody	@ltx/en_us_dedes/he.h.m4:heHE.EparthentaSeIdousa.name
ltx/en_us_dedes/me.m12.d26:alt1.meMA.Ode4C12.mode	@ltx/en_us_dedes/miscellanea:misc.Mode4
ltx/en_us_dedes/me.m12.d26:alt1.meMA.Ode4C12.ode	@ltx/en_us_dedes/miscellanea:misc.Ode4
ltx/en_us_dedes/me.m12.d26:alt1.meMA.Ode4C12.text	
ltx/en_us_dedes/me.m12.d26:alt1.meMA.Ode4C13.incipit	…
ltx/en_us_dedes/me.m12.d26:alt1.meMA.Ode4C13.melody	@ltx/en_us_dedes/he.h.m4:heHE.EparthentaSeIdousa.name
ltx/en_us_dedes/me.m12.d26:alt1.meMA.Ode4C13.mode	@ltx/en_us_dedes/miscellanea:misc.Mode4
ltx/en_us_dedes/me.m12.d26:alt1.meMA.Ode4C13.ode	@ltx/en_us_dedes/miscellanea:misc.Ode4
ltx/en_us_dedes/me.m12.d26:alt1.meMA.Ode4C13.text	
ltx/en_us_dedes/me.m12.d26:alt1.meMA.Ode4C14.incipit	…
ltx/en_us_dedes/me.m12.d26:alt1.meMA.Ode4C14.melody	@ltx/en_us_dedes/he.h.m4:heHE.EparthentaSeIdousa.name
ltx/en_us_dedes/me.m12.d26:alt1.meMA.Ode4C14.mode	@ltx/en_us_dedes/miscellanea:misc.Mode4
ltx/en_us_dedes/me.m12.d26:alt1.meMA.Ode4C14.ode	@ltx/en_us_dedes/miscellanea:misc.Ode4
ltx/en_us_dedes/me.m12.d26:alt1.meMA.Ode4C14.text	
ltx/en_us_dedes/me.m12.d26:alt1.meMA.Ode4C1T.incipit	…
ltx/en_us_dedes/me.m12.d26:alt1.meMA.Ode4C1T.melody	@ltx/en_us_dedes/he.h.m4:heHE.EparthentaSeIdousa.name
ltx/en_us_dedes/me.m12.d26:alt1.meMA.Ode4C1T.mode	@ltx/en_us_dedes/miscellanea:misc.Mode4
ltx/en_us_dedes/me.m12.d26:alt1.meMA.Ode4C1T.ode	@ltx/en_us_dedes/miscellanea:misc.Ode4
ltx/en_us_dedes/me.m12.d26:alt1.meMA.Ode4C1T.text	
ltx/en_us_dedes/me.m12.d26:alt1.meMA.Ode5C11.greekmelody	@ltx/en_us_dedes/he.h.m4:heHE.SyKyrieMouFos.greekname
ltx/en_us_dedes/me.m12.d26:alt1.meMA.Ode5C11.incipit	…
ltx/en_us_dedes/me.m12.d26:alt1.meMA.Ode5C11.melody	@ltx/en_us_dedes/he.h.m4:heHE.SyKyrieMouFos.name
ltx/en_us_dedes/me.m12.d26:alt1.meMA.Ode5C11.mode	@ltx/en_us_dedes/miscellanea:misc.Mode4
ltx/en_us_dedes/me.m12.d26:alt1.meMA.Ode5C11.ode	@ltx/en_us_dedes/miscellanea:misc.Ode5
ltx/en_us_dedes/me.m12.d26:alt1.meMA.Ode5C11.text	
ltx/en_us_dedes/me.m12.d26:alt1.meMA.Ode5C12.incipit	…
ltx/en_us_dedes/me.m12.d26:alt1.meMA.Ode5C12.melody	@ltx/en_us_dedes/he.h.m4:heHE.SyKyrieMouFos.name
ltx/en_us_dedes/me.m12.d26:alt1.meMA.Ode5C12.mode	@ltx/en_us_dedes/miscellanea:misc.Mode4
ltx/en_us_dedes/me.m12.d26:alt1.meMA.Ode5C12.ode	@ltx/en_us_dedes/miscellanea:misc.Ode5
ltx/en_us_dedes/me.m12.d26:alt1.meMA.Ode5C12.text	
ltx/en_us_dedes/me.m12.d26:alt1.meMA.Ode5C13.incipit	…
ltx/en_us_dedes/me.m12.d26:alt1.meMA.Ode5C13.melody	@ltx/en_us_dedes/he.h.m4:heHE.SyKyrieMouFos.name
ltx/en_us_dedes/me.m12.d26:alt1.meMA.Ode5C13.mode	@ltx/en_us_dedes/miscellanea:misc.Mode4
ltx/en_us_dedes/me.m12.d26:alt1.meMA.Ode5C13.ode	@ltx/en_us_dedes/miscellanea:misc.Ode5
ltx/en_us_dedes/me.m12.d26:alt1.meMA.Ode5C13.text	
ltx/en_us_dedes/me.m12.d26:alt1.meMA.Ode5C14.incipit	…
ltx/en_us_dedes/me.m12.d26:alt1.meMA.Ode5C14.melody	@ltx/en_us_dedes/he.h.m4:heHE.SyKyrieMouFos.name
ltx/en_us_dedes/me.m12.d26:alt1.meMA.Ode5C14.mode	@ltx/en_us_dedes/miscellanea:misc.Mode4
ltx/en_us_dedes/me.m12.d26:alt1.meMA.Ode5C14.ode	@ltx/en_us_dedes/miscellanea:misc.Ode5
ltx/en_us_dedes/me.m12.d26:alt1.meMA.Ode5C14.text	
ltx/en_us_dedes/me.m12.d26:alt1.meMA.Ode5C1T.incipit	…
ltx/en_us_dedes/me.m12.d26:alt1.meMA.Ode5C1T.melody	@ltx/en_us_dedes/he.h.m4:heHE.SyKyrieMouFos.name
ltx/en_us_dedes/me.m12.d26:alt1.meMA.Ode5C1T.mode	@ltx/en_us_dedes/miscellanea:misc.Mode4
ltx/en_us_dedes/me.m12.d26:alt1.meMA.Ode5C1T.ode	@ltx/en_us_dedes/miscellanea:misc.Ode5
ltx/en_us_dedes/me.m12.d26:alt1.meMA.Ode5C1T.text	
ltx/en_us_dedes/me.m12.d26:alt1.meMA.Ode6C11.greekmelody	@ltx/en_us_dedes/he.h.m4:heHE.ThysoSoiMetaFonis.greekname
ltx/en_us_dedes/me.m12.d26:alt1.meMA.Ode6C11.incipit	…
ltx/en_us_dedes/me.m12.d26:alt1.meMA.Ode6C11.melody	@ltx/en_us_dedes/he.h.m4:heHE.ThysoSoiMetaFonis.name
ltx/en_us_dedes/me.m12.d26:alt1.meMA.Ode6C11.mode	@ltx/en_us_dedes/miscellanea:misc.Mode4
ltx/en_us_dedes/me.m12.d26:alt1.meMA.Ode6C11.ode	@ltx/en_us_dedes/miscellanea:misc.Ode6
ltx/en_us_dedes/me.m12.d26:alt1.meMA.Ode6C11.text	
ltx/en_us_dedes/me.m12.d26:alt1.meMA.Ode6C12.incipit	…
ltx/en_us_dedes/me.m12.d26:alt1.meMA.Ode6C12.melody	@ltx/en_us_dedes/he.h.m4:heHE.ThysoSoiMetaFonis.name
ltx/en_us_dedes/me.m12.d26:alt1.meMA.Ode6C12.mode	@ltx/en_us_dedes/miscellanea:misc.Mode4
ltx/en_us_dedes/me.m12.d26:alt1.meMA.Ode6C12.ode	@ltx/en_us_dedes/miscellanea:misc.Ode6
ltx/en_us_dedes/me.m12.d26:alt1.meMA.Ode6C12.text	
ltx/en_us_dedes/me.m12.d26:alt1.meMA.Ode6C13.incipit	…
ltx/en_us_dedes/me.m12.d26:alt1.meMA.Ode6C13.melody	@ltx/en_us_dedes/he.h.m4:heHE.ThysoSoiMetaFonis.name
ltx/en_us_dedes/me.m12.d26:alt1.meMA.Ode6C13.mode	@ltx/en_us_dedes/miscellanea:misc.Mode4
ltx/en_us_dedes/me.m12.d26:alt1.meMA.Ode6C13.ode	@ltx/en_us_dedes/miscellanea:misc.Ode6
ltx/en_us_dedes/me.m12.d26:alt1.meMA.Ode6C13.text	
ltx/en_us_dedes/me.m12.d26:alt1.meMA.Ode6C1T.incipit	…
ltx/en_us_dedes/me.m12.d26:alt1.meMA.Ode6C1T.melody	@ltx/en_us_dedes/he.h.m4:heHE.ThysoSoiMetaFonis.name
ltx/en_us_dedes/me.m12.d26:alt1.meMA.Ode6C1T.mode	@ltx/en_us_dedes/miscellanea:misc.Mode4
ltx/en_us_dedes/me.m12.d26:alt1.meMA.Ode6C1T.ode	@ltx/en_us_dedes/miscellanea:misc.Ode6
ltx/en_us_dedes/me.m12.d26:alt1.meMA.Ode6C1T.text	
ltx/en_us_dedes/me.m12.d26:alt1.meMA.Ode7C11.greekmelody	@ltx/en_us_dedes/he.h.m4:heHE.EnTiKaminoAvramiaioi.greekname
ltx/en_us_dedes/me.m12.d26:alt1.meMA.Ode7C11.incipit	…
ltx/en_us_dedes/me.m12.d26:alt1.meMA.Ode7C11.melody	@ltx/en_us_dedes/he.h.m4:heHE.EnTiKaminoAvramiaioi.name
ltx/en_us_dedes/me.m12.d26:alt1.meMA.Ode7C11.mode	@ltx/en_us_dedes/miscellanea:misc.Mode4
ltx/en_us_dedes/me.m12.d26:alt1.meMA.Ode7C11.ode	@ltx/en_us_dedes/miscellanea:misc.Ode7
ltx/en_us_dedes/me.m12.d26:alt1.meMA.Ode7C11.text	
ltx/en_us_dedes/me.m12.d26:alt1.meMA.Ode7C12.incipit	…
ltx/en_us_dedes/me.m12.d26:alt1.meMA.Ode7C12.melody	@ltx/en_us_dedes/he.h.m4:heHE.EnTiKaminoAvramiaioi.name
ltx/en_us_dedes/me.m12.d26:alt1.meMA.Ode7C12.mode	@ltx/en_us_dedes/miscellanea:misc.Mode4
ltx/en_us_dedes/me.m12.d26:alt1.meMA.Ode7C12.ode	@ltx/en_us_dedes/miscellanea:misc.Ode7
ltx/en_us_dedes/me.m12.d26:alt1.meMA.Ode7C12.text	
ltx/en_us_dedes/me.m12.d26:alt1.meMA.Ode7C13.incipit	…
ltx/en_us_dedes/me.m12.d26:alt1.meMA.Ode7C13.melody	@ltx/en_us_dedes/he.h.m4:heHE.EnTiKaminoAvramiaioi.name
ltx/en_us_dedes/me.m12.d26:alt1.meMA.Ode7C13.mode	@ltx/en_us_dedes/miscellanea:misc.Mode4
ltx/en_us_dedes/me.m12.d26:alt1.meMA.Ode7C13.ode	@ltx/en_us_dedes/miscellanea:misc.Ode7
ltx/en_us_dedes/me.m12.d26:alt1.meMA.Ode7C13.text	
ltx/en_us_dedes/me.m12.d26:alt1.meMA.Ode7C1T.incipit	…
ltx/en_us_dedes/me.m12.d26:alt1.meMA.Ode7C1T.melody	@ltx/en_us_dedes/he.h.m4:heHE.EnTiKaminoAvramiaioi.name
ltx/en_us_dedes/me.m12.d26:alt1.meMA.Ode7C1T.mode	@ltx/en_us_dedes/miscellanea:misc.Mode4
ltx/en_us_dedes/me.m12.d26:alt1.meMA.Ode7C1T.ode	@ltx/en_us_dedes/miscellanea:misc.Ode7
ltx/en_us_dedes/me.m12.d26:alt1.meMA.Ode7C1T.text	
ltx/en_us_dedes/me.m12.d26:alt1.meMA.Ode8C11.greekmelody	@ltx/en_us_dedes/he.h.m4:heHE.CheirasEkpetasasDaniil.greekname
ltx/en_us_dedes/me.m12.d26:alt1.meMA.Ode8C11.incipit	…
ltx/en_us_dedes/me.m12.d26:alt1.meMA.Ode8C11.melody	@ltx/en_us_dedes/he.h.m4:heHE.CheirasEkpetasasDaniil.name
ltx/en_us_dedes/me.m12.d26:alt1.meMA.Ode8C11.mode	@ltx/en_us_dedes/miscellanea:misc.Mode4
ltx/en_us_dedes/me.m12.d26:alt1.meMA.Ode8C11.ode	@ltx/en_us_dedes/miscellanea:misc.Ode8
ltx/en_us_dedes/me.m12.d26:alt1.meMA.Ode8C11.text	
ltx/en_us_dedes/me.m12.d26:alt1.meMA.Ode8C12.incipit	…
ltx/en_us_dedes/me.m12.d26:alt1.meMA.Ode8C12.melody	@ltx/en_us_dedes/he.h.m4:heHE.CheirasEkpetasasDaniil.name
ltx/en_us_dedes/me.m12.d26:alt1.meMA.Ode8C12.mode	@ltx/en_us_dedes/miscellanea:misc.Mode4
ltx/en_us_dedes/me.m12.d26:alt1.meMA.Ode8C12.ode	@ltx/en_us_dedes/miscellanea:misc.Ode8
ltx/en_us_dedes/me.m12.d26:alt1.meMA.Ode8C12.text	
ltx/en_us_dedes/me.m12.d26:alt1.meMA.Ode8C13.incipit	…
ltx/en_us_dedes/me.m12.d26:alt1.meMA.Ode8C13.melody	@ltx/en_us_dedes/he.h.m4:heHE.CheirasEkpetasasDaniil.name
ltx/en_us_dedes/me.m12.d26:alt1.meMA.Ode8C13.mode	@ltx/en_us_dedes/miscellanea:misc.Mode4
ltx/en_us_dedes/me.m12.d26:alt1.meMA.Ode8C13.ode	@ltx/en_us_dedes/miscellanea:misc.Ode8
ltx/en_us_dedes/me.m12.d26:alt1.meMA.Ode8C13.text	
ltx/en_us_dedes/me.m12.d26:alt1.meMA.Ode8C1T.incipit	…
ltx/en_us_dedes/me.m12.d26:alt1.meMA.Ode8C1T.melody	@ltx/en_us_dedes/he.h.m4:heHE.CheirasEkpetasasDaniil.name
ltx/en_us_dedes/me.m12.d26:alt1.meMA.Ode8C1T.mode	@ltx/en_us_dedes/miscellanea:misc.Mode4
ltx/en_us_dedes/me.m12.d26:alt1.meMA.Ode8C1T.ode	@ltx/en_us_dedes/miscellanea:misc.Ode8
ltx/en_us_dedes/me.m12.d26:alt1.meMA.Ode8C1T.text	
ltx/en_us_dedes/me.m12.d26:alt1.meMA.Ode9C11.greekmelody	@ltx/en_us_dedes/he.h.m4:heHE.LithosAcheirotmitos.greekname
ltx/en_us_dedes/me.m12.d26:alt1.meMA.Ode9C11.incipit	…
ltx/en_us_dedes/me.m12.d26:alt1.meMA.Ode9C11.melody	@ltx/en_us_dedes/he.h.m4:heHE.LithosAcheirotmitos.name
ltx/en_us_dedes/me.m12.d26:alt1.meMA.Ode9C11.mode	@ltx/en_us_dedes/miscellanea:misc.Mode4
ltx/en_us_dedes/me.m12.d26:alt1.meMA.Ode9C11.ode	@ltx/en_us_dedes/miscellanea:misc.Ode9
ltx/en_us_dedes/me.m12.d26:alt1.meMA.Ode9C11.text	
ltx/en_us_dedes/me.m12.d26:alt1.meMA.Ode9C12.incipit	…
ltx/en_us_dedes/me.m12.d26:alt1.meMA.Ode9C12.melody	@ltx/en_us_dedes/he.h.m4:heHE.LithosAcheirotmitos.name
ltx/en_us_dedes/me.m12.d26:alt1.meMA.Ode9C12.mode	@ltx/en_us_dedes/miscellanea:misc.Mode4
ltx/en_us_dedes/me.m12.d26:alt1.meMA.Ode9C12.ode	@ltx/en_us_dedes/miscellanea:misc.Ode9
ltx/en_us_dedes/me.m12.d26:alt1.meMA.Ode9C12.text	
ltx/en_us_dedes/me.m12.d26:alt1.meMA.Ode9C13.incipit	…
ltx/en_us_dedes/me.m12.d26:alt1.meMA.Ode9C13.melody	@ltx/en_us_dedes/he.h.m4:heHE.LithosAcheirotmitos.name
ltx/en_us_dedes/me.m12.d26:alt1.meMA.Ode9C13.mode	@ltx/en_us_dedes/miscellanea:misc.Mode4
ltx/en_us_dedes/me.m12.d26:alt1.meMA.Ode9C13.ode	@ltx/en_us_dedes/miscellanea:misc.Ode9
ltx/en_us_dedes/me.m12.d26:alt1.meMA.Ode9C13.text	
ltx/en_us_dedes/me.m12.d26:alt1.meMA.Ode9C14.incipit	…
ltx/en_us_dedes/me.m12.d26:alt1.meMA.Ode9C14.melody	@ltx/en_us_dedes/he.h.m4:heHE.LithosAcheirotmitos.name
ltx/en_us_dedes/me.m12.d26:alt1.meMA.Ode9C14.mode	@ltx/en_us_dedes/miscellanea:misc.Mode4
ltx/en_us_dedes/me.m12.d26:alt1.meMA.Ode9C14.ode	@ltx/en_us_dedes/miscellanea:misc.Ode9
ltx/en_us_dedes/me.m12.d26:alt1.meMA.Ode9C14.text	
ltx/en_us_dedes/me.m12.d26:alt1.meMA.Ode9C1T.incipit	…
ltx/en_us_dedes/me.m12.d26:alt1.meMA.Ode9C1T.melody	@ltx/en_us_dedes/he.h.m4:heHE.LithosAcheirotmitos.name
ltx/en_us_dedes/me.m12.d26:alt1.meMA.Ode9C1T.mode	@ltx/en_us_dedes/miscellanea:misc.Mode4
ltx/en_us_dedes/me.m12.d26:alt1.meMA.Ode9C1T.ode	@ltx/en_us_dedes/miscellanea:misc.Ode9
ltx/en_us_dedes/me.m12.d26:alt1.meMA.Ode9C1T.text	
ltx/en_us_dedes/me.m12.d26:alt1.meVE.SticGlory.incipit	…
ltx/en_us_dedes/me.m12.d26:alt1.meVE.SticGlory.melody	
ltx/en_us_dedes/me.m12.d26:alt1.meVE.SticGlory.mode	@ltx/en_us_dedes/miscellanea:misc.Mode4
ltx/en_us_dedes/me.m12.d26:alt1.meVE.SticGlory.text	
ltx/en_us_dedes/me.m12.d26:alt1.meVE.Stichera01.greekmelody	@ltx/en_us_dedes/he.a.m8:heAU.OTouParadoxou.greekname
ltx/en_us_dedes/me.m12.d26:alt1.meVE.Stichera01.incipit	…
ltx/en_us_dedes/me.m12.d26:alt1.meVE.Stichera01.melody	@ltx/en_us_dedes/he.a.m8:heAU.OTouParadoxou.name
ltx/en_us_dedes/me.m12.d26:alt1.meVE.Stichera01.mode	@ltx/en_us_dedes/miscellanea:misc.Mode8
ltx/en_us_dedes/me.m12.d26:alt1.meVE.Stichera01.text	
ltx/en_us_dedes/me.m12.d26:alt1.meVE.Stichera02.incipit	…
ltx/en_us_dedes/me.m12.d26:alt1.meVE.Stichera02.melody	@ltx/en_us_dedes/he.a.m8:heAU.OTouParadoxou.name
ltx/en_us_dedes/me.m12.d26:alt1.meVE.Stichera02.mode	@ltx/en_us_dedes/miscellanea:misc.Mode8
ltx/en_us_dedes/me.m12.d26:alt1.meVE.Stichera02.text	
ltx/en_us_dedes/me.m12.d26:alt1.meVE.Stichera03.incipit	…
ltx/en_us_dedes/me.m12.d26:alt1.meVE.Stichera03.melody	@ltx/en_us_dedes/he.a.m8:heAU.OTouParadoxou.name
ltx/en_us_dedes/me.m12.d26:alt1.meVE.Stichera03.mode	@ltx/en_us_dedes/miscellanea:misc.Mode8
ltx/en_us_dedes/me.m12.d26:alt1.meVE.Stichera03.text	
ltx/en_us_dedes/me.m12.d26:meDA.commemoration.first	The Synaxis in Honor of the Theotokos
ltx/en_us_dedes/me.m12.d26:meDA.commemoration.first_name	
ltx/en_us_dedes/me.m12.d26:meDA.commemoration.first_short	The Synaxis in Honor of the Theotokos
ltx/en_us_dedes/me.m12.d26:meDA.commemoration.first_title	@ltx/en_us_dedes/titles:ti.Feast
ltx/en_us_dedes/me.m12.d26:meDA.commemoration.full	The Synaxis in Honor of the Most Holy Theotokos
ltx/en_us_dedes/me.m12.d26:meDA.commemoration.second_name	
ltx/en_us_dedes/me.m12.d26:meDA.commemoration.second_title	
ltx/en_us_dedes/me.m12.d26:meDA.date	December 26
ltx/en_us_dedes/me.m12.d26:meDA.dismissal	@ltx/en_us_dedes/dismissals:dis00.christmas
ltx/en_us_dedes/me.m12.d26:meDA.fordate	for December 26
ltx/en_us_dedes/me.m12.d26:meDA.insert1	
ltx/en_us_dedes/me.m12.d26:meDA.insert2	the Synaxis in honor of whom we celebrate,
ltx/en_us_dedes/me.m12.d26:meDA.note	
ltx/en_us_dedes/me.m12.d26:meDA.pdfcoverdate	December 26,
ltx/en_us_dedes/me.m12.d26:meDA.pdfheaderdate	December 26
ltx/en_us_dedes/me.m12.d26:meHO.commemorations	
ltx/en_us_dedes/me.m12.d26:meHO.note1	
ltx/en_us_dedes/me.m12.d26:meHO.note2	
ltx/en_us_dedes/me.m12.d26:meHO.number	
ltx/en_us_dedes/me.m12.d26:meHO.rank	
ltx/en_us_dedes/me.m12.d26:meLE.commemoration1	The Synaxis in of our All-Holy Lady Theotokos and Ever-Virgin Mary.
ltx/en_us_dedes/me.m12.d26:meLE.commemoration2	
ltx/en_us_dedes/me.m12.d26:meLI.Kontakion1.incipit	@ltx/en_us_dedes/me.m12.d26:meMA.Kontakion1.incipit
ltx/en_us_dedes/me.m12.d26:meLI.Kontakion1.melody	@ltx/en_us_dedes/me.m12.d26:meMA.Kontakion1.melody
ltx/en_us_dedes/me.m12.d26:meLI.Kontakion1.mode	@ltx/en_us_dedes/me.m12.d26:meMA.Kontakion1.mode
ltx/en_us_dedes/me.m12.d26:meLI.Kontakion1.text	@ltx/en_us_dedes/me.m12.d26:meMA.Kontakion1.text
ltx/en_us_dedes/me.m12.d26:meLI.MM.CommunionHymn.text	@ltx/en_us_dedes/properties:media.key
ltx/en_us_dedes/me.m12.d26:meLI.Megalynarion.text	
ltx/en_us_dedes/me.m12.d26:meLI.TheotokosHymn.incipit	@ltx/en_us_dedes/me.m12.d25:meMA.Ode9C2H.incipit
ltx/en_us_dedes/me.m12.d26:meLI.TheotokosHymn.mode	@ltx/en_us_dedes/me.m12.d25:meMA.Ode9C2H.mode
ltx/en_us_dedes/me.m12.d26:meLI.TheotokosHymn.text	@ltx/en_us_dedes/me.m12.d25:meMA.Ode9C2H.text
ltx/en_us_dedes/me.m12.d26:meLI.TheotokosHymnVerse.incipit	@ltx/en_us_dedes/me.m12.d25:meMA.Ode9C2MTh.incipit
ltx/en_us_dedes/me.m12.d26:meLI.TheotokosHymnVerse.text	@ltx/en_us_dedes/me.m12.d25:meMA.Ode9C2MTh.text
ltx/en_us_dedes/me.m12.d26:meMA.Exaposteilarion1.greekmelody	@ltx/en_us_dedes/he.a.m3:heAU.EpeskepsatoImas.greekname
ltx/en_us_dedes/me.m12.d26:meMA.Exaposteilarion1.incipit	@ltx/en_us_dedes/he.a.m3:heAU.EpeskepsatoImas.incipit
ltx/en_us_dedes/me.m12.d26:meMA.Exaposteilarion1.melody	@ltx/en_us_dedes/he.a.m3:heAU.EpeskepsatoImas.melody
ltx/en_us_dedes/me.m12.d26:meMA.Exaposteilarion1.mode	@ltx/en_us_dedes/miscellanea:misc.Mode3
ltx/en_us_dedes/me.m12.d26:meMA.Exaposteilarion1.text	@ltx/en_us_dedes/he.a.m3:heAU.EpeskepsatoImas.text
ltx/en_us_dedes/me.m12.d26:meMA.Kontakion1.incipit	He who was begotten of…
ltx/en_us_dedes/me.m12.d26:meMA.Kontakion1.melody	
ltx/en_us_dedes/me.m12.d26:meMA.Kontakion1.mode	@ltx/en_us_dedes/miscellanea:misc.Mode6
ltx/en_us_dedes/me.m12.d26:meMA.Kontakion1.text	He who was begotten of the Father before the Morning Star without a mother is made flesh from you on earth today without a father. Therefore a Star announces the good tidings to the Magi, and Shepherds join the Angels in extolling your immaculate birthgiving, O Maiden full of grace.
ltx/en_us_dedes/me.m12.d26:meMA.Lauds1.incipit	@ltx/en_us_dedes/me.m12.d25:meMA.Lauds1.incipit
ltx/en_us_dedes/me.m12.d26:meMA.Lauds1.melody	
ltx/en_us_dedes/me.m12.d26:meMA.Lauds1.mode	@ltx/en_us_dedes/miscellanea:misc.Mode4
ltx/en_us_dedes/me.m12.d26:meMA.Lauds1.poet	@ltx/en_us_dedes/poets:po.AndreouIerosolymitou
ltx/en_us_dedes/me.m12.d26:meMA.Lauds1.text	@ltx/en_us_dedes/me.m12.d25:meMA.Lauds1.text
ltx/en_us_dedes/me.m12.d26:meMA.Lauds2.incipit	@ltx/en_us_dedes/me.m12.d25:meMA.Lauds2.incipit
ltx/en_us_dedes/me.m12.d26:meMA.Lauds2.melody	
ltx/en_us_dedes/me.m12.d26:meMA.Lauds2.mode	@ltx/en_us_dedes/miscellanea:misc.Mode4
ltx/en_us_dedes/me.m12.d26:meMA.Lauds2.text	@ltx/en_us_dedes/me.m12.d25:meMA.Lauds2.text
ltx/en_us_dedes/me.m12.d26:meMA.Lauds3.incipit	@ltx/en_us_dedes/me.m12.d25:meMA.Lauds3.incipit
ltx/en_us_dedes/me.m12.d26:meMA.Lauds3.melody	
ltx/en_us_dedes/me.m12.d26:meMA.Lauds3.mode	@ltx/en_us_dedes/miscellanea:misc.Mode4
ltx/en_us_dedes/me.m12.d26:meMA.Lauds3.text	@ltx/en_us_dedes/me.m12.d25:meMA.Lauds3.text
ltx/en_us_dedes/me.m12.d26:meMA.Lauds4.incipit	@ltx/en_us_dedes/me.m12.d25:meMA.Lauds4.incipit
ltx/en_us_dedes/me.m12.d26:meMA.Lauds4.melody	
ltx/en_us_dedes/me.m12.d26:meMA.Lauds4.mode	@ltx/en_us_dedes/miscellanea:misc.Mode4
ltx/en_us_dedes/me.m12.d26:meMA.Lauds4.text	@ltx/en_us_dedes/me.m12.d25:meMA.Lauds4.text
ltx/en_us_dedes/me.m12.d26:meMA.LaudsBoth.incipit	@ltx/en_us_dedes/me.m12.d25:meMA.LaudsBoth.incipit
ltx/en_us_dedes/me.m12.d26:meMA.LaudsBoth.melody	@ltx/en_us_dedes/miscellanea:misc.Idiomelon
ltx/en_us_dedes/me.m12.d26:meMA.LaudsBoth.mode	@ltx/en_us_dedes/miscellanea:misc.Mode2
ltx/en_us_dedes/me.m12.d26:meMA.LaudsBoth.text	@ltx/en_us_dedes/me.m12.d25:meMA.LaudsBoth.text
ltx/en_us_dedes/me.m12.d26:meMA.LaudsGlory.incipit	Today, the invisible Nature is…
ltx/en_us_dedes/me.m12.d26:meMA.LaudsGlory.melody	@ltx/en_us_dedes/miscellanea:misc.Idiomelon
ltx/en_us_dedes/me.m12.d26:meMA.LaudsGlory.mode	@ltx/en_us_dedes/miscellanea:misc.Mode6
ltx/en_us_dedes/me.m12.d26:meMA.LaudsGlory.text	Today, the invisible Nature is conjoined to humanity from a Virgin. Today, the infinite Essence is wrapped in swaddling clothes in Bethlehem. Today, God uses a star to lead Magi to adore Him. By their gold, frankincense and myrrh, they foretell His three-day burial. For that reason we sing, “O Christ our God, who were incarnate of a Virgin, save our souls.”
ltx/en_us_dedes/me.m12.d26:meMA.MM.Lauds1234as5678.text	@ltx/en_us_dedes/properties:media.key
ltx/en_us_dedes/me.m12.d26:meMA.Oikos1.text	The mystical grapevine held the Cluster that she produced without natural labor in her arms as if in branches, and she spoke to Him. “You are my fruit, You are my life. You are my God, and from You I know that I am still a virgin as before. And as I see that the seal of my virginity is intact, I proclaim You to be the unchanged Logos who became flesh. I knew no insemination, but I know You the destroy of corruption. For even after You came forth from me, I am still pure; and You left my womb like You found it. For this reason all creation celebrates together and sings to me: ‘Rejoice, O Maiden full of grace.’”
ltx/en_us_dedes/me.m12.d26:meVE.Apolytikion1.incipit	@ltx/en_us_dedes/me.m12.d25:meVE.Apolytikion1.incipit
ltx/en_us_dedes/me.m12.d26:meVE.Apolytikion1.melody	
ltx/en_us_dedes/me.m12.d26:meVE.Apolytikion1.mode	@ltx/en_us_dedes/miscellanea:misc.Mode4
ltx/en_us_dedes/me.m12.d26:meVE.Apolytikion1.text	@ltx/en_us_dedes/me.m12.d25:meVE.Apolytikion1.text
ltx/en_us_dedes/me.m12.d26:meVE.AposGlory.incipit	The shepherds went with haste…
ltx/en_us_dedes/me.m12.d26:meVE.AposGlory.melody	@ltx/en_us_dedes/miscellanea:misc.Idiomelon
ltx/en_us_dedes/me.m12.d26:meVE.AposGlory.mode	@ltx/en_us_dedes/miscellanea:misc.Mode8
ltx/en_us_dedes/me.m12.d26:meVE.AposGlory.text	The shepherds went with haste to Bethlehem, and they made known the true Shepherd, who while seated on the cherubim was lying in a manger; for He had taken the form of an infant for our sake. O Lord, glory to You!
ltx/en_us_dedes/me.m12.d26:meVE.Aposticha1.incipit	A paradoxal mystery is unfolding…
ltx/en_us_dedes/me.m12.d26:meVE.Aposticha1.melody	@ltx/en_us_dedes/miscellanea:misc.Idiomelon
ltx/en_us_dedes/me.m12.d26:meVE.Aposticha1.mode	@ltx/en_us_dedes/miscellanea:misc.Mode8
ltx/en_us_dedes/me.m12.d26:meVE.Aposticha1.poet	@ltx/en_us_dedes/poets:po.IoannouMonachou
ltx/en_us_dedes/me.m12.d26:meVE.Aposticha1.text	A paradoxal mystery is unfolding today. Natures are involved in something new, as God becomes man. He has remained what He always was, and has assumed what He previously was not, yet nothing in Him is confused or divided.
ltx/en_us_dedes/me.m12.d26:meVE.Aposticha2.incipit	Lord, You arrived in Bethlehem…
ltx/en_us_dedes/me.m12.d26:meVE.Aposticha2.melody	@ltx/en_us_dedes/miscellanea:misc.Idiomelon
ltx/en_us_dedes/me.m12.d26:meVE.Aposticha2.mode	@ltx/en_us_dedes/miscellanea:misc.Mode8
ltx/en_us_dedes/me.m12.d26:meVE.Aposticha2.text	Lord, You arrived in Bethlehem, and You stayed at the Grotto. You have heaven for Your throne, yet You reclined in a manger. Hosts of Angels surround You, yet You allowed the shepherds to approach You. All this, in order to save our human race, O compassionate One. Glory to You!
ltx/en_us_dedes/me.m12.d26:meVE.Aposticha3.incipit	How shall I describe this…
ltx/en_us_dedes/me.m12.d26:meVE.Aposticha3.melody	@ltx/en_us_dedes/miscellanea:misc.Idiomelon
ltx/en_us_dedes/me.m12.d26:meVE.Aposticha3.mode	@ltx/en_us_dedes/miscellanea:misc.Mode8
ltx/en_us_dedes/me.m12.d26:meVE.Aposticha3.text	How shall I describe this great mystery? The discarnate Logos becomes incarnate and physical; the invisible One is now seen; and He who is intangible is being touched and held. The unoriginate begins to be. The Son of God becomes the Son of man, yes, Jesus Christ, the same yesterday and today, and forever.
ltx/en_us_dedes/me.m12.d26:meVE.SticGlory.incipit	@ltx/en_us_dedes/me.m12.d25:meMA.PostGospelIdiomelon.incipit
ltx/en_us_dedes/me.m12.d26:meVE.SticGlory.melody	@ltx/en_us_dedes/miscellanea:misc.Idiomelon
ltx/en_us_dedes/me.m12.d26:meVE.SticGlory.mode	@ltx/en_us_dedes/miscellanea:misc.Mode6
ltx/en_us_dedes/me.m12.d26:meVE.SticGlory.text	@ltx/en_us_dedes/me.m12.d25:meMA.PostGospelIdiomelon.text
ltx/en_us_dedes/me.m12.d26:meVE.Stichera01.incipit	@ltx/en_us_dedes/me.m12.d25:meVE.Stichera01.incipit
ltx/en_us_dedes/me.m12.d26:meVE.Stichera01.melody	
ltx/en_us_dedes/me.m12.d26:meVE.Stichera01.mode	@ltx/en_us_dedes/miscellanea:misc.Mode2
ltx/en_us_dedes/me.m12.d26:meVE.Stichera01.poet	@ltx/en_us_dedes/poets:po.Germanou
ltx/en_us_dedes/me.m12.d26:meVE.Stichera01.text	@ltx/en_us_dedes/me.m12.d25:meVE.Stichera01.text
ltx/en_us_dedes/me.m12.d26:meVE.Stichera02.incipit	@ltx/en_us_dedes/me.m12.d25:meVE.Stichera02.incipit
ltx/en_us_dedes/me.m12.d26:meVE.Stichera02.melody	
ltx/en_us_dedes/me.m12.d26:meVE.Stichera02.mode	@ltx/en_us_dedes/miscellanea:misc.Mode2
ltx/en_us_dedes/me.m12.d26:meVE.Stichera02.poet	@ltx/en_us_dedes/poets:po.Anatoliou
ltx/en_us_dedes/me.m12.d26:meVE.Stichera02.text	@ltx/en_us_dedes/me.m12.d25:meVE.Stichera02.text
ltx/en_us_dedes/me.m12.d26:meVE.Stichera03.incipit	@ltx/en_us_dedes/me.m12.d25:meVE.Stichera03.incipit
ltx/en_us_dedes/me.m12.d26:meVE.Stichera03.melody	
ltx/en_us_dedes/me.m12.d26:meVE.Stichera03.mode	@ltx/en_us_dedes/miscellanea:misc.Mode2
ltx/en_us_dedes/me.m12.d26:meVE.Stichera03.text	@ltx/en_us_dedes/me.m12.d25:meVE.Stichera03.text
ltx/en_us_dedes/me.m12.d26:meVE.Stichera04.incipit	@ltx/en_us_dedes/me.m12.d25:meVE.Stichera04.incipit
ltx/en_us_dedes/me.m12.d26:meVE.Stichera04.melody	
ltx/en_us_dedes/me.m12.d26:meVE.Stichera04.mode	@ltx/en_us_dedes/miscellanea:misc.Mode2
ltx/en_us_dedes/me.m12.d26:meVE.Stichera04.text	@ltx/en_us_dedes/me.m12.d25:meVE.Stichera04.text
