ltx/en_us_dedes/oc.m2.d3:ocBK.ModeNaked	@ltx/en_us_dedes/miscellanea:misc.Mode2.naked
ltx/en_us_dedes/oc.m2.d3:ocLI.Beatitudes1.incipit	@ltx/en_us_dedes/oc.m2.d1:ocLI.Beatitudes1.incipit
ltx/en_us_dedes/oc.m2.d3:ocLI.Beatitudes1.melody	
ltx/en_us_dedes/oc.m2.d3:ocLI.Beatitudes1.mode	@ltx/en_us_dedes/miscellanea:misc.Mode2
ltx/en_us_dedes/oc.m2.d3:ocLI.Beatitudes1.text	@ltx/en_us_dedes/oc.m2.d1:ocLI.Beatitudes1.text
ltx/en_us_dedes/oc.m2.d3:ocLI.Beatitudes2.incipit	I surpass both the robber…
ltx/en_us_dedes/oc.m2.d3:ocLI.Beatitudes2.melody	
ltx/en_us_dedes/oc.m2.d3:ocLI.Beatitudes2.mode	@ltx/en_us_dedes/miscellanea:misc.Mode2
ltx/en_us_dedes/oc.m2.d3:ocLI.Beatitudes2.text	I surpass both the robber and the sinful woman in sinful deeds. * Self-condemned as I am, I pray, Savior, pity me.
ltx/en_us_dedes/oc.m2.d3:ocLI.Beatitudes3.incipit	Holy Forerunner, you immersed Christ…
ltx/en_us_dedes/oc.m2.d3:ocLI.Beatitudes3.melody	
ltx/en_us_dedes/oc.m2.d3:ocLI.Beatitudes3.mode	@ltx/en_us_dedes/miscellanea:misc.Mode2
ltx/en_us_dedes/oc.m2.d3:ocLI.Beatitudes3.text	Holy Forerunner, you immersed Christ the ocean of tender-love * in the river. By your prayers, make my passions go away.
ltx/en_us_dedes/oc.m2.d3:ocLI.Beatitudes4.incipit	Holy Athletes of Christ, you…
ltx/en_us_dedes/oc.m2.d3:ocLI.Beatitudes4.melody	
ltx/en_us_dedes/oc.m2.d3:ocLI.Beatitudes4.mode	@ltx/en_us_dedes/miscellanea:misc.Mode2
ltx/en_us_dedes/oc.m2.d3:ocLI.Beatitudes4.text	Holy Athletes of Christ, you are everywhere rightly glorified. * You dried up the words of deceit with streams of your sacred blood.
ltx/en_us_dedes/oc.m2.d3:ocLI.BeatitudesT.incipit	Let us all sing unceasingly…
ltx/en_us_dedes/oc.m2.d3:ocLI.BeatitudesT.melody	
ltx/en_us_dedes/oc.m2.d3:ocLI.BeatitudesT.mode	@ltx/en_us_dedes/miscellanea:misc.Mode2
ltx/en_us_dedes/oc.m2.d3:ocLI.BeatitudesT.text	Let us all sing unceasingly hymns extolling the one who bore * eternal unoriginate God, without being burnt by Him.
ltx/en_us_dedes/oc.m2.d3:ocLI.BeatitudesTr.incipit	As is written, the mind…
ltx/en_us_dedes/oc.m2.d3:ocLI.BeatitudesTr.melody	
ltx/en_us_dedes/oc.m2.d3:ocLI.BeatitudesTr.mode	@ltx/en_us_dedes/miscellanea:misc.Mode2
ltx/en_us_dedes/oc.m2.d3:ocLI.BeatitudesTr.text	As is written, the mind of man is unable with words to praise * the Godhead’s one origin in three hypostases worthily.
ltx/en_us_dedes/oc.m2.d3:ocLI.MM.Beatitudes1234TrTas78910GB.text	@ltx/en_us_dedes/properties:media.key
ltx/en_us_dedes/oc.m2.d3:ocMA.ApolTheotokion.incipit	@ltx/en_us_dedes/oc.m2.d2:ocMA.Kathisma23.incipit
ltx/en_us_dedes/oc.m2.d3:ocMA.ApolTheotokion.melody	
ltx/en_us_dedes/oc.m2.d3:ocMA.ApolTheotokion.mode	@ltx/en_us_dedes/miscellanea:misc.Mode2
ltx/en_us_dedes/oc.m2.d3:ocMA.ApolTheotokion.text	@ltx/en_us_dedes/oc.m2.d2:ocMA.Kathisma23.text
ltx/en_us_dedes/oc.m2.d3:ocMA.AposTheotokion.incipit	Rejoice, O Mary Mother of God…
ltx/en_us_dedes/oc.m2.d3:ocMA.AposTheotokion.melody	
ltx/en_us_dedes/oc.m2.d3:ocMA.AposTheotokion.mode	@ltx/en_us_dedes/miscellanea:misc.Mode2
ltx/en_us_dedes/oc.m2.d3:ocMA.AposTheotokion.text	Rejoice, O Mary Mother of God, for you are the indestructible temple, or rather the holy temple, as the Prophet David said, “Holy is Your temple, wondrous in righteousness.”
ltx/en_us_dedes/oc.m2.d3:ocMA.Aposticha1.incipit	…
ltx/en_us_dedes/oc.m2.d3:ocMA.Aposticha1.melody	
ltx/en_us_dedes/oc.m2.d3:ocMA.Aposticha1.mode	@ltx/en_us_dedes/miscellanea:misc.Mode2
ltx/en_us_dedes/oc.m2.d3:ocMA.Aposticha1.text	
ltx/en_us_dedes/oc.m2.d3:ocMA.Aposticha2.incipit	@ltx/en_us_dedes/oc.m2.d2:ocMA.Aposticha2.incipit
ltx/en_us_dedes/oc.m2.d3:ocMA.Aposticha2.melody	
ltx/en_us_dedes/oc.m2.d3:ocMA.Aposticha2.mode	@ltx/en_us_dedes/miscellanea:misc.Mode2
ltx/en_us_dedes/oc.m2.d3:ocMA.Aposticha2.text	@ltx/en_us_dedes/oc.m2.d2:ocMA.Aposticha2.text
ltx/en_us_dedes/oc.m2.d3:ocMA.Aposticha3.incipit	…
ltx/en_us_dedes/oc.m2.d3:ocMA.Aposticha3.melody	
ltx/en_us_dedes/oc.m2.d3:ocMA.Aposticha3.mode	@ltx/en_us_dedes/miscellanea:misc.Mode2
ltx/en_us_dedes/oc.m2.d3:ocMA.Aposticha3.text	
ltx/en_us_dedes/oc.m2.d3:ocMA.C1.acrostic.notice1	
ltx/en_us_dedes/oc.m2.d3:ocMA.C1.acrostic.text	
ltx/en_us_dedes/oc.m2.d3:ocMA.C1.acrostic.title	Canon of Compunction.
ltx/en_us_dedes/oc.m2.d3:ocMA.C2.acrostic.notice1	
ltx/en_us_dedes/oc.m2.d3:ocMA.C2.acrostic.text	
ltx/en_us_dedes/oc.m2.d3:ocMA.C2.acrostic.title	Canon for the Forerunner.
ltx/en_us_dedes/oc.m2.d3:ocMA.Kathisma11.incipit	…
ltx/en_us_dedes/oc.m2.d3:ocMA.Kathisma11.melody	
ltx/en_us_dedes/oc.m2.d3:ocMA.Kathisma11.mode	@ltx/en_us_dedes/miscellanea:misc.Mode2
ltx/en_us_dedes/oc.m2.d3:ocMA.Kathisma11.text	
ltx/en_us_dedes/oc.m2.d3:ocMA.Kathisma12.incipit	…
ltx/en_us_dedes/oc.m2.d3:ocMA.Kathisma12.melody	
ltx/en_us_dedes/oc.m2.d3:ocMA.Kathisma12.mode	@ltx/en_us_dedes/miscellanea:misc.Mode2
ltx/en_us_dedes/oc.m2.d3:ocMA.Kathisma12.text	
ltx/en_us_dedes/oc.m2.d3:ocMA.Kathisma13.incipit	@ltx/en_us_dedes/oc.m2.d2:ocMA.Kathisma23.incipit
ltx/en_us_dedes/oc.m2.d3:ocMA.Kathisma13.melody	
ltx/en_us_dedes/oc.m2.d3:ocMA.Kathisma13.mode	@ltx/en_us_dedes/miscellanea:misc.Mode2
ltx/en_us_dedes/oc.m2.d3:ocMA.Kathisma13.text	@ltx/en_us_dedes/oc.m2.d2:ocMA.Kathisma23.text
ltx/en_us_dedes/oc.m2.d3:ocMA.Kathisma21.incipit	@ltx/en_us_dedes/oc.m2.d2:ocMA.Kathisma21.incipit
ltx/en_us_dedes/oc.m2.d3:ocMA.Kathisma21.melody	
ltx/en_us_dedes/oc.m2.d3:ocMA.Kathisma21.mode	@ltx/en_us_dedes/miscellanea:misc.Mode2
ltx/en_us_dedes/oc.m2.d3:ocMA.Kathisma21.text	@ltx/en_us_dedes/oc.m2.d2:ocMA.Kathisma21.text
ltx/en_us_dedes/oc.m2.d3:ocMA.Kathisma22.incipit	@ltx/en_us_dedes/oc.m2.d2:ocMA.Kathisma22.incipit
ltx/en_us_dedes/oc.m2.d3:ocMA.Kathisma22.melody	
ltx/en_us_dedes/oc.m2.d3:ocMA.Kathisma22.mode	@ltx/en_us_dedes/miscellanea:misc.Mode2
ltx/en_us_dedes/oc.m2.d3:ocMA.Kathisma22.text	@ltx/en_us_dedes/oc.m2.d2:ocMA.Kathisma22.text
ltx/en_us_dedes/oc.m2.d3:ocMA.Kathisma23.incipit	…
ltx/en_us_dedes/oc.m2.d3:ocMA.Kathisma23.melody	
ltx/en_us_dedes/oc.m2.d3:ocMA.Kathisma23.mode	@ltx/en_us_dedes/miscellanea:misc.Mode2
ltx/en_us_dedes/oc.m2.d3:ocMA.Kathisma23.text	
ltx/en_us_dedes/oc.m2.d3:ocMA.Kathisma31.greekmelody	@ltx/en_us_dedes/he.a.m2:heAU.EfsplagchniasYparchousa.greekname
ltx/en_us_dedes/oc.m2.d3:ocMA.Kathisma31.incipit	…
ltx/en_us_dedes/oc.m2.d3:ocMA.Kathisma31.melody	@ltx/en_us_dedes/he.a.m2:heAU.EfsplagchniasYparchousa.name
ltx/en_us_dedes/oc.m2.d3:ocMA.Kathisma31.mode	@ltx/en_us_dedes/miscellanea:misc.Mode2
ltx/en_us_dedes/oc.m2.d3:ocMA.Kathisma31.text	
ltx/en_us_dedes/oc.m2.d3:ocMA.Kathisma32.incipit	…
ltx/en_us_dedes/oc.m2.d3:ocMA.Kathisma32.melody	
ltx/en_us_dedes/oc.m2.d3:ocMA.Kathisma32.mode	@ltx/en_us_dedes/miscellanea:misc.Mode2
ltx/en_us_dedes/oc.m2.d3:ocMA.Kathisma32.text	
ltx/en_us_dedes/oc.m2.d3:ocMA.Kathisma33.incipit	…
ltx/en_us_dedes/oc.m2.d3:ocMA.Kathisma33.melody	
ltx/en_us_dedes/oc.m2.d3:ocMA.Kathisma33.mode	@ltx/en_us_dedes/miscellanea:misc.Mode2
ltx/en_us_dedes/oc.m2.d3:ocMA.Kathisma33.text	
ltx/en_us_dedes/oc.m2.d3:ocMA.OdeW1C11.incipit	…
ltx/en_us_dedes/oc.m2.d3:ocMA.OdeW1C11.melody	@ltx/en_us_dedes/he.h.m2:heHE.TinMoseosOdin.name
ltx/en_us_dedes/oc.m2.d3:ocMA.OdeW1C11.mode	@ltx/en_us_dedes/miscellanea:misc.Mode2
ltx/en_us_dedes/oc.m2.d3:ocMA.OdeW1C11.ode	@ltx/en_us_dedes/miscellanea:misc.Ode1
ltx/en_us_dedes/oc.m2.d3:ocMA.OdeW1C11.text	
ltx/en_us_dedes/oc.m2.d3:ocMA.OdeW1C12.incipit	…
ltx/en_us_dedes/oc.m2.d3:ocMA.OdeW1C12.melody	@ltx/en_us_dedes/he.h.m2:heHE.TinMoseosOdin.name
ltx/en_us_dedes/oc.m2.d3:ocMA.OdeW1C12.mode	@ltx/en_us_dedes/miscellanea:misc.Mode2
ltx/en_us_dedes/oc.m2.d3:ocMA.OdeW1C12.ode	@ltx/en_us_dedes/miscellanea:misc.Ode1
ltx/en_us_dedes/oc.m2.d3:ocMA.OdeW1C12.text	
ltx/en_us_dedes/oc.m2.d3:ocMA.OdeW1C13.incipit	…
ltx/en_us_dedes/oc.m2.d3:ocMA.OdeW1C13.melody	@ltx/en_us_dedes/he.h.m2:heHE.TinMoseosOdin.name
ltx/en_us_dedes/oc.m2.d3:ocMA.OdeW1C13.mode	@ltx/en_us_dedes/miscellanea:misc.Mode2
ltx/en_us_dedes/oc.m2.d3:ocMA.OdeW1C13.ode	@ltx/en_us_dedes/miscellanea:misc.Ode1
ltx/en_us_dedes/oc.m2.d3:ocMA.OdeW1C13.text	
ltx/en_us_dedes/oc.m2.d3:ocMA.OdeW1C14.incipit	…
ltx/en_us_dedes/oc.m2.d3:ocMA.OdeW1C14.melody	@ltx/en_us_dedes/he.h.m2:heHE.TinMoseosOdin.name
ltx/en_us_dedes/oc.m2.d3:ocMA.OdeW1C14.mode	@ltx/en_us_dedes/miscellanea:misc.Mode2
ltx/en_us_dedes/oc.m2.d3:ocMA.OdeW1C14.ode	@ltx/en_us_dedes/miscellanea:misc.Ode1
ltx/en_us_dedes/oc.m2.d3:ocMA.OdeW1C14.text	
ltx/en_us_dedes/oc.m2.d3:ocMA.OdeW1C1H.greekmelody	@ltx/en_us_dedes/he.h.m2:heHE.TinMoseosOdin.greekname
ltx/en_us_dedes/oc.m2.d3:ocMA.OdeW1C1H.incipit	@ltx/en_us_dedes/he.h.m2:heHE.TinMoseosOdin.incipit
ltx/en_us_dedes/oc.m2.d3:ocMA.OdeW1C1H.melody	@ltx/en_us_dedes/he.h.m2:heHE.TinMoseosOdin.melody
ltx/en_us_dedes/oc.m2.d3:ocMA.OdeW1C1H.mode	@ltx/en_us_dedes/miscellanea:misc.Mode2
ltx/en_us_dedes/oc.m2.d3:ocMA.OdeW1C1H.ode	@ltx/en_us_dedes/miscellanea:misc.Ode1
ltx/en_us_dedes/oc.m2.d3:ocMA.OdeW1C1H.text	@ltx/en_us_dedes/he.h.m2:heHE.TinMoseosOdin.text
ltx/en_us_dedes/oc.m2.d3:ocMA.OdeW1C1T.incipit	…
ltx/en_us_dedes/oc.m2.d3:ocMA.OdeW1C1T.melody	@ltx/en_us_dedes/he.h.m2:heHE.TinMoseosOdin.name
ltx/en_us_dedes/oc.m2.d3:ocMA.OdeW1C1T.mode	@ltx/en_us_dedes/miscellanea:misc.Mode2
ltx/en_us_dedes/oc.m2.d3:ocMA.OdeW1C1T.ode	@ltx/en_us_dedes/miscellanea:misc.Ode1
ltx/en_us_dedes/oc.m2.d3:ocMA.OdeW1C1T.text	
ltx/en_us_dedes/oc.m2.d3:ocMA.OdeW1C21.greekmelody	@ltx/en_us_dedes/he.h.m2:heHE.EnVythoKatestrose.greekname
ltx/en_us_dedes/oc.m2.d3:ocMA.OdeW1C21.incipit	…
ltx/en_us_dedes/oc.m2.d3:ocMA.OdeW1C21.melody	@ltx/en_us_dedes/he.h.m2:heHE.EnVythoKatestrose.name
ltx/en_us_dedes/oc.m2.d3:ocMA.OdeW1C21.mode	@ltx/en_us_dedes/miscellanea:misc.Mode2
ltx/en_us_dedes/oc.m2.d3:ocMA.OdeW1C21.ode	@ltx/en_us_dedes/miscellanea:misc.Ode1
ltx/en_us_dedes/oc.m2.d3:ocMA.OdeW1C21.text	
ltx/en_us_dedes/oc.m2.d3:ocMA.OdeW1C22.incipit	…
ltx/en_us_dedes/oc.m2.d3:ocMA.OdeW1C22.melody	@ltx/en_us_dedes/he.h.m2:heHE.EnVythoKatestrose.name
ltx/en_us_dedes/oc.m2.d3:ocMA.OdeW1C22.mode	@ltx/en_us_dedes/miscellanea:misc.Mode2
ltx/en_us_dedes/oc.m2.d3:ocMA.OdeW1C22.ode	@ltx/en_us_dedes/miscellanea:misc.Ode1
ltx/en_us_dedes/oc.m2.d3:ocMA.OdeW1C22.text	
ltx/en_us_dedes/oc.m2.d3:ocMA.OdeW1C23.incipit	…
ltx/en_us_dedes/oc.m2.d3:ocMA.OdeW1C23.melody	@ltx/en_us_dedes/he.h.m2:heHE.EnVythoKatestrose.name
ltx/en_us_dedes/oc.m2.d3:ocMA.OdeW1C23.mode	@ltx/en_us_dedes/miscellanea:misc.Mode2
ltx/en_us_dedes/oc.m2.d3:ocMA.OdeW1C23.ode	@ltx/en_us_dedes/miscellanea:misc.Ode1
ltx/en_us_dedes/oc.m2.d3:ocMA.OdeW1C23.text	
ltx/en_us_dedes/oc.m2.d3:ocMA.OdeW1C2T.incipit	…
ltx/en_us_dedes/oc.m2.d3:ocMA.OdeW1C2T.melody	@ltx/en_us_dedes/he.h.m2:heHE.EnVythoKatestrose.name
ltx/en_us_dedes/oc.m2.d3:ocMA.OdeW1C2T.mode	@ltx/en_us_dedes/miscellanea:misc.Mode2
ltx/en_us_dedes/oc.m2.d3:ocMA.OdeW1C2T.ode	@ltx/en_us_dedes/miscellanea:misc.Ode1
ltx/en_us_dedes/oc.m2.d3:ocMA.OdeW1C2T.text	
ltx/en_us_dedes/oc.m2.d3:ocMA.OdeW3C11.incipit	…
ltx/en_us_dedes/oc.m2.d3:ocMA.OdeW3C11.melody	@ltx/en_us_dedes/he.h.m2:heHE.SteirothentaMouTonNoun.name
ltx/en_us_dedes/oc.m2.d3:ocMA.OdeW3C11.mode	@ltx/en_us_dedes/miscellanea:misc.Mode2
ltx/en_us_dedes/oc.m2.d3:ocMA.OdeW3C11.ode	@ltx/en_us_dedes/miscellanea:misc.Ode3
ltx/en_us_dedes/oc.m2.d3:ocMA.OdeW3C11.text	
ltx/en_us_dedes/oc.m2.d3:ocMA.OdeW3C12.incipit	…
ltx/en_us_dedes/oc.m2.d3:ocMA.OdeW3C12.melody	@ltx/en_us_dedes/he.h.m2:heHE.SteirothentaMouTonNoun.name
ltx/en_us_dedes/oc.m2.d3:ocMA.OdeW3C12.mode	@ltx/en_us_dedes/miscellanea:misc.Mode2
ltx/en_us_dedes/oc.m2.d3:ocMA.OdeW3C12.ode	@ltx/en_us_dedes/miscellanea:misc.Ode3
ltx/en_us_dedes/oc.m2.d3:ocMA.OdeW3C12.text	
ltx/en_us_dedes/oc.m2.d3:ocMA.OdeW3C13.incipit	…
ltx/en_us_dedes/oc.m2.d3:ocMA.OdeW3C13.melody	@ltx/en_us_dedes/he.h.m2:heHE.SteirothentaMouTonNoun.name
ltx/en_us_dedes/oc.m2.d3:ocMA.OdeW3C13.mode	@ltx/en_us_dedes/miscellanea:misc.Mode2
ltx/en_us_dedes/oc.m2.d3:ocMA.OdeW3C13.ode	@ltx/en_us_dedes/miscellanea:misc.Ode3
ltx/en_us_dedes/oc.m2.d3:ocMA.OdeW3C13.text	
ltx/en_us_dedes/oc.m2.d3:ocMA.OdeW3C14.incipit	…
ltx/en_us_dedes/oc.m2.d3:ocMA.OdeW3C14.melody	@ltx/en_us_dedes/he.h.m2:heHE.SteirothentaMouTonNoun.name
ltx/en_us_dedes/oc.m2.d3:ocMA.OdeW3C14.mode	@ltx/en_us_dedes/miscellanea:misc.Mode2
ltx/en_us_dedes/oc.m2.d3:ocMA.OdeW3C14.ode	@ltx/en_us_dedes/miscellanea:misc.Ode3
ltx/en_us_dedes/oc.m2.d3:ocMA.OdeW3C14.text	
ltx/en_us_dedes/oc.m2.d3:ocMA.OdeW3C1H.greekmelody	@ltx/en_us_dedes/he.h.m2:heHE.SteirothentaMouTonNoun.greekname
ltx/en_us_dedes/oc.m2.d3:ocMA.OdeW3C1H.incipit	@ltx/en_us_dedes/he.h.m2:heHE.SteirothentaMouTonNoun.incipit
ltx/en_us_dedes/oc.m2.d3:ocMA.OdeW3C1H.melody	@ltx/en_us_dedes/he.h.m2:heHE.SteirothentaMouTonNoun.melody
ltx/en_us_dedes/oc.m2.d3:ocMA.OdeW3C1H.mode	@ltx/en_us_dedes/miscellanea:misc.Mode2
ltx/en_us_dedes/oc.m2.d3:ocMA.OdeW3C1H.ode	@ltx/en_us_dedes/miscellanea:misc.Ode3
ltx/en_us_dedes/oc.m2.d3:ocMA.OdeW3C1H.text	@ltx/en_us_dedes/he.h.m2:heHE.SteirothentaMouTonNoun.text
ltx/en_us_dedes/oc.m2.d3:ocMA.OdeW3C1T.incipit	…
ltx/en_us_dedes/oc.m2.d3:ocMA.OdeW3C1T.melody	@ltx/en_us_dedes/he.h.m2:heHE.SteirothentaMouTonNoun.name
ltx/en_us_dedes/oc.m2.d3:ocMA.OdeW3C1T.mode	@ltx/en_us_dedes/miscellanea:misc.Mode2
ltx/en_us_dedes/oc.m2.d3:ocMA.OdeW3C1T.ode	@ltx/en_us_dedes/miscellanea:misc.Ode3
ltx/en_us_dedes/oc.m2.d3:ocMA.OdeW3C1T.text	
ltx/en_us_dedes/oc.m2.d3:ocMA.OdeW3C21.greekmelody	@ltx/en_us_dedes/he.h.m2:heHE.EnPetraMeTisPisteos.greekname
ltx/en_us_dedes/oc.m2.d3:ocMA.OdeW3C21.incipit	…
ltx/en_us_dedes/oc.m2.d3:ocMA.OdeW3C21.melody	@ltx/en_us_dedes/he.h.m2:heHE.EnPetraMeTisPisteos.name
ltx/en_us_dedes/oc.m2.d3:ocMA.OdeW3C21.mode	@ltx/en_us_dedes/miscellanea:misc.Mode2
ltx/en_us_dedes/oc.m2.d3:ocMA.OdeW3C21.ode	@ltx/en_us_dedes/miscellanea:misc.Ode3
ltx/en_us_dedes/oc.m2.d3:ocMA.OdeW3C21.text	
ltx/en_us_dedes/oc.m2.d3:ocMA.OdeW3C22.incipit	…
ltx/en_us_dedes/oc.m2.d3:ocMA.OdeW3C22.melody	@ltx/en_us_dedes/he.h.m2:heHE.EnPetraMeTisPisteos.name
ltx/en_us_dedes/oc.m2.d3:ocMA.OdeW3C22.mode	@ltx/en_us_dedes/miscellanea:misc.Mode2
ltx/en_us_dedes/oc.m2.d3:ocMA.OdeW3C22.ode	@ltx/en_us_dedes/miscellanea:misc.Ode3
ltx/en_us_dedes/oc.m2.d3:ocMA.OdeW3C22.text	
ltx/en_us_dedes/oc.m2.d3:ocMA.OdeW3C23.incipit	…
ltx/en_us_dedes/oc.m2.d3:ocMA.OdeW3C23.melody	@ltx/en_us_dedes/he.h.m2:heHE.EnPetraMeTisPisteos.name
ltx/en_us_dedes/oc.m2.d3:ocMA.OdeW3C23.mode	@ltx/en_us_dedes/miscellanea:misc.Mode2
ltx/en_us_dedes/oc.m2.d3:ocMA.OdeW3C23.ode	@ltx/en_us_dedes/miscellanea:misc.Ode3
ltx/en_us_dedes/oc.m2.d3:ocMA.OdeW3C23.text	
ltx/en_us_dedes/oc.m2.d3:ocMA.OdeW3C2T.incipit	…
ltx/en_us_dedes/oc.m2.d3:ocMA.OdeW3C2T.melody	@ltx/en_us_dedes/he.h.m2:heHE.EnPetraMeTisPisteos.name
ltx/en_us_dedes/oc.m2.d3:ocMA.OdeW3C2T.mode	@ltx/en_us_dedes/miscellanea:misc.Mode2
ltx/en_us_dedes/oc.m2.d3:ocMA.OdeW3C2T.ode	@ltx/en_us_dedes/miscellanea:misc.Ode3
ltx/en_us_dedes/oc.m2.d3:ocMA.OdeW3C2T.text	
ltx/en_us_dedes/oc.m2.d3:ocMA.OdeW4C11.incipit	…
ltx/en_us_dedes/oc.m2.d3:ocMA.OdeW4C11.melody	@ltx/en_us_dedes/he.h.m2:heHE.TinEkParthenou.name
ltx/en_us_dedes/oc.m2.d3:ocMA.OdeW4C11.mode	@ltx/en_us_dedes/miscellanea:misc.Mode2
ltx/en_us_dedes/oc.m2.d3:ocMA.OdeW4C11.ode	@ltx/en_us_dedes/miscellanea:misc.Ode4
ltx/en_us_dedes/oc.m2.d3:ocMA.OdeW4C11.text	
ltx/en_us_dedes/oc.m2.d3:ocMA.OdeW4C12.incipit	…
ltx/en_us_dedes/oc.m2.d3:ocMA.OdeW4C12.melody	@ltx/en_us_dedes/he.h.m2:heHE.TinEkParthenou.name
ltx/en_us_dedes/oc.m2.d3:ocMA.OdeW4C12.mode	@ltx/en_us_dedes/miscellanea:misc.Mode2
ltx/en_us_dedes/oc.m2.d3:ocMA.OdeW4C12.ode	@ltx/en_us_dedes/miscellanea:misc.Ode4
ltx/en_us_dedes/oc.m2.d3:ocMA.OdeW4C12.text	
ltx/en_us_dedes/oc.m2.d3:ocMA.OdeW4C13.incipit	…
ltx/en_us_dedes/oc.m2.d3:ocMA.OdeW4C13.melody	@ltx/en_us_dedes/he.h.m2:heHE.TinEkParthenou.name
ltx/en_us_dedes/oc.m2.d3:ocMA.OdeW4C13.mode	@ltx/en_us_dedes/miscellanea:misc.Mode2
ltx/en_us_dedes/oc.m2.d3:ocMA.OdeW4C13.ode	@ltx/en_us_dedes/miscellanea:misc.Ode4
ltx/en_us_dedes/oc.m2.d3:ocMA.OdeW4C13.text	
ltx/en_us_dedes/oc.m2.d3:ocMA.OdeW4C14.incipit	…
ltx/en_us_dedes/oc.m2.d3:ocMA.OdeW4C14.melody	@ltx/en_us_dedes/he.h.m2:heHE.TinEkParthenou.name
ltx/en_us_dedes/oc.m2.d3:ocMA.OdeW4C14.mode	@ltx/en_us_dedes/miscellanea:misc.Mode2
ltx/en_us_dedes/oc.m2.d3:ocMA.OdeW4C14.ode	@ltx/en_us_dedes/miscellanea:misc.Ode4
ltx/en_us_dedes/oc.m2.d3:ocMA.OdeW4C14.text	
ltx/en_us_dedes/oc.m2.d3:ocMA.OdeW4C1H.greekmelody	@ltx/en_us_dedes/he.h.m2:heHE.TinEkParthenou.greekname
ltx/en_us_dedes/oc.m2.d3:ocMA.OdeW4C1H.incipit	@ltx/en_us_dedes/he.h.m2:heHE.TinEkParthenou.incipit
ltx/en_us_dedes/oc.m2.d3:ocMA.OdeW4C1H.melody	@ltx/en_us_dedes/he.h.m2:heHE.TinEkParthenou.melody
ltx/en_us_dedes/oc.m2.d3:ocMA.OdeW4C1H.mode	@ltx/en_us_dedes/miscellanea:misc.Mode2
ltx/en_us_dedes/oc.m2.d3:ocMA.OdeW4C1H.ode	@ltx/en_us_dedes/miscellanea:misc.Ode4
ltx/en_us_dedes/oc.m2.d3:ocMA.OdeW4C1H.text	@ltx/en_us_dedes/he.h.m2:heHE.TinEkParthenou.text
ltx/en_us_dedes/oc.m2.d3:ocMA.OdeW4C1T.incipit	…
ltx/en_us_dedes/oc.m2.d3:ocMA.OdeW4C1T.melody	@ltx/en_us_dedes/he.h.m2:heHE.TinEkParthenou.name
ltx/en_us_dedes/oc.m2.d3:ocMA.OdeW4C1T.mode	@ltx/en_us_dedes/miscellanea:misc.Mode2
ltx/en_us_dedes/oc.m2.d3:ocMA.OdeW4C1T.ode	@ltx/en_us_dedes/miscellanea:misc.Ode4
ltx/en_us_dedes/oc.m2.d3:ocMA.OdeW4C1T.text	
ltx/en_us_dedes/oc.m2.d3:ocMA.OdeW4C21.greekmelody	@ltx/en_us_dedes/he.h.m2:heHE.ElilythasEkParthenou.greekname
ltx/en_us_dedes/oc.m2.d3:ocMA.OdeW4C21.incipit	…
ltx/en_us_dedes/oc.m2.d3:ocMA.OdeW4C21.melody	@ltx/en_us_dedes/he.h.m2:heHE.ElilythasEkParthenou.name
ltx/en_us_dedes/oc.m2.d3:ocMA.OdeW4C21.mode	@ltx/en_us_dedes/miscellanea:misc.Mode2
ltx/en_us_dedes/oc.m2.d3:ocMA.OdeW4C21.ode	@ltx/en_us_dedes/miscellanea:misc.Ode4
ltx/en_us_dedes/oc.m2.d3:ocMA.OdeW4C21.text	
ltx/en_us_dedes/oc.m2.d3:ocMA.OdeW4C22.incipit	…
ltx/en_us_dedes/oc.m2.d3:ocMA.OdeW4C22.melody	@ltx/en_us_dedes/he.h.m2:heHE.ElilythasEkParthenou.name
ltx/en_us_dedes/oc.m2.d3:ocMA.OdeW4C22.mode	@ltx/en_us_dedes/miscellanea:misc.Mode2
ltx/en_us_dedes/oc.m2.d3:ocMA.OdeW4C22.ode	@ltx/en_us_dedes/miscellanea:misc.Ode4
ltx/en_us_dedes/oc.m2.d3:ocMA.OdeW4C22.text	
ltx/en_us_dedes/oc.m2.d3:ocMA.OdeW4C23.incipit	…
ltx/en_us_dedes/oc.m2.d3:ocMA.OdeW4C23.melody	@ltx/en_us_dedes/he.h.m2:heHE.ElilythasEkParthenou.name
ltx/en_us_dedes/oc.m2.d3:ocMA.OdeW4C23.mode	@ltx/en_us_dedes/miscellanea:misc.Mode2
ltx/en_us_dedes/oc.m2.d3:ocMA.OdeW4C23.ode	@ltx/en_us_dedes/miscellanea:misc.Ode4
ltx/en_us_dedes/oc.m2.d3:ocMA.OdeW4C23.text	
ltx/en_us_dedes/oc.m2.d3:ocMA.OdeW4C24.incipit	…
ltx/en_us_dedes/oc.m2.d3:ocMA.OdeW4C24.melody	@ltx/en_us_dedes/he.h.m2:heHE.ElilythasEkParthenou.name
ltx/en_us_dedes/oc.m2.d3:ocMA.OdeW4C24.mode	@ltx/en_us_dedes/miscellanea:misc.Mode2
ltx/en_us_dedes/oc.m2.d3:ocMA.OdeW4C24.ode	@ltx/en_us_dedes/miscellanea:misc.Ode4
ltx/en_us_dedes/oc.m2.d3:ocMA.OdeW4C24.text	
ltx/en_us_dedes/oc.m2.d3:ocMA.OdeW4C2T.incipit	…
ltx/en_us_dedes/oc.m2.d3:ocMA.OdeW4C2T.melody	@ltx/en_us_dedes/he.h.m2:heHE.ElilythasEkParthenou.name
ltx/en_us_dedes/oc.m2.d3:ocMA.OdeW4C2T.mode	@ltx/en_us_dedes/miscellanea:misc.Mode2
ltx/en_us_dedes/oc.m2.d3:ocMA.OdeW4C2T.ode	@ltx/en_us_dedes/miscellanea:misc.Ode4
ltx/en_us_dedes/oc.m2.d3:ocMA.OdeW4C2T.text	
ltx/en_us_dedes/oc.m2.d3:ocMA.OdeW5C11.incipit	…
ltx/en_us_dedes/oc.m2.d3:ocMA.OdeW5C11.melody	@ltx/en_us_dedes/he.h.m2:heHE.TinAchlynTisPsychisMou.name
ltx/en_us_dedes/oc.m2.d3:ocMA.OdeW5C11.mode	@ltx/en_us_dedes/miscellanea:misc.Mode2
ltx/en_us_dedes/oc.m2.d3:ocMA.OdeW5C11.ode	@ltx/en_us_dedes/miscellanea:misc.Ode5
ltx/en_us_dedes/oc.m2.d3:ocMA.OdeW5C11.text	
ltx/en_us_dedes/oc.m2.d3:ocMA.OdeW5C12.incipit	…
ltx/en_us_dedes/oc.m2.d3:ocMA.OdeW5C12.melody	@ltx/en_us_dedes/he.h.m2:heHE.TinAchlynTisPsychisMou.name
ltx/en_us_dedes/oc.m2.d3:ocMA.OdeW5C12.mode	@ltx/en_us_dedes/miscellanea:misc.Mode2
ltx/en_us_dedes/oc.m2.d3:ocMA.OdeW5C12.ode	@ltx/en_us_dedes/miscellanea:misc.Ode5
ltx/en_us_dedes/oc.m2.d3:ocMA.OdeW5C12.text	
ltx/en_us_dedes/oc.m2.d3:ocMA.OdeW5C13.incipit	…
ltx/en_us_dedes/oc.m2.d3:ocMA.OdeW5C13.melody	@ltx/en_us_dedes/he.h.m2:heHE.TinAchlynTisPsychisMou.name
ltx/en_us_dedes/oc.m2.d3:ocMA.OdeW5C13.mode	@ltx/en_us_dedes/miscellanea:misc.Mode2
ltx/en_us_dedes/oc.m2.d3:ocMA.OdeW5C13.ode	@ltx/en_us_dedes/miscellanea:misc.Ode5
ltx/en_us_dedes/oc.m2.d3:ocMA.OdeW5C13.text	
ltx/en_us_dedes/oc.m2.d3:ocMA.OdeW5C14.incipit	…
ltx/en_us_dedes/oc.m2.d3:ocMA.OdeW5C14.melody	@ltx/en_us_dedes/he.h.m2:heHE.TinAchlynTisPsychisMou.name
ltx/en_us_dedes/oc.m2.d3:ocMA.OdeW5C14.mode	@ltx/en_us_dedes/miscellanea:misc.Mode2
ltx/en_us_dedes/oc.m2.d3:ocMA.OdeW5C14.ode	@ltx/en_us_dedes/miscellanea:misc.Ode5
ltx/en_us_dedes/oc.m2.d3:ocMA.OdeW5C14.text	
ltx/en_us_dedes/oc.m2.d3:ocMA.OdeW5C1H.greekmelody	@ltx/en_us_dedes/he.h.m2:heHE.TinAchlynTisPsychisMou.greekname
ltx/en_us_dedes/oc.m2.d3:ocMA.OdeW5C1H.incipit	@ltx/en_us_dedes/he.h.m2:heHE.TinAchlynTisPsychisMou.incipit
ltx/en_us_dedes/oc.m2.d3:ocMA.OdeW5C1H.melody	@ltx/en_us_dedes/he.h.m2:heHE.TinAchlynTisPsychisMou.melody
ltx/en_us_dedes/oc.m2.d3:ocMA.OdeW5C1H.mode	@ltx/en_us_dedes/miscellanea:misc.Mode2
ltx/en_us_dedes/oc.m2.d3:ocMA.OdeW5C1H.ode	@ltx/en_us_dedes/miscellanea:misc.Ode5
ltx/en_us_dedes/oc.m2.d3:ocMA.OdeW5C1H.text	@ltx/en_us_dedes/he.h.m2:heHE.TinAchlynTisPsychisMou.text
ltx/en_us_dedes/oc.m2.d3:ocMA.OdeW5C1T.incipit	…
ltx/en_us_dedes/oc.m2.d3:ocMA.OdeW5C1T.melody	@ltx/en_us_dedes/he.h.m2:heHE.TinAchlynTisPsychisMou.name
ltx/en_us_dedes/oc.m2.d3:ocMA.OdeW5C1T.mode	@ltx/en_us_dedes/miscellanea:misc.Mode2
ltx/en_us_dedes/oc.m2.d3:ocMA.OdeW5C1T.ode	@ltx/en_us_dedes/miscellanea:misc.Ode5
ltx/en_us_dedes/oc.m2.d3:ocMA.OdeW5C1T.text	
ltx/en_us_dedes/oc.m2.d3:ocMA.OdeW5C21.greekmelody	@ltx/en_us_dedes/he.h.m2:heHE.OFotismos.greekname
ltx/en_us_dedes/oc.m2.d3:ocMA.OdeW5C21.incipit	…
ltx/en_us_dedes/oc.m2.d3:ocMA.OdeW5C21.melody	@ltx/en_us_dedes/he.h.m2:heHE.OFotismos.name
ltx/en_us_dedes/oc.m2.d3:ocMA.OdeW5C21.mode	@ltx/en_us_dedes/miscellanea:misc.Mode2
ltx/en_us_dedes/oc.m2.d3:ocMA.OdeW5C21.ode	@ltx/en_us_dedes/miscellanea:misc.Ode5
ltx/en_us_dedes/oc.m2.d3:ocMA.OdeW5C21.text	
ltx/en_us_dedes/oc.m2.d3:ocMA.OdeW5C22.incipit	…
ltx/en_us_dedes/oc.m2.d3:ocMA.OdeW5C22.melody	@ltx/en_us_dedes/he.h.m2:heHE.OFotismos.name
ltx/en_us_dedes/oc.m2.d3:ocMA.OdeW5C22.mode	@ltx/en_us_dedes/miscellanea:misc.Mode2
ltx/en_us_dedes/oc.m2.d3:ocMA.OdeW5C22.ode	@ltx/en_us_dedes/miscellanea:misc.Ode5
ltx/en_us_dedes/oc.m2.d3:ocMA.OdeW5C22.text	
ltx/en_us_dedes/oc.m2.d3:ocMA.OdeW5C23.incipit	…
ltx/en_us_dedes/oc.m2.d3:ocMA.OdeW5C23.melody	@ltx/en_us_dedes/he.h.m2:heHE.OFotismos.name
ltx/en_us_dedes/oc.m2.d3:ocMA.OdeW5C23.mode	@ltx/en_us_dedes/miscellanea:misc.Mode2
ltx/en_us_dedes/oc.m2.d3:ocMA.OdeW5C23.ode	@ltx/en_us_dedes/miscellanea:misc.Ode5
ltx/en_us_dedes/oc.m2.d3:ocMA.OdeW5C23.text	
ltx/en_us_dedes/oc.m2.d3:ocMA.OdeW5C24.incipit	…
ltx/en_us_dedes/oc.m2.d3:ocMA.OdeW5C24.melody	@ltx/en_us_dedes/he.h.m2:heHE.OFotismos.name
ltx/en_us_dedes/oc.m2.d3:ocMA.OdeW5C24.mode	@ltx/en_us_dedes/miscellanea:misc.Mode2
ltx/en_us_dedes/oc.m2.d3:ocMA.OdeW5C24.ode	@ltx/en_us_dedes/miscellanea:misc.Ode5
ltx/en_us_dedes/oc.m2.d3:ocMA.OdeW5C24.text	
ltx/en_us_dedes/oc.m2.d3:ocMA.OdeW5C2T.incipit	…
ltx/en_us_dedes/oc.m2.d3:ocMA.OdeW5C2T.melody	@ltx/en_us_dedes/he.h.m2:heHE.OFotismos.name
ltx/en_us_dedes/oc.m2.d3:ocMA.OdeW5C2T.mode	@ltx/en_us_dedes/miscellanea:misc.Mode2
ltx/en_us_dedes/oc.m2.d3:ocMA.OdeW5C2T.ode	@ltx/en_us_dedes/miscellanea:misc.Ode5
ltx/en_us_dedes/oc.m2.d3:ocMA.OdeW5C2T.text	
ltx/en_us_dedes/oc.m2.d3:ocMA.OdeW6C11.incipit	…
ltx/en_us_dedes/oc.m2.d3:ocMA.OdeW6C11.melody	@ltx/en_us_dedes/he.h.m2:heHE.VythoAmartimaton.name
ltx/en_us_dedes/oc.m2.d3:ocMA.OdeW6C11.mode	@ltx/en_us_dedes/miscellanea:misc.Mode2
ltx/en_us_dedes/oc.m2.d3:ocMA.OdeW6C11.ode	@ltx/en_us_dedes/miscellanea:misc.Ode6
ltx/en_us_dedes/oc.m2.d3:ocMA.OdeW6C11.text	
ltx/en_us_dedes/oc.m2.d3:ocMA.OdeW6C12.incipit	…
ltx/en_us_dedes/oc.m2.d3:ocMA.OdeW6C12.melody	@ltx/en_us_dedes/he.h.m2:heHE.VythoAmartimaton.name
ltx/en_us_dedes/oc.m2.d3:ocMA.OdeW6C12.mode	@ltx/en_us_dedes/miscellanea:misc.Mode2
ltx/en_us_dedes/oc.m2.d3:ocMA.OdeW6C12.ode	@ltx/en_us_dedes/miscellanea:misc.Ode6
ltx/en_us_dedes/oc.m2.d3:ocMA.OdeW6C12.text	
ltx/en_us_dedes/oc.m2.d3:ocMA.OdeW6C13.incipit	…
ltx/en_us_dedes/oc.m2.d3:ocMA.OdeW6C13.melody	@ltx/en_us_dedes/he.h.m2:heHE.VythoAmartimaton.name
ltx/en_us_dedes/oc.m2.d3:ocMA.OdeW6C13.mode	@ltx/en_us_dedes/miscellanea:misc.Mode2
ltx/en_us_dedes/oc.m2.d3:ocMA.OdeW6C13.ode	@ltx/en_us_dedes/miscellanea:misc.Ode6
ltx/en_us_dedes/oc.m2.d3:ocMA.OdeW6C13.text	
ltx/en_us_dedes/oc.m2.d3:ocMA.OdeW6C14.incipit	…
ltx/en_us_dedes/oc.m2.d3:ocMA.OdeW6C14.melody	@ltx/en_us_dedes/he.h.m2:heHE.VythoAmartimaton.name
ltx/en_us_dedes/oc.m2.d3:ocMA.OdeW6C14.mode	@ltx/en_us_dedes/miscellanea:misc.Mode2
ltx/en_us_dedes/oc.m2.d3:ocMA.OdeW6C14.ode	@ltx/en_us_dedes/miscellanea:misc.Ode6
ltx/en_us_dedes/oc.m2.d3:ocMA.OdeW6C14.text	
ltx/en_us_dedes/oc.m2.d3:ocMA.OdeW6C1H.greekmelody	@ltx/en_us_dedes/he.h.m2:heHE.VythoAmartimaton.greekname
ltx/en_us_dedes/oc.m2.d3:ocMA.OdeW6C1H.incipit	@ltx/en_us_dedes/he.h.m2:heHE.VythoAmartimaton.incipit
ltx/en_us_dedes/oc.m2.d3:ocMA.OdeW6C1H.melody	@ltx/en_us_dedes/he.h.m2:heHE.VythoAmartimaton.melody
ltx/en_us_dedes/oc.m2.d3:ocMA.OdeW6C1H.mode	@ltx/en_us_dedes/miscellanea:misc.Mode2
ltx/en_us_dedes/oc.m2.d3:ocMA.OdeW6C1H.ode	@ltx/en_us_dedes/miscellanea:misc.Ode6
ltx/en_us_dedes/oc.m2.d3:ocMA.OdeW6C1H.text	@ltx/en_us_dedes/he.h.m2:heHE.VythoAmartimaton.text
ltx/en_us_dedes/oc.m2.d3:ocMA.OdeW6C1T.incipit	…
ltx/en_us_dedes/oc.m2.d3:ocMA.OdeW6C1T.melody	@ltx/en_us_dedes/he.h.m2:heHE.VythoAmartimaton.name
ltx/en_us_dedes/oc.m2.d3:ocMA.OdeW6C1T.mode	@ltx/en_us_dedes/miscellanea:misc.Mode2
ltx/en_us_dedes/oc.m2.d3:ocMA.OdeW6C1T.ode	@ltx/en_us_dedes/miscellanea:misc.Ode6
ltx/en_us_dedes/oc.m2.d3:ocMA.OdeW6C1T.text	
ltx/en_us_dedes/oc.m2.d3:ocMA.OdeW6C21.greekmelody	@ltx/en_us_dedes/he.h.m2:heHE.EnAvyssoPtaismaton.greekname
ltx/en_us_dedes/oc.m2.d3:ocMA.OdeW6C21.incipit	…
ltx/en_us_dedes/oc.m2.d3:ocMA.OdeW6C21.melody	@ltx/en_us_dedes/he.h.m2:heHE.EnAvyssoPtaismaton.name
ltx/en_us_dedes/oc.m2.d3:ocMA.OdeW6C21.mode	@ltx/en_us_dedes/miscellanea:misc.Mode2
ltx/en_us_dedes/oc.m2.d3:ocMA.OdeW6C21.ode	@ltx/en_us_dedes/miscellanea:misc.Ode6
ltx/en_us_dedes/oc.m2.d3:ocMA.OdeW6C21.text	
ltx/en_us_dedes/oc.m2.d3:ocMA.OdeW6C22.incipit	…
ltx/en_us_dedes/oc.m2.d3:ocMA.OdeW6C22.melody	@ltx/en_us_dedes/he.h.m2:heHE.EnAvyssoPtaismaton.name
ltx/en_us_dedes/oc.m2.d3:ocMA.OdeW6C22.mode	@ltx/en_us_dedes/miscellanea:misc.Mode2
ltx/en_us_dedes/oc.m2.d3:ocMA.OdeW6C22.ode	@ltx/en_us_dedes/miscellanea:misc.Ode6
ltx/en_us_dedes/oc.m2.d3:ocMA.OdeW6C22.text	
ltx/en_us_dedes/oc.m2.d3:ocMA.OdeW6C23.incipit	…
ltx/en_us_dedes/oc.m2.d3:ocMA.OdeW6C23.melody	@ltx/en_us_dedes/he.h.m2:heHE.EnAvyssoPtaismaton.name
ltx/en_us_dedes/oc.m2.d3:ocMA.OdeW6C23.mode	@ltx/en_us_dedes/miscellanea:misc.Mode2
ltx/en_us_dedes/oc.m2.d3:ocMA.OdeW6C23.ode	@ltx/en_us_dedes/miscellanea:misc.Ode6
ltx/en_us_dedes/oc.m2.d3:ocMA.OdeW6C23.text	
ltx/en_us_dedes/oc.m2.d3:ocMA.OdeW6C2T.incipit	…
ltx/en_us_dedes/oc.m2.d3:ocMA.OdeW6C2T.melody	@ltx/en_us_dedes/he.h.m2:heHE.EnAvyssoPtaismaton.name
ltx/en_us_dedes/oc.m2.d3:ocMA.OdeW6C2T.mode	@ltx/en_us_dedes/miscellanea:misc.Mode2
ltx/en_us_dedes/oc.m2.d3:ocMA.OdeW6C2T.ode	@ltx/en_us_dedes/miscellanea:misc.Ode6
ltx/en_us_dedes/oc.m2.d3:ocMA.OdeW6C2T.text	
ltx/en_us_dedes/oc.m2.d3:ocMA.OdeW7C11.incipit	…
ltx/en_us_dedes/oc.m2.d3:ocMA.OdeW7C11.melody	@ltx/en_us_dedes/he.h.m2:heHE.TaCherouvimMimoumenoi.name
ltx/en_us_dedes/oc.m2.d3:ocMA.OdeW7C11.mode	@ltx/en_us_dedes/miscellanea:misc.Mode2
ltx/en_us_dedes/oc.m2.d3:ocMA.OdeW7C11.ode	@ltx/en_us_dedes/miscellanea:misc.Ode7
ltx/en_us_dedes/oc.m2.d3:ocMA.OdeW7C11.text	
ltx/en_us_dedes/oc.m2.d3:ocMA.OdeW7C12.incipit	…
ltx/en_us_dedes/oc.m2.d3:ocMA.OdeW7C12.melody	@ltx/en_us_dedes/he.h.m2:heHE.TaCherouvimMimoumenoi.name
ltx/en_us_dedes/oc.m2.d3:ocMA.OdeW7C12.mode	@ltx/en_us_dedes/miscellanea:misc.Mode2
ltx/en_us_dedes/oc.m2.d3:ocMA.OdeW7C12.ode	@ltx/en_us_dedes/miscellanea:misc.Ode7
ltx/en_us_dedes/oc.m2.d3:ocMA.OdeW7C12.text	
ltx/en_us_dedes/oc.m2.d3:ocMA.OdeW7C13.incipit	…
ltx/en_us_dedes/oc.m2.d3:ocMA.OdeW7C13.melody	@ltx/en_us_dedes/he.h.m2:heHE.TaCherouvimMimoumenoi.name
ltx/en_us_dedes/oc.m2.d3:ocMA.OdeW7C13.mode	@ltx/en_us_dedes/miscellanea:misc.Mode2
ltx/en_us_dedes/oc.m2.d3:ocMA.OdeW7C13.ode	@ltx/en_us_dedes/miscellanea:misc.Ode7
ltx/en_us_dedes/oc.m2.d3:ocMA.OdeW7C13.text	
ltx/en_us_dedes/oc.m2.d3:ocMA.OdeW7C14.incipit	…
ltx/en_us_dedes/oc.m2.d3:ocMA.OdeW7C14.melody	@ltx/en_us_dedes/he.h.m2:heHE.TaCherouvimMimoumenoi.name
ltx/en_us_dedes/oc.m2.d3:ocMA.OdeW7C14.mode	@ltx/en_us_dedes/miscellanea:misc.Mode2
ltx/en_us_dedes/oc.m2.d3:ocMA.OdeW7C14.ode	@ltx/en_us_dedes/miscellanea:misc.Ode7
ltx/en_us_dedes/oc.m2.d3:ocMA.OdeW7C14.text	
ltx/en_us_dedes/oc.m2.d3:ocMA.OdeW7C1H.greekmelody	@ltx/en_us_dedes/he.h.m2:heHE.TaCherouvimMimoumenoi.greekname
ltx/en_us_dedes/oc.m2.d3:ocMA.OdeW7C1H.incipit	@ltx/en_us_dedes/he.h.m2:heHE.TaCherouvimMimoumenoi.incipit
ltx/en_us_dedes/oc.m2.d3:ocMA.OdeW7C1H.melody	@ltx/en_us_dedes/he.h.m2:heHE.TaCherouvimMimoumenoi.melody
ltx/en_us_dedes/oc.m2.d3:ocMA.OdeW7C1H.mode	@ltx/en_us_dedes/miscellanea:misc.Mode2
ltx/en_us_dedes/oc.m2.d3:ocMA.OdeW7C1H.ode	@ltx/en_us_dedes/miscellanea:misc.Ode7
ltx/en_us_dedes/oc.m2.d3:ocMA.OdeW7C1H.text	@ltx/en_us_dedes/he.h.m2:heHE.TaCherouvimMimoumenoi.text
ltx/en_us_dedes/oc.m2.d3:ocMA.OdeW7C1T.incipit	…
ltx/en_us_dedes/oc.m2.d3:ocMA.OdeW7C1T.melody	@ltx/en_us_dedes/he.h.m2:heHE.TaCherouvimMimoumenoi.name
ltx/en_us_dedes/oc.m2.d3:ocMA.OdeW7C1T.mode	@ltx/en_us_dedes/miscellanea:misc.Mode2
ltx/en_us_dedes/oc.m2.d3:ocMA.OdeW7C1T.ode	@ltx/en_us_dedes/miscellanea:misc.Ode7
ltx/en_us_dedes/oc.m2.d3:ocMA.OdeW7C1T.text	
ltx/en_us_dedes/oc.m2.d3:ocMA.OdeW7C21.greekmelody	@ltx/en_us_dedes/he.h.m2:heHE.AntitheonProstagma.greekname
ltx/en_us_dedes/oc.m2.d3:ocMA.OdeW7C21.incipit	…
ltx/en_us_dedes/oc.m2.d3:ocMA.OdeW7C21.melody	@ltx/en_us_dedes/he.h.m2:heHE.AntitheonProstagma.name
ltx/en_us_dedes/oc.m2.d3:ocMA.OdeW7C21.mode	@ltx/en_us_dedes/miscellanea:misc.Mode2
ltx/en_us_dedes/oc.m2.d3:ocMA.OdeW7C21.ode	@ltx/en_us_dedes/miscellanea:misc.Ode7
ltx/en_us_dedes/oc.m2.d3:ocMA.OdeW7C21.text	
ltx/en_us_dedes/oc.m2.d3:ocMA.OdeW7C22.incipit	…
ltx/en_us_dedes/oc.m2.d3:ocMA.OdeW7C22.melody	@ltx/en_us_dedes/he.h.m2:heHE.AntitheonProstagma.name
ltx/en_us_dedes/oc.m2.d3:ocMA.OdeW7C22.mode	@ltx/en_us_dedes/miscellanea:misc.Mode2
ltx/en_us_dedes/oc.m2.d3:ocMA.OdeW7C22.ode	@ltx/en_us_dedes/miscellanea:misc.Ode7
ltx/en_us_dedes/oc.m2.d3:ocMA.OdeW7C22.text	
ltx/en_us_dedes/oc.m2.d3:ocMA.OdeW7C23.incipit	…
ltx/en_us_dedes/oc.m2.d3:ocMA.OdeW7C23.melody	@ltx/en_us_dedes/he.h.m2:heHE.AntitheonProstagma.name
ltx/en_us_dedes/oc.m2.d3:ocMA.OdeW7C23.mode	@ltx/en_us_dedes/miscellanea:misc.Mode2
ltx/en_us_dedes/oc.m2.d3:ocMA.OdeW7C23.ode	@ltx/en_us_dedes/miscellanea:misc.Ode7
ltx/en_us_dedes/oc.m2.d3:ocMA.OdeW7C23.text	
ltx/en_us_dedes/oc.m2.d3:ocMA.OdeW7C2T.incipit	…
ltx/en_us_dedes/oc.m2.d3:ocMA.OdeW7C2T.melody	@ltx/en_us_dedes/he.h.m2:heHE.AntitheonProstagma.name
ltx/en_us_dedes/oc.m2.d3:ocMA.OdeW7C2T.mode	@ltx/en_us_dedes/miscellanea:misc.Mode2
ltx/en_us_dedes/oc.m2.d3:ocMA.OdeW7C2T.ode	@ltx/en_us_dedes/miscellanea:misc.Ode7
ltx/en_us_dedes/oc.m2.d3:ocMA.OdeW7C2T.text	
ltx/en_us_dedes/oc.m2.d3:ocMA.OdeW8C11.incipit	…
ltx/en_us_dedes/oc.m2.d3:ocMA.OdeW8C11.melody	@ltx/en_us_dedes/he.h.m2:heHE.TonEnTiVatoMosi.name
ltx/en_us_dedes/oc.m2.d3:ocMA.OdeW8C11.mode	@ltx/en_us_dedes/miscellanea:misc.Mode2
ltx/en_us_dedes/oc.m2.d3:ocMA.OdeW8C11.ode	@ltx/en_us_dedes/miscellanea:misc.Ode8
ltx/en_us_dedes/oc.m2.d3:ocMA.OdeW8C11.text	
ltx/en_us_dedes/oc.m2.d3:ocMA.OdeW8C12.incipit	…
ltx/en_us_dedes/oc.m2.d3:ocMA.OdeW8C12.melody	@ltx/en_us_dedes/he.h.m2:heHE.TonEnTiVatoMosi.name
ltx/en_us_dedes/oc.m2.d3:ocMA.OdeW8C12.mode	@ltx/en_us_dedes/miscellanea:misc.Mode2
ltx/en_us_dedes/oc.m2.d3:ocMA.OdeW8C12.ode	@ltx/en_us_dedes/miscellanea:misc.Ode8
ltx/en_us_dedes/oc.m2.d3:ocMA.OdeW8C12.text	
ltx/en_us_dedes/oc.m2.d3:ocMA.OdeW8C13.incipit	…
ltx/en_us_dedes/oc.m2.d3:ocMA.OdeW8C13.melody	@ltx/en_us_dedes/he.h.m2:heHE.TonEnTiVatoMosi.name
ltx/en_us_dedes/oc.m2.d3:ocMA.OdeW8C13.mode	@ltx/en_us_dedes/miscellanea:misc.Mode2
ltx/en_us_dedes/oc.m2.d3:ocMA.OdeW8C13.ode	@ltx/en_us_dedes/miscellanea:misc.Ode8
ltx/en_us_dedes/oc.m2.d3:ocMA.OdeW8C13.text	
ltx/en_us_dedes/oc.m2.d3:ocMA.OdeW8C14.incipit	…
ltx/en_us_dedes/oc.m2.d3:ocMA.OdeW8C14.melody	@ltx/en_us_dedes/he.h.m2:heHE.TonEnTiVatoMosi.name
ltx/en_us_dedes/oc.m2.d3:ocMA.OdeW8C14.mode	@ltx/en_us_dedes/miscellanea:misc.Mode2
ltx/en_us_dedes/oc.m2.d3:ocMA.OdeW8C14.ode	@ltx/en_us_dedes/miscellanea:misc.Ode8
ltx/en_us_dedes/oc.m2.d3:ocMA.OdeW8C14.text	
ltx/en_us_dedes/oc.m2.d3:ocMA.OdeW8C1H.greekmelody	@ltx/en_us_dedes/he.h.m2:heHE.TonEnTiVatoMosi.greekname
ltx/en_us_dedes/oc.m2.d3:ocMA.OdeW8C1H.incipit	@ltx/en_us_dedes/he.h.m2:heHE.TonEnTiVatoMosi.incipit
ltx/en_us_dedes/oc.m2.d3:ocMA.OdeW8C1H.melody	@ltx/en_us_dedes/he.h.m2:heHE.TonEnTiVatoMosi.melody
ltx/en_us_dedes/oc.m2.d3:ocMA.OdeW8C1H.mode	@ltx/en_us_dedes/miscellanea:misc.Mode2
ltx/en_us_dedes/oc.m2.d3:ocMA.OdeW8C1H.ode	@ltx/en_us_dedes/miscellanea:misc.Ode8
ltx/en_us_dedes/oc.m2.d3:ocMA.OdeW8C1H.text	@ltx/en_us_dedes/he.h.m2:heHE.TonEnTiVatoMosi.text
ltx/en_us_dedes/oc.m2.d3:ocMA.OdeW8C1T.incipit	…
ltx/en_us_dedes/oc.m2.d3:ocMA.OdeW8C1T.melody	@ltx/en_us_dedes/he.h.m2:heHE.TonEnTiVatoMosi.name
ltx/en_us_dedes/oc.m2.d3:ocMA.OdeW8C1T.mode	@ltx/en_us_dedes/miscellanea:misc.Mode2
ltx/en_us_dedes/oc.m2.d3:ocMA.OdeW8C1T.ode	@ltx/en_us_dedes/miscellanea:misc.Ode8
ltx/en_us_dedes/oc.m2.d3:ocMA.OdeW8C1T.text	
ltx/en_us_dedes/oc.m2.d3:ocMA.OdeW8C21.greekmelody	@ltx/en_us_dedes/he.h.m2:heHE.KaminosPote.greekname
ltx/en_us_dedes/oc.m2.d3:ocMA.OdeW8C21.incipit	…
ltx/en_us_dedes/oc.m2.d3:ocMA.OdeW8C21.melody	@ltx/en_us_dedes/he.h.m2:heHE.KaminosPote.name
ltx/en_us_dedes/oc.m2.d3:ocMA.OdeW8C21.mode	@ltx/en_us_dedes/miscellanea:misc.Mode2
ltx/en_us_dedes/oc.m2.d3:ocMA.OdeW8C21.ode	@ltx/en_us_dedes/miscellanea:misc.Ode8
ltx/en_us_dedes/oc.m2.d3:ocMA.OdeW8C21.text	
ltx/en_us_dedes/oc.m2.d3:ocMA.OdeW8C22.incipit	…
ltx/en_us_dedes/oc.m2.d3:ocMA.OdeW8C22.melody	@ltx/en_us_dedes/he.h.m2:heHE.KaminosPote.name
ltx/en_us_dedes/oc.m2.d3:ocMA.OdeW8C22.mode	@ltx/en_us_dedes/miscellanea:misc.Mode2
ltx/en_us_dedes/oc.m2.d3:ocMA.OdeW8C22.ode	@ltx/en_us_dedes/miscellanea:misc.Ode8
ltx/en_us_dedes/oc.m2.d3:ocMA.OdeW8C22.text	
ltx/en_us_dedes/oc.m2.d3:ocMA.OdeW8C23.incipit	…
ltx/en_us_dedes/oc.m2.d3:ocMA.OdeW8C23.melody	@ltx/en_us_dedes/he.h.m2:heHE.KaminosPote.name
ltx/en_us_dedes/oc.m2.d3:ocMA.OdeW8C23.mode	@ltx/en_us_dedes/miscellanea:misc.Mode2
ltx/en_us_dedes/oc.m2.d3:ocMA.OdeW8C23.ode	@ltx/en_us_dedes/miscellanea:misc.Ode8
ltx/en_us_dedes/oc.m2.d3:ocMA.OdeW8C23.text	
ltx/en_us_dedes/oc.m2.d3:ocMA.OdeW8C24.incipit	…
ltx/en_us_dedes/oc.m2.d3:ocMA.OdeW8C24.melody	@ltx/en_us_dedes/he.h.m2:heHE.KaminosPote.name
ltx/en_us_dedes/oc.m2.d3:ocMA.OdeW8C24.mode	@ltx/en_us_dedes/miscellanea:misc.Mode2
ltx/en_us_dedes/oc.m2.d3:ocMA.OdeW8C24.ode	@ltx/en_us_dedes/miscellanea:misc.Ode8
ltx/en_us_dedes/oc.m2.d3:ocMA.OdeW8C24.text	
ltx/en_us_dedes/oc.m2.d3:ocMA.OdeW8C2T.incipit	…
ltx/en_us_dedes/oc.m2.d3:ocMA.OdeW8C2T.melody	@ltx/en_us_dedes/he.h.m2:heHE.KaminosPote.name
ltx/en_us_dedes/oc.m2.d3:ocMA.OdeW8C2T.mode	@ltx/en_us_dedes/miscellanea:misc.Mode2
ltx/en_us_dedes/oc.m2.d3:ocMA.OdeW8C2T.ode	@ltx/en_us_dedes/miscellanea:misc.Ode8
ltx/en_us_dedes/oc.m2.d3:ocMA.OdeW8C2T.text	
ltx/en_us_dedes/oc.m2.d3:ocMA.OdeW9C11.incipit	…
ltx/en_us_dedes/oc.m2.d3:ocMA.OdeW9C11.melody	@ltx/en_us_dedes/he.h.m2:heHE.TonGigenonTisIkouse.name
ltx/en_us_dedes/oc.m2.d3:ocMA.OdeW9C11.mode	@ltx/en_us_dedes/miscellanea:misc.Mode2
ltx/en_us_dedes/oc.m2.d3:ocMA.OdeW9C11.ode	@ltx/en_us_dedes/miscellanea:misc.Ode9
ltx/en_us_dedes/oc.m2.d3:ocMA.OdeW9C11.text	
ltx/en_us_dedes/oc.m2.d3:ocMA.OdeW9C12.incipit	…
ltx/en_us_dedes/oc.m2.d3:ocMA.OdeW9C12.melody	@ltx/en_us_dedes/he.h.m2:heHE.TonGigenonTisIkouse.name
ltx/en_us_dedes/oc.m2.d3:ocMA.OdeW9C12.mode	@ltx/en_us_dedes/miscellanea:misc.Mode2
ltx/en_us_dedes/oc.m2.d3:ocMA.OdeW9C12.ode	@ltx/en_us_dedes/miscellanea:misc.Ode9
ltx/en_us_dedes/oc.m2.d3:ocMA.OdeW9C12.text	
ltx/en_us_dedes/oc.m2.d3:ocMA.OdeW9C13.incipit	…
ltx/en_us_dedes/oc.m2.d3:ocMA.OdeW9C13.melody	@ltx/en_us_dedes/he.h.m2:heHE.TonGigenonTisIkouse.name
ltx/en_us_dedes/oc.m2.d3:ocMA.OdeW9C13.mode	@ltx/en_us_dedes/miscellanea:misc.Mode2
ltx/en_us_dedes/oc.m2.d3:ocMA.OdeW9C13.ode	@ltx/en_us_dedes/miscellanea:misc.Ode9
ltx/en_us_dedes/oc.m2.d3:ocMA.OdeW9C13.text	
ltx/en_us_dedes/oc.m2.d3:ocMA.OdeW9C14.incipit	…
ltx/en_us_dedes/oc.m2.d3:ocMA.OdeW9C14.melody	@ltx/en_us_dedes/he.h.m2:heHE.TonGigenonTisIkouse.name
ltx/en_us_dedes/oc.m2.d3:ocMA.OdeW9C14.mode	@ltx/en_us_dedes/miscellanea:misc.Mode2
ltx/en_us_dedes/oc.m2.d3:ocMA.OdeW9C14.ode	@ltx/en_us_dedes/miscellanea:misc.Ode9
ltx/en_us_dedes/oc.m2.d3:ocMA.OdeW9C14.text	
ltx/en_us_dedes/oc.m2.d3:ocMA.OdeW9C1H.greekmelody	@ltx/en_us_dedes/he.h.m2:heHE.TonGigenonTisIkouse.greekname
ltx/en_us_dedes/oc.m2.d3:ocMA.OdeW9C1H.incipit	@ltx/en_us_dedes/he.h.m2:heHE.TonGigenonTisIkouse.incipit
ltx/en_us_dedes/oc.m2.d3:ocMA.OdeW9C1H.melody	@ltx/en_us_dedes/he.h.m2:heHE.TonGigenonTisIkouse.melody
ltx/en_us_dedes/oc.m2.d3:ocMA.OdeW9C1H.mode	@ltx/en_us_dedes/miscellanea:misc.Mode2
ltx/en_us_dedes/oc.m2.d3:ocMA.OdeW9C1H.ode	@ltx/en_us_dedes/miscellanea:misc.Ode9
ltx/en_us_dedes/oc.m2.d3:ocMA.OdeW9C1H.text	@ltx/en_us_dedes/he.h.m2:heHE.TonGigenonTisIkouse.text
ltx/en_us_dedes/oc.m2.d3:ocMA.OdeW9C1T.incipit	…
ltx/en_us_dedes/oc.m2.d3:ocMA.OdeW9C1T.melody	@ltx/en_us_dedes/he.h.m2:heHE.TonGigenonTisIkouse.name
ltx/en_us_dedes/oc.m2.d3:ocMA.OdeW9C1T.mode	@ltx/en_us_dedes/miscellanea:misc.Mode2
ltx/en_us_dedes/oc.m2.d3:ocMA.OdeW9C1T.ode	@ltx/en_us_dedes/miscellanea:misc.Ode9
ltx/en_us_dedes/oc.m2.d3:ocMA.OdeW9C1T.text	
ltx/en_us_dedes/oc.m2.d3:ocMA.OdeW9C21.greekmelody	@ltx/en_us_dedes/he.h.m2:heHE.AnarchouGennitoros.greekname
ltx/en_us_dedes/oc.m2.d3:ocMA.OdeW9C21.incipit	…
ltx/en_us_dedes/oc.m2.d3:ocMA.OdeW9C21.melody	@ltx/en_us_dedes/he.h.m2:heHE.AnarchouGennitoros.name
ltx/en_us_dedes/oc.m2.d3:ocMA.OdeW9C21.mode	@ltx/en_us_dedes/miscellanea:misc.Mode2
ltx/en_us_dedes/oc.m2.d3:ocMA.OdeW9C21.ode	@ltx/en_us_dedes/miscellanea:misc.Ode9
ltx/en_us_dedes/oc.m2.d3:ocMA.OdeW9C21.text	
ltx/en_us_dedes/oc.m2.d3:ocMA.OdeW9C22.incipit	…
ltx/en_us_dedes/oc.m2.d3:ocMA.OdeW9C22.melody	@ltx/en_us_dedes/he.h.m2:heHE.AnarchouGennitoros.name
ltx/en_us_dedes/oc.m2.d3:ocMA.OdeW9C22.mode	@ltx/en_us_dedes/miscellanea:misc.Mode2
ltx/en_us_dedes/oc.m2.d3:ocMA.OdeW9C22.ode	@ltx/en_us_dedes/miscellanea:misc.Ode9
ltx/en_us_dedes/oc.m2.d3:ocMA.OdeW9C22.text	
ltx/en_us_dedes/oc.m2.d3:ocMA.OdeW9C23.incipit	…
ltx/en_us_dedes/oc.m2.d3:ocMA.OdeW9C23.melody	@ltx/en_us_dedes/he.h.m2:heHE.AnarchouGennitoros.name
ltx/en_us_dedes/oc.m2.d3:ocMA.OdeW9C23.mode	@ltx/en_us_dedes/miscellanea:misc.Mode2
ltx/en_us_dedes/oc.m2.d3:ocMA.OdeW9C23.ode	@ltx/en_us_dedes/miscellanea:misc.Ode9
ltx/en_us_dedes/oc.m2.d3:ocMA.OdeW9C23.text	
ltx/en_us_dedes/oc.m2.d3:ocMA.OdeW9C24.incipit	…
ltx/en_us_dedes/oc.m2.d3:ocMA.OdeW9C24.melody	@ltx/en_us_dedes/he.h.m2:heHE.AnarchouGennitoros.name
ltx/en_us_dedes/oc.m2.d3:ocMA.OdeW9C24.mode	@ltx/en_us_dedes/miscellanea:misc.Mode2
ltx/en_us_dedes/oc.m2.d3:ocMA.OdeW9C24.ode	@ltx/en_us_dedes/miscellanea:misc.Ode9
ltx/en_us_dedes/oc.m2.d3:ocMA.OdeW9C24.text	
ltx/en_us_dedes/oc.m2.d3:ocMA.OdeW9C2T.incipit	…
ltx/en_us_dedes/oc.m2.d3:ocMA.OdeW9C2T.melody	@ltx/en_us_dedes/he.h.m2:heHE.AnarchouGennitoros.name
ltx/en_us_dedes/oc.m2.d3:ocMA.OdeW9C2T.mode	@ltx/en_us_dedes/miscellanea:misc.Mode2
ltx/en_us_dedes/oc.m2.d3:ocMA.OdeW9C2T.ode	@ltx/en_us_dedes/miscellanea:misc.Ode9
ltx/en_us_dedes/oc.m2.d3:ocMA.OdeW9C2T.text	
ltx/en_us_dedes/oc.m2.d3:ocVE.ApolTheotokionVM.incipit	@ltx/en_us_dedes/oc.m2.d5:ocMA.Kathisma13.incipit
ltx/en_us_dedes/oc.m2.d3:ocVE.ApolTheotokionVM.melody	
ltx/en_us_dedes/oc.m2.d3:ocVE.ApolTheotokionVM.mode	@ltx/en_us_dedes/miscellanea:misc.Mode2
ltx/en_us_dedes/oc.m2.d3:ocVE.ApolTheotokionVM.text	@ltx/en_us_dedes/oc.m2.d5:ocMA.Kathisma13.text
ltx/en_us_dedes/oc.m2.d3:ocVE.AposTheotokion.incipit	O Mother of Life, I…
ltx/en_us_dedes/oc.m2.d3:ocVE.AposTheotokion.melody	
ltx/en_us_dedes/oc.m2.d3:ocVE.AposTheotokion.mode	@ltx/en_us_dedes/miscellanea:misc.Mode2
ltx/en_us_dedes/oc.m2.d3:ocVE.AposTheotokion.text	O Mother of Life, I have committed my every hope wholly unto you. Keep me under your shelter.
ltx/en_us_dedes/oc.m2.d3:ocVE.Aposticha1.incipit	@ltx/en_us_dedes/oc.m2.d2:ocVE.Aposticha1.incipit
ltx/en_us_dedes/oc.m2.d3:ocVE.Aposticha1.melody	
ltx/en_us_dedes/oc.m2.d3:ocVE.Aposticha1.mode	@ltx/en_us_dedes/miscellanea:misc.Mode2
ltx/en_us_dedes/oc.m2.d3:ocVE.Aposticha1.text	@ltx/en_us_dedes/oc.m2.d2:ocVE.Aposticha1.text
ltx/en_us_dedes/oc.m2.d3:ocVE.Aposticha2.incipit	@ltx/en_us_dedes/oc.m2.d2:ocVE.Aposticha2.incipit
ltx/en_us_dedes/oc.m2.d3:ocVE.Aposticha2.melody	
ltx/en_us_dedes/oc.m2.d3:ocVE.Aposticha2.mode	@ltx/en_us_dedes/miscellanea:misc.Mode2
ltx/en_us_dedes/oc.m2.d3:ocVE.Aposticha2.text	@ltx/en_us_dedes/oc.m2.d2:ocVE.Aposticha2.text
ltx/en_us_dedes/oc.m2.d3:ocVE.Aposticha3.incipit	Since the holy Martyrs are…
ltx/en_us_dedes/oc.m2.d3:ocVE.Aposticha3.melody	
ltx/en_us_dedes/oc.m2.d3:ocVE.Aposticha3.mode	@ltx/en_us_dedes/miscellanea:misc.Mode2
ltx/en_us_dedes/oc.m2.d3:ocVE.Aposticha3.text	Since the holy Martyrs are interceding on our behalf and are sending up their praises to Christ, all delusion has ceased and by faith the human race is preserved.
ltx/en_us_dedes/oc.m2.d3:ocVE.SticTheotokion.greekmelody	@ltx/en_us_dedes/he.a.m2:heAU.OteEkTouXylou.greekname
ltx/en_us_dedes/oc.m2.d3:ocVE.SticTheotokion.incipit	…
ltx/en_us_dedes/oc.m2.d3:ocVE.SticTheotokion.melody	@ltx/en_us_dedes/he.a.m2:heAU.OteEkTouXylou.name
ltx/en_us_dedes/oc.m2.d3:ocVE.SticTheotokion.mode	@ltx/en_us_dedes/miscellanea:misc.Mode2
ltx/en_us_dedes/oc.m2.d3:ocVE.SticTheotokion.text	
ltx/en_us_dedes/oc.m2.d3:ocVE.Stichera1.greekmelody	@ltx/en_us_dedes/he.a.m2:heAU.OteEkTouXylou.greekname
ltx/en_us_dedes/oc.m2.d3:ocVE.Stichera1.incipit	As the only sinless One…
ltx/en_us_dedes/oc.m2.d3:ocVE.Stichera1.melody	@ltx/en_us_dedes/he.a.m2:heAU.OteEkTouXylou.name
ltx/en_us_dedes/oc.m2.d3:ocVE.Stichera1.mode	@ltx/en_us_dedes/miscellanea:misc.Mode2
ltx/en_us_dedes/oc.m2.d3:ocVE.Stichera1.text	As the only sinless One, O Christ, * the only forbearing, the only wellspring of charity, * see my tribulation, see my strait perplexity. * Wipe away from my wounded soul * the scars and the bruises, * and save me Your servant in Your tender mercy, O Lord, * so that with the clouds of depression * gone away, I might offer glory * unto You my Savior most benevolent.
ltx/en_us_dedes/oc.m2.d3:ocVE.Stichera2.incipit	…
ltx/en_us_dedes/oc.m2.d3:ocVE.Stichera2.melody	@ltx/en_us_dedes/he.a.m2:heAU.OteEkTouXylou.name
ltx/en_us_dedes/oc.m2.d3:ocVE.Stichera2.mode	@ltx/en_us_dedes/miscellanea:misc.Mode2
ltx/en_us_dedes/oc.m2.d3:ocVE.Stichera2.text	
ltx/en_us_dedes/oc.m2.d3:ocVE.Stichera3.incipit	I have brought corruption on…
ltx/en_us_dedes/oc.m2.d3:ocVE.Stichera3.melody	@ltx/en_us_dedes/he.a.m2:heAU.OteEkTouXylou.name
ltx/en_us_dedes/oc.m2.d3:ocVE.Stichera3.mode	@ltx/en_us_dedes/miscellanea:misc.Mode2
ltx/en_us_dedes/oc.m2.d3:ocVE.Stichera3.text	I have brought corruption on my soul, * and I have polluted my body, and with my sordid thoughts * I have wounded grievously my heart and senses all. * I have sorely defiled my eyes, * my ears have I tainted, * and my tongue have I befouled. I am completely depraved. * Therefore, I fall down to You crying: * I have sinned against You, O Master. * I have sinned; forgive and save me, Christ my God.
ltx/en_us_dedes/oc.m2.d3:ocVE.Stichera4.greekmelody	@ltx/en_us_dedes/he.a.m2:heAU.OteEkTouXylou.greekname
ltx/en_us_dedes/oc.m2.d3:ocVE.Stichera4.incipit	…
ltx/en_us_dedes/oc.m2.d3:ocVE.Stichera4.melody	@ltx/en_us_dedes/he.a.m2:heAU.OteEkTouXylou.name
ltx/en_us_dedes/oc.m2.d3:ocVE.Stichera4.mode	@ltx/en_us_dedes/miscellanea:misc.Mode2
ltx/en_us_dedes/oc.m2.d3:ocVE.Stichera4.text	
ltx/en_us_dedes/oc.m2.d3:ocVE.Stichera5.incipit	…
ltx/en_us_dedes/oc.m2.d3:ocVE.Stichera5.melody	@ltx/en_us_dedes/he.a.m2:heAU.OteEkTouXylou.name
ltx/en_us_dedes/oc.m2.d3:ocVE.Stichera5.mode	@ltx/en_us_dedes/miscellanea:misc.Mode2
ltx/en_us_dedes/oc.m2.d3:ocVE.Stichera5.text	
ltx/en_us_dedes/oc.m2.d3:ocVE.Stichera6.incipit	Save me from the everlasting…
ltx/en_us_dedes/oc.m2.d3:ocVE.Stichera6.melody	@ltx/en_us_dedes/he.a.m2:heAU.OteEkTouXylou.name
ltx/en_us_dedes/oc.m2.d3:ocVE.Stichera6.mode	@ltx/en_us_dedes/miscellanea:misc.Mode2
ltx/en_us_dedes/oc.m2.d3:ocVE.Stichera6.text	Save me from the everlasting fire, * from the lightless darkness, from hardships, and all necessity, * from all tribulation and from all perplexing straits, * I beseech you, O Baptist John, * and by your entreaties * grant me who am self-condemned in my iniquities * surely to belong to the portion * of the saved wherein are the choirs * of the Saints and joy that is ineffable.
ltx/en_us_dedes/oc.m2.d3:octrMA.Kathisma11.incipit	@ltx/en_us_dedes/oc.m2.d3:ocMA.Kathisma21.incipit
ltx/en_us_dedes/oc.m2.d3:octrMA.Kathisma11.melody	
ltx/en_us_dedes/oc.m2.d3:octrMA.Kathisma11.mode	@ltx/en_us_dedes/miscellanea:misc.Mode2
ltx/en_us_dedes/oc.m2.d3:octrMA.Kathisma11.text	@ltx/en_us_dedes/oc.m2.d3:ocMA.Kathisma21.text
ltx/en_us_dedes/oc.m2.d3:octrMA.Kathisma12.incipit	@ltx/en_us_dedes/oc.m2.d3:ocMA.Kathisma22.incipit
ltx/en_us_dedes/oc.m2.d3:octrMA.Kathisma12.melody	
ltx/en_us_dedes/oc.m2.d3:octrMA.Kathisma12.mode	@ltx/en_us_dedes/miscellanea:misc.Mode2
ltx/en_us_dedes/oc.m2.d3:octrMA.Kathisma12.text	@ltx/en_us_dedes/oc.m2.d3:ocMA.Kathisma22.text
ltx/en_us_dedes/oc.m2.d3:octrMA.Kathisma1T.incipit	@ltx/en_us_dedes/oc.m2.d3:ocMA.Kathisma23.incipit
ltx/en_us_dedes/oc.m2.d3:octrMA.Kathisma1T.melody	
ltx/en_us_dedes/oc.m2.d3:octrMA.Kathisma1T.mode	@ltx/en_us_dedes/miscellanea:misc.Mode2
ltx/en_us_dedes/oc.m2.d3:octrMA.Kathisma1T.text	@ltx/en_us_dedes/oc.m2.d3:ocMA.Kathisma23.text
ltx/en_us_dedes/oc.m2.d3:octrMA.Ode7Martyricon.incipit	@ltx/en_us_dedes/oc.m2.d3:ocMA.Kathisma32.incipit
ltx/en_us_dedes/oc.m2.d3:octrMA.Ode7Martyricon.melody	
ltx/en_us_dedes/oc.m2.d3:octrMA.Ode7Martyricon.mode	@ltx/en_us_dedes/miscellanea:misc.Mode2
ltx/en_us_dedes/oc.m2.d3:octrMA.Ode7Martyricon.text	@ltx/en_us_dedes/oc.m2.d3:ocMA.Kathisma32.text
ltx/en_us_dedes/oc.m2.d3:octrMA.Photogogic.incipit	@ltx/en_us_dedes/oc.m2.d2:octrMA.Photagogic.incipit
ltx/en_us_dedes/oc.m2.d3:octrMA.Photogogic.mode	@ltx/en_us_dedes/miscellanea:misc.Mode2
ltx/en_us_dedes/oc.m2.d3:octrMA.Photogogic.text	@ltx/en_us_dedes/oc.m2.d2:octrMA.Photagogic.text
ltx/en_us_dedes/oc.m2.d3:octrMA.Triadic1.incipit	@ltx/en_us_dedes/oc.m2.d2:octrMA.Triadic1.incipit
ltx/en_us_dedes/oc.m2.d3:octrMA.Triadic1.mode	@ltx/en_us_dedes/miscellanea:misc.Mode2
ltx/en_us_dedes/oc.m2.d3:octrMA.Triadic1.text	@ltx/en_us_dedes/oc.m2.d2:octrMA.Triadic1.text
ltx/en_us_dedes/oc.m2.d3:octrMA.Triadic2.incipit	@ltx/en_us_dedes/oc.m2.d2:octrMA.Triadic2.incipit
ltx/en_us_dedes/oc.m2.d3:octrMA.Triadic2.mode	@ltx/en_us_dedes/miscellanea:misc.Mode2
ltx/en_us_dedes/oc.m2.d3:octrMA.Triadic2.text	@ltx/en_us_dedes/oc.m2.d2:octrMA.Triadic2.text
ltx/en_us_dedes/oc.m2.d3:octrMA.Triadic3.incipit	@ltx/en_us_dedes/oc.m2.d2:octrMA.Triadic3.incipit
ltx/en_us_dedes/oc.m2.d3:octrMA.Triadic3.mode	@ltx/en_us_dedes/miscellanea:misc.Mode2
ltx/en_us_dedes/oc.m2.d3:octrMA.Triadic3.text	@ltx/en_us_dedes/oc.m2.d2:octrMA.Triadic3.text
