ltx/en_us_dedes/pe.d103:peDA.commemoration.full	
ltx/en_us_dedes/pe.d103:peDA.commemoration.short	Thursday of the Fifth Week
ltx/en_us_dedes/pe.d103:peDA.dismissal	@ltx/en_us_dedes/dismissals:dis00.resurrection
ltx/en_us_dedes/pe.d103:peDA.insert1	
ltx/en_us_dedes/pe.d103:peDA.insert2	
ltx/en_us_dedes/pe.d103:peDA.note	
ltx/en_us_dedes/pe.d103:peHO.commemorations	
ltx/en_us_dedes/pe.d103:peHO.daytitle	
ltx/en_us_dedes/pe.d103:peHO.description1	
ltx/en_us_dedes/pe.d103:peHO.description2	
ltx/en_us_dedes/pe.d103:peHO.note1	
ltx/en_us_dedes/pe.d103:peHO.note2	
ltx/en_us_dedes/pe.d103:peMA.AposGlory.incipit	@ltx/en_us_dedes/pe.d099:peVE.LityGlory.incipit
ltx/en_us_dedes/pe.d103:peMA.AposGlory.melody	@ltx/en_us_dedes/pe.d099:peVE.LityGlory.melody
ltx/en_us_dedes/pe.d103:peMA.AposGlory.mode	@ltx/en_us_dedes/miscellanea:misc.Mode3
ltx/en_us_dedes/pe.d103:peMA.AposGlory.text	@ltx/en_us_dedes/pe.d099:peVE.LityGlory.text
ltx/en_us_dedes/pe.d103:peMA.Aposticha1.greekmelody	@ltx/en_us_dedes/he.a.m4:heAU.OsGennaionEnMartysi.greekname
ltx/en_us_dedes/pe.d103:peMA.Aposticha1.incipit	Only merciful Lord and God…
ltx/en_us_dedes/pe.d103:peMA.Aposticha1.melody	@ltx/en_us_dedes/he.a.m4:heAU.OsGennaionEnMartysi.name
ltx/en_us_dedes/pe.d103:peMA.Aposticha1.mode	@ltx/en_us_dedes/miscellanea:misc.Mode4
ltx/en_us_dedes/pe.d103:peMA.Aposticha1.text	Only merciful Lord and God, * source and well of benevolence, * treasury and ocean of everlasting life: * how did You speak to the woman of Samaria who had come * for water, “Give me a drink, * so that you may instead receive * forgiveness of sins.”? * We extol Your compassion and great mercy, * by which You, in Your abundant * goodness, have saved all humanity.
ltx/en_us_dedes/pe.d103:peMA.Aposticha2.incipit	Come and see for yourselves…
ltx/en_us_dedes/pe.d103:peMA.Aposticha2.melody	@ltx/en_us_dedes/he.a.m4:heAU.OsGennaionEnMartysi.name
ltx/en_us_dedes/pe.d103:peMA.Aposticha2.mode	@ltx/en_us_dedes/miscellanea:misc.Mode4
ltx/en_us_dedes/pe.d103:peMA.Aposticha2.text	Come and see for yourselves a man * who today told me everything * that I ever did. He is sitting by the well. * I do perceive Him to be a great * and truthful and genuine * Prophet, for He knows all things, * what is hidden and obvious. * Lord who loves mankind, * I entreat You to give me living water * that You offer to the thirsty, * that I may not ever thirst again.
ltx/en_us_dedes/pe.d103:peMA.Aposticha3.incipit	The divine ever-flowing well, *…
ltx/en_us_dedes/pe.d103:peMA.Aposticha3.melody	@ltx/en_us_dedes/he.a.m4:heAU.OsGennaionEnMartysi.name
ltx/en_us_dedes/pe.d103:peMA.Aposticha3.mode	@ltx/en_us_dedes/miscellanea:misc.Mode4
ltx/en_us_dedes/pe.d103:peMA.Aposticha3.text	The divine ever-flowing well, * yes, the Master, immortal life, * the unending stream of incorruptibility, * weary from walking, sat down to rest * near the well that Jacob dug. * Providentially he sent * His Disciples to buy supplies. * Then a women came * to draw water. And He addressed her, wishing * to enthrall her and illumine * the inner eyes of her soul with grace.
ltx/en_us_dedes/pe.d103:peMA.Kathisma11.greekmelody	@ltx/en_us_dedes/he.a.m4:heAU.OYpsotheisEnToStavro.greekname
ltx/en_us_dedes/pe.d103:peMA.Kathisma11.incipit	You who were crucified for…
ltx/en_us_dedes/pe.d103:peMA.Kathisma11.melody	@ltx/en_us_dedes/he.a.m4:heAU.OYpsotheisEnToStavro.name
ltx/en_us_dedes/pe.d103:peMA.Kathisma11.mode	@ltx/en_us_dedes/miscellanea:misc.Mode4
ltx/en_us_dedes/pe.d103:peMA.Kathisma11.text	You who were crucified for us voluntarily, * O Christ our God, and who were counted among the dead * and rose again the third day, as the Giver of life, * shattered the dominion of death by Your divine power; * by Your Resurrection You gave life to all in Hades. * And now, we faithful honor and extol * Your Resurrection, O Christ our immortal Lord.
ltx/en_us_dedes/pe.d103:peMA.Kathisma12.greekmelody	@ltx/en_us_dedes/oc.m4.d5:ocMA.Kathisma12.greekmelody
ltx/en_us_dedes/pe.d103:peMA.Kathisma12.incipit	@ltx/en_us_dedes/oc.m4.d5:ocMA.Kathisma12.incipit
ltx/en_us_dedes/pe.d103:peMA.Kathisma12.melody	@ltx/en_us_dedes/oc.m4.d5:ocMA.Kathisma12.melody
ltx/en_us_dedes/pe.d103:peMA.Kathisma12.mode	@ltx/en_us_dedes/miscellanea:misc.Mode4
ltx/en_us_dedes/pe.d103:peMA.Kathisma12.text	@ltx/en_us_dedes/oc.m4.d5:ocMA.Kathisma12.text
ltx/en_us_dedes/pe.d103:peMA.Kathisma13.greekmelody	@ltx/en_us_dedes/oc.m4.d3:ocMA.Kathisma32.greekmelody
ltx/en_us_dedes/pe.d103:peMA.Kathisma13.incipit	@ltx/en_us_dedes/oc.m4.d3:ocMA.Kathisma32.incipit
ltx/en_us_dedes/pe.d103:peMA.Kathisma13.melody	@ltx/en_us_dedes/oc.m4.d3:ocMA.Kathisma32.melody
ltx/en_us_dedes/pe.d103:peMA.Kathisma13.mode	@ltx/en_us_dedes/miscellanea:misc.Mode4
ltx/en_us_dedes/pe.d103:peMA.Kathisma13.text	@ltx/en_us_dedes/oc.m4.d3:ocMA.Kathisma32.text
ltx/en_us_dedes/pe.d103:peMA.Kathisma1T.greekmelody	@ltx/en_us_dedes/he.a.m4:heAU.TachyProkatalave.greekname
ltx/en_us_dedes/pe.d103:peMA.Kathisma1T.incipit	Immaculate Virgin, you are truly…
ltx/en_us_dedes/pe.d103:peMA.Kathisma1T.melody	@ltx/en_us_dedes/he.a.m4:heAU.TachyProkatalave.name
ltx/en_us_dedes/pe.d103:peMA.Kathisma1T.mode	@ltx/en_us_dedes/miscellanea:misc.Mode4
ltx/en_us_dedes/pe.d103:peMA.Kathisma1T.text	Immaculate Virgin, you are truly Mother of God * who is most benevolent. Join the Apostles and please * entreat Him unceasingly * that He forgive our sins and that He grant the amendment * of life before the end to us who rightly extol you * with faith, love, and longing, O only all-lauded one.
ltx/en_us_dedes/pe.d103:peMA.Kathisma21.incipit	O Lord, as You opened…
ltx/en_us_dedes/pe.d103:peMA.Kathisma21.melody	
ltx/en_us_dedes/pe.d103:peMA.Kathisma21.mode	@ltx/en_us_dedes/miscellanea:misc.Mode6
ltx/en_us_dedes/pe.d103:peMA.Kathisma21.text	O Lord, as You opened the well of Your divinity to the faithful woman of Samaria, and You poured out on her the knowledge of God, and You gave her a God-filled drink, so now send down to all of us the forgiveness of sins, since You are exceedingly good.
ltx/en_us_dedes/pe.d103:peMA.Lauds1.incipit	@ltx/en_us_dedes/oc.m4.d1:ocMA.Lauds4.incipit
ltx/en_us_dedes/pe.d103:peMA.Lauds1.melody	
ltx/en_us_dedes/pe.d103:peMA.Lauds1.mode	@ltx/en_us_dedes/miscellanea:misc.Mode4
ltx/en_us_dedes/pe.d103:peMA.Lauds1.text	@ltx/en_us_dedes/oc.m4.d1:ocMA.Lauds4.text
ltx/en_us_dedes/pe.d103:peMA.Lauds2.incipit	@ltx/en_us_dedes/oc.m4.d5:ocMA.Aposticha2.incipit
ltx/en_us_dedes/pe.d103:peMA.Lauds2.melody	
ltx/en_us_dedes/pe.d103:peMA.Lauds2.mode	@ltx/en_us_dedes/miscellanea:misc.Mode4
ltx/en_us_dedes/pe.d103:peMA.Lauds2.text	@ltx/en_us_dedes/oc.m4.d5:ocMA.Aposticha2.text
ltx/en_us_dedes/pe.d103:peMA.Lauds3.incipit	@ltx/en_us_dedes/oc.m4.d4:ocMA.Aposticha3.incipit
ltx/en_us_dedes/pe.d103:peMA.Lauds3.melody	
ltx/en_us_dedes/pe.d103:peMA.Lauds3.mode	@ltx/en_us_dedes/miscellanea:misc.Mode4
ltx/en_us_dedes/pe.d103:peMA.Lauds3.text	@ltx/en_us_dedes/oc.m4.d4:ocMA.Aposticha3.text
ltx/en_us_dedes/pe.d103:peMA.LaudsGlory.incipit	@ltx/en_us_dedes/pe.d099:peVE.Stichera10.incipit
ltx/en_us_dedes/pe.d103:peMA.LaudsGlory.melody	@ltx/en_us_dedes/pe.d099:peVE.Stichera10.melody
ltx/en_us_dedes/pe.d103:peMA.LaudsGlory.mode	@ltx/en_us_dedes/miscellanea:misc.Mode2
ltx/en_us_dedes/pe.d103:peMA.LaudsGlory.text	@ltx/en_us_dedes/pe.d099:peVE.Stichera10.text
ltx/en_us_dedes/pe.d103:peVE.AposGlory.incipit	@ltx/en_us_dedes/pe.d099:peVE.Stichera09.incipit
ltx/en_us_dedes/pe.d103:peVE.AposGlory.melody	@ltx/en_us_dedes/pe.d099:peVE.Stichera09.melody
ltx/en_us_dedes/pe.d103:peVE.AposGlory.mode	@ltx/en_us_dedes/miscellanea:misc.Mode2
ltx/en_us_dedes/pe.d103:peVE.AposGlory.text	@ltx/en_us_dedes/pe.d099:peVE.Stichera09.text
ltx/en_us_dedes/pe.d103:peVE.Aposticha1.incipit	@ltx/en_us_dedes/oc.m4.d1:ocVE.Stichera3.incipit
ltx/en_us_dedes/pe.d103:peVE.Aposticha1.melody	
ltx/en_us_dedes/pe.d103:peVE.Aposticha1.mode	@ltx/en_us_dedes/miscellanea:misc.Mode4
ltx/en_us_dedes/pe.d103:peVE.Aposticha1.text	@ltx/en_us_dedes/oc.m4.d1:ocVE.Stichera3.text
ltx/en_us_dedes/pe.d103:peVE.Aposticha2.incipit	@ltx/en_us_dedes/oc.m4.d5:ocVE.Aposticha1.incipit
ltx/en_us_dedes/pe.d103:peVE.Aposticha2.melody	
ltx/en_us_dedes/pe.d103:peVE.Aposticha2.mode	@ltx/en_us_dedes/miscellanea:misc.Mode4
ltx/en_us_dedes/pe.d103:peVE.Aposticha2.text	@ltx/en_us_dedes/oc.m4.d5:ocVE.Aposticha1.text
ltx/en_us_dedes/pe.d103:peVE.Aposticha3.incipit	@ltx/en_us_dedes/oc.m4.d4:ocVE.Aposticha3.incipit
ltx/en_us_dedes/pe.d103:peVE.Aposticha3.melody	
ltx/en_us_dedes/pe.d103:peVE.Aposticha3.mode	@ltx/en_us_dedes/miscellanea:misc.Mode4
ltx/en_us_dedes/pe.d103:peVE.Aposticha3.text	@ltx/en_us_dedes/oc.m4.d4:ocVE.Aposticha3.text
ltx/en_us_dedes/pe.d103:peVE.SticGlory.incipit	@ltx/en_us_dedes/pe.d099:peVE.Stichera08.incipit
ltx/en_us_dedes/pe.d103:peVE.SticGlory.melody	@ltx/en_us_dedes/pe.d099:peVE.Stichera08.melody
ltx/en_us_dedes/pe.d103:peVE.SticGlory.mode	@ltx/en_us_dedes/miscellanea:misc.Mode1
ltx/en_us_dedes/pe.d103:peVE.SticGlory.text	@ltx/en_us_dedes/pe.d099:peVE.Stichera08.text
ltx/en_us_dedes/pe.d103:peVE.Stichera01.greekmelody	@ltx/en_us_dedes/he.a.m4:heAU.OExYpsistouKlitheis.greekname
ltx/en_us_dedes/pe.d103:peVE.Stichera01.incipit	When Christ had come to…
ltx/en_us_dedes/pe.d103:peVE.Stichera01.melody	@ltx/en_us_dedes/he.a.m4:heAU.OExYpsistouKlitheis.name
ltx/en_us_dedes/pe.d103:peVE.Stichera01.mode	@ltx/en_us_dedes/miscellanea:misc.Mode4
ltx/en_us_dedes/pe.d103:peVE.Stichera01.text	When Christ had come to the well, He found the woman * of Samaria and asked her for water to drink. * He really thirsted for her correction and salvation, * which was accomplished by what He said and did. * She had come to draw a drink of water, but instead * He drew her in and gave her the drink of living water. * She went and said to her fellow citizens, * “Behold, Messiah Christ, of whom the Law * spoke of old! He has come and appeared as man. * He uncovered my secrets * and disclosed my every hidden thought.”
ltx/en_us_dedes/pe.d103:peVE.Stichera02.incipit	Said the Samaritan woman to…
ltx/en_us_dedes/pe.d103:peVE.Stichera02.melody	@ltx/en_us_dedes/he.a.m4:heAU.OExYpsistouKlitheis.name
ltx/en_us_dedes/pe.d103:peVE.Stichera02.mode	@ltx/en_us_dedes/miscellanea:misc.Mode4
ltx/en_us_dedes/pe.d103:peVE.Stichera02.text	Said the Samaritan woman to the people * in the city, “Come and see the one, of whom of old * the Law has written, that He would come, Christ the Messiah. * He is a great Prophet. He is God and man. * He explained to me what I have done throughout my life. * He knew the thoughts that were deep within my heart and hidden * He told me everything I have ever done.” * Then all the people of the city came, * and they saw that her words were completely true; * and they marveled, believing * for themselves by what they heard and saw.
ltx/en_us_dedes/pe.d103:peVE.Stichera03.incipit	It was the sixth hour…
ltx/en_us_dedes/pe.d103:peVE.Stichera03.melody	@ltx/en_us_dedes/he.a.m4:heAU.OExYpsistouKlitheis.name
ltx/en_us_dedes/pe.d103:peVE.Stichera03.mode	@ltx/en_us_dedes/miscellanea:misc.Mode4
ltx/en_us_dedes/pe.d103:peVE.Stichera03.text	It was the sixth hour when, as God and Master, * You walked in the Garden of Eden so long before. * It was the sixth hour once again, O Christ our Savior, * when Mother Eve’s daughter saw You sitting there * beside Jacob’s water well that had been dug of old. * And when You asked her, “Give me a drink,” it was to give her * to drink the water that wells up unto life. * And so it happened and she took a drink * of Your life-giving water and swallowed it. * Then she ran to the city * and announced Your water’s abundant gift.
