ltx/en_us_dedes/oc.m7.d5:ocBK.ModeNaked	@ltx/en_us_dedes/miscellanea:misc.Mode7.naked
ltx/en_us_dedes/oc.m7.d5:ocLI.Beatitudes1.incipit	@ltx/en_us_dedes/oc.m7.d1:ocLI.Beatitudes1.incipit
ltx/en_us_dedes/oc.m7.d5:ocLI.Beatitudes1.melody	
ltx/en_us_dedes/oc.m7.d5:ocLI.Beatitudes1.mode	@ltx/en_us_dedes/miscellanea:misc.Mode7
ltx/en_us_dedes/oc.m7.d5:ocLI.Beatitudes1.text	@ltx/en_us_dedes/oc.m7.d1:ocLI.Beatitudes1.text
ltx/en_us_dedes/oc.m7.d5:ocLI.Beatitudes2.incipit	O wise Apostles, you caught…
ltx/en_us_dedes/oc.m7.d5:ocLI.Beatitudes2.melody	
ltx/en_us_dedes/oc.m7.d5:ocLI.Beatitudes2.mode	@ltx/en_us_dedes/miscellanea:misc.Mode7
ltx/en_us_dedes/oc.m7.d5:ocLI.Beatitudes2.text	O wise Apostles, you caught the Gentiles * as if shoals of fish in your net, * and brought them from the sea of unbelief * to faith worthy of the Godhead, * and like a very costly dish * laid them on the spiritual table, O glorious ones.
ltx/en_us_dedes/oc.m7.d5:ocLI.Beatitudes3.incipit	When had driven away the…
ltx/en_us_dedes/oc.m7.d5:ocLI.Beatitudes3.melody	
ltx/en_us_dedes/oc.m7.d5:ocLI.Beatitudes3.mode	@ltx/en_us_dedes/miscellanea:misc.Mode7
ltx/en_us_dedes/oc.m7.d5:ocLI.Beatitudes3.text	When had driven away the darkness * of deadly deception by the light * of Gospel preaching, then you clearly gave * divine illumination * to the true believers’ hearts. * Therefore now with godly songs * we extol you, O Apostles of Christ.
ltx/en_us_dedes/oc.m7.d5:ocLI.Beatitudes4.incipit	Although your members were being…
ltx/en_us_dedes/oc.m7.d5:ocLI.Beatitudes4.melody	
ltx/en_us_dedes/oc.m7.d5:ocLI.Beatitudes4.mode	@ltx/en_us_dedes/miscellanea:misc.Mode7
ltx/en_us_dedes/oc.m7.d5:ocLI.Beatitudes4.text	Although your members were being cut off * by the sword, O Athletes of Christ, * yet you were never cut off from His love, * but you hastened to join Him * in the heavens, where you dwell * with the Savior joyously, * radiant with glory divine.
ltx/en_us_dedes/oc.m7.d5:ocLI.BeatitudesT.incipit	O modest Virgin, you truly…
ltx/en_us_dedes/oc.m7.d5:ocLI.BeatitudesT.melody	
ltx/en_us_dedes/oc.m7.d5:ocLI.BeatitudesT.mode	@ltx/en_us_dedes/miscellanea:misc.Mode7
ltx/en_us_dedes/oc.m7.d5:ocLI.BeatitudesT.text	O modest Virgin, you truly brought forth * Him who with the Father shares the throne, * and who to make the essence of mankind * immortal took mortal * flesh from your all-holy blood. * Therefore we are duty-bound * to extol and macarize you.
ltx/en_us_dedes/oc.m7.d5:ocLI.BeatitudesTr.incipit	The wicked devil who has…
ltx/en_us_dedes/oc.m7.d5:ocLI.BeatitudesTr.melody	
ltx/en_us_dedes/oc.m7.d5:ocLI.BeatitudesTr.mode	@ltx/en_us_dedes/miscellanea:misc.Mode7
ltx/en_us_dedes/oc.m7.d5:ocLI.BeatitudesTr.text	The wicked devil who has corrupted * the human race has a hold on me. * Almighty Holy Trinity, my God, * rescue me from his gullet, * at the Apostles’ holy prayers, * so that I may magnify * Your immense mercy.
ltx/en_us_dedes/oc.m7.d5:ocLI.MM.Beatitudes1234TrTas78910GB.text	@ltx/en_us_dedes/properties:media.key
ltx/en_us_dedes/oc.m7.d5:ocMA.ApolTheotokion.incipit	@ltx/en_us_dedes/oc.m7.d5:ocMA.Kathisma33.incipit
ltx/en_us_dedes/oc.m7.d5:ocMA.ApolTheotokion.melody	
ltx/en_us_dedes/oc.m7.d5:ocMA.ApolTheotokion.mode	@ltx/en_us_dedes/miscellanea:misc.Mode7
ltx/en_us_dedes/oc.m7.d5:ocMA.ApolTheotokion.text	@ltx/en_us_dedes/oc.m7.d5:ocMA.Kathisma33.text
ltx/en_us_dedes/oc.m7.d5:ocMA.AposTheotokion.greekmelody	@ltx/en_us_dedes/he.a.m7:heAU.SimeronGrigoreiOIoudas.greekname
ltx/en_us_dedes/oc.m7.d5:ocMA.AposTheotokion.incipit	…
ltx/en_us_dedes/oc.m7.d5:ocMA.AposTheotokion.melody	@ltx/en_us_dedes/he.a.m7:heAU.SimeronGrigoreiOIoudas.name
ltx/en_us_dedes/oc.m7.d5:ocMA.AposTheotokion.mode	@ltx/en_us_dedes/miscellanea:misc.Mode7
ltx/en_us_dedes/oc.m7.d5:ocMA.AposTheotokion.text	
ltx/en_us_dedes/oc.m7.d5:ocMA.Aposticha1.incipit	@ltx/en_us_dedes/oc.m7.d5:ocVE.Aposticha1.incipit
ltx/en_us_dedes/oc.m7.d5:ocMA.Aposticha1.melody	
ltx/en_us_dedes/oc.m7.d5:ocMA.Aposticha1.mode	@ltx/en_us_dedes/miscellanea:misc.Mode7
ltx/en_us_dedes/oc.m7.d5:ocMA.Aposticha1.text	@ltx/en_us_dedes/oc.m7.d5:ocVE.Aposticha1.text
ltx/en_us_dedes/oc.m7.d5:ocMA.Aposticha2.incipit	@ltx/en_us_dedes/oc.m7.d5:ocVE.Aposticha2.incipit
ltx/en_us_dedes/oc.m7.d5:ocMA.Aposticha2.melody	
ltx/en_us_dedes/oc.m7.d5:ocMA.Aposticha2.mode	@ltx/en_us_dedes/miscellanea:misc.Mode7
ltx/en_us_dedes/oc.m7.d5:ocMA.Aposticha2.text	@ltx/en_us_dedes/oc.m7.d5:ocVE.Aposticha2.text
ltx/en_us_dedes/oc.m7.d5:ocMA.Aposticha3.incipit	…
ltx/en_us_dedes/oc.m7.d5:ocMA.Aposticha3.melody	
ltx/en_us_dedes/oc.m7.d5:ocMA.Aposticha3.mode	@ltx/en_us_dedes/miscellanea:misc.Mode7
ltx/en_us_dedes/oc.m7.d5:ocMA.Aposticha3.text	
ltx/en_us_dedes/oc.m7.d5:ocMA.C1.acrostic.notice1	
ltx/en_us_dedes/oc.m7.d5:ocMA.C1.acrostic.text	
ltx/en_us_dedes/oc.m7.d5:ocMA.C1.acrostic.title	Canon for the Holy Apostles.
ltx/en_us_dedes/oc.m7.d5:ocMA.C2.acrostic.notice1	
ltx/en_us_dedes/oc.m7.d5:ocMA.C2.acrostic.text	
ltx/en_us_dedes/oc.m7.d5:ocMA.C2.acrostic.title	Canon for St. Nicholas.
ltx/en_us_dedes/oc.m7.d5:ocMA.Kathisma11.incipit	O Lord, You showed…
ltx/en_us_dedes/oc.m7.d5:ocMA.Kathisma11.melody	
ltx/en_us_dedes/oc.m7.d5:ocMA.Kathisma11.mode	@ltx/en_us_dedes/miscellanea:misc.Mode7
ltx/en_us_dedes/oc.m7.d5:ocMA.Kathisma11.text	O Lord, You showed Your Apostles to be husbandmen of Your field, who weeded out the idols. Therefore they preached to the Gentiles that You are the Savior, and they magnified You with correct belief.
ltx/en_us_dedes/oc.m7.d5:ocMA.Kathisma12.incipit	…
ltx/en_us_dedes/oc.m7.d5:ocMA.Kathisma12.melody	
ltx/en_us_dedes/oc.m7.d5:ocMA.Kathisma12.mode	@ltx/en_us_dedes/miscellanea:misc.Mode7
ltx/en_us_dedes/oc.m7.d5:ocMA.Kathisma12.text	
ltx/en_us_dedes/oc.m7.d5:ocMA.Kathisma13.incipit	O immaculate Maiden…
ltx/en_us_dedes/oc.m7.d5:ocMA.Kathisma13.melody	
ltx/en_us_dedes/oc.m7.d5:ocMA.Kathisma13.mode	@ltx/en_us_dedes/miscellanea:misc.Mode7
ltx/en_us_dedes/oc.m7.d5:ocMA.Kathisma13.text	O immaculate Maiden, the fruit of your womb is the fulfillment of the Prophets and the Law. Therefore, O Theotokos, with understanding, we glorify and magnify you piously.
ltx/en_us_dedes/oc.m7.d5:ocMA.Kathisma21.incipit	…
ltx/en_us_dedes/oc.m7.d5:ocMA.Kathisma21.melody	
ltx/en_us_dedes/oc.m7.d5:ocMA.Kathisma21.mode	@ltx/en_us_dedes/miscellanea:misc.Mode7
ltx/en_us_dedes/oc.m7.d5:ocMA.Kathisma21.text	
ltx/en_us_dedes/oc.m7.d5:ocMA.Kathisma22.incipit	…
ltx/en_us_dedes/oc.m7.d5:ocMA.Kathisma22.melody	
ltx/en_us_dedes/oc.m7.d5:ocMA.Kathisma22.mode	@ltx/en_us_dedes/miscellanea:misc.Mode7
ltx/en_us_dedes/oc.m7.d5:ocMA.Kathisma22.text	
ltx/en_us_dedes/oc.m7.d5:ocMA.Kathisma23.incipit	…
ltx/en_us_dedes/oc.m7.d5:ocMA.Kathisma23.melody	
ltx/en_us_dedes/oc.m7.d5:ocMA.Kathisma23.mode	@ltx/en_us_dedes/miscellanea:misc.Mode7
ltx/en_us_dedes/oc.m7.d5:ocMA.Kathisma23.text	
ltx/en_us_dedes/oc.m7.d5:ocMA.Kathisma31.incipit	…
ltx/en_us_dedes/oc.m7.d5:ocMA.Kathisma31.melody	
ltx/en_us_dedes/oc.m7.d5:ocMA.Kathisma31.mode	@ltx/en_us_dedes/miscellanea:misc.Mode7
ltx/en_us_dedes/oc.m7.d5:ocMA.Kathisma31.text	
ltx/en_us_dedes/oc.m7.d5:ocMA.Kathisma32.incipit	…
ltx/en_us_dedes/oc.m7.d5:ocMA.Kathisma32.melody	
ltx/en_us_dedes/oc.m7.d5:ocMA.Kathisma32.mode	@ltx/en_us_dedes/miscellanea:misc.Mode7
ltx/en_us_dedes/oc.m7.d5:ocMA.Kathisma32.text	
ltx/en_us_dedes/oc.m7.d5:ocMA.Kathisma33.incipit	O Bride of God…
ltx/en_us_dedes/oc.m7.d5:ocMA.Kathisma33.melody	
ltx/en_us_dedes/oc.m7.d5:ocMA.Kathisma33.mode	@ltx/en_us_dedes/miscellanea:misc.Mode7
ltx/en_us_dedes/oc.m7.d5:ocMA.Kathisma33.text	O Bride of God, the fruit of your womb brought about the salvation of humanity. Therefore, we the faithful glorify you in mind and tongue, O Theotokos, and we magnify you.
ltx/en_us_dedes/oc.m7.d5:ocMA.OdeW1C11.incipit	…
ltx/en_us_dedes/oc.m7.d5:ocMA.OdeW1C11.melody	@ltx/en_us_dedes/he.h.m7:heHE.NefseiSouProsGeodi.name
ltx/en_us_dedes/oc.m7.d5:ocMA.OdeW1C11.mode	@ltx/en_us_dedes/miscellanea:misc.Mode7
ltx/en_us_dedes/oc.m7.d5:ocMA.OdeW1C11.ode	@ltx/en_us_dedes/miscellanea:misc.Ode1
ltx/en_us_dedes/oc.m7.d5:ocMA.OdeW1C11.text	
ltx/en_us_dedes/oc.m7.d5:ocMA.OdeW1C12.incipit	…
ltx/en_us_dedes/oc.m7.d5:ocMA.OdeW1C12.melody	@ltx/en_us_dedes/he.h.m7:heHE.NefseiSouProsGeodi.name
ltx/en_us_dedes/oc.m7.d5:ocMA.OdeW1C12.mode	@ltx/en_us_dedes/miscellanea:misc.Mode7
ltx/en_us_dedes/oc.m7.d5:ocMA.OdeW1C12.ode	@ltx/en_us_dedes/miscellanea:misc.Ode1
ltx/en_us_dedes/oc.m7.d5:ocMA.OdeW1C12.text	
ltx/en_us_dedes/oc.m7.d5:ocMA.OdeW1C13.incipit	…
ltx/en_us_dedes/oc.m7.d5:ocMA.OdeW1C13.melody	@ltx/en_us_dedes/he.h.m7:heHE.NefseiSouProsGeodi.name
ltx/en_us_dedes/oc.m7.d5:ocMA.OdeW1C13.mode	@ltx/en_us_dedes/miscellanea:misc.Mode7
ltx/en_us_dedes/oc.m7.d5:ocMA.OdeW1C13.ode	@ltx/en_us_dedes/miscellanea:misc.Ode1
ltx/en_us_dedes/oc.m7.d5:ocMA.OdeW1C13.text	
ltx/en_us_dedes/oc.m7.d5:ocMA.OdeW1C1H.greekmelody	@ltx/en_us_dedes/he.h.m7:heHE.NefseiSouProsGeodi.greekname
ltx/en_us_dedes/oc.m7.d5:ocMA.OdeW1C1H.incipit	@ltx/en_us_dedes/he.h.m7:heHE.NefseiSouProsGeodi.incipit
ltx/en_us_dedes/oc.m7.d5:ocMA.OdeW1C1H.melody	@ltx/en_us_dedes/he.h.m7:heHE.NefseiSouProsGeodi.melody
ltx/en_us_dedes/oc.m7.d5:ocMA.OdeW1C1H.mode	@ltx/en_us_dedes/miscellanea:misc.Mode7
ltx/en_us_dedes/oc.m7.d5:ocMA.OdeW1C1H.ode	@ltx/en_us_dedes/miscellanea:misc.Ode1
ltx/en_us_dedes/oc.m7.d5:ocMA.OdeW1C1H.text	@ltx/en_us_dedes/he.h.m7:heHE.NefseiSouProsGeodi.text
ltx/en_us_dedes/oc.m7.d5:ocMA.OdeW1C1T.incipit	…
ltx/en_us_dedes/oc.m7.d5:ocMA.OdeW1C1T.melody	@ltx/en_us_dedes/he.h.m7:heHE.NefseiSouProsGeodi.name
ltx/en_us_dedes/oc.m7.d5:ocMA.OdeW1C1T.mode	@ltx/en_us_dedes/miscellanea:misc.Mode7
ltx/en_us_dedes/oc.m7.d5:ocMA.OdeW1C1T.ode	@ltx/en_us_dedes/miscellanea:misc.Ode1
ltx/en_us_dedes/oc.m7.d5:ocMA.OdeW1C1T.text	
ltx/en_us_dedes/oc.m7.d5:ocMA.OdeW1C21.greekmelody	@ltx/en_us_dedes/he.h.m7:heHE.ToSynergisantiTheo.greekname
ltx/en_us_dedes/oc.m7.d5:ocMA.OdeW1C21.incipit	…
ltx/en_us_dedes/oc.m7.d5:ocMA.OdeW1C21.melody	@ltx/en_us_dedes/he.h.m7:heHE.ToSynergisantiTheo.name
ltx/en_us_dedes/oc.m7.d5:ocMA.OdeW1C21.mode	@ltx/en_us_dedes/miscellanea:misc.Mode7
ltx/en_us_dedes/oc.m7.d5:ocMA.OdeW1C21.ode	@ltx/en_us_dedes/miscellanea:misc.Ode1
ltx/en_us_dedes/oc.m7.d5:ocMA.OdeW1C21.text	
ltx/en_us_dedes/oc.m7.d5:ocMA.OdeW1C22.incipit	…
ltx/en_us_dedes/oc.m7.d5:ocMA.OdeW1C22.melody	@ltx/en_us_dedes/he.h.m7:heHE.ToSynergisantiTheo.name
ltx/en_us_dedes/oc.m7.d5:ocMA.OdeW1C22.mode	@ltx/en_us_dedes/miscellanea:misc.Mode7
ltx/en_us_dedes/oc.m7.d5:ocMA.OdeW1C22.ode	@ltx/en_us_dedes/miscellanea:misc.Ode1
ltx/en_us_dedes/oc.m7.d5:ocMA.OdeW1C22.text	
ltx/en_us_dedes/oc.m7.d5:ocMA.OdeW1C23.incipit	…
ltx/en_us_dedes/oc.m7.d5:ocMA.OdeW1C23.melody	@ltx/en_us_dedes/he.h.m7:heHE.ToSynergisantiTheo.name
ltx/en_us_dedes/oc.m7.d5:ocMA.OdeW1C23.mode	@ltx/en_us_dedes/miscellanea:misc.Mode7
ltx/en_us_dedes/oc.m7.d5:ocMA.OdeW1C23.ode	@ltx/en_us_dedes/miscellanea:misc.Ode1
ltx/en_us_dedes/oc.m7.d5:ocMA.OdeW1C23.text	
ltx/en_us_dedes/oc.m7.d5:ocMA.OdeW1C2T.incipit	…
ltx/en_us_dedes/oc.m7.d5:ocMA.OdeW1C2T.melody	@ltx/en_us_dedes/he.h.m7:heHE.ToSynergisantiTheo.name
ltx/en_us_dedes/oc.m7.d5:ocMA.OdeW1C2T.mode	@ltx/en_us_dedes/miscellanea:misc.Mode7
ltx/en_us_dedes/oc.m7.d5:ocMA.OdeW1C2T.ode	@ltx/en_us_dedes/miscellanea:misc.Ode1
ltx/en_us_dedes/oc.m7.d5:ocMA.OdeW1C2T.text	
ltx/en_us_dedes/oc.m7.d5:ocMA.OdeW3C11.incipit	…
ltx/en_us_dedes/oc.m7.d5:ocMA.OdeW3C11.melody	@ltx/en_us_dedes/he.h.m7:heHE.OKatArchasTousOuranous.name
ltx/en_us_dedes/oc.m7.d5:ocMA.OdeW3C11.mode	@ltx/en_us_dedes/miscellanea:misc.Mode7
ltx/en_us_dedes/oc.m7.d5:ocMA.OdeW3C11.ode	@ltx/en_us_dedes/miscellanea:misc.Ode3
ltx/en_us_dedes/oc.m7.d5:ocMA.OdeW3C11.text	
ltx/en_us_dedes/oc.m7.d5:ocMA.OdeW3C12.incipit	…
ltx/en_us_dedes/oc.m7.d5:ocMA.OdeW3C12.melody	@ltx/en_us_dedes/he.h.m7:heHE.OKatArchasTousOuranous.name
ltx/en_us_dedes/oc.m7.d5:ocMA.OdeW3C12.mode	@ltx/en_us_dedes/miscellanea:misc.Mode7
ltx/en_us_dedes/oc.m7.d5:ocMA.OdeW3C12.ode	@ltx/en_us_dedes/miscellanea:misc.Ode3
ltx/en_us_dedes/oc.m7.d5:ocMA.OdeW3C12.text	
ltx/en_us_dedes/oc.m7.d5:ocMA.OdeW3C13.incipit	…
ltx/en_us_dedes/oc.m7.d5:ocMA.OdeW3C13.melody	@ltx/en_us_dedes/he.h.m7:heHE.OKatArchasTousOuranous.name
ltx/en_us_dedes/oc.m7.d5:ocMA.OdeW3C13.mode	@ltx/en_us_dedes/miscellanea:misc.Mode7
ltx/en_us_dedes/oc.m7.d5:ocMA.OdeW3C13.ode	@ltx/en_us_dedes/miscellanea:misc.Ode3
ltx/en_us_dedes/oc.m7.d5:ocMA.OdeW3C13.text	
ltx/en_us_dedes/oc.m7.d5:ocMA.OdeW3C1H.greekmelody	@ltx/en_us_dedes/he.h.m7:heHE.OKatArchasTousOuranous.greekname
ltx/en_us_dedes/oc.m7.d5:ocMA.OdeW3C1H.incipit	@ltx/en_us_dedes/he.h.m7:heHE.OKatArchasTousOuranous.incipit
ltx/en_us_dedes/oc.m7.d5:ocMA.OdeW3C1H.melody	@ltx/en_us_dedes/he.h.m7:heHE.OKatArchasTousOuranous.melody
ltx/en_us_dedes/oc.m7.d5:ocMA.OdeW3C1H.mode	@ltx/en_us_dedes/miscellanea:misc.Mode7
ltx/en_us_dedes/oc.m7.d5:ocMA.OdeW3C1H.ode	@ltx/en_us_dedes/miscellanea:misc.Ode3
ltx/en_us_dedes/oc.m7.d5:ocMA.OdeW3C1H.text	@ltx/en_us_dedes/he.h.m7:heHE.OKatArchasTousOuranous.text
ltx/en_us_dedes/oc.m7.d5:ocMA.OdeW3C1T.incipit	…
ltx/en_us_dedes/oc.m7.d5:ocMA.OdeW3C1T.melody	@ltx/en_us_dedes/he.h.m7:heHE.OKatArchasTousOuranous.name
ltx/en_us_dedes/oc.m7.d5:ocMA.OdeW3C1T.mode	@ltx/en_us_dedes/miscellanea:misc.Mode7
ltx/en_us_dedes/oc.m7.d5:ocMA.OdeW3C1T.ode	@ltx/en_us_dedes/miscellanea:misc.Ode3
ltx/en_us_dedes/oc.m7.d5:ocMA.OdeW3C1T.text	
ltx/en_us_dedes/oc.m7.d5:ocMA.OdeW3C21.greekmelody	@ltx/en_us_dedes/he.h.m7:heHE.StereomaMouGenou.greekname
ltx/en_us_dedes/oc.m7.d5:ocMA.OdeW3C21.incipit	…
ltx/en_us_dedes/oc.m7.d5:ocMA.OdeW3C21.melody	@ltx/en_us_dedes/he.h.m7:heHE.StereomaMouGenou.name
ltx/en_us_dedes/oc.m7.d5:ocMA.OdeW3C21.mode	@ltx/en_us_dedes/miscellanea:misc.Mode7
ltx/en_us_dedes/oc.m7.d5:ocMA.OdeW3C21.ode	@ltx/en_us_dedes/miscellanea:misc.Ode3
ltx/en_us_dedes/oc.m7.d5:ocMA.OdeW3C21.text	
ltx/en_us_dedes/oc.m7.d5:ocMA.OdeW3C22.incipit	…
ltx/en_us_dedes/oc.m7.d5:ocMA.OdeW3C22.melody	@ltx/en_us_dedes/he.h.m7:heHE.StereomaMouGenou.name
ltx/en_us_dedes/oc.m7.d5:ocMA.OdeW3C22.mode	@ltx/en_us_dedes/miscellanea:misc.Mode7
ltx/en_us_dedes/oc.m7.d5:ocMA.OdeW3C22.ode	@ltx/en_us_dedes/miscellanea:misc.Ode3
ltx/en_us_dedes/oc.m7.d5:ocMA.OdeW3C22.text	
ltx/en_us_dedes/oc.m7.d5:ocMA.OdeW3C23.incipit	…
ltx/en_us_dedes/oc.m7.d5:ocMA.OdeW3C23.melody	@ltx/en_us_dedes/he.h.m7:heHE.StereomaMouGenou.name
ltx/en_us_dedes/oc.m7.d5:ocMA.OdeW3C23.mode	@ltx/en_us_dedes/miscellanea:misc.Mode7
ltx/en_us_dedes/oc.m7.d5:ocMA.OdeW3C23.ode	@ltx/en_us_dedes/miscellanea:misc.Ode3
ltx/en_us_dedes/oc.m7.d5:ocMA.OdeW3C23.text	
ltx/en_us_dedes/oc.m7.d5:ocMA.OdeW3C2T.incipit	…
ltx/en_us_dedes/oc.m7.d5:ocMA.OdeW3C2T.melody	@ltx/en_us_dedes/he.h.m7:heHE.StereomaMouGenou.name
ltx/en_us_dedes/oc.m7.d5:ocMA.OdeW3C2T.mode	@ltx/en_us_dedes/miscellanea:misc.Mode7
ltx/en_us_dedes/oc.m7.d5:ocMA.OdeW3C2T.ode	@ltx/en_us_dedes/miscellanea:misc.Ode3
ltx/en_us_dedes/oc.m7.d5:ocMA.OdeW3C2T.text	
ltx/en_us_dedes/oc.m7.d5:ocMA.OdeW4C11.incipit	…
ltx/en_us_dedes/oc.m7.d5:ocMA.OdeW4C11.melody	@ltx/en_us_dedes/he.h.m7:heHE.OPatrikousKolpous.name
ltx/en_us_dedes/oc.m7.d5:ocMA.OdeW4C11.mode	@ltx/en_us_dedes/miscellanea:misc.Mode7
ltx/en_us_dedes/oc.m7.d5:ocMA.OdeW4C11.ode	@ltx/en_us_dedes/miscellanea:misc.Ode4
ltx/en_us_dedes/oc.m7.d5:ocMA.OdeW4C11.text	
ltx/en_us_dedes/oc.m7.d5:ocMA.OdeW4C12.incipit	…
ltx/en_us_dedes/oc.m7.d5:ocMA.OdeW4C12.melody	@ltx/en_us_dedes/he.h.m7:heHE.OPatrikousKolpous.name
ltx/en_us_dedes/oc.m7.d5:ocMA.OdeW4C12.mode	@ltx/en_us_dedes/miscellanea:misc.Mode7
ltx/en_us_dedes/oc.m7.d5:ocMA.OdeW4C12.ode	@ltx/en_us_dedes/miscellanea:misc.Ode4
ltx/en_us_dedes/oc.m7.d5:ocMA.OdeW4C12.text	
ltx/en_us_dedes/oc.m7.d5:ocMA.OdeW4C13.incipit	…
ltx/en_us_dedes/oc.m7.d5:ocMA.OdeW4C13.melody	@ltx/en_us_dedes/he.h.m7:heHE.OPatrikousKolpous.name
ltx/en_us_dedes/oc.m7.d5:ocMA.OdeW4C13.mode	@ltx/en_us_dedes/miscellanea:misc.Mode7
ltx/en_us_dedes/oc.m7.d5:ocMA.OdeW4C13.ode	@ltx/en_us_dedes/miscellanea:misc.Ode4
ltx/en_us_dedes/oc.m7.d5:ocMA.OdeW4C13.text	
ltx/en_us_dedes/oc.m7.d5:ocMA.OdeW4C1H.greekmelody	@ltx/en_us_dedes/he.h.m7:heHE.OPatrikousKolpous.greekname
ltx/en_us_dedes/oc.m7.d5:ocMA.OdeW4C1H.incipit	@ltx/en_us_dedes/he.h.m7:heHE.OPatrikousKolpous.incipit
ltx/en_us_dedes/oc.m7.d5:ocMA.OdeW4C1H.melody	@ltx/en_us_dedes/he.h.m7:heHE.OPatrikousKolpous.melody
ltx/en_us_dedes/oc.m7.d5:ocMA.OdeW4C1H.mode	@ltx/en_us_dedes/miscellanea:misc.Mode7
ltx/en_us_dedes/oc.m7.d5:ocMA.OdeW4C1H.ode	@ltx/en_us_dedes/miscellanea:misc.Ode4
ltx/en_us_dedes/oc.m7.d5:ocMA.OdeW4C1H.text	@ltx/en_us_dedes/he.h.m7:heHE.OPatrikousKolpous.text
ltx/en_us_dedes/oc.m7.d5:ocMA.OdeW4C1T.incipit	…
ltx/en_us_dedes/oc.m7.d5:ocMA.OdeW4C1T.melody	@ltx/en_us_dedes/he.h.m7:heHE.OPatrikousKolpous.name
ltx/en_us_dedes/oc.m7.d5:ocMA.OdeW4C1T.mode	@ltx/en_us_dedes/miscellanea:misc.Mode7
ltx/en_us_dedes/oc.m7.d5:ocMA.OdeW4C1T.ode	@ltx/en_us_dedes/miscellanea:misc.Ode4
ltx/en_us_dedes/oc.m7.d5:ocMA.OdeW4C1T.text	
ltx/en_us_dedes/oc.m7.d5:ocMA.OdeW4C21.greekmelody	@ltx/en_us_dedes/he.h.m7:heHE.EkalypsenOuranous.greekname
ltx/en_us_dedes/oc.m7.d5:ocMA.OdeW4C21.incipit	…
ltx/en_us_dedes/oc.m7.d5:ocMA.OdeW4C21.melody	@ltx/en_us_dedes/he.h.m7:heHE.EkalypsenOuranous.name
ltx/en_us_dedes/oc.m7.d5:ocMA.OdeW4C21.mode	@ltx/en_us_dedes/miscellanea:misc.Mode7
ltx/en_us_dedes/oc.m7.d5:ocMA.OdeW4C21.ode	@ltx/en_us_dedes/miscellanea:misc.Ode4
ltx/en_us_dedes/oc.m7.d5:ocMA.OdeW4C21.text	
ltx/en_us_dedes/oc.m7.d5:ocMA.OdeW4C22.incipit	…
ltx/en_us_dedes/oc.m7.d5:ocMA.OdeW4C22.melody	@ltx/en_us_dedes/he.h.m7:heHE.EkalypsenOuranous.name
ltx/en_us_dedes/oc.m7.d5:ocMA.OdeW4C22.mode	@ltx/en_us_dedes/miscellanea:misc.Mode7
ltx/en_us_dedes/oc.m7.d5:ocMA.OdeW4C22.ode	@ltx/en_us_dedes/miscellanea:misc.Ode4
ltx/en_us_dedes/oc.m7.d5:ocMA.OdeW4C22.text	
ltx/en_us_dedes/oc.m7.d5:ocMA.OdeW4C23.incipit	…
ltx/en_us_dedes/oc.m7.d5:ocMA.OdeW4C23.melody	@ltx/en_us_dedes/he.h.m7:heHE.EkalypsenOuranous.name
ltx/en_us_dedes/oc.m7.d5:ocMA.OdeW4C23.mode	@ltx/en_us_dedes/miscellanea:misc.Mode7
ltx/en_us_dedes/oc.m7.d5:ocMA.OdeW4C23.ode	@ltx/en_us_dedes/miscellanea:misc.Ode4
ltx/en_us_dedes/oc.m7.d5:ocMA.OdeW4C23.text	
ltx/en_us_dedes/oc.m7.d5:ocMA.OdeW4C2T.incipit	…
ltx/en_us_dedes/oc.m7.d5:ocMA.OdeW4C2T.melody	@ltx/en_us_dedes/he.h.m7:heHE.EkalypsenOuranous.name
ltx/en_us_dedes/oc.m7.d5:ocMA.OdeW4C2T.mode	@ltx/en_us_dedes/miscellanea:misc.Mode7
ltx/en_us_dedes/oc.m7.d5:ocMA.OdeW4C2T.ode	@ltx/en_us_dedes/miscellanea:misc.Ode4
ltx/en_us_dedes/oc.m7.d5:ocMA.OdeW4C2T.text	
ltx/en_us_dedes/oc.m7.d5:ocMA.OdeW5C11.incipit	…
ltx/en_us_dedes/oc.m7.d5:ocMA.OdeW5C11.melody	@ltx/en_us_dedes/he.h.m7:heHE.KyrieOTheosMou.name
ltx/en_us_dedes/oc.m7.d5:ocMA.OdeW5C11.mode	@ltx/en_us_dedes/miscellanea:misc.Mode7
ltx/en_us_dedes/oc.m7.d5:ocMA.OdeW5C11.ode	@ltx/en_us_dedes/miscellanea:misc.Ode5
ltx/en_us_dedes/oc.m7.d5:ocMA.OdeW5C11.text	
ltx/en_us_dedes/oc.m7.d5:ocMA.OdeW5C12.incipit	…
ltx/en_us_dedes/oc.m7.d5:ocMA.OdeW5C12.melody	@ltx/en_us_dedes/he.h.m7:heHE.KyrieOTheosMou.name
ltx/en_us_dedes/oc.m7.d5:ocMA.OdeW5C12.mode	@ltx/en_us_dedes/miscellanea:misc.Mode7
ltx/en_us_dedes/oc.m7.d5:ocMA.OdeW5C12.ode	@ltx/en_us_dedes/miscellanea:misc.Ode5
ltx/en_us_dedes/oc.m7.d5:ocMA.OdeW5C12.text	
ltx/en_us_dedes/oc.m7.d5:ocMA.OdeW5C1H.greekmelody	@ltx/en_us_dedes/he.h.m7:heHE.KyrieOTheosMou.greekname
ltx/en_us_dedes/oc.m7.d5:ocMA.OdeW5C1H.incipit	@ltx/en_us_dedes/he.h.m7:heHE.KyrieOTheosMou.incipit
ltx/en_us_dedes/oc.m7.d5:ocMA.OdeW5C1H.melody	@ltx/en_us_dedes/he.h.m7:heHE.KyrieOTheosMou.melody
ltx/en_us_dedes/oc.m7.d5:ocMA.OdeW5C1H.mode	@ltx/en_us_dedes/miscellanea:misc.Mode7
ltx/en_us_dedes/oc.m7.d5:ocMA.OdeW5C1H.ode	@ltx/en_us_dedes/miscellanea:misc.Ode5
ltx/en_us_dedes/oc.m7.d5:ocMA.OdeW5C1H.text	@ltx/en_us_dedes/he.h.m7:heHE.KyrieOTheosMou.text
ltx/en_us_dedes/oc.m7.d5:ocMA.OdeW5C1T.incipit	…
ltx/en_us_dedes/oc.m7.d5:ocMA.OdeW5C1T.melody	@ltx/en_us_dedes/he.h.m7:heHE.KyrieOTheosMou.name
ltx/en_us_dedes/oc.m7.d5:ocMA.OdeW5C1T.mode	@ltx/en_us_dedes/miscellanea:misc.Mode7
ltx/en_us_dedes/oc.m7.d5:ocMA.OdeW5C1T.ode	@ltx/en_us_dedes/miscellanea:misc.Ode5
ltx/en_us_dedes/oc.m7.d5:ocMA.OdeW5C1T.text	
ltx/en_us_dedes/oc.m7.d5:ocMA.OdeW5C21.greekmelody	@ltx/en_us_dedes/he.h.m7:heHE.OrthrizeiToPnevmaMou.greekname
ltx/en_us_dedes/oc.m7.d5:ocMA.OdeW5C21.incipit	…
ltx/en_us_dedes/oc.m7.d5:ocMA.OdeW5C21.melody	@ltx/en_us_dedes/he.h.m7:heHE.OrthrizeiToPnevmaMou.name
ltx/en_us_dedes/oc.m7.d5:ocMA.OdeW5C21.mode	@ltx/en_us_dedes/miscellanea:misc.Mode7
ltx/en_us_dedes/oc.m7.d5:ocMA.OdeW5C21.ode	@ltx/en_us_dedes/miscellanea:misc.Ode5
ltx/en_us_dedes/oc.m7.d5:ocMA.OdeW5C21.text	
ltx/en_us_dedes/oc.m7.d5:ocMA.OdeW5C22.incipit	…
ltx/en_us_dedes/oc.m7.d5:ocMA.OdeW5C22.melody	@ltx/en_us_dedes/he.h.m7:heHE.OrthrizeiToPnevmaMou.name
ltx/en_us_dedes/oc.m7.d5:ocMA.OdeW5C22.mode	@ltx/en_us_dedes/miscellanea:misc.Mode7
ltx/en_us_dedes/oc.m7.d5:ocMA.OdeW5C22.ode	@ltx/en_us_dedes/miscellanea:misc.Ode5
ltx/en_us_dedes/oc.m7.d5:ocMA.OdeW5C22.text	
ltx/en_us_dedes/oc.m7.d5:ocMA.OdeW5C23.incipit	…
ltx/en_us_dedes/oc.m7.d5:ocMA.OdeW5C23.melody	@ltx/en_us_dedes/he.h.m7:heHE.OrthrizeiToPnevmaMou.name
ltx/en_us_dedes/oc.m7.d5:ocMA.OdeW5C23.mode	@ltx/en_us_dedes/miscellanea:misc.Mode7
ltx/en_us_dedes/oc.m7.d5:ocMA.OdeW5C23.ode	@ltx/en_us_dedes/miscellanea:misc.Ode5
ltx/en_us_dedes/oc.m7.d5:ocMA.OdeW5C23.text	
ltx/en_us_dedes/oc.m7.d5:ocMA.OdeW5C2T.incipit	…
ltx/en_us_dedes/oc.m7.d5:ocMA.OdeW5C2T.melody	@ltx/en_us_dedes/he.h.m7:heHE.OrthrizeiToPnevmaMou.name
ltx/en_us_dedes/oc.m7.d5:ocMA.OdeW5C2T.mode	@ltx/en_us_dedes/miscellanea:misc.Mode7
ltx/en_us_dedes/oc.m7.d5:ocMA.OdeW5C2T.ode	@ltx/en_us_dedes/miscellanea:misc.Ode5
ltx/en_us_dedes/oc.m7.d5:ocMA.OdeW5C2T.text	
ltx/en_us_dedes/oc.m7.d5:ocMA.OdeW6C11.incipit	…
ltx/en_us_dedes/oc.m7.d5:ocMA.OdeW6C11.melody	@ltx/en_us_dedes/he.h.m7:heHE.NaftionToSalo.name
ltx/en_us_dedes/oc.m7.d5:ocMA.OdeW6C11.mode	@ltx/en_us_dedes/miscellanea:misc.Mode7
ltx/en_us_dedes/oc.m7.d5:ocMA.OdeW6C11.ode	@ltx/en_us_dedes/miscellanea:misc.Ode6
ltx/en_us_dedes/oc.m7.d5:ocMA.OdeW6C11.text	
ltx/en_us_dedes/oc.m7.d5:ocMA.OdeW6C12.incipit	…
ltx/en_us_dedes/oc.m7.d5:ocMA.OdeW6C12.melody	@ltx/en_us_dedes/he.h.m7:heHE.NaftionToSalo.name
ltx/en_us_dedes/oc.m7.d5:ocMA.OdeW6C12.mode	@ltx/en_us_dedes/miscellanea:misc.Mode7
ltx/en_us_dedes/oc.m7.d5:ocMA.OdeW6C12.ode	@ltx/en_us_dedes/miscellanea:misc.Ode6
ltx/en_us_dedes/oc.m7.d5:ocMA.OdeW6C12.text	
ltx/en_us_dedes/oc.m7.d5:ocMA.OdeW6C13.incipit	…
ltx/en_us_dedes/oc.m7.d5:ocMA.OdeW6C13.melody	@ltx/en_us_dedes/he.h.m7:heHE.NaftionToSalo.name
ltx/en_us_dedes/oc.m7.d5:ocMA.OdeW6C13.mode	@ltx/en_us_dedes/miscellanea:misc.Mode7
ltx/en_us_dedes/oc.m7.d5:ocMA.OdeW6C13.ode	@ltx/en_us_dedes/miscellanea:misc.Ode6
ltx/en_us_dedes/oc.m7.d5:ocMA.OdeW6C13.text	
ltx/en_us_dedes/oc.m7.d5:ocMA.OdeW6C1H.greekmelody	@ltx/en_us_dedes/he.h.m7:heHE.NaftionToSalo.greekname
ltx/en_us_dedes/oc.m7.d5:ocMA.OdeW6C1H.incipit	@ltx/en_us_dedes/he.h.m7:heHE.NaftionToSalo.incipit
ltx/en_us_dedes/oc.m7.d5:ocMA.OdeW6C1H.melody	@ltx/en_us_dedes/he.h.m7:heHE.NaftionToSalo.melody
ltx/en_us_dedes/oc.m7.d5:ocMA.OdeW6C1H.mode	@ltx/en_us_dedes/miscellanea:misc.Mode7
ltx/en_us_dedes/oc.m7.d5:ocMA.OdeW6C1H.ode	@ltx/en_us_dedes/miscellanea:misc.Ode6
ltx/en_us_dedes/oc.m7.d5:ocMA.OdeW6C1H.text	@ltx/en_us_dedes/he.h.m7:heHE.NaftionToSalo.text
ltx/en_us_dedes/oc.m7.d5:ocMA.OdeW6C1T.incipit	…
ltx/en_us_dedes/oc.m7.d5:ocMA.OdeW6C1T.melody	@ltx/en_us_dedes/he.h.m7:heHE.NaftionToSalo.name
ltx/en_us_dedes/oc.m7.d5:ocMA.OdeW6C1T.mode	@ltx/en_us_dedes/miscellanea:misc.Mode7
ltx/en_us_dedes/oc.m7.d5:ocMA.OdeW6C1T.ode	@ltx/en_us_dedes/miscellanea:misc.Ode6
ltx/en_us_dedes/oc.m7.d5:ocMA.OdeW6C1T.text	
ltx/en_us_dedes/oc.m7.d5:ocMA.OdeW6C21.greekmelody	@ltx/en_us_dedes/he.h.m7:heHE.OIonasEkKoilias.greekname
ltx/en_us_dedes/oc.m7.d5:ocMA.OdeW6C21.incipit	…
ltx/en_us_dedes/oc.m7.d5:ocMA.OdeW6C21.melody	@ltx/en_us_dedes/he.h.m7:heHE.OIonasEkKoilias.name
ltx/en_us_dedes/oc.m7.d5:ocMA.OdeW6C21.mode	@ltx/en_us_dedes/miscellanea:misc.Mode7
ltx/en_us_dedes/oc.m7.d5:ocMA.OdeW6C21.ode	@ltx/en_us_dedes/miscellanea:misc.Ode6
ltx/en_us_dedes/oc.m7.d5:ocMA.OdeW6C21.text	
ltx/en_us_dedes/oc.m7.d5:ocMA.OdeW6C22.incipit	…
ltx/en_us_dedes/oc.m7.d5:ocMA.OdeW6C22.melody	@ltx/en_us_dedes/he.h.m7:heHE.OIonasEkKoilias.name
ltx/en_us_dedes/oc.m7.d5:ocMA.OdeW6C22.mode	@ltx/en_us_dedes/miscellanea:misc.Mode7
ltx/en_us_dedes/oc.m7.d5:ocMA.OdeW6C22.ode	@ltx/en_us_dedes/miscellanea:misc.Ode6
ltx/en_us_dedes/oc.m7.d5:ocMA.OdeW6C22.text	
ltx/en_us_dedes/oc.m7.d5:ocMA.OdeW6C23.incipit	…
ltx/en_us_dedes/oc.m7.d5:ocMA.OdeW6C23.melody	@ltx/en_us_dedes/he.h.m7:heHE.OIonasEkKoilias.name
ltx/en_us_dedes/oc.m7.d5:ocMA.OdeW6C23.mode	@ltx/en_us_dedes/miscellanea:misc.Mode7
ltx/en_us_dedes/oc.m7.d5:ocMA.OdeW6C23.ode	@ltx/en_us_dedes/miscellanea:misc.Ode6
ltx/en_us_dedes/oc.m7.d5:ocMA.OdeW6C23.text	
ltx/en_us_dedes/oc.m7.d5:ocMA.OdeW6C2T.incipit	…
ltx/en_us_dedes/oc.m7.d5:ocMA.OdeW6C2T.melody	@ltx/en_us_dedes/he.h.m7:heHE.OIonasEkKoilias.name
ltx/en_us_dedes/oc.m7.d5:ocMA.OdeW6C2T.mode	@ltx/en_us_dedes/miscellanea:misc.Mode7
ltx/en_us_dedes/oc.m7.d5:ocMA.OdeW6C2T.ode	@ltx/en_us_dedes/miscellanea:misc.Ode6
ltx/en_us_dedes/oc.m7.d5:ocMA.OdeW6C2T.text	
ltx/en_us_dedes/oc.m7.d5:ocMA.OdeW7C11.incipit	…
ltx/en_us_dedes/oc.m7.d5:ocMA.OdeW7C11.melody	@ltx/en_us_dedes/he.h.m7:heHE.KaminonPaides.name
ltx/en_us_dedes/oc.m7.d5:ocMA.OdeW7C11.mode	@ltx/en_us_dedes/miscellanea:misc.Mode7
ltx/en_us_dedes/oc.m7.d5:ocMA.OdeW7C11.ode	@ltx/en_us_dedes/miscellanea:misc.Ode7
ltx/en_us_dedes/oc.m7.d5:ocMA.OdeW7C11.text	
ltx/en_us_dedes/oc.m7.d5:ocMA.OdeW7C12.incipit	…
ltx/en_us_dedes/oc.m7.d5:ocMA.OdeW7C12.melody	@ltx/en_us_dedes/he.h.m7:heHE.KaminonPaides.name
ltx/en_us_dedes/oc.m7.d5:ocMA.OdeW7C12.mode	@ltx/en_us_dedes/miscellanea:misc.Mode7
ltx/en_us_dedes/oc.m7.d5:ocMA.OdeW7C12.ode	@ltx/en_us_dedes/miscellanea:misc.Ode7
ltx/en_us_dedes/oc.m7.d5:ocMA.OdeW7C12.text	
ltx/en_us_dedes/oc.m7.d5:ocMA.OdeW7C13.incipit	…
ltx/en_us_dedes/oc.m7.d5:ocMA.OdeW7C13.melody	@ltx/en_us_dedes/he.h.m7:heHE.KaminonPaides.name
ltx/en_us_dedes/oc.m7.d5:ocMA.OdeW7C13.mode	@ltx/en_us_dedes/miscellanea:misc.Mode7
ltx/en_us_dedes/oc.m7.d5:ocMA.OdeW7C13.ode	@ltx/en_us_dedes/miscellanea:misc.Ode7
ltx/en_us_dedes/oc.m7.d5:ocMA.OdeW7C13.text	
ltx/en_us_dedes/oc.m7.d5:ocMA.OdeW7C1H.greekmelody	@ltx/en_us_dedes/he.h.m7:heHE.KaminonPaides.greekname
ltx/en_us_dedes/oc.m7.d5:ocMA.OdeW7C1H.incipit	@ltx/en_us_dedes/he.h.m7:heHE.KaminonPaides.incipit
ltx/en_us_dedes/oc.m7.d5:ocMA.OdeW7C1H.melody	@ltx/en_us_dedes/he.h.m7:heHE.KaminonPaides.melody
ltx/en_us_dedes/oc.m7.d5:ocMA.OdeW7C1H.mode	@ltx/en_us_dedes/miscellanea:misc.Mode7
ltx/en_us_dedes/oc.m7.d5:ocMA.OdeW7C1H.ode	@ltx/en_us_dedes/miscellanea:misc.Ode7
ltx/en_us_dedes/oc.m7.d5:ocMA.OdeW7C1H.text	@ltx/en_us_dedes/he.h.m7:heHE.KaminonPaides.text
ltx/en_us_dedes/oc.m7.d5:ocMA.OdeW7C1T.incipit	…
ltx/en_us_dedes/oc.m7.d5:ocMA.OdeW7C1T.melody	@ltx/en_us_dedes/he.h.m7:heHE.KaminonPaides.name
ltx/en_us_dedes/oc.m7.d5:ocMA.OdeW7C1T.mode	@ltx/en_us_dedes/miscellanea:misc.Mode7
ltx/en_us_dedes/oc.m7.d5:ocMA.OdeW7C1T.ode	@ltx/en_us_dedes/miscellanea:misc.Ode7
ltx/en_us_dedes/oc.m7.d5:ocMA.OdeW7C1T.text	
ltx/en_us_dedes/oc.m7.d5:ocMA.OdeW7C21.greekmelody	@ltx/en_us_dedes/he.h.m7:heHE.KaminonPaides.greekname
ltx/en_us_dedes/oc.m7.d5:ocMA.OdeW7C21.incipit	…
ltx/en_us_dedes/oc.m7.d5:ocMA.OdeW7C21.melody	@ltx/en_us_dedes/he.h.m7:heHE.KaminonPaides.name
ltx/en_us_dedes/oc.m7.d5:ocMA.OdeW7C21.mode	@ltx/en_us_dedes/miscellanea:misc.Mode7
ltx/en_us_dedes/oc.m7.d5:ocMA.OdeW7C21.ode	@ltx/en_us_dedes/miscellanea:misc.Ode7
ltx/en_us_dedes/oc.m7.d5:ocMA.OdeW7C21.text	
ltx/en_us_dedes/oc.m7.d5:ocMA.OdeW7C22.incipit	…
ltx/en_us_dedes/oc.m7.d5:ocMA.OdeW7C22.melody	@ltx/en_us_dedes/he.h.m7:heHE.KaminonPaides.name
ltx/en_us_dedes/oc.m7.d5:ocMA.OdeW7C22.mode	@ltx/en_us_dedes/miscellanea:misc.Mode7
ltx/en_us_dedes/oc.m7.d5:ocMA.OdeW7C22.ode	@ltx/en_us_dedes/miscellanea:misc.Ode7
ltx/en_us_dedes/oc.m7.d5:ocMA.OdeW7C22.text	
ltx/en_us_dedes/oc.m7.d5:ocMA.OdeW7C23.incipit	…
ltx/en_us_dedes/oc.m7.d5:ocMA.OdeW7C23.melody	@ltx/en_us_dedes/he.h.m7:heHE.KaminonPaides.name
ltx/en_us_dedes/oc.m7.d5:ocMA.OdeW7C23.mode	@ltx/en_us_dedes/miscellanea:misc.Mode7
ltx/en_us_dedes/oc.m7.d5:ocMA.OdeW7C23.ode	@ltx/en_us_dedes/miscellanea:misc.Ode7
ltx/en_us_dedes/oc.m7.d5:ocMA.OdeW7C23.text	
ltx/en_us_dedes/oc.m7.d5:ocMA.OdeW7C2T.incipit	…
ltx/en_us_dedes/oc.m7.d5:ocMA.OdeW7C2T.melody	@ltx/en_us_dedes/he.h.m7:heHE.KaminonPaides.name
ltx/en_us_dedes/oc.m7.d5:ocMA.OdeW7C2T.mode	@ltx/en_us_dedes/miscellanea:misc.Mode7
ltx/en_us_dedes/oc.m7.d5:ocMA.OdeW7C2T.ode	@ltx/en_us_dedes/miscellanea:misc.Ode7
ltx/en_us_dedes/oc.m7.d5:ocMA.OdeW7C2T.text	
ltx/en_us_dedes/oc.m7.d5:ocMA.OdeW8C11.incipit	…
ltx/en_us_dedes/oc.m7.d5:ocMA.OdeW8C11.melody	@ltx/en_us_dedes/he.h.m7:heHE.AflektosPyri.name
ltx/en_us_dedes/oc.m7.d5:ocMA.OdeW8C11.mode	@ltx/en_us_dedes/miscellanea:misc.Mode7
ltx/en_us_dedes/oc.m7.d5:ocMA.OdeW8C11.ode	@ltx/en_us_dedes/miscellanea:misc.Ode8
ltx/en_us_dedes/oc.m7.d5:ocMA.OdeW8C11.text	
ltx/en_us_dedes/oc.m7.d5:ocMA.OdeW8C12.incipit	…
ltx/en_us_dedes/oc.m7.d5:ocMA.OdeW8C12.melody	@ltx/en_us_dedes/he.h.m7:heHE.AflektosPyri.name
ltx/en_us_dedes/oc.m7.d5:ocMA.OdeW8C12.mode	@ltx/en_us_dedes/miscellanea:misc.Mode7
ltx/en_us_dedes/oc.m7.d5:ocMA.OdeW8C12.ode	@ltx/en_us_dedes/miscellanea:misc.Ode8
ltx/en_us_dedes/oc.m7.d5:ocMA.OdeW8C12.text	
ltx/en_us_dedes/oc.m7.d5:ocMA.OdeW8C13.incipit	…
ltx/en_us_dedes/oc.m7.d5:ocMA.OdeW8C13.melody	@ltx/en_us_dedes/he.h.m7:heHE.AflektosPyri.name
ltx/en_us_dedes/oc.m7.d5:ocMA.OdeW8C13.mode	@ltx/en_us_dedes/miscellanea:misc.Mode7
ltx/en_us_dedes/oc.m7.d5:ocMA.OdeW8C13.ode	@ltx/en_us_dedes/miscellanea:misc.Ode8
ltx/en_us_dedes/oc.m7.d5:ocMA.OdeW8C13.text	
ltx/en_us_dedes/oc.m7.d5:ocMA.OdeW8C1H.greekmelody	@ltx/en_us_dedes/he.h.m7:heHE.AflektosPyri.greekname
ltx/en_us_dedes/oc.m7.d5:ocMA.OdeW8C1H.incipit	@ltx/en_us_dedes/he.h.m7:heHE.AflektosPyri.incipit
ltx/en_us_dedes/oc.m7.d5:ocMA.OdeW8C1H.melody	@ltx/en_us_dedes/he.h.m7:heHE.AflektosPyri.melody
ltx/en_us_dedes/oc.m7.d5:ocMA.OdeW8C1H.mode	@ltx/en_us_dedes/miscellanea:misc.Mode7
ltx/en_us_dedes/oc.m7.d5:ocMA.OdeW8C1H.ode	@ltx/en_us_dedes/miscellanea:misc.Ode8
ltx/en_us_dedes/oc.m7.d5:ocMA.OdeW8C1H.text	@ltx/en_us_dedes/he.h.m7:heHE.AflektosPyri.text
ltx/en_us_dedes/oc.m7.d5:ocMA.OdeW8C1T.incipit	…
ltx/en_us_dedes/oc.m7.d5:ocMA.OdeW8C1T.melody	@ltx/en_us_dedes/he.h.m7:heHE.AflektosPyri.name
ltx/en_us_dedes/oc.m7.d5:ocMA.OdeW8C1T.mode	@ltx/en_us_dedes/miscellanea:misc.Mode7
ltx/en_us_dedes/oc.m7.d5:ocMA.OdeW8C1T.ode	@ltx/en_us_dedes/miscellanea:misc.Ode8
ltx/en_us_dedes/oc.m7.d5:ocMA.OdeW8C1T.text	
ltx/en_us_dedes/oc.m7.d5:ocMA.OdeW8C21.greekmelody	@ltx/en_us_dedes/he.h.m7:heHE.TousEnKaminoPaidasMimoumenoi.greekname
ltx/en_us_dedes/oc.m7.d5:ocMA.OdeW8C21.incipit	…
ltx/en_us_dedes/oc.m7.d5:ocMA.OdeW8C21.melody	@ltx/en_us_dedes/he.h.m7:heHE.TousEnKaminoPaidasMimoumenoi.name
ltx/en_us_dedes/oc.m7.d5:ocMA.OdeW8C21.mode	@ltx/en_us_dedes/miscellanea:misc.Mode7
ltx/en_us_dedes/oc.m7.d5:ocMA.OdeW8C21.ode	@ltx/en_us_dedes/miscellanea:misc.Ode8
ltx/en_us_dedes/oc.m7.d5:ocMA.OdeW8C21.text	
ltx/en_us_dedes/oc.m7.d5:ocMA.OdeW8C22.incipit	…
ltx/en_us_dedes/oc.m7.d5:ocMA.OdeW8C22.melody	@ltx/en_us_dedes/he.h.m7:heHE.TousEnKaminoPaidasMimoumenoi.name
ltx/en_us_dedes/oc.m7.d5:ocMA.OdeW8C22.mode	@ltx/en_us_dedes/miscellanea:misc.Mode7
ltx/en_us_dedes/oc.m7.d5:ocMA.OdeW8C22.ode	@ltx/en_us_dedes/miscellanea:misc.Ode8
ltx/en_us_dedes/oc.m7.d5:ocMA.OdeW8C22.text	
ltx/en_us_dedes/oc.m7.d5:ocMA.OdeW8C23.incipit	…
ltx/en_us_dedes/oc.m7.d5:ocMA.OdeW8C23.melody	@ltx/en_us_dedes/he.h.m7:heHE.TousEnKaminoPaidasMimoumenoi.name
ltx/en_us_dedes/oc.m7.d5:ocMA.OdeW8C23.mode	@ltx/en_us_dedes/miscellanea:misc.Mode7
ltx/en_us_dedes/oc.m7.d5:ocMA.OdeW8C23.ode	@ltx/en_us_dedes/miscellanea:misc.Ode8
ltx/en_us_dedes/oc.m7.d5:ocMA.OdeW8C23.text	
ltx/en_us_dedes/oc.m7.d5:ocMA.OdeW8C2T.incipit	…
ltx/en_us_dedes/oc.m7.d5:ocMA.OdeW8C2T.melody	@ltx/en_us_dedes/he.h.m7:heHE.TousEnKaminoPaidasMimoumenoi.name
ltx/en_us_dedes/oc.m7.d5:ocMA.OdeW8C2T.mode	@ltx/en_us_dedes/miscellanea:misc.Mode7
ltx/en_us_dedes/oc.m7.d5:ocMA.OdeW8C2T.ode	@ltx/en_us_dedes/miscellanea:misc.Ode8
ltx/en_us_dedes/oc.m7.d5:ocMA.OdeW8C2T.text	
ltx/en_us_dedes/oc.m7.d5:ocMA.OdeW9C11.incipit	…
ltx/en_us_dedes/oc.m7.d5:ocMA.OdeW9C11.melody	@ltx/en_us_dedes/he.h.m7:heHE.MiTisFthoras.name
ltx/en_us_dedes/oc.m7.d5:ocMA.OdeW9C11.mode	@ltx/en_us_dedes/miscellanea:misc.Mode7
ltx/en_us_dedes/oc.m7.d5:ocMA.OdeW9C11.ode	@ltx/en_us_dedes/miscellanea:misc.Ode9
ltx/en_us_dedes/oc.m7.d5:ocMA.OdeW9C11.text	
ltx/en_us_dedes/oc.m7.d5:ocMA.OdeW9C12.incipit	…
ltx/en_us_dedes/oc.m7.d5:ocMA.OdeW9C12.melody	@ltx/en_us_dedes/he.h.m7:heHE.MiTisFthoras.name
ltx/en_us_dedes/oc.m7.d5:ocMA.OdeW9C12.mode	@ltx/en_us_dedes/miscellanea:misc.Mode7
ltx/en_us_dedes/oc.m7.d5:ocMA.OdeW9C12.ode	@ltx/en_us_dedes/miscellanea:misc.Ode9
ltx/en_us_dedes/oc.m7.d5:ocMA.OdeW9C12.text	
ltx/en_us_dedes/oc.m7.d5:ocMA.OdeW9C13.incipit	…
ltx/en_us_dedes/oc.m7.d5:ocMA.OdeW9C13.melody	@ltx/en_us_dedes/he.h.m7:heHE.MiTisFthoras.name
ltx/en_us_dedes/oc.m7.d5:ocMA.OdeW9C13.mode	@ltx/en_us_dedes/miscellanea:misc.Mode7
ltx/en_us_dedes/oc.m7.d5:ocMA.OdeW9C13.ode	@ltx/en_us_dedes/miscellanea:misc.Ode9
ltx/en_us_dedes/oc.m7.d5:ocMA.OdeW9C13.text	
ltx/en_us_dedes/oc.m7.d5:ocMA.OdeW9C14.incipit	…
ltx/en_us_dedes/oc.m7.d5:ocMA.OdeW9C14.melody	@ltx/en_us_dedes/he.h.m7:heHE.MiTisFthoras.name
ltx/en_us_dedes/oc.m7.d5:ocMA.OdeW9C14.mode	@ltx/en_us_dedes/miscellanea:misc.Mode7
ltx/en_us_dedes/oc.m7.d5:ocMA.OdeW9C14.ode	@ltx/en_us_dedes/miscellanea:misc.Ode9
ltx/en_us_dedes/oc.m7.d5:ocMA.OdeW9C14.text	
ltx/en_us_dedes/oc.m7.d5:ocMA.OdeW9C1H.greekmelody	@ltx/en_us_dedes/he.h.m7:heHE.MiTisFthoras.greekname
ltx/en_us_dedes/oc.m7.d5:ocMA.OdeW9C1H.incipit	@ltx/en_us_dedes/he.h.m7:heHE.MiTisFthoras.incipit
ltx/en_us_dedes/oc.m7.d5:ocMA.OdeW9C1H.melody	@ltx/en_us_dedes/he.h.m7:heHE.MiTisFthoras.melody
ltx/en_us_dedes/oc.m7.d5:ocMA.OdeW9C1H.mode	@ltx/en_us_dedes/miscellanea:misc.Mode7
ltx/en_us_dedes/oc.m7.d5:ocMA.OdeW9C1H.ode	@ltx/en_us_dedes/miscellanea:misc.Ode9
ltx/en_us_dedes/oc.m7.d5:ocMA.OdeW9C1H.text	@ltx/en_us_dedes/he.h.m7:heHE.MiTisFthoras.text
ltx/en_us_dedes/oc.m7.d5:ocMA.OdeW9C1T.incipit	…
ltx/en_us_dedes/oc.m7.d5:ocMA.OdeW9C1T.melody	@ltx/en_us_dedes/he.h.m7:heHE.MiTisFthoras.name
ltx/en_us_dedes/oc.m7.d5:ocMA.OdeW9C1T.mode	@ltx/en_us_dedes/miscellanea:misc.Mode7
ltx/en_us_dedes/oc.m7.d5:ocMA.OdeW9C1T.ode	@ltx/en_us_dedes/miscellanea:misc.Ode9
ltx/en_us_dedes/oc.m7.d5:ocMA.OdeW9C1T.text	
ltx/en_us_dedes/oc.m7.d5:ocMA.OdeW9C21.greekmelody	@ltx/en_us_dedes/he.h.m7:heHE.TinYperFysinMitera.greekname
ltx/en_us_dedes/oc.m7.d5:ocMA.OdeW9C21.incipit	…
ltx/en_us_dedes/oc.m7.d5:ocMA.OdeW9C21.melody	@ltx/en_us_dedes/he.h.m7:heHE.TinYperFysinMitera.name
ltx/en_us_dedes/oc.m7.d5:ocMA.OdeW9C21.mode	@ltx/en_us_dedes/miscellanea:misc.Mode7
ltx/en_us_dedes/oc.m7.d5:ocMA.OdeW9C21.ode	@ltx/en_us_dedes/miscellanea:misc.Ode9
ltx/en_us_dedes/oc.m7.d5:ocMA.OdeW9C21.text	
ltx/en_us_dedes/oc.m7.d5:ocMA.OdeW9C22.incipit	…
ltx/en_us_dedes/oc.m7.d5:ocMA.OdeW9C22.melody	@ltx/en_us_dedes/he.h.m7:heHE.TinYperFysinMitera.name
ltx/en_us_dedes/oc.m7.d5:ocMA.OdeW9C22.mode	@ltx/en_us_dedes/miscellanea:misc.Mode7
ltx/en_us_dedes/oc.m7.d5:ocMA.OdeW9C22.ode	@ltx/en_us_dedes/miscellanea:misc.Ode9
ltx/en_us_dedes/oc.m7.d5:ocMA.OdeW9C22.text	
ltx/en_us_dedes/oc.m7.d5:ocMA.OdeW9C23.incipit	…
ltx/en_us_dedes/oc.m7.d5:ocMA.OdeW9C23.melody	@ltx/en_us_dedes/he.h.m7:heHE.TinYperFysinMitera.name
ltx/en_us_dedes/oc.m7.d5:ocMA.OdeW9C23.mode	@ltx/en_us_dedes/miscellanea:misc.Mode7
ltx/en_us_dedes/oc.m7.d5:ocMA.OdeW9C23.ode	@ltx/en_us_dedes/miscellanea:misc.Ode9
ltx/en_us_dedes/oc.m7.d5:ocMA.OdeW9C23.text	
ltx/en_us_dedes/oc.m7.d5:ocMA.OdeW9C24.incipit	…
ltx/en_us_dedes/oc.m7.d5:ocMA.OdeW9C24.melody	@ltx/en_us_dedes/he.h.m7:heHE.TinYperFysinMitera.name
ltx/en_us_dedes/oc.m7.d5:ocMA.OdeW9C24.mode	@ltx/en_us_dedes/miscellanea:misc.Mode7
ltx/en_us_dedes/oc.m7.d5:ocMA.OdeW9C24.ode	@ltx/en_us_dedes/miscellanea:misc.Ode9
ltx/en_us_dedes/oc.m7.d5:ocMA.OdeW9C24.text	
ltx/en_us_dedes/oc.m7.d5:ocMA.OdeW9C2T.incipit	…
ltx/en_us_dedes/oc.m7.d5:ocMA.OdeW9C2T.melody	@ltx/en_us_dedes/he.h.m7:heHE.TinYperFysinMitera.name
ltx/en_us_dedes/oc.m7.d5:ocMA.OdeW9C2T.mode	@ltx/en_us_dedes/miscellanea:misc.Mode7
ltx/en_us_dedes/oc.m7.d5:ocMA.OdeW9C2T.ode	@ltx/en_us_dedes/miscellanea:misc.Ode9
ltx/en_us_dedes/oc.m7.d5:ocMA.OdeW9C2T.text	
ltx/en_us_dedes/oc.m7.d5:ocVE.ApolTheotokionVM.incipit	@ltx/en_us_dedes/oc.m7.d5:ocMA.Kathisma13.incipit
ltx/en_us_dedes/oc.m7.d5:ocVE.ApolTheotokionVM.melody	
ltx/en_us_dedes/oc.m7.d5:ocVE.ApolTheotokionVM.mode	@ltx/en_us_dedes/miscellanea:misc.Mode7
ltx/en_us_dedes/oc.m7.d5:ocVE.ApolTheotokionVM.text	@ltx/en_us_dedes/oc.m7.d5:ocMA.Kathisma13.text
ltx/en_us_dedes/oc.m7.d5:ocVE.AposTheotokion.incipit	Release us from the sins…
ltx/en_us_dedes/oc.m7.d5:ocVE.AposTheotokion.melody	
ltx/en_us_dedes/oc.m7.d5:ocVE.AposTheotokion.mode	@ltx/en_us_dedes/miscellanea:misc.Mode7
ltx/en_us_dedes/oc.m7.d5:ocVE.AposTheotokion.text	Release us from the sins that sorely oppress us. * We the faithful have no other hope, O Theotokos, * just you and God born from you.
ltx/en_us_dedes/oc.m7.d5:ocVE.Aposticha1.incipit	O glorious Apostles…
ltx/en_us_dedes/oc.m7.d5:ocVE.Aposticha1.melody	
ltx/en_us_dedes/oc.m7.d5:ocVE.Aposticha1.mode	@ltx/en_us_dedes/miscellanea:misc.Mode7
ltx/en_us_dedes/oc.m7.d5:ocVE.Aposticha1.text	O glorious Apostles, the pillars of the Churches, the preachers of the truth, and brightly shining torches: with the fire of the Spirit you burned all delusion, and enlightened the human race. Therefore we beseech you, pray unto our Savior and God, that He bring peace into the world, and that He save our souls.
ltx/en_us_dedes/oc.m7.d5:ocVE.Aposticha2.incipit	O Apostles of Christ, you…
ltx/en_us_dedes/oc.m7.d5:ocVE.Aposticha2.melody	
ltx/en_us_dedes/oc.m7.d5:ocVE.Aposticha2.mode	@ltx/en_us_dedes/miscellanea:misc.Mode7
ltx/en_us_dedes/oc.m7.d5:ocVE.Aposticha2.text	O Apostles of Christ, you are the laborers of the Savior. For bearing on your shoulders the Cross as a plowshare, you cleared the arid earth of the delusion of the idols, and sowed the word of the Faith. And therefore you are rightly honored, * O holy Apostles of Christ.
ltx/en_us_dedes/oc.m7.d5:ocVE.Aposticha3.incipit	O world-famous Martyrs, the spiritual…
ltx/en_us_dedes/oc.m7.d5:ocVE.Aposticha3.melody	
ltx/en_us_dedes/oc.m7.d5:ocVE.Aposticha3.mode	@ltx/en_us_dedes/miscellanea:misc.Mode7
ltx/en_us_dedes/oc.m7.d5:ocVE.Aposticha3.text	O world-famous Martyrs, the spiritual livestock, rational whole burnt offerings, and sacrifice acceptable and pleasing to God: the earth did not conceal you, but heaven received you, and thus you share the fellowship of the Angels. We beseech you, pray with them unto our Savior and God, that He bring peace into the world, and that He save our souls.
ltx/en_us_dedes/oc.m7.d5:ocVE.SticTheotokion.greekmelody	@ltx/en_us_dedes/he.a.m7:heAU.OukEtiKolyometha.greekname
ltx/en_us_dedes/oc.m7.d5:ocVE.SticTheotokion.incipit	…
ltx/en_us_dedes/oc.m7.d5:ocVE.SticTheotokion.melody	@ltx/en_us_dedes/he.a.m7:heAU.OukEtiKolyometha.name
ltx/en_us_dedes/oc.m7.d5:ocVE.SticTheotokion.mode	@ltx/en_us_dedes/miscellanea:misc.Mode7
ltx/en_us_dedes/oc.m7.d5:ocVE.SticTheotokion.text	
ltx/en_us_dedes/oc.m7.d5:ocVE.Stichera1.greekmelody	@ltx/en_us_dedes/he.a.m7:heAU.OukEtiKolyometha.greekname
ltx/en_us_dedes/oc.m7.d5:ocVE.Stichera1.incipit	…
ltx/en_us_dedes/oc.m7.d5:ocVE.Stichera1.melody	@ltx/en_us_dedes/he.a.m7:heAU.OukEtiKolyometha.name
ltx/en_us_dedes/oc.m7.d5:ocVE.Stichera1.mode	@ltx/en_us_dedes/miscellanea:misc.Mode7
ltx/en_us_dedes/oc.m7.d5:ocVE.Stichera1.text	
ltx/en_us_dedes/oc.m7.d5:ocVE.Stichera2.incipit	…
ltx/en_us_dedes/oc.m7.d5:ocVE.Stichera2.melody	@ltx/en_us_dedes/he.a.m7:heAU.OukEtiKolyometha.name
ltx/en_us_dedes/oc.m7.d5:ocVE.Stichera2.mode	@ltx/en_us_dedes/miscellanea:misc.Mode7
ltx/en_us_dedes/oc.m7.d5:ocVE.Stichera2.text	
ltx/en_us_dedes/oc.m7.d5:ocVE.Stichera3.incipit	Since you have gained…
ltx/en_us_dedes/oc.m7.d5:ocVE.Stichera3.melody	@ltx/en_us_dedes/he.a.m7:heAU.OukEtiKolyometha.name
ltx/en_us_dedes/oc.m7.d5:ocVE.Stichera3.mode	@ltx/en_us_dedes/miscellanea:misc.Mode7
ltx/en_us_dedes/oc.m7.d5:ocVE.Stichera3.text	Since you have gained the citizenship in heaven, * teach me to set my mind on the things of heaven, * and to utter the divine wills of God.
ltx/en_us_dedes/oc.m7.d5:ocVE.Stichera4.greekmelody	@ltx/en_us_dedes/he.a.m7:heAU.OukEtiKolyometha.greekname
ltx/en_us_dedes/oc.m7.d5:ocVE.Stichera4.incipit	…
ltx/en_us_dedes/oc.m7.d5:ocVE.Stichera4.melody	@ltx/en_us_dedes/he.a.m7:heAU.OukEtiKolyometha.name
ltx/en_us_dedes/oc.m7.d5:ocVE.Stichera4.mode	@ltx/en_us_dedes/miscellanea:misc.Mode7
ltx/en_us_dedes/oc.m7.d5:ocVE.Stichera4.text	
ltx/en_us_dedes/oc.m7.d5:ocVE.Stichera5.incipit	…
ltx/en_us_dedes/oc.m7.d5:ocVE.Stichera5.melody	@ltx/en_us_dedes/he.a.m7:heAU.OukEtiKolyometha.name
ltx/en_us_dedes/oc.m7.d5:ocVE.Stichera5.mode	@ltx/en_us_dedes/miscellanea:misc.Mode7
ltx/en_us_dedes/oc.m7.d5:ocVE.Stichera5.text	
ltx/en_us_dedes/oc.m7.d5:ocVE.Stichera6.incipit	O Nicholas the wise Hierarch…
ltx/en_us_dedes/oc.m7.d5:ocVE.Stichera6.melody	@ltx/en_us_dedes/he.a.m7:heAU.OukEtiKolyometha.name
ltx/en_us_dedes/oc.m7.d5:ocVE.Stichera6.mode	@ltx/en_us_dedes/miscellanea:misc.Mode7
ltx/en_us_dedes/oc.m7.d5:ocVE.Stichera6.text	O Nicholas the wise Hierarch, deliver * your supplicants from plagues and from tribulations, * earthquakes and necessity.
ltx/en_us_dedes/oc.m7.d5:octrMA.Kathisma11.incipit	@ltx/en_us_dedes/oc.m7.d5:ocMA.Kathisma11.incipit
ltx/en_us_dedes/oc.m7.d5:octrMA.Kathisma11.melody	
ltx/en_us_dedes/oc.m7.d5:octrMA.Kathisma11.mode	@ltx/en_us_dedes/miscellanea:misc.Mode7
ltx/en_us_dedes/oc.m7.d5:octrMA.Kathisma11.text	@ltx/en_us_dedes/oc.m7.d5:ocMA.Kathisma11.text
ltx/en_us_dedes/oc.m7.d5:octrMA.Kathisma12.incipit	O children of the Church…
ltx/en_us_dedes/oc.m7.d5:octrMA.Kathisma12.melody	
ltx/en_us_dedes/oc.m7.d5:octrMA.Kathisma12.mode	@ltx/en_us_dedes/miscellanea:misc.Mode7
ltx/en_us_dedes/oc.m7.d5:octrMA.Kathisma12.text	O children of the Church, as we commemorate the all-lauded Apostles, let us extol Christ in songs and hymns. They saved those guilty of sin, by preaching repentance. They drove away deceitful error, they shined light on the world, and they intercede on behalf of our nation.
ltx/en_us_dedes/oc.m7.d5:octrMA.Kathisma1T.incipit	O Mother of Christ our…
ltx/en_us_dedes/oc.m7.d5:octrMA.Kathisma1T.melody	
ltx/en_us_dedes/oc.m7.d5:octrMA.Kathisma1T.mode	@ltx/en_us_dedes/miscellanea:misc.Mode7
ltx/en_us_dedes/oc.m7.d5:octrMA.Kathisma1T.text	O Mother of Christ our God, we salute you and say: Rejoice! From you the Logos became flesh without alteration, and He dwelt among us. Rejoice, noble Lady! You are the exultation of the Apostles and Martyrs, and the salvation of the faithful.
ltx/en_us_dedes/oc.m7.d5:octrMA.Ode7Martyricon.incipit	@ltx/en_us_dedes/oc.m7.d2:ocMA.Kathisma32.incipit
ltx/en_us_dedes/oc.m7.d5:octrMA.Ode7Martyricon.melody	
ltx/en_us_dedes/oc.m7.d5:octrMA.Ode7Martyricon.mode	@ltx/en_us_dedes/miscellanea:misc.Mode7
ltx/en_us_dedes/oc.m7.d5:octrMA.Ode7Martyricon.text	@ltx/en_us_dedes/oc.m7.d2:ocMA.Kathisma32.text
ltx/en_us_dedes/oc.m7.d5:octrMA.Photogogic.incipit	@ltx/en_us_dedes/oc.m7.d2:octrMA.Photagogic.incipit
ltx/en_us_dedes/oc.m7.d5:octrMA.Photogogic.mode	@ltx/en_us_dedes/miscellanea:misc.Mode7
ltx/en_us_dedes/oc.m7.d5:octrMA.Photogogic.text	@ltx/en_us_dedes/oc.m7.d2:octrMA.Photagogic.text
ltx/en_us_dedes/oc.m7.d5:octrMA.Triadic1.incipit	@ltx/en_us_dedes/oc.m7.d2:octrMA.Triadic1.incipit
ltx/en_us_dedes/oc.m7.d5:octrMA.Triadic1.mode	@ltx/en_us_dedes/miscellanea:misc.Mode7
ltx/en_us_dedes/oc.m7.d5:octrMA.Triadic1.text	@ltx/en_us_dedes/oc.m7.d2:octrMA.Triadic1.text
ltx/en_us_dedes/oc.m7.d5:octrMA.Triadic2.incipit	@ltx/en_us_dedes/oc.m7.d2:octrMA.Triadic2.incipit
ltx/en_us_dedes/oc.m7.d5:octrMA.Triadic2.mode	@ltx/en_us_dedes/miscellanea:misc.Mode7
ltx/en_us_dedes/oc.m7.d5:octrMA.Triadic2.text	@ltx/en_us_dedes/oc.m7.d2:octrMA.Triadic2.text
ltx/en_us_dedes/oc.m7.d5:octrMA.Triadic3.incipit	@ltx/en_us_dedes/oc.m7.d2:octrMA.Triadic3.incipit
ltx/en_us_dedes/oc.m7.d5:octrMA.Triadic3.mode	@ltx/en_us_dedes/miscellanea:misc.Mode7
ltx/en_us_dedes/oc.m7.d5:octrMA.Triadic3.text	@ltx/en_us_dedes/oc.m7.d2:octrMA.Triadic3.text
