ltx/en_us_dedes/sy.m12.d04:syMA.commemoration01.couplet1.title	@ltx/en_us_dedes/titles:ti.Verses
ltx/en_us_dedes/sy.m12.d04:syMA.commemoration01.couplet1.verse1	
ltx/en_us_dedes/sy.m12.d04:syMA.commemoration01.couplet1.verse2	
ltx/en_us_dedes/sy.m12.d04:syMA.commemoration01.narration.p01	
ltx/en_us_dedes/sy.m12.d04:syMA.commemoration01.single1	
ltx/en_us_dedes/sy.m12.d04:syMA.commemoration01.text	On December 4 we commemorate the contest of the holy Great-martyr Barbara.
ltx/en_us_dedes/sy.m12.d04:syMA.commemoration02.couplet1.title	@ltx/en_us_dedes/titles:ti.Verses
ltx/en_us_dedes/sy.m12.d04:syMA.commemoration02.couplet1.verse1	
ltx/en_us_dedes/sy.m12.d04:syMA.commemoration02.couplet1.verse2	
ltx/en_us_dedes/sy.m12.d04:syMA.commemoration02.narration.p01	
ltx/en_us_dedes/sy.m12.d04:syMA.commemoration02.narration.p02	
ltx/en_us_dedes/sy.m12.d04:syMA.commemoration02.narration.p03	
ltx/en_us_dedes/sy.m12.d04:syMA.commemoration02.text	On this day we also commemorate our devout father John of Damascus, the Monk and Priest.
ltx/en_us_dedes/sy.m12.d04:syMA.commemoration03.couplet1.title	@ltx/en_us_dedes/titles:ti.Verses
ltx/en_us_dedes/sy.m12.d04:syMA.commemoration03.couplet1.verse1	
ltx/en_us_dedes/sy.m12.d04:syMA.commemoration03.couplet1.verse2	
ltx/en_us_dedes/sy.m12.d04:syMA.commemoration03.narration.p01	
ltx/en_us_dedes/sy.m12.d04:syMA.commemoration03.text	On this day we also commemorate our devout Father John the Wonder-worker, Bishop of Polybotus.
ltx/en_us_dedes/sy.m12.d04:syMA.commemoration04.couplet1.title	@ltx/en_us_dedes/titles:ti.Verses
ltx/en_us_dedes/sy.m12.d04:syMA.commemoration04.couplet1.verse1	
ltx/en_us_dedes/sy.m12.d04:syMA.commemoration04.couplet1.verse2	
ltx/en_us_dedes/sy.m12.d04:syMA.commemoration04.text	On this day Saint Julianna died by the sword.
ltx/en_us_dedes/sy.m12.d04:syMA.commemoration05.couplet1.title	@ltx/en_us_dedes/titles:ti.Verses
ltx/en_us_dedes/sy.m12.d04:syMA.commemoration05.couplet1.verse1	
ltx/en_us_dedes/sy.m12.d04:syMA.commemoration05.couplet1.verse2	
ltx/en_us_dedes/sy.m12.d04:syMA.commemoration05.text	On this day Saints Christodoulos and Christodouli died by the sword.
ltx/en_us_dedes/sy.m12.d04:syMA.commemoration06.couplet1.title	@ltx/en_us_dedes/titles:ti.Verses
ltx/en_us_dedes/sy.m12.d04:syMA.commemoration06.couplet1.verse1	
ltx/en_us_dedes/sy.m12.d04:syMA.commemoration06.couplet1.verse2	
ltx/en_us_dedes/sy.m12.d04:syMA.commemoration06.text	The holy new Hieromartyr Seraphim, Bishop of Phanarion, witnessed in the year 1601, and died by being impaled.
ltx/en_us_dedes/sy.m12.d04:syMA.lastline	By their holy intercessions, O God, have mercy on us and save us. Amen.
