ltx/en_us_dedes/me.m03.d31:meDA.commemoration.first	Memory of the Holy Hieromartyr Hypatios
ltx/en_us_dedes/me.m03.d31:meDA.commemoration.first_name	
ltx/en_us_dedes/me.m03.d31:meDA.commemoration.first_short	Memory of the Holy Hieromartyr Hypatios
ltx/en_us_dedes/me.m03.d31:meDA.commemoration.first_title	@ltx/en_us_dedes/titles:ti.SaintM
ltx/en_us_dedes/me.m03.d31:meDA.commemoration.full	Memory of the Holy Hieromartyr Hypatios the Wonder-worker, Bishop of Gangra.
ltx/en_us_dedes/me.m03.d31:meDA.commemoration.second_name	
ltx/en_us_dedes/me.m03.d31:meDA.commemoration.second_title	
ltx/en_us_dedes/me.m03.d31:meDA.date	March 31
ltx/en_us_dedes/me.m03.d31:meDA.fordate	for March 31
ltx/en_us_dedes/me.m03.d31:meDA.insert1	
ltx/en_us_dedes/me.m03.d31:meDA.insert2	
ltx/en_us_dedes/me.m03.d31:meDA.note	
ltx/en_us_dedes/me.m03.d31:meDA.pdfcoverdate	March 31,
ltx/en_us_dedes/me.m03.d31:meDA.pdfheaderdate	March 31
ltx/en_us_dedes/me.m03.d31:meHO.commemorations	
ltx/en_us_dedes/me.m03.d31:meHO.note1	
ltx/en_us_dedes/me.m03.d31:meHO.note2	
ltx/en_us_dedes/me.m03.d31:meHO.number	
ltx/en_us_dedes/me.m03.d31:meHO.rank	
ltx/en_us_dedes/me.m03.d31:meLE.commemoration1	Memory of the Holy Hieromartyr Hypatios the Wonder-worker, Bishop of Gangra.
ltx/en_us_dedes/me.m03.d31:meLE.commemoration2	
ltx/en_us_dedes/me.m03.d31:meLI.Kontakion1.incipit	…
ltx/en_us_dedes/me.m03.d31:meLI.Kontakion1.melody	
ltx/en_us_dedes/me.m03.d31:meLI.Kontakion1.mode	
ltx/en_us_dedes/me.m03.d31:meLI.Kontakion1.text	
ltx/en_us_dedes/me.m03.d31:meLI.Megalynarion.text	
ltx/en_us_dedes/me.m03.d31:meMA.C1.title	@ltx/en_us_dedes/titles:ti.CanonHieromartyr
ltx/en_us_dedes/me.m03.d31:meMA.C1.verse	@ltx/en_us_dedes/prayers:pr.verse_SaintM.text
ltx/en_us_dedes/me.m03.d31:meMA.Ode1C11.greekmelody	@ltx/en_us_dedes/he.h.m8:heHE.YgranDiodefsas.greekname
ltx/en_us_dedes/me.m03.d31:meMA.Ode1C11.incipit	…
ltx/en_us_dedes/me.m03.d31:meMA.Ode1C11.melody	@ltx/en_us_dedes/he.h.m8:heHE.YgranDiodefsas.name
ltx/en_us_dedes/me.m03.d31:meMA.Ode1C11.mode	@ltx/en_us_dedes/miscellanea:misc.Mode8
ltx/en_us_dedes/me.m03.d31:meMA.Ode1C11.ode	@ltx/en_us_dedes/miscellanea:misc.Ode1
ltx/en_us_dedes/me.m03.d31:meMA.Ode1C11.text	
ltx/en_us_dedes/me.m03.d31:meMA.Ode1C12.incipit	…
ltx/en_us_dedes/me.m03.d31:meMA.Ode1C12.melody	@ltx/en_us_dedes/he.h.m8:heHE.YgranDiodefsas.name
ltx/en_us_dedes/me.m03.d31:meMA.Ode1C12.mode	@ltx/en_us_dedes/miscellanea:misc.Mode8
ltx/en_us_dedes/me.m03.d31:meMA.Ode1C12.ode	@ltx/en_us_dedes/miscellanea:misc.Ode1
ltx/en_us_dedes/me.m03.d31:meMA.Ode1C12.text	
ltx/en_us_dedes/me.m03.d31:meMA.Ode1C13.incipit	…
ltx/en_us_dedes/me.m03.d31:meMA.Ode1C13.melody	@ltx/en_us_dedes/he.h.m8:heHE.YgranDiodefsas.name
ltx/en_us_dedes/me.m03.d31:meMA.Ode1C13.mode	@ltx/en_us_dedes/miscellanea:misc.Mode8
ltx/en_us_dedes/me.m03.d31:meMA.Ode1C13.ode	@ltx/en_us_dedes/miscellanea:misc.Ode1
ltx/en_us_dedes/me.m03.d31:meMA.Ode1C13.text	
ltx/en_us_dedes/me.m03.d31:meMA.Ode1C1H.greekmelody	@ltx/en_us_dedes/he.h.m8:heHE.YgranDiodefsas.greekname
ltx/en_us_dedes/me.m03.d31:meMA.Ode1C1H.incipit	@ltx/en_us_dedes/he.h.m8:heHE.YgranDiodefsas.incipit
ltx/en_us_dedes/me.m03.d31:meMA.Ode1C1H.melody	@ltx/en_us_dedes/he.h.m8:heHE.YgranDiodefsas.melody
ltx/en_us_dedes/me.m03.d31:meMA.Ode1C1H.mode	@ltx/en_us_dedes/miscellanea:misc.Mode8
ltx/en_us_dedes/me.m03.d31:meMA.Ode1C1H.ode	@ltx/en_us_dedes/miscellanea:misc.Ode1
ltx/en_us_dedes/me.m03.d31:meMA.Ode1C1H.text	@ltx/en_us_dedes/he.h.m8:heHE.YgranDiodefsas.text
ltx/en_us_dedes/me.m03.d31:meMA.Ode1C1T.incipit	…
ltx/en_us_dedes/me.m03.d31:meMA.Ode1C1T.melody	@ltx/en_us_dedes/he.h.m8:heHE.YgranDiodefsas.name
ltx/en_us_dedes/me.m03.d31:meMA.Ode1C1T.mode	@ltx/en_us_dedes/miscellanea:misc.Mode8
ltx/en_us_dedes/me.m03.d31:meMA.Ode1C1T.ode	@ltx/en_us_dedes/miscellanea:misc.Ode1
ltx/en_us_dedes/me.m03.d31:meMA.Ode1C1T.text	
ltx/en_us_dedes/me.m03.d31:meMA.Ode3C11.greekmelody	@ltx/en_us_dedes/he.h.m8:heHE.SyEiToStereoma.greekname
ltx/en_us_dedes/me.m03.d31:meMA.Ode3C11.incipit	…
ltx/en_us_dedes/me.m03.d31:meMA.Ode3C11.melody	@ltx/en_us_dedes/he.h.m8:heHE.SyEiToStereoma.name
ltx/en_us_dedes/me.m03.d31:meMA.Ode3C11.mode	@ltx/en_us_dedes/miscellanea:misc.Mode8
ltx/en_us_dedes/me.m03.d31:meMA.Ode3C11.ode	@ltx/en_us_dedes/miscellanea:misc.Ode3
ltx/en_us_dedes/me.m03.d31:meMA.Ode3C11.text	
ltx/en_us_dedes/me.m03.d31:meMA.Ode3C12.incipit	…
ltx/en_us_dedes/me.m03.d31:meMA.Ode3C12.melody	@ltx/en_us_dedes/he.h.m8:heHE.SyEiToStereoma.name
ltx/en_us_dedes/me.m03.d31:meMA.Ode3C12.mode	@ltx/en_us_dedes/miscellanea:misc.Mode8
ltx/en_us_dedes/me.m03.d31:meMA.Ode3C12.ode	@ltx/en_us_dedes/miscellanea:misc.Ode3
ltx/en_us_dedes/me.m03.d31:meMA.Ode3C12.text	
ltx/en_us_dedes/me.m03.d31:meMA.Ode3C13.incipit	…
ltx/en_us_dedes/me.m03.d31:meMA.Ode3C13.melody	@ltx/en_us_dedes/he.h.m8:heHE.SyEiToStereoma.name
ltx/en_us_dedes/me.m03.d31:meMA.Ode3C13.mode	@ltx/en_us_dedes/miscellanea:misc.Mode8
ltx/en_us_dedes/me.m03.d31:meMA.Ode3C13.ode	@ltx/en_us_dedes/miscellanea:misc.Ode3
ltx/en_us_dedes/me.m03.d31:meMA.Ode3C13.text	
ltx/en_us_dedes/me.m03.d31:meMA.Ode3C14.incipit	…
ltx/en_us_dedes/me.m03.d31:meMA.Ode3C14.melody	@ltx/en_us_dedes/he.h.m8:heHE.SyEiToStereoma.name
ltx/en_us_dedes/me.m03.d31:meMA.Ode3C14.mode	@ltx/en_us_dedes/miscellanea:misc.Mode8
ltx/en_us_dedes/me.m03.d31:meMA.Ode3C14.ode	@ltx/en_us_dedes/miscellanea:misc.Ode3
ltx/en_us_dedes/me.m03.d31:meMA.Ode3C14.text	
ltx/en_us_dedes/me.m03.d31:meMA.Ode3C1H.greekmelody	@ltx/en_us_dedes/he.h.m8:heHE.SyEiToStereoma.greekname
ltx/en_us_dedes/me.m03.d31:meMA.Ode3C1H.incipit	@ltx/en_us_dedes/he.h.m8:heHE.SyEiToStereoma.incipit
ltx/en_us_dedes/me.m03.d31:meMA.Ode3C1H.melody	@ltx/en_us_dedes/he.h.m8:heHE.SyEiToStereoma.melody
ltx/en_us_dedes/me.m03.d31:meMA.Ode3C1H.mode	@ltx/en_us_dedes/miscellanea:misc.Mode8
ltx/en_us_dedes/me.m03.d31:meMA.Ode3C1H.ode	@ltx/en_us_dedes/miscellanea:misc.Ode3
ltx/en_us_dedes/me.m03.d31:meMA.Ode3C1H.text	@ltx/en_us_dedes/he.h.m8:heHE.SyEiToStereoma.text
ltx/en_us_dedes/me.m03.d31:meMA.Ode3C1T.incipit	…
ltx/en_us_dedes/me.m03.d31:meMA.Ode3C1T.melody	@ltx/en_us_dedes/he.h.m8:heHE.SyEiToStereoma.name
ltx/en_us_dedes/me.m03.d31:meMA.Ode3C1T.mode	@ltx/en_us_dedes/miscellanea:misc.Mode8
ltx/en_us_dedes/me.m03.d31:meMA.Ode3C1T.ode	@ltx/en_us_dedes/miscellanea:misc.Ode3
ltx/en_us_dedes/me.m03.d31:meMA.Ode3C1T.text	
ltx/en_us_dedes/me.m03.d31:meMA.Ode3Kathisma1.greekmelody	@ltx/en_us_dedes/he.a.m4:heAU.TachyProkatalave.greekname
ltx/en_us_dedes/me.m03.d31:meMA.Ode3Kathisma1.incipit	…
ltx/en_us_dedes/me.m03.d31:meMA.Ode3Kathisma1.melody	@ltx/en_us_dedes/he.a.m4:heAU.TachyProkatalave.name
ltx/en_us_dedes/me.m03.d31:meMA.Ode3Kathisma1.mode	@ltx/en_us_dedes/miscellanea:misc.Mode4
ltx/en_us_dedes/me.m03.d31:meMA.Ode3Kathisma1.text	
ltx/en_us_dedes/me.m03.d31:meMA.Ode3KathismaSt.incipit	…
ltx/en_us_dedes/me.m03.d31:meMA.Ode3KathismaSt.melody	@ltx/en_us_dedes/he.a.m4:heAU.TachyProkatalave.name
ltx/en_us_dedes/me.m03.d31:meMA.Ode3KathismaSt.mode	@ltx/en_us_dedes/miscellanea:misc.Mode4
ltx/en_us_dedes/me.m03.d31:meMA.Ode3KathismaSt.text	
ltx/en_us_dedes/me.m03.d31:meMA.Ode3KathismaT.incipit	…
ltx/en_us_dedes/me.m03.d31:meMA.Ode3KathismaT.melody	@ltx/en_us_dedes/he.a.m4:heAU.TachyProkatalave.name
ltx/en_us_dedes/me.m03.d31:meMA.Ode3KathismaT.mode	@ltx/en_us_dedes/miscellanea:misc.Mode4
ltx/en_us_dedes/me.m03.d31:meMA.Ode3KathismaT.text	
ltx/en_us_dedes/me.m03.d31:meMA.Ode4C11.greekmelody	@ltx/en_us_dedes/he.h.m8:heHE.EisakikoaKyrie.greekname
ltx/en_us_dedes/me.m03.d31:meMA.Ode4C11.incipit	…
ltx/en_us_dedes/me.m03.d31:meMA.Ode4C11.melody	@ltx/en_us_dedes/he.h.m8:heHE.EisakikoaKyrie.name
ltx/en_us_dedes/me.m03.d31:meMA.Ode4C11.mode	@ltx/en_us_dedes/miscellanea:misc.Mode8
ltx/en_us_dedes/me.m03.d31:meMA.Ode4C11.ode	@ltx/en_us_dedes/miscellanea:misc.Ode4
ltx/en_us_dedes/me.m03.d31:meMA.Ode4C11.text	
ltx/en_us_dedes/me.m03.d31:meMA.Ode4C12.incipit	…
ltx/en_us_dedes/me.m03.d31:meMA.Ode4C12.melody	@ltx/en_us_dedes/he.h.m8:heHE.EisakikoaKyrie.name
ltx/en_us_dedes/me.m03.d31:meMA.Ode4C12.mode	@ltx/en_us_dedes/miscellanea:misc.Mode8
ltx/en_us_dedes/me.m03.d31:meMA.Ode4C12.ode	@ltx/en_us_dedes/miscellanea:misc.Ode4
ltx/en_us_dedes/me.m03.d31:meMA.Ode4C12.text	
ltx/en_us_dedes/me.m03.d31:meMA.Ode4C13.incipit	…
ltx/en_us_dedes/me.m03.d31:meMA.Ode4C13.melody	@ltx/en_us_dedes/he.h.m8:heHE.EisakikoaKyrie.name
ltx/en_us_dedes/me.m03.d31:meMA.Ode4C13.mode	@ltx/en_us_dedes/miscellanea:misc.Mode8
ltx/en_us_dedes/me.m03.d31:meMA.Ode4C13.ode	@ltx/en_us_dedes/miscellanea:misc.Ode4
ltx/en_us_dedes/me.m03.d31:meMA.Ode4C13.text	
ltx/en_us_dedes/me.m03.d31:meMA.Ode4C1H.greekmelody	@ltx/en_us_dedes/he.h.m8:heHE.EisakikoaKyrie.greekname
ltx/en_us_dedes/me.m03.d31:meMA.Ode4C1H.incipit	@ltx/en_us_dedes/he.h.m8:heHE.EisakikoaKyrie.incipit
ltx/en_us_dedes/me.m03.d31:meMA.Ode4C1H.melody	@ltx/en_us_dedes/he.h.m8:heHE.EisakikoaKyrie.melody
ltx/en_us_dedes/me.m03.d31:meMA.Ode4C1H.mode	@ltx/en_us_dedes/miscellanea:misc.Mode8
ltx/en_us_dedes/me.m03.d31:meMA.Ode4C1H.ode	@ltx/en_us_dedes/miscellanea:misc.Ode4
ltx/en_us_dedes/me.m03.d31:meMA.Ode4C1H.text	@ltx/en_us_dedes/he.h.m8:heHE.EisakikoaKyrie.text
ltx/en_us_dedes/me.m03.d31:meMA.Ode4C1T.incipit	…
ltx/en_us_dedes/me.m03.d31:meMA.Ode4C1T.melody	@ltx/en_us_dedes/he.h.m8:heHE.EisakikoaKyrie.name
ltx/en_us_dedes/me.m03.d31:meMA.Ode4C1T.mode	@ltx/en_us_dedes/miscellanea:misc.Mode8
ltx/en_us_dedes/me.m03.d31:meMA.Ode4C1T.ode	@ltx/en_us_dedes/miscellanea:misc.Ode4
ltx/en_us_dedes/me.m03.d31:meMA.Ode4C1T.text	
ltx/en_us_dedes/me.m03.d31:meMA.Ode5C11.greekmelody	@ltx/en_us_dedes/he.h.m8:heHE.InaTiMeAposo.greekname
ltx/en_us_dedes/me.m03.d31:meMA.Ode5C11.incipit	…
ltx/en_us_dedes/me.m03.d31:meMA.Ode5C11.melody	@ltx/en_us_dedes/he.h.m8:heHE.InaTiMeAposo.name
ltx/en_us_dedes/me.m03.d31:meMA.Ode5C11.mode	@ltx/en_us_dedes/miscellanea:misc.Mode8
ltx/en_us_dedes/me.m03.d31:meMA.Ode5C11.ode	@ltx/en_us_dedes/miscellanea:misc.Ode5
ltx/en_us_dedes/me.m03.d31:meMA.Ode5C11.text	
ltx/en_us_dedes/me.m03.d31:meMA.Ode5C12.incipit	…
ltx/en_us_dedes/me.m03.d31:meMA.Ode5C12.melody	@ltx/en_us_dedes/he.h.m8:heHE.InaTiMeAposo.name
ltx/en_us_dedes/me.m03.d31:meMA.Ode5C12.mode	@ltx/en_us_dedes/miscellanea:misc.Mode8
ltx/en_us_dedes/me.m03.d31:meMA.Ode5C12.ode	@ltx/en_us_dedes/miscellanea:misc.Ode5
ltx/en_us_dedes/me.m03.d31:meMA.Ode5C12.text	
ltx/en_us_dedes/me.m03.d31:meMA.Ode5C13.incipit	…
ltx/en_us_dedes/me.m03.d31:meMA.Ode5C13.melody	@ltx/en_us_dedes/he.h.m8:heHE.InaTiMeAposo.name
ltx/en_us_dedes/me.m03.d31:meMA.Ode5C13.mode	@ltx/en_us_dedes/miscellanea:misc.Mode8
ltx/en_us_dedes/me.m03.d31:meMA.Ode5C13.ode	@ltx/en_us_dedes/miscellanea:misc.Ode5
ltx/en_us_dedes/me.m03.d31:meMA.Ode5C13.text	
ltx/en_us_dedes/me.m03.d31:meMA.Ode5C1H.greekmelody	@ltx/en_us_dedes/he.h.m8:heHE.InaTiMeAposo.greekname
ltx/en_us_dedes/me.m03.d31:meMA.Ode5C1H.incipit	@ltx/en_us_dedes/he.h.m8:heHE.InaTiMeAposo.incipit
ltx/en_us_dedes/me.m03.d31:meMA.Ode5C1H.melody	@ltx/en_us_dedes/he.h.m8:heHE.InaTiMeAposo.melody
ltx/en_us_dedes/me.m03.d31:meMA.Ode5C1H.mode	@ltx/en_us_dedes/miscellanea:misc.Mode8
ltx/en_us_dedes/me.m03.d31:meMA.Ode5C1H.ode	@ltx/en_us_dedes/miscellanea:misc.Ode5
ltx/en_us_dedes/me.m03.d31:meMA.Ode5C1H.text	@ltx/en_us_dedes/he.h.m8:heHE.InaTiMeAposo.text
ltx/en_us_dedes/me.m03.d31:meMA.Ode5C1T.incipit	…
ltx/en_us_dedes/me.m03.d31:meMA.Ode5C1T.melody	@ltx/en_us_dedes/he.h.m8:heHE.InaTiMeAposo.name
ltx/en_us_dedes/me.m03.d31:meMA.Ode5C1T.mode	@ltx/en_us_dedes/miscellanea:misc.Mode8
ltx/en_us_dedes/me.m03.d31:meMA.Ode5C1T.ode	@ltx/en_us_dedes/miscellanea:misc.Ode5
ltx/en_us_dedes/me.m03.d31:meMA.Ode5C1T.text	
ltx/en_us_dedes/me.m03.d31:meMA.Ode6C11.greekmelody	@ltx/en_us_dedes/he.h.m8:heHE.IlasthitiMoiSotir.greekname
ltx/en_us_dedes/me.m03.d31:meMA.Ode6C11.incipit	…
ltx/en_us_dedes/me.m03.d31:meMA.Ode6C11.melody	@ltx/en_us_dedes/he.h.m8:heHE.IlasthitiMoiSotir.name
ltx/en_us_dedes/me.m03.d31:meMA.Ode6C11.mode	@ltx/en_us_dedes/miscellanea:misc.Mode8
ltx/en_us_dedes/me.m03.d31:meMA.Ode6C11.ode	@ltx/en_us_dedes/miscellanea:misc.Ode6
ltx/en_us_dedes/me.m03.d31:meMA.Ode6C11.text	
ltx/en_us_dedes/me.m03.d31:meMA.Ode6C12.incipit	…
ltx/en_us_dedes/me.m03.d31:meMA.Ode6C12.melody	@ltx/en_us_dedes/he.h.m8:heHE.IlasthitiMoiSotir.name
ltx/en_us_dedes/me.m03.d31:meMA.Ode6C12.mode	@ltx/en_us_dedes/miscellanea:misc.Mode8
ltx/en_us_dedes/me.m03.d31:meMA.Ode6C12.ode	@ltx/en_us_dedes/miscellanea:misc.Ode6
ltx/en_us_dedes/me.m03.d31:meMA.Ode6C12.text	
ltx/en_us_dedes/me.m03.d31:meMA.Ode6C13.incipit	…
ltx/en_us_dedes/me.m03.d31:meMA.Ode6C13.melody	@ltx/en_us_dedes/he.h.m8:heHE.IlasthitiMoiSotir.name
ltx/en_us_dedes/me.m03.d31:meMA.Ode6C13.mode	@ltx/en_us_dedes/miscellanea:misc.Mode8
ltx/en_us_dedes/me.m03.d31:meMA.Ode6C13.ode	@ltx/en_us_dedes/miscellanea:misc.Ode6
ltx/en_us_dedes/me.m03.d31:meMA.Ode6C13.text	
ltx/en_us_dedes/me.m03.d31:meMA.Ode6C1H.greekmelody	@ltx/en_us_dedes/he.h.m8:heHE.IlasthitiMoiSotir.greekname
ltx/en_us_dedes/me.m03.d31:meMA.Ode6C1H.incipit	@ltx/en_us_dedes/he.h.m8:heHE.IlasthitiMoiSotir.incipit
ltx/en_us_dedes/me.m03.d31:meMA.Ode6C1H.melody	@ltx/en_us_dedes/he.h.m8:heHE.IlasthitiMoiSotir.melody
ltx/en_us_dedes/me.m03.d31:meMA.Ode6C1H.mode	@ltx/en_us_dedes/miscellanea:misc.Mode8
ltx/en_us_dedes/me.m03.d31:meMA.Ode6C1H.ode	@ltx/en_us_dedes/miscellanea:misc.Ode6
ltx/en_us_dedes/me.m03.d31:meMA.Ode6C1H.text	@ltx/en_us_dedes/he.h.m8:heHE.IlasthitiMoiSotir.text
ltx/en_us_dedes/me.m03.d31:meMA.Ode6C1T.incipit	…
ltx/en_us_dedes/me.m03.d31:meMA.Ode6C1T.melody	@ltx/en_us_dedes/he.h.m8:heHE.IlasthitiMoiSotir.name
ltx/en_us_dedes/me.m03.d31:meMA.Ode6C1T.mode	@ltx/en_us_dedes/miscellanea:misc.Mode8
ltx/en_us_dedes/me.m03.d31:meMA.Ode6C1T.ode	@ltx/en_us_dedes/miscellanea:misc.Ode6
ltx/en_us_dedes/me.m03.d31:meMA.Ode6C1T.text	
ltx/en_us_dedes/me.m03.d31:meMA.Ode7C11.greekmelody	@ltx/en_us_dedes/he.h.m8:heHE.OiEkTisIoudaias.greekname
ltx/en_us_dedes/me.m03.d31:meMA.Ode7C11.incipit	…
ltx/en_us_dedes/me.m03.d31:meMA.Ode7C11.melody	@ltx/en_us_dedes/he.h.m8:heHE.OiEkTisIoudaias.name
ltx/en_us_dedes/me.m03.d31:meMA.Ode7C11.mode	@ltx/en_us_dedes/miscellanea:misc.Mode8
ltx/en_us_dedes/me.m03.d31:meMA.Ode7C11.ode	@ltx/en_us_dedes/miscellanea:misc.Ode7
ltx/en_us_dedes/me.m03.d31:meMA.Ode7C11.text	
ltx/en_us_dedes/me.m03.d31:meMA.Ode7C12.incipit	…
ltx/en_us_dedes/me.m03.d31:meMA.Ode7C12.melody	@ltx/en_us_dedes/he.h.m8:heHE.OiEkTisIoudaias.name
ltx/en_us_dedes/me.m03.d31:meMA.Ode7C12.mode	@ltx/en_us_dedes/miscellanea:misc.Mode8
ltx/en_us_dedes/me.m03.d31:meMA.Ode7C12.ode	@ltx/en_us_dedes/miscellanea:misc.Ode7
ltx/en_us_dedes/me.m03.d31:meMA.Ode7C12.text	
ltx/en_us_dedes/me.m03.d31:meMA.Ode7C1H.greekmelody	@ltx/en_us_dedes/he.h.m8:heHE.OiEkTisIoudaias.greekname
ltx/en_us_dedes/me.m03.d31:meMA.Ode7C1H.incipit	@ltx/en_us_dedes/he.h.m8:heHE.OiEkTisIoudaias.incipit
ltx/en_us_dedes/me.m03.d31:meMA.Ode7C1H.melody	@ltx/en_us_dedes/he.h.m8:heHE.OiEkTisIoudaias.melody
ltx/en_us_dedes/me.m03.d31:meMA.Ode7C1H.mode	@ltx/en_us_dedes/miscellanea:misc.Mode8
ltx/en_us_dedes/me.m03.d31:meMA.Ode7C1H.ode	@ltx/en_us_dedes/miscellanea:misc.Ode7
ltx/en_us_dedes/me.m03.d31:meMA.Ode7C1H.text	@ltx/en_us_dedes/he.h.m8:heHE.OiEkTisIoudaias.text
ltx/en_us_dedes/me.m03.d31:meMA.Ode7C1T.incipit	…
ltx/en_us_dedes/me.m03.d31:meMA.Ode7C1T.melody	@ltx/en_us_dedes/he.h.m8:heHE.OiEkTisIoudaias.name
ltx/en_us_dedes/me.m03.d31:meMA.Ode7C1T.mode	@ltx/en_us_dedes/miscellanea:misc.Mode8
ltx/en_us_dedes/me.m03.d31:meMA.Ode7C1T.ode	@ltx/en_us_dedes/miscellanea:misc.Ode7
ltx/en_us_dedes/me.m03.d31:meMA.Ode7C1T.text	
ltx/en_us_dedes/me.m03.d31:meMA.Ode8C11.greekmelody	@ltx/en_us_dedes/he.h.m8:heHE.TonVasileaTonOuranon.greekname
ltx/en_us_dedes/me.m03.d31:meMA.Ode8C11.incipit	…
ltx/en_us_dedes/me.m03.d31:meMA.Ode8C11.melody	@ltx/en_us_dedes/he.h.m8:heHE.TonVasileaTonOuranon.name
ltx/en_us_dedes/me.m03.d31:meMA.Ode8C11.mode	@ltx/en_us_dedes/miscellanea:misc.Mode8
ltx/en_us_dedes/me.m03.d31:meMA.Ode8C11.ode	@ltx/en_us_dedes/miscellanea:misc.Ode8
ltx/en_us_dedes/me.m03.d31:meMA.Ode8C11.text	
ltx/en_us_dedes/me.m03.d31:meMA.Ode8C12.incipit	…
ltx/en_us_dedes/me.m03.d31:meMA.Ode8C12.melody	@ltx/en_us_dedes/he.h.m8:heHE.TonVasileaTonOuranon.name
ltx/en_us_dedes/me.m03.d31:meMA.Ode8C12.mode	@ltx/en_us_dedes/miscellanea:misc.Mode8
ltx/en_us_dedes/me.m03.d31:meMA.Ode8C12.ode	@ltx/en_us_dedes/miscellanea:misc.Ode8
ltx/en_us_dedes/me.m03.d31:meMA.Ode8C12.text	
ltx/en_us_dedes/me.m03.d31:meMA.Ode8C13.incipit	…
ltx/en_us_dedes/me.m03.d31:meMA.Ode8C13.melody	@ltx/en_us_dedes/he.h.m8:heHE.TonVasileaTonOuranon.name
ltx/en_us_dedes/me.m03.d31:meMA.Ode8C13.mode	@ltx/en_us_dedes/miscellanea:misc.Mode8
ltx/en_us_dedes/me.m03.d31:meMA.Ode8C13.ode	@ltx/en_us_dedes/miscellanea:misc.Ode8
ltx/en_us_dedes/me.m03.d31:meMA.Ode8C13.text	
ltx/en_us_dedes/me.m03.d31:meMA.Ode8C1H.greekmelody	@ltx/en_us_dedes/he.h.m8:heHE.TonVasileaTonOuranon.greekname
ltx/en_us_dedes/me.m03.d31:meMA.Ode8C1H.incipit	@ltx/en_us_dedes/he.h.m8:heHE.TonVasileaTonOuranon.incipit
ltx/en_us_dedes/me.m03.d31:meMA.Ode8C1H.melody	@ltx/en_us_dedes/he.h.m8:heHE.TonVasileaTonOuranon.melody
ltx/en_us_dedes/me.m03.d31:meMA.Ode8C1H.mode	@ltx/en_us_dedes/miscellanea:misc.Mode8
ltx/en_us_dedes/me.m03.d31:meMA.Ode8C1H.ode	@ltx/en_us_dedes/miscellanea:misc.Ode8
ltx/en_us_dedes/me.m03.d31:meMA.Ode8C1H.text	@ltx/en_us_dedes/he.h.m8:heHE.TonVasileaTonOuranon.text
ltx/en_us_dedes/me.m03.d31:meMA.Ode8C1T.incipit	…
ltx/en_us_dedes/me.m03.d31:meMA.Ode8C1T.melody	@ltx/en_us_dedes/he.h.m8:heHE.TonVasileaTonOuranon.name
ltx/en_us_dedes/me.m03.d31:meMA.Ode8C1T.mode	@ltx/en_us_dedes/miscellanea:misc.Mode8
ltx/en_us_dedes/me.m03.d31:meMA.Ode8C1T.ode	@ltx/en_us_dedes/miscellanea:misc.Ode8
ltx/en_us_dedes/me.m03.d31:meMA.Ode8C1T.text	
ltx/en_us_dedes/me.m03.d31:meMA.Ode9C11.greekmelody	@ltx/en_us_dedes/he.h.m8:heHE.ExestiEpiTouto.greekname
ltx/en_us_dedes/me.m03.d31:meMA.Ode9C11.incipit	…
ltx/en_us_dedes/me.m03.d31:meMA.Ode9C11.melody	@ltx/en_us_dedes/he.h.m8:heHE.ExestiEpiTouto.name
ltx/en_us_dedes/me.m03.d31:meMA.Ode9C11.mode	@ltx/en_us_dedes/miscellanea:misc.Mode8
ltx/en_us_dedes/me.m03.d31:meMA.Ode9C11.ode	@ltx/en_us_dedes/miscellanea:misc.Ode9
ltx/en_us_dedes/me.m03.d31:meMA.Ode9C11.text	
ltx/en_us_dedes/me.m03.d31:meMA.Ode9C12.incipit	…
ltx/en_us_dedes/me.m03.d31:meMA.Ode9C12.melody	@ltx/en_us_dedes/he.h.m8:heHE.ExestiEpiTouto.name
ltx/en_us_dedes/me.m03.d31:meMA.Ode9C12.mode	@ltx/en_us_dedes/miscellanea:misc.Mode8
ltx/en_us_dedes/me.m03.d31:meMA.Ode9C12.ode	@ltx/en_us_dedes/miscellanea:misc.Ode9
ltx/en_us_dedes/me.m03.d31:meMA.Ode9C12.text	
ltx/en_us_dedes/me.m03.d31:meMA.Ode9C13.incipit	…
ltx/en_us_dedes/me.m03.d31:meMA.Ode9C13.melody	@ltx/en_us_dedes/he.h.m8:heHE.ExestiEpiTouto.name
ltx/en_us_dedes/me.m03.d31:meMA.Ode9C13.mode	@ltx/en_us_dedes/miscellanea:misc.Mode8
ltx/en_us_dedes/me.m03.d31:meMA.Ode9C13.ode	@ltx/en_us_dedes/miscellanea:misc.Ode9
ltx/en_us_dedes/me.m03.d31:meMA.Ode9C13.text	
ltx/en_us_dedes/me.m03.d31:meMA.Ode9C1H.greekmelody	@ltx/en_us_dedes/he.h.m8:heHE.ExestiEpiTouto.greekname
ltx/en_us_dedes/me.m03.d31:meMA.Ode9C1H.incipit	@ltx/en_us_dedes/he.h.m8:heHE.ExestiEpiTouto.incipit
ltx/en_us_dedes/me.m03.d31:meMA.Ode9C1H.melody	@ltx/en_us_dedes/he.h.m8:heHE.ExestiEpiTouto.melody
ltx/en_us_dedes/me.m03.d31:meMA.Ode9C1H.mode	@ltx/en_us_dedes/miscellanea:misc.Mode8
ltx/en_us_dedes/me.m03.d31:meMA.Ode9C1H.ode	@ltx/en_us_dedes/miscellanea:misc.Ode9
ltx/en_us_dedes/me.m03.d31:meMA.Ode9C1H.text	@ltx/en_us_dedes/he.h.m8:heHE.ExestiEpiTouto.text
ltx/en_us_dedes/me.m03.d31:meMA.Ode9C1T.incipit	…
ltx/en_us_dedes/me.m03.d31:meMA.Ode9C1T.melody	@ltx/en_us_dedes/he.h.m8:heHE.ExestiEpiTouto.name
ltx/en_us_dedes/me.m03.d31:meMA.Ode9C1T.mode	@ltx/en_us_dedes/miscellanea:misc.Mode8
ltx/en_us_dedes/me.m03.d31:meMA.Ode9C1T.ode	@ltx/en_us_dedes/miscellanea:misc.Ode9
ltx/en_us_dedes/me.m03.d31:meMA.Ode9C1T.text	
ltx/en_us_dedes/me.m03.d31:meVE.Apolytikion1ger.greekmelody	@ltx/en_us_dedes/he.a.m4:heAU.TachyProkatalave.greekname
ltx/en_us_dedes/me.m03.d31:meVE.Apolytikion1ger.incipit	…
ltx/en_us_dedes/me.m03.d31:meVE.Apolytikion1ger.melody	@ltx/en_us_dedes/he.a.m4:heAU.TachyProkatalave.name
ltx/en_us_dedes/me.m03.d31:meVE.Apolytikion1ger.mode	@ltx/en_us_dedes/miscellanea:misc.Mode4
ltx/en_us_dedes/me.m03.d31:meVE.Apolytikion1ger.poet	@ltx/en_us_dedes/poets:po.Gerasimou
ltx/en_us_dedes/me.m03.d31:meVE.Apolytikion1ger.text	
ltx/en_us_dedes/me.m03.d31:meVE.MM.Stichera1123as78910.text	@ltx/en_us_dedes/properties:media.key
ltx/en_us_dedes/me.m03.d31:meVE.SticStavrotheotokion.greekmelody	@ltx/en_us_dedes/he.a.m8:heAU.OTouParadoxou.greekname
ltx/en_us_dedes/me.m03.d31:meVE.SticStavrotheotokion.incipit	@ltx/en_us_dedes/me.m03.d13:meVE.SticStavrotheotokion.incipit
ltx/en_us_dedes/me.m03.d31:meVE.SticStavrotheotokion.melody	@ltx/en_us_dedes/he.a.m8:heAU.OTouParadoxou.name
ltx/en_us_dedes/me.m03.d31:meVE.SticStavrotheotokion.mode	@ltx/en_us_dedes/miscellanea:misc.Mode8
ltx/en_us_dedes/me.m03.d31:meVE.SticStavrotheotokion.text	@ltx/en_us_dedes/me.m03.d13:meVE.SticStavrotheotokion.text
ltx/en_us_dedes/me.m03.d31:meVE.SticTheotokion.greekmelody	@ltx/en_us_dedes/he.a.m8:heAU.OTouParadoxou.greekname
ltx/en_us_dedes/me.m03.d31:meVE.SticTheotokion.incipit	Pride and joy of all…
ltx/en_us_dedes/me.m03.d31:meVE.SticTheotokion.melody	@ltx/en_us_dedes/he.a.m8:heAU.OTouParadoxou.name
ltx/en_us_dedes/me.m03.d31:meVE.SticTheotokion.mode	@ltx/en_us_dedes/miscellanea:misc.Mode8
ltx/en_us_dedes/me.m03.d31:meVE.SticTheotokion.text	Pride and joy of all the world, rejoice! Rejoice, O Lampstand of gold! Place of shelter for all, rejoice! Temple of the Lord, rejoice! Mountain, shady and dense, rejoice! Rejoice, the glory of all the Orthodox! Mary, the Mother of Christ our God, rejoice! Garden of Paradise, holy Table, Tabernacle, O rejoice! Manna Jar of solid gold, rejoice, O hope of all!
ltx/en_us_dedes/me.m03.d31:meVE.Stichera01.greekmelody	@ltx/en_us_dedes/he.a.m8:heAU.OTouParadoxou.greekname
ltx/en_us_dedes/me.m03.d31:meVE.Stichera01.incipit	Godly-minded Father Hypatios, since you…
ltx/en_us_dedes/me.m03.d31:meVE.Stichera01.melody	@ltx/en_us_dedes/he.a.m8:heAU.OTouParadoxou.name
ltx/en_us_dedes/me.m03.d31:meVE.Stichera01.mode	@ltx/en_us_dedes/miscellanea:misc.Mode8
ltx/en_us_dedes/me.m03.d31:meVE.Stichera01.text	Godly-minded Father Hypatios, since you were nurtured and raised in a culture of self-control, you grew to illustrious heights of virtue, while reaching up toward the mystical vision of your God, clearly beholding the handsomeness of Christ as in a mirror; and being by His light illumined mind and heart, you have flashed on all of us with beams of miracles.
ltx/en_us_dedes/me.m03.d31:meVE.Stichera02.incipit	Father of Fathers, Hypatios, the…
ltx/en_us_dedes/me.m03.d31:meVE.Stichera02.melody	@ltx/en_us_dedes/he.a.m8:heAU.OTouParadoxou.name
ltx/en_us_dedes/me.m03.d31:meVE.Stichera02.mode	@ltx/en_us_dedes/miscellanea:misc.Mode8
ltx/en_us_dedes/me.m03.d31:meVE.Stichera02.text	Father of Fathers, Hypatios, the light of Orthodox truth flashed from you, O most righteous man, and you filled with light the minds of the faithful who came to you. You blinded Arius with your dazzling light, and drove him out from the holy Church of Christ. We have obtained you now as a luminary. And as we observe your all-sacred memory, we bless and honor it.
ltx/en_us_dedes/me.m03.d31:meVE.Stichera03.incipit	You, O sacred Father Hypatios…
ltx/en_us_dedes/me.m03.d31:meVE.Stichera03.melody	@ltx/en_us_dedes/he.a.m8:heAU.OTouParadoxou.name
ltx/en_us_dedes/me.m03.d31:meVE.Stichera03.mode	@ltx/en_us_dedes/miscellanea:misc.Mode8
ltx/en_us_dedes/me.m03.d31:meVE.Stichera03.text	You, O sacred Father Hypatios, had Christ the King in your heart, and you openly taught and said that He is the Son of God, of one essence with God the Father. Therefore you shone with the rays of miracles, and thus you guided the world to the light. You killed a fearsome beast, by your holy prayers, and you made hot springs flow with therapeutic waters, healing ailments all.
