ltx/en_us_dedes/eo.e04:eo.Doxasticon.incipit	It was early dawn…
ltx/en_us_dedes/eo.e04:eo.Doxasticon.mode	@ltx/en_us_dedes/miscellanea:misc.Mode4
ltx/en_us_dedes/eo.e04:eo.Doxasticon.text	It was early dawn, and the women came to Your tomb, O Christ. But Your body, which they longed for, was nowhere to be found. While they were perplexed about this, the men in dazzling apparel stood by and said to them, “Why do you look among the dead for the One who is alive? He has risen, as He told you. Why do you not remember His words?” And they believed them, and proclaimed what they had seen. But the good news seemed to the Disciples an idle tale; this is how slow they still were to understand. But Peter ran and saw, and going home he glorified Your wonders.
ltx/en_us_dedes/eo.e04:eo.Exaposteilarion.greekmelody	@ltx/en_us_dedes/he.a.m2:heAU.ToisMathitaisSynelthomen.greekname
ltx/en_us_dedes/eo.e04:eo.Exaposteilarion.incipit	Let us with virtues dazzling bright…
ltx/en_us_dedes/eo.e04:eo.Exaposteilarion.melody	@ltx/en_us_dedes/he.a.m2:heAU.ToisMathitaisSynelthomen.name
ltx/en_us_dedes/eo.e04:eo.Exaposteilarion.mode	@ltx/en_us_dedes/miscellanea:misc.Mode2
ltx/en_us_dedes/eo.e04:eo.Exaposteilarion.text	Let us with virtues dazzling bright * envision two men standing * in the life-bearing sepulcher * wearing dazzling apparel * beside the myrrh-bearing women * who bow their faces to the earth. * Let us be taught the rising of * Him who rules over heaven. And let us run * unto life within the tomb, joining Peter. * Marveling at what has occurred, * let us abide to see Christ.
ltx/en_us_dedes/eo.e04:eo.Theotokion.incipit	Lord, when You said the word…
ltx/en_us_dedes/eo.e04:eo.Theotokion.melody	@ltx/en_us_dedes/he.a.m2:heAU.ToisMathitaisSynelthomen.name
ltx/en_us_dedes/eo.e04:eo.Theotokion.mode	@ltx/en_us_dedes/miscellanea:misc.Mode2
ltx/en_us_dedes/eo.e04:eo.Theotokion.text	Lord, when You said the word “Rejoice,” * You reversed the ancestral * sorrow and introduced instead * in the world the ineffable joy of Your resurrection. * Hence, O Life-giver, send out * its light illumining the hearts, * the light of Your compassion, by means of her * who gave birth to You, so that we might cry out: * O God-man and Lover of mankind, * glory be to Your rising.
ltx/en_us_dedes/eo.e04:eo.title	Eothinon 4.
