ltx/en_us_dedes/me.m05.d19:meDA.commemoration.first	Memory of the Holy Hieromartyr Patrick, Bishop of Prusa, and those with him
ltx/en_us_dedes/me.m05.d19:meDA.commemoration.first_name	
ltx/en_us_dedes/me.m05.d19:meDA.commemoration.first_short	Memory of the Holy Hieromartyr Patrick, Bishop of Prusa, and those with him
ltx/en_us_dedes/me.m05.d19:meDA.commemoration.first_title	@ltx/en_us_dedes/titles:ti.Saints
ltx/en_us_dedes/me.m05.d19:meDA.commemoration.full	Memory of the Holy Hieromartyr Patrick, Bishop of Prusa, and those with him: Akakios, Menander, and Polyaenus
ltx/en_us_dedes/me.m05.d19:meDA.commemoration.second_name	
ltx/en_us_dedes/me.m05.d19:meDA.commemoration.second_title	
ltx/en_us_dedes/me.m05.d19:meDA.date	May 19
ltx/en_us_dedes/me.m05.d19:meDA.fordate	for May 19
ltx/en_us_dedes/me.m05.d19:meDA.insert1	
ltx/en_us_dedes/me.m05.d19:meDA.insert2	
ltx/en_us_dedes/me.m05.d19:meDA.note	
ltx/en_us_dedes/me.m05.d19:meDA.pdfcoverdate	May 19,
ltx/en_us_dedes/me.m05.d19:meDA.pdfheaderdate	May 19
ltx/en_us_dedes/me.m05.d19:meHO.commemorations	
ltx/en_us_dedes/me.m05.d19:meHO.note1	
ltx/en_us_dedes/me.m05.d19:meHO.note2	
ltx/en_us_dedes/me.m05.d19:meHO.number	
ltx/en_us_dedes/me.m05.d19:meHO.rank	
ltx/en_us_dedes/me.m05.d19:meLE.commemoration1	
ltx/en_us_dedes/me.m05.d19:meLE.commemoration2	
ltx/en_us_dedes/me.m05.d19:meLI.Kontakion1.greekmelody	@ltx/en_us_dedes/me.m05.d19:meMA.Kontakion1.greekmelody
ltx/en_us_dedes/me.m05.d19:meLI.Kontakion1.incipit	@ltx/en_us_dedes/me.m05.d19:meMA.Kontakion1.incipit
ltx/en_us_dedes/me.m05.d19:meLI.Kontakion1.melody	@ltx/en_us_dedes/me.m05.d19:meMA.Kontakion1.melody
ltx/en_us_dedes/me.m05.d19:meLI.Kontakion1.mode	@ltx/en_us_dedes/me.m05.d19:meMA.Kontakion1.mode
ltx/en_us_dedes/me.m05.d19:meLI.Kontakion1.text	@ltx/en_us_dedes/me.m05.d19:meMA.Kontakion1.text
ltx/en_us_dedes/me.m05.d19:meLI.MM.CommunionHymn.text	@ltx/en_us_dedes/properties:media.key
ltx/en_us_dedes/me.m05.d19:meLI.Megalynarion.text	
ltx/en_us_dedes/me.m05.d19:meMA.C1.acrostic.notice1	
ltx/en_us_dedes/me.m05.d19:meMA.C1.acrostic.text	
ltx/en_us_dedes/me.m05.d19:meMA.C1.acrostic.title	
ltx/en_us_dedes/me.m05.d19:meMA.C1.poet	@ltx/en_us_dedes/poets:po.Theofanous
ltx/en_us_dedes/me.m05.d19:meMA.C1.title	@ltx/en_us_dedes/titles:ti.CanonSaints
ltx/en_us_dedes/me.m05.d19:meMA.C1.verse	@ltx/en_us_dedes/prayers:pr.verse_SaintsM.text
ltx/en_us_dedes/me.m05.d19:meMA.Kontakion1.greekmelody	@ltx/en_us_dedes/he.a.m8:heAU.OsAparchas.greekname
ltx/en_us_dedes/me.m05.d19:meMA.Kontakion1.incipit	O Patrick, the Church has…
ltx/en_us_dedes/me.m05.d19:meMA.Kontakion1.melody	@ltx/en_us_dedes/he.a.m8:heAU.OsAparchas.notmetered
ltx/en_us_dedes/me.m05.d19:meMA.Kontakion1.mode	@ltx/en_us_dedes/miscellanea:misc.Mode8
ltx/en_us_dedes/me.m05.d19:meMA.Kontakion1.text	O Patrick, the Church has received your body as a sacred treasure of Jesus. Now rejoicing, she cries out, “Through you the entire world is preserved in profound peace, unharmed by any heresy, and invincible.”
ltx/en_us_dedes/me.m05.d19:meMA.Ode1C11.greekmelody	@ltx/en_us_dedes/he.h.m8:heHE.ArmatilatinFarao.greekname
ltx/en_us_dedes/me.m05.d19:meMA.Ode1C11.incipit	…
ltx/en_us_dedes/me.m05.d19:meMA.Ode1C11.melody	@ltx/en_us_dedes/he.h.m8:heHE.ArmatilatinFarao.name
ltx/en_us_dedes/me.m05.d19:meMA.Ode1C11.mode	@ltx/en_us_dedes/miscellanea:misc.Mode8
ltx/en_us_dedes/me.m05.d19:meMA.Ode1C11.ode	@ltx/en_us_dedes/miscellanea:misc.Ode1
ltx/en_us_dedes/me.m05.d19:meMA.Ode1C11.text	
ltx/en_us_dedes/me.m05.d19:meMA.Ode1C12.incipit	…
ltx/en_us_dedes/me.m05.d19:meMA.Ode1C12.melody	@ltx/en_us_dedes/he.h.m8:heHE.ArmatilatinFarao.name
ltx/en_us_dedes/me.m05.d19:meMA.Ode1C12.mode	@ltx/en_us_dedes/miscellanea:misc.Mode8
ltx/en_us_dedes/me.m05.d19:meMA.Ode1C12.ode	@ltx/en_us_dedes/miscellanea:misc.Ode1
ltx/en_us_dedes/me.m05.d19:meMA.Ode1C12.text	
ltx/en_us_dedes/me.m05.d19:meMA.Ode1C13.incipit	…
ltx/en_us_dedes/me.m05.d19:meMA.Ode1C13.melody	@ltx/en_us_dedes/he.h.m8:heHE.ArmatilatinFarao.name
ltx/en_us_dedes/me.m05.d19:meMA.Ode1C13.mode	@ltx/en_us_dedes/miscellanea:misc.Mode8
ltx/en_us_dedes/me.m05.d19:meMA.Ode1C13.ode	@ltx/en_us_dedes/miscellanea:misc.Ode1
ltx/en_us_dedes/me.m05.d19:meMA.Ode1C13.text	
ltx/en_us_dedes/me.m05.d19:meMA.Ode1C1T.incipit	…
ltx/en_us_dedes/me.m05.d19:meMA.Ode1C1T.melody	@ltx/en_us_dedes/he.h.m8:heHE.ArmatilatinFarao.name
ltx/en_us_dedes/me.m05.d19:meMA.Ode1C1T.mode	@ltx/en_us_dedes/miscellanea:misc.Mode8
ltx/en_us_dedes/me.m05.d19:meMA.Ode1C1T.ode	@ltx/en_us_dedes/miscellanea:misc.Ode1
ltx/en_us_dedes/me.m05.d19:meMA.Ode1C1T.text	
ltx/en_us_dedes/me.m05.d19:meMA.Ode3C11.greekmelody	@ltx/en_us_dedes/he.h.m8:heHE.OStereosasKatArchas.greekname
ltx/en_us_dedes/me.m05.d19:meMA.Ode3C11.incipit	…
ltx/en_us_dedes/me.m05.d19:meMA.Ode3C11.melody	@ltx/en_us_dedes/he.h.m8:heHE.OStereosasKatArchas.name
ltx/en_us_dedes/me.m05.d19:meMA.Ode3C11.mode	@ltx/en_us_dedes/miscellanea:misc.Mode8
ltx/en_us_dedes/me.m05.d19:meMA.Ode3C11.ode	@ltx/en_us_dedes/miscellanea:misc.Ode3
ltx/en_us_dedes/me.m05.d19:meMA.Ode3C11.text	
ltx/en_us_dedes/me.m05.d19:meMA.Ode3C12.incipit	…
ltx/en_us_dedes/me.m05.d19:meMA.Ode3C12.melody	@ltx/en_us_dedes/he.h.m8:heHE.OStereosasKatArchas.name
ltx/en_us_dedes/me.m05.d19:meMA.Ode3C12.mode	@ltx/en_us_dedes/miscellanea:misc.Mode8
ltx/en_us_dedes/me.m05.d19:meMA.Ode3C12.ode	@ltx/en_us_dedes/miscellanea:misc.Ode3
ltx/en_us_dedes/me.m05.d19:meMA.Ode3C12.text	
ltx/en_us_dedes/me.m05.d19:meMA.Ode3C13.incipit	…
ltx/en_us_dedes/me.m05.d19:meMA.Ode3C13.melody	@ltx/en_us_dedes/he.h.m8:heHE.OStereosasKatArchas.name
ltx/en_us_dedes/me.m05.d19:meMA.Ode3C13.mode	@ltx/en_us_dedes/miscellanea:misc.Mode8
ltx/en_us_dedes/me.m05.d19:meMA.Ode3C13.ode	@ltx/en_us_dedes/miscellanea:misc.Ode3
ltx/en_us_dedes/me.m05.d19:meMA.Ode3C13.text	
ltx/en_us_dedes/me.m05.d19:meMA.Ode3C1T.incipit	…
ltx/en_us_dedes/me.m05.d19:meMA.Ode3C1T.melody	@ltx/en_us_dedes/he.h.m8:heHE.OStereosasKatArchas.name
ltx/en_us_dedes/me.m05.d19:meMA.Ode3C1T.mode	@ltx/en_us_dedes/miscellanea:misc.Mode8
ltx/en_us_dedes/me.m05.d19:meMA.Ode3C1T.ode	@ltx/en_us_dedes/miscellanea:misc.Ode3
ltx/en_us_dedes/me.m05.d19:meMA.Ode3C1T.text	
ltx/en_us_dedes/me.m05.d19:meMA.Ode3H.greekmelody	@ltx/en_us_dedes/he.h.m8:heHE.OStereosasKatArchas.greekname
ltx/en_us_dedes/me.m05.d19:meMA.Ode3H.incipit	@ltx/en_us_dedes/he.h.m8:heHE.OStereosasKatArchas.incipit
ltx/en_us_dedes/me.m05.d19:meMA.Ode3H.melody	@ltx/en_us_dedes/he.h.m8:heHE.OStereosasKatArchas.melody
ltx/en_us_dedes/me.m05.d19:meMA.Ode3H.mode	@ltx/en_us_dedes/miscellanea:misc.Mode8
ltx/en_us_dedes/me.m05.d19:meMA.Ode3H.ode	@ltx/en_us_dedes/miscellanea:misc.Ode3
ltx/en_us_dedes/me.m05.d19:meMA.Ode3H.text	@ltx/en_us_dedes/he.h.m8:heHE.OStereosasKatArchas.text
ltx/en_us_dedes/me.m05.d19:meMA.Ode3Kathisma1.greekmelody	@ltx/en_us_dedes/he.a.m8:heAU.TinSofianKaiLogon.greekname
ltx/en_us_dedes/me.m05.d19:meMA.Ode3Kathisma1.incipit	…
ltx/en_us_dedes/me.m05.d19:meMA.Ode3Kathisma1.melody	@ltx/en_us_dedes/he.a.m8:heAU.TinSofianKaiLogon.name
ltx/en_us_dedes/me.m05.d19:meMA.Ode3Kathisma1.mode	@ltx/en_us_dedes/miscellanea:misc.Mode8
ltx/en_us_dedes/me.m05.d19:meMA.Ode3Kathisma1.text	
ltx/en_us_dedes/me.m05.d19:meMA.Ode3KathismaSt.incipit	@ltx/en_us_dedes/oc.m8.d4:ocMA.Kathisma13.incipit
ltx/en_us_dedes/me.m05.d19:meMA.Ode3KathismaSt.melody	@ltx/en_us_dedes/he.a.m8:heAU.TinSofianKaiLogon.name
ltx/en_us_dedes/me.m05.d19:meMA.Ode3KathismaSt.mode	@ltx/en_us_dedes/miscellanea:misc.Mode8
ltx/en_us_dedes/me.m05.d19:meMA.Ode3KathismaSt.text	@ltx/en_us_dedes/oc.m8.d4:ocMA.Kathisma13.text
ltx/en_us_dedes/me.m05.d19:meMA.Ode3KathismaT.incipit	@ltx/en_us_dedes/me.m06.d29:meMA.Kathisma2T.incipit
ltx/en_us_dedes/me.m05.d19:meMA.Ode3KathismaT.melody	@ltx/en_us_dedes/he.a.m8:heAU.TinSofianKaiLogon.name
ltx/en_us_dedes/me.m05.d19:meMA.Ode3KathismaT.mode	@ltx/en_us_dedes/miscellanea:misc.Mode8
ltx/en_us_dedes/me.m05.d19:meMA.Ode3KathismaT.text	@ltx/en_us_dedes/me.m06.d29:meMA.Kathisma2T.text
ltx/en_us_dedes/me.m05.d19:meMA.Ode4C11.greekmelody	@ltx/en_us_dedes/he.h.m8:heHE.SyMouIschys.greekname
ltx/en_us_dedes/me.m05.d19:meMA.Ode4C11.incipit	…
ltx/en_us_dedes/me.m05.d19:meMA.Ode4C11.melody	@ltx/en_us_dedes/he.h.m8:heHE.SyMouIschys.name
ltx/en_us_dedes/me.m05.d19:meMA.Ode4C11.mode	@ltx/en_us_dedes/miscellanea:misc.Mode8
ltx/en_us_dedes/me.m05.d19:meMA.Ode4C11.ode	@ltx/en_us_dedes/miscellanea:misc.Ode4
ltx/en_us_dedes/me.m05.d19:meMA.Ode4C11.text	
ltx/en_us_dedes/me.m05.d19:meMA.Ode4C12.incipit	…
ltx/en_us_dedes/me.m05.d19:meMA.Ode4C12.melody	@ltx/en_us_dedes/he.h.m8:heHE.SyMouIschys.name
ltx/en_us_dedes/me.m05.d19:meMA.Ode4C12.mode	@ltx/en_us_dedes/miscellanea:misc.Mode8
ltx/en_us_dedes/me.m05.d19:meMA.Ode4C12.ode	@ltx/en_us_dedes/miscellanea:misc.Ode4
ltx/en_us_dedes/me.m05.d19:meMA.Ode4C12.text	
ltx/en_us_dedes/me.m05.d19:meMA.Ode4C13.incipit	…
ltx/en_us_dedes/me.m05.d19:meMA.Ode4C13.melody	@ltx/en_us_dedes/he.h.m8:heHE.SyMouIschys.name
ltx/en_us_dedes/me.m05.d19:meMA.Ode4C13.mode	@ltx/en_us_dedes/miscellanea:misc.Mode8
ltx/en_us_dedes/me.m05.d19:meMA.Ode4C13.ode	@ltx/en_us_dedes/miscellanea:misc.Ode4
ltx/en_us_dedes/me.m05.d19:meMA.Ode4C13.text	
ltx/en_us_dedes/me.m05.d19:meMA.Ode4C14.incipit	…
ltx/en_us_dedes/me.m05.d19:meMA.Ode4C14.melody	@ltx/en_us_dedes/he.h.m8:heHE.SyMouIschys.name
ltx/en_us_dedes/me.m05.d19:meMA.Ode4C14.mode	@ltx/en_us_dedes/miscellanea:misc.Mode8
ltx/en_us_dedes/me.m05.d19:meMA.Ode4C14.ode	@ltx/en_us_dedes/miscellanea:misc.Ode4
ltx/en_us_dedes/me.m05.d19:meMA.Ode4C14.text	
ltx/en_us_dedes/me.m05.d19:meMA.Ode4C1T.incipit	…
ltx/en_us_dedes/me.m05.d19:meMA.Ode4C1T.melody	@ltx/en_us_dedes/he.h.m8:heHE.SyMouIschys.name
ltx/en_us_dedes/me.m05.d19:meMA.Ode4C1T.mode	@ltx/en_us_dedes/miscellanea:misc.Mode8
ltx/en_us_dedes/me.m05.d19:meMA.Ode4C1T.ode	@ltx/en_us_dedes/miscellanea:misc.Ode4
ltx/en_us_dedes/me.m05.d19:meMA.Ode4C1T.text	
ltx/en_us_dedes/me.m05.d19:meMA.Ode5C11.greekmelody	@ltx/en_us_dedes/he.h.m8:heHE.InaTiMeAposo.greekname
ltx/en_us_dedes/me.m05.d19:meMA.Ode5C11.incipit	…
ltx/en_us_dedes/me.m05.d19:meMA.Ode5C11.melody	@ltx/en_us_dedes/he.h.m8:heHE.InaTiMeAposo.name
ltx/en_us_dedes/me.m05.d19:meMA.Ode5C11.mode	@ltx/en_us_dedes/miscellanea:misc.Mode8
ltx/en_us_dedes/me.m05.d19:meMA.Ode5C11.ode	@ltx/en_us_dedes/miscellanea:misc.Ode5
ltx/en_us_dedes/me.m05.d19:meMA.Ode5C11.text	
ltx/en_us_dedes/me.m05.d19:meMA.Ode5C12.incipit	…
ltx/en_us_dedes/me.m05.d19:meMA.Ode5C12.melody	@ltx/en_us_dedes/he.h.m8:heHE.InaTiMeAposo.name
ltx/en_us_dedes/me.m05.d19:meMA.Ode5C12.mode	@ltx/en_us_dedes/miscellanea:misc.Mode8
ltx/en_us_dedes/me.m05.d19:meMA.Ode5C12.ode	@ltx/en_us_dedes/miscellanea:misc.Ode5
ltx/en_us_dedes/me.m05.d19:meMA.Ode5C12.text	
ltx/en_us_dedes/me.m05.d19:meMA.Ode5C13.incipit	…
ltx/en_us_dedes/me.m05.d19:meMA.Ode5C13.melody	@ltx/en_us_dedes/he.h.m8:heHE.InaTiMeAposo.name
ltx/en_us_dedes/me.m05.d19:meMA.Ode5C13.mode	@ltx/en_us_dedes/miscellanea:misc.Mode8
ltx/en_us_dedes/me.m05.d19:meMA.Ode5C13.ode	@ltx/en_us_dedes/miscellanea:misc.Ode5
ltx/en_us_dedes/me.m05.d19:meMA.Ode5C13.text	
ltx/en_us_dedes/me.m05.d19:meMA.Ode5C1T.incipit	…
ltx/en_us_dedes/me.m05.d19:meMA.Ode5C1T.melody	@ltx/en_us_dedes/he.h.m8:heHE.InaTiMeAposo.name
ltx/en_us_dedes/me.m05.d19:meMA.Ode5C1T.mode	@ltx/en_us_dedes/miscellanea:misc.Mode8
ltx/en_us_dedes/me.m05.d19:meMA.Ode5C1T.ode	@ltx/en_us_dedes/miscellanea:misc.Ode5
ltx/en_us_dedes/me.m05.d19:meMA.Ode5C1T.text	
ltx/en_us_dedes/me.m05.d19:meMA.Ode6C11.greekmelody	@ltx/en_us_dedes/he.h.m8:heHE.AvyssosAmartion.greekname
ltx/en_us_dedes/me.m05.d19:meMA.Ode6C11.incipit	…
ltx/en_us_dedes/me.m05.d19:meMA.Ode6C11.melody	@ltx/en_us_dedes/he.h.m8:heHE.AvyssosAmartion.name
ltx/en_us_dedes/me.m05.d19:meMA.Ode6C11.mode	@ltx/en_us_dedes/miscellanea:misc.Mode8
ltx/en_us_dedes/me.m05.d19:meMA.Ode6C11.ode	@ltx/en_us_dedes/miscellanea:misc.Ode6
ltx/en_us_dedes/me.m05.d19:meMA.Ode6C11.text	
ltx/en_us_dedes/me.m05.d19:meMA.Ode6C12.incipit	…
ltx/en_us_dedes/me.m05.d19:meMA.Ode6C12.melody	@ltx/en_us_dedes/he.h.m8:heHE.AvyssosAmartion.name
ltx/en_us_dedes/me.m05.d19:meMA.Ode6C12.mode	@ltx/en_us_dedes/miscellanea:misc.Mode8
ltx/en_us_dedes/me.m05.d19:meMA.Ode6C12.ode	@ltx/en_us_dedes/miscellanea:misc.Ode6
ltx/en_us_dedes/me.m05.d19:meMA.Ode6C12.text	
ltx/en_us_dedes/me.m05.d19:meMA.Ode6C13.incipit	…
ltx/en_us_dedes/me.m05.d19:meMA.Ode6C13.melody	@ltx/en_us_dedes/he.h.m8:heHE.AvyssosAmartion.name
ltx/en_us_dedes/me.m05.d19:meMA.Ode6C13.mode	@ltx/en_us_dedes/miscellanea:misc.Mode8
ltx/en_us_dedes/me.m05.d19:meMA.Ode6C13.ode	@ltx/en_us_dedes/miscellanea:misc.Ode6
ltx/en_us_dedes/me.m05.d19:meMA.Ode6C13.text	
ltx/en_us_dedes/me.m05.d19:meMA.Ode6C1T.incipit	…
ltx/en_us_dedes/me.m05.d19:meMA.Ode6C1T.melody	@ltx/en_us_dedes/he.h.m8:heHE.AvyssosAmartion.name
ltx/en_us_dedes/me.m05.d19:meMA.Ode6C1T.mode	@ltx/en_us_dedes/miscellanea:misc.Mode8
ltx/en_us_dedes/me.m05.d19:meMA.Ode6C1T.ode	@ltx/en_us_dedes/miscellanea:misc.Ode6
ltx/en_us_dedes/me.m05.d19:meMA.Ode6C1T.text	
ltx/en_us_dedes/me.m05.d19:meMA.Ode6H.greekmelody	@ltx/en_us_dedes/he.h.m8:heHE.AvyssosAmartion.greekname
ltx/en_us_dedes/me.m05.d19:meMA.Ode6H.incipit	@ltx/en_us_dedes/he.h.m8:heHE.AvyssosAmartion.incipit
ltx/en_us_dedes/me.m05.d19:meMA.Ode6H.melody	@ltx/en_us_dedes/he.h.m8:heHE.AvyssosAmartion.melody
ltx/en_us_dedes/me.m05.d19:meMA.Ode6H.mode	@ltx/en_us_dedes/miscellanea:misc.Mode8
ltx/en_us_dedes/me.m05.d19:meMA.Ode6H.ode	@ltx/en_us_dedes/miscellanea:misc.Ode6
ltx/en_us_dedes/me.m05.d19:meMA.Ode6H.text	@ltx/en_us_dedes/he.h.m8:heHE.AvyssosAmartion.text
ltx/en_us_dedes/me.m05.d19:meMA.Ode7C11.greekmelody	@ltx/en_us_dedes/he.h.m8:heHE.TheouSynkatavasin.greekname
ltx/en_us_dedes/me.m05.d19:meMA.Ode7C11.incipit	…
ltx/en_us_dedes/me.m05.d19:meMA.Ode7C11.melody	@ltx/en_us_dedes/he.h.m8:heHE.TheouSynkatavasin.name
ltx/en_us_dedes/me.m05.d19:meMA.Ode7C11.mode	@ltx/en_us_dedes/miscellanea:misc.Mode8
ltx/en_us_dedes/me.m05.d19:meMA.Ode7C11.ode	@ltx/en_us_dedes/miscellanea:misc.Ode7
ltx/en_us_dedes/me.m05.d19:meMA.Ode7C11.text	
ltx/en_us_dedes/me.m05.d19:meMA.Ode7C12.incipit	…
ltx/en_us_dedes/me.m05.d19:meMA.Ode7C12.melody	@ltx/en_us_dedes/he.h.m8:heHE.TheouSynkatavasin.name
ltx/en_us_dedes/me.m05.d19:meMA.Ode7C12.mode	@ltx/en_us_dedes/miscellanea:misc.Mode8
ltx/en_us_dedes/me.m05.d19:meMA.Ode7C12.ode	@ltx/en_us_dedes/miscellanea:misc.Ode7
ltx/en_us_dedes/me.m05.d19:meMA.Ode7C12.text	
ltx/en_us_dedes/me.m05.d19:meMA.Ode7C13.incipit	…
ltx/en_us_dedes/me.m05.d19:meMA.Ode7C13.melody	@ltx/en_us_dedes/he.h.m8:heHE.TheouSynkatavasin.name
ltx/en_us_dedes/me.m05.d19:meMA.Ode7C13.mode	@ltx/en_us_dedes/miscellanea:misc.Mode8
ltx/en_us_dedes/me.m05.d19:meMA.Ode7C13.ode	@ltx/en_us_dedes/miscellanea:misc.Ode7
ltx/en_us_dedes/me.m05.d19:meMA.Ode7C13.text	
ltx/en_us_dedes/me.m05.d19:meMA.Ode7C1T.incipit	…
ltx/en_us_dedes/me.m05.d19:meMA.Ode7C1T.melody	@ltx/en_us_dedes/he.h.m8:heHE.TheouSynkatavasin.name
ltx/en_us_dedes/me.m05.d19:meMA.Ode7C1T.mode	@ltx/en_us_dedes/miscellanea:misc.Mode8
ltx/en_us_dedes/me.m05.d19:meMA.Ode7C1T.ode	@ltx/en_us_dedes/miscellanea:misc.Ode7
ltx/en_us_dedes/me.m05.d19:meMA.Ode7C1T.text	
ltx/en_us_dedes/me.m05.d19:meMA.Ode8C11.greekmelody	@ltx/en_us_dedes/he.h.m8:heHE.EptaplasiosKaminon.greekname
ltx/en_us_dedes/me.m05.d19:meMA.Ode8C11.incipit	…
ltx/en_us_dedes/me.m05.d19:meMA.Ode8C11.melody	@ltx/en_us_dedes/he.h.m8:heHE.EptaplasiosKaminon.name
ltx/en_us_dedes/me.m05.d19:meMA.Ode8C11.mode	@ltx/en_us_dedes/miscellanea:misc.Mode8
ltx/en_us_dedes/me.m05.d19:meMA.Ode8C11.ode	@ltx/en_us_dedes/miscellanea:misc.Ode8
ltx/en_us_dedes/me.m05.d19:meMA.Ode8C11.text	
ltx/en_us_dedes/me.m05.d19:meMA.Ode8C12.incipit	…
ltx/en_us_dedes/me.m05.d19:meMA.Ode8C12.melody	@ltx/en_us_dedes/he.h.m8:heHE.EptaplasiosKaminon.name
ltx/en_us_dedes/me.m05.d19:meMA.Ode8C12.mode	@ltx/en_us_dedes/miscellanea:misc.Mode8
ltx/en_us_dedes/me.m05.d19:meMA.Ode8C12.ode	@ltx/en_us_dedes/miscellanea:misc.Ode8
ltx/en_us_dedes/me.m05.d19:meMA.Ode8C12.text	
ltx/en_us_dedes/me.m05.d19:meMA.Ode8C13.incipit	…
ltx/en_us_dedes/me.m05.d19:meMA.Ode8C13.melody	@ltx/en_us_dedes/he.h.m8:heHE.EptaplasiosKaminon.name
ltx/en_us_dedes/me.m05.d19:meMA.Ode8C13.mode	@ltx/en_us_dedes/miscellanea:misc.Mode8
ltx/en_us_dedes/me.m05.d19:meMA.Ode8C13.ode	@ltx/en_us_dedes/miscellanea:misc.Ode8
ltx/en_us_dedes/me.m05.d19:meMA.Ode8C13.text	
ltx/en_us_dedes/me.m05.d19:meMA.Ode8C1T.incipit	…
ltx/en_us_dedes/me.m05.d19:meMA.Ode8C1T.melody	@ltx/en_us_dedes/he.h.m8:heHE.EptaplasiosKaminon.name
ltx/en_us_dedes/me.m05.d19:meMA.Ode8C1T.mode	@ltx/en_us_dedes/miscellanea:misc.Mode8
ltx/en_us_dedes/me.m05.d19:meMA.Ode8C1T.ode	@ltx/en_us_dedes/miscellanea:misc.Ode8
ltx/en_us_dedes/me.m05.d19:meMA.Ode8C1T.text	
ltx/en_us_dedes/me.m05.d19:meMA.Ode8H.greekmelody	@ltx/en_us_dedes/he.h.m8:heHE.EptaplasiosKaminon.greekname
ltx/en_us_dedes/me.m05.d19:meMA.Ode8H.incipit	@ltx/en_us_dedes/he.h.m8:heHE.EptaplasiosKaminon.incipit
ltx/en_us_dedes/me.m05.d19:meMA.Ode8H.melody	@ltx/en_us_dedes/he.h.m8:heHE.EptaplasiosKaminon.melody
ltx/en_us_dedes/me.m05.d19:meMA.Ode8H.mode	@ltx/en_us_dedes/miscellanea:misc.Mode8
ltx/en_us_dedes/me.m05.d19:meMA.Ode8H.ode	@ltx/en_us_dedes/miscellanea:misc.Ode8
ltx/en_us_dedes/me.m05.d19:meMA.Ode8H.text	@ltx/en_us_dedes/he.h.m8:heHE.EptaplasiosKaminon.text
ltx/en_us_dedes/me.m05.d19:meMA.Ode9C11.greekmelody	@ltx/en_us_dedes/he.h.m8:heHE.ExestiEpiTouto.greekname
ltx/en_us_dedes/me.m05.d19:meMA.Ode9C11.incipit	…
ltx/en_us_dedes/me.m05.d19:meMA.Ode9C11.melody	@ltx/en_us_dedes/he.h.m8:heHE.ExestiEpiTouto.name
ltx/en_us_dedes/me.m05.d19:meMA.Ode9C11.mode	@ltx/en_us_dedes/miscellanea:misc.Mode8
ltx/en_us_dedes/me.m05.d19:meMA.Ode9C11.ode	@ltx/en_us_dedes/miscellanea:misc.Ode9
ltx/en_us_dedes/me.m05.d19:meMA.Ode9C11.text	
ltx/en_us_dedes/me.m05.d19:meMA.Ode9C12.incipit	…
ltx/en_us_dedes/me.m05.d19:meMA.Ode9C12.melody	@ltx/en_us_dedes/he.h.m8:heHE.ExestiEpiTouto.name
ltx/en_us_dedes/me.m05.d19:meMA.Ode9C12.mode	@ltx/en_us_dedes/miscellanea:misc.Mode8
ltx/en_us_dedes/me.m05.d19:meMA.Ode9C12.ode	@ltx/en_us_dedes/miscellanea:misc.Ode9
ltx/en_us_dedes/me.m05.d19:meMA.Ode9C12.text	
ltx/en_us_dedes/me.m05.d19:meMA.Ode9C13.incipit	…
ltx/en_us_dedes/me.m05.d19:meMA.Ode9C13.melody	@ltx/en_us_dedes/he.h.m8:heHE.ExestiEpiTouto.name
ltx/en_us_dedes/me.m05.d19:meMA.Ode9C13.mode	@ltx/en_us_dedes/miscellanea:misc.Mode8
ltx/en_us_dedes/me.m05.d19:meMA.Ode9C13.ode	@ltx/en_us_dedes/miscellanea:misc.Ode9
ltx/en_us_dedes/me.m05.d19:meMA.Ode9C13.text	
ltx/en_us_dedes/me.m05.d19:meMA.Ode9C1T.incipit	…
ltx/en_us_dedes/me.m05.d19:meMA.Ode9C1T.melody	@ltx/en_us_dedes/he.h.m8:heHE.ExestiEpiTouto.name
ltx/en_us_dedes/me.m05.d19:meMA.Ode9C1T.mode	@ltx/en_us_dedes/miscellanea:misc.Mode8
ltx/en_us_dedes/me.m05.d19:meMA.Ode9C1T.ode	@ltx/en_us_dedes/miscellanea:misc.Ode9
ltx/en_us_dedes/me.m05.d19:meMA.Ode9C1T.text	
ltx/en_us_dedes/me.m05.d19:meMA.Ode9H.greekmelody	@ltx/en_us_dedes/he.h.m8:heHE.ExestiEpiTouto.greekname
ltx/en_us_dedes/me.m05.d19:meMA.Ode9H.incipit	@ltx/en_us_dedes/he.h.m8:heHE.ExestiEpiTouto.incipit
ltx/en_us_dedes/me.m05.d19:meMA.Ode9H.melody	@ltx/en_us_dedes/he.h.m8:heHE.ExestiEpiTouto.melody
ltx/en_us_dedes/me.m05.d19:meMA.Ode9H.mode	@ltx/en_us_dedes/miscellanea:misc.Mode8
ltx/en_us_dedes/me.m05.d19:meMA.Ode9H.ode	@ltx/en_us_dedes/miscellanea:misc.Ode9
ltx/en_us_dedes/me.m05.d19:meMA.Ode9H.text	@ltx/en_us_dedes/he.h.m8:heHE.ExestiEpiTouto.text
ltx/en_us_dedes/me.m05.d19:meVE.Apolytikion1ger.greekmelody	@ltx/en_us_dedes/he.a.m4:heAU.TachyProkatalave.greekname
ltx/en_us_dedes/me.m05.d19:meVE.Apolytikion1ger.incipit	…
ltx/en_us_dedes/me.m05.d19:meVE.Apolytikion1ger.melody	@ltx/en_us_dedes/he.a.m4:heAU.TachyProkatalave.name
ltx/en_us_dedes/me.m05.d19:meVE.Apolytikion1ger.mode	@ltx/en_us_dedes/miscellanea:misc.Mode4
ltx/en_us_dedes/me.m05.d19:meVE.Apolytikion1ger.poet	@ltx/en_us_dedes/poets:po.Gerasimou
ltx/en_us_dedes/me.m05.d19:meVE.Apolytikion1ger.text	
ltx/en_us_dedes/me.m05.d19:meVE.SticStavrotheotokion.greekmelody	@ltx/en_us_dedes/he.a.m2:heAU.OteEkTouXylou.greekname
ltx/en_us_dedes/me.m05.d19:meVE.SticStavrotheotokion.incipit	@ltx/en_us_dedes/oc.m2.d4:ocVE.SticTheotokion.incipit
ltx/en_us_dedes/me.m05.d19:meVE.SticStavrotheotokion.melody	@ltx/en_us_dedes/he.a.m2:heAU.OteEkTouXylou.name
ltx/en_us_dedes/me.m05.d19:meVE.SticStavrotheotokion.mode	@ltx/en_us_dedes/miscellanea:misc.Mode2
ltx/en_us_dedes/me.m05.d19:meVE.SticStavrotheotokion.text	@ltx/en_us_dedes/oc.m2.d4:ocVE.SticTheotokion.text
ltx/en_us_dedes/me.m05.d19:meVE.SticTheotokion.greekmelody	@ltx/en_us_dedes/he.a.m2:heAU.OteEkTouXylou.greekname
ltx/en_us_dedes/me.m05.d19:meVE.SticTheotokion.incipit	@ltx/en_us_dedes/me.m01.d15:meVE.SticTheotokion.incipit
ltx/en_us_dedes/me.m05.d19:meVE.SticTheotokion.melody	@ltx/en_us_dedes/he.a.m2:heAU.OteEkTouXylou.name
ltx/en_us_dedes/me.m05.d19:meVE.SticTheotokion.mode	@ltx/en_us_dedes/miscellanea:misc.Mode2
ltx/en_us_dedes/me.m05.d19:meVE.SticTheotokion.text	@ltx/en_us_dedes/me.m01.d15:meVE.SticTheotokion.text
ltx/en_us_dedes/me.m05.d19:meVE.Stichera01.greekmelody	@ltx/en_us_dedes/he.a.m2:heAU.OteEkTouXylou.greekname
ltx/en_us_dedes/me.m05.d19:meVE.Stichera01.incipit	Those four holy Hierarchs of…
ltx/en_us_dedes/me.m05.d19:meVE.Stichera01.melody	@ltx/en_us_dedes/he.a.m2:heAU.OteEkTouXylou.name
ltx/en_us_dedes/me.m05.d19:meVE.Stichera01.mode	@ltx/en_us_dedes/miscellanea:misc.Mode2
ltx/en_us_dedes/me.m05.d19:meVE.Stichera01.text	Those four holy Hierarchs of Christ * proved to be immovable pillars, much like the ones with which * Wisdom supported the house she built. And now to all * she is offering dogmas in place of sacrifices; * she has mixed her wine of gladness in the sacred bowl; * grace in place of food she is giving * those who faithfully are observing * the memory of the Hieromartyrs of Christ.
ltx/en_us_dedes/me.m05.d19:meVE.Stichera02.incipit	Mystics and divine servants of…
ltx/en_us_dedes/me.m05.d19:meVE.Stichera02.melody	@ltx/en_us_dedes/he.a.m2:heAU.OteEkTouXylou.name
ltx/en_us_dedes/me.m05.d19:meVE.Stichera02.mode	@ltx/en_us_dedes/miscellanea:misc.Mode2
ltx/en_us_dedes/me.m05.d19:meVE.Stichera02.text	Mystics and divine servants of Christ, * holy Hieromartyrs, we pray you, protect world where we live, * great and holy bishop Patrick, and all-sacred priests, * Polyaenus, Akakios, and blessed Menander. * Foursome, equal to the cherubim with four faces each, * as you form most divine chorus * standing near the throne of Godhead, * you preserve those honoring you faithfully.
ltx/en_us_dedes/me.m05.d19:meVE.Stichera03.incipit	Patrick, you indeed longed for…
ltx/en_us_dedes/me.m05.d19:meVE.Stichera03.melody	@ltx/en_us_dedes/he.a.m2:heAU.OteEkTouXylou.name
ltx/en_us_dedes/me.m05.d19:meVE.Stichera03.mode	@ltx/en_us_dedes/miscellanea:misc.Mode2
ltx/en_us_dedes/me.m05.d19:meVE.Stichera03.text	Patrick, you indeed longed for and loved * Him who inexpressibly founded the earth upon the seas, * and in the beginning formed its rivers, namely God. * Through inspired words you taught about the extraordinary * mystery of faith in Christ when you were at the hot springs. * Now through your divine intercessions, * grant to us the waters of healing * flowing from on high, the springs of grace divine.
