ltx/en_us_dedes/sy.m07.d26:syMA.commemoration01.couplet1.title	@ltx/en_us_dedes/titles:ti.Verses
ltx/en_us_dedes/sy.m07.d26:syMA.commemoration01.couplet1.verse1	
ltx/en_us_dedes/sy.m07.d26:syMA.commemoration01.couplet1.verse2	
ltx/en_us_dedes/sy.m07.d26:syMA.commemoration01.narration.p01	
ltx/en_us_dedes/sy.m07.d26:syMA.commemoration01.single1	
ltx/en_us_dedes/sy.m07.d26:syMA.commemoration01.text	On July 26, we commemorate the holy Hieromartyrs Hermolaus, Hermippus, and Hermocrates.
ltx/en_us_dedes/sy.m07.d26:syMA.commemoration02.couplet1.title	@ltx/en_us_dedes/titles:ti.Verses
ltx/en_us_dedes/sy.m07.d26:syMA.commemoration02.couplet1.verse1	
ltx/en_us_dedes/sy.m07.d26:syMA.commemoration02.couplet1.verse2	
ltx/en_us_dedes/sy.m07.d26:syMA.commemoration02.narration.p01	
ltx/en_us_dedes/sy.m07.d26:syMA.commemoration02.narration.p02	
ltx/en_us_dedes/sy.m07.d26:syMA.commemoration02.narration.p03	
ltx/en_us_dedes/sy.m07.d26:syMA.commemoration02.narration.p04	
ltx/en_us_dedes/sy.m07.d26:syMA.commemoration02.narration.p05	
ltx/en_us_dedes/sy.m07.d26:syMA.commemoration02.narration.p06	
ltx/en_us_dedes/sy.m07.d26:syMA.commemoration02.single1	
ltx/en_us_dedes/sy.m07.d26:syMA.commemoration02.text	On this day we also commemorate Saint Paraskeve, the devout Martyr of Christ.
ltx/en_us_dedes/sy.m07.d26:syMA.commemoration03.couplet1.title	@ltx/en_us_dedes/titles:ti.Verses
ltx/en_us_dedes/sy.m07.d26:syMA.commemoration03.couplet1.verse1	
ltx/en_us_dedes/sy.m07.d26:syMA.commemoration03.couplet1.verse2	
ltx/en_us_dedes/sy.m07.d26:syMA.commemoration03.text	On this day we also commemorate the holy Martyr Oraiozela.
ltx/en_us_dedes/sy.m07.d26:syMA.commemoration04.couplet1.title	@ltx/en_us_dedes/titles:ti.Verses
ltx/en_us_dedes/sy.m07.d26:syMA.commemoration04.couplet1.verse1	
ltx/en_us_dedes/sy.m07.d26:syMA.commemoration04.couplet1.verse2	
ltx/en_us_dedes/sy.m07.d26:syMA.commemoration04.couplet2.verse1	
ltx/en_us_dedes/sy.m07.d26:syMA.commemoration04.couplet2.verse2	
ltx/en_us_dedes/sy.m07.d26:syMA.commemoration04.couplet3.verse1	
ltx/en_us_dedes/sy.m07.d26:syMA.commemoration04.couplet3.verse2	
ltx/en_us_dedes/sy.m07.d26:syMA.commemoration04.text	On this day we also commemorate the devout Ignatius Steironites; and the consecration of the church Archangel Gabriel over in Chaldae; and Saints Appion and Jerusalem.
ltx/en_us_dedes/sy.m07.d26:syMA.lastline	By their holy intercessions, O God, have mercy on us. Amen.
