ltx/en_us_dedes/sy.m04.d07:cl.syMA.commemoration01.text	[saint/com 1]
ltx/en_us_dedes/sy.m04.d07:cl.syMA.commemoration02.text	[saint/com 2]
ltx/en_us_dedes/sy.m04.d07:cl.syMA.commemoration03.text	[saint/com 3]
ltx/en_us_dedes/sy.m04.d07:cl.syMA.commemoration04.text	[saint/com 4]
ltx/en_us_dedes/sy.m04.d07:cl.syMA.commemoration05.text	[saint/com 5]
ltx/en_us_dedes/sy.m04.d07:cl.syMA.commemoration06.text	[saint/com list]
ltx/en_us_dedes/sy.m04.d07:syMA.commemoration01.couplet1.title	@ltx/en_us_dedes/titles:ti.Verses
ltx/en_us_dedes/sy.m04.d07:syMA.commemoration01.couplet1.verse1	
ltx/en_us_dedes/sy.m04.d07:syMA.commemoration01.couplet1.verse2	
ltx/en_us_dedes/sy.m04.d07:syMA.commemoration01.narration.p01	
ltx/en_us_dedes/sy.m04.d07:syMA.commemoration01.narration.p02	
ltx/en_us_dedes/sy.m04.d07:syMA.commemoration01.single1	
ltx/en_us_dedes/sy.m04.d07:syMA.commemoration01.text	On April 7 we commemorate the holy martyr Kalliopios.
ltx/en_us_dedes/sy.m04.d07:syMA.commemoration02.couplet1.title	@ltx/en_us_dedes/titles:ti.Verses
ltx/en_us_dedes/sy.m04.d07:syMA.commemoration02.couplet1.verse1	
ltx/en_us_dedes/sy.m04.d07:syMA.commemoration02.couplet1.verse2	
ltx/en_us_dedes/sy.m04.d07:syMA.commemoration02.narration.p01	
ltx/en_us_dedes/sy.m04.d07:syMA.commemoration02.single1	
ltx/en_us_dedes/sy.m04.d07:syMA.commemoration02.text	On this day we also commemorate our father among the saints George, Bishop of Mytilene, the worker of signs and wonders.
ltx/en_us_dedes/sy.m04.d07:syMA.commemoration03.couplet1.title	@ltx/en_us_dedes/titles:ti.Verses
ltx/en_us_dedes/sy.m04.d07:syMA.commemoration03.couplet1.verse1	
ltx/en_us_dedes/sy.m04.d07:syMA.commemoration03.couplet1.verse2	
ltx/en_us_dedes/sy.m04.d07:syMA.commemoration03.text	On this day we also commemorate the holy martyr Rufinus the deacon.
ltx/en_us_dedes/sy.m04.d07:syMA.commemoration04.couplet1.title	@ltx/en_us_dedes/titles:ti.Verses
ltx/en_us_dedes/sy.m04.d07:syMA.commemoration04.couplet1.verse1	
ltx/en_us_dedes/sy.m04.d07:syMA.commemoration04.couplet1.verse2	
ltx/en_us_dedes/sy.m04.d07:syMA.commemoration04.text	On this day the holy martyr Aquilina died after they tied her hands and burned her body.
ltx/en_us_dedes/sy.m04.d07:syMA.commemoration05.couplet1.title	@ltx/en_us_dedes/titles:ti.Verses
ltx/en_us_dedes/sy.m04.d07:syMA.commemoration05.couplet1.verse1	
ltx/en_us_dedes/sy.m04.d07:syMA.commemoration05.couplet1.verse2	
ltx/en_us_dedes/sy.m04.d07:syMA.commemoration05.text	On this day we also commemorate the holy two-hundred martyrs in Sinope who died by the sword.
ltx/en_us_dedes/sy.m04.d07:syMA.commemoration06.couplet1.title	@ltx/en_us_dedes/titles:ti.Verses
ltx/en_us_dedes/sy.m04.d07:syMA.commemoration06.couplet1.verse1	
ltx/en_us_dedes/sy.m04.d07:syMA.commemoration06.couplet1.verse2	
ltx/en_us_dedes/sy.m04.d07:syMA.commemoration06.narration.p01	
ltx/en_us_dedes/sy.m04.d07:syMA.commemoration06.text	On this day we also commemorate our devout and God-bearing father Savas the new of Kalymnos.
ltx/en_us_dedes/sy.m04.d07:syMA.lastline	By the intercessions of Your Saints, O Christ God, have mercy on us. Amen.
