ltx/en_us_dedes/sy.m01.d08:cl.syMA.commemoration01.narration.p01	
ltx/en_us_dedes/sy.m01.d08:cl.syMA.commemoration01.narration.p02	
ltx/en_us_dedes/sy.m01.d08:cl.syMA.commemoration01.narration.p03	
ltx/en_us_dedes/sy.m01.d08:cl.syMA.commemoration01.narration.p04	
ltx/en_us_dedes/sy.m01.d08:cl.syMA.commemoration01.narration.p05	
ltx/en_us_dedes/sy.m01.d08:cl.syMA.commemoration01.narration.p06	
ltx/en_us_dedes/sy.m01.d08:cl.syMA.commemoration01.narration.p07	
ltx/en_us_dedes/sy.m01.d08:cl.syMA.commemoration01.text	[saint/com 1]
ltx/en_us_dedes/sy.m01.d08:cl.syMA.commemoration02.narration.p01	
ltx/en_us_dedes/sy.m01.d08:cl.syMA.commemoration02.narration.p02	
ltx/en_us_dedes/sy.m01.d08:cl.syMA.commemoration02.narration.p03	
ltx/en_us_dedes/sy.m01.d08:cl.syMA.commemoration02.narration.p04	
ltx/en_us_dedes/sy.m01.d08:cl.syMA.commemoration02.narration.p05	
ltx/en_us_dedes/sy.m01.d08:cl.syMA.commemoration02.narration.p06	
ltx/en_us_dedes/sy.m01.d08:cl.syMA.commemoration02.narration.p07	
ltx/en_us_dedes/sy.m01.d08:cl.syMA.commemoration02.text	[saint/com 2]
ltx/en_us_dedes/sy.m01.d08:cl.syMA.commemoration03.narration.p01	
ltx/en_us_dedes/sy.m01.d08:cl.syMA.commemoration03.narration.p02	
ltx/en_us_dedes/sy.m01.d08:cl.syMA.commemoration03.narration.p03	
ltx/en_us_dedes/sy.m01.d08:cl.syMA.commemoration03.narration.p04	
ltx/en_us_dedes/sy.m01.d08:cl.syMA.commemoration03.narration.p05	
ltx/en_us_dedes/sy.m01.d08:cl.syMA.commemoration03.narration.p06	
ltx/en_us_dedes/sy.m01.d08:cl.syMA.commemoration03.narration.p07	
ltx/en_us_dedes/sy.m01.d08:cl.syMA.commemoration03.text	[saint/com 3]
ltx/en_us_dedes/sy.m01.d08:cl.syMA.commemoration04.narration.p01	
ltx/en_us_dedes/sy.m01.d08:cl.syMA.commemoration04.narration.p02	
ltx/en_us_dedes/sy.m01.d08:cl.syMA.commemoration04.narration.p03	
ltx/en_us_dedes/sy.m01.d08:cl.syMA.commemoration04.narration.p04	
ltx/en_us_dedes/sy.m01.d08:cl.syMA.commemoration04.narration.p05	
ltx/en_us_dedes/sy.m01.d08:cl.syMA.commemoration04.narration.p06	
ltx/en_us_dedes/sy.m01.d08:cl.syMA.commemoration04.narration.p07	
ltx/en_us_dedes/sy.m01.d08:cl.syMA.commemoration04.text	[saint/com 4]
ltx/en_us_dedes/sy.m01.d08:cl.syMA.commemoration05.narration.p01	
ltx/en_us_dedes/sy.m01.d08:cl.syMA.commemoration05.narration.p02	
ltx/en_us_dedes/sy.m01.d08:cl.syMA.commemoration05.narration.p03	
ltx/en_us_dedes/sy.m01.d08:cl.syMA.commemoration05.narration.p04	
ltx/en_us_dedes/sy.m01.d08:cl.syMA.commemoration05.narration.p05	
ltx/en_us_dedes/sy.m01.d08:cl.syMA.commemoration05.narration.p06	
ltx/en_us_dedes/sy.m01.d08:cl.syMA.commemoration05.narration.p07	
ltx/en_us_dedes/sy.m01.d08:cl.syMA.commemoration05.text	[saint/com 5]
ltx/en_us_dedes/sy.m01.d08:cl.syMA.commemoration06.text	[saint/com list]
ltx/en_us_dedes/sy.m01.d08:syMA.commemoration01.couplet1.title	@ltx/en_us_dedes/titles:ti.Verses
ltx/en_us_dedes/sy.m01.d08:syMA.commemoration01.couplet1.verse1	
ltx/en_us_dedes/sy.m01.d08:syMA.commemoration01.couplet1.verse2	
ltx/en_us_dedes/sy.m01.d08:syMA.commemoration01.narration.p01	
ltx/en_us_dedes/sy.m01.d08:syMA.commemoration01.single1	
ltx/en_us_dedes/sy.m01.d08:syMA.commemoration01.text	On January 8 we commemorate our devout mother Domnica.
ltx/en_us_dedes/sy.m01.d08:syMA.commemoration02.couplet1.title	@ltx/en_us_dedes/titles:ti.Verses
ltx/en_us_dedes/sy.m01.d08:syMA.commemoration02.couplet1.verse1	
ltx/en_us_dedes/sy.m01.d08:syMA.commemoration02.couplet1.verse2	
ltx/en_us_dedes/sy.m01.d08:syMA.commemoration02.text	On this day we also commemorate our devout father George of Hozeva.
ltx/en_us_dedes/sy.m01.d08:syMA.commemoration03.couplet1.title	@ltx/en_us_dedes/titles:ti.Verses
ltx/en_us_dedes/sy.m01.d08:syMA.commemoration03.couplet1.verse1	
ltx/en_us_dedes/sy.m01.d08:syMA.commemoration03.couplet1.verse2	
ltx/en_us_dedes/sy.m01.d08:syMA.commemoration03.couplet2.verse1	
ltx/en_us_dedes/sy.m01.d08:syMA.commemoration03.couplet2.verse2	
ltx/en_us_dedes/sy.m01.d08:syMA.commemoration03.narration.p01	
ltx/en_us_dedes/sy.m01.d08:syMA.commemoration03.narration.p02	
ltx/en_us_dedes/sy.m01.d08:syMA.commemoration03.narration.p03	
ltx/en_us_dedes/sy.m01.d08:syMA.commemoration03.text	On this day we also commemorate the holy martyrs Julian and Basilissa, and those with them Celsius and Anthony.
ltx/en_us_dedes/sy.m01.d08:syMA.commemoration04.couplet1.title	@ltx/en_us_dedes/titles:ti.Verses
ltx/en_us_dedes/sy.m01.d08:syMA.commemoration04.couplet1.verse1	
ltx/en_us_dedes/sy.m01.d08:syMA.commemoration04.couplet1.verse2	
ltx/en_us_dedes/sy.m01.d08:syMA.commemoration04.narration.p01	
ltx/en_us_dedes/sy.m01.d08:syMA.commemoration04.narration.p02	
ltx/en_us_dedes/sy.m01.d08:syMA.commemoration04.narration.p03	
ltx/en_us_dedes/sy.m01.d08:syMA.commemoration04.narration.p04	
ltx/en_us_dedes/sy.m01.d08:syMA.commemoration04.narration.p05	
ltx/en_us_dedes/sy.m01.d08:syMA.commemoration04.text	On this day we also commemorate the holy hieromartyr Karterios.
ltx/en_us_dedes/sy.m01.d08:syMA.commemoration05.couplet1.title	@ltx/en_us_dedes/titles:ti.Verses
ltx/en_us_dedes/sy.m01.d08:syMA.commemoration05.couplet1.verse1	
ltx/en_us_dedes/sy.m01.d08:syMA.commemoration05.couplet1.verse2	
ltx/en_us_dedes/sy.m01.d08:syMA.commemoration05.text	On this day we commemorate our father among the saints Cyril, Archbishop of Constantinople. Services in his honor were held in the august monastery of Chora and in the Great Church on Sunday.
ltx/en_us_dedes/sy.m01.d08:syMA.commemoration06.couplet1.title	@ltx/en_us_dedes/titles:ti.Verses
ltx/en_us_dedes/sy.m01.d08:syMA.commemoration06.couplet1.verse1	
ltx/en_us_dedes/sy.m01.d08:syMA.commemoration06.couplet1.verse2	
ltx/en_us_dedes/sy.m01.d08:syMA.commemoration06.text	On this day Saint Attikos, Patriarch of Constantinople, reposed in peace.
ltx/en_us_dedes/sy.m01.d08:syMA.commemoration07.couplet1.title	@ltx/en_us_dedes/titles:ti.Verses
ltx/en_us_dedes/sy.m01.d08:syMA.commemoration07.couplet1.verse1	
ltx/en_us_dedes/sy.m01.d08:syMA.commemoration07.couplet1.verse2	
ltx/en_us_dedes/sy.m01.d08:syMA.commemoration07.text	On this day the holy Prophet Samea the Elamite reposed in peace.
ltx/en_us_dedes/sy.m01.d08:syMA.commemoration08.couplet1.title	@ltx/en_us_dedes/titles:ti.Verses
ltx/en_us_dedes/sy.m01.d08:syMA.commemoration08.couplet1.verse1	
ltx/en_us_dedes/sy.m01.d08:syMA.commemoration08.couplet1.verse2	
ltx/en_us_dedes/sy.m01.d08:syMA.commemoration08.text	On this day Saint Agatho reposed in peace.
ltx/en_us_dedes/sy.m01.d08:syMA.commemoration09.couplet1.title	@ltx/en_us_dedes/titles:ti.Verses
ltx/en_us_dedes/sy.m01.d08:syMA.commemoration09.couplet1.verse1	
ltx/en_us_dedes/sy.m01.d08:syMA.commemoration09.couplet1.verse2	
ltx/en_us_dedes/sy.m01.d08:syMA.commemoration09.narration.p01	
ltx/en_us_dedes/sy.m01.d08:syMA.commemoration09.text	On the day we also commemorate the holy martyrs of Christ Theophilos the deacon and Eladios the laymen.
ltx/en_us_dedes/sy.m01.d08:syMA.lastline	By the intercessions of Your Saints, O God, have mercy on us and save us. Amen.
