ltx/en_us_dedes/sy.m10.d11:cl.syMA.commemoration01.text	[saint/com 1]
ltx/en_us_dedes/sy.m10.d11:cl.syMA.commemoration02.text	[saint/com 2]
ltx/en_us_dedes/sy.m10.d11:cl.syMA.commemoration03.text	[saint/com 3]
ltx/en_us_dedes/sy.m10.d11:cl.syMA.commemoration04.text	[saint/com 4]
ltx/en_us_dedes/sy.m10.d11:cl.syMA.commemoration05.text	[saint/com 5]
ltx/en_us_dedes/sy.m10.d11:cl.syMA.commemoration06.text	[saint/com list]
ltx/en_us_dedes/sy.m10.d11:syMA.commemoration01.couplet1.title	@ltx/en_us_dedes/titles:ti.Verses
ltx/en_us_dedes/sy.m10.d11:syMA.commemoration01.couplet1.verse1	
ltx/en_us_dedes/sy.m10.d11:syMA.commemoration01.couplet1.verse2	
ltx/en_us_dedes/sy.m10.d11:syMA.commemoration01.narration.p01	
ltx/en_us_dedes/sy.m10.d11:syMA.commemoration01.single1	
ltx/en_us_dedes/sy.m10.d11:syMA.commemoration01.text	On October 11, we commemorate the holy Apostle Philip, one of the seven Deacons.
ltx/en_us_dedes/sy.m10.d11:syMA.commemoration02.couplet1.title	@ltx/en_us_dedes/titles:ti.Verses
ltx/en_us_dedes/sy.m10.d11:syMA.commemoration02.couplet1.verse1	
ltx/en_us_dedes/sy.m10.d11:syMA.commemoration02.couplet1.verse2	
ltx/en_us_dedes/sy.m10.d11:syMA.commemoration02.narration.p01	
ltx/en_us_dedes/sy.m10.d11:syMA.commemoration02.narration.p02	
ltx/en_us_dedes/sy.m10.d11:syMA.commemoration02.text	On this day we commemorate our devout father Theophanes the Confessor, brother of Saint Theodore the Branded.
ltx/en_us_dedes/sy.m10.d11:syMA.commemoration03.couplet1.title	@ltx/en_us_dedes/titles:ti.Verses
ltx/en_us_dedes/sy.m10.d11:syMA.commemoration03.couplet1.verse1	
ltx/en_us_dedes/sy.m10.d11:syMA.commemoration03.couplet1.verse2	
ltx/en_us_dedes/sy.m10.d11:syMA.commemoration03.narration.p01	
ltx/en_us_dedes/sy.m10.d11:syMA.commemoration03.text	On this day we commemorate the holy Martyrs Zenaida and Philonilla the sisters.
ltx/en_us_dedes/sy.m10.d11:syMA.commemoration04.couplet1.title	@ltx/en_us_dedes/titles:ti.Verses
ltx/en_us_dedes/sy.m10.d11:syMA.commemoration04.couplet1.verse1	
ltx/en_us_dedes/sy.m10.d11:syMA.commemoration04.couplet1.verse2	
ltx/en_us_dedes/sy.m10.d11:syMA.commemoration04.couplet2.verse1	
ltx/en_us_dedes/sy.m10.d11:syMA.commemoration04.couplet2.verse2	
ltx/en_us_dedes/sy.m10.d11:syMA.commemoration04.couplet3.verse1	
ltx/en_us_dedes/sy.m10.d11:syMA.commemoration04.couplet3.verse2	
ltx/en_us_dedes/sy.m10.d11:syMA.commemoration04.text	On this day we commemorate the holy Patriarchs of Constantinople Nektarios, Arsakios and Sisinios.
ltx/en_us_dedes/sy.m10.d11:syMA.lastline	By their holy intercessions, O God, have mercy on us. Amen.
