ltx/en_us_dedes/me.m06.d05:meDA.commemoration.first	Memory of the Holy Hieromartyr Dorotheus, Bishop of Tyre
ltx/en_us_dedes/me.m06.d05:meDA.commemoration.first_name	
ltx/en_us_dedes/me.m06.d05:meDA.commemoration.first_short	Memory of the Holy Hieromartyr Dorotheus, Bishop of Tyre
ltx/en_us_dedes/me.m06.d05:meDA.commemoration.first_title	@ltx/en_us_dedes/titles:ti.SaintM
ltx/en_us_dedes/me.m06.d05:meDA.commemoration.full	Memory of the Holy Hieromartyr Dorotheus, Bishop of Tyre
ltx/en_us_dedes/me.m06.d05:meDA.commemoration.second_name	
ltx/en_us_dedes/me.m06.d05:meDA.commemoration.second_title	
ltx/en_us_dedes/me.m06.d05:meDA.date	June 5
ltx/en_us_dedes/me.m06.d05:meDA.dismissal	
ltx/en_us_dedes/me.m06.d05:meDA.fordate	for June 5
ltx/en_us_dedes/me.m06.d05:meDA.insert1	
ltx/en_us_dedes/me.m06.d05:meDA.insert2	
ltx/en_us_dedes/me.m06.d05:meDA.note	
ltx/en_us_dedes/me.m06.d05:meDA.pdfcoverdate	June 5,
ltx/en_us_dedes/me.m06.d05:meDA.pdfheaderdate	June 5
ltx/en_us_dedes/me.m06.d05:meHO.commemorations	
ltx/en_us_dedes/me.m06.d05:meHO.note1	
ltx/en_us_dedes/me.m06.d05:meHO.note2	
ltx/en_us_dedes/me.m06.d05:meHO.number	
ltx/en_us_dedes/me.m06.d05:meHO.rank	
ltx/en_us_dedes/me.m06.d05:meLE.commemoration1	
ltx/en_us_dedes/me.m06.d05:meLE.commemoration2	
ltx/en_us_dedes/me.m06.d05:meLI.Kontakion1.greekmelody	@ltx/en_us_dedes/me.m06.d05:meMA.Kontakion1.greekmelody
ltx/en_us_dedes/me.m06.d05:meLI.Kontakion1.incipit	@ltx/en_us_dedes/me.m06.d05:meMA.Kontakion1.incipit
ltx/en_us_dedes/me.m06.d05:meLI.Kontakion1.melody	@ltx/en_us_dedes/me.m06.d05:meMA.Kontakion1.melody
ltx/en_us_dedes/me.m06.d05:meLI.Kontakion1.mode	@ltx/en_us_dedes/me.m06.d05:meMA.Kontakion1.mode
ltx/en_us_dedes/me.m06.d05:meLI.Kontakion1.text	@ltx/en_us_dedes/me.m06.d05:meMA.Kontakion1.text
ltx/en_us_dedes/me.m06.d05:meLI.MM.CommunionHymn.text	@ltx/en_us_dedes/properties:media.key
ltx/en_us_dedes/me.m06.d05:meLI.Megalynarion.text	
ltx/en_us_dedes/me.m06.d05:meMA.C1.acrostic.notice1	
ltx/en_us_dedes/me.m06.d05:meMA.C1.acrostic.text	
ltx/en_us_dedes/me.m06.d05:meMA.C1.acrostic.title	
ltx/en_us_dedes/me.m06.d05:meMA.C1.title	@ltx/en_us_dedes/titles:ti.CanonSaintM
ltx/en_us_dedes/me.m06.d05:meMA.C1.verse	@ltx/en_us_dedes/prayers:pr.verse_SaintM.text
ltx/en_us_dedes/me.m06.d05:meMA.Kontakion1.greekmelody	@ltx/en_us_dedes/he.a.m3:heAU.IParthenosSimeron.greekname
ltx/en_us_dedes/me.m06.d05:meMA.Kontakion1.incipit	Hieromartyr, you proclaimed * the…
ltx/en_us_dedes/me.m06.d05:meMA.Kontakion1.melody	@ltx/en_us_dedes/he.a.m3:heAU.IParthenosSimeron.name
ltx/en_us_dedes/me.m06.d05:meMA.Kontakion1.mode	@ltx/en_us_dedes/miscellanea:misc.Mode3
ltx/en_us_dedes/me.m06.d05:meMA.Kontakion1.text	Hieromartyr, you proclaimed * the sacred Orthodox doctrines. * In accordance with your name, * you gave yourself as a holy * gift to God. First you excelled in ascetic practice; * then you ran the race of martyrdom; and according * to the rules you won, and Christ God * gave you the holy medal of victory.
ltx/en_us_dedes/me.m06.d05:meMA.Ode1C11.greekmelody	@ltx/en_us_dedes/he.h.m8:heHE.AsomenToKyrio.greekname
ltx/en_us_dedes/me.m06.d05:meMA.Ode1C11.incipit	…
ltx/en_us_dedes/me.m06.d05:meMA.Ode1C11.melody	@ltx/en_us_dedes/he.h.m8:heHE.AsomenToKyrio.name
ltx/en_us_dedes/me.m06.d05:meMA.Ode1C11.mode	@ltx/en_us_dedes/miscellanea:misc.Mode8
ltx/en_us_dedes/me.m06.d05:meMA.Ode1C11.ode	@ltx/en_us_dedes/miscellanea:misc.Ode1
ltx/en_us_dedes/me.m06.d05:meMA.Ode1C11.text	
ltx/en_us_dedes/me.m06.d05:meMA.Ode1C12.incipit	…
ltx/en_us_dedes/me.m06.d05:meMA.Ode1C12.melody	@ltx/en_us_dedes/he.h.m8:heHE.AsomenToKyrio.name
ltx/en_us_dedes/me.m06.d05:meMA.Ode1C12.mode	@ltx/en_us_dedes/miscellanea:misc.Mode8
ltx/en_us_dedes/me.m06.d05:meMA.Ode1C12.ode	@ltx/en_us_dedes/miscellanea:misc.Ode1
ltx/en_us_dedes/me.m06.d05:meMA.Ode1C12.text	
ltx/en_us_dedes/me.m06.d05:meMA.Ode1C13.incipit	…
ltx/en_us_dedes/me.m06.d05:meMA.Ode1C13.melody	@ltx/en_us_dedes/he.h.m8:heHE.AsomenToKyrio.name
ltx/en_us_dedes/me.m06.d05:meMA.Ode1C13.mode	@ltx/en_us_dedes/miscellanea:misc.Mode8
ltx/en_us_dedes/me.m06.d05:meMA.Ode1C13.ode	@ltx/en_us_dedes/miscellanea:misc.Ode1
ltx/en_us_dedes/me.m06.d05:meMA.Ode1C13.text	
ltx/en_us_dedes/me.m06.d05:meMA.Ode1C1T.incipit	…
ltx/en_us_dedes/me.m06.d05:meMA.Ode1C1T.melody	@ltx/en_us_dedes/he.h.m8:heHE.AsomenToKyrio.name
ltx/en_us_dedes/me.m06.d05:meMA.Ode1C1T.mode	@ltx/en_us_dedes/miscellanea:misc.Mode8
ltx/en_us_dedes/me.m06.d05:meMA.Ode1C1T.ode	@ltx/en_us_dedes/miscellanea:misc.Ode1
ltx/en_us_dedes/me.m06.d05:meMA.Ode1C1T.text	
ltx/en_us_dedes/me.m06.d05:meMA.Ode3C11.greekmelody	@ltx/en_us_dedes/he.h.m8:heHE.SyEiToStereoma.greekname
ltx/en_us_dedes/me.m06.d05:meMA.Ode3C11.incipit	…
ltx/en_us_dedes/me.m06.d05:meMA.Ode3C11.melody	@ltx/en_us_dedes/he.h.m8:heHE.SyEiToStereoma.name
ltx/en_us_dedes/me.m06.d05:meMA.Ode3C11.mode	@ltx/en_us_dedes/miscellanea:misc.Mode8
ltx/en_us_dedes/me.m06.d05:meMA.Ode3C11.ode	@ltx/en_us_dedes/miscellanea:misc.Ode3
ltx/en_us_dedes/me.m06.d05:meMA.Ode3C11.text	
ltx/en_us_dedes/me.m06.d05:meMA.Ode3C12.incipit	…
ltx/en_us_dedes/me.m06.d05:meMA.Ode3C12.melody	@ltx/en_us_dedes/he.h.m8:heHE.SyEiToStereoma.name
ltx/en_us_dedes/me.m06.d05:meMA.Ode3C12.mode	@ltx/en_us_dedes/miscellanea:misc.Mode8
ltx/en_us_dedes/me.m06.d05:meMA.Ode3C12.ode	@ltx/en_us_dedes/miscellanea:misc.Ode3
ltx/en_us_dedes/me.m06.d05:meMA.Ode3C12.text	
ltx/en_us_dedes/me.m06.d05:meMA.Ode3C13.incipit	…
ltx/en_us_dedes/me.m06.d05:meMA.Ode3C13.melody	@ltx/en_us_dedes/he.h.m8:heHE.SyEiToStereoma.name
ltx/en_us_dedes/me.m06.d05:meMA.Ode3C13.mode	@ltx/en_us_dedes/miscellanea:misc.Mode8
ltx/en_us_dedes/me.m06.d05:meMA.Ode3C13.ode	@ltx/en_us_dedes/miscellanea:misc.Ode3
ltx/en_us_dedes/me.m06.d05:meMA.Ode3C13.text	
ltx/en_us_dedes/me.m06.d05:meMA.Ode3C1T.incipit	…
ltx/en_us_dedes/me.m06.d05:meMA.Ode3C1T.melody	@ltx/en_us_dedes/he.h.m8:heHE.SyEiToStereoma.name
ltx/en_us_dedes/me.m06.d05:meMA.Ode3C1T.mode	@ltx/en_us_dedes/miscellanea:misc.Mode8
ltx/en_us_dedes/me.m06.d05:meMA.Ode3C1T.ode	@ltx/en_us_dedes/miscellanea:misc.Ode3
ltx/en_us_dedes/me.m06.d05:meMA.Ode3C1T.text	
ltx/en_us_dedes/me.m06.d05:meMA.Ode3H.greekmelody	@ltx/en_us_dedes/he.h.m8:heHE.SyEiToStereoma.greekname
ltx/en_us_dedes/me.m06.d05:meMA.Ode3H.incipit	@ltx/en_us_dedes/he.h.m8:heHE.SyEiToStereoma.incipit
ltx/en_us_dedes/me.m06.d05:meMA.Ode3H.melody	@ltx/en_us_dedes/he.h.m8:heHE.SyEiToStereoma.melody
ltx/en_us_dedes/me.m06.d05:meMA.Ode3H.mode	@ltx/en_us_dedes/miscellanea:misc.Mode8
ltx/en_us_dedes/me.m06.d05:meMA.Ode3H.ode	@ltx/en_us_dedes/miscellanea:misc.Ode3
ltx/en_us_dedes/me.m06.d05:meMA.Ode3H.text	@ltx/en_us_dedes/he.h.m8:heHE.SyEiToStereoma.text
ltx/en_us_dedes/me.m06.d05:meMA.Ode3Kathisma1.greekmelody	@ltx/en_us_dedes/he.a.m3:heAU.TheiasPisteos.greekname
ltx/en_us_dedes/me.m06.d05:meMA.Ode3Kathisma1.incipit	…
ltx/en_us_dedes/me.m06.d05:meMA.Ode3Kathisma1.melody	@ltx/en_us_dedes/he.a.m3:heAU.TheiasPisteos.name
ltx/en_us_dedes/me.m06.d05:meMA.Ode3Kathisma1.mode	@ltx/en_us_dedes/miscellanea:misc.Mode3
ltx/en_us_dedes/me.m06.d05:meMA.Ode3Kathisma1.text	
ltx/en_us_dedes/me.m06.d05:meMA.Ode3KathismaSt.incipit	@ltx/en_us_dedes/me.m01.d29:meMA.Ode3KathismaSt.incipit
ltx/en_us_dedes/me.m06.d05:meMA.Ode3KathismaSt.melody	@ltx/en_us_dedes/he.a.m3:heAU.TheiasPisteos.name
ltx/en_us_dedes/me.m06.d05:meMA.Ode3KathismaSt.mode	@ltx/en_us_dedes/miscellanea:misc.Mode3
ltx/en_us_dedes/me.m06.d05:meMA.Ode3KathismaSt.text	@ltx/en_us_dedes/me.m01.d29:meMA.Ode3KathismaSt.text
ltx/en_us_dedes/me.m06.d05:meMA.Ode3KathismaT.incipit	@ltx/en_us_dedes/me.m01.d25:meMA.Kathisma1T.incipit
ltx/en_us_dedes/me.m06.d05:meMA.Ode3KathismaT.melody	@ltx/en_us_dedes/he.a.m3:heAU.TheiasPisteos.name
ltx/en_us_dedes/me.m06.d05:meMA.Ode3KathismaT.mode	@ltx/en_us_dedes/miscellanea:misc.Mode3
ltx/en_us_dedes/me.m06.d05:meMA.Ode3KathismaT.text	@ltx/en_us_dedes/me.m01.d25:meMA.Kathisma1T.text
ltx/en_us_dedes/me.m06.d05:meMA.Ode4C11.greekmelody	@ltx/en_us_dedes/he.h.m8:heHE.EisakikoaKyrie.greekname
ltx/en_us_dedes/me.m06.d05:meMA.Ode4C11.incipit	…
ltx/en_us_dedes/me.m06.d05:meMA.Ode4C11.melody	@ltx/en_us_dedes/he.h.m8:heHE.EisakikoaKyrie.name
ltx/en_us_dedes/me.m06.d05:meMA.Ode4C11.mode	@ltx/en_us_dedes/miscellanea:misc.Mode8
ltx/en_us_dedes/me.m06.d05:meMA.Ode4C11.ode	@ltx/en_us_dedes/miscellanea:misc.Ode4
ltx/en_us_dedes/me.m06.d05:meMA.Ode4C11.text	
ltx/en_us_dedes/me.m06.d05:meMA.Ode4C12.incipit	…
ltx/en_us_dedes/me.m06.d05:meMA.Ode4C12.melody	@ltx/en_us_dedes/he.h.m8:heHE.EisakikoaKyrie.name
ltx/en_us_dedes/me.m06.d05:meMA.Ode4C12.mode	@ltx/en_us_dedes/miscellanea:misc.Mode8
ltx/en_us_dedes/me.m06.d05:meMA.Ode4C12.ode	@ltx/en_us_dedes/miscellanea:misc.Ode4
ltx/en_us_dedes/me.m06.d05:meMA.Ode4C12.text	
ltx/en_us_dedes/me.m06.d05:meMA.Ode4C13.incipit	…
ltx/en_us_dedes/me.m06.d05:meMA.Ode4C13.melody	@ltx/en_us_dedes/he.h.m8:heHE.EisakikoaKyrie.name
ltx/en_us_dedes/me.m06.d05:meMA.Ode4C13.mode	@ltx/en_us_dedes/miscellanea:misc.Mode8
ltx/en_us_dedes/me.m06.d05:meMA.Ode4C13.ode	@ltx/en_us_dedes/miscellanea:misc.Ode4
ltx/en_us_dedes/me.m06.d05:meMA.Ode4C13.text	
ltx/en_us_dedes/me.m06.d05:meMA.Ode4C1T.incipit	…
ltx/en_us_dedes/me.m06.d05:meMA.Ode4C1T.melody	@ltx/en_us_dedes/he.h.m8:heHE.EisakikoaKyrie.name
ltx/en_us_dedes/me.m06.d05:meMA.Ode4C1T.mode	@ltx/en_us_dedes/miscellanea:misc.Mode8
ltx/en_us_dedes/me.m06.d05:meMA.Ode4C1T.ode	@ltx/en_us_dedes/miscellanea:misc.Ode4
ltx/en_us_dedes/me.m06.d05:meMA.Ode4C1T.text	
ltx/en_us_dedes/me.m06.d05:meMA.Ode5C11.greekmelody	@ltx/en_us_dedes/he.h.m8:heHE.TonEkNyktosAgnosias.greekname
ltx/en_us_dedes/me.m06.d05:meMA.Ode5C11.incipit	…
ltx/en_us_dedes/me.m06.d05:meMA.Ode5C11.melody	@ltx/en_us_dedes/he.h.m8:heHE.TonEkNyktosAgnosias.name
ltx/en_us_dedes/me.m06.d05:meMA.Ode5C11.mode	@ltx/en_us_dedes/miscellanea:misc.Mode8
ltx/en_us_dedes/me.m06.d05:meMA.Ode5C11.ode	@ltx/en_us_dedes/miscellanea:misc.Ode5
ltx/en_us_dedes/me.m06.d05:meMA.Ode5C11.text	
ltx/en_us_dedes/me.m06.d05:meMA.Ode5C12.incipit	…
ltx/en_us_dedes/me.m06.d05:meMA.Ode5C12.melody	@ltx/en_us_dedes/he.h.m8:heHE.TonEkNyktosAgnosias.name
ltx/en_us_dedes/me.m06.d05:meMA.Ode5C12.mode	@ltx/en_us_dedes/miscellanea:misc.Mode8
ltx/en_us_dedes/me.m06.d05:meMA.Ode5C12.ode	@ltx/en_us_dedes/miscellanea:misc.Ode5
ltx/en_us_dedes/me.m06.d05:meMA.Ode5C12.text	
ltx/en_us_dedes/me.m06.d05:meMA.Ode5C13.incipit	…
ltx/en_us_dedes/me.m06.d05:meMA.Ode5C13.melody	@ltx/en_us_dedes/he.h.m8:heHE.TonEkNyktosAgnosias.name
ltx/en_us_dedes/me.m06.d05:meMA.Ode5C13.mode	@ltx/en_us_dedes/miscellanea:misc.Mode8
ltx/en_us_dedes/me.m06.d05:meMA.Ode5C13.ode	@ltx/en_us_dedes/miscellanea:misc.Ode5
ltx/en_us_dedes/me.m06.d05:meMA.Ode5C13.text	
ltx/en_us_dedes/me.m06.d05:meMA.Ode5C1T.incipit	…
ltx/en_us_dedes/me.m06.d05:meMA.Ode5C1T.melody	@ltx/en_us_dedes/he.h.m8:heHE.TonEkNyktosAgnosias.name
ltx/en_us_dedes/me.m06.d05:meMA.Ode5C1T.mode	@ltx/en_us_dedes/miscellanea:misc.Mode8
ltx/en_us_dedes/me.m06.d05:meMA.Ode5C1T.ode	@ltx/en_us_dedes/miscellanea:misc.Ode5
ltx/en_us_dedes/me.m06.d05:meMA.Ode5C1T.text	
ltx/en_us_dedes/me.m06.d05:meMA.Ode6C11.greekmelody	@ltx/en_us_dedes/he.h.m8:heHE.ChitonaMoiParaschou.greekname
ltx/en_us_dedes/me.m06.d05:meMA.Ode6C11.incipit	…
ltx/en_us_dedes/me.m06.d05:meMA.Ode6C11.melody	@ltx/en_us_dedes/he.h.m8:heHE.ChitonaMoiParaschou.name
ltx/en_us_dedes/me.m06.d05:meMA.Ode6C11.mode	@ltx/en_us_dedes/miscellanea:misc.Mode8
ltx/en_us_dedes/me.m06.d05:meMA.Ode6C11.ode	@ltx/en_us_dedes/miscellanea:misc.Ode6
ltx/en_us_dedes/me.m06.d05:meMA.Ode6C11.text	
ltx/en_us_dedes/me.m06.d05:meMA.Ode6C12.incipit	…
ltx/en_us_dedes/me.m06.d05:meMA.Ode6C12.melody	@ltx/en_us_dedes/he.h.m8:heHE.ChitonaMoiParaschou.name
ltx/en_us_dedes/me.m06.d05:meMA.Ode6C12.mode	@ltx/en_us_dedes/miscellanea:misc.Mode8
ltx/en_us_dedes/me.m06.d05:meMA.Ode6C12.ode	@ltx/en_us_dedes/miscellanea:misc.Ode6
ltx/en_us_dedes/me.m06.d05:meMA.Ode6C12.text	
ltx/en_us_dedes/me.m06.d05:meMA.Ode6C13.incipit	…
ltx/en_us_dedes/me.m06.d05:meMA.Ode6C13.melody	@ltx/en_us_dedes/he.h.m8:heHE.ChitonaMoiParaschou.name
ltx/en_us_dedes/me.m06.d05:meMA.Ode6C13.mode	@ltx/en_us_dedes/miscellanea:misc.Mode8
ltx/en_us_dedes/me.m06.d05:meMA.Ode6C13.ode	@ltx/en_us_dedes/miscellanea:misc.Ode6
ltx/en_us_dedes/me.m06.d05:meMA.Ode6C13.text	
ltx/en_us_dedes/me.m06.d05:meMA.Ode6C1T.incipit	…
ltx/en_us_dedes/me.m06.d05:meMA.Ode6C1T.melody	@ltx/en_us_dedes/he.h.m8:heHE.ChitonaMoiParaschou.name
ltx/en_us_dedes/me.m06.d05:meMA.Ode6C1T.mode	@ltx/en_us_dedes/miscellanea:misc.Mode8
ltx/en_us_dedes/me.m06.d05:meMA.Ode6C1T.ode	@ltx/en_us_dedes/miscellanea:misc.Ode6
ltx/en_us_dedes/me.m06.d05:meMA.Ode6C1T.text	
ltx/en_us_dedes/me.m06.d05:meMA.Ode6H.greekmelody	@ltx/en_us_dedes/he.h.m8:heHE.ChitonaMoiParaschou.greekname
ltx/en_us_dedes/me.m06.d05:meMA.Ode6H.incipit	@ltx/en_us_dedes/he.h.m8:heHE.ChitonaMoiParaschou.incipit
ltx/en_us_dedes/me.m06.d05:meMA.Ode6H.melody	@ltx/en_us_dedes/he.h.m8:heHE.ChitonaMoiParaschou.melody
ltx/en_us_dedes/me.m06.d05:meMA.Ode6H.mode	@ltx/en_us_dedes/miscellanea:misc.Mode8
ltx/en_us_dedes/me.m06.d05:meMA.Ode6H.ode	@ltx/en_us_dedes/miscellanea:misc.Ode6
ltx/en_us_dedes/me.m06.d05:meMA.Ode6H.text	@ltx/en_us_dedes/he.h.m8:heHE.ChitonaMoiParaschou.text
ltx/en_us_dedes/me.m06.d05:meMA.Ode7C11.greekmelody	@ltx/en_us_dedes/he.h.m8:heHE.PaidesEvraion.greekname
ltx/en_us_dedes/me.m06.d05:meMA.Ode7C11.incipit	…
ltx/en_us_dedes/me.m06.d05:meMA.Ode7C11.melody	@ltx/en_us_dedes/he.h.m8:heHE.PaidesEvraion.name
ltx/en_us_dedes/me.m06.d05:meMA.Ode7C11.mode	@ltx/en_us_dedes/miscellanea:misc.Mode8
ltx/en_us_dedes/me.m06.d05:meMA.Ode7C11.ode	@ltx/en_us_dedes/miscellanea:misc.Ode7
ltx/en_us_dedes/me.m06.d05:meMA.Ode7C11.text	
ltx/en_us_dedes/me.m06.d05:meMA.Ode7C12.incipit	…
ltx/en_us_dedes/me.m06.d05:meMA.Ode7C12.melody	@ltx/en_us_dedes/he.h.m8:heHE.PaidesEvraion.name
ltx/en_us_dedes/me.m06.d05:meMA.Ode7C12.mode	@ltx/en_us_dedes/miscellanea:misc.Mode8
ltx/en_us_dedes/me.m06.d05:meMA.Ode7C12.ode	@ltx/en_us_dedes/miscellanea:misc.Ode7
ltx/en_us_dedes/me.m06.d05:meMA.Ode7C12.text	
ltx/en_us_dedes/me.m06.d05:meMA.Ode7C13.incipit	…
ltx/en_us_dedes/me.m06.d05:meMA.Ode7C13.melody	@ltx/en_us_dedes/he.h.m8:heHE.PaidesEvraion.name
ltx/en_us_dedes/me.m06.d05:meMA.Ode7C13.mode	@ltx/en_us_dedes/miscellanea:misc.Mode8
ltx/en_us_dedes/me.m06.d05:meMA.Ode7C13.ode	@ltx/en_us_dedes/miscellanea:misc.Ode7
ltx/en_us_dedes/me.m06.d05:meMA.Ode7C13.text	
ltx/en_us_dedes/me.m06.d05:meMA.Ode7C1T.incipit	…
ltx/en_us_dedes/me.m06.d05:meMA.Ode7C1T.melody	@ltx/en_us_dedes/he.h.m8:heHE.PaidesEvraion.name
ltx/en_us_dedes/me.m06.d05:meMA.Ode7C1T.mode	@ltx/en_us_dedes/miscellanea:misc.Mode8
ltx/en_us_dedes/me.m06.d05:meMA.Ode7C1T.ode	@ltx/en_us_dedes/miscellanea:misc.Ode7
ltx/en_us_dedes/me.m06.d05:meMA.Ode7C1T.text	
ltx/en_us_dedes/me.m06.d05:meMA.Ode8C11.greekmelody	@ltx/en_us_dedes/he.h.m8:heHE.OiTheorrimonesPaides.greekname
ltx/en_us_dedes/me.m06.d05:meMA.Ode8C11.incipit	…
ltx/en_us_dedes/me.m06.d05:meMA.Ode8C11.melody	@ltx/en_us_dedes/he.h.m8:heHE.OiTheorrimonesPaides.name
ltx/en_us_dedes/me.m06.d05:meMA.Ode8C11.mode	@ltx/en_us_dedes/miscellanea:misc.Mode8
ltx/en_us_dedes/me.m06.d05:meMA.Ode8C11.ode	@ltx/en_us_dedes/miscellanea:misc.Ode8
ltx/en_us_dedes/me.m06.d05:meMA.Ode8C11.text	
ltx/en_us_dedes/me.m06.d05:meMA.Ode8C12.incipit	…
ltx/en_us_dedes/me.m06.d05:meMA.Ode8C12.melody	@ltx/en_us_dedes/he.h.m8:heHE.OiTheorrimonesPaides.name
ltx/en_us_dedes/me.m06.d05:meMA.Ode8C12.mode	@ltx/en_us_dedes/miscellanea:misc.Mode8
ltx/en_us_dedes/me.m06.d05:meMA.Ode8C12.ode	@ltx/en_us_dedes/miscellanea:misc.Ode8
ltx/en_us_dedes/me.m06.d05:meMA.Ode8C12.text	
ltx/en_us_dedes/me.m06.d05:meMA.Ode8C13.incipit	…
ltx/en_us_dedes/me.m06.d05:meMA.Ode8C13.melody	@ltx/en_us_dedes/he.h.m8:heHE.OiTheorrimonesPaides.name
ltx/en_us_dedes/me.m06.d05:meMA.Ode8C13.mode	@ltx/en_us_dedes/miscellanea:misc.Mode8
ltx/en_us_dedes/me.m06.d05:meMA.Ode8C13.ode	@ltx/en_us_dedes/miscellanea:misc.Ode8
ltx/en_us_dedes/me.m06.d05:meMA.Ode8C13.text	
ltx/en_us_dedes/me.m06.d05:meMA.Ode8C1T.incipit	…
ltx/en_us_dedes/me.m06.d05:meMA.Ode8C1T.melody	@ltx/en_us_dedes/he.h.m8:heHE.OiTheorrimonesPaides.name
ltx/en_us_dedes/me.m06.d05:meMA.Ode8C1T.mode	@ltx/en_us_dedes/miscellanea:misc.Mode8
ltx/en_us_dedes/me.m06.d05:meMA.Ode8C1T.ode	@ltx/en_us_dedes/miscellanea:misc.Ode8
ltx/en_us_dedes/me.m06.d05:meMA.Ode8C1T.text	
ltx/en_us_dedes/me.m06.d05:meMA.Ode8H.greekmelody	@ltx/en_us_dedes/he.h.m8:heHE.OiTheorrimonesPaides.greekname
ltx/en_us_dedes/me.m06.d05:meMA.Ode8H.incipit	@ltx/en_us_dedes/he.h.m8:heHE.OiTheorrimonesPaides.incipit
ltx/en_us_dedes/me.m06.d05:meMA.Ode8H.melody	@ltx/en_us_dedes/he.h.m8:heHE.OiTheorrimonesPaides.melody
ltx/en_us_dedes/me.m06.d05:meMA.Ode8H.mode	@ltx/en_us_dedes/miscellanea:misc.Mode8
ltx/en_us_dedes/me.m06.d05:meMA.Ode8H.ode	@ltx/en_us_dedes/miscellanea:misc.Ode8
ltx/en_us_dedes/me.m06.d05:meMA.Ode8H.text	@ltx/en_us_dedes/he.h.m8:heHE.OiTheorrimonesPaides.text
ltx/en_us_dedes/me.m06.d05:meMA.Ode9C11.greekmelody	@ltx/en_us_dedes/he.h.m8:heHE.TonProdilothenta.greekname
ltx/en_us_dedes/me.m06.d05:meMA.Ode9C11.incipit	…
ltx/en_us_dedes/me.m06.d05:meMA.Ode9C11.melody	@ltx/en_us_dedes/he.h.m8:heHE.TonProdilothenta.name
ltx/en_us_dedes/me.m06.d05:meMA.Ode9C11.mode	@ltx/en_us_dedes/miscellanea:misc.Mode8
ltx/en_us_dedes/me.m06.d05:meMA.Ode9C11.ode	@ltx/en_us_dedes/miscellanea:misc.Ode9
ltx/en_us_dedes/me.m06.d05:meMA.Ode9C11.text	
ltx/en_us_dedes/me.m06.d05:meMA.Ode9C12.incipit	…
ltx/en_us_dedes/me.m06.d05:meMA.Ode9C12.melody	@ltx/en_us_dedes/he.h.m8:heHE.TonProdilothenta.name
ltx/en_us_dedes/me.m06.d05:meMA.Ode9C12.mode	@ltx/en_us_dedes/miscellanea:misc.Mode8
ltx/en_us_dedes/me.m06.d05:meMA.Ode9C12.ode	@ltx/en_us_dedes/miscellanea:misc.Ode9
ltx/en_us_dedes/me.m06.d05:meMA.Ode9C12.text	
ltx/en_us_dedes/me.m06.d05:meMA.Ode9C13.incipit	…
ltx/en_us_dedes/me.m06.d05:meMA.Ode9C13.melody	@ltx/en_us_dedes/he.h.m8:heHE.TonProdilothenta.name
ltx/en_us_dedes/me.m06.d05:meMA.Ode9C13.mode	@ltx/en_us_dedes/miscellanea:misc.Mode8
ltx/en_us_dedes/me.m06.d05:meMA.Ode9C13.ode	@ltx/en_us_dedes/miscellanea:misc.Ode9
ltx/en_us_dedes/me.m06.d05:meMA.Ode9C13.text	
ltx/en_us_dedes/me.m06.d05:meMA.Ode9C14.incipit	…
ltx/en_us_dedes/me.m06.d05:meMA.Ode9C14.melody	@ltx/en_us_dedes/he.h.m8:heHE.TonProdilothenta.name
ltx/en_us_dedes/me.m06.d05:meMA.Ode9C14.mode	@ltx/en_us_dedes/miscellanea:misc.Mode8
ltx/en_us_dedes/me.m06.d05:meMA.Ode9C14.ode	@ltx/en_us_dedes/miscellanea:misc.Ode9
ltx/en_us_dedes/me.m06.d05:meMA.Ode9C14.text	
ltx/en_us_dedes/me.m06.d05:meMA.Ode9C1T.incipit	…
ltx/en_us_dedes/me.m06.d05:meMA.Ode9C1T.melody	@ltx/en_us_dedes/he.h.m8:heHE.TonProdilothenta.name
ltx/en_us_dedes/me.m06.d05:meMA.Ode9C1T.mode	@ltx/en_us_dedes/miscellanea:misc.Mode8
ltx/en_us_dedes/me.m06.d05:meMA.Ode9C1T.ode	@ltx/en_us_dedes/miscellanea:misc.Ode9
ltx/en_us_dedes/me.m06.d05:meMA.Ode9C1T.text	
ltx/en_us_dedes/me.m06.d05:meMA.Ode9H.greekmelody	@ltx/en_us_dedes/he.h.m8:heHE.TonProdilothenta.greekname
ltx/en_us_dedes/me.m06.d05:meMA.Ode9H.incipit	@ltx/en_us_dedes/he.h.m8:heHE.TonProdilothenta.incipit
ltx/en_us_dedes/me.m06.d05:meMA.Ode9H.melody	@ltx/en_us_dedes/he.h.m8:heHE.TonProdilothenta.melody
ltx/en_us_dedes/me.m06.d05:meMA.Ode9H.mode	@ltx/en_us_dedes/miscellanea:misc.Mode8
ltx/en_us_dedes/me.m06.d05:meMA.Ode9H.ode	@ltx/en_us_dedes/miscellanea:misc.Ode9
ltx/en_us_dedes/me.m06.d05:meMA.Ode9H.text	@ltx/en_us_dedes/he.h.m8:heHE.TonProdilothenta.text
ltx/en_us_dedes/me.m06.d05:meVE.Apolytikion1ger.greekmelody	@ltx/en_us_dedes/he.a.m4:heAU.TachyProkatalave.greekname
ltx/en_us_dedes/me.m06.d05:meVE.Apolytikion1ger.incipit	…
ltx/en_us_dedes/me.m06.d05:meVE.Apolytikion1ger.melody	@ltx/en_us_dedes/he.a.m4:heAU.TachyProkatalave.name
ltx/en_us_dedes/me.m06.d05:meVE.Apolytikion1ger.mode	@ltx/en_us_dedes/miscellanea:misc.Mode4
ltx/en_us_dedes/me.m06.d05:meVE.Apolytikion1ger.poet	@ltx/en_us_dedes/poets:po.Gerasimou
ltx/en_us_dedes/me.m06.d05:meVE.Apolytikion1ger.text	
ltx/en_us_dedes/me.m06.d05:meVE.SticStavrotheotokion.greekmelody	@ltx/en_us_dedes/he.a.m8:heAU.OiMartyresSouKyrie.greekname
ltx/en_us_dedes/me.m06.d05:meVE.SticStavrotheotokion.incipit	@ltx/en_us_dedes/me.m02.d19:meVE.SticStavrotheotokion.incipit
ltx/en_us_dedes/me.m06.d05:meVE.SticStavrotheotokion.melody	@ltx/en_us_dedes/he.a.m8:heAU.OiMartyresSouKyrie.name
ltx/en_us_dedes/me.m06.d05:meVE.SticStavrotheotokion.mode	@ltx/en_us_dedes/miscellanea:misc.Mode8
ltx/en_us_dedes/me.m06.d05:meVE.SticStavrotheotokion.text	@ltx/en_us_dedes/me.m02.d19:meVE.SticStavrotheotokion.text
ltx/en_us_dedes/me.m06.d05:meVE.SticTheotokion.greekmelody	@ltx/en_us_dedes/he.a.m8:heAU.OiMartyresSouKyrie.greekname
ltx/en_us_dedes/me.m06.d05:meVE.SticTheotokion.incipit	@ltx/en_us_dedes/me.m01.d31:meVE.SticTheotokion.incipit
ltx/en_us_dedes/me.m06.d05:meVE.SticTheotokion.melody	@ltx/en_us_dedes/he.a.m8:heAU.OiMartyresSouKyrie.name
ltx/en_us_dedes/me.m06.d05:meVE.SticTheotokion.mode	@ltx/en_us_dedes/miscellanea:misc.Mode8
ltx/en_us_dedes/me.m06.d05:meVE.SticTheotokion.text	@ltx/en_us_dedes/me.m01.d31:meVE.SticTheotokion.text
ltx/en_us_dedes/me.m06.d05:meVE.Stichera01.greekmelody	@ltx/en_us_dedes/he.a.m8:heAU.OiMartyresSouKyrie.greekname
ltx/en_us_dedes/me.m06.d05:meVE.Stichera01.incipit	…
ltx/en_us_dedes/me.m06.d05:meVE.Stichera01.melody	@ltx/en_us_dedes/he.a.m8:heAU.OiMartyresSouKyrie.name
ltx/en_us_dedes/me.m06.d05:meVE.Stichera01.mode	@ltx/en_us_dedes/miscellanea:misc.Mode8
ltx/en_us_dedes/me.m06.d05:meVE.Stichera01.text	
ltx/en_us_dedes/me.m06.d05:meVE.Stichera02.incipit	…
ltx/en_us_dedes/me.m06.d05:meVE.Stichera02.melody	@ltx/en_us_dedes/he.a.m8:heAU.OiMartyresSouKyrie.name
ltx/en_us_dedes/me.m06.d05:meVE.Stichera02.mode	@ltx/en_us_dedes/miscellanea:misc.Mode8
ltx/en_us_dedes/me.m06.d05:meVE.Stichera02.text	
ltx/en_us_dedes/me.m06.d05:meVE.Stichera03.incipit	…
ltx/en_us_dedes/me.m06.d05:meVE.Stichera03.melody	@ltx/en_us_dedes/he.a.m8:heAU.OiMartyresSouKyrie.name
ltx/en_us_dedes/me.m06.d05:meVE.Stichera03.mode	@ltx/en_us_dedes/miscellanea:misc.Mode8
ltx/en_us_dedes/me.m06.d05:meVE.Stichera03.text	
