ltx/en_us_dedes/ho.ho15.m08:ho.Days	
ltx/en_us_dedes/ho.ho15.m08:ho.Hours	
ltx/en_us_dedes/ho.ho15.m08:ho.Month	
ltx/en_us_dedes/ho.ho15.m08:hoD08.GeneralApolytikion2.name	Aimilianos,
ltx/en_us_dedes/ho.ho15.m08:hoD09.GeneralApolytikion1.name	Matthias,
ltx/en_us_dedes/ho.ho15.m08:hoD12.GeneralApolytikion3.name	Maximus,
ltx/en_us_dedes/ho.ho15.m08:hoD14.Apolytikion2.greekmelody	@ltx/en_us_dedes/he.a.m4:heAU.TachyProkatalave.greekname
ltx/en_us_dedes/ho.ho15.m08:hoD14.Apolytikion2.incipit	O Micah inspired by God…
ltx/en_us_dedes/ho.ho15.m08:hoD14.Apolytikion2.melody	@ltx/en_us_dedes/he.a.m4:heAU.TachyProkatalave.name
ltx/en_us_dedes/ho.ho15.m08:hoD14.Apolytikion2.mode	@ltx/en_us_dedes/miscellanea:misc.Mode4
ltx/en_us_dedes/ho.ho15.m08:hoD14.Apolytikion2.poet	
ltx/en_us_dedes/ho.ho15.m08:hoD14.Apolytikion2.text	O Micah inspired by God, you in the Spirit foresaw * the all-holy Church of Christ as a mountain indeed * revealed and observed by all. * Therefore those who within it * find eternal salvation * walk in the paths of the Lord, as you foretold, O Prophet, * and they reverently celebrate your solemn memory.
ltx/en_us_dedes/ho.ho15.m08:hoD14.Apolytikion2.title	@ltx/en_us_dedes/titles:ti.Prophet
ltx/en_us_dedes/ho.ho15.m08:hoD20.GeneralApolytikion1.name	Samuel
ltx/en_us_dedes/ho.ho15.m08:hoD21.GeneralApolytikion1.name	Thaddeus,
ltx/en_us_dedes/ho.ho15.m08:hoD24.GeneralApolytikion1.name	father Eutyches.
ltx/en_us_dedes/ho.ho15.m08:hoD25.Apolytikion2.greekmelody	@ltx/en_us_dedes/he.a.m5:heAU.TonSynanarchonLogon.greekname
ltx/en_us_dedes/ho.ho15.m08:hoD25.Apolytikion2.incipit	…
ltx/en_us_dedes/ho.ho15.m08:hoD25.Apolytikion2.melody	@ltx/en_us_dedes/he.a.m5:heAU.TonSynanarchonLogon.name
ltx/en_us_dedes/ho.ho15.m08:hoD25.Apolytikion2.mode	@ltx/en_us_dedes/miscellanea:misc.Mode5
ltx/en_us_dedes/ho.ho15.m08:hoD25.Apolytikion2.poet	
ltx/en_us_dedes/ho.ho15.m08:hoD25.Apolytikion2.text	
ltx/en_us_dedes/ho.ho15.m08:hoD25.Apolytikion2.title	For the Apostle Bartholomew.
ltx/en_us_dedes/ho.ho15.m08:hoD27.GeneralApolytikion1.name	
ltx/en_us_dedes/ho.ho15.m08:hoD28.GeneralApolytikion1.name	
