ltx/en_us_dedes/eo.e05:eo.Doxasticon.incipit	O how wise are Your judgments…
ltx/en_us_dedes/eo.e05:eo.Doxasticon.mode	@ltx/en_us_dedes/miscellanea:misc.Mode5
ltx/en_us_dedes/eo.e05:eo.Doxasticon.text	O how wise are Your judgments, O Christ! How was it that to Peter You granted to understand Your resurrection by the grave clothes alone, whereas to Luke and Cleopas You spoke as You walked with them, and in speaking did not immediately reveal yourself? And for this reason You were upbraided as the only visitor to Jerusalem who was unaware of what had happened there in those days. Then You, who arrange everything for the benefit of Your creature, interpreted the prophecies concerning You, and when You blessed the bread they recognized You. Even before this, their hearts were burning in recognition of You. Then to the Disciples, who were gathered together, at once they clearly proclaimed Your resurrection; by which have mercy on us.
ltx/en_us_dedes/eo.e05:eo.Exaposteilarion.greekmelody	@ltx/en_us_dedes/he.a.m2:heAU.ToisMathitaisSynelthomen.greekname
ltx/en_us_dedes/eo.e05:eo.Exaposteilarion.incipit	When Christ who is the life…
ltx/en_us_dedes/eo.e05:eo.Exaposteilarion.melody	@ltx/en_us_dedes/he.a.m2:heAU.ToisMathitaisSynelthomen.name
ltx/en_us_dedes/eo.e05:eo.Exaposteilarion.mode	@ltx/en_us_dedes/miscellanea:misc.Mode2
ltx/en_us_dedes/eo.e05:eo.Exaposteilarion.text	When Christ who is the life and way * had from the dead arisen, * He went with Luke and Cleopas, * who dining recognized Him * breaking the bread in Emmaus. * Their souls and hearts within them * were burning while He talked to them * on the road and interpreted unto them * in the scriptures all the things He had suffered. * With them cry out that He arose * and has appeared to Peter.
ltx/en_us_dedes/eo.e05:eo.Theotokion.incipit	I hymn Your inexhaustible…
ltx/en_us_dedes/eo.e05:eo.Theotokion.melody	@ltx/en_us_dedes/he.a.m2:heAU.ToisMathitaisSynelthomen.name
ltx/en_us_dedes/eo.e05:eo.Theotokion.mode	@ltx/en_us_dedes/miscellanea:misc.Mode2
ltx/en_us_dedes/eo.e05:eo.Theotokion.text	I hymn Your inexhaustible * mercy, O my Creator. * For You emptied yourself, O Lord, * to wear and save the nature * of mortals which had been injured. * And though God, You accepted * to become like me and to be born * from the pure Theotokos, and to descend * into Hades, wishing this way to save me, * O Master all-compassionate, * through the prayers of Your Mother.
ltx/en_us_dedes/eo.e05:eo.title	Eothinon 5.
