ltx/en_us_dedes/pe.d086:peDA.commemoration.full	
ltx/en_us_dedes/pe.d086:peDA.commemoration.short	Monday of the Third Week
ltx/en_us_dedes/pe.d086:peDA.dismissal	@ltx/en_us_dedes/dismissals:dis00.resurrection
ltx/en_us_dedes/pe.d086:peDA.insert1	
ltx/en_us_dedes/pe.d086:peDA.insert2	
ltx/en_us_dedes/pe.d086:peDA.note	
ltx/en_us_dedes/pe.d086:peHO.commemorations	
ltx/en_us_dedes/pe.d086:peHO.daytitle	
ltx/en_us_dedes/pe.d086:peHO.description1	
ltx/en_us_dedes/pe.d086:peHO.description2	
ltx/en_us_dedes/pe.d086:peHO.note1	
ltx/en_us_dedes/pe.d086:peHO.note2	
ltx/en_us_dedes/pe.d086:peMA.AposGlory.incipit	@ltx/en_us_dedes/oc.m2.d1:ocMA.Lauds5.incipit
ltx/en_us_dedes/pe.d086:peMA.AposGlory.melody	@ltx/en_us_dedes/miscellanea:misc.Idiomelon
ltx/en_us_dedes/pe.d086:peMA.AposGlory.mode	@ltx/en_us_dedes/miscellanea:misc.Mode2
ltx/en_us_dedes/pe.d086:peMA.AposGlory.text	@ltx/en_us_dedes/oc.m2.d1:ocMA.Lauds5.text
ltx/en_us_dedes/pe.d086:peMA.Aposticha1.greekmelody	@ltx/en_us_dedes/he.a.m6:heAU.TriimerosAnestis.greekname
ltx/en_us_dedes/pe.d086:peMA.Aposticha1.incipit	O people, like the Psalm…
ltx/en_us_dedes/pe.d086:peMA.Aposticha1.melody	@ltx/en_us_dedes/he.a.m6:heAU.TriimerosAnestis.name
ltx/en_us_dedes/pe.d086:peMA.Aposticha1.mode	@ltx/en_us_dedes/miscellanea:misc.Mode6
ltx/en_us_dedes/pe.d086:peMA.Aposticha1.text	O people, like the Psalm says, begin, * and joyfully sing praises to Christ. * The Life-giver * Christ has risen from the tomb * and shined on us this holy * great Passover and Pascha, * as the Redeemer of creation all.
ltx/en_us_dedes/pe.d086:peMA.Aposticha2.incipit	You said to the Myrrh-bearers…
ltx/en_us_dedes/pe.d086:peMA.Aposticha2.melody	@ltx/en_us_dedes/he.a.m6:heAU.TriimerosAnestis.name
ltx/en_us_dedes/pe.d086:peMA.Aposticha2.mode	@ltx/en_us_dedes/miscellanea:misc.Mode6
ltx/en_us_dedes/pe.d086:peMA.Aposticha2.text	You said to the Myrrh-bearers, Rejoice, * and thus undid the curse on Eve, * namely sorrow, * and instead you gave them joy. * Having risen, You sent Your * Disciples to announce Your * third-day arising from the sepulcher.
ltx/en_us_dedes/pe.d086:peMA.Aposticha3.incipit	Now Christ has shined the…
ltx/en_us_dedes/pe.d086:peMA.Aposticha3.melody	@ltx/en_us_dedes/he.a.m6:heAU.TriimerosAnestis.name
ltx/en_us_dedes/pe.d086:peMA.Aposticha3.mode	@ltx/en_us_dedes/miscellanea:misc.Mode6
ltx/en_us_dedes/pe.d086:peMA.Aposticha3.text	Now Christ has shined the light of His * divine and holy Passover * on us all. Come, * let our souls brilliantly shine. * Behold now has arisen * the day of holy Pascha. * Let us with joy and gladness celebrate.
ltx/en_us_dedes/pe.d086:peMA.Kathisma11.incipit	@ltx/en_us_dedes/oc.m2.d1:ocMA.Kathisma21.incipit
ltx/en_us_dedes/pe.d086:peMA.Kathisma11.melody	
ltx/en_us_dedes/pe.d086:peMA.Kathisma11.mode	@ltx/en_us_dedes/miscellanea:misc.Mode2
ltx/en_us_dedes/pe.d086:peMA.Kathisma11.text	@ltx/en_us_dedes/oc.m2.d1:ocMA.Kathisma21.text
ltx/en_us_dedes/pe.d086:peMA.Kathisma12.incipit	@ltx/en_us_dedes/oc.m2.d2:ocMA.Kathisma11.incipit
ltx/en_us_dedes/pe.d086:peMA.Kathisma12.melody	
ltx/en_us_dedes/pe.d086:peMA.Kathisma12.mode	@ltx/en_us_dedes/miscellanea:misc.Mode2
ltx/en_us_dedes/pe.d086:peMA.Kathisma12.text	@ltx/en_us_dedes/oc.m2.d2:ocMA.Kathisma11.text
ltx/en_us_dedes/pe.d086:peMA.Kathisma13.incipit	@ltx/en_us_dedes/oc.m2.d2:ocMA.Kathisma32.incipit
ltx/en_us_dedes/pe.d086:peMA.Kathisma13.melody	
ltx/en_us_dedes/pe.d086:peMA.Kathisma13.mode	@ltx/en_us_dedes/miscellanea:misc.Mode2
ltx/en_us_dedes/pe.d086:peMA.Kathisma13.text	@ltx/en_us_dedes/oc.m2.d2:ocMA.Kathisma32.text
ltx/en_us_dedes/pe.d086:peMA.Kathisma1T.incipit	@ltx/en_us_dedes/oc.m2.d2:ocMA.Kathisma13.incipit
ltx/en_us_dedes/pe.d086:peMA.Kathisma1T.melody	
ltx/en_us_dedes/pe.d086:peMA.Kathisma1T.mode	@ltx/en_us_dedes/miscellanea:misc.Mode2
ltx/en_us_dedes/pe.d086:peMA.Kathisma1T.text	@ltx/en_us_dedes/oc.m2.d2:ocMA.Kathisma13.text
ltx/en_us_dedes/pe.d086:peMA.Kathisma21.greekmelody	@ltx/en_us_dedes/pe.d085:peMA.Ode3Kathisma1.greekmelody
ltx/en_us_dedes/pe.d086:peMA.Kathisma21.incipit	@ltx/en_us_dedes/pe.d085:peMA.Ode3Kathisma1.incipit
ltx/en_us_dedes/pe.d086:peMA.Kathisma21.melody	@ltx/en_us_dedes/pe.d085:peMA.Ode3Kathisma1.melody
ltx/en_us_dedes/pe.d086:peMA.Kathisma21.mode	@ltx/en_us_dedes/miscellanea:misc.Mode2
ltx/en_us_dedes/pe.d086:peMA.Kathisma21.text	@ltx/en_us_dedes/pe.d085:peMA.Ode3Kathisma1.text
ltx/en_us_dedes/pe.d086:peMA.Lauds1.incipit	@ltx/en_us_dedes/oc.m2.d1:ocMA.Lauds1.incipit
ltx/en_us_dedes/pe.d086:peMA.Lauds1.melody	
ltx/en_us_dedes/pe.d086:peMA.Lauds1.mode	@ltx/en_us_dedes/miscellanea:misc.Mode2
ltx/en_us_dedes/pe.d086:peMA.Lauds1.text	@ltx/en_us_dedes/oc.m2.d1:ocMA.Lauds1.text
ltx/en_us_dedes/pe.d086:peMA.Lauds2.incipit	@ltx/en_us_dedes/oc.m2.d2:ocMA.Aposticha1.incipit
ltx/en_us_dedes/pe.d086:peMA.Lauds2.melody	
ltx/en_us_dedes/pe.d086:peMA.Lauds2.mode	@ltx/en_us_dedes/miscellanea:misc.Mode2
ltx/en_us_dedes/pe.d086:peMA.Lauds2.text	@ltx/en_us_dedes/oc.m2.d2:ocMA.Aposticha1.text
ltx/en_us_dedes/pe.d086:peMA.Lauds3.incipit	@ltx/en_us_dedes/oc.m2.d2:ocMA.Aposticha3.incipit
ltx/en_us_dedes/pe.d086:peMA.Lauds3.melody	
ltx/en_us_dedes/pe.d086:peMA.Lauds3.mode	@ltx/en_us_dedes/miscellanea:misc.Mode2
ltx/en_us_dedes/pe.d086:peMA.Lauds3.text	@ltx/en_us_dedes/oc.m2.d2:ocMA.Aposticha3.text
ltx/en_us_dedes/pe.d086:peMA.LaudsGlory.incipit	@ltx/en_us_dedes/pe.d085:peVE.Lity3.incipit
ltx/en_us_dedes/pe.d086:peMA.LaudsGlory.melody	@ltx/en_us_dedes/miscellanea:misc.Idiomelon
ltx/en_us_dedes/pe.d086:peMA.LaudsGlory.mode	@ltx/en_us_dedes/miscellanea:misc.Mode1
ltx/en_us_dedes/pe.d086:peMA.LaudsGlory.text	@ltx/en_us_dedes/pe.d085:peVE.Lity3.text
ltx/en_us_dedes/pe.d086:peVE.AposGlory.incipit	@ltx/en_us_dedes/pe.d085:peVE.Lity2.incipit
ltx/en_us_dedes/pe.d086:peVE.AposGlory.melody	@ltx/en_us_dedes/miscellanea:misc.Idiomelon
ltx/en_us_dedes/pe.d086:peVE.AposGlory.mode	@ltx/en_us_dedes/miscellanea:misc.Mode1
ltx/en_us_dedes/pe.d086:peVE.AposGlory.text	@ltx/en_us_dedes/pe.d085:peVE.Lity2.text
ltx/en_us_dedes/pe.d086:peVE.Aposticha1.incipit	@ltx/en_us_dedes/oc.m2.d1:ocVE.Stichera1.incipit
ltx/en_us_dedes/pe.d086:peVE.Aposticha1.melody	
ltx/en_us_dedes/pe.d086:peVE.Aposticha1.mode	@ltx/en_us_dedes/miscellanea:misc.Mode2
ltx/en_us_dedes/pe.d086:peVE.Aposticha1.text	@ltx/en_us_dedes/oc.m2.d1:ocVE.Stichera1.text
ltx/en_us_dedes/pe.d086:peVE.Aposticha2.incipit	@ltx/en_us_dedes/oc.m2.d2:ocVE.Aposticha1.incipit
ltx/en_us_dedes/pe.d086:peVE.Aposticha2.melody	
ltx/en_us_dedes/pe.d086:peVE.Aposticha2.mode	@ltx/en_us_dedes/miscellanea:misc.Mode2
ltx/en_us_dedes/pe.d086:peVE.Aposticha2.text	@ltx/en_us_dedes/oc.m2.d2:ocVE.Aposticha1.text
ltx/en_us_dedes/pe.d086:peVE.Aposticha3.incipit	@ltx/en_us_dedes/oc.m2.d2:ocVE.Aposticha3.incipit
ltx/en_us_dedes/pe.d086:peVE.Aposticha3.melody	
ltx/en_us_dedes/pe.d086:peVE.Aposticha3.mode	@ltx/en_us_dedes/miscellanea:misc.Mode2
ltx/en_us_dedes/pe.d086:peVE.Aposticha3.text	@ltx/en_us_dedes/oc.m2.d2:ocVE.Aposticha3.text
ltx/en_us_dedes/pe.d086:peVE.SticGlory.incipit	@ltx/en_us_dedes/pe.d085:peVE.Lity1.incipit
ltx/en_us_dedes/pe.d086:peVE.SticGlory.melody	@ltx/en_us_dedes/miscellanea:misc.Idiomelon
ltx/en_us_dedes/pe.d086:peVE.SticGlory.mode	@ltx/en_us_dedes/miscellanea:misc.Mode1
ltx/en_us_dedes/pe.d086:peVE.SticGlory.text	@ltx/en_us_dedes/pe.d085:peVE.Lity1.text
ltx/en_us_dedes/pe.d086:peVE.Stichera01.greekmelody	@ltx/en_us_dedes/he.a.m5:heAU.ChairoisAskitikon.greekname
ltx/en_us_dedes/pe.d086:peVE.Stichera01.incipit	Savior, nailed to the Cross…
ltx/en_us_dedes/pe.d086:peVE.Stichera01.melody	@ltx/en_us_dedes/he.a.m5:heAU.ChairoisAskitikon.name
ltx/en_us_dedes/pe.d086:peVE.Stichera01.mode	@ltx/en_us_dedes/miscellanea:misc.Mode5
ltx/en_us_dedes/pe.d086:peVE.Stichera01.text	Savior, nailed to the Cross, you erased * the curse incurred at the tree through another tree. * You died and were truly buried, and by your power as God * resurrected those who from all time had died. * We sing out and glorify Your dominion with sacred hymns. * You are the brightness of the Father, our very life, * O almighty Jesus, our Pascha and Passover. * Therefore the heavens now exult together with us on earth, * singing the hymns of Your triumph, triumphant Logos and Word of God, * O Christ, and the Ruler * over all, who is bestowing great mercy on the world.
ltx/en_us_dedes/pe.d086:peVE.Stichera02.incipit	“Say now, has Life gone…
ltx/en_us_dedes/pe.d086:peVE.Stichera02.melody	@ltx/en_us_dedes/he.a.m5:heAU.ChairoisAskitikon.name
ltx/en_us_dedes/pe.d086:peVE.Stichera02.mode	@ltx/en_us_dedes/miscellanea:misc.Mode5
ltx/en_us_dedes/pe.d086:peVE.Stichera02.text	“Say now, has Life gone down to the dead? * Is He, the never-setting Sun, still beneath the earth, * below in the nether regions?” So did the Myrrh-bearers speak, * as they mourned and cried out, “Come and let us go * with haste to His holy tomb, so that we might observe again.” * And on arriving, they beheld in the sepulcher * a resplendent Angel, and they were very amazed. * He changed their mourning and lament to joy when he said to them, * “O pious women, the Giver of Life has risen! Be not afraid. * And He reigns forever, as the Lord who is bestowing great mercy on the world.”
ltx/en_us_dedes/pe.d086:peVE.Stichera03.incipit	Early on Sunday morning, the…
ltx/en_us_dedes/pe.d086:peVE.Stichera03.melody	@ltx/en_us_dedes/he.a.m5:heAU.ChairoisAskitikon.name
ltx/en_us_dedes/pe.d086:peVE.Stichera03.mode	@ltx/en_us_dedes/miscellanea:misc.Mode5
ltx/en_us_dedes/pe.d086:peVE.Stichera03.text	Early on Sunday morning, the host * of pious women sought the Sun, who before the sun * existed, and who had now set within the tomb. And they heard * the resplendent Angel say, “Arisen is * the Light that went down and shined on the dead who in darkness slept. * To the Disciples go announce and proclaim to them. * Put away your grief and replace it with utter joy. * Joyfully celebrate in hearts unwavering that indeed * the world is granted salvation, this joyous Pascha and Passover. * For Christ has arisen, as the Lord who is bestowing great mercy on the world.”
