ltx/en_us_dedes/tr.d032:trCO.header	(Great)
ltx/en_us_dedes/tr.d032:trDA.commemoration.full	
ltx/en_us_dedes/tr.d032:trDA.commemoration.short	Wednesday of the Second Week
ltx/en_us_dedes/tr.d032:trDA.insert1	
ltx/en_us_dedes/tr.d032:trDA.insert2	
ltx/en_us_dedes/tr.d032:trDA.note	
ltx/en_us_dedes/tr.d032:trDA.title	
ltx/en_us_dedes/tr.d032:trHO.commemorations	
ltx/en_us_dedes/tr.d032:trHO.daytitle	
ltx/en_us_dedes/tr.d032:trHO.description1	
ltx/en_us_dedes/tr.d032:trHO.description2	
ltx/en_us_dedes/tr.d032:trHO.note1	
ltx/en_us_dedes/tr.d032:trHO.note2	
ltx/en_us_dedes/tr.d032:trMA.AposIdiomelon1.incipit	…
ltx/en_us_dedes/tr.d032:trMA.AposIdiomelon1.melody	@ltx/en_us_dedes/miscellanea:misc.Idiomelon
ltx/en_us_dedes/tr.d032:trMA.AposIdiomelon1.mode	@ltx/en_us_dedes/miscellanea:misc.Mode7
ltx/en_us_dedes/tr.d032:trMA.AposIdiomelon1.text	
ltx/en_us_dedes/tr.d032:trMA.AposMartyric.greekmelody	@ltx/en_us_dedes/he.a.m7:heAU.OukEtiKolyometha.greekname
ltx/en_us_dedes/tr.d032:trMA.AposMartyric.incipit	@ltx/en_us_dedes/oc.m7.d4:ocMA.Aposticha3.incipit
ltx/en_us_dedes/tr.d032:trMA.AposMartyric.melody	@ltx/en_us_dedes/he.a.m7:heAU.OukEtiKolyometha.name
ltx/en_us_dedes/tr.d032:trMA.AposMartyric.mode	@ltx/en_us_dedes/miscellanea:misc.Mode7
ltx/en_us_dedes/tr.d032:trMA.AposMartyric.text	@ltx/en_us_dedes/oc.m7.d4:ocMA.Aposticha3.text
ltx/en_us_dedes/tr.d032:trMA.AposTheotokion.greekmelody	@ltx/en_us_dedes/he.a.m7:heAU.OukEtiKolyometha.greekname
ltx/en_us_dedes/tr.d032:trMA.AposTheotokion.incipit	@ltx/en_us_dedes/oc.m7.d4:ocVE.SticTheotokion.incipit
ltx/en_us_dedes/tr.d032:trMA.AposTheotokion.melody	@ltx/en_us_dedes/he.a.m7:heAU.OukEtiKolyometha.name
ltx/en_us_dedes/tr.d032:trMA.AposTheotokion.mode	@ltx/en_us_dedes/miscellanea:misc.Mode7
ltx/en_us_dedes/tr.d032:trMA.AposTheotokion.text	@ltx/en_us_dedes/oc.m7.d4:ocVE.SticTheotokion.text
ltx/en_us_dedes/tr.d032:trMA.C1.poet	@ltx/en_us_dedes/poets:po.Iosif
ltx/en_us_dedes/tr.d032:trMA.C2.poet	@ltx/en_us_dedes/poets:po.Theodorou
ltx/en_us_dedes/tr.d032:trMA.Kathisma21.greekmelody	@ltx/en_us_dedes/he.a.m1:heAU.TonTafonSouSotir.greekname
ltx/en_us_dedes/tr.d032:trMA.Kathisma21.incipit	…
ltx/en_us_dedes/tr.d032:trMA.Kathisma21.melody	@ltx/en_us_dedes/he.a.m1:heAU.TonTafonSouSotir.name
ltx/en_us_dedes/tr.d032:trMA.Kathisma21.mode	@ltx/en_us_dedes/miscellanea:misc.Mode1
ltx/en_us_dedes/tr.d032:trMA.Kathisma21.text	
ltx/en_us_dedes/tr.d032:trMA.Kathisma22.greekmelody	@ltx/en_us_dedes/he.a.m1:heAU.TonTafonSouSotir.greekname
ltx/en_us_dedes/tr.d032:trMA.Kathisma22.incipit	…
ltx/en_us_dedes/tr.d032:trMA.Kathisma22.melody	@ltx/en_us_dedes/he.a.m1:heAU.TonTafonSouSotir.name
ltx/en_us_dedes/tr.d032:trMA.Kathisma22.mode	@ltx/en_us_dedes/miscellanea:misc.Mode1
ltx/en_us_dedes/tr.d032:trMA.Kathisma22.text	
ltx/en_us_dedes/tr.d032:trMA.Kathisma31.greekmelody	@ltx/en_us_dedes/he.a.m3:heAU.TinOraiotita.greekname
ltx/en_us_dedes/tr.d032:trMA.Kathisma31.incipit	…
ltx/en_us_dedes/tr.d032:trMA.Kathisma31.melody	@ltx/en_us_dedes/he.a.m3:heAU.TinOraiotita.name
ltx/en_us_dedes/tr.d032:trMA.Kathisma31.mode	@ltx/en_us_dedes/miscellanea:misc.Mode3
ltx/en_us_dedes/tr.d032:trMA.Kathisma31.text	
ltx/en_us_dedes/tr.d032:trMA.Kathisma32.greekmelody	@ltx/en_us_dedes/he.a.m3:heAU.TinOraiotita.greekname
ltx/en_us_dedes/tr.d032:trMA.Kathisma32.incipit	@ltx/en_us_dedes/me.m06.d16:meMA.Ode3KathismaSt.incipit
ltx/en_us_dedes/tr.d032:trMA.Kathisma32.melody	@ltx/en_us_dedes/he.a.m3:heAU.TinOraiotita.name
ltx/en_us_dedes/tr.d032:trMA.Kathisma32.mode	@ltx/en_us_dedes/miscellanea:misc.Mode3
ltx/en_us_dedes/tr.d032:trMA.Kathisma32.text	@ltx/en_us_dedes/me.m06.d16:meMA.Ode3KathismaSt.text
ltx/en_us_dedes/tr.d032:trMA.Ode3C11.greekmelody	@ltx/en_us_dedes/he.h.m1:heHE.StereothitoIKardiaMou.greekname
ltx/en_us_dedes/tr.d032:trMA.Ode3C11.incipit	…
ltx/en_us_dedes/tr.d032:trMA.Ode3C11.melody	@ltx/en_us_dedes/he.h.m1:heHE.StereothitoIKardiaMou.name
ltx/en_us_dedes/tr.d032:trMA.Ode3C11.mode	@ltx/en_us_dedes/miscellanea:misc.Mode1
ltx/en_us_dedes/tr.d032:trMA.Ode3C11.ode	@ltx/en_us_dedes/miscellanea:misc.Ode3
ltx/en_us_dedes/tr.d032:trMA.Ode3C11.text	
ltx/en_us_dedes/tr.d032:trMA.Ode3C12.incipit	…
ltx/en_us_dedes/tr.d032:trMA.Ode3C12.melody	@ltx/en_us_dedes/he.h.m1:heHE.StereothitoIKardiaMou.name
ltx/en_us_dedes/tr.d032:trMA.Ode3C12.mode	@ltx/en_us_dedes/miscellanea:misc.Mode1
ltx/en_us_dedes/tr.d032:trMA.Ode3C12.ode	@ltx/en_us_dedes/miscellanea:misc.Ode3
ltx/en_us_dedes/tr.d032:trMA.Ode3C12.text	
ltx/en_us_dedes/tr.d032:trMA.Ode3C13.incipit	…
ltx/en_us_dedes/tr.d032:trMA.Ode3C13.melody	@ltx/en_us_dedes/he.h.m1:heHE.StereothitoIKardiaMou.name
ltx/en_us_dedes/tr.d032:trMA.Ode3C13.mode	@ltx/en_us_dedes/miscellanea:misc.Mode1
ltx/en_us_dedes/tr.d032:trMA.Ode3C13.ode	@ltx/en_us_dedes/miscellanea:misc.Ode3
ltx/en_us_dedes/tr.d032:trMA.Ode3C13.text	
ltx/en_us_dedes/tr.d032:trMA.Ode3C1T.incipit	…
ltx/en_us_dedes/tr.d032:trMA.Ode3C1T.melody	@ltx/en_us_dedes/he.h.m1:heHE.StereothitoIKardiaMou.name
ltx/en_us_dedes/tr.d032:trMA.Ode3C1T.mode	@ltx/en_us_dedes/miscellanea:misc.Mode1
ltx/en_us_dedes/tr.d032:trMA.Ode3C1T.ode	@ltx/en_us_dedes/miscellanea:misc.Ode3
ltx/en_us_dedes/tr.d032:trMA.Ode3C1T.text	
ltx/en_us_dedes/tr.d032:trMA.Ode3C21.greekmelody	@ltx/en_us_dedes/he.h.m3:heHE.StereosonKyrie.greekname
ltx/en_us_dedes/tr.d032:trMA.Ode3C21.incipit	…
ltx/en_us_dedes/tr.d032:trMA.Ode3C21.melody	@ltx/en_us_dedes/he.h.m3:heHE.StereosonKyrie.name
ltx/en_us_dedes/tr.d032:trMA.Ode3C21.mode	@ltx/en_us_dedes/miscellanea:misc.Mode3
ltx/en_us_dedes/tr.d032:trMA.Ode3C21.ode	@ltx/en_us_dedes/miscellanea:misc.Ode3
ltx/en_us_dedes/tr.d032:trMA.Ode3C21.text	
ltx/en_us_dedes/tr.d032:trMA.Ode3C22.incipit	…
ltx/en_us_dedes/tr.d032:trMA.Ode3C22.melody	@ltx/en_us_dedes/he.h.m3:heHE.StereosonKyrie.name
ltx/en_us_dedes/tr.d032:trMA.Ode3C22.mode	@ltx/en_us_dedes/miscellanea:misc.Mode3
ltx/en_us_dedes/tr.d032:trMA.Ode3C22.ode	@ltx/en_us_dedes/miscellanea:misc.Ode3
ltx/en_us_dedes/tr.d032:trMA.Ode3C22.text	
ltx/en_us_dedes/tr.d032:trMA.Ode3C2A1.incipit	…
ltx/en_us_dedes/tr.d032:trMA.Ode3C2A1.melody	@ltx/en_us_dedes/he.h.m3:heHE.StereosonKyrie.name
ltx/en_us_dedes/tr.d032:trMA.Ode3C2A1.mode	@ltx/en_us_dedes/miscellanea:misc.Mode3
ltx/en_us_dedes/tr.d032:trMA.Ode3C2A1.ode	@ltx/en_us_dedes/miscellanea:misc.Ode3
ltx/en_us_dedes/tr.d032:trMA.Ode3C2A1.text	
ltx/en_us_dedes/tr.d032:trMA.Ode3C2H.greekmelody	@ltx/en_us_dedes/he.h.m3:heHE.StereosonKyrie.greekname
ltx/en_us_dedes/tr.d032:trMA.Ode3C2H.incipit	@ltx/en_us_dedes/he.h.m3:heHE.StereosonKyrie.incipit
ltx/en_us_dedes/tr.d032:trMA.Ode3C2H.melody	@ltx/en_us_dedes/he.h.m3:heHE.StereosonKyrie.melody
ltx/en_us_dedes/tr.d032:trMA.Ode3C2H.mode	@ltx/en_us_dedes/miscellanea:misc.Mode3
ltx/en_us_dedes/tr.d032:trMA.Ode3C2H.ode	@ltx/en_us_dedes/miscellanea:misc.Ode3
ltx/en_us_dedes/tr.d032:trMA.Ode3C2H.text	@ltx/en_us_dedes/he.h.m3:heHE.StereosonKyrie.text
ltx/en_us_dedes/tr.d032:trMA.Ode3C2T.incipit	…
ltx/en_us_dedes/tr.d032:trMA.Ode3C2T.melody	@ltx/en_us_dedes/he.h.m3:heHE.StereosonKyrie.name
ltx/en_us_dedes/tr.d032:trMA.Ode3C2T.mode	@ltx/en_us_dedes/miscellanea:misc.Mode3
ltx/en_us_dedes/tr.d032:trMA.Ode3C2T.ode	@ltx/en_us_dedes/miscellanea:misc.Ode3
ltx/en_us_dedes/tr.d032:trMA.Ode3C2T.text	
ltx/en_us_dedes/tr.d032:trMA.Ode3C2Tr.incipit	…
ltx/en_us_dedes/tr.d032:trMA.Ode3C2Tr.melody	@ltx/en_us_dedes/he.h.m3:heHE.StereosonKyrie.name
ltx/en_us_dedes/tr.d032:trMA.Ode3C2Tr.mode	@ltx/en_us_dedes/miscellanea:misc.Mode3
ltx/en_us_dedes/tr.d032:trMA.Ode3C2Tr.ode	@ltx/en_us_dedes/miscellanea:misc.Ode3
ltx/en_us_dedes/tr.d032:trMA.Ode3C2Tr.text	
ltx/en_us_dedes/tr.d032:trMA.Ode8C11.greekmelody	@ltx/en_us_dedes/he.h.m1:heHE.TonTousYmnologousEnKamino.greekname
ltx/en_us_dedes/tr.d032:trMA.Ode8C11.incipit	…
ltx/en_us_dedes/tr.d032:trMA.Ode8C11.melody	@ltx/en_us_dedes/he.h.m1:heHE.TonTousYmnologousEnKamino.name
ltx/en_us_dedes/tr.d032:trMA.Ode8C11.mode	@ltx/en_us_dedes/miscellanea:misc.Mode1
ltx/en_us_dedes/tr.d032:trMA.Ode8C11.ode	@ltx/en_us_dedes/miscellanea:misc.Ode8
ltx/en_us_dedes/tr.d032:trMA.Ode8C11.text	
ltx/en_us_dedes/tr.d032:trMA.Ode8C12.incipit	…
ltx/en_us_dedes/tr.d032:trMA.Ode8C12.melody	@ltx/en_us_dedes/he.h.m1:heHE.TonTousYmnologousEnKamino.name
ltx/en_us_dedes/tr.d032:trMA.Ode8C12.mode	@ltx/en_us_dedes/miscellanea:misc.Mode1
ltx/en_us_dedes/tr.d032:trMA.Ode8C12.ode	@ltx/en_us_dedes/miscellanea:misc.Ode8
ltx/en_us_dedes/tr.d032:trMA.Ode8C12.text	
ltx/en_us_dedes/tr.d032:trMA.Ode8C13.incipit	…
ltx/en_us_dedes/tr.d032:trMA.Ode8C13.melody	@ltx/en_us_dedes/he.h.m1:heHE.TonTousYmnologousEnKamino.name
ltx/en_us_dedes/tr.d032:trMA.Ode8C13.mode	@ltx/en_us_dedes/miscellanea:misc.Mode1
ltx/en_us_dedes/tr.d032:trMA.Ode8C13.ode	@ltx/en_us_dedes/miscellanea:misc.Ode8
ltx/en_us_dedes/tr.d032:trMA.Ode8C13.text	
ltx/en_us_dedes/tr.d032:trMA.Ode8C1T.incipit	…
ltx/en_us_dedes/tr.d032:trMA.Ode8C1T.melody	@ltx/en_us_dedes/he.h.m1:heHE.TonTousYmnologousEnKamino.name
ltx/en_us_dedes/tr.d032:trMA.Ode8C1T.mode	@ltx/en_us_dedes/miscellanea:misc.Mode1
ltx/en_us_dedes/tr.d032:trMA.Ode8C1T.ode	@ltx/en_us_dedes/miscellanea:misc.Ode8
ltx/en_us_dedes/tr.d032:trMA.Ode8C1T.text	
ltx/en_us_dedes/tr.d032:trMA.Ode8C21.greekmelody	@ltx/en_us_dedes/he.h.m3:heHE.TonEnFlogi.greekname
ltx/en_us_dedes/tr.d032:trMA.Ode8C21.incipit	…
ltx/en_us_dedes/tr.d032:trMA.Ode8C21.melody	@ltx/en_us_dedes/he.h.m3:heHE.TonEnFlogi.name
ltx/en_us_dedes/tr.d032:trMA.Ode8C21.mode	@ltx/en_us_dedes/miscellanea:misc.Mode3
ltx/en_us_dedes/tr.d032:trMA.Ode8C21.ode	@ltx/en_us_dedes/miscellanea:misc.Ode8
ltx/en_us_dedes/tr.d032:trMA.Ode8C21.text	
ltx/en_us_dedes/tr.d032:trMA.Ode8C22.incipit	…
ltx/en_us_dedes/tr.d032:trMA.Ode8C22.melody	@ltx/en_us_dedes/he.h.m3:heHE.TonEnFlogi.name
ltx/en_us_dedes/tr.d032:trMA.Ode8C22.mode	@ltx/en_us_dedes/miscellanea:misc.Mode3
ltx/en_us_dedes/tr.d032:trMA.Ode8C22.ode	@ltx/en_us_dedes/miscellanea:misc.Ode8
ltx/en_us_dedes/tr.d032:trMA.Ode8C22.text	
ltx/en_us_dedes/tr.d032:trMA.Ode8C2A1.incipit	…
ltx/en_us_dedes/tr.d032:trMA.Ode8C2A1.melody	@ltx/en_us_dedes/he.h.m3:heHE.TonEnFlogi.name
ltx/en_us_dedes/tr.d032:trMA.Ode8C2A1.mode	@ltx/en_us_dedes/miscellanea:misc.Mode3
ltx/en_us_dedes/tr.d032:trMA.Ode8C2A1.ode	@ltx/en_us_dedes/miscellanea:misc.Ode8
ltx/en_us_dedes/tr.d032:trMA.Ode8C2A1.text	
ltx/en_us_dedes/tr.d032:trMA.Ode8C2H.greekmelody	@ltx/en_us_dedes/he.h.m3:heHE.TonEnFlogi.greekname
ltx/en_us_dedes/tr.d032:trMA.Ode8C2H.incipit	@ltx/en_us_dedes/he.h.m3:heHE.TonEnFlogi.incipit
ltx/en_us_dedes/tr.d032:trMA.Ode8C2H.melody	@ltx/en_us_dedes/he.h.m3:heHE.TonEnFlogi.melody
ltx/en_us_dedes/tr.d032:trMA.Ode8C2H.mode	@ltx/en_us_dedes/miscellanea:misc.Mode3
ltx/en_us_dedes/tr.d032:trMA.Ode8C2H.ode	@ltx/en_us_dedes/miscellanea:misc.Ode8
ltx/en_us_dedes/tr.d032:trMA.Ode8C2H.text	@ltx/en_us_dedes/he.h.m3:heHE.TonEnFlogi.text
ltx/en_us_dedes/tr.d032:trMA.Ode8C2T.incipit	…
ltx/en_us_dedes/tr.d032:trMA.Ode8C2T.melody	@ltx/en_us_dedes/he.h.m3:heHE.TonEnFlogi.name
ltx/en_us_dedes/tr.d032:trMA.Ode8C2T.mode	@ltx/en_us_dedes/miscellanea:misc.Mode3
ltx/en_us_dedes/tr.d032:trMA.Ode8C2T.ode	@ltx/en_us_dedes/miscellanea:misc.Ode8
ltx/en_us_dedes/tr.d032:trMA.Ode8C2T.text	
ltx/en_us_dedes/tr.d032:trMA.Ode8C2Tr.incipit	…
ltx/en_us_dedes/tr.d032:trMA.Ode8C2Tr.melody	@ltx/en_us_dedes/he.h.m3:heHE.TonEnFlogi.name
ltx/en_us_dedes/tr.d032:trMA.Ode8C2Tr.mode	@ltx/en_us_dedes/miscellanea:misc.Mode3
ltx/en_us_dedes/tr.d032:trMA.Ode8C2Tr.ode	@ltx/en_us_dedes/miscellanea:misc.Ode8
ltx/en_us_dedes/tr.d032:trMA.Ode8C2Tr.text	
ltx/en_us_dedes/tr.d032:trMA.Ode9C11.greekmelody	@ltx/en_us_dedes/he.h.m1:heHE.TinZoodochonPigin.greekname
ltx/en_us_dedes/tr.d032:trMA.Ode9C11.incipit	…
ltx/en_us_dedes/tr.d032:trMA.Ode9C11.melody	@ltx/en_us_dedes/he.h.m1:heHE.TinZoodochonPigin.name
ltx/en_us_dedes/tr.d032:trMA.Ode9C11.mode	@ltx/en_us_dedes/miscellanea:misc.Mode1
ltx/en_us_dedes/tr.d032:trMA.Ode9C11.ode	@ltx/en_us_dedes/miscellanea:misc.Ode9
ltx/en_us_dedes/tr.d032:trMA.Ode9C11.text	
ltx/en_us_dedes/tr.d032:trMA.Ode9C12.incipit	…
ltx/en_us_dedes/tr.d032:trMA.Ode9C12.melody	@ltx/en_us_dedes/he.h.m1:heHE.TinZoodochonPigin.name
ltx/en_us_dedes/tr.d032:trMA.Ode9C12.mode	@ltx/en_us_dedes/miscellanea:misc.Mode1
ltx/en_us_dedes/tr.d032:trMA.Ode9C12.ode	@ltx/en_us_dedes/miscellanea:misc.Ode9
ltx/en_us_dedes/tr.d032:trMA.Ode9C12.text	
ltx/en_us_dedes/tr.d032:trMA.Ode9C13.incipit	…
ltx/en_us_dedes/tr.d032:trMA.Ode9C13.melody	@ltx/en_us_dedes/he.h.m1:heHE.TinZoodochonPigin.name
ltx/en_us_dedes/tr.d032:trMA.Ode9C13.mode	@ltx/en_us_dedes/miscellanea:misc.Mode1
ltx/en_us_dedes/tr.d032:trMA.Ode9C13.ode	@ltx/en_us_dedes/miscellanea:misc.Ode9
ltx/en_us_dedes/tr.d032:trMA.Ode9C13.text	
ltx/en_us_dedes/tr.d032:trMA.Ode9C1T.incipit	…
ltx/en_us_dedes/tr.d032:trMA.Ode9C1T.melody	@ltx/en_us_dedes/he.h.m1:heHE.TinZoodochonPigin.name
ltx/en_us_dedes/tr.d032:trMA.Ode9C1T.mode	@ltx/en_us_dedes/miscellanea:misc.Mode1
ltx/en_us_dedes/tr.d032:trMA.Ode9C1T.ode	@ltx/en_us_dedes/miscellanea:misc.Ode9
ltx/en_us_dedes/tr.d032:trMA.Ode9C1T.text	
ltx/en_us_dedes/tr.d032:trMA.Ode9C21.greekmelody	@ltx/en_us_dedes/he.h.m3:heHE.EnSinaioToOrei.greekname
ltx/en_us_dedes/tr.d032:trMA.Ode9C21.incipit	…
ltx/en_us_dedes/tr.d032:trMA.Ode9C21.melody	@ltx/en_us_dedes/he.h.m3:heHE.EnSinaioToOrei.name
ltx/en_us_dedes/tr.d032:trMA.Ode9C21.mode	@ltx/en_us_dedes/miscellanea:misc.Mode3
ltx/en_us_dedes/tr.d032:trMA.Ode9C21.ode	@ltx/en_us_dedes/miscellanea:misc.Ode9
ltx/en_us_dedes/tr.d032:trMA.Ode9C21.text	
ltx/en_us_dedes/tr.d032:trMA.Ode9C22.incipit	…
ltx/en_us_dedes/tr.d032:trMA.Ode9C22.melody	@ltx/en_us_dedes/he.h.m3:heHE.EnSinaioToOrei.name
ltx/en_us_dedes/tr.d032:trMA.Ode9C22.mode	@ltx/en_us_dedes/miscellanea:misc.Mode3
ltx/en_us_dedes/tr.d032:trMA.Ode9C22.ode	@ltx/en_us_dedes/miscellanea:misc.Ode9
ltx/en_us_dedes/tr.d032:trMA.Ode9C22.text	
ltx/en_us_dedes/tr.d032:trMA.Ode9C2A1.incipit	…
ltx/en_us_dedes/tr.d032:trMA.Ode9C2A1.melody	@ltx/en_us_dedes/he.h.m3:heHE.EnSinaioToOrei.name
ltx/en_us_dedes/tr.d032:trMA.Ode9C2A1.mode	@ltx/en_us_dedes/miscellanea:misc.Mode3
ltx/en_us_dedes/tr.d032:trMA.Ode9C2A1.ode	@ltx/en_us_dedes/miscellanea:misc.Ode9
ltx/en_us_dedes/tr.d032:trMA.Ode9C2A1.text	
ltx/en_us_dedes/tr.d032:trMA.Ode9C2H.greekmelody	@ltx/en_us_dedes/he.h.m3:heHE.EnSinaioToOrei.greekname
ltx/en_us_dedes/tr.d032:trMA.Ode9C2H.incipit	@ltx/en_us_dedes/he.h.m3:heHE.EnSinaioToOrei.incipit
ltx/en_us_dedes/tr.d032:trMA.Ode9C2H.melody	@ltx/en_us_dedes/he.h.m3:heHE.EnSinaioToOrei.melody
ltx/en_us_dedes/tr.d032:trMA.Ode9C2H.mode	@ltx/en_us_dedes/miscellanea:misc.Mode3
ltx/en_us_dedes/tr.d032:trMA.Ode9C2H.ode	@ltx/en_us_dedes/miscellanea:misc.Ode9
ltx/en_us_dedes/tr.d032:trMA.Ode9C2H.text	@ltx/en_us_dedes/he.h.m3:heHE.EnSinaioToOrei.text
ltx/en_us_dedes/tr.d032:trMA.Ode9C2T.incipit	…
ltx/en_us_dedes/tr.d032:trMA.Ode9C2T.melody	@ltx/en_us_dedes/he.h.m3:heHE.EnSinaioToOrei.name
ltx/en_us_dedes/tr.d032:trMA.Ode9C2T.mode	@ltx/en_us_dedes/miscellanea:misc.Mode3
ltx/en_us_dedes/tr.d032:trMA.Ode9C2T.ode	@ltx/en_us_dedes/miscellanea:misc.Ode9
ltx/en_us_dedes/tr.d032:trMA.Ode9C2T.text	
ltx/en_us_dedes/tr.d032:trMA.Ode9C2Tr.incipit	…
ltx/en_us_dedes/tr.d032:trMA.Ode9C2Tr.melody	@ltx/en_us_dedes/he.h.m3:heHE.EnSinaioToOrei.name
ltx/en_us_dedes/tr.d032:trMA.Ode9C2Tr.mode	@ltx/en_us_dedes/miscellanea:misc.Mode3
ltx/en_us_dedes/tr.d032:trMA.Ode9C2Tr.ode	@ltx/en_us_dedes/miscellanea:misc.Ode9
ltx/en_us_dedes/tr.d032:trMA.Ode9C2Tr.text	
ltx/en_us_dedes/tr.d032:trTE.Troparion.incipit	…
ltx/en_us_dedes/tr.d032:trTE.Troparion.melody	
ltx/en_us_dedes/tr.d032:trTE.Troparion.mode	@ltx/en_us_dedes/miscellanea:misc.Mode6
ltx/en_us_dedes/tr.d032:trTE.Troparion.text	
ltx/en_us_dedes/tr.d032:trVE.AposIdiomelon1.incipit	…
ltx/en_us_dedes/tr.d032:trVE.AposIdiomelon1.melody	@ltx/en_us_dedes/miscellanea:misc.Idiomelon
ltx/en_us_dedes/tr.d032:trVE.AposIdiomelon1.mode	@ltx/en_us_dedes/miscellanea:misc.Mode3
ltx/en_us_dedes/tr.d032:trVE.AposIdiomelon1.text	
ltx/en_us_dedes/tr.d032:trVE.AposMartyric.incipit	@ltx/en_us_dedes/oc.m3.d4:ocVE.Aposticha3.incipit
ltx/en_us_dedes/tr.d032:trVE.AposMartyric.melody	
ltx/en_us_dedes/tr.d032:trVE.AposMartyric.mode	@ltx/en_us_dedes/miscellanea:misc.Mode3
ltx/en_us_dedes/tr.d032:trVE.AposMartyric.text	@ltx/en_us_dedes/oc.m3.d4:ocVE.Aposticha3.text
ltx/en_us_dedes/tr.d032:trVE.AposTheotokion.greekmelody	@ltx/en_us_dedes/he.a.m3:heAU.MegaliTouStavrouSou.greekname
ltx/en_us_dedes/tr.d032:trVE.AposTheotokion.incipit	@ltx/en_us_dedes/oc.m3.d6:ocVE.SticTheotokion.incipit
ltx/en_us_dedes/tr.d032:trVE.AposTheotokion.melody	@ltx/en_us_dedes/he.a.m3:heAU.MegaliTouStavrouSou.name
ltx/en_us_dedes/tr.d032:trVE.AposTheotokion.mode	@ltx/en_us_dedes/miscellanea:misc.Mode3
ltx/en_us_dedes/tr.d032:trVE.AposTheotokion.text	@ltx/en_us_dedes/oc.m3.d6:ocVE.SticTheotokion.text
ltx/en_us_dedes/tr.d032:trVE.Stichera01.greekmelody	@ltx/en_us_dedes/he.a.m1:heAU.PaneffimoiMartyres.greekname
ltx/en_us_dedes/tr.d032:trVE.Stichera01.incipit	…
ltx/en_us_dedes/tr.d032:trVE.Stichera01.melody	@ltx/en_us_dedes/he.a.m1:heAU.PaneffimoiMartyres.name
ltx/en_us_dedes/tr.d032:trVE.Stichera01.mode	@ltx/en_us_dedes/miscellanea:misc.Mode1
ltx/en_us_dedes/tr.d032:trVE.Stichera01.poet	@ltx/en_us_dedes/poets:po.Iosif
ltx/en_us_dedes/tr.d032:trVE.Stichera01.text	
ltx/en_us_dedes/tr.d032:trVE.Stichera02.greekmelody	@ltx/en_us_dedes/he.a.m1:heAU.PaneffimoiMartyres.greekname
ltx/en_us_dedes/tr.d032:trVE.Stichera02.incipit	…
ltx/en_us_dedes/tr.d032:trVE.Stichera02.melody	@ltx/en_us_dedes/he.a.m1:heAU.PaneffimoiMartyres.name
ltx/en_us_dedes/tr.d032:trVE.Stichera02.mode	@ltx/en_us_dedes/miscellanea:misc.Mode1
ltx/en_us_dedes/tr.d032:trVE.Stichera02.text	
ltx/en_us_dedes/tr.d032:trVE.Stichera03.incipit	…
ltx/en_us_dedes/tr.d032:trVE.Stichera03.melody	
ltx/en_us_dedes/tr.d032:trVE.Stichera03.mode	@ltx/en_us_dedes/miscellanea:misc.Mode3
ltx/en_us_dedes/tr.d032:trVE.Stichera03.poet	@ltx/en_us_dedes/poets:po.Theodorou
ltx/en_us_dedes/tr.d032:trVE.Stichera03.text	
