ltx/en_us_dedes/sy.m06.d07:cl.syMA.commemoration01.text	[saint/com 1]
ltx/en_us_dedes/sy.m06.d07:cl.syMA.commemoration02.text	[saint/com 2]
ltx/en_us_dedes/sy.m06.d07:cl.syMA.commemoration03.text	[saint/com 3]
ltx/en_us_dedes/sy.m06.d07:cl.syMA.commemoration04.text	[saint/com 4]
ltx/en_us_dedes/sy.m06.d07:cl.syMA.commemoration05.text	[saint/com 5]
ltx/en_us_dedes/sy.m06.d07:cl.syMA.commemoration06.text	[saint/com list]
ltx/en_us_dedes/sy.m06.d07:syMA.commemoration01.couplet1.title	@ltx/en_us_dedes/titles:ti.Verses
ltx/en_us_dedes/sy.m06.d07:syMA.commemoration01.couplet1.verse1	
ltx/en_us_dedes/sy.m06.d07:syMA.commemoration01.couplet1.verse2	
ltx/en_us_dedes/sy.m06.d07:syMA.commemoration01.narration.p01	
ltx/en_us_dedes/sy.m06.d07:syMA.commemoration01.single1	
ltx/en_us_dedes/sy.m06.d07:syMA.commemoration01.text	On June 7 we commemorate the holy Hieromartyr Theodotos of Ankyra.
ltx/en_us_dedes/sy.m06.d07:syMA.commemoration02.couplet1.title	@ltx/en_us_dedes/titles:ti.Verses
ltx/en_us_dedes/sy.m06.d07:syMA.commemoration02.couplet1.verse1	
ltx/en_us_dedes/sy.m06.d07:syMA.commemoration02.couplet1.verse2	
ltx/en_us_dedes/sy.m06.d07:syMA.commemoration02.text	On this day we also commemorate the Holy Martyr Zinaida (Zenais) the wonderworker.
ltx/en_us_dedes/sy.m06.d07:syMA.commemoration03.couplet1.title	@ltx/en_us_dedes/titles:ti.Verses
ltx/en_us_dedes/sy.m06.d07:syMA.commemoration03.couplet1.verse1	
ltx/en_us_dedes/sy.m06.d07:syMA.commemoration03.couplet1.verse2	
ltx/en_us_dedes/sy.m06.d07:syMA.commemoration03.text	On this day we also commemorate the Holy women, Aesia and Sosanna, followers of St. Pangratios, Bishop of Taormina. The services in their honor used to be conducted in their shrine in Basiliskos.
ltx/en_us_dedes/sy.m06.d07:syMA.commemoration04.couplet1.title	@ltx/en_us_dedes/titles:ti.Verses
ltx/en_us_dedes/sy.m06.d07:syMA.commemoration04.couplet1.verse1	
ltx/en_us_dedes/sy.m06.d07:syMA.commemoration04.couplet1.verse2	
ltx/en_us_dedes/sy.m06.d07:syMA.commemoration04.narration.p01	
ltx/en_us_dedes/sy.m06.d07:syMA.commemoration04.text	On this day we also commemorate the Holy Martyr Lykarion.
ltx/en_us_dedes/sy.m06.d07:syMA.commemoration05.couplet1.title	@ltx/en_us_dedes/titles:ti.Verses
ltx/en_us_dedes/sy.m06.d07:syMA.commemoration05.couplet1.verse1	
ltx/en_us_dedes/sy.m06.d07:syMA.commemoration05.couplet1.verse2	
ltx/en_us_dedes/sy.m06.d07:syMA.commemoration05.text	On this day, the Holy Martyrs Tarasios and John died by the sword.
ltx/en_us_dedes/sy.m06.d07:syMA.commemoration06.couplet1.title	@ltx/en_us_dedes/titles:ti.Verses
ltx/en_us_dedes/sy.m06.d07:syMA.commemoration06.couplet1.verse1	
ltx/en_us_dedes/sy.m06.d07:syMA.commemoration06.couplet1.verse2	
ltx/en_us_dedes/sy.m06.d07:syMA.commemoration06.text	On this day, the devout Stephen reposed in peace.
ltx/en_us_dedes/sy.m06.d07:syMA.commemoration07.couplet1.title	@ltx/en_us_dedes/titles:ti.Verses
ltx/en_us_dedes/sy.m06.d07:syMA.commemoration07.couplet1.verse1	
ltx/en_us_dedes/sy.m06.d07:syMA.commemoration07.couplet1.verse2	
ltx/en_us_dedes/sy.m06.d07:syMA.commemoration07.text	On this day, the devout Anthimos reposed in peace.
ltx/en_us_dedes/sy.m06.d07:syMA.commemoration08.couplet1.title	@ltx/en_us_dedes/titles:ti.Verses
ltx/en_us_dedes/sy.m06.d07:syMA.commemoration08.couplet1.verse1	
ltx/en_us_dedes/sy.m06.d07:syMA.commemoration08.couplet1.verse2	
ltx/en_us_dedes/sy.m06.d07:syMA.commemoration08.text	On this day, the Holy Sevastiani reposed in peace.
ltx/en_us_dedes/sy.m06.d07:syMA.lastline	By their holy intercessions, Christ God, have mercy on us. Amen.
