ltx/en_us_dedes/me.m06.d29:meDA.commemoration.first	Memory of the Preeminent Apostles Peter and Paul
ltx/en_us_dedes/me.m06.d29:meDA.commemoration.first_name	Sts. Peter and Paul
ltx/en_us_dedes/me.m06.d29:meDA.commemoration.first_short	Memory of the Preeminent Apostles Peter and Paul
ltx/en_us_dedes/me.m06.d29:meDA.commemoration.first_title	@ltx/en_us_dedes/titles:ti.Apostles
ltx/en_us_dedes/me.m06.d29:meDA.commemoration.full	Memory of the Holy, Glorious, All-Lauded Preeminent Apostles Peter and Paul.
ltx/en_us_dedes/me.m06.d29:meDA.commemoration.second_name	Apostle Paul
ltx/en_us_dedes/me.m06.d29:meDA.commemoration.second_title	
ltx/en_us_dedes/me.m06.d29:meDA.date	June 29
ltx/en_us_dedes/me.m06.d29:meDA.dismissal	
ltx/en_us_dedes/me.m06.d29:meDA.fordate	for June 29
ltx/en_us_dedes/me.m06.d29:meDA.insert1	the holy, glorious, and all-laudable, paramount Apostles Peter and Paul,
ltx/en_us_dedes/me.m06.d29:meDA.insert2	whose memory we celebrate;
ltx/en_us_dedes/me.m06.d29:meDA.note	
ltx/en_us_dedes/me.m06.d29:meDA.pdfcoverdate	June 29,
ltx/en_us_dedes/me.m06.d29:meDA.pdfheaderdate	June 29
ltx/en_us_dedes/me.m06.d29:meHO.commemorations	
ltx/en_us_dedes/me.m06.d29:meHO.note1	
ltx/en_us_dedes/me.m06.d29:meHO.note2	
ltx/en_us_dedes/me.m06.d29:meHO.number	
ltx/en_us_dedes/me.m06.d29:meHO.rank	
ltx/en_us_dedes/me.m06.d29:meLE.commemoration1	The Holy, Glorious, and Renowned Apostles Peter and Paul.
ltx/en_us_dedes/me.m06.d29:meLE.commemoration2	
ltx/en_us_dedes/me.m06.d29:meLI.Kontakion1.greekmelody	@ltx/en_us_dedes/me.m06.d29:meMA.Kontakion1.greekmelody
ltx/en_us_dedes/me.m06.d29:meLI.Kontakion1.incipit	@ltx/en_us_dedes/me.m06.d29:meMA.Kontakion1.incipit
ltx/en_us_dedes/me.m06.d29:meLI.Kontakion1.melody	@ltx/en_us_dedes/me.m06.d29:meMA.Kontakion1.melody
ltx/en_us_dedes/me.m06.d29:meLI.Kontakion1.mode	@ltx/en_us_dedes/me.m06.d29:meMA.Kontakion1.mode
ltx/en_us_dedes/me.m06.d29:meLI.Kontakion1.text	@ltx/en_us_dedes/me.m06.d29:meMA.Kontakion1.text
ltx/en_us_dedes/me.m06.d29:meLI.MM.CommunionHymn.text	@ltx/en_us_dedes/properties:media.key
ltx/en_us_dedes/me.m06.d29:meLI.Megalynarion.text	
ltx/en_us_dedes/me.m06.d29:meLI.Megalynarion2.text	
ltx/en_us_dedes/me.m06.d29:meMA.AdditionalIdiomelon1.incipit	…
ltx/en_us_dedes/me.m06.d29:meMA.AdditionalIdiomelon1.melody	@ltx/en_us_dedes/miscellanea:misc.Idiomelon
ltx/en_us_dedes/me.m06.d29:meMA.AdditionalIdiomelon1.mode	@ltx/en_us_dedes/miscellanea:misc.Mode4
ltx/en_us_dedes/me.m06.d29:meMA.AdditionalIdiomelon1.text	
ltx/en_us_dedes/me.m06.d29:meMA.AdditionalIdiomelon2.incipit	…
ltx/en_us_dedes/me.m06.d29:meMA.AdditionalIdiomelon2.melody	@ltx/en_us_dedes/miscellanea:misc.Idiomelon
ltx/en_us_dedes/me.m06.d29:meMA.AdditionalIdiomelon2.mode	@ltx/en_us_dedes/miscellanea:misc.Mode4
ltx/en_us_dedes/me.m06.d29:meMA.AdditionalIdiomelon2.poet	@ltx/en_us_dedes/poets:po.IoannouMonachou
ltx/en_us_dedes/me.m06.d29:meMA.AdditionalIdiomelon2.text	
ltx/en_us_dedes/me.m06.d29:meMA.AdditionalIdiomelon3.incipit	…
ltx/en_us_dedes/me.m06.d29:meMA.AdditionalIdiomelon3.melody	@ltx/en_us_dedes/miscellanea:misc.Idiomelon
ltx/en_us_dedes/me.m06.d29:meMA.AdditionalIdiomelon3.mode	@ltx/en_us_dedes/miscellanea:misc.Mode4
ltx/en_us_dedes/me.m06.d29:meMA.AdditionalIdiomelon3.poet	@ltx/en_us_dedes/poets:po.Theofanous
ltx/en_us_dedes/me.m06.d29:meMA.AdditionalIdiomelon3.text	
ltx/en_us_dedes/me.m06.d29:meMA.AdditionalIdiomelonGlory.incipit	…
ltx/en_us_dedes/me.m06.d29:meMA.AdditionalIdiomelonGlory.melody	@ltx/en_us_dedes/miscellanea:misc.Idiomelon
ltx/en_us_dedes/me.m06.d29:meMA.AdditionalIdiomelonGlory.mode	@ltx/en_us_dedes/miscellanea:misc.Mode4
ltx/en_us_dedes/me.m06.d29:meMA.AdditionalIdiomelonGlory.poet	@ltx/en_us_dedes/poets:po.IoannouMonachou
ltx/en_us_dedes/me.m06.d29:meMA.AdditionalIdiomelonGlory.text	
ltx/en_us_dedes/me.m06.d29:meMA.C1.poet	@ltx/en_us_dedes/poets:po.IoannouMonachou
ltx/en_us_dedes/me.m06.d29:meMA.C1.title	Canon for St. Peter.
ltx/en_us_dedes/me.m06.d29:meMA.C1.verse	@ltx/en_us_dedes/prayers:pr.verse_Apostle.text
ltx/en_us_dedes/me.m06.d29:meMA.C2.poet	@ltx/en_us_dedes/poets:po.IoannouMonachou
ltx/en_us_dedes/me.m06.d29:meMA.C2.title	Canon for St. Paul.
ltx/en_us_dedes/me.m06.d29:meMA.C2.verse	@ltx/en_us_dedes/prayers:pr.verse_Apostle.text
ltx/en_us_dedes/me.m06.d29:meMA.ExapTheotokion.incipit	The great and paradoxical *…
ltx/en_us_dedes/me.m06.d29:meMA.ExapTheotokion.melody	@ltx/en_us_dedes/he.a.m2:heAU.GynaikesAkoutisthite.name
ltx/en_us_dedes/me.m06.d29:meMA.ExapTheotokion.mode	@ltx/en_us_dedes/miscellanea:misc.Mode2
ltx/en_us_dedes/me.m06.d29:meMA.ExapTheotokion.text	The great and paradoxical * mystery of your childbirth, * O Maiden full of grace divine * and Virgin Theotokos, * was by the Prophets heralded * and taught by the Apostles all. * It was confessed by Martyr Saints; * it is extolled by the Angels * and likewise adored by mankind.
ltx/en_us_dedes/me.m06.d29:meMA.Exaposteilarion1.greekmelody	@ltx/en_us_dedes/he.a.m2:heAU.GynaikesAkoutisthite.greekname
ltx/en_us_dedes/me.m06.d29:meMA.Exaposteilarion1.incipit	Let all of us extol…
ltx/en_us_dedes/me.m06.d29:meMA.Exaposteilarion1.melody	@ltx/en_us_dedes/he.a.m2:heAU.GynaikesAkoutisthite.name
ltx/en_us_dedes/me.m06.d29:meMA.Exaposteilarion1.mode	@ltx/en_us_dedes/miscellanea:misc.Mode2
ltx/en_us_dedes/me.m06.d29:meMA.Exaposteilarion1.text	Let all of us extol in hymns * Peter and Paul in unison, * the paramount Apostles, * the world’s divine luminaries. * The heralds of the Faith are they, * and trumpets of theology, * the pillars of the Church of God, * and the revealers of dogma, * and the destroyers of error.
ltx/en_us_dedes/me.m06.d29:meMA.Hypakoe.incipit	…
ltx/en_us_dedes/me.m06.d29:meMA.Hypakoe.melody	
ltx/en_us_dedes/me.m06.d29:meMA.Hypakoe.mode	@ltx/en_us_dedes/miscellanea:misc.Mode8
ltx/en_us_dedes/me.m06.d29:meMA.Hypakoe.text	
ltx/en_us_dedes/me.m06.d29:meMA.Kathisma11.greekmelody	@ltx/en_us_dedes/he.a.m8:heAU.TinSofianKaiLogon.greekname
ltx/en_us_dedes/me.m06.d29:meMA.Kathisma11.incipit	You abandoned the fishery of…
ltx/en_us_dedes/me.m06.d29:meMA.Kathisma11.melody	@ltx/en_us_dedes/he.a.m8:heAU.TinSofianKaiLogon.name
ltx/en_us_dedes/me.m06.d29:meMA.Kathisma11.mode	@ltx/en_us_dedes/miscellanea:misc.Mode8
ltx/en_us_dedes/me.m06.d29:meMA.Kathisma11.text	You abandoned the fishery of the deep * and received from the Father the heaven-sent * divine revelation of the incarnation of the Logos. * And unto your Creator you cried out for all to hear,* “I know You, one in essence with the Father, O Son of God.” * Therefore you were truly and most worthily shown forth * indeed as the rock of faith and the man with the keys to grace, * O Apostle Peter. * Intercede with Christ our God * that He grant forgiveness of offenses * to those who with longing observe your holy memory.
ltx/en_us_dedes/me.m06.d29:meMA.Kathisma1T.incipit	I remember the judgment and…
ltx/en_us_dedes/me.m06.d29:meMA.Kathisma1T.melody	@ltx/en_us_dedes/he.a.m8:heAU.TinSofianKaiLogon.name
ltx/en_us_dedes/me.m06.d29:meMA.Kathisma1T.mode	@ltx/en_us_dedes/miscellanea:misc.Mode8
ltx/en_us_dedes/me.m06.d29:meMA.Kathisma1T.text	I remember the judgment and I am scared. * Of the close inquisition I am afraid. * I fear, trembling at the thought of the verdict and punishment, * and of the pain of fire, the darkness, and Hell’s abyss. * Alas! What shall I do in that hour on Judgment Day? * There will be the Judge’s seat and books will be opened. * And there will be inquiry of the actions of everyone. * O my Lady, I entreat, * be to me a helper then, * I beseech you, and an ardent advocate. * For I, your servant, have you as my only hope.
ltx/en_us_dedes/me.m06.d29:meMA.Kathisma21.greekmelody	@ltx/en_us_dedes/he.a.m8:heAU.TinSofianKaiLogon.greekname
ltx/en_us_dedes/me.m06.d29:meMA.Kathisma21.incipit	You received out of heaven…
ltx/en_us_dedes/me.m06.d29:meMA.Kathisma21.melody	@ltx/en_us_dedes/he.a.m8:heAU.TinSofianKaiLogon.name
ltx/en_us_dedes/me.m06.d29:meMA.Kathisma21.mode	@ltx/en_us_dedes/miscellanea:misc.Mode8
ltx/en_us_dedes/me.m06.d29:meMA.Kathisma21.text	You received out of heaven the call from Christ, * and were seen as a herald and preacher of light, * enlightening everyone with the teachings of grace divine. * You pared the ritual worship of the letter of the Law * and shined on the faithful the knowledge of the Spirit. * Therefore you were truly taken up and exalted * to third heaven worthily, and you reached even Paradise, * O Apostle St. Paul. * Intercede with Christ our God * that He grant forgiveness of offenses * to those who with longing observe your holy memory.
ltx/en_us_dedes/me.m06.d29:meMA.Kathisma2T.incipit	Duty-bound I present you this…
ltx/en_us_dedes/me.m06.d29:meMA.Kathisma2T.melody	@ltx/en_us_dedes/he.a.m8:heAU.TinSofianKaiLogon.name
ltx/en_us_dedes/me.m06.d29:meMA.Kathisma2T.mode	@ltx/en_us_dedes/miscellanea:misc.Mode8
ltx/en_us_dedes/me.m06.d29:meMA.Kathisma2T.text	Duty-bound I present you this hymn of praise, * like the widow’s two cents, out of gratitude, * O Lady, because of all your benevolent favors. * For you are my shelter and likewise my help in need; * from troubles and temptations you ever deliver me. * Therefore being rescued from the things that afflict me, * as though from a furnace fire, from my heart I cry out to you, * Theotokos help me, I pray, * interceding with your Son and God * that He grant forgiveness of offenses * to those who faithfully worship your Son, O immaculate one.
ltx/en_us_dedes/me.m06.d29:meMA.Kathisma31.greekmelody	@ltx/en_us_dedes/he.a.m8:heAU.TinSofianKaiLogon.greekname
ltx/en_us_dedes/me.m06.d29:meMA.Kathisma31.incipit	Let us worthily praise and…
ltx/en_us_dedes/me.m06.d29:meMA.Kathisma31.melody	@ltx/en_us_dedes/he.a.m8:heAU.TinSofianKaiLogon.name
ltx/en_us_dedes/me.m06.d29:meMA.Kathisma31.mode	@ltx/en_us_dedes/miscellanea:misc.Mode8
ltx/en_us_dedes/me.m06.d29:meMA.Kathisma31.text	Let us worthily praise and extol the chiefs * of the Master’s disciples, the great and bright * luminaries of the world, the all-wise Paul and Peter. * For shining with the Holy Spirit’s fire resplendently, * they burned away the dark mist of error entirely. * Therefore they were shown forth in the kingdom of heaven * as citizens worthily, and as sharing the throne of grace. * Let us therefore cry out to them, * “As Christ our God’s Apostles, entreat * that He grant forgiveness of offenses * to those who with longing observe your holy memory.”
ltx/en_us_dedes/me.m06.d29:meMA.Kathisma3T.incipit	@ltx/en_us_dedes/he.a.m8:heAU.TinSofianKaiLogon.incipit
ltx/en_us_dedes/me.m06.d29:meMA.Kathisma3T.melody	@ltx/en_us_dedes/he.a.m8:heAU.TinSofianKaiLogon.melody
ltx/en_us_dedes/me.m06.d29:meMA.Kathisma3T.mode	@ltx/en_us_dedes/miscellanea:misc.Mode8
ltx/en_us_dedes/me.m06.d29:meMA.Kathisma3T.text	@ltx/en_us_dedes/he.a.m8:heAU.TinSofianKaiLogon.text
ltx/en_us_dedes/me.m06.d29:meMA.Kontakion1.greekmelody	@ltx/en_us_dedes/he.a.m2:heAU.TousAsfaleis.greekname
ltx/en_us_dedes/me.m06.d29:meMA.Kontakion1.incipit	@ltx/en_us_dedes/he.a.m2:heAU.TousAsfaleis.incipit
ltx/en_us_dedes/me.m06.d29:meMA.Kontakion1.melody	@ltx/en_us_dedes/he.a.m2:heAU.TousAsfaleis.melody
ltx/en_us_dedes/me.m06.d29:meMA.Kontakion1.mode	@ltx/en_us_dedes/miscellanea:misc.Mode2
ltx/en_us_dedes/me.m06.d29:meMA.Kontakion1.text	@ltx/en_us_dedes/he.a.m2:heAU.TousAsfaleis.text
ltx/en_us_dedes/me.m06.d29:meMA.Lauds1.greekmelody	@ltx/en_us_dedes/he.a.m4:heAU.OExYpsistouKlitheis.greekname
ltx/en_us_dedes/me.m06.d29:meMA.Lauds1.incipit	@ltx/en_us_dedes/he.a.m4:heAU.OExYpsistouKlitheis.incipit
ltx/en_us_dedes/me.m06.d29:meMA.Lauds1.melody	@ltx/en_us_dedes/he.a.m4:heAU.OExYpsistouKlitheis.melody
ltx/en_us_dedes/me.m06.d29:meMA.Lauds1.mode	@ltx/en_us_dedes/miscellanea:misc.Mode4
ltx/en_us_dedes/me.m06.d29:meMA.Lauds1.text	@ltx/en_us_dedes/he.a.m4:heAU.OExYpsistouKlitheis.text
ltx/en_us_dedes/me.m06.d29:meMA.Lauds2.incipit	When the beginningless Father’s Son…
ltx/en_us_dedes/me.m06.d29:meMA.Lauds2.melody	@ltx/en_us_dedes/he.a.m4:heAU.OExYpsistouKlitheis.name
ltx/en_us_dedes/me.m06.d29:meMA.Lauds2.mode	@ltx/en_us_dedes/miscellanea:misc.Mode4
ltx/en_us_dedes/me.m06.d29:meMA.Lauds2.text	When the beginningless Father’s Son and Logos * came to earth and chose His Twelve Apostles, and He asked, * “Who do the people say that I am?” it was Saint Peter, * being preeminent of the Savior Christ’s * Disciples, who then received from heaven grace divine, * and in a loud voice proclaimed and said, theologizing, * “You are the Son of the living God, O Christ.” * Hence he is worthily beatified * for receiving revelation from on high * and the power of binding and of loosing the sins of all.
ltx/en_us_dedes/me.m06.d29:meMA.Lauds3.incipit	The name of Rock have…
ltx/en_us_dedes/me.m06.d29:meMA.Lauds3.melody	@ltx/en_us_dedes/he.a.m4:heAU.OExYpsistouKlitheis.name
ltx/en_us_dedes/me.m06.d29:meMA.Lauds3.mode	@ltx/en_us_dedes/miscellanea:misc.Mode4
ltx/en_us_dedes/me.m06.d29:meMA.Lauds3.text	The name of Rock have you worthily been given. * On this rock the Lord of all confirmed the Church’s faith * which is unshaken; and He made you, O holy Peter, * the senior pastor of reason endowed sheep. * Therefore the benevolent Master appointed you * to hold the keys of the heav’nly gates, and thus to open * to every person approaching them with faith. * And you were therefore counted worthy of * imitating your Lord, being crucified. * We entreat you to pray Him to illumine us and save our souls.
ltx/en_us_dedes/me.m06.d29:meMA.Lauds4.greekmelody	@ltx/en_us_dedes/he.a.m4:heAU.OExYpsistouKlitheis.greekname
ltx/en_us_dedes/me.m06.d29:meMA.Lauds4.incipit	Preacher of Christ, as you…
ltx/en_us_dedes/me.m06.d29:meMA.Lauds4.melody	@ltx/en_us_dedes/he.a.m4:heAU.OExYpsistouKlitheis.name
ltx/en_us_dedes/me.m06.d29:meMA.Lauds4.mode	@ltx/en_us_dedes/miscellanea:misc.Mode4
ltx/en_us_dedes/me.m06.d29:meMA.Lauds4.text	Preacher of Christ, as you bore the Cross’s glory, * O Paul, you sincerely did prefer to everything * the love divine and greatly beloved, that binds the lovers * unto the object of their longing and love. * Therefore you had called yourself a prisoner of Christ, * and you considered the suffering of every trial * as being sweeter than all mundane delights. * And you were granted the most honorable * dissolution to be with your Master Christ. * Therefore earnestly pray Him to illumine us and save our souls.
ltx/en_us_dedes/me.m06.d29:meMA.LaudsGlory.incipit	The all-august feast of the…
ltx/en_us_dedes/me.m06.d29:meMA.LaudsGlory.melody	@ltx/en_us_dedes/miscellanea:misc.Idiomelon
ltx/en_us_dedes/me.m06.d29:meMA.LaudsGlory.mode	@ltx/en_us_dedes/miscellanea:misc.Mode6
ltx/en_us_dedes/me.m06.d29:meMA.LaudsGlory.poet	@ltx/en_us_dedes/poets:po.KosmaMonachou
ltx/en_us_dedes/me.m06.d29:meMA.LaudsGlory.text	The all-august feast of the Apostles has arrived in the Church of Christ, as an occasion of salvation for us. So mystically applauding them let us say to them, “Rejoice, luminaries of those in darkness, since you are the rays of the Sun. Rejoice, Peter and Paul, unbroken foundations of the divine dogmas, friends of Christ, worthy vessels. Come and be in our midst invisibly, and count us worthy of immaterial gifts, as we extol your feast with songs.”
ltx/en_us_dedes/me.m06.d29:meMA.LaudsTheotokion.incipit	@ltx/en_us_dedes/he.o:heOT.TheotokeSyEi.incipit
ltx/en_us_dedes/me.m06.d29:meMA.LaudsTheotokion.melody	@ltx/en_us_dedes/he.o:heOT.TheotokeSyEi.name
ltx/en_us_dedes/me.m06.d29:meMA.LaudsTheotokion.mode	@ltx/en_us_dedes/miscellanea:misc.Mode6
ltx/en_us_dedes/me.m06.d29:meMA.LaudsTheotokion.text	@ltx/en_us_dedes/he.o:heOT.TheotokeSyEiApostolon.text
ltx/en_us_dedes/me.m06.d29:meMA.MM.Lauds1234as5678.text	@ltx/en_us_dedes/properties:media.key
ltx/en_us_dedes/me.m06.d29:meMA.MM.Lauds123as456.text	@ltx/en_us_dedes/properties:media.key
ltx/en_us_dedes/me.m06.d29:meMA.Ode1C11.greekmelody	@ltx/en_us_dedes/he.h.m4:heHE.OukEstiSoiOmoios.greekname
ltx/en_us_dedes/me.m06.d29:meMA.Ode1C11.incipit	…
ltx/en_us_dedes/me.m06.d29:meMA.Ode1C11.melody	@ltx/en_us_dedes/he.h.m4:heHE.OukEstiSoiOmoios.name
ltx/en_us_dedes/me.m06.d29:meMA.Ode1C11.mode	@ltx/en_us_dedes/miscellanea:misc.Mode4
ltx/en_us_dedes/me.m06.d29:meMA.Ode1C11.ode	@ltx/en_us_dedes/miscellanea:misc.Ode1
ltx/en_us_dedes/me.m06.d29:meMA.Ode1C11.text	
ltx/en_us_dedes/me.m06.d29:meMA.Ode1C12.incipit	…
ltx/en_us_dedes/me.m06.d29:meMA.Ode1C12.melody	@ltx/en_us_dedes/he.h.m4:heHE.OukEstiSoiOmoios.name
ltx/en_us_dedes/me.m06.d29:meMA.Ode1C12.mode	@ltx/en_us_dedes/miscellanea:misc.Mode4
ltx/en_us_dedes/me.m06.d29:meMA.Ode1C12.ode	@ltx/en_us_dedes/miscellanea:misc.Ode1
ltx/en_us_dedes/me.m06.d29:meMA.Ode1C12.text	
ltx/en_us_dedes/me.m06.d29:meMA.Ode1C13.incipit	…
ltx/en_us_dedes/me.m06.d29:meMA.Ode1C13.melody	@ltx/en_us_dedes/he.h.m4:heHE.OukEstiSoiOmoios.name
ltx/en_us_dedes/me.m06.d29:meMA.Ode1C13.mode	@ltx/en_us_dedes/miscellanea:misc.Mode4
ltx/en_us_dedes/me.m06.d29:meMA.Ode1C13.ode	@ltx/en_us_dedes/miscellanea:misc.Ode1
ltx/en_us_dedes/me.m06.d29:meMA.Ode1C13.text	
ltx/en_us_dedes/me.m06.d29:meMA.Ode1C1H.greekmelody	@ltx/en_us_dedes/he.h.m4:heHE.OukEstiSoiOmoios.greekname
ltx/en_us_dedes/me.m06.d29:meMA.Ode1C1H.incipit	@ltx/en_us_dedes/he.h.m4:heHE.OukEstiSoiOmoios.incipit
ltx/en_us_dedes/me.m06.d29:meMA.Ode1C1H.melody	@ltx/en_us_dedes/he.h.m4:heHE.OukEstiSoiOmoios.melody
ltx/en_us_dedes/me.m06.d29:meMA.Ode1C1H.mode	@ltx/en_us_dedes/miscellanea:misc.Mode4
ltx/en_us_dedes/me.m06.d29:meMA.Ode1C1H.ode	@ltx/en_us_dedes/miscellanea:misc.Ode1
ltx/en_us_dedes/me.m06.d29:meMA.Ode1C1H.text	@ltx/en_us_dedes/he.h.m4:heHE.OukEstiSoiOmoios.text
ltx/en_us_dedes/me.m06.d29:meMA.Ode1C1T.incipit	…
ltx/en_us_dedes/me.m06.d29:meMA.Ode1C1T.melody	@ltx/en_us_dedes/he.h.m4:heHE.OukEstiSoiOmoios.name
ltx/en_us_dedes/me.m06.d29:meMA.Ode1C1T.mode	@ltx/en_us_dedes/miscellanea:misc.Mode4
ltx/en_us_dedes/me.m06.d29:meMA.Ode1C1T.ode	@ltx/en_us_dedes/miscellanea:misc.Ode1
ltx/en_us_dedes/me.m06.d29:meMA.Ode1C1T.text	
ltx/en_us_dedes/me.m06.d29:meMA.Ode1C21.greekmelody	@ltx/en_us_dedes/he.h.m8:heHE.IKekommeni.greekname
ltx/en_us_dedes/me.m06.d29:meMA.Ode1C21.incipit	…
ltx/en_us_dedes/me.m06.d29:meMA.Ode1C21.melody	@ltx/en_us_dedes/he.h.m8:heHE.IKekommeni.name
ltx/en_us_dedes/me.m06.d29:meMA.Ode1C21.mode	@ltx/en_us_dedes/miscellanea:misc.Mode8
ltx/en_us_dedes/me.m06.d29:meMA.Ode1C21.ode	@ltx/en_us_dedes/miscellanea:misc.Ode1
ltx/en_us_dedes/me.m06.d29:meMA.Ode1C21.text	
ltx/en_us_dedes/me.m06.d29:meMA.Ode1C22.incipit	…
ltx/en_us_dedes/me.m06.d29:meMA.Ode1C22.melody	@ltx/en_us_dedes/he.h.m8:heHE.IKekommeni.name
ltx/en_us_dedes/me.m06.d29:meMA.Ode1C22.mode	@ltx/en_us_dedes/miscellanea:misc.Mode8
ltx/en_us_dedes/me.m06.d29:meMA.Ode1C22.ode	@ltx/en_us_dedes/miscellanea:misc.Ode1
ltx/en_us_dedes/me.m06.d29:meMA.Ode1C22.text	
ltx/en_us_dedes/me.m06.d29:meMA.Ode1C23.incipit	…
ltx/en_us_dedes/me.m06.d29:meMA.Ode1C23.melody	@ltx/en_us_dedes/he.h.m8:heHE.IKekommeni.name
ltx/en_us_dedes/me.m06.d29:meMA.Ode1C23.mode	@ltx/en_us_dedes/miscellanea:misc.Mode8
ltx/en_us_dedes/me.m06.d29:meMA.Ode1C23.ode	@ltx/en_us_dedes/miscellanea:misc.Ode1
ltx/en_us_dedes/me.m06.d29:meMA.Ode1C23.text	
ltx/en_us_dedes/me.m06.d29:meMA.Ode1C2T.incipit	…
ltx/en_us_dedes/me.m06.d29:meMA.Ode1C2T.melody	@ltx/en_us_dedes/he.h.m8:heHE.IKekommeni.name
ltx/en_us_dedes/me.m06.d29:meMA.Ode1C2T.mode	@ltx/en_us_dedes/miscellanea:misc.Mode8
ltx/en_us_dedes/me.m06.d29:meMA.Ode1C2T.ode	@ltx/en_us_dedes/miscellanea:misc.Ode1
ltx/en_us_dedes/me.m06.d29:meMA.Ode1C2T.text	
ltx/en_us_dedes/me.m06.d29:meMA.Ode3C11.greekmelody	@ltx/en_us_dedes/he.h.m4:heHE.OukEnSofia.greekname
ltx/en_us_dedes/me.m06.d29:meMA.Ode3C11.incipit	…
ltx/en_us_dedes/me.m06.d29:meMA.Ode3C11.melody	@ltx/en_us_dedes/he.h.m4:heHE.OukEnSofia.name
ltx/en_us_dedes/me.m06.d29:meMA.Ode3C11.mode	@ltx/en_us_dedes/miscellanea:misc.Mode4
ltx/en_us_dedes/me.m06.d29:meMA.Ode3C11.ode	@ltx/en_us_dedes/miscellanea:misc.Ode3
ltx/en_us_dedes/me.m06.d29:meMA.Ode3C11.text	
ltx/en_us_dedes/me.m06.d29:meMA.Ode3C12.incipit	…
ltx/en_us_dedes/me.m06.d29:meMA.Ode3C12.melody	@ltx/en_us_dedes/he.h.m4:heHE.OukEnSofia.name
ltx/en_us_dedes/me.m06.d29:meMA.Ode3C12.mode	@ltx/en_us_dedes/miscellanea:misc.Mode4
ltx/en_us_dedes/me.m06.d29:meMA.Ode3C12.ode	@ltx/en_us_dedes/miscellanea:misc.Ode3
ltx/en_us_dedes/me.m06.d29:meMA.Ode3C12.text	
ltx/en_us_dedes/me.m06.d29:meMA.Ode3C13.incipit	…
ltx/en_us_dedes/me.m06.d29:meMA.Ode3C13.melody	@ltx/en_us_dedes/he.h.m4:heHE.OukEnSofia.name
ltx/en_us_dedes/me.m06.d29:meMA.Ode3C13.mode	@ltx/en_us_dedes/miscellanea:misc.Mode4
ltx/en_us_dedes/me.m06.d29:meMA.Ode3C13.ode	@ltx/en_us_dedes/miscellanea:misc.Ode3
ltx/en_us_dedes/me.m06.d29:meMA.Ode3C13.text	
ltx/en_us_dedes/me.m06.d29:meMA.Ode3C1H.greekmelody	@ltx/en_us_dedes/he.h.m4:heHE.OukEnSofia.greekname
ltx/en_us_dedes/me.m06.d29:meMA.Ode3C1H.incipit	@ltx/en_us_dedes/he.h.m4:heHE.OukEnSofia.incipit
ltx/en_us_dedes/me.m06.d29:meMA.Ode3C1H.melody	@ltx/en_us_dedes/he.h.m4:heHE.OukEnSofia.melody
ltx/en_us_dedes/me.m06.d29:meMA.Ode3C1H.mode	@ltx/en_us_dedes/miscellanea:misc.Mode4
ltx/en_us_dedes/me.m06.d29:meMA.Ode3C1H.ode	@ltx/en_us_dedes/miscellanea:misc.Ode3
ltx/en_us_dedes/me.m06.d29:meMA.Ode3C1H.text	@ltx/en_us_dedes/he.h.m4:heHE.OukEnSofia.text
ltx/en_us_dedes/me.m06.d29:meMA.Ode3C1T.incipit	…
ltx/en_us_dedes/me.m06.d29:meMA.Ode3C1T.melody	@ltx/en_us_dedes/he.h.m4:heHE.OukEnSofia.name
ltx/en_us_dedes/me.m06.d29:meMA.Ode3C1T.mode	@ltx/en_us_dedes/miscellanea:misc.Mode4
ltx/en_us_dedes/me.m06.d29:meMA.Ode3C1T.ode	@ltx/en_us_dedes/miscellanea:misc.Ode3
ltx/en_us_dedes/me.m06.d29:meMA.Ode3C1T.text	
ltx/en_us_dedes/me.m06.d29:meMA.Ode3C21.greekmelody	@ltx/en_us_dedes/he.h.m8:heHE.SyEiToStereoma.greekname
ltx/en_us_dedes/me.m06.d29:meMA.Ode3C21.incipit	…
ltx/en_us_dedes/me.m06.d29:meMA.Ode3C21.melody	@ltx/en_us_dedes/he.h.m8:heHE.SyEiToStereoma.name
ltx/en_us_dedes/me.m06.d29:meMA.Ode3C21.mode	@ltx/en_us_dedes/miscellanea:misc.Mode8
ltx/en_us_dedes/me.m06.d29:meMA.Ode3C21.ode	@ltx/en_us_dedes/miscellanea:misc.Ode3
ltx/en_us_dedes/me.m06.d29:meMA.Ode3C21.text	
ltx/en_us_dedes/me.m06.d29:meMA.Ode3C22.incipit	…
ltx/en_us_dedes/me.m06.d29:meMA.Ode3C22.melody	@ltx/en_us_dedes/he.h.m8:heHE.SyEiToStereoma.name
ltx/en_us_dedes/me.m06.d29:meMA.Ode3C22.mode	@ltx/en_us_dedes/miscellanea:misc.Mode8
ltx/en_us_dedes/me.m06.d29:meMA.Ode3C22.ode	@ltx/en_us_dedes/miscellanea:misc.Ode3
ltx/en_us_dedes/me.m06.d29:meMA.Ode3C22.text	
ltx/en_us_dedes/me.m06.d29:meMA.Ode3C23.incipit	…
ltx/en_us_dedes/me.m06.d29:meMA.Ode3C23.melody	@ltx/en_us_dedes/he.h.m8:heHE.SyEiToStereoma.name
ltx/en_us_dedes/me.m06.d29:meMA.Ode3C23.mode	@ltx/en_us_dedes/miscellanea:misc.Mode8
ltx/en_us_dedes/me.m06.d29:meMA.Ode3C23.ode	@ltx/en_us_dedes/miscellanea:misc.Ode3
ltx/en_us_dedes/me.m06.d29:meMA.Ode3C23.text	
ltx/en_us_dedes/me.m06.d29:meMA.Ode3C2T.incipit	…
ltx/en_us_dedes/me.m06.d29:meMA.Ode3C2T.melody	@ltx/en_us_dedes/he.h.m8:heHE.SyEiToStereoma.name
ltx/en_us_dedes/me.m06.d29:meMA.Ode3C2T.mode	@ltx/en_us_dedes/miscellanea:misc.Mode8
ltx/en_us_dedes/me.m06.d29:meMA.Ode3C2T.ode	@ltx/en_us_dedes/miscellanea:misc.Ode3
ltx/en_us_dedes/me.m06.d29:meMA.Ode3C2T.text	
ltx/en_us_dedes/me.m06.d29:meMA.Ode4C11.greekmelody	@ltx/en_us_dedes/he.h.m4:heHE.OutosOTheosImon.greekname
ltx/en_us_dedes/me.m06.d29:meMA.Ode4C11.incipit	…
ltx/en_us_dedes/me.m06.d29:meMA.Ode4C11.melody	@ltx/en_us_dedes/he.h.m4:heHE.OutosOTheosImon.name
ltx/en_us_dedes/me.m06.d29:meMA.Ode4C11.mode	@ltx/en_us_dedes/miscellanea:misc.Mode4
ltx/en_us_dedes/me.m06.d29:meMA.Ode4C11.ode	@ltx/en_us_dedes/miscellanea:misc.Ode4
ltx/en_us_dedes/me.m06.d29:meMA.Ode4C11.text	
ltx/en_us_dedes/me.m06.d29:meMA.Ode4C12.incipit	…
ltx/en_us_dedes/me.m06.d29:meMA.Ode4C12.melody	@ltx/en_us_dedes/he.h.m4:heHE.OutosOTheosImon.name
ltx/en_us_dedes/me.m06.d29:meMA.Ode4C12.mode	@ltx/en_us_dedes/miscellanea:misc.Mode4
ltx/en_us_dedes/me.m06.d29:meMA.Ode4C12.ode	@ltx/en_us_dedes/miscellanea:misc.Ode4
ltx/en_us_dedes/me.m06.d29:meMA.Ode4C12.text	
ltx/en_us_dedes/me.m06.d29:meMA.Ode4C13.incipit	…
ltx/en_us_dedes/me.m06.d29:meMA.Ode4C13.melody	@ltx/en_us_dedes/he.h.m4:heHE.OutosOTheosImon.name
ltx/en_us_dedes/me.m06.d29:meMA.Ode4C13.mode	@ltx/en_us_dedes/miscellanea:misc.Mode4
ltx/en_us_dedes/me.m06.d29:meMA.Ode4C13.ode	@ltx/en_us_dedes/miscellanea:misc.Ode4
ltx/en_us_dedes/me.m06.d29:meMA.Ode4C13.text	
ltx/en_us_dedes/me.m06.d29:meMA.Ode4C1H.greekmelody	@ltx/en_us_dedes/he.h.m4:heHE.OutosOTheosImon.greekname
ltx/en_us_dedes/me.m06.d29:meMA.Ode4C1H.incipit	@ltx/en_us_dedes/he.h.m4:heHE.OutosOTheosImon.incipit
ltx/en_us_dedes/me.m06.d29:meMA.Ode4C1H.melody	@ltx/en_us_dedes/he.h.m4:heHE.OutosOTheosImon.melody
ltx/en_us_dedes/me.m06.d29:meMA.Ode4C1H.mode	@ltx/en_us_dedes/miscellanea:misc.Mode4
ltx/en_us_dedes/me.m06.d29:meMA.Ode4C1H.ode	@ltx/en_us_dedes/miscellanea:misc.Ode4
ltx/en_us_dedes/me.m06.d29:meMA.Ode4C1H.text	@ltx/en_us_dedes/he.h.m4:heHE.OutosOTheosImon.text
ltx/en_us_dedes/me.m06.d29:meMA.Ode4C1T.incipit	…
ltx/en_us_dedes/me.m06.d29:meMA.Ode4C1T.melody	@ltx/en_us_dedes/he.h.m4:heHE.OutosOTheosImon.name
ltx/en_us_dedes/me.m06.d29:meMA.Ode4C1T.mode	@ltx/en_us_dedes/miscellanea:misc.Mode4
ltx/en_us_dedes/me.m06.d29:meMA.Ode4C1T.ode	@ltx/en_us_dedes/miscellanea:misc.Ode4
ltx/en_us_dedes/me.m06.d29:meMA.Ode4C1T.text	
ltx/en_us_dedes/me.m06.d29:meMA.Ode4C21.greekmelody	@ltx/en_us_dedes/he.h.m8:heHE.EpevisEfIppous.greekname
ltx/en_us_dedes/me.m06.d29:meMA.Ode4C21.incipit	…
ltx/en_us_dedes/me.m06.d29:meMA.Ode4C21.melody	@ltx/en_us_dedes/he.h.m8:heHE.EpevisEfIppous.name
ltx/en_us_dedes/me.m06.d29:meMA.Ode4C21.mode	@ltx/en_us_dedes/miscellanea:misc.Mode8
ltx/en_us_dedes/me.m06.d29:meMA.Ode4C21.ode	@ltx/en_us_dedes/miscellanea:misc.Ode4
ltx/en_us_dedes/me.m06.d29:meMA.Ode4C21.text	
ltx/en_us_dedes/me.m06.d29:meMA.Ode4C22.incipit	…
ltx/en_us_dedes/me.m06.d29:meMA.Ode4C22.melody	@ltx/en_us_dedes/he.h.m8:heHE.EpevisEfIppous.name
ltx/en_us_dedes/me.m06.d29:meMA.Ode4C22.mode	@ltx/en_us_dedes/miscellanea:misc.Mode8
ltx/en_us_dedes/me.m06.d29:meMA.Ode4C22.ode	@ltx/en_us_dedes/miscellanea:misc.Ode4
ltx/en_us_dedes/me.m06.d29:meMA.Ode4C22.text	
ltx/en_us_dedes/me.m06.d29:meMA.Ode4C23.incipit	…
ltx/en_us_dedes/me.m06.d29:meMA.Ode4C23.melody	@ltx/en_us_dedes/he.h.m8:heHE.EpevisEfIppous.name
ltx/en_us_dedes/me.m06.d29:meMA.Ode4C23.mode	@ltx/en_us_dedes/miscellanea:misc.Mode8
ltx/en_us_dedes/me.m06.d29:meMA.Ode4C23.ode	@ltx/en_us_dedes/miscellanea:misc.Ode4
ltx/en_us_dedes/me.m06.d29:meMA.Ode4C23.text	
ltx/en_us_dedes/me.m06.d29:meMA.Ode4C2T.incipit	…
ltx/en_us_dedes/me.m06.d29:meMA.Ode4C2T.melody	@ltx/en_us_dedes/he.h.m8:heHE.EpevisEfIppous.name
ltx/en_us_dedes/me.m06.d29:meMA.Ode4C2T.mode	@ltx/en_us_dedes/miscellanea:misc.Mode8
ltx/en_us_dedes/me.m06.d29:meMA.Ode4C2T.ode	@ltx/en_us_dedes/miscellanea:misc.Ode4
ltx/en_us_dedes/me.m06.d29:meMA.Ode4C2T.text	
ltx/en_us_dedes/me.m06.d29:meMA.Ode5C11.greekmelody	@ltx/en_us_dedes/he.h.m4:heHE.OKtisamenosImas.greekname
ltx/en_us_dedes/me.m06.d29:meMA.Ode5C11.incipit	…
ltx/en_us_dedes/me.m06.d29:meMA.Ode5C11.melody	@ltx/en_us_dedes/he.h.m4:heHE.OKtisamenosImas.name
ltx/en_us_dedes/me.m06.d29:meMA.Ode5C11.mode	@ltx/en_us_dedes/miscellanea:misc.Mode4
ltx/en_us_dedes/me.m06.d29:meMA.Ode5C11.ode	@ltx/en_us_dedes/miscellanea:misc.Ode5
ltx/en_us_dedes/me.m06.d29:meMA.Ode5C11.text	
ltx/en_us_dedes/me.m06.d29:meMA.Ode5C12.incipit	…
ltx/en_us_dedes/me.m06.d29:meMA.Ode5C12.melody	@ltx/en_us_dedes/he.h.m4:heHE.OKtisamenosImas.name
ltx/en_us_dedes/me.m06.d29:meMA.Ode5C12.mode	@ltx/en_us_dedes/miscellanea:misc.Mode4
ltx/en_us_dedes/me.m06.d29:meMA.Ode5C12.ode	@ltx/en_us_dedes/miscellanea:misc.Ode5
ltx/en_us_dedes/me.m06.d29:meMA.Ode5C12.text	
ltx/en_us_dedes/me.m06.d29:meMA.Ode5C13.incipit	…
ltx/en_us_dedes/me.m06.d29:meMA.Ode5C13.melody	@ltx/en_us_dedes/he.h.m4:heHE.OKtisamenosImas.name
ltx/en_us_dedes/me.m06.d29:meMA.Ode5C13.mode	@ltx/en_us_dedes/miscellanea:misc.Mode4
ltx/en_us_dedes/me.m06.d29:meMA.Ode5C13.ode	@ltx/en_us_dedes/miscellanea:misc.Ode5
ltx/en_us_dedes/me.m06.d29:meMA.Ode5C13.text	
ltx/en_us_dedes/me.m06.d29:meMA.Ode5C1H.greekmelody	@ltx/en_us_dedes/he.h.m4:heHE.OKtisamenosImas.greekname
ltx/en_us_dedes/me.m06.d29:meMA.Ode5C1H.incipit	@ltx/en_us_dedes/he.h.m4:heHE.OKtisamenosImas.incipit
ltx/en_us_dedes/me.m06.d29:meMA.Ode5C1H.melody	@ltx/en_us_dedes/he.h.m4:heHE.OKtisamenosImas.melody
ltx/en_us_dedes/me.m06.d29:meMA.Ode5C1H.mode	@ltx/en_us_dedes/miscellanea:misc.Mode4
ltx/en_us_dedes/me.m06.d29:meMA.Ode5C1H.ode	@ltx/en_us_dedes/miscellanea:misc.Ode5
ltx/en_us_dedes/me.m06.d29:meMA.Ode5C1H.text	@ltx/en_us_dedes/he.h.m4:heHE.OKtisamenosImas.text
ltx/en_us_dedes/me.m06.d29:meMA.Ode5C1T.incipit	…
ltx/en_us_dedes/me.m06.d29:meMA.Ode5C1T.melody	@ltx/en_us_dedes/he.h.m4:heHE.OKtisamenosImas.name
ltx/en_us_dedes/me.m06.d29:meMA.Ode5C1T.mode	@ltx/en_us_dedes/miscellanea:misc.Mode4
ltx/en_us_dedes/me.m06.d29:meMA.Ode5C1T.ode	@ltx/en_us_dedes/miscellanea:misc.Ode5
ltx/en_us_dedes/me.m06.d29:meMA.Ode5C1T.text	
ltx/en_us_dedes/me.m06.d29:meMA.Ode5C21.greekmelody	@ltx/en_us_dedes/he.h.m8:heHE.FotisonImas.greekname
ltx/en_us_dedes/me.m06.d29:meMA.Ode5C21.incipit	…
ltx/en_us_dedes/me.m06.d29:meMA.Ode5C21.melody	@ltx/en_us_dedes/he.h.m8:heHE.FotisonImas.name
ltx/en_us_dedes/me.m06.d29:meMA.Ode5C21.mode	@ltx/en_us_dedes/miscellanea:misc.Mode8
ltx/en_us_dedes/me.m06.d29:meMA.Ode5C21.ode	@ltx/en_us_dedes/miscellanea:misc.Ode5
ltx/en_us_dedes/me.m06.d29:meMA.Ode5C21.text	
ltx/en_us_dedes/me.m06.d29:meMA.Ode5C22.incipit	…
ltx/en_us_dedes/me.m06.d29:meMA.Ode5C22.melody	@ltx/en_us_dedes/he.h.m8:heHE.FotisonImas.name
ltx/en_us_dedes/me.m06.d29:meMA.Ode5C22.mode	@ltx/en_us_dedes/miscellanea:misc.Mode8
ltx/en_us_dedes/me.m06.d29:meMA.Ode5C22.ode	@ltx/en_us_dedes/miscellanea:misc.Ode5
ltx/en_us_dedes/me.m06.d29:meMA.Ode5C22.text	
ltx/en_us_dedes/me.m06.d29:meMA.Ode5C23.incipit	…
ltx/en_us_dedes/me.m06.d29:meMA.Ode5C23.melody	@ltx/en_us_dedes/he.h.m8:heHE.FotisonImas.name
ltx/en_us_dedes/me.m06.d29:meMA.Ode5C23.mode	@ltx/en_us_dedes/miscellanea:misc.Mode8
ltx/en_us_dedes/me.m06.d29:meMA.Ode5C23.ode	@ltx/en_us_dedes/miscellanea:misc.Ode5
ltx/en_us_dedes/me.m06.d29:meMA.Ode5C23.text	
ltx/en_us_dedes/me.m06.d29:meMA.Ode5C2T.incipit	…
ltx/en_us_dedes/me.m06.d29:meMA.Ode5C2T.melody	@ltx/en_us_dedes/he.h.m8:heHE.FotisonImas.name
ltx/en_us_dedes/me.m06.d29:meMA.Ode5C2T.mode	@ltx/en_us_dedes/miscellanea:misc.Mode8
ltx/en_us_dedes/me.m06.d29:meMA.Ode5C2T.ode	@ltx/en_us_dedes/miscellanea:misc.Ode5
ltx/en_us_dedes/me.m06.d29:meMA.Ode5C2T.text	
ltx/en_us_dedes/me.m06.d29:meMA.Ode6C11.greekmelody	@ltx/en_us_dedes/he.h.m4:heHE.EnKiteiChriste.greekname
ltx/en_us_dedes/me.m06.d29:meMA.Ode6C11.incipit	…
ltx/en_us_dedes/me.m06.d29:meMA.Ode6C11.melody	@ltx/en_us_dedes/he.h.m4:heHE.EnKiteiChriste.name
ltx/en_us_dedes/me.m06.d29:meMA.Ode6C11.mode	@ltx/en_us_dedes/miscellanea:misc.Mode4
ltx/en_us_dedes/me.m06.d29:meMA.Ode6C11.ode	@ltx/en_us_dedes/miscellanea:misc.Ode6
ltx/en_us_dedes/me.m06.d29:meMA.Ode6C11.text	
ltx/en_us_dedes/me.m06.d29:meMA.Ode6C12.incipit	…
ltx/en_us_dedes/me.m06.d29:meMA.Ode6C12.melody	@ltx/en_us_dedes/he.h.m4:heHE.EnKiteiChriste.name
ltx/en_us_dedes/me.m06.d29:meMA.Ode6C12.mode	@ltx/en_us_dedes/miscellanea:misc.Mode4
ltx/en_us_dedes/me.m06.d29:meMA.Ode6C12.ode	@ltx/en_us_dedes/miscellanea:misc.Ode6
ltx/en_us_dedes/me.m06.d29:meMA.Ode6C12.text	
ltx/en_us_dedes/me.m06.d29:meMA.Ode6C13.incipit	…
ltx/en_us_dedes/me.m06.d29:meMA.Ode6C13.melody	@ltx/en_us_dedes/he.h.m4:heHE.EnKiteiChriste.name
ltx/en_us_dedes/me.m06.d29:meMA.Ode6C13.mode	@ltx/en_us_dedes/miscellanea:misc.Mode4
ltx/en_us_dedes/me.m06.d29:meMA.Ode6C13.ode	@ltx/en_us_dedes/miscellanea:misc.Ode6
ltx/en_us_dedes/me.m06.d29:meMA.Ode6C13.text	
ltx/en_us_dedes/me.m06.d29:meMA.Ode6C1H.greekmelody	@ltx/en_us_dedes/he.h.m4:heHE.EnKiteiChriste.greekname
ltx/en_us_dedes/me.m06.d29:meMA.Ode6C1H.incipit	@ltx/en_us_dedes/he.h.m4:heHE.EnKiteiChriste.incipit
ltx/en_us_dedes/me.m06.d29:meMA.Ode6C1H.melody	@ltx/en_us_dedes/he.h.m4:heHE.EnKiteiChriste.melody
ltx/en_us_dedes/me.m06.d29:meMA.Ode6C1H.mode	@ltx/en_us_dedes/miscellanea:misc.Mode4
ltx/en_us_dedes/me.m06.d29:meMA.Ode6C1H.ode	@ltx/en_us_dedes/miscellanea:misc.Ode6
ltx/en_us_dedes/me.m06.d29:meMA.Ode6C1H.text	@ltx/en_us_dedes/he.h.m4:heHE.EnKiteiChriste.text
ltx/en_us_dedes/me.m06.d29:meMA.Ode6C1T.incipit	…
ltx/en_us_dedes/me.m06.d29:meMA.Ode6C1T.melody	@ltx/en_us_dedes/he.h.m4:heHE.EnKiteiChriste.name
ltx/en_us_dedes/me.m06.d29:meMA.Ode6C1T.mode	@ltx/en_us_dedes/miscellanea:misc.Mode4
ltx/en_us_dedes/me.m06.d29:meMA.Ode6C1T.ode	@ltx/en_us_dedes/miscellanea:misc.Ode6
ltx/en_us_dedes/me.m06.d29:meMA.Ode6C1T.text	
ltx/en_us_dedes/me.m06.d29:meMA.Ode6C21.greekmelody	@ltx/en_us_dedes/he.h.m8:heHE.TinDeisinEkcheo.greekname
ltx/en_us_dedes/me.m06.d29:meMA.Ode6C21.incipit	…
ltx/en_us_dedes/me.m06.d29:meMA.Ode6C21.melody	@ltx/en_us_dedes/he.h.m8:heHE.TinDeisinEkcheo.name
ltx/en_us_dedes/me.m06.d29:meMA.Ode6C21.mode	@ltx/en_us_dedes/miscellanea:misc.Mode8
ltx/en_us_dedes/me.m06.d29:meMA.Ode6C21.ode	@ltx/en_us_dedes/miscellanea:misc.Ode6
ltx/en_us_dedes/me.m06.d29:meMA.Ode6C21.text	
ltx/en_us_dedes/me.m06.d29:meMA.Ode6C22.incipit	…
ltx/en_us_dedes/me.m06.d29:meMA.Ode6C22.melody	@ltx/en_us_dedes/he.h.m8:heHE.TinDeisinEkcheo.name
ltx/en_us_dedes/me.m06.d29:meMA.Ode6C22.mode	@ltx/en_us_dedes/miscellanea:misc.Mode8
ltx/en_us_dedes/me.m06.d29:meMA.Ode6C22.ode	@ltx/en_us_dedes/miscellanea:misc.Ode6
ltx/en_us_dedes/me.m06.d29:meMA.Ode6C22.text	
ltx/en_us_dedes/me.m06.d29:meMA.Ode6C23.incipit	…
ltx/en_us_dedes/me.m06.d29:meMA.Ode6C23.melody	@ltx/en_us_dedes/he.h.m8:heHE.TinDeisinEkcheo.name
ltx/en_us_dedes/me.m06.d29:meMA.Ode6C23.mode	@ltx/en_us_dedes/miscellanea:misc.Mode8
ltx/en_us_dedes/me.m06.d29:meMA.Ode6C23.ode	@ltx/en_us_dedes/miscellanea:misc.Ode6
ltx/en_us_dedes/me.m06.d29:meMA.Ode6C23.text	
ltx/en_us_dedes/me.m06.d29:meMA.Ode6C2T.incipit	…
ltx/en_us_dedes/me.m06.d29:meMA.Ode6C2T.melody	@ltx/en_us_dedes/he.h.m8:heHE.TinDeisinEkcheo.name
ltx/en_us_dedes/me.m06.d29:meMA.Ode6C2T.mode	@ltx/en_us_dedes/miscellanea:misc.Mode8
ltx/en_us_dedes/me.m06.d29:meMA.Ode6C2T.ode	@ltx/en_us_dedes/miscellanea:misc.Ode6
ltx/en_us_dedes/me.m06.d29:meMA.Ode6C2T.text	
ltx/en_us_dedes/me.m06.d29:meMA.Ode7C11.greekmelody	@ltx/en_us_dedes/he.h.m4:heHE.OEnArchiAnarchos.greekname
ltx/en_us_dedes/me.m06.d29:meMA.Ode7C11.incipit	…
ltx/en_us_dedes/me.m06.d29:meMA.Ode7C11.melody	@ltx/en_us_dedes/he.h.m4:heHE.OEnArchiAnarchos.name
ltx/en_us_dedes/me.m06.d29:meMA.Ode7C11.mode	@ltx/en_us_dedes/miscellanea:misc.Mode4
ltx/en_us_dedes/me.m06.d29:meMA.Ode7C11.ode	@ltx/en_us_dedes/miscellanea:misc.Ode7
ltx/en_us_dedes/me.m06.d29:meMA.Ode7C11.text	
ltx/en_us_dedes/me.m06.d29:meMA.Ode7C12.incipit	…
ltx/en_us_dedes/me.m06.d29:meMA.Ode7C12.melody	@ltx/en_us_dedes/he.h.m4:heHE.OEnArchiAnarchos.name
ltx/en_us_dedes/me.m06.d29:meMA.Ode7C12.mode	@ltx/en_us_dedes/miscellanea:misc.Mode4
ltx/en_us_dedes/me.m06.d29:meMA.Ode7C12.ode	@ltx/en_us_dedes/miscellanea:misc.Ode7
ltx/en_us_dedes/me.m06.d29:meMA.Ode7C12.text	
ltx/en_us_dedes/me.m06.d29:meMA.Ode7C13.incipit	…
ltx/en_us_dedes/me.m06.d29:meMA.Ode7C13.melody	@ltx/en_us_dedes/he.h.m4:heHE.OEnArchiAnarchos.name
ltx/en_us_dedes/me.m06.d29:meMA.Ode7C13.mode	@ltx/en_us_dedes/miscellanea:misc.Mode4
ltx/en_us_dedes/me.m06.d29:meMA.Ode7C13.ode	@ltx/en_us_dedes/miscellanea:misc.Ode7
ltx/en_us_dedes/me.m06.d29:meMA.Ode7C13.text	
ltx/en_us_dedes/me.m06.d29:meMA.Ode7C14.incipit	…
ltx/en_us_dedes/me.m06.d29:meMA.Ode7C14.melody	@ltx/en_us_dedes/he.h.m4:heHE.OEnArchiAnarchos.name
ltx/en_us_dedes/me.m06.d29:meMA.Ode7C14.mode	@ltx/en_us_dedes/miscellanea:misc.Mode4
ltx/en_us_dedes/me.m06.d29:meMA.Ode7C14.ode	@ltx/en_us_dedes/miscellanea:misc.Ode7
ltx/en_us_dedes/me.m06.d29:meMA.Ode7C14.text	
ltx/en_us_dedes/me.m06.d29:meMA.Ode7C1H.greekmelody	@ltx/en_us_dedes/he.h.m4:heHE.OEnArchiAnarchos.greekname
ltx/en_us_dedes/me.m06.d29:meMA.Ode7C1H.incipit	@ltx/en_us_dedes/he.h.m4:heHE.OEnArchiAnarchos.incipit
ltx/en_us_dedes/me.m06.d29:meMA.Ode7C1H.melody	@ltx/en_us_dedes/he.h.m4:heHE.OEnArchiAnarchos.melody
ltx/en_us_dedes/me.m06.d29:meMA.Ode7C1H.mode	@ltx/en_us_dedes/miscellanea:misc.Mode4
ltx/en_us_dedes/me.m06.d29:meMA.Ode7C1H.ode	@ltx/en_us_dedes/miscellanea:misc.Ode7
ltx/en_us_dedes/me.m06.d29:meMA.Ode7C1H.text	@ltx/en_us_dedes/he.h.m4:heHE.OEnArchiAnarchos.text
ltx/en_us_dedes/me.m06.d29:meMA.Ode7C1T.incipit	…
ltx/en_us_dedes/me.m06.d29:meMA.Ode7C1T.melody	@ltx/en_us_dedes/he.h.m4:heHE.OEnArchiAnarchos.name
ltx/en_us_dedes/me.m06.d29:meMA.Ode7C1T.mode	@ltx/en_us_dedes/miscellanea:misc.Mode4
ltx/en_us_dedes/me.m06.d29:meMA.Ode7C1T.ode	@ltx/en_us_dedes/miscellanea:misc.Ode7
ltx/en_us_dedes/me.m06.d29:meMA.Ode7C1T.text	
ltx/en_us_dedes/me.m06.d29:meMA.Ode7C21.greekmelody	@ltx/en_us_dedes/he.h.m8:heHE.EnPedioDeeira.greekname
ltx/en_us_dedes/me.m06.d29:meMA.Ode7C21.incipit	…
ltx/en_us_dedes/me.m06.d29:meMA.Ode7C21.melody	@ltx/en_us_dedes/he.h.m8:heHE.EnPedioDeeira.name
ltx/en_us_dedes/me.m06.d29:meMA.Ode7C21.mode	@ltx/en_us_dedes/miscellanea:misc.Mode8
ltx/en_us_dedes/me.m06.d29:meMA.Ode7C21.ode	@ltx/en_us_dedes/miscellanea:misc.Ode7
ltx/en_us_dedes/me.m06.d29:meMA.Ode7C21.text	
ltx/en_us_dedes/me.m06.d29:meMA.Ode7C22.incipit	…
ltx/en_us_dedes/me.m06.d29:meMA.Ode7C22.melody	@ltx/en_us_dedes/he.h.m8:heHE.EnPedioDeeira.name
ltx/en_us_dedes/me.m06.d29:meMA.Ode7C22.mode	@ltx/en_us_dedes/miscellanea:misc.Mode8
ltx/en_us_dedes/me.m06.d29:meMA.Ode7C22.ode	@ltx/en_us_dedes/miscellanea:misc.Ode7
ltx/en_us_dedes/me.m06.d29:meMA.Ode7C22.text	
ltx/en_us_dedes/me.m06.d29:meMA.Ode7C23.incipit	…
ltx/en_us_dedes/me.m06.d29:meMA.Ode7C23.melody	@ltx/en_us_dedes/he.h.m8:heHE.EnPedioDeeira.name
ltx/en_us_dedes/me.m06.d29:meMA.Ode7C23.mode	@ltx/en_us_dedes/miscellanea:misc.Mode8
ltx/en_us_dedes/me.m06.d29:meMA.Ode7C23.ode	@ltx/en_us_dedes/miscellanea:misc.Ode7
ltx/en_us_dedes/me.m06.d29:meMA.Ode7C23.text	
ltx/en_us_dedes/me.m06.d29:meMA.Ode7C24.incipit	…
ltx/en_us_dedes/me.m06.d29:meMA.Ode7C24.melody	@ltx/en_us_dedes/he.h.m8:heHE.EnPedioDeeira.name
ltx/en_us_dedes/me.m06.d29:meMA.Ode7C24.mode	@ltx/en_us_dedes/miscellanea:misc.Mode8
ltx/en_us_dedes/me.m06.d29:meMA.Ode7C24.ode	@ltx/en_us_dedes/miscellanea:misc.Ode7
ltx/en_us_dedes/me.m06.d29:meMA.Ode7C24.text	
ltx/en_us_dedes/me.m06.d29:meMA.Ode7C2T.incipit	…
ltx/en_us_dedes/me.m06.d29:meMA.Ode7C2T.melody	@ltx/en_us_dedes/he.h.m8:heHE.EnPedioDeeira.name
ltx/en_us_dedes/me.m06.d29:meMA.Ode7C2T.mode	@ltx/en_us_dedes/miscellanea:misc.Mode8
ltx/en_us_dedes/me.m06.d29:meMA.Ode7C2T.ode	@ltx/en_us_dedes/miscellanea:misc.Ode7
ltx/en_us_dedes/me.m06.d29:meMA.Ode7C2T.text	
ltx/en_us_dedes/me.m06.d29:meMA.Ode8C11.greekmelody	@ltx/en_us_dedes/he.h.m4:heHE.OTaSympantaFeron.greekname
ltx/en_us_dedes/me.m06.d29:meMA.Ode8C11.incipit	…
ltx/en_us_dedes/me.m06.d29:meMA.Ode8C11.melody	@ltx/en_us_dedes/he.h.m4:heHE.OTaSympantaFeron.name
ltx/en_us_dedes/me.m06.d29:meMA.Ode8C11.mode	@ltx/en_us_dedes/miscellanea:misc.Mode4
ltx/en_us_dedes/me.m06.d29:meMA.Ode8C11.ode	@ltx/en_us_dedes/miscellanea:misc.Ode8
ltx/en_us_dedes/me.m06.d29:meMA.Ode8C11.text	
ltx/en_us_dedes/me.m06.d29:meMA.Ode8C12.incipit	…
ltx/en_us_dedes/me.m06.d29:meMA.Ode8C12.melody	@ltx/en_us_dedes/he.h.m4:heHE.OTaSympantaFeron.name
ltx/en_us_dedes/me.m06.d29:meMA.Ode8C12.mode	@ltx/en_us_dedes/miscellanea:misc.Mode4
ltx/en_us_dedes/me.m06.d29:meMA.Ode8C12.ode	@ltx/en_us_dedes/miscellanea:misc.Ode8
ltx/en_us_dedes/me.m06.d29:meMA.Ode8C12.text	
ltx/en_us_dedes/me.m06.d29:meMA.Ode8C13.incipit	…
ltx/en_us_dedes/me.m06.d29:meMA.Ode8C13.melody	@ltx/en_us_dedes/he.h.m4:heHE.OTaSympantaFeron.name
ltx/en_us_dedes/me.m06.d29:meMA.Ode8C13.mode	@ltx/en_us_dedes/miscellanea:misc.Mode4
ltx/en_us_dedes/me.m06.d29:meMA.Ode8C13.ode	@ltx/en_us_dedes/miscellanea:misc.Ode8
ltx/en_us_dedes/me.m06.d29:meMA.Ode8C13.text	
ltx/en_us_dedes/me.m06.d29:meMA.Ode8C1H.greekmelody	@ltx/en_us_dedes/he.h.m4:heHE.OTaSympantaFeron.greekname
ltx/en_us_dedes/me.m06.d29:meMA.Ode8C1H.incipit	@ltx/en_us_dedes/he.h.m4:heHE.OTaSympantaFeron.incipit
ltx/en_us_dedes/me.m06.d29:meMA.Ode8C1H.melody	@ltx/en_us_dedes/he.h.m4:heHE.OTaSympantaFeron.melody
ltx/en_us_dedes/me.m06.d29:meMA.Ode8C1H.mode	@ltx/en_us_dedes/miscellanea:misc.Mode4
ltx/en_us_dedes/me.m06.d29:meMA.Ode8C1H.ode	@ltx/en_us_dedes/miscellanea:misc.Ode8
ltx/en_us_dedes/me.m06.d29:meMA.Ode8C1H.text	@ltx/en_us_dedes/he.h.m4:heHE.OTaSympantaFeron.text
ltx/en_us_dedes/me.m06.d29:meMA.Ode8C1T.incipit	…
ltx/en_us_dedes/me.m06.d29:meMA.Ode8C1T.melody	@ltx/en_us_dedes/he.h.m4:heHE.OTaSympantaFeron.name
ltx/en_us_dedes/me.m06.d29:meMA.Ode8C1T.mode	@ltx/en_us_dedes/miscellanea:misc.Mode4
ltx/en_us_dedes/me.m06.d29:meMA.Ode8C1T.ode	@ltx/en_us_dedes/miscellanea:misc.Ode8
ltx/en_us_dedes/me.m06.d29:meMA.Ode8C1T.text	
ltx/en_us_dedes/me.m06.d29:meMA.Ode8C21.greekmelody	@ltx/en_us_dedes/he.h.m8:heHE.TonEnOreiAgio.greekname
ltx/en_us_dedes/me.m06.d29:meMA.Ode8C21.incipit	…
ltx/en_us_dedes/me.m06.d29:meMA.Ode8C21.melody	@ltx/en_us_dedes/he.h.m8:heHE.TonEnOreiAgio.name
ltx/en_us_dedes/me.m06.d29:meMA.Ode8C21.mode	@ltx/en_us_dedes/miscellanea:misc.Mode8
ltx/en_us_dedes/me.m06.d29:meMA.Ode8C21.ode	@ltx/en_us_dedes/miscellanea:misc.Ode8
ltx/en_us_dedes/me.m06.d29:meMA.Ode8C21.text	
ltx/en_us_dedes/me.m06.d29:meMA.Ode8C22.incipit	…
ltx/en_us_dedes/me.m06.d29:meMA.Ode8C22.melody	@ltx/en_us_dedes/he.h.m8:heHE.TonEnOreiAgio.name
ltx/en_us_dedes/me.m06.d29:meMA.Ode8C22.mode	@ltx/en_us_dedes/miscellanea:misc.Mode8
ltx/en_us_dedes/me.m06.d29:meMA.Ode8C22.ode	@ltx/en_us_dedes/miscellanea:misc.Ode8
ltx/en_us_dedes/me.m06.d29:meMA.Ode8C22.text	
ltx/en_us_dedes/me.m06.d29:meMA.Ode8C23.incipit	…
ltx/en_us_dedes/me.m06.d29:meMA.Ode8C23.melody	@ltx/en_us_dedes/he.h.m8:heHE.TonEnOreiAgio.name
ltx/en_us_dedes/me.m06.d29:meMA.Ode8C23.mode	@ltx/en_us_dedes/miscellanea:misc.Mode8
ltx/en_us_dedes/me.m06.d29:meMA.Ode8C23.ode	@ltx/en_us_dedes/miscellanea:misc.Ode8
ltx/en_us_dedes/me.m06.d29:meMA.Ode8C23.text	
ltx/en_us_dedes/me.m06.d29:meMA.Ode8C2T.incipit	…
ltx/en_us_dedes/me.m06.d29:meMA.Ode8C2T.melody	@ltx/en_us_dedes/he.h.m8:heHE.TonEnOreiAgio.name
ltx/en_us_dedes/me.m06.d29:meMA.Ode8C2T.mode	@ltx/en_us_dedes/miscellanea:misc.Mode8
ltx/en_us_dedes/me.m06.d29:meMA.Ode8C2T.ode	@ltx/en_us_dedes/miscellanea:misc.Ode8
ltx/en_us_dedes/me.m06.d29:meMA.Ode8C2T.text	
ltx/en_us_dedes/me.m06.d29:meMA.Ode9C11.greekmelody	@ltx/en_us_dedes/he.h.m4:heHE.SeTinYperendoxonNymfin.greekname
ltx/en_us_dedes/me.m06.d29:meMA.Ode9C11.incipit	…
ltx/en_us_dedes/me.m06.d29:meMA.Ode9C11.melody	@ltx/en_us_dedes/he.h.m4:heHE.SeTinYperendoxonNymfin.name
ltx/en_us_dedes/me.m06.d29:meMA.Ode9C11.mode	@ltx/en_us_dedes/miscellanea:misc.Mode4
ltx/en_us_dedes/me.m06.d29:meMA.Ode9C11.ode	@ltx/en_us_dedes/miscellanea:misc.Ode9
ltx/en_us_dedes/me.m06.d29:meMA.Ode9C11.text	
ltx/en_us_dedes/me.m06.d29:meMA.Ode9C12.incipit	…
ltx/en_us_dedes/me.m06.d29:meMA.Ode9C12.melody	@ltx/en_us_dedes/he.h.m4:heHE.SeTinYperendoxonNymfin.name
ltx/en_us_dedes/me.m06.d29:meMA.Ode9C12.mode	@ltx/en_us_dedes/miscellanea:misc.Mode4
ltx/en_us_dedes/me.m06.d29:meMA.Ode9C12.ode	@ltx/en_us_dedes/miscellanea:misc.Ode9
ltx/en_us_dedes/me.m06.d29:meMA.Ode9C12.text	
ltx/en_us_dedes/me.m06.d29:meMA.Ode9C13.incipit	…
ltx/en_us_dedes/me.m06.d29:meMA.Ode9C13.melody	@ltx/en_us_dedes/he.h.m4:heHE.SeTinYperendoxonNymfin.name
ltx/en_us_dedes/me.m06.d29:meMA.Ode9C13.mode	@ltx/en_us_dedes/miscellanea:misc.Mode4
ltx/en_us_dedes/me.m06.d29:meMA.Ode9C13.ode	@ltx/en_us_dedes/miscellanea:misc.Ode9
ltx/en_us_dedes/me.m06.d29:meMA.Ode9C13.text	
ltx/en_us_dedes/me.m06.d29:meMA.Ode9C1H.greekmelody	@ltx/en_us_dedes/he.h.m4:heHE.SeTinYperendoxonNymfin.greekname
ltx/en_us_dedes/me.m06.d29:meMA.Ode9C1H.incipit	@ltx/en_us_dedes/he.h.m4:heHE.SeTinYperendoxonNymfin.incipit
ltx/en_us_dedes/me.m06.d29:meMA.Ode9C1H.melody	@ltx/en_us_dedes/he.h.m4:heHE.SeTinYperendoxonNymfin.melody
ltx/en_us_dedes/me.m06.d29:meMA.Ode9C1H.mode	@ltx/en_us_dedes/miscellanea:misc.Mode4
ltx/en_us_dedes/me.m06.d29:meMA.Ode9C1H.ode	@ltx/en_us_dedes/miscellanea:misc.Ode9
ltx/en_us_dedes/me.m06.d29:meMA.Ode9C1H.text	@ltx/en_us_dedes/he.h.m4:heHE.SeTinYperendoxonNymfin.text
ltx/en_us_dedes/me.m06.d29:meMA.Ode9C1T.incipit	…
ltx/en_us_dedes/me.m06.d29:meMA.Ode9C1T.melody	@ltx/en_us_dedes/he.h.m4:heHE.SeTinYperendoxonNymfin.name
ltx/en_us_dedes/me.m06.d29:meMA.Ode9C1T.mode	@ltx/en_us_dedes/miscellanea:misc.Mode4
ltx/en_us_dedes/me.m06.d29:meMA.Ode9C1T.ode	@ltx/en_us_dedes/miscellanea:misc.Ode9
ltx/en_us_dedes/me.m06.d29:meMA.Ode9C1T.text	
ltx/en_us_dedes/me.m06.d29:meMA.Ode9C21.greekmelody	@ltx/en_us_dedes/he.h.m8:heHE.OrousParilthes.greekname
ltx/en_us_dedes/me.m06.d29:meMA.Ode9C21.incipit	…
ltx/en_us_dedes/me.m06.d29:meMA.Ode9C21.melody	@ltx/en_us_dedes/he.h.m8:heHE.OrousParilthes.name
ltx/en_us_dedes/me.m06.d29:meMA.Ode9C21.mode	@ltx/en_us_dedes/miscellanea:misc.Mode8
ltx/en_us_dedes/me.m06.d29:meMA.Ode9C21.ode	@ltx/en_us_dedes/miscellanea:misc.Ode9
ltx/en_us_dedes/me.m06.d29:meMA.Ode9C21.text	
ltx/en_us_dedes/me.m06.d29:meMA.Ode9C22.incipit	…
ltx/en_us_dedes/me.m06.d29:meMA.Ode9C22.melody	@ltx/en_us_dedes/he.h.m8:heHE.OrousParilthes.name
ltx/en_us_dedes/me.m06.d29:meMA.Ode9C22.mode	@ltx/en_us_dedes/miscellanea:misc.Mode8
ltx/en_us_dedes/me.m06.d29:meMA.Ode9C22.ode	@ltx/en_us_dedes/miscellanea:misc.Ode9
ltx/en_us_dedes/me.m06.d29:meMA.Ode9C22.text	
ltx/en_us_dedes/me.m06.d29:meMA.Ode9C23.incipit	…
ltx/en_us_dedes/me.m06.d29:meMA.Ode9C23.melody	@ltx/en_us_dedes/he.h.m8:heHE.OrousParilthes.name
ltx/en_us_dedes/me.m06.d29:meMA.Ode9C23.mode	@ltx/en_us_dedes/miscellanea:misc.Mode8
ltx/en_us_dedes/me.m06.d29:meMA.Ode9C23.ode	@ltx/en_us_dedes/miscellanea:misc.Ode9
ltx/en_us_dedes/me.m06.d29:meMA.Ode9C23.text	
ltx/en_us_dedes/me.m06.d29:meMA.Ode9C2T.incipit	…
ltx/en_us_dedes/me.m06.d29:meMA.Ode9C2T.melody	@ltx/en_us_dedes/he.h.m8:heHE.OrousParilthes.name
ltx/en_us_dedes/me.m06.d29:meMA.Ode9C2T.mode	@ltx/en_us_dedes/miscellanea:misc.Mode8
ltx/en_us_dedes/me.m06.d29:meMA.Ode9C2T.ode	@ltx/en_us_dedes/miscellanea:misc.Ode9
ltx/en_us_dedes/me.m06.d29:meMA.Ode9C2T.text	
ltx/en_us_dedes/me.m06.d29:meMA.Oikos1.text	Expand my tongue, O Savior; widen my mouth, and filling it, prick my heart; so that I may follow what I say, and what I impart, accomplish first; for great is he, it says, who puts to practice what he preach. Yet, if I say, but do not do, I am rendered but a cymbal peal. Hence, grant me say the necessary, and practice what is excellent, for only You know what is in the heart.
ltx/en_us_dedes/me.m06.d29:meMA.PostGospelBoth.incipit	@ltx/en_us_dedes/ho.ho03:hoMA.PostGospelTheotokos.incipit
ltx/en_us_dedes/me.m06.d29:meMA.PostGospelBoth.melody	
ltx/en_us_dedes/me.m06.d29:meMA.PostGospelBoth.mode	@ltx/en_us_dedes/miscellanea:misc.Mode2
ltx/en_us_dedes/me.m06.d29:meMA.PostGospelBoth.text	@ltx/en_us_dedes/ho.ho03:hoMA.PostGospelTheotokos.text
ltx/en_us_dedes/me.m06.d29:meMA.PostGospelGlory.incipit	@ltx/en_us_dedes/ho.ho03:hoMA.PostGospelApostles.incipit
ltx/en_us_dedes/me.m06.d29:meMA.PostGospelGlory.melody	
ltx/en_us_dedes/me.m06.d29:meMA.PostGospelGlory.mode	@ltx/en_us_dedes/miscellanea:misc.Mode2
ltx/en_us_dedes/me.m06.d29:meMA.PostGospelGlory.text	@ltx/en_us_dedes/ho.ho03:hoMA.PostGospelApostles.text
ltx/en_us_dedes/me.m06.d29:meMA.PostGospelIdiomelon.incipit	@ltx/en_us_dedes/me.m06.d29:meVE.Lity3.incipit
ltx/en_us_dedes/me.m06.d29:meMA.PostGospelIdiomelon.melody	@ltx/en_us_dedes/miscellanea:misc.Idiomelon
ltx/en_us_dedes/me.m06.d29:meMA.PostGospelIdiomelon.mode	@ltx/en_us_dedes/miscellanea:misc.Mode2
ltx/en_us_dedes/me.m06.d29:meMA.PostGospelIdiomelon.text	@ltx/en_us_dedes/me.m06.d29:meVE.Lity3.text
ltx/en_us_dedes/me.m06.d29:meSV.AposGlory.incipit	…
ltx/en_us_dedes/me.m06.d29:meSV.AposGlory.melody	@ltx/en_us_dedes/he.a.m6:heAU.TriimerosAnestis.name
ltx/en_us_dedes/me.m06.d29:meSV.AposGlory.mode	@ltx/en_us_dedes/miscellanea:misc.Mode6
ltx/en_us_dedes/me.m06.d29:meSV.AposGlory.text	
ltx/en_us_dedes/me.m06.d29:meSV.Aposticha1.incipit	…
ltx/en_us_dedes/me.m06.d29:meSV.Aposticha1.melody	@ltx/en_us_dedes/he.a.m6:heAU.TriimerosAnestis.name
ltx/en_us_dedes/me.m06.d29:meSV.Aposticha1.mode	@ltx/en_us_dedes/miscellanea:misc.Mode6
ltx/en_us_dedes/me.m06.d29:meSV.Aposticha1.text	
ltx/en_us_dedes/me.m06.d29:meSV.Aposticha2.incipit	…
ltx/en_us_dedes/me.m06.d29:meSV.Aposticha2.melody	@ltx/en_us_dedes/he.a.m6:heAU.TriimerosAnestis.name
ltx/en_us_dedes/me.m06.d29:meSV.Aposticha2.mode	@ltx/en_us_dedes/miscellanea:misc.Mode6
ltx/en_us_dedes/me.m06.d29:meSV.Aposticha2.text	
ltx/en_us_dedes/me.m06.d29:meSV.Aposticha3.incipit	…
ltx/en_us_dedes/me.m06.d29:meSV.Aposticha3.melody	@ltx/en_us_dedes/he.a.m6:heAU.TriimerosAnestis.name
ltx/en_us_dedes/me.m06.d29:meSV.Aposticha3.mode	@ltx/en_us_dedes/miscellanea:misc.Mode6
ltx/en_us_dedes/me.m06.d29:meSV.Aposticha3.text	
ltx/en_us_dedes/me.m06.d29:meSV.SticBoth.incipit	@ltx/en_us_dedes/ho.ho23:hoCA.Troparion7.incipit
ltx/en_us_dedes/me.m06.d29:meSV.SticBoth.melody	
ltx/en_us_dedes/me.m06.d29:meSV.SticBoth.mode	@ltx/en_us_dedes/miscellanea:misc.Mode2
ltx/en_us_dedes/me.m06.d29:meSV.SticBoth.text	@ltx/en_us_dedes/ho.ho23:hoCA.Troparion7.text
ltx/en_us_dedes/me.m06.d29:meSV.SticGlory.incipit	…
ltx/en_us_dedes/me.m06.d29:meSV.SticGlory.melody	@ltx/en_us_dedes/miscellanea:misc.Idiomelon
ltx/en_us_dedes/me.m06.d29:meSV.SticGlory.mode	@ltx/en_us_dedes/miscellanea:misc.Mode2
ltx/en_us_dedes/me.m06.d29:meSV.SticGlory.poet	@ltx/en_us_dedes/poets:po.Germanou
ltx/en_us_dedes/me.m06.d29:meSV.SticGlory.text	
ltx/en_us_dedes/me.m06.d29:meSV.Stichera1.incipit	…
ltx/en_us_dedes/me.m06.d29:meSV.Stichera1.melody	@ltx/en_us_dedes/he.a.m4:heAU.EdokasSimeiosin.name
ltx/en_us_dedes/me.m06.d29:meSV.Stichera1.mode	@ltx/en_us_dedes/miscellanea:misc.Mode4
ltx/en_us_dedes/me.m06.d29:meSV.Stichera1.text	
ltx/en_us_dedes/me.m06.d29:meSV.Stichera2.incipit	…
ltx/en_us_dedes/me.m06.d29:meSV.Stichera2.melody	@ltx/en_us_dedes/he.a.m4:heAU.EdokasSimeiosin.name
ltx/en_us_dedes/me.m06.d29:meSV.Stichera2.mode	@ltx/en_us_dedes/miscellanea:misc.Mode4
ltx/en_us_dedes/me.m06.d29:meSV.Stichera2.text	
ltx/en_us_dedes/me.m06.d29:meSV.Stichera3.incipit	…
ltx/en_us_dedes/me.m06.d29:meSV.Stichera3.melody	@ltx/en_us_dedes/he.a.m4:heAU.EdokasSimeiosin.name
ltx/en_us_dedes/me.m06.d29:meSV.Stichera3.mode	@ltx/en_us_dedes/miscellanea:misc.Mode4
ltx/en_us_dedes/me.m06.d29:meSV.Stichera3.text	
ltx/en_us_dedes/me.m06.d29:meVE.Apolytikion1.incipit	@ltx/en_us_dedes/oc.m4.d5:ocMA.Kathisma11.incipit
ltx/en_us_dedes/me.m06.d29:meVE.Apolytikion1.melody	
ltx/en_us_dedes/me.m06.d29:meVE.Apolytikion1.mode	@ltx/en_us_dedes/miscellanea:misc.Mode4
ltx/en_us_dedes/me.m06.d29:meVE.Apolytikion1.text	@ltx/en_us_dedes/oc.m4.d5:ocMA.Kathisma11.text
ltx/en_us_dedes/me.m06.d29:meVE.AposGlory.incipit	A joyous feast is shining…
ltx/en_us_dedes/me.m06.d29:meVE.AposGlory.melody	@ltx/en_us_dedes/miscellanea:misc.Idiomelon
ltx/en_us_dedes/me.m06.d29:meVE.AposGlory.mode	@ltx/en_us_dedes/miscellanea:misc.Mode6
ltx/en_us_dedes/me.m06.d29:meVE.AposGlory.poet	@ltx/en_us_dedes/poets:po.EfraimKarias
ltx/en_us_dedes/me.m06.d29:meVE.AposGlory.text	A joyous feast is shining on the whole world today. It is the preeminent commemoration of the most wise and paramount Apostles, Peter and Paul. O brethren, let us also joyfully celebrate this solemn day, with hymns and poetry, and let us salute them and say, “Rejoice! O Peter, Apostle and genuine friend of your teacher, Christ our God! Rejoice! O beloved Paul, preacher of the faith and teacher of the whole world! As you were both chosen in holiness and have confidence in prayer, earnestly entreat Christ our God, for the salvation of our souls.”
ltx/en_us_dedes/me.m06.d29:meVE.AposTheotokion.incipit	@ltx/en_us_dedes/he.o:heOT.TheotokeSyEi.incipit
ltx/en_us_dedes/me.m06.d29:meVE.AposTheotokion.melody	@ltx/en_us_dedes/he.o:heOT.TheotokeSyEi.name
ltx/en_us_dedes/me.m06.d29:meVE.AposTheotokion.mode	@ltx/en_us_dedes/miscellanea:misc.Mode6
ltx/en_us_dedes/me.m06.d29:meVE.AposTheotokion.text	@ltx/en_us_dedes/he.o:heOT.TheotokeSyEiApostolon.text
ltx/en_us_dedes/me.m06.d29:meVE.Aposticha1.incipit	…
ltx/en_us_dedes/me.m06.d29:meVE.Aposticha1.melody	@ltx/en_us_dedes/miscellanea:misc.Idiomelon
ltx/en_us_dedes/me.m06.d29:meVE.Aposticha1.mode	@ltx/en_us_dedes/miscellanea:misc.Mode1
ltx/en_us_dedes/me.m06.d29:meVE.Aposticha1.poet	@ltx/en_us_dedes/poets:po.AndreouKritis
ltx/en_us_dedes/me.m06.d29:meVE.Aposticha1.text	
ltx/en_us_dedes/me.m06.d29:meVE.Aposticha2.incipit	…
ltx/en_us_dedes/me.m06.d29:meVE.Aposticha2.melody	@ltx/en_us_dedes/miscellanea:misc.Idiomelon
ltx/en_us_dedes/me.m06.d29:meVE.Aposticha2.mode	@ltx/en_us_dedes/miscellanea:misc.Mode1
ltx/en_us_dedes/me.m06.d29:meVE.Aposticha2.text	
ltx/en_us_dedes/me.m06.d29:meVE.Aposticha3.incipit	…
ltx/en_us_dedes/me.m06.d29:meVE.Aposticha3.melody	@ltx/en_us_dedes/miscellanea:misc.Idiomelon
ltx/en_us_dedes/me.m06.d29:meVE.Aposticha3.mode	@ltx/en_us_dedes/miscellanea:misc.Mode1
ltx/en_us_dedes/me.m06.d29:meVE.Aposticha3.text	
ltx/en_us_dedes/me.m06.d29:meVE.Lity1.incipit	…
ltx/en_us_dedes/me.m06.d29:meVE.Lity1.melody	@ltx/en_us_dedes/miscellanea:misc.Idiomelon
ltx/en_us_dedes/me.m06.d29:meVE.Lity1.mode	@ltx/en_us_dedes/miscellanea:misc.Mode2
ltx/en_us_dedes/me.m06.d29:meVE.Lity1.poet	@ltx/en_us_dedes/poets:po.AndreouIerosolymitou
ltx/en_us_dedes/me.m06.d29:meVE.Lity1.text	
ltx/en_us_dedes/me.m06.d29:meVE.Lity2.incipit	…
ltx/en_us_dedes/me.m06.d29:meVE.Lity2.melody	@ltx/en_us_dedes/miscellanea:misc.Idiomelon
ltx/en_us_dedes/me.m06.d29:meVE.Lity2.mode	@ltx/en_us_dedes/miscellanea:misc.Mode2
ltx/en_us_dedes/me.m06.d29:meVE.Lity2.poet	@ltx/en_us_dedes/poets:po.Arseniou
ltx/en_us_dedes/me.m06.d29:meVE.Lity2.text	
ltx/en_us_dedes/me.m06.d29:meVE.Lity3.incipit	Peter, chief of the glorious…
ltx/en_us_dedes/me.m06.d29:meVE.Lity3.melody	@ltx/en_us_dedes/miscellanea:misc.Idiomelon
ltx/en_us_dedes/me.m06.d29:meVE.Lity3.mode	@ltx/en_us_dedes/miscellanea:misc.Mode2
ltx/en_us_dedes/me.m06.d29:meVE.Lity3.poet	@ltx/en_us_dedes/poets:po.Germanou
ltx/en_us_dedes/me.m06.d29:meVE.Lity3.text	Peter, chief of the glorious Apostles and rock of the Faith; and sweet-voiced Paul, preacher and beacon of the holy churches. Being present at the divine throne, make intercession on our behalf.
ltx/en_us_dedes/me.m06.d29:meVE.Lity4.incipit	…
ltx/en_us_dedes/me.m06.d29:meVE.Lity4.melody	@ltx/en_us_dedes/miscellanea:misc.Idiomelon
ltx/en_us_dedes/me.m06.d29:meVE.Lity4.mode	@ltx/en_us_dedes/miscellanea:misc.Mode2
ltx/en_us_dedes/me.m06.d29:meVE.Lity4.text	
ltx/en_us_dedes/me.m06.d29:meVE.Lity5.incipit	…
ltx/en_us_dedes/me.m06.d29:meVE.Lity5.melody	@ltx/en_us_dedes/miscellanea:misc.Idiomelon
ltx/en_us_dedes/me.m06.d29:meVE.Lity5.mode	@ltx/en_us_dedes/miscellanea:misc.Mode3
ltx/en_us_dedes/me.m06.d29:meVE.Lity5.poet	@ltx/en_us_dedes/poets:po.IoannouMonachou
ltx/en_us_dedes/me.m06.d29:meVE.Lity5.text	
ltx/en_us_dedes/me.m06.d29:meVE.LityBoth.incipit	@ltx/en_us_dedes/oc.m5.d3:ocVE.AposTheotokion.incipit
ltx/en_us_dedes/me.m06.d29:meVE.LityBoth.melody	
ltx/en_us_dedes/me.m06.d29:meVE.LityBoth.mode	@ltx/en_us_dedes/miscellanea:misc.Mode5
ltx/en_us_dedes/me.m06.d29:meVE.LityBoth.text	@ltx/en_us_dedes/oc.m5.d3:ocVE.AposTheotokion.text
ltx/en_us_dedes/me.m06.d29:meVE.LityGlory.incipit	As the Wisdom of God…
ltx/en_us_dedes/me.m06.d29:meVE.LityGlory.melody	@ltx/en_us_dedes/miscellanea:misc.Idiomelon
ltx/en_us_dedes/me.m06.d29:meVE.LityGlory.mode	@ltx/en_us_dedes/miscellanea:misc.Mode5
ltx/en_us_dedes/me.m06.d29:meVE.LityGlory.poet	@ltx/en_us_dedes/poets:po.Vyzantiou
ltx/en_us_dedes/me.m06.d29:meVE.LityGlory.text	As the Wisdom of God, the co-eternal Logos of the Father, said of old in the Gospels, you, O all-praised Apostles, are fruitful vines, whose branches bear ripe and delicious grapes. When we the faithful eat of them, they leave a pleasing taste. O Peter, the rock of faith, and Paul, the pride of the civilized world, firmly support the flock that you procured by your teachings.
ltx/en_us_dedes/me.m06.d29:meVE.SticGlory.incipit	Three times, Christ asked Peter…
ltx/en_us_dedes/me.m06.d29:meVE.SticGlory.melody	@ltx/en_us_dedes/miscellanea:misc.Idiomelon
ltx/en_us_dedes/me.m06.d29:meVE.SticGlory.mode	@ltx/en_us_dedes/miscellanea:misc.Mode4
ltx/en_us_dedes/me.m06.d29:meVE.SticGlory.poet	@ltx/en_us_dedes/poets:po.IoannouMonachou
ltx/en_us_dedes/me.m06.d29:meVE.SticGlory.text	Three times, Christ asked Peter, “Do you love me?” In this way He remedied the three denials. And Simon replied to Him, who knows all secrets, “Lord, You know everything. You are aware of everything. You know that I love You.” Then the Savior said to him, “Tend my sheep. Tend my chosen. Tend my lambs, which by my blood I have made my own for their salvation.” O Apostle, whom God called blessed, entreat Him to grant us His great mercy.
ltx/en_us_dedes/me.m06.d29:meVE.SticTheotokion.incipit	@ltx/en_us_dedes/oc.m4.d1:ocVE.SticTheotokion.incipit
ltx/en_us_dedes/me.m06.d29:meVE.SticTheotokion.melody	
ltx/en_us_dedes/me.m06.d29:meVE.SticTheotokion.mode	@ltx/en_us_dedes/miscellanea:misc.Mode4
ltx/en_us_dedes/me.m06.d29:meVE.SticTheotokion.text	@ltx/en_us_dedes/oc.m4.d1:ocVE.SticTheotokion.text
ltx/en_us_dedes/me.m06.d29:meVE.Stichera01.greekmelody	@ltx/en_us_dedes/he.a.m2:heAU.PoioisEffimionStemmasin.greekname
ltx/en_us_dedes/me.m06.d29:meVE.Stichera01.incipit	@ltx/en_us_dedes/he.a.m2:heAU.PoioisEffimionStemmasin.incipit
ltx/en_us_dedes/me.m06.d29:meVE.Stichera01.melody	@ltx/en_us_dedes/he.a.m2:heAU.PoioisEffimionStemmasin.melody
ltx/en_us_dedes/me.m06.d29:meVE.Stichera01.mode	@ltx/en_us_dedes/miscellanea:misc.Mode2
ltx/en_us_dedes/me.m06.d29:meVE.Stichera01.poet	@ltx/en_us_dedes/poets:po.AndreouPyrou
ltx/en_us_dedes/me.m06.d29:meVE.Stichera01.text	@ltx/en_us_dedes/he.a.m2:heAU.PoioisEffimionStemmasin.text
ltx/en_us_dedes/me.m06.d29:meVE.Stichera02.incipit	…
ltx/en_us_dedes/me.m06.d29:meVE.Stichera02.melody	@ltx/en_us_dedes/he.a.m2:heAU.PoioisEffimionStemmasin.name
ltx/en_us_dedes/me.m06.d29:meVE.Stichera02.mode	@ltx/en_us_dedes/miscellanea:misc.Mode2
ltx/en_us_dedes/me.m06.d29:meVE.Stichera02.text	
ltx/en_us_dedes/me.m06.d29:meVE.Stichera03.incipit	…
ltx/en_us_dedes/me.m06.d29:meVE.Stichera03.melody	@ltx/en_us_dedes/he.a.m2:heAU.PoioisEffimionStemmasin.name
ltx/en_us_dedes/me.m06.d29:meVE.Stichera03.mode	@ltx/en_us_dedes/miscellanea:misc.Mode2
ltx/en_us_dedes/me.m06.d29:meVE.Stichera03.text	
