ltx/en_us_dedes/sy.m11.d07:syMA.commemoration01.couplet1.title	@ltx/en_us_dedes/titles:ti.Verses
ltx/en_us_dedes/sy.m11.d07:syMA.commemoration01.couplet1.verse1	
ltx/en_us_dedes/sy.m11.d07:syMA.commemoration01.couplet1.verse2	
ltx/en_us_dedes/sy.m11.d07:syMA.commemoration01.couplet2.verse1	
ltx/en_us_dedes/sy.m11.d07:syMA.commemoration01.couplet2.verse2	
ltx/en_us_dedes/sy.m11.d07:syMA.commemoration01.narration.p01	
ltx/en_us_dedes/sy.m11.d07:syMA.commemoration01.single1	
ltx/en_us_dedes/sy.m11.d07:syMA.commemoration01.text	On November 7, we commemorate the holy 33 Martyrs of Melitini, Hieron and the rest.
ltx/en_us_dedes/sy.m11.d07:syMA.commemoration02.couplet1.title	@ltx/en_us_dedes/titles:ti.Verses
ltx/en_us_dedes/sy.m11.d07:syMA.commemoration02.couplet1.verse1	
ltx/en_us_dedes/sy.m11.d07:syMA.commemoration02.couplet1.verse2	
ltx/en_us_dedes/sy.m11.d07:syMA.commemoration02.text	On this day we also commemorate our devout father Lazaros the Wonder-worker, who lived as an ascetic on Mount Galesion.
ltx/en_us_dedes/sy.m11.d07:syMA.commemoration03.couplet1.title	@ltx/en_us_dedes/titles:ti.Verses
ltx/en_us_dedes/sy.m11.d07:syMA.commemoration03.couplet1.verse1	
ltx/en_us_dedes/sy.m11.d07:syMA.commemoration03.couplet1.verse2	
ltx/en_us_dedes/sy.m11.d07:syMA.commemoration03.couplet2.verse1	
ltx/en_us_dedes/sy.m11.d07:syMA.commemoration03.couplet2.verse2	
ltx/en_us_dedes/sy.m11.d07:syMA.commemoration03.narration.p01	
ltx/en_us_dedes/sy.m11.d07:syMA.commemoration03.text	On this day we commemorate the holy Martyrs Melasippus, Cassiani, and Anthony.
ltx/en_us_dedes/sy.m11.d07:syMA.commemoration04.couplet1.title	@ltx/en_us_dedes/titles:ti.Verses
ltx/en_us_dedes/sy.m11.d07:syMA.commemoration04.couplet1.verse1	
ltx/en_us_dedes/sy.m11.d07:syMA.commemoration04.couplet1.verse2	
ltx/en_us_dedes/sy.m11.d07:syMA.commemoration04.couplet2.verse1	
ltx/en_us_dedes/sy.m11.d07:syMA.commemoration04.couplet2.verse2	
ltx/en_us_dedes/sy.m11.d07:syMA.commemoration04.narration.p01	
ltx/en_us_dedes/sy.m11.d07:syMA.commemoration04.narration.p02	
ltx/en_us_dedes/sy.m11.d07:syMA.commemoration04.text	On this day we also commemorate the holy Martyrs Auktos, Taurion, and Thessaloniki.
ltx/en_us_dedes/sy.m11.d07:syMA.commemoration05.couplet1.title	@ltx/en_us_dedes/titles:ti.Verses
ltx/en_us_dedes/sy.m11.d07:syMA.commemoration05.couplet1.verse1	
ltx/en_us_dedes/sy.m11.d07:syMA.commemoration05.couplet1.verse2	
ltx/en_us_dedes/sy.m11.d07:syMA.commemoration05.text	On this day we also commemorate the holy Martyr Athenodoros.
ltx/en_us_dedes/sy.m11.d07:syMA.commemoration06.couplet1.title	@ltx/en_us_dedes/titles:ti.Verses
ltx/en_us_dedes/sy.m11.d07:syMA.commemoration06.couplet1.verse1	
ltx/en_us_dedes/sy.m11.d07:syMA.commemoration06.couplet1.verse2	
ltx/en_us_dedes/sy.m11.d07:syMA.commemoration06.narration.p01	
ltx/en_us_dedes/sy.m11.d07:syMA.commemoration06.text	On this day, the holy Martyr Alexander from Thessaloniki died by the sword.
ltx/en_us_dedes/sy.m11.d07:syMA.lastline	By the intercessions of Your Saints, O God, have mercy on us. Amen.
