ltx/en_us_dedes/oc.m2.d2:ocBK.ModeNaked	@ltx/en_us_dedes/miscellanea:misc.Mode2.naked
ltx/en_us_dedes/oc.m2.d2:ocLI.Beatitudes1.incipit	@ltx/en_us_dedes/oc.m2.d1:ocLI.Beatitudes1.incipit
ltx/en_us_dedes/oc.m2.d2:ocLI.Beatitudes1.melody	
ltx/en_us_dedes/oc.m2.d2:ocLI.Beatitudes1.mode	@ltx/en_us_dedes/miscellanea:misc.Mode2
ltx/en_us_dedes/oc.m2.d2:ocLI.Beatitudes1.text	@ltx/en_us_dedes/oc.m2.d1:ocLI.Beatitudes1.text
ltx/en_us_dedes/oc.m2.d2:ocLI.Beatitudes2.incipit	Lord, I pray You to…
ltx/en_us_dedes/oc.m2.d2:ocLI.Beatitudes2.melody	
ltx/en_us_dedes/oc.m2.d2:ocLI.Beatitudes2.mode	@ltx/en_us_dedes/miscellanea:misc.Mode2
ltx/en_us_dedes/oc.m2.d2:ocLI.Beatitudes2.text	I implore You to overlook my offenses and many sins; * Grant me to partake of Your light, * benevolent Lord my God.
ltx/en_us_dedes/oc.m2.d2:ocLI.Beatitudes3.incipit	Hosts of Angels implore You…
ltx/en_us_dedes/oc.m2.d2:ocLI.Beatitudes3.melody	
ltx/en_us_dedes/oc.m2.d2:ocLI.Beatitudes3.mode	@ltx/en_us_dedes/miscellanea:misc.Mode2
ltx/en_us_dedes/oc.m2.d2:ocLI.Beatitudes3.text	Hosts of Angels implore You, Lord, on behalf of believers all, * who with love and longing sing sacred hymns extolling You.
ltx/en_us_dedes/oc.m2.d2:ocLI.Beatitudes4.incipit	Most benevolent Jesus Christ, by…
ltx/en_us_dedes/oc.m2.d2:ocLI.Beatitudes4.melody	
ltx/en_us_dedes/oc.m2.d2:ocLI.Beatitudes4.mode	@ltx/en_us_dedes/miscellanea:misc.Mode2
ltx/en_us_dedes/oc.m2.d2:ocLI.Beatitudes4.text	Most benevolent Jesus Christ, by the prayers of Your martyr saints, * be forgiving to us in that hour on Judgment Day.
ltx/en_us_dedes/oc.m2.d2:ocLI.BeatitudesT.incipit	O pure Virgin the holy…
ltx/en_us_dedes/oc.m2.d2:ocLI.BeatitudesT.melody	
ltx/en_us_dedes/oc.m2.d2:ocLI.BeatitudesT.mode	@ltx/en_us_dedes/miscellanea:misc.Mode2
ltx/en_us_dedes/oc.m2.d2:ocLI.BeatitudesT.text	O pure Virgin the holy Fruit of your womb made Adam and Eve, * who had slipped because of fruit, citizens of Paradise.
ltx/en_us_dedes/oc.m2.d2:ocLI.BeatitudesTr.incipit	@ltx/en_us_dedes/oc.m2.d1:ocLI.BeatitudesTr.incipit
ltx/en_us_dedes/oc.m2.d2:ocLI.BeatitudesTr.melody	
ltx/en_us_dedes/oc.m2.d2:ocLI.BeatitudesTr.mode	@ltx/en_us_dedes/miscellanea:misc.Mode2
ltx/en_us_dedes/oc.m2.d2:ocLI.BeatitudesTr.text	@ltx/en_us_dedes/oc.m2.d1:ocLI.BeatitudesTr.text
ltx/en_us_dedes/oc.m2.d2:ocLI.MM.Beatitudes1234TrTas78910GB.text	@ltx/en_us_dedes/properties:media.key
ltx/en_us_dedes/oc.m2.d2:ocMA.ApolTheotokion.incipit	Holy Mother of the immaculate…
ltx/en_us_dedes/oc.m2.d2:ocMA.ApolTheotokion.melody	
ltx/en_us_dedes/oc.m2.d2:ocMA.ApolTheotokion.mode	@ltx/en_us_dedes/miscellanea:misc.Mode2
ltx/en_us_dedes/oc.m2.d2:ocMA.ApolTheotokion.text	Holy Mother of the immaculate Light, we honor you with angelic hymns, and magnify you piously.
ltx/en_us_dedes/oc.m2.d2:ocMA.AposTheotokion.incipit	Like a fruitful olive tree…
ltx/en_us_dedes/oc.m2.d2:ocMA.AposTheotokion.melody	
ltx/en_us_dedes/oc.m2.d2:ocMA.AposTheotokion.mode	@ltx/en_us_dedes/miscellanea:misc.Mode2
ltx/en_us_dedes/oc.m2.d2:ocMA.AposTheotokion.text	Like a fruitful olive tree, the Virgin produced You, the fruit of life, to bear fruit for the world, namely Your great and abundant mercy.
ltx/en_us_dedes/oc.m2.d2:ocMA.Aposticha1.incipit	When I think about the…
ltx/en_us_dedes/oc.m2.d2:ocMA.Aposticha1.melody	
ltx/en_us_dedes/oc.m2.d2:ocMA.Aposticha1.mode	@ltx/en_us_dedes/miscellanea:misc.Mode2
ltx/en_us_dedes/oc.m2.d2:ocMA.Aposticha1.text	When I think about the unnatural vices I have committed, I imitate the Publican, the weeping Harlot, and the Prodigal Son, and I have recourse to your tender mercies. And so I fall before you, O merciful Lord, and pray before You condemn me, that You spare me and have mercy on me.
ltx/en_us_dedes/oc.m2.d2:ocMA.Aposticha2.incipit	Overlook my transgressions, O Lord…
ltx/en_us_dedes/oc.m2.d2:ocMA.Aposticha2.melody	
ltx/en_us_dedes/oc.m2.d2:ocMA.Aposticha2.mode	@ltx/en_us_dedes/miscellanea:misc.Mode2
ltx/en_us_dedes/oc.m2.d2:ocMA.Aposticha2.text	Overlook my transgressions, O Lord born of a Virgin, and purify my heart, and make it temple of Your Holy Spirit. I implore You whose mercy is immense, that You do not reject me from Your presence.
ltx/en_us_dedes/oc.m2.d2:ocMA.Aposticha3.incipit	O medal-winning Martyrs, for Christ…
ltx/en_us_dedes/oc.m2.d2:ocMA.Aposticha3.melody	
ltx/en_us_dedes/oc.m2.d2:ocMA.Aposticha3.mode	@ltx/en_us_dedes/miscellanea:misc.Mode2
ltx/en_us_dedes/oc.m2.d2:ocMA.Aposticha3.text	O medal-winning Martyrs, for Christ you suffered to the point of death. Now your souls are in heaven in the hand of God, and your relics are processed throughout the world. Clergy and world leaders venerate them, and all people rejoice, and we shout the well known verse: “Precious sleep in the sight of the Lord is the death of his Saints.”
ltx/en_us_dedes/oc.m2.d2:ocMA.C1.acrostic.notice1	
ltx/en_us_dedes/oc.m2.d2:ocMA.C1.acrostic.text	
ltx/en_us_dedes/oc.m2.d2:ocMA.C1.acrostic.title	Canon of Compunction.
ltx/en_us_dedes/oc.m2.d2:ocMA.C1.poet	@ltx/en_us_dedes/poets:po.KyriouIosif
ltx/en_us_dedes/oc.m2.d2:ocMA.C2.acrostic.notice1	
ltx/en_us_dedes/oc.m2.d2:ocMA.C2.acrostic.text	
ltx/en_us_dedes/oc.m2.d2:ocMA.C2.acrostic.title	Canon for the Bodiless Hosts.
ltx/en_us_dedes/oc.m2.d2:ocMA.Kathisma11.incipit	…
ltx/en_us_dedes/oc.m2.d2:ocMA.Kathisma11.melody	
ltx/en_us_dedes/oc.m2.d2:ocMA.Kathisma11.mode	@ltx/en_us_dedes/miscellanea:misc.Mode2
ltx/en_us_dedes/oc.m2.d2:ocMA.Kathisma11.text	
ltx/en_us_dedes/oc.m2.d2:ocMA.Kathisma12.incipit	…
ltx/en_us_dedes/oc.m2.d2:ocMA.Kathisma12.melody	
ltx/en_us_dedes/oc.m2.d2:ocMA.Kathisma12.mode	@ltx/en_us_dedes/miscellanea:misc.Mode2
ltx/en_us_dedes/oc.m2.d2:ocMA.Kathisma12.text	
ltx/en_us_dedes/oc.m2.d2:ocMA.Kathisma13.greekmelody	@ltx/en_us_dedes/he.a.m2:heAU.EfsplagchniasYparchousa.greekname
ltx/en_us_dedes/oc.m2.d2:ocMA.Kathisma13.incipit	@ltx/en_us_dedes/he.a.m2:heAU.EfsplagchniasYparchousa.incipit
ltx/en_us_dedes/oc.m2.d2:ocMA.Kathisma13.melody	@ltx/en_us_dedes/he.a.m2:heAU.EfsplagchniasYparchousa.melody
ltx/en_us_dedes/oc.m2.d2:ocMA.Kathisma13.mode	@ltx/en_us_dedes/miscellanea:misc.Mode2
ltx/en_us_dedes/oc.m2.d2:ocMA.Kathisma13.text	@ltx/en_us_dedes/he.a.m2:heAU.EfsplagchniasYparchousa.text
ltx/en_us_dedes/oc.m2.d2:ocMA.Kathisma21.incipit	…
ltx/en_us_dedes/oc.m2.d2:ocMA.Kathisma21.melody	
ltx/en_us_dedes/oc.m2.d2:ocMA.Kathisma21.mode	@ltx/en_us_dedes/miscellanea:misc.Mode2
ltx/en_us_dedes/oc.m2.d2:ocMA.Kathisma21.text	
ltx/en_us_dedes/oc.m2.d2:ocMA.Kathisma22.incipit	…
ltx/en_us_dedes/oc.m2.d2:ocMA.Kathisma22.melody	
ltx/en_us_dedes/oc.m2.d2:ocMA.Kathisma22.mode	@ltx/en_us_dedes/miscellanea:misc.Mode2
ltx/en_us_dedes/oc.m2.d2:ocMA.Kathisma22.text	
ltx/en_us_dedes/oc.m2.d2:ocMA.Kathisma23.incipit	We magnify you, O Theotokos…
ltx/en_us_dedes/oc.m2.d2:ocMA.Kathisma23.melody	
ltx/en_us_dedes/oc.m2.d2:ocMA.Kathisma23.mode	@ltx/en_us_dedes/miscellanea:misc.Mode2
ltx/en_us_dedes/oc.m2.d2:ocMA.Kathisma23.text	We magnify you, O Theotokos, and we cry out: Rejoice! You are the gate that was shut; and through you Paradise of long ago was opened to humanity.
ltx/en_us_dedes/oc.m2.d2:ocMA.Kathisma31.greekmelody	@ltx/en_us_dedes/he.a.m2:heAU.EfsplagchniasYparchousa.greekname
ltx/en_us_dedes/oc.m2.d2:ocMA.Kathisma31.incipit	…
ltx/en_us_dedes/oc.m2.d2:ocMA.Kathisma31.melody	@ltx/en_us_dedes/he.a.m2:heAU.EfsplagchniasYparchousa.name
ltx/en_us_dedes/oc.m2.d2:ocMA.Kathisma31.mode	@ltx/en_us_dedes/miscellanea:misc.Mode2
ltx/en_us_dedes/oc.m2.d2:ocMA.Kathisma31.text	
ltx/en_us_dedes/oc.m2.d2:ocMA.Kathisma32.incipit	…
ltx/en_us_dedes/oc.m2.d2:ocMA.Kathisma32.melody	
ltx/en_us_dedes/oc.m2.d2:ocMA.Kathisma32.mode	@ltx/en_us_dedes/miscellanea:misc.Mode2
ltx/en_us_dedes/oc.m2.d2:ocMA.Kathisma32.text	
ltx/en_us_dedes/oc.m2.d2:ocMA.Kathisma33.incipit	…
ltx/en_us_dedes/oc.m2.d2:ocMA.Kathisma33.melody	
ltx/en_us_dedes/oc.m2.d2:ocMA.Kathisma33.mode	@ltx/en_us_dedes/miscellanea:misc.Mode2
ltx/en_us_dedes/oc.m2.d2:ocMA.Kathisma33.text	
ltx/en_us_dedes/oc.m2.d2:ocMA.OdeW1C11.incipit	…
ltx/en_us_dedes/oc.m2.d2:ocMA.OdeW1C11.melody	@ltx/en_us_dedes/he.h.m2:heHE.DefteLaoi.name
ltx/en_us_dedes/oc.m2.d2:ocMA.OdeW1C11.mode	@ltx/en_us_dedes/miscellanea:misc.Mode2
ltx/en_us_dedes/oc.m2.d2:ocMA.OdeW1C11.ode	@ltx/en_us_dedes/miscellanea:misc.Ode1
ltx/en_us_dedes/oc.m2.d2:ocMA.OdeW1C11.text	
ltx/en_us_dedes/oc.m2.d2:ocMA.OdeW1C12.incipit	…
ltx/en_us_dedes/oc.m2.d2:ocMA.OdeW1C12.melody	@ltx/en_us_dedes/he.h.m2:heHE.DefteLaoi.name
ltx/en_us_dedes/oc.m2.d2:ocMA.OdeW1C12.mode	@ltx/en_us_dedes/miscellanea:misc.Mode2
ltx/en_us_dedes/oc.m2.d2:ocMA.OdeW1C12.ode	@ltx/en_us_dedes/miscellanea:misc.Ode1
ltx/en_us_dedes/oc.m2.d2:ocMA.OdeW1C12.text	
ltx/en_us_dedes/oc.m2.d2:ocMA.OdeW1C13.incipit	…
ltx/en_us_dedes/oc.m2.d2:ocMA.OdeW1C13.melody	@ltx/en_us_dedes/he.h.m2:heHE.DefteLaoi.name
ltx/en_us_dedes/oc.m2.d2:ocMA.OdeW1C13.mode	@ltx/en_us_dedes/miscellanea:misc.Mode2
ltx/en_us_dedes/oc.m2.d2:ocMA.OdeW1C13.ode	@ltx/en_us_dedes/miscellanea:misc.Ode1
ltx/en_us_dedes/oc.m2.d2:ocMA.OdeW1C13.text	
ltx/en_us_dedes/oc.m2.d2:ocMA.OdeW1C14.incipit	…
ltx/en_us_dedes/oc.m2.d2:ocMA.OdeW1C14.melody	@ltx/en_us_dedes/he.h.m2:heHE.DefteLaoi.name
ltx/en_us_dedes/oc.m2.d2:ocMA.OdeW1C14.mode	@ltx/en_us_dedes/miscellanea:misc.Mode2
ltx/en_us_dedes/oc.m2.d2:ocMA.OdeW1C14.ode	@ltx/en_us_dedes/miscellanea:misc.Ode1
ltx/en_us_dedes/oc.m2.d2:ocMA.OdeW1C14.text	
ltx/en_us_dedes/oc.m2.d2:ocMA.OdeW1C1H.greekmelody	@ltx/en_us_dedes/he.h.m2:heHE.DefteLaoi.greekname
ltx/en_us_dedes/oc.m2.d2:ocMA.OdeW1C1H.incipit	@ltx/en_us_dedes/he.h.m2:heHE.DefteLaoi.incipit
ltx/en_us_dedes/oc.m2.d2:ocMA.OdeW1C1H.melody	@ltx/en_us_dedes/he.h.m2:heHE.DefteLaoi.melody
ltx/en_us_dedes/oc.m2.d2:ocMA.OdeW1C1H.mode	@ltx/en_us_dedes/miscellanea:misc.Mode2
ltx/en_us_dedes/oc.m2.d2:ocMA.OdeW1C1H.ode	@ltx/en_us_dedes/miscellanea:misc.Ode1
ltx/en_us_dedes/oc.m2.d2:ocMA.OdeW1C1H.text	@ltx/en_us_dedes/he.h.m2:heHE.DefteLaoi.text
ltx/en_us_dedes/oc.m2.d2:ocMA.OdeW1C1T.incipit	…
ltx/en_us_dedes/oc.m2.d2:ocMA.OdeW1C1T.melody	@ltx/en_us_dedes/he.h.m2:heHE.DefteLaoi.name
ltx/en_us_dedes/oc.m2.d2:ocMA.OdeW1C1T.mode	@ltx/en_us_dedes/miscellanea:misc.Mode2
ltx/en_us_dedes/oc.m2.d2:ocMA.OdeW1C1T.ode	@ltx/en_us_dedes/miscellanea:misc.Ode1
ltx/en_us_dedes/oc.m2.d2:ocMA.OdeW1C1T.text	
ltx/en_us_dedes/oc.m2.d2:ocMA.OdeW1C21.greekmelody	@ltx/en_us_dedes/he.h.m2:heHE.AtriptonAsynithi.greekname
ltx/en_us_dedes/oc.m2.d2:ocMA.OdeW1C21.incipit	…
ltx/en_us_dedes/oc.m2.d2:ocMA.OdeW1C21.melody	@ltx/en_us_dedes/he.h.m2:heHE.AtriptonAsynithi.name
ltx/en_us_dedes/oc.m2.d2:ocMA.OdeW1C21.mode	@ltx/en_us_dedes/miscellanea:misc.Mode2
ltx/en_us_dedes/oc.m2.d2:ocMA.OdeW1C21.ode	@ltx/en_us_dedes/miscellanea:misc.Ode1
ltx/en_us_dedes/oc.m2.d2:ocMA.OdeW1C21.text	
ltx/en_us_dedes/oc.m2.d2:ocMA.OdeW1C22.incipit	…
ltx/en_us_dedes/oc.m2.d2:ocMA.OdeW1C22.melody	@ltx/en_us_dedes/he.h.m2:heHE.AtriptonAsynithi.name
ltx/en_us_dedes/oc.m2.d2:ocMA.OdeW1C22.mode	@ltx/en_us_dedes/miscellanea:misc.Mode2
ltx/en_us_dedes/oc.m2.d2:ocMA.OdeW1C22.ode	@ltx/en_us_dedes/miscellanea:misc.Ode1
ltx/en_us_dedes/oc.m2.d2:ocMA.OdeW1C22.text	
ltx/en_us_dedes/oc.m2.d2:ocMA.OdeW1C23.incipit	…
ltx/en_us_dedes/oc.m2.d2:ocMA.OdeW1C23.melody	@ltx/en_us_dedes/he.h.m2:heHE.AtriptonAsynithi.name
ltx/en_us_dedes/oc.m2.d2:ocMA.OdeW1C23.mode	@ltx/en_us_dedes/miscellanea:misc.Mode2
ltx/en_us_dedes/oc.m2.d2:ocMA.OdeW1C23.ode	@ltx/en_us_dedes/miscellanea:misc.Ode1
ltx/en_us_dedes/oc.m2.d2:ocMA.OdeW1C23.text	
ltx/en_us_dedes/oc.m2.d2:ocMA.OdeW1C2T.incipit	…
ltx/en_us_dedes/oc.m2.d2:ocMA.OdeW1C2T.melody	@ltx/en_us_dedes/he.h.m2:heHE.AtriptonAsynithi.name
ltx/en_us_dedes/oc.m2.d2:ocMA.OdeW1C2T.mode	@ltx/en_us_dedes/miscellanea:misc.Mode2
ltx/en_us_dedes/oc.m2.d2:ocMA.OdeW1C2T.ode	@ltx/en_us_dedes/miscellanea:misc.Ode1
ltx/en_us_dedes/oc.m2.d2:ocMA.OdeW1C2T.text	
ltx/en_us_dedes/oc.m2.d2:ocMA.OdeW3C11.incipit	…
ltx/en_us_dedes/oc.m2.d2:ocMA.OdeW3C11.melody	@ltx/en_us_dedes/he.h.m2:heHE.StereosonImasEnSoiKyrie.name
ltx/en_us_dedes/oc.m2.d2:ocMA.OdeW3C11.mode	@ltx/en_us_dedes/miscellanea:misc.Mode2
ltx/en_us_dedes/oc.m2.d2:ocMA.OdeW3C11.ode	@ltx/en_us_dedes/miscellanea:misc.Ode3
ltx/en_us_dedes/oc.m2.d2:ocMA.OdeW3C11.text	
ltx/en_us_dedes/oc.m2.d2:ocMA.OdeW3C12.incipit	…
ltx/en_us_dedes/oc.m2.d2:ocMA.OdeW3C12.melody	@ltx/en_us_dedes/he.h.m2:heHE.StereosonImasEnSoiKyrie.name
ltx/en_us_dedes/oc.m2.d2:ocMA.OdeW3C12.mode	@ltx/en_us_dedes/miscellanea:misc.Mode2
ltx/en_us_dedes/oc.m2.d2:ocMA.OdeW3C12.ode	@ltx/en_us_dedes/miscellanea:misc.Ode3
ltx/en_us_dedes/oc.m2.d2:ocMA.OdeW3C12.text	
ltx/en_us_dedes/oc.m2.d2:ocMA.OdeW3C13.incipit	…
ltx/en_us_dedes/oc.m2.d2:ocMA.OdeW3C13.melody	@ltx/en_us_dedes/he.h.m2:heHE.StereosonImasEnSoiKyrie.name
ltx/en_us_dedes/oc.m2.d2:ocMA.OdeW3C13.mode	@ltx/en_us_dedes/miscellanea:misc.Mode2
ltx/en_us_dedes/oc.m2.d2:ocMA.OdeW3C13.ode	@ltx/en_us_dedes/miscellanea:misc.Ode3
ltx/en_us_dedes/oc.m2.d2:ocMA.OdeW3C13.text	
ltx/en_us_dedes/oc.m2.d2:ocMA.OdeW3C14.incipit	…
ltx/en_us_dedes/oc.m2.d2:ocMA.OdeW3C14.melody	@ltx/en_us_dedes/he.h.m2:heHE.StereosonImasEnSoiKyrie.name
ltx/en_us_dedes/oc.m2.d2:ocMA.OdeW3C14.mode	@ltx/en_us_dedes/miscellanea:misc.Mode2
ltx/en_us_dedes/oc.m2.d2:ocMA.OdeW3C14.ode	@ltx/en_us_dedes/miscellanea:misc.Ode3
ltx/en_us_dedes/oc.m2.d2:ocMA.OdeW3C14.text	
ltx/en_us_dedes/oc.m2.d2:ocMA.OdeW3C1H.greekmelody	@ltx/en_us_dedes/he.h.m2:heHE.StereosonImasEnSoiKyrie.greekname
ltx/en_us_dedes/oc.m2.d2:ocMA.OdeW3C1H.incipit	@ltx/en_us_dedes/he.h.m2:heHE.StereosonImasEnSoiKyrie.incipit
ltx/en_us_dedes/oc.m2.d2:ocMA.OdeW3C1H.melody	@ltx/en_us_dedes/he.h.m2:heHE.StereosonImasEnSoiKyrie.melody
ltx/en_us_dedes/oc.m2.d2:ocMA.OdeW3C1H.mode	@ltx/en_us_dedes/miscellanea:misc.Mode2
ltx/en_us_dedes/oc.m2.d2:ocMA.OdeW3C1H.ode	@ltx/en_us_dedes/miscellanea:misc.Ode1
ltx/en_us_dedes/oc.m2.d2:ocMA.OdeW3C1H.text	@ltx/en_us_dedes/he.h.m2:heHE.StereosonImasEnSoiKyrie.text
ltx/en_us_dedes/oc.m2.d2:ocMA.OdeW3C1T.incipit	…
ltx/en_us_dedes/oc.m2.d2:ocMA.OdeW3C1T.melody	@ltx/en_us_dedes/he.h.m2:heHE.StereosonImasEnSoiKyrie.name
ltx/en_us_dedes/oc.m2.d2:ocMA.OdeW3C1T.mode	@ltx/en_us_dedes/miscellanea:misc.Mode2
ltx/en_us_dedes/oc.m2.d2:ocMA.OdeW3C1T.ode	@ltx/en_us_dedes/miscellanea:misc.Ode3
ltx/en_us_dedes/oc.m2.d2:ocMA.OdeW3C1T.text	
ltx/en_us_dedes/oc.m2.d2:ocMA.OdeW3C21.greekmelody	@ltx/en_us_dedes/he.h.m2:heHE.ToxonSynetriviDynaston.greekname
ltx/en_us_dedes/oc.m2.d2:ocMA.OdeW3C21.incipit	…
ltx/en_us_dedes/oc.m2.d2:ocMA.OdeW3C21.melody	@ltx/en_us_dedes/he.h.m2:heHE.ToxonSynetriviDynaston.name
ltx/en_us_dedes/oc.m2.d2:ocMA.OdeW3C21.mode	@ltx/en_us_dedes/miscellanea:misc.Mode2
ltx/en_us_dedes/oc.m2.d2:ocMA.OdeW3C21.ode	@ltx/en_us_dedes/miscellanea:misc.Ode3
ltx/en_us_dedes/oc.m2.d2:ocMA.OdeW3C21.text	
ltx/en_us_dedes/oc.m2.d2:ocMA.OdeW3C22.incipit	…
ltx/en_us_dedes/oc.m2.d2:ocMA.OdeW3C22.melody	@ltx/en_us_dedes/he.h.m2:heHE.ToxonSynetriviDynaston.name
ltx/en_us_dedes/oc.m2.d2:ocMA.OdeW3C22.mode	@ltx/en_us_dedes/miscellanea:misc.Mode2
ltx/en_us_dedes/oc.m2.d2:ocMA.OdeW3C22.ode	@ltx/en_us_dedes/miscellanea:misc.Ode3
ltx/en_us_dedes/oc.m2.d2:ocMA.OdeW3C22.text	
ltx/en_us_dedes/oc.m2.d2:ocMA.OdeW3C2T.incipit	…
ltx/en_us_dedes/oc.m2.d2:ocMA.OdeW3C2T.melody	@ltx/en_us_dedes/he.h.m2:heHE.ToxonSynetriviDynaston.name
ltx/en_us_dedes/oc.m2.d2:ocMA.OdeW3C2T.mode	@ltx/en_us_dedes/miscellanea:misc.Mode2
ltx/en_us_dedes/oc.m2.d2:ocMA.OdeW3C2T.ode	@ltx/en_us_dedes/miscellanea:misc.Ode3
ltx/en_us_dedes/oc.m2.d2:ocMA.OdeW3C2T.text	
ltx/en_us_dedes/oc.m2.d2:ocMA.OdeW4C11.incipit	…
ltx/en_us_dedes/oc.m2.d2:ocMA.OdeW4C11.melody	@ltx/en_us_dedes/he.h.m2:heHE.YmnoSeAkoi.name
ltx/en_us_dedes/oc.m2.d2:ocMA.OdeW4C11.mode	@ltx/en_us_dedes/miscellanea:misc.Mode2
ltx/en_us_dedes/oc.m2.d2:ocMA.OdeW4C11.ode	@ltx/en_us_dedes/miscellanea:misc.Ode4
ltx/en_us_dedes/oc.m2.d2:ocMA.OdeW4C11.text	
ltx/en_us_dedes/oc.m2.d2:ocMA.OdeW4C12.incipit	…
ltx/en_us_dedes/oc.m2.d2:ocMA.OdeW4C12.melody	@ltx/en_us_dedes/he.h.m2:heHE.YmnoSeAkoi.name
ltx/en_us_dedes/oc.m2.d2:ocMA.OdeW4C12.mode	@ltx/en_us_dedes/miscellanea:misc.Mode2
ltx/en_us_dedes/oc.m2.d2:ocMA.OdeW4C12.ode	@ltx/en_us_dedes/miscellanea:misc.Ode4
ltx/en_us_dedes/oc.m2.d2:ocMA.OdeW4C12.text	
ltx/en_us_dedes/oc.m2.d2:ocMA.OdeW4C13.incipit	…
ltx/en_us_dedes/oc.m2.d2:ocMA.OdeW4C13.melody	@ltx/en_us_dedes/he.h.m2:heHE.YmnoSeAkoi.name
ltx/en_us_dedes/oc.m2.d2:ocMA.OdeW4C13.mode	@ltx/en_us_dedes/miscellanea:misc.Mode2
ltx/en_us_dedes/oc.m2.d2:ocMA.OdeW4C13.ode	@ltx/en_us_dedes/miscellanea:misc.Ode4
ltx/en_us_dedes/oc.m2.d2:ocMA.OdeW4C13.text	
ltx/en_us_dedes/oc.m2.d2:ocMA.OdeW4C14.incipit	…
ltx/en_us_dedes/oc.m2.d2:ocMA.OdeW4C14.melody	@ltx/en_us_dedes/he.h.m2:heHE.YmnoSeAkoi.name
ltx/en_us_dedes/oc.m2.d2:ocMA.OdeW4C14.mode	@ltx/en_us_dedes/miscellanea:misc.Mode2
ltx/en_us_dedes/oc.m2.d2:ocMA.OdeW4C14.ode	@ltx/en_us_dedes/miscellanea:misc.Ode4
ltx/en_us_dedes/oc.m2.d2:ocMA.OdeW4C14.text	
ltx/en_us_dedes/oc.m2.d2:ocMA.OdeW4C15.incipit	…
ltx/en_us_dedes/oc.m2.d2:ocMA.OdeW4C15.melody	@ltx/en_us_dedes/he.h.m2:heHE.YmnoSeAkoi.name
ltx/en_us_dedes/oc.m2.d2:ocMA.OdeW4C15.mode	@ltx/en_us_dedes/miscellanea:misc.Mode2
ltx/en_us_dedes/oc.m2.d2:ocMA.OdeW4C15.ode	@ltx/en_us_dedes/miscellanea:misc.Ode4
ltx/en_us_dedes/oc.m2.d2:ocMA.OdeW4C15.text	
ltx/en_us_dedes/oc.m2.d2:ocMA.OdeW4C1H.greekmelody	@ltx/en_us_dedes/he.h.m2:heHE.YmnoSeAkoi.greekname
ltx/en_us_dedes/oc.m2.d2:ocMA.OdeW4C1H.incipit	@ltx/en_us_dedes/he.h.m2:heHE.YmnoSeAkoi.incipit
ltx/en_us_dedes/oc.m2.d2:ocMA.OdeW4C1H.melody	@ltx/en_us_dedes/he.h.m2:heHE.YmnoSeAkoi.melody
ltx/en_us_dedes/oc.m2.d2:ocMA.OdeW4C1H.mode	@ltx/en_us_dedes/miscellanea:misc.Mode2
ltx/en_us_dedes/oc.m2.d2:ocMA.OdeW4C1H.ode	@ltx/en_us_dedes/miscellanea:misc.Ode4
ltx/en_us_dedes/oc.m2.d2:ocMA.OdeW4C1H.text	@ltx/en_us_dedes/he.h.m2:heHE.YmnoSeAkoi.text
ltx/en_us_dedes/oc.m2.d2:ocMA.OdeW4C1T.incipit	…
ltx/en_us_dedes/oc.m2.d2:ocMA.OdeW4C1T.melody	@ltx/en_us_dedes/he.h.m2:heHE.YmnoSeAkoi.name
ltx/en_us_dedes/oc.m2.d2:ocMA.OdeW4C1T.mode	@ltx/en_us_dedes/miscellanea:misc.Mode2
ltx/en_us_dedes/oc.m2.d2:ocMA.OdeW4C1T.ode	@ltx/en_us_dedes/miscellanea:misc.Ode4
ltx/en_us_dedes/oc.m2.d2:ocMA.OdeW4C1T.text	
ltx/en_us_dedes/oc.m2.d2:ocMA.OdeW4C21.greekmelody	@ltx/en_us_dedes/he.h.m2:heHE.AkikoaKyrieTinEndoxon.greekname
ltx/en_us_dedes/oc.m2.d2:ocMA.OdeW4C21.incipit	…
ltx/en_us_dedes/oc.m2.d2:ocMA.OdeW4C21.melody	@ltx/en_us_dedes/he.h.m2:heHE.AkikoaKyrieTinEndoxon.name
ltx/en_us_dedes/oc.m2.d2:ocMA.OdeW4C21.mode	@ltx/en_us_dedes/miscellanea:misc.Mode2
ltx/en_us_dedes/oc.m2.d2:ocMA.OdeW4C21.ode	@ltx/en_us_dedes/miscellanea:misc.Ode4
ltx/en_us_dedes/oc.m2.d2:ocMA.OdeW4C21.text	
ltx/en_us_dedes/oc.m2.d2:ocMA.OdeW4C22.incipit	…
ltx/en_us_dedes/oc.m2.d2:ocMA.OdeW4C22.melody	@ltx/en_us_dedes/he.h.m2:heHE.AkikoaKyrieTinEndoxon.name
ltx/en_us_dedes/oc.m2.d2:ocMA.OdeW4C22.mode	@ltx/en_us_dedes/miscellanea:misc.Mode2
ltx/en_us_dedes/oc.m2.d2:ocMA.OdeW4C22.ode	@ltx/en_us_dedes/miscellanea:misc.Ode4
ltx/en_us_dedes/oc.m2.d2:ocMA.OdeW4C22.text	
ltx/en_us_dedes/oc.m2.d2:ocMA.OdeW4C23.incipit	…
ltx/en_us_dedes/oc.m2.d2:ocMA.OdeW4C23.melody	@ltx/en_us_dedes/he.h.m2:heHE.AkikoaKyrieTinEndoxon.name
ltx/en_us_dedes/oc.m2.d2:ocMA.OdeW4C23.mode	@ltx/en_us_dedes/miscellanea:misc.Mode2
ltx/en_us_dedes/oc.m2.d2:ocMA.OdeW4C23.ode	@ltx/en_us_dedes/miscellanea:misc.Ode4
ltx/en_us_dedes/oc.m2.d2:ocMA.OdeW4C23.text	
ltx/en_us_dedes/oc.m2.d2:ocMA.OdeW4C2T.incipit	…
ltx/en_us_dedes/oc.m2.d2:ocMA.OdeW4C2T.melody	@ltx/en_us_dedes/he.h.m2:heHE.AkikoaKyrieTinEndoxon.name
ltx/en_us_dedes/oc.m2.d2:ocMA.OdeW4C2T.mode	@ltx/en_us_dedes/miscellanea:misc.Mode2
ltx/en_us_dedes/oc.m2.d2:ocMA.OdeW4C2T.ode	@ltx/en_us_dedes/miscellanea:misc.Ode4
ltx/en_us_dedes/oc.m2.d2:ocMA.OdeW4C2T.text	
ltx/en_us_dedes/oc.m2.d2:ocMA.OdeW5C11.incipit	…
ltx/en_us_dedes/oc.m2.d2:ocMA.OdeW5C11.melody	@ltx/en_us_dedes/he.h.m2:heHE.OTouFotosChorigos.name
ltx/en_us_dedes/oc.m2.d2:ocMA.OdeW5C11.mode	@ltx/en_us_dedes/miscellanea:misc.Mode2
ltx/en_us_dedes/oc.m2.d2:ocMA.OdeW5C11.ode	@ltx/en_us_dedes/miscellanea:misc.Ode5
ltx/en_us_dedes/oc.m2.d2:ocMA.OdeW5C11.text	
ltx/en_us_dedes/oc.m2.d2:ocMA.OdeW5C12.incipit	…
ltx/en_us_dedes/oc.m2.d2:ocMA.OdeW5C12.melody	@ltx/en_us_dedes/he.h.m2:heHE.OTouFotosChorigos.name
ltx/en_us_dedes/oc.m2.d2:ocMA.OdeW5C12.mode	@ltx/en_us_dedes/miscellanea:misc.Mode2
ltx/en_us_dedes/oc.m2.d2:ocMA.OdeW5C12.ode	@ltx/en_us_dedes/miscellanea:misc.Ode5
ltx/en_us_dedes/oc.m2.d2:ocMA.OdeW5C12.text	
ltx/en_us_dedes/oc.m2.d2:ocMA.OdeW5C13.incipit	…
ltx/en_us_dedes/oc.m2.d2:ocMA.OdeW5C13.melody	@ltx/en_us_dedes/he.h.m2:heHE.OTouFotosChorigos.name
ltx/en_us_dedes/oc.m2.d2:ocMA.OdeW5C13.mode	@ltx/en_us_dedes/miscellanea:misc.Mode2
ltx/en_us_dedes/oc.m2.d2:ocMA.OdeW5C13.ode	@ltx/en_us_dedes/miscellanea:misc.Ode5
ltx/en_us_dedes/oc.m2.d2:ocMA.OdeW5C13.text	
ltx/en_us_dedes/oc.m2.d2:ocMA.OdeW5C14.incipit	…
ltx/en_us_dedes/oc.m2.d2:ocMA.OdeW5C14.melody	@ltx/en_us_dedes/he.h.m2:heHE.OTouFotosChorigos.name
ltx/en_us_dedes/oc.m2.d2:ocMA.OdeW5C14.mode	@ltx/en_us_dedes/miscellanea:misc.Mode2
ltx/en_us_dedes/oc.m2.d2:ocMA.OdeW5C14.ode	@ltx/en_us_dedes/miscellanea:misc.Ode5
ltx/en_us_dedes/oc.m2.d2:ocMA.OdeW5C14.text	
ltx/en_us_dedes/oc.m2.d2:ocMA.OdeW5C1H.greekmelody	@ltx/en_us_dedes/he.h.m2:heHE.OTouFotosChorigos.greekname
ltx/en_us_dedes/oc.m2.d2:ocMA.OdeW5C1H.incipit	@ltx/en_us_dedes/he.h.m2:heHE.OTouFotosChorigos.incipit
ltx/en_us_dedes/oc.m2.d2:ocMA.OdeW5C1H.melody	@ltx/en_us_dedes/he.h.m2:heHE.OTouFotosChorigos.melody
ltx/en_us_dedes/oc.m2.d2:ocMA.OdeW5C1H.mode	@ltx/en_us_dedes/miscellanea:misc.Mode2
ltx/en_us_dedes/oc.m2.d2:ocMA.OdeW5C1H.ode	@ltx/en_us_dedes/miscellanea:misc.Ode5
ltx/en_us_dedes/oc.m2.d2:ocMA.OdeW5C1H.text	@ltx/en_us_dedes/he.h.m2:heHE.OTouFotosChorigos.text
ltx/en_us_dedes/oc.m2.d2:ocMA.OdeW5C1T.incipit	…
ltx/en_us_dedes/oc.m2.d2:ocMA.OdeW5C1T.melody	@ltx/en_us_dedes/he.h.m2:heHE.OTouFotosChorigos.name
ltx/en_us_dedes/oc.m2.d2:ocMA.OdeW5C1T.mode	@ltx/en_us_dedes/miscellanea:misc.Mode2
ltx/en_us_dedes/oc.m2.d2:ocMA.OdeW5C1T.ode	@ltx/en_us_dedes/miscellanea:misc.Ode5
ltx/en_us_dedes/oc.m2.d2:ocMA.OdeW5C1T.text	
ltx/en_us_dedes/oc.m2.d2:ocMA.OdeW5C21.greekmelody	@ltx/en_us_dedes/he.h.m2:heHE.OAnthraxToIsaia.greekname
ltx/en_us_dedes/oc.m2.d2:ocMA.OdeW5C21.incipit	…
ltx/en_us_dedes/oc.m2.d2:ocMA.OdeW5C21.melody	@ltx/en_us_dedes/he.h.m2:heHE.OAnthraxToIsaia.name
ltx/en_us_dedes/oc.m2.d2:ocMA.OdeW5C21.mode	@ltx/en_us_dedes/miscellanea:misc.Mode2
ltx/en_us_dedes/oc.m2.d2:ocMA.OdeW5C21.ode	@ltx/en_us_dedes/miscellanea:misc.Ode5
ltx/en_us_dedes/oc.m2.d2:ocMA.OdeW5C21.text	
ltx/en_us_dedes/oc.m2.d2:ocMA.OdeW5C22.incipit	…
ltx/en_us_dedes/oc.m2.d2:ocMA.OdeW5C22.melody	@ltx/en_us_dedes/he.h.m2:heHE.OAnthraxToIsaia.name
ltx/en_us_dedes/oc.m2.d2:ocMA.OdeW5C22.mode	@ltx/en_us_dedes/miscellanea:misc.Mode2
ltx/en_us_dedes/oc.m2.d2:ocMA.OdeW5C22.ode	@ltx/en_us_dedes/miscellanea:misc.Ode5
ltx/en_us_dedes/oc.m2.d2:ocMA.OdeW5C22.text	
ltx/en_us_dedes/oc.m2.d2:ocMA.OdeW5C2T.incipit	…
ltx/en_us_dedes/oc.m2.d2:ocMA.OdeW5C2T.melody	@ltx/en_us_dedes/he.h.m2:heHE.OAnthraxToIsaia.name
ltx/en_us_dedes/oc.m2.d2:ocMA.OdeW5C2T.mode	@ltx/en_us_dedes/miscellanea:misc.Mode2
ltx/en_us_dedes/oc.m2.d2:ocMA.OdeW5C2T.ode	@ltx/en_us_dedes/miscellanea:misc.Ode5
ltx/en_us_dedes/oc.m2.d2:ocMA.OdeW5C2T.text	
ltx/en_us_dedes/oc.m2.d2:ocMA.OdeW6C11.incipit	…
ltx/en_us_dedes/oc.m2.d2:ocMA.OdeW6C11.melody	@ltx/en_us_dedes/he.h.m2:heHE.EnAvyssoPtaismaton.name
ltx/en_us_dedes/oc.m2.d2:ocMA.OdeW6C11.mode	@ltx/en_us_dedes/miscellanea:misc.Mode2
ltx/en_us_dedes/oc.m2.d2:ocMA.OdeW6C11.ode	@ltx/en_us_dedes/miscellanea:misc.Ode6
ltx/en_us_dedes/oc.m2.d2:ocMA.OdeW6C11.text	
ltx/en_us_dedes/oc.m2.d2:ocMA.OdeW6C12.incipit	…
ltx/en_us_dedes/oc.m2.d2:ocMA.OdeW6C12.melody	@ltx/en_us_dedes/he.h.m2:heHE.EnAvyssoPtaismaton.name
ltx/en_us_dedes/oc.m2.d2:ocMA.OdeW6C12.mode	@ltx/en_us_dedes/miscellanea:misc.Mode2
ltx/en_us_dedes/oc.m2.d2:ocMA.OdeW6C12.ode	@ltx/en_us_dedes/miscellanea:misc.Ode6
ltx/en_us_dedes/oc.m2.d2:ocMA.OdeW6C12.text	
ltx/en_us_dedes/oc.m2.d2:ocMA.OdeW6C13.incipit	…
ltx/en_us_dedes/oc.m2.d2:ocMA.OdeW6C13.melody	@ltx/en_us_dedes/he.h.m2:heHE.EnAvyssoPtaismaton.name
ltx/en_us_dedes/oc.m2.d2:ocMA.OdeW6C13.mode	@ltx/en_us_dedes/miscellanea:misc.Mode2
ltx/en_us_dedes/oc.m2.d2:ocMA.OdeW6C13.ode	@ltx/en_us_dedes/miscellanea:misc.Ode6
ltx/en_us_dedes/oc.m2.d2:ocMA.OdeW6C13.text	
ltx/en_us_dedes/oc.m2.d2:ocMA.OdeW6C14.incipit	…
ltx/en_us_dedes/oc.m2.d2:ocMA.OdeW6C14.melody	@ltx/en_us_dedes/he.h.m2:heHE.EnAvyssoPtaismaton.name
ltx/en_us_dedes/oc.m2.d2:ocMA.OdeW6C14.mode	@ltx/en_us_dedes/miscellanea:misc.Mode2
ltx/en_us_dedes/oc.m2.d2:ocMA.OdeW6C14.ode	@ltx/en_us_dedes/miscellanea:misc.Ode6
ltx/en_us_dedes/oc.m2.d2:ocMA.OdeW6C14.text	
ltx/en_us_dedes/oc.m2.d2:ocMA.OdeW6C1H.greekmelody	@ltx/en_us_dedes/he.h.m2:heHE.EnAvyssoPtaismaton.greekname
ltx/en_us_dedes/oc.m2.d2:ocMA.OdeW6C1H.incipit	@ltx/en_us_dedes/he.h.m2:heHE.EnAvyssoPtaismaton.incipit
ltx/en_us_dedes/oc.m2.d2:ocMA.OdeW6C1H.melody	@ltx/en_us_dedes/he.h.m2:heHE.EnAvyssoPtaismaton.melody
ltx/en_us_dedes/oc.m2.d2:ocMA.OdeW6C1H.mode	@ltx/en_us_dedes/miscellanea:misc.Mode2
ltx/en_us_dedes/oc.m2.d2:ocMA.OdeW6C1H.ode	@ltx/en_us_dedes/miscellanea:misc.Ode6
ltx/en_us_dedes/oc.m2.d2:ocMA.OdeW6C1H.text	@ltx/en_us_dedes/he.h.m2:heHE.EnAvyssoPtaismaton.text
ltx/en_us_dedes/oc.m2.d2:ocMA.OdeW6C1T.incipit	…
ltx/en_us_dedes/oc.m2.d2:ocMA.OdeW6C1T.melody	@ltx/en_us_dedes/he.h.m2:heHE.EnAvyssoPtaismaton.name
ltx/en_us_dedes/oc.m2.d2:ocMA.OdeW6C1T.mode	@ltx/en_us_dedes/miscellanea:misc.Mode2
ltx/en_us_dedes/oc.m2.d2:ocMA.OdeW6C1T.ode	@ltx/en_us_dedes/miscellanea:misc.Ode6
ltx/en_us_dedes/oc.m2.d2:ocMA.OdeW6C1T.text	
ltx/en_us_dedes/oc.m2.d2:ocMA.OdeW6C21.greekmelody	@ltx/en_us_dedes/he.h.m2:heHE.IchouRimatonDeiseos.greekname
ltx/en_us_dedes/oc.m2.d2:ocMA.OdeW6C21.incipit	…
ltx/en_us_dedes/oc.m2.d2:ocMA.OdeW6C21.melody	@ltx/en_us_dedes/he.h.m2:heHE.IchouRimatonDeiseos.name
ltx/en_us_dedes/oc.m2.d2:ocMA.OdeW6C21.mode	@ltx/en_us_dedes/miscellanea:misc.Mode2
ltx/en_us_dedes/oc.m2.d2:ocMA.OdeW6C21.ode	@ltx/en_us_dedes/miscellanea:misc.Ode6
ltx/en_us_dedes/oc.m2.d2:ocMA.OdeW6C21.text	
ltx/en_us_dedes/oc.m2.d2:ocMA.OdeW6C22.incipit	…
ltx/en_us_dedes/oc.m2.d2:ocMA.OdeW6C22.melody	@ltx/en_us_dedes/he.h.m2:heHE.IchouRimatonDeiseos.name
ltx/en_us_dedes/oc.m2.d2:ocMA.OdeW6C22.mode	@ltx/en_us_dedes/miscellanea:misc.Mode2
ltx/en_us_dedes/oc.m2.d2:ocMA.OdeW6C22.ode	@ltx/en_us_dedes/miscellanea:misc.Ode6
ltx/en_us_dedes/oc.m2.d2:ocMA.OdeW6C22.text	
ltx/en_us_dedes/oc.m2.d2:ocMA.OdeW6C2T.incipit	…
ltx/en_us_dedes/oc.m2.d2:ocMA.OdeW6C2T.melody	@ltx/en_us_dedes/he.h.m2:heHE.IchouRimatonDeiseos.name
ltx/en_us_dedes/oc.m2.d2:ocMA.OdeW6C2T.mode	@ltx/en_us_dedes/miscellanea:misc.Mode2
ltx/en_us_dedes/oc.m2.d2:ocMA.OdeW6C2T.ode	@ltx/en_us_dedes/miscellanea:misc.Ode6
ltx/en_us_dedes/oc.m2.d2:ocMA.OdeW6C2T.text	
ltx/en_us_dedes/oc.m2.d2:ocMA.OdeW7C11.incipit	…
ltx/en_us_dedes/oc.m2.d2:ocMA.OdeW7C11.melody	@ltx/en_us_dedes/he.h.m2:heHE.EikonosChrysis.name
ltx/en_us_dedes/oc.m2.d2:ocMA.OdeW7C11.mode	@ltx/en_us_dedes/miscellanea:misc.Mode2
ltx/en_us_dedes/oc.m2.d2:ocMA.OdeW7C11.ode	@ltx/en_us_dedes/miscellanea:misc.Ode7
ltx/en_us_dedes/oc.m2.d2:ocMA.OdeW7C11.text	
ltx/en_us_dedes/oc.m2.d2:ocMA.OdeW7C12.incipit	…
ltx/en_us_dedes/oc.m2.d2:ocMA.OdeW7C12.melody	@ltx/en_us_dedes/he.h.m2:heHE.EikonosChrysis.name
ltx/en_us_dedes/oc.m2.d2:ocMA.OdeW7C12.mode	@ltx/en_us_dedes/miscellanea:misc.Mode2
ltx/en_us_dedes/oc.m2.d2:ocMA.OdeW7C12.ode	@ltx/en_us_dedes/miscellanea:misc.Ode7
ltx/en_us_dedes/oc.m2.d2:ocMA.OdeW7C12.text	
ltx/en_us_dedes/oc.m2.d2:ocMA.OdeW7C13.incipit	…
ltx/en_us_dedes/oc.m2.d2:ocMA.OdeW7C13.melody	@ltx/en_us_dedes/he.h.m2:heHE.EikonosChrysis.name
ltx/en_us_dedes/oc.m2.d2:ocMA.OdeW7C13.mode	@ltx/en_us_dedes/miscellanea:misc.Mode2
ltx/en_us_dedes/oc.m2.d2:ocMA.OdeW7C13.ode	@ltx/en_us_dedes/miscellanea:misc.Ode7
ltx/en_us_dedes/oc.m2.d2:ocMA.OdeW7C13.text	
ltx/en_us_dedes/oc.m2.d2:ocMA.OdeW7C14.incipit	…
ltx/en_us_dedes/oc.m2.d2:ocMA.OdeW7C14.melody	@ltx/en_us_dedes/he.h.m2:heHE.EikonosChrysis.name
ltx/en_us_dedes/oc.m2.d2:ocMA.OdeW7C14.mode	@ltx/en_us_dedes/miscellanea:misc.Mode2
ltx/en_us_dedes/oc.m2.d2:ocMA.OdeW7C14.ode	@ltx/en_us_dedes/miscellanea:misc.Ode7
ltx/en_us_dedes/oc.m2.d2:ocMA.OdeW7C14.text	
ltx/en_us_dedes/oc.m2.d2:ocMA.OdeW7C1H.greekmelody	@ltx/en_us_dedes/he.h.m2:heHE.EikonosChrysis.greekname
ltx/en_us_dedes/oc.m2.d2:ocMA.OdeW7C1H.incipit	@ltx/en_us_dedes/he.h.m2:heHE.EikonosChrysis.incipit
ltx/en_us_dedes/oc.m2.d2:ocMA.OdeW7C1H.melody	@ltx/en_us_dedes/he.h.m2:heHE.EikonosChrysis.melody
ltx/en_us_dedes/oc.m2.d2:ocMA.OdeW7C1H.mode	@ltx/en_us_dedes/miscellanea:misc.Mode2
ltx/en_us_dedes/oc.m2.d2:ocMA.OdeW7C1H.ode	@ltx/en_us_dedes/miscellanea:misc.Ode7
ltx/en_us_dedes/oc.m2.d2:ocMA.OdeW7C1H.text	@ltx/en_us_dedes/he.h.m2:heHE.EikonosChrysis.text
ltx/en_us_dedes/oc.m2.d2:ocMA.OdeW7C1T.incipit	…
ltx/en_us_dedes/oc.m2.d2:ocMA.OdeW7C1T.melody	@ltx/en_us_dedes/he.h.m2:heHE.EikonosChrysis.name
ltx/en_us_dedes/oc.m2.d2:ocMA.OdeW7C1T.mode	@ltx/en_us_dedes/miscellanea:misc.Mode2
ltx/en_us_dedes/oc.m2.d2:ocMA.OdeW7C1T.ode	@ltx/en_us_dedes/miscellanea:misc.Ode7
ltx/en_us_dedes/oc.m2.d2:ocMA.OdeW7C1T.text	
ltx/en_us_dedes/oc.m2.d2:ocMA.OdeW7C21.greekmelody	@ltx/en_us_dedes/he.h.m2:heHE.RitoresAnedeichthisanPaides.greekname
ltx/en_us_dedes/oc.m2.d2:ocMA.OdeW7C21.incipit	…
ltx/en_us_dedes/oc.m2.d2:ocMA.OdeW7C21.melody	@ltx/en_us_dedes/he.h.m2:heHE.RitoresAnedeichthisanPaides.name
ltx/en_us_dedes/oc.m2.d2:ocMA.OdeW7C21.mode	@ltx/en_us_dedes/miscellanea:misc.Mode2
ltx/en_us_dedes/oc.m2.d2:ocMA.OdeW7C21.ode	@ltx/en_us_dedes/miscellanea:misc.Ode7
ltx/en_us_dedes/oc.m2.d2:ocMA.OdeW7C21.text	
ltx/en_us_dedes/oc.m2.d2:ocMA.OdeW7C22.incipit	…
ltx/en_us_dedes/oc.m2.d2:ocMA.OdeW7C22.melody	@ltx/en_us_dedes/he.h.m2:heHE.RitoresAnedeichthisanPaides.name
ltx/en_us_dedes/oc.m2.d2:ocMA.OdeW7C22.mode	@ltx/en_us_dedes/miscellanea:misc.Mode2
ltx/en_us_dedes/oc.m2.d2:ocMA.OdeW7C22.ode	@ltx/en_us_dedes/miscellanea:misc.Ode7
ltx/en_us_dedes/oc.m2.d2:ocMA.OdeW7C22.text	
ltx/en_us_dedes/oc.m2.d2:ocMA.OdeW7C2T.incipit	…
ltx/en_us_dedes/oc.m2.d2:ocMA.OdeW7C2T.melody	@ltx/en_us_dedes/he.h.m2:heHE.RitoresAnedeichthisanPaides.name
ltx/en_us_dedes/oc.m2.d2:ocMA.OdeW7C2T.mode	@ltx/en_us_dedes/miscellanea:misc.Mode2
ltx/en_us_dedes/oc.m2.d2:ocMA.OdeW7C2T.ode	@ltx/en_us_dedes/miscellanea:misc.Ode7
ltx/en_us_dedes/oc.m2.d2:ocMA.OdeW7C2T.text	
ltx/en_us_dedes/oc.m2.d2:ocMA.OdeW8C11.incipit	…
ltx/en_us_dedes/oc.m2.d2:ocMA.OdeW8C11.melody	@ltx/en_us_dedes/he.h.m2:heHE.TonEnKaminoTouPyros.name
ltx/en_us_dedes/oc.m2.d2:ocMA.OdeW8C11.mode	@ltx/en_us_dedes/miscellanea:misc.Mode2
ltx/en_us_dedes/oc.m2.d2:ocMA.OdeW8C11.ode	@ltx/en_us_dedes/miscellanea:misc.Ode8
ltx/en_us_dedes/oc.m2.d2:ocMA.OdeW8C11.text	
ltx/en_us_dedes/oc.m2.d2:ocMA.OdeW8C12.incipit	…
ltx/en_us_dedes/oc.m2.d2:ocMA.OdeW8C12.melody	@ltx/en_us_dedes/he.h.m2:heHE.TonEnKaminoTouPyros.name
ltx/en_us_dedes/oc.m2.d2:ocMA.OdeW8C12.mode	@ltx/en_us_dedes/miscellanea:misc.Mode2
ltx/en_us_dedes/oc.m2.d2:ocMA.OdeW8C12.ode	@ltx/en_us_dedes/miscellanea:misc.Ode8
ltx/en_us_dedes/oc.m2.d2:ocMA.OdeW8C12.text	
ltx/en_us_dedes/oc.m2.d2:ocMA.OdeW8C13.incipit	…
ltx/en_us_dedes/oc.m2.d2:ocMA.OdeW8C13.melody	@ltx/en_us_dedes/he.h.m2:heHE.TonEnKaminoTouPyros.name
ltx/en_us_dedes/oc.m2.d2:ocMA.OdeW8C13.mode	@ltx/en_us_dedes/miscellanea:misc.Mode2
ltx/en_us_dedes/oc.m2.d2:ocMA.OdeW8C13.ode	@ltx/en_us_dedes/miscellanea:misc.Ode8
ltx/en_us_dedes/oc.m2.d2:ocMA.OdeW8C13.text	
ltx/en_us_dedes/oc.m2.d2:ocMA.OdeW8C14.incipit	…
ltx/en_us_dedes/oc.m2.d2:ocMA.OdeW8C14.melody	@ltx/en_us_dedes/he.h.m2:heHE.TonEnKaminoTouPyros.name
ltx/en_us_dedes/oc.m2.d2:ocMA.OdeW8C14.mode	@ltx/en_us_dedes/miscellanea:misc.Mode2
ltx/en_us_dedes/oc.m2.d2:ocMA.OdeW8C14.ode	@ltx/en_us_dedes/miscellanea:misc.Ode8
ltx/en_us_dedes/oc.m2.d2:ocMA.OdeW8C14.text	
ltx/en_us_dedes/oc.m2.d2:ocMA.OdeW8C1H.greekmelody	@ltx/en_us_dedes/he.h.m2:heHE.TonEnKaminoTouPyros.greekname
ltx/en_us_dedes/oc.m2.d2:ocMA.OdeW8C1H.incipit	@ltx/en_us_dedes/he.h.m2:heHE.TonEnKaminoTouPyros.incipit
ltx/en_us_dedes/oc.m2.d2:ocMA.OdeW8C1H.melody	@ltx/en_us_dedes/he.h.m2:heHE.TonEnKaminoTouPyros.melody
ltx/en_us_dedes/oc.m2.d2:ocMA.OdeW8C1H.mode	@ltx/en_us_dedes/miscellanea:misc.Mode2
ltx/en_us_dedes/oc.m2.d2:ocMA.OdeW8C1H.ode	@ltx/en_us_dedes/miscellanea:misc.Ode8
ltx/en_us_dedes/oc.m2.d2:ocMA.OdeW8C1H.text	@ltx/en_us_dedes/he.h.m2:heHE.TonEnKaminoTouPyros.text
ltx/en_us_dedes/oc.m2.d2:ocMA.OdeW8C1T.incipit	…
ltx/en_us_dedes/oc.m2.d2:ocMA.OdeW8C1T.melody	@ltx/en_us_dedes/he.h.m2:heHE.TonEnKaminoTouPyros.name
ltx/en_us_dedes/oc.m2.d2:ocMA.OdeW8C1T.mode	@ltx/en_us_dedes/miscellanea:misc.Mode2
ltx/en_us_dedes/oc.m2.d2:ocMA.OdeW8C1T.ode	@ltx/en_us_dedes/miscellanea:misc.Ode8
ltx/en_us_dedes/oc.m2.d2:ocMA.OdeW8C1T.text	
ltx/en_us_dedes/oc.m2.d2:ocMA.OdeW8C21.greekmelody	@ltx/en_us_dedes/he.h.m2:heHE.IndalmatosChrysou.greekname
ltx/en_us_dedes/oc.m2.d2:ocMA.OdeW8C21.incipit	…
ltx/en_us_dedes/oc.m2.d2:ocMA.OdeW8C21.melody	@ltx/en_us_dedes/he.h.m2:heHE.IndalmatosChrysou.name
ltx/en_us_dedes/oc.m2.d2:ocMA.OdeW8C21.mode	@ltx/en_us_dedes/miscellanea:misc.Mode2
ltx/en_us_dedes/oc.m2.d2:ocMA.OdeW8C21.ode	@ltx/en_us_dedes/miscellanea:misc.Ode8
ltx/en_us_dedes/oc.m2.d2:ocMA.OdeW8C21.text	
ltx/en_us_dedes/oc.m2.d2:ocMA.OdeW8C22.incipit	…
ltx/en_us_dedes/oc.m2.d2:ocMA.OdeW8C22.melody	@ltx/en_us_dedes/he.h.m2:heHE.IndalmatosChrysou.name
ltx/en_us_dedes/oc.m2.d2:ocMA.OdeW8C22.mode	@ltx/en_us_dedes/miscellanea:misc.Mode2
ltx/en_us_dedes/oc.m2.d2:ocMA.OdeW8C22.ode	@ltx/en_us_dedes/miscellanea:misc.Ode8
ltx/en_us_dedes/oc.m2.d2:ocMA.OdeW8C22.text	
ltx/en_us_dedes/oc.m2.d2:ocMA.OdeW8C23.incipit	…
ltx/en_us_dedes/oc.m2.d2:ocMA.OdeW8C23.melody	@ltx/en_us_dedes/he.h.m2:heHE.IndalmatosChrysou.name
ltx/en_us_dedes/oc.m2.d2:ocMA.OdeW8C23.mode	@ltx/en_us_dedes/miscellanea:misc.Mode2
ltx/en_us_dedes/oc.m2.d2:ocMA.OdeW8C23.ode	@ltx/en_us_dedes/miscellanea:misc.Ode8
ltx/en_us_dedes/oc.m2.d2:ocMA.OdeW8C23.text	
ltx/en_us_dedes/oc.m2.d2:ocMA.OdeW8C2T.incipit	…
ltx/en_us_dedes/oc.m2.d2:ocMA.OdeW8C2T.melody	@ltx/en_us_dedes/he.h.m2:heHE.IndalmatosChrysou.name
ltx/en_us_dedes/oc.m2.d2:ocMA.OdeW8C2T.mode	@ltx/en_us_dedes/miscellanea:misc.Mode2
ltx/en_us_dedes/oc.m2.d2:ocMA.OdeW8C2T.ode	@ltx/en_us_dedes/miscellanea:misc.Ode8
ltx/en_us_dedes/oc.m2.d2:ocMA.OdeW8C2T.text	
ltx/en_us_dedes/oc.m2.d2:ocMA.OdeW9C11.incipit	…
ltx/en_us_dedes/oc.m2.d2:ocMA.OdeW9C11.melody	@ltx/en_us_dedes/he.h.m2:heHE.TonEkTheouTheonLogon.name
ltx/en_us_dedes/oc.m2.d2:ocMA.OdeW9C11.mode	@ltx/en_us_dedes/miscellanea:misc.Mode2
ltx/en_us_dedes/oc.m2.d2:ocMA.OdeW9C11.ode	@ltx/en_us_dedes/miscellanea:misc.Ode9
ltx/en_us_dedes/oc.m2.d2:ocMA.OdeW9C11.text	
ltx/en_us_dedes/oc.m2.d2:ocMA.OdeW9C12.incipit	…
ltx/en_us_dedes/oc.m2.d2:ocMA.OdeW9C12.melody	@ltx/en_us_dedes/he.h.m2:heHE.TonEkTheouTheonLogon.name
ltx/en_us_dedes/oc.m2.d2:ocMA.OdeW9C12.mode	@ltx/en_us_dedes/miscellanea:misc.Mode2
ltx/en_us_dedes/oc.m2.d2:ocMA.OdeW9C12.ode	@ltx/en_us_dedes/miscellanea:misc.Ode9
ltx/en_us_dedes/oc.m2.d2:ocMA.OdeW9C12.text	
ltx/en_us_dedes/oc.m2.d2:ocMA.OdeW9C13.incipit	…
ltx/en_us_dedes/oc.m2.d2:ocMA.OdeW9C13.melody	@ltx/en_us_dedes/he.h.m2:heHE.TonEkTheouTheonLogon.name
ltx/en_us_dedes/oc.m2.d2:ocMA.OdeW9C13.mode	@ltx/en_us_dedes/miscellanea:misc.Mode2
ltx/en_us_dedes/oc.m2.d2:ocMA.OdeW9C13.ode	@ltx/en_us_dedes/miscellanea:misc.Ode9
ltx/en_us_dedes/oc.m2.d2:ocMA.OdeW9C13.text	
ltx/en_us_dedes/oc.m2.d2:ocMA.OdeW9C14.incipit	…
ltx/en_us_dedes/oc.m2.d2:ocMA.OdeW9C14.melody	@ltx/en_us_dedes/he.h.m2:heHE.TonEkTheouTheonLogon.name
ltx/en_us_dedes/oc.m2.d2:ocMA.OdeW9C14.mode	@ltx/en_us_dedes/miscellanea:misc.Mode2
ltx/en_us_dedes/oc.m2.d2:ocMA.OdeW9C14.ode	@ltx/en_us_dedes/miscellanea:misc.Ode9
ltx/en_us_dedes/oc.m2.d2:ocMA.OdeW9C14.text	
ltx/en_us_dedes/oc.m2.d2:ocMA.OdeW9C1H.greekmelody	@ltx/en_us_dedes/he.h.m2:heHE.TonEkTheouTheonLogon.greekname
ltx/en_us_dedes/oc.m2.d2:ocMA.OdeW9C1H.incipit	@ltx/en_us_dedes/he.h.m2:heHE.TonEkTheouTheonLogon.incipit
ltx/en_us_dedes/oc.m2.d2:ocMA.OdeW9C1H.melody	@ltx/en_us_dedes/he.h.m2:heHE.TonEkTheouTheonLogon.melody
ltx/en_us_dedes/oc.m2.d2:ocMA.OdeW9C1H.mode	@ltx/en_us_dedes/miscellanea:misc.Mode2
ltx/en_us_dedes/oc.m2.d2:ocMA.OdeW9C1H.ode	@ltx/en_us_dedes/miscellanea:misc.Ode9
ltx/en_us_dedes/oc.m2.d2:ocMA.OdeW9C1H.text	@ltx/en_us_dedes/he.h.m2:heHE.TonEkTheouTheonLogon.text
ltx/en_us_dedes/oc.m2.d2:ocMA.OdeW9C1T.incipit	…
ltx/en_us_dedes/oc.m2.d2:ocMA.OdeW9C1T.melody	@ltx/en_us_dedes/he.h.m2:heHE.TonEkTheouTheonLogon.name
ltx/en_us_dedes/oc.m2.d2:ocMA.OdeW9C1T.mode	@ltx/en_us_dedes/miscellanea:misc.Mode2
ltx/en_us_dedes/oc.m2.d2:ocMA.OdeW9C1T.ode	@ltx/en_us_dedes/miscellanea:misc.Ode9
ltx/en_us_dedes/oc.m2.d2:ocMA.OdeW9C1T.text	
ltx/en_us_dedes/oc.m2.d2:ocMA.OdeW9C21.greekmelody	@ltx/en_us_dedes/he.h.m2:heHE.OlosYparcheisEfesis.greekname
ltx/en_us_dedes/oc.m2.d2:ocMA.OdeW9C21.incipit	…
ltx/en_us_dedes/oc.m2.d2:ocMA.OdeW9C21.melody	@ltx/en_us_dedes/he.h.m2:heHE.OlosYparcheisEfesis.name
ltx/en_us_dedes/oc.m2.d2:ocMA.OdeW9C21.mode	@ltx/en_us_dedes/miscellanea:misc.Mode2
ltx/en_us_dedes/oc.m2.d2:ocMA.OdeW9C21.ode	@ltx/en_us_dedes/miscellanea:misc.Ode9
ltx/en_us_dedes/oc.m2.d2:ocMA.OdeW9C21.text	
ltx/en_us_dedes/oc.m2.d2:ocMA.OdeW9C22.incipit	…
ltx/en_us_dedes/oc.m2.d2:ocMA.OdeW9C22.melody	@ltx/en_us_dedes/he.h.m2:heHE.OlosYparcheisEfesis.name
ltx/en_us_dedes/oc.m2.d2:ocMA.OdeW9C22.mode	@ltx/en_us_dedes/miscellanea:misc.Mode2
ltx/en_us_dedes/oc.m2.d2:ocMA.OdeW9C22.ode	@ltx/en_us_dedes/miscellanea:misc.Ode9
ltx/en_us_dedes/oc.m2.d2:ocMA.OdeW9C22.text	
ltx/en_us_dedes/oc.m2.d2:ocMA.OdeW9C2T.incipit	…
ltx/en_us_dedes/oc.m2.d2:ocMA.OdeW9C2T.melody	@ltx/en_us_dedes/he.h.m2:heHE.OlosYparcheisEfesis.name
ltx/en_us_dedes/oc.m2.d2:ocMA.OdeW9C2T.mode	@ltx/en_us_dedes/miscellanea:misc.Mode2
ltx/en_us_dedes/oc.m2.d2:ocMA.OdeW9C2T.ode	@ltx/en_us_dedes/miscellanea:misc.Ode9
ltx/en_us_dedes/oc.m2.d2:ocMA.OdeW9C2T.text	
ltx/en_us_dedes/oc.m2.d2:ocVE.ApolTheotokionVM.incipit	@ltx/en_us_dedes/he.a.m2:heAU.EfsplagchniasYparchousa.incipit
ltx/en_us_dedes/oc.m2.d2:ocVE.ApolTheotokionVM.melody	@ltx/en_us_dedes/he.a.m2:heAU.EfsplagchniasYparchousa.melody
ltx/en_us_dedes/oc.m2.d2:ocVE.ApolTheotokionVM.mode	@ltx/en_us_dedes/miscellanea:misc.Mode2
ltx/en_us_dedes/oc.m2.d2:ocVE.ApolTheotokionVM.text	@ltx/en_us_dedes/he.a.m2:heAU.EfsplagchniasYparchousa.text
ltx/en_us_dedes/oc.m2.d2:ocVE.AposTheotokion.incipit	O impassable gate mystically sealed…
ltx/en_us_dedes/oc.m2.d2:ocVE.AposTheotokion.melody	
ltx/en_us_dedes/oc.m2.d2:ocVE.AposTheotokion.mode	@ltx/en_us_dedes/miscellanea:misc.Mode2
ltx/en_us_dedes/oc.m2.d2:ocVE.AposTheotokion.text	O impassable gate mystically sealed, blessed Virgin Theotokos: accept our supplications and present them unto your Son and God, that through you He save our souls.
ltx/en_us_dedes/oc.m2.d2:ocVE.Aposticha1.incipit	Like the prodigal son, I…
ltx/en_us_dedes/oc.m2.d2:ocVE.Aposticha1.melody	
ltx/en_us_dedes/oc.m2.d2:ocVE.Aposticha1.mode	@ltx/en_us_dedes/miscellanea:misc.Mode2
ltx/en_us_dedes/oc.m2.d2:ocVE.Aposticha1.text	Like the prodigal son, I have sinned against You, O Savior. Accept me in repentance, O Father, and have mercy on me, O God.
ltx/en_us_dedes/oc.m2.d2:ocVE.Aposticha2.incipit	With the Publican I cry…
ltx/en_us_dedes/oc.m2.d2:ocVE.Aposticha2.melody	
ltx/en_us_dedes/oc.m2.d2:ocVE.Aposticha2.mode	@ltx/en_us_dedes/miscellanea:misc.Mode2
ltx/en_us_dedes/oc.m2.d2:ocVE.Aposticha2.text	With the Publican I cry unto You, O Christ my Savior: Unto me be gracious as You were unto him, and have mercy on me, O God.
ltx/en_us_dedes/oc.m2.d2:ocVE.Aposticha3.incipit	The prizewinning Martyrs, who loved…
ltx/en_us_dedes/oc.m2.d2:ocVE.Aposticha3.melody	
ltx/en_us_dedes/oc.m2.d2:ocVE.Aposticha3.mode	@ltx/en_us_dedes/miscellanea:misc.Mode2
ltx/en_us_dedes/oc.m2.d2:ocVE.Aposticha3.text	The prizewinning Martyrs, who loved no earthly enjoyments, were accounted worthy of the bounties of heaven. They have become fellow citizens of the Angels. By their intercessions, O Lord, have mercy on us and save us.
ltx/en_us_dedes/oc.m2.d2:ocVE.SticTheotokion.greekmelody	@ltx/en_us_dedes/he.a.m2:heAU.OteEkTouXylou.greekname
ltx/en_us_dedes/oc.m2.d2:ocVE.SticTheotokion.incipit	…
ltx/en_us_dedes/oc.m2.d2:ocVE.SticTheotokion.melody	@ltx/en_us_dedes/he.a.m2:heAU.OteEkTouXylou.name
ltx/en_us_dedes/oc.m2.d2:ocVE.SticTheotokion.mode	@ltx/en_us_dedes/miscellanea:misc.Mode2
ltx/en_us_dedes/oc.m2.d2:ocVE.SticTheotokion.text	
ltx/en_us_dedes/oc.m2.d2:ocVE.Stichera1.greekmelody	@ltx/en_us_dedes/he.a.m2:heAU.OteEkTouXylou.greekname
ltx/en_us_dedes/oc.m2.d2:ocVE.Stichera1.incipit	Grant thoughts of repentance unto…
ltx/en_us_dedes/oc.m2.d2:ocVE.Stichera1.melody	@ltx/en_us_dedes/he.a.m2:heAU.OteEkTouXylou.name
ltx/en_us_dedes/oc.m2.d2:ocVE.Stichera1.mode	@ltx/en_us_dedes/miscellanea:misc.Mode2
ltx/en_us_dedes/oc.m2.d2:ocVE.Stichera1.text	Grant thoughts of repentance unto me; * also grant the love for contrition unto my humble soul. * Rouse me from the sleep of grave insensibility, * and the darkness of laziness * drive out from within me, * and dispel the gloom created by despondency, * so that looking up, I the wretched * might cling fast to You and according * to Your holy will proceed, O Word of God.
ltx/en_us_dedes/oc.m2.d2:ocVE.Stichera2.incipit	…
ltx/en_us_dedes/oc.m2.d2:ocVE.Stichera2.melody	@ltx/en_us_dedes/he.a.m2:heAU.OteEkTouXylou.name
ltx/en_us_dedes/oc.m2.d2:ocVE.Stichera2.mode	@ltx/en_us_dedes/miscellanea:misc.Mode2
ltx/en_us_dedes/oc.m2.d2:ocVE.Stichera2.text	
ltx/en_us_dedes/oc.m2.d2:ocVE.Stichera3.incipit	Now do I confess to…
ltx/en_us_dedes/oc.m2.d2:ocVE.Stichera3.melody	@ltx/en_us_dedes/he.a.m2:heAU.OteEkTouXylou.name
ltx/en_us_dedes/oc.m2.d2:ocVE.Stichera3.mode	@ltx/en_us_dedes/miscellanea:misc.Mode2
ltx/en_us_dedes/oc.m2.d2:ocVE.Stichera3.text	Now do I confess to You my God * everything of which I am guilty, my sins against You in word, * deed and recollection, all do I declare to You. * I have passed the entire day * and all of my life’s time; * now I have arrived at night still full of wickedness. * Therefore, I fall down to You crying: * Master, O my Master and Savior, * I have sinned; forgive and save me, Lord my God.
ltx/en_us_dedes/oc.m2.d2:ocVE.Stichera4.greekmelody	@ltx/en_us_dedes/he.a.m2:heAU.OteEkTouXylou.greekname
ltx/en_us_dedes/oc.m2.d2:ocVE.Stichera4.incipit	Come, and singing spiritual songs…
ltx/en_us_dedes/oc.m2.d2:ocVE.Stichera4.melody	@ltx/en_us_dedes/he.a.m2:heAU.OteEkTouXylou.name
ltx/en_us_dedes/oc.m2.d2:ocVE.Stichera4.mode	@ltx/en_us_dedes/miscellanea:misc.Mode2
ltx/en_us_dedes/oc.m2.d2:ocVE.Stichera4.text	Come, and singing spiritual songs * let us now extol the commanders of the angelic hosts. * For being preeminent among the bodiless choirs, * they were both designated as * Archangels and Generals. * Foremost in the period of grace is Gabriel, * while in the Old Testament era * of the Law and prior to Moses, * prominent is Michael, the Archangels’ chief.
ltx/en_us_dedes/oc.m2.d2:ocVE.Stichera5.incipit	…
ltx/en_us_dedes/oc.m2.d2:ocVE.Stichera5.melody	@ltx/en_us_dedes/he.a.m2:heAU.OteEkTouXylou.name
ltx/en_us_dedes/oc.m2.d2:ocVE.Stichera5.mode	@ltx/en_us_dedes/miscellanea:misc.Mode2
ltx/en_us_dedes/oc.m2.d2:ocVE.Stichera5.text	
ltx/en_us_dedes/oc.m2.d2:ocVE.Stichera6.incipit	…
ltx/en_us_dedes/oc.m2.d2:ocVE.Stichera6.melody	@ltx/en_us_dedes/he.a.m2:heAU.OteEkTouXylou.name
ltx/en_us_dedes/oc.m2.d2:ocVE.Stichera6.mode	@ltx/en_us_dedes/miscellanea:misc.Mode2
ltx/en_us_dedes/oc.m2.d2:ocVE.Stichera6.text	
ltx/en_us_dedes/oc.m2.d2:octrMA.Kathisma11.incipit	@ltx/en_us_dedes/oc.m2.d2:ocMA.Kathisma11.incipit
ltx/en_us_dedes/oc.m2.d2:octrMA.Kathisma11.melody	
ltx/en_us_dedes/oc.m2.d2:octrMA.Kathisma11.mode	@ltx/en_us_dedes/miscellanea:misc.Mode2
ltx/en_us_dedes/oc.m2.d2:octrMA.Kathisma11.text	@ltx/en_us_dedes/oc.m2.d2:ocMA.Kathisma11.text
ltx/en_us_dedes/oc.m2.d2:octrMA.Kathisma12.incipit	@ltx/en_us_dedes/oc.m2.d2:ocMA.Kathisma12.incipit
ltx/en_us_dedes/oc.m2.d2:octrMA.Kathisma12.melody	
ltx/en_us_dedes/oc.m2.d2:octrMA.Kathisma12.mode	@ltx/en_us_dedes/miscellanea:misc.Mode2
ltx/en_us_dedes/oc.m2.d2:octrMA.Kathisma12.text	@ltx/en_us_dedes/oc.m2.d2:ocMA.Kathisma12.text
ltx/en_us_dedes/oc.m2.d2:octrMA.Kathisma1T.incipit	@ltx/en_us_dedes/oc.m2.d2:ocMA.Kathisma13.incipit
ltx/en_us_dedes/oc.m2.d2:octrMA.Kathisma1T.melody	
ltx/en_us_dedes/oc.m2.d2:octrMA.Kathisma1T.mode	@ltx/en_us_dedes/miscellanea:misc.Mode2
ltx/en_us_dedes/oc.m2.d2:octrMA.Kathisma1T.text	@ltx/en_us_dedes/oc.m2.d2:ocMA.Kathisma13.text
ltx/en_us_dedes/oc.m2.d2:octrMA.Ode7Martyricon.incipit	@ltx/en_us_dedes/oc.m2.d2:ocMA.Kathisma32.incipit
ltx/en_us_dedes/oc.m2.d2:octrMA.Ode7Martyricon.melody	
ltx/en_us_dedes/oc.m2.d2:octrMA.Ode7Martyricon.mode	@ltx/en_us_dedes/miscellanea:misc.Mode2
ltx/en_us_dedes/oc.m2.d2:octrMA.Ode7Martyricon.text	@ltx/en_us_dedes/oc.m2.d2:ocMA.Kathisma32.text
ltx/en_us_dedes/oc.m2.d2:octrMA.Photagogic.incipit	Send out Your eternal light…
ltx/en_us_dedes/oc.m2.d2:octrMA.Photagogic.mode	@ltx/en_us_dedes/miscellanea:misc.Mode2
ltx/en_us_dedes/oc.m2.d2:octrMA.Photagogic.text	Send out Your eternal light, O Lord, and illumine the hidden eyes of my heart,
ltx/en_us_dedes/oc.m2.d2:octrMA.Triadic1.incipit	We on earth…
ltx/en_us_dedes/oc.m2.d2:octrMA.Triadic1.mode	@ltx/en_us_dedes/miscellanea:misc.Mode2
ltx/en_us_dedes/oc.m2.d2:octrMA.Triadic1.text	We on earth, imitating the powers on high, send up a triumphal hymn to You, O good One: Holy, holy, holy are You, our God.
ltx/en_us_dedes/oc.m2.d2:octrMA.Triadic2.incipit	O uncreated nature…
ltx/en_us_dedes/oc.m2.d2:octrMA.Triadic2.mode	@ltx/en_us_dedes/miscellanea:misc.Mode2
ltx/en_us_dedes/oc.m2.d2:octrMA.Triadic2.text	O uncreated nature and Creator of the universe, open our lips, so that we may proclaim Your praise and cry out: Holy, holy, holy are You, our God.
ltx/en_us_dedes/oc.m2.d2:octrMA.Triadic3.incipit	From my bed and sleep…
ltx/en_us_dedes/oc.m2.d2:octrMA.Triadic3.mode	@ltx/en_us_dedes/miscellanea:misc.Mode2
ltx/en_us_dedes/oc.m2.d2:octrMA.Triadic3.text	From my bed and sleep You have roused me, O Lord. Illumine my mind and heart, and open my lips to extol You, O Holy Trinity: Holy, holy, holy are You, our God.
ltx/en_us_dedes/oc.m2.d2:octrVE.Stichera1.incipit	@ltx/en_us_dedes/oc.m2.d2:ocVE.Aposticha1.incipit
ltx/en_us_dedes/oc.m2.d2:octrVE.Stichera1.melody	
ltx/en_us_dedes/oc.m2.d2:octrVE.Stichera1.mode	@ltx/en_us_dedes/miscellanea:misc.Mode2
ltx/en_us_dedes/oc.m2.d2:octrVE.Stichera1.text	@ltx/en_us_dedes/oc.m2.d2:ocVE.Aposticha1.text
ltx/en_us_dedes/oc.m2.d2:octrVE.Stichera2.incipit	@ltx/en_us_dedes/oc.m2.d2:ocVE.Aposticha2.incipit
ltx/en_us_dedes/oc.m2.d2:octrVE.Stichera2.melody	
ltx/en_us_dedes/oc.m2.d2:octrVE.Stichera2.mode	@ltx/en_us_dedes/miscellanea:misc.Mode2
ltx/en_us_dedes/oc.m2.d2:octrVE.Stichera2.text	@ltx/en_us_dedes/oc.m2.d2:ocVE.Aposticha2.text
ltx/en_us_dedes/oc.m2.d2:octrVE.Stichera3.incipit	@ltx/en_us_dedes/oc.m2.d2:ocMA.Aposticha1.incipit
ltx/en_us_dedes/oc.m2.d2:octrVE.Stichera3.melody	
ltx/en_us_dedes/oc.m2.d2:octrVE.Stichera3.mode	@ltx/en_us_dedes/miscellanea:misc.Mode2
ltx/en_us_dedes/oc.m2.d2:octrVE.Stichera3.text	@ltx/en_us_dedes/oc.m2.d2:ocMA.Aposticha1.text
ltx/en_us_dedes/oc.m2.d2:octrVE.Stichera4.incipit	@ltx/en_us_dedes/oc.m2.d2:ocMA.Aposticha2.incipit
ltx/en_us_dedes/oc.m2.d2:octrVE.Stichera4.melody	
ltx/en_us_dedes/oc.m2.d2:octrVE.Stichera4.mode	@ltx/en_us_dedes/miscellanea:misc.Mode2
ltx/en_us_dedes/oc.m2.d2:octrVE.Stichera4.text	@ltx/en_us_dedes/oc.m2.d2:ocMA.Aposticha2.text
