ltx/en_us_dedes/sy.m06.d21:cl.syMA.commemoration01.text	[saint/com 1]
ltx/en_us_dedes/sy.m06.d21:cl.syMA.commemoration02.text	[saint/com 2]
ltx/en_us_dedes/sy.m06.d21:cl.syMA.commemoration03.text	[saint/com 3]
ltx/en_us_dedes/sy.m06.d21:cl.syMA.commemoration04.text	[saint/com 4]
ltx/en_us_dedes/sy.m06.d21:cl.syMA.commemoration05.text	[saint/com 5]
ltx/en_us_dedes/sy.m06.d21:cl.syMA.commemoration06.text	[saint/com list]
ltx/en_us_dedes/sy.m06.d21:syMA.commemoration01.couplet1.title	@ltx/en_us_dedes/titles:ti.Verses
ltx/en_us_dedes/sy.m06.d21:syMA.commemoration01.couplet1.verse1	
ltx/en_us_dedes/sy.m06.d21:syMA.commemoration01.couplet1.verse2	
ltx/en_us_dedes/sy.m06.d21:syMA.commemoration01.narration.p01	
ltx/en_us_dedes/sy.m06.d21:syMA.commemoration01.single1	
ltx/en_us_dedes/sy.m06.d21:syMA.commemoration01.text	On the June 21 we commemorate the Holy Martyr Julian of Tarsus in Cilicia.
ltx/en_us_dedes/sy.m06.d21:syMA.commemoration02.narration.p01	
ltx/en_us_dedes/sy.m06.d21:syMA.commemoration02.text	On this day we commemorate the holy Martyr Aphrodisios.
ltx/en_us_dedes/sy.m06.d21:syMA.commemoration03.couplet1.title	@ltx/en_us_dedes/titles:ti.Verses
ltx/en_us_dedes/sy.m06.d21:syMA.commemoration03.couplet1.verse1	
ltx/en_us_dedes/sy.m06.d21:syMA.commemoration03.couplet1.verse2	
ltx/en_us_dedes/sy.m06.d21:syMA.commemoration03.text	On this day we also commemorate the Holy Hieromartyr Terence, Bishop of Iconium.
ltx/en_us_dedes/sy.m06.d21:syMA.commemoration04.couplet1.title	@ltx/en_us_dedes/titles:ti.Verses
ltx/en_us_dedes/sy.m06.d21:syMA.commemoration04.couplet1.verse1	
ltx/en_us_dedes/sy.m06.d21:syMA.commemoration04.couplet1.verse2	
ltx/en_us_dedes/sy.m06.d21:syMA.commemoration04.text	The holy New-Martyr Nikitas from Nisyros, who witnessed on Chios in the year 1732 died by the sword.
ltx/en_us_dedes/sy.m06.d21:syMA.lastline	By their holy intercessions, Christ God, have mercy on us. Amen.
