ltx/en_us_dedes/he.a.m5:heAU.ChairoisAskitikon.greekname	Χαίροις ἀσκητικῶν.
ltx/en_us_dedes/he.a.m5:heAU.ChairoisAskitikon.incipit	Rejoice…
ltx/en_us_dedes/he.a.m5:heAU.ChairoisAskitikon.melody	@ltx/en_us_dedes/miscellanea:misc.Automelon
ltx/en_us_dedes/he.a.m5:heAU.ChairoisAskitikon.mode	@ltx/en_us_dedes/miscellanea:misc.Mode5
ltx/en_us_dedes/he.a.m5:heAU.ChairoisAskitikon.name	Rejoice.
ltx/en_us_dedes/he.a.m5:heAU.ChairoisAskitikon.notmetered	N/M (Rejoice.)
ltx/en_us_dedes/he.a.m5:heAU.ChairoisAskitikon.text	Rejoice, the fragrant treasure indeed * of true ascetical achievements, all-blessed one, * for taking upon your shoulders the cross and giving yourself * over to the Master Christ entirely, * you trampled the mind intent on the flesh and on earthly things, * and with the virtues made your soul shine resplendently, * and you raised it up to intense love inspired by God. * Therefore, all-lauded Saint, as we surround your all-holy tomb, * O father Savas, we ask that divine benevolence come to us, * by your intercessions, * and beseech the Lord to grant His great mercy to the world.
ltx/en_us_dedes/he.a.m5:heAU.LampeiSimeron.greekname	Λάμπει σήμερον.
ltx/en_us_dedes/he.a.m5:heAU.LampeiSimeron.incipit	…
ltx/en_us_dedes/he.a.m5:heAU.LampeiSimeron.melody	@ltx/en_us_dedes/miscellanea:misc.Automelon
ltx/en_us_dedes/he.a.m5:heAU.LampeiSimeron.mode	@ltx/en_us_dedes/miscellanea:misc.Mode5
ltx/en_us_dedes/he.a.m5:heAU.LampeiSimeron.name	
ltx/en_us_dedes/he.a.m5:heAU.LampeiSimeron.notmetered	N/M ()
ltx/en_us_dedes/he.a.m5:heAU.LampeiSimeron.text	
ltx/en_us_dedes/he.a.m5:heAU.OsiePater.greekname	Ὅσιε Πάτερ.
ltx/en_us_dedes/he.a.m5:heAU.OsiePater.incipit	Devout and God-bearing father…
ltx/en_us_dedes/he.a.m5:heAU.OsiePater.melody	@ltx/en_us_dedes/miscellanea:misc.Automelon
ltx/en_us_dedes/he.a.m5:heAU.OsiePater.mode	@ltx/en_us_dedes/miscellanea:misc.Mode5
ltx/en_us_dedes/he.a.m5:heAU.OsiePater.name	Devout and God-bearing father.
ltx/en_us_dedes/he.a.m5:heAU.OsiePater.notmetered	N/M (Devout and God-bearing father.)
ltx/en_us_dedes/he.a.m5:heAU.OsiePater.text	Devout and God-bearing father Theodosios, * so greatly did you struggle during this temporal life * in singing hymns and fasting and keeping vigils, * for your disciples you were a model and rule. * Now you join in chorus with the bodiless angels, * unceasingly glorifying Christ, * who is our Redeemer, and God the Logos from God, * who bowed His head and was baptized by the Forerunner, * and also sanctified the nature of the waters. * O Saint, we pray you implore Him, entreat Him earnestly, * that He grant to the Church forever * unanimity, lasting peace and the great mercy.
ltx/en_us_dedes/he.a.m5:heAU.TonSynanarchonLogon.greekname	Τὸν συνάναρχον Λόγον.
ltx/en_us_dedes/he.a.m5:heAU.TonSynanarchonLogon.incipit	Let us worship the Word…
ltx/en_us_dedes/he.a.m5:heAU.TonSynanarchonLogon.melody	@ltx/en_us_dedes/miscellanea:misc.Automelon
ltx/en_us_dedes/he.a.m5:heAU.TonSynanarchonLogon.mode	@ltx/en_us_dedes/miscellanea:misc.Mode5
ltx/en_us_dedes/he.a.m5:heAU.TonSynanarchonLogon.name	As the Father and Spirit.
ltx/en_us_dedes/he.a.m5:heAU.TonSynanarchonLogon.notmetered	N/M (As the Father and Spirit.)
ltx/en_us_dedes/he.a.m5:heAU.TonSynanarchonLogon.text	Let us worship the Word who is unoriginate * with the Father and the Spirit, and from a Virgin was born * for our salvation, O believers, and let us sing His praise. * For in His goodness He was pleased * to ascend the Cross in the flesh, and to undergo death, * and to raise up those who had died, * by His glorious Resurrection.
ltx/en_us_dedes/he.a.m5:heAU.title	Automela of Mode pl. 1
