ltx/en_us_dedes/sy.m01.d17:cl.syMA.commemoration01.text	[saint/com 1]
ltx/en_us_dedes/sy.m01.d17:cl.syMA.commemoration02.text	[saint/com 2]
ltx/en_us_dedes/sy.m01.d17:cl.syMA.commemoration03.text	[saint/com 3]
ltx/en_us_dedes/sy.m01.d17:cl.syMA.commemoration04.text	[saint/com 4]
ltx/en_us_dedes/sy.m01.d17:cl.syMA.commemoration05.text	[saint/com 5]
ltx/en_us_dedes/sy.m01.d17:cl.syMA.commemoration06.text	[saint/com list]
ltx/en_us_dedes/sy.m01.d17:syMA.commemoration01.couplet1.title	@ltx/en_us_dedes/titles:ti.Verses
ltx/en_us_dedes/sy.m01.d17:syMA.commemoration01.couplet1.verse1	
ltx/en_us_dedes/sy.m01.d17:syMA.commemoration01.couplet1.verse2	
ltx/en_us_dedes/sy.m01.d17:syMA.commemoration01.narration.p01	
ltx/en_us_dedes/sy.m01.d17:syMA.commemoration01.single1	
ltx/en_us_dedes/sy.m01.d17:syMA.commemoration01.text	On January 17, we commemorate our devout father Anthony the Great.
ltx/en_us_dedes/sy.m01.d17:syMA.commemoration02.couplet1.title	@ltx/en_us_dedes/titles:ti.Verses
ltx/en_us_dedes/sy.m01.d17:syMA.commemoration02.couplet1.verse1	
ltx/en_us_dedes/sy.m01.d17:syMA.commemoration02.couplet1.verse2	
ltx/en_us_dedes/sy.m01.d17:syMA.commemoration02.text	On this day we also commemorate our devout and God-bearing father and Wonderworker Anthony the New, who lived as an ascetic in a Skete in Beroea.
ltx/en_us_dedes/sy.m01.d17:syMA.commemoration03.couplet1.title	@ltx/en_us_dedes/titles:ti.Verses
ltx/en_us_dedes/sy.m01.d17:syMA.commemoration03.couplet1.verse1	
ltx/en_us_dedes/sy.m01.d17:syMA.commemoration03.couplet1.verse2	
ltx/en_us_dedes/sy.m01.d17:syMA.commemoration03.text	On this day, devout St. Achillas died in peace.
ltx/en_us_dedes/sy.m01.d17:syMA.commemoration04.couplet1.title	@ltx/en_us_dedes/titles:ti.Verses
ltx/en_us_dedes/sy.m01.d17:syMA.commemoration04.couplet1.verse1	
ltx/en_us_dedes/sy.m01.d17:syMA.commemoration04.couplet1.verse2	
ltx/en_us_dedes/sy.m01.d17:syMA.commemoration04.text	On this day we also commemorate the pious Emperor Theodosios the Great.
ltx/en_us_dedes/sy.m01.d17:syMA.commemoration05.couplet1.title	@ltx/en_us_dedes/titles:ti.Verses
ltx/en_us_dedes/sy.m01.d17:syMA.commemoration05.couplet1.verse1	
ltx/en_us_dedes/sy.m01.d17:syMA.commemoration05.couplet1.verse2	
ltx/en_us_dedes/sy.m01.d17:syMA.commemoration05.text	On this day we also commemorate the holy Neomartyr George of Ioannina, who contested in the year 1838.
ltx/en_us_dedes/sy.m01.d17:syMA.lastline	By their holy intercessions, O God, have mercy on us. Amen.
