ltx/en_us_dedes/me.m05.d09:meDA.commemoration.first	Memory of the Holy Martyr Christopher
ltx/en_us_dedes/me.m05.d09:meDA.commemoration.first_name	Prophet Isaiah
ltx/en_us_dedes/me.m05.d09:meDA.commemoration.first_short	Memory of the Holy Martyr Christopher
ltx/en_us_dedes/me.m05.d09:meDA.commemoration.first_title	@ltx/en_us_dedes/titles:ti.Prophet
ltx/en_us_dedes/me.m05.d09:meDA.commemoration.full	Memory of the Holy Prophet Isaiah; and the Holy Martyr Christopher
ltx/en_us_dedes/me.m05.d09:meDA.commemoration.second_name	St. Christopher
ltx/en_us_dedes/me.m05.d09:meDA.commemoration.second_title	@ltx/en_us_dedes/titles:ti.Martyr
ltx/en_us_dedes/me.m05.d09:meDA.date	May 9
ltx/en_us_dedes/me.m05.d09:meDA.fordate	for May 9
ltx/en_us_dedes/me.m05.d09:meDA.insert1	the holy and glorious Prophet Isaiah and the holy and glorious Martyr Christopher,
ltx/en_us_dedes/me.m05.d09:meDA.insert2	whose memory we observe,
ltx/en_us_dedes/me.m05.d09:meDA.note	
ltx/en_us_dedes/me.m05.d09:meDA.pdfcoverdate	May 9,
ltx/en_us_dedes/me.m05.d09:meDA.pdfheaderdate	May 9
ltx/en_us_dedes/me.m05.d09:meHO.commemorations	
ltx/en_us_dedes/me.m05.d09:meHO.note1	
ltx/en_us_dedes/me.m05.d09:meHO.note2	
ltx/en_us_dedes/me.m05.d09:meHO.number	
ltx/en_us_dedes/me.m05.d09:meHO.rank	
ltx/en_us_dedes/me.m05.d09:meLE.commemoration1	The Holy Prophet Isaiah.
ltx/en_us_dedes/me.m05.d09:meLE.commemoration2	
ltx/en_us_dedes/me.m05.d09:meLI.Kontakion1.greekmelody	@ltx/en_us_dedes/me.m05.d09:meMA.Kontakion1.greekmelody
ltx/en_us_dedes/me.m05.d09:meLI.Kontakion1.incipit	@ltx/en_us_dedes/me.m05.d09:meMA.Kontakion1.incipit
ltx/en_us_dedes/me.m05.d09:meLI.Kontakion1.melody	@ltx/en_us_dedes/me.m05.d09:meMA.Kontakion1.melody
ltx/en_us_dedes/me.m05.d09:meLI.Kontakion1.mode	@ltx/en_us_dedes/me.m05.d09:meMA.Kontakion1.mode
ltx/en_us_dedes/me.m05.d09:meLI.Kontakion1.text	@ltx/en_us_dedes/me.m05.d09:meMA.Kontakion1.text
ltx/en_us_dedes/me.m05.d09:meLI.MM.CommunionHymn.text	@ltx/en_us_dedes/properties:media.key
ltx/en_us_dedes/me.m05.d09:meLI.Megalynarion.text	
ltx/en_us_dedes/me.m05.d09:meLI.Megalynarion2.text	
ltx/en_us_dedes/me.m05.d09:meMA.C1.poet	@ltx/en_us_dedes/poets:po.Theofanous
ltx/en_us_dedes/me.m05.d09:meMA.C1.title	@ltx/en_us_dedes/titles:ti.CanonProphet
ltx/en_us_dedes/me.m05.d09:meMA.C1.verse	@ltx/en_us_dedes/prayers:pr.verse_Prophet.text
ltx/en_us_dedes/me.m05.d09:meMA.C2.title	@ltx/en_us_dedes/titles:ti.CanonMartyrM
ltx/en_us_dedes/me.m05.d09:meMA.C2.verse	@ltx/en_us_dedes/prayers:pr.verse_SaintM.text
ltx/en_us_dedes/me.m05.d09:meMA.Kontakion1.greekmelody	@ltx/en_us_dedes/he.a.m6:heAU.TinEnPresveiais.greekname
ltx/en_us_dedes/me.m05.d09:meMA.Kontakion1.incipit	Prophet and Martyr and divine…
ltx/en_us_dedes/me.m05.d09:meMA.Kontakion1.melody	@ltx/en_us_dedes/he.a.m6:heAU.TinEnPresveiais.name
ltx/en_us_dedes/me.m05.d09:meMA.Kontakion1.mode	@ltx/en_us_dedes/miscellanea:misc.Mode6
ltx/en_us_dedes/me.m05.d09:meMA.Kontakion1.text	Prophet and Martyr and divine herald Isaiah, * when you received the gift of prophecy, you cried out * publicly to everyone in the whole world, * and you announced the incarnation of God emphatically: * “Behold, the Virgin will conceive in the womb.”
ltx/en_us_dedes/me.m05.d09:meMA.Ode1C11.greekmelody	@ltx/en_us_dedes/he.h.m4:heHE.AsomaiSoiKyrie.greekname
ltx/en_us_dedes/me.m05.d09:meMA.Ode1C11.incipit	…
ltx/en_us_dedes/me.m05.d09:meMA.Ode1C11.melody	@ltx/en_us_dedes/he.h.m4:heHE.AsomaiSoiKyrie.name
ltx/en_us_dedes/me.m05.d09:meMA.Ode1C11.mode	@ltx/en_us_dedes/miscellanea:misc.Mode4
ltx/en_us_dedes/me.m05.d09:meMA.Ode1C11.ode	@ltx/en_us_dedes/miscellanea:misc.Ode1
ltx/en_us_dedes/me.m05.d09:meMA.Ode1C11.text	
ltx/en_us_dedes/me.m05.d09:meMA.Ode1C12.incipit	…
ltx/en_us_dedes/me.m05.d09:meMA.Ode1C12.melody	@ltx/en_us_dedes/he.h.m4:heHE.AsomaiSoiKyrie.name
ltx/en_us_dedes/me.m05.d09:meMA.Ode1C12.mode	@ltx/en_us_dedes/miscellanea:misc.Mode4
ltx/en_us_dedes/me.m05.d09:meMA.Ode1C12.ode	@ltx/en_us_dedes/miscellanea:misc.Ode1
ltx/en_us_dedes/me.m05.d09:meMA.Ode1C12.text	
ltx/en_us_dedes/me.m05.d09:meMA.Ode1C13.incipit	…
ltx/en_us_dedes/me.m05.d09:meMA.Ode1C13.melody	@ltx/en_us_dedes/he.h.m4:heHE.AsomaiSoiKyrie.name
ltx/en_us_dedes/me.m05.d09:meMA.Ode1C13.mode	@ltx/en_us_dedes/miscellanea:misc.Mode4
ltx/en_us_dedes/me.m05.d09:meMA.Ode1C13.ode	@ltx/en_us_dedes/miscellanea:misc.Ode1
ltx/en_us_dedes/me.m05.d09:meMA.Ode1C13.text	
ltx/en_us_dedes/me.m05.d09:meMA.Ode1C21.greekmelody	@ltx/en_us_dedes/he.h.m4:heHE.AsomaiSoiKyrie.greekname
ltx/en_us_dedes/me.m05.d09:meMA.Ode1C21.incipit	…
ltx/en_us_dedes/me.m05.d09:meMA.Ode1C21.melody	@ltx/en_us_dedes/he.h.m4:heHE.AsomaiSoiKyrie.name
ltx/en_us_dedes/me.m05.d09:meMA.Ode1C21.mode	@ltx/en_us_dedes/miscellanea:misc.Mode4
ltx/en_us_dedes/me.m05.d09:meMA.Ode1C21.ode	@ltx/en_us_dedes/miscellanea:misc.Ode1
ltx/en_us_dedes/me.m05.d09:meMA.Ode1C21.text	
ltx/en_us_dedes/me.m05.d09:meMA.Ode1C22.incipit	…
ltx/en_us_dedes/me.m05.d09:meMA.Ode1C22.melody	@ltx/en_us_dedes/he.h.m4:heHE.AsomaiSoiKyrie.name
ltx/en_us_dedes/me.m05.d09:meMA.Ode1C22.mode	@ltx/en_us_dedes/miscellanea:misc.Mode4
ltx/en_us_dedes/me.m05.d09:meMA.Ode1C22.ode	@ltx/en_us_dedes/miscellanea:misc.Ode1
ltx/en_us_dedes/me.m05.d09:meMA.Ode1C22.text	
ltx/en_us_dedes/me.m05.d09:meMA.Ode1C2T.incipit	…
ltx/en_us_dedes/me.m05.d09:meMA.Ode1C2T.melody	@ltx/en_us_dedes/he.h.m4:heHE.AsomaiSoiKyrie.name
ltx/en_us_dedes/me.m05.d09:meMA.Ode1C2T.mode	@ltx/en_us_dedes/miscellanea:misc.Mode4
ltx/en_us_dedes/me.m05.d09:meMA.Ode1C2T.ode	@ltx/en_us_dedes/miscellanea:misc.Ode1
ltx/en_us_dedes/me.m05.d09:meMA.Ode1C2T.text	
ltx/en_us_dedes/me.m05.d09:meMA.Ode3C11.greekmelody	@ltx/en_us_dedes/he.h.m4:heHE.ToxonDynatonIsthenise.greekname
ltx/en_us_dedes/me.m05.d09:meMA.Ode3C11.incipit	…
ltx/en_us_dedes/me.m05.d09:meMA.Ode3C11.melody	@ltx/en_us_dedes/he.h.m4:heHE.ToxonDynatonIsthenise.name
ltx/en_us_dedes/me.m05.d09:meMA.Ode3C11.mode	@ltx/en_us_dedes/miscellanea:misc.Mode4
ltx/en_us_dedes/me.m05.d09:meMA.Ode3C11.ode	@ltx/en_us_dedes/miscellanea:misc.Ode3
ltx/en_us_dedes/me.m05.d09:meMA.Ode3C11.text	
ltx/en_us_dedes/me.m05.d09:meMA.Ode3C12.incipit	…
ltx/en_us_dedes/me.m05.d09:meMA.Ode3C12.melody	@ltx/en_us_dedes/he.h.m4:heHE.ToxonDynatonIsthenise.name
ltx/en_us_dedes/me.m05.d09:meMA.Ode3C12.mode	@ltx/en_us_dedes/miscellanea:misc.Mode4
ltx/en_us_dedes/me.m05.d09:meMA.Ode3C12.ode	@ltx/en_us_dedes/miscellanea:misc.Ode3
ltx/en_us_dedes/me.m05.d09:meMA.Ode3C12.text	
ltx/en_us_dedes/me.m05.d09:meMA.Ode3C13.incipit	…
ltx/en_us_dedes/me.m05.d09:meMA.Ode3C13.melody	@ltx/en_us_dedes/he.h.m4:heHE.ToxonDynatonIsthenise.name
ltx/en_us_dedes/me.m05.d09:meMA.Ode3C13.mode	@ltx/en_us_dedes/miscellanea:misc.Mode4
ltx/en_us_dedes/me.m05.d09:meMA.Ode3C13.ode	@ltx/en_us_dedes/miscellanea:misc.Ode3
ltx/en_us_dedes/me.m05.d09:meMA.Ode3C13.text	
ltx/en_us_dedes/me.m05.d09:meMA.Ode3C21.greekmelody	@ltx/en_us_dedes/he.h.m4:heHE.ToxonDynatonIsthenise.greekname
ltx/en_us_dedes/me.m05.d09:meMA.Ode3C21.incipit	…
ltx/en_us_dedes/me.m05.d09:meMA.Ode3C21.melody	@ltx/en_us_dedes/he.h.m4:heHE.ToxonDynatonIsthenise.name
ltx/en_us_dedes/me.m05.d09:meMA.Ode3C21.mode	@ltx/en_us_dedes/miscellanea:misc.Mode4
ltx/en_us_dedes/me.m05.d09:meMA.Ode3C21.ode	@ltx/en_us_dedes/miscellanea:misc.Ode3
ltx/en_us_dedes/me.m05.d09:meMA.Ode3C21.text	
ltx/en_us_dedes/me.m05.d09:meMA.Ode3C22.incipit	…
ltx/en_us_dedes/me.m05.d09:meMA.Ode3C22.melody	@ltx/en_us_dedes/he.h.m4:heHE.ToxonDynatonIsthenise.name
ltx/en_us_dedes/me.m05.d09:meMA.Ode3C22.mode	@ltx/en_us_dedes/miscellanea:misc.Mode4
ltx/en_us_dedes/me.m05.d09:meMA.Ode3C22.ode	@ltx/en_us_dedes/miscellanea:misc.Ode3
ltx/en_us_dedes/me.m05.d09:meMA.Ode3C22.text	
ltx/en_us_dedes/me.m05.d09:meMA.Ode3C2T.incipit	…
ltx/en_us_dedes/me.m05.d09:meMA.Ode3C2T.melody	@ltx/en_us_dedes/he.h.m4:heHE.ToxonDynatonIsthenise.name
ltx/en_us_dedes/me.m05.d09:meMA.Ode3C2T.mode	@ltx/en_us_dedes/miscellanea:misc.Mode4
ltx/en_us_dedes/me.m05.d09:meMA.Ode3C2T.ode	@ltx/en_us_dedes/miscellanea:misc.Ode3
ltx/en_us_dedes/me.m05.d09:meMA.Ode3C2T.text	
ltx/en_us_dedes/me.m05.d09:meMA.Ode3H.greekmelody	@ltx/en_us_dedes/he.h.m4:heHE.ToxonDynatonIsthenise.greekname
ltx/en_us_dedes/me.m05.d09:meMA.Ode3H.incipit	@ltx/en_us_dedes/he.h.m4:heHE.ToxonDynatonIsthenise.incipit
ltx/en_us_dedes/me.m05.d09:meMA.Ode3H.melody	@ltx/en_us_dedes/he.h.m4:heHE.ToxonDynatonIsthenise.melody
ltx/en_us_dedes/me.m05.d09:meMA.Ode3H.mode	@ltx/en_us_dedes/miscellanea:misc.Mode4
ltx/en_us_dedes/me.m05.d09:meMA.Ode3H.ode	@ltx/en_us_dedes/miscellanea:misc.Ode3
ltx/en_us_dedes/me.m05.d09:meMA.Ode3H.text	@ltx/en_us_dedes/he.h.m4:heHE.ToxonDynatonIsthenise.text
ltx/en_us_dedes/me.m05.d09:meMA.Ode3Kathisma1.greekmelody	@ltx/en_us_dedes/he.a.m3:heAU.TheiasPisteos.greekname
ltx/en_us_dedes/me.m05.d09:meMA.Ode3Kathisma1.incipit	…
ltx/en_us_dedes/me.m05.d09:meMA.Ode3Kathisma1.melody	@ltx/en_us_dedes/he.a.m3:heAU.TheiasPisteos.name
ltx/en_us_dedes/me.m05.d09:meMA.Ode3Kathisma1.mode	@ltx/en_us_dedes/miscellanea:misc.Mode3
ltx/en_us_dedes/me.m05.d09:meMA.Ode3Kathisma1.text	
ltx/en_us_dedes/me.m05.d09:meMA.Ode3Kathisma2.greekmelody	@ltx/en_us_dedes/he.a.m8:heAU.TinSofianKaiLogon.greekname
ltx/en_us_dedes/me.m05.d09:meMA.Ode3Kathisma2.incipit	…
ltx/en_us_dedes/me.m05.d09:meMA.Ode3Kathisma2.melody	@ltx/en_us_dedes/he.a.m8:heAU.TinSofianKaiLogon.name
ltx/en_us_dedes/me.m05.d09:meMA.Ode3Kathisma2.mode	@ltx/en_us_dedes/miscellanea:misc.Mode8
ltx/en_us_dedes/me.m05.d09:meMA.Ode3Kathisma2.text	
ltx/en_us_dedes/me.m05.d09:meMA.Ode4C11.greekmelody	@ltx/en_us_dedes/he.h.m4:heHE.TisSisEpiGis.greekname
ltx/en_us_dedes/me.m05.d09:meMA.Ode4C11.incipit	…
ltx/en_us_dedes/me.m05.d09:meMA.Ode4C11.melody	@ltx/en_us_dedes/he.h.m4:heHE.TisSisEpiGis.name
ltx/en_us_dedes/me.m05.d09:meMA.Ode4C11.mode	@ltx/en_us_dedes/miscellanea:misc.Mode4
ltx/en_us_dedes/me.m05.d09:meMA.Ode4C11.ode	@ltx/en_us_dedes/miscellanea:misc.Ode4
ltx/en_us_dedes/me.m05.d09:meMA.Ode4C11.text	
ltx/en_us_dedes/me.m05.d09:meMA.Ode4C12.incipit	…
ltx/en_us_dedes/me.m05.d09:meMA.Ode4C12.melody	@ltx/en_us_dedes/he.h.m4:heHE.TisSisEpiGis.name
ltx/en_us_dedes/me.m05.d09:meMA.Ode4C12.mode	@ltx/en_us_dedes/miscellanea:misc.Mode4
ltx/en_us_dedes/me.m05.d09:meMA.Ode4C12.ode	@ltx/en_us_dedes/miscellanea:misc.Ode4
ltx/en_us_dedes/me.m05.d09:meMA.Ode4C12.text	
ltx/en_us_dedes/me.m05.d09:meMA.Ode4C13.incipit	…
ltx/en_us_dedes/me.m05.d09:meMA.Ode4C13.melody	@ltx/en_us_dedes/he.h.m4:heHE.TisSisEpiGis.name
ltx/en_us_dedes/me.m05.d09:meMA.Ode4C13.mode	@ltx/en_us_dedes/miscellanea:misc.Mode4
ltx/en_us_dedes/me.m05.d09:meMA.Ode4C13.ode	@ltx/en_us_dedes/miscellanea:misc.Ode4
ltx/en_us_dedes/me.m05.d09:meMA.Ode4C13.text	
ltx/en_us_dedes/me.m05.d09:meMA.Ode4C21.greekmelody	@ltx/en_us_dedes/he.h.m4:heHE.TisSisEpiGis.greekname
ltx/en_us_dedes/me.m05.d09:meMA.Ode4C21.incipit	…
ltx/en_us_dedes/me.m05.d09:meMA.Ode4C21.melody	@ltx/en_us_dedes/he.h.m4:heHE.TisSisEpiGis.name
ltx/en_us_dedes/me.m05.d09:meMA.Ode4C21.mode	@ltx/en_us_dedes/miscellanea:misc.Mode4
ltx/en_us_dedes/me.m05.d09:meMA.Ode4C21.ode	@ltx/en_us_dedes/miscellanea:misc.Ode4
ltx/en_us_dedes/me.m05.d09:meMA.Ode4C21.text	
ltx/en_us_dedes/me.m05.d09:meMA.Ode4C22.incipit	…
ltx/en_us_dedes/me.m05.d09:meMA.Ode4C22.melody	@ltx/en_us_dedes/he.h.m4:heHE.TisSisEpiGis.name
ltx/en_us_dedes/me.m05.d09:meMA.Ode4C22.mode	@ltx/en_us_dedes/miscellanea:misc.Mode4
ltx/en_us_dedes/me.m05.d09:meMA.Ode4C22.ode	@ltx/en_us_dedes/miscellanea:misc.Ode4
ltx/en_us_dedes/me.m05.d09:meMA.Ode4C22.text	
ltx/en_us_dedes/me.m05.d09:meMA.Ode4C2T.incipit	…
ltx/en_us_dedes/me.m05.d09:meMA.Ode4C2T.melody	@ltx/en_us_dedes/he.h.m4:heHE.TisSisEpiGis.name
ltx/en_us_dedes/me.m05.d09:meMA.Ode4C2T.mode	@ltx/en_us_dedes/miscellanea:misc.Mode4
ltx/en_us_dedes/me.m05.d09:meMA.Ode4C2T.ode	@ltx/en_us_dedes/miscellanea:misc.Ode4
ltx/en_us_dedes/me.m05.d09:meMA.Ode4C2T.text	
ltx/en_us_dedes/me.m05.d09:meMA.Ode5C11.greekmelody	@ltx/en_us_dedes/he.h.m4:heHE.TonFotismonSouKyrie.greekname
ltx/en_us_dedes/me.m05.d09:meMA.Ode5C11.incipit	…
ltx/en_us_dedes/me.m05.d09:meMA.Ode5C11.melody	@ltx/en_us_dedes/he.h.m4:heHE.TonFotismonSouKyrie.name
ltx/en_us_dedes/me.m05.d09:meMA.Ode5C11.mode	@ltx/en_us_dedes/miscellanea:misc.Mode4
ltx/en_us_dedes/me.m05.d09:meMA.Ode5C11.ode	@ltx/en_us_dedes/miscellanea:misc.Ode5
ltx/en_us_dedes/me.m05.d09:meMA.Ode5C11.text	
ltx/en_us_dedes/me.m05.d09:meMA.Ode5C12.incipit	…
ltx/en_us_dedes/me.m05.d09:meMA.Ode5C12.melody	@ltx/en_us_dedes/he.h.m4:heHE.TonFotismonSouKyrie.name
ltx/en_us_dedes/me.m05.d09:meMA.Ode5C12.mode	@ltx/en_us_dedes/miscellanea:misc.Mode4
ltx/en_us_dedes/me.m05.d09:meMA.Ode5C12.ode	@ltx/en_us_dedes/miscellanea:misc.Ode5
ltx/en_us_dedes/me.m05.d09:meMA.Ode5C12.text	
ltx/en_us_dedes/me.m05.d09:meMA.Ode5C13.incipit	…
ltx/en_us_dedes/me.m05.d09:meMA.Ode5C13.melody	@ltx/en_us_dedes/he.h.m4:heHE.TonFotismonSouKyrie.name
ltx/en_us_dedes/me.m05.d09:meMA.Ode5C13.mode	@ltx/en_us_dedes/miscellanea:misc.Mode4
ltx/en_us_dedes/me.m05.d09:meMA.Ode5C13.ode	@ltx/en_us_dedes/miscellanea:misc.Ode5
ltx/en_us_dedes/me.m05.d09:meMA.Ode5C13.text	
ltx/en_us_dedes/me.m05.d09:meMA.Ode5C21.greekmelody	@ltx/en_us_dedes/he.h.m4:heHE.TonFotismonSouKyrie.greekname
ltx/en_us_dedes/me.m05.d09:meMA.Ode5C21.incipit	…
ltx/en_us_dedes/me.m05.d09:meMA.Ode5C21.melody	@ltx/en_us_dedes/he.h.m4:heHE.TonFotismonSouKyrie.name
ltx/en_us_dedes/me.m05.d09:meMA.Ode5C21.mode	@ltx/en_us_dedes/miscellanea:misc.Mode4
ltx/en_us_dedes/me.m05.d09:meMA.Ode5C21.ode	@ltx/en_us_dedes/miscellanea:misc.Ode5
ltx/en_us_dedes/me.m05.d09:meMA.Ode5C21.text	
ltx/en_us_dedes/me.m05.d09:meMA.Ode5C2T.incipit	…
ltx/en_us_dedes/me.m05.d09:meMA.Ode5C2T.melody	@ltx/en_us_dedes/he.h.m4:heHE.TonFotismonSouKyrie.name
ltx/en_us_dedes/me.m05.d09:meMA.Ode5C2T.mode	@ltx/en_us_dedes/miscellanea:misc.Mode4
ltx/en_us_dedes/me.m05.d09:meMA.Ode5C2T.ode	@ltx/en_us_dedes/miscellanea:misc.Ode5
ltx/en_us_dedes/me.m05.d09:meMA.Ode5C2T.text	
ltx/en_us_dedes/me.m05.d09:meMA.Ode6C11.greekmelody	@ltx/en_us_dedes/he.h.m4:heHE.EvoiseProtypon.greekname
ltx/en_us_dedes/me.m05.d09:meMA.Ode6C11.incipit	…
ltx/en_us_dedes/me.m05.d09:meMA.Ode6C11.melody	@ltx/en_us_dedes/he.h.m4:heHE.EvoiseProtypon.name
ltx/en_us_dedes/me.m05.d09:meMA.Ode6C11.mode	@ltx/en_us_dedes/miscellanea:misc.Mode4
ltx/en_us_dedes/me.m05.d09:meMA.Ode6C11.ode	@ltx/en_us_dedes/miscellanea:misc.Ode6
ltx/en_us_dedes/me.m05.d09:meMA.Ode6C11.text	
ltx/en_us_dedes/me.m05.d09:meMA.Ode6C12.incipit	…
ltx/en_us_dedes/me.m05.d09:meMA.Ode6C12.melody	@ltx/en_us_dedes/he.h.m4:heHE.EvoiseProtypon.name
ltx/en_us_dedes/me.m05.d09:meMA.Ode6C12.mode	@ltx/en_us_dedes/miscellanea:misc.Mode4
ltx/en_us_dedes/me.m05.d09:meMA.Ode6C12.ode	@ltx/en_us_dedes/miscellanea:misc.Ode6
ltx/en_us_dedes/me.m05.d09:meMA.Ode6C12.text	
ltx/en_us_dedes/me.m05.d09:meMA.Ode6C13.incipit	…
ltx/en_us_dedes/me.m05.d09:meMA.Ode6C13.melody	@ltx/en_us_dedes/he.h.m4:heHE.EvoiseProtypon.name
ltx/en_us_dedes/me.m05.d09:meMA.Ode6C13.mode	@ltx/en_us_dedes/miscellanea:misc.Mode4
ltx/en_us_dedes/me.m05.d09:meMA.Ode6C13.ode	@ltx/en_us_dedes/miscellanea:misc.Ode6
ltx/en_us_dedes/me.m05.d09:meMA.Ode6C13.text	
ltx/en_us_dedes/me.m05.d09:meMA.Ode6C21.greekmelody	@ltx/en_us_dedes/he.h.m4:heHE.EvoiseProtypon.greekname
ltx/en_us_dedes/me.m05.d09:meMA.Ode6C21.incipit	…
ltx/en_us_dedes/me.m05.d09:meMA.Ode6C21.melody	@ltx/en_us_dedes/he.h.m4:heHE.EvoiseProtypon.name
ltx/en_us_dedes/me.m05.d09:meMA.Ode6C21.mode	@ltx/en_us_dedes/miscellanea:misc.Mode4
ltx/en_us_dedes/me.m05.d09:meMA.Ode6C21.ode	@ltx/en_us_dedes/miscellanea:misc.Ode6
ltx/en_us_dedes/me.m05.d09:meMA.Ode6C21.text	
ltx/en_us_dedes/me.m05.d09:meMA.Ode6C22.incipit	…
ltx/en_us_dedes/me.m05.d09:meMA.Ode6C22.melody	@ltx/en_us_dedes/he.h.m4:heHE.EvoiseProtypon.name
ltx/en_us_dedes/me.m05.d09:meMA.Ode6C22.mode	@ltx/en_us_dedes/miscellanea:misc.Mode4
ltx/en_us_dedes/me.m05.d09:meMA.Ode6C22.ode	@ltx/en_us_dedes/miscellanea:misc.Ode6
ltx/en_us_dedes/me.m05.d09:meMA.Ode6C22.text	
ltx/en_us_dedes/me.m05.d09:meMA.Ode6C2T.incipit	…
ltx/en_us_dedes/me.m05.d09:meMA.Ode6C2T.melody	@ltx/en_us_dedes/he.h.m4:heHE.EvoiseProtypon.name
ltx/en_us_dedes/me.m05.d09:meMA.Ode6C2T.mode	@ltx/en_us_dedes/miscellanea:misc.Mode4
ltx/en_us_dedes/me.m05.d09:meMA.Ode6C2T.ode	@ltx/en_us_dedes/miscellanea:misc.Ode6
ltx/en_us_dedes/me.m05.d09:meMA.Ode6C2T.text	
ltx/en_us_dedes/me.m05.d09:meMA.Ode6H.greekmelody	@ltx/en_us_dedes/he.h.m4:heHE.EvoiseProtypon.greekname
ltx/en_us_dedes/me.m05.d09:meMA.Ode6H.incipit	@ltx/en_us_dedes/he.h.m4:heHE.EvoiseProtypon.incipit
ltx/en_us_dedes/me.m05.d09:meMA.Ode6H.melody	@ltx/en_us_dedes/he.h.m4:heHE.EvoiseProtypon.melody
ltx/en_us_dedes/me.m05.d09:meMA.Ode6H.mode	@ltx/en_us_dedes/miscellanea:misc.Mode4
ltx/en_us_dedes/me.m05.d09:meMA.Ode6H.ode	@ltx/en_us_dedes/miscellanea:misc.Ode6
ltx/en_us_dedes/me.m05.d09:meMA.Ode6H.text	@ltx/en_us_dedes/he.h.m4:heHE.EvoiseProtypon.text
ltx/en_us_dedes/me.m05.d09:meMA.Ode7C11.greekmelody	@ltx/en_us_dedes/he.h.m4:heHE.AvramiaioiPote.greekname
ltx/en_us_dedes/me.m05.d09:meMA.Ode7C11.incipit	…
ltx/en_us_dedes/me.m05.d09:meMA.Ode7C11.melody	@ltx/en_us_dedes/he.h.m4:heHE.AvramiaioiPote.name
ltx/en_us_dedes/me.m05.d09:meMA.Ode7C11.mode	@ltx/en_us_dedes/miscellanea:misc.Mode4
ltx/en_us_dedes/me.m05.d09:meMA.Ode7C11.ode	@ltx/en_us_dedes/miscellanea:misc.Ode7
ltx/en_us_dedes/me.m05.d09:meMA.Ode7C11.text	
ltx/en_us_dedes/me.m05.d09:meMA.Ode7C12.incipit	…
ltx/en_us_dedes/me.m05.d09:meMA.Ode7C12.melody	@ltx/en_us_dedes/he.h.m4:heHE.AvramiaioiPote.name
ltx/en_us_dedes/me.m05.d09:meMA.Ode7C12.mode	@ltx/en_us_dedes/miscellanea:misc.Mode4
ltx/en_us_dedes/me.m05.d09:meMA.Ode7C12.ode	@ltx/en_us_dedes/miscellanea:misc.Ode7
ltx/en_us_dedes/me.m05.d09:meMA.Ode7C12.text	
ltx/en_us_dedes/me.m05.d09:meMA.Ode7C13.incipit	…
ltx/en_us_dedes/me.m05.d09:meMA.Ode7C13.melody	@ltx/en_us_dedes/he.h.m4:heHE.AvramiaioiPote.name
ltx/en_us_dedes/me.m05.d09:meMA.Ode7C13.mode	@ltx/en_us_dedes/miscellanea:misc.Mode4
ltx/en_us_dedes/me.m05.d09:meMA.Ode7C13.ode	@ltx/en_us_dedes/miscellanea:misc.Ode7
ltx/en_us_dedes/me.m05.d09:meMA.Ode7C13.text	
ltx/en_us_dedes/me.m05.d09:meMA.Ode7C21.greekmelody	@ltx/en_us_dedes/he.h.m4:heHE.AvramiaioiPote.greekname
ltx/en_us_dedes/me.m05.d09:meMA.Ode7C21.incipit	…
ltx/en_us_dedes/me.m05.d09:meMA.Ode7C21.melody	@ltx/en_us_dedes/he.h.m4:heHE.AvramiaioiPote.name
ltx/en_us_dedes/me.m05.d09:meMA.Ode7C21.mode	@ltx/en_us_dedes/miscellanea:misc.Mode4
ltx/en_us_dedes/me.m05.d09:meMA.Ode7C21.ode	@ltx/en_us_dedes/miscellanea:misc.Ode7
ltx/en_us_dedes/me.m05.d09:meMA.Ode7C21.text	
ltx/en_us_dedes/me.m05.d09:meMA.Ode7C22.incipit	…
ltx/en_us_dedes/me.m05.d09:meMA.Ode7C22.melody	@ltx/en_us_dedes/he.h.m4:heHE.AvramiaioiPote.name
ltx/en_us_dedes/me.m05.d09:meMA.Ode7C22.mode	@ltx/en_us_dedes/miscellanea:misc.Mode4
ltx/en_us_dedes/me.m05.d09:meMA.Ode7C22.ode	@ltx/en_us_dedes/miscellanea:misc.Ode7
ltx/en_us_dedes/me.m05.d09:meMA.Ode7C22.text	
ltx/en_us_dedes/me.m05.d09:meMA.Ode7C2T.incipit	…
ltx/en_us_dedes/me.m05.d09:meMA.Ode7C2T.melody	@ltx/en_us_dedes/he.h.m4:heHE.AvramiaioiPote.name
ltx/en_us_dedes/me.m05.d09:meMA.Ode7C2T.mode	@ltx/en_us_dedes/miscellanea:misc.Mode4
ltx/en_us_dedes/me.m05.d09:meMA.Ode7C2T.ode	@ltx/en_us_dedes/miscellanea:misc.Ode7
ltx/en_us_dedes/me.m05.d09:meMA.Ode7C2T.text	
ltx/en_us_dedes/me.m05.d09:meMA.Ode8C11.greekmelody	@ltx/en_us_dedes/he.h.m4:heHE.OiEnVavyloniPaides.greekname
ltx/en_us_dedes/me.m05.d09:meMA.Ode8C11.incipit	…
ltx/en_us_dedes/me.m05.d09:meMA.Ode8C11.melody	@ltx/en_us_dedes/he.h.m4:heHE.OiEnVavyloniPaides.name
ltx/en_us_dedes/me.m05.d09:meMA.Ode8C11.mode	@ltx/en_us_dedes/miscellanea:misc.Mode4
ltx/en_us_dedes/me.m05.d09:meMA.Ode8C11.ode	@ltx/en_us_dedes/miscellanea:misc.Ode8
ltx/en_us_dedes/me.m05.d09:meMA.Ode8C11.text	
ltx/en_us_dedes/me.m05.d09:meMA.Ode8C12.incipit	…
ltx/en_us_dedes/me.m05.d09:meMA.Ode8C12.melody	@ltx/en_us_dedes/he.h.m4:heHE.OiEnVavyloniPaides.name
ltx/en_us_dedes/me.m05.d09:meMA.Ode8C12.mode	@ltx/en_us_dedes/miscellanea:misc.Mode4
ltx/en_us_dedes/me.m05.d09:meMA.Ode8C12.ode	@ltx/en_us_dedes/miscellanea:misc.Ode8
ltx/en_us_dedes/me.m05.d09:meMA.Ode8C12.text	
ltx/en_us_dedes/me.m05.d09:meMA.Ode8C13.incipit	…
ltx/en_us_dedes/me.m05.d09:meMA.Ode8C13.melody	@ltx/en_us_dedes/he.h.m4:heHE.OiEnVavyloniPaides.name
ltx/en_us_dedes/me.m05.d09:meMA.Ode8C13.mode	@ltx/en_us_dedes/miscellanea:misc.Mode4
ltx/en_us_dedes/me.m05.d09:meMA.Ode8C13.ode	@ltx/en_us_dedes/miscellanea:misc.Ode8
ltx/en_us_dedes/me.m05.d09:meMA.Ode8C13.text	
ltx/en_us_dedes/me.m05.d09:meMA.Ode8C21.greekmelody	@ltx/en_us_dedes/he.h.m4:heHE.OiEnVavyloniPaides.greekname
ltx/en_us_dedes/me.m05.d09:meMA.Ode8C21.incipit	…
ltx/en_us_dedes/me.m05.d09:meMA.Ode8C21.melody	@ltx/en_us_dedes/he.h.m4:heHE.OiEnVavyloniPaides.name
ltx/en_us_dedes/me.m05.d09:meMA.Ode8C21.mode	@ltx/en_us_dedes/miscellanea:misc.Mode4
ltx/en_us_dedes/me.m05.d09:meMA.Ode8C21.ode	@ltx/en_us_dedes/miscellanea:misc.Ode8
ltx/en_us_dedes/me.m05.d09:meMA.Ode8C21.text	
ltx/en_us_dedes/me.m05.d09:meMA.Ode8C22.incipit	…
ltx/en_us_dedes/me.m05.d09:meMA.Ode8C22.melody	@ltx/en_us_dedes/he.h.m4:heHE.OiEnVavyloniPaides.name
ltx/en_us_dedes/me.m05.d09:meMA.Ode8C22.mode	@ltx/en_us_dedes/miscellanea:misc.Mode4
ltx/en_us_dedes/me.m05.d09:meMA.Ode8C22.ode	@ltx/en_us_dedes/miscellanea:misc.Ode8
ltx/en_us_dedes/me.m05.d09:meMA.Ode8C22.text	
ltx/en_us_dedes/me.m05.d09:meMA.Ode8C2T.incipit	…
ltx/en_us_dedes/me.m05.d09:meMA.Ode8C2T.melody	@ltx/en_us_dedes/he.h.m4:heHE.OiEnVavyloniPaides.name
ltx/en_us_dedes/me.m05.d09:meMA.Ode8C2T.mode	@ltx/en_us_dedes/miscellanea:misc.Mode4
ltx/en_us_dedes/me.m05.d09:meMA.Ode8C2T.ode	@ltx/en_us_dedes/miscellanea:misc.Ode8
ltx/en_us_dedes/me.m05.d09:meMA.Ode8C2T.text	
ltx/en_us_dedes/me.m05.d09:meMA.Ode8H.greekmelody	@ltx/en_us_dedes/he.h.m4:heHE.OiEnVavyloniPaides.greekname
ltx/en_us_dedes/me.m05.d09:meMA.Ode8H.incipit	@ltx/en_us_dedes/he.h.m4:heHE.OiEnVavyloniPaides.incipit
ltx/en_us_dedes/me.m05.d09:meMA.Ode8H.melody	@ltx/en_us_dedes/he.h.m4:heHE.OiEnVavyloniPaides.melody
ltx/en_us_dedes/me.m05.d09:meMA.Ode8H.mode	@ltx/en_us_dedes/miscellanea:misc.Mode4
ltx/en_us_dedes/me.m05.d09:meMA.Ode8H.ode	@ltx/en_us_dedes/miscellanea:misc.Ode8
ltx/en_us_dedes/me.m05.d09:meMA.Ode8H.text	@ltx/en_us_dedes/he.h.m4:heHE.OiEnVavyloniPaides.text
ltx/en_us_dedes/me.m05.d09:meMA.Ode9C11.greekmelody	@ltx/en_us_dedes/he.h.m4:heHE.EvaMenToTisParakois.greekname
ltx/en_us_dedes/me.m05.d09:meMA.Ode9C11.incipit	…
ltx/en_us_dedes/me.m05.d09:meMA.Ode9C11.melody	@ltx/en_us_dedes/he.h.m4:heHE.EvaMenToTisParakois.name
ltx/en_us_dedes/me.m05.d09:meMA.Ode9C11.mode	@ltx/en_us_dedes/miscellanea:misc.Mode4
ltx/en_us_dedes/me.m05.d09:meMA.Ode9C11.ode	@ltx/en_us_dedes/miscellanea:misc.Ode9
ltx/en_us_dedes/me.m05.d09:meMA.Ode9C11.text	
ltx/en_us_dedes/me.m05.d09:meMA.Ode9C12.incipit	…
ltx/en_us_dedes/me.m05.d09:meMA.Ode9C12.melody	@ltx/en_us_dedes/he.h.m4:heHE.EvaMenToTisParakois.name
ltx/en_us_dedes/me.m05.d09:meMA.Ode9C12.mode	@ltx/en_us_dedes/miscellanea:misc.Mode4
ltx/en_us_dedes/me.m05.d09:meMA.Ode9C12.ode	@ltx/en_us_dedes/miscellanea:misc.Ode9
ltx/en_us_dedes/me.m05.d09:meMA.Ode9C12.text	
ltx/en_us_dedes/me.m05.d09:meMA.Ode9C13.incipit	…
ltx/en_us_dedes/me.m05.d09:meMA.Ode9C13.melody	@ltx/en_us_dedes/he.h.m4:heHE.EvaMenToTisParakois.name
ltx/en_us_dedes/me.m05.d09:meMA.Ode9C13.mode	@ltx/en_us_dedes/miscellanea:misc.Mode4
ltx/en_us_dedes/me.m05.d09:meMA.Ode9C13.ode	@ltx/en_us_dedes/miscellanea:misc.Ode9
ltx/en_us_dedes/me.m05.d09:meMA.Ode9C13.text	
ltx/en_us_dedes/me.m05.d09:meMA.Ode9C21.greekmelody	@ltx/en_us_dedes/he.h.m4:heHE.EvaMenToTisParakois.greekname
ltx/en_us_dedes/me.m05.d09:meMA.Ode9C21.incipit	…
ltx/en_us_dedes/me.m05.d09:meMA.Ode9C21.melody	@ltx/en_us_dedes/he.h.m4:heHE.EvaMenToTisParakois.name
ltx/en_us_dedes/me.m05.d09:meMA.Ode9C21.mode	@ltx/en_us_dedes/miscellanea:misc.Mode4
ltx/en_us_dedes/me.m05.d09:meMA.Ode9C21.ode	@ltx/en_us_dedes/miscellanea:misc.Ode9
ltx/en_us_dedes/me.m05.d09:meMA.Ode9C21.text	
ltx/en_us_dedes/me.m05.d09:meMA.Ode9C22.incipit	…
ltx/en_us_dedes/me.m05.d09:meMA.Ode9C22.melody	@ltx/en_us_dedes/he.h.m4:heHE.EvaMenToTisParakois.name
ltx/en_us_dedes/me.m05.d09:meMA.Ode9C22.mode	@ltx/en_us_dedes/miscellanea:misc.Mode4
ltx/en_us_dedes/me.m05.d09:meMA.Ode9C22.ode	@ltx/en_us_dedes/miscellanea:misc.Ode9
ltx/en_us_dedes/me.m05.d09:meMA.Ode9C22.text	
ltx/en_us_dedes/me.m05.d09:meMA.Ode9C2T.incipit	…
ltx/en_us_dedes/me.m05.d09:meMA.Ode9C2T.melody	@ltx/en_us_dedes/he.h.m4:heHE.EvaMenToTisParakois.name
ltx/en_us_dedes/me.m05.d09:meMA.Ode9C2T.mode	@ltx/en_us_dedes/miscellanea:misc.Mode4
ltx/en_us_dedes/me.m05.d09:meMA.Ode9C2T.ode	@ltx/en_us_dedes/miscellanea:misc.Ode9
ltx/en_us_dedes/me.m05.d09:meMA.Ode9C2T.text	
ltx/en_us_dedes/me.m05.d09:meMA.Ode9H.greekmelody	@ltx/en_us_dedes/he.h.m4:heHE.EvaMenToTisParakois.greekname
ltx/en_us_dedes/me.m05.d09:meMA.Ode9H.incipit	@ltx/en_us_dedes/he.h.m4:heHE.EvaMenToTisParakois.incipit
ltx/en_us_dedes/me.m05.d09:meMA.Ode9H.melody	@ltx/en_us_dedes/he.h.m4:heHE.EvaMenToTisParakois.melody
ltx/en_us_dedes/me.m05.d09:meMA.Ode9H.mode	@ltx/en_us_dedes/miscellanea:misc.Mode4
ltx/en_us_dedes/me.m05.d09:meMA.Ode9H.ode	@ltx/en_us_dedes/miscellanea:misc.Ode9
ltx/en_us_dedes/me.m05.d09:meMA.Ode9H.text	@ltx/en_us_dedes/he.h.m4:heHE.EvaMenToTisParakois.text
ltx/en_us_dedes/me.m05.d09:meMA.Oikos1.text	As I am utterly deadened and I have unclean lips, how can I sing You a worthy hymn of praise, O Christ? Yet fully aware of Your compassion, that it saves those who approach with faith, as did that widow once with the two coins, I offer You my words, albeit from sordid lips, and I kneel in prayer cry out to You: O Master, illumine my mind, so that along with Your Prophet I may say, “Behold, the Virgin will conceive in the womb.”
ltx/en_us_dedes/me.m05.d09:meVE.Apolytikion1.melody	@ltx/en_us_dedes/he.ga:heGA.TouProfitouSou.name
ltx/en_us_dedes/me.m05.d09:meVE.Apolytikion1.mode	@ltx/en_us_dedes/miscellanea:misc.Mode2
ltx/en_us_dedes/me.m05.d09:meVE.Apolytikion2.greekmelody	@ltx/en_us_dedes/he.a.m4:heAU.TachyProkatalave.greekname
ltx/en_us_dedes/me.m05.d09:meVE.Apolytikion2.incipit	…
ltx/en_us_dedes/me.m05.d09:meVE.Apolytikion2.melody	@ltx/en_us_dedes/he.a.m4:heAU.TachyProkatalave.name
ltx/en_us_dedes/me.m05.d09:meVE.Apolytikion2.mode	@ltx/en_us_dedes/miscellanea:misc.Mode4
ltx/en_us_dedes/me.m05.d09:meVE.Apolytikion2.text	
ltx/en_us_dedes/me.m05.d09:meVE.AposGlory.incipit	O believers here assembled, come…
ltx/en_us_dedes/me.m05.d09:meVE.AposGlory.melody	
ltx/en_us_dedes/me.m05.d09:meVE.AposGlory.mode	@ltx/en_us_dedes/miscellanea:misc.Mode4
ltx/en_us_dedes/me.m05.d09:meVE.AposGlory.poet	@ltx/en_us_dedes/poets:po.Anatoliou
ltx/en_us_dedes/me.m05.d09:meVE.AposGlory.text	O believers here assembled, come let us form a spiritual chorus, and with hymns let us honor glorious St. Christopher, that medaled athlete of Christ God. For today he has risen like a morning star, and he illumines the minds of the believers, who with faith and love observe his solemn memory.
ltx/en_us_dedes/me.m05.d09:meVE.GeneralApolytikion1.name	Isaiah
ltx/en_us_dedes/me.m05.d09:meVE.SticGlory.incipit	The Church of God is…
ltx/en_us_dedes/me.m05.d09:meVE.SticGlory.melody	
ltx/en_us_dedes/me.m05.d09:meVE.SticGlory.mode	@ltx/en_us_dedes/miscellanea:misc.Mode4
ltx/en_us_dedes/me.m05.d09:meVE.SticGlory.poet	@ltx/en_us_dedes/poets:po.IoannouMonachou
ltx/en_us_dedes/me.m05.d09:meVE.SticGlory.text	The Church of God is decorated in the purple of the blood of your martyrdom, and it sends out rays like the sun, O Christopher, Herculean Saint. Once you had armed yourself with the Cross, and enthusiastically had chosen to die for Christ, you valiantly opposed the forces of the devil. You put to shame every scheme of the lawless, and you emerged as a victorious soldier of Christ. Therefore we implore you, since you have confidence to pray, O jewel of the Martyrs, intercede for the salvation of our souls.
ltx/en_us_dedes/me.m05.d09:meVE.Stichera01.greekmelody	@ltx/en_us_dedes/he.a.m4:heAU.EdokasSimeiosin.greekname
ltx/en_us_dedes/me.m05.d09:meVE.Stichera01.incipit	…
ltx/en_us_dedes/me.m05.d09:meVE.Stichera01.melody	@ltx/en_us_dedes/he.a.m4:heAU.EdokasSimeiosin.name
ltx/en_us_dedes/me.m05.d09:meVE.Stichera01.mode	@ltx/en_us_dedes/miscellanea:misc.Mode4
ltx/en_us_dedes/me.m05.d09:meVE.Stichera01.text	
ltx/en_us_dedes/me.m05.d09:meVE.Stichera02.incipit	…
ltx/en_us_dedes/me.m05.d09:meVE.Stichera02.melody	@ltx/en_us_dedes/he.a.m4:heAU.EdokasSimeiosin.name
ltx/en_us_dedes/me.m05.d09:meVE.Stichera02.mode	@ltx/en_us_dedes/miscellanea:misc.Mode4
ltx/en_us_dedes/me.m05.d09:meVE.Stichera02.text	
ltx/en_us_dedes/me.m05.d09:meVE.Stichera03.incipit	…
ltx/en_us_dedes/me.m05.d09:meVE.Stichera03.melody	@ltx/en_us_dedes/he.a.m4:heAU.EdokasSimeiosin.name
ltx/en_us_dedes/me.m05.d09:meVE.Stichera03.mode	@ltx/en_us_dedes/miscellanea:misc.Mode4
ltx/en_us_dedes/me.m05.d09:meVE.Stichera03.text	
ltx/en_us_dedes/me.m05.d09:meVE.Stichera04.greekmelody	@ltx/en_us_dedes/he.a.m1:heAU.TonOuranionTagmaton.greekname
ltx/en_us_dedes/me.m05.d09:meVE.Stichera04.incipit	Come let us honor the…
ltx/en_us_dedes/me.m05.d09:meVE.Stichera04.melody	@ltx/en_us_dedes/he.a.m1:heAU.TonOuranionTagmaton.name
ltx/en_us_dedes/me.m05.d09:meVE.Stichera04.mode	@ltx/en_us_dedes/miscellanea:misc.Mode1
ltx/en_us_dedes/me.m05.d09:meVE.Stichera04.text	Come let us honor the contests of holy Christopher. * Through them pours forth the ever welling fount of divine grace * of Christ who is the Giver of Life. For the Saint, * having beaten the enemy, * received the power from God to protect and cure * and repel demonic influence.
ltx/en_us_dedes/me.m05.d09:meVE.Stichera05.incipit	The holy dust of your…
ltx/en_us_dedes/me.m05.d09:meVE.Stichera05.melody	@ltx/en_us_dedes/he.a.m1:heAU.TonOuranionTagmaton.name
ltx/en_us_dedes/me.m05.d09:meVE.Stichera05.mode	@ltx/en_us_dedes/miscellanea:misc.Mode1
ltx/en_us_dedes/me.m05.d09:meVE.Stichera05.text	The holy dust of your relics does many miracles. * It guards from bolts of lightning, and it rescues from perils * and from epidemics. And therefore we pray, * O St. Christopher who endured * uncounted labors, that you ever keep us safe * from disaster and catastrophe.
ltx/en_us_dedes/me.m05.d09:meVE.Stichera06.incipit	The celebration, O Martyr, of…
ltx/en_us_dedes/me.m05.d09:meVE.Stichera06.melody	@ltx/en_us_dedes/he.a.m1:heAU.TonOuranionTagmaton.name
ltx/en_us_dedes/me.m05.d09:meVE.Stichera06.mode	@ltx/en_us_dedes/miscellanea:misc.Mode1
ltx/en_us_dedes/me.m05.d09:meVE.Stichera06.text	The celebration, O Martyr, of your memorial * exudes a sacred fragrance, like the scent of spring roses, * because during your contests you suffered much, * Through your prayers now do the infirm * those with diseases and passions receive their health, * and they glorify the Giver, Christ.
