ltx/en_us_dedes/me.m07.d31:meDA.commemoration.first	Memory of the Holy and Righteous Evdokimos
ltx/en_us_dedes/me.m07.d31:meDA.commemoration.first_name	
ltx/en_us_dedes/me.m07.d31:meDA.commemoration.first_short	Memory of the Holy and Righteous Evdokimos
ltx/en_us_dedes/me.m07.d31:meDA.commemoration.first_title	@ltx/en_us_dedes/titles:ti.SaintM
ltx/en_us_dedes/me.m07.d31:meDA.commemoration.full	Memory of the Holy and Righteous Evdokimos; and Forefeast of the Procession of the Holy Cross
ltx/en_us_dedes/me.m07.d31:meDA.commemoration.second_name	
ltx/en_us_dedes/me.m07.d31:meDA.commemoration.second_title	@ltx/en_us_dedes/titles:ti.Cross
ltx/en_us_dedes/me.m07.d31:meDA.date	July 31
ltx/en_us_dedes/me.m07.d31:meDA.fordate	for July 31
ltx/en_us_dedes/me.m07.d31:meDA.insert1	the righteous Saint Evdokimos,
ltx/en_us_dedes/me.m07.d31:meDA.insert2	whose memory we observe,
ltx/en_us_dedes/me.m07.d31:meDA.note	
ltx/en_us_dedes/me.m07.d31:meDA.pdfcoverdate	July 31,
ltx/en_us_dedes/me.m07.d31:meDA.pdfheaderdate	July 31
ltx/en_us_dedes/me.m07.d31:meHO.commemorations	
ltx/en_us_dedes/me.m07.d31:meHO.note1	
ltx/en_us_dedes/me.m07.d31:meHO.note2	
ltx/en_us_dedes/me.m07.d31:meHO.number	
ltx/en_us_dedes/me.m07.d31:meHO.rank	
ltx/en_us_dedes/me.m07.d31:meLE.commemoration1	The Holy and Just Eudokimos.
ltx/en_us_dedes/me.m07.d31:meLE.commemoration2	
ltx/en_us_dedes/me.m07.d31:meLI.Kontakion1.incipit	…
ltx/en_us_dedes/me.m07.d31:meLI.Kontakion1.melody	
ltx/en_us_dedes/me.m07.d31:meLI.Kontakion1.mode	
ltx/en_us_dedes/me.m07.d31:meLI.Kontakion1.text	
ltx/en_us_dedes/me.m07.d31:meLI.Megalynarion.text	
ltx/en_us_dedes/me.m07.d31:meMA.C1.acrostic.notice1	
ltx/en_us_dedes/me.m07.d31:meMA.C1.acrostic.text	
ltx/en_us_dedes/me.m07.d31:meMA.C1.acrostic.title	Canon for the Saint.
ltx/en_us_dedes/me.m07.d31:meMA.C1.title	@ltx/en_us_dedes/titles:ti.CanonSaintM
ltx/en_us_dedes/me.m07.d31:meMA.C1.verse	@ltx/en_us_dedes/prayers:pr.verse_SaintM.text
ltx/en_us_dedes/me.m07.d31:meMA.Exaposteilarion1.greekmelody	@ltx/en_us_dedes/he.a.m3:heAU.OOuranonToisAstrois.greekname
ltx/en_us_dedes/me.m07.d31:meMA.Exaposteilarion1.incipit	Against all kinds of passions…
ltx/en_us_dedes/me.m07.d31:meMA.Exaposteilarion1.melody	@ltx/en_us_dedes/he.a.m3:heAU.OOuranonToisAstrois.name
ltx/en_us_dedes/me.m07.d31:meMA.Exaposteilarion1.mode	@ltx/en_us_dedes/miscellanea:misc.Mode3
ltx/en_us_dedes/me.m07.d31:meMA.Exaposteilarion1.text	Against all kinds of passions * you were well tested when alive; * and even now you continue * to be a well of miracles, * by which our souls and bodies * are purified of the passions.
ltx/en_us_dedes/me.m07.d31:meMA.Exaposteilarion2.greekmelody	@ltx/en_us_dedes/he.a.m2:heAU.GynaikesAkoutisthite.greekname
ltx/en_us_dedes/me.m07.d31:meMA.Exaposteilarion2.incipit	As we prepare to celebrate…
ltx/en_us_dedes/me.m07.d31:meMA.Exaposteilarion2.melody	@ltx/en_us_dedes/he.a.m2:heAU.GynaikesAkoutisthite.name
ltx/en_us_dedes/me.m07.d31:meMA.Exaposteilarion2.mode	@ltx/en_us_dedes/miscellanea:misc.Mode2
ltx/en_us_dedes/me.m07.d31:meMA.Exaposteilarion2.text	As we prepare to celebrate * the Cross, the world is sanctified. * The ranks of Angels have joined us * rejoicing and celebrating. * They sing their hymns of praise to Him, * who for our sakes was crucified, * using the words that David sang: * God our King has worked salvation * in the midst of the earth, as Master.
ltx/en_us_dedes/me.m07.d31:meMA.Ode1C11.greekmelody	@ltx/en_us_dedes/he.h.m2:heHE.EnVythoKatestrose.greekname
ltx/en_us_dedes/me.m07.d31:meMA.Ode1C11.incipit	O Evdokimos, you had an…
ltx/en_us_dedes/me.m07.d31:meMA.Ode1C11.melody	@ltx/en_us_dedes/he.h.m2:heHE.EnVythoKatestrose.notmetered
ltx/en_us_dedes/me.m07.d31:meMA.Ode1C11.mode	@ltx/en_us_dedes/miscellanea:misc.Mode2
ltx/en_us_dedes/me.m07.d31:meMA.Ode1C11.ode	@ltx/en_us_dedes/miscellanea:misc.Ode1
ltx/en_us_dedes/me.m07.d31:meMA.Ode1C11.text	O Evdokimos, you had an exalted way of life, and you became wholly radiant by your divine ascents. Pray that illumination be granted me, as I extol your august virtues, whereby meeting with approval you obtained what hoped for.
ltx/en_us_dedes/me.m07.d31:meMA.Ode1C12.incipit	O all-blessed Evdokimos, you loved…
ltx/en_us_dedes/me.m07.d31:meMA.Ode1C12.melody	@ltx/en_us_dedes/he.h.m2:heHE.EnVythoKatestrose.notmetered
ltx/en_us_dedes/me.m07.d31:meMA.Ode1C12.mode	@ltx/en_us_dedes/miscellanea:misc.Mode2
ltx/en_us_dedes/me.m07.d31:meMA.Ode1C12.ode	@ltx/en_us_dedes/miscellanea:misc.Ode1
ltx/en_us_dedes/me.m07.d31:meMA.Ode1C12.text	O all-blessed Evdokimos, you loved the fragrant teachings of holy Scriptures; and occupied yourself with studying them. You turn away from the bad smell and dishonor of the pleasures, and you became fragrant as you were adorned with divine virtues.
ltx/en_us_dedes/me.m07.d31:meMA.Ode1C13.incipit	O blessed one, you drove…
ltx/en_us_dedes/me.m07.d31:meMA.Ode1C13.melody	@ltx/en_us_dedes/he.h.m2:heHE.EnVythoKatestrose.notmetered
ltx/en_us_dedes/me.m07.d31:meMA.Ode1C13.mode	@ltx/en_us_dedes/miscellanea:misc.Mode2
ltx/en_us_dedes/me.m07.d31:meMA.Ode1C13.ode	@ltx/en_us_dedes/miscellanea:misc.Ode1
ltx/en_us_dedes/me.m07.d31:meMA.Ode1C13.text	O blessed one, you drove sleep from the eyes of your soul, and standing all night long you kept vigil and drew closer to God, not giving in to the needs of nature. Therefore, you indeed attained the day that has no evening.
ltx/en_us_dedes/me.m07.d31:meMA.Ode1C1T.incipit	Let us extol the ever-blessed…
ltx/en_us_dedes/me.m07.d31:meMA.Ode1C1T.melody	@ltx/en_us_dedes/he.h.m2:heHE.EnVythoKatestrose.notmetered
ltx/en_us_dedes/me.m07.d31:meMA.Ode1C1T.mode	@ltx/en_us_dedes/miscellanea:misc.Mode2
ltx/en_us_dedes/me.m07.d31:meMA.Ode1C1T.ode	@ltx/en_us_dedes/miscellanea:misc.Ode1
ltx/en_us_dedes/me.m07.d31:meMA.Ode1C1T.text	Let us extol the ever-blessed Theotokos, the animate bride-chamber of God and the censer that holds the noetic, luminous Coal, and let us cry: “Rejoice, O cause of our refashioning that saved us!”
ltx/en_us_dedes/me.m07.d31:meMA.Ode3C11.greekmelody	@ltx/en_us_dedes/he.h.m2:heHE.EnPetraMeTisPisteos.greekname
ltx/en_us_dedes/me.m07.d31:meMA.Ode3C11.incipit	O Evdokimos, you paid attention…
ltx/en_us_dedes/me.m07.d31:meMA.Ode3C11.melody	@ltx/en_us_dedes/he.h.m2:heHE.EnPetraMeTisPisteos.notmetered
ltx/en_us_dedes/me.m07.d31:meMA.Ode3C11.mode	@ltx/en_us_dedes/miscellanea:misc.Mode2
ltx/en_us_dedes/me.m07.d31:meMA.Ode3C11.ode	@ltx/en_us_dedes/miscellanea:misc.Ode3
ltx/en_us_dedes/me.m07.d31:meMA.Ode3C11.text	O Evdokimos, you paid attention to the words from which life flows, and you imbibed them like a drink of salvation, and you vomited most bitter sin. Then you sang to God and said: No one holy except for You, O Lord.
ltx/en_us_dedes/me.m07.d31:meMA.Ode3C12.incipit	O Evdokimos, you had Christ-like…
ltx/en_us_dedes/me.m07.d31:meMA.Ode3C12.melody	@ltx/en_us_dedes/he.h.m2:heHE.EnPetraMeTisPisteos.notmetered
ltx/en_us_dedes/me.m07.d31:meMA.Ode3C12.mode	@ltx/en_us_dedes/miscellanea:misc.Mode2
ltx/en_us_dedes/me.m07.d31:meMA.Ode3C12.ode	@ltx/en_us_dedes/miscellanea:misc.Ode3
ltx/en_us_dedes/me.m07.d31:meMA.Ode3C12.text	O Evdokimos, you had Christ-like compassion; you distributed your wealth to those in need. This put you in possession of heavenly wealth, and you sang: No one holy except for You, O Lord.
ltx/en_us_dedes/me.m07.d31:meMA.Ode3C13.incipit	O blessed and glorious Evdokimos…
ltx/en_us_dedes/me.m07.d31:meMA.Ode3C13.melody	@ltx/en_us_dedes/he.h.m2:heHE.EnPetraMeTisPisteos.notmetered
ltx/en_us_dedes/me.m07.d31:meMA.Ode3C13.mode	@ltx/en_us_dedes/miscellanea:misc.Mode2
ltx/en_us_dedes/me.m07.d31:meMA.Ode3C13.ode	@ltx/en_us_dedes/miscellanea:misc.Ode3
ltx/en_us_dedes/me.m07.d31:meMA.Ode3C13.text	O blessed and glorious Evdokimos, through divine love you became a friend of the Creator. Now you have received the heavenly inheritance, and you partake of the Tree of Life. You have been deified by adoption, and you sing: No one holy except for You, O Lord.
ltx/en_us_dedes/me.m07.d31:meMA.Ode3C1T.incipit	O Mother of God, you…
ltx/en_us_dedes/me.m07.d31:meMA.Ode3C1T.melody	@ltx/en_us_dedes/he.h.m2:heHE.EnPetraMeTisPisteos.notmetered
ltx/en_us_dedes/me.m07.d31:meMA.Ode3C1T.mode	@ltx/en_us_dedes/miscellanea:misc.Mode2
ltx/en_us_dedes/me.m07.d31:meMA.Ode3C1T.ode	@ltx/en_us_dedes/miscellanea:misc.Ode3
ltx/en_us_dedes/me.m07.d31:meMA.Ode3C1T.text	O Mother of God, you are more honorable than the angels, for you carried the Creator of angels in your womb; and you gave birth to Him, who is the redemption of mortals, who sing to you: No one is immaculate except for you, O Lady.
ltx/en_us_dedes/me.m07.d31:meMA.Ode3H.greekmelody	@ltx/en_us_dedes/he.h.m2:heHE.EnPetraMeTisPisteos.greekname
ltx/en_us_dedes/me.m07.d31:meMA.Ode3H.incipit	@ltx/en_us_dedes/he.h.m2:heHE.EnPetraMeTisPisteos.incipit
ltx/en_us_dedes/me.m07.d31:meMA.Ode3H.melody	@ltx/en_us_dedes/he.h.m2:heHE.EnPetraMeTisPisteos.melody
ltx/en_us_dedes/me.m07.d31:meMA.Ode3H.mode	@ltx/en_us_dedes/miscellanea:misc.Mode2
ltx/en_us_dedes/me.m07.d31:meMA.Ode3H.ode	@ltx/en_us_dedes/miscellanea:misc.Ode3
ltx/en_us_dedes/me.m07.d31:meMA.Ode3H.text	@ltx/en_us_dedes/he.h.m2:heHE.EnPetraMeTisPisteos.text
ltx/en_us_dedes/me.m07.d31:meMA.Ode3Kathisma1.greekmelody	@ltx/en_us_dedes/he.a.m4:heAU.OYpsotheisEnToStavro.greekname
ltx/en_us_dedes/me.m07.d31:meMA.Ode3Kathisma1.incipit	O renowned Evdokimos, your name…
ltx/en_us_dedes/me.m07.d31:meMA.Ode3Kathisma1.melody	@ltx/en_us_dedes/he.a.m4:heAU.OYpsotheisEnToStavro.notmetered
ltx/en_us_dedes/me.m07.d31:meMA.Ode3Kathisma1.mode	@ltx/en_us_dedes/miscellanea:misc.Mode4
ltx/en_us_dedes/me.m07.d31:meMA.Ode3Kathisma1.text	O renowned Evdokimos, your name denotes approval, and you were approved in charitable works; and in temptations you were tested like gold in a furnace. For this reason, now after your death, you abundantly pour out miracles, like streams of water, and your stop diseases. And you continually pray earnestly for us, that we may received forgiveness of sins.
ltx/en_us_dedes/me.m07.d31:meMA.Ode3KathismaT.incipit	The Lord, who sits on…
ltx/en_us_dedes/me.m07.d31:meMA.Ode3KathismaT.melody	@ltx/en_us_dedes/he.a.m4:heAU.OYpsotheisEnToStavro.notmetered
ltx/en_us_dedes/me.m07.d31:meMA.Ode3KathismaT.mode	@ltx/en_us_dedes/miscellanea:misc.Mode4
ltx/en_us_dedes/me.m07.d31:meMA.Ode3KathismaT.text	The Lord, who sits on a throne of Cherubim and is in the bosom of the Father, physically sat in your lap as on a throne, O Lady. He is our God, and He reigns over all the nations. We sing to Him now with understanding. Will you entreat Him to save us your servants.
ltx/en_us_dedes/me.m07.d31:meMA.Ode4C11.greekmelody	@ltx/en_us_dedes/he.h.m2:heHE.ElilythasEkParthenou.greekname
ltx/en_us_dedes/me.m07.d31:meMA.Ode4C11.incipit	O admirable Evdokimos, you kept…
ltx/en_us_dedes/me.m07.d31:meMA.Ode4C11.melody	@ltx/en_us_dedes/he.h.m2:heHE.ElilythasEkParthenou.notmetered
ltx/en_us_dedes/me.m07.d31:meMA.Ode4C11.mode	@ltx/en_us_dedes/miscellanea:misc.Mode2
ltx/en_us_dedes/me.m07.d31:meMA.Ode4C11.ode	@ltx/en_us_dedes/miscellanea:misc.Ode4
ltx/en_us_dedes/me.m07.d31:meMA.Ode4C11.text	O admirable Evdokimos, you kept the doctrines of the Fathers, you had an Orthodox mindset from your youth, you had an unblemished life and a sympathetic attitude.
ltx/en_us_dedes/me.m07.d31:meMA.Ode4C12.incipit	O Evdokimos, nothing was able…
ltx/en_us_dedes/me.m07.d31:meMA.Ode4C12.melody	@ltx/en_us_dedes/he.h.m2:heHE.ElilythasEkParthenou.notmetered
ltx/en_us_dedes/me.m07.d31:meMA.Ode4C12.mode	@ltx/en_us_dedes/miscellanea:misc.Mode2
ltx/en_us_dedes/me.m07.d31:meMA.Ode4C12.ode	@ltx/en_us_dedes/miscellanea:misc.Ode4
ltx/en_us_dedes/me.m07.d31:meMA.Ode4C12.text	O Evdokimos, nothing was able to diminish your desire for the Lord, not the confusion of the world, nor the possession of power, nor perishable glory, but you were truly approved by godly deeds.
ltx/en_us_dedes/me.m07.d31:meMA.Ode4C13.incipit	O Evdokimos, you were daily…
ltx/en_us_dedes/me.m07.d31:meMA.Ode4C13.melody	@ltx/en_us_dedes/he.h.m2:heHE.ElilythasEkParthenou.notmetered
ltx/en_us_dedes/me.m07.d31:meMA.Ode4C13.mode	@ltx/en_us_dedes/miscellanea:misc.Mode2
ltx/en_us_dedes/me.m07.d31:meMA.Ode4C13.ode	@ltx/en_us_dedes/miscellanea:misc.Ode4
ltx/en_us_dedes/me.m07.d31:meMA.Ode4C13.text	O Evdokimos, you were daily uplifted in divine meditation, and you brouht the enemy low, and you received the power to work healings, by the just judgment of God that orders all things.
ltx/en_us_dedes/me.m07.d31:meMA.Ode4C14.incipit	O Evdokimos, the case with…
ltx/en_us_dedes/me.m07.d31:meMA.Ode4C14.melody	@ltx/en_us_dedes/he.h.m2:heHE.ElilythasEkParthenou.notmetered
ltx/en_us_dedes/me.m07.d31:meMA.Ode4C14.mode	@ltx/en_us_dedes/miscellanea:misc.Mode2
ltx/en_us_dedes/me.m07.d31:meMA.Ode4C14.ode	@ltx/en_us_dedes/miscellanea:misc.Ode4
ltx/en_us_dedes/me.m07.d31:meMA.Ode4C14.text	O Evdokimos, the case with your relics exhales the fragrance of abundant cures, it purges the passions of those who honor you with faith, and it scorches the armies of demons.
ltx/en_us_dedes/me.m07.d31:meMA.Ode4C1T.incipit	O all-hymned Lady and ever-virgin…
ltx/en_us_dedes/me.m07.d31:meMA.Ode4C1T.melody	@ltx/en_us_dedes/he.h.m2:heHE.ElilythasEkParthenou.notmetered
ltx/en_us_dedes/me.m07.d31:meMA.Ode4C1T.mode	@ltx/en_us_dedes/miscellanea:misc.Mode2
ltx/en_us_dedes/me.m07.d31:meMA.Ode4C1T.ode	@ltx/en_us_dedes/miscellanea:misc.Ode4
ltx/en_us_dedes/me.m07.d31:meMA.Ode4C1T.text	O all-hymned Lady and ever-virgin, you gave birth to God, who is praised on high by the commanders of His hosts, when He truly became man. Never cease imploring Him on behalf of your servants.
ltx/en_us_dedes/me.m07.d31:meMA.Ode5C11.greekmelody	@ltx/en_us_dedes/he.h.m2:heHE.OFotismos.greekname
ltx/en_us_dedes/me.m07.d31:meMA.Ode5C11.incipit	O godly-minded blessed Evdokimos, you…
ltx/en_us_dedes/me.m07.d31:meMA.Ode5C11.melody	@ltx/en_us_dedes/he.h.m2:heHE.OFotismos.notmetered
ltx/en_us_dedes/me.m07.d31:meMA.Ode5C11.mode	@ltx/en_us_dedes/miscellanea:misc.Mode2
ltx/en_us_dedes/me.m07.d31:meMA.Ode5C11.ode	@ltx/en_us_dedes/miscellanea:misc.Ode5
ltx/en_us_dedes/me.m07.d31:meMA.Ode5C11.text	O godly-minded blessed Evdokimos, you shined with the divine splendor of chastity, and you set the law of chastity around you like a fence. You passed the night of this life without stumbling, for you were winged by divine visions. Now you have gone to dwell in divine life.
ltx/en_us_dedes/me.m07.d31:meMA.Ode5C12.incipit	O blessed Evdokimos, a great…
ltx/en_us_dedes/me.m07.d31:meMA.Ode5C12.melody	@ltx/en_us_dedes/he.h.m2:heHE.OFotismos.notmetered
ltx/en_us_dedes/me.m07.d31:meMA.Ode5C12.mode	@ltx/en_us_dedes/miscellanea:misc.Mode2
ltx/en_us_dedes/me.m07.d31:meMA.Ode5C12.ode	@ltx/en_us_dedes/miscellanea:misc.Ode5
ltx/en_us_dedes/me.m07.d31:meMA.Ode5C12.text	O blessed Evdokimos, a great and astonishing miracle is now accomplished in you; for your body, lying in the tomb, is truly preserved from decay, long after burial, by the judgments known to God, who glorifies you.
ltx/en_us_dedes/me.m07.d31:meMA.Ode5C13.incipit	Kudos for your boldness with…
ltx/en_us_dedes/me.m07.d31:meMA.Ode5C13.melody	@ltx/en_us_dedes/he.h.m2:heHE.OFotismos.notmetered
ltx/en_us_dedes/me.m07.d31:meMA.Ode5C13.mode	@ltx/en_us_dedes/miscellanea:misc.Mode2
ltx/en_us_dedes/me.m07.d31:meMA.Ode5C13.ode	@ltx/en_us_dedes/miscellanea:misc.Ode5
ltx/en_us_dedes/me.m07.d31:meMA.Ode5C13.text	Kudos for your boldness with God; kudos for the heartfelt longing you had for Him. Worthy of your name, you were well approved, shining wondrously with divine brightness and illumining the faithful.
ltx/en_us_dedes/me.m07.d31:meMA.Ode5C1T.incipit	O Virgin Mother, continually importune…
ltx/en_us_dedes/me.m07.d31:meMA.Ode5C1T.melody	@ltx/en_us_dedes/he.h.m2:heHE.OFotismos.notmetered
ltx/en_us_dedes/me.m07.d31:meMA.Ode5C1T.mode	@ltx/en_us_dedes/miscellanea:misc.Mode2
ltx/en_us_dedes/me.m07.d31:meMA.Ode5C1T.ode	@ltx/en_us_dedes/miscellanea:misc.Ode5
ltx/en_us_dedes/me.m07.d31:meMA.Ode5C1T.text	O Virgin Mother, continually importune the Lord who became incarnate from you, and pray that we who praise you be delivered from passions and peril, from soul-destroying misery and tribulation, and from the eternal flame and perdition.
ltx/en_us_dedes/me.m07.d31:meMA.Ode6C11.greekmelody	@ltx/en_us_dedes/he.h.m2:heHE.EnAvyssoPtaismaton.greekname
ltx/en_us_dedes/me.m07.d31:meMA.Ode6C11.incipit	O blessed Saint, you perspired…
ltx/en_us_dedes/me.m07.d31:meMA.Ode6C11.melody	@ltx/en_us_dedes/he.h.m2:heHE.EnAvyssoPtaismaton.notmetered
ltx/en_us_dedes/me.m07.d31:meMA.Ode6C11.mode	@ltx/en_us_dedes/miscellanea:misc.Mode2
ltx/en_us_dedes/me.m07.d31:meMA.Ode6C11.ode	@ltx/en_us_dedes/miscellanea:misc.Ode6
ltx/en_us_dedes/me.m07.d31:meMA.Ode6C11.text	O blessed Saint, you perspired drops of sweetness, and exultation, and healing illumination, for which Christ our God is praise.
ltx/en_us_dedes/me.m07.d31:meMA.Ode6C12.incipit	O Saint, you blossomed like…
ltx/en_us_dedes/me.m07.d31:meMA.Ode6C12.melody	@ltx/en_us_dedes/he.h.m2:heHE.EnAvyssoPtaismaton.notmetered
ltx/en_us_dedes/me.m07.d31:meMA.Ode6C12.mode	@ltx/en_us_dedes/miscellanea:misc.Mode2
ltx/en_us_dedes/me.m07.d31:meMA.Ode6C12.ode	@ltx/en_us_dedes/miscellanea:misc.Ode6
ltx/en_us_dedes/me.m07.d31:meMA.Ode6C12.text	O Saint, you blossomed like a fruitful grapevine in the courts of our God, and your many branches produced a treasure of virtue clusters for the Husbandman of souls.
ltx/en_us_dedes/me.m07.d31:meMA.Ode6C13.incipit	O famous Saint, you longed…
ltx/en_us_dedes/me.m07.d31:meMA.Ode6C13.melody	@ltx/en_us_dedes/he.h.m2:heHE.EnAvyssoPtaismaton.notmetered
ltx/en_us_dedes/me.m07.d31:meMA.Ode6C13.mode	@ltx/en_us_dedes/miscellanea:misc.Mode2
ltx/en_us_dedes/me.m07.d31:meMA.Ode6C13.ode	@ltx/en_us_dedes/miscellanea:misc.Ode6
ltx/en_us_dedes/me.m07.d31:meMA.Ode6C13.text	O famous Saint, you longed for the kingdom and rule of God, and thus you ruled over the sinful passions, and you attained the joy of the just, by the good pleasure of the Almighty.
ltx/en_us_dedes/me.m07.d31:meMA.Ode6C1T.incipit	O Virgin, you were the…
ltx/en_us_dedes/me.m07.d31:meMA.Ode6C1T.melody	@ltx/en_us_dedes/he.h.m2:heHE.EnAvyssoPtaismaton.notmetered
ltx/en_us_dedes/me.m07.d31:meMA.Ode6C1T.mode	@ltx/en_us_dedes/miscellanea:misc.Mode2
ltx/en_us_dedes/me.m07.d31:meMA.Ode6C1T.ode	@ltx/en_us_dedes/miscellanea:misc.Ode6
ltx/en_us_dedes/me.m07.d31:meMA.Ode6C1T.text	O Virgin, you were the one selected by God, for you were most beautiful, and you became his spacious dwelling, the bridal room, the lamp, and the table.
ltx/en_us_dedes/me.m07.d31:meMA.Ode6H.greekmelody	@ltx/en_us_dedes/he.h.m2:heHE.EnAvyssoPtaismaton.greekname
ltx/en_us_dedes/me.m07.d31:meMA.Ode6H.incipit	@ltx/en_us_dedes/he.h.m2:heHE.EnAvyssoPtaismaton.incipit
ltx/en_us_dedes/me.m07.d31:meMA.Ode6H.melody	@ltx/en_us_dedes/he.h.m2:heHE.EnAvyssoPtaismaton.melody
ltx/en_us_dedes/me.m07.d31:meMA.Ode6H.mode	@ltx/en_us_dedes/miscellanea:misc.Mode2
ltx/en_us_dedes/me.m07.d31:meMA.Ode6H.ode	@ltx/en_us_dedes/miscellanea:misc.Ode6
ltx/en_us_dedes/me.m07.d31:meMA.Ode6H.text	@ltx/en_us_dedes/he.h.m2:heHE.EnAvyssoPtaismaton.text
ltx/en_us_dedes/me.m07.d31:meMA.Ode7C11.greekmelody	@ltx/en_us_dedes/he.h.m2:heHE.AntitheonProstagma.greekname
ltx/en_us_dedes/me.m07.d31:meMA.Ode7C11.incipit	O all-blessed Evdokimos, strengthened by…
ltx/en_us_dedes/me.m07.d31:meMA.Ode7C11.melody	@ltx/en_us_dedes/he.h.m2:heHE.AntitheonProstagma.notmetered
ltx/en_us_dedes/me.m07.d31:meMA.Ode7C11.mode	@ltx/en_us_dedes/miscellanea:misc.Mode2
ltx/en_us_dedes/me.m07.d31:meMA.Ode7C11.ode	@ltx/en_us_dedes/miscellanea:misc.Ode7
ltx/en_us_dedes/me.m07.d31:meMA.Ode7C11.text	O all-blessed Evdokimos, strengthened by the might of the Giver-of-Life, you prevailed over carnal urges, and you winged your mind to things heavenly, and you enthusiastically sang: O God, You are blessed and most glorious.
ltx/en_us_dedes/me.m07.d31:meMA.Ode7C12.incipit	O blessed one, you made…
ltx/en_us_dedes/me.m07.d31:meMA.Ode7C12.melody	@ltx/en_us_dedes/he.h.m2:heHE.AntitheonProstagma.notmetered
ltx/en_us_dedes/me.m07.d31:meMA.Ode7C12.mode	@ltx/en_us_dedes/miscellanea:misc.Mode2
ltx/en_us_dedes/me.m07.d31:meMA.Ode7C12.ode	@ltx/en_us_dedes/miscellanea:misc.Ode7
ltx/en_us_dedes/me.m07.d31:meMA.Ode7C12.text	O blessed one, you made yourself noble by acquiring the noblest of manners. You devoted yourself in purity of mind to the study of the God-inspired Scriptures, and you focused all your desire on God, who sees all things.
ltx/en_us_dedes/me.m07.d31:meMA.Ode7C13.incipit	O blessed Evdokimos, you were…
ltx/en_us_dedes/me.m07.d31:meMA.Ode7C13.melody	@ltx/en_us_dedes/he.h.m2:heHE.AntitheonProstagma.notmetered
ltx/en_us_dedes/me.m07.d31:meMA.Ode7C13.mode	@ltx/en_us_dedes/miscellanea:misc.Mode2
ltx/en_us_dedes/me.m07.d31:meMA.Ode7C13.ode	@ltx/en_us_dedes/miscellanea:misc.Ode7
ltx/en_us_dedes/me.m07.d31:meMA.Ode7C13.text	O blessed Evdokimos, you were granted to obtain the kingdom of heaven, the city on high, the Paradise of God, the enjoyment of the just, genuine delight, riches that cannot be stolen, and the light that never sets.
ltx/en_us_dedes/me.m07.d31:meMA.Ode7C14.incipit	O Saint, you pondered the…
ltx/en_us_dedes/me.m07.d31:meMA.Ode7C14.melody	@ltx/en_us_dedes/he.h.m2:heHE.AntitheonProstagma.notmetered
ltx/en_us_dedes/me.m07.d31:meMA.Ode7C14.mode	@ltx/en_us_dedes/miscellanea:misc.Mode2
ltx/en_us_dedes/me.m07.d31:meMA.Ode7C14.ode	@ltx/en_us_dedes/miscellanea:misc.Ode7
ltx/en_us_dedes/me.m07.d31:meMA.Ode7C14.text	O Saint, you pondered the uncertainty of things fleeting, and wisely you directed the movements of your soul to God alone. you ran unhindered past the stumbling-blocks of life, illumined by Him with divine beams.
ltx/en_us_dedes/me.m07.d31:meMA.Ode7C1T.incipit	O Lady full of divine…
ltx/en_us_dedes/me.m07.d31:meMA.Ode7C1T.melody	@ltx/en_us_dedes/he.h.m2:heHE.AntitheonProstagma.notmetered
ltx/en_us_dedes/me.m07.d31:meMA.Ode7C1T.mode	@ltx/en_us_dedes/miscellanea:misc.Mode2
ltx/en_us_dedes/me.m07.d31:meMA.Ode7C1T.ode	@ltx/en_us_dedes/miscellanea:misc.Ode7
ltx/en_us_dedes/me.m07.d31:meMA.Ode7C1T.text	O Lady full of divine grace, continually importune You Son to deliver me from my slavery to passions, and from future condemnation, and from the awful hardheartedness that holds me, and from all that afflicts me.
ltx/en_us_dedes/me.m07.d31:meMA.Ode8C11.greekmelody	@ltx/en_us_dedes/he.h.m2:heHE.TonEnKaminoTouPyros.greekname
ltx/en_us_dedes/me.m07.d31:meMA.Ode8C11.incipit	O godly-minded Evdokimos, pondering the…
ltx/en_us_dedes/me.m07.d31:meMA.Ode8C11.melody	@ltx/en_us_dedes/he.h.m2:heHE.TonEnKaminoTouPyros.notmetered
ltx/en_us_dedes/me.m07.d31:meMA.Ode8C11.mode	@ltx/en_us_dedes/miscellanea:misc.Mode2
ltx/en_us_dedes/me.m07.d31:meMA.Ode8C11.ode	@ltx/en_us_dedes/miscellanea:misc.Ode8
ltx/en_us_dedes/me.m07.d31:meMA.Ode8C11.text	O godly-minded Evdokimos, pondering the fearful fire that will flow before the throne of God, with compunction of heart you poured out hot rivers of tears, which burned to ashes the passions that burned like a furnace.
ltx/en_us_dedes/me.m07.d31:meMA.Ode8C12.incipit	O wise Evdokimos, you pointed…
ltx/en_us_dedes/me.m07.d31:meMA.Ode8C12.melody	@ltx/en_us_dedes/he.h.m2:heHE.TonEnKaminoTouPyros.notmetered
ltx/en_us_dedes/me.m07.d31:meMA.Ode8C12.mode	@ltx/en_us_dedes/miscellanea:misc.Mode2
ltx/en_us_dedes/me.m07.d31:meMA.Ode8C12.ode	@ltx/en_us_dedes/miscellanea:misc.Ode8
ltx/en_us_dedes/me.m07.d31:meMA.Ode8C12.text	O wise Evdokimos, you pointed all the longing of your soul to the Lord, and you cleaved to Him, crying out in the words of the Psalms: O my Christ, deliver me from the mire of the deadly passions, unto the ages.
ltx/en_us_dedes/me.m07.d31:meMA.Ode8C13.incipit	O all-honored Evdokimos, you persevered…
ltx/en_us_dedes/me.m07.d31:meMA.Ode8C13.melody	@ltx/en_us_dedes/he.h.m2:heHE.TonEnKaminoTouPyros.notmetered
ltx/en_us_dedes/me.m07.d31:meMA.Ode8C13.mode	@ltx/en_us_dedes/miscellanea:misc.Mode2
ltx/en_us_dedes/me.m07.d31:meMA.Ode8C13.ode	@ltx/en_us_dedes/miscellanea:misc.Ode8
ltx/en_us_dedes/me.m07.d31:meMA.Ode8C13.text	O all-honored Evdokimos, you persevered in patience, you were poor in heart and compassionate toward the needy. Well approved through your kind disposition and virtuous ways, you now overflow with the grace of miracles.
ltx/en_us_dedes/me.m07.d31:meMA.Ode8C14.incipit	O Saint, you had godly…
ltx/en_us_dedes/me.m07.d31:meMA.Ode8C14.melody	@ltx/en_us_dedes/he.h.m2:heHE.TonEnKaminoTouPyros.notmetered
ltx/en_us_dedes/me.m07.d31:meMA.Ode8C14.mode	@ltx/en_us_dedes/miscellanea:misc.Mode2
ltx/en_us_dedes/me.m07.d31:meMA.Ode8C14.ode	@ltx/en_us_dedes/miscellanea:misc.Ode8
ltx/en_us_dedes/me.m07.d31:meMA.Ode8C14.text	O Saint, you had godly understanding. You were a doer of the sayings of the Master; you loved the ways of the right hand, and clearly turned aside from those of the left, since you were prudent and wise, blessing Christ beyond measure, unto the ages.
ltx/en_us_dedes/me.m07.d31:meMA.Ode8C1T.incipit	Adam’s Fashioner is fashioned of…
ltx/en_us_dedes/me.m07.d31:meMA.Ode8C1T.melody	@ltx/en_us_dedes/he.h.m2:heHE.TonEnKaminoTouPyros.notmetered
ltx/en_us_dedes/me.m07.d31:meMA.Ode8C1T.mode	@ltx/en_us_dedes/miscellanea:misc.Mode2
ltx/en_us_dedes/me.m07.d31:meMA.Ode8C1T.ode	@ltx/en_us_dedes/miscellanea:misc.Ode8
ltx/en_us_dedes/me.m07.d31:meMA.Ode8C1T.text	Adam’s Fashioner is fashioned of your pure blood, O Virgin Theotokos, and He who feeds everything that breathes is fed with milk. Therefore, we glorify you as the Mother of God.
ltx/en_us_dedes/me.m07.d31:meMA.Ode8H.greekmelody	@ltx/en_us_dedes/he.h.m2:heHE.TonEnKaminoTouPyros.greekname
ltx/en_us_dedes/me.m07.d31:meMA.Ode8H.incipit	@ltx/en_us_dedes/he.h.m2:heHE.TonEnKaminoTouPyros.incipit
ltx/en_us_dedes/me.m07.d31:meMA.Ode8H.melody	@ltx/en_us_dedes/he.h.m2:heHE.TonEnKaminoTouPyros.melody
ltx/en_us_dedes/me.m07.d31:meMA.Ode8H.mode	@ltx/en_us_dedes/miscellanea:misc.Mode2
ltx/en_us_dedes/me.m07.d31:meMA.Ode8H.ode	@ltx/en_us_dedes/miscellanea:misc.Ode8
ltx/en_us_dedes/me.m07.d31:meMA.Ode8H.text	@ltx/en_us_dedes/he.h.m2:heHE.TonEnKaminoTouPyros.text
ltx/en_us_dedes/me.m07.d31:meMA.Ode9C11.greekmelody	@ltx/en_us_dedes/he.h.m2:heHE.AnarchouGennitoros.greekname
ltx/en_us_dedes/me.m07.d31:meMA.Ode9C11.incipit	O Evdokimos, you longed to…
ltx/en_us_dedes/me.m07.d31:meMA.Ode9C11.melody	@ltx/en_us_dedes/he.h.m2:heHE.AnarchouGennitoros.notmetered
ltx/en_us_dedes/me.m07.d31:meMA.Ode9C11.mode	@ltx/en_us_dedes/miscellanea:misc.Mode2
ltx/en_us_dedes/me.m07.d31:meMA.Ode9C11.ode	@ltx/en_us_dedes/miscellanea:misc.Ode9
ltx/en_us_dedes/me.m07.d31:meMA.Ode9C11.text	O Evdokimos, you longed to see the glory of our God, so you adorned yourself with the beauty of virtue; and holding your lamp, you entered the radiant wedding hall of the Angels, being with your Master and delighting in theosis.
ltx/en_us_dedes/me.m07.d31:meMA.Ode9C12.incipit	O godly-minded Evdokimos, the feast…
ltx/en_us_dedes/me.m07.d31:meMA.Ode9C12.melody	@ltx/en_us_dedes/he.h.m2:heHE.AnarchouGennitoros.notmetered
ltx/en_us_dedes/me.m07.d31:meMA.Ode9C12.mode	@ltx/en_us_dedes/miscellanea:misc.Mode2
ltx/en_us_dedes/me.m07.d31:meMA.Ode9C12.ode	@ltx/en_us_dedes/miscellanea:misc.Ode9
ltx/en_us_dedes/me.m07.d31:meMA.Ode9C12.text	O godly-minded Evdokimos, the feast of your memory has risen like daybreak, like the sun, and it illumines hearts that lay in darkness. You are know truly to be a son of light and of the day; and therefore we honor you.
ltx/en_us_dedes/me.m07.d31:meMA.Ode9C13.incipit	O Evdokimos, adorned with wisdom…
ltx/en_us_dedes/me.m07.d31:meMA.Ode9C13.melody	@ltx/en_us_dedes/he.h.m2:heHE.AnarchouGennitoros.notmetered
ltx/en_us_dedes/me.m07.d31:meMA.Ode9C13.mode	@ltx/en_us_dedes/miscellanea:misc.Mode2
ltx/en_us_dedes/me.m07.d31:meMA.Ode9C13.ode	@ltx/en_us_dedes/miscellanea:misc.Ode9
ltx/en_us_dedes/me.m07.d31:meMA.Ode9C13.text	O Evdokimos, adorned with wisdom, shining with knowledge, handsome with humility of heart, and distinguished for your exalted way of life, you went up to the noetic courts on high. Remember us who honor you.
ltx/en_us_dedes/me.m07.d31:meMA.Ode9C14.incipit	O admirable Evdokimos, we celebrate…
ltx/en_us_dedes/me.m07.d31:meMA.Ode9C14.melody	@ltx/en_us_dedes/he.h.m2:heHE.AnarchouGennitoros.notmetered
ltx/en_us_dedes/me.m07.d31:meMA.Ode9C14.mode	@ltx/en_us_dedes/miscellanea:misc.Mode2
ltx/en_us_dedes/me.m07.d31:meMA.Ode9C14.ode	@ltx/en_us_dedes/miscellanea:misc.Ode9
ltx/en_us_dedes/me.m07.d31:meMA.Ode9C14.text	O admirable Evdokimos, we celebrate your solemn translation from the earth as a festive day and an occasion for help, for you were a servant of the Lord and an unashamed worker of His commandments.
ltx/en_us_dedes/me.m07.d31:meMA.Ode9C1T.incipit	O Maiden graced of God…
ltx/en_us_dedes/me.m07.d31:meMA.Ode9C1T.melody	@ltx/en_us_dedes/he.h.m2:heHE.AnarchouGennitoros.notmetered
ltx/en_us_dedes/me.m07.d31:meMA.Ode9C1T.mode	@ltx/en_us_dedes/miscellanea:misc.Mode2
ltx/en_us_dedes/me.m07.d31:meMA.Ode9C1T.ode	@ltx/en_us_dedes/miscellanea:misc.Ode9
ltx/en_us_dedes/me.m07.d31:meMA.Ode9C1T.text	O Maiden graced of God, you are the habitation and tabernacle of the light of Him who has illumined all men, and a bridge and ladder leading those born on earth up to heaven. We therefore honor you and faithfully call you blessed.
ltx/en_us_dedes/me.m07.d31:meMA.Ode9H.greekmelody	@ltx/en_us_dedes/he.h.m2:heHE.AnarchouGennitoros.greekname
ltx/en_us_dedes/me.m07.d31:meMA.Ode9H.incipit	@ltx/en_us_dedes/he.h.m2:heHE.AnarchouGennitoros.incipit
ltx/en_us_dedes/me.m07.d31:meMA.Ode9H.melody	@ltx/en_us_dedes/he.h.m2:heHE.AnarchouGennitoros.melody
ltx/en_us_dedes/me.m07.d31:meMA.Ode9H.mode	@ltx/en_us_dedes/miscellanea:misc.Mode2
ltx/en_us_dedes/me.m07.d31:meMA.Ode9H.ode	@ltx/en_us_dedes/miscellanea:misc.Ode9
ltx/en_us_dedes/me.m07.d31:meMA.Ode9H.text	@ltx/en_us_dedes/he.h.m2:heHE.AnarchouGennitoros.text
ltx/en_us_dedes/me.m07.d31:meVE.Apolytikion1.greekmelody	@ltx/en_us_dedes/he.a.m4:heAU.TachyProkatalave.greekname
ltx/en_us_dedes/me.m07.d31:meVE.Apolytikion1.incipit	The Master who called you…
ltx/en_us_dedes/me.m07.d31:meVE.Apolytikion1.melody	@ltx/en_us_dedes/he.a.m4:heAU.TachyProkatalave.name
ltx/en_us_dedes/me.m07.d31:meVE.Apolytikion1.mode	@ltx/en_us_dedes/miscellanea:misc.Mode4
ltx/en_us_dedes/me.m07.d31:meVE.Apolytikion1.text	The Master who called you to eternal mansions on high * preserves incorrupt your body even after you died, * O holy Evdokimos; * for you had led a lifestyle of self-restraint and decorum, * never staining your flesh; and therefore truly you are blessed. * With confidence intercede with Christ to save our souls.
ltx/en_us_dedes/me.m07.d31:meVE.Apolytikion2ger.greekmelody	@ltx/en_us_dedes/he.a.m1:heAU.ChorosAngelikos.greekname
ltx/en_us_dedes/me.m07.d31:meVE.Apolytikion2ger.incipit	…
ltx/en_us_dedes/me.m07.d31:meVE.Apolytikion2ger.melody	@ltx/en_us_dedes/he.a.m1:heAU.ChorosAngelikos.name
ltx/en_us_dedes/me.m07.d31:meVE.Apolytikion2ger.mode	@ltx/en_us_dedes/miscellanea:misc.Mode1
ltx/en_us_dedes/me.m07.d31:meVE.Apolytikion2ger.poet	@ltx/en_us_dedes/poets:po.Gerasimou
ltx/en_us_dedes/me.m07.d31:meVE.Apolytikion2ger.text	
ltx/en_us_dedes/me.m07.d31:meVE.AposGlory.incipit	@ltx/en_us_dedes/me.m09.d14:meMA.PostGospelIdiomelon.incipit
ltx/en_us_dedes/me.m07.d31:meVE.AposGlory.melody	
ltx/en_us_dedes/me.m07.d31:meVE.AposGlory.mode	@ltx/en_us_dedes/miscellanea:misc.Mode6
ltx/en_us_dedes/me.m07.d31:meVE.AposGlory.text	@ltx/en_us_dedes/me.m09.d14:meMA.PostGospelIdiomelon.text
ltx/en_us_dedes/me.m07.d31:meVE.SticBoth.incipit	@ltx/en_us_dedes/me.m09.d14:meSV.SticGlory.incipit
ltx/en_us_dedes/me.m07.d31:meVE.SticBoth.melody	
ltx/en_us_dedes/me.m07.d31:meVE.SticBoth.mode	@ltx/en_us_dedes/miscellanea:misc.Mode2
ltx/en_us_dedes/me.m07.d31:meVE.SticBoth.text	@ltx/en_us_dedes/me.m09.d14:meSV.SticGlory.text
ltx/en_us_dedes/me.m07.d31:meVE.SticGlory.incipit	The memory of every righteous…
ltx/en_us_dedes/me.m07.d31:meVE.SticGlory.melody	
ltx/en_us_dedes/me.m07.d31:meVE.SticGlory.mode	@ltx/en_us_dedes/miscellanea:misc.Mode2
ltx/en_us_dedes/me.m07.d31:meVE.SticGlory.text	The memory of every righteous man is observed with hymns of praise; and thus so is yours, O Evdokimos, servant of Christ. You had the Cross as a shield, and faith in the consubstantial Trinity as invincible power. That is why you now relax among the Angels, O ever-memorable Saint.
ltx/en_us_dedes/me.m07.d31:meVE.Stichera01.greekmelody	@ltx/en_us_dedes/he.a.m1:heAU.TonOuranionTagmaton.greekname
ltx/en_us_dedes/me.m07.d31:meVE.Stichera01.incipit	…
ltx/en_us_dedes/me.m07.d31:meVE.Stichera01.melody	@ltx/en_us_dedes/he.a.m1:heAU.TonOuranionTagmaton.name
ltx/en_us_dedes/me.m07.d31:meVE.Stichera01.mode	@ltx/en_us_dedes/miscellanea:misc.Mode1
ltx/en_us_dedes/me.m07.d31:meVE.Stichera01.text	
ltx/en_us_dedes/me.m07.d31:meVE.Stichera02.incipit	…
ltx/en_us_dedes/me.m07.d31:meVE.Stichera02.melody	@ltx/en_us_dedes/he.a.m1:heAU.TonOuranionTagmaton.name
ltx/en_us_dedes/me.m07.d31:meVE.Stichera02.mode	@ltx/en_us_dedes/miscellanea:misc.Mode1
ltx/en_us_dedes/me.m07.d31:meVE.Stichera02.text	
ltx/en_us_dedes/me.m07.d31:meVE.Stichera03.incipit	…
ltx/en_us_dedes/me.m07.d31:meVE.Stichera03.melody	@ltx/en_us_dedes/he.a.m1:heAU.TonOuranionTagmaton.name
ltx/en_us_dedes/me.m07.d31:meVE.Stichera03.mode	@ltx/en_us_dedes/miscellanea:misc.Mode1
ltx/en_us_dedes/me.m07.d31:meVE.Stichera03.text	
ltx/en_us_dedes/me.m07.d31:meVE.Stichera04.greekmelody	@ltx/en_us_dedes/he.a.m1:heAU.TonOuranionTagmaton.greekname
ltx/en_us_dedes/me.m07.d31:meVE.Stichera04.incipit	You found a most blessed…
ltx/en_us_dedes/me.m07.d31:meVE.Stichera04.melody	@ltx/en_us_dedes/he.a.m1:heAU.TonOuranionTagmaton.name
ltx/en_us_dedes/me.m07.d31:meVE.Stichera04.mode	@ltx/en_us_dedes/miscellanea:misc.Mode1
ltx/en_us_dedes/me.m07.d31:meVE.Stichera04.text	You found a most blessed end, O devout Evdokimos. * Your name denotes approval: * you lived up to it fully * in godly virtue. For you did not succumb * to the trickery of the world, * but even brighter than rays of the sun you shone * and illumined the believers all.
ltx/en_us_dedes/me.m07.d31:meVE.Stichera05.incipit	Everyone, let us extol now…
ltx/en_us_dedes/me.m07.d31:meVE.Stichera05.melody	@ltx/en_us_dedes/he.a.m1:heAU.TonOuranionTagmaton.name
ltx/en_us_dedes/me.m07.d31:meVE.Stichera05.mode	@ltx/en_us_dedes/miscellanea:misc.Mode1
ltx/en_us_dedes/me.m07.d31:meVE.Stichera05.text	Everyone, let us extol now devout Evdokimos, * whose heart was full of mercy, * that protector of orphans, * that shelter of the homeless and poor, and the lamp * radiating the love of God. * He was a statue of chastity, and he kept * the commandments of the Lord in full.
ltx/en_us_dedes/me.m07.d31:meVE.Stichera06.incipit	In your most pure heart…
ltx/en_us_dedes/me.m07.d31:meVE.Stichera06.melody	@ltx/en_us_dedes/he.a.m1:heAU.TonOuranionTagmaton.name
ltx/en_us_dedes/me.m07.d31:meVE.Stichera06.mode	@ltx/en_us_dedes/miscellanea:misc.Mode1
ltx/en_us_dedes/me.m07.d31:meVE.Stichera06.text	In your most pure heart you sought God, O St. Evdokimos, * and you abhorred the pleasures * that the world has to offer. * O godly-minded man, thus you rightly received * the reward for your labors all * from righteous God, in accordance with your own faith, * in the end, as it was clearly revealed.
