ltx/en_us_dedes/me.m02.d08:meDA.commemoration.first	Memory of the Holy Great-martyr Theodore the General
ltx/en_us_dedes/me.m02.d08:meDA.commemoration.first_name	St. Theodore the General
ltx/en_us_dedes/me.m02.d08:meDA.commemoration.first_short	Memory of the Holy Great-martyr Theodore the General
ltx/en_us_dedes/me.m02.d08:meDA.commemoration.first_title	@ltx/en_us_dedes/titles:ti.Martyr
ltx/en_us_dedes/me.m02.d08:meDA.commemoration.full	Memory of the Holy Great-martyr Theodore the General; and the Holy Prophet Zacharias.
ltx/en_us_dedes/me.m02.d08:meDA.commemoration.second_name	
ltx/en_us_dedes/me.m02.d08:meDA.commemoration.second_title	@ltx/en_us_dedes/titles:ti.Prophet
ltx/en_us_dedes/me.m02.d08:meDA.date	February 8
ltx/en_us_dedes/me.m02.d08:meDA.dismissal	@ltx/en_us_dedes/dismissals:dis00.meeting
ltx/en_us_dedes/me.m02.d08:meDA.fordate	for February 8
ltx/en_us_dedes/me.m02.d08:meDA.insert1	
ltx/en_us_dedes/me.m02.d08:meDA.insert2	
ltx/en_us_dedes/me.m02.d08:meDA.note	
ltx/en_us_dedes/me.m02.d08:meDA.pdfcoverdate	February 8,
ltx/en_us_dedes/me.m02.d08:meDA.pdfheaderdate	February 8
ltx/en_us_dedes/me.m02.d08:meHO.commemorations	
ltx/en_us_dedes/me.m02.d08:meHO.note1	@ltx/en_us_dedes/rubrical:ru.HolidayWineOil
ltx/en_us_dedes/me.m02.d08:meHO.note2	
ltx/en_us_dedes/me.m02.d08:meHO.number	
ltx/en_us_dedes/me.m02.d08:meHO.rank	
ltx/en_us_dedes/me.m02.d08:meLE.commemoration1	The Holy Great-martyr Theodore Stratelatos.
ltx/en_us_dedes/me.m02.d08:meLE.commemoration2	
ltx/en_us_dedes/me.m02.d08:meLI.Kontakion1.greekmelody	@ltx/en_us_dedes/me.m02.d08:meMA.Kontakion1.greekmelody
ltx/en_us_dedes/me.m02.d08:meLI.Kontakion1.incipit	@ltx/en_us_dedes/me.m02.d08:meMA.Kontakion1.incipit
ltx/en_us_dedes/me.m02.d08:meLI.Kontakion1.melody	@ltx/en_us_dedes/me.m02.d08:meMA.Kontakion1.melody
ltx/en_us_dedes/me.m02.d08:meLI.Kontakion1.mode	@ltx/en_us_dedes/me.m02.d08:meMA.Kontakion1.mode
ltx/en_us_dedes/me.m02.d08:meLI.Kontakion1.text	@ltx/en_us_dedes/me.m02.d08:meMA.Kontakion1.text
ltx/en_us_dedes/me.m02.d08:meLI.Megalynarion.text	
ltx/en_us_dedes/me.m02.d08:meMA.AposBoth.incipit	O our Savior, You came…
ltx/en_us_dedes/me.m02.d08:meMA.AposBoth.melody	
ltx/en_us_dedes/me.m02.d08:meMA.AposBoth.mode	@ltx/en_us_dedes/miscellanea:misc.Mode7
ltx/en_us_dedes/me.m02.d08:meMA.AposBoth.text	O our Savior, You came from heaven as Light to bring revelation to the Gentiles. After You were born of the Virgin, your rested in the embraces of righteous Symeon. It was right that You, the Giver of life to all, should be recognized by the Elder, for You came to release him, according to Your word, O Lord who has great mercy.
ltx/en_us_dedes/me.m02.d08:meMA.AposGlory.incipit	…
ltx/en_us_dedes/me.m02.d08:meMA.AposGlory.melody	
ltx/en_us_dedes/me.m02.d08:meMA.AposGlory.mode	@ltx/en_us_dedes/miscellanea:misc.Mode8
ltx/en_us_dedes/me.m02.d08:meMA.AposGlory.text	
ltx/en_us_dedes/me.m02.d08:meMA.Aposticha1.greekmelody	@ltx/en_us_dedes/he.a.m2:heAU.OikosTouEfratha.greekname
ltx/en_us_dedes/me.m02.d08:meMA.Aposticha1.incipit	He who as Lord of…
ltx/en_us_dedes/me.m02.d08:meMA.Aposticha1.melody	@ltx/en_us_dedes/he.a.m2:heAU.OikosTouEfratha.name
ltx/en_us_dedes/me.m02.d08:meMA.Aposticha1.mode	@ltx/en_us_dedes/miscellanea:misc.Mode2
ltx/en_us_dedes/me.m02.d08:meMA.Aposticha1.text	He who as Lord of all * and as the world’s Creator * contains all things in His hand, * is brought into the Temple in hands of Elder Symeon.
ltx/en_us_dedes/me.m02.d08:meMA.Aposticha2.incipit	Symeon, leap for joy, *…
ltx/en_us_dedes/me.m02.d08:meMA.Aposticha2.melody	@ltx/en_us_dedes/he.a.m2:heAU.OikosTouEfratha.name
ltx/en_us_dedes/me.m02.d08:meMA.Aposticha2.mode	@ltx/en_us_dedes/miscellanea:misc.Mode2
ltx/en_us_dedes/me.m02.d08:meMA.Aposticha2.text	Symeon, leap for joy, * and Anna, be exultant! * Behold, the world’s Redeemer * has finally appeared and is brought in as an newborn babe.
ltx/en_us_dedes/me.m02.d08:meMA.Aposticha3.incipit	God-bearer Symeon, * in your…
ltx/en_us_dedes/me.m02.d08:meMA.Aposticha3.melody	@ltx/en_us_dedes/he.a.m2:heAU.OikosTouEfratha.name
ltx/en_us_dedes/me.m02.d08:meMA.Aposticha3.mode	@ltx/en_us_dedes/miscellanea:misc.Mode2
ltx/en_us_dedes/me.m02.d08:meMA.Aposticha3.text	God-bearer Symeon, * in your embraces holding * the One who holds together * all things, you see salvation, * releasing you from death’s decay.
ltx/en_us_dedes/me.m02.d08:meMA.C1.acrostic.notice1	
ltx/en_us_dedes/me.m02.d08:meMA.C1.acrostic.notice2	
ltx/en_us_dedes/me.m02.d08:meMA.C1.acrostic.text	
ltx/en_us_dedes/me.m02.d08:meMA.C1.acrostic.title	
ltx/en_us_dedes/me.m02.d08:meMA.C1.title	@ltx/en_us_dedes/titles:ti.CanonMartyrM
ltx/en_us_dedes/me.m02.d08:meMA.C1.verse	@ltx/en_us_dedes/prayers:pr.verse_SaintM.text
ltx/en_us_dedes/me.m02.d08:meMA.C2.acrostic.notice1	
ltx/en_us_dedes/me.m02.d08:meMA.C2.acrostic.text	
ltx/en_us_dedes/me.m02.d08:meMA.C2.acrostic.title	
ltx/en_us_dedes/me.m02.d08:meMA.C2.poet	@ltx/en_us_dedes/poets:po.Theofanous
ltx/en_us_dedes/me.m02.d08:meMA.C2.title	@ltx/en_us_dedes/titles:ti.CanonProphet
ltx/en_us_dedes/me.m02.d08:meMA.C2.verse	@ltx/en_us_dedes/prayers:pr.verse_SaintM.text
ltx/en_us_dedes/me.m02.d08:meMA.Exaposteilarion1.greekmelody	@ltx/en_us_dedes/he.a.m2:heAU.ToisMathitaisSynelthomen.greekname
ltx/en_us_dedes/me.m02.d08:meMA.Exaposteilarion1.incipit	…
ltx/en_us_dedes/me.m02.d08:meMA.Exaposteilarion1.melody	@ltx/en_us_dedes/he.a.m2:heAU.ToisMathitaisSynelthomen.name
ltx/en_us_dedes/me.m02.d08:meMA.Exaposteilarion1.mode	@ltx/en_us_dedes/miscellanea:misc.Mode2
ltx/en_us_dedes/me.m02.d08:meMA.Exaposteilarion1.text	
ltx/en_us_dedes/me.m02.d08:meMA.Exaposteilarion2.greekmelody	@ltx/en_us_dedes/me.m02.d02:meMA.Exaposteilarion1.greekmelody
ltx/en_us_dedes/me.m02.d08:meMA.Exaposteilarion2.incipit	@ltx/en_us_dedes/me.m02.d02:meMA.Exaposteilarion1.incipit
ltx/en_us_dedes/me.m02.d08:meMA.Exaposteilarion2.melody	@ltx/en_us_dedes/me.m02.d02:meMA.Exaposteilarion1.melody
ltx/en_us_dedes/me.m02.d08:meMA.Exaposteilarion2.mode	@ltx/en_us_dedes/miscellanea:misc.Mode3
ltx/en_us_dedes/me.m02.d08:meMA.Exaposteilarion2.text	@ltx/en_us_dedes/me.m02.d02:meMA.Exaposteilarion1.text
ltx/en_us_dedes/me.m02.d08:meMA.Kathisma11.greekmelody	@ltx/en_us_dedes/he.a.m4:heAU.OYpsotheisEnToStavro.greekname
ltx/en_us_dedes/me.m02.d08:meMA.Kathisma11.incipit	Christ’s triumphant athlete who is…
ltx/en_us_dedes/me.m02.d08:meMA.Kathisma11.melody	@ltx/en_us_dedes/he.a.m4:heAU.OYpsotheisEnToStavro.notmetered
ltx/en_us_dedes/me.m02.d08:meMA.Kathisma11.mode	@ltx/en_us_dedes/miscellanea:misc.Mode4
ltx/en_us_dedes/me.m02.d08:meMA.Kathisma11.text	Christ’s triumphant athlete who is called great, and who is beloved by God and by Angels, yes, marvelous and glorious Theodore, today in the Holy Spirit brings gladness to all the holy churches under the sun; and he prompts everyone to celebrate his memory with joy.
ltx/en_us_dedes/me.m02.d08:meMA.Kathisma12.greekmelody	@ltx/en_us_dedes/he.a.m4:heAU.KateplagiIosif.greekname
ltx/en_us_dedes/me.m02.d08:meMA.Kathisma12.incipit	@ltx/en_us_dedes/me.m02.d02:meMA.Ode3Kathisma1.incipit
ltx/en_us_dedes/me.m02.d08:meMA.Kathisma12.melody	@ltx/en_us_dedes/he.a.m4:heAU.KateplagiIosif.name
ltx/en_us_dedes/me.m02.d08:meMA.Kathisma12.mode	@ltx/en_us_dedes/miscellanea:misc.Mode4
ltx/en_us_dedes/me.m02.d08:meMA.Kathisma12.text	@ltx/en_us_dedes/me.m02.d02:meMA.Ode3Kathisma1.text
ltx/en_us_dedes/me.m02.d08:meMA.Kathisma21.greekmelody	@ltx/en_us_dedes/he.a.m1:heAU.TouLithouSfragisthentos.greekname
ltx/en_us_dedes/me.m02.d08:meMA.Kathisma21.incipit	…
ltx/en_us_dedes/me.m02.d08:meMA.Kathisma21.melody	@ltx/en_us_dedes/he.a.m1:heAU.TouLithouSfragisthentos.name
ltx/en_us_dedes/me.m02.d08:meMA.Kathisma21.mode	@ltx/en_us_dedes/miscellanea:misc.Mode1
ltx/en_us_dedes/me.m02.d08:meMA.Kathisma21.text	
ltx/en_us_dedes/me.m02.d08:meMA.Kontakion1.greekmelody	@ltx/en_us_dedes/he.a.m2:heAU.TaAnoZiton.greekname
ltx/en_us_dedes/me.m02.d08:meMA.Kontakion1.incipit	…
ltx/en_us_dedes/me.m02.d08:meMA.Kontakion1.melody	@ltx/en_us_dedes/he.a.m2:heAU.TaAnoZiton.name
ltx/en_us_dedes/me.m02.d08:meMA.Kontakion1.mode	@ltx/en_us_dedes/miscellanea:misc.Mode2
ltx/en_us_dedes/me.m02.d08:meMA.Kontakion1.text	
ltx/en_us_dedes/me.m02.d08:meMA.Lauds1.greekmelody	@ltx/en_us_dedes/he.a.m4:heAU.OsGennaionEnMartysi.greekname
ltx/en_us_dedes/me.m02.d08:meMA.Lauds1.incipit	…
ltx/en_us_dedes/me.m02.d08:meMA.Lauds1.melody	@ltx/en_us_dedes/he.a.m4:heAU.OsGennaionEnMartysi.name
ltx/en_us_dedes/me.m02.d08:meMA.Lauds1.mode	@ltx/en_us_dedes/miscellanea:misc.Mode4
ltx/en_us_dedes/me.m02.d08:meMA.Lauds1.text	
ltx/en_us_dedes/me.m02.d08:meMA.Lauds2.incipit	…
ltx/en_us_dedes/me.m02.d08:meMA.Lauds2.melody	@ltx/en_us_dedes/he.a.m4:heAU.OsGennaionEnMartysi.name
ltx/en_us_dedes/me.m02.d08:meMA.Lauds2.mode	@ltx/en_us_dedes/miscellanea:misc.Mode4
ltx/en_us_dedes/me.m02.d08:meMA.Lauds2.text	
ltx/en_us_dedes/me.m02.d08:meMA.Lauds3.incipit	…
ltx/en_us_dedes/me.m02.d08:meMA.Lauds3.melody	@ltx/en_us_dedes/he.a.m4:heAU.OsGennaionEnMartysi.name
ltx/en_us_dedes/me.m02.d08:meMA.Lauds3.mode	@ltx/en_us_dedes/miscellanea:misc.Mode4
ltx/en_us_dedes/me.m02.d08:meMA.Lauds3.text	
ltx/en_us_dedes/me.m02.d08:meMA.LaudsBoth.incipit	@ltx/en_us_dedes/me.m02.d02:meVE.Lity6.incipit
ltx/en_us_dedes/me.m02.d08:meMA.LaudsBoth.melody	
ltx/en_us_dedes/me.m02.d08:meMA.LaudsBoth.mode	@ltx/en_us_dedes/miscellanea:misc.Mode2
ltx/en_us_dedes/me.m02.d08:meMA.LaudsBoth.poet	@ltx/en_us_dedes/poets:po.Germanou
ltx/en_us_dedes/me.m02.d08:meMA.LaudsBoth.text	@ltx/en_us_dedes/me.m02.d02:meVE.Lity6.text
ltx/en_us_dedes/me.m02.d08:meMA.LaudsGlory.incipit	You piously wore the armor…
ltx/en_us_dedes/me.m02.d08:meMA.LaudsGlory.melody	
ltx/en_us_dedes/me.m02.d08:meMA.LaudsGlory.mode	@ltx/en_us_dedes/miscellanea:misc.Mode8
ltx/en_us_dedes/me.m02.d08:meMA.LaudsGlory.text	You piously wore the armor of athletic valor and rational worship, O medalist of Christ, by whose power you mightily lined up for battle. You disdained the tortures and the momentary fire, and thus you showed that the godlessness of the idols and the viciousness of the tyrant had no power over you. And now we entreat you, O Theodore, gift from God in name and deed: by your intercessions, save us who observe your memory from all adversity.
ltx/en_us_dedes/me.m02.d08:meMA.Ode1C11.greekmelody	@ltx/en_us_dedes/he.h.m8:heHE.ArmatilatinFarao.greekname
ltx/en_us_dedes/me.m02.d08:meMA.Ode1C11.incipit	…
ltx/en_us_dedes/me.m02.d08:meMA.Ode1C11.melody	@ltx/en_us_dedes/he.h.m8:heHE.ArmatilatinFarao.name
ltx/en_us_dedes/me.m02.d08:meMA.Ode1C11.mode	@ltx/en_us_dedes/miscellanea:misc.Mode8
ltx/en_us_dedes/me.m02.d08:meMA.Ode1C11.ode	@ltx/en_us_dedes/miscellanea:misc.Ode1
ltx/en_us_dedes/me.m02.d08:meMA.Ode1C11.text	
ltx/en_us_dedes/me.m02.d08:meMA.Ode1C12.incipit	…
ltx/en_us_dedes/me.m02.d08:meMA.Ode1C12.melody	@ltx/en_us_dedes/he.h.m8:heHE.ArmatilatinFarao.name
ltx/en_us_dedes/me.m02.d08:meMA.Ode1C12.mode	@ltx/en_us_dedes/miscellanea:misc.Mode8
ltx/en_us_dedes/me.m02.d08:meMA.Ode1C12.ode	@ltx/en_us_dedes/miscellanea:misc.Ode1
ltx/en_us_dedes/me.m02.d08:meMA.Ode1C12.text	
ltx/en_us_dedes/me.m02.d08:meMA.Ode1C13.incipit	…
ltx/en_us_dedes/me.m02.d08:meMA.Ode1C13.melody	@ltx/en_us_dedes/he.h.m8:heHE.ArmatilatinFarao.name
ltx/en_us_dedes/me.m02.d08:meMA.Ode1C13.mode	@ltx/en_us_dedes/miscellanea:misc.Mode8
ltx/en_us_dedes/me.m02.d08:meMA.Ode1C13.ode	@ltx/en_us_dedes/miscellanea:misc.Ode1
ltx/en_us_dedes/me.m02.d08:meMA.Ode1C13.text	
ltx/en_us_dedes/me.m02.d08:meMA.Ode1C14.incipit	…
ltx/en_us_dedes/me.m02.d08:meMA.Ode1C14.melody	@ltx/en_us_dedes/he.h.m8:heHE.ArmatilatinFarao.name
ltx/en_us_dedes/me.m02.d08:meMA.Ode1C14.mode	@ltx/en_us_dedes/miscellanea:misc.Mode8
ltx/en_us_dedes/me.m02.d08:meMA.Ode1C14.ode	@ltx/en_us_dedes/miscellanea:misc.Ode1
ltx/en_us_dedes/me.m02.d08:meMA.Ode1C14.text	
ltx/en_us_dedes/me.m02.d08:meMA.Ode1C1H.greekmelody	@ltx/en_us_dedes/he.h.m8:heHE.ArmatilatinFarao.greekname
ltx/en_us_dedes/me.m02.d08:meMA.Ode1C1H.incipit	@ltx/en_us_dedes/he.h.m8:heHE.ArmatilatinFarao.incipit
ltx/en_us_dedes/me.m02.d08:meMA.Ode1C1H.melody	@ltx/en_us_dedes/he.h.m8:heHE.ArmatilatinFarao.melody
ltx/en_us_dedes/me.m02.d08:meMA.Ode1C1H.mode	@ltx/en_us_dedes/miscellanea:misc.Mode8
ltx/en_us_dedes/me.m02.d08:meMA.Ode1C1H.ode	@ltx/en_us_dedes/miscellanea:misc.Ode1
ltx/en_us_dedes/me.m02.d08:meMA.Ode1C1H.text	@ltx/en_us_dedes/he.h.m8:heHE.ArmatilatinFarao.text
ltx/en_us_dedes/me.m02.d08:meMA.Ode1C1T.incipit	…
ltx/en_us_dedes/me.m02.d08:meMA.Ode1C1T.melody	@ltx/en_us_dedes/he.h.m8:heHE.ArmatilatinFarao.name
ltx/en_us_dedes/me.m02.d08:meMA.Ode1C1T.mode	@ltx/en_us_dedes/miscellanea:misc.Mode8
ltx/en_us_dedes/me.m02.d08:meMA.Ode1C1T.ode	@ltx/en_us_dedes/miscellanea:misc.Ode1
ltx/en_us_dedes/me.m02.d08:meMA.Ode1C1T.text	
ltx/en_us_dedes/me.m02.d08:meMA.Ode1C21.greekmelody	@ltx/en_us_dedes/he.h.m8:heHE.AsomenToKyrio.greekname
ltx/en_us_dedes/me.m02.d08:meMA.Ode1C21.incipit	…
ltx/en_us_dedes/me.m02.d08:meMA.Ode1C21.melody	@ltx/en_us_dedes/he.h.m8:heHE.AsomenToKyrio.name
ltx/en_us_dedes/me.m02.d08:meMA.Ode1C21.mode	@ltx/en_us_dedes/miscellanea:misc.Mode8
ltx/en_us_dedes/me.m02.d08:meMA.Ode1C21.ode	@ltx/en_us_dedes/miscellanea:misc.Ode1
ltx/en_us_dedes/me.m02.d08:meMA.Ode1C21.text	
ltx/en_us_dedes/me.m02.d08:meMA.Ode1C22.incipit	…
ltx/en_us_dedes/me.m02.d08:meMA.Ode1C22.melody	@ltx/en_us_dedes/he.h.m8:heHE.AsomenToKyrio.name
ltx/en_us_dedes/me.m02.d08:meMA.Ode1C22.mode	@ltx/en_us_dedes/miscellanea:misc.Mode8
ltx/en_us_dedes/me.m02.d08:meMA.Ode1C22.ode	@ltx/en_us_dedes/miscellanea:misc.Ode1
ltx/en_us_dedes/me.m02.d08:meMA.Ode1C22.text	
ltx/en_us_dedes/me.m02.d08:meMA.Ode1C23.incipit	…
ltx/en_us_dedes/me.m02.d08:meMA.Ode1C23.melody	@ltx/en_us_dedes/he.h.m8:heHE.AsomenToKyrio.name
ltx/en_us_dedes/me.m02.d08:meMA.Ode1C23.mode	@ltx/en_us_dedes/miscellanea:misc.Mode8
ltx/en_us_dedes/me.m02.d08:meMA.Ode1C23.ode	@ltx/en_us_dedes/miscellanea:misc.Ode1
ltx/en_us_dedes/me.m02.d08:meMA.Ode1C23.text	
ltx/en_us_dedes/me.m02.d08:meMA.Ode1C2H.greekmelody	@ltx/en_us_dedes/he.h.m8:heHE.AsomenToKyrio.greekname
ltx/en_us_dedes/me.m02.d08:meMA.Ode1C2H.incipit	@ltx/en_us_dedes/he.h.m8:heHE.AsomenToKyrio.incipit
ltx/en_us_dedes/me.m02.d08:meMA.Ode1C2H.melody	@ltx/en_us_dedes/he.h.m8:heHE.AsomenToKyrio.melody
ltx/en_us_dedes/me.m02.d08:meMA.Ode1C2H.mode	@ltx/en_us_dedes/miscellanea:misc.Mode8
ltx/en_us_dedes/me.m02.d08:meMA.Ode1C2H.ode	@ltx/en_us_dedes/miscellanea:misc.Ode1
ltx/en_us_dedes/me.m02.d08:meMA.Ode1C2H.text	@ltx/en_us_dedes/he.h.m8:heHE.AsomenToKyrio.text
ltx/en_us_dedes/me.m02.d08:meMA.Ode1C2T.incipit	…
ltx/en_us_dedes/me.m02.d08:meMA.Ode1C2T.melody	@ltx/en_us_dedes/he.h.m8:heHE.AsomenToKyrio.name
ltx/en_us_dedes/me.m02.d08:meMA.Ode1C2T.mode	@ltx/en_us_dedes/miscellanea:misc.Mode8
ltx/en_us_dedes/me.m02.d08:meMA.Ode1C2T.ode	@ltx/en_us_dedes/miscellanea:misc.Ode1
ltx/en_us_dedes/me.m02.d08:meMA.Ode1C2T.text	
ltx/en_us_dedes/me.m02.d08:meMA.Ode3C11.greekmelody	@ltx/en_us_dedes/he.h.m8:heHE.OuraniasApsidos.greekname
ltx/en_us_dedes/me.m02.d08:meMA.Ode3C11.incipit	…
ltx/en_us_dedes/me.m02.d08:meMA.Ode3C11.melody	@ltx/en_us_dedes/he.h.m8:heHE.OuraniasApsidos.name
ltx/en_us_dedes/me.m02.d08:meMA.Ode3C11.mode	@ltx/en_us_dedes/miscellanea:misc.Mode8
ltx/en_us_dedes/me.m02.d08:meMA.Ode3C11.ode	@ltx/en_us_dedes/miscellanea:misc.Ode3
ltx/en_us_dedes/me.m02.d08:meMA.Ode3C11.text	
ltx/en_us_dedes/me.m02.d08:meMA.Ode3C12.incipit	…
ltx/en_us_dedes/me.m02.d08:meMA.Ode3C12.melody	@ltx/en_us_dedes/he.h.m8:heHE.OuraniasApsidos.name
ltx/en_us_dedes/me.m02.d08:meMA.Ode3C12.mode	@ltx/en_us_dedes/miscellanea:misc.Mode8
ltx/en_us_dedes/me.m02.d08:meMA.Ode3C12.ode	@ltx/en_us_dedes/miscellanea:misc.Ode3
ltx/en_us_dedes/me.m02.d08:meMA.Ode3C12.text	
ltx/en_us_dedes/me.m02.d08:meMA.Ode3C13.incipit	…
ltx/en_us_dedes/me.m02.d08:meMA.Ode3C13.melody	@ltx/en_us_dedes/he.h.m8:heHE.OuraniasApsidos.name
ltx/en_us_dedes/me.m02.d08:meMA.Ode3C13.mode	@ltx/en_us_dedes/miscellanea:misc.Mode8
ltx/en_us_dedes/me.m02.d08:meMA.Ode3C13.ode	@ltx/en_us_dedes/miscellanea:misc.Ode3
ltx/en_us_dedes/me.m02.d08:meMA.Ode3C13.text	
ltx/en_us_dedes/me.m02.d08:meMA.Ode3C1H.greekmelody	@ltx/en_us_dedes/he.h.m8:heHE.OuraniasApsidos.greekname
ltx/en_us_dedes/me.m02.d08:meMA.Ode3C1H.incipit	@ltx/en_us_dedes/he.h.m8:heHE.OuraniasApsidos.incipit
ltx/en_us_dedes/me.m02.d08:meMA.Ode3C1H.melody	@ltx/en_us_dedes/he.h.m8:heHE.OuraniasApsidos.melody
ltx/en_us_dedes/me.m02.d08:meMA.Ode3C1H.mode	@ltx/en_us_dedes/miscellanea:misc.Mode8
ltx/en_us_dedes/me.m02.d08:meMA.Ode3C1H.ode	@ltx/en_us_dedes/miscellanea:misc.Ode3
ltx/en_us_dedes/me.m02.d08:meMA.Ode3C1H.text	@ltx/en_us_dedes/he.h.m8:heHE.OuraniasApsidos.text
ltx/en_us_dedes/me.m02.d08:meMA.Ode3C1T.incipit	…
ltx/en_us_dedes/me.m02.d08:meMA.Ode3C1T.melody	@ltx/en_us_dedes/he.h.m8:heHE.OuraniasApsidos.name
ltx/en_us_dedes/me.m02.d08:meMA.Ode3C1T.mode	@ltx/en_us_dedes/miscellanea:misc.Mode8
ltx/en_us_dedes/me.m02.d08:meMA.Ode3C1T.ode	@ltx/en_us_dedes/miscellanea:misc.Ode3
ltx/en_us_dedes/me.m02.d08:meMA.Ode3C1T.text	
ltx/en_us_dedes/me.m02.d08:meMA.Ode3C21.greekmelody	@ltx/en_us_dedes/he.h.m8:heHE.OukEstinAgios.greekname
ltx/en_us_dedes/me.m02.d08:meMA.Ode3C21.incipit	…
ltx/en_us_dedes/me.m02.d08:meMA.Ode3C21.melody	@ltx/en_us_dedes/he.h.m8:heHE.OukEstinAgios.name
ltx/en_us_dedes/me.m02.d08:meMA.Ode3C21.mode	@ltx/en_us_dedes/miscellanea:misc.Mode8
ltx/en_us_dedes/me.m02.d08:meMA.Ode3C21.ode	@ltx/en_us_dedes/miscellanea:misc.Ode3
ltx/en_us_dedes/me.m02.d08:meMA.Ode3C21.text	
ltx/en_us_dedes/me.m02.d08:meMA.Ode3C22.incipit	…
ltx/en_us_dedes/me.m02.d08:meMA.Ode3C22.melody	@ltx/en_us_dedes/he.h.m8:heHE.OukEstinAgios.name
ltx/en_us_dedes/me.m02.d08:meMA.Ode3C22.mode	@ltx/en_us_dedes/miscellanea:misc.Mode8
ltx/en_us_dedes/me.m02.d08:meMA.Ode3C22.ode	@ltx/en_us_dedes/miscellanea:misc.Ode3
ltx/en_us_dedes/me.m02.d08:meMA.Ode3C22.text	
ltx/en_us_dedes/me.m02.d08:meMA.Ode3C23.incipit	…
ltx/en_us_dedes/me.m02.d08:meMA.Ode3C23.melody	@ltx/en_us_dedes/he.h.m8:heHE.OukEstinAgios.name
ltx/en_us_dedes/me.m02.d08:meMA.Ode3C23.mode	@ltx/en_us_dedes/miscellanea:misc.Mode8
ltx/en_us_dedes/me.m02.d08:meMA.Ode3C23.ode	@ltx/en_us_dedes/miscellanea:misc.Ode3
ltx/en_us_dedes/me.m02.d08:meMA.Ode3C23.text	
ltx/en_us_dedes/me.m02.d08:meMA.Ode3C2H.greekmelody	@ltx/en_us_dedes/he.h.m8:heHE.OukEstinAgios.greekname
ltx/en_us_dedes/me.m02.d08:meMA.Ode3C2H.incipit	@ltx/en_us_dedes/he.h.m8:heHE.OukEstinAgios.incipit
ltx/en_us_dedes/me.m02.d08:meMA.Ode3C2H.melody	@ltx/en_us_dedes/he.h.m8:heHE.OukEstinAgios.melody
ltx/en_us_dedes/me.m02.d08:meMA.Ode3C2H.mode	@ltx/en_us_dedes/miscellanea:misc.Mode8
ltx/en_us_dedes/me.m02.d08:meMA.Ode3C2H.ode	@ltx/en_us_dedes/miscellanea:misc.Ode3
ltx/en_us_dedes/me.m02.d08:meMA.Ode3C2H.text	@ltx/en_us_dedes/he.h.m8:heHE.OukEstinAgios.text
ltx/en_us_dedes/me.m02.d08:meMA.Ode3C2T.incipit	…
ltx/en_us_dedes/me.m02.d08:meMA.Ode3C2T.melody	@ltx/en_us_dedes/he.h.m8:heHE.OukEstinAgios.name
ltx/en_us_dedes/me.m02.d08:meMA.Ode3C2T.mode	@ltx/en_us_dedes/miscellanea:misc.Mode8
ltx/en_us_dedes/me.m02.d08:meMA.Ode3C2T.ode	@ltx/en_us_dedes/miscellanea:misc.Ode3
ltx/en_us_dedes/me.m02.d08:meMA.Ode3C2T.text	
ltx/en_us_dedes/me.m02.d08:meMA.Ode3Kathisma1.greekmelody	@ltx/en_us_dedes/he.a.m8:heAU.TinSofianKaiLogon.greekname
ltx/en_us_dedes/me.m02.d08:meMA.Ode3Kathisma1.incipit	…
ltx/en_us_dedes/me.m02.d08:meMA.Ode3Kathisma1.melody	@ltx/en_us_dedes/he.a.m8:heAU.TinSofianKaiLogon.name
ltx/en_us_dedes/me.m02.d08:meMA.Ode3Kathisma1.mode	@ltx/en_us_dedes/miscellanea:misc.Mode8
ltx/en_us_dedes/me.m02.d08:meMA.Ode3Kathisma1.text	
ltx/en_us_dedes/me.m02.d08:meMA.Ode3Kathisma2.greekmelody	@ltx/en_us_dedes/he.a.m3:heAU.TinOraiotita.greekname
ltx/en_us_dedes/me.m02.d08:meMA.Ode3Kathisma2.incipit	…
ltx/en_us_dedes/me.m02.d08:meMA.Ode3Kathisma2.melody	@ltx/en_us_dedes/he.a.m3:heAU.TinOraiotita.name
ltx/en_us_dedes/me.m02.d08:meMA.Ode3Kathisma2.mode	@ltx/en_us_dedes/miscellanea:misc.Mode3
ltx/en_us_dedes/me.m02.d08:meMA.Ode3Kathisma2.text	
ltx/en_us_dedes/me.m02.d08:meMA.Ode3Kathisma3.greekmelody	@ltx/en_us_dedes/he.a.m3:heAU.TinOraiotita.greekname
ltx/en_us_dedes/me.m02.d08:meMA.Ode3Kathisma3.incipit	…
ltx/en_us_dedes/me.m02.d08:meMA.Ode3Kathisma3.melody	@ltx/en_us_dedes/he.a.m3:heAU.TinOraiotita.name
ltx/en_us_dedes/me.m02.d08:meMA.Ode3Kathisma3.mode	@ltx/en_us_dedes/miscellanea:misc.Mode3
ltx/en_us_dedes/me.m02.d08:meMA.Ode3Kathisma3.text	
ltx/en_us_dedes/me.m02.d08:meMA.Ode3KathismaSt.incipit	@ltx/en_us_dedes/me.m02.d03:meMA.Ode3KathismaSt.incipit
ltx/en_us_dedes/me.m02.d08:meMA.Ode3KathismaSt.melody	@ltx/en_us_dedes/he.a.m3:heAU.TinOraiotita.name
ltx/en_us_dedes/me.m02.d08:meMA.Ode3KathismaSt.mode	@ltx/en_us_dedes/miscellanea:misc.Mode3
ltx/en_us_dedes/me.m02.d08:meMA.Ode3KathismaSt.text	@ltx/en_us_dedes/me.m02.d03:meMA.Ode3KathismaSt.text
ltx/en_us_dedes/me.m02.d08:meMA.Ode3KathismaT.incipit	@ltx/en_us_dedes/me.m02.d03:meMA.Ode3KathismaT.incipit
ltx/en_us_dedes/me.m02.d08:meMA.Ode3KathismaT.melody	@ltx/en_us_dedes/he.a.m3:heAU.TinOraiotita.name
ltx/en_us_dedes/me.m02.d08:meMA.Ode3KathismaT.mode	@ltx/en_us_dedes/miscellanea:misc.Mode3
ltx/en_us_dedes/me.m02.d08:meMA.Ode3KathismaT.text	@ltx/en_us_dedes/me.m02.d03:meMA.Ode3KathismaT.text
ltx/en_us_dedes/me.m02.d08:meMA.Ode4C11.greekmelody	@ltx/en_us_dedes/he.h.m8:heHE.SyMouIschys.greekname
ltx/en_us_dedes/me.m02.d08:meMA.Ode4C11.incipit	…
ltx/en_us_dedes/me.m02.d08:meMA.Ode4C11.melody	@ltx/en_us_dedes/he.h.m8:heHE.SyMouIschys.name
ltx/en_us_dedes/me.m02.d08:meMA.Ode4C11.mode	@ltx/en_us_dedes/miscellanea:misc.Mode8
ltx/en_us_dedes/me.m02.d08:meMA.Ode4C11.ode	@ltx/en_us_dedes/miscellanea:misc.Ode4
ltx/en_us_dedes/me.m02.d08:meMA.Ode4C11.text	
ltx/en_us_dedes/me.m02.d08:meMA.Ode4C12.incipit	…
ltx/en_us_dedes/me.m02.d08:meMA.Ode4C12.melody	@ltx/en_us_dedes/he.h.m8:heHE.SyMouIschys.name
ltx/en_us_dedes/me.m02.d08:meMA.Ode4C12.mode	@ltx/en_us_dedes/miscellanea:misc.Mode8
ltx/en_us_dedes/me.m02.d08:meMA.Ode4C12.ode	@ltx/en_us_dedes/miscellanea:misc.Ode4
ltx/en_us_dedes/me.m02.d08:meMA.Ode4C12.text	
ltx/en_us_dedes/me.m02.d08:meMA.Ode4C13.incipit	…
ltx/en_us_dedes/me.m02.d08:meMA.Ode4C13.melody	@ltx/en_us_dedes/he.h.m8:heHE.SyMouIschys.name
ltx/en_us_dedes/me.m02.d08:meMA.Ode4C13.mode	@ltx/en_us_dedes/miscellanea:misc.Mode8
ltx/en_us_dedes/me.m02.d08:meMA.Ode4C13.ode	@ltx/en_us_dedes/miscellanea:misc.Ode4
ltx/en_us_dedes/me.m02.d08:meMA.Ode4C13.text	
ltx/en_us_dedes/me.m02.d08:meMA.Ode4C14.incipit	…
ltx/en_us_dedes/me.m02.d08:meMA.Ode4C14.melody	@ltx/en_us_dedes/he.h.m8:heHE.SyMouIschys.name
ltx/en_us_dedes/me.m02.d08:meMA.Ode4C14.mode	@ltx/en_us_dedes/miscellanea:misc.Mode8
ltx/en_us_dedes/me.m02.d08:meMA.Ode4C14.ode	@ltx/en_us_dedes/miscellanea:misc.Ode4
ltx/en_us_dedes/me.m02.d08:meMA.Ode4C14.text	
ltx/en_us_dedes/me.m02.d08:meMA.Ode4C1H.greekmelody	@ltx/en_us_dedes/he.h.m8:heHE.SyMouIschys.greekname
ltx/en_us_dedes/me.m02.d08:meMA.Ode4C1H.incipit	@ltx/en_us_dedes/he.h.m8:heHE.SyMouIschys.incipit
ltx/en_us_dedes/me.m02.d08:meMA.Ode4C1H.melody	@ltx/en_us_dedes/he.h.m8:heHE.SyMouIschys.melody
ltx/en_us_dedes/me.m02.d08:meMA.Ode4C1H.mode	@ltx/en_us_dedes/miscellanea:misc.Mode8
ltx/en_us_dedes/me.m02.d08:meMA.Ode4C1H.ode	@ltx/en_us_dedes/miscellanea:misc.Ode4
ltx/en_us_dedes/me.m02.d08:meMA.Ode4C1H.text	@ltx/en_us_dedes/he.h.m8:heHE.SyMouIschys.text
ltx/en_us_dedes/me.m02.d08:meMA.Ode4C1T.incipit	…
ltx/en_us_dedes/me.m02.d08:meMA.Ode4C1T.melody	@ltx/en_us_dedes/he.h.m8:heHE.SyMouIschys.name
ltx/en_us_dedes/me.m02.d08:meMA.Ode4C1T.mode	@ltx/en_us_dedes/miscellanea:misc.Mode8
ltx/en_us_dedes/me.m02.d08:meMA.Ode4C1T.ode	@ltx/en_us_dedes/miscellanea:misc.Ode4
ltx/en_us_dedes/me.m02.d08:meMA.Ode4C1T.text	
ltx/en_us_dedes/me.m02.d08:meMA.Ode4C21.greekmelody	@ltx/en_us_dedes/he.h.m8:heHE.ExOrousKataskiou.greekname
ltx/en_us_dedes/me.m02.d08:meMA.Ode4C21.incipit	…
ltx/en_us_dedes/me.m02.d08:meMA.Ode4C21.melody	@ltx/en_us_dedes/he.h.m8:heHE.ExOrousKataskiou.name
ltx/en_us_dedes/me.m02.d08:meMA.Ode4C21.mode	@ltx/en_us_dedes/miscellanea:misc.Mode8
ltx/en_us_dedes/me.m02.d08:meMA.Ode4C21.ode	@ltx/en_us_dedes/miscellanea:misc.Ode4
ltx/en_us_dedes/me.m02.d08:meMA.Ode4C21.text	
ltx/en_us_dedes/me.m02.d08:meMA.Ode4C22.incipit	…
ltx/en_us_dedes/me.m02.d08:meMA.Ode4C22.melody	@ltx/en_us_dedes/he.h.m8:heHE.ExOrousKataskiou.name
ltx/en_us_dedes/me.m02.d08:meMA.Ode4C22.mode	@ltx/en_us_dedes/miscellanea:misc.Mode8
ltx/en_us_dedes/me.m02.d08:meMA.Ode4C22.ode	@ltx/en_us_dedes/miscellanea:misc.Ode4
ltx/en_us_dedes/me.m02.d08:meMA.Ode4C22.text	
ltx/en_us_dedes/me.m02.d08:meMA.Ode4C23.incipit	…
ltx/en_us_dedes/me.m02.d08:meMA.Ode4C23.melody	@ltx/en_us_dedes/he.h.m8:heHE.ExOrousKataskiou.name
ltx/en_us_dedes/me.m02.d08:meMA.Ode4C23.mode	@ltx/en_us_dedes/miscellanea:misc.Mode8
ltx/en_us_dedes/me.m02.d08:meMA.Ode4C23.ode	@ltx/en_us_dedes/miscellanea:misc.Ode4
ltx/en_us_dedes/me.m02.d08:meMA.Ode4C23.text	
ltx/en_us_dedes/me.m02.d08:meMA.Ode4C2H.greekmelody	@ltx/en_us_dedes/he.h.m8:heHE.ExOrousKataskiou.greekname
ltx/en_us_dedes/me.m02.d08:meMA.Ode4C2H.incipit	@ltx/en_us_dedes/he.h.m8:heHE.ExOrousKataskiou.incipit
ltx/en_us_dedes/me.m02.d08:meMA.Ode4C2H.melody	@ltx/en_us_dedes/he.h.m8:heHE.ExOrousKataskiou.melody
ltx/en_us_dedes/me.m02.d08:meMA.Ode4C2H.mode	@ltx/en_us_dedes/miscellanea:misc.Mode8
ltx/en_us_dedes/me.m02.d08:meMA.Ode4C2H.ode	@ltx/en_us_dedes/miscellanea:misc.Ode4
ltx/en_us_dedes/me.m02.d08:meMA.Ode4C2H.text	@ltx/en_us_dedes/he.h.m8:heHE.ExOrousKataskiou.text
ltx/en_us_dedes/me.m02.d08:meMA.Ode4C2T.incipit	…
ltx/en_us_dedes/me.m02.d08:meMA.Ode4C2T.melody	@ltx/en_us_dedes/he.h.m8:heHE.ExOrousKataskiou.name
ltx/en_us_dedes/me.m02.d08:meMA.Ode4C2T.mode	@ltx/en_us_dedes/miscellanea:misc.Mode8
ltx/en_us_dedes/me.m02.d08:meMA.Ode4C2T.ode	@ltx/en_us_dedes/miscellanea:misc.Ode4
ltx/en_us_dedes/me.m02.d08:meMA.Ode4C2T.text	
ltx/en_us_dedes/me.m02.d08:meMA.Ode5C11.greekmelody	@ltx/en_us_dedes/he.h.m8:heHE.InaTiMeAposo.greekname
ltx/en_us_dedes/me.m02.d08:meMA.Ode5C11.incipit	…
ltx/en_us_dedes/me.m02.d08:meMA.Ode5C11.melody	@ltx/en_us_dedes/he.h.m8:heHE.InaTiMeAposo.name
ltx/en_us_dedes/me.m02.d08:meMA.Ode5C11.mode	@ltx/en_us_dedes/miscellanea:misc.Mode8
ltx/en_us_dedes/me.m02.d08:meMA.Ode5C11.ode	@ltx/en_us_dedes/miscellanea:misc.Ode5
ltx/en_us_dedes/me.m02.d08:meMA.Ode5C11.text	
ltx/en_us_dedes/me.m02.d08:meMA.Ode5C12.incipit	…
ltx/en_us_dedes/me.m02.d08:meMA.Ode5C12.melody	@ltx/en_us_dedes/he.h.m8:heHE.InaTiMeAposo.name
ltx/en_us_dedes/me.m02.d08:meMA.Ode5C12.mode	@ltx/en_us_dedes/miscellanea:misc.Mode8
ltx/en_us_dedes/me.m02.d08:meMA.Ode5C12.ode	@ltx/en_us_dedes/miscellanea:misc.Ode5
ltx/en_us_dedes/me.m02.d08:meMA.Ode5C12.text	
ltx/en_us_dedes/me.m02.d08:meMA.Ode5C13.incipit	…
ltx/en_us_dedes/me.m02.d08:meMA.Ode5C13.melody	@ltx/en_us_dedes/he.h.m8:heHE.InaTiMeAposo.name
ltx/en_us_dedes/me.m02.d08:meMA.Ode5C13.mode	@ltx/en_us_dedes/miscellanea:misc.Mode8
ltx/en_us_dedes/me.m02.d08:meMA.Ode5C13.ode	@ltx/en_us_dedes/miscellanea:misc.Ode5
ltx/en_us_dedes/me.m02.d08:meMA.Ode5C13.text	
ltx/en_us_dedes/me.m02.d08:meMA.Ode5C14.incipit	…
ltx/en_us_dedes/me.m02.d08:meMA.Ode5C14.melody	@ltx/en_us_dedes/he.h.m8:heHE.InaTiMeAposo.name
ltx/en_us_dedes/me.m02.d08:meMA.Ode5C14.mode	@ltx/en_us_dedes/miscellanea:misc.Mode8
ltx/en_us_dedes/me.m02.d08:meMA.Ode5C14.ode	@ltx/en_us_dedes/miscellanea:misc.Ode5
ltx/en_us_dedes/me.m02.d08:meMA.Ode5C14.text	
ltx/en_us_dedes/me.m02.d08:meMA.Ode5C1H.greekmelody	@ltx/en_us_dedes/he.h.m8:heHE.InaTiMeAposo.greekname
ltx/en_us_dedes/me.m02.d08:meMA.Ode5C1H.incipit	@ltx/en_us_dedes/he.h.m8:heHE.InaTiMeAposo.incipit
ltx/en_us_dedes/me.m02.d08:meMA.Ode5C1H.melody	@ltx/en_us_dedes/he.h.m8:heHE.InaTiMeAposo.melody
ltx/en_us_dedes/me.m02.d08:meMA.Ode5C1H.mode	@ltx/en_us_dedes/miscellanea:misc.Mode8
ltx/en_us_dedes/me.m02.d08:meMA.Ode5C1H.ode	@ltx/en_us_dedes/miscellanea:misc.Ode5
ltx/en_us_dedes/me.m02.d08:meMA.Ode5C1H.text	@ltx/en_us_dedes/he.h.m8:heHE.InaTiMeAposo.text
ltx/en_us_dedes/me.m02.d08:meMA.Ode5C1T.incipit	…
ltx/en_us_dedes/me.m02.d08:meMA.Ode5C1T.melody	@ltx/en_us_dedes/he.h.m8:heHE.InaTiMeAposo.name
ltx/en_us_dedes/me.m02.d08:meMA.Ode5C1T.mode	@ltx/en_us_dedes/miscellanea:misc.Mode8
ltx/en_us_dedes/me.m02.d08:meMA.Ode5C1T.ode	@ltx/en_us_dedes/miscellanea:misc.Ode5
ltx/en_us_dedes/me.m02.d08:meMA.Ode5C1T.text	
ltx/en_us_dedes/me.m02.d08:meMA.Ode5C21.greekmelody	@ltx/en_us_dedes/he.h.m8:heHE.OEkNyktosAgnoias.greekname
ltx/en_us_dedes/me.m02.d08:meMA.Ode5C21.incipit	…
ltx/en_us_dedes/me.m02.d08:meMA.Ode5C21.melody	@ltx/en_us_dedes/he.h.m8:heHE.OEkNyktosAgnoias.name
ltx/en_us_dedes/me.m02.d08:meMA.Ode5C21.mode	@ltx/en_us_dedes/miscellanea:misc.Mode8
ltx/en_us_dedes/me.m02.d08:meMA.Ode5C21.ode	@ltx/en_us_dedes/miscellanea:misc.Ode5
ltx/en_us_dedes/me.m02.d08:meMA.Ode5C21.text	
ltx/en_us_dedes/me.m02.d08:meMA.Ode5C22.incipit	…
ltx/en_us_dedes/me.m02.d08:meMA.Ode5C22.melody	@ltx/en_us_dedes/he.h.m8:heHE.OEkNyktosAgnoias.name
ltx/en_us_dedes/me.m02.d08:meMA.Ode5C22.mode	@ltx/en_us_dedes/miscellanea:misc.Mode8
ltx/en_us_dedes/me.m02.d08:meMA.Ode5C22.ode	@ltx/en_us_dedes/miscellanea:misc.Ode5
ltx/en_us_dedes/me.m02.d08:meMA.Ode5C22.text	
ltx/en_us_dedes/me.m02.d08:meMA.Ode5C23.incipit	…
ltx/en_us_dedes/me.m02.d08:meMA.Ode5C23.melody	@ltx/en_us_dedes/he.h.m8:heHE.OEkNyktosAgnoias.name
ltx/en_us_dedes/me.m02.d08:meMA.Ode5C23.mode	@ltx/en_us_dedes/miscellanea:misc.Mode8
ltx/en_us_dedes/me.m02.d08:meMA.Ode5C23.ode	@ltx/en_us_dedes/miscellanea:misc.Ode5
ltx/en_us_dedes/me.m02.d08:meMA.Ode5C23.text	
ltx/en_us_dedes/me.m02.d08:meMA.Ode5C2H.greekmelody	@ltx/en_us_dedes/he.h.m8:heHE.OEkNyktosAgnoias.greekname
ltx/en_us_dedes/me.m02.d08:meMA.Ode5C2H.incipit	@ltx/en_us_dedes/he.h.m8:heHE.OEkNyktosAgnoias.incipit
ltx/en_us_dedes/me.m02.d08:meMA.Ode5C2H.melody	@ltx/en_us_dedes/he.h.m8:heHE.OEkNyktosAgnoias.melody
ltx/en_us_dedes/me.m02.d08:meMA.Ode5C2H.mode	@ltx/en_us_dedes/miscellanea:misc.Mode8
ltx/en_us_dedes/me.m02.d08:meMA.Ode5C2H.ode	@ltx/en_us_dedes/miscellanea:misc.Ode5
ltx/en_us_dedes/me.m02.d08:meMA.Ode5C2H.text	@ltx/en_us_dedes/he.h.m8:heHE.OEkNyktosAgnoias.text
ltx/en_us_dedes/me.m02.d08:meMA.Ode5C2T.incipit	…
ltx/en_us_dedes/me.m02.d08:meMA.Ode5C2T.melody	@ltx/en_us_dedes/he.h.m8:heHE.OEkNyktosAgnoias.name
ltx/en_us_dedes/me.m02.d08:meMA.Ode5C2T.mode	@ltx/en_us_dedes/miscellanea:misc.Mode8
ltx/en_us_dedes/me.m02.d08:meMA.Ode5C2T.ode	@ltx/en_us_dedes/miscellanea:misc.Ode5
ltx/en_us_dedes/me.m02.d08:meMA.Ode5C2T.text	
ltx/en_us_dedes/me.m02.d08:meMA.Ode6C11.greekmelody	@ltx/en_us_dedes/he.h.m8:heHE.IlasthitiMoiSotir.greekname
ltx/en_us_dedes/me.m02.d08:meMA.Ode6C11.incipit	…
ltx/en_us_dedes/me.m02.d08:meMA.Ode6C11.melody	@ltx/en_us_dedes/he.h.m8:heHE.IlasthitiMoiSotir.name
ltx/en_us_dedes/me.m02.d08:meMA.Ode6C11.mode	@ltx/en_us_dedes/miscellanea:misc.Mode8
ltx/en_us_dedes/me.m02.d08:meMA.Ode6C11.ode	@ltx/en_us_dedes/miscellanea:misc.Ode6
ltx/en_us_dedes/me.m02.d08:meMA.Ode6C11.text	
ltx/en_us_dedes/me.m02.d08:meMA.Ode6C12.incipit	…
ltx/en_us_dedes/me.m02.d08:meMA.Ode6C12.melody	@ltx/en_us_dedes/he.h.m8:heHE.IlasthitiMoiSotir.name
ltx/en_us_dedes/me.m02.d08:meMA.Ode6C12.mode	@ltx/en_us_dedes/miscellanea:misc.Mode8
ltx/en_us_dedes/me.m02.d08:meMA.Ode6C12.ode	@ltx/en_us_dedes/miscellanea:misc.Ode6
ltx/en_us_dedes/me.m02.d08:meMA.Ode6C12.text	
ltx/en_us_dedes/me.m02.d08:meMA.Ode6C13.incipit	…
ltx/en_us_dedes/me.m02.d08:meMA.Ode6C13.melody	@ltx/en_us_dedes/he.h.m8:heHE.IlasthitiMoiSotir.name
ltx/en_us_dedes/me.m02.d08:meMA.Ode6C13.mode	@ltx/en_us_dedes/miscellanea:misc.Mode8
ltx/en_us_dedes/me.m02.d08:meMA.Ode6C13.ode	@ltx/en_us_dedes/miscellanea:misc.Ode6
ltx/en_us_dedes/me.m02.d08:meMA.Ode6C13.text	
ltx/en_us_dedes/me.m02.d08:meMA.Ode6C1H.greekmelody	@ltx/en_us_dedes/he.h.m8:heHE.IlasthitiMoiSotir.greekname
ltx/en_us_dedes/me.m02.d08:meMA.Ode6C1H.incipit	@ltx/en_us_dedes/he.h.m8:heHE.IlasthitiMoiSotir.incipit
ltx/en_us_dedes/me.m02.d08:meMA.Ode6C1H.melody	@ltx/en_us_dedes/he.h.m8:heHE.IlasthitiMoiSotir.melody
ltx/en_us_dedes/me.m02.d08:meMA.Ode6C1H.mode	@ltx/en_us_dedes/miscellanea:misc.Mode8
ltx/en_us_dedes/me.m02.d08:meMA.Ode6C1H.ode	@ltx/en_us_dedes/miscellanea:misc.Ode6
ltx/en_us_dedes/me.m02.d08:meMA.Ode6C1H.text	@ltx/en_us_dedes/he.h.m8:heHE.IlasthitiMoiSotir.text
ltx/en_us_dedes/me.m02.d08:meMA.Ode6C1T.incipit	…
ltx/en_us_dedes/me.m02.d08:meMA.Ode6C1T.melody	@ltx/en_us_dedes/he.h.m8:heHE.IlasthitiMoiSotir.name
ltx/en_us_dedes/me.m02.d08:meMA.Ode6C1T.mode	@ltx/en_us_dedes/miscellanea:misc.Mode8
ltx/en_us_dedes/me.m02.d08:meMA.Ode6C1T.ode	@ltx/en_us_dedes/miscellanea:misc.Ode6
ltx/en_us_dedes/me.m02.d08:meMA.Ode6C1T.text	
ltx/en_us_dedes/me.m02.d08:meMA.Ode6C21.greekmelody	@ltx/en_us_dedes/he.h.m8:heHE.TinDeisinEkcheo.greekname
ltx/en_us_dedes/me.m02.d08:meMA.Ode6C21.incipit	…
ltx/en_us_dedes/me.m02.d08:meMA.Ode6C21.melody	@ltx/en_us_dedes/he.h.m8:heHE.TinDeisinEkcheo.name
ltx/en_us_dedes/me.m02.d08:meMA.Ode6C21.mode	@ltx/en_us_dedes/miscellanea:misc.Mode8
ltx/en_us_dedes/me.m02.d08:meMA.Ode6C21.ode	@ltx/en_us_dedes/miscellanea:misc.Ode6
ltx/en_us_dedes/me.m02.d08:meMA.Ode6C21.text	
ltx/en_us_dedes/me.m02.d08:meMA.Ode6C22.incipit	…
ltx/en_us_dedes/me.m02.d08:meMA.Ode6C22.melody	@ltx/en_us_dedes/he.h.m8:heHE.TinDeisinEkcheo.name
ltx/en_us_dedes/me.m02.d08:meMA.Ode6C22.mode	@ltx/en_us_dedes/miscellanea:misc.Mode8
ltx/en_us_dedes/me.m02.d08:meMA.Ode6C22.ode	@ltx/en_us_dedes/miscellanea:misc.Ode6
ltx/en_us_dedes/me.m02.d08:meMA.Ode6C22.text	
ltx/en_us_dedes/me.m02.d08:meMA.Ode6C23.incipit	…
ltx/en_us_dedes/me.m02.d08:meMA.Ode6C23.melody	@ltx/en_us_dedes/he.h.m8:heHE.TinDeisinEkcheo.name
ltx/en_us_dedes/me.m02.d08:meMA.Ode6C23.mode	@ltx/en_us_dedes/miscellanea:misc.Mode8
ltx/en_us_dedes/me.m02.d08:meMA.Ode6C23.ode	@ltx/en_us_dedes/miscellanea:misc.Ode6
ltx/en_us_dedes/me.m02.d08:meMA.Ode6C23.text	
ltx/en_us_dedes/me.m02.d08:meMA.Ode6C2H.greekmelody	@ltx/en_us_dedes/he.h.m8:heHE.TinDeisinEkcheo.greekname
ltx/en_us_dedes/me.m02.d08:meMA.Ode6C2H.incipit	@ltx/en_us_dedes/he.h.m8:heHE.TinDeisinEkcheo.incipit
ltx/en_us_dedes/me.m02.d08:meMA.Ode6C2H.melody	@ltx/en_us_dedes/he.h.m8:heHE.TinDeisinEkcheo.melody
ltx/en_us_dedes/me.m02.d08:meMA.Ode6C2H.mode	@ltx/en_us_dedes/miscellanea:misc.Mode8
ltx/en_us_dedes/me.m02.d08:meMA.Ode6C2H.ode	@ltx/en_us_dedes/miscellanea:misc.Ode6
ltx/en_us_dedes/me.m02.d08:meMA.Ode6C2H.text	@ltx/en_us_dedes/he.h.m8:heHE.TinDeisinEkcheo.text
ltx/en_us_dedes/me.m02.d08:meMA.Ode6C2T.incipit	…
ltx/en_us_dedes/me.m02.d08:meMA.Ode6C2T.melody	@ltx/en_us_dedes/he.h.m8:heHE.TinDeisinEkcheo.name
ltx/en_us_dedes/me.m02.d08:meMA.Ode6C2T.mode	@ltx/en_us_dedes/miscellanea:misc.Mode8
ltx/en_us_dedes/me.m02.d08:meMA.Ode6C2T.ode	@ltx/en_us_dedes/miscellanea:misc.Ode6
ltx/en_us_dedes/me.m02.d08:meMA.Ode6C2T.text	
ltx/en_us_dedes/me.m02.d08:meMA.Ode7C11.greekmelody	@ltx/en_us_dedes/he.h.m8:heHE.TheouSynkatavasin.greekname
ltx/en_us_dedes/me.m02.d08:meMA.Ode7C11.incipit	…
ltx/en_us_dedes/me.m02.d08:meMA.Ode7C11.melody	@ltx/en_us_dedes/he.h.m8:heHE.TheouSynkatavasin.name
ltx/en_us_dedes/me.m02.d08:meMA.Ode7C11.mode	@ltx/en_us_dedes/miscellanea:misc.Mode8
ltx/en_us_dedes/me.m02.d08:meMA.Ode7C11.ode	@ltx/en_us_dedes/miscellanea:misc.Ode7
ltx/en_us_dedes/me.m02.d08:meMA.Ode7C11.text	
ltx/en_us_dedes/me.m02.d08:meMA.Ode7C12.incipit	…
ltx/en_us_dedes/me.m02.d08:meMA.Ode7C12.melody	@ltx/en_us_dedes/he.h.m8:heHE.TheouSynkatavasin.name
ltx/en_us_dedes/me.m02.d08:meMA.Ode7C12.mode	@ltx/en_us_dedes/miscellanea:misc.Mode8
ltx/en_us_dedes/me.m02.d08:meMA.Ode7C12.ode	@ltx/en_us_dedes/miscellanea:misc.Ode7
ltx/en_us_dedes/me.m02.d08:meMA.Ode7C12.text	
ltx/en_us_dedes/me.m02.d08:meMA.Ode7C13.incipit	…
ltx/en_us_dedes/me.m02.d08:meMA.Ode7C13.melody	@ltx/en_us_dedes/he.h.m8:heHE.TheouSynkatavasin.name
ltx/en_us_dedes/me.m02.d08:meMA.Ode7C13.mode	@ltx/en_us_dedes/miscellanea:misc.Mode8
ltx/en_us_dedes/me.m02.d08:meMA.Ode7C13.ode	@ltx/en_us_dedes/miscellanea:misc.Ode7
ltx/en_us_dedes/me.m02.d08:meMA.Ode7C13.text	
ltx/en_us_dedes/me.m02.d08:meMA.Ode7C1H.greekmelody	@ltx/en_us_dedes/he.h.m8:heHE.TheouSynkatavasin.greekname
ltx/en_us_dedes/me.m02.d08:meMA.Ode7C1H.incipit	@ltx/en_us_dedes/he.h.m8:heHE.TheouSynkatavasin.incipit
ltx/en_us_dedes/me.m02.d08:meMA.Ode7C1H.melody	@ltx/en_us_dedes/he.h.m8:heHE.TheouSynkatavasin.melody
ltx/en_us_dedes/me.m02.d08:meMA.Ode7C1H.mode	@ltx/en_us_dedes/miscellanea:misc.Mode8
ltx/en_us_dedes/me.m02.d08:meMA.Ode7C1H.ode	@ltx/en_us_dedes/miscellanea:misc.Ode7
ltx/en_us_dedes/me.m02.d08:meMA.Ode7C1H.text	@ltx/en_us_dedes/he.h.m8:heHE.TheouSynkatavasin.text
ltx/en_us_dedes/me.m02.d08:meMA.Ode7C1T.incipit	…
ltx/en_us_dedes/me.m02.d08:meMA.Ode7C1T.melody	@ltx/en_us_dedes/he.h.m8:heHE.TheouSynkatavasin.name
ltx/en_us_dedes/me.m02.d08:meMA.Ode7C1T.mode	@ltx/en_us_dedes/miscellanea:misc.Mode8
ltx/en_us_dedes/me.m02.d08:meMA.Ode7C1T.ode	@ltx/en_us_dedes/miscellanea:misc.Ode7
ltx/en_us_dedes/me.m02.d08:meMA.Ode7C1T.text	
ltx/en_us_dedes/me.m02.d08:meMA.Ode7C21.greekmelody	@ltx/en_us_dedes/he.h.m8:heHE.PaidesEvraion.greekname
ltx/en_us_dedes/me.m02.d08:meMA.Ode7C21.incipit	…
ltx/en_us_dedes/me.m02.d08:meMA.Ode7C21.melody	@ltx/en_us_dedes/he.h.m8:heHE.PaidesEvraion.name
ltx/en_us_dedes/me.m02.d08:meMA.Ode7C21.mode	@ltx/en_us_dedes/miscellanea:misc.Mode8
ltx/en_us_dedes/me.m02.d08:meMA.Ode7C21.ode	@ltx/en_us_dedes/miscellanea:misc.Ode7
ltx/en_us_dedes/me.m02.d08:meMA.Ode7C21.text	
ltx/en_us_dedes/me.m02.d08:meMA.Ode7C22.incipit	…
ltx/en_us_dedes/me.m02.d08:meMA.Ode7C22.melody	@ltx/en_us_dedes/he.h.m8:heHE.PaidesEvraion.name
ltx/en_us_dedes/me.m02.d08:meMA.Ode7C22.mode	@ltx/en_us_dedes/miscellanea:misc.Mode8
ltx/en_us_dedes/me.m02.d08:meMA.Ode7C22.ode	@ltx/en_us_dedes/miscellanea:misc.Ode7
ltx/en_us_dedes/me.m02.d08:meMA.Ode7C22.text	
ltx/en_us_dedes/me.m02.d08:meMA.Ode7C2H.greekmelody	@ltx/en_us_dedes/he.h.m8:heHE.PaidesEvraion.greekname
ltx/en_us_dedes/me.m02.d08:meMA.Ode7C2H.incipit	@ltx/en_us_dedes/he.h.m8:heHE.PaidesEvraion.incipit
ltx/en_us_dedes/me.m02.d08:meMA.Ode7C2H.melody	@ltx/en_us_dedes/he.h.m8:heHE.PaidesEvraion.melody
ltx/en_us_dedes/me.m02.d08:meMA.Ode7C2H.mode	@ltx/en_us_dedes/miscellanea:misc.Mode8
ltx/en_us_dedes/me.m02.d08:meMA.Ode7C2H.ode	@ltx/en_us_dedes/miscellanea:misc.Ode7
ltx/en_us_dedes/me.m02.d08:meMA.Ode7C2H.text	@ltx/en_us_dedes/he.h.m8:heHE.PaidesEvraion.text
ltx/en_us_dedes/me.m02.d08:meMA.Ode7C2T.incipit	…
ltx/en_us_dedes/me.m02.d08:meMA.Ode7C2T.melody	@ltx/en_us_dedes/he.h.m8:heHE.PaidesEvraion.name
ltx/en_us_dedes/me.m02.d08:meMA.Ode7C2T.mode	@ltx/en_us_dedes/miscellanea:misc.Mode8
ltx/en_us_dedes/me.m02.d08:meMA.Ode7C2T.ode	@ltx/en_us_dedes/miscellanea:misc.Ode7
ltx/en_us_dedes/me.m02.d08:meMA.Ode7C2T.text	
ltx/en_us_dedes/me.m02.d08:meMA.Ode8C11.greekmelody	@ltx/en_us_dedes/he.h.m8:heHE.EptaplasiosKaminon.greekname
ltx/en_us_dedes/me.m02.d08:meMA.Ode8C11.incipit	…
ltx/en_us_dedes/me.m02.d08:meMA.Ode8C11.melody	@ltx/en_us_dedes/he.h.m8:heHE.EptaplasiosKaminon.name
ltx/en_us_dedes/me.m02.d08:meMA.Ode8C11.mode	@ltx/en_us_dedes/miscellanea:misc.Mode8
ltx/en_us_dedes/me.m02.d08:meMA.Ode8C11.ode	@ltx/en_us_dedes/miscellanea:misc.Ode8
ltx/en_us_dedes/me.m02.d08:meMA.Ode8C11.text	
ltx/en_us_dedes/me.m02.d08:meMA.Ode8C12.incipit	…
ltx/en_us_dedes/me.m02.d08:meMA.Ode8C12.melody	@ltx/en_us_dedes/he.h.m8:heHE.EptaplasiosKaminon.name
ltx/en_us_dedes/me.m02.d08:meMA.Ode8C12.mode	@ltx/en_us_dedes/miscellanea:misc.Mode8
ltx/en_us_dedes/me.m02.d08:meMA.Ode8C12.ode	@ltx/en_us_dedes/miscellanea:misc.Ode8
ltx/en_us_dedes/me.m02.d08:meMA.Ode8C12.text	
ltx/en_us_dedes/me.m02.d08:meMA.Ode8C13.incipit	…
ltx/en_us_dedes/me.m02.d08:meMA.Ode8C13.melody	@ltx/en_us_dedes/he.h.m8:heHE.EptaplasiosKaminon.name
ltx/en_us_dedes/me.m02.d08:meMA.Ode8C13.mode	@ltx/en_us_dedes/miscellanea:misc.Mode8
ltx/en_us_dedes/me.m02.d08:meMA.Ode8C13.ode	@ltx/en_us_dedes/miscellanea:misc.Ode8
ltx/en_us_dedes/me.m02.d08:meMA.Ode8C13.text	
ltx/en_us_dedes/me.m02.d08:meMA.Ode8C1H.greekmelody	@ltx/en_us_dedes/he.h.m8:heHE.EptaplasiosKaminon.greekname
ltx/en_us_dedes/me.m02.d08:meMA.Ode8C1H.incipit	@ltx/en_us_dedes/he.h.m8:heHE.EptaplasiosKaminon.incipit
ltx/en_us_dedes/me.m02.d08:meMA.Ode8C1H.melody	@ltx/en_us_dedes/he.h.m8:heHE.EptaplasiosKaminon.melody
ltx/en_us_dedes/me.m02.d08:meMA.Ode8C1H.mode	@ltx/en_us_dedes/miscellanea:misc.Mode8
ltx/en_us_dedes/me.m02.d08:meMA.Ode8C1H.ode	@ltx/en_us_dedes/miscellanea:misc.Ode8
ltx/en_us_dedes/me.m02.d08:meMA.Ode8C1H.text	@ltx/en_us_dedes/he.h.m8:heHE.EptaplasiosKaminon.text
ltx/en_us_dedes/me.m02.d08:meMA.Ode8C1T.incipit	…
ltx/en_us_dedes/me.m02.d08:meMA.Ode8C1T.melody	@ltx/en_us_dedes/he.h.m8:heHE.EptaplasiosKaminon.name
ltx/en_us_dedes/me.m02.d08:meMA.Ode8C1T.mode	@ltx/en_us_dedes/miscellanea:misc.Mode8
ltx/en_us_dedes/me.m02.d08:meMA.Ode8C1T.ode	@ltx/en_us_dedes/miscellanea:misc.Ode8
ltx/en_us_dedes/me.m02.d08:meMA.Ode8C1T.text	
ltx/en_us_dedes/me.m02.d08:meMA.Ode8C21.greekmelody	@ltx/en_us_dedes/he.h.m8:heHE.TonEnOreiAgio.greekname
ltx/en_us_dedes/me.m02.d08:meMA.Ode8C21.incipit	…
ltx/en_us_dedes/me.m02.d08:meMA.Ode8C21.melody	@ltx/en_us_dedes/he.h.m8:heHE.TonEnOreiAgio.name
ltx/en_us_dedes/me.m02.d08:meMA.Ode8C21.mode	@ltx/en_us_dedes/miscellanea:misc.Mode8
ltx/en_us_dedes/me.m02.d08:meMA.Ode8C21.ode	@ltx/en_us_dedes/miscellanea:misc.Ode8
ltx/en_us_dedes/me.m02.d08:meMA.Ode8C21.text	
ltx/en_us_dedes/me.m02.d08:meMA.Ode8C22.incipit	…
ltx/en_us_dedes/me.m02.d08:meMA.Ode8C22.melody	@ltx/en_us_dedes/he.h.m8:heHE.TonEnOreiAgio.name
ltx/en_us_dedes/me.m02.d08:meMA.Ode8C22.mode	@ltx/en_us_dedes/miscellanea:misc.Mode8
ltx/en_us_dedes/me.m02.d08:meMA.Ode8C22.ode	@ltx/en_us_dedes/miscellanea:misc.Ode8
ltx/en_us_dedes/me.m02.d08:meMA.Ode8C22.text	
ltx/en_us_dedes/me.m02.d08:meMA.Ode8C23.incipit	…
ltx/en_us_dedes/me.m02.d08:meMA.Ode8C23.melody	@ltx/en_us_dedes/he.h.m8:heHE.TonEnOreiAgio.name
ltx/en_us_dedes/me.m02.d08:meMA.Ode8C23.mode	@ltx/en_us_dedes/miscellanea:misc.Mode8
ltx/en_us_dedes/me.m02.d08:meMA.Ode8C23.ode	@ltx/en_us_dedes/miscellanea:misc.Ode8
ltx/en_us_dedes/me.m02.d08:meMA.Ode8C23.text	
ltx/en_us_dedes/me.m02.d08:meMA.Ode8C2H.greekmelody	@ltx/en_us_dedes/he.h.m8:heHE.TonEnOreiAgio.greekname
ltx/en_us_dedes/me.m02.d08:meMA.Ode8C2H.incipit	@ltx/en_us_dedes/he.h.m8:heHE.TonEnOreiAgio.incipit
ltx/en_us_dedes/me.m02.d08:meMA.Ode8C2H.melody	@ltx/en_us_dedes/he.h.m8:heHE.TonEnOreiAgio.melody
ltx/en_us_dedes/me.m02.d08:meMA.Ode8C2H.mode	@ltx/en_us_dedes/miscellanea:misc.Mode8
ltx/en_us_dedes/me.m02.d08:meMA.Ode8C2H.ode	@ltx/en_us_dedes/miscellanea:misc.Ode8
ltx/en_us_dedes/me.m02.d08:meMA.Ode8C2H.text	@ltx/en_us_dedes/he.h.m8:heHE.TonEnOreiAgio.text
ltx/en_us_dedes/me.m02.d08:meMA.Ode8C2T.incipit	…
ltx/en_us_dedes/me.m02.d08:meMA.Ode8C2T.melody	@ltx/en_us_dedes/he.h.m8:heHE.TonEnOreiAgio.name
ltx/en_us_dedes/me.m02.d08:meMA.Ode8C2T.mode	@ltx/en_us_dedes/miscellanea:misc.Mode8
ltx/en_us_dedes/me.m02.d08:meMA.Ode8C2T.ode	@ltx/en_us_dedes/miscellanea:misc.Ode8
ltx/en_us_dedes/me.m02.d08:meMA.Ode8C2T.text	
ltx/en_us_dedes/me.m02.d08:meMA.Ode9C11.greekmelody	@ltx/en_us_dedes/he.h.m8:heHE.ExestiEpiTouto.greekname
ltx/en_us_dedes/me.m02.d08:meMA.Ode9C11.incipit	…
ltx/en_us_dedes/me.m02.d08:meMA.Ode9C11.melody	@ltx/en_us_dedes/he.h.m8:heHE.ExestiEpiTouto.name
ltx/en_us_dedes/me.m02.d08:meMA.Ode9C11.mode	@ltx/en_us_dedes/miscellanea:misc.Mode8
ltx/en_us_dedes/me.m02.d08:meMA.Ode9C11.ode	@ltx/en_us_dedes/miscellanea:misc.Ode9
ltx/en_us_dedes/me.m02.d08:meMA.Ode9C11.text	
ltx/en_us_dedes/me.m02.d08:meMA.Ode9C12.incipit	…
ltx/en_us_dedes/me.m02.d08:meMA.Ode9C12.melody	@ltx/en_us_dedes/he.h.m8:heHE.ExestiEpiTouto.name
ltx/en_us_dedes/me.m02.d08:meMA.Ode9C12.mode	@ltx/en_us_dedes/miscellanea:misc.Mode8
ltx/en_us_dedes/me.m02.d08:meMA.Ode9C12.ode	@ltx/en_us_dedes/miscellanea:misc.Ode9
ltx/en_us_dedes/me.m02.d08:meMA.Ode9C12.text	
ltx/en_us_dedes/me.m02.d08:meMA.Ode9C13.incipit	…
ltx/en_us_dedes/me.m02.d08:meMA.Ode9C13.melody	@ltx/en_us_dedes/he.h.m8:heHE.ExestiEpiTouto.name
ltx/en_us_dedes/me.m02.d08:meMA.Ode9C13.mode	@ltx/en_us_dedes/miscellanea:misc.Mode8
ltx/en_us_dedes/me.m02.d08:meMA.Ode9C13.ode	@ltx/en_us_dedes/miscellanea:misc.Ode9
ltx/en_us_dedes/me.m02.d08:meMA.Ode9C13.text	
ltx/en_us_dedes/me.m02.d08:meMA.Ode9C1H.greekmelody	@ltx/en_us_dedes/he.h.m8:heHE.ExestiEpiTouto.greekname
ltx/en_us_dedes/me.m02.d08:meMA.Ode9C1H.incipit	@ltx/en_us_dedes/he.h.m8:heHE.ExestiEpiTouto.incipit
ltx/en_us_dedes/me.m02.d08:meMA.Ode9C1H.melody	@ltx/en_us_dedes/he.h.m8:heHE.ExestiEpiTouto.melody
ltx/en_us_dedes/me.m02.d08:meMA.Ode9C1H.mode	@ltx/en_us_dedes/miscellanea:misc.Mode8
ltx/en_us_dedes/me.m02.d08:meMA.Ode9C1H.ode	@ltx/en_us_dedes/miscellanea:misc.Ode9
ltx/en_us_dedes/me.m02.d08:meMA.Ode9C1H.text	@ltx/en_us_dedes/he.h.m8:heHE.ExestiEpiTouto.text
ltx/en_us_dedes/me.m02.d08:meMA.Ode9C1T.incipit	…
ltx/en_us_dedes/me.m02.d08:meMA.Ode9C1T.melody	@ltx/en_us_dedes/he.h.m8:heHE.ExestiEpiTouto.name
ltx/en_us_dedes/me.m02.d08:meMA.Ode9C1T.mode	@ltx/en_us_dedes/miscellanea:misc.Mode8
ltx/en_us_dedes/me.m02.d08:meMA.Ode9C1T.ode	@ltx/en_us_dedes/miscellanea:misc.Ode9
ltx/en_us_dedes/me.m02.d08:meMA.Ode9C1T.text	
ltx/en_us_dedes/me.m02.d08:meMA.Ode9C21.greekmelody	@ltx/en_us_dedes/he.h.m8:heHE.SeTinApeirogamon.greekname
ltx/en_us_dedes/me.m02.d08:meMA.Ode9C21.incipit	…
ltx/en_us_dedes/me.m02.d08:meMA.Ode9C21.melody	@ltx/en_us_dedes/he.h.m8:heHE.SeTinApeirogamon.name
ltx/en_us_dedes/me.m02.d08:meMA.Ode9C21.mode	@ltx/en_us_dedes/miscellanea:misc.Mode8
ltx/en_us_dedes/me.m02.d08:meMA.Ode9C21.ode	@ltx/en_us_dedes/miscellanea:misc.Ode9
ltx/en_us_dedes/me.m02.d08:meMA.Ode9C21.text	
ltx/en_us_dedes/me.m02.d08:meMA.Ode9C22.incipit	…
ltx/en_us_dedes/me.m02.d08:meMA.Ode9C22.melody	@ltx/en_us_dedes/he.h.m8:heHE.SeTinApeirogamon.name
ltx/en_us_dedes/me.m02.d08:meMA.Ode9C22.mode	@ltx/en_us_dedes/miscellanea:misc.Mode8
ltx/en_us_dedes/me.m02.d08:meMA.Ode9C22.ode	@ltx/en_us_dedes/miscellanea:misc.Ode9
ltx/en_us_dedes/me.m02.d08:meMA.Ode9C22.text	
ltx/en_us_dedes/me.m02.d08:meMA.Ode9C23.incipit	…
ltx/en_us_dedes/me.m02.d08:meMA.Ode9C23.melody	@ltx/en_us_dedes/he.h.m8:heHE.SeTinApeirogamon.name
ltx/en_us_dedes/me.m02.d08:meMA.Ode9C23.mode	@ltx/en_us_dedes/miscellanea:misc.Mode8
ltx/en_us_dedes/me.m02.d08:meMA.Ode9C23.ode	@ltx/en_us_dedes/miscellanea:misc.Ode9
ltx/en_us_dedes/me.m02.d08:meMA.Ode9C23.text	
ltx/en_us_dedes/me.m02.d08:meMA.Ode9C2H.greekmelody	@ltx/en_us_dedes/he.h.m8:heHE.SeTinApeirogamon.greekname
ltx/en_us_dedes/me.m02.d08:meMA.Ode9C2H.incipit	@ltx/en_us_dedes/he.h.m8:heHE.SeTinApeirogamon.incipit
ltx/en_us_dedes/me.m02.d08:meMA.Ode9C2H.melody	@ltx/en_us_dedes/he.h.m8:heHE.SeTinApeirogamon.melody
ltx/en_us_dedes/me.m02.d08:meMA.Ode9C2H.mode	@ltx/en_us_dedes/miscellanea:misc.Mode8
ltx/en_us_dedes/me.m02.d08:meMA.Ode9C2H.ode	@ltx/en_us_dedes/miscellanea:misc.Ode9
ltx/en_us_dedes/me.m02.d08:meMA.Ode9C2H.text	@ltx/en_us_dedes/he.h.m8:heHE.SeTinApeirogamon.text
ltx/en_us_dedes/me.m02.d08:meMA.Ode9C2T.incipit	…
ltx/en_us_dedes/me.m02.d08:meMA.Ode9C2T.melody	@ltx/en_us_dedes/he.h.m8:heHE.SeTinApeirogamon.name
ltx/en_us_dedes/me.m02.d08:meMA.Ode9C2T.mode	@ltx/en_us_dedes/miscellanea:misc.Mode8
ltx/en_us_dedes/me.m02.d08:meMA.Ode9C2T.ode	@ltx/en_us_dedes/miscellanea:misc.Ode9
ltx/en_us_dedes/me.m02.d08:meMA.Ode9C2T.text	
ltx/en_us_dedes/me.m02.d08:meMA.Oikos1.text	Theodore, the splendid jewel of martyr athletes, is honored today. Come, O believers, and let us crown him with our hymns of praise. As his name means gift of God, so he was a great gift from God to the world, beaming with miracles. Since he defeated the enemy Belial by his venerable contests, now instead of blood he gushes a torrent of cures and healings. In all these things he rejoices in Christ, and he gives never-ending peace. Therefore we cry out to him: “Never cease interceding for the sake of us all.”
ltx/en_us_dedes/me.m02.d08:meVE.Apolytikion1.greekmelody	@ltx/en_us_dedes/he.a.m4:heAU.OYpsotheisEnToStavro.greekname
ltx/en_us_dedes/me.m02.d08:meVE.Apolytikion1.incipit	O medal-winner, you were duly…
ltx/en_us_dedes/me.m02.d08:meVE.Apolytikion1.melody	@ltx/en_us_dedes/he.a.m4:heAU.OYpsotheisEnToStavro.name
ltx/en_us_dedes/me.m02.d08:meVE.Apolytikion1.mode	@ltx/en_us_dedes/miscellanea:misc.Mode4
ltx/en_us_dedes/me.m02.d08:meVE.Apolytikion1.text	O medal-winner, you were duly enlisted * and highly decorated as a commander, * O Theodore, in service to the heavenly King. * Armed with faith, you prudently went to war and combated, * and you vanquished utterly the arrays of the demons. * O Martyr Athlete, evermore with faith * we count you blessed, for you were victorious.
ltx/en_us_dedes/me.m02.d08:meVE.Apolytikion2ger.greekmelody	@ltx/en_us_dedes/he.a.m4:heAU.TachyProkatalave.greekname
ltx/en_us_dedes/me.m02.d08:meVE.Apolytikion2ger.incipit	…
ltx/en_us_dedes/me.m02.d08:meVE.Apolytikion2ger.melody	@ltx/en_us_dedes/he.a.m4:heAU.TachyProkatalave.name
ltx/en_us_dedes/me.m02.d08:meVE.Apolytikion2ger.mode	@ltx/en_us_dedes/miscellanea:misc.Mode4
ltx/en_us_dedes/me.m02.d08:meVE.Apolytikion2ger.poet	@ltx/en_us_dedes/poets:po.Gerasimou
ltx/en_us_dedes/me.m02.d08:meVE.Apolytikion2ger.text	
ltx/en_us_dedes/me.m02.d08:meVE.AposBoth.incipit	@ltx/en_us_dedes/me.m02.d02:meVE.AposGlory.incipit
ltx/en_us_dedes/me.m02.d08:meVE.AposBoth.melody	
ltx/en_us_dedes/me.m02.d08:meVE.AposBoth.mode	@ltx/en_us_dedes/miscellanea:misc.Mode8
ltx/en_us_dedes/me.m02.d08:meVE.AposBoth.poet	@ltx/en_us_dedes/poets:po.AndreouKritis
ltx/en_us_dedes/me.m02.d08:meVE.AposBoth.text	@ltx/en_us_dedes/me.m02.d02:meVE.AposGlory.text
ltx/en_us_dedes/me.m02.d08:meVE.AposGlory.incipit	…
ltx/en_us_dedes/me.m02.d08:meVE.AposGlory.melody	
ltx/en_us_dedes/me.m02.d08:meVE.AposGlory.mode	@ltx/en_us_dedes/miscellanea:misc.Mode8
ltx/en_us_dedes/me.m02.d08:meVE.AposGlory.text	
ltx/en_us_dedes/me.m02.d08:meVE.Aposticha1.greekmelody	@ltx/en_us_dedes/he.a.m6:heAU.TriimerosAnestis.greekname
ltx/en_us_dedes/me.m02.d08:meVE.Aposticha1.incipit	@ltx/en_us_dedes/me.m02.d03:meMA.Aposticha1.incipit
ltx/en_us_dedes/me.m02.d08:meVE.Aposticha1.melody	@ltx/en_us_dedes/he.a.m6:heAU.TriimerosAnestis.name
ltx/en_us_dedes/me.m02.d08:meVE.Aposticha1.mode	@ltx/en_us_dedes/miscellanea:misc.Mode5
ltx/en_us_dedes/me.m02.d08:meVE.Aposticha1.text	@ltx/en_us_dedes/me.m02.d03:meMA.Aposticha1.text
ltx/en_us_dedes/me.m02.d08:meVE.Aposticha2.incipit	@ltx/en_us_dedes/me.m02.d03:meMA.Aposticha2.incipit
ltx/en_us_dedes/me.m02.d08:meVE.Aposticha2.melody	@ltx/en_us_dedes/he.a.m6:heAU.TriimerosAnestis.name
ltx/en_us_dedes/me.m02.d08:meVE.Aposticha2.mode	@ltx/en_us_dedes/miscellanea:misc.Mode5
ltx/en_us_dedes/me.m02.d08:meVE.Aposticha2.text	@ltx/en_us_dedes/me.m02.d03:meMA.Aposticha2.text
ltx/en_us_dedes/me.m02.d08:meVE.Aposticha3.incipit	@ltx/en_us_dedes/me.m02.d03:meMA.Aposticha3.incipit
ltx/en_us_dedes/me.m02.d08:meVE.Aposticha3.melody	@ltx/en_us_dedes/he.a.m6:heAU.TriimerosAnestis.name
ltx/en_us_dedes/me.m02.d08:meVE.Aposticha3.mode	@ltx/en_us_dedes/miscellanea:misc.Mode5
ltx/en_us_dedes/me.m02.d08:meVE.Aposticha3.text	@ltx/en_us_dedes/me.m02.d03:meMA.Aposticha3.text
ltx/en_us_dedes/me.m02.d08:meVE.SticBoth.incipit	@ltx/en_us_dedes/me.m02.d02:meVE.LityBoth.incipit
ltx/en_us_dedes/me.m02.d08:meVE.SticBoth.melody	
ltx/en_us_dedes/me.m02.d08:meVE.SticBoth.mode	@ltx/en_us_dedes/miscellanea:misc.Mode5
ltx/en_us_dedes/me.m02.d08:meVE.SticBoth.poet	@ltx/en_us_dedes/poets:po.GermanouOiDeAnatoliou
ltx/en_us_dedes/me.m02.d08:meVE.SticBoth.text	@ltx/en_us_dedes/me.m02.d02:meVE.LityBoth.text
ltx/en_us_dedes/me.m02.d08:meVE.SticGlory.incipit	The solemn memory of the…
ltx/en_us_dedes/me.m02.d08:meVE.SticGlory.melody	
ltx/en_us_dedes/me.m02.d08:meVE.SticGlory.mode	@ltx/en_us_dedes/miscellanea:misc.Mode5
ltx/en_us_dedes/me.m02.d08:meVE.SticGlory.text	The solemn memory of the medaled Martyr of Christ has risen today, brighter than the Morning Star. It breaks forth and illumines the hearts of the believers, by the action and grace of the Spirit, as it drives away the clouds that darken souls. Come, O fans of the Martyrs, let us salute him and say, “Rejoice, O blessed Theodore! In accordance with your name, you are a gift of God’s grace to the faithful, and you share your many miracles with those who come to you. Never cease to intercede with Christ, that we who faithfully celebrate your most solemn memory may obtain the eternal blessings.”
ltx/en_us_dedes/me.m02.d08:meVE.SticStavrotheotokion.incipit	…
ltx/en_us_dedes/me.m02.d08:meVE.SticStavrotheotokion.melody	
ltx/en_us_dedes/me.m02.d08:meVE.SticStavrotheotokion.mode	@ltx/en_us_dedes/miscellanea:misc.Mode5
ltx/en_us_dedes/me.m02.d08:meVE.SticStavrotheotokion.text	
ltx/en_us_dedes/me.m02.d08:meVE.SticStavrotheotokion2.greekmelody	@ltx/en_us_dedes/he.a.m8:heAU.TiYmasKalesomen.greekname
ltx/en_us_dedes/me.m02.d08:meVE.SticStavrotheotokion2.incipit	…
ltx/en_us_dedes/me.m02.d08:meVE.SticStavrotheotokion2.melody	@ltx/en_us_dedes/he.a.m8:heAU.TiYmasKalesomen.name
ltx/en_us_dedes/me.m02.d08:meVE.SticStavrotheotokion2.mode	@ltx/en_us_dedes/miscellanea:misc.Mode8
ltx/en_us_dedes/me.m02.d08:meVE.SticStavrotheotokion2.text	
ltx/en_us_dedes/me.m02.d08:meVE.SticTheotokion.incipit	@ltx/en_us_dedes/oc.m5.d3:ocVE.AposTheotokion.incipit
ltx/en_us_dedes/me.m02.d08:meVE.SticTheotokion.melody	
ltx/en_us_dedes/me.m02.d08:meVE.SticTheotokion.mode	@ltx/en_us_dedes/miscellanea:misc.Mode5
ltx/en_us_dedes/me.m02.d08:meVE.SticTheotokion.text	@ltx/en_us_dedes/oc.m5.d3:ocVE.AposTheotokion.text
ltx/en_us_dedes/me.m02.d08:meVE.SticTheotokion2.greekmelody	@ltx/en_us_dedes/he.a.m8:heAU.TiYmasKalesomen.greekname
ltx/en_us_dedes/me.m02.d08:meVE.SticTheotokion2.incipit	…
ltx/en_us_dedes/me.m02.d08:meVE.SticTheotokion2.melody	@ltx/en_us_dedes/he.a.m8:heAU.TiYmasKalesomen.name
ltx/en_us_dedes/me.m02.d08:meVE.SticTheotokion2.mode	@ltx/en_us_dedes/miscellanea:misc.Mode8
ltx/en_us_dedes/me.m02.d08:meVE.SticTheotokion2.text	
ltx/en_us_dedes/me.m02.d08:meVE.Stichera01.greekmelody	@ltx/en_us_dedes/he.a.m5:heAU.ChairoisAskitikon.greekname
ltx/en_us_dedes/me.m02.d08:meVE.Stichera01.incipit	Rejoice, O holy soldier of…
ltx/en_us_dedes/me.m02.d08:meVE.Stichera01.melody	@ltx/en_us_dedes/he.a.m5:heAU.ChairoisAskitikon.name
ltx/en_us_dedes/me.m02.d08:meVE.Stichera01.mode	@ltx/en_us_dedes/miscellanea:misc.Mode5
ltx/en_us_dedes/me.m02.d08:meVE.Stichera01.text	Rejoice, O holy soldier of Christ! * You roundly routed the front line of the enemy, * the true faith being your armor, supporting those who believe. * With the many tortures that you underwent, * you purchased the heavenly kingdom of God, O St. Theodore. * As you rejoice there, having truly been deified * by participation, and glowing with gifts of grace, * pray for us and remember us * who honor your glorious * commemoration and reverence the reliquary that holds your bones, * which now is a source of * health and vigor and great mercy to those who ask with faith.
ltx/en_us_dedes/me.m02.d08:meVE.Stichera02.incipit	Rejoice! O sacred head, we…
ltx/en_us_dedes/me.m02.d08:meVE.Stichera02.melody	@ltx/en_us_dedes/he.a.m5:heAU.ChairoisAskitikon.name
ltx/en_us_dedes/me.m02.d08:meVE.Stichera02.mode	@ltx/en_us_dedes/miscellanea:misc.Mode5
ltx/en_us_dedes/me.m02.d08:meVE.Stichera02.text	Rejoice! O sacred head, we salute * the holy firstfruits of victorious Martyrs Saints. * The foe was by you defeated. The Church by you is adorned. * You were aptly named for gifts that come from God. * With miracles, you give light to the earth like a shining lamp. * You, like a pillar that is great, were unshaken by * countless painful tortures the you were submitted to. * You killed the dragon with your great * endurance as with a sword, * and you excelled as a soldier, for you remained undefeatable. * To Christ pray in earnest, * and entreat Him that great mercy be granted to our souls.
ltx/en_us_dedes/me.m02.d08:meVE.Stichera03.incipit	Armed with the holy life-bearing…
ltx/en_us_dedes/me.m02.d08:meVE.Stichera03.melody	@ltx/en_us_dedes/he.a.m5:heAU.ChairoisAskitikon.name
ltx/en_us_dedes/me.m02.d08:meVE.Stichera03.mode	@ltx/en_us_dedes/miscellanea:misc.Mode5
ltx/en_us_dedes/me.m02.d08:meVE.Stichera03.text	Armed with the holy life-bearing Cross, * you smashed the idols of the pagans and scattered them. * And therefore you were subjected to whipping, stretched on the rack. * You were mutilated, beaten to a pulp. * They torched you, all-blessed one. They impaled you with sharpened stakes. * They crucified you, and you bravely endured it all. * And they blinded you, when by force they plucked out your eyes. * Therefore we call you blessed now, * for you have competed well * and were awarded the medals and crowns from heaven, O Theodore. * To Christ pray in earnest, * and entreat Him that great mercy be granted to our souls.
ltx/en_us_dedes/me.m02.d08:meVE.Stichera04.greekmelody	@ltx/en_us_dedes/he.a.m8:heAU.TiYmasKalesomen.greekname
ltx/en_us_dedes/me.m02.d08:meVE.Stichera04.incipit	…
ltx/en_us_dedes/me.m02.d08:meVE.Stichera04.melody	@ltx/en_us_dedes/he.a.m8:heAU.TiYmasKalesomen.name
ltx/en_us_dedes/me.m02.d08:meVE.Stichera04.mode	@ltx/en_us_dedes/miscellanea:misc.Mode8
ltx/en_us_dedes/me.m02.d08:meVE.Stichera04.text	
ltx/en_us_dedes/me.m02.d08:meVE.Stichera05.incipit	…
ltx/en_us_dedes/me.m02.d08:meVE.Stichera05.melody	@ltx/en_us_dedes/he.a.m8:heAU.TiYmasKalesomen.name
ltx/en_us_dedes/me.m02.d08:meVE.Stichera05.mode	@ltx/en_us_dedes/miscellanea:misc.Mode8
ltx/en_us_dedes/me.m02.d08:meVE.Stichera05.text	
ltx/en_us_dedes/me.m02.d08:meVE.Stichera06.incipit	…
ltx/en_us_dedes/me.m02.d08:meVE.Stichera06.melody	@ltx/en_us_dedes/he.a.m8:heAU.TiYmasKalesomen.name
ltx/en_us_dedes/me.m02.d08:meVE.Stichera06.mode	@ltx/en_us_dedes/miscellanea:misc.Mode8
ltx/en_us_dedes/me.m02.d08:meVE.Stichera06.text	
