ltx/en_us_dedes/sy.m05.d15:cl.syMA.commemoration01.text	[saint/com 1]
ltx/en_us_dedes/sy.m05.d15:cl.syMA.commemoration02.text	[saint/com 2]
ltx/en_us_dedes/sy.m05.d15:cl.syMA.commemoration03.text	[saint/com 3]
ltx/en_us_dedes/sy.m05.d15:cl.syMA.commemoration04.text	[saint/com 4]
ltx/en_us_dedes/sy.m05.d15:cl.syMA.commemoration05.text	[saint/com 5]
ltx/en_us_dedes/sy.m05.d15:cl.syMA.commemoration06.text	[saint/com list]
ltx/en_us_dedes/sy.m05.d15:syMA.commemoration01.couplet1.title	@ltx/en_us_dedes/titles:ti.Verses
ltx/en_us_dedes/sy.m05.d15:syMA.commemoration01.couplet1.verse1	
ltx/en_us_dedes/sy.m05.d15:syMA.commemoration01.couplet1.verse2	
ltx/en_us_dedes/sy.m05.d15:syMA.commemoration01.narration.p01	
ltx/en_us_dedes/sy.m05.d15:syMA.commemoration01.narration.p02	
ltx/en_us_dedes/sy.m05.d15:syMA.commemoration01.single1	
ltx/en_us_dedes/sy.m05.d15:syMA.commemoration01.text	On May 15 we commemorate our devout Father Pachomios the Great.
ltx/en_us_dedes/sy.m05.d15:syMA.commemoration02.couplet1.title	@ltx/en_us_dedes/titles:ti.Verses
ltx/en_us_dedes/sy.m05.d15:syMA.commemoration02.couplet1.verse1	
ltx/en_us_dedes/sy.m05.d15:syMA.commemoration02.couplet1.verse2	
ltx/en_us_dedes/sy.m05.d15:syMA.commemoration02.narration.p01	
ltx/en_us_dedes/sy.m05.d15:syMA.commemoration02.text	On this day we also commemorate our devout Father Achillios, Metropolitan of Larissa.
ltx/en_us_dedes/sy.m05.d15:syMA.commemoration03.couplet1.title	@ltx/en_us_dedes/titles:ti.Verses
ltx/en_us_dedes/sy.m05.d15:syMA.commemoration03.couplet1.verse1	
ltx/en_us_dedes/sy.m05.d15:syMA.commemoration03.couplet1.verse2	
ltx/en_us_dedes/sy.m05.d15:syMA.commemoration03.text	On this day we also commemorate our devout Father Barbaros the Myrrh-streamer.
ltx/en_us_dedes/sy.m05.d15:syMA.lastline	By their holy intercessions, O God, have mercy on us. Amen.
ltx/en_us_dedes/sy.m05.d15:syMA.note1	
