ltx/en_us_dedes/sy.m11.d27:syMA.commemoration01.couplet1.title	@ltx/en_us_dedes/titles:ti.Verses
ltx/en_us_dedes/sy.m11.d27:syMA.commemoration01.couplet1.verse1	
ltx/en_us_dedes/sy.m11.d27:syMA.commemoration01.couplet1.verse2	
ltx/en_us_dedes/sy.m11.d27:syMA.commemoration01.narration.p01	
ltx/en_us_dedes/sy.m11.d27:syMA.commemoration01.single1	
ltx/en_us_dedes/sy.m11.d27:syMA.commemoration01.text	On November 27, we commemorate the contest of the holy Great-martyr James the Persian.
ltx/en_us_dedes/sy.m11.d27:syMA.commemoration02.couplet1.title	@ltx/en_us_dedes/titles:ti.Verses
ltx/en_us_dedes/sy.m11.d27:syMA.commemoration02.couplet1.verse1	
ltx/en_us_dedes/sy.m11.d27:syMA.commemoration02.couplet1.verse2	
ltx/en_us_dedes/sy.m11.d27:syMA.commemoration02.text	On this day, devout St. Pinoufrios died in peace.
ltx/en_us_dedes/sy.m11.d27:syMA.commemoration03.couplet1.title	@ltx/en_us_dedes/titles:ti.Verses
ltx/en_us_dedes/sy.m11.d27:syMA.commemoration03.couplet1.verse1	
ltx/en_us_dedes/sy.m11.d27:syMA.commemoration03.couplet1.verse2	
ltx/en_us_dedes/sy.m11.d27:syMA.commemoration03.text	On this day, St. Nathaniel died in peace.
ltx/en_us_dedes/sy.m11.d27:syMA.lastline	By their holy intercessions, O God, have mercy on us and save us. Amen.
