ltx/en_us_dedes/properties:contact.address_1	Fr. Seraphim Dedes
ltx/en_us_dedes/properties:contact.address_2	2237 Ole Castle Ct.
ltx/en_us_dedes/properties:contact.address_3	Chesterfield, MO 63017
ltx/en_us_dedes/properties:contact.email	seraphimdedes@gmail.com
ltx/en_us_dedes/properties:contact.phone	704-719-3074
ltx/en_us_dedes/properties:deprecated.key	This key is no longer used.
ltx/en_us_dedes/properties:media.key	For media only.
ltx/en_us_dedes/properties:version.copyright1	Copyright © 2021 by Fr. Seraphim Dedes
ltx/en_us_dedes/properties:version.copyright2	Used by permission.
ltx/en_us_dedes/properties:version.copyright3	
ltx/en_us_dedes/properties:version.designation	SD
ltx/en_us_dedes/properties:version.name	Fr. Seraphim Dedes.
ltx/en_us_dedes/properties:version.notice1	
ltx/en_us_dedes/properties:version.translator	Translated by Fr. Seraphim Dedes
