ltx/en_us_dedes/eu.smallblessingofwater:euSWB.Key0100.title	The Service of the Small Blessing of Water
ltx/en_us_dedes/eu.smallblessingofwater:euSWB.Key0201.incipit	@ltx/en_us_dedes/he.h.m6:heHE.IToChaireDiAngelou.incipit
ltx/en_us_dedes/eu.smallblessingofwater:euSWB.Key0201.melody	@ltx/en_us_dedes/he.h.m6:heHE.IToChaireDiAngelou.melody
ltx/en_us_dedes/eu.smallblessingofwater:euSWB.Key0201.mode	@ltx/en_us_dedes/miscellanea:misc.Mode6
ltx/en_us_dedes/eu.smallblessingofwater:euSWB.Key0201.text	@ltx/en_us_dedes/he.h.m6:heHE.IToChaireDiAngelou.text
ltx/en_us_dedes/eu.smallblessingofwater:euSWB.Key0202.incipit	We extol your Son, O…
ltx/en_us_dedes/eu.smallblessingofwater:euSWB.Key0202.melody	@ltx/en_us_dedes/he.h.m6:heHE.IToChaireDiAngelou.name
ltx/en_us_dedes/eu.smallblessingofwater:euSWB.Key0202.mode	@ltx/en_us_dedes/miscellanea:misc.Mode6
ltx/en_us_dedes/eu.smallblessingofwater:euSWB.Key0202.text	We extol your Son, O Virgin Theotokos, * and we cry out to you the immaculate: * O Lady, save us your servants from jeopardy.
ltx/en_us_dedes/eu.smallblessingofwater:euSWB.Key0203.incipit	Of the emperors and Prophets…
ltx/en_us_dedes/eu.smallblessingofwater:euSWB.Key0203.melody	@ltx/en_us_dedes/he.h.m6:heHE.IToChaireDiAngelou.name
ltx/en_us_dedes/eu.smallblessingofwater:euSWB.Key0203.mode	@ltx/en_us_dedes/miscellanea:misc.Mode6
ltx/en_us_dedes/eu.smallblessingofwater:euSWB.Key0203.text	Of the emperors and Prophets and Apostles * and the martyr saints you are the pride and joy, * and the protection of the world, All-blameless one.
ltx/en_us_dedes/eu.smallblessingofwater:euSWB.Key0204.incipit	Every Orthodox believer’s tongue acclaims…
ltx/en_us_dedes/eu.smallblessingofwater:euSWB.Key0204.melody	@ltx/en_us_dedes/he.h.m6:heHE.IToChaireDiAngelou.name
ltx/en_us_dedes/eu.smallblessingofwater:euSWB.Key0204.mode	@ltx/en_us_dedes/miscellanea:misc.Mode6
ltx/en_us_dedes/eu.smallblessingofwater:euSWB.Key0204.text	Every Orthodox believer’s tongue acclaims you * and beatifies you, Mary Bride of God, * and glorifies your immaculate childbirth.
ltx/en_us_dedes/eu.smallblessingofwater:euSWB.Key0205.incipit	O my Christ, as One…
ltx/en_us_dedes/eu.smallblessingofwater:euSWB.Key0205.melody	@ltx/en_us_dedes/he.h.m6:heHE.IToChaireDiAngelou.name
ltx/en_us_dedes/eu.smallblessingofwater:euSWB.Key0205.mode	@ltx/en_us_dedes/miscellanea:misc.Mode6
ltx/en_us_dedes/eu.smallblessingofwater:euSWB.Key0205.text	O my Christ, as One compassionate, forgive me * the unworthy one all of my debts, I pray, * through the entreaties of her who gave birth to You.
ltx/en_us_dedes/eu.smallblessingofwater:euSWB.Key0206.incipit	I have set my hopes…
ltx/en_us_dedes/eu.smallblessingofwater:euSWB.Key0206.melody	@ltx/en_us_dedes/he.h.m6:heHE.IToChaireDiAngelou.name
ltx/en_us_dedes/eu.smallblessingofwater:euSWB.Key0206.mode	@ltx/en_us_dedes/miscellanea:misc.Mode6
ltx/en_us_dedes/eu.smallblessingofwater:euSWB.Key0206.text	I have set my hopes on you, O Theotokos. * Through your strong intercessions save me, I pray, * and grant forgiveness of offenses unto me.
ltx/en_us_dedes/eu.smallblessingofwater:euSWB.Key0207.incipit	As the Mother of the…
ltx/en_us_dedes/eu.smallblessingofwater:euSWB.Key0207.melody	@ltx/en_us_dedes/he.h.m6:heHE.IToChaireDiAngelou.name
ltx/en_us_dedes/eu.smallblessingofwater:euSWB.Key0207.mode	@ltx/en_us_dedes/miscellanea:misc.Mode6
ltx/en_us_dedes/eu.smallblessingofwater:euSWB.Key0207.text	As the Mother of the Life-giver and Savior * vivify me, and save me, O blessed one, * by interceding. For you are the hope of our souls.
ltx/en_us_dedes/eu.smallblessingofwater:euSWB.Key0208.incipit	Save our souls, O Virgin…
ltx/en_us_dedes/eu.smallblessingofwater:euSWB.Key0208.melody	@ltx/en_us_dedes/he.h.m6:heHE.IToChaireDiAngelou.name
ltx/en_us_dedes/eu.smallblessingofwater:euSWB.Key0208.mode	@ltx/en_us_dedes/miscellanea:misc.Mode6
ltx/en_us_dedes/eu.smallblessingofwater:euSWB.Key0208.text	Save our souls, O Virgin, through your intercessions, * as the one who conceived in your holy womb * the Creator of all things, all-blameless one.
ltx/en_us_dedes/eu.smallblessingofwater:euSWB.Key0209.incipit	Theotokos, you gave birth unto…
ltx/en_us_dedes/eu.smallblessingofwater:euSWB.Key0209.melody	@ltx/en_us_dedes/he.h.m6:heHE.IToChaireDiAngelou.name
ltx/en_us_dedes/eu.smallblessingofwater:euSWB.Key0209.mode	@ltx/en_us_dedes/miscellanea:misc.Mode6
ltx/en_us_dedes/eu.smallblessingofwater:euSWB.Key0209.text	Theotokos, you gave birth unto the Logos * by a word in a manner passed reasoning. * Importune Him to save our souls, all-lauded one.
ltx/en_us_dedes/eu.smallblessingofwater:euSWB.Key0210.incipit	Cause your Son who is…
ltx/en_us_dedes/eu.smallblessingofwater:euSWB.Key0210.melody	@ltx/en_us_dedes/he.h.m6:heHE.IToChaireDiAngelou.name
ltx/en_us_dedes/eu.smallblessingofwater:euSWB.Key0210.mode	@ltx/en_us_dedes/miscellanea:misc.Mode6
ltx/en_us_dedes/eu.smallblessingofwater:euSWB.Key0210.text	Cause your Son who is the Judge to be propitious * unto me who have erred more than everyone. * O Lady, do this by your intercessions, I pray.
ltx/en_us_dedes/eu.smallblessingofwater:euSWB.Key0211.incipit	Duty-bound we cry to you…
ltx/en_us_dedes/eu.smallblessingofwater:euSWB.Key0211.melody	@ltx/en_us_dedes/he.h.m6:heHE.IToChaireDiAngelou.name
ltx/en_us_dedes/eu.smallblessingofwater:euSWB.Key0211.mode	@ltx/en_us_dedes/miscellanea:misc.Mode6
ltx/en_us_dedes/eu.smallblessingofwater:euSWB.Key0211.text	Duty-bound we cry to you the Theotokos, * ever-virgin and pure, rejoice. And we * implore that by your intercessions we be saved.
ltx/en_us_dedes/eu.smallblessingofwater:euSWB.Key0212.incipit	O redeem me from the…
ltx/en_us_dedes/eu.smallblessingofwater:euSWB.Key0212.melody	@ltx/en_us_dedes/he.h.m6:heHE.IToChaireDiAngelou.name
ltx/en_us_dedes/eu.smallblessingofwater:euSWB.Key0212.mode	@ltx/en_us_dedes/miscellanea:misc.Mode6
ltx/en_us_dedes/eu.smallblessingofwater:euSWB.Key0212.text	O redeem me from the everlasting fire * and the torments that have been laid up for me, * O Theotokos, so that I may call you blest.
ltx/en_us_dedes/eu.smallblessingofwater:euSWB.Key0213.incipit	Overlook not the petitions of…
ltx/en_us_dedes/eu.smallblessingofwater:euSWB.Key0213.melody	@ltx/en_us_dedes/he.h.m6:heHE.IToChaireDiAngelou.name
ltx/en_us_dedes/eu.smallblessingofwater:euSWB.Key0213.mode	@ltx/en_us_dedes/miscellanea:misc.Mode6
ltx/en_us_dedes/eu.smallblessingofwater:euSWB.Key0213.text	Overlook not the petitions of your servants, * we implore you, O Lady extolled by all, * to be delivered from every predicament.
ltx/en_us_dedes/eu.smallblessingofwater:euSWB.Key0214.incipit	From diseases and from pain…
ltx/en_us_dedes/eu.smallblessingofwater:euSWB.Key0214.melody	@ltx/en_us_dedes/he.h.m6:heHE.IToChaireDiAngelou.name
ltx/en_us_dedes/eu.smallblessingofwater:euSWB.Key0214.mode	@ltx/en_us_dedes/miscellanea:misc.Mode6
ltx/en_us_dedes/eu.smallblessingofwater:euSWB.Key0214.text	From diseases and from pain and all afflictions * and from dangers, we pray you deliver us * who for protection to your sacred shelter flee.
ltx/en_us_dedes/eu.smallblessingofwater:euSWB.Key0215.incipit	Strange indeed, O Theotokos, is…
ltx/en_us_dedes/eu.smallblessingofwater:euSWB.Key0215.melody	@ltx/en_us_dedes/he.h.m6:heHE.IToChaireDiAngelou.name
ltx/en_us_dedes/eu.smallblessingofwater:euSWB.Key0215.mode	@ltx/en_us_dedes/miscellanea:misc.Mode6
ltx/en_us_dedes/eu.smallblessingofwater:euSWB.Key0215.text	Strange indeed, O Theotokos, is the wonder * that was wrought in you; for the Maker of all, * who is our God, for us from you was born like us.
ltx/en_us_dedes/eu.smallblessingofwater:euSWB.Key0216.incipit	Theotokos, now your temple is…
ltx/en_us_dedes/eu.smallblessingofwater:euSWB.Key0216.melody	@ltx/en_us_dedes/he.h.m6:heHE.IToChaireDiAngelou.name
ltx/en_us_dedes/eu.smallblessingofwater:euSWB.Key0216.mode	@ltx/en_us_dedes/miscellanea:misc.Mode6
ltx/en_us_dedes/eu.smallblessingofwater:euSWB.Key0216.text	Theotokos, now your temple is a clinic * treating bodily illnesses free of charge, * and providing comfort for afflicted souls.
ltx/en_us_dedes/eu.smallblessingofwater:euSWB.Key0217.incipit	O all holy Theotokos, as…
ltx/en_us_dedes/eu.smallblessingofwater:euSWB.Key0217.melody	@ltx/en_us_dedes/he.h.m6:heHE.IToChaireDiAngelou.name
ltx/en_us_dedes/eu.smallblessingofwater:euSWB.Key0217.mode	@ltx/en_us_dedes/miscellanea:misc.Mode6
ltx/en_us_dedes/eu.smallblessingofwater:euSWB.Key0217.text	O all holy Theotokos, as the Mother * of the Savior, deliver your servants from * perils and every other grave necessity.
ltx/en_us_dedes/eu.smallblessingofwater:euSWB.Key0218.incipit	From impending threats of danger…
ltx/en_us_dedes/eu.smallblessingofwater:euSWB.Key0218.melody	@ltx/en_us_dedes/he.h.m6:heHE.IToChaireDiAngelou.name
ltx/en_us_dedes/eu.smallblessingofwater:euSWB.Key0218.mode	@ltx/en_us_dedes/miscellanea:misc.Mode6
ltx/en_us_dedes/eu.smallblessingofwater:euSWB.Key0218.text	From impending threats of danger save your servants * and deliver them from every injury * of soul and body, O Lady all immaculate.
ltx/en_us_dedes/eu.smallblessingofwater:euSWB.Key0219.incipit	Virgin Theotokos, by your intercessions…
ltx/en_us_dedes/eu.smallblessingofwater:euSWB.Key0219.melody	@ltx/en_us_dedes/he.h.m6:heHE.IToChaireDiAngelou.name
ltx/en_us_dedes/eu.smallblessingofwater:euSWB.Key0219.mode	@ltx/en_us_dedes/miscellanea:misc.Mode6
ltx/en_us_dedes/eu.smallblessingofwater:euSWB.Key0219.text	Virgin Theotokos, by your intercessions * save us all who for refuge flee unto you. * From all distress and necessity deliver us.
ltx/en_us_dedes/eu.smallblessingofwater:euSWB.Key0220.incipit	Who has ever taken refuge…
ltx/en_us_dedes/eu.smallblessingofwater:euSWB.Key0220.melody	@ltx/en_us_dedes/he.h.m6:heHE.IToChaireDiAngelou.name
ltx/en_us_dedes/eu.smallblessingofwater:euSWB.Key0220.mode	@ltx/en_us_dedes/miscellanea:misc.Mode6
ltx/en_us_dedes/eu.smallblessingofwater:euSWB.Key0220.text	Who has ever taken refuge at your temple, * O immaculate Maiden, and not obtained * the speedy cure of soul and body, O Mother of God.
ltx/en_us_dedes/eu.smallblessingofwater:euSWB.Key0221.incipit	Importuned by all the Saints…
ltx/en_us_dedes/eu.smallblessingofwater:euSWB.Key0221.melody	@ltx/en_us_dedes/he.h.m6:heHE.IToChaireDiAngelou.name
ltx/en_us_dedes/eu.smallblessingofwater:euSWB.Key0221.mode	@ltx/en_us_dedes/miscellanea:misc.Mode6
ltx/en_us_dedes/eu.smallblessingofwater:euSWB.Key0221.text	Importuned by all the Saints, O loving Master, * and the heavenly orders, and by the prayers * of her who bore You, be gracious to me, O Lord.
ltx/en_us_dedes/eu.smallblessingofwater:euSWB.Key0222.incipit	O our Savior, spare the…
ltx/en_us_dedes/eu.smallblessingofwater:euSWB.Key0222.melody	@ltx/en_us_dedes/he.h.m6:heHE.IToChaireDiAngelou.name
ltx/en_us_dedes/eu.smallblessingofwater:euSWB.Key0222.mode	@ltx/en_us_dedes/miscellanea:misc.Mode6
ltx/en_us_dedes/eu.smallblessingofwater:euSWB.Key0222.text	O our Savior, spare the souls all our brethren * who have died in the hope of eternal life. * Grant them forgiveness, loosing their transgressions all.
ltx/en_us_dedes/eu.smallblessingofwater:euSWB.Key0223.incipit	Mercy seat for all the…
ltx/en_us_dedes/eu.smallblessingofwater:euSWB.Key0223.melody	@ltx/en_us_dedes/he.h.m6:heHE.IToChaireDiAngelou.name
ltx/en_us_dedes/eu.smallblessingofwater:euSWB.Key0223.mode	@ltx/en_us_dedes/miscellanea:misc.Mode6
ltx/en_us_dedes/eu.smallblessingofwater:euSWB.Key0223.text	Mercy seat for all the world, rejoice, O Virgin; * jar containing the manna divine, rejoice, * and gilded lamp-stand of the Light, O Bride of God.
ltx/en_us_dedes/eu.smallblessingofwater:euSWB.Key0224.incipit	Unto You the God in…
ltx/en_us_dedes/eu.smallblessingofwater:euSWB.Key0224.melody	@ltx/en_us_dedes/he.h.m6:heHE.IToChaireDiAngelou.name
ltx/en_us_dedes/eu.smallblessingofwater:euSWB.Key0224.mode	@ltx/en_us_dedes/miscellanea:misc.Mode6
ltx/en_us_dedes/eu.smallblessingofwater:euSWB.Key0224.text	Unto You the God in Trinity we cry out, * and the words of the thrice-holy hymn we chant, * as we entreat that we obtain salvation of soul.
ltx/en_us_dedes/eu.smallblessingofwater:euSWB.Key0225.incipit	Pray, O Virgin who gave…
ltx/en_us_dedes/eu.smallblessingofwater:euSWB.Key0225.melody	@ltx/en_us_dedes/he.h.m6:heHE.IToChaireDiAngelou.name
ltx/en_us_dedes/eu.smallblessingofwater:euSWB.Key0225.mode	@ltx/en_us_dedes/miscellanea:misc.Mode6
ltx/en_us_dedes/eu.smallblessingofwater:euSWB.Key0225.text	Pray, O Virgin who gave birth unto the Savior * and the Master and Lord of the universe, * and importune Him earnestly to save our souls.
ltx/en_us_dedes/eu.smallblessingofwater:euSWB.Key0226.incipit	O rejoice, mountain; rejoice, O…
ltx/en_us_dedes/eu.smallblessingofwater:euSWB.Key0226.melody	@ltx/en_us_dedes/he.h.m6:heHE.IToChaireDiAngelou.name
ltx/en_us_dedes/eu.smallblessingofwater:euSWB.Key0226.mode	@ltx/en_us_dedes/miscellanea:misc.Mode6
ltx/en_us_dedes/eu.smallblessingofwater:euSWB.Key0226.text	O rejoice, mountain; rejoice, O bush; rejoice, gate. * O rejoice, ladder; table divine, rejoice. * Rejoice, O Lady, the help of all humanity.
ltx/en_us_dedes/eu.smallblessingofwater:euSWB.Key0227.incipit	As the Merciful One, through…
ltx/en_us_dedes/eu.smallblessingofwater:euSWB.Key0227.melody	@ltx/en_us_dedes/he.h.m6:heHE.IToChaireDiAngelou.name
ltx/en_us_dedes/eu.smallblessingofwater:euSWB.Key0227.mode	@ltx/en_us_dedes/miscellanea:misc.Mode6
ltx/en_us_dedes/eu.smallblessingofwater:euSWB.Key0227.text	As the Merciful One, through the intercessions * of Your immaculate Mother and all the Saints * bestow Your mercies upon Your people copiously.
ltx/en_us_dedes/eu.smallblessingofwater:euSWB.Key0228.incipit	By the power of Your…
ltx/en_us_dedes/eu.smallblessingofwater:euSWB.Key0228.melody	@ltx/en_us_dedes/he.h.m6:heHE.IToChaireDiAngelou.name
ltx/en_us_dedes/eu.smallblessingofwater:euSWB.Key0228.mode	@ltx/en_us_dedes/miscellanea:misc.Mode6
ltx/en_us_dedes/eu.smallblessingofwater:euSWB.Key0228.text	By the power of Your holy Cross illumine * me Your servant, O Giver of Life, I pray, * that I may praise You in song, being saved by it.
ltx/en_us_dedes/eu.smallblessingofwater:euSWB.Key0229.incipit	Through the prayers of the…
ltx/en_us_dedes/eu.smallblessingofwater:euSWB.Key0229.melody	@ltx/en_us_dedes/he.h.m6:heHE.IToChaireDiAngelou.name
ltx/en_us_dedes/eu.smallblessingofwater:euSWB.Key0229.mode	@ltx/en_us_dedes/miscellanea:misc.Mode6
ltx/en_us_dedes/eu.smallblessingofwater:euSWB.Key0229.text	Through the prayers of the glorious Archangels * of the Angels and the hierarchies on high, * preserve, O Savior, Your servants and guard them well.
ltx/en_us_dedes/eu.smallblessingofwater:euSWB.Key0230.incipit	Through the intercessions of Your…
ltx/en_us_dedes/eu.smallblessingofwater:euSWB.Key0230.melody	@ltx/en_us_dedes/he.h.m6:heHE.IToChaireDiAngelou.name
ltx/en_us_dedes/eu.smallblessingofwater:euSWB.Key0230.mode	@ltx/en_us_dedes/miscellanea:misc.Mode6
ltx/en_us_dedes/eu.smallblessingofwater:euSWB.Key0230.text	Through the intercessions of Your highly honored * glorious Baptist and Prophet and Forerunner, * O Christ my Savior, guard Your servants from all harm.
ltx/en_us_dedes/eu.smallblessingofwater:euSWB.Key0231.incipit	Through the prayers of Your…
ltx/en_us_dedes/eu.smallblessingofwater:euSWB.Key0231.melody	@ltx/en_us_dedes/he.h.m6:heHE.IToChaireDiAngelou.name
ltx/en_us_dedes/eu.smallblessingofwater:euSWB.Key0231.mode	@ltx/en_us_dedes/miscellanea:misc.Mode6
ltx/en_us_dedes/eu.smallblessingofwater:euSWB.Key0231.text	Through the prayers of Your glorious Apostles * and Your Martyrs, O Lord, and of all Your Saints, * bestow Your mercies upon your people copiously.
ltx/en_us_dedes/eu.smallblessingofwater:euSWB.Key0232.incipit	By the prayers of the…
ltx/en_us_dedes/eu.smallblessingofwater:euSWB.Key0232.melody	@ltx/en_us_dedes/he.h.m6:heHE.IToChaireDiAngelou.name
ltx/en_us_dedes/eu.smallblessingofwater:euSWB.Key0232.mode	@ltx/en_us_dedes/miscellanea:misc.Mode6
ltx/en_us_dedes/eu.smallblessingofwater:euSWB.Key0232.text	By the prayers of the great and holy teachers, * Basil, Gregory and Saint John Chrysostom, * O Christ my Savior, guard Your servants from all harm.
ltx/en_us_dedes/eu.smallblessingofwater:euSWB.Key0233.incipit	O all-blessed father Nicholas, we…
ltx/en_us_dedes/eu.smallblessingofwater:euSWB.Key0233.melody	@ltx/en_us_dedes/he.h.m6:heHE.IToChaireDiAngelou.name
ltx/en_us_dedes/eu.smallblessingofwater:euSWB.Key0233.mode	@ltx/en_us_dedes/miscellanea:misc.Mode6
ltx/en_us_dedes/eu.smallblessingofwater:euSWB.Key0233.text	O all-blessed father Nicholas, we pray you, * send your speedy assistance abundantly * and your protection, to all those who honor you.
ltx/en_us_dedes/eu.smallblessingofwater:euSWB.Key0234.incipit	By the prayers of Your…
ltx/en_us_dedes/eu.smallblessingofwater:euSWB.Key0234.melody	@ltx/en_us_dedes/he.h.m6:heHE.IToChaireDiAngelou.name
ltx/en_us_dedes/eu.smallblessingofwater:euSWB.Key0234.mode	@ltx/en_us_dedes/miscellanea:misc.Mode6
ltx/en_us_dedes/eu.smallblessingofwater:euSWB.Key0234.text	By the prayers of Your glorious Great-martyrs, * Saints Demetrius, George, and the Theodores, * and Saint Artemius, Lord, keep us free of harm.
ltx/en_us_dedes/eu.smallblessingofwater:euSWB.Key0235.incipit	Guard your servants, at the…
ltx/en_us_dedes/eu.smallblessingofwater:euSWB.Key0235.melody	@ltx/en_us_dedes/he.h.m6:heHE.IToChaireDiAngelou.name
ltx/en_us_dedes/eu.smallblessingofwater:euSWB.Key0235.mode	@ltx/en_us_dedes/miscellanea:misc.Mode6
ltx/en_us_dedes/eu.smallblessingofwater:euSWB.Key0235.text	Guard your servants, at the fervent intercession * of the glorious Unmercenary Saints, * O Theotokos, protection and support of the world.
ltx/en_us_dedes/eu.smallblessingofwater:euSWB.Key0236.incipit	Panteleimon, holy Martyr of the…
ltx/en_us_dedes/eu.smallblessingofwater:euSWB.Key0236.melody	@ltx/en_us_dedes/he.h.m6:heHE.IToChaireDiAngelou.name
ltx/en_us_dedes/eu.smallblessingofwater:euSWB.Key0236.mode	@ltx/en_us_dedes/miscellanea:misc.Mode6
ltx/en_us_dedes/eu.smallblessingofwater:euSWB.Key0236.text	Panteleimon, holy Martyr of the Savior, * by your strong intercessions deliver us * from all diseases, for we come to you for help.
ltx/en_us_dedes/eu.smallblessingofwater:euSWB.Key0237.incipit	By the fervent intercessions of…
ltx/en_us_dedes/eu.smallblessingofwater:euSWB.Key0237.melody	@ltx/en_us_dedes/he.h.m6:heHE.IToChaireDiAngelou.name
ltx/en_us_dedes/eu.smallblessingofwater:euSWB.Key0237.mode	@ltx/en_us_dedes/miscellanea:misc.Mode6
ltx/en_us_dedes/eu.smallblessingofwater:euSWB.Key0237.text	By the fervent intercessions of the holy * righteous forefathers, all the monastic saints, * and all the righteous, O Christ, keep us free of harm.
ltx/en_us_dedes/eu.smallblessingofwater:euSWB.Key0238.incipit	To the Father, Son, and…
ltx/en_us_dedes/eu.smallblessingofwater:euSWB.Key0238.melody	@ltx/en_us_dedes/he.h.m6:heHE.IToChaireDiAngelou.name
ltx/en_us_dedes/eu.smallblessingofwater:euSWB.Key0238.mode	@ltx/en_us_dedes/miscellanea:misc.Mode6
ltx/en_us_dedes/eu.smallblessingofwater:euSWB.Key0238.text	To the Father, Son, and Holy Spirit, one God, * be the glory and honor for evermore. * We pray: “All-holy Trinity, save our souls.”
ltx/en_us_dedes/eu.smallblessingofwater:euSWB.Key0239.incipit	You ineffably conceived and then…
ltx/en_us_dedes/eu.smallblessingofwater:euSWB.Key0239.melody	@ltx/en_us_dedes/he.h.m6:heHE.IToChaireDiAngelou.name
ltx/en_us_dedes/eu.smallblessingofwater:euSWB.Key0239.mode	@ltx/en_us_dedes/miscellanea:misc.Mode6
ltx/en_us_dedes/eu.smallblessingofwater:euSWB.Key0239.text	You ineffably conceived and then gave birth to * the Creator himself in these latter days. * O Virgin, save us who magnify and call you blest.
ltx/en_us_dedes/eu.smallblessingofwater:euSWB.Key0240.incipit	@ltx/en_us_dedes/oc.m6.d5:ocMA.Kathisma13.incipit
ltx/en_us_dedes/eu.smallblessingofwater:euSWB.Key0240.text	@ltx/en_us_dedes/oc.m6.d5:ocMA.Kathisma13.text
ltx/en_us_dedes/eu.smallblessingofwater:euSWB.Key0301.incipit	Now the time is come…
ltx/en_us_dedes/eu.smallblessingofwater:euSWB.Key0301.mode	@ltx/en_us_dedes/miscellanea:misc.Mode8
ltx/en_us_dedes/eu.smallblessingofwater:euSWB.Key0301.text	Now the time is come that sanctifies all men, and awaiting us is the just Judge. O my soul, turn to repentance, crying tearfully like the harlot: Lord, have mercy on me.
ltx/en_us_dedes/eu.smallblessingofwater:euSWB.Key0302.incipit	You have rained down a…
ltx/en_us_dedes/eu.smallblessingofwater:euSWB.Key0302.mode	@ltx/en_us_dedes/miscellanea:misc.Mode8
ltx/en_us_dedes/eu.smallblessingofwater:euSWB.Key0302.text	You have rained down a fountain of cures upon the waters in the all-holy shrine of the Virgin today, O Christ; and by the sprinkling of Your blessing, You drive away the illnesses of the infirm, O Physician of our souls and bodies.
ltx/en_us_dedes/eu.smallblessingofwater:euSWB.Key0303.incipit	O Mary Theotokos, as a…
ltx/en_us_dedes/eu.smallblessingofwater:euSWB.Key0303.melody	@ltx/en_us_dedes/miscellanea:misc.NotMetered
ltx/en_us_dedes/eu.smallblessingofwater:euSWB.Key0303.mode	@ltx/en_us_dedes/miscellanea:misc.Mode8
ltx/en_us_dedes/eu.smallblessingofwater:euSWB.Key0303.text	O Mary Theotokos, as a virgin never knowing wedlock did you give birth; and you remained a virgin, O Mother unwedded. Entreat Christ our God that we be saved.
ltx/en_us_dedes/eu.smallblessingofwater:euSWB.Key0304.incipit	All-holy Virgin Theotokos, guide aright…
ltx/en_us_dedes/eu.smallblessingofwater:euSWB.Key0304.mode	@ltx/en_us_dedes/miscellanea:misc.Mode8
ltx/en_us_dedes/eu.smallblessingofwater:euSWB.Key0304.text	All-holy Virgin Theotokos, guide aright the works of our hands, we pray; and ask for the remission of our offenses, as we chant now the hymn of the Angels.
ltx/en_us_dedes/eu.smallblessingofwater:euSWB.Key0401a.text	
ltx/en_us_dedes/eu.smallblessingofwater:euSWB.Key0401b.text	
ltx/en_us_dedes/eu.smallblessingofwater:euSWB.Key0402.text	
ltx/en_us_dedes/eu.smallblessingofwater:euSWB.Key0403.text	
ltx/en_us_dedes/eu.smallblessingofwater:euSWB.Key0404.text	
ltx/en_us_dedes/eu.smallblessingofwater:euSWB.Key0405.text	
ltx/en_us_dedes/eu.smallblessingofwater:euSWB.Key0501a.text	
ltx/en_us_dedes/eu.smallblessingofwater:euSWB.Key0501b.text	
ltx/en_us_dedes/eu.smallblessingofwater:euSWB.Key0501c.text	
ltx/en_us_dedes/eu.smallblessingofwater:euSWB.Key0502.incipit	…
ltx/en_us_dedes/eu.smallblessingofwater:euSWB.Key0502.text	
ltx/en_us_dedes/eu.smallblessingofwater:euSWB.Key0502.title	
ltx/en_us_dedes/eu.smallblessingofwater:euSWB.Key0503.inicpit	…
ltx/en_us_dedes/eu.smallblessingofwater:euSWB.Key0503.title	
ltx/en_us_dedes/eu.smallblessingofwater:euSWB.Key0503a.text	
ltx/en_us_dedes/eu.smallblessingofwater:euSWB.Key0503b.text	
ltx/en_us_dedes/eu.smallblessingofwater:euSWB.Key0503c.text	
ltx/en_us_dedes/eu.smallblessingofwater:euSWB.Key0504.text	
ltx/en_us_dedes/eu.smallblessingofwater:euSWB.Key0601.text	@ltx/en_us_dedes/eu.greatblessingofwater:euGW.Prayer41.text
ltx/en_us_dedes/eu.smallblessingofwater:euSWB.Key0602.incipit	Make us worthy of your…
ltx/en_us_dedes/eu.smallblessingofwater:euSWB.Key0602.mode	@ltx/en_us_dedes/miscellanea:misc.Mode2
ltx/en_us_dedes/eu.smallblessingofwater:euSWB.Key0602.text	Make us worthy of your gifts, O Virgin Theotokos, disregarding our transgressions and bestowing healing, through faith, upon those who receive your blessing, O immaculate one.
ltx/en_us_dedes/eu.smallblessingofwater:euSWB.R101	
ltx/en_us_dedes/eu.smallblessingofwater:euSWB.R102	The hymn of the church.
ltx/en_us_dedes/eu.smallblessingofwater:euSWB.R201	Then we sing the following hymns to the Theotokos, with the verse: “Most-holy Theotokos, save us.”
ltx/en_us_dedes/eu.smallblessingofwater:euSWB.R301	Then the following hymns:
ltx/en_us_dedes/eu.smallblessingofwater:euSWB.R401	The celebrant says the following prayer:
ltx/en_us_dedes/eu.smallblessingofwater:euSWB.R501	Another shorter prayer, used instead of the usual long one to save time.
ltx/en_us_dedes/eu.smallblessingofwater:euSWB.R601	The celebrant bows his head and quietly says the following prayer:
ltx/en_us_dedes/eu.smallblessingofwater:euSWB.R602	The celebrant holds the cross and the holy water sprinkler and makes the sign of the cross over the water three times, each time quietly saying: “In the name of the Father and the Son and the Holy Spirit. Amen.” Then he immerses them in the water crosswise as he sings the following hymn:
ltx/en_us_dedes/eu.smallblessingofwater:euSWB.R603	Then the celebrant sings the following as he sprinkles crosswise.
ltx/en_us_dedes/eu.smallblessingofwater:euSWB.R604	Then the celebrant kisses the precious Cross. Then the rest of those in attendance do likewise and are also sprinkled on the forehead with holy water by the celebrant. They kiss the cross he is holding and also his hand. Then he proceeds to sprinkle the church (or the home) with holy water.
ltx/en_us_dedes/eu.smallblessingofwater:euSWB.R605	Meanwhile the following hymns are sung:
