ltx/en_us_dedes/me.m07.d06:meDA.commemoration.first	Memory of our Devout Father Sisoi
ltx/en_us_dedes/me.m07.d06:meDA.commemoration.first_name	
ltx/en_us_dedes/me.m07.d06:meDA.commemoration.first_short	Memory of our Devout Father Sisoi
ltx/en_us_dedes/me.m07.d06:meDA.commemoration.first_title	@ltx/en_us_dedes/titles:ti.DevoutSaintM
ltx/en_us_dedes/me.m07.d06:meDA.commemoration.full	Memory of our Devout Father Sisoi the Great
ltx/en_us_dedes/me.m07.d06:meDA.commemoration.second_name	
ltx/en_us_dedes/me.m07.d06:meDA.commemoration.second_title	
ltx/en_us_dedes/me.m07.d06:meDA.date	July 6
ltx/en_us_dedes/me.m07.d06:meDA.fordate	for July 6
ltx/en_us_dedes/me.m07.d06:meDA.insert1	
ltx/en_us_dedes/me.m07.d06:meDA.insert2	
ltx/en_us_dedes/me.m07.d06:meDA.note	
ltx/en_us_dedes/me.m07.d06:meDA.pdfcoverdate	July 6,
ltx/en_us_dedes/me.m07.d06:meDA.pdfheaderdate	July 6
ltx/en_us_dedes/me.m07.d06:meHO.commemorations	
ltx/en_us_dedes/me.m07.d06:meHO.note1	
ltx/en_us_dedes/me.m07.d06:meHO.note2	
ltx/en_us_dedes/me.m07.d06:meHO.number	
ltx/en_us_dedes/me.m07.d06:meHO.rank	
ltx/en_us_dedes/me.m07.d06:meLE.commemoration1	
ltx/en_us_dedes/me.m07.d06:meLE.commemoration2	
ltx/en_us_dedes/me.m07.d06:meLI.Kontakion1.incipit	…
ltx/en_us_dedes/me.m07.d06:meLI.Kontakion1.melody	
ltx/en_us_dedes/me.m07.d06:meLI.Kontakion1.mode	
ltx/en_us_dedes/me.m07.d06:meLI.Kontakion1.text	
ltx/en_us_dedes/me.m07.d06:meLI.Megalynarion.text	
ltx/en_us_dedes/me.m07.d06:meMA.C1.title	@ltx/en_us_dedes/titles:ti.CanonDevoutM
ltx/en_us_dedes/me.m07.d06:meMA.C1.verse	@ltx/en_us_dedes/prayers:pr.verse_DevoutMan.text
ltx/en_us_dedes/me.m07.d06:meMA.Ode1C11.greekmelody	@ltx/en_us_dedes/he.h.m8:heHE.AsomenToKyrio.greekname
ltx/en_us_dedes/me.m07.d06:meMA.Ode1C11.incipit	…
ltx/en_us_dedes/me.m07.d06:meMA.Ode1C11.melody	@ltx/en_us_dedes/he.h.m8:heHE.AsomenToKyrio.name
ltx/en_us_dedes/me.m07.d06:meMA.Ode1C11.mode	@ltx/en_us_dedes/miscellanea:misc.Mode8
ltx/en_us_dedes/me.m07.d06:meMA.Ode1C11.ode	@ltx/en_us_dedes/miscellanea:misc.Ode1
ltx/en_us_dedes/me.m07.d06:meMA.Ode1C11.text	
ltx/en_us_dedes/me.m07.d06:meMA.Ode1C12.incipit	…
ltx/en_us_dedes/me.m07.d06:meMA.Ode1C12.melody	@ltx/en_us_dedes/he.h.m8:heHE.AsomenToKyrio.name
ltx/en_us_dedes/me.m07.d06:meMA.Ode1C12.mode	@ltx/en_us_dedes/miscellanea:misc.Mode8
ltx/en_us_dedes/me.m07.d06:meMA.Ode1C12.ode	@ltx/en_us_dedes/miscellanea:misc.Ode1
ltx/en_us_dedes/me.m07.d06:meMA.Ode1C12.text	
ltx/en_us_dedes/me.m07.d06:meMA.Ode1C13.incipit	…
ltx/en_us_dedes/me.m07.d06:meMA.Ode1C13.melody	@ltx/en_us_dedes/he.h.m8:heHE.AsomenToKyrio.name
ltx/en_us_dedes/me.m07.d06:meMA.Ode1C13.mode	@ltx/en_us_dedes/miscellanea:misc.Mode8
ltx/en_us_dedes/me.m07.d06:meMA.Ode1C13.ode	@ltx/en_us_dedes/miscellanea:misc.Ode1
ltx/en_us_dedes/me.m07.d06:meMA.Ode1C13.text	
ltx/en_us_dedes/me.m07.d06:meMA.Ode1C1T.incipit	…
ltx/en_us_dedes/me.m07.d06:meMA.Ode1C1T.melody	@ltx/en_us_dedes/he.h.m8:heHE.AsomenToKyrio.name
ltx/en_us_dedes/me.m07.d06:meMA.Ode1C1T.mode	@ltx/en_us_dedes/miscellanea:misc.Mode8
ltx/en_us_dedes/me.m07.d06:meMA.Ode1C1T.ode	@ltx/en_us_dedes/miscellanea:misc.Ode1
ltx/en_us_dedes/me.m07.d06:meMA.Ode1C1T.text	
ltx/en_us_dedes/me.m07.d06:meMA.Ode3C11.greekmelody	@ltx/en_us_dedes/he.h.m8:heHE.SyEiToStereoma.greekname
ltx/en_us_dedes/me.m07.d06:meMA.Ode3C11.incipit	…
ltx/en_us_dedes/me.m07.d06:meMA.Ode3C11.melody	@ltx/en_us_dedes/he.h.m8:heHE.SyEiToStereoma.name
ltx/en_us_dedes/me.m07.d06:meMA.Ode3C11.mode	@ltx/en_us_dedes/miscellanea:misc.Mode8
ltx/en_us_dedes/me.m07.d06:meMA.Ode3C11.ode	@ltx/en_us_dedes/miscellanea:misc.Ode3
ltx/en_us_dedes/me.m07.d06:meMA.Ode3C11.text	
ltx/en_us_dedes/me.m07.d06:meMA.Ode3C12.incipit	…
ltx/en_us_dedes/me.m07.d06:meMA.Ode3C12.melody	@ltx/en_us_dedes/he.h.m8:heHE.SyEiToStereoma.name
ltx/en_us_dedes/me.m07.d06:meMA.Ode3C12.mode	@ltx/en_us_dedes/miscellanea:misc.Mode8
ltx/en_us_dedes/me.m07.d06:meMA.Ode3C12.ode	@ltx/en_us_dedes/miscellanea:misc.Ode3
ltx/en_us_dedes/me.m07.d06:meMA.Ode3C12.text	
ltx/en_us_dedes/me.m07.d06:meMA.Ode3C13.incipit	…
ltx/en_us_dedes/me.m07.d06:meMA.Ode3C13.melody	@ltx/en_us_dedes/he.h.m8:heHE.SyEiToStereoma.name
ltx/en_us_dedes/me.m07.d06:meMA.Ode3C13.mode	@ltx/en_us_dedes/miscellanea:misc.Mode8
ltx/en_us_dedes/me.m07.d06:meMA.Ode3C13.ode	@ltx/en_us_dedes/miscellanea:misc.Ode3
ltx/en_us_dedes/me.m07.d06:meMA.Ode3C13.text	
ltx/en_us_dedes/me.m07.d06:meMA.Ode3C1T.incipit	…
ltx/en_us_dedes/me.m07.d06:meMA.Ode3C1T.melody	@ltx/en_us_dedes/he.h.m8:heHE.SyEiToStereoma.name
ltx/en_us_dedes/me.m07.d06:meMA.Ode3C1T.mode	@ltx/en_us_dedes/miscellanea:misc.Mode8
ltx/en_us_dedes/me.m07.d06:meMA.Ode3C1T.ode	@ltx/en_us_dedes/miscellanea:misc.Ode3
ltx/en_us_dedes/me.m07.d06:meMA.Ode3C1T.text	
ltx/en_us_dedes/me.m07.d06:meMA.Ode3H.greekmelody	@ltx/en_us_dedes/he.h.m8:heHE.SyEiToStereoma.greekname
ltx/en_us_dedes/me.m07.d06:meMA.Ode3H.incipit	@ltx/en_us_dedes/he.h.m8:heHE.SyEiToStereoma.incipit
ltx/en_us_dedes/me.m07.d06:meMA.Ode3H.melody	@ltx/en_us_dedes/he.h.m8:heHE.SyEiToStereoma.melody
ltx/en_us_dedes/me.m07.d06:meMA.Ode3H.mode	@ltx/en_us_dedes/miscellanea:misc.Mode8
ltx/en_us_dedes/me.m07.d06:meMA.Ode3H.ode	@ltx/en_us_dedes/miscellanea:misc.Ode3
ltx/en_us_dedes/me.m07.d06:meMA.Ode3H.text	@ltx/en_us_dedes/he.h.m8:heHE.SyEiToStereoma.text
ltx/en_us_dedes/me.m07.d06:meMA.Ode3Kathisma1.greekmelody	@ltx/en_us_dedes/he.a.m1:heAU.TonTafonSouSotir.greekname
ltx/en_us_dedes/me.m07.d06:meMA.Ode3Kathisma1.incipit	…
ltx/en_us_dedes/me.m07.d06:meMA.Ode3Kathisma1.melody	@ltx/en_us_dedes/he.a.m1:heAU.TonTafonSouSotir.name
ltx/en_us_dedes/me.m07.d06:meMA.Ode3Kathisma1.mode	@ltx/en_us_dedes/miscellanea:misc.Mode1
ltx/en_us_dedes/me.m07.d06:meMA.Ode3Kathisma1.text	
ltx/en_us_dedes/me.m07.d06:meMA.Ode3KathismaSt.incipit	@ltx/en_us_dedes/me.m03.d18:meMA.Ode3KathismaSt.incipit
ltx/en_us_dedes/me.m07.d06:meMA.Ode3KathismaSt.melody	@ltx/en_us_dedes/he.a.m1:heAU.TonTafonSouSotir.name
ltx/en_us_dedes/me.m07.d06:meMA.Ode3KathismaSt.mode	@ltx/en_us_dedes/miscellanea:misc.Mode1
ltx/en_us_dedes/me.m07.d06:meMA.Ode3KathismaSt.text	@ltx/en_us_dedes/me.m03.d18:meMA.Ode3KathismaSt.text
ltx/en_us_dedes/me.m07.d06:meMA.Ode3KathismaT.incipit	…
ltx/en_us_dedes/me.m07.d06:meMA.Ode3KathismaT.melody	@ltx/en_us_dedes/he.a.m1:heAU.TonTafonSouSotir.name
ltx/en_us_dedes/me.m07.d06:meMA.Ode3KathismaT.mode	@ltx/en_us_dedes/miscellanea:misc.Mode1
ltx/en_us_dedes/me.m07.d06:meMA.Ode3KathismaT.text	
ltx/en_us_dedes/me.m07.d06:meMA.Ode4C11.greekmelody	@ltx/en_us_dedes/he.h.m8:heHE.EisakikoaKyrie.greekname
ltx/en_us_dedes/me.m07.d06:meMA.Ode4C11.incipit	…
ltx/en_us_dedes/me.m07.d06:meMA.Ode4C11.melody	@ltx/en_us_dedes/he.h.m8:heHE.EisakikoaKyrie.name
ltx/en_us_dedes/me.m07.d06:meMA.Ode4C11.mode	@ltx/en_us_dedes/miscellanea:misc.Mode8
ltx/en_us_dedes/me.m07.d06:meMA.Ode4C11.ode	@ltx/en_us_dedes/miscellanea:misc.Ode4
ltx/en_us_dedes/me.m07.d06:meMA.Ode4C11.text	
ltx/en_us_dedes/me.m07.d06:meMA.Ode4C12.incipit	…
ltx/en_us_dedes/me.m07.d06:meMA.Ode4C12.melody	@ltx/en_us_dedes/he.h.m8:heHE.EisakikoaKyrie.name
ltx/en_us_dedes/me.m07.d06:meMA.Ode4C12.mode	@ltx/en_us_dedes/miscellanea:misc.Mode8
ltx/en_us_dedes/me.m07.d06:meMA.Ode4C12.ode	@ltx/en_us_dedes/miscellanea:misc.Ode4
ltx/en_us_dedes/me.m07.d06:meMA.Ode4C12.text	
ltx/en_us_dedes/me.m07.d06:meMA.Ode4C13.incipit	…
ltx/en_us_dedes/me.m07.d06:meMA.Ode4C13.melody	@ltx/en_us_dedes/he.h.m8:heHE.EisakikoaKyrie.name
ltx/en_us_dedes/me.m07.d06:meMA.Ode4C13.mode	@ltx/en_us_dedes/miscellanea:misc.Mode8
ltx/en_us_dedes/me.m07.d06:meMA.Ode4C13.ode	@ltx/en_us_dedes/miscellanea:misc.Ode4
ltx/en_us_dedes/me.m07.d06:meMA.Ode4C13.text	
ltx/en_us_dedes/me.m07.d06:meMA.Ode4C1T.incipit	…
ltx/en_us_dedes/me.m07.d06:meMA.Ode4C1T.melody	@ltx/en_us_dedes/he.h.m8:heHE.EisakikoaKyrie.name
ltx/en_us_dedes/me.m07.d06:meMA.Ode4C1T.mode	@ltx/en_us_dedes/miscellanea:misc.Mode8
ltx/en_us_dedes/me.m07.d06:meMA.Ode4C1T.ode	@ltx/en_us_dedes/miscellanea:misc.Ode4
ltx/en_us_dedes/me.m07.d06:meMA.Ode4C1T.text	
ltx/en_us_dedes/me.m07.d06:meMA.Ode5C11.greekmelody	@ltx/en_us_dedes/he.h.m8:heHE.OrthrizontesVoomenSoi.greekname
ltx/en_us_dedes/me.m07.d06:meMA.Ode5C11.incipit	…
ltx/en_us_dedes/me.m07.d06:meMA.Ode5C11.melody	@ltx/en_us_dedes/he.h.m8:heHE.OrthrizontesVoomenSoi.name
ltx/en_us_dedes/me.m07.d06:meMA.Ode5C11.mode	@ltx/en_us_dedes/miscellanea:misc.Mode8
ltx/en_us_dedes/me.m07.d06:meMA.Ode5C11.ode	@ltx/en_us_dedes/miscellanea:misc.Ode5
ltx/en_us_dedes/me.m07.d06:meMA.Ode5C11.text	
ltx/en_us_dedes/me.m07.d06:meMA.Ode5C12.incipit	…
ltx/en_us_dedes/me.m07.d06:meMA.Ode5C12.melody	@ltx/en_us_dedes/he.h.m8:heHE.OrthrizontesVoomenSoi.name
ltx/en_us_dedes/me.m07.d06:meMA.Ode5C12.mode	@ltx/en_us_dedes/miscellanea:misc.Mode8
ltx/en_us_dedes/me.m07.d06:meMA.Ode5C12.ode	@ltx/en_us_dedes/miscellanea:misc.Ode5
ltx/en_us_dedes/me.m07.d06:meMA.Ode5C12.text	
ltx/en_us_dedes/me.m07.d06:meMA.Ode5C1T.incipit	…
ltx/en_us_dedes/me.m07.d06:meMA.Ode5C1T.melody	@ltx/en_us_dedes/he.h.m8:heHE.OrthrizontesVoomenSoi.name
ltx/en_us_dedes/me.m07.d06:meMA.Ode5C1T.mode	@ltx/en_us_dedes/miscellanea:misc.Mode8
ltx/en_us_dedes/me.m07.d06:meMA.Ode5C1T.ode	@ltx/en_us_dedes/miscellanea:misc.Ode5
ltx/en_us_dedes/me.m07.d06:meMA.Ode5C1T.text	
ltx/en_us_dedes/me.m07.d06:meMA.Ode6C11.greekmelody	@ltx/en_us_dedes/he.h.m8:heHE.IlasthitiMoiSotir.greekname
ltx/en_us_dedes/me.m07.d06:meMA.Ode6C11.incipit	…
ltx/en_us_dedes/me.m07.d06:meMA.Ode6C11.melody	@ltx/en_us_dedes/he.h.m8:heHE.IlasthitiMoiSotir.name
ltx/en_us_dedes/me.m07.d06:meMA.Ode6C11.mode	@ltx/en_us_dedes/miscellanea:misc.Mode8
ltx/en_us_dedes/me.m07.d06:meMA.Ode6C11.ode	@ltx/en_us_dedes/miscellanea:misc.Ode6
ltx/en_us_dedes/me.m07.d06:meMA.Ode6C11.text	
ltx/en_us_dedes/me.m07.d06:meMA.Ode6C12.incipit	…
ltx/en_us_dedes/me.m07.d06:meMA.Ode6C12.melody	@ltx/en_us_dedes/he.h.m8:heHE.IlasthitiMoiSotir.name
ltx/en_us_dedes/me.m07.d06:meMA.Ode6C12.mode	@ltx/en_us_dedes/miscellanea:misc.Mode8
ltx/en_us_dedes/me.m07.d06:meMA.Ode6C12.ode	@ltx/en_us_dedes/miscellanea:misc.Ode6
ltx/en_us_dedes/me.m07.d06:meMA.Ode6C12.text	
ltx/en_us_dedes/me.m07.d06:meMA.Ode6C13.incipit	…
ltx/en_us_dedes/me.m07.d06:meMA.Ode6C13.melody	@ltx/en_us_dedes/he.h.m8:heHE.IlasthitiMoiSotir.name
ltx/en_us_dedes/me.m07.d06:meMA.Ode6C13.mode	@ltx/en_us_dedes/miscellanea:misc.Mode8
ltx/en_us_dedes/me.m07.d06:meMA.Ode6C13.ode	@ltx/en_us_dedes/miscellanea:misc.Ode6
ltx/en_us_dedes/me.m07.d06:meMA.Ode6C13.text	
ltx/en_us_dedes/me.m07.d06:meMA.Ode6C1T.incipit	…
ltx/en_us_dedes/me.m07.d06:meMA.Ode6C1T.melody	@ltx/en_us_dedes/he.h.m8:heHE.IlasthitiMoiSotir.name
ltx/en_us_dedes/me.m07.d06:meMA.Ode6C1T.mode	@ltx/en_us_dedes/miscellanea:misc.Mode8
ltx/en_us_dedes/me.m07.d06:meMA.Ode6C1T.ode	@ltx/en_us_dedes/miscellanea:misc.Ode6
ltx/en_us_dedes/me.m07.d06:meMA.Ode6C1T.text	
ltx/en_us_dedes/me.m07.d06:meMA.Ode6H.greekmelody	@ltx/en_us_dedes/he.h.m8:heHE.IlasthitiMoiSotir.greekname
ltx/en_us_dedes/me.m07.d06:meMA.Ode6H.incipit	@ltx/en_us_dedes/he.h.m8:heHE.IlasthitiMoiSotir.incipit
ltx/en_us_dedes/me.m07.d06:meMA.Ode6H.melody	@ltx/en_us_dedes/he.h.m8:heHE.IlasthitiMoiSotir.melody
ltx/en_us_dedes/me.m07.d06:meMA.Ode6H.mode	@ltx/en_us_dedes/miscellanea:misc.Mode8
ltx/en_us_dedes/me.m07.d06:meMA.Ode6H.ode	@ltx/en_us_dedes/miscellanea:misc.Ode6
ltx/en_us_dedes/me.m07.d06:meMA.Ode6H.text	@ltx/en_us_dedes/he.h.m8:heHE.IlasthitiMoiSotir.text
ltx/en_us_dedes/me.m07.d06:meMA.Ode7C11.greekmelody	@ltx/en_us_dedes/he.h.m8:heHE.PaidesEvraion.greekname
ltx/en_us_dedes/me.m07.d06:meMA.Ode7C11.incipit	…
ltx/en_us_dedes/me.m07.d06:meMA.Ode7C11.melody	@ltx/en_us_dedes/he.h.m8:heHE.PaidesEvraion.name
ltx/en_us_dedes/me.m07.d06:meMA.Ode7C11.mode	@ltx/en_us_dedes/miscellanea:misc.Mode8
ltx/en_us_dedes/me.m07.d06:meMA.Ode7C11.ode	@ltx/en_us_dedes/miscellanea:misc.Ode7
ltx/en_us_dedes/me.m07.d06:meMA.Ode7C11.text	
ltx/en_us_dedes/me.m07.d06:meMA.Ode7C12.incipit	…
ltx/en_us_dedes/me.m07.d06:meMA.Ode7C12.melody	@ltx/en_us_dedes/he.h.m8:heHE.PaidesEvraion.name
ltx/en_us_dedes/me.m07.d06:meMA.Ode7C12.mode	@ltx/en_us_dedes/miscellanea:misc.Mode8
ltx/en_us_dedes/me.m07.d06:meMA.Ode7C12.ode	@ltx/en_us_dedes/miscellanea:misc.Ode7
ltx/en_us_dedes/me.m07.d06:meMA.Ode7C12.text	
ltx/en_us_dedes/me.m07.d06:meMA.Ode7C1T.incipit	…
ltx/en_us_dedes/me.m07.d06:meMA.Ode7C1T.melody	@ltx/en_us_dedes/he.h.m8:heHE.PaidesEvraion.name
ltx/en_us_dedes/me.m07.d06:meMA.Ode7C1T.mode	@ltx/en_us_dedes/miscellanea:misc.Mode8
ltx/en_us_dedes/me.m07.d06:meMA.Ode7C1T.ode	@ltx/en_us_dedes/miscellanea:misc.Ode7
ltx/en_us_dedes/me.m07.d06:meMA.Ode7C1T.text	
ltx/en_us_dedes/me.m07.d06:meMA.Ode8C11.greekmelody	@ltx/en_us_dedes/he.h.m8:heHE.EptaplasiosKaminon.greekname
ltx/en_us_dedes/me.m07.d06:meMA.Ode8C11.incipit	…
ltx/en_us_dedes/me.m07.d06:meMA.Ode8C11.melody	@ltx/en_us_dedes/he.h.m8:heHE.EptaplasiosKaminon.name
ltx/en_us_dedes/me.m07.d06:meMA.Ode8C11.mode	@ltx/en_us_dedes/miscellanea:misc.Mode8
ltx/en_us_dedes/me.m07.d06:meMA.Ode8C11.ode	@ltx/en_us_dedes/miscellanea:misc.Ode8
ltx/en_us_dedes/me.m07.d06:meMA.Ode8C11.text	
ltx/en_us_dedes/me.m07.d06:meMA.Ode8C12.incipit	…
ltx/en_us_dedes/me.m07.d06:meMA.Ode8C12.melody	@ltx/en_us_dedes/he.h.m8:heHE.EptaplasiosKaminon.name
ltx/en_us_dedes/me.m07.d06:meMA.Ode8C12.mode	@ltx/en_us_dedes/miscellanea:misc.Mode8
ltx/en_us_dedes/me.m07.d06:meMA.Ode8C12.ode	@ltx/en_us_dedes/miscellanea:misc.Ode8
ltx/en_us_dedes/me.m07.d06:meMA.Ode8C12.text	
ltx/en_us_dedes/me.m07.d06:meMA.Ode8C13.incipit	…
ltx/en_us_dedes/me.m07.d06:meMA.Ode8C13.melody	@ltx/en_us_dedes/he.h.m8:heHE.EptaplasiosKaminon.name
ltx/en_us_dedes/me.m07.d06:meMA.Ode8C13.mode	@ltx/en_us_dedes/miscellanea:misc.Mode8
ltx/en_us_dedes/me.m07.d06:meMA.Ode8C13.ode	@ltx/en_us_dedes/miscellanea:misc.Ode8
ltx/en_us_dedes/me.m07.d06:meMA.Ode8C13.text	
ltx/en_us_dedes/me.m07.d06:meMA.Ode8C1T.incipit	…
ltx/en_us_dedes/me.m07.d06:meMA.Ode8C1T.melody	@ltx/en_us_dedes/he.h.m8:heHE.EptaplasiosKaminon.name
ltx/en_us_dedes/me.m07.d06:meMA.Ode8C1T.mode	@ltx/en_us_dedes/miscellanea:misc.Mode8
ltx/en_us_dedes/me.m07.d06:meMA.Ode8C1T.ode	@ltx/en_us_dedes/miscellanea:misc.Ode8
ltx/en_us_dedes/me.m07.d06:meMA.Ode8C1T.text	
ltx/en_us_dedes/me.m07.d06:meMA.Ode8H.greekmelody	@ltx/en_us_dedes/he.h.m8:heHE.EptaplasiosKaminon.greekname
ltx/en_us_dedes/me.m07.d06:meMA.Ode8H.incipit	@ltx/en_us_dedes/he.h.m8:heHE.EptaplasiosKaminon.incipit
ltx/en_us_dedes/me.m07.d06:meMA.Ode8H.melody	@ltx/en_us_dedes/he.h.m8:heHE.EptaplasiosKaminon.melody
ltx/en_us_dedes/me.m07.d06:meMA.Ode8H.mode	@ltx/en_us_dedes/miscellanea:misc.Mode8
ltx/en_us_dedes/me.m07.d06:meMA.Ode8H.ode	@ltx/en_us_dedes/miscellanea:misc.Ode8
ltx/en_us_dedes/me.m07.d06:meMA.Ode8H.text	@ltx/en_us_dedes/he.h.m8:heHE.EptaplasiosKaminon.text
ltx/en_us_dedes/me.m07.d06:meMA.Ode9C11.greekmelody	@ltx/en_us_dedes/he.h.m8:heHE.EfrixePasaAkoi.greekname
ltx/en_us_dedes/me.m07.d06:meMA.Ode9C11.incipit	…
ltx/en_us_dedes/me.m07.d06:meMA.Ode9C11.melody	@ltx/en_us_dedes/he.h.m8:heHE.EfrixePasaAkoi.name
ltx/en_us_dedes/me.m07.d06:meMA.Ode9C11.mode	@ltx/en_us_dedes/miscellanea:misc.Mode8
ltx/en_us_dedes/me.m07.d06:meMA.Ode9C11.ode	@ltx/en_us_dedes/miscellanea:misc.Ode9
ltx/en_us_dedes/me.m07.d06:meMA.Ode9C11.text	
ltx/en_us_dedes/me.m07.d06:meMA.Ode9C12.incipit	…
ltx/en_us_dedes/me.m07.d06:meMA.Ode9C12.melody	@ltx/en_us_dedes/he.h.m8:heHE.EfrixePasaAkoi.name
ltx/en_us_dedes/me.m07.d06:meMA.Ode9C12.mode	@ltx/en_us_dedes/miscellanea:misc.Mode8
ltx/en_us_dedes/me.m07.d06:meMA.Ode9C12.ode	@ltx/en_us_dedes/miscellanea:misc.Ode9
ltx/en_us_dedes/me.m07.d06:meMA.Ode9C12.text	
ltx/en_us_dedes/me.m07.d06:meMA.Ode9C13.incipit	…
ltx/en_us_dedes/me.m07.d06:meMA.Ode9C13.melody	@ltx/en_us_dedes/he.h.m8:heHE.EfrixePasaAkoi.name
ltx/en_us_dedes/me.m07.d06:meMA.Ode9C13.mode	@ltx/en_us_dedes/miscellanea:misc.Mode8
ltx/en_us_dedes/me.m07.d06:meMA.Ode9C13.ode	@ltx/en_us_dedes/miscellanea:misc.Ode9
ltx/en_us_dedes/me.m07.d06:meMA.Ode9C13.text	
ltx/en_us_dedes/me.m07.d06:meMA.Ode9C1T.incipit	…
ltx/en_us_dedes/me.m07.d06:meMA.Ode9C1T.melody	@ltx/en_us_dedes/he.h.m8:heHE.EfrixePasaAkoi.name
ltx/en_us_dedes/me.m07.d06:meMA.Ode9C1T.mode	@ltx/en_us_dedes/miscellanea:misc.Mode8
ltx/en_us_dedes/me.m07.d06:meMA.Ode9C1T.ode	@ltx/en_us_dedes/miscellanea:misc.Ode9
ltx/en_us_dedes/me.m07.d06:meMA.Ode9C1T.text	
ltx/en_us_dedes/me.m07.d06:meMA.Ode9H.greekmelody	@ltx/en_us_dedes/he.h.m8:heHE.EfrixePasaAkoi.greekname
ltx/en_us_dedes/me.m07.d06:meMA.Ode9H.incipit	@ltx/en_us_dedes/he.h.m8:heHE.EfrixePasaAkoi.incipit
ltx/en_us_dedes/me.m07.d06:meMA.Ode9H.melody	@ltx/en_us_dedes/he.h.m8:heHE.EfrixePasaAkoi.melody
ltx/en_us_dedes/me.m07.d06:meMA.Ode9H.mode	@ltx/en_us_dedes/miscellanea:misc.Mode8
ltx/en_us_dedes/me.m07.d06:meMA.Ode9H.ode	@ltx/en_us_dedes/miscellanea:misc.Ode9
ltx/en_us_dedes/me.m07.d06:meMA.Ode9H.text	@ltx/en_us_dedes/he.h.m8:heHE.EfrixePasaAkoi.text
ltx/en_us_dedes/me.m07.d06:meVE.Apolytikion1.greekmelody	@ltx/en_us_dedes/he.ga:heGA.TisErimouPolitis.greekmelody
ltx/en_us_dedes/me.m07.d06:meVE.Apolytikion1.melody	@ltx/en_us_dedes/he.ga:heGA.TisErimouPolitis.name
ltx/en_us_dedes/me.m07.d06:meVE.Apolytikion1.mode	@ltx/en_us_dedes/miscellanea:misc.Mode1
ltx/en_us_dedes/me.m07.d06:meVE.Apolytikion2ger.greekmelody	@ltx/en_us_dedes/he.a.m5:heAU.TonSynanarchonLogon.greekname
ltx/en_us_dedes/me.m07.d06:meVE.Apolytikion2ger.incipit	…
ltx/en_us_dedes/me.m07.d06:meVE.Apolytikion2ger.melody	@ltx/en_us_dedes/he.a.m5:heAU.TonSynanarchonLogon.name
ltx/en_us_dedes/me.m07.d06:meVE.Apolytikion2ger.mode	@ltx/en_us_dedes/miscellanea:misc.Mode5
ltx/en_us_dedes/me.m07.d06:meVE.Apolytikion2ger.poet	@ltx/en_us_dedes/poets:po.Gerasimou
ltx/en_us_dedes/me.m07.d06:meVE.Apolytikion2ger.text	
ltx/en_us_dedes/me.m07.d06:meVE.GeneralApolytikion1.name	Sisoe,
ltx/en_us_dedes/me.m07.d06:meVE.SticStavrotheotokion.greekmelody	@ltx/en_us_dedes/he.a.m4:heAU.EdokasSimeiosin.greekname
ltx/en_us_dedes/me.m07.d06:meVE.SticStavrotheotokion.incipit	…
ltx/en_us_dedes/me.m07.d06:meVE.SticStavrotheotokion.melody	@ltx/en_us_dedes/he.a.m4:heAU.EdokasSimeiosin.name
ltx/en_us_dedes/me.m07.d06:meVE.SticStavrotheotokion.mode	@ltx/en_us_dedes/miscellanea:misc.Mode4
ltx/en_us_dedes/me.m07.d06:meVE.SticStavrotheotokion.text	
ltx/en_us_dedes/me.m07.d06:meVE.SticTheotokion.greekmelody	@ltx/en_us_dedes/he.a.m4:heAU.EdokasSimeiosin.greekname
ltx/en_us_dedes/me.m07.d06:meVE.SticTheotokion.incipit	@ltx/en_us_dedes/me.m06.d23:meVE.SticTheotokion.incipit
ltx/en_us_dedes/me.m07.d06:meVE.SticTheotokion.melody	@ltx/en_us_dedes/he.a.m4:heAU.EdokasSimeiosin.name
ltx/en_us_dedes/me.m07.d06:meVE.SticTheotokion.mode	@ltx/en_us_dedes/miscellanea:misc.Mode4
ltx/en_us_dedes/me.m07.d06:meVE.SticTheotokion.text	@ltx/en_us_dedes/me.m06.d23:meVE.SticTheotokion.text
ltx/en_us_dedes/me.m07.d06:meVE.Stichera01.greekmelody	@ltx/en_us_dedes/he.a.m4:heAU.EdokasSimeiosin.greekname
ltx/en_us_dedes/me.m07.d06:meVE.Stichera01.incipit	…
ltx/en_us_dedes/me.m07.d06:meVE.Stichera01.melody	@ltx/en_us_dedes/he.a.m4:heAU.EdokasSimeiosin.name
ltx/en_us_dedes/me.m07.d06:meVE.Stichera01.mode	@ltx/en_us_dedes/miscellanea:misc.Mode4
ltx/en_us_dedes/me.m07.d06:meVE.Stichera01.text	
ltx/en_us_dedes/me.m07.d06:meVE.Stichera02.incipit	…
ltx/en_us_dedes/me.m07.d06:meVE.Stichera02.melody	@ltx/en_us_dedes/he.a.m4:heAU.EdokasSimeiosin.name
ltx/en_us_dedes/me.m07.d06:meVE.Stichera02.mode	@ltx/en_us_dedes/miscellanea:misc.Mode4
ltx/en_us_dedes/me.m07.d06:meVE.Stichera02.text	
ltx/en_us_dedes/me.m07.d06:meVE.Stichera03.incipit	…
ltx/en_us_dedes/me.m07.d06:meVE.Stichera03.melody	@ltx/en_us_dedes/he.a.m4:heAU.EdokasSimeiosin.name
ltx/en_us_dedes/me.m07.d06:meVE.Stichera03.mode	@ltx/en_us_dedes/miscellanea:misc.Mode4
ltx/en_us_dedes/me.m07.d06:meVE.Stichera03.text	
