ltx/en_us_dedes/me.m12.d18:meDA.commemoration.first	Memory of the Holy Martyr Sebastian and those with him
ltx/en_us_dedes/me.m12.d18:meDA.commemoration.first_name	
ltx/en_us_dedes/me.m12.d18:meDA.commemoration.first_short	Memory of the Holy Martyr Sebastian and those with him
ltx/en_us_dedes/me.m12.d18:meDA.commemoration.first_title	@ltx/en_us_dedes/titles:ti.Martyrs
ltx/en_us_dedes/me.m12.d18:meDA.commemoration.full	Memory of the Holy Martyr Sebastian and those with him
ltx/en_us_dedes/me.m12.d18:meDA.commemoration.second_name	
ltx/en_us_dedes/me.m12.d18:meDA.commemoration.second_title	
ltx/en_us_dedes/me.m12.d18:meDA.date	December 18
ltx/en_us_dedes/me.m12.d18:meDA.fordate	for December 18
ltx/en_us_dedes/me.m12.d18:meDA.insert1	
ltx/en_us_dedes/me.m12.d18:meDA.insert2	
ltx/en_us_dedes/me.m12.d18:meDA.note	
ltx/en_us_dedes/me.m12.d18:meDA.pdfcoverdate	December 18,
ltx/en_us_dedes/me.m12.d18:meDA.pdfheaderdate	December 18
ltx/en_us_dedes/me.m12.d18:meHO.commemorations	
ltx/en_us_dedes/me.m12.d18:meHO.note1	
ltx/en_us_dedes/me.m12.d18:meHO.note2	
ltx/en_us_dedes/me.m12.d18:meHO.number	
ltx/en_us_dedes/me.m12.d18:meHO.rank	
ltx/en_us_dedes/me.m12.d18:meLE.commemoration1	
ltx/en_us_dedes/me.m12.d18:meLE.commemoration2	
ltx/en_us_dedes/me.m12.d18:meLI.Kontakion1.incipit	…
ltx/en_us_dedes/me.m12.d18:meLI.Kontakion1.melody	
ltx/en_us_dedes/me.m12.d18:meLI.Kontakion1.mode	
ltx/en_us_dedes/me.m12.d18:meLI.Kontakion1.text	
ltx/en_us_dedes/me.m12.d18:meLI.Megalynarion.text	
ltx/en_us_dedes/me.m12.d18:meMA.C1.acrostic.notice1	
ltx/en_us_dedes/me.m12.d18:meMA.C1.acrostic.text	
ltx/en_us_dedes/me.m12.d18:meMA.C1.acrostic.title	
ltx/en_us_dedes/me.m12.d18:meMA.C1.title	@ltx/en_us_dedes/titles:ti.CanonMartyrM
ltx/en_us_dedes/me.m12.d18:meMA.C1.verse	@ltx/en_us_dedes/prayers:pr.verse_SaintM.text
ltx/en_us_dedes/me.m12.d18:meMA.Ode1C11.greekmelody	@ltx/en_us_dedes/he.h.m1:heHE.SouITropaiouchos.greekname
ltx/en_us_dedes/me.m12.d18:meMA.Ode1C11.incipit	…
ltx/en_us_dedes/me.m12.d18:meMA.Ode1C11.melody	@ltx/en_us_dedes/he.h.m1:heHE.SouITropaiouchos.name
ltx/en_us_dedes/me.m12.d18:meMA.Ode1C11.mode	@ltx/en_us_dedes/miscellanea:misc.Mode1
ltx/en_us_dedes/me.m12.d18:meMA.Ode1C11.ode	@ltx/en_us_dedes/miscellanea:misc.Ode1
ltx/en_us_dedes/me.m12.d18:meMA.Ode1C11.text	
ltx/en_us_dedes/me.m12.d18:meMA.Ode1C12.incipit	…
ltx/en_us_dedes/me.m12.d18:meMA.Ode1C12.melody	@ltx/en_us_dedes/he.h.m1:heHE.SouITropaiouchos.name
ltx/en_us_dedes/me.m12.d18:meMA.Ode1C12.mode	@ltx/en_us_dedes/miscellanea:misc.Mode1
ltx/en_us_dedes/me.m12.d18:meMA.Ode1C12.ode	@ltx/en_us_dedes/miscellanea:misc.Ode1
ltx/en_us_dedes/me.m12.d18:meMA.Ode1C12.text	
ltx/en_us_dedes/me.m12.d18:meMA.Ode1C13.incipit	…
ltx/en_us_dedes/me.m12.d18:meMA.Ode1C13.melody	@ltx/en_us_dedes/he.h.m1:heHE.SouITropaiouchos.name
ltx/en_us_dedes/me.m12.d18:meMA.Ode1C13.mode	@ltx/en_us_dedes/miscellanea:misc.Mode1
ltx/en_us_dedes/me.m12.d18:meMA.Ode1C13.ode	@ltx/en_us_dedes/miscellanea:misc.Ode1
ltx/en_us_dedes/me.m12.d18:meMA.Ode1C13.text	
ltx/en_us_dedes/me.m12.d18:meMA.Ode1C14.incipit	…
ltx/en_us_dedes/me.m12.d18:meMA.Ode1C14.melody	@ltx/en_us_dedes/he.h.m1:heHE.SouITropaiouchos.name
ltx/en_us_dedes/me.m12.d18:meMA.Ode1C14.mode	@ltx/en_us_dedes/miscellanea:misc.Mode1
ltx/en_us_dedes/me.m12.d18:meMA.Ode1C14.ode	@ltx/en_us_dedes/miscellanea:misc.Ode1
ltx/en_us_dedes/me.m12.d18:meMA.Ode1C14.text	
ltx/en_us_dedes/me.m12.d18:meMA.Ode1C1T.incipit	…
ltx/en_us_dedes/me.m12.d18:meMA.Ode1C1T.melody	@ltx/en_us_dedes/he.h.m1:heHE.SouITropaiouchos.name
ltx/en_us_dedes/me.m12.d18:meMA.Ode1C1T.mode	@ltx/en_us_dedes/miscellanea:misc.Mode1
ltx/en_us_dedes/me.m12.d18:meMA.Ode1C1T.ode	@ltx/en_us_dedes/miscellanea:misc.Ode1
ltx/en_us_dedes/me.m12.d18:meMA.Ode1C1T.text	
ltx/en_us_dedes/me.m12.d18:meMA.Ode3C11.greekmelody	@ltx/en_us_dedes/he.h.m1:heHE.OMonosEidos.greekname
ltx/en_us_dedes/me.m12.d18:meMA.Ode3C11.incipit	…
ltx/en_us_dedes/me.m12.d18:meMA.Ode3C11.melody	@ltx/en_us_dedes/he.h.m1:heHE.OMonosEidos.name
ltx/en_us_dedes/me.m12.d18:meMA.Ode3C11.mode	@ltx/en_us_dedes/miscellanea:misc.Mode1
ltx/en_us_dedes/me.m12.d18:meMA.Ode3C11.ode	@ltx/en_us_dedes/miscellanea:misc.Ode3
ltx/en_us_dedes/me.m12.d18:meMA.Ode3C11.text	
ltx/en_us_dedes/me.m12.d18:meMA.Ode3C12.incipit	…
ltx/en_us_dedes/me.m12.d18:meMA.Ode3C12.melody	@ltx/en_us_dedes/he.h.m1:heHE.OMonosEidos.name
ltx/en_us_dedes/me.m12.d18:meMA.Ode3C12.mode	@ltx/en_us_dedes/miscellanea:misc.Mode1
ltx/en_us_dedes/me.m12.d18:meMA.Ode3C12.ode	@ltx/en_us_dedes/miscellanea:misc.Ode3
ltx/en_us_dedes/me.m12.d18:meMA.Ode3C12.text	
ltx/en_us_dedes/me.m12.d18:meMA.Ode3C13.incipit	…
ltx/en_us_dedes/me.m12.d18:meMA.Ode3C13.melody	@ltx/en_us_dedes/he.h.m1:heHE.OMonosEidos.name
ltx/en_us_dedes/me.m12.d18:meMA.Ode3C13.mode	@ltx/en_us_dedes/miscellanea:misc.Mode1
ltx/en_us_dedes/me.m12.d18:meMA.Ode3C13.ode	@ltx/en_us_dedes/miscellanea:misc.Ode3
ltx/en_us_dedes/me.m12.d18:meMA.Ode3C13.text	
ltx/en_us_dedes/me.m12.d18:meMA.Ode3C1T.incipit	…
ltx/en_us_dedes/me.m12.d18:meMA.Ode3C1T.melody	@ltx/en_us_dedes/he.h.m1:heHE.OMonosEidos.name
ltx/en_us_dedes/me.m12.d18:meMA.Ode3C1T.mode	@ltx/en_us_dedes/miscellanea:misc.Mode1
ltx/en_us_dedes/me.m12.d18:meMA.Ode3C1T.ode	@ltx/en_us_dedes/miscellanea:misc.Ode3
ltx/en_us_dedes/me.m12.d18:meMA.Ode3C1T.text	
ltx/en_us_dedes/me.m12.d18:meMA.Ode3H.greekmelody	@ltx/en_us_dedes/he.h.m1:heHE.OMonosEidos.greekname
ltx/en_us_dedes/me.m12.d18:meMA.Ode3H.incipit	@ltx/en_us_dedes/he.h.m1:heHE.OMonosEidos.incipit
ltx/en_us_dedes/me.m12.d18:meMA.Ode3H.melody	@ltx/en_us_dedes/he.h.m1:heHE.OMonosEidos.melody
ltx/en_us_dedes/me.m12.d18:meMA.Ode3H.mode	@ltx/en_us_dedes/miscellanea:misc.Mode1
ltx/en_us_dedes/me.m12.d18:meMA.Ode3H.ode	@ltx/en_us_dedes/miscellanea:misc.Ode3
ltx/en_us_dedes/me.m12.d18:meMA.Ode3H.text	@ltx/en_us_dedes/he.h.m1:heHE.OMonosEidos.text
ltx/en_us_dedes/me.m12.d18:meMA.Ode3Kathisma1.greekmelody	@ltx/en_us_dedes/he.a.m1:heAU.TonTafonSouSotir.greekname
ltx/en_us_dedes/me.m12.d18:meMA.Ode3Kathisma1.incipit	…
ltx/en_us_dedes/me.m12.d18:meMA.Ode3Kathisma1.melody	@ltx/en_us_dedes/he.a.m1:heAU.TonTafonSouSotir.name
ltx/en_us_dedes/me.m12.d18:meMA.Ode3Kathisma1.mode	@ltx/en_us_dedes/miscellanea:misc.Mode1
ltx/en_us_dedes/me.m12.d18:meMA.Ode3Kathisma1.text	
ltx/en_us_dedes/me.m12.d18:meMA.Ode3KathismaSt.incipit	…
ltx/en_us_dedes/me.m12.d18:meMA.Ode3KathismaSt.melody	@ltx/en_us_dedes/he.a.m1:heAU.TonTafonSouSotir.name
ltx/en_us_dedes/me.m12.d18:meMA.Ode3KathismaSt.mode	@ltx/en_us_dedes/miscellanea:misc.Mode1
ltx/en_us_dedes/me.m12.d18:meMA.Ode3KathismaSt.text	
ltx/en_us_dedes/me.m12.d18:meMA.Ode3KathismaT.incipit	…
ltx/en_us_dedes/me.m12.d18:meMA.Ode3KathismaT.melody	@ltx/en_us_dedes/he.a.m1:heAU.TonTafonSouSotir.name
ltx/en_us_dedes/me.m12.d18:meMA.Ode3KathismaT.mode	@ltx/en_us_dedes/miscellanea:misc.Mode1
ltx/en_us_dedes/me.m12.d18:meMA.Ode3KathismaT.text	
ltx/en_us_dedes/me.m12.d18:meMA.Ode4C11.greekmelody	@ltx/en_us_dedes/he.h.m1:heHE.OrosSeTiChariti.greekname
ltx/en_us_dedes/me.m12.d18:meMA.Ode4C11.incipit	…
ltx/en_us_dedes/me.m12.d18:meMA.Ode4C11.melody	@ltx/en_us_dedes/he.h.m1:heHE.OrosSeTiChariti.name
ltx/en_us_dedes/me.m12.d18:meMA.Ode4C11.mode	@ltx/en_us_dedes/miscellanea:misc.Mode1
ltx/en_us_dedes/me.m12.d18:meMA.Ode4C11.ode	@ltx/en_us_dedes/miscellanea:misc.Ode4
ltx/en_us_dedes/me.m12.d18:meMA.Ode4C11.text	
ltx/en_us_dedes/me.m12.d18:meMA.Ode4C12.incipit	…
ltx/en_us_dedes/me.m12.d18:meMA.Ode4C12.melody	@ltx/en_us_dedes/he.h.m1:heHE.OrosSeTiChariti.name
ltx/en_us_dedes/me.m12.d18:meMA.Ode4C12.mode	@ltx/en_us_dedes/miscellanea:misc.Mode1
ltx/en_us_dedes/me.m12.d18:meMA.Ode4C12.ode	@ltx/en_us_dedes/miscellanea:misc.Ode4
ltx/en_us_dedes/me.m12.d18:meMA.Ode4C12.text	
ltx/en_us_dedes/me.m12.d18:meMA.Ode4C13.incipit	…
ltx/en_us_dedes/me.m12.d18:meMA.Ode4C13.melody	@ltx/en_us_dedes/he.h.m1:heHE.OrosSeTiChariti.name
ltx/en_us_dedes/me.m12.d18:meMA.Ode4C13.mode	@ltx/en_us_dedes/miscellanea:misc.Mode1
ltx/en_us_dedes/me.m12.d18:meMA.Ode4C13.ode	@ltx/en_us_dedes/miscellanea:misc.Ode4
ltx/en_us_dedes/me.m12.d18:meMA.Ode4C13.text	
ltx/en_us_dedes/me.m12.d18:meMA.Ode4C14.incipit	…
ltx/en_us_dedes/me.m12.d18:meMA.Ode4C14.melody	@ltx/en_us_dedes/he.h.m1:heHE.OrosSeTiChariti.name
ltx/en_us_dedes/me.m12.d18:meMA.Ode4C14.mode	@ltx/en_us_dedes/miscellanea:misc.Mode1
ltx/en_us_dedes/me.m12.d18:meMA.Ode4C14.ode	@ltx/en_us_dedes/miscellanea:misc.Ode4
ltx/en_us_dedes/me.m12.d18:meMA.Ode4C14.text	
ltx/en_us_dedes/me.m12.d18:meMA.Ode4C1T.incipit	…
ltx/en_us_dedes/me.m12.d18:meMA.Ode4C1T.melody	@ltx/en_us_dedes/he.h.m1:heHE.OrosSeTiChariti.name
ltx/en_us_dedes/me.m12.d18:meMA.Ode4C1T.mode	@ltx/en_us_dedes/miscellanea:misc.Mode1
ltx/en_us_dedes/me.m12.d18:meMA.Ode4C1T.ode	@ltx/en_us_dedes/miscellanea:misc.Ode4
ltx/en_us_dedes/me.m12.d18:meMA.Ode4C1T.text	
ltx/en_us_dedes/me.m12.d18:meMA.Ode5C11.greekmelody	@ltx/en_us_dedes/he.h.m1:heHE.OFotisasTiEllampsei.greekname
ltx/en_us_dedes/me.m12.d18:meMA.Ode5C11.incipit	…
ltx/en_us_dedes/me.m12.d18:meMA.Ode5C11.melody	@ltx/en_us_dedes/he.h.m1:heHE.OFotisasTiEllampsei.name
ltx/en_us_dedes/me.m12.d18:meMA.Ode5C11.mode	@ltx/en_us_dedes/miscellanea:misc.Mode1
ltx/en_us_dedes/me.m12.d18:meMA.Ode5C11.ode	@ltx/en_us_dedes/miscellanea:misc.Ode5
ltx/en_us_dedes/me.m12.d18:meMA.Ode5C11.text	
ltx/en_us_dedes/me.m12.d18:meMA.Ode5C12.incipit	…
ltx/en_us_dedes/me.m12.d18:meMA.Ode5C12.melody	@ltx/en_us_dedes/he.h.m1:heHE.OFotisasTiEllampsei.name
ltx/en_us_dedes/me.m12.d18:meMA.Ode5C12.mode	@ltx/en_us_dedes/miscellanea:misc.Mode1
ltx/en_us_dedes/me.m12.d18:meMA.Ode5C12.ode	@ltx/en_us_dedes/miscellanea:misc.Ode5
ltx/en_us_dedes/me.m12.d18:meMA.Ode5C12.text	
ltx/en_us_dedes/me.m12.d18:meMA.Ode5C13.incipit	…
ltx/en_us_dedes/me.m12.d18:meMA.Ode5C13.melody	@ltx/en_us_dedes/he.h.m1:heHE.OFotisasTiEllampsei.name
ltx/en_us_dedes/me.m12.d18:meMA.Ode5C13.mode	@ltx/en_us_dedes/miscellanea:misc.Mode1
ltx/en_us_dedes/me.m12.d18:meMA.Ode5C13.ode	@ltx/en_us_dedes/miscellanea:misc.Ode5
ltx/en_us_dedes/me.m12.d18:meMA.Ode5C13.text	
ltx/en_us_dedes/me.m12.d18:meMA.Ode5C1T.incipit	…
ltx/en_us_dedes/me.m12.d18:meMA.Ode5C1T.melody	@ltx/en_us_dedes/he.h.m1:heHE.OFotisasTiEllampsei.name
ltx/en_us_dedes/me.m12.d18:meMA.Ode5C1T.mode	@ltx/en_us_dedes/miscellanea:misc.Mode1
ltx/en_us_dedes/me.m12.d18:meMA.Ode5C1T.ode	@ltx/en_us_dedes/miscellanea:misc.Ode5
ltx/en_us_dedes/me.m12.d18:meMA.Ode5C1T.text	
ltx/en_us_dedes/me.m12.d18:meMA.Ode6C11.greekmelody	@ltx/en_us_dedes/he.h.m1:heHE.EkyklosenImas.greekname
ltx/en_us_dedes/me.m12.d18:meMA.Ode6C11.incipit	…
ltx/en_us_dedes/me.m12.d18:meMA.Ode6C11.melody	@ltx/en_us_dedes/he.h.m1:heHE.EkyklosenImas.name
ltx/en_us_dedes/me.m12.d18:meMA.Ode6C11.mode	@ltx/en_us_dedes/miscellanea:misc.Mode1
ltx/en_us_dedes/me.m12.d18:meMA.Ode6C11.ode	@ltx/en_us_dedes/miscellanea:misc.Ode6
ltx/en_us_dedes/me.m12.d18:meMA.Ode6C11.text	
ltx/en_us_dedes/me.m12.d18:meMA.Ode6C12.incipit	…
ltx/en_us_dedes/me.m12.d18:meMA.Ode6C12.melody	@ltx/en_us_dedes/he.h.m1:heHE.EkyklosenImas.name
ltx/en_us_dedes/me.m12.d18:meMA.Ode6C12.mode	@ltx/en_us_dedes/miscellanea:misc.Mode1
ltx/en_us_dedes/me.m12.d18:meMA.Ode6C12.ode	@ltx/en_us_dedes/miscellanea:misc.Ode6
ltx/en_us_dedes/me.m12.d18:meMA.Ode6C12.text	
ltx/en_us_dedes/me.m12.d18:meMA.Ode6C13.incipit	…
ltx/en_us_dedes/me.m12.d18:meMA.Ode6C13.melody	@ltx/en_us_dedes/he.h.m1:heHE.EkyklosenImas.name
ltx/en_us_dedes/me.m12.d18:meMA.Ode6C13.mode	@ltx/en_us_dedes/miscellanea:misc.Mode1
ltx/en_us_dedes/me.m12.d18:meMA.Ode6C13.ode	@ltx/en_us_dedes/miscellanea:misc.Ode6
ltx/en_us_dedes/me.m12.d18:meMA.Ode6C13.text	
ltx/en_us_dedes/me.m12.d18:meMA.Ode6C1T.incipit	…
ltx/en_us_dedes/me.m12.d18:meMA.Ode6C1T.melody	@ltx/en_us_dedes/he.h.m1:heHE.EkyklosenImas.name
ltx/en_us_dedes/me.m12.d18:meMA.Ode6C1T.mode	@ltx/en_us_dedes/miscellanea:misc.Mode1
ltx/en_us_dedes/me.m12.d18:meMA.Ode6C1T.ode	@ltx/en_us_dedes/miscellanea:misc.Ode6
ltx/en_us_dedes/me.m12.d18:meMA.Ode6C1T.text	
ltx/en_us_dedes/me.m12.d18:meMA.Ode6H.greekmelody	@ltx/en_us_dedes/he.h.m1:heHE.EkyklosenImas.greekname
ltx/en_us_dedes/me.m12.d18:meMA.Ode6H.incipit	@ltx/en_us_dedes/he.h.m1:heHE.EkyklosenImas.incipit
ltx/en_us_dedes/me.m12.d18:meMA.Ode6H.melody	@ltx/en_us_dedes/he.h.m1:heHE.EkyklosenImas.melody
ltx/en_us_dedes/me.m12.d18:meMA.Ode6H.mode	@ltx/en_us_dedes/miscellanea:misc.Mode1
ltx/en_us_dedes/me.m12.d18:meMA.Ode6H.ode	@ltx/en_us_dedes/miscellanea:misc.Ode6
ltx/en_us_dedes/me.m12.d18:meMA.Ode6H.text	@ltx/en_us_dedes/he.h.m1:heHE.EkyklosenImas.text
ltx/en_us_dedes/me.m12.d18:meMA.Ode7C11.greekmelody	@ltx/en_us_dedes/he.h.m1:heHE.SeNoitin.greekname
ltx/en_us_dedes/me.m12.d18:meMA.Ode7C11.incipit	…
ltx/en_us_dedes/me.m12.d18:meMA.Ode7C11.melody	@ltx/en_us_dedes/he.h.m1:heHE.SeNoitin.name
ltx/en_us_dedes/me.m12.d18:meMA.Ode7C11.mode	@ltx/en_us_dedes/miscellanea:misc.Mode1
ltx/en_us_dedes/me.m12.d18:meMA.Ode7C11.ode	@ltx/en_us_dedes/miscellanea:misc.Ode7
ltx/en_us_dedes/me.m12.d18:meMA.Ode7C11.text	
ltx/en_us_dedes/me.m12.d18:meMA.Ode7C12.incipit	…
ltx/en_us_dedes/me.m12.d18:meMA.Ode7C12.melody	@ltx/en_us_dedes/he.h.m1:heHE.SeNoitin.name
ltx/en_us_dedes/me.m12.d18:meMA.Ode7C12.mode	@ltx/en_us_dedes/miscellanea:misc.Mode1
ltx/en_us_dedes/me.m12.d18:meMA.Ode7C12.ode	@ltx/en_us_dedes/miscellanea:misc.Ode7
ltx/en_us_dedes/me.m12.d18:meMA.Ode7C12.text	
ltx/en_us_dedes/me.m12.d18:meMA.Ode7C13.incipit	…
ltx/en_us_dedes/me.m12.d18:meMA.Ode7C13.melody	@ltx/en_us_dedes/he.h.m1:heHE.SeNoitin.name
ltx/en_us_dedes/me.m12.d18:meMA.Ode7C13.mode	@ltx/en_us_dedes/miscellanea:misc.Mode1
ltx/en_us_dedes/me.m12.d18:meMA.Ode7C13.ode	@ltx/en_us_dedes/miscellanea:misc.Ode7
ltx/en_us_dedes/me.m12.d18:meMA.Ode7C13.text	
ltx/en_us_dedes/me.m12.d18:meMA.Ode7C14.incipit	…
ltx/en_us_dedes/me.m12.d18:meMA.Ode7C14.melody	@ltx/en_us_dedes/he.h.m1:heHE.SeNoitin.name
ltx/en_us_dedes/me.m12.d18:meMA.Ode7C14.mode	@ltx/en_us_dedes/miscellanea:misc.Mode1
ltx/en_us_dedes/me.m12.d18:meMA.Ode7C14.ode	@ltx/en_us_dedes/miscellanea:misc.Ode7
ltx/en_us_dedes/me.m12.d18:meMA.Ode7C14.text	
ltx/en_us_dedes/me.m12.d18:meMA.Ode7C1T.incipit	…
ltx/en_us_dedes/me.m12.d18:meMA.Ode7C1T.melody	@ltx/en_us_dedes/he.h.m1:heHE.SeNoitin.name
ltx/en_us_dedes/me.m12.d18:meMA.Ode7C1T.mode	@ltx/en_us_dedes/miscellanea:misc.Mode1
ltx/en_us_dedes/me.m12.d18:meMA.Ode7C1T.ode	@ltx/en_us_dedes/miscellanea:misc.Ode7
ltx/en_us_dedes/me.m12.d18:meMA.Ode7C1T.text	
ltx/en_us_dedes/me.m12.d18:meMA.Ode8C11.greekmelody	@ltx/en_us_dedes/he.h.m1:heHE.EnKaminoPaides.greekname
ltx/en_us_dedes/me.m12.d18:meMA.Ode8C11.incipit	…
ltx/en_us_dedes/me.m12.d18:meMA.Ode8C11.melody	@ltx/en_us_dedes/he.h.m1:heHE.EnKaminoPaides.name
ltx/en_us_dedes/me.m12.d18:meMA.Ode8C11.mode	@ltx/en_us_dedes/miscellanea:misc.Mode1
ltx/en_us_dedes/me.m12.d18:meMA.Ode8C11.ode	@ltx/en_us_dedes/miscellanea:misc.Ode8
ltx/en_us_dedes/me.m12.d18:meMA.Ode8C11.text	
ltx/en_us_dedes/me.m12.d18:meMA.Ode8C12.incipit	…
ltx/en_us_dedes/me.m12.d18:meMA.Ode8C12.melody	@ltx/en_us_dedes/he.h.m1:heHE.EnKaminoPaides.name
ltx/en_us_dedes/me.m12.d18:meMA.Ode8C12.mode	@ltx/en_us_dedes/miscellanea:misc.Mode1
ltx/en_us_dedes/me.m12.d18:meMA.Ode8C12.ode	@ltx/en_us_dedes/miscellanea:misc.Ode8
ltx/en_us_dedes/me.m12.d18:meMA.Ode8C12.text	
ltx/en_us_dedes/me.m12.d18:meMA.Ode8C13.incipit	…
ltx/en_us_dedes/me.m12.d18:meMA.Ode8C13.melody	@ltx/en_us_dedes/he.h.m1:heHE.EnKaminoPaides.name
ltx/en_us_dedes/me.m12.d18:meMA.Ode8C13.mode	@ltx/en_us_dedes/miscellanea:misc.Mode1
ltx/en_us_dedes/me.m12.d18:meMA.Ode8C13.ode	@ltx/en_us_dedes/miscellanea:misc.Ode8
ltx/en_us_dedes/me.m12.d18:meMA.Ode8C13.text	
ltx/en_us_dedes/me.m12.d18:meMA.Ode8C1T.incipit	…
ltx/en_us_dedes/me.m12.d18:meMA.Ode8C1T.melody	@ltx/en_us_dedes/he.h.m1:heHE.EnKaminoPaides.name
ltx/en_us_dedes/me.m12.d18:meMA.Ode8C1T.mode	@ltx/en_us_dedes/miscellanea:misc.Mode1
ltx/en_us_dedes/me.m12.d18:meMA.Ode8C1T.ode	@ltx/en_us_dedes/miscellanea:misc.Ode8
ltx/en_us_dedes/me.m12.d18:meMA.Ode8C1T.text	
ltx/en_us_dedes/me.m12.d18:meMA.Ode8H.greekmelody	@ltx/en_us_dedes/he.h.m1:heHE.EnKaminoPaides.greekname
ltx/en_us_dedes/me.m12.d18:meMA.Ode8H.incipit	@ltx/en_us_dedes/he.h.m1:heHE.EnKaminoPaides.incipit
ltx/en_us_dedes/me.m12.d18:meMA.Ode8H.melody	@ltx/en_us_dedes/he.h.m1:heHE.EnKaminoPaides.melody
ltx/en_us_dedes/me.m12.d18:meMA.Ode8H.mode	@ltx/en_us_dedes/miscellanea:misc.Mode1
ltx/en_us_dedes/me.m12.d18:meMA.Ode8H.ode	@ltx/en_us_dedes/miscellanea:misc.Ode8
ltx/en_us_dedes/me.m12.d18:meMA.Ode8H.text	@ltx/en_us_dedes/he.h.m1:heHE.EnKaminoPaides.text
ltx/en_us_dedes/me.m12.d18:meMA.Ode9C11.greekmelody	@ltx/en_us_dedes/he.h.m1:heHE.TyponTisAgnis.greekname
ltx/en_us_dedes/me.m12.d18:meMA.Ode9C11.incipit	…
ltx/en_us_dedes/me.m12.d18:meMA.Ode9C11.melody	@ltx/en_us_dedes/he.h.m1:heHE.TyponTisAgnis.name
ltx/en_us_dedes/me.m12.d18:meMA.Ode9C11.mode	@ltx/en_us_dedes/miscellanea:misc.Mode1
ltx/en_us_dedes/me.m12.d18:meMA.Ode9C11.ode	@ltx/en_us_dedes/miscellanea:misc.Ode9
ltx/en_us_dedes/me.m12.d18:meMA.Ode9C11.text	
ltx/en_us_dedes/me.m12.d18:meMA.Ode9C12.incipit	…
ltx/en_us_dedes/me.m12.d18:meMA.Ode9C12.melody	@ltx/en_us_dedes/he.h.m1:heHE.TyponTisAgnis.name
ltx/en_us_dedes/me.m12.d18:meMA.Ode9C12.mode	@ltx/en_us_dedes/miscellanea:misc.Mode1
ltx/en_us_dedes/me.m12.d18:meMA.Ode9C12.ode	@ltx/en_us_dedes/miscellanea:misc.Ode9
ltx/en_us_dedes/me.m12.d18:meMA.Ode9C12.text	
ltx/en_us_dedes/me.m12.d18:meMA.Ode9C13.incipit	…
ltx/en_us_dedes/me.m12.d18:meMA.Ode9C13.melody	@ltx/en_us_dedes/he.h.m1:heHE.TyponTisAgnis.name
ltx/en_us_dedes/me.m12.d18:meMA.Ode9C13.mode	@ltx/en_us_dedes/miscellanea:misc.Mode1
ltx/en_us_dedes/me.m12.d18:meMA.Ode9C13.ode	@ltx/en_us_dedes/miscellanea:misc.Ode9
ltx/en_us_dedes/me.m12.d18:meMA.Ode9C13.text	
ltx/en_us_dedes/me.m12.d18:meMA.Ode9C14.incipit	…
ltx/en_us_dedes/me.m12.d18:meMA.Ode9C14.melody	@ltx/en_us_dedes/he.h.m1:heHE.TyponTisAgnis.name
ltx/en_us_dedes/me.m12.d18:meMA.Ode9C14.mode	@ltx/en_us_dedes/miscellanea:misc.Mode1
ltx/en_us_dedes/me.m12.d18:meMA.Ode9C14.ode	@ltx/en_us_dedes/miscellanea:misc.Ode9
ltx/en_us_dedes/me.m12.d18:meMA.Ode9C14.text	
ltx/en_us_dedes/me.m12.d18:meMA.Ode9C1T.incipit	…
ltx/en_us_dedes/me.m12.d18:meMA.Ode9C1T.melody	@ltx/en_us_dedes/he.h.m1:heHE.TyponTisAgnis.name
ltx/en_us_dedes/me.m12.d18:meMA.Ode9C1T.mode	@ltx/en_us_dedes/miscellanea:misc.Mode1
ltx/en_us_dedes/me.m12.d18:meMA.Ode9C1T.ode	@ltx/en_us_dedes/miscellanea:misc.Ode9
ltx/en_us_dedes/me.m12.d18:meMA.Ode9C1T.text	
ltx/en_us_dedes/me.m12.d18:meMA.Ode9H.greekmelody	@ltx/en_us_dedes/he.h.m1:heHE.TyponTisAgnis.greekname
ltx/en_us_dedes/me.m12.d18:meMA.Ode9H.incipit	@ltx/en_us_dedes/he.h.m1:heHE.TyponTisAgnis.incipit
ltx/en_us_dedes/me.m12.d18:meMA.Ode9H.melody	@ltx/en_us_dedes/he.h.m1:heHE.TyponTisAgnis.melody
ltx/en_us_dedes/me.m12.d18:meMA.Ode9H.mode	@ltx/en_us_dedes/miscellanea:misc.Mode1
ltx/en_us_dedes/me.m12.d18:meMA.Ode9H.ode	@ltx/en_us_dedes/miscellanea:misc.Ode9
ltx/en_us_dedes/me.m12.d18:meMA.Ode9H.text	@ltx/en_us_dedes/he.h.m1:heHE.TyponTisAgnis.text
ltx/en_us_dedes/me.m12.d18:meVE.Apolytikion1ger.greekmelody	@ltx/en_us_dedes/he.a.m1:heAU.TisErimouPolitis.greekname
ltx/en_us_dedes/me.m12.d18:meVE.Apolytikion1ger.incipit	…
ltx/en_us_dedes/me.m12.d18:meVE.Apolytikion1ger.melody	@ltx/en_us_dedes/he.a.m1:heAU.TisErimouPolitis.name
ltx/en_us_dedes/me.m12.d18:meVE.Apolytikion1ger.mode	@ltx/en_us_dedes/miscellanea:misc.Mode1
ltx/en_us_dedes/me.m12.d18:meVE.Apolytikion1ger.poet	@ltx/en_us_dedes/poets:po.Gerasimou
ltx/en_us_dedes/me.m12.d18:meVE.Apolytikion1ger.text	
ltx/en_us_dedes/me.m12.d18:meVE.SticStavrotheotokion.greekmelody	@ltx/en_us_dedes/he.a.m1:heAU.PaneffimoiMartyres.greekname
ltx/en_us_dedes/me.m12.d18:meVE.SticStavrotheotokion.incipit	@ltx/en_us_dedes/oc.m1.d4:ocVE.SticTheotokion.incipit
ltx/en_us_dedes/me.m12.d18:meVE.SticStavrotheotokion.melody	@ltx/en_us_dedes/he.a.m1:heAU.PaneffimoiMartyres.name
ltx/en_us_dedes/me.m12.d18:meVE.SticStavrotheotokion.mode	@ltx/en_us_dedes/miscellanea:misc.Mode1
ltx/en_us_dedes/me.m12.d18:meVE.SticStavrotheotokion.text	@ltx/en_us_dedes/oc.m1.d4:ocVE.SticTheotokion.text
ltx/en_us_dedes/me.m12.d18:meVE.SticTheotokion.greekmelody	@ltx/en_us_dedes/he.a.m1:heAU.PaneffimoiMartyres.greekname
ltx/en_us_dedes/me.m12.d18:meVE.SticTheotokion.incipit	All-laudable Virgin, Moses saw *…
ltx/en_us_dedes/me.m12.d18:meVE.SticTheotokion.melody	@ltx/en_us_dedes/he.a.m1:heAU.PaneffimoiMartyres.name
ltx/en_us_dedes/me.m12.d18:meVE.SticTheotokion.mode	@ltx/en_us_dedes/miscellanea:misc.Mode1
ltx/en_us_dedes/me.m12.d18:meVE.SticTheotokion.text	All-laudable Virgin, Moses saw * with his own prophetic eyes of old the mystery wrought in you when he beheld the bush * unconsumed though burning. * For in you the fire of Divinity in no way consumed your womb. And therefore we entreat * you the Mother of our Lord and God, * to grant mercy, * O pure one, and peace to your world.
ltx/en_us_dedes/me.m12.d18:meVE.Stichera01.greekmelody	@ltx/en_us_dedes/he.a.m1:heAU.PaneffimoiMartyres.greekname
ltx/en_us_dedes/me.m12.d18:meVE.Stichera01.incipit	…
ltx/en_us_dedes/me.m12.d18:meVE.Stichera01.melody	@ltx/en_us_dedes/he.a.m1:heAU.PaneffimoiMartyres.name
ltx/en_us_dedes/me.m12.d18:meVE.Stichera01.mode	@ltx/en_us_dedes/miscellanea:misc.Mode1
ltx/en_us_dedes/me.m12.d18:meVE.Stichera01.text	
ltx/en_us_dedes/me.m12.d18:meVE.Stichera02.incipit	…
ltx/en_us_dedes/me.m12.d18:meVE.Stichera02.melody	@ltx/en_us_dedes/he.a.m1:heAU.PaneffimoiMartyres.name
ltx/en_us_dedes/me.m12.d18:meVE.Stichera02.mode	@ltx/en_us_dedes/miscellanea:misc.Mode1
ltx/en_us_dedes/me.m12.d18:meVE.Stichera02.text	
ltx/en_us_dedes/me.m12.d18:meVE.Stichera03.incipit	…
ltx/en_us_dedes/me.m12.d18:meVE.Stichera03.melody	@ltx/en_us_dedes/he.a.m1:heAU.PaneffimoiMartyres.name
ltx/en_us_dedes/me.m12.d18:meVE.Stichera03.mode	@ltx/en_us_dedes/miscellanea:misc.Mode1
ltx/en_us_dedes/me.m12.d18:meVE.Stichera03.text	
