ltx/en_us_dedes/me.m02.d10:meCO.SupplicationVerse.text	
ltx/en_us_dedes/me.m02.d10:meDA.commemoration.first	Memory of the Holy Hieromartyr Haralambos
ltx/en_us_dedes/me.m02.d10:meDA.commemoration.first_name	St. Haralambos
ltx/en_us_dedes/me.m02.d10:meDA.commemoration.first_short	Memory of the Holy Hieromartyr Haralambos
ltx/en_us_dedes/me.m02.d10:meDA.commemoration.first_title	@ltx/en_us_dedes/titles:ti.SaintM
ltx/en_us_dedes/me.m02.d10:meDA.commemoration.full	Memory of the Holy Hieromartyr Haralambos the Wonder-worker
ltx/en_us_dedes/me.m02.d10:meDA.commemoration.second_name	
ltx/en_us_dedes/me.m02.d10:meDA.commemoration.second_title	
ltx/en_us_dedes/me.m02.d10:meDA.date	February 10
ltx/en_us_dedes/me.m02.d10:meDA.fordate	for February 10
ltx/en_us_dedes/me.m02.d10:meDA.insert1	the holy and glorious hieromartyr Haralambos the Wonder-worker,
ltx/en_us_dedes/me.m02.d10:meDA.insert2	whose memory we celebrate;
ltx/en_us_dedes/me.m02.d10:meDA.note	
ltx/en_us_dedes/me.m02.d10:meDA.pdfcoverdate	February 10,
ltx/en_us_dedes/me.m02.d10:meDA.pdfheaderdate	February 10
ltx/en_us_dedes/me.m02.d10:meHO.commemorations	
ltx/en_us_dedes/me.m02.d10:meHO.note1	@ltx/en_us_dedes/rubrical:ru.HolidayWineOil
ltx/en_us_dedes/me.m02.d10:meHO.note2	
ltx/en_us_dedes/me.m02.d10:meHO.number	
ltx/en_us_dedes/me.m02.d10:meHO.rank	
ltx/en_us_dedes/me.m02.d10:meLE.commemoration1	The Holy Hieromartyr Charalambos.
ltx/en_us_dedes/me.m02.d10:meLE.commemoration2	
ltx/en_us_dedes/me.m02.d10:meLI.Kontakion1.greekmelody	@ltx/en_us_dedes/me.m02.d10:meMA.Kontakion1.greekmelody
ltx/en_us_dedes/me.m02.d10:meLI.Kontakion1.incipit	@ltx/en_us_dedes/me.m02.d10:meMA.Kontakion1.incipit
ltx/en_us_dedes/me.m02.d10:meLI.Kontakion1.melody	@ltx/en_us_dedes/me.m02.d10:meMA.Kontakion1.melody
ltx/en_us_dedes/me.m02.d10:meLI.Kontakion1.mode	@ltx/en_us_dedes/me.m02.d10:meMA.Kontakion1.mode
ltx/en_us_dedes/me.m02.d10:meLI.Kontakion1.text	@ltx/en_us_dedes/me.m02.d10:meMA.Kontakion1.text
ltx/en_us_dedes/me.m02.d10:meLI.MM.CommunionHymn.text	@ltx/en_us_dedes/properties:media.key
ltx/en_us_dedes/me.m02.d10:meLI.Megalynarion.text	
ltx/en_us_dedes/me.m02.d10:meMA.C1.title	@ltx/en_us_dedes/titles:ti.Canon1SaintM
ltx/en_us_dedes/me.m02.d10:meMA.C1.verse	@ltx/en_us_dedes/prayers:pr.verse_SaintM.text
ltx/en_us_dedes/me.m02.d10:meMA.C2.title	@ltx/en_us_dedes/titles:ti.Canon2SaintM
ltx/en_us_dedes/me.m02.d10:meMA.C2.verse	@ltx/en_us_dedes/prayers:pr.verse_SaintM.text
ltx/en_us_dedes/me.m02.d10:meMA.ExapTheotokion.incipit	O Mary, as the place…
ltx/en_us_dedes/me.m02.d10:meMA.ExapTheotokion.melody	@ltx/en_us_dedes/he.a.m2:heAU.GynaikesAkoutisthite.name
ltx/en_us_dedes/me.m02.d10:meMA.ExapTheotokion.mode	@ltx/en_us_dedes/miscellanea:misc.Mode2
ltx/en_us_dedes/me.m02.d10:meMA.ExapTheotokion.text	O Mary, as the place we go * for refuge, pride of Christians all, * guard and protect us your servants * from harm and keep us uninjured. * With longing we extol you now. * We pray you to deliver us * from dangerous predicaments, * through your intense intercession * and prayers to your Son and our God.
ltx/en_us_dedes/me.m02.d10:meMA.Exaposteilarion1.greekmelody	@ltx/en_us_dedes/he.a.m2:heAU.GynaikesAkoutisthite.greekname
ltx/en_us_dedes/me.m02.d10:meMA.Exaposteilarion1.incipit	Your flame of love was…
ltx/en_us_dedes/me.m02.d10:meMA.Exaposteilarion1.melody	@ltx/en_us_dedes/he.a.m2:heAU.GynaikesAkoutisthite.name
ltx/en_us_dedes/me.m02.d10:meMA.Exaposteilarion1.mode	@ltx/en_us_dedes/miscellanea:misc.Mode2
ltx/en_us_dedes/me.m02.d10:meMA.Exaposteilarion1.text	Your flame of love was lit by God; * and longing for the King of all, * O blessed Saint, very bravely * you threw down the prideful serpent; * and you rebuked the inhumane * and brutal tyrant Severus, * O Hieromartyr Haralambos. * And you received worthy honor * and your reward from the Master.
ltx/en_us_dedes/me.m02.d10:meMA.Kathisma11.greekmelody	@ltx/en_us_dedes/he.a.m3:heAU.TheiasPisteos.greekname
ltx/en_us_dedes/me.m02.d10:meMA.Kathisma11.incipit	By your works of faith…
ltx/en_us_dedes/me.m02.d10:meMA.Kathisma11.melody	@ltx/en_us_dedes/he.a.m3:heAU.TheiasPisteos.name
ltx/en_us_dedes/me.m02.d10:meMA.Kathisma11.mode	@ltx/en_us_dedes/miscellanea:misc.Mode3
ltx/en_us_dedes/me.m02.d10:meMA.Kathisma11.text	By your works of faith you were distinguished. * Pagan error was by you extinguished. * You were a soldier of Christ, O Haralambos. * You put to shame the arrays of the lawless hosts * and raised a trophy to God, O all-blessed one. * Glorious Martyr, pray now to Christ our God, * entreating that He grant us His great mercy.
ltx/en_us_dedes/me.m02.d10:meMA.Kathisma1T.incipit	What a miracle, O Theotokos…
ltx/en_us_dedes/me.m02.d10:meMA.Kathisma1T.melody	@ltx/en_us_dedes/he.a.m3:heAU.TheiasPisteos.name
ltx/en_us_dedes/me.m02.d10:meMA.Kathisma1T.mode	@ltx/en_us_dedes/miscellanea:misc.Mode3
ltx/en_us_dedes/me.m02.d10:meMA.Kathisma1T.text	What a miracle, O Theotokos, * that you carried Him in your embraces, * the very Lord, who has the whole world in His hand; * and that you breastfed the Maker and Nurturer * of all creation! O Mother and Virgin, pure * and immaculate, to Him now pray fervently, * entreating that He grant us His great mercy.
ltx/en_us_dedes/me.m02.d10:meMA.Kathisma21.greekmelody	@ltx/en_us_dedes/he.a.m4:heAU.EpefanisSimeron.greekname
ltx/en_us_dedes/me.m02.d10:meMA.Kathisma21.incipit	From the East you shone…
ltx/en_us_dedes/me.m02.d10:meMA.Kathisma21.melody	@ltx/en_us_dedes/he.a.m4:heAU.EpefanisSimeron.name
ltx/en_us_dedes/me.m02.d10:meMA.Kathisma21.mode	@ltx/en_us_dedes/miscellanea:misc.Mode4
ltx/en_us_dedes/me.m02.d10:meMA.Kathisma21.text	From the East you shone forth as a luminary, * you illumined believers with the flashes of your miracles, * O Hieromartyr Haralambos. * Therefore we honor your relics which God deified.
ltx/en_us_dedes/me.m02.d10:meMA.Kathisma22.greekmelody	@ltx/en_us_dedes/he.a.m4:heAU.EpefanisSimeron.greekname
ltx/en_us_dedes/me.m02.d10:meMA.Kathisma22.incipit	The all-holy Spirit showed you…
ltx/en_us_dedes/me.m02.d10:meMA.Kathisma22.melody	@ltx/en_us_dedes/he.a.m4:heAU.EpefanisSimeron.name
ltx/en_us_dedes/me.m02.d10:meMA.Kathisma22.mode	@ltx/en_us_dedes/miscellanea:misc.Mode4
ltx/en_us_dedes/me.m02.d10:meMA.Kathisma22.text	The all-holy Spirit showed you to be sacred * as a priest, and you became a sacred victim, offered up * to the divine Word, most sacred and * wise Hieromartyr. * By God you were glorified.
ltx/en_us_dedes/me.m02.d10:meMA.Kathisma2T.incipit	Moses saw the burning bush…
ltx/en_us_dedes/me.m02.d10:meMA.Kathisma2T.melody	@ltx/en_us_dedes/he.a.m4:heAU.EpefanisSimeron.name
ltx/en_us_dedes/me.m02.d10:meMA.Kathisma2T.mode	@ltx/en_us_dedes/miscellanea:misc.Mode4
ltx/en_us_dedes/me.m02.d10:meMA.Kathisma2T.text	Moses saw the burning bush, * therein perceiving * you, the one who held the fire * that leads our souls into the light, * and you were not burnt, all-blameless one, * Lady, but rather * were filled with the dew of grace.
ltx/en_us_dedes/me.m02.d10:meMA.Kathisma31.greekmelody	@ltx/en_us_dedes/he.a.m3:heAU.TinOraiotita.greekname
ltx/en_us_dedes/me.m02.d10:meMA.Kathisma31.incipit	Seeing the purity, O Martyr…
ltx/en_us_dedes/me.m02.d10:meMA.Kathisma31.melody	@ltx/en_us_dedes/he.a.m3:heAU.TinOraiotita.name
ltx/en_us_dedes/me.m02.d10:meMA.Kathisma31.mode	@ltx/en_us_dedes/miscellanea:misc.Mode3
ltx/en_us_dedes/me.m02.d10:meMA.Kathisma31.text	Seeing the purity, O Martyr, of your life, * and how resplendently shone forth your martyrdom, * O Saint Haralambos, amazed was Greece, and with joy she calls out: * “On this day we venerate * and we honor your holy skull. * Crush the prideful insolence * of our arrogant enemies; * deliver us from all kinds of danger * and from diseases, as we sing your praise.”
ltx/en_us_dedes/me.m02.d10:meMA.Kathisma3T.incipit	Let us sing hymns in…
ltx/en_us_dedes/me.m02.d10:meMA.Kathisma3T.melody	@ltx/en_us_dedes/he.a.m3:heAU.TinOraiotita.name
ltx/en_us_dedes/me.m02.d10:meMA.Kathisma3T.mode	@ltx/en_us_dedes/miscellanea:misc.Mode3
ltx/en_us_dedes/me.m02.d10:meMA.Kathisma3T.text	Let us sing hymns in praise * of her who knew no man * and yet gave birth to God, * and held within her womb * the One whom nothing can contain, * the all-holy Theotokos. * Only she was capable * of redeeming the human race * from the curse by giving birth * to the Savior and God of all. * And let us say to her all together: * “Rejoice, O Lady full of grace.”
ltx/en_us_dedes/me.m02.d10:meMA.Kontakion1.greekmelody	@ltx/en_us_dedes/he.a.m4:heAU.EpefanisSimeron.greekname
ltx/en_us_dedes/me.m02.d10:meMA.Kontakion1.incipit	Since the holy Church of…
ltx/en_us_dedes/me.m02.d10:meMA.Kontakion1.melody	@ltx/en_us_dedes/he.a.m4:heAU.EpefanisSimeron.name
ltx/en_us_dedes/me.m02.d10:meMA.Kontakion1.mode	@ltx/en_us_dedes/miscellanea:misc.Mode4
ltx/en_us_dedes/me.m02.d10:meMA.Kontakion1.text	Since the holy Church of Christ is in possession of your highly honored skull as priceless treasure, she is glad, O Hieromartyr Haralambos. Therefore she praises the Maker of all with joy.
ltx/en_us_dedes/me.m02.d10:meMA.Lauds1.greekmelody	@ltx/en_us_dedes/he.a.m1:heAU.TonOuranionTagmaton.greekname
ltx/en_us_dedes/me.m02.d10:meMA.Lauds1.incipit	Come all you children of…
ltx/en_us_dedes/me.m02.d10:meMA.Lauds1.melody	@ltx/en_us_dedes/he.a.m1:heAU.TonOuranionTagmaton.name
ltx/en_us_dedes/me.m02.d10:meMA.Lauds1.mode	@ltx/en_us_dedes/miscellanea:misc.Mode1
ltx/en_us_dedes/me.m02.d10:meMA.Lauds1.text	Come all you children of Greece now, * and you who love the Saints, * let us give rightful honor * to the skull of the Martyr * Haralambos, saluting it with a kiss; * for he preached in the stadium * that Christ is God and Creator, and he rebuked * the deception of the impious.
ltx/en_us_dedes/me.m02.d10:meMA.Lauds2.incipit	Thrice-blessed Saint, you are numbered…
ltx/en_us_dedes/me.m02.d10:meMA.Lauds2.melody	@ltx/en_us_dedes/he.a.m1:heAU.TonOuranionTagmaton.name
ltx/en_us_dedes/me.m02.d10:meMA.Lauds2.mode	@ltx/en_us_dedes/miscellanea:misc.Mode1
ltx/en_us_dedes/me.m02.d10:meMA.Lauds2.text	Thrice-blessed Saint, you are numbered * with the celestial hosts, * and as you stand in honor * near the Trinity, Father, * you pray for us who honor your precious skull * with devout faith and reverence. * O Hieromartyr Haralambos, we entreat * that you keep us safe from any harm.
ltx/en_us_dedes/me.m02.d10:meMA.Lauds3.incipit	In all of Greece has…
ltx/en_us_dedes/me.m02.d10:meMA.Lauds3.melody	@ltx/en_us_dedes/he.a.m1:heAU.TonOuranionTagmaton.name
ltx/en_us_dedes/me.m02.d10:meMA.Lauds3.mode	@ltx/en_us_dedes/miscellanea:misc.Mode1
ltx/en_us_dedes/me.m02.d10:meMA.Lauds3.text	In all of Greece has the festive * and bright memorial * of holy Hieromartyr Saint Haralambos risen * most glorious and splendid; for she is blest * to possess his most honored skull, * which had proclaimed Christ the Savior, both God and man. * Hence she celebrates it festively.
ltx/en_us_dedes/me.m02.d10:meMA.LaudsGlory.incipit	Your precious skull, O divine…
ltx/en_us_dedes/me.m02.d10:meMA.LaudsGlory.melody	
ltx/en_us_dedes/me.m02.d10:meMA.LaudsGlory.mode	@ltx/en_us_dedes/miscellanea:misc.Mode5
ltx/en_us_dedes/me.m02.d10:meMA.LaudsGlory.text	Your precious skull, O divine Saint, is like an alabaster box that is full and pouring out cures, like very costly fragrant oil. It wondrously perfumes the faithful, and it delivers from every evil those who approach it with faith. It exterminates foul-smelling delusion, diseases of every kind, and the pandemic plague, and it grants good health to all, as well as peace and great mercy.
ltx/en_us_dedes/me.m02.d10:meMA.LaudsTheotokion.incipit	@ltx/en_us_dedes/oc.m5.d3:ocVE.AposTheotokion.incipit
ltx/en_us_dedes/me.m02.d10:meMA.LaudsTheotokion.melody	
ltx/en_us_dedes/me.m02.d10:meMA.LaudsTheotokion.mode	@ltx/en_us_dedes/miscellanea:misc.Mode5
ltx/en_us_dedes/me.m02.d10:meMA.LaudsTheotokion.text	@ltx/en_us_dedes/oc.m5.d3:ocVE.AposTheotokion.text
ltx/en_us_dedes/me.m02.d10:meMA.MM.Lauds1123as5678.text	@ltx/en_us_dedes/properties:media.key
ltx/en_us_dedes/me.m02.d10:meMA.MM.Lauds123as456.text	@ltx/en_us_dedes/properties:media.key
ltx/en_us_dedes/me.m02.d10:meMA.Ode1C11.greekmelody	@ltx/en_us_dedes/he.h.m6:heHE.OsEnIpeiroPezefsas.greekname
ltx/en_us_dedes/me.m02.d10:meMA.Ode1C11.incipit	…
ltx/en_us_dedes/me.m02.d10:meMA.Ode1C11.melody	@ltx/en_us_dedes/he.h.m6:heHE.OsEnIpeiroPezefsas.name
ltx/en_us_dedes/me.m02.d10:meMA.Ode1C11.mode	@ltx/en_us_dedes/miscellanea:misc.Mode6
ltx/en_us_dedes/me.m02.d10:meMA.Ode1C11.ode	@ltx/en_us_dedes/miscellanea:misc.Ode1
ltx/en_us_dedes/me.m02.d10:meMA.Ode1C11.text	
ltx/en_us_dedes/me.m02.d10:meMA.Ode1C12.incipit	…
ltx/en_us_dedes/me.m02.d10:meMA.Ode1C12.melody	@ltx/en_us_dedes/he.h.m6:heHE.OsEnIpeiroPezefsas.name
ltx/en_us_dedes/me.m02.d10:meMA.Ode1C12.mode	@ltx/en_us_dedes/miscellanea:misc.Mode6
ltx/en_us_dedes/me.m02.d10:meMA.Ode1C12.ode	@ltx/en_us_dedes/miscellanea:misc.Ode1
ltx/en_us_dedes/me.m02.d10:meMA.Ode1C12.text	
ltx/en_us_dedes/me.m02.d10:meMA.Ode1C13.incipit	…
ltx/en_us_dedes/me.m02.d10:meMA.Ode1C13.melody	@ltx/en_us_dedes/he.h.m6:heHE.OsEnIpeiroPezefsas.name
ltx/en_us_dedes/me.m02.d10:meMA.Ode1C13.mode	@ltx/en_us_dedes/miscellanea:misc.Mode6
ltx/en_us_dedes/me.m02.d10:meMA.Ode1C13.ode	@ltx/en_us_dedes/miscellanea:misc.Ode1
ltx/en_us_dedes/me.m02.d10:meMA.Ode1C13.text	
ltx/en_us_dedes/me.m02.d10:meMA.Ode1C1T.incipit	…
ltx/en_us_dedes/me.m02.d10:meMA.Ode1C1T.melody	@ltx/en_us_dedes/he.h.m6:heHE.OsEnIpeiroPezefsas.name
ltx/en_us_dedes/me.m02.d10:meMA.Ode1C1T.mode	@ltx/en_us_dedes/miscellanea:misc.Mode6
ltx/en_us_dedes/me.m02.d10:meMA.Ode1C1T.ode	@ltx/en_us_dedes/miscellanea:misc.Ode1
ltx/en_us_dedes/me.m02.d10:meMA.Ode1C1T.text	
ltx/en_us_dedes/me.m02.d10:meMA.Ode1C21.greekmelody	@ltx/en_us_dedes/he.h.m4:heHE.AnoixoToStomaMou.greekname
ltx/en_us_dedes/me.m02.d10:meMA.Ode1C21.incipit	…
ltx/en_us_dedes/me.m02.d10:meMA.Ode1C21.melody	@ltx/en_us_dedes/he.h.m4:heHE.AnoixoToStomaMou.name
ltx/en_us_dedes/me.m02.d10:meMA.Ode1C21.mode	@ltx/en_us_dedes/miscellanea:misc.Mode4
ltx/en_us_dedes/me.m02.d10:meMA.Ode1C21.ode	@ltx/en_us_dedes/miscellanea:misc.Ode1
ltx/en_us_dedes/me.m02.d10:meMA.Ode1C21.text	
ltx/en_us_dedes/me.m02.d10:meMA.Ode1C22.incipit	…
ltx/en_us_dedes/me.m02.d10:meMA.Ode1C22.melody	@ltx/en_us_dedes/he.h.m4:heHE.AnoixoToStomaMou.name
ltx/en_us_dedes/me.m02.d10:meMA.Ode1C22.mode	@ltx/en_us_dedes/miscellanea:misc.Mode4
ltx/en_us_dedes/me.m02.d10:meMA.Ode1C22.ode	@ltx/en_us_dedes/miscellanea:misc.Ode1
ltx/en_us_dedes/me.m02.d10:meMA.Ode1C22.text	
ltx/en_us_dedes/me.m02.d10:meMA.Ode1C23.incipit	…
ltx/en_us_dedes/me.m02.d10:meMA.Ode1C23.melody	@ltx/en_us_dedes/he.h.m4:heHE.AnoixoToStomaMou.name
ltx/en_us_dedes/me.m02.d10:meMA.Ode1C23.mode	@ltx/en_us_dedes/miscellanea:misc.Mode4
ltx/en_us_dedes/me.m02.d10:meMA.Ode1C23.ode	@ltx/en_us_dedes/miscellanea:misc.Ode1
ltx/en_us_dedes/me.m02.d10:meMA.Ode1C23.text	
ltx/en_us_dedes/me.m02.d10:meMA.Ode1C2T.incipit	…
ltx/en_us_dedes/me.m02.d10:meMA.Ode1C2T.melody	@ltx/en_us_dedes/he.h.m4:heHE.AnoixoToStomaMou.name
ltx/en_us_dedes/me.m02.d10:meMA.Ode1C2T.mode	@ltx/en_us_dedes/miscellanea:misc.Mode4
ltx/en_us_dedes/me.m02.d10:meMA.Ode1C2T.ode	@ltx/en_us_dedes/miscellanea:misc.Ode1
ltx/en_us_dedes/me.m02.d10:meMA.Ode1C2T.text	
ltx/en_us_dedes/me.m02.d10:meMA.Ode3C11.greekmelody	@ltx/en_us_dedes/he.h.m6:heHE.OukEstinAgios.greekname
ltx/en_us_dedes/me.m02.d10:meMA.Ode3C11.incipit	…
ltx/en_us_dedes/me.m02.d10:meMA.Ode3C11.melody	@ltx/en_us_dedes/he.h.m6:heHE.OukEstinAgios.name
ltx/en_us_dedes/me.m02.d10:meMA.Ode3C11.mode	@ltx/en_us_dedes/miscellanea:misc.Mode6
ltx/en_us_dedes/me.m02.d10:meMA.Ode3C11.ode	@ltx/en_us_dedes/miscellanea:misc.Ode3
ltx/en_us_dedes/me.m02.d10:meMA.Ode3C11.text	
ltx/en_us_dedes/me.m02.d10:meMA.Ode3C12.incipit	…
ltx/en_us_dedes/me.m02.d10:meMA.Ode3C12.melody	@ltx/en_us_dedes/he.h.m6:heHE.OukEstinAgios.name
ltx/en_us_dedes/me.m02.d10:meMA.Ode3C12.mode	@ltx/en_us_dedes/miscellanea:misc.Mode6
ltx/en_us_dedes/me.m02.d10:meMA.Ode3C12.ode	@ltx/en_us_dedes/miscellanea:misc.Ode3
ltx/en_us_dedes/me.m02.d10:meMA.Ode3C12.text	
ltx/en_us_dedes/me.m02.d10:meMA.Ode3C13.incipit	…
ltx/en_us_dedes/me.m02.d10:meMA.Ode3C13.melody	@ltx/en_us_dedes/he.h.m6:heHE.OukEstinAgios.name
ltx/en_us_dedes/me.m02.d10:meMA.Ode3C13.mode	@ltx/en_us_dedes/miscellanea:misc.Mode6
ltx/en_us_dedes/me.m02.d10:meMA.Ode3C13.ode	@ltx/en_us_dedes/miscellanea:misc.Ode3
ltx/en_us_dedes/me.m02.d10:meMA.Ode3C13.text	
ltx/en_us_dedes/me.m02.d10:meMA.Ode3C1T.incipit	…
ltx/en_us_dedes/me.m02.d10:meMA.Ode3C1T.melody	@ltx/en_us_dedes/he.h.m6:heHE.OukEstinAgios.name
ltx/en_us_dedes/me.m02.d10:meMA.Ode3C1T.mode	@ltx/en_us_dedes/miscellanea:misc.Mode6
ltx/en_us_dedes/me.m02.d10:meMA.Ode3C1T.ode	@ltx/en_us_dedes/miscellanea:misc.Ode3
ltx/en_us_dedes/me.m02.d10:meMA.Ode3C1T.text	
ltx/en_us_dedes/me.m02.d10:meMA.Ode3C21.greekmelody	@ltx/en_us_dedes/he.h.m4:heHE.TousSousYmnologous.greekname
ltx/en_us_dedes/me.m02.d10:meMA.Ode3C21.incipit	…
ltx/en_us_dedes/me.m02.d10:meMA.Ode3C21.melody	@ltx/en_us_dedes/he.h.m4:heHE.TousSousYmnologous.name
ltx/en_us_dedes/me.m02.d10:meMA.Ode3C21.mode	@ltx/en_us_dedes/miscellanea:misc.Mode4
ltx/en_us_dedes/me.m02.d10:meMA.Ode3C21.ode	@ltx/en_us_dedes/miscellanea:misc.Ode3
ltx/en_us_dedes/me.m02.d10:meMA.Ode3C21.text	
ltx/en_us_dedes/me.m02.d10:meMA.Ode3C22.incipit	…
ltx/en_us_dedes/me.m02.d10:meMA.Ode3C22.melody	@ltx/en_us_dedes/he.h.m4:heHE.TousSousYmnologous.name
ltx/en_us_dedes/me.m02.d10:meMA.Ode3C22.mode	@ltx/en_us_dedes/miscellanea:misc.Mode4
ltx/en_us_dedes/me.m02.d10:meMA.Ode3C22.ode	@ltx/en_us_dedes/miscellanea:misc.Ode3
ltx/en_us_dedes/me.m02.d10:meMA.Ode3C22.text	
ltx/en_us_dedes/me.m02.d10:meMA.Ode3C23.incipit	…
ltx/en_us_dedes/me.m02.d10:meMA.Ode3C23.melody	@ltx/en_us_dedes/he.h.m4:heHE.TousSousYmnologous.name
ltx/en_us_dedes/me.m02.d10:meMA.Ode3C23.mode	@ltx/en_us_dedes/miscellanea:misc.Mode4
ltx/en_us_dedes/me.m02.d10:meMA.Ode3C23.ode	@ltx/en_us_dedes/miscellanea:misc.Ode3
ltx/en_us_dedes/me.m02.d10:meMA.Ode3C23.text	
ltx/en_us_dedes/me.m02.d10:meMA.Ode3C2T.incipit	…
ltx/en_us_dedes/me.m02.d10:meMA.Ode3C2T.melody	@ltx/en_us_dedes/he.h.m4:heHE.TousSousYmnologous.name
ltx/en_us_dedes/me.m02.d10:meMA.Ode3C2T.mode	@ltx/en_us_dedes/miscellanea:misc.Mode4
ltx/en_us_dedes/me.m02.d10:meMA.Ode3C2T.ode	@ltx/en_us_dedes/miscellanea:misc.Ode3
ltx/en_us_dedes/me.m02.d10:meMA.Ode3C2T.text	
ltx/en_us_dedes/me.m02.d10:meMA.Ode3Kathisma1.greekmelody	@ltx/en_us_dedes/he.a.m3:heAU.TheiasPisteos.greekname
ltx/en_us_dedes/me.m02.d10:meMA.Ode3Kathisma1.incipit	…
ltx/en_us_dedes/me.m02.d10:meMA.Ode3Kathisma1.melody	@ltx/en_us_dedes/he.a.m3:heAU.TheiasPisteos.name
ltx/en_us_dedes/me.m02.d10:meMA.Ode3Kathisma1.mode	@ltx/en_us_dedes/miscellanea:misc.Mode3
ltx/en_us_dedes/me.m02.d10:meMA.Ode3Kathisma1.text	
ltx/en_us_dedes/me.m02.d10:meMA.Ode3Kathisma2.greekmelody	@ltx/en_us_dedes/he.a.m1:heAU.TonTafonSouSotir.greekname
ltx/en_us_dedes/me.m02.d10:meMA.Ode3Kathisma2.incipit	…
ltx/en_us_dedes/me.m02.d10:meMA.Ode3Kathisma2.melody	@ltx/en_us_dedes/he.a.m1:heAU.TonTafonSouSotir.name
ltx/en_us_dedes/me.m02.d10:meMA.Ode3Kathisma2.mode	@ltx/en_us_dedes/miscellanea:misc.Mode1
ltx/en_us_dedes/me.m02.d10:meMA.Ode3Kathisma2.text	
ltx/en_us_dedes/me.m02.d10:meMA.Ode3KathismaT.incipit	…
ltx/en_us_dedes/me.m02.d10:meMA.Ode3KathismaT.melody	@ltx/en_us_dedes/he.a.m1:heAU.TonTafonSouSotir.name
ltx/en_us_dedes/me.m02.d10:meMA.Ode3KathismaT.mode	@ltx/en_us_dedes/miscellanea:misc.Mode1
ltx/en_us_dedes/me.m02.d10:meMA.Ode3KathismaT.text	
ltx/en_us_dedes/me.m02.d10:meMA.Ode4C11.greekmelody	@ltx/en_us_dedes/he.h.m6:heHE.ChristosMouDynamis.greekname
ltx/en_us_dedes/me.m02.d10:meMA.Ode4C11.incipit	…
ltx/en_us_dedes/me.m02.d10:meMA.Ode4C11.melody	@ltx/en_us_dedes/he.h.m6:heHE.ChristosMouDynamis.name
ltx/en_us_dedes/me.m02.d10:meMA.Ode4C11.mode	@ltx/en_us_dedes/miscellanea:misc.Mode6
ltx/en_us_dedes/me.m02.d10:meMA.Ode4C11.ode	@ltx/en_us_dedes/miscellanea:misc.Ode4
ltx/en_us_dedes/me.m02.d10:meMA.Ode4C11.text	
ltx/en_us_dedes/me.m02.d10:meMA.Ode4C12.incipit	…
ltx/en_us_dedes/me.m02.d10:meMA.Ode4C12.melody	@ltx/en_us_dedes/he.h.m6:heHE.ChristosMouDynamis.name
ltx/en_us_dedes/me.m02.d10:meMA.Ode4C12.mode	@ltx/en_us_dedes/miscellanea:misc.Mode6
ltx/en_us_dedes/me.m02.d10:meMA.Ode4C12.ode	@ltx/en_us_dedes/miscellanea:misc.Ode4
ltx/en_us_dedes/me.m02.d10:meMA.Ode4C12.text	
ltx/en_us_dedes/me.m02.d10:meMA.Ode4C13.incipit	…
ltx/en_us_dedes/me.m02.d10:meMA.Ode4C13.melody	@ltx/en_us_dedes/he.h.m6:heHE.ChristosMouDynamis.name
ltx/en_us_dedes/me.m02.d10:meMA.Ode4C13.mode	@ltx/en_us_dedes/miscellanea:misc.Mode6
ltx/en_us_dedes/me.m02.d10:meMA.Ode4C13.ode	@ltx/en_us_dedes/miscellanea:misc.Ode4
ltx/en_us_dedes/me.m02.d10:meMA.Ode4C13.text	
ltx/en_us_dedes/me.m02.d10:meMA.Ode4C1T.incipit	…
ltx/en_us_dedes/me.m02.d10:meMA.Ode4C1T.melody	@ltx/en_us_dedes/he.h.m6:heHE.ChristosMouDynamis.name
ltx/en_us_dedes/me.m02.d10:meMA.Ode4C1T.mode	@ltx/en_us_dedes/miscellanea:misc.Mode6
ltx/en_us_dedes/me.m02.d10:meMA.Ode4C1T.ode	@ltx/en_us_dedes/miscellanea:misc.Ode4
ltx/en_us_dedes/me.m02.d10:meMA.Ode4C1T.text	
ltx/en_us_dedes/me.m02.d10:meMA.Ode4C21.greekmelody	@ltx/en_us_dedes/he.h.m4:heHE.OKathimenosEnDoxi.greekname
ltx/en_us_dedes/me.m02.d10:meMA.Ode4C21.incipit	…
ltx/en_us_dedes/me.m02.d10:meMA.Ode4C21.melody	@ltx/en_us_dedes/he.h.m4:heHE.OKathimenosEnDoxi.name
ltx/en_us_dedes/me.m02.d10:meMA.Ode4C21.mode	@ltx/en_us_dedes/miscellanea:misc.Mode4
ltx/en_us_dedes/me.m02.d10:meMA.Ode4C21.ode	@ltx/en_us_dedes/miscellanea:misc.Ode4
ltx/en_us_dedes/me.m02.d10:meMA.Ode4C21.text	
ltx/en_us_dedes/me.m02.d10:meMA.Ode4C22.incipit	…
ltx/en_us_dedes/me.m02.d10:meMA.Ode4C22.melody	@ltx/en_us_dedes/he.h.m4:heHE.OKathimenosEnDoxi.name
ltx/en_us_dedes/me.m02.d10:meMA.Ode4C22.mode	@ltx/en_us_dedes/miscellanea:misc.Mode4
ltx/en_us_dedes/me.m02.d10:meMA.Ode4C22.ode	@ltx/en_us_dedes/miscellanea:misc.Ode4
ltx/en_us_dedes/me.m02.d10:meMA.Ode4C22.text	
ltx/en_us_dedes/me.m02.d10:meMA.Ode4C23.incipit	…
ltx/en_us_dedes/me.m02.d10:meMA.Ode4C23.melody	@ltx/en_us_dedes/he.h.m4:heHE.OKathimenosEnDoxi.name
ltx/en_us_dedes/me.m02.d10:meMA.Ode4C23.mode	@ltx/en_us_dedes/miscellanea:misc.Mode4
ltx/en_us_dedes/me.m02.d10:meMA.Ode4C23.ode	@ltx/en_us_dedes/miscellanea:misc.Ode4
ltx/en_us_dedes/me.m02.d10:meMA.Ode4C23.text	
ltx/en_us_dedes/me.m02.d10:meMA.Ode4C2T.incipit	…
ltx/en_us_dedes/me.m02.d10:meMA.Ode4C2T.melody	@ltx/en_us_dedes/he.h.m4:heHE.OKathimenosEnDoxi.name
ltx/en_us_dedes/me.m02.d10:meMA.Ode4C2T.mode	@ltx/en_us_dedes/miscellanea:misc.Mode4
ltx/en_us_dedes/me.m02.d10:meMA.Ode4C2T.ode	@ltx/en_us_dedes/miscellanea:misc.Ode4
ltx/en_us_dedes/me.m02.d10:meMA.Ode4C2T.text	
ltx/en_us_dedes/me.m02.d10:meMA.Ode5C11.greekmelody	@ltx/en_us_dedes/he.h.m6:heHE.ToTheioFengeiSou.greekname
ltx/en_us_dedes/me.m02.d10:meMA.Ode5C11.incipit	…
ltx/en_us_dedes/me.m02.d10:meMA.Ode5C11.melody	@ltx/en_us_dedes/he.h.m6:heHE.ToTheioFengeiSou.name
ltx/en_us_dedes/me.m02.d10:meMA.Ode5C11.mode	@ltx/en_us_dedes/miscellanea:misc.Mode6
ltx/en_us_dedes/me.m02.d10:meMA.Ode5C11.ode	@ltx/en_us_dedes/miscellanea:misc.Ode5
ltx/en_us_dedes/me.m02.d10:meMA.Ode5C11.text	
ltx/en_us_dedes/me.m02.d10:meMA.Ode5C12.incipit	…
ltx/en_us_dedes/me.m02.d10:meMA.Ode5C12.melody	@ltx/en_us_dedes/he.h.m6:heHE.ToTheioFengeiSou.name
ltx/en_us_dedes/me.m02.d10:meMA.Ode5C12.mode	@ltx/en_us_dedes/miscellanea:misc.Mode6
ltx/en_us_dedes/me.m02.d10:meMA.Ode5C12.ode	@ltx/en_us_dedes/miscellanea:misc.Ode5
ltx/en_us_dedes/me.m02.d10:meMA.Ode5C12.text	
ltx/en_us_dedes/me.m02.d10:meMA.Ode5C13.incipit	…
ltx/en_us_dedes/me.m02.d10:meMA.Ode5C13.melody	@ltx/en_us_dedes/he.h.m6:heHE.ToTheioFengeiSou.name
ltx/en_us_dedes/me.m02.d10:meMA.Ode5C13.mode	@ltx/en_us_dedes/miscellanea:misc.Mode6
ltx/en_us_dedes/me.m02.d10:meMA.Ode5C13.ode	@ltx/en_us_dedes/miscellanea:misc.Ode5
ltx/en_us_dedes/me.m02.d10:meMA.Ode5C13.text	
ltx/en_us_dedes/me.m02.d10:meMA.Ode5C1T.incipit	…
ltx/en_us_dedes/me.m02.d10:meMA.Ode5C1T.melody	@ltx/en_us_dedes/he.h.m6:heHE.ToTheioFengeiSou.name
ltx/en_us_dedes/me.m02.d10:meMA.Ode5C1T.mode	@ltx/en_us_dedes/miscellanea:misc.Mode6
ltx/en_us_dedes/me.m02.d10:meMA.Ode5C1T.ode	@ltx/en_us_dedes/miscellanea:misc.Ode5
ltx/en_us_dedes/me.m02.d10:meMA.Ode5C1T.text	
ltx/en_us_dedes/me.m02.d10:meMA.Ode5C21.greekmelody	@ltx/en_us_dedes/he.h.m4:heHE.ExestiTaSympanta.greekname
ltx/en_us_dedes/me.m02.d10:meMA.Ode5C21.incipit	…
ltx/en_us_dedes/me.m02.d10:meMA.Ode5C21.melody	@ltx/en_us_dedes/he.h.m4:heHE.ExestiTaSympanta.name
ltx/en_us_dedes/me.m02.d10:meMA.Ode5C21.mode	@ltx/en_us_dedes/miscellanea:misc.Mode4
ltx/en_us_dedes/me.m02.d10:meMA.Ode5C21.ode	@ltx/en_us_dedes/miscellanea:misc.Ode5
ltx/en_us_dedes/me.m02.d10:meMA.Ode5C21.text	
ltx/en_us_dedes/me.m02.d10:meMA.Ode5C22.incipit	…
ltx/en_us_dedes/me.m02.d10:meMA.Ode5C22.melody	@ltx/en_us_dedes/he.h.m4:heHE.ExestiTaSympanta.name
ltx/en_us_dedes/me.m02.d10:meMA.Ode5C22.mode	@ltx/en_us_dedes/miscellanea:misc.Mode4
ltx/en_us_dedes/me.m02.d10:meMA.Ode5C22.ode	@ltx/en_us_dedes/miscellanea:misc.Ode5
ltx/en_us_dedes/me.m02.d10:meMA.Ode5C22.text	
ltx/en_us_dedes/me.m02.d10:meMA.Ode5C23.incipit	…
ltx/en_us_dedes/me.m02.d10:meMA.Ode5C23.melody	@ltx/en_us_dedes/he.h.m4:heHE.ExestiTaSympanta.name
ltx/en_us_dedes/me.m02.d10:meMA.Ode5C23.mode	@ltx/en_us_dedes/miscellanea:misc.Mode4
ltx/en_us_dedes/me.m02.d10:meMA.Ode5C23.ode	@ltx/en_us_dedes/miscellanea:misc.Ode5
ltx/en_us_dedes/me.m02.d10:meMA.Ode5C23.text	
ltx/en_us_dedes/me.m02.d10:meMA.Ode5C2T.incipit	…
ltx/en_us_dedes/me.m02.d10:meMA.Ode5C2T.melody	@ltx/en_us_dedes/he.h.m4:heHE.ExestiTaSympanta.name
ltx/en_us_dedes/me.m02.d10:meMA.Ode5C2T.mode	@ltx/en_us_dedes/miscellanea:misc.Mode4
ltx/en_us_dedes/me.m02.d10:meMA.Ode5C2T.ode	@ltx/en_us_dedes/miscellanea:misc.Ode5
ltx/en_us_dedes/me.m02.d10:meMA.Ode5C2T.text	
ltx/en_us_dedes/me.m02.d10:meMA.Ode6C11.greekmelody	@ltx/en_us_dedes/he.h.m6:heHE.TouViouTinThalassan.greekname
ltx/en_us_dedes/me.m02.d10:meMA.Ode6C11.incipit	…
ltx/en_us_dedes/me.m02.d10:meMA.Ode6C11.melody	@ltx/en_us_dedes/he.h.m6:heHE.TouViouTinThalassan.name
ltx/en_us_dedes/me.m02.d10:meMA.Ode6C11.mode	@ltx/en_us_dedes/miscellanea:misc.Mode6
ltx/en_us_dedes/me.m02.d10:meMA.Ode6C11.ode	@ltx/en_us_dedes/miscellanea:misc.Ode6
ltx/en_us_dedes/me.m02.d10:meMA.Ode6C11.text	
ltx/en_us_dedes/me.m02.d10:meMA.Ode6C12.incipit	…
ltx/en_us_dedes/me.m02.d10:meMA.Ode6C12.melody	@ltx/en_us_dedes/he.h.m6:heHE.TouViouTinThalassan.name
ltx/en_us_dedes/me.m02.d10:meMA.Ode6C12.mode	@ltx/en_us_dedes/miscellanea:misc.Mode6
ltx/en_us_dedes/me.m02.d10:meMA.Ode6C12.ode	@ltx/en_us_dedes/miscellanea:misc.Ode6
ltx/en_us_dedes/me.m02.d10:meMA.Ode6C12.text	
ltx/en_us_dedes/me.m02.d10:meMA.Ode6C13.incipit	…
ltx/en_us_dedes/me.m02.d10:meMA.Ode6C13.melody	@ltx/en_us_dedes/he.h.m6:heHE.TouViouTinThalassan.name
ltx/en_us_dedes/me.m02.d10:meMA.Ode6C13.mode	@ltx/en_us_dedes/miscellanea:misc.Mode6
ltx/en_us_dedes/me.m02.d10:meMA.Ode6C13.ode	@ltx/en_us_dedes/miscellanea:misc.Ode6
ltx/en_us_dedes/me.m02.d10:meMA.Ode6C13.text	
ltx/en_us_dedes/me.m02.d10:meMA.Ode6C1T.incipit	…
ltx/en_us_dedes/me.m02.d10:meMA.Ode6C1T.melody	@ltx/en_us_dedes/he.h.m6:heHE.TouViouTinThalassan.name
ltx/en_us_dedes/me.m02.d10:meMA.Ode6C1T.mode	@ltx/en_us_dedes/miscellanea:misc.Mode6
ltx/en_us_dedes/me.m02.d10:meMA.Ode6C1T.ode	@ltx/en_us_dedes/miscellanea:misc.Ode6
ltx/en_us_dedes/me.m02.d10:meMA.Ode6C1T.text	
ltx/en_us_dedes/me.m02.d10:meMA.Ode6C21.greekmelody	@ltx/en_us_dedes/he.h.m4:heHE.TinTheianTaftin.greekname
ltx/en_us_dedes/me.m02.d10:meMA.Ode6C21.incipit	…
ltx/en_us_dedes/me.m02.d10:meMA.Ode6C21.melody	@ltx/en_us_dedes/he.h.m4:heHE.TinTheianTaftin.name
ltx/en_us_dedes/me.m02.d10:meMA.Ode6C21.mode	@ltx/en_us_dedes/miscellanea:misc.Mode4
ltx/en_us_dedes/me.m02.d10:meMA.Ode6C21.ode	@ltx/en_us_dedes/miscellanea:misc.Ode6
ltx/en_us_dedes/me.m02.d10:meMA.Ode6C21.text	
ltx/en_us_dedes/me.m02.d10:meMA.Ode6C22.incipit	…
ltx/en_us_dedes/me.m02.d10:meMA.Ode6C22.melody	@ltx/en_us_dedes/he.h.m4:heHE.TinTheianTaftin.name
ltx/en_us_dedes/me.m02.d10:meMA.Ode6C22.mode	@ltx/en_us_dedes/miscellanea:misc.Mode4
ltx/en_us_dedes/me.m02.d10:meMA.Ode6C22.ode	@ltx/en_us_dedes/miscellanea:misc.Ode6
ltx/en_us_dedes/me.m02.d10:meMA.Ode6C22.text	
ltx/en_us_dedes/me.m02.d10:meMA.Ode6C23.incipit	…
ltx/en_us_dedes/me.m02.d10:meMA.Ode6C23.melody	@ltx/en_us_dedes/he.h.m4:heHE.TinTheianTaftin.name
ltx/en_us_dedes/me.m02.d10:meMA.Ode6C23.mode	@ltx/en_us_dedes/miscellanea:misc.Mode4
ltx/en_us_dedes/me.m02.d10:meMA.Ode6C23.ode	@ltx/en_us_dedes/miscellanea:misc.Ode6
ltx/en_us_dedes/me.m02.d10:meMA.Ode6C23.text	
ltx/en_us_dedes/me.m02.d10:meMA.Ode6C2T.incipit	…
ltx/en_us_dedes/me.m02.d10:meMA.Ode6C2T.melody	@ltx/en_us_dedes/he.h.m4:heHE.TinTheianTaftin.name
ltx/en_us_dedes/me.m02.d10:meMA.Ode6C2T.mode	@ltx/en_us_dedes/miscellanea:misc.Mode4
ltx/en_us_dedes/me.m02.d10:meMA.Ode6C2T.ode	@ltx/en_us_dedes/miscellanea:misc.Ode6
ltx/en_us_dedes/me.m02.d10:meMA.Ode6C2T.text	
ltx/en_us_dedes/me.m02.d10:meMA.Ode7C11.greekmelody	@ltx/en_us_dedes/he.h.m6:heHE.OiPaidesEnVavyloni.greekname
ltx/en_us_dedes/me.m02.d10:meMA.Ode7C11.incipit	…
ltx/en_us_dedes/me.m02.d10:meMA.Ode7C11.melody	@ltx/en_us_dedes/he.h.m6:heHE.OiPaidesEnVavyloni.name
ltx/en_us_dedes/me.m02.d10:meMA.Ode7C11.mode	@ltx/en_us_dedes/miscellanea:misc.Mode6
ltx/en_us_dedes/me.m02.d10:meMA.Ode7C11.ode	@ltx/en_us_dedes/miscellanea:misc.Ode7
ltx/en_us_dedes/me.m02.d10:meMA.Ode7C11.text	
ltx/en_us_dedes/me.m02.d10:meMA.Ode7C12.incipit	…
ltx/en_us_dedes/me.m02.d10:meMA.Ode7C12.melody	@ltx/en_us_dedes/he.h.m6:heHE.OiPaidesEnVavyloni.name
ltx/en_us_dedes/me.m02.d10:meMA.Ode7C12.mode	@ltx/en_us_dedes/miscellanea:misc.Mode6
ltx/en_us_dedes/me.m02.d10:meMA.Ode7C12.ode	@ltx/en_us_dedes/miscellanea:misc.Ode7
ltx/en_us_dedes/me.m02.d10:meMA.Ode7C12.text	
ltx/en_us_dedes/me.m02.d10:meMA.Ode7C13.incipit	…
ltx/en_us_dedes/me.m02.d10:meMA.Ode7C13.melody	@ltx/en_us_dedes/he.h.m6:heHE.OiPaidesEnVavyloni.name
ltx/en_us_dedes/me.m02.d10:meMA.Ode7C13.mode	@ltx/en_us_dedes/miscellanea:misc.Mode6
ltx/en_us_dedes/me.m02.d10:meMA.Ode7C13.ode	@ltx/en_us_dedes/miscellanea:misc.Ode7
ltx/en_us_dedes/me.m02.d10:meMA.Ode7C13.text	
ltx/en_us_dedes/me.m02.d10:meMA.Ode7C1T.incipit	…
ltx/en_us_dedes/me.m02.d10:meMA.Ode7C1T.melody	@ltx/en_us_dedes/he.h.m6:heHE.OiPaidesEnVavyloni.name
ltx/en_us_dedes/me.m02.d10:meMA.Ode7C1T.mode	@ltx/en_us_dedes/miscellanea:misc.Mode6
ltx/en_us_dedes/me.m02.d10:meMA.Ode7C1T.ode	@ltx/en_us_dedes/miscellanea:misc.Ode7
ltx/en_us_dedes/me.m02.d10:meMA.Ode7C1T.text	
ltx/en_us_dedes/me.m02.d10:meMA.Ode7C21.greekmelody	@ltx/en_us_dedes/he.h.m4:heHE.OukElatrefsan.greekname
ltx/en_us_dedes/me.m02.d10:meMA.Ode7C21.incipit	…
ltx/en_us_dedes/me.m02.d10:meMA.Ode7C21.melody	@ltx/en_us_dedes/he.h.m4:heHE.OukElatrefsan.name
ltx/en_us_dedes/me.m02.d10:meMA.Ode7C21.mode	@ltx/en_us_dedes/miscellanea:misc.Mode4
ltx/en_us_dedes/me.m02.d10:meMA.Ode7C21.ode	@ltx/en_us_dedes/miscellanea:misc.Ode7
ltx/en_us_dedes/me.m02.d10:meMA.Ode7C21.text	
ltx/en_us_dedes/me.m02.d10:meMA.Ode7C22.incipit	…
ltx/en_us_dedes/me.m02.d10:meMA.Ode7C22.melody	@ltx/en_us_dedes/he.h.m4:heHE.OukElatrefsan.name
ltx/en_us_dedes/me.m02.d10:meMA.Ode7C22.mode	@ltx/en_us_dedes/miscellanea:misc.Mode4
ltx/en_us_dedes/me.m02.d10:meMA.Ode7C22.ode	@ltx/en_us_dedes/miscellanea:misc.Ode7
ltx/en_us_dedes/me.m02.d10:meMA.Ode7C22.text	
ltx/en_us_dedes/me.m02.d10:meMA.Ode7C23.incipit	…
ltx/en_us_dedes/me.m02.d10:meMA.Ode7C23.melody	@ltx/en_us_dedes/he.h.m4:heHE.OukElatrefsan.name
ltx/en_us_dedes/me.m02.d10:meMA.Ode7C23.mode	@ltx/en_us_dedes/miscellanea:misc.Mode4
ltx/en_us_dedes/me.m02.d10:meMA.Ode7C23.ode	@ltx/en_us_dedes/miscellanea:misc.Ode7
ltx/en_us_dedes/me.m02.d10:meMA.Ode7C23.text	
ltx/en_us_dedes/me.m02.d10:meMA.Ode7C2T.incipit	…
ltx/en_us_dedes/me.m02.d10:meMA.Ode7C2T.melody	@ltx/en_us_dedes/he.h.m4:heHE.OukElatrefsan.name
ltx/en_us_dedes/me.m02.d10:meMA.Ode7C2T.mode	@ltx/en_us_dedes/miscellanea:misc.Mode4
ltx/en_us_dedes/me.m02.d10:meMA.Ode7C2T.ode	@ltx/en_us_dedes/miscellanea:misc.Ode7
ltx/en_us_dedes/me.m02.d10:meMA.Ode7C2T.text	
ltx/en_us_dedes/me.m02.d10:meMA.Ode8C11.greekmelody	@ltx/en_us_dedes/he.h.m6:heHE.EkFlogosToisOsiois.greekname
ltx/en_us_dedes/me.m02.d10:meMA.Ode8C11.incipit	…
ltx/en_us_dedes/me.m02.d10:meMA.Ode8C11.melody	@ltx/en_us_dedes/he.h.m6:heHE.EkFlogosToisOsiois.name
ltx/en_us_dedes/me.m02.d10:meMA.Ode8C11.mode	@ltx/en_us_dedes/miscellanea:misc.Mode6
ltx/en_us_dedes/me.m02.d10:meMA.Ode8C11.ode	@ltx/en_us_dedes/miscellanea:misc.Ode8
ltx/en_us_dedes/me.m02.d10:meMA.Ode8C11.text	
ltx/en_us_dedes/me.m02.d10:meMA.Ode8C12.incipit	…
ltx/en_us_dedes/me.m02.d10:meMA.Ode8C12.melody	@ltx/en_us_dedes/he.h.m6:heHE.EkFlogosToisOsiois.name
ltx/en_us_dedes/me.m02.d10:meMA.Ode8C12.mode	@ltx/en_us_dedes/miscellanea:misc.Mode6
ltx/en_us_dedes/me.m02.d10:meMA.Ode8C12.ode	@ltx/en_us_dedes/miscellanea:misc.Ode8
ltx/en_us_dedes/me.m02.d10:meMA.Ode8C12.text	
ltx/en_us_dedes/me.m02.d10:meMA.Ode8C13.incipit	…
ltx/en_us_dedes/me.m02.d10:meMA.Ode8C13.melody	@ltx/en_us_dedes/he.h.m6:heHE.EkFlogosToisOsiois.name
ltx/en_us_dedes/me.m02.d10:meMA.Ode8C13.mode	@ltx/en_us_dedes/miscellanea:misc.Mode6
ltx/en_us_dedes/me.m02.d10:meMA.Ode8C13.ode	@ltx/en_us_dedes/miscellanea:misc.Ode8
ltx/en_us_dedes/me.m02.d10:meMA.Ode8C13.text	
ltx/en_us_dedes/me.m02.d10:meMA.Ode8C1T.incipit	…
ltx/en_us_dedes/me.m02.d10:meMA.Ode8C1T.melody	@ltx/en_us_dedes/he.h.m6:heHE.EkFlogosToisOsiois.name
ltx/en_us_dedes/me.m02.d10:meMA.Ode8C1T.mode	@ltx/en_us_dedes/miscellanea:misc.Mode6
ltx/en_us_dedes/me.m02.d10:meMA.Ode8C1T.ode	@ltx/en_us_dedes/miscellanea:misc.Ode8
ltx/en_us_dedes/me.m02.d10:meMA.Ode8C1T.text	
ltx/en_us_dedes/me.m02.d10:meMA.Ode8C21.greekmelody	@ltx/en_us_dedes/he.h.m4:heHE.PaidasEvageis.greekname
ltx/en_us_dedes/me.m02.d10:meMA.Ode8C21.incipit	…
ltx/en_us_dedes/me.m02.d10:meMA.Ode8C21.melody	@ltx/en_us_dedes/he.h.m4:heHE.PaidasEvageis.name
ltx/en_us_dedes/me.m02.d10:meMA.Ode8C21.mode	@ltx/en_us_dedes/miscellanea:misc.Mode4
ltx/en_us_dedes/me.m02.d10:meMA.Ode8C21.ode	@ltx/en_us_dedes/miscellanea:misc.Ode8
ltx/en_us_dedes/me.m02.d10:meMA.Ode8C21.text	
ltx/en_us_dedes/me.m02.d10:meMA.Ode8C22.incipit	…
ltx/en_us_dedes/me.m02.d10:meMA.Ode8C22.melody	@ltx/en_us_dedes/he.h.m4:heHE.PaidasEvageis.name
ltx/en_us_dedes/me.m02.d10:meMA.Ode8C22.mode	@ltx/en_us_dedes/miscellanea:misc.Mode4
ltx/en_us_dedes/me.m02.d10:meMA.Ode8C22.ode	@ltx/en_us_dedes/miscellanea:misc.Ode8
ltx/en_us_dedes/me.m02.d10:meMA.Ode8C22.text	
ltx/en_us_dedes/me.m02.d10:meMA.Ode8C23.incipit	…
ltx/en_us_dedes/me.m02.d10:meMA.Ode8C23.melody	@ltx/en_us_dedes/he.h.m4:heHE.PaidasEvageis.name
ltx/en_us_dedes/me.m02.d10:meMA.Ode8C23.mode	@ltx/en_us_dedes/miscellanea:misc.Mode4
ltx/en_us_dedes/me.m02.d10:meMA.Ode8C23.ode	@ltx/en_us_dedes/miscellanea:misc.Ode8
ltx/en_us_dedes/me.m02.d10:meMA.Ode8C23.text	
ltx/en_us_dedes/me.m02.d10:meMA.Ode8C2T.incipit	…
ltx/en_us_dedes/me.m02.d10:meMA.Ode8C2T.melody	@ltx/en_us_dedes/he.h.m4:heHE.PaidasEvageis.name
ltx/en_us_dedes/me.m02.d10:meMA.Ode8C2T.mode	@ltx/en_us_dedes/miscellanea:misc.Mode4
ltx/en_us_dedes/me.m02.d10:meMA.Ode8C2T.ode	@ltx/en_us_dedes/miscellanea:misc.Ode8
ltx/en_us_dedes/me.m02.d10:meMA.Ode8C2T.text	
ltx/en_us_dedes/me.m02.d10:meMA.Ode9C11.greekmelody	@ltx/en_us_dedes/he.h.m6:heHE.TheonAnthropois.greekname
ltx/en_us_dedes/me.m02.d10:meMA.Ode9C11.incipit	O Athlete worthy of admiration…
ltx/en_us_dedes/me.m02.d10:meMA.Ode9C11.melody	@ltx/en_us_dedes/he.h.m6:heHE.TheonAnthropois.notmetered
ltx/en_us_dedes/me.m02.d10:meMA.Ode9C11.mode	@ltx/en_us_dedes/miscellanea:misc.Mode6
ltx/en_us_dedes/me.m02.d10:meMA.Ode9C11.ode	@ltx/en_us_dedes/miscellanea:misc.Ode9
ltx/en_us_dedes/me.m02.d10:meMA.Ode9C11.text	O Athlete worthy of admiration, neither fire, sword, death, persecution, tribulation, hunger, danger, nor threat of torture could separate you from the love of your Creator.
ltx/en_us_dedes/me.m02.d10:meMA.Ode9C12.incipit	O invincible medal-winning Martyr, by…
ltx/en_us_dedes/me.m02.d10:meMA.Ode9C12.melody	@ltx/en_us_dedes/he.h.m6:heHE.TheonAnthropois.notmetered
ltx/en_us_dedes/me.m02.d10:meMA.Ode9C12.mode	@ltx/en_us_dedes/miscellanea:misc.Mode6
ltx/en_us_dedes/me.m02.d10:meMA.Ode9C12.ode	@ltx/en_us_dedes/miscellanea:misc.Ode9
ltx/en_us_dedes/me.m02.d10:meMA.Ode9C12.text	O invincible medal-winning Martyr, by being scraped by rakes, you put off the garments of mortality, and you adorned yourself with the robes of your blood. And now with confidence and joy you stand near the Master and God of all.
ltx/en_us_dedes/me.m02.d10:meMA.Ode9C13.incipit	Your memory has risen on…
ltx/en_us_dedes/me.m02.d10:meMA.Ode9C13.melody	@ltx/en_us_dedes/he.h.m6:heHE.TheonAnthropois.notmetered
ltx/en_us_dedes/me.m02.d10:meMA.Ode9C13.mode	@ltx/en_us_dedes/miscellanea:misc.Mode6
ltx/en_us_dedes/me.m02.d10:meMA.Ode9C13.ode	@ltx/en_us_dedes/miscellanea:misc.Ode9
ltx/en_us_dedes/me.m02.d10:meMA.Ode9C13.text	Your memory has risen on the world, and it provides joy and divine splendor, it drives away the winter of the passions, and it leads all to the light. As we celebrate it, may we receive forgiveness of offenses, by your earnest prayers.
ltx/en_us_dedes/me.m02.d10:meMA.Ode9C1T.incipit	O all-blameless Virgin, the surging…
ltx/en_us_dedes/me.m02.d10:meMA.Ode9C1T.melody	@ltx/en_us_dedes/he.h.m6:heHE.TheonAnthropois.notmetered
ltx/en_us_dedes/me.m02.d10:meMA.Ode9C1T.mode	@ltx/en_us_dedes/miscellanea:misc.Mode6
ltx/en_us_dedes/me.m02.d10:meMA.Ode9C1T.ode	@ltx/en_us_dedes/miscellanea:misc.Ode9
ltx/en_us_dedes/me.m02.d10:meMA.Ode9C1T.text	O all-blameless Virgin, the surging sea of the passions is shaking me, and the swelling waves of evils are sinking me. As the Mother of Christ the pilot, extend a helping hand to me and save me, for only you are the protection of those who faithfully call you blest.
ltx/en_us_dedes/me.m02.d10:meMA.Ode9C21.greekmelody	@ltx/en_us_dedes/he.h.m4:heHE.ApasGigenis.greekname
ltx/en_us_dedes/me.m02.d10:meMA.Ode9C21.incipit	…
ltx/en_us_dedes/me.m02.d10:meMA.Ode9C21.melody	@ltx/en_us_dedes/he.h.m4:heHE.ApasGigenis.name
ltx/en_us_dedes/me.m02.d10:meMA.Ode9C21.mode	@ltx/en_us_dedes/miscellanea:misc.Mode4
ltx/en_us_dedes/me.m02.d10:meMA.Ode9C21.ode	@ltx/en_us_dedes/miscellanea:misc.Ode9
ltx/en_us_dedes/me.m02.d10:meMA.Ode9C21.text	
ltx/en_us_dedes/me.m02.d10:meMA.Ode9C22.incipit	…
ltx/en_us_dedes/me.m02.d10:meMA.Ode9C22.melody	@ltx/en_us_dedes/he.h.m4:heHE.ApasGigenis.name
ltx/en_us_dedes/me.m02.d10:meMA.Ode9C22.mode	@ltx/en_us_dedes/miscellanea:misc.Mode4
ltx/en_us_dedes/me.m02.d10:meMA.Ode9C22.ode	@ltx/en_us_dedes/miscellanea:misc.Ode9
ltx/en_us_dedes/me.m02.d10:meMA.Ode9C22.text	
ltx/en_us_dedes/me.m02.d10:meMA.Ode9C23.incipit	…
ltx/en_us_dedes/me.m02.d10:meMA.Ode9C23.melody	@ltx/en_us_dedes/he.h.m4:heHE.ApasGigenis.name
ltx/en_us_dedes/me.m02.d10:meMA.Ode9C23.mode	@ltx/en_us_dedes/miscellanea:misc.Mode4
ltx/en_us_dedes/me.m02.d10:meMA.Ode9C23.ode	@ltx/en_us_dedes/miscellanea:misc.Ode9
ltx/en_us_dedes/me.m02.d10:meMA.Ode9C23.text	
ltx/en_us_dedes/me.m02.d10:meMA.Ode9C2T.incipit	…
ltx/en_us_dedes/me.m02.d10:meMA.Ode9C2T.melody	@ltx/en_us_dedes/he.h.m4:heHE.ApasGigenis.name
ltx/en_us_dedes/me.m02.d10:meMA.Ode9C2T.mode	@ltx/en_us_dedes/miscellanea:misc.Mode4
ltx/en_us_dedes/me.m02.d10:meMA.Ode9C2T.ode	@ltx/en_us_dedes/miscellanea:misc.Ode9
ltx/en_us_dedes/me.m02.d10:meMA.Ode9C2T.text	
ltx/en_us_dedes/me.m02.d10:meMA.Oikos1.text	Let us come together and extol Haralambos, the all-glorious great Martyr, the steadfast warrior and soldier of Christ. He contended splendidly for Christ and the truth. He openly preached the Orthodox faith, and put an end to the error of idolatry. He rebuked the most unlawful king, and with joy and exultation he was beheaded. Therefore he received the crown from the right hand of the Most High, and he became a fellow citizen of the Angels. This is why the Orthodox Church venerates his all-honored skull, and crowns it with praises. By it she is freed from many hardships and diseases, and she praises the Maker of all with joy.
ltx/en_us_dedes/me.m02.d10:meMA.PostGospelBoth.incipit	@ltx/en_us_dedes/ho.ho03:hoMA.PostGospelTheotokos.incipit
ltx/en_us_dedes/me.m02.d10:meMA.PostGospelBoth.melody	
ltx/en_us_dedes/me.m02.d10:meMA.PostGospelBoth.mode	@ltx/en_us_dedes/miscellanea:misc.Mode2
ltx/en_us_dedes/me.m02.d10:meMA.PostGospelBoth.text	@ltx/en_us_dedes/ho.ho03:hoMA.PostGospelTheotokos.text
ltx/en_us_dedes/me.m02.d10:meMA.PostGospelGlory.incipit	@ltx/en_us_dedes/ho.ho03:hoMA.PostGospelMaleMartyr.incipit
ltx/en_us_dedes/me.m02.d10:meMA.PostGospelGlory.melody	
ltx/en_us_dedes/me.m02.d10:meMA.PostGospelGlory.mode	@ltx/en_us_dedes/miscellanea:misc.Mode2
ltx/en_us_dedes/me.m02.d10:meMA.PostGospelGlory.text	@ltx/en_us_dedes/ho.ho03:hoMA.PostGospelMaleMartyr.text
ltx/en_us_dedes/me.m02.d10:meMA.PostGospelIdiomelon.incipit	Come, you fans of the…
ltx/en_us_dedes/me.m02.d10:meMA.PostGospelIdiomelon.melody	
ltx/en_us_dedes/me.m02.d10:meMA.PostGospelIdiomelon.mode	@ltx/en_us_dedes/miscellanea:misc.Mode6
ltx/en_us_dedes/me.m02.d10:meMA.PostGospelIdiomelon.text	Come, you fans of the Martyrs, let us honor the God-crowned phalanx led by the radiant Martyr, that select and holy company of Hieromartyr Haralambos, which was eagerly sacrificed for Christ. Let us spiritually observe his all-sacred memory, and call out to him: “Free your people, who correctly believe in God; free us from the threat of plague, and deliver us from every adversity.”
ltx/en_us_dedes/me.m02.d10:meSV.AposGlory.incipit	…
ltx/en_us_dedes/me.m02.d10:meSV.AposGlory.melody	@ltx/en_us_dedes/he.a.m2:heAU.OikosTouEfratha.name
ltx/en_us_dedes/me.m02.d10:meSV.AposGlory.mode	@ltx/en_us_dedes/miscellanea:misc.Mode2
ltx/en_us_dedes/me.m02.d10:meSV.AposGlory.text	
ltx/en_us_dedes/me.m02.d10:meSV.Aposticha1.incipit	…
ltx/en_us_dedes/me.m02.d10:meSV.Aposticha1.melody	@ltx/en_us_dedes/he.a.m2:heAU.OikosTouEfratha.name
ltx/en_us_dedes/me.m02.d10:meSV.Aposticha1.mode	@ltx/en_us_dedes/miscellanea:misc.Mode2
ltx/en_us_dedes/me.m02.d10:meSV.Aposticha1.text	
ltx/en_us_dedes/me.m02.d10:meSV.Aposticha2.incipit	…
ltx/en_us_dedes/me.m02.d10:meSV.Aposticha2.melody	@ltx/en_us_dedes/he.a.m2:heAU.OikosTouEfratha.name
ltx/en_us_dedes/me.m02.d10:meSV.Aposticha2.mode	@ltx/en_us_dedes/miscellanea:misc.Mode2
ltx/en_us_dedes/me.m02.d10:meSV.Aposticha2.text	
ltx/en_us_dedes/me.m02.d10:meSV.Aposticha3.incipit	…
ltx/en_us_dedes/me.m02.d10:meSV.Aposticha3.melody	@ltx/en_us_dedes/he.a.m2:heAU.OikosTouEfratha.name
ltx/en_us_dedes/me.m02.d10:meSV.Aposticha3.mode	@ltx/en_us_dedes/miscellanea:misc.Mode2
ltx/en_us_dedes/me.m02.d10:meSV.Aposticha3.text	
ltx/en_us_dedes/me.m02.d10:meSV.SticBoth.incipit	@ltx/en_us_dedes/ho.ho23:hoCA.Troparion7.incipit
ltx/en_us_dedes/me.m02.d10:meSV.SticBoth.melody	
ltx/en_us_dedes/me.m02.d10:meSV.SticBoth.mode	@ltx/en_us_dedes/miscellanea:misc.Mode2
ltx/en_us_dedes/me.m02.d10:meSV.SticBoth.text	@ltx/en_us_dedes/ho.ho23:hoCA.Troparion7.text
ltx/en_us_dedes/me.m02.d10:meSV.SticGlory.incipit	…
ltx/en_us_dedes/me.m02.d10:meSV.SticGlory.melody	
ltx/en_us_dedes/me.m02.d10:meSV.SticGlory.mode	@ltx/en_us_dedes/miscellanea:misc.Mode2
ltx/en_us_dedes/me.m02.d10:meSV.SticGlory.text	
ltx/en_us_dedes/me.m02.d10:meSV.Stichera1.incipit	…
ltx/en_us_dedes/me.m02.d10:meSV.Stichera1.melody	@ltx/en_us_dedes/he.a.m1:heAU.TonOuranionTagmaton.name
ltx/en_us_dedes/me.m02.d10:meSV.Stichera1.mode	@ltx/en_us_dedes/miscellanea:misc.Mode1
ltx/en_us_dedes/me.m02.d10:meSV.Stichera1.text	
ltx/en_us_dedes/me.m02.d10:meSV.Stichera2.incipit	…
ltx/en_us_dedes/me.m02.d10:meSV.Stichera2.melody	@ltx/en_us_dedes/he.a.m1:heAU.TonOuranionTagmaton.name
ltx/en_us_dedes/me.m02.d10:meSV.Stichera2.mode	@ltx/en_us_dedes/miscellanea:misc.Mode1
ltx/en_us_dedes/me.m02.d10:meSV.Stichera2.text	
ltx/en_us_dedes/me.m02.d10:meSV.Stichera3.incipit	…
ltx/en_us_dedes/me.m02.d10:meSV.Stichera3.melody	@ltx/en_us_dedes/he.a.m1:heAU.TonOuranionTagmaton.name
ltx/en_us_dedes/me.m02.d10:meSV.Stichera3.mode	@ltx/en_us_dedes/miscellanea:misc.Mode1
ltx/en_us_dedes/me.m02.d10:meSV.Stichera3.text	
ltx/en_us_dedes/me.m02.d10:meVE.Apolytikion1.greekmelody	@ltx/en_us_dedes/he.a.m4:heAU.TachyProkatalave.greekname
ltx/en_us_dedes/me.m02.d10:meVE.Apolytikion1.incipit	A pillar unshakable are you…
ltx/en_us_dedes/me.m02.d10:meVE.Apolytikion1.melody	@ltx/en_us_dedes/he.a.m4:heAU.TachyProkatalave.name
ltx/en_us_dedes/me.m02.d10:meVE.Apolytikion1.mode	@ltx/en_us_dedes/miscellanea:misc.Mode4
ltx/en_us_dedes/me.m02.d10:meVE.Apolytikion1.text	A pillar unshakable are you in Christ’s holy Church, * and, as your own name denotes, an ever radiant lamp, * all-blessed Haralambos, * shining throughout the whole world * by your feats as a martyr, * driving away the darkness of the worship of idols. * With confidence, therefore, pray to Christ, * entreating Him to save our souls.
ltx/en_us_dedes/me.m02.d10:meVE.AposGlory.incipit	O brethren, let us extol…
ltx/en_us_dedes/me.m02.d10:meVE.AposGlory.melody	
ltx/en_us_dedes/me.m02.d10:meVE.AposGlory.mode	@ltx/en_us_dedes/miscellanea:misc.Mode4
ltx/en_us_dedes/me.m02.d10:meVE.AposGlory.text	O brethren, let us extol that spiritual diamond of unbreakable endurance, that most valorous athlete, Haralambos, the grandest of martyrs, who was crowned by the right hand of God, the King of all, with two crowns, that of priesthood and of martyrdom. He competed against the arrogant opponent, and raised a huge trophy against the error of paganism. And now that he is in heaven, he implores God to grant us forgiveness of sins, and to rid us of all diseases, inasmuch as we ardently seek his aid, and reverently kiss his holy relics, and observe his annual memorial with love and longing, and through him beseech God for expiation and the great mercy.
ltx/en_us_dedes/me.m02.d10:meVE.AposTheotokion.incipit	@ltx/en_us_dedes/oc.m4.d2:ocMA.AposTheotokion.incipit
ltx/en_us_dedes/me.m02.d10:meVE.AposTheotokion.melody	
ltx/en_us_dedes/me.m02.d10:meVE.AposTheotokion.mode	@ltx/en_us_dedes/miscellanea:misc.Mode4
ltx/en_us_dedes/me.m02.d10:meVE.AposTheotokion.text	@ltx/en_us_dedes/oc.m4.d2:ocMA.AposTheotokion.text
ltx/en_us_dedes/me.m02.d10:meVE.Aposticha1.greekmelody	@ltx/en_us_dedes/he.a.m1:heAU.PaneffimoiMartyres.greekname
ltx/en_us_dedes/me.m02.d10:meVE.Aposticha1.incipit	O Martyr of Christ extolled…
ltx/en_us_dedes/me.m02.d10:meVE.Aposticha1.melody	@ltx/en_us_dedes/he.a.m1:heAU.PaneffimoiMartyres.name
ltx/en_us_dedes/me.m02.d10:meVE.Aposticha1.mode	@ltx/en_us_dedes/miscellanea:misc.Mode1
ltx/en_us_dedes/me.m02.d10:meVE.Aposticha1.text	O Martyr of Christ extolled by all, * athlete St. Haralambos, you bravely entered the stadium and stood proclaiming Christ * to be God and human. * Therefore you were strengthened by the power of the Spirit, and thus against the foes contested well. * You received the crown of victory. * We all therefore * now honor your sacred skull.
ltx/en_us_dedes/me.m02.d10:meVE.Aposticha2.incipit	Today all the region of…
ltx/en_us_dedes/me.m02.d10:meVE.Aposticha2.melody	@ltx/en_us_dedes/he.a.m1:heAU.PaneffimoiMartyres.name
ltx/en_us_dedes/me.m02.d10:meVE.Aposticha2.mode	@ltx/en_us_dedes/miscellanea:misc.Mode1
ltx/en_us_dedes/me.m02.d10:meVE.Aposticha2.text	Today all the region of Hellas, which has borne the name of Christ, * is very proud for it has obtained the relic of your skull, * as a well of healings * and as freely gotten wealth, * a truly undepletable gift of grace, that drives away the bane * of diseases and the pestilence * from the people * who praise you and call you blest.
ltx/en_us_dedes/me.m02.d10:meVE.Aposticha3.incipit	When you raised a dead…
ltx/en_us_dedes/me.m02.d10:meVE.Aposticha3.melody	@ltx/en_us_dedes/he.a.m1:heAU.PaneffimoiMartyres.name
ltx/en_us_dedes/me.m02.d10:meVE.Aposticha3.mode	@ltx/en_us_dedes/miscellanea:misc.Mode1
ltx/en_us_dedes/me.m02.d10:meVE.Aposticha3.text	When you raised a dead man by your prayer * the impious pagans were utterly shamed; nonetheless you brought many of them to Christ. * And when you delivered * the demoniac, O Saint, * you saved the Queen Galena from following the evil one’s deceit, * and you offered her to Christ as well * as a virgin and martyr who wears a crown.
ltx/en_us_dedes/me.m02.d10:meVE.Lity1.incipit	Be glad in the…
ltx/en_us_dedes/me.m02.d10:meVE.Lity1.melody	
ltx/en_us_dedes/me.m02.d10:meVE.Lity1.mode	@ltx/en_us_dedes/miscellanea:misc.Mode1
ltx/en_us_dedes/me.m02.d10:meVE.Lity1.text	Be glad in the Lord, all you cities of Hellas, and leap in exultation; for you possess the head of the Great-martyr Haralambos. It is for you a weighty treasure that never fails. With you we also daily draw from it the waters of healing, and we are safe from the all-destroying plague; and we give thanks to God, the Protector and Savior of our souls and bodies.
ltx/en_us_dedes/me.m02.d10:meVE.Lity2.incipit	O Martyr Haralambos, you are…
ltx/en_us_dedes/me.m02.d10:meVE.Lity2.melody	
ltx/en_us_dedes/me.m02.d10:meVE.Lity2.mode	@ltx/en_us_dedes/miscellanea:misc.Mode1
ltx/en_us_dedes/me.m02.d10:meVE.Lity2.text	O Martyr Haralambos, you are praised by all, for you fought well the fight for God, and you have become a citizen of the Kingdom of heaven, and now you intercede for the world. You left your much afflicted body on earth, to be a saving cure for those who approach it and touch it with longing. The land of Greece has your all-venerable head as inexhaustible wealth and as a priceless treasure. Through your relic, she receives the utmost gifts, and by the overshadowing of the divine grace that is in you, she is delivered from adversities.
ltx/en_us_dedes/me.m02.d10:meVE.Lity3.incipit	 O Martyr Haralambos, ardent…
ltx/en_us_dedes/me.m02.d10:meVE.Lity3.melody	
ltx/en_us_dedes/me.m02.d10:meVE.Lity3.mode	@ltx/en_us_dedes/miscellanea:misc.Mode1
ltx/en_us_dedes/me.m02.d10:meVE.Lity3.text	 O Martyr Haralambos, ardent faith and longing for your Master set you on fire, and you used martyrdom for Christ as a ladder to ascend to the celestial meadows. Now from heaven, by the grace that God has given you, you watch over us who celebrate your venerable memory, and who honor your feats of martyrdom, and who kiss your precious relics.
ltx/en_us_dedes/me.m02.d10:meVE.Lity4.incipit	O Saint, with the firm…
ltx/en_us_dedes/me.m02.d10:meVE.Lity4.melody	
ltx/en_us_dedes/me.m02.d10:meVE.Lity4.mode	@ltx/en_us_dedes/miscellanea:misc.Mode1
ltx/en_us_dedes/me.m02.d10:meVE.Lity4.text	O Saint, with the firm resistance of your contests, you blunted the evil one’s sharp arrows and you shamed the serpent, the author of wickedness, and his instrument, that most ungodly man Severus. You were established on the rock of faith and your resolve was immovable, thus you remained unshaken, and the ungodly arguments were unable to overturn your steadfast correct belief. And now you dance for joy with the Angels in the heavens, and you unceasingly intercede for us who with faith and longing honor your all-venerable head in sacred song.
ltx/en_us_dedes/me.m02.d10:meVE.Lity5.incipit	O valiant athlete of Christ…
ltx/en_us_dedes/me.m02.d10:meVE.Lity5.melody	
ltx/en_us_dedes/me.m02.d10:meVE.Lity5.mode	@ltx/en_us_dedes/miscellanea:misc.Mode1
ltx/en_us_dedes/me.m02.d10:meVE.Lity5.text	O valiant athlete of Christ and Great-martyr Haralambos, you disdained all things present as fleeting, you loudly declared the true God in the stadium with mighty resolve. And now, as you rejoice with the Angels in heaven, unceasingly entreat Christ, whom you boldly confessed to be the Son of God, that He grant peace to the world, and that He rid mankind of all destructive diseases. And deliver us from all dangers, as we kiss your venerable relics with faith and longing, and as we celebrate your holy memory.
ltx/en_us_dedes/me.m02.d10:meVE.Lity6.incipit	O God-inspired Saint, you were…
ltx/en_us_dedes/me.m02.d10:meVE.Lity6.melody	
ltx/en_us_dedes/me.m02.d10:meVE.Lity6.mode	@ltx/en_us_dedes/miscellanea:misc.Mode1
ltx/en_us_dedes/me.m02.d10:meVE.Lity6.text	O God-inspired Saint, you were guarded by fortitude of mind, and thus you dismissed the torments of the godless, and went manfully to martyrdom. Your mind was enlightened by the Holy Spirit, and you confounded the unlawful king, and you upheld the Orthodox Faith. And now in heaven, you have received the rewards of your labors, and you ever glorify the Holy Trinity, and you intercede for us who honor your precious relics with faith and love.
ltx/en_us_dedes/me.m02.d10:meVE.LityBoth.incipit	@ltx/en_us_dedes/oc.m5.d7:ocVE.AposTheotokion.incipit
ltx/en_us_dedes/me.m02.d10:meVE.LityBoth.melody	
ltx/en_us_dedes/me.m02.d10:meVE.LityBoth.mode	@ltx/en_us_dedes/miscellanea:misc.Mode5
ltx/en_us_dedes/me.m02.d10:meVE.LityBoth.text	@ltx/en_us_dedes/oc.m5.d7:ocVE.AposTheotokion.text
ltx/en_us_dedes/me.m02.d10:meVE.LityGlory.incipit	O all you fans of…
ltx/en_us_dedes/me.m02.d10:meVE.LityGlory.melody	
ltx/en_us_dedes/me.m02.d10:meVE.LityGlory.mode	@ltx/en_us_dedes/miscellanea:misc.Mode5
ltx/en_us_dedes/me.m02.d10:meVE.LityGlory.text	O all you fans of the Martyrs, come and let us be merry on this occasion of the sacred feast of the award-winning Martyr, and let us celebrate it spiritually. Today, we come together to observe the all-venerable feast of the Hieromartyr Haralambos; set before us is the spiritual table of his excellent feats of martyrdom, as well as his most famous skull. His relic pours out a river of cures for all who approach with faith. And they are healed in both soul and body, they are delivered from afflictions, and they receive the great mercy.
ltx/en_us_dedes/me.m02.d10:meVE.SticGlory.incipit	You offered to God a…
ltx/en_us_dedes/me.m02.d10:meVE.SticGlory.melody	
ltx/en_us_dedes/me.m02.d10:meVE.SticGlory.mode	@ltx/en_us_dedes/miscellanea:misc.Mode4
ltx/en_us_dedes/me.m02.d10:meVE.SticGlory.text	You offered to God a sacrifice of praise, when you liturgized for your Master and Maker, as a most lawful priest. You also emulated His Passion, O Godly-minded Haralambos; for you offered yourself as an acceptable sacrifice to Him who for you had offered himself as a sacrifice to God the Father. Therefore you rejoice now with Him in heavenly dwellings, in the Church of the first-born. You also unceasingly intercede with Him, that we be delivered from wrath and tribulation, we who honor your all-festive memory and with ardent longing venerate your skull, which pours out countless miracles, and drives away pestilence and disease, and rewards us with salvation and healing.
ltx/en_us_dedes/me.m02.d10:meVE.SticTheotokion.incipit	@ltx/en_us_dedes/oc.m4.d1:ocVE.SticTheotokion.incipit
ltx/en_us_dedes/me.m02.d10:meVE.SticTheotokion.melody	
ltx/en_us_dedes/me.m02.d10:meVE.SticTheotokion.mode	@ltx/en_us_dedes/miscellanea:misc.Mode4
ltx/en_us_dedes/me.m02.d10:meVE.SticTheotokion.text	@ltx/en_us_dedes/oc.m4.d1:ocVE.SticTheotokion.text
ltx/en_us_dedes/me.m02.d10:meVE.Stichera01.greekmelody	@ltx/en_us_dedes/he.a.m6:heAU.OlinApothemenoi.greekname
ltx/en_us_dedes/me.m02.d10:meVE.Stichera01.incipit	To the Master from your…
ltx/en_us_dedes/me.m02.d10:meVE.Stichera01.melody	@ltx/en_us_dedes/he.a.m6:heAU.OlinApothemenoi.name
ltx/en_us_dedes/me.m02.d10:meVE.Stichera01.mode	@ltx/en_us_dedes/miscellanea:misc.Mode6
ltx/en_us_dedes/me.m02.d10:meVE.Stichera01.text	To the Master from your youth you were completely devoted, * and you loved and longed for Him, * and you followed in His steps faithfully, O Saint. * Purified of the stains * of the sinful passions, * grace divine was richly given you, * to cure diseases all * and to work most marvelous miracles. * When you were called to witness Christ, * you were given strength by the Crucified * to remain unshaken * by punishment and tortures of all kinds. * And now entreat Him persistently, * praying Him to save our souls.
ltx/en_us_dedes/me.m02.d10:meVE.Stichera02.incipit	Your blessed invincible * and…
ltx/en_us_dedes/me.m02.d10:meVE.Stichera02.melody	@ltx/en_us_dedes/he.a.m6:heAU.OlinApothemenoi.name
ltx/en_us_dedes/me.m02.d10:meVE.Stichera02.mode	@ltx/en_us_dedes/miscellanea:misc.Mode6
ltx/en_us_dedes/me.m02.d10:meVE.Stichera02.text	Your blessed invincible * and most longsuffering body, * O athlete Haralambos, * endured being skinned alive * and transfixed by nails. * Even as you were crushed * you maintained soul and mind * uncorrupted and inviolate. * For the divine intense * love for God within you burned mightily, * inciting you to patiently * suffer every torture and punishment. * O prize-winning Martyr * and sharer in the sufferings of Christ, * do now entreat Him with confidence, * praying Him to save our souls.
ltx/en_us_dedes/me.m02.d10:meVE.Stichera03.incipit	For your contest you have…
ltx/en_us_dedes/me.m02.d10:meVE.Stichera03.melody	@ltx/en_us_dedes/he.a.m6:heAU.OlinApothemenoi.name
ltx/en_us_dedes/me.m02.d10:meVE.Stichera03.mode	@ltx/en_us_dedes/miscellanea:misc.Mode6
ltx/en_us_dedes/me.m02.d10:meVE.Stichera03.text	For your contest you have won great exultation forever * and glory most hon’rable * and the joy that brilliantly shines like many lamps. * O devout priest of God, * venerable athlete, * and a soldier very wise and brave, * by grace you utterly * drowned the dragon’s armies and regiments * within the river of your blood, * O all-holy Martyr Haralambos. * And by your divine prayer * you truly raised some people who had died. * And now with confidence you entreat * the Lord that He save our souls.
ltx/en_us_dedes/me.m02.d10:meVE.Stichera04.greekmelody	@ltx/en_us_dedes/he.a.m4:heAU.EdokasSimeiosin.greekname
ltx/en_us_dedes/me.m02.d10:meVE.Stichera04.incipit	You delivered up your body…
ltx/en_us_dedes/me.m02.d10:meVE.Stichera04.melody	@ltx/en_us_dedes/he.a.m4:heAU.EdokasSimeiosin.name
ltx/en_us_dedes/me.m02.d10:meVE.Stichera04.mode	@ltx/en_us_dedes/miscellanea:misc.Mode4
ltx/en_us_dedes/me.m02.d10:meVE.Stichera04.text	You delivered up your body to be tortured, O famous one; * but your soul you preserved intact, * blameless and untainted by * any sin or baseness * or the false religion of the tormenters of your flesh. * And having lifted your mind to heaven’s heights, * all-glorious Haralambos, to where your Master and Maker is, * you were granted to dwell with Him * in the heavenly bridal room.
ltx/en_us_dedes/me.m02.d10:meVE.Stichera05.incipit	Lord, to us Your humble…
ltx/en_us_dedes/me.m02.d10:meVE.Stichera05.melody	@ltx/en_us_dedes/he.a.m4:heAU.EdokasSimeiosin.name
ltx/en_us_dedes/me.m02.d10:meVE.Stichera05.mode	@ltx/en_us_dedes/miscellanea:misc.Mode4
ltx/en_us_dedes/me.m02.d10:meVE.Stichera05.text	Lord, to us Your humble servants You have given Your faithful one, * glorious St. Haralambos, * to be an infallible cure of all diseases, * and to be a comfort during catastrophe and woe, * a great destroyer of error and deceit. * O Savior of our souls and Lord of tender mercies, we glorify * and extol Your benevolent * and divine plan to save the world.
ltx/en_us_dedes/me.m02.d10:meVE.Stichera06.incipit	As your name in Greek…
ltx/en_us_dedes/me.m02.d10:meVE.Stichera06.melody	@ltx/en_us_dedes/he.a.m4:heAU.EdokasSimeiosin.name
ltx/en_us_dedes/me.m02.d10:meVE.Stichera06.mode	@ltx/en_us_dedes/miscellanea:misc.Mode4
ltx/en_us_dedes/me.m02.d10:meVE.Stichera06.text	As your name in Greek denotes, the grace of healing that you display * unto all is indicative * of grace you obtained from God * passing understanding. * Likewise do the wonders and countless miracles that you * perform, O glorious Martyr, now proclaim * the special gifts that Christ our God, surpassing reason and intellect, * has profusely bestowed on you, * O prize-winner Haralambos.
