ltx/en_us_dedes/me.m12.d23:meCO.C1.acrostic.notice1	
ltx/en_us_dedes/me.m12.d23:meCO.C1.acrostic.text	
ltx/en_us_dedes/me.m12.d23:meCO.C1.acrostic.title	Three-ode Canon.
ltx/en_us_dedes/me.m12.d23:meCO.C1.title	Three-ode Canon of the Forefeast.
ltx/en_us_dedes/me.m12.d23:meCO.C1.verse	@ltx/en_us_dedes/prayers:pr.verse_God.text
ltx/en_us_dedes/me.m12.d23:meCO.Ode5C11.incipit	…
ltx/en_us_dedes/me.m12.d23:meCO.Ode5C11.melody	@ltx/en_us_dedes/he.h.m6:heHE.ProsSeOrthrizo.name
ltx/en_us_dedes/me.m12.d23:meCO.Ode5C11.mode	@ltx/en_us_dedes/miscellanea:misc.Mode6
ltx/en_us_dedes/me.m12.d23:meCO.Ode5C11.ode	@ltx/en_us_dedes/miscellanea:misc.Ode5
ltx/en_us_dedes/me.m12.d23:meCO.Ode5C11.text	
ltx/en_us_dedes/me.m12.d23:meCO.Ode5C12.incipit	…
ltx/en_us_dedes/me.m12.d23:meCO.Ode5C12.melody	@ltx/en_us_dedes/he.h.m6:heHE.ProsSeOrthrizo.name
ltx/en_us_dedes/me.m12.d23:meCO.Ode5C12.mode	@ltx/en_us_dedes/miscellanea:misc.Mode6
ltx/en_us_dedes/me.m12.d23:meCO.Ode5C12.ode	@ltx/en_us_dedes/miscellanea:misc.Ode5
ltx/en_us_dedes/me.m12.d23:meCO.Ode5C12.text	
ltx/en_us_dedes/me.m12.d23:meCO.Ode5C1H.incipit	…
ltx/en_us_dedes/me.m12.d23:meCO.Ode5C1H.melody	@ltx/en_us_dedes/he.h.m6:heHE.ProsSeOrthrizo.name
ltx/en_us_dedes/me.m12.d23:meCO.Ode5C1H.mode	@ltx/en_us_dedes/miscellanea:misc.Mode6
ltx/en_us_dedes/me.m12.d23:meCO.Ode5C1H.ode	@ltx/en_us_dedes/miscellanea:misc.Ode5
ltx/en_us_dedes/me.m12.d23:meCO.Ode5C1H.text	
ltx/en_us_dedes/me.m12.d23:meCO.Ode8C11.incipit	…
ltx/en_us_dedes/me.m12.d23:meCO.Ode8C11.melody	@ltx/en_us_dedes/he.h.m6:heHE.StilinKakiasAntitheou.name
ltx/en_us_dedes/me.m12.d23:meCO.Ode8C11.mode	@ltx/en_us_dedes/miscellanea:misc.Mode6
ltx/en_us_dedes/me.m12.d23:meCO.Ode8C11.ode	@ltx/en_us_dedes/miscellanea:misc.Ode8
ltx/en_us_dedes/me.m12.d23:meCO.Ode8C11.text	
ltx/en_us_dedes/me.m12.d23:meCO.Ode8C12.incipit	…
ltx/en_us_dedes/me.m12.d23:meCO.Ode8C12.melody	@ltx/en_us_dedes/he.h.m6:heHE.StilinKakiasAntitheou.name
ltx/en_us_dedes/me.m12.d23:meCO.Ode8C12.mode	@ltx/en_us_dedes/miscellanea:misc.Mode6
ltx/en_us_dedes/me.m12.d23:meCO.Ode8C12.ode	@ltx/en_us_dedes/miscellanea:misc.Ode8
ltx/en_us_dedes/me.m12.d23:meCO.Ode8C12.text	
ltx/en_us_dedes/me.m12.d23:meCO.Ode8C13.incipit	…
ltx/en_us_dedes/me.m12.d23:meCO.Ode8C13.melody	@ltx/en_us_dedes/he.h.m6:heHE.StilinKakiasAntitheou.name
ltx/en_us_dedes/me.m12.d23:meCO.Ode8C13.mode	@ltx/en_us_dedes/miscellanea:misc.Mode6
ltx/en_us_dedes/me.m12.d23:meCO.Ode8C13.ode	@ltx/en_us_dedes/miscellanea:misc.Ode8
ltx/en_us_dedes/me.m12.d23:meCO.Ode8C13.text	
ltx/en_us_dedes/me.m12.d23:meCO.Ode8C14.incipit	…
ltx/en_us_dedes/me.m12.d23:meCO.Ode8C14.melody	@ltx/en_us_dedes/he.h.m6:heHE.StilinKakiasAntitheou.name
ltx/en_us_dedes/me.m12.d23:meCO.Ode8C14.mode	@ltx/en_us_dedes/miscellanea:misc.Mode6
ltx/en_us_dedes/me.m12.d23:meCO.Ode8C14.ode	@ltx/en_us_dedes/miscellanea:misc.Ode8
ltx/en_us_dedes/me.m12.d23:meCO.Ode8C14.text	
ltx/en_us_dedes/me.m12.d23:meCO.Ode8C1H.incipit	…
ltx/en_us_dedes/me.m12.d23:meCO.Ode8C1H.melody	@ltx/en_us_dedes/he.h.m6:heHE.StilinKakiasAntitheou.name
ltx/en_us_dedes/me.m12.d23:meCO.Ode8C1H.mode	@ltx/en_us_dedes/miscellanea:misc.Mode6
ltx/en_us_dedes/me.m12.d23:meCO.Ode8C1H.ode	@ltx/en_us_dedes/miscellanea:misc.Ode8
ltx/en_us_dedes/me.m12.d23:meCO.Ode8C1H.text	
ltx/en_us_dedes/me.m12.d23:meCO.Ode9C11.incipit	…
ltx/en_us_dedes/me.m12.d23:meCO.Ode9C11.melody	@ltx/en_us_dedes/he.h.m6:heHE.TinTimioteran.name
ltx/en_us_dedes/me.m12.d23:meCO.Ode9C11.mode	@ltx/en_us_dedes/miscellanea:misc.Mode6
ltx/en_us_dedes/me.m12.d23:meCO.Ode9C11.ode	@ltx/en_us_dedes/miscellanea:misc.Ode9
ltx/en_us_dedes/me.m12.d23:meCO.Ode9C11.text	
ltx/en_us_dedes/me.m12.d23:meCO.Ode9C12.incipit	…
ltx/en_us_dedes/me.m12.d23:meCO.Ode9C12.melody	@ltx/en_us_dedes/he.h.m6:heHE.TinTimioteran.name
ltx/en_us_dedes/me.m12.d23:meCO.Ode9C12.mode	@ltx/en_us_dedes/miscellanea:misc.Mode6
ltx/en_us_dedes/me.m12.d23:meCO.Ode9C12.ode	@ltx/en_us_dedes/miscellanea:misc.Ode9
ltx/en_us_dedes/me.m12.d23:meCO.Ode9C12.text	
ltx/en_us_dedes/me.m12.d23:meCO.Ode9C13.incipit	…
ltx/en_us_dedes/me.m12.d23:meCO.Ode9C13.melody	@ltx/en_us_dedes/he.h.m6:heHE.TinTimioteran.name
ltx/en_us_dedes/me.m12.d23:meCO.Ode9C13.mode	@ltx/en_us_dedes/miscellanea:misc.Mode6
ltx/en_us_dedes/me.m12.d23:meCO.Ode9C13.ode	@ltx/en_us_dedes/miscellanea:misc.Ode9
ltx/en_us_dedes/me.m12.d23:meCO.Ode9C13.text	
ltx/en_us_dedes/me.m12.d23:meCO.Ode9C14.incipit	…
ltx/en_us_dedes/me.m12.d23:meCO.Ode9C14.melody	@ltx/en_us_dedes/he.h.m6:heHE.TinTimioteran.name
ltx/en_us_dedes/me.m12.d23:meCO.Ode9C14.mode	@ltx/en_us_dedes/miscellanea:misc.Mode6
ltx/en_us_dedes/me.m12.d23:meCO.Ode9C14.ode	@ltx/en_us_dedes/miscellanea:misc.Ode9
ltx/en_us_dedes/me.m12.d23:meCO.Ode9C14.text	
ltx/en_us_dedes/me.m12.d23:meCO.Ode9C1H.incipit	@ltx/en_us_dedes/he.h.m6:heHE.TinTimioteran.incipit
ltx/en_us_dedes/me.m12.d23:meCO.Ode9C1H.melody	@ltx/en_us_dedes/he.h.m6:heHE.TinTimioteran.melody
ltx/en_us_dedes/me.m12.d23:meCO.Ode9C1H.mode	@ltx/en_us_dedes/miscellanea:misc.Mode6
ltx/en_us_dedes/me.m12.d23:meCO.Ode9C1H.ode	@ltx/en_us_dedes/miscellanea:misc.Ode9
ltx/en_us_dedes/me.m12.d23:meCO.Ode9C1H.text	@ltx/en_us_dedes/he.h.m6:heHE.TinTimioteran.text
ltx/en_us_dedes/me.m12.d23:meDA.commemoration.first	Memory of the Holy Ten Martyrs in Crete
ltx/en_us_dedes/me.m12.d23:meDA.commemoration.first_name	
ltx/en_us_dedes/me.m12.d23:meDA.commemoration.first_short	Memory of the Holy Ten Martyrs in Crete
ltx/en_us_dedes/me.m12.d23:meDA.commemoration.first_title	@ltx/en_us_dedes/titles:ti.Martyrs
ltx/en_us_dedes/me.m12.d23:meDA.commemoration.full	Memory of the Holy Ten Martyrs in Crete
ltx/en_us_dedes/me.m12.d23:meDA.commemoration.second_name	
ltx/en_us_dedes/me.m12.d23:meDA.commemoration.second_title	
ltx/en_us_dedes/me.m12.d23:meDA.date	December 23
ltx/en_us_dedes/me.m12.d23:meDA.fordate	for December 23
ltx/en_us_dedes/me.m12.d23:meDA.insert1	the holy Ten Martyrs in Crete,
ltx/en_us_dedes/me.m12.d23:meDA.insert2	whose memory we are observing;
ltx/en_us_dedes/me.m12.d23:meDA.note	
ltx/en_us_dedes/me.m12.d23:meDA.pdfcoverdate	December 23,
ltx/en_us_dedes/me.m12.d23:meDA.pdfheaderdate	December 23
ltx/en_us_dedes/me.m12.d23:meHO.commemorations	
ltx/en_us_dedes/me.m12.d23:meHO.note1	
ltx/en_us_dedes/me.m12.d23:meHO.note2	
ltx/en_us_dedes/me.m12.d23:meHO.number	
ltx/en_us_dedes/me.m12.d23:meHO.rank	
ltx/en_us_dedes/me.m12.d23:meLE.commemoration1	
ltx/en_us_dedes/me.m12.d23:meLE.commemoration2	
ltx/en_us_dedes/me.m12.d23:meLI.Kontakion1.greekmelody	@ltx/en_us_dedes/me.m12.d23:meMA.Kontakion1.greekmelody
ltx/en_us_dedes/me.m12.d23:meLI.Kontakion1.incipit	@ltx/en_us_dedes/me.m12.d23:meMA.Kontakion1.incipit
ltx/en_us_dedes/me.m12.d23:meLI.Kontakion1.melody	@ltx/en_us_dedes/me.m12.d23:meMA.Kontakion1.melody
ltx/en_us_dedes/me.m12.d23:meLI.Kontakion1.mode	@ltx/en_us_dedes/me.m12.d23:meMA.Kontakion1.mode
ltx/en_us_dedes/me.m12.d23:meLI.Kontakion1.text	@ltx/en_us_dedes/me.m12.d23:meMA.Kontakion1.text
ltx/en_us_dedes/me.m12.d23:meLI.Megalynarion.text	
ltx/en_us_dedes/me.m12.d23:meMA.AposBoth.incipit	…
ltx/en_us_dedes/me.m12.d23:meMA.AposBoth.melody	
ltx/en_us_dedes/me.m12.d23:meMA.AposBoth.mode	@ltx/en_us_dedes/miscellanea:misc.Mode8
ltx/en_us_dedes/me.m12.d23:meMA.AposBoth.poet	@ltx/en_us_dedes/poets:po.Anatoliou
ltx/en_us_dedes/me.m12.d23:meMA.AposBoth.text	
ltx/en_us_dedes/me.m12.d23:meMA.AposGlory.incipit	O valiant Martyrs, witnesses to…
ltx/en_us_dedes/me.m12.d23:meMA.AposGlory.melody	
ltx/en_us_dedes/me.m12.d23:meMA.AposGlory.mode	@ltx/en_us_dedes/miscellanea:misc.Mode3
ltx/en_us_dedes/me.m12.d23:meMA.AposGlory.poet	@ltx/en_us_dedes/poets:po.Stouditou
ltx/en_us_dedes/me.m12.d23:meMA.AposGlory.text	O valiant Martyrs, witnesses to the truth, nothing was able to separate you from your love for God, not the force of the tyrant, nor deceptive flattery, nor dismemberment, nor the threat of death. Therefore, as a reward for the painful torments you endured, you have great access to Christ, the God over all, so you can entreat Him, that by your prayers we might receive great mercy from Christ.
ltx/en_us_dedes/me.m12.d23:meMA.Aposticha1.greekmelody	@ltx/en_us_dedes/he.a.m1:heAU.PaneffimoiMartyres.greekname
ltx/en_us_dedes/me.m12.d23:meMA.Aposticha1.incipit	…
ltx/en_us_dedes/me.m12.d23:meMA.Aposticha1.melody	@ltx/en_us_dedes/he.a.m1:heAU.PaneffimoiMartyres.name
ltx/en_us_dedes/me.m12.d23:meMA.Aposticha1.mode	@ltx/en_us_dedes/miscellanea:misc.Mode1
ltx/en_us_dedes/me.m12.d23:meMA.Aposticha1.text	
ltx/en_us_dedes/me.m12.d23:meMA.Aposticha2.incipit	…
ltx/en_us_dedes/me.m12.d23:meMA.Aposticha2.melody	@ltx/en_us_dedes/he.a.m1:heAU.PaneffimoiMartyres.name
ltx/en_us_dedes/me.m12.d23:meMA.Aposticha2.mode	@ltx/en_us_dedes/miscellanea:misc.Mode1
ltx/en_us_dedes/me.m12.d23:meMA.Aposticha2.text	
ltx/en_us_dedes/me.m12.d23:meMA.Aposticha3.incipit	…
ltx/en_us_dedes/me.m12.d23:meMA.Aposticha3.melody	@ltx/en_us_dedes/he.a.m1:heAU.PaneffimoiMartyres.name
ltx/en_us_dedes/me.m12.d23:meMA.Aposticha3.mode	@ltx/en_us_dedes/miscellanea:misc.Mode1
ltx/en_us_dedes/me.m12.d23:meMA.Aposticha3.text	
ltx/en_us_dedes/me.m12.d23:meMA.C1.acrostic.notice1	
ltx/en_us_dedes/me.m12.d23:meMA.C1.acrostic.title	
ltx/en_us_dedes/me.m12.d23:meMA.C1.poet	@ltx/en_us_dedes/poets:po.Iosif
ltx/en_us_dedes/me.m12.d23:meMA.C1.title	@ltx/en_us_dedes/titles:ti.CanonForefeast
ltx/en_us_dedes/me.m12.d23:meMA.C1.verse	@ltx/en_us_dedes/prayers:pr.verse_God.text
ltx/en_us_dedes/me.m12.d23:meMA.C2.title	@ltx/en_us_dedes/titles:ti.AnotherCanonForefeast
ltx/en_us_dedes/me.m12.d23:meMA.C2.verse	@ltx/en_us_dedes/prayers:pr.verse_God.text
ltx/en_us_dedes/me.m12.d23:meMA.C3.title	@ltx/en_us_dedes/titles:ti.CanonMartyrs
ltx/en_us_dedes/me.m12.d23:meMA.C3.verse	@ltx/en_us_dedes/prayers:pr.verse_SaintsM.text
ltx/en_us_dedes/me.m12.d23:meMA.Exaposteilarion1.greekmelody	@ltx/en_us_dedes/he.a.m2:heAU.ToisMathitaisSynelthomen.greekname
ltx/en_us_dedes/me.m12.d23:meMA.Exaposteilarion1.incipit	Let us joyfully crown with…
ltx/en_us_dedes/me.m12.d23:meMA.Exaposteilarion1.melody	@ltx/en_us_dedes/he.a.m2:heAU.ToisMathitaisSynelthomen.notmetered
ltx/en_us_dedes/me.m12.d23:meMA.Exaposteilarion1.mode	@ltx/en_us_dedes/miscellanea:misc.Mode2
ltx/en_us_dedes/me.m12.d23:meMA.Exaposteilarion1.text	Let us joyfully crown with hymns of praise the glorious and renowned holy Martyrs: Theodoulos, Zotikos, Agathopus, Satorninos, Pompey, Evnikianos, Vasilides, Efporos, Gelasios, and Evarestos. By their intercessions may we be freed from our transgressions, and may we also be crowned by Christ the Savior.
ltx/en_us_dedes/me.m12.d23:meMA.Exaposteilarion2.greekmelody	@ltx/en_us_dedes/he.a.m2:heAU.ToisMathitaisSynelthomen.greekname
ltx/en_us_dedes/me.m12.d23:meMA.Exaposteilarion2.incipit	Let us who practiced virtue…
ltx/en_us_dedes/me.m12.d23:meMA.Exaposteilarion2.melody	@ltx/en_us_dedes/he.a.m2:heAU.ToisMathitaisSynelthomen.notmetered
ltx/en_us_dedes/me.m12.d23:meMA.Exaposteilarion2.mode	@ltx/en_us_dedes/miscellanea:misc.Mode2
ltx/en_us_dedes/me.m12.d23:meMA.Exaposteilarion2.text	Let us who practiced virtue, and who hastened to mortify the passions by self-control, now offer praiseworthy action and focused contemplation, as our own gifts, like the shepherds and the Magi, in faith to God, whose good pleasure is our salvation, and who is coming to be born of the Virgin.
ltx/en_us_dedes/me.m12.d23:meMA.Kathisma11.greekmelody	@ltx/en_us_dedes/he.a.m5:heAU.TonSynanarchonLogon.greekname
ltx/en_us_dedes/me.m12.d23:meMA.Kathisma11.incipit	…
ltx/en_us_dedes/me.m12.d23:meMA.Kathisma11.melody	@ltx/en_us_dedes/he.a.m5:heAU.TonSynanarchonLogon.name
ltx/en_us_dedes/me.m12.d23:meMA.Kathisma11.mode	@ltx/en_us_dedes/miscellanea:misc.Mode5
ltx/en_us_dedes/me.m12.d23:meMA.Kathisma11.text	
ltx/en_us_dedes/me.m12.d23:meMA.Kathisma21.greekmelody	@ltx/en_us_dedes/he.a.m6:heAU.ElpisTouKosmouAgathi.greekname
ltx/en_us_dedes/me.m12.d23:meMA.Kathisma21.incipit	…
ltx/en_us_dedes/me.m12.d23:meMA.Kathisma21.melody	@ltx/en_us_dedes/he.a.m6:heAU.ElpisTouKosmouAgathi.name
ltx/en_us_dedes/me.m12.d23:meMA.Kathisma21.mode	@ltx/en_us_dedes/miscellanea:misc.Mode6
ltx/en_us_dedes/me.m12.d23:meMA.Kathisma21.text	
ltx/en_us_dedes/me.m12.d23:meMA.Kontakion1.greekmelody	@ltx/en_us_dedes/he.a.m4:heAU.EpefanisSimeron.greekname
ltx/en_us_dedes/me.m12.d23:meMA.Kontakion1.incipit	…
ltx/en_us_dedes/me.m12.d23:meMA.Kontakion1.melody	@ltx/en_us_dedes/he.a.m4:heAU.EpefanisSimeron.name
ltx/en_us_dedes/me.m12.d23:meMA.Kontakion1.mode	@ltx/en_us_dedes/miscellanea:misc.Mode4
ltx/en_us_dedes/me.m12.d23:meMA.Kontakion1.text	
ltx/en_us_dedes/me.m12.d23:meMA.Lauds1.greekmelody	@ltx/en_us_dedes/he.a.m6:heAU.AiAngelikai.greekname
ltx/en_us_dedes/me.m12.d23:meMA.Lauds1.incipit	…
ltx/en_us_dedes/me.m12.d23:meMA.Lauds1.melody	@ltx/en_us_dedes/he.a.m6:heAU.AiAngelikai.name
ltx/en_us_dedes/me.m12.d23:meMA.Lauds1.mode	@ltx/en_us_dedes/miscellanea:misc.Mode6
ltx/en_us_dedes/me.m12.d23:meMA.Lauds1.text	
ltx/en_us_dedes/me.m12.d23:meMA.Lauds2.incipit	…
ltx/en_us_dedes/me.m12.d23:meMA.Lauds2.melody	@ltx/en_us_dedes/he.a.m6:heAU.AiAngelikai.name
ltx/en_us_dedes/me.m12.d23:meMA.Lauds2.mode	@ltx/en_us_dedes/miscellanea:misc.Mode6
ltx/en_us_dedes/me.m12.d23:meMA.Lauds2.text	
ltx/en_us_dedes/me.m12.d23:meMA.Lauds3.incipit	…
ltx/en_us_dedes/me.m12.d23:meMA.Lauds3.melody	@ltx/en_us_dedes/he.a.m6:heAU.AiAngelikai.name
ltx/en_us_dedes/me.m12.d23:meMA.Lauds3.mode	@ltx/en_us_dedes/miscellanea:misc.Mode6
ltx/en_us_dedes/me.m12.d23:meMA.Lauds3.text	
ltx/en_us_dedes/me.m12.d23:meMA.Lauds4.greekmelody	@ltx/en_us_dedes/he.a.m6:heAU.AiAngelikai.greekname
ltx/en_us_dedes/me.m12.d23:meMA.Lauds4.incipit	…
ltx/en_us_dedes/me.m12.d23:meMA.Lauds4.melody	@ltx/en_us_dedes/he.a.m6:heAU.AiAngelikai.name
ltx/en_us_dedes/me.m12.d23:meMA.Lauds4.mode	@ltx/en_us_dedes/miscellanea:misc.Mode6
ltx/en_us_dedes/me.m12.d23:meMA.Lauds4.text	
ltx/en_us_dedes/me.m12.d23:meMA.LaudsBoth.incipit	…
ltx/en_us_dedes/me.m12.d23:meMA.LaudsBoth.melody	@ltx/en_us_dedes/he.a.m6:heAU.AiAngelikai.name
ltx/en_us_dedes/me.m12.d23:meMA.LaudsBoth.mode	@ltx/en_us_dedes/miscellanea:misc.Mode6
ltx/en_us_dedes/me.m12.d23:meMA.LaudsBoth.text	
ltx/en_us_dedes/me.m12.d23:meMA.LaudsGlory.incipit	…
ltx/en_us_dedes/me.m12.d23:meMA.LaudsGlory.melody	@ltx/en_us_dedes/he.a.m6:heAU.AiAngelikai.name
ltx/en_us_dedes/me.m12.d23:meMA.LaudsGlory.mode	@ltx/en_us_dedes/miscellanea:misc.Mode6
ltx/en_us_dedes/me.m12.d23:meMA.LaudsGlory.text	
ltx/en_us_dedes/me.m12.d23:meMA.Ode1C11.greekmelody	@ltx/en_us_dedes/he.h.m2:heHE.AtriptonAsynithi.greekname
ltx/en_us_dedes/me.m12.d23:meMA.Ode1C11.incipit	…
ltx/en_us_dedes/me.m12.d23:meMA.Ode1C11.melody	@ltx/en_us_dedes/he.h.m2:heHE.AtriptonAsynithi.name
ltx/en_us_dedes/me.m12.d23:meMA.Ode1C11.mode	@ltx/en_us_dedes/miscellanea:misc.Mode2
ltx/en_us_dedes/me.m12.d23:meMA.Ode1C11.ode	@ltx/en_us_dedes/miscellanea:misc.Ode1
ltx/en_us_dedes/me.m12.d23:meMA.Ode1C11.text	
ltx/en_us_dedes/me.m12.d23:meMA.Ode1C12.incipit	…
ltx/en_us_dedes/me.m12.d23:meMA.Ode1C12.melody	@ltx/en_us_dedes/he.h.m2:heHE.AtriptonAsynithi.name
ltx/en_us_dedes/me.m12.d23:meMA.Ode1C12.mode	@ltx/en_us_dedes/miscellanea:misc.Mode2
ltx/en_us_dedes/me.m12.d23:meMA.Ode1C12.ode	@ltx/en_us_dedes/miscellanea:misc.Ode1
ltx/en_us_dedes/me.m12.d23:meMA.Ode1C12.text	
ltx/en_us_dedes/me.m12.d23:meMA.Ode1C13.incipit	…
ltx/en_us_dedes/me.m12.d23:meMA.Ode1C13.melody	@ltx/en_us_dedes/he.h.m2:heHE.AtriptonAsynithi.name
ltx/en_us_dedes/me.m12.d23:meMA.Ode1C13.mode	@ltx/en_us_dedes/miscellanea:misc.Mode2
ltx/en_us_dedes/me.m12.d23:meMA.Ode1C13.ode	@ltx/en_us_dedes/miscellanea:misc.Ode1
ltx/en_us_dedes/me.m12.d23:meMA.Ode1C13.text	
ltx/en_us_dedes/me.m12.d23:meMA.Ode1C1H.greekmelody	@ltx/en_us_dedes/he.h.m2:heHE.AtriptonAsynithi.greekname
ltx/en_us_dedes/me.m12.d23:meMA.Ode1C1H.incipit	@ltx/en_us_dedes/he.h.m2:heHE.AtriptonAsynithi.incipit
ltx/en_us_dedes/me.m12.d23:meMA.Ode1C1H.melody	@ltx/en_us_dedes/he.h.m2:heHE.AtriptonAsynithi.melody
ltx/en_us_dedes/me.m12.d23:meMA.Ode1C1H.mode	@ltx/en_us_dedes/miscellanea:misc.Mode2
ltx/en_us_dedes/me.m12.d23:meMA.Ode1C1H.ode	@ltx/en_us_dedes/miscellanea:misc.Ode1
ltx/en_us_dedes/me.m12.d23:meMA.Ode1C1H.text	@ltx/en_us_dedes/he.h.m2:heHE.AtriptonAsynithi.text
ltx/en_us_dedes/me.m12.d23:meMA.Ode1C21.greekmelody	@ltx/en_us_dedes/he.h.m6:heHE.OsEnIpeiroPezefsas.greekname
ltx/en_us_dedes/me.m12.d23:meMA.Ode1C21.incipit	…
ltx/en_us_dedes/me.m12.d23:meMA.Ode1C21.melody	@ltx/en_us_dedes/he.h.m6:heHE.OsEnIpeiroPezefsas.name
ltx/en_us_dedes/me.m12.d23:meMA.Ode1C21.mode	@ltx/en_us_dedes/miscellanea:misc.Mode6
ltx/en_us_dedes/me.m12.d23:meMA.Ode1C21.ode	@ltx/en_us_dedes/miscellanea:misc.Ode1
ltx/en_us_dedes/me.m12.d23:meMA.Ode1C21.text	
ltx/en_us_dedes/me.m12.d23:meMA.Ode1C22.incipit	…
ltx/en_us_dedes/me.m12.d23:meMA.Ode1C22.melody	@ltx/en_us_dedes/he.h.m6:heHE.OsEnIpeiroPezefsas.name
ltx/en_us_dedes/me.m12.d23:meMA.Ode1C22.mode	@ltx/en_us_dedes/miscellanea:misc.Mode6
ltx/en_us_dedes/me.m12.d23:meMA.Ode1C22.ode	@ltx/en_us_dedes/miscellanea:misc.Ode1
ltx/en_us_dedes/me.m12.d23:meMA.Ode1C22.text	
ltx/en_us_dedes/me.m12.d23:meMA.Ode1C23.incipit	…
ltx/en_us_dedes/me.m12.d23:meMA.Ode1C23.melody	@ltx/en_us_dedes/he.h.m6:heHE.OsEnIpeiroPezefsas.name
ltx/en_us_dedes/me.m12.d23:meMA.Ode1C23.mode	@ltx/en_us_dedes/miscellanea:misc.Mode6
ltx/en_us_dedes/me.m12.d23:meMA.Ode1C23.ode	@ltx/en_us_dedes/miscellanea:misc.Ode1
ltx/en_us_dedes/me.m12.d23:meMA.Ode1C23.text	
ltx/en_us_dedes/me.m12.d23:meMA.Ode1C2T.incipit	…
ltx/en_us_dedes/me.m12.d23:meMA.Ode1C2T.melody	@ltx/en_us_dedes/he.h.m6:heHE.OsEnIpeiroPezefsas.name
ltx/en_us_dedes/me.m12.d23:meMA.Ode1C2T.mode	@ltx/en_us_dedes/miscellanea:misc.Mode6
ltx/en_us_dedes/me.m12.d23:meMA.Ode1C2T.ode	@ltx/en_us_dedes/miscellanea:misc.Ode1
ltx/en_us_dedes/me.m12.d23:meMA.Ode1C2T.text	
ltx/en_us_dedes/me.m12.d23:meMA.Ode1C31.greekmelody	@ltx/en_us_dedes/he.h.m3:heHE.AsomenToKyrio.greekname
ltx/en_us_dedes/me.m12.d23:meMA.Ode1C31.incipit	…
ltx/en_us_dedes/me.m12.d23:meMA.Ode1C31.melody	@ltx/en_us_dedes/he.h.m3:heHE.AsomenToKyrio.name
ltx/en_us_dedes/me.m12.d23:meMA.Ode1C31.mode	@ltx/en_us_dedes/miscellanea:misc.Mode3
ltx/en_us_dedes/me.m12.d23:meMA.Ode1C31.ode	@ltx/en_us_dedes/miscellanea:misc.Ode1
ltx/en_us_dedes/me.m12.d23:meMA.Ode1C31.text	
ltx/en_us_dedes/me.m12.d23:meMA.Ode1C32.incipit	…
ltx/en_us_dedes/me.m12.d23:meMA.Ode1C32.melody	@ltx/en_us_dedes/he.h.m3:heHE.AsomenToKyrio.name
ltx/en_us_dedes/me.m12.d23:meMA.Ode1C32.mode	@ltx/en_us_dedes/miscellanea:misc.Mode3
ltx/en_us_dedes/me.m12.d23:meMA.Ode1C32.ode	@ltx/en_us_dedes/miscellanea:misc.Ode1
ltx/en_us_dedes/me.m12.d23:meMA.Ode1C32.text	
ltx/en_us_dedes/me.m12.d23:meMA.Ode1C33.incipit	…
ltx/en_us_dedes/me.m12.d23:meMA.Ode1C33.melody	@ltx/en_us_dedes/he.h.m3:heHE.AsomenToKyrio.name
ltx/en_us_dedes/me.m12.d23:meMA.Ode1C33.mode	@ltx/en_us_dedes/miscellanea:misc.Mode3
ltx/en_us_dedes/me.m12.d23:meMA.Ode1C33.ode	@ltx/en_us_dedes/miscellanea:misc.Ode1
ltx/en_us_dedes/me.m12.d23:meMA.Ode1C33.text	
ltx/en_us_dedes/me.m12.d23:meMA.Ode1C34.incipit	…
ltx/en_us_dedes/me.m12.d23:meMA.Ode1C34.melody	@ltx/en_us_dedes/he.h.m3:heHE.AsomenToKyrio.name
ltx/en_us_dedes/me.m12.d23:meMA.Ode1C34.mode	@ltx/en_us_dedes/miscellanea:misc.Mode3
ltx/en_us_dedes/me.m12.d23:meMA.Ode1C34.ode	@ltx/en_us_dedes/miscellanea:misc.Ode1
ltx/en_us_dedes/me.m12.d23:meMA.Ode1C34.text	
ltx/en_us_dedes/me.m12.d23:meMA.Ode1C3T.incipit	…
ltx/en_us_dedes/me.m12.d23:meMA.Ode1C3T.melody	@ltx/en_us_dedes/he.h.m3:heHE.AsomenToKyrio.name
ltx/en_us_dedes/me.m12.d23:meMA.Ode1C3T.mode	@ltx/en_us_dedes/miscellanea:misc.Mode3
ltx/en_us_dedes/me.m12.d23:meMA.Ode1C3T.ode	@ltx/en_us_dedes/miscellanea:misc.Ode1
ltx/en_us_dedes/me.m12.d23:meMA.Ode1C3T.text	
ltx/en_us_dedes/me.m12.d23:meMA.Ode1C3Tr.incipit	…
ltx/en_us_dedes/me.m12.d23:meMA.Ode1C3Tr.melody	@ltx/en_us_dedes/he.h.m3:heHE.AsomenToKyrio.name
ltx/en_us_dedes/me.m12.d23:meMA.Ode1C3Tr.mode	@ltx/en_us_dedes/miscellanea:misc.Mode3
ltx/en_us_dedes/me.m12.d23:meMA.Ode1C3Tr.ode	@ltx/en_us_dedes/miscellanea:misc.Ode1
ltx/en_us_dedes/me.m12.d23:meMA.Ode1C3Tr.text	
ltx/en_us_dedes/me.m12.d23:meMA.Ode3C11.greekmelody	@ltx/en_us_dedes/he.h.m2:heHE.ToxonSynetriviDynaston.greekname
ltx/en_us_dedes/me.m12.d23:meMA.Ode3C11.incipit	Come now, with a purified…
ltx/en_us_dedes/me.m12.d23:meMA.Ode3C11.melody	@ltx/en_us_dedes/he.h.m2:heHE.ToxonSynetriviDynaston.notmetered
ltx/en_us_dedes/me.m12.d23:meMA.Ode3C11.mode	@ltx/en_us_dedes/miscellanea:misc.Mode2
ltx/en_us_dedes/me.m12.d23:meMA.Ode3C11.ode	@ltx/en_us_dedes/miscellanea:misc.Ode3
ltx/en_us_dedes/me.m12.d23:meMA.Ode3C11.text	Come now, with a purified mind, let us gaily sing for the fore-feast of the Birth of Christ.
ltx/en_us_dedes/me.m12.d23:meMA.Ode3C12.incipit	O King Jesus, You are…
ltx/en_us_dedes/me.m12.d23:meMA.Ode3C12.melody	@ltx/en_us_dedes/he.h.m2:heHE.ToxonSynetriviDynaston.notmetered
ltx/en_us_dedes/me.m12.d23:meMA.Ode3C12.mode	@ltx/en_us_dedes/miscellanea:misc.Mode2
ltx/en_us_dedes/me.m12.d23:meMA.Ode3C12.ode	@ltx/en_us_dedes/miscellanea:misc.Ode3
ltx/en_us_dedes/me.m12.d23:meMA.Ode3C12.text	O King Jesus, You are coming to lodge in a narrow cave, in order to enrich me by Your profound poverty.
ltx/en_us_dedes/me.m12.d23:meMA.Ode3C13.incipit	Christ is coming to be…
ltx/en_us_dedes/me.m12.d23:meMA.Ode3C13.melody	@ltx/en_us_dedes/he.h.m2:heHE.ToxonSynetriviDynaston.notmetered
ltx/en_us_dedes/me.m12.d23:meMA.Ode3C13.mode	@ltx/en_us_dedes/miscellanea:misc.Mode2
ltx/en_us_dedes/me.m12.d23:meMA.Ode3C13.ode	@ltx/en_us_dedes/miscellanea:misc.Ode3
ltx/en_us_dedes/me.m12.d23:meMA.Ode3C13.text	Christ is coming to be born in the flesh as a man, to remove us from the darkness of wickedness.
ltx/en_us_dedes/me.m12.d23:meMA.Ode3C1H.greekmelody	@ltx/en_us_dedes/he.h.m2:heHE.ToxonSynetriviDynaston.greekname
ltx/en_us_dedes/me.m12.d23:meMA.Ode3C1H.incipit	@ltx/en_us_dedes/he.h.m2:heHE.ToxonSynetriviDynaston.incipit
ltx/en_us_dedes/me.m12.d23:meMA.Ode3C1H.melody	@ltx/en_us_dedes/he.h.m2:heHE.ToxonSynetriviDynaston.melody
ltx/en_us_dedes/me.m12.d23:meMA.Ode3C1H.mode	@ltx/en_us_dedes/miscellanea:misc.Mode2
ltx/en_us_dedes/me.m12.d23:meMA.Ode3C1H.ode	@ltx/en_us_dedes/miscellanea:misc.Ode3
ltx/en_us_dedes/me.m12.d23:meMA.Ode3C1H.text	@ltx/en_us_dedes/he.h.m2:heHE.ToxonSynetriviDynaston.text
ltx/en_us_dedes/me.m12.d23:meMA.Ode3C21.greekmelody	@ltx/en_us_dedes/he.h.m6:heHE.OukEstinAgios.greekname
ltx/en_us_dedes/me.m12.d23:meMA.Ode3C21.incipit	…
ltx/en_us_dedes/me.m12.d23:meMA.Ode3C21.melody	@ltx/en_us_dedes/he.h.m6:heHE.OukEstinAgios.name
ltx/en_us_dedes/me.m12.d23:meMA.Ode3C21.mode	@ltx/en_us_dedes/miscellanea:misc.Mode6
ltx/en_us_dedes/me.m12.d23:meMA.Ode3C21.ode	@ltx/en_us_dedes/miscellanea:misc.Ode3
ltx/en_us_dedes/me.m12.d23:meMA.Ode3C21.text	
ltx/en_us_dedes/me.m12.d23:meMA.Ode3C22.incipit	…
ltx/en_us_dedes/me.m12.d23:meMA.Ode3C22.melody	@ltx/en_us_dedes/he.h.m6:heHE.OukEstinAgios.name
ltx/en_us_dedes/me.m12.d23:meMA.Ode3C22.mode	@ltx/en_us_dedes/miscellanea:misc.Mode6
ltx/en_us_dedes/me.m12.d23:meMA.Ode3C22.ode	@ltx/en_us_dedes/miscellanea:misc.Ode3
ltx/en_us_dedes/me.m12.d23:meMA.Ode3C22.text	
ltx/en_us_dedes/me.m12.d23:meMA.Ode3C23.incipit	…
ltx/en_us_dedes/me.m12.d23:meMA.Ode3C23.melody	@ltx/en_us_dedes/he.h.m6:heHE.OukEstinAgios.name
ltx/en_us_dedes/me.m12.d23:meMA.Ode3C23.mode	@ltx/en_us_dedes/miscellanea:misc.Mode6
ltx/en_us_dedes/me.m12.d23:meMA.Ode3C23.ode	@ltx/en_us_dedes/miscellanea:misc.Ode3
ltx/en_us_dedes/me.m12.d23:meMA.Ode3C23.text	
ltx/en_us_dedes/me.m12.d23:meMA.Ode3C2T.incipit	…
ltx/en_us_dedes/me.m12.d23:meMA.Ode3C2T.melody	@ltx/en_us_dedes/he.h.m6:heHE.OukEstinAgios.name
ltx/en_us_dedes/me.m12.d23:meMA.Ode3C2T.mode	@ltx/en_us_dedes/miscellanea:misc.Mode6
ltx/en_us_dedes/me.m12.d23:meMA.Ode3C2T.ode	@ltx/en_us_dedes/miscellanea:misc.Ode3
ltx/en_us_dedes/me.m12.d23:meMA.Ode3C2T.text	
ltx/en_us_dedes/me.m12.d23:meMA.Ode3C31.greekmelody	@ltx/en_us_dedes/he.h.m3:heHE.EstereothiIKardiaMou.greekname
ltx/en_us_dedes/me.m12.d23:meMA.Ode3C31.incipit	…
ltx/en_us_dedes/me.m12.d23:meMA.Ode3C31.melody	@ltx/en_us_dedes/he.h.m3:heHE.EstereothiIKardiaMou.name
ltx/en_us_dedes/me.m12.d23:meMA.Ode3C31.mode	@ltx/en_us_dedes/miscellanea:misc.Mode3
ltx/en_us_dedes/me.m12.d23:meMA.Ode3C31.ode	@ltx/en_us_dedes/miscellanea:misc.Ode3
ltx/en_us_dedes/me.m12.d23:meMA.Ode3C31.text	
ltx/en_us_dedes/me.m12.d23:meMA.Ode3C32.incipit	…
ltx/en_us_dedes/me.m12.d23:meMA.Ode3C32.melody	@ltx/en_us_dedes/he.h.m3:heHE.EstereothiIKardiaMou.name
ltx/en_us_dedes/me.m12.d23:meMA.Ode3C32.mode	@ltx/en_us_dedes/miscellanea:misc.Mode3
ltx/en_us_dedes/me.m12.d23:meMA.Ode3C32.ode	@ltx/en_us_dedes/miscellanea:misc.Ode3
ltx/en_us_dedes/me.m12.d23:meMA.Ode3C32.text	
ltx/en_us_dedes/me.m12.d23:meMA.Ode3C33.incipit	…
ltx/en_us_dedes/me.m12.d23:meMA.Ode3C33.melody	@ltx/en_us_dedes/he.h.m3:heHE.EstereothiIKardiaMou.name
ltx/en_us_dedes/me.m12.d23:meMA.Ode3C33.mode	@ltx/en_us_dedes/miscellanea:misc.Mode3
ltx/en_us_dedes/me.m12.d23:meMA.Ode3C33.ode	@ltx/en_us_dedes/miscellanea:misc.Ode3
ltx/en_us_dedes/me.m12.d23:meMA.Ode3C33.text	
ltx/en_us_dedes/me.m12.d23:meMA.Ode3C3T.incipit	…
ltx/en_us_dedes/me.m12.d23:meMA.Ode3C3T.melody	@ltx/en_us_dedes/he.h.m3:heHE.EstereothiIKardiaMou.name
ltx/en_us_dedes/me.m12.d23:meMA.Ode3C3T.mode	@ltx/en_us_dedes/miscellanea:misc.Mode3
ltx/en_us_dedes/me.m12.d23:meMA.Ode3C3T.ode	@ltx/en_us_dedes/miscellanea:misc.Ode3
ltx/en_us_dedes/me.m12.d23:meMA.Ode3C3T.text	
ltx/en_us_dedes/me.m12.d23:meMA.Ode3C3Tr.incipit	…
ltx/en_us_dedes/me.m12.d23:meMA.Ode3C3Tr.melody	@ltx/en_us_dedes/he.h.m3:heHE.EstereothiIKardiaMou.name
ltx/en_us_dedes/me.m12.d23:meMA.Ode3C3Tr.mode	@ltx/en_us_dedes/miscellanea:misc.Mode3
ltx/en_us_dedes/me.m12.d23:meMA.Ode3C3Tr.ode	@ltx/en_us_dedes/miscellanea:misc.Ode3
ltx/en_us_dedes/me.m12.d23:meMA.Ode3C3Tr.text	
ltx/en_us_dedes/me.m12.d23:meMA.Ode3H.greekmelody	@ltx/en_us_dedes/he.h.m3:heHE.EstereothiIKardiaMou.greekname
ltx/en_us_dedes/me.m12.d23:meMA.Ode3H.incipit	@ltx/en_us_dedes/he.h.m3:heHE.EstereothiIKardiaMou.incipit
ltx/en_us_dedes/me.m12.d23:meMA.Ode3H.melody	@ltx/en_us_dedes/he.h.m3:heHE.EstereothiIKardiaMou.melody
ltx/en_us_dedes/me.m12.d23:meMA.Ode3H.mode	@ltx/en_us_dedes/miscellanea:misc.Mode3
ltx/en_us_dedes/me.m12.d23:meMA.Ode3H.ode	@ltx/en_us_dedes/miscellanea:misc.Ode3
ltx/en_us_dedes/me.m12.d23:meMA.Ode3H.text	@ltx/en_us_dedes/he.h.m3:heHE.EstereothiIKardiaMou.text
ltx/en_us_dedes/me.m12.d23:meMA.Ode3Kathisma1.greekmelody	@ltx/en_us_dedes/he.a.m1:heAU.TonTafonSouSotir.greekname
ltx/en_us_dedes/me.m12.d23:meMA.Ode3Kathisma1.incipit	…
ltx/en_us_dedes/me.m12.d23:meMA.Ode3Kathisma1.melody	@ltx/en_us_dedes/he.a.m1:heAU.TonTafonSouSotir.name
ltx/en_us_dedes/me.m12.d23:meMA.Ode3Kathisma1.mode	@ltx/en_us_dedes/miscellanea:misc.Mode1
ltx/en_us_dedes/me.m12.d23:meMA.Ode3Kathisma1.text	
ltx/en_us_dedes/me.m12.d23:meMA.Ode3Kathisma2.greekmelody	@ltx/en_us_dedes/he.a.m1:heAU.TonTafonSouSotir.greekname
ltx/en_us_dedes/me.m12.d23:meMA.Ode3Kathisma2.incipit	…
ltx/en_us_dedes/me.m12.d23:meMA.Ode3Kathisma2.melody	@ltx/en_us_dedes/he.a.m1:heAU.TonTafonSouSotir.name
ltx/en_us_dedes/me.m12.d23:meMA.Ode3Kathisma2.mode	@ltx/en_us_dedes/miscellanea:misc.Mode1
ltx/en_us_dedes/me.m12.d23:meMA.Ode3Kathisma2.text	
ltx/en_us_dedes/me.m12.d23:meMA.Ode4C11.greekmelody	@ltx/en_us_dedes/he.h.m2:heHE.YmnoSeAkoi.greekname
ltx/en_us_dedes/me.m12.d23:meMA.Ode4C11.incipit	…
ltx/en_us_dedes/me.m12.d23:meMA.Ode4C11.melody	@ltx/en_us_dedes/he.h.m2:heHE.YmnoSeAkoi.name
ltx/en_us_dedes/me.m12.d23:meMA.Ode4C11.mode	@ltx/en_us_dedes/miscellanea:misc.Mode2
ltx/en_us_dedes/me.m12.d23:meMA.Ode4C11.ode	@ltx/en_us_dedes/miscellanea:misc.Ode4
ltx/en_us_dedes/me.m12.d23:meMA.Ode4C11.text	
ltx/en_us_dedes/me.m12.d23:meMA.Ode4C12.incipit	…
ltx/en_us_dedes/me.m12.d23:meMA.Ode4C12.melody	@ltx/en_us_dedes/he.h.m2:heHE.YmnoSeAkoi.name
ltx/en_us_dedes/me.m12.d23:meMA.Ode4C12.mode	@ltx/en_us_dedes/miscellanea:misc.Mode2
ltx/en_us_dedes/me.m12.d23:meMA.Ode4C12.ode	@ltx/en_us_dedes/miscellanea:misc.Ode4
ltx/en_us_dedes/me.m12.d23:meMA.Ode4C12.text	
ltx/en_us_dedes/me.m12.d23:meMA.Ode4C13.incipit	…
ltx/en_us_dedes/me.m12.d23:meMA.Ode4C13.melody	@ltx/en_us_dedes/he.h.m2:heHE.YmnoSeAkoi.name
ltx/en_us_dedes/me.m12.d23:meMA.Ode4C13.mode	@ltx/en_us_dedes/miscellanea:misc.Mode2
ltx/en_us_dedes/me.m12.d23:meMA.Ode4C13.ode	@ltx/en_us_dedes/miscellanea:misc.Ode4
ltx/en_us_dedes/me.m12.d23:meMA.Ode4C13.text	
ltx/en_us_dedes/me.m12.d23:meMA.Ode4C1H.greekmelody	@ltx/en_us_dedes/he.h.m2:heHE.YmnoSeAkoi.greekname
ltx/en_us_dedes/me.m12.d23:meMA.Ode4C1H.incipit	@ltx/en_us_dedes/he.h.m2:heHE.YmnoSeAkoi.incipit
ltx/en_us_dedes/me.m12.d23:meMA.Ode4C1H.melody	@ltx/en_us_dedes/he.h.m2:heHE.YmnoSeAkoi.melody
ltx/en_us_dedes/me.m12.d23:meMA.Ode4C1H.mode	@ltx/en_us_dedes/miscellanea:misc.Mode2
ltx/en_us_dedes/me.m12.d23:meMA.Ode4C1H.ode	@ltx/en_us_dedes/miscellanea:misc.Ode4
ltx/en_us_dedes/me.m12.d23:meMA.Ode4C1H.text	@ltx/en_us_dedes/he.h.m2:heHE.YmnoSeAkoi.text
ltx/en_us_dedes/me.m12.d23:meMA.Ode4C1T.incipit	…
ltx/en_us_dedes/me.m12.d23:meMA.Ode4C1T.melody	@ltx/en_us_dedes/he.h.m2:heHE.YmnoSeAkoi.name
ltx/en_us_dedes/me.m12.d23:meMA.Ode4C1T.mode	@ltx/en_us_dedes/miscellanea:misc.Mode2
ltx/en_us_dedes/me.m12.d23:meMA.Ode4C1T.ode	@ltx/en_us_dedes/miscellanea:misc.Ode4
ltx/en_us_dedes/me.m12.d23:meMA.Ode4C1T.text	
ltx/en_us_dedes/me.m12.d23:meMA.Ode4C21.greekmelody	@ltx/en_us_dedes/he.h.m6:heHE.ChristosMouDynamis.greekname
ltx/en_us_dedes/me.m12.d23:meMA.Ode4C21.incipit	…
ltx/en_us_dedes/me.m12.d23:meMA.Ode4C21.melody	@ltx/en_us_dedes/he.h.m6:heHE.ChristosMouDynamis.name
ltx/en_us_dedes/me.m12.d23:meMA.Ode4C21.mode	@ltx/en_us_dedes/miscellanea:misc.Mode6
ltx/en_us_dedes/me.m12.d23:meMA.Ode4C21.ode	@ltx/en_us_dedes/miscellanea:misc.Ode4
ltx/en_us_dedes/me.m12.d23:meMA.Ode4C21.text	
ltx/en_us_dedes/me.m12.d23:meMA.Ode4C22.incipit	…
ltx/en_us_dedes/me.m12.d23:meMA.Ode4C22.melody	@ltx/en_us_dedes/he.h.m6:heHE.ChristosMouDynamis.name
ltx/en_us_dedes/me.m12.d23:meMA.Ode4C22.mode	@ltx/en_us_dedes/miscellanea:misc.Mode6
ltx/en_us_dedes/me.m12.d23:meMA.Ode4C22.ode	@ltx/en_us_dedes/miscellanea:misc.Ode4
ltx/en_us_dedes/me.m12.d23:meMA.Ode4C22.text	
ltx/en_us_dedes/me.m12.d23:meMA.Ode4C23.incipit	…
ltx/en_us_dedes/me.m12.d23:meMA.Ode4C23.melody	@ltx/en_us_dedes/he.h.m6:heHE.ChristosMouDynamis.name
ltx/en_us_dedes/me.m12.d23:meMA.Ode4C23.mode	@ltx/en_us_dedes/miscellanea:misc.Mode6
ltx/en_us_dedes/me.m12.d23:meMA.Ode4C23.ode	@ltx/en_us_dedes/miscellanea:misc.Ode4
ltx/en_us_dedes/me.m12.d23:meMA.Ode4C23.text	
ltx/en_us_dedes/me.m12.d23:meMA.Ode4C2T.incipit	…
ltx/en_us_dedes/me.m12.d23:meMA.Ode4C2T.melody	@ltx/en_us_dedes/he.h.m6:heHE.ChristosMouDynamis.name
ltx/en_us_dedes/me.m12.d23:meMA.Ode4C2T.mode	@ltx/en_us_dedes/miscellanea:misc.Mode6
ltx/en_us_dedes/me.m12.d23:meMA.Ode4C2T.ode	@ltx/en_us_dedes/miscellanea:misc.Ode4
ltx/en_us_dedes/me.m12.d23:meMA.Ode4C2T.text	
ltx/en_us_dedes/me.m12.d23:meMA.Ode4C31.greekmelody	@ltx/en_us_dedes/he.h.m3:heHE.EisakikoaTinAkoin.greekname
ltx/en_us_dedes/me.m12.d23:meMA.Ode4C31.incipit	…
ltx/en_us_dedes/me.m12.d23:meMA.Ode4C31.melody	@ltx/en_us_dedes/he.h.m3:heHE.EisakikoaTinAkoin.name
ltx/en_us_dedes/me.m12.d23:meMA.Ode4C31.mode	@ltx/en_us_dedes/miscellanea:misc.Mode3
ltx/en_us_dedes/me.m12.d23:meMA.Ode4C31.ode	@ltx/en_us_dedes/miscellanea:misc.Ode4
ltx/en_us_dedes/me.m12.d23:meMA.Ode4C31.text	
ltx/en_us_dedes/me.m12.d23:meMA.Ode4C32.incipit	…
ltx/en_us_dedes/me.m12.d23:meMA.Ode4C32.melody	@ltx/en_us_dedes/he.h.m3:heHE.EisakikoaTinAkoin.name
ltx/en_us_dedes/me.m12.d23:meMA.Ode4C32.mode	@ltx/en_us_dedes/miscellanea:misc.Mode3
ltx/en_us_dedes/me.m12.d23:meMA.Ode4C32.ode	@ltx/en_us_dedes/miscellanea:misc.Ode4
ltx/en_us_dedes/me.m12.d23:meMA.Ode4C32.text	
ltx/en_us_dedes/me.m12.d23:meMA.Ode4C33.incipit	…
ltx/en_us_dedes/me.m12.d23:meMA.Ode4C33.melody	@ltx/en_us_dedes/he.h.m3:heHE.EisakikoaTinAkoin.name
ltx/en_us_dedes/me.m12.d23:meMA.Ode4C33.mode	@ltx/en_us_dedes/miscellanea:misc.Mode3
ltx/en_us_dedes/me.m12.d23:meMA.Ode4C33.ode	@ltx/en_us_dedes/miscellanea:misc.Ode4
ltx/en_us_dedes/me.m12.d23:meMA.Ode4C33.text	
ltx/en_us_dedes/me.m12.d23:meMA.Ode4C34.incipit	…
ltx/en_us_dedes/me.m12.d23:meMA.Ode4C34.melody	@ltx/en_us_dedes/he.h.m3:heHE.EisakikoaTinAkoin.name
ltx/en_us_dedes/me.m12.d23:meMA.Ode4C34.mode	@ltx/en_us_dedes/miscellanea:misc.Mode3
ltx/en_us_dedes/me.m12.d23:meMA.Ode4C34.ode	@ltx/en_us_dedes/miscellanea:misc.Ode4
ltx/en_us_dedes/me.m12.d23:meMA.Ode4C34.text	
ltx/en_us_dedes/me.m12.d23:meMA.Ode4C3T.incipit	…
ltx/en_us_dedes/me.m12.d23:meMA.Ode4C3T.melody	@ltx/en_us_dedes/he.h.m3:heHE.EisakikoaTinAkoin.name
ltx/en_us_dedes/me.m12.d23:meMA.Ode4C3T.mode	@ltx/en_us_dedes/miscellanea:misc.Mode3
ltx/en_us_dedes/me.m12.d23:meMA.Ode4C3T.ode	@ltx/en_us_dedes/miscellanea:misc.Ode4
ltx/en_us_dedes/me.m12.d23:meMA.Ode4C3T.text	
ltx/en_us_dedes/me.m12.d23:meMA.Ode5C11.greekmelody	@ltx/en_us_dedes/he.h.m2:heHE.OAnthraxToIsaia.greekname
ltx/en_us_dedes/me.m12.d23:meMA.Ode5C11.incipit	…
ltx/en_us_dedes/me.m12.d23:meMA.Ode5C11.melody	@ltx/en_us_dedes/he.h.m2:heHE.OAnthraxToIsaia.name
ltx/en_us_dedes/me.m12.d23:meMA.Ode5C11.mode	@ltx/en_us_dedes/miscellanea:misc.Mode2
ltx/en_us_dedes/me.m12.d23:meMA.Ode5C11.ode	@ltx/en_us_dedes/miscellanea:misc.Ode5
ltx/en_us_dedes/me.m12.d23:meMA.Ode5C11.text	
ltx/en_us_dedes/me.m12.d23:meMA.Ode5C12.incipit	…
ltx/en_us_dedes/me.m12.d23:meMA.Ode5C12.melody	@ltx/en_us_dedes/he.h.m2:heHE.OAnthraxToIsaia.name
ltx/en_us_dedes/me.m12.d23:meMA.Ode5C12.mode	@ltx/en_us_dedes/miscellanea:misc.Mode2
ltx/en_us_dedes/me.m12.d23:meMA.Ode5C12.ode	@ltx/en_us_dedes/miscellanea:misc.Ode5
ltx/en_us_dedes/me.m12.d23:meMA.Ode5C12.text	
ltx/en_us_dedes/me.m12.d23:meMA.Ode5C13.incipit	…
ltx/en_us_dedes/me.m12.d23:meMA.Ode5C13.melody	@ltx/en_us_dedes/he.h.m2:heHE.OAnthraxToIsaia.name
ltx/en_us_dedes/me.m12.d23:meMA.Ode5C13.mode	@ltx/en_us_dedes/miscellanea:misc.Mode2
ltx/en_us_dedes/me.m12.d23:meMA.Ode5C13.ode	@ltx/en_us_dedes/miscellanea:misc.Ode5
ltx/en_us_dedes/me.m12.d23:meMA.Ode5C13.text	
ltx/en_us_dedes/me.m12.d23:meMA.Ode5C1H.greekmelody	@ltx/en_us_dedes/he.h.m2:heHE.OAnthraxToIsaia.greekname
ltx/en_us_dedes/me.m12.d23:meMA.Ode5C1H.incipit	@ltx/en_us_dedes/he.h.m2:heHE.OAnthraxToIsaia.incipit
ltx/en_us_dedes/me.m12.d23:meMA.Ode5C1H.melody	@ltx/en_us_dedes/he.h.m2:heHE.OAnthraxToIsaia.melody
ltx/en_us_dedes/me.m12.d23:meMA.Ode5C1H.mode	@ltx/en_us_dedes/miscellanea:misc.Mode2
ltx/en_us_dedes/me.m12.d23:meMA.Ode5C1H.ode	@ltx/en_us_dedes/miscellanea:misc.Ode5
ltx/en_us_dedes/me.m12.d23:meMA.Ode5C1H.text	@ltx/en_us_dedes/he.h.m2:heHE.OAnthraxToIsaia.text
ltx/en_us_dedes/me.m12.d23:meMA.Ode5C21.greekmelody	@ltx/en_us_dedes/he.h.m6:heHE.ToTheioFengeiSou.greekname
ltx/en_us_dedes/me.m12.d23:meMA.Ode5C21.incipit	…
ltx/en_us_dedes/me.m12.d23:meMA.Ode5C21.melody	@ltx/en_us_dedes/he.h.m6:heHE.ToTheioFengeiSou.name
ltx/en_us_dedes/me.m12.d23:meMA.Ode5C21.mode	@ltx/en_us_dedes/miscellanea:misc.Mode6
ltx/en_us_dedes/me.m12.d23:meMA.Ode5C21.ode	@ltx/en_us_dedes/miscellanea:misc.Ode5
ltx/en_us_dedes/me.m12.d23:meMA.Ode5C21.text	
ltx/en_us_dedes/me.m12.d23:meMA.Ode5C22.incipit	…
ltx/en_us_dedes/me.m12.d23:meMA.Ode5C22.melody	@ltx/en_us_dedes/he.h.m6:heHE.ToTheioFengeiSou.name
ltx/en_us_dedes/me.m12.d23:meMA.Ode5C22.mode	@ltx/en_us_dedes/miscellanea:misc.Mode6
ltx/en_us_dedes/me.m12.d23:meMA.Ode5C22.ode	@ltx/en_us_dedes/miscellanea:misc.Ode5
ltx/en_us_dedes/me.m12.d23:meMA.Ode5C22.text	
ltx/en_us_dedes/me.m12.d23:meMA.Ode5C23.incipit	…
ltx/en_us_dedes/me.m12.d23:meMA.Ode5C23.melody	@ltx/en_us_dedes/he.h.m6:heHE.ToTheioFengeiSou.name
ltx/en_us_dedes/me.m12.d23:meMA.Ode5C23.mode	@ltx/en_us_dedes/miscellanea:misc.Mode6
ltx/en_us_dedes/me.m12.d23:meMA.Ode5C23.ode	@ltx/en_us_dedes/miscellanea:misc.Ode5
ltx/en_us_dedes/me.m12.d23:meMA.Ode5C23.text	
ltx/en_us_dedes/me.m12.d23:meMA.Ode5C2T.incipit	…
ltx/en_us_dedes/me.m12.d23:meMA.Ode5C2T.melody	@ltx/en_us_dedes/he.h.m6:heHE.ToTheioFengeiSou.name
ltx/en_us_dedes/me.m12.d23:meMA.Ode5C2T.mode	@ltx/en_us_dedes/miscellanea:misc.Mode6
ltx/en_us_dedes/me.m12.d23:meMA.Ode5C2T.ode	@ltx/en_us_dedes/miscellanea:misc.Ode5
ltx/en_us_dedes/me.m12.d23:meMA.Ode5C2T.text	
ltx/en_us_dedes/me.m12.d23:meMA.Ode5C31.greekmelody	@ltx/en_us_dedes/he.h.m3:heHE.TinSinEirinin.greekname
ltx/en_us_dedes/me.m12.d23:meMA.Ode5C31.incipit	…
ltx/en_us_dedes/me.m12.d23:meMA.Ode5C31.melody	@ltx/en_us_dedes/he.h.m3:heHE.TinSinEirinin.name
ltx/en_us_dedes/me.m12.d23:meMA.Ode5C31.mode	@ltx/en_us_dedes/miscellanea:misc.Mode3
ltx/en_us_dedes/me.m12.d23:meMA.Ode5C31.ode	@ltx/en_us_dedes/miscellanea:misc.Ode5
ltx/en_us_dedes/me.m12.d23:meMA.Ode5C31.text	
ltx/en_us_dedes/me.m12.d23:meMA.Ode5C32.incipit	…
ltx/en_us_dedes/me.m12.d23:meMA.Ode5C32.melody	@ltx/en_us_dedes/he.h.m3:heHE.TinSinEirinin.name
ltx/en_us_dedes/me.m12.d23:meMA.Ode5C32.mode	@ltx/en_us_dedes/miscellanea:misc.Mode3
ltx/en_us_dedes/me.m12.d23:meMA.Ode5C32.ode	@ltx/en_us_dedes/miscellanea:misc.Ode5
ltx/en_us_dedes/me.m12.d23:meMA.Ode5C32.text	
ltx/en_us_dedes/me.m12.d23:meMA.Ode5C33.incipit	…
ltx/en_us_dedes/me.m12.d23:meMA.Ode5C33.melody	@ltx/en_us_dedes/he.h.m3:heHE.TinSinEirinin.name
ltx/en_us_dedes/me.m12.d23:meMA.Ode5C33.mode	@ltx/en_us_dedes/miscellanea:misc.Mode3
ltx/en_us_dedes/me.m12.d23:meMA.Ode5C33.ode	@ltx/en_us_dedes/miscellanea:misc.Ode5
ltx/en_us_dedes/me.m12.d23:meMA.Ode5C33.text	
ltx/en_us_dedes/me.m12.d23:meMA.Ode5C34.incipit	…
ltx/en_us_dedes/me.m12.d23:meMA.Ode5C34.melody	@ltx/en_us_dedes/he.h.m3:heHE.TinSinEirinin.name
ltx/en_us_dedes/me.m12.d23:meMA.Ode5C34.mode	@ltx/en_us_dedes/miscellanea:misc.Mode3
ltx/en_us_dedes/me.m12.d23:meMA.Ode5C34.ode	@ltx/en_us_dedes/miscellanea:misc.Ode5
ltx/en_us_dedes/me.m12.d23:meMA.Ode5C34.text	
ltx/en_us_dedes/me.m12.d23:meMA.Ode5C3T.incipit	…
ltx/en_us_dedes/me.m12.d23:meMA.Ode5C3T.melody	@ltx/en_us_dedes/he.h.m3:heHE.TinSinEirinin.name
ltx/en_us_dedes/me.m12.d23:meMA.Ode5C3T.mode	@ltx/en_us_dedes/miscellanea:misc.Mode3
ltx/en_us_dedes/me.m12.d23:meMA.Ode5C3T.ode	@ltx/en_us_dedes/miscellanea:misc.Ode5
ltx/en_us_dedes/me.m12.d23:meMA.Ode5C3T.text	
ltx/en_us_dedes/me.m12.d23:meMA.Ode6C11.greekmelody	@ltx/en_us_dedes/he.h.m2:heHE.ProsKyrionEkKitous.greekname
ltx/en_us_dedes/me.m12.d23:meMA.Ode6C11.incipit	…
ltx/en_us_dedes/me.m12.d23:meMA.Ode6C11.melody	@ltx/en_us_dedes/he.h.m2:heHE.ProsKyrionEkKitous.name
ltx/en_us_dedes/me.m12.d23:meMA.Ode6C11.mode	@ltx/en_us_dedes/miscellanea:misc.Mode2
ltx/en_us_dedes/me.m12.d23:meMA.Ode6C11.ode	@ltx/en_us_dedes/miscellanea:misc.Ode6
ltx/en_us_dedes/me.m12.d23:meMA.Ode6C11.text	
ltx/en_us_dedes/me.m12.d23:meMA.Ode6C12.incipit	…
ltx/en_us_dedes/me.m12.d23:meMA.Ode6C12.melody	@ltx/en_us_dedes/he.h.m2:heHE.ProsKyrionEkKitous.name
ltx/en_us_dedes/me.m12.d23:meMA.Ode6C12.mode	@ltx/en_us_dedes/miscellanea:misc.Mode2
ltx/en_us_dedes/me.m12.d23:meMA.Ode6C12.ode	@ltx/en_us_dedes/miscellanea:misc.Ode6
ltx/en_us_dedes/me.m12.d23:meMA.Ode6C12.text	
ltx/en_us_dedes/me.m12.d23:meMA.Ode6C13.incipit	…
ltx/en_us_dedes/me.m12.d23:meMA.Ode6C13.melody	@ltx/en_us_dedes/he.h.m2:heHE.ProsKyrionEkKitous.name
ltx/en_us_dedes/me.m12.d23:meMA.Ode6C13.mode	@ltx/en_us_dedes/miscellanea:misc.Mode2
ltx/en_us_dedes/me.m12.d23:meMA.Ode6C13.ode	@ltx/en_us_dedes/miscellanea:misc.Ode6
ltx/en_us_dedes/me.m12.d23:meMA.Ode6C13.text	
ltx/en_us_dedes/me.m12.d23:meMA.Ode6C1H.greekmelody	@ltx/en_us_dedes/he.h.m2:heHE.ProsKyrionEkKitous.greekname
ltx/en_us_dedes/me.m12.d23:meMA.Ode6C1H.incipit	@ltx/en_us_dedes/he.h.m2:heHE.ProsKyrionEkKitous.incipit
ltx/en_us_dedes/me.m12.d23:meMA.Ode6C1H.melody	@ltx/en_us_dedes/he.h.m2:heHE.ProsKyrionEkKitous.melody
ltx/en_us_dedes/me.m12.d23:meMA.Ode6C1H.mode	@ltx/en_us_dedes/miscellanea:misc.Mode2
ltx/en_us_dedes/me.m12.d23:meMA.Ode6C1H.ode	@ltx/en_us_dedes/miscellanea:misc.Ode6
ltx/en_us_dedes/me.m12.d23:meMA.Ode6C1H.text	@ltx/en_us_dedes/he.h.m2:heHE.ProsKyrionEkKitous.text
ltx/en_us_dedes/me.m12.d23:meMA.Ode6C21.greekmelody	@ltx/en_us_dedes/he.h.m6:heHE.TouViouTinThalassan.greekname
ltx/en_us_dedes/me.m12.d23:meMA.Ode6C21.incipit	Behold, Christ is coming to…
ltx/en_us_dedes/me.m12.d23:meMA.Ode6C21.melody	@ltx/en_us_dedes/he.h.m6:heHE.TouViouTinThalassan.notmetered
ltx/en_us_dedes/me.m12.d23:meMA.Ode6C21.mode	@ltx/en_us_dedes/miscellanea:misc.Mode6
ltx/en_us_dedes/me.m12.d23:meMA.Ode6C21.ode	@ltx/en_us_dedes/miscellanea:misc.Ode6
ltx/en_us_dedes/me.m12.d23:meMA.Ode6C21.text	Behold, Christ is coming to His own. O believers, let us through divine virtues become His by grace; and thus illumined in soul and heart, let us receive Him.
ltx/en_us_dedes/me.m12.d23:meMA.Ode6C22.incipit	The root of Jesse has…
ltx/en_us_dedes/me.m12.d23:meMA.Ode6C22.melody	@ltx/en_us_dedes/he.h.m6:heHE.TouViouTinThalassan.notmetered
ltx/en_us_dedes/me.m12.d23:meMA.Ode6C22.mode	@ltx/en_us_dedes/miscellanea:misc.Mode6
ltx/en_us_dedes/me.m12.d23:meMA.Ode6C22.ode	@ltx/en_us_dedes/miscellanea:misc.Ode6
ltx/en_us_dedes/me.m12.d23:meMA.Ode6C22.text	The root of Jesse has blossomed, and from it, our God, who came as the hope of the Gentiles, repose and honor, like Isaiah prophesied of old, being divinely illumined.
ltx/en_us_dedes/me.m12.d23:meMA.Ode6C23.incipit	O my Jesus, You become…
ltx/en_us_dedes/me.m12.d23:meMA.Ode6C23.melody	@ltx/en_us_dedes/he.h.m6:heHE.TouViouTinThalassan.notmetered
ltx/en_us_dedes/me.m12.d23:meMA.Ode6C23.mode	@ltx/en_us_dedes/miscellanea:misc.Mode6
ltx/en_us_dedes/me.m12.d23:meMA.Ode6C23.ode	@ltx/en_us_dedes/miscellanea:misc.Ode6
ltx/en_us_dedes/me.m12.d23:meMA.Ode6C23.text	O my Jesus, You become poor and took on a body. You are wrapped with swaddling clothes, breaking the chains of my many sins; and you make me rich, when I was tragically made poor because of wickedness.
ltx/en_us_dedes/me.m12.d23:meMA.Ode6C2T.incipit	As I am assaulted by…
ltx/en_us_dedes/me.m12.d23:meMA.Ode6C2T.melody	@ltx/en_us_dedes/he.h.m6:heHE.TouViouTinThalassan.notmetered
ltx/en_us_dedes/me.m12.d23:meMA.Ode6C2T.mode	@ltx/en_us_dedes/miscellanea:misc.Mode6
ltx/en_us_dedes/me.m12.d23:meMA.Ode6C2T.ode	@ltx/en_us_dedes/miscellanea:misc.Ode6
ltx/en_us_dedes/me.m12.d23:meMA.Ode6C2T.text	As I am assaulted by evil spirits, the swelling of negative thoughts tosses my poor heart to and fro. O good and loving Lady, intervene and make it calm.
ltx/en_us_dedes/me.m12.d23:meMA.Ode6C31.greekmelody	@ltx/en_us_dedes/he.h.m3:heHE.TousEisTaTeli.greekname
ltx/en_us_dedes/me.m12.d23:meMA.Ode6C31.incipit	…
ltx/en_us_dedes/me.m12.d23:meMA.Ode6C31.melody	@ltx/en_us_dedes/he.h.m3:heHE.TousEisTaTeli.name
ltx/en_us_dedes/me.m12.d23:meMA.Ode6C31.mode	@ltx/en_us_dedes/miscellanea:misc.Mode3
ltx/en_us_dedes/me.m12.d23:meMA.Ode6C31.ode	@ltx/en_us_dedes/miscellanea:misc.Ode6
ltx/en_us_dedes/me.m12.d23:meMA.Ode6C31.text	
ltx/en_us_dedes/me.m12.d23:meMA.Ode6C32.incipit	…
ltx/en_us_dedes/me.m12.d23:meMA.Ode6C32.melody	@ltx/en_us_dedes/he.h.m3:heHE.TousEisTaTeli.name
ltx/en_us_dedes/me.m12.d23:meMA.Ode6C32.mode	@ltx/en_us_dedes/miscellanea:misc.Mode3
ltx/en_us_dedes/me.m12.d23:meMA.Ode6C32.ode	@ltx/en_us_dedes/miscellanea:misc.Ode6
ltx/en_us_dedes/me.m12.d23:meMA.Ode6C32.text	
ltx/en_us_dedes/me.m12.d23:meMA.Ode6C33.incipit	…
ltx/en_us_dedes/me.m12.d23:meMA.Ode6C33.melody	@ltx/en_us_dedes/he.h.m3:heHE.TousEisTaTeli.name
ltx/en_us_dedes/me.m12.d23:meMA.Ode6C33.mode	@ltx/en_us_dedes/miscellanea:misc.Mode3
ltx/en_us_dedes/me.m12.d23:meMA.Ode6C33.ode	@ltx/en_us_dedes/miscellanea:misc.Ode6
ltx/en_us_dedes/me.m12.d23:meMA.Ode6C33.text	
ltx/en_us_dedes/me.m12.d23:meMA.Ode6C3T.incipit	…
ltx/en_us_dedes/me.m12.d23:meMA.Ode6C3T.melody	@ltx/en_us_dedes/he.h.m3:heHE.TousEisTaTeli.name
ltx/en_us_dedes/me.m12.d23:meMA.Ode6C3T.mode	@ltx/en_us_dedes/miscellanea:misc.Mode3
ltx/en_us_dedes/me.m12.d23:meMA.Ode6C3T.ode	@ltx/en_us_dedes/miscellanea:misc.Ode6
ltx/en_us_dedes/me.m12.d23:meMA.Ode6C3T.text	
ltx/en_us_dedes/me.m12.d23:meMA.Ode6H.greekmelody	@ltx/en_us_dedes/he.h.m3:heHE.TousEisTaTeli.greekname
ltx/en_us_dedes/me.m12.d23:meMA.Ode6H.incipit	@ltx/en_us_dedes/he.h.m3:heHE.TousEisTaTeli.incipit
ltx/en_us_dedes/me.m12.d23:meMA.Ode6H.melody	@ltx/en_us_dedes/he.h.m3:heHE.TousEisTaTeli.melody
ltx/en_us_dedes/me.m12.d23:meMA.Ode6H.mode	@ltx/en_us_dedes/miscellanea:misc.Mode3
ltx/en_us_dedes/me.m12.d23:meMA.Ode6H.ode	@ltx/en_us_dedes/miscellanea:misc.Ode6
ltx/en_us_dedes/me.m12.d23:meMA.Ode6H.text	@ltx/en_us_dedes/he.h.m3:heHE.TousEisTaTeli.text
ltx/en_us_dedes/me.m12.d23:meMA.Ode7C11.greekmelody	@ltx/en_us_dedes/he.h.m2:heHE.RitoresAnedeichthisanPaides.greekname
ltx/en_us_dedes/me.m12.d23:meMA.Ode7C11.incipit	…
ltx/en_us_dedes/me.m12.d23:meMA.Ode7C11.melody	@ltx/en_us_dedes/he.h.m2:heHE.RitoresAnedeichthisanPaides.name
ltx/en_us_dedes/me.m12.d23:meMA.Ode7C11.mode	@ltx/en_us_dedes/miscellanea:misc.Mode2
ltx/en_us_dedes/me.m12.d23:meMA.Ode7C11.ode	@ltx/en_us_dedes/miscellanea:misc.Ode7
ltx/en_us_dedes/me.m12.d23:meMA.Ode7C11.text	
ltx/en_us_dedes/me.m12.d23:meMA.Ode7C12.incipit	…
ltx/en_us_dedes/me.m12.d23:meMA.Ode7C12.melody	@ltx/en_us_dedes/he.h.m2:heHE.RitoresAnedeichthisanPaides.name
ltx/en_us_dedes/me.m12.d23:meMA.Ode7C12.mode	@ltx/en_us_dedes/miscellanea:misc.Mode2
ltx/en_us_dedes/me.m12.d23:meMA.Ode7C12.ode	@ltx/en_us_dedes/miscellanea:misc.Ode7
ltx/en_us_dedes/me.m12.d23:meMA.Ode7C12.text	
ltx/en_us_dedes/me.m12.d23:meMA.Ode7C13.incipit	…
ltx/en_us_dedes/me.m12.d23:meMA.Ode7C13.melody	@ltx/en_us_dedes/he.h.m2:heHE.RitoresAnedeichthisanPaides.name
ltx/en_us_dedes/me.m12.d23:meMA.Ode7C13.mode	@ltx/en_us_dedes/miscellanea:misc.Mode2
ltx/en_us_dedes/me.m12.d23:meMA.Ode7C13.ode	@ltx/en_us_dedes/miscellanea:misc.Ode7
ltx/en_us_dedes/me.m12.d23:meMA.Ode7C13.text	
ltx/en_us_dedes/me.m12.d23:meMA.Ode7C1H.greekmelody	@ltx/en_us_dedes/he.h.m2:heHE.RitoresAnedeichthisanPaides.greekname
ltx/en_us_dedes/me.m12.d23:meMA.Ode7C1H.incipit	@ltx/en_us_dedes/he.h.m2:heHE.RitoresAnedeichthisanPaides.incipit
ltx/en_us_dedes/me.m12.d23:meMA.Ode7C1H.melody	@ltx/en_us_dedes/he.h.m2:heHE.RitoresAnedeichthisanPaides.melody
ltx/en_us_dedes/me.m12.d23:meMA.Ode7C1H.mode	@ltx/en_us_dedes/miscellanea:misc.Mode2
ltx/en_us_dedes/me.m12.d23:meMA.Ode7C1H.ode	@ltx/en_us_dedes/miscellanea:misc.Ode7
ltx/en_us_dedes/me.m12.d23:meMA.Ode7C1H.text	@ltx/en_us_dedes/he.h.m2:heHE.RitoresAnedeichthisanPaides.text
ltx/en_us_dedes/me.m12.d23:meMA.Ode7C1T.incipit	…
ltx/en_us_dedes/me.m12.d23:meMA.Ode7C1T.melody	@ltx/en_us_dedes/he.h.m2:heHE.RitoresAnedeichthisanPaides.name
ltx/en_us_dedes/me.m12.d23:meMA.Ode7C1T.mode	@ltx/en_us_dedes/miscellanea:misc.Mode2
ltx/en_us_dedes/me.m12.d23:meMA.Ode7C1T.ode	@ltx/en_us_dedes/miscellanea:misc.Ode7
ltx/en_us_dedes/me.m12.d23:meMA.Ode7C1T.text	
ltx/en_us_dedes/me.m12.d23:meMA.Ode7C21.greekmelody	@ltx/en_us_dedes/he.h.m6:heHE.DrosovolonMenTinKaminon.greekname
ltx/en_us_dedes/me.m12.d23:meMA.Ode7C21.incipit	…
ltx/en_us_dedes/me.m12.d23:meMA.Ode7C21.melody	@ltx/en_us_dedes/he.h.m6:heHE.DrosovolonMenTinKaminon.name
ltx/en_us_dedes/me.m12.d23:meMA.Ode7C21.mode	@ltx/en_us_dedes/miscellanea:misc.Mode6
ltx/en_us_dedes/me.m12.d23:meMA.Ode7C21.ode	@ltx/en_us_dedes/miscellanea:misc.Ode7
ltx/en_us_dedes/me.m12.d23:meMA.Ode7C21.text	
ltx/en_us_dedes/me.m12.d23:meMA.Ode7C22.incipit	…
ltx/en_us_dedes/me.m12.d23:meMA.Ode7C22.melody	@ltx/en_us_dedes/he.h.m6:heHE.DrosovolonMenTinKaminon.name
ltx/en_us_dedes/me.m12.d23:meMA.Ode7C22.mode	@ltx/en_us_dedes/miscellanea:misc.Mode6
ltx/en_us_dedes/me.m12.d23:meMA.Ode7C22.ode	@ltx/en_us_dedes/miscellanea:misc.Ode7
ltx/en_us_dedes/me.m12.d23:meMA.Ode7C22.text	
ltx/en_us_dedes/me.m12.d23:meMA.Ode7C23.incipit	…
ltx/en_us_dedes/me.m12.d23:meMA.Ode7C23.melody	@ltx/en_us_dedes/he.h.m6:heHE.DrosovolonMenTinKaminon.name
ltx/en_us_dedes/me.m12.d23:meMA.Ode7C23.mode	@ltx/en_us_dedes/miscellanea:misc.Mode6
ltx/en_us_dedes/me.m12.d23:meMA.Ode7C23.ode	@ltx/en_us_dedes/miscellanea:misc.Ode7
ltx/en_us_dedes/me.m12.d23:meMA.Ode7C23.text	
ltx/en_us_dedes/me.m12.d23:meMA.Ode7C2T.incipit	…
ltx/en_us_dedes/me.m12.d23:meMA.Ode7C2T.melody	@ltx/en_us_dedes/he.h.m6:heHE.DrosovolonMenTinKaminon.name
ltx/en_us_dedes/me.m12.d23:meMA.Ode7C2T.mode	@ltx/en_us_dedes/miscellanea:misc.Mode6
ltx/en_us_dedes/me.m12.d23:meMA.Ode7C2T.ode	@ltx/en_us_dedes/miscellanea:misc.Ode7
ltx/en_us_dedes/me.m12.d23:meMA.Ode7C2T.text	
ltx/en_us_dedes/me.m12.d23:meMA.Ode7C31.greekmelody	@ltx/en_us_dedes/he.h.m3:heHE.TreisPaidesEnKamino.greekname
ltx/en_us_dedes/me.m12.d23:meMA.Ode7C31.incipit	…
ltx/en_us_dedes/me.m12.d23:meMA.Ode7C31.melody	@ltx/en_us_dedes/he.h.m3:heHE.TreisPaidesEnKamino.name
ltx/en_us_dedes/me.m12.d23:meMA.Ode7C31.mode	@ltx/en_us_dedes/miscellanea:misc.Mode3
ltx/en_us_dedes/me.m12.d23:meMA.Ode7C31.ode	@ltx/en_us_dedes/miscellanea:misc.Ode7
ltx/en_us_dedes/me.m12.d23:meMA.Ode7C31.text	
ltx/en_us_dedes/me.m12.d23:meMA.Ode7C32.incipit	…
ltx/en_us_dedes/me.m12.d23:meMA.Ode7C32.melody	@ltx/en_us_dedes/he.h.m3:heHE.TreisPaidesEnKamino.name
ltx/en_us_dedes/me.m12.d23:meMA.Ode7C32.mode	@ltx/en_us_dedes/miscellanea:misc.Mode3
ltx/en_us_dedes/me.m12.d23:meMA.Ode7C32.ode	@ltx/en_us_dedes/miscellanea:misc.Ode7
ltx/en_us_dedes/me.m12.d23:meMA.Ode7C32.text	
ltx/en_us_dedes/me.m12.d23:meMA.Ode7C33.incipit	…
ltx/en_us_dedes/me.m12.d23:meMA.Ode7C33.melody	@ltx/en_us_dedes/he.h.m3:heHE.TreisPaidesEnKamino.name
ltx/en_us_dedes/me.m12.d23:meMA.Ode7C33.mode	@ltx/en_us_dedes/miscellanea:misc.Mode3
ltx/en_us_dedes/me.m12.d23:meMA.Ode7C33.ode	@ltx/en_us_dedes/miscellanea:misc.Ode7
ltx/en_us_dedes/me.m12.d23:meMA.Ode7C33.text	
ltx/en_us_dedes/me.m12.d23:meMA.Ode7C3T.incipit	…
ltx/en_us_dedes/me.m12.d23:meMA.Ode7C3T.melody	@ltx/en_us_dedes/he.h.m3:heHE.TreisPaidesEnKamino.name
ltx/en_us_dedes/me.m12.d23:meMA.Ode7C3T.mode	@ltx/en_us_dedes/miscellanea:misc.Mode3
ltx/en_us_dedes/me.m12.d23:meMA.Ode7C3T.ode	@ltx/en_us_dedes/miscellanea:misc.Ode7
ltx/en_us_dedes/me.m12.d23:meMA.Ode7C3T.text	
ltx/en_us_dedes/me.m12.d23:meMA.Ode8C11.greekmelody	@ltx/en_us_dedes/he.h.m2:heHE.IndalmatosChrysou.greekname
ltx/en_us_dedes/me.m12.d23:meMA.Ode8C11.incipit	…
ltx/en_us_dedes/me.m12.d23:meMA.Ode8C11.melody	@ltx/en_us_dedes/he.h.m2:heHE.IndalmatosChrysou.name
ltx/en_us_dedes/me.m12.d23:meMA.Ode8C11.mode	@ltx/en_us_dedes/miscellanea:misc.Mode2
ltx/en_us_dedes/me.m12.d23:meMA.Ode8C11.ode	@ltx/en_us_dedes/miscellanea:misc.Ode8
ltx/en_us_dedes/me.m12.d23:meMA.Ode8C11.text	
ltx/en_us_dedes/me.m12.d23:meMA.Ode8C12.incipit	…
ltx/en_us_dedes/me.m12.d23:meMA.Ode8C12.melody	@ltx/en_us_dedes/he.h.m2:heHE.IndalmatosChrysou.name
ltx/en_us_dedes/me.m12.d23:meMA.Ode8C12.mode	@ltx/en_us_dedes/miscellanea:misc.Mode2
ltx/en_us_dedes/me.m12.d23:meMA.Ode8C12.ode	@ltx/en_us_dedes/miscellanea:misc.Ode8
ltx/en_us_dedes/me.m12.d23:meMA.Ode8C12.text	
ltx/en_us_dedes/me.m12.d23:meMA.Ode8C13.incipit	…
ltx/en_us_dedes/me.m12.d23:meMA.Ode8C13.melody	@ltx/en_us_dedes/he.h.m2:heHE.IndalmatosChrysou.name
ltx/en_us_dedes/me.m12.d23:meMA.Ode8C13.mode	@ltx/en_us_dedes/miscellanea:misc.Mode2
ltx/en_us_dedes/me.m12.d23:meMA.Ode8C13.ode	@ltx/en_us_dedes/miscellanea:misc.Ode8
ltx/en_us_dedes/me.m12.d23:meMA.Ode8C13.text	
ltx/en_us_dedes/me.m12.d23:meMA.Ode8C14.incipit	…
ltx/en_us_dedes/me.m12.d23:meMA.Ode8C14.melody	@ltx/en_us_dedes/he.h.m2:heHE.IndalmatosChrysou.name
ltx/en_us_dedes/me.m12.d23:meMA.Ode8C14.mode	@ltx/en_us_dedes/miscellanea:misc.Mode2
ltx/en_us_dedes/me.m12.d23:meMA.Ode8C14.ode	@ltx/en_us_dedes/miscellanea:misc.Ode8
ltx/en_us_dedes/me.m12.d23:meMA.Ode8C14.text	
ltx/en_us_dedes/me.m12.d23:meMA.Ode8C1H.greekmelody	@ltx/en_us_dedes/he.h.m2:heHE.IndalmatosChrysou.greekname
ltx/en_us_dedes/me.m12.d23:meMA.Ode8C1H.incipit	@ltx/en_us_dedes/he.h.m2:heHE.IndalmatosChrysou.incipit
ltx/en_us_dedes/me.m12.d23:meMA.Ode8C1H.melody	@ltx/en_us_dedes/he.h.m2:heHE.IndalmatosChrysou.melody
ltx/en_us_dedes/me.m12.d23:meMA.Ode8C1H.mode	@ltx/en_us_dedes/miscellanea:misc.Mode2
ltx/en_us_dedes/me.m12.d23:meMA.Ode8C1H.ode	@ltx/en_us_dedes/miscellanea:misc.Ode8
ltx/en_us_dedes/me.m12.d23:meMA.Ode8C1H.text	@ltx/en_us_dedes/he.h.m2:heHE.IndalmatosChrysou.text
ltx/en_us_dedes/me.m12.d23:meMA.Ode8C21.greekmelody	@ltx/en_us_dedes/he.h.m6:heHE.EkFlogosToisOsiois.greekname
ltx/en_us_dedes/me.m12.d23:meMA.Ode8C21.incipit	…
ltx/en_us_dedes/me.m12.d23:meMA.Ode8C21.melody	@ltx/en_us_dedes/he.h.m6:heHE.EkFlogosToisOsiois.name
ltx/en_us_dedes/me.m12.d23:meMA.Ode8C21.mode	@ltx/en_us_dedes/miscellanea:misc.Mode6
ltx/en_us_dedes/me.m12.d23:meMA.Ode8C21.ode	@ltx/en_us_dedes/miscellanea:misc.Ode8
ltx/en_us_dedes/me.m12.d23:meMA.Ode8C21.text	
ltx/en_us_dedes/me.m12.d23:meMA.Ode8C22.incipit	…
ltx/en_us_dedes/me.m12.d23:meMA.Ode8C22.melody	@ltx/en_us_dedes/he.h.m6:heHE.EkFlogosToisOsiois.name
ltx/en_us_dedes/me.m12.d23:meMA.Ode8C22.mode	@ltx/en_us_dedes/miscellanea:misc.Mode6
ltx/en_us_dedes/me.m12.d23:meMA.Ode8C22.ode	@ltx/en_us_dedes/miscellanea:misc.Ode8
ltx/en_us_dedes/me.m12.d23:meMA.Ode8C22.text	
ltx/en_us_dedes/me.m12.d23:meMA.Ode8C23.incipit	…
ltx/en_us_dedes/me.m12.d23:meMA.Ode8C23.melody	@ltx/en_us_dedes/he.h.m6:heHE.EkFlogosToisOsiois.name
ltx/en_us_dedes/me.m12.d23:meMA.Ode8C23.mode	@ltx/en_us_dedes/miscellanea:misc.Mode6
ltx/en_us_dedes/me.m12.d23:meMA.Ode8C23.ode	@ltx/en_us_dedes/miscellanea:misc.Ode8
ltx/en_us_dedes/me.m12.d23:meMA.Ode8C23.text	
ltx/en_us_dedes/me.m12.d23:meMA.Ode8C2T.incipit	…
ltx/en_us_dedes/me.m12.d23:meMA.Ode8C2T.melody	@ltx/en_us_dedes/he.h.m6:heHE.EkFlogosToisOsiois.name
ltx/en_us_dedes/me.m12.d23:meMA.Ode8C2T.mode	@ltx/en_us_dedes/miscellanea:misc.Mode6
ltx/en_us_dedes/me.m12.d23:meMA.Ode8C2T.ode	@ltx/en_us_dedes/miscellanea:misc.Ode8
ltx/en_us_dedes/me.m12.d23:meMA.Ode8C2T.text	
ltx/en_us_dedes/me.m12.d23:meMA.Ode8C31.greekmelody	@ltx/en_us_dedes/he.h.m3:heHE.TonEnFlogi.greekname
ltx/en_us_dedes/me.m12.d23:meMA.Ode8C31.incipit	…
ltx/en_us_dedes/me.m12.d23:meMA.Ode8C31.melody	@ltx/en_us_dedes/he.h.m3:heHE.TonEnFlogi.name
ltx/en_us_dedes/me.m12.d23:meMA.Ode8C31.mode	@ltx/en_us_dedes/miscellanea:misc.Mode3
ltx/en_us_dedes/me.m12.d23:meMA.Ode8C31.ode	@ltx/en_us_dedes/miscellanea:misc.Ode8
ltx/en_us_dedes/me.m12.d23:meMA.Ode8C31.text	
ltx/en_us_dedes/me.m12.d23:meMA.Ode8C32.incipit	…
ltx/en_us_dedes/me.m12.d23:meMA.Ode8C32.melody	@ltx/en_us_dedes/he.h.m3:heHE.TonEnFlogi.name
ltx/en_us_dedes/me.m12.d23:meMA.Ode8C32.mode	@ltx/en_us_dedes/miscellanea:misc.Mode3
ltx/en_us_dedes/me.m12.d23:meMA.Ode8C32.ode	@ltx/en_us_dedes/miscellanea:misc.Ode8
ltx/en_us_dedes/me.m12.d23:meMA.Ode8C32.text	
ltx/en_us_dedes/me.m12.d23:meMA.Ode8C33.incipit	…
ltx/en_us_dedes/me.m12.d23:meMA.Ode8C33.melody	@ltx/en_us_dedes/he.h.m3:heHE.TonEnFlogi.name
ltx/en_us_dedes/me.m12.d23:meMA.Ode8C33.mode	@ltx/en_us_dedes/miscellanea:misc.Mode3
ltx/en_us_dedes/me.m12.d23:meMA.Ode8C33.ode	@ltx/en_us_dedes/miscellanea:misc.Ode8
ltx/en_us_dedes/me.m12.d23:meMA.Ode8C33.text	
ltx/en_us_dedes/me.m12.d23:meMA.Ode8C3T.incipit	…
ltx/en_us_dedes/me.m12.d23:meMA.Ode8C3T.melody	@ltx/en_us_dedes/he.h.m3:heHE.TonEnFlogi.name
ltx/en_us_dedes/me.m12.d23:meMA.Ode8C3T.mode	@ltx/en_us_dedes/miscellanea:misc.Mode3
ltx/en_us_dedes/me.m12.d23:meMA.Ode8C3T.ode	@ltx/en_us_dedes/miscellanea:misc.Ode8
ltx/en_us_dedes/me.m12.d23:meMA.Ode8C3T.text	
ltx/en_us_dedes/me.m12.d23:meMA.Ode8C3Tr.incipit	…
ltx/en_us_dedes/me.m12.d23:meMA.Ode8C3Tr.melody	@ltx/en_us_dedes/he.h.m3:heHE.TonEnFlogi.name
ltx/en_us_dedes/me.m12.d23:meMA.Ode8C3Tr.mode	@ltx/en_us_dedes/miscellanea:misc.Mode3
ltx/en_us_dedes/me.m12.d23:meMA.Ode8C3Tr.ode	@ltx/en_us_dedes/miscellanea:misc.Ode8
ltx/en_us_dedes/me.m12.d23:meMA.Ode8C3Tr.text	
ltx/en_us_dedes/me.m12.d23:meMA.Ode8H.greekmelody	@ltx/en_us_dedes/he.h.m3:heHE.TonEnFlogi.greekname
ltx/en_us_dedes/me.m12.d23:meMA.Ode8H.incipit	@ltx/en_us_dedes/he.h.m3:heHE.TonEnFlogi.incipit
ltx/en_us_dedes/me.m12.d23:meMA.Ode8H.melody	@ltx/en_us_dedes/he.h.m3:heHE.TonEnFlogi.melody
ltx/en_us_dedes/me.m12.d23:meMA.Ode8H.mode	@ltx/en_us_dedes/miscellanea:misc.Mode3
ltx/en_us_dedes/me.m12.d23:meMA.Ode8H.ode	@ltx/en_us_dedes/miscellanea:misc.Ode8
ltx/en_us_dedes/me.m12.d23:meMA.Ode8H.text	@ltx/en_us_dedes/he.h.m3:heHE.TonEnFlogi.text
ltx/en_us_dedes/me.m12.d23:meMA.Ode9C11.greekmelody	@ltx/en_us_dedes/he.h.m2:heHE.AporeiPasaGlossa.greekname
ltx/en_us_dedes/me.m12.d23:meMA.Ode9C11.incipit	…
ltx/en_us_dedes/me.m12.d23:meMA.Ode9C11.melody	@ltx/en_us_dedes/he.h.m2:heHE.AporeiPasaGlossa.name
ltx/en_us_dedes/me.m12.d23:meMA.Ode9C11.mode	@ltx/en_us_dedes/miscellanea:misc.Mode2
ltx/en_us_dedes/me.m12.d23:meMA.Ode9C11.ode	@ltx/en_us_dedes/miscellanea:misc.Ode9
ltx/en_us_dedes/me.m12.d23:meMA.Ode9C11.text	
ltx/en_us_dedes/me.m12.d23:meMA.Ode9C12.incipit	…
ltx/en_us_dedes/me.m12.d23:meMA.Ode9C12.melody	@ltx/en_us_dedes/he.h.m2:heHE.AporeiPasaGlossa.name
ltx/en_us_dedes/me.m12.d23:meMA.Ode9C12.mode	@ltx/en_us_dedes/miscellanea:misc.Mode2
ltx/en_us_dedes/me.m12.d23:meMA.Ode9C12.ode	@ltx/en_us_dedes/miscellanea:misc.Ode9
ltx/en_us_dedes/me.m12.d23:meMA.Ode9C12.text	
ltx/en_us_dedes/me.m12.d23:meMA.Ode9C13.incipit	…
ltx/en_us_dedes/me.m12.d23:meMA.Ode9C13.melody	@ltx/en_us_dedes/he.h.m2:heHE.AporeiPasaGlossa.name
ltx/en_us_dedes/me.m12.d23:meMA.Ode9C13.mode	@ltx/en_us_dedes/miscellanea:misc.Mode2
ltx/en_us_dedes/me.m12.d23:meMA.Ode9C13.ode	@ltx/en_us_dedes/miscellanea:misc.Ode9
ltx/en_us_dedes/me.m12.d23:meMA.Ode9C13.text	
ltx/en_us_dedes/me.m12.d23:meMA.Ode9C14.incipit	…
ltx/en_us_dedes/me.m12.d23:meMA.Ode9C14.melody	@ltx/en_us_dedes/he.h.m2:heHE.AporeiPasaGlossa.name
ltx/en_us_dedes/me.m12.d23:meMA.Ode9C14.mode	@ltx/en_us_dedes/miscellanea:misc.Mode2
ltx/en_us_dedes/me.m12.d23:meMA.Ode9C14.ode	@ltx/en_us_dedes/miscellanea:misc.Ode9
ltx/en_us_dedes/me.m12.d23:meMA.Ode9C14.text	
ltx/en_us_dedes/me.m12.d23:meMA.Ode9C15.incipit	…
ltx/en_us_dedes/me.m12.d23:meMA.Ode9C15.melody	@ltx/en_us_dedes/he.h.m2:heHE.AporeiPasaGlossa.name
ltx/en_us_dedes/me.m12.d23:meMA.Ode9C15.mode	@ltx/en_us_dedes/miscellanea:misc.Mode2
ltx/en_us_dedes/me.m12.d23:meMA.Ode9C15.ode	@ltx/en_us_dedes/miscellanea:misc.Ode9
ltx/en_us_dedes/me.m12.d23:meMA.Ode9C15.text	
ltx/en_us_dedes/me.m12.d23:meMA.Ode9C1H.greekmelody	@ltx/en_us_dedes/he.h.m2:heHE.AporeiPasaGlossa.greekname
ltx/en_us_dedes/me.m12.d23:meMA.Ode9C1H.incipit	@ltx/en_us_dedes/he.h.m2:heHE.AporeiPasaGlossa.incipit
ltx/en_us_dedes/me.m12.d23:meMA.Ode9C1H.melody	@ltx/en_us_dedes/he.h.m2:heHE.AporeiPasaGlossa.melody
ltx/en_us_dedes/me.m12.d23:meMA.Ode9C1H.mode	@ltx/en_us_dedes/miscellanea:misc.Mode2
ltx/en_us_dedes/me.m12.d23:meMA.Ode9C1H.ode	@ltx/en_us_dedes/miscellanea:misc.Ode9
ltx/en_us_dedes/me.m12.d23:meMA.Ode9C1H.text	@ltx/en_us_dedes/he.h.m2:heHE.AporeiPasaGlossa.text
ltx/en_us_dedes/me.m12.d23:meMA.Ode9C21.greekmelody	@ltx/en_us_dedes/he.h.m6:heHE.TheonAnthropois.greekname
ltx/en_us_dedes/me.m12.d23:meMA.Ode9C21.incipit	…
ltx/en_us_dedes/me.m12.d23:meMA.Ode9C21.melody	@ltx/en_us_dedes/he.h.m6:heHE.TheonAnthropois.name
ltx/en_us_dedes/me.m12.d23:meMA.Ode9C21.mode	@ltx/en_us_dedes/miscellanea:misc.Mode6
ltx/en_us_dedes/me.m12.d23:meMA.Ode9C21.ode	@ltx/en_us_dedes/miscellanea:misc.Ode9
ltx/en_us_dedes/me.m12.d23:meMA.Ode9C21.text	
ltx/en_us_dedes/me.m12.d23:meMA.Ode9C22.incipit	…
ltx/en_us_dedes/me.m12.d23:meMA.Ode9C22.melody	@ltx/en_us_dedes/he.h.m6:heHE.TheonAnthropois.name
ltx/en_us_dedes/me.m12.d23:meMA.Ode9C22.mode	@ltx/en_us_dedes/miscellanea:misc.Mode6
ltx/en_us_dedes/me.m12.d23:meMA.Ode9C22.ode	@ltx/en_us_dedes/miscellanea:misc.Ode9
ltx/en_us_dedes/me.m12.d23:meMA.Ode9C22.text	
ltx/en_us_dedes/me.m12.d23:meMA.Ode9C23.incipit	…
ltx/en_us_dedes/me.m12.d23:meMA.Ode9C23.melody	@ltx/en_us_dedes/he.h.m6:heHE.TheonAnthropois.name
ltx/en_us_dedes/me.m12.d23:meMA.Ode9C23.mode	@ltx/en_us_dedes/miscellanea:misc.Mode6
ltx/en_us_dedes/me.m12.d23:meMA.Ode9C23.ode	@ltx/en_us_dedes/miscellanea:misc.Ode9
ltx/en_us_dedes/me.m12.d23:meMA.Ode9C23.text	
ltx/en_us_dedes/me.m12.d23:meMA.Ode9C2T.incipit	…
ltx/en_us_dedes/me.m12.d23:meMA.Ode9C2T.melody	@ltx/en_us_dedes/he.h.m6:heHE.TheonAnthropois.name
ltx/en_us_dedes/me.m12.d23:meMA.Ode9C2T.mode	@ltx/en_us_dedes/miscellanea:misc.Mode6
ltx/en_us_dedes/me.m12.d23:meMA.Ode9C2T.ode	@ltx/en_us_dedes/miscellanea:misc.Ode9
ltx/en_us_dedes/me.m12.d23:meMA.Ode9C2T.text	
ltx/en_us_dedes/me.m12.d23:meMA.Ode9C31.greekmelody	@ltx/en_us_dedes/he.h.m3:heHE.SeTinAthanaton.greekname
ltx/en_us_dedes/me.m12.d23:meMA.Ode9C31.incipit	…
ltx/en_us_dedes/me.m12.d23:meMA.Ode9C31.melody	@ltx/en_us_dedes/he.h.m3:heHE.SeTinAthanaton.name
ltx/en_us_dedes/me.m12.d23:meMA.Ode9C31.mode	@ltx/en_us_dedes/miscellanea:misc.Mode3
ltx/en_us_dedes/me.m12.d23:meMA.Ode9C31.ode	@ltx/en_us_dedes/miscellanea:misc.Ode9
ltx/en_us_dedes/me.m12.d23:meMA.Ode9C31.text	
ltx/en_us_dedes/me.m12.d23:meMA.Ode9C32.incipit	…
ltx/en_us_dedes/me.m12.d23:meMA.Ode9C32.melody	@ltx/en_us_dedes/he.h.m3:heHE.SeTinAthanaton.name
ltx/en_us_dedes/me.m12.d23:meMA.Ode9C32.mode	@ltx/en_us_dedes/miscellanea:misc.Mode3
ltx/en_us_dedes/me.m12.d23:meMA.Ode9C32.ode	@ltx/en_us_dedes/miscellanea:misc.Ode9
ltx/en_us_dedes/me.m12.d23:meMA.Ode9C32.text	
ltx/en_us_dedes/me.m12.d23:meMA.Ode9C33.incipit	…
ltx/en_us_dedes/me.m12.d23:meMA.Ode9C33.melody	@ltx/en_us_dedes/he.h.m3:heHE.SeTinAthanaton.name
ltx/en_us_dedes/me.m12.d23:meMA.Ode9C33.mode	@ltx/en_us_dedes/miscellanea:misc.Mode3
ltx/en_us_dedes/me.m12.d23:meMA.Ode9C33.ode	@ltx/en_us_dedes/miscellanea:misc.Ode9
ltx/en_us_dedes/me.m12.d23:meMA.Ode9C33.text	
ltx/en_us_dedes/me.m12.d23:meMA.Ode9C3T.incipit	…
ltx/en_us_dedes/me.m12.d23:meMA.Ode9C3T.melody	@ltx/en_us_dedes/he.h.m3:heHE.SeTinAthanaton.name
ltx/en_us_dedes/me.m12.d23:meMA.Ode9C3T.mode	@ltx/en_us_dedes/miscellanea:misc.Mode3
ltx/en_us_dedes/me.m12.d23:meMA.Ode9C3T.ode	@ltx/en_us_dedes/miscellanea:misc.Ode9
ltx/en_us_dedes/me.m12.d23:meMA.Ode9C3T.text	
ltx/en_us_dedes/me.m12.d23:meMA.Ode9H.greekmelody	@ltx/en_us_dedes/he.h.m3:heHE.SeTinAthanaton.greekname
ltx/en_us_dedes/me.m12.d23:meMA.Ode9H.incipit	@ltx/en_us_dedes/he.h.m3:heHE.SeTinAthanaton.incipit
ltx/en_us_dedes/me.m12.d23:meMA.Ode9H.melody	@ltx/en_us_dedes/he.h.m3:heHE.SeTinAthanaton.melody
ltx/en_us_dedes/me.m12.d23:meMA.Ode9H.mode	@ltx/en_us_dedes/miscellanea:misc.Mode3
ltx/en_us_dedes/me.m12.d23:meMA.Ode9H.ode	@ltx/en_us_dedes/miscellanea:misc.Ode9
ltx/en_us_dedes/me.m12.d23:meMA.Ode9H.text	@ltx/en_us_dedes/he.h.m3:heHE.SeTinAthanaton.text
ltx/en_us_dedes/me.m12.d23:meMA.Oikos1.text	The soldiers longed for Christ the Giver of life, who for us was born of a Virgin in a cave. They raised us a radiant chorus against Belial; they completely vanquished him, who of old had immensely boasted, and they dashed him to the ground. Now, as luminaries of the noeitc Sun, they light the way for those in darkness. Of old it was a star that appeared to the Magi, guiding them to Bethlehem the city in Judah; and now these stars of martyrdom, by their tortures, herald to us the Lord, to whom the Virgin gave birth without human seed.
ltx/en_us_dedes/me.m12.d23:meVE.Apolytikion1.greekmelody	@ltx/en_us_dedes/he.a.m4:heAU.KateplagiIosif.greekname
ltx/en_us_dedes/me.m12.d23:meVE.Apolytikion1.incipit	@ltx/en_us_dedes/me.m12.d20:meVE.Apolytikion1.incipit
ltx/en_us_dedes/me.m12.d23:meVE.Apolytikion1.melody	@ltx/en_us_dedes/he.a.m4:heAU.KateplagiIosif.name
ltx/en_us_dedes/me.m12.d23:meVE.Apolytikion1.mode	@ltx/en_us_dedes/miscellanea:misc.Mode4
ltx/en_us_dedes/me.m12.d23:meVE.Apolytikion1.text	@ltx/en_us_dedes/me.m12.d20:meVE.Apolytikion1.text
ltx/en_us_dedes/me.m12.d23:meVE.Apolytikion2.greekmelody	@ltx/en_us_dedes/he.a.m3:heAU.TinOraiotita.greekname
ltx/en_us_dedes/me.m12.d23:meVE.Apolytikion2.incipit	…
ltx/en_us_dedes/me.m12.d23:meVE.Apolytikion2.melody	@ltx/en_us_dedes/he.a.m3:heAU.TinOraiotita.name
ltx/en_us_dedes/me.m12.d23:meVE.Apolytikion2.mode	@ltx/en_us_dedes/miscellanea:misc.Mode3
ltx/en_us_dedes/me.m12.d23:meVE.Apolytikion2.text	
ltx/en_us_dedes/me.m12.d23:meVE.Apolytikion3ger.greekmelody	@ltx/en_us_dedes/he.a.m3:heAU.TinOraiotita.greekname
ltx/en_us_dedes/me.m12.d23:meVE.Apolytikion3ger.incipit	…
ltx/en_us_dedes/me.m12.d23:meVE.Apolytikion3ger.melody	@ltx/en_us_dedes/he.a.m3:heAU.TinOraiotita.name
ltx/en_us_dedes/me.m12.d23:meVE.Apolytikion3ger.mode	@ltx/en_us_dedes/miscellanea:misc.Mode3
ltx/en_us_dedes/me.m12.d23:meVE.Apolytikion3ger.poet	@ltx/en_us_dedes/poets:po.Gerasimou
ltx/en_us_dedes/me.m12.d23:meVE.Apolytikion3ger.text	
ltx/en_us_dedes/me.m12.d23:meVE.AposBoth.incipit	…
ltx/en_us_dedes/me.m12.d23:meVE.AposBoth.melody	
ltx/en_us_dedes/me.m12.d23:meVE.AposBoth.mode	@ltx/en_us_dedes/miscellanea:misc.Mode3
ltx/en_us_dedes/me.m12.d23:meVE.AposBoth.poet	@ltx/en_us_dedes/poets:po.Anatoliou
ltx/en_us_dedes/me.m12.d23:meVE.AposBoth.text	
ltx/en_us_dedes/me.m12.d23:meVE.AposGlory.incipit	Today we celebrate the forefestal…
ltx/en_us_dedes/me.m12.d23:meVE.AposGlory.melody	
ltx/en_us_dedes/me.m12.d23:meVE.AposGlory.mode	@ltx/en_us_dedes/miscellanea:misc.Mode3
ltx/en_us_dedes/me.m12.d23:meVE.AposGlory.text	Today we celebrate the forefestal feast of the Martyrs, which is a harbinger for us of the coming feast of the Nativity, as it heralds the Sun from the Sun who physically appeared from the Virgin. The Ten Martyrs in Crete competed mightily, and they received the crowns of victory from heaven. Let us say to them, “O holy Martyrs, chosen and sanctified choir, entreat Christ on behalf of us who faithfully observe your most solemn memory.
ltx/en_us_dedes/me.m12.d23:meVE.Aposticha1.greekmelody	@ltx/en_us_dedes/he.a.m6:heAU.TriimerosAnestis.greekname
ltx/en_us_dedes/me.m12.d23:meVE.Aposticha1.incipit	…
ltx/en_us_dedes/me.m12.d23:meVE.Aposticha1.melody	@ltx/en_us_dedes/he.a.m6:heAU.TriimerosAnestis.name
ltx/en_us_dedes/me.m12.d23:meVE.Aposticha1.mode	@ltx/en_us_dedes/miscellanea:misc.Mode6
ltx/en_us_dedes/me.m12.d23:meVE.Aposticha1.text	
ltx/en_us_dedes/me.m12.d23:meVE.Aposticha2.incipit	…
ltx/en_us_dedes/me.m12.d23:meVE.Aposticha2.melody	@ltx/en_us_dedes/he.a.m6:heAU.TriimerosAnestis.name
ltx/en_us_dedes/me.m12.d23:meVE.Aposticha2.mode	@ltx/en_us_dedes/miscellanea:misc.Mode6
ltx/en_us_dedes/me.m12.d23:meVE.Aposticha2.text	
ltx/en_us_dedes/me.m12.d23:meVE.Aposticha3.incipit	…
ltx/en_us_dedes/me.m12.d23:meVE.Aposticha3.melody	@ltx/en_us_dedes/he.a.m6:heAU.TriimerosAnestis.name
ltx/en_us_dedes/me.m12.d23:meVE.Aposticha3.mode	@ltx/en_us_dedes/miscellanea:misc.Mode6
ltx/en_us_dedes/me.m12.d23:meVE.Aposticha3.text	
ltx/en_us_dedes/me.m12.d23:meVE.SticBoth.incipit	@ltx/en_us_dedes/me.m12.d20:meVE.Aposticha1.incipit
ltx/en_us_dedes/me.m12.d23:meVE.SticBoth.melody	
ltx/en_us_dedes/me.m12.d23:meVE.SticBoth.mode	@ltx/en_us_dedes/miscellanea:misc.Mode2
ltx/en_us_dedes/me.m12.d23:meVE.SticBoth.poet	@ltx/en_us_dedes/poets:po.Kyprianou
ltx/en_us_dedes/me.m12.d23:meVE.SticBoth.text	@ltx/en_us_dedes/me.m12.d20:meVE.Aposticha1.text
ltx/en_us_dedes/me.m12.d23:meVE.SticGlory.incipit	Today, Crete celebrates the fore-feast…
ltx/en_us_dedes/me.m12.d23:meVE.SticGlory.melody	
ltx/en_us_dedes/me.m12.d23:meVE.SticGlory.mode	@ltx/en_us_dedes/miscellanea:misc.Mode2
ltx/en_us_dedes/me.m12.d23:meVE.SticGlory.poet	@ltx/en_us_dedes/poets:po.Kyprianou
ltx/en_us_dedes/me.m12.d23:meVE.SticGlory.text	Today, Crete celebrates the fore-feast of the Birth of Christ, in the memory of its medal-winning Martyrs. Therefore we entreat You, Lord, that by their prayers You save our souls.
ltx/en_us_dedes/me.m12.d23:meVE.Stichera01.greekmelody	@ltx/en_us_dedes/he.a.m4:heAU.OExYpsistouKlitheis.greekname
ltx/en_us_dedes/me.m12.d23:meVE.Stichera01.incipit	…
ltx/en_us_dedes/me.m12.d23:meVE.Stichera01.melody	@ltx/en_us_dedes/he.a.m4:heAU.OExYpsistouKlitheis.name
ltx/en_us_dedes/me.m12.d23:meVE.Stichera01.mode	@ltx/en_us_dedes/miscellanea:misc.Mode4
ltx/en_us_dedes/me.m12.d23:meVE.Stichera01.text	
ltx/en_us_dedes/me.m12.d23:meVE.Stichera02.incipit	…
ltx/en_us_dedes/me.m12.d23:meVE.Stichera02.melody	@ltx/en_us_dedes/he.a.m4:heAU.OExYpsistouKlitheis.name
ltx/en_us_dedes/me.m12.d23:meVE.Stichera02.mode	@ltx/en_us_dedes/miscellanea:misc.Mode4
ltx/en_us_dedes/me.m12.d23:meVE.Stichera02.text	
ltx/en_us_dedes/me.m12.d23:meVE.Stichera03.incipit	…
ltx/en_us_dedes/me.m12.d23:meVE.Stichera03.melody	@ltx/en_us_dedes/he.a.m4:heAU.OExYpsistouKlitheis.name
ltx/en_us_dedes/me.m12.d23:meVE.Stichera03.mode	@ltx/en_us_dedes/miscellanea:misc.Mode4
ltx/en_us_dedes/me.m12.d23:meVE.Stichera03.text	
ltx/en_us_dedes/me.m12.d23:meVE.Stichera04.greekmelody	@ltx/en_us_dedes/he.a.m4:heAU.OsGennaionEnMartysi.greekname
ltx/en_us_dedes/me.m12.d23:meVE.Stichera04.incipit	On this day let the…
ltx/en_us_dedes/me.m12.d23:meVE.Stichera04.melody	@ltx/en_us_dedes/he.a.m4:heAU.OsGennaionEnMartysi.notmetered
ltx/en_us_dedes/me.m12.d23:meVE.Stichera04.mode	@ltx/en_us_dedes/miscellanea:misc.Mode4
ltx/en_us_dedes/me.m12.d23:meVE.Stichera04.text	On this day let the group of ten holy Martyrs elect of God be extolled in sacred hymns of praise sung with uplifted voices. They are a lamp with ten flames, which illumines the complement of the Church with divine rays; they are unshaken pillars, and bright stars that made earth like heaven, by the brilliance of their great contests.
ltx/en_us_dedes/me.m12.d23:meVE.Stichera05.incipit	Let us extol the holy…
ltx/en_us_dedes/me.m12.d23:meVE.Stichera05.melody	@ltx/en_us_dedes/he.a.m4:heAU.OsGennaionEnMartysi.name
ltx/en_us_dedes/me.m12.d23:meVE.Stichera05.mode	@ltx/en_us_dedes/miscellanea:misc.Mode4
ltx/en_us_dedes/me.m12.d23:meVE.Stichera05.text	Let us extol the holy Martyrs: Theodoulos, Zotikos, and Pompey, Vasilides and Efporos, Agathopus, Satorninos, Gelasios, Evarestos, and Evnikianos; and let us honor them now in song. They are a calm harbor in the storm. They exposed deceptive error, and they received crowns of victory.
ltx/en_us_dedes/me.m12.d23:meVE.Stichera06.incipit	Let us extol the medal-winning…
ltx/en_us_dedes/me.m12.d23:meVE.Stichera06.melody	@ltx/en_us_dedes/he.a.m4:heAU.OsGennaionEnMartysi.name
ltx/en_us_dedes/me.m12.d23:meVE.Stichera06.mode	@ltx/en_us_dedes/miscellanea:misc.Mode4
ltx/en_us_dedes/me.m12.d23:meVE.Stichera06.text	Let us extol the medal-winning Martyrs, the offspring of Crete, the supporters of the Church, the unfading ornaments of the faithful, the precious fragrant flowers of Paradise, the finest sacrificial victims acceptable to Christ, those ten holy men dedicated in the celestial temple to the Trinity.
