ltx/en_us_dedes/sy.m09.d02:syMA.commemoration01.couplet1.title	@ltx/en_us_dedes/titles:ti.Verses
ltx/en_us_dedes/sy.m09.d02:syMA.commemoration01.couplet1.verse1	
ltx/en_us_dedes/sy.m09.d02:syMA.commemoration01.couplet1.verse2	
ltx/en_us_dedes/sy.m09.d02:syMA.commemoration01.narration.p01	
ltx/en_us_dedes/sy.m09.d02:syMA.commemoration01.single1	
ltx/en_us_dedes/sy.m09.d02:syMA.commemoration01.text	On September 2, we commemorate the holy martyr Mamas.
ltx/en_us_dedes/sy.m09.d02:syMA.commemoration02.couplet1.title	@ltx/en_us_dedes/titles:ti.Verses
ltx/en_us_dedes/sy.m09.d02:syMA.commemoration02.couplet1.verse1	
ltx/en_us_dedes/sy.m09.d02:syMA.commemoration02.couplet1.verse2	
ltx/en_us_dedes/sy.m09.d02:syMA.commemoration02.narration.p01	
ltx/en_us_dedes/sy.m09.d02:syMA.commemoration02.narration.p02	
ltx/en_us_dedes/sy.m09.d02:syMA.commemoration02.narration.p03	
ltx/en_us_dedes/sy.m09.d02:syMA.commemoration02.narration.p04	
ltx/en_us_dedes/sy.m09.d02:syMA.commemoration02.narration.p05	
ltx/en_us_dedes/sy.m09.d02:syMA.commemoration02.narration.p06	
ltx/en_us_dedes/sy.m09.d02:syMA.commemoration02.narration.p07	
ltx/en_us_dedes/sy.m09.d02:syMA.commemoration02.narration.p08	
ltx/en_us_dedes/sy.m09.d02:syMA.commemoration02.narration.p09	
ltx/en_us_dedes/sy.m09.d02:syMA.commemoration02.text	On this day we commemorate our holy father John the Faster, Patriarch of Constantinople.
ltx/en_us_dedes/sy.m09.d02:syMA.commemoration03.couplet1.title	@ltx/en_us_dedes/titles:ti.Verses
ltx/en_us_dedes/sy.m09.d02:syMA.commemoration03.couplet1.verse1	
ltx/en_us_dedes/sy.m09.d02:syMA.commemoration03.couplet1.verse2	
ltx/en_us_dedes/sy.m09.d02:syMA.commemoration03.text	St. Diomides died when he was run through by a sword.
ltx/en_us_dedes/sy.m09.d02:syMA.commemoration04.couplet1.title	@ltx/en_us_dedes/titles:ti.Verses
ltx/en_us_dedes/sy.m09.d02:syMA.commemoration04.couplet1.verse1	
ltx/en_us_dedes/sy.m09.d02:syMA.commemoration04.couplet1.verse2	
ltx/en_us_dedes/sy.m09.d02:syMA.commemoration04.text	St. Julian died when he was beaten on the head by a plank.
ltx/en_us_dedes/sy.m09.d02:syMA.commemoration05.couplet1.title	@ltx/en_us_dedes/titles:ti.Verses
ltx/en_us_dedes/sy.m09.d02:syMA.commemoration05.couplet1.verse1	
ltx/en_us_dedes/sy.m09.d02:syMA.commemoration05.couplet1.verse2	
ltx/en_us_dedes/sy.m09.d02:syMA.commemoration05.text	St. Philip died by the sword.
ltx/en_us_dedes/sy.m09.d02:syMA.commemoration06.couplet1.title	@ltx/en_us_dedes/titles:ti.Verses
ltx/en_us_dedes/sy.m09.d02:syMA.commemoration06.couplet1.verse1	
ltx/en_us_dedes/sy.m09.d02:syMA.commemoration06.couplet1.verse2	
ltx/en_us_dedes/sy.m09.d02:syMA.commemoration06.text	St. Eutychian died on a fire grill.
ltx/en_us_dedes/sy.m09.d02:syMA.commemoration07.couplet1.title	@ltx/en_us_dedes/titles:ti.Verses
ltx/en_us_dedes/sy.m09.d02:syMA.commemoration07.couplet1.verse1	
ltx/en_us_dedes/sy.m09.d02:syMA.commemoration07.couplet1.verse2	
ltx/en_us_dedes/sy.m09.d02:syMA.commemoration07.text	St. Hesychios died by hanging.
ltx/en_us_dedes/sy.m09.d02:syMA.commemoration08.couplet1.title	@ltx/en_us_dedes/titles:ti.Verses
ltx/en_us_dedes/sy.m09.d02:syMA.commemoration08.couplet1.verse1	
ltx/en_us_dedes/sy.m09.d02:syMA.commemoration08.couplet1.verse2	
ltx/en_us_dedes/sy.m09.d02:syMA.commemoration08.text	St. Leonides died by fire.
ltx/en_us_dedes/sy.m09.d02:syMA.commemoration09.couplet1.title	@ltx/en_us_dedes/titles:ti.Verses
ltx/en_us_dedes/sy.m09.d02:syMA.commemoration09.couplet1.verse1	
ltx/en_us_dedes/sy.m09.d02:syMA.commemoration09.couplet1.verse2	
ltx/en_us_dedes/sy.m09.d02:syMA.commemoration09.text	St. Eutychios died by crucifixion.
ltx/en_us_dedes/sy.m09.d02:syMA.commemoration10.couplet1.title	@ltx/en_us_dedes/titles:ti.Verses
ltx/en_us_dedes/sy.m09.d02:syMA.commemoration10.couplet1.verse1	
ltx/en_us_dedes/sy.m09.d02:syMA.commemoration10.couplet1.verse2	
ltx/en_us_dedes/sy.m09.d02:syMA.commemoration10.text	St. Philadelphus died with the stone weight around his neck.
ltx/en_us_dedes/sy.m09.d02:syMA.commemoration11.couplet1.title	@ltx/en_us_dedes/titles:ti.Verses
ltx/en_us_dedes/sy.m09.d02:syMA.commemoration11.couplet1.verse1	
ltx/en_us_dedes/sy.m09.d02:syMA.commemoration11.couplet1.verse2	
ltx/en_us_dedes/sy.m09.d02:syMA.commemoration11.text	St. Melanippus died by fire.
ltx/en_us_dedes/sy.m09.d02:syMA.commemoration12.couplet1.title	@ltx/en_us_dedes/titles:ti.Verses
ltx/en_us_dedes/sy.m09.d02:syMA.commemoration12.couplet1.verse1	
ltx/en_us_dedes/sy.m09.d02:syMA.commemoration12.couplet1.verse2	
ltx/en_us_dedes/sy.m09.d02:syMA.commemoration12.text	St. Parthagape died in the sea.
ltx/en_us_dedes/sy.m09.d02:syMA.commemoration13.narration.p01	
ltx/en_us_dedes/sy.m09.d02:syMA.commemoration13.text	On this day we commemorate the just priests Eleazar and Phineas and also the holy martyrs Aeithala and Ammoun.
ltx/en_us_dedes/sy.m09.d02:syMA.lastline	By the intercessions of Your saints, O God, have mercy on us. Amen.
