ltx/en_us_dedes/he.h.m1:heHE.AftiIKliti.greekname	Αὔτη ἡ κλητή.
ltx/en_us_dedes/he.h.m1:heHE.AftiIKliti.incipit	This is it…
ltx/en_us_dedes/he.h.m1:heHE.AftiIKliti.melody	@ltx/en_us_dedes/miscellanea:misc.Heirmos
ltx/en_us_dedes/he.h.m1:heHE.AftiIKliti.mode	@ltx/en_us_dedes/miscellanea:misc.Mode1
ltx/en_us_dedes/he.h.m1:heHE.AftiIKliti.name	This is it.
ltx/en_us_dedes/he.h.m1:heHE.AftiIKliti.notmetered	N/M (This is it.)
ltx/en_us_dedes/he.h.m1:heHE.AftiIKliti.ode	@ltx/en_us_dedes/miscellanea:misc.Ode8
ltx/en_us_dedes/he.h.m1:heHE.AftiIKliti.text	This is it, the Day which is chosen and holy, * Day One of the Sabbaths. * It is the queen-day, the Lord’s Day, * and the Feast of all feasts, * and the Festival above every festival, * on which we extol Christ and bless Him to the ages.
ltx/en_us_dedes/he.h.m1:heHE.AlionPontogenes.greekname	Ἅλιον ποντογενές.
ltx/en_us_dedes/he.h.m1:heHE.AlionPontogenes.incipit	Briny and born…
ltx/en_us_dedes/he.h.m1:heHE.AlionPontogenes.melody	@ltx/en_us_dedes/miscellanea:misc.Heirmos
ltx/en_us_dedes/he.h.m1:heHE.AlionPontogenes.mode	@ltx/en_us_dedes/miscellanea:misc.Mode1
ltx/en_us_dedes/he.h.m1:heHE.AlionPontogenes.name	Briny and born.
ltx/en_us_dedes/he.h.m1:heHE.AlionPontogenes.notmetered	N/M (Briny and born.)
ltx/en_us_dedes/he.h.m1:heHE.AlionPontogenes.ode	@ltx/en_us_dedes/miscellanea:misc.Ode6
ltx/en_us_dedes/he.h.m1:heHE.AlionPontogenes.text	Briny and born of the deep, * the fire in the maw of the whale * was a prefiguring of Your three-daylong burial; * and of this figure was Jonah the interpreter. * For, preserved unscathed as before he was swallowed up, he cried out: * I shall sacrifice to You with a voice of praise, O Lord.
ltx/en_us_dedes/he.h.m1:heHE.AnastaseosImera.greekname	Ἀναστάσεως ἡμέρα.
ltx/en_us_dedes/he.h.m1:heHE.AnastaseosImera.incipit	Resurrection Day…
ltx/en_us_dedes/he.h.m1:heHE.AnastaseosImera.melody	@ltx/en_us_dedes/miscellanea:misc.Heirmos
ltx/en_us_dedes/he.h.m1:heHE.AnastaseosImera.mode	@ltx/en_us_dedes/miscellanea:misc.Mode1
ltx/en_us_dedes/he.h.m1:heHE.AnastaseosImera.name	Resurrection Day.
ltx/en_us_dedes/he.h.m1:heHE.AnastaseosImera.notmetered	N/M (Resurrection Day.)
ltx/en_us_dedes/he.h.m1:heHE.AnastaseosImera.ode	@ltx/en_us_dedes/miscellanea:misc.Ode1
ltx/en_us_dedes/he.h.m1:heHE.AnastaseosImera.text	Resurrection Day! O peoples, let us brilliantly shine! * Pascha, the Lord’s Pascha! * For Christ our God has out of death * passed us over into life, * and likewise from earth * to heaven, as we now sing * unto Him a triumphal hymn.
ltx/en_us_dedes/he.h.m1:heHE.AnthrakaPyrosTonIsaiou.greekname	Ἄνθρακα πυρὸς τῶν Ἠσαΐου.
ltx/en_us_dedes/he.h.m1:heHE.AnthrakaPyrosTonIsaiou.incipit	…
ltx/en_us_dedes/he.h.m1:heHE.AnthrakaPyrosTonIsaiou.melody	@ltx/en_us_dedes/miscellanea:misc.Heirmos
ltx/en_us_dedes/he.h.m1:heHE.AnthrakaPyrosTonIsaiou.mode	@ltx/en_us_dedes/miscellanea:misc.Mode1
ltx/en_us_dedes/he.h.m1:heHE.AnthrakaPyrosTonIsaiou.name	
ltx/en_us_dedes/he.h.m1:heHE.AnthrakaPyrosTonIsaiou.notmetered	N/M ()
ltx/en_us_dedes/he.h.m1:heHE.AnthrakaPyrosTonIsaiou.ode	@ltx/en_us_dedes/miscellanea:misc.Ode5
ltx/en_us_dedes/he.h.m1:heHE.AnthrakaPyrosTonIsaiou.text	
ltx/en_us_dedes/he.h.m1:heHE.AperripsasMe.greekname	Ἀπέῤῥιψάς με.
ltx/en_us_dedes/he.h.m1:heHE.AperripsasMe.incipit	…
ltx/en_us_dedes/he.h.m1:heHE.AperripsasMe.melody	@ltx/en_us_dedes/miscellanea:misc.Heirmos
ltx/en_us_dedes/he.h.m1:heHE.AperripsasMe.mode	@ltx/en_us_dedes/miscellanea:misc.Mode1
ltx/en_us_dedes/he.h.m1:heHE.AperripsasMe.name	
ltx/en_us_dedes/he.h.m1:heHE.AperripsasMe.notmetered	N/M ()
ltx/en_us_dedes/he.h.m1:heHE.AperripsasMe.ode	@ltx/en_us_dedes/miscellanea:misc.Ode6
ltx/en_us_dedes/he.h.m1:heHE.AperripsasMe.text	
ltx/en_us_dedes/he.h.m1:heHE.AsomenPantesLaoi.greekname	ᾌσωμεν πάντες λαοί.
ltx/en_us_dedes/he.h.m1:heHE.AsomenPantesLaoi.incipit	All people, sing to the Lord…
ltx/en_us_dedes/he.h.m1:heHE.AsomenPantesLaoi.melody	@ltx/en_us_dedes/miscellanea:misc.Heirmos
ltx/en_us_dedes/he.h.m1:heHE.AsomenPantesLaoi.mode	@ltx/en_us_dedes/miscellanea:misc.Mode1
ltx/en_us_dedes/he.h.m1:heHE.AsomenPantesLaoi.name	All people, sing to the Lord.
ltx/en_us_dedes/he.h.m1:heHE.AsomenPantesLaoi.notmetered	N/M (All people, sing to the Lord.)
ltx/en_us_dedes/he.h.m1:heHE.AsomenPantesLaoi.ode	@ltx/en_us_dedes/miscellanea:misc.Ode1
ltx/en_us_dedes/he.h.m1:heHE.AsomenPantesLaoi.text	All people, sing to the Lord – * who from their bitter bondage * to the Pharaoh freed the people of Israel * and led them through the Red Sea * and kept their feet from being splashed by it – * a victory song, for He is greatly glorified.
ltx/en_us_dedes/he.h.m1:heHE.AvramiaioiPaides.greekname	Ἀβραμιαῖοι Παῖδες.
ltx/en_us_dedes/he.h.m1:heHE.AvramiaioiPaides.incipit	…
ltx/en_us_dedes/he.h.m1:heHE.AvramiaioiPaides.melody	@ltx/en_us_dedes/miscellanea:misc.Heirmos
ltx/en_us_dedes/he.h.m1:heHE.AvramiaioiPaides.mode	@ltx/en_us_dedes/miscellanea:misc.Mode1
ltx/en_us_dedes/he.h.m1:heHE.AvramiaioiPaides.name	
ltx/en_us_dedes/he.h.m1:heHE.AvramiaioiPaides.notmetered	N/M ()
ltx/en_us_dedes/he.h.m1:heHE.AvramiaioiPaides.ode	@ltx/en_us_dedes/miscellanea:misc.Ode7
ltx/en_us_dedes/he.h.m1:heHE.AvramiaioiPaides.text	
ltx/en_us_dedes/he.h.m1:heHE.ChaireParthenias.greekname	Χαῖρε Παρθενίας.
ltx/en_us_dedes/he.h.m1:heHE.ChaireParthenias.incipit	…
ltx/en_us_dedes/he.h.m1:heHE.ChaireParthenias.melody	@ltx/en_us_dedes/miscellanea:misc.Heirmos
ltx/en_us_dedes/he.h.m1:heHE.ChaireParthenias.mode	@ltx/en_us_dedes/miscellanea:misc.Mode1
ltx/en_us_dedes/he.h.m1:heHE.ChaireParthenias.name	
ltx/en_us_dedes/he.h.m1:heHE.ChaireParthenias.notmetered	N/M ()
ltx/en_us_dedes/he.h.m1:heHE.ChaireParthenias.ode	@ltx/en_us_dedes/miscellanea:misc.Ode9
ltx/en_us_dedes/he.h.m1:heHE.ChaireParthenias.text	
ltx/en_us_dedes/he.h.m1:heHE.CheirasEnToLakko.greekname	Χεῖρας ἐν τῷ λάκκῳ.
ltx/en_us_dedes/he.h.m1:heHE.CheirasEnToLakko.incipit	Daniel, who is known…
ltx/en_us_dedes/he.h.m1:heHE.CheirasEnToLakko.melody	@ltx/en_us_dedes/miscellanea:misc.Heirmos
ltx/en_us_dedes/he.h.m1:heHE.CheirasEnToLakko.mode	@ltx/en_us_dedes/miscellanea:misc.Mode1
ltx/en_us_dedes/he.h.m1:heHE.CheirasEnToLakko.name	Daniel, who is known.
ltx/en_us_dedes/he.h.m1:heHE.CheirasEnToLakko.notmetered	N/M (Daniel, who is known.)
ltx/en_us_dedes/he.h.m1:heHE.CheirasEnToLakko.ode	@ltx/en_us_dedes/miscellanea:misc.Ode8
ltx/en_us_dedes/he.h.m1:heHE.CheirasEnToLakko.text	Daniel, who is known as one great among the Prophets, * was cast into the lions’ den and was preserved from being eaten; * for he stretched out his hands in the form of a cross and was kept unharmed, * as he was blessing Christ our God unto the ages.
ltx/en_us_dedes/he.h.m1:heHE.ChristosGennatai.greekname	Χριστὸς γεννᾶται.
ltx/en_us_dedes/he.h.m1:heHE.ChristosGennatai.incipit	Christ is born…
ltx/en_us_dedes/he.h.m1:heHE.ChristosGennatai.melody	@ltx/en_us_dedes/miscellanea:misc.Heirmos
ltx/en_us_dedes/he.h.m1:heHE.ChristosGennatai.mode	@ltx/en_us_dedes/miscellanea:misc.Mode1
ltx/en_us_dedes/he.h.m1:heHE.ChristosGennatai.name	Christ is born.
ltx/en_us_dedes/he.h.m1:heHE.ChristosGennatai.notmetered	N/M (Christ is born.)
ltx/en_us_dedes/he.h.m1:heHE.ChristosGennatai.ode	@ltx/en_us_dedes/miscellanea:misc.Ode1
ltx/en_us_dedes/he.h.m1:heHE.ChristosGennatai.text	Christ is born; glorify Him! * Christ is come from heaven; go and meet Him. * Christ is on earth; arise to Him. * Sing to the Lord, all you who dwell on the earth; * and in merry spirits, O you peoples, praise His birth. * For He is glorified.
ltx/en_us_dedes/he.h.m1:heHE.DeftePomaPiomen.greekname	Δεῦτε πόμα πίωμεν.
ltx/en_us_dedes/he.h.m1:heHE.DeftePomaPiomen.incipit	Come and let us drink…
ltx/en_us_dedes/he.h.m1:heHE.DeftePomaPiomen.melody	@ltx/en_us_dedes/miscellanea:misc.Heirmos
ltx/en_us_dedes/he.h.m1:heHE.DeftePomaPiomen.mode	@ltx/en_us_dedes/miscellanea:misc.Mode1
ltx/en_us_dedes/he.h.m1:heHE.DeftePomaPiomen.name	Come and let us drink.
ltx/en_us_dedes/he.h.m1:heHE.DeftePomaPiomen.notmetered	N/M (Come and let us drink.)
ltx/en_us_dedes/he.h.m1:heHE.DeftePomaPiomen.ode	@ltx/en_us_dedes/miscellanea:misc.Ode3
ltx/en_us_dedes/he.h.m1:heHE.DeftePomaPiomen.text	Come and let us drink a new drink, * not one marvelously issuing from a barren rock, * but one that Christ from the tomb * pours out, incorruption’s very source. * For we are established in Him.
ltx/en_us_dedes/he.h.m1:heHE.EikoniLatrevein.greekname	Εἰκόνι λατρεύειν.
ltx/en_us_dedes/he.h.m1:heHE.EikoniLatrevein.incipit	The sound of the music…
ltx/en_us_dedes/he.h.m1:heHE.EikoniLatrevein.melody	@ltx/en_us_dedes/miscellanea:misc.Heirmos
ltx/en_us_dedes/he.h.m1:heHE.EikoniLatrevein.mode	@ltx/en_us_dedes/miscellanea:misc.Mode1
ltx/en_us_dedes/he.h.m1:heHE.EikoniLatrevein.name	The sound of the music
ltx/en_us_dedes/he.h.m1:heHE.EikoniLatrevein.notmetered	N/M (The sound of the music.)
ltx/en_us_dedes/he.h.m1:heHE.EikoniLatrevein.ode	@ltx/en_us_dedes/miscellanea:misc.Ode7
ltx/en_us_dedes/he.h.m1:heHE.EikoniLatrevein.text	The sound of the music called the peoples to worship the golden image of old. * The Servants, scions of David, sang * a song of Zion in defiance of the despicable decree of the tyrant, * and the flame in the furnace became for them dewy, as they sang the hymn, * “Exalted beyond measure are You, O God of our fathers. Blessed are You, our God!”
ltx/en_us_dedes/he.h.m1:heHE.EisakikoaKyrieTinAkoin.greekname	Εἰσακήκοα Κύριε τὴν ἀκοήν.
ltx/en_us_dedes/he.h.m1:heHE.EisakikoaKyrieTinAkoin.incipit	…
ltx/en_us_dedes/he.h.m1:heHE.EisakikoaKyrieTinAkoin.melody	@ltx/en_us_dedes/miscellanea:misc.Heirmos
ltx/en_us_dedes/he.h.m1:heHE.EisakikoaKyrieTinAkoin.mode	@ltx/en_us_dedes/miscellanea:misc.Mode1
ltx/en_us_dedes/he.h.m1:heHE.EisakikoaKyrieTinAkoin.name	
ltx/en_us_dedes/he.h.m1:heHE.EisakikoaKyrieTinAkoin.notmetered	N/M ()
ltx/en_us_dedes/he.h.m1:heHE.EisakikoaKyrieTinAkoin.ode	@ltx/en_us_dedes/miscellanea:misc.Ode4
ltx/en_us_dedes/he.h.m1:heHE.EisakikoaKyrieTinAkoin.text	
ltx/en_us_dedes/he.h.m1:heHE.EkNyktosErgon.greekname	Ἐκ νυκτὸς ἔργων.
ltx/en_us_dedes/he.h.m1:heHE.EkNyktosErgon.incipit	Now rising…
ltx/en_us_dedes/he.h.m1:heHE.EkNyktosErgon.melody	@ltx/en_us_dedes/miscellanea:misc.Heirmos
ltx/en_us_dedes/he.h.m1:heHE.EkNyktosErgon.mode	@ltx/en_us_dedes/miscellanea:misc.Mode1
ltx/en_us_dedes/he.h.m1:heHE.EkNyktosErgon.name	Now rising.
ltx/en_us_dedes/he.h.m1:heHE.EkNyktosErgon.notmetered	N/M (Now rising.)
ltx/en_us_dedes/he.h.m1:heHE.EkNyktosErgon.ode	@ltx/en_us_dedes/miscellanea:misc.Ode5
ltx/en_us_dedes/he.h.m1:heHE.EkNyktosErgon.text	Now rising to You, O Christ, from the night of sinning — * Iniquitous misdeeds, bedarkened by error, — * To extol You, our Benefactor, we pray that You grant us * Your mercy, and come to us and make the path easy, * So that ascending by it we may attain to glory.
ltx/en_us_dedes/he.h.m1:heHE.EkNyktosErgon1.text	Now rising to You, O Christ, from the night of sinning —
ltx/en_us_dedes/he.h.m1:heHE.EkNyktosErgon1a.text	N
ltx/en_us_dedes/he.h.m1:heHE.EkNyktosErgon1b.text	ow rising to You, O Christ, from the night of sinning —
ltx/en_us_dedes/he.h.m1:heHE.EkNyktosErgon2.text	Iniquitous misdeeds, bedarkened by error, —
ltx/en_us_dedes/he.h.m1:heHE.EkNyktosErgon2a.text	I
ltx/en_us_dedes/he.h.m1:heHE.EkNyktosErgon2b.text	niquitous misdeeds, bedarkened by error, —
ltx/en_us_dedes/he.h.m1:heHE.EkNyktosErgon3.text	To extol You, our Benefactor, we pray that You grant us
ltx/en_us_dedes/he.h.m1:heHE.EkNyktosErgon3a.text	T
ltx/en_us_dedes/he.h.m1:heHE.EkNyktosErgon3b.text	o extol You, our Benefactor, we pray that You grant us
ltx/en_us_dedes/he.h.m1:heHE.EkNyktosErgon4.text	Your mercy, and come to us and make the path easy,
ltx/en_us_dedes/he.h.m1:heHE.EkNyktosErgon4a.text	Y
ltx/en_us_dedes/he.h.m1:heHE.EkNyktosErgon4b.text	our mercy, and come to us and make the path easy,
ltx/en_us_dedes/he.h.m1:heHE.EkNyktosErgon5.text	So that ascending by it we may attain to glory.
ltx/en_us_dedes/he.h.m1:heHE.EkNyktosErgon5a.text	S
ltx/en_us_dedes/he.h.m1:heHE.EkNyktosErgon5b.text	o that ascending by it we may attain to glory.
ltx/en_us_dedes/he.h.m1:heHE.EkNyktosOrthrizontes.greekname	Ἐκ νυκτὸς ὀρθρίζοντες.
ltx/en_us_dedes/he.h.m1:heHE.EkNyktosOrthrizontes.incipit	N/M…
ltx/en_us_dedes/he.h.m1:heHE.EkNyktosOrthrizontes.melody	@ltx/en_us_dedes/miscellanea:misc.HeirmosNotMetered
ltx/en_us_dedes/he.h.m1:heHE.EkNyktosOrthrizontes.mode	@ltx/en_us_dedes/miscellanea:misc.Mode1
ltx/en_us_dedes/he.h.m1:heHE.EkNyktosOrthrizontes.name	N/M ()
ltx/en_us_dedes/he.h.m1:heHE.EkNyktosOrthrizontes.notmetered	N/M ()
ltx/en_us_dedes/he.h.m1:heHE.EkNyktosOrthrizontes.ode	@ltx/en_us_dedes/miscellanea:misc.Ode5
ltx/en_us_dedes/he.h.m1:heHE.EkNyktosOrthrizontes.text	Rising early in the morning, we extol You, O Christ our God, who for us became poor, and endured the Cross and death in the flesh.
ltx/en_us_dedes/he.h.m1:heHE.EkNyktosOrthrizontesYmnoumenSe.greekname	Ἐκ νυκτὸς ὀρθρίζοντες ὑμνοῦμέν σε.
ltx/en_us_dedes/he.h.m1:heHE.EkNyktosOrthrizontesYmnoumenSe.incipit	Rising from the night, we sing…
ltx/en_us_dedes/he.h.m1:heHE.EkNyktosOrthrizontesYmnoumenSe.melody	@ltx/en_us_dedes/miscellanea:misc.Heirmos
ltx/en_us_dedes/he.h.m1:heHE.EkNyktosOrthrizontesYmnoumenSe.mode	@ltx/en_us_dedes/miscellanea:misc.Mode1
ltx/en_us_dedes/he.h.m1:heHE.EkNyktosOrthrizontesYmnoumenSe.name	Rising from the night, we sing.
ltx/en_us_dedes/he.h.m1:heHE.EkNyktosOrthrizontesYmnoumenSe.notmetered	N/M (Rising from the night, we sing.)
ltx/en_us_dedes/he.h.m1:heHE.EkNyktosOrthrizontesYmnoumenSe.ode	@ltx/en_us_dedes/miscellanea:misc.Ode5
ltx/en_us_dedes/he.h.m1:heHE.EkNyktosOrthrizontesYmnoumenSe.text	Rising from the night, we sing extolling You, O Christ, * the Father’s coeternal Son * and the Savior of our souls, O Lord. * Grant Your peace to the world, in Your divine benevolence.
ltx/en_us_dedes/he.h.m1:heHE.EkyklosenImas.greekname	Ἐκύκλωσεν ἡμᾶς.
ltx/en_us_dedes/he.h.m1:heHE.EkyklosenImas.incipit	The lowest depth encircles us…
ltx/en_us_dedes/he.h.m1:heHE.EkyklosenImas.melody	@ltx/en_us_dedes/miscellanea:misc.Heirmos
ltx/en_us_dedes/he.h.m1:heHE.EkyklosenImas.mode	@ltx/en_us_dedes/miscellanea:misc.Mode1
ltx/en_us_dedes/he.h.m1:heHE.EkyklosenImas.name	The lowest depth encircles us.
ltx/en_us_dedes/he.h.m1:heHE.EkyklosenImas.notmetered	N/M (The lowest depth encircles us.)
ltx/en_us_dedes/he.h.m1:heHE.EkyklosenImas.ode	@ltx/en_us_dedes/miscellanea:misc.Ode6
ltx/en_us_dedes/he.h.m1:heHE.EkyklosenImas.text	The lowest depth encircles us, like Jonah said, * and there is no deliverer. * We are counted as sheep for slaughter, O Lord. * Save Your people, for You are our only God. * You are our strength, and You restore us, the weak and broken down.
ltx/en_us_dedes/he.h.m1:heHE.EnKaminoPaides.greekname	Ἐν καμίνῳ Παῖδες.
ltx/en_us_dedes/he.h.m1:heHE.EnKaminoPaides.incipit	Three young men of Israel…
ltx/en_us_dedes/he.h.m1:heHE.EnKaminoPaides.melody	@ltx/en_us_dedes/miscellanea:misc.Heirmos
ltx/en_us_dedes/he.h.m1:heHE.EnKaminoPaides.mode	@ltx/en_us_dedes/miscellanea:misc.Mode1
ltx/en_us_dedes/he.h.m1:heHE.EnKaminoPaides.name	Three young men of Israel.
ltx/en_us_dedes/he.h.m1:heHE.EnKaminoPaides.notmetered	N/M (Three young men of Israel.)
ltx/en_us_dedes/he.h.m1:heHE.EnKaminoPaides.ode	@ltx/en_us_dedes/miscellanea:misc.Ode8
ltx/en_us_dedes/he.h.m1:heHE.EnKaminoPaides.text	Three young men of Israel were thrown * into the blazing furnace, * as if they were being smelted. * Shining brighter than pure gold with beauty of piety, * they sang, “Bless the Lord, all you works; to the Lord sing a hymn * and exalt Him beyond measure unto all the ages.”
ltx/en_us_dedes/he.h.m1:heHE.EnPnevmatiProvlepon.greekname	Ἐν Πνεύματι προβλέπων.
ltx/en_us_dedes/he.h.m1:heHE.EnPnevmatiProvlepon.incipit	When you, Prophet Habbakuk…
ltx/en_us_dedes/he.h.m1:heHE.EnPnevmatiProvlepon.melody	@ltx/en_us_dedes/miscellanea:misc.Heirmos
ltx/en_us_dedes/he.h.m1:heHE.EnPnevmatiProvlepon.mode	@ltx/en_us_dedes/miscellanea:misc.Mode1
ltx/en_us_dedes/he.h.m1:heHE.EnPnevmatiProvlepon.name	When you, Prophet Habbakuk.
ltx/en_us_dedes/he.h.m1:heHE.EnPnevmatiProvlepon.notmetered	N/M (When you, Prophet Habbakuk.)
ltx/en_us_dedes/he.h.m1:heHE.EnPnevmatiProvlepon.ode	@ltx/en_us_dedes/miscellanea:misc.Ode4
ltx/en_us_dedes/he.h.m1:heHE.EnPnevmatiProvlepon.text	When you, Prophet Habbakuk, inspired had foreseen * the incarnation of the Word, you shouted and declared, * “In the approaching years You shall be acknowledged; * You will be revealed when the time comes. * Glory to Your strength, O Lord.”
ltx/en_us_dedes/he.h.m1:heHE.EpainonOTheoptis.greekname	Ἔπαινον ὁ θεόπτης.
ltx/en_us_dedes/he.h.m1:heHE.EpainonOTheoptis.incipit	…
ltx/en_us_dedes/he.h.m1:heHE.EpainonOTheoptis.melody	@ltx/en_us_dedes/miscellanea:misc.Heirmos
ltx/en_us_dedes/he.h.m1:heHE.EpainonOTheoptis.mode	@ltx/en_us_dedes/miscellanea:misc.Mode1
ltx/en_us_dedes/he.h.m1:heHE.EpainonOTheoptis.name	
ltx/en_us_dedes/he.h.m1:heHE.EpainonOTheoptis.notmetered	N/M ()
ltx/en_us_dedes/he.h.m1:heHE.EpainonOTheoptis.ode	@ltx/en_us_dedes/miscellanea:misc.Ode1
ltx/en_us_dedes/he.h.m1:heHE.EpainonOTheoptis.text	
ltx/en_us_dedes/he.h.m1:heHE.EpiStavrouSeDynate.greekname	Ἐπὶ Σταυροῦ σε Δυνατέ.
ltx/en_us_dedes/he.h.m1:heHE.EpiStavrouSeDynate.incipit	O mighty Lord…
ltx/en_us_dedes/he.h.m1:heHE.EpiStavrouSeDynate.melody	@ltx/en_us_dedes/miscellanea:misc.Heirmos
ltx/en_us_dedes/he.h.m1:heHE.EpiStavrouSeDynate.mode	@ltx/en_us_dedes/miscellanea:misc.Mode1
ltx/en_us_dedes/he.h.m1:heHE.EpiStavrouSeDynate.name	O mighty Lord.
ltx/en_us_dedes/he.h.m1:heHE.EpiStavrouSeDynate.notmetered	N/M (O mighty Lord.)
ltx/en_us_dedes/he.h.m1:heHE.EpiStavrouSeDynate.ode	@ltx/en_us_dedes/miscellanea:misc.Ode4
ltx/en_us_dedes/he.h.m1:heHE.EpiStavrouSeDynate.text	O mighty Lord, when the sun beheld You hanging on the Cross, * that great luminary shuddered, * retracted and hid its rays; and all creation fearfully * sang a hymn extolling Your forbearance. * Indeed the earth has been filled with Your praise, O God.
ltx/en_us_dedes/he.h.m1:heHE.EpiTisTheiasFylakis.greekname	Ἐπὶ τῆς θείας φυλακῆς.
ltx/en_us_dedes/he.h.m1:heHE.EpiTisTheiasFylakis.incipit	Now let Habakkuk…
ltx/en_us_dedes/he.h.m1:heHE.EpiTisTheiasFylakis.melody	@ltx/en_us_dedes/miscellanea:misc.Heirmos
ltx/en_us_dedes/he.h.m1:heHE.EpiTisTheiasFylakis.mode	@ltx/en_us_dedes/miscellanea:misc.Mode1
ltx/en_us_dedes/he.h.m1:heHE.EpiTisTheiasFylakis.name	Now let Habakkuk.
ltx/en_us_dedes/he.h.m1:heHE.EpiTisTheiasFylakis.notmetered	N/M (Now let Habakkuk.)
ltx/en_us_dedes/he.h.m1:heHE.EpiTisTheiasFylakis.ode	@ltx/en_us_dedes/miscellanea:misc.Ode4
ltx/en_us_dedes/he.h.m1:heHE.EpiTisTheiasFylakis.text	Now let Habakkuk as a God-inspired prophet stand with us, * keeping his divine watch, and show us * the angelic messenger, who, shining, utters glowingly, * “Today, for the world is salvation,* because arisen is Christ, being omnipotent.”
ltx/en_us_dedes/he.h.m1:heHE.EpirthiOIlios.greekname	Ἐπήρθη ὁ ἥλιος.
ltx/en_us_dedes/he.h.m1:heHE.EpirthiOIlios.incipit	…
ltx/en_us_dedes/he.h.m1:heHE.EpirthiOIlios.melody	@ltx/en_us_dedes/miscellanea:misc.Heirmos
ltx/en_us_dedes/he.h.m1:heHE.EpirthiOIlios.mode	@ltx/en_us_dedes/miscellanea:misc.Mode1
ltx/en_us_dedes/he.h.m1:heHE.EpirthiOIlios.name	
ltx/en_us_dedes/he.h.m1:heHE.EpirthiOIlios.notmetered	N/M ()
ltx/en_us_dedes/he.h.m1:heHE.EpirthiOIlios.ode	@ltx/en_us_dedes/miscellanea:misc.Ode4
ltx/en_us_dedes/he.h.m1:heHE.EpirthiOIlios.text	
ltx/en_us_dedes/he.h.m1:heHE.EpoiiseKratos.greekname	Ἐποίησε κράτος.
ltx/en_us_dedes/he.h.m1:heHE.EpoiiseKratos.incipit	…
ltx/en_us_dedes/he.h.m1:heHE.EpoiiseKratos.melody	@ltx/en_us_dedes/miscellanea:misc.Heirmos
ltx/en_us_dedes/he.h.m1:heHE.EpoiiseKratos.mode	@ltx/en_us_dedes/miscellanea:misc.Mode1
ltx/en_us_dedes/he.h.m1:heHE.EpoiiseKratos.name	
ltx/en_us_dedes/he.h.m1:heHE.EpoiiseKratos.notmetered	N/M ()
ltx/en_us_dedes/he.h.m1:heHE.EpoiiseKratos.ode	@ltx/en_us_dedes/miscellanea:misc.Ode9
ltx/en_us_dedes/he.h.m1:heHE.EpoiiseKratos.text	
ltx/en_us_dedes/he.h.m1:heHE.EsoseLaon.greekname	Ἔσωσε λαόν.
ltx/en_us_dedes/he.h.m1:heHE.EsoseLaon.incipit	Working signs of old…
ltx/en_us_dedes/he.h.m1:heHE.EsoseLaon.melody	@ltx/en_us_dedes/miscellanea:misc.Heirmos
ltx/en_us_dedes/he.h.m1:heHE.EsoseLaon.mode	@ltx/en_us_dedes/miscellanea:misc.Mode1
ltx/en_us_dedes/he.h.m1:heHE.EsoseLaon.name	Working signs of old.
ltx/en_us_dedes/he.h.m1:heHE.EsoseLaon.notmetered	N/M (Working signs of old.)
ltx/en_us_dedes/he.h.m1:heHE.EsoseLaon.ode	@ltx/en_us_dedes/miscellanea:misc.Ode1
ltx/en_us_dedes/he.h.m1:heHE.EsoseLaon.text	Working signs of old, the Master saved the people * In the wilderness, by turning the sea into dry land. * Today, being willingly born of a Virgin, * He lays a path to heaven for us, who therefore * Praise Him, equal in essence to the Father and to humanity.
ltx/en_us_dedes/he.h.m1:heHE.EsoseLaon1.text	Working signs of old, the Master saved the people
ltx/en_us_dedes/he.h.m1:heHE.EsoseLaon1a.text	W
ltx/en_us_dedes/he.h.m1:heHE.EsoseLaon1b.text	orking signs of old, the Master saved the people
ltx/en_us_dedes/he.h.m1:heHE.EsoseLaon2.text	In the wilderness, by turning the sea into dry land.
ltx/en_us_dedes/he.h.m1:heHE.EsoseLaon2a.text	I
ltx/en_us_dedes/he.h.m1:heHE.EsoseLaon2b.text	n the wilderness, by turning the sea into dry land.
ltx/en_us_dedes/he.h.m1:heHE.EsoseLaon3.text	Today, being willingly born of a Virgin,
ltx/en_us_dedes/he.h.m1:heHE.EsoseLaon3a.text	T
ltx/en_us_dedes/he.h.m1:heHE.EsoseLaon3b.text	oday, being willingly born of a Virgin,
ltx/en_us_dedes/he.h.m1:heHE.EsoseLaon4.text	He lays a path to heaven for us, who therefore
ltx/en_us_dedes/he.h.m1:heHE.EsoseLaon4a.text	H
ltx/en_us_dedes/he.h.m1:heHE.EsoseLaon4b.text	e lays a path to heaven for us, who therefore
ltx/en_us_dedes/he.h.m1:heHE.EsoseLaon5.text	Praise Him, equal in essence to the Father and to humanity.
ltx/en_us_dedes/he.h.m1:heHE.EsoseLaon5a.text	P
ltx/en_us_dedes/he.h.m1:heHE.EsoseLaon5b.text	raise Him, equal in essence to the Father and to humanity.
ltx/en_us_dedes/he.h.m1:heHE.FlogaDrosizousanOsious.greekname	Φλόγα δροσίζουσαν Ὁσίους.
ltx/en_us_dedes/he.h.m1:heHE.FlogaDrosizousanOsious.incipit	Unto the Servants…
ltx/en_us_dedes/he.h.m1:heHE.FlogaDrosizousanOsious.melody	@ltx/en_us_dedes/miscellanea:misc.Heirmos
ltx/en_us_dedes/he.h.m1:heHE.FlogaDrosizousanOsious.mode	@ltx/en_us_dedes/miscellanea:misc.Mode1
ltx/en_us_dedes/he.h.m1:heHE.FlogaDrosizousanOsious.name	Unto the Servants.
ltx/en_us_dedes/he.h.m1:heHE.FlogaDrosizousanOsious.notmetered	N/M (Unto the Servants.)
ltx/en_us_dedes/he.h.m1:heHE.FlogaDrosizousanOsious.ode	@ltx/en_us_dedes/miscellanea:misc.Ode8
ltx/en_us_dedes/he.h.m1:heHE.FlogaDrosizousanOsious.text	Unto the Servants in the furnace, * God’s almighty Angel showed a flame * burning the impious, but the saints * cooling as with dew. * Into a life-welling fountain He has made the Theotokos, * gushing destruction upon death, but life to those who sing the hymn: * We who have been redeemed chant in praise of the only Creator, * exalting Him supremely unto all the ages.
ltx/en_us_dedes/he.h.m1:heHE.FlogoseosOPaidas.greekname	Φλογώσεως ὁ Παῖδας.
ltx/en_us_dedes/he.h.m1:heHE.FlogoseosOPaidas.incipit	The same One…
ltx/en_us_dedes/he.h.m1:heHE.FlogoseosOPaidas.melody	@ltx/en_us_dedes/miscellanea:misc.Heirmos
ltx/en_us_dedes/he.h.m1:heHE.FlogoseosOPaidas.mode	@ltx/en_us_dedes/miscellanea:misc.Mode1
ltx/en_us_dedes/he.h.m1:heHE.FlogoseosOPaidas.name	The same One.
ltx/en_us_dedes/he.h.m1:heHE.FlogoseosOPaidas.notmetered	N/M (The same One.)
ltx/en_us_dedes/he.h.m1:heHE.FlogoseosOPaidas.ode	@ltx/en_us_dedes/miscellanea:misc.Ode7
ltx/en_us_dedes/he.h.m1:heHE.FlogoseosOPaidas.text	The same One who saved those Servants from the furnace fire * has become incarnate now. * He has come to earth. * He was nailed upon the Cross. * He has granted salvation to us. * He alone is the God of our fathers, blessed and exceedingly glorious.
ltx/en_us_dedes/he.h.m1:heHE.FotizouFotizou.greekname	Φωτίζου, φωτίζου.
ltx/en_us_dedes/he.h.m1:heHE.FotizouFotizou.incipit	Arise, shine…
ltx/en_us_dedes/he.h.m1:heHE.FotizouFotizou.melody	@ltx/en_us_dedes/miscellanea:misc.Heirmos
ltx/en_us_dedes/he.h.m1:heHE.FotizouFotizou.mode	@ltx/en_us_dedes/miscellanea:misc.Mode1
ltx/en_us_dedes/he.h.m1:heHE.FotizouFotizou.name	Arise, shine.
ltx/en_us_dedes/he.h.m1:heHE.FotizouFotizou.notmetered	N/M (Arise, shine.)
ltx/en_us_dedes/he.h.m1:heHE.FotizouFotizou.ode	@ltx/en_us_dedes/miscellanea:misc.Ode9
ltx/en_us_dedes/he.h.m1:heHE.FotizouFotizou.text	Arise, shine! Arise, shine, O new Jerusalem! Shine! * For the glory of the Lord has risen upon you. * Zion, exult and be glad now. * O pure Mother of God, rejoice, celebrating * the resurrection of Christ your Son!
ltx/en_us_dedes/he.h.m1:heHE.GenousVroteiou.greekname	Γένους βροτείου.
ltx/en_us_dedes/he.h.m1:heHE.GenousVroteiou.incipit	Of old, Habakkuk’s ode…
ltx/en_us_dedes/he.h.m1:heHE.GenousVroteiou.melody	@ltx/en_us_dedes/miscellanea:misc.Heirmos
ltx/en_us_dedes/he.h.m1:heHE.GenousVroteiou.mode	@ltx/en_us_dedes/miscellanea:misc.Mode1
ltx/en_us_dedes/he.h.m1:heHE.GenousVroteiou.name	Of old, Habakkuk’s ode.
ltx/en_us_dedes/he.h.m1:heHE.GenousVroteiou.notmetered	N/M (Of old, Habakkuk’s ode.)
ltx/en_us_dedes/he.h.m1:heHE.GenousVroteiou.ode	@ltx/en_us_dedes/miscellanea:misc.Ode4
ltx/en_us_dedes/he.h.m1:heHE.GenousVroteiou.text	Of old, Habakkuk’s ode predicted the human * Race’s remaking, for as a Prophet he was granted * Numinous portents: God the Logos as a newborn * Infant emerging from an overshadowed mountain, * Namely the Virgin, to refashion humanity.
ltx/en_us_dedes/he.h.m1:heHE.GenousVroteiou1.text	Of old, Habakkuk’s ode predicted the human
ltx/en_us_dedes/he.h.m1:heHE.GenousVroteiou1a.text	O
ltx/en_us_dedes/he.h.m1:heHE.GenousVroteiou1b.text	f old, Habakkuk’s ode predicted the human
ltx/en_us_dedes/he.h.m1:heHE.GenousVroteiou2.text	Race’s remaking, for as a Prophet he was granted
ltx/en_us_dedes/he.h.m1:heHE.GenousVroteiou2a.text	R
ltx/en_us_dedes/he.h.m1:heHE.GenousVroteiou2b.text	ace’s remaking, for as a Prophet he was granted
ltx/en_us_dedes/he.h.m1:heHE.GenousVroteiou3.text	Numinous portents: God the Logos as a newborn
ltx/en_us_dedes/he.h.m1:heHE.GenousVroteiou3a.text	N
ltx/en_us_dedes/he.h.m1:heHE.GenousVroteiou3b.text	uminous portents: God the Logos as a newborn
ltx/en_us_dedes/he.h.m1:heHE.GenousVroteiou4.text	Infant emerging from an overshadowed mountain,
ltx/en_us_dedes/he.h.m1:heHE.GenousVroteiou4a.text	I
ltx/en_us_dedes/he.h.m1:heHE.GenousVroteiou4b.text	Infant emerging from an overshadowed mountain,
ltx/en_us_dedes/he.h.m1:heHE.GenousVroteiou5.text	Namely the Virgin, to refashion humanity.
ltx/en_us_dedes/he.h.m1:heHE.GenousVroteiou5a.text	N
ltx/en_us_dedes/he.h.m1:heHE.GenousVroteiou5b.text	amely the Virgin, to refashion humanity.
ltx/en_us_dedes/he.h.m1:heHE.IDimiourgiki.greekname	Ἡ δημιουργική.
ltx/en_us_dedes/he.h.m1:heHE.IDimiourgiki.incipit	O Wisdom of our God…
ltx/en_us_dedes/he.h.m1:heHE.IDimiourgiki.melody	@ltx/en_us_dedes/miscellanea:misc.Heirmos
ltx/en_us_dedes/he.h.m1:heHE.IDimiourgiki.mode	@ltx/en_us_dedes/miscellanea:misc.Mode1
ltx/en_us_dedes/he.h.m1:heHE.IDimiourgiki.name	O Wisdom of our God.
ltx/en_us_dedes/he.h.m1:heHE.IDimiourgiki.notmetered	N/M (O Wisdom of our God.)
ltx/en_us_dedes/he.h.m1:heHE.IDimiourgiki.ode	@ltx/en_us_dedes/miscellanea:misc.Ode3
ltx/en_us_dedes/he.h.m1:heHE.IDimiourgiki.text	O Wisdom of our God and His Power that has created * and is sustaining the universe, * reinforce Your Church, O Christ, * preserving her unshaken and unmoved. * For You alone are holy, * O Lord, and You repose in Your holy ones.
ltx/en_us_dedes/he.h.m1:heHE.IKaminosSotirEdrosizeto.greekname	Ἡ κάμινος Σωτὴρ ἐδροσίζετο.
ltx/en_us_dedes/he.h.m1:heHE.IKaminosSotirEdrosizeto.incipit	O Savior, as the furnace…
ltx/en_us_dedes/he.h.m1:heHE.IKaminosSotirEdrosizeto.melody	@ltx/en_us_dedes/miscellanea:misc.Heirmos
ltx/en_us_dedes/he.h.m1:heHE.IKaminosSotirEdrosizeto.mode	@ltx/en_us_dedes/miscellanea:misc.Mode1
ltx/en_us_dedes/he.h.m1:heHE.IKaminosSotirEdrosizeto.name	O Savior, as the furnace.
ltx/en_us_dedes/he.h.m1:heHE.IKaminosSotirEdrosizeto.notmetered	N/M (O Savior, as the furnace.)
ltx/en_us_dedes/he.h.m1:heHE.IKaminosSotirEdrosizeto.ode	@ltx/en_us_dedes/miscellanea:misc.Ode7
ltx/en_us_dedes/he.h.m1:heHE.IKaminosSotirEdrosizeto.text	O Savior, as the furnace was cooled with due, * the Servants who were in it sang praise to You, “O Lord and God of our fathers, blessed are You!”
ltx/en_us_dedes/he.h.m1:heHE.ITonProSyllipseos.greekname	Ἡ τὸν πρὸ συλλήψεως.
ltx/en_us_dedes/he.h.m1:heHE.ITonProSyllipseos.incipit	…
ltx/en_us_dedes/he.h.m1:heHE.ITonProSyllipseos.melody	@ltx/en_us_dedes/miscellanea:misc.Heirmos
ltx/en_us_dedes/he.h.m1:heHE.ITonProSyllipseos.mode	@ltx/en_us_dedes/miscellanea:misc.Mode1
ltx/en_us_dedes/he.h.m1:heHE.ITonProSyllipseos.name	
ltx/en_us_dedes/he.h.m1:heHE.ITonProSyllipseos.notmetered	N/M ()
ltx/en_us_dedes/he.h.m1:heHE.ITonProSyllipseos.ode	@ltx/en_us_dedes/miscellanea:misc.Ode3
ltx/en_us_dedes/he.h.m1:heHE.ITonProSyllipseos.text	
ltx/en_us_dedes/he.h.m1:heHE.IdeteIdete.greekname	Ἴδετε, ἴδετε.
ltx/en_us_dedes/he.h.m1:heHE.IdeteIdete.incipit	…
ltx/en_us_dedes/he.h.m1:heHE.IdeteIdete.melody	@ltx/en_us_dedes/miscellanea:misc.Heirmos
ltx/en_us_dedes/he.h.m1:heHE.IdeteIdete.mode	@ltx/en_us_dedes/miscellanea:misc.Mode1
ltx/en_us_dedes/he.h.m1:heHE.IdeteIdete.name	
ltx/en_us_dedes/he.h.m1:heHE.IdeteIdete.notmetered	N/M ()
ltx/en_us_dedes/he.h.m1:heHE.IdeteIdete.ode	@ltx/en_us_dedes/miscellanea:misc.Ode2
ltx/en_us_dedes/he.h.m1:heHE.IdeteIdete.text	
ltx/en_us_dedes/he.h.m1:heHE.ItamoThymo.greekname	Ἰταμῷ θυμῷ.
ltx/en_us_dedes/he.h.m1:heHE.ItamoThymo.incipit	Counterposed…
ltx/en_us_dedes/he.h.m1:heHE.ItamoThymo.melody	@ltx/en_us_dedes/miscellanea:misc.Heirmos
ltx/en_us_dedes/he.h.m1:heHE.ItamoThymo.mode	@ltx/en_us_dedes/miscellanea:misc.Mode1
ltx/en_us_dedes/he.h.m1:heHE.ItamoThymo.name	Counterposed.
ltx/en_us_dedes/he.h.m1:heHE.ItamoThymo.notmetered	N/M (Counterposed.)
ltx/en_us_dedes/he.h.m1:heHE.ItamoThymo.ode	@ltx/en_us_dedes/miscellanea:misc.Ode7
ltx/en_us_dedes/he.h.m1:heHE.ItamoThymo.text	Counterposed against audacious ire * and the furnace’s fire, the love for God * made the fire cool as dew, * while the ire it derided, * counteracting in the midst * of flames the musical organs with the three-toned, rational, * God-inspired lyre, * the three holy Servants chanting: Lord our God, * You are glorified, O God * of our fathers, You are blessed.
ltx/en_us_dedes/he.h.m1:heHE.KatavgasonImon.greekname	Καταύγασον ἡμῶν.
ltx/en_us_dedes/he.h.m1:heHE.KatavgasonImon.incipit	…
ltx/en_us_dedes/he.h.m1:heHE.KatavgasonImon.melody	@ltx/en_us_dedes/miscellanea:misc.Heirmos
ltx/en_us_dedes/he.h.m1:heHE.KatavgasonImon.mode	@ltx/en_us_dedes/miscellanea:misc.Mode1
ltx/en_us_dedes/he.h.m1:heHE.KatavgasonImon.name	
ltx/en_us_dedes/he.h.m1:heHE.KatavgasonImon.notmetered	N/M ()
ltx/en_us_dedes/he.h.m1:heHE.KatavgasonImon.ode	@ltx/en_us_dedes/miscellanea:misc.Ode5
ltx/en_us_dedes/he.h.m1:heHE.KatavgasonImon.text	
ltx/en_us_dedes/he.h.m1:heHE.KatenoisaPantodyname.greekname	Κατενόησα Παντοδύναμε.
ltx/en_us_dedes/he.h.m1:heHE.KatenoisaPantodyname.incipit	O almighty One…
ltx/en_us_dedes/he.h.m1:heHE.KatenoisaPantodyname.melody	@ltx/en_us_dedes/miscellanea:misc.Heirmos
ltx/en_us_dedes/he.h.m1:heHE.KatenoisaPantodyname.mode	@ltx/en_us_dedes/miscellanea:misc.Mode1
ltx/en_us_dedes/he.h.m1:heHE.KatenoisaPantodyname.name	O almighty One.
ltx/en_us_dedes/he.h.m1:heHE.KatenoisaPantodyname.notmetered	N/M (O almighty One.)
ltx/en_us_dedes/he.h.m1:heHE.KatenoisaPantodyname.ode	@ltx/en_us_dedes/miscellanea:misc.Ode4
ltx/en_us_dedes/he.h.m1:heHE.KatenoisaPantodyname.text	O almighty One, I understood Your plan for our salvation, * O Savior, and I glorified You with fear.
ltx/en_us_dedes/he.h.m1:heHE.KatilthesEnToisKatotatois.greekname	Κατῆλθες ἐν τοῖς κατωτάτοις.
ltx/en_us_dedes/he.h.m1:heHE.KatilthesEnToisKatotatois.incipit	You went down…
ltx/en_us_dedes/he.h.m1:heHE.KatilthesEnToisKatotatois.melody	@ltx/en_us_dedes/miscellanea:misc.Heirmos
ltx/en_us_dedes/he.h.m1:heHE.KatilthesEnToisKatotatois.mode	@ltx/en_us_dedes/miscellanea:misc.Mode1
ltx/en_us_dedes/he.h.m1:heHE.KatilthesEnToisKatotatois.name	You went down.
ltx/en_us_dedes/he.h.m1:heHE.KatilthesEnToisKatotatois.notmetered	N/M (You went down.)
ltx/en_us_dedes/he.h.m1:heHE.KatilthesEnToisKatotatois.ode	@ltx/en_us_dedes/miscellanea:misc.Ode6
ltx/en_us_dedes/he.h.m1:heHE.KatilthesEnToisKatotatois.text	You went down to the nether regions of earth, * and You broke apart the bars that forever * were closed on those who were held there, O Christ. * From the sepulcher, * as did Jonah from the whale, * You arose on the third day.
ltx/en_us_dedes/he.h.m1:heHE.LithonOnApedokimasan.greekname	Λίθον ὃν ἀπεδοκίμασαν.
ltx/en_us_dedes/he.h.m1:heHE.LithonOnApedokimasan.incipit	As the Psalmist said…
ltx/en_us_dedes/he.h.m1:heHE.LithonOnApedokimasan.melody	@ltx/en_us_dedes/miscellanea:misc.Heirmos
ltx/en_us_dedes/he.h.m1:heHE.LithonOnApedokimasan.mode	@ltx/en_us_dedes/miscellanea:misc.Mode1
ltx/en_us_dedes/he.h.m1:heHE.LithonOnApedokimasan.name	As the Psalmist said.
ltx/en_us_dedes/he.h.m1:heHE.LithonOnApedokimasan.notmetered	N/M (As the Psalmist said.)
ltx/en_us_dedes/he.h.m1:heHE.LithonOnApedokimasan.ode	@ltx/en_us_dedes/miscellanea:misc.Ode3
ltx/en_us_dedes/he.h.m1:heHE.LithonOnApedokimasan.text	As the Psalmist said, the stone that the builders had rejected * has itself become now the head of the corner. * And furthermore the same is the rock on which Christ our God * firmly established His own Church, * which from the Gentiles He redeemed for himself.
ltx/en_us_dedes/he.h.m1:heHE.MegaToMystirion.greekname	Μέγα τὸ μυστήριον.
ltx/en_us_dedes/he.h.m1:heHE.MegaToMystirion.incipit	God-inspired Habakkuk…
ltx/en_us_dedes/he.h.m1:heHE.MegaToMystirion.melody	@ltx/en_us_dedes/miscellanea:misc.Heirmos
ltx/en_us_dedes/he.h.m1:heHE.MegaToMystirion.mode	@ltx/en_us_dedes/miscellanea:misc.Mode1
ltx/en_us_dedes/he.h.m1:heHE.MegaToMystirion.name	God-inspired Habakkuk
ltx/en_us_dedes/he.h.m1:heHE.MegaToMystirion.notmetered	N/M (God-inspired Habakkuk.)
ltx/en_us_dedes/he.h.m1:heHE.MegaToMystirion.ode	@ltx/en_us_dedes/miscellanea:misc.Ode4
ltx/en_us_dedes/he.h.m1:heHE.MegaToMystirion.text	God-inspired Habakkuk of old foresaw a great mystery, * namely Your plan for our salvation, and he cried out to You, O Christ, * “You went forth for the salvation of Your people, O benevolent Lord.”
ltx/en_us_dedes/he.h.m1:heHE.MitranAflektos.greekname	Μήτραν ἀφλέκτως.
ltx/en_us_dedes/he.h.m1:heHE.MitranAflektos.incipit	As the Young Men of old…
ltx/en_us_dedes/he.h.m1:heHE.MitranAflektos.melody	@ltx/en_us_dedes/miscellanea:misc.Heirmos
ltx/en_us_dedes/he.h.m1:heHE.MitranAflektos.mode	@ltx/en_us_dedes/miscellanea:misc.Mode1
ltx/en_us_dedes/he.h.m1:heHE.MitranAflektos.name	As the Young Men of old.
ltx/en_us_dedes/he.h.m1:heHE.MitranAflektos.notmetered	N/M (As the Young Men of old.)
ltx/en_us_dedes/he.h.m1:heHE.MitranAflektos.ode	@ltx/en_us_dedes/miscellanea:misc.Ode8
ltx/en_us_dedes/he.h.m1:heHE.MitranAflektos.text	As the Young Men of old were not consumed in the furnace, * Virgin Mary’s womb was being prefigured; for it remained * Ever sealed throughout supernatural childbearing. * Manifestly grace, with the same miraculous power, * Effected both alike, rousing all people to sing praise.
ltx/en_us_dedes/he.h.m1:heHE.MitranAflektos1.text	As the Young Men of old were not consumed in the furnace,
ltx/en_us_dedes/he.h.m1:heHE.MitranAflektos1a.text	A
ltx/en_us_dedes/he.h.m1:heHE.MitranAflektos1b.text	s the Young Men of old were not consumed in the furnace,
ltx/en_us_dedes/he.h.m1:heHE.MitranAflektos2.text	Virgin Mary’s womb was being prefigured; for it remained
ltx/en_us_dedes/he.h.m1:heHE.MitranAflektos2a.text	V
ltx/en_us_dedes/he.h.m1:heHE.MitranAflektos2b.text	irgin Mary’s womb was being prefigured; for it remained
ltx/en_us_dedes/he.h.m1:heHE.MitranAflektos3.text	Ever sealed throughout supernatural childbearing.
ltx/en_us_dedes/he.h.m1:heHE.MitranAflektos3a.text	E
ltx/en_us_dedes/he.h.m1:heHE.MitranAflektos3b.text	ver sealed throughout supernatural childbearing.
ltx/en_us_dedes/he.h.m1:heHE.MitranAflektos4.text	Manifestly grace, with the same miraculous power,
ltx/en_us_dedes/he.h.m1:heHE.MitranAflektos4a.text	M
ltx/en_us_dedes/he.h.m1:heHE.MitranAflektos4b.text	anifestly grace, with the same miraculous power,
ltx/en_us_dedes/he.h.m1:heHE.MitranAflektos5.text	Effected both alike, rousing all people to sing praise.
ltx/en_us_dedes/he.h.m1:heHE.MitranAflektos5a.text	E
ltx/en_us_dedes/he.h.m1:heHE.MitranAflektos5b.text	ffected both alike, rousing all people to sing praise.
ltx/en_us_dedes/he.h.m1:heHE.MystirionXenon.greekname	Μυστήριον ξένον.
ltx/en_us_dedes/he.h.m1:heHE.MystirionXenon.incipit	I see here…
ltx/en_us_dedes/he.h.m1:heHE.MystirionXenon.melody	@ltx/en_us_dedes/miscellanea:misc.Heirmos
ltx/en_us_dedes/he.h.m1:heHE.MystirionXenon.mode	@ltx/en_us_dedes/miscellanea:misc.Mode1
ltx/en_us_dedes/he.h.m1:heHE.MystirionXenon.name	I see here.
ltx/en_us_dedes/he.h.m1:heHE.MystirionXenon.notmetered	N/M (I see here.)
ltx/en_us_dedes/he.h.m1:heHE.MystirionXenon.ode	@ltx/en_us_dedes/miscellanea:misc.Ode9
ltx/en_us_dedes/he.h.m1:heHE.MystirionXenon.text	I see here a strange and paradoxical mystery. * For, behold, the grotto is heaven; * cherubic throne is the Virgin; * the manger a grand space * in which Christ our God the uncontainable reclined as a babe; * Whom in extolling do we magnify.
ltx/en_us_dedes/he.h.m1:heHE.NaionIonas.greekname	Ναίων Ἰωνᾶς.
ltx/en_us_dedes/he.h.m1:heHE.NaionIonas.incipit	Gripped in the gorges…
ltx/en_us_dedes/he.h.m1:heHE.NaionIonas.melody	@ltx/en_us_dedes/miscellanea:misc.Heirmos
ltx/en_us_dedes/he.h.m1:heHE.NaionIonas.mode	@ltx/en_us_dedes/miscellanea:misc.Mode1
ltx/en_us_dedes/he.h.m1:heHE.NaionIonas.name	Gripped in the gorges.
ltx/en_us_dedes/he.h.m1:heHE.NaionIonas.notmetered	N/M (Gripped in the gorges.)
ltx/en_us_dedes/he.h.m1:heHE.NaionIonas.ode	@ltx/en_us_dedes/miscellanea:misc.Ode6
ltx/en_us_dedes/he.h.m1:heHE.NaionIonas.text	Gripped in the gorges of the sea, Jonah was praying * To rise above the peril round about and come to You. * However, I who am wounded by the dart of the devil, * Entreat You, O Christ the Destroyer of evil: * Without delaying come to me, before my negligence prevails.
ltx/en_us_dedes/he.h.m1:heHE.NaionIonas1.text	Gripped in the gorges of the sea, Jonah was praying
ltx/en_us_dedes/he.h.m1:heHE.NaionIonas1a.text	G
ltx/en_us_dedes/he.h.m1:heHE.NaionIonas1b.text	ripped and in the gorges of the sea, Jonah was praying
ltx/en_us_dedes/he.h.m1:heHE.NaionIonas2.text	To rise above the peril round about and come to You.
ltx/en_us_dedes/he.h.m1:heHE.NaionIonas2a.text	T
ltx/en_us_dedes/he.h.m1:heHE.NaionIonas2b.text	o rise above the peril round about and come to You.
ltx/en_us_dedes/he.h.m1:heHE.NaionIonas3.text	However, I who am wounded by the dart of the devil,
ltx/en_us_dedes/he.h.m1:heHE.NaionIonas3a.text	H
ltx/en_us_dedes/he.h.m1:heHE.NaionIonas3b.text	owever, I who have been shot by the dart of the devil,
ltx/en_us_dedes/he.h.m1:heHE.NaionIonas4.text	Entreat You, O Christ the Destroyer of evil:
ltx/en_us_dedes/he.h.m1:heHE.NaionIonas4a.text	E
ltx/en_us_dedes/he.h.m1:heHE.NaionIonas4b.text	ntreat You, O Christ the Destroyer of evil:
ltx/en_us_dedes/he.h.m1:heHE.NaionIonas5.text	Without delaying come to me, before my negligence prevails.
ltx/en_us_dedes/he.h.m1:heHE.NaionIonas5a.text	W
ltx/en_us_dedes/he.h.m1:heHE.NaionIonas5b.text	ithout delaying come to me, before my negligence prevails.
ltx/en_us_dedes/he.h.m1:heHE.NefsonProsYmnous.greekname	Νεῦσον πρὸς ὕμνους.
ltx/en_us_dedes/he.h.m1:heHE.NefsonProsYmnous.incipit	Incline Your ear…
ltx/en_us_dedes/he.h.m1:heHE.NefsonProsYmnous.melody	@ltx/en_us_dedes/miscellanea:misc.Heirmos
ltx/en_us_dedes/he.h.m1:heHE.NefsonProsYmnous.mode	@ltx/en_us_dedes/miscellanea:misc.Mode1
ltx/en_us_dedes/he.h.m1:heHE.NefsonProsYmnous.name	Incline Your ear.
ltx/en_us_dedes/he.h.m1:heHE.NefsonProsYmnous.notmetered	N/M (Incline Your ear.)
ltx/en_us_dedes/he.h.m1:heHE.NefsonProsYmnous.ode	@ltx/en_us_dedes/miscellanea:misc.Ode3
ltx/en_us_dedes/he.h.m1:heHE.NefsonProsYmnous.text	Incline Your ear to the hymns of us Your servants. * Subdue the arrogant contempt of the foe. * Exalt us who sing to You, all-seeing Benefactor, * To be unshaken and confirmed on the foundation of the Faith, * High above sin, and strengthened, O blessed Lord.
ltx/en_us_dedes/he.h.m1:heHE.NefsonProsYmnous1.text	Incline Your ear to the hymns of us Your servants.
ltx/en_us_dedes/he.h.m1:heHE.NefsonProsYmnous1a.text	I
ltx/en_us_dedes/he.h.m1:heHE.NefsonProsYmnous1b.text	ncline Your ear to the hymns of us Your servants.
ltx/en_us_dedes/he.h.m1:heHE.NefsonProsYmnous2.text	Subdue the arrogant contempt of the foe.
ltx/en_us_dedes/he.h.m1:heHE.NefsonProsYmnous2a.text	S
ltx/en_us_dedes/he.h.m1:heHE.NefsonProsYmnous2b.text	ubdue the arrogant contempt of the foe.
ltx/en_us_dedes/he.h.m1:heHE.NefsonProsYmnous3.text	Exalt us who sing to You, all-seeing Benefactor,
ltx/en_us_dedes/he.h.m1:heHE.NefsonProsYmnous3a.text	E
ltx/en_us_dedes/he.h.m1:heHE.NefsonProsYmnous3b.text	xalt us who sing to You, all-seeing Benefactor,
ltx/en_us_dedes/he.h.m1:heHE.NefsonProsYmnous4.text	To be unshaken and confirmed on the foundation of the Faith,
ltx/en_us_dedes/he.h.m1:heHE.NefsonProsYmnous4a.text	T
ltx/en_us_dedes/he.h.m1:heHE.NefsonProsYmnous4b.text	o be unshaken and confirmed on the foundation of the Faith,
ltx/en_us_dedes/he.h.m1:heHE.NefsonProsYmnous5.text	High above sin, and strengthened, O blessed Lord.
ltx/en_us_dedes/he.h.m1:heHE.NefsonProsYmnous5a.text	H
ltx/en_us_dedes/he.h.m1:heHE.NefsonProsYmnous5b.text	igh above sin, and strengthened, O blessed Lord.
ltx/en_us_dedes/he.h.m1:heHE.NenikintaiTisFyseos.greekname	Νενίκηνται τῆς φύσεως.
ltx/en_us_dedes/he.h.m1:heHE.NenikintaiTisFyseos.incipit	In you the laws of nature…
ltx/en_us_dedes/he.h.m1:heHE.NenikintaiTisFyseos.melody	@ltx/en_us_dedes/miscellanea:misc.Heirmos
ltx/en_us_dedes/he.h.m1:heHE.NenikintaiTisFyseos.mode	@ltx/en_us_dedes/miscellanea:misc.Mode1
ltx/en_us_dedes/he.h.m1:heHE.NenikintaiTisFyseos.name	In you the laws.
ltx/en_us_dedes/he.h.m1:heHE.NenikintaiTisFyseos.notmetered	N/M (In you the laws.)
ltx/en_us_dedes/he.h.m1:heHE.NenikintaiTisFyseos.ode	@ltx/en_us_dedes/miscellanea:misc.Ode9
ltx/en_us_dedes/he.h.m1:heHE.NenikintaiTisFyseos.text	In you the laws of nature are defeated,* O undefiled Virgin pure. * In virginity childbirth was accomplished, and death introduces life. * You, after bearing, are virgin, and after dying are living. * Mother of God, * ever save your inheritance.
ltx/en_us_dedes/he.h.m1:heHE.NyxPeriescheMeSotir.greekname	Νὺξ περιέσχε με Σωτήρ.
ltx/en_us_dedes/he.h.m1:heHE.NyxPeriescheMeSotir.incipit	N/M…
ltx/en_us_dedes/he.h.m1:heHE.NyxPeriescheMeSotir.melody	@ltx/en_us_dedes/miscellanea:misc.HeirmosNotMetered
ltx/en_us_dedes/he.h.m1:heHE.NyxPeriescheMeSotir.mode	@ltx/en_us_dedes/miscellanea:misc.Mode1
ltx/en_us_dedes/he.h.m1:heHE.NyxPeriescheMeSotir.name	N/M ()
ltx/en_us_dedes/he.h.m1:heHE.NyxPeriescheMeSotir.notmetered	N/M ()
ltx/en_us_dedes/he.h.m1:heHE.NyxPeriescheMeSotir.ode	@ltx/en_us_dedes/miscellanea:misc.Ode5
ltx/en_us_dedes/he.h.m1:heHE.NyxPeriescheMeSotir.text	O Savior, night and the fog of sin have surrounded me. Therefore I pray You, let the morning of repentance rise on me, O compassionate Lord, before I reach the indefinite end of my life, O Christ, the Life and the Light.
ltx/en_us_dedes/he.h.m1:heHE.ODiaStylouPyros.greekname	Ὁ διὰ στύλου πυρός.
ltx/en_us_dedes/he.h.m1:heHE.ODiaStylouPyros.incipit	…
ltx/en_us_dedes/he.h.m1:heHE.ODiaStylouPyros.melody	@ltx/en_us_dedes/miscellanea:misc.Heirmos
ltx/en_us_dedes/he.h.m1:heHE.ODiaStylouPyros.mode	@ltx/en_us_dedes/miscellanea:misc.Mode1
ltx/en_us_dedes/he.h.m1:heHE.ODiaStylouPyros.name	
ltx/en_us_dedes/he.h.m1:heHE.ODiaStylouPyros.notmetered	N/M ()
ltx/en_us_dedes/he.h.m1:heHE.ODiaStylouPyros.ode	@ltx/en_us_dedes/miscellanea:misc.Ode1
ltx/en_us_dedes/he.h.m1:heHE.ODiaStylouPyros.text	
ltx/en_us_dedes/he.h.m1:heHE.ODiapontion.greekname	Ὁ διαπόντιον.
ltx/en_us_dedes/he.h.m1:heHE.ODiapontion.incipit	…
ltx/en_us_dedes/he.h.m1:heHE.ODiapontion.melody	@ltx/en_us_dedes/miscellanea:misc.Heirmos
ltx/en_us_dedes/he.h.m1:heHE.ODiapontion.mode	@ltx/en_us_dedes/miscellanea:misc.Mode1
ltx/en_us_dedes/he.h.m1:heHE.ODiapontion.name	
ltx/en_us_dedes/he.h.m1:heHE.ODiapontion.notmetered	N/M ()
ltx/en_us_dedes/he.h.m1:heHE.ODiapontion.ode	@ltx/en_us_dedes/miscellanea:misc.Ode6
ltx/en_us_dedes/he.h.m1:heHE.ODiapontion.text	
ltx/en_us_dedes/he.h.m1:heHE.OEnTiVatoOftheis.greekname	Ὁ ἐν τῇ βάτῳ ὀφθείς.
ltx/en_us_dedes/he.h.m1:heHE.OEnTiVatoOftheis.incipit	When You appeared…
ltx/en_us_dedes/he.h.m1:heHE.OEnTiVatoOftheis.melody	@ltx/en_us_dedes/miscellanea:misc.Heirmos
ltx/en_us_dedes/he.h.m1:heHE.OEnTiVatoOftheis.mode	@ltx/en_us_dedes/miscellanea:misc.Mode1
ltx/en_us_dedes/he.h.m1:heHE.OEnTiVatoOftheis.name	When You appeared.
ltx/en_us_dedes/he.h.m1:heHE.OEnTiVatoOftheis.notmetered	N/M (When You appeared.)
ltx/en_us_dedes/he.h.m1:heHE.OEnTiVatoOftheis.ode	@ltx/en_us_dedes/miscellanea:misc.Ode7
ltx/en_us_dedes/he.h.m1:heHE.OEnTiVatoOftheis.text	When You appeared in the burning bush to the law-giver Moses, * You prefigured there the childbirth of the Ever-Virgin. * Blessed are You, O Lord, the God of our fathers.
ltx/en_us_dedes/he.h.m1:heHE.OFotisasTiEllampsei.greekname	Ὁ φωτίσας τῇ ἐλλάμψει.
ltx/en_us_dedes/he.h.m1:heHE.OFotisasTiEllampsei.incipit	By the brightness of Your coming…
ltx/en_us_dedes/he.h.m1:heHE.OFotisasTiEllampsei.melody	@ltx/en_us_dedes/miscellanea:misc.Heirmos
ltx/en_us_dedes/he.h.m1:heHE.OFotisasTiEllampsei.mode	@ltx/en_us_dedes/miscellanea:misc.Mode1
ltx/en_us_dedes/he.h.m1:heHE.OFotisasTiEllampsei.name	By the brightness of Your coming.
ltx/en_us_dedes/he.h.m1:heHE.OFotisasTiEllampsei.notmetered	N/M (By the brightness of Your coming.)
ltx/en_us_dedes/he.h.m1:heHE.OFotisasTiEllampsei.ode	@ltx/en_us_dedes/miscellanea:misc.Ode5
ltx/en_us_dedes/he.h.m1:heHE.OFotisasTiEllampsei.text	By the brightness of Your coming You enlightened the world, O Christ, * by the power of Your Cross you illumined the ends thereof. * With the light of knowing You as God enlighten now the hearts of * those who extol You with Orthodox faith.
ltx/en_us_dedes/he.h.m1:heHE.OMiterParthene.greekname	Ὦ Μῆτερ Παρθένε.
ltx/en_us_dedes/he.h.m1:heHE.OMiterParthene.incipit	O true Theotokos…
ltx/en_us_dedes/he.h.m1:heHE.OMiterParthene.melody	@ltx/en_us_dedes/miscellanea:misc.Heirmos
ltx/en_us_dedes/he.h.m1:heHE.OMiterParthene.mode	@ltx/en_us_dedes/miscellanea:misc.Mode1
ltx/en_us_dedes/he.h.m1:heHE.OMiterParthene.name	O true Theotokos.
ltx/en_us_dedes/he.h.m1:heHE.OMiterParthene.notmetered	N/M (O true Theotokos.)
ltx/en_us_dedes/he.h.m1:heHE.OMiterParthene.ode	@ltx/en_us_dedes/miscellanea:misc.Ode9
ltx/en_us_dedes/he.h.m1:heHE.OMiterParthene.text	O true Theotokos and virgin Mother, you conceived * without seed, and you gave birth to the Savior, Christ our God, * who in the flesh was lifted on the Cross. * All we, the faithful, worthily now praise you * and magnify you along with Him.
ltx/en_us_dedes/he.h.m1:heHE.OMonosEidos.greekname	Ὁ μόνος εἰδώς.
ltx/en_us_dedes/he.h.m1:heHE.OMonosEidos.incipit	As You are the only One…
ltx/en_us_dedes/he.h.m1:heHE.OMonosEidos.melody	@ltx/en_us_dedes/miscellanea:misc.Heirmos
ltx/en_us_dedes/he.h.m1:heHE.OMonosEidos.mode	@ltx/en_us_dedes/miscellanea:misc.Mode1
ltx/en_us_dedes/he.h.m1:heHE.OMonosEidos.name	As You are the only One.
ltx/en_us_dedes/he.h.m1:heHE.OMonosEidos.notmetered	N/M (As You are the only One.)
ltx/en_us_dedes/he.h.m1:heHE.OMonosEidos.ode	@ltx/en_us_dedes/miscellanea:misc.Ode3
ltx/en_us_dedes/he.h.m1:heHE.OMonosEidos.text	As You are the only One who knows * our mortal nature’s frailty and with compassion assumed the form thereof, * O Savior, gird me with the power from on high, * to cry out that Holy is the animate temple * of Your ineffable glory, benevolent Lord.
ltx/en_us_dedes/he.h.m1:heHE.OPaidasEkKaminou.greekname	Ὁ Παῖδας ἐκ καμίνου.
ltx/en_us_dedes/he.h.m1:heHE.OPaidasEkKaminou.incipit	The same One…
ltx/en_us_dedes/he.h.m1:heHE.OPaidasEkKaminou.melody	@ltx/en_us_dedes/miscellanea:misc.Heirmos
ltx/en_us_dedes/he.h.m1:heHE.OPaidasEkKaminou.mode	@ltx/en_us_dedes/miscellanea:misc.Mode1
ltx/en_us_dedes/he.h.m1:heHE.OPaidasEkKaminou.name	The same One.
ltx/en_us_dedes/he.h.m1:heHE.OPaidasEkKaminou.notmetered	N/M (The same One.)
ltx/en_us_dedes/he.h.m1:heHE.OPaidasEkKaminou.ode	@ltx/en_us_dedes/miscellanea:misc.Ode7
ltx/en_us_dedes/he.h.m1:heHE.OPaidasEkKaminou.text	The same One who delivered the Lads from fire, becoming a mortal man, * suffers in the flesh; and by His Passion He arrays * mortal nature with majesty, free of all * corruption, the only God of the fathers, * blessed and supremely glorious.
ltx/en_us_dedes/he.h.m1:heHE.OTheiotatosProetypose.greekname	Ὁ θειότατος προετύπωσε.
ltx/en_us_dedes/he.h.m1:heHE.OTheiotatosProetypose.incipit	That most godly prophet…
ltx/en_us_dedes/he.h.m1:heHE.OTheiotatosProetypose.melody	@ltx/en_us_dedes/miscellanea:misc.Heirmos
ltx/en_us_dedes/he.h.m1:heHE.OTheiotatosProetypose.mode	@ltx/en_us_dedes/miscellanea:misc.Mode1
ltx/en_us_dedes/he.h.m1:heHE.OTheiotatosProetypose.name	That most godly prophet.
ltx/en_us_dedes/he.h.m1:heHE.OTheiotatosProetypose.notmetered	N/M (That most godly prophet.)
ltx/en_us_dedes/he.h.m1:heHE.OTheiotatosProetypose.ode	@ltx/en_us_dedes/miscellanea:misc.Ode1
ltx/en_us_dedes/he.h.m1:heHE.OTheiotatosProetypose.text	That most godly prophet Moses prefigured Your Cross * in the Red Sea of old, O Savior. * For he divided the water with the rod in his hand, * and led Israel across, * and sang You a sacred ode of exodus, O Christ our God.
ltx/en_us_dedes/he.h.m1:heHE.OTonAnoVython.greekname	Ὁ τὸν ἄνω βυθόν.
ltx/en_us_dedes/he.h.m1:heHE.OTonAnoVython.incipit	O all-blessed Father…
ltx/en_us_dedes/he.h.m1:heHE.OTonAnoVython.melody	@ltx/en_us_dedes/miscellanea:misc.HeirmosNotMetered
ltx/en_us_dedes/he.h.m1:heHE.OTonAnoVython.mode	@ltx/en_us_dedes/miscellanea:misc.Mode1
ltx/en_us_dedes/he.h.m1:heHE.OTonAnoVython.name	N/M (O all-blessed Father.)
ltx/en_us_dedes/he.h.m1:heHE.OTonAnoVython.notmetered	N/M (O all-blessed Father.)
ltx/en_us_dedes/he.h.m1:heHE.OTonAnoVython.ode	@ltx/en_us_dedes/miscellanea:misc.Ode9
ltx/en_us_dedes/he.h.m1:heHE.OTonAnoVython.text	O all-blessed Father, you reverently swam up into the ocean of divine incomprehensibility on high, and you supported your mind on the divine Trinity, as on an incomprehensible rock. Therefore we magnify you.
ltx/en_us_dedes/he.h.m1:heHE.OdinEpinikion.greekname	ᾨδὴν ἐπινίκιον.
ltx/en_us_dedes/he.h.m1:heHE.OdinEpinikion.incipit	An anthem of victory…
ltx/en_us_dedes/he.h.m1:heHE.OdinEpinikion.melody	@ltx/en_us_dedes/miscellanea:misc.Heirmos
ltx/en_us_dedes/he.h.m1:heHE.OdinEpinikion.mode	@ltx/en_us_dedes/miscellanea:misc.Mode1
ltx/en_us_dedes/he.h.m1:heHE.OdinEpinikion.name	An anthem of victory.
ltx/en_us_dedes/he.h.m1:heHE.OdinEpinikion.notmetered	N/M (An anthem of victory.)
ltx/en_us_dedes/he.h.m1:heHE.OdinEpinikion.ode	@ltx/en_us_dedes/miscellanea:misc.Ode1
ltx/en_us_dedes/he.h.m1:heHE.OdinEpinikion.text	An anthem of victory let us all sing now * to God as the One who wrought * wondrous and portentous signs * by His exalted arm, * and who saved Israel of old. For He is glorified.
ltx/en_us_dedes/he.h.m1:heHE.OiMiTiTrofiChranthentes.greekname	Οἱ μὴ τῇ τροφῇ χρανθέντες.
ltx/en_us_dedes/he.h.m1:heHE.OiMiTiTrofiChranthentes.incipit	…
ltx/en_us_dedes/he.h.m1:heHE.OiMiTiTrofiChranthentes.melody	@ltx/en_us_dedes/miscellanea:misc.Heirmos
ltx/en_us_dedes/he.h.m1:heHE.OiMiTiTrofiChranthentes.mode	@ltx/en_us_dedes/miscellanea:misc.Mode1
ltx/en_us_dedes/he.h.m1:heHE.OiMiTiTrofiChranthentes.name	
ltx/en_us_dedes/he.h.m1:heHE.OiMiTiTrofiChranthentes.notmetered	N/M ()
ltx/en_us_dedes/he.h.m1:heHE.OiMiTiTrofiChranthentes.ode	@ltx/en_us_dedes/miscellanea:misc.Ode8
ltx/en_us_dedes/he.h.m1:heHE.OiMiTiTrofiChranthentes.text	
ltx/en_us_dedes/he.h.m1:heHE.OiOuranoiTonOuranon.greekname	Οἱ οὐρανοὶ τῶν οὐρανῶν.
ltx/en_us_dedes/he.h.m1:heHE.OiOuranoiTonOuranon.incipit	…
ltx/en_us_dedes/he.h.m1:heHE.OiOuranoiTonOuranon.melody	@ltx/en_us_dedes/miscellanea:misc.Heirmos
ltx/en_us_dedes/he.h.m1:heHE.OiOuranoiTonOuranon.mode	@ltx/en_us_dedes/miscellanea:misc.Mode1
ltx/en_us_dedes/he.h.m1:heHE.OiOuranoiTonOuranon.name	
ltx/en_us_dedes/he.h.m1:heHE.OiOuranoiTonOuranon.notmetered	N/M ()
ltx/en_us_dedes/he.h.m1:heHE.OiOuranoiTonOuranon.ode	@ltx/en_us_dedes/miscellanea:misc.Ode8
ltx/en_us_dedes/he.h.m1:heHE.OiOuranoiTonOuranon.text	
ltx/en_us_dedes/he.h.m1:heHE.OiPaidesEfseveia.greekname	Οἱ Παῖδες εὐσεβείᾳ.
ltx/en_us_dedes/he.h.m1:heHE.OiPaidesEfseveia.incipit	The Servants nurtured…
ltx/en_us_dedes/he.h.m1:heHE.OiPaidesEfseveia.melody	@ltx/en_us_dedes/miscellanea:misc.Heirmos
ltx/en_us_dedes/he.h.m1:heHE.OiPaidesEfseveia.mode	@ltx/en_us_dedes/miscellanea:misc.Mode1
ltx/en_us_dedes/he.h.m1:heHE.OiPaidesEfseveia.name	Brought up together.
ltx/en_us_dedes/he.h.m1:heHE.OiPaidesEfseveia.notmetered	N/M (Brought up together.)
ltx/en_us_dedes/he.h.m1:heHE.OiPaidesEfseveia.ode	@ltx/en_us_dedes/miscellanea:misc.Ode7
ltx/en_us_dedes/he.h.m1:heHE.OiPaidesEfseveia.text	The Servants nurtured piously together, * with contempt regarding the impious king’s decree, * intrepidly faced the threat of holocaust, * and while standing in the midst of flames they chanted thus, * saying: O God of the fathers, You are blessed.
ltx/en_us_dedes/he.h.m1:heHE.OnFrittousinAngeloi.greekname	Ὃν φρίττουσιν Ἄγγελοι.
ltx/en_us_dedes/he.h.m1:heHE.OnFrittousinAngeloi.incipit	To Him, the Creator…
ltx/en_us_dedes/he.h.m1:heHE.OnFrittousinAngeloi.melody	@ltx/en_us_dedes/miscellanea:misc.Heirmos
ltx/en_us_dedes/he.h.m1:heHE.OnFrittousinAngeloi.mode	@ltx/en_us_dedes/miscellanea:misc.Mode1
ltx/en_us_dedes/he.h.m1:heHE.OnFrittousinAngeloi.name	To Him, the Creator.
ltx/en_us_dedes/he.h.m1:heHE.OnFrittousinAngeloi.notmetered	N/M (To Him, the Creator.)
ltx/en_us_dedes/he.h.m1:heHE.OnFrittousinAngeloi.ode	@ltx/en_us_dedes/miscellanea:misc.Ode8
ltx/en_us_dedes/he.h.m1:heHE.OnFrittousinAngeloi.text	To Him, the Creator and the Lord, at whom all hosts * and armies of Angels shudder, sing a hymn of praise, * you priests, and you Servants, glorify Him and bless, * and exalt Him beyond measure, unto all the ages.
ltx/en_us_dedes/he.h.m1:heHE.OrosSeTiChariti.greekname	Ὄρος σε τῇ χάριτι.
ltx/en_us_dedes/he.h.m1:heHE.OrosSeTiChariti.incipit	Habakkuk the Prophet once perceived…
ltx/en_us_dedes/he.h.m1:heHE.OrosSeTiChariti.melody	@ltx/en_us_dedes/miscellanea:misc.Heirmos
ltx/en_us_dedes/he.h.m1:heHE.OrosSeTiChariti.mode	@ltx/en_us_dedes/miscellanea:misc.Mode1
ltx/en_us_dedes/he.h.m1:heHE.OrosSeTiChariti.name	Habakkuk the Prophet.
ltx/en_us_dedes/he.h.m1:heHE.OrosSeTiChariti.notmetered	N/M (Habakkuk the Prophet.)
ltx/en_us_dedes/he.h.m1:heHE.OrosSeTiChariti.ode	@ltx/en_us_dedes/miscellanea:misc.Ode4
ltx/en_us_dedes/he.h.m1:heHE.OrosSeTiChariti.text	Habakkuk the Prophet once perceived with foreseeing eyes, * that you would be the mountain overshadowed by the grace of God. * O Virgin, he prophesied that the Holy One of Israel would come from you, * for our salvation and for our refashioning.
ltx/en_us_dedes/he.h.m1:heHE.OrthrisomenOrthrouVatheos.greekname	Ὀρθρίσωμεν ὄρθρου βαθέος.
ltx/en_us_dedes/he.h.m1:heHE.OrthrisomenOrthrouVatheos.incipit	Arising at dawn…
ltx/en_us_dedes/he.h.m1:heHE.OrthrisomenOrthrouVatheos.melody	@ltx/en_us_dedes/miscellanea:misc.Heirmos
ltx/en_us_dedes/he.h.m1:heHE.OrthrisomenOrthrouVatheos.mode	@ltx/en_us_dedes/miscellanea:misc.Mode1
ltx/en_us_dedes/he.h.m1:heHE.OrthrisomenOrthrouVatheos.name	Arising at dawn.
ltx/en_us_dedes/he.h.m1:heHE.OrthrisomenOrthrouVatheos.notmetered	N/M (Arising at dawn.)
ltx/en_us_dedes/he.h.m1:heHE.OrthrisomenOrthrouVatheos.ode	@ltx/en_us_dedes/miscellanea:misc.Ode5
ltx/en_us_dedes/he.h.m1:heHE.OrthrisomenOrthrouVatheos.text	Arising at dawn very early, * instead of ointment, a hymn let us offer unto the Master, * and then we shall clearly see* Christ, the Sun of Righteousness, * causing true life to arise for all.
ltx/en_us_dedes/he.h.m1:heHE.OrthrizontesSeAnymnoumen.greekname	Ὀρθρίζοντές σε ἀνυμνοῦμεν.
ltx/en_us_dedes/he.h.m1:heHE.OrthrizontesSeAnymnoumen.incipit	We rise early…
ltx/en_us_dedes/he.h.m1:heHE.OrthrizontesSeAnymnoumen.melody	@ltx/en_us_dedes/miscellanea:misc.Heirmos
ltx/en_us_dedes/he.h.m1:heHE.OrthrizontesSeAnymnoumen.mode	@ltx/en_us_dedes/miscellanea:misc.Mode1
ltx/en_us_dedes/he.h.m1:heHE.OrthrizontesSeAnymnoumen.name	We rise early.
ltx/en_us_dedes/he.h.m1:heHE.OrthrizontesSeAnymnoumen.notmetered	N/M (We rise early.)
ltx/en_us_dedes/he.h.m1:heHE.OrthrizontesSeAnymnoumen.ode	@ltx/en_us_dedes/miscellanea:misc.Ode5
ltx/en_us_dedes/he.h.m1:heHE.OrthrizontesSeAnymnoumen.text	We rise early and we extol You, * for through Your Cross we found peace that passes all understanding. * Through it You, the Savior of the world, renewed the human race, * leading us to the unsetting light.
ltx/en_us_dedes/he.h.m1:heHE.PepoikilmeniTiTheiaDoxi.greekname	Πεποικιλμένη τῇ θείᾳ δόξῃ.
ltx/en_us_dedes/he.h.m1:heHE.PepoikilmeniTiTheiaDoxi.incipit	Adorned with glory…
ltx/en_us_dedes/he.h.m1:heHE.PepoikilmeniTiTheiaDoxi.melody	@ltx/en_us_dedes/miscellanea:misc.Heirmos
ltx/en_us_dedes/he.h.m1:heHE.PepoikilmeniTiTheiaDoxi.mode	@ltx/en_us_dedes/miscellanea:misc.Mode1
ltx/en_us_dedes/he.h.m1:heHE.PepoikilmeniTiTheiaDoxi.name	Adorned with glory.
ltx/en_us_dedes/he.h.m1:heHE.PepoikilmeniTiTheiaDoxi.notmetered	N/M (Adorned with glory.)
ltx/en_us_dedes/he.h.m1:heHE.PepoikilmeniTiTheiaDoxi.ode	@ltx/en_us_dedes/miscellanea:misc.Ode1
ltx/en_us_dedes/he.h.m1:heHE.PepoikilmeniTiTheiaDoxi.text	Adorned with glory divine, O Virgin, * is your most sacred and illustrious memorial, * gathering the faithful all together joyfully to sing * in processions led by Mariam, with timbrels and dancing, * to your Only-begotten Son. * For He has been greatly glorified.
ltx/en_us_dedes/he.h.m1:heHE.ProsecheOuraneKaiLaliso.greekname	Πρόσεχε, οὐρανὲ καὶ λαλήσω.
ltx/en_us_dedes/he.h.m1:heHE.ProsecheOuraneKaiLaliso.incipit	…
ltx/en_us_dedes/he.h.m1:heHE.ProsecheOuraneKaiLaliso.melody	@ltx/en_us_dedes/miscellanea:misc.Heirmos
ltx/en_us_dedes/he.h.m1:heHE.ProsecheOuraneKaiLaliso.mode	@ltx/en_us_dedes/miscellanea:misc.Mode1
ltx/en_us_dedes/he.h.m1:heHE.ProsecheOuraneKaiLaliso.name	
ltx/en_us_dedes/he.h.m1:heHE.ProsecheOuraneKaiLaliso.notmetered	N/M ()
ltx/en_us_dedes/he.h.m1:heHE.ProsecheOuraneKaiLaliso.ode	@ltx/en_us_dedes/miscellanea:misc.Ode2
ltx/en_us_dedes/he.h.m1:heHE.ProsecheOuraneKaiLaliso.text	
ltx/en_us_dedes/he.h.m1:heHE.RavdosEkTisRizis.greekname	Ῥάβδος ἐκ τῆς ῥίζης.
ltx/en_us_dedes/he.h.m1:heHE.RavdosEkTisRizis.incipit	A rod has come forth…
ltx/en_us_dedes/he.h.m1:heHE.RavdosEkTisRizis.melody	@ltx/en_us_dedes/miscellanea:misc.Heirmos
ltx/en_us_dedes/he.h.m1:heHE.RavdosEkTisRizis.mode	@ltx/en_us_dedes/miscellanea:misc.Mode1
ltx/en_us_dedes/he.h.m1:heHE.RavdosEkTisRizis.name	A rod has come forth.
ltx/en_us_dedes/he.h.m1:heHE.RavdosEkTisRizis.notmetered	N/M (A rod has come forth.)
ltx/en_us_dedes/he.h.m1:heHE.RavdosEkTisRizis.ode	@ltx/en_us_dedes/miscellanea:misc.Ode4
ltx/en_us_dedes/he.h.m1:heHE.RavdosEkTisRizis.text	Jesse’s root produced a branch, O Christ, * and You its flower blossomed forth, * from the Virgin who by Habakkuk prophetically once was called * overshadowed, dense mountain. * From her who knew not man You came incarnate, * the immaterial God. * Glory to Your strength, O Lord.
ltx/en_us_dedes/he.h.m1:heHE.RiseisProfitonKaiAinigmata.greekname	Ῥήσεις Προφητῶν καὶ αἰνίγματα.
ltx/en_us_dedes/he.h.m1:heHE.RiseisProfitonKaiAinigmata.incipit	Sayings of the Prophets…
ltx/en_us_dedes/he.h.m1:heHE.RiseisProfitonKaiAinigmata.melody	@ltx/en_us_dedes/miscellanea:misc.Heirmos
ltx/en_us_dedes/he.h.m1:heHE.RiseisProfitonKaiAinigmata.mode	@ltx/en_us_dedes/miscellanea:misc.Mode1
ltx/en_us_dedes/he.h.m1:heHE.RiseisProfitonKaiAinigmata.name	Sayings of the Prophets.
ltx/en_us_dedes/he.h.m1:heHE.RiseisProfitonKaiAinigmata.notmetered	N/M (Sayings of the Prophets.)
ltx/en_us_dedes/he.h.m1:heHE.RiseisProfitonKaiAinigmata.ode	@ltx/en_us_dedes/miscellanea:misc.Ode4
ltx/en_us_dedes/he.h.m1:heHE.RiseisProfitonKaiAinigmata.text	Sayings of the Prophets and mysteries * revealed Your incarnation from a Virgin mystically, O Christ: * that Your lightning’s brightness as light for Gentiles would emanate. * The abyss calls out to You with a voice of gladness: * To Your strength be glory, benevolent Lord!
ltx/en_us_dedes/he.h.m1:heHE.SeInPerEideMoysis.greekname	Σὲ ἥν περ εἶδε Μωυσῆς.
ltx/en_us_dedes/he.h.m1:heHE.SeInPerEideMoysis.incipit	…
ltx/en_us_dedes/he.h.m1:heHE.SeInPerEideMoysis.melody	@ltx/en_us_dedes/miscellanea:misc.Heirmos
ltx/en_us_dedes/he.h.m1:heHE.SeInPerEideMoysis.mode	@ltx/en_us_dedes/miscellanea:misc.Mode1
ltx/en_us_dedes/he.h.m1:heHE.SeInPerEideMoysis.name	
ltx/en_us_dedes/he.h.m1:heHE.SeInPerEideMoysis.notmetered	N/M ()
ltx/en_us_dedes/he.h.m1:heHE.SeInPerEideMoysis.ode	@ltx/en_us_dedes/miscellanea:misc.Ode9
ltx/en_us_dedes/he.h.m1:heHE.SeInPerEideMoysis.text	
ltx/en_us_dedes/he.h.m1:heHE.SeNoitin.greekname	Σὲ νοητήν.
ltx/en_us_dedes/he.h.m1:heHE.SeNoitin.incipit	We who believe know you…
ltx/en_us_dedes/he.h.m1:heHE.SeNoitin.melody	@ltx/en_us_dedes/miscellanea:misc.Heirmos
ltx/en_us_dedes/he.h.m1:heHE.SeNoitin.mode	@ltx/en_us_dedes/miscellanea:misc.Mode1
ltx/en_us_dedes/he.h.m1:heHE.SeNoitin.name	We who believe know you.
ltx/en_us_dedes/he.h.m1:heHE.SeNoitin.notmetered	N/M (We who believe know you.)
ltx/en_us_dedes/he.h.m1:heHE.SeNoitin.ode	@ltx/en_us_dedes/miscellanea:misc.Ode7
ltx/en_us_dedes/he.h.m1:heHE.SeNoitin.text	We who believe know you as the spiritual * furnace, O Mother of our God. * For your highly exalted Son, who once saved those servants three, * in your womb refashioned me and humanity entirely. * He is the God of our fathers, supremely praised and glorious.
ltx/en_us_dedes/he.h.m1:heHE.SeTinFaeinin.greekname	Σὲ τὴν φαεινήν.
ltx/en_us_dedes/he.h.m1:heHE.SeTinFaeinin.incipit	Mother of our God, we praise you…
ltx/en_us_dedes/he.h.m1:heHE.SeTinFaeinin.melody	@ltx/en_us_dedes/miscellanea:misc.Heirmos
ltx/en_us_dedes/he.h.m1:heHE.SeTinFaeinin.mode	@ltx/en_us_dedes/miscellanea:misc.Mode1
ltx/en_us_dedes/he.h.m1:heHE.SeTinFaeinin.name	Mother of our God, we praise you.
ltx/en_us_dedes/he.h.m1:heHE.SeTinFaeinin.notmetered	N/M (Mother of our God, we praise you.)
ltx/en_us_dedes/he.h.m1:heHE.SeTinFaeinin.ode	@ltx/en_us_dedes/miscellanea:misc.Ode9
ltx/en_us_dedes/he.h.m1:heHE.SeTinFaeinin.text	Mother of our God, we praise you * as the brightly shining lamp, * the illustrious glory * of all creation, of which you are the highest. * With sacred hymns we magnify you.
ltx/en_us_dedes/he.h.m1:heHE.SeTinOratheisan.greekname	Σὲ τὴν ὁραθεῖσαν.
ltx/en_us_dedes/he.h.m1:heHE.SeTinOratheisan.incipit	N/M…
ltx/en_us_dedes/he.h.m1:heHE.SeTinOratheisan.melody	@ltx/en_us_dedes/miscellanea:misc.HeirmosNotMetered
ltx/en_us_dedes/he.h.m1:heHE.SeTinOratheisan.mode	@ltx/en_us_dedes/miscellanea:misc.Mode1
ltx/en_us_dedes/he.h.m1:heHE.SeTinOratheisan.name	N/M ()
ltx/en_us_dedes/he.h.m1:heHE.SeTinOratheisan.notmetered	N/M ()
ltx/en_us_dedes/he.h.m1:heHE.SeTinOratheisan.ode	@ltx/en_us_dedes/miscellanea:misc.Ode9
ltx/en_us_dedes/he.h.m1:heHE.SeTinOratheisan.text	O Virgin Theotokos, you are the gate that the Prophet Ezekiel saw and through which no one went except God alone. We honor you with hymns.
ltx/en_us_dedes/he.h.m1:heHE.SouITropaiouchos.greekname	Σοῦ ἡ τροπαιοῦχος.
ltx/en_us_dedes/he.h.m1:heHE.SouITropaiouchos.incipit	Glorified in strength…
ltx/en_us_dedes/he.h.m1:heHE.SouITropaiouchos.melody	@ltx/en_us_dedes/miscellanea:misc.Heirmos
ltx/en_us_dedes/he.h.m1:heHE.SouITropaiouchos.mode	@ltx/en_us_dedes/miscellanea:misc.Mode1
ltx/en_us_dedes/he.h.m1:heHE.SouITropaiouchos.name	Glorified in strength.
ltx/en_us_dedes/he.h.m1:heHE.SouITropaiouchos.notmetered	N/M (Glorified in strength.)
ltx/en_us_dedes/he.h.m1:heHE.SouITropaiouchos.ode	@ltx/en_us_dedes/miscellanea:misc.Ode1
ltx/en_us_dedes/he.h.m1:heHE.SouITropaiouchos.text	Glorified in strength, as divine, * was Your victorious right hand, immortal Lord; * for, being all-powerful, it dashed and shattered the pursuing enemy, * opening a new way across the sea for the Israelites.
ltx/en_us_dedes/he.h.m1:heHE.SplanchnonIonan.greekname	Σπλάγχνων Ἰωνᾶν.
ltx/en_us_dedes/he.h.m1:heHE.SplanchnonIonan.incipit	Such as it received…
ltx/en_us_dedes/he.h.m1:heHE.SplanchnonIonan.melody	@ltx/en_us_dedes/miscellanea:misc.Heirmos
ltx/en_us_dedes/he.h.m1:heHE.SplanchnonIonan.mode	@ltx/en_us_dedes/miscellanea:misc.Mode1
ltx/en_us_dedes/he.h.m1:heHE.SplanchnonIonan.name	Jonah long ago.
ltx/en_us_dedes/he.h.m1:heHE.SplanchnonIonan.notmetered	N/M (Jonah long ago.)
ltx/en_us_dedes/he.h.m1:heHE.SplanchnonIonan.ode	@ltx/en_us_dedes/miscellanea:misc.Ode6
ltx/en_us_dedes/he.h.m1:heHE.SplanchnonIonan.text	Such as it received * Jonah as an embryo, the sea beast disgorged him from its bowels intact. * With the Virgin, though, when the Logos had dwelt in her taking on flesh, * He came forth from her preserving her yet incorrupt. * For from her no fluxion suffered He, * and He kept her unaltered in childbirth.
ltx/en_us_dedes/he.h.m1:heHE.StereomaMouGenou.greekname	Στερέωμά μου γενοῦ.
ltx/en_us_dedes/he.h.m1:heHE.StereomaMouGenou.incipit	Become my stable support…
ltx/en_us_dedes/he.h.m1:heHE.StereomaMouGenou.melody	@ltx/en_us_dedes/miscellanea:misc.Heirmos
ltx/en_us_dedes/he.h.m1:heHE.StereomaMouGenou.mode	@ltx/en_us_dedes/miscellanea:misc.Mode1
ltx/en_us_dedes/he.h.m1:heHE.StereomaMouGenou.name	Become my stable support.
ltx/en_us_dedes/he.h.m1:heHE.StereomaMouGenou.notmetered	N/M (Become my stable support.)
ltx/en_us_dedes/he.h.m1:heHE.StereomaMouGenou.ode	@ltx/en_us_dedes/miscellanea:misc.Ode3
ltx/en_us_dedes/he.h.m1:heHE.StereomaMouGenou.text	Become my stable support, * O Lord who established the earth of old on the waters, * for no one is holy except for You.
ltx/en_us_dedes/he.h.m1:heHE.StereosonDespotaChriste.greekname	Στερέωσον Δέσποτα Χριστέ.
ltx/en_us_dedes/he.h.m1:heHE.StereosonDespotaChriste.incipit	O Christ, set me firmly…
ltx/en_us_dedes/he.h.m1:heHE.StereosonDespotaChriste.melody	@ltx/en_us_dedes/miscellanea:misc.Heirmos
ltx/en_us_dedes/he.h.m1:heHE.StereosonDespotaChriste.mode	@ltx/en_us_dedes/miscellanea:misc.Mode1
ltx/en_us_dedes/he.h.m1:heHE.StereosonDespotaChriste.name	O Christ, set me firmly.
ltx/en_us_dedes/he.h.m1:heHE.StereosonDespotaChriste.notmetered	N/M (O Christ, set me firmly.)
ltx/en_us_dedes/he.h.m1:heHE.StereosonDespotaChriste.ode	@ltx/en_us_dedes/miscellanea:misc.Ode3
ltx/en_us_dedes/he.h.m1:heHE.StereosonDespotaChriste.text	O Christ, set me firmly on the rock of the Faith, by the power of Your all-holy Cross, * so that my mind will not move when tempted by the enemy’s assaults. * Only You are holy, O Lord.
ltx/en_us_dedes/he.h.m1:heHE.StereosonKyrie.greekname	Στερέωσον Κύριε.
ltx/en_us_dedes/he.h.m1:heHE.StereosonKyrie.incipit	…
ltx/en_us_dedes/he.h.m1:heHE.StereosonKyrie.melody	@ltx/en_us_dedes/miscellanea:misc.Heirmos
ltx/en_us_dedes/he.h.m1:heHE.StereosonKyrie.mode	@ltx/en_us_dedes/miscellanea:misc.Mode1
ltx/en_us_dedes/he.h.m1:heHE.StereosonKyrie.name	
ltx/en_us_dedes/he.h.m1:heHE.StereosonKyrie.notmetered	N/M ()
ltx/en_us_dedes/he.h.m1:heHE.StereosonKyrie.ode	@ltx/en_us_dedes/miscellanea:misc.Ode3
ltx/en_us_dedes/he.h.m1:heHE.StereosonKyrie.text	
ltx/en_us_dedes/he.h.m1:heHE.StereosonMeChriste.greekname	Στερέωσόν με Χριστέ.
ltx/en_us_dedes/he.h.m1:heHE.StereosonMeChriste.incipit	Establish me, O my Christ…
ltx/en_us_dedes/he.h.m1:heHE.StereosonMeChriste.melody	@ltx/en_us_dedes/miscellanea:misc.Heirmos
ltx/en_us_dedes/he.h.m1:heHE.StereosonMeChriste.mode	@ltx/en_us_dedes/miscellanea:misc.Mode1
ltx/en_us_dedes/he.h.m1:heHE.StereosonMeChriste.name	Establish me, O my Christ.
ltx/en_us_dedes/he.h.m1:heHE.StereosonMeChriste.notmetered	N/M (Establish me, O my Christ.)
ltx/en_us_dedes/he.h.m1:heHE.StereosonMeChriste.ode	@ltx/en_us_dedes/miscellanea:misc.Ode3
ltx/en_us_dedes/he.h.m1:heHE.StereosonMeChriste.text	Establish me, O my Christ, * on the unshakable rock of Your commandments, * and with the light of Your face, Lord, illumine me. * No one is holy but You who are benevolent.
ltx/en_us_dedes/he.h.m1:heHE.StereothitoIKardiaMou.greekname	Στερεωθήτω ἡ καρδία μου.
ltx/en_us_dedes/he.h.m1:heHE.StereothitoIKardiaMou.incipit	Firmly established be my heart…
ltx/en_us_dedes/he.h.m1:heHE.StereothitoIKardiaMou.melody	@ltx/en_us_dedes/miscellanea:misc.Heirmos
ltx/en_us_dedes/he.h.m1:heHE.StereothitoIKardiaMou.mode	@ltx/en_us_dedes/miscellanea:misc.Mode1
ltx/en_us_dedes/he.h.m1:heHE.StereothitoIKardiaMou.name	Firmly established be my heart.
ltx/en_us_dedes/he.h.m1:heHE.StereothitoIKardiaMou.notmetered	N/M (Firmly established be.)
ltx/en_us_dedes/he.h.m1:heHE.StereothitoIKardiaMou.ode	@ltx/en_us_dedes/miscellanea:misc.Ode3
ltx/en_us_dedes/he.h.m1:heHE.StereothitoIKardiaMou.text	Firmly established be my heart, O Christ, * in Your holy will, O my Lord and God. * Heaven of heaven was made firm * over waters by You, O Word. * You established on the waters * the earth, O Almighty One.
ltx/en_us_dedes/he.h.m1:heHE.StergeinMenImas.greekname	Στέργειν μὲν ἡμᾶς.
ltx/en_us_dedes/he.h.m1:heHE.StergeinMenImas.incipit	To favor being silent…
ltx/en_us_dedes/he.h.m1:heHE.StergeinMenImas.melody	@ltx/en_us_dedes/miscellanea:misc.Heirmos
ltx/en_us_dedes/he.h.m1:heHE.StergeinMenImas.mode	@ltx/en_us_dedes/miscellanea:misc.Mode1
ltx/en_us_dedes/he.h.m1:heHE.StergeinMenImas.name	To favor being silent.
ltx/en_us_dedes/he.h.m1:heHE.StergeinMenImas.notmetered	N/M (To favor being silent.)
ltx/en_us_dedes/he.h.m1:heHE.StergeinMenImas.ode	@ltx/en_us_dedes/miscellanea:misc.Ode9
ltx/en_us_dedes/he.h.m1:heHE.StergeinMenImas.text	To favor being silent out of caution is for us * Easy and free of risk, whereas to compose * Stirring hymns is arduous, but a labor of love * For you, all-holy Virgin. And so, we entreat you:  * O Mother, empower us to succeed in this endeavor.
ltx/en_us_dedes/he.h.m1:heHE.StergeinMenImas1.text	To favor being silent out of caution is for us
ltx/en_us_dedes/he.h.m1:heHE.StergeinMenImas1a.text	T
ltx/en_us_dedes/he.h.m1:heHE.StergeinMenImas1b.text	o favor being silent out of caution is for us
ltx/en_us_dedes/he.h.m1:heHE.StergeinMenImas2.text	Easy and free of risk, whereas to compose
ltx/en_us_dedes/he.h.m1:heHE.StergeinMenImas2a.text	E
ltx/en_us_dedes/he.h.m1:heHE.StergeinMenImas2b.text	asy and free of risk, whereas to compose
ltx/en_us_dedes/he.h.m1:heHE.StergeinMenImas3.text	Stirring hymns and poetry is arduous indeed;
ltx/en_us_dedes/he.h.m1:heHE.StergeinMenImas3a.text	S
ltx/en_us_dedes/he.h.m1:heHE.StergeinMenImas3b.text	tirring hymns and poetry is arduous indeed;
ltx/en_us_dedes/he.h.m1:heHE.StergeinMenImas4.text	For use in praising you, O Virgin, it is a labor of love.
ltx/en_us_dedes/he.h.m1:heHE.StergeinMenImas4a.text	F
ltx/en_us_dedes/he.h.m1:heHE.StergeinMenImas4b.text	or use in praising you, O Virgin, it is a labor of love.
ltx/en_us_dedes/he.h.m1:heHE.StergeinMenImas5.text	O Mother, empower us to succeed in this endeavor.
ltx/en_us_dedes/he.h.m1:heHE.StergeinMenImas5a.text	O
ltx/en_us_dedes/he.h.m1:heHE.StergeinMenImas5b.text	 Mother, empower us to succeed in this endeavor.
ltx/en_us_dedes/he.h.m1:heHE.SynToIonaVoomen.greekname	Σὺν τῷ Ἰωνᾷ βοῶμεν.
ltx/en_us_dedes/he.h.m1:heHE.SynToIonaVoomen.incipit	…
ltx/en_us_dedes/he.h.m1:heHE.SynToIonaVoomen.melody	@ltx/en_us_dedes/miscellanea:misc.Heirmos
ltx/en_us_dedes/he.h.m1:heHE.SynToIonaVoomen.mode	@ltx/en_us_dedes/miscellanea:misc.Mode1
ltx/en_us_dedes/he.h.m1:heHE.SynToIonaVoomen.name	
ltx/en_us_dedes/he.h.m1:heHE.SynToIonaVoomen.notmetered	N/M ()
ltx/en_us_dedes/he.h.m1:heHE.SynToIonaVoomen.ode	@ltx/en_us_dedes/miscellanea:misc.Ode6
ltx/en_us_dedes/he.h.m1:heHE.SynToIonaVoomen.text	
ltx/en_us_dedes/he.h.m1:heHE.SynToThavmasioStas.greekname	Σὺν τῷ θαυμασίῳ στάς.
ltx/en_us_dedes/he.h.m1:heHE.SynToThavmasioStas.incipit	…
ltx/en_us_dedes/he.h.m1:heHE.SynToThavmasioStas.melody	@ltx/en_us_dedes/miscellanea:misc.Heirmos
ltx/en_us_dedes/he.h.m1:heHE.SynToThavmasioStas.mode	@ltx/en_us_dedes/miscellanea:misc.Mode1
ltx/en_us_dedes/he.h.m1:heHE.SynToThavmasioStas.name	
ltx/en_us_dedes/he.h.m1:heHE.SynToThavmasioStas.notmetered	N/M ()
ltx/en_us_dedes/he.h.m1:heHE.SynToThavmasioStas.ode	@ltx/en_us_dedes/miscellanea:misc.Ode4
ltx/en_us_dedes/he.h.m1:heHE.SynToThavmasioStas.text	
ltx/en_us_dedes/he.h.m1:heHE.ThavmatosYperfyous.greekname	Θαύματος ὑπερφυοῦς.
ltx/en_us_dedes/he.h.m1:heHE.ThavmatosYperfyous.incipit	Babylon’s bedewing furnace…
ltx/en_us_dedes/he.h.m1:heHE.ThavmatosYperfyous.melody	@ltx/en_us_dedes/miscellanea:misc.Heirmos
ltx/en_us_dedes/he.h.m1:heHE.ThavmatosYperfyous.mode	@ltx/en_us_dedes/miscellanea:misc.Mode1
ltx/en_us_dedes/he.h.m1:heHE.ThavmatosYperfyous.name	Babylon’s bedewing furnace.
ltx/en_us_dedes/he.h.m1:heHE.ThavmatosYperfyous.notmetered	N/M (Babylon’s bedewing furnace.)
ltx/en_us_dedes/he.h.m1:heHE.ThavmatosYperfyous.ode	@ltx/en_us_dedes/miscellanea:misc.Ode8
ltx/en_us_dedes/he.h.m1:heHE.ThavmatosYperfyous.text	Babylon’s bedewing furnace bore the image * of an extraordinary wonder. * For it did not burn the youths it accepted, * nor did the fire of Divinity consume the Virgin’s womb wherein it went. * So let us melodiously chant in praise: * Let all creation bless and extol the Lord, * and let it exalt Him supremely to the ages.
ltx/en_us_dedes/he.h.m1:heHE.TheosOnEirinis.greekname	Θεὸς ὢν εἰρήνης.
ltx/en_us_dedes/he.h.m1:heHE.TheosOnEirinis.incipit	God of peace…
ltx/en_us_dedes/he.h.m1:heHE.TheosOnEirinis.melody	@ltx/en_us_dedes/miscellanea:misc.Heirmos
ltx/en_us_dedes/he.h.m1:heHE.TheosOnEirinis.mode	@ltx/en_us_dedes/miscellanea:misc.Mode1
ltx/en_us_dedes/he.h.m1:heHE.TheosOnEirinis.name	O God of peace.
ltx/en_us_dedes/he.h.m1:heHE.TheosOnEirinis.notmetered	N/M (O God of peace.)
ltx/en_us_dedes/he.h.m1:heHE.TheosOnEirinis.ode	@ltx/en_us_dedes/miscellanea:misc.Ode5
ltx/en_us_dedes/he.h.m1:heHE.TheosOnEirinis.text	God of peace and Father of mercies, Your Son * You have sent unto us as Your messenger, * the Angel of great counsel who is granting peace. * Therefore having been guided to the light of godly knowledge, * waking from the night to dawn, we sing Your glory, O benevolent Lord.
ltx/en_us_dedes/he.h.m1:heHE.TinFotoforonNefelin.greekname	Τὴν φωτοφόρον νεφέλην.
ltx/en_us_dedes/he.h.m1:heHE.TinFotoforonNefelin.incipit	The cloud that radiates…
ltx/en_us_dedes/he.h.m1:heHE.TinFotoforonNefelin.melody	@ltx/en_us_dedes/miscellanea:misc.Heirmos
ltx/en_us_dedes/he.h.m1:heHE.TinFotoforonNefelin.mode	@ltx/en_us_dedes/miscellanea:misc.Mode1
ltx/en_us_dedes/he.h.m1:heHE.TinFotoforonNefelin.name	The cloud that radiates.
ltx/en_us_dedes/he.h.m1:heHE.TinFotoforonNefelin.notmetered	N/M (The cloud that radiates.)
ltx/en_us_dedes/he.h.m1:heHE.TinFotoforonNefelin.ode	@ltx/en_us_dedes/miscellanea:misc.Ode9
ltx/en_us_dedes/he.h.m1:heHE.TinFotoforonNefelin.text	The cloud that radiates brightly * and into which, as the rain fell * upon the fleece, the Lord of all * from the heavens descended * and was incarnated for us * becoming a man, though Unoriginate, * the immaculate Mother * of our God do we all magnify in song.
ltx/en_us_dedes/he.h.m1:heHE.TinSinEirinin.greekname	Τὴν σὴν εἰρήνην.
ltx/en_us_dedes/he.h.m1:heHE.TinSinEirinin.incipit	O Son and Word of God…
ltx/en_us_dedes/he.h.m1:heHE.TinSinEirinin.melody	@ltx/en_us_dedes/miscellanea:misc.Heirmos
ltx/en_us_dedes/he.h.m1:heHE.TinSinEirinin.mode	@ltx/en_us_dedes/miscellanea:misc.Mode1
ltx/en_us_dedes/he.h.m1:heHE.TinSinEirinin.name	O Son and Word.
ltx/en_us_dedes/he.h.m1:heHE.TinSinEirinin.notmetered	N/M (O Son and Word.)
ltx/en_us_dedes/he.h.m1:heHE.TinSinEirinin.ode	@ltx/en_us_dedes/miscellanea:misc.Ode5
ltx/en_us_dedes/he.h.m1:heHE.TinSinEirinin.text	O Son and Word of God, we pray You grant us Your peace, * for You render everything to us, O Lord our God. * We know no other God; we name Your name. * For You are the God of the dead and of the living.
ltx/en_us_dedes/he.h.m1:heHE.TinZoodochonPigin.greekname	Τὴν ζωοδόχον πηγήν.
ltx/en_us_dedes/he.h.m1:heHE.TinZoodochonPigin.incipit	A spring, abundantly flowing…
ltx/en_us_dedes/he.h.m1:heHE.TinZoodochonPigin.melody	@ltx/en_us_dedes/miscellanea:misc.Heirmos
ltx/en_us_dedes/he.h.m1:heHE.TinZoodochonPigin.mode	@ltx/en_us_dedes/miscellanea:misc.Mode1
ltx/en_us_dedes/he.h.m1:heHE.TinZoodochonPigin.name	A spring, abundantly flowing.
ltx/en_us_dedes/he.h.m1:heHE.TinZoodochonPigin.notmetered	N/M (A spring, abundantly flowing.)
ltx/en_us_dedes/he.h.m1:heHE.TinZoodochonPigin.ode	@ltx/en_us_dedes/miscellanea:misc.Ode9
ltx/en_us_dedes/he.h.m1:heHE.TinZoodochonPigin.text	A spring, abundantly flowing, that hosted life, * a golden lamp-stand that bore the unwaning Light, * living Temple, and all pure * tabernacle symbolize * the Theotokos, who is said to be wider * than earth and heaven. With hymns let us honor her.
ltx/en_us_dedes/he.h.m1:heHE.ToFaeinonIminExanateilon.greekname	Τὸ φαεινὸν ἡμῖν ἑξανάτειλον.
ltx/en_us_dedes/he.h.m1:heHE.ToFaeinonIminExanateilon.incipit	Let Your radiant…
ltx/en_us_dedes/he.h.m1:heHE.ToFaeinonIminExanateilon.melody	@ltx/en_us_dedes/miscellanea:misc.Heirmos
ltx/en_us_dedes/he.h.m1:heHE.ToFaeinonIminExanateilon.mode	@ltx/en_us_dedes/miscellanea:misc.Mode1
ltx/en_us_dedes/he.h.m1:heHE.ToFaeinonIminExanateilon.name	Let Your radiant.
ltx/en_us_dedes/he.h.m1:heHE.ToFaeinonIminExanateilon.notmetered	N/M (Let Your radiant.)
ltx/en_us_dedes/he.h.m1:heHE.ToFaeinonIminExanateilon.ode	@ltx/en_us_dedes/miscellanea:misc.Ode5
ltx/en_us_dedes/he.h.m1:heHE.ToFaeinonIminExanateilon.text	Let Your radiant and unapproachable * light rise like dawn on us, * who rise early in the morning to observe * the judgments of Your commandment, * O benevolent Lord and Master, Christ our God.
ltx/en_us_dedes/he.h.m1:heHE.ToPantanaktos.greekname	Τῷ παντάνακτος.
ltx/en_us_dedes/he.h.m1:heHE.ToPantanaktos.incipit	In Babylon, the three Servants…
ltx/en_us_dedes/he.h.m1:heHE.ToPantanaktos.melody	@ltx/en_us_dedes/miscellanea:misc.Heirmos
ltx/en_us_dedes/he.h.m1:heHE.ToPantanaktos.mode	@ltx/en_us_dedes/miscellanea:misc.Mode1
ltx/en_us_dedes/he.h.m1:heHE.ToPantanaktos.name	In Babylon, the three Servants.
ltx/en_us_dedes/he.h.m1:heHE.ToPantanaktos.notmetered	N/M (In Babylon, the three Servants.)
ltx/en_us_dedes/he.h.m1:heHE.ToPantanaktos.ode	@ltx/en_us_dedes/miscellanea:misc.Ode7
ltx/en_us_dedes/he.h.m1:heHE.ToPantanaktos.text	In Babylon, the three Servants were captivated, * Not by fear but by longing for the King of all. * And they disdained the angry tyrant’s ungodly * Nonsense. The inferno yielded to them as they sang * Declaring, “O Master, You are blessed unto the ages.”
ltx/en_us_dedes/he.h.m1:heHE.ToPantanaktos1.text	In Babylon, the three Servants were captivated,
ltx/en_us_dedes/he.h.m1:heHE.ToPantanaktos1a.text	I
ltx/en_us_dedes/he.h.m1:heHE.ToPantanaktos1b.text	n Babylon, the three Servants were captivated,
ltx/en_us_dedes/he.h.m1:heHE.ToPantanaktos2.text	Not by fear but by longing for the King of all.
ltx/en_us_dedes/he.h.m1:heHE.ToPantanaktos2a.text	N
ltx/en_us_dedes/he.h.m1:heHE.ToPantanaktos2b.text	ot by fear but by longing for the King of all.
ltx/en_us_dedes/he.h.m1:heHE.ToPantanaktos3.text	And they disdained the angry tyrant’s ungodly
ltx/en_us_dedes/he.h.m1:heHE.ToPantanaktos3a.text	A
ltx/en_us_dedes/he.h.m1:heHE.ToPantanaktos3b.text	nd they disdained the angry tyrant’s ungodly
ltx/en_us_dedes/he.h.m1:heHE.ToPantanaktos4.text	Nonsense. The inferno yielded to them as they sang
ltx/en_us_dedes/he.h.m1:heHE.ToPantanaktos4a.text	N
ltx/en_us_dedes/he.h.m1:heHE.ToPantanaktos4b.text	onsense. The inferno yielded to them as they sang
ltx/en_us_dedes/he.h.m1:heHE.ToPantanaktos5.text	Declaring, “You are blessed unto the ages, O Master.”
ltx/en_us_dedes/he.h.m1:heHE.ToPantanaktos5a.text	D
ltx/en_us_dedes/he.h.m1:heHE.ToPantanaktos5b.text	eclaring, “O Master, You are blessed unto the ages.”
ltx/en_us_dedes/he.h.m1:heHE.ToProTonAionon.greekname	Τῷ πρὸ τῶν αἰώνων.
ltx/en_us_dedes/he.h.m1:heHE.ToProTonAionon.incipit	To the Son…
ltx/en_us_dedes/he.h.m1:heHE.ToProTonAionon.melody	@ltx/en_us_dedes/miscellanea:misc.Heirmos
ltx/en_us_dedes/he.h.m1:heHE.ToProTonAionon.mode	@ltx/en_us_dedes/miscellanea:misc.Mode1
ltx/en_us_dedes/he.h.m1:heHE.ToProTonAionon.name	To the Son.
ltx/en_us_dedes/he.h.m1:heHE.ToProTonAionon.notmetered	N/M (To the Son.)
ltx/en_us_dedes/he.h.m1:heHE.ToProTonAionon.ode	@ltx/en_us_dedes/miscellanea:misc.Ode3
ltx/en_us_dedes/he.h.m1:heHE.ToProTonAionon.text	To the Son, begotten * without flux, of the Father, before the ages, * and who was lately made incarnate * of the Virgin without seed; * to Christ God now let us cry aloud: * You have exalted the horn of our strength. Only You are holy, O Lord.
ltx/en_us_dedes/he.h.m1:heHE.ToTheionKaiArriton.greekname	Τὸ θεῖον καὶ ἄῤῥητον.
ltx/en_us_dedes/he.h.m1:heHE.ToTheionKaiArriton.incipit	O Christ, I shall tell…
ltx/en_us_dedes/he.h.m1:heHE.ToTheionKaiArriton.melody	@ltx/en_us_dedes/miscellanea:misc.Heirmos
ltx/en_us_dedes/he.h.m1:heHE.ToTheionKaiArriton.mode	@ltx/en_us_dedes/miscellanea:misc.Mode1
ltx/en_us_dedes/he.h.m1:heHE.ToTheionKaiArriton.name	O Christ, I shall tell.
ltx/en_us_dedes/he.h.m1:heHE.ToTheionKaiArriton.notmetered	N/M (O Christ, I shall tell.)
ltx/en_us_dedes/he.h.m1:heHE.ToTheionKaiArriton.ode	@ltx/en_us_dedes/miscellanea:misc.Ode5
ltx/en_us_dedes/he.h.m1:heHE.ToTheionKaiArriton.text	O Christ, I shall tell of Your virtues * and of their beauty, divine and ineffable: * As coeternal and hypostatic radiance * you shone from glory eternal; and coming forth * incarnate from the Virgin’s womb, * You have risen as a Sun * on those in darkness and in the shadow of death.
ltx/en_us_dedes/he.h.m1:heHE.ToVoithisantiTheo.greekname	Τῷ βοηθήσαντι Θεῷ.
ltx/en_us_dedes/he.h.m1:heHE.ToVoithisantiTheo.incipit	…
ltx/en_us_dedes/he.h.m1:heHE.ToVoithisantiTheo.melody	@ltx/en_us_dedes/miscellanea:misc.HeirmosNotMetered
ltx/en_us_dedes/he.h.m1:heHE.ToVoithisantiTheo.mode	@ltx/en_us_dedes/miscellanea:misc.Mode1
ltx/en_us_dedes/he.h.m1:heHE.ToVoithisantiTheo.name	N/M ()
ltx/en_us_dedes/he.h.m1:heHE.ToVoithisantiTheo.notmetered	N/M ()
ltx/en_us_dedes/he.h.m1:heHE.ToVoithisantiTheo.ode	@ltx/en_us_dedes/miscellanea:misc.Ode1
ltx/en_us_dedes/he.h.m1:heHE.ToVoithisantiTheo.text	To God who helped Moses in Egypt, and through him drowned Pharaoh with his entire army, let us sing a song of victory, for He is glorified.
ltx/en_us_dedes/he.h.m1:heHE.TonEnFlogiPyros.greekname	Τὸν ἐν φλογὶ πυρός.
ltx/en_us_dedes/he.h.m1:heHE.TonEnFlogiPyros.incipit	Let us extol the Lord…
ltx/en_us_dedes/he.h.m1:heHE.TonEnFlogiPyros.melody	@ltx/en_us_dedes/miscellanea:misc.Heirmos
ltx/en_us_dedes/he.h.m1:heHE.TonEnFlogiPyros.mode	@ltx/en_us_dedes/miscellanea:misc.Mode1
ltx/en_us_dedes/he.h.m1:heHE.TonEnFlogiPyros.name	Let us extol the Lord.
ltx/en_us_dedes/he.h.m1:heHE.TonEnFlogiPyros.notmetered	N/M (Let us extol the Lord.)
ltx/en_us_dedes/he.h.m1:heHE.TonEnFlogiPyros.ode	@ltx/en_us_dedes/miscellanea:misc.Ode8
ltx/en_us_dedes/he.h.m1:heHE.TonEnFlogiPyros.text	Let us extol the Lord, who went down to the Servants * inside the fiery furnace, * in the form of an Angel, and guarded them from the flames; and let us sing to Him * and exalt Him beyond measure, unto all the ages.
ltx/en_us_dedes/he.h.m1:heHE.TonEnSinaTinVaton.greekname	Τὸν ἐν Σινᾷ τὴν βάτον.
ltx/en_us_dedes/he.h.m1:heHE.TonEnSinaTinVaton.incipit	…
ltx/en_us_dedes/he.h.m1:heHE.TonEnSinaTinVaton.melody	@ltx/en_us_dedes/miscellanea:misc.Heirmos
ltx/en_us_dedes/he.h.m1:heHE.TonEnSinaTinVaton.mode	@ltx/en_us_dedes/miscellanea:misc.Mode1
ltx/en_us_dedes/he.h.m1:heHE.TonEnSinaTinVaton.name	
ltx/en_us_dedes/he.h.m1:heHE.TonEnSinaTinVaton.notmetered	N/M ()
ltx/en_us_dedes/he.h.m1:heHE.TonEnSinaTinVaton.ode	@ltx/en_us_dedes/miscellanea:misc.Ode8
ltx/en_us_dedes/he.h.m1:heHE.TonEnSinaTinVaton.text	
ltx/en_us_dedes/he.h.m1:heHE.TonEnSofiaTousOuranous.greekname	Τὸν ἐν σοφίᾳ τοὺς οὐρανούς.
ltx/en_us_dedes/he.h.m1:heHE.TonEnSofiaTousOuranous.incipit	…
ltx/en_us_dedes/he.h.m1:heHE.TonEnSofiaTousOuranous.melody	@ltx/en_us_dedes/miscellanea:misc.Heirmos
ltx/en_us_dedes/he.h.m1:heHE.TonEnSofiaTousOuranous.mode	@ltx/en_us_dedes/miscellanea:misc.Mode1
ltx/en_us_dedes/he.h.m1:heHE.TonEnSofiaTousOuranous.name	
ltx/en_us_dedes/he.h.m1:heHE.TonEnSofiaTousOuranous.notmetered	N/M ()
ltx/en_us_dedes/he.h.m1:heHE.TonEnSofiaTousOuranous.ode	@ltx/en_us_dedes/miscellanea:misc.Ode8
ltx/en_us_dedes/he.h.m1:heHE.TonEnSofiaTousOuranous.text	
ltx/en_us_dedes/he.h.m1:heHE.TonProfitinDiesosas.greekname	Τὸν Προφήτην διέσωσας.
ltx/en_us_dedes/he.h.m1:heHE.TonProfitinDiesosas.incipit	As You rescued the Prophet…
ltx/en_us_dedes/he.h.m1:heHE.TonProfitinDiesosas.melody	@ltx/en_us_dedes/miscellanea:misc.Heirmos
ltx/en_us_dedes/he.h.m1:heHE.TonProfitinDiesosas.mode	@ltx/en_us_dedes/miscellanea:misc.Mode1
ltx/en_us_dedes/he.h.m1:heHE.TonProfitinDiesosas.name	As You rescued the Prophet.
ltx/en_us_dedes/he.h.m1:heHE.TonProfitinDiesosas.notmetered	N/M (As You rescued the Prophet.)
ltx/en_us_dedes/he.h.m1:heHE.TonProfitinDiesosas.ode	@ltx/en_us_dedes/miscellanea:misc.Ode6
ltx/en_us_dedes/he.h.m1:heHE.TonProfitinDiesosas.text	As You rescued the Prophet from the belly of the whale of old, * I pray bring me up from the sea of my sins, O benevolent Lord.
ltx/en_us_dedes/he.h.m1:heHE.TonProfitinIonan.greekname	Τὸν Προφήτην Ἰωνᾶν.
ltx/en_us_dedes/he.h.m1:heHE.TonProfitinIonan.incipit	Imitating the inspired Prophet…
ltx/en_us_dedes/he.h.m1:heHE.TonProfitinIonan.melody	@ltx/en_us_dedes/miscellanea:misc.Heirmos
ltx/en_us_dedes/he.h.m1:heHE.TonProfitinIonan.mode	@ltx/en_us_dedes/miscellanea:misc.Mode1
ltx/en_us_dedes/he.h.m1:heHE.TonProfitinIonan.name	Imitating the inspired Prophet.
ltx/en_us_dedes/he.h.m1:heHE.TonProfitinIonan.notmetered	N/M (Imitating the inspired Prophet.)
ltx/en_us_dedes/he.h.m1:heHE.TonProfitinIonan.ode	@ltx/en_us_dedes/miscellanea:misc.Ode6
ltx/en_us_dedes/he.h.m1:heHE.TonProfitinIonan.text	Imitating the inspired Prophet Jonah in the whale, * I cry out to You, O Lord, * “From destruction free my life * and save me, I pray * to You, O Savior of the world. Glory to You!”
ltx/en_us_dedes/he.h.m1:heHE.TonTousYmnologousEnKamino.greekname	Τὸν τοὺς ὑμνολόγους ἐν καμίνῳ.
ltx/en_us_dedes/he.h.m1:heHE.TonTousYmnologousEnKamino.incipit	In the furnace He preserved…
ltx/en_us_dedes/he.h.m1:heHE.TonTousYmnologousEnKamino.melody	@ltx/en_us_dedes/miscellanea:misc.Heirmos
ltx/en_us_dedes/he.h.m1:heHE.TonTousYmnologousEnKamino.mode	@ltx/en_us_dedes/miscellanea:misc.Mode1
ltx/en_us_dedes/he.h.m1:heHE.TonTousYmnologousEnKamino.name	In the furnace He preserved.
ltx/en_us_dedes/he.h.m1:heHE.TonTousYmnologousEnKamino.notmetered	N/M (In the furnace He preserved.)
ltx/en_us_dedes/he.h.m1:heHE.TonTousYmnologousEnKamino.ode	@ltx/en_us_dedes/miscellanea:misc.Ode8
ltx/en_us_dedes/he.h.m1:heHE.TonTousYmnologousEnKamino.text	In the furnace He preserved those Servants * who sang a hymn to extol Him. * He made the roaring furnace like moist whistling wind blowing through it. * Sing praises to Christ our God, and exalt Him beyond measure unto all the ages.
ltx/en_us_dedes/he.h.m1:heHE.TonTyponTouTheiouStavrou.greekname	Τὸν τύπον τοῦ θείου Σταυροῦ.
ltx/en_us_dedes/he.h.m1:heHE.TonTyponTouTheiouStavrou.incipit	When Jonah was in…
ltx/en_us_dedes/he.h.m1:heHE.TonTyponTouTheiouStavrou.melody	@ltx/en_us_dedes/miscellanea:misc.Heirmos
ltx/en_us_dedes/he.h.m1:heHE.TonTyponTouTheiouStavrou.mode	@ltx/en_us_dedes/miscellanea:misc.Mode1
ltx/en_us_dedes/he.h.m1:heHE.TonTyponTouTheiouStavrou.name	When Jonah was in.
ltx/en_us_dedes/he.h.m1:heHE.TonTyponTouTheiouStavrou.notmetered	N/M (When Jonah was in.)
ltx/en_us_dedes/he.h.m1:heHE.TonTyponTouTheiouStavrou.ode	@ltx/en_us_dedes/miscellanea:misc.Ode6
ltx/en_us_dedes/he.h.m1:heHE.TonTyponTouTheiouStavrou.text	When Jonah was in the belly of the whale, * he extended his arms and thus foreshadowed the figure of Your holy Cross, O Lord. * Then he bounded forth * from the monster, being saved by Your power, O Logos.
ltx/en_us_dedes/he.h.m1:heHE.TousEnKaminoPaidas.greekname	Τοὺς ἐν καμίνῳ Παῖδας.
ltx/en_us_dedes/he.h.m1:heHE.TousEnKaminoPaidas.incipit	O Lord and Savior…
ltx/en_us_dedes/he.h.m1:heHE.TousEnKaminoPaidas.melody	@ltx/en_us_dedes/miscellanea:misc.HeirmosNotMetered
ltx/en_us_dedes/he.h.m1:heHE.TousEnKaminoPaidas.mode	@ltx/en_us_dedes/miscellanea:misc.Mode1
ltx/en_us_dedes/he.h.m1:heHE.TousEnKaminoPaidas.name	O Lord and Savior.
ltx/en_us_dedes/he.h.m1:heHE.TousEnKaminoPaidas.notmetered	N/M (O Lord and Savior.)
ltx/en_us_dedes/he.h.m1:heHE.TousEnKaminoPaidas.ode	@ltx/en_us_dedes/miscellanea:misc.Ode7
ltx/en_us_dedes/he.h.m1:heHE.TousEnKaminoPaidas.text	O Lord and Savior, fire did not harm, * nor touch at all, * Your Servants in the furnace of old. * Those three young men then shouted in unison, * blessing and extolling God, and sang, * “God of our fathers, unto the ages, blessed are You!”
ltx/en_us_dedes/he.h.m1:heHE.TyponTisAgnis.greekname	Τύπον τῆς ἁγνῆς.
ltx/en_us_dedes/he.h.m1:heHE.TyponTisAgnis.incipit	Burning, yet remaining…
ltx/en_us_dedes/he.h.m1:heHE.TyponTisAgnis.melody	@ltx/en_us_dedes/miscellanea:misc.Heirmos
ltx/en_us_dedes/he.h.m1:heHE.TyponTisAgnis.mode	@ltx/en_us_dedes/miscellanea:misc.Mode1
ltx/en_us_dedes/he.h.m1:heHE.TyponTisAgnis.name	Burning, yet remaining.
ltx/en_us_dedes/he.h.m1:heHE.TyponTisAgnis.notmetered	N/M (Burning, yet.)
ltx/en_us_dedes/he.h.m1:heHE.TyponTisAgnis.ode	@ltx/en_us_dedes/miscellanea:misc.Ode9
ltx/en_us_dedes/he.h.m1:heHE.TyponTisAgnis.text	Burning, yet remaining unconsumed, * the bush revealed a type of your virgin childbirth. * And now we entreat that you extinguish the wild fire * of temptations, for it is engulfing us, * all-holy Theotokos, * and we will magnify you ceaselessly.
ltx/en_us_dedes/he.h.m1:heHE.YmnonSoiProsferomen.greekname	Ὕμνον σοι προσφέρομεν.
ltx/en_us_dedes/he.h.m1:heHE.YmnonSoiProsferomen.incipit	N/M…
ltx/en_us_dedes/he.h.m1:heHE.YmnonSoiProsferomen.melody	@ltx/en_us_dedes/miscellanea:misc.HeirmosNotMetered
ltx/en_us_dedes/he.h.m1:heHE.YmnonSoiProsferomen.mode	@ltx/en_us_dedes/miscellanea:misc.Mode1
ltx/en_us_dedes/he.h.m1:heHE.YmnonSoiProsferomen.name	N/M ()
ltx/en_us_dedes/he.h.m1:heHE.YmnonSoiProsferomen.notmetered	N/M ()
ltx/en_us_dedes/he.h.m1:heHE.YmnonSoiProsferomen.ode	@ltx/en_us_dedes/miscellanea:misc.Ode8
ltx/en_us_dedes/he.h.m1:heHE.YmnonSoiProsferomen.text	We offer You a hymn of the Bodiless hosts, as did the Servants in the furnace. And we extol You and say: Bless the Lord, all you works of the Lord.
ltx/en_us_dedes/he.h.m1:heHE.YpilthonOsNymfona.greekname	Ὑπῆλθον ὡς νυμφῶνα.
ltx/en_us_dedes/he.h.m1:heHE.YpilthonOsNymfona.incipit	…
ltx/en_us_dedes/he.h.m1:heHE.YpilthonOsNymfona.melody	@ltx/en_us_dedes/miscellanea:misc.Heirmos
ltx/en_us_dedes/he.h.m1:heHE.YpilthonOsNymfona.mode	@ltx/en_us_dedes/miscellanea:misc.Mode1
ltx/en_us_dedes/he.h.m1:heHE.YpilthonOsNymfona.name	
ltx/en_us_dedes/he.h.m1:heHE.YpilthonOsNymfona.notmetered	N/M ()
ltx/en_us_dedes/he.h.m1:heHE.YpilthonOsNymfona.ode	@ltx/en_us_dedes/miscellanea:misc.Ode7
ltx/en_us_dedes/he.h.m1:heHE.YpilthonOsNymfona.text	
