ltx/en_us_dedes/eo.e09:eo.Doxasticon.incipit	Now in these last times…
ltx/en_us_dedes/eo.e09:eo.Doxasticon.mode	@ltx/en_us_dedes/miscellanea:misc.Mode5
ltx/en_us_dedes/eo.e09:eo.Doxasticon.text	Now in these last times, at evening on the first day of the week, O Christ, You came and stood among Your friends; and by the miracle of Your entry through the doors that were locked, You verified the miracle of Your resurrection from the dead. You filled the Disciples with joy, and imparted to them the Holy Spirit; and You gave them all authority to forgive sins. Moreover You did not leave Thomas to drown beneath the waves of disbelief. Therefore grant true knowledge also to us, and forgiveness of offenses, O compassionate Lord.
ltx/en_us_dedes/eo.e09:eo.Exaposteilarion.greekmelody	@ltx/en_us_dedes/he.a.m2:heAU.ToisMathitaisSynelthomen.greekname
ltx/en_us_dedes/eo.e09:eo.Exaposteilarion.incipit	The doors where the Apostles were…
ltx/en_us_dedes/eo.e09:eo.Exaposteilarion.melody	@ltx/en_us_dedes/he.a.m2:heAU.ToisMathitaisSynelthomen.name
ltx/en_us_dedes/eo.e09:eo.Exaposteilarion.mode	@ltx/en_us_dedes/miscellanea:misc.Mode2
ltx/en_us_dedes/eo.e09:eo.Exaposteilarion.text	The doors where the Apostles were * being closed shut, O Master, * You entered and You gave them peace, * and when You blew upon them * You gave them the Holy Spirit, * and enjoined them concerning * binding of sins and loosing them. * And coming eight days later, You showed Your side * and Your hands as tangible proof to Thomas. * With him we also cry aloud: * You are our Lord and our God.
ltx/en_us_dedes/eo.e09:eo.Theotokion.incipit	When you beheld your Son…
ltx/en_us_dedes/eo.e09:eo.Theotokion.melody	@ltx/en_us_dedes/he.a.m2:heAU.ToisMathitaisSynelthomen.name
ltx/en_us_dedes/eo.e09:eo.Theotokion.mode	@ltx/en_us_dedes/miscellanea:misc.Mode2
ltx/en_us_dedes/eo.e09:eo.Theotokion.text	When you beheld your Son and God * from the tomb resurrected * on the third day, O Bride of God, * all-holy Virgin Mary, * you set aside all the anguish * you suffered as a mother * when you had seen Him suffering, * and you with His Disciples were filled with joy * and together worshipped Him and extolled Him. * Hence save us all who now declare * you to be Theotokos.
ltx/en_us_dedes/eo.e09:eo.title	Eothinon 9.
