ltx/en_us_dedes/me.m01.d07:meDA.commemoration.first	Synaxis in honor of the holy Forerunner
ltx/en_us_dedes/me.m01.d07:meDA.commemoration.first_name	St. John the Baptist
ltx/en_us_dedes/me.m01.d07:meDA.commemoration.first_short	Synaxis in honor of the holy Forerunner
ltx/en_us_dedes/me.m01.d07:meDA.commemoration.first_title	@ltx/en_us_dedes/titles:ti.Feast
ltx/en_us_dedes/me.m01.d07:meDA.commemoration.full	Synaxis in Honor of the Glorious Prophet, Forerunner and Baptist John
ltx/en_us_dedes/me.m01.d07:meDA.commemoration.second_name	
ltx/en_us_dedes/me.m01.d07:meDA.commemoration.second_title	@ltx/en_us_dedes/titles:ti.Forerunner
ltx/en_us_dedes/me.m01.d07:meDA.date	January 7
ltx/en_us_dedes/me.m01.d07:meDA.dismissal	@ltx/en_us_dedes/dismissals:dis00.epiphany
ltx/en_us_dedes/me.m01.d07:meDA.fordate	for January 7
ltx/en_us_dedes/me.m01.d07:meDA.insert1	
ltx/en_us_dedes/me.m01.d07:meDA.insert2	in whose honor we have congregated today;
ltx/en_us_dedes/me.m01.d07:meDA.note	
ltx/en_us_dedes/me.m01.d07:meDA.pdfcoverdate	January 7,
ltx/en_us_dedes/me.m01.d07:meDA.pdfheaderdate	January 7
ltx/en_us_dedes/me.m01.d07:meHO.commemorations	
ltx/en_us_dedes/me.m01.d07:meHO.note1	@ltx/en_us_dedes/rubrical:ru.HolidayFish
ltx/en_us_dedes/me.m01.d07:meHO.note2	
ltx/en_us_dedes/me.m01.d07:meHO.number	7.
ltx/en_us_dedes/me.m01.d07:meHO.rank	
ltx/en_us_dedes/me.m01.d07:meLE.commemoration1	The Synaxis of the Honorable and Glorious Prophet and Forerunner John the Baptist.
ltx/en_us_dedes/me.m01.d07:meLE.commemoration2	
ltx/en_us_dedes/me.m01.d07:meLI.Kontakion1.incipit	@ltx/en_us_dedes/me.m01.d07:meMA.Kontakion1.incipit
ltx/en_us_dedes/me.m01.d07:meLI.Kontakion1.melody	@ltx/en_us_dedes/me.m01.d07:meMA.Kontakion1.melody
ltx/en_us_dedes/me.m01.d07:meLI.Kontakion1.mode	@ltx/en_us_dedes/me.m01.d07:meMA.Kontakion1.mode
ltx/en_us_dedes/me.m01.d07:meLI.Kontakion1.text	@ltx/en_us_dedes/me.m01.d07:meMA.Kontakion1.text
ltx/en_us_dedes/me.m01.d07:meLI.MM.CommunionHymn.text	@ltx/en_us_dedes/properties:media.key
ltx/en_us_dedes/me.m01.d07:meLI.Megalynarion.text	
ltx/en_us_dedes/me.m01.d07:meLI.TheotokosHymn.incipit	@ltx/en_us_dedes/me.m01.d06:meMA.Ode9C2H.incipit
ltx/en_us_dedes/me.m01.d07:meLI.TheotokosHymn.mode	@ltx/en_us_dedes/me.m01.d06:meMA.Ode9C2H.mode
ltx/en_us_dedes/me.m01.d07:meLI.TheotokosHymn.text	@ltx/en_us_dedes/me.m01.d06:meMA.Ode9C2H.text
ltx/en_us_dedes/me.m01.d07:meLI.TheotokosHymnVerse.incipit	@ltx/en_us_dedes/me.m01.d06:meMA.Ode9C2MTh.incipit
ltx/en_us_dedes/me.m01.d07:meLI.TheotokosHymnVerse.text	@ltx/en_us_dedes/me.m01.d06:meMA.Ode9C2MTh.text
ltx/en_us_dedes/me.m01.d07:meMA.C1.acrostic.notice1	
ltx/en_us_dedes/me.m01.d07:meMA.C1.acrostic.text	
ltx/en_us_dedes/me.m01.d07:meMA.C1.acrostic.title	Canon for the Saint.
ltx/en_us_dedes/me.m01.d07:meMA.C1.poet	@ltx/en_us_dedes/poets:po.Theofanous
ltx/en_us_dedes/me.m01.d07:meMA.C1.title	@ltx/en_us_dedes/titles:ti.CanonForerunner
ltx/en_us_dedes/me.m01.d07:meMA.C1.verse	@ltx/en_us_dedes/prayers:pr.verse_Baptist.text
ltx/en_us_dedes/me.m01.d07:meMA.Exaposteilarion1.greekmelody	@ltx/en_us_dedes/he.a.m2:heAU.GynaikesAkoutisthite.greekname
ltx/en_us_dedes/me.m01.d07:meMA.Exaposteilarion1.incipit	The Master once referred to…
ltx/en_us_dedes/me.m01.d07:meMA.Exaposteilarion1.melody	@ltx/en_us_dedes/he.a.m2:heAU.GynaikesAkoutisthite.name
ltx/en_us_dedes/me.m01.d07:meMA.Exaposteilarion1.mode	@ltx/en_us_dedes/miscellanea:misc.Mode2
ltx/en_us_dedes/me.m01.d07:meMA.Exaposteilarion1.text	The Master once referred to you * as Prophet and superior * to all the Prophets and greater * than all who were born to women; * for all the Prophets and the Law * announced the coming of the Christ, * but you have seen Him in the flesh, * and more than all you were honored * when you, O Saint John, baptized Him.
ltx/en_us_dedes/me.m01.d07:meMA.Exaposteilarion2.greekmelody	@ltx/en_us_dedes/he.a.m3:heAU.EpefaniOSotir.greekname
ltx/en_us_dedes/me.m01.d07:meMA.Exaposteilarion2.incipit	@ltx/en_us_dedes/he.a.m3:heAU.EpefaniOSotir.incipit
ltx/en_us_dedes/me.m01.d07:meMA.Exaposteilarion2.melody	@ltx/en_us_dedes/he.a.m3:heAU.EpefaniOSotir.melody
ltx/en_us_dedes/me.m01.d07:meMA.Exaposteilarion2.mode	@ltx/en_us_dedes/miscellanea:misc.Mode3
ltx/en_us_dedes/me.m01.d07:meMA.Exaposteilarion2.text	@ltx/en_us_dedes/he.a.m3:heAU.EpefaniOSotir.text
ltx/en_us_dedes/me.m01.d07:meMA.Kathisma11.greekmelody	@ltx/en_us_dedes/he.a.m1:heAU.TouLithouSfragisthentos.greekname
ltx/en_us_dedes/me.m01.d07:meMA.Kathisma11.incipit	When Jesus, who was born…
ltx/en_us_dedes/me.m01.d07:meMA.Kathisma11.melody	@ltx/en_us_dedes/he.a.m1:heAU.TouLithouSfragisthentos.name
ltx/en_us_dedes/me.m01.d07:meMA.Kathisma11.mode	@ltx/en_us_dedes/miscellanea:misc.Mode1
ltx/en_us_dedes/me.m01.d07:meMA.Kathisma11.text	When Jesus, who was born of the holy Virgin Mary, * was being baptized by John in the River Jordan, * the Spirit descended on Him, * appearing in the form of a dove. * And therefore the Prophet cried out and said * together with the Angels: * Glory to Your advent, O Christ; * Glory to Your eternal rule! * Glory to Your plan for saving us, only benevolent God!”
ltx/en_us_dedes/me.m01.d07:meMA.Kathisma21.greekmelody	@ltx/en_us_dedes/he.a.m4:heAU.EpefanisSimeron.greekname
ltx/en_us_dedes/me.m01.d07:meMA.Kathisma21.incipit	When he saw You in…
ltx/en_us_dedes/me.m01.d07:meMA.Kathisma21.melody	@ltx/en_us_dedes/he.a.m4:heAU.EpefanisSimeron.name
ltx/en_us_dedes/me.m01.d07:meMA.Kathisma21.mode	@ltx/en_us_dedes/miscellanea:misc.Mode4
ltx/en_us_dedes/me.m01.d07:meMA.Kathisma21.text	When he saw You in the streams * of River Jordan * being baptized willingly, * the great Forerunner cried aloud * to You, O Christ, and with gladness said: * You came and shone forth, O Light unapproachable.
ltx/en_us_dedes/me.m01.d07:meMA.Kontakion1.incipit	…
ltx/en_us_dedes/me.m01.d07:meMA.Kontakion1.melody	
ltx/en_us_dedes/me.m01.d07:meMA.Kontakion1.mode	@ltx/en_us_dedes/miscellanea:misc.Mode6
ltx/en_us_dedes/me.m01.d07:meMA.Kontakion1.text	
ltx/en_us_dedes/me.m01.d07:meMA.Lauds1.incipit	@ltx/en_us_dedes/me.m01.d06:meMA.Lauds1.incipit
ltx/en_us_dedes/me.m01.d07:meMA.Lauds1.melody	
ltx/en_us_dedes/me.m01.d07:meMA.Lauds1.mode	@ltx/en_us_dedes/miscellanea:misc.Mode1
ltx/en_us_dedes/me.m01.d07:meMA.Lauds1.poet	@ltx/en_us_dedes/poets:po.GermanouPatriarchou
ltx/en_us_dedes/me.m01.d07:meMA.Lauds1.text	@ltx/en_us_dedes/me.m01.d06:meMA.Lauds1.text
ltx/en_us_dedes/me.m01.d07:meMA.Lauds2.incipit	@ltx/en_us_dedes/me.m01.d06:meMA.Lauds2.incipit
ltx/en_us_dedes/me.m01.d07:meMA.Lauds2.melody	
ltx/en_us_dedes/me.m01.d07:meMA.Lauds2.mode	@ltx/en_us_dedes/miscellanea:misc.Mode1
ltx/en_us_dedes/me.m01.d07:meMA.Lauds2.text	@ltx/en_us_dedes/me.m01.d06:meMA.Lauds2.text
ltx/en_us_dedes/me.m01.d07:meMA.Lauds3.incipit	@ltx/en_us_dedes/me.m01.d06:meMA.Lauds3.incipit
ltx/en_us_dedes/me.m01.d07:meMA.Lauds3.melody	
ltx/en_us_dedes/me.m01.d07:meMA.Lauds3.mode	@ltx/en_us_dedes/miscellanea:misc.Mode1
ltx/en_us_dedes/me.m01.d07:meMA.Lauds3.text	@ltx/en_us_dedes/me.m01.d06:meMA.Lauds3.text
ltx/en_us_dedes/me.m01.d07:meMA.Lauds4.incipit	@ltx/en_us_dedes/me.m01.d06:meMA.Lauds4.incipit
ltx/en_us_dedes/me.m01.d07:meMA.Lauds4.melody	
ltx/en_us_dedes/me.m01.d07:meMA.Lauds4.mode	@ltx/en_us_dedes/miscellanea:misc.Mode1
ltx/en_us_dedes/me.m01.d07:meMA.Lauds4.text	@ltx/en_us_dedes/me.m01.d06:meMA.Lauds4.text
ltx/en_us_dedes/me.m01.d07:meMA.Lauds5.incipit	@ltx/en_us_dedes/me.m01.d06:meMA.Lauds5.incipit
ltx/en_us_dedes/me.m01.d07:meMA.Lauds5.melody	
ltx/en_us_dedes/me.m01.d07:meMA.Lauds5.mode	@ltx/en_us_dedes/miscellanea:misc.Mode1
ltx/en_us_dedes/me.m01.d07:meMA.Lauds5.poet	@ltx/en_us_dedes/poets:po.AndreouIerosolymitou
ltx/en_us_dedes/me.m01.d07:meMA.Lauds5.text	@ltx/en_us_dedes/me.m01.d06:meMA.Lauds5.text
ltx/en_us_dedes/me.m01.d07:meMA.LaudsBoth.incipit	@ltx/en_us_dedes/me.m01.d06:meMA.LaudsBoth.incipit
ltx/en_us_dedes/me.m01.d07:meMA.LaudsBoth.melody	
ltx/en_us_dedes/me.m01.d07:meMA.LaudsBoth.mode	@ltx/en_us_dedes/miscellanea:misc.Mode2
ltx/en_us_dedes/me.m01.d07:meMA.LaudsBoth.poet	@ltx/en_us_dedes/poets:po.Anatoliou
ltx/en_us_dedes/me.m01.d07:meMA.LaudsBoth.text	@ltx/en_us_dedes/me.m01.d06:meMA.LaudsBoth.text
ltx/en_us_dedes/me.m01.d07:meMA.LaudsGlory.incipit	…
ltx/en_us_dedes/me.m01.d07:meMA.LaudsGlory.melody	
ltx/en_us_dedes/me.m01.d07:meMA.LaudsGlory.mode	@ltx/en_us_dedes/miscellanea:misc.Mode6
ltx/en_us_dedes/me.m01.d07:meMA.LaudsGlory.poet	@ltx/en_us_dedes/poets:po.Vyzantiou
ltx/en_us_dedes/me.m01.d07:meMA.LaudsGlory.text	
ltx/en_us_dedes/me.m01.d07:meMA.Ode1C11.greekmelody	@ltx/en_us_dedes/he.h.m2:heHE.ToTinAvaton.greekname
ltx/en_us_dedes/me.m01.d07:meMA.Ode1C11.incipit	I am immersed in the…
ltx/en_us_dedes/me.m01.d07:meMA.Ode1C11.melody	@ltx/en_us_dedes/he.h.m2:heHE.ToTinAvaton.notmetered
ltx/en_us_dedes/me.m01.d07:meMA.Ode1C11.mode	@ltx/en_us_dedes/miscellanea:misc.Mode2
ltx/en_us_dedes/me.m01.d07:meMA.Ode1C11.ode	@ltx/en_us_dedes/miscellanea:misc.Ode1
ltx/en_us_dedes/me.m01.d07:meMA.Ode1C11.text	I am immersed in the stormy waters of my passions, O Forerunner; come and save me by your intercessions. For you became a holy and most pure vessel of dispassion, since you were dedicated to the Lord from the beginning as an infant.
ltx/en_us_dedes/me.m01.d07:meMA.Ode1C12.incipit	O all-blessed John, the Angel…
ltx/en_us_dedes/me.m01.d07:meMA.Ode1C12.melody	@ltx/en_us_dedes/he.h.m2:heHE.ToTinAvaton.notmetered
ltx/en_us_dedes/me.m01.d07:meMA.Ode1C12.mode	@ltx/en_us_dedes/miscellanea:misc.Mode2
ltx/en_us_dedes/me.m01.d07:meMA.Ode1C12.ode	@ltx/en_us_dedes/miscellanea:misc.Ode1
ltx/en_us_dedes/me.m01.d07:meMA.Ode1C12.text	O all-blessed John, the Angel who stands in the presence of God joyfully announced the birth of you, the peer of angels who would become the Lord’s Forerunner and friend, to Zacharias your venerable father as he served as a priest.
ltx/en_us_dedes/me.m01.d07:meMA.Ode1C13.incipit	O all-venerable Prophet, you were…
ltx/en_us_dedes/me.m01.d07:meMA.Ode1C13.melody	@ltx/en_us_dedes/he.h.m2:heHE.ToTinAvaton.notmetered
ltx/en_us_dedes/me.m01.d07:meMA.Ode1C13.mode	@ltx/en_us_dedes/miscellanea:misc.Mode2
ltx/en_us_dedes/me.m01.d07:meMA.Ode1C13.ode	@ltx/en_us_dedes/miscellanea:misc.Ode1
ltx/en_us_dedes/me.m01.d07:meMA.Ode1C13.text	O all-venerable Prophet, you were filled with the All-holy Spirit while you were being carried in your mother’s womb; and you joyfully made known the Fruit of virginity when you leapt with delight and worshiped Him.
ltx/en_us_dedes/me.m01.d07:meMA.Ode1C14.incipit	Let us extol him who…
ltx/en_us_dedes/me.m01.d07:meMA.Ode1C14.melody	@ltx/en_us_dedes/he.h.m2:heHE.ToTinAvaton.notmetered
ltx/en_us_dedes/me.m01.d07:meMA.Ode1C14.mode	@ltx/en_us_dedes/miscellanea:misc.Mode2
ltx/en_us_dedes/me.m01.d07:meMA.Ode1C14.ode	@ltx/en_us_dedes/miscellanea:misc.Ode1
ltx/en_us_dedes/me.m01.d07:meMA.Ode1C14.text	Let us extol him who cut the path of a strange way of life that was inaccessible to many people, and who baptized Christ in the streams of the Jordan, for he is the Lord’s divine and godly-minded Forerunner.
ltx/en_us_dedes/me.m01.d07:meMA.Ode1C1T.incipit	O pure and all-blameless Virgin…
ltx/en_us_dedes/me.m01.d07:meMA.Ode1C1T.melody	@ltx/en_us_dedes/he.h.m2:heHE.ToTinAvaton.notmetered
ltx/en_us_dedes/me.m01.d07:meMA.Ode1C1T.mode	@ltx/en_us_dedes/miscellanea:misc.Mode2
ltx/en_us_dedes/me.m01.d07:meMA.Ode1C1T.ode	@ltx/en_us_dedes/miscellanea:misc.Ode1
ltx/en_us_dedes/me.m01.d07:meMA.Ode1C1T.text	O pure and all-blameless Virgin, the sacred temple of virginity, who conceived God the Logos in your womb, by your intercessions, save us who run to you and pray to you, and deliver us from attacks and danger.
ltx/en_us_dedes/me.m01.d07:meMA.Ode3C11.greekmelody	@ltx/en_us_dedes/he.h.m2:heHE.EnPetraMeTisPisteos.greekname
ltx/en_us_dedes/me.m01.d07:meMA.Ode3C11.incipit	Forerunner of the Lord, and…
ltx/en_us_dedes/me.m01.d07:meMA.Ode3C11.melody	@ltx/en_us_dedes/he.h.m2:heHE.EnPetraMeTisPisteos.notmetered
ltx/en_us_dedes/me.m01.d07:meMA.Ode3C11.mode	@ltx/en_us_dedes/miscellanea:misc.Mode2
ltx/en_us_dedes/me.m01.d07:meMA.Ode3C11.ode	@ltx/en_us_dedes/miscellanea:misc.Ode3
ltx/en_us_dedes/me.m01.d07:meMA.Ode3C11.text	Forerunner of the Lord, and initiate of grace, O all-acclaimed companion of the Angels, you cancelled the reproach of barrenness, and you recognized the Virgin’s divine Child, and you leapt for joy in your mother’s womb.
ltx/en_us_dedes/me.m01.d07:meMA.Ode3C12.incipit	O Prophet who were preferred…
ltx/en_us_dedes/me.m01.d07:meMA.Ode3C12.melody	@ltx/en_us_dedes/he.h.m2:heHE.EnPetraMeTisPisteos.notmetered
ltx/en_us_dedes/me.m01.d07:meMA.Ode3C12.mode	@ltx/en_us_dedes/miscellanea:misc.Mode2
ltx/en_us_dedes/me.m01.d07:meMA.Ode3C12.ode	@ltx/en_us_dedes/miscellanea:misc.Ode3
ltx/en_us_dedes/me.m01.d07:meMA.Ode3C12.text	O Prophet who were preferred above all, you came before the Lord and prepared His ways; for, you were the lamp shining on all, and in the water you revealed Him to be the effulgence of the Father’s glory, when He appeared in a body.
ltx/en_us_dedes/me.m01.d07:meMA.Ode3C13.incipit	O John, you rose like…
ltx/en_us_dedes/me.m01.d07:meMA.Ode3C13.melody	@ltx/en_us_dedes/he.h.m2:heHE.EnPetraMeTisPisteos.notmetered
ltx/en_us_dedes/me.m01.d07:meMA.Ode3C13.mode	@ltx/en_us_dedes/miscellanea:misc.Mode2
ltx/en_us_dedes/me.m01.d07:meMA.Ode3C13.ode	@ltx/en_us_dedes/miscellanea:misc.Ode3
ltx/en_us_dedes/me.m01.d07:meMA.Ode3C13.text	O John, you rose like the break of day, declaring the Sun of Righteousness to those in darkness; for you became the herald and Forerunner of the salvation of all, and you said to all: Come to Christ with faith and be saved.
ltx/en_us_dedes/me.m01.d07:meMA.Ode3C1T.incipit	O Mother of God, you…
ltx/en_us_dedes/me.m01.d07:meMA.Ode3C1T.melody	@ltx/en_us_dedes/he.h.m2:heHE.EnPetraMeTisPisteos.notmetered
ltx/en_us_dedes/me.m01.d07:meMA.Ode3C1T.mode	@ltx/en_us_dedes/miscellanea:misc.Mode2
ltx/en_us_dedes/me.m01.d07:meMA.Ode3C1T.ode	@ltx/en_us_dedes/miscellanea:misc.Ode3
ltx/en_us_dedes/me.m01.d07:meMA.Ode3C1T.text	O Mother of God, you received inexpressible joy, and without seed you conceived your Master, Who was calling back to Himself the entire earth. We shout to Him: No one is holy except for you You, O Lord.
ltx/en_us_dedes/me.m01.d07:meMA.Ode3Kathisma1.greekmelody	@ltx/en_us_dedes/he.a.m1:heAU.TonTafonSouSotir.greekname
ltx/en_us_dedes/me.m01.d07:meMA.Ode3Kathisma1.incipit	The Lord, like a great…
ltx/en_us_dedes/me.m01.d07:meMA.Ode3Kathisma1.melody	@ltx/en_us_dedes/he.a.m1:heAU.TonTafonSouSotir.notmetered
ltx/en_us_dedes/me.m01.d07:meMA.Ode3Kathisma1.mode	@ltx/en_us_dedes/miscellanea:misc.Mode1
ltx/en_us_dedes/me.m01.d07:meMA.Ode3Kathisma1.text	The Lord, like a great rain, comes in the flesh to the streams of the river, wishing to be baptized. The godly Forerunner was amazed, and he spoke to Him, “How can I baptize You, who have no defilement? How can I lay my hand on Your divine head, of which all things are in awe?”
ltx/en_us_dedes/me.m01.d07:meMA.Ode3Kathisma2.greekmelody	@ltx/en_us_dedes/he.a.m4:heAU.KateplagiIosif.greekname
ltx/en_us_dedes/me.m01.d07:meMA.Ode3Kathisma2.incipit	Our incomprehensible God voluntarily came…
ltx/en_us_dedes/me.m01.d07:meMA.Ode3Kathisma2.melody	@ltx/en_us_dedes/he.a.m4:heAU.KateplagiIosif.notmetered
ltx/en_us_dedes/me.m01.d07:meMA.Ode3Kathisma2.mode	@ltx/en_us_dedes/miscellanea:misc.Mode4
ltx/en_us_dedes/me.m01.d07:meMA.Ode3Kathisma2.text	Our incomprehensible God voluntarily came down to earth and became incarnate for us, as He was well pleased to do; and He who is our illumination accepted to be baptized. At that time, the Forerunner said to Him, “O Savior, I dare not touch Your head, for I see that Your are incomprehensible, O Lord. Glory to You, O Logos, for You order all things for our benefit.”
ltx/en_us_dedes/me.m01.d07:meMA.Ode4C11.greekmelody	@ltx/en_us_dedes/he.h.m2:heHE.YmnoSeAkoi.greekname
ltx/en_us_dedes/me.m01.d07:meMA.Ode4C11.incipit	O all-venerable John, you were…
ltx/en_us_dedes/me.m01.d07:meMA.Ode4C11.melody	@ltx/en_us_dedes/he.h.m2:heHE.YmnoSeAkoi.notmetered
ltx/en_us_dedes/me.m01.d07:meMA.Ode4C11.mode	@ltx/en_us_dedes/miscellanea:misc.Mode2
ltx/en_us_dedes/me.m01.d07:meMA.Ode4C11.ode	@ltx/en_us_dedes/miscellanea:misc.Ode4
ltx/en_us_dedes/me.m01.d07:meMA.Ode4C11.text	O all-venerable John, you were sent ahead by the Master, to wash with water those who were stained, and to prepare them to receive Christ, who takes away sin and drives away error with the radiance of the knowledge of God.
ltx/en_us_dedes/me.m01.d07:meMA.Ode4C12.incipit	O blessed John, you baptized…
ltx/en_us_dedes/me.m01.d07:meMA.Ode4C12.melody	@ltx/en_us_dedes/he.h.m2:heHE.YmnoSeAkoi.notmetered
ltx/en_us_dedes/me.m01.d07:meMA.Ode4C12.mode	@ltx/en_us_dedes/miscellanea:misc.Mode2
ltx/en_us_dedes/me.m01.d07:meMA.Ode4C12.ode	@ltx/en_us_dedes/miscellanea:misc.Ode4
ltx/en_us_dedes/me.m01.d07:meMA.Ode4C12.text	O blessed John, you baptized Christ in the waters of the Jordan, wherein He as Savior crushed the wickedness of the dragons that was lurking there. Entreat Him to cure me of the poison of the dragon’s bite.
ltx/en_us_dedes/me.m01.d07:meMA.Ode4C13.incipit	O herald of Christ, you…
ltx/en_us_dedes/me.m01.d07:meMA.Ode4C13.melody	@ltx/en_us_dedes/he.h.m2:heHE.YmnoSeAkoi.notmetered
ltx/en_us_dedes/me.m01.d07:meMA.Ode4C13.mode	@ltx/en_us_dedes/miscellanea:misc.Mode2
ltx/en_us_dedes/me.m01.d07:meMA.Ode4C13.ode	@ltx/en_us_dedes/miscellanea:misc.Ode4
ltx/en_us_dedes/me.m01.d07:meMA.Ode4C13.text	O herald of Christ, you went forth, adorned with the wisdom of God. You became the voice of one crying out, which said, “Repent!” And as a Prophet you foretold of Him who said that you were the greatest of all men.
ltx/en_us_dedes/me.m01.d07:meMA.Ode4C14.incipit	You led a life that…
ltx/en_us_dedes/me.m01.d07:meMA.Ode4C14.melody	@ltx/en_us_dedes/he.h.m2:heHE.YmnoSeAkoi.notmetered
ltx/en_us_dedes/me.m01.d07:meMA.Ode4C14.mode	@ltx/en_us_dedes/miscellanea:misc.Mode2
ltx/en_us_dedes/me.m01.d07:meMA.Ode4C14.ode	@ltx/en_us_dedes/miscellanea:misc.Ode4
ltx/en_us_dedes/me.m01.d07:meMA.Ode4C14.text	You led a life that was different and off the beaten path, and then you came to the waters of the Jordan, where you would hear the voice of the Father and see the coming of the Spirit, O man most excellent of all.
ltx/en_us_dedes/me.m01.d07:meMA.Ode4C1T.incipit	O all-pure Virgin, the Lord…
ltx/en_us_dedes/me.m01.d07:meMA.Ode4C1T.melody	@ltx/en_us_dedes/he.h.m2:heHE.YmnoSeAkoi.notmetered
ltx/en_us_dedes/me.m01.d07:meMA.Ode4C1T.mode	@ltx/en_us_dedes/miscellanea:misc.Mode2
ltx/en_us_dedes/me.m01.d07:meMA.Ode4C1T.ode	@ltx/en_us_dedes/miscellanea:misc.Ode4
ltx/en_us_dedes/me.m01.d07:meMA.Ode4C1T.text	O all-pure Virgin, the Lord and fashioner of all things is formed like we are; for He entered your all-holy womb, and He clothed Himself with the form of man and rescued His image.
ltx/en_us_dedes/me.m01.d07:meMA.Ode5C11.greekmelody	@ltx/en_us_dedes/he.h.m2:heHE.OFotismos.greekname
ltx/en_us_dedes/me.m01.d07:meMA.Ode5C11.incipit	O Forerunner, you were arrayed…
ltx/en_us_dedes/me.m01.d07:meMA.Ode5C11.melody	@ltx/en_us_dedes/he.h.m2:heHE.OFotismos.notmetered
ltx/en_us_dedes/me.m01.d07:meMA.Ode5C11.mode	@ltx/en_us_dedes/miscellanea:misc.Mode2
ltx/en_us_dedes/me.m01.d07:meMA.Ode5C11.ode	@ltx/en_us_dedes/miscellanea:misc.Ode5
ltx/en_us_dedes/me.m01.d07:meMA.Ode5C11.text	O Forerunner, you were arrayed with the light of supernatural virtue, and inspired from heaven, you came to the Jordan River, and you baptized and cleansed through water those who approached you with wholehearted faith.
ltx/en_us_dedes/me.m01.d07:meMA.Ode5C12.incipit	When it was time for…
ltx/en_us_dedes/me.m01.d07:meMA.Ode5C12.melody	@ltx/en_us_dedes/he.h.m2:heHE.OFotismos.notmetered
ltx/en_us_dedes/me.m01.d07:meMA.Ode5C12.mode	@ltx/en_us_dedes/miscellanea:misc.Mode2
ltx/en_us_dedes/me.m01.d07:meMA.Ode5C12.ode	@ltx/en_us_dedes/miscellanea:misc.Ode5
ltx/en_us_dedes/me.m01.d07:meMA.Ode5C12.text	When it was time for you to baptize the pure and undefiled Light, you proved to be a vessel of purity; for you were chosen by Him as being greater than all men, and most honorable of the Prophets, for you were counted worthy to see the One about whom they had prophesied.
ltx/en_us_dedes/me.m01.d07:meMA.Ode5C13.incipit	The Forerunner, who was sent…
ltx/en_us_dedes/me.m01.d07:meMA.Ode5C13.melody	@ltx/en_us_dedes/he.h.m2:heHE.OFotismos.notmetered
ltx/en_us_dedes/me.m01.d07:meMA.Ode5C13.mode	@ltx/en_us_dedes/miscellanea:misc.Mode2
ltx/en_us_dedes/me.m01.d07:meMA.Ode5C13.ode	@ltx/en_us_dedes/miscellanea:misc.Ode5
ltx/en_us_dedes/me.m01.d07:meMA.Ode5C13.text	The Forerunner, who was sent before the face of the Lord, and shows men His straight paths, trembling touches the Master’s head and baptizes Him, saying, “I know no other God except for You.”
ltx/en_us_dedes/me.m01.d07:meMA.Ode5C1T.incipit	O Virgin, your Son proved…
ltx/en_us_dedes/me.m01.d07:meMA.Ode5C1T.melody	@ltx/en_us_dedes/he.h.m2:heHE.OFotismos.notmetered
ltx/en_us_dedes/me.m01.d07:meMA.Ode5C1T.mode	@ltx/en_us_dedes/miscellanea:misc.Mode2
ltx/en_us_dedes/me.m01.d07:meMA.Ode5C1T.ode	@ltx/en_us_dedes/miscellanea:misc.Ode5
ltx/en_us_dedes/me.m01.d07:meMA.Ode5C1T.text	O Virgin, your Son proved to be the Son of God as well, and as God He accomplished mighty deeds by His will alone. We all therefore truly and properly call you the Theotokos, for we know no other Mother of God except for you.
ltx/en_us_dedes/me.m01.d07:meMA.Ode6C11.greekmelody	@ltx/en_us_dedes/he.h.m2:heHE.EnAvyssoPtaismaton.greekname
ltx/en_us_dedes/me.m01.d07:meMA.Ode6C11.incipit	O Forerunner, you the voice…
ltx/en_us_dedes/me.m01.d07:meMA.Ode6C11.melody	@ltx/en_us_dedes/he.h.m2:heHE.EnAvyssoPtaismaton.notmetered
ltx/en_us_dedes/me.m01.d07:meMA.Ode6C11.mode	@ltx/en_us_dedes/miscellanea:misc.Mode2
ltx/en_us_dedes/me.m01.d07:meMA.Ode6C11.ode	@ltx/en_us_dedes/miscellanea:misc.Ode6
ltx/en_us_dedes/me.m01.d07:meMA.Ode6C11.text	O Forerunner, you the voice of the Word came forth, and you the morning star rose, and thus you clearly announced the Sun of Righteousness.
ltx/en_us_dedes/me.m01.d07:meMA.Ode6C12.incipit	O all-blessed John, you ignored…
ltx/en_us_dedes/me.m01.d07:meMA.Ode6C12.melody	@ltx/en_us_dedes/he.h.m2:heHE.EnAvyssoPtaismaton.notmetered
ltx/en_us_dedes/me.m01.d07:meMA.Ode6C12.mode	@ltx/en_us_dedes/miscellanea:misc.Mode2
ltx/en_us_dedes/me.m01.d07:meMA.Ode6C12.ode	@ltx/en_us_dedes/miscellanea:misc.Ode6
ltx/en_us_dedes/me.m01.d07:meMA.Ode6C12.text	O all-blessed John, you ignored earthly cares and were rich in heavenly hopes; thus you passed your life on earth like an Angel.
ltx/en_us_dedes/me.m01.d07:meMA.Ode6C13.incipit	We know you as the…
ltx/en_us_dedes/me.m01.d07:meMA.Ode6C13.melody	@ltx/en_us_dedes/he.h.m2:heHE.EnAvyssoPtaismaton.notmetered
ltx/en_us_dedes/me.m01.d07:meMA.Ode6C13.mode	@ltx/en_us_dedes/miscellanea:misc.Mode2
ltx/en_us_dedes/me.m01.d07:meMA.Ode6C13.ode	@ltx/en_us_dedes/miscellanea:misc.Ode6
ltx/en_us_dedes/me.m01.d07:meMA.Ode6C13.text	We know you as the seal of the Prophets, for you stand between the Old and New Covenants. We also declare that you are the Baptist and Forerunner of Christ our Savior.
ltx/en_us_dedes/me.m01.d07:meMA.Ode6C1T.incipit	O only Bride of God…
ltx/en_us_dedes/me.m01.d07:meMA.Ode6C1T.melody	@ltx/en_us_dedes/he.h.m2:heHE.EnAvyssoPtaismaton.notmetered
ltx/en_us_dedes/me.m01.d07:meMA.Ode6C1T.mode	@ltx/en_us_dedes/miscellanea:misc.Mode2
ltx/en_us_dedes/me.m01.d07:meMA.Ode6C1T.ode	@ltx/en_us_dedes/miscellanea:misc.Ode6
ltx/en_us_dedes/me.m01.d07:meMA.Ode6C1T.text	O only Bride of God, your conception is truly inexplicable, and all the faithful know and believe your ineffable and incomprehensible childbirth.
ltx/en_us_dedes/me.m01.d07:meMA.Ode7C11.greekmelody	@ltx/en_us_dedes/he.h.m2:heHE.VatosEnOrei.greekname
ltx/en_us_dedes/me.m01.d07:meMA.Ode7C11.incipit	O Forerunner, after you performed…
ltx/en_us_dedes/me.m01.d07:meMA.Ode7C11.melody	@ltx/en_us_dedes/he.h.m2:heHE.VatosEnOrei.notmetered
ltx/en_us_dedes/me.m01.d07:meMA.Ode7C11.mode	@ltx/en_us_dedes/miscellanea:misc.Mode2
ltx/en_us_dedes/me.m01.d07:meMA.Ode7C11.ode	@ltx/en_us_dedes/miscellanea:misc.Ode7
ltx/en_us_dedes/me.m01.d07:meMA.Ode7C11.text	O Forerunner, after you performed the sacrament of Baptism, and accomplished the divine mysteries that were entrusted to you, you were offered like a guileless lamb in sacrifice sacramentally. Therefore we join you in unison singing: Blessed are You, the God of our Fathers.
ltx/en_us_dedes/me.m01.d07:meMA.Ode7C12.incipit	O thrice-blessed Forerunner, you were…
ltx/en_us_dedes/me.m01.d07:meMA.Ode7C12.melody	@ltx/en_us_dedes/he.h.m2:heHE.VatosEnOrei.notmetered
ltx/en_us_dedes/me.m01.d07:meMA.Ode7C12.mode	@ltx/en_us_dedes/miscellanea:misc.Mode2
ltx/en_us_dedes/me.m01.d07:meMA.Ode7C12.ode	@ltx/en_us_dedes/miscellanea:misc.Ode7
ltx/en_us_dedes/me.m01.d07:meMA.Ode7C12.text	O thrice-blessed Forerunner, you were like another Elias, for like him you displayed an immaterial way of life, and you publicly reproved kings with boldness when they transgressed. Therefore, O Prophet, we join you singing: Blessed are You, the God of our Fathers.
ltx/en_us_dedes/me.m01.d07:meMA.Ode7C13.incipit	O thrice-blessed Forerunner, you were…
ltx/en_us_dedes/me.m01.d07:meMA.Ode7C13.melody	@ltx/en_us_dedes/he.h.m2:heHE.VatosEnOrei.notmetered
ltx/en_us_dedes/me.m01.d07:meMA.Ode7C13.mode	@ltx/en_us_dedes/miscellanea:misc.Mode2
ltx/en_us_dedes/me.m01.d07:meMA.Ode7C13.ode	@ltx/en_us_dedes/miscellanea:misc.Ode7
ltx/en_us_dedes/me.m01.d07:meMA.Ode7C13.text	O thrice-blessed Forerunner, you were greatest of all the Prophets, and you inherited the divine honor of the Apostles of Christ; in this way you are clearly shown to be the fulfillment of the Law and the first-fruit of the new grace. Therefore, O Baptist, we join you singing: Blessed are You, the God of our Fathers.
ltx/en_us_dedes/me.m01.d07:meMA.Ode7C1T.incipit	Let us all, with utmost…
ltx/en_us_dedes/me.m01.d07:meMA.Ode7C1T.melody	@ltx/en_us_dedes/he.h.m2:heHE.VatosEnOrei.notmetered
ltx/en_us_dedes/me.m01.d07:meMA.Ode7C1T.mode	@ltx/en_us_dedes/miscellanea:misc.Mode2
ltx/en_us_dedes/me.m01.d07:meMA.Ode7C1T.ode	@ltx/en_us_dedes/miscellanea:misc.Ode7
ltx/en_us_dedes/me.m01.d07:meMA.Ode7C1T.text	Let us all, with utmost reverence, worthily extol with sacred hymns the all-pure Lady who hosted God; for she carried in her womb the Only-begotten Son of God, when He was to appear to us men. To Him we believers in unison are singing: Blessed are You, the God of our Fathers.
ltx/en_us_dedes/me.m01.d07:meMA.Ode8C11.greekmelody	@ltx/en_us_dedes/he.h.m2:heHE.KaminosPote.greekname
ltx/en_us_dedes/me.m01.d07:meMA.Ode8C11.incipit	O all-blessed John, who appeared…
ltx/en_us_dedes/me.m01.d07:meMA.Ode8C11.melody	@ltx/en_us_dedes/he.h.m2:heHE.KaminosPote.notmetered
ltx/en_us_dedes/me.m01.d07:meMA.Ode8C11.mode	@ltx/en_us_dedes/miscellanea:misc.Mode2
ltx/en_us_dedes/me.m01.d07:meMA.Ode8C11.ode	@ltx/en_us_dedes/miscellanea:misc.Ode8
ltx/en_us_dedes/me.m01.d07:meMA.Ode8C11.text	O all-blessed John, who appeared on earth as a peer of the Angels in your unusual way of life, and who are superior to all other men, we joyfully honor you and we cry: O all you works, bless you the Lord.
ltx/en_us_dedes/me.m01.d07:meMA.Ode8C12.incipit	O Prophet, by the voice…
ltx/en_us_dedes/me.m01.d07:meMA.Ode8C12.melody	@ltx/en_us_dedes/he.h.m2:heHE.KaminosPote.notmetered
ltx/en_us_dedes/me.m01.d07:meMA.Ode8C12.mode	@ltx/en_us_dedes/miscellanea:misc.Mode2
ltx/en_us_dedes/me.m01.d07:meMA.Ode8C12.ode	@ltx/en_us_dedes/miscellanea:misc.Ode8
ltx/en_us_dedes/me.m01.d07:meMA.Ode8C12.text	O Prophet, by the voice of the Father and the coming of the Spirit, you understood that He whom you baptized was the eternal Logos of God. And thus you became an initiate of the one essence of the Godhead in three consubstantial hypostases.
ltx/en_us_dedes/me.m01.d07:meMA.Ode8C13.incipit	O all-venerable John, you were…
ltx/en_us_dedes/me.m01.d07:meMA.Ode8C13.melody	@ltx/en_us_dedes/he.h.m2:heHE.KaminosPote.notmetered
ltx/en_us_dedes/me.m01.d07:meMA.Ode8C13.mode	@ltx/en_us_dedes/miscellanea:misc.Mode2
ltx/en_us_dedes/me.m01.d07:meMA.Ode8C13.ode	@ltx/en_us_dedes/miscellanea:misc.Ode8
ltx/en_us_dedes/me.m01.d07:meMA.Ode8C13.text	O all-venerable John, you were born of a barren woman, and thus you were the noetic daybreak that preceded and made known the Sun that rose from a Virgin; and you preached the Lamb of God, who in His benevolence takes away the sin of the world.
ltx/en_us_dedes/me.m01.d07:meMA.Ode8C14.incipit	O blessed and truly happy…
ltx/en_us_dedes/me.m01.d07:meMA.Ode8C14.melody	@ltx/en_us_dedes/he.h.m2:heHE.KaminosPote.notmetered
ltx/en_us_dedes/me.m01.d07:meMA.Ode8C14.mode	@ltx/en_us_dedes/miscellanea:misc.Mode2
ltx/en_us_dedes/me.m01.d07:meMA.Ode8C14.ode	@ltx/en_us_dedes/miscellanea:misc.Ode8
ltx/en_us_dedes/me.m01.d07:meMA.Ode8C14.text	O blessed and truly happy Forerunner, as you now observe us from on high, by your intercessions keep us safe, who follow your divine preaching, and who abide in your inspired teachings and saving doctrines.
ltx/en_us_dedes/me.m01.d07:meMA.Ode8C1T.incipit	O all-pure Virgin, you ineffably…
ltx/en_us_dedes/me.m01.d07:meMA.Ode8C1T.melody	@ltx/en_us_dedes/he.h.m2:heHE.KaminosPote.notmetered
ltx/en_us_dedes/me.m01.d07:meMA.Ode8C1T.mode	@ltx/en_us_dedes/miscellanea:misc.Mode2
ltx/en_us_dedes/me.m01.d07:meMA.Ode8C1T.ode	@ltx/en_us_dedes/miscellanea:misc.Ode8
ltx/en_us_dedes/me.m01.d07:meMA.Ode8C1T.text	O all-pure Virgin, you ineffably conceived the pre-eternal effulgence of the Father’s glory, the unoriginate Logos, who is understood to be in the beginning, and has now, born of you, become without change the First-born of creation.
ltx/en_us_dedes/me.m01.d07:meMA.Ode9C11.greekmelody	@ltx/en_us_dedes/he.h.m2:heHE.ITonProIliouFostira.greekname
ltx/en_us_dedes/me.m01.d07:meMA.Ode9C11.incipit	Coming from the desert, the…
ltx/en_us_dedes/me.m01.d07:meMA.Ode9C11.melody	@ltx/en_us_dedes/he.h.m2:heHE.ITonProIliouFostira.name
ltx/en_us_dedes/me.m01.d07:meMA.Ode9C11.mode	@ltx/en_us_dedes/miscellanea:misc.Mode2
ltx/en_us_dedes/me.m01.d07:meMA.Ode9C11.ode	@ltx/en_us_dedes/miscellanea:misc.Ode9
ltx/en_us_dedes/me.m01.d07:meMA.Ode9C11.text	Coming from the desert, the Forerunner’s voice to all points out the Word who for our sake has visited us bodily; full of joy he prepares himself to baptize Him who has arrived, the One who purifies our souls from the ancestral sin through faith in Him.
ltx/en_us_dedes/me.m01.d07:meMA.Ode9C12.incipit	Grace and Law do clearly…
ltx/en_us_dedes/me.m01.d07:meMA.Ode9C12.melody	@ltx/en_us_dedes/he.h.m2:heHE.ITonProIliouFostira.name
ltx/en_us_dedes/me.m01.d07:meMA.Ode9C12.mode	@ltx/en_us_dedes/miscellanea:misc.Mode2
ltx/en_us_dedes/me.m01.d07:meMA.Ode9C12.ode	@ltx/en_us_dedes/miscellanea:misc.Ode9
ltx/en_us_dedes/me.m01.d07:meMA.Ode9C12.text	Grace and Law do clearly promote you, holy John, as intermediate, in that you seal the Law and inaugurate Grace; and the Word honored you himself above the other Prophets all. You now surpass things visible, all-venerable Forerunner.
ltx/en_us_dedes/me.m01.d07:meMA.Ode9C13.incipit	He who demonstrated a life…
ltx/en_us_dedes/me.m01.d07:meMA.Ode9C13.melody	@ltx/en_us_dedes/he.h.m2:heHE.ITonProIliouFostira.name
ltx/en_us_dedes/me.m01.d07:meMA.Ode9C13.mode	@ltx/en_us_dedes/miscellanea:misc.Mode2
ltx/en_us_dedes/me.m01.d07:meMA.Ode9C13.ode	@ltx/en_us_dedes/miscellanea:misc.Ode9
ltx/en_us_dedes/me.m01.d07:meMA.Ode9C13.text	He who demonstrated a life that emulates the incorporeal rejoices now together with angelic hosts; he is full of exultant joy as he stands beside the Master’s throne; forgiveness and salvation he requests for us and all who sing his praise.
ltx/en_us_dedes/me.m01.d07:meMA.Ode9C1T.incipit	Exceeding compassion, the Savior and…
ltx/en_us_dedes/me.m01.d07:meMA.Ode9C1T.melody	@ltx/en_us_dedes/he.h.m2:heHE.ITonProIliouFostira.name
ltx/en_us_dedes/me.m01.d07:meMA.Ode9C1T.mode	@ltx/en_us_dedes/miscellanea:misc.Mode2
ltx/en_us_dedes/me.m01.d07:meMA.Ode9C1T.ode	@ltx/en_us_dedes/miscellanea:misc.Ode9
ltx/en_us_dedes/me.m01.d07:meMA.Ode9C1T.text	Exceeding compassion, the Savior and Redeemer of the universe becomes a man and accepts to be born in the flesh. Benevolent is He by nature; He benefits humanity. He came forth from your virgin womb, all-blessed Maiden who gave birth to God.
ltx/en_us_dedes/me.m01.d07:meMA.Oikos1.text	
ltx/en_us_dedes/me.m01.d07:meVE.Apolytikion1.incipit	@ltx/en_us_dedes/me.m08.d29:meVE.Apolytikion1.incipit
ltx/en_us_dedes/me.m01.d07:meVE.Apolytikion1.melody	
ltx/en_us_dedes/me.m01.d07:meVE.Apolytikion1.mode	@ltx/en_us_dedes/me.m08.d29:meVE.Apolytikion1.mode
ltx/en_us_dedes/me.m01.d07:meVE.Apolytikion1.text	@ltx/en_us_dedes/me.m08.d29:meVE.Apolytikion1.text
ltx/en_us_dedes/me.m01.d07:meVE.AposBoth.incipit	@ltx/en_us_dedes/me.m01.d06:meVE.Lity3.incipit
ltx/en_us_dedes/me.m01.d07:meVE.AposBoth.melody	
ltx/en_us_dedes/me.m01.d07:meVE.AposBoth.mode	@ltx/en_us_dedes/miscellanea:misc.Mode4
ltx/en_us_dedes/me.m01.d07:meVE.AposBoth.poet	@ltx/en_us_dedes/poets:po.KosmaMonachou
ltx/en_us_dedes/me.m01.d07:meVE.AposBoth.text	@ltx/en_us_dedes/me.m01.d06:meVE.Lity3.text
ltx/en_us_dedes/me.m01.d07:meVE.AposGlory.incipit	…
ltx/en_us_dedes/me.m01.d07:meVE.AposGlory.melody	
ltx/en_us_dedes/me.m01.d07:meVE.AposGlory.mode	@ltx/en_us_dedes/miscellanea:misc.Mode4
ltx/en_us_dedes/me.m01.d07:meVE.AposGlory.poet	@ltx/en_us_dedes/poets:po.Vyzantos
ltx/en_us_dedes/me.m01.d07:meVE.AposGlory.text	
ltx/en_us_dedes/me.m01.d07:meVE.Aposticha1.greekmelody	@ltx/en_us_dedes/he.a.m4:heAU.EdokasSimeiosin.greekname
ltx/en_us_dedes/me.m01.d07:meVE.Aposticha1.incipit	…
ltx/en_us_dedes/me.m01.d07:meVE.Aposticha1.melody	@ltx/en_us_dedes/he.a.m4:heAU.EdokasSimeiosin.name
ltx/en_us_dedes/me.m01.d07:meVE.Aposticha1.mode	@ltx/en_us_dedes/miscellanea:misc.Mode4
ltx/en_us_dedes/me.m01.d07:meVE.Aposticha1.text	
ltx/en_us_dedes/me.m01.d07:meVE.Aposticha2.incipit	…
ltx/en_us_dedes/me.m01.d07:meVE.Aposticha2.melody	@ltx/en_us_dedes/he.a.m4:heAU.EdokasSimeiosin.name
ltx/en_us_dedes/me.m01.d07:meVE.Aposticha2.mode	@ltx/en_us_dedes/miscellanea:misc.Mode4
ltx/en_us_dedes/me.m01.d07:meVE.Aposticha2.text	
ltx/en_us_dedes/me.m01.d07:meVE.Aposticha3.incipit	…
ltx/en_us_dedes/me.m01.d07:meVE.Aposticha3.melody	@ltx/en_us_dedes/he.a.m4:heAU.EdokasSimeiosin.name
ltx/en_us_dedes/me.m01.d07:meVE.Aposticha3.mode	@ltx/en_us_dedes/miscellanea:misc.Mode4
ltx/en_us_dedes/me.m01.d07:meVE.Aposticha3.text	
ltx/en_us_dedes/me.m01.d07:meVE.SticBoth.incipit	@ltx/en_us_dedes/me.m01.d06:meMA.PostGospelIdiomelon.incipit
ltx/en_us_dedes/me.m01.d07:meVE.SticBoth.melody	
ltx/en_us_dedes/me.m01.d07:meVE.SticBoth.mode	@ltx/en_us_dedes/miscellanea:misc.Mode6
ltx/en_us_dedes/me.m01.d07:meVE.SticBoth.poet	@ltx/en_us_dedes/poets:po.Theofanous
ltx/en_us_dedes/me.m01.d07:meVE.SticBoth.text	@ltx/en_us_dedes/me.m01.d06:meMA.PostGospelIdiomelon.text
ltx/en_us_dedes/me.m01.d07:meVE.SticGlory.incipit	…
ltx/en_us_dedes/me.m01.d07:meVE.SticGlory.melody	
ltx/en_us_dedes/me.m01.d07:meVE.SticGlory.mode	@ltx/en_us_dedes/miscellanea:misc.Mode6
ltx/en_us_dedes/me.m01.d07:meVE.SticGlory.poet	@ltx/en_us_dedes/poets:po.Vyzantiou
ltx/en_us_dedes/me.m01.d07:meVE.SticGlory.text	
ltx/en_us_dedes/me.m01.d07:meVE.Stichera01.incipit	@ltx/en_us_dedes/me.m01.d06:meVE.Stichera01.incipit
ltx/en_us_dedes/me.m01.d07:meVE.Stichera01.melody	
ltx/en_us_dedes/me.m01.d07:meVE.Stichera01.mode	@ltx/en_us_dedes/miscellanea:misc.Mode2
ltx/en_us_dedes/me.m01.d07:meVE.Stichera01.poet	@ltx/en_us_dedes/poets:po.IoannouMonachou
ltx/en_us_dedes/me.m01.d07:meVE.Stichera01.text	@ltx/en_us_dedes/me.m01.d06:meVE.Stichera01.text
ltx/en_us_dedes/me.m01.d07:meVE.Stichera02.incipit	@ltx/en_us_dedes/me.m01.d06:meVE.Stichera02.incipit
ltx/en_us_dedes/me.m01.d07:meVE.Stichera02.melody	
ltx/en_us_dedes/me.m01.d07:meVE.Stichera02.mode	@ltx/en_us_dedes/miscellanea:misc.Mode2
ltx/en_us_dedes/me.m01.d07:meVE.Stichera02.text	@ltx/en_us_dedes/me.m01.d06:meVE.Stichera02.text
ltx/en_us_dedes/me.m01.d07:meVE.Stichera03.incipit	@ltx/en_us_dedes/me.m01.d06:meVE.Stichera03.incipit
ltx/en_us_dedes/me.m01.d07:meVE.Stichera03.melody	
ltx/en_us_dedes/me.m01.d07:meVE.Stichera03.mode	@ltx/en_us_dedes/miscellanea:misc.Mode2
ltx/en_us_dedes/me.m01.d07:meVE.Stichera03.text	@ltx/en_us_dedes/me.m01.d06:meVE.Stichera03.text
ltx/en_us_dedes/me.m01.d07:meVE.Stichera04.greekmelody	@ltx/en_us_dedes/he.a.m1:heAU.PaneffimoiMartyres.greekname
ltx/en_us_dedes/me.m01.d07:meVE.Stichera04.incipit	O Baptist and Forerunner of…
ltx/en_us_dedes/me.m01.d07:meVE.Stichera04.melody	@ltx/en_us_dedes/he.a.m1:heAU.PaneffimoiMartyres.name
ltx/en_us_dedes/me.m01.d07:meVE.Stichera04.mode	@ltx/en_us_dedes/miscellanea:misc.Mode1
ltx/en_us_dedes/me.m01.d07:meVE.Stichera04.text	O Baptist and Forerunner of Christ, * God-inspired and praised by all, we call you blest, and so doing we are glorifying Christ, * who in River Jordan * bowed His holy head to you, * and sanctified the nature of humankind. Now pray to Him for us, * and entreat Him that surpassing peace * and great mercy * be upon our souls bestowed.
ltx/en_us_dedes/me.m01.d07:meVE.Stichera05.incipit	O wise John the Forerunner…
ltx/en_us_dedes/me.m01.d07:meVE.Stichera05.melody	@ltx/en_us_dedes/he.a.m1:heAU.PaneffimoiMartyres.name
ltx/en_us_dedes/me.m01.d07:meVE.Stichera05.mode	@ltx/en_us_dedes/miscellanea:misc.Mode1
ltx/en_us_dedes/me.m01.d07:meVE.Stichera05.text	O wise John the Forerunner of Christ, * you beheld the Father’s ineffable glory from heaven, and you saw His only Son * standing in the water, * and the Spirit as a dove * which came upon Him, and which does purify and sanctify the world. * Thus, O mystic of the Trinity, we extol you, * and honor your sacred feast.
ltx/en_us_dedes/me.m01.d07:meVE.Stichera06.incipit	By Christ’s grace divine you…
ltx/en_us_dedes/me.m01.d07:meVE.Stichera06.melody	@ltx/en_us_dedes/he.a.m1:heAU.PaneffimoiMartyres.name
ltx/en_us_dedes/me.m01.d07:meVE.Stichera06.mode	@ltx/en_us_dedes/miscellanea:misc.Mode1
ltx/en_us_dedes/me.m01.d07:meVE.Stichera06.text	By Christ’s grace divine you were made strong, * Forerunner and Baptist John, and thus you showed us the Lamb of God who takes away the sins * of the world. And back then * on this day you joyfully did send those two disciples to follow Him. Now pray to Him for us, * and entreat Him that surpassing peace * and great mercy * be upon our souls bestowed.
