ltx/en_us_dedes/sy.m07.d19:syMA.commemoration01.couplet1.title	@ltx/en_us_dedes/titles:ti.Verses
ltx/en_us_dedes/sy.m07.d19:syMA.commemoration01.couplet1.verse1	
ltx/en_us_dedes/sy.m07.d19:syMA.commemoration01.couplet1.verse2	
ltx/en_us_dedes/sy.m07.d19:syMA.commemoration01.narration.p01	
ltx/en_us_dedes/sy.m07.d19:syMA.commemoration01.single1	
ltx/en_us_dedes/sy.m07.d19:syMA.commemoration01.text	On July 19, we commemorate the devout Macrina, sister of St. Basil the Great.
ltx/en_us_dedes/sy.m07.d19:syMA.commemoration02.couplet1.title	@ltx/en_us_dedes/titles:ti.Verses
ltx/en_us_dedes/sy.m07.d19:syMA.commemoration02.couplet1.verse1	
ltx/en_us_dedes/sy.m07.d19:syMA.commemoration02.couplet1.verse2	
ltx/en_us_dedes/sy.m07.d19:syMA.commemoration02.text	On this day we also commemorate our devout Father Dius the Wonderworker.
ltx/en_us_dedes/sy.m07.d19:syMA.commemoration03.couplet1.title	@ltx/en_us_dedes/titles:ti.Verses
ltx/en_us_dedes/sy.m07.d19:syMA.commemoration03.couplet1.verse1	
ltx/en_us_dedes/sy.m07.d19:syMA.commemoration03.couplet1.verse2	
ltx/en_us_dedes/sy.m07.d19:syMA.commemoration03.text	On this day we also commemorate four holy Ascetics who reposed in peace.
ltx/en_us_dedes/sy.m07.d19:syMA.commemoration04.couplet1.title	@ltx/en_us_dedes/titles:ti.Verses
ltx/en_us_dedes/sy.m07.d19:syMA.commemoration04.couplet1.verse1	
ltx/en_us_dedes/sy.m07.d19:syMA.commemoration04.couplet1.verse2	
ltx/en_us_dedes/sy.m07.d19:syMA.commemoration04.text	We also commemorate our Father among the saints Theodore, who lived in asceticism in the Lavra of St. Sabbas, and later became Archbishop of Edessa.
ltx/en_us_dedes/sy.m07.d19:syMA.commemoration05.text	We also commemorate our devout Father Gregory, Bishop of Panedus, the new confessor.
ltx/en_us_dedes/sy.m07.d19:syMA.lastline	By their holy intercessions, O God, have mercy on us. Amen.
