ltx/en_us_dedes/sy.m09.d25:syMA.commemoration01.couplet1.title	@ltx/en_us_dedes/titles:ti.Verses
ltx/en_us_dedes/sy.m09.d25:syMA.commemoration01.couplet1.verse1	
ltx/en_us_dedes/sy.m09.d25:syMA.commemoration01.couplet1.verse2	
ltx/en_us_dedes/sy.m09.d25:syMA.commemoration01.poem.verse01	
ltx/en_us_dedes/sy.m09.d25:syMA.commemoration01.poem.verse02	
ltx/en_us_dedes/sy.m09.d25:syMA.commemoration01.poem.verse03	
ltx/en_us_dedes/sy.m09.d25:syMA.commemoration01.poem.verse04	
ltx/en_us_dedes/sy.m09.d25:syMA.commemoration01.poem.verse05	
ltx/en_us_dedes/sy.m09.d25:syMA.commemoration01.poem.verse06	
ltx/en_us_dedes/sy.m09.d25:syMA.commemoration01.poem.verse07	
ltx/en_us_dedes/sy.m09.d25:syMA.commemoration01.poem.verse08	
ltx/en_us_dedes/sy.m09.d25:syMA.commemoration01.poem.verse09	
ltx/en_us_dedes/sy.m09.d25:syMA.commemoration01.poem.verse10	
ltx/en_us_dedes/sy.m09.d25:syMA.commemoration01.poem.verse11	
ltx/en_us_dedes/sy.m09.d25:syMA.commemoration01.poem.verse12	
ltx/en_us_dedes/sy.m09.d25:syMA.commemoration01.poem.verse13	
ltx/en_us_dedes/sy.m09.d25:syMA.commemoration01.poem.verse14	
ltx/en_us_dedes/sy.m09.d25:syMA.commemoration01.poem.verse15	
ltx/en_us_dedes/sy.m09.d25:syMA.commemoration01.poem.verse16	
ltx/en_us_dedes/sy.m09.d25:syMA.commemoration01.poem.verse17	
ltx/en_us_dedes/sy.m09.d25:syMA.commemoration01.poem.verse18	
ltx/en_us_dedes/sy.m09.d25:syMA.commemoration01.poem.verse19	
ltx/en_us_dedes/sy.m09.d25:syMA.commemoration01.poem.verse20	
ltx/en_us_dedes/sy.m09.d25:syMA.commemoration01.poem.verse21	
ltx/en_us_dedes/sy.m09.d25:syMA.commemoration01.poem.verse22	
ltx/en_us_dedes/sy.m09.d25:syMA.commemoration01.poem.verse23	
ltx/en_us_dedes/sy.m09.d25:syMA.commemoration01.poem.verse24	
ltx/en_us_dedes/sy.m09.d25:syMA.commemoration01.poem.verse25	
ltx/en_us_dedes/sy.m09.d25:syMA.commemoration01.poem.verse26	
ltx/en_us_dedes/sy.m09.d25:syMA.commemoration01.poem.verse27	
ltx/en_us_dedes/sy.m09.d25:syMA.commemoration01.poem.verse28	
ltx/en_us_dedes/sy.m09.d25:syMA.commemoration01.poem.verse29	
ltx/en_us_dedes/sy.m09.d25:syMA.commemoration01.poem.verse30	
ltx/en_us_dedes/sy.m09.d25:syMA.commemoration01.poem.verse31	
ltx/en_us_dedes/sy.m09.d25:syMA.commemoration01.poem.verse32	
ltx/en_us_dedes/sy.m09.d25:syMA.commemoration01.poem.verse33	
ltx/en_us_dedes/sy.m09.d25:syMA.commemoration01.poem.verse34	
ltx/en_us_dedes/sy.m09.d25:syMA.commemoration01.poem.verse35	
ltx/en_us_dedes/sy.m09.d25:syMA.commemoration01.single1	
ltx/en_us_dedes/sy.m09.d25:syMA.commemoration01.text	On September 25, we commemorate our devout mother Euphrosyne, daughter of Paphnutius the Egyptian.
ltx/en_us_dedes/sy.m09.d25:syMA.commemoration02.couplet1.title	For devout Saint Paphnutius, her father
ltx/en_us_dedes/sy.m09.d25:syMA.commemoration02.couplet1.verse1	
ltx/en_us_dedes/sy.m09.d25:syMA.commemoration02.couplet1.verse2	
ltx/en_us_dedes/sy.m09.d25:syMA.commemoration03.couplet1.title	@ltx/en_us_dedes/titles:ti.Verses
ltx/en_us_dedes/sy.m09.d25:syMA.commemoration03.couplet1.verse1	
ltx/en_us_dedes/sy.m09.d25:syMA.commemoration03.couplet1.verse2	
ltx/en_us_dedes/sy.m09.d25:syMA.commemoration03.text	On this day we commemorate the holy martyr Paphnutius.
ltx/en_us_dedes/sy.m09.d25:syMA.commemoration04.couplet1.title	@ltx/en_us_dedes/titles:ti.Verses
ltx/en_us_dedes/sy.m09.d25:syMA.commemoration04.couplet1.verse1	
ltx/en_us_dedes/sy.m09.d25:syMA.commemoration04.couplet1.verse2	
ltx/en_us_dedes/sy.m09.d25:syMA.commemoration04.narration.p01	
ltx/en_us_dedes/sy.m09.d25:syMA.commemoration04.text	On this day we remember the massive earthquake [in Constantinople], during which a child was wondrously caught up into the air [and heard the Thrice-holy Hymn].
ltx/en_us_dedes/sy.m09.d25:syMA.commemoration05.couplet1.title	@ltx/en_us_dedes/titles:ti.Verses
ltx/en_us_dedes/sy.m09.d25:syMA.commemoration05.couplet1.verse1	
ltx/en_us_dedes/sy.m09.d25:syMA.commemoration05.couplet1.verse2	
ltx/en_us_dedes/sy.m09.d25:syMA.commemoration05.narration.p01	
ltx/en_us_dedes/sy.m09.d25:syMA.commemoration05.text	On this day we commemorate the holy martyrs Paul, Tatta and their children Sabinian, Maximus, Rufus and Eugene.
ltx/en_us_dedes/sy.m09.d25:syMA.lastline	By the intercessions of Your Saints, O God, have mercy on us. Amen.
