ltx/en_us_dedes/me.m12.d19:meDA.commemoration.first	Memory of the Holy Martyr Boniface
ltx/en_us_dedes/me.m12.d19:meDA.commemoration.first_name	
ltx/en_us_dedes/me.m12.d19:meDA.commemoration.first_short	Memory of the Holy Martyr Boniface
ltx/en_us_dedes/me.m12.d19:meDA.commemoration.first_title	For St. Boniface.
ltx/en_us_dedes/me.m12.d19:meDA.commemoration.full	Memory of the Holy Martyr Boniface
ltx/en_us_dedes/me.m12.d19:meDA.commemoration.second_name	
ltx/en_us_dedes/me.m12.d19:meDA.commemoration.second_title	
ltx/en_us_dedes/me.m12.d19:meDA.date	December 19
ltx/en_us_dedes/me.m12.d19:meDA.fordate	for December 19
ltx/en_us_dedes/me.m12.d19:meDA.insert1	the holy and glorious Martyr Boniface,
ltx/en_us_dedes/me.m12.d19:meDA.insert2	whose memory we observe,
ltx/en_us_dedes/me.m12.d19:meDA.note	
ltx/en_us_dedes/me.m12.d19:meDA.pdfcoverdate	December 19,
ltx/en_us_dedes/me.m12.d19:meDA.pdfheaderdate	December 19
ltx/en_us_dedes/me.m12.d19:meHO.commemorations	
ltx/en_us_dedes/me.m12.d19:meHO.note1	
ltx/en_us_dedes/me.m12.d19:meHO.note2	
ltx/en_us_dedes/me.m12.d19:meHO.number	
ltx/en_us_dedes/me.m12.d19:meHO.rank	
ltx/en_us_dedes/me.m12.d19:meLE.commemoration1	
ltx/en_us_dedes/me.m12.d19:meLE.commemoration2	
ltx/en_us_dedes/me.m12.d19:meLI.Kontakion1.greekmelody	@ltx/en_us_dedes/me.m12.d19:meMA.Kontakion1.greekmelody
ltx/en_us_dedes/me.m12.d19:meLI.Kontakion1.incipit	@ltx/en_us_dedes/me.m12.d19:meMA.Kontakion1.incipit
ltx/en_us_dedes/me.m12.d19:meLI.Kontakion1.melody	@ltx/en_us_dedes/me.m12.d19:meMA.Kontakion1.melody
ltx/en_us_dedes/me.m12.d19:meLI.Kontakion1.mode	@ltx/en_us_dedes/me.m12.d19:meMA.Kontakion1.mode
ltx/en_us_dedes/me.m12.d19:meLI.Kontakion1.text	@ltx/en_us_dedes/me.m12.d19:meMA.Kontakion1.text
ltx/en_us_dedes/me.m12.d19:meLI.Megalynarion.text	
ltx/en_us_dedes/me.m12.d19:meMA.C1.acrostic.notice1	
ltx/en_us_dedes/me.m12.d19:meMA.C1.acrostic.text	
ltx/en_us_dedes/me.m12.d19:meMA.C1.acrostic.title	
ltx/en_us_dedes/me.m12.d19:meMA.C1.title	@ltx/en_us_dedes/titles:ti.CanonSaintM
ltx/en_us_dedes/me.m12.d19:meMA.C1.verse	@ltx/en_us_dedes/prayers:pr.verse_SaintM.text
ltx/en_us_dedes/me.m12.d19:meMA.Kontakion1.greekmelody	@ltx/en_us_dedes/he.a.m4:heAU.EpefanisSimeron.greekname
ltx/en_us_dedes/me.m12.d19:meMA.Kontakion1.incipit	Of your own accord, O…
ltx/en_us_dedes/me.m12.d19:meMA.Kontakion1.melody	@ltx/en_us_dedes/he.a.m4:heAU.EpefanisSimeron.notmetered
ltx/en_us_dedes/me.m12.d19:meMA.Kontakion1.mode	@ltx/en_us_dedes/miscellanea:misc.Mode4
ltx/en_us_dedes/me.m12.d19:meMA.Kontakion1.text	Of your own accord, O Saint, you offered yourself as a blameless sacrifice to the Lord, whose birth from the Virgin for our sake we will soon celebrate, O wise crown bearer Boniface.
ltx/en_us_dedes/me.m12.d19:meMA.Ode1C11.greekmelody	@ltx/en_us_dedes/he.h.m4:heHE.TristatasKrataious.greekname
ltx/en_us_dedes/me.m12.d19:meMA.Ode1C11.incipit	…
ltx/en_us_dedes/me.m12.d19:meMA.Ode1C11.melody	@ltx/en_us_dedes/he.h.m4:heHE.TristatasKrataious.name
ltx/en_us_dedes/me.m12.d19:meMA.Ode1C11.mode	@ltx/en_us_dedes/miscellanea:misc.Mode4
ltx/en_us_dedes/me.m12.d19:meMA.Ode1C11.ode	@ltx/en_us_dedes/miscellanea:misc.Ode1
ltx/en_us_dedes/me.m12.d19:meMA.Ode1C11.text	
ltx/en_us_dedes/me.m12.d19:meMA.Ode1C12.incipit	…
ltx/en_us_dedes/me.m12.d19:meMA.Ode1C12.melody	@ltx/en_us_dedes/he.h.m4:heHE.TristatasKrataious.name
ltx/en_us_dedes/me.m12.d19:meMA.Ode1C12.mode	@ltx/en_us_dedes/miscellanea:misc.Mode4
ltx/en_us_dedes/me.m12.d19:meMA.Ode1C12.ode	@ltx/en_us_dedes/miscellanea:misc.Ode1
ltx/en_us_dedes/me.m12.d19:meMA.Ode1C12.text	
ltx/en_us_dedes/me.m12.d19:meMA.Ode1C13.incipit	…
ltx/en_us_dedes/me.m12.d19:meMA.Ode1C13.melody	@ltx/en_us_dedes/he.h.m4:heHE.TristatasKrataious.name
ltx/en_us_dedes/me.m12.d19:meMA.Ode1C13.mode	@ltx/en_us_dedes/miscellanea:misc.Mode4
ltx/en_us_dedes/me.m12.d19:meMA.Ode1C13.ode	@ltx/en_us_dedes/miscellanea:misc.Ode1
ltx/en_us_dedes/me.m12.d19:meMA.Ode1C13.text	
ltx/en_us_dedes/me.m12.d19:meMA.Ode1C1T.incipit	…
ltx/en_us_dedes/me.m12.d19:meMA.Ode1C1T.melody	@ltx/en_us_dedes/he.h.m4:heHE.TristatasKrataious.name
ltx/en_us_dedes/me.m12.d19:meMA.Ode1C1T.mode	@ltx/en_us_dedes/miscellanea:misc.Mode4
ltx/en_us_dedes/me.m12.d19:meMA.Ode1C1T.ode	@ltx/en_us_dedes/miscellanea:misc.Ode1
ltx/en_us_dedes/me.m12.d19:meMA.Ode1C1T.text	
ltx/en_us_dedes/me.m12.d19:meMA.Ode3C11.greekmelody	@ltx/en_us_dedes/he.h.m4:heHE.OtiSteiraEteken.greekname
ltx/en_us_dedes/me.m12.d19:meMA.Ode3C11.incipit	…
ltx/en_us_dedes/me.m12.d19:meMA.Ode3C11.melody	@ltx/en_us_dedes/he.h.m4:heHE.OtiSteiraEteken.name
ltx/en_us_dedes/me.m12.d19:meMA.Ode3C11.mode	@ltx/en_us_dedes/miscellanea:misc.Mode4
ltx/en_us_dedes/me.m12.d19:meMA.Ode3C11.ode	@ltx/en_us_dedes/miscellanea:misc.Ode3
ltx/en_us_dedes/me.m12.d19:meMA.Ode3C11.text	
ltx/en_us_dedes/me.m12.d19:meMA.Ode3C12.incipit	…
ltx/en_us_dedes/me.m12.d19:meMA.Ode3C12.melody	@ltx/en_us_dedes/he.h.m4:heHE.OtiSteiraEteken.name
ltx/en_us_dedes/me.m12.d19:meMA.Ode3C12.mode	@ltx/en_us_dedes/miscellanea:misc.Mode4
ltx/en_us_dedes/me.m12.d19:meMA.Ode3C12.ode	@ltx/en_us_dedes/miscellanea:misc.Ode3
ltx/en_us_dedes/me.m12.d19:meMA.Ode3C12.text	
ltx/en_us_dedes/me.m12.d19:meMA.Ode3C13.incipit	…
ltx/en_us_dedes/me.m12.d19:meMA.Ode3C13.melody	@ltx/en_us_dedes/he.h.m4:heHE.OtiSteiraEteken.name
ltx/en_us_dedes/me.m12.d19:meMA.Ode3C13.mode	@ltx/en_us_dedes/miscellanea:misc.Mode4
ltx/en_us_dedes/me.m12.d19:meMA.Ode3C13.ode	@ltx/en_us_dedes/miscellanea:misc.Ode3
ltx/en_us_dedes/me.m12.d19:meMA.Ode3C13.text	
ltx/en_us_dedes/me.m12.d19:meMA.Ode3C1T.incipit	…
ltx/en_us_dedes/me.m12.d19:meMA.Ode3C1T.melody	@ltx/en_us_dedes/he.h.m4:heHE.OtiSteiraEteken.name
ltx/en_us_dedes/me.m12.d19:meMA.Ode3C1T.mode	@ltx/en_us_dedes/miscellanea:misc.Mode4
ltx/en_us_dedes/me.m12.d19:meMA.Ode3C1T.ode	@ltx/en_us_dedes/miscellanea:misc.Ode3
ltx/en_us_dedes/me.m12.d19:meMA.Ode3C1T.text	
ltx/en_us_dedes/me.m12.d19:meMA.Ode3H.greekmelody	@ltx/en_us_dedes/he.h.m4:heHE.OtiSteiraEteken.greekname
ltx/en_us_dedes/me.m12.d19:meMA.Ode3H.incipit	@ltx/en_us_dedes/he.h.m4:heHE.OtiSteiraEteken.incipit
ltx/en_us_dedes/me.m12.d19:meMA.Ode3H.melody	@ltx/en_us_dedes/he.h.m4:heHE.OtiSteiraEteken.melody
ltx/en_us_dedes/me.m12.d19:meMA.Ode3H.mode	@ltx/en_us_dedes/miscellanea:misc.Mode4
ltx/en_us_dedes/me.m12.d19:meMA.Ode3H.ode	@ltx/en_us_dedes/miscellanea:misc.Ode3
ltx/en_us_dedes/me.m12.d19:meMA.Ode3H.text	@ltx/en_us_dedes/he.h.m4:heHE.OtiSteiraEteken.text
ltx/en_us_dedes/me.m12.d19:meMA.Ode3Kathisma1.greekmelody	@ltx/en_us_dedes/he.a.m1:heAU.TonTafonSouSotir.greekname
ltx/en_us_dedes/me.m12.d19:meMA.Ode3Kathisma1.incipit	…
ltx/en_us_dedes/me.m12.d19:meMA.Ode3Kathisma1.melody	@ltx/en_us_dedes/he.a.m1:heAU.TonTafonSouSotir.name
ltx/en_us_dedes/me.m12.d19:meMA.Ode3Kathisma1.mode	@ltx/en_us_dedes/miscellanea:misc.Mode1
ltx/en_us_dedes/me.m12.d19:meMA.Ode3Kathisma1.text	
ltx/en_us_dedes/me.m12.d19:meMA.Ode3KathismaSt.incipit	@ltx/en_us_dedes/me.m12.d10:meMA.Ode3KathismaSt.incipit
ltx/en_us_dedes/me.m12.d19:meMA.Ode3KathismaSt.melody	@ltx/en_us_dedes/he.a.m1:heAU.TonTafonSouSotir.name
ltx/en_us_dedes/me.m12.d19:meMA.Ode3KathismaSt.mode	@ltx/en_us_dedes/miscellanea:misc.Mode1
ltx/en_us_dedes/me.m12.d19:meMA.Ode3KathismaSt.text	@ltx/en_us_dedes/me.m12.d10:meMA.Ode3KathismaSt.text
ltx/en_us_dedes/me.m12.d19:meMA.Ode3KathismaT.incipit	…
ltx/en_us_dedes/me.m12.d19:meMA.Ode3KathismaT.melody	@ltx/en_us_dedes/he.a.m1:heAU.TonTafonSouSotir.name
ltx/en_us_dedes/me.m12.d19:meMA.Ode3KathismaT.mode	@ltx/en_us_dedes/miscellanea:misc.Mode1
ltx/en_us_dedes/me.m12.d19:meMA.Ode3KathismaT.text	
ltx/en_us_dedes/me.m12.d19:meMA.Ode4C11.greekmelody	@ltx/en_us_dedes/he.h.m4:heHE.DiAgapisinOiktirmon.greekname
ltx/en_us_dedes/me.m12.d19:meMA.Ode4C11.incipit	…
ltx/en_us_dedes/me.m12.d19:meMA.Ode4C11.melody	@ltx/en_us_dedes/he.h.m4:heHE.DiAgapisinOiktirmon.name
ltx/en_us_dedes/me.m12.d19:meMA.Ode4C11.mode	@ltx/en_us_dedes/miscellanea:misc.Mode4
ltx/en_us_dedes/me.m12.d19:meMA.Ode4C11.ode	@ltx/en_us_dedes/miscellanea:misc.Ode4
ltx/en_us_dedes/me.m12.d19:meMA.Ode4C11.text	
ltx/en_us_dedes/me.m12.d19:meMA.Ode4C12.incipit	…
ltx/en_us_dedes/me.m12.d19:meMA.Ode4C12.melody	@ltx/en_us_dedes/he.h.m4:heHE.DiAgapisinOiktirmon.name
ltx/en_us_dedes/me.m12.d19:meMA.Ode4C12.mode	@ltx/en_us_dedes/miscellanea:misc.Mode4
ltx/en_us_dedes/me.m12.d19:meMA.Ode4C12.ode	@ltx/en_us_dedes/miscellanea:misc.Ode4
ltx/en_us_dedes/me.m12.d19:meMA.Ode4C12.text	
ltx/en_us_dedes/me.m12.d19:meMA.Ode4C13.incipit	…
ltx/en_us_dedes/me.m12.d19:meMA.Ode4C13.melody	@ltx/en_us_dedes/he.h.m4:heHE.DiAgapisinOiktirmon.name
ltx/en_us_dedes/me.m12.d19:meMA.Ode4C13.mode	@ltx/en_us_dedes/miscellanea:misc.Mode4
ltx/en_us_dedes/me.m12.d19:meMA.Ode4C13.ode	@ltx/en_us_dedes/miscellanea:misc.Ode4
ltx/en_us_dedes/me.m12.d19:meMA.Ode4C13.text	
ltx/en_us_dedes/me.m12.d19:meMA.Ode4C1T.incipit	…
ltx/en_us_dedes/me.m12.d19:meMA.Ode4C1T.melody	@ltx/en_us_dedes/he.h.m4:heHE.DiAgapisinOiktirmon.name
ltx/en_us_dedes/me.m12.d19:meMA.Ode4C1T.mode	@ltx/en_us_dedes/miscellanea:misc.Mode4
ltx/en_us_dedes/me.m12.d19:meMA.Ode4C1T.ode	@ltx/en_us_dedes/miscellanea:misc.Ode4
ltx/en_us_dedes/me.m12.d19:meMA.Ode4C1T.text	
ltx/en_us_dedes/me.m12.d19:meMA.Ode5C11.greekmelody	@ltx/en_us_dedes/he.h.m4:heHE.TonFotismonSouKyrie.greekname
ltx/en_us_dedes/me.m12.d19:meMA.Ode5C11.incipit	…
ltx/en_us_dedes/me.m12.d19:meMA.Ode5C11.melody	@ltx/en_us_dedes/he.h.m4:heHE.TonFotismonSouKyrie.name
ltx/en_us_dedes/me.m12.d19:meMA.Ode5C11.mode	@ltx/en_us_dedes/miscellanea:misc.Mode4
ltx/en_us_dedes/me.m12.d19:meMA.Ode5C11.ode	@ltx/en_us_dedes/miscellanea:misc.Ode5
ltx/en_us_dedes/me.m12.d19:meMA.Ode5C11.text	
ltx/en_us_dedes/me.m12.d19:meMA.Ode5C12.incipit	…
ltx/en_us_dedes/me.m12.d19:meMA.Ode5C12.melody	@ltx/en_us_dedes/he.h.m4:heHE.TonFotismonSouKyrie.name
ltx/en_us_dedes/me.m12.d19:meMA.Ode5C12.mode	@ltx/en_us_dedes/miscellanea:misc.Mode4
ltx/en_us_dedes/me.m12.d19:meMA.Ode5C12.ode	@ltx/en_us_dedes/miscellanea:misc.Ode5
ltx/en_us_dedes/me.m12.d19:meMA.Ode5C12.text	
ltx/en_us_dedes/me.m12.d19:meMA.Ode5C13.incipit	…
ltx/en_us_dedes/me.m12.d19:meMA.Ode5C13.melody	@ltx/en_us_dedes/he.h.m4:heHE.TonFotismonSouKyrie.name
ltx/en_us_dedes/me.m12.d19:meMA.Ode5C13.mode	@ltx/en_us_dedes/miscellanea:misc.Mode4
ltx/en_us_dedes/me.m12.d19:meMA.Ode5C13.ode	@ltx/en_us_dedes/miscellanea:misc.Ode5
ltx/en_us_dedes/me.m12.d19:meMA.Ode5C13.text	
ltx/en_us_dedes/me.m12.d19:meMA.Ode5C1T.incipit	…
ltx/en_us_dedes/me.m12.d19:meMA.Ode5C1T.melody	@ltx/en_us_dedes/he.h.m4:heHE.TonFotismonSouKyrie.name
ltx/en_us_dedes/me.m12.d19:meMA.Ode5C1T.mode	@ltx/en_us_dedes/miscellanea:misc.Mode4
ltx/en_us_dedes/me.m12.d19:meMA.Ode5C1T.ode	@ltx/en_us_dedes/miscellanea:misc.Ode5
ltx/en_us_dedes/me.m12.d19:meMA.Ode5C1T.text	
ltx/en_us_dedes/me.m12.d19:meMA.Ode6C11.greekmelody	@ltx/en_us_dedes/he.h.m4:heHE.EvoiseProtypon.greekname
ltx/en_us_dedes/me.m12.d19:meMA.Ode6C11.incipit	…
ltx/en_us_dedes/me.m12.d19:meMA.Ode6C11.melody	@ltx/en_us_dedes/he.h.m4:heHE.EvoiseProtypon.name
ltx/en_us_dedes/me.m12.d19:meMA.Ode6C11.mode	@ltx/en_us_dedes/miscellanea:misc.Mode4
ltx/en_us_dedes/me.m12.d19:meMA.Ode6C11.ode	@ltx/en_us_dedes/miscellanea:misc.Ode6
ltx/en_us_dedes/me.m12.d19:meMA.Ode6C11.text	
ltx/en_us_dedes/me.m12.d19:meMA.Ode6C12.incipit	…
ltx/en_us_dedes/me.m12.d19:meMA.Ode6C12.melody	@ltx/en_us_dedes/he.h.m4:heHE.EvoiseProtypon.name
ltx/en_us_dedes/me.m12.d19:meMA.Ode6C12.mode	@ltx/en_us_dedes/miscellanea:misc.Mode4
ltx/en_us_dedes/me.m12.d19:meMA.Ode6C12.ode	@ltx/en_us_dedes/miscellanea:misc.Ode6
ltx/en_us_dedes/me.m12.d19:meMA.Ode6C12.text	
ltx/en_us_dedes/me.m12.d19:meMA.Ode6C13.incipit	…
ltx/en_us_dedes/me.m12.d19:meMA.Ode6C13.melody	@ltx/en_us_dedes/he.h.m4:heHE.EvoiseProtypon.name
ltx/en_us_dedes/me.m12.d19:meMA.Ode6C13.mode	@ltx/en_us_dedes/miscellanea:misc.Mode4
ltx/en_us_dedes/me.m12.d19:meMA.Ode6C13.ode	@ltx/en_us_dedes/miscellanea:misc.Ode6
ltx/en_us_dedes/me.m12.d19:meMA.Ode6C13.text	
ltx/en_us_dedes/me.m12.d19:meMA.Ode6C1T.incipit	…
ltx/en_us_dedes/me.m12.d19:meMA.Ode6C1T.melody	@ltx/en_us_dedes/he.h.m4:heHE.EvoiseProtypon.name
ltx/en_us_dedes/me.m12.d19:meMA.Ode6C1T.mode	@ltx/en_us_dedes/miscellanea:misc.Mode4
ltx/en_us_dedes/me.m12.d19:meMA.Ode6C1T.ode	@ltx/en_us_dedes/miscellanea:misc.Ode6
ltx/en_us_dedes/me.m12.d19:meMA.Ode6C1T.text	
ltx/en_us_dedes/me.m12.d19:meMA.Ode6H.greekmelody	@ltx/en_us_dedes/he.h.m4:heHE.EvoiseProtypon.greekname
ltx/en_us_dedes/me.m12.d19:meMA.Ode6H.incipit	@ltx/en_us_dedes/he.h.m4:heHE.EvoiseProtypon.incipit
ltx/en_us_dedes/me.m12.d19:meMA.Ode6H.melody	@ltx/en_us_dedes/he.h.m4:heHE.EvoiseProtypon.melody
ltx/en_us_dedes/me.m12.d19:meMA.Ode6H.mode	@ltx/en_us_dedes/miscellanea:misc.Mode4
ltx/en_us_dedes/me.m12.d19:meMA.Ode6H.ode	@ltx/en_us_dedes/miscellanea:misc.Ode6
ltx/en_us_dedes/me.m12.d19:meMA.Ode6H.text	@ltx/en_us_dedes/he.h.m4:heHE.EvoiseProtypon.text
ltx/en_us_dedes/me.m12.d19:meMA.Ode7C11.greekmelody	@ltx/en_us_dedes/he.h.m4:heHE.AvramiaioiPote.greekname
ltx/en_us_dedes/me.m12.d19:meMA.Ode7C11.incipit	…
ltx/en_us_dedes/me.m12.d19:meMA.Ode7C11.melody	@ltx/en_us_dedes/he.h.m4:heHE.AvramiaioiPote.name
ltx/en_us_dedes/me.m12.d19:meMA.Ode7C11.mode	@ltx/en_us_dedes/miscellanea:misc.Mode4
ltx/en_us_dedes/me.m12.d19:meMA.Ode7C11.ode	@ltx/en_us_dedes/miscellanea:misc.Ode7
ltx/en_us_dedes/me.m12.d19:meMA.Ode7C11.text	
ltx/en_us_dedes/me.m12.d19:meMA.Ode7C12.incipit	…
ltx/en_us_dedes/me.m12.d19:meMA.Ode7C12.melody	@ltx/en_us_dedes/he.h.m4:heHE.AvramiaioiPote.name
ltx/en_us_dedes/me.m12.d19:meMA.Ode7C12.mode	@ltx/en_us_dedes/miscellanea:misc.Mode4
ltx/en_us_dedes/me.m12.d19:meMA.Ode7C12.ode	@ltx/en_us_dedes/miscellanea:misc.Ode7
ltx/en_us_dedes/me.m12.d19:meMA.Ode7C12.text	
ltx/en_us_dedes/me.m12.d19:meMA.Ode7C13.incipit	…
ltx/en_us_dedes/me.m12.d19:meMA.Ode7C13.melody	@ltx/en_us_dedes/he.h.m4:heHE.AvramiaioiPote.name
ltx/en_us_dedes/me.m12.d19:meMA.Ode7C13.mode	@ltx/en_us_dedes/miscellanea:misc.Mode4
ltx/en_us_dedes/me.m12.d19:meMA.Ode7C13.ode	@ltx/en_us_dedes/miscellanea:misc.Ode7
ltx/en_us_dedes/me.m12.d19:meMA.Ode7C13.text	
ltx/en_us_dedes/me.m12.d19:meMA.Ode7C1T.incipit	…
ltx/en_us_dedes/me.m12.d19:meMA.Ode7C1T.melody	@ltx/en_us_dedes/he.h.m4:heHE.AvramiaioiPote.name
ltx/en_us_dedes/me.m12.d19:meMA.Ode7C1T.mode	@ltx/en_us_dedes/miscellanea:misc.Mode4
ltx/en_us_dedes/me.m12.d19:meMA.Ode7C1T.ode	@ltx/en_us_dedes/miscellanea:misc.Ode7
ltx/en_us_dedes/me.m12.d19:meMA.Ode7C1T.text	
ltx/en_us_dedes/me.m12.d19:meMA.Ode8C11.greekmelody	@ltx/en_us_dedes/he.h.m4:heHE.LytrotaTouPantos.greekname
ltx/en_us_dedes/me.m12.d19:meMA.Ode8C11.incipit	…
ltx/en_us_dedes/me.m12.d19:meMA.Ode8C11.melody	@ltx/en_us_dedes/he.h.m4:heHE.LytrotaTouPantos.name
ltx/en_us_dedes/me.m12.d19:meMA.Ode8C11.mode	@ltx/en_us_dedes/miscellanea:misc.Mode4
ltx/en_us_dedes/me.m12.d19:meMA.Ode8C11.ode	@ltx/en_us_dedes/miscellanea:misc.Ode8
ltx/en_us_dedes/me.m12.d19:meMA.Ode8C11.text	
ltx/en_us_dedes/me.m12.d19:meMA.Ode8C12.incipit	…
ltx/en_us_dedes/me.m12.d19:meMA.Ode8C12.melody	@ltx/en_us_dedes/he.h.m4:heHE.LytrotaTouPantos.name
ltx/en_us_dedes/me.m12.d19:meMA.Ode8C12.mode	@ltx/en_us_dedes/miscellanea:misc.Mode4
ltx/en_us_dedes/me.m12.d19:meMA.Ode8C12.ode	@ltx/en_us_dedes/miscellanea:misc.Ode8
ltx/en_us_dedes/me.m12.d19:meMA.Ode8C12.text	
ltx/en_us_dedes/me.m12.d19:meMA.Ode8C13.incipit	…
ltx/en_us_dedes/me.m12.d19:meMA.Ode8C13.melody	@ltx/en_us_dedes/he.h.m4:heHE.LytrotaTouPantos.name
ltx/en_us_dedes/me.m12.d19:meMA.Ode8C13.mode	@ltx/en_us_dedes/miscellanea:misc.Mode4
ltx/en_us_dedes/me.m12.d19:meMA.Ode8C13.ode	@ltx/en_us_dedes/miscellanea:misc.Ode8
ltx/en_us_dedes/me.m12.d19:meMA.Ode8C13.text	
ltx/en_us_dedes/me.m12.d19:meMA.Ode8C14.incipit	…
ltx/en_us_dedes/me.m12.d19:meMA.Ode8C14.melody	@ltx/en_us_dedes/he.h.m4:heHE.LytrotaTouPantos.name
ltx/en_us_dedes/me.m12.d19:meMA.Ode8C14.mode	@ltx/en_us_dedes/miscellanea:misc.Mode4
ltx/en_us_dedes/me.m12.d19:meMA.Ode8C14.ode	@ltx/en_us_dedes/miscellanea:misc.Ode8
ltx/en_us_dedes/me.m12.d19:meMA.Ode8C14.text	
ltx/en_us_dedes/me.m12.d19:meMA.Ode8C1T.incipit	…
ltx/en_us_dedes/me.m12.d19:meMA.Ode8C1T.melody	@ltx/en_us_dedes/he.h.m4:heHE.LytrotaTouPantos.name
ltx/en_us_dedes/me.m12.d19:meMA.Ode8C1T.mode	@ltx/en_us_dedes/miscellanea:misc.Mode4
ltx/en_us_dedes/me.m12.d19:meMA.Ode8C1T.ode	@ltx/en_us_dedes/miscellanea:misc.Ode8
ltx/en_us_dedes/me.m12.d19:meMA.Ode8C1T.text	
ltx/en_us_dedes/me.m12.d19:meMA.Ode8H.greekmelody	@ltx/en_us_dedes/he.h.m4:heHE.LytrotaTouPantos.greekname
ltx/en_us_dedes/me.m12.d19:meMA.Ode8H.incipit	@ltx/en_us_dedes/he.h.m4:heHE.LytrotaTouPantos.incipit
ltx/en_us_dedes/me.m12.d19:meMA.Ode8H.melody	@ltx/en_us_dedes/he.h.m4:heHE.LytrotaTouPantos.melody
ltx/en_us_dedes/me.m12.d19:meMA.Ode8H.mode	@ltx/en_us_dedes/miscellanea:misc.Mode4
ltx/en_us_dedes/me.m12.d19:meMA.Ode8H.ode	@ltx/en_us_dedes/miscellanea:misc.Ode8
ltx/en_us_dedes/me.m12.d19:meMA.Ode8H.text	@ltx/en_us_dedes/he.h.m4:heHE.LytrotaTouPantos.text
ltx/en_us_dedes/me.m12.d19:meMA.Ode9C11.greekmelody	@ltx/en_us_dedes/he.h.m4:heHE.EvaMenToTisParakois.greekname
ltx/en_us_dedes/me.m12.d19:meMA.Ode9C11.incipit	…
ltx/en_us_dedes/me.m12.d19:meMA.Ode9C11.melody	@ltx/en_us_dedes/he.h.m4:heHE.EvaMenToTisParakois.name
ltx/en_us_dedes/me.m12.d19:meMA.Ode9C11.mode	@ltx/en_us_dedes/miscellanea:misc.Mode4
ltx/en_us_dedes/me.m12.d19:meMA.Ode9C11.ode	@ltx/en_us_dedes/miscellanea:misc.Ode9
ltx/en_us_dedes/me.m12.d19:meMA.Ode9C11.text	
ltx/en_us_dedes/me.m12.d19:meMA.Ode9C12.incipit	…
ltx/en_us_dedes/me.m12.d19:meMA.Ode9C12.melody	@ltx/en_us_dedes/he.h.m4:heHE.EvaMenToTisParakois.name
ltx/en_us_dedes/me.m12.d19:meMA.Ode9C12.mode	@ltx/en_us_dedes/miscellanea:misc.Mode4
ltx/en_us_dedes/me.m12.d19:meMA.Ode9C12.ode	@ltx/en_us_dedes/miscellanea:misc.Ode9
ltx/en_us_dedes/me.m12.d19:meMA.Ode9C12.text	
ltx/en_us_dedes/me.m12.d19:meMA.Ode9C13.incipit	…
ltx/en_us_dedes/me.m12.d19:meMA.Ode9C13.melody	@ltx/en_us_dedes/he.h.m4:heHE.EvaMenToTisParakois.name
ltx/en_us_dedes/me.m12.d19:meMA.Ode9C13.mode	@ltx/en_us_dedes/miscellanea:misc.Mode4
ltx/en_us_dedes/me.m12.d19:meMA.Ode9C13.ode	@ltx/en_us_dedes/miscellanea:misc.Ode9
ltx/en_us_dedes/me.m12.d19:meMA.Ode9C13.text	
ltx/en_us_dedes/me.m12.d19:meMA.Ode9C14.incipit	…
ltx/en_us_dedes/me.m12.d19:meMA.Ode9C14.melody	@ltx/en_us_dedes/he.h.m4:heHE.EvaMenToTisParakois.name
ltx/en_us_dedes/me.m12.d19:meMA.Ode9C14.mode	@ltx/en_us_dedes/miscellanea:misc.Mode4
ltx/en_us_dedes/me.m12.d19:meMA.Ode9C14.ode	@ltx/en_us_dedes/miscellanea:misc.Ode9
ltx/en_us_dedes/me.m12.d19:meMA.Ode9C14.text	
ltx/en_us_dedes/me.m12.d19:meMA.Ode9C1T.incipit	…
ltx/en_us_dedes/me.m12.d19:meMA.Ode9C1T.melody	@ltx/en_us_dedes/he.h.m4:heHE.EvaMenToTisParakois.name
ltx/en_us_dedes/me.m12.d19:meMA.Ode9C1T.mode	@ltx/en_us_dedes/miscellanea:misc.Mode4
ltx/en_us_dedes/me.m12.d19:meMA.Ode9C1T.ode	@ltx/en_us_dedes/miscellanea:misc.Ode9
ltx/en_us_dedes/me.m12.d19:meMA.Ode9C1T.text	
ltx/en_us_dedes/me.m12.d19:meMA.Ode9H.greekmelody	@ltx/en_us_dedes/he.h.m4:heHE.EvaMenToTisParakois.greekname
ltx/en_us_dedes/me.m12.d19:meMA.Ode9H.incipit	@ltx/en_us_dedes/he.h.m4:heHE.EvaMenToTisParakois.incipit
ltx/en_us_dedes/me.m12.d19:meMA.Ode9H.melody	@ltx/en_us_dedes/he.h.m4:heHE.EvaMenToTisParakois.melody
ltx/en_us_dedes/me.m12.d19:meMA.Ode9H.mode	@ltx/en_us_dedes/miscellanea:misc.Mode4
ltx/en_us_dedes/me.m12.d19:meMA.Ode9H.ode	@ltx/en_us_dedes/miscellanea:misc.Ode9
ltx/en_us_dedes/me.m12.d19:meMA.Ode9H.text	@ltx/en_us_dedes/he.h.m4:heHE.EvaMenToTisParakois.text
ltx/en_us_dedes/me.m12.d19:meMA.Oikos1.text	O godly-minded Saint, divine inspiration guided you from the west, like the Star in the east guided the Magi from Persia, so that to Christ, who was pleased to be born in a grotto, you might offer worship as to the King of all creation, and might bring Him your gifts, faith, and love, and hope, like their frankincense, myrrh, and gold. You offered yourself entirely to Him as an unblemished gift, and boldly you shouted and said to the tyrant judge, “I am a servant of my Christ,” O wise crown bearer Boniface.
ltx/en_us_dedes/me.m12.d19:meVE.Apolytikion1ger.greekmelody	@ltx/en_us_dedes/he.a.m4:heAU.TachyProkatalave.greekname
ltx/en_us_dedes/me.m12.d19:meVE.Apolytikion1ger.incipit	…
ltx/en_us_dedes/me.m12.d19:meVE.Apolytikion1ger.melody	@ltx/en_us_dedes/he.a.m4:heAU.TachyProkatalave.name
ltx/en_us_dedes/me.m12.d19:meVE.Apolytikion1ger.mode	@ltx/en_us_dedes/miscellanea:misc.Mode4
ltx/en_us_dedes/me.m12.d19:meVE.Apolytikion1ger.poet	@ltx/en_us_dedes/poets:po.Gerasimou
ltx/en_us_dedes/me.m12.d19:meVE.Apolytikion1ger.text	
ltx/en_us_dedes/me.m12.d19:meVE.SticStavrotheotokion.greekmelody	@ltx/en_us_dedes/he.a.m4:heAU.EdokasSimeiosin.greekname
ltx/en_us_dedes/me.m12.d19:meVE.SticStavrotheotokion.incipit	@ltx/en_us_dedes/oc.m4.d4:ocVE.SticTheotokion.incipit
ltx/en_us_dedes/me.m12.d19:meVE.SticStavrotheotokion.melody	@ltx/en_us_dedes/he.a.m4:heAU.EdokasSimeiosin.name
ltx/en_us_dedes/me.m12.d19:meVE.SticStavrotheotokion.mode	@ltx/en_us_dedes/miscellanea:misc.Mode4
ltx/en_us_dedes/me.m12.d19:meVE.SticStavrotheotokion.text	@ltx/en_us_dedes/oc.m4.d4:ocVE.SticTheotokion.text
ltx/en_us_dedes/me.m12.d19:meVE.SticTheotokion.greekmelody	@ltx/en_us_dedes/he.a.m4:heAU.EdokasSimeiosin.greekname
ltx/en_us_dedes/me.m12.d19:meVE.SticTheotokion.incipit	O Lady and Mother of…
ltx/en_us_dedes/me.m12.d19:meVE.SticTheotokion.melody	@ltx/en_us_dedes/he.a.m4:heAU.EdokasSimeiosin.name
ltx/en_us_dedes/me.m12.d19:meVE.SticTheotokion.mode	@ltx/en_us_dedes/miscellanea:misc.Mode4
ltx/en_us_dedes/me.m12.d19:meVE.SticTheotokion.text	O Lady and Mother of the very just Judge, I pray you now * to implore Him on the behalf * of me who am self-condemned and who am defenseless, * for licentious living, and pray that He condemn me not * on that impending and frightful Judgment Day, * but rather that He count me among His elect servants who will stand * on His right, in His tender love * and abundant benevolence.
ltx/en_us_dedes/me.m12.d19:meVE.Stichera01.greekmelody	@ltx/en_us_dedes/he.a.m4:heAU.EdokasSimeiosin.greekname
ltx/en_us_dedes/me.m12.d19:meVE.Stichera01.incipit	…
ltx/en_us_dedes/me.m12.d19:meVE.Stichera01.melody	@ltx/en_us_dedes/he.a.m4:heAU.EdokasSimeiosin.name
ltx/en_us_dedes/me.m12.d19:meVE.Stichera01.mode	@ltx/en_us_dedes/miscellanea:misc.Mode4
ltx/en_us_dedes/me.m12.d19:meVE.Stichera01.text	
ltx/en_us_dedes/me.m12.d19:meVE.Stichera02.incipit	…
ltx/en_us_dedes/me.m12.d19:meVE.Stichera02.melody	@ltx/en_us_dedes/he.a.m4:heAU.EdokasSimeiosin.name
ltx/en_us_dedes/me.m12.d19:meVE.Stichera02.mode	@ltx/en_us_dedes/miscellanea:misc.Mode4
ltx/en_us_dedes/me.m12.d19:meVE.Stichera02.text	
ltx/en_us_dedes/me.m12.d19:meVE.Stichera03.incipit	…
ltx/en_us_dedes/me.m12.d19:meVE.Stichera03.melody	@ltx/en_us_dedes/he.a.m4:heAU.EdokasSimeiosin.name
ltx/en_us_dedes/me.m12.d19:meVE.Stichera03.mode	@ltx/en_us_dedes/miscellanea:misc.Mode4
ltx/en_us_dedes/me.m12.d19:meVE.Stichera03.text	
