ltx/en_us_dedes/pe.d099:peDA.commemoration.full	Sunday of the Samaritan Woman
ltx/en_us_dedes/pe.d099:peDA.commemoration.short	Sunday of the Samaritan Woman
ltx/en_us_dedes/pe.d099:peDA.dismissal	@ltx/en_us_dedes/dismissals:dis00.resurrection
ltx/en_us_dedes/pe.d099:peDA.insert1	
ltx/en_us_dedes/pe.d099:peDA.insert2	
ltx/en_us_dedes/pe.d099:peDA.note	
ltx/en_us_dedes/pe.d099:peHO.commemorations	
ltx/en_us_dedes/pe.d099:peHO.daytitle	
ltx/en_us_dedes/pe.d099:peHO.description1	
ltx/en_us_dedes/pe.d099:peHO.description2	
ltx/en_us_dedes/pe.d099:peHO.note1	
ltx/en_us_dedes/pe.d099:peHO.note2	
ltx/en_us_dedes/pe.d099:peLI.Kontakion1.incipit	@ltx/en_us_dedes/pe.d099:peMA.Kontakion1.incipit
ltx/en_us_dedes/pe.d099:peLI.Kontakion1.melody	@ltx/en_us_dedes/pe.d099:peMA.Kontakion1.melody
ltx/en_us_dedes/pe.d099:peLI.Kontakion1.mode	@ltx/en_us_dedes/pe.d099:peMA.Kontakion1.mode
ltx/en_us_dedes/pe.d099:peLI.Kontakion1.text	@ltx/en_us_dedes/pe.d099:peMA.Kontakion1.text
ltx/en_us_dedes/pe.d099:peLI.Megalynarion.text	
ltx/en_us_dedes/pe.d099:peLI.Megalynarion2.text	
ltx/en_us_dedes/pe.d099:peLI.TheotokosHymn.incipit	@ltx/en_us_dedes/pe.d071:peMA.Ode9C22.incipit
ltx/en_us_dedes/pe.d099:peLI.TheotokosHymn.mode	@ltx/en_us_dedes/miscellanea:misc.Mode1
ltx/en_us_dedes/pe.d099:peLI.TheotokosHymn.text	@ltx/en_us_dedes/pe.d071:peMA.Ode9C22.text
ltx/en_us_dedes/pe.d099:peLI.TheotokosHymnVerse.text	@ltx/en_us_dedes/pe.d071:peMA.Ode9C1MKa.text
ltx/en_us_dedes/pe.d099:peMA.C1.acrostic.notice1	
ltx/en_us_dedes/pe.d099:peMA.C1.acrostic.notice2	
ltx/en_us_dedes/pe.d099:peMA.C1.acrostic.text	
ltx/en_us_dedes/pe.d099:peMA.C1.acrostic.title	
ltx/en_us_dedes/pe.d099:peMA.C1.poet	@ltx/en_us_dedes/poets:po.IosifThessalonikis
ltx/en_us_dedes/pe.d099:peMA.C1.title	@ltx/en_us_dedes/titles:ti.CanonSamaritanWoman
ltx/en_us_dedes/pe.d099:peMA.C1.verse	@ltx/en_us_dedes/prayers:pr.verse_God.text
ltx/en_us_dedes/pe.d099:peMA.Exaposteilarion1.greekmelody	@ltx/en_us_dedes/he.a.m2:heAU.GynaikesAkoutisthite.greekname
ltx/en_us_dedes/pe.d099:peMA.Exaposteilarion1.incipit	My Savior and almighty God,*…
ltx/en_us_dedes/pe.d099:peMA.Exaposteilarion1.melody	@ltx/en_us_dedes/he.a.m2:heAU.GynaikesAkoutisthite.name
ltx/en_us_dedes/pe.d099:peMA.Exaposteilarion1.mode	@ltx/en_us_dedes/miscellanea:misc.Mode2
ltx/en_us_dedes/pe.d099:peMA.Exaposteilarion1.text	My Savior and almighty God,* who from a rock made water gush* in the wilderness for the Hebrews,* You traveled to Samaria;* and with a woman You conversed* and asked for a drink of water.* Thus You drew her to faith in You;* and now in heaven forever* she enjoys life eternal.
ltx/en_us_dedes/pe.d099:peMA.Exaposteilarion2.greekmelody	@ltx/en_us_dedes/he.a.m2:heAU.GynaikesAkoutisthite.greekname
ltx/en_us_dedes/pe.d099:peMA.Exaposteilarion2.incipit	Midway into the Feast…
ltx/en_us_dedes/pe.d099:peMA.Exaposteilarion2.melody	@ltx/en_us_dedes/he.a.m2:heAU.GynaikesAkoutisthite.name
ltx/en_us_dedes/pe.d099:peMA.Exaposteilarion2.mode	@ltx/en_us_dedes/miscellanea:misc.Mode2
ltx/en_us_dedes/pe.d099:peMA.Exaposteilarion2.text	Midway into the Feast, You came, * O Savior most benevolent, * and stood in the Temple saying, * “You who are fed up with thirsting, * come to me and draw for yourselves * water living and welling up. * I tell you that through this you all * will surely enjoy divine grace, * delight and true life immortal.”
ltx/en_us_dedes/pe.d099:peMA.Kathisma11.incipit	@ltx/en_us_dedes/oc.m4.d1:ocMA.Kathisma11.incipit
ltx/en_us_dedes/pe.d099:peMA.Kathisma11.melody	
ltx/en_us_dedes/pe.d099:peMA.Kathisma11.mode	@ltx/en_us_dedes/miscellanea:misc.Mode4
ltx/en_us_dedes/pe.d099:peMA.Kathisma11.text	@ltx/en_us_dedes/oc.m4.d1:ocMA.Kathisma11.text
ltx/en_us_dedes/pe.d099:peMA.Kathisma12.greekmelody	@ltx/en_us_dedes/he.a.m4:heAU.TachyProkatalave.greekname
ltx/en_us_dedes/pe.d099:peMA.Kathisma12.incipit	@ltx/en_us_dedes/oc.m4.d1:ocMA.Kathisma21.incipit
ltx/en_us_dedes/pe.d099:peMA.Kathisma12.melody	@ltx/en_us_dedes/he.a.m4:heAU.TachyProkatalave.name
ltx/en_us_dedes/pe.d099:peMA.Kathisma12.mode	@ltx/en_us_dedes/miscellanea:misc.Mode4
ltx/en_us_dedes/pe.d099:peMA.Kathisma12.text	@ltx/en_us_dedes/oc.m4.d1:ocMA.Kathisma21.text
ltx/en_us_dedes/pe.d099:peMA.Kathisma13.incipit	@ltx/en_us_dedes/oc.m4.d1:ocVE.ApolTheotokionVM.incipit
ltx/en_us_dedes/pe.d099:peMA.Kathisma13.melody	
ltx/en_us_dedes/pe.d099:peMA.Kathisma13.mode	@ltx/en_us_dedes/miscellanea:misc.Mode4
ltx/en_us_dedes/pe.d099:peMA.Kathisma13.text	@ltx/en_us_dedes/oc.m4.d1:ocVE.ApolTheotokionVM.text
ltx/en_us_dedes/pe.d099:peMA.Kathisma21.greekmelody	@ltx/en_us_dedes/he.a.m4:heAU.KateplagiIosif.greekname
ltx/en_us_dedes/pe.d099:peMA.Kathisma21.incipit	@ltx/en_us_dedes/oc.m4.d1:ocMA.Kathisma22.incipit
ltx/en_us_dedes/pe.d099:peMA.Kathisma21.melody	@ltx/en_us_dedes/he.a.m4:heAU.KateplagiIosif.name
ltx/en_us_dedes/pe.d099:peMA.Kathisma21.mode	@ltx/en_us_dedes/miscellanea:misc.Mode4
ltx/en_us_dedes/pe.d099:peMA.Kathisma21.text	@ltx/en_us_dedes/oc.m4.d1:ocMA.Kathisma22.text
ltx/en_us_dedes/pe.d099:peMA.Kathisma22.greekmelody	@ltx/en_us_dedes/he.a.m4:heAU.KateplagiIosif.greekname
ltx/en_us_dedes/pe.d099:peMA.Kathisma22.incipit	@ltx/en_us_dedes/oc.m4.d1:ocMA.Kathisma12.incipit
ltx/en_us_dedes/pe.d099:peMA.Kathisma22.melody	@ltx/en_us_dedes/he.a.m4:heAU.KateplagiIosif.name
ltx/en_us_dedes/pe.d099:peMA.Kathisma22.mode	@ltx/en_us_dedes/miscellanea:misc.Mode4
ltx/en_us_dedes/pe.d099:peMA.Kathisma22.text	@ltx/en_us_dedes/oc.m4.d1:ocMA.Kathisma12.text
ltx/en_us_dedes/pe.d099:peMA.Kathisma23.greekmelody	@ltx/en_us_dedes/he.a.m4:heAU.KateplagiIosif.greekname
ltx/en_us_dedes/pe.d099:peMA.Kathisma23.incipit	@ltx/en_us_dedes/he.a.m4:heAU.KateplagiIosif.incipit
ltx/en_us_dedes/pe.d099:peMA.Kathisma23.melody	@ltx/en_us_dedes/he.a.m4:heAU.KateplagiIosif.melody
ltx/en_us_dedes/pe.d099:peMA.Kathisma23.mode	@ltx/en_us_dedes/he.a.m4:heAU.KateplagiIosif.mode
ltx/en_us_dedes/pe.d099:peMA.Kathisma23.text	@ltx/en_us_dedes/he.a.m4:heAU.KateplagiIosif.text
ltx/en_us_dedes/pe.d099:peMA.Kontakion1.incipit	In faith came the woman…
ltx/en_us_dedes/pe.d099:peMA.Kontakion1.melody	
ltx/en_us_dedes/pe.d099:peMA.Kontakion1.mode	@ltx/en_us_dedes/miscellanea:misc.Mode8
ltx/en_us_dedes/pe.d099:peMA.Kontakion1.text	In faith came the woman of Samaria to the well and she beheld You who are the water of wisdom. When she had fully drunk thereof, this famous lady inherited the kingdom on high for eternity.
ltx/en_us_dedes/pe.d099:peMA.Lauds1.incipit	@ltx/en_us_dedes/oc.m4.d1:ocMA.Lauds1.incipit
ltx/en_us_dedes/pe.d099:peMA.Lauds1.melody	@ltx/en_us_dedes/oc.m4.d1:ocMA.Lauds1.melody
ltx/en_us_dedes/pe.d099:peMA.Lauds1.mode	@ltx/en_us_dedes/oc.m4.d1:ocMA.Lauds1.mode
ltx/en_us_dedes/pe.d099:peMA.Lauds1.text	@ltx/en_us_dedes/oc.m4.d1:ocMA.Lauds1.text
ltx/en_us_dedes/pe.d099:peMA.Lauds2.incipit	@ltx/en_us_dedes/oc.m4.d1:ocMA.Lauds2.incipit
ltx/en_us_dedes/pe.d099:peMA.Lauds2.melody	@ltx/en_us_dedes/oc.m4.d1:ocMA.Lauds2.melody
ltx/en_us_dedes/pe.d099:peMA.Lauds2.mode	@ltx/en_us_dedes/oc.m4.d1:ocMA.Lauds2.mode
ltx/en_us_dedes/pe.d099:peMA.Lauds2.text	@ltx/en_us_dedes/oc.m4.d1:ocMA.Lauds2.text
ltx/en_us_dedes/pe.d099:peMA.Lauds3.incipit	@ltx/en_us_dedes/oc.m4.d1:ocMA.Lauds3.incipit
ltx/en_us_dedes/pe.d099:peMA.Lauds3.melody	@ltx/en_us_dedes/oc.m4.d1:ocMA.Lauds3.melody
ltx/en_us_dedes/pe.d099:peMA.Lauds3.mode	@ltx/en_us_dedes/oc.m4.d1:ocMA.Lauds3.mode
ltx/en_us_dedes/pe.d099:peMA.Lauds3.text	@ltx/en_us_dedes/oc.m4.d1:ocMA.Lauds3.text
ltx/en_us_dedes/pe.d099:peMA.Lauds4.incipit	@ltx/en_us_dedes/oc.m4.d1:ocMA.Lauds4.incipit
ltx/en_us_dedes/pe.d099:peMA.Lauds4.melody	@ltx/en_us_dedes/oc.m4.d1:ocMA.Lauds4.melody
ltx/en_us_dedes/pe.d099:peMA.Lauds4.mode	@ltx/en_us_dedes/oc.m4.d1:ocMA.Lauds4.mode
ltx/en_us_dedes/pe.d099:peMA.Lauds4.text	@ltx/en_us_dedes/oc.m4.d1:ocMA.Lauds4.text
ltx/en_us_dedes/pe.d099:peMA.Lauds7.incipit	@ltx/en_us_dedes/pe.d099:peVE.LityGlory.incipit
ltx/en_us_dedes/pe.d099:peMA.Lauds7.melody	@ltx/en_us_dedes/miscellanea:misc.Idiomelon
ltx/en_us_dedes/pe.d099:peMA.Lauds7.mode	@ltx/en_us_dedes/miscellanea:misc.Mode3
ltx/en_us_dedes/pe.d099:peMA.Lauds7.text	@ltx/en_us_dedes/pe.d099:peVE.LityGlory.text
ltx/en_us_dedes/pe.d099:peMA.Lauds8.incipit	Thus said the Lord to…
ltx/en_us_dedes/pe.d099:peMA.Lauds8.melody	@ltx/en_us_dedes/miscellanea:misc.Idiomelon
ltx/en_us_dedes/pe.d099:peMA.Lauds8.mode	@ltx/en_us_dedes/miscellanea:misc.Mode6
ltx/en_us_dedes/pe.d099:peMA.Lauds8.text	Thus said the Lord to the Samaritan woman, “If you knew the gift of God, and who it is that is saying to you, ‘Give me a drink of water,’ you would be asking him, and he would give you to drink, and you would never thirst again.” So said the Lord.
ltx/en_us_dedes/pe.d099:peMA.LaudsGlory.incipit	The Well of life’s source…
ltx/en_us_dedes/pe.d099:peMA.LaudsGlory.melody	@ltx/en_us_dedes/miscellanea:misc.Idiomelon
ltx/en_us_dedes/pe.d099:peMA.LaudsGlory.mode	@ltx/en_us_dedes/miscellanea:misc.Mode6
ltx/en_us_dedes/pe.d099:peMA.LaudsGlory.text	The Well of life’s source, Jesus our Savior, came to the well of Jacob the Patriarch, and He asked a Samaritan woman for a drink of water. When she objected that a Jew would have no dealings with her, the wise Creator diverts her attention with His sweet words, and gets her to ask instead for the eternal water. When she had received it, she proclaimed it to all, saying, “Come and see the Knower of things hidden; He is God, and He has come in the flesh to save humanity.”
ltx/en_us_dedes/pe.d099:peMA.Ode1C11.greekmelody	@ltx/en_us_dedes/he.h.m4:heHE.OPataxasAigypton.greekname
ltx/en_us_dedes/pe.d099:peMA.Ode1C11.incipit	…
ltx/en_us_dedes/pe.d099:peMA.Ode1C11.melody	@ltx/en_us_dedes/he.h.m4:heHE.OPataxasAigypton.name
ltx/en_us_dedes/pe.d099:peMA.Ode1C11.mode	@ltx/en_us_dedes/miscellanea:misc.Mode4
ltx/en_us_dedes/pe.d099:peMA.Ode1C11.ode	@ltx/en_us_dedes/miscellanea:misc.Ode1
ltx/en_us_dedes/pe.d099:peMA.Ode1C11.text	
ltx/en_us_dedes/pe.d099:peMA.Ode1C12.incipit	…
ltx/en_us_dedes/pe.d099:peMA.Ode1C12.melody	@ltx/en_us_dedes/he.h.m4:heHE.OPataxasAigypton.name
ltx/en_us_dedes/pe.d099:peMA.Ode1C12.mode	@ltx/en_us_dedes/miscellanea:misc.Mode4
ltx/en_us_dedes/pe.d099:peMA.Ode1C12.ode	@ltx/en_us_dedes/miscellanea:misc.Ode1
ltx/en_us_dedes/pe.d099:peMA.Ode1C12.text	
ltx/en_us_dedes/pe.d099:peMA.Ode1C13.incipit	…
ltx/en_us_dedes/pe.d099:peMA.Ode1C13.melody	@ltx/en_us_dedes/he.h.m4:heHE.OPataxasAigypton.name
ltx/en_us_dedes/pe.d099:peMA.Ode1C13.mode	@ltx/en_us_dedes/miscellanea:misc.Mode4
ltx/en_us_dedes/pe.d099:peMA.Ode1C13.ode	@ltx/en_us_dedes/miscellanea:misc.Ode1
ltx/en_us_dedes/pe.d099:peMA.Ode1C13.text	
ltx/en_us_dedes/pe.d099:peMA.Ode1C1F1.greekmelody	@ltx/en_us_dedes/he.h.m4:heHE.OPataxasAigypton.greekname
ltx/en_us_dedes/pe.d099:peMA.Ode1C1F1.incipit	…
ltx/en_us_dedes/pe.d099:peMA.Ode1C1F1.melody	@ltx/en_us_dedes/he.h.m4:heHE.OPataxasAigypton.name
ltx/en_us_dedes/pe.d099:peMA.Ode1C1F1.mode	@ltx/en_us_dedes/miscellanea:misc.Mode4
ltx/en_us_dedes/pe.d099:peMA.Ode1C1F1.ode	@ltx/en_us_dedes/miscellanea:misc.Ode1
ltx/en_us_dedes/pe.d099:peMA.Ode1C1F1.text	
ltx/en_us_dedes/pe.d099:peMA.Ode1C1H.greekmelody	@ltx/en_us_dedes/he.h.m4:heHE.OPataxasAigypton.greekname
ltx/en_us_dedes/pe.d099:peMA.Ode1C1H.incipit	@ltx/en_us_dedes/he.h.m4:heHE.OPataxasAigypton.incipit
ltx/en_us_dedes/pe.d099:peMA.Ode1C1H.melody	@ltx/en_us_dedes/he.h.m4:heHE.OPataxasAigypton.melody
ltx/en_us_dedes/pe.d099:peMA.Ode1C1H.mode	@ltx/en_us_dedes/miscellanea:misc.Mode4
ltx/en_us_dedes/pe.d099:peMA.Ode1C1H.ode	@ltx/en_us_dedes/miscellanea:misc.Ode1
ltx/en_us_dedes/pe.d099:peMA.Ode1C1H.text	@ltx/en_us_dedes/he.h.m4:heHE.OPataxasAigypton.text
ltx/en_us_dedes/pe.d099:peMA.Ode1C1T.incipit	…
ltx/en_us_dedes/pe.d099:peMA.Ode1C1T.melody	@ltx/en_us_dedes/he.h.m4:heHE.OPataxasAigypton.name
ltx/en_us_dedes/pe.d099:peMA.Ode1C1T.mode	@ltx/en_us_dedes/miscellanea:misc.Mode4
ltx/en_us_dedes/pe.d099:peMA.Ode1C1T.ode	@ltx/en_us_dedes/miscellanea:misc.Ode1
ltx/en_us_dedes/pe.d099:peMA.Ode1C1T.text	
ltx/en_us_dedes/pe.d099:peMA.Ode1C1Tr.incipit	…
ltx/en_us_dedes/pe.d099:peMA.Ode1C1Tr.melody	@ltx/en_us_dedes/he.h.m4:heHE.OPataxasAigypton.name
ltx/en_us_dedes/pe.d099:peMA.Ode1C1Tr.mode	@ltx/en_us_dedes/miscellanea:misc.Mode4
ltx/en_us_dedes/pe.d099:peMA.Ode1C1Tr.ode	@ltx/en_us_dedes/miscellanea:misc.Ode1
ltx/en_us_dedes/pe.d099:peMA.Ode1C1Tr.text	
ltx/en_us_dedes/pe.d099:peMA.Ode3C11.greekmelody	@ltx/en_us_dedes/he.h.m4:heHE.EstereothiIKardiaMouEnKyrio.greekname
ltx/en_us_dedes/pe.d099:peMA.Ode3C11.incipit	…
ltx/en_us_dedes/pe.d099:peMA.Ode3C11.melody	@ltx/en_us_dedes/he.h.m4:heHE.EstereothiIKardiaMouEnKyrio.name
ltx/en_us_dedes/pe.d099:peMA.Ode3C11.mode	@ltx/en_us_dedes/miscellanea:misc.Mode4
ltx/en_us_dedes/pe.d099:peMA.Ode3C11.ode	@ltx/en_us_dedes/miscellanea:misc.Ode3
ltx/en_us_dedes/pe.d099:peMA.Ode3C11.text	
ltx/en_us_dedes/pe.d099:peMA.Ode3C12.incipit	…
ltx/en_us_dedes/pe.d099:peMA.Ode3C12.melody	@ltx/en_us_dedes/he.h.m4:heHE.EstereothiIKardiaMouEnKyrio.name
ltx/en_us_dedes/pe.d099:peMA.Ode3C12.mode	@ltx/en_us_dedes/miscellanea:misc.Mode4
ltx/en_us_dedes/pe.d099:peMA.Ode3C12.ode	@ltx/en_us_dedes/miscellanea:misc.Ode3
ltx/en_us_dedes/pe.d099:peMA.Ode3C12.text	
ltx/en_us_dedes/pe.d099:peMA.Ode3C13.incipit	…
ltx/en_us_dedes/pe.d099:peMA.Ode3C13.melody	@ltx/en_us_dedes/he.h.m4:heHE.EstereothiIKardiaMouEnKyrio.name
ltx/en_us_dedes/pe.d099:peMA.Ode3C13.mode	@ltx/en_us_dedes/miscellanea:misc.Mode4
ltx/en_us_dedes/pe.d099:peMA.Ode3C13.ode	@ltx/en_us_dedes/miscellanea:misc.Ode3
ltx/en_us_dedes/pe.d099:peMA.Ode3C13.text	
ltx/en_us_dedes/pe.d099:peMA.Ode3C1F1.greekmelody	@ltx/en_us_dedes/he.h.m4:heHE.EstereothiIKardiaMouEnKyrio.greekname
ltx/en_us_dedes/pe.d099:peMA.Ode3C1F1.incipit	…
ltx/en_us_dedes/pe.d099:peMA.Ode3C1F1.melody	@ltx/en_us_dedes/he.h.m4:heHE.EstereothiIKardiaMouEnKyrio.name
ltx/en_us_dedes/pe.d099:peMA.Ode3C1F1.mode	@ltx/en_us_dedes/miscellanea:misc.Mode4
ltx/en_us_dedes/pe.d099:peMA.Ode3C1F1.ode	@ltx/en_us_dedes/miscellanea:misc.Ode3
ltx/en_us_dedes/pe.d099:peMA.Ode3C1F1.text	
ltx/en_us_dedes/pe.d099:peMA.Ode3C1H.greekmelody	@ltx/en_us_dedes/he.h.m4:heHE.EstereothiIKardiaMouEnKyrio.greekname
ltx/en_us_dedes/pe.d099:peMA.Ode3C1H.incipit	@ltx/en_us_dedes/he.h.m4:heHE.EstereothiIKardiaMouEnKyrio.incipit
ltx/en_us_dedes/pe.d099:peMA.Ode3C1H.melody	@ltx/en_us_dedes/he.h.m4:heHE.EstereothiIKardiaMouEnKyrio.melody
ltx/en_us_dedes/pe.d099:peMA.Ode3C1H.mode	@ltx/en_us_dedes/miscellanea:misc.Mode4
ltx/en_us_dedes/pe.d099:peMA.Ode3C1H.ode	@ltx/en_us_dedes/miscellanea:misc.Ode3
ltx/en_us_dedes/pe.d099:peMA.Ode3C1H.text	@ltx/en_us_dedes/he.h.m4:heHE.EstereothiIKardiaMouEnKyrio.text
ltx/en_us_dedes/pe.d099:peMA.Ode3C1T.incipit	…
ltx/en_us_dedes/pe.d099:peMA.Ode3C1T.melody	@ltx/en_us_dedes/he.h.m4:heHE.EstereothiIKardiaMouEnKyrio.name
ltx/en_us_dedes/pe.d099:peMA.Ode3C1T.mode	@ltx/en_us_dedes/miscellanea:misc.Mode4
ltx/en_us_dedes/pe.d099:peMA.Ode3C1T.ode	@ltx/en_us_dedes/miscellanea:misc.Ode3
ltx/en_us_dedes/pe.d099:peMA.Ode3C1T.text	
ltx/en_us_dedes/pe.d099:peMA.Ode3C1Tr.incipit	…
ltx/en_us_dedes/pe.d099:peMA.Ode3C1Tr.melody	@ltx/en_us_dedes/he.h.m4:heHE.EstereothiIKardiaMouEnKyrio.name
ltx/en_us_dedes/pe.d099:peMA.Ode3C1Tr.mode	@ltx/en_us_dedes/miscellanea:misc.Mode4
ltx/en_us_dedes/pe.d099:peMA.Ode3C1Tr.ode	@ltx/en_us_dedes/miscellanea:misc.Ode3
ltx/en_us_dedes/pe.d099:peMA.Ode3C1Tr.text	
ltx/en_us_dedes/pe.d099:peMA.Ode3Kathisma1.greekmelody	@ltx/en_us_dedes/he.a.m4:heAU.OYpsotheisEnToStavro.greekname
ltx/en_us_dedes/pe.d099:peMA.Ode3Kathisma1.incipit	Rejoice exceedingly, O heavens, and…
ltx/en_us_dedes/pe.d099:peMA.Ode3Kathisma1.melody	@ltx/en_us_dedes/he.a.m4:heAU.OYpsotheisEnToStavro.name
ltx/en_us_dedes/pe.d099:peMA.Ode3Kathisma1.mode	@ltx/en_us_dedes/miscellanea:misc.Mode4
ltx/en_us_dedes/pe.d099:peMA.Ode3Kathisma1.text	Rejoice exceedingly, O heavens, and also, * O earth, be glad, for Christ was born of a Virgin, * and He revealed himself as human, and by His own death * He delivered all mankind from decay and destruction. * Shining forth with miracles, * He requests a drink of water * and gives the woman of Samaria the well * of cures and healings, * as the only Immortal One.
ltx/en_us_dedes/pe.d099:peMA.Ode3Kathisma2.greekmelody	@ltx/en_us_dedes/he.a.m4:heAU.OYpsotheisEnToStavro.greekname
ltx/en_us_dedes/pe.d099:peMA.Ode3Kathisma2.incipit	…
ltx/en_us_dedes/pe.d099:peMA.Ode3Kathisma2.melody	@ltx/en_us_dedes/he.a.m4:heAU.OYpsotheisEnToStavro.name
ltx/en_us_dedes/pe.d099:peMA.Ode3Kathisma2.mode	@ltx/en_us_dedes/miscellanea:misc.Mode4
ltx/en_us_dedes/pe.d099:peMA.Ode3Kathisma2.text	
ltx/en_us_dedes/pe.d099:peMA.Ode4C11.greekmelody	@ltx/en_us_dedes/he.h.m4:heHE.EisakikoaKyrie.greekname
ltx/en_us_dedes/pe.d099:peMA.Ode4C11.incipit	…
ltx/en_us_dedes/pe.d099:peMA.Ode4C11.melody	@ltx/en_us_dedes/he.h.m4:heHE.EisakikoaKyrie.name
ltx/en_us_dedes/pe.d099:peMA.Ode4C11.mode	@ltx/en_us_dedes/miscellanea:misc.Mode4
ltx/en_us_dedes/pe.d099:peMA.Ode4C11.ode	@ltx/en_us_dedes/miscellanea:misc.Ode4
ltx/en_us_dedes/pe.d099:peMA.Ode4C11.text	
ltx/en_us_dedes/pe.d099:peMA.Ode4C12.incipit	…
ltx/en_us_dedes/pe.d099:peMA.Ode4C12.melody	@ltx/en_us_dedes/he.h.m4:heHE.EisakikoaKyrie.name
ltx/en_us_dedes/pe.d099:peMA.Ode4C12.mode	@ltx/en_us_dedes/miscellanea:misc.Mode4
ltx/en_us_dedes/pe.d099:peMA.Ode4C12.ode	@ltx/en_us_dedes/miscellanea:misc.Ode4
ltx/en_us_dedes/pe.d099:peMA.Ode4C12.text	
ltx/en_us_dedes/pe.d099:peMA.Ode4C13.incipit	…
ltx/en_us_dedes/pe.d099:peMA.Ode4C13.melody	@ltx/en_us_dedes/he.h.m4:heHE.EisakikoaKyrie.name
ltx/en_us_dedes/pe.d099:peMA.Ode4C13.mode	@ltx/en_us_dedes/miscellanea:misc.Mode4
ltx/en_us_dedes/pe.d099:peMA.Ode4C13.ode	@ltx/en_us_dedes/miscellanea:misc.Ode4
ltx/en_us_dedes/pe.d099:peMA.Ode4C13.text	
ltx/en_us_dedes/pe.d099:peMA.Ode4C1F1.greekmelody	@ltx/en_us_dedes/he.h.m4:heHE.EisakikoaKyrie.greekname
ltx/en_us_dedes/pe.d099:peMA.Ode4C1F1.incipit	…
ltx/en_us_dedes/pe.d099:peMA.Ode4C1F1.melody	@ltx/en_us_dedes/he.h.m4:heHE.EisakikoaKyrie.name
ltx/en_us_dedes/pe.d099:peMA.Ode4C1F1.mode	@ltx/en_us_dedes/miscellanea:misc.Mode4
ltx/en_us_dedes/pe.d099:peMA.Ode4C1F1.ode	@ltx/en_us_dedes/miscellanea:misc.Ode4
ltx/en_us_dedes/pe.d099:peMA.Ode4C1F1.text	
ltx/en_us_dedes/pe.d099:peMA.Ode4C1H.greekmelody	@ltx/en_us_dedes/he.h.m4:heHE.EisakikoaKyrie.greekname
ltx/en_us_dedes/pe.d099:peMA.Ode4C1H.incipit	@ltx/en_us_dedes/he.h.m4:heHE.EisakikoaKyrie.incipit
ltx/en_us_dedes/pe.d099:peMA.Ode4C1H.melody	@ltx/en_us_dedes/he.h.m4:heHE.EisakikoaKyrie.melody
ltx/en_us_dedes/pe.d099:peMA.Ode4C1H.mode	@ltx/en_us_dedes/miscellanea:misc.Mode4
ltx/en_us_dedes/pe.d099:peMA.Ode4C1H.ode	@ltx/en_us_dedes/miscellanea:misc.Ode4
ltx/en_us_dedes/pe.d099:peMA.Ode4C1H.text	@ltx/en_us_dedes/he.h.m4:heHE.EisakikoaKyrie.text
ltx/en_us_dedes/pe.d099:peMA.Ode4C1T.incipit	…
ltx/en_us_dedes/pe.d099:peMA.Ode4C1T.melody	@ltx/en_us_dedes/he.h.m4:heHE.EisakikoaKyrie.name
ltx/en_us_dedes/pe.d099:peMA.Ode4C1T.mode	@ltx/en_us_dedes/miscellanea:misc.Mode4
ltx/en_us_dedes/pe.d099:peMA.Ode4C1T.ode	@ltx/en_us_dedes/miscellanea:misc.Ode4
ltx/en_us_dedes/pe.d099:peMA.Ode4C1T.text	
ltx/en_us_dedes/pe.d099:peMA.Ode4C1Tr.incipit	…
ltx/en_us_dedes/pe.d099:peMA.Ode4C1Tr.melody	@ltx/en_us_dedes/he.h.m4:heHE.EisakikoaKyrie.name
ltx/en_us_dedes/pe.d099:peMA.Ode4C1Tr.mode	@ltx/en_us_dedes/miscellanea:misc.Mode4
ltx/en_us_dedes/pe.d099:peMA.Ode4C1Tr.ode	@ltx/en_us_dedes/miscellanea:misc.Ode4
ltx/en_us_dedes/pe.d099:peMA.Ode4C1Tr.text	
ltx/en_us_dedes/pe.d099:peMA.Ode5C11.greekmelody	@ltx/en_us_dedes/he.h.m4:heHE.AnateilonMoiKyrie.greekname
ltx/en_us_dedes/pe.d099:peMA.Ode5C11.incipit	…
ltx/en_us_dedes/pe.d099:peMA.Ode5C11.melody	@ltx/en_us_dedes/he.h.m4:heHE.AnateilonMoiKyrie.name
ltx/en_us_dedes/pe.d099:peMA.Ode5C11.mode	@ltx/en_us_dedes/miscellanea:misc.Mode4
ltx/en_us_dedes/pe.d099:peMA.Ode5C11.ode	@ltx/en_us_dedes/miscellanea:misc.Ode5
ltx/en_us_dedes/pe.d099:peMA.Ode5C11.text	
ltx/en_us_dedes/pe.d099:peMA.Ode5C12.incipit	…
ltx/en_us_dedes/pe.d099:peMA.Ode5C12.melody	@ltx/en_us_dedes/he.h.m4:heHE.AnateilonMoiKyrie.name
ltx/en_us_dedes/pe.d099:peMA.Ode5C12.mode	@ltx/en_us_dedes/miscellanea:misc.Mode4
ltx/en_us_dedes/pe.d099:peMA.Ode5C12.ode	@ltx/en_us_dedes/miscellanea:misc.Ode5
ltx/en_us_dedes/pe.d099:peMA.Ode5C12.text	
ltx/en_us_dedes/pe.d099:peMA.Ode5C13.incipit	…
ltx/en_us_dedes/pe.d099:peMA.Ode5C13.melody	@ltx/en_us_dedes/he.h.m4:heHE.AnateilonMoiKyrie.name
ltx/en_us_dedes/pe.d099:peMA.Ode5C13.mode	@ltx/en_us_dedes/miscellanea:misc.Mode4
ltx/en_us_dedes/pe.d099:peMA.Ode5C13.ode	@ltx/en_us_dedes/miscellanea:misc.Ode5
ltx/en_us_dedes/pe.d099:peMA.Ode5C13.text	
ltx/en_us_dedes/pe.d099:peMA.Ode5C1F1.greekmelody	@ltx/en_us_dedes/he.h.m4:heHE.AnateilonMoiKyrie.greekname
ltx/en_us_dedes/pe.d099:peMA.Ode5C1F1.incipit	…
ltx/en_us_dedes/pe.d099:peMA.Ode5C1F1.melody	@ltx/en_us_dedes/he.h.m4:heHE.AnateilonMoiKyrie.name
ltx/en_us_dedes/pe.d099:peMA.Ode5C1F1.mode	@ltx/en_us_dedes/miscellanea:misc.Mode4
ltx/en_us_dedes/pe.d099:peMA.Ode5C1F1.ode	@ltx/en_us_dedes/miscellanea:misc.Ode5
ltx/en_us_dedes/pe.d099:peMA.Ode5C1F1.text	
ltx/en_us_dedes/pe.d099:peMA.Ode5C1H.greekmelody	@ltx/en_us_dedes/he.h.m4:heHE.AnateilonMoiKyrie.greekname
ltx/en_us_dedes/pe.d099:peMA.Ode5C1H.incipit	@ltx/en_us_dedes/he.h.m4:heHE.AnateilonMoiKyrie.incipit
ltx/en_us_dedes/pe.d099:peMA.Ode5C1H.melody	@ltx/en_us_dedes/he.h.m4:heHE.AnateilonMoiKyrie.melody
ltx/en_us_dedes/pe.d099:peMA.Ode5C1H.mode	@ltx/en_us_dedes/miscellanea:misc.Mode4
ltx/en_us_dedes/pe.d099:peMA.Ode5C1H.ode	@ltx/en_us_dedes/miscellanea:misc.Ode5
ltx/en_us_dedes/pe.d099:peMA.Ode5C1H.text	@ltx/en_us_dedes/he.h.m4:heHE.AnateilonMoiKyrie.text
ltx/en_us_dedes/pe.d099:peMA.Ode5C1T.incipit	…
ltx/en_us_dedes/pe.d099:peMA.Ode5C1T.melody	@ltx/en_us_dedes/he.h.m4:heHE.AnateilonMoiKyrie.name
ltx/en_us_dedes/pe.d099:peMA.Ode5C1T.mode	@ltx/en_us_dedes/miscellanea:misc.Mode4
ltx/en_us_dedes/pe.d099:peMA.Ode5C1T.ode	@ltx/en_us_dedes/miscellanea:misc.Ode5
ltx/en_us_dedes/pe.d099:peMA.Ode5C1T.text	
ltx/en_us_dedes/pe.d099:peMA.Ode5C1Tr.incipit	…
ltx/en_us_dedes/pe.d099:peMA.Ode5C1Tr.melody	@ltx/en_us_dedes/he.h.m4:heHE.AnateilonMoiKyrie.name
ltx/en_us_dedes/pe.d099:peMA.Ode5C1Tr.mode	@ltx/en_us_dedes/miscellanea:misc.Mode4
ltx/en_us_dedes/pe.d099:peMA.Ode5C1Tr.ode	@ltx/en_us_dedes/miscellanea:misc.Ode5
ltx/en_us_dedes/pe.d099:peMA.Ode5C1Tr.text	
ltx/en_us_dedes/pe.d099:peMA.Ode6C11.greekmelody	@ltx/en_us_dedes/he.h.m4:heHE.MiKatapontisato.greekname
ltx/en_us_dedes/pe.d099:peMA.Ode6C11.incipit	…
ltx/en_us_dedes/pe.d099:peMA.Ode6C11.melody	@ltx/en_us_dedes/he.h.m4:heHE.MiKatapontisato.name
ltx/en_us_dedes/pe.d099:peMA.Ode6C11.mode	@ltx/en_us_dedes/miscellanea:misc.Mode4
ltx/en_us_dedes/pe.d099:peMA.Ode6C11.ode	@ltx/en_us_dedes/miscellanea:misc.Ode6
ltx/en_us_dedes/pe.d099:peMA.Ode6C11.text	
ltx/en_us_dedes/pe.d099:peMA.Ode6C12.incipit	…
ltx/en_us_dedes/pe.d099:peMA.Ode6C12.melody	@ltx/en_us_dedes/he.h.m4:heHE.MiKatapontisato.name
ltx/en_us_dedes/pe.d099:peMA.Ode6C12.mode	@ltx/en_us_dedes/miscellanea:misc.Mode4
ltx/en_us_dedes/pe.d099:peMA.Ode6C12.ode	@ltx/en_us_dedes/miscellanea:misc.Ode6
ltx/en_us_dedes/pe.d099:peMA.Ode6C12.text	
ltx/en_us_dedes/pe.d099:peMA.Ode6C13.incipit	…
ltx/en_us_dedes/pe.d099:peMA.Ode6C13.melody	@ltx/en_us_dedes/he.h.m4:heHE.MiKatapontisato.name
ltx/en_us_dedes/pe.d099:peMA.Ode6C13.mode	@ltx/en_us_dedes/miscellanea:misc.Mode4
ltx/en_us_dedes/pe.d099:peMA.Ode6C13.ode	@ltx/en_us_dedes/miscellanea:misc.Ode6
ltx/en_us_dedes/pe.d099:peMA.Ode6C13.text	
ltx/en_us_dedes/pe.d099:peMA.Ode6C1F1.greekmelody	@ltx/en_us_dedes/he.h.m4:heHE.MiKatapontisato.greekname
ltx/en_us_dedes/pe.d099:peMA.Ode6C1F1.incipit	…
ltx/en_us_dedes/pe.d099:peMA.Ode6C1F1.melody	@ltx/en_us_dedes/he.h.m4:heHE.MiKatapontisato.name
ltx/en_us_dedes/pe.d099:peMA.Ode6C1F1.mode	@ltx/en_us_dedes/miscellanea:misc.Mode4
ltx/en_us_dedes/pe.d099:peMA.Ode6C1F1.ode	@ltx/en_us_dedes/miscellanea:misc.Ode6
ltx/en_us_dedes/pe.d099:peMA.Ode6C1F1.text	
ltx/en_us_dedes/pe.d099:peMA.Ode6C1H.greekmelody	@ltx/en_us_dedes/he.h.m4:heHE.MiKatapontisato.greekname
ltx/en_us_dedes/pe.d099:peMA.Ode6C1H.incipit	@ltx/en_us_dedes/he.h.m4:heHE.MiKatapontisato.incipit
ltx/en_us_dedes/pe.d099:peMA.Ode6C1H.melody	@ltx/en_us_dedes/he.h.m4:heHE.MiKatapontisato.melody
ltx/en_us_dedes/pe.d099:peMA.Ode6C1H.mode	@ltx/en_us_dedes/miscellanea:misc.Mode4
ltx/en_us_dedes/pe.d099:peMA.Ode6C1H.ode	@ltx/en_us_dedes/miscellanea:misc.Ode6
ltx/en_us_dedes/pe.d099:peMA.Ode6C1H.text	@ltx/en_us_dedes/he.h.m4:heHE.MiKatapontisato.text
ltx/en_us_dedes/pe.d099:peMA.Ode6C1T.incipit	…
ltx/en_us_dedes/pe.d099:peMA.Ode6C1T.melody	@ltx/en_us_dedes/he.h.m4:heHE.MiKatapontisato.name
ltx/en_us_dedes/pe.d099:peMA.Ode6C1T.mode	@ltx/en_us_dedes/miscellanea:misc.Mode4
ltx/en_us_dedes/pe.d099:peMA.Ode6C1T.ode	@ltx/en_us_dedes/miscellanea:misc.Ode6
ltx/en_us_dedes/pe.d099:peMA.Ode6C1T.text	
ltx/en_us_dedes/pe.d099:peMA.Ode6C1Tr.incipit	…
ltx/en_us_dedes/pe.d099:peMA.Ode6C1Tr.melody	@ltx/en_us_dedes/he.h.m4:heHE.MiKatapontisato.name
ltx/en_us_dedes/pe.d099:peMA.Ode6C1Tr.mode	@ltx/en_us_dedes/miscellanea:misc.Mode4
ltx/en_us_dedes/pe.d099:peMA.Ode6C1Tr.ode	@ltx/en_us_dedes/miscellanea:misc.Ode6
ltx/en_us_dedes/pe.d099:peMA.Ode6C1Tr.text	
ltx/en_us_dedes/pe.d099:peMA.Ode7C11.greekmelody	@ltx/en_us_dedes/he.h.m4:heHE.MiParadoisImas.greekname
ltx/en_us_dedes/pe.d099:peMA.Ode7C11.incipit	…
ltx/en_us_dedes/pe.d099:peMA.Ode7C11.melody	@ltx/en_us_dedes/he.h.m4:heHE.MiParadoisImas.name
ltx/en_us_dedes/pe.d099:peMA.Ode7C11.mode	@ltx/en_us_dedes/miscellanea:misc.Mode4
ltx/en_us_dedes/pe.d099:peMA.Ode7C11.ode	@ltx/en_us_dedes/miscellanea:misc.Ode7
ltx/en_us_dedes/pe.d099:peMA.Ode7C11.text	
ltx/en_us_dedes/pe.d099:peMA.Ode7C12.incipit	…
ltx/en_us_dedes/pe.d099:peMA.Ode7C12.melody	@ltx/en_us_dedes/he.h.m4:heHE.MiParadoisImas.name
ltx/en_us_dedes/pe.d099:peMA.Ode7C12.mode	@ltx/en_us_dedes/miscellanea:misc.Mode4
ltx/en_us_dedes/pe.d099:peMA.Ode7C12.ode	@ltx/en_us_dedes/miscellanea:misc.Ode7
ltx/en_us_dedes/pe.d099:peMA.Ode7C12.text	
ltx/en_us_dedes/pe.d099:peMA.Ode7C13.incipit	…
ltx/en_us_dedes/pe.d099:peMA.Ode7C13.melody	@ltx/en_us_dedes/he.h.m4:heHE.MiParadoisImas.name
ltx/en_us_dedes/pe.d099:peMA.Ode7C13.mode	@ltx/en_us_dedes/miscellanea:misc.Mode4
ltx/en_us_dedes/pe.d099:peMA.Ode7C13.ode	@ltx/en_us_dedes/miscellanea:misc.Ode7
ltx/en_us_dedes/pe.d099:peMA.Ode7C13.text	
ltx/en_us_dedes/pe.d099:peMA.Ode7C1F1.greekmelody	@ltx/en_us_dedes/he.h.m4:heHE.MiParadoisImas.greekname
ltx/en_us_dedes/pe.d099:peMA.Ode7C1F1.incipit	…
ltx/en_us_dedes/pe.d099:peMA.Ode7C1F1.melody	@ltx/en_us_dedes/he.h.m4:heHE.MiParadoisImas.name
ltx/en_us_dedes/pe.d099:peMA.Ode7C1F1.mode	@ltx/en_us_dedes/miscellanea:misc.Mode4
ltx/en_us_dedes/pe.d099:peMA.Ode7C1F1.ode	@ltx/en_us_dedes/miscellanea:misc.Ode7
ltx/en_us_dedes/pe.d099:peMA.Ode7C1F1.text	
ltx/en_us_dedes/pe.d099:peMA.Ode7C1H.greekmelody	@ltx/en_us_dedes/he.h.m4:heHE.MiParadoisImas.greekname
ltx/en_us_dedes/pe.d099:peMA.Ode7C1H.incipit	@ltx/en_us_dedes/he.h.m4:heHE.MiParadoisImas.incipit
ltx/en_us_dedes/pe.d099:peMA.Ode7C1H.melody	@ltx/en_us_dedes/he.h.m4:heHE.MiParadoisImas.melody
ltx/en_us_dedes/pe.d099:peMA.Ode7C1H.mode	@ltx/en_us_dedes/miscellanea:misc.Mode4
ltx/en_us_dedes/pe.d099:peMA.Ode7C1H.ode	@ltx/en_us_dedes/miscellanea:misc.Ode7
ltx/en_us_dedes/pe.d099:peMA.Ode7C1H.text	@ltx/en_us_dedes/he.h.m4:heHE.MiParadoisImas.text
ltx/en_us_dedes/pe.d099:peMA.Ode7C1T.incipit	…
ltx/en_us_dedes/pe.d099:peMA.Ode7C1T.melody	@ltx/en_us_dedes/he.h.m4:heHE.MiParadoisImas.name
ltx/en_us_dedes/pe.d099:peMA.Ode7C1T.mode	@ltx/en_us_dedes/miscellanea:misc.Mode4
ltx/en_us_dedes/pe.d099:peMA.Ode7C1T.ode	@ltx/en_us_dedes/miscellanea:misc.Ode7
ltx/en_us_dedes/pe.d099:peMA.Ode7C1T.text	
ltx/en_us_dedes/pe.d099:peMA.Ode7C1Tr.incipit	…
ltx/en_us_dedes/pe.d099:peMA.Ode7C1Tr.melody	@ltx/en_us_dedes/he.h.m4:heHE.MiParadoisImas.name
ltx/en_us_dedes/pe.d099:peMA.Ode7C1Tr.mode	@ltx/en_us_dedes/miscellanea:misc.Mode4
ltx/en_us_dedes/pe.d099:peMA.Ode7C1Tr.ode	@ltx/en_us_dedes/miscellanea:misc.Ode7
ltx/en_us_dedes/pe.d099:peMA.Ode7C1Tr.text	
ltx/en_us_dedes/pe.d099:peMA.Ode8C11.greekmelody	@ltx/en_us_dedes/he.h.m4:heHE.TaSympantaDespota.greekname
ltx/en_us_dedes/pe.d099:peMA.Ode8C11.incipit	…
ltx/en_us_dedes/pe.d099:peMA.Ode8C11.melody	@ltx/en_us_dedes/he.h.m4:heHE.TaSympantaDespota.name
ltx/en_us_dedes/pe.d099:peMA.Ode8C11.mode	@ltx/en_us_dedes/miscellanea:misc.Mode4
ltx/en_us_dedes/pe.d099:peMA.Ode8C11.ode	@ltx/en_us_dedes/miscellanea:misc.Ode8
ltx/en_us_dedes/pe.d099:peMA.Ode8C11.text	
ltx/en_us_dedes/pe.d099:peMA.Ode8C12.incipit	…
ltx/en_us_dedes/pe.d099:peMA.Ode8C12.melody	@ltx/en_us_dedes/he.h.m4:heHE.TaSympantaDespota.name
ltx/en_us_dedes/pe.d099:peMA.Ode8C12.mode	@ltx/en_us_dedes/miscellanea:misc.Mode4
ltx/en_us_dedes/pe.d099:peMA.Ode8C12.ode	@ltx/en_us_dedes/miscellanea:misc.Ode8
ltx/en_us_dedes/pe.d099:peMA.Ode8C12.text	
ltx/en_us_dedes/pe.d099:peMA.Ode8C13.incipit	…
ltx/en_us_dedes/pe.d099:peMA.Ode8C13.melody	@ltx/en_us_dedes/he.h.m4:heHE.TaSympantaDespota.name
ltx/en_us_dedes/pe.d099:peMA.Ode8C13.mode	@ltx/en_us_dedes/miscellanea:misc.Mode4
ltx/en_us_dedes/pe.d099:peMA.Ode8C13.ode	@ltx/en_us_dedes/miscellanea:misc.Ode8
ltx/en_us_dedes/pe.d099:peMA.Ode8C13.text	
ltx/en_us_dedes/pe.d099:peMA.Ode8C1F1.greekmelody	@ltx/en_us_dedes/he.h.m4:heHE.TaSympantaDespota.greekname
ltx/en_us_dedes/pe.d099:peMA.Ode8C1F1.incipit	…
ltx/en_us_dedes/pe.d099:peMA.Ode8C1F1.melody	@ltx/en_us_dedes/he.h.m4:heHE.TaSympantaDespota.name
ltx/en_us_dedes/pe.d099:peMA.Ode8C1F1.mode	@ltx/en_us_dedes/miscellanea:misc.Mode4
ltx/en_us_dedes/pe.d099:peMA.Ode8C1F1.ode	@ltx/en_us_dedes/miscellanea:misc.Ode8
ltx/en_us_dedes/pe.d099:peMA.Ode8C1F1.text	
ltx/en_us_dedes/pe.d099:peMA.Ode8C1H.greekmelody	@ltx/en_us_dedes/he.h.m4:heHE.TaSympantaDespota.greekname
ltx/en_us_dedes/pe.d099:peMA.Ode8C1H.incipit	@ltx/en_us_dedes/he.h.m4:heHE.TaSympantaDespota.incipit
ltx/en_us_dedes/pe.d099:peMA.Ode8C1H.melody	@ltx/en_us_dedes/he.h.m4:heHE.TaSympantaDespota.melody
ltx/en_us_dedes/pe.d099:peMA.Ode8C1H.mode	@ltx/en_us_dedes/miscellanea:misc.Mode4
ltx/en_us_dedes/pe.d099:peMA.Ode8C1H.ode	@ltx/en_us_dedes/miscellanea:misc.Ode8
ltx/en_us_dedes/pe.d099:peMA.Ode8C1H.text	@ltx/en_us_dedes/he.h.m4:heHE.TaSympantaDespota.text
ltx/en_us_dedes/pe.d099:peMA.Ode8C1T.incipit	…
ltx/en_us_dedes/pe.d099:peMA.Ode8C1T.melody	@ltx/en_us_dedes/he.h.m4:heHE.TaSympantaDespota.name
ltx/en_us_dedes/pe.d099:peMA.Ode8C1T.mode	@ltx/en_us_dedes/miscellanea:misc.Mode4
ltx/en_us_dedes/pe.d099:peMA.Ode8C1T.ode	@ltx/en_us_dedes/miscellanea:misc.Ode8
ltx/en_us_dedes/pe.d099:peMA.Ode8C1T.text	
ltx/en_us_dedes/pe.d099:peMA.Ode8C1Tr.incipit	…
ltx/en_us_dedes/pe.d099:peMA.Ode8C1Tr.melody	@ltx/en_us_dedes/he.h.m4:heHE.TaSympantaDespota.name
ltx/en_us_dedes/pe.d099:peMA.Ode8C1Tr.mode	@ltx/en_us_dedes/miscellanea:misc.Mode4
ltx/en_us_dedes/pe.d099:peMA.Ode8C1Tr.ode	@ltx/en_us_dedes/miscellanea:misc.Ode8
ltx/en_us_dedes/pe.d099:peMA.Ode8C1Tr.text	
ltx/en_us_dedes/pe.d099:peMA.Ode9C11.greekmelody	@ltx/en_us_dedes/he.h.m4:heHE.EpoiiseKratos.greekname
ltx/en_us_dedes/pe.d099:peMA.Ode9C11.incipit	…
ltx/en_us_dedes/pe.d099:peMA.Ode9C11.melody	@ltx/en_us_dedes/he.h.m4:heHE.EpoiiseKratos.name
ltx/en_us_dedes/pe.d099:peMA.Ode9C11.mode	@ltx/en_us_dedes/miscellanea:misc.Mode4
ltx/en_us_dedes/pe.d099:peMA.Ode9C11.ode	@ltx/en_us_dedes/miscellanea:misc.Ode9
ltx/en_us_dedes/pe.d099:peMA.Ode9C11.text	
ltx/en_us_dedes/pe.d099:peMA.Ode9C12.incipit	…
ltx/en_us_dedes/pe.d099:peMA.Ode9C12.melody	@ltx/en_us_dedes/he.h.m4:heHE.EpoiiseKratos.name
ltx/en_us_dedes/pe.d099:peMA.Ode9C12.mode	@ltx/en_us_dedes/miscellanea:misc.Mode4
ltx/en_us_dedes/pe.d099:peMA.Ode9C12.ode	@ltx/en_us_dedes/miscellanea:misc.Ode9
ltx/en_us_dedes/pe.d099:peMA.Ode9C12.text	
ltx/en_us_dedes/pe.d099:peMA.Ode9C13.incipit	…
ltx/en_us_dedes/pe.d099:peMA.Ode9C13.melody	@ltx/en_us_dedes/he.h.m4:heHE.EpoiiseKratos.name
ltx/en_us_dedes/pe.d099:peMA.Ode9C13.mode	@ltx/en_us_dedes/miscellanea:misc.Mode4
ltx/en_us_dedes/pe.d099:peMA.Ode9C13.ode	@ltx/en_us_dedes/miscellanea:misc.Ode9
ltx/en_us_dedes/pe.d099:peMA.Ode9C13.text	
ltx/en_us_dedes/pe.d099:peMA.Ode9C1F1.greekmelody	@ltx/en_us_dedes/he.h.m4:heHE.EpoiiseKratos.greekname
ltx/en_us_dedes/pe.d099:peMA.Ode9C1F1.incipit	…
ltx/en_us_dedes/pe.d099:peMA.Ode9C1F1.melody	@ltx/en_us_dedes/he.h.m4:heHE.EpoiiseKratos.name
ltx/en_us_dedes/pe.d099:peMA.Ode9C1F1.mode	@ltx/en_us_dedes/miscellanea:misc.Mode4
ltx/en_us_dedes/pe.d099:peMA.Ode9C1F1.ode	@ltx/en_us_dedes/miscellanea:misc.Ode9
ltx/en_us_dedes/pe.d099:peMA.Ode9C1F1.text	
ltx/en_us_dedes/pe.d099:peMA.Ode9C1H.greekmelody	@ltx/en_us_dedes/he.h.m4:heHE.EpoiiseKratos.greekname
ltx/en_us_dedes/pe.d099:peMA.Ode9C1H.incipit	@ltx/en_us_dedes/he.h.m4:heHE.EpoiiseKratos.incipit
ltx/en_us_dedes/pe.d099:peMA.Ode9C1H.melody	@ltx/en_us_dedes/he.h.m4:heHE.EpoiiseKratos.melody
ltx/en_us_dedes/pe.d099:peMA.Ode9C1H.mode	@ltx/en_us_dedes/miscellanea:misc.Mode4
ltx/en_us_dedes/pe.d099:peMA.Ode9C1H.ode	@ltx/en_us_dedes/miscellanea:misc.Ode9
ltx/en_us_dedes/pe.d099:peMA.Ode9C1H.text	@ltx/en_us_dedes/he.h.m4:heHE.EpoiiseKratos.text
ltx/en_us_dedes/pe.d099:peMA.Ode9C1T.incipit	…
ltx/en_us_dedes/pe.d099:peMA.Ode9C1T.melody	@ltx/en_us_dedes/he.h.m4:heHE.EpoiiseKratos.name
ltx/en_us_dedes/pe.d099:peMA.Ode9C1T.mode	@ltx/en_us_dedes/miscellanea:misc.Mode4
ltx/en_us_dedes/pe.d099:peMA.Ode9C1T.ode	@ltx/en_us_dedes/miscellanea:misc.Ode9
ltx/en_us_dedes/pe.d099:peMA.Ode9C1T.text	
ltx/en_us_dedes/pe.d099:peMA.Ode9C1Tr.incipit	…
ltx/en_us_dedes/pe.d099:peMA.Ode9C1Tr.melody	@ltx/en_us_dedes/he.h.m4:heHE.EpoiiseKratos.name
ltx/en_us_dedes/pe.d099:peMA.Ode9C1Tr.mode	@ltx/en_us_dedes/miscellanea:misc.Mode4
ltx/en_us_dedes/pe.d099:peMA.Ode9C1Tr.ode	@ltx/en_us_dedes/miscellanea:misc.Ode9
ltx/en_us_dedes/pe.d099:peMA.Ode9C1Tr.text	
ltx/en_us_dedes/pe.d099:peMA.Oikos1.text	Let us listen to John as he teaches us of divine mysteries that took place in Samaria: how the Lord conversed with a woman, after asking her for water, He who collected the waters in their gatherings, and who shares the throne with the Father and Spirit. For our famous Savior came seeking His image, for the kingdom on high for eternity.
ltx/en_us_dedes/pe.d099:peSY.commemoration.couplet1.title	@ltx/en_us_dedes/titles:ti.Verses
ltx/en_us_dedes/pe.d099:peSY.commemoration.couplet1.verse1	Coming to fetch her fleeting water, a woman
ltx/en_us_dedes/pe.d099:peSY.commemoration.couplet1.verse2	The living water draws, by which You wash her soul’s sordes.
ltx/en_us_dedes/pe.d099:peSY.commemoration.narration.p01	[paragraph 01]
ltx/en_us_dedes/pe.d099:peSY.commemoration.narration.p02	[paragraph 02]
ltx/en_us_dedes/pe.d099:peSY.commemoration.narration.p03	[paragraph 03]
ltx/en_us_dedes/pe.d099:peSY.commemoration.narration.p04	[paragraph 04]
ltx/en_us_dedes/pe.d099:peSY.commemoration.narration.p05	[paragraph 05]
ltx/en_us_dedes/pe.d099:peSY.commemoration.narration.p06	[paragraph 06]
ltx/en_us_dedes/pe.d099:peSY.commemoration.narration.p07	[paragraph 07]
ltx/en_us_dedes/pe.d099:peSY.commemoration.text	On this day, the fifth Sunday of Pascha, we celebrate the feast of the Samaritan Woman.
ltx/en_us_dedes/pe.d099:peSY.lastline	By the intercessions of Your Martyr Photini, O Christ our God, have mercy on us. Amen.
ltx/en_us_dedes/pe.d099:peVE.Apolytikion1.incipit	@ltx/en_us_dedes/oc.m4.d1:ocVE.Apolytikion.incipit
ltx/en_us_dedes/pe.d099:peVE.Apolytikion1.melody	
ltx/en_us_dedes/pe.d099:peVE.Apolytikion1.mode	@ltx/en_us_dedes/miscellanea:misc.Mode4
ltx/en_us_dedes/pe.d099:peVE.Apolytikion1.text	@ltx/en_us_dedes/oc.m4.d1:ocVE.Apolytikion.text
ltx/en_us_dedes/pe.d099:peVE.Apolytikion2.incipit	@ltx/en_us_dedes/pe.d095:peVE.Apolytikion1.incipit
ltx/en_us_dedes/pe.d099:peVE.Apolytikion2.melody	
ltx/en_us_dedes/pe.d099:peVE.Apolytikion2.mode	@ltx/en_us_dedes/miscellanea:misc.Mode8
ltx/en_us_dedes/pe.d099:peVE.Apolytikion2.text	@ltx/en_us_dedes/pe.d095:peVE.Apolytikion1.text
ltx/en_us_dedes/pe.d099:peVE.AposGlory.incipit	While You, O Christ God…
ltx/en_us_dedes/pe.d099:peVE.AposGlory.melody	@ltx/en_us_dedes/miscellanea:misc.Idiomelon
ltx/en_us_dedes/pe.d099:peVE.AposGlory.mode	@ltx/en_us_dedes/miscellanea:misc.Mode8
ltx/en_us_dedes/pe.d099:peVE.AposGlory.text	While You, O Christ God, were on earth, in Your ineffable plan for our salvation, the Samaritan woman listened to Your benevolent words; and she left her water jar at the well, and she ran back to the city and said to the people there, “Come, see a man who knows what is in the heart. Can this be the Christ who is to come, who has the great mercy?”
ltx/en_us_dedes/pe.d099:peVE.LityGlory.incipit	Let heaven and earth beam…
ltx/en_us_dedes/pe.d099:peVE.LityGlory.melody	@ltx/en_us_dedes/miscellanea:misc.Idiomelon
ltx/en_us_dedes/pe.d099:peVE.LityGlory.mode	@ltx/en_us_dedes/miscellanea:misc.Mode3
ltx/en_us_dedes/pe.d099:peVE.LityGlory.text	Let heaven and earth beam with great joy today, for Christ has appeared, incarnate as man, to release from the curse all of Adam’s human race. He is greatly marveled at, when he comes to Samaria. He is seen with a woman, and and He asks her for water, He who surrounds himself with clouds and water. So come, all believers, let us worship Him, who voluntarily became poor for our sake, in His compassionate plan.
ltx/en_us_dedes/pe.d099:peVE.SticGlory.incipit	Beside Jacob’s well sat Jesus…
ltx/en_us_dedes/pe.d099:peVE.SticGlory.melody	@ltx/en_us_dedes/miscellanea:misc.Idiomelon
ltx/en_us_dedes/pe.d099:peVE.SticGlory.mode	@ltx/en_us_dedes/miscellanea:misc.Mode6
ltx/en_us_dedes/pe.d099:peVE.SticGlory.text	Beside Jacob’s well sat Jesus, where He found the Samaritan woman; and He asked her for water, He being the One who covers the earth with clouds. How amazing! He who rides on the Cherubim conversed with a promiscuous woman. He who suspended the earth in the waters was asking for water. He who pours out fountains and pools was requesting a drink of water. He truly wanted to get her back, since she had been caught by the hostile enemy; He wanted to give her a drink of the water of life, since she was dreadfully aflame in her offenses, as the only compassionate Lord who loves humanity.
ltx/en_us_dedes/pe.d099:peVE.Stichera05.greekmelody	@ltx/en_us_dedes/he.a.m4:heAU.KyrieAnelthonEnToStavro.greekname
ltx/en_us_dedes/pe.d099:peVE.Stichera05.incipit	@ltx/en_us_dedes/pe.d095:peVE.Stichera01.incipit
ltx/en_us_dedes/pe.d099:peVE.Stichera05.melody	@ltx/en_us_dedes/he.a.m4:heAU.KyrieAnelthonEnToStavro.name
ltx/en_us_dedes/pe.d099:peVE.Stichera05.mode	@ltx/en_us_dedes/miscellanea:misc.Mode4
ltx/en_us_dedes/pe.d099:peVE.Stichera05.text	@ltx/en_us_dedes/pe.d095:peVE.Stichera01.text
ltx/en_us_dedes/pe.d099:peVE.Stichera06.incipit	@ltx/en_us_dedes/pe.d095:peVE.Stichera02.incipit
ltx/en_us_dedes/pe.d099:peVE.Stichera06.melody	@ltx/en_us_dedes/he.a.m4:heAU.KyrieAnelthonEnToStavro.name
ltx/en_us_dedes/pe.d099:peVE.Stichera06.mode	@ltx/en_us_dedes/miscellanea:misc.Mode4
ltx/en_us_dedes/pe.d099:peVE.Stichera06.text	@ltx/en_us_dedes/pe.d095:peVE.Stichera02.text
ltx/en_us_dedes/pe.d099:peVE.Stichera07.greekmelody	@ltx/en_us_dedes/he.a.m4:heAU.KyrieAnelthonEnToStavro.greekname
ltx/en_us_dedes/pe.d099:peVE.Stichera07.incipit	@ltx/en_us_dedes/pe.d095:peVE.Stichera03.incipit
ltx/en_us_dedes/pe.d099:peVE.Stichera07.melody	@ltx/en_us_dedes/he.a.m4:heAU.KyrieAnelthonEnToStavro.name
ltx/en_us_dedes/pe.d099:peVE.Stichera07.mode	@ltx/en_us_dedes/miscellanea:misc.Mode4
ltx/en_us_dedes/pe.d099:peVE.Stichera07.text	@ltx/en_us_dedes/pe.d095:peVE.Stichera03.text
ltx/en_us_dedes/pe.d099:peVE.Stichera08.incipit	The Well of wonders came…
ltx/en_us_dedes/pe.d099:peVE.Stichera08.melody	@ltx/en_us_dedes/miscellanea:misc.Idiomelon
ltx/en_us_dedes/pe.d099:peVE.Stichera08.mode	@ltx/en_us_dedes/miscellanea:misc.Mode1
ltx/en_us_dedes/pe.d099:peVE.Stichera08.text	The Well of wonders came to the well, to salvage the daughter of Eve. It was about the sixth hour, the same time of day that Eve had exited Paradise, beguiled by the serpent. So the woman of Samaria came to draw water. Seeing her, the Savior said to her, “Give me a drink of water, and I will fill you with water welling up to eternal life.” Then that wise woman ran back to the city, and she said to the people at once, “Come and see Christ the Lord, the Savior of our souls!”
ltx/en_us_dedes/pe.d099:peVE.Stichera09.incipit	When the compassionate Lord came…
ltx/en_us_dedes/pe.d099:peVE.Stichera09.melody	@ltx/en_us_dedes/miscellanea:misc.Idiomelon
ltx/en_us_dedes/pe.d099:peVE.Stichera09.mode	@ltx/en_us_dedes/miscellanea:misc.Mode2
ltx/en_us_dedes/pe.d099:peVE.Stichera09.text	When the compassionate Lord came to the well, the Samaritan woman said in request, “Give me the water of faith, and I shall receive the baptismal waters, exultation and redemption.” O Lord, the Giver of life, glory to You!
ltx/en_us_dedes/pe.d099:peVE.Stichera10.incipit	The Father’s Logos and Son…
ltx/en_us_dedes/pe.d099:peVE.Stichera10.melody	@ltx/en_us_dedes/miscellanea:misc.Idiomelon
ltx/en_us_dedes/pe.d099:peVE.Stichera10.mode	@ltx/en_us_dedes/miscellanea:misc.Mode2
ltx/en_us_dedes/pe.d099:peVE.Stichera10.text	The Father’s Logos and Son, who is also unoriginate and eternal, and the well of cures and healing, came and sat down beside the well. Then came the woman of Samaria to draw water. The Savior looked at her and said, “Give me a drink of water, then go call your husband.” And she, thinking she was conversing with a man and not with God, tried to hide behind her words, saying, “I have no husband.” And the Teacher said to her, “You have spoken the truth in saying, ‘I have no husband’; for you have had five, and he whom you now have is not your husband.” Then she was amazed by what He said; and she ran to the city and said to the people, “Come and see the Christ, who grants the world the great mercy!”
