ltx/en_us_dedes/me.m11.d03:meDA.commemoration.first	Memory of the Holy Great-martyr George
ltx/en_us_dedes/me.m11.d03:meDA.commemoration.first_name	
ltx/en_us_dedes/me.m11.d03:meDA.commemoration.first_short	Memory of the Holy Great-martyr George
ltx/en_us_dedes/me.m11.d03:meDA.commemoration.first_title	@ltx/en_us_dedes/titles:ti.Martyrs
ltx/en_us_dedes/me.m11.d03:meDA.commemoration.full	Memory of the holy Martyrs Acepsimas, Joseph, and Aeithalas; and of the Consecration of the Church of the Holy Great-martyr George in Lydda, when his Holy Body was Placed in it.
ltx/en_us_dedes/me.m11.d03:meDA.commemoration.second_name	
ltx/en_us_dedes/me.m11.d03:meDA.commemoration.second_short	Memory of the holy Martyrs Acepsimas, Joseph, and Aeithalas
ltx/en_us_dedes/me.m11.d03:meDA.commemoration.second_title	For St. George.
ltx/en_us_dedes/me.m11.d03:meDA.date	November 3
ltx/en_us_dedes/me.m11.d03:meDA.fordate	for November 3
ltx/en_us_dedes/me.m11.d03:meDA.insert1	the holy Martyrs Acepsimas, Joseph, and Aeithalas, and the holy and glorious Great-martyr George the Trophy-bearer,
ltx/en_us_dedes/me.m11.d03:meDA.insert2	whose memory we celebrate;
ltx/en_us_dedes/me.m11.d03:meDA.note	
ltx/en_us_dedes/me.m11.d03:meDA.pdfcoverdate	November 3,
ltx/en_us_dedes/me.m11.d03:meDA.pdfheaderdate	November 3
ltx/en_us_dedes/me.m11.d03:meHO.commemorations	
ltx/en_us_dedes/me.m11.d03:meHO.note1	
ltx/en_us_dedes/me.m11.d03:meHO.note2	
ltx/en_us_dedes/me.m11.d03:meHO.number	
ltx/en_us_dedes/me.m11.d03:meHO.rank	
ltx/en_us_dedes/me.m11.d03:meLE.commemoration1	The Holy Martyrs Akepsimas, Ioseph, and Aeithalas. The Consecration of the Church of Saint George the Great-martyr at Lydda.
ltx/en_us_dedes/me.m11.d03:meLE.commemoration2	
ltx/en_us_dedes/me.m11.d03:meLI.Kontakion1.greekmelody	@ltx/en_us_dedes/me.m11.d03:meMA.Kontakion1.greekmelody
ltx/en_us_dedes/me.m11.d03:meLI.Kontakion1.incipit	@ltx/en_us_dedes/me.m11.d03:meMA.Kontakion1.incipit
ltx/en_us_dedes/me.m11.d03:meLI.Kontakion1.melody	@ltx/en_us_dedes/me.m11.d03:meMA.Kontakion1.melody
ltx/en_us_dedes/me.m11.d03:meLI.Kontakion1.mode	@ltx/en_us_dedes/me.m11.d03:meMA.Kontakion1.mode
ltx/en_us_dedes/me.m11.d03:meLI.Kontakion1.text	@ltx/en_us_dedes/me.m11.d03:meMA.Kontakion1.text
ltx/en_us_dedes/me.m11.d03:meLI.Megalynarion.text	
ltx/en_us_dedes/me.m11.d03:meLI.Megalynarion2.text	
ltx/en_us_dedes/me.m11.d03:meMA.C1.acrostic.notice1	
ltx/en_us_dedes/me.m11.d03:meMA.C1.acrostic.text	
ltx/en_us_dedes/me.m11.d03:meMA.C1.acrostic.title	
ltx/en_us_dedes/me.m11.d03:meMA.C1.title	@ltx/en_us_dedes/titles:ti.CanonSaints
ltx/en_us_dedes/me.m11.d03:meMA.C1.verse	@ltx/en_us_dedes/prayers:pr.verse_SaintsM.text
ltx/en_us_dedes/me.m11.d03:meMA.C2.acrostic.notice1	
ltx/en_us_dedes/me.m11.d03:meMA.C2.acrostic.text	
ltx/en_us_dedes/me.m11.d03:meMA.C2.acrostic.title	
ltx/en_us_dedes/me.m11.d03:meMA.C2.title	@ltx/en_us_dedes/titles:ti.CanonSaintM
ltx/en_us_dedes/me.m11.d03:meMA.C2.verse	@ltx/en_us_dedes/prayers:pr.verse_SaintM.text
ltx/en_us_dedes/me.m11.d03:meMA.ExapTheotokion.incipit	O Virgin, there is not…
ltx/en_us_dedes/me.m11.d03:meMA.ExapTheotokion.melody	@ltx/en_us_dedes/he.a.m3:heAU.EnPnevmatiToIero.name
ltx/en_us_dedes/me.m11.d03:meMA.ExapTheotokion.mode	@ltx/en_us_dedes/miscellanea:misc.Mode3
ltx/en_us_dedes/me.m11.d03:meMA.ExapTheotokion.text	O Virgin, there is not in me * any hope of salvation. * For I have fallen grievously * into a pit of vices. * And I await what was threatened, * namely ghastly punishment, * to share the goats’ disappointment. * Pity me before my trial, * ardent helper that you are, * my Lady the Theotokos.
ltx/en_us_dedes/me.m11.d03:meMA.Exaposteilarion1.greekmelody	@ltx/en_us_dedes/he.a.m2:heAU.ToisMathitaisSynelthomen.greekname
ltx/en_us_dedes/me.m11.d03:meMA.Exaposteilarion1.incipit	Acepsimas the glorious * with…
ltx/en_us_dedes/me.m11.d03:meMA.Exaposteilarion1.melody	@ltx/en_us_dedes/he.a.m2:heAU.ToisMathitaisSynelthomen.name
ltx/en_us_dedes/me.m11.d03:meMA.Exaposteilarion1.mode	@ltx/en_us_dedes/miscellanea:misc.Mode2
ltx/en_us_dedes/me.m11.d03:meMA.Exaposteilarion1.text	Acepsimas the glorious * with the courageous Joseph * and the all-wise Aeithalas, * by the power of Christ God, * contested and they dismantled * the error of the Persians; * and with the Holy Trinity * they intercede for us. As we now extol * them as hieromartyrs with pious reverence * we celebrate their radiant * memory with rejoicing.
ltx/en_us_dedes/me.m11.d03:meMA.Exaposteilarion2.greekmelody	@ltx/en_us_dedes/he.a.m3:heAU.EnPnevmatiToIero.greekname
ltx/en_us_dedes/me.m11.d03:meMA.Exaposteilarion2.incipit	O blessed martyr, with the…
ltx/en_us_dedes/me.m11.d03:meMA.Exaposteilarion2.melody	@ltx/en_us_dedes/he.a.m3:heAU.EnPnevmatiToIero.name
ltx/en_us_dedes/me.m11.d03:meMA.Exaposteilarion2.mode	@ltx/en_us_dedes/miscellanea:misc.Mode3
ltx/en_us_dedes/me.m11.d03:meMA.Exaposteilarion2.text	O blessed martyr, with the streams * of your blood you extinguished * deception’s flame, and thus you made * the audacious defiance * of tyrants utterly vanish, * thereby glorifying Christ, * O George victorious athlete. * Therefore you received the crown * of incorruption and life * from the right hand of the Most High.
ltx/en_us_dedes/me.m11.d03:meMA.Kontakion1.greekmelody	@ltx/en_us_dedes/he.a.m2:heAU.TaAnoZiton.greekname
ltx/en_us_dedes/me.m11.d03:meMA.Kontakion1.incipit	You solemnly celebrated the divine…
ltx/en_us_dedes/me.m11.d03:meMA.Kontakion1.melody	@ltx/en_us_dedes/he.a.m2:heAU.TaAnoZiton.notmetered
ltx/en_us_dedes/me.m11.d03:meMA.Kontakion1.mode	@ltx/en_us_dedes/miscellanea:misc.Mode2
ltx/en_us_dedes/me.m11.d03:meMA.Kontakion1.text	You solemnly celebrated the divine liturgy, and you became an acceptable sacrifice, all-blessed St. Acepsimas. You gloriously drank the cup of Christ; and along with your fellow martyrs, you never cease interceding on behalf of us all.
ltx/en_us_dedes/me.m11.d03:meMA.Kontakion2.greekmelody	@ltx/en_us_dedes/he.a.m8:heAU.TiYpermacho.greekname
ltx/en_us_dedes/me.m11.d03:meMA.Kontakion2.incipit	As we believers who extol…
ltx/en_us_dedes/me.m11.d03:meMA.Kontakion2.melody	@ltx/en_us_dedes/he.a.m8:heAU.TiYpermacho.notmetered
ltx/en_us_dedes/me.m11.d03:meMA.Kontakion2.mode	@ltx/en_us_dedes/miscellanea:misc.Mode8
ltx/en_us_dedes/me.m11.d03:meMA.Kontakion2.text	As we believers who extol you take refuge in your speedy help as our champion, we entreat that Christ will rescue us from the scandals of the enemy, and from every harm and danger, so that we may salute you and say: Rejoice, O Great-martyr George!
ltx/en_us_dedes/me.m11.d03:meMA.Lauds1.greekmelody	@ltx/en_us_dedes/he.a.m4:heAU.OsGennaionEnMartysi.greekname
ltx/en_us_dedes/me.m11.d03:meMA.Lauds1.incipit	To a brave one in…
ltx/en_us_dedes/me.m11.d03:meMA.Lauds1.melody	@ltx/en_us_dedes/he.a.m4:heAU.OsGennaionEnMartysi.name
ltx/en_us_dedes/me.m11.d03:meMA.Lauds1.mode	@ltx/en_us_dedes/miscellanea:misc.Mode4
ltx/en_us_dedes/me.m11.d03:meMA.Lauds1.text	To a brave one in martyr saints, * Christ’s own tillage and georgic field, * let us sing the praises of wise great martyr George. * He was a preacher of truth divine; * and an ever-living branch * of the vine of life was he, * in abundance producing fruit, * also gushing forth * the sweet wine of the Orthodox religion; and he gladdens those who yearly * observe his memory faithfully.
ltx/en_us_dedes/me.m11.d03:meMA.Lauds2.incipit	@ltx/en_us_dedes/me.m04.d23:meVE.Stichera05.incipit
ltx/en_us_dedes/me.m11.d03:meMA.Lauds2.melody	@ltx/en_us_dedes/he.a.m4:heAU.OsGennaionEnMartysi.name
ltx/en_us_dedes/me.m11.d03:meMA.Lauds2.mode	@ltx/en_us_dedes/miscellanea:misc.Mode4
ltx/en_us_dedes/me.m11.d03:meMA.Lauds2.text	@ltx/en_us_dedes/me.m04.d23:meVE.Stichera05.text
ltx/en_us_dedes/me.m11.d03:meMA.Lauds3.incipit	@ltx/en_us_dedes/me.m04.d23:meVE.Stichera06.incipit
ltx/en_us_dedes/me.m11.d03:meMA.Lauds3.melody	@ltx/en_us_dedes/he.a.m4:heAU.OsGennaionEnMartysi.name
ltx/en_us_dedes/me.m11.d03:meMA.Lauds3.mode	@ltx/en_us_dedes/miscellanea:misc.Mode4
ltx/en_us_dedes/me.m11.d03:meMA.Lauds3.text	@ltx/en_us_dedes/me.m04.d23:meVE.Stichera06.text
ltx/en_us_dedes/me.m11.d03:meMA.LaudsGlory.incipit	@ltx/en_us_dedes/me.m04.d23:meVE.AposGlory.incipit
ltx/en_us_dedes/me.m11.d03:meMA.LaudsGlory.melody	
ltx/en_us_dedes/me.m11.d03:meMA.LaudsGlory.mode	@ltx/en_us_dedes/miscellanea:misc.Mode4
ltx/en_us_dedes/me.m11.d03:meMA.LaudsGlory.text	@ltx/en_us_dedes/me.m04.d23:meVE.AposGlory.text
ltx/en_us_dedes/me.m11.d03:meMA.LaudsTheotokion.greekmelody	@ltx/en_us_dedes/he.a.m4:heAU.EdokasSimeiosin.greekname
ltx/en_us_dedes/me.m11.d03:meMA.LaudsTheotokion.incipit	@ltx/en_us_dedes/oc.m4.d4:ocVE.Stichera6.incipit
ltx/en_us_dedes/me.m11.d03:meMA.LaudsTheotokion.melody	@ltx/en_us_dedes/he.a.m4:heAU.EdokasSimeiosin.name
ltx/en_us_dedes/me.m11.d03:meMA.LaudsTheotokion.mode	@ltx/en_us_dedes/miscellanea:misc.Mode4
ltx/en_us_dedes/me.m11.d03:meMA.LaudsTheotokion.text	@ltx/en_us_dedes/oc.m4.d4:ocVE.Stichera6.text
ltx/en_us_dedes/me.m11.d03:meMA.MM.Lauds1123as5678.text	@ltx/en_us_dedes/properties:media.key
ltx/en_us_dedes/me.m11.d03:meMA.Ode1C11.greekmelody	@ltx/en_us_dedes/he.h.m1:heHE.SouITropaiouchos.greekname
ltx/en_us_dedes/me.m11.d03:meMA.Ode1C11.incipit	…
ltx/en_us_dedes/me.m11.d03:meMA.Ode1C11.melody	@ltx/en_us_dedes/he.h.m1:heHE.SouITropaiouchos.name
ltx/en_us_dedes/me.m11.d03:meMA.Ode1C11.mode	@ltx/en_us_dedes/miscellanea:misc.Mode1
ltx/en_us_dedes/me.m11.d03:meMA.Ode1C11.ode	@ltx/en_us_dedes/miscellanea:misc.Ode1
ltx/en_us_dedes/me.m11.d03:meMA.Ode1C11.text	
ltx/en_us_dedes/me.m11.d03:meMA.Ode1C12.incipit	…
ltx/en_us_dedes/me.m11.d03:meMA.Ode1C12.melody	@ltx/en_us_dedes/he.h.m1:heHE.SouITropaiouchos.name
ltx/en_us_dedes/me.m11.d03:meMA.Ode1C12.mode	@ltx/en_us_dedes/miscellanea:misc.Mode1
ltx/en_us_dedes/me.m11.d03:meMA.Ode1C12.ode	@ltx/en_us_dedes/miscellanea:misc.Ode1
ltx/en_us_dedes/me.m11.d03:meMA.Ode1C12.text	
ltx/en_us_dedes/me.m11.d03:meMA.Ode1C13.incipit	…
ltx/en_us_dedes/me.m11.d03:meMA.Ode1C13.melody	@ltx/en_us_dedes/he.h.m1:heHE.SouITropaiouchos.name
ltx/en_us_dedes/me.m11.d03:meMA.Ode1C13.mode	@ltx/en_us_dedes/miscellanea:misc.Mode1
ltx/en_us_dedes/me.m11.d03:meMA.Ode1C13.ode	@ltx/en_us_dedes/miscellanea:misc.Ode1
ltx/en_us_dedes/me.m11.d03:meMA.Ode1C13.text	
ltx/en_us_dedes/me.m11.d03:meMA.Ode1C1T.incipit	…
ltx/en_us_dedes/me.m11.d03:meMA.Ode1C1T.melody	@ltx/en_us_dedes/he.h.m1:heHE.SouITropaiouchos.name
ltx/en_us_dedes/me.m11.d03:meMA.Ode1C1T.mode	@ltx/en_us_dedes/miscellanea:misc.Mode1
ltx/en_us_dedes/me.m11.d03:meMA.Ode1C1T.ode	@ltx/en_us_dedes/miscellanea:misc.Ode1
ltx/en_us_dedes/me.m11.d03:meMA.Ode1C1T.text	
ltx/en_us_dedes/me.m11.d03:meMA.Ode1C21.greekmelody	@ltx/en_us_dedes/he.h.m4:heHE.ToOdigisantiPalai.greekname
ltx/en_us_dedes/me.m11.d03:meMA.Ode1C21.incipit	…
ltx/en_us_dedes/me.m11.d03:meMA.Ode1C21.melody	@ltx/en_us_dedes/he.h.m4:heHE.ToOdigisantiPalai.name
ltx/en_us_dedes/me.m11.d03:meMA.Ode1C21.mode	@ltx/en_us_dedes/miscellanea:misc.Mode4
ltx/en_us_dedes/me.m11.d03:meMA.Ode1C21.ode	@ltx/en_us_dedes/miscellanea:misc.Ode1
ltx/en_us_dedes/me.m11.d03:meMA.Ode1C21.text	
ltx/en_us_dedes/me.m11.d03:meMA.Ode1C22.incipit	…
ltx/en_us_dedes/me.m11.d03:meMA.Ode1C22.melody	@ltx/en_us_dedes/he.h.m4:heHE.ToOdigisantiPalai.name
ltx/en_us_dedes/me.m11.d03:meMA.Ode1C22.mode	@ltx/en_us_dedes/miscellanea:misc.Mode4
ltx/en_us_dedes/me.m11.d03:meMA.Ode1C22.ode	@ltx/en_us_dedes/miscellanea:misc.Ode1
ltx/en_us_dedes/me.m11.d03:meMA.Ode1C22.text	
ltx/en_us_dedes/me.m11.d03:meMA.Ode1C23.incipit	…
ltx/en_us_dedes/me.m11.d03:meMA.Ode1C23.melody	@ltx/en_us_dedes/he.h.m4:heHE.ToOdigisantiPalai.name
ltx/en_us_dedes/me.m11.d03:meMA.Ode1C23.mode	@ltx/en_us_dedes/miscellanea:misc.Mode4
ltx/en_us_dedes/me.m11.d03:meMA.Ode1C23.ode	@ltx/en_us_dedes/miscellanea:misc.Ode1
ltx/en_us_dedes/me.m11.d03:meMA.Ode1C23.text	
ltx/en_us_dedes/me.m11.d03:meMA.Ode1C2T.incipit	…
ltx/en_us_dedes/me.m11.d03:meMA.Ode1C2T.melody	@ltx/en_us_dedes/he.h.m4:heHE.ToOdigisantiPalai.name
ltx/en_us_dedes/me.m11.d03:meMA.Ode1C2T.mode	@ltx/en_us_dedes/miscellanea:misc.Mode4
ltx/en_us_dedes/me.m11.d03:meMA.Ode1C2T.ode	@ltx/en_us_dedes/miscellanea:misc.Ode1
ltx/en_us_dedes/me.m11.d03:meMA.Ode1C2T.text	
ltx/en_us_dedes/me.m11.d03:meMA.Ode3C11.greekmelody	@ltx/en_us_dedes/he.h.m1:heHE.OMonosEidos.greekname
ltx/en_us_dedes/me.m11.d03:meMA.Ode3C11.incipit	…
ltx/en_us_dedes/me.m11.d03:meMA.Ode3C11.melody	@ltx/en_us_dedes/he.h.m1:heHE.OMonosEidos.name
ltx/en_us_dedes/me.m11.d03:meMA.Ode3C11.mode	@ltx/en_us_dedes/miscellanea:misc.Mode1
ltx/en_us_dedes/me.m11.d03:meMA.Ode3C11.ode	@ltx/en_us_dedes/miscellanea:misc.Ode3
ltx/en_us_dedes/me.m11.d03:meMA.Ode3C11.text	
ltx/en_us_dedes/me.m11.d03:meMA.Ode3C12.incipit	…
ltx/en_us_dedes/me.m11.d03:meMA.Ode3C12.melody	@ltx/en_us_dedes/he.h.m1:heHE.OMonosEidos.name
ltx/en_us_dedes/me.m11.d03:meMA.Ode3C12.mode	@ltx/en_us_dedes/miscellanea:misc.Mode1
ltx/en_us_dedes/me.m11.d03:meMA.Ode3C12.ode	@ltx/en_us_dedes/miscellanea:misc.Ode3
ltx/en_us_dedes/me.m11.d03:meMA.Ode3C12.text	
ltx/en_us_dedes/me.m11.d03:meMA.Ode3C13.incipit	…
ltx/en_us_dedes/me.m11.d03:meMA.Ode3C13.melody	@ltx/en_us_dedes/he.h.m1:heHE.OMonosEidos.name
ltx/en_us_dedes/me.m11.d03:meMA.Ode3C13.mode	@ltx/en_us_dedes/miscellanea:misc.Mode1
ltx/en_us_dedes/me.m11.d03:meMA.Ode3C13.ode	@ltx/en_us_dedes/miscellanea:misc.Ode3
ltx/en_us_dedes/me.m11.d03:meMA.Ode3C13.text	
ltx/en_us_dedes/me.m11.d03:meMA.Ode3C1T.incipit	…
ltx/en_us_dedes/me.m11.d03:meMA.Ode3C1T.melody	@ltx/en_us_dedes/he.h.m1:heHE.OMonosEidos.name
ltx/en_us_dedes/me.m11.d03:meMA.Ode3C1T.mode	@ltx/en_us_dedes/miscellanea:misc.Mode1
ltx/en_us_dedes/me.m11.d03:meMA.Ode3C1T.ode	@ltx/en_us_dedes/miscellanea:misc.Ode3
ltx/en_us_dedes/me.m11.d03:meMA.Ode3C1T.text	
ltx/en_us_dedes/me.m11.d03:meMA.Ode3C21.greekmelody	@ltx/en_us_dedes/he.h.m4:heHE.OStereonVrontin.greekname
ltx/en_us_dedes/me.m11.d03:meMA.Ode3C21.incipit	…
ltx/en_us_dedes/me.m11.d03:meMA.Ode3C21.melody	@ltx/en_us_dedes/he.h.m4:heHE.OStereonVrontin.name
ltx/en_us_dedes/me.m11.d03:meMA.Ode3C21.mode	@ltx/en_us_dedes/miscellanea:misc.Mode4
ltx/en_us_dedes/me.m11.d03:meMA.Ode3C21.ode	@ltx/en_us_dedes/miscellanea:misc.Ode3
ltx/en_us_dedes/me.m11.d03:meMA.Ode3C21.text	
ltx/en_us_dedes/me.m11.d03:meMA.Ode3C22.incipit	…
ltx/en_us_dedes/me.m11.d03:meMA.Ode3C22.melody	@ltx/en_us_dedes/he.h.m4:heHE.OStereonVrontin.name
ltx/en_us_dedes/me.m11.d03:meMA.Ode3C22.mode	@ltx/en_us_dedes/miscellanea:misc.Mode4
ltx/en_us_dedes/me.m11.d03:meMA.Ode3C22.ode	@ltx/en_us_dedes/miscellanea:misc.Ode3
ltx/en_us_dedes/me.m11.d03:meMA.Ode3C22.text	
ltx/en_us_dedes/me.m11.d03:meMA.Ode3C23.incipit	…
ltx/en_us_dedes/me.m11.d03:meMA.Ode3C23.melody	@ltx/en_us_dedes/he.h.m4:heHE.OStereonVrontin.name
ltx/en_us_dedes/me.m11.d03:meMA.Ode3C23.mode	@ltx/en_us_dedes/miscellanea:misc.Mode4
ltx/en_us_dedes/me.m11.d03:meMA.Ode3C23.ode	@ltx/en_us_dedes/miscellanea:misc.Ode3
ltx/en_us_dedes/me.m11.d03:meMA.Ode3C23.text	
ltx/en_us_dedes/me.m11.d03:meMA.Ode3C2T.incipit	…
ltx/en_us_dedes/me.m11.d03:meMA.Ode3C2T.melody	@ltx/en_us_dedes/he.h.m4:heHE.OStereonVrontin.name
ltx/en_us_dedes/me.m11.d03:meMA.Ode3C2T.mode	@ltx/en_us_dedes/miscellanea:misc.Mode4
ltx/en_us_dedes/me.m11.d03:meMA.Ode3C2T.ode	@ltx/en_us_dedes/miscellanea:misc.Ode3
ltx/en_us_dedes/me.m11.d03:meMA.Ode3C2T.text	
ltx/en_us_dedes/me.m11.d03:meMA.Ode3H.greekmelody	@ltx/en_us_dedes/he.h.m4:heHE.OStereonVrontin.greekname
ltx/en_us_dedes/me.m11.d03:meMA.Ode3H.incipit	@ltx/en_us_dedes/he.h.m4:heHE.OStereonVrontin.incipit
ltx/en_us_dedes/me.m11.d03:meMA.Ode3H.melody	@ltx/en_us_dedes/he.h.m4:heHE.OStereonVrontin.melody
ltx/en_us_dedes/me.m11.d03:meMA.Ode3H.mode	@ltx/en_us_dedes/miscellanea:misc.Mode4
ltx/en_us_dedes/me.m11.d03:meMA.Ode3H.ode	@ltx/en_us_dedes/miscellanea:misc.Ode3
ltx/en_us_dedes/me.m11.d03:meMA.Ode3H.text	@ltx/en_us_dedes/he.h.m4:heHE.OStereonVrontin.text
ltx/en_us_dedes/me.m11.d03:meMA.Ode3Kathisma1.greekmelody	@ltx/en_us_dedes/he.a.m8:heAU.TinSofianKaiLogon.greekname
ltx/en_us_dedes/me.m11.d03:meMA.Ode3Kathisma1.incipit	…
ltx/en_us_dedes/me.m11.d03:meMA.Ode3Kathisma1.melody	@ltx/en_us_dedes/he.a.m8:heAU.TinSofianKaiLogon.name
ltx/en_us_dedes/me.m11.d03:meMA.Ode3Kathisma1.mode	@ltx/en_us_dedes/miscellanea:misc.Mode8
ltx/en_us_dedes/me.m11.d03:meMA.Ode3Kathisma1.text	
ltx/en_us_dedes/me.m11.d03:meMA.Ode3Kathisma2.greekmelody	@ltx/en_us_dedes/he.a.m8:heAU.TinSofianKaiLogon.greekname
ltx/en_us_dedes/me.m11.d03:meMA.Ode3Kathisma2.incipit	…
ltx/en_us_dedes/me.m11.d03:meMA.Ode3Kathisma2.melody	@ltx/en_us_dedes/he.a.m8:heAU.TinSofianKaiLogon.name
ltx/en_us_dedes/me.m11.d03:meMA.Ode3Kathisma2.mode	@ltx/en_us_dedes/miscellanea:misc.Mode8
ltx/en_us_dedes/me.m11.d03:meMA.Ode3Kathisma2.text	
ltx/en_us_dedes/me.m11.d03:meMA.Ode3KathismaSt.incipit	@ltx/en_us_dedes/oc.m8.d4:ocMA.Kathisma13.incipit
ltx/en_us_dedes/me.m11.d03:meMA.Ode3KathismaSt.melody	@ltx/en_us_dedes/he.a.m8:heAU.TinSofianKaiLogon.name
ltx/en_us_dedes/me.m11.d03:meMA.Ode3KathismaSt.mode	@ltx/en_us_dedes/miscellanea:misc.Mode8
ltx/en_us_dedes/me.m11.d03:meMA.Ode3KathismaSt.text	@ltx/en_us_dedes/oc.m8.d4:ocMA.Kathisma13.text
ltx/en_us_dedes/me.m11.d03:meMA.Ode3KathismaT.incipit	@ltx/en_us_dedes/me.m06.d29:meMA.Kathisma2T.incipit
ltx/en_us_dedes/me.m11.d03:meMA.Ode3KathismaT.melody	@ltx/en_us_dedes/he.a.m8:heAU.TinSofianKaiLogon.name
ltx/en_us_dedes/me.m11.d03:meMA.Ode3KathismaT.mode	@ltx/en_us_dedes/miscellanea:misc.Mode8
ltx/en_us_dedes/me.m11.d03:meMA.Ode3KathismaT.text	@ltx/en_us_dedes/me.m06.d29:meMA.Kathisma2T.text
ltx/en_us_dedes/me.m11.d03:meMA.Ode4C11.greekmelody	@ltx/en_us_dedes/he.h.m1:heHE.OrosSeTiChariti.greekname
ltx/en_us_dedes/me.m11.d03:meMA.Ode4C11.incipit	…
ltx/en_us_dedes/me.m11.d03:meMA.Ode4C11.melody	@ltx/en_us_dedes/he.h.m1:heHE.OrosSeTiChariti.name
ltx/en_us_dedes/me.m11.d03:meMA.Ode4C11.mode	@ltx/en_us_dedes/miscellanea:misc.Mode1
ltx/en_us_dedes/me.m11.d03:meMA.Ode4C11.ode	@ltx/en_us_dedes/miscellanea:misc.Ode4
ltx/en_us_dedes/me.m11.d03:meMA.Ode4C11.text	
ltx/en_us_dedes/me.m11.d03:meMA.Ode4C12.incipit	…
ltx/en_us_dedes/me.m11.d03:meMA.Ode4C12.melody	@ltx/en_us_dedes/he.h.m1:heHE.OrosSeTiChariti.name
ltx/en_us_dedes/me.m11.d03:meMA.Ode4C12.mode	@ltx/en_us_dedes/miscellanea:misc.Mode1
ltx/en_us_dedes/me.m11.d03:meMA.Ode4C12.ode	@ltx/en_us_dedes/miscellanea:misc.Ode4
ltx/en_us_dedes/me.m11.d03:meMA.Ode4C12.text	
ltx/en_us_dedes/me.m11.d03:meMA.Ode4C13.incipit	…
ltx/en_us_dedes/me.m11.d03:meMA.Ode4C13.melody	@ltx/en_us_dedes/he.h.m1:heHE.OrosSeTiChariti.name
ltx/en_us_dedes/me.m11.d03:meMA.Ode4C13.mode	@ltx/en_us_dedes/miscellanea:misc.Mode1
ltx/en_us_dedes/me.m11.d03:meMA.Ode4C13.ode	@ltx/en_us_dedes/miscellanea:misc.Ode4
ltx/en_us_dedes/me.m11.d03:meMA.Ode4C13.text	
ltx/en_us_dedes/me.m11.d03:meMA.Ode4C1T.incipit	…
ltx/en_us_dedes/me.m11.d03:meMA.Ode4C1T.melody	@ltx/en_us_dedes/he.h.m1:heHE.OrosSeTiChariti.name
ltx/en_us_dedes/me.m11.d03:meMA.Ode4C1T.mode	@ltx/en_us_dedes/miscellanea:misc.Mode1
ltx/en_us_dedes/me.m11.d03:meMA.Ode4C1T.ode	@ltx/en_us_dedes/miscellanea:misc.Ode4
ltx/en_us_dedes/me.m11.d03:meMA.Ode4C1T.text	
ltx/en_us_dedes/me.m11.d03:meMA.Ode4C21.greekmelody	@ltx/en_us_dedes/he.h.m4:heHE.EisakikoaKyrie.greekname
ltx/en_us_dedes/me.m11.d03:meMA.Ode4C21.incipit	…
ltx/en_us_dedes/me.m11.d03:meMA.Ode4C21.melody	@ltx/en_us_dedes/he.h.m4:heHE.EisakikoaKyrie.name
ltx/en_us_dedes/me.m11.d03:meMA.Ode4C21.mode	@ltx/en_us_dedes/miscellanea:misc.Mode4
ltx/en_us_dedes/me.m11.d03:meMA.Ode4C21.ode	@ltx/en_us_dedes/miscellanea:misc.Ode4
ltx/en_us_dedes/me.m11.d03:meMA.Ode4C21.text	
ltx/en_us_dedes/me.m11.d03:meMA.Ode4C22.incipit	…
ltx/en_us_dedes/me.m11.d03:meMA.Ode4C22.melody	@ltx/en_us_dedes/he.h.m4:heHE.EisakikoaKyrie.name
ltx/en_us_dedes/me.m11.d03:meMA.Ode4C22.mode	@ltx/en_us_dedes/miscellanea:misc.Mode4
ltx/en_us_dedes/me.m11.d03:meMA.Ode4C22.ode	@ltx/en_us_dedes/miscellanea:misc.Ode4
ltx/en_us_dedes/me.m11.d03:meMA.Ode4C22.text	
ltx/en_us_dedes/me.m11.d03:meMA.Ode4C23.incipit	…
ltx/en_us_dedes/me.m11.d03:meMA.Ode4C23.melody	@ltx/en_us_dedes/he.h.m4:heHE.EisakikoaKyrie.name
ltx/en_us_dedes/me.m11.d03:meMA.Ode4C23.mode	@ltx/en_us_dedes/miscellanea:misc.Mode4
ltx/en_us_dedes/me.m11.d03:meMA.Ode4C23.ode	@ltx/en_us_dedes/miscellanea:misc.Ode4
ltx/en_us_dedes/me.m11.d03:meMA.Ode4C23.text	
ltx/en_us_dedes/me.m11.d03:meMA.Ode4C2T.incipit	…
ltx/en_us_dedes/me.m11.d03:meMA.Ode4C2T.melody	@ltx/en_us_dedes/he.h.m4:heHE.EisakikoaKyrie.name
ltx/en_us_dedes/me.m11.d03:meMA.Ode4C2T.mode	@ltx/en_us_dedes/miscellanea:misc.Mode4
ltx/en_us_dedes/me.m11.d03:meMA.Ode4C2T.ode	@ltx/en_us_dedes/miscellanea:misc.Ode4
ltx/en_us_dedes/me.m11.d03:meMA.Ode4C2T.text	
ltx/en_us_dedes/me.m11.d03:meMA.Ode5C11.greekmelody	@ltx/en_us_dedes/he.h.m1:heHE.OFotisasTiEllampsei.greekname
ltx/en_us_dedes/me.m11.d03:meMA.Ode5C11.incipit	…
ltx/en_us_dedes/me.m11.d03:meMA.Ode5C11.melody	@ltx/en_us_dedes/he.h.m1:heHE.OFotisasTiEllampsei.name
ltx/en_us_dedes/me.m11.d03:meMA.Ode5C11.mode	@ltx/en_us_dedes/miscellanea:misc.Mode1
ltx/en_us_dedes/me.m11.d03:meMA.Ode5C11.ode	@ltx/en_us_dedes/miscellanea:misc.Ode5
ltx/en_us_dedes/me.m11.d03:meMA.Ode5C11.text	
ltx/en_us_dedes/me.m11.d03:meMA.Ode5C12.incipit	…
ltx/en_us_dedes/me.m11.d03:meMA.Ode5C12.melody	@ltx/en_us_dedes/he.h.m1:heHE.OFotisasTiEllampsei.name
ltx/en_us_dedes/me.m11.d03:meMA.Ode5C12.mode	@ltx/en_us_dedes/miscellanea:misc.Mode1
ltx/en_us_dedes/me.m11.d03:meMA.Ode5C12.ode	@ltx/en_us_dedes/miscellanea:misc.Ode5
ltx/en_us_dedes/me.m11.d03:meMA.Ode5C12.text	
ltx/en_us_dedes/me.m11.d03:meMA.Ode5C13.incipit	…
ltx/en_us_dedes/me.m11.d03:meMA.Ode5C13.melody	@ltx/en_us_dedes/he.h.m1:heHE.OFotisasTiEllampsei.name
ltx/en_us_dedes/me.m11.d03:meMA.Ode5C13.mode	@ltx/en_us_dedes/miscellanea:misc.Mode1
ltx/en_us_dedes/me.m11.d03:meMA.Ode5C13.ode	@ltx/en_us_dedes/miscellanea:misc.Ode5
ltx/en_us_dedes/me.m11.d03:meMA.Ode5C13.text	
ltx/en_us_dedes/me.m11.d03:meMA.Ode5C1T.incipit	…
ltx/en_us_dedes/me.m11.d03:meMA.Ode5C1T.melody	@ltx/en_us_dedes/he.h.m1:heHE.OFotisasTiEllampsei.name
ltx/en_us_dedes/me.m11.d03:meMA.Ode5C1T.mode	@ltx/en_us_dedes/miscellanea:misc.Mode1
ltx/en_us_dedes/me.m11.d03:meMA.Ode5C1T.ode	@ltx/en_us_dedes/miscellanea:misc.Ode5
ltx/en_us_dedes/me.m11.d03:meMA.Ode5C1T.text	
ltx/en_us_dedes/me.m11.d03:meMA.Ode5C21.greekmelody	@ltx/en_us_dedes/he.h.m4:heHE.AnateilonMoiKyrie.greekname
ltx/en_us_dedes/me.m11.d03:meMA.Ode5C21.incipit	…
ltx/en_us_dedes/me.m11.d03:meMA.Ode5C21.melody	@ltx/en_us_dedes/he.h.m4:heHE.AnateilonMoiKyrie.name
ltx/en_us_dedes/me.m11.d03:meMA.Ode5C21.mode	@ltx/en_us_dedes/miscellanea:misc.Mode4
ltx/en_us_dedes/me.m11.d03:meMA.Ode5C21.ode	@ltx/en_us_dedes/miscellanea:misc.Ode5
ltx/en_us_dedes/me.m11.d03:meMA.Ode5C21.text	
ltx/en_us_dedes/me.m11.d03:meMA.Ode5C22.incipit	…
ltx/en_us_dedes/me.m11.d03:meMA.Ode5C22.melody	@ltx/en_us_dedes/he.h.m4:heHE.AnateilonMoiKyrie.name
ltx/en_us_dedes/me.m11.d03:meMA.Ode5C22.mode	@ltx/en_us_dedes/miscellanea:misc.Mode4
ltx/en_us_dedes/me.m11.d03:meMA.Ode5C22.ode	@ltx/en_us_dedes/miscellanea:misc.Ode5
ltx/en_us_dedes/me.m11.d03:meMA.Ode5C22.text	
ltx/en_us_dedes/me.m11.d03:meMA.Ode5C23.incipit	…
ltx/en_us_dedes/me.m11.d03:meMA.Ode5C23.melody	@ltx/en_us_dedes/he.h.m4:heHE.AnateilonMoiKyrie.name
ltx/en_us_dedes/me.m11.d03:meMA.Ode5C23.mode	@ltx/en_us_dedes/miscellanea:misc.Mode4
ltx/en_us_dedes/me.m11.d03:meMA.Ode5C23.ode	@ltx/en_us_dedes/miscellanea:misc.Ode5
ltx/en_us_dedes/me.m11.d03:meMA.Ode5C23.text	
ltx/en_us_dedes/me.m11.d03:meMA.Ode5C2T.incipit	…
ltx/en_us_dedes/me.m11.d03:meMA.Ode5C2T.melody	@ltx/en_us_dedes/he.h.m4:heHE.AnateilonMoiKyrie.name
ltx/en_us_dedes/me.m11.d03:meMA.Ode5C2T.mode	@ltx/en_us_dedes/miscellanea:misc.Mode4
ltx/en_us_dedes/me.m11.d03:meMA.Ode5C2T.ode	@ltx/en_us_dedes/miscellanea:misc.Ode5
ltx/en_us_dedes/me.m11.d03:meMA.Ode5C2T.text	
ltx/en_us_dedes/me.m11.d03:meMA.Ode6C11.greekmelody	@ltx/en_us_dedes/he.h.m1:heHE.EkyklosenImas.greekname
ltx/en_us_dedes/me.m11.d03:meMA.Ode6C11.incipit	…
ltx/en_us_dedes/me.m11.d03:meMA.Ode6C11.melody	@ltx/en_us_dedes/he.h.m1:heHE.EkyklosenImas.name
ltx/en_us_dedes/me.m11.d03:meMA.Ode6C11.mode	@ltx/en_us_dedes/miscellanea:misc.Mode1
ltx/en_us_dedes/me.m11.d03:meMA.Ode6C11.ode	@ltx/en_us_dedes/miscellanea:misc.Ode6
ltx/en_us_dedes/me.m11.d03:meMA.Ode6C11.text	
ltx/en_us_dedes/me.m11.d03:meMA.Ode6C12.incipit	…
ltx/en_us_dedes/me.m11.d03:meMA.Ode6C12.melody	@ltx/en_us_dedes/he.h.m1:heHE.EkyklosenImas.name
ltx/en_us_dedes/me.m11.d03:meMA.Ode6C12.mode	@ltx/en_us_dedes/miscellanea:misc.Mode1
ltx/en_us_dedes/me.m11.d03:meMA.Ode6C12.ode	@ltx/en_us_dedes/miscellanea:misc.Ode6
ltx/en_us_dedes/me.m11.d03:meMA.Ode6C12.text	
ltx/en_us_dedes/me.m11.d03:meMA.Ode6C13.incipit	…
ltx/en_us_dedes/me.m11.d03:meMA.Ode6C13.melody	@ltx/en_us_dedes/he.h.m1:heHE.EkyklosenImas.name
ltx/en_us_dedes/me.m11.d03:meMA.Ode6C13.mode	@ltx/en_us_dedes/miscellanea:misc.Mode1
ltx/en_us_dedes/me.m11.d03:meMA.Ode6C13.ode	@ltx/en_us_dedes/miscellanea:misc.Ode6
ltx/en_us_dedes/me.m11.d03:meMA.Ode6C13.text	
ltx/en_us_dedes/me.m11.d03:meMA.Ode6C1T.incipit	…
ltx/en_us_dedes/me.m11.d03:meMA.Ode6C1T.melody	@ltx/en_us_dedes/he.h.m1:heHE.EkyklosenImas.name
ltx/en_us_dedes/me.m11.d03:meMA.Ode6C1T.mode	@ltx/en_us_dedes/miscellanea:misc.Mode1
ltx/en_us_dedes/me.m11.d03:meMA.Ode6C1T.ode	@ltx/en_us_dedes/miscellanea:misc.Ode6
ltx/en_us_dedes/me.m11.d03:meMA.Ode6C1T.text	
ltx/en_us_dedes/me.m11.d03:meMA.Ode6C21.greekmelody	@ltx/en_us_dedes/he.h.m4:heHE.ZaliMeLogismon.greekname
ltx/en_us_dedes/me.m11.d03:meMA.Ode6C21.incipit	…
ltx/en_us_dedes/me.m11.d03:meMA.Ode6C21.melody	@ltx/en_us_dedes/he.h.m4:heHE.ZaliMeLogismon.name
ltx/en_us_dedes/me.m11.d03:meMA.Ode6C21.mode	@ltx/en_us_dedes/miscellanea:misc.Mode4
ltx/en_us_dedes/me.m11.d03:meMA.Ode6C21.ode	@ltx/en_us_dedes/miscellanea:misc.Ode6
ltx/en_us_dedes/me.m11.d03:meMA.Ode6C21.text	
ltx/en_us_dedes/me.m11.d03:meMA.Ode6C22.incipit	…
ltx/en_us_dedes/me.m11.d03:meMA.Ode6C22.melody	@ltx/en_us_dedes/he.h.m4:heHE.ZaliMeLogismon.name
ltx/en_us_dedes/me.m11.d03:meMA.Ode6C22.mode	@ltx/en_us_dedes/miscellanea:misc.Mode4
ltx/en_us_dedes/me.m11.d03:meMA.Ode6C22.ode	@ltx/en_us_dedes/miscellanea:misc.Ode6
ltx/en_us_dedes/me.m11.d03:meMA.Ode6C22.text	
ltx/en_us_dedes/me.m11.d03:meMA.Ode6C23.incipit	…
ltx/en_us_dedes/me.m11.d03:meMA.Ode6C23.melody	@ltx/en_us_dedes/he.h.m4:heHE.ZaliMeLogismon.name
ltx/en_us_dedes/me.m11.d03:meMA.Ode6C23.mode	@ltx/en_us_dedes/miscellanea:misc.Mode4
ltx/en_us_dedes/me.m11.d03:meMA.Ode6C23.ode	@ltx/en_us_dedes/miscellanea:misc.Ode6
ltx/en_us_dedes/me.m11.d03:meMA.Ode6C23.text	
ltx/en_us_dedes/me.m11.d03:meMA.Ode6C2T.incipit	…
ltx/en_us_dedes/me.m11.d03:meMA.Ode6C2T.melody	@ltx/en_us_dedes/he.h.m4:heHE.ZaliMeLogismon.name
ltx/en_us_dedes/me.m11.d03:meMA.Ode6C2T.mode	@ltx/en_us_dedes/miscellanea:misc.Mode4
ltx/en_us_dedes/me.m11.d03:meMA.Ode6C2T.ode	@ltx/en_us_dedes/miscellanea:misc.Ode6
ltx/en_us_dedes/me.m11.d03:meMA.Ode6C2T.text	
ltx/en_us_dedes/me.m11.d03:meMA.Ode6H.greekmelody	@ltx/en_us_dedes/he.h.m4:heHE.ZaliMeLogismon.greekname
ltx/en_us_dedes/me.m11.d03:meMA.Ode6H.incipit	@ltx/en_us_dedes/he.h.m4:heHE.ZaliMeLogismon.incipit
ltx/en_us_dedes/me.m11.d03:meMA.Ode6H.melody	@ltx/en_us_dedes/he.h.m4:heHE.ZaliMeLogismon.melody
ltx/en_us_dedes/me.m11.d03:meMA.Ode6H.mode	@ltx/en_us_dedes/miscellanea:misc.Mode4
ltx/en_us_dedes/me.m11.d03:meMA.Ode6H.ode	@ltx/en_us_dedes/miscellanea:misc.Ode6
ltx/en_us_dedes/me.m11.d03:meMA.Ode6H.text	@ltx/en_us_dedes/he.h.m4:heHE.ZaliMeLogismon.text
ltx/en_us_dedes/me.m11.d03:meMA.Ode7C11.greekmelody	@ltx/en_us_dedes/he.h.m1:heHE.SeNoitin.greekname
ltx/en_us_dedes/me.m11.d03:meMA.Ode7C11.incipit	…
ltx/en_us_dedes/me.m11.d03:meMA.Ode7C11.melody	@ltx/en_us_dedes/he.h.m1:heHE.SeNoitin.name
ltx/en_us_dedes/me.m11.d03:meMA.Ode7C11.mode	@ltx/en_us_dedes/miscellanea:misc.Mode1
ltx/en_us_dedes/me.m11.d03:meMA.Ode7C11.ode	@ltx/en_us_dedes/miscellanea:misc.Ode7
ltx/en_us_dedes/me.m11.d03:meMA.Ode7C11.text	
ltx/en_us_dedes/me.m11.d03:meMA.Ode7C12.incipit	…
ltx/en_us_dedes/me.m11.d03:meMA.Ode7C12.melody	@ltx/en_us_dedes/he.h.m1:heHE.SeNoitin.name
ltx/en_us_dedes/me.m11.d03:meMA.Ode7C12.mode	@ltx/en_us_dedes/miscellanea:misc.Mode1
ltx/en_us_dedes/me.m11.d03:meMA.Ode7C12.ode	@ltx/en_us_dedes/miscellanea:misc.Ode7
ltx/en_us_dedes/me.m11.d03:meMA.Ode7C12.text	
ltx/en_us_dedes/me.m11.d03:meMA.Ode7C13.incipit	…
ltx/en_us_dedes/me.m11.d03:meMA.Ode7C13.melody	@ltx/en_us_dedes/he.h.m1:heHE.SeNoitin.name
ltx/en_us_dedes/me.m11.d03:meMA.Ode7C13.mode	@ltx/en_us_dedes/miscellanea:misc.Mode1
ltx/en_us_dedes/me.m11.d03:meMA.Ode7C13.ode	@ltx/en_us_dedes/miscellanea:misc.Ode7
ltx/en_us_dedes/me.m11.d03:meMA.Ode7C13.text	
ltx/en_us_dedes/me.m11.d03:meMA.Ode7C1T.incipit	…
ltx/en_us_dedes/me.m11.d03:meMA.Ode7C1T.melody	@ltx/en_us_dedes/he.h.m1:heHE.SeNoitin.name
ltx/en_us_dedes/me.m11.d03:meMA.Ode7C1T.mode	@ltx/en_us_dedes/miscellanea:misc.Mode1
ltx/en_us_dedes/me.m11.d03:meMA.Ode7C1T.ode	@ltx/en_us_dedes/miscellanea:misc.Ode7
ltx/en_us_dedes/me.m11.d03:meMA.Ode7C1T.text	
ltx/en_us_dedes/me.m11.d03:meMA.Ode7C21.greekmelody	@ltx/en_us_dedes/he.h.m4:heHE.ODiasosasEnPyri.greekname
ltx/en_us_dedes/me.m11.d03:meMA.Ode7C21.incipit	…
ltx/en_us_dedes/me.m11.d03:meMA.Ode7C21.melody	@ltx/en_us_dedes/he.h.m4:heHE.ODiasosasEnPyri.name
ltx/en_us_dedes/me.m11.d03:meMA.Ode7C21.mode	@ltx/en_us_dedes/miscellanea:misc.Mode4
ltx/en_us_dedes/me.m11.d03:meMA.Ode7C21.ode	@ltx/en_us_dedes/miscellanea:misc.Ode7
ltx/en_us_dedes/me.m11.d03:meMA.Ode7C21.text	
ltx/en_us_dedes/me.m11.d03:meMA.Ode7C22.incipit	…
ltx/en_us_dedes/me.m11.d03:meMA.Ode7C22.melody	@ltx/en_us_dedes/he.h.m4:heHE.ODiasosasEnPyri.name
ltx/en_us_dedes/me.m11.d03:meMA.Ode7C22.mode	@ltx/en_us_dedes/miscellanea:misc.Mode4
ltx/en_us_dedes/me.m11.d03:meMA.Ode7C22.ode	@ltx/en_us_dedes/miscellanea:misc.Ode7
ltx/en_us_dedes/me.m11.d03:meMA.Ode7C22.text	
ltx/en_us_dedes/me.m11.d03:meMA.Ode7C23.incipit	…
ltx/en_us_dedes/me.m11.d03:meMA.Ode7C23.melody	@ltx/en_us_dedes/he.h.m4:heHE.ODiasosasEnPyri.name
ltx/en_us_dedes/me.m11.d03:meMA.Ode7C23.mode	@ltx/en_us_dedes/miscellanea:misc.Mode4
ltx/en_us_dedes/me.m11.d03:meMA.Ode7C23.ode	@ltx/en_us_dedes/miscellanea:misc.Ode7
ltx/en_us_dedes/me.m11.d03:meMA.Ode7C23.text	
ltx/en_us_dedes/me.m11.d03:meMA.Ode7C2T.incipit	…
ltx/en_us_dedes/me.m11.d03:meMA.Ode7C2T.melody	@ltx/en_us_dedes/he.h.m4:heHE.ODiasosasEnPyri.name
ltx/en_us_dedes/me.m11.d03:meMA.Ode7C2T.mode	@ltx/en_us_dedes/miscellanea:misc.Mode4
ltx/en_us_dedes/me.m11.d03:meMA.Ode7C2T.ode	@ltx/en_us_dedes/miscellanea:misc.Ode7
ltx/en_us_dedes/me.m11.d03:meMA.Ode7C2T.text	
ltx/en_us_dedes/me.m11.d03:meMA.Ode8C11.greekmelody	@ltx/en_us_dedes/he.h.m1:heHE.EnKaminoPaides.greekname
ltx/en_us_dedes/me.m11.d03:meMA.Ode8C11.incipit	…
ltx/en_us_dedes/me.m11.d03:meMA.Ode8C11.melody	@ltx/en_us_dedes/he.h.m1:heHE.EnKaminoPaides.name
ltx/en_us_dedes/me.m11.d03:meMA.Ode8C11.mode	@ltx/en_us_dedes/miscellanea:misc.Mode1
ltx/en_us_dedes/me.m11.d03:meMA.Ode8C11.ode	@ltx/en_us_dedes/miscellanea:misc.Ode8
ltx/en_us_dedes/me.m11.d03:meMA.Ode8C11.text	
ltx/en_us_dedes/me.m11.d03:meMA.Ode8C12.incipit	…
ltx/en_us_dedes/me.m11.d03:meMA.Ode8C12.melody	@ltx/en_us_dedes/he.h.m1:heHE.EnKaminoPaides.name
ltx/en_us_dedes/me.m11.d03:meMA.Ode8C12.mode	@ltx/en_us_dedes/miscellanea:misc.Mode1
ltx/en_us_dedes/me.m11.d03:meMA.Ode8C12.ode	@ltx/en_us_dedes/miscellanea:misc.Ode8
ltx/en_us_dedes/me.m11.d03:meMA.Ode8C12.text	
ltx/en_us_dedes/me.m11.d03:meMA.Ode8C13.incipit	…
ltx/en_us_dedes/me.m11.d03:meMA.Ode8C13.melody	@ltx/en_us_dedes/he.h.m1:heHE.EnKaminoPaides.name
ltx/en_us_dedes/me.m11.d03:meMA.Ode8C13.mode	@ltx/en_us_dedes/miscellanea:misc.Mode1
ltx/en_us_dedes/me.m11.d03:meMA.Ode8C13.ode	@ltx/en_us_dedes/miscellanea:misc.Ode8
ltx/en_us_dedes/me.m11.d03:meMA.Ode8C13.text	
ltx/en_us_dedes/me.m11.d03:meMA.Ode8C1T.incipit	…
ltx/en_us_dedes/me.m11.d03:meMA.Ode8C1T.melody	@ltx/en_us_dedes/he.h.m1:heHE.EnKaminoPaides.name
ltx/en_us_dedes/me.m11.d03:meMA.Ode8C1T.mode	@ltx/en_us_dedes/miscellanea:misc.Mode1
ltx/en_us_dedes/me.m11.d03:meMA.Ode8C1T.ode	@ltx/en_us_dedes/miscellanea:misc.Ode8
ltx/en_us_dedes/me.m11.d03:meMA.Ode8C1T.text	
ltx/en_us_dedes/me.m11.d03:meMA.Ode8C1Tr.incipit	…
ltx/en_us_dedes/me.m11.d03:meMA.Ode8C1Tr.melody	@ltx/en_us_dedes/he.h.m1:heHE.EnKaminoPaides.name
ltx/en_us_dedes/me.m11.d03:meMA.Ode8C1Tr.mode	@ltx/en_us_dedes/miscellanea:misc.Mode1
ltx/en_us_dedes/me.m11.d03:meMA.Ode8C1Tr.ode	@ltx/en_us_dedes/miscellanea:misc.Ode8
ltx/en_us_dedes/me.m11.d03:meMA.Ode8C1Tr.text	
ltx/en_us_dedes/me.m11.d03:meMA.Ode8C21.greekmelody	@ltx/en_us_dedes/he.h.m4:heHE.GiKaiPantaTaEnAfti.greekname
ltx/en_us_dedes/me.m11.d03:meMA.Ode8C21.incipit	…
ltx/en_us_dedes/me.m11.d03:meMA.Ode8C21.melody	@ltx/en_us_dedes/he.h.m4:heHE.GiKaiPantaTaEnAfti.name
ltx/en_us_dedes/me.m11.d03:meMA.Ode8C21.mode	@ltx/en_us_dedes/miscellanea:misc.Mode4
ltx/en_us_dedes/me.m11.d03:meMA.Ode8C21.ode	@ltx/en_us_dedes/miscellanea:misc.Ode8
ltx/en_us_dedes/me.m11.d03:meMA.Ode8C21.text	
ltx/en_us_dedes/me.m11.d03:meMA.Ode8C22.incipit	…
ltx/en_us_dedes/me.m11.d03:meMA.Ode8C22.melody	@ltx/en_us_dedes/he.h.m4:heHE.GiKaiPantaTaEnAfti.name
ltx/en_us_dedes/me.m11.d03:meMA.Ode8C22.mode	@ltx/en_us_dedes/miscellanea:misc.Mode4
ltx/en_us_dedes/me.m11.d03:meMA.Ode8C22.ode	@ltx/en_us_dedes/miscellanea:misc.Ode8
ltx/en_us_dedes/me.m11.d03:meMA.Ode8C22.text	
ltx/en_us_dedes/me.m11.d03:meMA.Ode8C23.incipit	…
ltx/en_us_dedes/me.m11.d03:meMA.Ode8C23.melody	@ltx/en_us_dedes/he.h.m4:heHE.GiKaiPantaTaEnAfti.name
ltx/en_us_dedes/me.m11.d03:meMA.Ode8C23.mode	@ltx/en_us_dedes/miscellanea:misc.Mode4
ltx/en_us_dedes/me.m11.d03:meMA.Ode8C23.ode	@ltx/en_us_dedes/miscellanea:misc.Ode8
ltx/en_us_dedes/me.m11.d03:meMA.Ode8C23.text	
ltx/en_us_dedes/me.m11.d03:meMA.Ode8C2T.incipit	…
ltx/en_us_dedes/me.m11.d03:meMA.Ode8C2T.melody	@ltx/en_us_dedes/he.h.m4:heHE.GiKaiPantaTaEnAfti.name
ltx/en_us_dedes/me.m11.d03:meMA.Ode8C2T.mode	@ltx/en_us_dedes/miscellanea:misc.Mode4
ltx/en_us_dedes/me.m11.d03:meMA.Ode8C2T.ode	@ltx/en_us_dedes/miscellanea:misc.Ode8
ltx/en_us_dedes/me.m11.d03:meMA.Ode8C2T.text	
ltx/en_us_dedes/me.m11.d03:meMA.Ode8H.greekmelody	@ltx/en_us_dedes/he.h.m4:heHE.GiKaiPantaTaEnAfti.greekname
ltx/en_us_dedes/me.m11.d03:meMA.Ode8H.incipit	@ltx/en_us_dedes/he.h.m4:heHE.GiKaiPantaTaEnAfti.incipit
ltx/en_us_dedes/me.m11.d03:meMA.Ode8H.melody	@ltx/en_us_dedes/he.h.m4:heHE.GiKaiPantaTaEnAfti.melody
ltx/en_us_dedes/me.m11.d03:meMA.Ode8H.mode	@ltx/en_us_dedes/miscellanea:misc.Mode4
ltx/en_us_dedes/me.m11.d03:meMA.Ode8H.ode	@ltx/en_us_dedes/miscellanea:misc.Ode8
ltx/en_us_dedes/me.m11.d03:meMA.Ode8H.text	@ltx/en_us_dedes/he.h.m4:heHE.GiKaiPantaTaEnAfti.text
ltx/en_us_dedes/me.m11.d03:meMA.Ode9C11.greekmelody	@ltx/en_us_dedes/he.h.m1:heHE.TyponTisAgnis.greekname
ltx/en_us_dedes/me.m11.d03:meMA.Ode9C11.incipit	…
ltx/en_us_dedes/me.m11.d03:meMA.Ode9C11.melody	@ltx/en_us_dedes/he.h.m1:heHE.TyponTisAgnis.name
ltx/en_us_dedes/me.m11.d03:meMA.Ode9C11.mode	@ltx/en_us_dedes/miscellanea:misc.Mode1
ltx/en_us_dedes/me.m11.d03:meMA.Ode9C11.ode	@ltx/en_us_dedes/miscellanea:misc.Ode9
ltx/en_us_dedes/me.m11.d03:meMA.Ode9C11.text	
ltx/en_us_dedes/me.m11.d03:meMA.Ode9C12.incipit	…
ltx/en_us_dedes/me.m11.d03:meMA.Ode9C12.melody	@ltx/en_us_dedes/he.h.m1:heHE.TyponTisAgnis.name
ltx/en_us_dedes/me.m11.d03:meMA.Ode9C12.mode	@ltx/en_us_dedes/miscellanea:misc.Mode1
ltx/en_us_dedes/me.m11.d03:meMA.Ode9C12.ode	@ltx/en_us_dedes/miscellanea:misc.Ode9
ltx/en_us_dedes/me.m11.d03:meMA.Ode9C12.text	
ltx/en_us_dedes/me.m11.d03:meMA.Ode9C13.incipit	…
ltx/en_us_dedes/me.m11.d03:meMA.Ode9C13.melody	@ltx/en_us_dedes/he.h.m1:heHE.TyponTisAgnis.name
ltx/en_us_dedes/me.m11.d03:meMA.Ode9C13.mode	@ltx/en_us_dedes/miscellanea:misc.Mode1
ltx/en_us_dedes/me.m11.d03:meMA.Ode9C13.ode	@ltx/en_us_dedes/miscellanea:misc.Ode9
ltx/en_us_dedes/me.m11.d03:meMA.Ode9C13.text	
ltx/en_us_dedes/me.m11.d03:meMA.Ode9C1T.incipit	…
ltx/en_us_dedes/me.m11.d03:meMA.Ode9C1T.melody	@ltx/en_us_dedes/he.h.m1:heHE.TyponTisAgnis.name
ltx/en_us_dedes/me.m11.d03:meMA.Ode9C1T.mode	@ltx/en_us_dedes/miscellanea:misc.Mode1
ltx/en_us_dedes/me.m11.d03:meMA.Ode9C1T.ode	@ltx/en_us_dedes/miscellanea:misc.Ode9
ltx/en_us_dedes/me.m11.d03:meMA.Ode9C1T.text	
ltx/en_us_dedes/me.m11.d03:meMA.Ode9C21.greekmelody	@ltx/en_us_dedes/he.h.m4:heHE.OTokosSouAfthoros.greekname
ltx/en_us_dedes/me.m11.d03:meMA.Ode9C21.incipit	…
ltx/en_us_dedes/me.m11.d03:meMA.Ode9C21.melody	@ltx/en_us_dedes/he.h.m4:heHE.OTokosSouAfthoros.name
ltx/en_us_dedes/me.m11.d03:meMA.Ode9C21.mode	@ltx/en_us_dedes/miscellanea:misc.Mode4
ltx/en_us_dedes/me.m11.d03:meMA.Ode9C21.ode	@ltx/en_us_dedes/miscellanea:misc.Ode9
ltx/en_us_dedes/me.m11.d03:meMA.Ode9C21.text	
ltx/en_us_dedes/me.m11.d03:meMA.Ode9C22.incipit	…
ltx/en_us_dedes/me.m11.d03:meMA.Ode9C22.melody	@ltx/en_us_dedes/he.h.m4:heHE.OTokosSouAfthoros.name
ltx/en_us_dedes/me.m11.d03:meMA.Ode9C22.mode	@ltx/en_us_dedes/miscellanea:misc.Mode4
ltx/en_us_dedes/me.m11.d03:meMA.Ode9C22.ode	@ltx/en_us_dedes/miscellanea:misc.Ode9
ltx/en_us_dedes/me.m11.d03:meMA.Ode9C22.text	
ltx/en_us_dedes/me.m11.d03:meMA.Ode9C23.incipit	…
ltx/en_us_dedes/me.m11.d03:meMA.Ode9C23.melody	@ltx/en_us_dedes/he.h.m4:heHE.OTokosSouAfthoros.name
ltx/en_us_dedes/me.m11.d03:meMA.Ode9C23.mode	@ltx/en_us_dedes/miscellanea:misc.Mode4
ltx/en_us_dedes/me.m11.d03:meMA.Ode9C23.ode	@ltx/en_us_dedes/miscellanea:misc.Ode9
ltx/en_us_dedes/me.m11.d03:meMA.Ode9C23.text	
ltx/en_us_dedes/me.m11.d03:meMA.Ode9C2T.incipit	…
ltx/en_us_dedes/me.m11.d03:meMA.Ode9C2T.melody	@ltx/en_us_dedes/he.h.m4:heHE.OTokosSouAfthoros.name
ltx/en_us_dedes/me.m11.d03:meMA.Ode9C2T.mode	@ltx/en_us_dedes/miscellanea:misc.Mode4
ltx/en_us_dedes/me.m11.d03:meMA.Ode9C2T.ode	@ltx/en_us_dedes/miscellanea:misc.Ode9
ltx/en_us_dedes/me.m11.d03:meMA.Ode9C2T.text	
ltx/en_us_dedes/me.m11.d03:meMA.Ode9H.greekmelody	@ltx/en_us_dedes/he.h.m4:heHE.OTokosSouAfthoros.greekname
ltx/en_us_dedes/me.m11.d03:meMA.Ode9H.incipit	@ltx/en_us_dedes/he.h.m4:heHE.OTokosSouAfthoros.incipit
ltx/en_us_dedes/me.m11.d03:meMA.Ode9H.melody	@ltx/en_us_dedes/he.h.m4:heHE.OTokosSouAfthoros.melody
ltx/en_us_dedes/me.m11.d03:meMA.Ode9H.mode	@ltx/en_us_dedes/miscellanea:misc.Mode4
ltx/en_us_dedes/me.m11.d03:meMA.Ode9H.ode	@ltx/en_us_dedes/miscellanea:misc.Ode9
ltx/en_us_dedes/me.m11.d03:meMA.Ode9H.text	@ltx/en_us_dedes/he.h.m4:heHE.OTokosSouAfthoros.text
ltx/en_us_dedes/me.m11.d03:meMA.Oikos1.text	Almighty Jesus, with the showers of Your goodness, make my heart bear fruits of virtue, for it has become arid in many transgressions. I pray you illumine my mind with divine knowledge, and I will joyfully extol Your hierarch and great medaled athlete Acepsimas, as well as brave Aeithalas, and truly blessed Joseph. These holy men relied on You, and they boldly and bravely accepted to be tortured. And now, having received Your grace, they grant cures to those who are ill, and they never cease interceding on behalf of us all.
ltx/en_us_dedes/me.m11.d03:meMA.Oikos2.text	O companion and friend of the Lord, you have proved to be great in protecting us on earth. You shelter the faithful people and ever rescue them, O glorious Saint. Therefore with faith cry out and salute you, who suffered much:
ltx/en_us_dedes/me.m11.d03:meMA.Oikos22.text	Rejoice! Through you the world is dazzled. Rejoice! Through the army shines brightly.
ltx/en_us_dedes/me.m11.d03:meMA.Oikos23.text	Rejoice! You rescue believers who are captured. Rejoice! You quickly aid those unjustly imprisoned.
ltx/en_us_dedes/me.m11.d03:meMA.Oikos24.text	Rejoice! You are the exaltation of those who ardently rely on you with faith. Rejoice! You are the wealth of those who love you, and the joy of those in pain.
ltx/en_us_dedes/me.m11.d03:meMA.Oikos25.text	Rejoice! You are the fortress of kings. Rejoice! You grant them victory in war.
ltx/en_us_dedes/me.m11.d03:meMA.Oikos26.text	Rejoice! Like a star, you give light to those at sea. Rejoice! You rescue people from abuse of all kinds.
ltx/en_us_dedes/me.m11.d03:meMA.Oikos27.text	Rejoice! On you all believers rely. Rejoice! Through you our Creator is extolled.
ltx/en_us_dedes/me.m11.d03:meMA.Oikos28.text	Rejoice, O Great-martyr George!
ltx/en_us_dedes/me.m11.d03:meVE.Apolytikion1ger.greekmelody	@ltx/en_us_dedes/he.a.m3:heAU.TheiasPisteos.greekname
ltx/en_us_dedes/me.m11.d03:meVE.Apolytikion1ger.incipit	…
ltx/en_us_dedes/me.m11.d03:meVE.Apolytikion1ger.melody	@ltx/en_us_dedes/he.a.m3:heAU.TheiasPisteos.name
ltx/en_us_dedes/me.m11.d03:meVE.Apolytikion1ger.mode	@ltx/en_us_dedes/miscellanea:misc.Mode3
ltx/en_us_dedes/me.m11.d03:meVE.Apolytikion1ger.poet	@ltx/en_us_dedes/poets:po.Gerasimou
ltx/en_us_dedes/me.m11.d03:meVE.Apolytikion1ger.text	
ltx/en_us_dedes/me.m11.d03:meVE.Apolytikion2ger.greekmelody	@ltx/en_us_dedes/he.a.m4:heAU.TachyProkatalave.greekname
ltx/en_us_dedes/me.m11.d03:meVE.Apolytikion2ger.incipit	…
ltx/en_us_dedes/me.m11.d03:meVE.Apolytikion2ger.melody	@ltx/en_us_dedes/he.a.m4:heAU.TachyProkatalave.name
ltx/en_us_dedes/me.m11.d03:meVE.Apolytikion2ger.mode	@ltx/en_us_dedes/miscellanea:misc.Mode4
ltx/en_us_dedes/me.m11.d03:meVE.Apolytikion2ger.poet	@ltx/en_us_dedes/poets:po.Gerasimou
ltx/en_us_dedes/me.m11.d03:meVE.Apolytikion2ger.text	
ltx/en_us_dedes/me.m11.d03:meVE.AposGlory.incipit	…
ltx/en_us_dedes/me.m11.d03:meVE.AposGlory.melody	
ltx/en_us_dedes/me.m11.d03:meVE.AposGlory.mode	@ltx/en_us_dedes/miscellanea:misc.Mode6
ltx/en_us_dedes/me.m11.d03:meVE.AposGlory.poet	@ltx/en_us_dedes/poets:po.EfraimKarias
ltx/en_us_dedes/me.m11.d03:meVE.AposGlory.text	
ltx/en_us_dedes/me.m11.d03:meVE.AposStavrotheotokion.greekmelody	@ltx/en_us_dedes/he.a.m6:heAU.TriimerosAnestis.greekname
ltx/en_us_dedes/me.m11.d03:meVE.AposStavrotheotokion.incipit	@ltx/en_us_dedes/oc.m6.d4:ocMA.AposTheotokion.incipit
ltx/en_us_dedes/me.m11.d03:meVE.AposStavrotheotokion.melody	@ltx/en_us_dedes/he.a.m6:heAU.TriimerosAnestis.name
ltx/en_us_dedes/me.m11.d03:meVE.AposStavrotheotokion.mode	@ltx/en_us_dedes/miscellanea:misc.Mode6
ltx/en_us_dedes/me.m11.d03:meVE.AposStavrotheotokion.text	@ltx/en_us_dedes/oc.m6.d4:ocMA.AposTheotokion.text
ltx/en_us_dedes/me.m11.d03:meVE.AposTheotokion.incipit	@ltx/en_us_dedes/me.m01.d28:meVE.SticTheotokion.incipit
ltx/en_us_dedes/me.m11.d03:meVE.AposTheotokion.melody	
ltx/en_us_dedes/me.m11.d03:meVE.AposTheotokion.mode	@ltx/en_us_dedes/miscellanea:misc.Mode6
ltx/en_us_dedes/me.m11.d03:meVE.AposTheotokion.text	@ltx/en_us_dedes/me.m01.d28:meVE.SticTheotokion.text
ltx/en_us_dedes/me.m11.d03:meVE.Aposticha1.greekmelody	@ltx/en_us_dedes/he.a.m4:heAU.OsGennaionEnMartysi.greekname
ltx/en_us_dedes/me.m11.d03:meVE.Aposticha1.incipit	Medaled Athlete, Great-martyr George…
ltx/en_us_dedes/me.m11.d03:meVE.Aposticha1.melody	@ltx/en_us_dedes/he.a.m4:heAU.OsGennaionEnMartysi.name
ltx/en_us_dedes/me.m11.d03:meVE.Aposticha1.mode	@ltx/en_us_dedes/miscellanea:misc.Mode4
ltx/en_us_dedes/me.m11.d03:meVE.Aposticha1.text	Medaled Athlete, Great-martyr George, * as you live with the Angels now * and the other Martyrs, and as you are each day * a place of refuge for those in need, * I pray you to be for me, * who am on the sea of life, * like a haven of cool relief. Also I implore, * be my life’s guide and pilot, so that I may praise your supernatural contests * with incontestable faith and love.
ltx/en_us_dedes/me.m11.d03:meVE.Aposticha2.incipit	Guard me always and everywhere…
ltx/en_us_dedes/me.m11.d03:meVE.Aposticha2.melody	@ltx/en_us_dedes/he.a.m4:heAU.OsGennaionEnMartysi.name
ltx/en_us_dedes/me.m11.d03:meVE.Aposticha2.mode	@ltx/en_us_dedes/miscellanea:misc.Mode4
ltx/en_us_dedes/me.m11.d03:meVE.Aposticha2.text	Guard me always and everywhere, * when I travel by any means, * walking, driving, flying, and when I sleep at night. * And when I wake, keep me safe and sound, all-blessed Great-martyr George. * Guide me to fulfill the will * and commandments of God my Lord, * so that I who run * to your mighty protection be forgiven of the sins I have committed * throughout my lifetime, on Judgment Day.
ltx/en_us_dedes/me.m11.d03:meVE.Aposticha3.incipit	@ltx/en_us_dedes/me.m04.d23:meVE.Stichera04.incipit
ltx/en_us_dedes/me.m11.d03:meVE.Aposticha3.melody	@ltx/en_us_dedes/he.a.m4:heAU.OsGennaionEnMartysi.name
ltx/en_us_dedes/me.m11.d03:meVE.Aposticha3.mode	@ltx/en_us_dedes/miscellanea:misc.Mode4
ltx/en_us_dedes/me.m11.d03:meVE.Aposticha3.text	@ltx/en_us_dedes/me.m04.d23:meVE.Stichera04.text
ltx/en_us_dedes/me.m11.d03:meVE.SticGlory.incipit	@ltx/en_us_dedes/me.m04.d23:meVE.SticGlory.incipit
ltx/en_us_dedes/me.m11.d03:meVE.SticGlory.melody	
ltx/en_us_dedes/me.m11.d03:meVE.SticGlory.mode	@ltx/en_us_dedes/miscellanea:misc.Mode6
ltx/en_us_dedes/me.m11.d03:meVE.SticGlory.text	@ltx/en_us_dedes/me.m04.d23:meVE.SticGlory.text
ltx/en_us_dedes/me.m11.d03:meVE.SticStavrotheotokion.greekmelody	@ltx/en_us_dedes/he.a.m6:heAU.TriimerosAnestis.greekname
ltx/en_us_dedes/me.m11.d03:meVE.SticStavrotheotokion.incipit	@ltx/en_us_dedes/oc.m6.d4:ocVE.AposTheotokion.incipit
ltx/en_us_dedes/me.m11.d03:meVE.SticStavrotheotokion.melody	@ltx/en_us_dedes/he.a.m6:heAU.TriimerosAnestis.name
ltx/en_us_dedes/me.m11.d03:meVE.SticStavrotheotokion.mode	@ltx/en_us_dedes/miscellanea:misc.Mode6
ltx/en_us_dedes/me.m11.d03:meVE.SticStavrotheotokion.text	@ltx/en_us_dedes/oc.m6.d4:ocVE.AposTheotokion.text
ltx/en_us_dedes/me.m11.d03:meVE.SticTheotokion.incipit	@ltx/en_us_dedes/he.o:heOT.TheotokeSyEi.incipit
ltx/en_us_dedes/me.m11.d03:meVE.SticTheotokion.melody	@ltx/en_us_dedes/he.o:heOT.TheotokeSyEi.name
ltx/en_us_dedes/me.m11.d03:meVE.SticTheotokion.mode	@ltx/en_us_dedes/miscellanea:misc.Mode6
ltx/en_us_dedes/me.m11.d03:meVE.SticTheotokion.text	@ltx/en_us_dedes/he.o:heOT.TheotokeSyEiAthloforou.text
ltx/en_us_dedes/me.m11.d03:meVE.Stichera01.greekmelody	@ltx/en_us_dedes/he.a.m5:heAU.ChairoisAskitikon.greekname
ltx/en_us_dedes/me.m11.d03:meVE.Stichera01.incipit	Trinity of the Trinity, rejoice!…
ltx/en_us_dedes/me.m11.d03:meVE.Stichera01.melody	@ltx/en_us_dedes/he.a.m5:heAU.ChairoisAskitikon.name
ltx/en_us_dedes/me.m11.d03:meVE.Stichera01.mode	@ltx/en_us_dedes/miscellanea:misc.Mode5
ltx/en_us_dedes/me.m11.d03:meVE.Stichera01.text	Trinity of the Trinity, rejoice! * Of every virtue you are truly the pure abodes. * Like wine bowls you serve divine wine of Orthodoxy that makes * glad the hearts and souls of those who honor you. * Like breasts, you pour out the streams of divine cures like sweetest milk. * Like luminaries, you are shining the light of truth; * you illuminate all the world with your radiance. * Martyrs, your names are magnified. * The night-time of ignorance * has been diminished and shortened, as you illumine the minds of all. * To Christ pray intently, * and implore Him that great mercy be given to our souls.
ltx/en_us_dedes/me.m11.d03:meVE.Stichera02.incipit	Rejoice, Joseph and Aeithalas, *…
ltx/en_us_dedes/me.m11.d03:meVE.Stichera02.melody	@ltx/en_us_dedes/he.a.m5:heAU.ChairoisAskitikon.name
ltx/en_us_dedes/me.m11.d03:meVE.Stichera02.mode	@ltx/en_us_dedes/miscellanea:misc.Mode5
ltx/en_us_dedes/me.m11.d03:meVE.Stichera02.text	Rejoice, Joseph and Aeithalas, * sacred Acepsimas. You praiseworthy men of God * extinguished the false religion of those who worshiped the fire,* with the divine fire of the knowledge of God; * through which those who offered up an iniquitous sacrifice * to sun and stars have disappeared as if by eclipse, * and the false beliefs of magicians have come to naught. * Champions of the Trinity, * all-ven’rable Martyr Saints, * for those who sit in the darkness of sin and ignorance you are light * of Christ the true Shepherd, * who was sacrificed and grants His great mercy to the world.
ltx/en_us_dedes/me.m11.d03:meVE.Stichera03.incipit	Wise men with a most…
ltx/en_us_dedes/me.m11.d03:meVE.Stichera03.melody	@ltx/en_us_dedes/he.a.m5:heAU.ChairoisAskitikon.name
ltx/en_us_dedes/me.m11.d03:meVE.Stichera03.mode	@ltx/en_us_dedes/miscellanea:misc.Mode5
ltx/en_us_dedes/me.m11.d03:meVE.Stichera03.text	Wise men with a most brave frame of mind, * you were subjected unto torture of every kind. * As if you were beasts of burden, you were weighed down even more, * and were led to suffer more tormenting pain. * Although you were thrashed and cut and were bludgeoned repeatedly, * and were exhausted from the torture that you endured, * you did not submit nor renounce your belief in God. * Therefore you worthily received the halo of victory, * and you are famously numbered among the chorus of Martyr Saints. * With them now entreat Christ, * and implore Him that great mercy be given to our souls.
ltx/en_us_dedes/me.m11.d03:meVE.Stichera04.greekmelody	@ltx/en_us_dedes/he.a.m5:heAU.ChairoisAskitikon.greekname
ltx/en_us_dedes/me.m11.d03:meVE.Stichera04.incipit	Rejoicing, you motivated yourself, *…
ltx/en_us_dedes/me.m11.d03:meVE.Stichera04.melody	@ltx/en_us_dedes/he.a.m5:heAU.ChairoisAskitikon.name
ltx/en_us_dedes/me.m11.d03:meVE.Stichera04.mode	@ltx/en_us_dedes/miscellanea:misc.Mode5
ltx/en_us_dedes/me.m11.d03:meVE.Stichera04.text	Rejoicing, you motivated yourself, * and you courageously proceeded to martyrdom. * And everyone was confounded by your persistence, O Saint, * for you trampled tyrants’ arrogant conceit. * And now you have passed over to the radiant residence * of holy Angels, and together you celebrate; * and you ever save those who faithfully honor you. * We have you watching over us, all-blessed Great-martyr George. * And when the poor and the needy cry out invoking your sympathy, * you earnestly pray Christ, * and implore Him that He grant His great mercy to the world.
ltx/en_us_dedes/me.m11.d03:meVE.Stichera05.incipit	Come now to us, O…
ltx/en_us_dedes/me.m11.d03:meVE.Stichera05.melody	@ltx/en_us_dedes/he.a.m5:heAU.ChairoisAskitikon.name
ltx/en_us_dedes/me.m11.d03:meVE.Stichera05.mode	@ltx/en_us_dedes/miscellanea:misc.Mode5
ltx/en_us_dedes/me.m11.d03:meVE.Stichera05.text	Come now to us, O Great-martyr George. * Help us in trouble and beset by adversity. * Alleviate pain arising from our lamentable trials; * take away the burden that they place on us. * Protect us and shelter us, blessed Saint, and deliver us; * carry us over to the Lord God through right belief; * guide us to obey our Creator’s divine commands; * so that when we finish our lives, by His great benevolence * we may obtain what He promised, rewards in heaven and life with God, * as we now extol Christ, * our Savior who is granting great mercy to the world.
ltx/en_us_dedes/me.m11.d03:meVE.Stichera06.incipit	Truly the great and wonderful…
ltx/en_us_dedes/me.m11.d03:meVE.Stichera06.melody	@ltx/en_us_dedes/he.a.m5:heAU.ChairoisAskitikon.name
ltx/en_us_dedes/me.m11.d03:meVE.Stichera06.mode	@ltx/en_us_dedes/miscellanea:misc.Mode5
ltx/en_us_dedes/me.m11.d03:meVE.Stichera06.text	Truly the great and wonderful fame * of your extraordinary martyrdom is proclaimed, * O glorious and illustrious, noblest Great-martyr George; * and your reputation, worthy of esteem, * precedes you throughout the world: your innumerable miracles! * You cure diseases, and you heal many suffering, * by unceasingly interceding on their behalf. * Therefore we all know you to be our most ardent advocate, * all-blessed great benefactor, who rescues captives and hostages. * Intently entreat Christ, * and implore Him that great mercy be given to our souls.
