ltx/en_us_dedes/me.m01.d22:meDA.commemoration.first	
ltx/en_us_dedes/me.m01.d22:meDA.commemoration.first_name	
ltx/en_us_dedes/me.m01.d22:meDA.commemoration.first_short	
ltx/en_us_dedes/me.m01.d22:meDA.commemoration.first_title	@ltx/en_us_dedes/titles:ti.Apostle
ltx/en_us_dedes/me.m01.d22:meDA.commemoration.full	Memory of the Holy Apostle Timothy, and the Holy Devout Martyr Anastasios the Persian
ltx/en_us_dedes/me.m01.d22:meDA.commemoration.second_name	
ltx/en_us_dedes/me.m01.d22:meDA.commemoration.second_title	@ltx/en_us_dedes/titles:ti.Martyr
ltx/en_us_dedes/me.m01.d22:meDA.date	January 22
ltx/en_us_dedes/me.m01.d22:meDA.fordate	for January 22
ltx/en_us_dedes/me.m01.d22:meDA.insert1	the holy and glorious Apostle Timothy, and the holy devout martyr Anastasios the Persian,
ltx/en_us_dedes/me.m01.d22:meDA.insert2	whose memory we observe;
ltx/en_us_dedes/me.m01.d22:meDA.note	
ltx/en_us_dedes/me.m01.d22:meDA.pdfcoverdate	January 22,
ltx/en_us_dedes/me.m01.d22:meDA.pdfheaderdate	January 22
ltx/en_us_dedes/me.m01.d22:meHO.commemorations	
ltx/en_us_dedes/me.m01.d22:meHO.note1	
ltx/en_us_dedes/me.m01.d22:meHO.note2	
ltx/en_us_dedes/me.m01.d22:meHO.number	22.
ltx/en_us_dedes/me.m01.d22:meHO.rank	
ltx/en_us_dedes/me.m01.d22:meLE.commemoration1	The Holy Apostle Timothy. The Venerable Martyr Anastasios the Persian.
ltx/en_us_dedes/me.m01.d22:meLE.commemoration2	
ltx/en_us_dedes/me.m01.d22:meLI.Kontakion1.greekmelody	@ltx/en_us_dedes/me.m01.d22:meMA.Kontakion1.greekmelody
ltx/en_us_dedes/me.m01.d22:meLI.Kontakion1.incipit	@ltx/en_us_dedes/me.m01.d22:meMA.Kontakion1.incipit
ltx/en_us_dedes/me.m01.d22:meLI.Kontakion1.melody	@ltx/en_us_dedes/me.m01.d22:meMA.Kontakion1.melody
ltx/en_us_dedes/me.m01.d22:meLI.Kontakion1.mode	@ltx/en_us_dedes/me.m01.d22:meMA.Kontakion1.mode
ltx/en_us_dedes/me.m01.d22:meLI.Kontakion1.text	@ltx/en_us_dedes/me.m01.d22:meMA.Kontakion1.text
ltx/en_us_dedes/me.m01.d22:meLI.MM.CommunionHymn.text	@ltx/en_us_dedes/properties:media.key
ltx/en_us_dedes/me.m01.d22:meLI.Megalynarion.text	
ltx/en_us_dedes/me.m01.d22:meMA.AposGlory.incipit	…
ltx/en_us_dedes/me.m01.d22:meMA.AposGlory.melody	
ltx/en_us_dedes/me.m01.d22:meMA.AposGlory.mode	@ltx/en_us_dedes/miscellanea:misc.Mode5
ltx/en_us_dedes/me.m01.d22:meMA.AposGlory.poet	@ltx/en_us_dedes/poets:po.Stouditou
ltx/en_us_dedes/me.m01.d22:meMA.AposGlory.text	
ltx/en_us_dedes/me.m01.d22:meMA.AposStavrotheotokion.greekmelody	@ltx/en_us_dedes/he.a.m5:heAU.ChairoisAskitikon.greekname
ltx/en_us_dedes/me.m01.d22:meMA.AposStavrotheotokion.incipit	@ltx/en_us_dedes/oc.m5.d4:ocVE.AposTheotokion.incipit
ltx/en_us_dedes/me.m01.d22:meMA.AposStavrotheotokion.melody	@ltx/en_us_dedes/he.a.m5:heAU.ChairoisAskitikon.name
ltx/en_us_dedes/me.m01.d22:meMA.AposStavrotheotokion.mode	@ltx/en_us_dedes/miscellanea:misc.Mode5
ltx/en_us_dedes/me.m01.d22:meMA.AposStavrotheotokion.text	@ltx/en_us_dedes/oc.m5.d4:ocVE.AposTheotokion.text
ltx/en_us_dedes/me.m01.d22:meMA.AposTheotokion.greekmelody	@ltx/en_us_dedes/he.a.m5:heAU.ChairoisAskitikon.greekname
ltx/en_us_dedes/me.m01.d22:meMA.AposTheotokion.incipit	…
ltx/en_us_dedes/me.m01.d22:meMA.AposTheotokion.melody	@ltx/en_us_dedes/he.a.m5:heAU.ChairoisAskitikon.name
ltx/en_us_dedes/me.m01.d22:meMA.AposTheotokion.mode	@ltx/en_us_dedes/miscellanea:misc.Mode5
ltx/en_us_dedes/me.m01.d22:meMA.AposTheotokion.text	
ltx/en_us_dedes/me.m01.d22:meMA.Aposticha4.incipit	Come, O people, let us…
ltx/en_us_dedes/me.m01.d22:meMA.Aposticha4.melody	
ltx/en_us_dedes/me.m01.d22:meMA.Aposticha4.mode	@ltx/en_us_dedes/miscellanea:misc.Mode1
ltx/en_us_dedes/me.m01.d22:meMA.Aposticha4.text	Come, O people, let us extol the brave athlete Anastasios, who competed well for the sake of true belief in God. Let us salute him and say, “Rejoice, steadfast champion of the Faith, like the Prophets and the Apostles! Rejoice! You had Christ dwelling in you, and you imitated Paul in your deeds. Rejoice, calm refuge for the afflicted! Rejoice! You are the subject of our boast and the great joy of the whole world.
ltx/en_us_dedes/me.m01.d22:meMA.C1.acrostic.notice1	
ltx/en_us_dedes/me.m01.d22:meMA.C1.acrostic.text	
ltx/en_us_dedes/me.m01.d22:meMA.C1.acrostic.title	Canon for the Apostle.
ltx/en_us_dedes/me.m01.d22:meMA.C1.poet	@ltx/en_us_dedes/poets:po.Theofanous
ltx/en_us_dedes/me.m01.d22:meMA.C1.title	@ltx/en_us_dedes/titles:ti.CanonApostle
ltx/en_us_dedes/me.m01.d22:meMA.C1.verse	@ltx/en_us_dedes/prayers:pr.verse_Apostle.text
ltx/en_us_dedes/me.m01.d22:meMA.C2.title	@ltx/en_us_dedes/titles:ti.CanonMartyrM
ltx/en_us_dedes/me.m01.d22:meMA.C2.verse	@ltx/en_us_dedes/prayers:pr.verse_SaintM.text
ltx/en_us_dedes/me.m01.d22:meMA.ExapTheotokion.incipit	All-blameless Mother of our God…
ltx/en_us_dedes/me.m01.d22:meMA.ExapTheotokion.melody	@ltx/en_us_dedes/he.a.m2:heAU.GynaikesAkoutisthite.name
ltx/en_us_dedes/me.m01.d22:meMA.ExapTheotokion.mode	@ltx/en_us_dedes/miscellanea:misc.Mode2
ltx/en_us_dedes/me.m01.d22:meMA.ExapTheotokion.text	All-blameless Mother of our God, * the great and echoing report * of the Apostles and Martyrs, * of the Devout and the Prophets, * we pray you earnestly entreat * your Son and Lord on our behalf * when He will sit on Judgment Day * to judge us as each is worthy, * O all-holy Theotokos.
ltx/en_us_dedes/me.m01.d22:meMA.Exaposteilarion1.greekmelody	@ltx/en_us_dedes/he.a.m2:heAU.GynaikesAkoutisthite.greekname
ltx/en_us_dedes/me.m01.d22:meMA.Exaposteilarion1.incipit	Today that most illustrious *…
ltx/en_us_dedes/me.m01.d22:meMA.Exaposteilarion1.melody	@ltx/en_us_dedes/he.a.m2:heAU.GynaikesAkoutisthite.name
ltx/en_us_dedes/me.m01.d22:meMA.Exaposteilarion1.mode	@ltx/en_us_dedes/miscellanea:misc.Mode2
ltx/en_us_dedes/me.m01.d22:meMA.Exaposteilarion1.text	Today that most illustrious * duo is shining brilliantly, * more radiant than the sunlight, * illumining all creation, * divine Apostle Timothy, * who sits on the Apostles’ throne, * and holy Anastasios, * the great delight of monastics * and also the glory of Martyrs.
ltx/en_us_dedes/me.m01.d22:meMA.Kontakion1.greekmelody	@ltx/en_us_dedes/he.a.m1:heAU.ChorosAngelikos.greekname
ltx/en_us_dedes/me.m01.d22:meMA.Kontakion1.incipit	…
ltx/en_us_dedes/me.m01.d22:meMA.Kontakion1.melody	@ltx/en_us_dedes/he.a.m1:heAU.ChorosAngelikos.name
ltx/en_us_dedes/me.m01.d22:meMA.Kontakion1.mode	@ltx/en_us_dedes/miscellanea:misc.Mode1
ltx/en_us_dedes/me.m01.d22:meMA.Kontakion1.text	
ltx/en_us_dedes/me.m01.d22:meMA.MM.Ve12as56.text	@ltx/en_us_dedes/properties:media.key
ltx/en_us_dedes/me.m01.d22:meMA.MM.Ve45as78.text	@ltx/en_us_dedes/properties:media.key
ltx/en_us_dedes/me.m01.d22:meMA.Ode1C11.greekmelody	@ltx/en_us_dedes/he.h.m1:heHE.SouITropaiouchos.greekname
ltx/en_us_dedes/me.m01.d22:meMA.Ode1C11.incipit	…
ltx/en_us_dedes/me.m01.d22:meMA.Ode1C11.melody	@ltx/en_us_dedes/he.h.m1:heHE.SouITropaiouchos.name
ltx/en_us_dedes/me.m01.d22:meMA.Ode1C11.mode	@ltx/en_us_dedes/miscellanea:misc.Mode1
ltx/en_us_dedes/me.m01.d22:meMA.Ode1C11.ode	@ltx/en_us_dedes/miscellanea:misc.Ode1
ltx/en_us_dedes/me.m01.d22:meMA.Ode1C11.text	
ltx/en_us_dedes/me.m01.d22:meMA.Ode1C12.incipit	…
ltx/en_us_dedes/me.m01.d22:meMA.Ode1C12.melody	@ltx/en_us_dedes/he.h.m1:heHE.SouITropaiouchos.name
ltx/en_us_dedes/me.m01.d22:meMA.Ode1C12.mode	@ltx/en_us_dedes/miscellanea:misc.Mode1
ltx/en_us_dedes/me.m01.d22:meMA.Ode1C12.ode	@ltx/en_us_dedes/miscellanea:misc.Ode1
ltx/en_us_dedes/me.m01.d22:meMA.Ode1C12.text	
ltx/en_us_dedes/me.m01.d22:meMA.Ode1C13.incipit	…
ltx/en_us_dedes/me.m01.d22:meMA.Ode1C13.melody	@ltx/en_us_dedes/he.h.m1:heHE.SouITropaiouchos.name
ltx/en_us_dedes/me.m01.d22:meMA.Ode1C13.mode	@ltx/en_us_dedes/miscellanea:misc.Mode1
ltx/en_us_dedes/me.m01.d22:meMA.Ode1C13.ode	@ltx/en_us_dedes/miscellanea:misc.Ode1
ltx/en_us_dedes/me.m01.d22:meMA.Ode1C13.text	
ltx/en_us_dedes/me.m01.d22:meMA.Ode1C21.greekmelody	@ltx/en_us_dedes/he.h.m1:heHE.SouITropaiouchos.greekname
ltx/en_us_dedes/me.m01.d22:meMA.Ode1C21.incipit	…
ltx/en_us_dedes/me.m01.d22:meMA.Ode1C21.melody	@ltx/en_us_dedes/he.h.m1:heHE.SouITropaiouchos.name
ltx/en_us_dedes/me.m01.d22:meMA.Ode1C21.mode	@ltx/en_us_dedes/miscellanea:misc.Mode1
ltx/en_us_dedes/me.m01.d22:meMA.Ode1C21.ode	@ltx/en_us_dedes/miscellanea:misc.Ode1
ltx/en_us_dedes/me.m01.d22:meMA.Ode1C21.text	
ltx/en_us_dedes/me.m01.d22:meMA.Ode1C22.incipit	…
ltx/en_us_dedes/me.m01.d22:meMA.Ode1C22.melody	@ltx/en_us_dedes/he.h.m1:heHE.SouITropaiouchos.name
ltx/en_us_dedes/me.m01.d22:meMA.Ode1C22.mode	@ltx/en_us_dedes/miscellanea:misc.Mode1
ltx/en_us_dedes/me.m01.d22:meMA.Ode1C22.ode	@ltx/en_us_dedes/miscellanea:misc.Ode1
ltx/en_us_dedes/me.m01.d22:meMA.Ode1C22.text	
ltx/en_us_dedes/me.m01.d22:meMA.Ode1C2T.incipit	…
ltx/en_us_dedes/me.m01.d22:meMA.Ode1C2T.melody	@ltx/en_us_dedes/he.h.m1:heHE.SouITropaiouchos.name
ltx/en_us_dedes/me.m01.d22:meMA.Ode1C2T.mode	@ltx/en_us_dedes/miscellanea:misc.Mode1
ltx/en_us_dedes/me.m01.d22:meMA.Ode1C2T.ode	@ltx/en_us_dedes/miscellanea:misc.Ode1
ltx/en_us_dedes/me.m01.d22:meMA.Ode1C2T.text	
ltx/en_us_dedes/me.m01.d22:meMA.Ode3C11.greekmelody	@ltx/en_us_dedes/he.h.m1:heHE.OMonosEidos.greekname
ltx/en_us_dedes/me.m01.d22:meMA.Ode3C11.incipit	…
ltx/en_us_dedes/me.m01.d22:meMA.Ode3C11.melody	@ltx/en_us_dedes/he.h.m1:heHE.OMonosEidos.name
ltx/en_us_dedes/me.m01.d22:meMA.Ode3C11.mode	@ltx/en_us_dedes/miscellanea:misc.Mode1
ltx/en_us_dedes/me.m01.d22:meMA.Ode3C11.ode	@ltx/en_us_dedes/miscellanea:misc.Ode3
ltx/en_us_dedes/me.m01.d22:meMA.Ode3C11.text	
ltx/en_us_dedes/me.m01.d22:meMA.Ode3C12.incipit	…
ltx/en_us_dedes/me.m01.d22:meMA.Ode3C12.melody	@ltx/en_us_dedes/he.h.m1:heHE.OMonosEidos.name
ltx/en_us_dedes/me.m01.d22:meMA.Ode3C12.mode	@ltx/en_us_dedes/miscellanea:misc.Mode1
ltx/en_us_dedes/me.m01.d22:meMA.Ode3C12.ode	@ltx/en_us_dedes/miscellanea:misc.Ode3
ltx/en_us_dedes/me.m01.d22:meMA.Ode3C12.text	
ltx/en_us_dedes/me.m01.d22:meMA.Ode3C13.incipit	…
ltx/en_us_dedes/me.m01.d22:meMA.Ode3C13.melody	@ltx/en_us_dedes/he.h.m1:heHE.OMonosEidos.name
ltx/en_us_dedes/me.m01.d22:meMA.Ode3C13.mode	@ltx/en_us_dedes/miscellanea:misc.Mode1
ltx/en_us_dedes/me.m01.d22:meMA.Ode3C13.ode	@ltx/en_us_dedes/miscellanea:misc.Ode3
ltx/en_us_dedes/me.m01.d22:meMA.Ode3C13.text	
ltx/en_us_dedes/me.m01.d22:meMA.Ode3C21.greekmelody	@ltx/en_us_dedes/he.h.m1:heHE.OMonosEidos.greekname
ltx/en_us_dedes/me.m01.d22:meMA.Ode3C21.incipit	…
ltx/en_us_dedes/me.m01.d22:meMA.Ode3C21.melody	@ltx/en_us_dedes/he.h.m1:heHE.OMonosEidos.name
ltx/en_us_dedes/me.m01.d22:meMA.Ode3C21.mode	@ltx/en_us_dedes/miscellanea:misc.Mode1
ltx/en_us_dedes/me.m01.d22:meMA.Ode3C21.ode	@ltx/en_us_dedes/miscellanea:misc.Ode3
ltx/en_us_dedes/me.m01.d22:meMA.Ode3C21.text	
ltx/en_us_dedes/me.m01.d22:meMA.Ode3C22.incipit	…
ltx/en_us_dedes/me.m01.d22:meMA.Ode3C22.melody	@ltx/en_us_dedes/he.h.m1:heHE.OMonosEidos.name
ltx/en_us_dedes/me.m01.d22:meMA.Ode3C22.mode	@ltx/en_us_dedes/miscellanea:misc.Mode1
ltx/en_us_dedes/me.m01.d22:meMA.Ode3C22.ode	@ltx/en_us_dedes/miscellanea:misc.Ode3
ltx/en_us_dedes/me.m01.d22:meMA.Ode3C22.text	
ltx/en_us_dedes/me.m01.d22:meMA.Ode3C2T.incipit	…
ltx/en_us_dedes/me.m01.d22:meMA.Ode3C2T.melody	@ltx/en_us_dedes/he.h.m1:heHE.OMonosEidos.name
ltx/en_us_dedes/me.m01.d22:meMA.Ode3C2T.mode	@ltx/en_us_dedes/miscellanea:misc.Mode1
ltx/en_us_dedes/me.m01.d22:meMA.Ode3C2T.ode	@ltx/en_us_dedes/miscellanea:misc.Ode3
ltx/en_us_dedes/me.m01.d22:meMA.Ode3C2T.text	
ltx/en_us_dedes/me.m01.d22:meMA.Ode3H.greekmelody	@ltx/en_us_dedes/he.h.m1:heHE.OMonosEidos.greekname
ltx/en_us_dedes/me.m01.d22:meMA.Ode3H.incipit	@ltx/en_us_dedes/he.h.m1:heHE.OMonosEidos.incipit
ltx/en_us_dedes/me.m01.d22:meMA.Ode3H.melody	@ltx/en_us_dedes/he.h.m1:heHE.OMonosEidos.melody
ltx/en_us_dedes/me.m01.d22:meMA.Ode3H.mode	@ltx/en_us_dedes/miscellanea:misc.Mode1
ltx/en_us_dedes/me.m01.d22:meMA.Ode3H.ode	@ltx/en_us_dedes/miscellanea:misc.Ode3
ltx/en_us_dedes/me.m01.d22:meMA.Ode3H.text	@ltx/en_us_dedes/he.h.m1:heHE.OMonosEidos.text
ltx/en_us_dedes/me.m01.d22:meMA.Ode3Kathisma1.greekmelody	@ltx/en_us_dedes/he.a.m4:heAU.TachyProkatalave.greekname
ltx/en_us_dedes/me.m01.d22:meMA.Ode3Kathisma1.incipit	…
ltx/en_us_dedes/me.m01.d22:meMA.Ode3Kathisma1.melody	@ltx/en_us_dedes/he.a.m4:heAU.TachyProkatalave.name
ltx/en_us_dedes/me.m01.d22:meMA.Ode3Kathisma1.mode	@ltx/en_us_dedes/miscellanea:misc.Mode4
ltx/en_us_dedes/me.m01.d22:meMA.Ode3Kathisma1.text	
ltx/en_us_dedes/me.m01.d22:meMA.Ode3Kathisma2.greekmelody	@ltx/en_us_dedes/he.a.m4:heAU.TachyProkatalave.greekname
ltx/en_us_dedes/me.m01.d22:meMA.Ode3Kathisma2.incipit	…
ltx/en_us_dedes/me.m01.d22:meMA.Ode3Kathisma2.melody	@ltx/en_us_dedes/he.a.m4:heAU.TachyProkatalave.name
ltx/en_us_dedes/me.m01.d22:meMA.Ode3Kathisma2.mode	@ltx/en_us_dedes/miscellanea:misc.Mode4
ltx/en_us_dedes/me.m01.d22:meMA.Ode3Kathisma2.text	
ltx/en_us_dedes/me.m01.d22:meMA.Ode3KathismaSt.incipit	…
ltx/en_us_dedes/me.m01.d22:meMA.Ode3KathismaSt.melody	@ltx/en_us_dedes/he.a.m4:heAU.TachyProkatalave.name
ltx/en_us_dedes/me.m01.d22:meMA.Ode3KathismaSt.mode	@ltx/en_us_dedes/miscellanea:misc.Mode4
ltx/en_us_dedes/me.m01.d22:meMA.Ode3KathismaSt.text	
ltx/en_us_dedes/me.m01.d22:meMA.Ode3KathismaT.incipit	…
ltx/en_us_dedes/me.m01.d22:meMA.Ode3KathismaT.melody	@ltx/en_us_dedes/he.a.m4:heAU.TachyProkatalave.name
ltx/en_us_dedes/me.m01.d22:meMA.Ode3KathismaT.mode	@ltx/en_us_dedes/miscellanea:misc.Mode4
ltx/en_us_dedes/me.m01.d22:meMA.Ode3KathismaT.text	
ltx/en_us_dedes/me.m01.d22:meMA.Ode4C11.greekmelody	@ltx/en_us_dedes/he.h.m1:heHE.OrosSeTiChariti.greekname
ltx/en_us_dedes/me.m01.d22:meMA.Ode4C11.incipit	…
ltx/en_us_dedes/me.m01.d22:meMA.Ode4C11.melody	@ltx/en_us_dedes/he.h.m1:heHE.OrosSeTiChariti.name
ltx/en_us_dedes/me.m01.d22:meMA.Ode4C11.mode	@ltx/en_us_dedes/miscellanea:misc.Mode1
ltx/en_us_dedes/me.m01.d22:meMA.Ode4C11.ode	@ltx/en_us_dedes/miscellanea:misc.Ode4
ltx/en_us_dedes/me.m01.d22:meMA.Ode4C11.text	
ltx/en_us_dedes/me.m01.d22:meMA.Ode4C12.incipit	…
ltx/en_us_dedes/me.m01.d22:meMA.Ode4C12.melody	@ltx/en_us_dedes/he.h.m1:heHE.OrosSeTiChariti.name
ltx/en_us_dedes/me.m01.d22:meMA.Ode4C12.mode	@ltx/en_us_dedes/miscellanea:misc.Mode1
ltx/en_us_dedes/me.m01.d22:meMA.Ode4C12.ode	@ltx/en_us_dedes/miscellanea:misc.Ode4
ltx/en_us_dedes/me.m01.d22:meMA.Ode4C12.text	
ltx/en_us_dedes/me.m01.d22:meMA.Ode4C13.incipit	…
ltx/en_us_dedes/me.m01.d22:meMA.Ode4C13.melody	@ltx/en_us_dedes/he.h.m1:heHE.OrosSeTiChariti.name
ltx/en_us_dedes/me.m01.d22:meMA.Ode4C13.mode	@ltx/en_us_dedes/miscellanea:misc.Mode1
ltx/en_us_dedes/me.m01.d22:meMA.Ode4C13.ode	@ltx/en_us_dedes/miscellanea:misc.Ode4
ltx/en_us_dedes/me.m01.d22:meMA.Ode4C13.text	
ltx/en_us_dedes/me.m01.d22:meMA.Ode4C21.greekmelody	@ltx/en_us_dedes/he.h.m1:heHE.OrosSeTiChariti.greekname
ltx/en_us_dedes/me.m01.d22:meMA.Ode4C21.incipit	…
ltx/en_us_dedes/me.m01.d22:meMA.Ode4C21.melody	@ltx/en_us_dedes/he.h.m1:heHE.OrosSeTiChariti.name
ltx/en_us_dedes/me.m01.d22:meMA.Ode4C21.mode	@ltx/en_us_dedes/miscellanea:misc.Mode1
ltx/en_us_dedes/me.m01.d22:meMA.Ode4C21.ode	@ltx/en_us_dedes/miscellanea:misc.Ode4
ltx/en_us_dedes/me.m01.d22:meMA.Ode4C21.text	
ltx/en_us_dedes/me.m01.d22:meMA.Ode4C22.incipit	…
ltx/en_us_dedes/me.m01.d22:meMA.Ode4C22.melody	@ltx/en_us_dedes/he.h.m1:heHE.OrosSeTiChariti.name
ltx/en_us_dedes/me.m01.d22:meMA.Ode4C22.mode	@ltx/en_us_dedes/miscellanea:misc.Mode1
ltx/en_us_dedes/me.m01.d22:meMA.Ode4C22.ode	@ltx/en_us_dedes/miscellanea:misc.Ode4
ltx/en_us_dedes/me.m01.d22:meMA.Ode4C22.text	
ltx/en_us_dedes/me.m01.d22:meMA.Ode4C2T.incipit	…
ltx/en_us_dedes/me.m01.d22:meMA.Ode4C2T.melody	@ltx/en_us_dedes/he.h.m1:heHE.OrosSeTiChariti.name
ltx/en_us_dedes/me.m01.d22:meMA.Ode4C2T.mode	@ltx/en_us_dedes/miscellanea:misc.Mode1
ltx/en_us_dedes/me.m01.d22:meMA.Ode4C2T.ode	@ltx/en_us_dedes/miscellanea:misc.Ode4
ltx/en_us_dedes/me.m01.d22:meMA.Ode4C2T.text	
ltx/en_us_dedes/me.m01.d22:meMA.Ode5C11.greekmelody	@ltx/en_us_dedes/he.h.m1:heHE.TheosOnEirinis.greekname
ltx/en_us_dedes/me.m01.d22:meMA.Ode5C11.incipit	…
ltx/en_us_dedes/me.m01.d22:meMA.Ode5C11.melody	@ltx/en_us_dedes/he.h.m1:heHE.TheosOnEirinis.name
ltx/en_us_dedes/me.m01.d22:meMA.Ode5C11.mode	@ltx/en_us_dedes/miscellanea:misc.Mode1
ltx/en_us_dedes/me.m01.d22:meMA.Ode5C11.ode	@ltx/en_us_dedes/miscellanea:misc.Ode5
ltx/en_us_dedes/me.m01.d22:meMA.Ode5C11.text	
ltx/en_us_dedes/me.m01.d22:meMA.Ode5C12.incipit	…
ltx/en_us_dedes/me.m01.d22:meMA.Ode5C12.melody	@ltx/en_us_dedes/he.h.m1:heHE.TheosOnEirinis.name
ltx/en_us_dedes/me.m01.d22:meMA.Ode5C12.mode	@ltx/en_us_dedes/miscellanea:misc.Mode1
ltx/en_us_dedes/me.m01.d22:meMA.Ode5C12.ode	@ltx/en_us_dedes/miscellanea:misc.Ode5
ltx/en_us_dedes/me.m01.d22:meMA.Ode5C12.text	
ltx/en_us_dedes/me.m01.d22:meMA.Ode5C13.incipit	…
ltx/en_us_dedes/me.m01.d22:meMA.Ode5C13.melody	@ltx/en_us_dedes/he.h.m1:heHE.TheosOnEirinis.name
ltx/en_us_dedes/me.m01.d22:meMA.Ode5C13.mode	@ltx/en_us_dedes/miscellanea:misc.Mode1
ltx/en_us_dedes/me.m01.d22:meMA.Ode5C13.ode	@ltx/en_us_dedes/miscellanea:misc.Ode5
ltx/en_us_dedes/me.m01.d22:meMA.Ode5C13.text	
ltx/en_us_dedes/me.m01.d22:meMA.Ode5C21.greekmelody	@ltx/en_us_dedes/he.h.m1:heHE.TheosOnEirinis.greekname
ltx/en_us_dedes/me.m01.d22:meMA.Ode5C21.incipit	…
ltx/en_us_dedes/me.m01.d22:meMA.Ode5C21.melody	@ltx/en_us_dedes/he.h.m1:heHE.TheosOnEirinis.name
ltx/en_us_dedes/me.m01.d22:meMA.Ode5C21.mode	@ltx/en_us_dedes/miscellanea:misc.Mode1
ltx/en_us_dedes/me.m01.d22:meMA.Ode5C21.ode	@ltx/en_us_dedes/miscellanea:misc.Ode5
ltx/en_us_dedes/me.m01.d22:meMA.Ode5C21.text	
ltx/en_us_dedes/me.m01.d22:meMA.Ode5C22.incipit	…
ltx/en_us_dedes/me.m01.d22:meMA.Ode5C22.melody	@ltx/en_us_dedes/he.h.m1:heHE.TheosOnEirinis.name
ltx/en_us_dedes/me.m01.d22:meMA.Ode5C22.mode	@ltx/en_us_dedes/miscellanea:misc.Mode1
ltx/en_us_dedes/me.m01.d22:meMA.Ode5C22.ode	@ltx/en_us_dedes/miscellanea:misc.Ode5
ltx/en_us_dedes/me.m01.d22:meMA.Ode5C22.text	
ltx/en_us_dedes/me.m01.d22:meMA.Ode5C2T.incipit	…
ltx/en_us_dedes/me.m01.d22:meMA.Ode5C2T.melody	@ltx/en_us_dedes/he.h.m1:heHE.TheosOnEirinis.name
ltx/en_us_dedes/me.m01.d22:meMA.Ode5C2T.mode	@ltx/en_us_dedes/miscellanea:misc.Mode1
ltx/en_us_dedes/me.m01.d22:meMA.Ode5C2T.ode	@ltx/en_us_dedes/miscellanea:misc.Ode5
ltx/en_us_dedes/me.m01.d22:meMA.Ode5C2T.text	
ltx/en_us_dedes/me.m01.d22:meMA.Ode6C11.greekmelody	@ltx/en_us_dedes/he.h.m1:heHE.SplanchnonIonan.greekname
ltx/en_us_dedes/me.m01.d22:meMA.Ode6C11.incipit	…
ltx/en_us_dedes/me.m01.d22:meMA.Ode6C11.melody	@ltx/en_us_dedes/he.h.m1:heHE.SplanchnonIonan.name
ltx/en_us_dedes/me.m01.d22:meMA.Ode6C11.mode	@ltx/en_us_dedes/miscellanea:misc.Mode1
ltx/en_us_dedes/me.m01.d22:meMA.Ode6C11.ode	@ltx/en_us_dedes/miscellanea:misc.Ode6
ltx/en_us_dedes/me.m01.d22:meMA.Ode6C11.text	
ltx/en_us_dedes/me.m01.d22:meMA.Ode6C12.incipit	…
ltx/en_us_dedes/me.m01.d22:meMA.Ode6C12.melody	@ltx/en_us_dedes/he.h.m1:heHE.SplanchnonIonan.name
ltx/en_us_dedes/me.m01.d22:meMA.Ode6C12.mode	@ltx/en_us_dedes/miscellanea:misc.Mode1
ltx/en_us_dedes/me.m01.d22:meMA.Ode6C12.ode	@ltx/en_us_dedes/miscellanea:misc.Ode6
ltx/en_us_dedes/me.m01.d22:meMA.Ode6C12.text	
ltx/en_us_dedes/me.m01.d22:meMA.Ode6C13.incipit	…
ltx/en_us_dedes/me.m01.d22:meMA.Ode6C13.melody	@ltx/en_us_dedes/he.h.m1:heHE.SplanchnonIonan.name
ltx/en_us_dedes/me.m01.d22:meMA.Ode6C13.mode	@ltx/en_us_dedes/miscellanea:misc.Mode1
ltx/en_us_dedes/me.m01.d22:meMA.Ode6C13.ode	@ltx/en_us_dedes/miscellanea:misc.Ode6
ltx/en_us_dedes/me.m01.d22:meMA.Ode6C13.text	
ltx/en_us_dedes/me.m01.d22:meMA.Ode6C21.greekmelody	@ltx/en_us_dedes/he.h.m1:heHE.SplanchnonIonan.greekname
ltx/en_us_dedes/me.m01.d22:meMA.Ode6C21.incipit	…
ltx/en_us_dedes/me.m01.d22:meMA.Ode6C21.melody	@ltx/en_us_dedes/he.h.m1:heHE.SplanchnonIonan.name
ltx/en_us_dedes/me.m01.d22:meMA.Ode6C21.mode	@ltx/en_us_dedes/miscellanea:misc.Mode1
ltx/en_us_dedes/me.m01.d22:meMA.Ode6C21.ode	@ltx/en_us_dedes/miscellanea:misc.Ode6
ltx/en_us_dedes/me.m01.d22:meMA.Ode6C21.text	
ltx/en_us_dedes/me.m01.d22:meMA.Ode6C2T.incipit	…
ltx/en_us_dedes/me.m01.d22:meMA.Ode6C2T.melody	@ltx/en_us_dedes/he.h.m1:heHE.SplanchnonIonan.name
ltx/en_us_dedes/me.m01.d22:meMA.Ode6C2T.mode	@ltx/en_us_dedes/miscellanea:misc.Mode1
ltx/en_us_dedes/me.m01.d22:meMA.Ode6C2T.ode	@ltx/en_us_dedes/miscellanea:misc.Ode6
ltx/en_us_dedes/me.m01.d22:meMA.Ode6C2T.text	
ltx/en_us_dedes/me.m01.d22:meMA.Ode6H.greekmelody	@ltx/en_us_dedes/he.h.m1:heHE.SplanchnonIonan.greekname
ltx/en_us_dedes/me.m01.d22:meMA.Ode6H.incipit	@ltx/en_us_dedes/he.h.m1:heHE.SplanchnonIonan.incipit
ltx/en_us_dedes/me.m01.d22:meMA.Ode6H.melody	@ltx/en_us_dedes/he.h.m1:heHE.SplanchnonIonan.melody
ltx/en_us_dedes/me.m01.d22:meMA.Ode6H.mode	@ltx/en_us_dedes/miscellanea:misc.Mode1
ltx/en_us_dedes/me.m01.d22:meMA.Ode6H.ode	@ltx/en_us_dedes/miscellanea:misc.Ode6
ltx/en_us_dedes/me.m01.d22:meMA.Ode6H.text	@ltx/en_us_dedes/he.h.m1:heHE.SplanchnonIonan.text
ltx/en_us_dedes/me.m01.d22:meMA.Ode7C11.greekmelody	@ltx/en_us_dedes/he.h.m1:heHE.SeNoitin.greekname
ltx/en_us_dedes/me.m01.d22:meMA.Ode7C11.incipit	…
ltx/en_us_dedes/me.m01.d22:meMA.Ode7C11.melody	@ltx/en_us_dedes/he.h.m1:heHE.SeNoitin.name
ltx/en_us_dedes/me.m01.d22:meMA.Ode7C11.mode	@ltx/en_us_dedes/miscellanea:misc.Mode1
ltx/en_us_dedes/me.m01.d22:meMA.Ode7C11.ode	@ltx/en_us_dedes/miscellanea:misc.Ode7
ltx/en_us_dedes/me.m01.d22:meMA.Ode7C11.text	
ltx/en_us_dedes/me.m01.d22:meMA.Ode7C12.incipit	…
ltx/en_us_dedes/me.m01.d22:meMA.Ode7C12.melody	@ltx/en_us_dedes/he.h.m1:heHE.SeNoitin.name
ltx/en_us_dedes/me.m01.d22:meMA.Ode7C12.mode	@ltx/en_us_dedes/miscellanea:misc.Mode1
ltx/en_us_dedes/me.m01.d22:meMA.Ode7C12.ode	@ltx/en_us_dedes/miscellanea:misc.Ode7
ltx/en_us_dedes/me.m01.d22:meMA.Ode7C12.text	
ltx/en_us_dedes/me.m01.d22:meMA.Ode7C13.incipit	…
ltx/en_us_dedes/me.m01.d22:meMA.Ode7C13.melody	@ltx/en_us_dedes/he.h.m1:heHE.SeNoitin.name
ltx/en_us_dedes/me.m01.d22:meMA.Ode7C13.mode	@ltx/en_us_dedes/miscellanea:misc.Mode1
ltx/en_us_dedes/me.m01.d22:meMA.Ode7C13.ode	@ltx/en_us_dedes/miscellanea:misc.Ode7
ltx/en_us_dedes/me.m01.d22:meMA.Ode7C13.text	
ltx/en_us_dedes/me.m01.d22:meMA.Ode7C21.greekmelody	@ltx/en_us_dedes/he.h.m1:heHE.SeNoitin.greekname
ltx/en_us_dedes/me.m01.d22:meMA.Ode7C21.incipit	…
ltx/en_us_dedes/me.m01.d22:meMA.Ode7C21.melody	@ltx/en_us_dedes/he.h.m1:heHE.SeNoitin.name
ltx/en_us_dedes/me.m01.d22:meMA.Ode7C21.mode	@ltx/en_us_dedes/miscellanea:misc.Mode1
ltx/en_us_dedes/me.m01.d22:meMA.Ode7C21.ode	@ltx/en_us_dedes/miscellanea:misc.Ode7
ltx/en_us_dedes/me.m01.d22:meMA.Ode7C21.text	
ltx/en_us_dedes/me.m01.d22:meMA.Ode7C22.incipit	…
ltx/en_us_dedes/me.m01.d22:meMA.Ode7C22.melody	@ltx/en_us_dedes/he.h.m1:heHE.SeNoitin.name
ltx/en_us_dedes/me.m01.d22:meMA.Ode7C22.mode	@ltx/en_us_dedes/miscellanea:misc.Mode1
ltx/en_us_dedes/me.m01.d22:meMA.Ode7C22.ode	@ltx/en_us_dedes/miscellanea:misc.Ode7
ltx/en_us_dedes/me.m01.d22:meMA.Ode7C22.text	
ltx/en_us_dedes/me.m01.d22:meMA.Ode7C2T.incipit	…
ltx/en_us_dedes/me.m01.d22:meMA.Ode7C2T.melody	@ltx/en_us_dedes/he.h.m1:heHE.SeNoitin.name
ltx/en_us_dedes/me.m01.d22:meMA.Ode7C2T.mode	@ltx/en_us_dedes/miscellanea:misc.Mode1
ltx/en_us_dedes/me.m01.d22:meMA.Ode7C2T.ode	@ltx/en_us_dedes/miscellanea:misc.Ode7
ltx/en_us_dedes/me.m01.d22:meMA.Ode7C2T.text	
ltx/en_us_dedes/me.m01.d22:meMA.Ode8C11.greekmelody	@ltx/en_us_dedes/he.h.m1:heHE.ThavmatosYperfyous.greekname
ltx/en_us_dedes/me.m01.d22:meMA.Ode8C11.incipit	…
ltx/en_us_dedes/me.m01.d22:meMA.Ode8C11.melody	@ltx/en_us_dedes/he.h.m1:heHE.ThavmatosYperfyous.name
ltx/en_us_dedes/me.m01.d22:meMA.Ode8C11.mode	@ltx/en_us_dedes/miscellanea:misc.Mode1
ltx/en_us_dedes/me.m01.d22:meMA.Ode8C11.ode	@ltx/en_us_dedes/miscellanea:misc.Ode8
ltx/en_us_dedes/me.m01.d22:meMA.Ode8C11.text	
ltx/en_us_dedes/me.m01.d22:meMA.Ode8C12.incipit	…
ltx/en_us_dedes/me.m01.d22:meMA.Ode8C12.melody	@ltx/en_us_dedes/he.h.m1:heHE.ThavmatosYperfyous.name
ltx/en_us_dedes/me.m01.d22:meMA.Ode8C12.mode	@ltx/en_us_dedes/miscellanea:misc.Mode1
ltx/en_us_dedes/me.m01.d22:meMA.Ode8C12.ode	@ltx/en_us_dedes/miscellanea:misc.Ode8
ltx/en_us_dedes/me.m01.d22:meMA.Ode8C12.text	
ltx/en_us_dedes/me.m01.d22:meMA.Ode8C13.incipit	…
ltx/en_us_dedes/me.m01.d22:meMA.Ode8C13.melody	@ltx/en_us_dedes/he.h.m1:heHE.ThavmatosYperfyous.name
ltx/en_us_dedes/me.m01.d22:meMA.Ode8C13.mode	@ltx/en_us_dedes/miscellanea:misc.Mode1
ltx/en_us_dedes/me.m01.d22:meMA.Ode8C13.ode	@ltx/en_us_dedes/miscellanea:misc.Ode8
ltx/en_us_dedes/me.m01.d22:meMA.Ode8C13.text	
ltx/en_us_dedes/me.m01.d22:meMA.Ode8C21.greekmelody	@ltx/en_us_dedes/he.h.m1:heHE.ThavmatosYperfyous.greekname
ltx/en_us_dedes/me.m01.d22:meMA.Ode8C21.incipit	…
ltx/en_us_dedes/me.m01.d22:meMA.Ode8C21.melody	@ltx/en_us_dedes/he.h.m1:heHE.ThavmatosYperfyous.name
ltx/en_us_dedes/me.m01.d22:meMA.Ode8C21.mode	@ltx/en_us_dedes/miscellanea:misc.Mode1
ltx/en_us_dedes/me.m01.d22:meMA.Ode8C21.ode	@ltx/en_us_dedes/miscellanea:misc.Ode8
ltx/en_us_dedes/me.m01.d22:meMA.Ode8C21.text	
ltx/en_us_dedes/me.m01.d22:meMA.Ode8C22.incipit	…
ltx/en_us_dedes/me.m01.d22:meMA.Ode8C22.melody	@ltx/en_us_dedes/he.h.m1:heHE.ThavmatosYperfyous.name
ltx/en_us_dedes/me.m01.d22:meMA.Ode8C22.mode	@ltx/en_us_dedes/miscellanea:misc.Mode1
ltx/en_us_dedes/me.m01.d22:meMA.Ode8C22.ode	@ltx/en_us_dedes/miscellanea:misc.Ode8
ltx/en_us_dedes/me.m01.d22:meMA.Ode8C22.text	
ltx/en_us_dedes/me.m01.d22:meMA.Ode8C2T.incipit	…
ltx/en_us_dedes/me.m01.d22:meMA.Ode8C2T.melody	@ltx/en_us_dedes/he.h.m1:heHE.ThavmatosYperfyous.name
ltx/en_us_dedes/me.m01.d22:meMA.Ode8C2T.mode	@ltx/en_us_dedes/miscellanea:misc.Mode1
ltx/en_us_dedes/me.m01.d22:meMA.Ode8C2T.ode	@ltx/en_us_dedes/miscellanea:misc.Ode8
ltx/en_us_dedes/me.m01.d22:meMA.Ode8C2T.text	
ltx/en_us_dedes/me.m01.d22:meMA.Ode8H.greekmelody	@ltx/en_us_dedes/he.h.m1:heHE.ThavmatosYperfyous.greekname
ltx/en_us_dedes/me.m01.d22:meMA.Ode8H.incipit	@ltx/en_us_dedes/he.h.m1:heHE.ThavmatosYperfyous.incipit
ltx/en_us_dedes/me.m01.d22:meMA.Ode8H.melody	@ltx/en_us_dedes/he.h.m1:heHE.ThavmatosYperfyous.melody
ltx/en_us_dedes/me.m01.d22:meMA.Ode8H.mode	@ltx/en_us_dedes/miscellanea:misc.Mode1
ltx/en_us_dedes/me.m01.d22:meMA.Ode8H.ode	@ltx/en_us_dedes/miscellanea:misc.Ode8
ltx/en_us_dedes/me.m01.d22:meMA.Ode8H.text	@ltx/en_us_dedes/he.h.m1:heHE.ThavmatosYperfyous.text
ltx/en_us_dedes/me.m01.d22:meMA.Ode9C11.greekmelody	@ltx/en_us_dedes/he.h.m1:heHE.TyponTisAgnis.greekname
ltx/en_us_dedes/me.m01.d22:meMA.Ode9C11.incipit	…
ltx/en_us_dedes/me.m01.d22:meMA.Ode9C11.melody	@ltx/en_us_dedes/he.h.m1:heHE.TyponTisAgnis.name
ltx/en_us_dedes/me.m01.d22:meMA.Ode9C11.mode	@ltx/en_us_dedes/miscellanea:misc.Mode1
ltx/en_us_dedes/me.m01.d22:meMA.Ode9C11.ode	@ltx/en_us_dedes/miscellanea:misc.Ode9
ltx/en_us_dedes/me.m01.d22:meMA.Ode9C11.text	
ltx/en_us_dedes/me.m01.d22:meMA.Ode9C12.incipit	…
ltx/en_us_dedes/me.m01.d22:meMA.Ode9C12.melody	@ltx/en_us_dedes/he.h.m1:heHE.TyponTisAgnis.name
ltx/en_us_dedes/me.m01.d22:meMA.Ode9C12.mode	@ltx/en_us_dedes/miscellanea:misc.Mode1
ltx/en_us_dedes/me.m01.d22:meMA.Ode9C12.ode	@ltx/en_us_dedes/miscellanea:misc.Ode9
ltx/en_us_dedes/me.m01.d22:meMA.Ode9C12.text	
ltx/en_us_dedes/me.m01.d22:meMA.Ode9C13.incipit	…
ltx/en_us_dedes/me.m01.d22:meMA.Ode9C13.melody	@ltx/en_us_dedes/he.h.m1:heHE.TyponTisAgnis.name
ltx/en_us_dedes/me.m01.d22:meMA.Ode9C13.mode	@ltx/en_us_dedes/miscellanea:misc.Mode1
ltx/en_us_dedes/me.m01.d22:meMA.Ode9C13.ode	@ltx/en_us_dedes/miscellanea:misc.Ode9
ltx/en_us_dedes/me.m01.d22:meMA.Ode9C13.text	
ltx/en_us_dedes/me.m01.d22:meMA.Ode9C21.greekmelody	@ltx/en_us_dedes/he.h.m1:heHE.TyponTisAgnis.greekname
ltx/en_us_dedes/me.m01.d22:meMA.Ode9C21.incipit	…
ltx/en_us_dedes/me.m01.d22:meMA.Ode9C21.melody	@ltx/en_us_dedes/he.h.m1:heHE.TyponTisAgnis.name
ltx/en_us_dedes/me.m01.d22:meMA.Ode9C21.mode	@ltx/en_us_dedes/miscellanea:misc.Mode1
ltx/en_us_dedes/me.m01.d22:meMA.Ode9C21.ode	@ltx/en_us_dedes/miscellanea:misc.Ode9
ltx/en_us_dedes/me.m01.d22:meMA.Ode9C21.text	
ltx/en_us_dedes/me.m01.d22:meMA.Ode9C22.incipit	…
ltx/en_us_dedes/me.m01.d22:meMA.Ode9C22.melody	@ltx/en_us_dedes/he.h.m1:heHE.TyponTisAgnis.name
ltx/en_us_dedes/me.m01.d22:meMA.Ode9C22.mode	@ltx/en_us_dedes/miscellanea:misc.Mode1
ltx/en_us_dedes/me.m01.d22:meMA.Ode9C22.ode	@ltx/en_us_dedes/miscellanea:misc.Ode9
ltx/en_us_dedes/me.m01.d22:meMA.Ode9C22.text	
ltx/en_us_dedes/me.m01.d22:meMA.Ode9C2T.incipit	…
ltx/en_us_dedes/me.m01.d22:meMA.Ode9C2T.melody	@ltx/en_us_dedes/he.h.m1:heHE.TyponTisAgnis.name
ltx/en_us_dedes/me.m01.d22:meMA.Ode9C2T.mode	@ltx/en_us_dedes/miscellanea:misc.Mode1
ltx/en_us_dedes/me.m01.d22:meMA.Ode9C2T.ode	@ltx/en_us_dedes/miscellanea:misc.Ode9
ltx/en_us_dedes/me.m01.d22:meMA.Ode9C2T.text	
ltx/en_us_dedes/me.m01.d22:meMA.Ode9H.greekmelody	@ltx/en_us_dedes/he.h.m1:heHE.TyponTisAgnis.greekname
ltx/en_us_dedes/me.m01.d22:meMA.Ode9H.incipit	@ltx/en_us_dedes/he.h.m1:heHE.TyponTisAgnis.incipit
ltx/en_us_dedes/me.m01.d22:meMA.Ode9H.melody	@ltx/en_us_dedes/he.h.m1:heHE.TyponTisAgnis.melody
ltx/en_us_dedes/me.m01.d22:meMA.Ode9H.mode	@ltx/en_us_dedes/miscellanea:misc.Mode1
ltx/en_us_dedes/me.m01.d22:meMA.Ode9H.ode	@ltx/en_us_dedes/miscellanea:misc.Ode9
ltx/en_us_dedes/me.m01.d22:meMA.Ode9H.text	@ltx/en_us_dedes/he.h.m1:heHE.TyponTisAgnis.text
ltx/en_us_dedes/me.m01.d22:meMA.Oikos1.text	The great Apostle Paul, that most experienced fisher of men, once let out the nets of grace, and he pulled in Timothy the preacher of God, a holy catch. Together they went all over the world, and from the mouth of the devil they snatched all who received the word of the Faith. Among them was brave Anastasios, who, having believed, renounced all the error of the Persians and bore the name of Christ on his shoulders. And now, by grace he drives away from us our souls’ passions and our bodies’ disease!.
ltx/en_us_dedes/me.m01.d22:meVE.Apolytikion1.incipit	Having learned kindness, and being…
ltx/en_us_dedes/me.m01.d22:meVE.Apolytikion1.melody	
ltx/en_us_dedes/me.m01.d22:meVE.Apolytikion1.mode	@ltx/en_us_dedes/miscellanea:misc.Mode4
ltx/en_us_dedes/me.m01.d22:meVE.Apolytikion1.text	Having learned kindness, and being always steady and sober, vested with a good conscience as befits a priest, you drew out from the Chosen Vessel the secrets of God. And having kept the faith, you have finished the fair race, O Hieromartyr Timothy. Intercede with Christ our God, entreating Him to save our souls.
ltx/en_us_dedes/me.m01.d22:meVE.Apolytikion2.greekmelody	@ltx/en_us_dedes/he.a.m4:heAU.TachyProkatalave.greekname
ltx/en_us_dedes/me.m01.d22:meVE.Apolytikion2.incipit	@ltx/en_us_dedes/he.ga:heGA.OMartysSouKyrie.incipit
ltx/en_us_dedes/me.m01.d22:meVE.Apolytikion2.melody	@ltx/en_us_dedes/he.a.m4:heAU.TachyProkatalave.name
ltx/en_us_dedes/me.m01.d22:meVE.Apolytikion2.mode	@ltx/en_us_dedes/miscellanea:misc.Mode4
ltx/en_us_dedes/me.m01.d22:meVE.Apolytikion2.text	@ltx/en_us_dedes/he.ga:heGA.OMartysSouKyrie.text
ltx/en_us_dedes/me.m01.d22:meVE.AposGlory.incipit	O Christ, You magnified the…
ltx/en_us_dedes/me.m01.d22:meVE.AposGlory.melody	
ltx/en_us_dedes/me.m01.d22:meVE.AposGlory.mode	@ltx/en_us_dedes/miscellanea:misc.Mode2
ltx/en_us_dedes/me.m01.d22:meVE.AposGlory.text	O Christ, You magnified the power of the precious Cross in Judea, and You did this also now in Babylon. For by it they have learned of the life-giving Feast of the Resurrection. The Cross came into their midst as a captive, and it became their liberator from the madness of idolatry. And the unimpeachable witness to its marvels is glorious Anastasios, the athlete now extolled, who dances with Angels and intercedes for our souls.
ltx/en_us_dedes/me.m01.d22:meVE.AposStavrotheotokion.greekmelody	@ltx/en_us_dedes/he.a.m2:heAU.OteEkTouXylou.greekname
ltx/en_us_dedes/me.m01.d22:meVE.AposStavrotheotokion.incipit	…
ltx/en_us_dedes/me.m01.d22:meVE.AposStavrotheotokion.melody	@ltx/en_us_dedes/he.a.m2:heAU.OteEkTouXylou.name
ltx/en_us_dedes/me.m01.d22:meVE.AposStavrotheotokion.mode	@ltx/en_us_dedes/miscellanea:misc.Mode2
ltx/en_us_dedes/me.m01.d22:meVE.AposStavrotheotokion.text	
ltx/en_us_dedes/me.m01.d22:meVE.AposTheotokion.greekmelody	@ltx/en_us_dedes/he.a.m2:heAU.OteEkTouXylou.greekname
ltx/en_us_dedes/me.m01.d22:meVE.AposTheotokion.incipit	Only you, O all-holy Bride…
ltx/en_us_dedes/me.m01.d22:meVE.AposTheotokion.melody	@ltx/en_us_dedes/he.a.m2:heAU.OteEkTouXylou.name
ltx/en_us_dedes/me.m01.d22:meVE.AposTheotokion.mode	@ltx/en_us_dedes/miscellanea:misc.Mode2
ltx/en_us_dedes/me.m01.d22:meVE.AposTheotokion.text	Only you, O all-holy Bride of God, * carried in your womb unconstricted the uncontainable God, * who became a man in His sublime benevolence. * Blessed Virgin, I therefore pray * and ask that you free me * from the force of sinful passions that constrict my soul, * so that being cured of the passions, * I may walk the straight and the narrow * way and find my destination, life on high.
ltx/en_us_dedes/me.m01.d22:meVE.Aposticha4.incipit	…
ltx/en_us_dedes/me.m01.d22:meVE.Aposticha4.melody	
ltx/en_us_dedes/me.m01.d22:meVE.Aposticha4.mode	@ltx/en_us_dedes/miscellanea:misc.Mode1
ltx/en_us_dedes/me.m01.d22:meVE.Aposticha4.text	
ltx/en_us_dedes/me.m01.d22:meVE.SticGlory.incipit	God foreordained you, and wise…
ltx/en_us_dedes/me.m01.d22:meVE.SticGlory.melody	
ltx/en_us_dedes/me.m01.d22:meVE.SticGlory.mode	@ltx/en_us_dedes/miscellanea:misc.Mode8
ltx/en_us_dedes/me.m01.d22:meVE.SticGlory.poet	@ltx/en_us_dedes/poets:po.Stouditou
ltx/en_us_dedes/me.m01.d22:meVE.SticGlory.text	God foreordained you, and wise Paul made you a disciple, and thus you were initiated into divine knowledge. You lived your life well, and without hesitation you embraced the Faith even unto blood, and thus you proved to be a hierarch faithful to the things of God, O Apostle Timothy. Then you rebuked those who madly worshiped the idols. You were beaten with clubs and stones, and you obtained the martyr’s crown. Therefore, O all-blessed Saint, intercede for us who faithfully observe your all-venerable memory.
ltx/en_us_dedes/me.m01.d22:meVE.SticStavrotheotokion.greekmelody	@ltx/en_us_dedes/he.a.m8:heAU.OTouParadoxou.greekname
ltx/en_us_dedes/me.m01.d22:meVE.SticStavrotheotokion.incipit	@ltx/en_us_dedes/oc.m8.d4:ocVE.SticTheotokion.incipit
ltx/en_us_dedes/me.m01.d22:meVE.SticStavrotheotokion.melody	@ltx/en_us_dedes/he.a.m8:heAU.OTouParadoxou.name
ltx/en_us_dedes/me.m01.d22:meVE.SticStavrotheotokion.mode	@ltx/en_us_dedes/miscellanea:misc.Mode8
ltx/en_us_dedes/me.m01.d22:meVE.SticStavrotheotokion.text	@ltx/en_us_dedes/oc.m8.d4:ocVE.SticTheotokion.text
ltx/en_us_dedes/me.m01.d22:meVE.SticTheotokion.greekmelody	@ltx/en_us_dedes/he.a.m8:heAU.OTouParadoxou.greekname
ltx/en_us_dedes/me.m01.d22:meVE.SticTheotokion.incipit	@ltx/en_us_dedes/oc.m8.d4:ocVE.Stichera4.incipit
ltx/en_us_dedes/me.m01.d22:meVE.SticTheotokion.melody	@ltx/en_us_dedes/he.a.m8:heAU.OTouParadoxou.name
ltx/en_us_dedes/me.m01.d22:meVE.SticTheotokion.mode	@ltx/en_us_dedes/miscellanea:misc.Mode8
ltx/en_us_dedes/me.m01.d22:meVE.SticTheotokion.text	@ltx/en_us_dedes/oc.m8.d4:ocVE.Stichera4.text
ltx/en_us_dedes/me.m01.d22:meVE.Stichera01.greekmelody	@ltx/en_us_dedes/he.a.m1:heAU.PaneffimoiMartyres.greekname
ltx/en_us_dedes/me.m01.d22:meVE.Stichera01.incipit	O Timothy, teacher of the…
ltx/en_us_dedes/me.m01.d22:meVE.Stichera01.melody	@ltx/en_us_dedes/he.a.m1:heAU.PaneffimoiMartyres.name
ltx/en_us_dedes/me.m01.d22:meVE.Stichera01.mode	@ltx/en_us_dedes/miscellanea:misc.Mode1
ltx/en_us_dedes/me.m01.d22:meVE.Stichera01.text	O Timothy, teacher of the Faith, * by the Holy Spirit’s rays you were completely illumined in a most distinguished way. * You were like a bright star, * brilliantly traversing the entire earth, enlightening it by grace. Do therefore now entreat, * interceding, that surpassing peace and great mercy * be upon our souls bestowed.
ltx/en_us_dedes/me.m01.d22:meVE.Stichera02.incipit	O Timothy, godly-minded Saint, *…
ltx/en_us_dedes/me.m01.d22:meVE.Stichera02.melody	@ltx/en_us_dedes/he.a.m1:heAU.PaneffimoiMartyres.name
ltx/en_us_dedes/me.m01.d22:meVE.Stichera02.mode	@ltx/en_us_dedes/miscellanea:misc.Mode1
ltx/en_us_dedes/me.m01.d22:meVE.Stichera02.text	O Timothy, godly-minded Saint, * from the river of delight you drank your fill, then you gave this drink to those who ardently * longed for godly knowledge, * for you imitated Christ. * To Him you now have joyfully gone, and you behold the Trinity’s * holy glory, which exceeds all light, * and divine peace, * infinitely powerful.
ltx/en_us_dedes/me.m01.d22:meVE.Stichera03.incipit	O Timothy, godly-minded Saint, *…
ltx/en_us_dedes/me.m01.d22:meVE.Stichera03.melody	@ltx/en_us_dedes/he.a.m1:heAU.PaneffimoiMartyres.name
ltx/en_us_dedes/me.m01.d22:meVE.Stichera03.mode	@ltx/en_us_dedes/miscellanea:misc.Mode1
ltx/en_us_dedes/me.m01.d22:meVE.Stichera03.text	O Timothy, godly-minded Saint, * frequent ailments of your body and infirmities made you all the stronger in your mind. * Readily you brought down * the dominion of deceit and error, for the power of Christ the Lord protected you from harm. * And sublimely you proclaimed to us * the divine word, * the Gospel of peace and love.
ltx/en_us_dedes/me.m01.d22:meVE.Stichera04.greekmelody	@ltx/en_us_dedes/he.a.m1:heAU.PaneffimoiMartyres.greekname
ltx/en_us_dedes/me.m01.d22:meVE.Stichera04.incipit	O Martyr, your miracles are…
ltx/en_us_dedes/me.m01.d22:meVE.Stichera04.melody	@ltx/en_us_dedes/he.a.m1:heAU.PaneffimoiMartyres.name
ltx/en_us_dedes/me.m01.d22:meVE.Stichera04.mode	@ltx/en_us_dedes/miscellanea:misc.Mode1
ltx/en_us_dedes/me.m01.d22:meVE.Stichera04.text	O Martyr, your miracles are now * throughout all the world extolled, * O Anastasios the Wonderworker. Christ adorned you thus * with these wonder-workings * to reward you in return for painful torments you had endured for Him. And also after death * He has made you worthy to enjoy * the immortal * glory and beatitude.
ltx/en_us_dedes/me.m01.d22:meVE.Stichera05.incipit	O Martyr, you are the…
ltx/en_us_dedes/me.m01.d22:meVE.Stichera05.melody	@ltx/en_us_dedes/he.a.m1:heAU.PaneffimoiMartyres.name
ltx/en_us_dedes/me.m01.d22:meVE.Stichera05.mode	@ltx/en_us_dedes/miscellanea:misc.Mode1
ltx/en_us_dedes/me.m01.d22:meVE.Stichera05.text	O Martyr, you are the pride and joy * of the martyrs, for you raised glorious trophies against the devil’s error. And your name, * which means one who raises, * honors you. For as a victor, you, O Anastasios, were mightily successful everywhere. * Will you raise us, fallen into sin, * as in faith we honor your memory.
ltx/en_us_dedes/me.m01.d22:meVE.Stichera06.incipit	Martyr Anastasios, you raised *…
ltx/en_us_dedes/me.m01.d22:meVE.Stichera06.melody	@ltx/en_us_dedes/he.a.m1:heAU.PaneffimoiMartyres.name
ltx/en_us_dedes/me.m01.d22:meVE.Stichera06.mode	@ltx/en_us_dedes/miscellanea:misc.Mode1
ltx/en_us_dedes/me.m01.d22:meVE.Stichera06.text	Martyr Anastasios, you raised * mighty trophies in the fight against the enemy’s error. You received a double crown: * for ascetic rigor, * and for steady martyrdom and standing firm in faith even unto death. And thus the Master Christ, * as is worthy, gave to you the gift * of performing * extraordinary miracles.
