ltx/en_us_dedes/oc.m7.d6:ocBK.ModeNaked	@ltx/en_us_dedes/miscellanea:misc.Mode7.naked
ltx/en_us_dedes/oc.m7.d6:ocLI.Beatitudes1.incipit	@ltx/en_us_dedes/oc.m7.d1:ocLI.Beatitudes1.incipit
ltx/en_us_dedes/oc.m7.d6:ocLI.Beatitudes1.melody	
ltx/en_us_dedes/oc.m7.d6:ocLI.Beatitudes1.mode	@ltx/en_us_dedes/miscellanea:misc.Mode7
ltx/en_us_dedes/oc.m7.d6:ocLI.Beatitudes1.text	@ltx/en_us_dedes/oc.m7.d1:ocLI.Beatitudes1.text
ltx/en_us_dedes/oc.m7.d6:ocLI.Beatitudes2.incipit	In order to heal the…
ltx/en_us_dedes/oc.m7.d6:ocLI.Beatitudes2.melody	
ltx/en_us_dedes/oc.m7.d6:ocLI.Beatitudes2.mode	@ltx/en_us_dedes/miscellanea:misc.Mode7
ltx/en_us_dedes/oc.m7.d6:ocLI.Beatitudes2.text	In order to heal the wound that Adam * sustained at the counsel of the foe, * You let yourself be crucified, O King; * You let yourself be wounded: * Your hands and feet were pierced with nails. * Hence, O Word, we glorify * Your immense longsuffering.
ltx/en_us_dedes/oc.m7.d6:ocLI.Beatitudes3.incipit	A crowd of Jews gave…
ltx/en_us_dedes/oc.m7.d6:ocLI.Beatitudes3.melody	
ltx/en_us_dedes/oc.m7.d6:ocLI.Beatitudes3.mode	@ltx/en_us_dedes/miscellanea:misc.Mode7
ltx/en_us_dedes/oc.m7.d6:ocLI.Beatitudes3.text	A crowd of Jews gave You up to Romans, * and they had You crucified among * the outlaws, You the Giver of the Law * and the only Redeemer, * as You redeemed the human race * from all sin and lawlessness. * Therefore we extol You, O Christ.
ltx/en_us_dedes/oc.m7.d6:ocLI.Beatitudes4.incipit	The scars they bear from…
ltx/en_us_dedes/oc.m7.d6:ocLI.Beatitudes4.melody	
ltx/en_us_dedes/oc.m7.d6:ocLI.Beatitudes4.mode	@ltx/en_us_dedes/miscellanea:misc.Mode7
ltx/en_us_dedes/oc.m7.d6:ocLI.Beatitudes4.text	The scars they bear from their many tortures * are like medals that decorate * the holy Martyr Athletes of the Lord. * And they are recognized as * the bright adornment of the Church, * as they ever intercede * with Christ on behalf of our souls.
ltx/en_us_dedes/oc.m7.d6:ocLI.BeatitudesT.incipit	O Christ our God, when…
ltx/en_us_dedes/oc.m7.d6:ocLI.BeatitudesT.melody	
ltx/en_us_dedes/oc.m7.d6:ocLI.BeatitudesT.mode	@ltx/en_us_dedes/miscellanea:misc.Mode7
ltx/en_us_dedes/oc.m7.d6:ocLI.BeatitudesT.text	O Christ our God, when You had been lifted * on the tree of the Cross in the flesh, * Your all-pure Virgin Mother saw You there * bereft of form and beauty. * And in distress she cried aloud, * “Alas! How have lawless men * mutilated You, my Child?”
ltx/en_us_dedes/oc.m7.d6:ocLI.BeatitudesTr.incipit	Deliver us, Your unworthy servants…
ltx/en_us_dedes/oc.m7.d6:ocLI.BeatitudesTr.melody	
ltx/en_us_dedes/oc.m7.d6:ocLI.BeatitudesTr.mode	@ltx/en_us_dedes/miscellanea:misc.Mode7
ltx/en_us_dedes/oc.m7.d6:ocLI.BeatitudesTr.text	Deliver us, Your unworthy servants * who extol You, Holy Trinity. * Make us strong by the power of the Cross, * and guide on our journey * to the city that is on high. * And once we have entered it, * we hope to find mercy there.
ltx/en_us_dedes/oc.m7.d6:ocLI.MM.Beatitudes1234TrTas78910GB.text	@ltx/en_us_dedes/properties:media.key
ltx/en_us_dedes/oc.m7.d6:ocMA.ApolTheotokion.incipit	@ltx/en_us_dedes/oc.m7.d5:ocVE.AposTheotokion.incipit
ltx/en_us_dedes/oc.m7.d6:ocMA.ApolTheotokion.melody	
ltx/en_us_dedes/oc.m7.d6:ocMA.ApolTheotokion.mode	@ltx/en_us_dedes/miscellanea:misc.Mode7
ltx/en_us_dedes/oc.m7.d6:ocMA.ApolTheotokion.text	@ltx/en_us_dedes/oc.m7.d5:ocVE.AposTheotokion.text
ltx/en_us_dedes/oc.m7.d6:ocMA.AposTheotokion.greekmelody	@ltx/en_us_dedes/he.a.m7:heAU.SimeronGrigoreiOIoudas.greekname
ltx/en_us_dedes/oc.m7.d6:ocMA.AposTheotokion.incipit	You endured crucifixion and slaughter…
ltx/en_us_dedes/oc.m7.d6:ocMA.AposTheotokion.melody	@ltx/en_us_dedes/he.a.m7:heAU.SimeronGrigoreiOIoudas.name
ltx/en_us_dedes/oc.m7.d6:ocMA.AposTheotokion.mode	@ltx/en_us_dedes/miscellanea:misc.Mode7
ltx/en_us_dedes/oc.m7.d6:ocMA.AposTheotokion.text	You endured crucifixion and slaughter * as a criminal, forbearing Lord, * so that by the tree of the Cross You, O Savior, * might lift us who by a tree of old had fallen. * As Your Virgin Mother saw You dead, she was perplexed and wept. * Suffering from shock, overcome with grief she sighed and cried, * “What unjust madness is this! * These lawless men have killed the Righteous One!”
ltx/en_us_dedes/oc.m7.d6:ocMA.Aposticha1.greekmelody	@ltx/en_us_dedes/he.a.m7:heAU.OukEtiKolyometha.greekname
ltx/en_us_dedes/oc.m7.d6:ocMA.Aposticha1.incipit	@ltx/en_us_dedes/oc.m7.d4:ocMA.Aposticha1.incipit
ltx/en_us_dedes/oc.m7.d6:ocMA.Aposticha1.melody	@ltx/en_us_dedes/he.a.m7:heAU.OukEtiKolyometha.name
ltx/en_us_dedes/oc.m7.d6:ocMA.Aposticha1.mode	@ltx/en_us_dedes/miscellanea:misc.Mode7
ltx/en_us_dedes/oc.m7.d6:ocMA.Aposticha1.text	@ltx/en_us_dedes/oc.m7.d4:ocMA.Aposticha1.text
ltx/en_us_dedes/oc.m7.d6:ocMA.Aposticha2.incipit	@ltx/en_us_dedes/oc.m7.d4:ocMA.Aposticha2.incipit
ltx/en_us_dedes/oc.m7.d6:ocMA.Aposticha2.melody	
ltx/en_us_dedes/oc.m7.d6:ocMA.Aposticha2.mode	@ltx/en_us_dedes/miscellanea:misc.Mode7
ltx/en_us_dedes/oc.m7.d6:ocMA.Aposticha2.text	@ltx/en_us_dedes/oc.m7.d4:ocMA.Aposticha2.text
ltx/en_us_dedes/oc.m7.d6:ocMA.Aposticha3.greekmelody	@ltx/en_us_dedes/he.a.m7:heAU.OukEtiKolyometha.greekname
ltx/en_us_dedes/oc.m7.d6:ocMA.Aposticha3.incipit	@ltx/en_us_dedes/oc.m7.d2:ocMA.Aposticha3.incipit
ltx/en_us_dedes/oc.m7.d6:ocMA.Aposticha3.melody	@ltx/en_us_dedes/he.a.m7:heAU.OukEtiKolyometha.name
ltx/en_us_dedes/oc.m7.d6:ocMA.Aposticha3.mode	@ltx/en_us_dedes/miscellanea:misc.Mode7
ltx/en_us_dedes/oc.m7.d6:ocMA.Aposticha3.text	@ltx/en_us_dedes/oc.m7.d2:ocMA.Aposticha3.text
ltx/en_us_dedes/oc.m7.d6:ocMA.C1.acrostic.notice1	
ltx/en_us_dedes/oc.m7.d6:ocMA.C1.acrostic.text	
ltx/en_us_dedes/oc.m7.d6:ocMA.C1.acrostic.title	Canon for the Cross.
ltx/en_us_dedes/oc.m7.d6:ocMA.Kathisma11.incipit	@ltx/en_us_dedes/oc.m7.d4:ocMA.Kathisma11.incipit
ltx/en_us_dedes/oc.m7.d6:ocMA.Kathisma11.melody	
ltx/en_us_dedes/oc.m7.d6:ocMA.Kathisma11.mode	@ltx/en_us_dedes/miscellanea:misc.Mode7
ltx/en_us_dedes/oc.m7.d6:ocMA.Kathisma11.text	@ltx/en_us_dedes/oc.m7.d4:ocMA.Kathisma11.text
ltx/en_us_dedes/oc.m7.d6:ocMA.Kathisma12.incipit	@ltx/en_us_dedes/oc.m7.d4:ocMA.Kathisma12.incipit
ltx/en_us_dedes/oc.m7.d6:ocMA.Kathisma12.melody	
ltx/en_us_dedes/oc.m7.d6:ocMA.Kathisma12.mode	@ltx/en_us_dedes/miscellanea:misc.Mode7
ltx/en_us_dedes/oc.m7.d6:ocMA.Kathisma12.text	@ltx/en_us_dedes/oc.m7.d4:ocMA.Kathisma12.text
ltx/en_us_dedes/oc.m7.d6:ocMA.Kathisma13.incipit	O ever-virgin Theotokos, as your…
ltx/en_us_dedes/oc.m7.d6:ocMA.Kathisma13.melody	
ltx/en_us_dedes/oc.m7.d6:ocMA.Kathisma13.mode	@ltx/en_us_dedes/miscellanea:misc.Mode7
ltx/en_us_dedes/oc.m7.d6:ocMA.Kathisma13.text	O ever-virgin Theotokos, as your saw your Son hanging on the Cross, as a mother you lamented; but you magnified His terrific condescension, O immaculate Lady.
ltx/en_us_dedes/oc.m7.d6:ocMA.Kathisma21.incipit	@ltx/en_us_dedes/oc.m7.d4:ocMA.Kathisma21.incipit
ltx/en_us_dedes/oc.m7.d6:ocMA.Kathisma21.melody	
ltx/en_us_dedes/oc.m7.d6:ocMA.Kathisma21.mode	@ltx/en_us_dedes/miscellanea:misc.Mode7
ltx/en_us_dedes/oc.m7.d6:ocMA.Kathisma21.text	@ltx/en_us_dedes/oc.m7.d4:ocMA.Kathisma21.text
ltx/en_us_dedes/oc.m7.d6:ocMA.Kathisma22.incipit	@ltx/en_us_dedes/oc.m7.d4:ocMA.Kathisma22.incipit
ltx/en_us_dedes/oc.m7.d6:ocMA.Kathisma22.melody	
ltx/en_us_dedes/oc.m7.d6:ocMA.Kathisma22.mode	@ltx/en_us_dedes/miscellanea:misc.Mode7
ltx/en_us_dedes/oc.m7.d6:ocMA.Kathisma22.text	@ltx/en_us_dedes/oc.m7.d4:ocMA.Kathisma22.text
ltx/en_us_dedes/oc.m7.d6:ocMA.Kathisma23.incipit	O Christ, when You were…
ltx/en_us_dedes/oc.m7.d6:ocMA.Kathisma23.melody	
ltx/en_us_dedes/oc.m7.d6:ocMA.Kathisma23.mode	@ltx/en_us_dedes/miscellanea:misc.Mode7
ltx/en_us_dedes/oc.m7.d6:ocMA.Kathisma23.text	O Christ, when You were crucified of Your own will, the Theotokos stood nearby and said, “Lord, Lord, no other woman has endured the pain I suffer now. From Your miracles, I know that You are God; and behold, I see You hanging dead on the Cross! Nevertheless, rise, as You said You would, on the third day, so that I may rejoice and shout to You: Glory to You!”
ltx/en_us_dedes/oc.m7.d6:ocMA.Kathisma31.incipit	…
ltx/en_us_dedes/oc.m7.d6:ocMA.Kathisma31.melody	
ltx/en_us_dedes/oc.m7.d6:ocMA.Kathisma31.mode	@ltx/en_us_dedes/miscellanea:misc.Mode7
ltx/en_us_dedes/oc.m7.d6:ocMA.Kathisma31.text	
ltx/en_us_dedes/oc.m7.d6:ocMA.Kathisma32.incipit	@ltx/en_us_dedes/oc.m7.d2:ocMA.Kathisma32.incipit
ltx/en_us_dedes/oc.m7.d6:ocMA.Kathisma32.melody	
ltx/en_us_dedes/oc.m7.d6:ocMA.Kathisma32.mode	@ltx/en_us_dedes/miscellanea:misc.Mode7
ltx/en_us_dedes/oc.m7.d6:ocMA.Kathisma32.text	@ltx/en_us_dedes/oc.m7.d2:ocMA.Kathisma32.text
ltx/en_us_dedes/oc.m7.d6:ocMA.Kathisma33.incipit	…
ltx/en_us_dedes/oc.m7.d6:ocMA.Kathisma33.melody	
ltx/en_us_dedes/oc.m7.d6:ocMA.Kathisma33.mode	@ltx/en_us_dedes/miscellanea:misc.Mode7
ltx/en_us_dedes/oc.m7.d6:ocMA.Kathisma33.text	
ltx/en_us_dedes/oc.m7.d6:ocMA.OdeW1C11.incipit	When Christ was lifted on…
ltx/en_us_dedes/oc.m7.d6:ocMA.OdeW1C11.melody	@ltx/en_us_dedes/he.h.m7:heHE.ToEktinaxantiTheo.notmetered
ltx/en_us_dedes/oc.m7.d6:ocMA.OdeW1C11.mode	@ltx/en_us_dedes/miscellanea:misc.Mode7
ltx/en_us_dedes/oc.m7.d6:ocMA.OdeW1C11.ode	@ltx/en_us_dedes/miscellanea:misc.Ode1
ltx/en_us_dedes/oc.m7.d6:ocMA.OdeW1C11.text	When Christ was lifted on the Cross, He drew all mortals to himself, and cast down the enemy who had cursed everyone.
ltx/en_us_dedes/oc.m7.d6:ocMA.OdeW1C12.incipit	O Master Jesus, from Your…
ltx/en_us_dedes/oc.m7.d6:ocMA.OdeW1C12.melody	@ltx/en_us_dedes/he.h.m7:heHE.ToEktinaxantiTheo.notmetered
ltx/en_us_dedes/oc.m7.d6:ocMA.OdeW1C12.mode	@ltx/en_us_dedes/miscellanea:misc.Mode7
ltx/en_us_dedes/oc.m7.d6:ocMA.OdeW1C12.ode	@ltx/en_us_dedes/miscellanea:misc.Ode1
ltx/en_us_dedes/oc.m7.d6:ocMA.OdeW1C12.text	O Master Jesus, from Your life-bearing side You poured out for me a stream of life, and becoming dead You put the enemy to death.
ltx/en_us_dedes/oc.m7.d6:ocMA.OdeW1C13.incipit	O medaled Martyrs, offer fervent…
ltx/en_us_dedes/oc.m7.d6:ocMA.OdeW1C13.melody	@ltx/en_us_dedes/he.h.m7:heHE.ToEktinaxantiTheo.notmetered
ltx/en_us_dedes/oc.m7.d6:ocMA.OdeW1C13.mode	@ltx/en_us_dedes/miscellanea:misc.Mode7
ltx/en_us_dedes/oc.m7.d6:ocMA.OdeW1C13.ode	@ltx/en_us_dedes/miscellanea:misc.Ode1
ltx/en_us_dedes/oc.m7.d6:ocMA.OdeW1C13.text	O medaled Martyrs, offer fervent supplication to Christ on our behalf, that we all be delivered from the frightening judgment.
ltx/en_us_dedes/oc.m7.d6:ocMA.OdeW1C14.incipit	O wise Martyrs, you were…
ltx/en_us_dedes/oc.m7.d6:ocMA.OdeW1C14.melody	@ltx/en_us_dedes/he.h.m7:heHE.ToEktinaxantiTheo.notmetered
ltx/en_us_dedes/oc.m7.d6:ocMA.OdeW1C14.mode	@ltx/en_us_dedes/miscellanea:misc.Mode7
ltx/en_us_dedes/oc.m7.d6:ocMA.OdeW1C14.ode	@ltx/en_us_dedes/miscellanea:misc.Ode1
ltx/en_us_dedes/oc.m7.d6:ocMA.OdeW1C14.text	O wise Martyrs, you were humiliated for the sake of Christ, and by divine grace you completely overthrew the pompous enemy.
ltx/en_us_dedes/oc.m7.d6:ocMA.OdeW1C1H.greekmelody	@ltx/en_us_dedes/he.h.m7:heHE.ToEktinaxantiTheo.greekname
ltx/en_us_dedes/oc.m7.d6:ocMA.OdeW1C1H.incipit	@ltx/en_us_dedes/he.h.m7:heHE.ToEktinaxantiTheo.incipit
ltx/en_us_dedes/oc.m7.d6:ocMA.OdeW1C1H.melody	@ltx/en_us_dedes/he.h.m7:heHE.ToEktinaxantiTheo.melody
ltx/en_us_dedes/oc.m7.d6:ocMA.OdeW1C1H.mode	@ltx/en_us_dedes/miscellanea:misc.Mode7
ltx/en_us_dedes/oc.m7.d6:ocMA.OdeW1C1H.ode	@ltx/en_us_dedes/miscellanea:misc.Ode1
ltx/en_us_dedes/oc.m7.d6:ocMA.OdeW1C1H.text	@ltx/en_us_dedes/he.h.m7:heHE.ToEktinaxantiTheo.text
ltx/en_us_dedes/oc.m7.d6:ocMA.OdeW1C1T.incipit	O Lady, when you saw…
ltx/en_us_dedes/oc.m7.d6:ocMA.OdeW1C1T.melody	@ltx/en_us_dedes/he.h.m7:heHE.ToEktinaxantiTheo.notmetered
ltx/en_us_dedes/oc.m7.d6:ocMA.OdeW1C1T.mode	@ltx/en_us_dedes/miscellanea:misc.Mode7
ltx/en_us_dedes/oc.m7.d6:ocMA.OdeW1C1T.ode	@ltx/en_us_dedes/miscellanea:misc.Ode1
ltx/en_us_dedes/oc.m7.d6:ocMA.OdeW1C1T.text	O Lady, when you saw on the Cross your Son, who rose from you in His extreme compassion, you lamented and also glorified Him.
ltx/en_us_dedes/oc.m7.d6:ocMA.OdeW1C21.greekmelody	@ltx/en_us_dedes/he.h.m7:heHE.ToSyntripsantiPolemous.greekname
ltx/en_us_dedes/oc.m7.d6:ocMA.OdeW1C21.incipit	…
ltx/en_us_dedes/oc.m7.d6:ocMA.OdeW1C21.melody	@ltx/en_us_dedes/he.h.m7:heHE.ToSyntripsantiPolemous.name
ltx/en_us_dedes/oc.m7.d6:ocMA.OdeW1C21.mode	@ltx/en_us_dedes/miscellanea:misc.Mode7
ltx/en_us_dedes/oc.m7.d6:ocMA.OdeW1C21.ode	@ltx/en_us_dedes/miscellanea:misc.Ode1
ltx/en_us_dedes/oc.m7.d6:ocMA.OdeW1C21.text	
ltx/en_us_dedes/oc.m7.d6:ocMA.OdeW1C22.incipit	…
ltx/en_us_dedes/oc.m7.d6:ocMA.OdeW1C22.melody	@ltx/en_us_dedes/he.h.m7:heHE.ToSyntripsantiPolemous.name
ltx/en_us_dedes/oc.m7.d6:ocMA.OdeW1C22.mode	@ltx/en_us_dedes/miscellanea:misc.Mode7
ltx/en_us_dedes/oc.m7.d6:ocMA.OdeW1C22.ode	@ltx/en_us_dedes/miscellanea:misc.Ode1
ltx/en_us_dedes/oc.m7.d6:ocMA.OdeW1C22.text	
ltx/en_us_dedes/oc.m7.d6:ocMA.OdeW1C23.incipit	…
ltx/en_us_dedes/oc.m7.d6:ocMA.OdeW1C23.melody	@ltx/en_us_dedes/he.h.m7:heHE.ToSyntripsantiPolemous.name
ltx/en_us_dedes/oc.m7.d6:ocMA.OdeW1C23.mode	@ltx/en_us_dedes/miscellanea:misc.Mode7
ltx/en_us_dedes/oc.m7.d6:ocMA.OdeW1C23.ode	@ltx/en_us_dedes/miscellanea:misc.Ode1
ltx/en_us_dedes/oc.m7.d6:ocMA.OdeW1C23.text	
ltx/en_us_dedes/oc.m7.d6:ocMA.OdeW1C24.incipit	…
ltx/en_us_dedes/oc.m7.d6:ocMA.OdeW1C24.melody	@ltx/en_us_dedes/he.h.m7:heHE.ToSyntripsantiPolemous.name
ltx/en_us_dedes/oc.m7.d6:ocMA.OdeW1C24.mode	@ltx/en_us_dedes/miscellanea:misc.Mode7
ltx/en_us_dedes/oc.m7.d6:ocMA.OdeW1C24.ode	@ltx/en_us_dedes/miscellanea:misc.Ode1
ltx/en_us_dedes/oc.m7.d6:ocMA.OdeW1C24.text	
ltx/en_us_dedes/oc.m7.d6:ocMA.OdeW3C11.incipit	How can You who in…
ltx/en_us_dedes/oc.m7.d6:ocMA.OdeW3C11.melody	@ltx/en_us_dedes/he.h.m7:heHE.EstereothiTiPistei.notmetered
ltx/en_us_dedes/oc.m7.d6:ocMA.OdeW3C11.mode	@ltx/en_us_dedes/miscellanea:misc.Mode7
ltx/en_us_dedes/oc.m7.d6:ocMA.OdeW3C11.ode	@ltx/en_us_dedes/miscellanea:misc.Ode3
ltx/en_us_dedes/oc.m7.d6:ocMA.OdeW3C11.text	How can You who in essence do no suffer undergo Passion? How can You who breath life into me now die on the Cross? Great are Your mercy and Your longsuffering!
ltx/en_us_dedes/oc.m7.d6:ocMA.OdeW3C12.incipit	O Logos, You were unjustly…
ltx/en_us_dedes/oc.m7.d6:ocMA.OdeW3C12.melody	@ltx/en_us_dedes/he.h.m7:heHE.EstereothiTiPistei.notmetered
ltx/en_us_dedes/oc.m7.d6:ocMA.OdeW3C12.mode	@ltx/en_us_dedes/miscellanea:misc.Mode7
ltx/en_us_dedes/oc.m7.d6:ocMA.OdeW3C12.ode	@ltx/en_us_dedes/miscellanea:misc.Ode3
ltx/en_us_dedes/oc.m7.d6:ocMA.OdeW3C12.text	O Logos, You were unjustly crucified between two robbers, and You justified the one who recognized You as the Creator of all creation, who was suffering willingly.
ltx/en_us_dedes/oc.m7.d6:ocMA.OdeW3C13.incipit	O medaled Athletes, you endured…
ltx/en_us_dedes/oc.m7.d6:ocMA.OdeW3C13.melody	@ltx/en_us_dedes/he.h.m7:heHE.EstereothiTiPistei.notmetered
ltx/en_us_dedes/oc.m7.d6:ocMA.OdeW3C13.mode	@ltx/en_us_dedes/miscellanea:misc.Mode7
ltx/en_us_dedes/oc.m7.d6:ocMA.OdeW3C13.ode	@ltx/en_us_dedes/miscellanea:misc.Ode3
ltx/en_us_dedes/oc.m7.d6:ocMA.OdeW3C13.text	O medaled Athletes, you endured the flaying of your skin, amputation of your hands and feet and all your members; and for this you obtained glory, and you intercede for us.
ltx/en_us_dedes/oc.m7.d6:ocMA.OdeW3C14.incipit	O wise Martyrs, you were…
ltx/en_us_dedes/oc.m7.d6:ocMA.OdeW3C14.melody	@ltx/en_us_dedes/he.h.m7:heHE.EstereothiTiPistei.notmetered
ltx/en_us_dedes/oc.m7.d6:ocMA.OdeW3C14.mode	@ltx/en_us_dedes/miscellanea:misc.Mode7
ltx/en_us_dedes/oc.m7.d6:ocMA.OdeW3C14.ode	@ltx/en_us_dedes/miscellanea:misc.Ode3
ltx/en_us_dedes/oc.m7.d6:ocMA.OdeW3C14.text	O wise Martyrs, you were divinely burnished by the extreme tortures, and now you have inherited the surpassing glory. You ever intercede for the salvation of our souls.
ltx/en_us_dedes/oc.m7.d6:ocMA.OdeW3C1H.greekmelody	@ltx/en_us_dedes/he.h.m7:heHE.EstereothiTiPistei.greekname
ltx/en_us_dedes/oc.m7.d6:ocMA.OdeW3C1H.incipit	@ltx/en_us_dedes/he.h.m7:heHE.EstereothiTiPistei.incipit
ltx/en_us_dedes/oc.m7.d6:ocMA.OdeW3C1H.melody	@ltx/en_us_dedes/he.h.m7:heHE.EstereothiTiPistei.melody
ltx/en_us_dedes/oc.m7.d6:ocMA.OdeW3C1H.mode	@ltx/en_us_dedes/miscellanea:misc.Mode7
ltx/en_us_dedes/oc.m7.d6:ocMA.OdeW3C1H.ode	@ltx/en_us_dedes/miscellanea:misc.Ode3
ltx/en_us_dedes/oc.m7.d6:ocMA.OdeW3C1H.text	@ltx/en_us_dedes/he.h.m7:heHE.EstereothiTiPistei.text
ltx/en_us_dedes/oc.m7.d6:ocMA.OdeW3C1T.incipit	O pure Virgin, you were…
ltx/en_us_dedes/oc.m7.d6:ocMA.OdeW3C1T.melody	@ltx/en_us_dedes/he.h.m7:heHE.EstereothiTiPistei.notmetered
ltx/en_us_dedes/oc.m7.d6:ocMA.OdeW3C1T.mode	@ltx/en_us_dedes/miscellanea:misc.Mode7
ltx/en_us_dedes/oc.m7.d6:ocMA.OdeW3C1T.ode	@ltx/en_us_dedes/miscellanea:misc.Ode3
ltx/en_us_dedes/oc.m7.d6:ocMA.OdeW3C1T.text	O pure Virgin, you were pregnant with God the Logos. He became man and was nailed to the Cross. As His mother, intercede with Him to forgive us our debts.
ltx/en_us_dedes/oc.m7.d6:ocMA.OdeW3C21.greekmelody	@ltx/en_us_dedes/he.h.m7:heHE.OOuranousToLogo.greekname
ltx/en_us_dedes/oc.m7.d6:ocMA.OdeW3C21.incipit	…
ltx/en_us_dedes/oc.m7.d6:ocMA.OdeW3C21.melody	@ltx/en_us_dedes/he.h.m7:heHE.OOuranousToLogo.name
ltx/en_us_dedes/oc.m7.d6:ocMA.OdeW3C21.mode	@ltx/en_us_dedes/miscellanea:misc.Mode7
ltx/en_us_dedes/oc.m7.d6:ocMA.OdeW3C21.ode	@ltx/en_us_dedes/miscellanea:misc.Ode3
ltx/en_us_dedes/oc.m7.d6:ocMA.OdeW3C21.text	
ltx/en_us_dedes/oc.m7.d6:ocMA.OdeW3C22.incipit	…
ltx/en_us_dedes/oc.m7.d6:ocMA.OdeW3C22.melody	@ltx/en_us_dedes/he.h.m7:heHE.OOuranousToLogo.name
ltx/en_us_dedes/oc.m7.d6:ocMA.OdeW3C22.mode	@ltx/en_us_dedes/miscellanea:misc.Mode7
ltx/en_us_dedes/oc.m7.d6:ocMA.OdeW3C22.ode	@ltx/en_us_dedes/miscellanea:misc.Ode3
ltx/en_us_dedes/oc.m7.d6:ocMA.OdeW3C22.text	
ltx/en_us_dedes/oc.m7.d6:ocMA.OdeW3C23.incipit	…
ltx/en_us_dedes/oc.m7.d6:ocMA.OdeW3C23.melody	@ltx/en_us_dedes/he.h.m7:heHE.OOuranousToLogo.name
ltx/en_us_dedes/oc.m7.d6:ocMA.OdeW3C23.mode	@ltx/en_us_dedes/miscellanea:misc.Mode7
ltx/en_us_dedes/oc.m7.d6:ocMA.OdeW3C23.ode	@ltx/en_us_dedes/miscellanea:misc.Ode3
ltx/en_us_dedes/oc.m7.d6:ocMA.OdeW3C23.text	
ltx/en_us_dedes/oc.m7.d6:ocMA.OdeW3C24.incipit	…
ltx/en_us_dedes/oc.m7.d6:ocMA.OdeW3C24.melody	@ltx/en_us_dedes/he.h.m7:heHE.OOuranousToLogo.name
ltx/en_us_dedes/oc.m7.d6:ocMA.OdeW3C24.mode	@ltx/en_us_dedes/miscellanea:misc.Mode7
ltx/en_us_dedes/oc.m7.d6:ocMA.OdeW3C24.ode	@ltx/en_us_dedes/miscellanea:misc.Ode3
ltx/en_us_dedes/oc.m7.d6:ocMA.OdeW3C24.text	
ltx/en_us_dedes/oc.m7.d6:ocMA.OdeW4C11.incipit	O Master who loves humanity…
ltx/en_us_dedes/oc.m7.d6:ocMA.OdeW4C11.melody	@ltx/en_us_dedes/he.h.m7:heHE.EisakikoaTinAkoin.notmetered
ltx/en_us_dedes/oc.m7.d6:ocMA.OdeW4C11.mode	@ltx/en_us_dedes/miscellanea:misc.Mode7
ltx/en_us_dedes/oc.m7.d6:ocMA.OdeW4C11.ode	@ltx/en_us_dedes/miscellanea:misc.Ode4
ltx/en_us_dedes/oc.m7.d6:ocMA.OdeW4C11.text	O benevolent Master, You were lifted on the Cross like a most ripe cluster of grapes, and You dripped with the sweet wine that gladdens hearts.
ltx/en_us_dedes/oc.m7.d6:ocMA.OdeW4C12.incipit	O Master, when You accepted…
ltx/en_us_dedes/oc.m7.d6:ocMA.OdeW4C12.melody	@ltx/en_us_dedes/he.h.m7:heHE.EisakikoaTinAkoin.notmetered
ltx/en_us_dedes/oc.m7.d6:ocMA.OdeW4C12.mode	@ltx/en_us_dedes/miscellanea:misc.Mode7
ltx/en_us_dedes/oc.m7.d6:ocMA.OdeW4C12.ode	@ltx/en_us_dedes/miscellanea:misc.Ode4
ltx/en_us_dedes/oc.m7.d6:ocMA.OdeW4C12.text	O Master, when You accepted Your voluntary Passion in the flesh, You truly put an end to the very painful sufferings of humanity.
ltx/en_us_dedes/oc.m7.d6:ocMA.OdeW4C13.incipit	The medaled Athletes competed with…
ltx/en_us_dedes/oc.m7.d6:ocMA.OdeW4C13.melody	@ltx/en_us_dedes/he.h.m7:heHE.EisakikoaTinAkoin.notmetered
ltx/en_us_dedes/oc.m7.d6:ocMA.OdeW4C13.mode	@ltx/en_us_dedes/miscellanea:misc.Mode7
ltx/en_us_dedes/oc.m7.d6:ocMA.OdeW4C13.ode	@ltx/en_us_dedes/miscellanea:misc.Ode4
ltx/en_us_dedes/oc.m7.d6:ocMA.OdeW4C13.text	The medaled Athletes competed with valor, and they wounded the waring opponent. And now they are physicians of our souls.
ltx/en_us_dedes/oc.m7.d6:ocMA.OdeW4C14.incipit	The medaled Athletes lined up…
ltx/en_us_dedes/oc.m7.d6:ocMA.OdeW4C14.melody	@ltx/en_us_dedes/he.h.m7:heHE.EisakikoaTinAkoin.notmetered
ltx/en_us_dedes/oc.m7.d6:ocMA.OdeW4C14.mode	@ltx/en_us_dedes/miscellanea:misc.Mode7
ltx/en_us_dedes/oc.m7.d6:ocMA.OdeW4C14.ode	@ltx/en_us_dedes/miscellanea:misc.Ode4
ltx/en_us_dedes/oc.m7.d6:ocMA.OdeW4C14.text	The medaled Athletes lined up against the tyrants. They won, and they were awarded crowns of victory.
ltx/en_us_dedes/oc.m7.d6:ocMA.OdeW4C1H.greekmelody	@ltx/en_us_dedes/he.h.m7:heHE.EisakikoaTinAkoin.greekname
ltx/en_us_dedes/oc.m7.d6:ocMA.OdeW4C1H.incipit	@ltx/en_us_dedes/he.h.m7:heHE.EisakikoaTinAkoin.incipit
ltx/en_us_dedes/oc.m7.d6:ocMA.OdeW4C1H.melody	@ltx/en_us_dedes/he.h.m7:heHE.EisakikoaTinAkoin.melody
ltx/en_us_dedes/oc.m7.d6:ocMA.OdeW4C1H.mode	@ltx/en_us_dedes/miscellanea:misc.Mode7
ltx/en_us_dedes/oc.m7.d6:ocMA.OdeW4C1H.ode	@ltx/en_us_dedes/miscellanea:misc.Ode4
ltx/en_us_dedes/oc.m7.d6:ocMA.OdeW4C1H.text	@ltx/en_us_dedes/he.h.m7:heHE.EisakikoaTinAkoin.text
ltx/en_us_dedes/oc.m7.d6:ocMA.OdeW4C1T.incipit	O Virgin, without seed you…
ltx/en_us_dedes/oc.m7.d6:ocMA.OdeW4C1T.melody	@ltx/en_us_dedes/he.h.m7:heHE.EisakikoaTinAkoin.notmetered
ltx/en_us_dedes/oc.m7.d6:ocMA.OdeW4C1T.mode	@ltx/en_us_dedes/miscellanea:misc.Mode7
ltx/en_us_dedes/oc.m7.d6:ocMA.OdeW4C1T.ode	@ltx/en_us_dedes/miscellanea:misc.Ode4
ltx/en_us_dedes/oc.m7.d6:ocMA.OdeW4C1T.text	O Virgin, without seed you gave birth to the Logos, who by His Cross vanquished corruption, in His benevolence.
ltx/en_us_dedes/oc.m7.d6:ocMA.OdeW4C21.greekmelody	@ltx/en_us_dedes/he.h.m3:heHE.EkalypsenOuranous.greekname
ltx/en_us_dedes/oc.m7.d6:ocMA.OdeW4C21.incipit	…
ltx/en_us_dedes/oc.m7.d6:ocMA.OdeW4C21.melody	@ltx/en_us_dedes/he.h.m3:heHE.EkalypsenOuranous.name
ltx/en_us_dedes/oc.m7.d6:ocMA.OdeW4C21.mode	@ltx/en_us_dedes/miscellanea:misc.Mode7
ltx/en_us_dedes/oc.m7.d6:ocMA.OdeW4C21.ode	@ltx/en_us_dedes/miscellanea:misc.Ode4
ltx/en_us_dedes/oc.m7.d6:ocMA.OdeW4C21.text	
ltx/en_us_dedes/oc.m7.d6:ocMA.OdeW4C22.incipit	…
ltx/en_us_dedes/oc.m7.d6:ocMA.OdeW4C22.melody	@ltx/en_us_dedes/he.h.m3:heHE.EkalypsenOuranous.name
ltx/en_us_dedes/oc.m7.d6:ocMA.OdeW4C22.mode	@ltx/en_us_dedes/miscellanea:misc.Mode7
ltx/en_us_dedes/oc.m7.d6:ocMA.OdeW4C22.ode	@ltx/en_us_dedes/miscellanea:misc.Ode4
ltx/en_us_dedes/oc.m7.d6:ocMA.OdeW4C22.text	
ltx/en_us_dedes/oc.m7.d6:ocMA.OdeW4C23.incipit	…
ltx/en_us_dedes/oc.m7.d6:ocMA.OdeW4C23.melody	@ltx/en_us_dedes/he.h.m3:heHE.EkalypsenOuranous.name
ltx/en_us_dedes/oc.m7.d6:ocMA.OdeW4C23.mode	@ltx/en_us_dedes/miscellanea:misc.Mode7
ltx/en_us_dedes/oc.m7.d6:ocMA.OdeW4C23.ode	@ltx/en_us_dedes/miscellanea:misc.Ode4
ltx/en_us_dedes/oc.m7.d6:ocMA.OdeW4C23.text	
ltx/en_us_dedes/oc.m7.d6:ocMA.OdeW4C24.incipit	…
ltx/en_us_dedes/oc.m7.d6:ocMA.OdeW4C24.melody	@ltx/en_us_dedes/he.h.m3:heHE.EkalypsenOuranous.name
ltx/en_us_dedes/oc.m7.d6:ocMA.OdeW4C24.mode	@ltx/en_us_dedes/miscellanea:misc.Mode7
ltx/en_us_dedes/oc.m7.d6:ocMA.OdeW4C24.ode	@ltx/en_us_dedes/miscellanea:misc.Ode4
ltx/en_us_dedes/oc.m7.d6:ocMA.OdeW4C24.text	
ltx/en_us_dedes/oc.m7.d6:ocMA.OdeW5C11.incipit	…
ltx/en_us_dedes/oc.m7.d6:ocMA.OdeW5C11.melody	@ltx/en_us_dedes/he.h.m7:heHE.OrthrizeiToPnevmaMou.name
ltx/en_us_dedes/oc.m7.d6:ocMA.OdeW5C11.mode	@ltx/en_us_dedes/miscellanea:misc.Mode7
ltx/en_us_dedes/oc.m7.d6:ocMA.OdeW5C11.ode	@ltx/en_us_dedes/miscellanea:misc.Ode5
ltx/en_us_dedes/oc.m7.d6:ocMA.OdeW5C11.text	
ltx/en_us_dedes/oc.m7.d6:ocMA.OdeW5C12.incipit	…
ltx/en_us_dedes/oc.m7.d6:ocMA.OdeW5C12.melody	@ltx/en_us_dedes/he.h.m7:heHE.OrthrizeiToPnevmaMou.name
ltx/en_us_dedes/oc.m7.d6:ocMA.OdeW5C12.mode	@ltx/en_us_dedes/miscellanea:misc.Mode7
ltx/en_us_dedes/oc.m7.d6:ocMA.OdeW5C12.ode	@ltx/en_us_dedes/miscellanea:misc.Ode5
ltx/en_us_dedes/oc.m7.d6:ocMA.OdeW5C12.text	
ltx/en_us_dedes/oc.m7.d6:ocMA.OdeW5C13.incipit	…
ltx/en_us_dedes/oc.m7.d6:ocMA.OdeW5C13.melody	@ltx/en_us_dedes/he.h.m7:heHE.OrthrizeiToPnevmaMou.name
ltx/en_us_dedes/oc.m7.d6:ocMA.OdeW5C13.mode	@ltx/en_us_dedes/miscellanea:misc.Mode7
ltx/en_us_dedes/oc.m7.d6:ocMA.OdeW5C13.ode	@ltx/en_us_dedes/miscellanea:misc.Ode5
ltx/en_us_dedes/oc.m7.d6:ocMA.OdeW5C13.text	
ltx/en_us_dedes/oc.m7.d6:ocMA.OdeW5C14.incipit	…
ltx/en_us_dedes/oc.m7.d6:ocMA.OdeW5C14.melody	@ltx/en_us_dedes/he.h.m7:heHE.OrthrizeiToPnevmaMou.name
ltx/en_us_dedes/oc.m7.d6:ocMA.OdeW5C14.mode	@ltx/en_us_dedes/miscellanea:misc.Mode7
ltx/en_us_dedes/oc.m7.d6:ocMA.OdeW5C14.ode	@ltx/en_us_dedes/miscellanea:misc.Ode5
ltx/en_us_dedes/oc.m7.d6:ocMA.OdeW5C14.text	
ltx/en_us_dedes/oc.m7.d6:ocMA.OdeW5C1H.greekmelody	@ltx/en_us_dedes/he.h.m7:heHE.OrthrizeiToPnevmaMou.greekname
ltx/en_us_dedes/oc.m7.d6:ocMA.OdeW5C1H.incipit	@ltx/en_us_dedes/he.h.m7:heHE.OrthrizeiToPnevmaMou.incipit
ltx/en_us_dedes/oc.m7.d6:ocMA.OdeW5C1H.melody	@ltx/en_us_dedes/he.h.m7:heHE.OrthrizeiToPnevmaMou.melody
ltx/en_us_dedes/oc.m7.d6:ocMA.OdeW5C1H.mode	@ltx/en_us_dedes/miscellanea:misc.Mode7
ltx/en_us_dedes/oc.m7.d6:ocMA.OdeW5C1H.ode	@ltx/en_us_dedes/miscellanea:misc.Ode5
ltx/en_us_dedes/oc.m7.d6:ocMA.OdeW5C1H.text	@ltx/en_us_dedes/he.h.m7:heHE.OrthrizeiToPnevmaMou.text
ltx/en_us_dedes/oc.m7.d6:ocMA.OdeW5C1T.incipit	…
ltx/en_us_dedes/oc.m7.d6:ocMA.OdeW5C1T.melody	@ltx/en_us_dedes/he.h.m7:heHE.OrthrizeiToPnevmaMou.name
ltx/en_us_dedes/oc.m7.d6:ocMA.OdeW5C1T.mode	@ltx/en_us_dedes/miscellanea:misc.Mode7
ltx/en_us_dedes/oc.m7.d6:ocMA.OdeW5C1T.ode	@ltx/en_us_dedes/miscellanea:misc.Ode5
ltx/en_us_dedes/oc.m7.d6:ocMA.OdeW5C1T.text	
ltx/en_us_dedes/oc.m7.d6:ocMA.OdeW5C21.greekmelody	@ltx/en_us_dedes/he.h.m7:heHE.DiaskedasasTinNykta.greekname
ltx/en_us_dedes/oc.m7.d6:ocMA.OdeW5C21.incipit	…
ltx/en_us_dedes/oc.m7.d6:ocMA.OdeW5C21.melody	@ltx/en_us_dedes/he.h.m7:heHE.DiaskedasasTinNykta.name
ltx/en_us_dedes/oc.m7.d6:ocMA.OdeW5C21.mode	@ltx/en_us_dedes/miscellanea:misc.Mode7
ltx/en_us_dedes/oc.m7.d6:ocMA.OdeW5C21.ode	@ltx/en_us_dedes/miscellanea:misc.Ode5
ltx/en_us_dedes/oc.m7.d6:ocMA.OdeW5C21.text	
ltx/en_us_dedes/oc.m7.d6:ocMA.OdeW5C22.incipit	…
ltx/en_us_dedes/oc.m7.d6:ocMA.OdeW5C22.melody	@ltx/en_us_dedes/he.h.m7:heHE.DiaskedasasTinNykta.name
ltx/en_us_dedes/oc.m7.d6:ocMA.OdeW5C22.mode	@ltx/en_us_dedes/miscellanea:misc.Mode7
ltx/en_us_dedes/oc.m7.d6:ocMA.OdeW5C22.ode	@ltx/en_us_dedes/miscellanea:misc.Ode5
ltx/en_us_dedes/oc.m7.d6:ocMA.OdeW5C22.text	
ltx/en_us_dedes/oc.m7.d6:ocMA.OdeW5C23.incipit	…
ltx/en_us_dedes/oc.m7.d6:ocMA.OdeW5C23.melody	@ltx/en_us_dedes/he.h.m7:heHE.DiaskedasasTinNykta.name
ltx/en_us_dedes/oc.m7.d6:ocMA.OdeW5C23.mode	@ltx/en_us_dedes/miscellanea:misc.Mode7
ltx/en_us_dedes/oc.m7.d6:ocMA.OdeW5C23.ode	@ltx/en_us_dedes/miscellanea:misc.Ode5
ltx/en_us_dedes/oc.m7.d6:ocMA.OdeW5C23.text	
ltx/en_us_dedes/oc.m7.d6:ocMA.OdeW5C24.incipit	…
ltx/en_us_dedes/oc.m7.d6:ocMA.OdeW5C24.melody	@ltx/en_us_dedes/he.h.m7:heHE.DiaskedasasTinNykta.name
ltx/en_us_dedes/oc.m7.d6:ocMA.OdeW5C24.mode	@ltx/en_us_dedes/miscellanea:misc.Mode7
ltx/en_us_dedes/oc.m7.d6:ocMA.OdeW5C24.ode	@ltx/en_us_dedes/miscellanea:misc.Ode5
ltx/en_us_dedes/oc.m7.d6:ocMA.OdeW5C24.text	
ltx/en_us_dedes/oc.m7.d6:ocMA.OdeW6C11.incipit	Since human nature was sick…
ltx/en_us_dedes/oc.m7.d6:ocMA.OdeW6C11.melody	@ltx/en_us_dedes/he.h.m7:heHE.OIonasEkKoilias.notmetered
ltx/en_us_dedes/oc.m7.d6:ocMA.OdeW6C11.mode	@ltx/en_us_dedes/miscellanea:misc.Mode7
ltx/en_us_dedes/oc.m7.d6:ocMA.OdeW6C11.ode	@ltx/en_us_dedes/miscellanea:misc.Ode6
ltx/en_us_dedes/oc.m7.d6:ocMA.OdeW6C11.text	Since human nature was sick, You appeared on earth in Your tender-mercy, O Physician of the sick, and by Your Cross and Passion You cured it.
ltx/en_us_dedes/oc.m7.d6:ocMA.OdeW6C12.incipit	Of old, Adam was condemned…
ltx/en_us_dedes/oc.m7.d6:ocMA.OdeW6C12.melody	@ltx/en_us_dedes/he.h.m7:heHE.OIonasEkKoilias.notmetered
ltx/en_us_dedes/oc.m7.d6:ocMA.OdeW6C12.mode	@ltx/en_us_dedes/miscellanea:misc.Mode7
ltx/en_us_dedes/oc.m7.d6:ocMA.OdeW6C12.ode	@ltx/en_us_dedes/miscellanea:misc.Ode6
ltx/en_us_dedes/oc.m7.d6:ocMA.OdeW6C12.text	Of old, Adam was condemned because of a tree. Now, by the tree of the Cross, he is justified, and he is given entry to Paradise and he enjoys its delight.
ltx/en_us_dedes/oc.m7.d6:ocMA.OdeW6C13.incipit	O supremely good King, we…
ltx/en_us_dedes/oc.m7.d6:ocMA.OdeW6C13.melody	@ltx/en_us_dedes/he.h.m7:heHE.OIonasEkKoilias.notmetered
ltx/en_us_dedes/oc.m7.d6:ocMA.OdeW6C13.mode	@ltx/en_us_dedes/miscellanea:misc.Mode7
ltx/en_us_dedes/oc.m7.d6:ocMA.OdeW6C13.ode	@ltx/en_us_dedes/miscellanea:misc.Ode6
ltx/en_us_dedes/oc.m7.d6:ocMA.OdeW6C13.text	O supremely good King, we extol You who were lifted on the Cross; we glorify You who wore the crown of thorns and who crowned humanity with glory.
ltx/en_us_dedes/oc.m7.d6:ocMA.OdeW6C14.incipit	The Athletes rejected all the…
ltx/en_us_dedes/oc.m7.d6:ocMA.OdeW6C14.melody	@ltx/en_us_dedes/he.h.m7:heHE.OIonasEkKoilias.notmetered
ltx/en_us_dedes/oc.m7.d6:ocMA.OdeW6C14.mode	@ltx/en_us_dedes/miscellanea:misc.Mode7
ltx/en_us_dedes/oc.m7.d6:ocMA.OdeW6C14.ode	@ltx/en_us_dedes/miscellanea:misc.Ode6
ltx/en_us_dedes/oc.m7.d6:ocMA.OdeW6C14.text	The Athletes rejected all the destructive harm of idolatry. They embraced the tortures and died, and now they reign with Christ.
ltx/en_us_dedes/oc.m7.d6:ocMA.OdeW6C15.incipit	…
ltx/en_us_dedes/oc.m7.d6:ocMA.OdeW6C15.melody	@ltx/en_us_dedes/he.h.m7:heHE.OIonasEkKoilias.name
ltx/en_us_dedes/oc.m7.d6:ocMA.OdeW6C15.mode	@ltx/en_us_dedes/miscellanea:misc.Mode7
ltx/en_us_dedes/oc.m7.d6:ocMA.OdeW6C15.ode	@ltx/en_us_dedes/miscellanea:misc.Ode6
ltx/en_us_dedes/oc.m7.d6:ocMA.OdeW6C15.text	
ltx/en_us_dedes/oc.m7.d6:ocMA.OdeW6C1H.greekmelody	@ltx/en_us_dedes/he.h.m7:heHE.OIonasEkKoilias.greekname
ltx/en_us_dedes/oc.m7.d6:ocMA.OdeW6C1H.incipit	@ltx/en_us_dedes/he.h.m7:heHE.OIonasEkKoilias.incipit
ltx/en_us_dedes/oc.m7.d6:ocMA.OdeW6C1H.melody	@ltx/en_us_dedes/he.h.m7:heHE.OIonasEkKoilias.melody
ltx/en_us_dedes/oc.m7.d6:ocMA.OdeW6C1H.mode	@ltx/en_us_dedes/miscellanea:misc.Mode7
ltx/en_us_dedes/oc.m7.d6:ocMA.OdeW6C1H.ode	@ltx/en_us_dedes/miscellanea:misc.Ode6
ltx/en_us_dedes/oc.m7.d6:ocMA.OdeW6C1H.text	@ltx/en_us_dedes/he.h.m7:heHE.OIonasEkKoilias.text
ltx/en_us_dedes/oc.m7.d6:ocMA.OdeW6C1T.incipit	O pure and all-blameless Virgin…
ltx/en_us_dedes/oc.m7.d6:ocMA.OdeW6C1T.melody	@ltx/en_us_dedes/he.h.m7:heHE.OIonasEkKoilias.notmetered
ltx/en_us_dedes/oc.m7.d6:ocMA.OdeW6C1T.mode	@ltx/en_us_dedes/miscellanea:misc.Mode7
ltx/en_us_dedes/oc.m7.d6:ocMA.OdeW6C1T.ode	@ltx/en_us_dedes/miscellanea:misc.Ode6
ltx/en_us_dedes/oc.m7.d6:ocMA.OdeW6C1T.text	O pure and all-blameless Virgin Mother, you extol Him who was incarnate of you, and you lament as you see Him lifted on the Cross.
ltx/en_us_dedes/oc.m7.d6:ocMA.OdeW6C21.greekmelody	@ltx/en_us_dedes/he.h.m7:heHE.VythoAmartimaton.greekname
ltx/en_us_dedes/oc.m7.d6:ocMA.OdeW6C21.incipit	…
ltx/en_us_dedes/oc.m7.d6:ocMA.OdeW6C21.melody	@ltx/en_us_dedes/he.h.m7:heHE.VythoAmartimaton.name
ltx/en_us_dedes/oc.m7.d6:ocMA.OdeW6C21.mode	@ltx/en_us_dedes/miscellanea:misc.Mode7
ltx/en_us_dedes/oc.m7.d6:ocMA.OdeW6C21.ode	@ltx/en_us_dedes/miscellanea:misc.Ode6
ltx/en_us_dedes/oc.m7.d6:ocMA.OdeW6C21.text	
ltx/en_us_dedes/oc.m7.d6:ocMA.OdeW6C22.incipit	…
ltx/en_us_dedes/oc.m7.d6:ocMA.OdeW6C22.melody	@ltx/en_us_dedes/he.h.m7:heHE.VythoAmartimaton.name
ltx/en_us_dedes/oc.m7.d6:ocMA.OdeW6C22.mode	@ltx/en_us_dedes/miscellanea:misc.Mode7
ltx/en_us_dedes/oc.m7.d6:ocMA.OdeW6C22.ode	@ltx/en_us_dedes/miscellanea:misc.Ode6
ltx/en_us_dedes/oc.m7.d6:ocMA.OdeW6C22.text	
ltx/en_us_dedes/oc.m7.d6:ocMA.OdeW6C23.incipit	…
ltx/en_us_dedes/oc.m7.d6:ocMA.OdeW6C23.melody	@ltx/en_us_dedes/he.h.m7:heHE.VythoAmartimaton.name
ltx/en_us_dedes/oc.m7.d6:ocMA.OdeW6C23.mode	@ltx/en_us_dedes/miscellanea:misc.Mode7
ltx/en_us_dedes/oc.m7.d6:ocMA.OdeW6C23.ode	@ltx/en_us_dedes/miscellanea:misc.Ode6
ltx/en_us_dedes/oc.m7.d6:ocMA.OdeW6C23.text	
ltx/en_us_dedes/oc.m7.d6:ocMA.OdeW6C24.incipit	…
ltx/en_us_dedes/oc.m7.d6:ocMA.OdeW6C24.melody	@ltx/en_us_dedes/he.h.m7:heHE.VythoAmartimaton.name
ltx/en_us_dedes/oc.m7.d6:ocMA.OdeW6C24.mode	@ltx/en_us_dedes/miscellanea:misc.Mode7
ltx/en_us_dedes/oc.m7.d6:ocMA.OdeW6C24.ode	@ltx/en_us_dedes/miscellanea:misc.Ode6
ltx/en_us_dedes/oc.m7.d6:ocMA.OdeW6C24.text	
ltx/en_us_dedes/oc.m7.d6:ocMA.OdeW7C11.incipit	O supremely good Jesus, You…
ltx/en_us_dedes/oc.m7.d6:ocMA.OdeW7C11.melody	@ltx/en_us_dedes/he.h.m7:heHE.KaminonPaides.notmetered
ltx/en_us_dedes/oc.m7.d6:ocMA.OdeW7C11.mode	@ltx/en_us_dedes/miscellanea:misc.Mode7
ltx/en_us_dedes/oc.m7.d6:ocMA.OdeW7C11.ode	@ltx/en_us_dedes/miscellanea:misc.Ode7
ltx/en_us_dedes/oc.m7.d6:ocMA.OdeW7C11.text	O supremely good Jesus, You were lifted on the Cross between to outlaws, and thus You lightened the weight of my own lawlessness, O God of our fathers, exalted beyond measure and supremely good.
ltx/en_us_dedes/oc.m7.d6:ocMA.OdeW7C12.incipit	O Savior, You were pierced…
ltx/en_us_dedes/oc.m7.d6:ocMA.OdeW7C12.melody	@ltx/en_us_dedes/he.h.m7:heHE.KaminonPaides.notmetered
ltx/en_us_dedes/oc.m7.d6:ocMA.OdeW7C12.mode	@ltx/en_us_dedes/miscellanea:misc.Mode7
ltx/en_us_dedes/oc.m7.d6:ocMA.OdeW7C12.ode	@ltx/en_us_dedes/miscellanea:misc.Ode7
ltx/en_us_dedes/oc.m7.d6:ocMA.OdeW7C12.text	O Savior, You were pierced in the side with a lance, and You rectified the fall of Adam’s side. And You command the flaming sword from now on to allow me entry into Paradise.
ltx/en_us_dedes/oc.m7.d6:ocMA.OdeW7C13.incipit	The Church’s Saints have become…
ltx/en_us_dedes/oc.m7.d6:ocMA.OdeW7C13.melody	@ltx/en_us_dedes/he.h.m7:heHE.KaminonPaides.notmetered
ltx/en_us_dedes/oc.m7.d6:ocMA.OdeW7C13.mode	@ltx/en_us_dedes/miscellanea:misc.Mode7
ltx/en_us_dedes/oc.m7.d6:ocMA.OdeW7C13.ode	@ltx/en_us_dedes/miscellanea:misc.Ode7
ltx/en_us_dedes/oc.m7.d6:ocMA.OdeW7C13.text	The Church’s Saints have become like stars set in the heights, and they illumine creation with the splendor of their medals and the cheer that their cures bring.
ltx/en_us_dedes/oc.m7.d6:ocMA.OdeW7C14.incipit	The Book of the living…
ltx/en_us_dedes/oc.m7.d6:ocMA.OdeW7C14.melody	@ltx/en_us_dedes/he.h.m7:heHE.KaminonPaides.notmetered
ltx/en_us_dedes/oc.m7.d6:ocMA.OdeW7C14.mode	@ltx/en_us_dedes/miscellanea:misc.Mode7
ltx/en_us_dedes/oc.m7.d6:ocMA.OdeW7C14.ode	@ltx/en_us_dedes/miscellanea:misc.Ode7
ltx/en_us_dedes/oc.m7.d6:ocMA.OdeW7C14.text	The Book of the living shows that the Martyrs of the Lord are eternally recorded in it, for they eagerly kept the recorded commandments of God, and they competed in martyrdom mightily.
ltx/en_us_dedes/oc.m7.d6:ocMA.OdeW7C1H.greekmelody	@ltx/en_us_dedes/he.h.m7:heHE.KaminonPaides.greekname
ltx/en_us_dedes/oc.m7.d6:ocMA.OdeW7C1H.incipit	@ltx/en_us_dedes/he.h.m7:heHE.KaminonPaides.incipit
ltx/en_us_dedes/oc.m7.d6:ocMA.OdeW7C1H.melody	@ltx/en_us_dedes/he.h.m7:heHE.KaminonPaides.melody
ltx/en_us_dedes/oc.m7.d6:ocMA.OdeW7C1H.mode	@ltx/en_us_dedes/miscellanea:misc.Mode7
ltx/en_us_dedes/oc.m7.d6:ocMA.OdeW7C1H.ode	@ltx/en_us_dedes/miscellanea:misc.Ode7
ltx/en_us_dedes/oc.m7.d6:ocMA.OdeW7C1H.text	@ltx/en_us_dedes/he.h.m7:heHE.KaminonPaides.text
ltx/en_us_dedes/oc.m7.d6:ocMA.OdeW7C1T.incipit	The all-holy Lady lamented as…
ltx/en_us_dedes/oc.m7.d6:ocMA.OdeW7C1T.melody	@ltx/en_us_dedes/he.h.m7:heHE.KaminonPaides.notmetered
ltx/en_us_dedes/oc.m7.d6:ocMA.OdeW7C1T.mode	@ltx/en_us_dedes/miscellanea:misc.Mode7
ltx/en_us_dedes/oc.m7.d6:ocMA.OdeW7C1T.ode	@ltx/en_us_dedes/miscellanea:misc.Ode7
ltx/en_us_dedes/oc.m7.d6:ocMA.OdeW7C1T.text	The all-holy Lady lamented as she watched the all-holy Logos, who had risen from her, being lifted on the holy Cross and thus sanctifying humanity.
ltx/en_us_dedes/oc.m7.d6:ocMA.OdeW7C21.greekmelody	@ltx/en_us_dedes/he.h.m7:heHE.TousEnKaminoPaidasMimoumenoi.greekname
ltx/en_us_dedes/oc.m7.d6:ocMA.OdeW7C21.incipit	…
ltx/en_us_dedes/oc.m7.d6:ocMA.OdeW7C21.melody	@ltx/en_us_dedes/he.h.m7:heHE.TousEnKaminoPaidasMimoumenoi.name
ltx/en_us_dedes/oc.m7.d6:ocMA.OdeW7C21.mode	@ltx/en_us_dedes/miscellanea:misc.Mode7
ltx/en_us_dedes/oc.m7.d6:ocMA.OdeW7C21.ode	@ltx/en_us_dedes/miscellanea:misc.Ode7
ltx/en_us_dedes/oc.m7.d6:ocMA.OdeW7C21.text	
ltx/en_us_dedes/oc.m7.d6:ocMA.OdeW7C22.incipit	…
ltx/en_us_dedes/oc.m7.d6:ocMA.OdeW7C22.melody	@ltx/en_us_dedes/he.h.m7:heHE.TousEnKaminoPaidasMimoumenoi.name
ltx/en_us_dedes/oc.m7.d6:ocMA.OdeW7C22.mode	@ltx/en_us_dedes/miscellanea:misc.Mode7
ltx/en_us_dedes/oc.m7.d6:ocMA.OdeW7C22.ode	@ltx/en_us_dedes/miscellanea:misc.Ode7
ltx/en_us_dedes/oc.m7.d6:ocMA.OdeW7C22.text	
ltx/en_us_dedes/oc.m7.d6:ocMA.OdeW7C23.incipit	…
ltx/en_us_dedes/oc.m7.d6:ocMA.OdeW7C23.melody	@ltx/en_us_dedes/he.h.m7:heHE.TousEnKaminoPaidasMimoumenoi.name
ltx/en_us_dedes/oc.m7.d6:ocMA.OdeW7C23.mode	@ltx/en_us_dedes/miscellanea:misc.Mode7
ltx/en_us_dedes/oc.m7.d6:ocMA.OdeW7C23.ode	@ltx/en_us_dedes/miscellanea:misc.Ode7
ltx/en_us_dedes/oc.m7.d6:ocMA.OdeW7C23.text	
ltx/en_us_dedes/oc.m7.d6:ocMA.OdeW7C24.incipit	…
ltx/en_us_dedes/oc.m7.d6:ocMA.OdeW7C24.melody	@ltx/en_us_dedes/he.h.m7:heHE.TousEnKaminoPaidasMimoumenoi.name
ltx/en_us_dedes/oc.m7.d6:ocMA.OdeW7C24.mode	@ltx/en_us_dedes/miscellanea:misc.Mode7
ltx/en_us_dedes/oc.m7.d6:ocMA.OdeW7C24.ode	@ltx/en_us_dedes/miscellanea:misc.Ode7
ltx/en_us_dedes/oc.m7.d6:ocMA.OdeW7C24.text	
ltx/en_us_dedes/oc.m7.d6:ocMA.OdeW8C11.incipit	…
ltx/en_us_dedes/oc.m7.d6:ocMA.OdeW8C11.melody	@ltx/en_us_dedes/he.h.m7:heHE.TonMononAnarchon.name
ltx/en_us_dedes/oc.m7.d6:ocMA.OdeW8C11.mode	@ltx/en_us_dedes/miscellanea:misc.Mode7
ltx/en_us_dedes/oc.m7.d6:ocMA.OdeW8C11.ode	@ltx/en_us_dedes/miscellanea:misc.Ode8
ltx/en_us_dedes/oc.m7.d6:ocMA.OdeW8C11.text	
ltx/en_us_dedes/oc.m7.d6:ocMA.OdeW8C12.incipit	…
ltx/en_us_dedes/oc.m7.d6:ocMA.OdeW8C12.melody	@ltx/en_us_dedes/he.h.m7:heHE.TonMononAnarchon.name
ltx/en_us_dedes/oc.m7.d6:ocMA.OdeW8C12.mode	@ltx/en_us_dedes/miscellanea:misc.Mode7
ltx/en_us_dedes/oc.m7.d6:ocMA.OdeW8C12.ode	@ltx/en_us_dedes/miscellanea:misc.Ode8
ltx/en_us_dedes/oc.m7.d6:ocMA.OdeW8C12.text	
ltx/en_us_dedes/oc.m7.d6:ocMA.OdeW8C13.incipit	…
ltx/en_us_dedes/oc.m7.d6:ocMA.OdeW8C13.melody	@ltx/en_us_dedes/he.h.m7:heHE.TonMononAnarchon.name
ltx/en_us_dedes/oc.m7.d6:ocMA.OdeW8C13.mode	@ltx/en_us_dedes/miscellanea:misc.Mode7
ltx/en_us_dedes/oc.m7.d6:ocMA.OdeW8C13.ode	@ltx/en_us_dedes/miscellanea:misc.Ode8
ltx/en_us_dedes/oc.m7.d6:ocMA.OdeW8C13.text	
ltx/en_us_dedes/oc.m7.d6:ocMA.OdeW8C14.incipit	…
ltx/en_us_dedes/oc.m7.d6:ocMA.OdeW8C14.melody	@ltx/en_us_dedes/he.h.m7:heHE.TonMononAnarchon.name
ltx/en_us_dedes/oc.m7.d6:ocMA.OdeW8C14.mode	@ltx/en_us_dedes/miscellanea:misc.Mode7
ltx/en_us_dedes/oc.m7.d6:ocMA.OdeW8C14.ode	@ltx/en_us_dedes/miscellanea:misc.Ode8
ltx/en_us_dedes/oc.m7.d6:ocMA.OdeW8C14.text	
ltx/en_us_dedes/oc.m7.d6:ocMA.OdeW8C1H.greekmelody	@ltx/en_us_dedes/he.h.m7:heHE.TonMononAnarchon.greekname
ltx/en_us_dedes/oc.m7.d6:ocMA.OdeW8C1H.incipit	@ltx/en_us_dedes/he.h.m7:heHE.TonMononAnarchon.incipit
ltx/en_us_dedes/oc.m7.d6:ocMA.OdeW8C1H.melody	@ltx/en_us_dedes/he.h.m7:heHE.TonMononAnarchon.melody
ltx/en_us_dedes/oc.m7.d6:ocMA.OdeW8C1H.mode	@ltx/en_us_dedes/miscellanea:misc.Mode7
ltx/en_us_dedes/oc.m7.d6:ocMA.OdeW8C1H.ode	@ltx/en_us_dedes/miscellanea:misc.Ode8
ltx/en_us_dedes/oc.m7.d6:ocMA.OdeW8C1H.text	@ltx/en_us_dedes/he.h.m7:heHE.TonMononAnarchon.text
ltx/en_us_dedes/oc.m7.d6:ocMA.OdeW8C1T.incipit	…
ltx/en_us_dedes/oc.m7.d6:ocMA.OdeW8C1T.melody	@ltx/en_us_dedes/he.h.m7:heHE.TonMononAnarchon.name
ltx/en_us_dedes/oc.m7.d6:ocMA.OdeW8C1T.mode	@ltx/en_us_dedes/miscellanea:misc.Mode7
ltx/en_us_dedes/oc.m7.d6:ocMA.OdeW8C1T.ode	@ltx/en_us_dedes/miscellanea:misc.Ode8
ltx/en_us_dedes/oc.m7.d6:ocMA.OdeW8C1T.text	
ltx/en_us_dedes/oc.m7.d6:ocMA.OdeW8C21.greekmelody	@ltx/en_us_dedes/he.h.m7:heHE.TonYpAngelonAsigitos.greekname
ltx/en_us_dedes/oc.m7.d6:ocMA.OdeW8C21.incipit	…
ltx/en_us_dedes/oc.m7.d6:ocMA.OdeW8C21.melody	@ltx/en_us_dedes/he.h.m7:heHE.TonYpAngelonAsigitos.name
ltx/en_us_dedes/oc.m7.d6:ocMA.OdeW8C21.mode	@ltx/en_us_dedes/miscellanea:misc.Mode7
ltx/en_us_dedes/oc.m7.d6:ocMA.OdeW8C21.ode	@ltx/en_us_dedes/miscellanea:misc.Ode8
ltx/en_us_dedes/oc.m7.d6:ocMA.OdeW8C21.text	
ltx/en_us_dedes/oc.m7.d6:ocMA.OdeW8C22.incipit	…
ltx/en_us_dedes/oc.m7.d6:ocMA.OdeW8C22.melody	@ltx/en_us_dedes/he.h.m7:heHE.TonYpAngelonAsigitos.name
ltx/en_us_dedes/oc.m7.d6:ocMA.OdeW8C22.mode	@ltx/en_us_dedes/miscellanea:misc.Mode7
ltx/en_us_dedes/oc.m7.d6:ocMA.OdeW8C22.ode	@ltx/en_us_dedes/miscellanea:misc.Ode8
ltx/en_us_dedes/oc.m7.d6:ocMA.OdeW8C22.text	
ltx/en_us_dedes/oc.m7.d6:ocMA.OdeW8C23.incipit	…
ltx/en_us_dedes/oc.m7.d6:ocMA.OdeW8C23.melody	@ltx/en_us_dedes/he.h.m7:heHE.TonYpAngelonAsigitos.name
ltx/en_us_dedes/oc.m7.d6:ocMA.OdeW8C23.mode	@ltx/en_us_dedes/miscellanea:misc.Mode7
ltx/en_us_dedes/oc.m7.d6:ocMA.OdeW8C23.ode	@ltx/en_us_dedes/miscellanea:misc.Ode8
ltx/en_us_dedes/oc.m7.d6:ocMA.OdeW8C23.text	
ltx/en_us_dedes/oc.m7.d6:ocMA.OdeW8C24.incipit	…
ltx/en_us_dedes/oc.m7.d6:ocMA.OdeW8C24.melody	@ltx/en_us_dedes/he.h.m7:heHE.TonYpAngelonAsigitos.name
ltx/en_us_dedes/oc.m7.d6:ocMA.OdeW8C24.mode	@ltx/en_us_dedes/miscellanea:misc.Mode7
ltx/en_us_dedes/oc.m7.d6:ocMA.OdeW8C24.ode	@ltx/en_us_dedes/miscellanea:misc.Ode8
ltx/en_us_dedes/oc.m7.d6:ocMA.OdeW8C24.text	
ltx/en_us_dedes/oc.m7.d6:ocMA.OdeW9C11.incipit	…
ltx/en_us_dedes/oc.m7.d6:ocMA.OdeW9C11.melody	@ltx/en_us_dedes/he.h.m7:heHE.PanymniteTonOuranonYpsilotera.name
ltx/en_us_dedes/oc.m7.d6:ocMA.OdeW9C11.mode	@ltx/en_us_dedes/miscellanea:misc.Mode7
ltx/en_us_dedes/oc.m7.d6:ocMA.OdeW9C11.ode	@ltx/en_us_dedes/miscellanea:misc.Ode9
ltx/en_us_dedes/oc.m7.d6:ocMA.OdeW9C11.text	
ltx/en_us_dedes/oc.m7.d6:ocMA.OdeW9C12.incipit	…
ltx/en_us_dedes/oc.m7.d6:ocMA.OdeW9C12.melody	@ltx/en_us_dedes/he.h.m7:heHE.PanymniteTonOuranonYpsilotera.name
ltx/en_us_dedes/oc.m7.d6:ocMA.OdeW9C12.mode	@ltx/en_us_dedes/miscellanea:misc.Mode7
ltx/en_us_dedes/oc.m7.d6:ocMA.OdeW9C12.ode	@ltx/en_us_dedes/miscellanea:misc.Ode9
ltx/en_us_dedes/oc.m7.d6:ocMA.OdeW9C12.text	
ltx/en_us_dedes/oc.m7.d6:ocMA.OdeW9C13.incipit	…
ltx/en_us_dedes/oc.m7.d6:ocMA.OdeW9C13.melody	@ltx/en_us_dedes/he.h.m7:heHE.PanymniteTonOuranonYpsilotera.name
ltx/en_us_dedes/oc.m7.d6:ocMA.OdeW9C13.mode	@ltx/en_us_dedes/miscellanea:misc.Mode7
ltx/en_us_dedes/oc.m7.d6:ocMA.OdeW9C13.ode	@ltx/en_us_dedes/miscellanea:misc.Ode9
ltx/en_us_dedes/oc.m7.d6:ocMA.OdeW9C13.text	
ltx/en_us_dedes/oc.m7.d6:ocMA.OdeW9C14.incipit	…
ltx/en_us_dedes/oc.m7.d6:ocMA.OdeW9C14.melody	@ltx/en_us_dedes/he.h.m7:heHE.PanymniteTonOuranonYpsilotera.name
ltx/en_us_dedes/oc.m7.d6:ocMA.OdeW9C14.mode	@ltx/en_us_dedes/miscellanea:misc.Mode7
ltx/en_us_dedes/oc.m7.d6:ocMA.OdeW9C14.ode	@ltx/en_us_dedes/miscellanea:misc.Ode9
ltx/en_us_dedes/oc.m7.d6:ocMA.OdeW9C14.text	
ltx/en_us_dedes/oc.m7.d6:ocMA.OdeW9C1H.greekmelody	@ltx/en_us_dedes/he.h.m7:heHE.PanymniteTonOuranonYpsilotera.greekname
ltx/en_us_dedes/oc.m7.d6:ocMA.OdeW9C1H.incipit	@ltx/en_us_dedes/he.h.m7:heHE.PanymniteTonOuranonYpsilotera.incipit
ltx/en_us_dedes/oc.m7.d6:ocMA.OdeW9C1H.melody	@ltx/en_us_dedes/he.h.m7:heHE.PanymniteTonOuranonYpsilotera.melody
ltx/en_us_dedes/oc.m7.d6:ocMA.OdeW9C1H.mode	@ltx/en_us_dedes/miscellanea:misc.Mode7
ltx/en_us_dedes/oc.m7.d6:ocMA.OdeW9C1H.ode	@ltx/en_us_dedes/miscellanea:misc.Ode9
ltx/en_us_dedes/oc.m7.d6:ocMA.OdeW9C1H.text	@ltx/en_us_dedes/he.h.m7:heHE.PanymniteTonOuranonYpsilotera.text
ltx/en_us_dedes/oc.m7.d6:ocMA.OdeW9C1T.incipit	…
ltx/en_us_dedes/oc.m7.d6:ocMA.OdeW9C1T.melody	@ltx/en_us_dedes/he.h.m7:heHE.PanymniteTonOuranonYpsilotera.name
ltx/en_us_dedes/oc.m7.d6:ocMA.OdeW9C1T.mode	@ltx/en_us_dedes/miscellanea:misc.Mode7
ltx/en_us_dedes/oc.m7.d6:ocMA.OdeW9C1T.ode	@ltx/en_us_dedes/miscellanea:misc.Ode9
ltx/en_us_dedes/oc.m7.d6:ocMA.OdeW9C1T.text	
ltx/en_us_dedes/oc.m7.d6:ocMA.OdeW9C21.greekmelody	@ltx/en_us_dedes/he.h.m7:heHE.AsporouTokouSyllipsin.greekname
ltx/en_us_dedes/oc.m7.d6:ocMA.OdeW9C21.incipit	…
ltx/en_us_dedes/oc.m7.d6:ocMA.OdeW9C21.melody	@ltx/en_us_dedes/he.h.m7:heHE.AsporouTokouSyllipsin.name
ltx/en_us_dedes/oc.m7.d6:ocMA.OdeW9C21.mode	@ltx/en_us_dedes/miscellanea:misc.Mode7
ltx/en_us_dedes/oc.m7.d6:ocMA.OdeW9C21.ode	@ltx/en_us_dedes/miscellanea:misc.Ode9
ltx/en_us_dedes/oc.m7.d6:ocMA.OdeW9C21.text	
ltx/en_us_dedes/oc.m7.d6:ocMA.OdeW9C22.incipit	…
ltx/en_us_dedes/oc.m7.d6:ocMA.OdeW9C22.melody	@ltx/en_us_dedes/he.h.m7:heHE.AsporouTokouSyllipsin.name
ltx/en_us_dedes/oc.m7.d6:ocMA.OdeW9C22.mode	@ltx/en_us_dedes/miscellanea:misc.Mode7
ltx/en_us_dedes/oc.m7.d6:ocMA.OdeW9C22.ode	@ltx/en_us_dedes/miscellanea:misc.Ode9
ltx/en_us_dedes/oc.m7.d6:ocMA.OdeW9C22.text	
ltx/en_us_dedes/oc.m7.d6:ocMA.OdeW9C23.incipit	…
ltx/en_us_dedes/oc.m7.d6:ocMA.OdeW9C23.melody	@ltx/en_us_dedes/he.h.m7:heHE.AsporouTokouSyllipsin.name
ltx/en_us_dedes/oc.m7.d6:ocMA.OdeW9C23.mode	@ltx/en_us_dedes/miscellanea:misc.Mode7
ltx/en_us_dedes/oc.m7.d6:ocMA.OdeW9C23.ode	@ltx/en_us_dedes/miscellanea:misc.Ode9
ltx/en_us_dedes/oc.m7.d6:ocMA.OdeW9C23.text	
ltx/en_us_dedes/oc.m7.d6:ocMA.OdeW9C24.incipit	…
ltx/en_us_dedes/oc.m7.d6:ocMA.OdeW9C24.melody	@ltx/en_us_dedes/he.h.m7:heHE.AsporouTokouSyllipsin.name
ltx/en_us_dedes/oc.m7.d6:ocMA.OdeW9C24.mode	@ltx/en_us_dedes/miscellanea:misc.Mode7
ltx/en_us_dedes/oc.m7.d6:ocMA.OdeW9C24.ode	@ltx/en_us_dedes/miscellanea:misc.Ode9
ltx/en_us_dedes/oc.m7.d6:ocMA.OdeW9C24.text	
ltx/en_us_dedes/oc.m7.d6:ocVE.ApolTheotokionVM.incipit	@ltx/en_us_dedes/oc.m7.d4:ocMA.Kathisma33.incipit
ltx/en_us_dedes/oc.m7.d6:ocVE.ApolTheotokionVM.melody	
ltx/en_us_dedes/oc.m7.d6:ocVE.ApolTheotokionVM.mode	@ltx/en_us_dedes/miscellanea:misc.Mode7
ltx/en_us_dedes/oc.m7.d6:ocVE.ApolTheotokionVM.text	@ltx/en_us_dedes/oc.m7.d4:ocMA.Kathisma33.text
ltx/en_us_dedes/oc.m7.d6:ocVE.AposTheotokion.greekmelody	@ltx/en_us_dedes/he.a.m7:heAU.SimeronGrigoreiOIoudas.greekname
ltx/en_us_dedes/oc.m7.d6:ocVE.AposTheotokion.incipit	Pierced am I by the…
ltx/en_us_dedes/oc.m7.d6:ocVE.AposTheotokion.melody	@ltx/en_us_dedes/he.a.m7:heAU.SimeronGrigoreiOIoudas.name
ltx/en_us_dedes/oc.m7.d6:ocVE.AposTheotokion.mode	@ltx/en_us_dedes/miscellanea:misc.Mode7
ltx/en_us_dedes/oc.m7.d6:ocVE.AposTheotokion.text	Pierced am I by the sword of my sorrow * as I see You upon the Cross, * You who have established the earth on the waters, * and stretched out the heaven as it were a curtain. * For I see You naked, and slaughtered, and hanging there, * O beloved Son of mine. And now I prefer to die. * Stand aghast and shudder, O earth! * Thus the all-pure Lady uttered as she wept.
ltx/en_us_dedes/oc.m7.d6:ocVE.Aposticha1.greekmelody	@ltx/en_us_dedes/he.a.m7:heAU.OukEtiKolyometha.greekname
ltx/en_us_dedes/oc.m7.d6:ocVE.Aposticha1.incipit	@ltx/en_us_dedes/he.a.m7:heAU.OukEtiKolyometha.incipit
ltx/en_us_dedes/oc.m7.d6:ocVE.Aposticha1.melody	@ltx/en_us_dedes/he.a.m7:heAU.OukEtiKolyometha.melody
ltx/en_us_dedes/oc.m7.d6:ocVE.Aposticha1.mode	@ltx/en_us_dedes/miscellanea:misc.Mode7
ltx/en_us_dedes/oc.m7.d6:ocVE.Aposticha1.text	@ltx/en_us_dedes/he.a.m7:heAU.OukEtiKolyometha.text
ltx/en_us_dedes/oc.m7.d6:ocVE.Aposticha2.incipit	@ltx/en_us_dedes/oc.m7.d4:ocVE.Aposticha2.incipit
ltx/en_us_dedes/oc.m7.d6:ocVE.Aposticha2.melody	
ltx/en_us_dedes/oc.m7.d6:ocVE.Aposticha2.mode	@ltx/en_us_dedes/miscellanea:misc.Mode7
ltx/en_us_dedes/oc.m7.d6:ocVE.Aposticha2.text	@ltx/en_us_dedes/oc.m7.d4:ocVE.Aposticha2.text
ltx/en_us_dedes/oc.m7.d6:ocVE.Aposticha3.incipit	@ltx/en_us_dedes/oc.m7.d2:ocVE.Aposticha3.incipit
ltx/en_us_dedes/oc.m7.d6:ocVE.Aposticha3.melody	
ltx/en_us_dedes/oc.m7.d6:ocVE.Aposticha3.mode	@ltx/en_us_dedes/miscellanea:misc.Mode7
ltx/en_us_dedes/oc.m7.d6:ocVE.Aposticha3.text	@ltx/en_us_dedes/oc.m7.d2:ocVE.Aposticha3.text
ltx/en_us_dedes/oc.m7.d6:ocVE.SticTheotokion.greekmelody	@ltx/en_us_dedes/he.a.m7:heAU.SimeronGrigoreiOIoudas.greekname
ltx/en_us_dedes/oc.m7.d6:ocVE.SticTheotokion.incipit	…
ltx/en_us_dedes/oc.m7.d6:ocVE.SticTheotokion.melody	@ltx/en_us_dedes/he.a.m7:heAU.SimeronGrigoreiOIoudas.name
ltx/en_us_dedes/oc.m7.d6:ocVE.SticTheotokion.mode	@ltx/en_us_dedes/miscellanea:misc.Mode7
ltx/en_us_dedes/oc.m7.d6:ocVE.SticTheotokion.text	
ltx/en_us_dedes/oc.m7.d6:ocVE.Stichera1.greekmelody	@ltx/en_us_dedes/he.a.m7:heAU.OukEtiKolyometha.greekname
ltx/en_us_dedes/oc.m7.d6:ocVE.Stichera1.incipit	In order to make man…
ltx/en_us_dedes/oc.m7.d6:ocVE.Stichera1.melody	@ltx/en_us_dedes/he.a.m7:heAU.OukEtiKolyometha.name
ltx/en_us_dedes/oc.m7.d6:ocVE.Stichera1.mode	@ltx/en_us_dedes/miscellanea:misc.Mode7
ltx/en_us_dedes/oc.m7.d6:ocVE.Stichera1.text	In order to make man God, O gracious Master, * You became a mortal and were crucified. * Glory to Your glory, O Lord.
ltx/en_us_dedes/oc.m7.d6:ocVE.Stichera2.incipit	…
ltx/en_us_dedes/oc.m7.d6:ocVE.Stichera2.melody	@ltx/en_us_dedes/he.a.m7:heAU.OukEtiKolyometha.name
ltx/en_us_dedes/oc.m7.d6:ocVE.Stichera2.mode	@ltx/en_us_dedes/miscellanea:misc.Mode7
ltx/en_us_dedes/oc.m7.d6:ocVE.Stichera2.text	
ltx/en_us_dedes/oc.m7.d6:ocVE.Stichera3.incipit	When You were on the Cross…
ltx/en_us_dedes/oc.m7.d6:ocVE.Stichera3.melody	@ltx/en_us_dedes/he.a.m7:heAU.OukEtiKolyometha.name
ltx/en_us_dedes/oc.m7.d6:ocVE.Stichera3.mode	@ltx/en_us_dedes/miscellanea:misc.Mode7
ltx/en_us_dedes/oc.m7.d6:ocVE.Stichera3.text	When You were on the Cross, then the sun was darkened, * and creation trembled and shouted: Glory * unto You, O merciful Lord.
ltx/en_us_dedes/oc.m7.d6:ocVE.Stichera4.greekmelody	@ltx/en_us_dedes/he.a.m7:heAU.SimeronGrigoreiOIoudas.greekname
ltx/en_us_dedes/oc.m7.d6:ocVE.Stichera4.incipit	Lend me your kindly ear…
ltx/en_us_dedes/oc.m7.d6:ocVE.Stichera4.melody	@ltx/en_us_dedes/he.a.m7:heAU.SimeronGrigoreiOIoudas.name
ltx/en_us_dedes/oc.m7.d6:ocVE.Stichera4.mode	@ltx/en_us_dedes/miscellanea:misc.Mode7
ltx/en_us_dedes/oc.m7.d6:ocVE.Stichera4.text	Lend me your kindly ear as I pray now * unto you, O all-blameless one, * and do not reject me from before your presence, * neither send me far away from your assistance. * For, behold, the wily one with guile contrives to ruin me, * and with the unreasonable passions he stirs my heart. * Hence, I pray you, keep me safe * and wholly untouched by his malevolence.
ltx/en_us_dedes/oc.m7.d6:ocVE.Stichera5.incipit	…
ltx/en_us_dedes/oc.m7.d6:ocVE.Stichera5.melody	@ltx/en_us_dedes/he.a.m7:heAU.SimeronGrigoreiOIoudas.name
ltx/en_us_dedes/oc.m7.d6:ocVE.Stichera5.mode	@ltx/en_us_dedes/miscellanea:misc.Mode7
ltx/en_us_dedes/oc.m7.d6:ocVE.Stichera5.text	
ltx/en_us_dedes/oc.m7.d6:ocVE.Stichera6.incipit	…
ltx/en_us_dedes/oc.m7.d6:ocVE.Stichera6.melody	@ltx/en_us_dedes/he.a.m7:heAU.SimeronGrigoreiOIoudas.name
ltx/en_us_dedes/oc.m7.d6:ocVE.Stichera6.mode	@ltx/en_us_dedes/miscellanea:misc.Mode7
ltx/en_us_dedes/oc.m7.d6:ocVE.Stichera6.text	
ltx/en_us_dedes/oc.m7.d6:octrMA.Kathisma11.incipit	@ltx/en_us_dedes/oc.m7.d6:ocMA.Kathisma21.incipit
ltx/en_us_dedes/oc.m7.d6:octrMA.Kathisma11.melody	
ltx/en_us_dedes/oc.m7.d6:octrMA.Kathisma11.mode	@ltx/en_us_dedes/miscellanea:misc.Mode7
ltx/en_us_dedes/oc.m7.d6:octrMA.Kathisma11.text	@ltx/en_us_dedes/oc.m7.d6:ocMA.Kathisma21.text
ltx/en_us_dedes/oc.m7.d6:octrMA.Kathisma12.incipit	@ltx/en_us_dedes/oc.m7.d6:ocMA.Kathisma12.incipit
ltx/en_us_dedes/oc.m7.d6:octrMA.Kathisma12.melody	
ltx/en_us_dedes/oc.m7.d6:octrMA.Kathisma12.mode	@ltx/en_us_dedes/miscellanea:misc.Mode7
ltx/en_us_dedes/oc.m7.d6:octrMA.Kathisma12.text	@ltx/en_us_dedes/oc.m7.d6:ocMA.Kathisma12.text
ltx/en_us_dedes/oc.m7.d6:octrMA.Kathisma1T.incipit	@ltx/en_us_dedes/oc.m7.d4:ocMA.Kathisma33.incipit
ltx/en_us_dedes/oc.m7.d6:octrMA.Kathisma1T.melody	
ltx/en_us_dedes/oc.m7.d6:octrMA.Kathisma1T.mode	@ltx/en_us_dedes/miscellanea:misc.Mode7
ltx/en_us_dedes/oc.m7.d6:octrMA.Kathisma1T.text	@ltx/en_us_dedes/oc.m7.d4:ocMA.Kathisma33.text
ltx/en_us_dedes/oc.m7.d6:octrMA.Ode7Martyricon.incipit	@ltx/en_us_dedes/oc.m7.d5:ocMA.Kathisma32.incipit
ltx/en_us_dedes/oc.m7.d6:octrMA.Ode7Martyricon.melody	
ltx/en_us_dedes/oc.m7.d6:octrMA.Ode7Martyricon.mode	@ltx/en_us_dedes/miscellanea:misc.Mode7
ltx/en_us_dedes/oc.m7.d6:octrMA.Ode7Martyricon.text	@ltx/en_us_dedes/oc.m7.d5:ocMA.Kathisma32.text
ltx/en_us_dedes/oc.m7.d6:octrMA.Photogogic.incipit	@ltx/en_us_dedes/oc.m7.d2:octrMA.Photagogic.incipit
ltx/en_us_dedes/oc.m7.d6:octrMA.Photogogic.mode	@ltx/en_us_dedes/miscellanea:misc.Mode7
ltx/en_us_dedes/oc.m7.d6:octrMA.Photogogic.text	@ltx/en_us_dedes/oc.m7.d2:octrMA.Photagogic.text
ltx/en_us_dedes/oc.m7.d6:octrMA.Triadic1.incipit	@ltx/en_us_dedes/oc.m7.d2:octrMA.Triadic1.incipit
ltx/en_us_dedes/oc.m7.d6:octrMA.Triadic1.mode	@ltx/en_us_dedes/miscellanea:misc.Mode7
ltx/en_us_dedes/oc.m7.d6:octrMA.Triadic1.text	@ltx/en_us_dedes/oc.m7.d2:octrMA.Triadic1.text
ltx/en_us_dedes/oc.m7.d6:octrMA.Triadic2.incipit	@ltx/en_us_dedes/oc.m7.d2:octrMA.Triadic2.incipit
ltx/en_us_dedes/oc.m7.d6:octrMA.Triadic2.mode	@ltx/en_us_dedes/miscellanea:misc.Mode7
ltx/en_us_dedes/oc.m7.d6:octrMA.Triadic2.text	@ltx/en_us_dedes/oc.m7.d2:octrMA.Triadic2.text
ltx/en_us_dedes/oc.m7.d6:octrMA.Triadic3.incipit	@ltx/en_us_dedes/oc.m7.d2:octrMA.Triadic3.incipit
ltx/en_us_dedes/oc.m7.d6:octrMA.Triadic3.mode	@ltx/en_us_dedes/miscellanea:misc.Mode7
ltx/en_us_dedes/oc.m7.d6:octrMA.Triadic3.text	@ltx/en_us_dedes/oc.m7.d2:octrMA.Triadic3.text
