ltx/en_us_dedes/template.titles:bap.html.tab	BAPTISM
ltx/en_us_dedes/template.titles:bap.pdf.cover	
ltx/en_us_dedes/template.titles:bap.pdf.header	
ltx/en_us_dedes/template.titles:cdo.html.tab	CHURCH DOOR-OPENING
ltx/en_us_dedes/template.titles:cdo.pdf.cover	
ltx/en_us_dedes/template.titles:cdo.pdf.header	
ltx/en_us_dedes/template.titles:chi.html.tab	CHILDBIRTH
ltx/en_us_dedes/template.titles:chi.pdf.cover	
ltx/en_us_dedes/template.titles:chi.pdf.header	
ltx/en_us_dedes/template.titles:clps.additionallitanies.bottom	Hide Litanies
ltx/en_us_dedes/template.titles:clps.additionallitanies.top	Show Litanies
ltx/en_us_dedes/template.titles:clps.additionalpetitions.bottom	Hide Petitions
ltx/en_us_dedes/template.titles:clps.additionalpetitions.top	Show Petitions
ltx/en_us_dedes/template.titles:clps.alternative.bottom	Hide Alternative
ltx/en_us_dedes/template.titles:clps.alternative.top	Show Alternative
ltx/en_us_dedes/template.titles:clps.lity.bottom	Hide Lity.
ltx/en_us_dedes/template.titles:clps.lity.top	Show Lity.
ltx/en_us_dedes/template.titles:clps.matinsordinary.bottom	Hide Matins Ordinary
ltx/en_us_dedes/template.titles:clps.matinsordinary.top	Show Matins Ordinary
ltx/en_us_dedes/template.titles:clps.prayers.bottom	Hide Prayers
ltx/en_us_dedes/template.titles:clps.prayers.top	Show Prayers
ltx/en_us_dedes/template.titles:clps.precommunionprayers.bottom	Hide Pre-Communion Prayers
ltx/en_us_dedes/template.titles:clps.precommunionprayers.top	Show Pre-Communion Prayers
ltx/en_us_dedes/template.titles:clps.selectedverses.bottom	Hide Selected Verses.
ltx/en_us_dedes/template.titles:clps.selectedverses.top	Show Selected Verses.
ltx/en_us_dedes/template.titles:clps.stichologia.bottom	Hide Stichologia
ltx/en_us_dedes/template.titles:clps.stichologia.top	Show Stichologia
ltx/en_us_dedes/template.titles:clps.typikon.bottom	Hide Typikon
ltx/en_us_dedes/template.titles:clps.typikon.top	Show Typikon
ltx/en_us_dedes/template.titles:co.akathist.html.tab	SMALL COMPLINE WITH AKATHIST
ltx/en_us_dedes/template.titles:co.akathist.pdf.cover	Small Compline with Akathist
ltx/en_us_dedes/template.titles:co.akathist.pdf.header	Small Compline with Akathist
ltx/en_us_dedes/template.titles:co.christmasvigil.html.tab	CHRISTMAS VIGIL
ltx/en_us_dedes/template.titles:co.christmasvigil.pdf.cover	Christmas Vigil: Compline, Lity, End of Vespers
ltx/en_us_dedes/template.titles:co.christmasvigil.pdf.header	Christmas Vigil
ltx/en_us_dedes/template.titles:co.epiphanyvigil.html.tab	EPIPHANY VIGIL
ltx/en_us_dedes/template.titles:co.epiphanyvigil.pdf.cover	Epiphany Vigil: Compline, Lity, End of Vespers
ltx/en_us_dedes/template.titles:co.epiphanyvigil.pdf.header	Epiphany Vigil
ltx/en_us_dedes/template.titles:co.greatcanon.html.tab	Small Compline with Great Canon
ltx/en_us_dedes/template.titles:co.greatcanon.pdf.cover	Small Compline with Great Canon
ltx/en_us_dedes/template.titles:co.greatcanon.pdf.header	Small Compline with Great Canon
ltx/en_us_dedes/template.titles:co.greatcompline.pdf.cover	Great Compline
ltx/en_us_dedes/template.titles:co.greatcompline.pdf.header	(Great)
ltx/en_us_dedes/template.titles:co.html.tab	COMPLINE
ltx/en_us_dedes/template.titles:co.pdf.cover	The Service of Compline
ltx/en_us_dedes/template.titles:co.pdf.header	Compline
ltx/en_us_dedes/template.titles:co.salutations.pdf.cover	Small Compline with Salutations
ltx/en_us_dedes/template.titles:co.salutations.pdf.header	(Small) with Salutations
ltx/en_us_dedes/template.titles:co.smallcompline.html.tab	Small Compline
ltx/en_us_dedes/template.titles:co.smallcompline.pdf.cover	Small Compline
ltx/en_us_dedes/template.titles:co.smallcompline.pdf.header	(Small)
ltx/en_us_dedes/template.titles:co.smallcomplinewithcanon.html.tab	Small Compline and Canon
ltx/en_us_dedes/template.titles:co.smallcomplinewithcanon.pdf.cover	Small Compline and Canon
ltx/en_us_dedes/template.titles:co.smallcomplinewithcanon.pdf.header	SMALL COMPLINE AND CANON
ltx/en_us_dedes/template.titles:co1.html.tab	PRE-RESURRECTION SERVICE
ltx/en_us_dedes/template.titles:co1.pdf.cover	Pre-Resurrection Service
ltx/en_us_dedes/template.titles:co1.pdf.header	Pre-Resurrection Service
ltx/en_us_dedes/template.titles:co2.html.tab	SMALL COMPLINE - SALUTATIONS
ltx/en_us_dedes/template.titles:co2.pdf.cover	Small Compline and Salutations to the Theotokos
ltx/en_us_dedes/template.titles:co2.pdf.header	Small Compline and Salutations to the Theotokos
ltx/en_us_dedes/template.titles:co3.html.tab	SMALL COMPLINE - AKATHIST
ltx/en_us_dedes/template.titles:co3.pdf.cover	Small Compline and Akathist Hymn
ltx/en_us_dedes/template.titles:co3.pdf.header	Small Compline and Akathist Hymn
ltx/en_us_dedes/template.titles:co4.html.tab	SMALL COMPLINE - GREAT CANON
ltx/en_us_dedes/template.titles:co4.pdf.cover	Small Compline and Great Canon
ltx/en_us_dedes/template.titles:co4.pdf.header	Small Compline and Great Canon
ltx/en_us_dedes/template.titles:co6.html.tab	PASCHAL COMPLINE
ltx/en_us_dedes/template.titles:co6.pdf.cover	Paschal Compline
ltx/en_us_dedes/template.titles:co6.pdf.header	Paschal Compline
ltx/en_us_dedes/template.titles:con.html.tab	CONSECRATION
ltx/en_us_dedes/template.titles:con.pdf.cover	
ltx/en_us_dedes/template.titles:con.pdf.header	Consecration
ltx/en_us_dedes/template.titles:d	DAY
ltx/en_us_dedes/template.titles:d.delimiter	 -
ltx/en_us_dedes/template.titles:d.for	for
ltx/en_us_dedes/template.titles:d.of	 of
ltx/en_us_dedes/template.titles:d.on	 on
ltx/en_us_dedes/template.titles:d.onFridayAfternoon	on Friday Afternoon
ltx/en_us_dedes/template.titles:d.onFridayEvening	on Friday Evening
ltx/en_us_dedes/template.titles:d.onFridayMorning	on Friday Morning
ltx/en_us_dedes/template.titles:d.onMondayEvening	on Monday Evening
ltx/en_us_dedes/template.titles:d.onMondayMorning	on Monday Morning
ltx/en_us_dedes/template.titles:d.onSaturdayEvening	on Saturday Evening
ltx/en_us_dedes/template.titles:d.onSaturdayMorning	on Saturday Morning
ltx/en_us_dedes/template.titles:d.onSundayEvening	on Sunday Evening
ltx/en_us_dedes/template.titles:d.onSundayMorning	on Sunday Morning
ltx/en_us_dedes/template.titles:d.onThursdayEvening	on Thursday Evening
ltx/en_us_dedes/template.titles:d.onThursdayMorning	on Thursday Morning
ltx/en_us_dedes/template.titles:d.onTuesdayEvening	on Tuesday Evening
ltx/en_us_dedes/template.titles:d.onTuesdayMorning	on Tuesday Morning
ltx/en_us_dedes/template.titles:d.onWednesdayEvening	on Wednesday Evening
ltx/en_us_dedes/template.titles:d.onWednesdayMorning	on Wednesday Morning
ltx/en_us_dedes/template.titles:d.ontheeveof	 on the eve of
ltx/en_us_dedes/template.titles:dr.html.tab	DAILY READINGS
ltx/en_us_dedes/template.titles:dr.pdf.cover	Daily Readings
ltx/en_us_dedes/template.titles:dr.pdf.header	Daily Readings
ltx/en_us_dedes/template.titles:em.html.tab	MATINS
ltx/en_us_dedes/template.titles:em.pdf.cover	Matins
ltx/en_us_dedes/template.titles:em.pdf.header	Matins
ltx/en_us_dedes/template.titles:em3.html.tab	LAMENTATIONS
ltx/en_us_dedes/template.titles:em3.pdf.cover	Graveside Lamentations - Complete Text
ltx/en_us_dedes/template.titles:em3.pdf.header	Graveside Lamentations - Complete Text
ltx/en_us_dedes/template.titles:eo	EOTHINA
ltx/en_us_dedes/template.titles:eu	EUCHOLOGION
ltx/en_us_dedes/template.titles:fun.html.tab	FUNERAL
ltx/en_us_dedes/template.titles:fun.pdf.cover	
ltx/en_us_dedes/template.titles:fun.pdf.header	
ltx/en_us_dedes/template.titles:gc.html.tab	GREAT COMPLINE
ltx/en_us_dedes/template.titles:gc.pdf.cover	Great Compline
ltx/en_us_dedes/template.titles:gc.pdf.header	Great Compline
ltx/en_us_dedes/template.titles:gh.html.tab	GREAT HOURS
ltx/en_us_dedes/template.titles:gh.pdf.cover	The Great Hours
ltx/en_us_dedes/template.titles:gh.pdf.header	Great Hours
ltx/en_us_dedes/template.titles:gp.html.tab	PARAKLESIS
ltx/en_us_dedes/template.titles:gp.pdf.cover	Service of the Great Paraklesis
ltx/en_us_dedes/template.titles:gp.pdf.header	Great Paraklesis
ltx/en_us_dedes/template.titles:h1.html.tab	FIRST HOUR
ltx/en_us_dedes/template.titles:h1.pdf.cover	The First Hour
ltx/en_us_dedes/template.titles:h1.pdf.header	First Hour
ltx/en_us_dedes/template.titles:h13.html.tab	PASCHAL HOURS
ltx/en_us_dedes/template.titles:h13.pdf.cover	The Paschal Hours
ltx/en_us_dedes/template.titles:h13.pdf.header	The Paschal Hours
ltx/en_us_dedes/template.titles:h3.html.tab	THIRD HOUR
ltx/en_us_dedes/template.titles:h3.pdf.cover	The Third Hour
ltx/en_us_dedes/template.titles:h3.pdf.header	Third Hour
ltx/en_us_dedes/template.titles:h36.html.tab	TRITHEKTI
ltx/en_us_dedes/template.titles:h36.pdf.cover	The Trithekti
ltx/en_us_dedes/template.titles:h36.pdf.header	The Trithekti
ltx/en_us_dedes/template.titles:h6.html.tab	SIXTH HOUR
ltx/en_us_dedes/template.titles:h6.pdf.cover	The Sixth Hour
ltx/en_us_dedes/template.titles:h6.pdf.header	Sixth Hour
ltx/en_us_dedes/template.titles:h61.html.tab	TYPIKA SERVICE (no priest)
ltx/en_us_dedes/template.titles:h61.pdf.cover	Typika Service (no priest)
ltx/en_us_dedes/template.titles:h61.pdf.header	Typika Service (no priest)
ltx/en_us_dedes/template.titles:h9.html.tab	NINTH HOUR
ltx/en_us_dedes/template.titles:h9.pdf.cover	The Ninth Hour
ltx/en_us_dedes/template.titles:h9.pdf.header	Ninth Hour
ltx/en_us_dedes/template.titles:h91.html.tab	DAILY READINGS
ltx/en_us_dedes/template.titles:h91.pdf.cover	Daily Readings
ltx/en_us_dedes/template.titles:h91.pdf.header	Daily Readings
ltx/en_us_dedes/template.titles:h92.html.tab	SPECIAL CEREMONY
ltx/en_us_dedes/template.titles:h92.pdf.cover	Special Ceremony
ltx/en_us_dedes/template.titles:h92.pdf.header	Special Ceremony
ltx/en_us_dedes/template.titles:he	HEIRMOLOGION
ltx/en_us_dedes/template.titles:hi	PRIESTS HANDBOOK
ltx/en_us_dedes/template.titles:ho	HOROLOGION
ltx/en_us_dedes/template.titles:hw.beforeresurrection	Service before the Resurrection
ltx/en_us_dedes/template.titles:hw.bridegroomservice	Bridegroom Service
ltx/en_us_dedes/template.titles:hw.lamentation	Graveside Lamentation
ltx/en_us_dedes/template.titles:hw.mergedscores.title	Holy Week and Pascha Music<br>Merged Scores
ltx/en_us_dedes/template.titles:hw.ofholyfriday	of Holy Friday
ltx/en_us_dedes/template.titles:hw.ofholymonday	of Holy Monday
ltx/en_us_dedes/template.titles:hw.ofholysaturday	of Holy Saturday
ltx/en_us_dedes/template.titles:hw.ofholythursday	of Holy Thursday
ltx/en_us_dedes/template.titles:hw.ofholytuesday	of Holy Tuesday
ltx/en_us_dedes/template.titles:hw.ofholywednesday	of Holy Wednesday
ltx/en_us_dedes/template.titles:hw.palmsunday	Palm Sunday
ltx/en_us_dedes/template.titles:hw.passion	The Twelve Passion Gospels
ltx/en_us_dedes/template.titles:hw.pdf.cover	Holy Week
ltx/en_us_dedes/template.titles:hw.removal	Removal from the Cross
ltx/en_us_dedes/template.titles:ka	KATAVASIAS
ltx/en_us_dedes/template.titles:le	LECTIONARY
ltx/en_us_dedes/template.titles:li.html.tab	LITURGY OF ST. JOHN CHRYSOSTOM
ltx/en_us_dedes/template.titles:li.pdf.cover	The Divine Liturgy of St. John Chrysostom
ltx/en_us_dedes/template.titles:li.pdf.header	Divine Liturgy of St. John Chrysostom
ltx/en_us_dedes/template.titles:li1.html.tab	LITURGY OF ST. BASIL
ltx/en_us_dedes/template.titles:li1.pdf.cover	The Divine Liturgy of St. Basil the Great
ltx/en_us_dedes/template.titles:li1.pdf.header	Divine Liturgy of St. Basil
ltx/en_us_dedes/template.titles:li2.html.tab	LITURGY - VARIABLES / ANTIPHONS
ltx/en_us_dedes/template.titles:li2.pdf.cover	The Divine Liturgy - Variables / Antiphons
ltx/en_us_dedes/template.titles:li2.pdf.header	Divine Liturgy - Variables / Antiphons
ltx/en_us_dedes/template.titles:li3.html.tab	LITURGY - VARIABLES / TYPIKA
ltx/en_us_dedes/template.titles:li3.pdf.cover	The Divine Liturgy - Variables / Typika
ltx/en_us_dedes/template.titles:li3.pdf.header	Divine Liturgy - Variables / Typika
ltx/en_us_dedes/template.titles:li4.html.tab	LITURGY OF ST. JOHN CHRYSOSTOM
ltx/en_us_dedes/template.titles:li4.pdf.cover	The Divine Liturgy of St. John Chrysostom
ltx/en_us_dedes/template.titles:li4.pdf.header	Divine Liturgy of St. John Chrysostom
ltx/en_us_dedes/template.titles:li5.html.tab	LITURGY - VARIABLES
ltx/en_us_dedes/template.titles:li5.pdf.cover	The Divine Liturgy - Variables
ltx/en_us_dedes/template.titles:li5.pdf.header	Divine Liturgy - Variables
ltx/en_us_dedes/template.titles:li6.html.tab	LITURGY OF ST. JOHN CHRYSOSTOM
ltx/en_us_dedes/template.titles:li6.pdf.cover	The Divine Liturgy of St. John Chrysostom
ltx/en_us_dedes/template.titles:li6.pdf.header	Divine Liturgy of St. John Chrysostom
ltx/en_us_dedes/template.titles:li7.html.tab	LITURGY - VARIABLES
ltx/en_us_dedes/template.titles:li7.pdf.cover	The Divine Liturgy - Variables
ltx/en_us_dedes/template.titles:li7.pdf.header	Divine Liturgy - Variables
ltx/en_us_dedes/template.titles:li8.html.tab	LITURGY OF ST. JAMES
ltx/en_us_dedes/template.titles:li8.pdf.cover	The Divine Liturgy of St. James
ltx/en_us_dedes/template.titles:li8.pdf.header	Divine Liturgy of St. James
ltx/en_us_dedes/template.titles:li9.html.tab	HIERARCHICAL LITURGY
ltx/en_us_dedes/template.titles:li9.pdf.cover	Hierarchical Divine Liturgy
ltx/en_us_dedes/template.titles:li9.pdf.header	Hierarchical Liturgy
ltx/en_us_dedes/template.titles:m.mode	MODE
ltx/en_us_dedes/template.titles:m.month	MONTH
ltx/en_us_dedes/template.titles:ma.html.tab	MATINS
ltx/en_us_dedes/template.titles:ma.pdf.cover	The Service of Matins
ltx/en_us_dedes/template.titles:ma.pdf.header	Matins
ltx/en_us_dedes/template.titles:ma2.html.tab	MATINS
ltx/en_us_dedes/template.titles:ma2.pdf.cover	The Service of Matins
ltx/en_us_dedes/template.titles:ma2.pdf.header	Matins
ltx/en_us_dedes/template.titles:ma3.html.tab	MATINS
ltx/en_us_dedes/template.titles:ma3.pdf.cover	The Service of Matins
ltx/en_us_dedes/template.titles:ma3.pdf.header	Matins
ltx/en_us_dedes/template.titles:ma4.html.tab	MATINS
ltx/en_us_dedes/template.titles:ma4.pdf.cover	The Service of Matins
ltx/en_us_dedes/template.titles:ma4.pdf.header	Matins
ltx/en_us_dedes/template.titles:ma5.html.tab	MATINS
ltx/en_us_dedes/template.titles:ma5.pdf.cover	The Service of Matins
ltx/en_us_dedes/template.titles:ma5.pdf.header	Matins
ltx/en_us_dedes/template.titles:me	MENAION
ltx/en_us_dedes/template.titles:me.SundayAfterFeast	Sunday after the Feast
ltx/en_us_dedes/template.titles:me.m01.d06.onEpiphanyEve	on the Eve of Epiphany
ltx/en_us_dedes/template.titles:me.m12.d25.onChristmasEve	on Christmas Eve
ltx/en_us_dedes/template.titles:mem.html.tab	MEMORIAL
ltx/en_us_dedes/template.titles:mem.pdf.cover	
ltx/en_us_dedes/template.titles:mem.pdf.header	
ltx/en_us_dedes/template.titles:mo.html.tab	MIDNIGHT OFFICE
ltx/en_us_dedes/template.titles:mo.pdf.cover	The Midnight Office
ltx/en_us_dedes/template.titles:mo.pdf.header	Midnight Office
ltx/en_us_dedes/template.titles:mo1.html.tab	DAILY TYPIKON
ltx/en_us_dedes/template.titles:mo1.pdf.cover	Daily Typikon
ltx/en_us_dedes/template.titles:mo1.pdf.header	Daily Typikon
ltx/en_us_dedes/template.titles:mo6.html.tab	MIDNIGHT OFFICE OF PASCHA
ltx/en_us_dedes/template.titles:mo6.pdf.cover	The Midnight Office of Pascha
ltx/en_us_dedes/template.titles:mo6.pdf.header	Midnight Office of Pascha
ltx/en_us_dedes/template.titles:oc	OCTOECHOS
ltx/en_us_dedes/template.titles:oc.html.tab	OCTOECHOS
ltx/en_us_dedes/template.titles:oc.pdf.cover	Octoechos
ltx/en_us_dedes/template.titles:oc.pdf.header	Octoechos
ltx/en_us_dedes/template.titles:ord.html.tab	ORDINATION
ltx/en_us_dedes/template.titles:ord.pdf.cover	
ltx/en_us_dedes/template.titles:ord.pdf.header	
ltx/en_us_dedes/template.titles:pa.agape	The Agape Vespers Service
ltx/en_us_dedes/template.titles:pa.brightweek	Bright / Renewal Week
ltx/en_us_dedes/template.titles:pa.easter	Easter Sunday
ltx/en_us_dedes/template.titles:pa.ofbrightweek	of Bright / Renewal Week
ltx/en_us_dedes/template.titles:pa.ofpascha	of Pascha
ltx/en_us_dedes/template.titles:pa.pascha	Holy Pascha
ltx/en_us_dedes/template.titles:pa.resurrection	The Resurrection
ltx/en_us_dedes/template.titles:pe	PENTECOSTARION
ltx/en_us_dedes/template.titles:pen.html.tab	PENANCE
ltx/en_us_dedes/template.titles:pen.pdf.cover	
ltx/en_us_dedes/template.titles:pen.pdf.header	
ltx/en_us_dedes/template.titles:pl.html.tab	PRESANCTIFIED
ltx/en_us_dedes/template.titles:pl.pdf.cover	Presanctified Liturgy
ltx/en_us_dedes/template.titles:pl.pdf.header	Presanctified Liturgy
ltx/en_us_dedes/template.titles:ps	PSALTER
ltx/en_us_dedes/template.titles:sal.theotokos	Salutations to the Theotokos
ltx/en_us_dedes/template.titles:sat	SATURDAY
ltx/en_us_dedes/template.titles:service	Service
ltx/en_us_dedes/template.titles:sp.html.tab	PARAKLESIS
ltx/en_us_dedes/template.titles:sp.pdf.cover	Service of the Small Paraklesis
ltx/en_us_dedes/template.titles:sp.pdf.header	Small Paraklesis
ltx/en_us_dedes/template.titles:sun	SUNDAY
ltx/en_us_dedes/template.titles:sv.html.tab	SMALL VESPERS
ltx/en_us_dedes/template.titles:sv.pdf.cover	The Service of Small Vespers
ltx/en_us_dedes/template.titles:sv.pdf.header	Small Vespers
ltx/en_us_dedes/template.titles:sv3.html.tab	SMALL VESPERS AND PRESANCTIFIED
ltx/en_us_dedes/template.titles:sv3.pdf.cover	The Service of Small Vespers and Presanctified Liturgy
ltx/en_us_dedes/template.titles:sv3.pdf.header	Small Vespers and Presanctified Liturgy
ltx/en_us_dedes/template.titles:swb.html.tab	SMALL BLESSING OF WATER
ltx/en_us_dedes/template.titles:swb.pdf.cover	
ltx/en_us_dedes/template.titles:swb.pdf.header	
ltx/en_us_dedes/template.titles:sy	SYNAXARION
ltx/en_us_dedes/template.titles:tr	TRIODION
ltx/en_us_dedes/template.titles:unc.html.tab	HOLY UNCTION
ltx/en_us_dedes/template.titles:unc.pdf.cover	The Service of Holy Unction
ltx/en_us_dedes/template.titles:unc.pdf.header	The Service of Holy Unction
ltx/en_us_dedes/template.titles:ve.html.tab	VESPERS
ltx/en_us_dedes/template.titles:ve.pdf.cover	The Service of Vespers
ltx/en_us_dedes/template.titles:ve.pdf.header	Vespers
ltx/en_us_dedes/template.titles:ve2.html.tab	VESPERS
ltx/en_us_dedes/template.titles:ve2.pdf.cover	The Service of Vespers
ltx/en_us_dedes/template.titles:ve2.pdf.header	Vespers
ltx/en_us_dedes/template.titles:ve3.html.tab	GREAT VESPERS AND SALUTATIONS
ltx/en_us_dedes/template.titles:ve3.pdf.cover	The Service of Great Vespers and Salutations
ltx/en_us_dedes/template.titles:ve3.pdf.header	Great Vespers and Salutations
ltx/en_us_dedes/template.titles:ve4.html.tab	VESPERS
ltx/en_us_dedes/template.titles:ve4.pdf.cover	The Service of Vespers
ltx/en_us_dedes/template.titles:ve4.pdf.header	Vespers
ltx/en_us_dedes/template.titles:ve5.html.tab	VESPERS
ltx/en_us_dedes/template.titles:ve5.pdf.cover	The Service of Vespers
ltx/en_us_dedes/template.titles:ve5.pdf.header	Vespers
ltx/en_us_dedes/template.titles:vl.html.tab	VESPERAL LITURGY OF ST. BASIL
ltx/en_us_dedes/template.titles:vl.pdf.cover	Vesperal Liturgy
ltx/en_us_dedes/template.titles:vl.pdf.cover2	of St. Basil the Great
ltx/en_us_dedes/template.titles:vl.pdf.header	Vesperal Liturgy of St. Basil
ltx/en_us_dedes/template.titles:vl2.html.tab	VESPERAL LITURGY OF ST. JOHN CHRYSOSTOM
ltx/en_us_dedes/template.titles:vl2.pdf.cover	Vesperal Liturgy
ltx/en_us_dedes/template.titles:vl2.pdf.cover2	of St. John Chrysostom
ltx/en_us_dedes/template.titles:vl2.pdf.header	Vesperal Liturgy of St. John Chrysostom
ltx/en_us_dedes/template.titles:wed.html.tab	WEDDING
ltx/en_us_dedes/template.titles:wed.pdf.cover	
ltx/en_us_dedes/template.titles:wed.pdf.header	
ltx/en_us_dedes/template.titles:wkd	WEEKDAY
