ltx/en_us_dedes/sy.m04.d04:cl.syMA.commemoration01.text	[saint/com 1]
ltx/en_us_dedes/sy.m04.d04:cl.syMA.commemoration02.text	[saint/com 2]
ltx/en_us_dedes/sy.m04.d04:cl.syMA.commemoration03.text	[saint/com 3]
ltx/en_us_dedes/sy.m04.d04:cl.syMA.commemoration04.text	[saint/com 4]
ltx/en_us_dedes/sy.m04.d04:cl.syMA.commemoration05.text	[saint/com 5]
ltx/en_us_dedes/sy.m04.d04:cl.syMA.commemoration06.text	[saint/com list]
ltx/en_us_dedes/sy.m04.d04:syMA.commemoration01.couplet1.title	@ltx/en_us_dedes/titles:ti.Verses
ltx/en_us_dedes/sy.m04.d04:syMA.commemoration01.couplet1.verse1	
ltx/en_us_dedes/sy.m04.d04:syMA.commemoration01.couplet1.verse2	
ltx/en_us_dedes/sy.m04.d04:syMA.commemoration01.single1	
ltx/en_us_dedes/sy.m04.d04:syMA.commemoration01.text	On April 4 we commemorate our devout father George of Maleon.
ltx/en_us_dedes/sy.m04.d04:syMA.commemoration02.couplet1.title	@ltx/en_us_dedes/titles:ti.Verses
ltx/en_us_dedes/sy.m04.d04:syMA.commemoration02.couplet1.verse1	
ltx/en_us_dedes/sy.m04.d04:syMA.commemoration02.couplet1.verse2	
ltx/en_us_dedes/sy.m04.d04:syMA.commemoration02.narration.p01	
ltx/en_us_dedes/sy.m04.d04:syMA.commemoration02.text	On this day we also commemorate the holy martyrs Theodoulos and Agathopus.
ltx/en_us_dedes/sy.m04.d04:syMA.commemoration03.couplet1.title	@ltx/en_us_dedes/titles:ti.Verses
ltx/en_us_dedes/sy.m04.d04:syMA.commemoration03.couplet1.verse1	
ltx/en_us_dedes/sy.m04.d04:syMA.commemoration03.couplet1.verse2	
ltx/en_us_dedes/sy.m04.d04:syMA.commemoration03.couplet2.title	For her Sister and her Maid
ltx/en_us_dedes/sy.m04.d04:syMA.commemoration03.couplet2.verse1	
ltx/en_us_dedes/sy.m04.d04:syMA.commemoration03.couplet2.verse2	
ltx/en_us_dedes/sy.m04.d04:syMA.commemoration03.narration.p01	
ltx/en_us_dedes/sy.m04.d04:syMA.commemoration03.text	On this day we also commemorate the holy martyr Ferbutha, her maid, and her company.
ltx/en_us_dedes/sy.m04.d04:syMA.commemoration04.couplet1.title	@ltx/en_us_dedes/titles:ti.Verses
ltx/en_us_dedes/sy.m04.d04:syMA.commemoration04.couplet1.verse1	
ltx/en_us_dedes/sy.m04.d04:syMA.commemoration04.couplet1.verse2	
ltx/en_us_dedes/sy.m04.d04:syMA.commemoration04.text	On this day we also commemorate our devout father Publius.
ltx/en_us_dedes/sy.m04.d04:syMA.commemoration05.couplet1.title	@ltx/en_us_dedes/titles:ti.Verses
ltx/en_us_dedes/sy.m04.d04:syMA.commemoration05.couplet1.verse1	
ltx/en_us_dedes/sy.m04.d04:syMA.commemoration05.couplet1.verse2	
ltx/en_us_dedes/sy.m04.d04:syMA.commemoration05.text	On this day we also commemorate our devout father Plato, Abbot of the Monastery of Studium.
ltx/en_us_dedes/sy.m04.d04:syMA.commemoration06.couplet1.title	@ltx/en_us_dedes/titles:ti.Verses
ltx/en_us_dedes/sy.m04.d04:syMA.commemoration06.couplet1.verse1	
ltx/en_us_dedes/sy.m04.d04:syMA.commemoration06.couplet1.verse2	
ltx/en_us_dedes/sy.m04.d04:syMA.commemoration06.text	On this day we also commemorate the three devout saints, Theonas, Symeon, and Ferbinus, who reposed in peace.
ltx/en_us_dedes/sy.m04.d04:syMA.commemoration07.couplet1.title	@ltx/en_us_dedes/titles:ti.Verses
ltx/en_us_dedes/sy.m04.d04:syMA.commemoration07.couplet1.verse1	
ltx/en_us_dedes/sy.m04.d04:syMA.commemoration07.couplet1.verse2	
ltx/en_us_dedes/sy.m04.d04:syMA.commemoration07.text	On this day we also commemorate our devout father Zosimas who buried devout St. Mary of Egypt.
ltx/en_us_dedes/sy.m04.d04:syMA.commemoration08.couplet1.title	@ltx/en_us_dedes/titles:ti.Verses
ltx/en_us_dedes/sy.m04.d04:syMA.commemoration08.couplet1.verse1	
ltx/en_us_dedes/sy.m04.d04:syMA.commemoration08.couplet1.verse2	
ltx/en_us_dedes/sy.m04.d04:syMA.commemoration08.single1	
ltx/en_us_dedes/sy.m04.d04:syMA.commemoration08.text	On this day the devout Theonas, who was an ascetic in the Monastery of the Pantokrator and later became the Bishop of Thessaloniki, reposed in peace.
ltx/en_us_dedes/sy.m04.d04:syMA.lastline	By the intercessions of Your Saints, O God, have mercy on us. Amen.
