ltx/en_us_dedes/tr.d063:trCO.C1.poet	@ltx/en_us_dedes/poets:po.AndreouKritis
ltx/en_us_dedes/tr.d063:trCO.C1.title	Canon for Lazarus
ltx/en_us_dedes/tr.d063:trCO.C1.verse	@ltx/en_us_dedes/prayers:pr.verse_God.text
ltx/en_us_dedes/tr.d063:trCO.Ode1C11.incipit	…
ltx/en_us_dedes/tr.d063:trCO.Ode1C11.melody	@ltx/en_us_dedes/he.h.m1:heHE.OdinEpinikion.name
ltx/en_us_dedes/tr.d063:trCO.Ode1C11.mode	@ltx/en_us_dedes/miscellanea:misc.Mode1
ltx/en_us_dedes/tr.d063:trCO.Ode1C11.ode	@ltx/en_us_dedes/miscellanea:misc.Ode1
ltx/en_us_dedes/tr.d063:trCO.Ode1C11.text	
ltx/en_us_dedes/tr.d063:trCO.Ode1C12.incipit	…
ltx/en_us_dedes/tr.d063:trCO.Ode1C12.melody	@ltx/en_us_dedes/he.h.m1:heHE.OdinEpinikion.name
ltx/en_us_dedes/tr.d063:trCO.Ode1C12.mode	@ltx/en_us_dedes/miscellanea:misc.Mode1
ltx/en_us_dedes/tr.d063:trCO.Ode1C12.ode	@ltx/en_us_dedes/miscellanea:misc.Ode1
ltx/en_us_dedes/tr.d063:trCO.Ode1C12.text	
ltx/en_us_dedes/tr.d063:trCO.Ode1C13.incipit	…
ltx/en_us_dedes/tr.d063:trCO.Ode1C13.melody	@ltx/en_us_dedes/he.h.m1:heHE.OdinEpinikion.name
ltx/en_us_dedes/tr.d063:trCO.Ode1C13.mode	@ltx/en_us_dedes/miscellanea:misc.Mode1
ltx/en_us_dedes/tr.d063:trCO.Ode1C13.ode	@ltx/en_us_dedes/miscellanea:misc.Ode1
ltx/en_us_dedes/tr.d063:trCO.Ode1C13.text	
ltx/en_us_dedes/tr.d063:trCO.Ode1C14.incipit	…
ltx/en_us_dedes/tr.d063:trCO.Ode1C14.melody	@ltx/en_us_dedes/he.h.m1:heHE.OdinEpinikion.name
ltx/en_us_dedes/tr.d063:trCO.Ode1C14.mode	@ltx/en_us_dedes/miscellanea:misc.Mode1
ltx/en_us_dedes/tr.d063:trCO.Ode1C14.ode	@ltx/en_us_dedes/miscellanea:misc.Ode1
ltx/en_us_dedes/tr.d063:trCO.Ode1C14.text	
ltx/en_us_dedes/tr.d063:trCO.Ode1C15.incipit	…
ltx/en_us_dedes/tr.d063:trCO.Ode1C15.melody	@ltx/en_us_dedes/he.h.m1:heHE.OdinEpinikion.name
ltx/en_us_dedes/tr.d063:trCO.Ode1C15.mode	@ltx/en_us_dedes/miscellanea:misc.Mode1
ltx/en_us_dedes/tr.d063:trCO.Ode1C15.ode	@ltx/en_us_dedes/miscellanea:misc.Ode1
ltx/en_us_dedes/tr.d063:trCO.Ode1C15.text	
ltx/en_us_dedes/tr.d063:trCO.Ode1C16.incipit	…
ltx/en_us_dedes/tr.d063:trCO.Ode1C16.melody	@ltx/en_us_dedes/he.h.m1:heHE.OdinEpinikion.name
ltx/en_us_dedes/tr.d063:trCO.Ode1C16.mode	@ltx/en_us_dedes/miscellanea:misc.Mode1
ltx/en_us_dedes/tr.d063:trCO.Ode1C16.ode	@ltx/en_us_dedes/miscellanea:misc.Ode1
ltx/en_us_dedes/tr.d063:trCO.Ode1C16.text	
ltx/en_us_dedes/tr.d063:trCO.Ode1C17.incipit	…
ltx/en_us_dedes/tr.d063:trCO.Ode1C17.melody	@ltx/en_us_dedes/he.h.m1:heHE.OdinEpinikion.name
ltx/en_us_dedes/tr.d063:trCO.Ode1C17.mode	@ltx/en_us_dedes/miscellanea:misc.Mode1
ltx/en_us_dedes/tr.d063:trCO.Ode1C17.ode	@ltx/en_us_dedes/miscellanea:misc.Ode1
ltx/en_us_dedes/tr.d063:trCO.Ode1C17.text	
ltx/en_us_dedes/tr.d063:trCO.Ode1C1H.incipit	@ltx/en_us_dedes/he.h.m1:heHE.OdinEpinikion.incipit
ltx/en_us_dedes/tr.d063:trCO.Ode1C1H.melody	@ltx/en_us_dedes/he.h.m1:heHE.OdinEpinikion.melody
ltx/en_us_dedes/tr.d063:trCO.Ode1C1H.mode	@ltx/en_us_dedes/miscellanea:misc.Mode1
ltx/en_us_dedes/tr.d063:trCO.Ode1C1H.ode	@ltx/en_us_dedes/miscellanea:misc.Ode1
ltx/en_us_dedes/tr.d063:trCO.Ode1C1H.text	@ltx/en_us_dedes/he.h.m1:heHE.OdinEpinikion.text
ltx/en_us_dedes/tr.d063:trCO.Ode1C1T.incipit	…
ltx/en_us_dedes/tr.d063:trCO.Ode1C1T.melody	@ltx/en_us_dedes/he.h.m1:heHE.OdinEpinikion.name
ltx/en_us_dedes/tr.d063:trCO.Ode1C1T.mode	@ltx/en_us_dedes/miscellanea:misc.Mode1
ltx/en_us_dedes/tr.d063:trCO.Ode1C1T.ode	@ltx/en_us_dedes/miscellanea:misc.Ode1
ltx/en_us_dedes/tr.d063:trCO.Ode1C1T.text	
ltx/en_us_dedes/tr.d063:trCO.Ode1C1Tr.incipit	…
ltx/en_us_dedes/tr.d063:trCO.Ode1C1Tr.melody	@ltx/en_us_dedes/he.h.m1:heHE.OdinEpinikion.name
ltx/en_us_dedes/tr.d063:trCO.Ode1C1Tr.mode	@ltx/en_us_dedes/miscellanea:misc.Mode1
ltx/en_us_dedes/tr.d063:trCO.Ode1C1Tr.ode	@ltx/en_us_dedes/miscellanea:misc.Ode1
ltx/en_us_dedes/tr.d063:trCO.Ode1C1Tr.text	
ltx/en_us_dedes/tr.d063:trCO.Ode2C11.incipit	…
ltx/en_us_dedes/tr.d063:trCO.Ode2C11.melody	@ltx/en_us_dedes/he.h.m1:heHE.ProsecheOuraneKaiLaliso.name
ltx/en_us_dedes/tr.d063:trCO.Ode2C11.mode	@ltx/en_us_dedes/miscellanea:misc.Mode1
ltx/en_us_dedes/tr.d063:trCO.Ode2C11.ode	@ltx/en_us_dedes/miscellanea:misc.Ode2
ltx/en_us_dedes/tr.d063:trCO.Ode2C11.text	
ltx/en_us_dedes/tr.d063:trCO.Ode2C12.incipit	…
ltx/en_us_dedes/tr.d063:trCO.Ode2C12.melody	@ltx/en_us_dedes/he.h.m1:heHE.ProsecheOuraneKaiLaliso.name
ltx/en_us_dedes/tr.d063:trCO.Ode2C12.mode	@ltx/en_us_dedes/miscellanea:misc.Mode1
ltx/en_us_dedes/tr.d063:trCO.Ode2C12.ode	@ltx/en_us_dedes/miscellanea:misc.Ode2
ltx/en_us_dedes/tr.d063:trCO.Ode2C12.text	
ltx/en_us_dedes/tr.d063:trCO.Ode2C13.incipit	…
ltx/en_us_dedes/tr.d063:trCO.Ode2C13.melody	@ltx/en_us_dedes/he.h.m1:heHE.ProsecheOuraneKaiLaliso.name
ltx/en_us_dedes/tr.d063:trCO.Ode2C13.mode	@ltx/en_us_dedes/miscellanea:misc.Mode1
ltx/en_us_dedes/tr.d063:trCO.Ode2C13.ode	@ltx/en_us_dedes/miscellanea:misc.Ode2
ltx/en_us_dedes/tr.d063:trCO.Ode2C13.text	
ltx/en_us_dedes/tr.d063:trCO.Ode2C14.incipit	…
ltx/en_us_dedes/tr.d063:trCO.Ode2C14.melody	@ltx/en_us_dedes/he.h.m1:heHE.ProsecheOuraneKaiLaliso.name
ltx/en_us_dedes/tr.d063:trCO.Ode2C14.mode	@ltx/en_us_dedes/miscellanea:misc.Mode1
ltx/en_us_dedes/tr.d063:trCO.Ode2C14.ode	@ltx/en_us_dedes/miscellanea:misc.Ode2
ltx/en_us_dedes/tr.d063:trCO.Ode2C14.text	
ltx/en_us_dedes/tr.d063:trCO.Ode2C15.incipit	…
ltx/en_us_dedes/tr.d063:trCO.Ode2C15.melody	@ltx/en_us_dedes/he.h.m1:heHE.ProsecheOuraneKaiLaliso.name
ltx/en_us_dedes/tr.d063:trCO.Ode2C15.mode	@ltx/en_us_dedes/miscellanea:misc.Mode1
ltx/en_us_dedes/tr.d063:trCO.Ode2C15.ode	@ltx/en_us_dedes/miscellanea:misc.Ode2
ltx/en_us_dedes/tr.d063:trCO.Ode2C15.text	
ltx/en_us_dedes/tr.d063:trCO.Ode2C1H.incipit	@ltx/en_us_dedes/he.h.m1:heHE.ProsecheOuraneKaiLaliso.incipit
ltx/en_us_dedes/tr.d063:trCO.Ode2C1H.melody	@ltx/en_us_dedes/he.h.m1:heHE.ProsecheOuraneKaiLaliso.melody
ltx/en_us_dedes/tr.d063:trCO.Ode2C1H.mode	@ltx/en_us_dedes/miscellanea:misc.Mode1
ltx/en_us_dedes/tr.d063:trCO.Ode2C1H.ode	@ltx/en_us_dedes/miscellanea:misc.Ode2
ltx/en_us_dedes/tr.d063:trCO.Ode2C1H.text	@ltx/en_us_dedes/he.h.m1:heHE.ProsecheOuraneKaiLaliso.text
ltx/en_us_dedes/tr.d063:trCO.Ode2C1T.incipit	…
ltx/en_us_dedes/tr.d063:trCO.Ode2C1T.melody	@ltx/en_us_dedes/he.h.m1:heHE.ProsecheOuraneKaiLaliso.name
ltx/en_us_dedes/tr.d063:trCO.Ode2C1T.mode	@ltx/en_us_dedes/miscellanea:misc.Mode1
ltx/en_us_dedes/tr.d063:trCO.Ode2C1T.ode	@ltx/en_us_dedes/miscellanea:misc.Ode2
ltx/en_us_dedes/tr.d063:trCO.Ode2C1T.text	
ltx/en_us_dedes/tr.d063:trCO.Ode2C1Tr.incipit	…
ltx/en_us_dedes/tr.d063:trCO.Ode2C1Tr.melody	@ltx/en_us_dedes/he.h.m1:heHE.ProsecheOuraneKaiLaliso.name
ltx/en_us_dedes/tr.d063:trCO.Ode2C1Tr.mode	@ltx/en_us_dedes/miscellanea:misc.Mode1
ltx/en_us_dedes/tr.d063:trCO.Ode2C1Tr.ode	@ltx/en_us_dedes/miscellanea:misc.Ode2
ltx/en_us_dedes/tr.d063:trCO.Ode2C1Tr.text	
ltx/en_us_dedes/tr.d063:trCO.Ode3C11.incipit	…
ltx/en_us_dedes/tr.d063:trCO.Ode3C11.melody	@ltx/en_us_dedes/he.h.m1:heHE.LithonOnApedokimasan.name
ltx/en_us_dedes/tr.d063:trCO.Ode3C11.mode	@ltx/en_us_dedes/miscellanea:misc.Mode1
ltx/en_us_dedes/tr.d063:trCO.Ode3C11.ode	@ltx/en_us_dedes/miscellanea:misc.Ode3
ltx/en_us_dedes/tr.d063:trCO.Ode3C11.text	
ltx/en_us_dedes/tr.d063:trCO.Ode3C12.incipit	…
ltx/en_us_dedes/tr.d063:trCO.Ode3C12.melody	@ltx/en_us_dedes/he.h.m1:heHE.LithonOnApedokimasan.name
ltx/en_us_dedes/tr.d063:trCO.Ode3C12.mode	@ltx/en_us_dedes/miscellanea:misc.Mode1
ltx/en_us_dedes/tr.d063:trCO.Ode3C12.ode	@ltx/en_us_dedes/miscellanea:misc.Ode3
ltx/en_us_dedes/tr.d063:trCO.Ode3C12.text	
ltx/en_us_dedes/tr.d063:trCO.Ode3C13.incipit	…
ltx/en_us_dedes/tr.d063:trCO.Ode3C13.melody	@ltx/en_us_dedes/he.h.m1:heHE.LithonOnApedokimasan.name
ltx/en_us_dedes/tr.d063:trCO.Ode3C13.mode	@ltx/en_us_dedes/miscellanea:misc.Mode1
ltx/en_us_dedes/tr.d063:trCO.Ode3C13.ode	@ltx/en_us_dedes/miscellanea:misc.Ode3
ltx/en_us_dedes/tr.d063:trCO.Ode3C13.text	
ltx/en_us_dedes/tr.d063:trCO.Ode3C14.incipit	…
ltx/en_us_dedes/tr.d063:trCO.Ode3C14.melody	@ltx/en_us_dedes/he.h.m1:heHE.LithonOnApedokimasan.name
ltx/en_us_dedes/tr.d063:trCO.Ode3C14.mode	@ltx/en_us_dedes/miscellanea:misc.Mode1
ltx/en_us_dedes/tr.d063:trCO.Ode3C14.ode	@ltx/en_us_dedes/miscellanea:misc.Ode3
ltx/en_us_dedes/tr.d063:trCO.Ode3C14.text	
ltx/en_us_dedes/tr.d063:trCO.Ode3C15.incipit	…
ltx/en_us_dedes/tr.d063:trCO.Ode3C15.melody	@ltx/en_us_dedes/he.h.m1:heHE.LithonOnApedokimasan.name
ltx/en_us_dedes/tr.d063:trCO.Ode3C15.mode	@ltx/en_us_dedes/miscellanea:misc.Mode1
ltx/en_us_dedes/tr.d063:trCO.Ode3C15.ode	@ltx/en_us_dedes/miscellanea:misc.Ode3
ltx/en_us_dedes/tr.d063:trCO.Ode3C15.text	
ltx/en_us_dedes/tr.d063:trCO.Ode3C16.incipit	…
ltx/en_us_dedes/tr.d063:trCO.Ode3C16.melody	@ltx/en_us_dedes/he.h.m1:heHE.LithonOnApedokimasan.name
ltx/en_us_dedes/tr.d063:trCO.Ode3C16.mode	@ltx/en_us_dedes/miscellanea:misc.Mode1
ltx/en_us_dedes/tr.d063:trCO.Ode3C16.ode	@ltx/en_us_dedes/miscellanea:misc.Ode3
ltx/en_us_dedes/tr.d063:trCO.Ode3C16.text	
ltx/en_us_dedes/tr.d063:trCO.Ode3C1H.incipit	@ltx/en_us_dedes/he.h.m1:heHE.LithonOnApedokimasan.incipit
ltx/en_us_dedes/tr.d063:trCO.Ode3C1H.melody	@ltx/en_us_dedes/he.h.m1:heHE.LithonOnApedokimasan.melody
ltx/en_us_dedes/tr.d063:trCO.Ode3C1H.mode	@ltx/en_us_dedes/miscellanea:misc.Mode1
ltx/en_us_dedes/tr.d063:trCO.Ode3C1H.ode	@ltx/en_us_dedes/miscellanea:misc.Ode3
ltx/en_us_dedes/tr.d063:trCO.Ode3C1H.text	@ltx/en_us_dedes/he.h.m1:heHE.LithonOnApedokimasan.text
ltx/en_us_dedes/tr.d063:trCO.Ode3C1T.incipit	…
ltx/en_us_dedes/tr.d063:trCO.Ode3C1T.melody	@ltx/en_us_dedes/he.h.m1:heHE.LithonOnApedokimasan.name
ltx/en_us_dedes/tr.d063:trCO.Ode3C1T.mode	@ltx/en_us_dedes/miscellanea:misc.Mode1
ltx/en_us_dedes/tr.d063:trCO.Ode3C1T.ode	@ltx/en_us_dedes/miscellanea:misc.Ode3
ltx/en_us_dedes/tr.d063:trCO.Ode3C1T.text	
ltx/en_us_dedes/tr.d063:trCO.Ode3C1Tr.incipit	…
ltx/en_us_dedes/tr.d063:trCO.Ode3C1Tr.melody	@ltx/en_us_dedes/he.h.m1:heHE.LithonOnApedokimasan.name
ltx/en_us_dedes/tr.d063:trCO.Ode3C1Tr.mode	@ltx/en_us_dedes/miscellanea:misc.Mode1
ltx/en_us_dedes/tr.d063:trCO.Ode3C1Tr.ode	@ltx/en_us_dedes/miscellanea:misc.Ode3
ltx/en_us_dedes/tr.d063:trCO.Ode3C1Tr.text	
ltx/en_us_dedes/tr.d063:trCO.Ode4C11.incipit	…
ltx/en_us_dedes/tr.d063:trCO.Ode4C11.melody	@ltx/en_us_dedes/he.h.m1:heHE.EpirthiOIlios.name
ltx/en_us_dedes/tr.d063:trCO.Ode4C11.mode	@ltx/en_us_dedes/miscellanea:misc.Mode1
ltx/en_us_dedes/tr.d063:trCO.Ode4C11.ode	@ltx/en_us_dedes/miscellanea:misc.Ode4
ltx/en_us_dedes/tr.d063:trCO.Ode4C11.text	
ltx/en_us_dedes/tr.d063:trCO.Ode4C12.incipit	…
ltx/en_us_dedes/tr.d063:trCO.Ode4C12.melody	@ltx/en_us_dedes/he.h.m1:heHE.EpirthiOIlios.name
ltx/en_us_dedes/tr.d063:trCO.Ode4C12.mode	@ltx/en_us_dedes/miscellanea:misc.Mode1
ltx/en_us_dedes/tr.d063:trCO.Ode4C12.ode	@ltx/en_us_dedes/miscellanea:misc.Ode4
ltx/en_us_dedes/tr.d063:trCO.Ode4C12.text	
ltx/en_us_dedes/tr.d063:trCO.Ode4C13.incipit	…
ltx/en_us_dedes/tr.d063:trCO.Ode4C13.melody	@ltx/en_us_dedes/he.h.m1:heHE.EpirthiOIlios.name
ltx/en_us_dedes/tr.d063:trCO.Ode4C13.mode	@ltx/en_us_dedes/miscellanea:misc.Mode1
ltx/en_us_dedes/tr.d063:trCO.Ode4C13.ode	@ltx/en_us_dedes/miscellanea:misc.Ode4
ltx/en_us_dedes/tr.d063:trCO.Ode4C13.text	
ltx/en_us_dedes/tr.d063:trCO.Ode4C14.incipit	…
ltx/en_us_dedes/tr.d063:trCO.Ode4C14.melody	@ltx/en_us_dedes/he.h.m1:heHE.EpirthiOIlios.name
ltx/en_us_dedes/tr.d063:trCO.Ode4C14.mode	@ltx/en_us_dedes/miscellanea:misc.Mode1
ltx/en_us_dedes/tr.d063:trCO.Ode4C14.ode	@ltx/en_us_dedes/miscellanea:misc.Ode4
ltx/en_us_dedes/tr.d063:trCO.Ode4C14.text	
ltx/en_us_dedes/tr.d063:trCO.Ode4C15.incipit	…
ltx/en_us_dedes/tr.d063:trCO.Ode4C15.melody	@ltx/en_us_dedes/he.h.m1:heHE.EpirthiOIlios.name
ltx/en_us_dedes/tr.d063:trCO.Ode4C15.mode	@ltx/en_us_dedes/miscellanea:misc.Mode1
ltx/en_us_dedes/tr.d063:trCO.Ode4C15.ode	@ltx/en_us_dedes/miscellanea:misc.Ode4
ltx/en_us_dedes/tr.d063:trCO.Ode4C15.text	
ltx/en_us_dedes/tr.d063:trCO.Ode4C16.incipit	…
ltx/en_us_dedes/tr.d063:trCO.Ode4C16.melody	@ltx/en_us_dedes/he.h.m1:heHE.EpirthiOIlios.name
ltx/en_us_dedes/tr.d063:trCO.Ode4C16.mode	@ltx/en_us_dedes/miscellanea:misc.Mode1
ltx/en_us_dedes/tr.d063:trCO.Ode4C16.ode	@ltx/en_us_dedes/miscellanea:misc.Ode4
ltx/en_us_dedes/tr.d063:trCO.Ode4C16.text	
ltx/en_us_dedes/tr.d063:trCO.Ode4C17.incipit	…
ltx/en_us_dedes/tr.d063:trCO.Ode4C17.melody	@ltx/en_us_dedes/he.h.m1:heHE.EpirthiOIlios.name
ltx/en_us_dedes/tr.d063:trCO.Ode4C17.mode	@ltx/en_us_dedes/miscellanea:misc.Mode1
ltx/en_us_dedes/tr.d063:trCO.Ode4C17.ode	@ltx/en_us_dedes/miscellanea:misc.Ode4
ltx/en_us_dedes/tr.d063:trCO.Ode4C17.text	
ltx/en_us_dedes/tr.d063:trCO.Ode4C18.incipit	…
ltx/en_us_dedes/tr.d063:trCO.Ode4C18.melody	@ltx/en_us_dedes/he.h.m1:heHE.EpirthiOIlios.name
ltx/en_us_dedes/tr.d063:trCO.Ode4C18.mode	@ltx/en_us_dedes/miscellanea:misc.Mode1
ltx/en_us_dedes/tr.d063:trCO.Ode4C18.ode	@ltx/en_us_dedes/miscellanea:misc.Ode4
ltx/en_us_dedes/tr.d063:trCO.Ode4C18.text	
ltx/en_us_dedes/tr.d063:trCO.Ode4C19.incipit	…
ltx/en_us_dedes/tr.d063:trCO.Ode4C19.melody	@ltx/en_us_dedes/he.h.m1:heHE.EpirthiOIlios.name
ltx/en_us_dedes/tr.d063:trCO.Ode4C19.mode	@ltx/en_us_dedes/miscellanea:misc.Mode1
ltx/en_us_dedes/tr.d063:trCO.Ode4C19.ode	@ltx/en_us_dedes/miscellanea:misc.Ode4
ltx/en_us_dedes/tr.d063:trCO.Ode4C19.text	
ltx/en_us_dedes/tr.d063:trCO.Ode4C1H.incipit	@ltx/en_us_dedes/he.h.m1:heHE.EpirthiOIlios.incipit
ltx/en_us_dedes/tr.d063:trCO.Ode4C1H.melody	@ltx/en_us_dedes/he.h.m1:heHE.EpirthiOIlios.melody
ltx/en_us_dedes/tr.d063:trCO.Ode4C1H.mode	@ltx/en_us_dedes/miscellanea:misc.Mode1
ltx/en_us_dedes/tr.d063:trCO.Ode4C1H.ode	@ltx/en_us_dedes/miscellanea:misc.Ode4
ltx/en_us_dedes/tr.d063:trCO.Ode4C1H.text	@ltx/en_us_dedes/he.h.m1:heHE.EpirthiOIlios.text
ltx/en_us_dedes/tr.d063:trCO.Ode4C1T.incipit	…
ltx/en_us_dedes/tr.d063:trCO.Ode4C1T.melody	@ltx/en_us_dedes/he.h.m1:heHE.EpirthiOIlios.name
ltx/en_us_dedes/tr.d063:trCO.Ode4C1T.mode	@ltx/en_us_dedes/miscellanea:misc.Mode1
ltx/en_us_dedes/tr.d063:trCO.Ode4C1T.ode	@ltx/en_us_dedes/miscellanea:misc.Ode4
ltx/en_us_dedes/tr.d063:trCO.Ode4C1T.text	
ltx/en_us_dedes/tr.d063:trCO.Ode4C1Tr.incipit	…
ltx/en_us_dedes/tr.d063:trCO.Ode4C1Tr.melody	@ltx/en_us_dedes/he.h.m1:heHE.EpirthiOIlios.name
ltx/en_us_dedes/tr.d063:trCO.Ode4C1Tr.mode	@ltx/en_us_dedes/miscellanea:misc.Mode1
ltx/en_us_dedes/tr.d063:trCO.Ode4C1Tr.ode	@ltx/en_us_dedes/miscellanea:misc.Ode4
ltx/en_us_dedes/tr.d063:trCO.Ode4C1Tr.text	
ltx/en_us_dedes/tr.d063:trCO.Ode5C11.incipit	…
ltx/en_us_dedes/tr.d063:trCO.Ode5C11.melody	@ltx/en_us_dedes/he.h.m1:heHE.TinSinEirinin.name
ltx/en_us_dedes/tr.d063:trCO.Ode5C11.mode	@ltx/en_us_dedes/miscellanea:misc.Mode1
ltx/en_us_dedes/tr.d063:trCO.Ode5C11.ode	@ltx/en_us_dedes/miscellanea:misc.Ode5
ltx/en_us_dedes/tr.d063:trCO.Ode5C11.text	
ltx/en_us_dedes/tr.d063:trCO.Ode5C12.incipit	…
ltx/en_us_dedes/tr.d063:trCO.Ode5C12.melody	@ltx/en_us_dedes/he.h.m1:heHE.TinSinEirinin.name
ltx/en_us_dedes/tr.d063:trCO.Ode5C12.mode	@ltx/en_us_dedes/miscellanea:misc.Mode1
ltx/en_us_dedes/tr.d063:trCO.Ode5C12.ode	@ltx/en_us_dedes/miscellanea:misc.Ode5
ltx/en_us_dedes/tr.d063:trCO.Ode5C12.text	
ltx/en_us_dedes/tr.d063:trCO.Ode5C13.incipit	…
ltx/en_us_dedes/tr.d063:trCO.Ode5C13.melody	@ltx/en_us_dedes/he.h.m1:heHE.TinSinEirinin.name
ltx/en_us_dedes/tr.d063:trCO.Ode5C13.mode	@ltx/en_us_dedes/miscellanea:misc.Mode1
ltx/en_us_dedes/tr.d063:trCO.Ode5C13.ode	@ltx/en_us_dedes/miscellanea:misc.Ode5
ltx/en_us_dedes/tr.d063:trCO.Ode5C13.text	
ltx/en_us_dedes/tr.d063:trCO.Ode5C14.incipit	…
ltx/en_us_dedes/tr.d063:trCO.Ode5C14.melody	@ltx/en_us_dedes/he.h.m1:heHE.TinSinEirinin.name
ltx/en_us_dedes/tr.d063:trCO.Ode5C14.mode	@ltx/en_us_dedes/miscellanea:misc.Mode1
ltx/en_us_dedes/tr.d063:trCO.Ode5C14.ode	@ltx/en_us_dedes/miscellanea:misc.Ode5
ltx/en_us_dedes/tr.d063:trCO.Ode5C14.text	
ltx/en_us_dedes/tr.d063:trCO.Ode5C15.incipit	…
ltx/en_us_dedes/tr.d063:trCO.Ode5C15.melody	@ltx/en_us_dedes/he.h.m1:heHE.TinSinEirinin.name
ltx/en_us_dedes/tr.d063:trCO.Ode5C15.mode	@ltx/en_us_dedes/miscellanea:misc.Mode1
ltx/en_us_dedes/tr.d063:trCO.Ode5C15.ode	@ltx/en_us_dedes/miscellanea:misc.Ode5
ltx/en_us_dedes/tr.d063:trCO.Ode5C15.text	
ltx/en_us_dedes/tr.d063:trCO.Ode5C16.incipit	…
ltx/en_us_dedes/tr.d063:trCO.Ode5C16.melody	@ltx/en_us_dedes/he.h.m1:heHE.TinSinEirinin.name
ltx/en_us_dedes/tr.d063:trCO.Ode5C16.mode	@ltx/en_us_dedes/miscellanea:misc.Mode1
ltx/en_us_dedes/tr.d063:trCO.Ode5C16.ode	@ltx/en_us_dedes/miscellanea:misc.Ode5
ltx/en_us_dedes/tr.d063:trCO.Ode5C16.text	
ltx/en_us_dedes/tr.d063:trCO.Ode5C1H.incipit	@ltx/en_us_dedes/he.h.m1:heHE.TinSinEirinin.incipit
ltx/en_us_dedes/tr.d063:trCO.Ode5C1H.melody	@ltx/en_us_dedes/he.h.m1:heHE.TinSinEirinin.melody
ltx/en_us_dedes/tr.d063:trCO.Ode5C1H.mode	@ltx/en_us_dedes/miscellanea:misc.Mode1
ltx/en_us_dedes/tr.d063:trCO.Ode5C1H.ode	@ltx/en_us_dedes/miscellanea:misc.Ode5
ltx/en_us_dedes/tr.d063:trCO.Ode5C1H.text	@ltx/en_us_dedes/he.h.m1:heHE.TinSinEirinin.text
ltx/en_us_dedes/tr.d063:trCO.Ode5C1T.incipit	…
ltx/en_us_dedes/tr.d063:trCO.Ode5C1T.melody	@ltx/en_us_dedes/he.h.m1:heHE.TinSinEirinin.name
ltx/en_us_dedes/tr.d063:trCO.Ode5C1T.mode	@ltx/en_us_dedes/miscellanea:misc.Mode1
ltx/en_us_dedes/tr.d063:trCO.Ode5C1T.ode	@ltx/en_us_dedes/miscellanea:misc.Ode5
ltx/en_us_dedes/tr.d063:trCO.Ode5C1T.text	
ltx/en_us_dedes/tr.d063:trCO.Ode5C1Tr.incipit	…
ltx/en_us_dedes/tr.d063:trCO.Ode5C1Tr.melody	@ltx/en_us_dedes/he.h.m1:heHE.TinSinEirinin.name
ltx/en_us_dedes/tr.d063:trCO.Ode5C1Tr.mode	@ltx/en_us_dedes/miscellanea:misc.Mode1
ltx/en_us_dedes/tr.d063:trCO.Ode5C1Tr.ode	@ltx/en_us_dedes/miscellanea:misc.Ode5
ltx/en_us_dedes/tr.d063:trCO.Ode5C1Tr.text	
ltx/en_us_dedes/tr.d063:trCO.Ode6C11.incipit	…
ltx/en_us_dedes/tr.d063:trCO.Ode6C11.melody	@ltx/en_us_dedes/he.h.m1:heHE.AperripsasMe.name
ltx/en_us_dedes/tr.d063:trCO.Ode6C11.mode	@ltx/en_us_dedes/miscellanea:misc.Mode1
ltx/en_us_dedes/tr.d063:trCO.Ode6C11.ode	@ltx/en_us_dedes/miscellanea:misc.Ode6
ltx/en_us_dedes/tr.d063:trCO.Ode6C11.text	
ltx/en_us_dedes/tr.d063:trCO.Ode6C12.incipit	…
ltx/en_us_dedes/tr.d063:trCO.Ode6C12.melody	@ltx/en_us_dedes/he.h.m1:heHE.AperripsasMe.name
ltx/en_us_dedes/tr.d063:trCO.Ode6C12.mode	@ltx/en_us_dedes/miscellanea:misc.Mode1
ltx/en_us_dedes/tr.d063:trCO.Ode6C12.ode	@ltx/en_us_dedes/miscellanea:misc.Ode6
ltx/en_us_dedes/tr.d063:trCO.Ode6C12.text	
ltx/en_us_dedes/tr.d063:trCO.Ode6C13.incipit	…
ltx/en_us_dedes/tr.d063:trCO.Ode6C13.melody	@ltx/en_us_dedes/he.h.m1:heHE.AperripsasMe.name
ltx/en_us_dedes/tr.d063:trCO.Ode6C13.mode	@ltx/en_us_dedes/miscellanea:misc.Mode1
ltx/en_us_dedes/tr.d063:trCO.Ode6C13.ode	@ltx/en_us_dedes/miscellanea:misc.Ode6
ltx/en_us_dedes/tr.d063:trCO.Ode6C13.text	
ltx/en_us_dedes/tr.d063:trCO.Ode6C14.incipit	…
ltx/en_us_dedes/tr.d063:trCO.Ode6C14.melody	@ltx/en_us_dedes/he.h.m1:heHE.AperripsasMe.name
ltx/en_us_dedes/tr.d063:trCO.Ode6C14.mode	@ltx/en_us_dedes/miscellanea:misc.Mode1
ltx/en_us_dedes/tr.d063:trCO.Ode6C14.ode	@ltx/en_us_dedes/miscellanea:misc.Ode6
ltx/en_us_dedes/tr.d063:trCO.Ode6C14.text	
ltx/en_us_dedes/tr.d063:trCO.Ode6C15.incipit	…
ltx/en_us_dedes/tr.d063:trCO.Ode6C15.melody	@ltx/en_us_dedes/he.h.m1:heHE.AperripsasMe.name
ltx/en_us_dedes/tr.d063:trCO.Ode6C15.mode	@ltx/en_us_dedes/miscellanea:misc.Mode1
ltx/en_us_dedes/tr.d063:trCO.Ode6C15.ode	@ltx/en_us_dedes/miscellanea:misc.Ode6
ltx/en_us_dedes/tr.d063:trCO.Ode6C15.text	
ltx/en_us_dedes/tr.d063:trCO.Ode6C16.incipit	…
ltx/en_us_dedes/tr.d063:trCO.Ode6C16.melody	@ltx/en_us_dedes/he.h.m1:heHE.AperripsasMe.name
ltx/en_us_dedes/tr.d063:trCO.Ode6C16.mode	@ltx/en_us_dedes/miscellanea:misc.Mode1
ltx/en_us_dedes/tr.d063:trCO.Ode6C16.ode	@ltx/en_us_dedes/miscellanea:misc.Ode6
ltx/en_us_dedes/tr.d063:trCO.Ode6C16.text	
ltx/en_us_dedes/tr.d063:trCO.Ode6C1H.incipit	@ltx/en_us_dedes/he.h.m1:heHE.AperripsasMe.incipit
ltx/en_us_dedes/tr.d063:trCO.Ode6C1H.melody	@ltx/en_us_dedes/he.h.m1:heHE.AperripsasMe.melody
ltx/en_us_dedes/tr.d063:trCO.Ode6C1H.mode	@ltx/en_us_dedes/miscellanea:misc.Mode1
ltx/en_us_dedes/tr.d063:trCO.Ode6C1H.ode	@ltx/en_us_dedes/miscellanea:misc.Ode6
ltx/en_us_dedes/tr.d063:trCO.Ode6C1H.text	@ltx/en_us_dedes/he.h.m1:heHE.AperripsasMe.text
ltx/en_us_dedes/tr.d063:trCO.Ode6C1T.incipit	…
ltx/en_us_dedes/tr.d063:trCO.Ode6C1T.melody	@ltx/en_us_dedes/he.h.m1:heHE.AperripsasMe.name
ltx/en_us_dedes/tr.d063:trCO.Ode6C1T.mode	@ltx/en_us_dedes/miscellanea:misc.Mode1
ltx/en_us_dedes/tr.d063:trCO.Ode6C1T.ode	@ltx/en_us_dedes/miscellanea:misc.Ode6
ltx/en_us_dedes/tr.d063:trCO.Ode6C1T.text	
ltx/en_us_dedes/tr.d063:trCO.Ode6C1Tr.incipit	…
ltx/en_us_dedes/tr.d063:trCO.Ode6C1Tr.melody	@ltx/en_us_dedes/he.h.m1:heHE.AperripsasMe.name
ltx/en_us_dedes/tr.d063:trCO.Ode6C1Tr.mode	@ltx/en_us_dedes/miscellanea:misc.Mode1
ltx/en_us_dedes/tr.d063:trCO.Ode6C1Tr.ode	@ltx/en_us_dedes/miscellanea:misc.Ode6
ltx/en_us_dedes/tr.d063:trCO.Ode6C1Tr.text	
ltx/en_us_dedes/tr.d063:trCO.Ode7C11.incipit	…
ltx/en_us_dedes/tr.d063:trCO.Ode7C11.melody	@ltx/en_us_dedes/he.h.m1:heHE.TousEnKaminoPaidas.name
ltx/en_us_dedes/tr.d063:trCO.Ode7C11.mode	@ltx/en_us_dedes/miscellanea:misc.Mode1
ltx/en_us_dedes/tr.d063:trCO.Ode7C11.ode	@ltx/en_us_dedes/miscellanea:misc.Ode7
ltx/en_us_dedes/tr.d063:trCO.Ode7C11.text	
ltx/en_us_dedes/tr.d063:trCO.Ode7C12.incipit	…
ltx/en_us_dedes/tr.d063:trCO.Ode7C12.melody	@ltx/en_us_dedes/he.h.m1:heHE.TousEnKaminoPaidas.name
ltx/en_us_dedes/tr.d063:trCO.Ode7C12.mode	@ltx/en_us_dedes/miscellanea:misc.Mode1
ltx/en_us_dedes/tr.d063:trCO.Ode7C12.ode	@ltx/en_us_dedes/miscellanea:misc.Ode7
ltx/en_us_dedes/tr.d063:trCO.Ode7C12.text	
ltx/en_us_dedes/tr.d063:trCO.Ode7C13.incipit	…
ltx/en_us_dedes/tr.d063:trCO.Ode7C13.melody	@ltx/en_us_dedes/he.h.m1:heHE.TousEnKaminoPaidas.name
ltx/en_us_dedes/tr.d063:trCO.Ode7C13.mode	@ltx/en_us_dedes/miscellanea:misc.Mode1
ltx/en_us_dedes/tr.d063:trCO.Ode7C13.ode	@ltx/en_us_dedes/miscellanea:misc.Ode7
ltx/en_us_dedes/tr.d063:trCO.Ode7C13.text	
ltx/en_us_dedes/tr.d063:trCO.Ode7C14.incipit	…
ltx/en_us_dedes/tr.d063:trCO.Ode7C14.melody	@ltx/en_us_dedes/he.h.m1:heHE.TousEnKaminoPaidas.name
ltx/en_us_dedes/tr.d063:trCO.Ode7C14.mode	@ltx/en_us_dedes/miscellanea:misc.Mode1
ltx/en_us_dedes/tr.d063:trCO.Ode7C14.ode	@ltx/en_us_dedes/miscellanea:misc.Ode7
ltx/en_us_dedes/tr.d063:trCO.Ode7C14.text	
ltx/en_us_dedes/tr.d063:trCO.Ode7C15.incipit	…
ltx/en_us_dedes/tr.d063:trCO.Ode7C15.melody	@ltx/en_us_dedes/he.h.m1:heHE.TousEnKaminoPaidas.name
ltx/en_us_dedes/tr.d063:trCO.Ode7C15.mode	@ltx/en_us_dedes/miscellanea:misc.Mode1
ltx/en_us_dedes/tr.d063:trCO.Ode7C15.ode	@ltx/en_us_dedes/miscellanea:misc.Ode7
ltx/en_us_dedes/tr.d063:trCO.Ode7C15.text	
ltx/en_us_dedes/tr.d063:trCO.Ode7C16.incipit	…
ltx/en_us_dedes/tr.d063:trCO.Ode7C16.melody	@ltx/en_us_dedes/he.h.m1:heHE.TousEnKaminoPaidas.name
ltx/en_us_dedes/tr.d063:trCO.Ode7C16.mode	@ltx/en_us_dedes/miscellanea:misc.Mode1
ltx/en_us_dedes/tr.d063:trCO.Ode7C16.ode	@ltx/en_us_dedes/miscellanea:misc.Ode7
ltx/en_us_dedes/tr.d063:trCO.Ode7C16.text	
ltx/en_us_dedes/tr.d063:trCO.Ode7C17.incipit	…
ltx/en_us_dedes/tr.d063:trCO.Ode7C17.melody	@ltx/en_us_dedes/he.h.m1:heHE.TousEnKaminoPaidas.name
ltx/en_us_dedes/tr.d063:trCO.Ode7C17.mode	@ltx/en_us_dedes/miscellanea:misc.Mode1
ltx/en_us_dedes/tr.d063:trCO.Ode7C17.ode	@ltx/en_us_dedes/miscellanea:misc.Ode7
ltx/en_us_dedes/tr.d063:trCO.Ode7C17.text	
ltx/en_us_dedes/tr.d063:trCO.Ode7C1H.incipit	@ltx/en_us_dedes/he.h.m1:heHE.TousEnKaminoPaidas.incipit
ltx/en_us_dedes/tr.d063:trCO.Ode7C1H.melody	@ltx/en_us_dedes/he.h.m1:heHE.TousEnKaminoPaidas.melody
ltx/en_us_dedes/tr.d063:trCO.Ode7C1H.mode	@ltx/en_us_dedes/miscellanea:misc.Mode1
ltx/en_us_dedes/tr.d063:trCO.Ode7C1H.ode	@ltx/en_us_dedes/miscellanea:misc.Ode7
ltx/en_us_dedes/tr.d063:trCO.Ode7C1H.text	@ltx/en_us_dedes/he.h.m1:heHE.TousEnKaminoPaidas.text
ltx/en_us_dedes/tr.d063:trCO.Ode7C1T.incipit	…
ltx/en_us_dedes/tr.d063:trCO.Ode7C1T.melody	@ltx/en_us_dedes/he.h.m1:heHE.TousEnKaminoPaidas.name
ltx/en_us_dedes/tr.d063:trCO.Ode7C1T.mode	@ltx/en_us_dedes/miscellanea:misc.Mode1
ltx/en_us_dedes/tr.d063:trCO.Ode7C1T.ode	@ltx/en_us_dedes/miscellanea:misc.Ode7
ltx/en_us_dedes/tr.d063:trCO.Ode7C1T.text	
ltx/en_us_dedes/tr.d063:trCO.Ode7C1Tr.incipit	…
ltx/en_us_dedes/tr.d063:trCO.Ode7C1Tr.melody	@ltx/en_us_dedes/he.h.m1:heHE.TousEnKaminoPaidas.name
ltx/en_us_dedes/tr.d063:trCO.Ode7C1Tr.mode	@ltx/en_us_dedes/miscellanea:misc.Mode1
ltx/en_us_dedes/tr.d063:trCO.Ode7C1Tr.ode	@ltx/en_us_dedes/miscellanea:misc.Ode7
ltx/en_us_dedes/tr.d063:trCO.Ode7C1Tr.text	
ltx/en_us_dedes/tr.d063:trCO.Ode8C11.incipit	…
ltx/en_us_dedes/tr.d063:trCO.Ode8C11.melody	@ltx/en_us_dedes/he.h.m1:heHE.OiOuranoiTonOuranon.name
ltx/en_us_dedes/tr.d063:trCO.Ode8C11.mode	@ltx/en_us_dedes/miscellanea:misc.Mode1
ltx/en_us_dedes/tr.d063:trCO.Ode8C11.ode	@ltx/en_us_dedes/miscellanea:misc.Ode8
ltx/en_us_dedes/tr.d063:trCO.Ode8C11.text	
ltx/en_us_dedes/tr.d063:trCO.Ode8C12.incipit	…
ltx/en_us_dedes/tr.d063:trCO.Ode8C12.melody	@ltx/en_us_dedes/he.h.m1:heHE.OiOuranoiTonOuranon.name
ltx/en_us_dedes/tr.d063:trCO.Ode8C12.mode	@ltx/en_us_dedes/miscellanea:misc.Mode1
ltx/en_us_dedes/tr.d063:trCO.Ode8C12.ode	@ltx/en_us_dedes/miscellanea:misc.Ode8
ltx/en_us_dedes/tr.d063:trCO.Ode8C12.text	
ltx/en_us_dedes/tr.d063:trCO.Ode8C13.incipit	…
ltx/en_us_dedes/tr.d063:trCO.Ode8C13.melody	@ltx/en_us_dedes/he.h.m1:heHE.OiOuranoiTonOuranon.name
ltx/en_us_dedes/tr.d063:trCO.Ode8C13.mode	@ltx/en_us_dedes/miscellanea:misc.Mode1
ltx/en_us_dedes/tr.d063:trCO.Ode8C13.ode	@ltx/en_us_dedes/miscellanea:misc.Ode8
ltx/en_us_dedes/tr.d063:trCO.Ode8C13.text	
ltx/en_us_dedes/tr.d063:trCO.Ode8C14.incipit	…
ltx/en_us_dedes/tr.d063:trCO.Ode8C14.melody	@ltx/en_us_dedes/he.h.m1:heHE.OiOuranoiTonOuranon.name
ltx/en_us_dedes/tr.d063:trCO.Ode8C14.mode	@ltx/en_us_dedes/miscellanea:misc.Mode1
ltx/en_us_dedes/tr.d063:trCO.Ode8C14.ode	@ltx/en_us_dedes/miscellanea:misc.Ode8
ltx/en_us_dedes/tr.d063:trCO.Ode8C14.text	
ltx/en_us_dedes/tr.d063:trCO.Ode8C15.incipit	…
ltx/en_us_dedes/tr.d063:trCO.Ode8C15.melody	@ltx/en_us_dedes/he.h.m1:heHE.OiOuranoiTonOuranon.name
ltx/en_us_dedes/tr.d063:trCO.Ode8C15.mode	@ltx/en_us_dedes/miscellanea:misc.Mode1
ltx/en_us_dedes/tr.d063:trCO.Ode8C15.ode	@ltx/en_us_dedes/miscellanea:misc.Ode8
ltx/en_us_dedes/tr.d063:trCO.Ode8C15.text	
ltx/en_us_dedes/tr.d063:trCO.Ode8C16.incipit	…
ltx/en_us_dedes/tr.d063:trCO.Ode8C16.melody	@ltx/en_us_dedes/he.h.m1:heHE.OiOuranoiTonOuranon.name
ltx/en_us_dedes/tr.d063:trCO.Ode8C16.mode	@ltx/en_us_dedes/miscellanea:misc.Mode1
ltx/en_us_dedes/tr.d063:trCO.Ode8C16.ode	@ltx/en_us_dedes/miscellanea:misc.Ode8
ltx/en_us_dedes/tr.d063:trCO.Ode8C16.text	
ltx/en_us_dedes/tr.d063:trCO.Ode8C1H.incipit	@ltx/en_us_dedes/he.h.m1:heHE.OiOuranoiTonOuranon.incipit
ltx/en_us_dedes/tr.d063:trCO.Ode8C1H.melody	@ltx/en_us_dedes/he.h.m1:heHE.OiOuranoiTonOuranon.melody
ltx/en_us_dedes/tr.d063:trCO.Ode8C1H.mode	@ltx/en_us_dedes/miscellanea:misc.Mode1
ltx/en_us_dedes/tr.d063:trCO.Ode8C1H.ode	@ltx/en_us_dedes/miscellanea:misc.Ode8
ltx/en_us_dedes/tr.d063:trCO.Ode8C1H.text	@ltx/en_us_dedes/he.h.m1:heHE.OiOuranoiTonOuranon.text
ltx/en_us_dedes/tr.d063:trCO.Ode8C1T.incipit	…
ltx/en_us_dedes/tr.d063:trCO.Ode8C1T.melody	@ltx/en_us_dedes/he.h.m1:heHE.OiOuranoiTonOuranon.name
ltx/en_us_dedes/tr.d063:trCO.Ode8C1T.mode	@ltx/en_us_dedes/miscellanea:misc.Mode1
ltx/en_us_dedes/tr.d063:trCO.Ode8C1T.ode	@ltx/en_us_dedes/miscellanea:misc.Ode8
ltx/en_us_dedes/tr.d063:trCO.Ode8C1T.text	
ltx/en_us_dedes/tr.d063:trCO.Ode8C1Tr.incipit	…
ltx/en_us_dedes/tr.d063:trCO.Ode8C1Tr.melody	@ltx/en_us_dedes/he.h.m1:heHE.OiOuranoiTonOuranon.name
ltx/en_us_dedes/tr.d063:trCO.Ode8C1Tr.mode	@ltx/en_us_dedes/miscellanea:misc.Mode1
ltx/en_us_dedes/tr.d063:trCO.Ode8C1Tr.ode	@ltx/en_us_dedes/miscellanea:misc.Ode8
ltx/en_us_dedes/tr.d063:trCO.Ode8C1Tr.text	
ltx/en_us_dedes/tr.d063:trCO.Ode9C11.incipit	…
ltx/en_us_dedes/tr.d063:trCO.Ode9C11.melody	@ltx/en_us_dedes/he.h.m1:heHE.EpoiiseKratos.name
ltx/en_us_dedes/tr.d063:trCO.Ode9C11.mode	@ltx/en_us_dedes/miscellanea:misc.Mode1
ltx/en_us_dedes/tr.d063:trCO.Ode9C11.ode	@ltx/en_us_dedes/miscellanea:misc.Ode9
ltx/en_us_dedes/tr.d063:trCO.Ode9C11.text	
ltx/en_us_dedes/tr.d063:trCO.Ode9C12.incipit	…
ltx/en_us_dedes/tr.d063:trCO.Ode9C12.melody	@ltx/en_us_dedes/he.h.m1:heHE.EpoiiseKratos.name
ltx/en_us_dedes/tr.d063:trCO.Ode9C12.mode	@ltx/en_us_dedes/miscellanea:misc.Mode1
ltx/en_us_dedes/tr.d063:trCO.Ode9C12.ode	@ltx/en_us_dedes/miscellanea:misc.Ode9
ltx/en_us_dedes/tr.d063:trCO.Ode9C12.text	
ltx/en_us_dedes/tr.d063:trCO.Ode9C13.incipit	…
ltx/en_us_dedes/tr.d063:trCO.Ode9C13.melody	@ltx/en_us_dedes/he.h.m1:heHE.EpoiiseKratos.name
ltx/en_us_dedes/tr.d063:trCO.Ode9C13.mode	@ltx/en_us_dedes/miscellanea:misc.Mode1
ltx/en_us_dedes/tr.d063:trCO.Ode9C13.ode	@ltx/en_us_dedes/miscellanea:misc.Ode9
ltx/en_us_dedes/tr.d063:trCO.Ode9C13.text	
ltx/en_us_dedes/tr.d063:trCO.Ode9C14.incipit	…
ltx/en_us_dedes/tr.d063:trCO.Ode9C14.melody	@ltx/en_us_dedes/he.h.m1:heHE.EpoiiseKratos.name
ltx/en_us_dedes/tr.d063:trCO.Ode9C14.mode	@ltx/en_us_dedes/miscellanea:misc.Mode1
ltx/en_us_dedes/tr.d063:trCO.Ode9C14.ode	@ltx/en_us_dedes/miscellanea:misc.Ode9
ltx/en_us_dedes/tr.d063:trCO.Ode9C14.text	
ltx/en_us_dedes/tr.d063:trCO.Ode9C15.incipit	…
ltx/en_us_dedes/tr.d063:trCO.Ode9C15.melody	@ltx/en_us_dedes/he.h.m1:heHE.EpoiiseKratos.name
ltx/en_us_dedes/tr.d063:trCO.Ode9C15.mode	@ltx/en_us_dedes/miscellanea:misc.Mode1
ltx/en_us_dedes/tr.d063:trCO.Ode9C15.ode	@ltx/en_us_dedes/miscellanea:misc.Ode9
ltx/en_us_dedes/tr.d063:trCO.Ode9C15.text	
ltx/en_us_dedes/tr.d063:trCO.Ode9C16.incipit	…
ltx/en_us_dedes/tr.d063:trCO.Ode9C16.melody	@ltx/en_us_dedes/he.h.m1:heHE.EpoiiseKratos.name
ltx/en_us_dedes/tr.d063:trCO.Ode9C16.mode	@ltx/en_us_dedes/miscellanea:misc.Mode1
ltx/en_us_dedes/tr.d063:trCO.Ode9C16.ode	@ltx/en_us_dedes/miscellanea:misc.Ode9
ltx/en_us_dedes/tr.d063:trCO.Ode9C16.text	
ltx/en_us_dedes/tr.d063:trCO.Ode9C17.incipit	…
ltx/en_us_dedes/tr.d063:trCO.Ode9C17.melody	@ltx/en_us_dedes/he.h.m1:heHE.EpoiiseKratos.name
ltx/en_us_dedes/tr.d063:trCO.Ode9C17.mode	@ltx/en_us_dedes/miscellanea:misc.Mode1
ltx/en_us_dedes/tr.d063:trCO.Ode9C17.ode	@ltx/en_us_dedes/miscellanea:misc.Ode9
ltx/en_us_dedes/tr.d063:trCO.Ode9C17.text	
ltx/en_us_dedes/tr.d063:trCO.Ode9C1H.incipit	@ltx/en_us_dedes/he.h.m1:heHE.EpoiiseKratos.incipit
ltx/en_us_dedes/tr.d063:trCO.Ode9C1H.melody	@ltx/en_us_dedes/he.h.m1:heHE.EpoiiseKratos.melody
ltx/en_us_dedes/tr.d063:trCO.Ode9C1H.mode	@ltx/en_us_dedes/miscellanea:misc.Mode1
ltx/en_us_dedes/tr.d063:trCO.Ode9C1H.ode	@ltx/en_us_dedes/miscellanea:misc.Ode9
ltx/en_us_dedes/tr.d063:trCO.Ode9C1H.text	@ltx/en_us_dedes/he.h.m1:heHE.EpoiiseKratos.text
ltx/en_us_dedes/tr.d063:trCO.Ode9C1T.incipit	…
ltx/en_us_dedes/tr.d063:trCO.Ode9C1T.melody	@ltx/en_us_dedes/he.h.m1:heHE.EpoiiseKratos.name
ltx/en_us_dedes/tr.d063:trCO.Ode9C1T.mode	@ltx/en_us_dedes/miscellanea:misc.Mode1
ltx/en_us_dedes/tr.d063:trCO.Ode9C1T.ode	@ltx/en_us_dedes/miscellanea:misc.Ode9
ltx/en_us_dedes/tr.d063:trCO.Ode9C1T.text	
ltx/en_us_dedes/tr.d063:trCO.Ode9C1Tr.incipit	…
ltx/en_us_dedes/tr.d063:trCO.Ode9C1Tr.melody	@ltx/en_us_dedes/he.h.m1:heHE.EpoiiseKratos.name
ltx/en_us_dedes/tr.d063:trCO.Ode9C1Tr.mode	@ltx/en_us_dedes/miscellanea:misc.Mode1
ltx/en_us_dedes/tr.d063:trCO.Ode9C1Tr.ode	@ltx/en_us_dedes/miscellanea:misc.Ode9
ltx/en_us_dedes/tr.d063:trCO.Ode9C1Tr.text	
ltx/en_us_dedes/tr.d063:trCO.header	
ltx/en_us_dedes/tr.d063:trDA.commemoration.full	Saturday before Palm Sunday: Holy and Righteous Lazarus
ltx/en_us_dedes/tr.d063:trDA.commemoration.short	Saturday of Lazarus
ltx/en_us_dedes/tr.d063:trDA.dismissal	@ltx/en_us_dedes/dismissals:dis00.resurrection
ltx/en_us_dedes/tr.d063:trDA.insert1	
ltx/en_us_dedes/tr.d063:trDA.insert2	
ltx/en_us_dedes/tr.d063:trDA.note	
ltx/en_us_dedes/tr.d063:trDA.title	@ltx/en_us_dedes/titles:ti.Lazarus
ltx/en_us_dedes/tr.d063:trHO.commemorations	
ltx/en_us_dedes/tr.d063:trHO.daytitle	
ltx/en_us_dedes/tr.d063:trHO.description1	
ltx/en_us_dedes/tr.d063:trHO.description2	
ltx/en_us_dedes/tr.d063:trHO.note1	
ltx/en_us_dedes/tr.d063:trHO.note2	
ltx/en_us_dedes/tr.d063:trLI.AfterCommunion.incipit	@ltx/en_us_dedes/tr.d063:trVE.Apolytikion1.incipit
ltx/en_us_dedes/tr.d063:trLI.AfterCommunion.mode	@ltx/en_us_dedes/miscellanea:misc.Mode1
ltx/en_us_dedes/tr.d063:trLI.AfterCommunion.text	@ltx/en_us_dedes/tr.d063:trVE.Apolytikion1.text
ltx/en_us_dedes/tr.d063:trLI.Kontakion1.incipit	@ltx/en_us_dedes/tr.d063:trMA.Kontakion1.incipit
ltx/en_us_dedes/tr.d063:trLI.Kontakion1.melody	@ltx/en_us_dedes/tr.d063:trMA.Kontakion1.melody
ltx/en_us_dedes/tr.d063:trLI.Kontakion1.mode	@ltx/en_us_dedes/tr.d063:trMA.Kontakion1.mode
ltx/en_us_dedes/tr.d063:trLI.Kontakion1.text	@ltx/en_us_dedes/tr.d063:trMA.Kontakion1.text
ltx/en_us_dedes/tr.d063:trLI.MM.CommunionHymn.text	@ltx/en_us_dedes/properties:media.key
ltx/en_us_dedes/tr.d063:trLI.Megalynarion.text	
ltx/en_us_dedes/tr.d063:trLI.TheotokosHymn.incipit	@ltx/en_us_dedes/tr.d063:trMA.Ode9C1H.incipit
ltx/en_us_dedes/tr.d063:trLI.TheotokosHymn.mode	@ltx/en_us_dedes/miscellanea:misc.Mode8
ltx/en_us_dedes/tr.d063:trLI.TheotokosHymn.text	@ltx/en_us_dedes/tr.d063:trMA.Ode9C1H.text
ltx/en_us_dedes/tr.d063:trMA.C1.poet	@ltx/en_us_dedes/poets:po.Theofanous
ltx/en_us_dedes/tr.d063:trMA.C1.title	@ltx/en_us_dedes/titles:ti.Canon1
ltx/en_us_dedes/tr.d063:trMA.C1.verse	@ltx/en_us_dedes/prayers:pr.verse_God.text
ltx/en_us_dedes/tr.d063:trMA.C2.poet	@ltx/en_us_dedes/poets:po.KosmaMonachou
ltx/en_us_dedes/tr.d063:trMA.C2.title	@ltx/en_us_dedes/titles:ti.Canon2
ltx/en_us_dedes/tr.d063:trMA.C2.verse	@ltx/en_us_dedes/prayers:pr.verse_God.text
ltx/en_us_dedes/tr.d063:trMA.C3.poet	@ltx/en_us_dedes/poets:po.KosmaMonachou
ltx/en_us_dedes/tr.d063:trMA.C4.poet	@ltx/en_us_dedes/poets:po.IoannouMonachou
ltx/en_us_dedes/tr.d063:trMA.Exaposteilarion1.greekmelody	@ltx/en_us_dedes/he.a.m3:heAU.EpeskepsatoImas.greekname
ltx/en_us_dedes/tr.d063:trMA.Exaposteilarion1.incipit	By Your word, O Word…
ltx/en_us_dedes/tr.d063:trMA.Exaposteilarion1.melody	@ltx/en_us_dedes/he.a.m3:heAU.EpeskepsatoImas.name
ltx/en_us_dedes/tr.d063:trMA.Exaposteilarion1.mode	@ltx/en_us_dedes/miscellanea:misc.Mode3
ltx/en_us_dedes/tr.d063:trMA.Exaposteilarion1.text	By Your word, O Word of God, * Lazarus now leaps out of death, * having returned to this life. * Therefore the peoples honor You * with their branches, O Mighty One; * for You shall destroy Hades utterly by Your own death.
ltx/en_us_dedes/tr.d063:trMA.Exaposteilarion2.greekmelody	@ltx/en_us_dedes/he.a.m3:heAU.EpeskepsatoImas.greekname
ltx/en_us_dedes/tr.d063:trMA.Exaposteilarion2.incipit	By means of Lazarus has…
ltx/en_us_dedes/tr.d063:trMA.Exaposteilarion2.melody	@ltx/en_us_dedes/he.a.m3:heAU.EpeskepsatoImas.name
ltx/en_us_dedes/tr.d063:trMA.Exaposteilarion2.mode	@ltx/en_us_dedes/miscellanea:misc.Mode3
ltx/en_us_dedes/tr.d063:trMA.Exaposteilarion2.text	By means of Lazarus has Christ* already plundered you, O death. * Where is your victory, O Hades? * For the lament of Bethany * is handed over now to you. * Let us all wave against it * our branches of victory.
ltx/en_us_dedes/tr.d063:trMA.Kathisma11.greekmelody	@ltx/en_us_dedes/he.a.m1:heAU.TouLithouSfragisthentos.greekname
ltx/en_us_dedes/tr.d063:trMA.Kathisma11.incipit	You took pity on the…
ltx/en_us_dedes/tr.d063:trMA.Kathisma11.melody	@ltx/en_us_dedes/he.a.m1:heAU.TouLithouSfragisthentos.name
ltx/en_us_dedes/tr.d063:trMA.Kathisma11.mode	@ltx/en_us_dedes/miscellanea:misc.Mode1
ltx/en_us_dedes/tr.d063:trMA.Kathisma11.text	You took pity on the tears of Martha and Mary, * and You ordered that the stone be rolled away from the tomb, * O Christ our God. And then You called * the dead man and resurrected him; * and through him, O Giver of Life,* You assured the world of its resurrection. * Glory to Your dominion, O Savior; * glory to Your authority; * glory to You who established all things by Your word.
ltx/en_us_dedes/tr.d063:trMA.Kathisma21.greekmelody	@ltx/en_us_dedes/he.a.m5:heAU.TonSynanarchonLogon.greekname
ltx/en_us_dedes/tr.d063:trMA.Kathisma21.incipit	Source of wisdom and foreknowledge…
ltx/en_us_dedes/tr.d063:trMA.Kathisma21.melody	@ltx/en_us_dedes/he.a.m5:heAU.TonSynanarchonLogon.name
ltx/en_us_dedes/tr.d063:trMA.Kathisma21.mode	@ltx/en_us_dedes/miscellanea:misc.Mode5
ltx/en_us_dedes/tr.d063:trMA.Kathisma21.text	Source of wisdom and foreknowledge, Christ, You still inquired * of the neighbors of Martha in Bethany, O Lord. * And You said, “Where have you laid beloved Lazarus?” * Sympathetically You wept for Your friend four days dead.* Then by Your word alone You raised him, * as the Lord and Giver of Life, * compassionate and benevolent.
ltx/en_us_dedes/tr.d063:trMA.Kontakion1.incipit	The joy of all men…
ltx/en_us_dedes/tr.d063:trMA.Kontakion1.melody	@ltx/en_us_dedes/he.a.m2:heAU.TaAnoZiton.name
ltx/en_us_dedes/tr.d063:trMA.Kontakion1.mode	@ltx/en_us_dedes/miscellanea:misc.Mode2
ltx/en_us_dedes/tr.d063:trMA.Kontakion1.text	The joy of all men, the Truth who is Christ our God, the light and the life, the resurrection of the world has appeared unto those on earth, in that He is benevolent, becoming the type of the Resurrection, and granting divine remission unto all.
ltx/en_us_dedes/tr.d063:trMA.Lauds1.incipit	O Christ, as You are…
ltx/en_us_dedes/tr.d063:trMA.Lauds1.melody	@ltx/en_us_dedes/miscellanea:misc.Idiomelon
ltx/en_us_dedes/tr.d063:trMA.Lauds1.mode	@ltx/en_us_dedes/miscellanea:misc.Mode1
ltx/en_us_dedes/tr.d063:trMA.Lauds1.text	O Christ, as You are the resurrection and the life of mankind, You came to the tomb of Lazarus, and demonstrated for us both of Your essences, O longsuffering One; for from the pure Virgin You have come indeed as both God and man. As a mortal You inquired where he was buried, and as God with Your life-bearing summons You resurrected him who had been four days dead.
ltx/en_us_dedes/tr.d063:trMA.Lauds2.incipit	You resurrected Lazarus from Hades…
ltx/en_us_dedes/tr.d063:trMA.Lauds2.melody	@ltx/en_us_dedes/miscellanea:misc.Idiomelon
ltx/en_us_dedes/tr.d063:trMA.Lauds2.mode	@ltx/en_us_dedes/miscellanea:misc.Mode1
ltx/en_us_dedes/tr.d063:trMA.Lauds2.text	You resurrected Lazarus from Hades after he was dead for four days, O Christ, thus before Your own death confounding the dominion of death, and by means of one whom You loved foretokening the liberation of all mankind from corruption. Therefore adoring Your omnipotent authority we cry out: Blessed are You, O Savior. Have mercy on us.
ltx/en_us_dedes/tr.d063:trMA.Lauds3.incipit	Martha and Mary unto the…
ltx/en_us_dedes/tr.d063:trMA.Lauds3.melody	@ltx/en_us_dedes/miscellanea:misc.Idiomelon
ltx/en_us_dedes/tr.d063:trMA.Lauds3.mode	@ltx/en_us_dedes/miscellanea:misc.Mode1
ltx/en_us_dedes/tr.d063:trMA.Lauds3.text	Martha and Mary unto the Savior said: If You had been here, O Lord, then Lazarus would not have died. Then Christ, the Resurrection of those who in death have slumbered, resurrected from the dead the man already four days dead. Therefore, O believers all, come let us adore Him who is coming in glory to save our souls.
ltx/en_us_dedes/tr.d063:trMA.Lauds4.incipit	To Your disciples, O Christ…
ltx/en_us_dedes/tr.d063:trMA.Lauds4.melody	@ltx/en_us_dedes/miscellanea:misc.Idiomelon
ltx/en_us_dedes/tr.d063:trMA.Lauds4.mode	@ltx/en_us_dedes/miscellanea:misc.Mode1
ltx/en_us_dedes/tr.d063:trMA.Lauds4.text	To Your disciples, O Christ, You granted the tokens of Your Divinity; but You humbled yourself among the crowds, Your intention being to conceal it from them. Therefore as the Foreknower of all things and as God, You predicted to Your Apostles the death of Lazarus. In the presence of the people in Bethany, as though You did not know, as man, You sought to learn the place of Your friend’s burial. But when he, who had been four days dead, was resurrected by You, he made Your divine power manifest. O Almighty One, glory to You, O Lord.
ltx/en_us_dedes/tr.d063:trMA.Lauds5.incipit	You raised Your friend who…
ltx/en_us_dedes/tr.d063:trMA.Lauds5.melody	@ltx/en_us_dedes/miscellanea:misc.Idiomelon
ltx/en_us_dedes/tr.d063:trMA.Lauds5.mode	@ltx/en_us_dedes/miscellanea:misc.Mode4
ltx/en_us_dedes/tr.d063:trMA.Lauds5.text	You raised Your friend who was four days dead, O Christ, and brought an end to the lament of Martha and Mary, and thus You demonstrated to all that You are the one who fills all things by Your divine dominion, by Your own free will. The Cherubim cry out to You unceasingly: Hosanna in the highest. Blessed are You who are God above all. Glory to You.
ltx/en_us_dedes/tr.d063:trMA.Lauds6.incipit	Martha cried aloud to Mary:…
ltx/en_us_dedes/tr.d063:trMA.Lauds6.melody	@ltx/en_us_dedes/miscellanea:misc.Idiomelon
ltx/en_us_dedes/tr.d063:trMA.Lauds6.mode	@ltx/en_us_dedes/miscellanea:misc.Mode4
ltx/en_us_dedes/tr.d063:trMA.Lauds6.text	Martha cried aloud to Mary: “Come, for the Teacher is here and is calling for you.” And she went quickly to the place where her Lord was. And when she saw You, she cried; she knelt; she worshipped. As she covered Your immaculate feet with kisses, she said, “Lord, if You had been here, our brother would not have died.”
ltx/en_us_dedes/tr.d063:trMA.Lauds7.incipit	Four days after he had…
ltx/en_us_dedes/tr.d063:trMA.Lauds7.melody	@ltx/en_us_dedes/miscellanea:misc.Idiomelon
ltx/en_us_dedes/tr.d063:trMA.Lauds7.mode	@ltx/en_us_dedes/miscellanea:misc.Mode8
ltx/en_us_dedes/tr.d063:trMA.Lauds7.text	Four days after he had died You raised up Lazarus in Bethany. As soon as You came to the tomb, Your voice became life to the dead man; and Hades, groaning in fear, released him. Great was the miracle! Very merciful Lord, glory to You.
ltx/en_us_dedes/tr.d063:trMA.Lauds8.incipit	…
ltx/en_us_dedes/tr.d063:trMA.Lauds8.melody	@ltx/en_us_dedes/miscellanea:misc.Idiomelon
ltx/en_us_dedes/tr.d063:trMA.Lauds8.mode	@ltx/en_us_dedes/miscellanea:misc.Mode8
ltx/en_us_dedes/tr.d063:trMA.Lauds8.text	
ltx/en_us_dedes/tr.d063:trMA.LaudsGlory.incipit	Today has a miracle been…
ltx/en_us_dedes/tr.d063:trMA.LaudsGlory.melody	@ltx/en_us_dedes/miscellanea:misc.Idiomelon
ltx/en_us_dedes/tr.d063:trMA.LaudsGlory.mode	@ltx/en_us_dedes/miscellanea:misc.Mode2
ltx/en_us_dedes/tr.d063:trMA.LaudsGlory.text	Today has a miracle been performed that is great and paradoxical. For from the grave Christ has summoned a dead man of four days and resurrected him, and called him His beloved friend. Let us sing glory to Him who is supremely glorious, so that at the intercessions of Lazarus the righteous, He might save our souls.
ltx/en_us_dedes/tr.d063:trMA.LaudsTheotokion.incipit	@ltx/en_us_dedes/oc.m2.d1:ocMA.Kathisma23.incipit
ltx/en_us_dedes/tr.d063:trMA.LaudsTheotokion.melody	
ltx/en_us_dedes/tr.d063:trMA.LaudsTheotokion.mode	@ltx/en_us_dedes/miscellanea:misc.Mode2
ltx/en_us_dedes/tr.d063:trMA.LaudsTheotokion.text	@ltx/en_us_dedes/oc.m2.d1:ocMA.Kathisma23.text
ltx/en_us_dedes/tr.d063:trMA.MM.ExapIntro.text	@ltx/en_us_dedes/properties:media.key
ltx/en_us_dedes/tr.d063:trMA.Ode1C11.greekmelody	@ltx/en_us_dedes/he.h.m8:heHE.AsomenToKyrio.greekname
ltx/en_us_dedes/tr.d063:trMA.Ode1C11.incipit	…
ltx/en_us_dedes/tr.d063:trMA.Ode1C11.melody	@ltx/en_us_dedes/he.h.m8:heHE.AsomenToKyrio.name
ltx/en_us_dedes/tr.d063:trMA.Ode1C11.mode	@ltx/en_us_dedes/miscellanea:misc.Mode8
ltx/en_us_dedes/tr.d063:trMA.Ode1C11.ode	@ltx/en_us_dedes/miscellanea:misc.Ode1
ltx/en_us_dedes/tr.d063:trMA.Ode1C11.text	
ltx/en_us_dedes/tr.d063:trMA.Ode1C12.incipit	…
ltx/en_us_dedes/tr.d063:trMA.Ode1C12.melody	@ltx/en_us_dedes/he.h.m8:heHE.AsomenToKyrio.name
ltx/en_us_dedes/tr.d063:trMA.Ode1C12.mode	@ltx/en_us_dedes/miscellanea:misc.Mode8
ltx/en_us_dedes/tr.d063:trMA.Ode1C12.ode	@ltx/en_us_dedes/miscellanea:misc.Ode1
ltx/en_us_dedes/tr.d063:trMA.Ode1C12.text	
ltx/en_us_dedes/tr.d063:trMA.Ode1C13.incipit	…
ltx/en_us_dedes/tr.d063:trMA.Ode1C13.melody	@ltx/en_us_dedes/he.h.m8:heHE.AsomenToKyrio.name
ltx/en_us_dedes/tr.d063:trMA.Ode1C13.mode	@ltx/en_us_dedes/miscellanea:misc.Mode8
ltx/en_us_dedes/tr.d063:trMA.Ode1C13.ode	@ltx/en_us_dedes/miscellanea:misc.Ode1
ltx/en_us_dedes/tr.d063:trMA.Ode1C13.text	
ltx/en_us_dedes/tr.d063:trMA.Ode1C14.incipit	…
ltx/en_us_dedes/tr.d063:trMA.Ode1C14.melody	@ltx/en_us_dedes/he.h.m8:heHE.AsomenToKyrio.name
ltx/en_us_dedes/tr.d063:trMA.Ode1C14.mode	@ltx/en_us_dedes/miscellanea:misc.Mode8
ltx/en_us_dedes/tr.d063:trMA.Ode1C14.ode	@ltx/en_us_dedes/miscellanea:misc.Ode1
ltx/en_us_dedes/tr.d063:trMA.Ode1C14.text	
ltx/en_us_dedes/tr.d063:trMA.Ode1C1H.greekmelody	@ltx/en_us_dedes/he.h.m8:heHE.AsomenToKyrio.greekname
ltx/en_us_dedes/tr.d063:trMA.Ode1C1H.incipit	@ltx/en_us_dedes/he.h.m8:heHE.AsomenToKyrio.incipit
ltx/en_us_dedes/tr.d063:trMA.Ode1C1H.melody	@ltx/en_us_dedes/he.h.m8:heHE.AsomenToKyrio.melody
ltx/en_us_dedes/tr.d063:trMA.Ode1C1H.mode	@ltx/en_us_dedes/miscellanea:misc.Mode8
ltx/en_us_dedes/tr.d063:trMA.Ode1C1H.ode	@ltx/en_us_dedes/miscellanea:misc.Ode1
ltx/en_us_dedes/tr.d063:trMA.Ode1C1H.text	@ltx/en_us_dedes/he.h.m8:heHE.AsomenToKyrio.text
ltx/en_us_dedes/tr.d063:trMA.Ode1C21.greekmelody	@ltx/en_us_dedes/he.h.m8:heHE.YgranDiodefsas.greekname
ltx/en_us_dedes/tr.d063:trMA.Ode1C21.incipit	…
ltx/en_us_dedes/tr.d063:trMA.Ode1C21.melody	@ltx/en_us_dedes/he.h.m8:heHE.YgranDiodefsas.name
ltx/en_us_dedes/tr.d063:trMA.Ode1C21.mode	@ltx/en_us_dedes/miscellanea:misc.Mode8
ltx/en_us_dedes/tr.d063:trMA.Ode1C21.ode	@ltx/en_us_dedes/miscellanea:misc.Ode1
ltx/en_us_dedes/tr.d063:trMA.Ode1C21.text	
ltx/en_us_dedes/tr.d063:trMA.Ode1C22.incipit	…
ltx/en_us_dedes/tr.d063:trMA.Ode1C22.melody	@ltx/en_us_dedes/he.h.m8:heHE.YgranDiodefsas.name
ltx/en_us_dedes/tr.d063:trMA.Ode1C22.mode	@ltx/en_us_dedes/miscellanea:misc.Mode8
ltx/en_us_dedes/tr.d063:trMA.Ode1C22.ode	@ltx/en_us_dedes/miscellanea:misc.Ode1
ltx/en_us_dedes/tr.d063:trMA.Ode1C22.text	
ltx/en_us_dedes/tr.d063:trMA.Ode1C23.incipit	…
ltx/en_us_dedes/tr.d063:trMA.Ode1C23.melody	@ltx/en_us_dedes/he.h.m8:heHE.YgranDiodefsas.name
ltx/en_us_dedes/tr.d063:trMA.Ode1C23.mode	@ltx/en_us_dedes/miscellanea:misc.Mode8
ltx/en_us_dedes/tr.d063:trMA.Ode1C23.ode	@ltx/en_us_dedes/miscellanea:misc.Ode1
ltx/en_us_dedes/tr.d063:trMA.Ode1C23.text	
ltx/en_us_dedes/tr.d063:trMA.Ode1C2T.incipit	…
ltx/en_us_dedes/tr.d063:trMA.Ode1C2T.melody	@ltx/en_us_dedes/he.h.m8:heHE.YgranDiodefsas.name
ltx/en_us_dedes/tr.d063:trMA.Ode1C2T.mode	@ltx/en_us_dedes/miscellanea:misc.Mode8
ltx/en_us_dedes/tr.d063:trMA.Ode1C2T.ode	@ltx/en_us_dedes/miscellanea:misc.Ode1
ltx/en_us_dedes/tr.d063:trMA.Ode1C2T.text	
ltx/en_us_dedes/tr.d063:trMA.Ode1K.incipit	@ltx/en_us_dedes/he.h.m8:heHE.YgranDiodefsas.incipit
ltx/en_us_dedes/tr.d063:trMA.Ode1K.melody	@ltx/en_us_dedes/he.h.m8:heHE.YgranDiodefsas.melody
ltx/en_us_dedes/tr.d063:trMA.Ode1K.mode	@ltx/en_us_dedes/miscellanea:misc.Mode8
ltx/en_us_dedes/tr.d063:trMA.Ode1K.ode	@ltx/en_us_dedes/miscellanea:misc.Ode1
ltx/en_us_dedes/tr.d063:trMA.Ode1K.text	@ltx/en_us_dedes/he.h.m8:heHE.YgranDiodefsas.text
ltx/en_us_dedes/tr.d063:trMA.Ode3C11.greekmelody	@ltx/en_us_dedes/he.h.m8:heHE.SyEiToStereoma.greekname
ltx/en_us_dedes/tr.d063:trMA.Ode3C11.incipit	Savior, You are God and…
ltx/en_us_dedes/tr.d063:trMA.Ode3C11.melody	@ltx/en_us_dedes/he.h.m8:heHE.SyEiToStereoma.name
ltx/en_us_dedes/tr.d063:trMA.Ode3C11.mode	@ltx/en_us_dedes/miscellanea:misc.Mode8
ltx/en_us_dedes/tr.d063:trMA.Ode3C11.ode	@ltx/en_us_dedes/miscellanea:misc.Ode3
ltx/en_us_dedes/tr.d063:trMA.Ode3C11.text	Savior, You are God and man, and You displayed that Your energies are two indeed, * thereby demonstrating Your two natures and essences.
ltx/en_us_dedes/tr.d063:trMA.Ode3C12.incipit	Master, even though You are…
ltx/en_us_dedes/tr.d063:trMA.Ode3C12.melody	@ltx/en_us_dedes/he.h.m8:heHE.SyEiToStereoma.name
ltx/en_us_dedes/tr.d063:trMA.Ode3C12.mode	@ltx/en_us_dedes/miscellanea:misc.Mode8
ltx/en_us_dedes/tr.d063:trMA.Ode3C12.ode	@ltx/en_us_dedes/miscellanea:misc.Ode3
ltx/en_us_dedes/tr.d063:trMA.Ode3C12.text	Master, even though You are a sea of knowledge, You ask where the deceased was laid, * since You were going to raise him, as the Giver-of-Life and Lord.
ltx/en_us_dedes/tr.d063:trMA.Ode3C13.incipit	Christ, when You became a…
ltx/en_us_dedes/tr.d063:trMA.Ode3C13.melody	@ltx/en_us_dedes/he.h.m8:heHE.SyEiToStereoma.name
ltx/en_us_dedes/tr.d063:trMA.Ode3C13.mode	@ltx/en_us_dedes/miscellanea:misc.Mode8
ltx/en_us_dedes/tr.d063:trMA.Ode3C13.ode	@ltx/en_us_dedes/miscellanea:misc.Ode3
ltx/en_us_dedes/tr.d063:trMA.Ode3C13.text	Christ, when You became a man, You were in flesh circumscribed and went from place to place,* ever filling all things, being God and uncircumscribed.
ltx/en_us_dedes/tr.d063:trMA.Ode3C14.incipit	At Your divine word, O…
ltx/en_us_dedes/tr.d063:trMA.Ode3C14.melody	@ltx/en_us_dedes/he.h.m8:heHE.SyEiToStereoma.name
ltx/en_us_dedes/tr.d063:trMA.Ode3C14.mode	@ltx/en_us_dedes/miscellanea:misc.Mode8
ltx/en_us_dedes/tr.d063:trMA.Ode3C14.ode	@ltx/en_us_dedes/miscellanea:misc.Ode3
ltx/en_us_dedes/tr.d063:trMA.Ode3C14.text	At Your divine word, O Christ, of old You raised righteous Lazarus. And now I pray,* raise me who am lying dead because of my many sins.
ltx/en_us_dedes/tr.d063:trMA.Ode3C1H.greekmelody	@ltx/en_us_dedes/he.h.m8:heHE.SyEiToStereoma.greekname
ltx/en_us_dedes/tr.d063:trMA.Ode3C1H.incipit	@ltx/en_us_dedes/he.h.m8:heHE.SyEiToStereoma.incipit
ltx/en_us_dedes/tr.d063:trMA.Ode3C1H.melody	@ltx/en_us_dedes/he.h.m8:heHE.SyEiToStereoma.melody
ltx/en_us_dedes/tr.d063:trMA.Ode3C1H.mode	@ltx/en_us_dedes/miscellanea:misc.Mode8
ltx/en_us_dedes/tr.d063:trMA.Ode3C1H.ode	@ltx/en_us_dedes/miscellanea:misc.Ode3
ltx/en_us_dedes/tr.d063:trMA.Ode3C1H.text	@ltx/en_us_dedes/he.h.m8:heHE.SyEiToStereoma.text
ltx/en_us_dedes/tr.d063:trMA.Ode3C21.greekmelody	@ltx/en_us_dedes/he.h.m8:heHE.OuraniasApsidos.greekname
ltx/en_us_dedes/tr.d063:trMA.Ode3C21.incipit	…
ltx/en_us_dedes/tr.d063:trMA.Ode3C21.melody	@ltx/en_us_dedes/he.h.m8:heHE.OuraniasApsidos.name
ltx/en_us_dedes/tr.d063:trMA.Ode3C21.mode	@ltx/en_us_dedes/miscellanea:misc.Mode8
ltx/en_us_dedes/tr.d063:trMA.Ode3C21.ode	@ltx/en_us_dedes/miscellanea:misc.Ode3
ltx/en_us_dedes/tr.d063:trMA.Ode3C21.text	
ltx/en_us_dedes/tr.d063:trMA.Ode3C22.incipit	…
ltx/en_us_dedes/tr.d063:trMA.Ode3C22.melody	@ltx/en_us_dedes/he.h.m8:heHE.OuraniasApsidos.name
ltx/en_us_dedes/tr.d063:trMA.Ode3C22.mode	@ltx/en_us_dedes/miscellanea:misc.Mode8
ltx/en_us_dedes/tr.d063:trMA.Ode3C22.ode	@ltx/en_us_dedes/miscellanea:misc.Ode3
ltx/en_us_dedes/tr.d063:trMA.Ode3C22.text	
ltx/en_us_dedes/tr.d063:trMA.Ode3C23.incipit	…
ltx/en_us_dedes/tr.d063:trMA.Ode3C23.melody	@ltx/en_us_dedes/he.h.m8:heHE.OuraniasApsidos.name
ltx/en_us_dedes/tr.d063:trMA.Ode3C23.mode	@ltx/en_us_dedes/miscellanea:misc.Mode8
ltx/en_us_dedes/tr.d063:trMA.Ode3C23.ode	@ltx/en_us_dedes/miscellanea:misc.Ode3
ltx/en_us_dedes/tr.d063:trMA.Ode3C23.text	
ltx/en_us_dedes/tr.d063:trMA.Ode3C2T.incipit	…
ltx/en_us_dedes/tr.d063:trMA.Ode3C2T.melody	@ltx/en_us_dedes/he.h.m8:heHE.OuraniasApsidos.name
ltx/en_us_dedes/tr.d063:trMA.Ode3C2T.mode	@ltx/en_us_dedes/miscellanea:misc.Mode8
ltx/en_us_dedes/tr.d063:trMA.Ode3C2T.ode	@ltx/en_us_dedes/miscellanea:misc.Ode3
ltx/en_us_dedes/tr.d063:trMA.Ode3C2T.text	
ltx/en_us_dedes/tr.d063:trMA.Ode3K.incipit	@ltx/en_us_dedes/he.h.m8:heHE.OuraniasApsidos.incipit
ltx/en_us_dedes/tr.d063:trMA.Ode3K.melody	@ltx/en_us_dedes/he.h.m8:heHE.OuraniasApsidos.melody
ltx/en_us_dedes/tr.d063:trMA.Ode3K.mode	@ltx/en_us_dedes/miscellanea:misc.Mode8
ltx/en_us_dedes/tr.d063:trMA.Ode3K.ode	@ltx/en_us_dedes/miscellanea:misc.Ode3
ltx/en_us_dedes/tr.d063:trMA.Ode3K.text	@ltx/en_us_dedes/he.h.m8:heHE.OuraniasApsidos.text
ltx/en_us_dedes/tr.d063:trMA.Ode3Kathisma1.greekmelody	@ltx/en_us_dedes/he.a.m4:heAU.KateplagiIosif.greekname
ltx/en_us_dedes/tr.d063:trMA.Ode3Kathisma1.incipit	…
ltx/en_us_dedes/tr.d063:trMA.Ode3Kathisma1.melody	@ltx/en_us_dedes/he.a.m4:heAU.KateplagiIosif.name
ltx/en_us_dedes/tr.d063:trMA.Ode3Kathisma1.mode	@ltx/en_us_dedes/miscellanea:misc.Mode4
ltx/en_us_dedes/tr.d063:trMA.Ode3Kathisma1.text	
ltx/en_us_dedes/tr.d063:trMA.Ode3Kathisma2.greekmelody	@ltx/en_us_dedes/he.a.m8:heAU.TinSofianKaiLogon.greekname
ltx/en_us_dedes/tr.d063:trMA.Ode3Kathisma2.incipit	…
ltx/en_us_dedes/tr.d063:trMA.Ode3Kathisma2.melody	@ltx/en_us_dedes/he.a.m8:heAU.TinSofianKaiLogon.name
ltx/en_us_dedes/tr.d063:trMA.Ode3Kathisma2.mode	@ltx/en_us_dedes/miscellanea:misc.Mode8
ltx/en_us_dedes/tr.d063:trMA.Ode3Kathisma2.text	
ltx/en_us_dedes/tr.d063:trMA.Ode4C11.greekmelody	@ltx/en_us_dedes/he.h.m8:heHE.EisakikoaKyrie.greekname
ltx/en_us_dedes/tr.d063:trMA.Ode4C11.incipit	…
ltx/en_us_dedes/tr.d063:trMA.Ode4C11.melody	@ltx/en_us_dedes/he.h.m8:heHE.EisakikoaKyrie.name
ltx/en_us_dedes/tr.d063:trMA.Ode4C11.mode	@ltx/en_us_dedes/miscellanea:misc.Mode8
ltx/en_us_dedes/tr.d063:trMA.Ode4C11.ode	@ltx/en_us_dedes/miscellanea:misc.Ode4
ltx/en_us_dedes/tr.d063:trMA.Ode4C11.text	
ltx/en_us_dedes/tr.d063:trMA.Ode4C12.incipit	…
ltx/en_us_dedes/tr.d063:trMA.Ode4C12.melody	@ltx/en_us_dedes/he.h.m8:heHE.EisakikoaKyrie.name
ltx/en_us_dedes/tr.d063:trMA.Ode4C12.mode	@ltx/en_us_dedes/miscellanea:misc.Mode8
ltx/en_us_dedes/tr.d063:trMA.Ode4C12.ode	@ltx/en_us_dedes/miscellanea:misc.Ode4
ltx/en_us_dedes/tr.d063:trMA.Ode4C12.text	
ltx/en_us_dedes/tr.d063:trMA.Ode4C13.incipit	…
ltx/en_us_dedes/tr.d063:trMA.Ode4C13.melody	@ltx/en_us_dedes/he.h.m8:heHE.EisakikoaKyrie.name
ltx/en_us_dedes/tr.d063:trMA.Ode4C13.mode	@ltx/en_us_dedes/miscellanea:misc.Mode8
ltx/en_us_dedes/tr.d063:trMA.Ode4C13.ode	@ltx/en_us_dedes/miscellanea:misc.Ode4
ltx/en_us_dedes/tr.d063:trMA.Ode4C13.text	
ltx/en_us_dedes/tr.d063:trMA.Ode4C1H.greekmelody	@ltx/en_us_dedes/he.h.m8:heHE.EisakikoaKyrie.greekname
ltx/en_us_dedes/tr.d063:trMA.Ode4C1H.incipit	@ltx/en_us_dedes/he.h.m8:heHE.EisakikoaKyrie.incipit
ltx/en_us_dedes/tr.d063:trMA.Ode4C1H.melody	@ltx/en_us_dedes/he.h.m8:heHE.EisakikoaKyrie.melody
ltx/en_us_dedes/tr.d063:trMA.Ode4C1H.mode	@ltx/en_us_dedes/miscellanea:misc.Mode8
ltx/en_us_dedes/tr.d063:trMA.Ode4C1H.ode	@ltx/en_us_dedes/miscellanea:misc.Ode4
ltx/en_us_dedes/tr.d063:trMA.Ode4C1H.text	@ltx/en_us_dedes/he.h.m8:heHE.EisakikoaKyrie.text
ltx/en_us_dedes/tr.d063:trMA.Ode4C1T.incipit	…
ltx/en_us_dedes/tr.d063:trMA.Ode4C1T.melody	@ltx/en_us_dedes/he.h.m8:heHE.EisakikoaKyrie.name
ltx/en_us_dedes/tr.d063:trMA.Ode4C1T.mode	@ltx/en_us_dedes/miscellanea:misc.Mode8
ltx/en_us_dedes/tr.d063:trMA.Ode4C1T.ode	@ltx/en_us_dedes/miscellanea:misc.Ode4
ltx/en_us_dedes/tr.d063:trMA.Ode4C1T.text	
ltx/en_us_dedes/tr.d063:trMA.Ode4C21.greekmelody	@ltx/en_us_dedes/he.h.m8:heHE.SyMouIschys.greekname
ltx/en_us_dedes/tr.d063:trMA.Ode4C21.incipit	…
ltx/en_us_dedes/tr.d063:trMA.Ode4C21.melody	@ltx/en_us_dedes/he.h.m8:heHE.SyMouIschys.name
ltx/en_us_dedes/tr.d063:trMA.Ode4C21.mode	@ltx/en_us_dedes/miscellanea:misc.Mode8
ltx/en_us_dedes/tr.d063:trMA.Ode4C21.ode	@ltx/en_us_dedes/miscellanea:misc.Ode4
ltx/en_us_dedes/tr.d063:trMA.Ode4C21.text	
ltx/en_us_dedes/tr.d063:trMA.Ode4C22.incipit	…
ltx/en_us_dedes/tr.d063:trMA.Ode4C22.melody	@ltx/en_us_dedes/he.h.m8:heHE.SyMouIschys.name
ltx/en_us_dedes/tr.d063:trMA.Ode4C22.mode	@ltx/en_us_dedes/miscellanea:misc.Mode8
ltx/en_us_dedes/tr.d063:trMA.Ode4C22.ode	@ltx/en_us_dedes/miscellanea:misc.Ode4
ltx/en_us_dedes/tr.d063:trMA.Ode4C22.text	
ltx/en_us_dedes/tr.d063:trMA.Ode4C23.incipit	…
ltx/en_us_dedes/tr.d063:trMA.Ode4C23.melody	@ltx/en_us_dedes/he.h.m8:heHE.SyMouIschys.name
ltx/en_us_dedes/tr.d063:trMA.Ode4C23.mode	@ltx/en_us_dedes/miscellanea:misc.Mode8
ltx/en_us_dedes/tr.d063:trMA.Ode4C23.ode	@ltx/en_us_dedes/miscellanea:misc.Ode4
ltx/en_us_dedes/tr.d063:trMA.Ode4C23.text	
ltx/en_us_dedes/tr.d063:trMA.Ode4C2T.incipit	…
ltx/en_us_dedes/tr.d063:trMA.Ode4C2T.melody	@ltx/en_us_dedes/he.h.m8:heHE.SyMouIschys.name
ltx/en_us_dedes/tr.d063:trMA.Ode4C2T.mode	@ltx/en_us_dedes/miscellanea:misc.Mode8
ltx/en_us_dedes/tr.d063:trMA.Ode4C2T.ode	@ltx/en_us_dedes/miscellanea:misc.Ode4
ltx/en_us_dedes/tr.d063:trMA.Ode4C2T.text	
ltx/en_us_dedes/tr.d063:trMA.Ode4K.incipit	@ltx/en_us_dedes/he.h.m8:heHE.SyMouIschys.incipit
ltx/en_us_dedes/tr.d063:trMA.Ode4K.melody	@ltx/en_us_dedes/he.h.m8:heHE.SyMouIschys.melody
ltx/en_us_dedes/tr.d063:trMA.Ode4K.mode	@ltx/en_us_dedes/miscellanea:misc.Mode8
ltx/en_us_dedes/tr.d063:trMA.Ode4K.ode	@ltx/en_us_dedes/miscellanea:misc.Ode4
ltx/en_us_dedes/tr.d063:trMA.Ode4K.text	@ltx/en_us_dedes/he.h.m8:heHE.SyMouIschys.text
ltx/en_us_dedes/tr.d063:trMA.Ode5C11.greekmelody	@ltx/en_us_dedes/he.h.m8:heHE.InaTiMeAposo.greekname
ltx/en_us_dedes/tr.d063:trMA.Ode5C11.incipit	…
ltx/en_us_dedes/tr.d063:trMA.Ode5C11.melody	@ltx/en_us_dedes/he.h.m8:heHE.InaTiMeAposo.name
ltx/en_us_dedes/tr.d063:trMA.Ode5C11.mode	@ltx/en_us_dedes/miscellanea:misc.Mode8
ltx/en_us_dedes/tr.d063:trMA.Ode5C11.ode	@ltx/en_us_dedes/miscellanea:misc.Ode5
ltx/en_us_dedes/tr.d063:trMA.Ode5C11.text	
ltx/en_us_dedes/tr.d063:trMA.Ode5C12.incipit	…
ltx/en_us_dedes/tr.d063:trMA.Ode5C12.melody	@ltx/en_us_dedes/he.h.m8:heHE.InaTiMeAposo.name
ltx/en_us_dedes/tr.d063:trMA.Ode5C12.mode	@ltx/en_us_dedes/miscellanea:misc.Mode8
ltx/en_us_dedes/tr.d063:trMA.Ode5C12.ode	@ltx/en_us_dedes/miscellanea:misc.Ode5
ltx/en_us_dedes/tr.d063:trMA.Ode5C12.text	
ltx/en_us_dedes/tr.d063:trMA.Ode5C13.incipit	…
ltx/en_us_dedes/tr.d063:trMA.Ode5C13.melody	@ltx/en_us_dedes/he.h.m8:heHE.InaTiMeAposo.name
ltx/en_us_dedes/tr.d063:trMA.Ode5C13.mode	@ltx/en_us_dedes/miscellanea:misc.Mode8
ltx/en_us_dedes/tr.d063:trMA.Ode5C13.ode	@ltx/en_us_dedes/miscellanea:misc.Ode5
ltx/en_us_dedes/tr.d063:trMA.Ode5C13.text	
ltx/en_us_dedes/tr.d063:trMA.Ode5C1H.greekmelody	@ltx/en_us_dedes/he.h.m8:heHE.InaTiMeAposo.greekname
ltx/en_us_dedes/tr.d063:trMA.Ode5C1H.incipit	@ltx/en_us_dedes/he.h.m8:heHE.InaTiMeAposo.incipit
ltx/en_us_dedes/tr.d063:trMA.Ode5C1H.melody	@ltx/en_us_dedes/he.h.m8:heHE.InaTiMeAposo.melody
ltx/en_us_dedes/tr.d063:trMA.Ode5C1H.mode	@ltx/en_us_dedes/miscellanea:misc.Mode8
ltx/en_us_dedes/tr.d063:trMA.Ode5C1H.ode	@ltx/en_us_dedes/miscellanea:misc.Ode5
ltx/en_us_dedes/tr.d063:trMA.Ode5C1H.text	@ltx/en_us_dedes/he.h.m8:heHE.InaTiMeAposo.text
ltx/en_us_dedes/tr.d063:trMA.Ode5C21.greekmelody	@ltx/en_us_dedes/he.h.m8:heHE.InaTiMeAposo.greekname
ltx/en_us_dedes/tr.d063:trMA.Ode5C21.incipit	…
ltx/en_us_dedes/tr.d063:trMA.Ode5C21.melody	@ltx/en_us_dedes/he.h.m8:heHE.InaTiMeAposo.name
ltx/en_us_dedes/tr.d063:trMA.Ode5C21.mode	@ltx/en_us_dedes/miscellanea:misc.Mode8
ltx/en_us_dedes/tr.d063:trMA.Ode5C21.ode	@ltx/en_us_dedes/miscellanea:misc.Ode5
ltx/en_us_dedes/tr.d063:trMA.Ode5C21.text	
ltx/en_us_dedes/tr.d063:trMA.Ode5C22.incipit	…
ltx/en_us_dedes/tr.d063:trMA.Ode5C22.melody	@ltx/en_us_dedes/he.h.m8:heHE.InaTiMeAposo.name
ltx/en_us_dedes/tr.d063:trMA.Ode5C22.mode	@ltx/en_us_dedes/miscellanea:misc.Mode8
ltx/en_us_dedes/tr.d063:trMA.Ode5C22.ode	@ltx/en_us_dedes/miscellanea:misc.Ode5
ltx/en_us_dedes/tr.d063:trMA.Ode5C22.text	
ltx/en_us_dedes/tr.d063:trMA.Ode5C23.incipit	…
ltx/en_us_dedes/tr.d063:trMA.Ode5C23.melody	@ltx/en_us_dedes/he.h.m8:heHE.InaTiMeAposo.name
ltx/en_us_dedes/tr.d063:trMA.Ode5C23.mode	@ltx/en_us_dedes/miscellanea:misc.Mode8
ltx/en_us_dedes/tr.d063:trMA.Ode5C23.ode	@ltx/en_us_dedes/miscellanea:misc.Ode5
ltx/en_us_dedes/tr.d063:trMA.Ode5C23.text	
ltx/en_us_dedes/tr.d063:trMA.Ode5C2T.incipit	…
ltx/en_us_dedes/tr.d063:trMA.Ode5C2T.melody	@ltx/en_us_dedes/he.h.m8:heHE.InaTiMeAposo.name
ltx/en_us_dedes/tr.d063:trMA.Ode5C2T.mode	@ltx/en_us_dedes/miscellanea:misc.Mode8
ltx/en_us_dedes/tr.d063:trMA.Ode5C2T.ode	@ltx/en_us_dedes/miscellanea:misc.Ode5
ltx/en_us_dedes/tr.d063:trMA.Ode5C2T.text	
ltx/en_us_dedes/tr.d063:trMA.Ode5K.incipit	@ltx/en_us_dedes/he.h.m8:heHE.InaTiMeAposo.incipit
ltx/en_us_dedes/tr.d063:trMA.Ode5K.melody	@ltx/en_us_dedes/he.h.m8:heHE.InaTiMeAposo.melody
ltx/en_us_dedes/tr.d063:trMA.Ode5K.mode	@ltx/en_us_dedes/miscellanea:misc.Mode8
ltx/en_us_dedes/tr.d063:trMA.Ode5K.ode	@ltx/en_us_dedes/miscellanea:misc.Ode5
ltx/en_us_dedes/tr.d063:trMA.Ode5K.text	@ltx/en_us_dedes/he.h.m8:heHE.InaTiMeAposo.text
ltx/en_us_dedes/tr.d063:trMA.Ode6C11.greekmelody	@ltx/en_us_dedes/he.h.m8:heHE.TonIonanEnToKitei.greekname
ltx/en_us_dedes/tr.d063:trMA.Ode6C11.incipit	…
ltx/en_us_dedes/tr.d063:trMA.Ode6C11.melody	@ltx/en_us_dedes/he.h.m8:heHE.TonIonanEnToKitei.name
ltx/en_us_dedes/tr.d063:trMA.Ode6C11.mode	@ltx/en_us_dedes/miscellanea:misc.Mode8
ltx/en_us_dedes/tr.d063:trMA.Ode6C11.ode	@ltx/en_us_dedes/miscellanea:misc.Ode6
ltx/en_us_dedes/tr.d063:trMA.Ode6C11.text	
ltx/en_us_dedes/tr.d063:trMA.Ode6C12.incipit	…
ltx/en_us_dedes/tr.d063:trMA.Ode6C12.melody	@ltx/en_us_dedes/he.h.m8:heHE.TonIonanEnToKitei.name
ltx/en_us_dedes/tr.d063:trMA.Ode6C12.mode	@ltx/en_us_dedes/miscellanea:misc.Mode8
ltx/en_us_dedes/tr.d063:trMA.Ode6C12.ode	@ltx/en_us_dedes/miscellanea:misc.Ode6
ltx/en_us_dedes/tr.d063:trMA.Ode6C12.text	
ltx/en_us_dedes/tr.d063:trMA.Ode6C1H.greekmelody	@ltx/en_us_dedes/he.h.m8:heHE.TonIonanEnToKitei.greekname
ltx/en_us_dedes/tr.d063:trMA.Ode6C1H.incipit	@ltx/en_us_dedes/he.h.m8:heHE.TonIonanEnToKitei.incipit
ltx/en_us_dedes/tr.d063:trMA.Ode6C1H.melody	@ltx/en_us_dedes/he.h.m8:heHE.TonIonanEnToKitei.melody
ltx/en_us_dedes/tr.d063:trMA.Ode6C1H.mode	@ltx/en_us_dedes/miscellanea:misc.Mode8
ltx/en_us_dedes/tr.d063:trMA.Ode6C1H.ode	@ltx/en_us_dedes/miscellanea:misc.Ode6
ltx/en_us_dedes/tr.d063:trMA.Ode6C1H.text	@ltx/en_us_dedes/he.h.m8:heHE.TonIonanEnToKitei.text
ltx/en_us_dedes/tr.d063:trMA.Ode6C21.greekmelody	@ltx/en_us_dedes/he.h.m8:heHE.IlasthitiMoiSotir.greekname
ltx/en_us_dedes/tr.d063:trMA.Ode6C21.incipit	As true God You were…
ltx/en_us_dedes/tr.d063:trMA.Ode6C21.melody	@ltx/en_us_dedes/he.h.m8:heHE.IlasthitiMoiSotir.name
ltx/en_us_dedes/tr.d063:trMA.Ode6C21.mode	@ltx/en_us_dedes/miscellanea:misc.Mode8
ltx/en_us_dedes/tr.d063:trMA.Ode6C21.ode	@ltx/en_us_dedes/miscellanea:misc.Ode6
ltx/en_us_dedes/tr.d063:trMA.Ode6C21.text	As true God You were aware * of the repose of St Lazarus, * announcing it to Your twelve disciples, O Lord of all, * and thus proved the limitless energy and action * that befits Your divinity.
ltx/en_us_dedes/tr.d063:trMA.Ode6C22.incipit	O Master uncircumscribed, * You…
ltx/en_us_dedes/tr.d063:trMA.Ode6C22.melody	@ltx/en_us_dedes/he.h.m8:heHE.IlasthitiMoiSotir.name
ltx/en_us_dedes/tr.d063:trMA.Ode6C22.mode	@ltx/en_us_dedes/miscellanea:misc.Mode8
ltx/en_us_dedes/tr.d063:trMA.Ode6C22.ode	@ltx/en_us_dedes/miscellanea:misc.Ode6
ltx/en_us_dedes/tr.d063:trMA.Ode6C22.text	O Master uncircumscribed, * You were circumscribed in the flesh, * and coming to Bethany, You wept over Lazarus * as a man; but then as God by Your will You raised him * even four days after he had died.
ltx/en_us_dedes/tr.d063:trMA.Ode6K.incipit	@ltx/en_us_dedes/he.h.m8:heHE.IlasthitiMoiSotir.incipit
ltx/en_us_dedes/tr.d063:trMA.Ode6K.melody	@ltx/en_us_dedes/he.h.m8:heHE.IlasthitiMoiSotir.melody
ltx/en_us_dedes/tr.d063:trMA.Ode6K.mode	@ltx/en_us_dedes/miscellanea:misc.Mode8
ltx/en_us_dedes/tr.d063:trMA.Ode6K.ode	@ltx/en_us_dedes/miscellanea:misc.Ode6
ltx/en_us_dedes/tr.d063:trMA.Ode6K.text	@ltx/en_us_dedes/he.h.m8:heHE.IlasthitiMoiSotir.text
ltx/en_us_dedes/tr.d063:trMA.Ode7C11.greekmelody	@ltx/en_us_dedes/he.h.m8:heHE.PaidesEvraion.greekname
ltx/en_us_dedes/tr.d063:trMA.Ode7C11.incipit	…
ltx/en_us_dedes/tr.d063:trMA.Ode7C11.melody	@ltx/en_us_dedes/he.h.m8:heHE.PaidesEvraion.name
ltx/en_us_dedes/tr.d063:trMA.Ode7C11.mode	@ltx/en_us_dedes/miscellanea:misc.Mode8
ltx/en_us_dedes/tr.d063:trMA.Ode7C11.ode	@ltx/en_us_dedes/miscellanea:misc.Ode7
ltx/en_us_dedes/tr.d063:trMA.Ode7C11.text	
ltx/en_us_dedes/tr.d063:trMA.Ode7C12.incipit	…
ltx/en_us_dedes/tr.d063:trMA.Ode7C12.melody	@ltx/en_us_dedes/he.h.m8:heHE.PaidesEvraion.name
ltx/en_us_dedes/tr.d063:trMA.Ode7C12.mode	@ltx/en_us_dedes/miscellanea:misc.Mode8
ltx/en_us_dedes/tr.d063:trMA.Ode7C12.ode	@ltx/en_us_dedes/miscellanea:misc.Ode7
ltx/en_us_dedes/tr.d063:trMA.Ode7C12.text	
ltx/en_us_dedes/tr.d063:trMA.Ode7C1H.greekmelody	@ltx/en_us_dedes/he.h.m8:heHE.PaidesEvraion.greekname
ltx/en_us_dedes/tr.d063:trMA.Ode7C1H.incipit	@ltx/en_us_dedes/he.h.m8:heHE.PaidesEvraion.incipit
ltx/en_us_dedes/tr.d063:trMA.Ode7C1H.melody	@ltx/en_us_dedes/he.h.m8:heHE.PaidesEvraion.melody
ltx/en_us_dedes/tr.d063:trMA.Ode7C1H.mode	@ltx/en_us_dedes/miscellanea:misc.Mode8
ltx/en_us_dedes/tr.d063:trMA.Ode7C1H.ode	@ltx/en_us_dedes/miscellanea:misc.Ode7
ltx/en_us_dedes/tr.d063:trMA.Ode7C1H.text	@ltx/en_us_dedes/he.h.m8:heHE.PaidesEvraion.text
ltx/en_us_dedes/tr.d063:trMA.Ode7C21.greekmelody	@ltx/en_us_dedes/he.h.m8:heHE.OiEkTisIoudaias.greekname
ltx/en_us_dedes/tr.d063:trMA.Ode7C21.incipit	…
ltx/en_us_dedes/tr.d063:trMA.Ode7C21.melody	@ltx/en_us_dedes/he.h.m8:heHE.OiEkTisIoudaias.name
ltx/en_us_dedes/tr.d063:trMA.Ode7C21.mode	@ltx/en_us_dedes/miscellanea:misc.Mode8
ltx/en_us_dedes/tr.d063:trMA.Ode7C21.ode	@ltx/en_us_dedes/miscellanea:misc.Ode7
ltx/en_us_dedes/tr.d063:trMA.Ode7C21.text	
ltx/en_us_dedes/tr.d063:trMA.Ode7C22.incipit	…
ltx/en_us_dedes/tr.d063:trMA.Ode7C22.melody	@ltx/en_us_dedes/he.h.m8:heHE.OiEkTisIoudaias.name
ltx/en_us_dedes/tr.d063:trMA.Ode7C22.mode	@ltx/en_us_dedes/miscellanea:misc.Mode8
ltx/en_us_dedes/tr.d063:trMA.Ode7C22.ode	@ltx/en_us_dedes/miscellanea:misc.Ode7
ltx/en_us_dedes/tr.d063:trMA.Ode7C22.text	
ltx/en_us_dedes/tr.d063:trMA.Ode7C23.incipit	…
ltx/en_us_dedes/tr.d063:trMA.Ode7C23.melody	@ltx/en_us_dedes/he.h.m8:heHE.OiEkTisIoudaias.name
ltx/en_us_dedes/tr.d063:trMA.Ode7C23.mode	@ltx/en_us_dedes/miscellanea:misc.Mode8
ltx/en_us_dedes/tr.d063:trMA.Ode7C23.ode	@ltx/en_us_dedes/miscellanea:misc.Ode7
ltx/en_us_dedes/tr.d063:trMA.Ode7C23.text	
ltx/en_us_dedes/tr.d063:trMA.Ode7K.incipit	@ltx/en_us_dedes/he.h.m8:heHE.OiEkTisIoudaias.incipit
ltx/en_us_dedes/tr.d063:trMA.Ode7K.melody	@ltx/en_us_dedes/he.h.m8:heHE.OiEkTisIoudaias.melody
ltx/en_us_dedes/tr.d063:trMA.Ode7K.mode	@ltx/en_us_dedes/miscellanea:misc.Mode8
ltx/en_us_dedes/tr.d063:trMA.Ode7K.ode	@ltx/en_us_dedes/miscellanea:misc.Ode7
ltx/en_us_dedes/tr.d063:trMA.Ode7K.text	@ltx/en_us_dedes/he.h.m8:heHE.OiEkTisIoudaias.text
ltx/en_us_dedes/tr.d063:trMA.Ode8C11.greekmelody	@ltx/en_us_dedes/he.h.m8:heHE.MousikonOrganon.greekname
ltx/en_us_dedes/tr.d063:trMA.Ode8C11.incipit	…
ltx/en_us_dedes/tr.d063:trMA.Ode8C11.melody	@ltx/en_us_dedes/he.h.m8:heHE.MousikonOrganon.name
ltx/en_us_dedes/tr.d063:trMA.Ode8C11.mode	@ltx/en_us_dedes/miscellanea:misc.Mode8
ltx/en_us_dedes/tr.d063:trMA.Ode8C11.ode	@ltx/en_us_dedes/miscellanea:misc.Ode8
ltx/en_us_dedes/tr.d063:trMA.Ode8C11.text	
ltx/en_us_dedes/tr.d063:trMA.Ode8C12.incipit	…
ltx/en_us_dedes/tr.d063:trMA.Ode8C12.melody	@ltx/en_us_dedes/he.h.m8:heHE.MousikonOrganon.name
ltx/en_us_dedes/tr.d063:trMA.Ode8C12.mode	@ltx/en_us_dedes/miscellanea:misc.Mode8
ltx/en_us_dedes/tr.d063:trMA.Ode8C12.ode	@ltx/en_us_dedes/miscellanea:misc.Ode8
ltx/en_us_dedes/tr.d063:trMA.Ode8C12.text	
ltx/en_us_dedes/tr.d063:trMA.Ode8C1H.greekmelody	@ltx/en_us_dedes/he.h.m8:heHE.MousikonOrganon.greekname
ltx/en_us_dedes/tr.d063:trMA.Ode8C1H.incipit	@ltx/en_us_dedes/he.h.m8:heHE.MousikonOrganon.incipit
ltx/en_us_dedes/tr.d063:trMA.Ode8C1H.melody	@ltx/en_us_dedes/he.h.m8:heHE.MousikonOrganon.melody
ltx/en_us_dedes/tr.d063:trMA.Ode8C1H.mode	@ltx/en_us_dedes/miscellanea:misc.Mode8
ltx/en_us_dedes/tr.d063:trMA.Ode8C1H.ode	@ltx/en_us_dedes/miscellanea:misc.Ode8
ltx/en_us_dedes/tr.d063:trMA.Ode8C1H.text	@ltx/en_us_dedes/he.h.m8:heHE.MousikonOrganon.text
ltx/en_us_dedes/tr.d063:trMA.Ode8C21.greekmelody	@ltx/en_us_dedes/he.h.m8:heHE.TonVasileaTonOuranon.greekname
ltx/en_us_dedes/tr.d063:trMA.Ode8C21.incipit	…
ltx/en_us_dedes/tr.d063:trMA.Ode8C21.melody	@ltx/en_us_dedes/he.h.m8:heHE.TonVasileaTonOuranon.name
ltx/en_us_dedes/tr.d063:trMA.Ode8C21.mode	@ltx/en_us_dedes/miscellanea:misc.Mode8
ltx/en_us_dedes/tr.d063:trMA.Ode8C21.ode	@ltx/en_us_dedes/miscellanea:misc.Ode8
ltx/en_us_dedes/tr.d063:trMA.Ode8C21.text	
ltx/en_us_dedes/tr.d063:trMA.Ode8C22.incipit	…
ltx/en_us_dedes/tr.d063:trMA.Ode8C22.melody	@ltx/en_us_dedes/he.h.m8:heHE.TonVasileaTonOuranon.name
ltx/en_us_dedes/tr.d063:trMA.Ode8C22.mode	@ltx/en_us_dedes/miscellanea:misc.Mode8
ltx/en_us_dedes/tr.d063:trMA.Ode8C22.ode	@ltx/en_us_dedes/miscellanea:misc.Ode8
ltx/en_us_dedes/tr.d063:trMA.Ode8C22.text	
ltx/en_us_dedes/tr.d063:trMA.Ode8C23.incipit	…
ltx/en_us_dedes/tr.d063:trMA.Ode8C23.melody	@ltx/en_us_dedes/he.h.m8:heHE.TonVasileaTonOuranon.name
ltx/en_us_dedes/tr.d063:trMA.Ode8C23.mode	@ltx/en_us_dedes/miscellanea:misc.Mode8
ltx/en_us_dedes/tr.d063:trMA.Ode8C23.ode	@ltx/en_us_dedes/miscellanea:misc.Ode8
ltx/en_us_dedes/tr.d063:trMA.Ode8C23.text	
ltx/en_us_dedes/tr.d063:trMA.Ode8K.incipit	@ltx/en_us_dedes/he.h.m8:heHE.TonVasileaTonOuranon.incipit
ltx/en_us_dedes/tr.d063:trMA.Ode8K.melody	@ltx/en_us_dedes/he.h.m8:heHE.TonVasileaTonOuranon.melody
ltx/en_us_dedes/tr.d063:trMA.Ode8K.mode	@ltx/en_us_dedes/miscellanea:misc.Mode8
ltx/en_us_dedes/tr.d063:trMA.Ode8K.ode	@ltx/en_us_dedes/miscellanea:misc.Ode8
ltx/en_us_dedes/tr.d063:trMA.Ode8K.text	@ltx/en_us_dedes/he.h.m8:heHE.TonVasileaTonOuranon.text
ltx/en_us_dedes/tr.d063:trMA.Ode9C11.greekmelody	@ltx/en_us_dedes/he.h.m8:heHE.TinAgninEndoxos.greekname
ltx/en_us_dedes/tr.d063:trMA.Ode9C11.incipit	When they saw him walking…
ltx/en_us_dedes/tr.d063:trMA.Ode9C11.melody	@ltx/en_us_dedes/he.h.m8:heHE.TinAgninEndoxos.name
ltx/en_us_dedes/tr.d063:trMA.Ode9C11.mode	@ltx/en_us_dedes/miscellanea:misc.Mode8
ltx/en_us_dedes/tr.d063:trMA.Ode9C11.ode	@ltx/en_us_dedes/miscellanea:misc.Ode9
ltx/en_us_dedes/tr.d063:trMA.Ode9C11.text	When they saw him walking who had been dead * for four days, the people * were amazed by the miracle and cried to the Redeemer: * With never-silent hymns, O God, we magnify You.
ltx/en_us_dedes/tr.d063:trMA.Ode9C12.incipit	In advance affirming Your glorious…
ltx/en_us_dedes/tr.d063:trMA.Ode9C12.melody	@ltx/en_us_dedes/he.h.m8:heHE.TinAgninEndoxos.name
ltx/en_us_dedes/tr.d063:trMA.Ode9C12.mode	@ltx/en_us_dedes/miscellanea:misc.Mode8
ltx/en_us_dedes/tr.d063:trMA.Ode9C12.ode	@ltx/en_us_dedes/miscellanea:misc.Ode9
ltx/en_us_dedes/tr.d063:trMA.Ode9C12.text	In advance affirming Your glorious * arising, my Savior, * from Hades You liberate Lazarus who had been dead for * four days. Hence I magnify You with hymns.
ltx/en_us_dedes/tr.d063:trMA.Ode9C1H.greekmelody	@ltx/en_us_dedes/he.h.m8:heHE.TinAgninEndoxos.greekname
ltx/en_us_dedes/tr.d063:trMA.Ode9C1H.incipit	@ltx/en_us_dedes/he.h.m8:heHE.TinAgninEndoxos.incipit
ltx/en_us_dedes/tr.d063:trMA.Ode9C1H.melody	@ltx/en_us_dedes/he.h.m8:heHE.TinAgninEndoxos.melody
ltx/en_us_dedes/tr.d063:trMA.Ode9C1H.mode	@ltx/en_us_dedes/miscellanea:misc.Mode8
ltx/en_us_dedes/tr.d063:trMA.Ode9C1H.ode	@ltx/en_us_dedes/miscellanea:misc.Ode9
ltx/en_us_dedes/tr.d063:trMA.Ode9C1H.text	@ltx/en_us_dedes/he.h.m8:heHE.TinAgninEndoxos.text
ltx/en_us_dedes/tr.d063:trMA.Ode9C21.greekmelody	@ltx/en_us_dedes/he.h.m8:heHE.KyriosTheotokon.greekname
ltx/en_us_dedes/tr.d063:trMA.Ode9C21.incipit	In honor of Your Father…
ltx/en_us_dedes/tr.d063:trMA.Ode9C21.melody	@ltx/en_us_dedes/he.h.m8:heHE.KyriosTheotokon.name
ltx/en_us_dedes/tr.d063:trMA.Ode9C21.mode	@ltx/en_us_dedes/miscellanea:misc.Mode8
ltx/en_us_dedes/tr.d063:trMA.Ode9C21.ode	@ltx/en_us_dedes/miscellanea:misc.Ode9
ltx/en_us_dedes/tr.d063:trMA.Ode9C21.text	In honor of Your Father * and thus demonstrating * that You were not against God, Christ, You pray to Him, * when by an act of Your free will * You raised one four-days-dead.
ltx/en_us_dedes/tr.d063:trMA.Ode9C22.incipit	An all-trustworthy witness * of…
ltx/en_us_dedes/tr.d063:trMA.Ode9C22.melody	@ltx/en_us_dedes/he.h.m8:heHE.KyriosTheotokon.name
ltx/en_us_dedes/tr.d063:trMA.Ode9C22.mode	@ltx/en_us_dedes/miscellanea:misc.Mode8
ltx/en_us_dedes/tr.d063:trMA.Ode9C22.ode	@ltx/en_us_dedes/miscellanea:misc.Ode9
ltx/en_us_dedes/tr.d063:trMA.Ode9C22.text	An all-trustworthy witness * of Your three-day rising * You show to all in the person of Lazarus, * when from the grave after four days * You raised him, O my Christ.
ltx/en_us_dedes/tr.d063:trMA.Ode9C23.incipit	To demonstrate Your human *…
ltx/en_us_dedes/tr.d063:trMA.Ode9C23.melody	@ltx/en_us_dedes/he.h.m8:heHE.KyriosTheotokon.name
ltx/en_us_dedes/tr.d063:trMA.Ode9C23.mode	@ltx/en_us_dedes/miscellanea:misc.Mode8
ltx/en_us_dedes/tr.d063:trMA.Ode9C23.ode	@ltx/en_us_dedes/miscellanea:misc.Ode9
ltx/en_us_dedes/tr.d063:trMA.Ode9C23.text	To demonstrate Your human * energy, my Savior, * You walk and weep and You ask where is Lazarus; * and to declare Your divine such, * You raise him from the dead.
ltx/en_us_dedes/tr.d063:trMA.Ode9C24.incipit	O Master and my Savior…
ltx/en_us_dedes/tr.d063:trMA.Ode9C24.melody	@ltx/en_us_dedes/he.h.m8:heHE.KyriosTheotokon.name
ltx/en_us_dedes/tr.d063:trMA.Ode9C24.mode	@ltx/en_us_dedes/miscellanea:misc.Mode8
ltx/en_us_dedes/tr.d063:trMA.Ode9C24.ode	@ltx/en_us_dedes/miscellanea:misc.Ode9
ltx/en_us_dedes/tr.d063:trMA.Ode9C24.text	O Master and my Savior, * by the freely chosen * and voluntary effecting of each of Your wills, * You brought about my salvation * in ways surpassing speech.
ltx/en_us_dedes/tr.d063:trMA.Ode9K.incipit	@ltx/en_us_dedes/he.h.m8:heHE.KyriosTheotokon.incipit
ltx/en_us_dedes/tr.d063:trMA.Ode9K.melody	@ltx/en_us_dedes/he.h.m8:heHE.KyriosTheotokon.melody
ltx/en_us_dedes/tr.d063:trMA.Ode9K.mode	@ltx/en_us_dedes/miscellanea:misc.Mode8
ltx/en_us_dedes/tr.d063:trMA.Ode9K.ode	@ltx/en_us_dedes/miscellanea:misc.Ode9
ltx/en_us_dedes/tr.d063:trMA.Ode9K.text	@ltx/en_us_dedes/he.h.m8:heHE.KyriosTheotokon.text
ltx/en_us_dedes/tr.d063:trMA.Oikos1.text	
ltx/en_us_dedes/tr.d063:trSY.commemoration.couplet1.title	@ltx/en_us_dedes/titles:ti.Verses
ltx/en_us_dedes/tr.d063:trSY.commemoration.couplet1.verse1	O Jesus, You grieve: a token of mortal essence.
ltx/en_us_dedes/tr.d063:trSY.commemoration.couplet1.verse2	Your friend You revive: a token of divine potence.
ltx/en_us_dedes/tr.d063:trSY.commemoration.narration.p01	[paragraph 01]
ltx/en_us_dedes/tr.d063:trSY.commemoration.narration.p02	[paragraph 02]
ltx/en_us_dedes/tr.d063:trSY.commemoration.narration.p03	[paragraph 03]
ltx/en_us_dedes/tr.d063:trSY.commemoration.narration.p04	[paragraph 04]
ltx/en_us_dedes/tr.d063:trSY.commemoration.narration.p05	[paragraph 05]
ltx/en_us_dedes/tr.d063:trSY.commemoration.narration.p06	[paragraph 06]
ltx/en_us_dedes/tr.d063:trSY.commemoration.narration.p07	[paragraph 07]
ltx/en_us_dedes/tr.d063:trSY.commemoration.text	On this day, the Saturday before Palm Sunday, we celebrate the raising of the holy and righteous friend of Christ, Lazarus, who had been four days in the grave.
ltx/en_us_dedes/tr.d063:trSY.lastline	At the intercession of Your friend Lazarus, O Christ God, have mercy on us. Amen.
ltx/en_us_dedes/tr.d063:trVE.Apolytikion1.incipit	To confirm the general resurrection…
ltx/en_us_dedes/tr.d063:trVE.Apolytikion1.melody	
ltx/en_us_dedes/tr.d063:trVE.Apolytikion1.mode	@ltx/en_us_dedes/miscellanea:misc.Mode1
ltx/en_us_dedes/tr.d063:trVE.Apolytikion1.text	To confirm the general resurrection before Your Passion, You resurrected Lazarus from the dead, O Christ our God. Therefore imitating the children, carrying the symbols of victory, we cry out to You the Victor over death: “Hosanna in the highest! Blessed are You, the One, who comes in the name of the Lord.”
ltx/en_us_dedes/tr.d063:trVE.AposIdiomelon1.incipit	Now that we have finished…
ltx/en_us_dedes/tr.d063:trVE.AposIdiomelon1.melody	@ltx/en_us_dedes/miscellanea:misc.Idiomelon
ltx/en_us_dedes/tr.d063:trVE.AposIdiomelon1.mode	@ltx/en_us_dedes/miscellanea:misc.Mode8
ltx/en_us_dedes/tr.d063:trVE.AposIdiomelon1.text	Now that we have finished the forty-day fast of Lent, we pray that we may see the Holy Week of Your Passion, O benevolent Savior, so that during it we may glorify Your great works and Your ineffable plan for our salvation, and that with one heart we may sing: Glory to You, O Lord!
ltx/en_us_dedes/tr.d063:trVE.AposMartyric.incipit	@ltx/en_us_dedes/oc.m8.d3:ocVE.Aposticha3.incipit
ltx/en_us_dedes/tr.d063:trVE.AposMartyric.melody	
ltx/en_us_dedes/tr.d063:trVE.AposMartyric.mode	@ltx/en_us_dedes/miscellanea:misc.Mode8
ltx/en_us_dedes/tr.d063:trVE.AposMartyric.text	@ltx/en_us_dedes/oc.m8.d3:ocVE.Aposticha3.text
ltx/en_us_dedes/tr.d063:trVE.SticBoth.incipit	Now that we have finished…
ltx/en_us_dedes/tr.d063:trVE.SticBoth.melody	@ltx/en_us_dedes/miscellanea:misc.Idiomelon
ltx/en_us_dedes/tr.d063:trVE.SticBoth.mode	@ltx/en_us_dedes/miscellanea:misc.Mode8
ltx/en_us_dedes/tr.d063:trVE.SticBoth.poet	@ltx/en_us_dedes/poets:po.AndreouTyflou
ltx/en_us_dedes/tr.d063:trVE.SticBoth.text	Now that we have finished the forty-day fast of Lent, let us cry out: “We salute you, O city of Bethany; rejoice, O hometown of Lazarus! Rejoice, Martha and Mary, his sisters! Tomorrow, Christ will come, and by His word will revive your brother who has died. At the sound of the Lord’s voice, Hades, bitter and insatiable, will shudder in fear, and it will heave a great sigh, and it will release Lazarus, still bound with bandages. The Hebrew crowds will be amazed by the miracle, and they will go out to meet Jesus with palms and branches; and children, whose elders envy Him, will see Him and sing His praises: ‘Blessed is He who comes in the name of the Lord, even the King of Israel!’”
ltx/en_us_dedes/tr.d063:trVE.SticGlory.incipit	You stood at the gravesite…
ltx/en_us_dedes/tr.d063:trVE.SticGlory.melody	@ltx/en_us_dedes/miscellanea:misc.Idiomelon
ltx/en_us_dedes/tr.d063:trVE.SticGlory.mode	@ltx/en_us_dedes/miscellanea:misc.Mode8
ltx/en_us_dedes/tr.d063:trVE.SticGlory.text	You stood at the gravesite of Lazarus, O our Savior, and You called to the dead man, and You raised him from the dead as if from sleep. He shook off corruption by the spirit of incorruption, and at Your word he came out, still bound with bandages. You can do anything. Everything serves You, O benevolent Lord. Everything is subject to You, our Savior. Glory to You!
ltx/en_us_dedes/tr.d063:trVE.Stichera01.incipit	Lord, as You were nearing…
ltx/en_us_dedes/tr.d063:trVE.Stichera01.melody	@ltx/en_us_dedes/miscellanea:misc.Idiomelon
ltx/en_us_dedes/tr.d063:trVE.Stichera01.mode	@ltx/en_us_dedes/miscellanea:misc.Mode6
ltx/en_us_dedes/tr.d063:trVE.Stichera01.poet	@ltx/en_us_dedes/poets:po.LeontosTouVasileos
ltx/en_us_dedes/tr.d063:trVE.Stichera01.text	Lord, as You were nearing the time that of Your own will You would dwell in a tomb, You wished to see the tomb of Lazarus. You asked, “Where have you laid him?” When You learned what You already knew, You called to Your beloved friend, “Lazarus, come out.” And he, whose breathing had ceased, obeyed You, the One who gave him breath, the Savior of our souls.
ltx/en_us_dedes/tr.d063:trVE.Stichera02.incipit	Lord, You went to the…
ltx/en_us_dedes/tr.d063:trVE.Stichera02.melody	@ltx/en_us_dedes/miscellanea:misc.Idiomelon
ltx/en_us_dedes/tr.d063:trVE.Stichera02.mode	@ltx/en_us_dedes/miscellanea:misc.Mode6
ltx/en_us_dedes/tr.d063:trVE.Stichera02.text	Lord, You went to the gravesite, to the tomb of Lazarus, who had died four days before. You wept tears over Your friend, and You, the stalk of life, raised him who had died four days before. Your voice put death in bondage, as hands unbound the bandages. Then the company of disciples was filled with joy, and the people all together sang in unison: “Blessed are You, O Savior!” Have mercy on us.
ltx/en_us_dedes/tr.d063:trVE.Stichera03.incipit	Lord, the sound of Your…
ltx/en_us_dedes/tr.d063:trVE.Stichera03.melody	@ltx/en_us_dedes/miscellanea:misc.Idiomelon
ltx/en_us_dedes/tr.d063:trVE.Stichera03.mode	@ltx/en_us_dedes/miscellanea:misc.Mode6
ltx/en_us_dedes/tr.d063:trVE.Stichera03.text	Lord, the sound of Your voice demolished the palaces of Hades, and Your authoritative word raised Lazarus from the tomb, after he was dead for four days. And thus he was a prelude to our own regeneration and salvation. You can do all things, O Master, as the King over all. To us Your servants grant forgiveness and the great mercy.
ltx/en_us_dedes/tr.d063:trVE.Stichera04.incipit	Lord, You wanted to give…
ltx/en_us_dedes/tr.d063:trVE.Stichera04.melody	@ltx/en_us_dedes/miscellanea:misc.Idiomelon
ltx/en_us_dedes/tr.d063:trVE.Stichera04.mode	@ltx/en_us_dedes/miscellanea:misc.Mode6
ltx/en_us_dedes/tr.d063:trVE.Stichera04.text	Lord, You wanted to give Your disciples assurance of Your own resurrection from the dead. So You went to where Lazarus was buried. When You called him, Hades was despoiled, and it released him who had been dead for four days, and he cried out to You: “O blessed Lord, glory to You!”
ltx/en_us_dedes/tr.d063:trVE.Stichera05.incipit	Lord, You took Your disciples…
ltx/en_us_dedes/tr.d063:trVE.Stichera05.melody	@ltx/en_us_dedes/miscellanea:misc.Idiomelon
ltx/en_us_dedes/tr.d063:trVE.Stichera05.mode	@ltx/en_us_dedes/miscellanea:misc.Mode6
ltx/en_us_dedes/tr.d063:trVE.Stichera05.text	Lord, You took Your disciples and went to Bethany, in order to raise Lazarus. You wept for him, according to the laws of human nature; and as God, You raised him, who had been dead for four days. And he cried out to You, the Savior: “O blessed Lord, glory to You!”
ltx/en_us_dedes/tr.d063:trVL.header	Presanctified Liturgy on Friday Before Palm Sunday
