ltx/en_us_dedes/me.m01.d04:meCO.C1.acrostic.notice1	
ltx/en_us_dedes/me.m01.d04:meCO.C1.acrostic.text	
ltx/en_us_dedes/me.m01.d04:meCO.C1.acrostic.title	
ltx/en_us_dedes/me.m01.d04:meCO.C1.title	@ltx/en_us_dedes/titles:ti.TheCanon
ltx/en_us_dedes/me.m01.d04:meCO.C1.verse	@ltx/en_us_dedes/prayers:pr.verse_God.text
ltx/en_us_dedes/me.m01.d04:meCO.Ode1C11.incipit	…
ltx/en_us_dedes/me.m01.d04:meCO.Ode1C11.melody	@ltx/en_us_dedes/he.h.m6:heHE.TmitheisiTmatai.name
ltx/en_us_dedes/me.m01.d04:meCO.Ode1C11.mode	@ltx/en_us_dedes/miscellanea:misc.Mode6
ltx/en_us_dedes/me.m01.d04:meCO.Ode1C11.ode	@ltx/en_us_dedes/miscellanea:misc.Ode1
ltx/en_us_dedes/me.m01.d04:meCO.Ode1C11.text	
ltx/en_us_dedes/me.m01.d04:meCO.Ode1C12.incipit	…
ltx/en_us_dedes/me.m01.d04:meCO.Ode1C12.melody	@ltx/en_us_dedes/he.h.m6:heHE.TmitheisiTmatai.name
ltx/en_us_dedes/me.m01.d04:meCO.Ode1C12.mode	@ltx/en_us_dedes/miscellanea:misc.Mode6
ltx/en_us_dedes/me.m01.d04:meCO.Ode1C12.ode	@ltx/en_us_dedes/miscellanea:misc.Ode1
ltx/en_us_dedes/me.m01.d04:meCO.Ode1C12.text	
ltx/en_us_dedes/me.m01.d04:meCO.Ode1C13.incipit	…
ltx/en_us_dedes/me.m01.d04:meCO.Ode1C13.melody	@ltx/en_us_dedes/he.h.m6:heHE.TmitheisiTmatai.name
ltx/en_us_dedes/me.m01.d04:meCO.Ode1C13.mode	@ltx/en_us_dedes/miscellanea:misc.Mode6
ltx/en_us_dedes/me.m01.d04:meCO.Ode1C13.ode	@ltx/en_us_dedes/miscellanea:misc.Ode1
ltx/en_us_dedes/me.m01.d04:meCO.Ode1C13.text	
ltx/en_us_dedes/me.m01.d04:meCO.Ode1C1H.incipit	@ltx/en_us_dedes/he.h.m6:heHE.TmitheisiTmatai.incipit
ltx/en_us_dedes/me.m01.d04:meCO.Ode1C1H.melody	@ltx/en_us_dedes/he.h.m6:heHE.TmitheisiTmatai.melody
ltx/en_us_dedes/me.m01.d04:meCO.Ode1C1H.mode	@ltx/en_us_dedes/miscellanea:misc.Mode6
ltx/en_us_dedes/me.m01.d04:meCO.Ode1C1H.ode	@ltx/en_us_dedes/miscellanea:misc.Ode1
ltx/en_us_dedes/me.m01.d04:meCO.Ode1C1H.text	@ltx/en_us_dedes/he.h.m6:heHE.TmitheisiTmatai.text
ltx/en_us_dedes/me.m01.d04:meCO.Ode3C11.incipit	…
ltx/en_us_dedes/me.m01.d04:meCO.Ode3C11.melody	@ltx/en_us_dedes/he.h.m6:heHE.KyriosOnPantonEpiphany.name
ltx/en_us_dedes/me.m01.d04:meCO.Ode3C11.mode	@ltx/en_us_dedes/miscellanea:misc.Mode6
ltx/en_us_dedes/me.m01.d04:meCO.Ode3C11.ode	@ltx/en_us_dedes/miscellanea:misc.Ode3
ltx/en_us_dedes/me.m01.d04:meCO.Ode3C11.text	
ltx/en_us_dedes/me.m01.d04:meCO.Ode3C12.incipit	…
ltx/en_us_dedes/me.m01.d04:meCO.Ode3C12.melody	@ltx/en_us_dedes/he.h.m6:heHE.KyriosOnPantonEpiphany.name
ltx/en_us_dedes/me.m01.d04:meCO.Ode3C12.mode	@ltx/en_us_dedes/miscellanea:misc.Mode6
ltx/en_us_dedes/me.m01.d04:meCO.Ode3C12.ode	@ltx/en_us_dedes/miscellanea:misc.Ode3
ltx/en_us_dedes/me.m01.d04:meCO.Ode3C12.text	
ltx/en_us_dedes/me.m01.d04:meCO.Ode3C1H.incipit	@ltx/en_us_dedes/he.h.m6:heHE.KyriosOnPantonEpiphany.incipit
ltx/en_us_dedes/me.m01.d04:meCO.Ode3C1H.melody	@ltx/en_us_dedes/he.h.m6:heHE.KyriosOnPantonEpiphany.melody
ltx/en_us_dedes/me.m01.d04:meCO.Ode3C1H.mode	@ltx/en_us_dedes/miscellanea:misc.Mode6
ltx/en_us_dedes/me.m01.d04:meCO.Ode3C1H.ode	@ltx/en_us_dedes/miscellanea:misc.Ode3
ltx/en_us_dedes/me.m01.d04:meCO.Ode3C1H.text	@ltx/en_us_dedes/he.h.m6:heHE.KyriosOnPantonEpiphany.text
ltx/en_us_dedes/me.m01.d04:meCO.Ode4C11.incipit	…
ltx/en_us_dedes/me.m01.d04:meCO.Ode4C11.melody	@ltx/en_us_dedes/he.h.m6:heHE.ProkatidonOProfitis.name
ltx/en_us_dedes/me.m01.d04:meCO.Ode4C11.mode	@ltx/en_us_dedes/miscellanea:misc.Mode6
ltx/en_us_dedes/me.m01.d04:meCO.Ode4C11.ode	@ltx/en_us_dedes/miscellanea:misc.Ode4
ltx/en_us_dedes/me.m01.d04:meCO.Ode4C11.text	
ltx/en_us_dedes/me.m01.d04:meCO.Ode4C12.incipit	…
ltx/en_us_dedes/me.m01.d04:meCO.Ode4C12.melody	@ltx/en_us_dedes/he.h.m6:heHE.ProkatidonOProfitis.name
ltx/en_us_dedes/me.m01.d04:meCO.Ode4C12.mode	@ltx/en_us_dedes/miscellanea:misc.Mode6
ltx/en_us_dedes/me.m01.d04:meCO.Ode4C12.ode	@ltx/en_us_dedes/miscellanea:misc.Ode4
ltx/en_us_dedes/me.m01.d04:meCO.Ode4C12.text	
ltx/en_us_dedes/me.m01.d04:meCO.Ode4C13.incipit	…
ltx/en_us_dedes/me.m01.d04:meCO.Ode4C13.melody	@ltx/en_us_dedes/he.h.m6:heHE.ProkatidonOProfitis.name
ltx/en_us_dedes/me.m01.d04:meCO.Ode4C13.mode	@ltx/en_us_dedes/miscellanea:misc.Mode6
ltx/en_us_dedes/me.m01.d04:meCO.Ode4C13.ode	@ltx/en_us_dedes/miscellanea:misc.Ode4
ltx/en_us_dedes/me.m01.d04:meCO.Ode4C13.text	
ltx/en_us_dedes/me.m01.d04:meCO.Ode4C1H.incipit	@ltx/en_us_dedes/he.h.m6:heHE.ProkatidonOProfitisEpiphany.incipit
ltx/en_us_dedes/me.m01.d04:meCO.Ode4C1H.melody	@ltx/en_us_dedes/he.h.m6:heHE.ProkatidonOProfitisEpiphany.melody
ltx/en_us_dedes/me.m01.d04:meCO.Ode4C1H.mode	@ltx/en_us_dedes/miscellanea:misc.Mode6
ltx/en_us_dedes/me.m01.d04:meCO.Ode4C1H.ode	@ltx/en_us_dedes/miscellanea:misc.Ode4
ltx/en_us_dedes/me.m01.d04:meCO.Ode4C1H.text	@ltx/en_us_dedes/he.h.m6:heHE.ProkatidonOProfitisEpiphany.text
ltx/en_us_dedes/me.m01.d04:meCO.Ode5C11.incipit	…
ltx/en_us_dedes/me.m01.d04:meCO.Ode5C11.melody	@ltx/en_us_dedes/he.h.m6:heHE.ToSyndesmoTisAgapis.name
ltx/en_us_dedes/me.m01.d04:meCO.Ode5C11.mode	@ltx/en_us_dedes/miscellanea:misc.Mode6
ltx/en_us_dedes/me.m01.d04:meCO.Ode5C11.ode	@ltx/en_us_dedes/miscellanea:misc.Ode5
ltx/en_us_dedes/me.m01.d04:meCO.Ode5C11.text	
ltx/en_us_dedes/me.m01.d04:meCO.Ode5C12.incipit	…
ltx/en_us_dedes/me.m01.d04:meCO.Ode5C12.melody	@ltx/en_us_dedes/he.h.m6:heHE.ToSyndesmoTisAgapis.name
ltx/en_us_dedes/me.m01.d04:meCO.Ode5C12.mode	@ltx/en_us_dedes/miscellanea:misc.Mode6
ltx/en_us_dedes/me.m01.d04:meCO.Ode5C12.ode	@ltx/en_us_dedes/miscellanea:misc.Ode5
ltx/en_us_dedes/me.m01.d04:meCO.Ode5C12.text	
ltx/en_us_dedes/me.m01.d04:meCO.Ode5C1H.incipit	@ltx/en_us_dedes/he.h.m6:heHE.ToSyndesmoTisDeilias.incipit
ltx/en_us_dedes/me.m01.d04:meCO.Ode5C1H.melody	@ltx/en_us_dedes/he.h.m6:heHE.ToSyndesmoTisDeilias.melody
ltx/en_us_dedes/me.m01.d04:meCO.Ode5C1H.mode	@ltx/en_us_dedes/miscellanea:misc.Mode6
ltx/en_us_dedes/me.m01.d04:meCO.Ode5C1H.ode	@ltx/en_us_dedes/miscellanea:misc.Ode5
ltx/en_us_dedes/me.m01.d04:meCO.Ode5C1H.text	@ltx/en_us_dedes/he.h.m6:heHE.ToSyndesmoTisDeilias.text
ltx/en_us_dedes/me.m01.d04:meCO.Ode6C11.incipit	…
ltx/en_us_dedes/me.m01.d04:meCO.Ode6C11.melody	@ltx/en_us_dedes/he.h.m6:heHE.AvyssosEschati.name
ltx/en_us_dedes/me.m01.d04:meCO.Ode6C11.mode	@ltx/en_us_dedes/miscellanea:misc.Mode6
ltx/en_us_dedes/me.m01.d04:meCO.Ode6C11.ode	@ltx/en_us_dedes/miscellanea:misc.Ode6
ltx/en_us_dedes/me.m01.d04:meCO.Ode6C11.text	
ltx/en_us_dedes/me.m01.d04:meCO.Ode6C12.incipit	…
ltx/en_us_dedes/me.m01.d04:meCO.Ode6C12.melody	@ltx/en_us_dedes/he.h.m6:heHE.AvyssosEschati.name
ltx/en_us_dedes/me.m01.d04:meCO.Ode6C12.mode	@ltx/en_us_dedes/miscellanea:misc.Mode6
ltx/en_us_dedes/me.m01.d04:meCO.Ode6C12.ode	@ltx/en_us_dedes/miscellanea:misc.Ode6
ltx/en_us_dedes/me.m01.d04:meCO.Ode6C12.text	
ltx/en_us_dedes/me.m01.d04:meCO.Ode6C1H.incipit	@ltx/en_us_dedes/he.h.m6:heHE.AvyssosEschati.incipit
ltx/en_us_dedes/me.m01.d04:meCO.Ode6C1H.melody	@ltx/en_us_dedes/he.h.m6:heHE.AvyssosEschati.melody
ltx/en_us_dedes/me.m01.d04:meCO.Ode6C1H.mode	@ltx/en_us_dedes/miscellanea:misc.Mode6
ltx/en_us_dedes/me.m01.d04:meCO.Ode6C1H.ode	@ltx/en_us_dedes/miscellanea:misc.Ode6
ltx/en_us_dedes/me.m01.d04:meCO.Ode6C1H.text	@ltx/en_us_dedes/he.h.m6:heHE.AvyssosEschati.text
ltx/en_us_dedes/me.m01.d04:meCO.Ode7C11.incipit	…
ltx/en_us_dedes/me.m01.d04:meCO.Ode7C11.melody	@ltx/en_us_dedes/he.h.m6:heHE.OiPaidesEnVavyloni.name
ltx/en_us_dedes/me.m01.d04:meCO.Ode7C11.mode	@ltx/en_us_dedes/miscellanea:misc.Mode6
ltx/en_us_dedes/me.m01.d04:meCO.Ode7C11.ode	@ltx/en_us_dedes/miscellanea:misc.Ode7
ltx/en_us_dedes/me.m01.d04:meCO.Ode7C11.text	
ltx/en_us_dedes/me.m01.d04:meCO.Ode7C12.incipit	…
ltx/en_us_dedes/me.m01.d04:meCO.Ode7C12.melody	@ltx/en_us_dedes/he.h.m6:heHE.OiPaidesEnVavyloni.name
ltx/en_us_dedes/me.m01.d04:meCO.Ode7C12.mode	@ltx/en_us_dedes/miscellanea:misc.Mode6
ltx/en_us_dedes/me.m01.d04:meCO.Ode7C12.ode	@ltx/en_us_dedes/miscellanea:misc.Ode7
ltx/en_us_dedes/me.m01.d04:meCO.Ode7C12.text	
ltx/en_us_dedes/me.m01.d04:meCO.Ode7C13.incipit	…
ltx/en_us_dedes/me.m01.d04:meCO.Ode7C13.melody	@ltx/en_us_dedes/he.h.m6:heHE.OiPaidesEnVavyloni.name
ltx/en_us_dedes/me.m01.d04:meCO.Ode7C13.mode	@ltx/en_us_dedes/miscellanea:misc.Mode6
ltx/en_us_dedes/me.m01.d04:meCO.Ode7C13.ode	@ltx/en_us_dedes/miscellanea:misc.Ode7
ltx/en_us_dedes/me.m01.d04:meCO.Ode7C13.text	
ltx/en_us_dedes/me.m01.d04:meCO.Ode7C1H.incipit	@ltx/en_us_dedes/he.h.m6:heHE.OiPaidesEnVavyloni.incipit
ltx/en_us_dedes/me.m01.d04:meCO.Ode7C1H.melody	@ltx/en_us_dedes/he.h.m6:heHE.OiPaidesEnVavyloni.melody
ltx/en_us_dedes/me.m01.d04:meCO.Ode7C1H.mode	@ltx/en_us_dedes/miscellanea:misc.Mode6
ltx/en_us_dedes/me.m01.d04:meCO.Ode7C1H.ode	@ltx/en_us_dedes/miscellanea:misc.Ode7
ltx/en_us_dedes/me.m01.d04:meCO.Ode7C1H.text	@ltx/en_us_dedes/he.h.m6:heHE.OiPaidesEnVavyloni.text
ltx/en_us_dedes/me.m01.d04:meCO.Ode8C11.incipit	…
ltx/en_us_dedes/me.m01.d04:meCO.Ode8C11.melody	@ltx/en_us_dedes/he.h.m6:heHE.NomonPatroon.name
ltx/en_us_dedes/me.m01.d04:meCO.Ode8C11.mode	@ltx/en_us_dedes/miscellanea:misc.Mode6
ltx/en_us_dedes/me.m01.d04:meCO.Ode8C11.ode	@ltx/en_us_dedes/miscellanea:misc.Ode8
ltx/en_us_dedes/me.m01.d04:meCO.Ode8C11.text	
ltx/en_us_dedes/me.m01.d04:meCO.Ode8C12.incipit	…
ltx/en_us_dedes/me.m01.d04:meCO.Ode8C12.melody	@ltx/en_us_dedes/he.h.m6:heHE.NomonPatroon.name
ltx/en_us_dedes/me.m01.d04:meCO.Ode8C12.mode	@ltx/en_us_dedes/miscellanea:misc.Mode6
ltx/en_us_dedes/me.m01.d04:meCO.Ode8C12.ode	@ltx/en_us_dedes/miscellanea:misc.Ode8
ltx/en_us_dedes/me.m01.d04:meCO.Ode8C12.text	
ltx/en_us_dedes/me.m01.d04:meCO.Ode8C13.incipit	…
ltx/en_us_dedes/me.m01.d04:meCO.Ode8C13.melody	@ltx/en_us_dedes/he.h.m6:heHE.NomonPatroon.name
ltx/en_us_dedes/me.m01.d04:meCO.Ode8C13.mode	@ltx/en_us_dedes/miscellanea:misc.Mode6
ltx/en_us_dedes/me.m01.d04:meCO.Ode8C13.ode	@ltx/en_us_dedes/miscellanea:misc.Ode8
ltx/en_us_dedes/me.m01.d04:meCO.Ode8C13.text	
ltx/en_us_dedes/me.m01.d04:meCO.Ode8C1H.incipit	@ltx/en_us_dedes/he.h.m6:heHE.NomonPatroon.incipit
ltx/en_us_dedes/me.m01.d04:meCO.Ode8C1H.melody	@ltx/en_us_dedes/he.h.m6:heHE.NomonPatroon.melody
ltx/en_us_dedes/me.m01.d04:meCO.Ode8C1H.mode	@ltx/en_us_dedes/miscellanea:misc.Mode6
ltx/en_us_dedes/me.m01.d04:meCO.Ode8C1H.ode	@ltx/en_us_dedes/miscellanea:misc.Ode8
ltx/en_us_dedes/me.m01.d04:meCO.Ode8C1H.text	@ltx/en_us_dedes/he.h.m6:heHE.NomonPatroon.text
ltx/en_us_dedes/me.m01.d04:meCO.Ode9C11.incipit	…
ltx/en_us_dedes/me.m01.d04:meCO.Ode9C11.melody	@ltx/en_us_dedes/he.h.m6:heHE.XeniasDespotikis.name
ltx/en_us_dedes/me.m01.d04:meCO.Ode9C11.mode	@ltx/en_us_dedes/miscellanea:misc.Mode6
ltx/en_us_dedes/me.m01.d04:meCO.Ode9C11.ode	@ltx/en_us_dedes/miscellanea:misc.Ode9
ltx/en_us_dedes/me.m01.d04:meCO.Ode9C11.text	
ltx/en_us_dedes/me.m01.d04:meCO.Ode9C12.incipit	…
ltx/en_us_dedes/me.m01.d04:meCO.Ode9C12.melody	@ltx/en_us_dedes/he.h.m6:heHE.XeniasDespotikis.name
ltx/en_us_dedes/me.m01.d04:meCO.Ode9C12.mode	@ltx/en_us_dedes/miscellanea:misc.Mode6
ltx/en_us_dedes/me.m01.d04:meCO.Ode9C12.ode	@ltx/en_us_dedes/miscellanea:misc.Ode9
ltx/en_us_dedes/me.m01.d04:meCO.Ode9C12.text	
ltx/en_us_dedes/me.m01.d04:meCO.Ode9C13.incipit	…
ltx/en_us_dedes/me.m01.d04:meCO.Ode9C13.melody	@ltx/en_us_dedes/he.h.m6:heHE.XeniasDespotikis.name
ltx/en_us_dedes/me.m01.d04:meCO.Ode9C13.mode	@ltx/en_us_dedes/miscellanea:misc.Mode6
ltx/en_us_dedes/me.m01.d04:meCO.Ode9C13.ode	@ltx/en_us_dedes/miscellanea:misc.Ode9
ltx/en_us_dedes/me.m01.d04:meCO.Ode9C13.text	
ltx/en_us_dedes/me.m01.d04:meCO.Ode9C1H.incipit	@ltx/en_us_dedes/he.h.m6:heHE.XeniasDespotikisEpiphany.incipit
ltx/en_us_dedes/me.m01.d04:meCO.Ode9C1H.melody	@ltx/en_us_dedes/he.h.m6:heHE.XeniasDespotikisEpiphany.melody
ltx/en_us_dedes/me.m01.d04:meCO.Ode9C1H.mode	@ltx/en_us_dedes/miscellanea:misc.Mode6
ltx/en_us_dedes/me.m01.d04:meCO.Ode9C1H.ode	@ltx/en_us_dedes/miscellanea:misc.Ode9
ltx/en_us_dedes/me.m01.d04:meCO.Ode9C1H.text	@ltx/en_us_dedes/he.h.m6:heHE.XeniasDespotikisEpiphany.text
ltx/en_us_dedes/me.m01.d04:meDA.commemoration.first	Forefeast of Epiphany
ltx/en_us_dedes/me.m01.d04:meDA.commemoration.first_name	
ltx/en_us_dedes/me.m01.d04:meDA.commemoration.first_short	Forefeast of Epiphany
ltx/en_us_dedes/me.m01.d04:meDA.commemoration.first_title	@ltx/en_us_dedes/titles:ti.Apostles
ltx/en_us_dedes/me.m01.d04:meDA.commemoration.full	Forefeast of Epiphany, and Synaxis in honor of the Holy Seventy Apostles, and Memory of our Devout Father Theoktistos.
ltx/en_us_dedes/me.m01.d04:meDA.commemoration.second_name	
ltx/en_us_dedes/me.m01.d04:meDA.commemoration.second_title	@ltx/en_us_dedes/titles:ti.DevoutSaintM
ltx/en_us_dedes/me.m01.d04:meDA.date	January 4
ltx/en_us_dedes/me.m01.d04:meDA.fordate	for January 4
ltx/en_us_dedes/me.m01.d04:meDA.insert1	
ltx/en_us_dedes/me.m01.d04:meDA.insert2	
ltx/en_us_dedes/me.m01.d04:meDA.note	
ltx/en_us_dedes/me.m01.d04:meDA.pdfcoverdate	January 4,
ltx/en_us_dedes/me.m01.d04:meDA.pdfheaderdate	January 4
ltx/en_us_dedes/me.m01.d04:meHO.commemorations	
ltx/en_us_dedes/me.m01.d04:meHO.note1	
ltx/en_us_dedes/me.m01.d04:meHO.note2	
ltx/en_us_dedes/me.m01.d04:meHO.number	4.
ltx/en_us_dedes/me.m01.d04:meHO.rank	
ltx/en_us_dedes/me.m01.d04:meLE.commemoration1	Synaxis of the Holy Seventy Apostles.
ltx/en_us_dedes/me.m01.d04:meLE.commemoration2	
ltx/en_us_dedes/me.m01.d04:meLI.Kontakion1.greekmelody	@ltx/en_us_dedes/me.m01.d04:meMA.Kontakion1.greekmelody
ltx/en_us_dedes/me.m01.d04:meLI.Kontakion1.incipit	@ltx/en_us_dedes/me.m01.d04:meMA.Kontakion1.incipit
ltx/en_us_dedes/me.m01.d04:meLI.Kontakion1.melody	@ltx/en_us_dedes/me.m01.d04:meMA.Kontakion1.melody
ltx/en_us_dedes/me.m01.d04:meLI.Kontakion1.mode	@ltx/en_us_dedes/me.m01.d04:meMA.Kontakion1.mode
ltx/en_us_dedes/me.m01.d04:meLI.Kontakion1.text	@ltx/en_us_dedes/me.m01.d04:meMA.Kontakion1.text
ltx/en_us_dedes/me.m01.d04:meLI.Megalynarion.text	
ltx/en_us_dedes/me.m01.d04:meMA.AposGlory.incipit	…
ltx/en_us_dedes/me.m01.d04:meMA.AposGlory.melody	@ltx/en_us_dedes/he.a.m2:heAU.OikosTouEfratha.name
ltx/en_us_dedes/me.m01.d04:meMA.AposGlory.mode	@ltx/en_us_dedes/miscellanea:misc.Mode2
ltx/en_us_dedes/me.m01.d04:meMA.AposGlory.text	
ltx/en_us_dedes/me.m01.d04:meMA.Aposticha1.greekmelody	@ltx/en_us_dedes/he.a.m2:heAU.OikosTouEfratha.greekname
ltx/en_us_dedes/me.m01.d04:meMA.Aposticha1.incipit	@ltx/en_us_dedes/me.m01.d03:meMA.AposGlory.incipit
ltx/en_us_dedes/me.m01.d04:meMA.Aposticha1.melody	@ltx/en_us_dedes/he.a.m2:heAU.OikosTouEfratha.name
ltx/en_us_dedes/me.m01.d04:meMA.Aposticha1.mode	@ltx/en_us_dedes/miscellanea:misc.Mode2
ltx/en_us_dedes/me.m01.d04:meMA.Aposticha1.text	@ltx/en_us_dedes/me.m01.d03:meMA.AposGlory.text
ltx/en_us_dedes/me.m01.d04:meMA.Aposticha2.incipit	…
ltx/en_us_dedes/me.m01.d04:meMA.Aposticha2.melody	@ltx/en_us_dedes/he.a.m2:heAU.OikosTouEfratha.name
ltx/en_us_dedes/me.m01.d04:meMA.Aposticha2.mode	@ltx/en_us_dedes/miscellanea:misc.Mode2
ltx/en_us_dedes/me.m01.d04:meMA.Aposticha2.text	
ltx/en_us_dedes/me.m01.d04:meMA.Aposticha3.incipit	@ltx/en_us_dedes/me.m01.d04:meVE.Aposticha2.incipit
ltx/en_us_dedes/me.m01.d04:meMA.Aposticha3.melody	@ltx/en_us_dedes/he.a.m2:heAU.OikosTouEfratha.name
ltx/en_us_dedes/me.m01.d04:meMA.Aposticha3.mode	@ltx/en_us_dedes/miscellanea:misc.Mode2
ltx/en_us_dedes/me.m01.d04:meMA.Aposticha3.text	@ltx/en_us_dedes/me.m01.d04:meVE.Aposticha2.text
ltx/en_us_dedes/me.m01.d04:meMA.C1.acrostic.notice1	
ltx/en_us_dedes/me.m01.d04:meMA.C1.acrostic.title	
ltx/en_us_dedes/me.m01.d04:meMA.C1.poet	@ltx/en_us_dedes/poets:po.Iosif
ltx/en_us_dedes/me.m01.d04:meMA.C1.title	@ltx/en_us_dedes/titles:ti.CanonForefeast
ltx/en_us_dedes/me.m01.d04:meMA.C1.verse	@ltx/en_us_dedes/prayers:pr.verse_God.text
ltx/en_us_dedes/me.m01.d04:meMA.C2.acrostic.notice1	
ltx/en_us_dedes/me.m01.d04:meMA.C2.acrostic.text	
ltx/en_us_dedes/me.m01.d04:meMA.C2.acrostic.title	
ltx/en_us_dedes/me.m01.d04:meMA.C2.title	@ltx/en_us_dedes/titles:ti.CanonApostles
ltx/en_us_dedes/me.m01.d04:meMA.C2.verse	@ltx/en_us_dedes/prayers:pr.verse_Apostles.text
ltx/en_us_dedes/me.m01.d04:meMA.C3.poet	@ltx/en_us_dedes/poets:po.Theofanous
ltx/en_us_dedes/me.m01.d04:meMA.C3.title	@ltx/en_us_dedes/titles:ti.CanonDevoutM
ltx/en_us_dedes/me.m01.d04:meMA.C3.verse	@ltx/en_us_dedes/prayers:pr.verse_DevoutMan.text
ltx/en_us_dedes/me.m01.d04:meMA.Exaposteilarion1.greekmelody	@ltx/en_us_dedes/he.a.m3:heAU.OOuranonToisAstrois.greekname
ltx/en_us_dedes/me.m01.d04:meMA.Exaposteilarion1.incipit	…
ltx/en_us_dedes/me.m01.d04:meMA.Exaposteilarion1.melody	@ltx/en_us_dedes/he.a.m3:heAU.OOuranonToisAstrois.name
ltx/en_us_dedes/me.m01.d04:meMA.Exaposteilarion1.mode	@ltx/en_us_dedes/miscellanea:misc.Mode3
ltx/en_us_dedes/me.m01.d04:meMA.Exaposteilarion1.text	
ltx/en_us_dedes/me.m01.d04:meMA.Exaposteilarion2.greekmelody	@ltx/en_us_dedes/he.a.m3:heAU.OOuranonToisAstrois.greekname
ltx/en_us_dedes/me.m01.d04:meMA.Exaposteilarion2.incipit	…
ltx/en_us_dedes/me.m01.d04:meMA.Exaposteilarion2.melody	@ltx/en_us_dedes/he.a.m3:heAU.OOuranonToisAstrois.name
ltx/en_us_dedes/me.m01.d04:meMA.Exaposteilarion2.mode	@ltx/en_us_dedes/miscellanea:misc.Mode3
ltx/en_us_dedes/me.m01.d04:meMA.Exaposteilarion2.text	
ltx/en_us_dedes/me.m01.d04:meMA.Kathisma11.greekmelody	@ltx/en_us_dedes/he.a.m4:heAU.TachyProkatalave.greekname
ltx/en_us_dedes/me.m01.d04:meMA.Kathisma11.incipit	…
ltx/en_us_dedes/me.m01.d04:meMA.Kathisma11.melody	@ltx/en_us_dedes/he.a.m4:heAU.TachyProkatalave.name
ltx/en_us_dedes/me.m01.d04:meMA.Kathisma11.mode	@ltx/en_us_dedes/miscellanea:misc.Mode4
ltx/en_us_dedes/me.m01.d04:meMA.Kathisma11.text	
ltx/en_us_dedes/me.m01.d04:meMA.Kathisma12.greekmelody	@ltx/en_us_dedes/he.a.m4:heAU.OYpsotheisEnToStavro.greekname
ltx/en_us_dedes/me.m01.d04:meMA.Kathisma12.incipit	…
ltx/en_us_dedes/me.m01.d04:meMA.Kathisma12.melody	@ltx/en_us_dedes/he.a.m4:heAU.OYpsotheisEnToStavro.name
ltx/en_us_dedes/me.m01.d04:meMA.Kathisma12.mode	@ltx/en_us_dedes/miscellanea:misc.Mode4
ltx/en_us_dedes/me.m01.d04:meMA.Kathisma12.text	
ltx/en_us_dedes/me.m01.d04:meMA.Kathisma21.greekmelody	@ltx/en_us_dedes/he.a.m8:heAU.AnestisEkNekron.greekname
ltx/en_us_dedes/me.m01.d04:meMA.Kathisma21.incipit	…
ltx/en_us_dedes/me.m01.d04:meMA.Kathisma21.melody	@ltx/en_us_dedes/he.a.m8:heAU.AnestisEkNekron.name
ltx/en_us_dedes/me.m01.d04:meMA.Kathisma21.mode	@ltx/en_us_dedes/miscellanea:misc.Mode8
ltx/en_us_dedes/me.m01.d04:meMA.Kathisma21.text	
ltx/en_us_dedes/me.m01.d04:meMA.Kathisma22.greekmelody	@ltx/en_us_dedes/he.a.m8:heAU.AnestisEkNekron.greekname
ltx/en_us_dedes/me.m01.d04:meMA.Kathisma22.incipit	…
ltx/en_us_dedes/me.m01.d04:meMA.Kathisma22.melody	@ltx/en_us_dedes/he.a.m8:heAU.AnestisEkNekron.name
ltx/en_us_dedes/me.m01.d04:meMA.Kathisma22.mode	@ltx/en_us_dedes/miscellanea:misc.Mode8
ltx/en_us_dedes/me.m01.d04:meMA.Kathisma22.text	
ltx/en_us_dedes/me.m01.d04:meMA.Kontakion1.greekmelody	@ltx/en_us_dedes/he.a.m2:heAU.TaAnoZiton.greekname
ltx/en_us_dedes/me.m01.d04:meMA.Kontakion1.incipit	Inspired by God, * O…
ltx/en_us_dedes/me.m01.d04:meMA.Kontakion1.melody	@ltx/en_us_dedes/he.a.m2:heAU.TaAnoZiton.name
ltx/en_us_dedes/me.m01.d04:meMA.Kontakion1.mode	@ltx/en_us_dedes/miscellanea:misc.Mode2
ltx/en_us_dedes/me.m01.d04:meMA.Kontakion1.text	Inspired by God, * O faithful, let us celebrate * today and extol * the chorus of the Seventy * Disciples of Jesus Christ. * For through them we all have learned to worship the undivided Trinity, * as they are indeed lamps that guide to faith in God.
ltx/en_us_dedes/me.m01.d04:meMA.Lauds1.greekmelody	@ltx/en_us_dedes/he.a.m6:heAU.AiAngelikai.greekname
ltx/en_us_dedes/me.m01.d04:meMA.Lauds1.incipit	…
ltx/en_us_dedes/me.m01.d04:meMA.Lauds1.melody	@ltx/en_us_dedes/he.a.m6:heAU.AiAngelikai.name
ltx/en_us_dedes/me.m01.d04:meMA.Lauds1.mode	@ltx/en_us_dedes/miscellanea:misc.Mode6
ltx/en_us_dedes/me.m01.d04:meMA.Lauds1.text	
ltx/en_us_dedes/me.m01.d04:meMA.Lauds2.incipit	…
ltx/en_us_dedes/me.m01.d04:meMA.Lauds2.melody	@ltx/en_us_dedes/he.a.m6:heAU.AiAngelikai.name
ltx/en_us_dedes/me.m01.d04:meMA.Lauds2.mode	@ltx/en_us_dedes/miscellanea:misc.Mode6
ltx/en_us_dedes/me.m01.d04:meMA.Lauds2.text	
ltx/en_us_dedes/me.m01.d04:meMA.Lauds3.incipit	…
ltx/en_us_dedes/me.m01.d04:meMA.Lauds3.melody	@ltx/en_us_dedes/he.a.m6:heAU.AiAngelikai.name
ltx/en_us_dedes/me.m01.d04:meMA.Lauds3.mode	@ltx/en_us_dedes/miscellanea:misc.Mode6
ltx/en_us_dedes/me.m01.d04:meMA.Lauds3.text	
ltx/en_us_dedes/me.m01.d04:meMA.Lauds4.greekmelody	@ltx/en_us_dedes/he.a.m6:heAU.AiAngelikai.greekname
ltx/en_us_dedes/me.m01.d04:meMA.Lauds4.incipit	…
ltx/en_us_dedes/me.m01.d04:meMA.Lauds4.melody	@ltx/en_us_dedes/he.a.m6:heAU.AiAngelikai.name
ltx/en_us_dedes/me.m01.d04:meMA.Lauds4.mode	@ltx/en_us_dedes/miscellanea:misc.Mode6
ltx/en_us_dedes/me.m01.d04:meMA.Lauds4.text	
ltx/en_us_dedes/me.m01.d04:meMA.LaudsBoth.incipit	…
ltx/en_us_dedes/me.m01.d04:meMA.LaudsBoth.melody	@ltx/en_us_dedes/he.a.m6:heAU.AiAngelikai.name
ltx/en_us_dedes/me.m01.d04:meMA.LaudsBoth.mode	@ltx/en_us_dedes/miscellanea:misc.Mode6
ltx/en_us_dedes/me.m01.d04:meMA.LaudsBoth.text	
ltx/en_us_dedes/me.m01.d04:meMA.LaudsGlory.incipit	…
ltx/en_us_dedes/me.m01.d04:meMA.LaudsGlory.melody	@ltx/en_us_dedes/he.a.m6:heAU.AiAngelikai.name
ltx/en_us_dedes/me.m01.d04:meMA.LaudsGlory.mode	@ltx/en_us_dedes/miscellanea:misc.Mode6
ltx/en_us_dedes/me.m01.d04:meMA.LaudsGlory.text	
ltx/en_us_dedes/me.m01.d04:meMA.Ode1C11.greekmelody	@ltx/en_us_dedes/he.h.m6:heHE.OsEnIpeiroPezefsas.greekname
ltx/en_us_dedes/me.m01.d04:meMA.Ode1C11.incipit	…
ltx/en_us_dedes/me.m01.d04:meMA.Ode1C11.melody	@ltx/en_us_dedes/he.h.m6:heHE.OsEnIpeiroPezefsas.name
ltx/en_us_dedes/me.m01.d04:meMA.Ode1C11.mode	@ltx/en_us_dedes/miscellanea:misc.Mode6
ltx/en_us_dedes/me.m01.d04:meMA.Ode1C11.ode	@ltx/en_us_dedes/miscellanea:misc.Ode1
ltx/en_us_dedes/me.m01.d04:meMA.Ode1C11.text	
ltx/en_us_dedes/me.m01.d04:meMA.Ode1C12.incipit	…
ltx/en_us_dedes/me.m01.d04:meMA.Ode1C12.melody	@ltx/en_us_dedes/he.h.m6:heHE.OsEnIpeiroPezefsas.name
ltx/en_us_dedes/me.m01.d04:meMA.Ode1C12.mode	@ltx/en_us_dedes/miscellanea:misc.Mode6
ltx/en_us_dedes/me.m01.d04:meMA.Ode1C12.ode	@ltx/en_us_dedes/miscellanea:misc.Ode1
ltx/en_us_dedes/me.m01.d04:meMA.Ode1C12.text	
ltx/en_us_dedes/me.m01.d04:meMA.Ode1C13.incipit	…
ltx/en_us_dedes/me.m01.d04:meMA.Ode1C13.melody	@ltx/en_us_dedes/he.h.m6:heHE.OsEnIpeiroPezefsas.name
ltx/en_us_dedes/me.m01.d04:meMA.Ode1C13.mode	@ltx/en_us_dedes/miscellanea:misc.Mode6
ltx/en_us_dedes/me.m01.d04:meMA.Ode1C13.ode	@ltx/en_us_dedes/miscellanea:misc.Ode1
ltx/en_us_dedes/me.m01.d04:meMA.Ode1C13.text	
ltx/en_us_dedes/me.m01.d04:meMA.Ode1C1H.greekmelody	@ltx/en_us_dedes/he.h.m6:heHE.OsEnIpeiroPezefsas.greekname
ltx/en_us_dedes/me.m01.d04:meMA.Ode1C1H.incipit	@ltx/en_us_dedes/he.h.m6:heHE.OsEnIpeiroPezefsas.incipit
ltx/en_us_dedes/me.m01.d04:meMA.Ode1C1H.melody	@ltx/en_us_dedes/he.h.m6:heHE.OsEnIpeiroPezefsas.melody
ltx/en_us_dedes/me.m01.d04:meMA.Ode1C1H.mode	@ltx/en_us_dedes/miscellanea:misc.Mode6
ltx/en_us_dedes/me.m01.d04:meMA.Ode1C1H.ode	@ltx/en_us_dedes/miscellanea:misc.Ode1
ltx/en_us_dedes/me.m01.d04:meMA.Ode1C1H.text	@ltx/en_us_dedes/he.h.m6:heHE.OsEnIpeiroPezefsas.text
ltx/en_us_dedes/me.m01.d04:meMA.Ode1C21.greekmelody	@ltx/en_us_dedes/he.h.m4:heHE.AnoixoToStomaMou.greekname
ltx/en_us_dedes/me.m01.d04:meMA.Ode1C21.incipit	…
ltx/en_us_dedes/me.m01.d04:meMA.Ode1C21.melody	@ltx/en_us_dedes/he.h.m4:heHE.AnoixoToStomaMou.name
ltx/en_us_dedes/me.m01.d04:meMA.Ode1C21.mode	@ltx/en_us_dedes/miscellanea:misc.Mode4
ltx/en_us_dedes/me.m01.d04:meMA.Ode1C21.ode	@ltx/en_us_dedes/miscellanea:misc.Ode1
ltx/en_us_dedes/me.m01.d04:meMA.Ode1C21.text	
ltx/en_us_dedes/me.m01.d04:meMA.Ode1C22.incipit	…
ltx/en_us_dedes/me.m01.d04:meMA.Ode1C22.melody	@ltx/en_us_dedes/he.h.m4:heHE.AnoixoToStomaMou.name
ltx/en_us_dedes/me.m01.d04:meMA.Ode1C22.mode	@ltx/en_us_dedes/miscellanea:misc.Mode4
ltx/en_us_dedes/me.m01.d04:meMA.Ode1C22.ode	@ltx/en_us_dedes/miscellanea:misc.Ode1
ltx/en_us_dedes/me.m01.d04:meMA.Ode1C22.text	
ltx/en_us_dedes/me.m01.d04:meMA.Ode1C23.incipit	…
ltx/en_us_dedes/me.m01.d04:meMA.Ode1C23.melody	@ltx/en_us_dedes/he.h.m4:heHE.AnoixoToStomaMou.name
ltx/en_us_dedes/me.m01.d04:meMA.Ode1C23.mode	@ltx/en_us_dedes/miscellanea:misc.Mode4
ltx/en_us_dedes/me.m01.d04:meMA.Ode1C23.ode	@ltx/en_us_dedes/miscellanea:misc.Ode1
ltx/en_us_dedes/me.m01.d04:meMA.Ode1C23.text	
ltx/en_us_dedes/me.m01.d04:meMA.Ode1C24.incipit	…
ltx/en_us_dedes/me.m01.d04:meMA.Ode1C24.melody	@ltx/en_us_dedes/he.h.m4:heHE.AnoixoToStomaMou.name
ltx/en_us_dedes/me.m01.d04:meMA.Ode1C24.mode	@ltx/en_us_dedes/miscellanea:misc.Mode4
ltx/en_us_dedes/me.m01.d04:meMA.Ode1C24.ode	@ltx/en_us_dedes/miscellanea:misc.Ode1
ltx/en_us_dedes/me.m01.d04:meMA.Ode1C24.text	
ltx/en_us_dedes/me.m01.d04:meMA.Ode1C2T.incipit	…
ltx/en_us_dedes/me.m01.d04:meMA.Ode1C2T.melody	@ltx/en_us_dedes/he.h.m4:heHE.AnoixoToStomaMou.name
ltx/en_us_dedes/me.m01.d04:meMA.Ode1C2T.mode	@ltx/en_us_dedes/miscellanea:misc.Mode4
ltx/en_us_dedes/me.m01.d04:meMA.Ode1C2T.ode	@ltx/en_us_dedes/miscellanea:misc.Ode1
ltx/en_us_dedes/me.m01.d04:meMA.Ode1C2T.text	
ltx/en_us_dedes/me.m01.d04:meMA.Ode1C31.greekmelody	@ltx/en_us_dedes/he.h.m2:heHE.EnVythoKatestrose.greekname
ltx/en_us_dedes/me.m01.d04:meMA.Ode1C31.incipit	…
ltx/en_us_dedes/me.m01.d04:meMA.Ode1C31.melody	@ltx/en_us_dedes/he.h.m2:heHE.EnVythoKatestrose.name
ltx/en_us_dedes/me.m01.d04:meMA.Ode1C31.mode	@ltx/en_us_dedes/miscellanea:misc.Mode2
ltx/en_us_dedes/me.m01.d04:meMA.Ode1C31.ode	@ltx/en_us_dedes/miscellanea:misc.Ode1
ltx/en_us_dedes/me.m01.d04:meMA.Ode1C31.text	
ltx/en_us_dedes/me.m01.d04:meMA.Ode1C32.incipit	…
ltx/en_us_dedes/me.m01.d04:meMA.Ode1C32.melody	@ltx/en_us_dedes/he.h.m2:heHE.EnVythoKatestrose.name
ltx/en_us_dedes/me.m01.d04:meMA.Ode1C32.mode	@ltx/en_us_dedes/miscellanea:misc.Mode2
ltx/en_us_dedes/me.m01.d04:meMA.Ode1C32.ode	@ltx/en_us_dedes/miscellanea:misc.Ode1
ltx/en_us_dedes/me.m01.d04:meMA.Ode1C32.text	
ltx/en_us_dedes/me.m01.d04:meMA.Ode1C33.incipit	…
ltx/en_us_dedes/me.m01.d04:meMA.Ode1C33.melody	@ltx/en_us_dedes/he.h.m2:heHE.EnVythoKatestrose.name
ltx/en_us_dedes/me.m01.d04:meMA.Ode1C33.mode	@ltx/en_us_dedes/miscellanea:misc.Mode2
ltx/en_us_dedes/me.m01.d04:meMA.Ode1C33.ode	@ltx/en_us_dedes/miscellanea:misc.Ode1
ltx/en_us_dedes/me.m01.d04:meMA.Ode1C33.text	
ltx/en_us_dedes/me.m01.d04:meMA.Ode1C3T.incipit	…
ltx/en_us_dedes/me.m01.d04:meMA.Ode1C3T.melody	@ltx/en_us_dedes/he.h.m2:heHE.EnVythoKatestrose.name
ltx/en_us_dedes/me.m01.d04:meMA.Ode1C3T.mode	@ltx/en_us_dedes/miscellanea:misc.Mode2
ltx/en_us_dedes/me.m01.d04:meMA.Ode1C3T.ode	@ltx/en_us_dedes/miscellanea:misc.Ode1
ltx/en_us_dedes/me.m01.d04:meMA.Ode1C3T.text	
ltx/en_us_dedes/me.m01.d04:meMA.Ode3C11.greekmelody	@ltx/en_us_dedes/he.h.m6:heHE.OukEstinAgios.greekname
ltx/en_us_dedes/me.m01.d04:meMA.Ode3C11.incipit	…
ltx/en_us_dedes/me.m01.d04:meMA.Ode3C11.melody	@ltx/en_us_dedes/he.h.m6:heHE.OukEstinAgios.name
ltx/en_us_dedes/me.m01.d04:meMA.Ode3C11.mode	@ltx/en_us_dedes/miscellanea:misc.Mode6
ltx/en_us_dedes/me.m01.d04:meMA.Ode3C11.ode	@ltx/en_us_dedes/miscellanea:misc.Ode3
ltx/en_us_dedes/me.m01.d04:meMA.Ode3C11.text	
ltx/en_us_dedes/me.m01.d04:meMA.Ode3C12.incipit	…
ltx/en_us_dedes/me.m01.d04:meMA.Ode3C12.melody	@ltx/en_us_dedes/he.h.m6:heHE.OukEstinAgios.name
ltx/en_us_dedes/me.m01.d04:meMA.Ode3C12.mode	@ltx/en_us_dedes/miscellanea:misc.Mode6
ltx/en_us_dedes/me.m01.d04:meMA.Ode3C12.ode	@ltx/en_us_dedes/miscellanea:misc.Ode3
ltx/en_us_dedes/me.m01.d04:meMA.Ode3C12.text	
ltx/en_us_dedes/me.m01.d04:meMA.Ode3C13.incipit	…
ltx/en_us_dedes/me.m01.d04:meMA.Ode3C13.melody	@ltx/en_us_dedes/he.h.m6:heHE.OukEstinAgios.name
ltx/en_us_dedes/me.m01.d04:meMA.Ode3C13.mode	@ltx/en_us_dedes/miscellanea:misc.Mode6
ltx/en_us_dedes/me.m01.d04:meMA.Ode3C13.ode	@ltx/en_us_dedes/miscellanea:misc.Ode3
ltx/en_us_dedes/me.m01.d04:meMA.Ode3C13.text	
ltx/en_us_dedes/me.m01.d04:meMA.Ode3C1H.greekmelody	@ltx/en_us_dedes/he.h.m6:heHE.OukEstinAgios.greekname
ltx/en_us_dedes/me.m01.d04:meMA.Ode3C1H.incipit	@ltx/en_us_dedes/he.h.m6:heHE.OukEstinAgios.incipit
ltx/en_us_dedes/me.m01.d04:meMA.Ode3C1H.melody	@ltx/en_us_dedes/he.h.m6:heHE.OukEstinAgios.melody
ltx/en_us_dedes/me.m01.d04:meMA.Ode3C1H.mode	@ltx/en_us_dedes/miscellanea:misc.Mode6
ltx/en_us_dedes/me.m01.d04:meMA.Ode3C1H.ode	@ltx/en_us_dedes/miscellanea:misc.Ode3
ltx/en_us_dedes/me.m01.d04:meMA.Ode3C1H.text	@ltx/en_us_dedes/he.h.m6:heHE.OukEstinAgios.text
ltx/en_us_dedes/me.m01.d04:meMA.Ode3C21.greekmelody	@ltx/en_us_dedes/he.h.m4:heHE.TousSousYmnologous.greekname
ltx/en_us_dedes/me.m01.d04:meMA.Ode3C21.incipit	…
ltx/en_us_dedes/me.m01.d04:meMA.Ode3C21.melody	@ltx/en_us_dedes/he.h.m4:heHE.TousSousYmnologous.name
ltx/en_us_dedes/me.m01.d04:meMA.Ode3C21.mode	@ltx/en_us_dedes/miscellanea:misc.Mode4
ltx/en_us_dedes/me.m01.d04:meMA.Ode3C21.ode	@ltx/en_us_dedes/miscellanea:misc.Ode3
ltx/en_us_dedes/me.m01.d04:meMA.Ode3C21.text	
ltx/en_us_dedes/me.m01.d04:meMA.Ode3C22.incipit	…
ltx/en_us_dedes/me.m01.d04:meMA.Ode3C22.melody	@ltx/en_us_dedes/he.h.m4:heHE.TousSousYmnologous.name
ltx/en_us_dedes/me.m01.d04:meMA.Ode3C22.mode	@ltx/en_us_dedes/miscellanea:misc.Mode4
ltx/en_us_dedes/me.m01.d04:meMA.Ode3C22.ode	@ltx/en_us_dedes/miscellanea:misc.Ode3
ltx/en_us_dedes/me.m01.d04:meMA.Ode3C22.text	
ltx/en_us_dedes/me.m01.d04:meMA.Ode3C23.incipit	…
ltx/en_us_dedes/me.m01.d04:meMA.Ode3C23.melody	@ltx/en_us_dedes/he.h.m4:heHE.TousSousYmnologous.name
ltx/en_us_dedes/me.m01.d04:meMA.Ode3C23.mode	@ltx/en_us_dedes/miscellanea:misc.Mode4
ltx/en_us_dedes/me.m01.d04:meMA.Ode3C23.ode	@ltx/en_us_dedes/miscellanea:misc.Ode3
ltx/en_us_dedes/me.m01.d04:meMA.Ode3C23.text	
ltx/en_us_dedes/me.m01.d04:meMA.Ode3C2T.incipit	…
ltx/en_us_dedes/me.m01.d04:meMA.Ode3C2T.melody	@ltx/en_us_dedes/he.h.m4:heHE.TousSousYmnologous.name
ltx/en_us_dedes/me.m01.d04:meMA.Ode3C2T.mode	@ltx/en_us_dedes/miscellanea:misc.Mode4
ltx/en_us_dedes/me.m01.d04:meMA.Ode3C2T.ode	@ltx/en_us_dedes/miscellanea:misc.Ode3
ltx/en_us_dedes/me.m01.d04:meMA.Ode3C2T.text	
ltx/en_us_dedes/me.m01.d04:meMA.Ode3C31.greekmelody	@ltx/en_us_dedes/he.h.m2:heHE.EnPetraMeTisPisteos.greekname
ltx/en_us_dedes/me.m01.d04:meMA.Ode3C31.incipit	…
ltx/en_us_dedes/me.m01.d04:meMA.Ode3C31.melody	@ltx/en_us_dedes/he.h.m2:heHE.EnPetraMeTisPisteos.name
ltx/en_us_dedes/me.m01.d04:meMA.Ode3C31.mode	@ltx/en_us_dedes/miscellanea:misc.Mode2
ltx/en_us_dedes/me.m01.d04:meMA.Ode3C31.ode	@ltx/en_us_dedes/miscellanea:misc.Ode3
ltx/en_us_dedes/me.m01.d04:meMA.Ode3C31.text	
ltx/en_us_dedes/me.m01.d04:meMA.Ode3C32.incipit	…
ltx/en_us_dedes/me.m01.d04:meMA.Ode3C32.melody	@ltx/en_us_dedes/he.h.m2:heHE.EnPetraMeTisPisteos.name
ltx/en_us_dedes/me.m01.d04:meMA.Ode3C32.mode	@ltx/en_us_dedes/miscellanea:misc.Mode2
ltx/en_us_dedes/me.m01.d04:meMA.Ode3C32.ode	@ltx/en_us_dedes/miscellanea:misc.Ode3
ltx/en_us_dedes/me.m01.d04:meMA.Ode3C32.text	
ltx/en_us_dedes/me.m01.d04:meMA.Ode3C33.incipit	…
ltx/en_us_dedes/me.m01.d04:meMA.Ode3C33.melody	@ltx/en_us_dedes/he.h.m2:heHE.EnPetraMeTisPisteos.name
ltx/en_us_dedes/me.m01.d04:meMA.Ode3C33.mode	@ltx/en_us_dedes/miscellanea:misc.Mode2
ltx/en_us_dedes/me.m01.d04:meMA.Ode3C33.ode	@ltx/en_us_dedes/miscellanea:misc.Ode3
ltx/en_us_dedes/me.m01.d04:meMA.Ode3C33.text	
ltx/en_us_dedes/me.m01.d04:meMA.Ode3C3T.incipit	…
ltx/en_us_dedes/me.m01.d04:meMA.Ode3C3T.melody	@ltx/en_us_dedes/he.h.m2:heHE.EnPetraMeTisPisteos.name
ltx/en_us_dedes/me.m01.d04:meMA.Ode3C3T.mode	@ltx/en_us_dedes/miscellanea:misc.Mode2
ltx/en_us_dedes/me.m01.d04:meMA.Ode3C3T.ode	@ltx/en_us_dedes/miscellanea:misc.Ode3
ltx/en_us_dedes/me.m01.d04:meMA.Ode3C3T.text	
ltx/en_us_dedes/me.m01.d04:meMA.Ode3H.greekmelody	@ltx/en_us_dedes/he.h.m2:heHE.EnPetraMeTisPisteos.greekname
ltx/en_us_dedes/me.m01.d04:meMA.Ode3H.incipit	@ltx/en_us_dedes/he.h.m2:heHE.EnPetraMeTisPisteos.incipit
ltx/en_us_dedes/me.m01.d04:meMA.Ode3H.melody	@ltx/en_us_dedes/he.h.m2:heHE.EnPetraMeTisPisteos.melody
ltx/en_us_dedes/me.m01.d04:meMA.Ode3H.mode	@ltx/en_us_dedes/miscellanea:misc.Mode2
ltx/en_us_dedes/me.m01.d04:meMA.Ode3H.ode	@ltx/en_us_dedes/miscellanea:misc.Ode3
ltx/en_us_dedes/me.m01.d04:meMA.Ode3H.text	@ltx/en_us_dedes/he.h.m2:heHE.EnPetraMeTisPisteos.text
ltx/en_us_dedes/me.m01.d04:meMA.Ode3Kathisma1.greekmelody	@ltx/en_us_dedes/he.a.m3:heAU.TheiasPisteos.greekname
ltx/en_us_dedes/me.m01.d04:meMA.Ode3Kathisma1.incipit	…
ltx/en_us_dedes/me.m01.d04:meMA.Ode3Kathisma1.melody	@ltx/en_us_dedes/he.a.m3:heAU.TheiasPisteos.name
ltx/en_us_dedes/me.m01.d04:meMA.Ode3Kathisma1.mode	@ltx/en_us_dedes/miscellanea:misc.Mode3
ltx/en_us_dedes/me.m01.d04:meMA.Ode3Kathisma1.text	
ltx/en_us_dedes/me.m01.d04:meMA.Ode3Kathisma2.greekmelody	@ltx/en_us_dedes/he.a.m1:heAU.TouLithouSfragisthentos.greekname
ltx/en_us_dedes/me.m01.d04:meMA.Ode3Kathisma2.incipit	…
ltx/en_us_dedes/me.m01.d04:meMA.Ode3Kathisma2.melody	@ltx/en_us_dedes/he.a.m1:heAU.TouLithouSfragisthentos.name
ltx/en_us_dedes/me.m01.d04:meMA.Ode3Kathisma2.mode	@ltx/en_us_dedes/miscellanea:misc.Mode1
ltx/en_us_dedes/me.m01.d04:meMA.Ode3Kathisma2.text	
ltx/en_us_dedes/me.m01.d04:meMA.Ode3Kathisma3.greekmelody	@ltx/en_us_dedes/he.a.m1:heAU.TouLithouSfragisthentos.greekname
ltx/en_us_dedes/me.m01.d04:meMA.Ode3Kathisma3.incipit	…
ltx/en_us_dedes/me.m01.d04:meMA.Ode3Kathisma3.melody	@ltx/en_us_dedes/he.a.m1:heAU.TouLithouSfragisthentos.name
ltx/en_us_dedes/me.m01.d04:meMA.Ode3Kathisma3.mode	@ltx/en_us_dedes/miscellanea:misc.Mode1
ltx/en_us_dedes/me.m01.d04:meMA.Ode3Kathisma3.text	
ltx/en_us_dedes/me.m01.d04:meMA.Ode4C11.greekmelody	@ltx/en_us_dedes/he.h.m6:heHE.ChristosMouDynamis.greekname
ltx/en_us_dedes/me.m01.d04:meMA.Ode4C11.incipit	…
ltx/en_us_dedes/me.m01.d04:meMA.Ode4C11.melody	@ltx/en_us_dedes/he.h.m6:heHE.ChristosMouDynamis.name
ltx/en_us_dedes/me.m01.d04:meMA.Ode4C11.mode	@ltx/en_us_dedes/miscellanea:misc.Mode6
ltx/en_us_dedes/me.m01.d04:meMA.Ode4C11.ode	@ltx/en_us_dedes/miscellanea:misc.Ode4
ltx/en_us_dedes/me.m01.d04:meMA.Ode4C11.text	
ltx/en_us_dedes/me.m01.d04:meMA.Ode4C12.incipit	…
ltx/en_us_dedes/me.m01.d04:meMA.Ode4C12.melody	@ltx/en_us_dedes/he.h.m6:heHE.ChristosMouDynamis.name
ltx/en_us_dedes/me.m01.d04:meMA.Ode4C12.mode	@ltx/en_us_dedes/miscellanea:misc.Mode6
ltx/en_us_dedes/me.m01.d04:meMA.Ode4C12.ode	@ltx/en_us_dedes/miscellanea:misc.Ode4
ltx/en_us_dedes/me.m01.d04:meMA.Ode4C12.text	
ltx/en_us_dedes/me.m01.d04:meMA.Ode4C13.incipit	…
ltx/en_us_dedes/me.m01.d04:meMA.Ode4C13.melody	@ltx/en_us_dedes/he.h.m6:heHE.ChristosMouDynamis.name
ltx/en_us_dedes/me.m01.d04:meMA.Ode4C13.mode	@ltx/en_us_dedes/miscellanea:misc.Mode6
ltx/en_us_dedes/me.m01.d04:meMA.Ode4C13.ode	@ltx/en_us_dedes/miscellanea:misc.Ode4
ltx/en_us_dedes/me.m01.d04:meMA.Ode4C13.text	
ltx/en_us_dedes/me.m01.d04:meMA.Ode4C1H.greekmelody	@ltx/en_us_dedes/he.h.m6:heHE.ChristosMouDynamis.greekname
ltx/en_us_dedes/me.m01.d04:meMA.Ode4C1H.incipit	@ltx/en_us_dedes/he.h.m6:heHE.ChristosMouDynamis.incipit
ltx/en_us_dedes/me.m01.d04:meMA.Ode4C1H.melody	@ltx/en_us_dedes/he.h.m6:heHE.ChristosMouDynamis.melody
ltx/en_us_dedes/me.m01.d04:meMA.Ode4C1H.mode	@ltx/en_us_dedes/miscellanea:misc.Mode6
ltx/en_us_dedes/me.m01.d04:meMA.Ode4C1H.ode	@ltx/en_us_dedes/miscellanea:misc.Ode4
ltx/en_us_dedes/me.m01.d04:meMA.Ode4C1H.text	@ltx/en_us_dedes/he.h.m6:heHE.ChristosMouDynamis.text
ltx/en_us_dedes/me.m01.d04:meMA.Ode4C21.greekmelody	@ltx/en_us_dedes/he.h.m4:heHE.TinAnexichniaston.greekname
ltx/en_us_dedes/me.m01.d04:meMA.Ode4C21.incipit	…
ltx/en_us_dedes/me.m01.d04:meMA.Ode4C21.melody	@ltx/en_us_dedes/he.h.m4:heHE.TinAnexichniaston.name
ltx/en_us_dedes/me.m01.d04:meMA.Ode4C21.mode	@ltx/en_us_dedes/miscellanea:misc.Mode4
ltx/en_us_dedes/me.m01.d04:meMA.Ode4C21.ode	@ltx/en_us_dedes/miscellanea:misc.Ode4
ltx/en_us_dedes/me.m01.d04:meMA.Ode4C21.text	
ltx/en_us_dedes/me.m01.d04:meMA.Ode4C22.incipit	…
ltx/en_us_dedes/me.m01.d04:meMA.Ode4C22.melody	@ltx/en_us_dedes/he.h.m4:heHE.TinAnexichniaston.name
ltx/en_us_dedes/me.m01.d04:meMA.Ode4C22.mode	@ltx/en_us_dedes/miscellanea:misc.Mode4
ltx/en_us_dedes/me.m01.d04:meMA.Ode4C22.ode	@ltx/en_us_dedes/miscellanea:misc.Ode4
ltx/en_us_dedes/me.m01.d04:meMA.Ode4C22.text	
ltx/en_us_dedes/me.m01.d04:meMA.Ode4C23.incipit	…
ltx/en_us_dedes/me.m01.d04:meMA.Ode4C23.melody	@ltx/en_us_dedes/he.h.m4:heHE.TinAnexichniaston.name
ltx/en_us_dedes/me.m01.d04:meMA.Ode4C23.mode	@ltx/en_us_dedes/miscellanea:misc.Mode4
ltx/en_us_dedes/me.m01.d04:meMA.Ode4C23.ode	@ltx/en_us_dedes/miscellanea:misc.Ode4
ltx/en_us_dedes/me.m01.d04:meMA.Ode4C23.text	
ltx/en_us_dedes/me.m01.d04:meMA.Ode4C24.incipit	…
ltx/en_us_dedes/me.m01.d04:meMA.Ode4C24.melody	@ltx/en_us_dedes/he.h.m4:heHE.TinAnexichniaston.name
ltx/en_us_dedes/me.m01.d04:meMA.Ode4C24.mode	@ltx/en_us_dedes/miscellanea:misc.Mode4
ltx/en_us_dedes/me.m01.d04:meMA.Ode4C24.ode	@ltx/en_us_dedes/miscellanea:misc.Ode4
ltx/en_us_dedes/me.m01.d04:meMA.Ode4C24.text	
ltx/en_us_dedes/me.m01.d04:meMA.Ode4C2T.incipit	…
ltx/en_us_dedes/me.m01.d04:meMA.Ode4C2T.melody	@ltx/en_us_dedes/he.h.m4:heHE.TinAnexichniaston.name
ltx/en_us_dedes/me.m01.d04:meMA.Ode4C2T.mode	@ltx/en_us_dedes/miscellanea:misc.Mode4
ltx/en_us_dedes/me.m01.d04:meMA.Ode4C2T.ode	@ltx/en_us_dedes/miscellanea:misc.Ode4
ltx/en_us_dedes/me.m01.d04:meMA.Ode4C2T.text	
ltx/en_us_dedes/me.m01.d04:meMA.Ode4C31.greekmelody	@ltx/en_us_dedes/he.h.m2:heHE.ElilythasEkParthenou.greekname
ltx/en_us_dedes/me.m01.d04:meMA.Ode4C31.incipit	…
ltx/en_us_dedes/me.m01.d04:meMA.Ode4C31.melody	@ltx/en_us_dedes/he.h.m2:heHE.ElilythasEkParthenou.name
ltx/en_us_dedes/me.m01.d04:meMA.Ode4C31.mode	@ltx/en_us_dedes/miscellanea:misc.Mode2
ltx/en_us_dedes/me.m01.d04:meMA.Ode4C31.ode	@ltx/en_us_dedes/miscellanea:misc.Ode4
ltx/en_us_dedes/me.m01.d04:meMA.Ode4C31.text	
ltx/en_us_dedes/me.m01.d04:meMA.Ode4C32.incipit	…
ltx/en_us_dedes/me.m01.d04:meMA.Ode4C32.melody	@ltx/en_us_dedes/he.h.m2:heHE.ElilythasEkParthenou.name
ltx/en_us_dedes/me.m01.d04:meMA.Ode4C32.mode	@ltx/en_us_dedes/miscellanea:misc.Mode2
ltx/en_us_dedes/me.m01.d04:meMA.Ode4C32.ode	@ltx/en_us_dedes/miscellanea:misc.Ode4
ltx/en_us_dedes/me.m01.d04:meMA.Ode4C32.text	
ltx/en_us_dedes/me.m01.d04:meMA.Ode4C33.incipit	…
ltx/en_us_dedes/me.m01.d04:meMA.Ode4C33.melody	@ltx/en_us_dedes/he.h.m2:heHE.ElilythasEkParthenou.name
ltx/en_us_dedes/me.m01.d04:meMA.Ode4C33.mode	@ltx/en_us_dedes/miscellanea:misc.Mode2
ltx/en_us_dedes/me.m01.d04:meMA.Ode4C33.ode	@ltx/en_us_dedes/miscellanea:misc.Ode4
ltx/en_us_dedes/me.m01.d04:meMA.Ode4C33.text	
ltx/en_us_dedes/me.m01.d04:meMA.Ode4C3T.incipit	…
ltx/en_us_dedes/me.m01.d04:meMA.Ode4C3T.melody	@ltx/en_us_dedes/he.h.m2:heHE.ElilythasEkParthenou.name
ltx/en_us_dedes/me.m01.d04:meMA.Ode4C3T.mode	@ltx/en_us_dedes/miscellanea:misc.Mode2
ltx/en_us_dedes/me.m01.d04:meMA.Ode4C3T.ode	@ltx/en_us_dedes/miscellanea:misc.Ode4
ltx/en_us_dedes/me.m01.d04:meMA.Ode4C3T.text	
ltx/en_us_dedes/me.m01.d04:meMA.Ode5C11.greekmelody	@ltx/en_us_dedes/he.h.m6:heHE.ToTheioFengeiSou.greekname
ltx/en_us_dedes/me.m01.d04:meMA.Ode5C11.incipit	…
ltx/en_us_dedes/me.m01.d04:meMA.Ode5C11.melody	@ltx/en_us_dedes/he.h.m6:heHE.ToTheioFengeiSou.name
ltx/en_us_dedes/me.m01.d04:meMA.Ode5C11.mode	@ltx/en_us_dedes/miscellanea:misc.Mode6
ltx/en_us_dedes/me.m01.d04:meMA.Ode5C11.ode	@ltx/en_us_dedes/miscellanea:misc.Ode5
ltx/en_us_dedes/me.m01.d04:meMA.Ode5C11.text	
ltx/en_us_dedes/me.m01.d04:meMA.Ode5C12.incipit	…
ltx/en_us_dedes/me.m01.d04:meMA.Ode5C12.melody	@ltx/en_us_dedes/he.h.m6:heHE.ToTheioFengeiSou.name
ltx/en_us_dedes/me.m01.d04:meMA.Ode5C12.mode	@ltx/en_us_dedes/miscellanea:misc.Mode6
ltx/en_us_dedes/me.m01.d04:meMA.Ode5C12.ode	@ltx/en_us_dedes/miscellanea:misc.Ode5
ltx/en_us_dedes/me.m01.d04:meMA.Ode5C12.text	
ltx/en_us_dedes/me.m01.d04:meMA.Ode5C13.incipit	…
ltx/en_us_dedes/me.m01.d04:meMA.Ode5C13.melody	@ltx/en_us_dedes/he.h.m6:heHE.ToTheioFengeiSou.name
ltx/en_us_dedes/me.m01.d04:meMA.Ode5C13.mode	@ltx/en_us_dedes/miscellanea:misc.Mode6
ltx/en_us_dedes/me.m01.d04:meMA.Ode5C13.ode	@ltx/en_us_dedes/miscellanea:misc.Ode5
ltx/en_us_dedes/me.m01.d04:meMA.Ode5C13.text	
ltx/en_us_dedes/me.m01.d04:meMA.Ode5C1H.greekmelody	@ltx/en_us_dedes/he.h.m6:heHE.ToTheioFengeiSou.greekname
ltx/en_us_dedes/me.m01.d04:meMA.Ode5C1H.incipit	@ltx/en_us_dedes/he.h.m6:heHE.ToTheioFengeiSou.incipit
ltx/en_us_dedes/me.m01.d04:meMA.Ode5C1H.melody	@ltx/en_us_dedes/he.h.m6:heHE.ToTheioFengeiSou.melody
ltx/en_us_dedes/me.m01.d04:meMA.Ode5C1H.mode	@ltx/en_us_dedes/miscellanea:misc.Mode6
ltx/en_us_dedes/me.m01.d04:meMA.Ode5C1H.ode	@ltx/en_us_dedes/miscellanea:misc.Ode5
ltx/en_us_dedes/me.m01.d04:meMA.Ode5C1H.text	@ltx/en_us_dedes/he.h.m6:heHE.ToTheioFengeiSou.text
ltx/en_us_dedes/me.m01.d04:meMA.Ode5C21.greekmelody	@ltx/en_us_dedes/he.h.m4:heHE.ExestiTaSympanta.greekname
ltx/en_us_dedes/me.m01.d04:meMA.Ode5C21.incipit	…
ltx/en_us_dedes/me.m01.d04:meMA.Ode5C21.melody	@ltx/en_us_dedes/he.h.m4:heHE.ExestiTaSympanta.name
ltx/en_us_dedes/me.m01.d04:meMA.Ode5C21.mode	@ltx/en_us_dedes/miscellanea:misc.Mode4
ltx/en_us_dedes/me.m01.d04:meMA.Ode5C21.ode	@ltx/en_us_dedes/miscellanea:misc.Ode5
ltx/en_us_dedes/me.m01.d04:meMA.Ode5C21.text	
ltx/en_us_dedes/me.m01.d04:meMA.Ode5C22.incipit	…
ltx/en_us_dedes/me.m01.d04:meMA.Ode5C22.melody	@ltx/en_us_dedes/he.h.m4:heHE.ExestiTaSympanta.name
ltx/en_us_dedes/me.m01.d04:meMA.Ode5C22.mode	@ltx/en_us_dedes/miscellanea:misc.Mode4
ltx/en_us_dedes/me.m01.d04:meMA.Ode5C22.ode	@ltx/en_us_dedes/miscellanea:misc.Ode5
ltx/en_us_dedes/me.m01.d04:meMA.Ode5C22.text	
ltx/en_us_dedes/me.m01.d04:meMA.Ode5C23.incipit	…
ltx/en_us_dedes/me.m01.d04:meMA.Ode5C23.melody	@ltx/en_us_dedes/he.h.m4:heHE.ExestiTaSympanta.name
ltx/en_us_dedes/me.m01.d04:meMA.Ode5C23.mode	@ltx/en_us_dedes/miscellanea:misc.Mode4
ltx/en_us_dedes/me.m01.d04:meMA.Ode5C23.ode	@ltx/en_us_dedes/miscellanea:misc.Ode5
ltx/en_us_dedes/me.m01.d04:meMA.Ode5C23.text	
ltx/en_us_dedes/me.m01.d04:meMA.Ode5C2T.incipit	…
ltx/en_us_dedes/me.m01.d04:meMA.Ode5C2T.melody	@ltx/en_us_dedes/he.h.m4:heHE.ExestiTaSympanta.name
ltx/en_us_dedes/me.m01.d04:meMA.Ode5C2T.mode	@ltx/en_us_dedes/miscellanea:misc.Mode4
ltx/en_us_dedes/me.m01.d04:meMA.Ode5C2T.ode	@ltx/en_us_dedes/miscellanea:misc.Ode5
ltx/en_us_dedes/me.m01.d04:meMA.Ode5C2T.text	
ltx/en_us_dedes/me.m01.d04:meMA.Ode5C31.greekmelody	@ltx/en_us_dedes/he.h.m2:heHE.OFotismos.greekname
ltx/en_us_dedes/me.m01.d04:meMA.Ode5C31.incipit	…
ltx/en_us_dedes/me.m01.d04:meMA.Ode5C31.melody	@ltx/en_us_dedes/he.h.m2:heHE.OFotismos.name
ltx/en_us_dedes/me.m01.d04:meMA.Ode5C31.mode	@ltx/en_us_dedes/miscellanea:misc.Mode2
ltx/en_us_dedes/me.m01.d04:meMA.Ode5C31.ode	@ltx/en_us_dedes/miscellanea:misc.Ode5
ltx/en_us_dedes/me.m01.d04:meMA.Ode5C31.text	
ltx/en_us_dedes/me.m01.d04:meMA.Ode5C32.incipit	…
ltx/en_us_dedes/me.m01.d04:meMA.Ode5C32.melody	@ltx/en_us_dedes/he.h.m2:heHE.OFotismos.name
ltx/en_us_dedes/me.m01.d04:meMA.Ode5C32.mode	@ltx/en_us_dedes/miscellanea:misc.Mode2
ltx/en_us_dedes/me.m01.d04:meMA.Ode5C32.ode	@ltx/en_us_dedes/miscellanea:misc.Ode5
ltx/en_us_dedes/me.m01.d04:meMA.Ode5C32.text	
ltx/en_us_dedes/me.m01.d04:meMA.Ode5C33.incipit	…
ltx/en_us_dedes/me.m01.d04:meMA.Ode5C33.melody	@ltx/en_us_dedes/he.h.m2:heHE.OFotismos.name
ltx/en_us_dedes/me.m01.d04:meMA.Ode5C33.mode	@ltx/en_us_dedes/miscellanea:misc.Mode2
ltx/en_us_dedes/me.m01.d04:meMA.Ode5C33.ode	@ltx/en_us_dedes/miscellanea:misc.Ode5
ltx/en_us_dedes/me.m01.d04:meMA.Ode5C33.text	
ltx/en_us_dedes/me.m01.d04:meMA.Ode5C3T.incipit	…
ltx/en_us_dedes/me.m01.d04:meMA.Ode5C3T.melody	@ltx/en_us_dedes/he.h.m2:heHE.OFotismos.name
ltx/en_us_dedes/me.m01.d04:meMA.Ode5C3T.mode	@ltx/en_us_dedes/miscellanea:misc.Mode2
ltx/en_us_dedes/me.m01.d04:meMA.Ode5C3T.ode	@ltx/en_us_dedes/miscellanea:misc.Ode5
ltx/en_us_dedes/me.m01.d04:meMA.Ode5C3T.text	
ltx/en_us_dedes/me.m01.d04:meMA.Ode6C11.greekmelody	@ltx/en_us_dedes/he.h.m6:heHE.TouViouTinThalassan.greekname
ltx/en_us_dedes/me.m01.d04:meMA.Ode6C11.incipit	…
ltx/en_us_dedes/me.m01.d04:meMA.Ode6C11.melody	@ltx/en_us_dedes/he.h.m6:heHE.TouViouTinThalassan.name
ltx/en_us_dedes/me.m01.d04:meMA.Ode6C11.mode	@ltx/en_us_dedes/miscellanea:misc.Mode6
ltx/en_us_dedes/me.m01.d04:meMA.Ode6C11.ode	@ltx/en_us_dedes/miscellanea:misc.Ode6
ltx/en_us_dedes/me.m01.d04:meMA.Ode6C11.text	
ltx/en_us_dedes/me.m01.d04:meMA.Ode6C12.incipit	…
ltx/en_us_dedes/me.m01.d04:meMA.Ode6C12.melody	@ltx/en_us_dedes/he.h.m6:heHE.TouViouTinThalassan.name
ltx/en_us_dedes/me.m01.d04:meMA.Ode6C12.mode	@ltx/en_us_dedes/miscellanea:misc.Mode6
ltx/en_us_dedes/me.m01.d04:meMA.Ode6C12.ode	@ltx/en_us_dedes/miscellanea:misc.Ode6
ltx/en_us_dedes/me.m01.d04:meMA.Ode6C12.text	
ltx/en_us_dedes/me.m01.d04:meMA.Ode6C13.incipit	…
ltx/en_us_dedes/me.m01.d04:meMA.Ode6C13.melody	@ltx/en_us_dedes/he.h.m6:heHE.TouViouTinThalassan.name
ltx/en_us_dedes/me.m01.d04:meMA.Ode6C13.mode	@ltx/en_us_dedes/miscellanea:misc.Mode6
ltx/en_us_dedes/me.m01.d04:meMA.Ode6C13.ode	@ltx/en_us_dedes/miscellanea:misc.Ode6
ltx/en_us_dedes/me.m01.d04:meMA.Ode6C13.text	
ltx/en_us_dedes/me.m01.d04:meMA.Ode6C1H.greekmelody	@ltx/en_us_dedes/he.h.m6:heHE.TouViouTinThalassan.greekname
ltx/en_us_dedes/me.m01.d04:meMA.Ode6C1H.incipit	@ltx/en_us_dedes/he.h.m6:heHE.TouViouTinThalassan.incipit
ltx/en_us_dedes/me.m01.d04:meMA.Ode6C1H.melody	@ltx/en_us_dedes/he.h.m6:heHE.TouViouTinThalassan.melody
ltx/en_us_dedes/me.m01.d04:meMA.Ode6C1H.mode	@ltx/en_us_dedes/miscellanea:misc.Mode6
ltx/en_us_dedes/me.m01.d04:meMA.Ode6C1H.ode	@ltx/en_us_dedes/miscellanea:misc.Ode6
ltx/en_us_dedes/me.m01.d04:meMA.Ode6C1H.text	@ltx/en_us_dedes/he.h.m6:heHE.TouViouTinThalassan.text
ltx/en_us_dedes/me.m01.d04:meMA.Ode6C21.greekmelody	@ltx/en_us_dedes/he.h.m4:heHE.TinTheianTaftin.greekname
ltx/en_us_dedes/me.m01.d04:meMA.Ode6C21.incipit	…
ltx/en_us_dedes/me.m01.d04:meMA.Ode6C21.melody	@ltx/en_us_dedes/he.h.m4:heHE.TinTheianTaftin.name
ltx/en_us_dedes/me.m01.d04:meMA.Ode6C21.mode	@ltx/en_us_dedes/miscellanea:misc.Mode4
ltx/en_us_dedes/me.m01.d04:meMA.Ode6C21.ode	@ltx/en_us_dedes/miscellanea:misc.Ode6
ltx/en_us_dedes/me.m01.d04:meMA.Ode6C21.text	
ltx/en_us_dedes/me.m01.d04:meMA.Ode6C22.incipit	…
ltx/en_us_dedes/me.m01.d04:meMA.Ode6C22.melody	@ltx/en_us_dedes/he.h.m4:heHE.TinTheianTaftin.name
ltx/en_us_dedes/me.m01.d04:meMA.Ode6C22.mode	@ltx/en_us_dedes/miscellanea:misc.Mode4
ltx/en_us_dedes/me.m01.d04:meMA.Ode6C22.ode	@ltx/en_us_dedes/miscellanea:misc.Ode6
ltx/en_us_dedes/me.m01.d04:meMA.Ode6C22.text	
ltx/en_us_dedes/me.m01.d04:meMA.Ode6C23.incipit	…
ltx/en_us_dedes/me.m01.d04:meMA.Ode6C23.melody	@ltx/en_us_dedes/he.h.m4:heHE.TinTheianTaftin.name
ltx/en_us_dedes/me.m01.d04:meMA.Ode6C23.mode	@ltx/en_us_dedes/miscellanea:misc.Mode4
ltx/en_us_dedes/me.m01.d04:meMA.Ode6C23.ode	@ltx/en_us_dedes/miscellanea:misc.Ode6
ltx/en_us_dedes/me.m01.d04:meMA.Ode6C23.text	
ltx/en_us_dedes/me.m01.d04:meMA.Ode6C2T.incipit	…
ltx/en_us_dedes/me.m01.d04:meMA.Ode6C2T.melody	@ltx/en_us_dedes/he.h.m4:heHE.TinTheianTaftin.name
ltx/en_us_dedes/me.m01.d04:meMA.Ode6C2T.mode	@ltx/en_us_dedes/miscellanea:misc.Mode4
ltx/en_us_dedes/me.m01.d04:meMA.Ode6C2T.ode	@ltx/en_us_dedes/miscellanea:misc.Ode6
ltx/en_us_dedes/me.m01.d04:meMA.Ode6C2T.text	
ltx/en_us_dedes/me.m01.d04:meMA.Ode6C31.greekmelody	@ltx/en_us_dedes/he.h.m2:heHE.EnAvyssoPtaismaton.greekname
ltx/en_us_dedes/me.m01.d04:meMA.Ode6C31.incipit	…
ltx/en_us_dedes/me.m01.d04:meMA.Ode6C31.melody	@ltx/en_us_dedes/he.h.m2:heHE.EnAvyssoPtaismaton.name
ltx/en_us_dedes/me.m01.d04:meMA.Ode6C31.mode	@ltx/en_us_dedes/miscellanea:misc.Mode2
ltx/en_us_dedes/me.m01.d04:meMA.Ode6C31.ode	@ltx/en_us_dedes/miscellanea:misc.Ode6
ltx/en_us_dedes/me.m01.d04:meMA.Ode6C31.text	
ltx/en_us_dedes/me.m01.d04:meMA.Ode6C32.incipit	…
ltx/en_us_dedes/me.m01.d04:meMA.Ode6C32.melody	@ltx/en_us_dedes/he.h.m2:heHE.EnAvyssoPtaismaton.name
ltx/en_us_dedes/me.m01.d04:meMA.Ode6C32.mode	@ltx/en_us_dedes/miscellanea:misc.Mode2
ltx/en_us_dedes/me.m01.d04:meMA.Ode6C32.ode	@ltx/en_us_dedes/miscellanea:misc.Ode6
ltx/en_us_dedes/me.m01.d04:meMA.Ode6C32.text	
ltx/en_us_dedes/me.m01.d04:meMA.Ode6C3T.incipit	…
ltx/en_us_dedes/me.m01.d04:meMA.Ode6C3T.melody	@ltx/en_us_dedes/he.h.m2:heHE.EnAvyssoPtaismaton.name
ltx/en_us_dedes/me.m01.d04:meMA.Ode6C3T.mode	@ltx/en_us_dedes/miscellanea:misc.Mode2
ltx/en_us_dedes/me.m01.d04:meMA.Ode6C3T.ode	@ltx/en_us_dedes/miscellanea:misc.Ode6
ltx/en_us_dedes/me.m01.d04:meMA.Ode6C3T.text	
ltx/en_us_dedes/me.m01.d04:meMA.Ode6H.greekmelody	@ltx/en_us_dedes/he.h.m2:heHE.EnAvyssoPtaismaton.greekname
ltx/en_us_dedes/me.m01.d04:meMA.Ode6H.incipit	@ltx/en_us_dedes/he.h.m2:heHE.EnAvyssoPtaismaton.incipit
ltx/en_us_dedes/me.m01.d04:meMA.Ode6H.melody	@ltx/en_us_dedes/he.h.m2:heHE.EnAvyssoPtaismaton.melody
ltx/en_us_dedes/me.m01.d04:meMA.Ode6H.mode	@ltx/en_us_dedes/miscellanea:misc.Mode2
ltx/en_us_dedes/me.m01.d04:meMA.Ode6H.ode	@ltx/en_us_dedes/miscellanea:misc.Ode6
ltx/en_us_dedes/me.m01.d04:meMA.Ode6H.text	@ltx/en_us_dedes/he.h.m2:heHE.EnAvyssoPtaismaton.text
ltx/en_us_dedes/me.m01.d04:meMA.Ode7C11.greekmelody	@ltx/en_us_dedes/he.h.m6:heHE.DrosovolonMenTinKaminon.greekname
ltx/en_us_dedes/me.m01.d04:meMA.Ode7C11.incipit	…
ltx/en_us_dedes/me.m01.d04:meMA.Ode7C11.melody	@ltx/en_us_dedes/he.h.m6:heHE.DrosovolonMenTinKaminon.name
ltx/en_us_dedes/me.m01.d04:meMA.Ode7C11.mode	@ltx/en_us_dedes/miscellanea:misc.Mode6
ltx/en_us_dedes/me.m01.d04:meMA.Ode7C11.ode	@ltx/en_us_dedes/miscellanea:misc.Ode7
ltx/en_us_dedes/me.m01.d04:meMA.Ode7C11.text	
ltx/en_us_dedes/me.m01.d04:meMA.Ode7C12.incipit	…
ltx/en_us_dedes/me.m01.d04:meMA.Ode7C12.melody	@ltx/en_us_dedes/he.h.m6:heHE.DrosovolonMenTinKaminon.name
ltx/en_us_dedes/me.m01.d04:meMA.Ode7C12.mode	@ltx/en_us_dedes/miscellanea:misc.Mode6
ltx/en_us_dedes/me.m01.d04:meMA.Ode7C12.ode	@ltx/en_us_dedes/miscellanea:misc.Ode7
ltx/en_us_dedes/me.m01.d04:meMA.Ode7C12.text	
ltx/en_us_dedes/me.m01.d04:meMA.Ode7C13.incipit	…
ltx/en_us_dedes/me.m01.d04:meMA.Ode7C13.melody	@ltx/en_us_dedes/he.h.m6:heHE.DrosovolonMenTinKaminon.name
ltx/en_us_dedes/me.m01.d04:meMA.Ode7C13.mode	@ltx/en_us_dedes/miscellanea:misc.Mode6
ltx/en_us_dedes/me.m01.d04:meMA.Ode7C13.ode	@ltx/en_us_dedes/miscellanea:misc.Ode7
ltx/en_us_dedes/me.m01.d04:meMA.Ode7C13.text	
ltx/en_us_dedes/me.m01.d04:meMA.Ode7C1H.greekmelody	@ltx/en_us_dedes/he.h.m6:heHE.DrosovolonMenTinKaminon.greekname
ltx/en_us_dedes/me.m01.d04:meMA.Ode7C1H.incipit	@ltx/en_us_dedes/he.h.m6:heHE.DrosovolonMenTinKaminon.incipit
ltx/en_us_dedes/me.m01.d04:meMA.Ode7C1H.melody	@ltx/en_us_dedes/he.h.m6:heHE.DrosovolonMenTinKaminon.melody
ltx/en_us_dedes/me.m01.d04:meMA.Ode7C1H.mode	@ltx/en_us_dedes/miscellanea:misc.Mode6
ltx/en_us_dedes/me.m01.d04:meMA.Ode7C1H.ode	@ltx/en_us_dedes/miscellanea:misc.Ode7
ltx/en_us_dedes/me.m01.d04:meMA.Ode7C1H.text	@ltx/en_us_dedes/he.h.m6:heHE.DrosovolonMenTinKaminon.text
ltx/en_us_dedes/me.m01.d04:meMA.Ode7C21.greekmelody	@ltx/en_us_dedes/he.h.m4:heHE.OukElatrefsan.greekname
ltx/en_us_dedes/me.m01.d04:meMA.Ode7C21.incipit	…
ltx/en_us_dedes/me.m01.d04:meMA.Ode7C21.melody	@ltx/en_us_dedes/he.h.m4:heHE.OukElatrefsan.name
ltx/en_us_dedes/me.m01.d04:meMA.Ode7C21.mode	@ltx/en_us_dedes/miscellanea:misc.Mode4
ltx/en_us_dedes/me.m01.d04:meMA.Ode7C21.ode	@ltx/en_us_dedes/miscellanea:misc.Ode7
ltx/en_us_dedes/me.m01.d04:meMA.Ode7C21.text	
ltx/en_us_dedes/me.m01.d04:meMA.Ode7C22.incipit	…
ltx/en_us_dedes/me.m01.d04:meMA.Ode7C22.melody	@ltx/en_us_dedes/he.h.m4:heHE.OukElatrefsan.name
ltx/en_us_dedes/me.m01.d04:meMA.Ode7C22.mode	@ltx/en_us_dedes/miscellanea:misc.Mode4
ltx/en_us_dedes/me.m01.d04:meMA.Ode7C22.ode	@ltx/en_us_dedes/miscellanea:misc.Ode7
ltx/en_us_dedes/me.m01.d04:meMA.Ode7C22.text	
ltx/en_us_dedes/me.m01.d04:meMA.Ode7C23.incipit	…
ltx/en_us_dedes/me.m01.d04:meMA.Ode7C23.melody	@ltx/en_us_dedes/he.h.m4:heHE.OukElatrefsan.name
ltx/en_us_dedes/me.m01.d04:meMA.Ode7C23.mode	@ltx/en_us_dedes/miscellanea:misc.Mode4
ltx/en_us_dedes/me.m01.d04:meMA.Ode7C23.ode	@ltx/en_us_dedes/miscellanea:misc.Ode7
ltx/en_us_dedes/me.m01.d04:meMA.Ode7C23.text	
ltx/en_us_dedes/me.m01.d04:meMA.Ode7C24.incipit	…
ltx/en_us_dedes/me.m01.d04:meMA.Ode7C24.melody	@ltx/en_us_dedes/he.h.m4:heHE.OukElatrefsan.name
ltx/en_us_dedes/me.m01.d04:meMA.Ode7C24.mode	@ltx/en_us_dedes/miscellanea:misc.Mode4
ltx/en_us_dedes/me.m01.d04:meMA.Ode7C24.ode	@ltx/en_us_dedes/miscellanea:misc.Ode7
ltx/en_us_dedes/me.m01.d04:meMA.Ode7C24.text	
ltx/en_us_dedes/me.m01.d04:meMA.Ode7C2T.incipit	…
ltx/en_us_dedes/me.m01.d04:meMA.Ode7C2T.melody	@ltx/en_us_dedes/he.h.m4:heHE.OukElatrefsan.name
ltx/en_us_dedes/me.m01.d04:meMA.Ode7C2T.mode	@ltx/en_us_dedes/miscellanea:misc.Mode4
ltx/en_us_dedes/me.m01.d04:meMA.Ode7C2T.ode	@ltx/en_us_dedes/miscellanea:misc.Ode7
ltx/en_us_dedes/me.m01.d04:meMA.Ode7C2T.text	
ltx/en_us_dedes/me.m01.d04:meMA.Ode7C31.greekmelody	@ltx/en_us_dedes/he.h.m2:heHE.AntitheonProstagma.greekname
ltx/en_us_dedes/me.m01.d04:meMA.Ode7C31.incipit	…
ltx/en_us_dedes/me.m01.d04:meMA.Ode7C31.melody	@ltx/en_us_dedes/he.h.m2:heHE.AntitheonProstagma.name
ltx/en_us_dedes/me.m01.d04:meMA.Ode7C31.mode	@ltx/en_us_dedes/miscellanea:misc.Mode2
ltx/en_us_dedes/me.m01.d04:meMA.Ode7C31.ode	@ltx/en_us_dedes/miscellanea:misc.Ode7
ltx/en_us_dedes/me.m01.d04:meMA.Ode7C31.text	
ltx/en_us_dedes/me.m01.d04:meMA.Ode7C32.incipit	…
ltx/en_us_dedes/me.m01.d04:meMA.Ode7C32.melody	@ltx/en_us_dedes/he.h.m2:heHE.AntitheonProstagma.name
ltx/en_us_dedes/me.m01.d04:meMA.Ode7C32.mode	@ltx/en_us_dedes/miscellanea:misc.Mode2
ltx/en_us_dedes/me.m01.d04:meMA.Ode7C32.ode	@ltx/en_us_dedes/miscellanea:misc.Ode7
ltx/en_us_dedes/me.m01.d04:meMA.Ode7C32.text	
ltx/en_us_dedes/me.m01.d04:meMA.Ode7C3T.incipit	…
ltx/en_us_dedes/me.m01.d04:meMA.Ode7C3T.melody	@ltx/en_us_dedes/he.h.m2:heHE.AntitheonProstagma.name
ltx/en_us_dedes/me.m01.d04:meMA.Ode7C3T.mode	@ltx/en_us_dedes/miscellanea:misc.Mode2
ltx/en_us_dedes/me.m01.d04:meMA.Ode7C3T.ode	@ltx/en_us_dedes/miscellanea:misc.Ode7
ltx/en_us_dedes/me.m01.d04:meMA.Ode7C3T.text	
ltx/en_us_dedes/me.m01.d04:meMA.Ode8C11.greekmelody	@ltx/en_us_dedes/he.h.m6:heHE.EkFlogosToisOsiois.greekname
ltx/en_us_dedes/me.m01.d04:meMA.Ode8C11.incipit	…
ltx/en_us_dedes/me.m01.d04:meMA.Ode8C11.melody	@ltx/en_us_dedes/he.h.m6:heHE.EkFlogosToisOsiois.name
ltx/en_us_dedes/me.m01.d04:meMA.Ode8C11.mode	@ltx/en_us_dedes/miscellanea:misc.Mode6
ltx/en_us_dedes/me.m01.d04:meMA.Ode8C11.ode	@ltx/en_us_dedes/miscellanea:misc.Ode8
ltx/en_us_dedes/me.m01.d04:meMA.Ode8C11.text	
ltx/en_us_dedes/me.m01.d04:meMA.Ode8C12.incipit	…
ltx/en_us_dedes/me.m01.d04:meMA.Ode8C12.melody	@ltx/en_us_dedes/he.h.m6:heHE.EkFlogosToisOsiois.name
ltx/en_us_dedes/me.m01.d04:meMA.Ode8C12.mode	@ltx/en_us_dedes/miscellanea:misc.Mode6
ltx/en_us_dedes/me.m01.d04:meMA.Ode8C12.ode	@ltx/en_us_dedes/miscellanea:misc.Ode8
ltx/en_us_dedes/me.m01.d04:meMA.Ode8C12.text	
ltx/en_us_dedes/me.m01.d04:meMA.Ode8C13.incipit	…
ltx/en_us_dedes/me.m01.d04:meMA.Ode8C13.melody	@ltx/en_us_dedes/he.h.m6:heHE.EkFlogosToisOsiois.name
ltx/en_us_dedes/me.m01.d04:meMA.Ode8C13.mode	@ltx/en_us_dedes/miscellanea:misc.Mode6
ltx/en_us_dedes/me.m01.d04:meMA.Ode8C13.ode	@ltx/en_us_dedes/miscellanea:misc.Ode8
ltx/en_us_dedes/me.m01.d04:meMA.Ode8C13.text	
ltx/en_us_dedes/me.m01.d04:meMA.Ode8C1H.greekmelody	@ltx/en_us_dedes/he.h.m6:heHE.EkFlogosToisOsiois.greekname
ltx/en_us_dedes/me.m01.d04:meMA.Ode8C1H.incipit	@ltx/en_us_dedes/he.h.m6:heHE.EkFlogosToisOsiois.incipit
ltx/en_us_dedes/me.m01.d04:meMA.Ode8C1H.melody	@ltx/en_us_dedes/he.h.m6:heHE.EkFlogosToisOsiois.melody
ltx/en_us_dedes/me.m01.d04:meMA.Ode8C1H.mode	@ltx/en_us_dedes/miscellanea:misc.Mode6
ltx/en_us_dedes/me.m01.d04:meMA.Ode8C1H.ode	@ltx/en_us_dedes/miscellanea:misc.Ode8
ltx/en_us_dedes/me.m01.d04:meMA.Ode8C1H.text	@ltx/en_us_dedes/he.h.m6:heHE.EkFlogosToisOsiois.text
ltx/en_us_dedes/me.m01.d04:meMA.Ode8C21.greekmelody	@ltx/en_us_dedes/he.h.m4:heHE.PaidasEvageis.greekname
ltx/en_us_dedes/me.m01.d04:meMA.Ode8C21.incipit	…
ltx/en_us_dedes/me.m01.d04:meMA.Ode8C21.melody	@ltx/en_us_dedes/he.h.m4:heHE.PaidasEvageis.name
ltx/en_us_dedes/me.m01.d04:meMA.Ode8C21.mode	@ltx/en_us_dedes/miscellanea:misc.Mode4
ltx/en_us_dedes/me.m01.d04:meMA.Ode8C21.ode	@ltx/en_us_dedes/miscellanea:misc.Ode8
ltx/en_us_dedes/me.m01.d04:meMA.Ode8C21.text	
ltx/en_us_dedes/me.m01.d04:meMA.Ode8C22.incipit	…
ltx/en_us_dedes/me.m01.d04:meMA.Ode8C22.melody	@ltx/en_us_dedes/he.h.m4:heHE.PaidasEvageis.name
ltx/en_us_dedes/me.m01.d04:meMA.Ode8C22.mode	@ltx/en_us_dedes/miscellanea:misc.Mode4
ltx/en_us_dedes/me.m01.d04:meMA.Ode8C22.ode	@ltx/en_us_dedes/miscellanea:misc.Ode8
ltx/en_us_dedes/me.m01.d04:meMA.Ode8C22.text	
ltx/en_us_dedes/me.m01.d04:meMA.Ode8C23.incipit	…
ltx/en_us_dedes/me.m01.d04:meMA.Ode8C23.melody	@ltx/en_us_dedes/he.h.m4:heHE.PaidasEvageis.name
ltx/en_us_dedes/me.m01.d04:meMA.Ode8C23.mode	@ltx/en_us_dedes/miscellanea:misc.Mode4
ltx/en_us_dedes/me.m01.d04:meMA.Ode8C23.ode	@ltx/en_us_dedes/miscellanea:misc.Ode8
ltx/en_us_dedes/me.m01.d04:meMA.Ode8C23.text	
ltx/en_us_dedes/me.m01.d04:meMA.Ode8C2T.incipit	…
ltx/en_us_dedes/me.m01.d04:meMA.Ode8C2T.melody	@ltx/en_us_dedes/he.h.m4:heHE.PaidasEvageis.name
ltx/en_us_dedes/me.m01.d04:meMA.Ode8C2T.mode	@ltx/en_us_dedes/miscellanea:misc.Mode4
ltx/en_us_dedes/me.m01.d04:meMA.Ode8C2T.ode	@ltx/en_us_dedes/miscellanea:misc.Ode8
ltx/en_us_dedes/me.m01.d04:meMA.Ode8C2T.text	
ltx/en_us_dedes/me.m01.d04:meMA.Ode8C31.greekmelody	@ltx/en_us_dedes/he.h.m2:heHE.TonEnKaminoTouPyros.greekname
ltx/en_us_dedes/me.m01.d04:meMA.Ode8C31.incipit	…
ltx/en_us_dedes/me.m01.d04:meMA.Ode8C31.melody	@ltx/en_us_dedes/he.h.m2:heHE.TonEnKaminoTouPyros.name
ltx/en_us_dedes/me.m01.d04:meMA.Ode8C31.mode	@ltx/en_us_dedes/miscellanea:misc.Mode2
ltx/en_us_dedes/me.m01.d04:meMA.Ode8C31.ode	@ltx/en_us_dedes/miscellanea:misc.Ode8
ltx/en_us_dedes/me.m01.d04:meMA.Ode8C31.text	
ltx/en_us_dedes/me.m01.d04:meMA.Ode8C32.incipit	…
ltx/en_us_dedes/me.m01.d04:meMA.Ode8C32.melody	@ltx/en_us_dedes/he.h.m2:heHE.TonEnKaminoTouPyros.name
ltx/en_us_dedes/me.m01.d04:meMA.Ode8C32.mode	@ltx/en_us_dedes/miscellanea:misc.Mode2
ltx/en_us_dedes/me.m01.d04:meMA.Ode8C32.ode	@ltx/en_us_dedes/miscellanea:misc.Ode8
ltx/en_us_dedes/me.m01.d04:meMA.Ode8C32.text	
ltx/en_us_dedes/me.m01.d04:meMA.Ode8C3T.incipit	…
ltx/en_us_dedes/me.m01.d04:meMA.Ode8C3T.melody	@ltx/en_us_dedes/he.h.m2:heHE.TonEnKaminoTouPyros.name
ltx/en_us_dedes/me.m01.d04:meMA.Ode8C3T.mode	@ltx/en_us_dedes/miscellanea:misc.Mode2
ltx/en_us_dedes/me.m01.d04:meMA.Ode8C3T.ode	@ltx/en_us_dedes/miscellanea:misc.Ode8
ltx/en_us_dedes/me.m01.d04:meMA.Ode8C3T.text	
ltx/en_us_dedes/me.m01.d04:meMA.Ode8H.greekmelody	@ltx/en_us_dedes/he.h.m2:heHE.TonEnKaminoTouPyros.greekname
ltx/en_us_dedes/me.m01.d04:meMA.Ode8H.incipit	@ltx/en_us_dedes/he.h.m2:heHE.TonEnKaminoTouPyros.incipit
ltx/en_us_dedes/me.m01.d04:meMA.Ode8H.melody	@ltx/en_us_dedes/he.h.m2:heHE.TonEnKaminoTouPyros.melody
ltx/en_us_dedes/me.m01.d04:meMA.Ode8H.mode	@ltx/en_us_dedes/miscellanea:misc.Mode2
ltx/en_us_dedes/me.m01.d04:meMA.Ode8H.ode	@ltx/en_us_dedes/miscellanea:misc.Ode8
ltx/en_us_dedes/me.m01.d04:meMA.Ode8H.text	@ltx/en_us_dedes/he.h.m2:heHE.TonEnKaminoTouPyros.text
ltx/en_us_dedes/me.m01.d04:meMA.Ode9C11.greekmelody	@ltx/en_us_dedes/he.h.m6:heHE.TheonAnthropois.greekname
ltx/en_us_dedes/me.m01.d04:meMA.Ode9C11.incipit	…
ltx/en_us_dedes/me.m01.d04:meMA.Ode9C11.melody	@ltx/en_us_dedes/he.h.m6:heHE.TheonAnthropois.name
ltx/en_us_dedes/me.m01.d04:meMA.Ode9C11.mode	@ltx/en_us_dedes/miscellanea:misc.Mode6
ltx/en_us_dedes/me.m01.d04:meMA.Ode9C11.ode	@ltx/en_us_dedes/miscellanea:misc.Ode9
ltx/en_us_dedes/me.m01.d04:meMA.Ode9C11.text	
ltx/en_us_dedes/me.m01.d04:meMA.Ode9C12.incipit	…
ltx/en_us_dedes/me.m01.d04:meMA.Ode9C12.melody	@ltx/en_us_dedes/he.h.m6:heHE.TheonAnthropois.name
ltx/en_us_dedes/me.m01.d04:meMA.Ode9C12.mode	@ltx/en_us_dedes/miscellanea:misc.Mode6
ltx/en_us_dedes/me.m01.d04:meMA.Ode9C12.ode	@ltx/en_us_dedes/miscellanea:misc.Ode9
ltx/en_us_dedes/me.m01.d04:meMA.Ode9C12.text	
ltx/en_us_dedes/me.m01.d04:meMA.Ode9C13.incipit	…
ltx/en_us_dedes/me.m01.d04:meMA.Ode9C13.melody	@ltx/en_us_dedes/he.h.m6:heHE.TheonAnthropois.name
ltx/en_us_dedes/me.m01.d04:meMA.Ode9C13.mode	@ltx/en_us_dedes/miscellanea:misc.Mode6
ltx/en_us_dedes/me.m01.d04:meMA.Ode9C13.ode	@ltx/en_us_dedes/miscellanea:misc.Ode9
ltx/en_us_dedes/me.m01.d04:meMA.Ode9C13.text	
ltx/en_us_dedes/me.m01.d04:meMA.Ode9C1H.greekmelody	@ltx/en_us_dedes/he.h.m6:heHE.TheonAnthropois.greekname
ltx/en_us_dedes/me.m01.d04:meMA.Ode9C1H.incipit	@ltx/en_us_dedes/he.h.m6:heHE.TheonAnthropois.incipit
ltx/en_us_dedes/me.m01.d04:meMA.Ode9C1H.melody	@ltx/en_us_dedes/he.h.m6:heHE.TheonAnthropois.melody
ltx/en_us_dedes/me.m01.d04:meMA.Ode9C1H.mode	@ltx/en_us_dedes/miscellanea:misc.Mode6
ltx/en_us_dedes/me.m01.d04:meMA.Ode9C1H.ode	@ltx/en_us_dedes/miscellanea:misc.Ode9
ltx/en_us_dedes/me.m01.d04:meMA.Ode9C1H.text	@ltx/en_us_dedes/he.h.m6:heHE.TheonAnthropois.text
ltx/en_us_dedes/me.m01.d04:meMA.Ode9C21.greekmelody	@ltx/en_us_dedes/he.h.m4:heHE.ApasGigenis.greekname
ltx/en_us_dedes/me.m01.d04:meMA.Ode9C21.incipit	…
ltx/en_us_dedes/me.m01.d04:meMA.Ode9C21.melody	@ltx/en_us_dedes/he.h.m4:heHE.ApasGigenis.name
ltx/en_us_dedes/me.m01.d04:meMA.Ode9C21.mode	@ltx/en_us_dedes/miscellanea:misc.Mode4
ltx/en_us_dedes/me.m01.d04:meMA.Ode9C21.ode	@ltx/en_us_dedes/miscellanea:misc.Ode9
ltx/en_us_dedes/me.m01.d04:meMA.Ode9C21.text	
ltx/en_us_dedes/me.m01.d04:meMA.Ode9C22.incipit	…
ltx/en_us_dedes/me.m01.d04:meMA.Ode9C22.melody	@ltx/en_us_dedes/he.h.m4:heHE.ApasGigenis.name
ltx/en_us_dedes/me.m01.d04:meMA.Ode9C22.mode	@ltx/en_us_dedes/miscellanea:misc.Mode4
ltx/en_us_dedes/me.m01.d04:meMA.Ode9C22.ode	@ltx/en_us_dedes/miscellanea:misc.Ode9
ltx/en_us_dedes/me.m01.d04:meMA.Ode9C22.text	
ltx/en_us_dedes/me.m01.d04:meMA.Ode9C23.incipit	…
ltx/en_us_dedes/me.m01.d04:meMA.Ode9C23.melody	@ltx/en_us_dedes/he.h.m4:heHE.ApasGigenis.name
ltx/en_us_dedes/me.m01.d04:meMA.Ode9C23.mode	@ltx/en_us_dedes/miscellanea:misc.Mode4
ltx/en_us_dedes/me.m01.d04:meMA.Ode9C23.ode	@ltx/en_us_dedes/miscellanea:misc.Ode9
ltx/en_us_dedes/me.m01.d04:meMA.Ode9C23.text	
ltx/en_us_dedes/me.m01.d04:meMA.Ode9C24.incipit	…
ltx/en_us_dedes/me.m01.d04:meMA.Ode9C24.melody	@ltx/en_us_dedes/he.h.m4:heHE.ApasGigenis.name
ltx/en_us_dedes/me.m01.d04:meMA.Ode9C24.mode	@ltx/en_us_dedes/miscellanea:misc.Mode4
ltx/en_us_dedes/me.m01.d04:meMA.Ode9C24.ode	@ltx/en_us_dedes/miscellanea:misc.Ode9
ltx/en_us_dedes/me.m01.d04:meMA.Ode9C24.text	
ltx/en_us_dedes/me.m01.d04:meMA.Ode9C2T.incipit	…
ltx/en_us_dedes/me.m01.d04:meMA.Ode9C2T.melody	@ltx/en_us_dedes/he.h.m4:heHE.ApasGigenis.name
ltx/en_us_dedes/me.m01.d04:meMA.Ode9C2T.mode	@ltx/en_us_dedes/miscellanea:misc.Mode4
ltx/en_us_dedes/me.m01.d04:meMA.Ode9C2T.ode	@ltx/en_us_dedes/miscellanea:misc.Ode9
ltx/en_us_dedes/me.m01.d04:meMA.Ode9C2T.text	
ltx/en_us_dedes/me.m01.d04:meMA.Ode9C31.greekmelody	@ltx/en_us_dedes/he.h.m2:heHE.AnarchouGennitoros.greekname
ltx/en_us_dedes/me.m01.d04:meMA.Ode9C31.incipit	…
ltx/en_us_dedes/me.m01.d04:meMA.Ode9C31.melody	@ltx/en_us_dedes/he.h.m2:heHE.AnarchouGennitoros.name
ltx/en_us_dedes/me.m01.d04:meMA.Ode9C31.mode	@ltx/en_us_dedes/miscellanea:misc.Mode2
ltx/en_us_dedes/me.m01.d04:meMA.Ode9C31.ode	@ltx/en_us_dedes/miscellanea:misc.Ode9
ltx/en_us_dedes/me.m01.d04:meMA.Ode9C31.text	
ltx/en_us_dedes/me.m01.d04:meMA.Ode9C32.incipit	…
ltx/en_us_dedes/me.m01.d04:meMA.Ode9C32.melody	@ltx/en_us_dedes/he.h.m2:heHE.AnarchouGennitoros.name
ltx/en_us_dedes/me.m01.d04:meMA.Ode9C32.mode	@ltx/en_us_dedes/miscellanea:misc.Mode2
ltx/en_us_dedes/me.m01.d04:meMA.Ode9C32.ode	@ltx/en_us_dedes/miscellanea:misc.Ode9
ltx/en_us_dedes/me.m01.d04:meMA.Ode9C32.text	
ltx/en_us_dedes/me.m01.d04:meMA.Ode9C33.incipit	…
ltx/en_us_dedes/me.m01.d04:meMA.Ode9C33.melody	@ltx/en_us_dedes/he.h.m2:heHE.AnarchouGennitoros.name
ltx/en_us_dedes/me.m01.d04:meMA.Ode9C33.mode	@ltx/en_us_dedes/miscellanea:misc.Mode2
ltx/en_us_dedes/me.m01.d04:meMA.Ode9C33.ode	@ltx/en_us_dedes/miscellanea:misc.Ode9
ltx/en_us_dedes/me.m01.d04:meMA.Ode9C33.text	
ltx/en_us_dedes/me.m01.d04:meMA.Ode9C3T.incipit	…
ltx/en_us_dedes/me.m01.d04:meMA.Ode9C3T.melody	@ltx/en_us_dedes/he.h.m2:heHE.AnarchouGennitoros.name
ltx/en_us_dedes/me.m01.d04:meMA.Ode9C3T.mode	@ltx/en_us_dedes/miscellanea:misc.Mode2
ltx/en_us_dedes/me.m01.d04:meMA.Ode9C3T.ode	@ltx/en_us_dedes/miscellanea:misc.Ode9
ltx/en_us_dedes/me.m01.d04:meMA.Ode9C3T.text	
ltx/en_us_dedes/me.m01.d04:meMA.Ode9H.greekmelody	@ltx/en_us_dedes/he.h.m2:heHE.AnarchouGennitoros.greekname
ltx/en_us_dedes/me.m01.d04:meMA.Ode9H.incipit	@ltx/en_us_dedes/he.h.m2:heHE.AnarchouGennitoros.incipit
ltx/en_us_dedes/me.m01.d04:meMA.Ode9H.melody	@ltx/en_us_dedes/he.h.m2:heHE.AnarchouGennitoros.melody
ltx/en_us_dedes/me.m01.d04:meMA.Ode9H.mode	@ltx/en_us_dedes/miscellanea:misc.Mode2
ltx/en_us_dedes/me.m01.d04:meMA.Ode9H.ode	@ltx/en_us_dedes/miscellanea:misc.Ode9
ltx/en_us_dedes/me.m01.d04:meMA.Ode9H.text	@ltx/en_us_dedes/he.h.m2:heHE.AnarchouGennitoros.text
ltx/en_us_dedes/me.m01.d04:meMA.Oikos1.text	O believers, let us join our voices and sing sacred songs, to extol the chorus of the Seventy Apostles: Stephen, Prochorus, Silas, Nicanor, Timon, Amplias, Parmenas, Apelles, James, Philip, Aristarchus, Matthias, Herodion, Crescens, Plegon, Barnabas, Linus, Olympas, Luke, Asyncritus, and the rest. They are indeed lamps that guide to faith in God.
ltx/en_us_dedes/me.m01.d04:meVE.Apolytikion1.incipit	@ltx/en_us_dedes/me.m01.d02:meVE.Apolytikion1.incipit
ltx/en_us_dedes/me.m01.d04:meVE.Apolytikion1.melody	@ltx/en_us_dedes/me.m01.d02:meVE.Apolytikion1.melody
ltx/en_us_dedes/me.m01.d04:meVE.Apolytikion1.mode	@ltx/en_us_dedes/me.m01.d02:meVE.Apolytikion1.mode
ltx/en_us_dedes/me.m01.d04:meVE.Apolytikion1.text	@ltx/en_us_dedes/me.m01.d02:meVE.Apolytikion1.text
ltx/en_us_dedes/me.m01.d04:meVE.Apolytikion2.incipit	@ltx/en_us_dedes/he.ga:heGA.ApostoloiAgioi.incipit
ltx/en_us_dedes/me.m01.d04:meVE.Apolytikion2.melody	
ltx/en_us_dedes/me.m01.d04:meVE.Apolytikion2.mode	@ltx/en_us_dedes/he.ga:heGA.ApostoloiAgioi.mode
ltx/en_us_dedes/me.m01.d04:meVE.Apolytikion2.text	@ltx/en_us_dedes/he.ga:heGA.ApostoloiAgioi.text
ltx/en_us_dedes/me.m01.d04:meVE.AposGlory.incipit	…
ltx/en_us_dedes/me.m01.d04:meVE.AposGlory.melody	
ltx/en_us_dedes/me.m01.d04:meVE.AposGlory.mode	@ltx/en_us_dedes/miscellanea:misc.Mode6
ltx/en_us_dedes/me.m01.d04:meVE.AposGlory.poet	@ltx/en_us_dedes/poets:po.Vyzantiou
ltx/en_us_dedes/me.m01.d04:meVE.AposGlory.text	
ltx/en_us_dedes/me.m01.d04:meVE.Aposticha1.greekmelody	@ltx/en_us_dedes/he.a.m2:heAU.OikosTouEfratha.greekname
ltx/en_us_dedes/me.m01.d04:meVE.Aposticha1.incipit	…
ltx/en_us_dedes/me.m01.d04:meVE.Aposticha1.melody	@ltx/en_us_dedes/he.a.m2:heAU.OikosTouEfratha.name
ltx/en_us_dedes/me.m01.d04:meVE.Aposticha1.mode	@ltx/en_us_dedes/miscellanea:misc.Mode2
ltx/en_us_dedes/me.m01.d04:meVE.Aposticha1.text	
ltx/en_us_dedes/me.m01.d04:meVE.Aposticha2.incipit	…
ltx/en_us_dedes/me.m01.d04:meVE.Aposticha2.melody	@ltx/en_us_dedes/he.a.m2:heAU.OikosTouEfratha.name
ltx/en_us_dedes/me.m01.d04:meVE.Aposticha2.mode	@ltx/en_us_dedes/miscellanea:misc.Mode2
ltx/en_us_dedes/me.m01.d04:meVE.Aposticha2.text	
ltx/en_us_dedes/me.m01.d04:meVE.Aposticha3.incipit	…
ltx/en_us_dedes/me.m01.d04:meVE.Aposticha3.melody	@ltx/en_us_dedes/he.a.m2:heAU.OikosTouEfratha.name
ltx/en_us_dedes/me.m01.d04:meVE.Aposticha3.mode	@ltx/en_us_dedes/miscellanea:misc.Mode2
ltx/en_us_dedes/me.m01.d04:meVE.Aposticha3.text	
ltx/en_us_dedes/me.m01.d04:meVE.SticGlory.incipit	@ltx/en_us_dedes/me.m01.d02:meVE.Aposticha3.incipit
ltx/en_us_dedes/me.m01.d04:meVE.SticGlory.melody	
ltx/en_us_dedes/me.m01.d04:meVE.SticGlory.mode	@ltx/en_us_dedes/miscellanea:misc.Mode3
ltx/en_us_dedes/me.m01.d04:meVE.SticGlory.poet	@ltx/en_us_dedes/poets:po.AndreouIerosolymitou
ltx/en_us_dedes/me.m01.d04:meVE.SticGlory.text	@ltx/en_us_dedes/me.m01.d02:meVE.Aposticha3.text
ltx/en_us_dedes/me.m01.d04:meVE.Stichera01.greekmelody	@ltx/en_us_dedes/he.a.m4:heAU.EdokasSimeiosin.greekname
ltx/en_us_dedes/me.m01.d04:meVE.Stichera01.incipit	…
ltx/en_us_dedes/me.m01.d04:meVE.Stichera01.melody	@ltx/en_us_dedes/he.a.m4:heAU.EdokasSimeiosin.name
ltx/en_us_dedes/me.m01.d04:meVE.Stichera01.mode	@ltx/en_us_dedes/miscellanea:misc.Mode4
ltx/en_us_dedes/me.m01.d04:meVE.Stichera01.text	
ltx/en_us_dedes/me.m01.d04:meVE.Stichera02.incipit	…
ltx/en_us_dedes/me.m01.d04:meVE.Stichera02.melody	@ltx/en_us_dedes/he.a.m4:heAU.EdokasSimeiosin.name
ltx/en_us_dedes/me.m01.d04:meVE.Stichera02.mode	@ltx/en_us_dedes/miscellanea:misc.Mode4
ltx/en_us_dedes/me.m01.d04:meVE.Stichera02.text	
ltx/en_us_dedes/me.m01.d04:meVE.Stichera03.incipit	…
ltx/en_us_dedes/me.m01.d04:meVE.Stichera03.melody	@ltx/en_us_dedes/he.a.m4:heAU.EdokasSimeiosin.name
ltx/en_us_dedes/me.m01.d04:meVE.Stichera03.mode	@ltx/en_us_dedes/miscellanea:misc.Mode4
ltx/en_us_dedes/me.m01.d04:meVE.Stichera03.text	
ltx/en_us_dedes/me.m01.d04:meVE.Stichera04.greekmelody	@ltx/en_us_dedes/he.a.m2:heAU.OteEkTouXylou.greekname
ltx/en_us_dedes/me.m01.d04:meVE.Stichera04.incipit	When you sensed that you…
ltx/en_us_dedes/me.m01.d04:meVE.Stichera04.melody	@ltx/en_us_dedes/he.a.m2:heAU.OteEkTouXylou.name
ltx/en_us_dedes/me.m01.d04:meVE.Stichera04.mode	@ltx/en_us_dedes/miscellanea:misc.Mode2
ltx/en_us_dedes/me.m01.d04:meVE.Stichera04.text	When you sensed that you were pricked in soul * by the love of God, O all-blessed father, you took up your cross, * and with utmost joy you followed after Christ crucified. * Mortifying the mind set on the flesh through self-control, * you received the Holy Spirit’s living energy, * such that you could cure every illness, * by your well received intercessions, * Hence we all together call you blessed now.
ltx/en_us_dedes/me.m01.d04:meVE.Stichera05.incipit	Father, once you purified the…
ltx/en_us_dedes/me.m01.d04:meVE.Stichera05.melody	@ltx/en_us_dedes/he.a.m2:heAU.OteEkTouXylou.name
ltx/en_us_dedes/me.m01.d04:meVE.Stichera05.mode	@ltx/en_us_dedes/miscellanea:misc.Mode2
ltx/en_us_dedes/me.m01.d04:meVE.Stichera05.text	Father, once you purified the sight * of your soul by means of unceasing * and constant prayers to the Lord, * and intensive fasting, you became a temple of God, * the tri-solar Divinity. And when you accepted * the divine holy anointing of the office of priest, * you entered the holy of holies * and offered the One who condescended * ineffably and offered himself for you.
ltx/en_us_dedes/me.m01.d04:meVE.Stichera06.incipit	Gentle, meek, and innocent were…
ltx/en_us_dedes/me.m01.d04:meVE.Stichera06.melody	@ltx/en_us_dedes/he.a.m2:heAU.OteEkTouXylou.name
ltx/en_us_dedes/me.m01.d04:meVE.Stichera06.mode	@ltx/en_us_dedes/miscellanea:misc.Mode2
ltx/en_us_dedes/me.m01.d04:meVE.Stichera06.text	Gentle, meek, and innocent were you, * and you had integrity, holy father Theoktistos. * Therefore you inherited truly the land of the meek. * In this life being deified by participation, * you enjoy the true delights and exultation and joy. * Now on high, cease not to remember * us who celebrate you with longing, * O Saint, and who honor your divine repose.
