ltx/en_us_dedes/sy.m06.d22:cl.syMA.commemoration01.text	[saint/com 1]
ltx/en_us_dedes/sy.m06.d22:cl.syMA.commemoration02.text	[saint/com 2]
ltx/en_us_dedes/sy.m06.d22:cl.syMA.commemoration03.text	[saint/com 3]
ltx/en_us_dedes/sy.m06.d22:cl.syMA.commemoration04.text	[saint/com 4]
ltx/en_us_dedes/sy.m06.d22:cl.syMA.commemoration05.text	[saint/com 5]
ltx/en_us_dedes/sy.m06.d22:cl.syMA.commemoration06.text	[saint/com list]
ltx/en_us_dedes/sy.m06.d22:syMA.commemoration01.couplet1.title	@ltx/en_us_dedes/titles:ti.Verses
ltx/en_us_dedes/sy.m06.d22:syMA.commemoration01.couplet1.verse1	
ltx/en_us_dedes/sy.m06.d22:syMA.commemoration01.couplet1.verse2	
ltx/en_us_dedes/sy.m06.d22:syMA.commemoration01.narration.p01	
ltx/en_us_dedes/sy.m06.d22:syMA.commemoration01.narration.p02	
ltx/en_us_dedes/sy.m06.d22:syMA.commemoration01.single1	
ltx/en_us_dedes/sy.m06.d22:syMA.commemoration01.text	On June 22 we commemorate the holy Hieromartyr Eusebius, Bishop of Samosata.
ltx/en_us_dedes/sy.m06.d22:syMA.commemoration02.couplet1.title	@ltx/en_us_dedes/titles:ti.Verses
ltx/en_us_dedes/sy.m06.d22:syMA.commemoration02.couplet1.verse1	
ltx/en_us_dedes/sy.m06.d22:syMA.commemoration02.couplet1.verse2	
ltx/en_us_dedes/sy.m06.d22:syMA.commemoration02.narration.p01	
ltx/en_us_dedes/sy.m06.d22:syMA.commemoration02.narration.p02	
ltx/en_us_dedes/sy.m06.d22:syMA.commemoration02.text	On this day we commemorate the Ηoly Martyrs Zeno and Zenas.
ltx/en_us_dedes/sy.m06.d22:syMA.lastline	By their holy intercessions, Christ God, have mercy on us. Amen.
