ltx/en_us_dedes/sy.m05.d20:cl.syMA.commemoration01.text	[saint/com 1]
ltx/en_us_dedes/sy.m05.d20:cl.syMA.commemoration02.text	[saint/com 2]
ltx/en_us_dedes/sy.m05.d20:cl.syMA.commemoration03.text	[saint/com 3]
ltx/en_us_dedes/sy.m05.d20:cl.syMA.commemoration04.text	[saint/com 4]
ltx/en_us_dedes/sy.m05.d20:cl.syMA.commemoration05.text	[saint/com 5]
ltx/en_us_dedes/sy.m05.d20:cl.syMA.commemoration06.text	[saint/com list]
ltx/en_us_dedes/sy.m05.d20:syMA.commemoration01.couplet1.title	@ltx/en_us_dedes/titles:ti.Verses
ltx/en_us_dedes/sy.m05.d20:syMA.commemoration01.couplet1.verse1	
ltx/en_us_dedes/sy.m05.d20:syMA.commemoration01.couplet1.verse2	
ltx/en_us_dedes/sy.m05.d20:syMA.commemoration01.narration.p01	
ltx/en_us_dedes/sy.m05.d20:syMA.commemoration01.single1	
ltx/en_us_dedes/sy.m05.d20:syMA.commemoration01.text	On May 20 we commemorate the holy Martyr Thalleleos.
ltx/en_us_dedes/sy.m05.d20:syMA.commemoration02.couplet1.title	@ltx/en_us_dedes/titles:ti.Verses
ltx/en_us_dedes/sy.m05.d20:syMA.commemoration02.couplet1.verse1	
ltx/en_us_dedes/sy.m05.d20:syMA.commemoration02.couplet1.verse2	
ltx/en_us_dedes/sy.m05.d20:syMA.commemoration02.text	We also commemorate the holy Martyr Asclas who died when he was cast into a river.
ltx/en_us_dedes/sy.m05.d20:syMA.commemoration03.couplet1.title	@ltx/en_us_dedes/titles:ti.Verses
ltx/en_us_dedes/sy.m05.d20:syMA.commemoration03.couplet1.verse1	
ltx/en_us_dedes/sy.m05.d20:syMA.commemoration03.couplet1.verse2	
ltx/en_us_dedes/sy.m05.d20:syMA.commemoration03.text	Our three devout and God-bearing Fathers Niketas, John, and Joseph, Founders of the sacred and royal New Monastery (that is, Nea Moni) on Chios, reposed in peace.
ltx/en_us_dedes/sy.m05.d20:syMA.commemoration04.couplet1.title	@ltx/en_us_dedes/titles:ti.Verses
ltx/en_us_dedes/sy.m05.d20:syMA.commemoration04.couplet1.verse1	
ltx/en_us_dedes/sy.m05.d20:syMA.commemoration04.couplet1.verse2	
ltx/en_us_dedes/sy.m05.d20:syMA.commemoration04.text	On this day was the removal and transfer of the relic of our Father among the Saints Nicholas, bishop of Myra in Lycia, the wonder-worker.
ltx/en_us_dedes/sy.m05.d20:syMA.commemoration05.couplet1.title	@ltx/en_us_dedes/titles:ti.Verses
ltx/en_us_dedes/sy.m05.d20:syMA.commemoration05.couplet1.verse1	
ltx/en_us_dedes/sy.m05.d20:syMA.commemoration05.couplet1.verse2	
ltx/en_us_dedes/sy.m05.d20:syMA.commemoration05.text	Our devout Father Thalassios reposed in peace
ltx/en_us_dedes/sy.m05.d20:syMA.commemoration06.couplet1.title	@ltx/en_us_dedes/titles:ti.Verses
ltx/en_us_dedes/sy.m05.d20:syMA.commemoration06.couplet1.verse1	
ltx/en_us_dedes/sy.m05.d20:syMA.commemoration06.couplet1.verse2	
ltx/en_us_dedes/sy.m05.d20:syMA.commemorationsyMA.commemoration06.text	Devout Saint Mark the Hermit reposed in peace.
ltx/en_us_dedes/sy.m05.d20:syMA.lastline	By their holy intercessions, O God, have mercy on us. Amen.
