ltx/en_us_dedes/oc.m4.d7:ocBK.ModeNaked	@ltx/en_us_dedes/miscellanea:misc.Mode4.naked
ltx/en_us_dedes/oc.m4.d7:ocBK.end.title	END OF MODE 4
ltx/en_us_dedes/oc.m4.d7:ocBK.end.verse1.text	
ltx/en_us_dedes/oc.m4.d7:ocBK.end.verse2.text	
ltx/en_us_dedes/oc.m4.d7:ocBK.end.verse3.text	
ltx/en_us_dedes/oc.m4.d7:ocBK.end.verse4.text	
ltx/en_us_dedes/oc.m4.d7:ocBK.end.verse5.text	
ltx/en_us_dedes/oc.m4.d7:ocBK.end.verse6.text	
ltx/en_us_dedes/oc.m4.d7:ocLI.Beatitudes1.incipit	@ltx/en_us_dedes/oc.m4.d1:ocLI.Beatitudes1.incipit
ltx/en_us_dedes/oc.m4.d7:ocLI.Beatitudes1.melody	
ltx/en_us_dedes/oc.m4.d7:ocLI.Beatitudes1.mode	@ltx/en_us_dedes/miscellanea:misc.Mode4
ltx/en_us_dedes/oc.m4.d7:ocLI.Beatitudes1.text	@ltx/en_us_dedes/oc.m4.d1:ocLI.Beatitudes1.text
ltx/en_us_dedes/oc.m4.d7:ocLI.Beatitudes2.incipit	Holy Martyrs, burning hot *…
ltx/en_us_dedes/oc.m4.d7:ocLI.Beatitudes2.melody	
ltx/en_us_dedes/oc.m4.d7:ocLI.Beatitudes2.mode	@ltx/en_us_dedes/miscellanea:misc.Mode4
ltx/en_us_dedes/oc.m4.d7:ocLI.Beatitudes2.text	Holy Martyrs, burning hot * in your pious souls was the love of Christ. * By your contests as with dew * you put out the fire of idolatry. * The Church holds you up as lamps; * and the light you shine drives away by grace divine * the darkness of illnesses * and the tribulations encountered by our souls. * Therefore each day we all dutifully honor you.
ltx/en_us_dedes/oc.m4.d7:ocLI.Beatitudes3.incipit	God has glorified the Saints…
ltx/en_us_dedes/oc.m4.d7:ocLI.Beatitudes3.melody	
ltx/en_us_dedes/oc.m4.d7:ocLI.Beatitudes3.mode	@ltx/en_us_dedes/miscellanea:misc.Mode4
ltx/en_us_dedes/oc.m4.d7:ocLI.Beatitudes3.text	God has glorified the Saints, * for with deeds of virtue they served Him well. * Let us therefore praise them all, * and extol the great holy Hierarchs, * the Prophets inspired by God, * the devout Monastics, and all the Women Saints. * And calling them blessed now, * let us pray that by their entreaties we attain * the eternal glory and splendor of God’s elect.
ltx/en_us_dedes/oc.m4.d7:ocLI.Beatitudes4.incipit	We beseech You, overlook *…
ltx/en_us_dedes/oc.m4.d7:ocLI.Beatitudes4.melody	
ltx/en_us_dedes/oc.m4.d7:ocLI.Beatitudes4.mode	@ltx/en_us_dedes/miscellanea:misc.Mode4
ltx/en_us_dedes/oc.m4.d7:ocLI.Beatitudes4.text	We beseech You, overlook * the sins and offenses committed by * those preceding us in death * departing this life that is full of pain. * O Savior, establish them, * Your servants, where sorrow and pain have fled away, * where hosts of the Saints now dwell, * and where Your ineffable light forever shines, * so that they may extol Your divine benevolence.
ltx/en_us_dedes/oc.m4.d7:ocLI.BeatitudesT.incipit	You conceived and bore the…
ltx/en_us_dedes/oc.m4.d7:ocLI.BeatitudesT.melody	
ltx/en_us_dedes/oc.m4.d7:ocLI.BeatitudesT.mode	@ltx/en_us_dedes/miscellanea:misc.Mode4
ltx/en_us_dedes/oc.m4.d7:ocLI.BeatitudesT.text	You conceived and bore the Word * in the flesh when He became perfect man. * Yet before the morning star, * the Father begot Him eternally. * Your Son now is recognized * as having two natures, two wills and energies. * We beg you to pray to Him, * our Lord and Creator, that He be merciful * to us who extol you, immaculate Bride of God.
ltx/en_us_dedes/oc.m4.d7:ocLI.BeatitudesTr.incipit	Father, Son, and Holy Spirit…
ltx/en_us_dedes/oc.m4.d7:ocLI.BeatitudesTr.melody	
ltx/en_us_dedes/oc.m4.d7:ocLI.BeatitudesTr.mode	@ltx/en_us_dedes/miscellanea:misc.Mode4
ltx/en_us_dedes/oc.m4.d7:ocLI.BeatitudesTr.text	Father, Son, and Holy Spirit, the indivisible Trinity, * united and unconfused * in the individual qualities, * One God, three hypostases: * give rest to Your servants who died with faith in You, * at the intercessions of Your Prophets and Martyrs, Ascetics and all Saints, * and grant them Your mercy, forgiving their every sin.
ltx/en_us_dedes/oc.m4.d7:ocLI.MM.Beatitudes1234TrTas78910GB.text	@ltx/en_us_dedes/properties:media.key
ltx/en_us_dedes/oc.m4.d7:ocMA.ApolTheotokion.incipit	@ltx/en_us_dedes/oc.m4.d3:ocMA.Kathisma23.incipit
ltx/en_us_dedes/oc.m4.d7:ocMA.ApolTheotokion.melody	
ltx/en_us_dedes/oc.m4.d7:ocMA.ApolTheotokion.mode	@ltx/en_us_dedes/miscellanea:misc.Mode4
ltx/en_us_dedes/oc.m4.d7:ocMA.ApolTheotokion.text	@ltx/en_us_dedes/oc.m4.d3:ocMA.Kathisma23.text
ltx/en_us_dedes/oc.m4.d7:ocMA.AposTheotokion.greekmelody	@ltx/en_us_dedes/he.a.m4:heAU.EdokasSimeiosin.greekname
ltx/en_us_dedes/oc.m4.d7:ocMA.AposTheotokion.incipit	Following the sayings of the…
ltx/en_us_dedes/oc.m4.d7:ocMA.AposTheotokion.melody	@ltx/en_us_dedes/he.a.m4:heAU.EdokasSimeiosin.name
ltx/en_us_dedes/oc.m4.d7:ocMA.AposTheotokion.mode	@ltx/en_us_dedes/miscellanea:misc.Mode4
ltx/en_us_dedes/oc.m4.d7:ocMA.AposTheotokion.text	Following the sayings of the God-inspired, all-blameless one, * we consider you truly as * the Mother of God, for you * ineffably gave birth to * God who took a body * and then redeemed and ransomed us * who were in bonds and enslaved because of sins. * We pray you, all-pure Lady, to implore you Son to illuminate * all your servants who passed away * with His own uncreated light.
ltx/en_us_dedes/oc.m4.d7:ocMA.Aposticha1.greekmelody	@ltx/en_us_dedes/he.a.m4:heAU.EdokasSimeiosin.greekname
ltx/en_us_dedes/oc.m4.d7:ocMA.Aposticha1.incipit	Frightening indeed…
ltx/en_us_dedes/oc.m4.d7:ocMA.Aposticha1.melody	@ltx/en_us_dedes/he.a.m4:heAU.EdokasSimeiosin.name
ltx/en_us_dedes/oc.m4.d7:ocMA.Aposticha1.mode	@ltx/en_us_dedes/miscellanea:misc.Mode4
ltx/en_us_dedes/oc.m4.d7:ocMA.Aposticha1.text	Frightening indeed, and quite so, is the mystery known as death, how a soul then is forcibly * separated from its frame, parting from its body; * severed is that union, which is most natural and innate, * by Your divine will. And therefore we entreat * that You who are benevolent grant the departed eternal rest, * where the saints and the righteous dwell, * O our God and the Giver of life.
ltx/en_us_dedes/oc.m4.d7:ocMA.Aposticha2.greekmelody	@ltx/en_us_dedes/he.a.m4:heAU.EdokasSimeiosin.greekname
ltx/en_us_dedes/oc.m4.d7:ocMA.Aposticha2.incipit	Death is shown to be…
ltx/en_us_dedes/oc.m4.d7:ocMA.Aposticha2.melody	@ltx/en_us_dedes/he.a.m4:heAU.EdokasSimeiosin.name
ltx/en_us_dedes/oc.m4.d7:ocMA.Aposticha2.mode	@ltx/en_us_dedes/miscellanea:misc.Mode4
ltx/en_us_dedes/oc.m4.d7:ocMA.Aposticha2.text	Death is shown to be but slumber for believers, O Savior Christ * and the Lord of the universe, * since You were laid in a tomb, * and since You dismantled * all of death’s dominion * and You abolished all its might * that had prevailed over us for many years. * And therefore we entreat You now that You will place those who pass away * in the dwellings of all Your saints * in Your mansions that perish not.
ltx/en_us_dedes/oc.m4.d7:ocMA.Aposticha3.greekmelody	@ltx/en_us_dedes/he.a.m4:heAU.EdokasSimeiosin.greekname
ltx/en_us_dedes/oc.m4.d7:ocMA.Aposticha3.incipit	You, O Lord, became for…
ltx/en_us_dedes/oc.m4.d7:ocMA.Aposticha3.melody	@ltx/en_us_dedes/he.a.m4:heAU.EdokasSimeiosin.name
ltx/en_us_dedes/oc.m4.d7:ocMA.Aposticha3.mode	@ltx/en_us_dedes/miscellanea:misc.Mode4
ltx/en_us_dedes/oc.m4.d7:ocMA.Aposticha3.text	You, O Lord, became for us sanctification and righteousness * and redemption for all our souls. * For You have presented us * to the holy Father * justified and ransomed, having accepted for our sake * the price and penalty that was owed by us. * We therefore now implore You to grant rest to those who have passed away * in a place of bright joyousness, * Benefactor and Savior Christ.
ltx/en_us_dedes/oc.m4.d7:ocMA.Aposticha4.greekmelody	@ltx/en_us_dedes/he.a.m4:heAU.EdokasSimeiosin.greekname
ltx/en_us_dedes/oc.m4.d7:ocMA.Aposticha4.incipit	Now the human race has…
ltx/en_us_dedes/oc.m4.d7:ocMA.Aposticha4.melody	@ltx/en_us_dedes/he.a.m4:heAU.EdokasSimeiosin.name
ltx/en_us_dedes/oc.m4.d7:ocMA.Aposticha4.mode	@ltx/en_us_dedes/miscellanea:misc.Mode4
ltx/en_us_dedes/oc.m4.d7:ocMA.Aposticha4.text	Now the human race has been recalled from former corruption to * incorruption with no decay, * for it has been bathed and cleansed * in the blood that poured out * from Your side, O Savior; * and in Your blood You washed away * from us the sin of Adam our ancestor. * And therefore we entreat You to grant rest to those who have passed away * in eternal dwellings of Yours, * with the hosts of Your martyr saints.
ltx/en_us_dedes/oc.m4.d7:ocMA.C1.acrostic.notice1	
ltx/en_us_dedes/oc.m4.d7:ocMA.C1.acrostic.text	
ltx/en_us_dedes/oc.m4.d7:ocMA.C1.acrostic.title	Canon for all the Saints.
ltx/en_us_dedes/oc.m4.d7:ocMA.C2.acrostic.notice1	
ltx/en_us_dedes/oc.m4.d7:ocMA.C2.acrostic.text	
ltx/en_us_dedes/oc.m4.d7:ocMA.C2.acrostic.title	Canon for the Deceased.
ltx/en_us_dedes/oc.m4.d7:ocMA.Kathisma11.greekmelody	@ltx/en_us_dedes/he.a.m4:heAU.TachyProkatalave.greekname
ltx/en_us_dedes/oc.m4.d7:ocMA.Kathisma11.incipit	@ltx/en_us_dedes/oc.m4.d3:ocMA.Kathisma32.incipit
ltx/en_us_dedes/oc.m4.d7:ocMA.Kathisma11.melody	@ltx/en_us_dedes/he.a.m4:heAU.TachyProkatalave.name
ltx/en_us_dedes/oc.m4.d7:ocMA.Kathisma11.mode	@ltx/en_us_dedes/miscellanea:misc.Mode4
ltx/en_us_dedes/oc.m4.d7:ocMA.Kathisma11.text	@ltx/en_us_dedes/oc.m4.d3:ocMA.Kathisma32.text
ltx/en_us_dedes/oc.m4.d7:ocMA.Kathisma12.incipit	@ltx/en_us_dedes/oc.m4.d4:ocMA.Kathisma32.incipit
ltx/en_us_dedes/oc.m4.d7:ocMA.Kathisma12.melody	
ltx/en_us_dedes/oc.m4.d7:ocMA.Kathisma12.mode	@ltx/en_us_dedes/miscellanea:misc.Mode4
ltx/en_us_dedes/oc.m4.d7:ocMA.Kathisma12.text	@ltx/en_us_dedes/oc.m4.d4:ocMA.Kathisma32.text
ltx/en_us_dedes/oc.m4.d7:ocMA.Kathisma13.greekmelody	@ltx/en_us_dedes/he.a.m4:heAU.TachyProkatalave.greekname
ltx/en_us_dedes/oc.m4.d7:ocMA.Kathisma13.incipit	@ltx/en_us_dedes/oc.m4.d5:ocMA.Kathisma32.incipit
ltx/en_us_dedes/oc.m4.d7:ocMA.Kathisma13.melody	@ltx/en_us_dedes/he.a.m4:heAU.TachyProkatalave.name
ltx/en_us_dedes/oc.m4.d7:ocMA.Kathisma13.mode	@ltx/en_us_dedes/miscellanea:misc.Mode4
ltx/en_us_dedes/oc.m4.d7:ocMA.Kathisma13.text	@ltx/en_us_dedes/oc.m4.d5:ocMA.Kathisma32.text
ltx/en_us_dedes/oc.m4.d7:ocMA.Kathisma14.incipit	@ltx/en_us_dedes/oc.m4.d1:ocVE.ApolTheotokionVM.incipit
ltx/en_us_dedes/oc.m4.d7:ocMA.Kathisma14.melody	
ltx/en_us_dedes/oc.m4.d7:ocMA.Kathisma14.mode	@ltx/en_us_dedes/miscellanea:misc.Mode4
ltx/en_us_dedes/oc.m4.d7:ocMA.Kathisma14.text	@ltx/en_us_dedes/oc.m4.d1:ocVE.ApolTheotokionVM.text
ltx/en_us_dedes/oc.m4.d7:ocMA.Kathisma21.incipit	@ltx/en_us_dedes/oc.m4.d6:ocMA.Kathisma32.incipit
ltx/en_us_dedes/oc.m4.d7:ocMA.Kathisma21.melody	
ltx/en_us_dedes/oc.m4.d7:ocMA.Kathisma21.mode	@ltx/en_us_dedes/miscellanea:misc.Mode4
ltx/en_us_dedes/oc.m4.d7:ocMA.Kathisma21.text	@ltx/en_us_dedes/oc.m4.d6:ocMA.Kathisma32.text
ltx/en_us_dedes/oc.m4.d7:ocMA.Kathisma22.greekmelody	@ltx/en_us_dedes/he.a.m4:heAU.TachyProkatalave.greekname
ltx/en_us_dedes/oc.m4.d7:ocMA.Kathisma22.incipit	Give rest to the souls…
ltx/en_us_dedes/oc.m4.d7:ocMA.Kathisma22.melody	@ltx/en_us_dedes/he.a.m4:heAU.TachyProkatalave.name
ltx/en_us_dedes/oc.m4.d7:ocMA.Kathisma22.mode	@ltx/en_us_dedes/miscellanea:misc.Mode4
ltx/en_us_dedes/oc.m4.d7:ocMA.Kathisma22.text	Give rest to the souls that You translated from earth * and temporal things to be with You, the only immortal and almighty God. * Pardon them and forgive them * every sin they committed. * Merciful One, have mercy on the works of Your divine hands, * through the prayers of the Theotokos, O only benevolent Lord.
ltx/en_us_dedes/oc.m4.d7:ocMA.Kathisma23.greekmelody	@ltx/en_us_dedes/he.a.m4:heAU.TachyProkatalave.greekname
ltx/en_us_dedes/oc.m4.d7:ocMA.Kathisma23.incipit	…
ltx/en_us_dedes/oc.m4.d7:ocMA.Kathisma23.melody	@ltx/en_us_dedes/he.a.m4:heAU.TachyProkatalave.name
ltx/en_us_dedes/oc.m4.d7:ocMA.Kathisma23.mode	@ltx/en_us_dedes/miscellanea:misc.Mode4
ltx/en_us_dedes/oc.m4.d7:ocMA.Kathisma23.text	
ltx/en_us_dedes/oc.m4.d7:ocMA.Kathisma24.greekmelody	@ltx/en_us_dedes/he.a.m4:heAU.TachyProkatalave.greekname
ltx/en_us_dedes/oc.m4.d7:ocMA.Kathisma24.incipit	…
ltx/en_us_dedes/oc.m4.d7:ocMA.Kathisma24.melody	@ltx/en_us_dedes/he.a.m4:heAU.TachyProkatalave.name
ltx/en_us_dedes/oc.m4.d7:ocMA.Kathisma24.mode	@ltx/en_us_dedes/miscellanea:misc.Mode4
ltx/en_us_dedes/oc.m4.d7:ocMA.Kathisma24.text	
ltx/en_us_dedes/oc.m4.d7:ocMA.Lauds1.incipit	@ltx/en_us_dedes/oc.m4.d3:ocMA.Aposticha3.incipit
ltx/en_us_dedes/oc.m4.d7:ocMA.Lauds1.melody	
ltx/en_us_dedes/oc.m4.d7:ocMA.Lauds1.mode	@ltx/en_us_dedes/miscellanea:misc.Mode4
ltx/en_us_dedes/oc.m4.d7:ocMA.Lauds1.text	@ltx/en_us_dedes/oc.m4.d3:ocMA.Aposticha3.text
ltx/en_us_dedes/oc.m4.d7:ocMA.Lauds2.incipit	@ltx/en_us_dedes/oc.m4.d4:ocMA.Aposticha3.incipit
ltx/en_us_dedes/oc.m4.d7:ocMA.Lauds2.melody	
ltx/en_us_dedes/oc.m4.d7:ocMA.Lauds2.mode	@ltx/en_us_dedes/miscellanea:misc.Mode4
ltx/en_us_dedes/oc.m4.d7:ocMA.Lauds2.text	@ltx/en_us_dedes/oc.m4.d4:ocMA.Aposticha3.text
ltx/en_us_dedes/oc.m4.d7:ocMA.Lauds3.incipit	@ltx/en_us_dedes/oc.m4.d5:ocMA.Aposticha3.incipit
ltx/en_us_dedes/oc.m4.d7:ocMA.Lauds3.melody	
ltx/en_us_dedes/oc.m4.d7:ocMA.Lauds3.mode	@ltx/en_us_dedes/miscellanea:misc.Mode4
ltx/en_us_dedes/oc.m4.d7:ocMA.Lauds3.text	@ltx/en_us_dedes/oc.m4.d5:ocMA.Aposticha3.text
ltx/en_us_dedes/oc.m4.d7:ocMA.Lauds4.incipit	We pray You let the…
ltx/en_us_dedes/oc.m4.d7:ocMA.Lauds4.melody	
ltx/en_us_dedes/oc.m4.d7:ocMA.Lauds4.mode	@ltx/en_us_dedes/miscellanea:misc.Mode4
ltx/en_us_dedes/oc.m4.d7:ocMA.Lauds4.text	We pray You let the souls of Your servants repose in Your place of rest, where all Your saints repose, O Lord, for You alone are immortal.
ltx/en_us_dedes/oc.m4.d7:ocMA.LaudsGlory.incipit	Where are all those worldly…
ltx/en_us_dedes/oc.m4.d7:ocMA.LaudsGlory.melody	
ltx/en_us_dedes/oc.m4.d7:ocMA.LaudsGlory.mode	@ltx/en_us_dedes/miscellanea:misc.Mode4
ltx/en_us_dedes/oc.m4.d7:ocMA.LaudsGlory.text	Where are all those worldly attachments? Where are the imaginings of things that do not last? Where is the gold, where the silver? Where is the flood and fuss of assistants and servants? All of this is dust and ashes, all just a shadow. Nevertheless, come let us say to the immortal King, “Lord, grant Your eternal good things to those departed from us, and give them rest in unending blessedness.”
ltx/en_us_dedes/oc.m4.d7:ocMA.LaudsRubric1.text	@ltx/en_us_dedes/oc.m1.d7:ocMA.LaudsRubric1.text
ltx/en_us_dedes/oc.m4.d7:ocMA.LaudsTheotokion.incipit	@ltx/en_us_dedes/oc.m4.d5:ocMA.AposTheotokion.incipit
ltx/en_us_dedes/oc.m4.d7:ocMA.LaudsTheotokion.melody	
ltx/en_us_dedes/oc.m4.d7:ocMA.LaudsTheotokion.mode	@ltx/en_us_dedes/miscellanea:misc.Mode4
ltx/en_us_dedes/oc.m4.d7:ocMA.LaudsTheotokion.text	@ltx/en_us_dedes/oc.m4.d5:ocMA.AposTheotokion.text
ltx/en_us_dedes/oc.m4.d7:ocMA.MM.Alleluia.text	@ltx/en_us_dedes/properties:media.key
ltx/en_us_dedes/oc.m4.d7:ocMA.OdeW1C11.incipit	…
ltx/en_us_dedes/oc.m4.d7:ocMA.OdeW1C11.melody	@ltx/en_us_dedes/he.h.m4:heHE.TristatasKrataious.name
ltx/en_us_dedes/oc.m4.d7:ocMA.OdeW1C11.mode	@ltx/en_us_dedes/miscellanea:misc.Mode4
ltx/en_us_dedes/oc.m4.d7:ocMA.OdeW1C11.ode	@ltx/en_us_dedes/miscellanea:misc.Ode1
ltx/en_us_dedes/oc.m4.d7:ocMA.OdeW1C11.text	
ltx/en_us_dedes/oc.m4.d7:ocMA.OdeW1C12.incipit	…
ltx/en_us_dedes/oc.m4.d7:ocMA.OdeW1C12.melody	@ltx/en_us_dedes/he.h.m4:heHE.TristatasKrataious.name
ltx/en_us_dedes/oc.m4.d7:ocMA.OdeW1C12.mode	@ltx/en_us_dedes/miscellanea:misc.Mode4
ltx/en_us_dedes/oc.m4.d7:ocMA.OdeW1C12.ode	@ltx/en_us_dedes/miscellanea:misc.Ode1
ltx/en_us_dedes/oc.m4.d7:ocMA.OdeW1C12.text	
ltx/en_us_dedes/oc.m4.d7:ocMA.OdeW1C13.incipit	…
ltx/en_us_dedes/oc.m4.d7:ocMA.OdeW1C13.melody	@ltx/en_us_dedes/he.h.m4:heHE.TristatasKrataious.name
ltx/en_us_dedes/oc.m4.d7:ocMA.OdeW1C13.mode	@ltx/en_us_dedes/miscellanea:misc.Mode4
ltx/en_us_dedes/oc.m4.d7:ocMA.OdeW1C13.ode	@ltx/en_us_dedes/miscellanea:misc.Ode1
ltx/en_us_dedes/oc.m4.d7:ocMA.OdeW1C13.text	
ltx/en_us_dedes/oc.m4.d7:ocMA.OdeW1C14.incipit	…
ltx/en_us_dedes/oc.m4.d7:ocMA.OdeW1C14.melody	@ltx/en_us_dedes/he.h.m4:heHE.TristatasKrataious.name
ltx/en_us_dedes/oc.m4.d7:ocMA.OdeW1C14.mode	@ltx/en_us_dedes/miscellanea:misc.Mode4
ltx/en_us_dedes/oc.m4.d7:ocMA.OdeW1C14.ode	@ltx/en_us_dedes/miscellanea:misc.Ode1
ltx/en_us_dedes/oc.m4.d7:ocMA.OdeW1C14.text	
ltx/en_us_dedes/oc.m4.d7:ocMA.OdeW1C1H.greekmelody	@ltx/en_us_dedes/he.h.m4:heHE.TristatasKrataious.greekname
ltx/en_us_dedes/oc.m4.d7:ocMA.OdeW1C1H.incipit	@ltx/en_us_dedes/he.h.m4:heHE.TristatasKrataious.incipit
ltx/en_us_dedes/oc.m4.d7:ocMA.OdeW1C1H.melody	@ltx/en_us_dedes/he.h.m4:heHE.TristatasKrataious.melody
ltx/en_us_dedes/oc.m4.d7:ocMA.OdeW1C1H.mode	@ltx/en_us_dedes/miscellanea:misc.Mode4
ltx/en_us_dedes/oc.m4.d7:ocMA.OdeW1C1H.ode	@ltx/en_us_dedes/miscellanea:misc.Ode1
ltx/en_us_dedes/oc.m4.d7:ocMA.OdeW1C1H.text	@ltx/en_us_dedes/he.h.m4:heHE.TristatasKrataious.text
ltx/en_us_dedes/oc.m4.d7:ocMA.OdeW1C1T.incipit	…
ltx/en_us_dedes/oc.m4.d7:ocMA.OdeW1C1T.melody	@ltx/en_us_dedes/he.h.m4:heHE.TristatasKrataious.name
ltx/en_us_dedes/oc.m4.d7:ocMA.OdeW1C1T.mode	@ltx/en_us_dedes/miscellanea:misc.Mode4
ltx/en_us_dedes/oc.m4.d7:ocMA.OdeW1C1T.ode	@ltx/en_us_dedes/miscellanea:misc.Ode1
ltx/en_us_dedes/oc.m4.d7:ocMA.OdeW1C1T.text	
ltx/en_us_dedes/oc.m4.d7:ocMA.OdeW1C21.greekmelody	@ltx/en_us_dedes/he.h.m4:heHE.ThalassisToErythraion.greekname
ltx/en_us_dedes/oc.m4.d7:ocMA.OdeW1C21.incipit	…
ltx/en_us_dedes/oc.m4.d7:ocMA.OdeW1C21.melody	@ltx/en_us_dedes/he.h.m4:heHE.ThalassisToErythraion.name
ltx/en_us_dedes/oc.m4.d7:ocMA.OdeW1C21.mode	@ltx/en_us_dedes/miscellanea:misc.Mode4
ltx/en_us_dedes/oc.m4.d7:ocMA.OdeW1C21.ode	@ltx/en_us_dedes/miscellanea:misc.Ode1
ltx/en_us_dedes/oc.m4.d7:ocMA.OdeW1C21.text	
ltx/en_us_dedes/oc.m4.d7:ocMA.OdeW1C22.incipit	…
ltx/en_us_dedes/oc.m4.d7:ocMA.OdeW1C22.melody	@ltx/en_us_dedes/he.h.m4:heHE.ThalassisToErythraion.name
ltx/en_us_dedes/oc.m4.d7:ocMA.OdeW1C22.mode	@ltx/en_us_dedes/miscellanea:misc.Mode4
ltx/en_us_dedes/oc.m4.d7:ocMA.OdeW1C22.ode	@ltx/en_us_dedes/miscellanea:misc.Ode1
ltx/en_us_dedes/oc.m4.d7:ocMA.OdeW1C22.text	
ltx/en_us_dedes/oc.m4.d7:ocMA.OdeW1C23.incipit	…
ltx/en_us_dedes/oc.m4.d7:ocMA.OdeW1C23.melody	@ltx/en_us_dedes/he.h.m4:heHE.ThalassisToErythraion.name
ltx/en_us_dedes/oc.m4.d7:ocMA.OdeW1C23.mode	@ltx/en_us_dedes/miscellanea:misc.Mode4
ltx/en_us_dedes/oc.m4.d7:ocMA.OdeW1C23.ode	@ltx/en_us_dedes/miscellanea:misc.Ode1
ltx/en_us_dedes/oc.m4.d7:ocMA.OdeW1C23.text	
ltx/en_us_dedes/oc.m4.d7:ocMA.OdeW1C2T.incipit	…
ltx/en_us_dedes/oc.m4.d7:ocMA.OdeW1C2T.melody	@ltx/en_us_dedes/he.h.m4:heHE.ThalassisToErythraion.name
ltx/en_us_dedes/oc.m4.d7:ocMA.OdeW1C2T.mode	@ltx/en_us_dedes/miscellanea:misc.Mode4
ltx/en_us_dedes/oc.m4.d7:ocMA.OdeW1C2T.ode	@ltx/en_us_dedes/miscellanea:misc.Ode1
ltx/en_us_dedes/oc.m4.d7:ocMA.OdeW1C2T.text	
ltx/en_us_dedes/oc.m4.d7:ocMA.OdeW3C11.incipit	…
ltx/en_us_dedes/oc.m4.d7:ocMA.OdeW3C11.melody	@ltx/en_us_dedes/he.h.m4:heHE.ToxonDynatonIsthenise.name
ltx/en_us_dedes/oc.m4.d7:ocMA.OdeW3C11.mode	@ltx/en_us_dedes/miscellanea:misc.Mode4
ltx/en_us_dedes/oc.m4.d7:ocMA.OdeW3C11.ode	@ltx/en_us_dedes/miscellanea:misc.Ode3
ltx/en_us_dedes/oc.m4.d7:ocMA.OdeW3C11.text	
ltx/en_us_dedes/oc.m4.d7:ocMA.OdeW3C12.incipit	…
ltx/en_us_dedes/oc.m4.d7:ocMA.OdeW3C12.melody	@ltx/en_us_dedes/he.h.m4:heHE.ToxonDynatonIsthenise.name
ltx/en_us_dedes/oc.m4.d7:ocMA.OdeW3C12.mode	@ltx/en_us_dedes/miscellanea:misc.Mode4
ltx/en_us_dedes/oc.m4.d7:ocMA.OdeW3C12.ode	@ltx/en_us_dedes/miscellanea:misc.Ode3
ltx/en_us_dedes/oc.m4.d7:ocMA.OdeW3C12.text	
ltx/en_us_dedes/oc.m4.d7:ocMA.OdeW3C13.incipit	…
ltx/en_us_dedes/oc.m4.d7:ocMA.OdeW3C13.melody	@ltx/en_us_dedes/he.h.m4:heHE.ToxonDynatonIsthenise.name
ltx/en_us_dedes/oc.m4.d7:ocMA.OdeW3C13.mode	@ltx/en_us_dedes/miscellanea:misc.Mode4
ltx/en_us_dedes/oc.m4.d7:ocMA.OdeW3C13.ode	@ltx/en_us_dedes/miscellanea:misc.Ode3
ltx/en_us_dedes/oc.m4.d7:ocMA.OdeW3C13.text	
ltx/en_us_dedes/oc.m4.d7:ocMA.OdeW3C14.incipit	…
ltx/en_us_dedes/oc.m4.d7:ocMA.OdeW3C14.melody	@ltx/en_us_dedes/he.h.m4:heHE.ToxonDynatonIsthenise.name
ltx/en_us_dedes/oc.m4.d7:ocMA.OdeW3C14.mode	@ltx/en_us_dedes/miscellanea:misc.Mode4
ltx/en_us_dedes/oc.m4.d7:ocMA.OdeW3C14.ode	@ltx/en_us_dedes/miscellanea:misc.Ode3
ltx/en_us_dedes/oc.m4.d7:ocMA.OdeW3C14.text	
ltx/en_us_dedes/oc.m4.d7:ocMA.OdeW3C1H.greekmelody	@ltx/en_us_dedes/he.h.m4:heHE.ToxonDynatonIsthenise.greekname
ltx/en_us_dedes/oc.m4.d7:ocMA.OdeW3C1H.incipit	@ltx/en_us_dedes/he.h.m4:heHE.ToxonDynatonIsthenise.incipit
ltx/en_us_dedes/oc.m4.d7:ocMA.OdeW3C1H.melody	@ltx/en_us_dedes/he.h.m4:heHE.ToxonDynatonIsthenise.melody
ltx/en_us_dedes/oc.m4.d7:ocMA.OdeW3C1H.mode	@ltx/en_us_dedes/miscellanea:misc.Mode4
ltx/en_us_dedes/oc.m4.d7:ocMA.OdeW3C1H.ode	@ltx/en_us_dedes/miscellanea:misc.Ode3
ltx/en_us_dedes/oc.m4.d7:ocMA.OdeW3C1H.text	@ltx/en_us_dedes/he.h.m4:heHE.ToxonDynatonIsthenise.text
ltx/en_us_dedes/oc.m4.d7:ocMA.OdeW3C1T.incipit	…
ltx/en_us_dedes/oc.m4.d7:ocMA.OdeW3C1T.melody	@ltx/en_us_dedes/he.h.m4:heHE.ToxonDynatonIsthenise.name
ltx/en_us_dedes/oc.m4.d7:ocMA.OdeW3C1T.mode	@ltx/en_us_dedes/miscellanea:misc.Mode4
ltx/en_us_dedes/oc.m4.d7:ocMA.OdeW3C1T.ode	@ltx/en_us_dedes/miscellanea:misc.Ode3
ltx/en_us_dedes/oc.m4.d7:ocMA.OdeW3C1T.text	
ltx/en_us_dedes/oc.m4.d7:ocMA.OdeW3C21.greekmelody	@ltx/en_us_dedes/he.h.m4:heHE.OukEnSofia.greekname
ltx/en_us_dedes/oc.m4.d7:ocMA.OdeW3C21.incipit	…
ltx/en_us_dedes/oc.m4.d7:ocMA.OdeW3C21.melody	@ltx/en_us_dedes/he.h.m4:heHE.OukEnSofia.name
ltx/en_us_dedes/oc.m4.d7:ocMA.OdeW3C21.mode	@ltx/en_us_dedes/miscellanea:misc.Mode4
ltx/en_us_dedes/oc.m4.d7:ocMA.OdeW3C21.ode	@ltx/en_us_dedes/miscellanea:misc.Ode3
ltx/en_us_dedes/oc.m4.d7:ocMA.OdeW3C21.text	
ltx/en_us_dedes/oc.m4.d7:ocMA.OdeW3C22.incipit	…
ltx/en_us_dedes/oc.m4.d7:ocMA.OdeW3C22.melody	@ltx/en_us_dedes/he.h.m4:heHE.OukEnSofia.name
ltx/en_us_dedes/oc.m4.d7:ocMA.OdeW3C22.mode	@ltx/en_us_dedes/miscellanea:misc.Mode4
ltx/en_us_dedes/oc.m4.d7:ocMA.OdeW3C22.ode	@ltx/en_us_dedes/miscellanea:misc.Ode3
ltx/en_us_dedes/oc.m4.d7:ocMA.OdeW3C22.text	
ltx/en_us_dedes/oc.m4.d7:ocMA.OdeW3C23.incipit	…
ltx/en_us_dedes/oc.m4.d7:ocMA.OdeW3C23.melody	@ltx/en_us_dedes/he.h.m4:heHE.OukEnSofia.name
ltx/en_us_dedes/oc.m4.d7:ocMA.OdeW3C23.mode	@ltx/en_us_dedes/miscellanea:misc.Mode4
ltx/en_us_dedes/oc.m4.d7:ocMA.OdeW3C23.ode	@ltx/en_us_dedes/miscellanea:misc.Ode3
ltx/en_us_dedes/oc.m4.d7:ocMA.OdeW3C23.text	
ltx/en_us_dedes/oc.m4.d7:ocMA.OdeW3C2T.incipit	…
ltx/en_us_dedes/oc.m4.d7:ocMA.OdeW3C2T.melody	@ltx/en_us_dedes/he.h.m4:heHE.OukEnSofia.name
ltx/en_us_dedes/oc.m4.d7:ocMA.OdeW3C2T.mode	@ltx/en_us_dedes/miscellanea:misc.Mode4
ltx/en_us_dedes/oc.m4.d7:ocMA.OdeW3C2T.ode	@ltx/en_us_dedes/miscellanea:misc.Ode3
ltx/en_us_dedes/oc.m4.d7:ocMA.OdeW3C2T.text	
ltx/en_us_dedes/oc.m4.d7:ocMA.OdeW4C11.incipit	…
ltx/en_us_dedes/oc.m4.d7:ocMA.OdeW4C11.melody	@ltx/en_us_dedes/he.h.m4:heHE.OKathimenosEnDoxi.name
ltx/en_us_dedes/oc.m4.d7:ocMA.OdeW4C11.mode	@ltx/en_us_dedes/miscellanea:misc.Mode4
ltx/en_us_dedes/oc.m4.d7:ocMA.OdeW4C11.ode	@ltx/en_us_dedes/miscellanea:misc.Ode4
ltx/en_us_dedes/oc.m4.d7:ocMA.OdeW4C11.text	
ltx/en_us_dedes/oc.m4.d7:ocMA.OdeW4C12.incipit	…
ltx/en_us_dedes/oc.m4.d7:ocMA.OdeW4C12.melody	@ltx/en_us_dedes/he.h.m4:heHE.OKathimenosEnDoxi.name
ltx/en_us_dedes/oc.m4.d7:ocMA.OdeW4C12.mode	@ltx/en_us_dedes/miscellanea:misc.Mode4
ltx/en_us_dedes/oc.m4.d7:ocMA.OdeW4C12.ode	@ltx/en_us_dedes/miscellanea:misc.Ode4
ltx/en_us_dedes/oc.m4.d7:ocMA.OdeW4C12.text	
ltx/en_us_dedes/oc.m4.d7:ocMA.OdeW4C13.incipit	…
ltx/en_us_dedes/oc.m4.d7:ocMA.OdeW4C13.melody	@ltx/en_us_dedes/he.h.m4:heHE.OKathimenosEnDoxi.name
ltx/en_us_dedes/oc.m4.d7:ocMA.OdeW4C13.mode	@ltx/en_us_dedes/miscellanea:misc.Mode4
ltx/en_us_dedes/oc.m4.d7:ocMA.OdeW4C13.ode	@ltx/en_us_dedes/miscellanea:misc.Ode4
ltx/en_us_dedes/oc.m4.d7:ocMA.OdeW4C13.text	
ltx/en_us_dedes/oc.m4.d7:ocMA.OdeW4C14.incipit	…
ltx/en_us_dedes/oc.m4.d7:ocMA.OdeW4C14.melody	@ltx/en_us_dedes/he.h.m4:heHE.OKathimenosEnDoxi.name
ltx/en_us_dedes/oc.m4.d7:ocMA.OdeW4C14.mode	@ltx/en_us_dedes/miscellanea:misc.Mode4
ltx/en_us_dedes/oc.m4.d7:ocMA.OdeW4C14.ode	@ltx/en_us_dedes/miscellanea:misc.Ode4
ltx/en_us_dedes/oc.m4.d7:ocMA.OdeW4C14.text	
ltx/en_us_dedes/oc.m4.d7:ocMA.OdeW4C1H.greekmelody	@ltx/en_us_dedes/he.h.m4:heHE.OKathimenosEnDoxi.greekname
ltx/en_us_dedes/oc.m4.d7:ocMA.OdeW4C1H.incipit	@ltx/en_us_dedes/he.h.m4:heHE.OKathimenosEnDoxi.incipit
ltx/en_us_dedes/oc.m4.d7:ocMA.OdeW4C1H.melody	@ltx/en_us_dedes/he.h.m4:heHE.OKathimenosEnDoxi.melody
ltx/en_us_dedes/oc.m4.d7:ocMA.OdeW4C1H.mode	@ltx/en_us_dedes/miscellanea:misc.Mode4
ltx/en_us_dedes/oc.m4.d7:ocMA.OdeW4C1H.ode	@ltx/en_us_dedes/miscellanea:misc.Ode4
ltx/en_us_dedes/oc.m4.d7:ocMA.OdeW4C1H.text	@ltx/en_us_dedes/he.h.m4:heHE.OKathimenosEnDoxi.text
ltx/en_us_dedes/oc.m4.d7:ocMA.OdeW4C1T.incipit	…
ltx/en_us_dedes/oc.m4.d7:ocMA.OdeW4C1T.melody	@ltx/en_us_dedes/he.h.m4:heHE.OKathimenosEnDoxi.name
ltx/en_us_dedes/oc.m4.d7:ocMA.OdeW4C1T.mode	@ltx/en_us_dedes/miscellanea:misc.Mode4
ltx/en_us_dedes/oc.m4.d7:ocMA.OdeW4C1T.ode	@ltx/en_us_dedes/miscellanea:misc.Ode4
ltx/en_us_dedes/oc.m4.d7:ocMA.OdeW4C1T.text	
ltx/en_us_dedes/oc.m4.d7:ocMA.OdeW4C21.greekmelody	@ltx/en_us_dedes/he.h.m4:heHE.EparthentaSeIdousa.greekname
ltx/en_us_dedes/oc.m4.d7:ocMA.OdeW4C21.incipit	…
ltx/en_us_dedes/oc.m4.d7:ocMA.OdeW4C21.melody	@ltx/en_us_dedes/he.h.m4:heHE.EparthentaSeIdousa.name
ltx/en_us_dedes/oc.m4.d7:ocMA.OdeW4C21.mode	@ltx/en_us_dedes/miscellanea:misc.Mode4
ltx/en_us_dedes/oc.m4.d7:ocMA.OdeW4C21.ode	@ltx/en_us_dedes/miscellanea:misc.Ode4
ltx/en_us_dedes/oc.m4.d7:ocMA.OdeW4C21.text	
ltx/en_us_dedes/oc.m4.d7:ocMA.OdeW4C22.incipit	…
ltx/en_us_dedes/oc.m4.d7:ocMA.OdeW4C22.melody	@ltx/en_us_dedes/he.h.m4:heHE.EparthentaSeIdousa.name
ltx/en_us_dedes/oc.m4.d7:ocMA.OdeW4C22.mode	@ltx/en_us_dedes/miscellanea:misc.Mode4
ltx/en_us_dedes/oc.m4.d7:ocMA.OdeW4C22.ode	@ltx/en_us_dedes/miscellanea:misc.Ode4
ltx/en_us_dedes/oc.m4.d7:ocMA.OdeW4C22.text	
ltx/en_us_dedes/oc.m4.d7:ocMA.OdeW4C23.incipit	…
ltx/en_us_dedes/oc.m4.d7:ocMA.OdeW4C23.melody	@ltx/en_us_dedes/he.h.m4:heHE.EparthentaSeIdousa.name
ltx/en_us_dedes/oc.m4.d7:ocMA.OdeW4C23.mode	@ltx/en_us_dedes/miscellanea:misc.Mode4
ltx/en_us_dedes/oc.m4.d7:ocMA.OdeW4C23.ode	@ltx/en_us_dedes/miscellanea:misc.Ode4
ltx/en_us_dedes/oc.m4.d7:ocMA.OdeW4C23.text	
ltx/en_us_dedes/oc.m4.d7:ocMA.OdeW4C2T.incipit	…
ltx/en_us_dedes/oc.m4.d7:ocMA.OdeW4C2T.melody	@ltx/en_us_dedes/he.h.m4:heHE.EparthentaSeIdousa.name
ltx/en_us_dedes/oc.m4.d7:ocMA.OdeW4C2T.mode	@ltx/en_us_dedes/miscellanea:misc.Mode4
ltx/en_us_dedes/oc.m4.d7:ocMA.OdeW4C2T.ode	@ltx/en_us_dedes/miscellanea:misc.Ode4
ltx/en_us_dedes/oc.m4.d7:ocMA.OdeW4C2T.text	
ltx/en_us_dedes/oc.m4.d7:ocMA.OdeW5C11.incipit	…
ltx/en_us_dedes/oc.m4.d7:ocMA.OdeW5C11.melody	@ltx/en_us_dedes/he.h.m4:heHE.SyKyrieMouFos.name
ltx/en_us_dedes/oc.m4.d7:ocMA.OdeW5C11.mode	@ltx/en_us_dedes/miscellanea:misc.Mode4
ltx/en_us_dedes/oc.m4.d7:ocMA.OdeW5C11.ode	@ltx/en_us_dedes/miscellanea:misc.Ode5
ltx/en_us_dedes/oc.m4.d7:ocMA.OdeW5C11.text	
ltx/en_us_dedes/oc.m4.d7:ocMA.OdeW5C12.incipit	…
ltx/en_us_dedes/oc.m4.d7:ocMA.OdeW5C12.melody	@ltx/en_us_dedes/he.h.m4:heHE.SyKyrieMouFos.name
ltx/en_us_dedes/oc.m4.d7:ocMA.OdeW5C12.mode	@ltx/en_us_dedes/miscellanea:misc.Mode4
ltx/en_us_dedes/oc.m4.d7:ocMA.OdeW5C12.ode	@ltx/en_us_dedes/miscellanea:misc.Ode5
ltx/en_us_dedes/oc.m4.d7:ocMA.OdeW5C12.text	
ltx/en_us_dedes/oc.m4.d7:ocMA.OdeW5C13.incipit	…
ltx/en_us_dedes/oc.m4.d7:ocMA.OdeW5C13.melody	@ltx/en_us_dedes/he.h.m4:heHE.SyKyrieMouFos.name
ltx/en_us_dedes/oc.m4.d7:ocMA.OdeW5C13.mode	@ltx/en_us_dedes/miscellanea:misc.Mode4
ltx/en_us_dedes/oc.m4.d7:ocMA.OdeW5C13.ode	@ltx/en_us_dedes/miscellanea:misc.Ode5
ltx/en_us_dedes/oc.m4.d7:ocMA.OdeW5C13.text	
ltx/en_us_dedes/oc.m4.d7:ocMA.OdeW5C14.incipit	…
ltx/en_us_dedes/oc.m4.d7:ocMA.OdeW5C14.melody	@ltx/en_us_dedes/he.h.m4:heHE.SyKyrieMouFos.name
ltx/en_us_dedes/oc.m4.d7:ocMA.OdeW5C14.mode	@ltx/en_us_dedes/miscellanea:misc.Mode4
ltx/en_us_dedes/oc.m4.d7:ocMA.OdeW5C14.ode	@ltx/en_us_dedes/miscellanea:misc.Ode5
ltx/en_us_dedes/oc.m4.d7:ocMA.OdeW5C14.text	
ltx/en_us_dedes/oc.m4.d7:ocMA.OdeW5C1H.greekmelody	@ltx/en_us_dedes/he.h.m4:heHE.SyKyrieMouFos.greekname
ltx/en_us_dedes/oc.m4.d7:ocMA.OdeW5C1H.incipit	@ltx/en_us_dedes/he.h.m4:heHE.SyKyrieMouFos.incipit
ltx/en_us_dedes/oc.m4.d7:ocMA.OdeW5C1H.melody	@ltx/en_us_dedes/he.h.m4:heHE.SyKyrieMouFos.melody
ltx/en_us_dedes/oc.m4.d7:ocMA.OdeW5C1H.mode	@ltx/en_us_dedes/miscellanea:misc.Mode4
ltx/en_us_dedes/oc.m4.d7:ocMA.OdeW5C1H.ode	@ltx/en_us_dedes/miscellanea:misc.Ode5
ltx/en_us_dedes/oc.m4.d7:ocMA.OdeW5C1H.text	@ltx/en_us_dedes/he.h.m4:heHE.SyKyrieMouFos.text
ltx/en_us_dedes/oc.m4.d7:ocMA.OdeW5C1T.incipit	…
ltx/en_us_dedes/oc.m4.d7:ocMA.OdeW5C1T.melody	@ltx/en_us_dedes/he.h.m4:heHE.SyKyrieMouFos.name
ltx/en_us_dedes/oc.m4.d7:ocMA.OdeW5C1T.mode	@ltx/en_us_dedes/miscellanea:misc.Mode4
ltx/en_us_dedes/oc.m4.d7:ocMA.OdeW5C1T.ode	@ltx/en_us_dedes/miscellanea:misc.Ode5
ltx/en_us_dedes/oc.m4.d7:ocMA.OdeW5C1T.text	
ltx/en_us_dedes/oc.m4.d7:ocMA.OdeW5C21.greekmelody	@ltx/en_us_dedes/he.h.m4:heHE.SyKyrieMouFos.greekname
ltx/en_us_dedes/oc.m4.d7:ocMA.OdeW5C21.incipit	…
ltx/en_us_dedes/oc.m4.d7:ocMA.OdeW5C21.melody	@ltx/en_us_dedes/he.h.m4:heHE.SyKyrieMouFos.name
ltx/en_us_dedes/oc.m4.d7:ocMA.OdeW5C21.mode	@ltx/en_us_dedes/miscellanea:misc.Mode4
ltx/en_us_dedes/oc.m4.d7:ocMA.OdeW5C21.ode	@ltx/en_us_dedes/miscellanea:misc.Ode5
ltx/en_us_dedes/oc.m4.d7:ocMA.OdeW5C21.text	
ltx/en_us_dedes/oc.m4.d7:ocMA.OdeW5C22.incipit	…
ltx/en_us_dedes/oc.m4.d7:ocMA.OdeW5C22.melody	@ltx/en_us_dedes/he.h.m4:heHE.SyKyrieMouFos.name
ltx/en_us_dedes/oc.m4.d7:ocMA.OdeW5C22.mode	@ltx/en_us_dedes/miscellanea:misc.Mode4
ltx/en_us_dedes/oc.m4.d7:ocMA.OdeW5C22.ode	@ltx/en_us_dedes/miscellanea:misc.Ode5
ltx/en_us_dedes/oc.m4.d7:ocMA.OdeW5C22.text	
ltx/en_us_dedes/oc.m4.d7:ocMA.OdeW5C23.incipit	…
ltx/en_us_dedes/oc.m4.d7:ocMA.OdeW5C23.melody	@ltx/en_us_dedes/he.h.m4:heHE.SyKyrieMouFos.name
ltx/en_us_dedes/oc.m4.d7:ocMA.OdeW5C23.mode	@ltx/en_us_dedes/miscellanea:misc.Mode4
ltx/en_us_dedes/oc.m4.d7:ocMA.OdeW5C23.ode	@ltx/en_us_dedes/miscellanea:misc.Ode5
ltx/en_us_dedes/oc.m4.d7:ocMA.OdeW5C23.text	
ltx/en_us_dedes/oc.m4.d7:ocMA.OdeW5C2T.incipit	…
ltx/en_us_dedes/oc.m4.d7:ocMA.OdeW5C2T.melody	@ltx/en_us_dedes/he.h.m4:heHE.SyKyrieMouFos.name
ltx/en_us_dedes/oc.m4.d7:ocMA.OdeW5C2T.mode	@ltx/en_us_dedes/miscellanea:misc.Mode4
ltx/en_us_dedes/oc.m4.d7:ocMA.OdeW5C2T.ode	@ltx/en_us_dedes/miscellanea:misc.Ode5
ltx/en_us_dedes/oc.m4.d7:ocMA.OdeW5C2T.text	
ltx/en_us_dedes/oc.m4.d7:ocMA.OdeW6C11.incipit	…
ltx/en_us_dedes/oc.m4.d7:ocMA.OdeW6C11.melody	@ltx/en_us_dedes/he.h.m4:heHE.IlthonEisTaVathi.name
ltx/en_us_dedes/oc.m4.d7:ocMA.OdeW6C11.mode	@ltx/en_us_dedes/miscellanea:misc.Mode4
ltx/en_us_dedes/oc.m4.d7:ocMA.OdeW6C11.ode	@ltx/en_us_dedes/miscellanea:misc.Ode6
ltx/en_us_dedes/oc.m4.d7:ocMA.OdeW6C11.text	
ltx/en_us_dedes/oc.m4.d7:ocMA.OdeW6C12.incipit	…
ltx/en_us_dedes/oc.m4.d7:ocMA.OdeW6C12.melody	@ltx/en_us_dedes/he.h.m4:heHE.IlthonEisTaVathi.name
ltx/en_us_dedes/oc.m4.d7:ocMA.OdeW6C12.mode	@ltx/en_us_dedes/miscellanea:misc.Mode4
ltx/en_us_dedes/oc.m4.d7:ocMA.OdeW6C12.ode	@ltx/en_us_dedes/miscellanea:misc.Ode6
ltx/en_us_dedes/oc.m4.d7:ocMA.OdeW6C12.text	
ltx/en_us_dedes/oc.m4.d7:ocMA.OdeW6C13.incipit	…
ltx/en_us_dedes/oc.m4.d7:ocMA.OdeW6C13.melody	@ltx/en_us_dedes/he.h.m4:heHE.IlthonEisTaVathi.name
ltx/en_us_dedes/oc.m4.d7:ocMA.OdeW6C13.mode	@ltx/en_us_dedes/miscellanea:misc.Mode4
ltx/en_us_dedes/oc.m4.d7:ocMA.OdeW6C13.ode	@ltx/en_us_dedes/miscellanea:misc.Ode6
ltx/en_us_dedes/oc.m4.d7:ocMA.OdeW6C13.text	
ltx/en_us_dedes/oc.m4.d7:ocMA.OdeW6C14.incipit	…
ltx/en_us_dedes/oc.m4.d7:ocMA.OdeW6C14.melody	@ltx/en_us_dedes/he.h.m4:heHE.IlthonEisTaVathi.name
ltx/en_us_dedes/oc.m4.d7:ocMA.OdeW6C14.mode	@ltx/en_us_dedes/miscellanea:misc.Mode4
ltx/en_us_dedes/oc.m4.d7:ocMA.OdeW6C14.ode	@ltx/en_us_dedes/miscellanea:misc.Ode6
ltx/en_us_dedes/oc.m4.d7:ocMA.OdeW6C14.text	
ltx/en_us_dedes/oc.m4.d7:ocMA.OdeW6C1H.greekmelody	@ltx/en_us_dedes/he.h.m4:heHE.IlthonEisTaVathi.greekname
ltx/en_us_dedes/oc.m4.d7:ocMA.OdeW6C1H.incipit	@ltx/en_us_dedes/he.h.m4:heHE.IlthonEisTaVathi.incipit
ltx/en_us_dedes/oc.m4.d7:ocMA.OdeW6C1H.melody	@ltx/en_us_dedes/he.h.m4:heHE.IlthonEisTaVathi.melody
ltx/en_us_dedes/oc.m4.d7:ocMA.OdeW6C1H.mode	@ltx/en_us_dedes/miscellanea:misc.Mode4
ltx/en_us_dedes/oc.m4.d7:ocMA.OdeW6C1H.ode	@ltx/en_us_dedes/miscellanea:misc.Ode6
ltx/en_us_dedes/oc.m4.d7:ocMA.OdeW6C1H.text	@ltx/en_us_dedes/he.h.m4:heHE.IlthonEisTaVathi.text
ltx/en_us_dedes/oc.m4.d7:ocMA.OdeW6C1T.incipit	…
ltx/en_us_dedes/oc.m4.d7:ocMA.OdeW6C1T.melody	@ltx/en_us_dedes/he.h.m4:heHE.IlthonEisTaVathi.name
ltx/en_us_dedes/oc.m4.d7:ocMA.OdeW6C1T.mode	@ltx/en_us_dedes/miscellanea:misc.Mode4
ltx/en_us_dedes/oc.m4.d7:ocMA.OdeW6C1T.ode	@ltx/en_us_dedes/miscellanea:misc.Ode6
ltx/en_us_dedes/oc.m4.d7:ocMA.OdeW6C1T.text	
ltx/en_us_dedes/oc.m4.d7:ocMA.OdeW6C21.greekmelody	@ltx/en_us_dedes/he.h.m4:heHE.ThysoSoiMetaFonis.greekname
ltx/en_us_dedes/oc.m4.d7:ocMA.OdeW6C21.incipit	…
ltx/en_us_dedes/oc.m4.d7:ocMA.OdeW6C21.melody	@ltx/en_us_dedes/he.h.m4:heHE.ThysoSoiMetaFonis.name
ltx/en_us_dedes/oc.m4.d7:ocMA.OdeW6C21.mode	@ltx/en_us_dedes/miscellanea:misc.Mode4
ltx/en_us_dedes/oc.m4.d7:ocMA.OdeW6C21.ode	@ltx/en_us_dedes/miscellanea:misc.Ode6
ltx/en_us_dedes/oc.m4.d7:ocMA.OdeW6C21.text	
ltx/en_us_dedes/oc.m4.d7:ocMA.OdeW6C22.incipit	…
ltx/en_us_dedes/oc.m4.d7:ocMA.OdeW6C22.melody	@ltx/en_us_dedes/he.h.m4:heHE.ThysoSoiMetaFonis.name
ltx/en_us_dedes/oc.m4.d7:ocMA.OdeW6C22.mode	@ltx/en_us_dedes/miscellanea:misc.Mode4
ltx/en_us_dedes/oc.m4.d7:ocMA.OdeW6C22.ode	@ltx/en_us_dedes/miscellanea:misc.Ode6
ltx/en_us_dedes/oc.m4.d7:ocMA.OdeW6C22.text	
ltx/en_us_dedes/oc.m4.d7:ocMA.OdeW6C23.incipit	…
ltx/en_us_dedes/oc.m4.d7:ocMA.OdeW6C23.melody	@ltx/en_us_dedes/he.h.m4:heHE.ThysoSoiMetaFonis.name
ltx/en_us_dedes/oc.m4.d7:ocMA.OdeW6C23.mode	@ltx/en_us_dedes/miscellanea:misc.Mode4
ltx/en_us_dedes/oc.m4.d7:ocMA.OdeW6C23.ode	@ltx/en_us_dedes/miscellanea:misc.Ode6
ltx/en_us_dedes/oc.m4.d7:ocMA.OdeW6C23.text	
ltx/en_us_dedes/oc.m4.d7:ocMA.OdeW6C2T.incipit	…
ltx/en_us_dedes/oc.m4.d7:ocMA.OdeW6C2T.melody	@ltx/en_us_dedes/he.h.m4:heHE.ThysoSoiMetaFonis.name
ltx/en_us_dedes/oc.m4.d7:ocMA.OdeW6C2T.mode	@ltx/en_us_dedes/miscellanea:misc.Mode4
ltx/en_us_dedes/oc.m4.d7:ocMA.OdeW6C2T.ode	@ltx/en_us_dedes/miscellanea:misc.Ode6
ltx/en_us_dedes/oc.m4.d7:ocMA.OdeW6C2T.text	
ltx/en_us_dedes/oc.m4.d7:ocMA.OdeW7C11.incipit	…
ltx/en_us_dedes/oc.m4.d7:ocMA.OdeW7C11.melody	@ltx/en_us_dedes/he.h.m4:heHE.AvramiaioiPote.name
ltx/en_us_dedes/oc.m4.d7:ocMA.OdeW7C11.mode	@ltx/en_us_dedes/miscellanea:misc.Mode4
ltx/en_us_dedes/oc.m4.d7:ocMA.OdeW7C11.ode	@ltx/en_us_dedes/miscellanea:misc.Ode7
ltx/en_us_dedes/oc.m4.d7:ocMA.OdeW7C11.text	
ltx/en_us_dedes/oc.m4.d7:ocMA.OdeW7C12.incipit	…
ltx/en_us_dedes/oc.m4.d7:ocMA.OdeW7C12.melody	@ltx/en_us_dedes/he.h.m4:heHE.AvramiaioiPote.name
ltx/en_us_dedes/oc.m4.d7:ocMA.OdeW7C12.mode	@ltx/en_us_dedes/miscellanea:misc.Mode4
ltx/en_us_dedes/oc.m4.d7:ocMA.OdeW7C12.ode	@ltx/en_us_dedes/miscellanea:misc.Ode7
ltx/en_us_dedes/oc.m4.d7:ocMA.OdeW7C12.text	
ltx/en_us_dedes/oc.m4.d7:ocMA.OdeW7C13.incipit	…
ltx/en_us_dedes/oc.m4.d7:ocMA.OdeW7C13.melody	@ltx/en_us_dedes/he.h.m4:heHE.AvramiaioiPote.name
ltx/en_us_dedes/oc.m4.d7:ocMA.OdeW7C13.mode	@ltx/en_us_dedes/miscellanea:misc.Mode4
ltx/en_us_dedes/oc.m4.d7:ocMA.OdeW7C13.ode	@ltx/en_us_dedes/miscellanea:misc.Ode7
ltx/en_us_dedes/oc.m4.d7:ocMA.OdeW7C13.text	
ltx/en_us_dedes/oc.m4.d7:ocMA.OdeW7C14.incipit	…
ltx/en_us_dedes/oc.m4.d7:ocMA.OdeW7C14.melody	@ltx/en_us_dedes/he.h.m4:heHE.AvramiaioiPote.name
ltx/en_us_dedes/oc.m4.d7:ocMA.OdeW7C14.mode	@ltx/en_us_dedes/miscellanea:misc.Mode4
ltx/en_us_dedes/oc.m4.d7:ocMA.OdeW7C14.ode	@ltx/en_us_dedes/miscellanea:misc.Ode7
ltx/en_us_dedes/oc.m4.d7:ocMA.OdeW7C14.text	
ltx/en_us_dedes/oc.m4.d7:ocMA.OdeW7C1H.greekmelody	@ltx/en_us_dedes/he.h.m4:heHE.AvramiaioiPote.greekname
ltx/en_us_dedes/oc.m4.d7:ocMA.OdeW7C1H.incipit	@ltx/en_us_dedes/he.h.m4:heHE.AvramiaioiPote.incipit
ltx/en_us_dedes/oc.m4.d7:ocMA.OdeW7C1H.melody	@ltx/en_us_dedes/he.h.m4:heHE.AvramiaioiPote.melody
ltx/en_us_dedes/oc.m4.d7:ocMA.OdeW7C1H.mode	@ltx/en_us_dedes/miscellanea:misc.Mode4
ltx/en_us_dedes/oc.m4.d7:ocMA.OdeW7C1H.ode	@ltx/en_us_dedes/miscellanea:misc.Ode7
ltx/en_us_dedes/oc.m4.d7:ocMA.OdeW7C1H.text	@ltx/en_us_dedes/he.h.m4:heHE.AvramiaioiPote.text
ltx/en_us_dedes/oc.m4.d7:ocMA.OdeW7C1T.incipit	…
ltx/en_us_dedes/oc.m4.d7:ocMA.OdeW7C1T.melody	@ltx/en_us_dedes/he.h.m4:heHE.AvramiaioiPote.name
ltx/en_us_dedes/oc.m4.d7:ocMA.OdeW7C1T.mode	@ltx/en_us_dedes/miscellanea:misc.Mode4
ltx/en_us_dedes/oc.m4.d7:ocMA.OdeW7C1T.ode	@ltx/en_us_dedes/miscellanea:misc.Ode7
ltx/en_us_dedes/oc.m4.d7:ocMA.OdeW7C1T.text	
ltx/en_us_dedes/oc.m4.d7:ocMA.OdeW7C21.greekmelody	@ltx/en_us_dedes/he.h.m4:heHE.EnTiKaminoAvramiaioi.greekname
ltx/en_us_dedes/oc.m4.d7:ocMA.OdeW7C21.incipit	…
ltx/en_us_dedes/oc.m4.d7:ocMA.OdeW7C21.melody	@ltx/en_us_dedes/he.h.m4:heHE.EnTiKaminoAvramiaioi.name
ltx/en_us_dedes/oc.m4.d7:ocMA.OdeW7C21.mode	@ltx/en_us_dedes/miscellanea:misc.Mode4
ltx/en_us_dedes/oc.m4.d7:ocMA.OdeW7C21.ode	@ltx/en_us_dedes/miscellanea:misc.Ode7
ltx/en_us_dedes/oc.m4.d7:ocMA.OdeW7C21.text	
ltx/en_us_dedes/oc.m4.d7:ocMA.OdeW7C22.incipit	…
ltx/en_us_dedes/oc.m4.d7:ocMA.OdeW7C22.melody	@ltx/en_us_dedes/he.h.m4:heHE.EnTiKaminoAvramiaioi.name
ltx/en_us_dedes/oc.m4.d7:ocMA.OdeW7C22.mode	@ltx/en_us_dedes/miscellanea:misc.Mode4
ltx/en_us_dedes/oc.m4.d7:ocMA.OdeW7C22.ode	@ltx/en_us_dedes/miscellanea:misc.Ode7
ltx/en_us_dedes/oc.m4.d7:ocMA.OdeW7C22.text	
ltx/en_us_dedes/oc.m4.d7:ocMA.OdeW7C23.incipit	…
ltx/en_us_dedes/oc.m4.d7:ocMA.OdeW7C23.melody	@ltx/en_us_dedes/he.h.m4:heHE.EnTiKaminoAvramiaioi.name
ltx/en_us_dedes/oc.m4.d7:ocMA.OdeW7C23.mode	@ltx/en_us_dedes/miscellanea:misc.Mode4
ltx/en_us_dedes/oc.m4.d7:ocMA.OdeW7C23.ode	@ltx/en_us_dedes/miscellanea:misc.Ode7
ltx/en_us_dedes/oc.m4.d7:ocMA.OdeW7C23.text	
ltx/en_us_dedes/oc.m4.d7:ocMA.OdeW7C2T.incipit	…
ltx/en_us_dedes/oc.m4.d7:ocMA.OdeW7C2T.melody	@ltx/en_us_dedes/he.h.m4:heHE.EnTiKaminoAvramiaioi.name
ltx/en_us_dedes/oc.m4.d7:ocMA.OdeW7C2T.mode	@ltx/en_us_dedes/miscellanea:misc.Mode4
ltx/en_us_dedes/oc.m4.d7:ocMA.OdeW7C2T.ode	@ltx/en_us_dedes/miscellanea:misc.Ode7
ltx/en_us_dedes/oc.m4.d7:ocMA.OdeW7C2T.text	
ltx/en_us_dedes/oc.m4.d7:ocMA.OdeW8C11.incipit	…
ltx/en_us_dedes/oc.m4.d7:ocMA.OdeW8C11.melody	@ltx/en_us_dedes/he.h.m4:heHE.LytrotaTouPantos.name
ltx/en_us_dedes/oc.m4.d7:ocMA.OdeW8C11.mode	@ltx/en_us_dedes/miscellanea:misc.Mode4
ltx/en_us_dedes/oc.m4.d7:ocMA.OdeW8C11.ode	@ltx/en_us_dedes/miscellanea:misc.Ode8
ltx/en_us_dedes/oc.m4.d7:ocMA.OdeW8C11.text	
ltx/en_us_dedes/oc.m4.d7:ocMA.OdeW8C12.incipit	…
ltx/en_us_dedes/oc.m4.d7:ocMA.OdeW8C12.melody	@ltx/en_us_dedes/he.h.m4:heHE.LytrotaTouPantos.name
ltx/en_us_dedes/oc.m4.d7:ocMA.OdeW8C12.mode	@ltx/en_us_dedes/miscellanea:misc.Mode4
ltx/en_us_dedes/oc.m4.d7:ocMA.OdeW8C12.ode	@ltx/en_us_dedes/miscellanea:misc.Ode8
ltx/en_us_dedes/oc.m4.d7:ocMA.OdeW8C12.text	
ltx/en_us_dedes/oc.m4.d7:ocMA.OdeW8C13.incipit	…
ltx/en_us_dedes/oc.m4.d7:ocMA.OdeW8C13.melody	@ltx/en_us_dedes/he.h.m4:heHE.LytrotaTouPantos.name
ltx/en_us_dedes/oc.m4.d7:ocMA.OdeW8C13.mode	@ltx/en_us_dedes/miscellanea:misc.Mode4
ltx/en_us_dedes/oc.m4.d7:ocMA.OdeW8C13.ode	@ltx/en_us_dedes/miscellanea:misc.Ode8
ltx/en_us_dedes/oc.m4.d7:ocMA.OdeW8C13.text	
ltx/en_us_dedes/oc.m4.d7:ocMA.OdeW8C14.incipit	…
ltx/en_us_dedes/oc.m4.d7:ocMA.OdeW8C14.melody	@ltx/en_us_dedes/he.h.m4:heHE.LytrotaTouPantos.name
ltx/en_us_dedes/oc.m4.d7:ocMA.OdeW8C14.mode	@ltx/en_us_dedes/miscellanea:misc.Mode4
ltx/en_us_dedes/oc.m4.d7:ocMA.OdeW8C14.ode	@ltx/en_us_dedes/miscellanea:misc.Ode8
ltx/en_us_dedes/oc.m4.d7:ocMA.OdeW8C14.text	
ltx/en_us_dedes/oc.m4.d7:ocMA.OdeW8C1H.greekmelody	@ltx/en_us_dedes/he.h.m4:heHE.LytrotaTouPantos.greekname
ltx/en_us_dedes/oc.m4.d7:ocMA.OdeW8C1H.incipit	@ltx/en_us_dedes/he.h.m4:heHE.LytrotaTouPantos.incipit
ltx/en_us_dedes/oc.m4.d7:ocMA.OdeW8C1H.melody	@ltx/en_us_dedes/he.h.m4:heHE.LytrotaTouPantos.melody
ltx/en_us_dedes/oc.m4.d7:ocMA.OdeW8C1H.mode	@ltx/en_us_dedes/miscellanea:misc.Mode4
ltx/en_us_dedes/oc.m4.d7:ocMA.OdeW8C1H.ode	@ltx/en_us_dedes/miscellanea:misc.Ode8
ltx/en_us_dedes/oc.m4.d7:ocMA.OdeW8C1H.text	@ltx/en_us_dedes/he.h.m4:heHE.LytrotaTouPantos.text
ltx/en_us_dedes/oc.m4.d7:ocMA.OdeW8C1T.incipit	…
ltx/en_us_dedes/oc.m4.d7:ocMA.OdeW8C1T.melody	@ltx/en_us_dedes/he.h.m4:heHE.LytrotaTouPantos.name
ltx/en_us_dedes/oc.m4.d7:ocMA.OdeW8C1T.mode	@ltx/en_us_dedes/miscellanea:misc.Mode4
ltx/en_us_dedes/oc.m4.d7:ocMA.OdeW8C1T.ode	@ltx/en_us_dedes/miscellanea:misc.Ode8
ltx/en_us_dedes/oc.m4.d7:ocMA.OdeW8C1T.text	
ltx/en_us_dedes/oc.m4.d7:ocMA.OdeW8C21.greekmelody	@ltx/en_us_dedes/he.h.m4:heHE.CheirasEkpetasasDaniil.greekname
ltx/en_us_dedes/oc.m4.d7:ocMA.OdeW8C21.incipit	…
ltx/en_us_dedes/oc.m4.d7:ocMA.OdeW8C21.melody	@ltx/en_us_dedes/he.h.m4:heHE.CheirasEkpetasasDaniil.name
ltx/en_us_dedes/oc.m4.d7:ocMA.OdeW8C21.mode	@ltx/en_us_dedes/miscellanea:misc.Mode4
ltx/en_us_dedes/oc.m4.d7:ocMA.OdeW8C21.ode	@ltx/en_us_dedes/miscellanea:misc.Ode8
ltx/en_us_dedes/oc.m4.d7:ocMA.OdeW8C21.text	
ltx/en_us_dedes/oc.m4.d7:ocMA.OdeW8C22.incipit	…
ltx/en_us_dedes/oc.m4.d7:ocMA.OdeW8C22.melody	@ltx/en_us_dedes/he.h.m4:heHE.CheirasEkpetasasDaniil.name
ltx/en_us_dedes/oc.m4.d7:ocMA.OdeW8C22.mode	@ltx/en_us_dedes/miscellanea:misc.Mode4
ltx/en_us_dedes/oc.m4.d7:ocMA.OdeW8C22.ode	@ltx/en_us_dedes/miscellanea:misc.Ode8
ltx/en_us_dedes/oc.m4.d7:ocMA.OdeW8C22.text	
ltx/en_us_dedes/oc.m4.d7:ocMA.OdeW8C23.incipit	…
ltx/en_us_dedes/oc.m4.d7:ocMA.OdeW8C23.melody	@ltx/en_us_dedes/he.h.m4:heHE.CheirasEkpetasasDaniil.name
ltx/en_us_dedes/oc.m4.d7:ocMA.OdeW8C23.mode	@ltx/en_us_dedes/miscellanea:misc.Mode4
ltx/en_us_dedes/oc.m4.d7:ocMA.OdeW8C23.ode	@ltx/en_us_dedes/miscellanea:misc.Ode8
ltx/en_us_dedes/oc.m4.d7:ocMA.OdeW8C23.text	
ltx/en_us_dedes/oc.m4.d7:ocMA.OdeW8C2T.incipit	…
ltx/en_us_dedes/oc.m4.d7:ocMA.OdeW8C2T.melody	@ltx/en_us_dedes/he.h.m4:heHE.CheirasEkpetasasDaniil.name
ltx/en_us_dedes/oc.m4.d7:ocMA.OdeW8C2T.mode	@ltx/en_us_dedes/miscellanea:misc.Mode4
ltx/en_us_dedes/oc.m4.d7:ocMA.OdeW8C2T.ode	@ltx/en_us_dedes/miscellanea:misc.Ode8
ltx/en_us_dedes/oc.m4.d7:ocMA.OdeW8C2T.text	
ltx/en_us_dedes/oc.m4.d7:ocMA.OdeW9C11.incipit	…
ltx/en_us_dedes/oc.m4.d7:ocMA.OdeW9C11.melody	@ltx/en_us_dedes/he.h.m4:heHE.EvaMenToTisParakois.name
ltx/en_us_dedes/oc.m4.d7:ocMA.OdeW9C11.mode	@ltx/en_us_dedes/miscellanea:misc.Mode4
ltx/en_us_dedes/oc.m4.d7:ocMA.OdeW9C11.ode	@ltx/en_us_dedes/miscellanea:misc.Ode9
ltx/en_us_dedes/oc.m4.d7:ocMA.OdeW9C11.text	
ltx/en_us_dedes/oc.m4.d7:ocMA.OdeW9C12.incipit	…
ltx/en_us_dedes/oc.m4.d7:ocMA.OdeW9C12.melody	@ltx/en_us_dedes/he.h.m4:heHE.EvaMenToTisParakois.name
ltx/en_us_dedes/oc.m4.d7:ocMA.OdeW9C12.mode	@ltx/en_us_dedes/miscellanea:misc.Mode4
ltx/en_us_dedes/oc.m4.d7:ocMA.OdeW9C12.ode	@ltx/en_us_dedes/miscellanea:misc.Ode9
ltx/en_us_dedes/oc.m4.d7:ocMA.OdeW9C12.text	
ltx/en_us_dedes/oc.m4.d7:ocMA.OdeW9C13.incipit	…
ltx/en_us_dedes/oc.m4.d7:ocMA.OdeW9C13.melody	@ltx/en_us_dedes/he.h.m4:heHE.EvaMenToTisParakois.name
ltx/en_us_dedes/oc.m4.d7:ocMA.OdeW9C13.mode	@ltx/en_us_dedes/miscellanea:misc.Mode4
ltx/en_us_dedes/oc.m4.d7:ocMA.OdeW9C13.ode	@ltx/en_us_dedes/miscellanea:misc.Ode9
ltx/en_us_dedes/oc.m4.d7:ocMA.OdeW9C13.text	
ltx/en_us_dedes/oc.m4.d7:ocMA.OdeW9C14.incipit	…
ltx/en_us_dedes/oc.m4.d7:ocMA.OdeW9C14.melody	@ltx/en_us_dedes/he.h.m4:heHE.EvaMenToTisParakois.name
ltx/en_us_dedes/oc.m4.d7:ocMA.OdeW9C14.mode	@ltx/en_us_dedes/miscellanea:misc.Mode4
ltx/en_us_dedes/oc.m4.d7:ocMA.OdeW9C14.ode	@ltx/en_us_dedes/miscellanea:misc.Ode9
ltx/en_us_dedes/oc.m4.d7:ocMA.OdeW9C14.text	
ltx/en_us_dedes/oc.m4.d7:ocMA.OdeW9C1H.greekmelody	@ltx/en_us_dedes/he.h.m4:heHE.EvaMenToTisParakois.greekname
ltx/en_us_dedes/oc.m4.d7:ocMA.OdeW9C1H.incipit	@ltx/en_us_dedes/he.h.m4:heHE.EvaMenToTisParakois.incipit
ltx/en_us_dedes/oc.m4.d7:ocMA.OdeW9C1H.melody	@ltx/en_us_dedes/he.h.m4:heHE.EvaMenToTisParakois.melody
ltx/en_us_dedes/oc.m4.d7:ocMA.OdeW9C1H.mode	@ltx/en_us_dedes/miscellanea:misc.Mode4
ltx/en_us_dedes/oc.m4.d7:ocMA.OdeW9C1H.ode	@ltx/en_us_dedes/miscellanea:misc.Ode9
ltx/en_us_dedes/oc.m4.d7:ocMA.OdeW9C1H.text	@ltx/en_us_dedes/he.h.m4:heHE.EvaMenToTisParakois.text
ltx/en_us_dedes/oc.m4.d7:ocMA.OdeW9C1T.incipit	…
ltx/en_us_dedes/oc.m4.d7:ocMA.OdeW9C1T.melody	@ltx/en_us_dedes/he.h.m4:heHE.EvaMenToTisParakois.name
ltx/en_us_dedes/oc.m4.d7:ocMA.OdeW9C1T.mode	@ltx/en_us_dedes/miscellanea:misc.Mode4
ltx/en_us_dedes/oc.m4.d7:ocMA.OdeW9C1T.ode	@ltx/en_us_dedes/miscellanea:misc.Ode9
ltx/en_us_dedes/oc.m4.d7:ocMA.OdeW9C1T.text	
ltx/en_us_dedes/oc.m4.d7:ocMA.OdeW9C21.greekmelody	@ltx/en_us_dedes/he.h.m4:heHE.EvaMenToTisParakois.greekname
ltx/en_us_dedes/oc.m4.d7:ocMA.OdeW9C21.incipit	…
ltx/en_us_dedes/oc.m4.d7:ocMA.OdeW9C21.melody	@ltx/en_us_dedes/he.h.m4:heHE.EvaMenToTisParakois.name
ltx/en_us_dedes/oc.m4.d7:ocMA.OdeW9C21.mode	@ltx/en_us_dedes/miscellanea:misc.Mode4
ltx/en_us_dedes/oc.m4.d7:ocMA.OdeW9C21.ode	@ltx/en_us_dedes/miscellanea:misc.Ode9
ltx/en_us_dedes/oc.m4.d7:ocMA.OdeW9C21.text	
ltx/en_us_dedes/oc.m4.d7:ocMA.OdeW9C22.incipit	…
ltx/en_us_dedes/oc.m4.d7:ocMA.OdeW9C22.melody	@ltx/en_us_dedes/he.h.m4:heHE.EvaMenToTisParakois.name
ltx/en_us_dedes/oc.m4.d7:ocMA.OdeW9C22.mode	@ltx/en_us_dedes/miscellanea:misc.Mode4
ltx/en_us_dedes/oc.m4.d7:ocMA.OdeW9C22.ode	@ltx/en_us_dedes/miscellanea:misc.Ode9
ltx/en_us_dedes/oc.m4.d7:ocMA.OdeW9C22.text	
ltx/en_us_dedes/oc.m4.d7:ocMA.OdeW9C23.incipit	…
ltx/en_us_dedes/oc.m4.d7:ocMA.OdeW9C23.melody	@ltx/en_us_dedes/he.h.m4:heHE.EvaMenToTisParakois.name
ltx/en_us_dedes/oc.m4.d7:ocMA.OdeW9C23.mode	@ltx/en_us_dedes/miscellanea:misc.Mode4
ltx/en_us_dedes/oc.m4.d7:ocMA.OdeW9C23.ode	@ltx/en_us_dedes/miscellanea:misc.Ode9
ltx/en_us_dedes/oc.m4.d7:ocMA.OdeW9C23.text	
ltx/en_us_dedes/oc.m4.d7:ocMA.OdeW9C2T.incipit	…
ltx/en_us_dedes/oc.m4.d7:ocMA.OdeW9C2T.melody	@ltx/en_us_dedes/he.h.m4:heHE.EvaMenToTisParakois.name
ltx/en_us_dedes/oc.m4.d7:ocMA.OdeW9C2T.mode	@ltx/en_us_dedes/miscellanea:misc.Mode4
ltx/en_us_dedes/oc.m4.d7:ocMA.OdeW9C2T.ode	@ltx/en_us_dedes/miscellanea:misc.Ode9
ltx/en_us_dedes/oc.m4.d7:ocMA.OdeW9C2T.text	
ltx/en_us_dedes/oc.m4.d7:ocVE.ApolTheotokionVM.incipit	@ltx/en_us_dedes/oc.m4.d1:ocVE.ApolTheotokionVM.incipit
ltx/en_us_dedes/oc.m4.d7:ocVE.ApolTheotokionVM.melody	
ltx/en_us_dedes/oc.m4.d7:ocVE.ApolTheotokionVM.mode	@ltx/en_us_dedes/miscellanea:misc.Mode4
ltx/en_us_dedes/oc.m4.d7:ocVE.ApolTheotokionVM.text	@ltx/en_us_dedes/oc.m4.d1:ocVE.ApolTheotokionVM.text
ltx/en_us_dedes/oc.m4.d7:ocVE.AposTheotokion.incipit	Having you, O Theotokos, as…
ltx/en_us_dedes/oc.m4.d7:ocVE.AposTheotokion.melody	
ltx/en_us_dedes/oc.m4.d7:ocVE.AposTheotokion.mode	@ltx/en_us_dedes/miscellanea:misc.Mode4
ltx/en_us_dedes/oc.m4.d7:ocVE.AposTheotokion.text	Having you, O Theotokos, as our hope and protection, we are not dismayed by the schemes of the foe, for truly you save our souls.
ltx/en_us_dedes/oc.m4.d7:ocVE.Aposticha1.incipit	@ltx/en_us_dedes/oc.m4.d3:ocVE.Aposticha3.incipit
ltx/en_us_dedes/oc.m4.d7:ocVE.Aposticha1.melody	
ltx/en_us_dedes/oc.m4.d7:ocVE.Aposticha1.mode	@ltx/en_us_dedes/miscellanea:misc.Mode4
ltx/en_us_dedes/oc.m4.d7:ocVE.Aposticha1.text	@ltx/en_us_dedes/oc.m4.d3:ocVE.Aposticha3.text
ltx/en_us_dedes/oc.m4.d7:ocVE.Aposticha2.incipit	@ltx/en_us_dedes/oc.m4.d4:ocVE.Aposticha3.incipit
ltx/en_us_dedes/oc.m4.d7:ocVE.Aposticha2.melody	
ltx/en_us_dedes/oc.m4.d7:ocVE.Aposticha2.mode	@ltx/en_us_dedes/miscellanea:misc.Mode4
ltx/en_us_dedes/oc.m4.d7:ocVE.Aposticha2.text	@ltx/en_us_dedes/oc.m4.d4:ocVE.Aposticha3.text
ltx/en_us_dedes/oc.m4.d7:ocVE.Aposticha3.incipit	@ltx/en_us_dedes/oc.m4.d5:ocVE.Aposticha3.incipit
ltx/en_us_dedes/oc.m4.d7:ocVE.Aposticha3.melody	
ltx/en_us_dedes/oc.m4.d7:ocVE.Aposticha3.mode	@ltx/en_us_dedes/miscellanea:misc.Mode4
ltx/en_us_dedes/oc.m4.d7:ocVE.Aposticha3.text	@ltx/en_us_dedes/oc.m4.d5:ocVE.Aposticha3.text
ltx/en_us_dedes/oc.m4.d7:ocVE.Aposticha4.incipit	…
ltx/en_us_dedes/oc.m4.d7:ocVE.Aposticha4.melody	
ltx/en_us_dedes/oc.m4.d7:ocVE.Aposticha4.mode	@ltx/en_us_dedes/miscellanea:misc.Mode4
ltx/en_us_dedes/oc.m4.d7:ocVE.Aposticha4.text	
ltx/en_us_dedes/oc.m4.d7:ocVE.SticTheotokion.incipit	@ltx/en_us_dedes/oc.m4.d1:ocVE.SticTheotokion.incipit
ltx/en_us_dedes/oc.m4.d7:ocVE.SticTheotokion.melody	
ltx/en_us_dedes/oc.m4.d7:ocVE.SticTheotokion.mode	@ltx/en_us_dedes/miscellanea:misc.Mode4
ltx/en_us_dedes/oc.m4.d7:ocVE.SticTheotokion.text	@ltx/en_us_dedes/oc.m4.d1:ocVE.SticTheotokion.text
ltx/en_us_dedes/oc.m4.d7:ocVE.Stichera1.greekmelody	@ltx/en_us_dedes/he.a.m4:heAU.IthelonDakrysinExaleipsai.greekname
ltx/en_us_dedes/oc.m4.d7:ocVE.Stichera1.incipit	Shatter, O Master and God…
ltx/en_us_dedes/oc.m4.d7:ocVE.Stichera1.melody	@ltx/en_us_dedes/he.a.m4:heAU.IthelonDakrysinExaleipsai.name
ltx/en_us_dedes/oc.m4.d7:ocVE.Stichera1.mode	@ltx/en_us_dedes/miscellanea:misc.Mode4
ltx/en_us_dedes/oc.m4.d7:ocVE.Stichera1.text	Lord God, I pray You shatter the passions * of my wretched heart, for they are the carriers of death. * If You yourself demolish the house of * the flesh and build the house of the spirit in its stead, * then he who wages the warfare * upon my soul watches vainly. * Save me before I utterly perish, O Lord my God.
ltx/en_us_dedes/oc.m4.d7:ocVE.Stichera2.incipit	You gave the enemy for…
ltx/en_us_dedes/oc.m4.d7:ocVE.Stichera2.melody	@ltx/en_us_dedes/he.a.m4:heAU.IthelonDakrysinExaleipsai.name
ltx/en_us_dedes/oc.m4.d7:ocVE.Stichera2.mode	@ltx/en_us_dedes/miscellanea:misc.Mode4
ltx/en_us_dedes/oc.m4.d7:ocVE.Stichera2.text	You gave the enemy for my welfare * as a gift and scourge of discipline, tender-loving God. * For notwithstanding his evil purpose, * his wickedness cooperates with me for the good. * Yet I do not flee for refuge * unto You through thanksgiving. * Save me before I utterly perish, O Lord my God.
ltx/en_us_dedes/oc.m4.d7:ocVE.Stichera3.incipit	…
ltx/en_us_dedes/oc.m4.d7:ocVE.Stichera3.melody	@ltx/en_us_dedes/he.a.m4:heAU.IthelonDakrysinExaleipsai.name
ltx/en_us_dedes/oc.m4.d7:ocVE.Stichera3.mode	@ltx/en_us_dedes/miscellanea:misc.Mode4
ltx/en_us_dedes/oc.m4.d7:ocVE.Stichera3.text	
ltx/en_us_dedes/oc.m4.d7:ocVE.Stichera4.greekmelody	@ltx/en_us_dedes/he.a.m4:heAU.IthelonDakrysinExaleipsai.greekname
ltx/en_us_dedes/oc.m4.d7:ocVE.Stichera4.incipit	…
ltx/en_us_dedes/oc.m4.d7:ocVE.Stichera4.melody	@ltx/en_us_dedes/he.a.m4:heAU.IthelonDakrysinExaleipsai.name
ltx/en_us_dedes/oc.m4.d7:ocVE.Stichera4.mode	@ltx/en_us_dedes/miscellanea:misc.Mode4
ltx/en_us_dedes/oc.m4.d7:ocVE.Stichera4.text	
ltx/en_us_dedes/oc.m4.d7:ocVE.Stichera5.incipit	…
ltx/en_us_dedes/oc.m4.d7:ocVE.Stichera5.melody	@ltx/en_us_dedes/he.a.m4:heAU.IthelonDakrysinExaleipsai.name
ltx/en_us_dedes/oc.m4.d7:ocVE.Stichera5.mode	@ltx/en_us_dedes/miscellanea:misc.Mode4
ltx/en_us_dedes/oc.m4.d7:ocVE.Stichera5.text	
ltx/en_us_dedes/oc.m4.d7:ocVE.Stichera6.incipit	Mother of God, grant me…
ltx/en_us_dedes/oc.m4.d7:ocVE.Stichera6.melody	@ltx/en_us_dedes/he.a.m4:heAU.IthelonDakrysinExaleipsai.name
ltx/en_us_dedes/oc.m4.d7:ocVE.Stichera6.mode	@ltx/en_us_dedes/miscellanea:misc.Mode4
ltx/en_us_dedes/oc.m4.d7:ocVE.Stichera6.text	Mother of God, grant me tears, I pray you; * also make my stony heart to be humble and contrite. * Grant me to make a complete confession * of the sinful actions of my entire life, * that I may pass the remainder * of my life in repentance, * with your help, and obtain the remission of all my sins.
ltx/en_us_dedes/oc.m4.d7:octrMA.AposGlory.incipit	@ltx/en_us_dedes/oc.m4.d7:ocMA.Aposticha4.incipit
ltx/en_us_dedes/oc.m4.d7:octrMA.AposGlory.melody	@ltx/en_us_dedes/he.a.m4:heAU.EdokasSimeiosin.name
ltx/en_us_dedes/oc.m4.d7:octrMA.AposGlory.mode	@ltx/en_us_dedes/miscellanea:misc.Mode4
ltx/en_us_dedes/oc.m4.d7:octrMA.AposGlory.text	@ltx/en_us_dedes/oc.m4.d7:ocMA.Aposticha4.text
ltx/en_us_dedes/oc.m4.d7:octrMA.AposTheotokion.incipit	@ltx/en_us_dedes/oc.m4.d7:ocMA.AposTheotokion.incipit
ltx/en_us_dedes/oc.m4.d7:octrMA.AposTheotokion.melody	@ltx/en_us_dedes/he.a.m4:heAU.EdokasSimeiosin.name
ltx/en_us_dedes/oc.m4.d7:octrMA.AposTheotokion.mode	@ltx/en_us_dedes/miscellanea:misc.Mode4
ltx/en_us_dedes/oc.m4.d7:octrMA.AposTheotokion.text	@ltx/en_us_dedes/oc.m4.d7:ocMA.AposTheotokion.text
ltx/en_us_dedes/oc.m4.d7:octrMA.Aposticha1.greekmelody	@ltx/en_us_dedes/he.a.m4:heAU.EdokasSimeiosin.greekname
ltx/en_us_dedes/oc.m4.d7:octrMA.Aposticha1.incipit	@ltx/en_us_dedes/oc.m4.d7:ocMA.Aposticha1.incipit
ltx/en_us_dedes/oc.m4.d7:octrMA.Aposticha1.melody	@ltx/en_us_dedes/he.a.m4:heAU.EdokasSimeiosin.name
ltx/en_us_dedes/oc.m4.d7:octrMA.Aposticha1.mode	@ltx/en_us_dedes/miscellanea:misc.Mode4
ltx/en_us_dedes/oc.m4.d7:octrMA.Aposticha1.text	@ltx/en_us_dedes/oc.m4.d7:ocMA.Aposticha1.text
ltx/en_us_dedes/oc.m4.d7:octrMA.Aposticha2.incipit	@ltx/en_us_dedes/oc.m4.d7:ocMA.Aposticha2.incipit
ltx/en_us_dedes/oc.m4.d7:octrMA.Aposticha2.melody	@ltx/en_us_dedes/he.a.m4:heAU.EdokasSimeiosin.name
ltx/en_us_dedes/oc.m4.d7:octrMA.Aposticha2.mode	@ltx/en_us_dedes/miscellanea:misc.Mode4
ltx/en_us_dedes/oc.m4.d7:octrMA.Aposticha2.text	@ltx/en_us_dedes/oc.m4.d7:ocMA.Aposticha2.text
ltx/en_us_dedes/oc.m4.d7:octrMA.Aposticha3.incipit	@ltx/en_us_dedes/oc.m4.d7:ocMA.Aposticha3.incipit
ltx/en_us_dedes/oc.m4.d7:octrMA.Aposticha3.melody	@ltx/en_us_dedes/he.a.m4:heAU.EdokasSimeiosin.name
ltx/en_us_dedes/oc.m4.d7:octrMA.Aposticha3.mode	@ltx/en_us_dedes/miscellanea:misc.Mode4
ltx/en_us_dedes/oc.m4.d7:octrMA.Aposticha3.text	@ltx/en_us_dedes/oc.m4.d7:ocMA.Aposticha3.text
ltx/en_us_dedes/oc.m4.d7:octrMA.Kathisma11.greekmelody	@ltx/en_us_dedes/he.a.m4:heAU.TachyProkatalave.greekname
ltx/en_us_dedes/oc.m4.d7:octrMA.Kathisma11.incipit	@ltx/en_us_dedes/oc.m4.d7:ocMA.Kathisma13.incipit
ltx/en_us_dedes/oc.m4.d7:octrMA.Kathisma11.melody	@ltx/en_us_dedes/he.a.m4:heAU.TachyProkatalave.name
ltx/en_us_dedes/oc.m4.d7:octrMA.Kathisma11.mode	@ltx/en_us_dedes/miscellanea:misc.Mode4
ltx/en_us_dedes/oc.m4.d7:octrMA.Kathisma11.text	@ltx/en_us_dedes/oc.m4.d7:ocMA.Kathisma13.text
ltx/en_us_dedes/oc.m4.d7:octrMA.Kathisma12.incipit	@ltx/en_us_dedes/oc.m4.d7:ocMA.Kathisma12.incipit
ltx/en_us_dedes/oc.m4.d7:octrMA.Kathisma12.melody	
ltx/en_us_dedes/oc.m4.d7:octrMA.Kathisma12.mode	@ltx/en_us_dedes/miscellanea:misc.Mode4
ltx/en_us_dedes/oc.m4.d7:octrMA.Kathisma12.text	@ltx/en_us_dedes/oc.m4.d7:ocMA.Kathisma12.text
ltx/en_us_dedes/oc.m4.d7:octrMA.Kathisma13.greekmelody	@ltx/en_us_dedes/he.a.m4:heAU.TachyProkatalave.greekname
ltx/en_us_dedes/oc.m4.d7:octrMA.Kathisma13.incipit	@ltx/en_us_dedes/oc.m4.d7:ocMA.Kathisma11.incipit
ltx/en_us_dedes/oc.m4.d7:octrMA.Kathisma13.melody	@ltx/en_us_dedes/he.a.m4:heAU.TachyProkatalave.name
ltx/en_us_dedes/oc.m4.d7:octrMA.Kathisma13.mode	@ltx/en_us_dedes/miscellanea:misc.Mode4
ltx/en_us_dedes/oc.m4.d7:octrMA.Kathisma13.text	@ltx/en_us_dedes/oc.m4.d7:ocMA.Kathisma11.text
ltx/en_us_dedes/oc.m4.d7:octrMA.Kathisma14.greekmelody	@ltx/en_us_dedes/he.a.m4:heAU.TachyProkatalave.greekname
ltx/en_us_dedes/oc.m4.d7:octrMA.Kathisma14.incipit	@ltx/en_us_dedes/oc.m4.d7:ocMA.Kathisma22.incipit
ltx/en_us_dedes/oc.m4.d7:octrMA.Kathisma14.melody	@ltx/en_us_dedes/he.a.m4:heAU.TachyProkatalave.name
ltx/en_us_dedes/oc.m4.d7:octrMA.Kathisma14.mode	@ltx/en_us_dedes/miscellanea:misc.Mode4
ltx/en_us_dedes/oc.m4.d7:octrMA.Kathisma14.text	@ltx/en_us_dedes/oc.m4.d7:ocMA.Kathisma22.text
ltx/en_us_dedes/oc.m4.d7:octrMA.Kathisma1T.incipit	@ltx/en_us_dedes/oc.m4.d7:ocVE.ApolTheotokionVM.incipit
ltx/en_us_dedes/oc.m4.d7:octrMA.Kathisma1T.melody	
ltx/en_us_dedes/oc.m4.d7:octrMA.Kathisma1T.mode	@ltx/en_us_dedes/miscellanea:misc.Mode4
ltx/en_us_dedes/oc.m4.d7:octrMA.Kathisma1T.text	@ltx/en_us_dedes/oc.m4.d7:ocVE.ApolTheotokionVM.text
ltx/en_us_dedes/oc.m4.d7:octrMA.Lauds1.incipit	@ltx/en_us_dedes/oc.m4.d2:ocMA.Aposticha3.incipit
ltx/en_us_dedes/oc.m4.d7:octrMA.Lauds1.melody	
ltx/en_us_dedes/oc.m4.d7:octrMA.Lauds1.mode	@ltx/en_us_dedes/miscellanea:misc.Mode4
ltx/en_us_dedes/oc.m4.d7:octrMA.Lauds1.text	@ltx/en_us_dedes/oc.m4.d2:ocMA.Aposticha3.text
ltx/en_us_dedes/oc.m4.d7:octrMA.Lauds2.incipit	@ltx/en_us_dedes/oc.m4.d7:ocMA.Lauds1.incipit
ltx/en_us_dedes/oc.m4.d7:octrMA.Lauds2.melody	
ltx/en_us_dedes/oc.m4.d7:octrMA.Lauds2.mode	@ltx/en_us_dedes/miscellanea:misc.Mode4
ltx/en_us_dedes/oc.m4.d7:octrMA.Lauds2.text	@ltx/en_us_dedes/oc.m4.d7:ocMA.Lauds1.text
ltx/en_us_dedes/oc.m4.d7:octrMA.Lauds3.incipit	@ltx/en_us_dedes/oc.m4.d7:ocMA.Lauds2.incipit
ltx/en_us_dedes/oc.m4.d7:octrMA.Lauds3.melody	
ltx/en_us_dedes/oc.m4.d7:octrMA.Lauds3.mode	@ltx/en_us_dedes/miscellanea:misc.Mode4
ltx/en_us_dedes/oc.m4.d7:octrMA.Lauds3.text	@ltx/en_us_dedes/oc.m4.d7:ocMA.Lauds2.text
ltx/en_us_dedes/oc.m4.d7:octrMA.Lauds4.incipit	@ltx/en_us_dedes/oc.m4.d7:ocMA.Lauds3.incipit
ltx/en_us_dedes/oc.m4.d7:octrMA.Lauds4.melody	
ltx/en_us_dedes/oc.m4.d7:octrMA.Lauds4.mode	@ltx/en_us_dedes/miscellanea:misc.Mode4
ltx/en_us_dedes/oc.m4.d7:octrMA.Lauds4.text	@ltx/en_us_dedes/oc.m4.d7:ocMA.Lauds3.text
ltx/en_us_dedes/oc.m4.d7:octrMA.LaudsGlory.incipit	@ltx/en_us_dedes/oc.m4.d7:ocMA.Lauds4.incipit
ltx/en_us_dedes/oc.m4.d7:octrMA.LaudsGlory.melody	
ltx/en_us_dedes/oc.m4.d7:octrMA.LaudsGlory.mode	@ltx/en_us_dedes/miscellanea:misc.Mode4
ltx/en_us_dedes/oc.m4.d7:octrMA.LaudsGlory.text	@ltx/en_us_dedes/oc.m4.d7:ocMA.Lauds4.text
ltx/en_us_dedes/oc.m4.d7:octrMA.LaudsTheotokion.incipit	@ltx/en_us_dedes/oc.m4.d7:ocVE.AposTheotokion.incipit
ltx/en_us_dedes/oc.m4.d7:octrMA.LaudsTheotokion.melody	
ltx/en_us_dedes/oc.m4.d7:octrMA.LaudsTheotokion.mode	@ltx/en_us_dedes/miscellanea:misc.Mode4
ltx/en_us_dedes/oc.m4.d7:octrMA.LaudsTheotokion.text	@ltx/en_us_dedes/oc.m4.d7:ocVE.AposTheotokion.text
ltx/en_us_dedes/oc.m4.d7:octrMA.Photogogic.incipit	@ltx/en_us_dedes/oc.m4.d2:octrMA.Photagogic.incipit
ltx/en_us_dedes/oc.m4.d7:octrMA.Photogogic.mode	@ltx/en_us_dedes/miscellanea:misc.Mode4
ltx/en_us_dedes/oc.m4.d7:octrMA.Photogogic.text	@ltx/en_us_dedes/oc.m4.d2:octrMA.Photagogic.text
ltx/en_us_dedes/oc.m4.d7:octrVE.SticBoth.incipit	@ltx/en_us_dedes/oc.m4.d7:ocVE.SticTheotokion.incipit
ltx/en_us_dedes/oc.m4.d7:octrVE.SticBoth.melody	
ltx/en_us_dedes/oc.m4.d7:octrVE.SticBoth.mode	@ltx/en_us_dedes/miscellanea:misc.Mode4
ltx/en_us_dedes/oc.m4.d7:octrVE.SticBoth.text	@ltx/en_us_dedes/oc.m4.d7:ocVE.SticTheotokion.text
ltx/en_us_dedes/oc.m4.d7:octrVE.SticGlory.incipit	@ltx/en_us_dedes/oc.m4.d7:ocMA.LaudsGlory.incipit
ltx/en_us_dedes/oc.m4.d7:octrVE.SticGlory.melody	
ltx/en_us_dedes/oc.m4.d7:octrVE.SticGlory.mode	@ltx/en_us_dedes/miscellanea:misc.Mode4
ltx/en_us_dedes/oc.m4.d7:octrVE.SticGlory.text	@ltx/en_us_dedes/oc.m4.d7:ocMA.LaudsGlory.text
ltx/en_us_dedes/oc.m4.d7:octrVE.Stichera1.incipit	@ltx/en_us_dedes/oc.m4.d2:ocVE.Aposticha3.incipit
ltx/en_us_dedes/oc.m4.d7:octrVE.Stichera1.melody	
ltx/en_us_dedes/oc.m4.d7:octrVE.Stichera1.mode	@ltx/en_us_dedes/miscellanea:misc.Mode4
ltx/en_us_dedes/oc.m4.d7:octrVE.Stichera1.text	@ltx/en_us_dedes/oc.m4.d2:ocVE.Aposticha3.text
ltx/en_us_dedes/oc.m4.d7:octrVE.Stichera2.incipit	@ltx/en_us_dedes/oc.m4.d7:ocVE.Aposticha1.incipit
ltx/en_us_dedes/oc.m4.d7:octrVE.Stichera2.melody	
ltx/en_us_dedes/oc.m4.d7:octrVE.Stichera2.mode	@ltx/en_us_dedes/miscellanea:misc.Mode4
ltx/en_us_dedes/oc.m4.d7:octrVE.Stichera2.text	@ltx/en_us_dedes/oc.m4.d7:ocVE.Aposticha1.text
ltx/en_us_dedes/oc.m4.d7:octrVE.Stichera3.incipit	@ltx/en_us_dedes/oc.m4.d7:ocVE.Aposticha2.incipit
ltx/en_us_dedes/oc.m4.d7:octrVE.Stichera3.melody	
ltx/en_us_dedes/oc.m4.d7:octrVE.Stichera3.mode	@ltx/en_us_dedes/miscellanea:misc.Mode4
ltx/en_us_dedes/oc.m4.d7:octrVE.Stichera3.text	@ltx/en_us_dedes/oc.m4.d7:ocVE.Aposticha2.text
ltx/en_us_dedes/oc.m4.d7:octrVE.Stichera4.incipit	@ltx/en_us_dedes/oc.m4.d7:ocVE.Aposticha3.incipit
ltx/en_us_dedes/oc.m4.d7:octrVE.Stichera4.melody	
ltx/en_us_dedes/oc.m4.d7:octrVE.Stichera4.mode	@ltx/en_us_dedes/miscellanea:misc.Mode4
ltx/en_us_dedes/oc.m4.d7:octrVE.Stichera4.text	@ltx/en_us_dedes/oc.m4.d7:ocVE.Aposticha3.text
