ltx/en_us_dedes/tr.d061:trCO.header	(Great)
ltx/en_us_dedes/tr.d061:trDA.commemoration.full	
ltx/en_us_dedes/tr.d061:trDA.commemoration.short	Thursday of the Sixth Week
ltx/en_us_dedes/tr.d061:trDA.insert1	
ltx/en_us_dedes/tr.d061:trDA.insert2	
ltx/en_us_dedes/tr.d061:trDA.note	
ltx/en_us_dedes/tr.d061:trDA.title	
ltx/en_us_dedes/tr.d061:trHO.commemorations	
ltx/en_us_dedes/tr.d061:trHO.daytitle	
ltx/en_us_dedes/tr.d061:trHO.description1	
ltx/en_us_dedes/tr.d061:trHO.description2	
ltx/en_us_dedes/tr.d061:trHO.note1	
ltx/en_us_dedes/tr.d061:trHO.note2	
ltx/en_us_dedes/tr.d061:trMA.AposIdiomelon1.incipit	…
ltx/en_us_dedes/tr.d061:trMA.AposIdiomelon1.melody	@ltx/en_us_dedes/miscellanea:misc.Idiomelon
ltx/en_us_dedes/tr.d061:trMA.AposIdiomelon1.mode	@ltx/en_us_dedes/miscellanea:misc.Mode5
ltx/en_us_dedes/tr.d061:trMA.AposIdiomelon1.text	
ltx/en_us_dedes/tr.d061:trMA.AposMartyric.incipit	@ltx/en_us_dedes/oc.m5.d5:ocMA.Aposticha3.incipit
ltx/en_us_dedes/tr.d061:trMA.AposMartyric.melody	
ltx/en_us_dedes/tr.d061:trMA.AposMartyric.mode	@ltx/en_us_dedes/miscellanea:misc.Mode5
ltx/en_us_dedes/tr.d061:trMA.AposMartyric.text	@ltx/en_us_dedes/oc.m5.d5:ocMA.Aposticha3.text
ltx/en_us_dedes/tr.d061:trMA.AposTheotokion.incipit	@ltx/en_us_dedes/oc.m5.d5:ocMA.AposTheotokion.incipit
ltx/en_us_dedes/tr.d061:trMA.AposTheotokion.melody	
ltx/en_us_dedes/tr.d061:trMA.AposTheotokion.mode	@ltx/en_us_dedes/miscellanea:misc.Mode5
ltx/en_us_dedes/tr.d061:trMA.AposTheotokion.text	@ltx/en_us_dedes/oc.m5.d5:ocMA.AposTheotokion.text
ltx/en_us_dedes/tr.d061:trMA.C1.poet	
ltx/en_us_dedes/tr.d061:trMA.C2.poet	@ltx/en_us_dedes/poets:po.Theodorou
ltx/en_us_dedes/tr.d061:trMA.Kathisma21.greekmelody	@ltx/en_us_dedes/he.a.m5:heAU.TonSynanarchonLogon.greekname
ltx/en_us_dedes/tr.d061:trMA.Kathisma21.incipit	…
ltx/en_us_dedes/tr.d061:trMA.Kathisma21.melody	@ltx/en_us_dedes/he.a.m5:heAU.TonSynanarchonLogon.name
ltx/en_us_dedes/tr.d061:trMA.Kathisma21.mode	@ltx/en_us_dedes/miscellanea:misc.Mode5
ltx/en_us_dedes/tr.d061:trMA.Kathisma21.text	
ltx/en_us_dedes/tr.d061:trMA.Kathisma22.greekmelody	@ltx/en_us_dedes/he.a.m5:heAU.TonSynanarchonLogon.greekname
ltx/en_us_dedes/tr.d061:trMA.Kathisma22.incipit	…
ltx/en_us_dedes/tr.d061:trMA.Kathisma22.melody	@ltx/en_us_dedes/he.a.m5:heAU.TonSynanarchonLogon.name
ltx/en_us_dedes/tr.d061:trMA.Kathisma22.mode	@ltx/en_us_dedes/miscellanea:misc.Mode5
ltx/en_us_dedes/tr.d061:trMA.Kathisma22.text	
ltx/en_us_dedes/tr.d061:trMA.Kathisma31.greekmelody	@ltx/en_us_dedes/he.a.m6:heAU.AngelikaiDynameis.greekname
ltx/en_us_dedes/tr.d061:trMA.Kathisma31.incipit	…
ltx/en_us_dedes/tr.d061:trMA.Kathisma31.melody	@ltx/en_us_dedes/he.a.m6:heAU.AngelikaiDynameis.name
ltx/en_us_dedes/tr.d061:trMA.Kathisma31.mode	@ltx/en_us_dedes/miscellanea:misc.Mode6
ltx/en_us_dedes/tr.d061:trMA.Kathisma31.text	
ltx/en_us_dedes/tr.d061:trMA.Kathisma32.greekmelody	@ltx/en_us_dedes/he.a.m6:heAU.ElpisTouKosmouAgathi.greekname
ltx/en_us_dedes/tr.d061:trMA.Kathisma32.incipit	…
ltx/en_us_dedes/tr.d061:trMA.Kathisma32.melody	@ltx/en_us_dedes/he.a.m6:heAU.ElpisTouKosmouAgathi.name
ltx/en_us_dedes/tr.d061:trMA.Kathisma32.mode	@ltx/en_us_dedes/miscellanea:misc.Mode6
ltx/en_us_dedes/tr.d061:trMA.Kathisma32.text	
ltx/en_us_dedes/tr.d061:trMA.Ode4C11.greekmelody	@ltx/en_us_dedes/he.h.m5:heHE.TinTheianEnnoisas.greekname
ltx/en_us_dedes/tr.d061:trMA.Ode4C11.incipit	…
ltx/en_us_dedes/tr.d061:trMA.Ode4C11.melody	@ltx/en_us_dedes/he.h.m5:heHE.TinTheianEnnoisas.name
ltx/en_us_dedes/tr.d061:trMA.Ode4C11.mode	@ltx/en_us_dedes/miscellanea:misc.Mode5
ltx/en_us_dedes/tr.d061:trMA.Ode4C11.ode	@ltx/en_us_dedes/miscellanea:misc.Ode4
ltx/en_us_dedes/tr.d061:trMA.Ode4C11.text	
ltx/en_us_dedes/tr.d061:trMA.Ode4C12.incipit	…
ltx/en_us_dedes/tr.d061:trMA.Ode4C12.melody	@ltx/en_us_dedes/he.h.m5:heHE.TinTheianEnnoisas.name
ltx/en_us_dedes/tr.d061:trMA.Ode4C12.mode	@ltx/en_us_dedes/miscellanea:misc.Mode5
ltx/en_us_dedes/tr.d061:trMA.Ode4C12.ode	@ltx/en_us_dedes/miscellanea:misc.Ode4
ltx/en_us_dedes/tr.d061:trMA.Ode4C12.text	
ltx/en_us_dedes/tr.d061:trMA.Ode4C13.incipit	…
ltx/en_us_dedes/tr.d061:trMA.Ode4C13.melody	@ltx/en_us_dedes/he.h.m5:heHE.TinTheianEnnoisas.name
ltx/en_us_dedes/tr.d061:trMA.Ode4C13.mode	@ltx/en_us_dedes/miscellanea:misc.Mode5
ltx/en_us_dedes/tr.d061:trMA.Ode4C13.ode	@ltx/en_us_dedes/miscellanea:misc.Ode4
ltx/en_us_dedes/tr.d061:trMA.Ode4C13.text	
ltx/en_us_dedes/tr.d061:trMA.Ode4C14.incipit	…
ltx/en_us_dedes/tr.d061:trMA.Ode4C14.melody	@ltx/en_us_dedes/he.h.m5:heHE.TinTheianEnnoisas.name
ltx/en_us_dedes/tr.d061:trMA.Ode4C14.mode	@ltx/en_us_dedes/miscellanea:misc.Mode5
ltx/en_us_dedes/tr.d061:trMA.Ode4C14.ode	@ltx/en_us_dedes/miscellanea:misc.Ode4
ltx/en_us_dedes/tr.d061:trMA.Ode4C14.text	
ltx/en_us_dedes/tr.d061:trMA.Ode4C1T.incipit	…
ltx/en_us_dedes/tr.d061:trMA.Ode4C1T.melody	@ltx/en_us_dedes/he.h.m5:heHE.TinTheianEnnoisas.name
ltx/en_us_dedes/tr.d061:trMA.Ode4C1T.mode	@ltx/en_us_dedes/miscellanea:misc.Mode5
ltx/en_us_dedes/tr.d061:trMA.Ode4C1T.ode	@ltx/en_us_dedes/miscellanea:misc.Ode4
ltx/en_us_dedes/tr.d061:trMA.Ode4C1T.text	
ltx/en_us_dedes/tr.d061:trMA.Ode4C21.greekmelody	@ltx/en_us_dedes/he.h.m6:heHE.AkikoaKyrieTinAkoin.greekname
ltx/en_us_dedes/tr.d061:trMA.Ode4C21.incipit	…
ltx/en_us_dedes/tr.d061:trMA.Ode4C21.melody	@ltx/en_us_dedes/he.h.m6:heHE.AkikoaKyrieTinAkoin.name
ltx/en_us_dedes/tr.d061:trMA.Ode4C21.mode	@ltx/en_us_dedes/miscellanea:misc.Mode6
ltx/en_us_dedes/tr.d061:trMA.Ode4C21.ode	@ltx/en_us_dedes/miscellanea:misc.Ode4
ltx/en_us_dedes/tr.d061:trMA.Ode4C21.text	
ltx/en_us_dedes/tr.d061:trMA.Ode4C22.incipit	…
ltx/en_us_dedes/tr.d061:trMA.Ode4C22.melody	@ltx/en_us_dedes/he.h.m6:heHE.AkikoaKyrieTinAkoin.name
ltx/en_us_dedes/tr.d061:trMA.Ode4C22.mode	@ltx/en_us_dedes/miscellanea:misc.Mode6
ltx/en_us_dedes/tr.d061:trMA.Ode4C22.ode	@ltx/en_us_dedes/miscellanea:misc.Ode4
ltx/en_us_dedes/tr.d061:trMA.Ode4C22.text	
ltx/en_us_dedes/tr.d061:trMA.Ode4C2A1.incipit	…
ltx/en_us_dedes/tr.d061:trMA.Ode4C2A1.melody	@ltx/en_us_dedes/he.h.m6:heHE.AkikoaKyrieTinAkoin.name
ltx/en_us_dedes/tr.d061:trMA.Ode4C2A1.mode	@ltx/en_us_dedes/miscellanea:misc.Mode6
ltx/en_us_dedes/tr.d061:trMA.Ode4C2A1.ode	@ltx/en_us_dedes/miscellanea:misc.Ode4
ltx/en_us_dedes/tr.d061:trMA.Ode4C2A1.text	
ltx/en_us_dedes/tr.d061:trMA.Ode4C2H.greekmelody	@ltx/en_us_dedes/he.h.m6:heHE.AkikoaKyrieTinAkoin.greekname
ltx/en_us_dedes/tr.d061:trMA.Ode4C2H.incipit	@ltx/en_us_dedes/he.h.m6:heHE.AkikoaKyrieTinAkoin.incipit
ltx/en_us_dedes/tr.d061:trMA.Ode4C2H.melody	@ltx/en_us_dedes/he.h.m6:heHE.AkikoaKyrieTinAkoin.melody
ltx/en_us_dedes/tr.d061:trMA.Ode4C2H.mode	@ltx/en_us_dedes/miscellanea:misc.Mode6
ltx/en_us_dedes/tr.d061:trMA.Ode4C2H.ode	@ltx/en_us_dedes/miscellanea:misc.Ode4
ltx/en_us_dedes/tr.d061:trMA.Ode4C2H.text	@ltx/en_us_dedes/he.h.m6:heHE.AkikoaKyrieTinAkoin.text
ltx/en_us_dedes/tr.d061:trMA.Ode4C2T.incipit	…
ltx/en_us_dedes/tr.d061:trMA.Ode4C2T.melody	@ltx/en_us_dedes/he.h.m6:heHE.AkikoaKyrieTinAkoin.name
ltx/en_us_dedes/tr.d061:trMA.Ode4C2T.mode	@ltx/en_us_dedes/miscellanea:misc.Mode6
ltx/en_us_dedes/tr.d061:trMA.Ode4C2T.ode	@ltx/en_us_dedes/miscellanea:misc.Ode4
ltx/en_us_dedes/tr.d061:trMA.Ode4C2T.text	
ltx/en_us_dedes/tr.d061:trMA.Ode4C2Tr.incipit	…
ltx/en_us_dedes/tr.d061:trMA.Ode4C2Tr.melody	@ltx/en_us_dedes/he.h.m6:heHE.AkikoaKyrieTinAkoin.name
ltx/en_us_dedes/tr.d061:trMA.Ode4C2Tr.mode	@ltx/en_us_dedes/miscellanea:misc.Mode6
ltx/en_us_dedes/tr.d061:trMA.Ode4C2Tr.ode	@ltx/en_us_dedes/miscellanea:misc.Ode4
ltx/en_us_dedes/tr.d061:trMA.Ode4C2Tr.text	
ltx/en_us_dedes/tr.d061:trMA.Ode8C11.greekmelody	@ltx/en_us_dedes/he.h.m5:heHE.SoiToPantourgo.greekname
ltx/en_us_dedes/tr.d061:trMA.Ode8C11.incipit	…
ltx/en_us_dedes/tr.d061:trMA.Ode8C11.melody	@ltx/en_us_dedes/he.h.m5:heHE.SoiToPantourgo.name
ltx/en_us_dedes/tr.d061:trMA.Ode8C11.mode	@ltx/en_us_dedes/miscellanea:misc.Mode5
ltx/en_us_dedes/tr.d061:trMA.Ode8C11.ode	@ltx/en_us_dedes/miscellanea:misc.Ode8
ltx/en_us_dedes/tr.d061:trMA.Ode8C11.text	
ltx/en_us_dedes/tr.d061:trMA.Ode8C12.incipit	…
ltx/en_us_dedes/tr.d061:trMA.Ode8C12.melody	@ltx/en_us_dedes/he.h.m5:heHE.SoiToPantourgo.name
ltx/en_us_dedes/tr.d061:trMA.Ode8C12.mode	@ltx/en_us_dedes/miscellanea:misc.Mode5
ltx/en_us_dedes/tr.d061:trMA.Ode8C12.ode	@ltx/en_us_dedes/miscellanea:misc.Ode8
ltx/en_us_dedes/tr.d061:trMA.Ode8C12.text	
ltx/en_us_dedes/tr.d061:trMA.Ode8C13.incipit	…
ltx/en_us_dedes/tr.d061:trMA.Ode8C13.melody	@ltx/en_us_dedes/he.h.m5:heHE.SoiToPantourgo.name
ltx/en_us_dedes/tr.d061:trMA.Ode8C13.mode	@ltx/en_us_dedes/miscellanea:misc.Mode5
ltx/en_us_dedes/tr.d061:trMA.Ode8C13.ode	@ltx/en_us_dedes/miscellanea:misc.Ode8
ltx/en_us_dedes/tr.d061:trMA.Ode8C13.text	
ltx/en_us_dedes/tr.d061:trMA.Ode8C1T.incipit	…
ltx/en_us_dedes/tr.d061:trMA.Ode8C1T.melody	@ltx/en_us_dedes/he.h.m5:heHE.SoiToPantourgo.name
ltx/en_us_dedes/tr.d061:trMA.Ode8C1T.mode	@ltx/en_us_dedes/miscellanea:misc.Mode5
ltx/en_us_dedes/tr.d061:trMA.Ode8C1T.ode	@ltx/en_us_dedes/miscellanea:misc.Ode8
ltx/en_us_dedes/tr.d061:trMA.Ode8C1T.text	
ltx/en_us_dedes/tr.d061:trMA.Ode8C21.greekmelody	@ltx/en_us_dedes/he.h.m6:heHE.OiOsioiSouPaides.greekname
ltx/en_us_dedes/tr.d061:trMA.Ode8C21.incipit	…
ltx/en_us_dedes/tr.d061:trMA.Ode8C21.melody	@ltx/en_us_dedes/he.h.m6:heHE.OiOsioiSouPaides.name
ltx/en_us_dedes/tr.d061:trMA.Ode8C21.mode	@ltx/en_us_dedes/miscellanea:misc.Mode6
ltx/en_us_dedes/tr.d061:trMA.Ode8C21.ode	@ltx/en_us_dedes/miscellanea:misc.Ode8
ltx/en_us_dedes/tr.d061:trMA.Ode8C21.text	
ltx/en_us_dedes/tr.d061:trMA.Ode8C22.incipit	…
ltx/en_us_dedes/tr.d061:trMA.Ode8C22.melody	@ltx/en_us_dedes/he.h.m6:heHE.OiOsioiSouPaides.name
ltx/en_us_dedes/tr.d061:trMA.Ode8C22.mode	@ltx/en_us_dedes/miscellanea:misc.Mode6
ltx/en_us_dedes/tr.d061:trMA.Ode8C22.ode	@ltx/en_us_dedes/miscellanea:misc.Ode8
ltx/en_us_dedes/tr.d061:trMA.Ode8C22.text	
ltx/en_us_dedes/tr.d061:trMA.Ode8C2A1.incipit	…
ltx/en_us_dedes/tr.d061:trMA.Ode8C2A1.melody	@ltx/en_us_dedes/he.h.m6:heHE.OiOsioiSouPaides.name
ltx/en_us_dedes/tr.d061:trMA.Ode8C2A1.mode	@ltx/en_us_dedes/miscellanea:misc.Mode6
ltx/en_us_dedes/tr.d061:trMA.Ode8C2A1.ode	@ltx/en_us_dedes/miscellanea:misc.Ode8
ltx/en_us_dedes/tr.d061:trMA.Ode8C2A1.text	
ltx/en_us_dedes/tr.d061:trMA.Ode8C2H.greekmelody	@ltx/en_us_dedes/he.h.m6:heHE.OiOsioiSouPaides.greekname
ltx/en_us_dedes/tr.d061:trMA.Ode8C2H.incipit	@ltx/en_us_dedes/he.h.m6:heHE.OiOsioiSouPaides.incipit
ltx/en_us_dedes/tr.d061:trMA.Ode8C2H.melody	@ltx/en_us_dedes/he.h.m6:heHE.OiOsioiSouPaides.melody
ltx/en_us_dedes/tr.d061:trMA.Ode8C2H.mode	@ltx/en_us_dedes/miscellanea:misc.Mode6
ltx/en_us_dedes/tr.d061:trMA.Ode8C2H.ode	@ltx/en_us_dedes/miscellanea:misc.Ode8
ltx/en_us_dedes/tr.d061:trMA.Ode8C2H.text	@ltx/en_us_dedes/he.h.m6:heHE.OiOsioiSouPaides.text
ltx/en_us_dedes/tr.d061:trMA.Ode8C2T.incipit	…
ltx/en_us_dedes/tr.d061:trMA.Ode8C2T.melody	@ltx/en_us_dedes/he.h.m6:heHE.OiOsioiSouPaides.name
ltx/en_us_dedes/tr.d061:trMA.Ode8C2T.mode	@ltx/en_us_dedes/miscellanea:misc.Mode6
ltx/en_us_dedes/tr.d061:trMA.Ode8C2T.ode	@ltx/en_us_dedes/miscellanea:misc.Ode8
ltx/en_us_dedes/tr.d061:trMA.Ode8C2T.text	
ltx/en_us_dedes/tr.d061:trMA.Ode8C2Tr.incipit	…
ltx/en_us_dedes/tr.d061:trMA.Ode8C2Tr.melody	@ltx/en_us_dedes/he.h.m6:heHE.OiOsioiSouPaides.name
ltx/en_us_dedes/tr.d061:trMA.Ode8C2Tr.mode	@ltx/en_us_dedes/miscellanea:misc.Mode6
ltx/en_us_dedes/tr.d061:trMA.Ode8C2Tr.ode	@ltx/en_us_dedes/miscellanea:misc.Ode8
ltx/en_us_dedes/tr.d061:trMA.Ode8C2Tr.text	
ltx/en_us_dedes/tr.d061:trMA.Ode9C11.greekmelody	@ltx/en_us_dedes/he.h.m5:heHE.IsaiaChoreve.greekname
ltx/en_us_dedes/tr.d061:trMA.Ode9C11.incipit	…
ltx/en_us_dedes/tr.d061:trMA.Ode9C11.melody	@ltx/en_us_dedes/he.h.m5:heHE.IsaiaChoreve.name
ltx/en_us_dedes/tr.d061:trMA.Ode9C11.mode	@ltx/en_us_dedes/miscellanea:misc.Mode5
ltx/en_us_dedes/tr.d061:trMA.Ode9C11.ode	@ltx/en_us_dedes/miscellanea:misc.Ode9
ltx/en_us_dedes/tr.d061:trMA.Ode9C11.text	
ltx/en_us_dedes/tr.d061:trMA.Ode9C12.incipit	…
ltx/en_us_dedes/tr.d061:trMA.Ode9C12.melody	@ltx/en_us_dedes/he.h.m5:heHE.IsaiaChoreve.name
ltx/en_us_dedes/tr.d061:trMA.Ode9C12.mode	@ltx/en_us_dedes/miscellanea:misc.Mode5
ltx/en_us_dedes/tr.d061:trMA.Ode9C12.ode	@ltx/en_us_dedes/miscellanea:misc.Ode9
ltx/en_us_dedes/tr.d061:trMA.Ode9C12.text	
ltx/en_us_dedes/tr.d061:trMA.Ode9C13.incipit	…
ltx/en_us_dedes/tr.d061:trMA.Ode9C13.melody	@ltx/en_us_dedes/he.h.m5:heHE.IsaiaChoreve.name
ltx/en_us_dedes/tr.d061:trMA.Ode9C13.mode	@ltx/en_us_dedes/miscellanea:misc.Mode5
ltx/en_us_dedes/tr.d061:trMA.Ode9C13.ode	@ltx/en_us_dedes/miscellanea:misc.Ode9
ltx/en_us_dedes/tr.d061:trMA.Ode9C13.text	
ltx/en_us_dedes/tr.d061:trMA.Ode9C1T.incipit	…
ltx/en_us_dedes/tr.d061:trMA.Ode9C1T.melody	@ltx/en_us_dedes/he.h.m5:heHE.IsaiaChoreve.name
ltx/en_us_dedes/tr.d061:trMA.Ode9C1T.mode	@ltx/en_us_dedes/miscellanea:misc.Mode5
ltx/en_us_dedes/tr.d061:trMA.Ode9C1T.ode	@ltx/en_us_dedes/miscellanea:misc.Ode9
ltx/en_us_dedes/tr.d061:trMA.Ode9C1T.text	
ltx/en_us_dedes/tr.d061:trMA.Ode9C21.greekmelody	@ltx/en_us_dedes/he.h.m6:heHE.AsporouSyllipseos.greekname
ltx/en_us_dedes/tr.d061:trMA.Ode9C21.incipit	…
ltx/en_us_dedes/tr.d061:trMA.Ode9C21.melody	@ltx/en_us_dedes/he.h.m6:heHE.AsporouSyllipseos.name
ltx/en_us_dedes/tr.d061:trMA.Ode9C21.mode	@ltx/en_us_dedes/miscellanea:misc.Mode6
ltx/en_us_dedes/tr.d061:trMA.Ode9C21.ode	@ltx/en_us_dedes/miscellanea:misc.Ode9
ltx/en_us_dedes/tr.d061:trMA.Ode9C21.text	
ltx/en_us_dedes/tr.d061:trMA.Ode9C22.incipit	…
ltx/en_us_dedes/tr.d061:trMA.Ode9C22.melody	@ltx/en_us_dedes/he.h.m6:heHE.AsporouSyllipseos.name
ltx/en_us_dedes/tr.d061:trMA.Ode9C22.mode	@ltx/en_us_dedes/miscellanea:misc.Mode6
ltx/en_us_dedes/tr.d061:trMA.Ode9C22.ode	@ltx/en_us_dedes/miscellanea:misc.Ode9
ltx/en_us_dedes/tr.d061:trMA.Ode9C22.text	
ltx/en_us_dedes/tr.d061:trMA.Ode9C2A1.incipit	…
ltx/en_us_dedes/tr.d061:trMA.Ode9C2A1.melody	@ltx/en_us_dedes/he.h.m6:heHE.AsporouSyllipseos.name
ltx/en_us_dedes/tr.d061:trMA.Ode9C2A1.mode	@ltx/en_us_dedes/miscellanea:misc.Mode6
ltx/en_us_dedes/tr.d061:trMA.Ode9C2A1.ode	@ltx/en_us_dedes/miscellanea:misc.Ode9
ltx/en_us_dedes/tr.d061:trMA.Ode9C2A1.text	
ltx/en_us_dedes/tr.d061:trMA.Ode9C2H.greekmelody	@ltx/en_us_dedes/he.h.m6:heHE.AsporouSyllipseos.greekname
ltx/en_us_dedes/tr.d061:trMA.Ode9C2H.incipit	@ltx/en_us_dedes/he.h.m6:heHE.AsporouSyllipseos.incipit
ltx/en_us_dedes/tr.d061:trMA.Ode9C2H.melody	@ltx/en_us_dedes/he.h.m6:heHE.AsporouSyllipseos.melody
ltx/en_us_dedes/tr.d061:trMA.Ode9C2H.mode	@ltx/en_us_dedes/miscellanea:misc.Mode6
ltx/en_us_dedes/tr.d061:trMA.Ode9C2H.ode	@ltx/en_us_dedes/miscellanea:misc.Ode9
ltx/en_us_dedes/tr.d061:trMA.Ode9C2H.text	@ltx/en_us_dedes/he.h.m6:heHE.AsporouSyllipseos.text
ltx/en_us_dedes/tr.d061:trMA.Ode9C2T.incipit	…
ltx/en_us_dedes/tr.d061:trMA.Ode9C2T.melody	@ltx/en_us_dedes/he.h.m6:heHE.AsporouSyllipseos.name
ltx/en_us_dedes/tr.d061:trMA.Ode9C2T.mode	@ltx/en_us_dedes/miscellanea:misc.Mode6
ltx/en_us_dedes/tr.d061:trMA.Ode9C2T.ode	@ltx/en_us_dedes/miscellanea:misc.Ode9
ltx/en_us_dedes/tr.d061:trMA.Ode9C2T.text	
ltx/en_us_dedes/tr.d061:trMA.Ode9C2Tr.incipit	…
ltx/en_us_dedes/tr.d061:trMA.Ode9C2Tr.melody	@ltx/en_us_dedes/he.h.m6:heHE.AsporouSyllipseos.name
ltx/en_us_dedes/tr.d061:trMA.Ode9C2Tr.mode	@ltx/en_us_dedes/miscellanea:misc.Mode6
ltx/en_us_dedes/tr.d061:trMA.Ode9C2Tr.ode	@ltx/en_us_dedes/miscellanea:misc.Ode9
ltx/en_us_dedes/tr.d061:trMA.Ode9C2Tr.text	
ltx/en_us_dedes/tr.d061:trTE.Troparion.incipit	…
ltx/en_us_dedes/tr.d061:trTE.Troparion.melody	
ltx/en_us_dedes/tr.d061:trTE.Troparion.mode	@ltx/en_us_dedes/miscellanea:misc.Mode1
ltx/en_us_dedes/tr.d061:trTE.Troparion.text	
ltx/en_us_dedes/tr.d061:trVE.AposIdiomelon1.incipit	Rich am I in passions…
ltx/en_us_dedes/tr.d061:trVE.AposIdiomelon1.melody	
ltx/en_us_dedes/tr.d061:trVE.AposIdiomelon1.mode	@ltx/en_us_dedes/miscellanea:misc.Mode5
ltx/en_us_dedes/tr.d061:trVE.AposIdiomelon1.text	Rich am I in passions and clothed in the deceptive robe of hypocrisy, feasting in the evils of self-indulgence. I display immense lack of compassion, for I have neglected my spiritual mind, which lies at the gate of repentance, famished of anything good, and sick with inattention. But now I pray You, Lord, make me like Lazarus, to be poor in sins, lest I be denied when I pray that a finger cool my burning tongue, in unquenchable fire; and make me dwell in the bosom of Abraham, as You are benevolent.
ltx/en_us_dedes/tr.d061:trVE.AposMartyric.incipit	@ltx/en_us_dedes/oc.m5.d5:ocVE.Aposticha3.incipit
ltx/en_us_dedes/tr.d061:trVE.AposMartyric.melody	
ltx/en_us_dedes/tr.d061:trVE.AposMartyric.mode	@ltx/en_us_dedes/miscellanea:misc.Mode5
ltx/en_us_dedes/tr.d061:trVE.AposMartyric.text	@ltx/en_us_dedes/oc.m5.d5:ocVE.Aposticha3.text
ltx/en_us_dedes/tr.d061:trVE.Stichera01.greekmelody	@ltx/en_us_dedes/he.a.m5:heAU.ChairoisAskitikon.greekname
ltx/en_us_dedes/tr.d061:trVE.Stichera01.incipit	Jesus, across the Jordan you…
ltx/en_us_dedes/tr.d061:trVE.Stichera01.melody	@ltx/en_us_dedes/he.a.m5:heAU.ChairoisAskitikon.name
ltx/en_us_dedes/tr.d061:trVE.Stichera01.mode	@ltx/en_us_dedes/miscellanea:misc.Mode5
ltx/en_us_dedes/tr.d061:trVE.Stichera01.text	Jesus, across the Jordan you went; * as man You stayed there; * then you said to Your followers, * “Our friend Lazarus has fallen * asleep, in fact he has died, * and he has been buried and laid in a tomb. * My friends, I am glad for you, * for through this you will surely learn * that I have not ceased * being God knowing everything, * although visibly I appear to be just a man. * So let us go and bring him back * to life, so that in this way * death might experience fully * its own defeat and might clearly feel * the total destruction * which I shall effect, while granting great mercy to the world.”
ltx/en_us_dedes/tr.d061:trVE.Stichera02.greekmelody	@ltx/en_us_dedes/he.a.m5:heAU.ChairoisAskitikon.greekname
ltx/en_us_dedes/tr.d061:trVE.Stichera02.incipit	Faithful, come let us imitate…
ltx/en_us_dedes/tr.d061:trVE.Stichera02.melody	@ltx/en_us_dedes/he.a.m5:heAU.ChairoisAskitikon.name
ltx/en_us_dedes/tr.d061:trVE.Stichera02.mode	@ltx/en_us_dedes/miscellanea:misc.Mode5
ltx/en_us_dedes/tr.d061:trVE.Stichera02.text	Faithful, come let us imitate * Martha and Mary, * and dispatch as our messengers * to Christ godly deeds and actions, * so that He come now to us * and resurrect our minds, which * grievously lie dead, * inert as if in a tomb * of neglect and of carelessness, * wholly unfeeling, * with no sense of the fear of God, * and not having in them the life-giving energy. * Let us cry out to Him and say, * “Compassionate Lord, behold, * and as You once resurrected * of old Your friend, righteous Lazarus, * by Your awesome power, * so now vivify us, granting great mercy to us all.”
ltx/en_us_dedes/tr.d061:trVE.Stichera03.incipit	Lazarus has now been in…
ltx/en_us_dedes/tr.d061:trVE.Stichera03.melody	@ltx/en_us_dedes/miscellanea:misc.NotMetered
ltx/en_us_dedes/tr.d061:trVE.Stichera03.mode	@ltx/en_us_dedes/miscellanea:misc.Mode6
ltx/en_us_dedes/tr.d061:trVE.Stichera03.text	Lazarus has now been in the tomb for two days. He sees the dead from the beginning of time. He gazes at strange and frightening sights, at a countless multitude being held prisoner in the bonds of Hades. Therefore do his sisters lament bitterly, as they look at his tomb. But Christ is coming to bring His friend back to life, so that with one voice everyone might say: “Blessed are You, O Savior! Have mercy on us.”
ltx/en_us_dedes/tr.d061:trVL.header	Presanctified Liturgy on Wednesday of the Sixth Week
