ltx/en_us_dedes/sy.m12.d12:syMA.commemoration01.couplet1.title	@ltx/en_us_dedes/titles:ti.Verses
ltx/en_us_dedes/sy.m12.d12:syMA.commemoration01.couplet1.verse1	
ltx/en_us_dedes/sy.m12.d12:syMA.commemoration01.couplet1.verse2	
ltx/en_us_dedes/sy.m12.d12:syMA.commemoration01.narration.p01	
ltx/en_us_dedes/sy.m12.d12:syMA.commemoration01.narration.p02	
ltx/en_us_dedes/sy.m12.d12:syMA.commemoration01.narration.p03	
ltx/en_us_dedes/sy.m12.d12:syMA.commemoration01.narration.p04	
ltx/en_us_dedes/sy.m12.d12:syMA.commemoration01.narration.p05	
ltx/en_us_dedes/sy.m12.d12:syMA.commemoration01.single1	
ltx/en_us_dedes/sy.m12.d12:syMA.commemoration01.text	On December 12 we commemorate our devout Father Spyridon the Wonder-worker, Bishop of Trimythous.
ltx/en_us_dedes/sy.m12.d12:syMA.commemoration02.couplet1.title	@ltx/en_us_dedes/titles:ti.Verses
ltx/en_us_dedes/sy.m12.d12:syMA.commemoration02.couplet1.verse1	
ltx/en_us_dedes/sy.m12.d12:syMA.commemoration02.couplet1.verse2	
ltx/en_us_dedes/sy.m12.d12:syMA.commemoration02.narration.p01	
ltx/en_us_dedes/sy.m12.d12:syMA.commemoration02.text	On this day we also commemorate the holy Martyr Synetos.
ltx/en_us_dedes/sy.m12.d12:syMA.commemoration03.couplet1.title	@ltx/en_us_dedes/titles:ti.Verses
ltx/en_us_dedes/sy.m12.d12:syMA.commemoration03.couplet1.verse1	
ltx/en_us_dedes/sy.m12.d12:syMA.commemoration03.couplet1.verse2	
ltx/en_us_dedes/sy.m12.d12:syMA.commemoration03.narration.p01	
ltx/en_us_dedes/sy.m12.d12:syMA.commemoration03.narration.p02	
ltx/en_us_dedes/sy.m12.d12:syMA.commemoration03.text	On this day we also commemorate our father among the saints Alexander Archbishop of Jerusalem, the Hieromartyr.
ltx/en_us_dedes/sy.m12.d12:syMA.commemoration04.couplet1.title	@ltx/en_us_dedes/titles:ti.Verses
ltx/en_us_dedes/sy.m12.d12:syMA.commemoration04.couplet1.verse1	
ltx/en_us_dedes/sy.m12.d12:syMA.commemoration04.couplet1.verse2	
ltx/en_us_dedes/sy.m12.d12:syMA.commemoration04.couplet2.verse1	
ltx/en_us_dedes/sy.m12.d12:syMA.commemoration04.text	On this day we also commemorate our devout fathers Amonathas and Anthos.
ltx/en_us_dedes/sy.m12.d12:syMA.lastline	By their holy intercessions, O God, have mercy on us and save us. Amen.
