ltx/en_us_dedes/ty.m01.d12:tyCommemoration.text	
ltx/en_us_dedes/ty.m01.d12:tyDate.text	
ltx/en_us_dedes/ty.m01.d12:tyLI.AfterCommunion.text	
ltx/en_us_dedes/ty.m01.d12:tyLI.AmboPrayer.text	
ltx/en_us_dedes/ty.m01.d12:tyLI.Antiphons.text	
ltx/en_us_dedes/ty.m01.d12:tyLI.Apolytikia.text	
ltx/en_us_dedes/ty.m01.d12:tyLI.CommunionHymn.text	
ltx/en_us_dedes/ty.m01.d12:tyLI.Dismissal.text	
ltx/en_us_dedes/ty.m01.d12:tyLI.EntranceHymn.text	
ltx/en_us_dedes/ty.m01.d12:tyLI.Epistle.text	
ltx/en_us_dedes/ty.m01.d12:tyLI.Gospel.text	
ltx/en_us_dedes/ty.m01.d12:tyLI.Kontakion.text	
ltx/en_us_dedes/ty.m01.d12:tyLI.Megalynarion.text	
ltx/en_us_dedes/ty.m01.d12:tyLI.TheotokosHymn.text	
ltx/en_us_dedes/ty.m01.d12:tyMA.Anavathmoi.text	
ltx/en_us_dedes/ty.m01.d12:tyMA.Apolytikia.text	
ltx/en_us_dedes/ty.m01.d12:tyMA.Canons.text	
ltx/en_us_dedes/ty.m01.d12:tyMA.Doxology.text	
ltx/en_us_dedes/ty.m01.d12:tyMA.EndApolytikion.text	
ltx/en_us_dedes/ty.m01.d12:tyMA.Exaposteilaria.text	
ltx/en_us_dedes/ty.m01.d12:tyMA.Katavasias.text	
ltx/en_us_dedes/ty.m01.d12:tyMA.Kathismata.text	
ltx/en_us_dedes/ty.m01.d12:tyMA.KontakionOikos.text	
ltx/en_us_dedes/ty.m01.d12:tyMA.Lauds.text	
ltx/en_us_dedes/ty.m01.d12:tyMA.LaudsBoth.text	
ltx/en_us_dedes/ty.m01.d12:tyMA.LaudsGlory.text	
ltx/en_us_dedes/ty.m01.d12:tyMA.LaudsVerses.text	
ltx/en_us_dedes/ty.m01.d12:tyMA.Magnificat.text	
ltx/en_us_dedes/ty.m01.d12:tyMA.MatinsGospel.text	
ltx/en_us_dedes/ty.m01.d12:tyMA.MidodeKath.text	
ltx/en_us_dedes/ty.m01.d12:tyMA.MidodeKontakion.text	
ltx/en_us_dedes/ty.m01.d12:tyMA.Ode9_1.text	
ltx/en_us_dedes/ty.m01.d12:tyMA.Ode9_2.text	
ltx/en_us_dedes/ty.m01.d12:tyMA.Ode9_3.text	
ltx/en_us_dedes/ty.m01.d12:tyMA.Ode9_4.text	
ltx/en_us_dedes/ty.m01.d12:tyMA.Ode9_5.text	
ltx/en_us_dedes/ty.m01.d12:tyMA.Ode9_6.text	
ltx/en_us_dedes/ty.m01.d12:tyMA.Ode9_7.text	
ltx/en_us_dedes/ty.m01.d12:tyMA.Ode9_8.text	
ltx/en_us_dedes/ty.m01.d12:tyMA.Ode9_Katavasia1.text	
ltx/en_us_dedes/ty.m01.d12:tyMA.Ode9_Katavasia2.text	
ltx/en_us_dedes/ty.m01.d12:tyMA.ProkVerse.text	
ltx/en_us_dedes/ty.m01.d12:tyMA.Prokeimenon.text	
ltx/en_us_dedes/ty.m01.d12:tyMA.Psalm50.text	
ltx/en_us_dedes/ty.m01.d12:tyMA.Synaxarion.text	
ltx/en_us_dedes/ty.m01.d12:tyMO.Rubric1.text	
ltx/en_us_dedes/ty.m01.d12:tyNote1.text	
ltx/en_us_dedes/ty.m01.d12:tyVE.Apolytikia.text	
ltx/en_us_dedes/ty.m01.d12:tyVE.AposBoth.text	
ltx/en_us_dedes/ty.m01.d12:tyVE.AposGlory.text	
ltx/en_us_dedes/ty.m01.d12:tyVE.AposGloryBoth.text	
ltx/en_us_dedes/ty.m01.d12:tyVE.Aposticha.text	
ltx/en_us_dedes/ty.m01.d12:tyVE.Dismissal.text	
ltx/en_us_dedes/ty.m01.d12:tyVE.Entrance.text	
ltx/en_us_dedes/ty.m01.d12:tyVE.Intro.text	
ltx/en_us_dedes/ty.m01.d12:tyVE.LIHC.text	
ltx/en_us_dedes/ty.m01.d12:tyVE.Note1.text	
ltx/en_us_dedes/ty.m01.d12:tyVE.Note2.text	
ltx/en_us_dedes/ty.m01.d12:tyVE.SticBoth.text	
ltx/en_us_dedes/ty.m01.d12:tyVE.SticGlory.text	
ltx/en_us_dedes/ty.m01.d12:tyVE.SticGloryBoth.text	
ltx/en_us_dedes/ty.m01.d12:tyVE.Stichera.text	
