ltx/en_us_dedes/oc.m3.d6:ocBK.ModeNaked	@ltx/en_us_dedes/miscellanea:misc.Mode3.naked
ltx/en_us_dedes/oc.m3.d6:ocLI.Beatitudes1.incipit	@ltx/en_us_dedes/oc.m3.d1:ocLI.Beatitudes1.incipit
ltx/en_us_dedes/oc.m3.d6:ocLI.Beatitudes1.melody	
ltx/en_us_dedes/oc.m3.d6:ocLI.Beatitudes1.mode	@ltx/en_us_dedes/miscellanea:misc.Mode3
ltx/en_us_dedes/oc.m3.d6:ocLI.Beatitudes1.text	@ltx/en_us_dedes/oc.m3.d1:ocLI.Beatitudes1.text
ltx/en_us_dedes/oc.m3.d6:ocLI.Beatitudes2.incipit	When the sun beheld that…
ltx/en_us_dedes/oc.m3.d6:ocLI.Beatitudes2.melody	
ltx/en_us_dedes/oc.m3.d6:ocLI.Beatitudes2.mode	@ltx/en_us_dedes/miscellanea:misc.Mode3
ltx/en_us_dedes/oc.m3.d6:ocLI.Beatitudes2.text	When the sun beheld that You, O Lord, were crucified, * it made its light go dark; O holy Master, the rocks split apart; * and all the earth was quaking. * Even the Temple curtain tore in two, * when it saw how You were unjustly suffering, * You the Savior of all and incomprehensible.
ltx/en_us_dedes/oc.m3.d6:ocLI.Beatitudes3.incipit	On behalf of all, O…
ltx/en_us_dedes/oc.m3.d6:ocLI.Beatitudes3.melody	
ltx/en_us_dedes/oc.m3.d6:ocLI.Beatitudes3.mode	@ltx/en_us_dedes/miscellanea:misc.Mode3
ltx/en_us_dedes/oc.m3.d6:ocLI.Beatitudes3.text	On behalf of all, O Jesus, You were led to death, * You life of the living, so that by Your divine sufferings * You being God might save all * who died because of eating from the tree, * and might make them residents of Paradise. * Therefore we who believe magnify Your sufferings.
ltx/en_us_dedes/oc.m3.d6:ocLI.Beatitudes4.incipit	Imitating the Passion of Christ…
ltx/en_us_dedes/oc.m3.d6:ocLI.Beatitudes4.melody	
ltx/en_us_dedes/oc.m3.d6:ocLI.Beatitudes4.mode	@ltx/en_us_dedes/miscellanea:misc.Mode3
ltx/en_us_dedes/oc.m3.d6:ocLI.Beatitudes4.text	Imitating the Passion of Christ the Savior, * who suffered for us and took away reproach from humanity, * through many painful tortures, * you wrestled down and beat the hostile foe, * and were granted glory from God on high. * Holy Martyrs, and thus * you are fittingly glorified.
ltx/en_us_dedes/oc.m3.d6:ocLI.BeatitudesT.incipit	O all-blameless Lady, you were…
ltx/en_us_dedes/oc.m3.d6:ocLI.BeatitudesT.melody	
ltx/en_us_dedes/oc.m3.d6:ocLI.BeatitudesT.mode	@ltx/en_us_dedes/miscellanea:misc.Mode3
ltx/en_us_dedes/oc.m3.d6:ocLI.BeatitudesT.text	O all-blameless Lady, you were wholly shaken * as you watched as your Son was voluntarily crucified * and suffered in His body. * O pure One, you lamented and cried out, * “Woe is me! How have You, my only Child, died, * O Savior, who wish to revive all mankind that had died.”
ltx/en_us_dedes/oc.m3.d6:ocLI.BeatitudesTr.incipit	O believers, let us glorify…
ltx/en_us_dedes/oc.m3.d6:ocLI.BeatitudesTr.melody	
ltx/en_us_dedes/oc.m3.d6:ocLI.BeatitudesTr.mode	@ltx/en_us_dedes/miscellanea:misc.Mode3
ltx/en_us_dedes/oc.m3.d6:ocLI.BeatitudesTr.text	O believers, let us glorify the Father * and Son and Holy Spirit, in unconfused Divinity, * the single rule and glory, * solemnly worshiping our only God * as befits Him with faith that is Orthodox, * as we cry out and say, * “In Your kingdom remember us.”
ltx/en_us_dedes/oc.m3.d6:ocLI.MM.Beatitudes1234TrTas78910GB.text	@ltx/en_us_dedes/properties:media.key
ltx/en_us_dedes/oc.m3.d6:ocMA.ApolTheotokion.incipit	@ltx/en_us_dedes/oc.m3.d3:ocMA.Kathisma13.incipit
ltx/en_us_dedes/oc.m3.d6:ocMA.ApolTheotokion.melody	
ltx/en_us_dedes/oc.m3.d6:ocMA.ApolTheotokion.mode	@ltx/en_us_dedes/miscellanea:misc.Mode3
ltx/en_us_dedes/oc.m3.d6:ocMA.ApolTheotokion.text	@ltx/en_us_dedes/oc.m3.d3:ocMA.Kathisma13.text
ltx/en_us_dedes/oc.m3.d6:ocMA.AposTheotokion.greekmelody	@ltx/en_us_dedes/he.a.m3:heAU.MegaliTouStavrouSou.greekname
ltx/en_us_dedes/oc.m3.d6:ocMA.AposTheotokion.incipit	As the all-blameless Lady wept…
ltx/en_us_dedes/oc.m3.d6:ocMA.AposTheotokion.melody	@ltx/en_us_dedes/he.a.m3:heAU.MegaliTouStavrouSou.name
ltx/en_us_dedes/oc.m3.d6:ocMA.AposTheotokion.mode	@ltx/en_us_dedes/miscellanea:misc.Mode3
ltx/en_us_dedes/oc.m3.d6:ocMA.AposTheotokion.text	As the all-blameless Lady wept and poured out streams of tears, * she sighed and she lamented, and cried out from the depths of her soul, * “How have You now set, O Jesus, my sweetest light? * How is it that I see You on the Cross speechless now, * who by a word created all things?”
ltx/en_us_dedes/oc.m3.d6:ocMA.Aposticha1.incipit	@ltx/en_us_dedes/he.a.m3:heAU.StavrofanosMoysis.incipit
ltx/en_us_dedes/oc.m3.d6:ocMA.Aposticha1.melody	
ltx/en_us_dedes/oc.m3.d6:ocMA.Aposticha1.mode	@ltx/en_us_dedes/miscellanea:misc.Mode3
ltx/en_us_dedes/oc.m3.d6:ocMA.Aposticha1.text	@ltx/en_us_dedes/he.a.m3:heAU.StavrofanosMoysis.text
ltx/en_us_dedes/oc.m3.d6:ocMA.Aposticha2.incipit	@ltx/en_us_dedes/oc.m3.d4:ocMA.Aposticha1.incipit
ltx/en_us_dedes/oc.m3.d6:ocMA.Aposticha2.melody	
ltx/en_us_dedes/oc.m3.d6:ocMA.Aposticha2.mode	@ltx/en_us_dedes/miscellanea:misc.Mode3
ltx/en_us_dedes/oc.m3.d6:ocMA.Aposticha2.text	@ltx/en_us_dedes/oc.m3.d4:ocMA.Aposticha1.text
ltx/en_us_dedes/oc.m3.d6:ocMA.Aposticha3.incipit	@ltx/en_us_dedes/oc.m3.d2:ocMA.Aposticha3.incipit
ltx/en_us_dedes/oc.m3.d6:ocMA.Aposticha3.melody	
ltx/en_us_dedes/oc.m3.d6:ocMA.Aposticha3.mode	@ltx/en_us_dedes/miscellanea:misc.Mode3
ltx/en_us_dedes/oc.m3.d6:ocMA.Aposticha3.text	@ltx/en_us_dedes/oc.m3.d2:ocMA.Aposticha3.text
ltx/en_us_dedes/oc.m3.d6:ocMA.C1.acrostic.notice1	
ltx/en_us_dedes/oc.m3.d6:ocMA.C1.acrostic.text	
ltx/en_us_dedes/oc.m3.d6:ocMA.C1.acrostic.title	Canon for the Cross.
ltx/en_us_dedes/oc.m3.d6:ocMA.Kathisma11.incipit	@ltx/en_us_dedes/oc.m3.d4:ocMA.Kathisma11.incipit
ltx/en_us_dedes/oc.m3.d6:ocMA.Kathisma11.melody	
ltx/en_us_dedes/oc.m3.d6:ocMA.Kathisma11.mode	@ltx/en_us_dedes/miscellanea:misc.Mode3
ltx/en_us_dedes/oc.m3.d6:ocMA.Kathisma11.text	@ltx/en_us_dedes/oc.m3.d4:ocMA.Kathisma11.text
ltx/en_us_dedes/oc.m3.d6:ocMA.Kathisma12.incipit	@ltx/en_us_dedes/oc.m3.d4:ocMA.Kathisma12.incipit
ltx/en_us_dedes/oc.m3.d6:ocMA.Kathisma12.melody	@ltx/en_us_dedes/oc.m3.d4:ocMA.Kathisma12.melody
ltx/en_us_dedes/oc.m3.d6:ocMA.Kathisma12.mode	@ltx/en_us_dedes/miscellanea:misc.Mode3
ltx/en_us_dedes/oc.m3.d6:ocMA.Kathisma12.text	@ltx/en_us_dedes/oc.m3.d4:ocMA.Kathisma12.text
ltx/en_us_dedes/oc.m3.d6:ocMA.Kathisma13.greekmelody	@ltx/en_us_dedes/he.a.m3:heAU.TinOraiotita.greekname
ltx/en_us_dedes/oc.m3.d6:ocMA.Kathisma13.incipit	…
ltx/en_us_dedes/oc.m3.d6:ocMA.Kathisma13.melody	@ltx/en_us_dedes/he.a.m3:heAU.TinOraiotita.name
ltx/en_us_dedes/oc.m3.d6:ocMA.Kathisma13.mode	@ltx/en_us_dedes/miscellanea:misc.Mode3
ltx/en_us_dedes/oc.m3.d6:ocMA.Kathisma13.text	
ltx/en_us_dedes/oc.m3.d6:ocMA.Kathisma21.incipit	@ltx/en_us_dedes/oc.m3.d4:ocMA.Kathisma22.incipit
ltx/en_us_dedes/oc.m3.d6:ocMA.Kathisma21.melody	@ltx/en_us_dedes/oc.m3.d4:ocMA.Kathisma22.melody
ltx/en_us_dedes/oc.m3.d6:ocMA.Kathisma21.mode	@ltx/en_us_dedes/miscellanea:misc.Mode3
ltx/en_us_dedes/oc.m3.d6:ocMA.Kathisma21.text	@ltx/en_us_dedes/oc.m3.d4:ocMA.Kathisma22.text
ltx/en_us_dedes/oc.m3.d6:ocMA.Kathisma22.greekmelody	@ltx/en_us_dedes/he.a.m3:heAU.TinOraiotita.greekname
ltx/en_us_dedes/oc.m3.d6:ocMA.Kathisma22.incipit	…
ltx/en_us_dedes/oc.m3.d6:ocMA.Kathisma22.melody	@ltx/en_us_dedes/he.a.m3:heAU.TinOraiotita.name
ltx/en_us_dedes/oc.m3.d6:ocMA.Kathisma22.mode	@ltx/en_us_dedes/miscellanea:misc.Mode3
ltx/en_us_dedes/oc.m3.d6:ocMA.Kathisma22.text	
ltx/en_us_dedes/oc.m3.d6:ocMA.Kathisma23.greekmelody	@ltx/en_us_dedes/he.a.m3:heAU.TinOraiotita.greekname
ltx/en_us_dedes/oc.m3.d6:ocMA.Kathisma23.incipit	…
ltx/en_us_dedes/oc.m3.d6:ocMA.Kathisma23.melody	@ltx/en_us_dedes/he.a.m3:heAU.TinOraiotita.name
ltx/en_us_dedes/oc.m3.d6:ocMA.Kathisma23.mode	@ltx/en_us_dedes/miscellanea:misc.Mode3
ltx/en_us_dedes/oc.m3.d6:ocMA.Kathisma23.text	
ltx/en_us_dedes/oc.m3.d6:ocMA.Kathisma31.incipit	@ltx/en_us_dedes/oc.m3.d4:ocMA.Kathisma21.incipit
ltx/en_us_dedes/oc.m3.d6:ocMA.Kathisma31.melody	@ltx/en_us_dedes/oc.m3.d4:ocMA.Kathisma21.melody
ltx/en_us_dedes/oc.m3.d6:ocMA.Kathisma31.mode	@ltx/en_us_dedes/miscellanea:misc.Mode3
ltx/en_us_dedes/oc.m3.d6:ocMA.Kathisma31.text	@ltx/en_us_dedes/oc.m3.d4:ocMA.Kathisma21.text
ltx/en_us_dedes/oc.m3.d6:ocMA.Kathisma32.incipit	Your wholehearted endurance…
ltx/en_us_dedes/oc.m3.d6:ocMA.Kathisma32.melody	
ltx/en_us_dedes/oc.m3.d6:ocMA.Kathisma32.mode	@ltx/en_us_dedes/miscellanea:misc.Mode3
ltx/en_us_dedes/oc.m3.d6:ocMA.Kathisma32.text	Your wholehearted endurance vanquished the machinations of the enemy and author of evil, O all-lauded medal-winners. That is why you have been counted worthy of eternal blessedness. We entreat you to intercede with the Lord, that He save the flock of Christ-loving people, for You, O Martyrs, are witnesses of the truth.
ltx/en_us_dedes/oc.m3.d6:ocMA.Kathisma33.greekmelody	@ltx/en_us_dedes/he.a.m3:heAU.TinOraiotita.greekname
ltx/en_us_dedes/oc.m3.d6:ocMA.Kathisma33.incipit	…
ltx/en_us_dedes/oc.m3.d6:ocMA.Kathisma33.melody	@ltx/en_us_dedes/he.a.m3:heAU.TinOraiotita.name
ltx/en_us_dedes/oc.m3.d6:ocMA.Kathisma33.mode	@ltx/en_us_dedes/miscellanea:misc.Mode3
ltx/en_us_dedes/oc.m3.d6:ocMA.Kathisma33.text	
ltx/en_us_dedes/oc.m3.d6:ocMA.OdeW1C11.incipit	…
ltx/en_us_dedes/oc.m3.d6:ocMA.OdeW1C11.melody	@ltx/en_us_dedes/he.h.m3:heHE.ChersonAvyssotokon.name
ltx/en_us_dedes/oc.m3.d6:ocMA.OdeW1C11.mode	@ltx/en_us_dedes/miscellanea:misc.Mode3
ltx/en_us_dedes/oc.m3.d6:ocMA.OdeW1C11.ode	@ltx/en_us_dedes/miscellanea:misc.Ode1
ltx/en_us_dedes/oc.m3.d6:ocMA.OdeW1C11.text	
ltx/en_us_dedes/oc.m3.d6:ocMA.OdeW1C12.incipit	…
ltx/en_us_dedes/oc.m3.d6:ocMA.OdeW1C12.melody	@ltx/en_us_dedes/he.h.m3:heHE.ChersonAvyssotokon.name
ltx/en_us_dedes/oc.m3.d6:ocMA.OdeW1C12.mode	@ltx/en_us_dedes/miscellanea:misc.Mode3
ltx/en_us_dedes/oc.m3.d6:ocMA.OdeW1C12.ode	@ltx/en_us_dedes/miscellanea:misc.Ode1
ltx/en_us_dedes/oc.m3.d6:ocMA.OdeW1C12.text	
ltx/en_us_dedes/oc.m3.d6:ocMA.OdeW1C13.incipit	…
ltx/en_us_dedes/oc.m3.d6:ocMA.OdeW1C13.melody	@ltx/en_us_dedes/he.h.m3:heHE.ChersonAvyssotokon.name
ltx/en_us_dedes/oc.m3.d6:ocMA.OdeW1C13.mode	@ltx/en_us_dedes/miscellanea:misc.Mode3
ltx/en_us_dedes/oc.m3.d6:ocMA.OdeW1C13.ode	@ltx/en_us_dedes/miscellanea:misc.Ode1
ltx/en_us_dedes/oc.m3.d6:ocMA.OdeW1C13.text	
ltx/en_us_dedes/oc.m3.d6:ocMA.OdeW1C14.incipit	…
ltx/en_us_dedes/oc.m3.d6:ocMA.OdeW1C14.melody	@ltx/en_us_dedes/he.h.m3:heHE.ChersonAvyssotokon.name
ltx/en_us_dedes/oc.m3.d6:ocMA.OdeW1C14.mode	@ltx/en_us_dedes/miscellanea:misc.Mode3
ltx/en_us_dedes/oc.m3.d6:ocMA.OdeW1C14.ode	@ltx/en_us_dedes/miscellanea:misc.Ode1
ltx/en_us_dedes/oc.m3.d6:ocMA.OdeW1C14.text	
ltx/en_us_dedes/oc.m3.d6:ocMA.OdeW1C1H.greekmelody	@ltx/en_us_dedes/he.h.m3:heHE.ChersonAvyssotokon.greekname
ltx/en_us_dedes/oc.m3.d6:ocMA.OdeW1C1H.incipit	@ltx/en_us_dedes/he.h.m3:heHE.ChersonAvyssotokon.incipit
ltx/en_us_dedes/oc.m3.d6:ocMA.OdeW1C1H.melody	@ltx/en_us_dedes/he.h.m3:heHE.ChersonAvyssotokon.melody
ltx/en_us_dedes/oc.m3.d6:ocMA.OdeW1C1H.mode	@ltx/en_us_dedes/miscellanea:misc.Mode3
ltx/en_us_dedes/oc.m3.d6:ocMA.OdeW1C1H.ode	@ltx/en_us_dedes/miscellanea:misc.Ode1
ltx/en_us_dedes/oc.m3.d6:ocMA.OdeW1C1H.text	@ltx/en_us_dedes/he.h.m3:heHE.ChersonAvyssotokon.text
ltx/en_us_dedes/oc.m3.d6:ocMA.OdeW1C1T.incipit	…
ltx/en_us_dedes/oc.m3.d6:ocMA.OdeW1C1T.melody	@ltx/en_us_dedes/he.h.m3:heHE.ChersonAvyssotokon.name
ltx/en_us_dedes/oc.m3.d6:ocMA.OdeW1C1T.mode	@ltx/en_us_dedes/miscellanea:misc.Mode3
ltx/en_us_dedes/oc.m3.d6:ocMA.OdeW1C1T.ode	@ltx/en_us_dedes/miscellanea:misc.Ode1
ltx/en_us_dedes/oc.m3.d6:ocMA.OdeW1C1T.text	
ltx/en_us_dedes/oc.m3.d6:ocMA.OdeW1C21.greekmelody	@ltx/en_us_dedes/he.h.m3:heHE.AsomenToKyrio.greekname
ltx/en_us_dedes/oc.m3.d6:ocMA.OdeW1C21.incipit	…
ltx/en_us_dedes/oc.m3.d6:ocMA.OdeW1C21.melody	@ltx/en_us_dedes/he.h.m3:heHE.AsomenToKyrio.name
ltx/en_us_dedes/oc.m3.d6:ocMA.OdeW1C21.mode	@ltx/en_us_dedes/miscellanea:misc.Mode3
ltx/en_us_dedes/oc.m3.d6:ocMA.OdeW1C21.ode	@ltx/en_us_dedes/miscellanea:misc.Ode1
ltx/en_us_dedes/oc.m3.d6:ocMA.OdeW1C21.text	
ltx/en_us_dedes/oc.m3.d6:ocMA.OdeW1C22.incipit	…
ltx/en_us_dedes/oc.m3.d6:ocMA.OdeW1C22.melody	@ltx/en_us_dedes/he.h.m3:heHE.AsomenToKyrio.name
ltx/en_us_dedes/oc.m3.d6:ocMA.OdeW1C22.mode	@ltx/en_us_dedes/miscellanea:misc.Mode3
ltx/en_us_dedes/oc.m3.d6:ocMA.OdeW1C22.ode	@ltx/en_us_dedes/miscellanea:misc.Ode1
ltx/en_us_dedes/oc.m3.d6:ocMA.OdeW1C22.text	
ltx/en_us_dedes/oc.m3.d6:ocMA.OdeW1C23.incipit	…
ltx/en_us_dedes/oc.m3.d6:ocMA.OdeW1C23.melody	@ltx/en_us_dedes/he.h.m3:heHE.AsomenToKyrio.name
ltx/en_us_dedes/oc.m3.d6:ocMA.OdeW1C23.mode	@ltx/en_us_dedes/miscellanea:misc.Mode3
ltx/en_us_dedes/oc.m3.d6:ocMA.OdeW1C23.ode	@ltx/en_us_dedes/miscellanea:misc.Ode1
ltx/en_us_dedes/oc.m3.d6:ocMA.OdeW1C23.text	
ltx/en_us_dedes/oc.m3.d6:ocMA.OdeW3C11.incipit	…
ltx/en_us_dedes/oc.m3.d6:ocMA.OdeW3C11.melody	@ltx/en_us_dedes/he.h.m3:heHE.ToStereoma.name
ltx/en_us_dedes/oc.m3.d6:ocMA.OdeW3C11.mode	@ltx/en_us_dedes/miscellanea:misc.Mode3
ltx/en_us_dedes/oc.m3.d6:ocMA.OdeW3C11.ode	@ltx/en_us_dedes/miscellanea:misc.Ode3
ltx/en_us_dedes/oc.m3.d6:ocMA.OdeW3C11.text	
ltx/en_us_dedes/oc.m3.d6:ocMA.OdeW3C12.incipit	…
ltx/en_us_dedes/oc.m3.d6:ocMA.OdeW3C12.melody	@ltx/en_us_dedes/he.h.m3:heHE.ToStereoma.name
ltx/en_us_dedes/oc.m3.d6:ocMA.OdeW3C12.mode	@ltx/en_us_dedes/miscellanea:misc.Mode3
ltx/en_us_dedes/oc.m3.d6:ocMA.OdeW3C12.ode	@ltx/en_us_dedes/miscellanea:misc.Ode3
ltx/en_us_dedes/oc.m3.d6:ocMA.OdeW3C12.text	
ltx/en_us_dedes/oc.m3.d6:ocMA.OdeW3C13.incipit	…
ltx/en_us_dedes/oc.m3.d6:ocMA.OdeW3C13.melody	@ltx/en_us_dedes/he.h.m3:heHE.ToStereoma.name
ltx/en_us_dedes/oc.m3.d6:ocMA.OdeW3C13.mode	@ltx/en_us_dedes/miscellanea:misc.Mode3
ltx/en_us_dedes/oc.m3.d6:ocMA.OdeW3C13.ode	@ltx/en_us_dedes/miscellanea:misc.Ode3
ltx/en_us_dedes/oc.m3.d6:ocMA.OdeW3C13.text	
ltx/en_us_dedes/oc.m3.d6:ocMA.OdeW3C14.incipit	…
ltx/en_us_dedes/oc.m3.d6:ocMA.OdeW3C14.melody	@ltx/en_us_dedes/he.h.m3:heHE.ToStereoma.name
ltx/en_us_dedes/oc.m3.d6:ocMA.OdeW3C14.mode	@ltx/en_us_dedes/miscellanea:misc.Mode3
ltx/en_us_dedes/oc.m3.d6:ocMA.OdeW3C14.ode	@ltx/en_us_dedes/miscellanea:misc.Ode3
ltx/en_us_dedes/oc.m3.d6:ocMA.OdeW3C14.text	
ltx/en_us_dedes/oc.m3.d6:ocMA.OdeW3C1H.greekmelody	@ltx/en_us_dedes/he.h.m3:heHE.ToStereoma.greekname
ltx/en_us_dedes/oc.m3.d6:ocMA.OdeW3C1H.incipit	@ltx/en_us_dedes/he.h.m3:heHE.ToStereoma.incipit
ltx/en_us_dedes/oc.m3.d6:ocMA.OdeW3C1H.melody	@ltx/en_us_dedes/he.h.m3:heHE.ToStereoma.melody
ltx/en_us_dedes/oc.m3.d6:ocMA.OdeW3C1H.mode	@ltx/en_us_dedes/miscellanea:misc.Mode3
ltx/en_us_dedes/oc.m3.d6:ocMA.OdeW3C1H.ode	@ltx/en_us_dedes/miscellanea:misc.Ode3
ltx/en_us_dedes/oc.m3.d6:ocMA.OdeW3C1H.text	@ltx/en_us_dedes/he.h.m3:heHE.ToStereoma.text
ltx/en_us_dedes/oc.m3.d6:ocMA.OdeW3C1T.incipit	…
ltx/en_us_dedes/oc.m3.d6:ocMA.OdeW3C1T.melody	@ltx/en_us_dedes/he.h.m3:heHE.ToStereoma.name
ltx/en_us_dedes/oc.m3.d6:ocMA.OdeW3C1T.mode	@ltx/en_us_dedes/miscellanea:misc.Mode3
ltx/en_us_dedes/oc.m3.d6:ocMA.OdeW3C1T.ode	@ltx/en_us_dedes/miscellanea:misc.Ode3
ltx/en_us_dedes/oc.m3.d6:ocMA.OdeW3C1T.text	
ltx/en_us_dedes/oc.m3.d6:ocMA.OdeW3C21.greekmelody	@ltx/en_us_dedes/he.h.m3:heHE.EstereothiIKardiaMou.greekname
ltx/en_us_dedes/oc.m3.d6:ocMA.OdeW3C21.incipit	…
ltx/en_us_dedes/oc.m3.d6:ocMA.OdeW3C21.melody	@ltx/en_us_dedes/he.h.m3:heHE.EstereothiIKardiaMou.name
ltx/en_us_dedes/oc.m3.d6:ocMA.OdeW3C21.mode	@ltx/en_us_dedes/miscellanea:misc.Mode3
ltx/en_us_dedes/oc.m3.d6:ocMA.OdeW3C21.ode	@ltx/en_us_dedes/miscellanea:misc.Ode3
ltx/en_us_dedes/oc.m3.d6:ocMA.OdeW3C21.text	
ltx/en_us_dedes/oc.m3.d6:ocMA.OdeW3C22.incipit	…
ltx/en_us_dedes/oc.m3.d6:ocMA.OdeW3C22.melody	@ltx/en_us_dedes/he.h.m3:heHE.EstereothiIKardiaMou.name
ltx/en_us_dedes/oc.m3.d6:ocMA.OdeW3C22.mode	@ltx/en_us_dedes/miscellanea:misc.Mode3
ltx/en_us_dedes/oc.m3.d6:ocMA.OdeW3C22.ode	@ltx/en_us_dedes/miscellanea:misc.Ode3
ltx/en_us_dedes/oc.m3.d6:ocMA.OdeW3C22.text	
ltx/en_us_dedes/oc.m3.d6:ocMA.OdeW3C23.incipit	…
ltx/en_us_dedes/oc.m3.d6:ocMA.OdeW3C23.melody	@ltx/en_us_dedes/he.h.m3:heHE.EstereothiIKardiaMou.name
ltx/en_us_dedes/oc.m3.d6:ocMA.OdeW3C23.mode	@ltx/en_us_dedes/miscellanea:misc.Mode3
ltx/en_us_dedes/oc.m3.d6:ocMA.OdeW3C23.ode	@ltx/en_us_dedes/miscellanea:misc.Ode3
ltx/en_us_dedes/oc.m3.d6:ocMA.OdeW3C23.text	
ltx/en_us_dedes/oc.m3.d6:ocMA.OdeW4C11.incipit	…
ltx/en_us_dedes/oc.m3.d6:ocMA.OdeW4C11.melody	@ltx/en_us_dedes/he.h.m3:heHE.EkalypsenOuranous.name
ltx/en_us_dedes/oc.m3.d6:ocMA.OdeW4C11.mode	@ltx/en_us_dedes/miscellanea:misc.Mode3
ltx/en_us_dedes/oc.m3.d6:ocMA.OdeW4C11.ode	@ltx/en_us_dedes/miscellanea:misc.Ode4
ltx/en_us_dedes/oc.m3.d6:ocMA.OdeW4C11.text	
ltx/en_us_dedes/oc.m3.d6:ocMA.OdeW4C12.incipit	…
ltx/en_us_dedes/oc.m3.d6:ocMA.OdeW4C12.melody	@ltx/en_us_dedes/he.h.m3:heHE.EkalypsenOuranous.name
ltx/en_us_dedes/oc.m3.d6:ocMA.OdeW4C12.mode	@ltx/en_us_dedes/miscellanea:misc.Mode3
ltx/en_us_dedes/oc.m3.d6:ocMA.OdeW4C12.ode	@ltx/en_us_dedes/miscellanea:misc.Ode4
ltx/en_us_dedes/oc.m3.d6:ocMA.OdeW4C12.text	
ltx/en_us_dedes/oc.m3.d6:ocMA.OdeW4C13.incipit	…
ltx/en_us_dedes/oc.m3.d6:ocMA.OdeW4C13.melody	@ltx/en_us_dedes/he.h.m3:heHE.EkalypsenOuranous.name
ltx/en_us_dedes/oc.m3.d6:ocMA.OdeW4C13.mode	@ltx/en_us_dedes/miscellanea:misc.Mode3
ltx/en_us_dedes/oc.m3.d6:ocMA.OdeW4C13.ode	@ltx/en_us_dedes/miscellanea:misc.Ode4
ltx/en_us_dedes/oc.m3.d6:ocMA.OdeW4C13.text	
ltx/en_us_dedes/oc.m3.d6:ocMA.OdeW4C14.incipit	…
ltx/en_us_dedes/oc.m3.d6:ocMA.OdeW4C14.melody	@ltx/en_us_dedes/he.h.m3:heHE.EkalypsenOuranous.name
ltx/en_us_dedes/oc.m3.d6:ocMA.OdeW4C14.mode	@ltx/en_us_dedes/miscellanea:misc.Mode3
ltx/en_us_dedes/oc.m3.d6:ocMA.OdeW4C14.ode	@ltx/en_us_dedes/miscellanea:misc.Ode4
ltx/en_us_dedes/oc.m3.d6:ocMA.OdeW4C14.text	
ltx/en_us_dedes/oc.m3.d6:ocMA.OdeW4C1H.greekmelody	@ltx/en_us_dedes/he.h.m3:heHE.EkalypsenOuranous.greekname
ltx/en_us_dedes/oc.m3.d6:ocMA.OdeW4C1H.incipit	@ltx/en_us_dedes/he.h.m3:heHE.EkalypsenOuranous.incipit
ltx/en_us_dedes/oc.m3.d6:ocMA.OdeW4C1H.melody	@ltx/en_us_dedes/he.h.m3:heHE.EkalypsenOuranous.melody
ltx/en_us_dedes/oc.m3.d6:ocMA.OdeW4C1H.mode	@ltx/en_us_dedes/miscellanea:misc.Mode3
ltx/en_us_dedes/oc.m3.d6:ocMA.OdeW4C1H.ode	@ltx/en_us_dedes/miscellanea:misc.Ode4
ltx/en_us_dedes/oc.m3.d6:ocMA.OdeW4C1H.text	@ltx/en_us_dedes/he.h.m3:heHE.EkalypsenOuranous.text
ltx/en_us_dedes/oc.m3.d6:ocMA.OdeW4C1T.incipit	…
ltx/en_us_dedes/oc.m3.d6:ocMA.OdeW4C1T.melody	@ltx/en_us_dedes/he.h.m3:heHE.EkalypsenOuranous.name
ltx/en_us_dedes/oc.m3.d6:ocMA.OdeW4C1T.mode	@ltx/en_us_dedes/miscellanea:misc.Mode3
ltx/en_us_dedes/oc.m3.d6:ocMA.OdeW4C1T.ode	@ltx/en_us_dedes/miscellanea:misc.Ode4
ltx/en_us_dedes/oc.m3.d6:ocMA.OdeW4C1T.text	
ltx/en_us_dedes/oc.m3.d6:ocMA.OdeW4C21.greekmelody	@ltx/en_us_dedes/he.h.m3:heHE.EisakikoaTinAkoin.greekname
ltx/en_us_dedes/oc.m3.d6:ocMA.OdeW4C21.incipit	…
ltx/en_us_dedes/oc.m3.d6:ocMA.OdeW4C21.melody	@ltx/en_us_dedes/he.h.m3:heHE.EisakikoaTinAkoin.name
ltx/en_us_dedes/oc.m3.d6:ocMA.OdeW4C21.mode	@ltx/en_us_dedes/miscellanea:misc.Mode3
ltx/en_us_dedes/oc.m3.d6:ocMA.OdeW4C21.ode	@ltx/en_us_dedes/miscellanea:misc.Ode4
ltx/en_us_dedes/oc.m3.d6:ocMA.OdeW4C21.text	
ltx/en_us_dedes/oc.m3.d6:ocMA.OdeW4C22.incipit	…
ltx/en_us_dedes/oc.m3.d6:ocMA.OdeW4C22.melody	@ltx/en_us_dedes/he.h.m3:heHE.EisakikoaTinAkoin.name
ltx/en_us_dedes/oc.m3.d6:ocMA.OdeW4C22.mode	@ltx/en_us_dedes/miscellanea:misc.Mode3
ltx/en_us_dedes/oc.m3.d6:ocMA.OdeW4C22.ode	@ltx/en_us_dedes/miscellanea:misc.Ode4
ltx/en_us_dedes/oc.m3.d6:ocMA.OdeW4C22.text	
ltx/en_us_dedes/oc.m3.d6:ocMA.OdeW4C23.incipit	…
ltx/en_us_dedes/oc.m3.d6:ocMA.OdeW4C23.melody	@ltx/en_us_dedes/he.h.m3:heHE.EisakikoaTinAkoin.name
ltx/en_us_dedes/oc.m3.d6:ocMA.OdeW4C23.mode	@ltx/en_us_dedes/miscellanea:misc.Mode3
ltx/en_us_dedes/oc.m3.d6:ocMA.OdeW4C23.ode	@ltx/en_us_dedes/miscellanea:misc.Ode4
ltx/en_us_dedes/oc.m3.d6:ocMA.OdeW4C23.text	
ltx/en_us_dedes/oc.m3.d6:ocMA.OdeW5C11.incipit	…
ltx/en_us_dedes/oc.m3.d6:ocMA.OdeW5C11.melody	@ltx/en_us_dedes/he.h.m3:heHE.OsEidenIsaias.name
ltx/en_us_dedes/oc.m3.d6:ocMA.OdeW5C11.mode	@ltx/en_us_dedes/miscellanea:misc.Mode3
ltx/en_us_dedes/oc.m3.d6:ocMA.OdeW5C11.ode	@ltx/en_us_dedes/miscellanea:misc.Ode5
ltx/en_us_dedes/oc.m3.d6:ocMA.OdeW5C11.text	
ltx/en_us_dedes/oc.m3.d6:ocMA.OdeW5C12.incipit	…
ltx/en_us_dedes/oc.m3.d6:ocMA.OdeW5C12.melody	@ltx/en_us_dedes/he.h.m3:heHE.OsEidenIsaias.name
ltx/en_us_dedes/oc.m3.d6:ocMA.OdeW5C12.mode	@ltx/en_us_dedes/miscellanea:misc.Mode3
ltx/en_us_dedes/oc.m3.d6:ocMA.OdeW5C12.ode	@ltx/en_us_dedes/miscellanea:misc.Ode5
ltx/en_us_dedes/oc.m3.d6:ocMA.OdeW5C12.text	
ltx/en_us_dedes/oc.m3.d6:ocMA.OdeW5C13.incipit	…
ltx/en_us_dedes/oc.m3.d6:ocMA.OdeW5C13.melody	@ltx/en_us_dedes/he.h.m3:heHE.OsEidenIsaias.name
ltx/en_us_dedes/oc.m3.d6:ocMA.OdeW5C13.mode	@ltx/en_us_dedes/miscellanea:misc.Mode3
ltx/en_us_dedes/oc.m3.d6:ocMA.OdeW5C13.ode	@ltx/en_us_dedes/miscellanea:misc.Ode5
ltx/en_us_dedes/oc.m3.d6:ocMA.OdeW5C13.text	
ltx/en_us_dedes/oc.m3.d6:ocMA.OdeW5C14.incipit	…
ltx/en_us_dedes/oc.m3.d6:ocMA.OdeW5C14.melody	@ltx/en_us_dedes/he.h.m3:heHE.OsEidenIsaias.name
ltx/en_us_dedes/oc.m3.d6:ocMA.OdeW5C14.mode	@ltx/en_us_dedes/miscellanea:misc.Mode3
ltx/en_us_dedes/oc.m3.d6:ocMA.OdeW5C14.ode	@ltx/en_us_dedes/miscellanea:misc.Ode5
ltx/en_us_dedes/oc.m3.d6:ocMA.OdeW5C14.text	
ltx/en_us_dedes/oc.m3.d6:ocMA.OdeW5C1H.greekmelody	@ltx/en_us_dedes/he.h.m3:heHE.OsEidenIsaias.greekname
ltx/en_us_dedes/oc.m3.d6:ocMA.OdeW5C1H.incipit	@ltx/en_us_dedes/he.h.m3:heHE.OsEidenIsaias.incipit
ltx/en_us_dedes/oc.m3.d6:ocMA.OdeW5C1H.melody	@ltx/en_us_dedes/he.h.m3:heHE.OsEidenIsaias.melody
ltx/en_us_dedes/oc.m3.d6:ocMA.OdeW5C1H.mode	@ltx/en_us_dedes/miscellanea:misc.Mode3
ltx/en_us_dedes/oc.m3.d6:ocMA.OdeW5C1H.ode	@ltx/en_us_dedes/miscellanea:misc.Ode5
ltx/en_us_dedes/oc.m3.d6:ocMA.OdeW5C1H.text	@ltx/en_us_dedes/he.h.m3:heHE.OsEidenIsaias.text
ltx/en_us_dedes/oc.m3.d6:ocMA.OdeW5C1T.incipit	…
ltx/en_us_dedes/oc.m3.d6:ocMA.OdeW5C1T.melody	@ltx/en_us_dedes/he.h.m3:heHE.OsEidenIsaias.name
ltx/en_us_dedes/oc.m3.d6:ocMA.OdeW5C1T.mode	@ltx/en_us_dedes/miscellanea:misc.Mode3
ltx/en_us_dedes/oc.m3.d6:ocMA.OdeW5C1T.ode	@ltx/en_us_dedes/miscellanea:misc.Ode5
ltx/en_us_dedes/oc.m3.d6:ocMA.OdeW5C1T.text	
ltx/en_us_dedes/oc.m3.d6:ocMA.OdeW5C21.greekmelody	@ltx/en_us_dedes/he.h.m3:heHE.TinSinEirinin.greekname
ltx/en_us_dedes/oc.m3.d6:ocMA.OdeW5C21.incipit	…
ltx/en_us_dedes/oc.m3.d6:ocMA.OdeW5C21.melody	@ltx/en_us_dedes/he.h.m3:heHE.TinSinEirinin.name
ltx/en_us_dedes/oc.m3.d6:ocMA.OdeW5C21.mode	@ltx/en_us_dedes/miscellanea:misc.Mode3
ltx/en_us_dedes/oc.m3.d6:ocMA.OdeW5C21.ode	@ltx/en_us_dedes/miscellanea:misc.Ode5
ltx/en_us_dedes/oc.m3.d6:ocMA.OdeW5C21.text	
ltx/en_us_dedes/oc.m3.d6:ocMA.OdeW5C22.incipit	…
ltx/en_us_dedes/oc.m3.d6:ocMA.OdeW5C22.melody	@ltx/en_us_dedes/he.h.m3:heHE.TinSinEirinin.name
ltx/en_us_dedes/oc.m3.d6:ocMA.OdeW5C22.mode	@ltx/en_us_dedes/miscellanea:misc.Mode3
ltx/en_us_dedes/oc.m3.d6:ocMA.OdeW5C22.ode	@ltx/en_us_dedes/miscellanea:misc.Ode5
ltx/en_us_dedes/oc.m3.d6:ocMA.OdeW5C22.text	
ltx/en_us_dedes/oc.m3.d6:ocMA.OdeW5C23.incipit	…
ltx/en_us_dedes/oc.m3.d6:ocMA.OdeW5C23.melody	@ltx/en_us_dedes/he.h.m3:heHE.TinSinEirinin.name
ltx/en_us_dedes/oc.m3.d6:ocMA.OdeW5C23.mode	@ltx/en_us_dedes/miscellanea:misc.Mode3
ltx/en_us_dedes/oc.m3.d6:ocMA.OdeW5C23.ode	@ltx/en_us_dedes/miscellanea:misc.Ode5
ltx/en_us_dedes/oc.m3.d6:ocMA.OdeW5C23.text	
ltx/en_us_dedes/oc.m3.d6:ocMA.OdeW6C11.incipit	…
ltx/en_us_dedes/oc.m3.d6:ocMA.OdeW6C11.melody	@ltx/en_us_dedes/he.h.m3:heHE.EvoiseSoi.name
ltx/en_us_dedes/oc.m3.d6:ocMA.OdeW6C11.mode	@ltx/en_us_dedes/miscellanea:misc.Mode3
ltx/en_us_dedes/oc.m3.d6:ocMA.OdeW6C11.ode	@ltx/en_us_dedes/miscellanea:misc.Ode6
ltx/en_us_dedes/oc.m3.d6:ocMA.OdeW6C11.text	
ltx/en_us_dedes/oc.m3.d6:ocMA.OdeW6C12.incipit	…
ltx/en_us_dedes/oc.m3.d6:ocMA.OdeW6C12.melody	@ltx/en_us_dedes/he.h.m3:heHE.EvoiseSoi.name
ltx/en_us_dedes/oc.m3.d6:ocMA.OdeW6C12.mode	@ltx/en_us_dedes/miscellanea:misc.Mode3
ltx/en_us_dedes/oc.m3.d6:ocMA.OdeW6C12.ode	@ltx/en_us_dedes/miscellanea:misc.Ode6
ltx/en_us_dedes/oc.m3.d6:ocMA.OdeW6C12.text	
ltx/en_us_dedes/oc.m3.d6:ocMA.OdeW6C13.incipit	…
ltx/en_us_dedes/oc.m3.d6:ocMA.OdeW6C13.melody	@ltx/en_us_dedes/he.h.m3:heHE.EvoiseSoi.name
ltx/en_us_dedes/oc.m3.d6:ocMA.OdeW6C13.mode	@ltx/en_us_dedes/miscellanea:misc.Mode3
ltx/en_us_dedes/oc.m3.d6:ocMA.OdeW6C13.ode	@ltx/en_us_dedes/miscellanea:misc.Ode6
ltx/en_us_dedes/oc.m3.d6:ocMA.OdeW6C13.text	
ltx/en_us_dedes/oc.m3.d6:ocMA.OdeW6C14.incipit	…
ltx/en_us_dedes/oc.m3.d6:ocMA.OdeW6C14.melody	@ltx/en_us_dedes/he.h.m3:heHE.EvoiseSoi.name
ltx/en_us_dedes/oc.m3.d6:ocMA.OdeW6C14.mode	@ltx/en_us_dedes/miscellanea:misc.Mode3
ltx/en_us_dedes/oc.m3.d6:ocMA.OdeW6C14.ode	@ltx/en_us_dedes/miscellanea:misc.Ode6
ltx/en_us_dedes/oc.m3.d6:ocMA.OdeW6C14.text	
ltx/en_us_dedes/oc.m3.d6:ocMA.OdeW6C1H.greekmelody	@ltx/en_us_dedes/he.h.m3:heHE.EvoiseSoi.greekname
ltx/en_us_dedes/oc.m3.d6:ocMA.OdeW6C1H.incipit	@ltx/en_us_dedes/he.h.m3:heHE.EvoiseSoi.incipit
ltx/en_us_dedes/oc.m3.d6:ocMA.OdeW6C1H.melody	@ltx/en_us_dedes/he.h.m3:heHE.EvoiseSoi.melody
ltx/en_us_dedes/oc.m3.d6:ocMA.OdeW6C1H.mode	@ltx/en_us_dedes/miscellanea:misc.Mode3
ltx/en_us_dedes/oc.m3.d6:ocMA.OdeW6C1H.ode	@ltx/en_us_dedes/miscellanea:misc.Ode6
ltx/en_us_dedes/oc.m3.d6:ocMA.OdeW6C1H.text	@ltx/en_us_dedes/he.h.m3:heHE.EvoiseSoi.text
ltx/en_us_dedes/oc.m3.d6:ocMA.OdeW6C1T.incipit	…
ltx/en_us_dedes/oc.m3.d6:ocMA.OdeW6C1T.melody	@ltx/en_us_dedes/he.h.m3:heHE.EvoiseSoi.name
ltx/en_us_dedes/oc.m3.d6:ocMA.OdeW6C1T.mode	@ltx/en_us_dedes/miscellanea:misc.Mode3
ltx/en_us_dedes/oc.m3.d6:ocMA.OdeW6C1T.ode	@ltx/en_us_dedes/miscellanea:misc.Ode6
ltx/en_us_dedes/oc.m3.d6:ocMA.OdeW6C1T.text	
ltx/en_us_dedes/oc.m3.d6:ocMA.OdeW6C21.greekmelody	@ltx/en_us_dedes/he.h.m3:heHE.EvoisaEnStenagmois.greekname
ltx/en_us_dedes/oc.m3.d6:ocMA.OdeW6C21.incipit	…
ltx/en_us_dedes/oc.m3.d6:ocMA.OdeW6C21.melody	@ltx/en_us_dedes/he.h.m3:heHE.EvoisaEnStenagmois.name
ltx/en_us_dedes/oc.m3.d6:ocMA.OdeW6C21.mode	@ltx/en_us_dedes/miscellanea:misc.Mode3
ltx/en_us_dedes/oc.m3.d6:ocMA.OdeW6C21.ode	@ltx/en_us_dedes/miscellanea:misc.Ode6
ltx/en_us_dedes/oc.m3.d6:ocMA.OdeW6C21.text	
ltx/en_us_dedes/oc.m3.d6:ocMA.OdeW6C22.incipit	…
ltx/en_us_dedes/oc.m3.d6:ocMA.OdeW6C22.melody	@ltx/en_us_dedes/he.h.m3:heHE.EvoisaEnStenagmois.name
ltx/en_us_dedes/oc.m3.d6:ocMA.OdeW6C22.mode	@ltx/en_us_dedes/miscellanea:misc.Mode3
ltx/en_us_dedes/oc.m3.d6:ocMA.OdeW6C22.ode	@ltx/en_us_dedes/miscellanea:misc.Ode6
ltx/en_us_dedes/oc.m3.d6:ocMA.OdeW6C22.text	
ltx/en_us_dedes/oc.m3.d6:ocMA.OdeW6C23.incipit	…
ltx/en_us_dedes/oc.m3.d6:ocMA.OdeW6C23.melody	@ltx/en_us_dedes/he.h.m3:heHE.EvoisaEnStenagmois.name
ltx/en_us_dedes/oc.m3.d6:ocMA.OdeW6C23.mode	@ltx/en_us_dedes/miscellanea:misc.Mode3
ltx/en_us_dedes/oc.m3.d6:ocMA.OdeW6C23.ode	@ltx/en_us_dedes/miscellanea:misc.Ode6
ltx/en_us_dedes/oc.m3.d6:ocMA.OdeW6C23.text	
ltx/en_us_dedes/oc.m3.d6:ocMA.OdeW7C11.incipit	…
ltx/en_us_dedes/oc.m3.d6:ocMA.OdeW7C11.melody	@ltx/en_us_dedes/he.h.m3:heHE.SeTonEnPyri.name
ltx/en_us_dedes/oc.m3.d6:ocMA.OdeW7C11.mode	@ltx/en_us_dedes/miscellanea:misc.Mode3
ltx/en_us_dedes/oc.m3.d6:ocMA.OdeW7C11.ode	@ltx/en_us_dedes/miscellanea:misc.Ode7
ltx/en_us_dedes/oc.m3.d6:ocMA.OdeW7C11.text	
ltx/en_us_dedes/oc.m3.d6:ocMA.OdeW7C12.incipit	…
ltx/en_us_dedes/oc.m3.d6:ocMA.OdeW7C12.melody	@ltx/en_us_dedes/he.h.m3:heHE.SeTonEnPyri.name
ltx/en_us_dedes/oc.m3.d6:ocMA.OdeW7C12.mode	@ltx/en_us_dedes/miscellanea:misc.Mode3
ltx/en_us_dedes/oc.m3.d6:ocMA.OdeW7C12.ode	@ltx/en_us_dedes/miscellanea:misc.Ode7
ltx/en_us_dedes/oc.m3.d6:ocMA.OdeW7C12.text	
ltx/en_us_dedes/oc.m3.d6:ocMA.OdeW7C13.incipit	…
ltx/en_us_dedes/oc.m3.d6:ocMA.OdeW7C13.melody	@ltx/en_us_dedes/he.h.m3:heHE.SeTonEnPyri.name
ltx/en_us_dedes/oc.m3.d6:ocMA.OdeW7C13.mode	@ltx/en_us_dedes/miscellanea:misc.Mode3
ltx/en_us_dedes/oc.m3.d6:ocMA.OdeW7C13.ode	@ltx/en_us_dedes/miscellanea:misc.Ode7
ltx/en_us_dedes/oc.m3.d6:ocMA.OdeW7C13.text	
ltx/en_us_dedes/oc.m3.d6:ocMA.OdeW7C1H.greekmelody	@ltx/en_us_dedes/he.h.m3:heHE.SeTonEnPyri.greekname
ltx/en_us_dedes/oc.m3.d6:ocMA.OdeW7C1H.incipit	@ltx/en_us_dedes/he.h.m3:heHE.SeTonEnPyri.incipit
ltx/en_us_dedes/oc.m3.d6:ocMA.OdeW7C1H.melody	@ltx/en_us_dedes/he.h.m3:heHE.SeTonEnPyri.melody
ltx/en_us_dedes/oc.m3.d6:ocMA.OdeW7C1H.mode	@ltx/en_us_dedes/miscellanea:misc.Mode3
ltx/en_us_dedes/oc.m3.d6:ocMA.OdeW7C1H.ode	@ltx/en_us_dedes/miscellanea:misc.Ode7
ltx/en_us_dedes/oc.m3.d6:ocMA.OdeW7C1H.text	@ltx/en_us_dedes/he.h.m3:heHE.SeTonEnPyri.text
ltx/en_us_dedes/oc.m3.d6:ocMA.OdeW7C1T.incipit	…
ltx/en_us_dedes/oc.m3.d6:ocMA.OdeW7C1T.melody	@ltx/en_us_dedes/he.h.m3:heHE.SeTonEnPyri.name
ltx/en_us_dedes/oc.m3.d6:ocMA.OdeW7C1T.mode	@ltx/en_us_dedes/miscellanea:misc.Mode3
ltx/en_us_dedes/oc.m3.d6:ocMA.OdeW7C1T.ode	@ltx/en_us_dedes/miscellanea:misc.Ode7
ltx/en_us_dedes/oc.m3.d6:ocMA.OdeW7C1T.text	
ltx/en_us_dedes/oc.m3.d6:ocMA.OdeW7C21.greekmelody	@ltx/en_us_dedes/he.h.m3:heHE.TreisPaidesEnKamino.greekname
ltx/en_us_dedes/oc.m3.d6:ocMA.OdeW7C21.incipit	…
ltx/en_us_dedes/oc.m3.d6:ocMA.OdeW7C21.melody	@ltx/en_us_dedes/he.h.m3:heHE.TreisPaidesEnKamino.name
ltx/en_us_dedes/oc.m3.d6:ocMA.OdeW7C21.mode	@ltx/en_us_dedes/miscellanea:misc.Mode3
ltx/en_us_dedes/oc.m3.d6:ocMA.OdeW7C21.ode	@ltx/en_us_dedes/miscellanea:misc.Ode7
ltx/en_us_dedes/oc.m3.d6:ocMA.OdeW7C21.text	
ltx/en_us_dedes/oc.m3.d6:ocMA.OdeW7C22.incipit	…
ltx/en_us_dedes/oc.m3.d6:ocMA.OdeW7C22.melody	@ltx/en_us_dedes/he.h.m3:heHE.TreisPaidesEnKamino.name
ltx/en_us_dedes/oc.m3.d6:ocMA.OdeW7C22.mode	@ltx/en_us_dedes/miscellanea:misc.Mode3
ltx/en_us_dedes/oc.m3.d6:ocMA.OdeW7C22.ode	@ltx/en_us_dedes/miscellanea:misc.Ode7
ltx/en_us_dedes/oc.m3.d6:ocMA.OdeW7C22.text	
ltx/en_us_dedes/oc.m3.d6:ocMA.OdeW7C23.incipit	…
ltx/en_us_dedes/oc.m3.d6:ocMA.OdeW7C23.melody	@ltx/en_us_dedes/he.h.m3:heHE.TreisPaidesEnKamino.name
ltx/en_us_dedes/oc.m3.d6:ocMA.OdeW7C23.mode	@ltx/en_us_dedes/miscellanea:misc.Mode3
ltx/en_us_dedes/oc.m3.d6:ocMA.OdeW7C23.ode	@ltx/en_us_dedes/miscellanea:misc.Ode7
ltx/en_us_dedes/oc.m3.d6:ocMA.OdeW7C23.text	
ltx/en_us_dedes/oc.m3.d6:ocMA.OdeW8C11.incipit	…
ltx/en_us_dedes/oc.m3.d6:ocMA.OdeW8C11.melody	@ltx/en_us_dedes/he.h.m3:heHE.AstektoPyri.name
ltx/en_us_dedes/oc.m3.d6:ocMA.OdeW8C11.mode	@ltx/en_us_dedes/miscellanea:misc.Mode3
ltx/en_us_dedes/oc.m3.d6:ocMA.OdeW8C11.ode	@ltx/en_us_dedes/miscellanea:misc.Ode8
ltx/en_us_dedes/oc.m3.d6:ocMA.OdeW8C11.text	
ltx/en_us_dedes/oc.m3.d6:ocMA.OdeW8C12.incipit	…
ltx/en_us_dedes/oc.m3.d6:ocMA.OdeW8C12.melody	@ltx/en_us_dedes/he.h.m3:heHE.AstektoPyri.name
ltx/en_us_dedes/oc.m3.d6:ocMA.OdeW8C12.mode	@ltx/en_us_dedes/miscellanea:misc.Mode3
ltx/en_us_dedes/oc.m3.d6:ocMA.OdeW8C12.ode	@ltx/en_us_dedes/miscellanea:misc.Ode8
ltx/en_us_dedes/oc.m3.d6:ocMA.OdeW8C12.text	
ltx/en_us_dedes/oc.m3.d6:ocMA.OdeW8C13.incipit	…
ltx/en_us_dedes/oc.m3.d6:ocMA.OdeW8C13.melody	@ltx/en_us_dedes/he.h.m3:heHE.AstektoPyri.name
ltx/en_us_dedes/oc.m3.d6:ocMA.OdeW8C13.mode	@ltx/en_us_dedes/miscellanea:misc.Mode3
ltx/en_us_dedes/oc.m3.d6:ocMA.OdeW8C13.ode	@ltx/en_us_dedes/miscellanea:misc.Ode8
ltx/en_us_dedes/oc.m3.d6:ocMA.OdeW8C13.text	
ltx/en_us_dedes/oc.m3.d6:ocMA.OdeW8C14.incipit	…
ltx/en_us_dedes/oc.m3.d6:ocMA.OdeW8C14.melody	@ltx/en_us_dedes/he.h.m3:heHE.AstektoPyri.name
ltx/en_us_dedes/oc.m3.d6:ocMA.OdeW8C14.mode	@ltx/en_us_dedes/miscellanea:misc.Mode3
ltx/en_us_dedes/oc.m3.d6:ocMA.OdeW8C14.ode	@ltx/en_us_dedes/miscellanea:misc.Ode8
ltx/en_us_dedes/oc.m3.d6:ocMA.OdeW8C14.text	
ltx/en_us_dedes/oc.m3.d6:ocMA.OdeW8C1H.greekmelody	@ltx/en_us_dedes/he.h.m3:heHE.AstektoPyri.greekname
ltx/en_us_dedes/oc.m3.d6:ocMA.OdeW8C1H.incipit	@ltx/en_us_dedes/he.h.m3:heHE.AstektoPyri.incipit
ltx/en_us_dedes/oc.m3.d6:ocMA.OdeW8C1H.melody	@ltx/en_us_dedes/he.h.m3:heHE.AstektoPyri.melody
ltx/en_us_dedes/oc.m3.d6:ocMA.OdeW8C1H.mode	@ltx/en_us_dedes/miscellanea:misc.Mode3
ltx/en_us_dedes/oc.m3.d6:ocMA.OdeW8C1H.ode	@ltx/en_us_dedes/miscellanea:misc.Ode8
ltx/en_us_dedes/oc.m3.d6:ocMA.OdeW8C1H.text	@ltx/en_us_dedes/he.h.m3:heHE.AstektoPyri.text
ltx/en_us_dedes/oc.m3.d6:ocMA.OdeW8C1T.incipit	…
ltx/en_us_dedes/oc.m3.d6:ocMA.OdeW8C1T.melody	@ltx/en_us_dedes/he.h.m3:heHE.AstektoPyri.name
ltx/en_us_dedes/oc.m3.d6:ocMA.OdeW8C1T.mode	@ltx/en_us_dedes/miscellanea:misc.Mode3
ltx/en_us_dedes/oc.m3.d6:ocMA.OdeW8C1T.ode	@ltx/en_us_dedes/miscellanea:misc.Ode8
ltx/en_us_dedes/oc.m3.d6:ocMA.OdeW8C1T.text	
ltx/en_us_dedes/oc.m3.d6:ocMA.OdeW8C21.greekmelody	@ltx/en_us_dedes/he.h.m3:heHE.TonEnFlogi.greekname
ltx/en_us_dedes/oc.m3.d6:ocMA.OdeW8C21.incipit	…
ltx/en_us_dedes/oc.m3.d6:ocMA.OdeW8C21.melody	@ltx/en_us_dedes/he.h.m3:heHE.TonEnFlogi.name
ltx/en_us_dedes/oc.m3.d6:ocMA.OdeW8C21.mode	@ltx/en_us_dedes/miscellanea:misc.Mode3
ltx/en_us_dedes/oc.m3.d6:ocMA.OdeW8C21.ode	@ltx/en_us_dedes/miscellanea:misc.Ode8
ltx/en_us_dedes/oc.m3.d6:ocMA.OdeW8C21.text	
ltx/en_us_dedes/oc.m3.d6:ocMA.OdeW8C22.incipit	…
ltx/en_us_dedes/oc.m3.d6:ocMA.OdeW8C22.melody	@ltx/en_us_dedes/he.h.m3:heHE.TonEnFlogi.name
ltx/en_us_dedes/oc.m3.d6:ocMA.OdeW8C22.mode	@ltx/en_us_dedes/miscellanea:misc.Mode3
ltx/en_us_dedes/oc.m3.d6:ocMA.OdeW8C22.ode	@ltx/en_us_dedes/miscellanea:misc.Ode8
ltx/en_us_dedes/oc.m3.d6:ocMA.OdeW8C22.text	
ltx/en_us_dedes/oc.m3.d6:ocMA.OdeW8C23.incipit	…
ltx/en_us_dedes/oc.m3.d6:ocMA.OdeW8C23.melody	@ltx/en_us_dedes/he.h.m3:heHE.TonEnFlogi.name
ltx/en_us_dedes/oc.m3.d6:ocMA.OdeW8C23.mode	@ltx/en_us_dedes/miscellanea:misc.Mode3
ltx/en_us_dedes/oc.m3.d6:ocMA.OdeW8C23.ode	@ltx/en_us_dedes/miscellanea:misc.Ode8
ltx/en_us_dedes/oc.m3.d6:ocMA.OdeW8C23.text	
ltx/en_us_dedes/oc.m3.d6:ocMA.OdeW9C11.incipit	…
ltx/en_us_dedes/oc.m3.d6:ocMA.OdeW9C11.melody	@ltx/en_us_dedes/he.h.m3:heHE.EnNomoSkia.name
ltx/en_us_dedes/oc.m3.d6:ocMA.OdeW9C11.mode	@ltx/en_us_dedes/miscellanea:misc.Mode3
ltx/en_us_dedes/oc.m3.d6:ocMA.OdeW9C11.ode	@ltx/en_us_dedes/miscellanea:misc.Ode9
ltx/en_us_dedes/oc.m3.d6:ocMA.OdeW9C11.text	
ltx/en_us_dedes/oc.m3.d6:ocMA.OdeW9C12.incipit	…
ltx/en_us_dedes/oc.m3.d6:ocMA.OdeW9C12.melody	@ltx/en_us_dedes/he.h.m3:heHE.EnNomoSkia.name
ltx/en_us_dedes/oc.m3.d6:ocMA.OdeW9C12.mode	@ltx/en_us_dedes/miscellanea:misc.Mode3
ltx/en_us_dedes/oc.m3.d6:ocMA.OdeW9C12.ode	@ltx/en_us_dedes/miscellanea:misc.Ode9
ltx/en_us_dedes/oc.m3.d6:ocMA.OdeW9C12.text	
ltx/en_us_dedes/oc.m3.d6:ocMA.OdeW9C13.incipit	…
ltx/en_us_dedes/oc.m3.d6:ocMA.OdeW9C13.melody	@ltx/en_us_dedes/he.h.m3:heHE.EnNomoSkia.name
ltx/en_us_dedes/oc.m3.d6:ocMA.OdeW9C13.mode	@ltx/en_us_dedes/miscellanea:misc.Mode3
ltx/en_us_dedes/oc.m3.d6:ocMA.OdeW9C13.ode	@ltx/en_us_dedes/miscellanea:misc.Ode9
ltx/en_us_dedes/oc.m3.d6:ocMA.OdeW9C13.text	
ltx/en_us_dedes/oc.m3.d6:ocMA.OdeW9C14.incipit	…
ltx/en_us_dedes/oc.m3.d6:ocMA.OdeW9C14.melody	@ltx/en_us_dedes/he.h.m3:heHE.EnNomoSkia.name
ltx/en_us_dedes/oc.m3.d6:ocMA.OdeW9C14.mode	@ltx/en_us_dedes/miscellanea:misc.Mode3
ltx/en_us_dedes/oc.m3.d6:ocMA.OdeW9C14.ode	@ltx/en_us_dedes/miscellanea:misc.Ode9
ltx/en_us_dedes/oc.m3.d6:ocMA.OdeW9C14.text	
ltx/en_us_dedes/oc.m3.d6:ocMA.OdeW9C1H.greekmelody	@ltx/en_us_dedes/he.h.m3:heHE.EnNomoSkia.greekname
ltx/en_us_dedes/oc.m3.d6:ocMA.OdeW9C1H.incipit	@ltx/en_us_dedes/he.h.m3:heHE.EnNomoSkia.incipit
ltx/en_us_dedes/oc.m3.d6:ocMA.OdeW9C1H.melody	@ltx/en_us_dedes/he.h.m3:heHE.EnNomoSkia.melody
ltx/en_us_dedes/oc.m3.d6:ocMA.OdeW9C1H.mode	@ltx/en_us_dedes/miscellanea:misc.Mode3
ltx/en_us_dedes/oc.m3.d6:ocMA.OdeW9C1H.ode	@ltx/en_us_dedes/miscellanea:misc.Ode9
ltx/en_us_dedes/oc.m3.d6:ocMA.OdeW9C1H.text	@ltx/en_us_dedes/he.h.m3:heHE.EnNomoSkia.text
ltx/en_us_dedes/oc.m3.d6:ocMA.OdeW9C1T.incipit	…
ltx/en_us_dedes/oc.m3.d6:ocMA.OdeW9C1T.melody	@ltx/en_us_dedes/he.h.m3:heHE.EnNomoSkia.name
ltx/en_us_dedes/oc.m3.d6:ocMA.OdeW9C1T.mode	@ltx/en_us_dedes/miscellanea:misc.Mode3
ltx/en_us_dedes/oc.m3.d6:ocMA.OdeW9C1T.ode	@ltx/en_us_dedes/miscellanea:misc.Ode9
ltx/en_us_dedes/oc.m3.d6:ocMA.OdeW9C1T.text	
ltx/en_us_dedes/oc.m3.d6:ocMA.OdeW9C21.greekmelody	@ltx/en_us_dedes/he.h.m3:heHE.SeTinAkataflekton.greekname
ltx/en_us_dedes/oc.m3.d6:ocMA.OdeW9C21.incipit	…
ltx/en_us_dedes/oc.m3.d6:ocMA.OdeW9C21.melody	@ltx/en_us_dedes/he.h.m3:heHE.SeTinAkataflekton.name
ltx/en_us_dedes/oc.m3.d6:ocMA.OdeW9C21.mode	@ltx/en_us_dedes/miscellanea:misc.Mode3
ltx/en_us_dedes/oc.m3.d6:ocMA.OdeW9C21.ode	@ltx/en_us_dedes/miscellanea:misc.Ode9
ltx/en_us_dedes/oc.m3.d6:ocMA.OdeW9C21.text	
ltx/en_us_dedes/oc.m3.d6:ocMA.OdeW9C22.incipit	…
ltx/en_us_dedes/oc.m3.d6:ocMA.OdeW9C22.melody	@ltx/en_us_dedes/he.h.m3:heHE.SeTinAkataflekton.name
ltx/en_us_dedes/oc.m3.d6:ocMA.OdeW9C22.mode	@ltx/en_us_dedes/miscellanea:misc.Mode3
ltx/en_us_dedes/oc.m3.d6:ocMA.OdeW9C22.ode	@ltx/en_us_dedes/miscellanea:misc.Ode9
ltx/en_us_dedes/oc.m3.d6:ocMA.OdeW9C22.text	
ltx/en_us_dedes/oc.m3.d6:ocMA.OdeW9C23.incipit	…
ltx/en_us_dedes/oc.m3.d6:ocMA.OdeW9C23.melody	@ltx/en_us_dedes/he.h.m3:heHE.SeTinAkataflekton.name
ltx/en_us_dedes/oc.m3.d6:ocMA.OdeW9C23.mode	@ltx/en_us_dedes/miscellanea:misc.Mode3
ltx/en_us_dedes/oc.m3.d6:ocMA.OdeW9C23.ode	@ltx/en_us_dedes/miscellanea:misc.Ode9
ltx/en_us_dedes/oc.m3.d6:ocMA.OdeW9C23.text	
ltx/en_us_dedes/oc.m3.d6:ocVE.ApolTheotokionVM.incipit	@ltx/en_us_dedes/oc.m3.d4:ocMA.Kathisma13.incipit
ltx/en_us_dedes/oc.m3.d6:ocVE.ApolTheotokionVM.melody	
ltx/en_us_dedes/oc.m3.d6:ocVE.ApolTheotokionVM.mode	@ltx/en_us_dedes/miscellanea:misc.Mode3
ltx/en_us_dedes/oc.m3.d6:ocVE.ApolTheotokionVM.text	@ltx/en_us_dedes/oc.m3.d4:ocMA.Kathisma13.text
ltx/en_us_dedes/oc.m3.d6:ocVE.AposTheotokion.greekmelody	@ltx/en_us_dedes/he.a.m3:heAU.MegaliTouStavrouSou.greekname
ltx/en_us_dedes/oc.m3.d6:ocVE.AposTheotokion.incipit	The purest Virgin cried aloud…
ltx/en_us_dedes/oc.m3.d6:ocVE.AposTheotokion.melody	@ltx/en_us_dedes/he.a.m3:heAU.MegaliTouStavrouSou.name
ltx/en_us_dedes/oc.m3.d6:ocVE.AposTheotokion.mode	@ltx/en_us_dedes/miscellanea:misc.Mode3
ltx/en_us_dedes/oc.m3.d6:ocVE.AposTheotokion.text	The purest Virgin cried aloud to You, O Word of God: * The world is granted mercy, * creation is enlightened, * and the Gentiles find salvation through Your Cross, O Master. * But now I suffer, my Son, as I behold * Your voluntary suffering.
ltx/en_us_dedes/oc.m3.d6:ocVE.Aposticha1.incipit	@ltx/en_us_dedes/oc.m3.d4:ocVE.Aposticha1.incipit
ltx/en_us_dedes/oc.m3.d6:ocVE.Aposticha1.melody	
ltx/en_us_dedes/oc.m3.d6:ocVE.Aposticha1.mode	@ltx/en_us_dedes/miscellanea:misc.Mode3
ltx/en_us_dedes/oc.m3.d6:ocVE.Aposticha1.text	@ltx/en_us_dedes/oc.m3.d4:ocVE.Aposticha1.text
ltx/en_us_dedes/oc.m3.d6:ocVE.Aposticha2.incipit	@ltx/en_us_dedes/oc.m3.d4:ocVE.Aposticha2.incipit
ltx/en_us_dedes/oc.m3.d6:ocVE.Aposticha2.melody	
ltx/en_us_dedes/oc.m3.d6:ocVE.Aposticha2.mode	@ltx/en_us_dedes/miscellanea:misc.Mode3
ltx/en_us_dedes/oc.m3.d6:ocVE.Aposticha2.text	@ltx/en_us_dedes/oc.m3.d4:ocVE.Aposticha2.text
ltx/en_us_dedes/oc.m3.d6:ocVE.Aposticha3.incipit	@ltx/en_us_dedes/he.a.m3:heAU.MegaliTouStavrouSou.incipit
ltx/en_us_dedes/oc.m3.d6:ocVE.Aposticha3.melody	
ltx/en_us_dedes/oc.m3.d6:ocVE.Aposticha3.mode	@ltx/en_us_dedes/miscellanea:misc.Mode3
ltx/en_us_dedes/oc.m3.d6:ocVE.Aposticha3.text	@ltx/en_us_dedes/he.a.m3:heAU.MegaliTouStavrouSou.text
ltx/en_us_dedes/oc.m3.d6:ocVE.SticTheotokion.greekmelody	@ltx/en_us_dedes/he.a.m3:heAU.MegaliTonMartyronSou.greekname
ltx/en_us_dedes/oc.m3.d6:ocVE.SticTheotokion.incipit	…
ltx/en_us_dedes/oc.m3.d6:ocVE.SticTheotokion.melody	@ltx/en_us_dedes/he.a.m3:heAU.MegaliTonMartyronSou.name
ltx/en_us_dedes/oc.m3.d6:ocVE.SticTheotokion.mode	@ltx/en_us_dedes/miscellanea:misc.Mode3
ltx/en_us_dedes/oc.m3.d6:ocVE.SticTheotokion.text	
ltx/en_us_dedes/oc.m3.d6:ocVE.Stichera1.greekmelody	@ltx/en_us_dedes/he.a.m3:heAU.MegaliTouStavrouSou.greekname
ltx/en_us_dedes/oc.m3.d6:ocVE.Stichera1.incipit	…
ltx/en_us_dedes/oc.m3.d6:ocVE.Stichera1.melody	@ltx/en_us_dedes/he.a.m3:heAU.MegaliTouStavrouSou.name
ltx/en_us_dedes/oc.m3.d6:ocVE.Stichera1.mode	@ltx/en_us_dedes/miscellanea:misc.Mode3
ltx/en_us_dedes/oc.m3.d6:ocVE.Stichera1.text	
ltx/en_us_dedes/oc.m3.d6:ocVE.Stichera2.incipit	…
ltx/en_us_dedes/oc.m3.d6:ocVE.Stichera2.melody	@ltx/en_us_dedes/he.a.m3:heAU.MegaliTouStavrouSou.name
ltx/en_us_dedes/oc.m3.d6:ocVE.Stichera2.mode	@ltx/en_us_dedes/miscellanea:misc.Mode3
ltx/en_us_dedes/oc.m3.d6:ocVE.Stichera2.text	
ltx/en_us_dedes/oc.m3.d6:ocVE.Stichera3.incipit	You willingly were hung upon…
ltx/en_us_dedes/oc.m3.d6:ocVE.Stichera3.melody	@ltx/en_us_dedes/he.a.m3:heAU.MegaliTouStavrouSou.name
ltx/en_us_dedes/oc.m3.d6:ocVE.Stichera3.mode	@ltx/en_us_dedes/miscellanea:misc.Mode3
ltx/en_us_dedes/oc.m3.d6:ocVE.Stichera3.text	You willingly were hung upon the Cross, O gracious Lord, * and unto Your own Father * were offered as a sacrifice; * and You ended sacrifices unto idols, * and destroyed the dominion * of the malignant one, * O King of all the ages.
ltx/en_us_dedes/oc.m3.d6:ocVE.Stichera4.greekmelody	@ltx/en_us_dedes/he.a.m3:heAU.StavrofanosMoysis.greekname
ltx/en_us_dedes/oc.m3.d6:ocVE.Stichera4.incipit	…
ltx/en_us_dedes/oc.m3.d6:ocVE.Stichera4.melody	@ltx/en_us_dedes/he.a.m3:heAU.StavrofanosMoysis.name
ltx/en_us_dedes/oc.m3.d6:ocVE.Stichera4.mode	@ltx/en_us_dedes/miscellanea:misc.Mode3
ltx/en_us_dedes/oc.m3.d6:ocVE.Stichera4.text	
ltx/en_us_dedes/oc.m3.d6:ocVE.Stichera5.incipit	…
ltx/en_us_dedes/oc.m3.d6:ocVE.Stichera5.melody	@ltx/en_us_dedes/he.a.m3:heAU.StavrofanosMoysis.name
ltx/en_us_dedes/oc.m3.d6:ocVE.Stichera5.mode	@ltx/en_us_dedes/miscellanea:misc.Mode3
ltx/en_us_dedes/oc.m3.d6:ocVE.Stichera5.text	
ltx/en_us_dedes/oc.m3.d6:ocVE.Stichera6.incipit	He who of old beguiled…
ltx/en_us_dedes/oc.m3.d6:ocVE.Stichera6.melody	@ltx/en_us_dedes/he.a.m3:heAU.StavrofanosMoysis.name
ltx/en_us_dedes/oc.m3.d6:ocVE.Stichera6.mode	@ltx/en_us_dedes/miscellanea:misc.Mode3
ltx/en_us_dedes/oc.m3.d6:ocVE.Stichera6.text	He who of old beguiled Adam in Eden * to disobey his Creator, * the same now having seduced me, * turning me off of the straight way, * has thrown me into the ditch of many sins on an impassable byway, * and the hellion dares to vaunt * as he beholds me completely fallen down. * So with the sword of your intercessions, O Virgin, * smite him down and free me from his snares, * since you are most compassionate.
ltx/en_us_dedes/oc.m3.d6:octrMA.Kathisma11.greekmelody	@ltx/en_us_dedes/oc.m3.d6:ocMA.Kathisma22.greekmelody
ltx/en_us_dedes/oc.m3.d6:octrMA.Kathisma11.incipit	@ltx/en_us_dedes/oc.m3.d6:ocMA.Kathisma22.incipit
ltx/en_us_dedes/oc.m3.d6:octrMA.Kathisma11.melody	@ltx/en_us_dedes/oc.m3.d6:ocMA.Kathisma22.melody
ltx/en_us_dedes/oc.m3.d6:octrMA.Kathisma11.mode	@ltx/en_us_dedes/miscellanea:misc.Mode3
ltx/en_us_dedes/oc.m3.d6:octrMA.Kathisma11.text	@ltx/en_us_dedes/oc.m3.d6:ocMA.Kathisma22.text
ltx/en_us_dedes/oc.m3.d6:octrMA.Kathisma12.incipit	@ltx/en_us_dedes/oc.m3.d6:ocMA.Kathisma12.incipit
ltx/en_us_dedes/oc.m3.d6:octrMA.Kathisma12.melody	@ltx/en_us_dedes/oc.m3.d6:ocMA.Kathisma12.melody
ltx/en_us_dedes/oc.m3.d6:octrMA.Kathisma12.mode	@ltx/en_us_dedes/miscellanea:misc.Mode3
ltx/en_us_dedes/oc.m3.d6:octrMA.Kathisma12.text	@ltx/en_us_dedes/oc.m3.d6:ocMA.Kathisma12.text
ltx/en_us_dedes/oc.m3.d6:octrMA.Kathisma1T.greekmelody	@ltx/en_us_dedes/he.a.m3:heAU.TinOraiotita.greekname
ltx/en_us_dedes/oc.m3.d6:octrMA.Kathisma1T.incipit	O tender-loving Lord, willingly You…
ltx/en_us_dedes/oc.m3.d6:octrMA.Kathisma1T.melody	@ltx/en_us_dedes/he.a.m3:heAU.TinOraiotita.name
ltx/en_us_dedes/oc.m3.d6:octrMA.Kathisma1T.mode	@ltx/en_us_dedes/miscellanea:misc.Mode3
ltx/en_us_dedes/oc.m3.d6:octrMA.Kathisma1T.text	O tender-loving Lord, willingly You endured * a very painful death by being crucified. * And as Your Mother witnessed it, O Christ, she was pricked in the heart. * At her earnest prayers for us, * O benevolent and humane * Master in You tender love * and compassion take pity on us, * and save the world, O merciful Savior * who takes away the sin of the world.
ltx/en_us_dedes/oc.m3.d6:octrMA.Ode7Martyricon.incipit	@ltx/en_us_dedes/oc.m3.d5:ocMA.Kathisma32.incipit
ltx/en_us_dedes/oc.m3.d6:octrMA.Ode7Martyricon.melody	
ltx/en_us_dedes/oc.m3.d6:octrMA.Ode7Martyricon.mode	@ltx/en_us_dedes/miscellanea:misc.Mode3
ltx/en_us_dedes/oc.m3.d6:octrMA.Ode7Martyricon.text	@ltx/en_us_dedes/oc.m3.d5:ocMA.Kathisma32.text
ltx/en_us_dedes/oc.m3.d6:octrMA.Photogogic.incipit	@ltx/en_us_dedes/oc.m3.d2:octrMA.Photagogic.incipit
ltx/en_us_dedes/oc.m3.d6:octrMA.Photogogic.mode	@ltx/en_us_dedes/miscellanea:misc.Mode3
ltx/en_us_dedes/oc.m3.d6:octrMA.Photogogic.text	@ltx/en_us_dedes/oc.m3.d2:octrMA.Photagogic.text
ltx/en_us_dedes/oc.m3.d6:octrMA.Triadic1.incipit	@ltx/en_us_dedes/oc.m3.d2:octrMA.Triadic1.incipit
ltx/en_us_dedes/oc.m3.d6:octrMA.Triadic1.mode	@ltx/en_us_dedes/miscellanea:misc.Mode3
ltx/en_us_dedes/oc.m3.d6:octrMA.Triadic1.text	@ltx/en_us_dedes/oc.m3.d2:octrMA.Triadic1.text
ltx/en_us_dedes/oc.m3.d6:octrMA.Triadic2.incipit	@ltx/en_us_dedes/oc.m3.d2:octrMA.Triadic2.incipit
ltx/en_us_dedes/oc.m3.d6:octrMA.Triadic2.mode	@ltx/en_us_dedes/miscellanea:misc.Mode3
ltx/en_us_dedes/oc.m3.d6:octrMA.Triadic2.text	@ltx/en_us_dedes/oc.m3.d2:octrMA.Triadic2.text
ltx/en_us_dedes/oc.m3.d6:octrMA.Triadic3.incipit	@ltx/en_us_dedes/oc.m3.d2:octrMA.Triadic3.incipit
ltx/en_us_dedes/oc.m3.d6:octrMA.Triadic3.mode	@ltx/en_us_dedes/miscellanea:misc.Mode3
ltx/en_us_dedes/oc.m3.d6:octrMA.Triadic3.text	@ltx/en_us_dedes/oc.m3.d2:octrMA.Triadic3.text
