ltx/en_us_dedes/sy.m09.d27:syMA.commemoration01.couplet1.title	@ltx/en_us_dedes/titles:ti.Verses
ltx/en_us_dedes/sy.m09.d27:syMA.commemoration01.couplet1.verse1	
ltx/en_us_dedes/sy.m09.d27:syMA.commemoration01.couplet1.verse2	
ltx/en_us_dedes/sy.m09.d27:syMA.commemoration01.couplet2.title	For the 49 holy Martyrs
ltx/en_us_dedes/sy.m09.d27:syMA.commemoration01.couplet2.verse1	
ltx/en_us_dedes/sy.m09.d27:syMA.commemoration01.couplet2.verse2	
ltx/en_us_dedes/sy.m09.d27:syMA.commemoration01.narration.p01	
ltx/en_us_dedes/sy.m09.d27:syMA.commemoration01.single1	
ltx/en_us_dedes/sy.m09.d27:syMA.commemoration01.text	On September 27 we commemorate the holy Martyr Callistratus and the 49 Martyrs with him.
ltx/en_us_dedes/sy.m09.d27:syMA.commemoration02.couplet1.title	@ltx/en_us_dedes/titles:ti.Verses
ltx/en_us_dedes/sy.m09.d27:syMA.commemoration02.couplet1.verse1	
ltx/en_us_dedes/sy.m09.d27:syMA.commemoration02.couplet1.verse2	
ltx/en_us_dedes/sy.m09.d27:syMA.commemoration02.narration.p01	
ltx/en_us_dedes/sy.m09.d27:syMA.commemoration02.text	On this day we also commemorate the holy woman Martyr Epicharis.
ltx/en_us_dedes/sy.m09.d27:syMA.commemoration03.narration.p01	
ltx/en_us_dedes/sy.m09.d27:syMA.commemoration03.narration.p02	
ltx/en_us_dedes/sy.m09.d27:syMA.commemoration03.text	On this day we also commemorate our devout Father St. Ignatios, Abbot of the Monastery of The Savior Christ, which is called the Monastery of the Deep Stream.
ltx/en_us_dedes/sy.m09.d27:syMA.commemoration04.narration.p01	
ltx/en_us_dedes/sy.m09.d27:syMA.commemoration04.text	On this day we also commemorate the holy Apostles Mark, Aristarchos, and Zeno.
ltx/en_us_dedes/sy.m09.d27:syMA.commemoration05.couplet1.title	@ltx/en_us_dedes/titles:ti.Verses
ltx/en_us_dedes/sy.m09.d27:syMA.commemoration05.couplet1.verse1	
ltx/en_us_dedes/sy.m09.d27:syMA.commemoration05.couplet1.verse2	
ltx/en_us_dedes/sy.m09.d27:syMA.commemoration05.text	On this day we also commemorate the holy Martyrs Philemon the bishop, and Fortunianos; and the holy woman Martyr Gaiana.
ltx/en_us_dedes/sy.m09.d27:syMA.commemoration06.couplet1.title	@ltx/en_us_dedes/titles:ti.Verses
ltx/en_us_dedes/sy.m09.d27:syMA.commemoration06.couplet1.verse1	
ltx/en_us_dedes/sy.m09.d27:syMA.commemoration06.couplet1.verse2	
ltx/en_us_dedes/sy.m09.d27:syMA.commemoration06.text	On this day we also remember the 15 Martyrs who were put on a ship, which was set on fire, and then drowned at sea.
ltx/en_us_dedes/sy.m09.d27:syMA.commemoration07.text	On this day the holy Neo-Martyr Aquilina the virgin, who died in the year 1764.
ltx/en_us_dedes/sy.m09.d27:syMA.lastline	By the intercessions of Your Saints, O God, have mercy on us. Amen.
