ltx/en_us_dedes/me.m04.d17:meDA.commemoration.first	Memory of Holy Hieromartyr Symeon of Persia and those with him
ltx/en_us_dedes/me.m04.d17:meDA.commemoration.first_name	
ltx/en_us_dedes/me.m04.d17:meDA.commemoration.first_short	Memory of Holy Hieromartyr Symeon of Persia and those with him
ltx/en_us_dedes/me.m04.d17:meDA.commemoration.first_title	@ltx/en_us_dedes/titles:ti.Saints
ltx/en_us_dedes/me.m04.d17:meDA.commemoration.full	Memory of Holy Hieromartyr Symeon of Persia and those with him
ltx/en_us_dedes/me.m04.d17:meDA.commemoration.second_name	
ltx/en_us_dedes/me.m04.d17:meDA.commemoration.second_title	
ltx/en_us_dedes/me.m04.d17:meDA.date	April 17
ltx/en_us_dedes/me.m04.d17:meDA.fordate	for April 17
ltx/en_us_dedes/me.m04.d17:meDA.insert1	
ltx/en_us_dedes/me.m04.d17:meDA.insert2	
ltx/en_us_dedes/me.m04.d17:meDA.note	
ltx/en_us_dedes/me.m04.d17:meDA.pdfcoverdate	April 17,
ltx/en_us_dedes/me.m04.d17:meDA.pdfheaderdate	April 17
ltx/en_us_dedes/me.m04.d17:meHO.commemorations	
ltx/en_us_dedes/me.m04.d17:meHO.note1	
ltx/en_us_dedes/me.m04.d17:meHO.note2	
ltx/en_us_dedes/me.m04.d17:meHO.number	
ltx/en_us_dedes/me.m04.d17:meHO.rank	
ltx/en_us_dedes/me.m04.d17:meLE.commemoration1	
ltx/en_us_dedes/me.m04.d17:meLE.commemoration2	
ltx/en_us_dedes/me.m04.d17:meLI.Kontakion1.incipit	@ltx/en_us_dedes/me.m04.d17:meMA.Kontakion1ger.incipit
ltx/en_us_dedes/me.m04.d17:meLI.Kontakion1.melody	@ltx/en_us_dedes/me.m04.d17:meMA.Kontakion1ger.melody
ltx/en_us_dedes/me.m04.d17:meLI.Kontakion1.mode	@ltx/en_us_dedes/me.m04.d17:meMA.Kontakion1ger.mode
ltx/en_us_dedes/me.m04.d17:meLI.Kontakion1.text	@ltx/en_us_dedes/me.m04.d17:meMA.Kontakion1ger.text
ltx/en_us_dedes/me.m04.d17:meLI.MM.CommunionHymn.text	@ltx/en_us_dedes/properties:media.key
ltx/en_us_dedes/me.m04.d17:meLI.Megalynarion.text	
ltx/en_us_dedes/me.m04.d17:meMA.C1.acrostic.notice1	
ltx/en_us_dedes/me.m04.d17:meMA.C1.acrostic.text	
ltx/en_us_dedes/me.m04.d17:meMA.C1.acrostic.title	
ltx/en_us_dedes/me.m04.d17:meMA.C1.title	@ltx/en_us_dedes/titles:ti.CanonSaintM
ltx/en_us_dedes/me.m04.d17:meMA.C1.verse	@ltx/en_us_dedes/prayers:pr.verse_SaintM.text
ltx/en_us_dedes/me.m04.d17:meMA.Kontakion1ger.incipit	…
ltx/en_us_dedes/me.m04.d17:meMA.Kontakion1ger.melody	@ltx/en_us_dedes/he.a.m4:heAU.EpefanisSimeron.name
ltx/en_us_dedes/me.m04.d17:meMA.Kontakion1ger.mode	@ltx/en_us_dedes/miscellanea:misc.Mode4
ltx/en_us_dedes/me.m04.d17:meMA.Kontakion1ger.poet	@ltx/en_us_dedes/poets:po.Gerasimou
ltx/en_us_dedes/me.m04.d17:meMA.Kontakion1ger.text	
ltx/en_us_dedes/me.m04.d17:meMA.Ode1C11.greekmelody	@ltx/en_us_dedes/he.h.m5:heHE.IpponKaiAnavatin.greekname
ltx/en_us_dedes/me.m04.d17:meMA.Ode1C11.incipit	…
ltx/en_us_dedes/me.m04.d17:meMA.Ode1C11.melody	@ltx/en_us_dedes/he.h.m5:heHE.IpponKaiAnavatin.name
ltx/en_us_dedes/me.m04.d17:meMA.Ode1C11.mode	@ltx/en_us_dedes/miscellanea:misc.Mode5
ltx/en_us_dedes/me.m04.d17:meMA.Ode1C11.ode	@ltx/en_us_dedes/miscellanea:misc.Ode1
ltx/en_us_dedes/me.m04.d17:meMA.Ode1C11.text	
ltx/en_us_dedes/me.m04.d17:meMA.Ode1C12.incipit	…
ltx/en_us_dedes/me.m04.d17:meMA.Ode1C12.melody	@ltx/en_us_dedes/he.h.m5:heHE.IpponKaiAnavatin.name
ltx/en_us_dedes/me.m04.d17:meMA.Ode1C12.mode	@ltx/en_us_dedes/miscellanea:misc.Mode5
ltx/en_us_dedes/me.m04.d17:meMA.Ode1C12.ode	@ltx/en_us_dedes/miscellanea:misc.Ode1
ltx/en_us_dedes/me.m04.d17:meMA.Ode1C12.text	
ltx/en_us_dedes/me.m04.d17:meMA.Ode1C13.incipit	…
ltx/en_us_dedes/me.m04.d17:meMA.Ode1C13.melody	@ltx/en_us_dedes/he.h.m5:heHE.IpponKaiAnavatin.name
ltx/en_us_dedes/me.m04.d17:meMA.Ode1C13.mode	@ltx/en_us_dedes/miscellanea:misc.Mode5
ltx/en_us_dedes/me.m04.d17:meMA.Ode1C13.ode	@ltx/en_us_dedes/miscellanea:misc.Ode1
ltx/en_us_dedes/me.m04.d17:meMA.Ode1C13.text	
ltx/en_us_dedes/me.m04.d17:meMA.Ode1C1H.greekmelody	@ltx/en_us_dedes/he.h.m5:heHE.IpponKaiAnavatin.greekname
ltx/en_us_dedes/me.m04.d17:meMA.Ode1C1H.incipit	@ltx/en_us_dedes/he.h.m5:heHE.IpponKaiAnavatin.incipit
ltx/en_us_dedes/me.m04.d17:meMA.Ode1C1H.melody	@ltx/en_us_dedes/he.h.m5:heHE.IpponKaiAnavatin.melody
ltx/en_us_dedes/me.m04.d17:meMA.Ode1C1H.mode	@ltx/en_us_dedes/miscellanea:misc.Mode5
ltx/en_us_dedes/me.m04.d17:meMA.Ode1C1H.ode	@ltx/en_us_dedes/miscellanea:misc.Ode1
ltx/en_us_dedes/me.m04.d17:meMA.Ode1C1H.text	@ltx/en_us_dedes/he.h.m5:heHE.IpponKaiAnavatin.text
ltx/en_us_dedes/me.m04.d17:meMA.Ode1C1T.incipit	…
ltx/en_us_dedes/me.m04.d17:meMA.Ode1C1T.melody	@ltx/en_us_dedes/he.h.m5:heHE.IpponKaiAnavatin.name
ltx/en_us_dedes/me.m04.d17:meMA.Ode1C1T.mode	@ltx/en_us_dedes/miscellanea:misc.Mode5
ltx/en_us_dedes/me.m04.d17:meMA.Ode1C1T.ode	@ltx/en_us_dedes/miscellanea:misc.Ode1
ltx/en_us_dedes/me.m04.d17:meMA.Ode1C1T.text	
ltx/en_us_dedes/me.m04.d17:meMA.Ode3C11.greekmelody	@ltx/en_us_dedes/he.h.m5:heHE.OPixasEpOudenos.greekname
ltx/en_us_dedes/me.m04.d17:meMA.Ode3C11.incipit	…
ltx/en_us_dedes/me.m04.d17:meMA.Ode3C11.melody	@ltx/en_us_dedes/he.h.m5:heHE.OPixasEpOudenos.name
ltx/en_us_dedes/me.m04.d17:meMA.Ode3C11.mode	@ltx/en_us_dedes/miscellanea:misc.Mode5
ltx/en_us_dedes/me.m04.d17:meMA.Ode3C11.ode	@ltx/en_us_dedes/miscellanea:misc.Ode3
ltx/en_us_dedes/me.m04.d17:meMA.Ode3C11.text	
ltx/en_us_dedes/me.m04.d17:meMA.Ode3C12.incipit	…
ltx/en_us_dedes/me.m04.d17:meMA.Ode3C12.melody	@ltx/en_us_dedes/he.h.m5:heHE.OPixasEpOudenos.name
ltx/en_us_dedes/me.m04.d17:meMA.Ode3C12.mode	@ltx/en_us_dedes/miscellanea:misc.Mode5
ltx/en_us_dedes/me.m04.d17:meMA.Ode3C12.ode	@ltx/en_us_dedes/miscellanea:misc.Ode3
ltx/en_us_dedes/me.m04.d17:meMA.Ode3C12.text	
ltx/en_us_dedes/me.m04.d17:meMA.Ode3C13.incipit	…
ltx/en_us_dedes/me.m04.d17:meMA.Ode3C13.melody	@ltx/en_us_dedes/he.h.m5:heHE.OPixasEpOudenos.name
ltx/en_us_dedes/me.m04.d17:meMA.Ode3C13.mode	@ltx/en_us_dedes/miscellanea:misc.Mode5
ltx/en_us_dedes/me.m04.d17:meMA.Ode3C13.ode	@ltx/en_us_dedes/miscellanea:misc.Ode3
ltx/en_us_dedes/me.m04.d17:meMA.Ode3C13.text	
ltx/en_us_dedes/me.m04.d17:meMA.Ode3C1H.greekmelody	@ltx/en_us_dedes/he.h.m5:heHE.OPixasEpOudenos.greekname
ltx/en_us_dedes/me.m04.d17:meMA.Ode3C1H.incipit	@ltx/en_us_dedes/he.h.m5:heHE.OPixasEpOudenos.incipit
ltx/en_us_dedes/me.m04.d17:meMA.Ode3C1H.melody	@ltx/en_us_dedes/he.h.m5:heHE.OPixasEpOudenos.melody
ltx/en_us_dedes/me.m04.d17:meMA.Ode3C1H.mode	@ltx/en_us_dedes/miscellanea:misc.Mode5
ltx/en_us_dedes/me.m04.d17:meMA.Ode3C1H.ode	@ltx/en_us_dedes/miscellanea:misc.Ode3
ltx/en_us_dedes/me.m04.d17:meMA.Ode3C1H.text	@ltx/en_us_dedes/he.h.m5:heHE.OPixasEpOudenos.text
ltx/en_us_dedes/me.m04.d17:meMA.Ode3C1T.incipit	…
ltx/en_us_dedes/me.m04.d17:meMA.Ode3C1T.melody	@ltx/en_us_dedes/he.h.m5:heHE.OPixasEpOudenos.name
ltx/en_us_dedes/me.m04.d17:meMA.Ode3C1T.mode	@ltx/en_us_dedes/miscellanea:misc.Mode5
ltx/en_us_dedes/me.m04.d17:meMA.Ode3C1T.ode	@ltx/en_us_dedes/miscellanea:misc.Ode3
ltx/en_us_dedes/me.m04.d17:meMA.Ode3C1T.text	
ltx/en_us_dedes/me.m04.d17:meMA.Ode3Kathisma1.greekmelody	@ltx/en_us_dedes/he.a.m1:heAU.TonTafonSouSotir.greekname
ltx/en_us_dedes/me.m04.d17:meMA.Ode3Kathisma1.incipit	…
ltx/en_us_dedes/me.m04.d17:meMA.Ode3Kathisma1.melody	@ltx/en_us_dedes/he.a.m1:heAU.TonTafonSouSotir.name
ltx/en_us_dedes/me.m04.d17:meMA.Ode3Kathisma1.mode	@ltx/en_us_dedes/miscellanea:misc.Mode1
ltx/en_us_dedes/me.m04.d17:meMA.Ode3Kathisma1.text	
ltx/en_us_dedes/me.m04.d17:meMA.Ode3KathismaSt.incipit	@ltx/en_us_dedes/oc.m1.d4:octrMA.Kathisma11.incipit
ltx/en_us_dedes/me.m04.d17:meMA.Ode3KathismaSt.melody	@ltx/en_us_dedes/he.a.m1:heAU.TonTafonSouSotir.name
ltx/en_us_dedes/me.m04.d17:meMA.Ode3KathismaSt.mode	@ltx/en_us_dedes/miscellanea:misc.Mode1
ltx/en_us_dedes/me.m04.d17:meMA.Ode3KathismaSt.text	@ltx/en_us_dedes/oc.m1.d4:octrMA.Kathisma11.text
ltx/en_us_dedes/me.m04.d17:meMA.Ode3KathismaT.incipit	@ltx/en_us_dedes/oc.m1.d1:ocMA.Kathisma23.incipit
ltx/en_us_dedes/me.m04.d17:meMA.Ode3KathismaT.melody	@ltx/en_us_dedes/he.a.m1:heAU.TonTafonSouSotir.name
ltx/en_us_dedes/me.m04.d17:meMA.Ode3KathismaT.mode	@ltx/en_us_dedes/miscellanea:misc.Mode1
ltx/en_us_dedes/me.m04.d17:meMA.Ode3KathismaT.text	@ltx/en_us_dedes/oc.m1.d1:ocMA.Kathisma23.text
ltx/en_us_dedes/me.m04.d17:meMA.Ode4C11.greekmelody	@ltx/en_us_dedes/he.h.m5:heHE.TinTheianEnnoisas.greekname
ltx/en_us_dedes/me.m04.d17:meMA.Ode4C11.incipit	…
ltx/en_us_dedes/me.m04.d17:meMA.Ode4C11.melody	@ltx/en_us_dedes/he.h.m5:heHE.TinTheianEnnoisas.name
ltx/en_us_dedes/me.m04.d17:meMA.Ode4C11.mode	@ltx/en_us_dedes/miscellanea:misc.Mode5
ltx/en_us_dedes/me.m04.d17:meMA.Ode4C11.ode	@ltx/en_us_dedes/miscellanea:misc.Ode4
ltx/en_us_dedes/me.m04.d17:meMA.Ode4C11.text	
ltx/en_us_dedes/me.m04.d17:meMA.Ode4C12.incipit	…
ltx/en_us_dedes/me.m04.d17:meMA.Ode4C12.melody	@ltx/en_us_dedes/he.h.m5:heHE.TinTheianEnnoisas.name
ltx/en_us_dedes/me.m04.d17:meMA.Ode4C12.mode	@ltx/en_us_dedes/miscellanea:misc.Mode5
ltx/en_us_dedes/me.m04.d17:meMA.Ode4C12.ode	@ltx/en_us_dedes/miscellanea:misc.Ode4
ltx/en_us_dedes/me.m04.d17:meMA.Ode4C12.text	
ltx/en_us_dedes/me.m04.d17:meMA.Ode4C13.incipit	…
ltx/en_us_dedes/me.m04.d17:meMA.Ode4C13.melody	@ltx/en_us_dedes/he.h.m5:heHE.TinTheianEnnoisas.name
ltx/en_us_dedes/me.m04.d17:meMA.Ode4C13.mode	@ltx/en_us_dedes/miscellanea:misc.Mode5
ltx/en_us_dedes/me.m04.d17:meMA.Ode4C13.ode	@ltx/en_us_dedes/miscellanea:misc.Ode4
ltx/en_us_dedes/me.m04.d17:meMA.Ode4C13.text	
ltx/en_us_dedes/me.m04.d17:meMA.Ode4C1H.greekmelody	@ltx/en_us_dedes/he.h.m5:heHE.TinTheianEnnoisas.greekname
ltx/en_us_dedes/me.m04.d17:meMA.Ode4C1H.incipit	@ltx/en_us_dedes/he.h.m5:heHE.TinTheianEnnoisas.incipit
ltx/en_us_dedes/me.m04.d17:meMA.Ode4C1H.melody	@ltx/en_us_dedes/he.h.m5:heHE.TinTheianEnnoisas.melody
ltx/en_us_dedes/me.m04.d17:meMA.Ode4C1H.mode	@ltx/en_us_dedes/miscellanea:misc.Mode5
ltx/en_us_dedes/me.m04.d17:meMA.Ode4C1H.ode	@ltx/en_us_dedes/miscellanea:misc.Ode4
ltx/en_us_dedes/me.m04.d17:meMA.Ode4C1H.text	@ltx/en_us_dedes/he.h.m5:heHE.TinTheianEnnoisas.text
ltx/en_us_dedes/me.m04.d17:meMA.Ode4C1T.incipit	…
ltx/en_us_dedes/me.m04.d17:meMA.Ode4C1T.melody	@ltx/en_us_dedes/he.h.m5:heHE.TinTheianEnnoisas.name
ltx/en_us_dedes/me.m04.d17:meMA.Ode4C1T.mode	@ltx/en_us_dedes/miscellanea:misc.Mode5
ltx/en_us_dedes/me.m04.d17:meMA.Ode4C1T.ode	@ltx/en_us_dedes/miscellanea:misc.Ode4
ltx/en_us_dedes/me.m04.d17:meMA.Ode4C1T.text	
ltx/en_us_dedes/me.m04.d17:meMA.Ode5C11.greekmelody	@ltx/en_us_dedes/he.h.m5:heHE.OAnavallomenos.greekname
ltx/en_us_dedes/me.m04.d17:meMA.Ode5C11.incipit	…
ltx/en_us_dedes/me.m04.d17:meMA.Ode5C11.melody	@ltx/en_us_dedes/he.h.m5:heHE.OAnavallomenos.name
ltx/en_us_dedes/me.m04.d17:meMA.Ode5C11.mode	@ltx/en_us_dedes/miscellanea:misc.Mode5
ltx/en_us_dedes/me.m04.d17:meMA.Ode5C11.ode	@ltx/en_us_dedes/miscellanea:misc.Ode5
ltx/en_us_dedes/me.m04.d17:meMA.Ode5C11.text	
ltx/en_us_dedes/me.m04.d17:meMA.Ode5C12.incipit	…
ltx/en_us_dedes/me.m04.d17:meMA.Ode5C12.melody	@ltx/en_us_dedes/he.h.m5:heHE.OAnavallomenos.name
ltx/en_us_dedes/me.m04.d17:meMA.Ode5C12.mode	@ltx/en_us_dedes/miscellanea:misc.Mode5
ltx/en_us_dedes/me.m04.d17:meMA.Ode5C12.ode	@ltx/en_us_dedes/miscellanea:misc.Ode5
ltx/en_us_dedes/me.m04.d17:meMA.Ode5C12.text	
ltx/en_us_dedes/me.m04.d17:meMA.Ode5C13.incipit	…
ltx/en_us_dedes/me.m04.d17:meMA.Ode5C13.melody	@ltx/en_us_dedes/he.h.m5:heHE.OAnavallomenos.name
ltx/en_us_dedes/me.m04.d17:meMA.Ode5C13.mode	@ltx/en_us_dedes/miscellanea:misc.Mode5
ltx/en_us_dedes/me.m04.d17:meMA.Ode5C13.ode	@ltx/en_us_dedes/miscellanea:misc.Ode5
ltx/en_us_dedes/me.m04.d17:meMA.Ode5C13.text	
ltx/en_us_dedes/me.m04.d17:meMA.Ode5C1H.greekmelody	@ltx/en_us_dedes/he.h.m5:heHE.OAnavallomenos.greekname
ltx/en_us_dedes/me.m04.d17:meMA.Ode5C1H.incipit	@ltx/en_us_dedes/he.h.m5:heHE.OAnavallomenos.incipit
ltx/en_us_dedes/me.m04.d17:meMA.Ode5C1H.melody	@ltx/en_us_dedes/he.h.m5:heHE.OAnavallomenos.melody
ltx/en_us_dedes/me.m04.d17:meMA.Ode5C1H.mode	@ltx/en_us_dedes/miscellanea:misc.Mode5
ltx/en_us_dedes/me.m04.d17:meMA.Ode5C1H.ode	@ltx/en_us_dedes/miscellanea:misc.Ode5
ltx/en_us_dedes/me.m04.d17:meMA.Ode5C1H.text	@ltx/en_us_dedes/he.h.m5:heHE.OAnavallomenos.text
ltx/en_us_dedes/me.m04.d17:meMA.Ode5C1T.incipit	…
ltx/en_us_dedes/me.m04.d17:meMA.Ode5C1T.melody	@ltx/en_us_dedes/he.h.m5:heHE.OAnavallomenos.name
ltx/en_us_dedes/me.m04.d17:meMA.Ode5C1T.mode	@ltx/en_us_dedes/miscellanea:misc.Mode5
ltx/en_us_dedes/me.m04.d17:meMA.Ode5C1T.ode	@ltx/en_us_dedes/miscellanea:misc.Ode5
ltx/en_us_dedes/me.m04.d17:meMA.Ode5C1T.text	
ltx/en_us_dedes/me.m04.d17:meMA.Ode6C11.greekmelody	@ltx/en_us_dedes/he.h.m5:heHE.MainomeninKlydoni.greekname
ltx/en_us_dedes/me.m04.d17:meMA.Ode6C11.incipit	…
ltx/en_us_dedes/me.m04.d17:meMA.Ode6C11.melody	@ltx/en_us_dedes/he.h.m5:heHE.MainomeninKlydoni.name
ltx/en_us_dedes/me.m04.d17:meMA.Ode6C11.mode	@ltx/en_us_dedes/miscellanea:misc.Mode5
ltx/en_us_dedes/me.m04.d17:meMA.Ode6C11.ode	@ltx/en_us_dedes/miscellanea:misc.Ode6
ltx/en_us_dedes/me.m04.d17:meMA.Ode6C11.text	
ltx/en_us_dedes/me.m04.d17:meMA.Ode6C12.incipit	…
ltx/en_us_dedes/me.m04.d17:meMA.Ode6C12.melody	@ltx/en_us_dedes/he.h.m5:heHE.MainomeninKlydoni.name
ltx/en_us_dedes/me.m04.d17:meMA.Ode6C12.mode	@ltx/en_us_dedes/miscellanea:misc.Mode5
ltx/en_us_dedes/me.m04.d17:meMA.Ode6C12.ode	@ltx/en_us_dedes/miscellanea:misc.Ode6
ltx/en_us_dedes/me.m04.d17:meMA.Ode6C12.text	
ltx/en_us_dedes/me.m04.d17:meMA.Ode6C13.incipit	…
ltx/en_us_dedes/me.m04.d17:meMA.Ode6C13.melody	@ltx/en_us_dedes/he.h.m5:heHE.MainomeninKlydoni.name
ltx/en_us_dedes/me.m04.d17:meMA.Ode6C13.mode	@ltx/en_us_dedes/miscellanea:misc.Mode5
ltx/en_us_dedes/me.m04.d17:meMA.Ode6C13.ode	@ltx/en_us_dedes/miscellanea:misc.Ode6
ltx/en_us_dedes/me.m04.d17:meMA.Ode6C13.text	
ltx/en_us_dedes/me.m04.d17:meMA.Ode6C1H.greekmelody	@ltx/en_us_dedes/he.h.m5:heHE.MainomeninKlydoni.greekname
ltx/en_us_dedes/me.m04.d17:meMA.Ode6C1H.incipit	@ltx/en_us_dedes/he.h.m5:heHE.MainomeninKlydoni.incipit
ltx/en_us_dedes/me.m04.d17:meMA.Ode6C1H.melody	@ltx/en_us_dedes/he.h.m5:heHE.MainomeninKlydoni.melody
ltx/en_us_dedes/me.m04.d17:meMA.Ode6C1H.mode	@ltx/en_us_dedes/miscellanea:misc.Mode5
ltx/en_us_dedes/me.m04.d17:meMA.Ode6C1H.ode	@ltx/en_us_dedes/miscellanea:misc.Ode6
ltx/en_us_dedes/me.m04.d17:meMA.Ode6C1H.text	@ltx/en_us_dedes/he.h.m5:heHE.MainomeninKlydoni.text
ltx/en_us_dedes/me.m04.d17:meMA.Ode6C1T.incipit	…
ltx/en_us_dedes/me.m04.d17:meMA.Ode6C1T.melody	@ltx/en_us_dedes/he.h.m5:heHE.MainomeninKlydoni.name
ltx/en_us_dedes/me.m04.d17:meMA.Ode6C1T.mode	@ltx/en_us_dedes/miscellanea:misc.Mode5
ltx/en_us_dedes/me.m04.d17:meMA.Ode6C1T.ode	@ltx/en_us_dedes/miscellanea:misc.Ode6
ltx/en_us_dedes/me.m04.d17:meMA.Ode6C1T.text	
ltx/en_us_dedes/me.m04.d17:meMA.Ode7C11.greekmelody	@ltx/en_us_dedes/he.h.m5:heHE.OYperypsoumenos.greekname
ltx/en_us_dedes/me.m04.d17:meMA.Ode7C11.incipit	…
ltx/en_us_dedes/me.m04.d17:meMA.Ode7C11.melody	@ltx/en_us_dedes/he.h.m5:heHE.OYperypsoumenos.name
ltx/en_us_dedes/me.m04.d17:meMA.Ode7C11.mode	@ltx/en_us_dedes/miscellanea:misc.Mode5
ltx/en_us_dedes/me.m04.d17:meMA.Ode7C11.ode	@ltx/en_us_dedes/miscellanea:misc.Ode7
ltx/en_us_dedes/me.m04.d17:meMA.Ode7C11.text	
ltx/en_us_dedes/me.m04.d17:meMA.Ode7C12.incipit	…
ltx/en_us_dedes/me.m04.d17:meMA.Ode7C12.melody	@ltx/en_us_dedes/he.h.m5:heHE.OYperypsoumenos.name
ltx/en_us_dedes/me.m04.d17:meMA.Ode7C12.mode	@ltx/en_us_dedes/miscellanea:misc.Mode5
ltx/en_us_dedes/me.m04.d17:meMA.Ode7C12.ode	@ltx/en_us_dedes/miscellanea:misc.Ode7
ltx/en_us_dedes/me.m04.d17:meMA.Ode7C12.text	
ltx/en_us_dedes/me.m04.d17:meMA.Ode7C13.incipit	…
ltx/en_us_dedes/me.m04.d17:meMA.Ode7C13.melody	@ltx/en_us_dedes/he.h.m5:heHE.OYperypsoumenos.name
ltx/en_us_dedes/me.m04.d17:meMA.Ode7C13.mode	@ltx/en_us_dedes/miscellanea:misc.Mode5
ltx/en_us_dedes/me.m04.d17:meMA.Ode7C13.ode	@ltx/en_us_dedes/miscellanea:misc.Ode7
ltx/en_us_dedes/me.m04.d17:meMA.Ode7C13.text	
ltx/en_us_dedes/me.m04.d17:meMA.Ode7C1H.greekmelody	@ltx/en_us_dedes/he.h.m5:heHE.OYperypsoumenos.greekname
ltx/en_us_dedes/me.m04.d17:meMA.Ode7C1H.incipit	@ltx/en_us_dedes/he.h.m5:heHE.OYperypsoumenos.incipit
ltx/en_us_dedes/me.m04.d17:meMA.Ode7C1H.melody	@ltx/en_us_dedes/he.h.m5:heHE.OYperypsoumenos.melody
ltx/en_us_dedes/me.m04.d17:meMA.Ode7C1H.mode	@ltx/en_us_dedes/miscellanea:misc.Mode5
ltx/en_us_dedes/me.m04.d17:meMA.Ode7C1H.ode	@ltx/en_us_dedes/miscellanea:misc.Ode7
ltx/en_us_dedes/me.m04.d17:meMA.Ode7C1H.text	@ltx/en_us_dedes/he.h.m5:heHE.OYperypsoumenos.text
ltx/en_us_dedes/me.m04.d17:meMA.Ode7C1T.incipit	…
ltx/en_us_dedes/me.m04.d17:meMA.Ode7C1T.melody	@ltx/en_us_dedes/he.h.m5:heHE.OYperypsoumenos.name
ltx/en_us_dedes/me.m04.d17:meMA.Ode7C1T.mode	@ltx/en_us_dedes/miscellanea:misc.Mode5
ltx/en_us_dedes/me.m04.d17:meMA.Ode7C1T.ode	@ltx/en_us_dedes/miscellanea:misc.Ode7
ltx/en_us_dedes/me.m04.d17:meMA.Ode7C1T.text	
ltx/en_us_dedes/me.m04.d17:meMA.Ode8C11.greekmelody	@ltx/en_us_dedes/he.h.m5:heHE.SoiToPantourgo.greekname
ltx/en_us_dedes/me.m04.d17:meMA.Ode8C11.incipit	…
ltx/en_us_dedes/me.m04.d17:meMA.Ode8C11.melody	@ltx/en_us_dedes/he.h.m5:heHE.SoiToPantourgo.name
ltx/en_us_dedes/me.m04.d17:meMA.Ode8C11.mode	@ltx/en_us_dedes/miscellanea:misc.Mode5
ltx/en_us_dedes/me.m04.d17:meMA.Ode8C11.ode	@ltx/en_us_dedes/miscellanea:misc.Ode8
ltx/en_us_dedes/me.m04.d17:meMA.Ode8C11.text	
ltx/en_us_dedes/me.m04.d17:meMA.Ode8C12.incipit	…
ltx/en_us_dedes/me.m04.d17:meMA.Ode8C12.melody	@ltx/en_us_dedes/he.h.m5:heHE.SoiToPantourgo.name
ltx/en_us_dedes/me.m04.d17:meMA.Ode8C12.mode	@ltx/en_us_dedes/miscellanea:misc.Mode5
ltx/en_us_dedes/me.m04.d17:meMA.Ode8C12.ode	@ltx/en_us_dedes/miscellanea:misc.Ode8
ltx/en_us_dedes/me.m04.d17:meMA.Ode8C12.text	
ltx/en_us_dedes/me.m04.d17:meMA.Ode8C13.incipit	…
ltx/en_us_dedes/me.m04.d17:meMA.Ode8C13.melody	@ltx/en_us_dedes/he.h.m5:heHE.SoiToPantourgo.name
ltx/en_us_dedes/me.m04.d17:meMA.Ode8C13.mode	@ltx/en_us_dedes/miscellanea:misc.Mode5
ltx/en_us_dedes/me.m04.d17:meMA.Ode8C13.ode	@ltx/en_us_dedes/miscellanea:misc.Ode8
ltx/en_us_dedes/me.m04.d17:meMA.Ode8C13.text	
ltx/en_us_dedes/me.m04.d17:meMA.Ode8C1H.greekmelody	@ltx/en_us_dedes/he.h.m5:heHE.SoiToPantourgo.greekname
ltx/en_us_dedes/me.m04.d17:meMA.Ode8C1H.incipit	@ltx/en_us_dedes/he.h.m5:heHE.SoiToPantourgo.incipit
ltx/en_us_dedes/me.m04.d17:meMA.Ode8C1H.melody	@ltx/en_us_dedes/he.h.m5:heHE.SoiToPantourgo.melody
ltx/en_us_dedes/me.m04.d17:meMA.Ode8C1H.mode	@ltx/en_us_dedes/miscellanea:misc.Mode5
ltx/en_us_dedes/me.m04.d17:meMA.Ode8C1H.ode	@ltx/en_us_dedes/miscellanea:misc.Ode8
ltx/en_us_dedes/me.m04.d17:meMA.Ode8C1H.text	@ltx/en_us_dedes/he.h.m5:heHE.SoiToPantourgo.text
ltx/en_us_dedes/me.m04.d17:meMA.Ode8C1T.incipit	…
ltx/en_us_dedes/me.m04.d17:meMA.Ode8C1T.melody	@ltx/en_us_dedes/he.h.m5:heHE.SoiToPantourgo.name
ltx/en_us_dedes/me.m04.d17:meMA.Ode8C1T.mode	@ltx/en_us_dedes/miscellanea:misc.Mode5
ltx/en_us_dedes/me.m04.d17:meMA.Ode8C1T.ode	@ltx/en_us_dedes/miscellanea:misc.Ode8
ltx/en_us_dedes/me.m04.d17:meMA.Ode8C1T.text	
ltx/en_us_dedes/me.m04.d17:meMA.Ode9C11.greekmelody	@ltx/en_us_dedes/he.h.m5:heHE.IsaiaChoreve.greekname
ltx/en_us_dedes/me.m04.d17:meMA.Ode9C11.incipit	…
ltx/en_us_dedes/me.m04.d17:meMA.Ode9C11.melody	@ltx/en_us_dedes/he.h.m5:heHE.IsaiaChoreve.name
ltx/en_us_dedes/me.m04.d17:meMA.Ode9C11.mode	@ltx/en_us_dedes/miscellanea:misc.Mode5
ltx/en_us_dedes/me.m04.d17:meMA.Ode9C11.ode	@ltx/en_us_dedes/miscellanea:misc.Ode9
ltx/en_us_dedes/me.m04.d17:meMA.Ode9C11.text	
ltx/en_us_dedes/me.m04.d17:meMA.Ode9C12.incipit	…
ltx/en_us_dedes/me.m04.d17:meMA.Ode9C12.melody	@ltx/en_us_dedes/he.h.m5:heHE.IsaiaChoreve.name
ltx/en_us_dedes/me.m04.d17:meMA.Ode9C12.mode	@ltx/en_us_dedes/miscellanea:misc.Mode5
ltx/en_us_dedes/me.m04.d17:meMA.Ode9C12.ode	@ltx/en_us_dedes/miscellanea:misc.Ode9
ltx/en_us_dedes/me.m04.d17:meMA.Ode9C12.text	
ltx/en_us_dedes/me.m04.d17:meMA.Ode9C13.incipit	…
ltx/en_us_dedes/me.m04.d17:meMA.Ode9C13.melody	@ltx/en_us_dedes/he.h.m5:heHE.IsaiaChoreve.name
ltx/en_us_dedes/me.m04.d17:meMA.Ode9C13.mode	@ltx/en_us_dedes/miscellanea:misc.Mode5
ltx/en_us_dedes/me.m04.d17:meMA.Ode9C13.ode	@ltx/en_us_dedes/miscellanea:misc.Ode9
ltx/en_us_dedes/me.m04.d17:meMA.Ode9C13.text	
ltx/en_us_dedes/me.m04.d17:meMA.Ode9C1H.greekmelody	@ltx/en_us_dedes/he.h.m5:heHE.IsaiaChoreve.greekname
ltx/en_us_dedes/me.m04.d17:meMA.Ode9C1H.incipit	@ltx/en_us_dedes/he.h.m5:heHE.IsaiaChoreve.incipit
ltx/en_us_dedes/me.m04.d17:meMA.Ode9C1H.melody	@ltx/en_us_dedes/he.h.m5:heHE.IsaiaChoreve.melody
ltx/en_us_dedes/me.m04.d17:meMA.Ode9C1H.mode	@ltx/en_us_dedes/miscellanea:misc.Mode5
ltx/en_us_dedes/me.m04.d17:meMA.Ode9C1H.ode	@ltx/en_us_dedes/miscellanea:misc.Ode9
ltx/en_us_dedes/me.m04.d17:meMA.Ode9C1H.text	@ltx/en_us_dedes/he.h.m5:heHE.IsaiaChoreve.text
ltx/en_us_dedes/me.m04.d17:meMA.Ode9C1T.incipit	…
ltx/en_us_dedes/me.m04.d17:meMA.Ode9C1T.melody	@ltx/en_us_dedes/he.h.m5:heHE.IsaiaChoreve.name
ltx/en_us_dedes/me.m04.d17:meMA.Ode9C1T.mode	@ltx/en_us_dedes/miscellanea:misc.Mode5
ltx/en_us_dedes/me.m04.d17:meMA.Ode9C1T.ode	@ltx/en_us_dedes/miscellanea:misc.Ode9
ltx/en_us_dedes/me.m04.d17:meMA.Ode9C1T.text	
ltx/en_us_dedes/me.m04.d17:meVE.Apolytikion1ger.greekmelody	@ltx/en_us_dedes/he.a.m4:heAU.OYpsotheisEnToStavro.greekname
ltx/en_us_dedes/me.m04.d17:meVE.Apolytikion1ger.incipit	…
ltx/en_us_dedes/me.m04.d17:meVE.Apolytikion1ger.melody	@ltx/en_us_dedes/he.a.m4:heAU.OYpsotheisEnToStavro.name
ltx/en_us_dedes/me.m04.d17:meVE.Apolytikion1ger.mode	@ltx/en_us_dedes/miscellanea:misc.Mode4
ltx/en_us_dedes/me.m04.d17:meVE.Apolytikion1ger.poet	@ltx/en_us_dedes/poets:po.Gerasimou
ltx/en_us_dedes/me.m04.d17:meVE.Apolytikion1ger.text	
ltx/en_us_dedes/me.m04.d17:meVE.SticStavrotheotokion.greekmelody	@ltx/en_us_dedes/he.a.m4:heAU.EdokasSimeiosin.greekname
ltx/en_us_dedes/me.m04.d17:meVE.SticStavrotheotokion.incipit	…
ltx/en_us_dedes/me.m04.d17:meVE.SticStavrotheotokion.melody	@ltx/en_us_dedes/he.a.m4:heAU.EdokasSimeiosin.name
ltx/en_us_dedes/me.m04.d17:meVE.SticStavrotheotokion.mode	@ltx/en_us_dedes/miscellanea:misc.Mode4
ltx/en_us_dedes/me.m04.d17:meVE.SticStavrotheotokion.text	
ltx/en_us_dedes/me.m04.d17:meVE.SticTheotokion.greekmelody	@ltx/en_us_dedes/he.a.m4:heAU.EdokasSimeiosin.greekname
ltx/en_us_dedes/me.m04.d17:meVE.SticTheotokion.incipit	Lady, I implore you now…
ltx/en_us_dedes/me.m04.d17:meVE.SticTheotokion.melody	@ltx/en_us_dedes/he.a.m4:heAU.EdokasSimeiosin.name
ltx/en_us_dedes/me.m04.d17:meVE.SticTheotokion.mode	@ltx/en_us_dedes/miscellanea:misc.Mode4
ltx/en_us_dedes/me.m04.d17:meVE.SticTheotokion.text	Lady, I implore you now, the cleanest Palace of God the King, * holy Virgin extolled by all. * Purify my intellect, soiled by my shameful * thoughts and sinful actions. Make it a dwelling that is bright * and a delight for the Holy Trinity. * And I your worthless supplicant, whom you have rescued, shall magnify * your entreaties on my behalf and immeasurable tender love.
ltx/en_us_dedes/me.m04.d17:meVE.Stichera01.greekmelody	@ltx/en_us_dedes/he.a.m4:heAU.EdokasSimeiosin.greekname
ltx/en_us_dedes/me.m04.d17:meVE.Stichera01.incipit	…
ltx/en_us_dedes/me.m04.d17:meVE.Stichera01.melody	@ltx/en_us_dedes/he.a.m4:heAU.EdokasSimeiosin.name
ltx/en_us_dedes/me.m04.d17:meVE.Stichera01.mode	@ltx/en_us_dedes/miscellanea:misc.Mode4
ltx/en_us_dedes/me.m04.d17:meVE.Stichera01.text	
ltx/en_us_dedes/me.m04.d17:meVE.Stichera02.incipit	…
ltx/en_us_dedes/me.m04.d17:meVE.Stichera02.melody	@ltx/en_us_dedes/he.a.m4:heAU.EdokasSimeiosin.name
ltx/en_us_dedes/me.m04.d17:meVE.Stichera02.mode	@ltx/en_us_dedes/miscellanea:misc.Mode4
ltx/en_us_dedes/me.m04.d17:meVE.Stichera02.text	
ltx/en_us_dedes/me.m04.d17:meVE.Stichera03.incipit	…
ltx/en_us_dedes/me.m04.d17:meVE.Stichera03.melody	@ltx/en_us_dedes/he.a.m4:heAU.EdokasSimeiosin.name
ltx/en_us_dedes/me.m04.d17:meVE.Stichera03.mode	@ltx/en_us_dedes/miscellanea:misc.Mode4
ltx/en_us_dedes/me.m04.d17:meVE.Stichera03.text	
