ltx/en_us_dedes/sy.m03.d30:cl.syMA.commemoration01.text	[saint/com 1]
ltx/en_us_dedes/sy.m03.d30:cl.syMA.commemoration02.text	[saint/com 2]
ltx/en_us_dedes/sy.m03.d30:cl.syMA.commemoration03.text	[saint/com 3]
ltx/en_us_dedes/sy.m03.d30:cl.syMA.commemoration04.text	[saint/com 4]
ltx/en_us_dedes/sy.m03.d30:cl.syMA.commemoration05.text	[saint/com 5]
ltx/en_us_dedes/sy.m03.d30:cl.syMA.commemoration06.text	[saint/com list]
ltx/en_us_dedes/sy.m03.d30:syMA.commemoration01.couplet1.title	@ltx/en_us_dedes/titles:ti.Verses
ltx/en_us_dedes/sy.m03.d30:syMA.commemoration01.couplet1.verse1	
ltx/en_us_dedes/sy.m03.d30:syMA.commemoration01.couplet1.verse2	
ltx/en_us_dedes/sy.m03.d30:syMA.commemoration01.narration.p01	
ltx/en_us_dedes/sy.m03.d30:syMA.commemoration01.narration.p02	
ltx/en_us_dedes/sy.m03.d30:syMA.commemoration01.single1	
ltx/en_us_dedes/sy.m03.d30:syMA.commemoration01.text	On March 30 we commemorate our devout father John, the author of the Ladder.
ltx/en_us_dedes/sy.m03.d30:syMA.commemoration02.couplet1.title	@ltx/en_us_dedes/titles:ti.Verses
ltx/en_us_dedes/sy.m03.d30:syMA.commemoration02.couplet1.verse1	
ltx/en_us_dedes/sy.m03.d30:syMA.commemoration02.couplet1.verse2	
ltx/en_us_dedes/sy.m03.d30:syMA.commemoration02.narration.p01	
ltx/en_us_dedes/sy.m03.d30:syMA.commemoration02.text	On this day we also commemorate the holy Prophet Joad (or Joel).
ltx/en_us_dedes/sy.m03.d30:syMA.commemoration03.couplet1.title	@ltx/en_us_dedes/titles:ti.Verses
ltx/en_us_dedes/sy.m03.d30:syMA.commemoration03.couplet1.verse1	
ltx/en_us_dedes/sy.m03.d30:syMA.commemoration03.couplet1.verse2	
ltx/en_us_dedes/sy.m03.d30:syMA.commemoration03.text	On this day we also commemorate our devout father John of the Well.
ltx/en_us_dedes/sy.m03.d30:syMA.commemoration04.couplet1.title	@ltx/en_us_dedes/titles:ti.Verses
ltx/en_us_dedes/sy.m03.d30:syMA.commemoration04.couplet1.verse1	
ltx/en_us_dedes/sy.m03.d30:syMA.commemoration04.couplet1.verse2	
ltx/en_us_dedes/sy.m03.d30:syMA.commemoration04.text	On this day Saint Evouli, the mother of St. Panteleimon, died in peace.
ltx/en_us_dedes/sy.m03.d30:syMA.commemoration05.couplet1.title	@ltx/en_us_dedes/titles:ti.Verses
ltx/en_us_dedes/sy.m03.d30:syMA.commemoration05.couplet1.verse1	
ltx/en_us_dedes/sy.m03.d30:syMA.commemoration05.couplet1.verse2	
ltx/en_us_dedes/sy.m03.d30:syMA.commemoration05.text	On this day Saint John, Patriarch of Jerusalem, died in peace.
ltx/en_us_dedes/sy.m03.d30:syMA.commemoration06.couplet1.title	@ltx/en_us_dedes/titles:ti.Verses
ltx/en_us_dedes/sy.m03.d30:syMA.commemoration06.couplet1.verse1	
ltx/en_us_dedes/sy.m03.d30:syMA.commemoration06.couplet1.verse2	
ltx/en_us_dedes/sy.m03.d30:syMA.commemoration06.text	On this day the holy New Hieromartyr Zacharias, who witnessed in Corinth in the year 1684, died by the sword.
ltx/en_us_dedes/sy.m03.d30:syMA.lastline	By their holy intercessions, O God, have mercy on us. Amen.
ltx/en_us_dedes/sy.m03.d30:syMA.note1	
ltx/en_us_dedes/sy.m03.d30:syMA.note2	
