ltx/en_us_dedes/pe.d119:peDA.commemoration.full	
ltx/en_us_dedes/pe.d119:peDA.commemoration.short	Soul Saturday
ltx/en_us_dedes/pe.d119:peDA.insert1	
ltx/en_us_dedes/pe.d119:peDA.insert2	
ltx/en_us_dedes/pe.d119:peDA.note	
ltx/en_us_dedes/pe.d119:peHO.commemorations	
ltx/en_us_dedes/pe.d119:peHO.daytitle	
ltx/en_us_dedes/pe.d119:peHO.description1	
ltx/en_us_dedes/pe.d119:peHO.description2	
ltx/en_us_dedes/pe.d119:peHO.note1	
ltx/en_us_dedes/pe.d119:peHO.note2	
ltx/en_us_dedes/pe.d119:peLI.MM.CommunionHymn.text	@ltx/en_us_dedes/properties:media.key
ltx/en_us_dedes/pe.d119:peLI.Megalynarion.text	
ltx/en_us_dedes/pe.d119:peMA.AposGlory.incipit	@ltx/en_us_dedes/oc.m6.d7:ocVE.Aposticha3.incipit
ltx/en_us_dedes/pe.d119:peMA.AposGlory.melody	
ltx/en_us_dedes/pe.d119:peMA.AposGlory.mode	@ltx/en_us_dedes/miscellanea:misc.Mode6
ltx/en_us_dedes/pe.d119:peMA.AposGlory.text	@ltx/en_us_dedes/oc.m6.d7:ocVE.Aposticha3.text
ltx/en_us_dedes/pe.d119:peMA.AposTheotokion.incipit	@ltx/en_us_dedes/oc.m6.d7:ocMA.AposTheotokion.incipit
ltx/en_us_dedes/pe.d119:peMA.AposTheotokion.melody	@ltx/en_us_dedes/he.a.m6:heAU.OlinApothemenoi.name
ltx/en_us_dedes/pe.d119:peMA.AposTheotokion.mode	@ltx/en_us_dedes/miscellanea:misc.Mode6
ltx/en_us_dedes/pe.d119:peMA.AposTheotokion.text	@ltx/en_us_dedes/oc.m6.d7:ocMA.AposTheotokion.text
ltx/en_us_dedes/pe.d119:peMA.Aposticha1.greekmelody	@ltx/en_us_dedes/he.a.m6:heAU.OlinApothemenoi.greekname
ltx/en_us_dedes/pe.d119:peMA.Aposticha1.incipit	@ltx/en_us_dedes/oc.m6.d7:ocMA.Aposticha1.incipit
ltx/en_us_dedes/pe.d119:peMA.Aposticha1.melody	@ltx/en_us_dedes/he.a.m6:heAU.OlinApothemenoi.name
ltx/en_us_dedes/pe.d119:peMA.Aposticha1.mode	@ltx/en_us_dedes/miscellanea:misc.Mode6
ltx/en_us_dedes/pe.d119:peMA.Aposticha1.text	@ltx/en_us_dedes/oc.m6.d7:ocMA.Aposticha1.text
ltx/en_us_dedes/pe.d119:peMA.Aposticha2.incipit	@ltx/en_us_dedes/oc.m6.d7:ocMA.Aposticha2.incipit
ltx/en_us_dedes/pe.d119:peMA.Aposticha2.melody	
ltx/en_us_dedes/pe.d119:peMA.Aposticha2.mode	@ltx/en_us_dedes/miscellanea:misc.Mode6
ltx/en_us_dedes/pe.d119:peMA.Aposticha2.text	@ltx/en_us_dedes/oc.m6.d7:ocMA.Aposticha2.text
ltx/en_us_dedes/pe.d119:peMA.Aposticha3.incipit	@ltx/en_us_dedes/oc.m6.d7:ocMA.Aposticha3.incipit
ltx/en_us_dedes/pe.d119:peMA.Aposticha3.melody	
ltx/en_us_dedes/pe.d119:peMA.Aposticha3.mode	@ltx/en_us_dedes/miscellanea:misc.Mode6
ltx/en_us_dedes/pe.d119:peMA.Aposticha3.text	@ltx/en_us_dedes/oc.m6.d7:ocMA.Aposticha3.text
ltx/en_us_dedes/pe.d119:peMA.C1.acrostic.notice1	
ltx/en_us_dedes/pe.d119:peMA.C1.acrostic.notice2	
ltx/en_us_dedes/pe.d119:peMA.C1.acrostic.text	
ltx/en_us_dedes/pe.d119:peMA.C1.acrostic.title	Canon for the Dead.
ltx/en_us_dedes/pe.d119:peMA.C1.poet	
ltx/en_us_dedes/pe.d119:peMA.C1.title	@ltx/en_us_dedes/titles:ti.CanonDead
ltx/en_us_dedes/pe.d119:peMA.C1.verse	@ltx/en_us_dedes/prayers:pr.verse_God.text
ltx/en_us_dedes/pe.d119:peMA.ExapTheotokion.incipit	@ltx/en_us_dedes/da.d7:daMA.ExapTheotokion1.incipit
ltx/en_us_dedes/pe.d119:peMA.ExapTheotokion.melody	@ltx/en_us_dedes/he.a.m3:heAU.OOuranonToisAstrois.name
ltx/en_us_dedes/pe.d119:peMA.ExapTheotokion.mode	@ltx/en_us_dedes/miscellanea:misc.Mode3
ltx/en_us_dedes/pe.d119:peMA.ExapTheotokion.text	@ltx/en_us_dedes/da.d7:daMA.ExapTheotokion1.text
ltx/en_us_dedes/pe.d119:peMA.Exaposteilarion1.greekmelody	@ltx/en_us_dedes/he.a.m3:heAU.OOuranonToisAstrois.greekname
ltx/en_us_dedes/pe.d119:peMA.Exaposteilarion1.incipit	As we observe this memorial…
ltx/en_us_dedes/pe.d119:peMA.Exaposteilarion1.melody	@ltx/en_us_dedes/he.a.m3:heAU.OOuranonToisAstrois.name
ltx/en_us_dedes/pe.d119:peMA.Exaposteilarion1.mode	@ltx/en_us_dedes/miscellanea:misc.Mode3
ltx/en_us_dedes/pe.d119:peMA.Exaposteilarion1.text	As we observe this memorial * of all who have reposed in Christ, * let us the faithful also * remember our own final day, * and let us always entreat Christ * for ourselves and for them as well.
ltx/en_us_dedes/pe.d119:peMA.Kathisma11.greekmelody	@ltx/en_us_dedes/he.a.m6:heAU.AngelikaiDynameis.greekname
ltx/en_us_dedes/pe.d119:peMA.Kathisma11.incipit	@ltx/en_us_dedes/oc.m6.d3:ocMA.Kathisma32.incipit
ltx/en_us_dedes/pe.d119:peMA.Kathisma11.melody	@ltx/en_us_dedes/he.a.m6:heAU.AngelikaiDynameis.name
ltx/en_us_dedes/pe.d119:peMA.Kathisma11.mode	@ltx/en_us_dedes/miscellanea:misc.Mode6
ltx/en_us_dedes/pe.d119:peMA.Kathisma11.text	@ltx/en_us_dedes/oc.m6.d3:ocMA.Kathisma32.text
ltx/en_us_dedes/pe.d119:peMA.Kathisma12.incipit	@ltx/en_us_dedes/oc.m6.d4:ocMA.Kathisma32.incipit
ltx/en_us_dedes/pe.d119:peMA.Kathisma12.melody	
ltx/en_us_dedes/pe.d119:peMA.Kathisma12.mode	@ltx/en_us_dedes/miscellanea:misc.Mode6
ltx/en_us_dedes/pe.d119:peMA.Kathisma12.text	@ltx/en_us_dedes/oc.m6.d4:ocMA.Kathisma32.text
ltx/en_us_dedes/pe.d119:peMA.Kathisma13.incipit	@ltx/en_us_dedes/oc.m6.d5:ocMA.Kathisma32.incipit
ltx/en_us_dedes/pe.d119:peMA.Kathisma13.melody	
ltx/en_us_dedes/pe.d119:peMA.Kathisma13.mode	@ltx/en_us_dedes/miscellanea:misc.Mode6
ltx/en_us_dedes/pe.d119:peMA.Kathisma13.text	@ltx/en_us_dedes/oc.m6.d5:ocMA.Kathisma32.text
ltx/en_us_dedes/pe.d119:peMA.Kathisma14.incipit	We pray for those who…
ltx/en_us_dedes/pe.d119:peMA.Kathisma14.melody	
ltx/en_us_dedes/pe.d119:peMA.Kathisma14.mode	@ltx/en_us_dedes/miscellanea:misc.Mode6
ltx/en_us_dedes/pe.d119:peMA.Kathisma14.text	We pray for those who died in true faith and whom You have taken to yourself, that You, as our placable God, place them in the dwellings of the elect and in the land of the living; fill them with Your never-setting light, and grant them Your heavenly joy.
ltx/en_us_dedes/pe.d119:peMA.Kathisma1T.incipit	@ltx/en_us_dedes/oc.m6.d1:ocVE.ApolTheotokionVM.incipit
ltx/en_us_dedes/pe.d119:peMA.Kathisma1T.melody	
ltx/en_us_dedes/pe.d119:peMA.Kathisma1T.mode	@ltx/en_us_dedes/miscellanea:misc.Mode6
ltx/en_us_dedes/pe.d119:peMA.Kathisma1T.text	@ltx/en_us_dedes/oc.m6.d1:ocVE.ApolTheotokionVM.text
ltx/en_us_dedes/pe.d119:peMA.Kathisma21.incipit	@ltx/en_us_dedes/tr.d014:trMA.Kathisma21.incipit
ltx/en_us_dedes/pe.d119:peMA.Kathisma21.melody	
ltx/en_us_dedes/pe.d119:peMA.Kathisma21.mode	@ltx/en_us_dedes/miscellanea:misc.Mode5
ltx/en_us_dedes/pe.d119:peMA.Kathisma21.text	@ltx/en_us_dedes/tr.d014:trMA.Kathisma21.text
ltx/en_us_dedes/pe.d119:peMA.Kathisma21b.incipit	@ltx/en_us_dedes/tr.d014:trMA.Kathisma21b.incipit
ltx/en_us_dedes/pe.d119:peMA.Kathisma21b.melody	
ltx/en_us_dedes/pe.d119:peMA.Kathisma21b.mode	@ltx/en_us_dedes/miscellanea:misc.Mode5
ltx/en_us_dedes/pe.d119:peMA.Kathisma21b.text	@ltx/en_us_dedes/tr.d014:trMA.Kathisma21b.text
ltx/en_us_dedes/pe.d119:peMA.Kathisma22.incipit	@ltx/en_us_dedes/tr.d014:trMA.Kathisma22.incipit
ltx/en_us_dedes/pe.d119:peMA.Kathisma22.melody	
ltx/en_us_dedes/pe.d119:peMA.Kathisma22.mode	@ltx/en_us_dedes/miscellanea:misc.Mode5
ltx/en_us_dedes/pe.d119:peMA.Kathisma22.text	@ltx/en_us_dedes/tr.d014:trMA.Kathisma22.text
ltx/en_us_dedes/pe.d119:peMA.Kontakion1.incipit	Immortal Savior, let those who…
ltx/en_us_dedes/pe.d119:peMA.Kontakion1.melody	
ltx/en_us_dedes/pe.d119:peMA.Kontakion1.mode	@ltx/en_us_dedes/miscellanea:misc.Mode8
ltx/en_us_dedes/pe.d119:peMA.Kontakion1.text	Immortal Savior, let those who have departed from us and from things temporary dwell in the dwellings of the elect, and grant them to repose with the righteous. Even if as human beings they sinned on earth, will You the sinless Lord forgive their voluntary and involuntary transgressions, at the intercessions of Your Mother, the Theotokos, so that in unison we may sing on their behalf: Alleluia.
ltx/en_us_dedes/pe.d119:peMA.Lauds1.greekmelody	@ltx/en_us_dedes/he.a.m6:heAU.IApegnosmeni.greekname
ltx/en_us_dedes/pe.d119:peMA.Lauds1.incipit	The finality of a person’s…
ltx/en_us_dedes/pe.d119:peMA.Lauds1.melody	@ltx/en_us_dedes/he.a.m6:heAU.IApegnosmeni.name
ltx/en_us_dedes/pe.d119:peMA.Lauds1.mode	@ltx/en_us_dedes/miscellanea:misc.Mode6
ltx/en_us_dedes/pe.d119:peMA.Lauds1.text	The finality of a person’s death is awful; * and the Master’s judgment to come is also dreadful. * For in Hell is prepared the unquenchable fire, * there is the sleepless worm that tortures, * and the gnashing of teeth, and don’t forget the outer darkness, the everlasting sentence. * Therefore let us cry out to the Savior: * “To those You chose from what is temporal grant repose, * because of Your great mercy.”
ltx/en_us_dedes/pe.d119:peMA.Lauds2.greekmelody	@ltx/en_us_dedes/he.a.m6:heAU.IApegnosmeni.greekname
ltx/en_us_dedes/pe.d119:peMA.Lauds2.incipit	All who are engrossed in…
ltx/en_us_dedes/pe.d119:peMA.Lauds2.melody	@ltx/en_us_dedes/he.a.m6:heAU.IApegnosmeni.name
ltx/en_us_dedes/pe.d119:peMA.Lauds2.mode	@ltx/en_us_dedes/miscellanea:misc.Mode6
ltx/en_us_dedes/pe.d119:peMA.Lauds2.text	All who are engrossed in mundane existence, * come and be amazed as we look within the caskets. * Behold, the illusion of the world and its deception. * Where is the beauty of the body, * and the glory of wealth, where is the pride in one’s position? Truly all this is useless. * Therefore let us cry out to the Savior: * “To those You chose from what is temporal grant repose, * because of Your great mercy.”
ltx/en_us_dedes/pe.d119:peMA.Lauds3.greekmelody	@ltx/en_us_dedes/he.a.m6:heAU.IApegnosmeni.greekname
ltx/en_us_dedes/pe.d119:peMA.Lauds3.incipit	Once upon a throne, he…
ltx/en_us_dedes/pe.d119:peMA.Lauds3.melody	@ltx/en_us_dedes/he.a.m6:heAU.IApegnosmeni.name
ltx/en_us_dedes/pe.d119:peMA.Lauds3.mode	@ltx/en_us_dedes/miscellanea:misc.Mode6
ltx/en_us_dedes/pe.d119:peMA.Lauds3.text	Once upon a throne, he is in the grave now. * Once in royal purple, he is decaying. * No longer upon a throne, but in a tomb now he is lying. * See how imperial authority has left him. * See how every person’s life passes like a dream and is finished. * Therefore let us cry out to the Savior: * “To those You chose from what is temporal grant repose, * because of Your great mercy.”
ltx/en_us_dedes/pe.d119:peMA.Lauds4.incipit	Savior, we entreat You for…
ltx/en_us_dedes/pe.d119:peMA.Lauds4.melody	@ltx/en_us_dedes/he.a.m6:heAU.IApegnosmeni.name
ltx/en_us_dedes/pe.d119:peMA.Lauds4.mode	@ltx/en_us_dedes/miscellanea:misc.Mode6
ltx/en_us_dedes/pe.d119:peMA.Lauds4.text	Savior, we entreat You for every person * who has died in whichever way and passed on * from this life in hopes of everlasting life, O Master, * people of every race and station, * of every age and stature, both men and women, youths and children, * and even newborn infants. * In Your gracious benevolence, place them in the bosom of Abraham, in a place of rest, * because of Your great mercy.
ltx/en_us_dedes/pe.d119:peMA.LaudsBoth.incipit	@ltx/en_us_dedes/oc.m6.d7:ocMA.LaudsTheotokion.incipit
ltx/en_us_dedes/pe.d119:peMA.LaudsBoth.melody	
ltx/en_us_dedes/pe.d119:peMA.LaudsBoth.mode	@ltx/en_us_dedes/miscellanea:misc.Mode6
ltx/en_us_dedes/pe.d119:peMA.LaudsBoth.text	@ltx/en_us_dedes/oc.m6.d7:ocMA.LaudsTheotokion.text
ltx/en_us_dedes/pe.d119:peMA.LaudsGlory.incipit	@ltx/en_us_dedes/oc.m2.d7:ocVE.Aposticha4.incipit
ltx/en_us_dedes/pe.d119:peMA.LaudsGlory.melody	
ltx/en_us_dedes/pe.d119:peMA.LaudsGlory.mode	@ltx/en_us_dedes/miscellanea:misc.Mode2
ltx/en_us_dedes/pe.d119:peMA.LaudsGlory.text	@ltx/en_us_dedes/oc.m2.d7:ocVE.Aposticha4.text
ltx/en_us_dedes/pe.d119:peMA.Ode1C11.greekmelody	@ltx/en_us_dedes/he.h.m6:heHE.OsEnIpeiroPezefsas.greekname
ltx/en_us_dedes/pe.d119:peMA.Ode1C11.incipit	You are the Master and…
ltx/en_us_dedes/pe.d119:peMA.Ode1C11.melody	@ltx/en_us_dedes/he.h.m6:heHE.OsEnIpeiroPezefsas.name
ltx/en_us_dedes/pe.d119:peMA.Ode1C11.mode	@ltx/en_us_dedes/miscellanea:misc.Mode6
ltx/en_us_dedes/pe.d119:peMA.Ode1C11.ode	@ltx/en_us_dedes/miscellanea:misc.Ode1
ltx/en_us_dedes/pe.d119:peMA.Ode1C11.text	You are the Master and Maker, the Judge and Lord * of the souls of everyone and of everything on earth, * and the whole wide world is in Your hand. * Grant repose to those You transfered who believe in You.
ltx/en_us_dedes/pe.d119:peMA.Ode1C12.incipit	O Lord, for all the…
ltx/en_us_dedes/pe.d119:peMA.Ode1C12.melody	@ltx/en_us_dedes/he.h.m6:heHE.OsEnIpeiroPezefsas.name
ltx/en_us_dedes/pe.d119:peMA.Ode1C12.mode	@ltx/en_us_dedes/miscellanea:misc.Mode6
ltx/en_us_dedes/pe.d119:peMA.Ode1C12.ode	@ltx/en_us_dedes/miscellanea:misc.Ode1
ltx/en_us_dedes/pe.d119:peMA.Ode1C12.text	O Lord, for all the deceased of the human race, * of whichever age or rank or their stature in this life, * we implore You. And we fervently entreat * on behalf of those You transferred, that You save them all.
ltx/en_us_dedes/pe.d119:peMA.Ode1C13.incipit	With Your immaculate hand You…
ltx/en_us_dedes/pe.d119:peMA.Ode1C13.melody	@ltx/en_us_dedes/he.h.m6:heHE.OsEnIpeiroPezefsas.name
ltx/en_us_dedes/pe.d119:peMA.Ode1C13.mode	@ltx/en_us_dedes/miscellanea:misc.Mode6
ltx/en_us_dedes/pe.d119:peMA.Ode1C13.ode	@ltx/en_us_dedes/miscellanea:misc.Ode1
ltx/en_us_dedes/pe.d119:peMA.Ode1C13.text	With Your immaculate hand You made me from earth, * O Word; by Your breath of life, You as God gave me a soul. * I implore You now, compassionate Lord, * on behalf of those You took from here, to save them all.
ltx/en_us_dedes/pe.d119:peMA.Ode1C1H.greekmelody	@ltx/en_us_dedes/he.h.m6:heHE.OsEnIpeiroPezefsas.greekname
ltx/en_us_dedes/pe.d119:peMA.Ode1C1H.incipit	@ltx/en_us_dedes/he.h.m6:heHE.OsEnIpeiroPezefsas.incipit
ltx/en_us_dedes/pe.d119:peMA.Ode1C1H.melody	@ltx/en_us_dedes/he.h.m6:heHE.OsEnIpeiroPezefsas.melody
ltx/en_us_dedes/pe.d119:peMA.Ode1C1H.mode	@ltx/en_us_dedes/miscellanea:misc.Mode6
ltx/en_us_dedes/pe.d119:peMA.Ode1C1H.ode	@ltx/en_us_dedes/miscellanea:misc.Ode1
ltx/en_us_dedes/pe.d119:peMA.Ode1C1H.text	@ltx/en_us_dedes/he.h.m6:heHE.OsEnIpeiroPezefsas.text
ltx/en_us_dedes/pe.d119:peMA.Ode1C1T.incipit	You are the refuge and…
ltx/en_us_dedes/pe.d119:peMA.Ode1C1T.melody	@ltx/en_us_dedes/he.h.m6:heHE.OsEnIpeiroPezefsas.name
ltx/en_us_dedes/pe.d119:peMA.Ode1C1T.mode	@ltx/en_us_dedes/miscellanea:misc.Mode6
ltx/en_us_dedes/pe.d119:peMA.Ode1C1T.ode	@ltx/en_us_dedes/miscellanea:misc.Ode1
ltx/en_us_dedes/pe.d119:peMA.Ode1C1T.text	You are the refuge and champion of the world, * O all-holy Virgin pure, by your fervent prayers for all. * Intercede for us who run to you, * the impenetrable fortress in our time of need.
ltx/en_us_dedes/pe.d119:peMA.Ode3C11.greekmelody	@ltx/en_us_dedes/he.h.m6:heHE.OukEstinAgios.greekname
ltx/en_us_dedes/pe.d119:peMA.Ode3C11.incipit	O Christ, the one who…
ltx/en_us_dedes/pe.d119:peMA.Ode3C11.melody	@ltx/en_us_dedes/he.h.m6:heHE.OukEstinAgios.notmetered
ltx/en_us_dedes/pe.d119:peMA.Ode3C11.mode	@ltx/en_us_dedes/miscellanea:misc.Mode6
ltx/en_us_dedes/pe.d119:peMA.Ode3C11.ode	@ltx/en_us_dedes/miscellanea:misc.Ode3
ltx/en_us_dedes/pe.d119:peMA.Ode3C11.text	O Christ, the one who lifts the souls of the faithful to You as in clouds, from the ends of the earth, by the might of Your divine glory, grant rest to Your servants whom You have taken.
ltx/en_us_dedes/pe.d119:peMA.Ode3C12.incipit	You alone are the one…
ltx/en_us_dedes/pe.d119:peMA.Ode3C12.melody	@ltx/en_us_dedes/he.h.m6:heHE.OukEstinAgios.notmetered
ltx/en_us_dedes/pe.d119:peMA.Ode3C12.mode	@ltx/en_us_dedes/miscellanea:misc.Mode6
ltx/en_us_dedes/pe.d119:peMA.Ode3C12.ode	@ltx/en_us_dedes/miscellanea:misc.Ode3
ltx/en_us_dedes/pe.d119:peMA.Ode3C12.text	You alone are the one who establishes kings and emperors and judges and rulers. So, O Savior, as the God of all, in Your judgment, deliver them from perdition.
ltx/en_us_dedes/pe.d119:peMA.Ode3C13.incipit	O Christ, the Make of…
ltx/en_us_dedes/pe.d119:peMA.Ode3C13.melody	@ltx/en_us_dedes/he.h.m6:heHE.OukEstinAgios.notmetered
ltx/en_us_dedes/pe.d119:peMA.Ode3C13.mode	@ltx/en_us_dedes/miscellanea:misc.Mode6
ltx/en_us_dedes/pe.d119:peMA.Ode3C13.ode	@ltx/en_us_dedes/miscellanea:misc.Ode3
ltx/en_us_dedes/pe.d119:peMA.Ode3C13.text	O Christ, the Make of all the earth, make worthy of eternal joy and of Your delight all those whom You have taken, including the elderly, girls and boys, and teenagers.
ltx/en_us_dedes/pe.d119:peMA.Ode3C1H.greekmelody	@ltx/en_us_dedes/he.h.m6:heHE.OukEstinAgios.greekname
ltx/en_us_dedes/pe.d119:peMA.Ode3C1H.incipit	@ltx/en_us_dedes/he.h.m6:heHE.OukEstinAgios.incipit
ltx/en_us_dedes/pe.d119:peMA.Ode3C1H.melody	@ltx/en_us_dedes/he.h.m6:heHE.OukEstinAgios.melody
ltx/en_us_dedes/pe.d119:peMA.Ode3C1H.mode	@ltx/en_us_dedes/miscellanea:misc.Mode6
ltx/en_us_dedes/pe.d119:peMA.Ode3C1H.ode	@ltx/en_us_dedes/miscellanea:misc.Ode3
ltx/en_us_dedes/pe.d119:peMA.Ode3C1H.text	@ltx/en_us_dedes/he.h.m6:heHE.OukEstinAgios.text
ltx/en_us_dedes/pe.d119:peMA.Ode3C1T.incipit	O Lady Theotokos, the mighty…
ltx/en_us_dedes/pe.d119:peMA.Ode3C1T.melody	@ltx/en_us_dedes/he.h.m6:heHE.OukEstinAgios.notmetered
ltx/en_us_dedes/pe.d119:peMA.Ode3C1T.mode	@ltx/en_us_dedes/miscellanea:misc.Mode6
ltx/en_us_dedes/pe.d119:peMA.Ode3C1T.ode	@ltx/en_us_dedes/miscellanea:misc.Ode3
ltx/en_us_dedes/pe.d119:peMA.Ode3C1T.text	O Lady Theotokos, the mighty hope of the world, do not reject us who always run to you with longing; but rather by your entreaties, rescue from all troubles those who honor you.
ltx/en_us_dedes/pe.d119:peMA.Ode3Kathisma1.greekmelody	@ltx/en_us_dedes/he.a.m8:heAU.TinSofianKaiLogon.greekname
ltx/en_us_dedes/pe.d119:peMA.Ode3Kathisma1.incipit	O Creator of all things…
ltx/en_us_dedes/pe.d119:peMA.Ode3Kathisma1.melody	@ltx/en_us_dedes/he.a.m8:heAU.TinSofianKaiLogon.name
ltx/en_us_dedes/pe.d119:peMA.Ode3Kathisma1.mode	@ltx/en_us_dedes/miscellanea:misc.Mode8
ltx/en_us_dedes/pe.d119:peMA.Ode3Kathisma1.text	O Creator of all things by Your command, * we implore You, our God who is placable, * and pray You to grant repose to all Christians who died in faith, * to our relatives, forebears, our parents and grandparents, * siblings, friends, and all people, married, single, both rich and poor, * likewise kings and rulers, men and women monastics. * We pray You for their repose, that You grant them a place of rest, * where the Saints and the Righteous dwell. * Christ, You are our Master and King. On behalf of all Your servants we entreat, * that You grant them forgiveness of all their transgressions and sins.
ltx/en_us_dedes/pe.d119:peMA.Ode3Kathisma2.greekmelody	@ltx/en_us_dedes/he.a.m8:heAU.TinSofianKaiLogon.greekname
ltx/en_us_dedes/pe.d119:peMA.Ode3Kathisma2.incipit	@ltx/en_us_dedes/me.m06.d29:meMA.Kathisma2T.incipit
ltx/en_us_dedes/pe.d119:peMA.Ode3Kathisma2.melody	@ltx/en_us_dedes/he.a.m8:heAU.TinSofianKaiLogon.name
ltx/en_us_dedes/pe.d119:peMA.Ode3Kathisma2.mode	@ltx/en_us_dedes/miscellanea:misc.Mode8
ltx/en_us_dedes/pe.d119:peMA.Ode3Kathisma2.text	@ltx/en_us_dedes/me.m06.d29:meMA.Kathisma2T.text
ltx/en_us_dedes/pe.d119:peMA.Ode4C11.greekmelody	@ltx/en_us_dedes/he.h.m6:heHE.ChristosMouDynamis.greekname
ltx/en_us_dedes/pe.d119:peMA.Ode4C11.incipit	O Lord and Shepherd, You…
ltx/en_us_dedes/pe.d119:peMA.Ode4C11.melody	@ltx/en_us_dedes/he.h.m6:heHE.ChristosMouDynamis.notmetered
ltx/en_us_dedes/pe.d119:peMA.Ode4C11.mode	@ltx/en_us_dedes/miscellanea:misc.Mode6
ltx/en_us_dedes/pe.d119:peMA.Ode4C11.ode	@ltx/en_us_dedes/miscellanea:misc.Ode4
ltx/en_us_dedes/pe.d119:peMA.Ode4C11.text	O Lord and Shepherd, You take all believers to green pastures and lead them beside the still waters of eternal rest. O Savior, please do not send any of Your servants away from the gladness that is there.
ltx/en_us_dedes/pe.d119:peMA.Ode4C12.incipit	O Lord, place the choirs…
ltx/en_us_dedes/pe.d119:peMA.Ode4C12.melody	@ltx/en_us_dedes/he.h.m6:heHE.ChristosMouDynamis.notmetered
ltx/en_us_dedes/pe.d119:peMA.Ode4C12.mode	@ltx/en_us_dedes/miscellanea:misc.Mode6
ltx/en_us_dedes/pe.d119:peMA.Ode4C12.ode	@ltx/en_us_dedes/miscellanea:misc.Ode4
ltx/en_us_dedes/pe.d119:peMA.Ode4C12.text	O Lord, place the choirs of Your monastics and hierarchs and all Your ministers among the ranks of the Angels. For they dedicated their souls and bodies to You who love humanity.
ltx/en_us_dedes/pe.d119:peMA.Ode4C13.incipit	As Lord of all, You…
ltx/en_us_dedes/pe.d119:peMA.Ode4C13.melody	@ltx/en_us_dedes/he.h.m6:heHE.ChristosMouDynamis.notmetered
ltx/en_us_dedes/pe.d119:peMA.Ode4C13.mode	@ltx/en_us_dedes/miscellanea:misc.Mode6
ltx/en_us_dedes/pe.d119:peMA.Ode4C13.ode	@ltx/en_us_dedes/miscellanea:misc.Ode4
ltx/en_us_dedes/pe.d119:peMA.Ode4C13.text	As Lord of all, You alone have knowledge of the onset of death, the terms of life, and the passing of every mortal. Therefore now take pity on Your servants, O God supremely good.
ltx/en_us_dedes/pe.d119:peMA.Ode4C1H.greekmelody	@ltx/en_us_dedes/he.h.m6:heHE.ChristosMouDynamis.greekname
ltx/en_us_dedes/pe.d119:peMA.Ode4C1H.incipit	@ltx/en_us_dedes/he.h.m6:heHE.ChristosMouDynamis.incipit
ltx/en_us_dedes/pe.d119:peMA.Ode4C1H.melody	@ltx/en_us_dedes/he.h.m6:heHE.ChristosMouDynamis.melody
ltx/en_us_dedes/pe.d119:peMA.Ode4C1H.mode	@ltx/en_us_dedes/miscellanea:misc.Mode6
ltx/en_us_dedes/pe.d119:peMA.Ode4C1H.ode	@ltx/en_us_dedes/miscellanea:misc.Ode4
ltx/en_us_dedes/pe.d119:peMA.Ode4C1H.text	@ltx/en_us_dedes/he.h.m6:heHE.ChristosMouDynamis.text
ltx/en_us_dedes/pe.d119:peMA.Ode4C1T.incipit	O all-holy Virgin, you gave…
ltx/en_us_dedes/pe.d119:peMA.Ode4C1T.melody	@ltx/en_us_dedes/he.h.m6:heHE.ChristosMouDynamis.notmetered
ltx/en_us_dedes/pe.d119:peMA.Ode4C1T.mode	@ltx/en_us_dedes/miscellanea:misc.Mode6
ltx/en_us_dedes/pe.d119:peMA.Ode4C1T.ode	@ltx/en_us_dedes/miscellanea:misc.Ode4
ltx/en_us_dedes/pe.d119:peMA.Ode4C1T.text	O all-holy Virgin, you gave birth to the holy God of the Saints. Implore Him now, with your divine supplications, that those whom He has transferred be placed in the delightful dwellings of the Saints.
ltx/en_us_dedes/pe.d119:peMA.Ode5C11.greekmelody	@ltx/en_us_dedes/he.h.m6:heHE.ToTheioFengeiSou.greekname
ltx/en_us_dedes/pe.d119:peMA.Ode5C11.incipit	Behold, the divine choirs of…
ltx/en_us_dedes/pe.d119:peMA.Ode5C11.melody	@ltx/en_us_dedes/he.h.m6:heHE.ToTheioFengeiSou.notmetered
ltx/en_us_dedes/pe.d119:peMA.Ode5C11.mode	@ltx/en_us_dedes/miscellanea:misc.Mode6
ltx/en_us_dedes/pe.d119:peMA.Ode5C11.ode	@ltx/en_us_dedes/miscellanea:misc.Ode5
ltx/en_us_dedes/pe.d119:peMA.Ode5C11.text	Behold, the divine choirs of Martyrs, the ranks of the Apostles and Prophets, and the hosts of the Righteous, extol You, O Savior, and they entreat You to save all whom You have taken from the world.
ltx/en_us_dedes/pe.d119:peMA.Ode5C12.incipit	When at the loud sound…
ltx/en_us_dedes/pe.d119:peMA.Ode5C12.melody	@ltx/en_us_dedes/he.h.m6:heHE.ToTheioFengeiSou.notmetered
ltx/en_us_dedes/pe.d119:peMA.Ode5C12.mode	@ltx/en_us_dedes/miscellanea:misc.Mode6
ltx/en_us_dedes/pe.d119:peMA.Ode5C12.ode	@ltx/en_us_dedes/miscellanea:misc.Ode5
ltx/en_us_dedes/pe.d119:peMA.Ode5C12.text	When at the loud sound of Your trumpet the graves of the dead are opened, and the earth shakes and shudders, then place Your servants, whom You have transferred, with the sheep on Your right hand, O Christ.
ltx/en_us_dedes/pe.d119:peMA.Ode5C13.incipit	We pray You grant repose…
ltx/en_us_dedes/pe.d119:peMA.Ode5C13.melody	@ltx/en_us_dedes/he.h.m6:heHE.ToTheioFengeiSou.notmetered
ltx/en_us_dedes/pe.d119:peMA.Ode5C13.mode	@ltx/en_us_dedes/miscellanea:misc.Mode6
ltx/en_us_dedes/pe.d119:peMA.Ode5C13.ode	@ltx/en_us_dedes/miscellanea:misc.Ode5
ltx/en_us_dedes/pe.d119:peMA.Ode5C13.text	We pray You grant repose to Your believing servants who have been transferred to you, be they men or women, children or elderly, rich or poor, and save them all, as our placable God.
ltx/en_us_dedes/pe.d119:peMA.Ode5C1H.greekmelody	@ltx/en_us_dedes/he.h.m6:heHE.ToTheioFengeiSou.greekname
ltx/en_us_dedes/pe.d119:peMA.Ode5C1H.incipit	@ltx/en_us_dedes/he.h.m6:heHE.ToTheioFengeiSou.incipit
ltx/en_us_dedes/pe.d119:peMA.Ode5C1H.melody	@ltx/en_us_dedes/he.h.m6:heHE.ToTheioFengeiSou.melody
ltx/en_us_dedes/pe.d119:peMA.Ode5C1H.mode	@ltx/en_us_dedes/miscellanea:misc.Mode6
ltx/en_us_dedes/pe.d119:peMA.Ode5C1H.ode	@ltx/en_us_dedes/miscellanea:misc.Ode5
ltx/en_us_dedes/pe.d119:peMA.Ode5C1H.text	@ltx/en_us_dedes/he.h.m6:heHE.ToTheioFengeiSou.text
ltx/en_us_dedes/pe.d119:peMA.Ode5C1T.incipit	All of us, of every…
ltx/en_us_dedes/pe.d119:peMA.Ode5C1T.melody	@ltx/en_us_dedes/he.h.m6:heHE.ToTheioFengeiSou.notmetered
ltx/en_us_dedes/pe.d119:peMA.Ode5C1T.mode	@ltx/en_us_dedes/miscellanea:misc.Mode6
ltx/en_us_dedes/pe.d119:peMA.Ode5C1T.ode	@ltx/en_us_dedes/miscellanea:misc.Ode5
ltx/en_us_dedes/pe.d119:peMA.Ode5C1T.text	All of us, of every race and language, whether still alive or having died believing correctly, have you, immaculate Lady, as our helper. Now we pray that you intercede with the Lord, that in the next life we may attain repose.
ltx/en_us_dedes/pe.d119:peMA.Ode6C11.greekmelody	@ltx/en_us_dedes/he.h.m6:heHE.TouViouTinThalassan.greekname
ltx/en_us_dedes/pe.d119:peMA.Ode6C11.incipit	Be merciful, O Master. Be…
ltx/en_us_dedes/pe.d119:peMA.Ode6C11.melody	@ltx/en_us_dedes/he.h.m6:heHE.TouViouTinThalassan.notmetered
ltx/en_us_dedes/pe.d119:peMA.Ode6C11.mode	@ltx/en_us_dedes/miscellanea:misc.Mode6
ltx/en_us_dedes/pe.d119:peMA.Ode6C11.ode	@ltx/en_us_dedes/miscellanea:misc.Ode6
ltx/en_us_dedes/pe.d119:peMA.Ode6C11.text	Be merciful, O Master. Be entreated, O Savior. Demonstrate Your mercy; demonstrate You compassion. Since You are good and You love humanity, save all whom You have transferred to yourself from all the earth.
ltx/en_us_dedes/pe.d119:peMA.Ode6C12.incipit	O only placable Lord, do…
ltx/en_us_dedes/pe.d119:peMA.Ode6C12.melody	@ltx/en_us_dedes/he.h.m6:heHE.TouViouTinThalassan.notmetered
ltx/en_us_dedes/pe.d119:peMA.Ode6C12.mode	@ltx/en_us_dedes/miscellanea:misc.Mode6
ltx/en_us_dedes/pe.d119:peMA.Ode6C12.ode	@ltx/en_us_dedes/miscellanea:misc.Ode6
ltx/en_us_dedes/pe.d119:peMA.Ode6C12.text	O only placable Lord, do not overlook those who died in a tsunami or flood, or in a river, those who had a sudden death, or whose life ended in the great outdoors, on mountains or in caves.
ltx/en_us_dedes/pe.d119:peMA.Ode6C13.incipit	O Lord, You see when…
ltx/en_us_dedes/pe.d119:peMA.Ode6C13.melody	@ltx/en_us_dedes/he.h.m6:heHE.TouViouTinThalassan.notmetered
ltx/en_us_dedes/pe.d119:peMA.Ode6C13.mode	@ltx/en_us_dedes/miscellanea:misc.Mode6
ltx/en_us_dedes/pe.d119:peMA.Ode6C13.ode	@ltx/en_us_dedes/miscellanea:misc.Ode6
ltx/en_us_dedes/pe.d119:peMA.Ode6C13.text	O Lord, You see when people die unknown on land and sea, and those whose lives end horribly in wars and battles and calamities. Have mercy on them all, O Savior, as You are benevolent.
ltx/en_us_dedes/pe.d119:peMA.Ode6C1H.greekmelody	@ltx/en_us_dedes/he.h.m6:heHE.TouViouTinThalassan.greekname
ltx/en_us_dedes/pe.d119:peMA.Ode6C1H.incipit	@ltx/en_us_dedes/he.h.m6:heHE.TouViouTinThalassan.incipit
ltx/en_us_dedes/pe.d119:peMA.Ode6C1H.melody	@ltx/en_us_dedes/he.h.m6:heHE.TouViouTinThalassan.melody
ltx/en_us_dedes/pe.d119:peMA.Ode6C1H.mode	@ltx/en_us_dedes/miscellanea:misc.Mode6
ltx/en_us_dedes/pe.d119:peMA.Ode6C1H.ode	@ltx/en_us_dedes/miscellanea:misc.Ode6
ltx/en_us_dedes/pe.d119:peMA.Ode6C1H.text	@ltx/en_us_dedes/he.h.m6:heHE.TouViouTinThalassan.text
ltx/en_us_dedes/pe.d119:peMA.Ode6C1T.incipit	O all-pure Lady, for us…
ltx/en_us_dedes/pe.d119:peMA.Ode6C1T.melody	@ltx/en_us_dedes/he.h.m6:heHE.TouViouTinThalassan.notmetered
ltx/en_us_dedes/pe.d119:peMA.Ode6C1T.mode	@ltx/en_us_dedes/miscellanea:misc.Mode6
ltx/en_us_dedes/pe.d119:peMA.Ode6C1T.ode	@ltx/en_us_dedes/miscellanea:misc.Ode6
ltx/en_us_dedes/pe.d119:peMA.Ode6C1T.text	O all-pure Lady, for us mortals you gave birth to the Lord and Pilot. I pray you to calm the unruly and harsh turbulence cased by my passions; and grant tranquility to my heart.
ltx/en_us_dedes/pe.d119:peMA.Ode7C11.greekmelody	@ltx/en_us_dedes/he.h.m6:heHE.DrosovolonMenTinKaminon.greekname
ltx/en_us_dedes/pe.d119:peMA.Ode7C11.incipit	Savior, when You come with…
ltx/en_us_dedes/pe.d119:peMA.Ode7C11.melody	@ltx/en_us_dedes/he.h.m6:heHE.DrosovolonMenTinKaminon.notmetered
ltx/en_us_dedes/pe.d119:peMA.Ode7C11.mode	@ltx/en_us_dedes/miscellanea:misc.Mode6
ltx/en_us_dedes/pe.d119:peMA.Ode7C11.ode	@ltx/en_us_dedes/miscellanea:misc.Ode7
ltx/en_us_dedes/pe.d119:peMA.Ode7C11.text	Savior, when You come with Your Angels, and You sit on Your throne of glory, to judge the earth, fill Your servants with Your divine joy, that they may unceasingly sing aloud: O God of our Fathers, You are blessed!
ltx/en_us_dedes/pe.d119:peMA.Ode7C12.incipit	O Savior, have mercy on…
ltx/en_us_dedes/pe.d119:peMA.Ode7C12.melody	@ltx/en_us_dedes/he.h.m6:heHE.DrosovolonMenTinKaminon.notmetered
ltx/en_us_dedes/pe.d119:peMA.Ode7C12.mode	@ltx/en_us_dedes/miscellanea:misc.Mode6
ltx/en_us_dedes/pe.d119:peMA.Ode7C12.ode	@ltx/en_us_dedes/miscellanea:misc.Ode7
ltx/en_us_dedes/pe.d119:peMA.Ode7C12.text	O Savior, have mercy on all who died by being ripped apart by wild animals, those whom fish dismembered, those buried by earthquakes, or who fell into pits or over cliffs; and deliver them from the threat of hell, O compassionate Lord.
ltx/en_us_dedes/pe.d119:peMA.Ode7C13.incipit	Pity those who were killed…
ltx/en_us_dedes/pe.d119:peMA.Ode7C13.melody	@ltx/en_us_dedes/he.h.m6:heHE.DrosovolonMenTinKaminon.notmetered
ltx/en_us_dedes/pe.d119:peMA.Ode7C13.mode	@ltx/en_us_dedes/miscellanea:misc.Mode6
ltx/en_us_dedes/pe.d119:peMA.Ode7C13.ode	@ltx/en_us_dedes/miscellanea:misc.Ode7
ltx/en_us_dedes/pe.d119:peMA.Ode7C13.text	Pity those who were killed by swords, dagger, fire, torture, or stoning, by robbers, or from famine or plague; and save them and grant them Your communion and joy, that they may reverently extol You, the God of our Fathers.
ltx/en_us_dedes/pe.d119:peMA.Ode7C1H.greekmelody	@ltx/en_us_dedes/he.h.m6:heHE.DrosovolonMenTinKaminon.greekname
ltx/en_us_dedes/pe.d119:peMA.Ode7C1H.incipit	@ltx/en_us_dedes/he.h.m6:heHE.DrosovolonMenTinKaminon.incipit
ltx/en_us_dedes/pe.d119:peMA.Ode7C1H.melody	@ltx/en_us_dedes/he.h.m6:heHE.DrosovolonMenTinKaminon.melody
ltx/en_us_dedes/pe.d119:peMA.Ode7C1H.mode	@ltx/en_us_dedes/miscellanea:misc.Mode6
ltx/en_us_dedes/pe.d119:peMA.Ode7C1H.ode	@ltx/en_us_dedes/miscellanea:misc.Ode7
ltx/en_us_dedes/pe.d119:peMA.Ode7C1H.text	@ltx/en_us_dedes/he.h.m6:heHE.DrosovolonMenTinKaminon.text
ltx/en_us_dedes/pe.d119:peMA.Ode7C1T.incipit	O pure Mother of God…
ltx/en_us_dedes/pe.d119:peMA.Ode7C1T.melody	@ltx/en_us_dedes/he.h.m6:heHE.DrosovolonMenTinKaminon.notmetered
ltx/en_us_dedes/pe.d119:peMA.Ode7C1T.mode	@ltx/en_us_dedes/miscellanea:misc.Mode6
ltx/en_us_dedes/pe.d119:peMA.Ode7C1T.ode	@ltx/en_us_dedes/miscellanea:misc.Ode7
ltx/en_us_dedes/pe.d119:peMA.Ode7C1T.text	O pure Mother of God, only you are a bridge for the world, transporting human beings to God. By your intercessions, save from all necessity and corruption, those who ended their life with hope and love for you.
ltx/en_us_dedes/pe.d119:peMA.Ode8C11.greekmelody	@ltx/en_us_dedes/he.h.m6:heHE.EkstithiFrittonOurane.greekname
ltx/en_us_dedes/pe.d119:peMA.Ode8C11.incipit	O Lord and Savior, our…
ltx/en_us_dedes/pe.d119:peMA.Ode8C11.melody	@ltx/en_us_dedes/he.h.m6:heHE.EkstithiFrittonOurane.notmetered
ltx/en_us_dedes/pe.d119:peMA.Ode8C11.mode	@ltx/en_us_dedes/miscellanea:misc.Mode6
ltx/en_us_dedes/pe.d119:peMA.Ode8C11.ode	@ltx/en_us_dedes/miscellanea:misc.Ode8
ltx/en_us_dedes/pe.d119:peMA.Ode8C11.text	O Lord and Savior, our only merciful God, grant repose to all people, of every rank and class, whom You have transported, Your faithful emperor and kings, princes and rulers and judges of the nations on the earth, governors and protectors of peoples and races, so that we may extol You, unto all the ages.
ltx/en_us_dedes/pe.d119:peMA.Ode8C12.incipit	O Lord who love humanity…
ltx/en_us_dedes/pe.d119:peMA.Ode8C12.melody	@ltx/en_us_dedes/he.h.m6:heHE.EkstithiFrittonOurane.notmetered
ltx/en_us_dedes/pe.d119:peMA.Ode8C12.mode	@ltx/en_us_dedes/miscellanea:misc.Mode6
ltx/en_us_dedes/pe.d119:peMA.Ode8C12.ode	@ltx/en_us_dedes/miscellanea:misc.Ode8
ltx/en_us_dedes/pe.d119:peMA.Ode8C12.text	O Lord who love humanity, rescue from the frightful fire the servants of Your holy Church; and save the orders of monastics, the ranks of the clergy, and the choirs of godly ministers. Count them all worthy of the glory of heaven, so that we may extol You, unto all the ages.
ltx/en_us_dedes/pe.d119:peMA.Ode8C13.incipit	Save, O Master Christ, save…
ltx/en_us_dedes/pe.d119:peMA.Ode8C13.melody	@ltx/en_us_dedes/he.h.m6:heHE.EkstithiFrittonOurane.notmetered
ltx/en_us_dedes/pe.d119:peMA.Ode8C13.mode	@ltx/en_us_dedes/miscellanea:misc.Mode6
ltx/en_us_dedes/pe.d119:peMA.Ode8C13.ode	@ltx/en_us_dedes/miscellanea:misc.Ode8
ltx/en_us_dedes/pe.d119:peMA.Ode8C13.text	Save, O Master Christ, save, have mercy, and grant repose to the souls of Your people who, in every place and land, conducted their lives faithfully with trembling; and rescue them from hellfire and bitter torments, so that we may extol You, unto all the ages.
ltx/en_us_dedes/pe.d119:peMA.Ode8C1H.greekmelody	@ltx/en_us_dedes/he.h.m6:heHE.EkstithiFrittonOurane.greekname
ltx/en_us_dedes/pe.d119:peMA.Ode8C1H.incipit	@ltx/en_us_dedes/he.h.m6:heHE.EkstithiFrittonOurane.incipit
ltx/en_us_dedes/pe.d119:peMA.Ode8C1H.melody	@ltx/en_us_dedes/he.h.m6:heHE.EkstithiFrittonOurane.melody
ltx/en_us_dedes/pe.d119:peMA.Ode8C1H.mode	@ltx/en_us_dedes/miscellanea:misc.Mode6
ltx/en_us_dedes/pe.d119:peMA.Ode8C1H.ode	@ltx/en_us_dedes/miscellanea:misc.Ode8
ltx/en_us_dedes/pe.d119:peMA.Ode8C1H.text	@ltx/en_us_dedes/he.h.m6:heHE.EkstithiFrittonOurane.text
ltx/en_us_dedes/pe.d119:peMA.Ode8C1T.incipit	O immaculate Virgin, only you…
ltx/en_us_dedes/pe.d119:peMA.Ode8C1T.melody	@ltx/en_us_dedes/he.h.m6:heHE.EkstithiFrittonOurane.notmetered
ltx/en_us_dedes/pe.d119:peMA.Ode8C1T.mode	@ltx/en_us_dedes/miscellanea:misc.Mode6
ltx/en_us_dedes/pe.d119:peMA.Ode8C1T.ode	@ltx/en_us_dedes/miscellanea:misc.Ode8
ltx/en_us_dedes/pe.d119:peMA.Ode8C1T.text	O immaculate Virgin, only you truly reversed the curse on Eve, and you became the source of life to those on earth. Therefore, by your intercessions, make worthy of eternal life all who have departed from temporal life, so that we may extol You, unto all the ages.
ltx/en_us_dedes/pe.d119:peMA.Ode9C11.greekmelody	@ltx/en_us_dedes/he.h.m6:heHE.AporeiPasaGlossa.greekname
ltx/en_us_dedes/pe.d119:peMA.Ode9C11.incipit	O merciful Lord, now the…
ltx/en_us_dedes/pe.d119:peMA.Ode9C11.melody	@ltx/en_us_dedes/he.h.m6:heHE.AporeiPasaGlossa.notmetered
ltx/en_us_dedes/pe.d119:peMA.Ode9C11.mode	@ltx/en_us_dedes/miscellanea:misc.Mode6
ltx/en_us_dedes/pe.d119:peMA.Ode9C11.ode	@ltx/en_us_dedes/miscellanea:misc.Ode9
ltx/en_us_dedes/pe.d119:peMA.Ode9C11.text	O merciful Lord, now the choirs of Angels implore You, and the Cherubim and divine Seraphim entreat You, and the Powers, the Thrones, Principalities, and Hosts, Archangels and Dominions all pray to You, O mighty God, that You be merciful to all the souls that You have translated.
ltx/en_us_dedes/pe.d119:peMA.Ode9C12.incipit	Behold, the Prophets entreat You…
ltx/en_us_dedes/pe.d119:peMA.Ode9C12.melody	@ltx/en_us_dedes/he.h.m6:heHE.AporeiPasaGlossa.notmetered
ltx/en_us_dedes/pe.d119:peMA.Ode9C12.mode	@ltx/en_us_dedes/miscellanea:misc.Mode6
ltx/en_us_dedes/pe.d119:peMA.Ode9C12.ode	@ltx/en_us_dedes/miscellanea:misc.Ode9
ltx/en_us_dedes/pe.d119:peMA.Ode9C12.text	Behold, the Prophets entreat You, the Apostles implore You, and the Patriarchs, the Martyrs and the Righteous all cry out in supplication: “Save the souls of all Your pious servants who have died on earth, O Lord who loves humanity.”
ltx/en_us_dedes/pe.d119:peMA.Ode9C13.incipit	You know everything, You see…
ltx/en_us_dedes/pe.d119:peMA.Ode9C13.melody	@ltx/en_us_dedes/he.h.m6:heHE.AporeiPasaGlossa.notmetered
ltx/en_us_dedes/pe.d119:peMA.Ode9C13.mode	@ltx/en_us_dedes/miscellanea:misc.Mode6
ltx/en_us_dedes/pe.d119:peMA.Ode9C13.ode	@ltx/en_us_dedes/miscellanea:misc.Ode9
ltx/en_us_dedes/pe.d119:peMA.Ode9C13.text	You know everything, You see, and You observe, and You know all people and the span of each person’s life. Give them all the forgiveness of their sins, and as the only compassionate God, grant the beauty of Paradise to all Your faithful servants, whom You have chosen.
ltx/en_us_dedes/pe.d119:peMA.Ode9C1H.greekmelody	@ltx/en_us_dedes/he.h.m6:heHE.AporeiPasaGlossa.greekname
ltx/en_us_dedes/pe.d119:peMA.Ode9C1H.incipit	@ltx/en_us_dedes/he.h.m6:heHE.AporeiPasaGlossa.incipit
ltx/en_us_dedes/pe.d119:peMA.Ode9C1H.melody	@ltx/en_us_dedes/he.h.m6:heHE.AporeiPasaGlossa.melody
ltx/en_us_dedes/pe.d119:peMA.Ode9C1H.mode	@ltx/en_us_dedes/miscellanea:misc.Mode6
ltx/en_us_dedes/pe.d119:peMA.Ode9C1H.ode	@ltx/en_us_dedes/miscellanea:misc.Ode9
ltx/en_us_dedes/pe.d119:peMA.Ode9C1H.text	@ltx/en_us_dedes/he.h.m6:heHE.AporeiPasaGlossa.text
ltx/en_us_dedes/pe.d119:peMA.Ode9C1T.incipit	Most holy Virgin and Lady…
ltx/en_us_dedes/pe.d119:peMA.Ode9C1T.melody	@ltx/en_us_dedes/he.h.m6:heHE.AporeiPasaGlossa.notmetered
ltx/en_us_dedes/pe.d119:peMA.Ode9C1T.mode	@ltx/en_us_dedes/miscellanea:misc.Mode6
ltx/en_us_dedes/pe.d119:peMA.Ode9C1T.ode	@ltx/en_us_dedes/miscellanea:misc.Ode9
ltx/en_us_dedes/pe.d119:peMA.Ode9C1T.text	Most holy Virgin and Lady of the world, you are the shelter of all, both the living and the dead; and you are the calmness, the glory, the delight and the relief of those who have obtained you as their defender, helper, and deliverer, O good one. Therefore, save them all, by your prayers.
ltx/en_us_dedes/pe.d119:peMA.Oikos1.text	@ltx/en_us_dedes/tr.d014:trMA.Oikos1.text
ltx/en_us_dedes/pe.d119:peSY.commemoration.narration.p01	[paragraph 01]
ltx/en_us_dedes/pe.d119:peSY.commemoration.narration.p02	[paragraph 02]
ltx/en_us_dedes/pe.d119:peSY.commemoration.narration.p03	[paragraph 03]
ltx/en_us_dedes/pe.d119:peSY.commemoration.narration.p04	[paragraph 04]
ltx/en_us_dedes/pe.d119:peSY.commemoration.narration.p05	[paragraph 05]
ltx/en_us_dedes/pe.d119:peSY.commemoration.narration.p06	[paragraph 06]
ltx/en_us_dedes/pe.d119:peSY.commemoration.narration.p07	[paragraph 07]
ltx/en_us_dedes/pe.d119:peSY.commemoration.text	Our most godly Fathers ordered that on this day we remember all those who have ever reposed with correct faith and with the hope of the resurrection of life eternal.
ltx/en_us_dedes/pe.d119:peSY.lastline	O Master Christ, assign the souls of those who have already reposed to the dwellings of the Righteous, and have mercy on us, as the only Immortal One. Amen.
ltx/en_us_dedes/pe.d119:peVE.ApolTheotokion.incipit	@ltx/en_us_dedes/tr.d014:trVE.ApolTheotokion.incipit
ltx/en_us_dedes/pe.d119:peVE.ApolTheotokion.melody	
ltx/en_us_dedes/pe.d119:peVE.ApolTheotokion.mode	@ltx/en_us_dedes/miscellanea:misc.Mode8
ltx/en_us_dedes/pe.d119:peVE.ApolTheotokion.text	@ltx/en_us_dedes/tr.d014:trVE.ApolTheotokion.text
ltx/en_us_dedes/pe.d119:peVE.Apolytikion1.incipit	@ltx/en_us_dedes/tr.d014:trVE.Apolytikion1.incipit
ltx/en_us_dedes/pe.d119:peVE.Apolytikion1.melody	
ltx/en_us_dedes/pe.d119:peVE.Apolytikion1.mode	@ltx/en_us_dedes/miscellanea:misc.Mode8
ltx/en_us_dedes/pe.d119:peVE.Apolytikion1.text	@ltx/en_us_dedes/tr.d014:trVE.Apolytikion1.text
ltx/en_us_dedes/pe.d119:peVE.Apolytikion2.incipit	@ltx/en_us_dedes/tr.d014:trVE.Apolytikion2.incipit
ltx/en_us_dedes/pe.d119:peVE.Apolytikion2.text	@ltx/en_us_dedes/tr.d014:trVE.Apolytikion2.text
ltx/en_us_dedes/pe.d119:peVE.AposBoth.incipit	@ltx/en_us_dedes/oc.m6.d7:ocVE.AposTheotokion.incipit
ltx/en_us_dedes/pe.d119:peVE.AposBoth.melody	@ltx/en_us_dedes/he.a.m6:heAU.TriimerosAnestis.name
ltx/en_us_dedes/pe.d119:peVE.AposBoth.mode	@ltx/en_us_dedes/miscellanea:misc.Mode6
ltx/en_us_dedes/pe.d119:peVE.AposBoth.text	@ltx/en_us_dedes/oc.m6.d7:ocVE.AposTheotokion.text
ltx/en_us_dedes/pe.d119:peVE.AposGlory.incipit	@ltx/en_us_dedes/oc.m6.d7:ocVE.Aposticha2.incipit
ltx/en_us_dedes/pe.d119:peVE.AposGlory.melody	
ltx/en_us_dedes/pe.d119:peVE.AposGlory.mode	@ltx/en_us_dedes/miscellanea:misc.Mode6
ltx/en_us_dedes/pe.d119:peVE.AposGlory.text	@ltx/en_us_dedes/oc.m6.d7:ocVE.Aposticha2.text
ltx/en_us_dedes/pe.d119:peVE.Aposticha1.incipit	@ltx/en_us_dedes/oc.m6.d5:ocVE.Aposticha3.incipit
ltx/en_us_dedes/pe.d119:peVE.Aposticha1.melody	
ltx/en_us_dedes/pe.d119:peVE.Aposticha1.mode	@ltx/en_us_dedes/miscellanea:misc.Mode6
ltx/en_us_dedes/pe.d119:peVE.Aposticha1.text	@ltx/en_us_dedes/oc.m6.d5:ocVE.Aposticha3.text
ltx/en_us_dedes/pe.d119:peVE.Aposticha2.incipit	@ltx/en_us_dedes/oc.m6.d7:ocMA.LaudsGlory.incipit
ltx/en_us_dedes/pe.d119:peVE.Aposticha2.melody	
ltx/en_us_dedes/pe.d119:peVE.Aposticha2.mode	@ltx/en_us_dedes/miscellanea:misc.Mode6
ltx/en_us_dedes/pe.d119:peVE.Aposticha2.text	@ltx/en_us_dedes/oc.m6.d7:ocMA.LaudsGlory.text
ltx/en_us_dedes/pe.d119:peVE.Aposticha3.incipit	You planted a garden in…
ltx/en_us_dedes/pe.d119:peVE.Aposticha3.melody	
ltx/en_us_dedes/pe.d119:peVE.Aposticha3.mode	@ltx/en_us_dedes/miscellanea:misc.Mode6
ltx/en_us_dedes/pe.d119:peVE.Aposticha3.text	You planted a garden in Eden, decorated with every kind of plant, and free from any sorrow and care; and You set me in it, as a partaker of divine life, a mixed being, living on earth and a peer of the angels. You did all this so that I might distinguish how much higher this life is from that of all the rest. Therefore, O Savior, give rest to Your servants, in the land of the living, where the righteous dwell.
ltx/en_us_dedes/pe.d119:peVE.SticBoth.incipit	@ltx/en_us_dedes/oc.m6.d1:ocVE.SticTheotokion.incipit
ltx/en_us_dedes/pe.d119:peVE.SticBoth.melody	
ltx/en_us_dedes/pe.d119:peVE.SticBoth.mode	@ltx/en_us_dedes/miscellanea:misc.Mode6
ltx/en_us_dedes/pe.d119:peVE.SticBoth.text	@ltx/en_us_dedes/oc.m6.d1:ocVE.SticTheotokion.text
ltx/en_us_dedes/pe.d119:peVE.SticGlory.incipit	@ltx/en_us_dedes/tr.d014:trVE.SticGlory.incipit
ltx/en_us_dedes/pe.d119:peVE.SticGlory.melody	
ltx/en_us_dedes/pe.d119:peVE.SticGlory.mode	@ltx/en_us_dedes/miscellanea:misc.Mode8
ltx/en_us_dedes/pe.d119:peVE.SticGlory.text	@ltx/en_us_dedes/tr.d014:trVE.SticGlory.text
ltx/en_us_dedes/pe.d119:peVE.Stichera01.incipit	@ltx/en_us_dedes/oc.m6.d2:ocVE.Aposticha3.incipit
ltx/en_us_dedes/pe.d119:peVE.Stichera01.melody	
ltx/en_us_dedes/pe.d119:peVE.Stichera01.mode	@ltx/en_us_dedes/miscellanea:misc.Mode6
ltx/en_us_dedes/pe.d119:peVE.Stichera01.text	@ltx/en_us_dedes/oc.m6.d2:ocVE.Aposticha3.text
ltx/en_us_dedes/pe.d119:peVE.Stichera02.incipit	@ltx/en_us_dedes/oc.m6.d3:ocVE.Aposticha3.incipit
ltx/en_us_dedes/pe.d119:peVE.Stichera02.melody	
ltx/en_us_dedes/pe.d119:peVE.Stichera02.mode	@ltx/en_us_dedes/miscellanea:misc.Mode6
ltx/en_us_dedes/pe.d119:peVE.Stichera02.text	@ltx/en_us_dedes/oc.m6.d3:ocVE.Aposticha3.text
ltx/en_us_dedes/pe.d119:peVE.Stichera03.incipit	@ltx/en_us_dedes/oc.m6.d4:ocVE.Aposticha3.incipit
ltx/en_us_dedes/pe.d119:peVE.Stichera03.melody	
ltx/en_us_dedes/pe.d119:peVE.Stichera03.mode	@ltx/en_us_dedes/miscellanea:misc.Mode6
ltx/en_us_dedes/pe.d119:peVE.Stichera03.text	@ltx/en_us_dedes/oc.m6.d4:ocVE.Aposticha3.text
ltx/en_us_dedes/pe.d119:peVE.Stichera04.greekmelody	@ltx/en_us_dedes/he.a.m8:heAU.OEnEdemParadeisos.greekname
ltx/en_us_dedes/pe.d119:peVE.Stichera04.incipit	@ltx/en_us_dedes/tr.d014:trVE.Stichera01.incipit
ltx/en_us_dedes/pe.d119:peVE.Stichera04.melody	@ltx/en_us_dedes/he.a.m8:heAU.OEnEdemParadeisos.name
ltx/en_us_dedes/pe.d119:peVE.Stichera04.mode	@ltx/en_us_dedes/miscellanea:misc.Mode8
ltx/en_us_dedes/pe.d119:peVE.Stichera04.text	@ltx/en_us_dedes/tr.d014:trVE.Stichera01.text
ltx/en_us_dedes/pe.d119:peVE.Stichera05.greekmelody	@ltx/en_us_dedes/he.a.m8:heAU.OEnEdemParadeisos.greekname
ltx/en_us_dedes/pe.d119:peVE.Stichera05.incipit	@ltx/en_us_dedes/tr.d014:trVE.Stichera02.incipit
ltx/en_us_dedes/pe.d119:peVE.Stichera05.melody	@ltx/en_us_dedes/he.a.m8:heAU.OEnEdemParadeisos.name
ltx/en_us_dedes/pe.d119:peVE.Stichera05.mode	@ltx/en_us_dedes/miscellanea:misc.Mode8
ltx/en_us_dedes/pe.d119:peVE.Stichera05.text	@ltx/en_us_dedes/tr.d014:trVE.Stichera02.text
ltx/en_us_dedes/pe.d119:peVE.Stichera06.incipit	@ltx/en_us_dedes/tr.d014:trVE.Stichera03.incipit
ltx/en_us_dedes/pe.d119:peVE.Stichera06.melody	@ltx/en_us_dedes/he.a.m8:heAU.OEnEdemParadeisos.name
ltx/en_us_dedes/pe.d119:peVE.Stichera06.mode	@ltx/en_us_dedes/miscellanea:misc.Mode8
ltx/en_us_dedes/pe.d119:peVE.Stichera06.text	@ltx/en_us_dedes/tr.d014:trVE.Stichera03.text
