ltx/en_us_dedes/me.m07.d18:meDA.commemoration.first	Memory of the Holy Martyr Emilian
ltx/en_us_dedes/me.m07.d18:meDA.commemoration.first_name	
ltx/en_us_dedes/me.m07.d18:meDA.commemoration.first_short	Memory of the Holy Martyr Emilian
ltx/en_us_dedes/me.m07.d18:meDA.commemoration.first_title	@ltx/en_us_dedes/titles:ti.SaintM
ltx/en_us_dedes/me.m07.d18:meDA.commemoration.full	Memory of the Holy Martyr Emilian
ltx/en_us_dedes/me.m07.d18:meDA.commemoration.second_name	
ltx/en_us_dedes/me.m07.d18:meDA.commemoration.second_title	
ltx/en_us_dedes/me.m07.d18:meDA.date	July 18
ltx/en_us_dedes/me.m07.d18:meDA.fordate	for July 18
ltx/en_us_dedes/me.m07.d18:meDA.insert1	the holy and glorious Martyr Emilian,
ltx/en_us_dedes/me.m07.d18:meDA.insert2	whose memory we observe,
ltx/en_us_dedes/me.m07.d18:meDA.note	
ltx/en_us_dedes/me.m07.d18:meDA.pdfcoverdate	July 18,
ltx/en_us_dedes/me.m07.d18:meDA.pdfheaderdate	July 18
ltx/en_us_dedes/me.m07.d18:meHO.commemorations	
ltx/en_us_dedes/me.m07.d18:meHO.note1	
ltx/en_us_dedes/me.m07.d18:meHO.note2	
ltx/en_us_dedes/me.m07.d18:meHO.number	
ltx/en_us_dedes/me.m07.d18:meHO.rank	
ltx/en_us_dedes/me.m07.d18:meLE.commemoration1	The Holy Martyr Aimilianos.
ltx/en_us_dedes/me.m07.d18:meLE.commemoration2	
ltx/en_us_dedes/me.m07.d18:meLI.Kontakion1.incipit	…
ltx/en_us_dedes/me.m07.d18:meLI.Kontakion1.melody	
ltx/en_us_dedes/me.m07.d18:meLI.Kontakion1.mode	
ltx/en_us_dedes/me.m07.d18:meLI.Kontakion1.text	
ltx/en_us_dedes/me.m07.d18:meLI.Megalynarion.text	
ltx/en_us_dedes/me.m07.d18:meMA.C1.acrostic.notice1	
ltx/en_us_dedes/me.m07.d18:meMA.C1.acrostic.text	
ltx/en_us_dedes/me.m07.d18:meMA.C1.acrostic.title	Canon for the Saint.
ltx/en_us_dedes/me.m07.d18:meMA.C1.title	@ltx/en_us_dedes/titles:ti.CanonSaintM
ltx/en_us_dedes/me.m07.d18:meMA.C1.verse	@ltx/en_us_dedes/prayers:pr.verse_SaintM.text
ltx/en_us_dedes/me.m07.d18:meMA.Ode1C11.greekmelody	@ltx/en_us_dedes/he.h.m4:heHE.AnoixoToStomaMou.greekname
ltx/en_us_dedes/me.m07.d18:meMA.Ode1C11.incipit	…
ltx/en_us_dedes/me.m07.d18:meMA.Ode1C11.melody	@ltx/en_us_dedes/he.h.m4:heHE.AnoixoToStomaMou.name
ltx/en_us_dedes/me.m07.d18:meMA.Ode1C11.mode	@ltx/en_us_dedes/miscellanea:misc.Mode4
ltx/en_us_dedes/me.m07.d18:meMA.Ode1C11.ode	@ltx/en_us_dedes/miscellanea:misc.Ode1
ltx/en_us_dedes/me.m07.d18:meMA.Ode1C11.text	
ltx/en_us_dedes/me.m07.d18:meMA.Ode1C12.incipit	…
ltx/en_us_dedes/me.m07.d18:meMA.Ode1C12.melody	@ltx/en_us_dedes/he.h.m4:heHE.AnoixoToStomaMou.name
ltx/en_us_dedes/me.m07.d18:meMA.Ode1C12.mode	@ltx/en_us_dedes/miscellanea:misc.Mode4
ltx/en_us_dedes/me.m07.d18:meMA.Ode1C12.ode	@ltx/en_us_dedes/miscellanea:misc.Ode1
ltx/en_us_dedes/me.m07.d18:meMA.Ode1C12.text	
ltx/en_us_dedes/me.m07.d18:meMA.Ode1C13.incipit	…
ltx/en_us_dedes/me.m07.d18:meMA.Ode1C13.melody	@ltx/en_us_dedes/he.h.m4:heHE.AnoixoToStomaMou.name
ltx/en_us_dedes/me.m07.d18:meMA.Ode1C13.mode	@ltx/en_us_dedes/miscellanea:misc.Mode4
ltx/en_us_dedes/me.m07.d18:meMA.Ode1C13.ode	@ltx/en_us_dedes/miscellanea:misc.Ode1
ltx/en_us_dedes/me.m07.d18:meMA.Ode1C13.text	
ltx/en_us_dedes/me.m07.d18:meMA.Ode1C1T.incipit	…
ltx/en_us_dedes/me.m07.d18:meMA.Ode1C1T.melody	@ltx/en_us_dedes/he.h.m4:heHE.AnoixoToStomaMou.name
ltx/en_us_dedes/me.m07.d18:meMA.Ode1C1T.mode	@ltx/en_us_dedes/miscellanea:misc.Mode4
ltx/en_us_dedes/me.m07.d18:meMA.Ode1C1T.ode	@ltx/en_us_dedes/miscellanea:misc.Ode1
ltx/en_us_dedes/me.m07.d18:meMA.Ode1C1T.text	
ltx/en_us_dedes/me.m07.d18:meMA.Ode3C11.greekmelody	@ltx/en_us_dedes/he.h.m4:heHE.TousSousYmnologous.greekname
ltx/en_us_dedes/me.m07.d18:meMA.Ode3C11.incipit	…
ltx/en_us_dedes/me.m07.d18:meMA.Ode3C11.melody	@ltx/en_us_dedes/he.h.m4:heHE.TousSousYmnologous.name
ltx/en_us_dedes/me.m07.d18:meMA.Ode3C11.mode	@ltx/en_us_dedes/miscellanea:misc.Mode4
ltx/en_us_dedes/me.m07.d18:meMA.Ode3C11.ode	@ltx/en_us_dedes/miscellanea:misc.Ode3
ltx/en_us_dedes/me.m07.d18:meMA.Ode3C11.text	
ltx/en_us_dedes/me.m07.d18:meMA.Ode3C12.incipit	…
ltx/en_us_dedes/me.m07.d18:meMA.Ode3C12.melody	@ltx/en_us_dedes/he.h.m4:heHE.TousSousYmnologous.name
ltx/en_us_dedes/me.m07.d18:meMA.Ode3C12.mode	@ltx/en_us_dedes/miscellanea:misc.Mode4
ltx/en_us_dedes/me.m07.d18:meMA.Ode3C12.ode	@ltx/en_us_dedes/miscellanea:misc.Ode3
ltx/en_us_dedes/me.m07.d18:meMA.Ode3C12.text	
ltx/en_us_dedes/me.m07.d18:meMA.Ode3C13.incipit	…
ltx/en_us_dedes/me.m07.d18:meMA.Ode3C13.melody	@ltx/en_us_dedes/he.h.m4:heHE.TousSousYmnologous.name
ltx/en_us_dedes/me.m07.d18:meMA.Ode3C13.mode	@ltx/en_us_dedes/miscellanea:misc.Mode4
ltx/en_us_dedes/me.m07.d18:meMA.Ode3C13.ode	@ltx/en_us_dedes/miscellanea:misc.Ode3
ltx/en_us_dedes/me.m07.d18:meMA.Ode3C13.text	
ltx/en_us_dedes/me.m07.d18:meMA.Ode3C1T.incipit	…
ltx/en_us_dedes/me.m07.d18:meMA.Ode3C1T.melody	@ltx/en_us_dedes/he.h.m4:heHE.TousSousYmnologous.name
ltx/en_us_dedes/me.m07.d18:meMA.Ode3C1T.mode	@ltx/en_us_dedes/miscellanea:misc.Mode4
ltx/en_us_dedes/me.m07.d18:meMA.Ode3C1T.ode	@ltx/en_us_dedes/miscellanea:misc.Ode3
ltx/en_us_dedes/me.m07.d18:meMA.Ode3C1T.text	
ltx/en_us_dedes/me.m07.d18:meMA.Ode3H.greekmelody	@ltx/en_us_dedes/he.h.m4:heHE.TousSousYmnologous.greekname
ltx/en_us_dedes/me.m07.d18:meMA.Ode3H.incipit	@ltx/en_us_dedes/he.h.m4:heHE.TousSousYmnologous.incipit
ltx/en_us_dedes/me.m07.d18:meMA.Ode3H.melody	@ltx/en_us_dedes/he.h.m4:heHE.TousSousYmnologous.melody
ltx/en_us_dedes/me.m07.d18:meMA.Ode3H.mode	@ltx/en_us_dedes/miscellanea:misc.Mode4
ltx/en_us_dedes/me.m07.d18:meMA.Ode3H.ode	@ltx/en_us_dedes/miscellanea:misc.Ode3
ltx/en_us_dedes/me.m07.d18:meMA.Ode3H.text	@ltx/en_us_dedes/he.h.m4:heHE.TousSousYmnologous.text
ltx/en_us_dedes/me.m07.d18:meMA.Ode3Kathisma1.greekmelody	@ltx/en_us_dedes/he.a.m3:heAU.TheiasPisteos.greekname
ltx/en_us_dedes/me.m07.d18:meMA.Ode3Kathisma1.incipit	…
ltx/en_us_dedes/me.m07.d18:meMA.Ode3Kathisma1.melody	@ltx/en_us_dedes/he.a.m3:heAU.TheiasPisteos.name
ltx/en_us_dedes/me.m07.d18:meMA.Ode3Kathisma1.mode	@ltx/en_us_dedes/miscellanea:misc.Mode3
ltx/en_us_dedes/me.m07.d18:meMA.Ode3Kathisma1.text	
ltx/en_us_dedes/me.m07.d18:meMA.Ode3KathismaSt.incipit	…
ltx/en_us_dedes/me.m07.d18:meMA.Ode3KathismaSt.melody	@ltx/en_us_dedes/he.a.m3:heAU.TheiasPisteos.name
ltx/en_us_dedes/me.m07.d18:meMA.Ode3KathismaSt.mode	@ltx/en_us_dedes/miscellanea:misc.Mode3
ltx/en_us_dedes/me.m07.d18:meMA.Ode3KathismaSt.text	
ltx/en_us_dedes/me.m07.d18:meMA.Ode3KathismaT.incipit	The only Lord was not…
ltx/en_us_dedes/me.m07.d18:meMA.Ode3KathismaT.melody	@ltx/en_us_dedes/he.a.m3:heAU.TheiasPisteos.notmetered
ltx/en_us_dedes/me.m07.d18:meMA.Ode3KathismaT.mode	@ltx/en_us_dedes/miscellanea:misc.Mode3
ltx/en_us_dedes/me.m07.d18:meMA.Ode3KathismaT.text	The only Lord was not separated from divine nature when He became flesh in your womb; but He remained God when He became man. And He kept you a virgin, like you were before childbirth, even after He was born of you, His all-blameless Mother. We entreat you to earnestly pray to Him, to save our souls.
ltx/en_us_dedes/me.m07.d18:meMA.Ode4C11.greekmelody	@ltx/en_us_dedes/he.h.m4:heHE.OKathimenosEnDoxi.greekname
ltx/en_us_dedes/me.m07.d18:meMA.Ode4C11.incipit	…
ltx/en_us_dedes/me.m07.d18:meMA.Ode4C11.melody	@ltx/en_us_dedes/he.h.m4:heHE.OKathimenosEnDoxi.name
ltx/en_us_dedes/me.m07.d18:meMA.Ode4C11.mode	@ltx/en_us_dedes/miscellanea:misc.Mode4
ltx/en_us_dedes/me.m07.d18:meMA.Ode4C11.ode	@ltx/en_us_dedes/miscellanea:misc.Ode4
ltx/en_us_dedes/me.m07.d18:meMA.Ode4C11.text	
ltx/en_us_dedes/me.m07.d18:meMA.Ode4C12.incipit	…
ltx/en_us_dedes/me.m07.d18:meMA.Ode4C12.melody	@ltx/en_us_dedes/he.h.m4:heHE.OKathimenosEnDoxi.name
ltx/en_us_dedes/me.m07.d18:meMA.Ode4C12.mode	@ltx/en_us_dedes/miscellanea:misc.Mode4
ltx/en_us_dedes/me.m07.d18:meMA.Ode4C12.ode	@ltx/en_us_dedes/miscellanea:misc.Ode4
ltx/en_us_dedes/me.m07.d18:meMA.Ode4C12.text	
ltx/en_us_dedes/me.m07.d18:meMA.Ode4C13.incipit	…
ltx/en_us_dedes/me.m07.d18:meMA.Ode4C13.melody	@ltx/en_us_dedes/he.h.m4:heHE.OKathimenosEnDoxi.name
ltx/en_us_dedes/me.m07.d18:meMA.Ode4C13.mode	@ltx/en_us_dedes/miscellanea:misc.Mode4
ltx/en_us_dedes/me.m07.d18:meMA.Ode4C13.ode	@ltx/en_us_dedes/miscellanea:misc.Ode4
ltx/en_us_dedes/me.m07.d18:meMA.Ode4C13.text	
ltx/en_us_dedes/me.m07.d18:meMA.Ode4C1T.incipit	…
ltx/en_us_dedes/me.m07.d18:meMA.Ode4C1T.melody	@ltx/en_us_dedes/he.h.m4:heHE.OKathimenosEnDoxi.name
ltx/en_us_dedes/me.m07.d18:meMA.Ode4C1T.mode	@ltx/en_us_dedes/miscellanea:misc.Mode4
ltx/en_us_dedes/me.m07.d18:meMA.Ode4C1T.ode	@ltx/en_us_dedes/miscellanea:misc.Ode4
ltx/en_us_dedes/me.m07.d18:meMA.Ode4C1T.text	
ltx/en_us_dedes/me.m07.d18:meMA.Ode5C11.greekmelody	@ltx/en_us_dedes/he.h.m4:heHE.ExestiTaSympanta.greekname
ltx/en_us_dedes/me.m07.d18:meMA.Ode5C11.incipit	…
ltx/en_us_dedes/me.m07.d18:meMA.Ode5C11.melody	@ltx/en_us_dedes/he.h.m4:heHE.ExestiTaSympanta.name
ltx/en_us_dedes/me.m07.d18:meMA.Ode5C11.mode	@ltx/en_us_dedes/miscellanea:misc.Mode4
ltx/en_us_dedes/me.m07.d18:meMA.Ode5C11.ode	@ltx/en_us_dedes/miscellanea:misc.Ode5
ltx/en_us_dedes/me.m07.d18:meMA.Ode5C11.text	
ltx/en_us_dedes/me.m07.d18:meMA.Ode5C12.incipit	…
ltx/en_us_dedes/me.m07.d18:meMA.Ode5C12.melody	@ltx/en_us_dedes/he.h.m4:heHE.ExestiTaSympanta.name
ltx/en_us_dedes/me.m07.d18:meMA.Ode5C12.mode	@ltx/en_us_dedes/miscellanea:misc.Mode4
ltx/en_us_dedes/me.m07.d18:meMA.Ode5C12.ode	@ltx/en_us_dedes/miscellanea:misc.Ode5
ltx/en_us_dedes/me.m07.d18:meMA.Ode5C12.text	
ltx/en_us_dedes/me.m07.d18:meMA.Ode5C13.incipit	…
ltx/en_us_dedes/me.m07.d18:meMA.Ode5C13.melody	@ltx/en_us_dedes/he.h.m4:heHE.ExestiTaSympanta.name
ltx/en_us_dedes/me.m07.d18:meMA.Ode5C13.mode	@ltx/en_us_dedes/miscellanea:misc.Mode4
ltx/en_us_dedes/me.m07.d18:meMA.Ode5C13.ode	@ltx/en_us_dedes/miscellanea:misc.Ode5
ltx/en_us_dedes/me.m07.d18:meMA.Ode5C13.text	
ltx/en_us_dedes/me.m07.d18:meMA.Ode5C1T.incipit	…
ltx/en_us_dedes/me.m07.d18:meMA.Ode5C1T.melody	@ltx/en_us_dedes/he.h.m4:heHE.ExestiTaSympanta.name
ltx/en_us_dedes/me.m07.d18:meMA.Ode5C1T.mode	@ltx/en_us_dedes/miscellanea:misc.Mode4
ltx/en_us_dedes/me.m07.d18:meMA.Ode5C1T.ode	@ltx/en_us_dedes/miscellanea:misc.Ode5
ltx/en_us_dedes/me.m07.d18:meMA.Ode5C1T.text	
ltx/en_us_dedes/me.m07.d18:meMA.Ode6C11.greekmelody	@ltx/en_us_dedes/he.h.m4:heHE.IlthonEisTaVathi.greekname
ltx/en_us_dedes/me.m07.d18:meMA.Ode6C11.incipit	…
ltx/en_us_dedes/me.m07.d18:meMA.Ode6C11.melody	@ltx/en_us_dedes/he.h.m4:heHE.IlthonEisTaVathi.name
ltx/en_us_dedes/me.m07.d18:meMA.Ode6C11.mode	@ltx/en_us_dedes/miscellanea:misc.Mode4
ltx/en_us_dedes/me.m07.d18:meMA.Ode6C11.ode	@ltx/en_us_dedes/miscellanea:misc.Ode6
ltx/en_us_dedes/me.m07.d18:meMA.Ode6C11.text	
ltx/en_us_dedes/me.m07.d18:meMA.Ode6C12.incipit	…
ltx/en_us_dedes/me.m07.d18:meMA.Ode6C12.melody	@ltx/en_us_dedes/he.h.m4:heHE.IlthonEisTaVathi.name
ltx/en_us_dedes/me.m07.d18:meMA.Ode6C12.mode	@ltx/en_us_dedes/miscellanea:misc.Mode4
ltx/en_us_dedes/me.m07.d18:meMA.Ode6C12.ode	@ltx/en_us_dedes/miscellanea:misc.Ode6
ltx/en_us_dedes/me.m07.d18:meMA.Ode6C12.text	
ltx/en_us_dedes/me.m07.d18:meMA.Ode6C13.incipit	…
ltx/en_us_dedes/me.m07.d18:meMA.Ode6C13.melody	@ltx/en_us_dedes/he.h.m4:heHE.IlthonEisTaVathi.name
ltx/en_us_dedes/me.m07.d18:meMA.Ode6C13.mode	@ltx/en_us_dedes/miscellanea:misc.Mode4
ltx/en_us_dedes/me.m07.d18:meMA.Ode6C13.ode	@ltx/en_us_dedes/miscellanea:misc.Ode6
ltx/en_us_dedes/me.m07.d18:meMA.Ode6C13.text	
ltx/en_us_dedes/me.m07.d18:meMA.Ode6C1T.incipit	…
ltx/en_us_dedes/me.m07.d18:meMA.Ode6C1T.melody	@ltx/en_us_dedes/he.h.m4:heHE.IlthonEisTaVathi.name
ltx/en_us_dedes/me.m07.d18:meMA.Ode6C1T.mode	@ltx/en_us_dedes/miscellanea:misc.Mode4
ltx/en_us_dedes/me.m07.d18:meMA.Ode6C1T.ode	@ltx/en_us_dedes/miscellanea:misc.Ode6
ltx/en_us_dedes/me.m07.d18:meMA.Ode6C1T.text	
ltx/en_us_dedes/me.m07.d18:meMA.Ode6H.greekmelody	@ltx/en_us_dedes/he.h.m4:heHE.IlthonEisTaVathi.greekname
ltx/en_us_dedes/me.m07.d18:meMA.Ode6H.incipit	@ltx/en_us_dedes/he.h.m4:heHE.IlthonEisTaVathi.incipit
ltx/en_us_dedes/me.m07.d18:meMA.Ode6H.melody	@ltx/en_us_dedes/he.h.m4:heHE.IlthonEisTaVathi.melody
ltx/en_us_dedes/me.m07.d18:meMA.Ode6H.mode	@ltx/en_us_dedes/miscellanea:misc.Mode4
ltx/en_us_dedes/me.m07.d18:meMA.Ode6H.ode	@ltx/en_us_dedes/miscellanea:misc.Ode6
ltx/en_us_dedes/me.m07.d18:meMA.Ode6H.text	@ltx/en_us_dedes/he.h.m4:heHE.IlthonEisTaVathi.text
ltx/en_us_dedes/me.m07.d18:meMA.Ode7C11.greekmelody	@ltx/en_us_dedes/he.h.m4:heHE.OukElatrefsan.greekname
ltx/en_us_dedes/me.m07.d18:meMA.Ode7C11.incipit	…
ltx/en_us_dedes/me.m07.d18:meMA.Ode7C11.melody	@ltx/en_us_dedes/he.h.m4:heHE.OukElatrefsan.name
ltx/en_us_dedes/me.m07.d18:meMA.Ode7C11.mode	@ltx/en_us_dedes/miscellanea:misc.Mode4
ltx/en_us_dedes/me.m07.d18:meMA.Ode7C11.ode	@ltx/en_us_dedes/miscellanea:misc.Ode7
ltx/en_us_dedes/me.m07.d18:meMA.Ode7C11.text	
ltx/en_us_dedes/me.m07.d18:meMA.Ode7C12.incipit	…
ltx/en_us_dedes/me.m07.d18:meMA.Ode7C12.melody	@ltx/en_us_dedes/he.h.m4:heHE.OukElatrefsan.name
ltx/en_us_dedes/me.m07.d18:meMA.Ode7C12.mode	@ltx/en_us_dedes/miscellanea:misc.Mode4
ltx/en_us_dedes/me.m07.d18:meMA.Ode7C12.ode	@ltx/en_us_dedes/miscellanea:misc.Ode7
ltx/en_us_dedes/me.m07.d18:meMA.Ode7C12.text	
ltx/en_us_dedes/me.m07.d18:meMA.Ode7C13.incipit	…
ltx/en_us_dedes/me.m07.d18:meMA.Ode7C13.melody	@ltx/en_us_dedes/he.h.m4:heHE.OukElatrefsan.name
ltx/en_us_dedes/me.m07.d18:meMA.Ode7C13.mode	@ltx/en_us_dedes/miscellanea:misc.Mode4
ltx/en_us_dedes/me.m07.d18:meMA.Ode7C13.ode	@ltx/en_us_dedes/miscellanea:misc.Ode7
ltx/en_us_dedes/me.m07.d18:meMA.Ode7C13.text	
ltx/en_us_dedes/me.m07.d18:meMA.Ode7C1T.incipit	…
ltx/en_us_dedes/me.m07.d18:meMA.Ode7C1T.melody	@ltx/en_us_dedes/he.h.m4:heHE.OukElatrefsan.name
ltx/en_us_dedes/me.m07.d18:meMA.Ode7C1T.mode	@ltx/en_us_dedes/miscellanea:misc.Mode4
ltx/en_us_dedes/me.m07.d18:meMA.Ode7C1T.ode	@ltx/en_us_dedes/miscellanea:misc.Ode7
ltx/en_us_dedes/me.m07.d18:meMA.Ode7C1T.text	
ltx/en_us_dedes/me.m07.d18:meMA.Ode8C11.greekmelody	@ltx/en_us_dedes/he.h.m4:heHE.PaidasEvageis.greekname
ltx/en_us_dedes/me.m07.d18:meMA.Ode8C11.incipit	…
ltx/en_us_dedes/me.m07.d18:meMA.Ode8C11.melody	@ltx/en_us_dedes/he.h.m4:heHE.PaidasEvageis.name
ltx/en_us_dedes/me.m07.d18:meMA.Ode8C11.mode	@ltx/en_us_dedes/miscellanea:misc.Mode4
ltx/en_us_dedes/me.m07.d18:meMA.Ode8C11.ode	@ltx/en_us_dedes/miscellanea:misc.Ode8
ltx/en_us_dedes/me.m07.d18:meMA.Ode8C11.text	
ltx/en_us_dedes/me.m07.d18:meMA.Ode8C12.incipit	…
ltx/en_us_dedes/me.m07.d18:meMA.Ode8C12.melody	@ltx/en_us_dedes/he.h.m4:heHE.PaidasEvageis.name
ltx/en_us_dedes/me.m07.d18:meMA.Ode8C12.mode	@ltx/en_us_dedes/miscellanea:misc.Mode4
ltx/en_us_dedes/me.m07.d18:meMA.Ode8C12.ode	@ltx/en_us_dedes/miscellanea:misc.Ode8
ltx/en_us_dedes/me.m07.d18:meMA.Ode8C12.text	
ltx/en_us_dedes/me.m07.d18:meMA.Ode8C13.incipit	…
ltx/en_us_dedes/me.m07.d18:meMA.Ode8C13.melody	@ltx/en_us_dedes/he.h.m4:heHE.PaidasEvageis.name
ltx/en_us_dedes/me.m07.d18:meMA.Ode8C13.mode	@ltx/en_us_dedes/miscellanea:misc.Mode4
ltx/en_us_dedes/me.m07.d18:meMA.Ode8C13.ode	@ltx/en_us_dedes/miscellanea:misc.Ode8
ltx/en_us_dedes/me.m07.d18:meMA.Ode8C13.text	
ltx/en_us_dedes/me.m07.d18:meMA.Ode8C1T.incipit	…
ltx/en_us_dedes/me.m07.d18:meMA.Ode8C1T.melody	@ltx/en_us_dedes/he.h.m4:heHE.PaidasEvageis.name
ltx/en_us_dedes/me.m07.d18:meMA.Ode8C1T.mode	@ltx/en_us_dedes/miscellanea:misc.Mode4
ltx/en_us_dedes/me.m07.d18:meMA.Ode8C1T.ode	@ltx/en_us_dedes/miscellanea:misc.Ode8
ltx/en_us_dedes/me.m07.d18:meMA.Ode8C1T.text	
ltx/en_us_dedes/me.m07.d18:meMA.Ode8H.greekmelody	@ltx/en_us_dedes/he.h.m4:heHE.PaidasEvageis.greekname
ltx/en_us_dedes/me.m07.d18:meMA.Ode8H.incipit	@ltx/en_us_dedes/he.h.m4:heHE.PaidasEvageis.incipit
ltx/en_us_dedes/me.m07.d18:meMA.Ode8H.melody	@ltx/en_us_dedes/he.h.m4:heHE.PaidasEvageis.melody
ltx/en_us_dedes/me.m07.d18:meMA.Ode8H.mode	@ltx/en_us_dedes/miscellanea:misc.Mode4
ltx/en_us_dedes/me.m07.d18:meMA.Ode8H.ode	@ltx/en_us_dedes/miscellanea:misc.Ode8
ltx/en_us_dedes/me.m07.d18:meMA.Ode8H.text	@ltx/en_us_dedes/he.h.m4:heHE.PaidasEvageis.text
ltx/en_us_dedes/me.m07.d18:meMA.Ode9C11.greekmelody	@ltx/en_us_dedes/he.h.m4:heHE.EvaMenToTisParakois.greekname
ltx/en_us_dedes/me.m07.d18:meMA.Ode9C11.incipit	…
ltx/en_us_dedes/me.m07.d18:meMA.Ode9C11.melody	@ltx/en_us_dedes/he.h.m4:heHE.EvaMenToTisParakois.name
ltx/en_us_dedes/me.m07.d18:meMA.Ode9C11.mode	@ltx/en_us_dedes/miscellanea:misc.Mode4
ltx/en_us_dedes/me.m07.d18:meMA.Ode9C11.ode	@ltx/en_us_dedes/miscellanea:misc.Ode9
ltx/en_us_dedes/me.m07.d18:meMA.Ode9C11.text	
ltx/en_us_dedes/me.m07.d18:meMA.Ode9C12.incipit	…
ltx/en_us_dedes/me.m07.d18:meMA.Ode9C12.melody	@ltx/en_us_dedes/he.h.m4:heHE.EvaMenToTisParakois.name
ltx/en_us_dedes/me.m07.d18:meMA.Ode9C12.mode	@ltx/en_us_dedes/miscellanea:misc.Mode4
ltx/en_us_dedes/me.m07.d18:meMA.Ode9C12.ode	@ltx/en_us_dedes/miscellanea:misc.Ode9
ltx/en_us_dedes/me.m07.d18:meMA.Ode9C12.text	
ltx/en_us_dedes/me.m07.d18:meMA.Ode9C13.incipit	…
ltx/en_us_dedes/me.m07.d18:meMA.Ode9C13.melody	@ltx/en_us_dedes/he.h.m4:heHE.EvaMenToTisParakois.name
ltx/en_us_dedes/me.m07.d18:meMA.Ode9C13.mode	@ltx/en_us_dedes/miscellanea:misc.Mode4
ltx/en_us_dedes/me.m07.d18:meMA.Ode9C13.ode	@ltx/en_us_dedes/miscellanea:misc.Ode9
ltx/en_us_dedes/me.m07.d18:meMA.Ode9C13.text	
ltx/en_us_dedes/me.m07.d18:meMA.Ode9C14.incipit	…
ltx/en_us_dedes/me.m07.d18:meMA.Ode9C14.melody	@ltx/en_us_dedes/he.h.m4:heHE.EvaMenToTisParakois.name
ltx/en_us_dedes/me.m07.d18:meMA.Ode9C14.mode	@ltx/en_us_dedes/miscellanea:misc.Mode4
ltx/en_us_dedes/me.m07.d18:meMA.Ode9C14.ode	@ltx/en_us_dedes/miscellanea:misc.Ode9
ltx/en_us_dedes/me.m07.d18:meMA.Ode9C14.text	
ltx/en_us_dedes/me.m07.d18:meMA.Ode9C1T.incipit	…
ltx/en_us_dedes/me.m07.d18:meMA.Ode9C1T.melody	@ltx/en_us_dedes/he.h.m4:heHE.EvaMenToTisParakois.name
ltx/en_us_dedes/me.m07.d18:meMA.Ode9C1T.mode	@ltx/en_us_dedes/miscellanea:misc.Mode4
ltx/en_us_dedes/me.m07.d18:meMA.Ode9C1T.ode	@ltx/en_us_dedes/miscellanea:misc.Ode9
ltx/en_us_dedes/me.m07.d18:meMA.Ode9C1T.text	
ltx/en_us_dedes/me.m07.d18:meMA.Ode9H.greekmelody	@ltx/en_us_dedes/he.h.m4:heHE.EvaMenToTisParakois.greekname
ltx/en_us_dedes/me.m07.d18:meMA.Ode9H.incipit	@ltx/en_us_dedes/he.h.m4:heHE.EvaMenToTisParakois.incipit
ltx/en_us_dedes/me.m07.d18:meMA.Ode9H.melody	@ltx/en_us_dedes/he.h.m4:heHE.EvaMenToTisParakois.melody
ltx/en_us_dedes/me.m07.d18:meMA.Ode9H.mode	@ltx/en_us_dedes/miscellanea:misc.Mode4
ltx/en_us_dedes/me.m07.d18:meMA.Ode9H.ode	@ltx/en_us_dedes/miscellanea:misc.Ode9
ltx/en_us_dedes/me.m07.d18:meMA.Ode9H.text	@ltx/en_us_dedes/he.h.m4:heHE.EvaMenToTisParakois.text
ltx/en_us_dedes/me.m07.d18:meVE.Apolytikion1ger.greekmelody	@ltx/en_us_dedes/he.a.m4:heAU.OYpsotheisEnToStavro.greekname
ltx/en_us_dedes/me.m07.d18:meVE.Apolytikion1ger.incipit	…
ltx/en_us_dedes/me.m07.d18:meVE.Apolytikion1ger.melody	@ltx/en_us_dedes/he.a.m4:heAU.OYpsotheisEnToStavro.name
ltx/en_us_dedes/me.m07.d18:meVE.Apolytikion1ger.mode	@ltx/en_us_dedes/miscellanea:misc.Mode4
ltx/en_us_dedes/me.m07.d18:meVE.Apolytikion1ger.poet	@ltx/en_us_dedes/poets:po.Gerasimou
ltx/en_us_dedes/me.m07.d18:meVE.Apolytikion1ger.text	
ltx/en_us_dedes/me.m07.d18:meVE.SticStavrotheotokion.greekmelody	@ltx/en_us_dedes/he.a.m4:heAU.EdokasSimeiosin.greekname
ltx/en_us_dedes/me.m07.d18:meVE.SticStavrotheotokion.incipit	As the all-pure Lady saw…
ltx/en_us_dedes/me.m07.d18:meVE.SticStavrotheotokion.melody	@ltx/en_us_dedes/he.a.m4:heAU.EdokasSimeiosin.name
ltx/en_us_dedes/me.m07.d18:meVE.SticStavrotheotokion.mode	@ltx/en_us_dedes/miscellanea:misc.Mode4
ltx/en_us_dedes/me.m07.d18:meVE.SticStavrotheotokion.text	As the all-pure Lady saw her only Son being put to death, * who as Master and Christ himself * put to death the crafty one, * weeping she extolled Him, * born of her own body; * and as she marveled and admired * His great forbearance, she cried aloud and said, * “As God, being benevolent, do not forget me Your handmaiden; * O my Child, for whom I long, let my heartache be not prolonged.”
ltx/en_us_dedes/me.m07.d18:meVE.SticTheotokion.greekmelody	@ltx/en_us_dedes/he.a.m4:heAU.EdokasSimeiosin.greekname
ltx/en_us_dedes/me.m07.d18:meVE.SticTheotokion.incipit	@ltx/en_us_dedes/oc.m4.d4:ocVE.Stichera4.incipit
ltx/en_us_dedes/me.m07.d18:meVE.SticTheotokion.melody	@ltx/en_us_dedes/he.a.m4:heAU.EdokasSimeiosin.name
ltx/en_us_dedes/me.m07.d18:meVE.SticTheotokion.mode	@ltx/en_us_dedes/miscellanea:misc.Mode4
ltx/en_us_dedes/me.m07.d18:meVE.SticTheotokion.text	@ltx/en_us_dedes/oc.m4.d4:ocVE.Stichera4.text
ltx/en_us_dedes/me.m07.d18:meVE.Stichera01.greekmelody	@ltx/en_us_dedes/he.a.m4:heAU.EdokasSimeiosin.greekname
ltx/en_us_dedes/me.m07.d18:meVE.Stichera01.incipit	O Master, You clothed Your…
ltx/en_us_dedes/me.m07.d18:meVE.Stichera01.melody	@ltx/en_us_dedes/he.a.m4:heAU.EdokasSimeiosin.name
ltx/en_us_dedes/me.m07.d18:meVE.Stichera01.mode	@ltx/en_us_dedes/miscellanea:misc.Mode4
ltx/en_us_dedes/me.m07.d18:meVE.Stichera01.text	O Master, You clothed Your medaled Saint with Your power from on high, * which is truly invincible, * and thus You enabled him to endure the tortures * for You as a Martyr, when lawless foes tormented him, * and to receive halos for his martyrdom. * O Jesus the almighty Savior of our souls, we implore You grant * the forgiveness of all our sins, at the prayers of Emilian.
ltx/en_us_dedes/me.m07.d18:meVE.Stichera02.incipit	O Lord, when Your medaled…
ltx/en_us_dedes/me.m07.d18:meVE.Stichera02.melody	@ltx/en_us_dedes/he.a.m4:heAU.EdokasSimeiosin.name
ltx/en_us_dedes/me.m07.d18:meVE.Stichera02.mode	@ltx/en_us_dedes/miscellanea:misc.Mode4
ltx/en_us_dedes/me.m07.d18:meVE.Stichera02.text	O Lord, when Your medaled Saint was fully armed with Your holy Cross * and on fire with zeal for You, * he entered the pagan shrines and smashed all the idols. * Thus the hosts of him who is evil’s author were destroyed * by Your all-glorious Saint Emilian. * O Master, for his victory You have awarded Him heavenly * rule and kingdom. And now he prays * that you save us who honor him.
ltx/en_us_dedes/me.m07.d18:meVE.Stichera03.incipit	O Lord, You have added…
ltx/en_us_dedes/me.m07.d18:meVE.Stichera03.melody	@ltx/en_us_dedes/he.a.m4:heAU.EdokasSimeiosin.name
ltx/en_us_dedes/me.m07.d18:meVE.Stichera03.mode	@ltx/en_us_dedes/miscellanea:misc.Mode4
ltx/en_us_dedes/me.m07.d18:meVE.Stichera03.text	O Lord, You have added to the Church’s firmament Your sublime * holy Martyr Emilian. * He shines like a brilliant star, as a sterling soldier. * Lighting up the whole world with mystic miracles and signs, * he drives away the darkness of godlessness. * O Jesus the almighty Savior of our souls, we extol You now; * through Your Saint You illumine us * to sing praises befitting God.
