ltx/en_us_dedes/tr.d066:trCO.Kathisma11.incipit	…
ltx/en_us_dedes/tr.d066:trCO.Kathisma11.melody	@ltx/en_us_dedes/he.a.m2:heAU.EfsplagchniasYparchousa.name
ltx/en_us_dedes/tr.d066:trCO.Kathisma11.mode	@ltx/en_us_dedes/miscellanea:misc.Mode2
ltx/en_us_dedes/tr.d066:trCO.Kathisma11.text	
ltx/en_us_dedes/tr.d066:trCO.Ode2C11.incipit	…
ltx/en_us_dedes/tr.d066:trCO.Ode2C11.melody	@ltx/en_us_dedes/he.h.m8:heHE.ProsecheOurane.name
ltx/en_us_dedes/tr.d066:trCO.Ode2C11.mode	@ltx/en_us_dedes/miscellanea:misc.Mode8
ltx/en_us_dedes/tr.d066:trCO.Ode2C11.ode	@ltx/en_us_dedes/miscellanea:misc.Ode2
ltx/en_us_dedes/tr.d066:trCO.Ode2C11.text	
ltx/en_us_dedes/tr.d066:trCO.Ode2C12.incipit	…
ltx/en_us_dedes/tr.d066:trCO.Ode2C12.melody	@ltx/en_us_dedes/he.h.m8:heHE.ProsecheOurane.name
ltx/en_us_dedes/tr.d066:trCO.Ode2C12.mode	@ltx/en_us_dedes/miscellanea:misc.Mode8
ltx/en_us_dedes/tr.d066:trCO.Ode2C12.ode	@ltx/en_us_dedes/miscellanea:misc.Ode2
ltx/en_us_dedes/tr.d066:trCO.Ode2C12.text	
ltx/en_us_dedes/tr.d066:trCO.Ode2C13.incipit	…
ltx/en_us_dedes/tr.d066:trCO.Ode2C13.melody	@ltx/en_us_dedes/he.h.m8:heHE.ProsecheOurane.name
ltx/en_us_dedes/tr.d066:trCO.Ode2C13.mode	@ltx/en_us_dedes/miscellanea:misc.Mode8
ltx/en_us_dedes/tr.d066:trCO.Ode2C13.ode	@ltx/en_us_dedes/miscellanea:misc.Ode2
ltx/en_us_dedes/tr.d066:trCO.Ode2C13.text	
ltx/en_us_dedes/tr.d066:trCO.Ode2C1H.incipit	@ltx/en_us_dedes/he.h.m8:heHE.ProsecheOurane.incipit
ltx/en_us_dedes/tr.d066:trCO.Ode2C1H.melody	@ltx/en_us_dedes/he.h.m8:heHE.ProsecheOurane.melody
ltx/en_us_dedes/tr.d066:trCO.Ode2C1H.mode	@ltx/en_us_dedes/miscellanea:misc.Mode8
ltx/en_us_dedes/tr.d066:trCO.Ode2C1H.ode	@ltx/en_us_dedes/miscellanea:misc.Ode2
ltx/en_us_dedes/tr.d066:trCO.Ode2C1H.text	@ltx/en_us_dedes/he.h.m8:heHE.ProsecheOurane.text
ltx/en_us_dedes/tr.d066:trCO.Ode2C1T.incipit	…
ltx/en_us_dedes/tr.d066:trCO.Ode2C1T.melody	@ltx/en_us_dedes/he.h.m8:heHE.ProsecheOurane.name
ltx/en_us_dedes/tr.d066:trCO.Ode2C1T.mode	@ltx/en_us_dedes/miscellanea:misc.Mode8
ltx/en_us_dedes/tr.d066:trCO.Ode2C1T.ode	@ltx/en_us_dedes/miscellanea:misc.Ode2
ltx/en_us_dedes/tr.d066:trCO.Ode2C1T.text	
ltx/en_us_dedes/tr.d066:trCO.Ode2C21.incipit	…
ltx/en_us_dedes/tr.d066:trCO.Ode2C21.melody	@ltx/en_us_dedes/he.h.m8:heHE.IdeteIdeteOPrinGenesthai.name
ltx/en_us_dedes/tr.d066:trCO.Ode2C21.mode	@ltx/en_us_dedes/miscellanea:misc.Mode8
ltx/en_us_dedes/tr.d066:trCO.Ode2C21.ode	@ltx/en_us_dedes/miscellanea:misc.Ode2
ltx/en_us_dedes/tr.d066:trCO.Ode2C21.text	
ltx/en_us_dedes/tr.d066:trCO.Ode2C22.incipit	…
ltx/en_us_dedes/tr.d066:trCO.Ode2C22.melody	@ltx/en_us_dedes/he.h.m8:heHE.IdeteIdeteOPrinGenesthai.name
ltx/en_us_dedes/tr.d066:trCO.Ode2C22.mode	@ltx/en_us_dedes/miscellanea:misc.Mode8
ltx/en_us_dedes/tr.d066:trCO.Ode2C22.ode	@ltx/en_us_dedes/miscellanea:misc.Ode2
ltx/en_us_dedes/tr.d066:trCO.Ode2C22.text	
ltx/en_us_dedes/tr.d066:trCO.Ode2C23.incipit	…
ltx/en_us_dedes/tr.d066:trCO.Ode2C23.melody	@ltx/en_us_dedes/he.h.m8:heHE.IdeteIdeteOPrinGenesthai.name
ltx/en_us_dedes/tr.d066:trCO.Ode2C23.mode	@ltx/en_us_dedes/miscellanea:misc.Mode8
ltx/en_us_dedes/tr.d066:trCO.Ode2C23.ode	@ltx/en_us_dedes/miscellanea:misc.Ode2
ltx/en_us_dedes/tr.d066:trCO.Ode2C23.text	
ltx/en_us_dedes/tr.d066:trCO.Ode2C24.incipit	…
ltx/en_us_dedes/tr.d066:trCO.Ode2C24.melody	@ltx/en_us_dedes/he.h.m8:heHE.IdeteIdeteOPrinGenesthai.name
ltx/en_us_dedes/tr.d066:trCO.Ode2C24.mode	@ltx/en_us_dedes/miscellanea:misc.Mode8
ltx/en_us_dedes/tr.d066:trCO.Ode2C24.ode	@ltx/en_us_dedes/miscellanea:misc.Ode2
ltx/en_us_dedes/tr.d066:trCO.Ode2C24.text	
ltx/en_us_dedes/tr.d066:trCO.Ode2C25.incipit	…
ltx/en_us_dedes/tr.d066:trCO.Ode2C25.melody	@ltx/en_us_dedes/he.h.m8:heHE.IdeteIdeteOPrinGenesthai.name
ltx/en_us_dedes/tr.d066:trCO.Ode2C25.mode	@ltx/en_us_dedes/miscellanea:misc.Mode8
ltx/en_us_dedes/tr.d066:trCO.Ode2C25.ode	@ltx/en_us_dedes/miscellanea:misc.Ode2
ltx/en_us_dedes/tr.d066:trCO.Ode2C25.text	
ltx/en_us_dedes/tr.d066:trCO.Ode2C2H.incipit	@ltx/en_us_dedes/he.h.m8:heHE.IdeteIdeteOPrinGenesthai.incipit
ltx/en_us_dedes/tr.d066:trCO.Ode2C2H.melody	@ltx/en_us_dedes/he.h.m8:heHE.IdeteIdeteOPrinGenesthai.melody
ltx/en_us_dedes/tr.d066:trCO.Ode2C2H.mode	@ltx/en_us_dedes/miscellanea:misc.Mode8
ltx/en_us_dedes/tr.d066:trCO.Ode2C2H.ode	@ltx/en_us_dedes/miscellanea:misc.Ode2
ltx/en_us_dedes/tr.d066:trCO.Ode2C2H.text	@ltx/en_us_dedes/he.h.m8:heHE.IdeteIdeteOPrinGenesthai.text
ltx/en_us_dedes/tr.d066:trCO.Ode2C2T.incipit	…
ltx/en_us_dedes/tr.d066:trCO.Ode2C2T.melody	@ltx/en_us_dedes/he.h.m8:heHE.IdeteIdeteOPrinGenesthai.name
ltx/en_us_dedes/tr.d066:trCO.Ode2C2T.mode	@ltx/en_us_dedes/miscellanea:misc.Mode8
ltx/en_us_dedes/tr.d066:trCO.Ode2C2T.ode	@ltx/en_us_dedes/miscellanea:misc.Ode2
ltx/en_us_dedes/tr.d066:trCO.Ode2C2T.text	
ltx/en_us_dedes/tr.d066:trCO.Ode2C2Tr.incipit	…
ltx/en_us_dedes/tr.d066:trCO.Ode2C2Tr.melody	@ltx/en_us_dedes/he.h.m8:heHE.IdeteIdeteOPrinGenesthai.name
ltx/en_us_dedes/tr.d066:trCO.Ode2C2Tr.mode	@ltx/en_us_dedes/miscellanea:misc.Mode8
ltx/en_us_dedes/tr.d066:trCO.Ode2C2Tr.ode	@ltx/en_us_dedes/miscellanea:misc.Ode2
ltx/en_us_dedes/tr.d066:trCO.Ode2C2Tr.text	
ltx/en_us_dedes/tr.d066:trCO.Ode8C11.incipit	…
ltx/en_us_dedes/tr.d066:trCO.Ode8C11.melody	@ltx/en_us_dedes/he.h.m8:heHE.AngeloiKaiOuranoi.name
ltx/en_us_dedes/tr.d066:trCO.Ode8C11.mode	@ltx/en_us_dedes/miscellanea:misc.Mode8
ltx/en_us_dedes/tr.d066:trCO.Ode8C11.ode	@ltx/en_us_dedes/miscellanea:misc.Ode8
ltx/en_us_dedes/tr.d066:trCO.Ode8C11.text	
ltx/en_us_dedes/tr.d066:trCO.Ode8C12.incipit	…
ltx/en_us_dedes/tr.d066:trCO.Ode8C12.melody	@ltx/en_us_dedes/he.h.m8:heHE.AngeloiKaiOuranoi.name
ltx/en_us_dedes/tr.d066:trCO.Ode8C12.mode	@ltx/en_us_dedes/miscellanea:misc.Mode8
ltx/en_us_dedes/tr.d066:trCO.Ode8C12.ode	@ltx/en_us_dedes/miscellanea:misc.Ode8
ltx/en_us_dedes/tr.d066:trCO.Ode8C12.text	
ltx/en_us_dedes/tr.d066:trCO.Ode8C13.incipit	…
ltx/en_us_dedes/tr.d066:trCO.Ode8C13.melody	@ltx/en_us_dedes/he.h.m8:heHE.AngeloiKaiOuranoi.name
ltx/en_us_dedes/tr.d066:trCO.Ode8C13.mode	@ltx/en_us_dedes/miscellanea:misc.Mode8
ltx/en_us_dedes/tr.d066:trCO.Ode8C13.ode	@ltx/en_us_dedes/miscellanea:misc.Ode8
ltx/en_us_dedes/tr.d066:trCO.Ode8C13.text	
ltx/en_us_dedes/tr.d066:trCO.Ode8C14.incipit	…
ltx/en_us_dedes/tr.d066:trCO.Ode8C14.melody	@ltx/en_us_dedes/he.h.m8:heHE.AngeloiKaiOuranoi.name
ltx/en_us_dedes/tr.d066:trCO.Ode8C14.mode	@ltx/en_us_dedes/miscellanea:misc.Mode8
ltx/en_us_dedes/tr.d066:trCO.Ode8C14.ode	@ltx/en_us_dedes/miscellanea:misc.Ode8
ltx/en_us_dedes/tr.d066:trCO.Ode8C14.text	
ltx/en_us_dedes/tr.d066:trCO.Ode8C15.incipit	…
ltx/en_us_dedes/tr.d066:trCO.Ode8C15.melody	@ltx/en_us_dedes/he.h.m8:heHE.AngeloiKaiOuranoi.name
ltx/en_us_dedes/tr.d066:trCO.Ode8C15.mode	@ltx/en_us_dedes/miscellanea:misc.Mode8
ltx/en_us_dedes/tr.d066:trCO.Ode8C15.ode	@ltx/en_us_dedes/miscellanea:misc.Ode8
ltx/en_us_dedes/tr.d066:trCO.Ode8C15.text	
ltx/en_us_dedes/tr.d066:trCO.Ode8C16.incipit	…
ltx/en_us_dedes/tr.d066:trCO.Ode8C16.melody	@ltx/en_us_dedes/he.h.m8:heHE.AngeloiKaiOuranoi.name
ltx/en_us_dedes/tr.d066:trCO.Ode8C16.mode	@ltx/en_us_dedes/miscellanea:misc.Mode8
ltx/en_us_dedes/tr.d066:trCO.Ode8C16.ode	@ltx/en_us_dedes/miscellanea:misc.Ode8
ltx/en_us_dedes/tr.d066:trCO.Ode8C16.text	
ltx/en_us_dedes/tr.d066:trCO.Ode8C1H.incipit	@ltx/en_us_dedes/he.h.m8:heHE.AngeloiKaiOuranoi.incipit
ltx/en_us_dedes/tr.d066:trCO.Ode8C1H.melody	@ltx/en_us_dedes/he.h.m8:heHE.AngeloiKaiOuranoi.melody
ltx/en_us_dedes/tr.d066:trCO.Ode8C1H.mode	@ltx/en_us_dedes/miscellanea:misc.Mode8
ltx/en_us_dedes/tr.d066:trCO.Ode8C1H.ode	@ltx/en_us_dedes/miscellanea:misc.Ode8
ltx/en_us_dedes/tr.d066:trCO.Ode8C1H.text	@ltx/en_us_dedes/he.h.m8:heHE.AngeloiKaiOuranoi.text
ltx/en_us_dedes/tr.d066:trCO.Ode8C1T.incipit	…
ltx/en_us_dedes/tr.d066:trCO.Ode8C1T.melody	@ltx/en_us_dedes/he.h.m8:heHE.AngeloiKaiOuranoi.name
ltx/en_us_dedes/tr.d066:trCO.Ode8C1T.mode	@ltx/en_us_dedes/miscellanea:misc.Mode8
ltx/en_us_dedes/tr.d066:trCO.Ode8C1T.ode	@ltx/en_us_dedes/miscellanea:misc.Ode8
ltx/en_us_dedes/tr.d066:trCO.Ode8C1T.text	
ltx/en_us_dedes/tr.d066:trCO.Ode8C1Tr.incipit	…
ltx/en_us_dedes/tr.d066:trCO.Ode8C1Tr.melody	@ltx/en_us_dedes/he.h.m8:heHE.AngeloiKaiOuranoi.name
ltx/en_us_dedes/tr.d066:trCO.Ode8C1Tr.mode	@ltx/en_us_dedes/miscellanea:misc.Mode8
ltx/en_us_dedes/tr.d066:trCO.Ode8C1Tr.ode	@ltx/en_us_dedes/miscellanea:misc.Ode8
ltx/en_us_dedes/tr.d066:trCO.Ode8C1Tr.text	
ltx/en_us_dedes/tr.d066:trCO.Ode9C11.incipit	…
ltx/en_us_dedes/tr.d066:trCO.Ode9C11.melody	@ltx/en_us_dedes/he.h.m8:heHE.TonProdilothenta.name
ltx/en_us_dedes/tr.d066:trCO.Ode9C11.mode	@ltx/en_us_dedes/miscellanea:misc.Mode8
ltx/en_us_dedes/tr.d066:trCO.Ode9C11.ode	@ltx/en_us_dedes/miscellanea:misc.Ode9
ltx/en_us_dedes/tr.d066:trCO.Ode9C11.text	
ltx/en_us_dedes/tr.d066:trCO.Ode9C12.incipit	…
ltx/en_us_dedes/tr.d066:trCO.Ode9C12.melody	@ltx/en_us_dedes/he.h.m8:heHE.TonProdilothenta.name
ltx/en_us_dedes/tr.d066:trCO.Ode9C12.mode	@ltx/en_us_dedes/miscellanea:misc.Mode8
ltx/en_us_dedes/tr.d066:trCO.Ode9C12.ode	@ltx/en_us_dedes/miscellanea:misc.Ode9
ltx/en_us_dedes/tr.d066:trCO.Ode9C12.text	
ltx/en_us_dedes/tr.d066:trCO.Ode9C13.incipit	…
ltx/en_us_dedes/tr.d066:trCO.Ode9C13.melody	@ltx/en_us_dedes/he.h.m8:heHE.TonProdilothenta.name
ltx/en_us_dedes/tr.d066:trCO.Ode9C13.mode	@ltx/en_us_dedes/miscellanea:misc.Mode8
ltx/en_us_dedes/tr.d066:trCO.Ode9C13.ode	@ltx/en_us_dedes/miscellanea:misc.Ode9
ltx/en_us_dedes/tr.d066:trCO.Ode9C13.text	
ltx/en_us_dedes/tr.d066:trCO.Ode9C14.incipit	…
ltx/en_us_dedes/tr.d066:trCO.Ode9C14.melody	@ltx/en_us_dedes/he.h.m8:heHE.TonProdilothenta.name
ltx/en_us_dedes/tr.d066:trCO.Ode9C14.mode	@ltx/en_us_dedes/miscellanea:misc.Mode8
ltx/en_us_dedes/tr.d066:trCO.Ode9C14.ode	@ltx/en_us_dedes/miscellanea:misc.Ode9
ltx/en_us_dedes/tr.d066:trCO.Ode9C14.text	
ltx/en_us_dedes/tr.d066:trCO.Ode9C15.incipit	…
ltx/en_us_dedes/tr.d066:trCO.Ode9C15.melody	@ltx/en_us_dedes/he.h.m8:heHE.TonProdilothenta.name
ltx/en_us_dedes/tr.d066:trCO.Ode9C15.mode	@ltx/en_us_dedes/miscellanea:misc.Mode8
ltx/en_us_dedes/tr.d066:trCO.Ode9C15.ode	@ltx/en_us_dedes/miscellanea:misc.Ode9
ltx/en_us_dedes/tr.d066:trCO.Ode9C15.text	
ltx/en_us_dedes/tr.d066:trCO.Ode9C16.incipit	…
ltx/en_us_dedes/tr.d066:trCO.Ode9C16.melody	@ltx/en_us_dedes/he.h.m8:heHE.TonProdilothenta.name
ltx/en_us_dedes/tr.d066:trCO.Ode9C16.mode	@ltx/en_us_dedes/miscellanea:misc.Mode8
ltx/en_us_dedes/tr.d066:trCO.Ode9C16.ode	@ltx/en_us_dedes/miscellanea:misc.Ode9
ltx/en_us_dedes/tr.d066:trCO.Ode9C16.text	
ltx/en_us_dedes/tr.d066:trCO.Ode9C17.incipit	…
ltx/en_us_dedes/tr.d066:trCO.Ode9C17.melody	@ltx/en_us_dedes/he.h.m8:heHE.TonProdilothenta.name
ltx/en_us_dedes/tr.d066:trCO.Ode9C17.mode	@ltx/en_us_dedes/miscellanea:misc.Mode8
ltx/en_us_dedes/tr.d066:trCO.Ode9C17.ode	@ltx/en_us_dedes/miscellanea:misc.Ode9
ltx/en_us_dedes/tr.d066:trCO.Ode9C17.text	
ltx/en_us_dedes/tr.d066:trCO.Ode9C1H.incipit	@ltx/en_us_dedes/he.h.m8:heHE.TonProdilothenta.incipit
ltx/en_us_dedes/tr.d066:trCO.Ode9C1H.melody	@ltx/en_us_dedes/he.h.m8:heHE.TonProdilothenta.melody
ltx/en_us_dedes/tr.d066:trCO.Ode9C1H.mode	@ltx/en_us_dedes/miscellanea:misc.Mode8
ltx/en_us_dedes/tr.d066:trCO.Ode9C1H.ode	@ltx/en_us_dedes/miscellanea:misc.Ode9
ltx/en_us_dedes/tr.d066:trCO.Ode9C1H.text	@ltx/en_us_dedes/he.h.m8:heHE.TonProdilothenta.text
ltx/en_us_dedes/tr.d066:trCO.Ode9C1T.incipit	…
ltx/en_us_dedes/tr.d066:trCO.Ode9C1T.melody	@ltx/en_us_dedes/he.h.m8:heHE.TonProdilothenta.name
ltx/en_us_dedes/tr.d066:trCO.Ode9C1T.mode	@ltx/en_us_dedes/miscellanea:misc.Mode8
ltx/en_us_dedes/tr.d066:trCO.Ode9C1T.ode	@ltx/en_us_dedes/miscellanea:misc.Ode9
ltx/en_us_dedes/tr.d066:trCO.Ode9C1T.text	
ltx/en_us_dedes/tr.d066:trCO.Ode9C1Tr.incipit	…
ltx/en_us_dedes/tr.d066:trCO.Ode9C1Tr.melody	@ltx/en_us_dedes/he.h.m8:heHE.TonProdilothenta.name
ltx/en_us_dedes/tr.d066:trCO.Ode9C1Tr.mode	@ltx/en_us_dedes/miscellanea:misc.Mode8
ltx/en_us_dedes/tr.d066:trCO.Ode9C1Tr.ode	@ltx/en_us_dedes/miscellanea:misc.Ode9
ltx/en_us_dedes/tr.d066:trCO.Ode9C1Tr.text	
ltx/en_us_dedes/tr.d066:trCO.header	
ltx/en_us_dedes/tr.d066:trDA.commemoration.full	
ltx/en_us_dedes/tr.d066:trDA.commemoration.short	Holy Tuesday
ltx/en_us_dedes/tr.d066:trDA.dismissal	@ltx/en_us_dedes/dismissals:dis00.bridegroom
ltx/en_us_dedes/tr.d066:trDA.insert1	
ltx/en_us_dedes/tr.d066:trDA.insert2	
ltx/en_us_dedes/tr.d066:trDA.note	
ltx/en_us_dedes/tr.d066:trDA.title	
ltx/en_us_dedes/tr.d066:trEM.header	Bridegroom Service on Monday Evening
ltx/en_us_dedes/tr.d066:trHO.commemorations	
ltx/en_us_dedes/tr.d066:trHO.daytitle	
ltx/en_us_dedes/tr.d066:trHO.description1	
ltx/en_us_dedes/tr.d066:trHO.description2	
ltx/en_us_dedes/tr.d066:trHO.note1	
ltx/en_us_dedes/tr.d066:trHO.note2	
ltx/en_us_dedes/tr.d066:trMA.AposGlory.incipit	Behold, my soul, how the…
ltx/en_us_dedes/tr.d066:trMA.AposGlory.melody	@ltx/en_us_dedes/miscellanea:misc.Idiomelon
ltx/en_us_dedes/tr.d066:trMA.AposGlory.mode	@ltx/en_us_dedes/miscellanea:misc.Mode7
ltx/en_us_dedes/tr.d066:trMA.AposGlory.text	Behold, my soul, how the Master has entrusted the talent to you. With fear accept the gift of God. Borrow it from the One who gave it; distribute to the poor, and earn the Lord’s friendship; so that you may stand at His right when He comes in His glory, and might hear that blessed voice, “Enter, my servant, into your Master’s joy.” O Savior, I have gone astray; still count me worthy of this joy, in Your great mercy.
ltx/en_us_dedes/tr.d066:trMA.Aposticha1.incipit	Come, O believers, let us…
ltx/en_us_dedes/tr.d066:trMA.Aposticha1.melody	@ltx/en_us_dedes/miscellanea:misc.Idiomelon
ltx/en_us_dedes/tr.d066:trMA.Aposticha1.mode	@ltx/en_us_dedes/miscellanea:misc.Mode6
ltx/en_us_dedes/tr.d066:trMA.Aposticha1.text	Come, O believers, let us labor with zeal for the Master. Since He distributes His wealth to His servants, let each of us correspondingly increase the talent of grace that we received. Let one acquire wisdom by means of good deeds. Let another celebrate the liturgy with splendor. Let the believer communicate the word to the uninitiated, and let another disperse his wealth to the poor. And so let us increase that which was lent to us, so that as faithful stewards of grace we may be counted worthy of the Master’s joy. Count us worthy of this joy, O Christ, as our benevolent God.
ltx/en_us_dedes/tr.d066:trMA.Aposticha2.incipit	When You come in Your…
ltx/en_us_dedes/tr.d066:trMA.Aposticha2.melody	@ltx/en_us_dedes/miscellanea:misc.Idiomelon
ltx/en_us_dedes/tr.d066:trMA.Aposticha2.mode	@ltx/en_us_dedes/miscellanea:misc.Mode6
ltx/en_us_dedes/tr.d066:trMA.Aposticha2.text	When You come in Your glory with the angelic powers, O Jesus, and You sit on the throne of judgment, do not separate me from You, O Good Shepherd. You know the ways on the right, but those on the left are perverted. Please do not destroy me with the goats, though I am hardened in sin, but number me with the sheep on Your right hand, O benevolent Lord, and save me.
ltx/en_us_dedes/tr.d066:trMA.Aposticha3.incipit	O Bridegroom, more beautiful than…
ltx/en_us_dedes/tr.d066:trMA.Aposticha3.melody	@ltx/en_us_dedes/miscellanea:misc.Idiomelon
ltx/en_us_dedes/tr.d066:trMA.Aposticha3.mode	@ltx/en_us_dedes/miscellanea:misc.Mode6
ltx/en_us_dedes/tr.d066:trMA.Aposticha3.text	O Bridegroom, more beautiful than all other men, You have invited us to the spiritual banquet of your bridal chamber. Divest my ill-clad form of offenses by my participation in Your sufferings. And when You have adorned me with the glorious apparel of Your beauty, show me to be a radiant guest of Your kingdom, since You are compassionate.
ltx/en_us_dedes/tr.d066:trMA.C1.acrostic.notice1	
ltx/en_us_dedes/tr.d066:trMA.C1.acrostic.text	
ltx/en_us_dedes/tr.d066:trMA.C1.acrostic.title	Two-ode Canon.
ltx/en_us_dedes/tr.d066:trMA.C1.poet	@ltx/en_us_dedes/poets:po.KosmaMonachou
ltx/en_us_dedes/tr.d066:trMA.C1.verse	@ltx/en_us_dedes/prayers:pr.verse_God.text
ltx/en_us_dedes/tr.d066:trMA.Exaposteilarion1.greekmelody	@ltx/en_us_dedes/he.a.m3:heAU.TonNymfonaSouVlepo.greekname
ltx/en_us_dedes/tr.d066:trMA.Exaposteilarion1.incipit	@ltx/en_us_dedes/he.a.m3:heAU.TonNymfonaSouVlepo.incipit
ltx/en_us_dedes/tr.d066:trMA.Exaposteilarion1.melody	@ltx/en_us_dedes/he.a.m3:heAU.TonNymfonaSouVlepo.melody
ltx/en_us_dedes/tr.d066:trMA.Exaposteilarion1.mode	@ltx/en_us_dedes/miscellanea:misc.Mode3
ltx/en_us_dedes/tr.d066:trMA.Exaposteilarion1.text	@ltx/en_us_dedes/he.a.m3:heAU.TonNymfonaSouVlepo.text
ltx/en_us_dedes/tr.d066:trMA.Kathisma11.greekmelody	@ltx/en_us_dedes/he.a.m4:heAU.OYpsotheisEnToStavro.greekname
ltx/en_us_dedes/tr.d066:trMA.Kathisma11.incipit	Let us truly love the…
ltx/en_us_dedes/tr.d066:trMA.Kathisma11.melody	@ltx/en_us_dedes/he.a.m4:heAU.OYpsotheisEnToStavro.name
ltx/en_us_dedes/tr.d066:trMA.Kathisma11.mode	@ltx/en_us_dedes/miscellanea:misc.Mode4
ltx/en_us_dedes/tr.d066:trMA.Kathisma11.text	Let us truly love the Bridegroom, O brethren, * and prepare our oil lamps to receive Him, * and let us shine with virtues and the Orthodox faith, * so that we may be prepared, like the sensible virgins, * and enter the wedding feast * together with the Master. * For being God, the Bridegroom bestows * on all a free gift, * the crown that will perish not.
ltx/en_us_dedes/tr.d066:trMA.Kathisma21.greekmelody	@ltx/en_us_dedes/he.a.m4:heAU.KateplagiIosif.greekname
ltx/en_us_dedes/tr.d066:trMA.Kathisma21.incipit	Motivated by their fierce *…
ltx/en_us_dedes/tr.d066:trMA.Kathisma21.melody	@ltx/en_us_dedes/he.a.m4:heAU.KateplagiIosif.name
ltx/en_us_dedes/tr.d066:trMA.Kathisma21.mode	@ltx/en_us_dedes/miscellanea:misc.Mode4
ltx/en_us_dedes/tr.d066:trMA.Kathisma21.text	Motivated by their fierce * envy, the priests and the scribes, * came together and convened * a lawless council against You, * and they incited Judas to betray You. * Shamelessly he went to them, O Savior, and spoke, * vilifying You to men who kept not the Law; * and he conferred with them and said, “What will you give me * if I deliver Him into your hands?” * O Lord, deliver our souls, we pray You, * from the betrayer’s condemnation.
ltx/en_us_dedes/tr.d066:trMA.Kathisma31.greekmelody	@ltx/en_us_dedes/he.a.m8:heAU.TinSofianKaiLogon.greekname
ltx/en_us_dedes/tr.d066:trMA.Kathisma31.incipit	Avaricious is Judas in his…
ltx/en_us_dedes/tr.d066:trMA.Kathisma31.melody	@ltx/en_us_dedes/he.a.m8:heAU.TinSofianKaiLogon.name
ltx/en_us_dedes/tr.d066:trMA.Kathisma31.mode	@ltx/en_us_dedes/miscellanea:misc.Mode8
ltx/en_us_dedes/tr.d066:trMA.Kathisma31.text	Avaricious is Judas in his intent. * And against his own Teacher, the godless one * maneuvers, deliberates, his betrayal he meditates. * He falls away from the light and accepts the darkness. * He negotiates the sale, and he sells off the priceless One. * Therefore, as the payment for the deed he committed, * the wretch went and hanged himself, and he suffered a painful death. * We entreat You, deliver us * from his lot, O Christ our God, * and forgiveness of offenses grant to us * who observe Your immaculate Passion with faith and love.
ltx/en_us_dedes/tr.d066:trMA.Kontakion1.incipit	Consider your final hour, O…
ltx/en_us_dedes/tr.d066:trMA.Kontakion1.melody	@ltx/en_us_dedes/he.a.m2:heAU.TaAnoZiton.name
ltx/en_us_dedes/tr.d066:trMA.Kontakion1.mode	@ltx/en_us_dedes/miscellanea:misc.Mode2
ltx/en_us_dedes/tr.d066:trMA.Kontakion1.text	Consider your final hour, O wretched soul; be frightened by how the fig tree was cut down; and therefore with diligence cultivate the talent that was given you, being vigilant and crying out, “Let us not be left out of the wedding hall of Christ.”
ltx/en_us_dedes/tr.d066:trMA.Lauds1.incipit	How shall I enter…
ltx/en_us_dedes/tr.d066:trMA.Lauds1.melody	@ltx/en_us_dedes/miscellanea:misc.Idiomelon
ltx/en_us_dedes/tr.d066:trMA.Lauds1.mode	@ltx/en_us_dedes/miscellanea:misc.Mode1
ltx/en_us_dedes/tr.d066:trMA.Lauds1.text	How shall I enter into the splendor of Your saints since I am unworthy? For if I dare to enter the wedding hall along with them, my garment will betray me, for it is not fit for the wedding; and then I shall be bound and cast out by the Angels. I pray You to wash away the stains on my soul, and save me, O benevolent Lord.
ltx/en_us_dedes/tr.d066:trMA.Lauds2.incipit	I have been sleepy with…
ltx/en_us_dedes/tr.d066:trMA.Lauds2.melody	@ltx/en_us_dedes/miscellanea:misc.Idiomelon
ltx/en_us_dedes/tr.d066:trMA.Lauds2.mode	@ltx/en_us_dedes/miscellanea:misc.Mode2
ltx/en_us_dedes/tr.d066:trMA.Lauds2.text	I have been sleepy with idleness of soul, and therefore, O Bridegroom Christ, my lamp is not burning with virtue. I have been like those foolish maidens, roving about when it was time for work. O Master, I pray You do not close Your compassionate heart on me; but shake off this gloomy sleep from me, and raise me up, and bring me together with the wise virgins into Your bridal chamber, where the pure sound is of those who are feasting and unceasingly shouting, “Glory to You, O Lord.”
ltx/en_us_dedes/tr.d066:trMA.LaudsGlory.incipit	You have heard, O soul…
ltx/en_us_dedes/tr.d066:trMA.LaudsGlory.melody	@ltx/en_us_dedes/miscellanea:misc.Idiomelon
ltx/en_us_dedes/tr.d066:trMA.LaudsGlory.mode	@ltx/en_us_dedes/miscellanea:misc.Mode4
ltx/en_us_dedes/tr.d066:trMA.LaudsGlory.text	You have heard, O soul of mine, how he who hid the talent was condemned. So, hide not the word of God. But instead proclaim His wonders, so that for increasing the gift of grace, you may enter the joy of your Master.
ltx/en_us_dedes/tr.d066:trMA.MM.Alleluia.text	@ltx/en_us_dedes/properties:media.key
ltx/en_us_dedes/tr.d066:trMA.Ode8C11.greekmelody	@ltx/en_us_dedes/he.h.m2:heHE.ToDogmatiToTyranniko.greekname
ltx/en_us_dedes/tr.d066:trMA.Ode8C11.incipit	Let us rid ourselves of…
ltx/en_us_dedes/tr.d066:trMA.Ode8C11.melody	@ltx/en_us_dedes/he.h.m2:heHE.ToDogmatiToTyranniko.name
ltx/en_us_dedes/tr.d066:trMA.Ode8C11.mode	@ltx/en_us_dedes/miscellanea:misc.Mode2
ltx/en_us_dedes/tr.d066:trMA.Ode8C11.ode	@ltx/en_us_dedes/miscellanea:misc.Ode8
ltx/en_us_dedes/tr.d066:trMA.Ode8C11.text	Let us rid ourselves of all laziness; * and with our lamps shining brightly, * let us go forth to meet the immortal Bridegroom Christ, * singing hymns and shouting, “Bless the Lord, all you works of the Lord.”
ltx/en_us_dedes/tr.d066:trMA.Ode8C12.incipit	Let the oil of distributing…
ltx/en_us_dedes/tr.d066:trMA.Ode8C12.melody	@ltx/en_us_dedes/he.h.m2:heHE.ToDogmatiToTyranniko.name
ltx/en_us_dedes/tr.d066:trMA.Ode8C12.mode	@ltx/en_us_dedes/miscellanea:misc.Mode2
ltx/en_us_dedes/tr.d066:trMA.Ode8C12.ode	@ltx/en_us_dedes/miscellanea:misc.Ode8
ltx/en_us_dedes/tr.d066:trMA.Ode8C12.text	Let the oil of distributing alms * be abundant in the vessels of our souls, * so that we will not be purchasing * when it comes time for the rewards. * Then we can sing, “Bless the Lord, all you works of the Lord.”
ltx/en_us_dedes/tr.d066:trMA.Ode8C13.incipit	As many of you as…
ltx/en_us_dedes/tr.d066:trMA.Ode8C13.melody	@ltx/en_us_dedes/he.h.m2:heHE.ToDogmatiToTyranniko.name
ltx/en_us_dedes/tr.d066:trMA.Ode8C13.mode	@ltx/en_us_dedes/miscellanea:misc.Mode2
ltx/en_us_dedes/tr.d066:trMA.Ode8C13.ode	@ltx/en_us_dedes/miscellanea:misc.Ode8
ltx/en_us_dedes/tr.d066:trMA.Ode8C13.text	As many of you as have received * the talent from God, labor to increase it, * and double the grace, with the aid * of Christ who gave it to you, * and with joy sing, “Bless the Lord, all you works of the Lord.”
ltx/en_us_dedes/tr.d066:trMA.Ode8C1H.greekmelody	@ltx/en_us_dedes/he.h.m2:heHE.ToDogmatiToTyranniko.greekname
ltx/en_us_dedes/tr.d066:trMA.Ode8C1H.incipit	@ltx/en_us_dedes/he.h.m2:heHE.ToDogmatiToTyranniko.incipit
ltx/en_us_dedes/tr.d066:trMA.Ode8C1H.melody	@ltx/en_us_dedes/he.h.m2:heHE.ToDogmatiToTyranniko.melody
ltx/en_us_dedes/tr.d066:trMA.Ode8C1H.mode	@ltx/en_us_dedes/miscellanea:misc.Mode2
ltx/en_us_dedes/tr.d066:trMA.Ode8C1H.ode	@ltx/en_us_dedes/miscellanea:misc.Ode8
ltx/en_us_dedes/tr.d066:trMA.Ode8C1H.text	@ltx/en_us_dedes/he.h.m2:heHE.ToDogmatiToTyranniko.text
ltx/en_us_dedes/tr.d066:trMA.Ode8K.incipit	@ltx/en_us_dedes/he.h.m2:heHE.ToDogmatiToTyranniko.incipit
ltx/en_us_dedes/tr.d066:trMA.Ode8K.melody	@ltx/en_us_dedes/he.h.m2:heHE.ToDogmatiToTyranniko.melody
ltx/en_us_dedes/tr.d066:trMA.Ode8K.mode	@ltx/en_us_dedes/miscellanea:misc.Mode2
ltx/en_us_dedes/tr.d066:trMA.Ode8K.ode	@ltx/en_us_dedes/miscellanea:misc.Ode8
ltx/en_us_dedes/tr.d066:trMA.Ode8K.text	@ltx/en_us_dedes/he.h.m2:heHE.ToDogmatiToTyranniko.text
ltx/en_us_dedes/tr.d066:trMA.Ode9C11.greekmelody	@ltx/en_us_dedes/he.h.m2:heHE.ITonAchoritonTheon.greekname
ltx/en_us_dedes/tr.d066:trMA.Ode9C11.incipit	You, the Benevolent, enjoined *…
ltx/en_us_dedes/tr.d066:trMA.Ode9C11.melody	@ltx/en_us_dedes/he.h.m2:heHE.ITonAchoritonTheon.name
ltx/en_us_dedes/tr.d066:trMA.Ode9C11.mode	@ltx/en_us_dedes/miscellanea:misc.Mode2
ltx/en_us_dedes/tr.d066:trMA.Ode9C11.ode	@ltx/en_us_dedes/miscellanea:misc.Ode9
ltx/en_us_dedes/tr.d066:trMA.Ode9C11.text	You, the Benevolent, enjoined * Your disciples telling them, * “Watch, for you do not know the hour * when the Lord will come to reward each of His servants.”
ltx/en_us_dedes/tr.d066:trMA.Ode9C12.incipit	When you return at Your…
ltx/en_us_dedes/tr.d066:trMA.Ode9C12.melody	@ltx/en_us_dedes/he.h.m2:heHE.ITonAchoritonTheon.name
ltx/en_us_dedes/tr.d066:trMA.Ode9C12.mode	@ltx/en_us_dedes/miscellanea:misc.Mode2
ltx/en_us_dedes/tr.d066:trMA.Ode9C12.ode	@ltx/en_us_dedes/miscellanea:misc.Ode9
ltx/en_us_dedes/tr.d066:trMA.Ode9C12.text	When you return at Your most dread * second coming, O Master, * overlook my many offenses, * and put me with the sheep at Your right hand.
ltx/en_us_dedes/tr.d066:trMA.Ode9C1H.greekmelody	@ltx/en_us_dedes/he.h.m2:heHE.ITonAchoritonTheon.greekname
ltx/en_us_dedes/tr.d066:trMA.Ode9C1H.incipit	@ltx/en_us_dedes/he.h.m2:heHE.ITonAchoritonTheon.incipit
ltx/en_us_dedes/tr.d066:trMA.Ode9C1H.melody	@ltx/en_us_dedes/he.h.m2:heHE.ITonAchoritonTheon.melody
ltx/en_us_dedes/tr.d066:trMA.Ode9C1H.mode	@ltx/en_us_dedes/miscellanea:misc.Mode2
ltx/en_us_dedes/tr.d066:trMA.Ode9C1H.ode	@ltx/en_us_dedes/miscellanea:misc.Ode9
ltx/en_us_dedes/tr.d066:trMA.Ode9C1H.text	@ltx/en_us_dedes/he.h.m2:heHE.ITonAchoritonTheon.text
ltx/en_us_dedes/tr.d066:trMA.Ode9K.incipit	@ltx/en_us_dedes/he.h.m2:heHE.ITonAchoritonTheon.incipit
ltx/en_us_dedes/tr.d066:trMA.Ode9K.melody	@ltx/en_us_dedes/he.h.m2:heHE.ITonAchoritonTheon.melody
ltx/en_us_dedes/tr.d066:trMA.Ode9K.mode	@ltx/en_us_dedes/miscellanea:misc.Mode2
ltx/en_us_dedes/tr.d066:trMA.Ode9K.ode	@ltx/en_us_dedes/miscellanea:misc.Ode9
ltx/en_us_dedes/tr.d066:trMA.Ode9K.text	@ltx/en_us_dedes/he.h.m2:heHE.ITonAchoritonTheon.text
ltx/en_us_dedes/tr.d066:trMA.Oikos1.text	Why are you lazy, my pitiful soul? Why are you thinking about unprofitable cares at such a time? Why are you busy with things that pass away? The final hour is at hand and we shall soon be parted from all that is here. While you still have time, get sober and cry, “I have sinned against You, my Savior. Do not cut me down like that unfruitful fig tree; but, since You are compassionate, O Christ, take pity on me as I cry out with fear: Let us not be left out of the wedding hall of Christ.”
ltx/en_us_dedes/tr.d066:trMA.Troparion.incipit	@ltx/en_us_dedes/tr.d065:trMA.Troparion.incipit
ltx/en_us_dedes/tr.d066:trMA.Troparion.melody	
ltx/en_us_dedes/tr.d066:trMA.Troparion.mode	@ltx/en_us_dedes/miscellanea:misc.Mode8
ltx/en_us_dedes/tr.d066:trMA.Troparion.text	@ltx/en_us_dedes/tr.d065:trMA.Troparion.text
ltx/en_us_dedes/tr.d066:trSY.commemoration.couplet1.title	@ltx/en_us_dedes/titles:ti.Verses
ltx/en_us_dedes/tr.d066:trSY.commemoration.couplet1.verse1	The greatest of Tuesdays points to the Ten Virgins,
ltx/en_us_dedes/tr.d066:trSY.commemoration.couplet1.verse2	Who point to the victory of the impartial Master.
ltx/en_us_dedes/tr.d066:trSY.commemoration.narration.p01	[paragraph 01]
ltx/en_us_dedes/tr.d066:trSY.commemoration.narration.p02	[paragraph 02]
ltx/en_us_dedes/tr.d066:trSY.commemoration.narration.p03	[paragraph 03]
ltx/en_us_dedes/tr.d066:trSY.commemoration.narration.p04	[paragraph 04]
ltx/en_us_dedes/tr.d066:trSY.commemoration.narration.p05	[paragraph 05]
ltx/en_us_dedes/tr.d066:trSY.commemoration.narration.p06	[paragraph 06]
ltx/en_us_dedes/tr.d066:trSY.commemoration.narration.p07	[paragraph 07]
ltx/en_us_dedes/tr.d066:trSY.commemoration.text	On great and holy Tuesday, we commemorate the parable of the ten virgins from the holy Gospel.
ltx/en_us_dedes/tr.d066:trSY.lastline	O Bridegroom Christ, number us with the wise virgins, and include us in Your chosen flock, and have mercy on us. Amen.
ltx/en_us_dedes/tr.d066:trTE.Troparion.incipit	…
ltx/en_us_dedes/tr.d066:trTE.Troparion.melody	
ltx/en_us_dedes/tr.d066:trTE.Troparion.mode	@ltx/en_us_dedes/miscellanea:misc.Mode1
ltx/en_us_dedes/tr.d066:trTE.Troparion.text	
ltx/en_us_dedes/tr.d066:trVE.SticGlory.incipit	@ltx/en_us_dedes/tr.d065:trMA.AposGlory.incipit
ltx/en_us_dedes/tr.d066:trVE.SticGlory.melody	@ltx/en_us_dedes/miscellanea:misc.Idiomelon
ltx/en_us_dedes/tr.d066:trVE.SticGlory.mode	@ltx/en_us_dedes/miscellanea:misc.Mode8
ltx/en_us_dedes/tr.d066:trVE.SticGlory.text	@ltx/en_us_dedes/tr.d065:trMA.AposGlory.text
ltx/en_us_dedes/tr.d066:trVE.Stichera01.incipit	@ltx/en_us_dedes/tr.d065:trMA.Lauds1.incipit
ltx/en_us_dedes/tr.d066:trVE.Stichera01.melody	@ltx/en_us_dedes/miscellanea:misc.Idiomelon
ltx/en_us_dedes/tr.d066:trVE.Stichera01.mode	@ltx/en_us_dedes/miscellanea:misc.Mode1
ltx/en_us_dedes/tr.d066:trVE.Stichera01.text	@ltx/en_us_dedes/tr.d065:trMA.Lauds1.text
ltx/en_us_dedes/tr.d066:trVE.Stichera02.incipit	@ltx/en_us_dedes/tr.d065:trMA.Lauds2.incipit
ltx/en_us_dedes/tr.d066:trVE.Stichera02.melody	@ltx/en_us_dedes/miscellanea:misc.Idiomelon
ltx/en_us_dedes/tr.d066:trVE.Stichera02.mode	@ltx/en_us_dedes/miscellanea:misc.Mode5
ltx/en_us_dedes/tr.d066:trVE.Stichera02.text	@ltx/en_us_dedes/tr.d065:trMA.Lauds2.text
ltx/en_us_dedes/tr.d066:trVE.Stichera03.incipit	@ltx/en_us_dedes/tr.d065:trMA.LaudsGlory.incipit
ltx/en_us_dedes/tr.d066:trVE.Stichera03.melody	@ltx/en_us_dedes/miscellanea:misc.Idiomelon
ltx/en_us_dedes/tr.d066:trVE.Stichera03.mode	@ltx/en_us_dedes/miscellanea:misc.Mode5
ltx/en_us_dedes/tr.d066:trVE.Stichera03.text	@ltx/en_us_dedes/tr.d065:trMA.LaudsGlory.text
ltx/en_us_dedes/tr.d066:trVE.Stichera04.incipit	@ltx/en_us_dedes/tr.d065:trMA.Aposticha1.incipit
ltx/en_us_dedes/tr.d066:trVE.Stichera04.melody	@ltx/en_us_dedes/miscellanea:misc.Idiomelon
ltx/en_us_dedes/tr.d066:trVE.Stichera04.mode	@ltx/en_us_dedes/miscellanea:misc.Mode5
ltx/en_us_dedes/tr.d066:trVE.Stichera04.text	@ltx/en_us_dedes/tr.d065:trMA.Aposticha1.text
ltx/en_us_dedes/tr.d066:trVE.Stichera05.incipit	@ltx/en_us_dedes/tr.d065:trMA.Aposticha2.incipit
ltx/en_us_dedes/tr.d066:trVE.Stichera05.melody	@ltx/en_us_dedes/miscellanea:misc.Idiomelon
ltx/en_us_dedes/tr.d066:trVE.Stichera05.mode	@ltx/en_us_dedes/miscellanea:misc.Mode5
ltx/en_us_dedes/tr.d066:trVE.Stichera05.text	@ltx/en_us_dedes/tr.d065:trMA.Aposticha2.text
ltx/en_us_dedes/tr.d066:trVE.Stichera06.incipit	@ltx/en_us_dedes/tr.d065:trMA.Aposticha3.incipit
ltx/en_us_dedes/tr.d066:trVE.Stichera06.melody	@ltx/en_us_dedes/miscellanea:misc.Idiomelon
ltx/en_us_dedes/tr.d066:trVE.Stichera06.mode	@ltx/en_us_dedes/miscellanea:misc.Mode8
ltx/en_us_dedes/tr.d066:trVE.Stichera06.text	@ltx/en_us_dedes/tr.d065:trMA.Aposticha3.text
ltx/en_us_dedes/tr.d066:trVL.header	Presanctified Liturgy on Holy Monday
