ltx/en_us_dedes/me.m04.d03:meDA.commemoration.first	Memory of our Devout Father Nikitas the Confessor
ltx/en_us_dedes/me.m04.d03:meDA.commemoration.first_name	
ltx/en_us_dedes/me.m04.d03:meDA.commemoration.first_short	Memory of our Devout Father Nikitas the Confessor
ltx/en_us_dedes/me.m04.d03:meDA.commemoration.first_title	@ltx/en_us_dedes/titles:ti.DevoutSaintM
ltx/en_us_dedes/me.m04.d03:meDA.commemoration.full	Memory of our Devout Father Nikitas the Confessor and Abbot of the Monastery of Medicium; and Joseph the Hymnographer.
ltx/en_us_dedes/me.m04.d03:meDA.commemoration.second_name	
ltx/en_us_dedes/me.m04.d03:meDA.commemoration.second_title	
ltx/en_us_dedes/me.m04.d03:meDA.date	April 3
ltx/en_us_dedes/me.m04.d03:meDA.fordate	for April 3
ltx/en_us_dedes/me.m04.d03:meDA.insert1	
ltx/en_us_dedes/me.m04.d03:meDA.insert2	
ltx/en_us_dedes/me.m04.d03:meDA.note	
ltx/en_us_dedes/me.m04.d03:meDA.pdfcoverdate	April 3,
ltx/en_us_dedes/me.m04.d03:meDA.pdfheaderdate	April 3
ltx/en_us_dedes/me.m04.d03:meHO.commemorations	
ltx/en_us_dedes/me.m04.d03:meHO.note1	
ltx/en_us_dedes/me.m04.d03:meHO.note2	
ltx/en_us_dedes/me.m04.d03:meHO.number	
ltx/en_us_dedes/me.m04.d03:meHO.rank	
ltx/en_us_dedes/me.m04.d03:meLE.commemoration1	
ltx/en_us_dedes/me.m04.d03:meLE.commemoration2	
ltx/en_us_dedes/me.m04.d03:meLI.Kontakion1.incipit	@ltx/en_us_dedes/me.m04.d03:meMA.Kontakion1ger.incipit
ltx/en_us_dedes/me.m04.d03:meLI.Kontakion1.melody	@ltx/en_us_dedes/me.m04.d03:meMA.Kontakion1ger.melody
ltx/en_us_dedes/me.m04.d03:meLI.Kontakion1.mode	@ltx/en_us_dedes/me.m04.d03:meMA.Kontakion1ger.mode
ltx/en_us_dedes/me.m04.d03:meLI.Kontakion1.text	@ltx/en_us_dedes/me.m04.d03:meMA.Kontakion1ger.text
ltx/en_us_dedes/me.m04.d03:meLI.MM.CommunionHymn.text	@ltx/en_us_dedes/properties:media.key
ltx/en_us_dedes/me.m04.d03:meLI.Megalynarion.text	
ltx/en_us_dedes/me.m04.d03:meMA.C1.acrostic.notice1	
ltx/en_us_dedes/me.m04.d03:meMA.C1.acrostic.text	
ltx/en_us_dedes/me.m04.d03:meMA.C1.acrostic.title	
ltx/en_us_dedes/me.m04.d03:meMA.C1.poet	@ltx/en_us_dedes/poets:po.Theofanous
ltx/en_us_dedes/me.m04.d03:meMA.C1.title	@ltx/en_us_dedes/titles:ti.CanonSaintM
ltx/en_us_dedes/me.m04.d03:meMA.C1.verse	@ltx/en_us_dedes/prayers:pr.verse_DevoutMan.text
ltx/en_us_dedes/me.m04.d03:meMA.Kontakion1ger.incipit	…
ltx/en_us_dedes/me.m04.d03:meMA.Kontakion1ger.melody	@ltx/en_us_dedes/he.a.m8:heAU.TiYpermacho.name
ltx/en_us_dedes/me.m04.d03:meMA.Kontakion1ger.mode	@ltx/en_us_dedes/miscellanea:misc.Mode8
ltx/en_us_dedes/me.m04.d03:meMA.Kontakion1ger.poet	@ltx/en_us_dedes/poets:po.Gerasimou
ltx/en_us_dedes/me.m04.d03:meMA.Kontakion1ger.text	
ltx/en_us_dedes/me.m04.d03:meMA.Kontakion2ger.incipit	…
ltx/en_us_dedes/me.m04.d03:meMA.Kontakion2ger.melody	@ltx/en_us_dedes/he.a.m3:heAU.IParthenosSimeron.name
ltx/en_us_dedes/me.m04.d03:meMA.Kontakion2ger.mode	@ltx/en_us_dedes/miscellanea:misc.Mode3
ltx/en_us_dedes/me.m04.d03:meMA.Kontakion2ger.poet	@ltx/en_us_dedes/poets:po.Gerasimou
ltx/en_us_dedes/me.m04.d03:meMA.Kontakion2ger.text	
ltx/en_us_dedes/me.m04.d03:meMA.Ode1C11.greekmelody	@ltx/en_us_dedes/he.h.m2:heHE.EnVythoKatestrose.greekname
ltx/en_us_dedes/me.m04.d03:meMA.Ode1C11.incipit	…
ltx/en_us_dedes/me.m04.d03:meMA.Ode1C11.melody	@ltx/en_us_dedes/he.h.m2:heHE.EnVythoKatestrose.name
ltx/en_us_dedes/me.m04.d03:meMA.Ode1C11.mode	@ltx/en_us_dedes/miscellanea:misc.Mode2
ltx/en_us_dedes/me.m04.d03:meMA.Ode1C11.ode	@ltx/en_us_dedes/miscellanea:misc.Ode1
ltx/en_us_dedes/me.m04.d03:meMA.Ode1C11.text	
ltx/en_us_dedes/me.m04.d03:meMA.Ode1C12.incipit	…
ltx/en_us_dedes/me.m04.d03:meMA.Ode1C12.melody	@ltx/en_us_dedes/he.h.m2:heHE.EnVythoKatestrose.name
ltx/en_us_dedes/me.m04.d03:meMA.Ode1C12.mode	@ltx/en_us_dedes/miscellanea:misc.Mode2
ltx/en_us_dedes/me.m04.d03:meMA.Ode1C12.ode	@ltx/en_us_dedes/miscellanea:misc.Ode1
ltx/en_us_dedes/me.m04.d03:meMA.Ode1C12.text	
ltx/en_us_dedes/me.m04.d03:meMA.Ode1C13.incipit	…
ltx/en_us_dedes/me.m04.d03:meMA.Ode1C13.melody	@ltx/en_us_dedes/he.h.m2:heHE.EnVythoKatestrose.name
ltx/en_us_dedes/me.m04.d03:meMA.Ode1C13.mode	@ltx/en_us_dedes/miscellanea:misc.Mode2
ltx/en_us_dedes/me.m04.d03:meMA.Ode1C13.ode	@ltx/en_us_dedes/miscellanea:misc.Ode1
ltx/en_us_dedes/me.m04.d03:meMA.Ode1C13.text	
ltx/en_us_dedes/me.m04.d03:meMA.Ode1C14.incipit	…
ltx/en_us_dedes/me.m04.d03:meMA.Ode1C14.melody	@ltx/en_us_dedes/he.h.m2:heHE.EnVythoKatestrose.name
ltx/en_us_dedes/me.m04.d03:meMA.Ode1C14.mode	@ltx/en_us_dedes/miscellanea:misc.Mode2
ltx/en_us_dedes/me.m04.d03:meMA.Ode1C14.ode	@ltx/en_us_dedes/miscellanea:misc.Ode1
ltx/en_us_dedes/me.m04.d03:meMA.Ode1C14.text	
ltx/en_us_dedes/me.m04.d03:meMA.Ode1C1H.greekmelody	@ltx/en_us_dedes/he.h.m2:heHE.EnVythoKatestrose.greekname
ltx/en_us_dedes/me.m04.d03:meMA.Ode1C1H.incipit	@ltx/en_us_dedes/he.h.m2:heHE.EnVythoKatestrose.incipit
ltx/en_us_dedes/me.m04.d03:meMA.Ode1C1H.melody	@ltx/en_us_dedes/he.h.m2:heHE.EnVythoKatestrose.melody
ltx/en_us_dedes/me.m04.d03:meMA.Ode1C1H.mode	@ltx/en_us_dedes/miscellanea:misc.Mode2
ltx/en_us_dedes/me.m04.d03:meMA.Ode1C1H.ode	@ltx/en_us_dedes/miscellanea:misc.Ode1
ltx/en_us_dedes/me.m04.d03:meMA.Ode1C1H.text	@ltx/en_us_dedes/he.h.m2:heHE.EnVythoKatestrose.text
ltx/en_us_dedes/me.m04.d03:meMA.Ode1C1T.incipit	@ltx/en_us_dedes/oc.m2.d1:ocMA.OdeS1C1T.incipit
ltx/en_us_dedes/me.m04.d03:meMA.Ode1C1T.melody	@ltx/en_us_dedes/he.h.m2:heHE.EnVythoKatestrose.name
ltx/en_us_dedes/me.m04.d03:meMA.Ode1C1T.mode	@ltx/en_us_dedes/miscellanea:misc.Mode2
ltx/en_us_dedes/me.m04.d03:meMA.Ode1C1T.ode	@ltx/en_us_dedes/miscellanea:misc.Ode1
ltx/en_us_dedes/me.m04.d03:meMA.Ode1C1T.text	@ltx/en_us_dedes/oc.m2.d1:ocMA.OdeS1C1T.text
ltx/en_us_dedes/me.m04.d03:meMA.Ode3C11.greekmelody	@ltx/en_us_dedes/he.h.m2:heHE.ExinthisenIErimos.greekname
ltx/en_us_dedes/me.m04.d03:meMA.Ode3C11.incipit	…
ltx/en_us_dedes/me.m04.d03:meMA.Ode3C11.melody	@ltx/en_us_dedes/he.h.m2:heHE.ExinthisenIErimos.name
ltx/en_us_dedes/me.m04.d03:meMA.Ode3C11.mode	@ltx/en_us_dedes/miscellanea:misc.Mode2
ltx/en_us_dedes/me.m04.d03:meMA.Ode3C11.ode	@ltx/en_us_dedes/miscellanea:misc.Ode3
ltx/en_us_dedes/me.m04.d03:meMA.Ode3C11.text	
ltx/en_us_dedes/me.m04.d03:meMA.Ode3C12.incipit	…
ltx/en_us_dedes/me.m04.d03:meMA.Ode3C12.melody	@ltx/en_us_dedes/he.h.m2:heHE.ExinthisenIErimos.name
ltx/en_us_dedes/me.m04.d03:meMA.Ode3C12.mode	@ltx/en_us_dedes/miscellanea:misc.Mode2
ltx/en_us_dedes/me.m04.d03:meMA.Ode3C12.ode	@ltx/en_us_dedes/miscellanea:misc.Ode3
ltx/en_us_dedes/me.m04.d03:meMA.Ode3C12.text	
ltx/en_us_dedes/me.m04.d03:meMA.Ode3C13.incipit	…
ltx/en_us_dedes/me.m04.d03:meMA.Ode3C13.melody	@ltx/en_us_dedes/he.h.m2:heHE.ExinthisenIErimos.name
ltx/en_us_dedes/me.m04.d03:meMA.Ode3C13.mode	@ltx/en_us_dedes/miscellanea:misc.Mode2
ltx/en_us_dedes/me.m04.d03:meMA.Ode3C13.ode	@ltx/en_us_dedes/miscellanea:misc.Ode3
ltx/en_us_dedes/me.m04.d03:meMA.Ode3C13.text	
ltx/en_us_dedes/me.m04.d03:meMA.Ode3C14.incipit	…
ltx/en_us_dedes/me.m04.d03:meMA.Ode3C14.melody	@ltx/en_us_dedes/he.h.m2:heHE.ExinthisenIErimos.name
ltx/en_us_dedes/me.m04.d03:meMA.Ode3C14.mode	@ltx/en_us_dedes/miscellanea:misc.Mode2
ltx/en_us_dedes/me.m04.d03:meMA.Ode3C14.ode	@ltx/en_us_dedes/miscellanea:misc.Ode3
ltx/en_us_dedes/me.m04.d03:meMA.Ode3C14.text	
ltx/en_us_dedes/me.m04.d03:meMA.Ode3C1H.greekmelody	@ltx/en_us_dedes/he.h.m2:heHE.ExinthisenIErimos.greekname
ltx/en_us_dedes/me.m04.d03:meMA.Ode3C1H.incipit	@ltx/en_us_dedes/he.h.m2:heHE.ExinthisenIErimos.incipit
ltx/en_us_dedes/me.m04.d03:meMA.Ode3C1H.melody	@ltx/en_us_dedes/he.h.m2:heHE.ExinthisenIErimos.melody
ltx/en_us_dedes/me.m04.d03:meMA.Ode3C1H.mode	@ltx/en_us_dedes/miscellanea:misc.Mode2
ltx/en_us_dedes/me.m04.d03:meMA.Ode3C1H.ode	@ltx/en_us_dedes/miscellanea:misc.Ode3
ltx/en_us_dedes/me.m04.d03:meMA.Ode3C1H.text	@ltx/en_us_dedes/he.h.m2:heHE.ExinthisenIErimos.text
ltx/en_us_dedes/me.m04.d03:meMA.Ode3C1T.incipit	…
ltx/en_us_dedes/me.m04.d03:meMA.Ode3C1T.melody	@ltx/en_us_dedes/he.h.m2:heHE.ExinthisenIErimos.name
ltx/en_us_dedes/me.m04.d03:meMA.Ode3C1T.mode	@ltx/en_us_dedes/miscellanea:misc.Mode2
ltx/en_us_dedes/me.m04.d03:meMA.Ode3C1T.ode	@ltx/en_us_dedes/miscellanea:misc.Ode3
ltx/en_us_dedes/me.m04.d03:meMA.Ode3C1T.text	
ltx/en_us_dedes/me.m04.d03:meMA.Ode3Kathisma1.greekmelody	@ltx/en_us_dedes/he.a.m4:heAU.TachyProkatalave.greekname
ltx/en_us_dedes/me.m04.d03:meMA.Ode3Kathisma1.incipit	…
ltx/en_us_dedes/me.m04.d03:meMA.Ode3Kathisma1.melody	@ltx/en_us_dedes/he.a.m4:heAU.TachyProkatalave.name
ltx/en_us_dedes/me.m04.d03:meMA.Ode3Kathisma1.mode	@ltx/en_us_dedes/miscellanea:misc.Mode4
ltx/en_us_dedes/me.m04.d03:meMA.Ode3Kathisma1.text	
ltx/en_us_dedes/me.m04.d03:meMA.Ode3KathismaSt.incipit	O Savior, You Virgin Mother…
ltx/en_us_dedes/me.m04.d03:meMA.Ode3KathismaSt.melody	@ltx/en_us_dedes/he.a.m4:heAU.TachyProkatalave.name
ltx/en_us_dedes/me.m04.d03:meMA.Ode3KathismaSt.mode	@ltx/en_us_dedes/miscellanea:misc.Mode4
ltx/en_us_dedes/me.m04.d03:meMA.Ode3KathismaSt.text	O Savior, You Virgin Mother saw You lifted up on the Cross. * And looking at You, she bitterly lamented and wept * and uttered such things as this: * “What an extraordinary, new, unusual wonder! * How did these lawless people have the gall to crucify You, * the only Giver of life, O sweetest Light of mine!”
ltx/en_us_dedes/me.m04.d03:meMA.Ode3KathismaT.incipit	…
ltx/en_us_dedes/me.m04.d03:meMA.Ode3KathismaT.melody	@ltx/en_us_dedes/he.a.m4:heAU.TachyProkatalave.name
ltx/en_us_dedes/me.m04.d03:meMA.Ode3KathismaT.mode	@ltx/en_us_dedes/miscellanea:misc.Mode4
ltx/en_us_dedes/me.m04.d03:meMA.Ode3KathismaT.text	
ltx/en_us_dedes/me.m04.d03:meMA.Ode4C11.greekmelody	@ltx/en_us_dedes/he.h.m2:heHE.ElilythasEkParthenou.greekname
ltx/en_us_dedes/me.m04.d03:meMA.Ode4C11.incipit	…
ltx/en_us_dedes/me.m04.d03:meMA.Ode4C11.melody	@ltx/en_us_dedes/he.h.m2:heHE.ElilythasEkParthenou.name
ltx/en_us_dedes/me.m04.d03:meMA.Ode4C11.mode	@ltx/en_us_dedes/miscellanea:misc.Mode2
ltx/en_us_dedes/me.m04.d03:meMA.Ode4C11.ode	@ltx/en_us_dedes/miscellanea:misc.Ode4
ltx/en_us_dedes/me.m04.d03:meMA.Ode4C11.text	
ltx/en_us_dedes/me.m04.d03:meMA.Ode4C12.incipit	…
ltx/en_us_dedes/me.m04.d03:meMA.Ode4C12.melody	@ltx/en_us_dedes/he.h.m2:heHE.ElilythasEkParthenou.name
ltx/en_us_dedes/me.m04.d03:meMA.Ode4C12.mode	@ltx/en_us_dedes/miscellanea:misc.Mode2
ltx/en_us_dedes/me.m04.d03:meMA.Ode4C12.ode	@ltx/en_us_dedes/miscellanea:misc.Ode4
ltx/en_us_dedes/me.m04.d03:meMA.Ode4C12.text	
ltx/en_us_dedes/me.m04.d03:meMA.Ode4C13.incipit	…
ltx/en_us_dedes/me.m04.d03:meMA.Ode4C13.melody	@ltx/en_us_dedes/he.h.m2:heHE.ElilythasEkParthenou.name
ltx/en_us_dedes/me.m04.d03:meMA.Ode4C13.mode	@ltx/en_us_dedes/miscellanea:misc.Mode2
ltx/en_us_dedes/me.m04.d03:meMA.Ode4C13.ode	@ltx/en_us_dedes/miscellanea:misc.Ode4
ltx/en_us_dedes/me.m04.d03:meMA.Ode4C13.text	
ltx/en_us_dedes/me.m04.d03:meMA.Ode4C14.incipit	…
ltx/en_us_dedes/me.m04.d03:meMA.Ode4C14.melody	@ltx/en_us_dedes/he.h.m2:heHE.ElilythasEkParthenou.name
ltx/en_us_dedes/me.m04.d03:meMA.Ode4C14.mode	@ltx/en_us_dedes/miscellanea:misc.Mode2
ltx/en_us_dedes/me.m04.d03:meMA.Ode4C14.ode	@ltx/en_us_dedes/miscellanea:misc.Ode4
ltx/en_us_dedes/me.m04.d03:meMA.Ode4C14.text	
ltx/en_us_dedes/me.m04.d03:meMA.Ode4C1H.greekmelody	@ltx/en_us_dedes/he.h.m2:heHE.ElilythasEkParthenou.greekname
ltx/en_us_dedes/me.m04.d03:meMA.Ode4C1H.incipit	@ltx/en_us_dedes/he.h.m2:heHE.ElilythasEkParthenou.incipit
ltx/en_us_dedes/me.m04.d03:meMA.Ode4C1H.melody	@ltx/en_us_dedes/he.h.m2:heHE.ElilythasEkParthenou.melody
ltx/en_us_dedes/me.m04.d03:meMA.Ode4C1H.mode	@ltx/en_us_dedes/miscellanea:misc.Mode2
ltx/en_us_dedes/me.m04.d03:meMA.Ode4C1H.ode	@ltx/en_us_dedes/miscellanea:misc.Ode4
ltx/en_us_dedes/me.m04.d03:meMA.Ode4C1H.text	@ltx/en_us_dedes/he.h.m2:heHE.ElilythasEkParthenou.text
ltx/en_us_dedes/me.m04.d03:meMA.Ode4C1T.incipit	…
ltx/en_us_dedes/me.m04.d03:meMA.Ode4C1T.melody	@ltx/en_us_dedes/he.h.m2:heHE.ElilythasEkParthenou.name
ltx/en_us_dedes/me.m04.d03:meMA.Ode4C1T.mode	@ltx/en_us_dedes/miscellanea:misc.Mode2
ltx/en_us_dedes/me.m04.d03:meMA.Ode4C1T.ode	@ltx/en_us_dedes/miscellanea:misc.Ode4
ltx/en_us_dedes/me.m04.d03:meMA.Ode4C1T.text	
ltx/en_us_dedes/me.m04.d03:meMA.Ode5C11.greekmelody	@ltx/en_us_dedes/he.h.m2:heHE.MesitisTheou.greekname
ltx/en_us_dedes/me.m04.d03:meMA.Ode5C11.incipit	…
ltx/en_us_dedes/me.m04.d03:meMA.Ode5C11.melody	@ltx/en_us_dedes/he.h.m2:heHE.MesitisTheou.name
ltx/en_us_dedes/me.m04.d03:meMA.Ode5C11.mode	@ltx/en_us_dedes/miscellanea:misc.Mode2
ltx/en_us_dedes/me.m04.d03:meMA.Ode5C11.ode	@ltx/en_us_dedes/miscellanea:misc.Ode5
ltx/en_us_dedes/me.m04.d03:meMA.Ode5C11.text	
ltx/en_us_dedes/me.m04.d03:meMA.Ode5C12.incipit	…
ltx/en_us_dedes/me.m04.d03:meMA.Ode5C12.melody	@ltx/en_us_dedes/he.h.m2:heHE.MesitisTheou.name
ltx/en_us_dedes/me.m04.d03:meMA.Ode5C12.mode	@ltx/en_us_dedes/miscellanea:misc.Mode2
ltx/en_us_dedes/me.m04.d03:meMA.Ode5C12.ode	@ltx/en_us_dedes/miscellanea:misc.Ode5
ltx/en_us_dedes/me.m04.d03:meMA.Ode5C12.text	
ltx/en_us_dedes/me.m04.d03:meMA.Ode5C13.incipit	…
ltx/en_us_dedes/me.m04.d03:meMA.Ode5C13.melody	@ltx/en_us_dedes/he.h.m2:heHE.MesitisTheou.name
ltx/en_us_dedes/me.m04.d03:meMA.Ode5C13.mode	@ltx/en_us_dedes/miscellanea:misc.Mode2
ltx/en_us_dedes/me.m04.d03:meMA.Ode5C13.ode	@ltx/en_us_dedes/miscellanea:misc.Ode5
ltx/en_us_dedes/me.m04.d03:meMA.Ode5C13.text	
ltx/en_us_dedes/me.m04.d03:meMA.Ode5C1H.greekmelody	@ltx/en_us_dedes/he.h.m2:heHE.MesitisTheou.greekname
ltx/en_us_dedes/me.m04.d03:meMA.Ode5C1H.incipit	@ltx/en_us_dedes/he.h.m2:heHE.MesitisTheou.incipit
ltx/en_us_dedes/me.m04.d03:meMA.Ode5C1H.melody	@ltx/en_us_dedes/he.h.m2:heHE.MesitisTheou.melody
ltx/en_us_dedes/me.m04.d03:meMA.Ode5C1H.mode	@ltx/en_us_dedes/miscellanea:misc.Mode2
ltx/en_us_dedes/me.m04.d03:meMA.Ode5C1H.ode	@ltx/en_us_dedes/miscellanea:misc.Ode5
ltx/en_us_dedes/me.m04.d03:meMA.Ode5C1H.text	@ltx/en_us_dedes/he.h.m2:heHE.MesitisTheou.text
ltx/en_us_dedes/me.m04.d03:meMA.Ode5C1T.incipit	…
ltx/en_us_dedes/me.m04.d03:meMA.Ode5C1T.melody	@ltx/en_us_dedes/he.h.m2:heHE.MesitisTheou.name
ltx/en_us_dedes/me.m04.d03:meMA.Ode5C1T.mode	@ltx/en_us_dedes/miscellanea:misc.Mode2
ltx/en_us_dedes/me.m04.d03:meMA.Ode5C1T.ode	@ltx/en_us_dedes/miscellanea:misc.Ode5
ltx/en_us_dedes/me.m04.d03:meMA.Ode5C1T.text	
ltx/en_us_dedes/me.m04.d03:meMA.Ode6C11.greekmelody	@ltx/en_us_dedes/he.h.m2:heHE.EnAvyssoPtaismaton.greekname
ltx/en_us_dedes/me.m04.d03:meMA.Ode6C11.incipit	…
ltx/en_us_dedes/me.m04.d03:meMA.Ode6C11.melody	@ltx/en_us_dedes/he.h.m2:heHE.EnAvyssoPtaismaton.name
ltx/en_us_dedes/me.m04.d03:meMA.Ode6C11.mode	@ltx/en_us_dedes/miscellanea:misc.Mode2
ltx/en_us_dedes/me.m04.d03:meMA.Ode6C11.ode	@ltx/en_us_dedes/miscellanea:misc.Ode6
ltx/en_us_dedes/me.m04.d03:meMA.Ode6C11.text	
ltx/en_us_dedes/me.m04.d03:meMA.Ode6C12.incipit	…
ltx/en_us_dedes/me.m04.d03:meMA.Ode6C12.melody	@ltx/en_us_dedes/he.h.m2:heHE.EnAvyssoPtaismaton.name
ltx/en_us_dedes/me.m04.d03:meMA.Ode6C12.mode	@ltx/en_us_dedes/miscellanea:misc.Mode2
ltx/en_us_dedes/me.m04.d03:meMA.Ode6C12.ode	@ltx/en_us_dedes/miscellanea:misc.Ode6
ltx/en_us_dedes/me.m04.d03:meMA.Ode6C12.text	
ltx/en_us_dedes/me.m04.d03:meMA.Ode6C13.incipit	…
ltx/en_us_dedes/me.m04.d03:meMA.Ode6C13.melody	@ltx/en_us_dedes/he.h.m2:heHE.EnAvyssoPtaismaton.name
ltx/en_us_dedes/me.m04.d03:meMA.Ode6C13.mode	@ltx/en_us_dedes/miscellanea:misc.Mode2
ltx/en_us_dedes/me.m04.d03:meMA.Ode6C13.ode	@ltx/en_us_dedes/miscellanea:misc.Ode6
ltx/en_us_dedes/me.m04.d03:meMA.Ode6C13.text	
ltx/en_us_dedes/me.m04.d03:meMA.Ode6C1H.greekmelody	@ltx/en_us_dedes/he.h.m2:heHE.EnAvyssoPtaismaton.greekname
ltx/en_us_dedes/me.m04.d03:meMA.Ode6C1H.incipit	@ltx/en_us_dedes/he.h.m2:heHE.EnAvyssoPtaismaton.incipit
ltx/en_us_dedes/me.m04.d03:meMA.Ode6C1H.melody	@ltx/en_us_dedes/he.h.m2:heHE.EnAvyssoPtaismaton.melody
ltx/en_us_dedes/me.m04.d03:meMA.Ode6C1H.mode	@ltx/en_us_dedes/miscellanea:misc.Mode2
ltx/en_us_dedes/me.m04.d03:meMA.Ode6C1H.ode	@ltx/en_us_dedes/miscellanea:misc.Ode6
ltx/en_us_dedes/me.m04.d03:meMA.Ode6C1H.text	@ltx/en_us_dedes/he.h.m2:heHE.EnAvyssoPtaismaton.text
ltx/en_us_dedes/me.m04.d03:meMA.Ode6C1T.incipit	…
ltx/en_us_dedes/me.m04.d03:meMA.Ode6C1T.melody	@ltx/en_us_dedes/he.h.m2:heHE.EnAvyssoPtaismaton.name
ltx/en_us_dedes/me.m04.d03:meMA.Ode6C1T.mode	@ltx/en_us_dedes/miscellanea:misc.Mode2
ltx/en_us_dedes/me.m04.d03:meMA.Ode6C1T.ode	@ltx/en_us_dedes/miscellanea:misc.Ode6
ltx/en_us_dedes/me.m04.d03:meMA.Ode6C1T.text	
ltx/en_us_dedes/me.m04.d03:meMA.Ode7C11.greekmelody	@ltx/en_us_dedes/he.h.m2:heHE.AntitheonProstagma.greekname
ltx/en_us_dedes/me.m04.d03:meMA.Ode7C11.incipit	…
ltx/en_us_dedes/me.m04.d03:meMA.Ode7C11.melody	@ltx/en_us_dedes/he.h.m2:heHE.AntitheonProstagma.name
ltx/en_us_dedes/me.m04.d03:meMA.Ode7C11.mode	@ltx/en_us_dedes/miscellanea:misc.Mode2
ltx/en_us_dedes/me.m04.d03:meMA.Ode7C11.ode	@ltx/en_us_dedes/miscellanea:misc.Ode7
ltx/en_us_dedes/me.m04.d03:meMA.Ode7C11.text	
ltx/en_us_dedes/me.m04.d03:meMA.Ode7C12.incipit	…
ltx/en_us_dedes/me.m04.d03:meMA.Ode7C12.melody	@ltx/en_us_dedes/he.h.m2:heHE.AntitheonProstagma.name
ltx/en_us_dedes/me.m04.d03:meMA.Ode7C12.mode	@ltx/en_us_dedes/miscellanea:misc.Mode2
ltx/en_us_dedes/me.m04.d03:meMA.Ode7C12.ode	@ltx/en_us_dedes/miscellanea:misc.Ode7
ltx/en_us_dedes/me.m04.d03:meMA.Ode7C12.text	
ltx/en_us_dedes/me.m04.d03:meMA.Ode7C13.incipit	…
ltx/en_us_dedes/me.m04.d03:meMA.Ode7C13.melody	@ltx/en_us_dedes/he.h.m2:heHE.AntitheonProstagma.name
ltx/en_us_dedes/me.m04.d03:meMA.Ode7C13.mode	@ltx/en_us_dedes/miscellanea:misc.Mode2
ltx/en_us_dedes/me.m04.d03:meMA.Ode7C13.ode	@ltx/en_us_dedes/miscellanea:misc.Ode7
ltx/en_us_dedes/me.m04.d03:meMA.Ode7C13.text	
ltx/en_us_dedes/me.m04.d03:meMA.Ode7C1H.greekmelody	@ltx/en_us_dedes/he.h.m2:heHE.AntitheonProstagma.greekname
ltx/en_us_dedes/me.m04.d03:meMA.Ode7C1H.incipit	@ltx/en_us_dedes/he.h.m2:heHE.AntitheonProstagma.incipit
ltx/en_us_dedes/me.m04.d03:meMA.Ode7C1H.melody	@ltx/en_us_dedes/he.h.m2:heHE.AntitheonProstagma.melody
ltx/en_us_dedes/me.m04.d03:meMA.Ode7C1H.mode	@ltx/en_us_dedes/miscellanea:misc.Mode2
ltx/en_us_dedes/me.m04.d03:meMA.Ode7C1H.ode	@ltx/en_us_dedes/miscellanea:misc.Ode7
ltx/en_us_dedes/me.m04.d03:meMA.Ode7C1H.text	@ltx/en_us_dedes/he.h.m2:heHE.AntitheonProstagma.text
ltx/en_us_dedes/me.m04.d03:meMA.Ode7C1T.incipit	…
ltx/en_us_dedes/me.m04.d03:meMA.Ode7C1T.melody	@ltx/en_us_dedes/he.h.m2:heHE.AntitheonProstagma.name
ltx/en_us_dedes/me.m04.d03:meMA.Ode7C1T.mode	@ltx/en_us_dedes/miscellanea:misc.Mode2
ltx/en_us_dedes/me.m04.d03:meMA.Ode7C1T.ode	@ltx/en_us_dedes/miscellanea:misc.Ode7
ltx/en_us_dedes/me.m04.d03:meMA.Ode7C1T.text	
ltx/en_us_dedes/me.m04.d03:meMA.Ode8C11.greekmelody	@ltx/en_us_dedes/he.h.m2:heHE.KaminosPote.greekname
ltx/en_us_dedes/me.m04.d03:meMA.Ode8C11.incipit	…
ltx/en_us_dedes/me.m04.d03:meMA.Ode8C11.melody	@ltx/en_us_dedes/he.h.m2:heHE.KaminosPote.name
ltx/en_us_dedes/me.m04.d03:meMA.Ode8C11.mode	@ltx/en_us_dedes/miscellanea:misc.Mode2
ltx/en_us_dedes/me.m04.d03:meMA.Ode8C11.ode	@ltx/en_us_dedes/miscellanea:misc.Ode8
ltx/en_us_dedes/me.m04.d03:meMA.Ode8C11.text	
ltx/en_us_dedes/me.m04.d03:meMA.Ode8C12.incipit	…
ltx/en_us_dedes/me.m04.d03:meMA.Ode8C12.melody	@ltx/en_us_dedes/he.h.m2:heHE.KaminosPote.name
ltx/en_us_dedes/me.m04.d03:meMA.Ode8C12.mode	@ltx/en_us_dedes/miscellanea:misc.Mode2
ltx/en_us_dedes/me.m04.d03:meMA.Ode8C12.ode	@ltx/en_us_dedes/miscellanea:misc.Ode8
ltx/en_us_dedes/me.m04.d03:meMA.Ode8C12.text	
ltx/en_us_dedes/me.m04.d03:meMA.Ode8C13.incipit	…
ltx/en_us_dedes/me.m04.d03:meMA.Ode8C13.melody	@ltx/en_us_dedes/he.h.m2:heHE.KaminosPote.name
ltx/en_us_dedes/me.m04.d03:meMA.Ode8C13.mode	@ltx/en_us_dedes/miscellanea:misc.Mode2
ltx/en_us_dedes/me.m04.d03:meMA.Ode8C13.ode	@ltx/en_us_dedes/miscellanea:misc.Ode8
ltx/en_us_dedes/me.m04.d03:meMA.Ode8C13.text	
ltx/en_us_dedes/me.m04.d03:meMA.Ode8C14.incipit	…
ltx/en_us_dedes/me.m04.d03:meMA.Ode8C14.melody	@ltx/en_us_dedes/he.h.m2:heHE.KaminosPote.name
ltx/en_us_dedes/me.m04.d03:meMA.Ode8C14.mode	@ltx/en_us_dedes/miscellanea:misc.Mode2
ltx/en_us_dedes/me.m04.d03:meMA.Ode8C14.ode	@ltx/en_us_dedes/miscellanea:misc.Ode8
ltx/en_us_dedes/me.m04.d03:meMA.Ode8C14.text	
ltx/en_us_dedes/me.m04.d03:meMA.Ode8C1H.greekmelody	@ltx/en_us_dedes/he.h.m2:heHE.KaminosPote.greekname
ltx/en_us_dedes/me.m04.d03:meMA.Ode8C1H.incipit	@ltx/en_us_dedes/he.h.m2:heHE.KaminosPote.incipit
ltx/en_us_dedes/me.m04.d03:meMA.Ode8C1H.melody	@ltx/en_us_dedes/he.h.m2:heHE.KaminosPote.melody
ltx/en_us_dedes/me.m04.d03:meMA.Ode8C1H.mode	@ltx/en_us_dedes/miscellanea:misc.Mode2
ltx/en_us_dedes/me.m04.d03:meMA.Ode8C1H.ode	@ltx/en_us_dedes/miscellanea:misc.Ode8
ltx/en_us_dedes/me.m04.d03:meMA.Ode8C1H.text	@ltx/en_us_dedes/he.h.m2:heHE.KaminosPote.text
ltx/en_us_dedes/me.m04.d03:meMA.Ode8C1T.incipit	…
ltx/en_us_dedes/me.m04.d03:meMA.Ode8C1T.melody	@ltx/en_us_dedes/he.h.m2:heHE.KaminosPote.name
ltx/en_us_dedes/me.m04.d03:meMA.Ode8C1T.mode	@ltx/en_us_dedes/miscellanea:misc.Mode2
ltx/en_us_dedes/me.m04.d03:meMA.Ode8C1T.ode	@ltx/en_us_dedes/miscellanea:misc.Ode8
ltx/en_us_dedes/me.m04.d03:meMA.Ode8C1T.text	
ltx/en_us_dedes/me.m04.d03:meMA.Ode9C11.greekmelody	@ltx/en_us_dedes/he.h.m2:heHE.AnarchouGennitoros.greekname
ltx/en_us_dedes/me.m04.d03:meMA.Ode9C11.incipit	…
ltx/en_us_dedes/me.m04.d03:meMA.Ode9C11.melody	@ltx/en_us_dedes/he.h.m2:heHE.AnarchouGennitoros.name
ltx/en_us_dedes/me.m04.d03:meMA.Ode9C11.mode	@ltx/en_us_dedes/miscellanea:misc.Mode2
ltx/en_us_dedes/me.m04.d03:meMA.Ode9C11.ode	@ltx/en_us_dedes/miscellanea:misc.Ode9
ltx/en_us_dedes/me.m04.d03:meMA.Ode9C11.text	
ltx/en_us_dedes/me.m04.d03:meMA.Ode9C12.incipit	…
ltx/en_us_dedes/me.m04.d03:meMA.Ode9C12.melody	@ltx/en_us_dedes/he.h.m2:heHE.AnarchouGennitoros.name
ltx/en_us_dedes/me.m04.d03:meMA.Ode9C12.mode	@ltx/en_us_dedes/miscellanea:misc.Mode2
ltx/en_us_dedes/me.m04.d03:meMA.Ode9C12.ode	@ltx/en_us_dedes/miscellanea:misc.Ode9
ltx/en_us_dedes/me.m04.d03:meMA.Ode9C12.text	
ltx/en_us_dedes/me.m04.d03:meMA.Ode9C13.incipit	…
ltx/en_us_dedes/me.m04.d03:meMA.Ode9C13.melody	@ltx/en_us_dedes/he.h.m2:heHE.AnarchouGennitoros.name
ltx/en_us_dedes/me.m04.d03:meMA.Ode9C13.mode	@ltx/en_us_dedes/miscellanea:misc.Mode2
ltx/en_us_dedes/me.m04.d03:meMA.Ode9C13.ode	@ltx/en_us_dedes/miscellanea:misc.Ode9
ltx/en_us_dedes/me.m04.d03:meMA.Ode9C13.text	
ltx/en_us_dedes/me.m04.d03:meMA.Ode9C1H.greekmelody	@ltx/en_us_dedes/he.h.m2:heHE.AnarchouGennitoros.greekname
ltx/en_us_dedes/me.m04.d03:meMA.Ode9C1H.incipit	@ltx/en_us_dedes/he.h.m2:heHE.AnarchouGennitoros.incipit
ltx/en_us_dedes/me.m04.d03:meMA.Ode9C1H.melody	@ltx/en_us_dedes/he.h.m2:heHE.AnarchouGennitoros.melody
ltx/en_us_dedes/me.m04.d03:meMA.Ode9C1H.mode	@ltx/en_us_dedes/miscellanea:misc.Mode2
ltx/en_us_dedes/me.m04.d03:meMA.Ode9C1H.ode	@ltx/en_us_dedes/miscellanea:misc.Ode9
ltx/en_us_dedes/me.m04.d03:meMA.Ode9C1H.text	@ltx/en_us_dedes/he.h.m2:heHE.AnarchouGennitoros.text
ltx/en_us_dedes/me.m04.d03:meMA.Ode9C1T.incipit	…
ltx/en_us_dedes/me.m04.d03:meMA.Ode9C1T.melody	@ltx/en_us_dedes/he.h.m2:heHE.AnarchouGennitoros.name
ltx/en_us_dedes/me.m04.d03:meMA.Ode9C1T.mode	@ltx/en_us_dedes/miscellanea:misc.Mode2
ltx/en_us_dedes/me.m04.d03:meMA.Ode9C1T.ode	@ltx/en_us_dedes/miscellanea:misc.Ode9
ltx/en_us_dedes/me.m04.d03:meMA.Ode9C1T.text	
ltx/en_us_dedes/me.m04.d03:meVE.Apolytikion1ger.greekmelody	@ltx/en_us_dedes/he.a.m4:heAU.TachyProkatalave.greekname
ltx/en_us_dedes/me.m04.d03:meVE.Apolytikion1ger.incipit	…
ltx/en_us_dedes/me.m04.d03:meVE.Apolytikion1ger.melody	@ltx/en_us_dedes/he.a.m4:heAU.TachyProkatalave.name
ltx/en_us_dedes/me.m04.d03:meVE.Apolytikion1ger.mode	@ltx/en_us_dedes/miscellanea:misc.Mode4
ltx/en_us_dedes/me.m04.d03:meVE.Apolytikion1ger.poet	@ltx/en_us_dedes/poets:po.Gerasimou
ltx/en_us_dedes/me.m04.d03:meVE.Apolytikion1ger.text	
ltx/en_us_dedes/me.m04.d03:meVE.Apolytikion2ger.greekmelody	@ltx/en_us_dedes/he.a.m3:heAU.TinOraiotita.greekname
ltx/en_us_dedes/me.m04.d03:meVE.Apolytikion2ger.incipit	…
ltx/en_us_dedes/me.m04.d03:meVE.Apolytikion2ger.melody	@ltx/en_us_dedes/he.a.m3:heAU.TinOraiotita.name
ltx/en_us_dedes/me.m04.d03:meVE.Apolytikion2ger.mode	@ltx/en_us_dedes/miscellanea:misc.Mode3
ltx/en_us_dedes/me.m04.d03:meVE.Apolytikion2ger.poet	@ltx/en_us_dedes/poets:po.Gerasimou
ltx/en_us_dedes/me.m04.d03:meVE.Apolytikion2ger.text	
ltx/en_us_dedes/me.m04.d03:meVE.SticStavrotheotokion.greekmelody	@ltx/en_us_dedes/he.a.m2:heAU.OteEkTouXylou.greekname
ltx/en_us_dedes/me.m04.d03:meVE.SticStavrotheotokion.incipit	The sun put on darkness…
ltx/en_us_dedes/me.m04.d03:meVE.SticStavrotheotokion.melody	@ltx/en_us_dedes/he.a.m2:heAU.OteEkTouXylou.notmetered
ltx/en_us_dedes/me.m04.d03:meVE.SticStavrotheotokion.mode	@ltx/en_us_dedes/miscellanea:misc.Mode2
ltx/en_us_dedes/me.m04.d03:meVE.SticStavrotheotokion.text	The sun put on darkness, when it saw You, Savior, hanging on the Cross. And below, the netherworld shuddered, and the dead arose; stones shattered, and the heavens were amazed. But the immaculate Virgin stood near Your Cross and wept, and she extolled You, the benevolent Lord.
ltx/en_us_dedes/me.m04.d03:meVE.SticTheotokion.greekmelody	@ltx/en_us_dedes/he.a.m2:heAU.OteEkTouXylou.greekname
ltx/en_us_dedes/me.m04.d03:meVE.SticTheotokion.incipit	I sigh from the depths…
ltx/en_us_dedes/me.m04.d03:meVE.SticTheotokion.melody	@ltx/en_us_dedes/he.a.m2:heAU.OteEkTouXylou.name
ltx/en_us_dedes/me.m04.d03:meVE.SticTheotokion.mode	@ltx/en_us_dedes/miscellanea:misc.Mode2
ltx/en_us_dedes/me.m04.d03:meVE.SticTheotokion.text	I sigh from the depths of my soul * when I recollect my transgressions, and also beat my breast, * crying out that I have sinned against my Lord and God. * O my Lady, I come to you, intending repentance, * but being an idiot, I burn with passion again. * Woe is me for my sinful habit. * Free me from this quickly, I pray you, * also be my guide along salvation’s path.
ltx/en_us_dedes/me.m04.d03:meVE.Stichera01.greekmelody	@ltx/en_us_dedes/he.a.m2:heAU.OteEkTouXylou.greekname
ltx/en_us_dedes/me.m04.d03:meVE.Stichera01.incipit	…
ltx/en_us_dedes/me.m04.d03:meVE.Stichera01.melody	@ltx/en_us_dedes/he.a.m2:heAU.OteEkTouXylou.name
ltx/en_us_dedes/me.m04.d03:meVE.Stichera01.mode	@ltx/en_us_dedes/miscellanea:misc.Mode2
ltx/en_us_dedes/me.m04.d03:meVE.Stichera01.text	
ltx/en_us_dedes/me.m04.d03:meVE.Stichera02.incipit	…
ltx/en_us_dedes/me.m04.d03:meVE.Stichera02.melody	@ltx/en_us_dedes/he.a.m2:heAU.OteEkTouXylou.name
ltx/en_us_dedes/me.m04.d03:meVE.Stichera02.mode	@ltx/en_us_dedes/miscellanea:misc.Mode2
ltx/en_us_dedes/me.m04.d03:meVE.Stichera02.text	
ltx/en_us_dedes/me.m04.d03:meVE.Stichera03.incipit	…
ltx/en_us_dedes/me.m04.d03:meVE.Stichera03.melody	@ltx/en_us_dedes/he.a.m2:heAU.OteEkTouXylou.name
ltx/en_us_dedes/me.m04.d03:meVE.Stichera03.mode	@ltx/en_us_dedes/miscellanea:misc.Mode2
ltx/en_us_dedes/me.m04.d03:meVE.Stichera03.text	
