ltx/en_us_dedes/oc.m3.d1:ocBK.ModeNaked	@ltx/en_us_dedes/miscellanea:misc.Mode3.naked
ltx/en_us_dedes/oc.m3.d1:ocBK.mode.title	PERIOD OF MODE 3
ltx/en_us_dedes/oc.m3.d1:ocGE.MM.BothHeirmologic.text	@ltx/en_us_dedes/properties:media.key
ltx/en_us_dedes/oc.m3.d1:ocGE.MM.BothSticheraric.text	@ltx/en_us_dedes/properties:media.key
ltx/en_us_dedes/oc.m3.d1:ocGE.MM.GloryHeirmologic.text	@ltx/en_us_dedes/properties:media.key
ltx/en_us_dedes/oc.m3.d1:ocGE.MM.GlorySticheraric.text	@ltx/en_us_dedes/properties:media.key
ltx/en_us_dedes/oc.m3.d1:ocLI.Alleuia.text	@ltx/en_us_dedes/prayers:pr.Alleluia3.text
ltx/en_us_dedes/oc.m3.d1:ocLI.Beatitudes1.incipit	When our primal father Adam…
ltx/en_us_dedes/oc.m3.d1:ocLI.Beatitudes1.melody	
ltx/en_us_dedes/oc.m3.d1:ocLI.Beatitudes1.mode	@ltx/en_us_dedes/miscellanea:misc.Mode3
ltx/en_us_dedes/oc.m3.d1:ocLI.Beatitudes1.text	When our primal father Adam disobeyed Your divine command, O Christ, You expelled him from Paradise. But when the faithful Robber while on the cross confessed You to be Lord, You restored him there, as he cried to You: “O Savior, when You come in Your kingdom, remember me.”
ltx/en_us_dedes/oc.m3.d1:ocLI.Beatitudes2.incipit	When in Paradise we sinned…
ltx/en_us_dedes/oc.m3.d1:ocLI.Beatitudes2.melody	
ltx/en_us_dedes/oc.m3.d1:ocLI.Beatitudes2.mode	@ltx/en_us_dedes/miscellanea:misc.Mode3
ltx/en_us_dedes/oc.m3.d1:ocLI.Beatitudes2.text	When in Paradise we sinned, You condemned us and pronounced the curse of death, being the Lord and the Giver of life. But later, loving Master, You who are sinless suffered in the flesh, and You brought the dead back to life again, who shouted: “When You come in Your kingdom, remember us.”
ltx/en_us_dedes/oc.m3.d1:ocLI.Beatitudes3.incipit	Having risen from the dead…
ltx/en_us_dedes/oc.m3.d1:ocLI.Beatitudes3.melody	
ltx/en_us_dedes/oc.m3.d1:ocLI.Beatitudes3.mode	@ltx/en_us_dedes/miscellanea:misc.Mode3
ltx/en_us_dedes/oc.m3.d1:ocLI.Beatitudes3.text	Having risen from the dead, You also raised us from the passions, by Your holy resurrection, O Christ our God. And roundly You defeated death’s dominion over us, O Lord. Therefore we believers cry out to You: O Savior, when You come in Your kingdom, remember us.
ltx/en_us_dedes/oc.m3.d1:ocLI.Beatitudes4.incipit	After three days in the…
ltx/en_us_dedes/oc.m3.d1:ocLI.Beatitudes4.melody	
ltx/en_us_dedes/oc.m3.d1:ocLI.Beatitudes4.mode	@ltx/en_us_dedes/miscellanea:misc.Mode3
ltx/en_us_dedes/oc.m3.d1:ocLI.Beatitudes4.text	After three days in the tomb, as God, You gave life to the dead who were in Hades and also resurrected them. And being good, You welled forth the gift of incorruption to us all, who in faith cry out now unceasingly: O Savior, when You come in Your kingdom, remember us.
ltx/en_us_dedes/oc.m3.d1:ocLI.Beatitudes5.incipit	When You had risen from…
ltx/en_us_dedes/oc.m3.d1:ocLI.Beatitudes5.melody	
ltx/en_us_dedes/oc.m3.d1:ocLI.Beatitudes5.mode	@ltx/en_us_dedes/miscellanea:misc.Mode3
ltx/en_us_dedes/oc.m3.d1:ocLI.Beatitudes5.text	When You had risen from the dead, You appeared first to the myrrh-bearing women, and You spoke to them and said, “Rejoice.” You sent them, Lord, proclaiming Your resurrection to Your friends, O Christ. Therefore we believers cry out to You: O Savior, when You come in Your kingdom, remember us.
ltx/en_us_dedes/oc.m3.d1:ocLI.Beatitudes6.incipit	Prophet Moses on the hill…
ltx/en_us_dedes/oc.m3.d1:ocLI.Beatitudes6.melody	
ltx/en_us_dedes/oc.m3.d1:ocLI.Beatitudes6.mode	@ltx/en_us_dedes/miscellanea:misc.Mode3
ltx/en_us_dedes/oc.m3.d1:ocLI.Beatitudes6.text	Prophet Moses on the hill of old extended his hands and thus prefigured the Cross, defeating Amalek. And now with faith we take up the mighty weapon of the precious Cross, and defeat the demons, and cry aloud: “O Savior, when You come in Your kingdom, remember us.”
ltx/en_us_dedes/oc.m3.d1:ocLI.BeatitudesT.incipit	Rejoice, the gate of God…
ltx/en_us_dedes/oc.m3.d1:ocLI.BeatitudesT.melody	
ltx/en_us_dedes/oc.m3.d1:ocLI.BeatitudesT.mode	@ltx/en_us_dedes/miscellanea:misc.Mode3
ltx/en_us_dedes/oc.m3.d1:ocLI.BeatitudesT.text	Rejoice, the gate of God, through whom went the incarnate Creator, when He was born from you, and He kept you sealed. Rejoice, O swift and light cloud who brings the divine showers, namely Christ. Rejoice, O ladder to heaven and celestial throne. O rejoice, holy mountain, uncut and rich.
ltx/en_us_dedes/oc.m3.d1:ocLI.BeatitudesTr.incipit	O believers, let us all…
ltx/en_us_dedes/oc.m3.d1:ocLI.BeatitudesTr.melody	
ltx/en_us_dedes/oc.m3.d1:ocLI.BeatitudesTr.mode	@ltx/en_us_dedes/miscellanea:misc.Mode3
ltx/en_us_dedes/oc.m3.d1:ocLI.BeatitudesTr.text	O believers, let us all extol the Father and the Son and the all-holy Spirit, the single God, as from one Sun, the one Lord. For thrice-resplendent is the Trinity, which illumines all who cry out in faith: “O Lord, when You come in Your kingdom, remember us.”
ltx/en_us_dedes/oc.m3.d1:ocLI.MM.Beatitudes123456TrTas5678910GB.text	@ltx/en_us_dedes/properties:media.key
ltx/en_us_dedes/oc.m3.d1:ocLI.MM.Beatitudes123Tas1234.text	@ltx/en_us_dedes/properties:media.key
ltx/en_us_dedes/oc.m3.d1:ocLI.MM.Beatitudes123Tas5678.text	@ltx/en_us_dedes/properties:media.key
ltx/en_us_dedes/oc.m3.d1:ocLI.MM.Prokeimenon.text	
ltx/en_us_dedes/oc.m3.d1:ocMA.Antiphon11.incipit	You rescued the captivity of Zion…
ltx/en_us_dedes/oc.m3.d1:ocMA.Antiphon11.melody	
ltx/en_us_dedes/oc.m3.d1:ocMA.Antiphon11.mode	@ltx/en_us_dedes/miscellanea:misc.Mode3
ltx/en_us_dedes/oc.m3.d1:ocMA.Antiphon11.text	You rescued the captivity of Zion out of Babylon, O Logos; do also draw me up from the passions to life.
ltx/en_us_dedes/oc.m3.d1:ocMA.Antiphon12.incipit	Those who sow shedding godly…
ltx/en_us_dedes/oc.m3.d1:ocMA.Antiphon12.melody	
ltx/en_us_dedes/oc.m3.d1:ocMA.Antiphon12.mode	@ltx/en_us_dedes/miscellanea:misc.Mode3
ltx/en_us_dedes/oc.m3.d1:ocMA.Antiphon12.text	Those who sow shedding godly tears when the south wind is blowing, joyously will harvest ears of life everlasting.
ltx/en_us_dedes/oc.m3.d1:ocMA.Antiphon13.incipit	In the Holy Spirit, as…
ltx/en_us_dedes/oc.m3.d1:ocMA.Antiphon13.melody	
ltx/en_us_dedes/oc.m3.d1:ocMA.Antiphon13.mode	@ltx/en_us_dedes/miscellanea:misc.Mode3
ltx/en_us_dedes/oc.m3.d1:ocMA.Antiphon13.text	In the Holy Spirit, as in the Father and the Son, radiates intrinsically every gift of goodness. And in Him all things both live and move.
ltx/en_us_dedes/oc.m3.d1:ocMA.Antiphon21.incipit	Unless the Lord build the…
ltx/en_us_dedes/oc.m3.d1:ocMA.Antiphon21.melody	
ltx/en_us_dedes/oc.m3.d1:ocMA.Antiphon21.mode	@ltx/en_us_dedes/miscellanea:misc.Mode3
ltx/en_us_dedes/oc.m3.d1:ocMA.Antiphon21.text	Unless the Lord build the house of the virtues, in vain do we labor. But if He protect the soul, no one can conquer our city.
ltx/en_us_dedes/oc.m3.d1:ocMA.Antiphon22.incipit	O Christ the Fruit of…
ltx/en_us_dedes/oc.m3.d1:ocMA.Antiphon22.melody	
ltx/en_us_dedes/oc.m3.d1:ocMA.Antiphon22.mode	@ltx/en_us_dedes/miscellanea:misc.Mode3
ltx/en_us_dedes/oc.m3.d1:ocMA.Antiphon22.text	O Christ the Fruit of the womb, by the Spirit are the saints forever as adopted sons to You as to a father.
ltx/en_us_dedes/oc.m3.d1:ocMA.Antiphon23.incipit	In the Holy Spirit are…
ltx/en_us_dedes/oc.m3.d1:ocMA.Antiphon23.melody	
ltx/en_us_dedes/oc.m3.d1:ocMA.Antiphon23.mode	@ltx/en_us_dedes/miscellanea:misc.Mode3
ltx/en_us_dedes/oc.m3.d1:ocMA.Antiphon23.text	In the Holy Spirit are perceived all holiness and wisdom, for He gives substance to all creation. Since He is God, let us worship Him, as we do the Father and Logos.
ltx/en_us_dedes/oc.m3.d1:ocMA.Antiphon31.incipit	Those who fear the Lord…
ltx/en_us_dedes/oc.m3.d1:ocMA.Antiphon31.melody	
ltx/en_us_dedes/oc.m3.d1:ocMA.Antiphon31.mode	@ltx/en_us_dedes/miscellanea:misc.Mode3
ltx/en_us_dedes/oc.m3.d1:ocMA.Antiphon31.text	Those who fear the Lord are blessed: they will walk in the ways of the commandments; for they will eat every kind of vivifying produce.
ltx/en_us_dedes/oc.m3.d1:ocMA.Antiphon32.incipit	Gazing on your offspring round…
ltx/en_us_dedes/oc.m3.d1:ocMA.Antiphon32.melody	
ltx/en_us_dedes/oc.m3.d1:ocMA.Antiphon32.mode	@ltx/en_us_dedes/miscellanea:misc.Mode3
ltx/en_us_dedes/oc.m3.d1:ocMA.Antiphon32.text	Gazing on your offspring round about your table bearing branches of good works, be glad, O arch-pastor.
ltx/en_us_dedes/oc.m3.d1:ocMA.Antiphon33.incipit	With the Holy Spirit is…
ltx/en_us_dedes/oc.m3.d1:ocMA.Antiphon33.melody	
ltx/en_us_dedes/oc.m3.d1:ocMA.Antiphon33.mode	@ltx/en_us_dedes/miscellanea:misc.Mode3
ltx/en_us_dedes/oc.m3.d1:ocMA.Antiphon33.text	With the Holy Spirit is all the wealth of glory. From Him issue grace and life to all creation, for He is extolled with the Father and the Logos.
ltx/en_us_dedes/oc.m3.d1:ocMA.ApolTheotokion.incipit	@ltx/en_us_dedes/ho.ho03:hoMA.SunTroparion1.incipit
ltx/en_us_dedes/oc.m3.d1:ocMA.ApolTheotokion.melody	
ltx/en_us_dedes/oc.m3.d1:ocMA.ApolTheotokion.mode	@ltx/en_us_dedes/miscellanea:misc.Mode3
ltx/en_us_dedes/oc.m3.d1:ocMA.ApolTheotokion.text	@ltx/en_us_dedes/ho.ho03:hoMA.SunTroparion1.text
ltx/en_us_dedes/oc.m3.d1:ocMA.C2.acrostic.notice1	
ltx/en_us_dedes/oc.m3.d1:ocMA.C2.acrostic.text	
ltx/en_us_dedes/oc.m3.d1:ocMA.C2.acrostic.title	Canon for the Cross and Resurrection.
ltx/en_us_dedes/oc.m3.d1:ocMA.C2.poet	@ltx/en_us_dedes/poets:po.IoannouMonachou
ltx/en_us_dedes/oc.m3.d1:ocMA.C3.acrostic	
ltx/en_us_dedes/oc.m3.d1:ocMA.C3.acrostic.notice1	
ltx/en_us_dedes/oc.m3.d1:ocMA.C3.acrostic.text	
ltx/en_us_dedes/oc.m3.d1:ocMA.C3.acrostic.title	Canon for the Theotokos.
ltx/en_us_dedes/oc.m3.d1:ocMA.Hypakoe.incipit	Astounding in appearance…
ltx/en_us_dedes/oc.m3.d1:ocMA.Hypakoe.melody	
ltx/en_us_dedes/oc.m3.d1:ocMA.Hypakoe.mode	@ltx/en_us_dedes/miscellanea:misc.Mode3
ltx/en_us_dedes/oc.m3.d1:ocMA.Hypakoe.text	Astounding in appearance, refreshing by the words he spoke, the flashing Angel said to the myrrh-bearing women: Why do you look in a tomb for the Living One? He is risen and has emptied the tombs. Know Him, the unchanging Changer of corruption. Say to God: How awesome are Your works! For You have saved the human race.
ltx/en_us_dedes/oc.m3.d1:ocMA.Kathisma11.incipit	Christ has risen from the dead…
ltx/en_us_dedes/oc.m3.d1:ocMA.Kathisma11.melody	
ltx/en_us_dedes/oc.m3.d1:ocMA.Kathisma11.mode	@ltx/en_us_dedes/miscellanea:misc.Mode3
ltx/en_us_dedes/oc.m3.d1:ocMA.Kathisma11.text	Christ has risen from the dead, the first of those who have fallen asleep. The Artificer of all things that were made was first born before all creation; now He has renewed the corrupted nature of our human race in himself. O Death, you no longer have dominion, for the Master of all has destroyed your power.
ltx/en_us_dedes/oc.m3.d1:ocMA.Kathisma12.incipit	When You had physically tasted death…
ltx/en_us_dedes/oc.m3.d1:ocMA.Kathisma12.melody	
ltx/en_us_dedes/oc.m3.d1:ocMA.Kathisma12.mode	@ltx/en_us_dedes/miscellanea:misc.Mode3
ltx/en_us_dedes/oc.m3.d1:ocMA.Kathisma12.text	When You had physically tasted death, O Lord, You curtailed its bitterness by Your resurrection, and You strengthened humanity against it, by reversing the failure related to the primal curse, O Defender of our life. Glory to You, O Lord.
ltx/en_us_dedes/oc.m3.d1:ocMA.Kathisma13.greekmelody	@ltx/en_us_dedes/he.a.m3:heAU.TinOraiotita.greekname
ltx/en_us_dedes/oc.m3.d1:ocMA.Kathisma13.incipit	@ltx/en_us_dedes/he.a.m3:heAU.TinOraiotita.incipit
ltx/en_us_dedes/oc.m3.d1:ocMA.Kathisma13.melody	@ltx/en_us_dedes/he.a.m3:heAU.TinOraiotita.melody
ltx/en_us_dedes/oc.m3.d1:ocMA.Kathisma13.mode	@ltx/en_us_dedes/miscellanea:misc.Mode3
ltx/en_us_dedes/oc.m3.d1:ocMA.Kathisma13.text	@ltx/en_us_dedes/he.a.m3:heAU.TinOraiotita.text
ltx/en_us_dedes/oc.m3.d1:ocMA.Kathisma21.greekmelody	@ltx/en_us_dedes/he.a.m3:heAU.TinOraiotita.greekname
ltx/en_us_dedes/oc.m3.d1:ocMA.Kathisma21.incipit	At Your Divinity’s immutability…
ltx/en_us_dedes/oc.m3.d1:ocMA.Kathisma21.melody	@ltx/en_us_dedes/he.a.m3:heAU.TinOraiotita.name
ltx/en_us_dedes/oc.m3.d1:ocMA.Kathisma21.mode	@ltx/en_us_dedes/miscellanea:misc.Mode3
ltx/en_us_dedes/oc.m3.d1:ocMA.Kathisma21.text	At Your Divinity’s immutability, * and at Your suffering’s intentionality, * amazed was Hades, Lord, and thus lamented to itself and said: * I tremble at this human frame’s uncorrupted hypostasis. * I see the invisible One waging war on me secretly. * Hence those whom I am holding are crying out: * Glory to Your resurrection, O Christ.
ltx/en_us_dedes/oc.m3.d1:ocMA.Kathisma22.greekmelody	@ltx/en_us_dedes/he.a.m3:heAU.TinOraiotita.greekname
ltx/en_us_dedes/oc.m3.d1:ocMA.Kathisma22.incipit	We the believers now theologize…
ltx/en_us_dedes/oc.m3.d1:ocMA.Kathisma22.melody	@ltx/en_us_dedes/he.a.m3:heAU.TinOraiotita.name
ltx/en_us_dedes/oc.m3.d1:ocMA.Kathisma22.mode	@ltx/en_us_dedes/miscellanea:misc.Mode3
ltx/en_us_dedes/oc.m3.d1:ocMA.Kathisma22.text	We the believers now theologize about * the inexplicable, incomprehensible * unspoken mystery of Your crucifixion and resurrection. * For today the realm of death and of Hades has been despoiled, * and vested is the human race with incorruptibility. * And therefore in thanksgiving we cry aloud: * Glory to Your resurrection, O Christ.
ltx/en_us_dedes/oc.m3.d1:ocMA.Kathisma23.greekmelody	@ltx/en_us_dedes/he.a.m3:heAU.TinOraiotita.greekname
ltx/en_us_dedes/oc.m3.d1:ocMA.Kathisma23.incipit	You carried mystically…
ltx/en_us_dedes/oc.m3.d1:ocMA.Kathisma23.melody	@ltx/en_us_dedes/he.a.m3:heAU.TinOraiotita.name
ltx/en_us_dedes/oc.m3.d1:ocMA.Kathisma23.mode	@ltx/en_us_dedes/miscellanea:misc.Mode3
ltx/en_us_dedes/oc.m3.d1:ocMA.Kathisma23.text	You carried mystically within your womb the One * incomprehensible, uncircumscribable, * and coessential with the Father and the Spirit, O Mother of God. * By your giving birth, we know that the Trinity’s energy, * singular and unconfused, in the world should be glorified. * And therefore in thanksgiving we cry to you: * Rejoice, O Lady full of grace.
ltx/en_us_dedes/oc.m3.d1:ocMA.Kontakion.incipit	From the tomb You rose…
ltx/en_us_dedes/oc.m3.d1:ocMA.Kontakion.melody	@ltx/en_us_dedes/he.a.m3:heAU.IParthenosSimeron.name
ltx/en_us_dedes/oc.m3.d1:ocMA.Kontakion.mode	@ltx/en_us_dedes/miscellanea:misc.Mode3
ltx/en_us_dedes/oc.m3.d1:ocMA.Kontakion.text	From the tomb You rose today, O Lord of tender compassion, also from the gates of death You led us out, O our Savior. On this day is Adam dancing and Eve rejoices, and with them together Patriarchs and the Prophets are unceasingly extolling the divine power of Your authority.
ltx/en_us_dedes/oc.m3.d1:ocMA.Lauds1.incipit	O come, all you nations…
ltx/en_us_dedes/oc.m3.d1:ocMA.Lauds1.melody	
ltx/en_us_dedes/oc.m3.d1:ocMA.Lauds1.mode	@ltx/en_us_dedes/miscellanea:misc.Mode3
ltx/en_us_dedes/oc.m3.d1:ocMA.Lauds1.text	O come, all you nations. Know the power of the awe-inspiring mystery. For Christ our Savior, the Logos who was in the beginning, voluntarily for us was crucified and buried, and He rose from the dead to save the universe. Let us worship Him.
ltx/en_us_dedes/oc.m3.d1:ocMA.Lauds2.incipit	Those who guarded You reported…
ltx/en_us_dedes/oc.m3.d1:ocMA.Lauds2.melody	
ltx/en_us_dedes/oc.m3.d1:ocMA.Lauds2.mode	@ltx/en_us_dedes/miscellanea:misc.Mode3
ltx/en_us_dedes/oc.m3.d1:ocMA.Lauds2.text	Those who guarded You reported all the marvelous events, O Lord. However the Sanhedrin of futility filled their hands with gifts, thinking that in this way they could hide Your resurrection, which the world glorifies. Have mercy on us.
ltx/en_us_dedes/oc.m3.d1:ocMA.Lauds3.incipit	The universe was filled with joy…
ltx/en_us_dedes/oc.m3.d1:ocMA.Lauds3.melody	
ltx/en_us_dedes/oc.m3.d1:ocMA.Lauds3.mode	@ltx/en_us_dedes/miscellanea:misc.Mode3
ltx/en_us_dedes/oc.m3.d1:ocMA.Lauds3.text	The universe was filled with joy in the experience of Your resurrection. Mary Magdalene came unto the tomb and found an Angel sitting upon the stone. With his garments flashing like lightning, he said to her, “Why do you seek among the dead the One who is alive? He is not here, but has risen as He said, and is going before you to Galilee.”
ltx/en_us_dedes/oc.m3.d1:ocMA.Lauds4.incipit	In Your light we will see light…
ltx/en_us_dedes/oc.m3.d1:ocMA.Lauds4.melody	
ltx/en_us_dedes/oc.m3.d1:ocMA.Lauds4.mode	@ltx/en_us_dedes/miscellanea:misc.Mode3
ltx/en_us_dedes/oc.m3.d1:ocMA.Lauds4.text	In Your light we will see light, O Master who loves humanity; for You have risen from the dead, and You granted salvation to the human race, so that all creation may glorify You, only sinless One. Have mercy on us.
ltx/en_us_dedes/oc.m3.d1:ocMA.Lauds5.incipit	The myrrh-bearing women…
ltx/en_us_dedes/oc.m3.d1:ocMA.Lauds5.melody	
ltx/en_us_dedes/oc.m3.d1:ocMA.Lauds5.mode	@ltx/en_us_dedes/miscellanea:misc.Mode3
ltx/en_us_dedes/oc.m3.d1:ocMA.Lauds5.text	The myrrh-bearing women offered their tears as a morning hymn to You, O Lord; for in possession of sweet-smelling spices, they came to Your tomb intent on anointing Your immaculate body for burial. The Angel sitting on the stone announced to them the good tidings. “Why do you seek among the dead the One who lives? For as God He has trampled on death. He has risen, and granted unto all His great mercy.”
ltx/en_us_dedes/oc.m3.d1:ocMA.Lauds6.incipit	Like lightning flashed the Angel…
ltx/en_us_dedes/oc.m3.d1:ocMA.Lauds6.melody	
ltx/en_us_dedes/oc.m3.d1:ocMA.Lauds6.mode	@ltx/en_us_dedes/miscellanea:misc.Mode3
ltx/en_us_dedes/oc.m3.d1:ocMA.Lauds6.text	Like lightning flashed the Angel sitting on Your life-giving sepulcher; and to the myrrh-bearing women he said, “The Redeemer has emptied the graves. He has despoiled Hades, and He resurrected on the third day as the only God and omnipotent.”
ltx/en_us_dedes/oc.m3.d1:ocMA.Lauds7.incipit	On the first day of the week…
ltx/en_us_dedes/oc.m3.d1:ocMA.Lauds7.melody	
ltx/en_us_dedes/oc.m3.d1:ocMA.Lauds7.mode	@ltx/en_us_dedes/miscellanea:misc.Mode3
ltx/en_us_dedes/oc.m3.d1:ocMA.Lauds7.text	On the first day of the week, Mary Magdalene came to the tomb seeking You. But not finding You, she lamented and cried out with weeping, “Alas, O my Savior! How were You stolen, O King of all?” Then did a pair of life-bearing Angels sitting inside the sepulcher cry out, “Woman, why are you weeping?” She said, “I weep, for they have taken my Lord away from the tomb, and I do not know where they have laid Him.” Then she turned around, and, having recognized You, straightaway she cried out, “My Lord and my God, glory to You.”
ltx/en_us_dedes/oc.m3.d1:ocMA.Lauds8.incipit	Whereas the Hebrews had enclosed…
ltx/en_us_dedes/oc.m3.d1:ocMA.Lauds8.melody	
ltx/en_us_dedes/oc.m3.d1:ocMA.Lauds8.mode	@ltx/en_us_dedes/miscellanea:misc.Mode3
ltx/en_us_dedes/oc.m3.d1:ocMA.Lauds8.text	Whereas the Hebrews had enclosed Life itself in a tomb, the Robber has opened up Eden in a word. He cried out and uttered, “He who for me was with me crucified was along with me on a cross suspended, and appeared to me to be jointly seated with the Father upon the throne; for He is indeed Christ our God, and He possesses great mercy.”
ltx/en_us_dedes/oc.m3.d1:ocMA.MM.AntiphonsProkeimenon.text	@ltx/en_us_dedes/properties:media.key
ltx/en_us_dedes/oc.m3.d1:ocMA.MM.GodIsTheLord.text	@ltx/en_us_dedes/properties:media.key
ltx/en_us_dedes/oc.m3.d1:ocMA.MM.Lauds01.text	@ltx/en_us_dedes/properties:media.key
ltx/en_us_dedes/oc.m3.d1:ocMA.MM.Lauds02.text	@ltx/en_us_dedes/properties:media.key
ltx/en_us_dedes/oc.m3.d1:ocMA.MM.LaudsStichologia.text	@ltx/en_us_dedes/properties:media.key
ltx/en_us_dedes/oc.m3.d1:ocMA.MM.Prokeimenon.text	@ltx/en_us_dedes/properties:media.key
ltx/en_us_dedes/oc.m3.d1:ocMA.Magnificat.incipit	@ltx/en_us_dedes/he.h.m6:heHE.TinTimioteran.incipit
ltx/en_us_dedes/oc.m3.d1:ocMA.Magnificat.mode	@ltx/en_us_dedes/miscellanea:misc.Mode3
ltx/en_us_dedes/oc.m3.d1:ocMA.Magnificat.text	@ltx/en_us_dedes/he.h.m6:heHE.TinTimioteran.text
ltx/en_us_dedes/oc.m3.d1:ocMA.OdeS1C11.incipit	He who once laid a curse…
ltx/en_us_dedes/oc.m3.d1:ocMA.OdeS1C11.melody	@ltx/en_us_dedes/he.h.m3:heHE.OTaYdata.name
ltx/en_us_dedes/oc.m3.d1:ocMA.OdeS1C11.mode	@ltx/en_us_dedes/miscellanea:misc.Mode3
ltx/en_us_dedes/oc.m3.d1:ocMA.OdeS1C11.ode	@ltx/en_us_dedes/miscellanea:misc.Ode1
ltx/en_us_dedes/oc.m3.d1:ocMA.OdeS1C11.text	He who once laid a curse on the ground, to bring forth * for him who disobeyed thorns for his labors, * let a crown of thorns be laid on His head in the flesh, * by the hands of lawless men. He is our God, and He lifted * the ancestral curse, for He is greatly glorified.
ltx/en_us_dedes/oc.m3.d1:ocMA.OdeS1C12.incipit	By submitting to death…
ltx/en_us_dedes/oc.m3.d1:ocMA.OdeS1C12.melody	@ltx/en_us_dedes/he.h.m3:heHE.OTaYdata.name
ltx/en_us_dedes/oc.m3.d1:ocMA.OdeS1C12.mode	@ltx/en_us_dedes/miscellanea:misc.Mode3
ltx/en_us_dedes/oc.m3.d1:ocMA.OdeS1C12.ode	@ltx/en_us_dedes/miscellanea:misc.Ode1
ltx/en_us_dedes/oc.m3.d1:ocMA.OdeS1C12.text	By submitting to death, He became the victor * triumphantly over death, taking trophies. * He assumed a passible human body and soul. * As our God and Lord, He wrestled with the tyrant and beat him. * With himself He raised all men, for He is glorified.
ltx/en_us_dedes/oc.m3.d1:ocMA.OdeS1C1H.greekmelody	@ltx/en_us_dedes/he.h.m3:heHE.OTaYdata.greekname
ltx/en_us_dedes/oc.m3.d1:ocMA.OdeS1C1H.incipit	@ltx/en_us_dedes/he.h.m3:heHE.OTaYdata.incipit
ltx/en_us_dedes/oc.m3.d1:ocMA.OdeS1C1H.melody	@ltx/en_us_dedes/he.h.m3:heHE.OTaYdata.melody
ltx/en_us_dedes/oc.m3.d1:ocMA.OdeS1C1H.mode	@ltx/en_us_dedes/miscellanea:misc.Mode3
ltx/en_us_dedes/oc.m3.d1:ocMA.OdeS1C1H.ode	@ltx/en_us_dedes/miscellanea:misc.Ode1
ltx/en_us_dedes/oc.m3.d1:ocMA.OdeS1C1H.text	@ltx/en_us_dedes/he.h.m3:heHE.OTaYdata.text
ltx/en_us_dedes/oc.m3.d1:ocMA.OdeS1C1T.incipit	Without seed you gave birth…
ltx/en_us_dedes/oc.m3.d1:ocMA.OdeS1C1T.melody	@ltx/en_us_dedes/he.h.m3:heHE.OTaYdata.name
ltx/en_us_dedes/oc.m3.d1:ocMA.OdeS1C1T.mode	@ltx/en_us_dedes/miscellanea:misc.Mode3
ltx/en_us_dedes/oc.m3.d1:ocMA.OdeS1C1T.ode	@ltx/en_us_dedes/miscellanea:misc.Ode1
ltx/en_us_dedes/oc.m3.d1:ocMA.OdeS1C1T.text	Without seed you gave birth to God. Now all nations * extol you, the only true Theotokos. * For the One who entered into your sanctified womb * is our God and Lord, and He assumed our whole human nature; * and when He was born from you, He was both God and man.
ltx/en_us_dedes/oc.m3.d1:ocMA.OdeS1C21.greekmelody	@ltx/en_us_dedes/he.h.m3:heHE.AsmaKainon.greekname
ltx/en_us_dedes/oc.m3.d1:ocMA.OdeS1C21.incipit	…
ltx/en_us_dedes/oc.m3.d1:ocMA.OdeS1C21.melody	@ltx/en_us_dedes/he.h.m3:heHE.AsmaKainon.name
ltx/en_us_dedes/oc.m3.d1:ocMA.OdeS1C21.mode	@ltx/en_us_dedes/miscellanea:misc.Mode3
ltx/en_us_dedes/oc.m3.d1:ocMA.OdeS1C21.ode	@ltx/en_us_dedes/miscellanea:misc.Ode1
ltx/en_us_dedes/oc.m3.d1:ocMA.OdeS1C21.text	
ltx/en_us_dedes/oc.m3.d1:ocMA.OdeS1C22.incipit	…
ltx/en_us_dedes/oc.m3.d1:ocMA.OdeS1C22.melody	@ltx/en_us_dedes/he.h.m3:heHE.AsmaKainon.name
ltx/en_us_dedes/oc.m3.d1:ocMA.OdeS1C22.mode	@ltx/en_us_dedes/miscellanea:misc.Mode3
ltx/en_us_dedes/oc.m3.d1:ocMA.OdeS1C22.ode	@ltx/en_us_dedes/miscellanea:misc.Ode1
ltx/en_us_dedes/oc.m3.d1:ocMA.OdeS1C22.text	
ltx/en_us_dedes/oc.m3.d1:ocMA.OdeS1C31.greekmelody	@ltx/en_us_dedes/he.h.m3:heHE.AsmaKainon.greekname
ltx/en_us_dedes/oc.m3.d1:ocMA.OdeS1C31.incipit	…
ltx/en_us_dedes/oc.m3.d1:ocMA.OdeS1C31.melody	@ltx/en_us_dedes/he.h.m3:heHE.AsmaKainon.name
ltx/en_us_dedes/oc.m3.d1:ocMA.OdeS1C31.mode	@ltx/en_us_dedes/miscellanea:misc.Mode3
ltx/en_us_dedes/oc.m3.d1:ocMA.OdeS1C31.ode	@ltx/en_us_dedes/miscellanea:misc.Ode1
ltx/en_us_dedes/oc.m3.d1:ocMA.OdeS1C31.text	
ltx/en_us_dedes/oc.m3.d1:ocMA.OdeS1C32.incipit	…
ltx/en_us_dedes/oc.m3.d1:ocMA.OdeS1C32.melody	@ltx/en_us_dedes/he.h.m3:heHE.AsmaKainon.name
ltx/en_us_dedes/oc.m3.d1:ocMA.OdeS1C32.mode	@ltx/en_us_dedes/miscellanea:misc.Mode3
ltx/en_us_dedes/oc.m3.d1:ocMA.OdeS1C32.ode	@ltx/en_us_dedes/miscellanea:misc.Ode1
ltx/en_us_dedes/oc.m3.d1:ocMA.OdeS1C32.text	
ltx/en_us_dedes/oc.m3.d1:ocMA.OdeS3C11.incipit	The ungodly one…
ltx/en_us_dedes/oc.m3.d1:ocMA.OdeS3C11.melody	@ltx/en_us_dedes/he.h.m3:heHE.OEkMiOnton.name
ltx/en_us_dedes/oc.m3.d1:ocMA.OdeS3C11.mode	@ltx/en_us_dedes/miscellanea:misc.Mode3
ltx/en_us_dedes/oc.m3.d1:ocMA.OdeS3C11.ode	@ltx/en_us_dedes/miscellanea:misc.Ode3
ltx/en_us_dedes/oc.m3.d1:ocMA.OdeS3C11.text	The ungodly one was put to shame by Your Cross. * He opened up a pit, and he fell into the hole he made. * And exalted was the horn * of the humble, O Christ, by Your resurrection.
ltx/en_us_dedes/oc.m3.d1:ocMA.OdeS3C12.incipit	The proclamation of knowledge…
ltx/en_us_dedes/oc.m3.d1:ocMA.OdeS3C12.melody	@ltx/en_us_dedes/he.h.m3:heHE.OEkMiOnton.name
ltx/en_us_dedes/oc.m3.d1:ocMA.OdeS3C12.mode	@ltx/en_us_dedes/miscellanea:misc.Mode3
ltx/en_us_dedes/oc.m3.d1:ocMA.OdeS3C12.ode	@ltx/en_us_dedes/miscellanea:misc.Ode3
ltx/en_us_dedes/oc.m3.d1:ocMA.OdeS3C12.text	The proclamation of knowledge and faith in God * has covered the whole wide world, * as much water covers the seas. * Risen, You revealed the light * of the Trinity, O benevolent Savior.
ltx/en_us_dedes/oc.m3.d1:ocMA.OdeS3C1H.greekmelody	@ltx/en_us_dedes/he.h.m3:heHE.OEkMiOnton.greekname
ltx/en_us_dedes/oc.m3.d1:ocMA.OdeS3C1H.incipit	@ltx/en_us_dedes/he.h.m3:heHE.OEkMiOnton.incipit
ltx/en_us_dedes/oc.m3.d1:ocMA.OdeS3C1H.melody	@ltx/en_us_dedes/he.h.m3:heHE.OEkMiOnton.melody
ltx/en_us_dedes/oc.m3.d1:ocMA.OdeS3C1H.mode	@ltx/en_us_dedes/miscellanea:misc.Mode3
ltx/en_us_dedes/oc.m3.d1:ocMA.OdeS3C1H.ode	@ltx/en_us_dedes/miscellanea:misc.Ode3
ltx/en_us_dedes/oc.m3.d1:ocMA.OdeS3C1H.text	@ltx/en_us_dedes/he.h.m3:heHE.OEkMiOnton.text
ltx/en_us_dedes/oc.m3.d1:ocMA.OdeS3C1T.incipit	Glorious things have been spoken…
ltx/en_us_dedes/oc.m3.d1:ocMA.OdeS3C1T.melody	@ltx/en_us_dedes/he.h.m3:heHE.OEkMiOnton.name
ltx/en_us_dedes/oc.m3.d1:ocMA.OdeS3C1T.mode	@ltx/en_us_dedes/miscellanea:misc.Mode3
ltx/en_us_dedes/oc.m3.d1:ocMA.OdeS3C1T.ode	@ltx/en_us_dedes/miscellanea:misc.Ode3
ltx/en_us_dedes/oc.m3.d1:ocMA.OdeS3C1T.text	Glorious things have been spoken concerning you, * O Lady, the animate city of Him who forever reigns; * for it was through you that God * was seen upon the earth and lived among men.
ltx/en_us_dedes/oc.m3.d1:ocMA.OdeS3C21.greekmelody	@ltx/en_us_dedes/he.h.m3:heHE.ToxonEthrafsasEchthron.greekname
ltx/en_us_dedes/oc.m3.d1:ocMA.OdeS3C21.incipit	…
ltx/en_us_dedes/oc.m3.d1:ocMA.OdeS3C21.melody	@ltx/en_us_dedes/he.h.m3:heHE.ToxonEthrafsasEchthron.name
ltx/en_us_dedes/oc.m3.d1:ocMA.OdeS3C21.mode	@ltx/en_us_dedes/miscellanea:misc.Mode3
ltx/en_us_dedes/oc.m3.d1:ocMA.OdeS3C21.ode	@ltx/en_us_dedes/miscellanea:misc.Ode3
ltx/en_us_dedes/oc.m3.d1:ocMA.OdeS3C21.text	
ltx/en_us_dedes/oc.m3.d1:ocMA.OdeS3C22.incipit	…
ltx/en_us_dedes/oc.m3.d1:ocMA.OdeS3C22.melody	@ltx/en_us_dedes/he.h.m3:heHE.ToxonEthrafsasEchthron.name
ltx/en_us_dedes/oc.m3.d1:ocMA.OdeS3C22.mode	@ltx/en_us_dedes/miscellanea:misc.Mode3
ltx/en_us_dedes/oc.m3.d1:ocMA.OdeS3C22.ode	@ltx/en_us_dedes/miscellanea:misc.Ode3
ltx/en_us_dedes/oc.m3.d1:ocMA.OdeS3C22.text	
ltx/en_us_dedes/oc.m3.d1:ocMA.OdeS3C31.greekmelody	@ltx/en_us_dedes/he.h.m3:heHE.ToxonEthrafsasEchthron.greekname
ltx/en_us_dedes/oc.m3.d1:ocMA.OdeS3C31.incipit	…
ltx/en_us_dedes/oc.m3.d1:ocMA.OdeS3C31.melody	@ltx/en_us_dedes/he.h.m3:heHE.ToxonEthrafsasEchthron.name
ltx/en_us_dedes/oc.m3.d1:ocMA.OdeS3C31.mode	@ltx/en_us_dedes/miscellanea:misc.Mode3
ltx/en_us_dedes/oc.m3.d1:ocMA.OdeS3C31.ode	@ltx/en_us_dedes/miscellanea:misc.Ode3
ltx/en_us_dedes/oc.m3.d1:ocMA.OdeS3C31.text	
ltx/en_us_dedes/oc.m3.d1:ocMA.OdeS3C32.incipit	…
ltx/en_us_dedes/oc.m3.d1:ocMA.OdeS3C32.melody	@ltx/en_us_dedes/he.h.m3:heHE.ToxonEthrafsasEchthron.name
ltx/en_us_dedes/oc.m3.d1:ocMA.OdeS3C32.mode	@ltx/en_us_dedes/miscellanea:misc.Mode3
ltx/en_us_dedes/oc.m3.d1:ocMA.OdeS3C32.ode	@ltx/en_us_dedes/miscellanea:misc.Ode3
ltx/en_us_dedes/oc.m3.d1:ocMA.OdeS3C32.text	
ltx/en_us_dedes/oc.m3.d1:ocMA.OdeS4C11.incipit	Suffering for us…
ltx/en_us_dedes/oc.m3.d1:ocMA.OdeS4C11.melody	@ltx/en_us_dedes/he.h.m3:heHE.EthouProsImas.name
ltx/en_us_dedes/oc.m3.d1:ocMA.OdeS4C11.mode	@ltx/en_us_dedes/miscellanea:misc.Mode3
ltx/en_us_dedes/oc.m3.d1:ocMA.OdeS4C11.ode	@ltx/en_us_dedes/miscellanea:misc.Ode4
ltx/en_us_dedes/oc.m3.d1:ocMA.OdeS4C11.text	Suffering for us, You endured shameful treatment patiently. * You were struck and spit upon, O Christ. * You bore marks and bruises sympathetically. * By accepting it all, You worked my salvation. * Glory to Your strength, O Lord!
ltx/en_us_dedes/oc.m3.d1:ocMA.OdeS4C12.incipit	You made war on death…
ltx/en_us_dedes/oc.m3.d1:ocMA.OdeS4C12.melody	@ltx/en_us_dedes/he.h.m3:heHE.EthouProsImas.name
ltx/en_us_dedes/oc.m3.d1:ocMA.OdeS4C12.mode	@ltx/en_us_dedes/miscellanea:misc.Mode3
ltx/en_us_dedes/oc.m3.d1:ocMA.OdeS4C12.ode	@ltx/en_us_dedes/miscellanea:misc.Ode4
ltx/en_us_dedes/oc.m3.d1:ocMA.OdeS4C12.text	You made war on death with Your mortal body, O Life itself, * because of the groaning of the poor * and of the suffering of the needy, O Christ. * You ruined him who ruined us and raised all people * with yourself, O Lord only humane and glorified.
ltx/en_us_dedes/oc.m3.d1:ocMA.OdeS4C1H.greekmelody	@ltx/en_us_dedes/he.h.m3:heHE.EthouProsImas.greekname
ltx/en_us_dedes/oc.m3.d1:ocMA.OdeS4C1H.incipit	@ltx/en_us_dedes/he.h.m3:heHE.EthouProsImas.incipit
ltx/en_us_dedes/oc.m3.d1:ocMA.OdeS4C1H.melody	@ltx/en_us_dedes/he.h.m3:heHE.EthouProsImas.melody
ltx/en_us_dedes/oc.m3.d1:ocMA.OdeS4C1H.mode	@ltx/en_us_dedes/miscellanea:misc.Mode3
ltx/en_us_dedes/oc.m3.d1:ocMA.OdeS4C1H.ode	@ltx/en_us_dedes/miscellanea:misc.Ode4
ltx/en_us_dedes/oc.m3.d1:ocMA.OdeS4C1H.text	@ltx/en_us_dedes/he.h.m3:heHE.EthouProsImas.text
ltx/en_us_dedes/oc.m3.d1:ocMA.OdeS4C1T.incipit	Remember Your flock…
ltx/en_us_dedes/oc.m3.d1:ocMA.OdeS4C1T.melody	@ltx/en_us_dedes/he.h.m3:heHE.EthouProsImas.name
ltx/en_us_dedes/oc.m3.d1:ocMA.OdeS4C1T.mode	@ltx/en_us_dedes/miscellanea:misc.Mode3
ltx/en_us_dedes/oc.m3.d1:ocMA.OdeS4C1T.ode	@ltx/en_us_dedes/miscellanea:misc.Ode4
ltx/en_us_dedes/oc.m3.d1:ocMA.OdeS4C1T.text	Remember Your flock that You acquired by Your Passion, O Christ. * Listen to the sympathetic prayers * of Your glorified Mother on our behalf. * Visit it, and whenever it is afflicted * save it, by Your strength, O Lord.
ltx/en_us_dedes/oc.m3.d1:ocMA.OdeS4C21.greekmelody	@ltx/en_us_dedes/he.h.m3:heHE.ToXenonKaiAporriton.greekname
ltx/en_us_dedes/oc.m3.d1:ocMA.OdeS4C21.incipit	…
ltx/en_us_dedes/oc.m3.d1:ocMA.OdeS4C21.melody	@ltx/en_us_dedes/he.h.m3:heHE.ToXenonKaiAporriton.name
ltx/en_us_dedes/oc.m3.d1:ocMA.OdeS4C21.mode	@ltx/en_us_dedes/miscellanea:misc.Mode3
ltx/en_us_dedes/oc.m3.d1:ocMA.OdeS4C21.ode	@ltx/en_us_dedes/miscellanea:misc.Ode4
ltx/en_us_dedes/oc.m3.d1:ocMA.OdeS4C21.text	
ltx/en_us_dedes/oc.m3.d1:ocMA.OdeS4C22.incipit	…
ltx/en_us_dedes/oc.m3.d1:ocMA.OdeS4C22.melody	@ltx/en_us_dedes/he.h.m3:heHE.ToXenonKaiAporriton.name
ltx/en_us_dedes/oc.m3.d1:ocMA.OdeS4C22.mode	@ltx/en_us_dedes/miscellanea:misc.Mode3
ltx/en_us_dedes/oc.m3.d1:ocMA.OdeS4C22.ode	@ltx/en_us_dedes/miscellanea:misc.Ode4
ltx/en_us_dedes/oc.m3.d1:ocMA.OdeS4C22.text	
ltx/en_us_dedes/oc.m3.d1:ocMA.OdeS4C31.greekmelody	@ltx/en_us_dedes/he.h.m3:heHE.ToXenonKaiAporriton.greekname
ltx/en_us_dedes/oc.m3.d1:ocMA.OdeS4C31.incipit	…
ltx/en_us_dedes/oc.m3.d1:ocMA.OdeS4C31.melody	@ltx/en_us_dedes/he.h.m3:heHE.ToXenonKaiAporriton.name
ltx/en_us_dedes/oc.m3.d1:ocMA.OdeS4C31.mode	@ltx/en_us_dedes/miscellanea:misc.Mode3
ltx/en_us_dedes/oc.m3.d1:ocMA.OdeS4C31.ode	@ltx/en_us_dedes/miscellanea:misc.Ode4
ltx/en_us_dedes/oc.m3.d1:ocMA.OdeS4C31.text	
ltx/en_us_dedes/oc.m3.d1:ocMA.OdeS4C32.incipit	…
ltx/en_us_dedes/oc.m3.d1:ocMA.OdeS4C32.melody	@ltx/en_us_dedes/he.h.m3:heHE.ToXenonKaiAporriton.name
ltx/en_us_dedes/oc.m3.d1:ocMA.OdeS4C32.mode	@ltx/en_us_dedes/miscellanea:misc.Mode3
ltx/en_us_dedes/oc.m3.d1:ocMA.OdeS4C32.ode	@ltx/en_us_dedes/miscellanea:misc.Ode4
ltx/en_us_dedes/oc.m3.d1:ocMA.OdeS4C32.text	
ltx/en_us_dedes/oc.m3.d1:ocMA.OdeS4C33.incipit	…
ltx/en_us_dedes/oc.m3.d1:ocMA.OdeS4C33.melody	@ltx/en_us_dedes/he.h.m3:heHE.ToXenonKaiAporriton.name
ltx/en_us_dedes/oc.m3.d1:ocMA.OdeS4C33.mode	@ltx/en_us_dedes/miscellanea:misc.Mode3
ltx/en_us_dedes/oc.m3.d1:ocMA.OdeS4C33.ode	@ltx/en_us_dedes/miscellanea:misc.Ode4
ltx/en_us_dedes/oc.m3.d1:ocMA.OdeS4C33.text	
ltx/en_us_dedes/oc.m3.d1:ocMA.OdeS5C11.incipit	To an unjust judge…
ltx/en_us_dedes/oc.m3.d1:ocMA.OdeS5C11.melody	@ltx/en_us_dedes/he.h.m3:heHE.ProsSeOrthrizo.name
ltx/en_us_dedes/oc.m3.d1:ocMA.OdeS5C11.mode	@ltx/en_us_dedes/miscellanea:misc.Mode3
ltx/en_us_dedes/oc.m3.d1:ocMA.OdeS5C11.ode	@ltx/en_us_dedes/miscellanea:misc.Ode5
ltx/en_us_dedes/oc.m3.d1:ocMA.OdeS5C11.text	To an unjust judge, envious leaders of the Jews * delivered You, the all-seeing God who judges * all earth righteously. And You delivered * Adam who was condemned of old.
ltx/en_us_dedes/oc.m3.d1:ocMA.OdeS5C12.incipit	By the invincible power…
ltx/en_us_dedes/oc.m3.d1:ocMA.OdeS5C12.melody	@ltx/en_us_dedes/he.h.m3:heHE.ProsSeOrthrizo.name
ltx/en_us_dedes/oc.m3.d1:ocMA.OdeS5C12.mode	@ltx/en_us_dedes/miscellanea:misc.Mode3
ltx/en_us_dedes/oc.m3.d1:ocMA.OdeS5C12.ode	@ltx/en_us_dedes/miscellanea:misc.Ode5
ltx/en_us_dedes/oc.m3.d1:ocMA.OdeS5C12.text	By the invincible power of Your Cross, O Christ, * who on the third day rose from the dead, O Savior, * grant Your peace to Your Church, we entreat You, * O Lord our God, and save our souls.
ltx/en_us_dedes/oc.m3.d1:ocMA.OdeS5C1H.greekmelody	@ltx/en_us_dedes/he.h.m3:heHE.ProsSeOrthrizo.greekname
ltx/en_us_dedes/oc.m3.d1:ocMA.OdeS5C1H.incipit	@ltx/en_us_dedes/he.h.m3:heHE.ProsSeOrthrizo.incipit
ltx/en_us_dedes/oc.m3.d1:ocMA.OdeS5C1H.melody	@ltx/en_us_dedes/he.h.m3:heHE.ProsSeOrthrizo.melody
ltx/en_us_dedes/oc.m3.d1:ocMA.OdeS5C1H.mode	@ltx/en_us_dedes/miscellanea:misc.Mode3
ltx/en_us_dedes/oc.m3.d1:ocMA.OdeS5C1H.ode	@ltx/en_us_dedes/miscellanea:misc.Ode5
ltx/en_us_dedes/oc.m3.d1:ocMA.OdeS5C1H.text	@ltx/en_us_dedes/he.h.m3:heHE.ProsSeOrthrizo.text
ltx/en_us_dedes/oc.m3.d1:ocMA.OdeS5C1T.incipit	O Ever-Virgin, you became…
ltx/en_us_dedes/oc.m3.d1:ocMA.OdeS5C1T.melody	@ltx/en_us_dedes/he.h.m3:heHE.ProsSeOrthrizo.name
ltx/en_us_dedes/oc.m3.d1:ocMA.OdeS5C1T.mode	@ltx/en_us_dedes/miscellanea:misc.Mode3
ltx/en_us_dedes/oc.m3.d1:ocMA.OdeS5C1T.ode	@ltx/en_us_dedes/miscellanea:misc.Ode5
ltx/en_us_dedes/oc.m3.d1:ocMA.OdeS5C1T.text	O Ever-Virgin, you became like the holy Tent * and wider than the heavens, for you accepted * within your womb the Logos of God, * whom all creation cannot contain.
ltx/en_us_dedes/oc.m3.d1:ocMA.OdeS5C21.greekmelody	@ltx/en_us_dedes/he.h.m3:heHE.EpiTisGis.greekname
ltx/en_us_dedes/oc.m3.d1:ocMA.OdeS5C21.incipit	…
ltx/en_us_dedes/oc.m3.d1:ocMA.OdeS5C21.melody	@ltx/en_us_dedes/he.h.m3:heHE.EpiTisGis.name
ltx/en_us_dedes/oc.m3.d1:ocMA.OdeS5C21.mode	@ltx/en_us_dedes/miscellanea:misc.Mode3
ltx/en_us_dedes/oc.m3.d1:ocMA.OdeS5C21.ode	@ltx/en_us_dedes/miscellanea:misc.Ode5
ltx/en_us_dedes/oc.m3.d1:ocMA.OdeS5C21.text	
ltx/en_us_dedes/oc.m3.d1:ocMA.OdeS5C22.incipit	…
ltx/en_us_dedes/oc.m3.d1:ocMA.OdeS5C22.melody	@ltx/en_us_dedes/he.h.m3:heHE.EpiTisGis.name
ltx/en_us_dedes/oc.m3.d1:ocMA.OdeS5C22.mode	@ltx/en_us_dedes/miscellanea:misc.Mode3
ltx/en_us_dedes/oc.m3.d1:ocMA.OdeS5C22.ode	@ltx/en_us_dedes/miscellanea:misc.Ode5
ltx/en_us_dedes/oc.m3.d1:ocMA.OdeS5C22.text	
ltx/en_us_dedes/oc.m3.d1:ocMA.OdeS5C31.greekmelody	@ltx/en_us_dedes/he.h.m3:heHE.EpiTisGis.greekname
ltx/en_us_dedes/oc.m3.d1:ocMA.OdeS5C31.incipit	…
ltx/en_us_dedes/oc.m3.d1:ocMA.OdeS5C31.melody	@ltx/en_us_dedes/he.h.m3:heHE.EpiTisGis.name
ltx/en_us_dedes/oc.m3.d1:ocMA.OdeS5C31.mode	@ltx/en_us_dedes/miscellanea:misc.Mode3
ltx/en_us_dedes/oc.m3.d1:ocMA.OdeS5C31.ode	@ltx/en_us_dedes/miscellanea:misc.Ode5
ltx/en_us_dedes/oc.m3.d1:ocMA.OdeS5C31.text	
ltx/en_us_dedes/oc.m3.d1:ocMA.OdeS5C32.incipit	…
ltx/en_us_dedes/oc.m3.d1:ocMA.OdeS5C32.melody	@ltx/en_us_dedes/he.h.m3:heHE.EpiTisGis.name
ltx/en_us_dedes/oc.m3.d1:ocMA.OdeS5C32.mode	@ltx/en_us_dedes/miscellanea:misc.Mode3
ltx/en_us_dedes/oc.m3.d1:ocMA.OdeS5C32.ode	@ltx/en_us_dedes/miscellanea:misc.Ode5
ltx/en_us_dedes/oc.m3.d1:ocMA.OdeS5C32.text	
ltx/en_us_dedes/oc.m3.d1:ocMA.OdeS6C11.incipit	Mercy and compassion…
ltx/en_us_dedes/oc.m3.d1:ocMA.OdeS6C11.melody	@ltx/en_us_dedes/he.h.m3:heHE.AvyssosEschati.name
ltx/en_us_dedes/oc.m3.d1:ocMA.OdeS6C11.mode	@ltx/en_us_dedes/miscellanea:misc.Mode3
ltx/en_us_dedes/oc.m3.d1:ocMA.OdeS6C11.ode	@ltx/en_us_dedes/miscellanea:misc.Ode6
ltx/en_us_dedes/oc.m3.d1:ocMA.OdeS6C11.text	Mercy and compassion encircle me now like a sea, * for in Your love You came down to me. * You became incarnate, Master, and took on the form of a slave, * and You deified and, with yourself, You glorified me.
ltx/en_us_dedes/oc.m3.d1:ocMA.OdeS6C12.incipit	When he saw the One…
ltx/en_us_dedes/oc.m3.d1:ocMA.OdeS6C12.melody	@ltx/en_us_dedes/he.h.m3:heHE.AvyssosEschati.name
ltx/en_us_dedes/oc.m3.d1:ocMA.OdeS6C12.mode	@ltx/en_us_dedes/miscellanea:misc.Mode3
ltx/en_us_dedes/oc.m3.d1:ocMA.OdeS6C12.ode	@ltx/en_us_dedes/miscellanea:misc.Ode6
ltx/en_us_dedes/oc.m3.d1:ocMA.OdeS6C12.text	When he saw the One who was put to death come back to life, * he who wielded death was put to death. * These are the tokens of Your resurrection, O Christ our God, * and the prizes of Your all-immaculate Passion.
ltx/en_us_dedes/oc.m3.d1:ocMA.OdeS6C1H.greekmelody	@ltx/en_us_dedes/he.h.m3:heHE.AvyssosEschati.greekname
ltx/en_us_dedes/oc.m3.d1:ocMA.OdeS6C1H.incipit	@ltx/en_us_dedes/he.h.m3:heHE.AvyssosEschati.incipit
ltx/en_us_dedes/oc.m3.d1:ocMA.OdeS6C1H.melody	@ltx/en_us_dedes/he.h.m3:heHE.AvyssosEschati.melody
ltx/en_us_dedes/oc.m3.d1:ocMA.OdeS6C1H.mode	@ltx/en_us_dedes/miscellanea:misc.Mode3
ltx/en_us_dedes/oc.m3.d1:ocMA.OdeS6C1H.ode	@ltx/en_us_dedes/miscellanea:misc.Ode6
ltx/en_us_dedes/oc.m3.d1:ocMA.OdeS6C1H.text	@ltx/en_us_dedes/he.h.m3:heHE.AvyssosEschati.text
ltx/en_us_dedes/oc.m3.d1:ocMA.OdeS6C1T.incipit	You incomprehensibly intercede…
ltx/en_us_dedes/oc.m3.d1:ocMA.OdeS6C1T.melody	@ltx/en_us_dedes/he.h.m3:heHE.AvyssosEschati.name
ltx/en_us_dedes/oc.m3.d1:ocMA.OdeS6C1T.mode	@ltx/en_us_dedes/miscellanea:misc.Mode3
ltx/en_us_dedes/oc.m3.d1:ocMA.OdeS6C1T.ode	@ltx/en_us_dedes/miscellanea:misc.Ode6
ltx/en_us_dedes/oc.m3.d1:ocMA.OdeS6C1T.text	You incomprehensibly intercede with the Creator * on behalf of humanity. * Only all-pure Virgin, pray your Son, that He be merciful * and the champion of your servants who are sinners.
ltx/en_us_dedes/oc.m3.d1:ocMA.OdeS6C21.greekmelody	@ltx/en_us_dedes/he.h.m3:heHE.SkinoseosIonas.greekname
ltx/en_us_dedes/oc.m3.d1:ocMA.OdeS6C21.incipit	…
ltx/en_us_dedes/oc.m3.d1:ocMA.OdeS6C21.melody	@ltx/en_us_dedes/he.h.m3:heHE.SkinoseosIonas.name
ltx/en_us_dedes/oc.m3.d1:ocMA.OdeS6C21.mode	@ltx/en_us_dedes/miscellanea:misc.Mode3
ltx/en_us_dedes/oc.m3.d1:ocMA.OdeS6C21.ode	@ltx/en_us_dedes/miscellanea:misc.Ode6
ltx/en_us_dedes/oc.m3.d1:ocMA.OdeS6C21.text	
ltx/en_us_dedes/oc.m3.d1:ocMA.OdeS6C22.incipit	…
ltx/en_us_dedes/oc.m3.d1:ocMA.OdeS6C22.melody	@ltx/en_us_dedes/he.h.m3:heHE.SkinoseosIonas.name
ltx/en_us_dedes/oc.m3.d1:ocMA.OdeS6C22.mode	@ltx/en_us_dedes/miscellanea:misc.Mode3
ltx/en_us_dedes/oc.m3.d1:ocMA.OdeS6C22.ode	@ltx/en_us_dedes/miscellanea:misc.Ode6
ltx/en_us_dedes/oc.m3.d1:ocMA.OdeS6C22.text	
ltx/en_us_dedes/oc.m3.d1:ocMA.OdeS6C31.greekmelody	@ltx/en_us_dedes/he.h.m3:heHE.SkinoseosIonas.greekname
ltx/en_us_dedes/oc.m3.d1:ocMA.OdeS6C31.incipit	…
ltx/en_us_dedes/oc.m3.d1:ocMA.OdeS6C31.melody	@ltx/en_us_dedes/he.h.m3:heHE.SkinoseosIonas.name
ltx/en_us_dedes/oc.m3.d1:ocMA.OdeS6C31.mode	@ltx/en_us_dedes/miscellanea:misc.Mode3
ltx/en_us_dedes/oc.m3.d1:ocMA.OdeS6C31.ode	@ltx/en_us_dedes/miscellanea:misc.Ode6
ltx/en_us_dedes/oc.m3.d1:ocMA.OdeS6C31.text	
ltx/en_us_dedes/oc.m3.d1:ocMA.OdeS6C32.incipit	…
ltx/en_us_dedes/oc.m3.d1:ocMA.OdeS6C32.melody	@ltx/en_us_dedes/he.h.m3:heHE.SkinoseosIonas.name
ltx/en_us_dedes/oc.m3.d1:ocMA.OdeS6C32.mode	@ltx/en_us_dedes/miscellanea:misc.Mode3
ltx/en_us_dedes/oc.m3.d1:ocMA.OdeS6C32.ode	@ltx/en_us_dedes/miscellanea:misc.Ode6
ltx/en_us_dedes/oc.m3.d1:ocMA.OdeS6C32.text	
ltx/en_us_dedes/oc.m3.d1:ocMA.OdeS7C11.incipit	The resplendent curtain…
ltx/en_us_dedes/oc.m3.d1:ocMA.OdeS7C11.melody	@ltx/en_us_dedes/he.h.m3:heHE.OsPalaiTousEfseveis.name
ltx/en_us_dedes/oc.m3.d1:ocMA.OdeS7C11.mode	@ltx/en_us_dedes/miscellanea:misc.Mode3
ltx/en_us_dedes/oc.m3.d1:ocMA.OdeS7C11.ode	@ltx/en_us_dedes/miscellanea:misc.Ode7
ltx/en_us_dedes/oc.m3.d1:ocMA.OdeS7C11.text	The resplendent curtain of the Temple was torn in two, * when the Creator was on the Cross, * revealing to the faithful the truth that was hidden in the letter of the Law. * Now they cry out and sing to Him: * “Blessed are You, O God of our fathers.”
ltx/en_us_dedes/oc.m3.d1:ocMA.OdeS7C12.incipit	O Christ, when Your holy side…
ltx/en_us_dedes/oc.m3.d1:ocMA.OdeS7C12.melody	@ltx/en_us_dedes/he.h.m3:heHE.OsPalaiTousEfseveis.name
ltx/en_us_dedes/oc.m3.d1:ocMA.OdeS7C12.mode	@ltx/en_us_dedes/miscellanea:misc.Mode3
ltx/en_us_dedes/oc.m3.d1:ocMA.OdeS7C12.ode	@ltx/en_us_dedes/miscellanea:misc.Ode7
ltx/en_us_dedes/oc.m3.d1:ocMA.OdeS7C12.text	O Christ, when Your holy side was pierced, providentially * from Your divine body there were drops * of life-giving blood that were spilled upon the earth * and remade those born on earth. * We all cry out and sing to You: * “Blessed are You, O God of our fathers.”
ltx/en_us_dedes/oc.m3.d1:ocMA.OdeS7C1H.greekmelody	@ltx/en_us_dedes/he.h.m3:heHE.OsPalaiTousEfseveis.greekname
ltx/en_us_dedes/oc.m3.d1:ocMA.OdeS7C1H.incipit	@ltx/en_us_dedes/he.h.m3:heHE.OsPalaiTousEfseveis.incipit
ltx/en_us_dedes/oc.m3.d1:ocMA.OdeS7C1H.melody	@ltx/en_us_dedes/he.h.m3:heHE.OsPalaiTousEfseveis.melody
ltx/en_us_dedes/oc.m3.d1:ocMA.OdeS7C1H.mode	@ltx/en_us_dedes/miscellanea:misc.Mode3
ltx/en_us_dedes/oc.m3.d1:ocMA.OdeS7C1H.ode	@ltx/en_us_dedes/miscellanea:misc.Ode7
ltx/en_us_dedes/oc.m3.d1:ocMA.OdeS7C1H.text	@ltx/en_us_dedes/he.h.m3:heHE.OsPalaiTousEfseveis.text
ltx/en_us_dedes/oc.m3.d1:ocMA.OdeS7C1Tr.incipit	O faithful, let us adore…
ltx/en_us_dedes/oc.m3.d1:ocMA.OdeS7C1Tr.melody	@ltx/en_us_dedes/he.h.m3:heHE.OsPalaiTousEfseveis.name
ltx/en_us_dedes/oc.m3.d1:ocMA.OdeS7C1Tr.mode	@ltx/en_us_dedes/miscellanea:misc.Mode3
ltx/en_us_dedes/oc.m3.d1:ocMA.OdeS7C1Tr.ode	@ltx/en_us_dedes/miscellanea:misc.Ode7
ltx/en_us_dedes/oc.m3.d1:ocMA.OdeS7C1Tr.text	O faithful, let us adore and worship one principal, * the single Godhead, the one in three, * glorifying Father, only-begotten Son, * and the good Holy Spirit, God, * as we cry out and sing aloud: * “Blessed are You, O God of our fathers.”
ltx/en_us_dedes/oc.m3.d1:ocMA.OdeS7C21.greekmelody	@ltx/en_us_dedes/he.h.m3:heHE.SovarosOTyrannos.greekname
ltx/en_us_dedes/oc.m3.d1:ocMA.OdeS7C21.incipit	…
ltx/en_us_dedes/oc.m3.d1:ocMA.OdeS7C21.melody	@ltx/en_us_dedes/he.h.m3:heHE.SovarosOTyrannos.name
ltx/en_us_dedes/oc.m3.d1:ocMA.OdeS7C21.mode	@ltx/en_us_dedes/miscellanea:misc.Mode3
ltx/en_us_dedes/oc.m3.d1:ocMA.OdeS7C21.ode	@ltx/en_us_dedes/miscellanea:misc.Ode7
ltx/en_us_dedes/oc.m3.d1:ocMA.OdeS7C21.text	
ltx/en_us_dedes/oc.m3.d1:ocMA.OdeS7C22.incipit	…
ltx/en_us_dedes/oc.m3.d1:ocMA.OdeS7C22.melody	@ltx/en_us_dedes/he.h.m3:heHE.SovarosOTyrannos.name
ltx/en_us_dedes/oc.m3.d1:ocMA.OdeS7C22.mode	@ltx/en_us_dedes/miscellanea:misc.Mode3
ltx/en_us_dedes/oc.m3.d1:ocMA.OdeS7C22.ode	@ltx/en_us_dedes/miscellanea:misc.Ode7
ltx/en_us_dedes/oc.m3.d1:ocMA.OdeS7C22.text	
ltx/en_us_dedes/oc.m3.d1:ocMA.OdeS7C2T.incipit	…
ltx/en_us_dedes/oc.m3.d1:ocMA.OdeS7C2T.melody	@ltx/en_us_dedes/he.h.m3:heHE.SovarosOTyrannos.name
ltx/en_us_dedes/oc.m3.d1:ocMA.OdeS7C2T.mode	@ltx/en_us_dedes/miscellanea:misc.Mode3
ltx/en_us_dedes/oc.m3.d1:ocMA.OdeS7C2T.ode	@ltx/en_us_dedes/miscellanea:misc.Ode7
ltx/en_us_dedes/oc.m3.d1:ocMA.OdeS7C2T.text	
ltx/en_us_dedes/oc.m3.d1:ocMA.OdeS7C31.greekmelody	@ltx/en_us_dedes/he.h.m3:heHE.SovarosOTyrannos.greekname
ltx/en_us_dedes/oc.m3.d1:ocMA.OdeS7C31.incipit	…
ltx/en_us_dedes/oc.m3.d1:ocMA.OdeS7C31.melody	@ltx/en_us_dedes/he.h.m3:heHE.SovarosOTyrannos.name
ltx/en_us_dedes/oc.m3.d1:ocMA.OdeS7C31.mode	@ltx/en_us_dedes/miscellanea:misc.Mode3
ltx/en_us_dedes/oc.m3.d1:ocMA.OdeS7C31.ode	@ltx/en_us_dedes/miscellanea:misc.Ode7
ltx/en_us_dedes/oc.m3.d1:ocMA.OdeS7C31.text	
ltx/en_us_dedes/oc.m3.d1:ocMA.OdeS7C32.incipit	…
ltx/en_us_dedes/oc.m3.d1:ocMA.OdeS7C32.melody	@ltx/en_us_dedes/he.h.m3:heHE.SovarosOTyrannos.name
ltx/en_us_dedes/oc.m3.d1:ocMA.OdeS7C32.mode	@ltx/en_us_dedes/miscellanea:misc.Mode3
ltx/en_us_dedes/oc.m3.d1:ocMA.OdeS7C32.ode	@ltx/en_us_dedes/miscellanea:misc.Ode7
ltx/en_us_dedes/oc.m3.d1:ocMA.OdeS7C32.text	
ltx/en_us_dedes/oc.m3.d1:ocMA.OdeS7C33.incipit	…
ltx/en_us_dedes/oc.m3.d1:ocMA.OdeS7C33.melody	@ltx/en_us_dedes/he.h.m3:heHE.SovarosOTyrannos.name
ltx/en_us_dedes/oc.m3.d1:ocMA.OdeS7C33.mode	@ltx/en_us_dedes/miscellanea:misc.Mode3
ltx/en_us_dedes/oc.m3.d1:ocMA.OdeS7C33.ode	@ltx/en_us_dedes/miscellanea:misc.Ode7
ltx/en_us_dedes/oc.m3.d1:ocMA.OdeS7C33.text	
ltx/en_us_dedes/oc.m3.d1:ocMA.OdeS8C11.incipit	The Temple’s resplendent veil…
ltx/en_us_dedes/oc.m3.d1:ocMA.OdeS8C11.melody	@ltx/en_us_dedes/he.h.m3:heHE.AstektoPyri.name
ltx/en_us_dedes/oc.m3.d1:ocMA.OdeS8C11.mode	@ltx/en_us_dedes/miscellanea:misc.Mode3
ltx/en_us_dedes/oc.m3.d1:ocMA.OdeS8C11.ode	@ltx/en_us_dedes/miscellanea:misc.Ode8
ltx/en_us_dedes/oc.m3.d1:ocMA.OdeS8C11.text	The Temple’s resplendent veil was torn down, * O Lord, when Your precious Cross on Calvary was set up. * And creation was also quaking, * and in fear it sang the hymn, * “All you works of the Lord, bless the Lord, * and exalt Him beyond measure unto all the ages.”
ltx/en_us_dedes/oc.m3.d1:ocMA.OdeS8C12.incipit	You rose from the tomb…
ltx/en_us_dedes/oc.m3.d1:ocMA.OdeS8C12.melody	@ltx/en_us_dedes/he.h.m3:heHE.AstektoPyri.name
ltx/en_us_dedes/oc.m3.d1:ocMA.OdeS8C12.mode	@ltx/en_us_dedes/miscellanea:misc.Mode3
ltx/en_us_dedes/oc.m3.d1:ocMA.OdeS8C12.ode	@ltx/en_us_dedes/miscellanea:misc.Ode8
ltx/en_us_dedes/oc.m3.d1:ocMA.OdeS8C12.text	You rose from the tomb, O Messiah, * and by divine power You raised Adam who had fallen * through a tree of old by deception. * He cried out and sang the hymn, * “All you works of the Lord, bless the Lord, * and exalt Him beyond measure unto all the ages.”
ltx/en_us_dedes/oc.m3.d1:ocMA.OdeS8C1H.greekmelody	@ltx/en_us_dedes/he.h.m3:heHE.AstektoPyri.greekname
ltx/en_us_dedes/oc.m3.d1:ocMA.OdeS8C1H.incipit	@ltx/en_us_dedes/he.h.m3:heHE.AstektoPyri.incipit
ltx/en_us_dedes/oc.m3.d1:ocMA.OdeS8C1H.melody	@ltx/en_us_dedes/he.h.m3:heHE.AstektoPyri.melody
ltx/en_us_dedes/oc.m3.d1:ocMA.OdeS8C1H.mode	@ltx/en_us_dedes/miscellanea:misc.Mode3
ltx/en_us_dedes/oc.m3.d1:ocMA.OdeS8C1H.ode	@ltx/en_us_dedes/miscellanea:misc.Ode8
ltx/en_us_dedes/oc.m3.d1:ocMA.OdeS8C1H.text	@ltx/en_us_dedes/he.h.m3:heHE.AstektoPyri.text
ltx/en_us_dedes/oc.m3.d1:ocMA.OdeS8C1T.incipit	All-pure Theotokos…
ltx/en_us_dedes/oc.m3.d1:ocMA.OdeS8C1T.melody	@ltx/en_us_dedes/he.h.m3:heHE.AstektoPyri.name
ltx/en_us_dedes/oc.m3.d1:ocMA.OdeS8C1T.mode	@ltx/en_us_dedes/miscellanea:misc.Mode3
ltx/en_us_dedes/oc.m3.d1:ocMA.OdeS8C1T.ode	@ltx/en_us_dedes/miscellanea:misc.Ode8
ltx/en_us_dedes/oc.m3.d1:ocMA.OdeS8C1T.text	All-pure Theotokos, we call you * God’s animate Temple and His Ark, for you contained Him. * To our Creator you reconciled us mortals through your childbirth. * As is right we all sing hymns to you, * and exalt you beyond measure unto all the ages.
ltx/en_us_dedes/oc.m3.d1:ocMA.OdeS8C21.greekmelody	@ltx/en_us_dedes/he.h.m3:heHE.EnylouFlogaPyros.greekname
ltx/en_us_dedes/oc.m3.d1:ocMA.OdeS8C21.incipit	…
ltx/en_us_dedes/oc.m3.d1:ocMA.OdeS8C21.melody	@ltx/en_us_dedes/he.h.m3:heHE.EnylouFlogaPyros.name
ltx/en_us_dedes/oc.m3.d1:ocMA.OdeS8C21.mode	@ltx/en_us_dedes/miscellanea:misc.Mode3
ltx/en_us_dedes/oc.m3.d1:ocMA.OdeS8C21.ode	@ltx/en_us_dedes/miscellanea:misc.Ode8
ltx/en_us_dedes/oc.m3.d1:ocMA.OdeS8C21.text	
ltx/en_us_dedes/oc.m3.d1:ocMA.OdeS8C22.incipit	…
ltx/en_us_dedes/oc.m3.d1:ocMA.OdeS8C22.melody	@ltx/en_us_dedes/he.h.m3:heHE.EnylouFlogaPyros.name
ltx/en_us_dedes/oc.m3.d1:ocMA.OdeS8C22.mode	@ltx/en_us_dedes/miscellanea:misc.Mode3
ltx/en_us_dedes/oc.m3.d1:ocMA.OdeS8C22.ode	@ltx/en_us_dedes/miscellanea:misc.Ode8
ltx/en_us_dedes/oc.m3.d1:ocMA.OdeS8C22.text	
ltx/en_us_dedes/oc.m3.d1:ocMA.OdeS8C2Tr.incipit	…
ltx/en_us_dedes/oc.m3.d1:ocMA.OdeS8C2Tr.melody	@ltx/en_us_dedes/he.h.m3:heHE.EnylouFlogaPyros.name
ltx/en_us_dedes/oc.m3.d1:ocMA.OdeS8C2Tr.mode	@ltx/en_us_dedes/miscellanea:misc.Mode3
ltx/en_us_dedes/oc.m3.d1:ocMA.OdeS8C2Tr.ode	@ltx/en_us_dedes/miscellanea:misc.Ode8
ltx/en_us_dedes/oc.m3.d1:ocMA.OdeS8C2Tr.text	
ltx/en_us_dedes/oc.m3.d1:ocMA.OdeS8C31.greekmelody	@ltx/en_us_dedes/he.h.m3:heHE.EnylouFlogaPyros.greekname
ltx/en_us_dedes/oc.m3.d1:ocMA.OdeS8C31.incipit	…
ltx/en_us_dedes/oc.m3.d1:ocMA.OdeS8C31.melody	@ltx/en_us_dedes/he.h.m3:heHE.EnylouFlogaPyros.name
ltx/en_us_dedes/oc.m3.d1:ocMA.OdeS8C31.mode	@ltx/en_us_dedes/miscellanea:misc.Mode3
ltx/en_us_dedes/oc.m3.d1:ocMA.OdeS8C31.ode	@ltx/en_us_dedes/miscellanea:misc.Ode8
ltx/en_us_dedes/oc.m3.d1:ocMA.OdeS8C31.text	
ltx/en_us_dedes/oc.m3.d1:ocMA.OdeS8C32.incipit	…
ltx/en_us_dedes/oc.m3.d1:ocMA.OdeS8C32.melody	@ltx/en_us_dedes/he.h.m3:heHE.EnylouFlogaPyros.name
ltx/en_us_dedes/oc.m3.d1:ocMA.OdeS8C32.mode	@ltx/en_us_dedes/miscellanea:misc.Mode3
ltx/en_us_dedes/oc.m3.d1:ocMA.OdeS8C32.ode	@ltx/en_us_dedes/miscellanea:misc.Ode8
ltx/en_us_dedes/oc.m3.d1:ocMA.OdeS8C32.text	
ltx/en_us_dedes/oc.m3.d1:ocMA.OdeS9C11.incipit	It was an awful sight…
ltx/en_us_dedes/oc.m3.d1:ocMA.OdeS9C11.melody	@ltx/en_us_dedes/he.h.m3:heHE.KainonToThavma.name
ltx/en_us_dedes/oc.m3.d1:ocMA.OdeS9C11.mode	@ltx/en_us_dedes/miscellanea:misc.Mode3
ltx/en_us_dedes/oc.m3.d1:ocMA.OdeS9C11.ode	@ltx/en_us_dedes/miscellanea:misc.Ode9
ltx/en_us_dedes/oc.m3.d1:ocMA.OdeS9C11.text	It was an awful sight when You, the Maker, * were hanging on the Cross, O Logos of God, * in the body suffering, O God, for Your servants; * When You expired, You were laid in a sepulcher, * and You freed the dead who were in Hades. * We magnify You, for You, O Savior Christ, are omnipotent.
ltx/en_us_dedes/oc.m3.d1:ocMA.OdeS9C12.incipit	When You had died…
ltx/en_us_dedes/oc.m3.d1:ocMA.OdeS9C12.melody	@ltx/en_us_dedes/he.h.m3:heHE.KainonToThavma.name
ltx/en_us_dedes/oc.m3.d1:ocMA.OdeS9C12.mode	@ltx/en_us_dedes/miscellanea:misc.Mode3
ltx/en_us_dedes/oc.m3.d1:ocMA.OdeS9C12.ode	@ltx/en_us_dedes/miscellanea:misc.Ode9
ltx/en_us_dedes/oc.m3.d1:ocMA.OdeS9C12.text	When You had died and were buried, O Christ, * You saved our ancestors from death and corruption. * You made life to blossom forth, granting resurrection * to all the dead; and You led human nature to light * and clothed it with divine incorruption. * We magnify You, for You are the source of ever-living light.
ltx/en_us_dedes/oc.m3.d1:ocMA.OdeS9C1H.greekmelody	@ltx/en_us_dedes/he.h.m3:heHE.KainonToThavma.greekname
ltx/en_us_dedes/oc.m3.d1:ocMA.OdeS9C1H.incipit	@ltx/en_us_dedes/he.h.m3:heHE.KainonToThavma.incipit
ltx/en_us_dedes/oc.m3.d1:ocMA.OdeS9C1H.melody	@ltx/en_us_dedes/he.h.m3:heHE.KainonToThavma.melody
ltx/en_us_dedes/oc.m3.d1:ocMA.OdeS9C1H.mode	@ltx/en_us_dedes/miscellanea:misc.Mode3
ltx/en_us_dedes/oc.m3.d1:ocMA.OdeS9C1H.ode	@ltx/en_us_dedes/miscellanea:misc.Ode9
ltx/en_us_dedes/oc.m3.d1:ocMA.OdeS9C1H.text	@ltx/en_us_dedes/he.h.m3:heHE.KainonToThavma.text
ltx/en_us_dedes/oc.m3.d1:ocMA.OdeS9C1T.incipit	You are the throne…
ltx/en_us_dedes/oc.m3.d1:ocMA.OdeS9C1T.melody	@ltx/en_us_dedes/he.h.m3:heHE.KainonToThavma.name
ltx/en_us_dedes/oc.m3.d1:ocMA.OdeS9C1T.mode	@ltx/en_us_dedes/miscellanea:misc.Mode3
ltx/en_us_dedes/oc.m3.d1:ocMA.OdeS9C1T.ode	@ltx/en_us_dedes/miscellanea:misc.Ode9
ltx/en_us_dedes/oc.m3.d1:ocMA.OdeS9C1T.text	You are the throne and Temple of our God; * for the One who is on high had dwelt within you. * All-pure Virgin, He was born of you without human seed, and He kept you a virgin. * Therefore, noble Lady, by your never-ceasing prayers, * subordinate hostile foes and forces swiftly and completely to the government.
ltx/en_us_dedes/oc.m3.d1:ocMA.OdeS9C21.greekmelody	@ltx/en_us_dedes/he.h.m3:heHE.OiToGlykei.greekname
ltx/en_us_dedes/oc.m3.d1:ocMA.OdeS9C21.incipit	…
ltx/en_us_dedes/oc.m3.d1:ocMA.OdeS9C21.melody	@ltx/en_us_dedes/he.h.m3:heHE.OiToGlykei.name
ltx/en_us_dedes/oc.m3.d1:ocMA.OdeS9C21.mode	@ltx/en_us_dedes/miscellanea:misc.Mode3
ltx/en_us_dedes/oc.m3.d1:ocMA.OdeS9C21.ode	@ltx/en_us_dedes/miscellanea:misc.Ode9
ltx/en_us_dedes/oc.m3.d1:ocMA.OdeS9C21.text	
ltx/en_us_dedes/oc.m3.d1:ocMA.OdeS9C22.incipit	…
ltx/en_us_dedes/oc.m3.d1:ocMA.OdeS9C22.melody	@ltx/en_us_dedes/he.h.m3:heHE.OiToGlykei.name
ltx/en_us_dedes/oc.m3.d1:ocMA.OdeS9C22.mode	@ltx/en_us_dedes/miscellanea:misc.Mode3
ltx/en_us_dedes/oc.m3.d1:ocMA.OdeS9C22.ode	@ltx/en_us_dedes/miscellanea:misc.Ode9
ltx/en_us_dedes/oc.m3.d1:ocMA.OdeS9C22.text	
ltx/en_us_dedes/oc.m3.d1:ocMA.OdeS9C31.greekmelody	@ltx/en_us_dedes/he.h.m3:heHE.OiToGlykei.greekname
ltx/en_us_dedes/oc.m3.d1:ocMA.OdeS9C31.incipit	…
ltx/en_us_dedes/oc.m3.d1:ocMA.OdeS9C31.melody	@ltx/en_us_dedes/he.h.m3:heHE.OiToGlykei.name
ltx/en_us_dedes/oc.m3.d1:ocMA.OdeS9C31.mode	@ltx/en_us_dedes/miscellanea:misc.Mode3
ltx/en_us_dedes/oc.m3.d1:ocMA.OdeS9C31.ode	@ltx/en_us_dedes/miscellanea:misc.Ode9
ltx/en_us_dedes/oc.m3.d1:ocMA.OdeS9C31.text	
ltx/en_us_dedes/oc.m3.d1:ocMA.OdeS9C32.incipit	…
ltx/en_us_dedes/oc.m3.d1:ocMA.OdeS9C32.melody	@ltx/en_us_dedes/he.h.m3:heHE.OiToGlykei.name
ltx/en_us_dedes/oc.m3.d1:ocMA.OdeS9C32.mode	@ltx/en_us_dedes/miscellanea:misc.Mode3
ltx/en_us_dedes/oc.m3.d1:ocMA.OdeS9C32.ode	@ltx/en_us_dedes/miscellanea:misc.Ode9
ltx/en_us_dedes/oc.m3.d1:ocMA.OdeS9C32.text	
ltx/en_us_dedes/oc.m3.d1:ocMA.Oikos.incipit	Let heaven and earth dance…
ltx/en_us_dedes/oc.m3.d1:ocMA.Oikos.mode	@ltx/en_us_dedes/miscellanea:misc.Mode3
ltx/en_us_dedes/oc.m3.d1:ocMA.Oikos.text	Let heaven and earth dance for joy today, and in oneness of mind extol Christ God, for He resurrected the prisoners from their tombs. All creation rejoices together, offering worthy songs to the Creator of all and our Redeemer, for today as the Giver of Life, having drawn mortals up from Hades, He exalts them to heaven together, and lays a curse on the enemy’s haughtiness, and smashes the gates of Hades, by the divine power of His authority.
ltx/en_us_dedes/oc.m3.d1:ocMO.Kathisma11.greekmelody	@ltx/en_us_dedes/he.a.m3:heAU.TinOraiotita.greekname
ltx/en_us_dedes/oc.m3.d1:ocMO.Kathisma11.incipit	…
ltx/en_us_dedes/oc.m3.d1:ocMO.Kathisma11.melody	@ltx/en_us_dedes/he.a.m3:heAU.TinOraiotita.name
ltx/en_us_dedes/oc.m3.d1:ocMO.Kathisma11.mode	@ltx/en_us_dedes/miscellanea:misc.Mode3
ltx/en_us_dedes/oc.m3.d1:ocMO.Kathisma11.text	
ltx/en_us_dedes/oc.m3.d1:ocMO.Kathisma12.incipit	…
ltx/en_us_dedes/oc.m3.d1:ocMO.Kathisma12.melody	@ltx/en_us_dedes/he.a.m3:heAU.TinOraiotita.name
ltx/en_us_dedes/oc.m3.d1:ocMO.Kathisma12.mode	@ltx/en_us_dedes/miscellanea:misc.Mode3
ltx/en_us_dedes/oc.m3.d1:ocMO.Kathisma12.text	
ltx/en_us_dedes/oc.m3.d1:ocMO.Kathisma21.greekmelody	@ltx/en_us_dedes/he.a.m3:heAU.TheiasPisteos.greekname
ltx/en_us_dedes/oc.m3.d1:ocMO.Kathisma21.incipit	…
ltx/en_us_dedes/oc.m3.d1:ocMO.Kathisma21.melody	@ltx/en_us_dedes/he.a.m3:heAU.TheiasPisteos.name
ltx/en_us_dedes/oc.m3.d1:ocMO.Kathisma21.mode	@ltx/en_us_dedes/miscellanea:misc.Mode3
ltx/en_us_dedes/oc.m3.d1:ocMO.Kathisma21.text	
ltx/en_us_dedes/oc.m3.d1:ocMO.Kathisma22.incipit	…
ltx/en_us_dedes/oc.m3.d1:ocMO.Kathisma22.melody	@ltx/en_us_dedes/he.a.m3:heAU.TheiasPisteos.name
ltx/en_us_dedes/oc.m3.d1:ocMO.Kathisma22.mode	@ltx/en_us_dedes/miscellanea:misc.Mode3
ltx/en_us_dedes/oc.m3.d1:ocMO.Kathisma22.text	
ltx/en_us_dedes/oc.m3.d1:ocMO.Ode11.greekmelody	@ltx/en_us_dedes/he.h.m3:heHE.OTaYdata.greekname
ltx/en_us_dedes/oc.m3.d1:ocMO.Ode11.incipit	…
ltx/en_us_dedes/oc.m3.d1:ocMO.Ode11.melody	@ltx/en_us_dedes/he.h.m3:heHE.OTaYdata.name
ltx/en_us_dedes/oc.m3.d1:ocMO.Ode11.mode	@ltx/en_us_dedes/miscellanea:misc.Mode3
ltx/en_us_dedes/oc.m3.d1:ocMO.Ode11.ode	@ltx/en_us_dedes/miscellanea:misc.Ode1
ltx/en_us_dedes/oc.m3.d1:ocMO.Ode11.text	
ltx/en_us_dedes/oc.m3.d1:ocMO.Ode12.incipit	…
ltx/en_us_dedes/oc.m3.d1:ocMO.Ode12.melody	@ltx/en_us_dedes/he.h.m3:heHE.OTaYdata.name
ltx/en_us_dedes/oc.m3.d1:ocMO.Ode12.mode	@ltx/en_us_dedes/miscellanea:misc.Mode3
ltx/en_us_dedes/oc.m3.d1:ocMO.Ode12.ode	@ltx/en_us_dedes/miscellanea:misc.Ode1
ltx/en_us_dedes/oc.m3.d1:ocMO.Ode12.text	
ltx/en_us_dedes/oc.m3.d1:ocMO.Ode13.incipit	…
ltx/en_us_dedes/oc.m3.d1:ocMO.Ode13.melody	@ltx/en_us_dedes/he.h.m3:heHE.OTaYdata.name
ltx/en_us_dedes/oc.m3.d1:ocMO.Ode13.mode	@ltx/en_us_dedes/miscellanea:misc.Mode3
ltx/en_us_dedes/oc.m3.d1:ocMO.Ode13.ode	@ltx/en_us_dedes/miscellanea:misc.Ode1
ltx/en_us_dedes/oc.m3.d1:ocMO.Ode13.text	
ltx/en_us_dedes/oc.m3.d1:ocMO.Ode1T.incipit	…
ltx/en_us_dedes/oc.m3.d1:ocMO.Ode1T.melody	@ltx/en_us_dedes/he.h.m3:heHE.OTaYdata.name
ltx/en_us_dedes/oc.m3.d1:ocMO.Ode1T.mode	@ltx/en_us_dedes/miscellanea:misc.Mode3
ltx/en_us_dedes/oc.m3.d1:ocMO.Ode1T.ode	@ltx/en_us_dedes/miscellanea:misc.Ode1
ltx/en_us_dedes/oc.m3.d1:ocMO.Ode1T.text	
ltx/en_us_dedes/oc.m3.d1:ocMO.Ode31.greekmelody	@ltx/en_us_dedes/he.h.m3:heHE.OEkMiOnton.greekname
ltx/en_us_dedes/oc.m3.d1:ocMO.Ode31.incipit	…
ltx/en_us_dedes/oc.m3.d1:ocMO.Ode31.melody	@ltx/en_us_dedes/he.h.m3:heHE.OEkMiOnton.name
ltx/en_us_dedes/oc.m3.d1:ocMO.Ode31.mode	@ltx/en_us_dedes/miscellanea:misc.Mode3
ltx/en_us_dedes/oc.m3.d1:ocMO.Ode31.ode	@ltx/en_us_dedes/miscellanea:misc.Ode3
ltx/en_us_dedes/oc.m3.d1:ocMO.Ode31.text	
ltx/en_us_dedes/oc.m3.d1:ocMO.Ode32.incipit	…
ltx/en_us_dedes/oc.m3.d1:ocMO.Ode32.melody	@ltx/en_us_dedes/he.h.m3:heHE.OEkMiOnton.name
ltx/en_us_dedes/oc.m3.d1:ocMO.Ode32.mode	@ltx/en_us_dedes/miscellanea:misc.Mode3
ltx/en_us_dedes/oc.m3.d1:ocMO.Ode32.ode	@ltx/en_us_dedes/miscellanea:misc.Ode3
ltx/en_us_dedes/oc.m3.d1:ocMO.Ode32.text	
ltx/en_us_dedes/oc.m3.d1:ocMO.Ode33.incipit	…
ltx/en_us_dedes/oc.m3.d1:ocMO.Ode33.melody	@ltx/en_us_dedes/he.h.m3:heHE.OEkMiOnton.name
ltx/en_us_dedes/oc.m3.d1:ocMO.Ode33.mode	@ltx/en_us_dedes/miscellanea:misc.Mode3
ltx/en_us_dedes/oc.m3.d1:ocMO.Ode33.ode	@ltx/en_us_dedes/miscellanea:misc.Ode3
ltx/en_us_dedes/oc.m3.d1:ocMO.Ode33.text	
ltx/en_us_dedes/oc.m3.d1:ocMO.Ode3T.incipit	…
ltx/en_us_dedes/oc.m3.d1:ocMO.Ode3T.melody	@ltx/en_us_dedes/he.h.m3:heHE.OEkMiOnton.name
ltx/en_us_dedes/oc.m3.d1:ocMO.Ode3T.mode	@ltx/en_us_dedes/miscellanea:misc.Mode3
ltx/en_us_dedes/oc.m3.d1:ocMO.Ode3T.ode	@ltx/en_us_dedes/miscellanea:misc.Ode3
ltx/en_us_dedes/oc.m3.d1:ocMO.Ode3T.text	
ltx/en_us_dedes/oc.m3.d1:ocMO.Ode41.greekmelody	@ltx/en_us_dedes/he.h.m3:heHE.EthouProsImas.greekname
ltx/en_us_dedes/oc.m3.d1:ocMO.Ode41.incipit	…
ltx/en_us_dedes/oc.m3.d1:ocMO.Ode41.melody	@ltx/en_us_dedes/he.h.m3:heHE.EthouProsImas.name
ltx/en_us_dedes/oc.m3.d1:ocMO.Ode41.mode	@ltx/en_us_dedes/miscellanea:misc.Mode3
ltx/en_us_dedes/oc.m3.d1:ocMO.Ode41.ode	@ltx/en_us_dedes/miscellanea:misc.Ode4
ltx/en_us_dedes/oc.m3.d1:ocMO.Ode41.text	
ltx/en_us_dedes/oc.m3.d1:ocMO.Ode42.incipit	…
ltx/en_us_dedes/oc.m3.d1:ocMO.Ode42.melody	@ltx/en_us_dedes/he.h.m3:heHE.EthouProsImas.name
ltx/en_us_dedes/oc.m3.d1:ocMO.Ode42.mode	@ltx/en_us_dedes/miscellanea:misc.Mode3
ltx/en_us_dedes/oc.m3.d1:ocMO.Ode42.ode	@ltx/en_us_dedes/miscellanea:misc.Ode4
ltx/en_us_dedes/oc.m3.d1:ocMO.Ode42.text	
ltx/en_us_dedes/oc.m3.d1:ocMO.Ode4T.incipit	…
ltx/en_us_dedes/oc.m3.d1:ocMO.Ode4T.melody	@ltx/en_us_dedes/he.h.m3:heHE.EthouProsImas.name
ltx/en_us_dedes/oc.m3.d1:ocMO.Ode4T.mode	@ltx/en_us_dedes/miscellanea:misc.Mode3
ltx/en_us_dedes/oc.m3.d1:ocMO.Ode4T.ode	@ltx/en_us_dedes/miscellanea:misc.Ode4
ltx/en_us_dedes/oc.m3.d1:ocMO.Ode4T.text	
ltx/en_us_dedes/oc.m3.d1:ocMO.Ode51.greekmelody	@ltx/en_us_dedes/he.h.m3:heHE.OsEidenIsaias.greekname
ltx/en_us_dedes/oc.m3.d1:ocMO.Ode51.incipit	…
ltx/en_us_dedes/oc.m3.d1:ocMO.Ode51.melody	@ltx/en_us_dedes/he.h.m3:heHE.OsEidenIsaias.name
ltx/en_us_dedes/oc.m3.d1:ocMO.Ode51.mode	@ltx/en_us_dedes/miscellanea:misc.Mode3
ltx/en_us_dedes/oc.m3.d1:ocMO.Ode51.ode	@ltx/en_us_dedes/miscellanea:misc.Ode5
ltx/en_us_dedes/oc.m3.d1:ocMO.Ode51.text	
ltx/en_us_dedes/oc.m3.d1:ocMO.Ode52.incipit	…
ltx/en_us_dedes/oc.m3.d1:ocMO.Ode52.melody	@ltx/en_us_dedes/he.h.m3:heHE.OsEidenIsaias.name
ltx/en_us_dedes/oc.m3.d1:ocMO.Ode52.mode	@ltx/en_us_dedes/miscellanea:misc.Mode3
ltx/en_us_dedes/oc.m3.d1:ocMO.Ode52.ode	@ltx/en_us_dedes/miscellanea:misc.Ode5
ltx/en_us_dedes/oc.m3.d1:ocMO.Ode52.text	
ltx/en_us_dedes/oc.m3.d1:ocMO.Ode5T.incipit	…
ltx/en_us_dedes/oc.m3.d1:ocMO.Ode5T.melody	@ltx/en_us_dedes/he.h.m3:heHE.OsEidenIsaias.name
ltx/en_us_dedes/oc.m3.d1:ocMO.Ode5T.mode	@ltx/en_us_dedes/miscellanea:misc.Mode3
ltx/en_us_dedes/oc.m3.d1:ocMO.Ode5T.ode	@ltx/en_us_dedes/miscellanea:misc.Ode5
ltx/en_us_dedes/oc.m3.d1:ocMO.Ode5T.text	
ltx/en_us_dedes/oc.m3.d1:ocMO.Ode61.greekmelody	@ltx/en_us_dedes/he.h.m3:heHE.AvyssosEschati.greekname
ltx/en_us_dedes/oc.m3.d1:ocMO.Ode61.incipit	…
ltx/en_us_dedes/oc.m3.d1:ocMO.Ode61.melody	@ltx/en_us_dedes/he.h.m3:heHE.AvyssosEschati.name
ltx/en_us_dedes/oc.m3.d1:ocMO.Ode61.mode	@ltx/en_us_dedes/miscellanea:misc.Mode3
ltx/en_us_dedes/oc.m3.d1:ocMO.Ode61.ode	@ltx/en_us_dedes/miscellanea:misc.Ode6
ltx/en_us_dedes/oc.m3.d1:ocMO.Ode61.text	
ltx/en_us_dedes/oc.m3.d1:ocMO.Ode62.incipit	…
ltx/en_us_dedes/oc.m3.d1:ocMO.Ode62.melody	@ltx/en_us_dedes/he.h.m3:heHE.AvyssosEschati.name
ltx/en_us_dedes/oc.m3.d1:ocMO.Ode62.mode	@ltx/en_us_dedes/miscellanea:misc.Mode3
ltx/en_us_dedes/oc.m3.d1:ocMO.Ode62.ode	@ltx/en_us_dedes/miscellanea:misc.Ode6
ltx/en_us_dedes/oc.m3.d1:ocMO.Ode62.text	
ltx/en_us_dedes/oc.m3.d1:ocMO.Ode6T.incipit	…
ltx/en_us_dedes/oc.m3.d1:ocMO.Ode6T.melody	@ltx/en_us_dedes/he.h.m3:heHE.AvyssosEschati.name
ltx/en_us_dedes/oc.m3.d1:ocMO.Ode6T.mode	@ltx/en_us_dedes/miscellanea:misc.Mode3
ltx/en_us_dedes/oc.m3.d1:ocMO.Ode6T.ode	@ltx/en_us_dedes/miscellanea:misc.Ode6
ltx/en_us_dedes/oc.m3.d1:ocMO.Ode6T.text	
ltx/en_us_dedes/oc.m3.d1:ocMO.Ode71.greekmelody	@ltx/en_us_dedes/he.h.m3:heHE.OsPalaiTousEfseveis.greekname
ltx/en_us_dedes/oc.m3.d1:ocMO.Ode71.incipit	…
ltx/en_us_dedes/oc.m3.d1:ocMO.Ode71.melody	@ltx/en_us_dedes/he.h.m3:heHE.OsPalaiTousEfseveis.name
ltx/en_us_dedes/oc.m3.d1:ocMO.Ode71.mode	@ltx/en_us_dedes/miscellanea:misc.Mode3
ltx/en_us_dedes/oc.m3.d1:ocMO.Ode71.ode	@ltx/en_us_dedes/miscellanea:misc.Ode7
ltx/en_us_dedes/oc.m3.d1:ocMO.Ode71.text	
ltx/en_us_dedes/oc.m3.d1:ocMO.Ode72.incipit	…
ltx/en_us_dedes/oc.m3.d1:ocMO.Ode72.melody	@ltx/en_us_dedes/he.h.m3:heHE.OsPalaiTousEfseveis.name
ltx/en_us_dedes/oc.m3.d1:ocMO.Ode72.mode	@ltx/en_us_dedes/miscellanea:misc.Mode3
ltx/en_us_dedes/oc.m3.d1:ocMO.Ode72.ode	@ltx/en_us_dedes/miscellanea:misc.Ode7
ltx/en_us_dedes/oc.m3.d1:ocMO.Ode72.text	
ltx/en_us_dedes/oc.m3.d1:ocMO.Ode73.incipit	…
ltx/en_us_dedes/oc.m3.d1:ocMO.Ode73.melody	@ltx/en_us_dedes/he.h.m3:heHE.OsPalaiTousEfseveis.name
ltx/en_us_dedes/oc.m3.d1:ocMO.Ode73.mode	@ltx/en_us_dedes/miscellanea:misc.Mode3
ltx/en_us_dedes/oc.m3.d1:ocMO.Ode73.ode	@ltx/en_us_dedes/miscellanea:misc.Ode7
ltx/en_us_dedes/oc.m3.d1:ocMO.Ode73.text	
ltx/en_us_dedes/oc.m3.d1:ocMO.Ode7T.incipit	…
ltx/en_us_dedes/oc.m3.d1:ocMO.Ode7T.melody	@ltx/en_us_dedes/he.h.m3:heHE.OsPalaiTousEfseveis.name
ltx/en_us_dedes/oc.m3.d1:ocMO.Ode7T.mode	@ltx/en_us_dedes/miscellanea:misc.Mode3
ltx/en_us_dedes/oc.m3.d1:ocMO.Ode7T.ode	@ltx/en_us_dedes/miscellanea:misc.Ode7
ltx/en_us_dedes/oc.m3.d1:ocMO.Ode7T.text	
ltx/en_us_dedes/oc.m3.d1:ocMO.Ode81.greekmelody	@ltx/en_us_dedes/he.h.m3:heHE.AstektoPyri.greekname
ltx/en_us_dedes/oc.m3.d1:ocMO.Ode81.incipit	…
ltx/en_us_dedes/oc.m3.d1:ocMO.Ode81.melody	@ltx/en_us_dedes/he.h.m3:heHE.AstektoPyri.name
ltx/en_us_dedes/oc.m3.d1:ocMO.Ode81.mode	@ltx/en_us_dedes/miscellanea:misc.Mode3
ltx/en_us_dedes/oc.m3.d1:ocMO.Ode81.ode	@ltx/en_us_dedes/miscellanea:misc.Ode8
ltx/en_us_dedes/oc.m3.d1:ocMO.Ode81.text	
ltx/en_us_dedes/oc.m3.d1:ocMO.Ode82.incipit	…
ltx/en_us_dedes/oc.m3.d1:ocMO.Ode82.melody	@ltx/en_us_dedes/he.h.m3:heHE.AstektoPyri.name
ltx/en_us_dedes/oc.m3.d1:ocMO.Ode82.mode	@ltx/en_us_dedes/miscellanea:misc.Mode3
ltx/en_us_dedes/oc.m3.d1:ocMO.Ode82.ode	@ltx/en_us_dedes/miscellanea:misc.Ode8
ltx/en_us_dedes/oc.m3.d1:ocMO.Ode82.text	
ltx/en_us_dedes/oc.m3.d1:ocMO.Ode8T.incipit	…
ltx/en_us_dedes/oc.m3.d1:ocMO.Ode8T.melody	@ltx/en_us_dedes/he.h.m3:heHE.AstektoPyri.name
ltx/en_us_dedes/oc.m3.d1:ocMO.Ode8T.mode	@ltx/en_us_dedes/miscellanea:misc.Mode3
ltx/en_us_dedes/oc.m3.d1:ocMO.Ode8T.ode	@ltx/en_us_dedes/miscellanea:misc.Ode8
ltx/en_us_dedes/oc.m3.d1:ocMO.Ode8T.text	
ltx/en_us_dedes/oc.m3.d1:ocMO.Ode91.greekmelody	@ltx/en_us_dedes/he.h.m3:heHE.KainonToThavma.greekname
ltx/en_us_dedes/oc.m3.d1:ocMO.Ode91.incipit	…
ltx/en_us_dedes/oc.m3.d1:ocMO.Ode91.melody	@ltx/en_us_dedes/he.h.m3:heHE.KainonToThavma.name
ltx/en_us_dedes/oc.m3.d1:ocMO.Ode91.mode	@ltx/en_us_dedes/miscellanea:misc.Mode3
ltx/en_us_dedes/oc.m3.d1:ocMO.Ode91.ode	@ltx/en_us_dedes/miscellanea:misc.Ode9
ltx/en_us_dedes/oc.m3.d1:ocMO.Ode91.text	
ltx/en_us_dedes/oc.m3.d1:ocMO.Ode92.incipit	…
ltx/en_us_dedes/oc.m3.d1:ocMO.Ode92.melody	@ltx/en_us_dedes/he.h.m3:heHE.KainonToThavma.name
ltx/en_us_dedes/oc.m3.d1:ocMO.Ode92.mode	@ltx/en_us_dedes/miscellanea:misc.Mode3
ltx/en_us_dedes/oc.m3.d1:ocMO.Ode92.ode	@ltx/en_us_dedes/miscellanea:misc.Ode9
ltx/en_us_dedes/oc.m3.d1:ocMO.Ode92.text	
ltx/en_us_dedes/oc.m3.d1:ocMO.Ode9T.incipit	…
ltx/en_us_dedes/oc.m3.d1:ocMO.Ode9T.melody	@ltx/en_us_dedes/he.h.m3:heHE.KainonToThavma.name
ltx/en_us_dedes/oc.m3.d1:ocMO.Ode9T.mode	@ltx/en_us_dedes/miscellanea:misc.Mode3
ltx/en_us_dedes/oc.m3.d1:ocMO.Ode9T.ode	@ltx/en_us_dedes/miscellanea:misc.Ode9
ltx/en_us_dedes/oc.m3.d1:ocMO.Ode9T.text	
ltx/en_us_dedes/oc.m3.d1:ocMO.acrostic.notice	
ltx/en_us_dedes/oc.m3.d1:ocMO.acrostic.text	
ltx/en_us_dedes/oc.m3.d1:ocMO.poet	@ltx/en_us_dedes/poets:po.MitrofanousSmirnis
ltx/en_us_dedes/oc.m3.d1:ocMO.title	Canon for the Trinity
ltx/en_us_dedes/oc.m3.d1:ocSV.AposDogmatic.incipit	…
ltx/en_us_dedes/oc.m3.d1:ocSV.AposDogmatic.melody	
ltx/en_us_dedes/oc.m3.d1:ocSV.AposDogmatic.mode	@ltx/en_us_dedes/miscellanea:misc.Mode3
ltx/en_us_dedes/oc.m3.d1:ocSV.AposDogmatic.text	
ltx/en_us_dedes/oc.m3.d1:ocSV.Aposticha1.incipit	…
ltx/en_us_dedes/oc.m3.d1:ocSV.Aposticha1.melody	
ltx/en_us_dedes/oc.m3.d1:ocSV.Aposticha1.mode	@ltx/en_us_dedes/miscellanea:misc.Mode3
ltx/en_us_dedes/oc.m3.d1:ocSV.Aposticha1.text	
ltx/en_us_dedes/oc.m3.d1:ocSV.Aposticha2.incipit	…
ltx/en_us_dedes/oc.m3.d1:ocSV.Aposticha2.melody	
ltx/en_us_dedes/oc.m3.d1:ocSV.Aposticha2.mode	@ltx/en_us_dedes/miscellanea:misc.Mode3
ltx/en_us_dedes/oc.m3.d1:ocSV.Aposticha2.text	
ltx/en_us_dedes/oc.m3.d1:ocSV.Aposticha3.incipit	…
ltx/en_us_dedes/oc.m3.d1:ocSV.Aposticha3.melody	
ltx/en_us_dedes/oc.m3.d1:ocSV.Aposticha3.mode	@ltx/en_us_dedes/miscellanea:misc.Mode3
ltx/en_us_dedes/oc.m3.d1:ocSV.Aposticha3.text	
ltx/en_us_dedes/oc.m3.d1:ocSV.Dogmatic.incipit	…
ltx/en_us_dedes/oc.m3.d1:ocSV.Dogmatic.melody	
ltx/en_us_dedes/oc.m3.d1:ocSV.Dogmatic.mode	@ltx/en_us_dedes/miscellanea:misc.Mode3
ltx/en_us_dedes/oc.m3.d1:ocSV.Dogmatic.text	
ltx/en_us_dedes/oc.m3.d1:ocVE.ApolTheotokionVM.incipit	Unto you who mediated…
ltx/en_us_dedes/oc.m3.d1:ocVE.ApolTheotokionVM.melody	
ltx/en_us_dedes/oc.m3.d1:ocVE.ApolTheotokionVM.mode	@ltx/en_us_dedes/miscellanea:misc.Mode3
ltx/en_us_dedes/oc.m3.d1:ocVE.ApolTheotokionVM.text	Unto you who mediated the salvation of our race we sing praises, O Virgin Theotokos. For your Son and our God in the flesh that He assumed from you accepted suffering by means of crucifixion and has thereby set us free from corruption, in His love for man.
ltx/en_us_dedes/oc.m3.d1:ocVE.Apolytikion.incipit	Let the heavens sing for joy…
ltx/en_us_dedes/oc.m3.d1:ocVE.Apolytikion.melody	
ltx/en_us_dedes/oc.m3.d1:ocVE.Apolytikion.mode	@ltx/en_us_dedes/miscellanea:misc.Mode3
ltx/en_us_dedes/oc.m3.d1:ocVE.Apolytikion.text	Let the heavens sing for joy, and let everything on earth be glad. For with His arm the Lord has worked power. He trampled death under foot by means of death; and He became the firstborn from the dead. From the maw of Hades He delivered us; and He granted the world His great mercy.
ltx/en_us_dedes/oc.m3.d1:ocVE.AposTheotokion.incipit	…
ltx/en_us_dedes/oc.m3.d1:ocVE.AposTheotokion.melody	
ltx/en_us_dedes/oc.m3.d1:ocVE.AposTheotokion.mode	@ltx/en_us_dedes/miscellanea:misc.Mode3
ltx/en_us_dedes/oc.m3.d1:ocVE.AposTheotokion.text	
ltx/en_us_dedes/oc.m3.d1:ocVE.Aposticha1.incipit	…
ltx/en_us_dedes/oc.m3.d1:ocVE.Aposticha1.melody	
ltx/en_us_dedes/oc.m3.d1:ocVE.Aposticha1.mode	@ltx/en_us_dedes/miscellanea:misc.Mode3
ltx/en_us_dedes/oc.m3.d1:ocVE.Aposticha1.text	
ltx/en_us_dedes/oc.m3.d1:ocVE.Aposticha2.incipit	…
ltx/en_us_dedes/oc.m3.d1:ocVE.Aposticha2.melody	
ltx/en_us_dedes/oc.m3.d1:ocVE.Aposticha2.mode	@ltx/en_us_dedes/miscellanea:misc.Mode3
ltx/en_us_dedes/oc.m3.d1:ocVE.Aposticha2.text	
ltx/en_us_dedes/oc.m3.d1:ocVE.Aposticha3.incipit	…
ltx/en_us_dedes/oc.m3.d1:ocVE.Aposticha3.melody	
ltx/en_us_dedes/oc.m3.d1:ocVE.Aposticha3.mode	@ltx/en_us_dedes/miscellanea:misc.Mode3
ltx/en_us_dedes/oc.m3.d1:ocVE.Aposticha3.text	
ltx/en_us_dedes/oc.m3.d1:ocVE.Aposticha4.incipit	…
ltx/en_us_dedes/oc.m3.d1:ocVE.Aposticha4.melody	
ltx/en_us_dedes/oc.m3.d1:ocVE.Aposticha4.mode	@ltx/en_us_dedes/miscellanea:misc.Mode3
ltx/en_us_dedes/oc.m3.d1:ocVE.Aposticha4.text	
ltx/en_us_dedes/oc.m3.d1:ocVE.MM.LIHC1.text	@ltx/en_us_dedes/properties:media.key
ltx/en_us_dedes/oc.m3.d1:ocVE.MM.LIHC2.text	@ltx/en_us_dedes/properties:media.key
ltx/en_us_dedes/oc.m3.d1:ocVE.MM.Stichologia.text	@ltx/en_us_dedes/properties:media.key
ltx/en_us_dedes/oc.m3.d1:ocVE.SticTheotokion.incipit	How can we not marvel…
ltx/en_us_dedes/oc.m3.d1:ocVE.SticTheotokion.melody	
ltx/en_us_dedes/oc.m3.d1:ocVE.SticTheotokion.mode	@ltx/en_us_dedes/miscellanea:misc.Mode3
ltx/en_us_dedes/oc.m3.d1:ocVE.SticTheotokion.text	How can we not marvel at your theandric childbirth, O most reverend Maid? For while having had no spousal congress, all-blameless one, you gave birth unto a Son unfathered in the flesh, Who had, unmothered, been begotten of the Father before all ages. He in no way underwent any change, intermingling or division; but He preserved each nature’s distinct identity in its totality. Therefore, O Virgin Mother and Lady, entreat Him for the salvation of the souls of those confessing you, in Orthodox manner, to be Theotokos.
ltx/en_us_dedes/oc.m3.d1:ocVE.Stichera1.incipit	…
ltx/en_us_dedes/oc.m3.d1:ocVE.Stichera1.melody	
ltx/en_us_dedes/oc.m3.d1:ocVE.Stichera1.mode	@ltx/en_us_dedes/miscellanea:misc.Mode3
ltx/en_us_dedes/oc.m3.d1:ocVE.Stichera1.text	
ltx/en_us_dedes/oc.m3.d1:ocVE.Stichera2.incipit	…
ltx/en_us_dedes/oc.m3.d1:ocVE.Stichera2.melody	
ltx/en_us_dedes/oc.m3.d1:ocVE.Stichera2.mode	@ltx/en_us_dedes/miscellanea:misc.Mode3
ltx/en_us_dedes/oc.m3.d1:ocVE.Stichera2.text	
ltx/en_us_dedes/oc.m3.d1:ocVE.Stichera3.incipit	…
ltx/en_us_dedes/oc.m3.d1:ocVE.Stichera3.melody	
ltx/en_us_dedes/oc.m3.d1:ocVE.Stichera3.mode	@ltx/en_us_dedes/miscellanea:misc.Mode3
ltx/en_us_dedes/oc.m3.d1:ocVE.Stichera3.text	
ltx/en_us_dedes/oc.m3.d1:ocVE.Stichera4.incipit	…
ltx/en_us_dedes/oc.m3.d1:ocVE.Stichera4.melody	
ltx/en_us_dedes/oc.m3.d1:ocVE.Stichera4.mode	@ltx/en_us_dedes/miscellanea:misc.Mode3
ltx/en_us_dedes/oc.m3.d1:ocVE.Stichera4.text	
ltx/en_us_dedes/oc.m3.d1:ocVE.Stichera5.incipit	…
ltx/en_us_dedes/oc.m3.d1:ocVE.Stichera5.melody	
ltx/en_us_dedes/oc.m3.d1:ocVE.Stichera5.mode	@ltx/en_us_dedes/miscellanea:misc.Mode3
ltx/en_us_dedes/oc.m3.d1:ocVE.Stichera5.text	
ltx/en_us_dedes/oc.m3.d1:ocVE.Stichera6.incipit	…
ltx/en_us_dedes/oc.m3.d1:ocVE.Stichera6.melody	
ltx/en_us_dedes/oc.m3.d1:ocVE.Stichera6.mode	@ltx/en_us_dedes/miscellanea:misc.Mode3
ltx/en_us_dedes/oc.m3.d1:ocVE.Stichera6.text	
ltx/en_us_dedes/oc.m3.d1:ocVE.Stichera7.incipit	…
ltx/en_us_dedes/oc.m3.d1:ocVE.Stichera7.melody	
ltx/en_us_dedes/oc.m3.d1:ocVE.Stichera7.mode	@ltx/en_us_dedes/miscellanea:misc.Mode3
ltx/en_us_dedes/oc.m3.d1:ocVE.Stichera7.text	
