ltx/en_us_dedes/me.m10.d28:alt1.meDA.commemoration.first_name	Holy Protection
ltx/en_us_dedes/me.m10.d28:alt1.meDA.commemoration.first_short	Holy Protection of our Most Holy Lady Theotokos
ltx/en_us_dedes/me.m10.d28:alt1.meDA.commemoration.first_title	@ltx/en_us_dedes/titles:ti.Theotokos
ltx/en_us_dedes/me.m10.d28:alt1.meDA.commemoration.full	
ltx/en_us_dedes/me.m10.d28:alt1.meDA.commemoration.second_name	
ltx/en_us_dedes/me.m10.d28:alt1.meDA.commemoration.second_title	
ltx/en_us_dedes/me.m10.d28:alt1.meDA.date	
ltx/en_us_dedes/me.m10.d28:alt1.meDA.insert1	
ltx/en_us_dedes/me.m10.d28:alt1.meDA.insert2	
ltx/en_us_dedes/me.m10.d28:alt1.meDA.note	
ltx/en_us_dedes/me.m10.d28:alt1.meHO.commemorations	
ltx/en_us_dedes/me.m10.d28:alt1.meHO.note1	
ltx/en_us_dedes/me.m10.d28:alt1.meHO.note2	
ltx/en_us_dedes/me.m10.d28:alt1.meHO.number	
ltx/en_us_dedes/me.m10.d28:alt1.meHO.rank	
ltx/en_us_dedes/me.m10.d28:alt1.meLE.commemoration1	
ltx/en_us_dedes/me.m10.d28:alt1.meLE.commemoration2	
ltx/en_us_dedes/me.m10.d28:alt1.meLI.Kontakion1.incipit	@ltx/en_us_dedes/me.m10.d28:alt1.meMA.Kontakion1.incipit
ltx/en_us_dedes/me.m10.d28:alt1.meLI.Kontakion1.melody	@ltx/en_us_dedes/me.m10.d28:alt1.meMA.Kontakion1.melody
ltx/en_us_dedes/me.m10.d28:alt1.meLI.Kontakion1.mode	@ltx/en_us_dedes/me.m10.d28:alt1.meMA.Kontakion1.mode
ltx/en_us_dedes/me.m10.d28:alt1.meLI.Kontakion1.text	@ltx/en_us_dedes/me.m10.d28:alt1.meMA.Kontakion1.text
ltx/en_us_dedes/me.m10.d28:alt1.meLI.MM.CommunionHymn.text	@ltx/en_us_dedes/properties:media.key
ltx/en_us_dedes/me.m10.d28:alt1.meLI.Megalynarion.text	
ltx/en_us_dedes/me.m10.d28:alt1.meLI.Megalynarion2.text	
ltx/en_us_dedes/me.m10.d28:alt1.meMA.C1.acrostic.notice1	
ltx/en_us_dedes/me.m10.d28:alt1.meMA.C1.acrostic.text	
ltx/en_us_dedes/me.m10.d28:alt1.meMA.C1.acrostic.title	
ltx/en_us_dedes/me.m10.d28:alt1.meMA.C1.title	@ltx/en_us_dedes/titles:ti.Canon1Theotokos
ltx/en_us_dedes/me.m10.d28:alt1.meMA.C1.verse	@ltx/en_us_dedes/prayers:pr.verse_Theotokos.text
ltx/en_us_dedes/me.m10.d28:alt1.meMA.C2.acrostic.notice1	
ltx/en_us_dedes/me.m10.d28:alt1.meMA.C2.acrostic.text	
ltx/en_us_dedes/me.m10.d28:alt1.meMA.C2.acrostic.title	
ltx/en_us_dedes/me.m10.d28:alt1.meMA.C2.title	@ltx/en_us_dedes/titles:ti.Canon2Theotokos
ltx/en_us_dedes/me.m10.d28:alt1.meMA.C2.verse	@ltx/en_us_dedes/prayers:pr.verse_Theotokos.text
ltx/en_us_dedes/me.m10.d28:alt1.meMA.Exaposteilarion1.greekmelody	@ltx/en_us_dedes/he.a.m3:heAU.OOuranonToisAstrois.greekname
ltx/en_us_dedes/me.m10.d28:alt1.meMA.Exaposteilarion1.incipit	…
ltx/en_us_dedes/me.m10.d28:alt1.meMA.Exaposteilarion1.melody	@ltx/en_us_dedes/he.a.m3:heAU.OOuranonToisAstrois.name
ltx/en_us_dedes/me.m10.d28:alt1.meMA.Exaposteilarion1.mode	@ltx/en_us_dedes/miscellanea:misc.Mode3
ltx/en_us_dedes/me.m10.d28:alt1.meMA.Exaposteilarion1.text	
ltx/en_us_dedes/me.m10.d28:alt1.meMA.Exaposteilarion2.greekmelody	@ltx/en_us_dedes/he.a.m3:heAU.OOuranonToisAstrois.greekname
ltx/en_us_dedes/me.m10.d28:alt1.meMA.Exaposteilarion2.incipit	…
ltx/en_us_dedes/me.m10.d28:alt1.meMA.Exaposteilarion2.melody	@ltx/en_us_dedes/he.a.m3:heAU.OOuranonToisAstrois.name
ltx/en_us_dedes/me.m10.d28:alt1.meMA.Exaposteilarion2.mode	@ltx/en_us_dedes/miscellanea:misc.Mode3
ltx/en_us_dedes/me.m10.d28:alt1.meMA.Exaposteilarion2.text	
ltx/en_us_dedes/me.m10.d28:alt1.meMA.Kathisma11.greekmelody	@ltx/en_us_dedes/he.a.m1:heAU.TonTafonSouSotir.greekname
ltx/en_us_dedes/me.m10.d28:alt1.meMA.Kathisma11.incipit	…
ltx/en_us_dedes/me.m10.d28:alt1.meMA.Kathisma11.melody	@ltx/en_us_dedes/he.a.m1:heAU.TonTafonSouSotir.name
ltx/en_us_dedes/me.m10.d28:alt1.meMA.Kathisma11.mode	@ltx/en_us_dedes/miscellanea:misc.Mode1
ltx/en_us_dedes/me.m10.d28:alt1.meMA.Kathisma11.text	
ltx/en_us_dedes/me.m10.d28:alt1.meMA.Kathisma21.greekmelody	@ltx/en_us_dedes/he.a.m4:heAU.TachyProkatalave.greekname
ltx/en_us_dedes/me.m10.d28:alt1.meMA.Kathisma21.incipit	…
ltx/en_us_dedes/me.m10.d28:alt1.meMA.Kathisma21.melody	@ltx/en_us_dedes/he.a.m4:heAU.TachyProkatalave.name
ltx/en_us_dedes/me.m10.d28:alt1.meMA.Kathisma21.mode	@ltx/en_us_dedes/miscellanea:misc.Mode4
ltx/en_us_dedes/me.m10.d28:alt1.meMA.Kathisma21.text	
ltx/en_us_dedes/me.m10.d28:alt1.meMA.Kathisma31.greekmelody	@ltx/en_us_dedes/he.a.m8:heAU.TinSofianKaiLogon.greekname
ltx/en_us_dedes/me.m10.d28:alt1.meMA.Kathisma31.incipit	…
ltx/en_us_dedes/me.m10.d28:alt1.meMA.Kathisma31.melody	@ltx/en_us_dedes/he.a.m8:heAU.TinSofianKaiLogon.name
ltx/en_us_dedes/me.m10.d28:alt1.meMA.Kathisma31.mode	@ltx/en_us_dedes/miscellanea:misc.Mode8
ltx/en_us_dedes/me.m10.d28:alt1.meMA.Kathisma31.text	
ltx/en_us_dedes/me.m10.d28:alt1.meMA.Kontakion1.greekmelody	@ltx/en_us_dedes/he.a.m8:heAU.TiYpermacho.greekname
ltx/en_us_dedes/me.m10.d28:alt1.meMA.Kontakion1.incipit	…
ltx/en_us_dedes/me.m10.d28:alt1.meMA.Kontakion1.melody	@ltx/en_us_dedes/he.a.m8:heAU.TiYpermacho.name
ltx/en_us_dedes/me.m10.d28:alt1.meMA.Kontakion1.mode	@ltx/en_us_dedes/miscellanea:misc.Mode8
ltx/en_us_dedes/me.m10.d28:alt1.meMA.Kontakion1.text	
ltx/en_us_dedes/me.m10.d28:alt1.meMA.Lauds1.greekmelody	@ltx/en_us_dedes/he.a.m1:heAU.TonOuranionTagmaton.greekname
ltx/en_us_dedes/me.m10.d28:alt1.meMA.Lauds1.incipit	…
ltx/en_us_dedes/me.m10.d28:alt1.meMA.Lauds1.melody	@ltx/en_us_dedes/he.a.m1:heAU.TonOuranionTagmaton.name
ltx/en_us_dedes/me.m10.d28:alt1.meMA.Lauds1.mode	@ltx/en_us_dedes/miscellanea:misc.Mode1
ltx/en_us_dedes/me.m10.d28:alt1.meMA.Lauds1.text	
ltx/en_us_dedes/me.m10.d28:alt1.meMA.Lauds2.incipit	…
ltx/en_us_dedes/me.m10.d28:alt1.meMA.Lauds2.melody	@ltx/en_us_dedes/he.a.m1:heAU.TonOuranionTagmaton.name
ltx/en_us_dedes/me.m10.d28:alt1.meMA.Lauds2.mode	@ltx/en_us_dedes/miscellanea:misc.Mode1
ltx/en_us_dedes/me.m10.d28:alt1.meMA.Lauds2.text	
ltx/en_us_dedes/me.m10.d28:alt1.meMA.Lauds3.incipit	…
ltx/en_us_dedes/me.m10.d28:alt1.meMA.Lauds3.melody	@ltx/en_us_dedes/he.a.m1:heAU.TonOuranionTagmaton.name
ltx/en_us_dedes/me.m10.d28:alt1.meMA.Lauds3.mode	@ltx/en_us_dedes/miscellanea:misc.Mode1
ltx/en_us_dedes/me.m10.d28:alt1.meMA.Lauds3.text	
ltx/en_us_dedes/me.m10.d28:alt1.meMA.Lauds4.incipit	…
ltx/en_us_dedes/me.m10.d28:alt1.meMA.Lauds4.melody	
ltx/en_us_dedes/me.m10.d28:alt1.meMA.Lauds4.mode	@ltx/en_us_dedes/miscellanea:misc.Mode1
ltx/en_us_dedes/me.m10.d28:alt1.meMA.Lauds4.text	
ltx/en_us_dedes/me.m10.d28:alt1.meMA.LaudsGlory.incipit	…
ltx/en_us_dedes/me.m10.d28:alt1.meMA.LaudsGlory.melody	
ltx/en_us_dedes/me.m10.d28:alt1.meMA.LaudsGlory.mode	@ltx/en_us_dedes/miscellanea:misc.Mode5
ltx/en_us_dedes/me.m10.d28:alt1.meMA.LaudsGlory.text	
ltx/en_us_dedes/me.m10.d28:alt1.meMA.MM.Lauds1234as5678.text	@ltx/en_us_dedes/properties:media.key
ltx/en_us_dedes/me.m10.d28:alt1.meMA.Ode1C11.greekmelody	@ltx/en_us_dedes/he.h.m4:heHE.AnoixoToStomaMou.greekname
ltx/en_us_dedes/me.m10.d28:alt1.meMA.Ode1C11.incipit	…
ltx/en_us_dedes/me.m10.d28:alt1.meMA.Ode1C11.melody	@ltx/en_us_dedes/he.h.m4:heHE.AnoixoToStomaMou.name
ltx/en_us_dedes/me.m10.d28:alt1.meMA.Ode1C11.mode	@ltx/en_us_dedes/miscellanea:misc.Mode4
ltx/en_us_dedes/me.m10.d28:alt1.meMA.Ode1C11.ode	@ltx/en_us_dedes/miscellanea:misc.Ode1
ltx/en_us_dedes/me.m10.d28:alt1.meMA.Ode1C11.text	
ltx/en_us_dedes/me.m10.d28:alt1.meMA.Ode1C12.incipit	…
ltx/en_us_dedes/me.m10.d28:alt1.meMA.Ode1C12.melody	@ltx/en_us_dedes/he.h.m4:heHE.AnoixoToStomaMou.name
ltx/en_us_dedes/me.m10.d28:alt1.meMA.Ode1C12.mode	@ltx/en_us_dedes/miscellanea:misc.Mode4
ltx/en_us_dedes/me.m10.d28:alt1.meMA.Ode1C12.ode	@ltx/en_us_dedes/miscellanea:misc.Ode1
ltx/en_us_dedes/me.m10.d28:alt1.meMA.Ode1C12.text	
ltx/en_us_dedes/me.m10.d28:alt1.meMA.Ode1C13.incipit	…
ltx/en_us_dedes/me.m10.d28:alt1.meMA.Ode1C13.melody	@ltx/en_us_dedes/he.h.m4:heHE.AnoixoToStomaMou.name
ltx/en_us_dedes/me.m10.d28:alt1.meMA.Ode1C13.mode	@ltx/en_us_dedes/miscellanea:misc.Mode4
ltx/en_us_dedes/me.m10.d28:alt1.meMA.Ode1C13.ode	@ltx/en_us_dedes/miscellanea:misc.Ode1
ltx/en_us_dedes/me.m10.d28:alt1.meMA.Ode1C13.text	
ltx/en_us_dedes/me.m10.d28:alt1.meMA.Ode1C14.incipit	…
ltx/en_us_dedes/me.m10.d28:alt1.meMA.Ode1C14.melody	@ltx/en_us_dedes/he.h.m4:heHE.AnoixoToStomaMou.name
ltx/en_us_dedes/me.m10.d28:alt1.meMA.Ode1C14.mode	@ltx/en_us_dedes/miscellanea:misc.Mode4
ltx/en_us_dedes/me.m10.d28:alt1.meMA.Ode1C14.ode	@ltx/en_us_dedes/miscellanea:misc.Ode1
ltx/en_us_dedes/me.m10.d28:alt1.meMA.Ode1C14.text	
ltx/en_us_dedes/me.m10.d28:alt1.meMA.Ode1C1H.greekmelody	@ltx/en_us_dedes/he.h.m4:heHE.AnoixoToStomaMou.greekname
ltx/en_us_dedes/me.m10.d28:alt1.meMA.Ode1C1H.incipit	@ltx/en_us_dedes/he.h.m4:heHE.AnoixoToStomaMou.incipit
ltx/en_us_dedes/me.m10.d28:alt1.meMA.Ode1C1H.melody	@ltx/en_us_dedes/he.h.m4:heHE.AnoixoToStomaMou.melody
ltx/en_us_dedes/me.m10.d28:alt1.meMA.Ode1C1H.mode	@ltx/en_us_dedes/miscellanea:misc.Mode4
ltx/en_us_dedes/me.m10.d28:alt1.meMA.Ode1C1H.ode	@ltx/en_us_dedes/miscellanea:misc.Ode1
ltx/en_us_dedes/me.m10.d28:alt1.meMA.Ode1C1H.text	@ltx/en_us_dedes/he.h.m4:heHE.AnoixoToStomaMou.text
ltx/en_us_dedes/me.m10.d28:alt1.meMA.Ode1C21.greekmelody	@ltx/en_us_dedes/he.h.m8:heHE.ArmatilatinFarao.greekname
ltx/en_us_dedes/me.m10.d28:alt1.meMA.Ode1C21.incipit	…
ltx/en_us_dedes/me.m10.d28:alt1.meMA.Ode1C21.melody	@ltx/en_us_dedes/he.h.m8:heHE.ArmatilatinFarao.name
ltx/en_us_dedes/me.m10.d28:alt1.meMA.Ode1C21.mode	@ltx/en_us_dedes/miscellanea:misc.Mode8
ltx/en_us_dedes/me.m10.d28:alt1.meMA.Ode1C21.ode	@ltx/en_us_dedes/miscellanea:misc.Ode1
ltx/en_us_dedes/me.m10.d28:alt1.meMA.Ode1C21.text	
ltx/en_us_dedes/me.m10.d28:alt1.meMA.Ode1C22.incipit	…
ltx/en_us_dedes/me.m10.d28:alt1.meMA.Ode1C22.melody	@ltx/en_us_dedes/he.h.m8:heHE.ArmatilatinFarao.name
ltx/en_us_dedes/me.m10.d28:alt1.meMA.Ode1C22.mode	@ltx/en_us_dedes/miscellanea:misc.Mode8
ltx/en_us_dedes/me.m10.d28:alt1.meMA.Ode1C22.ode	@ltx/en_us_dedes/miscellanea:misc.Ode1
ltx/en_us_dedes/me.m10.d28:alt1.meMA.Ode1C22.text	
ltx/en_us_dedes/me.m10.d28:alt1.meMA.Ode1C23.incipit	…
ltx/en_us_dedes/me.m10.d28:alt1.meMA.Ode1C23.melody	@ltx/en_us_dedes/he.h.m8:heHE.ArmatilatinFarao.name
ltx/en_us_dedes/me.m10.d28:alt1.meMA.Ode1C23.mode	@ltx/en_us_dedes/miscellanea:misc.Mode8
ltx/en_us_dedes/me.m10.d28:alt1.meMA.Ode1C23.ode	@ltx/en_us_dedes/miscellanea:misc.Ode1
ltx/en_us_dedes/me.m10.d28:alt1.meMA.Ode1C23.text	
ltx/en_us_dedes/me.m10.d28:alt1.meMA.Ode1C24.incipit	…
ltx/en_us_dedes/me.m10.d28:alt1.meMA.Ode1C24.melody	@ltx/en_us_dedes/he.h.m8:heHE.ArmatilatinFarao.name
ltx/en_us_dedes/me.m10.d28:alt1.meMA.Ode1C24.mode	@ltx/en_us_dedes/miscellanea:misc.Mode8
ltx/en_us_dedes/me.m10.d28:alt1.meMA.Ode1C24.ode	@ltx/en_us_dedes/miscellanea:misc.Ode1
ltx/en_us_dedes/me.m10.d28:alt1.meMA.Ode1C24.text	
ltx/en_us_dedes/me.m10.d28:alt1.meMA.Ode3C11.greekmelody	@ltx/en_us_dedes/he.h.m4:heHE.TousSousYmnologous.greekname
ltx/en_us_dedes/me.m10.d28:alt1.meMA.Ode3C11.incipit	…
ltx/en_us_dedes/me.m10.d28:alt1.meMA.Ode3C11.melody	@ltx/en_us_dedes/he.h.m4:heHE.TousSousYmnologous.name
ltx/en_us_dedes/me.m10.d28:alt1.meMA.Ode3C11.mode	@ltx/en_us_dedes/miscellanea:misc.Mode4
ltx/en_us_dedes/me.m10.d28:alt1.meMA.Ode3C11.ode	@ltx/en_us_dedes/miscellanea:misc.Ode3
ltx/en_us_dedes/me.m10.d28:alt1.meMA.Ode3C11.text	
ltx/en_us_dedes/me.m10.d28:alt1.meMA.Ode3C12.incipit	…
ltx/en_us_dedes/me.m10.d28:alt1.meMA.Ode3C12.melody	@ltx/en_us_dedes/he.h.m4:heHE.TousSousYmnologous.name
ltx/en_us_dedes/me.m10.d28:alt1.meMA.Ode3C12.mode	@ltx/en_us_dedes/miscellanea:misc.Mode4
ltx/en_us_dedes/me.m10.d28:alt1.meMA.Ode3C12.ode	@ltx/en_us_dedes/miscellanea:misc.Ode3
ltx/en_us_dedes/me.m10.d28:alt1.meMA.Ode3C12.text	
ltx/en_us_dedes/me.m10.d28:alt1.meMA.Ode3C13.incipit	…
ltx/en_us_dedes/me.m10.d28:alt1.meMA.Ode3C13.melody	@ltx/en_us_dedes/he.h.m4:heHE.TousSousYmnologous.name
ltx/en_us_dedes/me.m10.d28:alt1.meMA.Ode3C13.mode	@ltx/en_us_dedes/miscellanea:misc.Mode4
ltx/en_us_dedes/me.m10.d28:alt1.meMA.Ode3C13.ode	@ltx/en_us_dedes/miscellanea:misc.Ode3
ltx/en_us_dedes/me.m10.d28:alt1.meMA.Ode3C13.text	
ltx/en_us_dedes/me.m10.d28:alt1.meMA.Ode3C14.incipit	…
ltx/en_us_dedes/me.m10.d28:alt1.meMA.Ode3C14.melody	@ltx/en_us_dedes/he.h.m4:heHE.TousSousYmnologous.name
ltx/en_us_dedes/me.m10.d28:alt1.meMA.Ode3C14.mode	@ltx/en_us_dedes/miscellanea:misc.Mode4
ltx/en_us_dedes/me.m10.d28:alt1.meMA.Ode3C14.ode	@ltx/en_us_dedes/miscellanea:misc.Ode3
ltx/en_us_dedes/me.m10.d28:alt1.meMA.Ode3C14.text	
ltx/en_us_dedes/me.m10.d28:alt1.meMA.Ode3C1H.greekmelody	@ltx/en_us_dedes/he.h.m4:heHE.TousSousYmnologous.greekname
ltx/en_us_dedes/me.m10.d28:alt1.meMA.Ode3C1H.incipit	@ltx/en_us_dedes/he.h.m4:heHE.TousSousYmnologous.incipit
ltx/en_us_dedes/me.m10.d28:alt1.meMA.Ode3C1H.melody	@ltx/en_us_dedes/he.h.m4:heHE.TousSousYmnologous.melody
ltx/en_us_dedes/me.m10.d28:alt1.meMA.Ode3C1H.mode	@ltx/en_us_dedes/miscellanea:misc.Mode4
ltx/en_us_dedes/me.m10.d28:alt1.meMA.Ode3C1H.ode	@ltx/en_us_dedes/miscellanea:misc.Ode3
ltx/en_us_dedes/me.m10.d28:alt1.meMA.Ode3C1H.text	@ltx/en_us_dedes/he.h.m4:heHE.TousSousYmnologous.text
ltx/en_us_dedes/me.m10.d28:alt1.meMA.Ode3C21.greekmelody	@ltx/en_us_dedes/he.h.m8:heHE.OStereosasKatArchas.greekname
ltx/en_us_dedes/me.m10.d28:alt1.meMA.Ode3C21.incipit	…
ltx/en_us_dedes/me.m10.d28:alt1.meMA.Ode3C21.melody	@ltx/en_us_dedes/he.h.m8:heHE.OStereosasKatArchas.name
ltx/en_us_dedes/me.m10.d28:alt1.meMA.Ode3C21.mode	@ltx/en_us_dedes/miscellanea:misc.Mode8
ltx/en_us_dedes/me.m10.d28:alt1.meMA.Ode3C21.ode	@ltx/en_us_dedes/miscellanea:misc.Ode3
ltx/en_us_dedes/me.m10.d28:alt1.meMA.Ode3C21.text	
ltx/en_us_dedes/me.m10.d28:alt1.meMA.Ode3C22.incipit	…
ltx/en_us_dedes/me.m10.d28:alt1.meMA.Ode3C22.melody	@ltx/en_us_dedes/he.h.m8:heHE.OStereosasKatArchas.name
ltx/en_us_dedes/me.m10.d28:alt1.meMA.Ode3C22.mode	@ltx/en_us_dedes/miscellanea:misc.Mode8
ltx/en_us_dedes/me.m10.d28:alt1.meMA.Ode3C22.ode	@ltx/en_us_dedes/miscellanea:misc.Ode3
ltx/en_us_dedes/me.m10.d28:alt1.meMA.Ode3C22.text	
ltx/en_us_dedes/me.m10.d28:alt1.meMA.Ode3C23.incipit	…
ltx/en_us_dedes/me.m10.d28:alt1.meMA.Ode3C23.melody	@ltx/en_us_dedes/he.h.m8:heHE.OStereosasKatArchas.name
ltx/en_us_dedes/me.m10.d28:alt1.meMA.Ode3C23.mode	@ltx/en_us_dedes/miscellanea:misc.Mode8
ltx/en_us_dedes/me.m10.d28:alt1.meMA.Ode3C23.ode	@ltx/en_us_dedes/miscellanea:misc.Ode3
ltx/en_us_dedes/me.m10.d28:alt1.meMA.Ode3C23.text	
ltx/en_us_dedes/me.m10.d28:alt1.meMA.Ode3C24.incipit	…
ltx/en_us_dedes/me.m10.d28:alt1.meMA.Ode3C24.melody	@ltx/en_us_dedes/he.h.m8:heHE.OStereosasKatArchas.name
ltx/en_us_dedes/me.m10.d28:alt1.meMA.Ode3C24.mode	@ltx/en_us_dedes/miscellanea:misc.Mode8
ltx/en_us_dedes/me.m10.d28:alt1.meMA.Ode3C24.ode	@ltx/en_us_dedes/miscellanea:misc.Ode3
ltx/en_us_dedes/me.m10.d28:alt1.meMA.Ode3C24.text	
ltx/en_us_dedes/me.m10.d28:alt1.meMA.Ode3Kathisma1.greekmelody	@ltx/en_us_dedes/he.a.m3:heAU.TheiasPisteos.greekname
ltx/en_us_dedes/me.m10.d28:alt1.meMA.Ode3Kathisma1.incipit	…
ltx/en_us_dedes/me.m10.d28:alt1.meMA.Ode3Kathisma1.melody	@ltx/en_us_dedes/he.a.m3:heAU.TheiasPisteos.name
ltx/en_us_dedes/me.m10.d28:alt1.meMA.Ode3Kathisma1.mode	@ltx/en_us_dedes/miscellanea:misc.Mode3
ltx/en_us_dedes/me.m10.d28:alt1.meMA.Ode3Kathisma1.text	
ltx/en_us_dedes/me.m10.d28:alt1.meMA.Ode4C11.greekmelody	@ltx/en_us_dedes/he.h.m4:heHE.OKathimenosEnDoxi.greekname
ltx/en_us_dedes/me.m10.d28:alt1.meMA.Ode4C11.incipit	…
ltx/en_us_dedes/me.m10.d28:alt1.meMA.Ode4C11.melody	@ltx/en_us_dedes/he.h.m4:heHE.OKathimenosEnDoxi.name
ltx/en_us_dedes/me.m10.d28:alt1.meMA.Ode4C11.mode	@ltx/en_us_dedes/miscellanea:misc.Mode4
ltx/en_us_dedes/me.m10.d28:alt1.meMA.Ode4C11.ode	@ltx/en_us_dedes/miscellanea:misc.Ode4
ltx/en_us_dedes/me.m10.d28:alt1.meMA.Ode4C11.text	
ltx/en_us_dedes/me.m10.d28:alt1.meMA.Ode4C12.incipit	…
ltx/en_us_dedes/me.m10.d28:alt1.meMA.Ode4C12.melody	@ltx/en_us_dedes/he.h.m4:heHE.OKathimenosEnDoxi.name
ltx/en_us_dedes/me.m10.d28:alt1.meMA.Ode4C12.mode	@ltx/en_us_dedes/miscellanea:misc.Mode4
ltx/en_us_dedes/me.m10.d28:alt1.meMA.Ode4C12.ode	@ltx/en_us_dedes/miscellanea:misc.Ode4
ltx/en_us_dedes/me.m10.d28:alt1.meMA.Ode4C12.text	
ltx/en_us_dedes/me.m10.d28:alt1.meMA.Ode4C13.incipit	…
ltx/en_us_dedes/me.m10.d28:alt1.meMA.Ode4C13.melody	@ltx/en_us_dedes/he.h.m4:heHE.OKathimenosEnDoxi.name
ltx/en_us_dedes/me.m10.d28:alt1.meMA.Ode4C13.mode	@ltx/en_us_dedes/miscellanea:misc.Mode4
ltx/en_us_dedes/me.m10.d28:alt1.meMA.Ode4C13.ode	@ltx/en_us_dedes/miscellanea:misc.Ode4
ltx/en_us_dedes/me.m10.d28:alt1.meMA.Ode4C13.text	
ltx/en_us_dedes/me.m10.d28:alt1.meMA.Ode4C14.incipit	…
ltx/en_us_dedes/me.m10.d28:alt1.meMA.Ode4C14.melody	@ltx/en_us_dedes/he.h.m4:heHE.OKathimenosEnDoxi.name
ltx/en_us_dedes/me.m10.d28:alt1.meMA.Ode4C14.mode	@ltx/en_us_dedes/miscellanea:misc.Mode4
ltx/en_us_dedes/me.m10.d28:alt1.meMA.Ode4C14.ode	@ltx/en_us_dedes/miscellanea:misc.Ode4
ltx/en_us_dedes/me.m10.d28:alt1.meMA.Ode4C14.text	
ltx/en_us_dedes/me.m10.d28:alt1.meMA.Ode4C1H.greekmelody	@ltx/en_us_dedes/he.h.m4:heHE.OKathimenosEnDoxi.greekname
ltx/en_us_dedes/me.m10.d28:alt1.meMA.Ode4C1H.incipit	@ltx/en_us_dedes/he.h.m4:heHE.OKathimenosEnDoxi.incipit
ltx/en_us_dedes/me.m10.d28:alt1.meMA.Ode4C1H.melody	@ltx/en_us_dedes/he.h.m4:heHE.OKathimenosEnDoxi.melody
ltx/en_us_dedes/me.m10.d28:alt1.meMA.Ode4C1H.mode	@ltx/en_us_dedes/miscellanea:misc.Mode4
ltx/en_us_dedes/me.m10.d28:alt1.meMA.Ode4C1H.ode	@ltx/en_us_dedes/miscellanea:misc.Ode4
ltx/en_us_dedes/me.m10.d28:alt1.meMA.Ode4C1H.text	@ltx/en_us_dedes/he.h.m4:heHE.OKathimenosEnDoxi.text
ltx/en_us_dedes/me.m10.d28:alt1.meMA.Ode4C21.greekmelody	@ltx/en_us_dedes/he.h.m8:heHE.SyMouIschys.greekname
ltx/en_us_dedes/me.m10.d28:alt1.meMA.Ode4C21.incipit	…
ltx/en_us_dedes/me.m10.d28:alt1.meMA.Ode4C21.melody	@ltx/en_us_dedes/he.h.m8:heHE.SyMouIschys.name
ltx/en_us_dedes/me.m10.d28:alt1.meMA.Ode4C21.mode	@ltx/en_us_dedes/miscellanea:misc.Mode8
ltx/en_us_dedes/me.m10.d28:alt1.meMA.Ode4C21.ode	@ltx/en_us_dedes/miscellanea:misc.Ode4
ltx/en_us_dedes/me.m10.d28:alt1.meMA.Ode4C21.text	
ltx/en_us_dedes/me.m10.d28:alt1.meMA.Ode4C22.incipit	…
ltx/en_us_dedes/me.m10.d28:alt1.meMA.Ode4C22.melody	@ltx/en_us_dedes/he.h.m8:heHE.SyMouIschys.name
ltx/en_us_dedes/me.m10.d28:alt1.meMA.Ode4C22.mode	@ltx/en_us_dedes/miscellanea:misc.Mode8
ltx/en_us_dedes/me.m10.d28:alt1.meMA.Ode4C22.ode	@ltx/en_us_dedes/miscellanea:misc.Ode4
ltx/en_us_dedes/me.m10.d28:alt1.meMA.Ode4C22.text	
ltx/en_us_dedes/me.m10.d28:alt1.meMA.Ode4C23.incipit	…
ltx/en_us_dedes/me.m10.d28:alt1.meMA.Ode4C23.melody	@ltx/en_us_dedes/he.h.m8:heHE.SyMouIschys.name
ltx/en_us_dedes/me.m10.d28:alt1.meMA.Ode4C23.mode	@ltx/en_us_dedes/miscellanea:misc.Mode8
ltx/en_us_dedes/me.m10.d28:alt1.meMA.Ode4C23.ode	@ltx/en_us_dedes/miscellanea:misc.Ode4
ltx/en_us_dedes/me.m10.d28:alt1.meMA.Ode4C23.text	
ltx/en_us_dedes/me.m10.d28:alt1.meMA.Ode4C24.incipit	…
ltx/en_us_dedes/me.m10.d28:alt1.meMA.Ode4C24.melody	@ltx/en_us_dedes/he.h.m8:heHE.SyMouIschys.name
ltx/en_us_dedes/me.m10.d28:alt1.meMA.Ode4C24.mode	@ltx/en_us_dedes/miscellanea:misc.Mode8
ltx/en_us_dedes/me.m10.d28:alt1.meMA.Ode4C24.ode	@ltx/en_us_dedes/miscellanea:misc.Ode4
ltx/en_us_dedes/me.m10.d28:alt1.meMA.Ode4C24.text	
ltx/en_us_dedes/me.m10.d28:alt1.meMA.Ode5C11.greekmelody	@ltx/en_us_dedes/he.h.m4:heHE.ExestiTaSympanta.greekname
ltx/en_us_dedes/me.m10.d28:alt1.meMA.Ode5C11.incipit	…
ltx/en_us_dedes/me.m10.d28:alt1.meMA.Ode5C11.melody	@ltx/en_us_dedes/he.h.m4:heHE.ExestiTaSympanta.name
ltx/en_us_dedes/me.m10.d28:alt1.meMA.Ode5C11.mode	@ltx/en_us_dedes/miscellanea:misc.Mode4
ltx/en_us_dedes/me.m10.d28:alt1.meMA.Ode5C11.ode	@ltx/en_us_dedes/miscellanea:misc.Ode5
ltx/en_us_dedes/me.m10.d28:alt1.meMA.Ode5C11.text	
ltx/en_us_dedes/me.m10.d28:alt1.meMA.Ode5C12.incipit	…
ltx/en_us_dedes/me.m10.d28:alt1.meMA.Ode5C12.melody	@ltx/en_us_dedes/he.h.m4:heHE.ExestiTaSympanta.name
ltx/en_us_dedes/me.m10.d28:alt1.meMA.Ode5C12.mode	@ltx/en_us_dedes/miscellanea:misc.Mode4
ltx/en_us_dedes/me.m10.d28:alt1.meMA.Ode5C12.ode	@ltx/en_us_dedes/miscellanea:misc.Ode5
ltx/en_us_dedes/me.m10.d28:alt1.meMA.Ode5C12.text	
ltx/en_us_dedes/me.m10.d28:alt1.meMA.Ode5C13.incipit	…
ltx/en_us_dedes/me.m10.d28:alt1.meMA.Ode5C13.melody	@ltx/en_us_dedes/he.h.m4:heHE.ExestiTaSympanta.name
ltx/en_us_dedes/me.m10.d28:alt1.meMA.Ode5C13.mode	@ltx/en_us_dedes/miscellanea:misc.Mode4
ltx/en_us_dedes/me.m10.d28:alt1.meMA.Ode5C13.ode	@ltx/en_us_dedes/miscellanea:misc.Ode5
ltx/en_us_dedes/me.m10.d28:alt1.meMA.Ode5C13.text	
ltx/en_us_dedes/me.m10.d28:alt1.meMA.Ode5C14.incipit	…
ltx/en_us_dedes/me.m10.d28:alt1.meMA.Ode5C14.melody	@ltx/en_us_dedes/he.h.m4:heHE.ExestiTaSympanta.name
ltx/en_us_dedes/me.m10.d28:alt1.meMA.Ode5C14.mode	@ltx/en_us_dedes/miscellanea:misc.Mode4
ltx/en_us_dedes/me.m10.d28:alt1.meMA.Ode5C14.ode	@ltx/en_us_dedes/miscellanea:misc.Ode5
ltx/en_us_dedes/me.m10.d28:alt1.meMA.Ode5C14.text	
ltx/en_us_dedes/me.m10.d28:alt1.meMA.Ode5C1H.greekmelody	@ltx/en_us_dedes/he.h.m4:heHE.ExestiTaSympanta.greekname
ltx/en_us_dedes/me.m10.d28:alt1.meMA.Ode5C1H.incipit	@ltx/en_us_dedes/he.h.m4:heHE.ExestiTaSympanta.incipit
ltx/en_us_dedes/me.m10.d28:alt1.meMA.Ode5C1H.melody	@ltx/en_us_dedes/he.h.m4:heHE.ExestiTaSympanta.melody
ltx/en_us_dedes/me.m10.d28:alt1.meMA.Ode5C1H.mode	@ltx/en_us_dedes/miscellanea:misc.Mode4
ltx/en_us_dedes/me.m10.d28:alt1.meMA.Ode5C1H.ode	@ltx/en_us_dedes/miscellanea:misc.Ode5
ltx/en_us_dedes/me.m10.d28:alt1.meMA.Ode5C1H.text	@ltx/en_us_dedes/he.h.m4:heHE.ExestiTaSympanta.text
ltx/en_us_dedes/me.m10.d28:alt1.meMA.Ode5C21.greekmelody	@ltx/en_us_dedes/he.h.m8:heHE.InaTiMeAposo.greekname
ltx/en_us_dedes/me.m10.d28:alt1.meMA.Ode5C21.incipit	…
ltx/en_us_dedes/me.m10.d28:alt1.meMA.Ode5C21.melody	@ltx/en_us_dedes/he.h.m8:heHE.InaTiMeAposo.name
ltx/en_us_dedes/me.m10.d28:alt1.meMA.Ode5C21.mode	@ltx/en_us_dedes/miscellanea:misc.Mode8
ltx/en_us_dedes/me.m10.d28:alt1.meMA.Ode5C21.ode	@ltx/en_us_dedes/miscellanea:misc.Ode5
ltx/en_us_dedes/me.m10.d28:alt1.meMA.Ode5C21.text	
ltx/en_us_dedes/me.m10.d28:alt1.meMA.Ode5C22.incipit	…
ltx/en_us_dedes/me.m10.d28:alt1.meMA.Ode5C22.melody	@ltx/en_us_dedes/he.h.m8:heHE.InaTiMeAposo.name
ltx/en_us_dedes/me.m10.d28:alt1.meMA.Ode5C22.mode	@ltx/en_us_dedes/miscellanea:misc.Mode8
ltx/en_us_dedes/me.m10.d28:alt1.meMA.Ode5C22.ode	@ltx/en_us_dedes/miscellanea:misc.Ode5
ltx/en_us_dedes/me.m10.d28:alt1.meMA.Ode5C22.text	
ltx/en_us_dedes/me.m10.d28:alt1.meMA.Ode5C23.incipit	…
ltx/en_us_dedes/me.m10.d28:alt1.meMA.Ode5C23.melody	@ltx/en_us_dedes/he.h.m8:heHE.InaTiMeAposo.name
ltx/en_us_dedes/me.m10.d28:alt1.meMA.Ode5C23.mode	@ltx/en_us_dedes/miscellanea:misc.Mode8
ltx/en_us_dedes/me.m10.d28:alt1.meMA.Ode5C23.ode	@ltx/en_us_dedes/miscellanea:misc.Ode5
ltx/en_us_dedes/me.m10.d28:alt1.meMA.Ode5C23.text	
ltx/en_us_dedes/me.m10.d28:alt1.meMA.Ode5C24.incipit	…
ltx/en_us_dedes/me.m10.d28:alt1.meMA.Ode5C24.melody	@ltx/en_us_dedes/he.h.m8:heHE.InaTiMeAposo.name
ltx/en_us_dedes/me.m10.d28:alt1.meMA.Ode5C24.mode	@ltx/en_us_dedes/miscellanea:misc.Mode8
ltx/en_us_dedes/me.m10.d28:alt1.meMA.Ode5C24.ode	@ltx/en_us_dedes/miscellanea:misc.Ode5
ltx/en_us_dedes/me.m10.d28:alt1.meMA.Ode5C24.text	
ltx/en_us_dedes/me.m10.d28:alt1.meMA.Ode6C11.greekmelody	@ltx/en_us_dedes/he.h.m4:heHE.TinTheianTaftin.greekname
ltx/en_us_dedes/me.m10.d28:alt1.meMA.Ode6C11.incipit	…
ltx/en_us_dedes/me.m10.d28:alt1.meMA.Ode6C11.melody	@ltx/en_us_dedes/he.h.m4:heHE.TinTheianTaftin.name
ltx/en_us_dedes/me.m10.d28:alt1.meMA.Ode6C11.mode	@ltx/en_us_dedes/miscellanea:misc.Mode4
ltx/en_us_dedes/me.m10.d28:alt1.meMA.Ode6C11.ode	@ltx/en_us_dedes/miscellanea:misc.Ode6
ltx/en_us_dedes/me.m10.d28:alt1.meMA.Ode6C11.text	
ltx/en_us_dedes/me.m10.d28:alt1.meMA.Ode6C12.incipit	…
ltx/en_us_dedes/me.m10.d28:alt1.meMA.Ode6C12.melody	@ltx/en_us_dedes/he.h.m4:heHE.TinTheianTaftin.name
ltx/en_us_dedes/me.m10.d28:alt1.meMA.Ode6C12.mode	@ltx/en_us_dedes/miscellanea:misc.Mode4
ltx/en_us_dedes/me.m10.d28:alt1.meMA.Ode6C12.ode	@ltx/en_us_dedes/miscellanea:misc.Ode6
ltx/en_us_dedes/me.m10.d28:alt1.meMA.Ode6C12.text	
ltx/en_us_dedes/me.m10.d28:alt1.meMA.Ode6C13.incipit	…
ltx/en_us_dedes/me.m10.d28:alt1.meMA.Ode6C13.melody	@ltx/en_us_dedes/he.h.m4:heHE.TinTheianTaftin.name
ltx/en_us_dedes/me.m10.d28:alt1.meMA.Ode6C13.mode	@ltx/en_us_dedes/miscellanea:misc.Mode4
ltx/en_us_dedes/me.m10.d28:alt1.meMA.Ode6C13.ode	@ltx/en_us_dedes/miscellanea:misc.Ode6
ltx/en_us_dedes/me.m10.d28:alt1.meMA.Ode6C13.text	
ltx/en_us_dedes/me.m10.d28:alt1.meMA.Ode6C14.incipit	…
ltx/en_us_dedes/me.m10.d28:alt1.meMA.Ode6C14.melody	@ltx/en_us_dedes/he.h.m4:heHE.TinTheianTaftin.name
ltx/en_us_dedes/me.m10.d28:alt1.meMA.Ode6C14.mode	@ltx/en_us_dedes/miscellanea:misc.Mode4
ltx/en_us_dedes/me.m10.d28:alt1.meMA.Ode6C14.ode	@ltx/en_us_dedes/miscellanea:misc.Ode6
ltx/en_us_dedes/me.m10.d28:alt1.meMA.Ode6C14.text	
ltx/en_us_dedes/me.m10.d28:alt1.meMA.Ode6C1H.greekmelody	@ltx/en_us_dedes/he.h.m4:heHE.TinTheianTaftin.greekname
ltx/en_us_dedes/me.m10.d28:alt1.meMA.Ode6C1H.incipit	@ltx/en_us_dedes/he.h.m4:heHE.TinTheianTaftin.incipit
ltx/en_us_dedes/me.m10.d28:alt1.meMA.Ode6C1H.melody	@ltx/en_us_dedes/he.h.m4:heHE.TinTheianTaftin.melody
ltx/en_us_dedes/me.m10.d28:alt1.meMA.Ode6C1H.mode	@ltx/en_us_dedes/miscellanea:misc.Mode4
ltx/en_us_dedes/me.m10.d28:alt1.meMA.Ode6C1H.ode	@ltx/en_us_dedes/miscellanea:misc.Ode6
ltx/en_us_dedes/me.m10.d28:alt1.meMA.Ode6C1H.text	@ltx/en_us_dedes/he.h.m4:heHE.TinTheianTaftin.text
ltx/en_us_dedes/me.m10.d28:alt1.meMA.Ode6C21.greekmelody	@ltx/en_us_dedes/he.h.m8:heHE.IlasthitiMoiSotir.greekname
ltx/en_us_dedes/me.m10.d28:alt1.meMA.Ode6C21.incipit	…
ltx/en_us_dedes/me.m10.d28:alt1.meMA.Ode6C21.melody	@ltx/en_us_dedes/he.h.m8:heHE.IlasthitiMoiSotir.name
ltx/en_us_dedes/me.m10.d28:alt1.meMA.Ode6C21.mode	@ltx/en_us_dedes/miscellanea:misc.Mode8
ltx/en_us_dedes/me.m10.d28:alt1.meMA.Ode6C21.ode	@ltx/en_us_dedes/miscellanea:misc.Ode6
ltx/en_us_dedes/me.m10.d28:alt1.meMA.Ode6C21.text	
ltx/en_us_dedes/me.m10.d28:alt1.meMA.Ode6C22.incipit	…
ltx/en_us_dedes/me.m10.d28:alt1.meMA.Ode6C22.melody	@ltx/en_us_dedes/he.h.m8:heHE.IlasthitiMoiSotir.name
ltx/en_us_dedes/me.m10.d28:alt1.meMA.Ode6C22.mode	@ltx/en_us_dedes/miscellanea:misc.Mode8
ltx/en_us_dedes/me.m10.d28:alt1.meMA.Ode6C22.ode	@ltx/en_us_dedes/miscellanea:misc.Ode6
ltx/en_us_dedes/me.m10.d28:alt1.meMA.Ode6C22.text	
ltx/en_us_dedes/me.m10.d28:alt1.meMA.Ode6C23.incipit	…
ltx/en_us_dedes/me.m10.d28:alt1.meMA.Ode6C23.melody	@ltx/en_us_dedes/he.h.m8:heHE.IlasthitiMoiSotir.name
ltx/en_us_dedes/me.m10.d28:alt1.meMA.Ode6C23.mode	@ltx/en_us_dedes/miscellanea:misc.Mode8
ltx/en_us_dedes/me.m10.d28:alt1.meMA.Ode6C23.ode	@ltx/en_us_dedes/miscellanea:misc.Ode6
ltx/en_us_dedes/me.m10.d28:alt1.meMA.Ode6C23.text	
ltx/en_us_dedes/me.m10.d28:alt1.meMA.Ode6C24.incipit	…
ltx/en_us_dedes/me.m10.d28:alt1.meMA.Ode6C24.melody	@ltx/en_us_dedes/he.h.m8:heHE.IlasthitiMoiSotir.name
ltx/en_us_dedes/me.m10.d28:alt1.meMA.Ode6C24.mode	@ltx/en_us_dedes/miscellanea:misc.Mode8
ltx/en_us_dedes/me.m10.d28:alt1.meMA.Ode6C24.ode	@ltx/en_us_dedes/miscellanea:misc.Ode6
ltx/en_us_dedes/me.m10.d28:alt1.meMA.Ode6C24.text	
ltx/en_us_dedes/me.m10.d28:alt1.meMA.Ode7C11.greekmelody	@ltx/en_us_dedes/he.h.m4:heHE.OukElatrefsan.greekname
ltx/en_us_dedes/me.m10.d28:alt1.meMA.Ode7C11.incipit	…
ltx/en_us_dedes/me.m10.d28:alt1.meMA.Ode7C11.melody	@ltx/en_us_dedes/he.h.m4:heHE.OukElatrefsan.name
ltx/en_us_dedes/me.m10.d28:alt1.meMA.Ode7C11.mode	@ltx/en_us_dedes/miscellanea:misc.Mode4
ltx/en_us_dedes/me.m10.d28:alt1.meMA.Ode7C11.ode	@ltx/en_us_dedes/miscellanea:misc.Ode7
ltx/en_us_dedes/me.m10.d28:alt1.meMA.Ode7C11.text	
ltx/en_us_dedes/me.m10.d28:alt1.meMA.Ode7C12.incipit	…
ltx/en_us_dedes/me.m10.d28:alt1.meMA.Ode7C12.melody	@ltx/en_us_dedes/he.h.m4:heHE.OukElatrefsan.name
ltx/en_us_dedes/me.m10.d28:alt1.meMA.Ode7C12.mode	@ltx/en_us_dedes/miscellanea:misc.Mode4
ltx/en_us_dedes/me.m10.d28:alt1.meMA.Ode7C12.ode	@ltx/en_us_dedes/miscellanea:misc.Ode7
ltx/en_us_dedes/me.m10.d28:alt1.meMA.Ode7C12.text	
ltx/en_us_dedes/me.m10.d28:alt1.meMA.Ode7C13.incipit	…
ltx/en_us_dedes/me.m10.d28:alt1.meMA.Ode7C13.melody	@ltx/en_us_dedes/he.h.m4:heHE.OukElatrefsan.name
ltx/en_us_dedes/me.m10.d28:alt1.meMA.Ode7C13.mode	@ltx/en_us_dedes/miscellanea:misc.Mode4
ltx/en_us_dedes/me.m10.d28:alt1.meMA.Ode7C13.ode	@ltx/en_us_dedes/miscellanea:misc.Ode7
ltx/en_us_dedes/me.m10.d28:alt1.meMA.Ode7C13.text	
ltx/en_us_dedes/me.m10.d28:alt1.meMA.Ode7C14.incipit	…
ltx/en_us_dedes/me.m10.d28:alt1.meMA.Ode7C14.melody	@ltx/en_us_dedes/he.h.m4:heHE.OukElatrefsan.name
ltx/en_us_dedes/me.m10.d28:alt1.meMA.Ode7C14.mode	@ltx/en_us_dedes/miscellanea:misc.Mode4
ltx/en_us_dedes/me.m10.d28:alt1.meMA.Ode7C14.ode	@ltx/en_us_dedes/miscellanea:misc.Ode7
ltx/en_us_dedes/me.m10.d28:alt1.meMA.Ode7C14.text	
ltx/en_us_dedes/me.m10.d28:alt1.meMA.Ode7C1H.greekmelody	@ltx/en_us_dedes/he.h.m4:heHE.OukElatrefsan.greekname
ltx/en_us_dedes/me.m10.d28:alt1.meMA.Ode7C1H.incipit	@ltx/en_us_dedes/he.h.m4:heHE.OukElatrefsan.incipit
ltx/en_us_dedes/me.m10.d28:alt1.meMA.Ode7C1H.melody	@ltx/en_us_dedes/he.h.m4:heHE.OukElatrefsan.melody
ltx/en_us_dedes/me.m10.d28:alt1.meMA.Ode7C1H.mode	@ltx/en_us_dedes/miscellanea:misc.Mode4
ltx/en_us_dedes/me.m10.d28:alt1.meMA.Ode7C1H.ode	@ltx/en_us_dedes/miscellanea:misc.Ode7
ltx/en_us_dedes/me.m10.d28:alt1.meMA.Ode7C1H.text	@ltx/en_us_dedes/he.h.m4:heHE.OukElatrefsan.text
ltx/en_us_dedes/me.m10.d28:alt1.meMA.Ode7C21.greekmelody	@ltx/en_us_dedes/he.h.m8:heHE.TheouSynkatavasin.greekname
ltx/en_us_dedes/me.m10.d28:alt1.meMA.Ode7C21.incipit	…
ltx/en_us_dedes/me.m10.d28:alt1.meMA.Ode7C21.melody	@ltx/en_us_dedes/he.h.m8:heHE.TheouSynkatavasin.name
ltx/en_us_dedes/me.m10.d28:alt1.meMA.Ode7C21.mode	@ltx/en_us_dedes/miscellanea:misc.Mode8
ltx/en_us_dedes/me.m10.d28:alt1.meMA.Ode7C21.ode	@ltx/en_us_dedes/miscellanea:misc.Ode7
ltx/en_us_dedes/me.m10.d28:alt1.meMA.Ode7C21.text	
ltx/en_us_dedes/me.m10.d28:alt1.meMA.Ode7C22.incipit	…
ltx/en_us_dedes/me.m10.d28:alt1.meMA.Ode7C22.melody	@ltx/en_us_dedes/he.h.m8:heHE.TheouSynkatavasin.name
ltx/en_us_dedes/me.m10.d28:alt1.meMA.Ode7C22.mode	@ltx/en_us_dedes/miscellanea:misc.Mode8
ltx/en_us_dedes/me.m10.d28:alt1.meMA.Ode7C22.ode	@ltx/en_us_dedes/miscellanea:misc.Ode7
ltx/en_us_dedes/me.m10.d28:alt1.meMA.Ode7C22.text	
ltx/en_us_dedes/me.m10.d28:alt1.meMA.Ode7C23.incipit	…
ltx/en_us_dedes/me.m10.d28:alt1.meMA.Ode7C23.melody	@ltx/en_us_dedes/he.h.m8:heHE.TheouSynkatavasin.name
ltx/en_us_dedes/me.m10.d28:alt1.meMA.Ode7C23.mode	@ltx/en_us_dedes/miscellanea:misc.Mode8
ltx/en_us_dedes/me.m10.d28:alt1.meMA.Ode7C23.ode	@ltx/en_us_dedes/miscellanea:misc.Ode7
ltx/en_us_dedes/me.m10.d28:alt1.meMA.Ode7C23.text	
ltx/en_us_dedes/me.m10.d28:alt1.meMA.Ode7C24.incipit	…
ltx/en_us_dedes/me.m10.d28:alt1.meMA.Ode7C24.melody	@ltx/en_us_dedes/he.h.m8:heHE.TheouSynkatavasin.name
ltx/en_us_dedes/me.m10.d28:alt1.meMA.Ode7C24.mode	@ltx/en_us_dedes/miscellanea:misc.Mode8
ltx/en_us_dedes/me.m10.d28:alt1.meMA.Ode7C24.ode	@ltx/en_us_dedes/miscellanea:misc.Ode7
ltx/en_us_dedes/me.m10.d28:alt1.meMA.Ode7C24.text	
ltx/en_us_dedes/me.m10.d28:alt1.meMA.Ode8C11.greekmelody	@ltx/en_us_dedes/he.h.m4:heHE.PaidasEvageis.greekname
ltx/en_us_dedes/me.m10.d28:alt1.meMA.Ode8C11.incipit	…
ltx/en_us_dedes/me.m10.d28:alt1.meMA.Ode8C11.melody	@ltx/en_us_dedes/he.h.m4:heHE.PaidasEvageis.name
ltx/en_us_dedes/me.m10.d28:alt1.meMA.Ode8C11.mode	@ltx/en_us_dedes/miscellanea:misc.Mode4
ltx/en_us_dedes/me.m10.d28:alt1.meMA.Ode8C11.ode	@ltx/en_us_dedes/miscellanea:misc.Ode8
ltx/en_us_dedes/me.m10.d28:alt1.meMA.Ode8C11.text	
ltx/en_us_dedes/me.m10.d28:alt1.meMA.Ode8C12.incipit	…
ltx/en_us_dedes/me.m10.d28:alt1.meMA.Ode8C12.melody	@ltx/en_us_dedes/he.h.m4:heHE.PaidasEvageis.name
ltx/en_us_dedes/me.m10.d28:alt1.meMA.Ode8C12.mode	@ltx/en_us_dedes/miscellanea:misc.Mode4
ltx/en_us_dedes/me.m10.d28:alt1.meMA.Ode8C12.ode	@ltx/en_us_dedes/miscellanea:misc.Ode8
ltx/en_us_dedes/me.m10.d28:alt1.meMA.Ode8C12.text	
ltx/en_us_dedes/me.m10.d28:alt1.meMA.Ode8C13.incipit	…
ltx/en_us_dedes/me.m10.d28:alt1.meMA.Ode8C13.melody	@ltx/en_us_dedes/he.h.m4:heHE.PaidasEvageis.name
ltx/en_us_dedes/me.m10.d28:alt1.meMA.Ode8C13.mode	@ltx/en_us_dedes/miscellanea:misc.Mode4
ltx/en_us_dedes/me.m10.d28:alt1.meMA.Ode8C13.ode	@ltx/en_us_dedes/miscellanea:misc.Ode8
ltx/en_us_dedes/me.m10.d28:alt1.meMA.Ode8C13.text	
ltx/en_us_dedes/me.m10.d28:alt1.meMA.Ode8C14.incipit	…
ltx/en_us_dedes/me.m10.d28:alt1.meMA.Ode8C14.melody	@ltx/en_us_dedes/he.h.m4:heHE.PaidasEvageis.name
ltx/en_us_dedes/me.m10.d28:alt1.meMA.Ode8C14.mode	@ltx/en_us_dedes/miscellanea:misc.Mode4
ltx/en_us_dedes/me.m10.d28:alt1.meMA.Ode8C14.ode	@ltx/en_us_dedes/miscellanea:misc.Ode8
ltx/en_us_dedes/me.m10.d28:alt1.meMA.Ode8C14.text	
ltx/en_us_dedes/me.m10.d28:alt1.meMA.Ode8C1H.greekmelody	@ltx/en_us_dedes/he.h.m4:heHE.PaidasEvageis.greekname
ltx/en_us_dedes/me.m10.d28:alt1.meMA.Ode8C1H.incipit	@ltx/en_us_dedes/he.h.m4:heHE.PaidasEvageis.incipit
ltx/en_us_dedes/me.m10.d28:alt1.meMA.Ode8C1H.melody	@ltx/en_us_dedes/he.h.m4:heHE.PaidasEvageis.melody
ltx/en_us_dedes/me.m10.d28:alt1.meMA.Ode8C1H.mode	@ltx/en_us_dedes/miscellanea:misc.Mode4
ltx/en_us_dedes/me.m10.d28:alt1.meMA.Ode8C1H.ode	@ltx/en_us_dedes/miscellanea:misc.Ode8
ltx/en_us_dedes/me.m10.d28:alt1.meMA.Ode8C1H.text	@ltx/en_us_dedes/he.h.m4:heHE.PaidasEvageis.text
ltx/en_us_dedes/me.m10.d28:alt1.meMA.Ode8C21.greekmelody	@ltx/en_us_dedes/he.h.m8:heHE.TonEnOreiAgio.greekname
ltx/en_us_dedes/me.m10.d28:alt1.meMA.Ode8C21.incipit	…
ltx/en_us_dedes/me.m10.d28:alt1.meMA.Ode8C21.melody	@ltx/en_us_dedes/he.h.m8:heHE.TonEnOreiAgio.name
ltx/en_us_dedes/me.m10.d28:alt1.meMA.Ode8C21.mode	@ltx/en_us_dedes/miscellanea:misc.Mode8
ltx/en_us_dedes/me.m10.d28:alt1.meMA.Ode8C21.ode	@ltx/en_us_dedes/miscellanea:misc.Ode8
ltx/en_us_dedes/me.m10.d28:alt1.meMA.Ode8C21.text	
ltx/en_us_dedes/me.m10.d28:alt1.meMA.Ode8C22.incipit	…
ltx/en_us_dedes/me.m10.d28:alt1.meMA.Ode8C22.melody	@ltx/en_us_dedes/he.h.m8:heHE.TonEnOreiAgio.name
ltx/en_us_dedes/me.m10.d28:alt1.meMA.Ode8C22.mode	@ltx/en_us_dedes/miscellanea:misc.Mode8
ltx/en_us_dedes/me.m10.d28:alt1.meMA.Ode8C22.ode	@ltx/en_us_dedes/miscellanea:misc.Ode8
ltx/en_us_dedes/me.m10.d28:alt1.meMA.Ode8C22.text	
ltx/en_us_dedes/me.m10.d28:alt1.meMA.Ode8C23.incipit	…
ltx/en_us_dedes/me.m10.d28:alt1.meMA.Ode8C23.melody	@ltx/en_us_dedes/he.h.m8:heHE.TonEnOreiAgio.name
ltx/en_us_dedes/me.m10.d28:alt1.meMA.Ode8C23.mode	@ltx/en_us_dedes/miscellanea:misc.Mode8
ltx/en_us_dedes/me.m10.d28:alt1.meMA.Ode8C23.ode	@ltx/en_us_dedes/miscellanea:misc.Ode8
ltx/en_us_dedes/me.m10.d28:alt1.meMA.Ode8C23.text	
ltx/en_us_dedes/me.m10.d28:alt1.meMA.Ode8C24.incipit	…
ltx/en_us_dedes/me.m10.d28:alt1.meMA.Ode8C24.melody	@ltx/en_us_dedes/he.h.m8:heHE.TonEnOreiAgio.name
ltx/en_us_dedes/me.m10.d28:alt1.meMA.Ode8C24.mode	@ltx/en_us_dedes/miscellanea:misc.Mode8
ltx/en_us_dedes/me.m10.d28:alt1.meMA.Ode8C24.ode	@ltx/en_us_dedes/miscellanea:misc.Ode8
ltx/en_us_dedes/me.m10.d28:alt1.meMA.Ode8C24.text	
ltx/en_us_dedes/me.m10.d28:alt1.meMA.Ode9C11.greekmelody	@ltx/en_us_dedes/he.h.m4:heHE.ApasGigenis.greekname
ltx/en_us_dedes/me.m10.d28:alt1.meMA.Ode9C11.incipit	…
ltx/en_us_dedes/me.m10.d28:alt1.meMA.Ode9C11.melody	@ltx/en_us_dedes/he.h.m4:heHE.ApasGigenis.name
ltx/en_us_dedes/me.m10.d28:alt1.meMA.Ode9C11.mode	@ltx/en_us_dedes/miscellanea:misc.Mode4
ltx/en_us_dedes/me.m10.d28:alt1.meMA.Ode9C11.ode	@ltx/en_us_dedes/miscellanea:misc.Ode9
ltx/en_us_dedes/me.m10.d28:alt1.meMA.Ode9C11.text	
ltx/en_us_dedes/me.m10.d28:alt1.meMA.Ode9C12.incipit	…
ltx/en_us_dedes/me.m10.d28:alt1.meMA.Ode9C12.melody	@ltx/en_us_dedes/he.h.m4:heHE.ApasGigenis.name
ltx/en_us_dedes/me.m10.d28:alt1.meMA.Ode9C12.mode	@ltx/en_us_dedes/miscellanea:misc.Mode4
ltx/en_us_dedes/me.m10.d28:alt1.meMA.Ode9C12.ode	@ltx/en_us_dedes/miscellanea:misc.Ode9
ltx/en_us_dedes/me.m10.d28:alt1.meMA.Ode9C12.text	
ltx/en_us_dedes/me.m10.d28:alt1.meMA.Ode9C13.incipit	…
ltx/en_us_dedes/me.m10.d28:alt1.meMA.Ode9C13.melody	@ltx/en_us_dedes/he.h.m4:heHE.ApasGigenis.name
ltx/en_us_dedes/me.m10.d28:alt1.meMA.Ode9C13.mode	@ltx/en_us_dedes/miscellanea:misc.Mode4
ltx/en_us_dedes/me.m10.d28:alt1.meMA.Ode9C13.ode	@ltx/en_us_dedes/miscellanea:misc.Ode9
ltx/en_us_dedes/me.m10.d28:alt1.meMA.Ode9C13.text	
ltx/en_us_dedes/me.m10.d28:alt1.meMA.Ode9C14.incipit	…
ltx/en_us_dedes/me.m10.d28:alt1.meMA.Ode9C14.melody	@ltx/en_us_dedes/he.h.m4:heHE.ApasGigenis.name
ltx/en_us_dedes/me.m10.d28:alt1.meMA.Ode9C14.mode	@ltx/en_us_dedes/miscellanea:misc.Mode4
ltx/en_us_dedes/me.m10.d28:alt1.meMA.Ode9C14.ode	@ltx/en_us_dedes/miscellanea:misc.Ode9
ltx/en_us_dedes/me.m10.d28:alt1.meMA.Ode9C14.text	
ltx/en_us_dedes/me.m10.d28:alt1.meMA.Ode9C1H.greekmelody	@ltx/en_us_dedes/he.h.m4:heHE.ApasGigenis.greekname
ltx/en_us_dedes/me.m10.d28:alt1.meMA.Ode9C1H.incipit	@ltx/en_us_dedes/he.h.m4:heHE.ApasGigenis.incipit
ltx/en_us_dedes/me.m10.d28:alt1.meMA.Ode9C1H.melody	@ltx/en_us_dedes/he.h.m4:heHE.ApasGigenis.melody
ltx/en_us_dedes/me.m10.d28:alt1.meMA.Ode9C1H.mode	@ltx/en_us_dedes/miscellanea:misc.Mode4
ltx/en_us_dedes/me.m10.d28:alt1.meMA.Ode9C1H.ode	@ltx/en_us_dedes/miscellanea:misc.Ode9
ltx/en_us_dedes/me.m10.d28:alt1.meMA.Ode9C1H.text	@ltx/en_us_dedes/he.h.m4:heHE.ApasGigenis.text
ltx/en_us_dedes/me.m10.d28:alt1.meMA.Ode9C1M01.incipit	…
ltx/en_us_dedes/me.m10.d28:alt1.meMA.Ode9C1M01.text	
ltx/en_us_dedes/me.m10.d28:alt1.meMA.Ode9C1M02.incipit	…
ltx/en_us_dedes/me.m10.d28:alt1.meMA.Ode9C1M02.text	
ltx/en_us_dedes/me.m10.d28:alt1.meMA.Ode9C1M03.incipit	…
ltx/en_us_dedes/me.m10.d28:alt1.meMA.Ode9C1M03.text	
ltx/en_us_dedes/me.m10.d28:alt1.meMA.Ode9C1M04.incipit	…
ltx/en_us_dedes/me.m10.d28:alt1.meMA.Ode9C1M04.text	
ltx/en_us_dedes/me.m10.d28:alt1.meMA.Ode9C1M05.incipit	…
ltx/en_us_dedes/me.m10.d28:alt1.meMA.Ode9C1M05.text	
ltx/en_us_dedes/me.m10.d28:alt1.meMA.Ode9C21.greekmelody	@ltx/en_us_dedes/he.h.m8:heHE.ExestiEpiTouto.greekname
ltx/en_us_dedes/me.m10.d28:alt1.meMA.Ode9C21.incipit	…
ltx/en_us_dedes/me.m10.d28:alt1.meMA.Ode9C21.melody	@ltx/en_us_dedes/he.h.m8:heHE.ExestiEpiTouto.name
ltx/en_us_dedes/me.m10.d28:alt1.meMA.Ode9C21.mode	@ltx/en_us_dedes/miscellanea:misc.Mode8
ltx/en_us_dedes/me.m10.d28:alt1.meMA.Ode9C21.ode	@ltx/en_us_dedes/miscellanea:misc.Ode9
ltx/en_us_dedes/me.m10.d28:alt1.meMA.Ode9C21.text	
ltx/en_us_dedes/me.m10.d28:alt1.meMA.Ode9C22.incipit	…
ltx/en_us_dedes/me.m10.d28:alt1.meMA.Ode9C22.melody	@ltx/en_us_dedes/he.h.m8:heHE.ExestiEpiTouto.name
ltx/en_us_dedes/me.m10.d28:alt1.meMA.Ode9C22.mode	@ltx/en_us_dedes/miscellanea:misc.Mode8
ltx/en_us_dedes/me.m10.d28:alt1.meMA.Ode9C22.ode	@ltx/en_us_dedes/miscellanea:misc.Ode9
ltx/en_us_dedes/me.m10.d28:alt1.meMA.Ode9C22.text	
ltx/en_us_dedes/me.m10.d28:alt1.meMA.Ode9C23.incipit	…
ltx/en_us_dedes/me.m10.d28:alt1.meMA.Ode9C23.melody	@ltx/en_us_dedes/he.h.m8:heHE.ExestiEpiTouto.name
ltx/en_us_dedes/me.m10.d28:alt1.meMA.Ode9C23.mode	@ltx/en_us_dedes/miscellanea:misc.Mode8
ltx/en_us_dedes/me.m10.d28:alt1.meMA.Ode9C23.ode	@ltx/en_us_dedes/miscellanea:misc.Ode9
ltx/en_us_dedes/me.m10.d28:alt1.meMA.Ode9C23.text	
ltx/en_us_dedes/me.m10.d28:alt1.meMA.Ode9C24.incipit	…
ltx/en_us_dedes/me.m10.d28:alt1.meMA.Ode9C24.melody	@ltx/en_us_dedes/he.h.m8:heHE.ExestiEpiTouto.name
ltx/en_us_dedes/me.m10.d28:alt1.meMA.Ode9C24.mode	@ltx/en_us_dedes/miscellanea:misc.Mode8
ltx/en_us_dedes/me.m10.d28:alt1.meMA.Ode9C24.ode	@ltx/en_us_dedes/miscellanea:misc.Ode9
ltx/en_us_dedes/me.m10.d28:alt1.meMA.Ode9C24.text	
ltx/en_us_dedes/me.m10.d28:alt1.meMA.Ode9C2M01.incipit	…
ltx/en_us_dedes/me.m10.d28:alt1.meMA.Ode9C2M01.text	
ltx/en_us_dedes/me.m10.d28:alt1.meMA.Ode9C2M02.incipit	…
ltx/en_us_dedes/me.m10.d28:alt1.meMA.Ode9C2M02.text	
ltx/en_us_dedes/me.m10.d28:alt1.meMA.Ode9C2M03.incipit	…
ltx/en_us_dedes/me.m10.d28:alt1.meMA.Ode9C2M03.text	
ltx/en_us_dedes/me.m10.d28:alt1.meMA.Ode9C2M04.incipit	…
ltx/en_us_dedes/me.m10.d28:alt1.meMA.Ode9C2M04.text	
ltx/en_us_dedes/me.m10.d28:alt1.meMA.Oikos1.text	
ltx/en_us_dedes/me.m10.d28:alt1.meMA.Oikos12.text	
ltx/en_us_dedes/me.m10.d28:alt1.meMA.Oikos13.text	
ltx/en_us_dedes/me.m10.d28:alt1.meMA.Oikos14.text	
ltx/en_us_dedes/me.m10.d28:alt1.meMA.Oikos15.text	
ltx/en_us_dedes/me.m10.d28:alt1.meMA.Oikos16.text	
ltx/en_us_dedes/me.m10.d28:alt1.meMA.Oikos17.text	
ltx/en_us_dedes/me.m10.d28:alt1.meMA.Oikos18.text	
ltx/en_us_dedes/me.m10.d28:alt1.meMA.PostGospelBoth.incipit	@ltx/en_us_dedes/ho.ho03:hoMA.PostGospelAllPureLady.incipit
ltx/en_us_dedes/me.m10.d28:alt1.meMA.PostGospelBoth.melody	
ltx/en_us_dedes/me.m10.d28:alt1.meMA.PostGospelBoth.mode	@ltx/en_us_dedes/miscellanea:misc.Mode2
ltx/en_us_dedes/me.m10.d28:alt1.meMA.PostGospelBoth.text	@ltx/en_us_dedes/ho.ho03:hoMA.PostGospelAllPureLady.text
ltx/en_us_dedes/me.m10.d28:alt1.meMA.PostGospelGlory.incipit	@ltx/en_us_dedes/ho.ho03:hoMA.PostGospelTheotokos.incipit
ltx/en_us_dedes/me.m10.d28:alt1.meMA.PostGospelGlory.melody	
ltx/en_us_dedes/me.m10.d28:alt1.meMA.PostGospelGlory.mode	@ltx/en_us_dedes/miscellanea:misc.Mode2
ltx/en_us_dedes/me.m10.d28:alt1.meMA.PostGospelGlory.text	@ltx/en_us_dedes/ho.ho03:hoMA.PostGospelTheotokos.text
ltx/en_us_dedes/me.m10.d28:alt1.meMA.PostGospelIdiomelon.incipit	…
ltx/en_us_dedes/me.m10.d28:alt1.meMA.PostGospelIdiomelon.melody	
ltx/en_us_dedes/me.m10.d28:alt1.meMA.PostGospelIdiomelon.mode	@ltx/en_us_dedes/miscellanea:misc.Mode6
ltx/en_us_dedes/me.m10.d28:alt1.meMA.PostGospelIdiomelon.text	
ltx/en_us_dedes/me.m10.d28:alt1.meSV.AposBoth.incipit	…
ltx/en_us_dedes/me.m10.d28:alt1.meSV.AposBoth.melody	@ltx/en_us_dedes/he.a.m2:heAU.OikosTouEfratha.name
ltx/en_us_dedes/me.m10.d28:alt1.meSV.AposBoth.mode	@ltx/en_us_dedes/miscellanea:misc.Mode2
ltx/en_us_dedes/me.m10.d28:alt1.meSV.AposBoth.text	
ltx/en_us_dedes/me.m10.d28:alt1.meSV.AposGlory.incipit	…
ltx/en_us_dedes/me.m10.d28:alt1.meSV.AposGlory.melody	@ltx/en_us_dedes/he.a.m2:heAU.OikosTouEfratha.name
ltx/en_us_dedes/me.m10.d28:alt1.meSV.AposGlory.mode	@ltx/en_us_dedes/miscellanea:misc.Mode2
ltx/en_us_dedes/me.m10.d28:alt1.meSV.AposGlory.text	
ltx/en_us_dedes/me.m10.d28:alt1.meSV.Aposticha1.greekmelody	@ltx/en_us_dedes/he.a.m2:heAU.OikosTouEfratha.greekname
ltx/en_us_dedes/me.m10.d28:alt1.meSV.Aposticha1.incipit	…
ltx/en_us_dedes/me.m10.d28:alt1.meSV.Aposticha1.melody	@ltx/en_us_dedes/he.a.m2:heAU.OikosTouEfratha.name
ltx/en_us_dedes/me.m10.d28:alt1.meSV.Aposticha1.mode	@ltx/en_us_dedes/miscellanea:misc.Mode2
ltx/en_us_dedes/me.m10.d28:alt1.meSV.Aposticha1.text	
ltx/en_us_dedes/me.m10.d28:alt1.meSV.Aposticha2.incipit	…
ltx/en_us_dedes/me.m10.d28:alt1.meSV.Aposticha2.melody	@ltx/en_us_dedes/he.a.m2:heAU.OikosTouEfratha.name
ltx/en_us_dedes/me.m10.d28:alt1.meSV.Aposticha2.mode	@ltx/en_us_dedes/miscellanea:misc.Mode2
ltx/en_us_dedes/me.m10.d28:alt1.meSV.Aposticha2.text	
ltx/en_us_dedes/me.m10.d28:alt1.meSV.Aposticha3.incipit	…
ltx/en_us_dedes/me.m10.d28:alt1.meSV.Aposticha3.melody	@ltx/en_us_dedes/he.a.m2:heAU.OikosTouEfratha.name
ltx/en_us_dedes/me.m10.d28:alt1.meSV.Aposticha3.mode	@ltx/en_us_dedes/miscellanea:misc.Mode2
ltx/en_us_dedes/me.m10.d28:alt1.meSV.Aposticha3.text	
ltx/en_us_dedes/me.m10.d28:alt1.meSV.SticGlory.incipit	…
ltx/en_us_dedes/me.m10.d28:alt1.meSV.SticGlory.melody	
ltx/en_us_dedes/me.m10.d28:alt1.meSV.SticGlory.mode	@ltx/en_us_dedes/miscellanea:misc.Mode1
ltx/en_us_dedes/me.m10.d28:alt1.meSV.SticGlory.text	
ltx/en_us_dedes/me.m10.d28:alt1.meSV.Stichera1.greekmelody	@ltx/en_us_dedes/he.a.m1:heAU.TonOuranionTagmaton.greekname
ltx/en_us_dedes/me.m10.d28:alt1.meSV.Stichera1.incipit	…
ltx/en_us_dedes/me.m10.d28:alt1.meSV.Stichera1.melody	@ltx/en_us_dedes/he.a.m1:heAU.TonOuranionTagmaton.name
ltx/en_us_dedes/me.m10.d28:alt1.meSV.Stichera1.mode	@ltx/en_us_dedes/miscellanea:misc.Mode1
ltx/en_us_dedes/me.m10.d28:alt1.meSV.Stichera1.text	
ltx/en_us_dedes/me.m10.d28:alt1.meSV.Stichera2.incipit	…
ltx/en_us_dedes/me.m10.d28:alt1.meSV.Stichera2.melody	@ltx/en_us_dedes/he.a.m1:heAU.TonOuranionTagmaton.name
ltx/en_us_dedes/me.m10.d28:alt1.meSV.Stichera2.mode	@ltx/en_us_dedes/miscellanea:misc.Mode1
ltx/en_us_dedes/me.m10.d28:alt1.meSV.Stichera2.text	
ltx/en_us_dedes/me.m10.d28:alt1.meSV.Stichera3.incipit	…
ltx/en_us_dedes/me.m10.d28:alt1.meSV.Stichera3.melody	@ltx/en_us_dedes/he.a.m1:heAU.TonOuranionTagmaton.name
ltx/en_us_dedes/me.m10.d28:alt1.meSV.Stichera3.mode	@ltx/en_us_dedes/miscellanea:misc.Mode1
ltx/en_us_dedes/me.m10.d28:alt1.meSV.Stichera3.text	
ltx/en_us_dedes/me.m10.d28:alt1.meSV.Stichera4.greekmelody	@ltx/en_us_dedes/he.a.m1:heAU.TonOuranionTagmaton.greekname
ltx/en_us_dedes/me.m10.d28:alt1.meSV.Stichera4.incipit	…
ltx/en_us_dedes/me.m10.d28:alt1.meSV.Stichera4.melody	@ltx/en_us_dedes/he.a.m1:heAU.TonOuranionTagmaton.name
ltx/en_us_dedes/me.m10.d28:alt1.meSV.Stichera4.mode	@ltx/en_us_dedes/miscellanea:misc.Mode1
ltx/en_us_dedes/me.m10.d28:alt1.meSV.Stichera4.text	
ltx/en_us_dedes/me.m10.d28:alt1.meVE.Apolytikion1.greekmelody	@ltx/en_us_dedes/he.a.m1:heAU.TisErimouPolitis.greekname
ltx/en_us_dedes/me.m10.d28:alt1.meVE.Apolytikion1.incipit	…
ltx/en_us_dedes/me.m10.d28:alt1.meVE.Apolytikion1.melody	@ltx/en_us_dedes/he.a.m1:heAU.TisErimouPolitis.name
ltx/en_us_dedes/me.m10.d28:alt1.meVE.Apolytikion1.mode	@ltx/en_us_dedes/miscellanea:misc.Mode1
ltx/en_us_dedes/me.m10.d28:alt1.meVE.Apolytikion1.text	
ltx/en_us_dedes/me.m10.d28:alt1.meVE.Apolytikion2.incipit	…
ltx/en_us_dedes/me.m10.d28:alt1.meVE.Apolytikion2.melody	
ltx/en_us_dedes/me.m10.d28:alt1.meVE.Apolytikion2.mode	@ltx/en_us_dedes/miscellanea:misc.Mode8
ltx/en_us_dedes/me.m10.d28:alt1.meVE.Apolytikion2.text	
ltx/en_us_dedes/me.m10.d28:alt1.meVE.AposGlory.incipit	…
ltx/en_us_dedes/me.m10.d28:alt1.meVE.AposGlory.melody	
ltx/en_us_dedes/me.m10.d28:alt1.meVE.AposGlory.mode	@ltx/en_us_dedes/miscellanea:misc.Mode8
ltx/en_us_dedes/me.m10.d28:alt1.meVE.AposGlory.text	
ltx/en_us_dedes/me.m10.d28:alt1.meVE.Aposticha1.greekmelody	@ltx/en_us_dedes/he.a.m5:heAU.ChairoisAskitikon.greekname
ltx/en_us_dedes/me.m10.d28:alt1.meVE.Aposticha1.incipit	…
ltx/en_us_dedes/me.m10.d28:alt1.meVE.Aposticha1.melody	@ltx/en_us_dedes/he.a.m5:heAU.ChairoisAskitikon.name
ltx/en_us_dedes/me.m10.d28:alt1.meVE.Aposticha1.mode	@ltx/en_us_dedes/miscellanea:misc.Mode5
ltx/en_us_dedes/me.m10.d28:alt1.meVE.Aposticha1.text	
ltx/en_us_dedes/me.m10.d28:alt1.meVE.Aposticha2.incipit	…
ltx/en_us_dedes/me.m10.d28:alt1.meVE.Aposticha2.melody	@ltx/en_us_dedes/he.a.m5:heAU.ChairoisAskitikon.name
ltx/en_us_dedes/me.m10.d28:alt1.meVE.Aposticha2.mode	@ltx/en_us_dedes/miscellanea:misc.Mode5
ltx/en_us_dedes/me.m10.d28:alt1.meVE.Aposticha2.text	
ltx/en_us_dedes/me.m10.d28:alt1.meVE.Aposticha3.incipit	…
ltx/en_us_dedes/me.m10.d28:alt1.meVE.Aposticha3.melody	@ltx/en_us_dedes/he.a.m5:heAU.ChairoisAskitikon.name
ltx/en_us_dedes/me.m10.d28:alt1.meVE.Aposticha3.mode	@ltx/en_us_dedes/miscellanea:misc.Mode5
ltx/en_us_dedes/me.m10.d28:alt1.meVE.Aposticha3.text	
ltx/en_us_dedes/me.m10.d28:alt1.meVE.Lity1.incipit	…
ltx/en_us_dedes/me.m10.d28:alt1.meVE.Lity1.melody	
ltx/en_us_dedes/me.m10.d28:alt1.meVE.Lity1.mode	@ltx/en_us_dedes/miscellanea:misc.Mode1
ltx/en_us_dedes/me.m10.d28:alt1.meVE.Lity1.text	
ltx/en_us_dedes/me.m10.d28:alt1.meVE.Lity2.incipit	…
ltx/en_us_dedes/me.m10.d28:alt1.meVE.Lity2.melody	
ltx/en_us_dedes/me.m10.d28:alt1.meVE.Lity2.mode	@ltx/en_us_dedes/miscellanea:misc.Mode2
ltx/en_us_dedes/me.m10.d28:alt1.meVE.Lity2.text	
ltx/en_us_dedes/me.m10.d28:alt1.meVE.Lity3.incipit	…
ltx/en_us_dedes/me.m10.d28:alt1.meVE.Lity3.melody	
ltx/en_us_dedes/me.m10.d28:alt1.meVE.Lity3.mode	@ltx/en_us_dedes/miscellanea:misc.Mode3
ltx/en_us_dedes/me.m10.d28:alt1.meVE.Lity3.text	
ltx/en_us_dedes/me.m10.d28:alt1.meVE.Lity4.incipit	…
ltx/en_us_dedes/me.m10.d28:alt1.meVE.Lity4.melody	
ltx/en_us_dedes/me.m10.d28:alt1.meVE.Lity4.mode	@ltx/en_us_dedes/miscellanea:misc.Mode4
ltx/en_us_dedes/me.m10.d28:alt1.meVE.Lity4.text	
ltx/en_us_dedes/me.m10.d28:alt1.meVE.LityGlory.incipit	…
ltx/en_us_dedes/me.m10.d28:alt1.meVE.LityGlory.melody	
ltx/en_us_dedes/me.m10.d28:alt1.meVE.LityGlory.mode	@ltx/en_us_dedes/miscellanea:misc.Mode5
ltx/en_us_dedes/me.m10.d28:alt1.meVE.LityGlory.text	
ltx/en_us_dedes/me.m10.d28:alt1.meVE.SticGlory.incipit	…
ltx/en_us_dedes/me.m10.d28:alt1.meVE.SticGlory.melody	
ltx/en_us_dedes/me.m10.d28:alt1.meVE.SticGlory.mode	@ltx/en_us_dedes/miscellanea:misc.Mode6
ltx/en_us_dedes/me.m10.d28:alt1.meVE.SticGlory.text	
ltx/en_us_dedes/me.m10.d28:alt1.meVE.Stichera01.greekmelody	@ltx/en_us_dedes/he.a.m1:heAU.OTouParadoxouThavmatos.greekname
ltx/en_us_dedes/me.m10.d28:alt1.meVE.Stichera01.incipit	…
ltx/en_us_dedes/me.m10.d28:alt1.meVE.Stichera01.melody	@ltx/en_us_dedes/he.a.m1:heAU.OTouParadoxouThavmatos.name
ltx/en_us_dedes/me.m10.d28:alt1.meVE.Stichera01.mode	@ltx/en_us_dedes/miscellanea:misc.Mode1
ltx/en_us_dedes/me.m10.d28:alt1.meVE.Stichera01.text	
ltx/en_us_dedes/me.m10.d28:alt1.meVE.Stichera02.incipit	…
ltx/en_us_dedes/me.m10.d28:alt1.meVE.Stichera02.melody	@ltx/en_us_dedes/he.a.m1:heAU.OTouParadoxouThavmatos.name
ltx/en_us_dedes/me.m10.d28:alt1.meVE.Stichera02.mode	@ltx/en_us_dedes/miscellanea:misc.Mode1
ltx/en_us_dedes/me.m10.d28:alt1.meVE.Stichera02.text	
ltx/en_us_dedes/me.m10.d28:alt1.meVE.Stichera03.incipit	…
ltx/en_us_dedes/me.m10.d28:alt1.meVE.Stichera03.melody	@ltx/en_us_dedes/he.a.m1:heAU.OTouParadoxouThavmatos.name
ltx/en_us_dedes/me.m10.d28:alt1.meVE.Stichera03.mode	@ltx/en_us_dedes/miscellanea:misc.Mode1
ltx/en_us_dedes/me.m10.d28:alt1.meVE.Stichera03.text	
ltx/en_us_dedes/me.m10.d28:alt1.meVE.Stichera04.greekmelody	@ltx/en_us_dedes/he.a.m4:heAU.OsGennaionEnMartysi.greekname
ltx/en_us_dedes/me.m10.d28:alt1.meVE.Stichera04.incipit	…
ltx/en_us_dedes/me.m10.d28:alt1.meVE.Stichera04.melody	@ltx/en_us_dedes/he.a.m4:heAU.OsGennaionEnMartysi.name
ltx/en_us_dedes/me.m10.d28:alt1.meVE.Stichera04.mode	@ltx/en_us_dedes/miscellanea:misc.Mode4
ltx/en_us_dedes/me.m10.d28:alt1.meVE.Stichera04.text	
ltx/en_us_dedes/me.m10.d28:alt1.meVE.Stichera05.greekmelody	@ltx/en_us_dedes/he.a.m4:heAU.OsGennaionEnMartysi.greekname
ltx/en_us_dedes/me.m10.d28:alt1.meVE.Stichera05.incipit	…
ltx/en_us_dedes/me.m10.d28:alt1.meVE.Stichera05.melody	@ltx/en_us_dedes/he.a.m4:heAU.OsGennaionEnMartysi.name
ltx/en_us_dedes/me.m10.d28:alt1.meVE.Stichera05.mode	@ltx/en_us_dedes/miscellanea:misc.Mode4
ltx/en_us_dedes/me.m10.d28:alt1.meVE.Stichera05.text	
ltx/en_us_dedes/me.m10.d28:alt1.meVE.Stichera06.incipit	…
ltx/en_us_dedes/me.m10.d28:alt1.meVE.Stichera06.melody	@ltx/en_us_dedes/he.a.m4:heAU.OsGennaionEnMartysi.name
ltx/en_us_dedes/me.m10.d28:alt1.meVE.Stichera06.mode	@ltx/en_us_dedes/miscellanea:misc.Mode4
ltx/en_us_dedes/me.m10.d28:alt1.meVE.Stichera06.text	
ltx/en_us_dedes/me.m10.d28:meDA.commemoration.first	Memory of the Holy Martyrs Terence and Neonilla and their Children
ltx/en_us_dedes/me.m10.d28:meDA.commemoration.first_name	
ltx/en_us_dedes/me.m10.d28:meDA.commemoration.first_short	Memory of the Holy Martyrs Terence and Neonilla and their Children
ltx/en_us_dedes/me.m10.d28:meDA.commemoration.first_title	@ltx/en_us_dedes/titles:ti.Martyrs
ltx/en_us_dedes/me.m10.d28:meDA.commemoration.full	Memory of the Holy Martyrs Terence and Neonilla and their Children; and our Devout Father Stephen of St. Savas Monastery.
ltx/en_us_dedes/me.m10.d28:meDA.commemoration.second_name	
ltx/en_us_dedes/me.m10.d28:meDA.commemoration.second_title	For St. Stephen.
ltx/en_us_dedes/me.m10.d28:meDA.date	October 28
ltx/en_us_dedes/me.m10.d28:meDA.fordate	for October 28
ltx/en_us_dedes/me.m10.d28:meDA.insert1	
ltx/en_us_dedes/me.m10.d28:meDA.insert2	
ltx/en_us_dedes/me.m10.d28:meDA.note	
ltx/en_us_dedes/me.m10.d28:meDA.pdfcoverdate	October 28,
ltx/en_us_dedes/me.m10.d28:meDA.pdfheaderdate	October 28
ltx/en_us_dedes/me.m10.d28:meHO.commemorations	
ltx/en_us_dedes/me.m10.d28:meHO.note1	
ltx/en_us_dedes/me.m10.d28:meHO.note2	
ltx/en_us_dedes/me.m10.d28:meHO.number	
ltx/en_us_dedes/me.m10.d28:meHO.rank	
ltx/en_us_dedes/me.m10.d28:meLE.commemoration1	
ltx/en_us_dedes/me.m10.d28:meLE.commemoration2	
ltx/en_us_dedes/me.m10.d28:meLI.Kontakion1.greekmelody	@ltx/en_us_dedes/me.m10.d28:meMA.Kontakion1.greekmelody
ltx/en_us_dedes/me.m10.d28:meLI.Kontakion1.incipit	@ltx/en_us_dedes/me.m10.d28:meMA.Kontakion1.incipit
ltx/en_us_dedes/me.m10.d28:meLI.Kontakion1.melody	@ltx/en_us_dedes/me.m10.d28:meMA.Kontakion1.melody
ltx/en_us_dedes/me.m10.d28:meLI.Kontakion1.mode	@ltx/en_us_dedes/me.m10.d28:meMA.Kontakion1.mode
ltx/en_us_dedes/me.m10.d28:meLI.Kontakion1.text	@ltx/en_us_dedes/me.m10.d28:meMA.Kontakion1.text
ltx/en_us_dedes/me.m10.d28:meLI.Megalynarion.text	
ltx/en_us_dedes/me.m10.d28:meMA.C1.title	@ltx/en_us_dedes/titles:ti.CanonMartyrs
ltx/en_us_dedes/me.m10.d28:meMA.C1.verse	@ltx/en_us_dedes/prayers:pr.verse_SaintsM.text
ltx/en_us_dedes/me.m10.d28:meMA.C2.acrostic.notice1	
ltx/en_us_dedes/me.m10.d28:meMA.C2.acrostic.text	
ltx/en_us_dedes/me.m10.d28:meMA.C2.acrostic.title	
ltx/en_us_dedes/me.m10.d28:meMA.C2.poet	@ltx/en_us_dedes/poets:po.Theofanous
ltx/en_us_dedes/me.m10.d28:meMA.C2.title	@ltx/en_us_dedes/titles:ti.CanonDevoutM
ltx/en_us_dedes/me.m10.d28:meMA.C2.verse	@ltx/en_us_dedes/prayers:pr.verse_DevoutMan.text
ltx/en_us_dedes/me.m10.d28:meMA.ExapTheotokion.incipit	Cease not to pray…
ltx/en_us_dedes/me.m10.d28:meMA.ExapTheotokion.melody	@ltx/en_us_dedes/he.a.m2:heAU.ToisMathitaisSynelthomen.name
ltx/en_us_dedes/me.m10.d28:meMA.ExapTheotokion.mode	@ltx/en_us_dedes/miscellanea:misc.Mode2
ltx/en_us_dedes/me.m10.d28:meMA.ExapTheotokion.text	Cease not to pray most earnestly * to the Lord who became flesh * from your pure blood, O undefiled * Virgin Mother, entreating * for us your unworthy servants, * that we find grace to help us * in time of need on Judgment Day * when He as God will judge all the human race, * meting out deserts according to merit; * for all of us in times of need * have you as our protectress.
ltx/en_us_dedes/me.m10.d28:meMA.Exaposteilarion1.greekmelody	@ltx/en_us_dedes/he.a.m2:heAU.ToisMathitaisSynelthomen.greekname
ltx/en_us_dedes/me.m10.d28:meMA.Exaposteilarion1.incipit	…
ltx/en_us_dedes/me.m10.d28:meMA.Exaposteilarion1.melody	@ltx/en_us_dedes/he.a.m2:heAU.ToisMathitaisSynelthomen.name
ltx/en_us_dedes/me.m10.d28:meMA.Exaposteilarion1.mode	@ltx/en_us_dedes/miscellanea:misc.Mode2
ltx/en_us_dedes/me.m10.d28:meMA.Exaposteilarion1.text	
ltx/en_us_dedes/me.m10.d28:meMA.Exaposteilarion2.greekmelody	@ltx/en_us_dedes/he.a.m2:heAU.ToisMathitaisSynelthomen.greekname
ltx/en_us_dedes/me.m10.d28:meMA.Exaposteilarion2.incipit	…
ltx/en_us_dedes/me.m10.d28:meMA.Exaposteilarion2.melody	@ltx/en_us_dedes/he.a.m2:heAU.ToisMathitaisSynelthomen.name
ltx/en_us_dedes/me.m10.d28:meMA.Exaposteilarion2.mode	@ltx/en_us_dedes/miscellanea:misc.Mode2
ltx/en_us_dedes/me.m10.d28:meMA.Exaposteilarion2.text	
ltx/en_us_dedes/me.m10.d28:meMA.Kontakion1.greekmelody	@ltx/en_us_dedes/he.a.m4:heAU.OYpsotheisEnToStavro.greekname
ltx/en_us_dedes/me.m10.d28:meMA.Kontakion1.incipit	…
ltx/en_us_dedes/me.m10.d28:meMA.Kontakion1.melody	@ltx/en_us_dedes/he.a.m4:heAU.OYpsotheisEnToStavro.name
ltx/en_us_dedes/me.m10.d28:meMA.Kontakion1.mode	@ltx/en_us_dedes/miscellanea:misc.Mode4
ltx/en_us_dedes/me.m10.d28:meMA.Kontakion1.text	
ltx/en_us_dedes/me.m10.d28:meMA.Ode1C11.greekmelody	@ltx/en_us_dedes/he.h.m4:heHE.AnoixoToStomaMou.greekname
ltx/en_us_dedes/me.m10.d28:meMA.Ode1C11.incipit	…
ltx/en_us_dedes/me.m10.d28:meMA.Ode1C11.melody	@ltx/en_us_dedes/he.h.m4:heHE.AnoixoToStomaMou.name
ltx/en_us_dedes/me.m10.d28:meMA.Ode1C11.mode	@ltx/en_us_dedes/miscellanea:misc.Mode4
ltx/en_us_dedes/me.m10.d28:meMA.Ode1C11.ode	@ltx/en_us_dedes/miscellanea:misc.Ode1
ltx/en_us_dedes/me.m10.d28:meMA.Ode1C11.text	
ltx/en_us_dedes/me.m10.d28:meMA.Ode1C12.incipit	…
ltx/en_us_dedes/me.m10.d28:meMA.Ode1C12.melody	@ltx/en_us_dedes/he.h.m4:heHE.AnoixoToStomaMou.name
ltx/en_us_dedes/me.m10.d28:meMA.Ode1C12.mode	@ltx/en_us_dedes/miscellanea:misc.Mode4
ltx/en_us_dedes/me.m10.d28:meMA.Ode1C12.ode	@ltx/en_us_dedes/miscellanea:misc.Ode1
ltx/en_us_dedes/me.m10.d28:meMA.Ode1C12.text	
ltx/en_us_dedes/me.m10.d28:meMA.Ode1C13.incipit	…
ltx/en_us_dedes/me.m10.d28:meMA.Ode1C13.melody	@ltx/en_us_dedes/he.h.m4:heHE.AnoixoToStomaMou.name
ltx/en_us_dedes/me.m10.d28:meMA.Ode1C13.mode	@ltx/en_us_dedes/miscellanea:misc.Mode4
ltx/en_us_dedes/me.m10.d28:meMA.Ode1C13.ode	@ltx/en_us_dedes/miscellanea:misc.Ode1
ltx/en_us_dedes/me.m10.d28:meMA.Ode1C13.text	
ltx/en_us_dedes/me.m10.d28:meMA.Ode1C1T.incipit	…
ltx/en_us_dedes/me.m10.d28:meMA.Ode1C1T.melody	@ltx/en_us_dedes/he.h.m4:heHE.AnoixoToStomaMou.name
ltx/en_us_dedes/me.m10.d28:meMA.Ode1C1T.mode	@ltx/en_us_dedes/miscellanea:misc.Mode4
ltx/en_us_dedes/me.m10.d28:meMA.Ode1C1T.ode	@ltx/en_us_dedes/miscellanea:misc.Ode1
ltx/en_us_dedes/me.m10.d28:meMA.Ode1C1T.text	
ltx/en_us_dedes/me.m10.d28:meMA.Ode1C21.greekmelody	@ltx/en_us_dedes/he.h.m2:heHE.EnVythoKatestrose.greekname
ltx/en_us_dedes/me.m10.d28:meMA.Ode1C21.incipit	…
ltx/en_us_dedes/me.m10.d28:meMA.Ode1C21.melody	@ltx/en_us_dedes/he.h.m2:heHE.EnVythoKatestrose.name
ltx/en_us_dedes/me.m10.d28:meMA.Ode1C21.mode	@ltx/en_us_dedes/miscellanea:misc.Mode2
ltx/en_us_dedes/me.m10.d28:meMA.Ode1C21.ode	@ltx/en_us_dedes/miscellanea:misc.Ode1
ltx/en_us_dedes/me.m10.d28:meMA.Ode1C21.text	
ltx/en_us_dedes/me.m10.d28:meMA.Ode1C22.incipit	…
ltx/en_us_dedes/me.m10.d28:meMA.Ode1C22.melody	@ltx/en_us_dedes/he.h.m2:heHE.EnVythoKatestrose.name
ltx/en_us_dedes/me.m10.d28:meMA.Ode1C22.mode	@ltx/en_us_dedes/miscellanea:misc.Mode2
ltx/en_us_dedes/me.m10.d28:meMA.Ode1C22.ode	@ltx/en_us_dedes/miscellanea:misc.Ode1
ltx/en_us_dedes/me.m10.d28:meMA.Ode1C22.text	
ltx/en_us_dedes/me.m10.d28:meMA.Ode1C23.incipit	…
ltx/en_us_dedes/me.m10.d28:meMA.Ode1C23.melody	@ltx/en_us_dedes/he.h.m2:heHE.EnVythoKatestrose.name
ltx/en_us_dedes/me.m10.d28:meMA.Ode1C23.mode	@ltx/en_us_dedes/miscellanea:misc.Mode2
ltx/en_us_dedes/me.m10.d28:meMA.Ode1C23.ode	@ltx/en_us_dedes/miscellanea:misc.Ode1
ltx/en_us_dedes/me.m10.d28:meMA.Ode1C23.text	
ltx/en_us_dedes/me.m10.d28:meMA.Ode1C2T.incipit	…
ltx/en_us_dedes/me.m10.d28:meMA.Ode1C2T.melody	@ltx/en_us_dedes/he.h.m2:heHE.EnVythoKatestrose.name
ltx/en_us_dedes/me.m10.d28:meMA.Ode1C2T.mode	@ltx/en_us_dedes/miscellanea:misc.Mode2
ltx/en_us_dedes/me.m10.d28:meMA.Ode1C2T.ode	@ltx/en_us_dedes/miscellanea:misc.Ode1
ltx/en_us_dedes/me.m10.d28:meMA.Ode1C2T.text	
ltx/en_us_dedes/me.m10.d28:meMA.Ode3C11.greekmelody	@ltx/en_us_dedes/he.h.m4:heHE.OukEnSofia.greekname
ltx/en_us_dedes/me.m10.d28:meMA.Ode3C11.incipit	…
ltx/en_us_dedes/me.m10.d28:meMA.Ode3C11.melody	@ltx/en_us_dedes/he.h.m4:heHE.OukEnSofia.name
ltx/en_us_dedes/me.m10.d28:meMA.Ode3C11.mode	@ltx/en_us_dedes/miscellanea:misc.Mode4
ltx/en_us_dedes/me.m10.d28:meMA.Ode3C11.ode	@ltx/en_us_dedes/miscellanea:misc.Ode3
ltx/en_us_dedes/me.m10.d28:meMA.Ode3C11.text	
ltx/en_us_dedes/me.m10.d28:meMA.Ode3C12.incipit	…
ltx/en_us_dedes/me.m10.d28:meMA.Ode3C12.melody	@ltx/en_us_dedes/he.h.m4:heHE.OukEnSofia.name
ltx/en_us_dedes/me.m10.d28:meMA.Ode3C12.mode	@ltx/en_us_dedes/miscellanea:misc.Mode4
ltx/en_us_dedes/me.m10.d28:meMA.Ode3C12.ode	@ltx/en_us_dedes/miscellanea:misc.Ode3
ltx/en_us_dedes/me.m10.d28:meMA.Ode3C12.text	
ltx/en_us_dedes/me.m10.d28:meMA.Ode3C13.incipit	…
ltx/en_us_dedes/me.m10.d28:meMA.Ode3C13.melody	@ltx/en_us_dedes/he.h.m4:heHE.OukEnSofia.name
ltx/en_us_dedes/me.m10.d28:meMA.Ode3C13.mode	@ltx/en_us_dedes/miscellanea:misc.Mode4
ltx/en_us_dedes/me.m10.d28:meMA.Ode3C13.ode	@ltx/en_us_dedes/miscellanea:misc.Ode3
ltx/en_us_dedes/me.m10.d28:meMA.Ode3C13.text	
ltx/en_us_dedes/me.m10.d28:meMA.Ode3C1T.incipit	…
ltx/en_us_dedes/me.m10.d28:meMA.Ode3C1T.melody	@ltx/en_us_dedes/he.h.m4:heHE.OukEnSofia.name
ltx/en_us_dedes/me.m10.d28:meMA.Ode3C1T.mode	@ltx/en_us_dedes/miscellanea:misc.Mode4
ltx/en_us_dedes/me.m10.d28:meMA.Ode3C1T.ode	@ltx/en_us_dedes/miscellanea:misc.Ode3
ltx/en_us_dedes/me.m10.d28:meMA.Ode3C1T.text	
ltx/en_us_dedes/me.m10.d28:meMA.Ode3C21.greekmelody	@ltx/en_us_dedes/he.h.m2:heHE.ExinthisenIErimos.greekname
ltx/en_us_dedes/me.m10.d28:meMA.Ode3C21.incipit	…
ltx/en_us_dedes/me.m10.d28:meMA.Ode3C21.melody	@ltx/en_us_dedes/he.h.m2:heHE.ExinthisenIErimos.name
ltx/en_us_dedes/me.m10.d28:meMA.Ode3C21.mode	@ltx/en_us_dedes/miscellanea:misc.Mode2
ltx/en_us_dedes/me.m10.d28:meMA.Ode3C21.ode	@ltx/en_us_dedes/miscellanea:misc.Ode3
ltx/en_us_dedes/me.m10.d28:meMA.Ode3C21.text	
ltx/en_us_dedes/me.m10.d28:meMA.Ode3C22.incipit	…
ltx/en_us_dedes/me.m10.d28:meMA.Ode3C22.melody	@ltx/en_us_dedes/he.h.m2:heHE.ExinthisenIErimos.name
ltx/en_us_dedes/me.m10.d28:meMA.Ode3C22.mode	@ltx/en_us_dedes/miscellanea:misc.Mode2
ltx/en_us_dedes/me.m10.d28:meMA.Ode3C22.ode	@ltx/en_us_dedes/miscellanea:misc.Ode3
ltx/en_us_dedes/me.m10.d28:meMA.Ode3C22.text	
ltx/en_us_dedes/me.m10.d28:meMA.Ode3C23.incipit	…
ltx/en_us_dedes/me.m10.d28:meMA.Ode3C23.melody	@ltx/en_us_dedes/he.h.m2:heHE.ExinthisenIErimos.name
ltx/en_us_dedes/me.m10.d28:meMA.Ode3C23.mode	@ltx/en_us_dedes/miscellanea:misc.Mode2
ltx/en_us_dedes/me.m10.d28:meMA.Ode3C23.ode	@ltx/en_us_dedes/miscellanea:misc.Ode3
ltx/en_us_dedes/me.m10.d28:meMA.Ode3C23.text	
ltx/en_us_dedes/me.m10.d28:meMA.Ode3C2T.incipit	…
ltx/en_us_dedes/me.m10.d28:meMA.Ode3C2T.melody	@ltx/en_us_dedes/he.h.m2:heHE.ExinthisenIErimos.name
ltx/en_us_dedes/me.m10.d28:meMA.Ode3C2T.mode	@ltx/en_us_dedes/miscellanea:misc.Mode2
ltx/en_us_dedes/me.m10.d28:meMA.Ode3C2T.ode	@ltx/en_us_dedes/miscellanea:misc.Ode3
ltx/en_us_dedes/me.m10.d28:meMA.Ode3C2T.text	
ltx/en_us_dedes/me.m10.d28:meMA.Ode3H.greekmelody	@ltx/en_us_dedes/he.h.m2:heHE.ExinthisenIErimos.greekname
ltx/en_us_dedes/me.m10.d28:meMA.Ode3H.incipit	@ltx/en_us_dedes/he.h.m2:heHE.ExinthisenIErimos.incipit
ltx/en_us_dedes/me.m10.d28:meMA.Ode3H.melody	@ltx/en_us_dedes/he.h.m2:heHE.ExinthisenIErimos.melody
ltx/en_us_dedes/me.m10.d28:meMA.Ode3H.mode	@ltx/en_us_dedes/miscellanea:misc.Mode2
ltx/en_us_dedes/me.m10.d28:meMA.Ode3H.ode	@ltx/en_us_dedes/miscellanea:misc.Ode3
ltx/en_us_dedes/me.m10.d28:meMA.Ode3H.text	@ltx/en_us_dedes/he.h.m2:heHE.ExinthisenIErimos.text
ltx/en_us_dedes/me.m10.d28:meMA.Ode3Kathisma1.greekmelody	@ltx/en_us_dedes/he.a.m8:heAU.TinSofianKaiLogon.greekname
ltx/en_us_dedes/me.m10.d28:meMA.Ode3Kathisma1.incipit	…
ltx/en_us_dedes/me.m10.d28:meMA.Ode3Kathisma1.melody	@ltx/en_us_dedes/he.a.m8:heAU.TinSofianKaiLogon.name
ltx/en_us_dedes/me.m10.d28:meMA.Ode3Kathisma1.mode	@ltx/en_us_dedes/miscellanea:misc.Mode8
ltx/en_us_dedes/me.m10.d28:meMA.Ode3Kathisma1.text	
ltx/en_us_dedes/me.m10.d28:meMA.Ode3Kathisma2.greekmelody	@ltx/en_us_dedes/he.a.m8:heAU.AnestisEkNekron.greekname
ltx/en_us_dedes/me.m10.d28:meMA.Ode3Kathisma2.incipit	…
ltx/en_us_dedes/me.m10.d28:meMA.Ode3Kathisma2.melody	@ltx/en_us_dedes/he.a.m8:heAU.AnestisEkNekron.name
ltx/en_us_dedes/me.m10.d28:meMA.Ode3Kathisma2.mode	@ltx/en_us_dedes/miscellanea:misc.Mode8
ltx/en_us_dedes/me.m10.d28:meMA.Ode3Kathisma2.text	
ltx/en_us_dedes/me.m10.d28:meMA.Ode3KathismaSt.incipit	…
ltx/en_us_dedes/me.m10.d28:meMA.Ode3KathismaSt.melody	@ltx/en_us_dedes/he.a.m8:heAU.AnestisEkNekron.name
ltx/en_us_dedes/me.m10.d28:meMA.Ode3KathismaSt.mode	@ltx/en_us_dedes/miscellanea:misc.Mode8
ltx/en_us_dedes/me.m10.d28:meMA.Ode3KathismaSt.text	
ltx/en_us_dedes/me.m10.d28:meMA.Ode3KathismaT.incipit	…
ltx/en_us_dedes/me.m10.d28:meMA.Ode3KathismaT.melody	@ltx/en_us_dedes/he.a.m8:heAU.AnestisEkNekron.name
ltx/en_us_dedes/me.m10.d28:meMA.Ode3KathismaT.mode	@ltx/en_us_dedes/miscellanea:misc.Mode8
ltx/en_us_dedes/me.m10.d28:meMA.Ode3KathismaT.text	
ltx/en_us_dedes/me.m10.d28:meMA.Ode4C11.greekmelody	@ltx/en_us_dedes/he.h.m4:heHE.EparthentaSeIdousa.greekname
ltx/en_us_dedes/me.m10.d28:meMA.Ode4C11.incipit	…
ltx/en_us_dedes/me.m10.d28:meMA.Ode4C11.melody	@ltx/en_us_dedes/he.h.m4:heHE.EparthentaSeIdousa.name
ltx/en_us_dedes/me.m10.d28:meMA.Ode4C11.mode	@ltx/en_us_dedes/miscellanea:misc.Mode4
ltx/en_us_dedes/me.m10.d28:meMA.Ode4C11.ode	@ltx/en_us_dedes/miscellanea:misc.Ode4
ltx/en_us_dedes/me.m10.d28:meMA.Ode4C11.text	
ltx/en_us_dedes/me.m10.d28:meMA.Ode4C12.incipit	…
ltx/en_us_dedes/me.m10.d28:meMA.Ode4C12.melody	@ltx/en_us_dedes/he.h.m4:heHE.EparthentaSeIdousa.name
ltx/en_us_dedes/me.m10.d28:meMA.Ode4C12.mode	@ltx/en_us_dedes/miscellanea:misc.Mode4
ltx/en_us_dedes/me.m10.d28:meMA.Ode4C12.ode	@ltx/en_us_dedes/miscellanea:misc.Ode4
ltx/en_us_dedes/me.m10.d28:meMA.Ode4C12.text	
ltx/en_us_dedes/me.m10.d28:meMA.Ode4C13.incipit	…
ltx/en_us_dedes/me.m10.d28:meMA.Ode4C13.melody	@ltx/en_us_dedes/he.h.m4:heHE.EparthentaSeIdousa.name
ltx/en_us_dedes/me.m10.d28:meMA.Ode4C13.mode	@ltx/en_us_dedes/miscellanea:misc.Mode4
ltx/en_us_dedes/me.m10.d28:meMA.Ode4C13.ode	@ltx/en_us_dedes/miscellanea:misc.Ode4
ltx/en_us_dedes/me.m10.d28:meMA.Ode4C13.text	
ltx/en_us_dedes/me.m10.d28:meMA.Ode4C1T.incipit	…
ltx/en_us_dedes/me.m10.d28:meMA.Ode4C1T.melody	@ltx/en_us_dedes/he.h.m4:heHE.EparthentaSeIdousa.name
ltx/en_us_dedes/me.m10.d28:meMA.Ode4C1T.mode	@ltx/en_us_dedes/miscellanea:misc.Mode4
ltx/en_us_dedes/me.m10.d28:meMA.Ode4C1T.ode	@ltx/en_us_dedes/miscellanea:misc.Ode4
ltx/en_us_dedes/me.m10.d28:meMA.Ode4C1T.text	
ltx/en_us_dedes/me.m10.d28:meMA.Ode4C21.greekmelody	@ltx/en_us_dedes/he.h.m2:heHE.ElilythasEkParthenou.greekname
ltx/en_us_dedes/me.m10.d28:meMA.Ode4C21.incipit	…
ltx/en_us_dedes/me.m10.d28:meMA.Ode4C21.melody	@ltx/en_us_dedes/he.h.m2:heHE.ElilythasEkParthenou.name
ltx/en_us_dedes/me.m10.d28:meMA.Ode4C21.mode	@ltx/en_us_dedes/miscellanea:misc.Mode2
ltx/en_us_dedes/me.m10.d28:meMA.Ode4C21.ode	@ltx/en_us_dedes/miscellanea:misc.Ode4
ltx/en_us_dedes/me.m10.d28:meMA.Ode4C21.text	
ltx/en_us_dedes/me.m10.d28:meMA.Ode4C22.incipit	…
ltx/en_us_dedes/me.m10.d28:meMA.Ode4C22.melody	@ltx/en_us_dedes/he.h.m2:heHE.ElilythasEkParthenou.name
ltx/en_us_dedes/me.m10.d28:meMA.Ode4C22.mode	@ltx/en_us_dedes/miscellanea:misc.Mode2
ltx/en_us_dedes/me.m10.d28:meMA.Ode4C22.ode	@ltx/en_us_dedes/miscellanea:misc.Ode4
ltx/en_us_dedes/me.m10.d28:meMA.Ode4C22.text	
ltx/en_us_dedes/me.m10.d28:meMA.Ode4C23.incipit	…
ltx/en_us_dedes/me.m10.d28:meMA.Ode4C23.melody	@ltx/en_us_dedes/he.h.m2:heHE.ElilythasEkParthenou.name
ltx/en_us_dedes/me.m10.d28:meMA.Ode4C23.mode	@ltx/en_us_dedes/miscellanea:misc.Mode2
ltx/en_us_dedes/me.m10.d28:meMA.Ode4C23.ode	@ltx/en_us_dedes/miscellanea:misc.Ode4
ltx/en_us_dedes/me.m10.d28:meMA.Ode4C23.text	
ltx/en_us_dedes/me.m10.d28:meMA.Ode4C2T.incipit	…
ltx/en_us_dedes/me.m10.d28:meMA.Ode4C2T.melody	@ltx/en_us_dedes/he.h.m2:heHE.ElilythasEkParthenou.name
ltx/en_us_dedes/me.m10.d28:meMA.Ode4C2T.mode	@ltx/en_us_dedes/miscellanea:misc.Mode2
ltx/en_us_dedes/me.m10.d28:meMA.Ode4C2T.ode	@ltx/en_us_dedes/miscellanea:misc.Ode4
ltx/en_us_dedes/me.m10.d28:meMA.Ode4C2T.text	
ltx/en_us_dedes/me.m10.d28:meMA.Ode5C11.greekmelody	@ltx/en_us_dedes/he.h.m4:heHE.SyKyrieMouFos.greekname
ltx/en_us_dedes/me.m10.d28:meMA.Ode5C11.incipit	…
ltx/en_us_dedes/me.m10.d28:meMA.Ode5C11.melody	@ltx/en_us_dedes/he.h.m4:heHE.SyKyrieMouFos.name
ltx/en_us_dedes/me.m10.d28:meMA.Ode5C11.mode	@ltx/en_us_dedes/miscellanea:misc.Mode4
ltx/en_us_dedes/me.m10.d28:meMA.Ode5C11.ode	@ltx/en_us_dedes/miscellanea:misc.Ode5
ltx/en_us_dedes/me.m10.d28:meMA.Ode5C11.text	
ltx/en_us_dedes/me.m10.d28:meMA.Ode5C12.incipit	…
ltx/en_us_dedes/me.m10.d28:meMA.Ode5C12.melody	@ltx/en_us_dedes/he.h.m4:heHE.SyKyrieMouFos.name
ltx/en_us_dedes/me.m10.d28:meMA.Ode5C12.mode	@ltx/en_us_dedes/miscellanea:misc.Mode4
ltx/en_us_dedes/me.m10.d28:meMA.Ode5C12.ode	@ltx/en_us_dedes/miscellanea:misc.Ode5
ltx/en_us_dedes/me.m10.d28:meMA.Ode5C12.text	
ltx/en_us_dedes/me.m10.d28:meMA.Ode5C13.incipit	…
ltx/en_us_dedes/me.m10.d28:meMA.Ode5C13.melody	@ltx/en_us_dedes/he.h.m4:heHE.SyKyrieMouFos.name
ltx/en_us_dedes/me.m10.d28:meMA.Ode5C13.mode	@ltx/en_us_dedes/miscellanea:misc.Mode4
ltx/en_us_dedes/me.m10.d28:meMA.Ode5C13.ode	@ltx/en_us_dedes/miscellanea:misc.Ode5
ltx/en_us_dedes/me.m10.d28:meMA.Ode5C13.text	
ltx/en_us_dedes/me.m10.d28:meMA.Ode5C1T.incipit	…
ltx/en_us_dedes/me.m10.d28:meMA.Ode5C1T.melody	@ltx/en_us_dedes/he.h.m4:heHE.SyKyrieMouFos.name
ltx/en_us_dedes/me.m10.d28:meMA.Ode5C1T.mode	@ltx/en_us_dedes/miscellanea:misc.Mode4
ltx/en_us_dedes/me.m10.d28:meMA.Ode5C1T.ode	@ltx/en_us_dedes/miscellanea:misc.Ode5
ltx/en_us_dedes/me.m10.d28:meMA.Ode5C1T.text	
ltx/en_us_dedes/me.m10.d28:meMA.Ode5C21.greekmelody	@ltx/en_us_dedes/he.h.m2:heHE.MesitisTheou.greekname
ltx/en_us_dedes/me.m10.d28:meMA.Ode5C21.incipit	…
ltx/en_us_dedes/me.m10.d28:meMA.Ode5C21.melody	@ltx/en_us_dedes/he.h.m2:heHE.MesitisTheou.name
ltx/en_us_dedes/me.m10.d28:meMA.Ode5C21.mode	@ltx/en_us_dedes/miscellanea:misc.Mode2
ltx/en_us_dedes/me.m10.d28:meMA.Ode5C21.ode	@ltx/en_us_dedes/miscellanea:misc.Ode5
ltx/en_us_dedes/me.m10.d28:meMA.Ode5C21.text	
ltx/en_us_dedes/me.m10.d28:meMA.Ode5C22.incipit	…
ltx/en_us_dedes/me.m10.d28:meMA.Ode5C22.melody	@ltx/en_us_dedes/he.h.m2:heHE.MesitisTheou.name
ltx/en_us_dedes/me.m10.d28:meMA.Ode5C22.mode	@ltx/en_us_dedes/miscellanea:misc.Mode2
ltx/en_us_dedes/me.m10.d28:meMA.Ode5C22.ode	@ltx/en_us_dedes/miscellanea:misc.Ode5
ltx/en_us_dedes/me.m10.d28:meMA.Ode5C22.text	
ltx/en_us_dedes/me.m10.d28:meMA.Ode5C23.incipit	…
ltx/en_us_dedes/me.m10.d28:meMA.Ode5C23.melody	@ltx/en_us_dedes/he.h.m2:heHE.MesitisTheou.name
ltx/en_us_dedes/me.m10.d28:meMA.Ode5C23.mode	@ltx/en_us_dedes/miscellanea:misc.Mode2
ltx/en_us_dedes/me.m10.d28:meMA.Ode5C23.ode	@ltx/en_us_dedes/miscellanea:misc.Ode5
ltx/en_us_dedes/me.m10.d28:meMA.Ode5C23.text	
ltx/en_us_dedes/me.m10.d28:meMA.Ode5C2T.incipit	…
ltx/en_us_dedes/me.m10.d28:meMA.Ode5C2T.melody	@ltx/en_us_dedes/he.h.m2:heHE.MesitisTheou.name
ltx/en_us_dedes/me.m10.d28:meMA.Ode5C2T.mode	@ltx/en_us_dedes/miscellanea:misc.Mode2
ltx/en_us_dedes/me.m10.d28:meMA.Ode5C2T.ode	@ltx/en_us_dedes/miscellanea:misc.Ode5
ltx/en_us_dedes/me.m10.d28:meMA.Ode5C2T.text	
ltx/en_us_dedes/me.m10.d28:meMA.Ode6C11.greekmelody	@ltx/en_us_dedes/he.h.m4:heHE.ThysoSoiMetaFonis.greekname
ltx/en_us_dedes/me.m10.d28:meMA.Ode6C11.incipit	…
ltx/en_us_dedes/me.m10.d28:meMA.Ode6C11.melody	@ltx/en_us_dedes/he.h.m4:heHE.ThysoSoiMetaFonis.name
ltx/en_us_dedes/me.m10.d28:meMA.Ode6C11.mode	@ltx/en_us_dedes/miscellanea:misc.Mode4
ltx/en_us_dedes/me.m10.d28:meMA.Ode6C11.ode	@ltx/en_us_dedes/miscellanea:misc.Ode6
ltx/en_us_dedes/me.m10.d28:meMA.Ode6C11.text	
ltx/en_us_dedes/me.m10.d28:meMA.Ode6C12.incipit	…
ltx/en_us_dedes/me.m10.d28:meMA.Ode6C12.melody	@ltx/en_us_dedes/he.h.m4:heHE.ThysoSoiMetaFonis.name
ltx/en_us_dedes/me.m10.d28:meMA.Ode6C12.mode	@ltx/en_us_dedes/miscellanea:misc.Mode4
ltx/en_us_dedes/me.m10.d28:meMA.Ode6C12.ode	@ltx/en_us_dedes/miscellanea:misc.Ode6
ltx/en_us_dedes/me.m10.d28:meMA.Ode6C12.text	
ltx/en_us_dedes/me.m10.d28:meMA.Ode6C13.incipit	…
ltx/en_us_dedes/me.m10.d28:meMA.Ode6C13.melody	@ltx/en_us_dedes/he.h.m4:heHE.ThysoSoiMetaFonis.name
ltx/en_us_dedes/me.m10.d28:meMA.Ode6C13.mode	@ltx/en_us_dedes/miscellanea:misc.Mode4
ltx/en_us_dedes/me.m10.d28:meMA.Ode6C13.ode	@ltx/en_us_dedes/miscellanea:misc.Ode6
ltx/en_us_dedes/me.m10.d28:meMA.Ode6C13.text	
ltx/en_us_dedes/me.m10.d28:meMA.Ode6C1T.incipit	…
ltx/en_us_dedes/me.m10.d28:meMA.Ode6C1T.melody	@ltx/en_us_dedes/he.h.m4:heHE.ThysoSoiMetaFonis.name
ltx/en_us_dedes/me.m10.d28:meMA.Ode6C1T.mode	@ltx/en_us_dedes/miscellanea:misc.Mode4
ltx/en_us_dedes/me.m10.d28:meMA.Ode6C1T.ode	@ltx/en_us_dedes/miscellanea:misc.Ode6
ltx/en_us_dedes/me.m10.d28:meMA.Ode6C1T.text	
ltx/en_us_dedes/me.m10.d28:meMA.Ode6C21.greekmelody	@ltx/en_us_dedes/he.h.m2:heHE.EnAvyssoPtaismaton.greekname
ltx/en_us_dedes/me.m10.d28:meMA.Ode6C21.incipit	…
ltx/en_us_dedes/me.m10.d28:meMA.Ode6C21.melody	@ltx/en_us_dedes/he.h.m2:heHE.EnAvyssoPtaismaton.name
ltx/en_us_dedes/me.m10.d28:meMA.Ode6C21.mode	@ltx/en_us_dedes/miscellanea:misc.Mode2
ltx/en_us_dedes/me.m10.d28:meMA.Ode6C21.ode	@ltx/en_us_dedes/miscellanea:misc.Ode6
ltx/en_us_dedes/me.m10.d28:meMA.Ode6C21.text	
ltx/en_us_dedes/me.m10.d28:meMA.Ode6C22.incipit	…
ltx/en_us_dedes/me.m10.d28:meMA.Ode6C22.melody	@ltx/en_us_dedes/he.h.m2:heHE.EnAvyssoPtaismaton.name
ltx/en_us_dedes/me.m10.d28:meMA.Ode6C22.mode	@ltx/en_us_dedes/miscellanea:misc.Mode2
ltx/en_us_dedes/me.m10.d28:meMA.Ode6C22.ode	@ltx/en_us_dedes/miscellanea:misc.Ode6
ltx/en_us_dedes/me.m10.d28:meMA.Ode6C22.text	
ltx/en_us_dedes/me.m10.d28:meMA.Ode6C23.incipit	…
ltx/en_us_dedes/me.m10.d28:meMA.Ode6C23.melody	@ltx/en_us_dedes/he.h.m2:heHE.EnAvyssoPtaismaton.name
ltx/en_us_dedes/me.m10.d28:meMA.Ode6C23.mode	@ltx/en_us_dedes/miscellanea:misc.Mode2
ltx/en_us_dedes/me.m10.d28:meMA.Ode6C23.ode	@ltx/en_us_dedes/miscellanea:misc.Ode6
ltx/en_us_dedes/me.m10.d28:meMA.Ode6C23.text	
ltx/en_us_dedes/me.m10.d28:meMA.Ode6C2T.incipit	…
ltx/en_us_dedes/me.m10.d28:meMA.Ode6C2T.melody	@ltx/en_us_dedes/he.h.m2:heHE.EnAvyssoPtaismaton.name
ltx/en_us_dedes/me.m10.d28:meMA.Ode6C2T.mode	@ltx/en_us_dedes/miscellanea:misc.Mode2
ltx/en_us_dedes/me.m10.d28:meMA.Ode6C2T.ode	@ltx/en_us_dedes/miscellanea:misc.Ode6
ltx/en_us_dedes/me.m10.d28:meMA.Ode6C2T.text	
ltx/en_us_dedes/me.m10.d28:meMA.Ode6H.greekmelody	@ltx/en_us_dedes/he.h.m2:heHE.EnAvyssoPtaismaton.greekname
ltx/en_us_dedes/me.m10.d28:meMA.Ode6H.incipit	@ltx/en_us_dedes/he.h.m2:heHE.EnAvyssoPtaismaton.incipit
ltx/en_us_dedes/me.m10.d28:meMA.Ode6H.melody	@ltx/en_us_dedes/he.h.m2:heHE.EnAvyssoPtaismaton.melody
ltx/en_us_dedes/me.m10.d28:meMA.Ode6H.mode	@ltx/en_us_dedes/miscellanea:misc.Mode2
ltx/en_us_dedes/me.m10.d28:meMA.Ode6H.ode	@ltx/en_us_dedes/miscellanea:misc.Ode6
ltx/en_us_dedes/me.m10.d28:meMA.Ode6H.text	@ltx/en_us_dedes/he.h.m2:heHE.EnAvyssoPtaismaton.text
ltx/en_us_dedes/me.m10.d28:meMA.Ode7C11.greekmelody	@ltx/en_us_dedes/he.h.m4:heHE.EnTiKaminoAvramiaioi.greekname
ltx/en_us_dedes/me.m10.d28:meMA.Ode7C11.incipit	…
ltx/en_us_dedes/me.m10.d28:meMA.Ode7C11.melody	@ltx/en_us_dedes/he.h.m4:heHE.EnTiKaminoAvramiaioi.name
ltx/en_us_dedes/me.m10.d28:meMA.Ode7C11.mode	@ltx/en_us_dedes/miscellanea:misc.Mode4
ltx/en_us_dedes/me.m10.d28:meMA.Ode7C11.ode	@ltx/en_us_dedes/miscellanea:misc.Ode7
ltx/en_us_dedes/me.m10.d28:meMA.Ode7C11.text	
ltx/en_us_dedes/me.m10.d28:meMA.Ode7C12.incipit	…
ltx/en_us_dedes/me.m10.d28:meMA.Ode7C12.melody	@ltx/en_us_dedes/he.h.m4:heHE.EnTiKaminoAvramiaioi.name
ltx/en_us_dedes/me.m10.d28:meMA.Ode7C12.mode	@ltx/en_us_dedes/miscellanea:misc.Mode4
ltx/en_us_dedes/me.m10.d28:meMA.Ode7C12.ode	@ltx/en_us_dedes/miscellanea:misc.Ode7
ltx/en_us_dedes/me.m10.d28:meMA.Ode7C12.text	
ltx/en_us_dedes/me.m10.d28:meMA.Ode7C13.incipit	…
ltx/en_us_dedes/me.m10.d28:meMA.Ode7C13.melody	@ltx/en_us_dedes/he.h.m4:heHE.EnTiKaminoAvramiaioi.name
ltx/en_us_dedes/me.m10.d28:meMA.Ode7C13.mode	@ltx/en_us_dedes/miscellanea:misc.Mode4
ltx/en_us_dedes/me.m10.d28:meMA.Ode7C13.ode	@ltx/en_us_dedes/miscellanea:misc.Ode7
ltx/en_us_dedes/me.m10.d28:meMA.Ode7C13.text	
ltx/en_us_dedes/me.m10.d28:meMA.Ode7C1T.incipit	…
ltx/en_us_dedes/me.m10.d28:meMA.Ode7C1T.melody	@ltx/en_us_dedes/he.h.m4:heHE.EnTiKaminoAvramiaioi.name
ltx/en_us_dedes/me.m10.d28:meMA.Ode7C1T.mode	@ltx/en_us_dedes/miscellanea:misc.Mode4
ltx/en_us_dedes/me.m10.d28:meMA.Ode7C1T.ode	@ltx/en_us_dedes/miscellanea:misc.Ode7
ltx/en_us_dedes/me.m10.d28:meMA.Ode7C1T.text	
ltx/en_us_dedes/me.m10.d28:meMA.Ode7C21.greekmelody	@ltx/en_us_dedes/he.h.m2:heHE.AntitheonProstagma.greekname
ltx/en_us_dedes/me.m10.d28:meMA.Ode7C21.incipit	…
ltx/en_us_dedes/me.m10.d28:meMA.Ode7C21.melody	@ltx/en_us_dedes/he.h.m2:heHE.AntitheonProstagma.name
ltx/en_us_dedes/me.m10.d28:meMA.Ode7C21.mode	@ltx/en_us_dedes/miscellanea:misc.Mode2
ltx/en_us_dedes/me.m10.d28:meMA.Ode7C21.ode	@ltx/en_us_dedes/miscellanea:misc.Ode7
ltx/en_us_dedes/me.m10.d28:meMA.Ode7C21.text	
ltx/en_us_dedes/me.m10.d28:meMA.Ode7C22.incipit	…
ltx/en_us_dedes/me.m10.d28:meMA.Ode7C22.melody	@ltx/en_us_dedes/he.h.m2:heHE.AntitheonProstagma.name
ltx/en_us_dedes/me.m10.d28:meMA.Ode7C22.mode	@ltx/en_us_dedes/miscellanea:misc.Mode2
ltx/en_us_dedes/me.m10.d28:meMA.Ode7C22.ode	@ltx/en_us_dedes/miscellanea:misc.Ode7
ltx/en_us_dedes/me.m10.d28:meMA.Ode7C22.text	
ltx/en_us_dedes/me.m10.d28:meMA.Ode7C23.incipit	…
ltx/en_us_dedes/me.m10.d28:meMA.Ode7C23.melody	@ltx/en_us_dedes/he.h.m2:heHE.AntitheonProstagma.name
ltx/en_us_dedes/me.m10.d28:meMA.Ode7C23.mode	@ltx/en_us_dedes/miscellanea:misc.Mode2
ltx/en_us_dedes/me.m10.d28:meMA.Ode7C23.ode	@ltx/en_us_dedes/miscellanea:misc.Ode7
ltx/en_us_dedes/me.m10.d28:meMA.Ode7C23.text	
ltx/en_us_dedes/me.m10.d28:meMA.Ode7C2T.incipit	…
ltx/en_us_dedes/me.m10.d28:meMA.Ode7C2T.melody	@ltx/en_us_dedes/he.h.m2:heHE.AntitheonProstagma.name
ltx/en_us_dedes/me.m10.d28:meMA.Ode7C2T.mode	@ltx/en_us_dedes/miscellanea:misc.Mode2
ltx/en_us_dedes/me.m10.d28:meMA.Ode7C2T.ode	@ltx/en_us_dedes/miscellanea:misc.Ode7
ltx/en_us_dedes/me.m10.d28:meMA.Ode7C2T.text	
ltx/en_us_dedes/me.m10.d28:meMA.Ode8C11.greekmelody	@ltx/en_us_dedes/he.h.m4:heHE.CheirasEkpetasasDaniil.greekname
ltx/en_us_dedes/me.m10.d28:meMA.Ode8C11.incipit	…
ltx/en_us_dedes/me.m10.d28:meMA.Ode8C11.melody	@ltx/en_us_dedes/he.h.m4:heHE.CheirasEkpetasasDaniil.name
ltx/en_us_dedes/me.m10.d28:meMA.Ode8C11.mode	@ltx/en_us_dedes/miscellanea:misc.Mode4
ltx/en_us_dedes/me.m10.d28:meMA.Ode8C11.ode	@ltx/en_us_dedes/miscellanea:misc.Ode8
ltx/en_us_dedes/me.m10.d28:meMA.Ode8C11.text	
ltx/en_us_dedes/me.m10.d28:meMA.Ode8C12.incipit	…
ltx/en_us_dedes/me.m10.d28:meMA.Ode8C12.melody	@ltx/en_us_dedes/he.h.m4:heHE.CheirasEkpetasasDaniil.name
ltx/en_us_dedes/me.m10.d28:meMA.Ode8C12.mode	@ltx/en_us_dedes/miscellanea:misc.Mode4
ltx/en_us_dedes/me.m10.d28:meMA.Ode8C12.ode	@ltx/en_us_dedes/miscellanea:misc.Ode8
ltx/en_us_dedes/me.m10.d28:meMA.Ode8C12.text	
ltx/en_us_dedes/me.m10.d28:meMA.Ode8C13.incipit	…
ltx/en_us_dedes/me.m10.d28:meMA.Ode8C13.melody	@ltx/en_us_dedes/he.h.m4:heHE.CheirasEkpetasasDaniil.name
ltx/en_us_dedes/me.m10.d28:meMA.Ode8C13.mode	@ltx/en_us_dedes/miscellanea:misc.Mode4
ltx/en_us_dedes/me.m10.d28:meMA.Ode8C13.ode	@ltx/en_us_dedes/miscellanea:misc.Ode8
ltx/en_us_dedes/me.m10.d28:meMA.Ode8C13.text	
ltx/en_us_dedes/me.m10.d28:meMA.Ode8C1T.incipit	…
ltx/en_us_dedes/me.m10.d28:meMA.Ode8C1T.melody	@ltx/en_us_dedes/he.h.m4:heHE.CheirasEkpetasasDaniil.name
ltx/en_us_dedes/me.m10.d28:meMA.Ode8C1T.mode	@ltx/en_us_dedes/miscellanea:misc.Mode4
ltx/en_us_dedes/me.m10.d28:meMA.Ode8C1T.ode	@ltx/en_us_dedes/miscellanea:misc.Ode8
ltx/en_us_dedes/me.m10.d28:meMA.Ode8C1T.text	
ltx/en_us_dedes/me.m10.d28:meMA.Ode8C21.greekmelody	@ltx/en_us_dedes/he.h.m2:heHE.KaminosPote.greekname
ltx/en_us_dedes/me.m10.d28:meMA.Ode8C21.incipit	…
ltx/en_us_dedes/me.m10.d28:meMA.Ode8C21.melody	@ltx/en_us_dedes/he.h.m2:heHE.KaminosPote.name
ltx/en_us_dedes/me.m10.d28:meMA.Ode8C21.mode	@ltx/en_us_dedes/miscellanea:misc.Mode2
ltx/en_us_dedes/me.m10.d28:meMA.Ode8C21.ode	@ltx/en_us_dedes/miscellanea:misc.Ode8
ltx/en_us_dedes/me.m10.d28:meMA.Ode8C21.text	
ltx/en_us_dedes/me.m10.d28:meMA.Ode8C22.incipit	…
ltx/en_us_dedes/me.m10.d28:meMA.Ode8C22.melody	@ltx/en_us_dedes/he.h.m2:heHE.KaminosPote.name
ltx/en_us_dedes/me.m10.d28:meMA.Ode8C22.mode	@ltx/en_us_dedes/miscellanea:misc.Mode2
ltx/en_us_dedes/me.m10.d28:meMA.Ode8C22.ode	@ltx/en_us_dedes/miscellanea:misc.Ode8
ltx/en_us_dedes/me.m10.d28:meMA.Ode8C22.text	
ltx/en_us_dedes/me.m10.d28:meMA.Ode8C23.incipit	…
ltx/en_us_dedes/me.m10.d28:meMA.Ode8C23.melody	@ltx/en_us_dedes/he.h.m2:heHE.KaminosPote.name
ltx/en_us_dedes/me.m10.d28:meMA.Ode8C23.mode	@ltx/en_us_dedes/miscellanea:misc.Mode2
ltx/en_us_dedes/me.m10.d28:meMA.Ode8C23.ode	@ltx/en_us_dedes/miscellanea:misc.Ode8
ltx/en_us_dedes/me.m10.d28:meMA.Ode8C23.text	
ltx/en_us_dedes/me.m10.d28:meMA.Ode8C2T.incipit	…
ltx/en_us_dedes/me.m10.d28:meMA.Ode8C2T.melody	@ltx/en_us_dedes/he.h.m2:heHE.KaminosPote.name
ltx/en_us_dedes/me.m10.d28:meMA.Ode8C2T.mode	@ltx/en_us_dedes/miscellanea:misc.Mode2
ltx/en_us_dedes/me.m10.d28:meMA.Ode8C2T.ode	@ltx/en_us_dedes/miscellanea:misc.Ode8
ltx/en_us_dedes/me.m10.d28:meMA.Ode8C2T.text	
ltx/en_us_dedes/me.m10.d28:meMA.Ode8H.greekmelody	@ltx/en_us_dedes/he.h.m2:heHE.KaminosPote.greekname
ltx/en_us_dedes/me.m10.d28:meMA.Ode8H.incipit	@ltx/en_us_dedes/he.h.m2:heHE.KaminosPote.incipit
ltx/en_us_dedes/me.m10.d28:meMA.Ode8H.melody	@ltx/en_us_dedes/he.h.m2:heHE.KaminosPote.melody
ltx/en_us_dedes/me.m10.d28:meMA.Ode8H.mode	@ltx/en_us_dedes/miscellanea:misc.Mode2
ltx/en_us_dedes/me.m10.d28:meMA.Ode8H.ode	@ltx/en_us_dedes/miscellanea:misc.Ode8
ltx/en_us_dedes/me.m10.d28:meMA.Ode8H.text	@ltx/en_us_dedes/he.h.m2:heHE.KaminosPote.text
ltx/en_us_dedes/me.m10.d28:meMA.Ode9C11.greekmelody	@ltx/en_us_dedes/he.h.m4:heHE.LithosAcheirotmitos.greekname
ltx/en_us_dedes/me.m10.d28:meMA.Ode9C11.incipit	…
ltx/en_us_dedes/me.m10.d28:meMA.Ode9C11.melody	@ltx/en_us_dedes/he.h.m4:heHE.LithosAcheirotmitos.name
ltx/en_us_dedes/me.m10.d28:meMA.Ode9C11.mode	@ltx/en_us_dedes/miscellanea:misc.Mode4
ltx/en_us_dedes/me.m10.d28:meMA.Ode9C11.ode	@ltx/en_us_dedes/miscellanea:misc.Ode9
ltx/en_us_dedes/me.m10.d28:meMA.Ode9C11.text	
ltx/en_us_dedes/me.m10.d28:meMA.Ode9C12.incipit	…
ltx/en_us_dedes/me.m10.d28:meMA.Ode9C12.melody	@ltx/en_us_dedes/he.h.m4:heHE.LithosAcheirotmitos.name
ltx/en_us_dedes/me.m10.d28:meMA.Ode9C12.mode	@ltx/en_us_dedes/miscellanea:misc.Mode4
ltx/en_us_dedes/me.m10.d28:meMA.Ode9C12.ode	@ltx/en_us_dedes/miscellanea:misc.Ode9
ltx/en_us_dedes/me.m10.d28:meMA.Ode9C12.text	
ltx/en_us_dedes/me.m10.d28:meMA.Ode9C13.incipit	…
ltx/en_us_dedes/me.m10.d28:meMA.Ode9C13.melody	@ltx/en_us_dedes/he.h.m4:heHE.LithosAcheirotmitos.name
ltx/en_us_dedes/me.m10.d28:meMA.Ode9C13.mode	@ltx/en_us_dedes/miscellanea:misc.Mode4
ltx/en_us_dedes/me.m10.d28:meMA.Ode9C13.ode	@ltx/en_us_dedes/miscellanea:misc.Ode9
ltx/en_us_dedes/me.m10.d28:meMA.Ode9C13.text	
ltx/en_us_dedes/me.m10.d28:meMA.Ode9C1T.incipit	…
ltx/en_us_dedes/me.m10.d28:meMA.Ode9C1T.melody	@ltx/en_us_dedes/he.h.m4:heHE.LithosAcheirotmitos.name
ltx/en_us_dedes/me.m10.d28:meMA.Ode9C1T.mode	@ltx/en_us_dedes/miscellanea:misc.Mode4
ltx/en_us_dedes/me.m10.d28:meMA.Ode9C1T.ode	@ltx/en_us_dedes/miscellanea:misc.Ode9
ltx/en_us_dedes/me.m10.d28:meMA.Ode9C1T.text	
ltx/en_us_dedes/me.m10.d28:meMA.Ode9C21.greekmelody	@ltx/en_us_dedes/he.h.m2:heHE.AnarchouGennitoros.greekname
ltx/en_us_dedes/me.m10.d28:meMA.Ode9C21.incipit	…
ltx/en_us_dedes/me.m10.d28:meMA.Ode9C21.melody	@ltx/en_us_dedes/he.h.m2:heHE.AnarchouGennitoros.name
ltx/en_us_dedes/me.m10.d28:meMA.Ode9C21.mode	@ltx/en_us_dedes/miscellanea:misc.Mode2
ltx/en_us_dedes/me.m10.d28:meMA.Ode9C21.ode	@ltx/en_us_dedes/miscellanea:misc.Ode9
ltx/en_us_dedes/me.m10.d28:meMA.Ode9C21.text	
ltx/en_us_dedes/me.m10.d28:meMA.Ode9C22.incipit	…
ltx/en_us_dedes/me.m10.d28:meMA.Ode9C22.melody	@ltx/en_us_dedes/he.h.m2:heHE.AnarchouGennitoros.name
ltx/en_us_dedes/me.m10.d28:meMA.Ode9C22.mode	@ltx/en_us_dedes/miscellanea:misc.Mode2
ltx/en_us_dedes/me.m10.d28:meMA.Ode9C22.ode	@ltx/en_us_dedes/miscellanea:misc.Ode9
ltx/en_us_dedes/me.m10.d28:meMA.Ode9C22.text	
ltx/en_us_dedes/me.m10.d28:meMA.Ode9C23.incipit	…
ltx/en_us_dedes/me.m10.d28:meMA.Ode9C23.melody	@ltx/en_us_dedes/he.h.m2:heHE.AnarchouGennitoros.name
ltx/en_us_dedes/me.m10.d28:meMA.Ode9C23.mode	@ltx/en_us_dedes/miscellanea:misc.Mode2
ltx/en_us_dedes/me.m10.d28:meMA.Ode9C23.ode	@ltx/en_us_dedes/miscellanea:misc.Ode9
ltx/en_us_dedes/me.m10.d28:meMA.Ode9C23.text	
ltx/en_us_dedes/me.m10.d28:meMA.Ode9C2T.incipit	…
ltx/en_us_dedes/me.m10.d28:meMA.Ode9C2T.melody	@ltx/en_us_dedes/he.h.m2:heHE.AnarchouGennitoros.name
ltx/en_us_dedes/me.m10.d28:meMA.Ode9C2T.mode	@ltx/en_us_dedes/miscellanea:misc.Mode2
ltx/en_us_dedes/me.m10.d28:meMA.Ode9C2T.ode	@ltx/en_us_dedes/miscellanea:misc.Ode9
ltx/en_us_dedes/me.m10.d28:meMA.Ode9C2T.text	
ltx/en_us_dedes/me.m10.d28:meMA.Ode9H.greekmelody	@ltx/en_us_dedes/he.h.m2:heHE.AnarchouGennitoros.greekname
ltx/en_us_dedes/me.m10.d28:meMA.Ode9H.incipit	@ltx/en_us_dedes/he.h.m2:heHE.AnarchouGennitoros.incipit
ltx/en_us_dedes/me.m10.d28:meMA.Ode9H.melody	@ltx/en_us_dedes/he.h.m2:heHE.AnarchouGennitoros.melody
ltx/en_us_dedes/me.m10.d28:meMA.Ode9H.mode	@ltx/en_us_dedes/miscellanea:misc.Mode2
ltx/en_us_dedes/me.m10.d28:meMA.Ode9H.ode	@ltx/en_us_dedes/miscellanea:misc.Ode9
ltx/en_us_dedes/me.m10.d28:meMA.Ode9H.text	@ltx/en_us_dedes/he.h.m2:heHE.AnarchouGennitoros.text
ltx/en_us_dedes/me.m10.d28:meMA.Oikos1.text	
ltx/en_us_dedes/me.m10.d28:meVE.SticStavrotheotokion.greekmelody	@ltx/en_us_dedes/he.a.m8:heAU.OTouParadoxou.greekname
ltx/en_us_dedes/me.m10.d28:meVE.SticStavrotheotokion.incipit	@ltx/en_us_dedes/me.m03.d12:meVE.SticStavrotheotokion.incipit
ltx/en_us_dedes/me.m10.d28:meVE.SticStavrotheotokion.melody	@ltx/en_us_dedes/he.a.m8:heAU.OTouParadoxou.name
ltx/en_us_dedes/me.m10.d28:meVE.SticStavrotheotokion.mode	@ltx/en_us_dedes/miscellanea:misc.Mode8
ltx/en_us_dedes/me.m10.d28:meVE.SticStavrotheotokion.text	@ltx/en_us_dedes/me.m03.d12:meVE.SticStavrotheotokion.text
ltx/en_us_dedes/me.m10.d28:meVE.SticTheotokion.greekmelody	@ltx/en_us_dedes/he.a.m8:heAU.OTouParadoxou.greekname
ltx/en_us_dedes/me.m10.d28:meVE.SticTheotokion.incipit	…
ltx/en_us_dedes/me.m10.d28:meVE.SticTheotokion.melody	@ltx/en_us_dedes/he.a.m8:heAU.OTouParadoxou.name
ltx/en_us_dedes/me.m10.d28:meVE.SticTheotokion.mode	@ltx/en_us_dedes/miscellanea:misc.Mode8
ltx/en_us_dedes/me.m10.d28:meVE.SticTheotokion.text	
ltx/en_us_dedes/me.m10.d28:meVE.Stichera01.greekmelody	@ltx/en_us_dedes/he.a.m4:heAU.OsGennaionEnMartysi.greekname
ltx/en_us_dedes/me.m10.d28:meVE.Stichera01.incipit	You bravely endured many kinds…
ltx/en_us_dedes/me.m10.d28:meVE.Stichera01.melody	@ltx/en_us_dedes/he.a.m4:heAU.OsGennaionEnMartysi.notmetered
ltx/en_us_dedes/me.m10.d28:meVE.Stichera01.mode	@ltx/en_us_dedes/miscellanea:misc.Mode4
ltx/en_us_dedes/me.m10.d28:meVE.Stichera01.text	You bravely endured many kinds of torture, and thus you brought down the enemy’s conceit, O blessed Martyrs, when you stood before the tyrants and confessed that Christ the Lord appeared in the flesh for us and voluntarily suffered the immaculate Passion, and that He pours grace and mercy on the world.
ltx/en_us_dedes/me.m10.d28:meVE.Stichera02.incipit	Glorious Terence and Neonilla, and…
ltx/en_us_dedes/me.m10.d28:meVE.Stichera02.melody	@ltx/en_us_dedes/he.a.m4:heAU.OsGennaionEnMartysi.notmetered
ltx/en_us_dedes/me.m10.d28:meVE.Stichera02.mode	@ltx/en_us_dedes/miscellanea:misc.Mode4
ltx/en_us_dedes/me.m10.d28:meVE.Stichera02.text	Glorious Terence and Neonilla, and their marvelous children, Nitas, Sarbelus, Hierax, Theodulus, Phocas, Veles, and Eunice, all shined together, when they lawfully completed their martyrdom. They extinguished the fire of their tortures by the dew of the Spirit; they became towers of correct faith in God, acceptable sacrifices, and most pure offerings.
ltx/en_us_dedes/me.m10.d28:meVE.Stichera03.incipit	Like a bright sun uniting…
ltx/en_us_dedes/me.m10.d28:meVE.Stichera03.melody	@ltx/en_us_dedes/he.a.m4:heAU.OsGennaionEnMartysi.notmetered
ltx/en_us_dedes/me.m10.d28:meVE.Stichera03.mode	@ltx/en_us_dedes/miscellanea:misc.Mode4
ltx/en_us_dedes/me.m10.d28:meVE.Stichera03.text	Like a bright sun uniting with the moon, you, O Terence, united with your wife Neonilla, and you produced your children, like a constellation of seven stars, red with the blood of martyrdom, emitting a joyous light, and dwelling where the day never ends, where all the hosts of victorious Martyrs live in glory.
ltx/en_us_dedes/me.m10.d28:meVE.Stichera04.greekmelody	@ltx/en_us_dedes/he.a.m8:heAU.OTouParadoxou.greekname
ltx/en_us_dedes/me.m10.d28:meVE.Stichera04.incipit	…
ltx/en_us_dedes/me.m10.d28:meVE.Stichera04.melody	@ltx/en_us_dedes/he.a.m8:heAU.OTouParadoxou.name
ltx/en_us_dedes/me.m10.d28:meVE.Stichera04.mode	@ltx/en_us_dedes/miscellanea:misc.Mode8
ltx/en_us_dedes/me.m10.d28:meVE.Stichera04.text	
ltx/en_us_dedes/me.m10.d28:meVE.Stichera05.incipit	…
ltx/en_us_dedes/me.m10.d28:meVE.Stichera05.melody	@ltx/en_us_dedes/he.a.m8:heAU.OTouParadoxou.name
ltx/en_us_dedes/me.m10.d28:meVE.Stichera05.mode	@ltx/en_us_dedes/miscellanea:misc.Mode8
ltx/en_us_dedes/me.m10.d28:meVE.Stichera05.text	
ltx/en_us_dedes/me.m10.d28:meVE.Stichera06.incipit	…
ltx/en_us_dedes/me.m10.d28:meVE.Stichera06.melody	@ltx/en_us_dedes/he.a.m8:heAU.OTouParadoxou.name
ltx/en_us_dedes/me.m10.d28:meVE.Stichera06.mode	@ltx/en_us_dedes/miscellanea:misc.Mode8
ltx/en_us_dedes/me.m10.d28:meVE.Stichera06.text	
