ltx/en_us_dedes/pe.d085:peDA.commemoration.full	Sunday of the Myrrh-bearers
ltx/en_us_dedes/pe.d085:peDA.commemoration.short	Myrrh-bearers Sunday
ltx/en_us_dedes/pe.d085:peDA.dismissal	@ltx/en_us_dedes/dismissals:dis00.resurrection
ltx/en_us_dedes/pe.d085:peDA.insert1	the holy Myrrh-bearers, and Joseph of Arimathea, and Nikodemos the disciple by night,
ltx/en_us_dedes/pe.d085:peDA.insert2	whose memory we observe,
ltx/en_us_dedes/pe.d085:peDA.note	
ltx/en_us_dedes/pe.d085:peHO.commemorations	
ltx/en_us_dedes/pe.d085:peHO.daytitle	
ltx/en_us_dedes/pe.d085:peHO.description1	
ltx/en_us_dedes/pe.d085:peHO.description2	
ltx/en_us_dedes/pe.d085:peHO.note1	
ltx/en_us_dedes/pe.d085:peHO.note2	
ltx/en_us_dedes/pe.d085:peLI.Kontakion1.incipit	@ltx/en_us_dedes/pe.d085:peMA.Kontakion1.incipit
ltx/en_us_dedes/pe.d085:peLI.Kontakion1.melody	@ltx/en_us_dedes/pe.d085:peMA.Kontakion1.melody
ltx/en_us_dedes/pe.d085:peLI.Kontakion1.mode	@ltx/en_us_dedes/pe.d085:peMA.Kontakion1.mode
ltx/en_us_dedes/pe.d085:peLI.Kontakion1.text	@ltx/en_us_dedes/pe.d085:peMA.Kontakion1.text
ltx/en_us_dedes/pe.d085:peLI.Megalynarion.text	
ltx/en_us_dedes/pe.d085:peLI.TheotokosHymn.incipit	@ltx/en_us_dedes/pe.d071:peMA.Ode9C1H.incipit
ltx/en_us_dedes/pe.d085:peLI.TheotokosHymn.mode	@ltx/en_us_dedes/miscellanea:misc.Mode1
ltx/en_us_dedes/pe.d085:peLI.TheotokosHymn.text	@ltx/en_us_dedes/pe.d071:peMA.Ode9C1H.text
ltx/en_us_dedes/pe.d085:peLI.TheotokosHymnVerse.text	@ltx/en_us_dedes/pe.d071:peMA.Ode9C1MKa.text
ltx/en_us_dedes/pe.d085:peMA.C1.poet	@ltx/en_us_dedes/poets:po.AndreouKritis
ltx/en_us_dedes/pe.d085:peMA.C1.title	@ltx/en_us_dedes/titles:ti.CanonMyrrhbearers
ltx/en_us_dedes/pe.d085:peMA.C1.verse	@ltx/en_us_dedes/prayers:pr.verse_God.text
ltx/en_us_dedes/pe.d085:peMA.Exaposteilarion1.greekmelody	@ltx/en_us_dedes/he.a.m2:heAU.GynaikesAkoutisthite.greekname
ltx/en_us_dedes/pe.d085:peMA.Exaposteilarion1.incipit	@ltx/en_us_dedes/he.a.m2:heAU.GynaikesAkoutisthite.incipit
ltx/en_us_dedes/pe.d085:peMA.Exaposteilarion1.melody	@ltx/en_us_dedes/he.a.m2:heAU.GynaikesAkoutisthite.melody
ltx/en_us_dedes/pe.d085:peMA.Exaposteilarion1.mode	@ltx/en_us_dedes/miscellanea:misc.Mode2
ltx/en_us_dedes/pe.d085:peMA.Exaposteilarion1.text	@ltx/en_us_dedes/he.a.m2:heAU.GynaikesAkoutisthite.text
ltx/en_us_dedes/pe.d085:peMA.Kathisma11.incipit	@ltx/en_us_dedes/oc.m2.d1:ocMA.Kathisma21.incipit
ltx/en_us_dedes/pe.d085:peMA.Kathisma11.melody	
ltx/en_us_dedes/pe.d085:peMA.Kathisma11.mode	@ltx/en_us_dedes/miscellanea:misc.Mode2
ltx/en_us_dedes/pe.d085:peMA.Kathisma11.text	@ltx/en_us_dedes/oc.m2.d1:ocMA.Kathisma21.text
ltx/en_us_dedes/pe.d085:peMA.Kathisma12.incipit	Not quitting the immaculate bosom…
ltx/en_us_dedes/pe.d085:peMA.Kathisma12.melody	
ltx/en_us_dedes/pe.d085:peMA.Kathisma12.mode	@ltx/en_us_dedes/miscellanea:misc.Mode2
ltx/en_us_dedes/pe.d085:peMA.Kathisma12.text	Not quitting the immaculate bosom in the highest, for all You accepted burial and resurrection. Glory to You, O Lord.
ltx/en_us_dedes/pe.d085:peMA.Kathisma13.incipit	@ltx/en_us_dedes/oc.m2.d1:ocVE.ApolTheotokionVM.incipit
ltx/en_us_dedes/pe.d085:peMA.Kathisma13.melody	
ltx/en_us_dedes/pe.d085:peMA.Kathisma13.mode	@ltx/en_us_dedes/miscellanea:misc.Mode2
ltx/en_us_dedes/pe.d085:peMA.Kathisma13.text	@ltx/en_us_dedes/oc.m2.d1:ocVE.ApolTheotokionVM.text
ltx/en_us_dedes/pe.d085:peMA.Kathisma21.incipit	The women came with ointments…
ltx/en_us_dedes/pe.d085:peMA.Kathisma21.melody	
ltx/en_us_dedes/pe.d085:peMA.Kathisma21.mode	@ltx/en_us_dedes/miscellanea:misc.Mode2
ltx/en_us_dedes/pe.d085:peMA.Kathisma21.text	The women came with ointments very early in the morning, and they saw that the tomb was empty. Then they went and told the Apostles, “The Mighty One has overpowered corruption, and He has rescued those who were bound in Hades. Proclaim it openly, that Christ God has risen, granting us His great mercy.”
ltx/en_us_dedes/pe.d085:peMA.Kathisma22.incipit	…
ltx/en_us_dedes/pe.d085:peMA.Kathisma22.melody	
ltx/en_us_dedes/pe.d085:peMA.Kathisma22.mode	@ltx/en_us_dedes/miscellanea:misc.Mode2
ltx/en_us_dedes/pe.d085:peMA.Kathisma22.text	
ltx/en_us_dedes/pe.d085:peMA.Kathisma23.incipit	@ltx/en_us_dedes/oc.m2.d1:ocMA.Kathisma13.incipit
ltx/en_us_dedes/pe.d085:peMA.Kathisma23.melody	
ltx/en_us_dedes/pe.d085:peMA.Kathisma23.mode	@ltx/en_us_dedes/miscellanea:misc.Mode2
ltx/en_us_dedes/pe.d085:peMA.Kathisma23.text	@ltx/en_us_dedes/oc.m2.d1:ocMA.Kathisma13.text
ltx/en_us_dedes/pe.d085:peMA.Kontakion1.incipit	In saying Rejoice to the…
ltx/en_us_dedes/pe.d085:peMA.Kontakion1.melody	
ltx/en_us_dedes/pe.d085:peMA.Kontakion1.mode	@ltx/en_us_dedes/miscellanea:misc.Mode2
ltx/en_us_dedes/pe.d085:peMA.Kontakion1.text	In saying Rejoice to the myrrh-bearers, You allayed the lament of the first mother Eve, at Your Resurrection, O Christ our God. And You ordered Your Apostles to proclaim, * “The Savior has risen from the sepulcher.”
ltx/en_us_dedes/pe.d085:peMA.Lauds1.incipit	@ltx/en_us_dedes/oc.m2.d1:ocMA.Lauds1.incipit
ltx/en_us_dedes/pe.d085:peMA.Lauds1.melody	@ltx/en_us_dedes/oc.m2.d1:ocMA.Lauds1.melody
ltx/en_us_dedes/pe.d085:peMA.Lauds1.mode	@ltx/en_us_dedes/oc.m2.d1:ocMA.Lauds1.mode
ltx/en_us_dedes/pe.d085:peMA.Lauds1.text	@ltx/en_us_dedes/oc.m2.d1:ocMA.Lauds1.text
ltx/en_us_dedes/pe.d085:peMA.Lauds2.incipit	@ltx/en_us_dedes/oc.m2.d1:ocMA.Lauds2.incipit
ltx/en_us_dedes/pe.d085:peMA.Lauds2.melody	@ltx/en_us_dedes/oc.m2.d1:ocMA.Lauds2.melody
ltx/en_us_dedes/pe.d085:peMA.Lauds2.mode	@ltx/en_us_dedes/oc.m2.d1:ocMA.Lauds2.mode
ltx/en_us_dedes/pe.d085:peMA.Lauds2.text	@ltx/en_us_dedes/oc.m2.d1:ocMA.Lauds2.text
ltx/en_us_dedes/pe.d085:peMA.Lauds3.incipit	@ltx/en_us_dedes/oc.m2.d1:ocMA.Lauds3.incipit
ltx/en_us_dedes/pe.d085:peMA.Lauds3.melody	@ltx/en_us_dedes/oc.m2.d1:ocMA.Lauds3.melody
ltx/en_us_dedes/pe.d085:peMA.Lauds3.mode	@ltx/en_us_dedes/oc.m2.d1:ocMA.Lauds3.mode
ltx/en_us_dedes/pe.d085:peMA.Lauds3.text	@ltx/en_us_dedes/oc.m2.d1:ocMA.Lauds3.text
ltx/en_us_dedes/pe.d085:peMA.Lauds4.incipit	@ltx/en_us_dedes/oc.m2.d1:ocMA.Lauds4.incipit
ltx/en_us_dedes/pe.d085:peMA.Lauds4.melody	@ltx/en_us_dedes/oc.m2.d1:ocMA.Lauds4.melody
ltx/en_us_dedes/pe.d085:peMA.Lauds4.mode	@ltx/en_us_dedes/oc.m2.d1:ocMA.Lauds4.mode
ltx/en_us_dedes/pe.d085:peMA.Lauds4.text	@ltx/en_us_dedes/oc.m2.d1:ocMA.Lauds4.text
ltx/en_us_dedes/pe.d085:peMA.LaudsGlory.incipit	@ltx/en_us_dedes/eo.e02:eo.Doxasticon.incipit
ltx/en_us_dedes/pe.d085:peMA.LaudsGlory.melody	@ltx/en_us_dedes/miscellanea:misc.Idiomelon
ltx/en_us_dedes/pe.d085:peMA.LaudsGlory.mode	@ltx/en_us_dedes/miscellanea:misc.Mode2
ltx/en_us_dedes/pe.d085:peMA.LaudsGlory.text	@ltx/en_us_dedes/eo.e02:eo.Doxasticon.text
ltx/en_us_dedes/pe.d085:peMA.Ode1C11.greekmelody	@ltx/en_us_dedes/he.h.m2:heHE.TinMoseosOdin.greekname
ltx/en_us_dedes/pe.d085:peMA.Ode1C11.incipit	…
ltx/en_us_dedes/pe.d085:peMA.Ode1C11.melody	@ltx/en_us_dedes/he.h.m2:heHE.TinMoseosOdin.name
ltx/en_us_dedes/pe.d085:peMA.Ode1C11.mode	@ltx/en_us_dedes/miscellanea:misc.Mode2
ltx/en_us_dedes/pe.d085:peMA.Ode1C11.ode	@ltx/en_us_dedes/miscellanea:misc.Ode1
ltx/en_us_dedes/pe.d085:peMA.Ode1C11.text	
ltx/en_us_dedes/pe.d085:peMA.Ode1C12.incipit	…
ltx/en_us_dedes/pe.d085:peMA.Ode1C12.melody	@ltx/en_us_dedes/he.h.m2:heHE.TinMoseosOdin.name
ltx/en_us_dedes/pe.d085:peMA.Ode1C12.mode	@ltx/en_us_dedes/miscellanea:misc.Mode2
ltx/en_us_dedes/pe.d085:peMA.Ode1C12.ode	@ltx/en_us_dedes/miscellanea:misc.Ode1
ltx/en_us_dedes/pe.d085:peMA.Ode1C12.text	
ltx/en_us_dedes/pe.d085:peMA.Ode1C13.incipit	…
ltx/en_us_dedes/pe.d085:peMA.Ode1C13.melody	@ltx/en_us_dedes/he.h.m2:heHE.TinMoseosOdin.name
ltx/en_us_dedes/pe.d085:peMA.Ode1C13.mode	@ltx/en_us_dedes/miscellanea:misc.Mode2
ltx/en_us_dedes/pe.d085:peMA.Ode1C13.ode	@ltx/en_us_dedes/miscellanea:misc.Ode1
ltx/en_us_dedes/pe.d085:peMA.Ode1C13.text	
ltx/en_us_dedes/pe.d085:peMA.Ode1C14.incipit	…
ltx/en_us_dedes/pe.d085:peMA.Ode1C14.melody	@ltx/en_us_dedes/he.h.m2:heHE.TinMoseosOdin.name
ltx/en_us_dedes/pe.d085:peMA.Ode1C14.mode	@ltx/en_us_dedes/miscellanea:misc.Mode2
ltx/en_us_dedes/pe.d085:peMA.Ode1C14.ode	@ltx/en_us_dedes/miscellanea:misc.Ode1
ltx/en_us_dedes/pe.d085:peMA.Ode1C14.text	
ltx/en_us_dedes/pe.d085:peMA.Ode1C15.incipit	…
ltx/en_us_dedes/pe.d085:peMA.Ode1C15.melody	@ltx/en_us_dedes/he.h.m2:heHE.TinMoseosOdin.name
ltx/en_us_dedes/pe.d085:peMA.Ode1C15.mode	@ltx/en_us_dedes/miscellanea:misc.Mode2
ltx/en_us_dedes/pe.d085:peMA.Ode1C15.ode	@ltx/en_us_dedes/miscellanea:misc.Ode1
ltx/en_us_dedes/pe.d085:peMA.Ode1C15.text	
ltx/en_us_dedes/pe.d085:peMA.Ode1C1F1.greekmelody	@ltx/en_us_dedes/he.h.m2:heHE.TinMoseosOdin.greekname
ltx/en_us_dedes/pe.d085:peMA.Ode1C1F1.incipit	…
ltx/en_us_dedes/pe.d085:peMA.Ode1C1F1.melody	@ltx/en_us_dedes/he.h.m2:heHE.TinMoseosOdin.name
ltx/en_us_dedes/pe.d085:peMA.Ode1C1F1.mode	@ltx/en_us_dedes/miscellanea:misc.Mode2
ltx/en_us_dedes/pe.d085:peMA.Ode1C1F1.ode	@ltx/en_us_dedes/miscellanea:misc.Ode1
ltx/en_us_dedes/pe.d085:peMA.Ode1C1F1.text	
ltx/en_us_dedes/pe.d085:peMA.Ode1C1F2.incipit	…
ltx/en_us_dedes/pe.d085:peMA.Ode1C1F2.melody	@ltx/en_us_dedes/he.h.m2:heHE.TinMoseosOdin.name
ltx/en_us_dedes/pe.d085:peMA.Ode1C1F2.mode	@ltx/en_us_dedes/miscellanea:misc.Mode2
ltx/en_us_dedes/pe.d085:peMA.Ode1C1F2.ode	@ltx/en_us_dedes/miscellanea:misc.Ode1
ltx/en_us_dedes/pe.d085:peMA.Ode1C1F2.text	
ltx/en_us_dedes/pe.d085:peMA.Ode1C1H.greekmelody	@ltx/en_us_dedes/he.h.m2:heHE.TinMoseosOdin.greekname
ltx/en_us_dedes/pe.d085:peMA.Ode1C1H.incipit	@ltx/en_us_dedes/he.h.m2:heHE.TinMoseosOdin.incipit
ltx/en_us_dedes/pe.d085:peMA.Ode1C1H.melody	@ltx/en_us_dedes/he.h.m2:heHE.TinMoseosOdin.melody
ltx/en_us_dedes/pe.d085:peMA.Ode1C1H.mode	@ltx/en_us_dedes/miscellanea:misc.Mode2
ltx/en_us_dedes/pe.d085:peMA.Ode1C1H.ode	@ltx/en_us_dedes/miscellanea:misc.Ode1
ltx/en_us_dedes/pe.d085:peMA.Ode1C1H.text	@ltx/en_us_dedes/he.h.m2:heHE.TinMoseosOdin.text
ltx/en_us_dedes/pe.d085:peMA.Ode1C1T.incipit	…
ltx/en_us_dedes/pe.d085:peMA.Ode1C1T.melody	@ltx/en_us_dedes/he.h.m2:heHE.TinMoseosOdin.name
ltx/en_us_dedes/pe.d085:peMA.Ode1C1T.mode	@ltx/en_us_dedes/miscellanea:misc.Mode2
ltx/en_us_dedes/pe.d085:peMA.Ode1C1T.ode	@ltx/en_us_dedes/miscellanea:misc.Ode1
ltx/en_us_dedes/pe.d085:peMA.Ode1C1T.text	
ltx/en_us_dedes/pe.d085:peMA.Ode1C1Tr.incipit	…
ltx/en_us_dedes/pe.d085:peMA.Ode1C1Tr.melody	@ltx/en_us_dedes/he.h.m2:heHE.TinMoseosOdin.name
ltx/en_us_dedes/pe.d085:peMA.Ode1C1Tr.mode	@ltx/en_us_dedes/miscellanea:misc.Mode2
ltx/en_us_dedes/pe.d085:peMA.Ode1C1Tr.ode	@ltx/en_us_dedes/miscellanea:misc.Ode1
ltx/en_us_dedes/pe.d085:peMA.Ode1C1Tr.text	
ltx/en_us_dedes/pe.d085:peMA.Ode3C11.greekmelody	@ltx/en_us_dedes/he.h.m2:heHE.SteirothentaMouTonNoun.greekname
ltx/en_us_dedes/pe.d085:peMA.Ode3C11.incipit	…
ltx/en_us_dedes/pe.d085:peMA.Ode3C11.melody	@ltx/en_us_dedes/he.h.m2:heHE.SteirothentaMouTonNoun.name
ltx/en_us_dedes/pe.d085:peMA.Ode3C11.mode	@ltx/en_us_dedes/miscellanea:misc.Mode2
ltx/en_us_dedes/pe.d085:peMA.Ode3C11.ode	@ltx/en_us_dedes/miscellanea:misc.Ode3
ltx/en_us_dedes/pe.d085:peMA.Ode3C11.text	
ltx/en_us_dedes/pe.d085:peMA.Ode3C12.incipit	…
ltx/en_us_dedes/pe.d085:peMA.Ode3C12.melody	@ltx/en_us_dedes/he.h.m2:heHE.SteirothentaMouTonNoun.name
ltx/en_us_dedes/pe.d085:peMA.Ode3C12.mode	@ltx/en_us_dedes/miscellanea:misc.Mode2
ltx/en_us_dedes/pe.d085:peMA.Ode3C12.ode	@ltx/en_us_dedes/miscellanea:misc.Ode3
ltx/en_us_dedes/pe.d085:peMA.Ode3C12.text	
ltx/en_us_dedes/pe.d085:peMA.Ode3C13.incipit	…
ltx/en_us_dedes/pe.d085:peMA.Ode3C13.melody	@ltx/en_us_dedes/he.h.m2:heHE.SteirothentaMouTonNoun.name
ltx/en_us_dedes/pe.d085:peMA.Ode3C13.mode	@ltx/en_us_dedes/miscellanea:misc.Mode2
ltx/en_us_dedes/pe.d085:peMA.Ode3C13.ode	@ltx/en_us_dedes/miscellanea:misc.Ode3
ltx/en_us_dedes/pe.d085:peMA.Ode3C13.text	
ltx/en_us_dedes/pe.d085:peMA.Ode3C14.incipit	…
ltx/en_us_dedes/pe.d085:peMA.Ode3C14.melody	@ltx/en_us_dedes/he.h.m2:heHE.SteirothentaMouTonNoun.name
ltx/en_us_dedes/pe.d085:peMA.Ode3C14.mode	@ltx/en_us_dedes/miscellanea:misc.Mode2
ltx/en_us_dedes/pe.d085:peMA.Ode3C14.ode	@ltx/en_us_dedes/miscellanea:misc.Ode3
ltx/en_us_dedes/pe.d085:peMA.Ode3C14.text	
ltx/en_us_dedes/pe.d085:peMA.Ode3C15.incipit	…
ltx/en_us_dedes/pe.d085:peMA.Ode3C15.melody	@ltx/en_us_dedes/he.h.m2:heHE.SteirothentaMouTonNoun.name
ltx/en_us_dedes/pe.d085:peMA.Ode3C15.mode	@ltx/en_us_dedes/miscellanea:misc.Mode2
ltx/en_us_dedes/pe.d085:peMA.Ode3C15.ode	@ltx/en_us_dedes/miscellanea:misc.Ode3
ltx/en_us_dedes/pe.d085:peMA.Ode3C15.text	
ltx/en_us_dedes/pe.d085:peMA.Ode3C16.incipit	…
ltx/en_us_dedes/pe.d085:peMA.Ode3C16.melody	@ltx/en_us_dedes/he.h.m2:heHE.SteirothentaMouTonNoun.name
ltx/en_us_dedes/pe.d085:peMA.Ode3C16.mode	@ltx/en_us_dedes/miscellanea:misc.Mode2
ltx/en_us_dedes/pe.d085:peMA.Ode3C16.ode	@ltx/en_us_dedes/miscellanea:misc.Ode3
ltx/en_us_dedes/pe.d085:peMA.Ode3C16.text	
ltx/en_us_dedes/pe.d085:peMA.Ode3C17.incipit	…
ltx/en_us_dedes/pe.d085:peMA.Ode3C17.melody	@ltx/en_us_dedes/he.h.m2:heHE.SteirothentaMouTonNoun.name
ltx/en_us_dedes/pe.d085:peMA.Ode3C17.mode	@ltx/en_us_dedes/miscellanea:misc.Mode2
ltx/en_us_dedes/pe.d085:peMA.Ode3C17.ode	@ltx/en_us_dedes/miscellanea:misc.Ode3
ltx/en_us_dedes/pe.d085:peMA.Ode3C17.text	
ltx/en_us_dedes/pe.d085:peMA.Ode3C1F1.greekmelody	@ltx/en_us_dedes/he.h.m2:heHE.SteirothentaMouTonNoun.greekname
ltx/en_us_dedes/pe.d085:peMA.Ode3C1F1.incipit	…
ltx/en_us_dedes/pe.d085:peMA.Ode3C1F1.melody	@ltx/en_us_dedes/he.h.m2:heHE.SteirothentaMouTonNoun.name
ltx/en_us_dedes/pe.d085:peMA.Ode3C1F1.mode	@ltx/en_us_dedes/miscellanea:misc.Mode2
ltx/en_us_dedes/pe.d085:peMA.Ode3C1F1.ode	@ltx/en_us_dedes/miscellanea:misc.Ode3
ltx/en_us_dedes/pe.d085:peMA.Ode3C1F1.text	
ltx/en_us_dedes/pe.d085:peMA.Ode3C1F2.incipit	…
ltx/en_us_dedes/pe.d085:peMA.Ode3C1F2.melody	@ltx/en_us_dedes/he.h.m2:heHE.SteirothentaMouTonNoun.name
ltx/en_us_dedes/pe.d085:peMA.Ode3C1F2.mode	@ltx/en_us_dedes/miscellanea:misc.Mode2
ltx/en_us_dedes/pe.d085:peMA.Ode3C1F2.ode	@ltx/en_us_dedes/miscellanea:misc.Ode3
ltx/en_us_dedes/pe.d085:peMA.Ode3C1F2.text	
ltx/en_us_dedes/pe.d085:peMA.Ode3C1H.greekmelody	@ltx/en_us_dedes/he.h.m2:heHE.SteirothentaMouTonNoun.greekname
ltx/en_us_dedes/pe.d085:peMA.Ode3C1H.incipit	@ltx/en_us_dedes/he.h.m2:heHE.SteirothentaMouTonNoun.incipit
ltx/en_us_dedes/pe.d085:peMA.Ode3C1H.melody	@ltx/en_us_dedes/he.h.m2:heHE.SteirothentaMouTonNoun.melody
ltx/en_us_dedes/pe.d085:peMA.Ode3C1H.mode	@ltx/en_us_dedes/miscellanea:misc.Mode2
ltx/en_us_dedes/pe.d085:peMA.Ode3C1H.ode	@ltx/en_us_dedes/miscellanea:misc.Ode3
ltx/en_us_dedes/pe.d085:peMA.Ode3C1H.text	@ltx/en_us_dedes/he.h.m2:heHE.SteirothentaMouTonNoun.text
ltx/en_us_dedes/pe.d085:peMA.Ode3C1T.incipit	…
ltx/en_us_dedes/pe.d085:peMA.Ode3C1T.melody	@ltx/en_us_dedes/he.h.m2:heHE.SteirothentaMouTonNoun.name
ltx/en_us_dedes/pe.d085:peMA.Ode3C1T.mode	@ltx/en_us_dedes/miscellanea:misc.Mode2
ltx/en_us_dedes/pe.d085:peMA.Ode3C1T.ode	@ltx/en_us_dedes/miscellanea:misc.Ode3
ltx/en_us_dedes/pe.d085:peMA.Ode3C1T.text	
ltx/en_us_dedes/pe.d085:peMA.Ode3C1Tr.incipit	…
ltx/en_us_dedes/pe.d085:peMA.Ode3C1Tr.melody	@ltx/en_us_dedes/he.h.m2:heHE.SteirothentaMouTonNoun.name
ltx/en_us_dedes/pe.d085:peMA.Ode3C1Tr.mode	@ltx/en_us_dedes/miscellanea:misc.Mode2
ltx/en_us_dedes/pe.d085:peMA.Ode3C1Tr.ode	@ltx/en_us_dedes/miscellanea:misc.Ode3
ltx/en_us_dedes/pe.d085:peMA.Ode3C1Tr.text	
ltx/en_us_dedes/pe.d085:peMA.Ode3Kathisma1.greekmelody	@ltx/en_us_dedes/he.a.m2:heAU.TaAnoZiton.greekname
ltx/en_us_dedes/pe.d085:peMA.Ode3Kathisma1.incipit	The Women with zeal brought…
ltx/en_us_dedes/pe.d085:peMA.Ode3Kathisma1.melody	@ltx/en_us_dedes/he.a.m2:heAU.TaAnoZiton.name
ltx/en_us_dedes/pe.d085:peMA.Ode3Kathisma1.mode	@ltx/en_us_dedes/miscellanea:misc.Mode2
ltx/en_us_dedes/pe.d085:peMA.Ode3Kathisma1.text	The Women with zeal brought spices to Your sepulcher. * Their souls leapt for joy beholding the Angel’s dazzling light. * And they boldly proclaimed You the King of all; * and said to the Disciples, * “Truly the Life of all has risen from the grave.”
ltx/en_us_dedes/pe.d085:peMA.Ode3Kathisma2.incipit	@ltx/en_us_dedes/oc.m2.d1:ocMA.Kathisma22.incipit
ltx/en_us_dedes/pe.d085:peMA.Ode3Kathisma2.melody	
ltx/en_us_dedes/pe.d085:peMA.Ode3Kathisma2.mode	@ltx/en_us_dedes/miscellanea:misc.Mode2
ltx/en_us_dedes/pe.d085:peMA.Ode3Kathisma2.text	@ltx/en_us_dedes/oc.m2.d1:ocMA.Kathisma22.text
ltx/en_us_dedes/pe.d085:peMA.Ode4C11.greekmelody	@ltx/en_us_dedes/he.h.m2:heHE.TinEkParthenou.greekname
ltx/en_us_dedes/pe.d085:peMA.Ode4C11.incipit	…
ltx/en_us_dedes/pe.d085:peMA.Ode4C11.melody	@ltx/en_us_dedes/he.h.m2:heHE.TinEkParthenou.name
ltx/en_us_dedes/pe.d085:peMA.Ode4C11.mode	@ltx/en_us_dedes/miscellanea:misc.Mode2
ltx/en_us_dedes/pe.d085:peMA.Ode4C11.ode	@ltx/en_us_dedes/miscellanea:misc.Ode4
ltx/en_us_dedes/pe.d085:peMA.Ode4C11.text	
ltx/en_us_dedes/pe.d085:peMA.Ode4C12.incipit	…
ltx/en_us_dedes/pe.d085:peMA.Ode4C12.melody	@ltx/en_us_dedes/he.h.m2:heHE.TinEkParthenou.name
ltx/en_us_dedes/pe.d085:peMA.Ode4C12.mode	@ltx/en_us_dedes/miscellanea:misc.Mode2
ltx/en_us_dedes/pe.d085:peMA.Ode4C12.ode	@ltx/en_us_dedes/miscellanea:misc.Ode4
ltx/en_us_dedes/pe.d085:peMA.Ode4C12.text	
ltx/en_us_dedes/pe.d085:peMA.Ode4C13.incipit	…
ltx/en_us_dedes/pe.d085:peMA.Ode4C13.melody	@ltx/en_us_dedes/he.h.m2:heHE.TinEkParthenou.name
ltx/en_us_dedes/pe.d085:peMA.Ode4C13.mode	@ltx/en_us_dedes/miscellanea:misc.Mode2
ltx/en_us_dedes/pe.d085:peMA.Ode4C13.ode	@ltx/en_us_dedes/miscellanea:misc.Ode4
ltx/en_us_dedes/pe.d085:peMA.Ode4C13.text	
ltx/en_us_dedes/pe.d085:peMA.Ode4C14.incipit	…
ltx/en_us_dedes/pe.d085:peMA.Ode4C14.melody	@ltx/en_us_dedes/he.h.m2:heHE.TinEkParthenou.name
ltx/en_us_dedes/pe.d085:peMA.Ode4C14.mode	@ltx/en_us_dedes/miscellanea:misc.Mode2
ltx/en_us_dedes/pe.d085:peMA.Ode4C14.ode	@ltx/en_us_dedes/miscellanea:misc.Ode4
ltx/en_us_dedes/pe.d085:peMA.Ode4C14.text	
ltx/en_us_dedes/pe.d085:peMA.Ode4C15.incipit	…
ltx/en_us_dedes/pe.d085:peMA.Ode4C15.melody	@ltx/en_us_dedes/he.h.m2:heHE.TinEkParthenou.name
ltx/en_us_dedes/pe.d085:peMA.Ode4C15.mode	@ltx/en_us_dedes/miscellanea:misc.Mode2
ltx/en_us_dedes/pe.d085:peMA.Ode4C15.ode	@ltx/en_us_dedes/miscellanea:misc.Ode4
ltx/en_us_dedes/pe.d085:peMA.Ode4C15.text	
ltx/en_us_dedes/pe.d085:peMA.Ode4C16.incipit	…
ltx/en_us_dedes/pe.d085:peMA.Ode4C16.melody	@ltx/en_us_dedes/he.h.m2:heHE.TinEkParthenou.name
ltx/en_us_dedes/pe.d085:peMA.Ode4C16.mode	@ltx/en_us_dedes/miscellanea:misc.Mode2
ltx/en_us_dedes/pe.d085:peMA.Ode4C16.ode	@ltx/en_us_dedes/miscellanea:misc.Ode4
ltx/en_us_dedes/pe.d085:peMA.Ode4C16.text	
ltx/en_us_dedes/pe.d085:peMA.Ode4C17.incipit	…
ltx/en_us_dedes/pe.d085:peMA.Ode4C17.melody	@ltx/en_us_dedes/he.h.m2:heHE.TinEkParthenou.name
ltx/en_us_dedes/pe.d085:peMA.Ode4C17.mode	@ltx/en_us_dedes/miscellanea:misc.Mode2
ltx/en_us_dedes/pe.d085:peMA.Ode4C17.ode	@ltx/en_us_dedes/miscellanea:misc.Ode4
ltx/en_us_dedes/pe.d085:peMA.Ode4C17.text	
ltx/en_us_dedes/pe.d085:peMA.Ode4C1F1.greekmelody	@ltx/en_us_dedes/he.h.m2:heHE.TinEkParthenou.greekname
ltx/en_us_dedes/pe.d085:peMA.Ode4C1F1.incipit	…
ltx/en_us_dedes/pe.d085:peMA.Ode4C1F1.melody	@ltx/en_us_dedes/he.h.m2:heHE.TinEkParthenou.name
ltx/en_us_dedes/pe.d085:peMA.Ode4C1F1.mode	@ltx/en_us_dedes/miscellanea:misc.Mode2
ltx/en_us_dedes/pe.d085:peMA.Ode4C1F1.ode	@ltx/en_us_dedes/miscellanea:misc.Ode4
ltx/en_us_dedes/pe.d085:peMA.Ode4C1F1.text	
ltx/en_us_dedes/pe.d085:peMA.Ode4C1F2.incipit	…
ltx/en_us_dedes/pe.d085:peMA.Ode4C1F2.melody	@ltx/en_us_dedes/he.h.m2:heHE.TinEkParthenou.name
ltx/en_us_dedes/pe.d085:peMA.Ode4C1F2.mode	@ltx/en_us_dedes/miscellanea:misc.Mode2
ltx/en_us_dedes/pe.d085:peMA.Ode4C1F2.ode	@ltx/en_us_dedes/miscellanea:misc.Ode4
ltx/en_us_dedes/pe.d085:peMA.Ode4C1F2.text	
ltx/en_us_dedes/pe.d085:peMA.Ode4C1H.greekmelody	@ltx/en_us_dedes/he.h.m2:heHE.TinEkParthenou.greekname
ltx/en_us_dedes/pe.d085:peMA.Ode4C1H.incipit	@ltx/en_us_dedes/he.h.m2:heHE.TinEkParthenou.incipit
ltx/en_us_dedes/pe.d085:peMA.Ode4C1H.melody	@ltx/en_us_dedes/he.h.m2:heHE.TinEkParthenou.melody
ltx/en_us_dedes/pe.d085:peMA.Ode4C1H.mode	@ltx/en_us_dedes/miscellanea:misc.Mode2
ltx/en_us_dedes/pe.d085:peMA.Ode4C1H.ode	@ltx/en_us_dedes/miscellanea:misc.Ode4
ltx/en_us_dedes/pe.d085:peMA.Ode4C1H.text	@ltx/en_us_dedes/he.h.m2:heHE.TinEkParthenou.text
ltx/en_us_dedes/pe.d085:peMA.Ode4C1T.incipit	…
ltx/en_us_dedes/pe.d085:peMA.Ode4C1T.melody	@ltx/en_us_dedes/he.h.m2:heHE.TinEkParthenou.name
ltx/en_us_dedes/pe.d085:peMA.Ode4C1T.mode	@ltx/en_us_dedes/miscellanea:misc.Mode2
ltx/en_us_dedes/pe.d085:peMA.Ode4C1T.ode	@ltx/en_us_dedes/miscellanea:misc.Ode4
ltx/en_us_dedes/pe.d085:peMA.Ode4C1T.text	
ltx/en_us_dedes/pe.d085:peMA.Ode4C1Tr.incipit	…
ltx/en_us_dedes/pe.d085:peMA.Ode4C1Tr.melody	@ltx/en_us_dedes/he.h.m2:heHE.TinEkParthenou.name
ltx/en_us_dedes/pe.d085:peMA.Ode4C1Tr.mode	@ltx/en_us_dedes/miscellanea:misc.Mode2
ltx/en_us_dedes/pe.d085:peMA.Ode4C1Tr.ode	@ltx/en_us_dedes/miscellanea:misc.Ode4
ltx/en_us_dedes/pe.d085:peMA.Ode4C1Tr.text	
ltx/en_us_dedes/pe.d085:peMA.Ode5C11.greekmelody	@ltx/en_us_dedes/he.h.m2:heHE.TinAchlynTisPsychisMou.greekname
ltx/en_us_dedes/pe.d085:peMA.Ode5C11.incipit	…
ltx/en_us_dedes/pe.d085:peMA.Ode5C11.melody	@ltx/en_us_dedes/he.h.m2:heHE.TinAchlynTisPsychisMou.name
ltx/en_us_dedes/pe.d085:peMA.Ode5C11.mode	@ltx/en_us_dedes/miscellanea:misc.Mode2
ltx/en_us_dedes/pe.d085:peMA.Ode5C11.ode	@ltx/en_us_dedes/miscellanea:misc.Ode5
ltx/en_us_dedes/pe.d085:peMA.Ode5C11.text	
ltx/en_us_dedes/pe.d085:peMA.Ode5C12.incipit	…
ltx/en_us_dedes/pe.d085:peMA.Ode5C12.melody	@ltx/en_us_dedes/he.h.m2:heHE.TinAchlynTisPsychisMou.name
ltx/en_us_dedes/pe.d085:peMA.Ode5C12.mode	@ltx/en_us_dedes/miscellanea:misc.Mode2
ltx/en_us_dedes/pe.d085:peMA.Ode5C12.ode	@ltx/en_us_dedes/miscellanea:misc.Ode5
ltx/en_us_dedes/pe.d085:peMA.Ode5C12.text	
ltx/en_us_dedes/pe.d085:peMA.Ode5C13.incipit	…
ltx/en_us_dedes/pe.d085:peMA.Ode5C13.melody	@ltx/en_us_dedes/he.h.m2:heHE.TinAchlynTisPsychisMou.name
ltx/en_us_dedes/pe.d085:peMA.Ode5C13.mode	@ltx/en_us_dedes/miscellanea:misc.Mode2
ltx/en_us_dedes/pe.d085:peMA.Ode5C13.ode	@ltx/en_us_dedes/miscellanea:misc.Ode5
ltx/en_us_dedes/pe.d085:peMA.Ode5C13.text	
ltx/en_us_dedes/pe.d085:peMA.Ode5C14.incipit	…
ltx/en_us_dedes/pe.d085:peMA.Ode5C14.melody	@ltx/en_us_dedes/he.h.m2:heHE.TinAchlynTisPsychisMou.name
ltx/en_us_dedes/pe.d085:peMA.Ode5C14.mode	@ltx/en_us_dedes/miscellanea:misc.Mode2
ltx/en_us_dedes/pe.d085:peMA.Ode5C14.ode	@ltx/en_us_dedes/miscellanea:misc.Ode5
ltx/en_us_dedes/pe.d085:peMA.Ode5C14.text	
ltx/en_us_dedes/pe.d085:peMA.Ode5C15.incipit	…
ltx/en_us_dedes/pe.d085:peMA.Ode5C15.melody	@ltx/en_us_dedes/he.h.m2:heHE.TinAchlynTisPsychisMou.name
ltx/en_us_dedes/pe.d085:peMA.Ode5C15.mode	@ltx/en_us_dedes/miscellanea:misc.Mode2
ltx/en_us_dedes/pe.d085:peMA.Ode5C15.ode	@ltx/en_us_dedes/miscellanea:misc.Ode5
ltx/en_us_dedes/pe.d085:peMA.Ode5C15.text	
ltx/en_us_dedes/pe.d085:peMA.Ode5C16.incipit	…
ltx/en_us_dedes/pe.d085:peMA.Ode5C16.melody	@ltx/en_us_dedes/he.h.m2:heHE.TinAchlynTisPsychisMou.name
ltx/en_us_dedes/pe.d085:peMA.Ode5C16.mode	@ltx/en_us_dedes/miscellanea:misc.Mode2
ltx/en_us_dedes/pe.d085:peMA.Ode5C16.ode	@ltx/en_us_dedes/miscellanea:misc.Ode5
ltx/en_us_dedes/pe.d085:peMA.Ode5C16.text	
ltx/en_us_dedes/pe.d085:peMA.Ode5C17.incipit	…
ltx/en_us_dedes/pe.d085:peMA.Ode5C17.melody	@ltx/en_us_dedes/he.h.m2:heHE.TinAchlynTisPsychisMou.name
ltx/en_us_dedes/pe.d085:peMA.Ode5C17.mode	@ltx/en_us_dedes/miscellanea:misc.Mode2
ltx/en_us_dedes/pe.d085:peMA.Ode5C17.ode	@ltx/en_us_dedes/miscellanea:misc.Ode5
ltx/en_us_dedes/pe.d085:peMA.Ode5C17.text	
ltx/en_us_dedes/pe.d085:peMA.Ode5C1F1.greekmelody	@ltx/en_us_dedes/he.h.m2:heHE.TinAchlynTisPsychisMou.greekname
ltx/en_us_dedes/pe.d085:peMA.Ode5C1F1.incipit	…
ltx/en_us_dedes/pe.d085:peMA.Ode5C1F1.melody	@ltx/en_us_dedes/he.h.m2:heHE.TinAchlynTisPsychisMou.name
ltx/en_us_dedes/pe.d085:peMA.Ode5C1F1.mode	@ltx/en_us_dedes/miscellanea:misc.Mode2
ltx/en_us_dedes/pe.d085:peMA.Ode5C1F1.ode	@ltx/en_us_dedes/miscellanea:misc.Ode5
ltx/en_us_dedes/pe.d085:peMA.Ode5C1F1.text	
ltx/en_us_dedes/pe.d085:peMA.Ode5C1F2.incipit	…
ltx/en_us_dedes/pe.d085:peMA.Ode5C1F2.melody	@ltx/en_us_dedes/he.h.m2:heHE.TinAchlynTisPsychisMou.name
ltx/en_us_dedes/pe.d085:peMA.Ode5C1F2.mode	@ltx/en_us_dedes/miscellanea:misc.Mode2
ltx/en_us_dedes/pe.d085:peMA.Ode5C1F2.ode	@ltx/en_us_dedes/miscellanea:misc.Ode5
ltx/en_us_dedes/pe.d085:peMA.Ode5C1F2.text	
ltx/en_us_dedes/pe.d085:peMA.Ode5C1H.greekmelody	@ltx/en_us_dedes/he.h.m2:heHE.TinAchlynTisPsychisMou.greekname
ltx/en_us_dedes/pe.d085:peMA.Ode5C1H.incipit	@ltx/en_us_dedes/he.h.m2:heHE.TinAchlynTisPsychisMou.incipit
ltx/en_us_dedes/pe.d085:peMA.Ode5C1H.melody	@ltx/en_us_dedes/he.h.m2:heHE.TinAchlynTisPsychisMou.melody
ltx/en_us_dedes/pe.d085:peMA.Ode5C1H.mode	@ltx/en_us_dedes/miscellanea:misc.Mode2
ltx/en_us_dedes/pe.d085:peMA.Ode5C1H.ode	@ltx/en_us_dedes/miscellanea:misc.Ode5
ltx/en_us_dedes/pe.d085:peMA.Ode5C1H.text	@ltx/en_us_dedes/he.h.m2:heHE.TinAchlynTisPsychisMou.text
ltx/en_us_dedes/pe.d085:peMA.Ode5C1T.incipit	…
ltx/en_us_dedes/pe.d085:peMA.Ode5C1T.melody	@ltx/en_us_dedes/he.h.m2:heHE.TinAchlynTisPsychisMou.name
ltx/en_us_dedes/pe.d085:peMA.Ode5C1T.mode	@ltx/en_us_dedes/miscellanea:misc.Mode2
ltx/en_us_dedes/pe.d085:peMA.Ode5C1T.ode	@ltx/en_us_dedes/miscellanea:misc.Ode5
ltx/en_us_dedes/pe.d085:peMA.Ode5C1T.text	
ltx/en_us_dedes/pe.d085:peMA.Ode5C1Tr.incipit	…
ltx/en_us_dedes/pe.d085:peMA.Ode5C1Tr.melody	@ltx/en_us_dedes/he.h.m2:heHE.TinAchlynTisPsychisMou.name
ltx/en_us_dedes/pe.d085:peMA.Ode5C1Tr.mode	@ltx/en_us_dedes/miscellanea:misc.Mode2
ltx/en_us_dedes/pe.d085:peMA.Ode5C1Tr.ode	@ltx/en_us_dedes/miscellanea:misc.Ode5
ltx/en_us_dedes/pe.d085:peMA.Ode5C1Tr.text	
ltx/en_us_dedes/pe.d085:peMA.Ode6C11.greekmelody	@ltx/en_us_dedes/he.h.m2:heHE.VythoAmartimaton.greekname
ltx/en_us_dedes/pe.d085:peMA.Ode6C11.incipit	…
ltx/en_us_dedes/pe.d085:peMA.Ode6C11.melody	@ltx/en_us_dedes/he.h.m2:heHE.VythoAmartimaton.name
ltx/en_us_dedes/pe.d085:peMA.Ode6C11.mode	@ltx/en_us_dedes/miscellanea:misc.Mode2
ltx/en_us_dedes/pe.d085:peMA.Ode6C11.ode	@ltx/en_us_dedes/miscellanea:misc.Ode6
ltx/en_us_dedes/pe.d085:peMA.Ode6C11.text	
ltx/en_us_dedes/pe.d085:peMA.Ode6C12.incipit	…
ltx/en_us_dedes/pe.d085:peMA.Ode6C12.melody	@ltx/en_us_dedes/he.h.m2:heHE.VythoAmartimaton.name
ltx/en_us_dedes/pe.d085:peMA.Ode6C12.mode	@ltx/en_us_dedes/miscellanea:misc.Mode2
ltx/en_us_dedes/pe.d085:peMA.Ode6C12.ode	@ltx/en_us_dedes/miscellanea:misc.Ode6
ltx/en_us_dedes/pe.d085:peMA.Ode6C12.text	
ltx/en_us_dedes/pe.d085:peMA.Ode6C13.incipit	…
ltx/en_us_dedes/pe.d085:peMA.Ode6C13.melody	@ltx/en_us_dedes/he.h.m2:heHE.VythoAmartimaton.name
ltx/en_us_dedes/pe.d085:peMA.Ode6C13.mode	@ltx/en_us_dedes/miscellanea:misc.Mode2
ltx/en_us_dedes/pe.d085:peMA.Ode6C13.ode	@ltx/en_us_dedes/miscellanea:misc.Ode6
ltx/en_us_dedes/pe.d085:peMA.Ode6C13.text	
ltx/en_us_dedes/pe.d085:peMA.Ode6C14.incipit	…
ltx/en_us_dedes/pe.d085:peMA.Ode6C14.melody	@ltx/en_us_dedes/he.h.m2:heHE.VythoAmartimaton.name
ltx/en_us_dedes/pe.d085:peMA.Ode6C14.mode	@ltx/en_us_dedes/miscellanea:misc.Mode2
ltx/en_us_dedes/pe.d085:peMA.Ode6C14.ode	@ltx/en_us_dedes/miscellanea:misc.Ode6
ltx/en_us_dedes/pe.d085:peMA.Ode6C14.text	
ltx/en_us_dedes/pe.d085:peMA.Ode6C1F1.greekmelody	@ltx/en_us_dedes/he.h.m2:heHE.VythoAmartimaton.greekname
ltx/en_us_dedes/pe.d085:peMA.Ode6C1F1.incipit	…
ltx/en_us_dedes/pe.d085:peMA.Ode6C1F1.melody	@ltx/en_us_dedes/he.h.m2:heHE.VythoAmartimaton.name
ltx/en_us_dedes/pe.d085:peMA.Ode6C1F1.mode	@ltx/en_us_dedes/miscellanea:misc.Mode2
ltx/en_us_dedes/pe.d085:peMA.Ode6C1F1.ode	@ltx/en_us_dedes/miscellanea:misc.Ode6
ltx/en_us_dedes/pe.d085:peMA.Ode6C1F1.text	
ltx/en_us_dedes/pe.d085:peMA.Ode6C1F2.incipit	…
ltx/en_us_dedes/pe.d085:peMA.Ode6C1F2.melody	@ltx/en_us_dedes/he.h.m2:heHE.VythoAmartimaton.name
ltx/en_us_dedes/pe.d085:peMA.Ode6C1F2.mode	@ltx/en_us_dedes/miscellanea:misc.Mode2
ltx/en_us_dedes/pe.d085:peMA.Ode6C1F2.ode	@ltx/en_us_dedes/miscellanea:misc.Ode6
ltx/en_us_dedes/pe.d085:peMA.Ode6C1F2.text	
ltx/en_us_dedes/pe.d085:peMA.Ode6C1H.greekmelody	@ltx/en_us_dedes/he.h.m2:heHE.VythoAmartimaton.greekname
ltx/en_us_dedes/pe.d085:peMA.Ode6C1H.incipit	@ltx/en_us_dedes/he.h.m2:heHE.VythoAmartimaton.incipit
ltx/en_us_dedes/pe.d085:peMA.Ode6C1H.melody	@ltx/en_us_dedes/he.h.m2:heHE.VythoAmartimaton.melody
ltx/en_us_dedes/pe.d085:peMA.Ode6C1H.mode	@ltx/en_us_dedes/miscellanea:misc.Mode2
ltx/en_us_dedes/pe.d085:peMA.Ode6C1H.ode	@ltx/en_us_dedes/miscellanea:misc.Ode6
ltx/en_us_dedes/pe.d085:peMA.Ode6C1H.text	@ltx/en_us_dedes/he.h.m2:heHE.VythoAmartimaton.text
ltx/en_us_dedes/pe.d085:peMA.Ode6C1T.incipit	…
ltx/en_us_dedes/pe.d085:peMA.Ode6C1T.melody	@ltx/en_us_dedes/he.h.m2:heHE.VythoAmartimaton.name
ltx/en_us_dedes/pe.d085:peMA.Ode6C1T.mode	@ltx/en_us_dedes/miscellanea:misc.Mode2
ltx/en_us_dedes/pe.d085:peMA.Ode6C1T.ode	@ltx/en_us_dedes/miscellanea:misc.Ode6
ltx/en_us_dedes/pe.d085:peMA.Ode6C1T.text	
ltx/en_us_dedes/pe.d085:peMA.Ode6C1Tr.incipit	…
ltx/en_us_dedes/pe.d085:peMA.Ode6C1Tr.melody	@ltx/en_us_dedes/he.h.m2:heHE.VythoAmartimaton.name
ltx/en_us_dedes/pe.d085:peMA.Ode6C1Tr.mode	@ltx/en_us_dedes/miscellanea:misc.Mode2
ltx/en_us_dedes/pe.d085:peMA.Ode6C1Tr.ode	@ltx/en_us_dedes/miscellanea:misc.Ode6
ltx/en_us_dedes/pe.d085:peMA.Ode6C1Tr.text	
ltx/en_us_dedes/pe.d085:peMA.Ode7C11.greekmelody	@ltx/en_us_dedes/he.h.m2:heHE.TaCherouvimMimoumenoi.greekname
ltx/en_us_dedes/pe.d085:peMA.Ode7C11.incipit	…
ltx/en_us_dedes/pe.d085:peMA.Ode7C11.melody	@ltx/en_us_dedes/he.h.m2:heHE.TaCherouvimMimoumenoi.name
ltx/en_us_dedes/pe.d085:peMA.Ode7C11.mode	@ltx/en_us_dedes/miscellanea:misc.Mode2
ltx/en_us_dedes/pe.d085:peMA.Ode7C11.ode	@ltx/en_us_dedes/miscellanea:misc.Ode7
ltx/en_us_dedes/pe.d085:peMA.Ode7C11.text	
ltx/en_us_dedes/pe.d085:peMA.Ode7C12.incipit	…
ltx/en_us_dedes/pe.d085:peMA.Ode7C12.melody	@ltx/en_us_dedes/he.h.m2:heHE.TaCherouvimMimoumenoi.name
ltx/en_us_dedes/pe.d085:peMA.Ode7C12.mode	@ltx/en_us_dedes/miscellanea:misc.Mode2
ltx/en_us_dedes/pe.d085:peMA.Ode7C12.ode	@ltx/en_us_dedes/miscellanea:misc.Ode7
ltx/en_us_dedes/pe.d085:peMA.Ode7C12.text	
ltx/en_us_dedes/pe.d085:peMA.Ode7C13.incipit	…
ltx/en_us_dedes/pe.d085:peMA.Ode7C13.melody	@ltx/en_us_dedes/he.h.m2:heHE.TaCherouvimMimoumenoi.name
ltx/en_us_dedes/pe.d085:peMA.Ode7C13.mode	@ltx/en_us_dedes/miscellanea:misc.Mode2
ltx/en_us_dedes/pe.d085:peMA.Ode7C13.ode	@ltx/en_us_dedes/miscellanea:misc.Ode7
ltx/en_us_dedes/pe.d085:peMA.Ode7C13.text	
ltx/en_us_dedes/pe.d085:peMA.Ode7C14.incipit	…
ltx/en_us_dedes/pe.d085:peMA.Ode7C14.melody	@ltx/en_us_dedes/he.h.m2:heHE.TaCherouvimMimoumenoi.name
ltx/en_us_dedes/pe.d085:peMA.Ode7C14.mode	@ltx/en_us_dedes/miscellanea:misc.Mode2
ltx/en_us_dedes/pe.d085:peMA.Ode7C14.ode	@ltx/en_us_dedes/miscellanea:misc.Ode7
ltx/en_us_dedes/pe.d085:peMA.Ode7C14.text	
ltx/en_us_dedes/pe.d085:peMA.Ode7C1F1.greekmelody	@ltx/en_us_dedes/he.h.m2:heHE.TaCherouvimMimoumenoi.greekname
ltx/en_us_dedes/pe.d085:peMA.Ode7C1F1.incipit	…
ltx/en_us_dedes/pe.d085:peMA.Ode7C1F1.melody	@ltx/en_us_dedes/he.h.m2:heHE.TaCherouvimMimoumenoi.name
ltx/en_us_dedes/pe.d085:peMA.Ode7C1F1.mode	@ltx/en_us_dedes/miscellanea:misc.Mode2
ltx/en_us_dedes/pe.d085:peMA.Ode7C1F1.ode	@ltx/en_us_dedes/miscellanea:misc.Ode7
ltx/en_us_dedes/pe.d085:peMA.Ode7C1F1.text	
ltx/en_us_dedes/pe.d085:peMA.Ode7C1F2.incipit	…
ltx/en_us_dedes/pe.d085:peMA.Ode7C1F2.melody	@ltx/en_us_dedes/he.h.m2:heHE.TaCherouvimMimoumenoi.name
ltx/en_us_dedes/pe.d085:peMA.Ode7C1F2.mode	@ltx/en_us_dedes/miscellanea:misc.Mode2
ltx/en_us_dedes/pe.d085:peMA.Ode7C1F2.ode	@ltx/en_us_dedes/miscellanea:misc.Ode7
ltx/en_us_dedes/pe.d085:peMA.Ode7C1F2.text	
ltx/en_us_dedes/pe.d085:peMA.Ode7C1H.greekmelody	@ltx/en_us_dedes/he.h.m2:heHE.TaCherouvimMimoumenoi.greekname
ltx/en_us_dedes/pe.d085:peMA.Ode7C1H.incipit	@ltx/en_us_dedes/he.h.m2:heHE.TaCherouvimMimoumenoi.incipit
ltx/en_us_dedes/pe.d085:peMA.Ode7C1H.melody	@ltx/en_us_dedes/he.h.m2:heHE.TaCherouvimMimoumenoi.melody
ltx/en_us_dedes/pe.d085:peMA.Ode7C1H.mode	@ltx/en_us_dedes/miscellanea:misc.Mode2
ltx/en_us_dedes/pe.d085:peMA.Ode7C1H.ode	@ltx/en_us_dedes/miscellanea:misc.Ode7
ltx/en_us_dedes/pe.d085:peMA.Ode7C1H.text	@ltx/en_us_dedes/he.h.m2:heHE.TaCherouvimMimoumenoi.text
ltx/en_us_dedes/pe.d085:peMA.Ode7C1T.incipit	…
ltx/en_us_dedes/pe.d085:peMA.Ode7C1T.melody	@ltx/en_us_dedes/he.h.m2:heHE.TaCherouvimMimoumenoi.name
ltx/en_us_dedes/pe.d085:peMA.Ode7C1T.mode	@ltx/en_us_dedes/miscellanea:misc.Mode2
ltx/en_us_dedes/pe.d085:peMA.Ode7C1T.ode	@ltx/en_us_dedes/miscellanea:misc.Ode7
ltx/en_us_dedes/pe.d085:peMA.Ode7C1T.text	
ltx/en_us_dedes/pe.d085:peMA.Ode7C1Tr.incipit	…
ltx/en_us_dedes/pe.d085:peMA.Ode7C1Tr.melody	@ltx/en_us_dedes/he.h.m2:heHE.TaCherouvimMimoumenoi.name
ltx/en_us_dedes/pe.d085:peMA.Ode7C1Tr.mode	@ltx/en_us_dedes/miscellanea:misc.Mode2
ltx/en_us_dedes/pe.d085:peMA.Ode7C1Tr.ode	@ltx/en_us_dedes/miscellanea:misc.Ode7
ltx/en_us_dedes/pe.d085:peMA.Ode7C1Tr.text	
ltx/en_us_dedes/pe.d085:peMA.Ode8C11.greekmelody	@ltx/en_us_dedes/he.h.m2:heHE.TonEnTiVatoMosi.greekname
ltx/en_us_dedes/pe.d085:peMA.Ode8C11.incipit	…
ltx/en_us_dedes/pe.d085:peMA.Ode8C11.melody	@ltx/en_us_dedes/he.h.m2:heHE.TonEnTiVatoMosi.name
ltx/en_us_dedes/pe.d085:peMA.Ode8C11.mode	@ltx/en_us_dedes/miscellanea:misc.Mode2
ltx/en_us_dedes/pe.d085:peMA.Ode8C11.ode	@ltx/en_us_dedes/miscellanea:misc.Ode8
ltx/en_us_dedes/pe.d085:peMA.Ode8C11.text	
ltx/en_us_dedes/pe.d085:peMA.Ode8C12.incipit	…
ltx/en_us_dedes/pe.d085:peMA.Ode8C12.melody	@ltx/en_us_dedes/he.h.m2:heHE.TonEnTiVatoMosi.name
ltx/en_us_dedes/pe.d085:peMA.Ode8C12.mode	@ltx/en_us_dedes/miscellanea:misc.Mode2
ltx/en_us_dedes/pe.d085:peMA.Ode8C12.ode	@ltx/en_us_dedes/miscellanea:misc.Ode8
ltx/en_us_dedes/pe.d085:peMA.Ode8C12.text	
ltx/en_us_dedes/pe.d085:peMA.Ode8C13.incipit	…
ltx/en_us_dedes/pe.d085:peMA.Ode8C13.melody	@ltx/en_us_dedes/he.h.m2:heHE.TonEnTiVatoMosi.name
ltx/en_us_dedes/pe.d085:peMA.Ode8C13.mode	@ltx/en_us_dedes/miscellanea:misc.Mode2
ltx/en_us_dedes/pe.d085:peMA.Ode8C13.ode	@ltx/en_us_dedes/miscellanea:misc.Ode8
ltx/en_us_dedes/pe.d085:peMA.Ode8C13.text	
ltx/en_us_dedes/pe.d085:peMA.Ode8C14.incipit	…
ltx/en_us_dedes/pe.d085:peMA.Ode8C14.melody	@ltx/en_us_dedes/he.h.m2:heHE.TonEnTiVatoMosi.name
ltx/en_us_dedes/pe.d085:peMA.Ode8C14.mode	@ltx/en_us_dedes/miscellanea:misc.Mode2
ltx/en_us_dedes/pe.d085:peMA.Ode8C14.ode	@ltx/en_us_dedes/miscellanea:misc.Ode8
ltx/en_us_dedes/pe.d085:peMA.Ode8C14.text	
ltx/en_us_dedes/pe.d085:peMA.Ode8C15.incipit	…
ltx/en_us_dedes/pe.d085:peMA.Ode8C15.melody	@ltx/en_us_dedes/he.h.m2:heHE.TonEnTiVatoMosi.name
ltx/en_us_dedes/pe.d085:peMA.Ode8C15.mode	@ltx/en_us_dedes/miscellanea:misc.Mode2
ltx/en_us_dedes/pe.d085:peMA.Ode8C15.ode	@ltx/en_us_dedes/miscellanea:misc.Ode8
ltx/en_us_dedes/pe.d085:peMA.Ode8C15.text	
ltx/en_us_dedes/pe.d085:peMA.Ode8C16.incipit	…
ltx/en_us_dedes/pe.d085:peMA.Ode8C16.melody	@ltx/en_us_dedes/he.h.m2:heHE.TonEnTiVatoMosi.name
ltx/en_us_dedes/pe.d085:peMA.Ode8C16.mode	@ltx/en_us_dedes/miscellanea:misc.Mode2
ltx/en_us_dedes/pe.d085:peMA.Ode8C16.ode	@ltx/en_us_dedes/miscellanea:misc.Ode8
ltx/en_us_dedes/pe.d085:peMA.Ode8C16.text	
ltx/en_us_dedes/pe.d085:peMA.Ode8C17.incipit	…
ltx/en_us_dedes/pe.d085:peMA.Ode8C17.melody	@ltx/en_us_dedes/he.h.m2:heHE.TonEnTiVatoMosi.name
ltx/en_us_dedes/pe.d085:peMA.Ode8C17.mode	@ltx/en_us_dedes/miscellanea:misc.Mode2
ltx/en_us_dedes/pe.d085:peMA.Ode8C17.ode	@ltx/en_us_dedes/miscellanea:misc.Ode8
ltx/en_us_dedes/pe.d085:peMA.Ode8C17.text	
ltx/en_us_dedes/pe.d085:peMA.Ode8C1F1.greekmelody	@ltx/en_us_dedes/he.h.m2:heHE.TonEnTiVatoMosi.greekname
ltx/en_us_dedes/pe.d085:peMA.Ode8C1F1.incipit	…
ltx/en_us_dedes/pe.d085:peMA.Ode8C1F1.melody	@ltx/en_us_dedes/he.h.m2:heHE.TonEnTiVatoMosi.name
ltx/en_us_dedes/pe.d085:peMA.Ode8C1F1.mode	@ltx/en_us_dedes/miscellanea:misc.Mode2
ltx/en_us_dedes/pe.d085:peMA.Ode8C1F1.ode	@ltx/en_us_dedes/miscellanea:misc.Ode8
ltx/en_us_dedes/pe.d085:peMA.Ode8C1F1.text	
ltx/en_us_dedes/pe.d085:peMA.Ode8C1F2.incipit	…
ltx/en_us_dedes/pe.d085:peMA.Ode8C1F2.melody	@ltx/en_us_dedes/he.h.m2:heHE.TonEnTiVatoMosi.name
ltx/en_us_dedes/pe.d085:peMA.Ode8C1F2.mode	@ltx/en_us_dedes/miscellanea:misc.Mode2
ltx/en_us_dedes/pe.d085:peMA.Ode8C1F2.ode	@ltx/en_us_dedes/miscellanea:misc.Ode8
ltx/en_us_dedes/pe.d085:peMA.Ode8C1F2.text	
ltx/en_us_dedes/pe.d085:peMA.Ode8C1H.greekmelody	@ltx/en_us_dedes/he.h.m2:heHE.TonEnTiVatoMosi.greekname
ltx/en_us_dedes/pe.d085:peMA.Ode8C1H.incipit	@ltx/en_us_dedes/he.h.m2:heHE.TonEnTiVatoMosi.incipit
ltx/en_us_dedes/pe.d085:peMA.Ode8C1H.melody	@ltx/en_us_dedes/he.h.m2:heHE.TonEnTiVatoMosi.melody
ltx/en_us_dedes/pe.d085:peMA.Ode8C1H.mode	@ltx/en_us_dedes/miscellanea:misc.Mode2
ltx/en_us_dedes/pe.d085:peMA.Ode8C1H.ode	@ltx/en_us_dedes/miscellanea:misc.Ode8
ltx/en_us_dedes/pe.d085:peMA.Ode8C1H.text	@ltx/en_us_dedes/he.h.m2:heHE.TonEnTiVatoMosi.text
ltx/en_us_dedes/pe.d085:peMA.Ode8C1T.incipit	…
ltx/en_us_dedes/pe.d085:peMA.Ode8C1T.melody	@ltx/en_us_dedes/he.h.m2:heHE.TonEnTiVatoMosi.name
ltx/en_us_dedes/pe.d085:peMA.Ode8C1T.mode	@ltx/en_us_dedes/miscellanea:misc.Mode2
ltx/en_us_dedes/pe.d085:peMA.Ode8C1T.ode	@ltx/en_us_dedes/miscellanea:misc.Ode8
ltx/en_us_dedes/pe.d085:peMA.Ode8C1T.text	
ltx/en_us_dedes/pe.d085:peMA.Ode8C1Tr.incipit	…
ltx/en_us_dedes/pe.d085:peMA.Ode8C1Tr.melody	@ltx/en_us_dedes/he.h.m2:heHE.TonEnTiVatoMosi.name
ltx/en_us_dedes/pe.d085:peMA.Ode8C1Tr.mode	@ltx/en_us_dedes/miscellanea:misc.Mode2
ltx/en_us_dedes/pe.d085:peMA.Ode8C1Tr.ode	@ltx/en_us_dedes/miscellanea:misc.Ode8
ltx/en_us_dedes/pe.d085:peMA.Ode8C1Tr.text	
ltx/en_us_dedes/pe.d085:peMA.Ode9C11.greekmelody	@ltx/en_us_dedes/he.h.m2:heHE.TinYperfyosSarki.greekname
ltx/en_us_dedes/pe.d085:peMA.Ode9C11.incipit	…
ltx/en_us_dedes/pe.d085:peMA.Ode9C11.melody	@ltx/en_us_dedes/he.h.m2:heHE.TinYperfyosSarki.name
ltx/en_us_dedes/pe.d085:peMA.Ode9C11.mode	@ltx/en_us_dedes/miscellanea:misc.Mode2
ltx/en_us_dedes/pe.d085:peMA.Ode9C11.ode	@ltx/en_us_dedes/miscellanea:misc.Ode9
ltx/en_us_dedes/pe.d085:peMA.Ode9C11.text	
ltx/en_us_dedes/pe.d085:peMA.Ode9C12.incipit	…
ltx/en_us_dedes/pe.d085:peMA.Ode9C12.melody	@ltx/en_us_dedes/he.h.m2:heHE.TinYperfyosSarki.name
ltx/en_us_dedes/pe.d085:peMA.Ode9C12.mode	@ltx/en_us_dedes/miscellanea:misc.Mode2
ltx/en_us_dedes/pe.d085:peMA.Ode9C12.ode	@ltx/en_us_dedes/miscellanea:misc.Ode9
ltx/en_us_dedes/pe.d085:peMA.Ode9C12.text	
ltx/en_us_dedes/pe.d085:peMA.Ode9C13.incipit	…
ltx/en_us_dedes/pe.d085:peMA.Ode9C13.melody	@ltx/en_us_dedes/he.h.m2:heHE.TinYperfyosSarki.name
ltx/en_us_dedes/pe.d085:peMA.Ode9C13.mode	@ltx/en_us_dedes/miscellanea:misc.Mode2
ltx/en_us_dedes/pe.d085:peMA.Ode9C13.ode	@ltx/en_us_dedes/miscellanea:misc.Ode9
ltx/en_us_dedes/pe.d085:peMA.Ode9C13.text	
ltx/en_us_dedes/pe.d085:peMA.Ode9C14.incipit	…
ltx/en_us_dedes/pe.d085:peMA.Ode9C14.melody	@ltx/en_us_dedes/he.h.m2:heHE.TinYperfyosSarki.name
ltx/en_us_dedes/pe.d085:peMA.Ode9C14.mode	@ltx/en_us_dedes/miscellanea:misc.Mode2
ltx/en_us_dedes/pe.d085:peMA.Ode9C14.ode	@ltx/en_us_dedes/miscellanea:misc.Ode9
ltx/en_us_dedes/pe.d085:peMA.Ode9C14.text	
ltx/en_us_dedes/pe.d085:peMA.Ode9C15.incipit	…
ltx/en_us_dedes/pe.d085:peMA.Ode9C15.melody	@ltx/en_us_dedes/he.h.m2:heHE.TinYperfyosSarki.name
ltx/en_us_dedes/pe.d085:peMA.Ode9C15.mode	@ltx/en_us_dedes/miscellanea:misc.Mode2
ltx/en_us_dedes/pe.d085:peMA.Ode9C15.ode	@ltx/en_us_dedes/miscellanea:misc.Ode9
ltx/en_us_dedes/pe.d085:peMA.Ode9C15.text	
ltx/en_us_dedes/pe.d085:peMA.Ode9C16.incipit	…
ltx/en_us_dedes/pe.d085:peMA.Ode9C16.melody	@ltx/en_us_dedes/he.h.m2:heHE.TinYperfyosSarki.name
ltx/en_us_dedes/pe.d085:peMA.Ode9C16.mode	@ltx/en_us_dedes/miscellanea:misc.Mode2
ltx/en_us_dedes/pe.d085:peMA.Ode9C16.ode	@ltx/en_us_dedes/miscellanea:misc.Ode9
ltx/en_us_dedes/pe.d085:peMA.Ode9C16.text	
ltx/en_us_dedes/pe.d085:peMA.Ode9C17.incipit	…
ltx/en_us_dedes/pe.d085:peMA.Ode9C17.melody	@ltx/en_us_dedes/he.h.m2:heHE.TinYperfyosSarki.name
ltx/en_us_dedes/pe.d085:peMA.Ode9C17.mode	@ltx/en_us_dedes/miscellanea:misc.Mode2
ltx/en_us_dedes/pe.d085:peMA.Ode9C17.ode	@ltx/en_us_dedes/miscellanea:misc.Ode9
ltx/en_us_dedes/pe.d085:peMA.Ode9C17.text	
ltx/en_us_dedes/pe.d085:peMA.Ode9C18.incipit	…
ltx/en_us_dedes/pe.d085:peMA.Ode9C18.melody	@ltx/en_us_dedes/he.h.m2:heHE.TinYperfyosSarki.name
ltx/en_us_dedes/pe.d085:peMA.Ode9C18.mode	@ltx/en_us_dedes/miscellanea:misc.Mode2
ltx/en_us_dedes/pe.d085:peMA.Ode9C18.ode	@ltx/en_us_dedes/miscellanea:misc.Ode9
ltx/en_us_dedes/pe.d085:peMA.Ode9C18.text	
ltx/en_us_dedes/pe.d085:peMA.Ode9C1F1.greekmelody	@ltx/en_us_dedes/he.h.m2:heHE.TinYperfyosSarki.greekname
ltx/en_us_dedes/pe.d085:peMA.Ode9C1F1.incipit	…
ltx/en_us_dedes/pe.d085:peMA.Ode9C1F1.melody	@ltx/en_us_dedes/he.h.m2:heHE.TinYperfyosSarki.name
ltx/en_us_dedes/pe.d085:peMA.Ode9C1F1.mode	@ltx/en_us_dedes/miscellanea:misc.Mode2
ltx/en_us_dedes/pe.d085:peMA.Ode9C1F1.ode	@ltx/en_us_dedes/miscellanea:misc.Ode9
ltx/en_us_dedes/pe.d085:peMA.Ode9C1F1.text	
ltx/en_us_dedes/pe.d085:peMA.Ode9C1F2.incipit	…
ltx/en_us_dedes/pe.d085:peMA.Ode9C1F2.melody	@ltx/en_us_dedes/he.h.m2:heHE.TinYperfyosSarki.name
ltx/en_us_dedes/pe.d085:peMA.Ode9C1F2.mode	@ltx/en_us_dedes/miscellanea:misc.Mode2
ltx/en_us_dedes/pe.d085:peMA.Ode9C1F2.ode	@ltx/en_us_dedes/miscellanea:misc.Ode9
ltx/en_us_dedes/pe.d085:peMA.Ode9C1F2.text	
ltx/en_us_dedes/pe.d085:peMA.Ode9C1H.greekmelody	@ltx/en_us_dedes/he.h.m2:heHE.TinYperfyosSarki.greekname
ltx/en_us_dedes/pe.d085:peMA.Ode9C1H.incipit	@ltx/en_us_dedes/he.h.m2:heHE.TinYperfyosSarki.incipit
ltx/en_us_dedes/pe.d085:peMA.Ode9C1H.melody	@ltx/en_us_dedes/he.h.m2:heHE.TinYperfyosSarki.melody
ltx/en_us_dedes/pe.d085:peMA.Ode9C1H.mode	@ltx/en_us_dedes/miscellanea:misc.Mode2
ltx/en_us_dedes/pe.d085:peMA.Ode9C1H.ode	@ltx/en_us_dedes/miscellanea:misc.Ode9
ltx/en_us_dedes/pe.d085:peMA.Ode9C1H.text	@ltx/en_us_dedes/he.h.m2:heHE.TinYperfyosSarki.text
ltx/en_us_dedes/pe.d085:peMA.Ode9C1T.incipit	…
ltx/en_us_dedes/pe.d085:peMA.Ode9C1T.melody	@ltx/en_us_dedes/he.h.m2:heHE.TinYperfyosSarki.name
ltx/en_us_dedes/pe.d085:peMA.Ode9C1T.mode	@ltx/en_us_dedes/miscellanea:misc.Mode2
ltx/en_us_dedes/pe.d085:peMA.Ode9C1T.ode	@ltx/en_us_dedes/miscellanea:misc.Ode9
ltx/en_us_dedes/pe.d085:peMA.Ode9C1T.text	
ltx/en_us_dedes/pe.d085:peMA.Ode9C1Tr.incipit	…
ltx/en_us_dedes/pe.d085:peMA.Ode9C1Tr.melody	@ltx/en_us_dedes/he.h.m2:heHE.TinYperfyosSarki.name
ltx/en_us_dedes/pe.d085:peMA.Ode9C1Tr.mode	@ltx/en_us_dedes/miscellanea:misc.Mode2
ltx/en_us_dedes/pe.d085:peMA.Ode9C1Tr.ode	@ltx/en_us_dedes/miscellanea:misc.Ode9
ltx/en_us_dedes/pe.d085:peMA.Ode9C1Tr.text	
ltx/en_us_dedes/pe.d085:peMA.Oikos1.text	O Savior, as the myrrh-bearing women were on their way to Your sepulcher, they mentally wondered to themselves and said, “Who will roll the stone away from the tomb for us?” And looking up, they see that the stone has been rolled away. They were amazed by the look of the Angel and his robe. Trembling came upon them, and they considered fleeing. Then the young man said to them, “Do not you be afraid. The One you seek has risen. Come, see the place where the body of Jesus lay. Then go quickly and tell the Disciples, * ‘The Savior has risen from the sepulcher.’”
ltx/en_us_dedes/pe.d085:peSY.commemoration.couplet1.title	@ltx/en_us_dedes/titles:ti.Verses
ltx/en_us_dedes/pe.d085:peSY.commemoration.couplet1.verse1	The women disciples brought ointments to Christ.
ltx/en_us_dedes/pe.d085:peSY.commemoration.couplet1.verse2	And I bring, as ointment, a hymn to them.
ltx/en_us_dedes/pe.d085:peSY.commemoration.narration.p01	[paragraph 01]
ltx/en_us_dedes/pe.d085:peSY.commemoration.narration.p02	[paragraph 02]
ltx/en_us_dedes/pe.d085:peSY.commemoration.narration.p03	[paragraph 03]
ltx/en_us_dedes/pe.d085:peSY.commemoration.narration.p04	[paragraph 04]
ltx/en_us_dedes/pe.d085:peSY.commemoration.narration.p05	[paragraph 05]
ltx/en_us_dedes/pe.d085:peSY.commemoration.narration.p06	[paragraph 06]
ltx/en_us_dedes/pe.d085:peSY.commemoration.narration.p07	[paragraph 07]
ltx/en_us_dedes/pe.d085:peSY.commemoration.text	On this day, the third Sunday reckoned from Pascha, we celebrate the feast of the holy Myrrh-bearing Women. Furthermore, we commemorate Joseph of Arimathea, who was a secret disciple; and also Nicodemos, the disciple by night.
ltx/en_us_dedes/pe.d085:peSY.lastline	At the intercession of the holy Myrrh bearers, O God, have mercy on us. Amen.
ltx/en_us_dedes/pe.d085:peVE.Apolytikion1.incipit	@ltx/en_us_dedes/oc.m2.d1:ocVE.Apolytikion.incipit
ltx/en_us_dedes/pe.d085:peVE.Apolytikion1.melody	
ltx/en_us_dedes/pe.d085:peVE.Apolytikion1.mode	@ltx/en_us_dedes/miscellanea:misc.Mode2
ltx/en_us_dedes/pe.d085:peVE.Apolytikion1.text	@ltx/en_us_dedes/oc.m2.d1:ocVE.Apolytikion.text
ltx/en_us_dedes/pe.d085:peVE.Apolytikion2.incipit	@ltx/en_us_dedes/oc.m2.d1:ocMA.Kathisma11.incipit
ltx/en_us_dedes/pe.d085:peVE.Apolytikion2.melody	
ltx/en_us_dedes/pe.d085:peVE.Apolytikion2.mode	@ltx/en_us_dedes/miscellanea:misc.Mode2
ltx/en_us_dedes/pe.d085:peVE.Apolytikion2.text	@ltx/en_us_dedes/oc.m2.d1:ocMA.Kathisma11.text
ltx/en_us_dedes/pe.d085:peVE.Apolytikion3.incipit	@ltx/en_us_dedes/oc.m2.d1:ocMA.Kathisma12.incipit
ltx/en_us_dedes/pe.d085:peVE.Apolytikion3.melody	
ltx/en_us_dedes/pe.d085:peVE.Apolytikion3.mode	@ltx/en_us_dedes/miscellanea:misc.Mode2
ltx/en_us_dedes/pe.d085:peVE.Apolytikion3.text	@ltx/en_us_dedes/oc.m2.d1:ocMA.Kathisma12.text
ltx/en_us_dedes/pe.d085:peVE.AposGlory.incipit	@ltx/en_us_dedes/tr.d070:trVE.AposGlory.incipit
ltx/en_us_dedes/pe.d085:peVE.AposGlory.melody	@ltx/en_us_dedes/miscellanea:misc.Idiomelon
ltx/en_us_dedes/pe.d085:peVE.AposGlory.mode	@ltx/en_us_dedes/miscellanea:misc.Mode5
ltx/en_us_dedes/pe.d085:peVE.AposGlory.text	@ltx/en_us_dedes/tr.d070:trVE.AposGlory.text
ltx/en_us_dedes/pe.d085:peVE.Lity1.incipit	The Angel said to the…
ltx/en_us_dedes/pe.d085:peVE.Lity1.melody	@ltx/en_us_dedes/miscellanea:misc.Idiomelon
ltx/en_us_dedes/pe.d085:peVE.Lity1.mode	@ltx/en_us_dedes/miscellanea:misc.Mode1
ltx/en_us_dedes/pe.d085:peVE.Lity1.text	The Angel said to the Myrrh-bearing Women, “Why have you come to the tomb? Why are you looking among the dead for the One who is alive? The Lord has risen! Be of good cheer!”
ltx/en_us_dedes/pe.d085:peVE.Lity2.incipit	The Women came with fear…
ltx/en_us_dedes/pe.d085:peVE.Lity2.melody	@ltx/en_us_dedes/miscellanea:misc.Idiomelon
ltx/en_us_dedes/pe.d085:peVE.Lity2.mode	@ltx/en_us_dedes/miscellanea:misc.Mode1
ltx/en_us_dedes/pe.d085:peVE.Lity2.text	The Women came with fear to the tomb, eager to anoint Your Body with spices. When they did not find it, they were at a loss and began to ask each other about it, for they did not yet know about the Resurrection. Then an Angel appeared to them and said, “Christ is risen, granting you the great mercy.”
ltx/en_us_dedes/pe.d085:peVE.Lity3.incipit	To the tomb came Mary…
ltx/en_us_dedes/pe.d085:peVE.Lity3.melody	@ltx/en_us_dedes/miscellanea:misc.Idiomelon
ltx/en_us_dedes/pe.d085:peVE.Lity3.mode	@ltx/en_us_dedes/miscellanea:misc.Mode1
ltx/en_us_dedes/pe.d085:peVE.Lity3.text	To the tomb came Mary Magdalene and the other Mary, seeking the Lord. They saw the Angel like lightning sitting on the stone, and he said to them, “Why do you seek among the dead Him who is alive? He has risen, as He said. You will find Him in Galilee.” Let us cry out to Him: “O Lord who rose from the dead, glory to You!”
ltx/en_us_dedes/pe.d085:peVE.LityBoth.incipit	@ltx/en_us_dedes/oc.m6.d1:ocVE.AposTheotokion.incipit
ltx/en_us_dedes/pe.d085:peVE.LityBoth.melody	
ltx/en_us_dedes/pe.d085:peVE.LityBoth.mode	@ltx/en_us_dedes/miscellanea:misc.Mode6
ltx/en_us_dedes/pe.d085:peVE.LityBoth.text	@ltx/en_us_dedes/oc.m6.d1:ocVE.AposTheotokion.text
ltx/en_us_dedes/pe.d085:peVE.LityGlory.incipit	Joseph asked for the Body…
ltx/en_us_dedes/pe.d085:peVE.LityGlory.melody	@ltx/en_us_dedes/miscellanea:misc.Idiomelon
ltx/en_us_dedes/pe.d085:peVE.LityGlory.mode	@ltx/en_us_dedes/miscellanea:misc.Mode6
ltx/en_us_dedes/pe.d085:peVE.LityGlory.text	Joseph asked for the Body of Jesus, and he laid it in his own new tomb; for Jesus had to emerge from the grave as from His bridal chamber. “You who shattered the dominion of death and opened the gates of Paradise for all mankind, glory to You!”
ltx/en_us_dedes/pe.d085:peVE.MM.Stichera8910as567.text	
ltx/en_us_dedes/pe.d085:peVE.MM.Stichera89as56.text	
ltx/en_us_dedes/pe.d085:peVE.SticGlory.incipit	The myrrh-bearing women arrived at…
ltx/en_us_dedes/pe.d085:peVE.SticGlory.melody	@ltx/en_us_dedes/miscellanea:misc.Idiomelon
ltx/en_us_dedes/pe.d085:peVE.SticGlory.mode	@ltx/en_us_dedes/miscellanea:misc.Mode6
ltx/en_us_dedes/pe.d085:peVE.SticGlory.poet	@ltx/en_us_dedes/poets:po.KosmaMonachou
ltx/en_us_dedes/pe.d085:peVE.SticGlory.text	The myrrh-bearing women arrived at your sepulcher, and they saw the seals on the gravestone, but they did not find Your immaculate Body, O Lord. They had come in all earnestness, and lamenting they said, “Who has stolen our hope? Who took away the dead man, naked and covered with myrrh, his mother’s only consolation? He who revived the dead, oh, how has He died? He who plundered Hades, how was He buried? Nevertheless, arise, O Savior, by Your own authority, on the third day, as You said You would, and save our souls.”
ltx/en_us_dedes/pe.d085:peVE.Stichera08.incipit	The Myrrh-bearing women, very early…
ltx/en_us_dedes/pe.d085:peVE.Stichera08.melody	@ltx/en_us_dedes/miscellanea:misc.Idiomelon
ltx/en_us_dedes/pe.d085:peVE.Stichera08.mode	@ltx/en_us_dedes/miscellanea:misc.Mode2
ltx/en_us_dedes/pe.d085:peVE.Stichera08.poet	@ltx/en_us_dedes/poets:po.Anatoliou
ltx/en_us_dedes/pe.d085:peVE.Stichera08.text	The Myrrh-bearing women, very early in the morning, took their spices and went to the tomb of the Lord. When they found it not as they had hoped, they reverently pondered the removal of the stone, and they said to one another, “Where are the seals that secured the tomb? Where is Pilate’s guard and special security?” Then a shining Angel appeared as a messenger to the women who were unaware, and he said to them, “Why do you mournfully seek the One who is alive and who gave life to the human race? Christ our God is risen from the dead, as the almighty One, and He is granting us all incorruption and life, illumination and the great mercy.”
ltx/en_us_dedes/pe.d085:peVE.Stichera09.incipit	Why do you mix the…
ltx/en_us_dedes/pe.d085:peVE.Stichera09.melody	@ltx/en_us_dedes/miscellanea:misc.Idiomelon
ltx/en_us_dedes/pe.d085:peVE.Stichera09.mode	@ltx/en_us_dedes/miscellanea:misc.Mode2
ltx/en_us_dedes/pe.d085:peVE.Stichera09.poet	@ltx/en_us_dedes/poets:po.Koumoula
ltx/en_us_dedes/pe.d085:peVE.Stichera09.text	Why do you mix the ointments with your tears, O women disciples? The stone has been rolled away; the sepulcher is empty. See how corruption has been trampled underfoot by life. See how the seals on the stone obviously bear witness to this. See how stupefied in terror are the guards of the disobedient. Mortal humanity has been saved by the flesh of God, and Hades is lamenting. So joyfully run and say to the Apostles, that Christ who put death to death as the first-born from the dead is going ahead of you into Galilee.
ltx/en_us_dedes/pe.d085:peVE.Stichera10.incipit	At early dawn the Myrrh-bearing…
ltx/en_us_dedes/pe.d085:peVE.Stichera10.melody	@ltx/en_us_dedes/miscellanea:misc.Idiomelon
ltx/en_us_dedes/pe.d085:peVE.Stichera10.mode	@ltx/en_us_dedes/miscellanea:misc.Mode2
ltx/en_us_dedes/pe.d085:peVE.Stichera10.text	At early dawn the Myrrh-bearing women earnestly came to Your grave. They were seeking You, to anoint Your immaculate body, O Christ. And from what the Angel said, they became aware of the joyful evidence, and they went to the Apostles and proclaimed to them, “The author of our salvation has risen after plundering death, and in so doing He has granted the world everlasting life and the great mercy.”
