ltx/en_us_dedes/sy.m05.d07:cl.syMA.commemoration01.text	[saint/com 1]
ltx/en_us_dedes/sy.m05.d07:cl.syMA.commemoration02.text	[saint/com 2]
ltx/en_us_dedes/sy.m05.d07:cl.syMA.commemoration03.text	[saint/com 3]
ltx/en_us_dedes/sy.m05.d07:cl.syMA.commemoration04.text	[saint/com 4]
ltx/en_us_dedes/sy.m05.d07:cl.syMA.commemoration05.text	[saint/com 5]
ltx/en_us_dedes/sy.m05.d07:cl.syMA.commemoration06.text	[saint/com list]
ltx/en_us_dedes/sy.m05.d07:syMA.commemoration01.couplet1.title	@ltx/en_us_dedes/titles:ti.Verses
ltx/en_us_dedes/sy.m05.d07:syMA.commemoration01.couplet1.verse1	
ltx/en_us_dedes/sy.m05.d07:syMA.commemoration01.couplet1.verse2	
ltx/en_us_dedes/sy.m05.d07:syMA.commemoration01.narration.p01	
ltx/en_us_dedes/sy.m05.d07:syMA.commemoration01.single1	
ltx/en_us_dedes/sy.m05.d07:syMA.commemoration01.text	On May 7 we commemorate the Appearance of the Sign of the Precious Cross in the sky, during the reign of the Emperor Constantius, son of Saint Constantine the Great, when Cyril was Archbishop of Jerusalem.
ltx/en_us_dedes/sy.m05.d07:syMA.commemoration02.couplet1.title	@ltx/en_us_dedes/titles:ti.Verses
ltx/en_us_dedes/sy.m05.d07:syMA.commemoration02.couplet1.verse1	
ltx/en_us_dedes/sy.m05.d07:syMA.commemoration02.couplet1.verse2	
ltx/en_us_dedes/sy.m05.d07:syMA.commemoration02.narration.p01	
ltx/en_us_dedes/sy.m05.d07:syMA.commemoration02.text	On this day we also commemorate the holy Martyr Akakios.
ltx/en_us_dedes/sy.m05.d07:syMA.commemoration03.couplet1.title	@ltx/en_us_dedes/titles:ti.Verses
ltx/en_us_dedes/sy.m05.d07:syMA.commemoration03.couplet1.verse1	
ltx/en_us_dedes/sy.m05.d07:syMA.commemoration03.couplet1.verse2	
ltx/en_us_dedes/sy.m05.d07:syMA.commemoration03.narration.p01	
ltx/en_us_dedes/sy.m05.d07:syMA.commemoration03.narration.p02	
ltx/en_us_dedes/sy.m05.d07:syMA.commemoration03.text	On this day we also commemorate the contest of the holy Martyr Quadratus and those with him.
ltx/en_us_dedes/sy.m05.d07:syMA.commemoration04.couplet1.title	@ltx/en_us_dedes/titles:ti.Verses
ltx/en_us_dedes/sy.m05.d07:syMA.commemoration04.couplet1.verse1	
ltx/en_us_dedes/sy.m05.d07:syMA.commemoration04.couplet1.verse2	
ltx/en_us_dedes/sy.m05.d07:syMA.commemoration04.narration.p01	
ltx/en_us_dedes/sy.m05.d07:syMA.commemoration04.text	On this day we also commemorate our devout Father John Psychaites, the Confessor.
ltx/en_us_dedes/sy.m05.d07:syMA.commemoration05.couplet1.title	@ltx/en_us_dedes/titles:ti.Verses
ltx/en_us_dedes/sy.m05.d07:syMA.commemoration05.couplet1.verse1	
ltx/en_us_dedes/sy.m05.d07:syMA.commemoration05.couplet1.verse2	
ltx/en_us_dedes/sy.m05.d07:syMA.commemoration05.narration.p01	
ltx/en_us_dedes/sy.m05.d07:syMA.commemoration05.text	On this day we also commemorate the contest of the holy Martyr Maximus.
ltx/en_us_dedes/sy.m05.d07:syMA.lastline	By their holy intercessions, O God, have mercy on us. Amen.
