ltx/en_us_dedes/sy.m10.d10:syMA.commemoration01.couplet1.title	@ltx/en_us_dedes/titles:ti.Verses
ltx/en_us_dedes/sy.m10.d10:syMA.commemoration01.couplet1.verse1	
ltx/en_us_dedes/sy.m10.d10:syMA.commemoration01.couplet1.verse2	
ltx/en_us_dedes/sy.m10.d10:syMA.commemoration01.narration.p01	
ltx/en_us_dedes/sy.m10.d10:syMA.commemoration01.single1	
ltx/en_us_dedes/sy.m10.d10:syMA.commemoration01.text	On October 10, we commemorate the holy martyrs Eulampius and Eulampia.
ltx/en_us_dedes/sy.m10.d10:syMA.commemoration02.couplet1.title	@ltx/en_us_dedes/titles:ti.Verses
ltx/en_us_dedes/sy.m10.d10:syMA.commemoration02.couplet1.verse1	
ltx/en_us_dedes/sy.m10.d10:syMA.commemoration02.couplet1.verse2	
ltx/en_us_dedes/sy.m10.d10:syMA.commemoration02.text	On this day we commemorate the two-hundred holy martyrs who were killed along with Saint Eulampius.
ltx/en_us_dedes/sy.m10.d10:syMA.commemoration03.couplet1.title	@ltx/en_us_dedes/titles:ti.Verses
ltx/en_us_dedes/sy.m10.d10:syMA.commemoration03.couplet1.verse1	
ltx/en_us_dedes/sy.m10.d10:syMA.commemoration03.couplet1.verse2	
ltx/en_us_dedes/sy.m10.d10:syMA.commemoration03.narration.p01	
ltx/en_us_dedes/sy.m10.d10:syMA.commemoration03.text	On this day we commemorate our devout father Bassianus.
ltx/en_us_dedes/sy.m10.d10:syMA.commemoration04.couplet1.title	@ltx/en_us_dedes/titles:ti.Verses
ltx/en_us_dedes/sy.m10.d10:syMA.commemoration04.couplet1.verse1	
ltx/en_us_dedes/sy.m10.d10:syMA.commemoration04.couplet1.verse2	
ltx/en_us_dedes/sy.m10.d10:syMA.commemoration04.narration.p01	
ltx/en_us_dedes/sy.m10.d10:syMA.commemoration04.narration.p02	
ltx/en_us_dedes/sy.m10.d10:syMA.commemoration04.narration.p03	
ltx/en_us_dedes/sy.m10.d10:syMA.commemoration04.narration.p04	
ltx/en_us_dedes/sy.m10.d10:syMA.commemoration04.narration.p05	
ltx/en_us_dedes/sy.m10.d10:syMA.commemoration04.narration.p06	
ltx/en_us_dedes/sy.m10.d10:syMA.commemoration04.narration.p07	
ltx/en_us_dedes/sy.m10.d10:syMA.commemoration04.narration.p08	
ltx/en_us_dedes/sy.m10.d10:syMA.commemoration04.text	On this day we commemorate our devout father Theophilus the Confessor.
ltx/en_us_dedes/sy.m10.d10:syMA.lastline	By the intercessions of Your Saints, O God, have mercy on us. Amen.
