ltx/en_us_dedes/me.m09.d01:meDA.commemoration.first	Indiction
ltx/en_us_dedes/me.m09.d01:meDA.commemoration.first_name	
ltx/en_us_dedes/me.m09.d01:meDA.commemoration.first_short	Indiction
ltx/en_us_dedes/me.m09.d01:meDA.commemoration.first_title	@ltx/en_us_dedes/titles:ti.Indiction
ltx/en_us_dedes/me.m09.d01:meDA.commemoration.full	Beginning of the Indiction, i.e. the New Year; and Memory of our Devout Father Symeon the Stylite and Archimandrite; and Synaxis of the Recovery of the Icon of the Most Holy Theotokos of Miasenae; and the Holy Martyr Aeithalas, and the Holy 40 Women and their Teacher Ammoun the Deacon; and the Holy Martyrs Callista her Brothers Evodos and Hermogenes; and Memory of Joshua Son of Nun; and Commemoration of the Big Fire.
ltx/en_us_dedes/me.m09.d01:meDA.commemoration.second_name	
ltx/en_us_dedes/me.m09.d01:meDA.commemoration.second_title	@ltx/en_us_dedes/titles:ti.HolyWomen
ltx/en_us_dedes/me.m09.d01:meDA.date	September 1
ltx/en_us_dedes/me.m09.d01:meDA.fordate	for September 1
ltx/en_us_dedes/me.m09.d01:meDA.insert1	our devout and God-bearing father Symeon the Stylite,
ltx/en_us_dedes/me.m09.d01:meDA.insert2	whose memory we celebrate;
ltx/en_us_dedes/me.m09.d01:meDA.note	
ltx/en_us_dedes/me.m09.d01:meDA.pdfcoverdate	September 1,
ltx/en_us_dedes/me.m09.d01:meDA.pdfheaderdate	September 1
ltx/en_us_dedes/me.m09.d01:meHO.commemorations	
ltx/en_us_dedes/me.m09.d01:meHO.note1	
ltx/en_us_dedes/me.m09.d01:meHO.note2	
ltx/en_us_dedes/me.m09.d01:meHO.number	
ltx/en_us_dedes/me.m09.d01:meHO.rank	
ltx/en_us_dedes/me.m09.d01:meLE.commemoration1	The Beginning of the Indiction, that is, of the New Year.
ltx/en_us_dedes/me.m09.d01:meLE.commemoration2	Our Venerable Father Symeon the Stylite.
ltx/en_us_dedes/me.m09.d01:meLI.Kontakion1.greekmelody	@ltx/en_us_dedes/me.m09.d01:meMA.Kontakion1.greekmelody
ltx/en_us_dedes/me.m09.d01:meLI.Kontakion1.incipit	@ltx/en_us_dedes/me.m09.d01:meMA.Kontakion1.incipit
ltx/en_us_dedes/me.m09.d01:meLI.Kontakion1.melody	@ltx/en_us_dedes/me.m09.d01:meMA.Kontakion1.melody
ltx/en_us_dedes/me.m09.d01:meLI.Kontakion1.mode	@ltx/en_us_dedes/me.m09.d01:meMA.Kontakion1.mode
ltx/en_us_dedes/me.m09.d01:meLI.Kontakion1.text	@ltx/en_us_dedes/me.m09.d01:meMA.Kontakion1.text
ltx/en_us_dedes/me.m09.d01:meLI.Kontakion2.greekmelody	@ltx/en_us_dedes/me.m09.d01:meMA.Kontakion2.greekmelody
ltx/en_us_dedes/me.m09.d01:meLI.Kontakion2.incipit	@ltx/en_us_dedes/me.m09.d01:meMA.Kontakion2.incipit
ltx/en_us_dedes/me.m09.d01:meLI.Kontakion2.melody	@ltx/en_us_dedes/me.m09.d01:meMA.Kontakion2.melody
ltx/en_us_dedes/me.m09.d01:meLI.Kontakion2.mode	@ltx/en_us_dedes/me.m09.d01:meMA.Kontakion2.mode
ltx/en_us_dedes/me.m09.d01:meLI.Kontakion2.text	@ltx/en_us_dedes/me.m09.d01:meMA.Kontakion2.text
ltx/en_us_dedes/me.m09.d01:meLI.Kontakion3.greekmelody	@ltx/en_us_dedes/me.m09.d01:meMA.Kontakion3.greekmelody
ltx/en_us_dedes/me.m09.d01:meLI.Kontakion3.incipit	@ltx/en_us_dedes/me.m09.d01:meMA.Kontakion3.incipit
ltx/en_us_dedes/me.m09.d01:meLI.Kontakion3.melody	@ltx/en_us_dedes/me.m09.d01:meMA.Kontakion3.melody
ltx/en_us_dedes/me.m09.d01:meLI.Kontakion3.mode	@ltx/en_us_dedes/me.m09.d01:meMA.Kontakion3.mode
ltx/en_us_dedes/me.m09.d01:meLI.Kontakion3.text	@ltx/en_us_dedes/me.m09.d01:meMA.Kontakion3.text
ltx/en_us_dedes/me.m09.d01:meLI.MM.CommunionHymn.text	@ltx/en_us_dedes/properties:media.key
ltx/en_us_dedes/me.m09.d01:meLI.MM.EntranceHymn.text	@ltx/en_us_dedes/properties:media.key
ltx/en_us_dedes/me.m09.d01:meLI.Megalynarion.text	
ltx/en_us_dedes/me.m09.d01:meLI.Megalynarion2.text	
ltx/en_us_dedes/me.m09.d01:meMA.C1.poet	@ltx/en_us_dedes/poets:po.IoannouMonachou
ltx/en_us_dedes/me.m09.d01:meMA.C1.title	Canon for the Indiction.
ltx/en_us_dedes/me.m09.d01:meMA.C1.verse	@ltx/en_us_dedes/prayers:pr.verse_God.text
ltx/en_us_dedes/me.m09.d01:meMA.C2.acrostic.notice1	
ltx/en_us_dedes/me.m09.d01:meMA.C2.acrostic.text	
ltx/en_us_dedes/me.m09.d01:meMA.C2.acrostic.title	
ltx/en_us_dedes/me.m09.d01:meMA.C2.title	Canon for the holy Women.
ltx/en_us_dedes/me.m09.d01:meMA.C2.verse	@ltx/en_us_dedes/prayers:pr.verse_SaintsW.text
ltx/en_us_dedes/me.m09.d01:meMA.C3.acrostic.notice1	
ltx/en_us_dedes/me.m09.d01:meMA.C3.acrostic.text	
ltx/en_us_dedes/me.m09.d01:meMA.C3.acrostic.title	
ltx/en_us_dedes/me.m09.d01:meMA.C3.poet	@ltx/en_us_dedes/poets:po.IoannouMonachou
ltx/en_us_dedes/me.m09.d01:meMA.C3.title	@ltx/en_us_dedes/titles:ti.CanonDevoutM
ltx/en_us_dedes/me.m09.d01:meMA.C3.verse	@ltx/en_us_dedes/prayers:pr.verse_SaintM.text
ltx/en_us_dedes/me.m09.d01:meMA.ExapTheotokion.incipit	Creator of creation all *…
ltx/en_us_dedes/me.m09.d01:meMA.ExapTheotokion.melody	@ltx/en_us_dedes/he.a.m2:heAU.ToisMathitaisSynelthomen.name
ltx/en_us_dedes/me.m09.d01:meMA.ExapTheotokion.mode	@ltx/en_us_dedes/miscellanea:misc.Mode2
ltx/en_us_dedes/me.m09.d01:meMA.ExapTheotokion.text	Creator of creation all * and its Savior and Master, * by Your authority You fixed * times and annual seasons. Therefore we pray You, O loving Lord, * that You crown the coming * yearly cycle with blessings of * goodness, and keep Your people in lasting peace, * free of harm and injury, we entreat You, * by Your Mother’s all-holy prayers * and those of holy Angels.
ltx/en_us_dedes/me.m09.d01:meMA.Exaposteilarion1.greekmelody	@ltx/en_us_dedes/he.a.m2:heAU.ToisMathitaisSynelthomen.greekname
ltx/en_us_dedes/me.m09.d01:meMA.Exaposteilarion1.incipit	O God of gods and…
ltx/en_us_dedes/me.m09.d01:meMA.Exaposteilarion1.melody	@ltx/en_us_dedes/he.a.m2:heAU.ToisMathitaisSynelthomen.name
ltx/en_us_dedes/me.m09.d01:meMA.Exaposteilarion1.mode	@ltx/en_us_dedes/miscellanea:misc.Mode2
ltx/en_us_dedes/me.m09.d01:meMA.Exaposteilarion1.text	O God of gods and sovereign Lord, * tri-hypostatic nature, * eternal, unapproachable, * uncreated Creator of all, omnipotent Master, * we all bow down before You, * and we entreat you earnestly, * praying You bless this new year, since You are good, * and preserve in long-lasting peace our rulers * and all Your people and the world, * O compassionate Savior.
ltx/en_us_dedes/me.m09.d01:meMA.Exaposteilarion2.greekmelody	@ltx/en_us_dedes/he.a.m2:heAU.ToisMathitaisSynelthomen.greekname
ltx/en_us_dedes/me.m09.d01:meMA.Exaposteilarion2.incipit	Your splendid life, a virtual…
ltx/en_us_dedes/me.m09.d01:meMA.Exaposteilarion2.melody	@ltx/en_us_dedes/he.a.m2:heAU.ToisMathitaisSynelthomen.name
ltx/en_us_dedes/me.m09.d01:meMA.Exaposteilarion2.mode	@ltx/en_us_dedes/miscellanea:misc.Mode2
ltx/en_us_dedes/me.m09.d01:meMA.Exaposteilarion2.text	Your splendid life, a virtual * luminary, has shone forth, * and with the rays of miracles * thoroughly has illumined all of the earth, O devout one. * For by a pillar, as on * a ladder, you went up to God, * where the ultimate object of all desire * truly is; and since then you have been praying, * O blessed father Symeon, * for us who pay you honor.
ltx/en_us_dedes/me.m09.d01:meMA.Kathisma11.greekmelody	@ltx/en_us_dedes/he.a.m8:heAU.TinSofianKaiLogon.greekname
ltx/en_us_dedes/me.m09.d01:meMA.Kathisma11.incipit	O Provider of seasons producing…
ltx/en_us_dedes/me.m09.d01:meMA.Kathisma11.melody	@ltx/en_us_dedes/he.a.m8:heAU.TinSofianKaiLogon.name
ltx/en_us_dedes/me.m09.d01:meMA.Kathisma11.mode	@ltx/en_us_dedes/miscellanea:misc.Mode8
ltx/en_us_dedes/me.m09.d01:meMA.Kathisma11.text	O Provider of seasons producing fruit * and of rains from the heavens for those on earth, * accept now the fervent prayers that Your servants present to You, * and deliver Your City from every necessity. * And may Your tender mercies be lavished on all Your works. * Therefore we entreat You, bless our comings and goings, * guiding aright the works of our hands for our benefit, * O our God, and bestow on us * forgiveness of our every offence. * For You are the One who brought the universe * from nonexistence into being, as the One who can.
ltx/en_us_dedes/me.m09.d01:meMA.Kathisma21.greekmelody	@ltx/en_us_dedes/he.a.m5:heAU.TonSynanarchonLogon.greekname
ltx/en_us_dedes/me.m09.d01:meMA.Kathisma21.incipit	Blessed Father, assaults of the…
ltx/en_us_dedes/me.m09.d01:meMA.Kathisma21.melody	@ltx/en_us_dedes/he.a.m5:heAU.TonSynanarchonLogon.name
ltx/en_us_dedes/me.m09.d01:meMA.Kathisma21.mode	@ltx/en_us_dedes/miscellanea:misc.Mode5
ltx/en_us_dedes/me.m09.d01:meMA.Kathisma21.text	Blessed Father, assaults of the enemy of man * disappeared, once you mortified your body, and thus * you adorned your holy life with virtue and self-control. * You were transported to God and to the life that never ends, as an heir most worthy. * Now, intercede without ceasing * and entreat Him to have mercy on us.
ltx/en_us_dedes/me.m09.d01:meMA.Kathisma22.greekmelody	@ltx/en_us_dedes/he.a.m4:heAU.TachyProkatalave.greekname
ltx/en_us_dedes/me.m09.d01:meMA.Kathisma22.incipit	Callista, you entered martyrdom’s arena…
ltx/en_us_dedes/me.m09.d01:meMA.Kathisma22.melody	@ltx/en_us_dedes/he.a.m4:heAU.TachyProkatalave.name
ltx/en_us_dedes/me.m09.d01:meMA.Kathisma22.mode	@ltx/en_us_dedes/miscellanea:misc.Mode4
ltx/en_us_dedes/me.m09.d01:meMA.Kathisma22.text	Callista, you entered martyrdom’s arena with faith, * and with your two brothers you confessed and bravely proclaimed * that Christ is indeed our God. * Raised as you were to love Him, you became instrumental * in making them into spiritual vessels of Christ’s Church. * And therefore, O holy Martyr, you join them in the life on high.
ltx/en_us_dedes/me.m09.d01:meMA.Kathisma2T.incipit	@ltx/en_us_dedes/oc.m4.d5:ocMA.Kathisma13.incipit
ltx/en_us_dedes/me.m09.d01:meMA.Kathisma2T.melody	@ltx/en_us_dedes/he.a.m4:heAU.TachyProkatalave.name
ltx/en_us_dedes/me.m09.d01:meMA.Kathisma2T.mode	@ltx/en_us_dedes/miscellanea:misc.Mode4
ltx/en_us_dedes/me.m09.d01:meMA.Kathisma2T.text	@ltx/en_us_dedes/oc.m4.d5:ocMA.Kathisma13.text
ltx/en_us_dedes/me.m09.d01:meMA.Kathisma31.greekmelody	@ltx/en_us_dedes/he.a.m1:heAU.TonTafonSouSotir.greekname
ltx/en_us_dedes/me.m09.d01:meMA.Kathisma31.incipit	O spiritual lambs, forty virgins…
ltx/en_us_dedes/me.m09.d01:meMA.Kathisma31.melody	@ltx/en_us_dedes/he.a.m1:heAU.TonTafonSouSotir.name
ltx/en_us_dedes/me.m09.d01:meMA.Kathisma31.mode	@ltx/en_us_dedes/miscellanea:misc.Mode1
ltx/en_us_dedes/me.m09.d01:meMA.Kathisma31.text	O spiritual lambs, forty virgins and martyrs, * through martyrdom you came to the Lamb and the Shepherd, * when you had finished the race, and like Paul, you had kept the faith. * Therefore on this day we magnify Christ our Savior, * as we joyfully observe and worthily honor * your all-holy memory.
ltx/en_us_dedes/me.m09.d01:meMA.Kathisma32.greekmelody	@ltx/en_us_dedes/he.a.m4:heAU.KateplagiIosif.greekname
ltx/en_us_dedes/me.m09.d01:meMA.Kathisma32.incipit	We approach You now with…
ltx/en_us_dedes/me.m09.d01:meMA.Kathisma32.melody	@ltx/en_us_dedes/he.a.m4:heAU.KateplagiIosif.name
ltx/en_us_dedes/me.m09.d01:meMA.Kathisma32.mode	@ltx/en_us_dedes/miscellanea:misc.Mode4
ltx/en_us_dedes/me.m09.d01:meMA.Kathisma32.text	We approach You now with faith, * for You are Master of all * and the Giver of good things, and we sincerely cry to You: * “Since You are good, grant to us who faithfully honor * and glorify You, Lord, in Your two essences, * that we may offer You an acceptable * ecclesiastical year, O Savior. * For this be entreated * by Your compassion, and intercessions * of Your Mother and of all Your Saints.”
ltx/en_us_dedes/me.m09.d01:meMA.Kontakion1.greekmelody	@ltx/en_us_dedes/he.a.m3:heAU.IParthenosSimeron.greekname
ltx/en_us_dedes/me.m09.d01:meMA.Kontakion1.incipit	…
ltx/en_us_dedes/me.m09.d01:meMA.Kontakion1.melody	@ltx/en_us_dedes/he.a.m3:heAU.IParthenosSimeron.name
ltx/en_us_dedes/me.m09.d01:meMA.Kontakion1.mode	@ltx/en_us_dedes/miscellanea:misc.Mode3
ltx/en_us_dedes/me.m09.d01:meMA.Kontakion1.poet	@ltx/en_us_dedes/poets:po.PatriarchouKyrillou
ltx/en_us_dedes/me.m09.d01:meMA.Kontakion1.text	
ltx/en_us_dedes/me.m09.d01:meMA.Kontakion2.greekmelody	@ltx/en_us_dedes/he.a.m2:heAU.TaAnoZiton.greekname
ltx/en_us_dedes/me.m09.d01:meMA.Kontakion2.incipit	@ltx/en_us_dedes/he.a.m2:heAU.TaAnoZiton.incipit
ltx/en_us_dedes/me.m09.d01:meMA.Kontakion2.melody	@ltx/en_us_dedes/he.a.m2:heAU.TaAnoZiton.melody
ltx/en_us_dedes/me.m09.d01:meMA.Kontakion2.mode	@ltx/en_us_dedes/miscellanea:misc.Mode2
ltx/en_us_dedes/me.m09.d01:meMA.Kontakion2.text	@ltx/en_us_dedes/he.a.m2:heAU.TaAnoZiton.text
ltx/en_us_dedes/me.m09.d01:meMA.Kontakion3.greekmelody	@ltx/en_us_dedes/he.a.m4:heAU.OYpsotheisEnToStavro.greekname
ltx/en_us_dedes/me.m09.d01:meMA.Kontakion3.incipit	You, the Creator and the…
ltx/en_us_dedes/me.m09.d01:meMA.Kontakion3.melody	@ltx/en_us_dedes/he.a.m4:heAU.OYpsotheisEnToStavro.name
ltx/en_us_dedes/me.m09.d01:meMA.Kontakion3.mode	@ltx/en_us_dedes/miscellanea:misc.Mode4
ltx/en_us_dedes/me.m09.d01:meMA.Kontakion3.poet	@ltx/en_us_dedes/poets:po.IakovouProtopsaltou
ltx/en_us_dedes/me.m09.d01:meMA.Kontakion3.text	You, the Creator and the Lord of the ages, O God of all, truly transcending all essence, we earnestly entreat, that You will bless the year, and, O tender-loving Lord, in Your infinite mercy, only Master, save us all who worship and serve You, O our Redeemer, and who cry with fear, “For all Your servants, make fruitful the coming year.”
ltx/en_us_dedes/me.m09.d01:meMA.Lauds1.incipit	Pre-eternal Logos of the Father…
ltx/en_us_dedes/me.m09.d01:meMA.Lauds1.melody	@ltx/en_us_dedes/miscellanea:misc.Idiomelon
ltx/en_us_dedes/me.m09.d01:meMA.Lauds1.mode	@ltx/en_us_dedes/miscellanea:misc.Mode3
ltx/en_us_dedes/me.m09.d01:meMA.Lauds1.poet	@ltx/en_us_dedes/poets:po.IoannouMonachou
ltx/en_us_dedes/me.m09.d01:meMA.Lauds1.text	Pre-eternal Logos of the Father, who are in the form of God, and who brought creation from nonexistence into being, and who fixed seasons and times by Your own authority: we pray You bless the crown of this year with Your goodness, grant peace to Your Churches, victory to our faithful leaders, fruitfulness to the earth, and to us Your great mercy.
ltx/en_us_dedes/me.m09.d01:meMA.Lauds2.incipit	Your kingdom, O Christ God…
ltx/en_us_dedes/me.m09.d01:meMA.Lauds2.melody	@ltx/en_us_dedes/miscellanea:misc.Idiomelon
ltx/en_us_dedes/me.m09.d01:meMA.Lauds2.mode	@ltx/en_us_dedes/miscellanea:misc.Mode4
ltx/en_us_dedes/me.m09.d01:meMA.Lauds2.poet	@ltx/en_us_dedes/poets:po.IoannouMonachou
ltx/en_us_dedes/me.m09.d01:meMA.Lauds2.text	Your kingdom, O Christ God, is a kingdom of all the ages, and Your dominion is from generation to generation. You made all things in wisdom, fixing both times and seasons. Therefore we thank You for all and in all, and we shout to You: Bless the crown of the year with Your goodness, and grant that without condemnation we may call out to You, “Glory to You, O Lord!”
ltx/en_us_dedes/me.m09.d01:meMA.Lauds3.incipit	Your processionals, O God, Your…
ltx/en_us_dedes/me.m09.d01:meMA.Lauds3.melody	@ltx/en_us_dedes/miscellanea:misc.Idiomelon
ltx/en_us_dedes/me.m09.d01:meMA.Lauds3.mode	@ltx/en_us_dedes/miscellanea:misc.Mode4
ltx/en_us_dedes/me.m09.d01:meMA.Lauds3.poet	@ltx/en_us_dedes/poets:po.AndreouPyrou
ltx/en_us_dedes/me.m09.d01:meMA.Lauds3.text	Your processionals, O God, Your processionals are great and wonderful. Therefore we magnify the power of Your dispensation; for You came, light from light, to Your weary world, and You took away the original curse on old Adam, as You, O Logos, were well pleased to do. Also, in wisdom You fixed times and seasons for us, that we might glorify Your omnificent goodness. Glory to You, O Lord!
ltx/en_us_dedes/me.m09.d01:meMA.Lauds4.incipit	When You had established the…
ltx/en_us_dedes/me.m09.d01:meMA.Lauds4.melody	@ltx/en_us_dedes/miscellanea:misc.Idiomelon
ltx/en_us_dedes/me.m09.d01:meMA.Lauds4.mode	@ltx/en_us_dedes/miscellanea:misc.Mode2
ltx/en_us_dedes/me.m09.d01:meMA.Lauds4.poet	@ltx/en_us_dedes/poets:po.Germanou
ltx/en_us_dedes/me.m09.d01:meMA.Lauds4.text	When You had established the world by Your Passion, O Lord, then those who were weak were girded with strength, and Women fought like men against that malevolent tyrant. They reversed the defeat of mother Eve and again attained the Garden of Eden, to Your glory, O Christ, who were born of a woman and have saved the human race.
ltx/en_us_dedes/me.m09.d01:meMA.LaudsBoth.incipit	O Logos, Christ our God…
ltx/en_us_dedes/me.m09.d01:meMA.LaudsBoth.melody	@ltx/en_us_dedes/miscellanea:misc.Idiomelon
ltx/en_us_dedes/me.m09.d01:meMA.LaudsBoth.mode	@ltx/en_us_dedes/miscellanea:misc.Mode8
ltx/en_us_dedes/me.m09.d01:meMA.LaudsBoth.poet	@ltx/en_us_dedes/poets:po.Germanou
ltx/en_us_dedes/me.m09.d01:meMA.LaudsBoth.text	O Logos, Christ our God, who constituted the universe with wisdom ineffable, who appointed seasons and years, bless the works of Your hands; and make our faithful leader glad in You power, giving him might against foreign enemies, for You alone are good and benevolent.
ltx/en_us_dedes/me.m09.d01:meMA.LaudsGlory.incipit	@ltx/en_us_dedes/me.m09.d01:meVE.Stichera07.incipit
ltx/en_us_dedes/me.m09.d01:meMA.LaudsGlory.melody	@ltx/en_us_dedes/miscellanea:misc.Idiomelon
ltx/en_us_dedes/me.m09.d01:meMA.LaudsGlory.mode	@ltx/en_us_dedes/miscellanea:misc.Mode2
ltx/en_us_dedes/me.m09.d01:meMA.LaudsGlory.text	@ltx/en_us_dedes/me.m09.d01:meVE.Stichera07.text
ltx/en_us_dedes/me.m09.d01:meMA.MM.Ve1123as5678.text	@ltx/en_us_dedes/properties:media.key
ltx/en_us_dedes/me.m09.d01:meMA.Ode1C11.greekmelody	@ltx/en_us_dedes/he.h.m1:heHE.AsomenPantesLaoi.greekname
ltx/en_us_dedes/me.m09.d01:meMA.Ode1C11.incipit	…
ltx/en_us_dedes/me.m09.d01:meMA.Ode1C11.melody	@ltx/en_us_dedes/he.h.m1:heHE.AsomenPantesLaoi.name
ltx/en_us_dedes/me.m09.d01:meMA.Ode1C11.mode	@ltx/en_us_dedes/miscellanea:misc.Mode1
ltx/en_us_dedes/me.m09.d01:meMA.Ode1C11.ode	@ltx/en_us_dedes/miscellanea:misc.Ode1
ltx/en_us_dedes/me.m09.d01:meMA.Ode1C11.text	
ltx/en_us_dedes/me.m09.d01:meMA.Ode1C12.incipit	…
ltx/en_us_dedes/me.m09.d01:meMA.Ode1C12.melody	@ltx/en_us_dedes/he.h.m1:heHE.AsomenPantesLaoi.name
ltx/en_us_dedes/me.m09.d01:meMA.Ode1C12.mode	@ltx/en_us_dedes/miscellanea:misc.Mode1
ltx/en_us_dedes/me.m09.d01:meMA.Ode1C12.ode	@ltx/en_us_dedes/miscellanea:misc.Ode1
ltx/en_us_dedes/me.m09.d01:meMA.Ode1C12.text	
ltx/en_us_dedes/me.m09.d01:meMA.Ode1C13.incipit	…
ltx/en_us_dedes/me.m09.d01:meMA.Ode1C13.melody	@ltx/en_us_dedes/he.h.m1:heHE.AsomenPantesLaoi.name
ltx/en_us_dedes/me.m09.d01:meMA.Ode1C13.mode	@ltx/en_us_dedes/miscellanea:misc.Mode1
ltx/en_us_dedes/me.m09.d01:meMA.Ode1C13.ode	@ltx/en_us_dedes/miscellanea:misc.Ode1
ltx/en_us_dedes/me.m09.d01:meMA.Ode1C13.text	
ltx/en_us_dedes/me.m09.d01:meMA.Ode1C1H.greekmelody	@ltx/en_us_dedes/he.h.m1:heHE.AsomenPantesLaoi.greekname
ltx/en_us_dedes/me.m09.d01:meMA.Ode1C1H.incipit	@ltx/en_us_dedes/he.h.m1:heHE.AsomenPantesLaoi.incipit
ltx/en_us_dedes/me.m09.d01:meMA.Ode1C1H.melody	@ltx/en_us_dedes/he.h.m1:heHE.AsomenPantesLaoi.melody
ltx/en_us_dedes/me.m09.d01:meMA.Ode1C1H.mode	@ltx/en_us_dedes/miscellanea:misc.Mode1
ltx/en_us_dedes/me.m09.d01:meMA.Ode1C1H.ode	@ltx/en_us_dedes/miscellanea:misc.Ode1
ltx/en_us_dedes/me.m09.d01:meMA.Ode1C1H.text	@ltx/en_us_dedes/he.h.m1:heHE.AsomenPantesLaoi.text
ltx/en_us_dedes/me.m09.d01:meMA.Ode1C1T.incipit	…
ltx/en_us_dedes/me.m09.d01:meMA.Ode1C1T.melody	@ltx/en_us_dedes/he.h.m1:heHE.AsomenPantesLaoi.name
ltx/en_us_dedes/me.m09.d01:meMA.Ode1C1T.mode	@ltx/en_us_dedes/miscellanea:misc.Mode1
ltx/en_us_dedes/me.m09.d01:meMA.Ode1C1T.ode	@ltx/en_us_dedes/miscellanea:misc.Ode1
ltx/en_us_dedes/me.m09.d01:meMA.Ode1C1T.text	
ltx/en_us_dedes/me.m09.d01:meMA.Ode1C21.greekmelody	@ltx/en_us_dedes/he.h.m4:heHE.AnoixoToStomaMou.greekname
ltx/en_us_dedes/me.m09.d01:meMA.Ode1C21.incipit	…
ltx/en_us_dedes/me.m09.d01:meMA.Ode1C21.melody	@ltx/en_us_dedes/he.h.m4:heHE.AnoixoToStomaMou.name
ltx/en_us_dedes/me.m09.d01:meMA.Ode1C21.mode	@ltx/en_us_dedes/miscellanea:misc.Mode4
ltx/en_us_dedes/me.m09.d01:meMA.Ode1C21.ode	@ltx/en_us_dedes/miscellanea:misc.Ode1
ltx/en_us_dedes/me.m09.d01:meMA.Ode1C21.text	
ltx/en_us_dedes/me.m09.d01:meMA.Ode1C22.incipit	…
ltx/en_us_dedes/me.m09.d01:meMA.Ode1C22.melody	@ltx/en_us_dedes/he.h.m4:heHE.AnoixoToStomaMou.name
ltx/en_us_dedes/me.m09.d01:meMA.Ode1C22.mode	@ltx/en_us_dedes/miscellanea:misc.Mode4
ltx/en_us_dedes/me.m09.d01:meMA.Ode1C22.ode	@ltx/en_us_dedes/miscellanea:misc.Ode1
ltx/en_us_dedes/me.m09.d01:meMA.Ode1C22.text	
ltx/en_us_dedes/me.m09.d01:meMA.Ode1C23.incipit	…
ltx/en_us_dedes/me.m09.d01:meMA.Ode1C23.melody	@ltx/en_us_dedes/he.h.m4:heHE.AnoixoToStomaMou.name
ltx/en_us_dedes/me.m09.d01:meMA.Ode1C23.mode	@ltx/en_us_dedes/miscellanea:misc.Mode4
ltx/en_us_dedes/me.m09.d01:meMA.Ode1C23.ode	@ltx/en_us_dedes/miscellanea:misc.Ode1
ltx/en_us_dedes/me.m09.d01:meMA.Ode1C23.text	
ltx/en_us_dedes/me.m09.d01:meMA.Ode1C2T.incipit	…
ltx/en_us_dedes/me.m09.d01:meMA.Ode1C2T.melody	@ltx/en_us_dedes/he.h.m4:heHE.AnoixoToStomaMou.name
ltx/en_us_dedes/me.m09.d01:meMA.Ode1C2T.mode	@ltx/en_us_dedes/miscellanea:misc.Mode4
ltx/en_us_dedes/me.m09.d01:meMA.Ode1C2T.ode	@ltx/en_us_dedes/miscellanea:misc.Ode1
ltx/en_us_dedes/me.m09.d01:meMA.Ode1C2T.text	
ltx/en_us_dedes/me.m09.d01:meMA.Ode1C31.greekmelody	@ltx/en_us_dedes/he.h.m8:heHE.AsomenToKyrioPantesLaoi.greekname
ltx/en_us_dedes/me.m09.d01:meMA.Ode1C31.incipit	…
ltx/en_us_dedes/me.m09.d01:meMA.Ode1C31.melody	@ltx/en_us_dedes/he.h.m8:heHE.AsomenToKyrioPantesLaoi.name
ltx/en_us_dedes/me.m09.d01:meMA.Ode1C31.mode	@ltx/en_us_dedes/miscellanea:misc.Mode8
ltx/en_us_dedes/me.m09.d01:meMA.Ode1C31.ode	@ltx/en_us_dedes/miscellanea:misc.Ode1
ltx/en_us_dedes/me.m09.d01:meMA.Ode1C31.text	
ltx/en_us_dedes/me.m09.d01:meMA.Ode1C32.incipit	…
ltx/en_us_dedes/me.m09.d01:meMA.Ode1C32.melody	@ltx/en_us_dedes/he.h.m8:heHE.AsomenToKyrioPantesLaoi.name
ltx/en_us_dedes/me.m09.d01:meMA.Ode1C32.mode	@ltx/en_us_dedes/miscellanea:misc.Mode8
ltx/en_us_dedes/me.m09.d01:meMA.Ode1C32.ode	@ltx/en_us_dedes/miscellanea:misc.Ode1
ltx/en_us_dedes/me.m09.d01:meMA.Ode1C32.text	
ltx/en_us_dedes/me.m09.d01:meMA.Ode1C33.incipit	…
ltx/en_us_dedes/me.m09.d01:meMA.Ode1C33.melody	@ltx/en_us_dedes/he.h.m8:heHE.AsomenToKyrioPantesLaoi.name
ltx/en_us_dedes/me.m09.d01:meMA.Ode1C33.mode	@ltx/en_us_dedes/miscellanea:misc.Mode8
ltx/en_us_dedes/me.m09.d01:meMA.Ode1C33.ode	@ltx/en_us_dedes/miscellanea:misc.Ode1
ltx/en_us_dedes/me.m09.d01:meMA.Ode1C33.text	
ltx/en_us_dedes/me.m09.d01:meMA.Ode1C3T.incipit	…
ltx/en_us_dedes/me.m09.d01:meMA.Ode1C3T.melody	@ltx/en_us_dedes/he.h.m8:heHE.AsomenToKyrioPantesLaoi.name
ltx/en_us_dedes/me.m09.d01:meMA.Ode1C3T.mode	@ltx/en_us_dedes/miscellanea:misc.Mode8
ltx/en_us_dedes/me.m09.d01:meMA.Ode1C3T.ode	@ltx/en_us_dedes/miscellanea:misc.Ode1
ltx/en_us_dedes/me.m09.d01:meMA.Ode1C3T.text	
ltx/en_us_dedes/me.m09.d01:meMA.Ode3C11.greekmelody	@ltx/en_us_dedes/he.h.m1:heHE.StereosonMeChriste.greekname
ltx/en_us_dedes/me.m09.d01:meMA.Ode3C11.incipit	…
ltx/en_us_dedes/me.m09.d01:meMA.Ode3C11.melody	@ltx/en_us_dedes/he.h.m1:heHE.StereosonMeChriste.name
ltx/en_us_dedes/me.m09.d01:meMA.Ode3C11.mode	@ltx/en_us_dedes/miscellanea:misc.Mode1
ltx/en_us_dedes/me.m09.d01:meMA.Ode3C11.ode	@ltx/en_us_dedes/miscellanea:misc.Ode3
ltx/en_us_dedes/me.m09.d01:meMA.Ode3C11.text	
ltx/en_us_dedes/me.m09.d01:meMA.Ode3C12.incipit	…
ltx/en_us_dedes/me.m09.d01:meMA.Ode3C12.melody	@ltx/en_us_dedes/he.h.m1:heHE.StereosonMeChriste.name
ltx/en_us_dedes/me.m09.d01:meMA.Ode3C12.mode	@ltx/en_us_dedes/miscellanea:misc.Mode1
ltx/en_us_dedes/me.m09.d01:meMA.Ode3C12.ode	@ltx/en_us_dedes/miscellanea:misc.Ode3
ltx/en_us_dedes/me.m09.d01:meMA.Ode3C12.text	
ltx/en_us_dedes/me.m09.d01:meMA.Ode3C13.incipit	…
ltx/en_us_dedes/me.m09.d01:meMA.Ode3C13.melody	@ltx/en_us_dedes/he.h.m1:heHE.StereosonMeChriste.name
ltx/en_us_dedes/me.m09.d01:meMA.Ode3C13.mode	@ltx/en_us_dedes/miscellanea:misc.Mode1
ltx/en_us_dedes/me.m09.d01:meMA.Ode3C13.ode	@ltx/en_us_dedes/miscellanea:misc.Ode3
ltx/en_us_dedes/me.m09.d01:meMA.Ode3C13.text	
ltx/en_us_dedes/me.m09.d01:meMA.Ode3C1H.greekmelody	@ltx/en_us_dedes/he.h.m1:heHE.StereosonMeChriste.greekname
ltx/en_us_dedes/me.m09.d01:meMA.Ode3C1H.incipit	@ltx/en_us_dedes/he.h.m1:heHE.StereosonMeChriste.incipit
ltx/en_us_dedes/me.m09.d01:meMA.Ode3C1H.melody	@ltx/en_us_dedes/he.h.m1:heHE.StereosonMeChriste.melody
ltx/en_us_dedes/me.m09.d01:meMA.Ode3C1H.mode	@ltx/en_us_dedes/miscellanea:misc.Mode1
ltx/en_us_dedes/me.m09.d01:meMA.Ode3C1H.ode	@ltx/en_us_dedes/miscellanea:misc.Ode3
ltx/en_us_dedes/me.m09.d01:meMA.Ode3C1H.text	@ltx/en_us_dedes/he.h.m1:heHE.StereosonMeChriste.text
ltx/en_us_dedes/me.m09.d01:meMA.Ode3C1T.incipit	…
ltx/en_us_dedes/me.m09.d01:meMA.Ode3C1T.melody	@ltx/en_us_dedes/he.h.m1:heHE.StereosonMeChriste.name
ltx/en_us_dedes/me.m09.d01:meMA.Ode3C1T.mode	@ltx/en_us_dedes/miscellanea:misc.Mode1
ltx/en_us_dedes/me.m09.d01:meMA.Ode3C1T.ode	@ltx/en_us_dedes/miscellanea:misc.Ode3
ltx/en_us_dedes/me.m09.d01:meMA.Ode3C1T.text	
ltx/en_us_dedes/me.m09.d01:meMA.Ode3C21.greekmelody	@ltx/en_us_dedes/he.h.m4:heHE.ToxonDynatonIsthenise.greekname
ltx/en_us_dedes/me.m09.d01:meMA.Ode3C21.incipit	…
ltx/en_us_dedes/me.m09.d01:meMA.Ode3C21.melody	@ltx/en_us_dedes/he.h.m4:heHE.ToxonDynatonIsthenise.name
ltx/en_us_dedes/me.m09.d01:meMA.Ode3C21.mode	@ltx/en_us_dedes/miscellanea:misc.Mode4
ltx/en_us_dedes/me.m09.d01:meMA.Ode3C21.ode	@ltx/en_us_dedes/miscellanea:misc.Ode3
ltx/en_us_dedes/me.m09.d01:meMA.Ode3C21.text	
ltx/en_us_dedes/me.m09.d01:meMA.Ode3C22.incipit	…
ltx/en_us_dedes/me.m09.d01:meMA.Ode3C22.melody	@ltx/en_us_dedes/he.h.m4:heHE.ToxonDynatonIsthenise.name
ltx/en_us_dedes/me.m09.d01:meMA.Ode3C22.mode	@ltx/en_us_dedes/miscellanea:misc.Mode4
ltx/en_us_dedes/me.m09.d01:meMA.Ode3C22.ode	@ltx/en_us_dedes/miscellanea:misc.Ode3
ltx/en_us_dedes/me.m09.d01:meMA.Ode3C22.text	
ltx/en_us_dedes/me.m09.d01:meMA.Ode3C23.incipit	…
ltx/en_us_dedes/me.m09.d01:meMA.Ode3C23.melody	@ltx/en_us_dedes/he.h.m4:heHE.ToxonDynatonIsthenise.name
ltx/en_us_dedes/me.m09.d01:meMA.Ode3C23.mode	@ltx/en_us_dedes/miscellanea:misc.Mode4
ltx/en_us_dedes/me.m09.d01:meMA.Ode3C23.ode	@ltx/en_us_dedes/miscellanea:misc.Ode3
ltx/en_us_dedes/me.m09.d01:meMA.Ode3C23.text	
ltx/en_us_dedes/me.m09.d01:meMA.Ode3C2T.incipit	…
ltx/en_us_dedes/me.m09.d01:meMA.Ode3C2T.melody	@ltx/en_us_dedes/he.h.m4:heHE.ToxonDynatonIsthenise.name
ltx/en_us_dedes/me.m09.d01:meMA.Ode3C2T.mode	@ltx/en_us_dedes/miscellanea:misc.Mode4
ltx/en_us_dedes/me.m09.d01:meMA.Ode3C2T.ode	@ltx/en_us_dedes/miscellanea:misc.Ode3
ltx/en_us_dedes/me.m09.d01:meMA.Ode3C2T.text	
ltx/en_us_dedes/me.m09.d01:meMA.Ode3C31.greekmelody	@ltx/en_us_dedes/he.h.m8:heHE.TonFovonSouKyrie.greekname
ltx/en_us_dedes/me.m09.d01:meMA.Ode3C31.incipit	…
ltx/en_us_dedes/me.m09.d01:meMA.Ode3C31.melody	@ltx/en_us_dedes/he.h.m8:heHE.TonFovonSouKyrie.name
ltx/en_us_dedes/me.m09.d01:meMA.Ode3C31.mode	@ltx/en_us_dedes/miscellanea:misc.Mode8
ltx/en_us_dedes/me.m09.d01:meMA.Ode3C31.ode	@ltx/en_us_dedes/miscellanea:misc.Ode3
ltx/en_us_dedes/me.m09.d01:meMA.Ode3C31.text	
ltx/en_us_dedes/me.m09.d01:meMA.Ode3C32.incipit	…
ltx/en_us_dedes/me.m09.d01:meMA.Ode3C32.melody	@ltx/en_us_dedes/he.h.m8:heHE.TonFovonSouKyrie.name
ltx/en_us_dedes/me.m09.d01:meMA.Ode3C32.mode	@ltx/en_us_dedes/miscellanea:misc.Mode8
ltx/en_us_dedes/me.m09.d01:meMA.Ode3C32.ode	@ltx/en_us_dedes/miscellanea:misc.Ode3
ltx/en_us_dedes/me.m09.d01:meMA.Ode3C32.text	
ltx/en_us_dedes/me.m09.d01:meMA.Ode3C33.incipit	…
ltx/en_us_dedes/me.m09.d01:meMA.Ode3C33.melody	@ltx/en_us_dedes/he.h.m8:heHE.TonFovonSouKyrie.name
ltx/en_us_dedes/me.m09.d01:meMA.Ode3C33.mode	@ltx/en_us_dedes/miscellanea:misc.Mode8
ltx/en_us_dedes/me.m09.d01:meMA.Ode3C33.ode	@ltx/en_us_dedes/miscellanea:misc.Ode3
ltx/en_us_dedes/me.m09.d01:meMA.Ode3C33.text	
ltx/en_us_dedes/me.m09.d01:meMA.Ode3C3T.incipit	…
ltx/en_us_dedes/me.m09.d01:meMA.Ode3C3T.melody	@ltx/en_us_dedes/he.h.m8:heHE.TonFovonSouKyrie.name
ltx/en_us_dedes/me.m09.d01:meMA.Ode3C3T.mode	@ltx/en_us_dedes/miscellanea:misc.Mode8
ltx/en_us_dedes/me.m09.d01:meMA.Ode3C3T.ode	@ltx/en_us_dedes/miscellanea:misc.Ode3
ltx/en_us_dedes/me.m09.d01:meMA.Ode3C3T.text	
ltx/en_us_dedes/me.m09.d01:meMA.Ode3Kathisma1.greekmelody	@ltx/en_us_dedes/he.a.m8:heAU.TinSofianKaiLogon.greekname
ltx/en_us_dedes/me.m09.d01:meMA.Ode3Kathisma1.incipit	…
ltx/en_us_dedes/me.m09.d01:meMA.Ode3Kathisma1.melody	@ltx/en_us_dedes/he.a.m8:heAU.TinSofianKaiLogon.name
ltx/en_us_dedes/me.m09.d01:meMA.Ode3Kathisma1.mode	@ltx/en_us_dedes/miscellanea:misc.Mode8
ltx/en_us_dedes/me.m09.d01:meMA.Ode3Kathisma1.text	
ltx/en_us_dedes/me.m09.d01:meMA.Ode3Kathisma2.greekmelody	@ltx/en_us_dedes/he.a.m1:heAU.TonTafonSouSotir.greekname
ltx/en_us_dedes/me.m09.d01:meMA.Ode3Kathisma2.incipit	…
ltx/en_us_dedes/me.m09.d01:meMA.Ode3Kathisma2.melody	@ltx/en_us_dedes/he.a.m1:heAU.TonTafonSouSotir.name
ltx/en_us_dedes/me.m09.d01:meMA.Ode3Kathisma2.mode	@ltx/en_us_dedes/miscellanea:misc.Mode1
ltx/en_us_dedes/me.m09.d01:meMA.Ode3Kathisma2.text	
ltx/en_us_dedes/me.m09.d01:meMA.Ode3Kathisma3.greekmelody	@ltx/en_us_dedes/he.a.m4:heAU.KateplagiIosif.greekname
ltx/en_us_dedes/me.m09.d01:meMA.Ode3Kathisma3.incipit	…
ltx/en_us_dedes/me.m09.d01:meMA.Ode3Kathisma3.melody	@ltx/en_us_dedes/he.a.m4:heAU.KateplagiIosif.name
ltx/en_us_dedes/me.m09.d01:meMA.Ode3Kathisma3.mode	@ltx/en_us_dedes/miscellanea:misc.Mode4
ltx/en_us_dedes/me.m09.d01:meMA.Ode3Kathisma3.text	
ltx/en_us_dedes/me.m09.d01:meMA.Ode4C11.greekmelody	@ltx/en_us_dedes/he.h.m1:heHE.KatenoisaPantodyname.greekname
ltx/en_us_dedes/me.m09.d01:meMA.Ode4C11.incipit	…
ltx/en_us_dedes/me.m09.d01:meMA.Ode4C11.melody	@ltx/en_us_dedes/he.h.m1:heHE.KatenoisaPantodyname.name
ltx/en_us_dedes/me.m09.d01:meMA.Ode4C11.mode	@ltx/en_us_dedes/miscellanea:misc.Mode1
ltx/en_us_dedes/me.m09.d01:meMA.Ode4C11.ode	@ltx/en_us_dedes/miscellanea:misc.Ode4
ltx/en_us_dedes/me.m09.d01:meMA.Ode4C11.text	
ltx/en_us_dedes/me.m09.d01:meMA.Ode4C12.incipit	…
ltx/en_us_dedes/me.m09.d01:meMA.Ode4C12.melody	@ltx/en_us_dedes/he.h.m1:heHE.KatenoisaPantodyname.name
ltx/en_us_dedes/me.m09.d01:meMA.Ode4C12.mode	@ltx/en_us_dedes/miscellanea:misc.Mode1
ltx/en_us_dedes/me.m09.d01:meMA.Ode4C12.ode	@ltx/en_us_dedes/miscellanea:misc.Ode4
ltx/en_us_dedes/me.m09.d01:meMA.Ode4C12.text	
ltx/en_us_dedes/me.m09.d01:meMA.Ode4C13.incipit	…
ltx/en_us_dedes/me.m09.d01:meMA.Ode4C13.melody	@ltx/en_us_dedes/he.h.m1:heHE.KatenoisaPantodyname.name
ltx/en_us_dedes/me.m09.d01:meMA.Ode4C13.mode	@ltx/en_us_dedes/miscellanea:misc.Mode1
ltx/en_us_dedes/me.m09.d01:meMA.Ode4C13.ode	@ltx/en_us_dedes/miscellanea:misc.Ode4
ltx/en_us_dedes/me.m09.d01:meMA.Ode4C13.text	
ltx/en_us_dedes/me.m09.d01:meMA.Ode4C1H.greekmelody	@ltx/en_us_dedes/he.h.m1:heHE.KatenoisaPantodyname.greekname
ltx/en_us_dedes/me.m09.d01:meMA.Ode4C1H.incipit	@ltx/en_us_dedes/he.h.m1:heHE.KatenoisaPantodyname.incipit
ltx/en_us_dedes/me.m09.d01:meMA.Ode4C1H.melody	@ltx/en_us_dedes/he.h.m1:heHE.KatenoisaPantodyname.melody
ltx/en_us_dedes/me.m09.d01:meMA.Ode4C1H.mode	@ltx/en_us_dedes/miscellanea:misc.Mode1
ltx/en_us_dedes/me.m09.d01:meMA.Ode4C1H.ode	@ltx/en_us_dedes/miscellanea:misc.Ode4
ltx/en_us_dedes/me.m09.d01:meMA.Ode4C1H.text	@ltx/en_us_dedes/he.h.m1:heHE.KatenoisaPantodyname.text
ltx/en_us_dedes/me.m09.d01:meMA.Ode4C1T.incipit	…
ltx/en_us_dedes/me.m09.d01:meMA.Ode4C1T.melody	@ltx/en_us_dedes/he.h.m1:heHE.KatenoisaPantodyname.name
ltx/en_us_dedes/me.m09.d01:meMA.Ode4C1T.mode	@ltx/en_us_dedes/miscellanea:misc.Mode1
ltx/en_us_dedes/me.m09.d01:meMA.Ode4C1T.ode	@ltx/en_us_dedes/miscellanea:misc.Ode4
ltx/en_us_dedes/me.m09.d01:meMA.Ode4C1T.text	
ltx/en_us_dedes/me.m09.d01:meMA.Ode4C21.greekmelody	@ltx/en_us_dedes/he.h.m4:heHE.OKathimenosEnDoxi.greekname
ltx/en_us_dedes/me.m09.d01:meMA.Ode4C21.incipit	…
ltx/en_us_dedes/me.m09.d01:meMA.Ode4C21.melody	@ltx/en_us_dedes/he.h.m4:heHE.OKathimenosEnDoxi.name
ltx/en_us_dedes/me.m09.d01:meMA.Ode4C21.mode	@ltx/en_us_dedes/miscellanea:misc.Mode4
ltx/en_us_dedes/me.m09.d01:meMA.Ode4C21.ode	@ltx/en_us_dedes/miscellanea:misc.Ode4
ltx/en_us_dedes/me.m09.d01:meMA.Ode4C21.text	
ltx/en_us_dedes/me.m09.d01:meMA.Ode4C22.incipit	…
ltx/en_us_dedes/me.m09.d01:meMA.Ode4C22.melody	@ltx/en_us_dedes/he.h.m4:heHE.OKathimenosEnDoxi.name
ltx/en_us_dedes/me.m09.d01:meMA.Ode4C22.mode	@ltx/en_us_dedes/miscellanea:misc.Mode4
ltx/en_us_dedes/me.m09.d01:meMA.Ode4C22.ode	@ltx/en_us_dedes/miscellanea:misc.Ode4
ltx/en_us_dedes/me.m09.d01:meMA.Ode4C22.text	
ltx/en_us_dedes/me.m09.d01:meMA.Ode4C23.incipit	…
ltx/en_us_dedes/me.m09.d01:meMA.Ode4C23.melody	@ltx/en_us_dedes/he.h.m4:heHE.OKathimenosEnDoxi.name
ltx/en_us_dedes/me.m09.d01:meMA.Ode4C23.mode	@ltx/en_us_dedes/miscellanea:misc.Mode4
ltx/en_us_dedes/me.m09.d01:meMA.Ode4C23.ode	@ltx/en_us_dedes/miscellanea:misc.Ode4
ltx/en_us_dedes/me.m09.d01:meMA.Ode4C23.text	
ltx/en_us_dedes/me.m09.d01:meMA.Ode4C24.incipit	…
ltx/en_us_dedes/me.m09.d01:meMA.Ode4C24.melody	@ltx/en_us_dedes/he.h.m4:heHE.OKathimenosEnDoxi.name
ltx/en_us_dedes/me.m09.d01:meMA.Ode4C24.mode	@ltx/en_us_dedes/miscellanea:misc.Mode4
ltx/en_us_dedes/me.m09.d01:meMA.Ode4C24.ode	@ltx/en_us_dedes/miscellanea:misc.Ode4
ltx/en_us_dedes/me.m09.d01:meMA.Ode4C24.text	
ltx/en_us_dedes/me.m09.d01:meMA.Ode4C2T.incipit	…
ltx/en_us_dedes/me.m09.d01:meMA.Ode4C2T.melody	@ltx/en_us_dedes/he.h.m4:heHE.OKathimenosEnDoxi.name
ltx/en_us_dedes/me.m09.d01:meMA.Ode4C2T.mode	@ltx/en_us_dedes/miscellanea:misc.Mode4
ltx/en_us_dedes/me.m09.d01:meMA.Ode4C2T.ode	@ltx/en_us_dedes/miscellanea:misc.Ode4
ltx/en_us_dedes/me.m09.d01:meMA.Ode4C2T.text	
ltx/en_us_dedes/me.m09.d01:meMA.Ode4C31.greekmelody	@ltx/en_us_dedes/he.h.m8:heHE.EisakikoaKyrie.greekname
ltx/en_us_dedes/me.m09.d01:meMA.Ode4C31.incipit	…
ltx/en_us_dedes/me.m09.d01:meMA.Ode4C31.melody	@ltx/en_us_dedes/he.h.m8:heHE.EisakikoaKyrie.name
ltx/en_us_dedes/me.m09.d01:meMA.Ode4C31.mode	@ltx/en_us_dedes/miscellanea:misc.Mode8
ltx/en_us_dedes/me.m09.d01:meMA.Ode4C31.ode	@ltx/en_us_dedes/miscellanea:misc.Ode4
ltx/en_us_dedes/me.m09.d01:meMA.Ode4C31.text	
ltx/en_us_dedes/me.m09.d01:meMA.Ode4C32.incipit	…
ltx/en_us_dedes/me.m09.d01:meMA.Ode4C32.melody	@ltx/en_us_dedes/he.h.m8:heHE.EisakikoaKyrie.name
ltx/en_us_dedes/me.m09.d01:meMA.Ode4C32.mode	@ltx/en_us_dedes/miscellanea:misc.Mode8
ltx/en_us_dedes/me.m09.d01:meMA.Ode4C32.ode	@ltx/en_us_dedes/miscellanea:misc.Ode4
ltx/en_us_dedes/me.m09.d01:meMA.Ode4C32.text	
ltx/en_us_dedes/me.m09.d01:meMA.Ode4C33.incipit	…
ltx/en_us_dedes/me.m09.d01:meMA.Ode4C33.melody	@ltx/en_us_dedes/he.h.m8:heHE.EisakikoaKyrie.name
ltx/en_us_dedes/me.m09.d01:meMA.Ode4C33.mode	@ltx/en_us_dedes/miscellanea:misc.Mode8
ltx/en_us_dedes/me.m09.d01:meMA.Ode4C33.ode	@ltx/en_us_dedes/miscellanea:misc.Ode4
ltx/en_us_dedes/me.m09.d01:meMA.Ode4C33.text	
ltx/en_us_dedes/me.m09.d01:meMA.Ode4C34.incipit	…
ltx/en_us_dedes/me.m09.d01:meMA.Ode4C34.melody	@ltx/en_us_dedes/he.h.m8:heHE.EisakikoaKyrie.name
ltx/en_us_dedes/me.m09.d01:meMA.Ode4C34.mode	@ltx/en_us_dedes/miscellanea:misc.Mode8
ltx/en_us_dedes/me.m09.d01:meMA.Ode4C34.ode	@ltx/en_us_dedes/miscellanea:misc.Ode4
ltx/en_us_dedes/me.m09.d01:meMA.Ode4C34.text	
ltx/en_us_dedes/me.m09.d01:meMA.Ode4C3T.incipit	…
ltx/en_us_dedes/me.m09.d01:meMA.Ode4C3T.melody	@ltx/en_us_dedes/he.h.m8:heHE.EisakikoaKyrie.name
ltx/en_us_dedes/me.m09.d01:meMA.Ode4C3T.mode	@ltx/en_us_dedes/miscellanea:misc.Mode8
ltx/en_us_dedes/me.m09.d01:meMA.Ode4C3T.ode	@ltx/en_us_dedes/miscellanea:misc.Ode4
ltx/en_us_dedes/me.m09.d01:meMA.Ode4C3T.text	
ltx/en_us_dedes/me.m09.d01:meMA.Ode5C11.greekmelody	@ltx/en_us_dedes/he.h.m1:heHE.EkNyktosOrthrizontesYmnoumenSe.greekname
ltx/en_us_dedes/me.m09.d01:meMA.Ode5C11.incipit	…
ltx/en_us_dedes/me.m09.d01:meMA.Ode5C11.melody	@ltx/en_us_dedes/he.h.m1:heHE.EkNyktosOrthrizontesYmnoumenSe.name
ltx/en_us_dedes/me.m09.d01:meMA.Ode5C11.mode	@ltx/en_us_dedes/miscellanea:misc.Mode1
ltx/en_us_dedes/me.m09.d01:meMA.Ode5C11.ode	@ltx/en_us_dedes/miscellanea:misc.Ode5
ltx/en_us_dedes/me.m09.d01:meMA.Ode5C11.text	
ltx/en_us_dedes/me.m09.d01:meMA.Ode5C12.incipit	…
ltx/en_us_dedes/me.m09.d01:meMA.Ode5C12.melody	@ltx/en_us_dedes/he.h.m1:heHE.EkNyktosOrthrizontesYmnoumenSe.name
ltx/en_us_dedes/me.m09.d01:meMA.Ode5C12.mode	@ltx/en_us_dedes/miscellanea:misc.Mode1
ltx/en_us_dedes/me.m09.d01:meMA.Ode5C12.ode	@ltx/en_us_dedes/miscellanea:misc.Ode5
ltx/en_us_dedes/me.m09.d01:meMA.Ode5C12.text	
ltx/en_us_dedes/me.m09.d01:meMA.Ode5C13.incipit	…
ltx/en_us_dedes/me.m09.d01:meMA.Ode5C13.melody	@ltx/en_us_dedes/he.h.m1:heHE.EkNyktosOrthrizontesYmnoumenSe.name
ltx/en_us_dedes/me.m09.d01:meMA.Ode5C13.mode	@ltx/en_us_dedes/miscellanea:misc.Mode1
ltx/en_us_dedes/me.m09.d01:meMA.Ode5C13.ode	@ltx/en_us_dedes/miscellanea:misc.Ode5
ltx/en_us_dedes/me.m09.d01:meMA.Ode5C13.text	
ltx/en_us_dedes/me.m09.d01:meMA.Ode5C1H.greekmelody	@ltx/en_us_dedes/he.h.m1:heHE.EkNyktosOrthrizontesYmnoumenSe.greekname
ltx/en_us_dedes/me.m09.d01:meMA.Ode5C1H.incipit	@ltx/en_us_dedes/he.h.m1:heHE.EkNyktosOrthrizontesYmnoumenSe.incipit
ltx/en_us_dedes/me.m09.d01:meMA.Ode5C1H.melody	@ltx/en_us_dedes/he.h.m1:heHE.EkNyktosOrthrizontesYmnoumenSe.melody
ltx/en_us_dedes/me.m09.d01:meMA.Ode5C1H.mode	@ltx/en_us_dedes/miscellanea:misc.Mode1
ltx/en_us_dedes/me.m09.d01:meMA.Ode5C1H.ode	@ltx/en_us_dedes/miscellanea:misc.Ode5
ltx/en_us_dedes/me.m09.d01:meMA.Ode5C1H.text	@ltx/en_us_dedes/he.h.m1:heHE.EkNyktosOrthrizontesYmnoumenSe.text
ltx/en_us_dedes/me.m09.d01:meMA.Ode5C1T.incipit	…
ltx/en_us_dedes/me.m09.d01:meMA.Ode5C1T.melody	@ltx/en_us_dedes/he.h.m1:heHE.EkNyktosOrthrizontesYmnoumenSe.name
ltx/en_us_dedes/me.m09.d01:meMA.Ode5C1T.mode	@ltx/en_us_dedes/miscellanea:misc.Mode1
ltx/en_us_dedes/me.m09.d01:meMA.Ode5C1T.ode	@ltx/en_us_dedes/miscellanea:misc.Ode5
ltx/en_us_dedes/me.m09.d01:meMA.Ode5C1T.text	
ltx/en_us_dedes/me.m09.d01:meMA.Ode5C21.greekmelody	@ltx/en_us_dedes/he.h.m4:heHE.AseveisOukOpsontai.greekname
ltx/en_us_dedes/me.m09.d01:meMA.Ode5C21.incipit	…
ltx/en_us_dedes/me.m09.d01:meMA.Ode5C21.melody	@ltx/en_us_dedes/he.h.m4:heHE.AseveisOukOpsontai.name
ltx/en_us_dedes/me.m09.d01:meMA.Ode5C21.mode	@ltx/en_us_dedes/miscellanea:misc.Mode4
ltx/en_us_dedes/me.m09.d01:meMA.Ode5C21.ode	@ltx/en_us_dedes/miscellanea:misc.Ode5
ltx/en_us_dedes/me.m09.d01:meMA.Ode5C21.text	
ltx/en_us_dedes/me.m09.d01:meMA.Ode5C22.incipit	…
ltx/en_us_dedes/me.m09.d01:meMA.Ode5C22.melody	@ltx/en_us_dedes/he.h.m4:heHE.AseveisOukOpsontai.name
ltx/en_us_dedes/me.m09.d01:meMA.Ode5C22.mode	@ltx/en_us_dedes/miscellanea:misc.Mode4
ltx/en_us_dedes/me.m09.d01:meMA.Ode5C22.ode	@ltx/en_us_dedes/miscellanea:misc.Ode5
ltx/en_us_dedes/me.m09.d01:meMA.Ode5C22.text	
ltx/en_us_dedes/me.m09.d01:meMA.Ode5C23.incipit	…
ltx/en_us_dedes/me.m09.d01:meMA.Ode5C23.melody	@ltx/en_us_dedes/he.h.m4:heHE.AseveisOukOpsontai.name
ltx/en_us_dedes/me.m09.d01:meMA.Ode5C23.mode	@ltx/en_us_dedes/miscellanea:misc.Mode4
ltx/en_us_dedes/me.m09.d01:meMA.Ode5C23.ode	@ltx/en_us_dedes/miscellanea:misc.Ode5
ltx/en_us_dedes/me.m09.d01:meMA.Ode5C23.text	
ltx/en_us_dedes/me.m09.d01:meMA.Ode5C2T.incipit	…
ltx/en_us_dedes/me.m09.d01:meMA.Ode5C2T.melody	@ltx/en_us_dedes/he.h.m4:heHE.AseveisOukOpsontai.name
ltx/en_us_dedes/me.m09.d01:meMA.Ode5C2T.mode	@ltx/en_us_dedes/miscellanea:misc.Mode4
ltx/en_us_dedes/me.m09.d01:meMA.Ode5C2T.ode	@ltx/en_us_dedes/miscellanea:misc.Ode5
ltx/en_us_dedes/me.m09.d01:meMA.Ode5C2T.text	
ltx/en_us_dedes/me.m09.d01:meMA.Ode5C31.greekmelody	@ltx/en_us_dedes/he.h.m8:heHE.FotisonImas.greekname
ltx/en_us_dedes/me.m09.d01:meMA.Ode5C31.incipit	…
ltx/en_us_dedes/me.m09.d01:meMA.Ode5C31.melody	@ltx/en_us_dedes/he.h.m8:heHE.FotisonImas.name
ltx/en_us_dedes/me.m09.d01:meMA.Ode5C31.mode	@ltx/en_us_dedes/miscellanea:misc.Mode8
ltx/en_us_dedes/me.m09.d01:meMA.Ode5C31.ode	@ltx/en_us_dedes/miscellanea:misc.Ode5
ltx/en_us_dedes/me.m09.d01:meMA.Ode5C31.text	
ltx/en_us_dedes/me.m09.d01:meMA.Ode5C32.incipit	…
ltx/en_us_dedes/me.m09.d01:meMA.Ode5C32.melody	@ltx/en_us_dedes/he.h.m8:heHE.FotisonImas.name
ltx/en_us_dedes/me.m09.d01:meMA.Ode5C32.mode	@ltx/en_us_dedes/miscellanea:misc.Mode8
ltx/en_us_dedes/me.m09.d01:meMA.Ode5C32.ode	@ltx/en_us_dedes/miscellanea:misc.Ode5
ltx/en_us_dedes/me.m09.d01:meMA.Ode5C32.text	
ltx/en_us_dedes/me.m09.d01:meMA.Ode5C33.incipit	…
ltx/en_us_dedes/me.m09.d01:meMA.Ode5C33.melody	@ltx/en_us_dedes/he.h.m8:heHE.FotisonImas.name
ltx/en_us_dedes/me.m09.d01:meMA.Ode5C33.mode	@ltx/en_us_dedes/miscellanea:misc.Mode8
ltx/en_us_dedes/me.m09.d01:meMA.Ode5C33.ode	@ltx/en_us_dedes/miscellanea:misc.Ode5
ltx/en_us_dedes/me.m09.d01:meMA.Ode5C33.text	
ltx/en_us_dedes/me.m09.d01:meMA.Ode5C3T.incipit	…
ltx/en_us_dedes/me.m09.d01:meMA.Ode5C3T.melody	@ltx/en_us_dedes/he.h.m8:heHE.FotisonImas.name
ltx/en_us_dedes/me.m09.d01:meMA.Ode5C3T.mode	@ltx/en_us_dedes/miscellanea:misc.Mode8
ltx/en_us_dedes/me.m09.d01:meMA.Ode5C3T.ode	@ltx/en_us_dedes/miscellanea:misc.Ode5
ltx/en_us_dedes/me.m09.d01:meMA.Ode5C3T.text	
ltx/en_us_dedes/me.m09.d01:meMA.Ode6C11.greekmelody	@ltx/en_us_dedes/he.h.m1:heHE.TonProfitinDiesosas.greekname
ltx/en_us_dedes/me.m09.d01:meMA.Ode6C11.incipit	…
ltx/en_us_dedes/me.m09.d01:meMA.Ode6C11.melody	@ltx/en_us_dedes/he.h.m1:heHE.TonProfitinDiesosas.name
ltx/en_us_dedes/me.m09.d01:meMA.Ode6C11.mode	@ltx/en_us_dedes/miscellanea:misc.Mode1
ltx/en_us_dedes/me.m09.d01:meMA.Ode6C11.ode	@ltx/en_us_dedes/miscellanea:misc.Ode6
ltx/en_us_dedes/me.m09.d01:meMA.Ode6C11.text	
ltx/en_us_dedes/me.m09.d01:meMA.Ode6C12.incipit	…
ltx/en_us_dedes/me.m09.d01:meMA.Ode6C12.melody	@ltx/en_us_dedes/he.h.m1:heHE.TonProfitinDiesosas.name
ltx/en_us_dedes/me.m09.d01:meMA.Ode6C12.mode	@ltx/en_us_dedes/miscellanea:misc.Mode1
ltx/en_us_dedes/me.m09.d01:meMA.Ode6C12.ode	@ltx/en_us_dedes/miscellanea:misc.Ode6
ltx/en_us_dedes/me.m09.d01:meMA.Ode6C12.text	
ltx/en_us_dedes/me.m09.d01:meMA.Ode6C1H.greekmelody	@ltx/en_us_dedes/he.h.m1:heHE.TonProfitinDiesosas.greekname
ltx/en_us_dedes/me.m09.d01:meMA.Ode6C1H.incipit	@ltx/en_us_dedes/he.h.m1:heHE.TonProfitinDiesosas.incipit
ltx/en_us_dedes/me.m09.d01:meMA.Ode6C1H.melody	@ltx/en_us_dedes/he.h.m1:heHE.TonProfitinDiesosas.melody
ltx/en_us_dedes/me.m09.d01:meMA.Ode6C1H.mode	@ltx/en_us_dedes/miscellanea:misc.Mode1
ltx/en_us_dedes/me.m09.d01:meMA.Ode6C1H.ode	@ltx/en_us_dedes/miscellanea:misc.Ode6
ltx/en_us_dedes/me.m09.d01:meMA.Ode6C1H.text	@ltx/en_us_dedes/he.h.m1:heHE.TonProfitinDiesosas.text
ltx/en_us_dedes/me.m09.d01:meMA.Ode6C1T.incipit	…
ltx/en_us_dedes/me.m09.d01:meMA.Ode6C1T.melody	@ltx/en_us_dedes/he.h.m1:heHE.TonProfitinDiesosas.name
ltx/en_us_dedes/me.m09.d01:meMA.Ode6C1T.mode	@ltx/en_us_dedes/miscellanea:misc.Mode1
ltx/en_us_dedes/me.m09.d01:meMA.Ode6C1T.ode	@ltx/en_us_dedes/miscellanea:misc.Ode6
ltx/en_us_dedes/me.m09.d01:meMA.Ode6C1T.text	
ltx/en_us_dedes/me.m09.d01:meMA.Ode6C21.greekmelody	@ltx/en_us_dedes/he.h.m4:heHE.EvoiseProtypon.greekname
ltx/en_us_dedes/me.m09.d01:meMA.Ode6C21.incipit	…
ltx/en_us_dedes/me.m09.d01:meMA.Ode6C21.melody	@ltx/en_us_dedes/he.h.m4:heHE.EvoiseProtypon.name
ltx/en_us_dedes/me.m09.d01:meMA.Ode6C21.mode	@ltx/en_us_dedes/miscellanea:misc.Mode4
ltx/en_us_dedes/me.m09.d01:meMA.Ode6C21.ode	@ltx/en_us_dedes/miscellanea:misc.Ode6
ltx/en_us_dedes/me.m09.d01:meMA.Ode6C21.text	
ltx/en_us_dedes/me.m09.d01:meMA.Ode6C22.incipit	…
ltx/en_us_dedes/me.m09.d01:meMA.Ode6C22.melody	@ltx/en_us_dedes/he.h.m4:heHE.EvoiseProtypon.name
ltx/en_us_dedes/me.m09.d01:meMA.Ode6C22.mode	@ltx/en_us_dedes/miscellanea:misc.Mode4
ltx/en_us_dedes/me.m09.d01:meMA.Ode6C22.ode	@ltx/en_us_dedes/miscellanea:misc.Ode6
ltx/en_us_dedes/me.m09.d01:meMA.Ode6C22.text	
ltx/en_us_dedes/me.m09.d01:meMA.Ode6C23.incipit	…
ltx/en_us_dedes/me.m09.d01:meMA.Ode6C23.melody	@ltx/en_us_dedes/he.h.m4:heHE.EvoiseProtypon.name
ltx/en_us_dedes/me.m09.d01:meMA.Ode6C23.mode	@ltx/en_us_dedes/miscellanea:misc.Mode4
ltx/en_us_dedes/me.m09.d01:meMA.Ode6C23.ode	@ltx/en_us_dedes/miscellanea:misc.Ode6
ltx/en_us_dedes/me.m09.d01:meMA.Ode6C23.text	
ltx/en_us_dedes/me.m09.d01:meMA.Ode6C2T.incipit	…
ltx/en_us_dedes/me.m09.d01:meMA.Ode6C2T.melody	@ltx/en_us_dedes/he.h.m4:heHE.EvoiseProtypon.name
ltx/en_us_dedes/me.m09.d01:meMA.Ode6C2T.mode	@ltx/en_us_dedes/miscellanea:misc.Mode4
ltx/en_us_dedes/me.m09.d01:meMA.Ode6C2T.ode	@ltx/en_us_dedes/miscellanea:misc.Ode6
ltx/en_us_dedes/me.m09.d01:meMA.Ode6C2T.text	
ltx/en_us_dedes/me.m09.d01:meMA.Ode6C31.greekmelody	@ltx/en_us_dedes/he.h.m8:heHE.ChitonaMoiParaschou.greekname
ltx/en_us_dedes/me.m09.d01:meMA.Ode6C31.incipit	…
ltx/en_us_dedes/me.m09.d01:meMA.Ode6C31.melody	@ltx/en_us_dedes/he.h.m8:heHE.ChitonaMoiParaschou.name
ltx/en_us_dedes/me.m09.d01:meMA.Ode6C31.mode	@ltx/en_us_dedes/miscellanea:misc.Mode8
ltx/en_us_dedes/me.m09.d01:meMA.Ode6C31.ode	@ltx/en_us_dedes/miscellanea:misc.Ode6
ltx/en_us_dedes/me.m09.d01:meMA.Ode6C31.text	
ltx/en_us_dedes/me.m09.d01:meMA.Ode6C32.incipit	…
ltx/en_us_dedes/me.m09.d01:meMA.Ode6C32.melody	@ltx/en_us_dedes/he.h.m8:heHE.ChitonaMoiParaschou.name
ltx/en_us_dedes/me.m09.d01:meMA.Ode6C32.mode	@ltx/en_us_dedes/miscellanea:misc.Mode8
ltx/en_us_dedes/me.m09.d01:meMA.Ode6C32.ode	@ltx/en_us_dedes/miscellanea:misc.Ode6
ltx/en_us_dedes/me.m09.d01:meMA.Ode6C32.text	
ltx/en_us_dedes/me.m09.d01:meMA.Ode6C33.incipit	…
ltx/en_us_dedes/me.m09.d01:meMA.Ode6C33.melody	@ltx/en_us_dedes/he.h.m8:heHE.ChitonaMoiParaschou.name
ltx/en_us_dedes/me.m09.d01:meMA.Ode6C33.mode	@ltx/en_us_dedes/miscellanea:misc.Mode8
ltx/en_us_dedes/me.m09.d01:meMA.Ode6C33.ode	@ltx/en_us_dedes/miscellanea:misc.Ode6
ltx/en_us_dedes/me.m09.d01:meMA.Ode6C33.text	
ltx/en_us_dedes/me.m09.d01:meMA.Ode6C3T.incipit	…
ltx/en_us_dedes/me.m09.d01:meMA.Ode6C3T.melody	@ltx/en_us_dedes/he.h.m8:heHE.ChitonaMoiParaschou.name
ltx/en_us_dedes/me.m09.d01:meMA.Ode6C3T.mode	@ltx/en_us_dedes/miscellanea:misc.Mode8
ltx/en_us_dedes/me.m09.d01:meMA.Ode6C3T.ode	@ltx/en_us_dedes/miscellanea:misc.Ode6
ltx/en_us_dedes/me.m09.d01:meMA.Ode6C3T.text	
ltx/en_us_dedes/me.m09.d01:meMA.Ode7C11.greekmelody	@ltx/en_us_dedes/he.h.m1:heHE.OiPaidesEfseveia.greekname
ltx/en_us_dedes/me.m09.d01:meMA.Ode7C11.incipit	…
ltx/en_us_dedes/me.m09.d01:meMA.Ode7C11.melody	@ltx/en_us_dedes/he.h.m1:heHE.OiPaidesEfseveia.name
ltx/en_us_dedes/me.m09.d01:meMA.Ode7C11.mode	@ltx/en_us_dedes/miscellanea:misc.Mode1
ltx/en_us_dedes/me.m09.d01:meMA.Ode7C11.ode	@ltx/en_us_dedes/miscellanea:misc.Ode7
ltx/en_us_dedes/me.m09.d01:meMA.Ode7C11.text	
ltx/en_us_dedes/me.m09.d01:meMA.Ode7C12.incipit	…
ltx/en_us_dedes/me.m09.d01:meMA.Ode7C12.melody	@ltx/en_us_dedes/he.h.m1:heHE.OiPaidesEfseveia.name
ltx/en_us_dedes/me.m09.d01:meMA.Ode7C12.mode	@ltx/en_us_dedes/miscellanea:misc.Mode1
ltx/en_us_dedes/me.m09.d01:meMA.Ode7C12.ode	@ltx/en_us_dedes/miscellanea:misc.Ode7
ltx/en_us_dedes/me.m09.d01:meMA.Ode7C12.text	
ltx/en_us_dedes/me.m09.d01:meMA.Ode7C1H.greekmelody	@ltx/en_us_dedes/he.h.m1:heHE.OiPaidesEfseveia.greekname
ltx/en_us_dedes/me.m09.d01:meMA.Ode7C1H.incipit	@ltx/en_us_dedes/he.h.m1:heHE.OiPaidesEfseveia.incipit
ltx/en_us_dedes/me.m09.d01:meMA.Ode7C1H.melody	@ltx/en_us_dedes/he.h.m1:heHE.OiPaidesEfseveia.melody
ltx/en_us_dedes/me.m09.d01:meMA.Ode7C1H.mode	@ltx/en_us_dedes/miscellanea:misc.Mode1
ltx/en_us_dedes/me.m09.d01:meMA.Ode7C1H.ode	@ltx/en_us_dedes/miscellanea:misc.Ode7
ltx/en_us_dedes/me.m09.d01:meMA.Ode7C1H.text	@ltx/en_us_dedes/he.h.m1:heHE.OiPaidesEfseveia.text
ltx/en_us_dedes/me.m09.d01:meMA.Ode7C1T.incipit	…
ltx/en_us_dedes/me.m09.d01:meMA.Ode7C1T.melody	@ltx/en_us_dedes/he.h.m1:heHE.OiPaidesEfseveia.name
ltx/en_us_dedes/me.m09.d01:meMA.Ode7C1T.mode	@ltx/en_us_dedes/miscellanea:misc.Mode1
ltx/en_us_dedes/me.m09.d01:meMA.Ode7C1T.ode	@ltx/en_us_dedes/miscellanea:misc.Ode7
ltx/en_us_dedes/me.m09.d01:meMA.Ode7C1T.text	
ltx/en_us_dedes/me.m09.d01:meMA.Ode7C21.greekmelody	@ltx/en_us_dedes/he.h.m4:heHE.ODiasosasEnPyri.greekname
ltx/en_us_dedes/me.m09.d01:meMA.Ode7C21.incipit	…
ltx/en_us_dedes/me.m09.d01:meMA.Ode7C21.melody	@ltx/en_us_dedes/he.h.m4:heHE.ODiasosasEnPyri.name
ltx/en_us_dedes/me.m09.d01:meMA.Ode7C21.mode	@ltx/en_us_dedes/miscellanea:misc.Mode4
ltx/en_us_dedes/me.m09.d01:meMA.Ode7C21.ode	@ltx/en_us_dedes/miscellanea:misc.Ode7
ltx/en_us_dedes/me.m09.d01:meMA.Ode7C21.text	
ltx/en_us_dedes/me.m09.d01:meMA.Ode7C22.incipit	…
ltx/en_us_dedes/me.m09.d01:meMA.Ode7C22.melody	@ltx/en_us_dedes/he.h.m4:heHE.ODiasosasEnPyri.name
ltx/en_us_dedes/me.m09.d01:meMA.Ode7C22.mode	@ltx/en_us_dedes/miscellanea:misc.Mode4
ltx/en_us_dedes/me.m09.d01:meMA.Ode7C22.ode	@ltx/en_us_dedes/miscellanea:misc.Ode7
ltx/en_us_dedes/me.m09.d01:meMA.Ode7C22.text	
ltx/en_us_dedes/me.m09.d01:meMA.Ode7C23.incipit	…
ltx/en_us_dedes/me.m09.d01:meMA.Ode7C23.melody	@ltx/en_us_dedes/he.h.m4:heHE.ODiasosasEnPyri.name
ltx/en_us_dedes/me.m09.d01:meMA.Ode7C23.mode	@ltx/en_us_dedes/miscellanea:misc.Mode4
ltx/en_us_dedes/me.m09.d01:meMA.Ode7C23.ode	@ltx/en_us_dedes/miscellanea:misc.Ode7
ltx/en_us_dedes/me.m09.d01:meMA.Ode7C23.text	
ltx/en_us_dedes/me.m09.d01:meMA.Ode7C2T.incipit	…
ltx/en_us_dedes/me.m09.d01:meMA.Ode7C2T.melody	@ltx/en_us_dedes/he.h.m4:heHE.ODiasosasEnPyri.name
ltx/en_us_dedes/me.m09.d01:meMA.Ode7C2T.mode	@ltx/en_us_dedes/miscellanea:misc.Mode4
ltx/en_us_dedes/me.m09.d01:meMA.Ode7C2T.ode	@ltx/en_us_dedes/miscellanea:misc.Ode7
ltx/en_us_dedes/me.m09.d01:meMA.Ode7C2T.text	
ltx/en_us_dedes/me.m09.d01:meMA.Ode7C31.greekmelody	@ltx/en_us_dedes/he.h.m8:heHE.PaidesTheoseveis.greekname
ltx/en_us_dedes/me.m09.d01:meMA.Ode7C31.incipit	…
ltx/en_us_dedes/me.m09.d01:meMA.Ode7C31.melody	@ltx/en_us_dedes/he.h.m8:heHE.PaidesTheoseveis.name
ltx/en_us_dedes/me.m09.d01:meMA.Ode7C31.mode	@ltx/en_us_dedes/miscellanea:misc.Mode8
ltx/en_us_dedes/me.m09.d01:meMA.Ode7C31.ode	@ltx/en_us_dedes/miscellanea:misc.Ode7
ltx/en_us_dedes/me.m09.d01:meMA.Ode7C31.text	
ltx/en_us_dedes/me.m09.d01:meMA.Ode7C32.incipit	…
ltx/en_us_dedes/me.m09.d01:meMA.Ode7C32.melody	@ltx/en_us_dedes/he.h.m8:heHE.PaidesTheoseveis.name
ltx/en_us_dedes/me.m09.d01:meMA.Ode7C32.mode	@ltx/en_us_dedes/miscellanea:misc.Mode8
ltx/en_us_dedes/me.m09.d01:meMA.Ode7C32.ode	@ltx/en_us_dedes/miscellanea:misc.Ode7
ltx/en_us_dedes/me.m09.d01:meMA.Ode7C32.text	
ltx/en_us_dedes/me.m09.d01:meMA.Ode7C33.incipit	…
ltx/en_us_dedes/me.m09.d01:meMA.Ode7C33.melody	@ltx/en_us_dedes/he.h.m8:heHE.PaidesTheoseveis.name
ltx/en_us_dedes/me.m09.d01:meMA.Ode7C33.mode	@ltx/en_us_dedes/miscellanea:misc.Mode8
ltx/en_us_dedes/me.m09.d01:meMA.Ode7C33.ode	@ltx/en_us_dedes/miscellanea:misc.Ode7
ltx/en_us_dedes/me.m09.d01:meMA.Ode7C33.text	
ltx/en_us_dedes/me.m09.d01:meMA.Ode7C34.incipit	…
ltx/en_us_dedes/me.m09.d01:meMA.Ode7C34.melody	@ltx/en_us_dedes/he.h.m8:heHE.PaidesTheoseveis.name
ltx/en_us_dedes/me.m09.d01:meMA.Ode7C34.mode	@ltx/en_us_dedes/miscellanea:misc.Mode8
ltx/en_us_dedes/me.m09.d01:meMA.Ode7C34.ode	@ltx/en_us_dedes/miscellanea:misc.Ode7
ltx/en_us_dedes/me.m09.d01:meMA.Ode7C34.text	
ltx/en_us_dedes/me.m09.d01:meMA.Ode7C3T.incipit	…
ltx/en_us_dedes/me.m09.d01:meMA.Ode7C3T.melody	@ltx/en_us_dedes/he.h.m8:heHE.PaidesTheoseveis.name
ltx/en_us_dedes/me.m09.d01:meMA.Ode7C3T.mode	@ltx/en_us_dedes/miscellanea:misc.Mode8
ltx/en_us_dedes/me.m09.d01:meMA.Ode7C3T.ode	@ltx/en_us_dedes/miscellanea:misc.Ode7
ltx/en_us_dedes/me.m09.d01:meMA.Ode7C3T.text	
ltx/en_us_dedes/me.m09.d01:meMA.Ode8C11.greekmelody	@ltx/en_us_dedes/he.h.m1:heHE.TonTousYmnologousEnKamino.greekname
ltx/en_us_dedes/me.m09.d01:meMA.Ode8C11.incipit	…
ltx/en_us_dedes/me.m09.d01:meMA.Ode8C11.melody	@ltx/en_us_dedes/he.h.m1:heHE.TonTousYmnologousEnKamino.name
ltx/en_us_dedes/me.m09.d01:meMA.Ode8C11.mode	@ltx/en_us_dedes/miscellanea:misc.Mode1
ltx/en_us_dedes/me.m09.d01:meMA.Ode8C11.ode	@ltx/en_us_dedes/miscellanea:misc.Ode8
ltx/en_us_dedes/me.m09.d01:meMA.Ode8C11.text	
ltx/en_us_dedes/me.m09.d01:meMA.Ode8C12.incipit	…
ltx/en_us_dedes/me.m09.d01:meMA.Ode8C12.melody	@ltx/en_us_dedes/he.h.m1:heHE.TonTousYmnologousEnKamino.name
ltx/en_us_dedes/me.m09.d01:meMA.Ode8C12.mode	@ltx/en_us_dedes/miscellanea:misc.Mode1
ltx/en_us_dedes/me.m09.d01:meMA.Ode8C12.ode	@ltx/en_us_dedes/miscellanea:misc.Ode8
ltx/en_us_dedes/me.m09.d01:meMA.Ode8C12.text	
ltx/en_us_dedes/me.m09.d01:meMA.Ode8C13.incipit	…
ltx/en_us_dedes/me.m09.d01:meMA.Ode8C13.melody	@ltx/en_us_dedes/he.h.m1:heHE.TonTousYmnologousEnKamino.name
ltx/en_us_dedes/me.m09.d01:meMA.Ode8C13.mode	@ltx/en_us_dedes/miscellanea:misc.Mode1
ltx/en_us_dedes/me.m09.d01:meMA.Ode8C13.ode	@ltx/en_us_dedes/miscellanea:misc.Ode8
ltx/en_us_dedes/me.m09.d01:meMA.Ode8C13.text	
ltx/en_us_dedes/me.m09.d01:meMA.Ode8C1H.greekmelody	@ltx/en_us_dedes/he.h.m1:heHE.TonTousYmnologousEnKamino.greekname
ltx/en_us_dedes/me.m09.d01:meMA.Ode8C1H.incipit	@ltx/en_us_dedes/he.h.m1:heHE.TonTousYmnologousEnKamino.incipit
ltx/en_us_dedes/me.m09.d01:meMA.Ode8C1H.melody	@ltx/en_us_dedes/he.h.m1:heHE.TonTousYmnologousEnKamino.melody
ltx/en_us_dedes/me.m09.d01:meMA.Ode8C1H.mode	@ltx/en_us_dedes/miscellanea:misc.Mode1
ltx/en_us_dedes/me.m09.d01:meMA.Ode8C1H.ode	@ltx/en_us_dedes/miscellanea:misc.Ode8
ltx/en_us_dedes/me.m09.d01:meMA.Ode8C1H.text	@ltx/en_us_dedes/he.h.m1:heHE.TonTousYmnologousEnKamino.text
ltx/en_us_dedes/me.m09.d01:meMA.Ode8C1T.incipit	…
ltx/en_us_dedes/me.m09.d01:meMA.Ode8C1T.melody	@ltx/en_us_dedes/he.h.m1:heHE.TonTousYmnologousEnKamino.name
ltx/en_us_dedes/me.m09.d01:meMA.Ode8C1T.mode	@ltx/en_us_dedes/miscellanea:misc.Mode1
ltx/en_us_dedes/me.m09.d01:meMA.Ode8C1T.ode	@ltx/en_us_dedes/miscellanea:misc.Ode8
ltx/en_us_dedes/me.m09.d01:meMA.Ode8C1T.text	
ltx/en_us_dedes/me.m09.d01:meMA.Ode8C21.greekmelody	@ltx/en_us_dedes/he.h.m4:heHE.PaidasEvageis.greekname
ltx/en_us_dedes/me.m09.d01:meMA.Ode8C21.incipit	…
ltx/en_us_dedes/me.m09.d01:meMA.Ode8C21.melody	@ltx/en_us_dedes/he.h.m4:heHE.PaidasEvageis.name
ltx/en_us_dedes/me.m09.d01:meMA.Ode8C21.mode	@ltx/en_us_dedes/miscellanea:misc.Mode4
ltx/en_us_dedes/me.m09.d01:meMA.Ode8C21.ode	@ltx/en_us_dedes/miscellanea:misc.Ode8
ltx/en_us_dedes/me.m09.d01:meMA.Ode8C21.text	
ltx/en_us_dedes/me.m09.d01:meMA.Ode8C22.incipit	…
ltx/en_us_dedes/me.m09.d01:meMA.Ode8C22.melody	@ltx/en_us_dedes/he.h.m4:heHE.PaidasEvageis.name
ltx/en_us_dedes/me.m09.d01:meMA.Ode8C22.mode	@ltx/en_us_dedes/miscellanea:misc.Mode4
ltx/en_us_dedes/me.m09.d01:meMA.Ode8C22.ode	@ltx/en_us_dedes/miscellanea:misc.Ode8
ltx/en_us_dedes/me.m09.d01:meMA.Ode8C22.text	
ltx/en_us_dedes/me.m09.d01:meMA.Ode8C23.incipit	…
ltx/en_us_dedes/me.m09.d01:meMA.Ode8C23.melody	@ltx/en_us_dedes/he.h.m4:heHE.PaidasEvageis.name
ltx/en_us_dedes/me.m09.d01:meMA.Ode8C23.mode	@ltx/en_us_dedes/miscellanea:misc.Mode4
ltx/en_us_dedes/me.m09.d01:meMA.Ode8C23.ode	@ltx/en_us_dedes/miscellanea:misc.Ode8
ltx/en_us_dedes/me.m09.d01:meMA.Ode8C23.text	
ltx/en_us_dedes/me.m09.d01:meMA.Ode8C24.incipit	…
ltx/en_us_dedes/me.m09.d01:meMA.Ode8C24.melody	@ltx/en_us_dedes/he.h.m4:heHE.PaidasEvageis.name
ltx/en_us_dedes/me.m09.d01:meMA.Ode8C24.mode	@ltx/en_us_dedes/miscellanea:misc.Mode4
ltx/en_us_dedes/me.m09.d01:meMA.Ode8C24.ode	@ltx/en_us_dedes/miscellanea:misc.Ode8
ltx/en_us_dedes/me.m09.d01:meMA.Ode8C24.text	
ltx/en_us_dedes/me.m09.d01:meMA.Ode8C2T.incipit	…
ltx/en_us_dedes/me.m09.d01:meMA.Ode8C2T.melody	@ltx/en_us_dedes/he.h.m4:heHE.PaidasEvageis.name
ltx/en_us_dedes/me.m09.d01:meMA.Ode8C2T.mode	@ltx/en_us_dedes/miscellanea:misc.Mode4
ltx/en_us_dedes/me.m09.d01:meMA.Ode8C2T.ode	@ltx/en_us_dedes/miscellanea:misc.Ode8
ltx/en_us_dedes/me.m09.d01:meMA.Ode8C2T.text	
ltx/en_us_dedes/me.m09.d01:meMA.Ode8C31.greekmelody	@ltx/en_us_dedes/he.h.m8:heHE.TonEnOreiAgio.greekname
ltx/en_us_dedes/me.m09.d01:meMA.Ode8C31.incipit	…
ltx/en_us_dedes/me.m09.d01:meMA.Ode8C31.melody	@ltx/en_us_dedes/he.h.m8:heHE.TonEnOreiAgio.name
ltx/en_us_dedes/me.m09.d01:meMA.Ode8C31.mode	@ltx/en_us_dedes/miscellanea:misc.Mode8
ltx/en_us_dedes/me.m09.d01:meMA.Ode8C31.ode	@ltx/en_us_dedes/miscellanea:misc.Ode8
ltx/en_us_dedes/me.m09.d01:meMA.Ode8C31.text	
ltx/en_us_dedes/me.m09.d01:meMA.Ode8C32.incipit	…
ltx/en_us_dedes/me.m09.d01:meMA.Ode8C32.melody	@ltx/en_us_dedes/he.h.m8:heHE.TonEnOreiAgio.name
ltx/en_us_dedes/me.m09.d01:meMA.Ode8C32.mode	@ltx/en_us_dedes/miscellanea:misc.Mode8
ltx/en_us_dedes/me.m09.d01:meMA.Ode8C32.ode	@ltx/en_us_dedes/miscellanea:misc.Ode8
ltx/en_us_dedes/me.m09.d01:meMA.Ode8C32.text	
ltx/en_us_dedes/me.m09.d01:meMA.Ode8C33.incipit	…
ltx/en_us_dedes/me.m09.d01:meMA.Ode8C33.melody	@ltx/en_us_dedes/he.h.m8:heHE.TonEnOreiAgio.name
ltx/en_us_dedes/me.m09.d01:meMA.Ode8C33.mode	@ltx/en_us_dedes/miscellanea:misc.Mode8
ltx/en_us_dedes/me.m09.d01:meMA.Ode8C33.ode	@ltx/en_us_dedes/miscellanea:misc.Ode8
ltx/en_us_dedes/me.m09.d01:meMA.Ode8C33.text	
ltx/en_us_dedes/me.m09.d01:meMA.Ode8C34.incipit	…
ltx/en_us_dedes/me.m09.d01:meMA.Ode8C34.melody	@ltx/en_us_dedes/he.h.m8:heHE.TonEnOreiAgio.name
ltx/en_us_dedes/me.m09.d01:meMA.Ode8C34.mode	@ltx/en_us_dedes/miscellanea:misc.Mode8
ltx/en_us_dedes/me.m09.d01:meMA.Ode8C34.ode	@ltx/en_us_dedes/miscellanea:misc.Ode8
ltx/en_us_dedes/me.m09.d01:meMA.Ode8C34.text	
ltx/en_us_dedes/me.m09.d01:meMA.Ode8C3T.incipit	…
ltx/en_us_dedes/me.m09.d01:meMA.Ode8C3T.melody	@ltx/en_us_dedes/he.h.m8:heHE.TonEnOreiAgio.name
ltx/en_us_dedes/me.m09.d01:meMA.Ode8C3T.mode	@ltx/en_us_dedes/miscellanea:misc.Mode8
ltx/en_us_dedes/me.m09.d01:meMA.Ode8C3T.ode	@ltx/en_us_dedes/miscellanea:misc.Ode8
ltx/en_us_dedes/me.m09.d01:meMA.Ode8C3T.text	
ltx/en_us_dedes/me.m09.d01:meMA.Ode9C11.greekmelody	@ltx/en_us_dedes/he.h.m1:heHE.TyponTisAgnis.greekname
ltx/en_us_dedes/me.m09.d01:meMA.Ode9C11.incipit	…
ltx/en_us_dedes/me.m09.d01:meMA.Ode9C11.melody	@ltx/en_us_dedes/he.h.m1:heHE.TyponTisAgnis.name
ltx/en_us_dedes/me.m09.d01:meMA.Ode9C11.mode	@ltx/en_us_dedes/miscellanea:misc.Mode1
ltx/en_us_dedes/me.m09.d01:meMA.Ode9C11.ode	@ltx/en_us_dedes/miscellanea:misc.Ode9
ltx/en_us_dedes/me.m09.d01:meMA.Ode9C11.text	
ltx/en_us_dedes/me.m09.d01:meMA.Ode9C12.incipit	…
ltx/en_us_dedes/me.m09.d01:meMA.Ode9C12.melody	@ltx/en_us_dedes/he.h.m1:heHE.TyponTisAgnis.name
ltx/en_us_dedes/me.m09.d01:meMA.Ode9C12.mode	@ltx/en_us_dedes/miscellanea:misc.Mode1
ltx/en_us_dedes/me.m09.d01:meMA.Ode9C12.ode	@ltx/en_us_dedes/miscellanea:misc.Ode9
ltx/en_us_dedes/me.m09.d01:meMA.Ode9C12.text	
ltx/en_us_dedes/me.m09.d01:meMA.Ode9C1H.greekmelody	@ltx/en_us_dedes/he.h.m1:heHE.TyponTisAgnis.greekname
ltx/en_us_dedes/me.m09.d01:meMA.Ode9C1H.incipit	@ltx/en_us_dedes/he.h.m1:heHE.TyponTisAgnis.incipit
ltx/en_us_dedes/me.m09.d01:meMA.Ode9C1H.melody	@ltx/en_us_dedes/he.h.m1:heHE.TyponTisAgnis.melody
ltx/en_us_dedes/me.m09.d01:meMA.Ode9C1H.mode	@ltx/en_us_dedes/miscellanea:misc.Mode1
ltx/en_us_dedes/me.m09.d01:meMA.Ode9C1H.ode	@ltx/en_us_dedes/miscellanea:misc.Ode9
ltx/en_us_dedes/me.m09.d01:meMA.Ode9C1H.text	@ltx/en_us_dedes/he.h.m1:heHE.TyponTisAgnis.text
ltx/en_us_dedes/me.m09.d01:meMA.Ode9C1T.incipit	…
ltx/en_us_dedes/me.m09.d01:meMA.Ode9C1T.melody	@ltx/en_us_dedes/he.h.m1:heHE.TyponTisAgnis.name
ltx/en_us_dedes/me.m09.d01:meMA.Ode9C1T.mode	@ltx/en_us_dedes/miscellanea:misc.Mode1
ltx/en_us_dedes/me.m09.d01:meMA.Ode9C1T.ode	@ltx/en_us_dedes/miscellanea:misc.Ode9
ltx/en_us_dedes/me.m09.d01:meMA.Ode9C1T.text	
ltx/en_us_dedes/me.m09.d01:meMA.Ode9C21.greekmelody	@ltx/en_us_dedes/he.h.m4:heHE.EvaMenToTisParakois.greekname
ltx/en_us_dedes/me.m09.d01:meMA.Ode9C21.incipit	…
ltx/en_us_dedes/me.m09.d01:meMA.Ode9C21.melody	@ltx/en_us_dedes/he.h.m4:heHE.EvaMenToTisParakois.name
ltx/en_us_dedes/me.m09.d01:meMA.Ode9C21.mode	@ltx/en_us_dedes/miscellanea:misc.Mode4
ltx/en_us_dedes/me.m09.d01:meMA.Ode9C21.ode	@ltx/en_us_dedes/miscellanea:misc.Ode9
ltx/en_us_dedes/me.m09.d01:meMA.Ode9C21.text	
ltx/en_us_dedes/me.m09.d01:meMA.Ode9C22.incipit	…
ltx/en_us_dedes/me.m09.d01:meMA.Ode9C22.melody	@ltx/en_us_dedes/he.h.m4:heHE.EvaMenToTisParakois.name
ltx/en_us_dedes/me.m09.d01:meMA.Ode9C22.mode	@ltx/en_us_dedes/miscellanea:misc.Mode4
ltx/en_us_dedes/me.m09.d01:meMA.Ode9C22.ode	@ltx/en_us_dedes/miscellanea:misc.Ode9
ltx/en_us_dedes/me.m09.d01:meMA.Ode9C22.text	
ltx/en_us_dedes/me.m09.d01:meMA.Ode9C23.incipit	…
ltx/en_us_dedes/me.m09.d01:meMA.Ode9C23.melody	@ltx/en_us_dedes/he.h.m4:heHE.EvaMenToTisParakois.name
ltx/en_us_dedes/me.m09.d01:meMA.Ode9C23.mode	@ltx/en_us_dedes/miscellanea:misc.Mode4
ltx/en_us_dedes/me.m09.d01:meMA.Ode9C23.ode	@ltx/en_us_dedes/miscellanea:misc.Ode9
ltx/en_us_dedes/me.m09.d01:meMA.Ode9C23.text	
ltx/en_us_dedes/me.m09.d01:meMA.Ode9C2T.incipit	…
ltx/en_us_dedes/me.m09.d01:meMA.Ode9C2T.melody	@ltx/en_us_dedes/he.h.m4:heHE.EvaMenToTisParakois.name
ltx/en_us_dedes/me.m09.d01:meMA.Ode9C2T.mode	@ltx/en_us_dedes/miscellanea:misc.Mode4
ltx/en_us_dedes/me.m09.d01:meMA.Ode9C2T.ode	@ltx/en_us_dedes/miscellanea:misc.Ode9
ltx/en_us_dedes/me.m09.d01:meMA.Ode9C2T.text	
ltx/en_us_dedes/me.m09.d01:meMA.Ode9C31.greekmelody	@ltx/en_us_dedes/he.h.m8:heHE.TonProdilothenta.greekname
ltx/en_us_dedes/me.m09.d01:meMA.Ode9C31.incipit	…
ltx/en_us_dedes/me.m09.d01:meMA.Ode9C31.melody	@ltx/en_us_dedes/he.h.m8:heHE.TonProdilothenta.name
ltx/en_us_dedes/me.m09.d01:meMA.Ode9C31.mode	@ltx/en_us_dedes/miscellanea:misc.Mode8
ltx/en_us_dedes/me.m09.d01:meMA.Ode9C31.ode	@ltx/en_us_dedes/miscellanea:misc.Ode9
ltx/en_us_dedes/me.m09.d01:meMA.Ode9C31.text	
ltx/en_us_dedes/me.m09.d01:meMA.Ode9C32.incipit	…
ltx/en_us_dedes/me.m09.d01:meMA.Ode9C32.melody	@ltx/en_us_dedes/he.h.m8:heHE.TonProdilothenta.name
ltx/en_us_dedes/me.m09.d01:meMA.Ode9C32.mode	@ltx/en_us_dedes/miscellanea:misc.Mode8
ltx/en_us_dedes/me.m09.d01:meMA.Ode9C32.ode	@ltx/en_us_dedes/miscellanea:misc.Ode9
ltx/en_us_dedes/me.m09.d01:meMA.Ode9C32.text	
ltx/en_us_dedes/me.m09.d01:meMA.Ode9C33.incipit	…
ltx/en_us_dedes/me.m09.d01:meMA.Ode9C33.melody	@ltx/en_us_dedes/he.h.m8:heHE.TonProdilothenta.name
ltx/en_us_dedes/me.m09.d01:meMA.Ode9C33.mode	@ltx/en_us_dedes/miscellanea:misc.Mode8
ltx/en_us_dedes/me.m09.d01:meMA.Ode9C33.ode	@ltx/en_us_dedes/miscellanea:misc.Ode9
ltx/en_us_dedes/me.m09.d01:meMA.Ode9C33.text	
ltx/en_us_dedes/me.m09.d01:meMA.Ode9C3T.incipit	…
ltx/en_us_dedes/me.m09.d01:meMA.Ode9C3T.melody	@ltx/en_us_dedes/he.h.m8:heHE.TonProdilothenta.name
ltx/en_us_dedes/me.m09.d01:meMA.Ode9C3T.mode	@ltx/en_us_dedes/miscellanea:misc.Mode8
ltx/en_us_dedes/me.m09.d01:meMA.Ode9C3T.ode	@ltx/en_us_dedes/miscellanea:misc.Ode9
ltx/en_us_dedes/me.m09.d01:meMA.Ode9C3T.text	
ltx/en_us_dedes/me.m09.d01:meMA.Oikos2.text	No human language is sufficient to tell of Symeon’s blameless life or to praise it. Nevertheless, by God’s wisdom I will extol this hero’s contests and feats. He appeared on earth like a beacon for all people, and by his perseverance he shone mightily for the choir of Angels. With them, he unceasingly sings to the Lord, and he ceaselessly intercedes with Christ our God.
ltx/en_us_dedes/me.m09.d01:meMA.Oikos3.text	To God, who made all things in ineffable wisdom, and who preserves all things by His omnific might, we offer our heartfelt praise with reverence, and with trembling we implore Him to grant fruitfulness to the earth, today on the beginning of the year, and to deliver us from every hardship and from enemies, seen and unseen, as we cry out in these good times: “For all Your servants, make fruitful the coming year.”
ltx/en_us_dedes/me.m09.d01:meMA.PostGospelBoth.incipit	@ltx/en_us_dedes/ho.ho03:hoMA.PostGospelTheotokos.incipit
ltx/en_us_dedes/me.m09.d01:meMA.PostGospelBoth.melody	
ltx/en_us_dedes/me.m09.d01:meMA.PostGospelBoth.mode	@ltx/en_us_dedes/miscellanea:misc.Mode2
ltx/en_us_dedes/me.m09.d01:meMA.PostGospelBoth.text	@ltx/en_us_dedes/ho.ho03:hoMA.PostGospelTheotokos.text
ltx/en_us_dedes/me.m09.d01:meMA.PostGospelGlory.incipit	@ltx/en_us_dedes/ho.ho03:hoMA.PostGospelMonastic.incipit
ltx/en_us_dedes/me.m09.d01:meMA.PostGospelGlory.melody	
ltx/en_us_dedes/me.m09.d01:meMA.PostGospelGlory.mode	@ltx/en_us_dedes/miscellanea:misc.Mode2
ltx/en_us_dedes/me.m09.d01:meMA.PostGospelGlory.text	@ltx/en_us_dedes/ho.ho03:hoMA.PostGospelMonastic.text
ltx/en_us_dedes/me.m09.d01:meMA.PostGospelIdiomelon.incipit	@ltx/en_us_dedes/me.m09.d01:meVE.Aposticha4.incipit
ltx/en_us_dedes/me.m09.d01:meMA.PostGospelIdiomelon.melody	
ltx/en_us_dedes/me.m09.d01:meMA.PostGospelIdiomelon.mode	@ltx/en_us_dedes/miscellanea:misc.Mode2
ltx/en_us_dedes/me.m09.d01:meMA.PostGospelIdiomelon.text	@ltx/en_us_dedes/me.m09.d01:meVE.Aposticha4.text
ltx/en_us_dedes/me.m09.d01:meVE.Apolytikion1.incipit	O Fashioner of all creation…
ltx/en_us_dedes/me.m09.d01:meVE.Apolytikion1.melody	
ltx/en_us_dedes/me.m09.d01:meVE.Apolytikion1.mode	@ltx/en_us_dedes/miscellanea:misc.Mode2
ltx/en_us_dedes/me.m09.d01:meVE.Apolytikion1.text	O Fashioner of all creation, who made seasons and years by Your own authority, bless the crown of the year with Your goodness, O Lord, and preserve our rulers and Your city in peace, at the intercession of the Theotokos, and save us.
ltx/en_us_dedes/me.m09.d01:meVE.Apolytikion2.incipit	You became a pillar of…
ltx/en_us_dedes/me.m09.d01:meVE.Apolytikion2.melody	
ltx/en_us_dedes/me.m09.d01:meVE.Apolytikion2.mode	@ltx/en_us_dedes/miscellanea:misc.Mode1
ltx/en_us_dedes/me.m09.d01:meVE.Apolytikion2.text	You became a pillar of patience, O devout one, emulating the forefathers, Job in his sufferings and Joseph in his temptations, and the manner of the bodiless, though you were still in body. O devout father Symeon, intercede with Christ God, to save our souls.
ltx/en_us_dedes/me.m09.d01:meVE.Apolytikion3.incipit	@ltx/en_us_dedes/oc.m7.d1:ocMA.Kathisma23.incipit
ltx/en_us_dedes/me.m09.d01:meVE.Apolytikion3.melody	
ltx/en_us_dedes/me.m09.d01:meVE.Apolytikion3.mode	@ltx/en_us_dedes/miscellanea:misc.Mode7
ltx/en_us_dedes/me.m09.d01:meVE.Apolytikion3.text	@ltx/en_us_dedes/oc.m7.d1:ocMA.Kathisma23.text
ltx/en_us_dedes/me.m09.d01:meVE.AposBoth.incipit	You, O King, the one…
ltx/en_us_dedes/me.m09.d01:meVE.AposBoth.melody	@ltx/en_us_dedes/miscellanea:misc.Idiomelon
ltx/en_us_dedes/me.m09.d01:meVE.AposBoth.mode	@ltx/en_us_dedes/miscellanea:misc.Mode5
ltx/en_us_dedes/me.m09.d01:meVE.AposBoth.poet	@ltx/en_us_dedes/poets:po.IoannouMonachou
ltx/en_us_dedes/me.m09.d01:meVE.AposBoth.text	You, O King, the one who is and who remains for never-ending ages, accept the entreaties of sinners who pray for salvation; and give us mild weather, and grant the earth to produce good crops, since You are benevolent. Be an ally of our faithful leaders, as You once were of David, against ungodly enemies; for they have invaded Your dwellings and defiled the Holy Land, O Savior. We pray You grant the victory, O Christ our God, at the intercession of the Theotokos; for You are the victory of the Orthodox, and our pride and joy.
ltx/en_us_dedes/me.m09.d01:meVE.AposGlory.incipit	@ltx/en_us_dedes/me.m09.d01:meVE.Stichera04.incipit
ltx/en_us_dedes/me.m09.d01:meVE.AposGlory.melody	
ltx/en_us_dedes/me.m09.d01:meVE.AposGlory.mode	@ltx/en_us_dedes/miscellanea:misc.Mode5
ltx/en_us_dedes/me.m09.d01:meVE.AposGlory.text	@ltx/en_us_dedes/me.m09.d01:meVE.Stichera04.text
ltx/en_us_dedes/me.m09.d01:meVE.Aposticha1.incipit	It is the first day…
ltx/en_us_dedes/me.m09.d01:meVE.Aposticha1.melody	@ltx/en_us_dedes/miscellanea:misc.Idiomelon
ltx/en_us_dedes/me.m09.d01:meVE.Aposticha1.mode	@ltx/en_us_dedes/miscellanea:misc.Mode1
ltx/en_us_dedes/me.m09.d01:meVE.Aposticha1.poet	@ltx/en_us_dedes/poets:po.IoannouMonachou
ltx/en_us_dedes/me.m09.d01:meVE.Aposticha1.text	It is the first day of the ecclesiastical year. It invites us to honor those who make it splendid: Callista, Evodos, and Hermogenes, those siblings and martyrs; Symeon, that peer of the angels; Joshua, the son of Nun; the Seven Young Men of Ephesus; and that chorus of Forty Holy Women. As we commemorate them all together, O fans of the Church’s feasts, let us sing with gusto and also pray, “O Lord, bless the works of Your hands, and grant that we may spend the time of the coming year advantageously.”
ltx/en_us_dedes/me.m09.d01:meVE.Aposticha2.incipit	…
ltx/en_us_dedes/me.m09.d01:meVE.Aposticha2.melody	@ltx/en_us_dedes/miscellanea:misc.Idiomelon
ltx/en_us_dedes/me.m09.d01:meVE.Aposticha2.mode	@ltx/en_us_dedes/miscellanea:misc.Mode1
ltx/en_us_dedes/me.m09.d01:meVE.Aposticha2.poet	@ltx/en_us_dedes/poets:po.IoannouMonachou
ltx/en_us_dedes/me.m09.d01:meVE.Aposticha2.text	
ltx/en_us_dedes/me.m09.d01:meVE.Aposticha3.incipit	…
ltx/en_us_dedes/me.m09.d01:meVE.Aposticha3.melody	@ltx/en_us_dedes/miscellanea:misc.Idiomelon
ltx/en_us_dedes/me.m09.d01:meVE.Aposticha3.mode	@ltx/en_us_dedes/miscellanea:misc.Mode2
ltx/en_us_dedes/me.m09.d01:meVE.Aposticha3.poet	@ltx/en_us_dedes/poets:po.Kyprianou
ltx/en_us_dedes/me.m09.d01:meVE.Aposticha3.text	
ltx/en_us_dedes/me.m09.d01:meVE.Aposticha4.incipit	You created all things with…
ltx/en_us_dedes/me.m09.d01:meVE.Aposticha4.melody	@ltx/en_us_dedes/miscellanea:misc.Idiomelon
ltx/en_us_dedes/me.m09.d01:meVE.Aposticha4.mode	@ltx/en_us_dedes/miscellanea:misc.Mode2
ltx/en_us_dedes/me.m09.d01:meVE.Aposticha4.poet	@ltx/en_us_dedes/poets:po.IoannouMonachou
ltx/en_us_dedes/me.m09.d01:meVE.Aposticha4.text	You created all things with wisdom, O pre-eternal Logos of the Father, and You established the entire creation by Your all-powerful word. Bless the crown of the year with Your goodness, and suppress heresies, through the Theotokos, as You are good and benevolent.
ltx/en_us_dedes/me.m09.d01:meVE.GeneralApolytikion2.melody	@ltx/en_us_dedes/he.ga:heGA.YpomonisStylos.name
ltx/en_us_dedes/me.m09.d01:meVE.GeneralApolytikion2.mode	@ltx/en_us_dedes/miscellanea:misc.Mode1
ltx/en_us_dedes/me.m09.d01:meVE.GeneralApolytikion2.name	Symeon,
ltx/en_us_dedes/me.m09.d01:meVE.MM.GeneralApolytikion2.text	@ltx/en_us_dedes/properties:media.key
ltx/en_us_dedes/me.m09.d01:meVE.MM.Stichera123as567.text	@ltx/en_us_dedes/properties:media.key
ltx/en_us_dedes/me.m09.d01:meVE.MM.Stichera456as456.text	@ltx/en_us_dedes/properties:media.key
ltx/en_us_dedes/me.m09.d01:meVE.MM.Stichera456as8910.text	@ltx/en_us_dedes/properties:media.key
ltx/en_us_dedes/me.m09.d01:meVE.SticBoth.incipit	…
ltx/en_us_dedes/me.m09.d01:meVE.SticBoth.melody	@ltx/en_us_dedes/miscellanea:misc.Idiomelon
ltx/en_us_dedes/me.m09.d01:meVE.SticBoth.mode	@ltx/en_us_dedes/miscellanea:misc.Mode6
ltx/en_us_dedes/me.m09.d01:meVE.SticBoth.poet	@ltx/en_us_dedes/poets:po.Vyzantiou
ltx/en_us_dedes/me.m09.d01:meVE.SticBoth.text	
ltx/en_us_dedes/me.m09.d01:meVE.SticGlory.incipit	…
ltx/en_us_dedes/me.m09.d01:meVE.SticGlory.melody	@ltx/en_us_dedes/miscellanea:misc.Idiomelon
ltx/en_us_dedes/me.m09.d01:meVE.SticGlory.mode	@ltx/en_us_dedes/miscellanea:misc.Mode6
ltx/en_us_dedes/me.m09.d01:meVE.SticGlory.poet	@ltx/en_us_dedes/poets:po.Germanou
ltx/en_us_dedes/me.m09.d01:meVE.SticGlory.text	
ltx/en_us_dedes/me.m09.d01:meVE.Stichera01.greekmelody	@ltx/en_us_dedes/he.a.m1:heAU.TonOuranionTagmaton.greekname
ltx/en_us_dedes/me.m09.d01:meVE.Stichera01.incipit	Since we have all learned…
ltx/en_us_dedes/me.m09.d01:meVE.Stichera01.melody	@ltx/en_us_dedes/he.a.m1:heAU.TonOuranionTagmaton.name
ltx/en_us_dedes/me.m09.d01:meVE.Stichera01.mode	@ltx/en_us_dedes/miscellanea:misc.Mode1
ltx/en_us_dedes/me.m09.d01:meVE.Stichera01.text	Since we have all learned the Lord’s prayer, which Christ himself taught us, * let us recite it daily * to our God and Creator, * and pray out loud with fervor: Our Father who art * in the heavens, Thy kingdom come. * Thy will be done. Give us this day our daily bread, * and forgive us all our trespasses.
ltx/en_us_dedes/me.m09.d01:meVE.Stichera02.incipit	Of old, O Master of…
ltx/en_us_dedes/me.m09.d01:meVE.Stichera02.melody	@ltx/en_us_dedes/he.a.m1:heAU.TonOuranionTagmaton.name
ltx/en_us_dedes/me.m09.d01:meVE.Stichera02.mode	@ltx/en_us_dedes/miscellanea:misc.Mode1
ltx/en_us_dedes/me.m09.d01:meVE.Stichera02.text	Of old, O Master of all things, there in the wilderness, * when the ungrateful Hebrews * disobeyed You, then rightly * they were overthrown and their bodies fell. * Likewise, O Christ, now scatter the bones * of disbelieving and impious Hagarenes * next to Hades, as the Psalmist said.
ltx/en_us_dedes/me.m09.d01:meVE.Stichera03.incipit	O Christ our God, on…
ltx/en_us_dedes/me.m09.d01:meVE.Stichera03.melody	@ltx/en_us_dedes/he.a.m1:heAU.TonOuranionTagmaton.name
ltx/en_us_dedes/me.m09.d01:meVE.Stichera03.mode	@ltx/en_us_dedes/miscellanea:misc.Mode1
ltx/en_us_dedes/me.m09.d01:meVE.Stichera03.text	O Christ our God, on Mt. Sinai You wrote the tablets of old. * And now You came incarnate, * and You went to the city * of Nazareth, O Lord, and accepted to read * from the book of the Prophecies. * And then you closed it and said to the people there, * that the Scripture is fulfilled in You.
ltx/en_us_dedes/me.m09.d01:meVE.Stichera04.greekmelody	@ltx/en_us_dedes/he.a.m5:heAU.OsiePater.greekname
ltx/en_us_dedes/me.m09.d01:meVE.Stichera04.incipit	…
ltx/en_us_dedes/me.m09.d01:meVE.Stichera04.melody	@ltx/en_us_dedes/he.a.m5:heAU.OsiePater.name
ltx/en_us_dedes/me.m09.d01:meVE.Stichera04.mode	@ltx/en_us_dedes/miscellanea:misc.Mode5
ltx/en_us_dedes/me.m09.d01:meVE.Stichera04.text	
ltx/en_us_dedes/me.m09.d01:meVE.Stichera05.incipit	…
ltx/en_us_dedes/me.m09.d01:meVE.Stichera05.melody	@ltx/en_us_dedes/he.a.m5:heAU.OsiePater.name
ltx/en_us_dedes/me.m09.d01:meVE.Stichera05.mode	@ltx/en_us_dedes/miscellanea:misc.Mode5
ltx/en_us_dedes/me.m09.d01:meVE.Stichera05.text	
ltx/en_us_dedes/me.m09.d01:meVE.Stichera06.incipit	…
ltx/en_us_dedes/me.m09.d01:meVE.Stichera06.melody	@ltx/en_us_dedes/he.a.m5:heAU.OsiePater.name
ltx/en_us_dedes/me.m09.d01:meVE.Stichera06.mode	@ltx/en_us_dedes/miscellanea:misc.Mode5
ltx/en_us_dedes/me.m09.d01:meVE.Stichera06.text	
ltx/en_us_dedes/me.m09.d01:meVE.Stichera07.incipit	A good root produced a…
ltx/en_us_dedes/me.m09.d01:meVE.Stichera07.melody	@ltx/en_us_dedes/miscellanea:misc.Idiomelon
ltx/en_us_dedes/me.m09.d01:meVE.Stichera07.mode	@ltx/en_us_dedes/miscellanea:misc.Mode2
ltx/en_us_dedes/me.m09.d01:meVE.Stichera07.text	A good root produced a good fruit, namely Symeon, who was sacred from birth, nursed with grace more than with milk. He lifted his body on a boulder, and his mind to God even higher. With virtues he built a house in the sky, and floating along with the heavenly Hosts, he became a dwelling place of Christ, our God and the Savior of our souls.
ltx/en_us_dedes/me.m09.d01:meVE.Stichera08.incipit	…
ltx/en_us_dedes/me.m09.d01:meVE.Stichera08.melody	@ltx/en_us_dedes/miscellanea:misc.Idiomelon
ltx/en_us_dedes/me.m09.d01:meVE.Stichera08.mode	@ltx/en_us_dedes/miscellanea:misc.Mode2
ltx/en_us_dedes/me.m09.d01:meVE.Stichera08.text	
ltx/en_us_dedes/me.m09.d01:meVE.Stichera09.incipit	…
ltx/en_us_dedes/me.m09.d01:meVE.Stichera09.melody	@ltx/en_us_dedes/miscellanea:misc.Idiomelon
ltx/en_us_dedes/me.m09.d01:meVE.Stichera09.mode	@ltx/en_us_dedes/miscellanea:misc.Mode2
ltx/en_us_dedes/me.m09.d01:meVE.Stichera09.poet	@ltx/en_us_dedes/poets:po.Kyprianou
ltx/en_us_dedes/me.m09.d01:meVE.Stichera09.text	
ltx/en_us_dedes/me.m09.d01:meVE.Stichera10.incipit	…
ltx/en_us_dedes/me.m09.d01:meVE.Stichera10.melody	@ltx/en_us_dedes/miscellanea:misc.Idiomelon
ltx/en_us_dedes/me.m09.d01:meVE.Stichera10.mode	@ltx/en_us_dedes/miscellanea:misc.Mode2
ltx/en_us_dedes/me.m09.d01:meVE.Stichera10.poet	@ltx/en_us_dedes/poets:po.Germanou
ltx/en_us_dedes/me.m09.d01:meVE.Stichera10.text	
