ltx/en_us_dedes/tr.d028:trCA.Kontakion.incipit	@ltx/en_us_dedes/tr.d028:trMA.Kontakion1.incipit
ltx/en_us_dedes/tr.d028:trCA.Kontakion.melody	
ltx/en_us_dedes/tr.d028:trCA.Kontakion.mode	@ltx/en_us_dedes/miscellanea:misc.Mode8
ltx/en_us_dedes/tr.d028:trCA.Kontakion.text	@ltx/en_us_dedes/tr.d028:trMA.Kontakion1.text
ltx/en_us_dedes/tr.d028:trCA.Ode11.incipit	…
ltx/en_us_dedes/tr.d028:trCA.Ode11.melody	@ltx/en_us_dedes/he.h.m8:heHE.YgranDiodefsas.name
ltx/en_us_dedes/tr.d028:trCA.Ode11.mode	@ltx/en_us_dedes/miscellanea:misc.Mode8
ltx/en_us_dedes/tr.d028:trCA.Ode11.ode	@ltx/en_us_dedes/miscellanea:misc.Ode1
ltx/en_us_dedes/tr.d028:trCA.Ode11.text	
ltx/en_us_dedes/tr.d028:trCA.Ode12.incipit	…
ltx/en_us_dedes/tr.d028:trCA.Ode12.melody	@ltx/en_us_dedes/he.h.m8:heHE.YgranDiodefsas.name
ltx/en_us_dedes/tr.d028:trCA.Ode12.mode	@ltx/en_us_dedes/miscellanea:misc.Mode8
ltx/en_us_dedes/tr.d028:trCA.Ode12.ode	@ltx/en_us_dedes/miscellanea:misc.Ode1
ltx/en_us_dedes/tr.d028:trCA.Ode12.text	
ltx/en_us_dedes/tr.d028:trCA.Ode13.incipit	…
ltx/en_us_dedes/tr.d028:trCA.Ode13.melody	@ltx/en_us_dedes/he.h.m8:heHE.YgranDiodefsas.name
ltx/en_us_dedes/tr.d028:trCA.Ode13.mode	@ltx/en_us_dedes/miscellanea:misc.Mode8
ltx/en_us_dedes/tr.d028:trCA.Ode13.ode	@ltx/en_us_dedes/miscellanea:misc.Ode1
ltx/en_us_dedes/tr.d028:trCA.Ode13.text	
ltx/en_us_dedes/tr.d028:trCA.Ode1T.incipit	…
ltx/en_us_dedes/tr.d028:trCA.Ode1T.melody	@ltx/en_us_dedes/he.h.m8:heHE.YgranDiodefsas.name
ltx/en_us_dedes/tr.d028:trCA.Ode1T.mode	@ltx/en_us_dedes/miscellanea:misc.Mode8
ltx/en_us_dedes/tr.d028:trCA.Ode1T.ode	@ltx/en_us_dedes/miscellanea:misc.Ode1
ltx/en_us_dedes/tr.d028:trCA.Ode1T.text	
ltx/en_us_dedes/tr.d028:trCA.Ode31.incipit	…
ltx/en_us_dedes/tr.d028:trCA.Ode31.melody	@ltx/en_us_dedes/he.h.m8:heHE.SyEiToStereoma.name
ltx/en_us_dedes/tr.d028:trCA.Ode31.mode	@ltx/en_us_dedes/miscellanea:misc.Mode8
ltx/en_us_dedes/tr.d028:trCA.Ode31.ode	@ltx/en_us_dedes/miscellanea:misc.Ode3
ltx/en_us_dedes/tr.d028:trCA.Ode31.text	
ltx/en_us_dedes/tr.d028:trCA.Ode32.incipit	…
ltx/en_us_dedes/tr.d028:trCA.Ode32.melody	@ltx/en_us_dedes/he.h.m8:heHE.SyEiToStereoma.name
ltx/en_us_dedes/tr.d028:trCA.Ode32.mode	@ltx/en_us_dedes/miscellanea:misc.Mode8
ltx/en_us_dedes/tr.d028:trCA.Ode32.ode	@ltx/en_us_dedes/miscellanea:misc.Ode3
ltx/en_us_dedes/tr.d028:trCA.Ode32.text	
ltx/en_us_dedes/tr.d028:trCA.Ode33.incipit	…
ltx/en_us_dedes/tr.d028:trCA.Ode33.melody	@ltx/en_us_dedes/he.h.m8:heHE.SyEiToStereoma.name
ltx/en_us_dedes/tr.d028:trCA.Ode33.mode	@ltx/en_us_dedes/miscellanea:misc.Mode8
ltx/en_us_dedes/tr.d028:trCA.Ode33.ode	@ltx/en_us_dedes/miscellanea:misc.Ode3
ltx/en_us_dedes/tr.d028:trCA.Ode33.text	
ltx/en_us_dedes/tr.d028:trCA.Ode3T.incipit	…
ltx/en_us_dedes/tr.d028:trCA.Ode3T.melody	@ltx/en_us_dedes/he.h.m8:heHE.SyEiToStereoma.name
ltx/en_us_dedes/tr.d028:trCA.Ode3T.mode	@ltx/en_us_dedes/miscellanea:misc.Mode8
ltx/en_us_dedes/tr.d028:trCA.Ode3T.ode	@ltx/en_us_dedes/miscellanea:misc.Ode3
ltx/en_us_dedes/tr.d028:trCA.Ode3T.text	
ltx/en_us_dedes/tr.d028:trCA.Ode41.incipit	…
ltx/en_us_dedes/tr.d028:trCA.Ode41.melody	@ltx/en_us_dedes/he.h.m8:heHE.EisakikoaKyrie.name
ltx/en_us_dedes/tr.d028:trCA.Ode41.mode	@ltx/en_us_dedes/miscellanea:misc.Mode8
ltx/en_us_dedes/tr.d028:trCA.Ode41.ode	@ltx/en_us_dedes/miscellanea:misc.Ode4
ltx/en_us_dedes/tr.d028:trCA.Ode41.text	
ltx/en_us_dedes/tr.d028:trCA.Ode42.incipit	…
ltx/en_us_dedes/tr.d028:trCA.Ode42.melody	@ltx/en_us_dedes/he.h.m8:heHE.EisakikoaKyrie.name
ltx/en_us_dedes/tr.d028:trCA.Ode42.mode	@ltx/en_us_dedes/miscellanea:misc.Mode8
ltx/en_us_dedes/tr.d028:trCA.Ode42.ode	@ltx/en_us_dedes/miscellanea:misc.Ode4
ltx/en_us_dedes/tr.d028:trCA.Ode42.text	
ltx/en_us_dedes/tr.d028:trCA.Ode43.incipit	…
ltx/en_us_dedes/tr.d028:trCA.Ode43.melody	@ltx/en_us_dedes/he.h.m8:heHE.EisakikoaKyrie.name
ltx/en_us_dedes/tr.d028:trCA.Ode43.mode	@ltx/en_us_dedes/miscellanea:misc.Mode8
ltx/en_us_dedes/tr.d028:trCA.Ode43.ode	@ltx/en_us_dedes/miscellanea:misc.Ode4
ltx/en_us_dedes/tr.d028:trCA.Ode43.text	
ltx/en_us_dedes/tr.d028:trCA.Ode4T.incipit	…
ltx/en_us_dedes/tr.d028:trCA.Ode4T.melody	@ltx/en_us_dedes/he.h.m8:heHE.EisakikoaKyrie.name
ltx/en_us_dedes/tr.d028:trCA.Ode4T.mode	@ltx/en_us_dedes/miscellanea:misc.Mode8
ltx/en_us_dedes/tr.d028:trCA.Ode4T.ode	@ltx/en_us_dedes/miscellanea:misc.Ode4
ltx/en_us_dedes/tr.d028:trCA.Ode4T.text	
ltx/en_us_dedes/tr.d028:trCA.Ode51.incipit	…
ltx/en_us_dedes/tr.d028:trCA.Ode51.melody	@ltx/en_us_dedes/he.h.m8:heHE.OrthrizontesVoomenSoi.name
ltx/en_us_dedes/tr.d028:trCA.Ode51.mode	@ltx/en_us_dedes/miscellanea:misc.Mode8
ltx/en_us_dedes/tr.d028:trCA.Ode51.ode	@ltx/en_us_dedes/miscellanea:misc.Ode5
ltx/en_us_dedes/tr.d028:trCA.Ode51.text	
ltx/en_us_dedes/tr.d028:trCA.Ode52.incipit	…
ltx/en_us_dedes/tr.d028:trCA.Ode52.melody	@ltx/en_us_dedes/he.h.m8:heHE.OrthrizontesVoomenSoi.name
ltx/en_us_dedes/tr.d028:trCA.Ode52.mode	@ltx/en_us_dedes/miscellanea:misc.Mode8
ltx/en_us_dedes/tr.d028:trCA.Ode52.ode	@ltx/en_us_dedes/miscellanea:misc.Ode5
ltx/en_us_dedes/tr.d028:trCA.Ode52.text	
ltx/en_us_dedes/tr.d028:trCA.Ode53.incipit	…
ltx/en_us_dedes/tr.d028:trCA.Ode53.melody	@ltx/en_us_dedes/he.h.m8:heHE.OrthrizontesVoomenSoi.name
ltx/en_us_dedes/tr.d028:trCA.Ode53.mode	@ltx/en_us_dedes/miscellanea:misc.Mode8
ltx/en_us_dedes/tr.d028:trCA.Ode53.ode	@ltx/en_us_dedes/miscellanea:misc.Ode5
ltx/en_us_dedes/tr.d028:trCA.Ode53.text	
ltx/en_us_dedes/tr.d028:trCA.Ode5T.incipit	…
ltx/en_us_dedes/tr.d028:trCA.Ode5T.melody	@ltx/en_us_dedes/he.h.m8:heHE.OrthrizontesVoomenSoi.name
ltx/en_us_dedes/tr.d028:trCA.Ode5T.mode	@ltx/en_us_dedes/miscellanea:misc.Mode8
ltx/en_us_dedes/tr.d028:trCA.Ode5T.ode	@ltx/en_us_dedes/miscellanea:misc.Ode5
ltx/en_us_dedes/tr.d028:trCA.Ode5T.text	
ltx/en_us_dedes/tr.d028:trCA.Ode61.incipit	…
ltx/en_us_dedes/tr.d028:trCA.Ode61.melody	@ltx/en_us_dedes/he.h.m8:heHE.IlasthitiMoiSotir.name
ltx/en_us_dedes/tr.d028:trCA.Ode61.mode	@ltx/en_us_dedes/miscellanea:misc.Mode8
ltx/en_us_dedes/tr.d028:trCA.Ode61.ode	@ltx/en_us_dedes/miscellanea:misc.Ode6
ltx/en_us_dedes/tr.d028:trCA.Ode61.text	
ltx/en_us_dedes/tr.d028:trCA.Ode62.incipit	…
ltx/en_us_dedes/tr.d028:trCA.Ode62.melody	@ltx/en_us_dedes/he.h.m8:heHE.IlasthitiMoiSotir.name
ltx/en_us_dedes/tr.d028:trCA.Ode62.mode	@ltx/en_us_dedes/miscellanea:misc.Mode8
ltx/en_us_dedes/tr.d028:trCA.Ode62.ode	@ltx/en_us_dedes/miscellanea:misc.Ode6
ltx/en_us_dedes/tr.d028:trCA.Ode62.text	
ltx/en_us_dedes/tr.d028:trCA.Ode6T.incipit	…
ltx/en_us_dedes/tr.d028:trCA.Ode6T.melody	@ltx/en_us_dedes/he.h.m8:heHE.IlasthitiMoiSotir.name
ltx/en_us_dedes/tr.d028:trCA.Ode6T.mode	@ltx/en_us_dedes/miscellanea:misc.Mode8
ltx/en_us_dedes/tr.d028:trCA.Ode6T.ode	@ltx/en_us_dedes/miscellanea:misc.Ode6
ltx/en_us_dedes/tr.d028:trCA.Ode6T.text	
ltx/en_us_dedes/tr.d028:trCA.Ode71.incipit	…
ltx/en_us_dedes/tr.d028:trCA.Ode71.melody	@ltx/en_us_dedes/he.h.m8:heHE.OiEkTisIoudaias.name
ltx/en_us_dedes/tr.d028:trCA.Ode71.mode	@ltx/en_us_dedes/miscellanea:misc.Mode8
ltx/en_us_dedes/tr.d028:trCA.Ode71.ode	@ltx/en_us_dedes/miscellanea:misc.Ode7
ltx/en_us_dedes/tr.d028:trCA.Ode71.text	
ltx/en_us_dedes/tr.d028:trCA.Ode72.incipit	…
ltx/en_us_dedes/tr.d028:trCA.Ode72.melody	@ltx/en_us_dedes/he.h.m8:heHE.OiEkTisIoudaias.name
ltx/en_us_dedes/tr.d028:trCA.Ode72.mode	@ltx/en_us_dedes/miscellanea:misc.Mode8
ltx/en_us_dedes/tr.d028:trCA.Ode72.ode	@ltx/en_us_dedes/miscellanea:misc.Ode7
ltx/en_us_dedes/tr.d028:trCA.Ode72.text	
ltx/en_us_dedes/tr.d028:trCA.Ode73.incipit	…
ltx/en_us_dedes/tr.d028:trCA.Ode73.melody	@ltx/en_us_dedes/he.h.m8:heHE.OiEkTisIoudaias.name
ltx/en_us_dedes/tr.d028:trCA.Ode73.mode	@ltx/en_us_dedes/miscellanea:misc.Mode8
ltx/en_us_dedes/tr.d028:trCA.Ode73.ode	@ltx/en_us_dedes/miscellanea:misc.Ode7
ltx/en_us_dedes/tr.d028:trCA.Ode73.text	
ltx/en_us_dedes/tr.d028:trCA.Ode7T.incipit	…
ltx/en_us_dedes/tr.d028:trCA.Ode7T.melody	@ltx/en_us_dedes/he.h.m8:heHE.OiEkTisIoudaias.name
ltx/en_us_dedes/tr.d028:trCA.Ode7T.mode	@ltx/en_us_dedes/miscellanea:misc.Mode8
ltx/en_us_dedes/tr.d028:trCA.Ode7T.ode	@ltx/en_us_dedes/miscellanea:misc.Ode7
ltx/en_us_dedes/tr.d028:trCA.Ode7T.text	
ltx/en_us_dedes/tr.d028:trCA.Ode7Tr.incipit	…
ltx/en_us_dedes/tr.d028:trCA.Ode7Tr.melody	@ltx/en_us_dedes/he.h.m8:heHE.OiEkTisIoudaias.name
ltx/en_us_dedes/tr.d028:trCA.Ode7Tr.mode	@ltx/en_us_dedes/miscellanea:misc.Mode8
ltx/en_us_dedes/tr.d028:trCA.Ode7Tr.ode	@ltx/en_us_dedes/miscellanea:misc.Ode7
ltx/en_us_dedes/tr.d028:trCA.Ode7Tr.text	
ltx/en_us_dedes/tr.d028:trCA.Ode81.incipit	…
ltx/en_us_dedes/tr.d028:trCA.Ode81.melody	@ltx/en_us_dedes/he.h.m8:heHE.EptaplasiosKaminon.name
ltx/en_us_dedes/tr.d028:trCA.Ode81.mode	@ltx/en_us_dedes/miscellanea:misc.Mode8
ltx/en_us_dedes/tr.d028:trCA.Ode81.ode	@ltx/en_us_dedes/miscellanea:misc.Ode8
ltx/en_us_dedes/tr.d028:trCA.Ode81.text	
ltx/en_us_dedes/tr.d028:trCA.Ode82.incipit	…
ltx/en_us_dedes/tr.d028:trCA.Ode82.melody	@ltx/en_us_dedes/he.h.m8:heHE.EptaplasiosKaminon.name
ltx/en_us_dedes/tr.d028:trCA.Ode82.mode	@ltx/en_us_dedes/miscellanea:misc.Mode8
ltx/en_us_dedes/tr.d028:trCA.Ode82.ode	@ltx/en_us_dedes/miscellanea:misc.Ode8
ltx/en_us_dedes/tr.d028:trCA.Ode82.text	
ltx/en_us_dedes/tr.d028:trCA.Ode83.incipit	…
ltx/en_us_dedes/tr.d028:trCA.Ode83.melody	@ltx/en_us_dedes/he.h.m8:heHE.EptaplasiosKaminon.name
ltx/en_us_dedes/tr.d028:trCA.Ode83.mode	@ltx/en_us_dedes/miscellanea:misc.Mode8
ltx/en_us_dedes/tr.d028:trCA.Ode83.ode	@ltx/en_us_dedes/miscellanea:misc.Ode8
ltx/en_us_dedes/tr.d028:trCA.Ode83.text	
ltx/en_us_dedes/tr.d028:trCA.Ode8T.incipit	…
ltx/en_us_dedes/tr.d028:trCA.Ode8T.melody	@ltx/en_us_dedes/he.h.m8:heHE.EptaplasiosKaminon.name
ltx/en_us_dedes/tr.d028:trCA.Ode8T.mode	@ltx/en_us_dedes/miscellanea:misc.Mode8
ltx/en_us_dedes/tr.d028:trCA.Ode8T.ode	@ltx/en_us_dedes/miscellanea:misc.Ode8
ltx/en_us_dedes/tr.d028:trCA.Ode8T.text	
ltx/en_us_dedes/tr.d028:trCA.Ode91.incipit	…
ltx/en_us_dedes/tr.d028:trCA.Ode91.melody	@ltx/en_us_dedes/he.h.m8:heHE.SeTinApeirogamon.name
ltx/en_us_dedes/tr.d028:trCA.Ode91.mode	@ltx/en_us_dedes/miscellanea:misc.Mode8
ltx/en_us_dedes/tr.d028:trCA.Ode91.ode	@ltx/en_us_dedes/miscellanea:misc.Ode9
ltx/en_us_dedes/tr.d028:trCA.Ode91.text	
ltx/en_us_dedes/tr.d028:trCA.Ode92.incipit	…
ltx/en_us_dedes/tr.d028:trCA.Ode92.melody	@ltx/en_us_dedes/he.h.m8:heHE.SeTinApeirogamon.name
ltx/en_us_dedes/tr.d028:trCA.Ode92.mode	@ltx/en_us_dedes/miscellanea:misc.Mode8
ltx/en_us_dedes/tr.d028:trCA.Ode92.ode	@ltx/en_us_dedes/miscellanea:misc.Ode9
ltx/en_us_dedes/tr.d028:trCA.Ode92.text	
ltx/en_us_dedes/tr.d028:trCA.Ode9H.incipit	@ltx/en_us_dedes/he.h.m8:heHE.SeTinApeirogamon.incipit
ltx/en_us_dedes/tr.d028:trCA.Ode9H.melody	@ltx/en_us_dedes/he.h.m8:heHE.SeTinApeirogamon.melody
ltx/en_us_dedes/tr.d028:trCA.Ode9H.mode	@ltx/en_us_dedes/miscellanea:misc.Mode8
ltx/en_us_dedes/tr.d028:trCA.Ode9H.ode	@ltx/en_us_dedes/miscellanea:misc.Ode9
ltx/en_us_dedes/tr.d028:trCA.Ode9H.text	@ltx/en_us_dedes/he.h.m8:heHE.SeTinApeirogamon.text
ltx/en_us_dedes/tr.d028:trCA.Ode9T.incipit	…
ltx/en_us_dedes/tr.d028:trCA.Ode9T.melody	@ltx/en_us_dedes/he.h.m8:heHE.SeTinApeirogamon.name
ltx/en_us_dedes/tr.d028:trCA.Ode9T.mode	@ltx/en_us_dedes/miscellanea:misc.Mode8
ltx/en_us_dedes/tr.d028:trCA.Ode9T.ode	@ltx/en_us_dedes/miscellanea:misc.Ode9
ltx/en_us_dedes/tr.d028:trCA.Ode9T.text	
ltx/en_us_dedes/tr.d028:trCA.Ode9Tr.incipit	…
ltx/en_us_dedes/tr.d028:trCA.Ode9Tr.melody	@ltx/en_us_dedes/he.h.m8:heHE.SeTinApeirogamon.name
ltx/en_us_dedes/tr.d028:trCA.Ode9Tr.mode	@ltx/en_us_dedes/miscellanea:misc.Mode8
ltx/en_us_dedes/tr.d028:trCA.Ode9Tr.ode	@ltx/en_us_dedes/miscellanea:misc.Ode9
ltx/en_us_dedes/tr.d028:trCA.Ode9Tr.text	
ltx/en_us_dedes/tr.d028:trCA.Troparion1.incipit	@ltx/en_us_dedes/tr.d028:trVE.Apolytikion1.incipit
ltx/en_us_dedes/tr.d028:trCA.Troparion1.melody	
ltx/en_us_dedes/tr.d028:trCA.Troparion1.mode	@ltx/en_us_dedes/miscellanea:misc.Mode2
ltx/en_us_dedes/tr.d028:trCA.Troparion1.text	@ltx/en_us_dedes/tr.d028:trVE.Apolytikion1.text
ltx/en_us_dedes/tr.d028:trCA.Troparion2.incipit	@ltx/en_us_dedes/tr.d028:trMA.Kontakion1.incipit
ltx/en_us_dedes/tr.d028:trCA.Troparion2.melody	
ltx/en_us_dedes/tr.d028:trCA.Troparion2.mode	@ltx/en_us_dedes/miscellanea:misc.Mode8
ltx/en_us_dedes/tr.d028:trCA.Troparion2.text	@ltx/en_us_dedes/tr.d028:trMA.Kontakion1.text
ltx/en_us_dedes/tr.d028:trCA.Troparion3.incipit	…
ltx/en_us_dedes/tr.d028:trCA.Troparion3.melody	
ltx/en_us_dedes/tr.d028:trCA.Troparion3.mode	@ltx/en_us_dedes/miscellanea:misc.Mode8
ltx/en_us_dedes/tr.d028:trCA.Troparion3.text	
ltx/en_us_dedes/tr.d028:trCA.acrostic.notice1	
ltx/en_us_dedes/tr.d028:trCA.acrostic.text	
ltx/en_us_dedes/tr.d028:trCA.acrostic.title	
ltx/en_us_dedes/tr.d028:trCA.poet	@ltx/en_us_dedes/poets:po.IoannouTouDamaskinou
ltx/en_us_dedes/tr.d028:trCA.verse	@ltx/en_us_dedes/prayers:pr.verse_SaintM.text
ltx/en_us_dedes/tr.d028:trCO.header	(Small) with Salutations
ltx/en_us_dedes/tr.d028:trDA.commemoration.full	Memory of the Kolyva Miracle of the Holy Great-martyr Theodore the Recruit
ltx/en_us_dedes/tr.d028:trDA.commemoration.short	St. Theodore the Recruit and the Kolyva Miracle.
ltx/en_us_dedes/tr.d028:trDA.insert1	the Holy Great-martyr Theodore the Recruit,
ltx/en_us_dedes/tr.d028:trDA.insert2	whose miracle of the kolyva we celebrate;
ltx/en_us_dedes/tr.d028:trDA.note	
ltx/en_us_dedes/tr.d028:trDA.title	@ltx/en_us_dedes/titles:ti.SaintM
ltx/en_us_dedes/tr.d028:trHO.commemorations	
ltx/en_us_dedes/tr.d028:trHO.daytitle	
ltx/en_us_dedes/tr.d028:trHO.description1	
ltx/en_us_dedes/tr.d028:trHO.description2	
ltx/en_us_dedes/tr.d028:trHO.note1	
ltx/en_us_dedes/tr.d028:trHO.note2	
ltx/en_us_dedes/tr.d028:trLI.MM.CommunionHymn.text	@ltx/en_us_dedes/properties:media.key
ltx/en_us_dedes/tr.d028:trLI.Megalynarion.text	
ltx/en_us_dedes/tr.d028:trMA.AposGlory.incipit	…
ltx/en_us_dedes/tr.d028:trMA.AposGlory.melody	@ltx/en_us_dedes/miscellanea:misc.Idiomelon
ltx/en_us_dedes/tr.d028:trMA.AposGlory.mode	@ltx/en_us_dedes/miscellanea:misc.Mode8
ltx/en_us_dedes/tr.d028:trMA.AposGlory.text	
ltx/en_us_dedes/tr.d028:trMA.AposTheotokion.incipit	@ltx/en_us_dedes/oc.m8.d5:ocMA.AposTheotokion.incipit
ltx/en_us_dedes/tr.d028:trMA.AposTheotokion.melody	
ltx/en_us_dedes/tr.d028:trMA.AposTheotokion.mode	@ltx/en_us_dedes/miscellanea:misc.Mode8
ltx/en_us_dedes/tr.d028:trMA.AposTheotokion.text	@ltx/en_us_dedes/oc.m8.d5:ocMA.AposTheotokion.text
ltx/en_us_dedes/tr.d028:trMA.Aposticha1.incipit	…
ltx/en_us_dedes/tr.d028:trMA.Aposticha1.melody	@ltx/en_us_dedes/miscellanea:misc.Idiomelon
ltx/en_us_dedes/tr.d028:trMA.Aposticha1.mode	@ltx/en_us_dedes/miscellanea:misc.Mode3
ltx/en_us_dedes/tr.d028:trMA.Aposticha1.text	
ltx/en_us_dedes/tr.d028:trMA.Aposticha2.incipit	…
ltx/en_us_dedes/tr.d028:trMA.Aposticha2.melody	@ltx/en_us_dedes/miscellanea:misc.Idiomelon
ltx/en_us_dedes/tr.d028:trMA.Aposticha2.mode	@ltx/en_us_dedes/miscellanea:misc.Mode3
ltx/en_us_dedes/tr.d028:trMA.Aposticha2.text	
ltx/en_us_dedes/tr.d028:trMA.Aposticha3.incipit	…
ltx/en_us_dedes/tr.d028:trMA.Aposticha3.melody	@ltx/en_us_dedes/miscellanea:misc.Idiomelon
ltx/en_us_dedes/tr.d028:trMA.Aposticha3.mode	@ltx/en_us_dedes/miscellanea:misc.Mode3
ltx/en_us_dedes/tr.d028:trMA.Aposticha3.text	
ltx/en_us_dedes/tr.d028:trMA.C1.acrostic.notice1	
ltx/en_us_dedes/tr.d028:trMA.C1.acrostic.notice2	
ltx/en_us_dedes/tr.d028:trMA.C1.acrostic.text	
ltx/en_us_dedes/tr.d028:trMA.C1.acrostic.title	
ltx/en_us_dedes/tr.d028:trMA.C1.poet	@ltx/en_us_dedes/poets:po.IoannouEfchaiton
ltx/en_us_dedes/tr.d028:trMA.C1.title	@ltx/en_us_dedes/titles:ti.Canon1SaintM
ltx/en_us_dedes/tr.d028:trMA.C1.verse	@ltx/en_us_dedes/prayers:pr.verse_SaintM.text
ltx/en_us_dedes/tr.d028:trMA.C2.poet	@ltx/en_us_dedes/poets:po.IoannouEfchaiton
ltx/en_us_dedes/tr.d028:trMA.C2.title	@ltx/en_us_dedes/titles:ti.Canon2SaintM
ltx/en_us_dedes/tr.d028:trMA.C2.verse	@ltx/en_us_dedes/prayers:pr.verse_SaintM.text
ltx/en_us_dedes/tr.d028:trMA.ExapTheotokion.greekmelody	@ltx/en_us_dedes/he.a.m2:heAU.ToisMathitaisSynelthomen.greekname
ltx/en_us_dedes/tr.d028:trMA.ExapTheotokion.incipit	The Lord resided in your…
ltx/en_us_dedes/tr.d028:trMA.ExapTheotokion.melody	@ltx/en_us_dedes/he.a.m2:heAU.ToisMathitaisSynelthomen.name
ltx/en_us_dedes/tr.d028:trMA.ExapTheotokion.mode	@ltx/en_us_dedes/miscellanea:misc.Mode2
ltx/en_us_dedes/tr.d028:trMA.ExapTheotokion.text	The Lord resided in your womb, * Theotokos, as He knew, * wishing to call the world He made * back from corruption, for it was lost and perishing. Lady, * now having found salvation, * all together we cry to you * the Angel’s famous salutation, “Rejoice, * you are truly blessed among all women!” * For you, O Virgin, have brought forth * holy joy to the whole world.
ltx/en_us_dedes/tr.d028:trMA.Exaposteilarion1.greekmelody	@ltx/en_us_dedes/he.a.m2:heAU.ToisMathitaisSynelthomen.greekname
ltx/en_us_dedes/tr.d028:trMA.Exaposteilarion1.incipit	Wearing a crown, O Saint…
ltx/en_us_dedes/tr.d028:trMA.Exaposteilarion1.melody	@ltx/en_us_dedes/he.a.m2:heAU.ToisMathitaisSynelthomen.name
ltx/en_us_dedes/tr.d028:trMA.Exaposteilarion1.mode	@ltx/en_us_dedes/miscellanea:misc.Mode2
ltx/en_us_dedes/tr.d028:trMA.Exaposteilarion1.text	Wearing a crown, O Saint, you now * stand beside Christ’s tribunal * together with angelic hosts. * Prize-winner, you are filled with the light that originates there. * Never cease interceding * for the peace of the whole wide world, * and salvation for us who with pious faith * celebrate your memory, which is radiant, * O Theodore, all-glorious * and illustrious Martyr.
ltx/en_us_dedes/tr.d028:trMA.Kathisma21.greekmelody	@ltx/en_us_dedes/he.a.m3:heAU.TheiasPisteos.greekname
ltx/en_us_dedes/tr.d028:trMA.Kathisma21.incipit	As you boiled hot with…
ltx/en_us_dedes/tr.d028:trMA.Kathisma21.melody	@ltx/en_us_dedes/he.a.m3:heAU.TheiasPisteos.name
ltx/en_us_dedes/tr.d028:trMA.Kathisma21.mode	@ltx/en_us_dedes/miscellanea:misc.Mode3
ltx/en_us_dedes/tr.d028:trMA.Kathisma21.text	As you boiled hot with Orthodoxy, * you extinguished heresy’s delusion * and arrested idolatry’s godlessness. * You became a whole-burnt offering unto God, * and you refresh the whole world with your miracles. * Pray to Christ our God, O glorious Martyr, fervently, * entreating Him to grant us His great mercy.
ltx/en_us_dedes/tr.d028:trMA.Kathisma22.greekmelody	@ltx/en_us_dedes/he.a.m3:heAU.TheiasPisteos.greekname
ltx/en_us_dedes/tr.d028:trMA.Kathisma22.incipit	The Lord, who strengthened you…
ltx/en_us_dedes/tr.d028:trMA.Kathisma22.melody	@ltx/en_us_dedes/he.a.m3:heAU.TheiasPisteos.name
ltx/en_us_dedes/tr.d028:trMA.Kathisma22.mode	@ltx/en_us_dedes/miscellanea:misc.Mode3
ltx/en_us_dedes/tr.d028:trMA.Kathisma22.text	The Lord, who strengthened you when in the contests, * gave you to the world for our salvation, * as a divine gift, which is what your name denotes. * You heal the illness and passions that plague our souls * and ward off physical trauma and suffering. * Martyr Theodore, to Christ our God pray fervently, * entreating Him to grant us His great mercy.
ltx/en_us_dedes/tr.d028:trMA.Kathisma23.greekmelody	@ltx/en_us_dedes/he.a.m3:heAU.TinOraiotita.greekname
ltx/en_us_dedes/tr.d028:trMA.Kathisma23.incipit	You carried in your womb…
ltx/en_us_dedes/tr.d028:trMA.Kathisma23.melody	@ltx/en_us_dedes/he.a.m3:heAU.TinOraiotita.name
ltx/en_us_dedes/tr.d028:trMA.Kathisma23.mode	@ltx/en_us_dedes/miscellanea:misc.Mode3
ltx/en_us_dedes/tr.d028:trMA.Kathisma23.text	You carried in your womb the uncontainable God, * the hypostatic Word and consubstantial Son, * who pre-eternally shone forth from the Father without flux or change. * Virgin all-immaculate, now entreat Him on our behalf, * bringing with you all the saints, Prophets, Martyrs, and Monastics all, * Ascetics and the Righteous, and pray Him * to grant us forgiveness of offenses.
ltx/en_us_dedes/tr.d028:trMA.Kontakion1.incipit	Once you had taken the…
ltx/en_us_dedes/tr.d028:trMA.Kontakion1.melody	@ltx/en_us_dedes/miscellanea:misc.Automelon
ltx/en_us_dedes/tr.d028:trMA.Kontakion1.mode	@ltx/en_us_dedes/miscellanea:misc.Mode8
ltx/en_us_dedes/tr.d028:trMA.Kontakion1.text	Once you had taken the Faith of Christ into your heart like a suit of armor, you trampled the hostile forces underfoot, having contended much, and you were crowned with heavenly laurels forever, as one invincible.
ltx/en_us_dedes/tr.d028:trMA.Lauds1.greekmelody	@ltx/en_us_dedes/he.a.m1:heAU.TonOuranionTagmaton.greekname
ltx/en_us_dedes/tr.d028:trMA.Lauds1.incipit	@ltx/en_us_dedes/me.m02.d17:meMA.Lauds2.incipit
ltx/en_us_dedes/tr.d028:trMA.Lauds1.melody	@ltx/en_us_dedes/he.a.m1:heAU.TonOuranionTagmaton.name
ltx/en_us_dedes/tr.d028:trMA.Lauds1.mode	@ltx/en_us_dedes/miscellanea:misc.Mode1
ltx/en_us_dedes/tr.d028:trMA.Lauds1.text	@ltx/en_us_dedes/me.m02.d17:meMA.Lauds2.text
ltx/en_us_dedes/tr.d028:trMA.Lauds2.incipit	Your name denotes it, and…
ltx/en_us_dedes/tr.d028:trMA.Lauds2.melody	@ltx/en_us_dedes/he.a.m1:heAU.TonOuranionTagmaton.name
ltx/en_us_dedes/tr.d028:trMA.Lauds2.mode	@ltx/en_us_dedes/miscellanea:misc.Mode1
ltx/en_us_dedes/tr.d028:trMA.Lauds2.text	Your name denotes it, and truly You are a gift from God, * and you were given as comfort to all who are in trouble, * O thrice-blessed Theodore. For everyone * who comes in truth to your holy church, * and who with gladness receives the divine rewards * of your miracles, gives honor to Christ.
ltx/en_us_dedes/tr.d028:trMA.Lauds3.incipit	@ltx/en_us_dedes/me.m02.d17:meMA.Lauds3.incipit
ltx/en_us_dedes/tr.d028:trMA.Lauds3.melody	@ltx/en_us_dedes/he.a.m1:heAU.TonOuranionTagmaton.name
ltx/en_us_dedes/tr.d028:trMA.Lauds3.mode	@ltx/en_us_dedes/miscellanea:misc.Mode1
ltx/en_us_dedes/tr.d028:trMA.Lauds3.text	@ltx/en_us_dedes/me.m02.d17:meMA.Lauds3.text
ltx/en_us_dedes/tr.d028:trMA.Lauds4.incipit	@ltx/en_us_dedes/me.m02.d17:meMA.Lauds1.incipit
ltx/en_us_dedes/tr.d028:trMA.Lauds4.melody	@ltx/en_us_dedes/he.a.m1:heAU.TonOuranionTagmaton.name
ltx/en_us_dedes/tr.d028:trMA.Lauds4.mode	@ltx/en_us_dedes/miscellanea:misc.Mode1
ltx/en_us_dedes/tr.d028:trMA.Lauds4.text	@ltx/en_us_dedes/me.m02.d17:meMA.Lauds1.text
ltx/en_us_dedes/tr.d028:trMA.LaudsGlory.incipit	@ltx/en_us_dedes/me.m02.d17:meMA.LaudsGlory.incipit
ltx/en_us_dedes/tr.d028:trMA.LaudsGlory.melody	@ltx/en_us_dedes/miscellanea:misc.Idiomelon
ltx/en_us_dedes/tr.d028:trMA.LaudsGlory.mode	@ltx/en_us_dedes/miscellanea:misc.Mode6
ltx/en_us_dedes/tr.d028:trMA.LaudsGlory.text	@ltx/en_us_dedes/me.m02.d17:meMA.LaudsGlory.text
ltx/en_us_dedes/tr.d028:trMA.LaudsTheotokion.incipit	@ltx/en_us_dedes/he.o:heOT.TheotokeSyEi.incipit
ltx/en_us_dedes/tr.d028:trMA.LaudsTheotokion.melody	@ltx/en_us_dedes/he.o:heOT.TheotokeSyEi.name
ltx/en_us_dedes/tr.d028:trMA.LaudsTheotokion.mode	@ltx/en_us_dedes/miscellanea:misc.Mode6
ltx/en_us_dedes/tr.d028:trMA.LaudsTheotokion.text	@ltx/en_us_dedes/he.o:heOT.TheotokeSyEiAthloforou.text
ltx/en_us_dedes/tr.d028:trMA.Ode1C11.greekmelody	@ltx/en_us_dedes/he.h.m4:heHE.AnoixoToStomaMou.greekname
ltx/en_us_dedes/tr.d028:trMA.Ode1C11.incipit	…
ltx/en_us_dedes/tr.d028:trMA.Ode1C11.melody	@ltx/en_us_dedes/he.h.m4:heHE.AnoixoToStomaMou.name
ltx/en_us_dedes/tr.d028:trMA.Ode1C11.mode	@ltx/en_us_dedes/miscellanea:misc.Mode4
ltx/en_us_dedes/tr.d028:trMA.Ode1C11.ode	@ltx/en_us_dedes/miscellanea:misc.Ode1
ltx/en_us_dedes/tr.d028:trMA.Ode1C11.text	
ltx/en_us_dedes/tr.d028:trMA.Ode1C12.incipit	…
ltx/en_us_dedes/tr.d028:trMA.Ode1C12.melody	@ltx/en_us_dedes/he.h.m4:heHE.AnoixoToStomaMou.name
ltx/en_us_dedes/tr.d028:trMA.Ode1C12.mode	@ltx/en_us_dedes/miscellanea:misc.Mode4
ltx/en_us_dedes/tr.d028:trMA.Ode1C12.ode	@ltx/en_us_dedes/miscellanea:misc.Ode1
ltx/en_us_dedes/tr.d028:trMA.Ode1C12.text	
ltx/en_us_dedes/tr.d028:trMA.Ode1C13.incipit	…
ltx/en_us_dedes/tr.d028:trMA.Ode1C13.melody	@ltx/en_us_dedes/he.h.m4:heHE.AnoixoToStomaMou.name
ltx/en_us_dedes/tr.d028:trMA.Ode1C13.mode	@ltx/en_us_dedes/miscellanea:misc.Mode4
ltx/en_us_dedes/tr.d028:trMA.Ode1C13.ode	@ltx/en_us_dedes/miscellanea:misc.Ode1
ltx/en_us_dedes/tr.d028:trMA.Ode1C13.text	
ltx/en_us_dedes/tr.d028:trMA.Ode1C14.incipit	…
ltx/en_us_dedes/tr.d028:trMA.Ode1C14.melody	@ltx/en_us_dedes/he.h.m4:heHE.AnoixoToStomaMou.name
ltx/en_us_dedes/tr.d028:trMA.Ode1C14.mode	@ltx/en_us_dedes/miscellanea:misc.Mode4
ltx/en_us_dedes/tr.d028:trMA.Ode1C14.ode	@ltx/en_us_dedes/miscellanea:misc.Ode1
ltx/en_us_dedes/tr.d028:trMA.Ode1C14.text	
ltx/en_us_dedes/tr.d028:trMA.Ode1C1H.greekmelody	@ltx/en_us_dedes/he.h.m4:heHE.AnoixoToStomaMou.greekname
ltx/en_us_dedes/tr.d028:trMA.Ode1C1H.incipit	@ltx/en_us_dedes/he.h.m4:heHE.AnoixoToStomaMou.incipit
ltx/en_us_dedes/tr.d028:trMA.Ode1C1H.melody	@ltx/en_us_dedes/he.h.m4:heHE.AnoixoToStomaMou.melody
ltx/en_us_dedes/tr.d028:trMA.Ode1C1H.mode	@ltx/en_us_dedes/miscellanea:misc.Mode4
ltx/en_us_dedes/tr.d028:trMA.Ode1C1H.ode	@ltx/en_us_dedes/miscellanea:misc.Ode1
ltx/en_us_dedes/tr.d028:trMA.Ode1C1H.text	@ltx/en_us_dedes/he.h.m4:heHE.AnoixoToStomaMou.text
ltx/en_us_dedes/tr.d028:trMA.Ode1C1T.incipit	…
ltx/en_us_dedes/tr.d028:trMA.Ode1C1T.melody	@ltx/en_us_dedes/he.h.m4:heHE.AnoixoToStomaMou.name
ltx/en_us_dedes/tr.d028:trMA.Ode1C1T.mode	@ltx/en_us_dedes/miscellanea:misc.Mode4
ltx/en_us_dedes/tr.d028:trMA.Ode1C1T.ode	@ltx/en_us_dedes/miscellanea:misc.Ode1
ltx/en_us_dedes/tr.d028:trMA.Ode1C1T.text	
ltx/en_us_dedes/tr.d028:trMA.Ode1C21.incipit	…
ltx/en_us_dedes/tr.d028:trMA.Ode1C21.melody	
ltx/en_us_dedes/tr.d028:trMA.Ode1C21.mode	@ltx/en_us_dedes/miscellanea:misc.Mode6
ltx/en_us_dedes/tr.d028:trMA.Ode1C21.ode	@ltx/en_us_dedes/miscellanea:misc.Ode1
ltx/en_us_dedes/tr.d028:trMA.Ode1C21.text	
ltx/en_us_dedes/tr.d028:trMA.Ode1C22.incipit	…
ltx/en_us_dedes/tr.d028:trMA.Ode1C22.melody	
ltx/en_us_dedes/tr.d028:trMA.Ode1C22.mode	@ltx/en_us_dedes/miscellanea:misc.Mode6
ltx/en_us_dedes/tr.d028:trMA.Ode1C22.ode	@ltx/en_us_dedes/miscellanea:misc.Ode1
ltx/en_us_dedes/tr.d028:trMA.Ode1C22.text	
ltx/en_us_dedes/tr.d028:trMA.Ode1C23.incipit	…
ltx/en_us_dedes/tr.d028:trMA.Ode1C23.melody	
ltx/en_us_dedes/tr.d028:trMA.Ode1C23.mode	@ltx/en_us_dedes/miscellanea:misc.Mode6
ltx/en_us_dedes/tr.d028:trMA.Ode1C23.ode	@ltx/en_us_dedes/miscellanea:misc.Ode1
ltx/en_us_dedes/tr.d028:trMA.Ode1C23.text	
ltx/en_us_dedes/tr.d028:trMA.Ode1C2T.incipit	…
ltx/en_us_dedes/tr.d028:trMA.Ode1C2T.melody	
ltx/en_us_dedes/tr.d028:trMA.Ode1C2T.mode	@ltx/en_us_dedes/miscellanea:misc.Mode6
ltx/en_us_dedes/tr.d028:trMA.Ode1C2T.ode	@ltx/en_us_dedes/miscellanea:misc.Ode1
ltx/en_us_dedes/tr.d028:trMA.Ode1C2T.text	
ltx/en_us_dedes/tr.d028:trMA.Ode1K.incipit	@ltx/en_us_dedes/he.h.m4:heHE.AnoixoToStomaMou.incipit
ltx/en_us_dedes/tr.d028:trMA.Ode1K.melody	@ltx/en_us_dedes/he.h.m4:heHE.AnoixoToStomaMou.melody
ltx/en_us_dedes/tr.d028:trMA.Ode1K.mode	@ltx/en_us_dedes/miscellanea:misc.Mode4
ltx/en_us_dedes/tr.d028:trMA.Ode1K.ode	@ltx/en_us_dedes/miscellanea:misc.Ode1
ltx/en_us_dedes/tr.d028:trMA.Ode1K.text	@ltx/en_us_dedes/he.h.m4:heHE.AnoixoToStomaMou.text
ltx/en_us_dedes/tr.d028:trMA.Ode3C11.greekmelody	@ltx/en_us_dedes/he.h.m4:heHE.TousSousYmnologous.greekname
ltx/en_us_dedes/tr.d028:trMA.Ode3C11.incipit	…
ltx/en_us_dedes/tr.d028:trMA.Ode3C11.melody	@ltx/en_us_dedes/he.h.m4:heHE.TousSousYmnologous.name
ltx/en_us_dedes/tr.d028:trMA.Ode3C11.mode	@ltx/en_us_dedes/miscellanea:misc.Mode4
ltx/en_us_dedes/tr.d028:trMA.Ode3C11.ode	@ltx/en_us_dedes/miscellanea:misc.Ode3
ltx/en_us_dedes/tr.d028:trMA.Ode3C11.text	
ltx/en_us_dedes/tr.d028:trMA.Ode3C12.incipit	…
ltx/en_us_dedes/tr.d028:trMA.Ode3C12.melody	@ltx/en_us_dedes/he.h.m4:heHE.TousSousYmnologous.name
ltx/en_us_dedes/tr.d028:trMA.Ode3C12.mode	@ltx/en_us_dedes/miscellanea:misc.Mode4
ltx/en_us_dedes/tr.d028:trMA.Ode3C12.ode	@ltx/en_us_dedes/miscellanea:misc.Ode3
ltx/en_us_dedes/tr.d028:trMA.Ode3C12.text	
ltx/en_us_dedes/tr.d028:trMA.Ode3C13.incipit	…
ltx/en_us_dedes/tr.d028:trMA.Ode3C13.melody	@ltx/en_us_dedes/he.h.m4:heHE.TousSousYmnologous.name
ltx/en_us_dedes/tr.d028:trMA.Ode3C13.mode	@ltx/en_us_dedes/miscellanea:misc.Mode4
ltx/en_us_dedes/tr.d028:trMA.Ode3C13.ode	@ltx/en_us_dedes/miscellanea:misc.Ode3
ltx/en_us_dedes/tr.d028:trMA.Ode3C13.text	
ltx/en_us_dedes/tr.d028:trMA.Ode3C14.incipit	…
ltx/en_us_dedes/tr.d028:trMA.Ode3C14.melody	@ltx/en_us_dedes/he.h.m4:heHE.TousSousYmnologous.name
ltx/en_us_dedes/tr.d028:trMA.Ode3C14.mode	@ltx/en_us_dedes/miscellanea:misc.Mode4
ltx/en_us_dedes/tr.d028:trMA.Ode3C14.ode	@ltx/en_us_dedes/miscellanea:misc.Ode3
ltx/en_us_dedes/tr.d028:trMA.Ode3C14.text	
ltx/en_us_dedes/tr.d028:trMA.Ode3C15.incipit	…
ltx/en_us_dedes/tr.d028:trMA.Ode3C15.melody	@ltx/en_us_dedes/he.h.m4:heHE.TousSousYmnologous.name
ltx/en_us_dedes/tr.d028:trMA.Ode3C15.mode	@ltx/en_us_dedes/miscellanea:misc.Mode4
ltx/en_us_dedes/tr.d028:trMA.Ode3C15.ode	@ltx/en_us_dedes/miscellanea:misc.Ode3
ltx/en_us_dedes/tr.d028:trMA.Ode3C15.text	
ltx/en_us_dedes/tr.d028:trMA.Ode3C1H.greekmelody	@ltx/en_us_dedes/he.h.m4:heHE.TousSousYmnologous.greekname
ltx/en_us_dedes/tr.d028:trMA.Ode3C1H.incipit	@ltx/en_us_dedes/he.h.m4:heHE.TousSousYmnologous.incipit
ltx/en_us_dedes/tr.d028:trMA.Ode3C1H.melody	@ltx/en_us_dedes/he.h.m4:heHE.TousSousYmnologous.melody
ltx/en_us_dedes/tr.d028:trMA.Ode3C1H.mode	@ltx/en_us_dedes/miscellanea:misc.Mode4
ltx/en_us_dedes/tr.d028:trMA.Ode3C1H.ode	@ltx/en_us_dedes/miscellanea:misc.Ode3
ltx/en_us_dedes/tr.d028:trMA.Ode3C1H.text	@ltx/en_us_dedes/he.h.m4:heHE.TousSousYmnologous.text
ltx/en_us_dedes/tr.d028:trMA.Ode3C1T.incipit	…
ltx/en_us_dedes/tr.d028:trMA.Ode3C1T.melody	@ltx/en_us_dedes/he.h.m4:heHE.TousSousYmnologous.name
ltx/en_us_dedes/tr.d028:trMA.Ode3C1T.mode	@ltx/en_us_dedes/miscellanea:misc.Mode4
ltx/en_us_dedes/tr.d028:trMA.Ode3C1T.ode	@ltx/en_us_dedes/miscellanea:misc.Ode3
ltx/en_us_dedes/tr.d028:trMA.Ode3C1T.text	
ltx/en_us_dedes/tr.d028:trMA.Ode3C21.greekmelody	@ltx/en_us_dedes/he.h.m6:heHE.OukEstinAgios.greekname
ltx/en_us_dedes/tr.d028:trMA.Ode3C21.incipit	…
ltx/en_us_dedes/tr.d028:trMA.Ode3C21.melody	@ltx/en_us_dedes/he.h.m6:heHE.OukEstinAgios.name
ltx/en_us_dedes/tr.d028:trMA.Ode3C21.mode	@ltx/en_us_dedes/miscellanea:misc.Mode6
ltx/en_us_dedes/tr.d028:trMA.Ode3C21.ode	@ltx/en_us_dedes/miscellanea:misc.Ode3
ltx/en_us_dedes/tr.d028:trMA.Ode3C21.text	
ltx/en_us_dedes/tr.d028:trMA.Ode3C22.incipit	…
ltx/en_us_dedes/tr.d028:trMA.Ode3C22.melody	@ltx/en_us_dedes/he.h.m6:heHE.OukEstinAgios.name
ltx/en_us_dedes/tr.d028:trMA.Ode3C22.mode	@ltx/en_us_dedes/miscellanea:misc.Mode6
ltx/en_us_dedes/tr.d028:trMA.Ode3C22.ode	@ltx/en_us_dedes/miscellanea:misc.Ode3
ltx/en_us_dedes/tr.d028:trMA.Ode3C22.text	
ltx/en_us_dedes/tr.d028:trMA.Ode3C23.incipit	…
ltx/en_us_dedes/tr.d028:trMA.Ode3C23.melody	@ltx/en_us_dedes/he.h.m6:heHE.OukEstinAgios.name
ltx/en_us_dedes/tr.d028:trMA.Ode3C23.mode	@ltx/en_us_dedes/miscellanea:misc.Mode6
ltx/en_us_dedes/tr.d028:trMA.Ode3C23.ode	@ltx/en_us_dedes/miscellanea:misc.Ode3
ltx/en_us_dedes/tr.d028:trMA.Ode3C23.text	
ltx/en_us_dedes/tr.d028:trMA.Ode3C2T.incipit	…
ltx/en_us_dedes/tr.d028:trMA.Ode3C2T.melody	@ltx/en_us_dedes/he.h.m6:heHE.OukEstinAgios.name
ltx/en_us_dedes/tr.d028:trMA.Ode3C2T.mode	@ltx/en_us_dedes/miscellanea:misc.Mode6
ltx/en_us_dedes/tr.d028:trMA.Ode3C2T.ode	@ltx/en_us_dedes/miscellanea:misc.Ode3
ltx/en_us_dedes/tr.d028:trMA.Ode3C2T.text	
ltx/en_us_dedes/tr.d028:trMA.Ode3K.incipit	@ltx/en_us_dedes/he.h.m4:heHE.TousSousYmnologous.incipit
ltx/en_us_dedes/tr.d028:trMA.Ode3K.melody	@ltx/en_us_dedes/he.h.m4:heHE.TousSousYmnologous.melody
ltx/en_us_dedes/tr.d028:trMA.Ode3K.mode	@ltx/en_us_dedes/miscellanea:misc.Mode4
ltx/en_us_dedes/tr.d028:trMA.Ode3K.ode	@ltx/en_us_dedes/miscellanea:misc.Ode3
ltx/en_us_dedes/tr.d028:trMA.Ode3K.text	@ltx/en_us_dedes/he.h.m4:heHE.TousSousYmnologous.text
ltx/en_us_dedes/tr.d028:trMA.Ode3Kathisma1.greekmelody	@ltx/en_us_dedes/he.a.m8:heAU.TinSofianKaiLogon.greekname
ltx/en_us_dedes/tr.d028:trMA.Ode3Kathisma1.incipit	…
ltx/en_us_dedes/tr.d028:trMA.Ode3Kathisma1.melody	@ltx/en_us_dedes/he.a.m8:heAU.TinSofianKaiLogon.name
ltx/en_us_dedes/tr.d028:trMA.Ode3Kathisma1.mode	@ltx/en_us_dedes/miscellanea:misc.Mode8
ltx/en_us_dedes/tr.d028:trMA.Ode3Kathisma1.text	
ltx/en_us_dedes/tr.d028:trMA.Ode3Kathisma2.greekmelody	@ltx/en_us_dedes/he.a.m8:heAU.TinSofianKaiLogon.greekname
ltx/en_us_dedes/tr.d028:trMA.Ode3Kathisma2.incipit	…
ltx/en_us_dedes/tr.d028:trMA.Ode3Kathisma2.melody	@ltx/en_us_dedes/he.a.m8:heAU.TinSofianKaiLogon.name
ltx/en_us_dedes/tr.d028:trMA.Ode3Kathisma2.mode	@ltx/en_us_dedes/miscellanea:misc.Mode8
ltx/en_us_dedes/tr.d028:trMA.Ode3Kathisma2.text	
ltx/en_us_dedes/tr.d028:trMA.Ode3Kathisma3.greekmelody	@ltx/en_us_dedes/he.a.m8:heAU.TinSofianKaiLogon.greekname
ltx/en_us_dedes/tr.d028:trMA.Ode3Kathisma3.incipit	…
ltx/en_us_dedes/tr.d028:trMA.Ode3Kathisma3.melody	@ltx/en_us_dedes/he.a.m8:heAU.TinSofianKaiLogon.name
ltx/en_us_dedes/tr.d028:trMA.Ode3Kathisma3.mode	@ltx/en_us_dedes/miscellanea:misc.Mode8
ltx/en_us_dedes/tr.d028:trMA.Ode3Kathisma3.text	
ltx/en_us_dedes/tr.d028:trMA.Ode4C11.greekmelody	@ltx/en_us_dedes/he.h.m4:heHE.OKathimenosEnDoxi.greekname
ltx/en_us_dedes/tr.d028:trMA.Ode4C11.incipit	…
ltx/en_us_dedes/tr.d028:trMA.Ode4C11.melody	@ltx/en_us_dedes/he.h.m4:heHE.OKathimenosEnDoxi.name
ltx/en_us_dedes/tr.d028:trMA.Ode4C11.mode	@ltx/en_us_dedes/miscellanea:misc.Mode4
ltx/en_us_dedes/tr.d028:trMA.Ode4C11.ode	@ltx/en_us_dedes/miscellanea:misc.Ode4
ltx/en_us_dedes/tr.d028:trMA.Ode4C11.text	
ltx/en_us_dedes/tr.d028:trMA.Ode4C12.incipit	…
ltx/en_us_dedes/tr.d028:trMA.Ode4C12.melody	@ltx/en_us_dedes/he.h.m4:heHE.OKathimenosEnDoxi.name
ltx/en_us_dedes/tr.d028:trMA.Ode4C12.mode	@ltx/en_us_dedes/miscellanea:misc.Mode4
ltx/en_us_dedes/tr.d028:trMA.Ode4C12.ode	@ltx/en_us_dedes/miscellanea:misc.Ode4
ltx/en_us_dedes/tr.d028:trMA.Ode4C12.text	
ltx/en_us_dedes/tr.d028:trMA.Ode4C13.incipit	…
ltx/en_us_dedes/tr.d028:trMA.Ode4C13.melody	@ltx/en_us_dedes/he.h.m4:heHE.OKathimenosEnDoxi.name
ltx/en_us_dedes/tr.d028:trMA.Ode4C13.mode	@ltx/en_us_dedes/miscellanea:misc.Mode4
ltx/en_us_dedes/tr.d028:trMA.Ode4C13.ode	@ltx/en_us_dedes/miscellanea:misc.Ode4
ltx/en_us_dedes/tr.d028:trMA.Ode4C13.text	
ltx/en_us_dedes/tr.d028:trMA.Ode4C14.incipit	…
ltx/en_us_dedes/tr.d028:trMA.Ode4C14.melody	@ltx/en_us_dedes/he.h.m4:heHE.OKathimenosEnDoxi.name
ltx/en_us_dedes/tr.d028:trMA.Ode4C14.mode	@ltx/en_us_dedes/miscellanea:misc.Mode4
ltx/en_us_dedes/tr.d028:trMA.Ode4C14.ode	@ltx/en_us_dedes/miscellanea:misc.Ode4
ltx/en_us_dedes/tr.d028:trMA.Ode4C14.text	
ltx/en_us_dedes/tr.d028:trMA.Ode4C1H.greekmelody	@ltx/en_us_dedes/he.h.m4:heHE.OKathimenosEnDoxi.greekname
ltx/en_us_dedes/tr.d028:trMA.Ode4C1H.incipit	@ltx/en_us_dedes/he.h.m4:heHE.OKathimenosEnDoxi.incipit
ltx/en_us_dedes/tr.d028:trMA.Ode4C1H.melody	@ltx/en_us_dedes/he.h.m4:heHE.OKathimenosEnDoxi.melody
ltx/en_us_dedes/tr.d028:trMA.Ode4C1H.mode	@ltx/en_us_dedes/miscellanea:misc.Mode4
ltx/en_us_dedes/tr.d028:trMA.Ode4C1H.ode	@ltx/en_us_dedes/miscellanea:misc.Ode4
ltx/en_us_dedes/tr.d028:trMA.Ode4C1H.text	@ltx/en_us_dedes/he.h.m4:heHE.OKathimenosEnDoxi.text
ltx/en_us_dedes/tr.d028:trMA.Ode4C1T.incipit	…
ltx/en_us_dedes/tr.d028:trMA.Ode4C1T.melody	@ltx/en_us_dedes/he.h.m4:heHE.OKathimenosEnDoxi.name
ltx/en_us_dedes/tr.d028:trMA.Ode4C1T.mode	@ltx/en_us_dedes/miscellanea:misc.Mode4
ltx/en_us_dedes/tr.d028:trMA.Ode4C1T.ode	@ltx/en_us_dedes/miscellanea:misc.Ode4
ltx/en_us_dedes/tr.d028:trMA.Ode4C1T.text	
ltx/en_us_dedes/tr.d028:trMA.Ode4C21.greekmelody	@ltx/en_us_dedes/he.h.m6:heHE.ChristosMouDynamis.greekname
ltx/en_us_dedes/tr.d028:trMA.Ode4C21.incipit	…
ltx/en_us_dedes/tr.d028:trMA.Ode4C21.melody	@ltx/en_us_dedes/he.h.m6:heHE.ChristosMouDynamis.name
ltx/en_us_dedes/tr.d028:trMA.Ode4C21.mode	@ltx/en_us_dedes/miscellanea:misc.Mode6
ltx/en_us_dedes/tr.d028:trMA.Ode4C21.ode	@ltx/en_us_dedes/miscellanea:misc.Ode4
ltx/en_us_dedes/tr.d028:trMA.Ode4C21.text	
ltx/en_us_dedes/tr.d028:trMA.Ode4C22.incipit	…
ltx/en_us_dedes/tr.d028:trMA.Ode4C22.melody	@ltx/en_us_dedes/he.h.m6:heHE.ChristosMouDynamis.name
ltx/en_us_dedes/tr.d028:trMA.Ode4C22.mode	@ltx/en_us_dedes/miscellanea:misc.Mode6
ltx/en_us_dedes/tr.d028:trMA.Ode4C22.ode	@ltx/en_us_dedes/miscellanea:misc.Ode4
ltx/en_us_dedes/tr.d028:trMA.Ode4C22.text	
ltx/en_us_dedes/tr.d028:trMA.Ode4C23.incipit	…
ltx/en_us_dedes/tr.d028:trMA.Ode4C23.melody	@ltx/en_us_dedes/he.h.m6:heHE.ChristosMouDynamis.name
ltx/en_us_dedes/tr.d028:trMA.Ode4C23.mode	@ltx/en_us_dedes/miscellanea:misc.Mode6
ltx/en_us_dedes/tr.d028:trMA.Ode4C23.ode	@ltx/en_us_dedes/miscellanea:misc.Ode4
ltx/en_us_dedes/tr.d028:trMA.Ode4C23.text	
ltx/en_us_dedes/tr.d028:trMA.Ode4C2T.incipit	…
ltx/en_us_dedes/tr.d028:trMA.Ode4C2T.melody	@ltx/en_us_dedes/he.h.m6:heHE.ChristosMouDynamis.name
ltx/en_us_dedes/tr.d028:trMA.Ode4C2T.mode	@ltx/en_us_dedes/miscellanea:misc.Mode6
ltx/en_us_dedes/tr.d028:trMA.Ode4C2T.ode	@ltx/en_us_dedes/miscellanea:misc.Ode4
ltx/en_us_dedes/tr.d028:trMA.Ode4C2T.text	
ltx/en_us_dedes/tr.d028:trMA.Ode4K.incipit	@ltx/en_us_dedes/he.h.m4:heHE.OKathimenosEnDoxi.incipit
ltx/en_us_dedes/tr.d028:trMA.Ode4K.melody	@ltx/en_us_dedes/he.h.m4:heHE.OKathimenosEnDoxi.melody
ltx/en_us_dedes/tr.d028:trMA.Ode4K.mode	@ltx/en_us_dedes/miscellanea:misc.Mode4
ltx/en_us_dedes/tr.d028:trMA.Ode4K.ode	@ltx/en_us_dedes/miscellanea:misc.Ode4
ltx/en_us_dedes/tr.d028:trMA.Ode4K.text	@ltx/en_us_dedes/he.h.m4:heHE.OKathimenosEnDoxi.text
ltx/en_us_dedes/tr.d028:trMA.Ode5C11.greekmelody	@ltx/en_us_dedes/he.h.m4:heHE.ExestiTaSympanta.greekname
ltx/en_us_dedes/tr.d028:trMA.Ode5C11.incipit	…
ltx/en_us_dedes/tr.d028:trMA.Ode5C11.melody	@ltx/en_us_dedes/he.h.m4:heHE.ExestiTaSympanta.name
ltx/en_us_dedes/tr.d028:trMA.Ode5C11.mode	@ltx/en_us_dedes/miscellanea:misc.Mode4
ltx/en_us_dedes/tr.d028:trMA.Ode5C11.ode	@ltx/en_us_dedes/miscellanea:misc.Ode5
ltx/en_us_dedes/tr.d028:trMA.Ode5C11.text	
ltx/en_us_dedes/tr.d028:trMA.Ode5C12.incipit	…
ltx/en_us_dedes/tr.d028:trMA.Ode5C12.melody	@ltx/en_us_dedes/he.h.m4:heHE.ExestiTaSympanta.name
ltx/en_us_dedes/tr.d028:trMA.Ode5C12.mode	@ltx/en_us_dedes/miscellanea:misc.Mode4
ltx/en_us_dedes/tr.d028:trMA.Ode5C12.ode	@ltx/en_us_dedes/miscellanea:misc.Ode5
ltx/en_us_dedes/tr.d028:trMA.Ode5C12.text	
ltx/en_us_dedes/tr.d028:trMA.Ode5C13.incipit	…
ltx/en_us_dedes/tr.d028:trMA.Ode5C13.melody	@ltx/en_us_dedes/he.h.m4:heHE.ExestiTaSympanta.name
ltx/en_us_dedes/tr.d028:trMA.Ode5C13.mode	@ltx/en_us_dedes/miscellanea:misc.Mode4
ltx/en_us_dedes/tr.d028:trMA.Ode5C13.ode	@ltx/en_us_dedes/miscellanea:misc.Ode5
ltx/en_us_dedes/tr.d028:trMA.Ode5C13.text	
ltx/en_us_dedes/tr.d028:trMA.Ode5C1H.greekmelody	@ltx/en_us_dedes/he.h.m4:heHE.ExestiTaSympanta.greekname
ltx/en_us_dedes/tr.d028:trMA.Ode5C1H.incipit	@ltx/en_us_dedes/he.h.m4:heHE.ExestiTaSympanta.incipit
ltx/en_us_dedes/tr.d028:trMA.Ode5C1H.melody	@ltx/en_us_dedes/he.h.m4:heHE.ExestiTaSympanta.melody
ltx/en_us_dedes/tr.d028:trMA.Ode5C1H.mode	@ltx/en_us_dedes/miscellanea:misc.Mode4
ltx/en_us_dedes/tr.d028:trMA.Ode5C1H.ode	@ltx/en_us_dedes/miscellanea:misc.Ode5
ltx/en_us_dedes/tr.d028:trMA.Ode5C1H.text	@ltx/en_us_dedes/he.h.m4:heHE.ExestiTaSympanta.text
ltx/en_us_dedes/tr.d028:trMA.Ode5C1T.incipit	…
ltx/en_us_dedes/tr.d028:trMA.Ode5C1T.melody	@ltx/en_us_dedes/he.h.m4:heHE.ExestiTaSympanta.name
ltx/en_us_dedes/tr.d028:trMA.Ode5C1T.mode	@ltx/en_us_dedes/miscellanea:misc.Mode4
ltx/en_us_dedes/tr.d028:trMA.Ode5C1T.ode	@ltx/en_us_dedes/miscellanea:misc.Ode5
ltx/en_us_dedes/tr.d028:trMA.Ode5C1T.text	
ltx/en_us_dedes/tr.d028:trMA.Ode5C21.greekmelody	@ltx/en_us_dedes/he.h.m6:heHE.ToTheioFengeiSou.greekname
ltx/en_us_dedes/tr.d028:trMA.Ode5C21.incipit	…
ltx/en_us_dedes/tr.d028:trMA.Ode5C21.melody	@ltx/en_us_dedes/he.h.m6:heHE.ToTheioFengeiSou.name
ltx/en_us_dedes/tr.d028:trMA.Ode5C21.mode	@ltx/en_us_dedes/miscellanea:misc.Mode6
ltx/en_us_dedes/tr.d028:trMA.Ode5C21.ode	@ltx/en_us_dedes/miscellanea:misc.Ode5
ltx/en_us_dedes/tr.d028:trMA.Ode5C21.text	
ltx/en_us_dedes/tr.d028:trMA.Ode5C22.incipit	…
ltx/en_us_dedes/tr.d028:trMA.Ode5C22.melody	@ltx/en_us_dedes/he.h.m6:heHE.ToTheioFengeiSou.name
ltx/en_us_dedes/tr.d028:trMA.Ode5C22.mode	@ltx/en_us_dedes/miscellanea:misc.Mode6
ltx/en_us_dedes/tr.d028:trMA.Ode5C22.ode	@ltx/en_us_dedes/miscellanea:misc.Ode5
ltx/en_us_dedes/tr.d028:trMA.Ode5C22.text	
ltx/en_us_dedes/tr.d028:trMA.Ode5C23.incipit	…
ltx/en_us_dedes/tr.d028:trMA.Ode5C23.melody	@ltx/en_us_dedes/he.h.m6:heHE.ToTheioFengeiSou.name
ltx/en_us_dedes/tr.d028:trMA.Ode5C23.mode	@ltx/en_us_dedes/miscellanea:misc.Mode6
ltx/en_us_dedes/tr.d028:trMA.Ode5C23.ode	@ltx/en_us_dedes/miscellanea:misc.Ode5
ltx/en_us_dedes/tr.d028:trMA.Ode5C23.text	
ltx/en_us_dedes/tr.d028:trMA.Ode5C2T.incipit	…
ltx/en_us_dedes/tr.d028:trMA.Ode5C2T.melody	@ltx/en_us_dedes/he.h.m6:heHE.ToTheioFengeiSou.name
ltx/en_us_dedes/tr.d028:trMA.Ode5C2T.mode	@ltx/en_us_dedes/miscellanea:misc.Mode6
ltx/en_us_dedes/tr.d028:trMA.Ode5C2T.ode	@ltx/en_us_dedes/miscellanea:misc.Ode5
ltx/en_us_dedes/tr.d028:trMA.Ode5C2T.text	
ltx/en_us_dedes/tr.d028:trMA.Ode5K.incipit	@ltx/en_us_dedes/he.h.m4:heHE.ExestiTaSympanta.incipit
ltx/en_us_dedes/tr.d028:trMA.Ode5K.melody	@ltx/en_us_dedes/he.h.m4:heHE.ExestiTaSympanta.melody
ltx/en_us_dedes/tr.d028:trMA.Ode5K.mode	@ltx/en_us_dedes/miscellanea:misc.Mode4
ltx/en_us_dedes/tr.d028:trMA.Ode5K.ode	@ltx/en_us_dedes/miscellanea:misc.Ode5
ltx/en_us_dedes/tr.d028:trMA.Ode5K.text	@ltx/en_us_dedes/he.h.m4:heHE.ExestiTaSympanta.text
ltx/en_us_dedes/tr.d028:trMA.Ode6C11.greekmelody	@ltx/en_us_dedes/he.h.m4:heHE.TinTheianTaftin.greekname
ltx/en_us_dedes/tr.d028:trMA.Ode6C11.incipit	…
ltx/en_us_dedes/tr.d028:trMA.Ode6C11.melody	@ltx/en_us_dedes/he.h.m4:heHE.TinTheianTaftin.name
ltx/en_us_dedes/tr.d028:trMA.Ode6C11.mode	@ltx/en_us_dedes/miscellanea:misc.Mode4
ltx/en_us_dedes/tr.d028:trMA.Ode6C11.ode	@ltx/en_us_dedes/miscellanea:misc.Ode6
ltx/en_us_dedes/tr.d028:trMA.Ode6C11.text	
ltx/en_us_dedes/tr.d028:trMA.Ode6C12.incipit	…
ltx/en_us_dedes/tr.d028:trMA.Ode6C12.melody	@ltx/en_us_dedes/he.h.m4:heHE.TinTheianTaftin.name
ltx/en_us_dedes/tr.d028:trMA.Ode6C12.mode	@ltx/en_us_dedes/miscellanea:misc.Mode4
ltx/en_us_dedes/tr.d028:trMA.Ode6C12.ode	@ltx/en_us_dedes/miscellanea:misc.Ode6
ltx/en_us_dedes/tr.d028:trMA.Ode6C12.text	
ltx/en_us_dedes/tr.d028:trMA.Ode6C13.incipit	…
ltx/en_us_dedes/tr.d028:trMA.Ode6C13.melody	@ltx/en_us_dedes/he.h.m4:heHE.TinTheianTaftin.name
ltx/en_us_dedes/tr.d028:trMA.Ode6C13.mode	@ltx/en_us_dedes/miscellanea:misc.Mode4
ltx/en_us_dedes/tr.d028:trMA.Ode6C13.ode	@ltx/en_us_dedes/miscellanea:misc.Ode6
ltx/en_us_dedes/tr.d028:trMA.Ode6C13.text	
ltx/en_us_dedes/tr.d028:trMA.Ode6C1H.greekmelody	@ltx/en_us_dedes/he.h.m4:heHE.TinTheianTaftin.greekname
ltx/en_us_dedes/tr.d028:trMA.Ode6C1H.incipit	@ltx/en_us_dedes/he.h.m4:heHE.TinTheianTaftin.incipit
ltx/en_us_dedes/tr.d028:trMA.Ode6C1H.melody	@ltx/en_us_dedes/he.h.m4:heHE.TinTheianTaftin.melody
ltx/en_us_dedes/tr.d028:trMA.Ode6C1H.mode	@ltx/en_us_dedes/miscellanea:misc.Mode4
ltx/en_us_dedes/tr.d028:trMA.Ode6C1H.ode	@ltx/en_us_dedes/miscellanea:misc.Ode6
ltx/en_us_dedes/tr.d028:trMA.Ode6C1H.text	@ltx/en_us_dedes/he.h.m4:heHE.TinTheianTaftin.text
ltx/en_us_dedes/tr.d028:trMA.Ode6C1T.incipit	…
ltx/en_us_dedes/tr.d028:trMA.Ode6C1T.melody	@ltx/en_us_dedes/he.h.m4:heHE.TinTheianTaftin.name
ltx/en_us_dedes/tr.d028:trMA.Ode6C1T.mode	@ltx/en_us_dedes/miscellanea:misc.Mode4
ltx/en_us_dedes/tr.d028:trMA.Ode6C1T.ode	@ltx/en_us_dedes/miscellanea:misc.Ode6
ltx/en_us_dedes/tr.d028:trMA.Ode6C1T.text	
ltx/en_us_dedes/tr.d028:trMA.Ode6C21.greekmelody	@ltx/en_us_dedes/he.h.m6:heHE.TouViouTinThalassan.greekname
ltx/en_us_dedes/tr.d028:trMA.Ode6C21.incipit	The Archbishop was amazed by…
ltx/en_us_dedes/tr.d028:trMA.Ode6C21.melody	@ltx/en_us_dedes/he.h.m6:heHE.TouViouTinThalassan.notmetered
ltx/en_us_dedes/tr.d028:trMA.Ode6C21.mode	@ltx/en_us_dedes/miscellanea:misc.Mode6
ltx/en_us_dedes/tr.d028:trMA.Ode6C21.ode	@ltx/en_us_dedes/miscellanea:misc.Ode6
ltx/en_us_dedes/tr.d028:trMA.Ode6C21.text	The Archbishop was amazed by your strange unusual appearance to him. And he said, “Sir, who are you, who speak to me? Instruct me and show me how we might be helped.”
ltx/en_us_dedes/tr.d028:trMA.Ode6C22.incipit	Theodore replied, “I am obviously…
ltx/en_us_dedes/tr.d028:trMA.Ode6C22.melody	@ltx/en_us_dedes/he.h.m6:heHE.TouViouTinThalassan.notmetered
ltx/en_us_dedes/tr.d028:trMA.Ode6C22.mode	@ltx/en_us_dedes/miscellanea:misc.Mode6
ltx/en_us_dedes/tr.d028:trMA.Ode6C22.ode	@ltx/en_us_dedes/miscellanea:misc.Ode6
ltx/en_us_dedes/tr.d028:trMA.Ode6C22.text	Theodore replied, “I am obviously the Martyr. Now listen to me. Boil wheat and give it to the people. This is how you will be safe from the polluted foods of that wicked man.”
ltx/en_us_dedes/tr.d028:trMA.Ode6C23.incipit	O Theodore, how great was…
ltx/en_us_dedes/tr.d028:trMA.Ode6C23.melody	@ltx/en_us_dedes/he.h.m6:heHE.TouViouTinThalassan.notmetered
ltx/en_us_dedes/tr.d028:trMA.Ode6C23.mode	@ltx/en_us_dedes/miscellanea:misc.Mode6
ltx/en_us_dedes/tr.d028:trMA.Ode6C23.ode	@ltx/en_us_dedes/miscellanea:misc.Ode6
ltx/en_us_dedes/tr.d028:trMA.Ode6C23.text	O Theodore, how great was your miracle, and how amazing was your help! Because of this, we are all encouraged, and we sincerely run to you and pray: Save us who pray to you!
ltx/en_us_dedes/tr.d028:trMA.Ode6C2T.incipit	O Lady, you became the…
ltx/en_us_dedes/tr.d028:trMA.Ode6C2T.melody	@ltx/en_us_dedes/he.h.m6:heHE.TouViouTinThalassan.notmetered
ltx/en_us_dedes/tr.d028:trMA.Ode6C2T.mode	@ltx/en_us_dedes/miscellanea:misc.Mode6
ltx/en_us_dedes/tr.d028:trMA.Ode6C2T.ode	@ltx/en_us_dedes/miscellanea:misc.Ode6
ltx/en_us_dedes/tr.d028:trMA.Ode6C2T.text	O Lady, you became the dwelling place of Light, and the clean vessel of the Logos, by the good pleasure of the Father and the visitation in you of the Holy Spirit. Therefore, I pray you, guide me to the Light.
ltx/en_us_dedes/tr.d028:trMA.Ode6K.incipit	@ltx/en_us_dedes/he.h.m4:heHE.TinTheianTaftin.incipit
ltx/en_us_dedes/tr.d028:trMA.Ode6K.melody	@ltx/en_us_dedes/he.h.m4:heHE.TinTheianTaftin.melody
ltx/en_us_dedes/tr.d028:trMA.Ode6K.mode	@ltx/en_us_dedes/miscellanea:misc.Mode4
ltx/en_us_dedes/tr.d028:trMA.Ode6K.ode	@ltx/en_us_dedes/miscellanea:misc.Ode6
ltx/en_us_dedes/tr.d028:trMA.Ode6K.text	@ltx/en_us_dedes/he.h.m4:heHE.TinTheianTaftin.text
ltx/en_us_dedes/tr.d028:trMA.Ode7C11.greekmelody	@ltx/en_us_dedes/he.h.m4:heHE.OukElatrefsan.greekname
ltx/en_us_dedes/tr.d028:trMA.Ode7C11.incipit	…
ltx/en_us_dedes/tr.d028:trMA.Ode7C11.melody	@ltx/en_us_dedes/he.h.m4:heHE.OukElatrefsan.name
ltx/en_us_dedes/tr.d028:trMA.Ode7C11.mode	@ltx/en_us_dedes/miscellanea:misc.Mode4
ltx/en_us_dedes/tr.d028:trMA.Ode7C11.ode	@ltx/en_us_dedes/miscellanea:misc.Ode7
ltx/en_us_dedes/tr.d028:trMA.Ode7C11.text	
ltx/en_us_dedes/tr.d028:trMA.Ode7C12.incipit	…
ltx/en_us_dedes/tr.d028:trMA.Ode7C12.melody	@ltx/en_us_dedes/he.h.m4:heHE.OukElatrefsan.name
ltx/en_us_dedes/tr.d028:trMA.Ode7C12.mode	@ltx/en_us_dedes/miscellanea:misc.Mode4
ltx/en_us_dedes/tr.d028:trMA.Ode7C12.ode	@ltx/en_us_dedes/miscellanea:misc.Ode7
ltx/en_us_dedes/tr.d028:trMA.Ode7C12.text	
ltx/en_us_dedes/tr.d028:trMA.Ode7C13.incipit	…
ltx/en_us_dedes/tr.d028:trMA.Ode7C13.melody	@ltx/en_us_dedes/he.h.m4:heHE.OukElatrefsan.name
ltx/en_us_dedes/tr.d028:trMA.Ode7C13.mode	@ltx/en_us_dedes/miscellanea:misc.Mode4
ltx/en_us_dedes/tr.d028:trMA.Ode7C13.ode	@ltx/en_us_dedes/miscellanea:misc.Ode7
ltx/en_us_dedes/tr.d028:trMA.Ode7C13.text	
ltx/en_us_dedes/tr.d028:trMA.Ode7C1H.greekmelody	@ltx/en_us_dedes/he.h.m4:heHE.OukElatrefsan.greekname
ltx/en_us_dedes/tr.d028:trMA.Ode7C1H.incipit	@ltx/en_us_dedes/he.h.m4:heHE.OukElatrefsan.incipit
ltx/en_us_dedes/tr.d028:trMA.Ode7C1H.melody	@ltx/en_us_dedes/he.h.m4:heHE.OukElatrefsan.melody
ltx/en_us_dedes/tr.d028:trMA.Ode7C1H.mode	@ltx/en_us_dedes/miscellanea:misc.Mode4
ltx/en_us_dedes/tr.d028:trMA.Ode7C1H.ode	@ltx/en_us_dedes/miscellanea:misc.Ode7
ltx/en_us_dedes/tr.d028:trMA.Ode7C1H.text	@ltx/en_us_dedes/he.h.m4:heHE.OukElatrefsan.text
ltx/en_us_dedes/tr.d028:trMA.Ode7C1T.incipit	…
ltx/en_us_dedes/tr.d028:trMA.Ode7C1T.melody	@ltx/en_us_dedes/he.h.m4:heHE.OukElatrefsan.name
ltx/en_us_dedes/tr.d028:trMA.Ode7C1T.mode	@ltx/en_us_dedes/miscellanea:misc.Mode4
ltx/en_us_dedes/tr.d028:trMA.Ode7C1T.ode	@ltx/en_us_dedes/miscellanea:misc.Ode7
ltx/en_us_dedes/tr.d028:trMA.Ode7C1T.text	
ltx/en_us_dedes/tr.d028:trMA.Ode7C21.greekmelody	@ltx/en_us_dedes/he.h.m6:heHE.DrosovolonMenTinKaminon.greekname
ltx/en_us_dedes/tr.d028:trMA.Ode7C21.incipit	…
ltx/en_us_dedes/tr.d028:trMA.Ode7C21.melody	@ltx/en_us_dedes/he.h.m6:heHE.DrosovolonMenTinKaminon.name
ltx/en_us_dedes/tr.d028:trMA.Ode7C21.mode	@ltx/en_us_dedes/miscellanea:misc.Mode6
ltx/en_us_dedes/tr.d028:trMA.Ode7C21.ode	@ltx/en_us_dedes/miscellanea:misc.Ode7
ltx/en_us_dedes/tr.d028:trMA.Ode7C21.text	
ltx/en_us_dedes/tr.d028:trMA.Ode7C22.incipit	…
ltx/en_us_dedes/tr.d028:trMA.Ode7C22.melody	@ltx/en_us_dedes/he.h.m6:heHE.DrosovolonMenTinKaminon.name
ltx/en_us_dedes/tr.d028:trMA.Ode7C22.mode	@ltx/en_us_dedes/miscellanea:misc.Mode6
ltx/en_us_dedes/tr.d028:trMA.Ode7C22.ode	@ltx/en_us_dedes/miscellanea:misc.Ode7
ltx/en_us_dedes/tr.d028:trMA.Ode7C22.text	
ltx/en_us_dedes/tr.d028:trMA.Ode7C23.incipit	…
ltx/en_us_dedes/tr.d028:trMA.Ode7C23.melody	@ltx/en_us_dedes/he.h.m6:heHE.DrosovolonMenTinKaminon.name
ltx/en_us_dedes/tr.d028:trMA.Ode7C23.mode	@ltx/en_us_dedes/miscellanea:misc.Mode6
ltx/en_us_dedes/tr.d028:trMA.Ode7C23.ode	@ltx/en_us_dedes/miscellanea:misc.Ode7
ltx/en_us_dedes/tr.d028:trMA.Ode7C23.text	
ltx/en_us_dedes/tr.d028:trMA.Ode7C2T.incipit	…
ltx/en_us_dedes/tr.d028:trMA.Ode7C2T.melody	@ltx/en_us_dedes/he.h.m6:heHE.DrosovolonMenTinKaminon.name
ltx/en_us_dedes/tr.d028:trMA.Ode7C2T.mode	@ltx/en_us_dedes/miscellanea:misc.Mode6
ltx/en_us_dedes/tr.d028:trMA.Ode7C2T.ode	@ltx/en_us_dedes/miscellanea:misc.Ode7
ltx/en_us_dedes/tr.d028:trMA.Ode7C2T.text	
ltx/en_us_dedes/tr.d028:trMA.Ode7K.incipit	@ltx/en_us_dedes/he.h.m4:heHE.OukElatrefsan.incipit
ltx/en_us_dedes/tr.d028:trMA.Ode7K.melody	@ltx/en_us_dedes/he.h.m4:heHE.OukElatrefsan.melody
ltx/en_us_dedes/tr.d028:trMA.Ode7K.mode	@ltx/en_us_dedes/miscellanea:misc.Mode4
ltx/en_us_dedes/tr.d028:trMA.Ode7K.ode	@ltx/en_us_dedes/miscellanea:misc.Ode7
ltx/en_us_dedes/tr.d028:trMA.Ode7K.text	@ltx/en_us_dedes/he.h.m4:heHE.OukElatrefsan.text
ltx/en_us_dedes/tr.d028:trMA.Ode8C11.greekmelody	@ltx/en_us_dedes/he.h.m4:heHE.LytrotaTouPantos.greekname
ltx/en_us_dedes/tr.d028:trMA.Ode8C11.incipit	…
ltx/en_us_dedes/tr.d028:trMA.Ode8C11.melody	@ltx/en_us_dedes/he.h.m4:heHE.LytrotaTouPantos.name
ltx/en_us_dedes/tr.d028:trMA.Ode8C11.mode	@ltx/en_us_dedes/miscellanea:misc.Mode4
ltx/en_us_dedes/tr.d028:trMA.Ode8C11.ode	@ltx/en_us_dedes/miscellanea:misc.Ode8
ltx/en_us_dedes/tr.d028:trMA.Ode8C11.text	
ltx/en_us_dedes/tr.d028:trMA.Ode8C12.incipit	…
ltx/en_us_dedes/tr.d028:trMA.Ode8C12.melody	@ltx/en_us_dedes/he.h.m4:heHE.LytrotaTouPantos.name
ltx/en_us_dedes/tr.d028:trMA.Ode8C12.mode	@ltx/en_us_dedes/miscellanea:misc.Mode4
ltx/en_us_dedes/tr.d028:trMA.Ode8C12.ode	@ltx/en_us_dedes/miscellanea:misc.Ode8
ltx/en_us_dedes/tr.d028:trMA.Ode8C12.text	
ltx/en_us_dedes/tr.d028:trMA.Ode8C13.incipit	…
ltx/en_us_dedes/tr.d028:trMA.Ode8C13.melody	@ltx/en_us_dedes/he.h.m4:heHE.LytrotaTouPantos.name
ltx/en_us_dedes/tr.d028:trMA.Ode8C13.mode	@ltx/en_us_dedes/miscellanea:misc.Mode4
ltx/en_us_dedes/tr.d028:trMA.Ode8C13.ode	@ltx/en_us_dedes/miscellanea:misc.Ode8
ltx/en_us_dedes/tr.d028:trMA.Ode8C13.text	
ltx/en_us_dedes/tr.d028:trMA.Ode8C14.incipit	…
ltx/en_us_dedes/tr.d028:trMA.Ode8C14.melody	@ltx/en_us_dedes/he.h.m4:heHE.LytrotaTouPantos.name
ltx/en_us_dedes/tr.d028:trMA.Ode8C14.mode	@ltx/en_us_dedes/miscellanea:misc.Mode4
ltx/en_us_dedes/tr.d028:trMA.Ode8C14.ode	@ltx/en_us_dedes/miscellanea:misc.Ode8
ltx/en_us_dedes/tr.d028:trMA.Ode8C14.text	
ltx/en_us_dedes/tr.d028:trMA.Ode8C1H.greekmelody	@ltx/en_us_dedes/he.h.m4:heHE.LytrotaTouPantos.greekname
ltx/en_us_dedes/tr.d028:trMA.Ode8C1H.incipit	@ltx/en_us_dedes/he.h.m4:heHE.LytrotaTouPantos.incipit
ltx/en_us_dedes/tr.d028:trMA.Ode8C1H.melody	@ltx/en_us_dedes/he.h.m4:heHE.LytrotaTouPantos.melody
ltx/en_us_dedes/tr.d028:trMA.Ode8C1H.mode	@ltx/en_us_dedes/miscellanea:misc.Mode4
ltx/en_us_dedes/tr.d028:trMA.Ode8C1H.ode	@ltx/en_us_dedes/miscellanea:misc.Ode8
ltx/en_us_dedes/tr.d028:trMA.Ode8C1H.text	@ltx/en_us_dedes/he.h.m4:heHE.LytrotaTouPantos.text
ltx/en_us_dedes/tr.d028:trMA.Ode8C1T.incipit	…
ltx/en_us_dedes/tr.d028:trMA.Ode8C1T.melody	@ltx/en_us_dedes/he.h.m4:heHE.LytrotaTouPantos.name
ltx/en_us_dedes/tr.d028:trMA.Ode8C1T.mode	@ltx/en_us_dedes/miscellanea:misc.Mode4
ltx/en_us_dedes/tr.d028:trMA.Ode8C1T.ode	@ltx/en_us_dedes/miscellanea:misc.Ode8
ltx/en_us_dedes/tr.d028:trMA.Ode8C1T.text	
ltx/en_us_dedes/tr.d028:trMA.Ode8C21.greekmelody	@ltx/en_us_dedes/he.h.m6:heHE.EkFlogosToisOsiois.greekname
ltx/en_us_dedes/tr.d028:trMA.Ode8C21.incipit	…
ltx/en_us_dedes/tr.d028:trMA.Ode8C21.melody	@ltx/en_us_dedes/he.h.m6:heHE.EkFlogosToisOsiois.name
ltx/en_us_dedes/tr.d028:trMA.Ode8C21.mode	@ltx/en_us_dedes/miscellanea:misc.Mode6
ltx/en_us_dedes/tr.d028:trMA.Ode8C21.ode	@ltx/en_us_dedes/miscellanea:misc.Ode8
ltx/en_us_dedes/tr.d028:trMA.Ode8C21.text	
ltx/en_us_dedes/tr.d028:trMA.Ode8C22.incipit	…
ltx/en_us_dedes/tr.d028:trMA.Ode8C22.melody	@ltx/en_us_dedes/he.h.m6:heHE.EkFlogosToisOsiois.name
ltx/en_us_dedes/tr.d028:trMA.Ode8C22.mode	@ltx/en_us_dedes/miscellanea:misc.Mode6
ltx/en_us_dedes/tr.d028:trMA.Ode8C22.ode	@ltx/en_us_dedes/miscellanea:misc.Ode8
ltx/en_us_dedes/tr.d028:trMA.Ode8C22.text	
ltx/en_us_dedes/tr.d028:trMA.Ode8C23.incipit	…
ltx/en_us_dedes/tr.d028:trMA.Ode8C23.melody	@ltx/en_us_dedes/he.h.m6:heHE.EkFlogosToisOsiois.name
ltx/en_us_dedes/tr.d028:trMA.Ode8C23.mode	@ltx/en_us_dedes/miscellanea:misc.Mode6
ltx/en_us_dedes/tr.d028:trMA.Ode8C23.ode	@ltx/en_us_dedes/miscellanea:misc.Ode8
ltx/en_us_dedes/tr.d028:trMA.Ode8C23.text	
ltx/en_us_dedes/tr.d028:trMA.Ode8C2T.incipit	…
ltx/en_us_dedes/tr.d028:trMA.Ode8C2T.melody	@ltx/en_us_dedes/he.h.m6:heHE.EkFlogosToisOsiois.name
ltx/en_us_dedes/tr.d028:trMA.Ode8C2T.mode	@ltx/en_us_dedes/miscellanea:misc.Mode6
ltx/en_us_dedes/tr.d028:trMA.Ode8C2T.ode	@ltx/en_us_dedes/miscellanea:misc.Ode8
ltx/en_us_dedes/tr.d028:trMA.Ode8C2T.text	
ltx/en_us_dedes/tr.d028:trMA.Ode8K.incipit	@ltx/en_us_dedes/he.h.m4:heHE.PaidasEvageis.incipit
ltx/en_us_dedes/tr.d028:trMA.Ode8K.melody	@ltx/en_us_dedes/he.h.m4:heHE.PaidasEvageis.melody
ltx/en_us_dedes/tr.d028:trMA.Ode8K.mode	@ltx/en_us_dedes/miscellanea:misc.Mode4
ltx/en_us_dedes/tr.d028:trMA.Ode8K.ode	@ltx/en_us_dedes/miscellanea:misc.Ode8
ltx/en_us_dedes/tr.d028:trMA.Ode8K.text	@ltx/en_us_dedes/he.h.m4:heHE.PaidasEvageis.text
ltx/en_us_dedes/tr.d028:trMA.Ode9C11.greekmelody	@ltx/en_us_dedes/he.h.m4:heHE.OTokosSouAfthoros.greekname
ltx/en_us_dedes/tr.d028:trMA.Ode9C11.incipit	…
ltx/en_us_dedes/tr.d028:trMA.Ode9C11.melody	@ltx/en_us_dedes/he.h.m4:heHE.OTokosSouAfthoros.name
ltx/en_us_dedes/tr.d028:trMA.Ode9C11.mode	@ltx/en_us_dedes/miscellanea:misc.Mode4
ltx/en_us_dedes/tr.d028:trMA.Ode9C11.ode	@ltx/en_us_dedes/miscellanea:misc.Ode9
ltx/en_us_dedes/tr.d028:trMA.Ode9C11.text	
ltx/en_us_dedes/tr.d028:trMA.Ode9C12.incipit	…
ltx/en_us_dedes/tr.d028:trMA.Ode9C12.melody	@ltx/en_us_dedes/he.h.m4:heHE.OTokosSouAfthoros.name
ltx/en_us_dedes/tr.d028:trMA.Ode9C12.mode	@ltx/en_us_dedes/miscellanea:misc.Mode4
ltx/en_us_dedes/tr.d028:trMA.Ode9C12.ode	@ltx/en_us_dedes/miscellanea:misc.Ode9
ltx/en_us_dedes/tr.d028:trMA.Ode9C12.text	
ltx/en_us_dedes/tr.d028:trMA.Ode9C13.incipit	…
ltx/en_us_dedes/tr.d028:trMA.Ode9C13.melody	@ltx/en_us_dedes/he.h.m4:heHE.OTokosSouAfthoros.name
ltx/en_us_dedes/tr.d028:trMA.Ode9C13.mode	@ltx/en_us_dedes/miscellanea:misc.Mode4
ltx/en_us_dedes/tr.d028:trMA.Ode9C13.ode	@ltx/en_us_dedes/miscellanea:misc.Ode9
ltx/en_us_dedes/tr.d028:trMA.Ode9C13.text	
ltx/en_us_dedes/tr.d028:trMA.Ode9C1H.greekmelody	@ltx/en_us_dedes/he.h.m4:heHE.OTokosSouAfthoros.greekname
ltx/en_us_dedes/tr.d028:trMA.Ode9C1H.incipit	@ltx/en_us_dedes/he.h.m4:heHE.OTokosSouAfthoros.incipit
ltx/en_us_dedes/tr.d028:trMA.Ode9C1H.melody	@ltx/en_us_dedes/he.h.m4:heHE.OTokosSouAfthoros.melody
ltx/en_us_dedes/tr.d028:trMA.Ode9C1H.mode	@ltx/en_us_dedes/miscellanea:misc.Mode4
ltx/en_us_dedes/tr.d028:trMA.Ode9C1H.ode	@ltx/en_us_dedes/miscellanea:misc.Ode9
ltx/en_us_dedes/tr.d028:trMA.Ode9C1H.text	@ltx/en_us_dedes/he.h.m4:heHE.OTokosSouAfthoros.text
ltx/en_us_dedes/tr.d028:trMA.Ode9C1T.incipit	…
ltx/en_us_dedes/tr.d028:trMA.Ode9C1T.melody	@ltx/en_us_dedes/he.h.m4:heHE.OTokosSouAfthoros.name
ltx/en_us_dedes/tr.d028:trMA.Ode9C1T.mode	@ltx/en_us_dedes/miscellanea:misc.Mode4
ltx/en_us_dedes/tr.d028:trMA.Ode9C1T.ode	@ltx/en_us_dedes/miscellanea:misc.Ode9
ltx/en_us_dedes/tr.d028:trMA.Ode9C1T.text	
ltx/en_us_dedes/tr.d028:trMA.Ode9C21.greekmelody	@ltx/en_us_dedes/he.h.m6:heHE.TheonAnthropois.greekname
ltx/en_us_dedes/tr.d028:trMA.Ode9C21.incipit	…
ltx/en_us_dedes/tr.d028:trMA.Ode9C21.melody	@ltx/en_us_dedes/he.h.m6:heHE.TheonAnthropois.name
ltx/en_us_dedes/tr.d028:trMA.Ode9C21.mode	@ltx/en_us_dedes/miscellanea:misc.Mode6
ltx/en_us_dedes/tr.d028:trMA.Ode9C21.ode	@ltx/en_us_dedes/miscellanea:misc.Ode9
ltx/en_us_dedes/tr.d028:trMA.Ode9C21.text	
ltx/en_us_dedes/tr.d028:trMA.Ode9C22.incipit	…
ltx/en_us_dedes/tr.d028:trMA.Ode9C22.melody	@ltx/en_us_dedes/he.h.m6:heHE.TheonAnthropois.name
ltx/en_us_dedes/tr.d028:trMA.Ode9C22.mode	@ltx/en_us_dedes/miscellanea:misc.Mode6
ltx/en_us_dedes/tr.d028:trMA.Ode9C22.ode	@ltx/en_us_dedes/miscellanea:misc.Ode9
ltx/en_us_dedes/tr.d028:trMA.Ode9C22.text	
ltx/en_us_dedes/tr.d028:trMA.Ode9C23.incipit	…
ltx/en_us_dedes/tr.d028:trMA.Ode9C23.melody	@ltx/en_us_dedes/he.h.m6:heHE.TheonAnthropois.name
ltx/en_us_dedes/tr.d028:trMA.Ode9C23.mode	@ltx/en_us_dedes/miscellanea:misc.Mode6
ltx/en_us_dedes/tr.d028:trMA.Ode9C23.ode	@ltx/en_us_dedes/miscellanea:misc.Ode9
ltx/en_us_dedes/tr.d028:trMA.Ode9C23.text	
ltx/en_us_dedes/tr.d028:trMA.Ode9C2T.incipit	…
ltx/en_us_dedes/tr.d028:trMA.Ode9C2T.melody	@ltx/en_us_dedes/he.h.m6:heHE.TheonAnthropois.name
ltx/en_us_dedes/tr.d028:trMA.Ode9C2T.mode	@ltx/en_us_dedes/miscellanea:misc.Mode6
ltx/en_us_dedes/tr.d028:trMA.Ode9C2T.ode	@ltx/en_us_dedes/miscellanea:misc.Ode9
ltx/en_us_dedes/tr.d028:trMA.Ode9C2T.text	
ltx/en_us_dedes/tr.d028:trMA.Ode9K.incipit	@ltx/en_us_dedes/he.h.m4:heHE.ApasGigenis.incipit
ltx/en_us_dedes/tr.d028:trMA.Ode9K.melody	@ltx/en_us_dedes/he.h.m4:heHE.ApasGigenis.melody
ltx/en_us_dedes/tr.d028:trMA.Ode9K.mode	@ltx/en_us_dedes/miscellanea:misc.Mode4
ltx/en_us_dedes/tr.d028:trMA.Ode9K.ode	@ltx/en_us_dedes/miscellanea:misc.Ode9
ltx/en_us_dedes/tr.d028:trMA.Ode9K.text	@ltx/en_us_dedes/he.h.m4:heHE.ApasGigenis.text
ltx/en_us_dedes/tr.d028:trMA.Oikos1.text	We gladly in faith extol You, who are carried on a throne of light. For You have given us a divine gift, Theodore, who was brave in the contests and thrice-blessed in his life, as being a champion of the truth. Having a pious frame of mind, he obtained You, O Christ; and against the deceiver he proved to be a mighty victor, as one invincible.
ltx/en_us_dedes/tr.d028:trSY.commemoration.couplet1.title	@ltx/en_us_dedes/titles:ti.Verses
ltx/en_us_dedes/tr.d028:trSY.commemoration.couplet1.verse1	With Kollyva the Tyro feeds the City
ltx/en_us_dedes/tr.d028:trSY.commemoration.couplet1.verse2	And makes ineffectual the food that was defiled.
ltx/en_us_dedes/tr.d028:trSY.commemoration.narration.p01	[paragraph 01]
ltx/en_us_dedes/tr.d028:trSY.commemoration.narration.p02	[paragraph 02]
ltx/en_us_dedes/tr.d028:trSY.commemoration.narration.p03	[paragraph 03]
ltx/en_us_dedes/tr.d028:trSY.commemoration.narration.p04	[paragraph 04]
ltx/en_us_dedes/tr.d028:trSY.commemoration.narration.p05	[paragraph 05]
ltx/en_us_dedes/tr.d028:trSY.commemoration.narration.p06	[paragraph 06]
ltx/en_us_dedes/tr.d028:trSY.commemoration.narration.p07	[paragraph 07]
ltx/en_us_dedes/tr.d028:trSY.commemoration.onotherday.text	On this day, we celebrate the marvelous wonder involving Kolyva by the holy and glorious Great-martyr Theodore the Recruit.
ltx/en_us_dedes/tr.d028:trSY.commemoration.text	On this day, Saturday of the first week of Lent, we celebrate the marvelous wonder involving Kolyva by the holy and glorious Great-martyr Theodore the Recruit.
ltx/en_us_dedes/tr.d028:trSY.lastline	By his holy intercessions, O God, have mercy on us and save us. Amen.
ltx/en_us_dedes/tr.d028:trVE.ApolTheotokion.incipit	@ltx/en_us_dedes/oc.m2.d1:ocVE.ApolTheotokionVM.incipit
ltx/en_us_dedes/tr.d028:trVE.ApolTheotokion.melody	
ltx/en_us_dedes/tr.d028:trVE.ApolTheotokion.mode	@ltx/en_us_dedes/miscellanea:misc.Mode2
ltx/en_us_dedes/tr.d028:trVE.ApolTheotokion.text	@ltx/en_us_dedes/oc.m2.d1:ocVE.ApolTheotokionVM.text
ltx/en_us_dedes/tr.d028:trVE.Apolytikion1.incipit	@ltx/en_us_dedes/me.m02.d17:meVE.Apolytikion1.incipit
ltx/en_us_dedes/tr.d028:trVE.Apolytikion1.melody	
ltx/en_us_dedes/tr.d028:trVE.Apolytikion1.mode	@ltx/en_us_dedes/miscellanea:misc.Mode2
ltx/en_us_dedes/tr.d028:trVE.Apolytikion1.text	@ltx/en_us_dedes/me.m02.d17:meVE.Apolytikion1.text
ltx/en_us_dedes/tr.d028:trVE.AposIdiomelon1.incipit	Come, O believers, let us…
ltx/en_us_dedes/tr.d028:trVE.AposIdiomelon1.melody	@ltx/en_us_dedes/miscellanea:misc.Idiomelon
ltx/en_us_dedes/tr.d028:trVE.AposIdiomelon1.mode	@ltx/en_us_dedes/miscellanea:misc.Mode5
ltx/en_us_dedes/tr.d028:trVE.AposIdiomelon1.text	Come, O believers, let us do the works of God in the light; let us conduct ourselves becomingly as in the day. Of our own accord let us get rid of every unjust contract with our neighbor, and not put a stumbling block in his way. Let us abandon the pleasures of the flesh, and instead increase the spiritual gifts of the soul. Let us give bread to those in need. And thus let us go to Christ and cry out in repentance: “O our God, have mercy on us.”
ltx/en_us_dedes/tr.d028:trVE.SticGlory.incipit	The devil used the tyrant…
ltx/en_us_dedes/tr.d028:trVE.SticGlory.melody	@ltx/en_us_dedes/miscellanea:misc.Idiomelon
ltx/en_us_dedes/tr.d028:trVE.SticGlory.mode	@ltx/en_us_dedes/miscellanea:misc.Mode6
ltx/en_us_dedes/tr.d028:trVE.SticGlory.text	The devil used the tyrant, his fellow apostate, as his instrument. He gave him the foul idea, to attempt to defile the Orthodox people who were purifying themselves by fasting, by compelling them to eat foods that were polluted by pagan sacrifice. But you, O Saint, thwarted his plot with a wiser idea. You appeared to the Archbishop in a dream, and revealed to him the sinister plot, and how awful the consequences would be. For this we offer gratitude, and even call you savior; and every year we remember this miracle. And now we entreat you, O Martyr Theodore, to preserve us unharmed by the plots of the evil one, by your intercessions to God on our behalf.
ltx/en_us_dedes/tr.d028:trVE.Stichera01.incipit	Martyr fans all, come now…
ltx/en_us_dedes/tr.d028:trVE.Stichera01.melody	@ltx/en_us_dedes/miscellanea:misc.Idiomelon
ltx/en_us_dedes/tr.d028:trVE.Stichera01.mode	@ltx/en_us_dedes/miscellanea:misc.Mode2
ltx/en_us_dedes/tr.d028:trVE.Stichera01.text	Martyr fans all, come now, let us spiritually make merry and celebrate! Today, the martyr Theodore is offering a mystical banquet, which makes us, who are fans of feast days, so glad, that we shout to him: “We salute you and say, Rejoice, O undefeated medalist! You crushed to the ground the threats made by the tyrants. Rejoice, for you gave your clay body over to torture for the sake of Christ God! Rejoice, for by many trials you were shown to be a tried and true soldier of the heavenly army! Therefore we entreat you, O adornment of martyrs: Intercede on behalf of our souls!
ltx/en_us_dedes/tr.d028:trVE.Stichera02.incipit	@ltx/en_us_dedes/me.m02.d17:meVE.AposGlory.incipit
ltx/en_us_dedes/tr.d028:trVE.Stichera02.melody	@ltx/en_us_dedes/miscellanea:misc.Idiomelon
ltx/en_us_dedes/tr.d028:trVE.Stichera02.mode	@ltx/en_us_dedes/miscellanea:misc.Mode2
ltx/en_us_dedes/tr.d028:trVE.Stichera02.text	@ltx/en_us_dedes/me.m02.d17:meVE.AposGlory.text
ltx/en_us_dedes/tr.d028:trVE.Stichera03.incipit	You have proved to be…
ltx/en_us_dedes/tr.d028:trVE.Stichera03.melody	@ltx/en_us_dedes/miscellanea:misc.Idiomelon
ltx/en_us_dedes/tr.d028:trVE.Stichera03.mode	@ltx/en_us_dedes/miscellanea:misc.Mode2
ltx/en_us_dedes/tr.d028:trVE.Stichera03.text	You have proved to be a supreme gift of God, according to your name, O martyr Theodore, for you grant the requests of those who pray to you, even after death, as if you were alive. For example, when a widow’s son had been taken captive by foreign soldiers, the woman came to your church and drenched it in tears; you, being sympathetic, mounted a white horse and invisibly returned her son. Ever since then you do not cease to do miracles. Now we entreat you to pray to Christ God, for the salvation of our souls.
ltx/en_us_dedes/tr.d028:trVE.Stichera04.incipit	@ltx/en_us_dedes/me.m02.d17:meVE.SticGlory.incipit
ltx/en_us_dedes/tr.d028:trVE.Stichera04.melody	@ltx/en_us_dedes/miscellanea:misc.Idiomelon
ltx/en_us_dedes/tr.d028:trVE.Stichera04.mode	@ltx/en_us_dedes/miscellanea:misc.Mode2
ltx/en_us_dedes/tr.d028:trVE.Stichera04.text	@ltx/en_us_dedes/me.m02.d17:meVE.SticGlory.text
ltx/en_us_dedes/tr.d028:trVL.header	Presanctified Liturgy on Friday of the First Week
