ltx/en_us_dedes/me.m04.d15:meDA.commemoration.first	Memory of the Holy Martyr Crescent
ltx/en_us_dedes/me.m04.d15:meDA.commemoration.first_name	
ltx/en_us_dedes/me.m04.d15:meDA.commemoration.first_short	Memory of the Holy Martyr Crescent
ltx/en_us_dedes/me.m04.d15:meDA.commemoration.first_title	@ltx/en_us_dedes/titles:ti.SaintM
ltx/en_us_dedes/me.m04.d15:meDA.commemoration.full	Memory of the Holy Martyr Crescent, and the holy Hieromartyr Leonidas, Bishop of Athens
ltx/en_us_dedes/me.m04.d15:meDA.commemoration.second_name	
ltx/en_us_dedes/me.m04.d15:meDA.commemoration.second_title	
ltx/en_us_dedes/me.m04.d15:meDA.date	April 15
ltx/en_us_dedes/me.m04.d15:meDA.fordate	for April 15
ltx/en_us_dedes/me.m04.d15:meDA.insert1	
ltx/en_us_dedes/me.m04.d15:meDA.insert2	
ltx/en_us_dedes/me.m04.d15:meDA.note	
ltx/en_us_dedes/me.m04.d15:meDA.pdfcoverdate	April 15,
ltx/en_us_dedes/me.m04.d15:meDA.pdfheaderdate	April 15
ltx/en_us_dedes/me.m04.d15:meHO.commemorations	
ltx/en_us_dedes/me.m04.d15:meHO.note1	
ltx/en_us_dedes/me.m04.d15:meHO.note2	
ltx/en_us_dedes/me.m04.d15:meHO.number	
ltx/en_us_dedes/me.m04.d15:meHO.rank	
ltx/en_us_dedes/me.m04.d15:meLE.commemoration1	
ltx/en_us_dedes/me.m04.d15:meLE.commemoration2	
ltx/en_us_dedes/me.m04.d15:meLI.Kontakion1.incipit	@ltx/en_us_dedes/me.m04.d15:meMA.Kontakion1ger.incipit
ltx/en_us_dedes/me.m04.d15:meLI.Kontakion1.melody	@ltx/en_us_dedes/me.m04.d15:meMA.Kontakion1ger.melody
ltx/en_us_dedes/me.m04.d15:meLI.Kontakion1.mode	@ltx/en_us_dedes/me.m04.d15:meMA.Kontakion1ger.mode
ltx/en_us_dedes/me.m04.d15:meLI.Kontakion1.text	@ltx/en_us_dedes/me.m04.d15:meMA.Kontakion1ger.text
ltx/en_us_dedes/me.m04.d15:meLI.MM.CommunionHymn.text	@ltx/en_us_dedes/properties:media.key
ltx/en_us_dedes/me.m04.d15:meLI.Megalynarion.text	
ltx/en_us_dedes/me.m04.d15:meMA.C1.acrostic.notice1	
ltx/en_us_dedes/me.m04.d15:meMA.C1.acrostic.text	
ltx/en_us_dedes/me.m04.d15:meMA.C1.acrostic.title	
ltx/en_us_dedes/me.m04.d15:meMA.C1.title	@ltx/en_us_dedes/titles:ti.CanonSaintM
ltx/en_us_dedes/me.m04.d15:meMA.C1.verse	@ltx/en_us_dedes/prayers:pr.verse_SaintM.text
ltx/en_us_dedes/me.m04.d15:meMA.Kontakion1ger.incipit	…
ltx/en_us_dedes/me.m04.d15:meMA.Kontakion1ger.melody	
ltx/en_us_dedes/me.m04.d15:meMA.Kontakion1ger.mode	@ltx/en_us_dedes/miscellanea:misc.Mode8
ltx/en_us_dedes/me.m04.d15:meMA.Kontakion1ger.poet	@ltx/en_us_dedes/poets:po.Gerasimou
ltx/en_us_dedes/me.m04.d15:meMA.Kontakion1ger.text	
ltx/en_us_dedes/me.m04.d15:meMA.Kontakion2ger.incipit	…
ltx/en_us_dedes/me.m04.d15:meMA.Kontakion2ger.melody	@ltx/en_us_dedes/he.a.m4:heAU.OYpsotheisEnToStavro.name
ltx/en_us_dedes/me.m04.d15:meMA.Kontakion2ger.mode	@ltx/en_us_dedes/miscellanea:misc.Mode4
ltx/en_us_dedes/me.m04.d15:meMA.Kontakion2ger.poet	@ltx/en_us_dedes/poets:po.Gerasimou
ltx/en_us_dedes/me.m04.d15:meMA.Kontakion2ger.text	
ltx/en_us_dedes/me.m04.d15:meMA.Ode1C11.greekmelody	@ltx/en_us_dedes/he.h.m4:heHE.ThalassisToErythraion.greekname
ltx/en_us_dedes/me.m04.d15:meMA.Ode1C11.incipit	…
ltx/en_us_dedes/me.m04.d15:meMA.Ode1C11.melody	@ltx/en_us_dedes/he.h.m4:heHE.ThalassisToErythraion.name
ltx/en_us_dedes/me.m04.d15:meMA.Ode1C11.mode	@ltx/en_us_dedes/miscellanea:misc.Mode4
ltx/en_us_dedes/me.m04.d15:meMA.Ode1C11.ode	@ltx/en_us_dedes/miscellanea:misc.Ode1
ltx/en_us_dedes/me.m04.d15:meMA.Ode1C11.text	
ltx/en_us_dedes/me.m04.d15:meMA.Ode1C12.incipit	…
ltx/en_us_dedes/me.m04.d15:meMA.Ode1C12.melody	@ltx/en_us_dedes/he.h.m4:heHE.ThalassisToErythraion.name
ltx/en_us_dedes/me.m04.d15:meMA.Ode1C12.mode	@ltx/en_us_dedes/miscellanea:misc.Mode4
ltx/en_us_dedes/me.m04.d15:meMA.Ode1C12.ode	@ltx/en_us_dedes/miscellanea:misc.Ode1
ltx/en_us_dedes/me.m04.d15:meMA.Ode1C12.text	
ltx/en_us_dedes/me.m04.d15:meMA.Ode1C13.incipit	…
ltx/en_us_dedes/me.m04.d15:meMA.Ode1C13.melody	@ltx/en_us_dedes/he.h.m4:heHE.ThalassisToErythraion.name
ltx/en_us_dedes/me.m04.d15:meMA.Ode1C13.mode	@ltx/en_us_dedes/miscellanea:misc.Mode4
ltx/en_us_dedes/me.m04.d15:meMA.Ode1C13.ode	@ltx/en_us_dedes/miscellanea:misc.Ode1
ltx/en_us_dedes/me.m04.d15:meMA.Ode1C13.text	
ltx/en_us_dedes/me.m04.d15:meMA.Ode1C1H.greekmelody	@ltx/en_us_dedes/he.h.m4:heHE.ThalassisToErythraion.greekname
ltx/en_us_dedes/me.m04.d15:meMA.Ode1C1H.incipit	@ltx/en_us_dedes/he.h.m4:heHE.ThalassisToErythraion.incipit
ltx/en_us_dedes/me.m04.d15:meMA.Ode1C1H.melody	@ltx/en_us_dedes/he.h.m4:heHE.ThalassisToErythraion.melody
ltx/en_us_dedes/me.m04.d15:meMA.Ode1C1H.mode	@ltx/en_us_dedes/miscellanea:misc.Mode4
ltx/en_us_dedes/me.m04.d15:meMA.Ode1C1H.ode	@ltx/en_us_dedes/miscellanea:misc.Ode1
ltx/en_us_dedes/me.m04.d15:meMA.Ode1C1H.text	@ltx/en_us_dedes/he.h.m4:heHE.ThalassisToErythraion.text
ltx/en_us_dedes/me.m04.d15:meMA.Ode1C1T.incipit	…
ltx/en_us_dedes/me.m04.d15:meMA.Ode1C1T.melody	@ltx/en_us_dedes/he.h.m4:heHE.ThalassisToErythraion.name
ltx/en_us_dedes/me.m04.d15:meMA.Ode1C1T.mode	@ltx/en_us_dedes/miscellanea:misc.Mode4
ltx/en_us_dedes/me.m04.d15:meMA.Ode1C1T.ode	@ltx/en_us_dedes/miscellanea:misc.Ode1
ltx/en_us_dedes/me.m04.d15:meMA.Ode1C1T.text	
ltx/en_us_dedes/me.m04.d15:meMA.Ode3C11.greekmelody	@ltx/en_us_dedes/he.h.m4:heHE.EffrainetaiEpiSoi.greekname
ltx/en_us_dedes/me.m04.d15:meMA.Ode3C11.incipit	…
ltx/en_us_dedes/me.m04.d15:meMA.Ode3C11.melody	@ltx/en_us_dedes/he.h.m4:heHE.EffrainetaiEpiSoi.name
ltx/en_us_dedes/me.m04.d15:meMA.Ode3C11.mode	@ltx/en_us_dedes/miscellanea:misc.Mode4
ltx/en_us_dedes/me.m04.d15:meMA.Ode3C11.ode	@ltx/en_us_dedes/miscellanea:misc.Ode3
ltx/en_us_dedes/me.m04.d15:meMA.Ode3C11.text	
ltx/en_us_dedes/me.m04.d15:meMA.Ode3C12.incipit	…
ltx/en_us_dedes/me.m04.d15:meMA.Ode3C12.melody	@ltx/en_us_dedes/he.h.m4:heHE.EffrainetaiEpiSoi.name
ltx/en_us_dedes/me.m04.d15:meMA.Ode3C12.mode	@ltx/en_us_dedes/miscellanea:misc.Mode4
ltx/en_us_dedes/me.m04.d15:meMA.Ode3C12.ode	@ltx/en_us_dedes/miscellanea:misc.Ode3
ltx/en_us_dedes/me.m04.d15:meMA.Ode3C12.text	
ltx/en_us_dedes/me.m04.d15:meMA.Ode3C13.incipit	…
ltx/en_us_dedes/me.m04.d15:meMA.Ode3C13.melody	@ltx/en_us_dedes/he.h.m4:heHE.EffrainetaiEpiSoi.name
ltx/en_us_dedes/me.m04.d15:meMA.Ode3C13.mode	@ltx/en_us_dedes/miscellanea:misc.Mode4
ltx/en_us_dedes/me.m04.d15:meMA.Ode3C13.ode	@ltx/en_us_dedes/miscellanea:misc.Ode3
ltx/en_us_dedes/me.m04.d15:meMA.Ode3C13.text	
ltx/en_us_dedes/me.m04.d15:meMA.Ode3C1H.greekmelody	@ltx/en_us_dedes/he.h.m4:heHE.EffrainetaiEpiSoi.greekname
ltx/en_us_dedes/me.m04.d15:meMA.Ode3C1H.incipit	@ltx/en_us_dedes/he.h.m4:heHE.EffrainetaiEpiSoi.incipit
ltx/en_us_dedes/me.m04.d15:meMA.Ode3C1H.melody	@ltx/en_us_dedes/he.h.m4:heHE.EffrainetaiEpiSoi.melody
ltx/en_us_dedes/me.m04.d15:meMA.Ode3C1H.mode	@ltx/en_us_dedes/miscellanea:misc.Mode4
ltx/en_us_dedes/me.m04.d15:meMA.Ode3C1H.ode	@ltx/en_us_dedes/miscellanea:misc.Ode3
ltx/en_us_dedes/me.m04.d15:meMA.Ode3C1H.text	@ltx/en_us_dedes/he.h.m4:heHE.EffrainetaiEpiSoi.text
ltx/en_us_dedes/me.m04.d15:meMA.Ode3C1T.incipit	…
ltx/en_us_dedes/me.m04.d15:meMA.Ode3C1T.melody	@ltx/en_us_dedes/he.h.m4:heHE.EffrainetaiEpiSoi.name
ltx/en_us_dedes/me.m04.d15:meMA.Ode3C1T.mode	@ltx/en_us_dedes/miscellanea:misc.Mode4
ltx/en_us_dedes/me.m04.d15:meMA.Ode3C1T.ode	@ltx/en_us_dedes/miscellanea:misc.Ode3
ltx/en_us_dedes/me.m04.d15:meMA.Ode3C1T.text	
ltx/en_us_dedes/me.m04.d15:meMA.Ode3Kathisma1.greekmelody	@ltx/en_us_dedes/he.a.m4:heAU.OYpsotheisEnToStavro.greekname
ltx/en_us_dedes/me.m04.d15:meMA.Ode3Kathisma1.incipit	…
ltx/en_us_dedes/me.m04.d15:meMA.Ode3Kathisma1.melody	@ltx/en_us_dedes/he.a.m4:heAU.OYpsotheisEnToStavro.name
ltx/en_us_dedes/me.m04.d15:meMA.Ode3Kathisma1.mode	@ltx/en_us_dedes/miscellanea:misc.Mode4
ltx/en_us_dedes/me.m04.d15:meMA.Ode3Kathisma1.text	
ltx/en_us_dedes/me.m04.d15:meMA.Ode3KathismaSt.incipit	…
ltx/en_us_dedes/me.m04.d15:meMA.Ode3KathismaSt.melody	@ltx/en_us_dedes/he.a.m4:heAU.OYpsotheisEnToStavro.name
ltx/en_us_dedes/me.m04.d15:meMA.Ode3KathismaSt.mode	@ltx/en_us_dedes/miscellanea:misc.Mode4
ltx/en_us_dedes/me.m04.d15:meMA.Ode3KathismaSt.text	
ltx/en_us_dedes/me.m04.d15:meMA.Ode3KathismaT.incipit	@ltx/en_us_dedes/ho.ho23:hoCA.Apolytikion2.incipit
ltx/en_us_dedes/me.m04.d15:meMA.Ode3KathismaT.melody	@ltx/en_us_dedes/he.a.m4:heAU.OYpsotheisEnToStavro.name
ltx/en_us_dedes/me.m04.d15:meMA.Ode3KathismaT.mode	@ltx/en_us_dedes/miscellanea:misc.Mode4
ltx/en_us_dedes/me.m04.d15:meMA.Ode3KathismaT.text	@ltx/en_us_dedes/ho.ho23:hoCA.Apolytikion2.text
ltx/en_us_dedes/me.m04.d15:meMA.Ode4C11.greekmelody	@ltx/en_us_dedes/he.h.m4:heHE.EparthentaSeIdousa.greekname
ltx/en_us_dedes/me.m04.d15:meMA.Ode4C11.incipit	…
ltx/en_us_dedes/me.m04.d15:meMA.Ode4C11.melody	@ltx/en_us_dedes/he.h.m4:heHE.EparthentaSeIdousa.name
ltx/en_us_dedes/me.m04.d15:meMA.Ode4C11.mode	@ltx/en_us_dedes/miscellanea:misc.Mode4
ltx/en_us_dedes/me.m04.d15:meMA.Ode4C11.ode	@ltx/en_us_dedes/miscellanea:misc.Ode4
ltx/en_us_dedes/me.m04.d15:meMA.Ode4C11.text	
ltx/en_us_dedes/me.m04.d15:meMA.Ode4C12.incipit	…
ltx/en_us_dedes/me.m04.d15:meMA.Ode4C12.melody	@ltx/en_us_dedes/he.h.m4:heHE.EparthentaSeIdousa.name
ltx/en_us_dedes/me.m04.d15:meMA.Ode4C12.mode	@ltx/en_us_dedes/miscellanea:misc.Mode4
ltx/en_us_dedes/me.m04.d15:meMA.Ode4C12.ode	@ltx/en_us_dedes/miscellanea:misc.Ode4
ltx/en_us_dedes/me.m04.d15:meMA.Ode4C12.text	
ltx/en_us_dedes/me.m04.d15:meMA.Ode4C1H.greekmelody	@ltx/en_us_dedes/he.h.m4:heHE.EparthentaSeIdousa.greekname
ltx/en_us_dedes/me.m04.d15:meMA.Ode4C1H.incipit	@ltx/en_us_dedes/he.h.m4:heHE.EparthentaSeIdousa.incipit
ltx/en_us_dedes/me.m04.d15:meMA.Ode4C1H.melody	@ltx/en_us_dedes/he.h.m4:heHE.EparthentaSeIdousa.melody
ltx/en_us_dedes/me.m04.d15:meMA.Ode4C1H.mode	@ltx/en_us_dedes/miscellanea:misc.Mode4
ltx/en_us_dedes/me.m04.d15:meMA.Ode4C1H.ode	@ltx/en_us_dedes/miscellanea:misc.Ode4
ltx/en_us_dedes/me.m04.d15:meMA.Ode4C1H.text	@ltx/en_us_dedes/he.h.m4:heHE.EparthentaSeIdousa.text
ltx/en_us_dedes/me.m04.d15:meMA.Ode4C1T.incipit	…
ltx/en_us_dedes/me.m04.d15:meMA.Ode4C1T.melody	@ltx/en_us_dedes/he.h.m4:heHE.EparthentaSeIdousa.name
ltx/en_us_dedes/me.m04.d15:meMA.Ode4C1T.mode	@ltx/en_us_dedes/miscellanea:misc.Mode4
ltx/en_us_dedes/me.m04.d15:meMA.Ode4C1T.ode	@ltx/en_us_dedes/miscellanea:misc.Ode4
ltx/en_us_dedes/me.m04.d15:meMA.Ode4C1T.text	
ltx/en_us_dedes/me.m04.d15:meMA.Ode5C11.greekmelody	@ltx/en_us_dedes/he.h.m4:heHE.SyKyrieMouFos.greekname
ltx/en_us_dedes/me.m04.d15:meMA.Ode5C11.incipit	…
ltx/en_us_dedes/me.m04.d15:meMA.Ode5C11.melody	@ltx/en_us_dedes/he.h.m4:heHE.SyKyrieMouFos.name
ltx/en_us_dedes/me.m04.d15:meMA.Ode5C11.mode	@ltx/en_us_dedes/miscellanea:misc.Mode4
ltx/en_us_dedes/me.m04.d15:meMA.Ode5C11.ode	@ltx/en_us_dedes/miscellanea:misc.Ode5
ltx/en_us_dedes/me.m04.d15:meMA.Ode5C11.text	
ltx/en_us_dedes/me.m04.d15:meMA.Ode5C12.incipit	…
ltx/en_us_dedes/me.m04.d15:meMA.Ode5C12.melody	@ltx/en_us_dedes/he.h.m4:heHE.SyKyrieMouFos.name
ltx/en_us_dedes/me.m04.d15:meMA.Ode5C12.mode	@ltx/en_us_dedes/miscellanea:misc.Mode4
ltx/en_us_dedes/me.m04.d15:meMA.Ode5C12.ode	@ltx/en_us_dedes/miscellanea:misc.Ode5
ltx/en_us_dedes/me.m04.d15:meMA.Ode5C12.text	
ltx/en_us_dedes/me.m04.d15:meMA.Ode5C13.incipit	…
ltx/en_us_dedes/me.m04.d15:meMA.Ode5C13.melody	@ltx/en_us_dedes/he.h.m4:heHE.SyKyrieMouFos.name
ltx/en_us_dedes/me.m04.d15:meMA.Ode5C13.mode	@ltx/en_us_dedes/miscellanea:misc.Mode4
ltx/en_us_dedes/me.m04.d15:meMA.Ode5C13.ode	@ltx/en_us_dedes/miscellanea:misc.Ode5
ltx/en_us_dedes/me.m04.d15:meMA.Ode5C13.text	
ltx/en_us_dedes/me.m04.d15:meMA.Ode5C1H.greekmelody	@ltx/en_us_dedes/he.h.m4:heHE.SyKyrieMouFos.greekname
ltx/en_us_dedes/me.m04.d15:meMA.Ode5C1H.incipit	@ltx/en_us_dedes/he.h.m4:heHE.SyKyrieMouFos.incipit
ltx/en_us_dedes/me.m04.d15:meMA.Ode5C1H.melody	@ltx/en_us_dedes/he.h.m4:heHE.SyKyrieMouFos.melody
ltx/en_us_dedes/me.m04.d15:meMA.Ode5C1H.mode	@ltx/en_us_dedes/miscellanea:misc.Mode4
ltx/en_us_dedes/me.m04.d15:meMA.Ode5C1H.ode	@ltx/en_us_dedes/miscellanea:misc.Ode4
ltx/en_us_dedes/me.m04.d15:meMA.Ode5C1H.text	@ltx/en_us_dedes/he.h.m4:heHE.SyKyrieMouFos.text
ltx/en_us_dedes/me.m04.d15:meMA.Ode5C1T.incipit	…
ltx/en_us_dedes/me.m04.d15:meMA.Ode5C1T.melody	@ltx/en_us_dedes/he.h.m4:heHE.SyKyrieMouFos.name
ltx/en_us_dedes/me.m04.d15:meMA.Ode5C1T.mode	@ltx/en_us_dedes/miscellanea:misc.Mode4
ltx/en_us_dedes/me.m04.d15:meMA.Ode5C1T.ode	@ltx/en_us_dedes/miscellanea:misc.Ode5
ltx/en_us_dedes/me.m04.d15:meMA.Ode5C1T.text	
ltx/en_us_dedes/me.m04.d15:meMA.Ode6C11.greekmelody	@ltx/en_us_dedes/he.h.m4:heHE.ThysoSoiMetaFonis.greekname
ltx/en_us_dedes/me.m04.d15:meMA.Ode6C11.incipit	…
ltx/en_us_dedes/me.m04.d15:meMA.Ode6C11.melody	@ltx/en_us_dedes/he.h.m4:heHE.ThysoSoiMetaFonis.name
ltx/en_us_dedes/me.m04.d15:meMA.Ode6C11.mode	@ltx/en_us_dedes/miscellanea:misc.Mode4
ltx/en_us_dedes/me.m04.d15:meMA.Ode6C11.ode	@ltx/en_us_dedes/miscellanea:misc.Ode6
ltx/en_us_dedes/me.m04.d15:meMA.Ode6C11.text	
ltx/en_us_dedes/me.m04.d15:meMA.Ode6C12.incipit	…
ltx/en_us_dedes/me.m04.d15:meMA.Ode6C12.melody	@ltx/en_us_dedes/he.h.m4:heHE.ThysoSoiMetaFonis.name
ltx/en_us_dedes/me.m04.d15:meMA.Ode6C12.mode	@ltx/en_us_dedes/miscellanea:misc.Mode4
ltx/en_us_dedes/me.m04.d15:meMA.Ode6C12.ode	@ltx/en_us_dedes/miscellanea:misc.Ode6
ltx/en_us_dedes/me.m04.d15:meMA.Ode6C12.text	
ltx/en_us_dedes/me.m04.d15:meMA.Ode6C13.incipit	…
ltx/en_us_dedes/me.m04.d15:meMA.Ode6C13.melody	@ltx/en_us_dedes/he.h.m4:heHE.ThysoSoiMetaFonis.name
ltx/en_us_dedes/me.m04.d15:meMA.Ode6C13.mode	@ltx/en_us_dedes/miscellanea:misc.Mode4
ltx/en_us_dedes/me.m04.d15:meMA.Ode6C13.ode	@ltx/en_us_dedes/miscellanea:misc.Ode6
ltx/en_us_dedes/me.m04.d15:meMA.Ode6C13.text	
ltx/en_us_dedes/me.m04.d15:meMA.Ode6C1H.greekmelody	@ltx/en_us_dedes/he.h.m4:heHE.ThysoSoiMetaFonis.greekname
ltx/en_us_dedes/me.m04.d15:meMA.Ode6C1H.incipit	@ltx/en_us_dedes/he.h.m4:heHE.ThysoSoiMetaFonis.incipit
ltx/en_us_dedes/me.m04.d15:meMA.Ode6C1H.melody	@ltx/en_us_dedes/he.h.m4:heHE.ThysoSoiMetaFonis.melody
ltx/en_us_dedes/me.m04.d15:meMA.Ode6C1H.mode	@ltx/en_us_dedes/miscellanea:misc.Mode4
ltx/en_us_dedes/me.m04.d15:meMA.Ode6C1H.ode	@ltx/en_us_dedes/miscellanea:misc.Ode6
ltx/en_us_dedes/me.m04.d15:meMA.Ode6C1H.text	@ltx/en_us_dedes/he.h.m4:heHE.ThysoSoiMetaFonis.text
ltx/en_us_dedes/me.m04.d15:meMA.Ode6C1T.incipit	…
ltx/en_us_dedes/me.m04.d15:meMA.Ode6C1T.melody	@ltx/en_us_dedes/he.h.m4:heHE.ThysoSoiMetaFonis.name
ltx/en_us_dedes/me.m04.d15:meMA.Ode6C1T.mode	@ltx/en_us_dedes/miscellanea:misc.Mode4
ltx/en_us_dedes/me.m04.d15:meMA.Ode6C1T.ode	@ltx/en_us_dedes/miscellanea:misc.Ode6
ltx/en_us_dedes/me.m04.d15:meMA.Ode6C1T.text	
ltx/en_us_dedes/me.m04.d15:meMA.Ode7C11.greekmelody	@ltx/en_us_dedes/he.h.m4:heHE.EnTiKaminoAvramiaioi.greekname
ltx/en_us_dedes/me.m04.d15:meMA.Ode7C11.incipit	…
ltx/en_us_dedes/me.m04.d15:meMA.Ode7C11.melody	@ltx/en_us_dedes/he.h.m4:heHE.EnTiKaminoAvramiaioi.name
ltx/en_us_dedes/me.m04.d15:meMA.Ode7C11.mode	@ltx/en_us_dedes/miscellanea:misc.Mode4
ltx/en_us_dedes/me.m04.d15:meMA.Ode7C11.ode	@ltx/en_us_dedes/miscellanea:misc.Ode7
ltx/en_us_dedes/me.m04.d15:meMA.Ode7C11.text	
ltx/en_us_dedes/me.m04.d15:meMA.Ode7C12.incipit	…
ltx/en_us_dedes/me.m04.d15:meMA.Ode7C12.melody	@ltx/en_us_dedes/he.h.m4:heHE.EnTiKaminoAvramiaioi.name
ltx/en_us_dedes/me.m04.d15:meMA.Ode7C12.mode	@ltx/en_us_dedes/miscellanea:misc.Mode4
ltx/en_us_dedes/me.m04.d15:meMA.Ode7C12.ode	@ltx/en_us_dedes/miscellanea:misc.Ode7
ltx/en_us_dedes/me.m04.d15:meMA.Ode7C12.text	
ltx/en_us_dedes/me.m04.d15:meMA.Ode7C13.incipit	…
ltx/en_us_dedes/me.m04.d15:meMA.Ode7C13.melody	@ltx/en_us_dedes/he.h.m4:heHE.EnTiKaminoAvramiaioi.name
ltx/en_us_dedes/me.m04.d15:meMA.Ode7C13.mode	@ltx/en_us_dedes/miscellanea:misc.Mode4
ltx/en_us_dedes/me.m04.d15:meMA.Ode7C13.ode	@ltx/en_us_dedes/miscellanea:misc.Ode7
ltx/en_us_dedes/me.m04.d15:meMA.Ode7C13.text	
ltx/en_us_dedes/me.m04.d15:meMA.Ode7C1H.greekmelody	@ltx/en_us_dedes/he.h.m4:heHE.EnTiKaminoAvramiaioi.greekname
ltx/en_us_dedes/me.m04.d15:meMA.Ode7C1H.incipit	@ltx/en_us_dedes/he.h.m4:heHE.EnTiKaminoAvramiaioi.incipit
ltx/en_us_dedes/me.m04.d15:meMA.Ode7C1H.melody	@ltx/en_us_dedes/he.h.m4:heHE.EnTiKaminoAvramiaioi.melody
ltx/en_us_dedes/me.m04.d15:meMA.Ode7C1H.mode	@ltx/en_us_dedes/miscellanea:misc.Mode4
ltx/en_us_dedes/me.m04.d15:meMA.Ode7C1H.ode	@ltx/en_us_dedes/miscellanea:misc.Ode7
ltx/en_us_dedes/me.m04.d15:meMA.Ode7C1H.text	@ltx/en_us_dedes/he.h.m4:heHE.EnTiKaminoAvramiaioi.text
ltx/en_us_dedes/me.m04.d15:meMA.Ode7C1T.incipit	…
ltx/en_us_dedes/me.m04.d15:meMA.Ode7C1T.melody	@ltx/en_us_dedes/he.h.m4:heHE.EnTiKaminoAvramiaioi.name
ltx/en_us_dedes/me.m04.d15:meMA.Ode7C1T.mode	@ltx/en_us_dedes/miscellanea:misc.Mode4
ltx/en_us_dedes/me.m04.d15:meMA.Ode7C1T.ode	@ltx/en_us_dedes/miscellanea:misc.Ode7
ltx/en_us_dedes/me.m04.d15:meMA.Ode7C1T.text	
ltx/en_us_dedes/me.m04.d15:meMA.Ode8C11.greekmelody	@ltx/en_us_dedes/he.h.m4:heHE.CheirasEkpetasasDaniil.greekname
ltx/en_us_dedes/me.m04.d15:meMA.Ode8C11.incipit	…
ltx/en_us_dedes/me.m04.d15:meMA.Ode8C11.melody	@ltx/en_us_dedes/he.h.m4:heHE.CheirasEkpetasasDaniil.name
ltx/en_us_dedes/me.m04.d15:meMA.Ode8C11.mode	@ltx/en_us_dedes/miscellanea:misc.Mode4
ltx/en_us_dedes/me.m04.d15:meMA.Ode8C11.ode	@ltx/en_us_dedes/miscellanea:misc.Ode8
ltx/en_us_dedes/me.m04.d15:meMA.Ode8C11.text	
ltx/en_us_dedes/me.m04.d15:meMA.Ode8C12.incipit	…
ltx/en_us_dedes/me.m04.d15:meMA.Ode8C12.melody	@ltx/en_us_dedes/he.h.m4:heHE.CheirasEkpetasasDaniil.name
ltx/en_us_dedes/me.m04.d15:meMA.Ode8C12.mode	@ltx/en_us_dedes/miscellanea:misc.Mode4
ltx/en_us_dedes/me.m04.d15:meMA.Ode8C12.ode	@ltx/en_us_dedes/miscellanea:misc.Ode8
ltx/en_us_dedes/me.m04.d15:meMA.Ode8C12.text	
ltx/en_us_dedes/me.m04.d15:meMA.Ode8C13.incipit	…
ltx/en_us_dedes/me.m04.d15:meMA.Ode8C13.melody	@ltx/en_us_dedes/he.h.m4:heHE.CheirasEkpetasasDaniil.name
ltx/en_us_dedes/me.m04.d15:meMA.Ode8C13.mode	@ltx/en_us_dedes/miscellanea:misc.Mode4
ltx/en_us_dedes/me.m04.d15:meMA.Ode8C13.ode	@ltx/en_us_dedes/miscellanea:misc.Ode8
ltx/en_us_dedes/me.m04.d15:meMA.Ode8C13.text	
ltx/en_us_dedes/me.m04.d15:meMA.Ode8C14.incipit	…
ltx/en_us_dedes/me.m04.d15:meMA.Ode8C14.melody	@ltx/en_us_dedes/he.h.m4:heHE.CheirasEkpetasasDaniil.name
ltx/en_us_dedes/me.m04.d15:meMA.Ode8C14.mode	@ltx/en_us_dedes/miscellanea:misc.Mode4
ltx/en_us_dedes/me.m04.d15:meMA.Ode8C14.ode	@ltx/en_us_dedes/miscellanea:misc.Ode8
ltx/en_us_dedes/me.m04.d15:meMA.Ode8C14.text	
ltx/en_us_dedes/me.m04.d15:meMA.Ode8C1H.greekmelody	@ltx/en_us_dedes/he.h.m4:heHE.CheirasEkpetasasDaniil.greekname
ltx/en_us_dedes/me.m04.d15:meMA.Ode8C1H.incipit	@ltx/en_us_dedes/he.h.m4:heHE.CheirasEkpetasasDaniil.incipit
ltx/en_us_dedes/me.m04.d15:meMA.Ode8C1H.melody	@ltx/en_us_dedes/he.h.m4:heHE.CheirasEkpetasasDaniil.melody
ltx/en_us_dedes/me.m04.d15:meMA.Ode8C1H.mode	@ltx/en_us_dedes/miscellanea:misc.Mode4
ltx/en_us_dedes/me.m04.d15:meMA.Ode8C1H.ode	@ltx/en_us_dedes/miscellanea:misc.Ode8
ltx/en_us_dedes/me.m04.d15:meMA.Ode8C1H.text	@ltx/en_us_dedes/he.h.m4:heHE.CheirasEkpetasasDaniil.text
ltx/en_us_dedes/me.m04.d15:meMA.Ode8C1T.incipit	…
ltx/en_us_dedes/me.m04.d15:meMA.Ode8C1T.melody	@ltx/en_us_dedes/he.h.m4:heHE.CheirasEkpetasasDaniil.name
ltx/en_us_dedes/me.m04.d15:meMA.Ode8C1T.mode	@ltx/en_us_dedes/miscellanea:misc.Mode4
ltx/en_us_dedes/me.m04.d15:meMA.Ode8C1T.ode	@ltx/en_us_dedes/miscellanea:misc.Ode8
ltx/en_us_dedes/me.m04.d15:meMA.Ode8C1T.text	
ltx/en_us_dedes/me.m04.d15:meMA.Ode9C11.greekmelody	@ltx/en_us_dedes/he.h.m4:heHE.LithosAcheirotmitos.greekname
ltx/en_us_dedes/me.m04.d15:meMA.Ode9C11.incipit	…
ltx/en_us_dedes/me.m04.d15:meMA.Ode9C11.melody	@ltx/en_us_dedes/he.h.m4:heHE.LithosAcheirotmitos.name
ltx/en_us_dedes/me.m04.d15:meMA.Ode9C11.mode	@ltx/en_us_dedes/miscellanea:misc.Mode4
ltx/en_us_dedes/me.m04.d15:meMA.Ode9C11.ode	@ltx/en_us_dedes/miscellanea:misc.Ode9
ltx/en_us_dedes/me.m04.d15:meMA.Ode9C11.text	
ltx/en_us_dedes/me.m04.d15:meMA.Ode9C12.incipit	…
ltx/en_us_dedes/me.m04.d15:meMA.Ode9C12.melody	@ltx/en_us_dedes/he.h.m4:heHE.LithosAcheirotmitos.name
ltx/en_us_dedes/me.m04.d15:meMA.Ode9C12.mode	@ltx/en_us_dedes/miscellanea:misc.Mode4
ltx/en_us_dedes/me.m04.d15:meMA.Ode9C12.ode	@ltx/en_us_dedes/miscellanea:misc.Ode9
ltx/en_us_dedes/me.m04.d15:meMA.Ode9C12.text	
ltx/en_us_dedes/me.m04.d15:meMA.Ode9C13.incipit	…
ltx/en_us_dedes/me.m04.d15:meMA.Ode9C13.melody	@ltx/en_us_dedes/he.h.m4:heHE.LithosAcheirotmitos.name
ltx/en_us_dedes/me.m04.d15:meMA.Ode9C13.mode	@ltx/en_us_dedes/miscellanea:misc.Mode4
ltx/en_us_dedes/me.m04.d15:meMA.Ode9C13.ode	@ltx/en_us_dedes/miscellanea:misc.Ode9
ltx/en_us_dedes/me.m04.d15:meMA.Ode9C13.text	
ltx/en_us_dedes/me.m04.d15:meMA.Ode9C14.incipit	…
ltx/en_us_dedes/me.m04.d15:meMA.Ode9C14.melody	@ltx/en_us_dedes/he.h.m4:heHE.LithosAcheirotmitos.name
ltx/en_us_dedes/me.m04.d15:meMA.Ode9C14.mode	@ltx/en_us_dedes/miscellanea:misc.Mode4
ltx/en_us_dedes/me.m04.d15:meMA.Ode9C14.ode	@ltx/en_us_dedes/miscellanea:misc.Ode9
ltx/en_us_dedes/me.m04.d15:meMA.Ode9C14.text	
ltx/en_us_dedes/me.m04.d15:meMA.Ode9C1H.greekmelody	@ltx/en_us_dedes/he.h.m4:heHE.LithosAcheirotmitos.greekname
ltx/en_us_dedes/me.m04.d15:meMA.Ode9C1H.incipit	@ltx/en_us_dedes/he.h.m4:heHE.LithosAcheirotmitos.incipit
ltx/en_us_dedes/me.m04.d15:meMA.Ode9C1H.melody	@ltx/en_us_dedes/he.h.m4:heHE.LithosAcheirotmitos.melody
ltx/en_us_dedes/me.m04.d15:meMA.Ode9C1H.mode	@ltx/en_us_dedes/miscellanea:misc.Mode4
ltx/en_us_dedes/me.m04.d15:meMA.Ode9C1H.ode	@ltx/en_us_dedes/miscellanea:misc.Ode9
ltx/en_us_dedes/me.m04.d15:meMA.Ode9C1H.text	@ltx/en_us_dedes/he.h.m4:heHE.LithosAcheirotmitos.text
ltx/en_us_dedes/me.m04.d15:meMA.Ode9C1T.incipit	…
ltx/en_us_dedes/me.m04.d15:meMA.Ode9C1T.melody	@ltx/en_us_dedes/he.h.m4:heHE.LithosAcheirotmitos.name
ltx/en_us_dedes/me.m04.d15:meMA.Ode9C1T.mode	@ltx/en_us_dedes/miscellanea:misc.Mode4
ltx/en_us_dedes/me.m04.d15:meMA.Ode9C1T.ode	@ltx/en_us_dedes/miscellanea:misc.Ode9
ltx/en_us_dedes/me.m04.d15:meMA.Ode9C1T.text	
ltx/en_us_dedes/me.m04.d15:meVE.Apolytikion1ger.greekmelody	@ltx/en_us_dedes/he.a.m1:heAU.TisErimouPolitis.greekname
ltx/en_us_dedes/me.m04.d15:meVE.Apolytikion1ger.incipit	…
ltx/en_us_dedes/me.m04.d15:meVE.Apolytikion1ger.melody	@ltx/en_us_dedes/he.a.m1:heAU.TisErimouPolitis.name
ltx/en_us_dedes/me.m04.d15:meVE.Apolytikion1ger.mode	@ltx/en_us_dedes/miscellanea:misc.Mode1
ltx/en_us_dedes/me.m04.d15:meVE.Apolytikion1ger.poet	@ltx/en_us_dedes/poets:po.Gerasimou
ltx/en_us_dedes/me.m04.d15:meVE.Apolytikion1ger.text	
ltx/en_us_dedes/me.m04.d15:meVE.Apolytikion2ger.greekmelody	@ltx/en_us_dedes/he.a.m4:heAU.TachyProkatalave.greekname
ltx/en_us_dedes/me.m04.d15:meVE.Apolytikion2ger.incipit	…
ltx/en_us_dedes/me.m04.d15:meVE.Apolytikion2ger.melody	@ltx/en_us_dedes/he.a.m4:heAU.TachyProkatalave.name
ltx/en_us_dedes/me.m04.d15:meVE.Apolytikion2ger.mode	@ltx/en_us_dedes/miscellanea:misc.Mode4
ltx/en_us_dedes/me.m04.d15:meVE.Apolytikion2ger.poet	@ltx/en_us_dedes/poets:po.Gerasimou
ltx/en_us_dedes/me.m04.d15:meVE.Apolytikion2ger.text	
ltx/en_us_dedes/me.m04.d15:meVE.SticStavrotheotokion.greekmelody	@ltx/en_us_dedes/he.a.m4:heAU.OsGennaionEnMartysi.greekname
ltx/en_us_dedes/me.m04.d15:meVE.SticStavrotheotokion.incipit	@ltx/en_us_dedes/oc.m4.d6:ocMA.AposTheotokion.incipit
ltx/en_us_dedes/me.m04.d15:meVE.SticStavrotheotokion.melody	@ltx/en_us_dedes/he.a.m4:heAU.OsGennaionEnMartysi.name
ltx/en_us_dedes/me.m04.d15:meVE.SticStavrotheotokion.mode	@ltx/en_us_dedes/miscellanea:misc.Mode4
ltx/en_us_dedes/me.m04.d15:meVE.SticStavrotheotokion.text	@ltx/en_us_dedes/oc.m4.d6:ocMA.AposTheotokion.text
ltx/en_us_dedes/me.m04.d15:meVE.SticTheotokion.greekmelody	@ltx/en_us_dedes/he.a.m4:heAU.OsGennaionEnMartysi.greekname
ltx/en_us_dedes/me.m04.d15:meVE.SticTheotokion.incipit	@ltx/en_us_dedes/me.m04.d08:meVE.SticTheotokion.incipit
ltx/en_us_dedes/me.m04.d15:meVE.SticTheotokion.melody	@ltx/en_us_dedes/he.a.m4:heAU.OsGennaionEnMartysi.name
ltx/en_us_dedes/me.m04.d15:meVE.SticTheotokion.mode	@ltx/en_us_dedes/miscellanea:misc.Mode4
ltx/en_us_dedes/me.m04.d15:meVE.SticTheotokion.text	@ltx/en_us_dedes/me.m04.d08:meVE.SticTheotokion.text
ltx/en_us_dedes/me.m04.d15:meVE.Stichera01.greekmelody	@ltx/en_us_dedes/he.a.m4:heAU.OsGennaionEnMartysi.greekname
ltx/en_us_dedes/me.m04.d15:meVE.Stichera01.incipit	With a valorous frame of…
ltx/en_us_dedes/me.m04.d15:meVE.Stichera01.melody	@ltx/en_us_dedes/he.a.m4:heAU.OsGennaionEnMartysi.name
ltx/en_us_dedes/me.m04.d15:meVE.Stichera01.mode	@ltx/en_us_dedes/miscellanea:misc.Mode4
ltx/en_us_dedes/me.m04.d15:meVE.Stichera01.text	With a valorous frame of mind * you proceeded to arduous * and most painful contests, entanglements and snares, * wise one, not sparing your flesh at all, * but choosing to die instead, * for your love for God was strong. * And today all the Church of Christ * rightly calls you blest, * and extols you and celebrates the feast of your memorial with splendor, * Great-martyr Crescens, all-glorious.
ltx/en_us_dedes/me.m04.d15:meVE.Stichera02.incipit	As they savagely scraped your…
ltx/en_us_dedes/me.m04.d15:meVE.Stichera02.melody	@ltx/en_us_dedes/he.a.m4:heAU.OsGennaionEnMartysi.name
ltx/en_us_dedes/me.m04.d15:meVE.Stichera02.mode	@ltx/en_us_dedes/miscellanea:misc.Mode4
ltx/en_us_dedes/me.m04.d15:meVE.Stichera02.text	As they savagely scraped your flesh * and they gouged out your side and ribs, * weakening your strength with a multitude of wounds, * they never once heard you to renounce * the ven’rable name of Christ, * O adornment of the Church * and the beauty of martyr saints. * For this reason now * we extol you and venerate your relics, as we celebrate and honor * the holy day of your memory.
ltx/en_us_dedes/me.m04.d15:meVE.Stichera03.incipit	Set aflame with a sacred…
ltx/en_us_dedes/me.m04.d15:meVE.Stichera03.melody	@ltx/en_us_dedes/he.a.m4:heAU.OsGennaionEnMartysi.name
ltx/en_us_dedes/me.m04.d15:meVE.Stichera03.mode	@ltx/en_us_dedes/miscellanea:misc.Mode4
ltx/en_us_dedes/me.m04.d15:meVE.Stichera03.text	Set aflame with a sacred love * for your Maker, O all-extolled * Crescens, in the midst of the fire you stood firm; * and you remained totally unburnt * until you commended your * blessed soul into the hands * of our God and Deliverer. * Therefore you received * crowns and medals of victory, entreating that the faithful extol you * receive forgiveness of all their sins.
