ltx/en_us_dedes/sy.m02.d05:cl.syMA.commemoration01.text	[saint/com 1]
ltx/en_us_dedes/sy.m02.d05:cl.syMA.commemoration02.text	[saint/com 2]
ltx/en_us_dedes/sy.m02.d05:cl.syMA.commemoration03.text	[saint/com 3]
ltx/en_us_dedes/sy.m02.d05:cl.syMA.commemoration04.text	[saint/com 4]
ltx/en_us_dedes/sy.m02.d05:cl.syMA.commemoration05.text	[saint/com 5]
ltx/en_us_dedes/sy.m02.d05:cl.syMA.commemoration06.text	[saint/com list]
ltx/en_us_dedes/sy.m02.d05:syMA.commemoration01.couplet1.title	@ltx/en_us_dedes/titles:ti.Verses
ltx/en_us_dedes/sy.m02.d05:syMA.commemoration01.couplet1.verse1	
ltx/en_us_dedes/sy.m02.d05:syMA.commemoration01.couplet1.verse2	
ltx/en_us_dedes/sy.m02.d05:syMA.commemoration01.narration.p01	
ltx/en_us_dedes/sy.m02.d05:syMA.commemoration01.narration.p02	
ltx/en_us_dedes/sy.m02.d05:syMA.commemoration01.single1	
ltx/en_us_dedes/sy.m02.d05:syMA.commemoration01.text	On February 5 we commemorate the holy martyr Agatha.
ltx/en_us_dedes/sy.m02.d05:syMA.commemoration02.couplet1.title	@ltx/en_us_dedes/titles:ti.Verses
ltx/en_us_dedes/sy.m02.d05:syMA.commemoration02.couplet1.verse1	
ltx/en_us_dedes/sy.m02.d05:syMA.commemoration02.couplet1.verse2	
ltx/en_us_dedes/sy.m02.d05:syMA.commemoration02.narration.p01	
ltx/en_us_dedes/sy.m02.d05:syMA.commemoration02.text	On this day we also commemorate our devout father Theodosius of Skopelos.
ltx/en_us_dedes/sy.m02.d05:syMA.commemoration03.couplet1.title	@ltx/en_us_dedes/titles:ti.Verses
ltx/en_us_dedes/sy.m02.d05:syMA.commemoration03.couplet1.verse1	
ltx/en_us_dedes/sy.m02.d05:syMA.commemoration03.couplet1.verse2	
ltx/en_us_dedes/sy.m02.d05:syMA.commemoration03.text	On this day we also commemorate our devout father Polyeuctus, Patriarch of Constantinople.
ltx/en_us_dedes/sy.m02.d05:syMA.commemoration04.couplet1.title	@ltx/en_us_dedes/titles:ti.Verses
ltx/en_us_dedes/sy.m02.d05:syMA.commemoration04.couplet1.verse1	
ltx/en_us_dedes/sy.m02.d05:syMA.commemoration04.couplet1.verse2	
ltx/en_us_dedes/sy.m02.d05:syMA.commemoration04.text	On this day we also commemorate the holy new martyr Anthony of Athens who witnessed in Constantinople by the sword in the year 1774.
ltx/en_us_dedes/sy.m02.d05:syMA.lastline	By the intercessions of Your Saints, O God, have mercy on us. Amen.
