ltx/en_us_dedes/sy.m12.d23:syMA.commemoration01.couplet1.title	@ltx/en_us_dedes/titles:ti.Verses
ltx/en_us_dedes/sy.m12.d23:syMA.commemoration01.couplet1.verse1	
ltx/en_us_dedes/sy.m12.d23:syMA.commemoration01.couplet1.verse2	
ltx/en_us_dedes/sy.m12.d23:syMA.commemoration01.narration.p01	
ltx/en_us_dedes/sy.m12.d23:syMA.commemoration01.narration.p02	
ltx/en_us_dedes/sy.m12.d23:syMA.commemoration01.single1	
ltx/en_us_dedes/sy.m12.d23:syMA.commemoration01.text	On December 23, we commemorate the holy Ten Martyrs who witnessed in Crete.
ltx/en_us_dedes/sy.m12.d23:syMA.commemoration02.couplet1.title	@ltx/en_us_dedes/titles:ti.Verses
ltx/en_us_dedes/sy.m12.d23:syMA.commemoration02.couplet1.verse1	
ltx/en_us_dedes/sy.m12.d23:syMA.commemoration02.couplet1.verse2	
ltx/en_us_dedes/sy.m12.d23:syMA.commemoration02.narration.p01	
ltx/en_us_dedes/sy.m12.d23:syMA.commemoration02.narration.p02	
ltx/en_us_dedes/sy.m12.d23:syMA.commemoration02.narration.p03	
ltx/en_us_dedes/sy.m12.d23:syMA.commemoration02.narration.p04	
ltx/en_us_dedes/sy.m12.d23:syMA.commemoration02.text	On this day we also commemorate our devout father Paul, Archbishop of Neocesaria, one of the 318 holy fathers of the First Council in Nicea.
ltx/en_us_dedes/sy.m12.d23:syMA.commemoration03.couplet1.title	@ltx/en_us_dedes/titles:ti.Verses
ltx/en_us_dedes/sy.m12.d23:syMA.commemoration03.couplet1.verse1	
ltx/en_us_dedes/sy.m12.d23:syMA.commemoration03.couplet1.verse2	
ltx/en_us_dedes/sy.m12.d23:syMA.commemoration03.text	On this day was the consecration of the holy Great Church of Christ.
ltx/en_us_dedes/sy.m12.d23:syMA.commemoration04.couplet1.title	@ltx/en_us_dedes/titles:ti.Verses
ltx/en_us_dedes/sy.m12.d23:syMA.commemoration04.couplet1.verse1	
ltx/en_us_dedes/sy.m12.d23:syMA.commemoration04.couplet1.verse2	
ltx/en_us_dedes/sy.m12.d23:syMA.commemoration04.text	On this day we commemorate our holy and God-bearing father Nahum the wonder-worker, the enlightener and preacher of Bulgaria.
ltx/en_us_dedes/sy.m12.d23:syMA.commemoration05.couplet1.title	@ltx/en_us_dedes/titles:ti.Verses
ltx/en_us_dedes/sy.m12.d23:syMA.commemoration05.couplet1.verse1	
ltx/en_us_dedes/sy.m12.d23:syMA.commemoration05.couplet1.verse2	
ltx/en_us_dedes/sy.m12.d23:syMA.commemoration05.text	St. Schinon the Martyr died by the sword.
ltx/en_us_dedes/sy.m12.d23:syMA.lastline	By the intercessions of Your Saints, O God, have mercy on us. Amen.
