ltx/en_us_dedes/sy.m04.d12:cl.syMA.commemoration01.text	[saint/com 1]
ltx/en_us_dedes/sy.m04.d12:cl.syMA.commemoration02.text	[saint/com 2]
ltx/en_us_dedes/sy.m04.d12:cl.syMA.commemoration03.text	[saint/com 3]
ltx/en_us_dedes/sy.m04.d12:cl.syMA.commemoration04.text	[saint/com 4]
ltx/en_us_dedes/sy.m04.d12:cl.syMA.commemoration05.text	[saint/com 5]
ltx/en_us_dedes/sy.m04.d12:cl.syMA.commemoration06.text	[saint/com list]
ltx/en_us_dedes/sy.m04.d12:syMA.commemoration01.couplet1.title	@ltx/en_us_dedes/titles:ti.Verses
ltx/en_us_dedes/sy.m04.d12:syMA.commemoration01.couplet1.verse1	
ltx/en_us_dedes/sy.m04.d12:syMA.commemoration01.couplet1.verse2	
ltx/en_us_dedes/sy.m04.d12:syMA.commemoration01.narration.p01	
ltx/en_us_dedes/sy.m04.d12:syMA.commemoration01.single1	
ltx/en_us_dedes/sy.m04.d12:syMA.commemoration01.text	On April 12, we commemorate our devout father Basil the Confessor, Bishop of Parium.
ltx/en_us_dedes/sy.m04.d12:syMA.commemoration02.text	On this day in the year 942, the precious Belt (also called sash, garment and cincture) of our most-holy Lady Theotokos was transferred from the Diocese of Zela to Constantinople, during the reign of Constantine and Romanos Porphyrogenitoi. Afterwards, on August 31, it was moved to the holy shrine of Chalcoprateia.
ltx/en_us_dedes/sy.m04.d12:syMA.commemoration03.couplet1.title	@ltx/en_us_dedes/titles:ti.Verses
ltx/en_us_dedes/sy.m04.d12:syMA.commemoration03.couplet1.verse1	
ltx/en_us_dedes/sy.m04.d12:syMA.commemoration03.couplet1.verse2	
ltx/en_us_dedes/sy.m04.d12:syMA.commemoration03.narration.p01	
ltx/en_us_dedes/sy.m04.d12:syMA.commemoration03.text	On this day we also commemorate our devout mother Anthousa, daughter of Emperor Constantine V.
ltx/en_us_dedes/sy.m04.d12:syMA.commemoration04.couplet1.title	@ltx/en_us_dedes/titles:ti.Verses
ltx/en_us_dedes/sy.m04.d12:syMA.commemoration04.couplet1.verse1	
ltx/en_us_dedes/sy.m04.d12:syMA.commemoration04.couplet1.verse2	
ltx/en_us_dedes/sy.m04.d12:syMA.commemoration04.text	On this day we also commemorate the holy martyrs Demes and Proteon.
ltx/en_us_dedes/sy.m04.d12:syMA.commemoration05.couplet1.title	@ltx/en_us_dedes/titles:ti.Verses
ltx/en_us_dedes/sy.m04.d12:syMA.commemoration05.couplet1.verse1	
ltx/en_us_dedes/sy.m04.d12:syMA.commemoration05.couplet1.verse2	
ltx/en_us_dedes/sy.m04.d12:syMA.commemoration05.text	On this day we also commemorate the holy hieromartyr Artemon.
ltx/en_us_dedes/sy.m04.d12:syMA.commemoration06.couplet1.title	@ltx/en_us_dedes/titles:ti.Verses
ltx/en_us_dedes/sy.m04.d12:syMA.commemoration06.couplet1.verse1	
ltx/en_us_dedes/sy.m04.d12:syMA.commemoration06.couplet1.verse2	
ltx/en_us_dedes/sy.m04.d12:syMA.commemoration06.text	On this day we also commemorate the three holy martyrs, Menas, David and John.
ltx/en_us_dedes/sy.m04.d12:syMA.commemoration07.couplet1.title	@ltx/en_us_dedes/titles:ti.Verses
ltx/en_us_dedes/sy.m04.d12:syMA.commemoration07.couplet1.verse1	
ltx/en_us_dedes/sy.m04.d12:syMA.commemoration07.couplet1.verse2	
ltx/en_us_dedes/sy.m04.d12:syMA.commemoration07.text	Devout Akakios the new, who lived as an ascetic in the Skete of Kafsokalivia on Mt. Athos in the 18th century, died in peace.
ltx/en_us_dedes/sy.m04.d12:syMA.lastline	By their holy intercessions, O Christ God, have mercy on us. Amen.
