ltx/en_us_dedes/pe.d102:peDA.commemoration.full	Wednesday of the Fifth Week
ltx/en_us_dedes/pe.d102:peDA.commemoration.short	Leave-taking of Mid-Pentecost
ltx/en_us_dedes/pe.d102:peDA.dismissal	@ltx/en_us_dedes/dismissals:dis00.resurrection
ltx/en_us_dedes/pe.d102:peDA.insert1	
ltx/en_us_dedes/pe.d102:peDA.insert2	
ltx/en_us_dedes/pe.d102:peDA.note	
ltx/en_us_dedes/pe.d102:peHO.commemorations	
ltx/en_us_dedes/pe.d102:peHO.daytitle	
ltx/en_us_dedes/pe.d102:peHO.description1	
ltx/en_us_dedes/pe.d102:peHO.description2	
ltx/en_us_dedes/pe.d102:peHO.note1	
ltx/en_us_dedes/pe.d102:peHO.note2	
ltx/en_us_dedes/pe.d102:peLI.MM.CommunionHymn.text	@ltx/en_us_dedes/properties:media.key
ltx/en_us_dedes/pe.d102:peLI.Megalynarion.text	@ltx/en_us_dedes/pe.d095:peLI.Megalynarion.text
ltx/en_us_dedes/pe.d102:peLI.TheotokosHymn.incipit	@ltx/en_us_dedes/pe.d095:peLI.TheotokosHymn.incipit
ltx/en_us_dedes/pe.d102:peLI.TheotokosHymn.mode	@ltx/en_us_dedes/pe.d095:peLI.TheotokosHymn.mode
ltx/en_us_dedes/pe.d102:peLI.TheotokosHymn.text	@ltx/en_us_dedes/pe.d095:peLI.TheotokosHymn.text
ltx/en_us_dedes/pe.d102:peMA.C1.acrostic.notice1	@ltx/en_us_dedes/pe.d095:peMA.C1.acrostic.notice1
ltx/en_us_dedes/pe.d102:peMA.C1.acrostic.notice2	@ltx/en_us_dedes/pe.d095:peMA.C1.acrostic.notice2
ltx/en_us_dedes/pe.d102:peMA.C1.acrostic.text	@ltx/en_us_dedes/pe.d095:peMA.C1.acrostic.text
ltx/en_us_dedes/pe.d102:peMA.C1.acrostic.title	@ltx/en_us_dedes/pe.d095:peMA.C1.acrostic.title
ltx/en_us_dedes/pe.d102:peMA.C1.poet	@ltx/en_us_dedes/pe.d095:peMA.C1.poet
ltx/en_us_dedes/pe.d102:peMA.C1.title	@ltx/en_us_dedes/pe.d095:peMA.C1.title
ltx/en_us_dedes/pe.d102:peMA.C1.verse	@ltx/en_us_dedes/pe.d095:peMA.C1.verse
ltx/en_us_dedes/pe.d102:peMA.C2.acrostic.title	@ltx/en_us_dedes/pe.d095:peMA.C2.acrostic.title
ltx/en_us_dedes/pe.d102:peMA.C2.poet	@ltx/en_us_dedes/pe.d095:peMA.C2.poet
ltx/en_us_dedes/pe.d102:peMA.C2.title	@ltx/en_us_dedes/pe.d095:peMA.C2.title
ltx/en_us_dedes/pe.d102:peMA.C2.verse	@ltx/en_us_dedes/pe.d095:peMA.C2.verse
ltx/en_us_dedes/pe.d102:peMA.Exaposteilarion1.incipit	@ltx/en_us_dedes/pe.d095:peMA.Exaposteilarion1.incipit
ltx/en_us_dedes/pe.d102:peMA.Exaposteilarion1.melody	@ltx/en_us_dedes/pe.d095:peMA.Exaposteilarion1.melody
ltx/en_us_dedes/pe.d102:peMA.Exaposteilarion1.mode	@ltx/en_us_dedes/pe.d095:peMA.Exaposteilarion1.mode
ltx/en_us_dedes/pe.d102:peMA.Exaposteilarion1.text	@ltx/en_us_dedes/pe.d095:peMA.Exaposteilarion1.text
ltx/en_us_dedes/pe.d102:peMA.Kathisma11.greekmelody	@ltx/en_us_dedes/pe.d095:peMA.Kathisma11.greekmelody
ltx/en_us_dedes/pe.d102:peMA.Kathisma11.incipit	@ltx/en_us_dedes/pe.d095:peMA.Kathisma11.incipit
ltx/en_us_dedes/pe.d102:peMA.Kathisma11.melody	@ltx/en_us_dedes/pe.d095:peMA.Kathisma11.melody
ltx/en_us_dedes/pe.d102:peMA.Kathisma11.mode	@ltx/en_us_dedes/pe.d095:peMA.Kathisma11.mode
ltx/en_us_dedes/pe.d102:peMA.Kathisma11.text	@ltx/en_us_dedes/pe.d095:peMA.Kathisma11.text
ltx/en_us_dedes/pe.d102:peMA.Kathisma21.greekmelody	@ltx/en_us_dedes/pe.d095:peMA.Kathisma21.greekmelody
ltx/en_us_dedes/pe.d102:peMA.Kathisma21.incipit	@ltx/en_us_dedes/pe.d095:peMA.Kathisma21.incipit
ltx/en_us_dedes/pe.d102:peMA.Kathisma21.melody	@ltx/en_us_dedes/pe.d095:peMA.Kathisma21.melody
ltx/en_us_dedes/pe.d102:peMA.Kathisma21.mode	@ltx/en_us_dedes/pe.d095:peMA.Kathisma21.mode
ltx/en_us_dedes/pe.d102:peMA.Kathisma21.text	@ltx/en_us_dedes/pe.d095:peMA.Kathisma21.text
ltx/en_us_dedes/pe.d102:peMA.Kontakion1.incipit	@ltx/en_us_dedes/pe.d095:peMA.Kontakion1.incipit
ltx/en_us_dedes/pe.d102:peMA.Kontakion1.melody	@ltx/en_us_dedes/pe.d095:peMA.Kontakion1.melody
ltx/en_us_dedes/pe.d102:peMA.Kontakion1.mode	@ltx/en_us_dedes/pe.d095:peMA.Kontakion1.mode
ltx/en_us_dedes/pe.d102:peMA.Kontakion1.text	@ltx/en_us_dedes/pe.d095:peMA.Kontakion1.text
ltx/en_us_dedes/pe.d102:peMA.Lauds1.greekmelody	@ltx/en_us_dedes/pe.d095:peMA.Lauds1.greekmelody
ltx/en_us_dedes/pe.d102:peMA.Lauds1.incipit	@ltx/en_us_dedes/pe.d095:peMA.Lauds1.incipit
ltx/en_us_dedes/pe.d102:peMA.Lauds1.melody	@ltx/en_us_dedes/pe.d095:peMA.Lauds1.melody
ltx/en_us_dedes/pe.d102:peMA.Lauds1.mode	@ltx/en_us_dedes/pe.d095:peMA.Lauds1.mode
ltx/en_us_dedes/pe.d102:peMA.Lauds1.text	@ltx/en_us_dedes/pe.d095:peMA.Lauds1.text
ltx/en_us_dedes/pe.d102:peMA.Lauds2.incipit	@ltx/en_us_dedes/pe.d095:peMA.Lauds2.incipit
ltx/en_us_dedes/pe.d102:peMA.Lauds2.melody	@ltx/en_us_dedes/pe.d095:peMA.Lauds2.melody
ltx/en_us_dedes/pe.d102:peMA.Lauds2.mode	@ltx/en_us_dedes/pe.d095:peMA.Lauds2.mode
ltx/en_us_dedes/pe.d102:peMA.Lauds2.text	@ltx/en_us_dedes/pe.d095:peMA.Lauds2.text
ltx/en_us_dedes/pe.d102:peMA.Lauds3.incipit	@ltx/en_us_dedes/pe.d095:peMA.Lauds3.incipit
ltx/en_us_dedes/pe.d102:peMA.Lauds3.melody	@ltx/en_us_dedes/pe.d095:peMA.Lauds3.melody
ltx/en_us_dedes/pe.d102:peMA.Lauds3.mode	@ltx/en_us_dedes/pe.d095:peMA.Lauds3.mode
ltx/en_us_dedes/pe.d102:peMA.Lauds3.text	@ltx/en_us_dedes/pe.d095:peMA.Lauds3.text
ltx/en_us_dedes/pe.d102:peMA.LaudsGlory.incipit	@ltx/en_us_dedes/pe.d095:peMA.LaudsGlory.incipit
ltx/en_us_dedes/pe.d102:peMA.LaudsGlory.melody	@ltx/en_us_dedes/pe.d095:peMA.LaudsGlory.melody
ltx/en_us_dedes/pe.d102:peMA.LaudsGlory.mode	@ltx/en_us_dedes/pe.d095:peMA.LaudsGlory.mode
ltx/en_us_dedes/pe.d102:peMA.LaudsGlory.text	@ltx/en_us_dedes/pe.d095:peMA.LaudsGlory.text
ltx/en_us_dedes/pe.d102:peMA.MM.Lauds123as123.text	@ltx/en_us_dedes/properties:media.key
ltx/en_us_dedes/pe.d102:peMA.Ode1C11.greekmelody	@ltx/en_us_dedes/pe.d095:peMA.Ode1C11.greekmelody
ltx/en_us_dedes/pe.d102:peMA.Ode1C11.incipit	@ltx/en_us_dedes/pe.d095:peMA.Ode1C11.incipit
ltx/en_us_dedes/pe.d102:peMA.Ode1C11.melody	@ltx/en_us_dedes/pe.d095:peMA.Ode1C11.melody
ltx/en_us_dedes/pe.d102:peMA.Ode1C11.mode	@ltx/en_us_dedes/pe.d095:peMA.Ode1C11.mode
ltx/en_us_dedes/pe.d102:peMA.Ode1C11.ode	@ltx/en_us_dedes/pe.d095:peMA.Ode1C11.ode
ltx/en_us_dedes/pe.d102:peMA.Ode1C11.text	@ltx/en_us_dedes/pe.d095:peMA.Ode1C11.text
ltx/en_us_dedes/pe.d102:peMA.Ode1C12.incipit	@ltx/en_us_dedes/pe.d095:peMA.Ode1C12.incipit
ltx/en_us_dedes/pe.d102:peMA.Ode1C12.melody	@ltx/en_us_dedes/pe.d095:peMA.Ode1C12.melody
ltx/en_us_dedes/pe.d102:peMA.Ode1C12.mode	@ltx/en_us_dedes/pe.d095:peMA.Ode1C12.mode
ltx/en_us_dedes/pe.d102:peMA.Ode1C12.ode	@ltx/en_us_dedes/pe.d095:peMA.Ode1C12.ode
ltx/en_us_dedes/pe.d102:peMA.Ode1C12.text	@ltx/en_us_dedes/pe.d095:peMA.Ode1C12.text
ltx/en_us_dedes/pe.d102:peMA.Ode1C13.incipit	@ltx/en_us_dedes/pe.d095:peMA.Ode1C13.incipit
ltx/en_us_dedes/pe.d102:peMA.Ode1C13.melody	@ltx/en_us_dedes/pe.d095:peMA.Ode1C13.melody
ltx/en_us_dedes/pe.d102:peMA.Ode1C13.mode	@ltx/en_us_dedes/pe.d095:peMA.Ode1C13.mode
ltx/en_us_dedes/pe.d102:peMA.Ode1C13.ode	@ltx/en_us_dedes/pe.d095:peMA.Ode1C13.ode
ltx/en_us_dedes/pe.d102:peMA.Ode1C13.text	@ltx/en_us_dedes/pe.d095:peMA.Ode1C13.text
ltx/en_us_dedes/pe.d102:peMA.Ode1C1H.greekmelody	@ltx/en_us_dedes/pe.d095:peMA.Ode1C1H.greekmelody
ltx/en_us_dedes/pe.d102:peMA.Ode1C1H.incipit	@ltx/en_us_dedes/pe.d095:peMA.Ode1C1H.incipit
ltx/en_us_dedes/pe.d102:peMA.Ode1C1H.melody	@ltx/en_us_dedes/pe.d095:peMA.Ode1C1H.melody
ltx/en_us_dedes/pe.d102:peMA.Ode1C1H.mode	@ltx/en_us_dedes/pe.d095:peMA.Ode1C1H.mode
ltx/en_us_dedes/pe.d102:peMA.Ode1C1H.ode	@ltx/en_us_dedes/pe.d095:peMA.Ode1C1H.ode
ltx/en_us_dedes/pe.d102:peMA.Ode1C1H.text	@ltx/en_us_dedes/pe.d095:peMA.Ode1C1H.text
ltx/en_us_dedes/pe.d102:peMA.Ode1C1T.incipit	@ltx/en_us_dedes/pe.d095:peMA.Ode1C1T.incipit
ltx/en_us_dedes/pe.d102:peMA.Ode1C1T.melody	@ltx/en_us_dedes/pe.d095:peMA.Ode1C1T.melody
ltx/en_us_dedes/pe.d102:peMA.Ode1C1T.mode	@ltx/en_us_dedes/pe.d095:peMA.Ode1C1T.mode
ltx/en_us_dedes/pe.d102:peMA.Ode1C1T.ode	@ltx/en_us_dedes/pe.d095:peMA.Ode1C1T.ode
ltx/en_us_dedes/pe.d102:peMA.Ode1C1T.text	@ltx/en_us_dedes/pe.d095:peMA.Ode1C1T.text
ltx/en_us_dedes/pe.d102:peMA.Ode1C21.greekmelody	@ltx/en_us_dedes/pe.d095:peMA.Ode1C21.greekmelody
ltx/en_us_dedes/pe.d102:peMA.Ode1C21.incipit	@ltx/en_us_dedes/pe.d095:peMA.Ode1C21.incipit
ltx/en_us_dedes/pe.d102:peMA.Ode1C21.melody	@ltx/en_us_dedes/pe.d095:peMA.Ode1C21.melody
ltx/en_us_dedes/pe.d102:peMA.Ode1C21.mode	@ltx/en_us_dedes/pe.d095:peMA.Ode1C21.mode
ltx/en_us_dedes/pe.d102:peMA.Ode1C21.ode	@ltx/en_us_dedes/pe.d095:peMA.Ode1C21.ode
ltx/en_us_dedes/pe.d102:peMA.Ode1C21.text	@ltx/en_us_dedes/pe.d095:peMA.Ode1C21.text
ltx/en_us_dedes/pe.d102:peMA.Ode1C22.incipit	@ltx/en_us_dedes/pe.d095:peMA.Ode1C22.incipit
ltx/en_us_dedes/pe.d102:peMA.Ode1C22.melody	@ltx/en_us_dedes/pe.d095:peMA.Ode1C22.melody
ltx/en_us_dedes/pe.d102:peMA.Ode1C22.mode	@ltx/en_us_dedes/pe.d095:peMA.Ode1C22.mode
ltx/en_us_dedes/pe.d102:peMA.Ode1C22.ode	@ltx/en_us_dedes/pe.d095:peMA.Ode1C22.ode
ltx/en_us_dedes/pe.d102:peMA.Ode1C22.text	@ltx/en_us_dedes/pe.d095:peMA.Ode1C22.text
ltx/en_us_dedes/pe.d102:peMA.Ode1C23.incipit	@ltx/en_us_dedes/pe.d095:peMA.Ode1C23.incipit
ltx/en_us_dedes/pe.d102:peMA.Ode1C23.melody	@ltx/en_us_dedes/pe.d095:peMA.Ode1C23.melody
ltx/en_us_dedes/pe.d102:peMA.Ode1C23.mode	@ltx/en_us_dedes/pe.d095:peMA.Ode1C23.mode
ltx/en_us_dedes/pe.d102:peMA.Ode1C23.ode	@ltx/en_us_dedes/pe.d095:peMA.Ode1C23.ode
ltx/en_us_dedes/pe.d102:peMA.Ode1C23.text	@ltx/en_us_dedes/pe.d095:peMA.Ode1C23.text
ltx/en_us_dedes/pe.d102:peMA.Ode1C24.incipit	@ltx/en_us_dedes/pe.d095:peMA.Ode1C24.incipit
ltx/en_us_dedes/pe.d102:peMA.Ode1C24.melody	@ltx/en_us_dedes/pe.d095:peMA.Ode1C24.melody
ltx/en_us_dedes/pe.d102:peMA.Ode1C24.mode	@ltx/en_us_dedes/pe.d095:peMA.Ode1C24.mode
ltx/en_us_dedes/pe.d102:peMA.Ode1C24.ode	@ltx/en_us_dedes/pe.d095:peMA.Ode1C24.ode
ltx/en_us_dedes/pe.d102:peMA.Ode1C24.text	@ltx/en_us_dedes/pe.d095:peMA.Ode1C24.text
ltx/en_us_dedes/pe.d102:peMA.Ode1C2H.greekmelody	@ltx/en_us_dedes/pe.d095:peMA.Ode1C2H.greekmelody
ltx/en_us_dedes/pe.d102:peMA.Ode1C2H.incipit	@ltx/en_us_dedes/pe.d095:peMA.Ode1C2H.incipit
ltx/en_us_dedes/pe.d102:peMA.Ode1C2H.melody	@ltx/en_us_dedes/pe.d095:peMA.Ode1C2H.melody
ltx/en_us_dedes/pe.d102:peMA.Ode1C2H.mode	@ltx/en_us_dedes/pe.d095:peMA.Ode1C2H.mode
ltx/en_us_dedes/pe.d102:peMA.Ode1C2H.ode	@ltx/en_us_dedes/pe.d095:peMA.Ode1C2H.ode
ltx/en_us_dedes/pe.d102:peMA.Ode1C2H.text	@ltx/en_us_dedes/pe.d095:peMA.Ode1C2H.text
ltx/en_us_dedes/pe.d102:peMA.Ode1C2T.incipit	@ltx/en_us_dedes/pe.d095:peMA.Ode1C2T.incipit
ltx/en_us_dedes/pe.d102:peMA.Ode1C2T.melody	@ltx/en_us_dedes/pe.d095:peMA.Ode1C2T.melody
ltx/en_us_dedes/pe.d102:peMA.Ode1C2T.mode	@ltx/en_us_dedes/pe.d095:peMA.Ode1C2T.mode
ltx/en_us_dedes/pe.d102:peMA.Ode1C2T.ode	@ltx/en_us_dedes/pe.d095:peMA.Ode1C2T.ode
ltx/en_us_dedes/pe.d102:peMA.Ode1C2T.text	@ltx/en_us_dedes/pe.d095:peMA.Ode1C2T.text
ltx/en_us_dedes/pe.d102:peMA.Ode1C2Tr.incipit	@ltx/en_us_dedes/pe.d095:peMA.Ode1C2Tr.incipit
ltx/en_us_dedes/pe.d102:peMA.Ode1C2Tr.melody	@ltx/en_us_dedes/pe.d095:peMA.Ode1C2Tr.melody
ltx/en_us_dedes/pe.d102:peMA.Ode1C2Tr.mode	@ltx/en_us_dedes/pe.d095:peMA.Ode1C2Tr.mode
ltx/en_us_dedes/pe.d102:peMA.Ode1C2Tr.ode	@ltx/en_us_dedes/pe.d095:peMA.Ode1C2Tr.ode
ltx/en_us_dedes/pe.d102:peMA.Ode1C2Tr.text	@ltx/en_us_dedes/pe.d095:peMA.Ode1C2Tr.text
ltx/en_us_dedes/pe.d102:peMA.Ode3C11.greekmelody	@ltx/en_us_dedes/pe.d095:peMA.Ode3C11.greekmelody
ltx/en_us_dedes/pe.d102:peMA.Ode3C11.incipit	@ltx/en_us_dedes/pe.d095:peMA.Ode3C11.incipit
ltx/en_us_dedes/pe.d102:peMA.Ode3C11.melody	@ltx/en_us_dedes/pe.d095:peMA.Ode3C11.melody
ltx/en_us_dedes/pe.d102:peMA.Ode3C11.mode	@ltx/en_us_dedes/pe.d095:peMA.Ode3C11.mode
ltx/en_us_dedes/pe.d102:peMA.Ode3C11.ode	@ltx/en_us_dedes/pe.d095:peMA.Ode3C11.ode
ltx/en_us_dedes/pe.d102:peMA.Ode3C11.text	@ltx/en_us_dedes/pe.d095:peMA.Ode3C11.text
ltx/en_us_dedes/pe.d102:peMA.Ode3C12.incipit	@ltx/en_us_dedes/pe.d095:peMA.Ode3C12.incipit
ltx/en_us_dedes/pe.d102:peMA.Ode3C12.melody	@ltx/en_us_dedes/pe.d095:peMA.Ode3C12.melody
ltx/en_us_dedes/pe.d102:peMA.Ode3C12.mode	@ltx/en_us_dedes/pe.d095:peMA.Ode3C12.mode
ltx/en_us_dedes/pe.d102:peMA.Ode3C12.ode	@ltx/en_us_dedes/pe.d095:peMA.Ode3C12.ode
ltx/en_us_dedes/pe.d102:peMA.Ode3C12.text	@ltx/en_us_dedes/pe.d095:peMA.Ode3C12.text
ltx/en_us_dedes/pe.d102:peMA.Ode3C1H.greekmelody	@ltx/en_us_dedes/pe.d095:peMA.Ode3C1H.greekmelody
ltx/en_us_dedes/pe.d102:peMA.Ode3C1H.incipit	@ltx/en_us_dedes/pe.d095:peMA.Ode3C1H.incipit
ltx/en_us_dedes/pe.d102:peMA.Ode3C1H.melody	@ltx/en_us_dedes/pe.d095:peMA.Ode3C1H.melody
ltx/en_us_dedes/pe.d102:peMA.Ode3C1H.mode	@ltx/en_us_dedes/pe.d095:peMA.Ode3C1H.mode
ltx/en_us_dedes/pe.d102:peMA.Ode3C1H.ode	@ltx/en_us_dedes/pe.d095:peMA.Ode3C1H.ode
ltx/en_us_dedes/pe.d102:peMA.Ode3C1H.text	@ltx/en_us_dedes/pe.d095:peMA.Ode3C1H.text
ltx/en_us_dedes/pe.d102:peMA.Ode3C1T.incipit	@ltx/en_us_dedes/pe.d095:peMA.Ode3C1T.incipit
ltx/en_us_dedes/pe.d102:peMA.Ode3C1T.melody	@ltx/en_us_dedes/pe.d095:peMA.Ode3C1T.melody
ltx/en_us_dedes/pe.d102:peMA.Ode3C1T.mode	@ltx/en_us_dedes/pe.d095:peMA.Ode3C1T.mode
ltx/en_us_dedes/pe.d102:peMA.Ode3C1T.ode	@ltx/en_us_dedes/pe.d095:peMA.Ode3C1T.ode
ltx/en_us_dedes/pe.d102:peMA.Ode3C1T.text	@ltx/en_us_dedes/pe.d095:peMA.Ode3C1T.text
ltx/en_us_dedes/pe.d102:peMA.Ode3C21.greekmelody	@ltx/en_us_dedes/pe.d095:peMA.Ode3C21.greekmelody
ltx/en_us_dedes/pe.d102:peMA.Ode3C21.incipit	@ltx/en_us_dedes/pe.d095:peMA.Ode3C21.incipit
ltx/en_us_dedes/pe.d102:peMA.Ode3C21.melody	@ltx/en_us_dedes/pe.d095:peMA.Ode3C21.melody
ltx/en_us_dedes/pe.d102:peMA.Ode3C21.mode	@ltx/en_us_dedes/pe.d095:peMA.Ode3C21.mode
ltx/en_us_dedes/pe.d102:peMA.Ode3C21.ode	@ltx/en_us_dedes/pe.d095:peMA.Ode3C21.ode
ltx/en_us_dedes/pe.d102:peMA.Ode3C21.text	@ltx/en_us_dedes/pe.d095:peMA.Ode3C21.text
ltx/en_us_dedes/pe.d102:peMA.Ode3C22.incipit	@ltx/en_us_dedes/pe.d095:peMA.Ode3C22.incipit
ltx/en_us_dedes/pe.d102:peMA.Ode3C22.melody	@ltx/en_us_dedes/pe.d095:peMA.Ode3C22.melody
ltx/en_us_dedes/pe.d102:peMA.Ode3C22.mode	@ltx/en_us_dedes/pe.d095:peMA.Ode3C22.mode
ltx/en_us_dedes/pe.d102:peMA.Ode3C22.ode	@ltx/en_us_dedes/pe.d095:peMA.Ode3C22.ode
ltx/en_us_dedes/pe.d102:peMA.Ode3C22.text	@ltx/en_us_dedes/pe.d095:peMA.Ode3C22.text
ltx/en_us_dedes/pe.d102:peMA.Ode3C23.incipit	@ltx/en_us_dedes/pe.d095:peMA.Ode3C23.incipit
ltx/en_us_dedes/pe.d102:peMA.Ode3C23.melody	@ltx/en_us_dedes/pe.d095:peMA.Ode3C23.melody
ltx/en_us_dedes/pe.d102:peMA.Ode3C23.mode	@ltx/en_us_dedes/pe.d095:peMA.Ode3C23.mode
ltx/en_us_dedes/pe.d102:peMA.Ode3C23.ode	@ltx/en_us_dedes/pe.d095:peMA.Ode3C23.ode
ltx/en_us_dedes/pe.d102:peMA.Ode3C23.text	@ltx/en_us_dedes/pe.d095:peMA.Ode3C23.text
ltx/en_us_dedes/pe.d102:peMA.Ode3C24.incipit	@ltx/en_us_dedes/pe.d095:peMA.Ode3C24.incipit
ltx/en_us_dedes/pe.d102:peMA.Ode3C24.melody	@ltx/en_us_dedes/pe.d095:peMA.Ode3C24.melody
ltx/en_us_dedes/pe.d102:peMA.Ode3C24.mode	@ltx/en_us_dedes/pe.d095:peMA.Ode3C24.mode
ltx/en_us_dedes/pe.d102:peMA.Ode3C24.ode	@ltx/en_us_dedes/pe.d095:peMA.Ode3C24.ode
ltx/en_us_dedes/pe.d102:peMA.Ode3C24.text	@ltx/en_us_dedes/pe.d095:peMA.Ode3C24.text
ltx/en_us_dedes/pe.d102:peMA.Ode3C2H.greekmelody	@ltx/en_us_dedes/pe.d095:peMA.Ode3C2H.greekmelody
ltx/en_us_dedes/pe.d102:peMA.Ode3C2H.incipit	@ltx/en_us_dedes/pe.d095:peMA.Ode3C2H.incipit
ltx/en_us_dedes/pe.d102:peMA.Ode3C2H.melody	@ltx/en_us_dedes/pe.d095:peMA.Ode3C2H.melody
ltx/en_us_dedes/pe.d102:peMA.Ode3C2H.mode	@ltx/en_us_dedes/pe.d095:peMA.Ode3C2H.mode
ltx/en_us_dedes/pe.d102:peMA.Ode3C2H.ode	@ltx/en_us_dedes/pe.d095:peMA.Ode3C2H.ode
ltx/en_us_dedes/pe.d102:peMA.Ode3C2H.text	@ltx/en_us_dedes/pe.d095:peMA.Ode3C2H.text
ltx/en_us_dedes/pe.d102:peMA.Ode3C2T.incipit	@ltx/en_us_dedes/pe.d095:peMA.Ode3C2T.incipit
ltx/en_us_dedes/pe.d102:peMA.Ode3C2T.melody	@ltx/en_us_dedes/pe.d095:peMA.Ode3C2T.melody
ltx/en_us_dedes/pe.d102:peMA.Ode3C2T.mode	@ltx/en_us_dedes/pe.d095:peMA.Ode3C2T.mode
ltx/en_us_dedes/pe.d102:peMA.Ode3C2T.ode	@ltx/en_us_dedes/pe.d095:peMA.Ode3C2T.ode
ltx/en_us_dedes/pe.d102:peMA.Ode3C2T.text	@ltx/en_us_dedes/pe.d095:peMA.Ode3C2T.text
ltx/en_us_dedes/pe.d102:peMA.Ode3C2Tr.incipit	@ltx/en_us_dedes/pe.d095:peMA.Ode3C2Tr.incipit
ltx/en_us_dedes/pe.d102:peMA.Ode3C2Tr.melody	@ltx/en_us_dedes/pe.d095:peMA.Ode3C2Tr.melody
ltx/en_us_dedes/pe.d102:peMA.Ode3C2Tr.mode	@ltx/en_us_dedes/pe.d095:peMA.Ode3C2Tr.mode
ltx/en_us_dedes/pe.d102:peMA.Ode3C2Tr.ode	@ltx/en_us_dedes/pe.d095:peMA.Ode3C2Tr.ode
ltx/en_us_dedes/pe.d102:peMA.Ode3C2Tr.text	@ltx/en_us_dedes/pe.d095:peMA.Ode3C2Tr.text
ltx/en_us_dedes/pe.d102:peMA.Ode3Kathisma1.greekmelody	@ltx/en_us_dedes/pe.d095:peMA.Ode3Kathisma1.greekmelody
ltx/en_us_dedes/pe.d102:peMA.Ode3Kathisma1.incipit	@ltx/en_us_dedes/pe.d095:peMA.Ode3Kathisma1.incipit
ltx/en_us_dedes/pe.d102:peMA.Ode3Kathisma1.melody	@ltx/en_us_dedes/pe.d095:peMA.Ode3Kathisma1.melody
ltx/en_us_dedes/pe.d102:peMA.Ode3Kathisma1.mode	@ltx/en_us_dedes/pe.d095:peMA.Ode3Kathisma1.mode
ltx/en_us_dedes/pe.d102:peMA.Ode3Kathisma1.text	@ltx/en_us_dedes/pe.d095:peMA.Ode3Kathisma1.text
ltx/en_us_dedes/pe.d102:peMA.Ode3Kathisma2.greekmelody	@ltx/en_us_dedes/pe.d095:peMA.Ode3Kathisma2.greekmelody
ltx/en_us_dedes/pe.d102:peMA.Ode3Kathisma2.incipit	@ltx/en_us_dedes/pe.d095:peMA.Ode3Kathisma2.incipit
ltx/en_us_dedes/pe.d102:peMA.Ode3Kathisma2.melody	@ltx/en_us_dedes/pe.d095:peMA.Ode3Kathisma2.melody
ltx/en_us_dedes/pe.d102:peMA.Ode3Kathisma2.mode	@ltx/en_us_dedes/pe.d095:peMA.Ode3Kathisma2.mode
ltx/en_us_dedes/pe.d102:peMA.Ode3Kathisma2.text	@ltx/en_us_dedes/pe.d095:peMA.Ode3Kathisma2.text
ltx/en_us_dedes/pe.d102:peMA.Ode4C11.greekmelody	@ltx/en_us_dedes/pe.d095:peMA.Ode4C11.greekmelody
ltx/en_us_dedes/pe.d102:peMA.Ode4C11.incipit	@ltx/en_us_dedes/pe.d095:peMA.Ode4C11.incipit
ltx/en_us_dedes/pe.d102:peMA.Ode4C11.melody	@ltx/en_us_dedes/pe.d095:peMA.Ode4C11.melody
ltx/en_us_dedes/pe.d102:peMA.Ode4C11.mode	@ltx/en_us_dedes/pe.d095:peMA.Ode4C11.mode
ltx/en_us_dedes/pe.d102:peMA.Ode4C11.ode	@ltx/en_us_dedes/pe.d095:peMA.Ode4C11.ode
ltx/en_us_dedes/pe.d102:peMA.Ode4C11.text	@ltx/en_us_dedes/pe.d095:peMA.Ode4C11.text
ltx/en_us_dedes/pe.d102:peMA.Ode4C12.incipit	@ltx/en_us_dedes/pe.d095:peMA.Ode4C12.incipit
ltx/en_us_dedes/pe.d102:peMA.Ode4C12.melody	@ltx/en_us_dedes/pe.d095:peMA.Ode4C12.melody
ltx/en_us_dedes/pe.d102:peMA.Ode4C12.mode	@ltx/en_us_dedes/pe.d095:peMA.Ode4C12.mode
ltx/en_us_dedes/pe.d102:peMA.Ode4C12.ode	@ltx/en_us_dedes/pe.d095:peMA.Ode4C12.ode
ltx/en_us_dedes/pe.d102:peMA.Ode4C12.text	@ltx/en_us_dedes/pe.d095:peMA.Ode4C12.text
ltx/en_us_dedes/pe.d102:peMA.Ode4C13.incipit	@ltx/en_us_dedes/pe.d095:peMA.Ode4C13.incipit
ltx/en_us_dedes/pe.d102:peMA.Ode4C13.melody	@ltx/en_us_dedes/pe.d095:peMA.Ode4C13.melody
ltx/en_us_dedes/pe.d102:peMA.Ode4C13.mode	@ltx/en_us_dedes/pe.d095:peMA.Ode4C13.mode
ltx/en_us_dedes/pe.d102:peMA.Ode4C13.ode	@ltx/en_us_dedes/pe.d095:peMA.Ode4C13.ode
ltx/en_us_dedes/pe.d102:peMA.Ode4C13.text	@ltx/en_us_dedes/pe.d095:peMA.Ode4C13.text
ltx/en_us_dedes/pe.d102:peMA.Ode4C1H.greekmelody	@ltx/en_us_dedes/pe.d095:peMA.Ode4C1H.greekmelody
ltx/en_us_dedes/pe.d102:peMA.Ode4C1H.incipit	@ltx/en_us_dedes/pe.d095:peMA.Ode4C1H.incipit
ltx/en_us_dedes/pe.d102:peMA.Ode4C1H.melody	@ltx/en_us_dedes/pe.d095:peMA.Ode4C1H.melody
ltx/en_us_dedes/pe.d102:peMA.Ode4C1H.mode	@ltx/en_us_dedes/pe.d095:peMA.Ode4C1H.mode
ltx/en_us_dedes/pe.d102:peMA.Ode4C1H.ode	@ltx/en_us_dedes/pe.d095:peMA.Ode4C1H.ode
ltx/en_us_dedes/pe.d102:peMA.Ode4C1H.text	@ltx/en_us_dedes/pe.d095:peMA.Ode4C1H.text
ltx/en_us_dedes/pe.d102:peMA.Ode4C1T.incipit	@ltx/en_us_dedes/pe.d095:peMA.Ode4C1T.incipit
ltx/en_us_dedes/pe.d102:peMA.Ode4C1T.melody	@ltx/en_us_dedes/pe.d095:peMA.Ode4C1T.melody
ltx/en_us_dedes/pe.d102:peMA.Ode4C1T.mode	@ltx/en_us_dedes/pe.d095:peMA.Ode4C1T.mode
ltx/en_us_dedes/pe.d102:peMA.Ode4C1T.ode	@ltx/en_us_dedes/pe.d095:peMA.Ode4C1T.ode
ltx/en_us_dedes/pe.d102:peMA.Ode4C1T.text	@ltx/en_us_dedes/pe.d095:peMA.Ode4C1T.text
ltx/en_us_dedes/pe.d102:peMA.Ode4C21.greekmelody	@ltx/en_us_dedes/pe.d095:peMA.Ode4C21.greekmelody
ltx/en_us_dedes/pe.d102:peMA.Ode4C21.incipit	@ltx/en_us_dedes/pe.d095:peMA.Ode4C21.incipit
ltx/en_us_dedes/pe.d102:peMA.Ode4C21.melody	@ltx/en_us_dedes/pe.d095:peMA.Ode4C21.melody
ltx/en_us_dedes/pe.d102:peMA.Ode4C21.mode	@ltx/en_us_dedes/pe.d095:peMA.Ode4C21.mode
ltx/en_us_dedes/pe.d102:peMA.Ode4C21.ode	@ltx/en_us_dedes/pe.d095:peMA.Ode4C21.ode
ltx/en_us_dedes/pe.d102:peMA.Ode4C21.text	@ltx/en_us_dedes/pe.d095:peMA.Ode4C21.text
ltx/en_us_dedes/pe.d102:peMA.Ode4C22.incipit	@ltx/en_us_dedes/pe.d095:peMA.Ode4C22.incipit
ltx/en_us_dedes/pe.d102:peMA.Ode4C22.melody	@ltx/en_us_dedes/pe.d095:peMA.Ode4C22.melody
ltx/en_us_dedes/pe.d102:peMA.Ode4C22.mode	@ltx/en_us_dedes/pe.d095:peMA.Ode4C22.mode
ltx/en_us_dedes/pe.d102:peMA.Ode4C22.ode	@ltx/en_us_dedes/pe.d095:peMA.Ode4C22.ode
ltx/en_us_dedes/pe.d102:peMA.Ode4C22.text	@ltx/en_us_dedes/pe.d095:peMA.Ode4C22.text
ltx/en_us_dedes/pe.d102:peMA.Ode4C23.incipit	@ltx/en_us_dedes/pe.d095:peMA.Ode4C23.incipit
ltx/en_us_dedes/pe.d102:peMA.Ode4C23.melody	@ltx/en_us_dedes/pe.d095:peMA.Ode4C23.melody
ltx/en_us_dedes/pe.d102:peMA.Ode4C23.mode	@ltx/en_us_dedes/pe.d095:peMA.Ode4C23.mode
ltx/en_us_dedes/pe.d102:peMA.Ode4C23.ode	@ltx/en_us_dedes/pe.d095:peMA.Ode4C23.ode
ltx/en_us_dedes/pe.d102:peMA.Ode4C23.text	@ltx/en_us_dedes/pe.d095:peMA.Ode4C23.text
ltx/en_us_dedes/pe.d102:peMA.Ode4C24.incipit	@ltx/en_us_dedes/pe.d095:peMA.Ode4C24.incipit
ltx/en_us_dedes/pe.d102:peMA.Ode4C24.melody	@ltx/en_us_dedes/pe.d095:peMA.Ode4C24.melody
ltx/en_us_dedes/pe.d102:peMA.Ode4C24.mode	@ltx/en_us_dedes/pe.d095:peMA.Ode4C24.mode
ltx/en_us_dedes/pe.d102:peMA.Ode4C24.ode	@ltx/en_us_dedes/pe.d095:peMA.Ode4C24.ode
ltx/en_us_dedes/pe.d102:peMA.Ode4C24.text	@ltx/en_us_dedes/pe.d095:peMA.Ode4C24.text
ltx/en_us_dedes/pe.d102:peMA.Ode4C25.incipit	@ltx/en_us_dedes/pe.d095:peMA.Ode4C25.incipit
ltx/en_us_dedes/pe.d102:peMA.Ode4C25.melody	@ltx/en_us_dedes/pe.d095:peMA.Ode4C25.melody
ltx/en_us_dedes/pe.d102:peMA.Ode4C25.mode	@ltx/en_us_dedes/pe.d095:peMA.Ode4C25.mode
ltx/en_us_dedes/pe.d102:peMA.Ode4C25.ode	@ltx/en_us_dedes/pe.d095:peMA.Ode4C25.ode
ltx/en_us_dedes/pe.d102:peMA.Ode4C25.text	@ltx/en_us_dedes/pe.d095:peMA.Ode4C25.text
ltx/en_us_dedes/pe.d102:peMA.Ode4C2H.greekmelody	@ltx/en_us_dedes/pe.d095:peMA.Ode4C2H.greekmelody
ltx/en_us_dedes/pe.d102:peMA.Ode4C2H.incipit	@ltx/en_us_dedes/pe.d095:peMA.Ode4C2H.incipit
ltx/en_us_dedes/pe.d102:peMA.Ode4C2H.melody	@ltx/en_us_dedes/pe.d095:peMA.Ode4C2H.melody
ltx/en_us_dedes/pe.d102:peMA.Ode4C2H.mode	@ltx/en_us_dedes/pe.d095:peMA.Ode4C2H.mode
ltx/en_us_dedes/pe.d102:peMA.Ode4C2H.ode	@ltx/en_us_dedes/pe.d095:peMA.Ode4C2H.ode
ltx/en_us_dedes/pe.d102:peMA.Ode4C2H.text	@ltx/en_us_dedes/pe.d095:peMA.Ode4C2H.text
ltx/en_us_dedes/pe.d102:peMA.Ode4C2T.incipit	@ltx/en_us_dedes/pe.d095:peMA.Ode4C2T.incipit
ltx/en_us_dedes/pe.d102:peMA.Ode4C2T.melody	@ltx/en_us_dedes/pe.d095:peMA.Ode4C2T.melody
ltx/en_us_dedes/pe.d102:peMA.Ode4C2T.mode	@ltx/en_us_dedes/pe.d095:peMA.Ode4C2T.mode
ltx/en_us_dedes/pe.d102:peMA.Ode4C2T.ode	@ltx/en_us_dedes/pe.d095:peMA.Ode4C2T.ode
ltx/en_us_dedes/pe.d102:peMA.Ode4C2T.text	@ltx/en_us_dedes/pe.d095:peMA.Ode4C2T.text
ltx/en_us_dedes/pe.d102:peMA.Ode4C2Tr.incipit	@ltx/en_us_dedes/pe.d095:peMA.Ode4C2Tr.incipit
ltx/en_us_dedes/pe.d102:peMA.Ode4C2Tr.melody	@ltx/en_us_dedes/pe.d095:peMA.Ode4C2Tr.melody
ltx/en_us_dedes/pe.d102:peMA.Ode4C2Tr.mode	@ltx/en_us_dedes/pe.d095:peMA.Ode4C2Tr.mode
ltx/en_us_dedes/pe.d102:peMA.Ode4C2Tr.ode	@ltx/en_us_dedes/pe.d095:peMA.Ode4C2Tr.ode
ltx/en_us_dedes/pe.d102:peMA.Ode4C2Tr.text	@ltx/en_us_dedes/pe.d095:peMA.Ode4C2Tr.text
ltx/en_us_dedes/pe.d102:peMA.Ode5C11.greekmelody	@ltx/en_us_dedes/pe.d095:peMA.Ode5C11.greekmelody
ltx/en_us_dedes/pe.d102:peMA.Ode5C11.incipit	@ltx/en_us_dedes/pe.d095:peMA.Ode5C11.incipit
ltx/en_us_dedes/pe.d102:peMA.Ode5C11.melody	@ltx/en_us_dedes/pe.d095:peMA.Ode5C11.melody
ltx/en_us_dedes/pe.d102:peMA.Ode5C11.mode	@ltx/en_us_dedes/pe.d095:peMA.Ode5C11.mode
ltx/en_us_dedes/pe.d102:peMA.Ode5C11.ode	@ltx/en_us_dedes/pe.d095:peMA.Ode5C11.ode
ltx/en_us_dedes/pe.d102:peMA.Ode5C11.text	@ltx/en_us_dedes/pe.d095:peMA.Ode5C11.text
ltx/en_us_dedes/pe.d102:peMA.Ode5C12.incipit	@ltx/en_us_dedes/pe.d095:peMA.Ode5C12.incipit
ltx/en_us_dedes/pe.d102:peMA.Ode5C12.melody	@ltx/en_us_dedes/pe.d095:peMA.Ode5C12.melody
ltx/en_us_dedes/pe.d102:peMA.Ode5C12.mode	@ltx/en_us_dedes/pe.d095:peMA.Ode5C12.mode
ltx/en_us_dedes/pe.d102:peMA.Ode5C12.ode	@ltx/en_us_dedes/pe.d095:peMA.Ode5C12.ode
ltx/en_us_dedes/pe.d102:peMA.Ode5C12.text	@ltx/en_us_dedes/pe.d095:peMA.Ode5C12.text
ltx/en_us_dedes/pe.d102:peMA.Ode5C1H.greekmelody	@ltx/en_us_dedes/pe.d095:peMA.Ode5C1H.greekmelody
ltx/en_us_dedes/pe.d102:peMA.Ode5C1H.incipit	@ltx/en_us_dedes/pe.d095:peMA.Ode5C1H.incipit
ltx/en_us_dedes/pe.d102:peMA.Ode5C1H.melody	@ltx/en_us_dedes/pe.d095:peMA.Ode5C1H.melody
ltx/en_us_dedes/pe.d102:peMA.Ode5C1H.mode	@ltx/en_us_dedes/pe.d095:peMA.Ode5C1H.mode
ltx/en_us_dedes/pe.d102:peMA.Ode5C1H.ode	@ltx/en_us_dedes/pe.d095:peMA.Ode5C1H.ode
ltx/en_us_dedes/pe.d102:peMA.Ode5C1H.text	@ltx/en_us_dedes/pe.d095:peMA.Ode5C1H.text
ltx/en_us_dedes/pe.d102:peMA.Ode5C1T.incipit	@ltx/en_us_dedes/pe.d095:peMA.Ode5C1T.incipit
ltx/en_us_dedes/pe.d102:peMA.Ode5C1T.melody	@ltx/en_us_dedes/pe.d095:peMA.Ode5C1T.melody
ltx/en_us_dedes/pe.d102:peMA.Ode5C1T.mode	@ltx/en_us_dedes/pe.d095:peMA.Ode5C1T.mode
ltx/en_us_dedes/pe.d102:peMA.Ode5C1T.ode	@ltx/en_us_dedes/pe.d095:peMA.Ode5C1T.ode
ltx/en_us_dedes/pe.d102:peMA.Ode5C1T.text	@ltx/en_us_dedes/pe.d095:peMA.Ode5C1T.text
ltx/en_us_dedes/pe.d102:peMA.Ode5C21.greekmelody	@ltx/en_us_dedes/pe.d095:peMA.Ode5C21.greekmelody
ltx/en_us_dedes/pe.d102:peMA.Ode5C21.incipit	@ltx/en_us_dedes/pe.d095:peMA.Ode5C21.incipit
ltx/en_us_dedes/pe.d102:peMA.Ode5C21.melody	@ltx/en_us_dedes/pe.d095:peMA.Ode5C21.melody
ltx/en_us_dedes/pe.d102:peMA.Ode5C21.mode	@ltx/en_us_dedes/pe.d095:peMA.Ode5C21.mode
ltx/en_us_dedes/pe.d102:peMA.Ode5C21.ode	@ltx/en_us_dedes/pe.d095:peMA.Ode5C21.ode
ltx/en_us_dedes/pe.d102:peMA.Ode5C21.text	@ltx/en_us_dedes/pe.d095:peMA.Ode5C21.text
ltx/en_us_dedes/pe.d102:peMA.Ode5C22.incipit	@ltx/en_us_dedes/pe.d095:peMA.Ode5C22.incipit
ltx/en_us_dedes/pe.d102:peMA.Ode5C22.melody	@ltx/en_us_dedes/pe.d095:peMA.Ode5C22.melody
ltx/en_us_dedes/pe.d102:peMA.Ode5C22.mode	@ltx/en_us_dedes/pe.d095:peMA.Ode5C22.mode
ltx/en_us_dedes/pe.d102:peMA.Ode5C22.ode	@ltx/en_us_dedes/pe.d095:peMA.Ode5C22.ode
ltx/en_us_dedes/pe.d102:peMA.Ode5C22.text	@ltx/en_us_dedes/pe.d095:peMA.Ode5C22.text
ltx/en_us_dedes/pe.d102:peMA.Ode5C23.incipit	@ltx/en_us_dedes/pe.d095:peMA.Ode5C23.incipit
ltx/en_us_dedes/pe.d102:peMA.Ode5C23.melody	@ltx/en_us_dedes/pe.d095:peMA.Ode5C23.melody
ltx/en_us_dedes/pe.d102:peMA.Ode5C23.mode	@ltx/en_us_dedes/pe.d095:peMA.Ode5C23.mode
ltx/en_us_dedes/pe.d102:peMA.Ode5C23.ode	@ltx/en_us_dedes/pe.d095:peMA.Ode5C23.ode
ltx/en_us_dedes/pe.d102:peMA.Ode5C23.text	@ltx/en_us_dedes/pe.d095:peMA.Ode5C23.text
ltx/en_us_dedes/pe.d102:peMA.Ode5C2H.greekmelody	@ltx/en_us_dedes/pe.d095:peMA.Ode5C2H.greekmelody
ltx/en_us_dedes/pe.d102:peMA.Ode5C2H.incipit	@ltx/en_us_dedes/pe.d095:peMA.Ode5C2H.incipit
ltx/en_us_dedes/pe.d102:peMA.Ode5C2H.melody	@ltx/en_us_dedes/pe.d095:peMA.Ode5C2H.melody
ltx/en_us_dedes/pe.d102:peMA.Ode5C2H.mode	@ltx/en_us_dedes/pe.d095:peMA.Ode5C2H.mode
ltx/en_us_dedes/pe.d102:peMA.Ode5C2H.ode	@ltx/en_us_dedes/pe.d095:peMA.Ode5C2H.ode
ltx/en_us_dedes/pe.d102:peMA.Ode5C2H.text	@ltx/en_us_dedes/pe.d095:peMA.Ode5C2H.text
ltx/en_us_dedes/pe.d102:peMA.Ode5C2T.incipit	@ltx/en_us_dedes/pe.d095:peMA.Ode5C2T.incipit
ltx/en_us_dedes/pe.d102:peMA.Ode5C2T.melody	@ltx/en_us_dedes/pe.d095:peMA.Ode5C2T.melody
ltx/en_us_dedes/pe.d102:peMA.Ode5C2T.mode	@ltx/en_us_dedes/pe.d095:peMA.Ode5C2T.mode
ltx/en_us_dedes/pe.d102:peMA.Ode5C2T.ode	@ltx/en_us_dedes/pe.d095:peMA.Ode5C2T.ode
ltx/en_us_dedes/pe.d102:peMA.Ode5C2T.text	@ltx/en_us_dedes/pe.d095:peMA.Ode5C2T.text
ltx/en_us_dedes/pe.d102:peMA.Ode5C2Tr.incipit	@ltx/en_us_dedes/pe.d095:peMA.Ode5C2Tr.incipit
ltx/en_us_dedes/pe.d102:peMA.Ode5C2Tr.melody	@ltx/en_us_dedes/pe.d095:peMA.Ode5C2Tr.melody
ltx/en_us_dedes/pe.d102:peMA.Ode5C2Tr.mode	@ltx/en_us_dedes/pe.d095:peMA.Ode5C2Tr.mode
ltx/en_us_dedes/pe.d102:peMA.Ode5C2Tr.ode	@ltx/en_us_dedes/pe.d095:peMA.Ode5C2Tr.ode
ltx/en_us_dedes/pe.d102:peMA.Ode5C2Tr.text	@ltx/en_us_dedes/pe.d095:peMA.Ode5C2Tr.text
ltx/en_us_dedes/pe.d102:peMA.Ode6C11.greekmelody	@ltx/en_us_dedes/pe.d095:peMA.Ode6C11.greekmelody
ltx/en_us_dedes/pe.d102:peMA.Ode6C11.incipit	@ltx/en_us_dedes/pe.d095:peMA.Ode6C11.incipit
ltx/en_us_dedes/pe.d102:peMA.Ode6C11.melody	@ltx/en_us_dedes/pe.d095:peMA.Ode6C11.melody
ltx/en_us_dedes/pe.d102:peMA.Ode6C11.mode	@ltx/en_us_dedes/pe.d095:peMA.Ode6C11.mode
ltx/en_us_dedes/pe.d102:peMA.Ode6C11.ode	@ltx/en_us_dedes/pe.d095:peMA.Ode6C11.ode
ltx/en_us_dedes/pe.d102:peMA.Ode6C11.text	@ltx/en_us_dedes/pe.d095:peMA.Ode6C11.text
ltx/en_us_dedes/pe.d102:peMA.Ode6C12.incipit	@ltx/en_us_dedes/pe.d095:peMA.Ode6C12.incipit
ltx/en_us_dedes/pe.d102:peMA.Ode6C12.melody	@ltx/en_us_dedes/pe.d095:peMA.Ode6C12.melody
ltx/en_us_dedes/pe.d102:peMA.Ode6C12.mode	@ltx/en_us_dedes/pe.d095:peMA.Ode6C12.mode
ltx/en_us_dedes/pe.d102:peMA.Ode6C12.ode	@ltx/en_us_dedes/pe.d095:peMA.Ode6C12.ode
ltx/en_us_dedes/pe.d102:peMA.Ode6C12.text	@ltx/en_us_dedes/pe.d095:peMA.Ode6C12.text
ltx/en_us_dedes/pe.d102:peMA.Ode6C1H.greekmelody	@ltx/en_us_dedes/pe.d095:peMA.Ode6C1H.greekmelody
ltx/en_us_dedes/pe.d102:peMA.Ode6C1H.incipit	@ltx/en_us_dedes/pe.d095:peMA.Ode6C1H.incipit
ltx/en_us_dedes/pe.d102:peMA.Ode6C1H.melody	@ltx/en_us_dedes/pe.d095:peMA.Ode6C1H.melody
ltx/en_us_dedes/pe.d102:peMA.Ode6C1H.mode	@ltx/en_us_dedes/pe.d095:peMA.Ode6C1H.mode
ltx/en_us_dedes/pe.d102:peMA.Ode6C1H.ode	@ltx/en_us_dedes/pe.d095:peMA.Ode6C1H.ode
ltx/en_us_dedes/pe.d102:peMA.Ode6C1H.text	@ltx/en_us_dedes/pe.d095:peMA.Ode6C1H.text
ltx/en_us_dedes/pe.d102:peMA.Ode6C1T.incipit	@ltx/en_us_dedes/pe.d095:peMA.Ode6C1T.incipit
ltx/en_us_dedes/pe.d102:peMA.Ode6C1T.melody	@ltx/en_us_dedes/pe.d095:peMA.Ode6C1T.melody
ltx/en_us_dedes/pe.d102:peMA.Ode6C1T.mode	@ltx/en_us_dedes/pe.d095:peMA.Ode6C1T.mode
ltx/en_us_dedes/pe.d102:peMA.Ode6C1T.ode	@ltx/en_us_dedes/pe.d095:peMA.Ode6C1T.ode
ltx/en_us_dedes/pe.d102:peMA.Ode6C1T.text	@ltx/en_us_dedes/pe.d095:peMA.Ode6C1T.text
ltx/en_us_dedes/pe.d102:peMA.Ode6C21.greekmelody	@ltx/en_us_dedes/pe.d095:peMA.Ode6C21.greekmelody
ltx/en_us_dedes/pe.d102:peMA.Ode6C21.incipit	@ltx/en_us_dedes/pe.d095:peMA.Ode6C21.incipit
ltx/en_us_dedes/pe.d102:peMA.Ode6C21.melody	@ltx/en_us_dedes/pe.d095:peMA.Ode6C21.melody
ltx/en_us_dedes/pe.d102:peMA.Ode6C21.mode	@ltx/en_us_dedes/pe.d095:peMA.Ode6C21.mode
ltx/en_us_dedes/pe.d102:peMA.Ode6C21.ode	@ltx/en_us_dedes/pe.d095:peMA.Ode6C21.ode
ltx/en_us_dedes/pe.d102:peMA.Ode6C21.text	@ltx/en_us_dedes/pe.d095:peMA.Ode6C21.text
ltx/en_us_dedes/pe.d102:peMA.Ode6C22.incipit	@ltx/en_us_dedes/pe.d095:peMA.Ode6C22.incipit
ltx/en_us_dedes/pe.d102:peMA.Ode6C22.melody	@ltx/en_us_dedes/pe.d095:peMA.Ode6C22.melody
ltx/en_us_dedes/pe.d102:peMA.Ode6C22.mode	@ltx/en_us_dedes/pe.d095:peMA.Ode6C22.mode
ltx/en_us_dedes/pe.d102:peMA.Ode6C22.ode	@ltx/en_us_dedes/pe.d095:peMA.Ode6C22.ode
ltx/en_us_dedes/pe.d102:peMA.Ode6C22.text	@ltx/en_us_dedes/pe.d095:peMA.Ode6C22.text
ltx/en_us_dedes/pe.d102:peMA.Ode6C23.incipit	@ltx/en_us_dedes/pe.d095:peMA.Ode6C23.incipit
ltx/en_us_dedes/pe.d102:peMA.Ode6C23.melody	@ltx/en_us_dedes/pe.d095:peMA.Ode6C23.melody
ltx/en_us_dedes/pe.d102:peMA.Ode6C23.mode	@ltx/en_us_dedes/pe.d095:peMA.Ode6C23.mode
ltx/en_us_dedes/pe.d102:peMA.Ode6C23.ode	@ltx/en_us_dedes/pe.d095:peMA.Ode6C23.ode
ltx/en_us_dedes/pe.d102:peMA.Ode6C23.text	@ltx/en_us_dedes/pe.d095:peMA.Ode6C23.text
ltx/en_us_dedes/pe.d102:peMA.Ode6C24.incipit	@ltx/en_us_dedes/pe.d095:peMA.Ode6C24.incipit
ltx/en_us_dedes/pe.d102:peMA.Ode6C24.melody	@ltx/en_us_dedes/pe.d095:peMA.Ode6C24.melody
ltx/en_us_dedes/pe.d102:peMA.Ode6C24.mode	@ltx/en_us_dedes/pe.d095:peMA.Ode6C24.mode
ltx/en_us_dedes/pe.d102:peMA.Ode6C24.ode	@ltx/en_us_dedes/pe.d095:peMA.Ode6C24.ode
ltx/en_us_dedes/pe.d102:peMA.Ode6C24.text	@ltx/en_us_dedes/pe.d095:peMA.Ode6C24.text
ltx/en_us_dedes/pe.d102:peMA.Ode6C2H.greekmelody	@ltx/en_us_dedes/pe.d095:peMA.Ode6C2H.greekmelody
ltx/en_us_dedes/pe.d102:peMA.Ode6C2H.incipit	@ltx/en_us_dedes/pe.d095:peMA.Ode6C2H.incipit
ltx/en_us_dedes/pe.d102:peMA.Ode6C2H.melody	@ltx/en_us_dedes/pe.d095:peMA.Ode6C2H.melody
ltx/en_us_dedes/pe.d102:peMA.Ode6C2H.mode	@ltx/en_us_dedes/pe.d095:peMA.Ode6C2H.mode
ltx/en_us_dedes/pe.d102:peMA.Ode6C2H.ode	@ltx/en_us_dedes/pe.d095:peMA.Ode6C2H.ode
ltx/en_us_dedes/pe.d102:peMA.Ode6C2H.text	@ltx/en_us_dedes/pe.d095:peMA.Ode6C2H.text
ltx/en_us_dedes/pe.d102:peMA.Ode6C2T.incipit	@ltx/en_us_dedes/pe.d095:peMA.Ode6C2T.incipit
ltx/en_us_dedes/pe.d102:peMA.Ode6C2T.melody	@ltx/en_us_dedes/pe.d095:peMA.Ode6C2T.melody
ltx/en_us_dedes/pe.d102:peMA.Ode6C2T.mode	@ltx/en_us_dedes/pe.d095:peMA.Ode6C2T.mode
ltx/en_us_dedes/pe.d102:peMA.Ode6C2T.ode	@ltx/en_us_dedes/pe.d095:peMA.Ode6C2T.ode
ltx/en_us_dedes/pe.d102:peMA.Ode6C2T.text	@ltx/en_us_dedes/pe.d095:peMA.Ode6C2T.text
ltx/en_us_dedes/pe.d102:peMA.Ode6C2Tr.incipit	@ltx/en_us_dedes/pe.d095:peMA.Ode6C2Tr.incipit
ltx/en_us_dedes/pe.d102:peMA.Ode6C2Tr.melody	@ltx/en_us_dedes/pe.d095:peMA.Ode6C2Tr.melody
ltx/en_us_dedes/pe.d102:peMA.Ode6C2Tr.mode	@ltx/en_us_dedes/pe.d095:peMA.Ode6C2Tr.mode
ltx/en_us_dedes/pe.d102:peMA.Ode6C2Tr.ode	@ltx/en_us_dedes/pe.d095:peMA.Ode6C2Tr.ode
ltx/en_us_dedes/pe.d102:peMA.Ode6C2Tr.text	@ltx/en_us_dedes/pe.d095:peMA.Ode6C2Tr.text
ltx/en_us_dedes/pe.d102:peMA.Ode7C11.greekmelody	@ltx/en_us_dedes/pe.d095:peMA.Ode7C11.greekmelody
ltx/en_us_dedes/pe.d102:peMA.Ode7C11.incipit	@ltx/en_us_dedes/pe.d095:peMA.Ode7C11.incipit
ltx/en_us_dedes/pe.d102:peMA.Ode7C11.melody	@ltx/en_us_dedes/pe.d095:peMA.Ode7C11.melody
ltx/en_us_dedes/pe.d102:peMA.Ode7C11.mode	@ltx/en_us_dedes/pe.d095:peMA.Ode7C11.mode
ltx/en_us_dedes/pe.d102:peMA.Ode7C11.ode	@ltx/en_us_dedes/pe.d095:peMA.Ode7C11.ode
ltx/en_us_dedes/pe.d102:peMA.Ode7C11.text	@ltx/en_us_dedes/pe.d095:peMA.Ode7C11.text
ltx/en_us_dedes/pe.d102:peMA.Ode7C12.incipit	@ltx/en_us_dedes/pe.d095:peMA.Ode7C12.incipit
ltx/en_us_dedes/pe.d102:peMA.Ode7C12.melody	@ltx/en_us_dedes/pe.d095:peMA.Ode7C12.melody
ltx/en_us_dedes/pe.d102:peMA.Ode7C12.mode	@ltx/en_us_dedes/pe.d095:peMA.Ode7C12.mode
ltx/en_us_dedes/pe.d102:peMA.Ode7C12.ode	@ltx/en_us_dedes/pe.d095:peMA.Ode7C12.ode
ltx/en_us_dedes/pe.d102:peMA.Ode7C12.text	@ltx/en_us_dedes/pe.d095:peMA.Ode7C12.text
ltx/en_us_dedes/pe.d102:peMA.Ode7C1H.greekmelody	@ltx/en_us_dedes/pe.d095:peMA.Ode7C1H.greekmelody
ltx/en_us_dedes/pe.d102:peMA.Ode7C1H.incipit	@ltx/en_us_dedes/pe.d095:peMA.Ode7C1H.incipit
ltx/en_us_dedes/pe.d102:peMA.Ode7C1H.melody	@ltx/en_us_dedes/pe.d095:peMA.Ode7C1H.melody
ltx/en_us_dedes/pe.d102:peMA.Ode7C1H.mode	@ltx/en_us_dedes/pe.d095:peMA.Ode7C1H.mode
ltx/en_us_dedes/pe.d102:peMA.Ode7C1H.ode	@ltx/en_us_dedes/pe.d095:peMA.Ode7C1H.ode
ltx/en_us_dedes/pe.d102:peMA.Ode7C1H.text	@ltx/en_us_dedes/pe.d095:peMA.Ode7C1H.text
ltx/en_us_dedes/pe.d102:peMA.Ode7C1T.incipit	@ltx/en_us_dedes/pe.d095:peMA.Ode7C1T.incipit
ltx/en_us_dedes/pe.d102:peMA.Ode7C1T.melody	@ltx/en_us_dedes/pe.d095:peMA.Ode7C1T.melody
ltx/en_us_dedes/pe.d102:peMA.Ode7C1T.mode	@ltx/en_us_dedes/pe.d095:peMA.Ode7C1T.mode
ltx/en_us_dedes/pe.d102:peMA.Ode7C1T.ode	@ltx/en_us_dedes/pe.d095:peMA.Ode7C1T.ode
ltx/en_us_dedes/pe.d102:peMA.Ode7C1T.text	@ltx/en_us_dedes/pe.d095:peMA.Ode7C1T.text
ltx/en_us_dedes/pe.d102:peMA.Ode7C21.greekmelody	@ltx/en_us_dedes/pe.d095:peMA.Ode7C21.greekmelody
ltx/en_us_dedes/pe.d102:peMA.Ode7C21.incipit	@ltx/en_us_dedes/pe.d095:peMA.Ode7C21.incipit
ltx/en_us_dedes/pe.d102:peMA.Ode7C21.melody	@ltx/en_us_dedes/pe.d095:peMA.Ode7C21.melody
ltx/en_us_dedes/pe.d102:peMA.Ode7C21.mode	@ltx/en_us_dedes/pe.d095:peMA.Ode7C21.mode
ltx/en_us_dedes/pe.d102:peMA.Ode7C21.ode	@ltx/en_us_dedes/pe.d095:peMA.Ode7C21.ode
ltx/en_us_dedes/pe.d102:peMA.Ode7C21.text	@ltx/en_us_dedes/pe.d095:peMA.Ode7C21.text
ltx/en_us_dedes/pe.d102:peMA.Ode7C22.incipit	@ltx/en_us_dedes/pe.d095:peMA.Ode7C22.incipit
ltx/en_us_dedes/pe.d102:peMA.Ode7C22.melody	@ltx/en_us_dedes/pe.d095:peMA.Ode7C22.melody
ltx/en_us_dedes/pe.d102:peMA.Ode7C22.mode	@ltx/en_us_dedes/pe.d095:peMA.Ode7C22.mode
ltx/en_us_dedes/pe.d102:peMA.Ode7C22.ode	@ltx/en_us_dedes/pe.d095:peMA.Ode7C22.ode
ltx/en_us_dedes/pe.d102:peMA.Ode7C22.text	@ltx/en_us_dedes/pe.d095:peMA.Ode7C22.text
ltx/en_us_dedes/pe.d102:peMA.Ode7C23.incipit	@ltx/en_us_dedes/pe.d095:peMA.Ode7C23.incipit
ltx/en_us_dedes/pe.d102:peMA.Ode7C23.melody	@ltx/en_us_dedes/pe.d095:peMA.Ode7C23.melody
ltx/en_us_dedes/pe.d102:peMA.Ode7C23.mode	@ltx/en_us_dedes/pe.d095:peMA.Ode7C23.mode
ltx/en_us_dedes/pe.d102:peMA.Ode7C23.ode	@ltx/en_us_dedes/pe.d095:peMA.Ode7C23.ode
ltx/en_us_dedes/pe.d102:peMA.Ode7C23.text	@ltx/en_us_dedes/pe.d095:peMA.Ode7C23.text
ltx/en_us_dedes/pe.d102:peMA.Ode7C24.incipit	@ltx/en_us_dedes/pe.d095:peMA.Ode7C24.incipit
ltx/en_us_dedes/pe.d102:peMA.Ode7C24.melody	@ltx/en_us_dedes/pe.d095:peMA.Ode7C24.melody
ltx/en_us_dedes/pe.d102:peMA.Ode7C24.mode	@ltx/en_us_dedes/pe.d095:peMA.Ode7C24.mode
ltx/en_us_dedes/pe.d102:peMA.Ode7C24.ode	@ltx/en_us_dedes/pe.d095:peMA.Ode7C24.ode
ltx/en_us_dedes/pe.d102:peMA.Ode7C24.text	@ltx/en_us_dedes/pe.d095:peMA.Ode7C24.text
ltx/en_us_dedes/pe.d102:peMA.Ode7C25.incipit	@ltx/en_us_dedes/pe.d095:peMA.Ode7C25.incipit
ltx/en_us_dedes/pe.d102:peMA.Ode7C25.melody	@ltx/en_us_dedes/pe.d095:peMA.Ode7C25.melody
ltx/en_us_dedes/pe.d102:peMA.Ode7C25.mode	@ltx/en_us_dedes/pe.d095:peMA.Ode7C25.mode
ltx/en_us_dedes/pe.d102:peMA.Ode7C25.ode	@ltx/en_us_dedes/pe.d095:peMA.Ode7C25.ode
ltx/en_us_dedes/pe.d102:peMA.Ode7C25.text	@ltx/en_us_dedes/pe.d095:peMA.Ode7C25.text
ltx/en_us_dedes/pe.d102:peMA.Ode7C26.incipit	@ltx/en_us_dedes/pe.d095:peMA.Ode7C26.incipit
ltx/en_us_dedes/pe.d102:peMA.Ode7C26.melody	@ltx/en_us_dedes/pe.d095:peMA.Ode7C26.melody
ltx/en_us_dedes/pe.d102:peMA.Ode7C26.mode	@ltx/en_us_dedes/pe.d095:peMA.Ode7C26.mode
ltx/en_us_dedes/pe.d102:peMA.Ode7C26.ode	@ltx/en_us_dedes/pe.d095:peMA.Ode7C26.ode
ltx/en_us_dedes/pe.d102:peMA.Ode7C26.text	@ltx/en_us_dedes/pe.d095:peMA.Ode7C26.text
ltx/en_us_dedes/pe.d102:peMA.Ode7C27.incipit	@ltx/en_us_dedes/pe.d095:peMA.Ode7C27.incipit
ltx/en_us_dedes/pe.d102:peMA.Ode7C27.melody	@ltx/en_us_dedes/pe.d095:peMA.Ode7C27.melody
ltx/en_us_dedes/pe.d102:peMA.Ode7C27.mode	@ltx/en_us_dedes/pe.d095:peMA.Ode7C27.mode
ltx/en_us_dedes/pe.d102:peMA.Ode7C27.ode	@ltx/en_us_dedes/pe.d095:peMA.Ode7C27.ode
ltx/en_us_dedes/pe.d102:peMA.Ode7C27.text	@ltx/en_us_dedes/pe.d095:peMA.Ode7C27.text
ltx/en_us_dedes/pe.d102:peMA.Ode7C2H.greekmelody	@ltx/en_us_dedes/pe.d095:peMA.Ode7C2H.greekmelody
ltx/en_us_dedes/pe.d102:peMA.Ode7C2H.incipit	@ltx/en_us_dedes/pe.d095:peMA.Ode7C2H.incipit
ltx/en_us_dedes/pe.d102:peMA.Ode7C2H.melody	@ltx/en_us_dedes/pe.d095:peMA.Ode7C2H.melody
ltx/en_us_dedes/pe.d102:peMA.Ode7C2H.mode	@ltx/en_us_dedes/pe.d095:peMA.Ode7C2H.mode
ltx/en_us_dedes/pe.d102:peMA.Ode7C2H.ode	@ltx/en_us_dedes/pe.d095:peMA.Ode7C2H.ode
ltx/en_us_dedes/pe.d102:peMA.Ode7C2H.text	@ltx/en_us_dedes/pe.d095:peMA.Ode7C2H.text
ltx/en_us_dedes/pe.d102:peMA.Ode7C2T.incipit	@ltx/en_us_dedes/pe.d095:peMA.Ode7C2T.incipit
ltx/en_us_dedes/pe.d102:peMA.Ode7C2T.melody	@ltx/en_us_dedes/pe.d095:peMA.Ode7C2T.melody
ltx/en_us_dedes/pe.d102:peMA.Ode7C2T.mode	@ltx/en_us_dedes/pe.d095:peMA.Ode7C2T.mode
ltx/en_us_dedes/pe.d102:peMA.Ode7C2T.ode	@ltx/en_us_dedes/pe.d095:peMA.Ode7C2T.ode
ltx/en_us_dedes/pe.d102:peMA.Ode7C2T.text	@ltx/en_us_dedes/pe.d095:peMA.Ode7C2T.text
ltx/en_us_dedes/pe.d102:peMA.Ode7C2Tr.incipit	@ltx/en_us_dedes/pe.d095:peMA.Ode7C2Tr.incipit
ltx/en_us_dedes/pe.d102:peMA.Ode7C2Tr.melody	@ltx/en_us_dedes/pe.d095:peMA.Ode7C2Tr.melody
ltx/en_us_dedes/pe.d102:peMA.Ode7C2Tr.mode	@ltx/en_us_dedes/pe.d095:peMA.Ode7C2Tr.mode
ltx/en_us_dedes/pe.d102:peMA.Ode7C2Tr.ode	@ltx/en_us_dedes/pe.d095:peMA.Ode7C2Tr.ode
ltx/en_us_dedes/pe.d102:peMA.Ode7C2Tr.text	@ltx/en_us_dedes/pe.d095:peMA.Ode7C2Tr.text
ltx/en_us_dedes/pe.d102:peMA.Ode8C11.greekmelody	@ltx/en_us_dedes/pe.d095:peMA.Ode8C11.greekmelody
ltx/en_us_dedes/pe.d102:peMA.Ode8C11.incipit	@ltx/en_us_dedes/pe.d095:peMA.Ode8C11.incipit
ltx/en_us_dedes/pe.d102:peMA.Ode8C11.melody	@ltx/en_us_dedes/pe.d095:peMA.Ode8C11.melody
ltx/en_us_dedes/pe.d102:peMA.Ode8C11.mode	@ltx/en_us_dedes/pe.d095:peMA.Ode8C11.mode
ltx/en_us_dedes/pe.d102:peMA.Ode8C11.ode	@ltx/en_us_dedes/pe.d095:peMA.Ode8C11.ode
ltx/en_us_dedes/pe.d102:peMA.Ode8C11.text	@ltx/en_us_dedes/pe.d095:peMA.Ode8C11.text
ltx/en_us_dedes/pe.d102:peMA.Ode8C12.incipit	@ltx/en_us_dedes/pe.d095:peMA.Ode8C12.incipit
ltx/en_us_dedes/pe.d102:peMA.Ode8C12.melody	@ltx/en_us_dedes/pe.d095:peMA.Ode8C12.melody
ltx/en_us_dedes/pe.d102:peMA.Ode8C12.mode	@ltx/en_us_dedes/pe.d095:peMA.Ode8C12.mode
ltx/en_us_dedes/pe.d102:peMA.Ode8C12.ode	@ltx/en_us_dedes/pe.d095:peMA.Ode8C12.ode
ltx/en_us_dedes/pe.d102:peMA.Ode8C12.text	@ltx/en_us_dedes/pe.d095:peMA.Ode8C12.text
ltx/en_us_dedes/pe.d102:peMA.Ode8C13.incipit	@ltx/en_us_dedes/pe.d095:peMA.Ode8C13.incipit
ltx/en_us_dedes/pe.d102:peMA.Ode8C13.melody	@ltx/en_us_dedes/pe.d095:peMA.Ode8C13.melody
ltx/en_us_dedes/pe.d102:peMA.Ode8C13.mode	@ltx/en_us_dedes/pe.d095:peMA.Ode8C13.mode
ltx/en_us_dedes/pe.d102:peMA.Ode8C13.ode	@ltx/en_us_dedes/pe.d095:peMA.Ode8C13.ode
ltx/en_us_dedes/pe.d102:peMA.Ode8C13.text	@ltx/en_us_dedes/pe.d095:peMA.Ode8C13.text
ltx/en_us_dedes/pe.d102:peMA.Ode8C1H.greekmelody	@ltx/en_us_dedes/pe.d095:peMA.Ode8C1H.greekmelody
ltx/en_us_dedes/pe.d102:peMA.Ode8C1H.incipit	@ltx/en_us_dedes/pe.d095:peMA.Ode8C1H.incipit
ltx/en_us_dedes/pe.d102:peMA.Ode8C1H.melody	@ltx/en_us_dedes/pe.d095:peMA.Ode8C1H.melody
ltx/en_us_dedes/pe.d102:peMA.Ode8C1H.mode	@ltx/en_us_dedes/pe.d095:peMA.Ode8C1H.mode
ltx/en_us_dedes/pe.d102:peMA.Ode8C1H.ode	@ltx/en_us_dedes/pe.d095:peMA.Ode8C1H.ode
ltx/en_us_dedes/pe.d102:peMA.Ode8C1H.text	@ltx/en_us_dedes/pe.d095:peMA.Ode8C1H.text
ltx/en_us_dedes/pe.d102:peMA.Ode8C1T.incipit	@ltx/en_us_dedes/pe.d095:peMA.Ode8C1T.incipit
ltx/en_us_dedes/pe.d102:peMA.Ode8C1T.melody	@ltx/en_us_dedes/pe.d095:peMA.Ode8C1T.melody
ltx/en_us_dedes/pe.d102:peMA.Ode8C1T.mode	@ltx/en_us_dedes/pe.d095:peMA.Ode8C1T.mode
ltx/en_us_dedes/pe.d102:peMA.Ode8C1T.ode	@ltx/en_us_dedes/pe.d095:peMA.Ode8C1T.ode
ltx/en_us_dedes/pe.d102:peMA.Ode8C1T.text	@ltx/en_us_dedes/pe.d095:peMA.Ode8C1T.text
ltx/en_us_dedes/pe.d102:peMA.Ode8C21.greekmelody	@ltx/en_us_dedes/pe.d095:peMA.Ode8C21.greekmelody
ltx/en_us_dedes/pe.d102:peMA.Ode8C21.incipit	@ltx/en_us_dedes/pe.d095:peMA.Ode8C21.incipit
ltx/en_us_dedes/pe.d102:peMA.Ode8C21.melody	@ltx/en_us_dedes/pe.d095:peMA.Ode8C21.melody
ltx/en_us_dedes/pe.d102:peMA.Ode8C21.mode	@ltx/en_us_dedes/pe.d095:peMA.Ode8C21.mode
ltx/en_us_dedes/pe.d102:peMA.Ode8C21.ode	@ltx/en_us_dedes/pe.d095:peMA.Ode8C21.ode
ltx/en_us_dedes/pe.d102:peMA.Ode8C21.text	@ltx/en_us_dedes/pe.d095:peMA.Ode8C21.text
ltx/en_us_dedes/pe.d102:peMA.Ode8C22.incipit	@ltx/en_us_dedes/pe.d095:peMA.Ode8C22.incipit
ltx/en_us_dedes/pe.d102:peMA.Ode8C22.melody	@ltx/en_us_dedes/pe.d095:peMA.Ode8C22.melody
ltx/en_us_dedes/pe.d102:peMA.Ode8C22.mode	@ltx/en_us_dedes/pe.d095:peMA.Ode8C22.mode
ltx/en_us_dedes/pe.d102:peMA.Ode8C22.ode	@ltx/en_us_dedes/pe.d095:peMA.Ode8C22.ode
ltx/en_us_dedes/pe.d102:peMA.Ode8C22.text	@ltx/en_us_dedes/pe.d095:peMA.Ode8C22.text
ltx/en_us_dedes/pe.d102:peMA.Ode8C23.incipit	@ltx/en_us_dedes/pe.d095:peMA.Ode8C23.incipit
ltx/en_us_dedes/pe.d102:peMA.Ode8C23.melody	@ltx/en_us_dedes/pe.d095:peMA.Ode8C23.melody
ltx/en_us_dedes/pe.d102:peMA.Ode8C23.mode	@ltx/en_us_dedes/pe.d095:peMA.Ode8C23.mode
ltx/en_us_dedes/pe.d102:peMA.Ode8C23.ode	@ltx/en_us_dedes/pe.d095:peMA.Ode8C23.ode
ltx/en_us_dedes/pe.d102:peMA.Ode8C23.text	@ltx/en_us_dedes/pe.d095:peMA.Ode8C23.text
ltx/en_us_dedes/pe.d102:peMA.Ode8C24.incipit	@ltx/en_us_dedes/pe.d095:peMA.Ode8C24.incipit
ltx/en_us_dedes/pe.d102:peMA.Ode8C24.melody	@ltx/en_us_dedes/pe.d095:peMA.Ode8C24.melody
ltx/en_us_dedes/pe.d102:peMA.Ode8C24.mode	@ltx/en_us_dedes/pe.d095:peMA.Ode8C24.mode
ltx/en_us_dedes/pe.d102:peMA.Ode8C24.ode	@ltx/en_us_dedes/pe.d095:peMA.Ode8C24.ode
ltx/en_us_dedes/pe.d102:peMA.Ode8C24.text	@ltx/en_us_dedes/pe.d095:peMA.Ode8C24.text
ltx/en_us_dedes/pe.d102:peMA.Ode8C25.incipit	@ltx/en_us_dedes/pe.d095:peMA.Ode8C25.incipit
ltx/en_us_dedes/pe.d102:peMA.Ode8C25.melody	@ltx/en_us_dedes/pe.d095:peMA.Ode8C25.melody
ltx/en_us_dedes/pe.d102:peMA.Ode8C25.mode	@ltx/en_us_dedes/pe.d095:peMA.Ode8C25.mode
ltx/en_us_dedes/pe.d102:peMA.Ode8C25.ode	@ltx/en_us_dedes/pe.d095:peMA.Ode8C25.ode
ltx/en_us_dedes/pe.d102:peMA.Ode8C25.text	@ltx/en_us_dedes/pe.d095:peMA.Ode8C25.text
ltx/en_us_dedes/pe.d102:peMA.Ode8C26.incipit	@ltx/en_us_dedes/pe.d095:peMA.Ode8C26.incipit
ltx/en_us_dedes/pe.d102:peMA.Ode8C26.melody	@ltx/en_us_dedes/pe.d095:peMA.Ode8C26.melody
ltx/en_us_dedes/pe.d102:peMA.Ode8C26.mode	@ltx/en_us_dedes/pe.d095:peMA.Ode8C26.mode
ltx/en_us_dedes/pe.d102:peMA.Ode8C26.ode	@ltx/en_us_dedes/pe.d095:peMA.Ode8C26.ode
ltx/en_us_dedes/pe.d102:peMA.Ode8C26.text	@ltx/en_us_dedes/pe.d095:peMA.Ode8C26.text
ltx/en_us_dedes/pe.d102:peMA.Ode8C27.incipit	@ltx/en_us_dedes/pe.d095:peMA.Ode8C27.incipit
ltx/en_us_dedes/pe.d102:peMA.Ode8C27.melody	@ltx/en_us_dedes/pe.d095:peMA.Ode8C27.melody
ltx/en_us_dedes/pe.d102:peMA.Ode8C27.mode	@ltx/en_us_dedes/pe.d095:peMA.Ode8C27.mode
ltx/en_us_dedes/pe.d102:peMA.Ode8C27.ode	@ltx/en_us_dedes/pe.d095:peMA.Ode8C27.ode
ltx/en_us_dedes/pe.d102:peMA.Ode8C27.text	@ltx/en_us_dedes/pe.d095:peMA.Ode8C27.text
ltx/en_us_dedes/pe.d102:peMA.Ode8C2H.greekmelody	@ltx/en_us_dedes/pe.d095:peMA.Ode8C2H.greekmelody
ltx/en_us_dedes/pe.d102:peMA.Ode8C2H.incipit	@ltx/en_us_dedes/pe.d095:peMA.Ode8C2H.incipit
ltx/en_us_dedes/pe.d102:peMA.Ode8C2H.melody	@ltx/en_us_dedes/pe.d095:peMA.Ode8C2H.melody
ltx/en_us_dedes/pe.d102:peMA.Ode8C2H.mode	@ltx/en_us_dedes/pe.d095:peMA.Ode8C2H.mode
ltx/en_us_dedes/pe.d102:peMA.Ode8C2H.ode	@ltx/en_us_dedes/pe.d095:peMA.Ode8C2H.ode
ltx/en_us_dedes/pe.d102:peMA.Ode8C2H.text	@ltx/en_us_dedes/pe.d095:peMA.Ode8C2H.text
ltx/en_us_dedes/pe.d102:peMA.Ode8C2T.incipit	@ltx/en_us_dedes/pe.d095:peMA.Ode8C2T.incipit
ltx/en_us_dedes/pe.d102:peMA.Ode8C2T.melody	@ltx/en_us_dedes/pe.d095:peMA.Ode8C2T.melody
ltx/en_us_dedes/pe.d102:peMA.Ode8C2T.mode	@ltx/en_us_dedes/pe.d095:peMA.Ode8C2T.mode
ltx/en_us_dedes/pe.d102:peMA.Ode8C2T.ode	@ltx/en_us_dedes/pe.d095:peMA.Ode8C2T.ode
ltx/en_us_dedes/pe.d102:peMA.Ode8C2T.text	@ltx/en_us_dedes/pe.d095:peMA.Ode8C2T.text
ltx/en_us_dedes/pe.d102:peMA.Ode8C2Tr.incipit	@ltx/en_us_dedes/pe.d095:peMA.Ode8C2Tr.incipit
ltx/en_us_dedes/pe.d102:peMA.Ode8C2Tr.melody	@ltx/en_us_dedes/pe.d095:peMA.Ode8C2Tr.melody
ltx/en_us_dedes/pe.d102:peMA.Ode8C2Tr.mode	@ltx/en_us_dedes/pe.d095:peMA.Ode8C2Tr.mode
ltx/en_us_dedes/pe.d102:peMA.Ode8C2Tr.ode	@ltx/en_us_dedes/pe.d095:peMA.Ode8C2Tr.ode
ltx/en_us_dedes/pe.d102:peMA.Ode8C2Tr.text	@ltx/en_us_dedes/pe.d095:peMA.Ode8C2Tr.text
ltx/en_us_dedes/pe.d102:peMA.Ode9C11.greekmelody	@ltx/en_us_dedes/pe.d095:peMA.Ode9C11.greekmelody
ltx/en_us_dedes/pe.d102:peMA.Ode9C11.incipit	@ltx/en_us_dedes/pe.d095:peMA.Ode9C11.incipit
ltx/en_us_dedes/pe.d102:peMA.Ode9C11.melody	@ltx/en_us_dedes/pe.d095:peMA.Ode9C11.melody
ltx/en_us_dedes/pe.d102:peMA.Ode9C11.mode	@ltx/en_us_dedes/pe.d095:peMA.Ode9C11.mode
ltx/en_us_dedes/pe.d102:peMA.Ode9C11.ode	@ltx/en_us_dedes/pe.d095:peMA.Ode9C11.ode
ltx/en_us_dedes/pe.d102:peMA.Ode9C11.text	@ltx/en_us_dedes/pe.d095:peMA.Ode9C11.text
ltx/en_us_dedes/pe.d102:peMA.Ode9C12.incipit	@ltx/en_us_dedes/pe.d095:peMA.Ode9C12.incipit
ltx/en_us_dedes/pe.d102:peMA.Ode9C12.melody	@ltx/en_us_dedes/pe.d095:peMA.Ode9C12.melody
ltx/en_us_dedes/pe.d102:peMA.Ode9C12.mode	@ltx/en_us_dedes/pe.d095:peMA.Ode9C12.mode
ltx/en_us_dedes/pe.d102:peMA.Ode9C12.ode	@ltx/en_us_dedes/pe.d095:peMA.Ode9C12.ode
ltx/en_us_dedes/pe.d102:peMA.Ode9C12.text	@ltx/en_us_dedes/pe.d095:peMA.Ode9C12.text
ltx/en_us_dedes/pe.d102:peMA.Ode9C13.incipit	@ltx/en_us_dedes/pe.d095:peMA.Ode9C13.incipit
ltx/en_us_dedes/pe.d102:peMA.Ode9C13.melody	@ltx/en_us_dedes/pe.d095:peMA.Ode9C13.melody
ltx/en_us_dedes/pe.d102:peMA.Ode9C13.mode	@ltx/en_us_dedes/pe.d095:peMA.Ode9C13.mode
ltx/en_us_dedes/pe.d102:peMA.Ode9C13.ode	@ltx/en_us_dedes/pe.d095:peMA.Ode9C13.ode
ltx/en_us_dedes/pe.d102:peMA.Ode9C13.text	@ltx/en_us_dedes/pe.d095:peMA.Ode9C13.text
ltx/en_us_dedes/pe.d102:peMA.Ode9C1H.greekmelody	@ltx/en_us_dedes/pe.d095:peMA.Ode9C1H.greekmelody
ltx/en_us_dedes/pe.d102:peMA.Ode9C1H.incipit	@ltx/en_us_dedes/pe.d095:peMA.Ode9C1H.incipit
ltx/en_us_dedes/pe.d102:peMA.Ode9C1H.melody	@ltx/en_us_dedes/pe.d095:peMA.Ode9C1H.melody
ltx/en_us_dedes/pe.d102:peMA.Ode9C1H.mode	@ltx/en_us_dedes/pe.d095:peMA.Ode9C1H.mode
ltx/en_us_dedes/pe.d102:peMA.Ode9C1H.ode	@ltx/en_us_dedes/pe.d095:peMA.Ode9C1H.ode
ltx/en_us_dedes/pe.d102:peMA.Ode9C1H.text	@ltx/en_us_dedes/pe.d095:peMA.Ode9C1H.text
ltx/en_us_dedes/pe.d102:peMA.Ode9C1T.incipit	@ltx/en_us_dedes/pe.d095:peMA.Ode9C1T.incipit
ltx/en_us_dedes/pe.d102:peMA.Ode9C1T.melody	@ltx/en_us_dedes/pe.d095:peMA.Ode9C1T.melody
ltx/en_us_dedes/pe.d102:peMA.Ode9C1T.mode	@ltx/en_us_dedes/pe.d095:peMA.Ode9C1T.mode
ltx/en_us_dedes/pe.d102:peMA.Ode9C1T.ode	@ltx/en_us_dedes/pe.d095:peMA.Ode9C1T.ode
ltx/en_us_dedes/pe.d102:peMA.Ode9C1T.text	@ltx/en_us_dedes/pe.d095:peMA.Ode9C1T.text
ltx/en_us_dedes/pe.d102:peMA.Ode9C21.greekmelody	@ltx/en_us_dedes/pe.d095:peMA.Ode9C21.greekmelody
ltx/en_us_dedes/pe.d102:peMA.Ode9C21.incipit	@ltx/en_us_dedes/pe.d095:peMA.Ode9C21.incipit
ltx/en_us_dedes/pe.d102:peMA.Ode9C21.melody	@ltx/en_us_dedes/pe.d095:peMA.Ode9C21.melody
ltx/en_us_dedes/pe.d102:peMA.Ode9C21.mode	@ltx/en_us_dedes/pe.d095:peMA.Ode9C21.mode
ltx/en_us_dedes/pe.d102:peMA.Ode9C21.ode	@ltx/en_us_dedes/pe.d095:peMA.Ode9C21.ode
ltx/en_us_dedes/pe.d102:peMA.Ode9C21.text	@ltx/en_us_dedes/pe.d095:peMA.Ode9C21.text
ltx/en_us_dedes/pe.d102:peMA.Ode9C22.incipit	@ltx/en_us_dedes/pe.d095:peMA.Ode9C22.incipit
ltx/en_us_dedes/pe.d102:peMA.Ode9C22.melody	@ltx/en_us_dedes/pe.d095:peMA.Ode9C22.melody
ltx/en_us_dedes/pe.d102:peMA.Ode9C22.mode	@ltx/en_us_dedes/pe.d095:peMA.Ode9C22.mode
ltx/en_us_dedes/pe.d102:peMA.Ode9C22.ode	@ltx/en_us_dedes/pe.d095:peMA.Ode9C22.ode
ltx/en_us_dedes/pe.d102:peMA.Ode9C22.text	@ltx/en_us_dedes/pe.d095:peMA.Ode9C22.text
ltx/en_us_dedes/pe.d102:peMA.Ode9C23.incipit	@ltx/en_us_dedes/pe.d095:peMA.Ode9C23.incipit
ltx/en_us_dedes/pe.d102:peMA.Ode9C23.melody	@ltx/en_us_dedes/pe.d095:peMA.Ode9C23.melody
ltx/en_us_dedes/pe.d102:peMA.Ode9C23.mode	@ltx/en_us_dedes/pe.d095:peMA.Ode9C23.mode
ltx/en_us_dedes/pe.d102:peMA.Ode9C23.ode	@ltx/en_us_dedes/pe.d095:peMA.Ode9C23.ode
ltx/en_us_dedes/pe.d102:peMA.Ode9C23.text	@ltx/en_us_dedes/pe.d095:peMA.Ode9C23.text
ltx/en_us_dedes/pe.d102:peMA.Ode9C24.incipit	@ltx/en_us_dedes/pe.d095:peMA.Ode9C24.incipit
ltx/en_us_dedes/pe.d102:peMA.Ode9C24.melody	@ltx/en_us_dedes/pe.d095:peMA.Ode9C24.melody
ltx/en_us_dedes/pe.d102:peMA.Ode9C24.mode	@ltx/en_us_dedes/pe.d095:peMA.Ode9C24.mode
ltx/en_us_dedes/pe.d102:peMA.Ode9C24.ode	@ltx/en_us_dedes/pe.d095:peMA.Ode9C24.ode
ltx/en_us_dedes/pe.d102:peMA.Ode9C24.text	@ltx/en_us_dedes/pe.d095:peMA.Ode9C24.text
ltx/en_us_dedes/pe.d102:peMA.Ode9C25.incipit	@ltx/en_us_dedes/pe.d095:peMA.Ode9C25.incipit
ltx/en_us_dedes/pe.d102:peMA.Ode9C25.melody	@ltx/en_us_dedes/pe.d095:peMA.Ode9C25.melody
ltx/en_us_dedes/pe.d102:peMA.Ode9C25.mode	@ltx/en_us_dedes/pe.d095:peMA.Ode9C25.mode
ltx/en_us_dedes/pe.d102:peMA.Ode9C25.ode	@ltx/en_us_dedes/pe.d095:peMA.Ode9C25.ode
ltx/en_us_dedes/pe.d102:peMA.Ode9C25.text	@ltx/en_us_dedes/pe.d095:peMA.Ode9C25.text
ltx/en_us_dedes/pe.d102:peMA.Ode9C26.incipit	@ltx/en_us_dedes/pe.d095:peMA.Ode9C26.incipit
ltx/en_us_dedes/pe.d102:peMA.Ode9C26.melody	@ltx/en_us_dedes/pe.d095:peMA.Ode9C26.melody
ltx/en_us_dedes/pe.d102:peMA.Ode9C26.mode	@ltx/en_us_dedes/pe.d095:peMA.Ode9C26.mode
ltx/en_us_dedes/pe.d102:peMA.Ode9C26.ode	@ltx/en_us_dedes/pe.d095:peMA.Ode9C26.ode
ltx/en_us_dedes/pe.d102:peMA.Ode9C26.text	@ltx/en_us_dedes/pe.d095:peMA.Ode9C26.text
ltx/en_us_dedes/pe.d102:peMA.Ode9C27.incipit	@ltx/en_us_dedes/pe.d095:peMA.Ode9C27.incipit
ltx/en_us_dedes/pe.d102:peMA.Ode9C27.melody	@ltx/en_us_dedes/pe.d095:peMA.Ode9C27.melody
ltx/en_us_dedes/pe.d102:peMA.Ode9C27.mode	@ltx/en_us_dedes/pe.d095:peMA.Ode9C27.mode
ltx/en_us_dedes/pe.d102:peMA.Ode9C27.ode	@ltx/en_us_dedes/pe.d095:peMA.Ode9C27.ode
ltx/en_us_dedes/pe.d102:peMA.Ode9C27.text	@ltx/en_us_dedes/pe.d095:peMA.Ode9C27.text
ltx/en_us_dedes/pe.d102:peMA.Ode9C2H.greekmelody	@ltx/en_us_dedes/pe.d095:peMA.Ode9C2H.greekmelody
ltx/en_us_dedes/pe.d102:peMA.Ode9C2H.incipit	@ltx/en_us_dedes/pe.d095:peMA.Ode9C2H.incipit
ltx/en_us_dedes/pe.d102:peMA.Ode9C2H.melody	@ltx/en_us_dedes/pe.d095:peMA.Ode9C2H.melody
ltx/en_us_dedes/pe.d102:peMA.Ode9C2H.mode	@ltx/en_us_dedes/pe.d095:peMA.Ode9C2H.mode
ltx/en_us_dedes/pe.d102:peMA.Ode9C2H.ode	@ltx/en_us_dedes/pe.d095:peMA.Ode9C2H.ode
ltx/en_us_dedes/pe.d102:peMA.Ode9C2H.text	@ltx/en_us_dedes/pe.d095:peMA.Ode9C2H.text
ltx/en_us_dedes/pe.d102:peMA.Ode9C2T.incipit	@ltx/en_us_dedes/pe.d095:peMA.Ode9C2T.incipit
ltx/en_us_dedes/pe.d102:peMA.Ode9C2T.melody	@ltx/en_us_dedes/pe.d095:peMA.Ode9C2T.melody
ltx/en_us_dedes/pe.d102:peMA.Ode9C2T.mode	@ltx/en_us_dedes/pe.d095:peMA.Ode9C2T.mode
ltx/en_us_dedes/pe.d102:peMA.Ode9C2T.ode	@ltx/en_us_dedes/pe.d095:peMA.Ode9C2T.ode
ltx/en_us_dedes/pe.d102:peMA.Ode9C2T.text	@ltx/en_us_dedes/pe.d095:peMA.Ode9C2T.text
ltx/en_us_dedes/pe.d102:peMA.Ode9C2Tr.incipit	@ltx/en_us_dedes/pe.d095:peMA.Ode9C2Tr.incipit
ltx/en_us_dedes/pe.d102:peMA.Ode9C2Tr.melody	@ltx/en_us_dedes/pe.d095:peMA.Ode9C2Tr.melody
ltx/en_us_dedes/pe.d102:peMA.Ode9C2Tr.mode	@ltx/en_us_dedes/pe.d095:peMA.Ode9C2Tr.mode
ltx/en_us_dedes/pe.d102:peMA.Ode9C2Tr.ode	@ltx/en_us_dedes/pe.d095:peMA.Ode9C2Tr.ode
ltx/en_us_dedes/pe.d102:peMA.Ode9C2Tr.text	@ltx/en_us_dedes/pe.d095:peMA.Ode9C2Tr.text
ltx/en_us_dedes/pe.d102:peMA.Oikos1.text	@ltx/en_us_dedes/pe.d095:peMA.Oikos1.text
ltx/en_us_dedes/pe.d102:peVE.Apolytikion1.incipit	@ltx/en_us_dedes/pe.d095:peVE.Apolytikion1.incipit
ltx/en_us_dedes/pe.d102:peVE.Apolytikion1.melody	@ltx/en_us_dedes/pe.d095:peVE.Apolytikion1.melody
ltx/en_us_dedes/pe.d102:peVE.Apolytikion1.mode	@ltx/en_us_dedes/pe.d095:peVE.Apolytikion1.mode
ltx/en_us_dedes/pe.d102:peVE.Apolytikion1.text	@ltx/en_us_dedes/pe.d095:peVE.Apolytikion1.text
ltx/en_us_dedes/pe.d102:peVE.AposGlory.incipit	@ltx/en_us_dedes/pe.d095:peVE.AposGlory.incipit
ltx/en_us_dedes/pe.d102:peVE.AposGlory.melody	@ltx/en_us_dedes/pe.d095:peVE.AposGlory.melody
ltx/en_us_dedes/pe.d102:peVE.AposGlory.mode	@ltx/en_us_dedes/pe.d095:peVE.AposGlory.mode
ltx/en_us_dedes/pe.d102:peVE.AposGlory.text	@ltx/en_us_dedes/pe.d095:peVE.AposGlory.text
ltx/en_us_dedes/pe.d102:peVE.Aposticha1.incipit	@ltx/en_us_dedes/pe.d095:peVE.Aposticha1.incipit
ltx/en_us_dedes/pe.d102:peVE.Aposticha1.melody	@ltx/en_us_dedes/pe.d095:peVE.Aposticha1.melody
ltx/en_us_dedes/pe.d102:peVE.Aposticha1.mode	@ltx/en_us_dedes/pe.d095:peVE.Aposticha1.mode
ltx/en_us_dedes/pe.d102:peVE.Aposticha1.poet	@ltx/en_us_dedes/pe.d095:peVE.Aposticha1.poet
ltx/en_us_dedes/pe.d102:peVE.Aposticha1.text	@ltx/en_us_dedes/pe.d095:peVE.Aposticha1.text
ltx/en_us_dedes/pe.d102:peVE.Aposticha2.incipit	@ltx/en_us_dedes/pe.d095:peVE.Aposticha2.incipit
ltx/en_us_dedes/pe.d102:peVE.Aposticha2.melody	@ltx/en_us_dedes/pe.d095:peVE.Aposticha2.melody
ltx/en_us_dedes/pe.d102:peVE.Aposticha2.mode	@ltx/en_us_dedes/pe.d095:peVE.Aposticha2.mode
ltx/en_us_dedes/pe.d102:peVE.Aposticha2.text	@ltx/en_us_dedes/pe.d095:peVE.Aposticha2.text
ltx/en_us_dedes/pe.d102:peVE.Aposticha3.incipit	@ltx/en_us_dedes/pe.d095:peVE.Aposticha3.incipit
ltx/en_us_dedes/pe.d102:peVE.Aposticha3.melody	@ltx/en_us_dedes/pe.d095:peVE.Aposticha3.melody
ltx/en_us_dedes/pe.d102:peVE.Aposticha3.mode	@ltx/en_us_dedes/pe.d095:peVE.Aposticha3.mode
ltx/en_us_dedes/pe.d102:peVE.Aposticha3.text	@ltx/en_us_dedes/pe.d095:peVE.Aposticha3.text
ltx/en_us_dedes/pe.d102:peVE.MM.Stichera1123as3456.text	@ltx/en_us_dedes/pe.d095:peVE.MM.Stichera1123as3456.text
ltx/en_us_dedes/pe.d102:peVE.MM.Stichera11as56.text	@ltx/en_us_dedes/pe.d095:peVE.MM.Stichera11as56.text
ltx/en_us_dedes/pe.d102:peVE.MM.Stichera22as78.text	@ltx/en_us_dedes/pe.d095:peVE.MM.Stichera22as78.text
ltx/en_us_dedes/pe.d102:peVE.MM.Stichera33as910.text	@ltx/en_us_dedes/pe.d095:peVE.MM.Stichera33as910.text
ltx/en_us_dedes/pe.d102:peVE.SticGlory.incipit	@ltx/en_us_dedes/pe.d095:peVE.SticGlory.incipit
ltx/en_us_dedes/pe.d102:peVE.SticGlory.melody	@ltx/en_us_dedes/pe.d095:peVE.SticGlory.melody
ltx/en_us_dedes/pe.d102:peVE.SticGlory.mode	@ltx/en_us_dedes/pe.d095:peVE.SticGlory.mode
ltx/en_us_dedes/pe.d102:peVE.SticGlory.text	@ltx/en_us_dedes/pe.d095:peVE.SticGlory.text
ltx/en_us_dedes/pe.d102:peVE.Stichera01.greekmelody	@ltx/en_us_dedes/pe.d095:peVE.Stichera01.greekmelody
ltx/en_us_dedes/pe.d102:peVE.Stichera01.incipit	@ltx/en_us_dedes/pe.d095:peVE.Stichera01.incipit
ltx/en_us_dedes/pe.d102:peVE.Stichera01.melody	@ltx/en_us_dedes/pe.d095:peVE.Stichera01.melody
ltx/en_us_dedes/pe.d102:peVE.Stichera01.mode	@ltx/en_us_dedes/pe.d095:peVE.Stichera01.mode
ltx/en_us_dedes/pe.d102:peVE.Stichera01.text	@ltx/en_us_dedes/pe.d095:peVE.Stichera01.text
ltx/en_us_dedes/pe.d102:peVE.Stichera02.incipit	@ltx/en_us_dedes/pe.d095:peVE.Stichera02.incipit
ltx/en_us_dedes/pe.d102:peVE.Stichera02.melody	@ltx/en_us_dedes/pe.d095:peVE.Stichera02.melody
ltx/en_us_dedes/pe.d102:peVE.Stichera02.mode	@ltx/en_us_dedes/pe.d095:peVE.Stichera02.mode
ltx/en_us_dedes/pe.d102:peVE.Stichera02.text	@ltx/en_us_dedes/pe.d095:peVE.Stichera02.text
ltx/en_us_dedes/pe.d102:peVE.Stichera03.incipit	@ltx/en_us_dedes/pe.d095:peVE.Stichera03.incipit
ltx/en_us_dedes/pe.d102:peVE.Stichera03.melody	@ltx/en_us_dedes/pe.d095:peVE.Stichera03.melody
ltx/en_us_dedes/pe.d102:peVE.Stichera03.mode	@ltx/en_us_dedes/pe.d095:peVE.Stichera03.mode
ltx/en_us_dedes/pe.d102:peVE.Stichera03.text	@ltx/en_us_dedes/pe.d095:peVE.Stichera03.text
