ltx/en_us_dedes/me.m02.d27:meDA.commemoration.first	Memory of our St. Procopius of Decapolis
ltx/en_us_dedes/me.m02.d27:meDA.commemoration.first_name	
ltx/en_us_dedes/me.m02.d27:meDA.commemoration.first_short	Memory of our St. Procopius of Decapolis
ltx/en_us_dedes/me.m02.d27:meDA.commemoration.first_title	@ltx/en_us_dedes/titles:ti.DevoutSaintM
ltx/en_us_dedes/me.m02.d27:meDA.commemoration.full	Memory of our Devout Father Procopius of Decapolis
ltx/en_us_dedes/me.m02.d27:meDA.commemoration.second_name	
ltx/en_us_dedes/me.m02.d27:meDA.commemoration.second_title	
ltx/en_us_dedes/me.m02.d27:meDA.date	February 27
ltx/en_us_dedes/me.m02.d27:meDA.fordate	for February 27
ltx/en_us_dedes/me.m02.d27:meDA.insert1	
ltx/en_us_dedes/me.m02.d27:meDA.insert2	
ltx/en_us_dedes/me.m02.d27:meDA.note	
ltx/en_us_dedes/me.m02.d27:meDA.pdfcoverdate	February 27,
ltx/en_us_dedes/me.m02.d27:meDA.pdfheaderdate	February 27
ltx/en_us_dedes/me.m02.d27:meHO.commemorations	
ltx/en_us_dedes/me.m02.d27:meHO.note1	
ltx/en_us_dedes/me.m02.d27:meHO.note2	
ltx/en_us_dedes/me.m02.d27:meHO.number	
ltx/en_us_dedes/me.m02.d27:meHO.rank	
ltx/en_us_dedes/me.m02.d27:meLE.commemoration1	
ltx/en_us_dedes/me.m02.d27:meLE.commemoration2	
ltx/en_us_dedes/me.m02.d27:meLI.Kontakion1.greekmelody	@ltx/en_us_dedes/me.m02.d27:meMA.Kontakion1.greekmelody
ltx/en_us_dedes/me.m02.d27:meLI.Kontakion1.incipit	@ltx/en_us_dedes/me.m02.d27:meMA.Kontakion1.incipit
ltx/en_us_dedes/me.m02.d27:meLI.Kontakion1.melody	@ltx/en_us_dedes/me.m02.d27:meMA.Kontakion1.melody
ltx/en_us_dedes/me.m02.d27:meLI.Kontakion1.mode	@ltx/en_us_dedes/me.m02.d27:meMA.Kontakion1.mode
ltx/en_us_dedes/me.m02.d27:meLI.Kontakion1.text	@ltx/en_us_dedes/me.m02.d27:meMA.Kontakion1.text
ltx/en_us_dedes/me.m02.d27:meLI.Megalynarion.text	
ltx/en_us_dedes/me.m02.d27:meMA.C1.acrostic.notice1	
ltx/en_us_dedes/me.m02.d27:meMA.C1.acrostic.text	
ltx/en_us_dedes/me.m02.d27:meMA.C1.acrostic.title	
ltx/en_us_dedes/me.m02.d27:meMA.C1.poet	@ltx/en_us_dedes/poets:po.Theofanous
ltx/en_us_dedes/me.m02.d27:meMA.C1.title	@ltx/en_us_dedes/titles:ti.CanonDevoutM
ltx/en_us_dedes/me.m02.d27:meMA.C1.verse	@ltx/en_us_dedes/prayers:pr.verse_DevoutMan.text
ltx/en_us_dedes/me.m02.d27:meMA.ExapTheotokion.incipit	Our refuge, great and strong…
ltx/en_us_dedes/me.m02.d27:meMA.ExapTheotokion.melody	@ltx/en_us_dedes/he.a.m2:heAU.GynaikesAkoutisthite.name
ltx/en_us_dedes/me.m02.d27:meMA.ExapTheotokion.mode	@ltx/en_us_dedes/miscellanea:misc.Mode2
ltx/en_us_dedes/me.m02.d27:meMA.ExapTheotokion.text	Our refuge, great and strong, are you, * protector of our sorry souls; * more spacious are you than heaven, * and higher than the Cherubim. * We pray you to implore Your Son * for us your servants who have sinned, * that we all be absolved and freed * from sins and from every danger, * O all-holy Theotokos.
ltx/en_us_dedes/me.m02.d27:meMA.Exaposteilarion1.greekmelody	@ltx/en_us_dedes/he.a.m2:heAU.GynaikesAkoutisthite.greekname
ltx/en_us_dedes/me.m02.d27:meMA.Exaposteilarion1.incipit	Procopius, when you took leave…
ltx/en_us_dedes/me.m02.d27:meMA.Exaposteilarion1.melody	@ltx/en_us_dedes/he.a.m2:heAU.GynaikesAkoutisthite.name
ltx/en_us_dedes/me.m02.d27:meMA.Exaposteilarion1.mode	@ltx/en_us_dedes/miscellanea:misc.Mode2
ltx/en_us_dedes/me.m02.d27:meMA.Exaposteilarion1.text	Procopius, when you took leave * of your all precious flesh, you went * to stand with Angels before God, * the unapproachable Trinity. * Glorious Father, when you pray, * commemorate us, who with love * observe your holy memory * and honor you and extol you, * O wise and eminent Bishop.
ltx/en_us_dedes/me.m02.d27:meMA.Kontakion1.greekmelody	@ltx/en_us_dedes/he.a.m4:heAU.EpefanisSimeron.greekname
ltx/en_us_dedes/me.m02.d27:meMA.Kontakion1.incipit	O Confessor, as the Church…
ltx/en_us_dedes/me.m02.d27:meMA.Kontakion1.melody	@ltx/en_us_dedes/he.a.m4:heAU.EpefanisSimeron.name
ltx/en_us_dedes/me.m02.d27:meMA.Kontakion1.mode	@ltx/en_us_dedes/miscellanea:misc.Mode4
ltx/en_us_dedes/me.m02.d27:meMA.Kontakion1.text	O Confessor, as the Church today extols you, * who are like a morning star, * she drives away the gloomy mist * of bad religion and heresy, * mystic of heaven, O glorious Procopius.
ltx/en_us_dedes/me.m02.d27:meMA.Ode1C11.greekmelody	@ltx/en_us_dedes/he.h.m6:heHE.OsEnIpeiroPezefsas.greekname
ltx/en_us_dedes/me.m02.d27:meMA.Ode1C11.incipit	…
ltx/en_us_dedes/me.m02.d27:meMA.Ode1C11.melody	@ltx/en_us_dedes/he.h.m6:heHE.OsEnIpeiroPezefsas.name
ltx/en_us_dedes/me.m02.d27:meMA.Ode1C11.mode	@ltx/en_us_dedes/miscellanea:misc.Mode6
ltx/en_us_dedes/me.m02.d27:meMA.Ode1C11.ode	@ltx/en_us_dedes/miscellanea:misc.Ode1
ltx/en_us_dedes/me.m02.d27:meMA.Ode1C11.text	
ltx/en_us_dedes/me.m02.d27:meMA.Ode1C12.incipit	…
ltx/en_us_dedes/me.m02.d27:meMA.Ode1C12.melody	@ltx/en_us_dedes/he.h.m6:heHE.OsEnIpeiroPezefsas.name
ltx/en_us_dedes/me.m02.d27:meMA.Ode1C12.mode	@ltx/en_us_dedes/miscellanea:misc.Mode6
ltx/en_us_dedes/me.m02.d27:meMA.Ode1C12.ode	@ltx/en_us_dedes/miscellanea:misc.Ode1
ltx/en_us_dedes/me.m02.d27:meMA.Ode1C12.text	
ltx/en_us_dedes/me.m02.d27:meMA.Ode1C13.incipit	…
ltx/en_us_dedes/me.m02.d27:meMA.Ode1C13.melody	@ltx/en_us_dedes/he.h.m6:heHE.OsEnIpeiroPezefsas.name
ltx/en_us_dedes/me.m02.d27:meMA.Ode1C13.mode	@ltx/en_us_dedes/miscellanea:misc.Mode6
ltx/en_us_dedes/me.m02.d27:meMA.Ode1C13.ode	@ltx/en_us_dedes/miscellanea:misc.Ode1
ltx/en_us_dedes/me.m02.d27:meMA.Ode1C13.text	
ltx/en_us_dedes/me.m02.d27:meMA.Ode1C1H.greekmelody	@ltx/en_us_dedes/he.h.m6:heHE.OsEnIpeiroPezefsas.greekname
ltx/en_us_dedes/me.m02.d27:meMA.Ode1C1H.incipit	@ltx/en_us_dedes/he.h.m6:heHE.OsEnIpeiroPezefsas.incipit
ltx/en_us_dedes/me.m02.d27:meMA.Ode1C1H.melody	@ltx/en_us_dedes/he.h.m6:heHE.OsEnIpeiroPezefsas.melody
ltx/en_us_dedes/me.m02.d27:meMA.Ode1C1H.mode	@ltx/en_us_dedes/miscellanea:misc.Mode6
ltx/en_us_dedes/me.m02.d27:meMA.Ode1C1H.ode	@ltx/en_us_dedes/miscellanea:misc.Ode1
ltx/en_us_dedes/me.m02.d27:meMA.Ode1C1H.text	@ltx/en_us_dedes/he.h.m6:heHE.OsEnIpeiroPezefsas.text
ltx/en_us_dedes/me.m02.d27:meMA.Ode1C1T.incipit	…
ltx/en_us_dedes/me.m02.d27:meMA.Ode1C1T.melody	@ltx/en_us_dedes/he.h.m6:heHE.OsEnIpeiroPezefsas.name
ltx/en_us_dedes/me.m02.d27:meMA.Ode1C1T.mode	@ltx/en_us_dedes/miscellanea:misc.Mode6
ltx/en_us_dedes/me.m02.d27:meMA.Ode1C1T.ode	@ltx/en_us_dedes/miscellanea:misc.Ode1
ltx/en_us_dedes/me.m02.d27:meMA.Ode1C1T.text	
ltx/en_us_dedes/me.m02.d27:meMA.Ode3C11.greekmelody	@ltx/en_us_dedes/he.h.m6:heHE.OukEstinAgios.greekname
ltx/en_us_dedes/me.m02.d27:meMA.Ode3C11.incipit	…
ltx/en_us_dedes/me.m02.d27:meMA.Ode3C11.melody	@ltx/en_us_dedes/he.h.m6:heHE.OukEstinAgios.name
ltx/en_us_dedes/me.m02.d27:meMA.Ode3C11.mode	@ltx/en_us_dedes/miscellanea:misc.Mode6
ltx/en_us_dedes/me.m02.d27:meMA.Ode3C11.ode	@ltx/en_us_dedes/miscellanea:misc.Ode3
ltx/en_us_dedes/me.m02.d27:meMA.Ode3C11.text	
ltx/en_us_dedes/me.m02.d27:meMA.Ode3C12.incipit	…
ltx/en_us_dedes/me.m02.d27:meMA.Ode3C12.melody	@ltx/en_us_dedes/he.h.m6:heHE.OukEstinAgios.name
ltx/en_us_dedes/me.m02.d27:meMA.Ode3C12.mode	@ltx/en_us_dedes/miscellanea:misc.Mode6
ltx/en_us_dedes/me.m02.d27:meMA.Ode3C12.ode	@ltx/en_us_dedes/miscellanea:misc.Ode3
ltx/en_us_dedes/me.m02.d27:meMA.Ode3C12.text	
ltx/en_us_dedes/me.m02.d27:meMA.Ode3C13.incipit	…
ltx/en_us_dedes/me.m02.d27:meMA.Ode3C13.melody	@ltx/en_us_dedes/he.h.m6:heHE.OukEstinAgios.name
ltx/en_us_dedes/me.m02.d27:meMA.Ode3C13.mode	@ltx/en_us_dedes/miscellanea:misc.Mode6
ltx/en_us_dedes/me.m02.d27:meMA.Ode3C13.ode	@ltx/en_us_dedes/miscellanea:misc.Ode3
ltx/en_us_dedes/me.m02.d27:meMA.Ode3C13.text	
ltx/en_us_dedes/me.m02.d27:meMA.Ode3C1H.greekmelody	@ltx/en_us_dedes/he.h.m6:heHE.OukEstinAgios.greekname
ltx/en_us_dedes/me.m02.d27:meMA.Ode3C1H.incipit	@ltx/en_us_dedes/he.h.m6:heHE.OukEstinAgios.incipit
ltx/en_us_dedes/me.m02.d27:meMA.Ode3C1H.melody	@ltx/en_us_dedes/he.h.m6:heHE.OukEstinAgios.melody
ltx/en_us_dedes/me.m02.d27:meMA.Ode3C1H.mode	@ltx/en_us_dedes/miscellanea:misc.Mode6
ltx/en_us_dedes/me.m02.d27:meMA.Ode3C1H.ode	@ltx/en_us_dedes/miscellanea:misc.Ode3
ltx/en_us_dedes/me.m02.d27:meMA.Ode3C1H.text	@ltx/en_us_dedes/he.h.m6:heHE.OukEstinAgios.text
ltx/en_us_dedes/me.m02.d27:meMA.Ode3C1T.incipit	…
ltx/en_us_dedes/me.m02.d27:meMA.Ode3C1T.melody	@ltx/en_us_dedes/he.h.m6:heHE.OukEstinAgios.name
ltx/en_us_dedes/me.m02.d27:meMA.Ode3C1T.mode	@ltx/en_us_dedes/miscellanea:misc.Mode6
ltx/en_us_dedes/me.m02.d27:meMA.Ode3C1T.ode	@ltx/en_us_dedes/miscellanea:misc.Ode3
ltx/en_us_dedes/me.m02.d27:meMA.Ode3C1T.text	
ltx/en_us_dedes/me.m02.d27:meMA.Ode3Kathisma1.greekmelody	@ltx/en_us_dedes/he.a.m1:heAU.TouLithouSfragisthentos.greekname
ltx/en_us_dedes/me.m02.d27:meMA.Ode3Kathisma1.incipit	…
ltx/en_us_dedes/me.m02.d27:meMA.Ode3Kathisma1.melody	@ltx/en_us_dedes/he.a.m1:heAU.TouLithouSfragisthentos.name
ltx/en_us_dedes/me.m02.d27:meMA.Ode3Kathisma1.mode	@ltx/en_us_dedes/miscellanea:misc.Mode1
ltx/en_us_dedes/me.m02.d27:meMA.Ode3Kathisma1.text	
ltx/en_us_dedes/me.m02.d27:meMA.Ode3KathismaSt.incipit	…
ltx/en_us_dedes/me.m02.d27:meMA.Ode3KathismaSt.melody	@ltx/en_us_dedes/he.a.m1:heAU.TouLithouSfragisthentos.name
ltx/en_us_dedes/me.m02.d27:meMA.Ode3KathismaSt.mode	@ltx/en_us_dedes/miscellanea:misc.Mode1
ltx/en_us_dedes/me.m02.d27:meMA.Ode3KathismaSt.text	
ltx/en_us_dedes/me.m02.d27:meMA.Ode3KathismaT.incipit	@ltx/en_us_dedes/me.m02.d13:meMA.Ode3KathismaT.incipit
ltx/en_us_dedes/me.m02.d27:meMA.Ode3KathismaT.melody	@ltx/en_us_dedes/he.a.m1:heAU.TouLithouSfragisthentos.name
ltx/en_us_dedes/me.m02.d27:meMA.Ode3KathismaT.mode	@ltx/en_us_dedes/miscellanea:misc.Mode1
ltx/en_us_dedes/me.m02.d27:meMA.Ode3KathismaT.text	@ltx/en_us_dedes/me.m02.d13:meMA.Ode3KathismaT.text
ltx/en_us_dedes/me.m02.d27:meMA.Ode4C11.greekmelody	@ltx/en_us_dedes/he.h.m6:heHE.ChristosMouDynamis.greekname
ltx/en_us_dedes/me.m02.d27:meMA.Ode4C11.incipit	…
ltx/en_us_dedes/me.m02.d27:meMA.Ode4C11.melody	@ltx/en_us_dedes/he.h.m6:heHE.ChristosMouDynamis.name
ltx/en_us_dedes/me.m02.d27:meMA.Ode4C11.mode	@ltx/en_us_dedes/miscellanea:misc.Mode6
ltx/en_us_dedes/me.m02.d27:meMA.Ode4C11.ode	@ltx/en_us_dedes/miscellanea:misc.Ode4
ltx/en_us_dedes/me.m02.d27:meMA.Ode4C11.text	
ltx/en_us_dedes/me.m02.d27:meMA.Ode4C12.incipit	…
ltx/en_us_dedes/me.m02.d27:meMA.Ode4C12.melody	@ltx/en_us_dedes/he.h.m6:heHE.ChristosMouDynamis.name
ltx/en_us_dedes/me.m02.d27:meMA.Ode4C12.mode	@ltx/en_us_dedes/miscellanea:misc.Mode6
ltx/en_us_dedes/me.m02.d27:meMA.Ode4C12.ode	@ltx/en_us_dedes/miscellanea:misc.Ode4
ltx/en_us_dedes/me.m02.d27:meMA.Ode4C12.text	
ltx/en_us_dedes/me.m02.d27:meMA.Ode4C13.incipit	…
ltx/en_us_dedes/me.m02.d27:meMA.Ode4C13.melody	@ltx/en_us_dedes/he.h.m6:heHE.ChristosMouDynamis.name
ltx/en_us_dedes/me.m02.d27:meMA.Ode4C13.mode	@ltx/en_us_dedes/miscellanea:misc.Mode6
ltx/en_us_dedes/me.m02.d27:meMA.Ode4C13.ode	@ltx/en_us_dedes/miscellanea:misc.Ode4
ltx/en_us_dedes/me.m02.d27:meMA.Ode4C13.text	
ltx/en_us_dedes/me.m02.d27:meMA.Ode4C1H.greekmelody	@ltx/en_us_dedes/he.h.m6:heHE.ChristosMouDynamis.greekname
ltx/en_us_dedes/me.m02.d27:meMA.Ode4C1H.incipit	@ltx/en_us_dedes/he.h.m6:heHE.ChristosMouDynamis.incipit
ltx/en_us_dedes/me.m02.d27:meMA.Ode4C1H.melody	@ltx/en_us_dedes/he.h.m6:heHE.ChristosMouDynamis.melody
ltx/en_us_dedes/me.m02.d27:meMA.Ode4C1H.mode	@ltx/en_us_dedes/miscellanea:misc.Mode6
ltx/en_us_dedes/me.m02.d27:meMA.Ode4C1H.ode	@ltx/en_us_dedes/miscellanea:misc.Ode4
ltx/en_us_dedes/me.m02.d27:meMA.Ode4C1H.text	@ltx/en_us_dedes/he.h.m6:heHE.ChristosMouDynamis.text
ltx/en_us_dedes/me.m02.d27:meMA.Ode4C1T.incipit	…
ltx/en_us_dedes/me.m02.d27:meMA.Ode4C1T.melody	@ltx/en_us_dedes/he.h.m6:heHE.ChristosMouDynamis.name
ltx/en_us_dedes/me.m02.d27:meMA.Ode4C1T.mode	@ltx/en_us_dedes/miscellanea:misc.Mode6
ltx/en_us_dedes/me.m02.d27:meMA.Ode4C1T.ode	@ltx/en_us_dedes/miscellanea:misc.Ode4
ltx/en_us_dedes/me.m02.d27:meMA.Ode4C1T.text	
ltx/en_us_dedes/me.m02.d27:meMA.Ode5C11.greekmelody	@ltx/en_us_dedes/he.h.m6:heHE.ToTheioFengeiSou.greekname
ltx/en_us_dedes/me.m02.d27:meMA.Ode5C11.incipit	…
ltx/en_us_dedes/me.m02.d27:meMA.Ode5C11.melody	@ltx/en_us_dedes/he.h.m6:heHE.ToTheioFengeiSou.name
ltx/en_us_dedes/me.m02.d27:meMA.Ode5C11.mode	@ltx/en_us_dedes/miscellanea:misc.Mode6
ltx/en_us_dedes/me.m02.d27:meMA.Ode5C11.ode	@ltx/en_us_dedes/miscellanea:misc.Ode5
ltx/en_us_dedes/me.m02.d27:meMA.Ode5C11.text	
ltx/en_us_dedes/me.m02.d27:meMA.Ode5C12.incipit	…
ltx/en_us_dedes/me.m02.d27:meMA.Ode5C12.melody	@ltx/en_us_dedes/he.h.m6:heHE.ToTheioFengeiSou.name
ltx/en_us_dedes/me.m02.d27:meMA.Ode5C12.mode	@ltx/en_us_dedes/miscellanea:misc.Mode6
ltx/en_us_dedes/me.m02.d27:meMA.Ode5C12.ode	@ltx/en_us_dedes/miscellanea:misc.Ode5
ltx/en_us_dedes/me.m02.d27:meMA.Ode5C12.text	
ltx/en_us_dedes/me.m02.d27:meMA.Ode5C13.incipit	…
ltx/en_us_dedes/me.m02.d27:meMA.Ode5C13.melody	@ltx/en_us_dedes/he.h.m6:heHE.ToTheioFengeiSou.name
ltx/en_us_dedes/me.m02.d27:meMA.Ode5C13.mode	@ltx/en_us_dedes/miscellanea:misc.Mode6
ltx/en_us_dedes/me.m02.d27:meMA.Ode5C13.ode	@ltx/en_us_dedes/miscellanea:misc.Ode5
ltx/en_us_dedes/me.m02.d27:meMA.Ode5C13.text	
ltx/en_us_dedes/me.m02.d27:meMA.Ode5C1H.greekmelody	@ltx/en_us_dedes/he.h.m6:heHE.ToTheioFengeiSou.greekname
ltx/en_us_dedes/me.m02.d27:meMA.Ode5C1H.incipit	@ltx/en_us_dedes/he.h.m6:heHE.ToTheioFengeiSou.incipit
ltx/en_us_dedes/me.m02.d27:meMA.Ode5C1H.melody	@ltx/en_us_dedes/he.h.m6:heHE.ToTheioFengeiSou.melody
ltx/en_us_dedes/me.m02.d27:meMA.Ode5C1H.mode	@ltx/en_us_dedes/miscellanea:misc.Mode6
ltx/en_us_dedes/me.m02.d27:meMA.Ode5C1H.ode	@ltx/en_us_dedes/miscellanea:misc.Ode5
ltx/en_us_dedes/me.m02.d27:meMA.Ode5C1H.text	@ltx/en_us_dedes/he.h.m6:heHE.ToTheioFengeiSou.text
ltx/en_us_dedes/me.m02.d27:meMA.Ode5C1T.incipit	…
ltx/en_us_dedes/me.m02.d27:meMA.Ode5C1T.melody	@ltx/en_us_dedes/he.h.m6:heHE.ToTheioFengeiSou.name
ltx/en_us_dedes/me.m02.d27:meMA.Ode5C1T.mode	@ltx/en_us_dedes/miscellanea:misc.Mode6
ltx/en_us_dedes/me.m02.d27:meMA.Ode5C1T.ode	@ltx/en_us_dedes/miscellanea:misc.Ode5
ltx/en_us_dedes/me.m02.d27:meMA.Ode5C1T.text	
ltx/en_us_dedes/me.m02.d27:meMA.Ode6C11.greekmelody	@ltx/en_us_dedes/he.h.m6:heHE.TouViouTinThalassan.greekname
ltx/en_us_dedes/me.m02.d27:meMA.Ode6C11.incipit	…
ltx/en_us_dedes/me.m02.d27:meMA.Ode6C11.melody	@ltx/en_us_dedes/he.h.m6:heHE.TouViouTinThalassan.name
ltx/en_us_dedes/me.m02.d27:meMA.Ode6C11.mode	@ltx/en_us_dedes/miscellanea:misc.Mode6
ltx/en_us_dedes/me.m02.d27:meMA.Ode6C11.ode	@ltx/en_us_dedes/miscellanea:misc.Ode6
ltx/en_us_dedes/me.m02.d27:meMA.Ode6C11.text	
ltx/en_us_dedes/me.m02.d27:meMA.Ode6C12.incipit	…
ltx/en_us_dedes/me.m02.d27:meMA.Ode6C12.melody	@ltx/en_us_dedes/he.h.m6:heHE.TouViouTinThalassan.name
ltx/en_us_dedes/me.m02.d27:meMA.Ode6C12.mode	@ltx/en_us_dedes/miscellanea:misc.Mode6
ltx/en_us_dedes/me.m02.d27:meMA.Ode6C12.ode	@ltx/en_us_dedes/miscellanea:misc.Ode6
ltx/en_us_dedes/me.m02.d27:meMA.Ode6C12.text	
ltx/en_us_dedes/me.m02.d27:meMA.Ode6C13.incipit	…
ltx/en_us_dedes/me.m02.d27:meMA.Ode6C13.melody	@ltx/en_us_dedes/he.h.m6:heHE.TouViouTinThalassan.name
ltx/en_us_dedes/me.m02.d27:meMA.Ode6C13.mode	@ltx/en_us_dedes/miscellanea:misc.Mode6
ltx/en_us_dedes/me.m02.d27:meMA.Ode6C13.ode	@ltx/en_us_dedes/miscellanea:misc.Ode6
ltx/en_us_dedes/me.m02.d27:meMA.Ode6C13.text	
ltx/en_us_dedes/me.m02.d27:meMA.Ode6C1H.greekmelody	@ltx/en_us_dedes/he.h.m6:heHE.TouViouTinThalassan.greekname
ltx/en_us_dedes/me.m02.d27:meMA.Ode6C1H.incipit	@ltx/en_us_dedes/he.h.m6:heHE.TouViouTinThalassan.incipit
ltx/en_us_dedes/me.m02.d27:meMA.Ode6C1H.melody	@ltx/en_us_dedes/he.h.m6:heHE.TouViouTinThalassan.melody
ltx/en_us_dedes/me.m02.d27:meMA.Ode6C1H.mode	@ltx/en_us_dedes/miscellanea:misc.Mode6
ltx/en_us_dedes/me.m02.d27:meMA.Ode6C1H.ode	@ltx/en_us_dedes/miscellanea:misc.Ode6
ltx/en_us_dedes/me.m02.d27:meMA.Ode6C1H.text	@ltx/en_us_dedes/he.h.m6:heHE.TouViouTinThalassan.text
ltx/en_us_dedes/me.m02.d27:meMA.Ode6C1T.incipit	…
ltx/en_us_dedes/me.m02.d27:meMA.Ode6C1T.melody	@ltx/en_us_dedes/he.h.m6:heHE.TouViouTinThalassan.name
ltx/en_us_dedes/me.m02.d27:meMA.Ode6C1T.mode	@ltx/en_us_dedes/miscellanea:misc.Mode6
ltx/en_us_dedes/me.m02.d27:meMA.Ode6C1T.ode	@ltx/en_us_dedes/miscellanea:misc.Ode6
ltx/en_us_dedes/me.m02.d27:meMA.Ode6C1T.text	
ltx/en_us_dedes/me.m02.d27:meMA.Ode7C11.greekmelody	@ltx/en_us_dedes/he.h.m6:heHE.DrosovolonMenTinKaminon.greekname
ltx/en_us_dedes/me.m02.d27:meMA.Ode7C11.incipit	…
ltx/en_us_dedes/me.m02.d27:meMA.Ode7C11.melody	@ltx/en_us_dedes/he.h.m6:heHE.DrosovolonMenTinKaminon.name
ltx/en_us_dedes/me.m02.d27:meMA.Ode7C11.mode	@ltx/en_us_dedes/miscellanea:misc.Mode6
ltx/en_us_dedes/me.m02.d27:meMA.Ode7C11.ode	@ltx/en_us_dedes/miscellanea:misc.Ode7
ltx/en_us_dedes/me.m02.d27:meMA.Ode7C11.text	
ltx/en_us_dedes/me.m02.d27:meMA.Ode7C12.incipit	…
ltx/en_us_dedes/me.m02.d27:meMA.Ode7C12.melody	@ltx/en_us_dedes/he.h.m6:heHE.DrosovolonMenTinKaminon.name
ltx/en_us_dedes/me.m02.d27:meMA.Ode7C12.mode	@ltx/en_us_dedes/miscellanea:misc.Mode6
ltx/en_us_dedes/me.m02.d27:meMA.Ode7C12.ode	@ltx/en_us_dedes/miscellanea:misc.Ode7
ltx/en_us_dedes/me.m02.d27:meMA.Ode7C12.text	
ltx/en_us_dedes/me.m02.d27:meMA.Ode7C13.incipit	…
ltx/en_us_dedes/me.m02.d27:meMA.Ode7C13.melody	@ltx/en_us_dedes/he.h.m6:heHE.DrosovolonMenTinKaminon.name
ltx/en_us_dedes/me.m02.d27:meMA.Ode7C13.mode	@ltx/en_us_dedes/miscellanea:misc.Mode6
ltx/en_us_dedes/me.m02.d27:meMA.Ode7C13.ode	@ltx/en_us_dedes/miscellanea:misc.Ode7
ltx/en_us_dedes/me.m02.d27:meMA.Ode7C13.text	
ltx/en_us_dedes/me.m02.d27:meMA.Ode7C1H.greekmelody	@ltx/en_us_dedes/he.h.m6:heHE.DrosovolonMenTinKaminon.greekname
ltx/en_us_dedes/me.m02.d27:meMA.Ode7C1H.incipit	@ltx/en_us_dedes/he.h.m6:heHE.DrosovolonMenTinKaminon.incipit
ltx/en_us_dedes/me.m02.d27:meMA.Ode7C1H.melody	@ltx/en_us_dedes/he.h.m6:heHE.DrosovolonMenTinKaminon.melody
ltx/en_us_dedes/me.m02.d27:meMA.Ode7C1H.mode	@ltx/en_us_dedes/miscellanea:misc.Mode6
ltx/en_us_dedes/me.m02.d27:meMA.Ode7C1H.ode	@ltx/en_us_dedes/miscellanea:misc.Ode7
ltx/en_us_dedes/me.m02.d27:meMA.Ode7C1H.text	@ltx/en_us_dedes/he.h.m6:heHE.DrosovolonMenTinKaminon.text
ltx/en_us_dedes/me.m02.d27:meMA.Ode7C1T.incipit	…
ltx/en_us_dedes/me.m02.d27:meMA.Ode7C1T.melody	@ltx/en_us_dedes/he.h.m6:heHE.DrosovolonMenTinKaminon.name
ltx/en_us_dedes/me.m02.d27:meMA.Ode7C1T.mode	@ltx/en_us_dedes/miscellanea:misc.Mode6
ltx/en_us_dedes/me.m02.d27:meMA.Ode7C1T.ode	@ltx/en_us_dedes/miscellanea:misc.Ode7
ltx/en_us_dedes/me.m02.d27:meMA.Ode7C1T.text	
ltx/en_us_dedes/me.m02.d27:meMA.Ode8C11.greekmelody	@ltx/en_us_dedes/he.h.m6:heHE.EkFlogosToisOsiois.greekname
ltx/en_us_dedes/me.m02.d27:meMA.Ode8C11.incipit	…
ltx/en_us_dedes/me.m02.d27:meMA.Ode8C11.melody	@ltx/en_us_dedes/he.h.m6:heHE.EkFlogosToisOsiois.name
ltx/en_us_dedes/me.m02.d27:meMA.Ode8C11.mode	@ltx/en_us_dedes/miscellanea:misc.Mode6
ltx/en_us_dedes/me.m02.d27:meMA.Ode8C11.ode	@ltx/en_us_dedes/miscellanea:misc.Ode8
ltx/en_us_dedes/me.m02.d27:meMA.Ode8C11.text	
ltx/en_us_dedes/me.m02.d27:meMA.Ode8C12.incipit	…
ltx/en_us_dedes/me.m02.d27:meMA.Ode8C12.melody	@ltx/en_us_dedes/he.h.m6:heHE.EkFlogosToisOsiois.name
ltx/en_us_dedes/me.m02.d27:meMA.Ode8C12.mode	@ltx/en_us_dedes/miscellanea:misc.Mode6
ltx/en_us_dedes/me.m02.d27:meMA.Ode8C12.ode	@ltx/en_us_dedes/miscellanea:misc.Ode8
ltx/en_us_dedes/me.m02.d27:meMA.Ode8C12.text	
ltx/en_us_dedes/me.m02.d27:meMA.Ode8C13.incipit	…
ltx/en_us_dedes/me.m02.d27:meMA.Ode8C13.melody	@ltx/en_us_dedes/he.h.m6:heHE.EkFlogosToisOsiois.name
ltx/en_us_dedes/me.m02.d27:meMA.Ode8C13.mode	@ltx/en_us_dedes/miscellanea:misc.Mode6
ltx/en_us_dedes/me.m02.d27:meMA.Ode8C13.ode	@ltx/en_us_dedes/miscellanea:misc.Ode8
ltx/en_us_dedes/me.m02.d27:meMA.Ode8C13.text	
ltx/en_us_dedes/me.m02.d27:meMA.Ode8C1H.greekmelody	@ltx/en_us_dedes/he.h.m6:heHE.EkFlogosToisOsiois.greekname
ltx/en_us_dedes/me.m02.d27:meMA.Ode8C1H.incipit	@ltx/en_us_dedes/he.h.m6:heHE.EkFlogosToisOsiois.incipit
ltx/en_us_dedes/me.m02.d27:meMA.Ode8C1H.melody	@ltx/en_us_dedes/he.h.m6:heHE.EkFlogosToisOsiois.melody
ltx/en_us_dedes/me.m02.d27:meMA.Ode8C1H.mode	@ltx/en_us_dedes/miscellanea:misc.Mode6
ltx/en_us_dedes/me.m02.d27:meMA.Ode8C1H.ode	@ltx/en_us_dedes/miscellanea:misc.Ode8
ltx/en_us_dedes/me.m02.d27:meMA.Ode8C1H.text	@ltx/en_us_dedes/he.h.m6:heHE.EkFlogosToisOsiois.text
ltx/en_us_dedes/me.m02.d27:meMA.Ode8C1T.incipit	…
ltx/en_us_dedes/me.m02.d27:meMA.Ode8C1T.melody	@ltx/en_us_dedes/he.h.m6:heHE.EkFlogosToisOsiois.name
ltx/en_us_dedes/me.m02.d27:meMA.Ode8C1T.mode	@ltx/en_us_dedes/miscellanea:misc.Mode6
ltx/en_us_dedes/me.m02.d27:meMA.Ode8C1T.ode	@ltx/en_us_dedes/miscellanea:misc.Ode8
ltx/en_us_dedes/me.m02.d27:meMA.Ode8C1T.text	
ltx/en_us_dedes/me.m02.d27:meMA.Ode9C11.greekmelody	@ltx/en_us_dedes/he.h.m6:heHE.TheonAnthropois.greekname
ltx/en_us_dedes/me.m02.d27:meMA.Ode9C11.incipit	…
ltx/en_us_dedes/me.m02.d27:meMA.Ode9C11.melody	@ltx/en_us_dedes/he.h.m6:heHE.TheonAnthropois.name
ltx/en_us_dedes/me.m02.d27:meMA.Ode9C11.mode	@ltx/en_us_dedes/miscellanea:misc.Mode6
ltx/en_us_dedes/me.m02.d27:meMA.Ode9C11.ode	@ltx/en_us_dedes/miscellanea:misc.Ode9
ltx/en_us_dedes/me.m02.d27:meMA.Ode9C11.text	
ltx/en_us_dedes/me.m02.d27:meMA.Ode9C12.incipit	…
ltx/en_us_dedes/me.m02.d27:meMA.Ode9C12.melody	@ltx/en_us_dedes/he.h.m6:heHE.TheonAnthropois.name
ltx/en_us_dedes/me.m02.d27:meMA.Ode9C12.mode	@ltx/en_us_dedes/miscellanea:misc.Mode6
ltx/en_us_dedes/me.m02.d27:meMA.Ode9C12.ode	@ltx/en_us_dedes/miscellanea:misc.Ode9
ltx/en_us_dedes/me.m02.d27:meMA.Ode9C12.text	
ltx/en_us_dedes/me.m02.d27:meMA.Ode9C13.incipit	…
ltx/en_us_dedes/me.m02.d27:meMA.Ode9C13.melody	@ltx/en_us_dedes/he.h.m6:heHE.TheonAnthropois.name
ltx/en_us_dedes/me.m02.d27:meMA.Ode9C13.mode	@ltx/en_us_dedes/miscellanea:misc.Mode6
ltx/en_us_dedes/me.m02.d27:meMA.Ode9C13.ode	@ltx/en_us_dedes/miscellanea:misc.Ode9
ltx/en_us_dedes/me.m02.d27:meMA.Ode9C13.text	
ltx/en_us_dedes/me.m02.d27:meMA.Ode9C1H.greekmelody	@ltx/en_us_dedes/he.h.m6:heHE.TheonAnthropois.greekname
ltx/en_us_dedes/me.m02.d27:meMA.Ode9C1H.incipit	@ltx/en_us_dedes/he.h.m6:heHE.TheonAnthropois.incipit
ltx/en_us_dedes/me.m02.d27:meMA.Ode9C1H.melody	@ltx/en_us_dedes/he.h.m6:heHE.TheonAnthropois.melody
ltx/en_us_dedes/me.m02.d27:meMA.Ode9C1H.mode	@ltx/en_us_dedes/miscellanea:misc.Mode6
ltx/en_us_dedes/me.m02.d27:meMA.Ode9C1H.ode	@ltx/en_us_dedes/miscellanea:misc.Ode9
ltx/en_us_dedes/me.m02.d27:meMA.Ode9C1H.text	@ltx/en_us_dedes/he.h.m6:heHE.TheonAnthropois.text
ltx/en_us_dedes/me.m02.d27:meMA.Ode9C1T.incipit	…
ltx/en_us_dedes/me.m02.d27:meMA.Ode9C1T.melody	@ltx/en_us_dedes/he.h.m6:heHE.TheonAnthropois.name
ltx/en_us_dedes/me.m02.d27:meMA.Ode9C1T.mode	@ltx/en_us_dedes/miscellanea:misc.Mode6
ltx/en_us_dedes/me.m02.d27:meMA.Ode9C1T.ode	@ltx/en_us_dedes/miscellanea:misc.Ode9
ltx/en_us_dedes/me.m02.d27:meMA.Ode9C1T.text	
ltx/en_us_dedes/me.m02.d27:meVE.Apolytikion1ger.greekmelody	@ltx/en_us_dedes/he.a.m1:heAU.TisErimouPolitis.greekname
ltx/en_us_dedes/me.m02.d27:meVE.Apolytikion1ger.incipit	…
ltx/en_us_dedes/me.m02.d27:meVE.Apolytikion1ger.melody	@ltx/en_us_dedes/he.a.m1:heAU.TisErimouPolitis.name
ltx/en_us_dedes/me.m02.d27:meVE.Apolytikion1ger.mode	@ltx/en_us_dedes/miscellanea:misc.Mode1
ltx/en_us_dedes/me.m02.d27:meVE.Apolytikion1ger.poet	@ltx/en_us_dedes/poets:po.Gerasimou
ltx/en_us_dedes/me.m02.d27:meVE.Apolytikion1ger.text	
ltx/en_us_dedes/me.m02.d27:meVE.SticStavrotheotokion.greekmelody	@ltx/en_us_dedes/he.a.m4:heAU.OsGennaionEnMartysi.greekname
ltx/en_us_dedes/me.m02.d27:meVE.SticStavrotheotokion.incipit	When Your Mother, the Ewe…
ltx/en_us_dedes/me.m02.d27:meVE.SticStavrotheotokion.melody	@ltx/en_us_dedes/he.a.m4:heAU.OsGennaionEnMartysi.name
ltx/en_us_dedes/me.m02.d27:meVE.SticStavrotheotokion.mode	@ltx/en_us_dedes/miscellanea:misc.Mode4
ltx/en_us_dedes/me.m02.d27:meVE.SticStavrotheotokion.text	When Your Mother, the Ewe, beheld * You suspended upon the Cross, * she was horrified, and astounded she cried out, * “O most beloved and longed for Son, * what is this that I behold! * Such is Your reward from them * who enjoyed all Your miracles, * breakers of the law, * disobedient people!” Notwithstanding, Lord and Master, we give glory * to Your transcendent benevolence.
ltx/en_us_dedes/me.m02.d27:meVE.SticTheotokion.greekmelody	@ltx/en_us_dedes/he.a.m4:heAU.OsGennaionEnMartysi.greekname
ltx/en_us_dedes/me.m02.d27:meVE.SticTheotokion.incipit	@ltx/en_us_dedes/oc.m4.d5:ocVE.SticTheotokion.incipit
ltx/en_us_dedes/me.m02.d27:meVE.SticTheotokion.melody	@ltx/en_us_dedes/he.a.m4:heAU.OsGennaionEnMartysi.name
ltx/en_us_dedes/me.m02.d27:meVE.SticTheotokion.mode	@ltx/en_us_dedes/miscellanea:misc.Mode4
ltx/en_us_dedes/me.m02.d27:meVE.SticTheotokion.text	@ltx/en_us_dedes/oc.m4.d5:ocVE.SticTheotokion.text
ltx/en_us_dedes/me.m02.d27:meVE.Stichera01.greekmelody	@ltx/en_us_dedes/he.a.m4:heAU.OsGennaionEnMartysi.greekname
ltx/en_us_dedes/me.m02.d27:meVE.Stichera01.incipit	…
ltx/en_us_dedes/me.m02.d27:meVE.Stichera01.melody	@ltx/en_us_dedes/he.a.m4:heAU.OsGennaionEnMartysi.name
ltx/en_us_dedes/me.m02.d27:meVE.Stichera01.mode	@ltx/en_us_dedes/miscellanea:misc.Mode4
ltx/en_us_dedes/me.m02.d27:meVE.Stichera01.text	
ltx/en_us_dedes/me.m02.d27:meVE.Stichera02.incipit	…
ltx/en_us_dedes/me.m02.d27:meVE.Stichera02.melody	@ltx/en_us_dedes/he.a.m4:heAU.OsGennaionEnMartysi.name
ltx/en_us_dedes/me.m02.d27:meVE.Stichera02.mode	@ltx/en_us_dedes/miscellanea:misc.Mode4
ltx/en_us_dedes/me.m02.d27:meVE.Stichera02.text	
ltx/en_us_dedes/me.m02.d27:meVE.Stichera03.incipit	…
ltx/en_us_dedes/me.m02.d27:meVE.Stichera03.melody	@ltx/en_us_dedes/he.a.m4:heAU.OsGennaionEnMartysi.name
ltx/en_us_dedes/me.m02.d27:meVE.Stichera03.mode	@ltx/en_us_dedes/miscellanea:misc.Mode4
ltx/en_us_dedes/me.m02.d27:meVE.Stichera03.text	
