ltx/en_us_dedes/me.m10.d07:meDA.commemoration.first	Memory of the Holy Martyrs Sergius and Bacchus
ltx/en_us_dedes/me.m10.d07:meDA.commemoration.first_name	
ltx/en_us_dedes/me.m10.d07:meDA.commemoration.first_short	Memory of the Holy Martyrs Sergius and Bacchus
ltx/en_us_dedes/me.m10.d07:meDA.commemoration.first_title	@ltx/en_us_dedes/titles:ti.Saints
ltx/en_us_dedes/me.m10.d07:meDA.commemoration.full	Memory of the Holy Martyrs Sergius and Bacchus
ltx/en_us_dedes/me.m10.d07:meDA.commemoration.second_name	
ltx/en_us_dedes/me.m10.d07:meDA.commemoration.second_title	
ltx/en_us_dedes/me.m10.d07:meDA.date	October 7
ltx/en_us_dedes/me.m10.d07:meDA.fordate	for October 7
ltx/en_us_dedes/me.m10.d07:meDA.insert1	of the Holy Martyrs Sergius and Bacchus,
ltx/en_us_dedes/me.m10.d07:meDA.insert2	whose memory we are observing,
ltx/en_us_dedes/me.m10.d07:meDA.note	
ltx/en_us_dedes/me.m10.d07:meDA.pdfcoverdate	October 7,
ltx/en_us_dedes/me.m10.d07:meDA.pdfheaderdate	October 7
ltx/en_us_dedes/me.m10.d07:meHO.commemorations	
ltx/en_us_dedes/me.m10.d07:meHO.note1	
ltx/en_us_dedes/me.m10.d07:meHO.note2	
ltx/en_us_dedes/me.m10.d07:meHO.number	
ltx/en_us_dedes/me.m10.d07:meHO.rank	
ltx/en_us_dedes/me.m10.d07:meLE.commemoration1	The Holy Martyrs Sergios and Bacchos.
ltx/en_us_dedes/me.m10.d07:meLE.commemoration2	
ltx/en_us_dedes/me.m10.d07:meLI.Kontakion1.greekmelody	@ltx/en_us_dedes/me.m10.d07:meMA.Kontakion1.greekmelody
ltx/en_us_dedes/me.m10.d07:meLI.Kontakion1.incipit	@ltx/en_us_dedes/me.m10.d07:meMA.Kontakion1.incipit
ltx/en_us_dedes/me.m10.d07:meLI.Kontakion1.melody	@ltx/en_us_dedes/me.m10.d07:meMA.Kontakion1.melody
ltx/en_us_dedes/me.m10.d07:meLI.Kontakion1.mode	@ltx/en_us_dedes/me.m10.d07:meMA.Kontakion1.mode
ltx/en_us_dedes/me.m10.d07:meLI.Kontakion1.text	@ltx/en_us_dedes/me.m10.d07:meMA.Kontakion1.text
ltx/en_us_dedes/me.m10.d07:meLI.Megalynarion.text	
ltx/en_us_dedes/me.m10.d07:meMA.AposGlory.incipit	…
ltx/en_us_dedes/me.m10.d07:meMA.AposGlory.melody	
ltx/en_us_dedes/me.m10.d07:meMA.AposGlory.mode	@ltx/en_us_dedes/miscellanea:misc.Mode2
ltx/en_us_dedes/me.m10.d07:meMA.AposGlory.poet	@ltx/en_us_dedes/poets:po.Anatoliou
ltx/en_us_dedes/me.m10.d07:meMA.AposGlory.text	
ltx/en_us_dedes/me.m10.d07:meMA.AposStavrotheotokion.greekmelody	@ltx/en_us_dedes/he.a.m2:heAU.OteEkTouXylou.greekname
ltx/en_us_dedes/me.m10.d07:meMA.AposStavrotheotokion.incipit	@ltx/en_us_dedes/me.m02.d25:meVE.SticStavrotheotokion.incipit
ltx/en_us_dedes/me.m10.d07:meMA.AposStavrotheotokion.melody	@ltx/en_us_dedes/he.a.m2:heAU.OteEkTouXylou.name
ltx/en_us_dedes/me.m10.d07:meMA.AposStavrotheotokion.mode	@ltx/en_us_dedes/miscellanea:misc.Mode2
ltx/en_us_dedes/me.m10.d07:meMA.AposStavrotheotokion.text	@ltx/en_us_dedes/me.m02.d25:meVE.SticStavrotheotokion.text
ltx/en_us_dedes/me.m10.d07:meMA.AposTheotokion.greekmelody	@ltx/en_us_dedes/he.a.m2:heAU.OteEkTouXylou.greekname
ltx/en_us_dedes/me.m10.d07:meMA.AposTheotokion.incipit	@ltx/en_us_dedes/oc.m2.d7:ocMA.LaudsTheotokion.incipit
ltx/en_us_dedes/me.m10.d07:meMA.AposTheotokion.melody	@ltx/en_us_dedes/he.a.m2:heAU.OteEkTouXylou.name
ltx/en_us_dedes/me.m10.d07:meMA.AposTheotokion.mode	@ltx/en_us_dedes/miscellanea:misc.Mode2
ltx/en_us_dedes/me.m10.d07:meMA.AposTheotokion.text	@ltx/en_us_dedes/oc.m2.d7:ocMA.LaudsTheotokion.text
ltx/en_us_dedes/me.m10.d07:meMA.C1.acrostic.notice1	
ltx/en_us_dedes/me.m10.d07:meMA.C1.acrostic.text	
ltx/en_us_dedes/me.m10.d07:meMA.C1.acrostic.title	
ltx/en_us_dedes/me.m10.d07:meMA.C1.poet	@ltx/en_us_dedes/poets:po.Theofanous
ltx/en_us_dedes/me.m10.d07:meMA.C1.title	@ltx/en_us_dedes/titles:ti.CanonSaints
ltx/en_us_dedes/me.m10.d07:meMA.C1.verse	@ltx/en_us_dedes/prayers:pr.verse_SaintsM.text
ltx/en_us_dedes/me.m10.d07:meMA.ExapTheotokion.incipit	Cease not to pray most…
ltx/en_us_dedes/me.m10.d07:meMA.ExapTheotokion.melody	@ltx/en_us_dedes/he.a.m2:heAU.ToisMathitaisSynelthomen.name
ltx/en_us_dedes/me.m10.d07:meMA.ExapTheotokion.mode	@ltx/en_us_dedes/miscellanea:misc.Mode2
ltx/en_us_dedes/me.m10.d07:meMA.ExapTheotokion.text	Cease not to pray most earnestly * to the Lord who became flesh * from your pure blood, O undefiled * Virgin Mother, entreating * for us your unworthy servants, * that we find grace to help us * in time of need on Judgment Day * when He as God will judge all the human race, * meting out deserts according to merit; * for all of us in times of need * have you as our protectress.
ltx/en_us_dedes/me.m10.d07:meMA.Exaposteilarion1.greekmelody	@ltx/en_us_dedes/he.a.m2:heAU.ToisMathitaisSynelthomen.greekname
ltx/en_us_dedes/me.m10.d07:meMA.Exaposteilarion1.incipit	United by fraternal love *…
ltx/en_us_dedes/me.m10.d07:meMA.Exaposteilarion1.melody	@ltx/en_us_dedes/he.a.m2:heAU.ToisMathitaisSynelthomen.name
ltx/en_us_dedes/me.m10.d07:meMA.Exaposteilarion1.mode	@ltx/en_us_dedes/miscellanea:misc.Mode2
ltx/en_us_dedes/me.m10.d07:meMA.Exaposteilarion1.text	United by fraternal love * and also by their shared faith, * the godly-minded Sergius * and the all-lauded Bacchus, * those two prize-winning martyr Saints, * importunely entreat You, * O Christ, that You bestow Your peace * on the world and its people, granting success * over foreign enemies to our rulers, * and that You save our souls, O Lord, * and forgive our offenses.
ltx/en_us_dedes/me.m10.d07:meMA.Kontakion1.greekmelody	@ltx/en_us_dedes/he.a.m2:heAU.TaAnoZiton.greekname
ltx/en_us_dedes/me.m10.d07:meMA.Kontakion1.incipit	…
ltx/en_us_dedes/me.m10.d07:meMA.Kontakion1.melody	@ltx/en_us_dedes/he.a.m2:heAU.TaAnoZiton.name
ltx/en_us_dedes/me.m10.d07:meMA.Kontakion1.mode	@ltx/en_us_dedes/miscellanea:misc.Mode2
ltx/en_us_dedes/me.m10.d07:meMA.Kontakion1.text	
ltx/en_us_dedes/me.m10.d07:meMA.Lauds1.incipit	The Martyrs Sergius and Bacchus…
ltx/en_us_dedes/me.m10.d07:meMA.Lauds1.melody	
ltx/en_us_dedes/me.m10.d07:meMA.Lauds1.mode	@ltx/en_us_dedes/miscellanea:misc.Mode1
ltx/en_us_dedes/me.m10.d07:meMA.Lauds1.poet	@ltx/en_us_dedes/poets:po.Germanou
ltx/en_us_dedes/me.m10.d07:meMA.Lauds1.text	The Martyrs Sergius and Bacchus, who were joined together not by nature but by faith, exclaimed in the words of David, “Behold, how good and pleasant it is when brothers dwell in unity!” Together these saints trampled the enemy; and they took up the cross and followed Christ. They intercede with God our King, to grant to our souls peace and great mercy.
ltx/en_us_dedes/me.m10.d07:meMA.Lauds2.incipit	How good and how pleasant…
ltx/en_us_dedes/me.m10.d07:meMA.Lauds2.melody	
ltx/en_us_dedes/me.m10.d07:meMA.Lauds2.mode	@ltx/en_us_dedes/miscellanea:misc.Mode3
ltx/en_us_dedes/me.m10.d07:meMA.Lauds2.text	How good and how pleasant were the brotherly sentiments of Your Martyrs, O Lord. Although nature did not know them to be brothers in the flesh, their faith compelled them to be brothers to the point of blood. O God, at their prayers, have mercy on us.
ltx/en_us_dedes/me.m10.d07:meMA.Lauds3.incipit	Let us come together, and…
ltx/en_us_dedes/me.m10.d07:meMA.Lauds3.melody	
ltx/en_us_dedes/me.m10.d07:meMA.Lauds3.mode	@ltx/en_us_dedes/miscellanea:misc.Mode4
ltx/en_us_dedes/me.m10.d07:meMA.Lauds3.poet	@ltx/en_us_dedes/poets:po.Anatoliou
ltx/en_us_dedes/me.m10.d07:meMA.Lauds3.text	Let us come together, and in the words of the Prophet, to the Saints let us sing aloud the hymn: “Behold, how good and pleasant it is when brothers dwell in unity; not because it is the natural order, but because the Holy Spirit unites them in faith.” The courageous Martyrs Sergius and Bacchus despised everything corruptible, and took up the cross on their shoulders, and followed Christ. They are allowed to speak freely in heaven; so they intercede with the Lord on our behalf, that He send down to us the great mercy.
ltx/en_us_dedes/me.m10.d07:meMA.LaudsGlory.incipit	Sergius had shod his feet…
ltx/en_us_dedes/me.m10.d07:meMA.LaudsGlory.melody	
ltx/en_us_dedes/me.m10.d07:meMA.LaudsGlory.mode	@ltx/en_us_dedes/miscellanea:misc.Mode4
ltx/en_us_dedes/me.m10.d07:meMA.LaudsGlory.text	Sergius had shod his feet with the equipment of the gospel of peace, namely the iron sandals with nails in their soles. With the blood that flowed from his feet, he blinded the serpent who watches our heels, and he received the halo for martyrdom. We entreat You, O Christ our God, that by his prayers for us, You nail down our flesh with the fear of You, and be merciful to us.
ltx/en_us_dedes/me.m10.d07:meMA.LaudsStavrotheotokion.greekmelody	@ltx/en_us_dedes/he.a.m4:heAU.OsGennaionEnMartysi.greekname
ltx/en_us_dedes/me.m10.d07:meMA.LaudsStavrotheotokion.incipit	@ltx/en_us_dedes/me.m01.d19:meMA.AposStavrotheotokion.incipit
ltx/en_us_dedes/me.m10.d07:meMA.LaudsStavrotheotokion.melody	@ltx/en_us_dedes/he.a.m4:heAU.OsGennaionEnMartysi.name
ltx/en_us_dedes/me.m10.d07:meMA.LaudsStavrotheotokion.mode	@ltx/en_us_dedes/miscellanea:misc.Mode4
ltx/en_us_dedes/me.m10.d07:meMA.LaudsStavrotheotokion.text	@ltx/en_us_dedes/me.m01.d19:meMA.AposStavrotheotokion.text
ltx/en_us_dedes/me.m10.d07:meMA.LaudsTheotokion.incipit	@ltx/en_us_dedes/oc.m4.d2:ocVE.AposTheotokion.incipit
ltx/en_us_dedes/me.m10.d07:meMA.LaudsTheotokion.melody	
ltx/en_us_dedes/me.m10.d07:meMA.LaudsTheotokion.mode	@ltx/en_us_dedes/miscellanea:misc.Mode4
ltx/en_us_dedes/me.m10.d07:meMA.LaudsTheotokion.text	@ltx/en_us_dedes/oc.m4.d2:ocVE.AposTheotokion.text
ltx/en_us_dedes/me.m10.d07:meMA.MM.Lauds1123as5678.text	@ltx/en_us_dedes/properties:media.key
ltx/en_us_dedes/me.m10.d07:meMA.Ode1C11.greekmelody	@ltx/en_us_dedes/he.h.m1:heHE.SouITropaiouchos.greekname
ltx/en_us_dedes/me.m10.d07:meMA.Ode1C11.incipit	…
ltx/en_us_dedes/me.m10.d07:meMA.Ode1C11.melody	@ltx/en_us_dedes/he.h.m1:heHE.SouITropaiouchos.name
ltx/en_us_dedes/me.m10.d07:meMA.Ode1C11.mode	@ltx/en_us_dedes/miscellanea:misc.Mode1
ltx/en_us_dedes/me.m10.d07:meMA.Ode1C11.ode	@ltx/en_us_dedes/miscellanea:misc.Ode1
ltx/en_us_dedes/me.m10.d07:meMA.Ode1C11.text	
ltx/en_us_dedes/me.m10.d07:meMA.Ode1C12.incipit	…
ltx/en_us_dedes/me.m10.d07:meMA.Ode1C12.melody	@ltx/en_us_dedes/he.h.m1:heHE.SouITropaiouchos.name
ltx/en_us_dedes/me.m10.d07:meMA.Ode1C12.mode	@ltx/en_us_dedes/miscellanea:misc.Mode1
ltx/en_us_dedes/me.m10.d07:meMA.Ode1C12.ode	@ltx/en_us_dedes/miscellanea:misc.Ode1
ltx/en_us_dedes/me.m10.d07:meMA.Ode1C12.text	
ltx/en_us_dedes/me.m10.d07:meMA.Ode1C13.incipit	…
ltx/en_us_dedes/me.m10.d07:meMA.Ode1C13.melody	@ltx/en_us_dedes/he.h.m1:heHE.SouITropaiouchos.name
ltx/en_us_dedes/me.m10.d07:meMA.Ode1C13.mode	@ltx/en_us_dedes/miscellanea:misc.Mode1
ltx/en_us_dedes/me.m10.d07:meMA.Ode1C13.ode	@ltx/en_us_dedes/miscellanea:misc.Ode1
ltx/en_us_dedes/me.m10.d07:meMA.Ode1C13.text	
ltx/en_us_dedes/me.m10.d07:meMA.Ode1C14.incipit	…
ltx/en_us_dedes/me.m10.d07:meMA.Ode1C14.melody	@ltx/en_us_dedes/he.h.m1:heHE.SouITropaiouchos.name
ltx/en_us_dedes/me.m10.d07:meMA.Ode1C14.mode	@ltx/en_us_dedes/miscellanea:misc.Mode1
ltx/en_us_dedes/me.m10.d07:meMA.Ode1C14.ode	@ltx/en_us_dedes/miscellanea:misc.Ode1
ltx/en_us_dedes/me.m10.d07:meMA.Ode1C14.text	
ltx/en_us_dedes/me.m10.d07:meMA.Ode1C1T.incipit	…
ltx/en_us_dedes/me.m10.d07:meMA.Ode1C1T.melody	@ltx/en_us_dedes/he.h.m1:heHE.SouITropaiouchos.name
ltx/en_us_dedes/me.m10.d07:meMA.Ode1C1T.mode	@ltx/en_us_dedes/miscellanea:misc.Mode1
ltx/en_us_dedes/me.m10.d07:meMA.Ode1C1T.ode	@ltx/en_us_dedes/miscellanea:misc.Ode1
ltx/en_us_dedes/me.m10.d07:meMA.Ode1C1T.text	
ltx/en_us_dedes/me.m10.d07:meMA.Ode3C11.greekmelody	@ltx/en_us_dedes/he.h.m1:heHE.OMonosEidos.greekname
ltx/en_us_dedes/me.m10.d07:meMA.Ode3C11.incipit	…
ltx/en_us_dedes/me.m10.d07:meMA.Ode3C11.melody	@ltx/en_us_dedes/he.h.m1:heHE.OMonosEidos.name
ltx/en_us_dedes/me.m10.d07:meMA.Ode3C11.mode	@ltx/en_us_dedes/miscellanea:misc.Mode1
ltx/en_us_dedes/me.m10.d07:meMA.Ode3C11.ode	@ltx/en_us_dedes/miscellanea:misc.Ode3
ltx/en_us_dedes/me.m10.d07:meMA.Ode3C11.text	
ltx/en_us_dedes/me.m10.d07:meMA.Ode3C12.incipit	…
ltx/en_us_dedes/me.m10.d07:meMA.Ode3C12.melody	@ltx/en_us_dedes/he.h.m1:heHE.OMonosEidos.name
ltx/en_us_dedes/me.m10.d07:meMA.Ode3C12.mode	@ltx/en_us_dedes/miscellanea:misc.Mode1
ltx/en_us_dedes/me.m10.d07:meMA.Ode3C12.ode	@ltx/en_us_dedes/miscellanea:misc.Ode3
ltx/en_us_dedes/me.m10.d07:meMA.Ode3C12.text	
ltx/en_us_dedes/me.m10.d07:meMA.Ode3C13.incipit	…
ltx/en_us_dedes/me.m10.d07:meMA.Ode3C13.melody	@ltx/en_us_dedes/he.h.m1:heHE.OMonosEidos.name
ltx/en_us_dedes/me.m10.d07:meMA.Ode3C13.mode	@ltx/en_us_dedes/miscellanea:misc.Mode1
ltx/en_us_dedes/me.m10.d07:meMA.Ode3C13.ode	@ltx/en_us_dedes/miscellanea:misc.Ode3
ltx/en_us_dedes/me.m10.d07:meMA.Ode3C13.text	
ltx/en_us_dedes/me.m10.d07:meMA.Ode3C1T.incipit	…
ltx/en_us_dedes/me.m10.d07:meMA.Ode3C1T.melody	@ltx/en_us_dedes/he.h.m1:heHE.OMonosEidos.name
ltx/en_us_dedes/me.m10.d07:meMA.Ode3C1T.mode	@ltx/en_us_dedes/miscellanea:misc.Mode1
ltx/en_us_dedes/me.m10.d07:meMA.Ode3C1T.ode	@ltx/en_us_dedes/miscellanea:misc.Ode3
ltx/en_us_dedes/me.m10.d07:meMA.Ode3C1T.text	
ltx/en_us_dedes/me.m10.d07:meMA.Ode3H.greekmelody	@ltx/en_us_dedes/he.h.m1:heHE.OMonosEidos.greekname
ltx/en_us_dedes/me.m10.d07:meMA.Ode3H.incipit	@ltx/en_us_dedes/he.h.m1:heHE.OMonosEidos.incipit
ltx/en_us_dedes/me.m10.d07:meMA.Ode3H.melody	@ltx/en_us_dedes/he.h.m1:heHE.OMonosEidos.melody
ltx/en_us_dedes/me.m10.d07:meMA.Ode3H.mode	@ltx/en_us_dedes/miscellanea:misc.Mode1
ltx/en_us_dedes/me.m10.d07:meMA.Ode3H.ode	@ltx/en_us_dedes/miscellanea:misc.Ode3
ltx/en_us_dedes/me.m10.d07:meMA.Ode3H.text	@ltx/en_us_dedes/he.h.m1:heHE.OMonosEidos.text
ltx/en_us_dedes/me.m10.d07:meMA.Ode3Kathisma1.greekmelody	@ltx/en_us_dedes/he.a.m8:heAU.TinSofianKaiLogon.greekname
ltx/en_us_dedes/me.m10.d07:meMA.Ode3Kathisma1.incipit	…
ltx/en_us_dedes/me.m10.d07:meMA.Ode3Kathisma1.melody	@ltx/en_us_dedes/he.a.m8:heAU.TinSofianKaiLogon.name
ltx/en_us_dedes/me.m10.d07:meMA.Ode3Kathisma1.mode	@ltx/en_us_dedes/miscellanea:misc.Mode8
ltx/en_us_dedes/me.m10.d07:meMA.Ode3Kathisma1.text	
ltx/en_us_dedes/me.m10.d07:meMA.Ode3KathismaSt.incipit	…
ltx/en_us_dedes/me.m10.d07:meMA.Ode3KathismaSt.melody	@ltx/en_us_dedes/he.a.m8:heAU.TinSofianKaiLogon.name
ltx/en_us_dedes/me.m10.d07:meMA.Ode3KathismaSt.mode	@ltx/en_us_dedes/miscellanea:misc.Mode8
ltx/en_us_dedes/me.m10.d07:meMA.Ode3KathismaSt.text	
ltx/en_us_dedes/me.m10.d07:meMA.Ode3KathismaT.incipit	…
ltx/en_us_dedes/me.m10.d07:meMA.Ode3KathismaT.melody	@ltx/en_us_dedes/he.a.m8:heAU.TinSofianKaiLogon.name
ltx/en_us_dedes/me.m10.d07:meMA.Ode3KathismaT.mode	@ltx/en_us_dedes/miscellanea:misc.Mode8
ltx/en_us_dedes/me.m10.d07:meMA.Ode3KathismaT.text	
ltx/en_us_dedes/me.m10.d07:meMA.Ode4C11.greekmelody	@ltx/en_us_dedes/he.h.m1:heHE.OrosSeTiChariti.greekname
ltx/en_us_dedes/me.m10.d07:meMA.Ode4C11.incipit	…
ltx/en_us_dedes/me.m10.d07:meMA.Ode4C11.melody	@ltx/en_us_dedes/he.h.m1:heHE.OrosSeTiChariti.name
ltx/en_us_dedes/me.m10.d07:meMA.Ode4C11.mode	@ltx/en_us_dedes/miscellanea:misc.Mode1
ltx/en_us_dedes/me.m10.d07:meMA.Ode4C11.ode	@ltx/en_us_dedes/miscellanea:misc.Ode4
ltx/en_us_dedes/me.m10.d07:meMA.Ode4C11.text	
ltx/en_us_dedes/me.m10.d07:meMA.Ode4C12.incipit	…
ltx/en_us_dedes/me.m10.d07:meMA.Ode4C12.melody	@ltx/en_us_dedes/he.h.m1:heHE.OrosSeTiChariti.name
ltx/en_us_dedes/me.m10.d07:meMA.Ode4C12.mode	@ltx/en_us_dedes/miscellanea:misc.Mode1
ltx/en_us_dedes/me.m10.d07:meMA.Ode4C12.ode	@ltx/en_us_dedes/miscellanea:misc.Ode4
ltx/en_us_dedes/me.m10.d07:meMA.Ode4C12.text	
ltx/en_us_dedes/me.m10.d07:meMA.Ode4C13.incipit	…
ltx/en_us_dedes/me.m10.d07:meMA.Ode4C13.melody	@ltx/en_us_dedes/he.h.m1:heHE.OrosSeTiChariti.name
ltx/en_us_dedes/me.m10.d07:meMA.Ode4C13.mode	@ltx/en_us_dedes/miscellanea:misc.Mode1
ltx/en_us_dedes/me.m10.d07:meMA.Ode4C13.ode	@ltx/en_us_dedes/miscellanea:misc.Ode4
ltx/en_us_dedes/me.m10.d07:meMA.Ode4C13.text	
ltx/en_us_dedes/me.m10.d07:meMA.Ode4C14.incipit	…
ltx/en_us_dedes/me.m10.d07:meMA.Ode4C14.melody	@ltx/en_us_dedes/he.h.m1:heHE.OrosSeTiChariti.name
ltx/en_us_dedes/me.m10.d07:meMA.Ode4C14.mode	@ltx/en_us_dedes/miscellanea:misc.Mode1
ltx/en_us_dedes/me.m10.d07:meMA.Ode4C14.ode	@ltx/en_us_dedes/miscellanea:misc.Ode4
ltx/en_us_dedes/me.m10.d07:meMA.Ode4C14.text	
ltx/en_us_dedes/me.m10.d07:meMA.Ode4C1T.incipit	…
ltx/en_us_dedes/me.m10.d07:meMA.Ode4C1T.melody	@ltx/en_us_dedes/he.h.m1:heHE.OrosSeTiChariti.name
ltx/en_us_dedes/me.m10.d07:meMA.Ode4C1T.mode	@ltx/en_us_dedes/miscellanea:misc.Mode1
ltx/en_us_dedes/me.m10.d07:meMA.Ode4C1T.ode	@ltx/en_us_dedes/miscellanea:misc.Ode4
ltx/en_us_dedes/me.m10.d07:meMA.Ode4C1T.text	
ltx/en_us_dedes/me.m10.d07:meMA.Ode5C11.greekmelody	@ltx/en_us_dedes/he.h.m1:heHE.OFotisasTiEllampsei.greekname
ltx/en_us_dedes/me.m10.d07:meMA.Ode5C11.incipit	…
ltx/en_us_dedes/me.m10.d07:meMA.Ode5C11.melody	@ltx/en_us_dedes/he.h.m1:heHE.OFotisasTiEllampsei.name
ltx/en_us_dedes/me.m10.d07:meMA.Ode5C11.mode	@ltx/en_us_dedes/miscellanea:misc.Mode1
ltx/en_us_dedes/me.m10.d07:meMA.Ode5C11.ode	@ltx/en_us_dedes/miscellanea:misc.Ode5
ltx/en_us_dedes/me.m10.d07:meMA.Ode5C11.text	
ltx/en_us_dedes/me.m10.d07:meMA.Ode5C12.incipit	…
ltx/en_us_dedes/me.m10.d07:meMA.Ode5C12.melody	@ltx/en_us_dedes/he.h.m1:heHE.OFotisasTiEllampsei.name
ltx/en_us_dedes/me.m10.d07:meMA.Ode5C12.mode	@ltx/en_us_dedes/miscellanea:misc.Mode1
ltx/en_us_dedes/me.m10.d07:meMA.Ode5C12.ode	@ltx/en_us_dedes/miscellanea:misc.Ode5
ltx/en_us_dedes/me.m10.d07:meMA.Ode5C12.text	
ltx/en_us_dedes/me.m10.d07:meMA.Ode5C13.incipit	…
ltx/en_us_dedes/me.m10.d07:meMA.Ode5C13.melody	@ltx/en_us_dedes/he.h.m1:heHE.OFotisasTiEllampsei.name
ltx/en_us_dedes/me.m10.d07:meMA.Ode5C13.mode	@ltx/en_us_dedes/miscellanea:misc.Mode1
ltx/en_us_dedes/me.m10.d07:meMA.Ode5C13.ode	@ltx/en_us_dedes/miscellanea:misc.Ode5
ltx/en_us_dedes/me.m10.d07:meMA.Ode5C13.text	
ltx/en_us_dedes/me.m10.d07:meMA.Ode5C1T.incipit	…
ltx/en_us_dedes/me.m10.d07:meMA.Ode5C1T.melody	@ltx/en_us_dedes/he.h.m1:heHE.OFotisasTiEllampsei.name
ltx/en_us_dedes/me.m10.d07:meMA.Ode5C1T.mode	@ltx/en_us_dedes/miscellanea:misc.Mode1
ltx/en_us_dedes/me.m10.d07:meMA.Ode5C1T.ode	@ltx/en_us_dedes/miscellanea:misc.Ode5
ltx/en_us_dedes/me.m10.d07:meMA.Ode5C1T.text	
ltx/en_us_dedes/me.m10.d07:meMA.Ode6C11.greekmelody	@ltx/en_us_dedes/he.h.m1:heHE.EkyklosenImas.greekname
ltx/en_us_dedes/me.m10.d07:meMA.Ode6C11.incipit	…
ltx/en_us_dedes/me.m10.d07:meMA.Ode6C11.melody	@ltx/en_us_dedes/he.h.m1:heHE.EkyklosenImas.name
ltx/en_us_dedes/me.m10.d07:meMA.Ode6C11.mode	@ltx/en_us_dedes/miscellanea:misc.Mode1
ltx/en_us_dedes/me.m10.d07:meMA.Ode6C11.ode	@ltx/en_us_dedes/miscellanea:misc.Ode6
ltx/en_us_dedes/me.m10.d07:meMA.Ode6C11.text	
ltx/en_us_dedes/me.m10.d07:meMA.Ode6C12.incipit	…
ltx/en_us_dedes/me.m10.d07:meMA.Ode6C12.melody	@ltx/en_us_dedes/he.h.m1:heHE.EkyklosenImas.name
ltx/en_us_dedes/me.m10.d07:meMA.Ode6C12.mode	@ltx/en_us_dedes/miscellanea:misc.Mode1
ltx/en_us_dedes/me.m10.d07:meMA.Ode6C12.ode	@ltx/en_us_dedes/miscellanea:misc.Ode6
ltx/en_us_dedes/me.m10.d07:meMA.Ode6C12.text	
ltx/en_us_dedes/me.m10.d07:meMA.Ode6C13.incipit	…
ltx/en_us_dedes/me.m10.d07:meMA.Ode6C13.melody	@ltx/en_us_dedes/he.h.m1:heHE.EkyklosenImas.name
ltx/en_us_dedes/me.m10.d07:meMA.Ode6C13.mode	@ltx/en_us_dedes/miscellanea:misc.Mode1
ltx/en_us_dedes/me.m10.d07:meMA.Ode6C13.ode	@ltx/en_us_dedes/miscellanea:misc.Ode6
ltx/en_us_dedes/me.m10.d07:meMA.Ode6C13.text	
ltx/en_us_dedes/me.m10.d07:meMA.Ode6C1T.incipit	…
ltx/en_us_dedes/me.m10.d07:meMA.Ode6C1T.melody	@ltx/en_us_dedes/he.h.m1:heHE.EkyklosenImas.name
ltx/en_us_dedes/me.m10.d07:meMA.Ode6C1T.mode	@ltx/en_us_dedes/miscellanea:misc.Mode1
ltx/en_us_dedes/me.m10.d07:meMA.Ode6C1T.ode	@ltx/en_us_dedes/miscellanea:misc.Ode6
ltx/en_us_dedes/me.m10.d07:meMA.Ode6C1T.text	
ltx/en_us_dedes/me.m10.d07:meMA.Ode6H.greekmelody	@ltx/en_us_dedes/he.h.m1:heHE.EkyklosenImas.greekname
ltx/en_us_dedes/me.m10.d07:meMA.Ode6H.incipit	@ltx/en_us_dedes/he.h.m1:heHE.EkyklosenImas.incipit
ltx/en_us_dedes/me.m10.d07:meMA.Ode6H.melody	@ltx/en_us_dedes/he.h.m1:heHE.EkyklosenImas.melody
ltx/en_us_dedes/me.m10.d07:meMA.Ode6H.mode	@ltx/en_us_dedes/miscellanea:misc.Mode1
ltx/en_us_dedes/me.m10.d07:meMA.Ode6H.ode	@ltx/en_us_dedes/miscellanea:misc.Ode6
ltx/en_us_dedes/me.m10.d07:meMA.Ode6H.text	@ltx/en_us_dedes/he.h.m1:heHE.EkyklosenImas.text
ltx/en_us_dedes/me.m10.d07:meMA.Ode7C11.greekmelody	@ltx/en_us_dedes/he.h.m1:heHE.SeNoitin.greekname
ltx/en_us_dedes/me.m10.d07:meMA.Ode7C11.incipit	…
ltx/en_us_dedes/me.m10.d07:meMA.Ode7C11.melody	@ltx/en_us_dedes/he.h.m1:heHE.SeNoitin.name
ltx/en_us_dedes/me.m10.d07:meMA.Ode7C11.mode	@ltx/en_us_dedes/miscellanea:misc.Mode1
ltx/en_us_dedes/me.m10.d07:meMA.Ode7C11.ode	@ltx/en_us_dedes/miscellanea:misc.Ode7
ltx/en_us_dedes/me.m10.d07:meMA.Ode7C11.text	
ltx/en_us_dedes/me.m10.d07:meMA.Ode7C12.incipit	…
ltx/en_us_dedes/me.m10.d07:meMA.Ode7C12.melody	@ltx/en_us_dedes/he.h.m1:heHE.SeNoitin.name
ltx/en_us_dedes/me.m10.d07:meMA.Ode7C12.mode	@ltx/en_us_dedes/miscellanea:misc.Mode1
ltx/en_us_dedes/me.m10.d07:meMA.Ode7C12.ode	@ltx/en_us_dedes/miscellanea:misc.Ode7
ltx/en_us_dedes/me.m10.d07:meMA.Ode7C12.text	
ltx/en_us_dedes/me.m10.d07:meMA.Ode7C13.incipit	…
ltx/en_us_dedes/me.m10.d07:meMA.Ode7C13.melody	@ltx/en_us_dedes/he.h.m1:heHE.SeNoitin.name
ltx/en_us_dedes/me.m10.d07:meMA.Ode7C13.mode	@ltx/en_us_dedes/miscellanea:misc.Mode1
ltx/en_us_dedes/me.m10.d07:meMA.Ode7C13.ode	@ltx/en_us_dedes/miscellanea:misc.Ode7
ltx/en_us_dedes/me.m10.d07:meMA.Ode7C13.text	
ltx/en_us_dedes/me.m10.d07:meMA.Ode7C1T.incipit	…
ltx/en_us_dedes/me.m10.d07:meMA.Ode7C1T.melody	@ltx/en_us_dedes/he.h.m1:heHE.SeNoitin.name
ltx/en_us_dedes/me.m10.d07:meMA.Ode7C1T.mode	@ltx/en_us_dedes/miscellanea:misc.Mode1
ltx/en_us_dedes/me.m10.d07:meMA.Ode7C1T.ode	@ltx/en_us_dedes/miscellanea:misc.Ode7
ltx/en_us_dedes/me.m10.d07:meMA.Ode7C1T.text	
ltx/en_us_dedes/me.m10.d07:meMA.Ode8C11.greekmelody	@ltx/en_us_dedes/he.h.m1:heHE.EnKaminoPaides.greekname
ltx/en_us_dedes/me.m10.d07:meMA.Ode8C11.incipit	…
ltx/en_us_dedes/me.m10.d07:meMA.Ode8C11.melody	@ltx/en_us_dedes/he.h.m1:heHE.EnKaminoPaides.name
ltx/en_us_dedes/me.m10.d07:meMA.Ode8C11.mode	@ltx/en_us_dedes/miscellanea:misc.Mode1
ltx/en_us_dedes/me.m10.d07:meMA.Ode8C11.ode	@ltx/en_us_dedes/miscellanea:misc.Ode8
ltx/en_us_dedes/me.m10.d07:meMA.Ode8C11.text	
ltx/en_us_dedes/me.m10.d07:meMA.Ode8C12.incipit	…
ltx/en_us_dedes/me.m10.d07:meMA.Ode8C12.melody	@ltx/en_us_dedes/he.h.m1:heHE.EnKaminoPaides.name
ltx/en_us_dedes/me.m10.d07:meMA.Ode8C12.mode	@ltx/en_us_dedes/miscellanea:misc.Mode1
ltx/en_us_dedes/me.m10.d07:meMA.Ode8C12.ode	@ltx/en_us_dedes/miscellanea:misc.Ode8
ltx/en_us_dedes/me.m10.d07:meMA.Ode8C12.text	
ltx/en_us_dedes/me.m10.d07:meMA.Ode8C13.incipit	…
ltx/en_us_dedes/me.m10.d07:meMA.Ode8C13.melody	@ltx/en_us_dedes/he.h.m1:heHE.EnKaminoPaides.name
ltx/en_us_dedes/me.m10.d07:meMA.Ode8C13.mode	@ltx/en_us_dedes/miscellanea:misc.Mode1
ltx/en_us_dedes/me.m10.d07:meMA.Ode8C13.ode	@ltx/en_us_dedes/miscellanea:misc.Ode8
ltx/en_us_dedes/me.m10.d07:meMA.Ode8C13.text	
ltx/en_us_dedes/me.m10.d07:meMA.Ode8C14.incipit	…
ltx/en_us_dedes/me.m10.d07:meMA.Ode8C14.melody	@ltx/en_us_dedes/he.h.m1:heHE.EnKaminoPaides.name
ltx/en_us_dedes/me.m10.d07:meMA.Ode8C14.mode	@ltx/en_us_dedes/miscellanea:misc.Mode1
ltx/en_us_dedes/me.m10.d07:meMA.Ode8C14.ode	@ltx/en_us_dedes/miscellanea:misc.Ode8
ltx/en_us_dedes/me.m10.d07:meMA.Ode8C14.text	
ltx/en_us_dedes/me.m10.d07:meMA.Ode8C1T.incipit	…
ltx/en_us_dedes/me.m10.d07:meMA.Ode8C1T.melody	@ltx/en_us_dedes/he.h.m1:heHE.EnKaminoPaides.name
ltx/en_us_dedes/me.m10.d07:meMA.Ode8C1T.mode	@ltx/en_us_dedes/miscellanea:misc.Mode1
ltx/en_us_dedes/me.m10.d07:meMA.Ode8C1T.ode	@ltx/en_us_dedes/miscellanea:misc.Ode8
ltx/en_us_dedes/me.m10.d07:meMA.Ode8C1T.text	
ltx/en_us_dedes/me.m10.d07:meMA.Ode8H.greekmelody	@ltx/en_us_dedes/he.h.m1:heHE.EnKaminoPaides.greekname
ltx/en_us_dedes/me.m10.d07:meMA.Ode8H.incipit	@ltx/en_us_dedes/he.h.m1:heHE.EnKaminoPaides.incipit
ltx/en_us_dedes/me.m10.d07:meMA.Ode8H.melody	@ltx/en_us_dedes/he.h.m1:heHE.EnKaminoPaides.melody
ltx/en_us_dedes/me.m10.d07:meMA.Ode8H.mode	@ltx/en_us_dedes/miscellanea:misc.Mode1
ltx/en_us_dedes/me.m10.d07:meMA.Ode8H.ode	@ltx/en_us_dedes/miscellanea:misc.Ode8
ltx/en_us_dedes/me.m10.d07:meMA.Ode8H.text	@ltx/en_us_dedes/he.h.m1:heHE.EnKaminoPaides.text
ltx/en_us_dedes/me.m10.d07:meMA.Ode9C11.greekmelody	@ltx/en_us_dedes/he.h.m1:heHE.TyponTisAgnis.greekname
ltx/en_us_dedes/me.m10.d07:meMA.Ode9C11.incipit	…
ltx/en_us_dedes/me.m10.d07:meMA.Ode9C11.melody	@ltx/en_us_dedes/he.h.m1:heHE.TyponTisAgnis.name
ltx/en_us_dedes/me.m10.d07:meMA.Ode9C11.mode	@ltx/en_us_dedes/miscellanea:misc.Mode1
ltx/en_us_dedes/me.m10.d07:meMA.Ode9C11.ode	@ltx/en_us_dedes/miscellanea:misc.Ode9
ltx/en_us_dedes/me.m10.d07:meMA.Ode9C11.text	
ltx/en_us_dedes/me.m10.d07:meMA.Ode9C12.incipit	…
ltx/en_us_dedes/me.m10.d07:meMA.Ode9C12.melody	@ltx/en_us_dedes/he.h.m1:heHE.TyponTisAgnis.name
ltx/en_us_dedes/me.m10.d07:meMA.Ode9C12.mode	@ltx/en_us_dedes/miscellanea:misc.Mode1
ltx/en_us_dedes/me.m10.d07:meMA.Ode9C12.ode	@ltx/en_us_dedes/miscellanea:misc.Ode9
ltx/en_us_dedes/me.m10.d07:meMA.Ode9C12.text	
ltx/en_us_dedes/me.m10.d07:meMA.Ode9C13.incipit	…
ltx/en_us_dedes/me.m10.d07:meMA.Ode9C13.melody	@ltx/en_us_dedes/he.h.m1:heHE.TyponTisAgnis.name
ltx/en_us_dedes/me.m10.d07:meMA.Ode9C13.mode	@ltx/en_us_dedes/miscellanea:misc.Mode1
ltx/en_us_dedes/me.m10.d07:meMA.Ode9C13.ode	@ltx/en_us_dedes/miscellanea:misc.Ode9
ltx/en_us_dedes/me.m10.d07:meMA.Ode9C13.text	
ltx/en_us_dedes/me.m10.d07:meMA.Ode9C14.incipit	…
ltx/en_us_dedes/me.m10.d07:meMA.Ode9C14.melody	@ltx/en_us_dedes/he.h.m1:heHE.TyponTisAgnis.name
ltx/en_us_dedes/me.m10.d07:meMA.Ode9C14.mode	@ltx/en_us_dedes/miscellanea:misc.Mode1
ltx/en_us_dedes/me.m10.d07:meMA.Ode9C14.ode	@ltx/en_us_dedes/miscellanea:misc.Ode9
ltx/en_us_dedes/me.m10.d07:meMA.Ode9C14.text	
ltx/en_us_dedes/me.m10.d07:meMA.Ode9C1T.incipit	…
ltx/en_us_dedes/me.m10.d07:meMA.Ode9C1T.melody	@ltx/en_us_dedes/he.h.m1:heHE.TyponTisAgnis.name
ltx/en_us_dedes/me.m10.d07:meMA.Ode9C1T.mode	@ltx/en_us_dedes/miscellanea:misc.Mode1
ltx/en_us_dedes/me.m10.d07:meMA.Ode9C1T.ode	@ltx/en_us_dedes/miscellanea:misc.Ode9
ltx/en_us_dedes/me.m10.d07:meMA.Ode9C1T.text	
ltx/en_us_dedes/me.m10.d07:meMA.Ode9H.greekmelody	@ltx/en_us_dedes/he.h.m1:heHE.TyponTisAgnis.greekname
ltx/en_us_dedes/me.m10.d07:meMA.Ode9H.incipit	@ltx/en_us_dedes/he.h.m1:heHE.TyponTisAgnis.incipit
ltx/en_us_dedes/me.m10.d07:meMA.Ode9H.melody	@ltx/en_us_dedes/he.h.m1:heHE.TyponTisAgnis.melody
ltx/en_us_dedes/me.m10.d07:meMA.Ode9H.mode	@ltx/en_us_dedes/miscellanea:misc.Mode1
ltx/en_us_dedes/me.m10.d07:meMA.Ode9H.ode	@ltx/en_us_dedes/miscellanea:misc.Ode9
ltx/en_us_dedes/me.m10.d07:meMA.Ode9H.text	@ltx/en_us_dedes/he.h.m1:heHE.TyponTisAgnis.text
ltx/en_us_dedes/me.m10.d07:meMA.Oikos1.text	
ltx/en_us_dedes/me.m10.d07:meVE.Apolytikion1ger.greekmelody	@ltx/en_us_dedes/he.a.m1:heAU.TouLithouSfragisthentos.greekname
ltx/en_us_dedes/me.m10.d07:meVE.Apolytikion1ger.incipit	…
ltx/en_us_dedes/me.m10.d07:meVE.Apolytikion1ger.melody	@ltx/en_us_dedes/he.a.m1:heAU.TouLithouSfragisthentos.name
ltx/en_us_dedes/me.m10.d07:meVE.Apolytikion1ger.mode	@ltx/en_us_dedes/miscellanea:misc.Mode1
ltx/en_us_dedes/me.m10.d07:meVE.Apolytikion1ger.poet	@ltx/en_us_dedes/poets:po.Gerasimou
ltx/en_us_dedes/me.m10.d07:meVE.Apolytikion1ger.text	
ltx/en_us_dedes/me.m10.d07:meVE.Apolytikion2ger.greekmelody	@ltx/en_us_dedes/he.a.m4:heAU.TachyProkatalave.greekname
ltx/en_us_dedes/me.m10.d07:meVE.Apolytikion2ger.incipit	…
ltx/en_us_dedes/me.m10.d07:meVE.Apolytikion2ger.melody	@ltx/en_us_dedes/he.a.m4:heAU.TachyProkatalave.name
ltx/en_us_dedes/me.m10.d07:meVE.Apolytikion2ger.mode	@ltx/en_us_dedes/miscellanea:misc.Mode4
ltx/en_us_dedes/me.m10.d07:meVE.Apolytikion2ger.poet	@ltx/en_us_dedes/poets:po.Gerasimou
ltx/en_us_dedes/me.m10.d07:meVE.Apolytikion2ger.text	
ltx/en_us_dedes/me.m10.d07:meVE.AposGlory.incipit	…
ltx/en_us_dedes/me.m10.d07:meVE.AposGlory.melody	
ltx/en_us_dedes/me.m10.d07:meVE.AposGlory.mode	@ltx/en_us_dedes/miscellanea:misc.Mode8
ltx/en_us_dedes/me.m10.d07:meVE.AposGlory.text	
ltx/en_us_dedes/me.m10.d07:meVE.AposStavrotheotokion.greekmelody	@ltx/en_us_dedes/he.a.m8:heAU.OTouParadoxou.greekname
ltx/en_us_dedes/me.m10.d07:meVE.AposStavrotheotokion.incipit	“What a paradoxal miracle; *…
ltx/en_us_dedes/me.m10.d07:meVE.AposStavrotheotokion.melody	@ltx/en_us_dedes/he.a.m8:heAU.OTouParadoxou.name
ltx/en_us_dedes/me.m10.d07:meVE.AposStavrotheotokion.mode	@ltx/en_us_dedes/miscellanea:misc.Mode8
ltx/en_us_dedes/me.m10.d07:meVE.AposStavrotheotokion.text	“What a paradoxal miracle; * Oh, novel mystery! Oh, * what an awful event this is!” * So Your Virgin Mother spoke, * as she witnessed You hanging there, * between two robbers on Golgotha, O Lord, * whom she had borne without labor wondrously. * Weeping she cried to You, * “Woe is me, O most beloved Son of mine! * Harsh and thankless are the ones who had You crucified!”
ltx/en_us_dedes/me.m10.d07:meVE.AposTheotokion.greekmelody	@ltx/en_us_dedes/he.a.m8:heAU.OTouParadoxou.greekname
ltx/en_us_dedes/me.m10.d07:meVE.AposTheotokion.incipit	@ltx/en_us_dedes/me.m10.d02:meMA.AposTheotokion.incipit
ltx/en_us_dedes/me.m10.d07:meVE.AposTheotokion.melody	@ltx/en_us_dedes/he.a.m8:heAU.OTouParadoxou.name
ltx/en_us_dedes/me.m10.d07:meVE.AposTheotokion.mode	@ltx/en_us_dedes/miscellanea:misc.Mode8
ltx/en_us_dedes/me.m10.d07:meVE.AposTheotokion.text	@ltx/en_us_dedes/me.m10.d02:meMA.AposTheotokion.text
ltx/en_us_dedes/me.m10.d07:meVE.SticGlory.incipit	…
ltx/en_us_dedes/me.m10.d07:meVE.SticGlory.melody	
ltx/en_us_dedes/me.m10.d07:meVE.SticGlory.mode	@ltx/en_us_dedes/miscellanea:misc.Mode4
ltx/en_us_dedes/me.m10.d07:meVE.SticGlory.text	
ltx/en_us_dedes/me.m10.d07:meVE.SticStavrotheotokion.greekmelody	@ltx/en_us_dedes/he.a.m4:heAU.EdokasSimeiosin.greekname
ltx/en_us_dedes/me.m10.d07:meVE.SticStavrotheotokion.incipit	@ltx/en_us_dedes/me.m02.d03:meVE.SticStavrotheotokion.incipit
ltx/en_us_dedes/me.m10.d07:meVE.SticStavrotheotokion.melody	@ltx/en_us_dedes/he.a.m4:heAU.EdokasSimeiosin.name
ltx/en_us_dedes/me.m10.d07:meVE.SticStavrotheotokion.mode	@ltx/en_us_dedes/miscellanea:misc.Mode4
ltx/en_us_dedes/me.m10.d07:meVE.SticStavrotheotokion.text	@ltx/en_us_dedes/me.m02.d03:meVE.SticStavrotheotokion.text
ltx/en_us_dedes/me.m10.d07:meVE.SticTheotokion.greekmelody	@ltx/en_us_dedes/he.a.m4:heAU.EdokasSimeiosin.greekname
ltx/en_us_dedes/me.m10.d07:meVE.SticTheotokion.incipit	…
ltx/en_us_dedes/me.m10.d07:meVE.SticTheotokion.melody	@ltx/en_us_dedes/he.a.m4:heAU.EdokasSimeiosin.name
ltx/en_us_dedes/me.m10.d07:meVE.SticTheotokion.mode	@ltx/en_us_dedes/miscellanea:misc.Mode4
ltx/en_us_dedes/me.m10.d07:meVE.SticTheotokion.text	
ltx/en_us_dedes/me.m10.d07:meVE.Stichera01.greekmelody	@ltx/en_us_dedes/he.a.m1:heAU.PaneffimoiMartyres.greekname
ltx/en_us_dedes/me.m10.d07:meVE.Stichera01.incipit	…
ltx/en_us_dedes/me.m10.d07:meVE.Stichera01.melody	@ltx/en_us_dedes/he.a.m1:heAU.PaneffimoiMartyres.name
ltx/en_us_dedes/me.m10.d07:meVE.Stichera01.mode	@ltx/en_us_dedes/miscellanea:misc.Mode1
ltx/en_us_dedes/me.m10.d07:meVE.Stichera01.text	
ltx/en_us_dedes/me.m10.d07:meVE.Stichera02.incipit	…
ltx/en_us_dedes/me.m10.d07:meVE.Stichera02.melody	@ltx/en_us_dedes/he.a.m1:heAU.PaneffimoiMartyres.name
ltx/en_us_dedes/me.m10.d07:meVE.Stichera02.mode	@ltx/en_us_dedes/miscellanea:misc.Mode1
ltx/en_us_dedes/me.m10.d07:meVE.Stichera02.text	
ltx/en_us_dedes/me.m10.d07:meVE.Stichera03.incipit	…
ltx/en_us_dedes/me.m10.d07:meVE.Stichera03.melody	@ltx/en_us_dedes/he.a.m1:heAU.PaneffimoiMartyres.name
ltx/en_us_dedes/me.m10.d07:meVE.Stichera03.mode	@ltx/en_us_dedes/miscellanea:misc.Mode1
ltx/en_us_dedes/me.m10.d07:meVE.Stichera03.text	
