ltx/en_us_dedes/me.m11.d13:meDA.commemoration.first	Memory of St. John Chrysostom
ltx/en_us_dedes/me.m11.d13:meDA.commemoration.first_name	St. John Chrysostom
ltx/en_us_dedes/me.m11.d13:meDA.commemoration.first_short	Memory of St. John Chrysostom
ltx/en_us_dedes/me.m11.d13:meDA.commemoration.first_title	@ltx/en_us_dedes/titles:ti.SaintM
ltx/en_us_dedes/me.m11.d13:meDA.commemoration.full	Memory of our Father among the Saints John Chrysostom, Archbishop of Constantinople.
ltx/en_us_dedes/me.m11.d13:meDA.commemoration.second_name	
ltx/en_us_dedes/me.m11.d13:meDA.commemoration.second_title	
ltx/en_us_dedes/me.m11.d13:meDA.date	November 13
ltx/en_us_dedes/me.m11.d13:meDA.fordate	for November 13
ltx/en_us_dedes/me.m11.d13:meDA.insert1	our father among the saints John Chrysostom, Archbishop of Constantinople,
ltx/en_us_dedes/me.m11.d13:meDA.insert2	whose memory we celebrate;
ltx/en_us_dedes/me.m11.d13:meDA.note	
ltx/en_us_dedes/me.m11.d13:meDA.pdfcoverdate	November 13,
ltx/en_us_dedes/me.m11.d13:meDA.pdfheaderdate	November 13
ltx/en_us_dedes/me.m11.d13:meHO.commemorations	
ltx/en_us_dedes/me.m11.d13:meHO.note1	
ltx/en_us_dedes/me.m11.d13:meHO.note2	
ltx/en_us_dedes/me.m11.d13:meHO.number	
ltx/en_us_dedes/me.m11.d13:meHO.rank	
ltx/en_us_dedes/me.m11.d13:meLE.commemoration1	Our Father among the Saints John Chrysostomos, Archbishop of Constantinople.
ltx/en_us_dedes/me.m11.d13:meLE.commemoration2	
ltx/en_us_dedes/me.m11.d13:meLI.Kontakion1.greekmelody	@ltx/en_us_dedes/me.m11.d13:meMA.Kontakion1.greekmelody
ltx/en_us_dedes/me.m11.d13:meLI.Kontakion1.incipit	@ltx/en_us_dedes/me.m11.d13:meMA.Kontakion1.incipit
ltx/en_us_dedes/me.m11.d13:meLI.Kontakion1.melody	@ltx/en_us_dedes/me.m11.d13:meMA.Kontakion1.melody
ltx/en_us_dedes/me.m11.d13:meLI.Kontakion1.mode	@ltx/en_us_dedes/me.m11.d13:meMA.Kontakion1.mode
ltx/en_us_dedes/me.m11.d13:meLI.Kontakion1.text	@ltx/en_us_dedes/me.m11.d13:meMA.Kontakion1.text
ltx/en_us_dedes/me.m11.d13:meLI.MM.CommunionHymn.text	@ltx/en_us_dedes/properties:media.key
ltx/en_us_dedes/me.m11.d13:meLI.Megalynarion.text	
ltx/en_us_dedes/me.m11.d13:meMA.C1.title	@ltx/en_us_dedes/titles:ti.CanonTheotokos
ltx/en_us_dedes/me.m11.d13:meMA.C1.verse	@ltx/en_us_dedes/prayers:pr.verse_Theotokos.text
ltx/en_us_dedes/me.m11.d13:meMA.C2.acrostic.notice1	
ltx/en_us_dedes/me.m11.d13:meMA.C2.acrostic.text	
ltx/en_us_dedes/me.m11.d13:meMA.C2.acrostic.title	
ltx/en_us_dedes/me.m11.d13:meMA.C2.poet	@ltx/en_us_dedes/poets:po.Theofanous
ltx/en_us_dedes/me.m11.d13:meMA.C2.title	@ltx/en_us_dedes/titles:ti.CanonSaintM
ltx/en_us_dedes/me.m11.d13:meMA.C2.verse	@ltx/en_us_dedes/prayers:pr.verse_SaintM.text
ltx/en_us_dedes/me.m11.d13:meMA.ExapTheotokion.incipit	O Virgin all-immaculate, * my…
ltx/en_us_dedes/me.m11.d13:meMA.ExapTheotokion.melody	@ltx/en_us_dedes/he.a.m2:heAU.GynaikesAkoutisthite.name
ltx/en_us_dedes/me.m11.d13:meMA.ExapTheotokion.mode	@ltx/en_us_dedes/miscellanea:misc.Mode2
ltx/en_us_dedes/me.m11.d13:meMA.ExapTheotokion.text	O Virgin all-immaculate, * my Lady, I beseech you now, * with Chrysostom the distinguished * uniting in supplication, * implore your Son to save us from * all manner of adversity, * and to grant us eternal goods; * for all this is in your power * to do for those who extol you.
ltx/en_us_dedes/me.m11.d13:meMA.Exaposteilarion1.greekmelody	@ltx/en_us_dedes/he.a.m3:heAU.EnPnevmatiToIero.greekname
ltx/en_us_dedes/me.m11.d13:meMA.Exaposteilarion1.incipit	Today the holy Church of…
ltx/en_us_dedes/me.m11.d13:meMA.Exaposteilarion1.melody	@ltx/en_us_dedes/he.a.m3:heAU.EnPnevmatiToIero.name
ltx/en_us_dedes/me.m11.d13:meMA.Exaposteilarion1.mode	@ltx/en_us_dedes/miscellanea:misc.Mode3
ltx/en_us_dedes/me.m11.d13:meMA.Exaposteilarion1.text	Today the holy Church of Christ * beams with joy and is brightened * because of your words that shine like gold, * O Chrysostom our father; * and as the faithful celebrate * your all-holy memory, * their souls are gaily rejoicing; * you have come to be the guide * to salvation for us all, * and a preacher of repentance.
ltx/en_us_dedes/me.m11.d13:meMA.Exaposteilarion2.greekmelody	@ltx/en_us_dedes/he.a.m2:heAU.GynaikesAkoutisthite.greekname
ltx/en_us_dedes/me.m11.d13:meMA.Exaposteilarion2.incipit	Since we were fortified by…
ltx/en_us_dedes/me.m11.d13:meMA.Exaposteilarion2.melody	@ltx/en_us_dedes/he.a.m2:heAU.GynaikesAkoutisthite.name
ltx/en_us_dedes/me.m11.d13:meMA.Exaposteilarion2.mode	@ltx/en_us_dedes/miscellanea:misc.Mode2
ltx/en_us_dedes/me.m11.d13:meMA.Exaposteilarion2.text	Since we were fortified by him, * let us extol saint John the wise, * that great stentorian preacher * of charity and repentance, * the sweetly-speaking golden mouth * that taught the dogmas of the Church, * and therefore was called Chrysostom, * that treasure chest of the paupers, * the clarity of the Scriptures.
ltx/en_us_dedes/me.m11.d13:meMA.Kathisma11.greekmelody	@ltx/en_us_dedes/he.a.m8:heAU.TinSofianKaiLogon.greekname
ltx/en_us_dedes/me.m11.d13:meMA.Kathisma11.incipit	In the wisdom of God…
ltx/en_us_dedes/me.m11.d13:meMA.Kathisma11.melody	@ltx/en_us_dedes/he.a.m8:heAU.TinSofianKaiLogon.name
ltx/en_us_dedes/me.m11.d13:meMA.Kathisma11.mode	@ltx/en_us_dedes/miscellanea:misc.Mode8
ltx/en_us_dedes/me.m11.d13:meMA.Kathisma11.text	In the wisdom of God you were fully versed, * and the grace of eloquence you received from Him. * Then brightly you shone on all, * much like gold that is purified. * And you preached the dogma of the one God in Trinity, * and with your words you shot down the error of avarice. * Therefore you were zealous to censure the Empress; * and you were unjustly sent into exile from your flock, * blessed Saint John Chrysostom. * Intercede with Christ our God * that He grant forgiveness of offenses * to those who with longing observe your holy memory.
ltx/en_us_dedes/me.m11.d13:meMA.Kathisma1T.incipit	Holy Virgin, you see that…
ltx/en_us_dedes/me.m11.d13:meMA.Kathisma1T.melody	@ltx/en_us_dedes/he.a.m8:heAU.TinSofianKaiLogon.name
ltx/en_us_dedes/me.m11.d13:meMA.Kathisma1T.mode	@ltx/en_us_dedes/miscellanea:misc.Mode8
ltx/en_us_dedes/me.m11.d13:meMA.Kathisma1T.text	Holy Virgin, you see that my humble soul * like a ship with no pilot is tossed about * in the storm of the present life, with temptations as turbulence, * and it is taking water because of the weight of sins; * and it is now in danger of entering the depth of Hell. * Come, O Theotokos, with your strong intercession, * and save me, and steer the ship of my soul to your calm port, * that with faith I may sing to you: * With your Son and God intercede, * that He grant to me forgiveness of my sins. * I your servant, O Lady, have you as my only hope.
ltx/en_us_dedes/me.m11.d13:meMA.Kathisma21.greekmelody	@ltx/en_us_dedes/he.a.m3:heAU.TheiasPisteos.greekname
ltx/en_us_dedes/me.m11.d13:meMA.Kathisma21.incipit	You were shown to be…
ltx/en_us_dedes/me.m11.d13:meMA.Kathisma21.melody	@ltx/en_us_dedes/he.a.m3:heAU.TheiasPisteos.name
ltx/en_us_dedes/me.m11.d13:meMA.Kathisma21.mode	@ltx/en_us_dedes/miscellanea:misc.Mode3
ltx/en_us_dedes/me.m11.d13:meMA.Kathisma21.text	You were shown to be a holy vessel * of the Church of Christ, O righteous Father, * and the safe and secure wealth of true belief; * and with dispassion you embellished your way of life, * and you dispensed care and mercy to those in need. * Holy Chrysostom, to Christ our God pray fervently, * beseeching Him to grant us His great mercy.
ltx/en_us_dedes/me.m11.d13:meMA.Kathisma22.greekmelody	@ltx/en_us_dedes/he.a.m5:heAU.TonSynanarchonLogon.greekname
ltx/en_us_dedes/me.m11.d13:meMA.Kathisma22.incipit	To that meadow of God-inspired…
ltx/en_us_dedes/me.m11.d13:meMA.Kathisma22.melody	@ltx/en_us_dedes/he.a.m5:heAU.TonSynanarchonLogon.name
ltx/en_us_dedes/me.m11.d13:meMA.Kathisma22.mode	@ltx/en_us_dedes/miscellanea:misc.Mode5
ltx/en_us_dedes/me.m11.d13:meMA.Kathisma22.text	To that meadow of God-inspired words of holy Writ, * to the one who has guided us to repentance, * to the man who has endured trials of every kind, * Saint John Chrysostom, who taught us, believers, let us give * honor and praise as is worthy. * He intercedes with the Savior, to have mercy on our souls.
ltx/en_us_dedes/me.m11.d13:meMA.Kathisma2T.incipit	The astonishing miracle of how…
ltx/en_us_dedes/me.m11.d13:meMA.Kathisma2T.melody	@ltx/en_us_dedes/he.a.m5:heAU.TonSynanarchonLogon.name
ltx/en_us_dedes/me.m11.d13:meMA.Kathisma2T.mode	@ltx/en_us_dedes/miscellanea:misc.Mode5
ltx/en_us_dedes/me.m11.d13:meMA.Kathisma2T.text	The astonishing miracle of how you conceived * and the ineffable manner of how you gave birth * that was manifest in you, O Ever-virgin and pure, * is astounding to my mind, * and your glory as well * has stunned my thoughts, Theotokos, * and it spreads out to all people, for the salvation of our souls.
ltx/en_us_dedes/me.m11.d13:meMA.Kathisma31.greekmelody	@ltx/en_us_dedes/he.a.m4:heAU.EpefanisSimeron.greekname
ltx/en_us_dedes/me.m11.d13:meMA.Kathisma31.incipit	Watered by your golden words…
ltx/en_us_dedes/me.m11.d13:meMA.Kathisma31.melody	@ltx/en_us_dedes/he.a.m4:heAU.EpefanisSimeron.name
ltx/en_us_dedes/me.m11.d13:meMA.Kathisma31.mode	@ltx/en_us_dedes/miscellanea:misc.Mode4
ltx/en_us_dedes/me.m11.d13:meMA.Kathisma31.text	Watered by your golden words, * the Church now offers * the refreshing beverage * of golden waters unto all, * and she is able to cure the ills * of all who praise you, * O all-blessed Chrysostom.
ltx/en_us_dedes/me.m11.d13:meMA.Kathisma32.greekmelody	@ltx/en_us_dedes/he.a.m5:heAU.TonSynanarchonLogon.greekname
ltx/en_us_dedes/me.m11.d13:meMA.Kathisma32.incipit	The unauthorized synod’s overt hostility…
ltx/en_us_dedes/me.m11.d13:meMA.Kathisma32.melody	@ltx/en_us_dedes/he.a.m5:heAU.TonSynanarchonLogon.name
ltx/en_us_dedes/me.m11.d13:meMA.Kathisma32.mode	@ltx/en_us_dedes/miscellanea:misc.Mode5
ltx/en_us_dedes/me.m11.d13:meMA.Kathisma32.text	The unauthorized synod’s overt hostility * and the furious Empress’s animosity * were unable to extinguish the virtue in you; * but in the fire of the trials being tested like gold, * you now entreat without ceasing * the all-holy Trinity, * for the sake of which you struggled ardently.
ltx/en_us_dedes/me.m11.d13:meMA.Kathisma3T.incipit	@ltx/en_us_dedes/oc.m5.d3:ocVE.ApolTheotokionVM.incipit
ltx/en_us_dedes/me.m11.d13:meMA.Kathisma3T.melody	@ltx/en_us_dedes/he.a.m5:heAU.TonSynanarchonLogon.name
ltx/en_us_dedes/me.m11.d13:meMA.Kathisma3T.mode	@ltx/en_us_dedes/miscellanea:misc.Mode5
ltx/en_us_dedes/me.m11.d13:meMA.Kathisma3T.text	@ltx/en_us_dedes/oc.m5.d3:ocVE.ApolTheotokionVM.text
ltx/en_us_dedes/me.m11.d13:meMA.Kontakion1.greekmelody	@ltx/en_us_dedes/he.a.m6:heAU.TinYperImon.greekname
ltx/en_us_dedes/me.m11.d13:meMA.Kontakion1.incipit	You received the grace of…
ltx/en_us_dedes/me.m11.d13:meMA.Kontakion1.melody	@ltx/en_us_dedes/he.a.m6:heAU.TinYperImon.name
ltx/en_us_dedes/me.m11.d13:meMA.Kontakion1.mode	@ltx/en_us_dedes/miscellanea:misc.Mode6
ltx/en_us_dedes/me.m11.d13:meMA.Kontakion1.text	You received the grace of God coming down from heaven; now by means of your own lips you instruct all people how to worship in Trinity the one and only God, O devout Saint John Chrysostom, the all-blessed and golden-mouthed. It is right that we should honor you. For elucidating things divine, you are our teacher and guide.
ltx/en_us_dedes/me.m11.d13:meMA.Lauds1.greekmelody	@ltx/en_us_dedes/he.a.m4:heAU.EdokasSimeiosin.greekname
ltx/en_us_dedes/me.m11.d13:meMA.Lauds1.incipit	You pour out your sacred…
ltx/en_us_dedes/me.m11.d13:meMA.Lauds1.melody	@ltx/en_us_dedes/he.a.m4:heAU.EdokasSimeiosin.name
ltx/en_us_dedes/me.m11.d13:meMA.Lauds1.mode	@ltx/en_us_dedes/miscellanea:misc.Mode4
ltx/en_us_dedes/me.m11.d13:meMA.Lauds1.text	You pour out your sacred teachings which, more splendid than gold itself, * do enrich our impoverished minds * and hearts, blessed Chrysostom, * wise and holy father; * and by them you drive out the bitter winter and the gloom * brought on by passions, indeed by avarice. * And therefore we are obligated to extol you and call you blest, * and we honor your relics’ dust * as a well-spring of sanctity.
ltx/en_us_dedes/me.m11.d13:meMA.Lauds2.incipit	Today let us all extol…
ltx/en_us_dedes/me.m11.d13:meMA.Lauds2.melody	@ltx/en_us_dedes/he.a.m4:heAU.EdokasSimeiosin.name
ltx/en_us_dedes/me.m11.d13:meMA.Lauds2.mode	@ltx/en_us_dedes/miscellanea:misc.Mode4
ltx/en_us_dedes/me.m11.d13:meMA.Lauds2.text	Today let us all extol that fiery column, that solid gold * sacred mouth of theology, * that river with mighty streams * of Orthodox dogmas, * guarantor of sinners, that godly preacher who exhorts * all to repentance, heavenly intellect, * that man who lives in heaven now and shines on earth as a radiant * luminary, that blessed John, * whom we honor as Chrysostom.
ltx/en_us_dedes/me.m11.d13:meMA.Lauds3.incipit	You became a gloriously glowing…
ltx/en_us_dedes/me.m11.d13:meMA.Lauds3.melody	@ltx/en_us_dedes/he.a.m4:heAU.EdokasSimeiosin.name
ltx/en_us_dedes/me.m11.d13:meMA.Lauds3.mode	@ltx/en_us_dedes/miscellanea:misc.Mode4
ltx/en_us_dedes/me.m11.d13:meMA.Lauds3.text	You became a gloriously glowing sun that illuminates * by your words the entire world, * a star that is luminous, * and a shining beacon,* a prominent lighthouse, inviting everyone who sails * the stormy sea of the world in every age, * to put in at the tranquil harbor of salvation obtained by grace, * golden-spoken saint Chrysostom, * intercessor on our behalf.
ltx/en_us_dedes/me.m11.d13:meMA.Lauds4.greekmelody	@ltx/en_us_dedes/he.a.m4:heAU.EdokasSimeiosin.greekname
ltx/en_us_dedes/me.m11.d13:meMA.Lauds4.incipit	Father, you were driven from…
ltx/en_us_dedes/me.m11.d13:meMA.Lauds4.melody	@ltx/en_us_dedes/he.a.m4:heAU.EdokasSimeiosin.name
ltx/en_us_dedes/me.m11.d13:meMA.Lauds4.mode	@ltx/en_us_dedes/miscellanea:misc.Mode4
ltx/en_us_dedes/me.m11.d13:meMA.Lauds4.text	Father, you were driven from your flock unjustly and met with great * tribulations, O holy one, * and bitterest banishments, * in which you were counted * worthy of a blest end; * and as an athlete brave and strong * you fought the crafty one and you threw him down; * and Christ our Savior crowned you with the laurel crown for your victory, * O devout Saint John Chrysostom, * intercessor on our behalf.
ltx/en_us_dedes/me.m11.d13:meMA.LaudsGlory.incipit	You adorned God’s Church with…
ltx/en_us_dedes/me.m11.d13:meMA.LaudsGlory.melody	
ltx/en_us_dedes/me.m11.d13:meMA.LaudsGlory.mode	@ltx/en_us_dedes/miscellanea:misc.Mode8
ltx/en_us_dedes/me.m11.d13:meMA.LaudsGlory.poet	@ltx/en_us_dedes/poets:po.Anatoliou
ltx/en_us_dedes/me.m11.d13:meMA.LaudsGlory.text	You adorned God’s Church with golden words and teachings inspired by God, and you amassed in her a spiritual treasure, namely your divine oracles. Therefore on the occasion of your sacred memory, she presents you a wreath, woven with songs like undying flowers, O divinely wise Saint John, solid gold both in soul and tongue. Since you pray with confidence, O Righteous Father, intercede on behalf of our souls.
ltx/en_us_dedes/me.m11.d13:meMA.LaudsTheotokion.incipit	@ltx/en_us_dedes/oc.m8.d5:ocMA.AposTheotokion.incipit
ltx/en_us_dedes/me.m11.d13:meMA.LaudsTheotokion.melody	
ltx/en_us_dedes/me.m11.d13:meMA.LaudsTheotokion.mode	@ltx/en_us_dedes/miscellanea:misc.Mode8
ltx/en_us_dedes/me.m11.d13:meMA.LaudsTheotokion.text	@ltx/en_us_dedes/oc.m8.d5:ocMA.AposTheotokion.text
ltx/en_us_dedes/me.m11.d13:meMA.MM.Lauds1234as5678.text	@ltx/en_us_dedes/properties:media.key
ltx/en_us_dedes/me.m11.d13:meMA.Ode1C11.greekmelody	@ltx/en_us_dedes/he.h.m8:heHE.YgranDiodefsas.greekname
ltx/en_us_dedes/me.m11.d13:meMA.Ode1C11.incipit	@ltx/en_us_dedes/ho.ho23:hoCA.Ode11.incipit
ltx/en_us_dedes/me.m11.d13:meMA.Ode1C11.melody	@ltx/en_us_dedes/he.h.m8:heHE.YgranDiodefsas.name
ltx/en_us_dedes/me.m11.d13:meMA.Ode1C11.mode	@ltx/en_us_dedes/miscellanea:misc.Mode8
ltx/en_us_dedes/me.m11.d13:meMA.Ode1C11.ode	@ltx/en_us_dedes/miscellanea:misc.Ode1
ltx/en_us_dedes/me.m11.d13:meMA.Ode1C11.text	@ltx/en_us_dedes/ho.ho23:hoCA.Ode11.text
ltx/en_us_dedes/me.m11.d13:meMA.Ode1C12.incipit	@ltx/en_us_dedes/ho.ho23:hoCA.Ode12.incipit
ltx/en_us_dedes/me.m11.d13:meMA.Ode1C12.melody	@ltx/en_us_dedes/he.h.m8:heHE.YgranDiodefsas.name
ltx/en_us_dedes/me.m11.d13:meMA.Ode1C12.mode	@ltx/en_us_dedes/miscellanea:misc.Mode8
ltx/en_us_dedes/me.m11.d13:meMA.Ode1C12.ode	@ltx/en_us_dedes/miscellanea:misc.Ode1
ltx/en_us_dedes/me.m11.d13:meMA.Ode1C12.text	@ltx/en_us_dedes/ho.ho23:hoCA.Ode12.text
ltx/en_us_dedes/me.m11.d13:meMA.Ode1C13.incipit	@ltx/en_us_dedes/ho.ho23:hoCA.Ode13.incipit
ltx/en_us_dedes/me.m11.d13:meMA.Ode1C13.melody	@ltx/en_us_dedes/he.h.m8:heHE.YgranDiodefsas.name
ltx/en_us_dedes/me.m11.d13:meMA.Ode1C13.mode	@ltx/en_us_dedes/miscellanea:misc.Mode8
ltx/en_us_dedes/me.m11.d13:meMA.Ode1C13.ode	@ltx/en_us_dedes/miscellanea:misc.Ode1
ltx/en_us_dedes/me.m11.d13:meMA.Ode1C13.text	@ltx/en_us_dedes/ho.ho23:hoCA.Ode13.text
ltx/en_us_dedes/me.m11.d13:meMA.Ode1C14.incipit	@ltx/en_us_dedes/ho.ho23:hoCA.Ode14.incipit
ltx/en_us_dedes/me.m11.d13:meMA.Ode1C14.melody	@ltx/en_us_dedes/he.h.m8:heHE.YgranDiodefsas.name
ltx/en_us_dedes/me.m11.d13:meMA.Ode1C14.mode	@ltx/en_us_dedes/miscellanea:misc.Mode8
ltx/en_us_dedes/me.m11.d13:meMA.Ode1C14.ode	@ltx/en_us_dedes/miscellanea:misc.Ode1
ltx/en_us_dedes/me.m11.d13:meMA.Ode1C14.text	@ltx/en_us_dedes/ho.ho23:hoCA.Ode14.text
ltx/en_us_dedes/me.m11.d13:meMA.Ode1C15.incipit	…
ltx/en_us_dedes/me.m11.d13:meMA.Ode1C15.melody	@ltx/en_us_dedes/he.h.m8:heHE.YgranDiodefsas.name
ltx/en_us_dedes/me.m11.d13:meMA.Ode1C15.mode	@ltx/en_us_dedes/miscellanea:misc.Mode8
ltx/en_us_dedes/me.m11.d13:meMA.Ode1C15.ode	@ltx/en_us_dedes/miscellanea:misc.Ode1
ltx/en_us_dedes/me.m11.d13:meMA.Ode1C15.text	
ltx/en_us_dedes/me.m11.d13:meMA.Ode1C1H.greekmelody	@ltx/en_us_dedes/he.h.m8:heHE.YgranDiodefsas.greekname
ltx/en_us_dedes/me.m11.d13:meMA.Ode1C1H.incipit	@ltx/en_us_dedes/he.h.m8:heHE.YgranDiodefsas.incipit
ltx/en_us_dedes/me.m11.d13:meMA.Ode1C1H.melody	@ltx/en_us_dedes/he.h.m8:heHE.YgranDiodefsas.melody
ltx/en_us_dedes/me.m11.d13:meMA.Ode1C1H.mode	@ltx/en_us_dedes/miscellanea:misc.Mode8
ltx/en_us_dedes/me.m11.d13:meMA.Ode1C1H.ode	@ltx/en_us_dedes/miscellanea:misc.Ode1
ltx/en_us_dedes/me.m11.d13:meMA.Ode1C1H.text	@ltx/en_us_dedes/he.h.m8:heHE.YgranDiodefsas.text
ltx/en_us_dedes/me.m11.d13:meMA.Ode1C21.greekmelody	@ltx/en_us_dedes/he.h.m8:heHE.ArmatilatinFarao.greekname
ltx/en_us_dedes/me.m11.d13:meMA.Ode1C21.incipit	…
ltx/en_us_dedes/me.m11.d13:meMA.Ode1C21.melody	@ltx/en_us_dedes/he.h.m8:heHE.ArmatilatinFarao.name
ltx/en_us_dedes/me.m11.d13:meMA.Ode1C21.mode	@ltx/en_us_dedes/miscellanea:misc.Mode8
ltx/en_us_dedes/me.m11.d13:meMA.Ode1C21.ode	@ltx/en_us_dedes/miscellanea:misc.Ode1
ltx/en_us_dedes/me.m11.d13:meMA.Ode1C21.text	
ltx/en_us_dedes/me.m11.d13:meMA.Ode1C22.incipit	…
ltx/en_us_dedes/me.m11.d13:meMA.Ode1C22.melody	@ltx/en_us_dedes/he.h.m8:heHE.ArmatilatinFarao.name
ltx/en_us_dedes/me.m11.d13:meMA.Ode1C22.mode	@ltx/en_us_dedes/miscellanea:misc.Mode8
ltx/en_us_dedes/me.m11.d13:meMA.Ode1C22.ode	@ltx/en_us_dedes/miscellanea:misc.Ode1
ltx/en_us_dedes/me.m11.d13:meMA.Ode1C22.text	
ltx/en_us_dedes/me.m11.d13:meMA.Ode1C23.incipit	…
ltx/en_us_dedes/me.m11.d13:meMA.Ode1C23.melody	@ltx/en_us_dedes/he.h.m8:heHE.ArmatilatinFarao.name
ltx/en_us_dedes/me.m11.d13:meMA.Ode1C23.mode	@ltx/en_us_dedes/miscellanea:misc.Mode8
ltx/en_us_dedes/me.m11.d13:meMA.Ode1C23.ode	@ltx/en_us_dedes/miscellanea:misc.Ode1
ltx/en_us_dedes/me.m11.d13:meMA.Ode1C23.text	
ltx/en_us_dedes/me.m11.d13:meMA.Ode1C2T.incipit	…
ltx/en_us_dedes/me.m11.d13:meMA.Ode1C2T.melody	@ltx/en_us_dedes/he.h.m8:heHE.ArmatilatinFarao.name
ltx/en_us_dedes/me.m11.d13:meMA.Ode1C2T.mode	@ltx/en_us_dedes/miscellanea:misc.Mode8
ltx/en_us_dedes/me.m11.d13:meMA.Ode1C2T.ode	@ltx/en_us_dedes/miscellanea:misc.Ode1
ltx/en_us_dedes/me.m11.d13:meMA.Ode1C2T.text	
ltx/en_us_dedes/me.m11.d13:meMA.Ode3C11.greekmelody	@ltx/en_us_dedes/he.h.m8:heHE.OuraniasApsidos.greekname
ltx/en_us_dedes/me.m11.d13:meMA.Ode3C11.incipit	@ltx/en_us_dedes/ho.ho23:hoCA.Ode31.incipit
ltx/en_us_dedes/me.m11.d13:meMA.Ode3C11.melody	@ltx/en_us_dedes/he.h.m8:heHE.OuraniasApsidos.name
ltx/en_us_dedes/me.m11.d13:meMA.Ode3C11.mode	@ltx/en_us_dedes/miscellanea:misc.Mode8
ltx/en_us_dedes/me.m11.d13:meMA.Ode3C11.ode	@ltx/en_us_dedes/miscellanea:misc.Ode3
ltx/en_us_dedes/me.m11.d13:meMA.Ode3C11.text	@ltx/en_us_dedes/ho.ho23:hoCA.Ode31.text
ltx/en_us_dedes/me.m11.d13:meMA.Ode3C12.incipit	@ltx/en_us_dedes/ho.ho23:hoCA.Ode32.incipit
ltx/en_us_dedes/me.m11.d13:meMA.Ode3C12.melody	@ltx/en_us_dedes/he.h.m8:heHE.OuraniasApsidos.name
ltx/en_us_dedes/me.m11.d13:meMA.Ode3C12.mode	@ltx/en_us_dedes/miscellanea:misc.Mode8
ltx/en_us_dedes/me.m11.d13:meMA.Ode3C12.ode	@ltx/en_us_dedes/miscellanea:misc.Ode3
ltx/en_us_dedes/me.m11.d13:meMA.Ode3C12.text	@ltx/en_us_dedes/ho.ho23:hoCA.Ode32.text
ltx/en_us_dedes/me.m11.d13:meMA.Ode3C13.incipit	@ltx/en_us_dedes/ho.ho23:hoCA.Ode33.incipit
ltx/en_us_dedes/me.m11.d13:meMA.Ode3C13.melody	@ltx/en_us_dedes/he.h.m8:heHE.OuraniasApsidos.name
ltx/en_us_dedes/me.m11.d13:meMA.Ode3C13.mode	@ltx/en_us_dedes/miscellanea:misc.Mode8
ltx/en_us_dedes/me.m11.d13:meMA.Ode3C13.ode	@ltx/en_us_dedes/miscellanea:misc.Ode3
ltx/en_us_dedes/me.m11.d13:meMA.Ode3C13.text	@ltx/en_us_dedes/ho.ho23:hoCA.Ode33.text
ltx/en_us_dedes/me.m11.d13:meMA.Ode3C14.incipit	@ltx/en_us_dedes/ho.ho23:hoCA.Ode34.incipit
ltx/en_us_dedes/me.m11.d13:meMA.Ode3C14.melody	@ltx/en_us_dedes/he.h.m8:heHE.OuraniasApsidos.name
ltx/en_us_dedes/me.m11.d13:meMA.Ode3C14.mode	@ltx/en_us_dedes/miscellanea:misc.Mode8
ltx/en_us_dedes/me.m11.d13:meMA.Ode3C14.ode	@ltx/en_us_dedes/miscellanea:misc.Ode3
ltx/en_us_dedes/me.m11.d13:meMA.Ode3C14.text	@ltx/en_us_dedes/ho.ho23:hoCA.Ode34.text
ltx/en_us_dedes/me.m11.d13:meMA.Ode3C1H.greekmelody	@ltx/en_us_dedes/he.h.m8:heHE.OuraniasApsidos.greekname
ltx/en_us_dedes/me.m11.d13:meMA.Ode3C1H.incipit	@ltx/en_us_dedes/he.h.m8:heHE.OuraniasApsidos.incipit
ltx/en_us_dedes/me.m11.d13:meMA.Ode3C1H.melody	@ltx/en_us_dedes/he.h.m8:heHE.OuraniasApsidos.melody
ltx/en_us_dedes/me.m11.d13:meMA.Ode3C1H.mode	@ltx/en_us_dedes/miscellanea:misc.Mode8
ltx/en_us_dedes/me.m11.d13:meMA.Ode3C1H.ode	@ltx/en_us_dedes/miscellanea:misc.Ode3
ltx/en_us_dedes/me.m11.d13:meMA.Ode3C1H.text	@ltx/en_us_dedes/he.h.m8:heHE.OuraniasApsidos.text
ltx/en_us_dedes/me.m11.d13:meMA.Ode3C21.greekmelody	@ltx/en_us_dedes/he.h.m8:heHE.OStereosasKatArchas.greekname
ltx/en_us_dedes/me.m11.d13:meMA.Ode3C21.incipit	…
ltx/en_us_dedes/me.m11.d13:meMA.Ode3C21.melody	@ltx/en_us_dedes/he.h.m8:heHE.OStereosasKatArchas.name
ltx/en_us_dedes/me.m11.d13:meMA.Ode3C21.mode	@ltx/en_us_dedes/miscellanea:misc.Mode8
ltx/en_us_dedes/me.m11.d13:meMA.Ode3C21.ode	@ltx/en_us_dedes/miscellanea:misc.Ode3
ltx/en_us_dedes/me.m11.d13:meMA.Ode3C21.text	
ltx/en_us_dedes/me.m11.d13:meMA.Ode3C22.incipit	…
ltx/en_us_dedes/me.m11.d13:meMA.Ode3C22.melody	@ltx/en_us_dedes/he.h.m8:heHE.OStereosasKatArchas.name
ltx/en_us_dedes/me.m11.d13:meMA.Ode3C22.mode	@ltx/en_us_dedes/miscellanea:misc.Mode8
ltx/en_us_dedes/me.m11.d13:meMA.Ode3C22.ode	@ltx/en_us_dedes/miscellanea:misc.Ode3
ltx/en_us_dedes/me.m11.d13:meMA.Ode3C22.text	
ltx/en_us_dedes/me.m11.d13:meMA.Ode3C23.incipit	…
ltx/en_us_dedes/me.m11.d13:meMA.Ode3C23.melody	@ltx/en_us_dedes/he.h.m8:heHE.OStereosasKatArchas.name
ltx/en_us_dedes/me.m11.d13:meMA.Ode3C23.mode	@ltx/en_us_dedes/miscellanea:misc.Mode8
ltx/en_us_dedes/me.m11.d13:meMA.Ode3C23.ode	@ltx/en_us_dedes/miscellanea:misc.Ode3
ltx/en_us_dedes/me.m11.d13:meMA.Ode3C23.text	
ltx/en_us_dedes/me.m11.d13:meMA.Ode3C2T.incipit	…
ltx/en_us_dedes/me.m11.d13:meMA.Ode3C2T.melody	@ltx/en_us_dedes/he.h.m8:heHE.OStereosasKatArchas.name
ltx/en_us_dedes/me.m11.d13:meMA.Ode3C2T.mode	@ltx/en_us_dedes/miscellanea:misc.Mode8
ltx/en_us_dedes/me.m11.d13:meMA.Ode3C2T.ode	@ltx/en_us_dedes/miscellanea:misc.Ode3
ltx/en_us_dedes/me.m11.d13:meMA.Ode3C2T.text	
ltx/en_us_dedes/me.m11.d13:meMA.Ode3Kathisma1.greekmelody	@ltx/en_us_dedes/he.a.m8:heAU.TinSofianKaiLogon.greekname
ltx/en_us_dedes/me.m11.d13:meMA.Ode3Kathisma1.incipit	…
ltx/en_us_dedes/me.m11.d13:meMA.Ode3Kathisma1.melody	@ltx/en_us_dedes/he.a.m8:heAU.TinSofianKaiLogon.name
ltx/en_us_dedes/me.m11.d13:meMA.Ode3Kathisma1.mode	@ltx/en_us_dedes/miscellanea:misc.Mode8
ltx/en_us_dedes/me.m11.d13:meMA.Ode3Kathisma1.text	
ltx/en_us_dedes/me.m11.d13:meMA.Ode3KathismaT.incipit	…
ltx/en_us_dedes/me.m11.d13:meMA.Ode3KathismaT.melody	@ltx/en_us_dedes/he.a.m8:heAU.TinSofianKaiLogon.name
ltx/en_us_dedes/me.m11.d13:meMA.Ode3KathismaT.mode	@ltx/en_us_dedes/miscellanea:misc.Mode8
ltx/en_us_dedes/me.m11.d13:meMA.Ode3KathismaT.text	
ltx/en_us_dedes/me.m11.d13:meMA.Ode4C11.greekmelody	@ltx/en_us_dedes/he.h.m8:heHE.EisakikoaKyrie.greekname
ltx/en_us_dedes/me.m11.d13:meMA.Ode4C11.incipit	@ltx/en_us_dedes/ho.ho23:hoCA.Ode41.incipit
ltx/en_us_dedes/me.m11.d13:meMA.Ode4C11.melody	@ltx/en_us_dedes/he.h.m8:heHE.EisakikoaKyrie.name
ltx/en_us_dedes/me.m11.d13:meMA.Ode4C11.mode	@ltx/en_us_dedes/miscellanea:misc.Mode8
ltx/en_us_dedes/me.m11.d13:meMA.Ode4C11.ode	@ltx/en_us_dedes/miscellanea:misc.Ode4
ltx/en_us_dedes/me.m11.d13:meMA.Ode4C11.text	@ltx/en_us_dedes/ho.ho23:hoCA.Ode41.text
ltx/en_us_dedes/me.m11.d13:meMA.Ode4C12.incipit	@ltx/en_us_dedes/ho.ho23:hoCA.Ode42.incipit
ltx/en_us_dedes/me.m11.d13:meMA.Ode4C12.melody	@ltx/en_us_dedes/he.h.m8:heHE.EisakikoaKyrie.name
ltx/en_us_dedes/me.m11.d13:meMA.Ode4C12.mode	@ltx/en_us_dedes/miscellanea:misc.Mode8
ltx/en_us_dedes/me.m11.d13:meMA.Ode4C12.ode	@ltx/en_us_dedes/miscellanea:misc.Ode4
ltx/en_us_dedes/me.m11.d13:meMA.Ode4C12.text	@ltx/en_us_dedes/ho.ho23:hoCA.Ode42.text
ltx/en_us_dedes/me.m11.d13:meMA.Ode4C13.incipit	@ltx/en_us_dedes/ho.ho23:hoCA.Ode43.incipit
ltx/en_us_dedes/me.m11.d13:meMA.Ode4C13.melody	@ltx/en_us_dedes/he.h.m8:heHE.EisakikoaKyrie.name
ltx/en_us_dedes/me.m11.d13:meMA.Ode4C13.mode	@ltx/en_us_dedes/miscellanea:misc.Mode8
ltx/en_us_dedes/me.m11.d13:meMA.Ode4C13.ode	@ltx/en_us_dedes/miscellanea:misc.Ode4
ltx/en_us_dedes/me.m11.d13:meMA.Ode4C13.text	@ltx/en_us_dedes/ho.ho23:hoCA.Ode43.text
ltx/en_us_dedes/me.m11.d13:meMA.Ode4C14.incipit	@ltx/en_us_dedes/ho.ho23:hoCA.Ode44.incipit
ltx/en_us_dedes/me.m11.d13:meMA.Ode4C14.melody	@ltx/en_us_dedes/he.h.m8:heHE.EisakikoaKyrie.name
ltx/en_us_dedes/me.m11.d13:meMA.Ode4C14.mode	@ltx/en_us_dedes/miscellanea:misc.Mode8
ltx/en_us_dedes/me.m11.d13:meMA.Ode4C14.ode	@ltx/en_us_dedes/miscellanea:misc.Ode4
ltx/en_us_dedes/me.m11.d13:meMA.Ode4C14.text	@ltx/en_us_dedes/ho.ho23:hoCA.Ode44.text
ltx/en_us_dedes/me.m11.d13:meMA.Ode4C15.incipit	…
ltx/en_us_dedes/me.m11.d13:meMA.Ode4C15.melody	@ltx/en_us_dedes/he.h.m8:heHE.EisakikoaKyrie.name
ltx/en_us_dedes/me.m11.d13:meMA.Ode4C15.mode	@ltx/en_us_dedes/miscellanea:misc.Mode8
ltx/en_us_dedes/me.m11.d13:meMA.Ode4C15.ode	@ltx/en_us_dedes/miscellanea:misc.Ode4
ltx/en_us_dedes/me.m11.d13:meMA.Ode4C15.text	
ltx/en_us_dedes/me.m11.d13:meMA.Ode4C1H.greekmelody	@ltx/en_us_dedes/he.h.m8:heHE.EisakikoaKyrie.greekname
ltx/en_us_dedes/me.m11.d13:meMA.Ode4C1H.incipit	@ltx/en_us_dedes/he.h.m8:heHE.EisakikoaKyrie.incipit
ltx/en_us_dedes/me.m11.d13:meMA.Ode4C1H.melody	@ltx/en_us_dedes/he.h.m8:heHE.EisakikoaKyrie.melody
ltx/en_us_dedes/me.m11.d13:meMA.Ode4C1H.mode	@ltx/en_us_dedes/miscellanea:misc.Mode8
ltx/en_us_dedes/me.m11.d13:meMA.Ode4C1H.ode	@ltx/en_us_dedes/miscellanea:misc.Ode4
ltx/en_us_dedes/me.m11.d13:meMA.Ode4C1H.text	@ltx/en_us_dedes/he.h.m8:heHE.EisakikoaKyrie.text
ltx/en_us_dedes/me.m11.d13:meMA.Ode4C21.greekmelody	@ltx/en_us_dedes/he.h.m8:heHE.SyMouIschys.greekname
ltx/en_us_dedes/me.m11.d13:meMA.Ode4C21.incipit	…
ltx/en_us_dedes/me.m11.d13:meMA.Ode4C21.melody	@ltx/en_us_dedes/he.h.m8:heHE.SyMouIschys.name
ltx/en_us_dedes/me.m11.d13:meMA.Ode4C21.mode	@ltx/en_us_dedes/miscellanea:misc.Mode8
ltx/en_us_dedes/me.m11.d13:meMA.Ode4C21.ode	@ltx/en_us_dedes/miscellanea:misc.Ode4
ltx/en_us_dedes/me.m11.d13:meMA.Ode4C21.text	
ltx/en_us_dedes/me.m11.d13:meMA.Ode4C22.incipit	…
ltx/en_us_dedes/me.m11.d13:meMA.Ode4C22.melody	@ltx/en_us_dedes/he.h.m8:heHE.SyMouIschys.name
ltx/en_us_dedes/me.m11.d13:meMA.Ode4C22.mode	@ltx/en_us_dedes/miscellanea:misc.Mode8
ltx/en_us_dedes/me.m11.d13:meMA.Ode4C22.ode	@ltx/en_us_dedes/miscellanea:misc.Ode4
ltx/en_us_dedes/me.m11.d13:meMA.Ode4C22.text	
ltx/en_us_dedes/me.m11.d13:meMA.Ode4C23.incipit	…
ltx/en_us_dedes/me.m11.d13:meMA.Ode4C23.melody	@ltx/en_us_dedes/he.h.m8:heHE.SyMouIschys.name
ltx/en_us_dedes/me.m11.d13:meMA.Ode4C23.mode	@ltx/en_us_dedes/miscellanea:misc.Mode8
ltx/en_us_dedes/me.m11.d13:meMA.Ode4C23.ode	@ltx/en_us_dedes/miscellanea:misc.Ode4
ltx/en_us_dedes/me.m11.d13:meMA.Ode4C23.text	
ltx/en_us_dedes/me.m11.d13:meMA.Ode4C24.incipit	…
ltx/en_us_dedes/me.m11.d13:meMA.Ode4C24.melody	@ltx/en_us_dedes/he.h.m8:heHE.SyMouIschys.name
ltx/en_us_dedes/me.m11.d13:meMA.Ode4C24.mode	@ltx/en_us_dedes/miscellanea:misc.Mode8
ltx/en_us_dedes/me.m11.d13:meMA.Ode4C24.ode	@ltx/en_us_dedes/miscellanea:misc.Ode4
ltx/en_us_dedes/me.m11.d13:meMA.Ode4C24.text	
ltx/en_us_dedes/me.m11.d13:meMA.Ode4C2T.incipit	…
ltx/en_us_dedes/me.m11.d13:meMA.Ode4C2T.melody	@ltx/en_us_dedes/he.h.m8:heHE.SyMouIschys.name
ltx/en_us_dedes/me.m11.d13:meMA.Ode4C2T.mode	@ltx/en_us_dedes/miscellanea:misc.Mode8
ltx/en_us_dedes/me.m11.d13:meMA.Ode4C2T.ode	@ltx/en_us_dedes/miscellanea:misc.Ode4
ltx/en_us_dedes/me.m11.d13:meMA.Ode4C2T.text	
ltx/en_us_dedes/me.m11.d13:meMA.Ode5C11.greekmelody	@ltx/en_us_dedes/he.h.m8:heHE.FotisonImas.greekname
ltx/en_us_dedes/me.m11.d13:meMA.Ode5C11.incipit	@ltx/en_us_dedes/ho.ho23:hoCA.Ode51.incipit
ltx/en_us_dedes/me.m11.d13:meMA.Ode5C11.melody	@ltx/en_us_dedes/he.h.m8:heHE.FotisonImas.name
ltx/en_us_dedes/me.m11.d13:meMA.Ode5C11.mode	@ltx/en_us_dedes/miscellanea:misc.Mode8
ltx/en_us_dedes/me.m11.d13:meMA.Ode5C11.ode	@ltx/en_us_dedes/miscellanea:misc.Ode5
ltx/en_us_dedes/me.m11.d13:meMA.Ode5C11.text	@ltx/en_us_dedes/ho.ho23:hoCA.Ode51.text
ltx/en_us_dedes/me.m11.d13:meMA.Ode5C12.incipit	@ltx/en_us_dedes/ho.ho23:hoCA.Ode52.incipit
ltx/en_us_dedes/me.m11.d13:meMA.Ode5C12.melody	@ltx/en_us_dedes/he.h.m8:heHE.FotisonImas.name
ltx/en_us_dedes/me.m11.d13:meMA.Ode5C12.mode	@ltx/en_us_dedes/miscellanea:misc.Mode8
ltx/en_us_dedes/me.m11.d13:meMA.Ode5C12.ode	@ltx/en_us_dedes/miscellanea:misc.Ode5
ltx/en_us_dedes/me.m11.d13:meMA.Ode5C12.text	@ltx/en_us_dedes/ho.ho23:hoCA.Ode52.text
ltx/en_us_dedes/me.m11.d13:meMA.Ode5C13.incipit	@ltx/en_us_dedes/ho.ho23:hoCA.Ode53.incipit
ltx/en_us_dedes/me.m11.d13:meMA.Ode5C13.melody	@ltx/en_us_dedes/he.h.m8:heHE.FotisonImas.name
ltx/en_us_dedes/me.m11.d13:meMA.Ode5C13.mode	@ltx/en_us_dedes/miscellanea:misc.Mode8
ltx/en_us_dedes/me.m11.d13:meMA.Ode5C13.ode	@ltx/en_us_dedes/miscellanea:misc.Ode5
ltx/en_us_dedes/me.m11.d13:meMA.Ode5C13.text	@ltx/en_us_dedes/ho.ho23:hoCA.Ode53.text
ltx/en_us_dedes/me.m11.d13:meMA.Ode5C14.incipit	@ltx/en_us_dedes/ho.ho23:hoCA.Ode54.incipit
ltx/en_us_dedes/me.m11.d13:meMA.Ode5C14.melody	@ltx/en_us_dedes/he.h.m8:heHE.FotisonImas.name
ltx/en_us_dedes/me.m11.d13:meMA.Ode5C14.mode	@ltx/en_us_dedes/miscellanea:misc.Mode8
ltx/en_us_dedes/me.m11.d13:meMA.Ode5C14.ode	@ltx/en_us_dedes/miscellanea:misc.Ode5
ltx/en_us_dedes/me.m11.d13:meMA.Ode5C14.text	@ltx/en_us_dedes/ho.ho23:hoCA.Ode54.text
ltx/en_us_dedes/me.m11.d13:meMA.Ode5C1H.greekmelody	@ltx/en_us_dedes/he.h.m8:heHE.FotisonImas.greekname
ltx/en_us_dedes/me.m11.d13:meMA.Ode5C1H.incipit	@ltx/en_us_dedes/he.h.m8:heHE.FotisonImas.incipit
ltx/en_us_dedes/me.m11.d13:meMA.Ode5C1H.melody	@ltx/en_us_dedes/he.h.m8:heHE.FotisonImas.melody
ltx/en_us_dedes/me.m11.d13:meMA.Ode5C1H.mode	@ltx/en_us_dedes/miscellanea:misc.Mode8
ltx/en_us_dedes/me.m11.d13:meMA.Ode5C1H.ode	@ltx/en_us_dedes/miscellanea:misc.Ode5
ltx/en_us_dedes/me.m11.d13:meMA.Ode5C1H.text	@ltx/en_us_dedes/he.h.m8:heHE.FotisonImas.text
ltx/en_us_dedes/me.m11.d13:meMA.Ode5C21.greekmelody	@ltx/en_us_dedes/he.h.m8:heHE.InaTiMeAposo.greekname
ltx/en_us_dedes/me.m11.d13:meMA.Ode5C21.incipit	…
ltx/en_us_dedes/me.m11.d13:meMA.Ode5C21.melody	@ltx/en_us_dedes/he.h.m8:heHE.InaTiMeAposo.name
ltx/en_us_dedes/me.m11.d13:meMA.Ode5C21.mode	@ltx/en_us_dedes/miscellanea:misc.Mode8
ltx/en_us_dedes/me.m11.d13:meMA.Ode5C21.ode	@ltx/en_us_dedes/miscellanea:misc.Ode5
ltx/en_us_dedes/me.m11.d13:meMA.Ode5C21.text	
ltx/en_us_dedes/me.m11.d13:meMA.Ode5C22.incipit	…
ltx/en_us_dedes/me.m11.d13:meMA.Ode5C22.melody	@ltx/en_us_dedes/he.h.m8:heHE.InaTiMeAposo.name
ltx/en_us_dedes/me.m11.d13:meMA.Ode5C22.mode	@ltx/en_us_dedes/miscellanea:misc.Mode8
ltx/en_us_dedes/me.m11.d13:meMA.Ode5C22.ode	@ltx/en_us_dedes/miscellanea:misc.Ode5
ltx/en_us_dedes/me.m11.d13:meMA.Ode5C22.text	
ltx/en_us_dedes/me.m11.d13:meMA.Ode5C23.incipit	…
ltx/en_us_dedes/me.m11.d13:meMA.Ode5C23.melody	@ltx/en_us_dedes/he.h.m8:heHE.InaTiMeAposo.name
ltx/en_us_dedes/me.m11.d13:meMA.Ode5C23.mode	@ltx/en_us_dedes/miscellanea:misc.Mode8
ltx/en_us_dedes/me.m11.d13:meMA.Ode5C23.ode	@ltx/en_us_dedes/miscellanea:misc.Ode5
ltx/en_us_dedes/me.m11.d13:meMA.Ode5C23.text	
ltx/en_us_dedes/me.m11.d13:meMA.Ode5C2T.incipit	…
ltx/en_us_dedes/me.m11.d13:meMA.Ode5C2T.melody	@ltx/en_us_dedes/he.h.m8:heHE.InaTiMeAposo.name
ltx/en_us_dedes/me.m11.d13:meMA.Ode5C2T.mode	@ltx/en_us_dedes/miscellanea:misc.Mode8
ltx/en_us_dedes/me.m11.d13:meMA.Ode5C2T.ode	@ltx/en_us_dedes/miscellanea:misc.Ode5
ltx/en_us_dedes/me.m11.d13:meMA.Ode5C2T.text	
ltx/en_us_dedes/me.m11.d13:meMA.Ode6C11.greekmelody	@ltx/en_us_dedes/he.h.m8:heHE.TinDeisinEkcheo.greekname
ltx/en_us_dedes/me.m11.d13:meMA.Ode6C11.incipit	@ltx/en_us_dedes/ho.ho23:hoCA.Ode61.incipit
ltx/en_us_dedes/me.m11.d13:meMA.Ode6C11.melody	@ltx/en_us_dedes/he.h.m8:heHE.TinDeisinEkcheo.name
ltx/en_us_dedes/me.m11.d13:meMA.Ode6C11.mode	@ltx/en_us_dedes/miscellanea:misc.Mode8
ltx/en_us_dedes/me.m11.d13:meMA.Ode6C11.ode	@ltx/en_us_dedes/miscellanea:misc.Ode6
ltx/en_us_dedes/me.m11.d13:meMA.Ode6C11.text	@ltx/en_us_dedes/ho.ho23:hoCA.Ode61.text
ltx/en_us_dedes/me.m11.d13:meMA.Ode6C12.incipit	@ltx/en_us_dedes/ho.ho23:hoCA.Ode62.incipit
ltx/en_us_dedes/me.m11.d13:meMA.Ode6C12.melody	@ltx/en_us_dedes/he.h.m8:heHE.TinDeisinEkcheo.name
ltx/en_us_dedes/me.m11.d13:meMA.Ode6C12.mode	@ltx/en_us_dedes/miscellanea:misc.Mode8
ltx/en_us_dedes/me.m11.d13:meMA.Ode6C12.ode	@ltx/en_us_dedes/miscellanea:misc.Ode6
ltx/en_us_dedes/me.m11.d13:meMA.Ode6C12.text	@ltx/en_us_dedes/ho.ho23:hoCA.Ode62.text
ltx/en_us_dedes/me.m11.d13:meMA.Ode6C13.incipit	@ltx/en_us_dedes/ho.ho23:hoCA.Ode63.incipit
ltx/en_us_dedes/me.m11.d13:meMA.Ode6C13.melody	@ltx/en_us_dedes/he.h.m8:heHE.TinDeisinEkcheo.name
ltx/en_us_dedes/me.m11.d13:meMA.Ode6C13.mode	@ltx/en_us_dedes/miscellanea:misc.Mode8
ltx/en_us_dedes/me.m11.d13:meMA.Ode6C13.ode	@ltx/en_us_dedes/miscellanea:misc.Ode6
ltx/en_us_dedes/me.m11.d13:meMA.Ode6C13.text	@ltx/en_us_dedes/ho.ho23:hoCA.Ode63.text
ltx/en_us_dedes/me.m11.d13:meMA.Ode6C14.incipit	@ltx/en_us_dedes/ho.ho23:hoCA.Ode64.incipit
ltx/en_us_dedes/me.m11.d13:meMA.Ode6C14.melody	@ltx/en_us_dedes/he.h.m8:heHE.TinDeisinEkcheo.name
ltx/en_us_dedes/me.m11.d13:meMA.Ode6C14.mode	@ltx/en_us_dedes/miscellanea:misc.Mode8
ltx/en_us_dedes/me.m11.d13:meMA.Ode6C14.ode	@ltx/en_us_dedes/miscellanea:misc.Ode6
ltx/en_us_dedes/me.m11.d13:meMA.Ode6C14.text	@ltx/en_us_dedes/ho.ho23:hoCA.Ode64.text
ltx/en_us_dedes/me.m11.d13:meMA.Ode6C1H.greekmelody	@ltx/en_us_dedes/he.h.m8:heHE.TinDeisinEkcheo.greekname
ltx/en_us_dedes/me.m11.d13:meMA.Ode6C1H.incipit	@ltx/en_us_dedes/he.h.m8:heHE.TinDeisinEkcheo.incipit
ltx/en_us_dedes/me.m11.d13:meMA.Ode6C1H.melody	@ltx/en_us_dedes/he.h.m8:heHE.TinDeisinEkcheo.melody
ltx/en_us_dedes/me.m11.d13:meMA.Ode6C1H.mode	@ltx/en_us_dedes/miscellanea:misc.Mode8
ltx/en_us_dedes/me.m11.d13:meMA.Ode6C1H.ode	@ltx/en_us_dedes/miscellanea:misc.Ode6
ltx/en_us_dedes/me.m11.d13:meMA.Ode6C1H.text	@ltx/en_us_dedes/he.h.m8:heHE.TinDeisinEkcheo.text
ltx/en_us_dedes/me.m11.d13:meMA.Ode6C21.greekmelody	@ltx/en_us_dedes/he.h.m8:heHE.IlasthitiMoiSotir.greekname
ltx/en_us_dedes/me.m11.d13:meMA.Ode6C21.incipit	…
ltx/en_us_dedes/me.m11.d13:meMA.Ode6C21.melody	@ltx/en_us_dedes/he.h.m8:heHE.IlasthitiMoiSotir.name
ltx/en_us_dedes/me.m11.d13:meMA.Ode6C21.mode	@ltx/en_us_dedes/miscellanea:misc.Mode8
ltx/en_us_dedes/me.m11.d13:meMA.Ode6C21.ode	@ltx/en_us_dedes/miscellanea:misc.Ode6
ltx/en_us_dedes/me.m11.d13:meMA.Ode6C21.text	
ltx/en_us_dedes/me.m11.d13:meMA.Ode6C22.incipit	…
ltx/en_us_dedes/me.m11.d13:meMA.Ode6C22.melody	@ltx/en_us_dedes/he.h.m8:heHE.IlasthitiMoiSotir.name
ltx/en_us_dedes/me.m11.d13:meMA.Ode6C22.mode	@ltx/en_us_dedes/miscellanea:misc.Mode8
ltx/en_us_dedes/me.m11.d13:meMA.Ode6C22.ode	@ltx/en_us_dedes/miscellanea:misc.Ode6
ltx/en_us_dedes/me.m11.d13:meMA.Ode6C22.text	
ltx/en_us_dedes/me.m11.d13:meMA.Ode6C23.incipit	…
ltx/en_us_dedes/me.m11.d13:meMA.Ode6C23.melody	@ltx/en_us_dedes/he.h.m8:heHE.IlasthitiMoiSotir.name
ltx/en_us_dedes/me.m11.d13:meMA.Ode6C23.mode	@ltx/en_us_dedes/miscellanea:misc.Mode8
ltx/en_us_dedes/me.m11.d13:meMA.Ode6C23.ode	@ltx/en_us_dedes/miscellanea:misc.Ode6
ltx/en_us_dedes/me.m11.d13:meMA.Ode6C23.text	
ltx/en_us_dedes/me.m11.d13:meMA.Ode6C2T.incipit	…
ltx/en_us_dedes/me.m11.d13:meMA.Ode6C2T.melody	@ltx/en_us_dedes/he.h.m8:heHE.IlasthitiMoiSotir.name
ltx/en_us_dedes/me.m11.d13:meMA.Ode6C2T.mode	@ltx/en_us_dedes/miscellanea:misc.Mode8
ltx/en_us_dedes/me.m11.d13:meMA.Ode6C2T.ode	@ltx/en_us_dedes/miscellanea:misc.Ode6
ltx/en_us_dedes/me.m11.d13:meMA.Ode6C2T.text	
ltx/en_us_dedes/me.m11.d13:meMA.Ode7C11.greekmelody	@ltx/en_us_dedes/he.h.m8:heHE.OiEkTisIoudaias.greekname
ltx/en_us_dedes/me.m11.d13:meMA.Ode7C11.incipit	@ltx/en_us_dedes/ho.ho23:hoCA.Ode71.incipit
ltx/en_us_dedes/me.m11.d13:meMA.Ode7C11.melody	@ltx/en_us_dedes/he.h.m8:heHE.OiEkTisIoudaias.name
ltx/en_us_dedes/me.m11.d13:meMA.Ode7C11.mode	@ltx/en_us_dedes/miscellanea:misc.Mode8
ltx/en_us_dedes/me.m11.d13:meMA.Ode7C11.ode	@ltx/en_us_dedes/miscellanea:misc.Ode7
ltx/en_us_dedes/me.m11.d13:meMA.Ode7C11.text	@ltx/en_us_dedes/ho.ho23:hoCA.Ode71.text
ltx/en_us_dedes/me.m11.d13:meMA.Ode7C12.incipit	@ltx/en_us_dedes/ho.ho23:hoCA.Ode73.incipit
ltx/en_us_dedes/me.m11.d13:meMA.Ode7C12.melody	@ltx/en_us_dedes/he.h.m8:heHE.OiEkTisIoudaias.name
ltx/en_us_dedes/me.m11.d13:meMA.Ode7C12.mode	@ltx/en_us_dedes/miscellanea:misc.Mode8
ltx/en_us_dedes/me.m11.d13:meMA.Ode7C12.ode	@ltx/en_us_dedes/miscellanea:misc.Ode7
ltx/en_us_dedes/me.m11.d13:meMA.Ode7C12.text	@ltx/en_us_dedes/ho.ho23:hoCA.Ode73.text
ltx/en_us_dedes/me.m11.d13:meMA.Ode7C13.incipit	@ltx/en_us_dedes/ho.ho23:hoCA.Ode72.incipit
ltx/en_us_dedes/me.m11.d13:meMA.Ode7C13.melody	@ltx/en_us_dedes/he.h.m8:heHE.OiEkTisIoudaias.name
ltx/en_us_dedes/me.m11.d13:meMA.Ode7C13.mode	@ltx/en_us_dedes/miscellanea:misc.Mode8
ltx/en_us_dedes/me.m11.d13:meMA.Ode7C13.ode	@ltx/en_us_dedes/miscellanea:misc.Ode7
ltx/en_us_dedes/me.m11.d13:meMA.Ode7C13.text	@ltx/en_us_dedes/ho.ho23:hoCA.Ode72.text
ltx/en_us_dedes/me.m11.d13:meMA.Ode7C14.incipit	@ltx/en_us_dedes/ho.ho23:hoCA.Ode74.incipit
ltx/en_us_dedes/me.m11.d13:meMA.Ode7C14.melody	@ltx/en_us_dedes/he.h.m8:heHE.OiEkTisIoudaias.name
ltx/en_us_dedes/me.m11.d13:meMA.Ode7C14.mode	@ltx/en_us_dedes/miscellanea:misc.Mode8
ltx/en_us_dedes/me.m11.d13:meMA.Ode7C14.ode	@ltx/en_us_dedes/miscellanea:misc.Ode7
ltx/en_us_dedes/me.m11.d13:meMA.Ode7C14.text	@ltx/en_us_dedes/ho.ho23:hoCA.Ode74.text
ltx/en_us_dedes/me.m11.d13:meMA.Ode7C1H.greekmelody	@ltx/en_us_dedes/he.h.m8:heHE.OiEkTisIoudaias.greekname
ltx/en_us_dedes/me.m11.d13:meMA.Ode7C1H.incipit	@ltx/en_us_dedes/he.h.m8:heHE.OiEkTisIoudaias.incipit
ltx/en_us_dedes/me.m11.d13:meMA.Ode7C1H.melody	@ltx/en_us_dedes/he.h.m8:heHE.OiEkTisIoudaias.melody
ltx/en_us_dedes/me.m11.d13:meMA.Ode7C1H.mode	@ltx/en_us_dedes/miscellanea:misc.Mode8
ltx/en_us_dedes/me.m11.d13:meMA.Ode7C1H.ode	@ltx/en_us_dedes/miscellanea:misc.Ode7
ltx/en_us_dedes/me.m11.d13:meMA.Ode7C1H.text	@ltx/en_us_dedes/he.h.m8:heHE.OiEkTisIoudaias.text
ltx/en_us_dedes/me.m11.d13:meMA.Ode7C21.greekmelody	@ltx/en_us_dedes/he.h.m8:heHE.TheouSynkatavasin.greekname
ltx/en_us_dedes/me.m11.d13:meMA.Ode7C21.incipit	…
ltx/en_us_dedes/me.m11.d13:meMA.Ode7C21.melody	@ltx/en_us_dedes/he.h.m8:heHE.TheouSynkatavasin.name
ltx/en_us_dedes/me.m11.d13:meMA.Ode7C21.mode	@ltx/en_us_dedes/miscellanea:misc.Mode8
ltx/en_us_dedes/me.m11.d13:meMA.Ode7C21.ode	@ltx/en_us_dedes/miscellanea:misc.Ode7
ltx/en_us_dedes/me.m11.d13:meMA.Ode7C21.text	
ltx/en_us_dedes/me.m11.d13:meMA.Ode7C22.incipit	…
ltx/en_us_dedes/me.m11.d13:meMA.Ode7C22.melody	@ltx/en_us_dedes/he.h.m8:heHE.TheouSynkatavasin.name
ltx/en_us_dedes/me.m11.d13:meMA.Ode7C22.mode	@ltx/en_us_dedes/miscellanea:misc.Mode8
ltx/en_us_dedes/me.m11.d13:meMA.Ode7C22.ode	@ltx/en_us_dedes/miscellanea:misc.Ode7
ltx/en_us_dedes/me.m11.d13:meMA.Ode7C22.text	
ltx/en_us_dedes/me.m11.d13:meMA.Ode7C23.incipit	…
ltx/en_us_dedes/me.m11.d13:meMA.Ode7C23.melody	@ltx/en_us_dedes/he.h.m8:heHE.TheouSynkatavasin.name
ltx/en_us_dedes/me.m11.d13:meMA.Ode7C23.mode	@ltx/en_us_dedes/miscellanea:misc.Mode8
ltx/en_us_dedes/me.m11.d13:meMA.Ode7C23.ode	@ltx/en_us_dedes/miscellanea:misc.Ode7
ltx/en_us_dedes/me.m11.d13:meMA.Ode7C23.text	
ltx/en_us_dedes/me.m11.d13:meMA.Ode7C2T.incipit	…
ltx/en_us_dedes/me.m11.d13:meMA.Ode7C2T.melody	@ltx/en_us_dedes/he.h.m8:heHE.TheouSynkatavasin.name
ltx/en_us_dedes/me.m11.d13:meMA.Ode7C2T.mode	@ltx/en_us_dedes/miscellanea:misc.Mode8
ltx/en_us_dedes/me.m11.d13:meMA.Ode7C2T.ode	@ltx/en_us_dedes/miscellanea:misc.Ode7
ltx/en_us_dedes/me.m11.d13:meMA.Ode7C2T.text	
ltx/en_us_dedes/me.m11.d13:meMA.Ode8C11.greekmelody	@ltx/en_us_dedes/he.h.m8:heHE.TonVasileaTonOuranon.greekname
ltx/en_us_dedes/me.m11.d13:meMA.Ode8C11.incipit	@ltx/en_us_dedes/ho.ho23:hoCA.Ode81.incipit
ltx/en_us_dedes/me.m11.d13:meMA.Ode8C11.melody	@ltx/en_us_dedes/he.h.m8:heHE.TonVasileaTonOuranon.name
ltx/en_us_dedes/me.m11.d13:meMA.Ode8C11.mode	@ltx/en_us_dedes/miscellanea:misc.Mode8
ltx/en_us_dedes/me.m11.d13:meMA.Ode8C11.ode	@ltx/en_us_dedes/miscellanea:misc.Ode8
ltx/en_us_dedes/me.m11.d13:meMA.Ode8C11.text	@ltx/en_us_dedes/ho.ho23:hoCA.Ode81.text
ltx/en_us_dedes/me.m11.d13:meMA.Ode8C12.incipit	@ltx/en_us_dedes/ho.ho23:hoCA.Ode82.incipit
ltx/en_us_dedes/me.m11.d13:meMA.Ode8C12.melody	@ltx/en_us_dedes/he.h.m8:heHE.TonVasileaTonOuranon.name
ltx/en_us_dedes/me.m11.d13:meMA.Ode8C12.mode	@ltx/en_us_dedes/miscellanea:misc.Mode8
ltx/en_us_dedes/me.m11.d13:meMA.Ode8C12.ode	@ltx/en_us_dedes/miscellanea:misc.Ode8
ltx/en_us_dedes/me.m11.d13:meMA.Ode8C12.text	@ltx/en_us_dedes/ho.ho23:hoCA.Ode82.text
ltx/en_us_dedes/me.m11.d13:meMA.Ode8C13.incipit	@ltx/en_us_dedes/ho.ho23:hoCA.Ode83.incipit
ltx/en_us_dedes/me.m11.d13:meMA.Ode8C13.melody	@ltx/en_us_dedes/he.h.m8:heHE.TonVasileaTonOuranon.name
ltx/en_us_dedes/me.m11.d13:meMA.Ode8C13.mode	@ltx/en_us_dedes/miscellanea:misc.Mode8
ltx/en_us_dedes/me.m11.d13:meMA.Ode8C13.ode	@ltx/en_us_dedes/miscellanea:misc.Ode8
ltx/en_us_dedes/me.m11.d13:meMA.Ode8C13.text	@ltx/en_us_dedes/ho.ho23:hoCA.Ode83.text
ltx/en_us_dedes/me.m11.d13:meMA.Ode8C14.incipit	@ltx/en_us_dedes/ho.ho23:hoCA.Ode84.incipit
ltx/en_us_dedes/me.m11.d13:meMA.Ode8C14.melody	@ltx/en_us_dedes/he.h.m8:heHE.TonVasileaTonOuranon.name
ltx/en_us_dedes/me.m11.d13:meMA.Ode8C14.mode	@ltx/en_us_dedes/miscellanea:misc.Mode8
ltx/en_us_dedes/me.m11.d13:meMA.Ode8C14.ode	@ltx/en_us_dedes/miscellanea:misc.Ode8
ltx/en_us_dedes/me.m11.d13:meMA.Ode8C14.text	@ltx/en_us_dedes/ho.ho23:hoCA.Ode84.text
ltx/en_us_dedes/me.m11.d13:meMA.Ode8C1H.greekmelody	@ltx/en_us_dedes/he.h.m8:heHE.TonVasileaTonOuranon.greekname
ltx/en_us_dedes/me.m11.d13:meMA.Ode8C1H.incipit	@ltx/en_us_dedes/he.h.m8:heHE.TonVasileaTonOuranon.incipit
ltx/en_us_dedes/me.m11.d13:meMA.Ode8C1H.melody	@ltx/en_us_dedes/he.h.m8:heHE.TonVasileaTonOuranon.melody
ltx/en_us_dedes/me.m11.d13:meMA.Ode8C1H.mode	@ltx/en_us_dedes/miscellanea:misc.Mode8
ltx/en_us_dedes/me.m11.d13:meMA.Ode8C1H.ode	@ltx/en_us_dedes/miscellanea:misc.Ode8
ltx/en_us_dedes/me.m11.d13:meMA.Ode8C1H.text	@ltx/en_us_dedes/he.h.m8:heHE.TonVasileaTonOuranon.text
ltx/en_us_dedes/me.m11.d13:meMA.Ode8C21.greekmelody	@ltx/en_us_dedes/he.h.m8:heHE.EptaplasiosKaminon.greekname
ltx/en_us_dedes/me.m11.d13:meMA.Ode8C21.incipit	…
ltx/en_us_dedes/me.m11.d13:meMA.Ode8C21.melody	@ltx/en_us_dedes/he.h.m8:heHE.EptaplasiosKaminon.name
ltx/en_us_dedes/me.m11.d13:meMA.Ode8C21.mode	@ltx/en_us_dedes/miscellanea:misc.Mode8
ltx/en_us_dedes/me.m11.d13:meMA.Ode8C21.ode	@ltx/en_us_dedes/miscellanea:misc.Ode8
ltx/en_us_dedes/me.m11.d13:meMA.Ode8C21.text	
ltx/en_us_dedes/me.m11.d13:meMA.Ode8C22.incipit	…
ltx/en_us_dedes/me.m11.d13:meMA.Ode8C22.melody	@ltx/en_us_dedes/he.h.m8:heHE.EptaplasiosKaminon.name
ltx/en_us_dedes/me.m11.d13:meMA.Ode8C22.mode	@ltx/en_us_dedes/miscellanea:misc.Mode8
ltx/en_us_dedes/me.m11.d13:meMA.Ode8C22.ode	@ltx/en_us_dedes/miscellanea:misc.Ode8
ltx/en_us_dedes/me.m11.d13:meMA.Ode8C22.text	
ltx/en_us_dedes/me.m11.d13:meMA.Ode8C23.incipit	…
ltx/en_us_dedes/me.m11.d13:meMA.Ode8C23.melody	@ltx/en_us_dedes/he.h.m8:heHE.EptaplasiosKaminon.name
ltx/en_us_dedes/me.m11.d13:meMA.Ode8C23.mode	@ltx/en_us_dedes/miscellanea:misc.Mode8
ltx/en_us_dedes/me.m11.d13:meMA.Ode8C23.ode	@ltx/en_us_dedes/miscellanea:misc.Ode8
ltx/en_us_dedes/me.m11.d13:meMA.Ode8C23.text	
ltx/en_us_dedes/me.m11.d13:meMA.Ode8C2T.incipit	…
ltx/en_us_dedes/me.m11.d13:meMA.Ode8C2T.melody	@ltx/en_us_dedes/he.h.m8:heHE.EptaplasiosKaminon.name
ltx/en_us_dedes/me.m11.d13:meMA.Ode8C2T.mode	@ltx/en_us_dedes/miscellanea:misc.Mode8
ltx/en_us_dedes/me.m11.d13:meMA.Ode8C2T.ode	@ltx/en_us_dedes/miscellanea:misc.Ode8
ltx/en_us_dedes/me.m11.d13:meMA.Ode8C2T.text	
ltx/en_us_dedes/me.m11.d13:meMA.Ode9C11.greekmelody	@ltx/en_us_dedes/he.h.m8:heHE.KyriosTheotokon.greekname
ltx/en_us_dedes/me.m11.d13:meMA.Ode9C11.incipit	@ltx/en_us_dedes/ho.ho23:hoCA.Ode91.incipit
ltx/en_us_dedes/me.m11.d13:meMA.Ode9C11.melody	@ltx/en_us_dedes/he.h.m8:heHE.KyriosTheotokon.name
ltx/en_us_dedes/me.m11.d13:meMA.Ode9C11.mode	@ltx/en_us_dedes/miscellanea:misc.Mode8
ltx/en_us_dedes/me.m11.d13:meMA.Ode9C11.ode	@ltx/en_us_dedes/miscellanea:misc.Ode9
ltx/en_us_dedes/me.m11.d13:meMA.Ode9C11.text	@ltx/en_us_dedes/ho.ho23:hoCA.Ode91.text
ltx/en_us_dedes/me.m11.d13:meMA.Ode9C12.incipit	@ltx/en_us_dedes/ho.ho23:hoCA.Ode92.incipit
ltx/en_us_dedes/me.m11.d13:meMA.Ode9C12.melody	@ltx/en_us_dedes/he.h.m8:heHE.KyriosTheotokon.name
ltx/en_us_dedes/me.m11.d13:meMA.Ode9C12.mode	@ltx/en_us_dedes/miscellanea:misc.Mode8
ltx/en_us_dedes/me.m11.d13:meMA.Ode9C12.ode	@ltx/en_us_dedes/miscellanea:misc.Ode9
ltx/en_us_dedes/me.m11.d13:meMA.Ode9C12.text	@ltx/en_us_dedes/ho.ho23:hoCA.Ode92.text
ltx/en_us_dedes/me.m11.d13:meMA.Ode9C13.incipit	@ltx/en_us_dedes/ho.ho23:hoCA.Ode93.incipit
ltx/en_us_dedes/me.m11.d13:meMA.Ode9C13.melody	@ltx/en_us_dedes/he.h.m8:heHE.KyriosTheotokon.name
ltx/en_us_dedes/me.m11.d13:meMA.Ode9C13.mode	@ltx/en_us_dedes/miscellanea:misc.Mode8
ltx/en_us_dedes/me.m11.d13:meMA.Ode9C13.ode	@ltx/en_us_dedes/miscellanea:misc.Ode9
ltx/en_us_dedes/me.m11.d13:meMA.Ode9C13.text	@ltx/en_us_dedes/ho.ho23:hoCA.Ode93.text
ltx/en_us_dedes/me.m11.d13:meMA.Ode9C14.incipit	@ltx/en_us_dedes/ho.ho23:hoCA.Ode94.incipit
ltx/en_us_dedes/me.m11.d13:meMA.Ode9C14.melody	@ltx/en_us_dedes/he.h.m8:heHE.KyriosTheotokon.name
ltx/en_us_dedes/me.m11.d13:meMA.Ode9C14.mode	@ltx/en_us_dedes/miscellanea:misc.Mode8
ltx/en_us_dedes/me.m11.d13:meMA.Ode9C14.ode	@ltx/en_us_dedes/miscellanea:misc.Ode9
ltx/en_us_dedes/me.m11.d13:meMA.Ode9C14.text	@ltx/en_us_dedes/ho.ho23:hoCA.Ode94.text
ltx/en_us_dedes/me.m11.d13:meMA.Ode9C15.incipit	@ltx/en_us_dedes/ho.ho23:hoCA.Ode95.incipit
ltx/en_us_dedes/me.m11.d13:meMA.Ode9C15.melody	@ltx/en_us_dedes/he.h.m8:heHE.KyriosTheotokon.name
ltx/en_us_dedes/me.m11.d13:meMA.Ode9C15.mode	@ltx/en_us_dedes/miscellanea:misc.Mode8
ltx/en_us_dedes/me.m11.d13:meMA.Ode9C15.ode	@ltx/en_us_dedes/miscellanea:misc.Ode9
ltx/en_us_dedes/me.m11.d13:meMA.Ode9C15.text	@ltx/en_us_dedes/ho.ho23:hoCA.Ode95.text
ltx/en_us_dedes/me.m11.d13:meMA.Ode9C1H.greekmelody	@ltx/en_us_dedes/he.h.m8:heHE.KyriosTheotokon.greekname
ltx/en_us_dedes/me.m11.d13:meMA.Ode9C1H.incipit	@ltx/en_us_dedes/he.h.m8:heHE.KyriosTheotokon.incipit
ltx/en_us_dedes/me.m11.d13:meMA.Ode9C1H.melody	@ltx/en_us_dedes/he.h.m8:heHE.KyriosTheotokon.melody
ltx/en_us_dedes/me.m11.d13:meMA.Ode9C1H.mode	@ltx/en_us_dedes/miscellanea:misc.Mode8
ltx/en_us_dedes/me.m11.d13:meMA.Ode9C1H.ode	@ltx/en_us_dedes/miscellanea:misc.Ode9
ltx/en_us_dedes/me.m11.d13:meMA.Ode9C1H.text	@ltx/en_us_dedes/he.h.m8:heHE.KyriosTheotokon.text
ltx/en_us_dedes/me.m11.d13:meMA.Ode9C21.greekmelody	@ltx/en_us_dedes/he.h.m8:heHE.ExestiEpiTouto.greekname
ltx/en_us_dedes/me.m11.d13:meMA.Ode9C21.incipit	…
ltx/en_us_dedes/me.m11.d13:meMA.Ode9C21.melody	@ltx/en_us_dedes/he.h.m8:heHE.ExestiEpiTouto.name
ltx/en_us_dedes/me.m11.d13:meMA.Ode9C21.mode	@ltx/en_us_dedes/miscellanea:misc.Mode8
ltx/en_us_dedes/me.m11.d13:meMA.Ode9C21.ode	@ltx/en_us_dedes/miscellanea:misc.Ode9
ltx/en_us_dedes/me.m11.d13:meMA.Ode9C21.text	
ltx/en_us_dedes/me.m11.d13:meMA.Ode9C22.incipit	…
ltx/en_us_dedes/me.m11.d13:meMA.Ode9C22.melody	@ltx/en_us_dedes/he.h.m8:heHE.ExestiEpiTouto.name
ltx/en_us_dedes/me.m11.d13:meMA.Ode9C22.mode	@ltx/en_us_dedes/miscellanea:misc.Mode8
ltx/en_us_dedes/me.m11.d13:meMA.Ode9C22.ode	@ltx/en_us_dedes/miscellanea:misc.Ode9
ltx/en_us_dedes/me.m11.d13:meMA.Ode9C22.text	
ltx/en_us_dedes/me.m11.d13:meMA.Ode9C23.incipit	…
ltx/en_us_dedes/me.m11.d13:meMA.Ode9C23.melody	@ltx/en_us_dedes/he.h.m8:heHE.ExestiEpiTouto.name
ltx/en_us_dedes/me.m11.d13:meMA.Ode9C23.mode	@ltx/en_us_dedes/miscellanea:misc.Mode8
ltx/en_us_dedes/me.m11.d13:meMA.Ode9C23.ode	@ltx/en_us_dedes/miscellanea:misc.Ode9
ltx/en_us_dedes/me.m11.d13:meMA.Ode9C23.text	
ltx/en_us_dedes/me.m11.d13:meMA.Ode9C2T.incipit	…
ltx/en_us_dedes/me.m11.d13:meMA.Ode9C2T.melody	@ltx/en_us_dedes/he.h.m8:heHE.ExestiEpiTouto.name
ltx/en_us_dedes/me.m11.d13:meMA.Ode9C2T.mode	@ltx/en_us_dedes/miscellanea:misc.Mode8
ltx/en_us_dedes/me.m11.d13:meMA.Ode9C2T.ode	@ltx/en_us_dedes/miscellanea:misc.Ode9
ltx/en_us_dedes/me.m11.d13:meMA.Ode9C2T.text	
ltx/en_us_dedes/me.m11.d13:meMA.Oikos1.text	To the Maker of all I bend the knee, to the Word pre-eternal I extend my hands, seeking the gift of speech, so that I may extol that devout man whom He magnified. He who lives forever once said to the Prophet: “I glorify those who in faith glorify Me.” And so, He who of old exalted Samuel has now glorified the Hierarch. For he invested well the talent he was entrusted, and he offers it now to the King; and for this the Transcendent One exalted him transcendently. That is why I, the unworthy, request that speech be given me, so that I may be able to extol him piously. For, elucidating things divine, he is the world’s teacher and guide.
ltx/en_us_dedes/me.m11.d13:meMA.PostGospelBoth.incipit	@ltx/en_us_dedes/ho.ho03:hoMA.PostGospelTheotokos.incipit
ltx/en_us_dedes/me.m11.d13:meMA.PostGospelBoth.melody	
ltx/en_us_dedes/me.m11.d13:meMA.PostGospelBoth.mode	@ltx/en_us_dedes/miscellanea:misc.Mode2
ltx/en_us_dedes/me.m11.d13:meMA.PostGospelBoth.text	@ltx/en_us_dedes/ho.ho03:hoMA.PostGospelTheotokos.text
ltx/en_us_dedes/me.m11.d13:meMA.PostGospelGlory.incipit	Today, Hierarchs everywhere exult in…
ltx/en_us_dedes/me.m11.d13:meMA.PostGospelGlory.melody	
ltx/en_us_dedes/me.m11.d13:meMA.PostGospelGlory.mode	@ltx/en_us_dedes/miscellanea:misc.Mode2
ltx/en_us_dedes/me.m11.d13:meMA.PostGospelGlory.text	Today, Hierarchs everywhere exult in spirit, and all together we honor your memory, O righteous Hierarch Chrysostom, the Church’s luminary.
ltx/en_us_dedes/me.m11.d13:meMA.PostGospelIdiomelon.incipit	@ltx/en_us_dedes/me.m01.d01:meVE.LityGlory.incipit
ltx/en_us_dedes/me.m11.d13:meMA.PostGospelIdiomelon.melody	
ltx/en_us_dedes/me.m11.d13:meMA.PostGospelIdiomelon.mode	@ltx/en_us_dedes/miscellanea:misc.Mode6
ltx/en_us_dedes/me.m11.d13:meMA.PostGospelIdiomelon.text	@ltx/en_us_dedes/me.m01.d01:meVE.LityGlory.text
ltx/en_us_dedes/me.m11.d13:meSV.AposBoth.incipit	…
ltx/en_us_dedes/me.m11.d13:meSV.AposBoth.melody	@ltx/en_us_dedes/he.a.m2:heAU.OikosTouEfratha.name
ltx/en_us_dedes/me.m11.d13:meSV.AposBoth.mode	@ltx/en_us_dedes/miscellanea:misc.Mode2
ltx/en_us_dedes/me.m11.d13:meSV.AposBoth.text	
ltx/en_us_dedes/me.m11.d13:meSV.AposGlory.incipit	…
ltx/en_us_dedes/me.m11.d13:meSV.AposGlory.melody	@ltx/en_us_dedes/he.a.m2:heAU.OikosTouEfratha.name
ltx/en_us_dedes/me.m11.d13:meSV.AposGlory.mode	@ltx/en_us_dedes/miscellanea:misc.Mode2
ltx/en_us_dedes/me.m11.d13:meSV.AposGlory.text	
ltx/en_us_dedes/me.m11.d13:meSV.Aposticha1.incipit	…
ltx/en_us_dedes/me.m11.d13:meSV.Aposticha1.melody	@ltx/en_us_dedes/he.a.m2:heAU.OikosTouEfratha.name
ltx/en_us_dedes/me.m11.d13:meSV.Aposticha1.mode	@ltx/en_us_dedes/miscellanea:misc.Mode2
ltx/en_us_dedes/me.m11.d13:meSV.Aposticha1.text	
ltx/en_us_dedes/me.m11.d13:meSV.Aposticha2.incipit	…
ltx/en_us_dedes/me.m11.d13:meSV.Aposticha2.melody	@ltx/en_us_dedes/he.a.m2:heAU.OikosTouEfratha.name
ltx/en_us_dedes/me.m11.d13:meSV.Aposticha2.mode	@ltx/en_us_dedes/miscellanea:misc.Mode2
ltx/en_us_dedes/me.m11.d13:meSV.Aposticha2.text	
ltx/en_us_dedes/me.m11.d13:meSV.Aposticha3.incipit	…
ltx/en_us_dedes/me.m11.d13:meSV.Aposticha3.melody	@ltx/en_us_dedes/he.a.m2:heAU.OikosTouEfratha.name
ltx/en_us_dedes/me.m11.d13:meSV.Aposticha3.mode	@ltx/en_us_dedes/miscellanea:misc.Mode2
ltx/en_us_dedes/me.m11.d13:meSV.Aposticha3.text	
ltx/en_us_dedes/me.m11.d13:meSV.SticBoth.incipit	@ltx/en_us_dedes/oc.m4.d3:ocVE.AposTheotokion.incipit
ltx/en_us_dedes/me.m11.d13:meSV.SticBoth.melody	
ltx/en_us_dedes/me.m11.d13:meSV.SticBoth.mode	@ltx/en_us_dedes/miscellanea:misc.Mode4
ltx/en_us_dedes/me.m11.d13:meSV.SticBoth.text	@ltx/en_us_dedes/oc.m4.d3:ocVE.AposTheotokion.text
ltx/en_us_dedes/me.m11.d13:meSV.SticGlory.incipit	…
ltx/en_us_dedes/me.m11.d13:meSV.SticGlory.melody	
ltx/en_us_dedes/me.m11.d13:meSV.SticGlory.mode	@ltx/en_us_dedes/miscellanea:misc.Mode4
ltx/en_us_dedes/me.m11.d13:meSV.SticGlory.text	
ltx/en_us_dedes/me.m11.d13:meSV.Stichera1.incipit	…
ltx/en_us_dedes/me.m11.d13:meSV.Stichera1.melody	@ltx/en_us_dedes/he.a.m1:heAU.TonOuranionTagmaton.name
ltx/en_us_dedes/me.m11.d13:meSV.Stichera1.mode	@ltx/en_us_dedes/miscellanea:misc.Mode1
ltx/en_us_dedes/me.m11.d13:meSV.Stichera1.text	
ltx/en_us_dedes/me.m11.d13:meSV.Stichera2.incipit	…
ltx/en_us_dedes/me.m11.d13:meSV.Stichera2.melody	@ltx/en_us_dedes/he.a.m1:heAU.TonOuranionTagmaton.name
ltx/en_us_dedes/me.m11.d13:meSV.Stichera2.mode	@ltx/en_us_dedes/miscellanea:misc.Mode1
ltx/en_us_dedes/me.m11.d13:meSV.Stichera2.text	
ltx/en_us_dedes/me.m11.d13:meSV.Stichera3.incipit	…
ltx/en_us_dedes/me.m11.d13:meSV.Stichera3.melody	@ltx/en_us_dedes/he.a.m1:heAU.TonOuranionTagmaton.name
ltx/en_us_dedes/me.m11.d13:meSV.Stichera3.mode	@ltx/en_us_dedes/miscellanea:misc.Mode1
ltx/en_us_dedes/me.m11.d13:meSV.Stichera3.text	
ltx/en_us_dedes/me.m11.d13:meVE.Apolytikion1.incipit	The grace that from your mouth…
ltx/en_us_dedes/me.m11.d13:meVE.Apolytikion1.melody	
ltx/en_us_dedes/me.m11.d13:meVE.Apolytikion1.mode	@ltx/en_us_dedes/miscellanea:misc.Mode8
ltx/en_us_dedes/me.m11.d13:meVE.Apolytikion1.text	The grace that from your mouth shone forth like a torch illumined the universe. It deposited in the world the treasures of the absence of avarice. It showed us the height that is attained by humility. Now you instruct us by your words, Father John Chrysostom. Intercede with Christ God, the Word himself, entreating Him to save our souls.
ltx/en_us_dedes/me.m11.d13:meVE.AposGlory.incipit	You were like a trumpet…
ltx/en_us_dedes/me.m11.d13:meVE.AposGlory.melody	
ltx/en_us_dedes/me.m11.d13:meVE.AposGlory.mode	@ltx/en_us_dedes/miscellanea:misc.Mode6
ltx/en_us_dedes/me.m11.d13:meVE.AposGlory.text	You were like a trumpet making golden sounds, O Chrysostom, the golden mouth producing golden words; and you made golden the hearts of the believers with your teachings wrought of gold. As the prophet said, the sound of your doctrines went out, O devout Father, and you illumined all the ends of the earth.
ltx/en_us_dedes/me.m11.d13:meVE.AposTheotokion.incipit	@ltx/en_us_dedes/oc.m6.d1:ocVE.AposTheotokion.incipit
ltx/en_us_dedes/me.m11.d13:meVE.AposTheotokion.melody	
ltx/en_us_dedes/me.m11.d13:meVE.AposTheotokion.mode	@ltx/en_us_dedes/miscellanea:misc.Mode6
ltx/en_us_dedes/me.m11.d13:meVE.AposTheotokion.text	@ltx/en_us_dedes/oc.m6.d1:ocVE.AposTheotokion.text
ltx/en_us_dedes/me.m11.d13:meVE.Aposticha1.greekmelody	@ltx/en_us_dedes/he.a.m5:heAU.ChairoisAskitikon.greekname
ltx/en_us_dedes/me.m11.d13:meVE.Aposticha1.incipit	…
ltx/en_us_dedes/me.m11.d13:meVE.Aposticha1.melody	@ltx/en_us_dedes/he.a.m5:heAU.ChairoisAskitikon.name
ltx/en_us_dedes/me.m11.d13:meVE.Aposticha1.mode	@ltx/en_us_dedes/miscellanea:misc.Mode5
ltx/en_us_dedes/me.m11.d13:meVE.Aposticha1.text	
ltx/en_us_dedes/me.m11.d13:meVE.Aposticha2.incipit	…
ltx/en_us_dedes/me.m11.d13:meVE.Aposticha2.melody	@ltx/en_us_dedes/he.a.m5:heAU.ChairoisAskitikon.name
ltx/en_us_dedes/me.m11.d13:meVE.Aposticha2.mode	@ltx/en_us_dedes/miscellanea:misc.Mode5
ltx/en_us_dedes/me.m11.d13:meVE.Aposticha2.text	
ltx/en_us_dedes/me.m11.d13:meVE.Aposticha3.incipit	…
ltx/en_us_dedes/me.m11.d13:meVE.Aposticha3.melody	@ltx/en_us_dedes/he.a.m5:heAU.ChairoisAskitikon.name
ltx/en_us_dedes/me.m11.d13:meVE.Aposticha3.mode	@ltx/en_us_dedes/miscellanea:misc.Mode5
ltx/en_us_dedes/me.m11.d13:meVE.Aposticha3.text	
ltx/en_us_dedes/me.m11.d13:meVE.Lity1.incipit	…
ltx/en_us_dedes/me.m11.d13:meVE.Lity1.melody	
ltx/en_us_dedes/me.m11.d13:meVE.Lity1.mode	@ltx/en_us_dedes/miscellanea:misc.Mode1
ltx/en_us_dedes/me.m11.d13:meVE.Lity1.poet	@ltx/en_us_dedes/poets:po.Anatoliou
ltx/en_us_dedes/me.m11.d13:meVE.Lity1.text	
ltx/en_us_dedes/me.m11.d13:meVE.Lity2.incipit	…
ltx/en_us_dedes/me.m11.d13:meVE.Lity2.melody	
ltx/en_us_dedes/me.m11.d13:meVE.Lity2.mode	@ltx/en_us_dedes/miscellanea:misc.Mode1
ltx/en_us_dedes/me.m11.d13:meVE.Lity2.text	
ltx/en_us_dedes/me.m11.d13:meVE.Lity3.incipit	…
ltx/en_us_dedes/me.m11.d13:meVE.Lity3.melody	
ltx/en_us_dedes/me.m11.d13:meVE.Lity3.mode	@ltx/en_us_dedes/miscellanea:misc.Mode2
ltx/en_us_dedes/me.m11.d13:meVE.Lity3.poet	@ltx/en_us_dedes/poets:po.Stouditou
ltx/en_us_dedes/me.m11.d13:meVE.Lity3.text	
ltx/en_us_dedes/me.m11.d13:meVE.Lity4.incipit	…
ltx/en_us_dedes/me.m11.d13:meVE.Lity4.melody	
ltx/en_us_dedes/me.m11.d13:meVE.Lity4.mode	@ltx/en_us_dedes/miscellanea:misc.Mode2
ltx/en_us_dedes/me.m11.d13:meVE.Lity4.poet	@ltx/en_us_dedes/poets:po.GeorgiouNikomideias
ltx/en_us_dedes/me.m11.d13:meVE.Lity4.text	
ltx/en_us_dedes/me.m11.d13:meVE.Lity5.incipit	…
ltx/en_us_dedes/me.m11.d13:meVE.Lity5.melody	
ltx/en_us_dedes/me.m11.d13:meVE.Lity5.mode	@ltx/en_us_dedes/miscellanea:misc.Mode2
ltx/en_us_dedes/me.m11.d13:meVE.Lity5.text	
ltx/en_us_dedes/me.m11.d13:meVE.Lity6.incipit	…
ltx/en_us_dedes/me.m11.d13:meVE.Lity6.melody	
ltx/en_us_dedes/me.m11.d13:meVE.Lity6.mode	@ltx/en_us_dedes/miscellanea:misc.Mode4
ltx/en_us_dedes/me.m11.d13:meVE.Lity6.text	
ltx/en_us_dedes/me.m11.d13:meVE.LityBoth.incipit	…
ltx/en_us_dedes/me.m11.d13:meVE.LityBoth.melody	
ltx/en_us_dedes/me.m11.d13:meVE.LityBoth.mode	@ltx/en_us_dedes/miscellanea:misc.Mode4
ltx/en_us_dedes/me.m11.d13:meVE.LityBoth.text	
ltx/en_us_dedes/me.m11.d13:meVE.LityGlory.incipit	…
ltx/en_us_dedes/me.m11.d13:meVE.LityGlory.melody	
ltx/en_us_dedes/me.m11.d13:meVE.LityGlory.mode	@ltx/en_us_dedes/miscellanea:misc.Mode4
ltx/en_us_dedes/me.m11.d13:meVE.LityGlory.poet	@ltx/en_us_dedes/poets:po.Germanou
ltx/en_us_dedes/me.m11.d13:meVE.LityGlory.text	
ltx/en_us_dedes/me.m11.d13:meVE.SticGlory.incipit	O devout, thrice-blessed, all-holy Father…
ltx/en_us_dedes/me.m11.d13:meVE.SticGlory.melody	
ltx/en_us_dedes/me.m11.d13:meVE.SticGlory.mode	@ltx/en_us_dedes/miscellanea:misc.Mode6
ltx/en_us_dedes/me.m11.d13:meVE.SticGlory.text	O devout, thrice-blessed, all-holy Father, good Shepherd, and Disciple of Christ the Chief Shepherd, you laid down your life for the sheep. O all-lauded John Chrysostom, pray for us, that by your intercessions the Lord grant us His great mercy.
ltx/en_us_dedes/me.m11.d13:meVE.SticTheotokion.incipit	@ltx/en_us_dedes/oc.m6.d1:ocVE.SticTheotokion.incipit
ltx/en_us_dedes/me.m11.d13:meVE.SticTheotokion.melody	
ltx/en_us_dedes/me.m11.d13:meVE.SticTheotokion.mode	@ltx/en_us_dedes/miscellanea:misc.Mode6
ltx/en_us_dedes/me.m11.d13:meVE.SticTheotokion.text	@ltx/en_us_dedes/oc.m6.d1:ocVE.SticTheotokion.text
ltx/en_us_dedes/me.m11.d13:meVE.Stichera01.greekmelody	@ltx/en_us_dedes/he.a.m4:heAU.OsGennaionEnMartysi.greekname
ltx/en_us_dedes/me.m11.d13:meVE.Stichera01.incipit	@ltx/en_us_dedes/me.m01.d27:meVE.Stichera01.incipit
ltx/en_us_dedes/me.m11.d13:meVE.Stichera01.melody	@ltx/en_us_dedes/he.a.m4:heAU.OsGennaionEnMartysi.name
ltx/en_us_dedes/me.m11.d13:meVE.Stichera01.mode	@ltx/en_us_dedes/miscellanea:misc.Mode4
ltx/en_us_dedes/me.m11.d13:meVE.Stichera01.text	@ltx/en_us_dedes/me.m01.d27:meVE.Stichera01.text
ltx/en_us_dedes/me.m11.d13:meVE.Stichera02.incipit	@ltx/en_us_dedes/me.m01.d27:meVE.Stichera02.incipit
ltx/en_us_dedes/me.m11.d13:meVE.Stichera02.melody	@ltx/en_us_dedes/he.a.m4:heAU.OsGennaionEnMartysi.name
ltx/en_us_dedes/me.m11.d13:meVE.Stichera02.mode	@ltx/en_us_dedes/miscellanea:misc.Mode4
ltx/en_us_dedes/me.m11.d13:meVE.Stichera02.text	@ltx/en_us_dedes/me.m01.d27:meVE.Stichera02.text
ltx/en_us_dedes/me.m11.d13:meVE.Stichera03.incipit	@ltx/en_us_dedes/me.m01.d27:meVE.Stichera03.incipit
ltx/en_us_dedes/me.m11.d13:meVE.Stichera03.melody	@ltx/en_us_dedes/he.a.m4:heAU.OsGennaionEnMartysi.name
ltx/en_us_dedes/me.m11.d13:meVE.Stichera03.mode	@ltx/en_us_dedes/miscellanea:misc.Mode4
ltx/en_us_dedes/me.m11.d13:meVE.Stichera03.text	@ltx/en_us_dedes/me.m01.d27:meVE.Stichera03.text
