ltx/en_us_dedes/oc.m5.d2:ocBK.ModeNaked	@ltx/en_us_dedes/miscellanea:misc.Mode5.naked
ltx/en_us_dedes/oc.m5.d2:ocLI.Beatitudes1.incipit	@ltx/en_us_dedes/oc.m5.d1:ocLI.Beatitudes1.incipit
ltx/en_us_dedes/oc.m5.d2:ocLI.Beatitudes1.melody	
ltx/en_us_dedes/oc.m5.d2:ocLI.Beatitudes1.mode	@ltx/en_us_dedes/miscellanea:misc.Mode5
ltx/en_us_dedes/oc.m5.d2:ocLI.Beatitudes1.text	@ltx/en_us_dedes/oc.m5.d1:ocLI.Beatitudes1.text
ltx/en_us_dedes/oc.m5.d2:ocLI.Beatitudes2.incipit	On the road, which is…
ltx/en_us_dedes/oc.m5.d2:ocLI.Beatitudes2.melody	
ltx/en_us_dedes/oc.m5.d2:ocLI.Beatitudes2.mode	@ltx/en_us_dedes/miscellanea:misc.Mode5
ltx/en_us_dedes/oc.m5.d2:ocLI.Beatitudes2.text	On the road, which is my life, * soul-destroying robbers accosted me, * and they left me wounded. Now to Your divine compassion * I come running. Heal me, I pray, * and save me, O Christ my God.
ltx/en_us_dedes/oc.m5.d2:ocLI.Beatitudes3.incipit	O almighty God of all…
ltx/en_us_dedes/oc.m5.d2:ocLI.Beatitudes3.melody	
ltx/en_us_dedes/oc.m5.d2:ocLI.Beatitudes3.mode	@ltx/en_us_dedes/miscellanea:misc.Mode5
ltx/en_us_dedes/oc.m5.d2:ocLI.Beatitudes3.text	O almighty God of all, * You are extolled by all the heavenly hosts. * At their spirited intercessions, O Master, * overlook my many wicked deeds, * I pray You, and save my soul.
ltx/en_us_dedes/oc.m5.d2:ocLI.Beatitudes4.incipit	O Martyr Athletes of Christ…
ltx/en_us_dedes/oc.m5.d2:ocLI.Beatitudes4.melody	
ltx/en_us_dedes/oc.m5.d2:ocLI.Beatitudes4.mode	@ltx/en_us_dedes/miscellanea:misc.Mode5
ltx/en_us_dedes/oc.m5.d2:ocLI.Beatitudes4.text	O Martyr Athletes of Christ, * enumerated now with angelic hosts * and filled with never-setting illumination, * cause the fetid passions of my heart * to shrink and to disappear.
ltx/en_us_dedes/oc.m5.d2:ocLI.BeatitudesT.incipit	O pure One, at the…
ltx/en_us_dedes/oc.m5.d2:ocLI.BeatitudesT.melody	
ltx/en_us_dedes/oc.m5.d2:ocLI.BeatitudesT.mode	@ltx/en_us_dedes/miscellanea:misc.Mode5
ltx/en_us_dedes/oc.m5.d2:ocLI.BeatitudesT.text	O pure One, at the Angel’s word, * you accepted Christ the Joy within your womb. * But my soul is sad and depressed from the evils * I have done. Please fill it up with joy, * and guide to the light, I pray.
ltx/en_us_dedes/oc.m5.d2:ocLI.BeatitudesTr.incipit	Holy Trinity, You are *…
ltx/en_us_dedes/oc.m5.d2:ocLI.BeatitudesTr.melody	
ltx/en_us_dedes/oc.m5.d2:ocLI.BeatitudesTr.mode	@ltx/en_us_dedes/miscellanea:misc.Mode5
ltx/en_us_dedes/oc.m5.d2:ocLI.BeatitudesTr.text	Holy Trinity, You are * with glory by angelic voices extolled. * I entreat You for my soul that has been infected * by the demons, that in Your divine * mercy You restore its health.
ltx/en_us_dedes/oc.m5.d2:ocLI.MM.Beatitudes1234TrTas78910GB.text	@ltx/en_us_dedes/properties:media.key
ltx/en_us_dedes/oc.m5.d2:ocMA.ApolTheotokion.incipit	…
ltx/en_us_dedes/oc.m5.d2:ocMA.ApolTheotokion.melody	
ltx/en_us_dedes/oc.m5.d2:ocMA.ApolTheotokion.mode	@ltx/en_us_dedes/miscellanea:misc.Mode5
ltx/en_us_dedes/oc.m5.d2:ocMA.ApolTheotokion.text	
ltx/en_us_dedes/oc.m5.d2:ocMA.AposTheotokion.incipit	…
ltx/en_us_dedes/oc.m5.d2:ocMA.AposTheotokion.melody	
ltx/en_us_dedes/oc.m5.d2:ocMA.AposTheotokion.mode	@ltx/en_us_dedes/miscellanea:misc.Mode5
ltx/en_us_dedes/oc.m5.d2:ocMA.AposTheotokion.text	
ltx/en_us_dedes/oc.m5.d2:ocMA.Aposticha1.incipit	Alas! Why have I become…
ltx/en_us_dedes/oc.m5.d2:ocMA.Aposticha1.melody	
ltx/en_us_dedes/oc.m5.d2:ocMA.Aposticha1.mode	@ltx/en_us_dedes/miscellanea:misc.Mode5
ltx/en_us_dedes/oc.m5.d2:ocMA.Aposticha1.text	Alas! Why have I become like the unfruitful fig tree, and I am afraid of the curse and of being cut down? O Christ my God, the heavenly husbandman, make my barren soul fruitful, and accept me like the Prodigal Son, and have mercy on me.
ltx/en_us_dedes/oc.m5.d2:ocMA.Aposticha2.incipit	Overlook the multitude of my…
ltx/en_us_dedes/oc.m5.d2:ocMA.Aposticha2.melody	
ltx/en_us_dedes/oc.m5.d2:ocMA.Aposticha2.mode	@ltx/en_us_dedes/miscellanea:misc.Mode5
ltx/en_us_dedes/oc.m5.d2:ocMA.Aposticha2.text	Overlook the multitude of my offenses, O Lord who were born of a Virgin. I pray You, blot out all of my transgressions, and grant to me the thought to return, as the only benevolent God, and have mercy on me.
ltx/en_us_dedes/oc.m5.d2:ocMA.Aposticha3.incipit	Blessed is the army of…
ltx/en_us_dedes/oc.m5.d2:ocMA.Aposticha3.melody	
ltx/en_us_dedes/oc.m5.d2:ocMA.Aposticha3.mode	@ltx/en_us_dedes/miscellanea:misc.Mode5
ltx/en_us_dedes/oc.m5.d2:ocMA.Aposticha3.text	Blessed is the army of the King of heaven. Even though they were but human, the medaled Martyrs strove to attain angelic rank, by disregarding their bodies. Through suffering, they were granted the honor of the bodiless hosts. By their prayers, O Lord, send down to us Your great mercy.
ltx/en_us_dedes/oc.m5.d2:ocMA.C1.acrostic.notice1	
ltx/en_us_dedes/oc.m5.d2:ocMA.C1.acrostic.text	
ltx/en_us_dedes/oc.m5.d2:ocMA.C1.acrostic.title	Canon of Compunction.
ltx/en_us_dedes/oc.m5.d2:ocMA.C1.poet	@ltx/en_us_dedes/poets:po.KyriouIosif
ltx/en_us_dedes/oc.m5.d2:ocMA.C2.acrostic.notice1	
ltx/en_us_dedes/oc.m5.d2:ocMA.C2.acrostic.text	
ltx/en_us_dedes/oc.m5.d2:ocMA.C2.acrostic.title	Canon for the Bodiless Hosts.
ltx/en_us_dedes/oc.m5.d2:ocMA.C2.poet	@ltx/en_us_dedes/poets:po.Theofanous
ltx/en_us_dedes/oc.m5.d2:ocMA.Kathisma11.incipit	…
ltx/en_us_dedes/oc.m5.d2:ocMA.Kathisma11.melody	
ltx/en_us_dedes/oc.m5.d2:ocMA.Kathisma11.mode	@ltx/en_us_dedes/miscellanea:misc.Mode5
ltx/en_us_dedes/oc.m5.d2:ocMA.Kathisma11.text	
ltx/en_us_dedes/oc.m5.d2:ocMA.Kathisma12.incipit	…
ltx/en_us_dedes/oc.m5.d2:ocMA.Kathisma12.melody	
ltx/en_us_dedes/oc.m5.d2:ocMA.Kathisma12.mode	@ltx/en_us_dedes/miscellanea:misc.Mode5
ltx/en_us_dedes/oc.m5.d2:ocMA.Kathisma12.text	
ltx/en_us_dedes/oc.m5.d2:ocMA.Kathisma13.greekmelody	@ltx/en_us_dedes/he.a.m5:heAU.TonSynanarchonLogon.greekname
ltx/en_us_dedes/oc.m5.d2:ocMA.Kathisma13.incipit	You are fervent protection…
ltx/en_us_dedes/oc.m5.d2:ocMA.Kathisma13.melody	@ltx/en_us_dedes/he.a.m5:heAU.TonSynanarchonLogon.name
ltx/en_us_dedes/oc.m5.d2:ocMA.Kathisma13.mode	@ltx/en_us_dedes/miscellanea:misc.Mode5
ltx/en_us_dedes/oc.m5.d2:ocMA.Kathisma13.text	You are fervent protection that is invincible, * and the hope that is sure and is never put to shame, * shelter, haven, and high wall for those who flee to you, * with the angelic hosts on high, make entreaty with your Son and God, O pure Ever-virgin, * that He grant peace and great mercy and His salvation to all the world.
ltx/en_us_dedes/oc.m5.d2:ocMA.Kathisma21.incipit	Let us all be vigilant…
ltx/en_us_dedes/oc.m5.d2:ocMA.Kathisma21.melody	
ltx/en_us_dedes/oc.m5.d2:ocMA.Kathisma21.mode	@ltx/en_us_dedes/miscellanea:misc.Mode5
ltx/en_us_dedes/oc.m5.d2:ocMA.Kathisma21.text	Let us all be vigilant, and go out to meet Christ, with a good supply of oil and lamps burning bright, so that we be granted entry to the bridal hall. He who ended up outside the door, to no avail cried out, “Have mercy on me!”
ltx/en_us_dedes/oc.m5.d2:ocMA.Kathisma22.incipit	…
ltx/en_us_dedes/oc.m5.d2:ocMA.Kathisma22.melody	
ltx/en_us_dedes/oc.m5.d2:ocMA.Kathisma22.mode	@ltx/en_us_dedes/miscellanea:misc.Mode5
ltx/en_us_dedes/oc.m5.d2:ocMA.Kathisma22.text	
ltx/en_us_dedes/oc.m5.d2:ocMA.Kathisma23.incipit	…
ltx/en_us_dedes/oc.m5.d2:ocMA.Kathisma23.melody	
ltx/en_us_dedes/oc.m5.d2:ocMA.Kathisma23.mode	@ltx/en_us_dedes/miscellanea:misc.Mode5
ltx/en_us_dedes/oc.m5.d2:ocMA.Kathisma23.text	
ltx/en_us_dedes/oc.m5.d2:ocMA.Kathisma31.greekmelody	@ltx/en_us_dedes/he.a.m5:heAU.TonSynanarchonLogon.greekname
ltx/en_us_dedes/oc.m5.d2:ocMA.Kathisma31.incipit	…
ltx/en_us_dedes/oc.m5.d2:ocMA.Kathisma31.melody	@ltx/en_us_dedes/he.a.m5:heAU.TonSynanarchonLogon.name
ltx/en_us_dedes/oc.m5.d2:ocMA.Kathisma31.mode	@ltx/en_us_dedes/miscellanea:misc.Mode5
ltx/en_us_dedes/oc.m5.d2:ocMA.Kathisma31.text	
ltx/en_us_dedes/oc.m5.d2:ocMA.Kathisma32.incipit	…
ltx/en_us_dedes/oc.m5.d2:ocMA.Kathisma32.melody	
ltx/en_us_dedes/oc.m5.d2:ocMA.Kathisma32.mode	@ltx/en_us_dedes/miscellanea:misc.Mode5
ltx/en_us_dedes/oc.m5.d2:ocMA.Kathisma32.text	
ltx/en_us_dedes/oc.m5.d2:ocMA.Kathisma33.greekmelody	@ltx/en_us_dedes/he.a.m5:heAU.TonSynanarchonLogon.greekname
ltx/en_us_dedes/oc.m5.d2:ocMA.Kathisma33.incipit	…
ltx/en_us_dedes/oc.m5.d2:ocMA.Kathisma33.melody	@ltx/en_us_dedes/he.a.m5:heAU.TonSynanarchonLogon.name
ltx/en_us_dedes/oc.m5.d2:ocMA.Kathisma33.mode	@ltx/en_us_dedes/miscellanea:misc.Mode5
ltx/en_us_dedes/oc.m5.d2:ocMA.Kathisma33.text	
ltx/en_us_dedes/oc.m5.d2:ocMA.OdeW1C11.incipit	…
ltx/en_us_dedes/oc.m5.d2:ocMA.OdeW1C11.melody	@ltx/en_us_dedes/he.h.m5:heHE.AsomenToKyrio.name
ltx/en_us_dedes/oc.m5.d2:ocMA.OdeW1C11.mode	@ltx/en_us_dedes/miscellanea:misc.Mode5
ltx/en_us_dedes/oc.m5.d2:ocMA.OdeW1C11.ode	@ltx/en_us_dedes/miscellanea:misc.Ode1
ltx/en_us_dedes/oc.m5.d2:ocMA.OdeW1C11.text	
ltx/en_us_dedes/oc.m5.d2:ocMA.OdeW1C12.incipit	…
ltx/en_us_dedes/oc.m5.d2:ocMA.OdeW1C12.melody	@ltx/en_us_dedes/he.h.m5:heHE.AsomenToKyrio.name
ltx/en_us_dedes/oc.m5.d2:ocMA.OdeW1C12.mode	@ltx/en_us_dedes/miscellanea:misc.Mode5
ltx/en_us_dedes/oc.m5.d2:ocMA.OdeW1C12.ode	@ltx/en_us_dedes/miscellanea:misc.Ode1
ltx/en_us_dedes/oc.m5.d2:ocMA.OdeW1C12.text	
ltx/en_us_dedes/oc.m5.d2:ocMA.OdeW1C13.incipit	…
ltx/en_us_dedes/oc.m5.d2:ocMA.OdeW1C13.melody	@ltx/en_us_dedes/he.h.m5:heHE.AsomenToKyrio.name
ltx/en_us_dedes/oc.m5.d2:ocMA.OdeW1C13.mode	@ltx/en_us_dedes/miscellanea:misc.Mode5
ltx/en_us_dedes/oc.m5.d2:ocMA.OdeW1C13.ode	@ltx/en_us_dedes/miscellanea:misc.Ode1
ltx/en_us_dedes/oc.m5.d2:ocMA.OdeW1C13.text	
ltx/en_us_dedes/oc.m5.d2:ocMA.OdeW1C14.incipit	…
ltx/en_us_dedes/oc.m5.d2:ocMA.OdeW1C14.melody	@ltx/en_us_dedes/he.h.m5:heHE.AsomenToKyrio.name
ltx/en_us_dedes/oc.m5.d2:ocMA.OdeW1C14.mode	@ltx/en_us_dedes/miscellanea:misc.Mode5
ltx/en_us_dedes/oc.m5.d2:ocMA.OdeW1C14.ode	@ltx/en_us_dedes/miscellanea:misc.Ode1
ltx/en_us_dedes/oc.m5.d2:ocMA.OdeW1C14.text	
ltx/en_us_dedes/oc.m5.d2:ocMA.OdeW1C1H.greekmelody	@ltx/en_us_dedes/he.h.m5:heHE.AsomenToKyrio.greekname
ltx/en_us_dedes/oc.m5.d2:ocMA.OdeW1C1H.incipit	@ltx/en_us_dedes/he.h.m5:heHE.AsomenToKyrio.incipit
ltx/en_us_dedes/oc.m5.d2:ocMA.OdeW1C1H.melody	@ltx/en_us_dedes/he.h.m5:heHE.AsomenToKyrio.melody
ltx/en_us_dedes/oc.m5.d2:ocMA.OdeW1C1H.mode	@ltx/en_us_dedes/miscellanea:misc.Mode5
ltx/en_us_dedes/oc.m5.d2:ocMA.OdeW1C1H.ode	@ltx/en_us_dedes/miscellanea:misc.Ode1
ltx/en_us_dedes/oc.m5.d2:ocMA.OdeW1C1H.text	@ltx/en_us_dedes/he.h.m5:heHE.AsomenToKyrio.text
ltx/en_us_dedes/oc.m5.d2:ocMA.OdeW1C1T.incipit	…
ltx/en_us_dedes/oc.m5.d2:ocMA.OdeW1C1T.melody	@ltx/en_us_dedes/he.h.m5:heHE.AsomenToKyrio.name
ltx/en_us_dedes/oc.m5.d2:ocMA.OdeW1C1T.mode	@ltx/en_us_dedes/miscellanea:misc.Mode5
ltx/en_us_dedes/oc.m5.d2:ocMA.OdeW1C1T.ode	@ltx/en_us_dedes/miscellanea:misc.Ode1
ltx/en_us_dedes/oc.m5.d2:ocMA.OdeW1C1T.text	
ltx/en_us_dedes/oc.m5.d2:ocMA.OdeW1C21.greekmelody	@ltx/en_us_dedes/he.h.m5:heHE.IpponKaiAnavatin.greekname
ltx/en_us_dedes/oc.m5.d2:ocMA.OdeW1C21.incipit	…
ltx/en_us_dedes/oc.m5.d2:ocMA.OdeW1C21.melody	@ltx/en_us_dedes/he.h.m5:heHE.IpponKaiAnavatin.name
ltx/en_us_dedes/oc.m5.d2:ocMA.OdeW1C21.mode	@ltx/en_us_dedes/miscellanea:misc.Mode5
ltx/en_us_dedes/oc.m5.d2:ocMA.OdeW1C21.ode	@ltx/en_us_dedes/miscellanea:misc.Ode1
ltx/en_us_dedes/oc.m5.d2:ocMA.OdeW1C21.text	
ltx/en_us_dedes/oc.m5.d2:ocMA.OdeW1C22.incipit	…
ltx/en_us_dedes/oc.m5.d2:ocMA.OdeW1C22.melody	@ltx/en_us_dedes/he.h.m5:heHE.IpponKaiAnavatin.name
ltx/en_us_dedes/oc.m5.d2:ocMA.OdeW1C22.mode	@ltx/en_us_dedes/miscellanea:misc.Mode5
ltx/en_us_dedes/oc.m5.d2:ocMA.OdeW1C22.ode	@ltx/en_us_dedes/miscellanea:misc.Ode1
ltx/en_us_dedes/oc.m5.d2:ocMA.OdeW1C22.text	
ltx/en_us_dedes/oc.m5.d2:ocMA.OdeW1C2T.incipit	@ltx/en_us_dedes/oc.m5.d1:ocMA.OdeS1C1T.incipit
ltx/en_us_dedes/oc.m5.d2:ocMA.OdeW1C2T.melody	@ltx/en_us_dedes/he.h.m5:heHE.IpponKaiAnavatin.name
ltx/en_us_dedes/oc.m5.d2:ocMA.OdeW1C2T.mode	@ltx/en_us_dedes/miscellanea:misc.Mode5
ltx/en_us_dedes/oc.m5.d2:ocMA.OdeW1C2T.ode	@ltx/en_us_dedes/miscellanea:misc.Ode1
ltx/en_us_dedes/oc.m5.d2:ocMA.OdeW1C2T.text	@ltx/en_us_dedes/oc.m5.d1:ocMA.OdeS1C1T.text
ltx/en_us_dedes/oc.m5.d2:ocMA.OdeW3C11.incipit	…
ltx/en_us_dedes/oc.m5.d2:ocMA.OdeW3C11.melody	@ltx/en_us_dedes/he.h.m5:heHE.EpiTaEthni.name
ltx/en_us_dedes/oc.m5.d2:ocMA.OdeW3C11.mode	@ltx/en_us_dedes/miscellanea:misc.Mode5
ltx/en_us_dedes/oc.m5.d2:ocMA.OdeW3C11.ode	@ltx/en_us_dedes/miscellanea:misc.Ode3
ltx/en_us_dedes/oc.m5.d2:ocMA.OdeW3C11.text	
ltx/en_us_dedes/oc.m5.d2:ocMA.OdeW3C12.incipit	…
ltx/en_us_dedes/oc.m5.d2:ocMA.OdeW3C12.melody	@ltx/en_us_dedes/he.h.m5:heHE.EpiTaEthni.name
ltx/en_us_dedes/oc.m5.d2:ocMA.OdeW3C12.mode	@ltx/en_us_dedes/miscellanea:misc.Mode5
ltx/en_us_dedes/oc.m5.d2:ocMA.OdeW3C12.ode	@ltx/en_us_dedes/miscellanea:misc.Ode3
ltx/en_us_dedes/oc.m5.d2:ocMA.OdeW3C12.text	
ltx/en_us_dedes/oc.m5.d2:ocMA.OdeW3C13.incipit	…
ltx/en_us_dedes/oc.m5.d2:ocMA.OdeW3C13.melody	@ltx/en_us_dedes/he.h.m5:heHE.EpiTaEthni.name
ltx/en_us_dedes/oc.m5.d2:ocMA.OdeW3C13.mode	@ltx/en_us_dedes/miscellanea:misc.Mode5
ltx/en_us_dedes/oc.m5.d2:ocMA.OdeW3C13.ode	@ltx/en_us_dedes/miscellanea:misc.Ode3
ltx/en_us_dedes/oc.m5.d2:ocMA.OdeW3C13.text	
ltx/en_us_dedes/oc.m5.d2:ocMA.OdeW3C14.incipit	…
ltx/en_us_dedes/oc.m5.d2:ocMA.OdeW3C14.melody	@ltx/en_us_dedes/he.h.m5:heHE.EpiTaEthni.name
ltx/en_us_dedes/oc.m5.d2:ocMA.OdeW3C14.mode	@ltx/en_us_dedes/miscellanea:misc.Mode5
ltx/en_us_dedes/oc.m5.d2:ocMA.OdeW3C14.ode	@ltx/en_us_dedes/miscellanea:misc.Ode3
ltx/en_us_dedes/oc.m5.d2:ocMA.OdeW3C14.text	
ltx/en_us_dedes/oc.m5.d2:ocMA.OdeW3C1H.greekmelody	@ltx/en_us_dedes/he.h.m5:heHE.EpiTaEthni.greekname
ltx/en_us_dedes/oc.m5.d2:ocMA.OdeW3C1H.incipit	@ltx/en_us_dedes/he.h.m5:heHE.EpiTaEthni.incipit
ltx/en_us_dedes/oc.m5.d2:ocMA.OdeW3C1H.melody	@ltx/en_us_dedes/he.h.m5:heHE.EpiTaEthni.melody
ltx/en_us_dedes/oc.m5.d2:ocMA.OdeW3C1H.mode	@ltx/en_us_dedes/miscellanea:misc.Mode5
ltx/en_us_dedes/oc.m5.d2:ocMA.OdeW3C1H.ode	@ltx/en_us_dedes/miscellanea:misc.Ode3
ltx/en_us_dedes/oc.m5.d2:ocMA.OdeW3C1H.text	@ltx/en_us_dedes/he.h.m5:heHE.EpiTaEthni.text
ltx/en_us_dedes/oc.m5.d2:ocMA.OdeW3C1T.incipit	…
ltx/en_us_dedes/oc.m5.d2:ocMA.OdeW3C1T.melody	@ltx/en_us_dedes/he.h.m5:heHE.EpiTaEthni.name
ltx/en_us_dedes/oc.m5.d2:ocMA.OdeW3C1T.mode	@ltx/en_us_dedes/miscellanea:misc.Mode5
ltx/en_us_dedes/oc.m5.d2:ocMA.OdeW3C1T.ode	@ltx/en_us_dedes/miscellanea:misc.Ode3
ltx/en_us_dedes/oc.m5.d2:ocMA.OdeW3C1T.text	
ltx/en_us_dedes/oc.m5.d2:ocMA.OdeW3C21.greekmelody	@ltx/en_us_dedes/he.h.m5:heHE.OPixasEpOudenos.greekname
ltx/en_us_dedes/oc.m5.d2:ocMA.OdeW3C21.incipit	…
ltx/en_us_dedes/oc.m5.d2:ocMA.OdeW3C21.melody	@ltx/en_us_dedes/he.h.m5:heHE.OPixasEpOudenos.name
ltx/en_us_dedes/oc.m5.d2:ocMA.OdeW3C21.mode	@ltx/en_us_dedes/miscellanea:misc.Mode5
ltx/en_us_dedes/oc.m5.d2:ocMA.OdeW3C21.ode	@ltx/en_us_dedes/miscellanea:misc.Ode3
ltx/en_us_dedes/oc.m5.d2:ocMA.OdeW3C21.text	
ltx/en_us_dedes/oc.m5.d2:ocMA.OdeW3C2T.incipit	…
ltx/en_us_dedes/oc.m5.d2:ocMA.OdeW3C2T.melody	@ltx/en_us_dedes/he.h.m5:heHE.OPixasEpOudenos.name
ltx/en_us_dedes/oc.m5.d2:ocMA.OdeW3C2T.mode	@ltx/en_us_dedes/miscellanea:misc.Mode5
ltx/en_us_dedes/oc.m5.d2:ocMA.OdeW3C2T.ode	@ltx/en_us_dedes/miscellanea:misc.Ode3
ltx/en_us_dedes/oc.m5.d2:ocMA.OdeW3C2T.text	
ltx/en_us_dedes/oc.m5.d2:ocMA.OdeW4C11.incipit	…
ltx/en_us_dedes/oc.m5.d2:ocMA.OdeW4C11.melody	@ltx/en_us_dedes/he.h.m5:heHE.TaErgaTisOikonomias.name
ltx/en_us_dedes/oc.m5.d2:ocMA.OdeW4C11.mode	@ltx/en_us_dedes/miscellanea:misc.Mode5
ltx/en_us_dedes/oc.m5.d2:ocMA.OdeW4C11.ode	@ltx/en_us_dedes/miscellanea:misc.Ode4
ltx/en_us_dedes/oc.m5.d2:ocMA.OdeW4C11.text	
ltx/en_us_dedes/oc.m5.d2:ocMA.OdeW4C12.incipit	…
ltx/en_us_dedes/oc.m5.d2:ocMA.OdeW4C12.melody	@ltx/en_us_dedes/he.h.m5:heHE.TaErgaTisOikonomias.name
ltx/en_us_dedes/oc.m5.d2:ocMA.OdeW4C12.mode	@ltx/en_us_dedes/miscellanea:misc.Mode5
ltx/en_us_dedes/oc.m5.d2:ocMA.OdeW4C12.ode	@ltx/en_us_dedes/miscellanea:misc.Ode4
ltx/en_us_dedes/oc.m5.d2:ocMA.OdeW4C12.text	
ltx/en_us_dedes/oc.m5.d2:ocMA.OdeW4C13.incipit	…
ltx/en_us_dedes/oc.m5.d2:ocMA.OdeW4C13.melody	@ltx/en_us_dedes/he.h.m5:heHE.TaErgaTisOikonomias.name
ltx/en_us_dedes/oc.m5.d2:ocMA.OdeW4C13.mode	@ltx/en_us_dedes/miscellanea:misc.Mode5
ltx/en_us_dedes/oc.m5.d2:ocMA.OdeW4C13.ode	@ltx/en_us_dedes/miscellanea:misc.Ode4
ltx/en_us_dedes/oc.m5.d2:ocMA.OdeW4C13.text	
ltx/en_us_dedes/oc.m5.d2:ocMA.OdeW4C14.incipit	…
ltx/en_us_dedes/oc.m5.d2:ocMA.OdeW4C14.melody	@ltx/en_us_dedes/he.h.m5:heHE.TaErgaTisOikonomias.name
ltx/en_us_dedes/oc.m5.d2:ocMA.OdeW4C14.mode	@ltx/en_us_dedes/miscellanea:misc.Mode5
ltx/en_us_dedes/oc.m5.d2:ocMA.OdeW4C14.ode	@ltx/en_us_dedes/miscellanea:misc.Ode4
ltx/en_us_dedes/oc.m5.d2:ocMA.OdeW4C14.text	
ltx/en_us_dedes/oc.m5.d2:ocMA.OdeW4C1H.greekmelody	@ltx/en_us_dedes/he.h.m5:heHE.TaErgaTisOikonomias.greekname
ltx/en_us_dedes/oc.m5.d2:ocMA.OdeW4C1H.incipit	@ltx/en_us_dedes/he.h.m5:heHE.TaErgaTisOikonomias.incipit
ltx/en_us_dedes/oc.m5.d2:ocMA.OdeW4C1H.melody	@ltx/en_us_dedes/he.h.m5:heHE.TaErgaTisOikonomias.melody
ltx/en_us_dedes/oc.m5.d2:ocMA.OdeW4C1H.mode	@ltx/en_us_dedes/miscellanea:misc.Mode5
ltx/en_us_dedes/oc.m5.d2:ocMA.OdeW4C1H.ode	@ltx/en_us_dedes/miscellanea:misc.Ode4
ltx/en_us_dedes/oc.m5.d2:ocMA.OdeW4C1H.text	@ltx/en_us_dedes/he.h.m5:heHE.TaErgaTisOikonomias.text
ltx/en_us_dedes/oc.m5.d2:ocMA.OdeW4C1T.incipit	…
ltx/en_us_dedes/oc.m5.d2:ocMA.OdeW4C1T.melody	@ltx/en_us_dedes/he.h.m5:heHE.TaErgaTisOikonomias.name
ltx/en_us_dedes/oc.m5.d2:ocMA.OdeW4C1T.mode	@ltx/en_us_dedes/miscellanea:misc.Mode5
ltx/en_us_dedes/oc.m5.d2:ocMA.OdeW4C1T.ode	@ltx/en_us_dedes/miscellanea:misc.Ode4
ltx/en_us_dedes/oc.m5.d2:ocMA.OdeW4C1T.text	
ltx/en_us_dedes/oc.m5.d2:ocMA.OdeW4C21.greekmelody	@ltx/en_us_dedes/he.h.m5:heHE.TinTheianEnnoisas.greekname
ltx/en_us_dedes/oc.m5.d2:ocMA.OdeW4C21.incipit	…
ltx/en_us_dedes/oc.m5.d2:ocMA.OdeW4C21.melody	@ltx/en_us_dedes/he.h.m5:heHE.TinTheianEnnoisas.name
ltx/en_us_dedes/oc.m5.d2:ocMA.OdeW4C21.mode	@ltx/en_us_dedes/miscellanea:misc.Mode5
ltx/en_us_dedes/oc.m5.d2:ocMA.OdeW4C21.ode	@ltx/en_us_dedes/miscellanea:misc.Ode4
ltx/en_us_dedes/oc.m5.d2:ocMA.OdeW4C21.text	
ltx/en_us_dedes/oc.m5.d2:ocMA.OdeW4C22.incipit	…
ltx/en_us_dedes/oc.m5.d2:ocMA.OdeW4C22.melody	@ltx/en_us_dedes/he.h.m5:heHE.TinTheianEnnoisas.name
ltx/en_us_dedes/oc.m5.d2:ocMA.OdeW4C22.mode	@ltx/en_us_dedes/miscellanea:misc.Mode5
ltx/en_us_dedes/oc.m5.d2:ocMA.OdeW4C22.ode	@ltx/en_us_dedes/miscellanea:misc.Ode4
ltx/en_us_dedes/oc.m5.d2:ocMA.OdeW4C22.text	
ltx/en_us_dedes/oc.m5.d2:ocMA.OdeW4C2T.incipit	…
ltx/en_us_dedes/oc.m5.d2:ocMA.OdeW4C2T.melody	@ltx/en_us_dedes/he.h.m5:heHE.TinTheianEnnoisas.name
ltx/en_us_dedes/oc.m5.d2:ocMA.OdeW4C2T.mode	@ltx/en_us_dedes/miscellanea:misc.Mode5
ltx/en_us_dedes/oc.m5.d2:ocMA.OdeW4C2T.ode	@ltx/en_us_dedes/miscellanea:misc.Ode4
ltx/en_us_dedes/oc.m5.d2:ocMA.OdeW4C2T.text	
ltx/en_us_dedes/oc.m5.d2:ocMA.OdeW5C11.incipit	…
ltx/en_us_dedes/oc.m5.d2:ocMA.OdeW5C11.melody	@ltx/en_us_dedes/he.h.m5:heHE.ToFosToAlithinon.name
ltx/en_us_dedes/oc.m5.d2:ocMA.OdeW5C11.mode	@ltx/en_us_dedes/miscellanea:misc.Mode5
ltx/en_us_dedes/oc.m5.d2:ocMA.OdeW5C11.ode	@ltx/en_us_dedes/miscellanea:misc.Ode5
ltx/en_us_dedes/oc.m5.d2:ocMA.OdeW5C11.text	
ltx/en_us_dedes/oc.m5.d2:ocMA.OdeW5C12.incipit	…
ltx/en_us_dedes/oc.m5.d2:ocMA.OdeW5C12.melody	@ltx/en_us_dedes/he.h.m5:heHE.ToFosToAlithinon.name
ltx/en_us_dedes/oc.m5.d2:ocMA.OdeW5C12.mode	@ltx/en_us_dedes/miscellanea:misc.Mode5
ltx/en_us_dedes/oc.m5.d2:ocMA.OdeW5C12.ode	@ltx/en_us_dedes/miscellanea:misc.Ode5
ltx/en_us_dedes/oc.m5.d2:ocMA.OdeW5C12.text	
ltx/en_us_dedes/oc.m5.d2:ocMA.OdeW5C13.incipit	…
ltx/en_us_dedes/oc.m5.d2:ocMA.OdeW5C13.melody	@ltx/en_us_dedes/he.h.m5:heHE.ToFosToAlithinon.name
ltx/en_us_dedes/oc.m5.d2:ocMA.OdeW5C13.mode	@ltx/en_us_dedes/miscellanea:misc.Mode5
ltx/en_us_dedes/oc.m5.d2:ocMA.OdeW5C13.ode	@ltx/en_us_dedes/miscellanea:misc.Ode5
ltx/en_us_dedes/oc.m5.d2:ocMA.OdeW5C13.text	
ltx/en_us_dedes/oc.m5.d2:ocMA.OdeW5C14.incipit	…
ltx/en_us_dedes/oc.m5.d2:ocMA.OdeW5C14.melody	@ltx/en_us_dedes/he.h.m5:heHE.ToFosToAlithinon.name
ltx/en_us_dedes/oc.m5.d2:ocMA.OdeW5C14.mode	@ltx/en_us_dedes/miscellanea:misc.Mode5
ltx/en_us_dedes/oc.m5.d2:ocMA.OdeW5C14.ode	@ltx/en_us_dedes/miscellanea:misc.Ode5
ltx/en_us_dedes/oc.m5.d2:ocMA.OdeW5C14.text	
ltx/en_us_dedes/oc.m5.d2:ocMA.OdeW5C1H.greekmelody	@ltx/en_us_dedes/he.h.m5:heHE.ToFosToAlithinon.greekname
ltx/en_us_dedes/oc.m5.d2:ocMA.OdeW5C1H.incipit	@ltx/en_us_dedes/he.h.m5:heHE.ToFosToAlithinon.incipit
ltx/en_us_dedes/oc.m5.d2:ocMA.OdeW5C1H.melody	@ltx/en_us_dedes/he.h.m5:heHE.ToFosToAlithinon.melody
ltx/en_us_dedes/oc.m5.d2:ocMA.OdeW5C1H.mode	@ltx/en_us_dedes/miscellanea:misc.Mode5
ltx/en_us_dedes/oc.m5.d2:ocMA.OdeW5C1H.ode	@ltx/en_us_dedes/miscellanea:misc.Ode5
ltx/en_us_dedes/oc.m5.d2:ocMA.OdeW5C1H.text	@ltx/en_us_dedes/he.h.m5:heHE.ToFosToAlithinon.text
ltx/en_us_dedes/oc.m5.d2:ocMA.OdeW5C1T.incipit	…
ltx/en_us_dedes/oc.m5.d2:ocMA.OdeW5C1T.melody	@ltx/en_us_dedes/he.h.m5:heHE.ToFosToAlithinon.name
ltx/en_us_dedes/oc.m5.d2:ocMA.OdeW5C1T.mode	@ltx/en_us_dedes/miscellanea:misc.Mode5
ltx/en_us_dedes/oc.m5.d2:ocMA.OdeW5C1T.ode	@ltx/en_us_dedes/miscellanea:misc.Ode5
ltx/en_us_dedes/oc.m5.d2:ocMA.OdeW5C1T.text	
ltx/en_us_dedes/oc.m5.d2:ocMA.OdeW5C21.greekmelody	@ltx/en_us_dedes/he.h.m5:heHE.OAnavallomenos.greekname
ltx/en_us_dedes/oc.m5.d2:ocMA.OdeW5C21.incipit	…
ltx/en_us_dedes/oc.m5.d2:ocMA.OdeW5C21.melody	@ltx/en_us_dedes/he.h.m5:heHE.OAnavallomenos.name
ltx/en_us_dedes/oc.m5.d2:ocMA.OdeW5C21.mode	@ltx/en_us_dedes/miscellanea:misc.Mode5
ltx/en_us_dedes/oc.m5.d2:ocMA.OdeW5C21.ode	@ltx/en_us_dedes/miscellanea:misc.Ode5
ltx/en_us_dedes/oc.m5.d2:ocMA.OdeW5C21.text	
ltx/en_us_dedes/oc.m5.d2:ocMA.OdeW5C22.incipit	…
ltx/en_us_dedes/oc.m5.d2:ocMA.OdeW5C22.melody	@ltx/en_us_dedes/he.h.m5:heHE.OAnavallomenos.name
ltx/en_us_dedes/oc.m5.d2:ocMA.OdeW5C22.mode	@ltx/en_us_dedes/miscellanea:misc.Mode5
ltx/en_us_dedes/oc.m5.d2:ocMA.OdeW5C22.ode	@ltx/en_us_dedes/miscellanea:misc.Ode5
ltx/en_us_dedes/oc.m5.d2:ocMA.OdeW5C22.text	
ltx/en_us_dedes/oc.m5.d2:ocMA.OdeW5C2T.incipit	…
ltx/en_us_dedes/oc.m5.d2:ocMA.OdeW5C2T.melody	@ltx/en_us_dedes/he.h.m5:heHE.OAnavallomenos.name
ltx/en_us_dedes/oc.m5.d2:ocMA.OdeW5C2T.mode	@ltx/en_us_dedes/miscellanea:misc.Mode5
ltx/en_us_dedes/oc.m5.d2:ocMA.OdeW5C2T.ode	@ltx/en_us_dedes/miscellanea:misc.Ode5
ltx/en_us_dedes/oc.m5.d2:ocMA.OdeW5C2T.text	
ltx/en_us_dedes/oc.m5.d2:ocMA.OdeW6C11.incipit	…
ltx/en_us_dedes/oc.m5.d2:ocMA.OdeW6C11.melody	@ltx/en_us_dedes/he.h.m5:heHE.TouKitousTonProfitin.name
ltx/en_us_dedes/oc.m5.d2:ocMA.OdeW6C11.mode	@ltx/en_us_dedes/miscellanea:misc.Mode5
ltx/en_us_dedes/oc.m5.d2:ocMA.OdeW6C11.ode	@ltx/en_us_dedes/miscellanea:misc.Ode6
ltx/en_us_dedes/oc.m5.d2:ocMA.OdeW6C11.text	
ltx/en_us_dedes/oc.m5.d2:ocMA.OdeW6C12.incipit	…
ltx/en_us_dedes/oc.m5.d2:ocMA.OdeW6C12.melody	@ltx/en_us_dedes/he.h.m5:heHE.TouKitousTonProfitin.name
ltx/en_us_dedes/oc.m5.d2:ocMA.OdeW6C12.mode	@ltx/en_us_dedes/miscellanea:misc.Mode5
ltx/en_us_dedes/oc.m5.d2:ocMA.OdeW6C12.ode	@ltx/en_us_dedes/miscellanea:misc.Ode6
ltx/en_us_dedes/oc.m5.d2:ocMA.OdeW6C12.text	
ltx/en_us_dedes/oc.m5.d2:ocMA.OdeW6C13.incipit	…
ltx/en_us_dedes/oc.m5.d2:ocMA.OdeW6C13.melody	@ltx/en_us_dedes/he.h.m5:heHE.TouKitousTonProfitin.name
ltx/en_us_dedes/oc.m5.d2:ocMA.OdeW6C13.mode	@ltx/en_us_dedes/miscellanea:misc.Mode5
ltx/en_us_dedes/oc.m5.d2:ocMA.OdeW6C13.ode	@ltx/en_us_dedes/miscellanea:misc.Ode6
ltx/en_us_dedes/oc.m5.d2:ocMA.OdeW6C13.text	
ltx/en_us_dedes/oc.m5.d2:ocMA.OdeW6C14.incipit	…
ltx/en_us_dedes/oc.m5.d2:ocMA.OdeW6C14.melody	@ltx/en_us_dedes/he.h.m5:heHE.TouKitousTonProfitin.name
ltx/en_us_dedes/oc.m5.d2:ocMA.OdeW6C14.mode	@ltx/en_us_dedes/miscellanea:misc.Mode5
ltx/en_us_dedes/oc.m5.d2:ocMA.OdeW6C14.ode	@ltx/en_us_dedes/miscellanea:misc.Ode6
ltx/en_us_dedes/oc.m5.d2:ocMA.OdeW6C14.text	
ltx/en_us_dedes/oc.m5.d2:ocMA.OdeW6C1H.greekmelody	@ltx/en_us_dedes/he.h.m5:heHE.TouKitousTonProfitin.greekname
ltx/en_us_dedes/oc.m5.d2:ocMA.OdeW6C1H.incipit	@ltx/en_us_dedes/he.h.m5:heHE.TouKitousTonProfitin.incipit
ltx/en_us_dedes/oc.m5.d2:ocMA.OdeW6C1H.melody	@ltx/en_us_dedes/he.h.m5:heHE.TouKitousTonProfitin.melody
ltx/en_us_dedes/oc.m5.d2:ocMA.OdeW6C1H.mode	@ltx/en_us_dedes/miscellanea:misc.Mode5
ltx/en_us_dedes/oc.m5.d2:ocMA.OdeW6C1H.ode	@ltx/en_us_dedes/miscellanea:misc.Ode6
ltx/en_us_dedes/oc.m5.d2:ocMA.OdeW6C1H.text	@ltx/en_us_dedes/he.h.m5:heHE.TouKitousTonProfitin.text
ltx/en_us_dedes/oc.m5.d2:ocMA.OdeW6C1T.incipit	…
ltx/en_us_dedes/oc.m5.d2:ocMA.OdeW6C1T.melody	@ltx/en_us_dedes/he.h.m5:heHE.TouKitousTonProfitin.name
ltx/en_us_dedes/oc.m5.d2:ocMA.OdeW6C1T.mode	@ltx/en_us_dedes/miscellanea:misc.Mode5
ltx/en_us_dedes/oc.m5.d2:ocMA.OdeW6C1T.ode	@ltx/en_us_dedes/miscellanea:misc.Ode6
ltx/en_us_dedes/oc.m5.d2:ocMA.OdeW6C1T.text	
ltx/en_us_dedes/oc.m5.d2:ocMA.OdeW6C21.greekmelody	@ltx/en_us_dedes/he.h.m5:heHE.MainomeninKlydoni.greekname
ltx/en_us_dedes/oc.m5.d2:ocMA.OdeW6C21.incipit	…
ltx/en_us_dedes/oc.m5.d2:ocMA.OdeW6C21.melody	@ltx/en_us_dedes/he.h.m5:heHE.MainomeninKlydoni.name
ltx/en_us_dedes/oc.m5.d2:ocMA.OdeW6C21.mode	@ltx/en_us_dedes/miscellanea:misc.Mode5
ltx/en_us_dedes/oc.m5.d2:ocMA.OdeW6C21.ode	@ltx/en_us_dedes/miscellanea:misc.Ode6
ltx/en_us_dedes/oc.m5.d2:ocMA.OdeW6C21.text	
ltx/en_us_dedes/oc.m5.d2:ocMA.OdeW6C2T.incipit	…
ltx/en_us_dedes/oc.m5.d2:ocMA.OdeW6C2T.melody	@ltx/en_us_dedes/he.h.m5:heHE.MainomeninKlydoni.name
ltx/en_us_dedes/oc.m5.d2:ocMA.OdeW6C2T.mode	@ltx/en_us_dedes/miscellanea:misc.Mode5
ltx/en_us_dedes/oc.m5.d2:ocMA.OdeW6C2T.ode	@ltx/en_us_dedes/miscellanea:misc.Ode6
ltx/en_us_dedes/oc.m5.d2:ocMA.OdeW6C2T.text	
ltx/en_us_dedes/oc.m5.d2:ocMA.OdeW7C11.incipit	…
ltx/en_us_dedes/oc.m5.d2:ocMA.OdeW7C11.melody	@ltx/en_us_dedes/he.h.m5:heHE.EvlogitosEiOTheos.name
ltx/en_us_dedes/oc.m5.d2:ocMA.OdeW7C11.mode	@ltx/en_us_dedes/miscellanea:misc.Mode5
ltx/en_us_dedes/oc.m5.d2:ocMA.OdeW7C11.ode	@ltx/en_us_dedes/miscellanea:misc.Ode7
ltx/en_us_dedes/oc.m5.d2:ocMA.OdeW7C11.text	
ltx/en_us_dedes/oc.m5.d2:ocMA.OdeW7C12.incipit	…
ltx/en_us_dedes/oc.m5.d2:ocMA.OdeW7C12.melody	@ltx/en_us_dedes/he.h.m5:heHE.EvlogitosEiOTheos.name
ltx/en_us_dedes/oc.m5.d2:ocMA.OdeW7C12.mode	@ltx/en_us_dedes/miscellanea:misc.Mode5
ltx/en_us_dedes/oc.m5.d2:ocMA.OdeW7C12.ode	@ltx/en_us_dedes/miscellanea:misc.Ode7
ltx/en_us_dedes/oc.m5.d2:ocMA.OdeW7C12.text	
ltx/en_us_dedes/oc.m5.d2:ocMA.OdeW7C13.incipit	…
ltx/en_us_dedes/oc.m5.d2:ocMA.OdeW7C13.melody	@ltx/en_us_dedes/he.h.m5:heHE.EvlogitosEiOTheos.name
ltx/en_us_dedes/oc.m5.d2:ocMA.OdeW7C13.mode	@ltx/en_us_dedes/miscellanea:misc.Mode5
ltx/en_us_dedes/oc.m5.d2:ocMA.OdeW7C13.ode	@ltx/en_us_dedes/miscellanea:misc.Ode7
ltx/en_us_dedes/oc.m5.d2:ocMA.OdeW7C13.text	
ltx/en_us_dedes/oc.m5.d2:ocMA.OdeW7C14.incipit	…
ltx/en_us_dedes/oc.m5.d2:ocMA.OdeW7C14.melody	@ltx/en_us_dedes/he.h.m5:heHE.EvlogitosEiOTheos.name
ltx/en_us_dedes/oc.m5.d2:ocMA.OdeW7C14.mode	@ltx/en_us_dedes/miscellanea:misc.Mode5
ltx/en_us_dedes/oc.m5.d2:ocMA.OdeW7C14.ode	@ltx/en_us_dedes/miscellanea:misc.Ode7
ltx/en_us_dedes/oc.m5.d2:ocMA.OdeW7C14.text	
ltx/en_us_dedes/oc.m5.d2:ocMA.OdeW7C1H.greekmelody	@ltx/en_us_dedes/he.h.m5:heHE.EvlogitosEiOTheos.greekname
ltx/en_us_dedes/oc.m5.d2:ocMA.OdeW7C1H.incipit	@ltx/en_us_dedes/he.h.m5:heHE.EvlogitosEiOTheos.incipit
ltx/en_us_dedes/oc.m5.d2:ocMA.OdeW7C1H.melody	@ltx/en_us_dedes/he.h.m5:heHE.EvlogitosEiOTheos.melody
ltx/en_us_dedes/oc.m5.d2:ocMA.OdeW7C1H.mode	@ltx/en_us_dedes/miscellanea:misc.Mode5
ltx/en_us_dedes/oc.m5.d2:ocMA.OdeW7C1H.ode	@ltx/en_us_dedes/miscellanea:misc.Ode7
ltx/en_us_dedes/oc.m5.d2:ocMA.OdeW7C1H.text	@ltx/en_us_dedes/he.h.m5:heHE.EvlogitosEiOTheos.text
ltx/en_us_dedes/oc.m5.d2:ocMA.OdeW7C1T.incipit	…
ltx/en_us_dedes/oc.m5.d2:ocMA.OdeW7C1T.melody	@ltx/en_us_dedes/he.h.m5:heHE.EvlogitosEiOTheos.name
ltx/en_us_dedes/oc.m5.d2:ocMA.OdeW7C1T.mode	@ltx/en_us_dedes/miscellanea:misc.Mode5
ltx/en_us_dedes/oc.m5.d2:ocMA.OdeW7C1T.ode	@ltx/en_us_dedes/miscellanea:misc.Ode7
ltx/en_us_dedes/oc.m5.d2:ocMA.OdeW7C1T.text	
ltx/en_us_dedes/oc.m5.d2:ocMA.OdeW7C21.greekmelody	@ltx/en_us_dedes/he.h.m5:heHE.OYperypsoumenos.greekname
ltx/en_us_dedes/oc.m5.d2:ocMA.OdeW7C21.incipit	…
ltx/en_us_dedes/oc.m5.d2:ocMA.OdeW7C21.melody	@ltx/en_us_dedes/he.h.m5:heHE.OYperypsoumenos.name
ltx/en_us_dedes/oc.m5.d2:ocMA.OdeW7C21.mode	@ltx/en_us_dedes/miscellanea:misc.Mode5
ltx/en_us_dedes/oc.m5.d2:ocMA.OdeW7C21.ode	@ltx/en_us_dedes/miscellanea:misc.Ode7
ltx/en_us_dedes/oc.m5.d2:ocMA.OdeW7C21.text	
ltx/en_us_dedes/oc.m5.d2:ocMA.OdeW7C22.incipit	…
ltx/en_us_dedes/oc.m5.d2:ocMA.OdeW7C22.melody	@ltx/en_us_dedes/he.h.m5:heHE.OYperypsoumenos.name
ltx/en_us_dedes/oc.m5.d2:ocMA.OdeW7C22.mode	@ltx/en_us_dedes/miscellanea:misc.Mode5
ltx/en_us_dedes/oc.m5.d2:ocMA.OdeW7C22.ode	@ltx/en_us_dedes/miscellanea:misc.Ode7
ltx/en_us_dedes/oc.m5.d2:ocMA.OdeW7C22.text	
ltx/en_us_dedes/oc.m5.d2:ocMA.OdeW7C2T.incipit	…
ltx/en_us_dedes/oc.m5.d2:ocMA.OdeW7C2T.melody	@ltx/en_us_dedes/he.h.m5:heHE.OYperypsoumenos.name
ltx/en_us_dedes/oc.m5.d2:ocMA.OdeW7C2T.mode	@ltx/en_us_dedes/miscellanea:misc.Mode5
ltx/en_us_dedes/oc.m5.d2:ocMA.OdeW7C2T.ode	@ltx/en_us_dedes/miscellanea:misc.Ode7
ltx/en_us_dedes/oc.m5.d2:ocMA.OdeW7C2T.text	
ltx/en_us_dedes/oc.m5.d2:ocMA.OdeW8C11.incipit	…
ltx/en_us_dedes/oc.m5.d2:ocMA.OdeW8C11.melody	@ltx/en_us_dedes/he.h.m5:heHE.TonPoiitinTisKtiseos.name
ltx/en_us_dedes/oc.m5.d2:ocMA.OdeW8C11.mode	@ltx/en_us_dedes/miscellanea:misc.Mode5
ltx/en_us_dedes/oc.m5.d2:ocMA.OdeW8C11.ode	@ltx/en_us_dedes/miscellanea:misc.Ode8
ltx/en_us_dedes/oc.m5.d2:ocMA.OdeW8C11.text	
ltx/en_us_dedes/oc.m5.d2:ocMA.OdeW8C12.incipit	…
ltx/en_us_dedes/oc.m5.d2:ocMA.OdeW8C12.melody	@ltx/en_us_dedes/he.h.m5:heHE.TonPoiitinTisKtiseos.name
ltx/en_us_dedes/oc.m5.d2:ocMA.OdeW8C12.mode	@ltx/en_us_dedes/miscellanea:misc.Mode5
ltx/en_us_dedes/oc.m5.d2:ocMA.OdeW8C12.ode	@ltx/en_us_dedes/miscellanea:misc.Ode8
ltx/en_us_dedes/oc.m5.d2:ocMA.OdeW8C12.text	
ltx/en_us_dedes/oc.m5.d2:ocMA.OdeW8C13.incipit	…
ltx/en_us_dedes/oc.m5.d2:ocMA.OdeW8C13.melody	@ltx/en_us_dedes/he.h.m5:heHE.TonPoiitinTisKtiseos.name
ltx/en_us_dedes/oc.m5.d2:ocMA.OdeW8C13.mode	@ltx/en_us_dedes/miscellanea:misc.Mode5
ltx/en_us_dedes/oc.m5.d2:ocMA.OdeW8C13.ode	@ltx/en_us_dedes/miscellanea:misc.Ode8
ltx/en_us_dedes/oc.m5.d2:ocMA.OdeW8C13.text	
ltx/en_us_dedes/oc.m5.d2:ocMA.OdeW8C14.incipit	…
ltx/en_us_dedes/oc.m5.d2:ocMA.OdeW8C14.melody	@ltx/en_us_dedes/he.h.m5:heHE.TonPoiitinTisKtiseos.name
ltx/en_us_dedes/oc.m5.d2:ocMA.OdeW8C14.mode	@ltx/en_us_dedes/miscellanea:misc.Mode5
ltx/en_us_dedes/oc.m5.d2:ocMA.OdeW8C14.ode	@ltx/en_us_dedes/miscellanea:misc.Ode8
ltx/en_us_dedes/oc.m5.d2:ocMA.OdeW8C14.text	
ltx/en_us_dedes/oc.m5.d2:ocMA.OdeW8C1H.greekmelody	@ltx/en_us_dedes/he.h.m5:heHE.TonPoiitinTisKtiseos.greekname
ltx/en_us_dedes/oc.m5.d2:ocMA.OdeW8C1H.incipit	@ltx/en_us_dedes/he.h.m5:heHE.TonPoiitinTisKtiseos.incipit
ltx/en_us_dedes/oc.m5.d2:ocMA.OdeW8C1H.melody	@ltx/en_us_dedes/he.h.m5:heHE.TonPoiitinTisKtiseos.melody
ltx/en_us_dedes/oc.m5.d2:ocMA.OdeW8C1H.mode	@ltx/en_us_dedes/miscellanea:misc.Mode5
ltx/en_us_dedes/oc.m5.d2:ocMA.OdeW8C1H.ode	@ltx/en_us_dedes/miscellanea:misc.Ode8
ltx/en_us_dedes/oc.m5.d2:ocMA.OdeW8C1H.text	@ltx/en_us_dedes/he.h.m5:heHE.TonPoiitinTisKtiseos.text
ltx/en_us_dedes/oc.m5.d2:ocMA.OdeW8C1T.incipit	…
ltx/en_us_dedes/oc.m5.d2:ocMA.OdeW8C1T.melody	@ltx/en_us_dedes/he.h.m5:heHE.TonPoiitinTisKtiseos.name
ltx/en_us_dedes/oc.m5.d2:ocMA.OdeW8C1T.mode	@ltx/en_us_dedes/miscellanea:misc.Mode5
ltx/en_us_dedes/oc.m5.d2:ocMA.OdeW8C1T.ode	@ltx/en_us_dedes/miscellanea:misc.Ode8
ltx/en_us_dedes/oc.m5.d2:ocMA.OdeW8C1T.text	
ltx/en_us_dedes/oc.m5.d2:ocMA.OdeW8C21.greekmelody	@ltx/en_us_dedes/he.h.m5:heHE.SoiToPantourgo.greekname
ltx/en_us_dedes/oc.m5.d2:ocMA.OdeW8C21.incipit	…
ltx/en_us_dedes/oc.m5.d2:ocMA.OdeW8C21.melody	@ltx/en_us_dedes/he.h.m5:heHE.SoiToPantourgo.name
ltx/en_us_dedes/oc.m5.d2:ocMA.OdeW8C21.mode	@ltx/en_us_dedes/miscellanea:misc.Mode5
ltx/en_us_dedes/oc.m5.d2:ocMA.OdeW8C21.ode	@ltx/en_us_dedes/miscellanea:misc.Ode8
ltx/en_us_dedes/oc.m5.d2:ocMA.OdeW8C21.text	
ltx/en_us_dedes/oc.m5.d2:ocMA.OdeW8C22.incipit	…
ltx/en_us_dedes/oc.m5.d2:ocMA.OdeW8C22.melody	@ltx/en_us_dedes/he.h.m5:heHE.SoiToPantourgo.name
ltx/en_us_dedes/oc.m5.d2:ocMA.OdeW8C22.mode	@ltx/en_us_dedes/miscellanea:misc.Mode5
ltx/en_us_dedes/oc.m5.d2:ocMA.OdeW8C22.ode	@ltx/en_us_dedes/miscellanea:misc.Ode8
ltx/en_us_dedes/oc.m5.d2:ocMA.OdeW8C22.text	
ltx/en_us_dedes/oc.m5.d2:ocMA.OdeW8C2T.incipit	…
ltx/en_us_dedes/oc.m5.d2:ocMA.OdeW8C2T.melody	@ltx/en_us_dedes/he.h.m5:heHE.SoiToPantourgo.name
ltx/en_us_dedes/oc.m5.d2:ocMA.OdeW8C2T.mode	@ltx/en_us_dedes/miscellanea:misc.Mode5
ltx/en_us_dedes/oc.m5.d2:ocMA.OdeW8C2T.ode	@ltx/en_us_dedes/miscellanea:misc.Ode8
ltx/en_us_dedes/oc.m5.d2:ocMA.OdeW8C2T.text	
ltx/en_us_dedes/oc.m5.d2:ocMA.OdeW9C11.incipit	…
ltx/en_us_dedes/oc.m5.d2:ocMA.OdeW9C11.melody	@ltx/en_us_dedes/he.h.m5:heHE.SeTinMakarianEnGynaixi.name
ltx/en_us_dedes/oc.m5.d2:ocMA.OdeW9C11.mode	@ltx/en_us_dedes/miscellanea:misc.Mode5
ltx/en_us_dedes/oc.m5.d2:ocMA.OdeW9C11.ode	@ltx/en_us_dedes/miscellanea:misc.Ode9
ltx/en_us_dedes/oc.m5.d2:ocMA.OdeW9C11.text	
ltx/en_us_dedes/oc.m5.d2:ocMA.OdeW9C12.incipit	…
ltx/en_us_dedes/oc.m5.d2:ocMA.OdeW9C12.melody	@ltx/en_us_dedes/he.h.m5:heHE.SeTinMakarianEnGynaixi.name
ltx/en_us_dedes/oc.m5.d2:ocMA.OdeW9C12.mode	@ltx/en_us_dedes/miscellanea:misc.Mode5
ltx/en_us_dedes/oc.m5.d2:ocMA.OdeW9C12.ode	@ltx/en_us_dedes/miscellanea:misc.Ode9
ltx/en_us_dedes/oc.m5.d2:ocMA.OdeW9C12.text	
ltx/en_us_dedes/oc.m5.d2:ocMA.OdeW9C13.incipit	…
ltx/en_us_dedes/oc.m5.d2:ocMA.OdeW9C13.melody	@ltx/en_us_dedes/he.h.m5:heHE.SeTinMakarianEnGynaixi.name
ltx/en_us_dedes/oc.m5.d2:ocMA.OdeW9C13.mode	@ltx/en_us_dedes/miscellanea:misc.Mode5
ltx/en_us_dedes/oc.m5.d2:ocMA.OdeW9C13.ode	@ltx/en_us_dedes/miscellanea:misc.Ode9
ltx/en_us_dedes/oc.m5.d2:ocMA.OdeW9C13.text	
ltx/en_us_dedes/oc.m5.d2:ocMA.OdeW9C14.incipit	…
ltx/en_us_dedes/oc.m5.d2:ocMA.OdeW9C14.melody	@ltx/en_us_dedes/he.h.m5:heHE.SeTinMakarianEnGynaixi.name
ltx/en_us_dedes/oc.m5.d2:ocMA.OdeW9C14.mode	@ltx/en_us_dedes/miscellanea:misc.Mode5
ltx/en_us_dedes/oc.m5.d2:ocMA.OdeW9C14.ode	@ltx/en_us_dedes/miscellanea:misc.Ode9
ltx/en_us_dedes/oc.m5.d2:ocMA.OdeW9C14.text	
ltx/en_us_dedes/oc.m5.d2:ocMA.OdeW9C1H.greekmelody	@ltx/en_us_dedes/he.h.m5:heHE.SeTinMakarianEnGynaixi.greekname
ltx/en_us_dedes/oc.m5.d2:ocMA.OdeW9C1H.incipit	@ltx/en_us_dedes/he.h.m5:heHE.SeTinMakarianEnGynaixi.incipit
ltx/en_us_dedes/oc.m5.d2:ocMA.OdeW9C1H.melody	@ltx/en_us_dedes/he.h.m5:heHE.SeTinMakarianEnGynaixi.melody
ltx/en_us_dedes/oc.m5.d2:ocMA.OdeW9C1H.mode	@ltx/en_us_dedes/miscellanea:misc.Mode5
ltx/en_us_dedes/oc.m5.d2:ocMA.OdeW9C1H.ode	@ltx/en_us_dedes/miscellanea:misc.Ode9
ltx/en_us_dedes/oc.m5.d2:ocMA.OdeW9C1H.text	@ltx/en_us_dedes/he.h.m5:heHE.SeTinMakarianEnGynaixi.text
ltx/en_us_dedes/oc.m5.d2:ocMA.OdeW9C1T.incipit	…
ltx/en_us_dedes/oc.m5.d2:ocMA.OdeW9C1T.melody	@ltx/en_us_dedes/he.h.m5:heHE.SeTinMakarianEnGynaixi.name
ltx/en_us_dedes/oc.m5.d2:ocMA.OdeW9C1T.mode	@ltx/en_us_dedes/miscellanea:misc.Mode5
ltx/en_us_dedes/oc.m5.d2:ocMA.OdeW9C1T.ode	@ltx/en_us_dedes/miscellanea:misc.Ode9
ltx/en_us_dedes/oc.m5.d2:ocMA.OdeW9C1T.text	
ltx/en_us_dedes/oc.m5.d2:ocMA.OdeW9C21.greekmelody	@ltx/en_us_dedes/he.h.m5:heHE.IsaiaChoreve.greekname
ltx/en_us_dedes/oc.m5.d2:ocMA.OdeW9C21.incipit	…
ltx/en_us_dedes/oc.m5.d2:ocMA.OdeW9C21.melody	@ltx/en_us_dedes/he.h.m5:heHE.IsaiaChoreve.name
ltx/en_us_dedes/oc.m5.d2:ocMA.OdeW9C21.mode	@ltx/en_us_dedes/miscellanea:misc.Mode5
ltx/en_us_dedes/oc.m5.d2:ocMA.OdeW9C21.ode	@ltx/en_us_dedes/miscellanea:misc.Ode9
ltx/en_us_dedes/oc.m5.d2:ocMA.OdeW9C21.text	
ltx/en_us_dedes/oc.m5.d2:ocMA.OdeW9C22.incipit	…
ltx/en_us_dedes/oc.m5.d2:ocMA.OdeW9C22.melody	@ltx/en_us_dedes/he.h.m5:heHE.IsaiaChoreve.name
ltx/en_us_dedes/oc.m5.d2:ocMA.OdeW9C22.mode	@ltx/en_us_dedes/miscellanea:misc.Mode5
ltx/en_us_dedes/oc.m5.d2:ocMA.OdeW9C22.ode	@ltx/en_us_dedes/miscellanea:misc.Ode9
ltx/en_us_dedes/oc.m5.d2:ocMA.OdeW9C22.text	
ltx/en_us_dedes/oc.m5.d2:ocMA.OdeW9C2T.incipit	…
ltx/en_us_dedes/oc.m5.d2:ocMA.OdeW9C2T.melody	@ltx/en_us_dedes/he.h.m5:heHE.IsaiaChoreve.name
ltx/en_us_dedes/oc.m5.d2:ocMA.OdeW9C2T.mode	@ltx/en_us_dedes/miscellanea:misc.Mode5
ltx/en_us_dedes/oc.m5.d2:ocMA.OdeW9C2T.ode	@ltx/en_us_dedes/miscellanea:misc.Ode9
ltx/en_us_dedes/oc.m5.d2:ocMA.OdeW9C2T.text	
ltx/en_us_dedes/oc.m5.d2:ocVE.ApolTheotokionVM.incipit	The heavens with the Angels…
ltx/en_us_dedes/oc.m5.d2:ocVE.ApolTheotokionVM.melody	
ltx/en_us_dedes/oc.m5.d2:ocVE.ApolTheotokionVM.mode	@ltx/en_us_dedes/miscellanea:misc.Mode5
ltx/en_us_dedes/oc.m5.d2:ocVE.ApolTheotokionVM.text	The heavens with the Angels, and the earth with humanity, shout to you, O Theotokos, with a voice of exultation. Rejoice, O Gate, wider than the heavens; rejoice, the only salvation for us born on earth. Rejoice, O Maiden full of grace, and Mother of incarnate God.
ltx/en_us_dedes/oc.m5.d2:ocVE.AposTheotokion.incipit	How awesome and extraordinary and…
ltx/en_us_dedes/oc.m5.d2:ocVE.AposTheotokion.melody	
ltx/en_us_dedes/oc.m5.d2:ocVE.AposTheotokion.mode	@ltx/en_us_dedes/miscellanea:misc.Mode5
ltx/en_us_dedes/oc.m5.d2:ocVE.AposTheotokion.text	How awesome and extraordinary and great is the mystery! The Uncontainable is contained in a womb, and after birth the mother remained a virgin still. For it was God Whom she bore, become incarnate from her. To Him let us cry aloud, to Him let us exclaim our hymn, and let us sing with the Angels: Holy are You, O Christ our God, who for us became a man. Glory to You.
ltx/en_us_dedes/oc.m5.d2:ocVE.Aposticha1.incipit	I do not desist…
ltx/en_us_dedes/oc.m5.d2:ocVE.Aposticha1.melody	
ltx/en_us_dedes/oc.m5.d2:ocVE.Aposticha1.mode	@ltx/en_us_dedes/miscellanea:misc.Mode5
ltx/en_us_dedes/oc.m5.d2:ocVE.Aposticha1.text	I do not desist from committing sins; and as the recipient of Your benevolence, I am unaware. Overcome my hardness of heart, only good Lord, and have mercy.
ltx/en_us_dedes/oc.m5.d2:ocVE.Aposticha2.incipit	O Lord, from fear of…
ltx/en_us_dedes/oc.m5.d2:ocVE.Aposticha2.melody	
ltx/en_us_dedes/oc.m5.d2:ocVE.Aposticha2.mode	@ltx/en_us_dedes/miscellanea:misc.Mode5
ltx/en_us_dedes/oc.m5.d2:ocVE.Aposticha2.text	O Lord, from fear of You I am terrified, and even so I cease not from doing evil. In a court of justice who is not terrified of the judge? Or who, wishing to be healed, enrages the physician as I do? Be compassionate towards my infirmity, O forbearing Lord, and have mercy on me.
ltx/en_us_dedes/oc.m5.d2:ocVE.Aposticha3.incipit	You disdained all earthly things…
ltx/en_us_dedes/oc.m5.d2:ocVE.Aposticha3.melody	
ltx/en_us_dedes/oc.m5.d2:ocVE.Aposticha3.mode	@ltx/en_us_dedes/miscellanea:misc.Mode5
ltx/en_us_dedes/oc.m5.d2:ocVE.Aposticha3.text	You disdained all earthly things, and you manfully defied the tortures. And hence you failed not in your blessed hopes, but became heirs of the Kingdom of heaven, O Martyrs, extolled throughout the world. Since to our humane God you speak with freedom, ask for peace for the world, and great mercy upon our souls.
ltx/en_us_dedes/oc.m5.d2:ocVE.SticTheotokion.greekmelody	@ltx/en_us_dedes/he.a.m5:heAU.ChairoisAskitikon.greekname
ltx/en_us_dedes/oc.m5.d2:ocVE.SticTheotokion.incipit	…
ltx/en_us_dedes/oc.m5.d2:ocVE.SticTheotokion.melody	@ltx/en_us_dedes/he.a.m5:heAU.ChairoisAskitikon.name
ltx/en_us_dedes/oc.m5.d2:ocVE.SticTheotokion.mode	@ltx/en_us_dedes/miscellanea:misc.Mode5
ltx/en_us_dedes/oc.m5.d2:ocVE.SticTheotokion.text	
ltx/en_us_dedes/oc.m5.d2:ocVE.Stichera1.greekmelody	@ltx/en_us_dedes/he.a.m5:heAU.ChairoisAskitikon.greekname
ltx/en_us_dedes/oc.m5.d2:ocVE.Stichera1.incipit	Woe be to me who…
ltx/en_us_dedes/oc.m5.d2:ocVE.Stichera1.melody	@ltx/en_us_dedes/he.a.m5:heAU.ChairoisAskitikon.name
ltx/en_us_dedes/oc.m5.d2:ocVE.Stichera1.mode	@ltx/en_us_dedes/miscellanea:misc.Mode5
ltx/en_us_dedes/oc.m5.d2:ocVE.Stichera1.text	Woe be to me who moved You to wrath, * O my compassionate and merciful Lord and God! * How many times I have promised, * O Christ, that I would repent * and turned out a liar, mindless that I am! * My former baptismal robe have I soiled entirely * and disregarded the agreements I made with You. * And a second time, I have broken my vows to You. * For after having freely donned * this habit of mournfulness, * having professed my vocation * in front of men and the Angels too, * unfaithful have I been. * So, O Savior, do not leave me to perish utterly.
ltx/en_us_dedes/oc.m5.d2:ocVE.Stichera2.incipit	What kind of a defense…
ltx/en_us_dedes/oc.m5.d2:ocVE.Stichera2.melody	@ltx/en_us_dedes/he.a.m5:heAU.ChairoisAskitikon.name
ltx/en_us_dedes/oc.m5.d2:ocVE.Stichera2.mode	@ltx/en_us_dedes/miscellanea:misc.Mode5
ltx/en_us_dedes/oc.m5.d2:ocVE.Stichera2.text	What kind of a defense will you have * the day of judgment, O unfortunate soul of mine? * Or who from the condemnation * of the continual fire * and from all the tortures then shall rescue you? * Nobody unless you cease * to commit your unlawful acts, * and rather take hold of a God-pleasing way of life, * weeping daily for your uncountable trespasses * into which you fall every hour * in word, deed, and thought as well; * and pray to Christ that He grant you * complete forgiveness for all of them. * And thus you will make Him * who is known for His compassion propitious unto you.
ltx/en_us_dedes/oc.m5.d2:ocVE.Stichera3.incipit	…
ltx/en_us_dedes/oc.m5.d2:ocVE.Stichera3.melody	@ltx/en_us_dedes/he.a.m5:heAU.ChairoisAskitikon.name
ltx/en_us_dedes/oc.m5.d2:ocVE.Stichera3.mode	@ltx/en_us_dedes/miscellanea:misc.Mode5
ltx/en_us_dedes/oc.m5.d2:ocVE.Stichera3.text	
ltx/en_us_dedes/oc.m5.d2:ocVE.Stichera4.greekmelody	@ltx/en_us_dedes/he.a.m5:heAU.ChairoisAskitikon.greekname
ltx/en_us_dedes/oc.m5.d2:ocVE.Stichera4.incipit	Holy Archangels, I am distressed…
ltx/en_us_dedes/oc.m5.d2:ocVE.Stichera4.melody	@ltx/en_us_dedes/he.a.m5:heAU.ChairoisAskitikon.name
ltx/en_us_dedes/oc.m5.d2:ocVE.Stichera4.mode	@ltx/en_us_dedes/miscellanea:misc.Mode5
ltx/en_us_dedes/oc.m5.d2:ocVE.Stichera4.text	Holy Archangels, I am distressed * by the excretions of the passions which fill like rheum * the eyes of my heart and darken them; * and I cannot see at all * the ways to salvation. Hence, as I proceed, * I wander about and fall * badly into the pit of hell. * But when recalling all your marvelous miracles, * I receive the healing of all my infirmity. * O that I might now quickly see * your kindly goodwill towards me! * Hasten and put out the flames of * my passions, O spirit messengers. * Release me from evils * and direct me to the light of salvation evermore.
ltx/en_us_dedes/oc.m5.d2:ocVE.Stichera5.incipit	…
ltx/en_us_dedes/oc.m5.d2:ocVE.Stichera5.melody	@ltx/en_us_dedes/he.a.m5:heAU.ChairoisAskitikon.name
ltx/en_us_dedes/oc.m5.d2:ocVE.Stichera5.mode	@ltx/en_us_dedes/miscellanea:misc.Mode5
ltx/en_us_dedes/oc.m5.d2:ocVE.Stichera5.text	
ltx/en_us_dedes/oc.m5.d2:ocVE.Stichera6.incipit	…
ltx/en_us_dedes/oc.m5.d2:ocVE.Stichera6.melody	@ltx/en_us_dedes/he.a.m5:heAU.ChairoisAskitikon.name
ltx/en_us_dedes/oc.m5.d2:ocVE.Stichera6.mode	@ltx/en_us_dedes/miscellanea:misc.Mode5
ltx/en_us_dedes/oc.m5.d2:ocVE.Stichera6.text	
ltx/en_us_dedes/oc.m5.d2:octrMA.Kathisma11.incipit	@ltx/en_us_dedes/oc.m5.d2:ocMA.Kathisma11.incipit
ltx/en_us_dedes/oc.m5.d2:octrMA.Kathisma11.melody	
ltx/en_us_dedes/oc.m5.d2:octrMA.Kathisma11.mode	@ltx/en_us_dedes/miscellanea:misc.Mode5
ltx/en_us_dedes/oc.m5.d2:octrMA.Kathisma11.text	@ltx/en_us_dedes/oc.m5.d2:ocMA.Kathisma11.text
ltx/en_us_dedes/oc.m5.d2:octrMA.Kathisma12.incipit	@ltx/en_us_dedes/oc.m5.d2:ocMA.Kathisma12.incipit
ltx/en_us_dedes/oc.m5.d2:octrMA.Kathisma12.melody	
ltx/en_us_dedes/oc.m5.d2:octrMA.Kathisma12.mode	@ltx/en_us_dedes/miscellanea:misc.Mode5
ltx/en_us_dedes/oc.m5.d2:octrMA.Kathisma12.text	@ltx/en_us_dedes/oc.m5.d2:ocMA.Kathisma12.text
ltx/en_us_dedes/oc.m5.d2:octrMA.Kathisma1T.incipit	@ltx/en_us_dedes/oc.m5.d2:ocVE.ApolTheotokionVM.incipit
ltx/en_us_dedes/oc.m5.d2:octrMA.Kathisma1T.melody	
ltx/en_us_dedes/oc.m5.d2:octrMA.Kathisma1T.mode	@ltx/en_us_dedes/miscellanea:misc.Mode5
ltx/en_us_dedes/oc.m5.d2:octrMA.Kathisma1T.text	@ltx/en_us_dedes/oc.m5.d2:ocVE.ApolTheotokionVM.text
ltx/en_us_dedes/oc.m5.d2:octrMA.Ode7Martyricon.incipit	@ltx/en_us_dedes/oc.m5.d5:ocMA.Kathisma32.incipit
ltx/en_us_dedes/oc.m5.d2:octrMA.Ode7Martyricon.melody	@ltx/en_us_dedes/miscellanea:misc.Automelon
ltx/en_us_dedes/oc.m5.d2:octrMA.Ode7Martyricon.mode	@ltx/en_us_dedes/miscellanea:misc.Mode5
ltx/en_us_dedes/oc.m5.d2:octrMA.Ode7Martyricon.text	@ltx/en_us_dedes/oc.m5.d5:ocMA.Kathisma32.text
ltx/en_us_dedes/oc.m5.d2:octrMA.Photagogic.incipit	O Lord and Giver of…
ltx/en_us_dedes/oc.m5.d2:octrMA.Photagogic.mode	@ltx/en_us_dedes/miscellanea:misc.Mode5
ltx/en_us_dedes/oc.m5.d2:octrMA.Photagogic.text	O Lord and Giver of light, send out Your light and illumine my heart,
ltx/en_us_dedes/oc.m5.d2:octrMA.Triadic1.incipit	It is time to sing…
ltx/en_us_dedes/oc.m5.d2:octrMA.Triadic1.mode	@ltx/en_us_dedes/miscellanea:misc.Mode5
ltx/en_us_dedes/oc.m5.d2:octrMA.Triadic1.text	It is time to sing hymns; it is the hour of prayer. Let us earnestly cry out to our only God: Holy, holy, holy are You our God.
ltx/en_us_dedes/oc.m5.d2:octrMA.Triadic2.incipit	Daring to portray…
ltx/en_us_dedes/oc.m5.d2:octrMA.Triadic2.mode	@ltx/en_us_dedes/miscellanea:misc.Mode5
ltx/en_us_dedes/oc.m5.d2:octrMA.Triadic2.text	Daring to portray Your spiritual armies, O unoriginate Trinity, we cry out with unworthy lips: Holy, holy, holy are You our God.
ltx/en_us_dedes/oc.m5.d2:octrMA.Triadic3.incipit	O Christ our God…
ltx/en_us_dedes/oc.m5.d2:octrMA.Triadic3.mode	@ltx/en_us_dedes/miscellanea:misc.Mode5
ltx/en_us_dedes/oc.m5.d2:octrMA.Triadic3.text	O Christ our God, You were contained in the womb of the Virgin, and never parted from the bosom of the Father. Accept us as we cry to You together with the Angels: Holy, holy, holy are You our God.
ltx/en_us_dedes/oc.m5.d2:octrVE.Stichera1.incipit	@ltx/en_us_dedes/oc.m5.d2:ocVE.Aposticha1.incipit
ltx/en_us_dedes/oc.m5.d2:octrVE.Stichera1.melody	
ltx/en_us_dedes/oc.m5.d2:octrVE.Stichera1.mode	@ltx/en_us_dedes/miscellanea:misc.Mode5
ltx/en_us_dedes/oc.m5.d2:octrVE.Stichera1.text	@ltx/en_us_dedes/oc.m5.d2:ocVE.Aposticha1.text
ltx/en_us_dedes/oc.m5.d2:octrVE.Stichera2.incipit	@ltx/en_us_dedes/oc.m5.d2:ocVE.Aposticha2.incipit
ltx/en_us_dedes/oc.m5.d2:octrVE.Stichera2.melody	
ltx/en_us_dedes/oc.m5.d2:octrVE.Stichera2.mode	@ltx/en_us_dedes/miscellanea:misc.Mode5
ltx/en_us_dedes/oc.m5.d2:octrVE.Stichera2.text	@ltx/en_us_dedes/oc.m5.d2:ocVE.Aposticha2.text
ltx/en_us_dedes/oc.m5.d2:octrVE.Stichera3.incipit	@ltx/en_us_dedes/oc.m5.d2:ocMA.Aposticha1.incipit
ltx/en_us_dedes/oc.m5.d2:octrVE.Stichera3.melody	
ltx/en_us_dedes/oc.m5.d2:octrVE.Stichera3.mode	@ltx/en_us_dedes/miscellanea:misc.Mode5
ltx/en_us_dedes/oc.m5.d2:octrVE.Stichera3.text	@ltx/en_us_dedes/oc.m5.d2:ocMA.Aposticha1.text
ltx/en_us_dedes/oc.m5.d2:octrVE.Stichera4.incipit	@ltx/en_us_dedes/oc.m5.d2:ocMA.Aposticha2.incipit
ltx/en_us_dedes/oc.m5.d2:octrVE.Stichera4.melody	
ltx/en_us_dedes/oc.m5.d2:octrVE.Stichera4.mode	@ltx/en_us_dedes/miscellanea:misc.Mode5
ltx/en_us_dedes/oc.m5.d2:octrVE.Stichera4.text	@ltx/en_us_dedes/oc.m5.d2:ocMA.Aposticha2.text
