ltx/en_us_dedes/sy.m11.d08:cl.syMA.commemoration01.text	[saint/com 1]
ltx/en_us_dedes/sy.m11.d08:cl.syMA.commemoration02.text	[saint/com 2]
ltx/en_us_dedes/sy.m11.d08:cl.syMA.commemoration03.text	[saint/com 3]
ltx/en_us_dedes/sy.m11.d08:cl.syMA.commemoration04.text	[saint/com 4]
ltx/en_us_dedes/sy.m11.d08:cl.syMA.commemoration05.text	[saint/com 5]
ltx/en_us_dedes/sy.m11.d08:cl.syMA.commemoration06.text	[saint/com list]
ltx/en_us_dedes/sy.m11.d08:syMA.commemoration01.couplet1.title	@ltx/en_us_dedes/titles:ti.Verses
ltx/en_us_dedes/sy.m11.d08:syMA.commemoration01.couplet1.verse1	
ltx/en_us_dedes/sy.m11.d08:syMA.commemoration01.couplet1.verse2	
ltx/en_us_dedes/sy.m11.d08:syMA.commemoration01.couplet2.title	For the Synaxis are the Nine Orders: Seraphim, Cherubim, Thrones, Dominions, Powers, Authorities, Principalities, Archangels, and Angels.
ltx/en_us_dedes/sy.m11.d08:syMA.commemoration01.couplet2.verse1	
ltx/en_us_dedes/sy.m11.d08:syMA.commemoration01.couplet2.verse2	
ltx/en_us_dedes/sy.m11.d08:syMA.commemoration01.narration.p01	
ltx/en_us_dedes/sy.m11.d08:syMA.commemoration01.narration.p02	
ltx/en_us_dedes/sy.m11.d08:syMA.commemoration01.single1	
ltx/en_us_dedes/sy.m11.d08:syMA.commemoration01.text	On November 8, we hold the Synaxis in honor of Chief Commanders Michael and Gabriel, and the other holy bodiless and celestial Orders.
ltx/en_us_dedes/sy.m11.d08:syMA.lastline	By their holy intercessions, O God, have mercy on us. Amen.
