ltx/en_us_dedes/he.h.m8:heHE.AkikoaKyrieTinAkoin.greekname	Ἀκήκοα Κύριε τὴν ἀκοήν.
ltx/en_us_dedes/he.h.m8:heHE.AkikoaKyrieTinAkoin.incipit	I heard Your report…
ltx/en_us_dedes/he.h.m8:heHE.AkikoaKyrieTinAkoin.melody	@ltx/en_us_dedes/miscellanea:misc.Heirmos
ltx/en_us_dedes/he.h.m8:heHE.AkikoaKyrieTinAkoin.mode	@ltx/en_us_dedes/miscellanea:misc.Mode8
ltx/en_us_dedes/he.h.m8:heHE.AkikoaKyrieTinAkoin.name	I heard Your report.
ltx/en_us_dedes/he.h.m8:heHE.AkikoaKyrieTinAkoin.notmetered	N/M (I heard Your report.)
ltx/en_us_dedes/he.h.m8:heHE.AkikoaKyrieTinAkoin.ode	@ltx/en_us_dedes/miscellanea:misc.Ode4
ltx/en_us_dedes/he.h.m8:heHE.AkikoaKyrieTinAkoin.text	I heard Your report, O Lord, and was afraid and greatly astonished, * that You the eternal God, in counsel ineffable, * became incarnate and were born of the Virgin. * Glory to Your glory, O Christ! * Glory to Your strength, O Lord!
ltx/en_us_dedes/he.h.m8:heHE.AllotrionTonMiteron.greekname	Ἀλλότριον τῶν μητέρων.
ltx/en_us_dedes/he.h.m8:heHE.AllotrionTonMiteron.incipit	Virginity is a state…
ltx/en_us_dedes/he.h.m8:heHE.AllotrionTonMiteron.melody	@ltx/en_us_dedes/miscellanea:misc.Heirmos
ltx/en_us_dedes/he.h.m8:heHE.AllotrionTonMiteron.mode	@ltx/en_us_dedes/miscellanea:misc.Mode8
ltx/en_us_dedes/he.h.m8:heHE.AllotrionTonMiteron.name	Virginity is a state.
ltx/en_us_dedes/he.h.m8:heHE.AllotrionTonMiteron.notmetered	N/M (Virginity is a state.)
ltx/en_us_dedes/he.h.m8:heHE.AllotrionTonMiteron.ode	@ltx/en_us_dedes/miscellanea:misc.Ode9
ltx/en_us_dedes/he.h.m8:heHE.AllotrionTonMiteron.text	Virginity is a state alien to mothers, * and childbirth is foreign to those who are virgins. * But in you, Theotokos, have both of these been accomplished. * Indeed all generations everywhere * now call you blessed evermore.
ltx/en_us_dedes/he.h.m8:heHE.AngeloiKaiOuranoi.greekname	Ἄγγελοι καὶ οὐρανοί.
ltx/en_us_dedes/he.h.m8:heHE.AngeloiKaiOuranoi.incipit	Angels and you heavens…
ltx/en_us_dedes/he.h.m8:heHE.AngeloiKaiOuranoi.melody	@ltx/en_us_dedes/miscellanea:misc.Heirmos
ltx/en_us_dedes/he.h.m8:heHE.AngeloiKaiOuranoi.mode	@ltx/en_us_dedes/miscellanea:misc.Mode8
ltx/en_us_dedes/he.h.m8:heHE.AngeloiKaiOuranoi.name	Angels and you heavens.
ltx/en_us_dedes/he.h.m8:heHE.AngeloiKaiOuranoi.notmetered	N/M (Angels and you heavens.)
ltx/en_us_dedes/he.h.m8:heHE.AngeloiKaiOuranoi.ode	@ltx/en_us_dedes/miscellanea:misc.Ode8
ltx/en_us_dedes/he.h.m8:heHE.AngeloiKaiOuranoi.text	Angels and you heavens, bless Him who as King is carried on a glorious throne, * and who as God is glorified unceasingly. * Ever bless and extol Him, and exalt Him beyond measure unto all the ages.
ltx/en_us_dedes/he.h.m8:heHE.ArmatilatinFarao.greekname	Ἁρματηλάτην Φαραώ.
ltx/en_us_dedes/he.h.m8:heHE.ArmatilatinFarao.incipit	The rod of Moses…
ltx/en_us_dedes/he.h.m8:heHE.ArmatilatinFarao.melody	@ltx/en_us_dedes/miscellanea:misc.Heirmos
ltx/en_us_dedes/he.h.m8:heHE.ArmatilatinFarao.mode	@ltx/en_us_dedes/miscellanea:misc.Mode8
ltx/en_us_dedes/he.h.m8:heHE.ArmatilatinFarao.name	The rod of Moses.
ltx/en_us_dedes/he.h.m8:heHE.ArmatilatinFarao.notmetered	N/M (The rod of Moses.)
ltx/en_us_dedes/he.h.m8:heHE.ArmatilatinFarao.ode	@ltx/en_us_dedes/miscellanea:misc.Ode1
ltx/en_us_dedes/he.h.m8:heHE.ArmatilatinFarao.text	The rod of Moses working wonders once submerged Phar’onic charioteers * when it smote the waters * in the figure of a cross and thereby split the sea in two; * while it rescued on dry land wayfaring fugitive Israel, * which to God resoundingly sang a song.
ltx/en_us_dedes/he.h.m8:heHE.AseveiasOrgana.greekname	Ἀσεβείας ὄργανα.
ltx/en_us_dedes/he.h.m8:heHE.AseveiasOrgana.incipit	…
ltx/en_us_dedes/he.h.m8:heHE.AseveiasOrgana.melody	@ltx/en_us_dedes/miscellanea:misc.Heirmos
ltx/en_us_dedes/he.h.m8:heHE.AseveiasOrgana.mode	@ltx/en_us_dedes/miscellanea:misc.Mode8
ltx/en_us_dedes/he.h.m8:heHE.AseveiasOrgana.name	
ltx/en_us_dedes/he.h.m8:heHE.AseveiasOrgana.notmetered	N/M ()
ltx/en_us_dedes/he.h.m8:heHE.AseveiasOrgana.ode	@ltx/en_us_dedes/miscellanea:misc.Ode8
ltx/en_us_dedes/he.h.m8:heHE.AseveiasOrgana.text	
ltx/en_us_dedes/he.h.m8:heHE.AsmaAnapempsomen.greekname	Ἆσμα ἀναπέμψωμεν.
ltx/en_us_dedes/he.h.m8:heHE.AsmaAnapempsomen.incipit	All you people…
ltx/en_us_dedes/he.h.m8:heHE.AsmaAnapempsomen.melody	@ltx/en_us_dedes/miscellanea:misc.Heirmos
ltx/en_us_dedes/he.h.m8:heHE.AsmaAnapempsomen.mode	@ltx/en_us_dedes/miscellanea:misc.Mode8
ltx/en_us_dedes/he.h.m8:heHE.AsmaAnapempsomen.name	All you people.
ltx/en_us_dedes/he.h.m8:heHE.AsmaAnapempsomen.notmetered	N/M (All you people.)
ltx/en_us_dedes/he.h.m8:heHE.AsmaAnapempsomen.ode	@ltx/en_us_dedes/miscellanea:misc.Ode1
ltx/en_us_dedes/he.h.m8:heHE.AsmaAnapempsomen.text	All you people, come and let us sing unto our God most wonderful, * who rescued Israel and freed it from its bondage, * an anthem of victory, singing to Him and saying, * “We shall sing to You, our only Master.”
ltx/en_us_dedes/he.h.m8:heHE.AsmaAsmaton.greekname	Ἆσμα ἀσμάτων.
ltx/en_us_dedes/he.h.m8:heHE.AsmaAsmaton.incipit	…
ltx/en_us_dedes/he.h.m8:heHE.AsmaAsmaton.melody	@ltx/en_us_dedes/miscellanea:misc.Heirmos
ltx/en_us_dedes/he.h.m8:heHE.AsmaAsmaton.mode	@ltx/en_us_dedes/miscellanea:misc.Mode8
ltx/en_us_dedes/he.h.m8:heHE.AsmaAsmaton.name	
ltx/en_us_dedes/he.h.m8:heHE.AsmaAsmaton.notmetered	N/M ()
ltx/en_us_dedes/he.h.m8:heHE.AsmaAsmaton.ode	@ltx/en_us_dedes/miscellanea:misc.Ode1
ltx/en_us_dedes/he.h.m8:heHE.AsmaAsmaton.text	
ltx/en_us_dedes/he.h.m8:heHE.AsomenOdinToTheo.greekname	ᾌσωμεν ᾠδὴν τῷ Θεῷ.
ltx/en_us_dedes/he.h.m8:heHE.AsomenOdinToTheo.incipit	…
ltx/en_us_dedes/he.h.m8:heHE.AsomenOdinToTheo.melody	@ltx/en_us_dedes/miscellanea:misc.HeirmosNotMetered
ltx/en_us_dedes/he.h.m8:heHE.AsomenOdinToTheo.mode	@ltx/en_us_dedes/miscellanea:misc.Mode8
ltx/en_us_dedes/he.h.m8:heHE.AsomenOdinToTheo.name	
ltx/en_us_dedes/he.h.m8:heHE.AsomenOdinToTheo.notmetered	N/M (Let us sing a song.)
ltx/en_us_dedes/he.h.m8:heHE.AsomenOdinToTheo.ode	@ltx/en_us_dedes/miscellanea:misc.Ode1
ltx/en_us_dedes/he.h.m8:heHE.AsomenOdinToTheo.text	Let us sing a song to God, who delivered Israel from bitter slavery to Pharaoh, and who led them by a pillar of fire and a cloud of light; for He is glorified.
ltx/en_us_dedes/he.h.m8:heHE.AsomenToKyrio.greekname	ᾌσωμεν τῷ Κυρίῳ.
ltx/en_us_dedes/he.h.m8:heHE.AsomenToKyrio.incipit	Using the words of Moses…
ltx/en_us_dedes/he.h.m8:heHE.AsomenToKyrio.melody	@ltx/en_us_dedes/miscellanea:misc.Heirmos
ltx/en_us_dedes/he.h.m8:heHE.AsomenToKyrio.mode	@ltx/en_us_dedes/miscellanea:misc.Mode8
ltx/en_us_dedes/he.h.m8:heHE.AsomenToKyrio.name	Using the words of Moses.
ltx/en_us_dedes/he.h.m8:heHE.AsomenToKyrio.notmetered	N/M (Using the words of Moses.)
ltx/en_us_dedes/he.h.m8:heHE.AsomenToKyrio.ode	@ltx/en_us_dedes/miscellanea:misc.Ode1
ltx/en_us_dedes/he.h.m8:heHE.AsomenToKyrio.text	Using the words of Moses * and the people, let us sing unto the Lord, * who led them through the Red Sea. * Only He is triumphantly glorified.
ltx/en_us_dedes/he.h.m8:heHE.AsomenToKyrioPantesLaoi.greekname	ᾌσωμεν τῷ Κυρίῳ πάντες λαοί.
ltx/en_us_dedes/he.h.m8:heHE.AsomenToKyrioPantesLaoi.incipit	Come, all you peoples…
ltx/en_us_dedes/he.h.m8:heHE.AsomenToKyrioPantesLaoi.melody	@ltx/en_us_dedes/miscellanea:misc.Heirmos
ltx/en_us_dedes/he.h.m8:heHE.AsomenToKyrioPantesLaoi.mode	@ltx/en_us_dedes/miscellanea:misc.Mode8
ltx/en_us_dedes/he.h.m8:heHE.AsomenToKyrioPantesLaoi.name	Come, all you peoples, let us sing.
ltx/en_us_dedes/he.h.m8:heHE.AsomenToKyrioPantesLaoi.notmetered	N/M (Come, all you peoples, let us sing.)
ltx/en_us_dedes/he.h.m8:heHE.AsomenToKyrioPantesLaoi.ode	@ltx/en_us_dedes/miscellanea:misc.Ode1
ltx/en_us_dedes/he.h.m8:heHE.AsomenToKyrioPantesLaoi.text	Come, all you peoples, let us sing to the Lord, * for in the Red Sea He destroyed * the Pharaoh’s army long ago. * Let us sing to Him a song * of triumph, for He was glorified.
ltx/en_us_dedes/he.h.m8:heHE.AvyssosAmartion.greekname	Ἄβυσσος ἁμαρτιῶν.
ltx/en_us_dedes/he.h.m8:heHE.AvyssosAmartion.incipit	My transgressions…
ltx/en_us_dedes/he.h.m8:heHE.AvyssosAmartion.melody	@ltx/en_us_dedes/miscellanea:misc.Heirmos
ltx/en_us_dedes/he.h.m8:heHE.AvyssosAmartion.mode	@ltx/en_us_dedes/miscellanea:misc.Mode8
ltx/en_us_dedes/he.h.m8:heHE.AvyssosAmartion.name	My transgressions.
ltx/en_us_dedes/he.h.m8:heHE.AvyssosAmartion.notmetered	N/M (My transgressions)
ltx/en_us_dedes/he.h.m8:heHE.AvyssosAmartion.ode	@ltx/en_us_dedes/miscellanea:misc.Ode6
ltx/en_us_dedes/he.h.m8:heHE.AvyssosAmartion.text	My transgressions and my sins, * like a tempest on the deep sea, afflict me * and forcibly compel me to the depths of despondency. * So I pray You to extend * Your mighty arm to me, as to Peter, * O God, my Pilot and Savior, and rescue me.
ltx/en_us_dedes/he.h.m8:heHE.ChitonaMoiParaschou.greekname	Χιτῶνά μοι παράσχου.
ltx/en_us_dedes/he.h.m8:heHE.ChitonaMoiParaschou.incipit	I pray that You will grant…
ltx/en_us_dedes/he.h.m8:heHE.ChitonaMoiParaschou.melody	@ltx/en_us_dedes/miscellanea:misc.Heirmos
ltx/en_us_dedes/he.h.m8:heHE.ChitonaMoiParaschou.mode	@ltx/en_us_dedes/miscellanea:misc.Mode8
ltx/en_us_dedes/he.h.m8:heHE.ChitonaMoiParaschou.name	I pray that You will grant.
ltx/en_us_dedes/he.h.m8:heHE.ChitonaMoiParaschou.notmetered	N/M (I pray… grant.)
ltx/en_us_dedes/he.h.m8:heHE.ChitonaMoiParaschou.ode	@ltx/en_us_dedes/miscellanea:misc.Ode6
ltx/en_us_dedes/he.h.m8:heHE.ChitonaMoiParaschou.text	I pray that You will grant to me a bright * garment, O most merciful Lord, who cover yourself * with the light as with a garment, O Christ our God.
ltx/en_us_dedes/he.h.m8:heHE.EfrixePasaAkoi.greekname	Ἔφριξε πᾶσα ἀκοή.
ltx/en_us_dedes/he.h.m8:heHE.EfrixePasaAkoi.incipit	All hearers shuddered…
ltx/en_us_dedes/he.h.m8:heHE.EfrixePasaAkoi.melody	@ltx/en_us_dedes/miscellanea:misc.Heirmos
ltx/en_us_dedes/he.h.m8:heHE.EfrixePasaAkoi.mode	@ltx/en_us_dedes/miscellanea:misc.Mode8
ltx/en_us_dedes/he.h.m8:heHE.EfrixePasaAkoi.name	All hearers shuddered.
ltx/en_us_dedes/he.h.m8:heHE.EfrixePasaAkoi.notmetered	N/M (All hearers.)
ltx/en_us_dedes/he.h.m8:heHE.EfrixePasaAkoi.ode	@ltx/en_us_dedes/miscellanea:misc.Ode9
ltx/en_us_dedes/he.h.m8:heHE.EfrixePasaAkoi.text	All hearers shuddered when they heard * the unheard-of condescension of God to us: * that voluntarily * the Most High came down, and even bodily, * and from a Virgin’s womb was born, * becoming a man from her. * Hence, the immaculate * Theotokos we believers now magnify.
ltx/en_us_dedes/he.h.m8:heHE.EisakikoaKyrie.greekname	Εἰσακήκοα Κύριε.
ltx/en_us_dedes/he.h.m8:heHE.EisakikoaKyrie.incipit	I have heard the report…
ltx/en_us_dedes/he.h.m8:heHE.EisakikoaKyrie.melody	@ltx/en_us_dedes/miscellanea:misc.Heirmos
ltx/en_us_dedes/he.h.m8:heHE.EisakikoaKyrie.mode	@ltx/en_us_dedes/miscellanea:misc.Mode8
ltx/en_us_dedes/he.h.m8:heHE.EisakikoaKyrie.name	I have heard the report.
ltx/en_us_dedes/he.h.m8:heHE.EisakikoaKyrie.notmetered	N/M (I have heard.)
ltx/en_us_dedes/he.h.m8:heHE.EisakikoaKyrie.ode	@ltx/en_us_dedes/miscellanea:misc.Ode4
ltx/en_us_dedes/he.h.m8:heHE.EisakikoaKyrie.text	I have heard the report, O Lord, * of Your incarnation, which is a mystery. * I considered Your astounding works, * and I glorified Your divinity.
ltx/en_us_dedes/he.h.m8:heHE.EisakikoaKyrieTinAkoinSou.greekname	Εἰσακήκος Κύριε, τὴν ἀκοήν.
ltx/en_us_dedes/he.h.m8:heHE.EisakikoaKyrieTinAkoinSou.incipit	…
ltx/en_us_dedes/he.h.m8:heHE.EisakikoaKyrieTinAkoinSou.melody	@ltx/en_us_dedes/miscellanea:misc.HeirmosNotMetered
ltx/en_us_dedes/he.h.m8:heHE.EisakikoaKyrieTinAkoinSou.mode	@ltx/en_us_dedes/miscellanea:misc.Mode8
ltx/en_us_dedes/he.h.m8:heHE.EisakikoaKyrieTinAkoinSou.name	
ltx/en_us_dedes/he.h.m8:heHE.EisakikoaKyrieTinAkoinSou.notmetered	N/M
ltx/en_us_dedes/he.h.m8:heHE.EisakikoaKyrieTinAkoinSou.ode	@ltx/en_us_dedes/miscellanea:misc.Ode4
ltx/en_us_dedes/he.h.m8:heHE.EisakikoaKyrieTinAkoinSou.text	Lord, I heard Your report and I was afraid. I considered Your works, and I glorified Your dominion, O Master.
ltx/en_us_dedes/he.h.m8:heHE.EkSarkosSouVolides.greekname	Ἐκ σαρκός σου βολίδες.
ltx/en_us_dedes/he.h.m8:heHE.EkSarkosSouVolides.incipit	…
ltx/en_us_dedes/he.h.m8:heHE.EkSarkosSouVolides.melody	@ltx/en_us_dedes/miscellanea:misc.Heirmos
ltx/en_us_dedes/he.h.m8:heHE.EkSarkosSouVolides.mode	@ltx/en_us_dedes/miscellanea:misc.Mode8
ltx/en_us_dedes/he.h.m8:heHE.EkSarkosSouVolides.name	
ltx/en_us_dedes/he.h.m8:heHE.EkSarkosSouVolides.notmetered	N/M ()
ltx/en_us_dedes/he.h.m8:heHE.EkSarkosSouVolides.ode	@ltx/en_us_dedes/miscellanea:misc.Ode4
ltx/en_us_dedes/he.h.m8:heHE.EkSarkosSouVolides.text	
ltx/en_us_dedes/he.h.m8:heHE.EknoonProstagma.greekname	Ἔκνοον πρόσταγμα.
ltx/en_us_dedes/he.h.m8:heHE.EknoonProstagma.incipit	The impious tyrant’s…
ltx/en_us_dedes/he.h.m8:heHE.EknoonProstagma.melody	@ltx/en_us_dedes/miscellanea:misc.Heirmos
ltx/en_us_dedes/he.h.m8:heHE.EknoonProstagma.mode	@ltx/en_us_dedes/miscellanea:misc.Mode8
ltx/en_us_dedes/he.h.m8:heHE.EknoonProstagma.name	The impious tyrant’s.
ltx/en_us_dedes/he.h.m8:heHE.EknoonProstagma.notmetered	N/M (The impious.)
ltx/en_us_dedes/he.h.m8:heHE.EknoonProstagma.ode	@ltx/en_us_dedes/miscellanea:misc.Ode7
ltx/en_us_dedes/he.h.m8:heHE.EknoonProstagma.text	The impious tyrant’s preposterous decree disturbed the populace, * breathing threats and blasphemous pronouncements hateful to God. * His brutal anger did not intimidate * the three Servants, nor did the consuming fire. * But when the dew-laden breeze whistled against the fire, they joined it and together sang, * “Blessed are You, O Lord. You are highly praised, O God, the God of our fathers.”
ltx/en_us_dedes/he.h.m8:heHE.EnPedioDeeira.greekname	Ἐν πεδίῳ Δεειρᾷ.
ltx/en_us_dedes/he.h.m8:heHE.EnPedioDeeira.incipit	…
ltx/en_us_dedes/he.h.m8:heHE.EnPedioDeeira.melody	@ltx/en_us_dedes/miscellanea:misc.Heirmos
ltx/en_us_dedes/he.h.m8:heHE.EnPedioDeeira.mode	@ltx/en_us_dedes/miscellanea:misc.Mode8
ltx/en_us_dedes/he.h.m8:heHE.EnPedioDeeira.name	
ltx/en_us_dedes/he.h.m8:heHE.EnPedioDeeira.notmetered	N/M ()
ltx/en_us_dedes/he.h.m8:heHE.EnPedioDeeira.ode	@ltx/en_us_dedes/miscellanea:misc.Ode7
ltx/en_us_dedes/he.h.m8:heHE.EnPedioDeeira.text	
ltx/en_us_dedes/he.h.m8:heHE.EpevisEfIppous.greekname	Ἐπέβης ἐφʼ ἵππους.
ltx/en_us_dedes/he.h.m8:heHE.EpevisEfIppous.incipit	You mounted Your horses…
ltx/en_us_dedes/he.h.m8:heHE.EpevisEfIppous.melody	@ltx/en_us_dedes/miscellanea:misc.Heirmos
ltx/en_us_dedes/he.h.m8:heHE.EpevisEfIppous.mode	@ltx/en_us_dedes/miscellanea:misc.Mode8
ltx/en_us_dedes/he.h.m8:heHE.EpevisEfIppous.name	You mounted Your horses.
ltx/en_us_dedes/he.h.m8:heHE.EpevisEfIppous.notmetered	N/M (You mounted Your horses.)
ltx/en_us_dedes/he.h.m8:heHE.EpevisEfIppous.ode	@ltx/en_us_dedes/miscellanea:misc.Ode4
ltx/en_us_dedes/he.h.m8:heHE.EpevisEfIppous.text	You mounted Your horses, namely Your holy Apostles, O Lord, * and You guided them, holding their reins in Your hands. * And thus Your chariot became salvation for us all, * who are faithfully singing * unto You: Glory to Your strength, O Lord!
ltx/en_us_dedes/he.h.m8:heHE.EptaplasiosKaminon.greekname	Ἑπταπλασίως κάμινον.
ltx/en_us_dedes/he.h.m8:heHE.EptaplasiosKaminon.incipit	The tyrant king…
ltx/en_us_dedes/he.h.m8:heHE.EptaplasiosKaminon.melody	@ltx/en_us_dedes/miscellanea:misc.Heirmos
ltx/en_us_dedes/he.h.m8:heHE.EptaplasiosKaminon.mode	@ltx/en_us_dedes/miscellanea:misc.Mode8
ltx/en_us_dedes/he.h.m8:heHE.EptaplasiosKaminon.name	The tyrant king.
ltx/en_us_dedes/he.h.m8:heHE.EptaplasiosKaminon.notmetered	N/M (The tyrant king.)
ltx/en_us_dedes/he.h.m8:heHE.EptaplasiosKaminon.ode	@ltx/en_us_dedes/miscellanea:misc.Ode8
ltx/en_us_dedes/he.h.m8:heHE.EptaplasiosKaminon.text	The tyrant king of Babylon * had the furnace made seven times * hotter for the godly men, for he was furious. * But after he witnessed how * a higher power rescued them, * he cried out and said, “You Servants, bless the Creator; * sing hymns to the Redeemer, O you priests; and you people * exalt Him beyond measure, unto all the ages.”
ltx/en_us_dedes/he.h.m8:heHE.EstereothiIKardiaMouEnKyrio.greekname	Ἐστερεώθη ἡ καρδία μου.
ltx/en_us_dedes/he.h.m8:heHE.EstereothiIKardiaMouEnKyrio.incipit	My heart exults…
ltx/en_us_dedes/he.h.m8:heHE.EstereothiIKardiaMouEnKyrio.melody	@ltx/en_us_dedes/miscellanea:misc.Heirmos
ltx/en_us_dedes/he.h.m8:heHE.EstereothiIKardiaMouEnKyrio.mode	@ltx/en_us_dedes/miscellanea:misc.Mode8
ltx/en_us_dedes/he.h.m8:heHE.EstereothiIKardiaMouEnKyrio.name	My heart exults.
ltx/en_us_dedes/he.h.m8:heHE.EstereothiIKardiaMouEnKyrio.notmetered	N/M (My heart exults.)
ltx/en_us_dedes/he.h.m8:heHE.EstereothiIKardiaMouEnKyrio.ode	@ltx/en_us_dedes/miscellanea:misc.Ode3
ltx/en_us_dedes/he.h.m8:heHE.EstereothiIKardiaMouEnKyrio.text	My heart exults and in the Lord firmly is established; * and in my God is my horn exalted; * and my mouth is open wide at my enemies, and in Your salvation I rejoice.
ltx/en_us_dedes/he.h.m8:heHE.EvlogeitePaides.greekname	Εὐλογεῖτε Παῖδες.
ltx/en_us_dedes/he.h.m8:heHE.EvlogeitePaides.incipit	You three pious Servants…
ltx/en_us_dedes/he.h.m8:heHE.EvlogeitePaides.melody	@ltx/en_us_dedes/miscellanea:misc.Heirmos
ltx/en_us_dedes/he.h.m8:heHE.EvlogeitePaides.mode	@ltx/en_us_dedes/miscellanea:misc.Mode8
ltx/en_us_dedes/he.h.m8:heHE.EvlogeitePaides.name	You three pious Servants.
ltx/en_us_dedes/he.h.m8:heHE.EvlogeitePaides.notmetered	N/M (You three pious Servants.)
ltx/en_us_dedes/he.h.m8:heHE.EvlogeitePaides.ode	@ltx/en_us_dedes/miscellanea:misc.Ode8
ltx/en_us_dedes/he.h.m8:heHE.EvlogeitePaides.text	You three pious Servants, * same in number as the Trinity, * bless God the Father, Maker of all; * sing a hymn to the Word who condescended * and who changed the fire in the furnace into dew; * as for the all-holy Spirit, who gives life to all, exalt Him * beyond measure unto the ages.
ltx/en_us_dedes/he.h.m8:heHE.EvlogitosOKyrios.greekname	Εὐλογητὸς ὁ Κύριος.
ltx/en_us_dedes/he.h.m8:heHE.EvlogitosOKyrios.incipit	Blessed is He…
ltx/en_us_dedes/he.h.m8:heHE.EvlogitosOKyrios.melody	@ltx/en_us_dedes/miscellanea:misc.Heirmos
ltx/en_us_dedes/he.h.m8:heHE.EvlogitosOKyrios.mode	@ltx/en_us_dedes/miscellanea:misc.Mode8
ltx/en_us_dedes/he.h.m8:heHE.EvlogitosOKyrios.name	Blessed is He.
ltx/en_us_dedes/he.h.m8:heHE.EvlogitosOKyrios.notmetered	N/M (Blessed is He.)
ltx/en_us_dedes/he.h.m8:heHE.EvlogitosOKyrios.ode	@ltx/en_us_dedes/miscellanea:misc.Ode9
ltx/en_us_dedes/he.h.m8:heHE.EvlogitosOKyrios.text	Blessed is He who raised a horn of salvation in the house * of His servant David, as He spoke by the mouth * of Prophets, the Lord God of Israel. * The Day dawned upon us from on high, and He gave light and guided * our feet into the way of peace through His mercy.
ltx/en_us_dedes/he.h.m8:heHE.ExOrousKataskiou.greekname	Ἐξ ὄρους κατασκίου.
ltx/en_us_dedes/he.h.m8:heHE.ExOrousKataskiou.incipit	The Prophet understood…
ltx/en_us_dedes/he.h.m8:heHE.ExOrousKataskiou.melody	@ltx/en_us_dedes/miscellanea:misc.Heirmos
ltx/en_us_dedes/he.h.m8:heHE.ExOrousKataskiou.mode	@ltx/en_us_dedes/miscellanea:misc.Mode8
ltx/en_us_dedes/he.h.m8:heHE.ExOrousKataskiou.name	The Prophet understood.
ltx/en_us_dedes/he.h.m8:heHE.ExOrousKataskiou.notmetered	N/M (The Prophet understood.)
ltx/en_us_dedes/he.h.m8:heHE.ExOrousKataskiou.ode	@ltx/en_us_dedes/miscellanea:misc.Ode4
ltx/en_us_dedes/he.h.m8:heHE.ExOrousKataskiou.text	The Prophet understood that You would be incarnate * from the Theotokos when he had considered * with divine vision, O Logos, the shaded mountain. * Afraid, he glorified Your power, O Lord.
ltx/en_us_dedes/he.h.m8:heHE.ExestiEpiTouto.greekname	Ἐξέστη ἐπὶ τούτῳ.
ltx/en_us_dedes/he.h.m8:heHE.ExestiEpiTouto.incipit	The heavens were astounded…
ltx/en_us_dedes/he.h.m8:heHE.ExestiEpiTouto.melody	@ltx/en_us_dedes/miscellanea:misc.Heirmos
ltx/en_us_dedes/he.h.m8:heHE.ExestiEpiTouto.mode	@ltx/en_us_dedes/miscellanea:misc.Mode8
ltx/en_us_dedes/he.h.m8:heHE.ExestiEpiTouto.name	The heavens were astounded.
ltx/en_us_dedes/he.h.m8:heHE.ExestiEpiTouto.notmetered	N/M (The heavens.)
ltx/en_us_dedes/he.h.m8:heHE.ExestiEpiTouto.ode	@ltx/en_us_dedes/miscellanea:misc.Ode9
ltx/en_us_dedes/he.h.m8:heHE.ExestiEpiTouto.text	The heavens were astounded because of this, * and the ends of the earth were astonished, because God himself * bodily appeared to the human race, * O Theotokos, coming forth * from your virgin womb, which indeed became * more spacious than the heavens. * And therefore by the orders * of men and angels you are magnified.
ltx/en_us_dedes/he.h.m8:heHE.FotisonImas.greekname	Φώτισον ἡμᾶς.
ltx/en_us_dedes/he.h.m8:heHE.FotisonImas.incipit	Sovereign Lord our God…
ltx/en_us_dedes/he.h.m8:heHE.FotisonImas.melody	@ltx/en_us_dedes/miscellanea:misc.Heirmos
ltx/en_us_dedes/he.h.m8:heHE.FotisonImas.mode	@ltx/en_us_dedes/miscellanea:misc.Mode8
ltx/en_us_dedes/he.h.m8:heHE.FotisonImas.name	Sovereign Lord our God.
ltx/en_us_dedes/he.h.m8:heHE.FotisonImas.notmetered	N/M (Sovereign Lord.)
ltx/en_us_dedes/he.h.m8:heHE.FotisonImas.ode	@ltx/en_us_dedes/miscellanea:misc.Ode5
ltx/en_us_dedes/he.h.m8:heHE.FotisonImas.text	Sovereign Lord our God, * as the One who is benevolent, * with your commandments enlighten us, we pray; * and also grant us * Your peace with Your own uplifted arm.
ltx/en_us_dedes/he.h.m8:heHE.IKekommeni.greekname	Ἡ κεκομμένη.
ltx/en_us_dedes/he.h.m8:heHE.IKekommeni.incipit	The rod of Moses divided…
ltx/en_us_dedes/he.h.m8:heHE.IKekommeni.melody	@ltx/en_us_dedes/miscellanea:misc.Heirmos
ltx/en_us_dedes/he.h.m8:heHE.IKekommeni.mode	@ltx/en_us_dedes/miscellanea:misc.Mode8
ltx/en_us_dedes/he.h.m8:heHE.IKekommeni.name	The rod of Moses divided.
ltx/en_us_dedes/he.h.m8:heHE.IKekommeni.notmetered	N/M (The rod of Moses divided.)
ltx/en_us_dedes/he.h.m8:heHE.IKekommeni.ode	@ltx/en_us_dedes/miscellanea:misc.Ode1
ltx/en_us_dedes/he.h.m8:heHE.IKekommeni.text	The rod of Moses divided the sea of old, * and for the first time, the sun saw the ground beneath the sea. * As Israel passed over what had been impassable, * the enemy was drowned beneath the sea. * And then the people sang the song, * saying: “Let us sing to the Lord, * for He is greatly glorified.”
ltx/en_us_dedes/he.h.m8:heHE.IdeteIdeteOKathierosas.greekname	Ἴδετε ἴδετε.ὁ καθιέρωσας.
ltx/en_us_dedes/he.h.m8:heHE.IdeteIdeteOKathierosas.incipit	…
ltx/en_us_dedes/he.h.m8:heHE.IdeteIdeteOKathierosas.melody	@ltx/en_us_dedes/miscellanea:misc.Heirmos
ltx/en_us_dedes/he.h.m8:heHE.IdeteIdeteOKathierosas.mode	@ltx/en_us_dedes/miscellanea:misc.Mode8
ltx/en_us_dedes/he.h.m8:heHE.IdeteIdeteOKathierosas.name	
ltx/en_us_dedes/he.h.m8:heHE.IdeteIdeteOKathierosas.notmetered	N/M ()
ltx/en_us_dedes/he.h.m8:heHE.IdeteIdeteOKathierosas.ode	@ltx/en_us_dedes/miscellanea:misc.Ode2
ltx/en_us_dedes/he.h.m8:heHE.IdeteIdeteOKathierosas.text	
ltx/en_us_dedes/he.h.m8:heHE.IdeteIdeteOPalaiTonIsrail.greekname	Ἴδετε ἴδετε.ὁ πάλαι τὸν Ἰσραήλ.
ltx/en_us_dedes/he.h.m8:heHE.IdeteIdeteOPalaiTonIsrail.incipit	…
ltx/en_us_dedes/he.h.m8:heHE.IdeteIdeteOPalaiTonIsrail.melody	@ltx/en_us_dedes/miscellanea:misc.Heirmos
ltx/en_us_dedes/he.h.m8:heHE.IdeteIdeteOPalaiTonIsrail.mode	@ltx/en_us_dedes/miscellanea:misc.Mode8
ltx/en_us_dedes/he.h.m8:heHE.IdeteIdeteOPalaiTonIsrail.name	
ltx/en_us_dedes/he.h.m8:heHE.IdeteIdeteOPalaiTonIsrail.notmetered	N/M ()
ltx/en_us_dedes/he.h.m8:heHE.IdeteIdeteOPalaiTonIsrail.ode	@ltx/en_us_dedes/miscellanea:misc.Ode2
ltx/en_us_dedes/he.h.m8:heHE.IdeteIdeteOPalaiTonIsrail.text	
ltx/en_us_dedes/he.h.m8:heHE.IdeteIdeteOPrinGenesthai.greekname	Ἴδετε ἴδετε.ὁ πρὶν γενέσθαι.
ltx/en_us_dedes/he.h.m8:heHE.IdeteIdeteOPrinGenesthai.incipit	…
ltx/en_us_dedes/he.h.m8:heHE.IdeteIdeteOPrinGenesthai.melody	@ltx/en_us_dedes/miscellanea:misc.Heirmos
ltx/en_us_dedes/he.h.m8:heHE.IdeteIdeteOPrinGenesthai.mode	@ltx/en_us_dedes/miscellanea:misc.Mode8
ltx/en_us_dedes/he.h.m8:heHE.IdeteIdeteOPrinGenesthai.name	
ltx/en_us_dedes/he.h.m8:heHE.IdeteIdeteOPrinGenesthai.notmetered	N/M ()
ltx/en_us_dedes/he.h.m8:heHE.IdeteIdeteOPrinGenesthai.ode	@ltx/en_us_dedes/miscellanea:misc.Ode2
ltx/en_us_dedes/he.h.m8:heHE.IdeteIdeteOPrinGenesthai.text	
ltx/en_us_dedes/he.h.m8:heHE.IdeteIdeteOProTonAionon.greekname	Ἴδετε ἴδετε.ὁ πρὸ τῶν αἰώνων.
ltx/en_us_dedes/he.h.m8:heHE.IdeteIdeteOProTonAionon.incipit	Now see, I, even I…
ltx/en_us_dedes/he.h.m8:heHE.IdeteIdeteOProTonAionon.melody	@ltx/en_us_dedes/miscellanea:misc.HeirmosNotMetered
ltx/en_us_dedes/he.h.m8:heHE.IdeteIdeteOProTonAionon.mode	@ltx/en_us_dedes/miscellanea:misc.Mode8
ltx/en_us_dedes/he.h.m8:heHE.IdeteIdeteOProTonAionon.name	N/M ()
ltx/en_us_dedes/he.h.m8:heHE.IdeteIdeteOProTonAionon.notmetered	N/M ()
ltx/en_us_dedes/he.h.m8:heHE.IdeteIdeteOProTonAionon.ode	@ltx/en_us_dedes/miscellanea:misc.Ode2
ltx/en_us_dedes/he.h.m8:heHE.IdeteIdeteOProTonAionon.text	Now see, I, even I, am your God, begotten of the Father before all ages, and in latter days born of the Virgin without a man; and I have released Adam from ancestral sin, for I am benevolent.
ltx/en_us_dedes/he.h.m8:heHE.IlasthitiMoiSotir.greekname	Ἱλάσθητί μοι Σωτήρ.
ltx/en_us_dedes/he.h.m8:heHE.IlasthitiMoiSotir.incipit	Be gracious to me…
ltx/en_us_dedes/he.h.m8:heHE.IlasthitiMoiSotir.melody	@ltx/en_us_dedes/miscellanea:misc.Heirmos
ltx/en_us_dedes/he.h.m8:heHE.IlasthitiMoiSotir.mode	@ltx/en_us_dedes/miscellanea:misc.Mode8
ltx/en_us_dedes/he.h.m8:heHE.IlasthitiMoiSotir.name	Be gracious to me.
ltx/en_us_dedes/he.h.m8:heHE.IlasthitiMoiSotir.notmetered	N/M (Be gracious to me.)
ltx/en_us_dedes/he.h.m8:heHE.IlasthitiMoiSotir.ode	@ltx/en_us_dedes/miscellanea:misc.Ode6
ltx/en_us_dedes/he.h.m8:heHE.IlasthitiMoiSotir.text	Be gracious to me, O Lord, * for many are my iniquities; * and bring me up from the depth of evils, I supplicate. * Like Jonah, I cry to You. * O my Savior, hear me, * as the God of my Deliverance.
ltx/en_us_dedes/he.h.m8:heHE.InaTiMeAposo.greekname	Ἵνα τί με ἀπώσω.
ltx/en_us_dedes/he.h.m8:heHE.InaTiMeAposo.incipit	Why reject me, Your servant…
ltx/en_us_dedes/he.h.m8:heHE.InaTiMeAposo.melody	@ltx/en_us_dedes/miscellanea:misc.Heirmos
ltx/en_us_dedes/he.h.m8:heHE.InaTiMeAposo.mode	@ltx/en_us_dedes/miscellanea:misc.Mode8
ltx/en_us_dedes/he.h.m8:heHE.InaTiMeAposo.name	Why reject me, Your servant.
ltx/en_us_dedes/he.h.m8:heHE.InaTiMeAposo.notmetered	N/M (Why reject me.)
ltx/en_us_dedes/he.h.m8:heHE.InaTiMeAposo.ode	@ltx/en_us_dedes/miscellanea:misc.Ode5
ltx/en_us_dedes/he.h.m8:heHE.InaTiMeAposo.text	Why reject me, Your servant, * from before Your face, O Lord the light that never sets? * Miserable sinner that I am, now this strange darkness covers me. * Savior, I implore You to bring me back to Your commandments, * which are light, and I pray You to guide my ways.
ltx/en_us_dedes/he.h.m8:heHE.KyrieOTheosImon.greekname	Κύριε ὁ Θεὸς ἡμῶν.
ltx/en_us_dedes/he.h.m8:heHE.KyrieOTheosImon.incipit	O Lord our God, give peace…
ltx/en_us_dedes/he.h.m8:heHE.KyrieOTheosImon.melody	@ltx/en_us_dedes/miscellanea:misc.Heirmos
ltx/en_us_dedes/he.h.m8:heHE.KyrieOTheosImon.mode	@ltx/en_us_dedes/miscellanea:misc.Mode8
ltx/en_us_dedes/he.h.m8:heHE.KyrieOTheosImon.name	O Lord our God, give peace.
ltx/en_us_dedes/he.h.m8:heHE.KyrieOTheosImon.notmetered	N/M (O Lord our God.)
ltx/en_us_dedes/he.h.m8:heHE.KyrieOTheosImon.ode	@ltx/en_us_dedes/miscellanea:misc.Ode5
ltx/en_us_dedes/he.h.m8:heHE.KyrieOTheosImon.text	O Lord our God, give peace to us, for You have rendered all. * O Lord our God, we pray, take possession of us. * Lord, O Lord, we do not know any other God except for You, and we name Your name.
ltx/en_us_dedes/he.h.m8:heHE.KyriosTheotokon.greekname	Κυρίως Θεοτόκον.
ltx/en_us_dedes/he.h.m8:heHE.KyriosTheotokon.incipit	You are the Theotokos…
ltx/en_us_dedes/he.h.m8:heHE.KyriosTheotokon.melody	@ltx/en_us_dedes/miscellanea:misc.Heirmos
ltx/en_us_dedes/he.h.m8:heHE.KyriosTheotokon.mode	@ltx/en_us_dedes/miscellanea:misc.Mode8
ltx/en_us_dedes/he.h.m8:heHE.KyriosTheotokon.name	You are the Theotokos.
ltx/en_us_dedes/he.h.m8:heHE.KyriosTheotokon.notmetered	N/M (You are the Theotokos.)
ltx/en_us_dedes/he.h.m8:heHE.KyriosTheotokon.ode	@ltx/en_us_dedes/miscellanea:misc.Ode9
ltx/en_us_dedes/he.h.m8:heHE.KyriosTheotokon.text	You are the Theotokos * lit’rally, O Virgin; * and we confess it, for we have been saved through you * whom we, O pure one, with choirs of angels magnify.
ltx/en_us_dedes/he.h.m8:heHE.MegalynomenSeTinMiteraTouFotos.greekname	Μεγαλύνομέν σε τὴν Μητέρα τοῦ φωτός.
ltx/en_us_dedes/he.h.m8:heHE.MegalynomenSeTinMiteraTouFotos.incipit	We all magnify you as the Mother of the Light…
ltx/en_us_dedes/he.h.m8:heHE.MegalynomenSeTinMiteraTouFotos.melody	@ltx/en_us_dedes/miscellanea:misc.Heirmos
ltx/en_us_dedes/he.h.m8:heHE.MegalynomenSeTinMiteraTouFotos.mode	@ltx/en_us_dedes/miscellanea:misc.Mode8
ltx/en_us_dedes/he.h.m8:heHE.MegalynomenSeTinMiteraTouFotos.name	We all magnify you as the Mother of the Light.
ltx/en_us_dedes/he.h.m8:heHE.MegalynomenSeTinMiteraTouFotos.notmetered	N/M (We all magnify you as the Mother of the Light.)
ltx/en_us_dedes/he.h.m8:heHE.MegalynomenSeTinMiteraTouFotos.ode	@ltx/en_us_dedes/miscellanea:misc.Ode9
ltx/en_us_dedes/he.h.m8:heHE.MegalynomenSeTinMiteraTouFotos.text	We all magnify you as the Mother of the Light, * and we glorify you, O Virgin Theotokos, * as the one who gave birth * to the Savior of our souls, Jesus Christ.
ltx/en_us_dedes/he.h.m8:heHE.MegalynomenSeTinMiteraTouTheou.greekname	Μεγαλύνομέν σε τὴν Μητέρα τοῦ Θεοῦ.
ltx/en_us_dedes/he.h.m8:heHE.MegalynomenSeTinMiteraTouTheou.incipit	We all magnify you as the Mother of our God…
ltx/en_us_dedes/he.h.m8:heHE.MegalynomenSeTinMiteraTouTheou.melody	@ltx/en_us_dedes/miscellanea:misc.Heirmos
ltx/en_us_dedes/he.h.m8:heHE.MegalynomenSeTinMiteraTouTheou.mode	@ltx/en_us_dedes/miscellanea:misc.Mode8
ltx/en_us_dedes/he.h.m8:heHE.MegalynomenSeTinMiteraTouTheou.name	We all magnify you as the Mother of our God.
ltx/en_us_dedes/he.h.m8:heHE.MegalynomenSeTinMiteraTouTheou.notmetered	N/M (We all magnify you as the Mother of our God.)
ltx/en_us_dedes/he.h.m8:heHE.MegalynomenSeTinMiteraTouTheou.ode	@ltx/en_us_dedes/miscellanea:misc.Ode9
ltx/en_us_dedes/he.h.m8:heHE.MegalynomenSeTinMiteraTouTheou.text	We all magnify you as the Mother of our God, * and we glorify you, O Virgin Theotokos, * as the one who gave birth to the Savior of our souls.
ltx/en_us_dedes/he.h.m8:heHE.MegalynomenSeTinPanamomon.greekname	Μεγαλύνομέν σε τὴν πανάμωμον.
ltx/en_us_dedes/he.h.m8:heHE.MegalynomenSeTinPanamomon.incipit	…
ltx/en_us_dedes/he.h.m8:heHE.MegalynomenSeTinPanamomon.melody	@ltx/en_us_dedes/miscellanea:misc.Heirmos
ltx/en_us_dedes/he.h.m8:heHE.MegalynomenSeTinPanamomon.mode	@ltx/en_us_dedes/miscellanea:misc.Mode8
ltx/en_us_dedes/he.h.m8:heHE.MegalynomenSeTinPanamomon.name	
ltx/en_us_dedes/he.h.m8:heHE.MegalynomenSeTinPanamomon.notmetered	N/M ()
ltx/en_us_dedes/he.h.m8:heHE.MegalynomenSeTinPanamomon.ode	@ltx/en_us_dedes/miscellanea:misc.Ode9
ltx/en_us_dedes/he.h.m8:heHE.MegalynomenSeTinPanamomon.text	
ltx/en_us_dedes/he.h.m8:heHE.MousikonOrganon.greekname	Μουσικῶν ὀργάνων.
ltx/en_us_dedes/he.h.m8:heHE.MousikonOrganon.incipit	At the sound…
ltx/en_us_dedes/he.h.m8:heHE.MousikonOrganon.melody	@ltx/en_us_dedes/miscellanea:misc.Heirmos
ltx/en_us_dedes/he.h.m8:heHE.MousikonOrganon.mode	@ltx/en_us_dedes/miscellanea:misc.Mode8
ltx/en_us_dedes/he.h.m8:heHE.MousikonOrganon.name	At the sound.
ltx/en_us_dedes/he.h.m8:heHE.MousikonOrganon.notmetered	N/M (At the sound.)
ltx/en_us_dedes/he.h.m8:heHE.MousikonOrganon.ode	@ltx/en_us_dedes/miscellanea:misc.Ode8
ltx/en_us_dedes/he.h.m8:heHE.MousikonOrganon.text	At the sound of every kind of music, * multitudes of people fell and worshiped * the golden image in Dura. Three Servants, noncompliant, * extolled the Lord and praised Him, and they glorified Him unto all the ages.
ltx/en_us_dedes/he.h.m8:heHE.MystikosEiTheotoke.greekname	Μυστικὸς εἶ Θεοτόκε.
ltx/en_us_dedes/he.h.m8:heHE.MystikosEiTheotoke.incipit	Theotokos, you are mystical…
ltx/en_us_dedes/he.h.m8:heHE.MystikosEiTheotoke.melody	@ltx/en_us_dedes/miscellanea:misc.Heirmos
ltx/en_us_dedes/he.h.m8:heHE.MystikosEiTheotoke.mode	@ltx/en_us_dedes/miscellanea:misc.Mode8
ltx/en_us_dedes/he.h.m8:heHE.MystikosEiTheotoke.name	Theotokos, you are mystical.
ltx/en_us_dedes/he.h.m8:heHE.MystikosEiTheotoke.notmetered	N/M (Theotokos…mystical.)
ltx/en_us_dedes/he.h.m8:heHE.MystikosEiTheotoke.ode	@ltx/en_us_dedes/miscellanea:misc.Ode9
ltx/en_us_dedes/he.h.m8:heHE.MystikosEiTheotoke.text	Theotokos, you are mystical Paradise, * for without husbandry you have blossomed Christ, * by whom on earth the Cross, as a life-bearing tree, has been planted and watered. * As it is now exalted, * we adore Him and worship Him and magnify you.
ltx/en_us_dedes/he.h.m8:heHE.MystikosOProfitis.greekname	Μυστικῶς ὁ Προφήτης.
ltx/en_us_dedes/he.h.m8:heHE.MystikosOProfitis.incipit	…
ltx/en_us_dedes/he.h.m8:heHE.MystikosOProfitis.melody	@ltx/en_us_dedes/miscellanea:misc.Heirmos
ltx/en_us_dedes/he.h.m8:heHE.MystikosOProfitis.mode	@ltx/en_us_dedes/miscellanea:misc.Mode8
ltx/en_us_dedes/he.h.m8:heHE.MystikosOProfitis.name	
ltx/en_us_dedes/he.h.m8:heHE.MystikosOProfitis.notmetered	N/M ()
ltx/en_us_dedes/he.h.m8:heHE.MystikosOProfitis.ode	@ltx/en_us_dedes/miscellanea:misc.Ode4
ltx/en_us_dedes/he.h.m8:heHE.MystikosOProfitis.text	
ltx/en_us_dedes/he.h.m8:heHE.NikitaiTyrannou.greekname	Νικηταὶ τυράννου.
ltx/en_us_dedes/he.h.m8:heHE.NikitaiTyrannou.incipit	By Your grace those Servants…
ltx/en_us_dedes/he.h.m8:heHE.NikitaiTyrannou.melody	@ltx/en_us_dedes/miscellanea:misc.Heirmos
ltx/en_us_dedes/he.h.m8:heHE.NikitaiTyrannou.mode	@ltx/en_us_dedes/miscellanea:misc.Mode8
ltx/en_us_dedes/he.h.m8:heHE.NikitaiTyrannou.name	By Your grace those Servants.
ltx/en_us_dedes/he.h.m8:heHE.NikitaiTyrannou.notmetered	N/M (By Your grace.)
ltx/en_us_dedes/he.h.m8:heHE.NikitaiTyrannou.ode	@ltx/en_us_dedes/miscellanea:misc.Ode8
ltx/en_us_dedes/he.h.m8:heHE.NikitaiTyrannou.text	By Your grace those Servants, * who adhered exceedingly to Your commandments, * once became the victors * over the tyrant * and the burning flame in the furnace and cried aloud: * Bless the Lord, O all you the works of the Lord, * and supremely exalt Him unto all the ages.
ltx/en_us_dedes/he.h.m8:heHE.NotiouThiros.greekname	Νοτίου θηρός.
ltx/en_us_dedes/he.h.m8:heHE.NotiouThiros.incipit	When Jonah…
ltx/en_us_dedes/he.h.m8:heHE.NotiouThiros.melody	@ltx/en_us_dedes/miscellanea:misc.Heirmos
ltx/en_us_dedes/he.h.m8:heHE.NotiouThiros.mode	@ltx/en_us_dedes/miscellanea:misc.Mode8
ltx/en_us_dedes/he.h.m8:heHE.NotiouThiros.name	When Jonah.
ltx/en_us_dedes/he.h.m8:heHE.NotiouThiros.notmetered	N/M (When Jonah.)
ltx/en_us_dedes/he.h.m8:heHE.NotiouThiros.ode	@ltx/en_us_dedes/miscellanea:misc.Ode6
ltx/en_us_dedes/he.h.m8:heHE.NotiouThiros.text	In the belly of the sea beast * the prophet Jonah prayed with his arms extended crosswise; * thus he clearly prefigured the saving Passion of Christ. * When after three days he emerged, * he was depicting the supernal resurrection from the dead * of Christ God, who was physically nailed to the Cross * and by His third-day arising illumined the universe.
ltx/en_us_dedes/he.h.m8:heHE.ODiAngelouPaidas.greekname	Ὁ διʼ Ἀγγέλου Παῖδας.
ltx/en_us_dedes/he.h.m8:heHE.ODiAngelouPaidas.incipit	O Lord, You saved…
ltx/en_us_dedes/he.h.m8:heHE.ODiAngelouPaidas.melody	@ltx/en_us_dedes/miscellanea:misc.Heirmos
ltx/en_us_dedes/he.h.m8:heHE.ODiAngelouPaidas.mode	@ltx/en_us_dedes/miscellanea:misc.Mode8
ltx/en_us_dedes/he.h.m8:heHE.ODiAngelouPaidas.name	O Lord, You saved.
ltx/en_us_dedes/he.h.m8:heHE.ODiAngelouPaidas.notmetered	N/M (O Lord, You saved.)
ltx/en_us_dedes/he.h.m8:heHE.ODiAngelouPaidas.ode	@ltx/en_us_dedes/miscellanea:misc.Ode7
ltx/en_us_dedes/he.h.m8:heHE.ODiAngelouPaidas.text	O Lord, You saved those Servants from the fire by an Angel, * and made the raging furnace be as though dewy refreshment. * We sing to You: Blessed are You, O God of our fathers.
ltx/en_us_dedes/he.h.m8:heHE.ODiaVroseos.greekname	Ὁ διὰ βρώσεως.
ltx/en_us_dedes/he.h.m8:heHE.ODiaVroseos.incipit	Eating the tree’s…
ltx/en_us_dedes/he.h.m8:heHE.ODiaVroseos.melody	@ltx/en_us_dedes/miscellanea:misc.Heirmos
ltx/en_us_dedes/he.h.m8:heHE.ODiaVroseos.mode	@ltx/en_us_dedes/miscellanea:misc.Mode8
ltx/en_us_dedes/he.h.m8:heHE.ODiaVroseos.name	Eating the tree’s.
ltx/en_us_dedes/he.h.m8:heHE.ODiaVroseos.notmetered	N/M (Eating the tree’s.)
ltx/en_us_dedes/he.h.m8:heHE.ODiaVroseos.ode	@ltx/en_us_dedes/miscellanea:misc.Ode9
ltx/en_us_dedes/he.h.m8:heHE.ODiaVroseos.text	Eating the tree’s forbidden fruit once * in Paradise brought death to the human race. * But through the Cross, today death has no effect, * because the curse that fell on the entire human race through mother Eve * was undone by the Offspring of the all pure Mother of God, who now is by all the hosts of heaven magnified.
ltx/en_us_dedes/he.h.m8:heHE.OEkNyktosAgnoias.greekname	Ὁ ἐκ νυκτὸς ἀγνοίας.
ltx/en_us_dedes/he.h.m8:heHE.OEkNyktosAgnoias.incipit	You lit the world…
ltx/en_us_dedes/he.h.m8:heHE.OEkNyktosAgnoias.melody	@ltx/en_us_dedes/miscellanea:misc.Heirmos
ltx/en_us_dedes/he.h.m8:heHE.OEkNyktosAgnoias.mode	@ltx/en_us_dedes/miscellanea:misc.Mode8
ltx/en_us_dedes/he.h.m8:heHE.OEkNyktosAgnoias.name	You lit the world.
ltx/en_us_dedes/he.h.m8:heHE.OEkNyktosAgnoias.notmetered	N/M (You lit the world.)
ltx/en_us_dedes/he.h.m8:heHE.OEkNyktosAgnoias.ode	@ltx/en_us_dedes/miscellanea:misc.Ode5
ltx/en_us_dedes/he.h.m8:heHE.OEkNyktosAgnoias.text	You lit the world with knowledge * of God, and woke it from night-time of ignorance. * Lord, illumine me also * with the morning light of Your benevolence.
ltx/en_us_dedes/he.h.m8:heHE.OEnArchiTinGin.greekname	Ὁ ἐν ἀρχῇ τὴν γῆν.
ltx/en_us_dedes/he.h.m8:heHE.OEnArchiTinGin.incipit	O Lord, You founded earth…
ltx/en_us_dedes/he.h.m8:heHE.OEnArchiTinGin.melody	@ltx/en_us_dedes/miscellanea:misc.Heirmos
ltx/en_us_dedes/he.h.m8:heHE.OEnArchiTinGin.mode	@ltx/en_us_dedes/miscellanea:misc.Mode8
ltx/en_us_dedes/he.h.m8:heHE.OEnArchiTinGin.name	O Lord, You founded earth.
ltx/en_us_dedes/he.h.m8:heHE.OEnArchiTinGin.notmetered	N/M (O Lord, You founded earth.)
ltx/en_us_dedes/he.h.m8:heHE.OEnArchiTinGin.ode	@ltx/en_us_dedes/miscellanea:misc.Ode7
ltx/en_us_dedes/he.h.m8:heHE.OEnArchiTinGin.text	O Lord, You founded earth in the beginning, * and by Your word the heavens were established. * Blessed are You unto all the ages. * O Lord, the God of our fathers, blessed are You.
ltx/en_us_dedes/he.h.m8:heHE.OProfitisAvvakoum.greekname	Ὁ Προφήτης Ἀββακούμ.
ltx/en_us_dedes/he.h.m8:heHE.OProfitisAvvakoum.incipit	With his spiritual eyes…
ltx/en_us_dedes/he.h.m8:heHE.OProfitisAvvakoum.melody	@ltx/en_us_dedes/miscellanea:misc.Heirmos
ltx/en_us_dedes/he.h.m8:heHE.OProfitisAvvakoum.mode	@ltx/en_us_dedes/miscellanea:misc.Mode8
ltx/en_us_dedes/he.h.m8:heHE.OProfitisAvvakoum.name	With his spiritual eyes.
ltx/en_us_dedes/he.h.m8:heHE.OProfitisAvvakoum.notmetered	N/M (With his spiritual eyes.)
ltx/en_us_dedes/he.h.m8:heHE.OProfitisAvvakoum.ode	@ltx/en_us_dedes/miscellanea:misc.Ode4
ltx/en_us_dedes/he.h.m8:heHE.OProfitisAvvakoum.text	With his spiritual eyes, the Prophet Habakkuk saw * in the future Your appearance on the earth, O Lord. * And therefore he cried out and said that God from Theman will surely come. * Glory to Your glory, O Christ! * Glory to Your condescension, O Lord!
ltx/en_us_dedes/he.h.m8:heHE.OStegazonEnYdasi.greekname	Ὁ στεγάζων ἐν ὕδασι.
ltx/en_us_dedes/he.h.m8:heHE.OStegazonEnYdasi.incipit	In the waters…
ltx/en_us_dedes/he.h.m8:heHE.OStegazonEnYdasi.melody	@ltx/en_us_dedes/miscellanea:misc.Heirmos
ltx/en_us_dedes/he.h.m8:heHE.OStegazonEnYdasi.mode	@ltx/en_us_dedes/miscellanea:misc.Mode8
ltx/en_us_dedes/he.h.m8:heHE.OStegazonEnYdasi.name	In the waters.
ltx/en_us_dedes/he.h.m8:heHE.OStegazonEnYdasi.notmetered	N/M (In the waters.)
ltx/en_us_dedes/he.h.m8:heHE.OStegazonEnYdasi.ode	@ltx/en_us_dedes/miscellanea:misc.Ode8
ltx/en_us_dedes/he.h.m8:heHE.OStegazonEnYdasi.text	In the waters You lay the beams of upper chambers, O Christ. * For the sea You placed the sand as its bound. You hold all things in Your hand. * Sun and moon glorify, sing Your praise, and extol You. * Lord, to You the Maker and Creator, * all creation offers worship, unto the ages.
ltx/en_us_dedes/he.h.m8:heHE.OStereosasEnTiCheiriSou.greekname	Ὁ στερεώσας ἐν τῇ χειρί σου.
ltx/en_us_dedes/he.h.m8:heHE.OStereosasEnTiCheiriSou.incipit	…
ltx/en_us_dedes/he.h.m8:heHE.OStereosasEnTiCheiriSou.melody	@ltx/en_us_dedes/miscellanea:misc.HeirmosNotMetered
ltx/en_us_dedes/he.h.m8:heHE.OStereosasEnTiCheiriSou.mode	@ltx/en_us_dedes/miscellanea:misc.Mode8
ltx/en_us_dedes/he.h.m8:heHE.OStereosasEnTiCheiriSou.name	
ltx/en_us_dedes/he.h.m8:heHE.OStereosasEnTiCheiriSou.notmetered	N/M ()
ltx/en_us_dedes/he.h.m8:heHE.OStereosasEnTiCheiriSou.ode	@ltx/en_us_dedes/miscellanea:misc.Ode3
ltx/en_us_dedes/he.h.m8:heHE.OStereosasEnTiCheiriSou.text	O Logos of God, in Your hand You established the heavens. We who trust in You pray that You establish our hearts in the illumination of the true knowledge of You.
ltx/en_us_dedes/he.h.m8:heHE.OStereosasKatArchas.greekname	Ὁ στερεώσας κατʼ ἀρχάς.
ltx/en_us_dedes/he.h.m8:heHE.OStereosasKatArchas.incipit	In the beginning…
ltx/en_us_dedes/he.h.m8:heHE.OStereosasKatArchas.melody	@ltx/en_us_dedes/miscellanea:misc.Heirmos
ltx/en_us_dedes/he.h.m8:heHE.OStereosasKatArchas.mode	@ltx/en_us_dedes/miscellanea:misc.Mode8
ltx/en_us_dedes/he.h.m8:heHE.OStereosasKatArchas.name	In the beginning.
ltx/en_us_dedes/he.h.m8:heHE.OStereosasKatArchas.notmetered	N/M (In the beginning.)
ltx/en_us_dedes/he.h.m8:heHE.OStereosasKatArchas.ode	@ltx/en_us_dedes/miscellanea:misc.Ode3
ltx/en_us_dedes/he.h.m8:heHE.OStereosasKatArchas.text	In the beginning, You O Christ, * established all of the heavens, * and You made firm the earth upon the waters, * with intelligence divine. Confirm me on the Church’s rock. * No one but You is holy, and only You are benevolent.
ltx/en_us_dedes/he.h.m8:heHE.OStereosasLogo.greekname	Ὁ στερεώσας λόγῳ.
ltx/en_us_dedes/he.h.m8:heHE.OStereosasLogo.incipit	The heavens You established…
ltx/en_us_dedes/he.h.m8:heHE.OStereosasLogo.melody	@ltx/en_us_dedes/miscellanea:misc.Heirmos
ltx/en_us_dedes/he.h.m8:heHE.OStereosasLogo.mode	@ltx/en_us_dedes/miscellanea:misc.Mode8
ltx/en_us_dedes/he.h.m8:heHE.OStereosasLogo.name	The heavens You established.
ltx/en_us_dedes/he.h.m8:heHE.OStereosasLogo.notmetered	N/M (The heavens You established.)
ltx/en_us_dedes/he.h.m8:heHE.OStereosasLogo.ode	@ltx/en_us_dedes/miscellanea:misc.Ode3
ltx/en_us_dedes/he.h.m8:heHE.OStereosasLogo.text	The heavens You established by Your own word, * and on many waters You stabilized the earth. * Establish me as a singer * glorifying You from my heart, O Lord.
ltx/en_us_dedes/he.h.m8:heHE.OTousPaidasDrosisas.greekname	Ὁ τοὺς Παῖδας δροσίσας.
ltx/en_us_dedes/he.h.m8:heHE.OTousPaidasDrosisas.incipit	…
ltx/en_us_dedes/he.h.m8:heHE.OTousPaidasDrosisas.melody	@ltx/en_us_dedes/miscellanea:misc.Heirmos
ltx/en_us_dedes/he.h.m8:heHE.OTousPaidasDrosisas.mode	@ltx/en_us_dedes/miscellanea:misc.Mode8
ltx/en_us_dedes/he.h.m8:heHE.OTousPaidasDrosisas.name	
ltx/en_us_dedes/he.h.m8:heHE.OTousPaidasDrosisas.notmetered	N/M ()
ltx/en_us_dedes/he.h.m8:heHE.OTousPaidasDrosisas.ode	@ltx/en_us_dedes/miscellanea:misc.Ode7
ltx/en_us_dedes/he.h.m8:heHE.OTousPaidasDrosisas.text	
ltx/en_us_dedes/he.h.m8:heHE.OTrismakaristonXylon.greekname	Ὦ τρισμακάριστον ξύλον.
ltx/en_us_dedes/he.h.m8:heHE.OTrismakaristonXylon.incipit	Tree of the Cross…
ltx/en_us_dedes/he.h.m8:heHE.OTrismakaristonXylon.melody	@ltx/en_us_dedes/miscellanea:misc.Heirmos
ltx/en_us_dedes/he.h.m8:heHE.OTrismakaristonXylon.mode	@ltx/en_us_dedes/miscellanea:misc.Mode8
ltx/en_us_dedes/he.h.m8:heHE.OTrismakaristonXylon.name	Tree of the Cross.
ltx/en_us_dedes/he.h.m8:heHE.OTrismakaristonXylon.notmetered	N/M (Tree of the Cross.)
ltx/en_us_dedes/he.h.m8:heHE.OTrismakaristonXylon.ode	@ltx/en_us_dedes/miscellanea:misc.Ode5
ltx/en_us_dedes/he.h.m8:heHE.OTrismakaristonXylon.text	Tree of the Cross, you are thrice-blessed, * for Jesus Christ, who is King and Lord, was crucified on you. * Through you fallen is the one who by a tree deceived us, * for he was lured by God who in the flesh indeed * was hung and nailed to you, * and who grants to our souls His peace.
ltx/en_us_dedes/he.h.m8:heHE.OiEkTisIoudaias.greekname	Οἱ ἐκ τῆς Ἰουδαίας.
ltx/en_us_dedes/he.h.m8:heHE.OiEkTisIoudaias.incipit	The Servants from Judea…
ltx/en_us_dedes/he.h.m8:heHE.OiEkTisIoudaias.melody	@ltx/en_us_dedes/miscellanea:misc.Heirmos
ltx/en_us_dedes/he.h.m8:heHE.OiEkTisIoudaias.mode	@ltx/en_us_dedes/miscellanea:misc.Mode8
ltx/en_us_dedes/he.h.m8:heHE.OiEkTisIoudaias.name	The Servants from Judea.
ltx/en_us_dedes/he.h.m8:heHE.OiEkTisIoudaias.notmetered	N/M (The Servants.)
ltx/en_us_dedes/he.h.m8:heHE.OiEkTisIoudaias.ode	@ltx/en_us_dedes/miscellanea:misc.Ode7
ltx/en_us_dedes/he.h.m8:heHE.OiEkTisIoudaias.text	Those Servants from Judea, * who of old were deported and sent to Babylon, * once treaded on the fire * of the furnace by holding * to the faith in the Trinity * and chanted: Blessed are You the God of our fathers.
ltx/en_us_dedes/he.h.m8:heHE.OiTheorrimonesPaides.greekname	Οἱ θεοῤῥήμονες Παῖδες.
ltx/en_us_dedes/he.h.m8:heHE.OiTheorrimonesPaides.incipit	Those Servants, speaking…
ltx/en_us_dedes/he.h.m8:heHE.OiTheorrimonesPaides.melody	@ltx/en_us_dedes/miscellanea:misc.Heirmos
ltx/en_us_dedes/he.h.m8:heHE.OiTheorrimonesPaides.mode	@ltx/en_us_dedes/miscellanea:misc.Mode8
ltx/en_us_dedes/he.h.m8:heHE.OiTheorrimonesPaides.name	Those Servants, speaking.
ltx/en_us_dedes/he.h.m8:heHE.OiTheorrimonesPaides.notmetered	N/M (Those Servants, speaking.)
ltx/en_us_dedes/he.h.m8:heHE.OiTheorrimonesPaides.ode	@ltx/en_us_dedes/miscellanea:misc.Ode8
ltx/en_us_dedes/he.h.m8:heHE.OiTheorrimonesPaides.text	Those Servants, speaking from God, in the furnace trampled * the fire and also the error * and the deception and they sang, “All you works of the Lord, praise and bless the Lord.”
ltx/en_us_dedes/he.h.m8:heHE.OiTisChaldaiasKaminou.greekname	Οἱ τῆς Χαλδαίας καμίνου.
ltx/en_us_dedes/he.h.m8:heHE.OiTisChaldaiasKaminou.incipit	…
ltx/en_us_dedes/he.h.m8:heHE.OiTisChaldaiasKaminou.melody	@ltx/en_us_dedes/miscellanea:misc.Heirmos
ltx/en_us_dedes/he.h.m8:heHE.OiTisChaldaiasKaminou.mode	@ltx/en_us_dedes/miscellanea:misc.Mode8
ltx/en_us_dedes/he.h.m8:heHE.OiTisChaldaiasKaminou.name	
ltx/en_us_dedes/he.h.m8:heHE.OiTisChaldaiasKaminou.notmetered	N/M ()
ltx/en_us_dedes/he.h.m8:heHE.OiTisChaldaiasKaminou.ode	@ltx/en_us_dedes/miscellanea:misc.Ode7
ltx/en_us_dedes/he.h.m8:heHE.OiTisChaldaiasKaminou.text	
ltx/en_us_dedes/he.h.m8:heHE.OrousParilthes.greekname	Ὅρους παρῆλθες.
ltx/en_us_dedes/he.h.m8:heHE.OrousParilthes.incipit	When you conceived…
ltx/en_us_dedes/he.h.m8:heHE.OrousParilthes.melody	@ltx/en_us_dedes/miscellanea:misc.Heirmos
ltx/en_us_dedes/he.h.m8:heHE.OrousParilthes.mode	@ltx/en_us_dedes/miscellanea:misc.Mode8
ltx/en_us_dedes/he.h.m8:heHE.OrousParilthes.name	When you conceived.
ltx/en_us_dedes/he.h.m8:heHE.OrousParilthes.notmetered	N/M (When you conceived.)
ltx/en_us_dedes/he.h.m8:heHE.OrousParilthes.ode	@ltx/en_us_dedes/miscellanea:misc.Ode9
ltx/en_us_dedes/he.h.m8:heHE.OrousParilthes.text	When you conceived your Maker and Lord, * you eluded nature’s conventions, O Virgin pure; * and you became a gate to salvation for the world. * Therefore, O Theotokos, * we faithful never cease to magnify you.
ltx/en_us_dedes/he.h.m8:heHE.OrthrizeiToPnevmaMou.greekname	Ὀρθρίζει τὸ πνεῦμά μου.
ltx/en_us_dedes/he.h.m8:heHE.OrthrizeiToPnevmaMou.incipit	N/M ()…
ltx/en_us_dedes/he.h.m8:heHE.OrthrizeiToPnevmaMou.melody	@ltx/en_us_dedes/miscellanea:misc.HeirmosNotMetered
ltx/en_us_dedes/he.h.m8:heHE.OrthrizeiToPnevmaMou.mode	@ltx/en_us_dedes/miscellanea:misc.Mode8
ltx/en_us_dedes/he.h.m8:heHE.OrthrizeiToPnevmaMou.name	N/M ()
ltx/en_us_dedes/he.h.m8:heHE.OrthrizeiToPnevmaMou.notmetered	N/M ()
ltx/en_us_dedes/he.h.m8:heHE.OrthrizeiToPnevmaMou.ode	@ltx/en_us_dedes/miscellanea:misc.Ode5
ltx/en_us_dedes/he.h.m8:heHE.OrthrizeiToPnevmaMou.text	My spirit rises early to You, O God, for Your commandments are the light of Your presence. With them shine upon our minds, O Master, and guide us on the path of life.
ltx/en_us_dedes/he.h.m8:heHE.OrthrizontesVoomenSoi.greekname	Ὀρθρίζοντες βοῶμέν σοι.
ltx/en_us_dedes/he.h.m8:heHE.OrthrizontesVoomenSoi.incipit	We rise at early morn…
ltx/en_us_dedes/he.h.m8:heHE.OrthrizontesVoomenSoi.melody	@ltx/en_us_dedes/miscellanea:misc.Heirmos
ltx/en_us_dedes/he.h.m8:heHE.OrthrizontesVoomenSoi.mode	@ltx/en_us_dedes/miscellanea:misc.Mode8
ltx/en_us_dedes/he.h.m8:heHE.OrthrizontesVoomenSoi.name	We rise at early morn.
ltx/en_us_dedes/he.h.m8:heHE.OrthrizontesVoomenSoi.notmetered	N/M (We rise at early morn.)
ltx/en_us_dedes/he.h.m8:heHE.OrthrizontesVoomenSoi.ode	@ltx/en_us_dedes/miscellanea:misc.Ode5
ltx/en_us_dedes/he.h.m8:heHE.OrthrizontesVoomenSoi.text	We rise at early morn and cry out to You, * “Save us, O Lord!” * For You only are our God; * we have no other except for You.
ltx/en_us_dedes/he.h.m8:heHE.OsTonProfitinErryso.greekname	Ὡς τὸν Προφήτην ἐῤῥύσω.
ltx/en_us_dedes/he.h.m8:heHE.OsTonProfitinErryso.incipit	O Christ my God…
ltx/en_us_dedes/he.h.m8:heHE.OsTonProfitinErryso.melody	@ltx/en_us_dedes/miscellanea:misc.Heirmos
ltx/en_us_dedes/he.h.m8:heHE.OsTonProfitinErryso.mode	@ltx/en_us_dedes/miscellanea:misc.Mode8
ltx/en_us_dedes/he.h.m8:heHE.OsTonProfitinErryso.name	O Christ my God.
ltx/en_us_dedes/he.h.m8:heHE.OsTonProfitinErryso.notmetered	N/M (O Christ my God.)
ltx/en_us_dedes/he.h.m8:heHE.OsTonProfitinErryso.ode	@ltx/en_us_dedes/miscellanea:misc.Ode6
ltx/en_us_dedes/he.h.m8:heHE.OsTonProfitinErryso.text	O Christ my God, as You rescued * Prophet Jonah of old from the depths of the sea, * I pray You, now rescue me * from my sins, and steer the ship * of my life, as You are my benevolent Lord.
ltx/en_us_dedes/he.h.m8:heHE.OsYdataThalassis.greekname	Ὡς ὕδατα θαλάσσης.
ltx/en_us_dedes/he.h.m8:heHE.OsYdataThalassis.incipit	The troubles of my life…
ltx/en_us_dedes/he.h.m8:heHE.OsYdataThalassis.melody	@ltx/en_us_dedes/miscellanea:misc.Heirmos
ltx/en_us_dedes/he.h.m8:heHE.OsYdataThalassis.mode	@ltx/en_us_dedes/miscellanea:misc.Mode8
ltx/en_us_dedes/he.h.m8:heHE.OsYdataThalassis.name	The troubles of my life.
ltx/en_us_dedes/he.h.m8:heHE.OsYdataThalassis.notmetered	N/M (The troubles of my life.)
ltx/en_us_dedes/he.h.m8:heHE.OsYdataThalassis.ode	@ltx/en_us_dedes/miscellanea:misc.Ode6
ltx/en_us_dedes/he.h.m8:heHE.OsYdataThalassis.text	The troubles of my life are like storms at sea, * O Logos, and the waves are afflicting me. * I cry to You, as once did the Prophet Jonah, * to raise my life from corruption, O only Lord and compassionate God.
ltx/en_us_dedes/he.h.m8:heHE.OukEstinAgios.greekname	Οὔκ ἐστιν ἅγιος.
ltx/en_us_dedes/he.h.m8:heHE.OukEstinAgios.incipit	No one is holy…
ltx/en_us_dedes/he.h.m8:heHE.OukEstinAgios.melody	@ltx/en_us_dedes/miscellanea:misc.HeirmosNotMetered
ltx/en_us_dedes/he.h.m8:heHE.OukEstinAgios.mode	@ltx/en_us_dedes/miscellanea:misc.Mode8
ltx/en_us_dedes/he.h.m8:heHE.OukEstinAgios.name	No one is holy.
ltx/en_us_dedes/he.h.m8:heHE.OukEstinAgios.notmetered	N/M (No one is holy.)
ltx/en_us_dedes/he.h.m8:heHE.OukEstinAgios.ode	@ltx/en_us_dedes/miscellanea:misc.Ode3
ltx/en_us_dedes/he.h.m8:heHE.OukEstinAgios.text	No one is holy like You are, O Lord, and no one is righteous like You our God. All creation extols You. No one is holy except for You, O Lord.
ltx/en_us_dedes/he.h.m8:heHE.OukEstinAgiosOsOTheos.greekname	Οὔκ ἐστιν ἅγιος ὡς ὁ Θεός.
ltx/en_us_dedes/he.h.m8:heHE.OukEstinAgiosOsOTheos.incipit	…
ltx/en_us_dedes/he.h.m8:heHE.OukEstinAgiosOsOTheos.melody	@ltx/en_us_dedes/miscellanea:misc.Heirmos
ltx/en_us_dedes/he.h.m8:heHE.OukEstinAgiosOsOTheos.mode	@ltx/en_us_dedes/miscellanea:misc.Mode8
ltx/en_us_dedes/he.h.m8:heHE.OukEstinAgiosOsOTheos.name	No one is holy like God.
ltx/en_us_dedes/he.h.m8:heHE.OukEstinAgiosOsOTheos.notmetered	N/M
ltx/en_us_dedes/he.h.m8:heHE.OukEstinAgiosOsOTheos.ode	@ltx/en_us_dedes/miscellanea:misc.Ode3
ltx/en_us_dedes/he.h.m8:heHE.OukEstinAgiosOsOTheos.text	[Missing]
ltx/en_us_dedes/he.h.m8:heHE.OuraniasApsidos.greekname	Οὐρανίας ἁψῖδος.
ltx/en_us_dedes/he.h.m8:heHE.OuraniasApsidos.incipit	O divine Master Builder…
ltx/en_us_dedes/he.h.m8:heHE.OuraniasApsidos.melody	@ltx/en_us_dedes/miscellanea:misc.Heirmos
ltx/en_us_dedes/he.h.m8:heHE.OuraniasApsidos.mode	@ltx/en_us_dedes/miscellanea:misc.Mode8
ltx/en_us_dedes/he.h.m8:heHE.OuraniasApsidos.name	O divine Master Builder.
ltx/en_us_dedes/he.h.m8:heHE.OuraniasApsidos.notmetered	N/M (O divine Master Builder.)
ltx/en_us_dedes/he.h.m8:heHE.OuraniasApsidos.ode	@ltx/en_us_dedes/miscellanea:misc.Ode3
ltx/en_us_dedes/he.h.m8:heHE.OuraniasApsidos.text	O divine Master Builder of the celestial vault, * Founder of the Church and the ultimate object of desire, * only benevolent support of every believer, * in the love for You, O Lord, firmly establish me.
ltx/en_us_dedes/he.h.m8:heHE.PaidesEvraion.greekname	Παῖδες Ἑβραίων.
ltx/en_us_dedes/he.h.m8:heHE.PaidesEvraion.incipit	Servants, descendants…
ltx/en_us_dedes/he.h.m8:heHE.PaidesEvraion.melody	@ltx/en_us_dedes/miscellanea:misc.Heirmos
ltx/en_us_dedes/he.h.m8:heHE.PaidesEvraion.mode	@ltx/en_us_dedes/miscellanea:misc.Mode8
ltx/en_us_dedes/he.h.m8:heHE.PaidesEvraion.name	Servants, descendants.
ltx/en_us_dedes/he.h.m8:heHE.PaidesEvraion.notmetered	N/M (Servants, descendants.)
ltx/en_us_dedes/he.h.m8:heHE.PaidesEvraion.ode	@ltx/en_us_dedes/miscellanea:misc.Ode7
ltx/en_us_dedes/he.h.m8:heHE.PaidesEvraion.text	Servants, descendants of the Hebrews, * bravely trampled down the flame within the furnace; * and they changed into dew * the fire, and they chanted: * Blessed are You, O Lord, the God * of our fathers to the ages.
ltx/en_us_dedes/he.h.m8:heHE.PaidesTheoseveis.greekname	Παῖδες θεοσεβεῖς.
ltx/en_us_dedes/he.h.m8:heHE.PaidesTheoseveis.incipit	God-fearing holy Servants…
ltx/en_us_dedes/he.h.m8:heHE.PaidesTheoseveis.melody	@ltx/en_us_dedes/miscellanea:misc.Heirmos
ltx/en_us_dedes/he.h.m8:heHE.PaidesTheoseveis.mode	@ltx/en_us_dedes/miscellanea:misc.Mode8
ltx/en_us_dedes/he.h.m8:heHE.PaidesTheoseveis.name	God-fearing holy Servants.
ltx/en_us_dedes/he.h.m8:heHE.PaidesTheoseveis.notmetered	N/M (God-fearing holy Servants.)
ltx/en_us_dedes/he.h.m8:heHE.PaidesTheoseveis.ode	@ltx/en_us_dedes/miscellanea:misc.Ode7
ltx/en_us_dedes/he.h.m8:heHE.PaidesTheoseveis.text	God-fearing holy Servants did not worship * the image of gold of old in Babylon. * They were thrown in the furnace, * where no fiery flame, but moist * whistling wind refreshed them, as they extolled * the Lord and sang: “O God of our fathers, blessed are You.”
ltx/en_us_dedes/he.h.m8:heHE.ProsTonDynamenonSozein.greekname	Πρὸς τὸν δυνάμενον σῴζειν.
ltx/en_us_dedes/he.h.m8:heHE.ProsTonDynamenonSozein.incipit	From the pit of sins…
ltx/en_us_dedes/he.h.m8:heHE.ProsTonDynamenonSozein.melody	@ltx/en_us_dedes/miscellanea:misc.HeirmosNotMetered
ltx/en_us_dedes/he.h.m8:heHE.ProsTonDynamenonSozein.mode	@ltx/en_us_dedes/miscellanea:misc.Mode8
ltx/en_us_dedes/he.h.m8:heHE.ProsTonDynamenonSozein.name	From the pit of sins.
ltx/en_us_dedes/he.h.m8:heHE.ProsTonDynamenonSozein.notmetered	N/M (From the pit of sins.)
ltx/en_us_dedes/he.h.m8:heHE.ProsTonDynamenonSozein.ode	@ltx/en_us_dedes/miscellanea:misc.Ode6
ltx/en_us_dedes/he.h.m8:heHE.ProsTonDynamenonSozein.text	From the pit of sins I cried to the Lord, who can save me; and He lifted my life from destruction, for He is benevolent.
ltx/en_us_dedes/he.h.m8:heHE.ProsecheOurane.greekname	Πρόσεχε οὐρανέ.
ltx/en_us_dedes/he.h.m8:heHE.ProsecheOurane.incipit	…
ltx/en_us_dedes/he.h.m8:heHE.ProsecheOurane.melody	@ltx/en_us_dedes/miscellanea:misc.Heirmos
ltx/en_us_dedes/he.h.m8:heHE.ProsecheOurane.mode	@ltx/en_us_dedes/miscellanea:misc.Mode8
ltx/en_us_dedes/he.h.m8:heHE.ProsecheOurane.name	
ltx/en_us_dedes/he.h.m8:heHE.ProsecheOurane.notmetered	N/M ()
ltx/en_us_dedes/he.h.m8:heHE.ProsecheOurane.ode	@ltx/en_us_dedes/miscellanea:misc.Ode2
ltx/en_us_dedes/he.h.m8:heHE.ProsecheOurane.text	
ltx/en_us_dedes/he.h.m8:heHE.RavdosEisTypon.greekname	Ῥάβδος εἰς τύπον.
ltx/en_us_dedes/he.h.m8:heHE.RavdosEisTypon.incipit	The rod of Aaron…
ltx/en_us_dedes/he.h.m8:heHE.RavdosEisTypon.melody	@ltx/en_us_dedes/miscellanea:misc.Heirmos
ltx/en_us_dedes/he.h.m8:heHE.RavdosEisTypon.mode	@ltx/en_us_dedes/miscellanea:misc.Mode8
ltx/en_us_dedes/he.h.m8:heHE.RavdosEisTypon.name	The rod of Aaron.
ltx/en_us_dedes/he.h.m8:heHE.RavdosEisTypon.notmetered	N/M (The rod of Aaron.)
ltx/en_us_dedes/he.h.m8:heHE.RavdosEisTypon.ode	@ltx/en_us_dedes/miscellanea:misc.Ode3
ltx/en_us_dedes/he.h.m8:heHE.RavdosEisTypon.text	The rod of Aaron is seen as typifying the mystery; * for it budded, and thus was the priest selected. * Now in the Church, that was barren once, the Cross of Christ, like a tree, * has blossomed forth, * as power and a firm support.
ltx/en_us_dedes/he.h.m8:heHE.SeTinApeirogamon.greekname	Σὲ τὴν ἀπειρόγαμον.
ltx/en_us_dedes/he.h.m8:heHE.SeTinApeirogamon.incipit	With unceasing hymns…
ltx/en_us_dedes/he.h.m8:heHE.SeTinApeirogamon.melody	@ltx/en_us_dedes/miscellanea:misc.Heirmos
ltx/en_us_dedes/he.h.m8:heHE.SeTinApeirogamon.mode	@ltx/en_us_dedes/miscellanea:misc.Mode8
ltx/en_us_dedes/he.h.m8:heHE.SeTinApeirogamon.name	With unceasing hymns.
ltx/en_us_dedes/he.h.m8:heHE.SeTinApeirogamon.notmetered	N/M (With unceasing hymns.)
ltx/en_us_dedes/he.h.m8:heHE.SeTinApeirogamon.ode	@ltx/en_us_dedes/miscellanea:misc.Ode9
ltx/en_us_dedes/he.h.m8:heHE.SeTinApeirogamon.text	With unceasing hymns of praise we glorify and magnify you, * the unwedded Mother of the Most High God; * by a word you gave birth to the true God inexplicably, * and you are higher than the immaculate angelic hosts.
ltx/en_us_dedes/he.h.m8:heHE.SeTinOuranou.greekname	Σὲ τὴν οὐρανοῦ.
ltx/en_us_dedes/he.h.m8:heHE.SeTinOuranou.incipit	…
ltx/en_us_dedes/he.h.m8:heHE.SeTinOuranou.melody	@ltx/en_us_dedes/miscellanea:misc.HeirmosNotMetered
ltx/en_us_dedes/he.h.m8:heHE.SeTinOuranou.mode	@ltx/en_us_dedes/miscellanea:misc.Mode8
ltx/en_us_dedes/he.h.m8:heHE.SeTinOuranou.name	
ltx/en_us_dedes/he.h.m8:heHE.SeTinOuranou.notmetered	N/M
ltx/en_us_dedes/he.h.m8:heHE.SeTinOuranou.ode	@ltx/en_us_dedes/miscellanea:misc.Ode9
ltx/en_us_dedes/he.h.m8:heHE.SeTinOuranou.text	We, all generations, magnify you, the mediator between heaven and earth. Indeed, O Virgin, the fullness of the Godhead dwelt in you physically.
ltx/en_us_dedes/he.h.m8:heHE.StavronCharaxasMosis.greekname	Σταυρὸν χαράξας Μωσῆς.
ltx/en_us_dedes/he.h.m8:heHE.StavronCharaxasMosis.incipit	Moses prefigured…
ltx/en_us_dedes/he.h.m8:heHE.StavronCharaxasMosis.melody	@ltx/en_us_dedes/miscellanea:misc.Heirmos
ltx/en_us_dedes/he.h.m8:heHE.StavronCharaxasMosis.mode	@ltx/en_us_dedes/miscellanea:misc.Mode8
ltx/en_us_dedes/he.h.m8:heHE.StavronCharaxasMosis.name	Moses prefigured.
ltx/en_us_dedes/he.h.m8:heHE.StavronCharaxasMosis.notmetered	N/M (Moses prefigured.)
ltx/en_us_dedes/he.h.m8:heHE.StavronCharaxasMosis.ode	@ltx/en_us_dedes/miscellanea:misc.Ode1
ltx/en_us_dedes/he.h.m8:heHE.StavronCharaxasMosis.text	Moses prefigured the Cross. * Lifting up the rod, he stretched out his hand and split the Sea for Israel to cross on land. * Then he stretched it out again, * and the sea returned and covered Pharaoh’s chariots. * The Cross was thus portrayed as our invincible armor. * So let us sing to the Lord, * Christ our God, for He is greatly glorified.
ltx/en_us_dedes/he.h.m8:heHE.StereomaMouSotir.greekname	Στερέωμά μου Σωτήρ.
ltx/en_us_dedes/he.h.m8:heHE.StereomaMouSotir.incipit	…
ltx/en_us_dedes/he.h.m8:heHE.StereomaMouSotir.melody	@ltx/en_us_dedes/miscellanea:misc.HeirmosNotMetered
ltx/en_us_dedes/he.h.m8:heHE.StereomaMouSotir.mode	@ltx/en_us_dedes/miscellanea:misc.Mode8
ltx/en_us_dedes/he.h.m8:heHE.StereomaMouSotir.name	
ltx/en_us_dedes/he.h.m8:heHE.StereomaMouSotir.notmetered	N/M ()
ltx/en_us_dedes/he.h.m8:heHE.StereomaMouSotir.ode	@ltx/en_us_dedes/miscellanea:misc.Ode3
ltx/en_us_dedes/he.h.m8:heHE.StereomaMouSotir.text	O Savior, You are my firm support, my refuge, and my strength. When my heart is shaken, confirm it in the fear of You; for there is no one holy, like You are God.
ltx/en_us_dedes/he.h.m8:heHE.StereosonImonTonNoun.greekname	Στερέωσον ἡμῶν τὸν νοῦν.
ltx/en_us_dedes/he.h.m8:heHE.StereosonImonTonNoun.incipit	By Your word…
ltx/en_us_dedes/he.h.m8:heHE.StereosonImonTonNoun.melody	@ltx/en_us_dedes/miscellanea:misc.Heirmos
ltx/en_us_dedes/he.h.m8:heHE.StereosonImonTonNoun.mode	@ltx/en_us_dedes/miscellanea:misc.Mode8
ltx/en_us_dedes/he.h.m8:heHE.StereosonImonTonNoun.name	By Your word.
ltx/en_us_dedes/he.h.m8:heHE.StereosonImonTonNoun.notmetered	N/M (By Your word.)
ltx/en_us_dedes/he.h.m8:heHE.StereosonImonTonNoun.ode	@ltx/en_us_dedes/miscellanea:misc.Ode3
ltx/en_us_dedes/he.h.m8:heHE.StereosonImonTonNoun.text	By Your word, O Lord, the heavens were established. * Now our hearts and minds, we pray You to establish, * that we may praise You, O Savior, and glorify You, * the all compassionate Redeemer and God.
ltx/en_us_dedes/he.h.m8:heHE.SyEiToStereoma.greekname	Σὺ εἶ τὸ στερέωμα.
ltx/en_us_dedes/he.h.m8:heHE.SyEiToStereoma.incipit	Lord, You are the firm…
ltx/en_us_dedes/he.h.m8:heHE.SyEiToStereoma.melody	@ltx/en_us_dedes/miscellanea:misc.Heirmos
ltx/en_us_dedes/he.h.m8:heHE.SyEiToStereoma.mode	@ltx/en_us_dedes/miscellanea:misc.Mode8
ltx/en_us_dedes/he.h.m8:heHE.SyEiToStereoma.name	Lord, You are the firm.
ltx/en_us_dedes/he.h.m8:heHE.SyEiToStereoma.notmetered	N/M (Lord, You are the firm.)
ltx/en_us_dedes/he.h.m8:heHE.SyEiToStereoma.ode	@ltx/en_us_dedes/miscellanea:misc.Ode3
ltx/en_us_dedes/he.h.m8:heHE.SyEiToStereoma.text	Lord, You are the firm support * of those run to You faithfully. * You are the light * of those who are darkened. * And my spirit is praising You.
ltx/en_us_dedes/he.h.m8:heHE.SyMouIschys.greekname	Σύ μου ἰσχύς.
ltx/en_us_dedes/he.h.m8:heHE.SyMouIschys.incipit	You are my strength…
ltx/en_us_dedes/he.h.m8:heHE.SyMouIschys.melody	@ltx/en_us_dedes/miscellanea:misc.Heirmos
ltx/en_us_dedes/he.h.m8:heHE.SyMouIschys.mode	@ltx/en_us_dedes/miscellanea:misc.Mode8
ltx/en_us_dedes/he.h.m8:heHE.SyMouIschys.name	You are my strength.
ltx/en_us_dedes/he.h.m8:heHE.SyMouIschys.notmetered	N/M (You are my strength.)
ltx/en_us_dedes/he.h.m8:heHE.SyMouIschys.ode	@ltx/en_us_dedes/miscellanea:misc.Ode4
ltx/en_us_dedes/he.h.m8:heHE.SyMouIschys.text	You are my strength. * You are my power, O Christ my Lord. * God my Savior, You are my exceeding joy. You came to us, never absent from the bosom of the Father, * and You assumed human poverty. * And so I join the Prophet Habakkuk, singing: Glory * to Your strength, O benevolent Lord my God!
ltx/en_us_dedes/he.h.m8:heHE.SynechomenonDexaiMe.greekname	Συνεχόμενον δέξαι με.
ltx/en_us_dedes/he.h.m8:heHE.SynechomenonDexaiMe.incipit	…
ltx/en_us_dedes/he.h.m8:heHE.SynechomenonDexaiMe.melody	@ltx/en_us_dedes/miscellanea:misc.HeirmosNotMetered
ltx/en_us_dedes/he.h.m8:heHE.SynechomenonDexaiMe.mode	@ltx/en_us_dedes/miscellanea:misc.Mode8
ltx/en_us_dedes/he.h.m8:heHE.SynechomenonDexaiMe.name	N/M ()
ltx/en_us_dedes/he.h.m8:heHE.SynechomenonDexaiMe.notmetered	N/M ()
ltx/en_us_dedes/he.h.m8:heHE.SynechomenonDexaiMe.ode	@ltx/en_us_dedes/miscellanea:misc.Ode6
ltx/en_us_dedes/he.h.m8:heHE.SynechomenonDexaiMe.text	I am constrained by my many transgressions. O benevolent Lord, receive me as I entreat Your tender mercies, as did the Prophet, and save me.
ltx/en_us_dedes/he.h.m8:heHE.ThalassanEpixas.greekname	Θάλασσαν ἔπηξας.
ltx/en_us_dedes/he.h.m8:heHE.ThalassanEpixas.incipit	Lord, You congealed…
ltx/en_us_dedes/he.h.m8:heHE.ThalassanEpixas.melody	@ltx/en_us_dedes/miscellanea:misc.Heirmos
ltx/en_us_dedes/he.h.m8:heHE.ThalassanEpixas.mode	@ltx/en_us_dedes/miscellanea:misc.Mode8
ltx/en_us_dedes/he.h.m8:heHE.ThalassanEpixas.name	Lord, You congealed.
ltx/en_us_dedes/he.h.m8:heHE.ThalassanEpixas.notmetered	N/M (Lord, You congealed.)
ltx/en_us_dedes/he.h.m8:heHE.ThalassanEpixas.ode	@ltx/en_us_dedes/miscellanea:misc.Ode1
ltx/en_us_dedes/he.h.m8:heHE.ThalassanEpixas.text	Lord, You congealed the sea and saved Your people, keeping them dry; * and then You threw into the deep prideful Pharaoh’s chariots and army. * Then to the mountain of Your holiness You brought Your people, who shouted, * “Let us sing a song of victory * to You, our God; for in battles You are powerful and strong.”
ltx/en_us_dedes/he.h.m8:heHE.TheouSynkatavasin.greekname	Θεοῦ συγκατάβασιν.
ltx/en_us_dedes/he.h.m8:heHE.TheouSynkatavasin.incipit	The fire in Babylon…
ltx/en_us_dedes/he.h.m8:heHE.TheouSynkatavasin.melody	@ltx/en_us_dedes/miscellanea:misc.Heirmos
ltx/en_us_dedes/he.h.m8:heHE.TheouSynkatavasin.mode	@ltx/en_us_dedes/miscellanea:misc.Mode8
ltx/en_us_dedes/he.h.m8:heHE.TheouSynkatavasin.name	The fire in Babylon.
ltx/en_us_dedes/he.h.m8:heHE.TheouSynkatavasin.notmetered	N/M (The fire in Babylon.)
ltx/en_us_dedes/he.h.m8:heHE.TheouSynkatavasin.ode	@ltx/en_us_dedes/miscellanea:misc.Ode7
ltx/en_us_dedes/he.h.m8:heHE.TheouSynkatavasin.text	The fire in Babylon * withdrew in fear from the condescension of God. * For this reason the Servants * within the furnace as in a moist meadow danced * with feet exultant, and sang that immortal hymn, * saying, “O God of our fathers, blessed are You!”
ltx/en_us_dedes/he.h.m8:heHE.TinAgninEndoxos.greekname	Τὴν ἁγνὴν ἐνδόξως.
ltx/en_us_dedes/he.h.m8:heHE.TinAgninEndoxos.incipit	The pure Theotokos…
ltx/en_us_dedes/he.h.m8:heHE.TinAgninEndoxos.melody	@ltx/en_us_dedes/miscellanea:misc.Heirmos
ltx/en_us_dedes/he.h.m8:heHE.TinAgninEndoxos.mode	@ltx/en_us_dedes/miscellanea:misc.Mode8
ltx/en_us_dedes/he.h.m8:heHE.TinAgninEndoxos.name	The pure Theotokos.
ltx/en_us_dedes/he.h.m8:heHE.TinAgninEndoxos.notmetered	N/M (The pure Theotokos.)
ltx/en_us_dedes/he.h.m8:heHE.TinAgninEndoxos.ode	@ltx/en_us_dedes/miscellanea:misc.Ode9
ltx/en_us_dedes/he.h.m8:heHE.TinAgninEndoxos.text	The pure Theotokos who in her womb * conceived the divine fire * without being burned, let us honor gloriously, O peoples, * magnifying her with never-silent hymns.
ltx/en_us_dedes/he.h.m8:heHE.TinDeisinEkcheo.greekname	Τὴν δέησιν ἐκχεῶ.
ltx/en_us_dedes/he.h.m8:heHE.TinDeisinEkcheo.incipit	I pour out my supplication…
ltx/en_us_dedes/he.h.m8:heHE.TinDeisinEkcheo.melody	@ltx/en_us_dedes/miscellanea:misc.Heirmos
ltx/en_us_dedes/he.h.m8:heHE.TinDeisinEkcheo.mode	@ltx/en_us_dedes/miscellanea:misc.Mode8
ltx/en_us_dedes/he.h.m8:heHE.TinDeisinEkcheo.name	I pour out my supplication.
ltx/en_us_dedes/he.h.m8:heHE.TinDeisinEkcheo.notmetered	N/M (I pour out my supplication.)
ltx/en_us_dedes/he.h.m8:heHE.TinDeisinEkcheo.ode	@ltx/en_us_dedes/miscellanea:misc.Ode6
ltx/en_us_dedes/he.h.m8:heHE.TinDeisinEkcheo.text	I pour out my supplication to the Lord, * and I tell Him all about my afflictions, * and that my soul has been flooded with evils, * and that my life has come close to being in hell. * Like Prophet Jonah, I entreat, * “Raise me up from corruption, O Lord my God.”
ltx/en_us_dedes/he.h.m8:heHE.TisTonPathonMeAchlyos.greekname	Τῆς τῶν παθῶν με ἀχλύος.
ltx/en_us_dedes/he.h.m8:heHE.TisTonPathonMeAchlyos.incipit	…
ltx/en_us_dedes/he.h.m8:heHE.TisTonPathonMeAchlyos.melody	@ltx/en_us_dedes/miscellanea:misc.Heirmos
ltx/en_us_dedes/he.h.m8:heHE.TisTonPathonMeAchlyos.mode	@ltx/en_us_dedes/miscellanea:misc.Mode8
ltx/en_us_dedes/he.h.m8:heHE.TisTonPathonMeAchlyos.name	
ltx/en_us_dedes/he.h.m8:heHE.TisTonPathonMeAchlyos.notmetered	N/M ()
ltx/en_us_dedes/he.h.m8:heHE.TisTonPathonMeAchlyos.ode	@ltx/en_us_dedes/miscellanea:misc.Ode5
ltx/en_us_dedes/he.h.m8:heHE.TisTonPathonMeAchlyos.text	
ltx/en_us_dedes/he.h.m8:heHE.ToEktinaxanti.greekname	Τῷ ἐκτινάξαντι.
ltx/en_us_dedes/he.h.m8:heHE.ToEktinaxanti.incipit	He overthrew…
ltx/en_us_dedes/he.h.m8:heHE.ToEktinaxanti.melody	@ltx/en_us_dedes/miscellanea:misc.Heirmos
ltx/en_us_dedes/he.h.m8:heHE.ToEktinaxanti.mode	@ltx/en_us_dedes/miscellanea:misc.Mode8
ltx/en_us_dedes/he.h.m8:heHE.ToEktinaxanti.name	He overthrew.
ltx/en_us_dedes/he.h.m8:heHE.ToEktinaxanti.notmetered	N/M (He overthrew.)
ltx/en_us_dedes/he.h.m8:heHE.ToEktinaxanti.ode	@ltx/en_us_dedes/miscellanea:misc.Ode1
ltx/en_us_dedes/he.h.m8:heHE.ToEktinaxanti.text	Christ overthrew all of Pharaoh’s army, * and He submerged it in the Sea; * and over dry ground He led the children of Israel. * To Him, yes Christ, let us sing, * for He is glorified unto the ages.
ltx/en_us_dedes/he.h.m8:heHE.ToSyntripsantiPolemous.greekname	Τῷ συντρίψαντι πολέμους.
ltx/en_us_dedes/he.h.m8:heHE.ToSyntripsantiPolemous.incipit	To the Lord who crushed combatants…
ltx/en_us_dedes/he.h.m8:heHE.ToSyntripsantiPolemous.melody	@ltx/en_us_dedes/miscellanea:misc.Heirmos
ltx/en_us_dedes/he.h.m8:heHE.ToSyntripsantiPolemous.mode	@ltx/en_us_dedes/miscellanea:misc.Mode8
ltx/en_us_dedes/he.h.m8:heHE.ToSyntripsantiPolemous.name	To the Lord.
ltx/en_us_dedes/he.h.m8:heHE.ToSyntripsantiPolemous.notmetered	N/M ()
ltx/en_us_dedes/he.h.m8:heHE.ToSyntripsantiPolemous.ode	@ltx/en_us_dedes/miscellanea:misc.Ode1
ltx/en_us_dedes/he.h.m8:heHE.ToSyntripsantiPolemous.text	To the Lord who crushed combatants * by His strong and upraised arm * for His people Israel, * and led them as they passed over the Red Sea, * let us sing, for He is our deliverer and God and greatly glorified.
ltx/en_us_dedes/he.h.m8:heHE.TonAnarchonVasilea.greekname	Τὸν ἄναρχον Βασιλέα.
ltx/en_us_dedes/he.h.m8:heHE.TonAnarchonVasilea.incipit	The regiments…
ltx/en_us_dedes/he.h.m8:heHE.TonAnarchonVasilea.melody	@ltx/en_us_dedes/miscellanea:misc.Heirmos
ltx/en_us_dedes/he.h.m8:heHE.TonAnarchonVasilea.mode	@ltx/en_us_dedes/miscellanea:misc.Mode8
ltx/en_us_dedes/he.h.m8:heHE.TonAnarchonVasilea.name	The regiments.
ltx/en_us_dedes/he.h.m8:heHE.TonAnarchonVasilea.notmetered	N/M (The regiments.)
ltx/en_us_dedes/he.h.m8:heHE.TonAnarchonVasilea.ode	@ltx/en_us_dedes/miscellanea:misc.Ode8
ltx/en_us_dedes/he.h.m8:heHE.TonAnarchonVasilea.text	The regiments of the Angels all shudder * at the unoriginate King of glory. * O priest and people praise and exalt Him beyond measure, * unto all the ages.
ltx/en_us_dedes/he.h.m8:heHE.TonAoratonMorfi.greekname	Τὸν ἀόρατον μορφῇ.
ltx/en_us_dedes/he.h.m8:heHE.TonAoratonMorfi.incipit	…
ltx/en_us_dedes/he.h.m8:heHE.TonAoratonMorfi.melody	@ltx/en_us_dedes/miscellanea:misc.Heirmos
ltx/en_us_dedes/he.h.m8:heHE.TonAoratonMorfi.mode	@ltx/en_us_dedes/miscellanea:misc.Mode8
ltx/en_us_dedes/he.h.m8:heHE.TonAoratonMorfi.name	
ltx/en_us_dedes/he.h.m8:heHE.TonAoratonMorfi.notmetered	N/M ()
ltx/en_us_dedes/he.h.m8:heHE.TonAoratonMorfi.ode	@ltx/en_us_dedes/miscellanea:misc.Ode9
ltx/en_us_dedes/he.h.m8:heHE.TonAoratonMorfi.text	
ltx/en_us_dedes/he.h.m8:heHE.TonChaldaionIKaminos.greekname	Τῶν Χαλδαίων ἡ κάμινος.
ltx/en_us_dedes/he.h.m8:heHE.TonChaldaionIKaminos.incipit	All ablaze…
ltx/en_us_dedes/he.h.m8:heHE.TonChaldaionIKaminos.melody	@ltx/en_us_dedes/miscellanea:misc.Heirmos
ltx/en_us_dedes/he.h.m8:heHE.TonChaldaionIKaminos.mode	@ltx/en_us_dedes/miscellanea:misc.Mode8
ltx/en_us_dedes/he.h.m8:heHE.TonChaldaionIKaminos.name	All ablaze.
ltx/en_us_dedes/he.h.m8:heHE.TonChaldaionIKaminos.notmetered	N/M (All ablaze.)
ltx/en_us_dedes/he.h.m8:heHE.TonChaldaionIKaminos.ode	@ltx/en_us_dedes/miscellanea:misc.Ode7
ltx/en_us_dedes/he.h.m8:heHE.TonChaldaionIKaminos.text	All ablaze with a raging fire was the Chaldean furnace, * through which blew a dew-laden breeze at God’s almighty order. * The three holy Servants sang, * “You are the God of our fathers, and blessed are You.”
ltx/en_us_dedes/he.h.m8:heHE.TonEkNyktosAgnosias.greekname	Τὸν ἐκ νυκτὸς ἀγνωσίας.
ltx/en_us_dedes/he.h.m8:heHE.TonEkNyktosAgnosias.incipit	From the night of ignorance…
ltx/en_us_dedes/he.h.m8:heHE.TonEkNyktosAgnosias.melody	@ltx/en_us_dedes/miscellanea:misc.HeirmosNotMetered
ltx/en_us_dedes/he.h.m8:heHE.TonEkNyktosAgnosias.mode	@ltx/en_us_dedes/miscellanea:misc.Mode8
ltx/en_us_dedes/he.h.m8:heHE.TonEkNyktosAgnosias.name	From the night of ignorance.
ltx/en_us_dedes/he.h.m8:heHE.TonEkNyktosAgnosias.notmetered	N/M (From the night of ignorance.)
ltx/en_us_dedes/he.h.m8:heHE.TonEkNyktosAgnosias.ode	@ltx/en_us_dedes/miscellanea:misc.Ode5
ltx/en_us_dedes/he.h.m8:heHE.TonEkNyktosAgnosias.text	From the night of ignorance, I am ever wandering on the highway, where my soul might be captured. I pray You guide me to the light of the knowledge of You, O Lord, and lead me on the path of Your commandments.
ltx/en_us_dedes/he.h.m8:heHE.TonEkPatrosProAionon.greekname	Τὸν ἐκ Πατρὸς πρὸ αἰώνων.
ltx/en_us_dedes/he.h.m8:heHE.TonEkPatrosProAionon.incipit	Before the ages begotten…
ltx/en_us_dedes/he.h.m8:heHE.TonEkPatrosProAionon.melody	@ltx/en_us_dedes/miscellanea:misc.Heirmos
ltx/en_us_dedes/he.h.m8:heHE.TonEkPatrosProAionon.mode	@ltx/en_us_dedes/miscellanea:misc.Mode8
ltx/en_us_dedes/he.h.m8:heHE.TonEkPatrosProAionon.name	Before the ages begotten.
ltx/en_us_dedes/he.h.m8:heHE.TonEkPatrosProAionon.notmetered	N/M (Before the ages begotten.)
ltx/en_us_dedes/he.h.m8:heHE.TonEkPatrosProAionon.ode	@ltx/en_us_dedes/miscellanea:misc.Ode8
ltx/en_us_dedes/he.h.m8:heHE.TonEkPatrosProAionon.text	Before the ages begotten of the Father, * the Son was later incarnate of His Mother. * Bless the Lord, priests and people; exalt Him beyond measure, unto all the ages.
ltx/en_us_dedes/he.h.m8:heHE.TonEnOreiAgio.greekname	Τὸν ἐν ὄρει ἁγίῳ.
ltx/en_us_dedes/he.h.m8:heHE.TonEnOreiAgio.incipit	O extol Him…
ltx/en_us_dedes/he.h.m8:heHE.TonEnOreiAgio.melody	@ltx/en_us_dedes/miscellanea:misc.Heirmos
ltx/en_us_dedes/he.h.m8:heHE.TonEnOreiAgio.mode	@ltx/en_us_dedes/miscellanea:misc.Mode8
ltx/en_us_dedes/he.h.m8:heHE.TonEnOreiAgio.name	O extol Him.
ltx/en_us_dedes/he.h.m8:heHE.TonEnOreiAgio.notmetered	N/M (O extol Him.)
ltx/en_us_dedes/he.h.m8:heHE.TonEnOreiAgio.ode	@ltx/en_us_dedes/miscellanea:misc.Ode8
ltx/en_us_dedes/he.h.m8:heHE.TonEnOreiAgio.text	O extol Him, who on the holy mountain * showed His glory, as Lord, * and in the bush with fire * revealed to Moses knowledge of the mystery * of the Ever-Virgin, supremely exalting Him unto all the ages.
ltx/en_us_dedes/he.h.m8:heHE.TonFovonSouKyrie.greekname	Τὸν φόβον σου Κύριε.
ltx/en_us_dedes/he.h.m8:heHE.TonFovonSouKyrie.incipit	O Lord, we Your servants…
ltx/en_us_dedes/he.h.m8:heHE.TonFovonSouKyrie.melody	@ltx/en_us_dedes/miscellanea:misc.Heirmos
ltx/en_us_dedes/he.h.m8:heHE.TonFovonSouKyrie.mode	@ltx/en_us_dedes/miscellanea:misc.Mode8
ltx/en_us_dedes/he.h.m8:heHE.TonFovonSouKyrie.name	O Lord, we Your servants.
ltx/en_us_dedes/he.h.m8:heHE.TonFovonSouKyrie.notmetered	N/M (O Lord, we Your servants.)
ltx/en_us_dedes/he.h.m8:heHE.TonFovonSouKyrie.ode	@ltx/en_us_dedes/miscellanea:misc.Ode3
ltx/en_us_dedes/he.h.m8:heHE.TonFovonSouKyrie.text	O Lord, we Your servants pray You plant Your fear * in our hearts, and become for us * who wholeheartedly in truth invoke * Your holy name, O Savior, strength and confirmation.
ltx/en_us_dedes/he.h.m8:heHE.TonIonanEnToKitei.greekname	Τὸν Ἰωνᾶν ἐν τῷ κήτει.
ltx/en_us_dedes/he.h.m8:heHE.TonIonanEnToKitei.incipit	O Lord, You made Prophet Jonah…
ltx/en_us_dedes/he.h.m8:heHE.TonIonanEnToKitei.melody	@ltx/en_us_dedes/miscellanea:misc.Heirmos
ltx/en_us_dedes/he.h.m8:heHE.TonIonanEnToKitei.mode	@ltx/en_us_dedes/miscellanea:misc.Mode8
ltx/en_us_dedes/he.h.m8:heHE.TonIonanEnToKitei.name	O Lord, You made Prophet Jonah.
ltx/en_us_dedes/he.h.m8:heHE.TonIonanEnToKitei.notmetered	N/M (O Lord, You made Prophet Jonah.)
ltx/en_us_dedes/he.h.m8:heHE.TonIonanEnToKitei.ode	@ltx/en_us_dedes/miscellanea:misc.Ode6
ltx/en_us_dedes/he.h.m8:heHE.TonIonanEnToKitei.text	O Lord, you made Prophet Jonah settle as a solitary in the whale. * You led him out then from corruption; * do likewise now rescue me, * for I am held in bondage in nets of the foe.
ltx/en_us_dedes/he.h.m8:heHE.TonIsrailEkDouleias.greekname	Τὸν Ἰσραὴλ ἐκ δουλείας.
ltx/en_us_dedes/he.h.m8:heHE.TonIsrailEkDouleias.incipit	…
ltx/en_us_dedes/he.h.m8:heHE.TonIsrailEkDouleias.melody	@ltx/en_us_dedes/miscellanea:misc.Heirmos
ltx/en_us_dedes/he.h.m8:heHE.TonIsrailEkDouleias.mode	@ltx/en_us_dedes/miscellanea:misc.Mode8
ltx/en_us_dedes/he.h.m8:heHE.TonIsrailEkDouleias.name	
ltx/en_us_dedes/he.h.m8:heHE.TonIsrailEkDouleias.notmetered	N/M ()
ltx/en_us_dedes/he.h.m8:heHE.TonIsrailEkDouleias.ode	@ltx/en_us_dedes/miscellanea:misc.Ode1
ltx/en_us_dedes/he.h.m8:heHE.TonIsrailEkDouleias.text	
ltx/en_us_dedes/he.h.m8:heHE.TonProdilothenta.greekname	Τὸν προδηλωθέντα.
ltx/en_us_dedes/he.h.m8:heHE.TonProdilothenta.incipit	Let us sing to Him…
ltx/en_us_dedes/he.h.m8:heHE.TonProdilothenta.melody	@ltx/en_us_dedes/miscellanea:misc.Heirmos
ltx/en_us_dedes/he.h.m8:heHE.TonProdilothenta.mode	@ltx/en_us_dedes/miscellanea:misc.Mode8
ltx/en_us_dedes/he.h.m8:heHE.TonProdilothenta.name	Let us sing to Him.
ltx/en_us_dedes/he.h.m8:heHE.TonProdilothenta.notmetered	N/M (Let us sing to Him.)
ltx/en_us_dedes/he.h.m8:heHE.TonProdilothenta.ode	@ltx/en_us_dedes/miscellanea:misc.Ode9
ltx/en_us_dedes/he.h.m8:heHE.TonProdilothenta.text	Let us sing to Him who to Moses of old prefigured * in the burning bush the childbirth of ever-virgin Mary, * for the salvation of us the believers. * Let us magnify Him with unceasing hymns.
ltx/en_us_dedes/he.h.m8:heHE.TonVasileaTonOuranon.greekname	Τὸν Βασιλέα τῶν οὐρανῶν.
ltx/en_us_dedes/he.h.m8:heHE.TonVasileaTonOuranon.incipit	O praise and bless Him…
ltx/en_us_dedes/he.h.m8:heHE.TonVasileaTonOuranon.melody	@ltx/en_us_dedes/miscellanea:misc.Heirmos
ltx/en_us_dedes/he.h.m8:heHE.TonVasileaTonOuranon.mode	@ltx/en_us_dedes/miscellanea:misc.Mode8
ltx/en_us_dedes/he.h.m8:heHE.TonVasileaTonOuranon.name	O praise and bless Him.
ltx/en_us_dedes/he.h.m8:heHE.TonVasileaTonOuranon.notmetered	N/M (O praise and bless Him.)
ltx/en_us_dedes/he.h.m8:heHE.TonVasileaTonOuranon.ode	@ltx/en_us_dedes/miscellanea:misc.Ode8
ltx/en_us_dedes/he.h.m8:heHE.TonVasileaTonOuranon.text	O praise and bless Him * who by the armies of Angels * is extolled as King of the heavens, * supremely exalting Him unto all the ages.
ltx/en_us_dedes/he.h.m8:heHE.TonZofonTisPsychisMou.greekname	Τὸν ζόφον τῆς ψυχῆς μου.
ltx/en_us_dedes/he.h.m8:heHE.TonZofonTisPsychisMou.incipit	You drove out…
ltx/en_us_dedes/he.h.m8:heHE.TonZofonTisPsychisMou.melody	@ltx/en_us_dedes/miscellanea:misc.Heirmos
ltx/en_us_dedes/he.h.m8:heHE.TonZofonTisPsychisMou.mode	@ltx/en_us_dedes/miscellanea:misc.Mode8
ltx/en_us_dedes/he.h.m8:heHE.TonZofonTisPsychisMou.name	You drove out.
ltx/en_us_dedes/he.h.m8:heHE.TonZofonTisPsychisMou.notmetered	N/M (You drove out.)
ltx/en_us_dedes/he.h.m8:heHE.TonZofonTisPsychisMou.ode	@ltx/en_us_dedes/miscellanea:misc.Ode5
ltx/en_us_dedes/he.h.m8:heHE.TonZofonTisPsychisMou.text	You drove out the abyss’s * primal darkness, O Christ God, of old, as Giver of light. * Now dispel gloomy darkness * from my soul, I entreat You, * O Word, and grant me the light * of Your commands, so that rising early, I may glorify You.
ltx/en_us_dedes/he.h.m8:heHE.YgranDiodefsas.greekname	Ὑγρὰν διοδεύσας.
ltx/en_us_dedes/he.h.m8:heHE.YgranDiodefsas.incipit	Of old when the Israelite…
ltx/en_us_dedes/he.h.m8:heHE.YgranDiodefsas.melody	@ltx/en_us_dedes/miscellanea:misc.Heirmos
ltx/en_us_dedes/he.h.m8:heHE.YgranDiodefsas.mode	@ltx/en_us_dedes/miscellanea:misc.Mode8
ltx/en_us_dedes/he.h.m8:heHE.YgranDiodefsas.name	Of old when the Israelite.
ltx/en_us_dedes/he.h.m8:heHE.YgranDiodefsas.notmetered	N/M (Of old when the Israelite.)
ltx/en_us_dedes/he.h.m8:heHE.YgranDiodefsas.ode	@ltx/en_us_dedes/miscellanea:misc.Ode1
ltx/en_us_dedes/he.h.m8:heHE.YgranDiodefsas.text	Of old when the Israelite had crossed * the watery passage as if over a tract of land, * fleeing from the misery of Egypt, * he cried: “To God our Redeemer, O let us sing.”
