ltx/en_us_dedes/sy.m01.d19:cl.syMA.commemoration01.text	[saint/com 1]
ltx/en_us_dedes/sy.m01.d19:cl.syMA.commemoration02.text	[saint/com 2]
ltx/en_us_dedes/sy.m01.d19:cl.syMA.commemoration03.text	[saint/com 3]
ltx/en_us_dedes/sy.m01.d19:cl.syMA.commemoration04.text	[saint/com 4]
ltx/en_us_dedes/sy.m01.d19:cl.syMA.commemoration05.text	[saint/com 5]
ltx/en_us_dedes/sy.m01.d19:cl.syMA.commemoration06.text	[saint/com list]
ltx/en_us_dedes/sy.m01.d19:syMA.commemoration01.couplet1.title	@ltx/en_us_dedes/titles:ti.Verses
ltx/en_us_dedes/sy.m01.d19:syMA.commemoration01.couplet1.verse1	
ltx/en_us_dedes/sy.m01.d19:syMA.commemoration01.couplet1.verse2	
ltx/en_us_dedes/sy.m01.d19:syMA.commemoration01.narration.p01	
ltx/en_us_dedes/sy.m01.d19:syMA.commemoration01.narration.p02	
ltx/en_us_dedes/sy.m01.d19:syMA.commemoration01.narration.p03	
ltx/en_us_dedes/sy.m01.d19:syMA.commemoration01.narration.p04	
ltx/en_us_dedes/sy.m01.d19:syMA.commemoration01.narration.p05	
ltx/en_us_dedes/sy.m01.d19:syMA.commemoration01.narration.p06	
ltx/en_us_dedes/sy.m01.d19:syMA.commemoration01.narration.p07	
ltx/en_us_dedes/sy.m01.d19:syMA.commemoration01.single1	
ltx/en_us_dedes/sy.m01.d19:syMA.commemoration01.text	On January 19, we commemorate our devout father Makarios of Egypt the anchorite, and also devout saint Makarios of Alexandria.
ltx/en_us_dedes/sy.m01.d19:syMA.commemoration02.couplet1.title	@ltx/en_us_dedes/titles:ti.Verses
ltx/en_us_dedes/sy.m01.d19:syMA.commemoration02.couplet1.verse1	
ltx/en_us_dedes/sy.m01.d19:syMA.commemoration02.couplet1.verse2	
ltx/en_us_dedes/sy.m01.d19:syMA.commemoration02.narration.p01	
ltx/en_us_dedes/sy.m01.d19:syMA.commemoration02.text	On this day we also commemorate the holy Martyr Efrasia.
ltx/en_us_dedes/sy.m01.d19:syMA.commemoration03.couplet1.title	@ltx/en_us_dedes/titles:ti.Verses
ltx/en_us_dedes/sy.m01.d19:syMA.commemoration03.couplet1.verse1	
ltx/en_us_dedes/sy.m01.d19:syMA.commemoration03.couplet1.verse2	
ltx/en_us_dedes/sy.m01.d19:syMA.commemoration03.text	On this day was the transfer of the relic of our father among the saints Gregory the Theologian to the Church of the Holy Apostles in Constantinople.
ltx/en_us_dedes/sy.m01.d19:syMA.commemoration04.couplet1.title	@ltx/en_us_dedes/titles:ti.Verses
ltx/en_us_dedes/sy.m01.d19:syMA.commemoration04.couplet1.verse1	
ltx/en_us_dedes/sy.m01.d19:syMA.commemoration04.couplet1.verse2	
ltx/en_us_dedes/sy.m01.d19:syMA.commemoration04.text	On this day is the commemoration of the great miracle in Nicea, when St. Basil the Great by prayers opened the doors of the Catholic Church and gave it to the Orthodox.
ltx/en_us_dedes/sy.m01.d19:syMA.commemoration05.couplet1.title	@ltx/en_us_dedes/titles:ti.Verses
ltx/en_us_dedes/sy.m01.d19:syMA.commemoration05.couplet1.verse1	
ltx/en_us_dedes/sy.m01.d19:syMA.commemoration05.couplet1.verse2	
ltx/en_us_dedes/sy.m01.d19:syMA.commemoration05.text	On this day we also commemorate our father among the saints Arsenios, Archbishop of Kerkyra.
ltx/en_us_dedes/sy.m01.d19:syMA.commemoration06.couplet1.title	@ltx/en_us_dedes/titles:ti.Verses
ltx/en_us_dedes/sy.m01.d19:syMA.commemoration06.couplet1.verse1	
ltx/en_us_dedes/sy.m01.d19:syMA.commemoration06.couplet1.verse2	
ltx/en_us_dedes/sy.m01.d19:syMA.commemoration06.text	On this day we also commemorate our devout father Meletios the Confessor of Mt. Galesion, who lived in the 13th century.
ltx/en_us_dedes/sy.m01.d19:syMA.commemoration07.couplet1.title	@ltx/en_us_dedes/titles:ti.Verses
ltx/en_us_dedes/sy.m01.d19:syMA.commemoration07.couplet1.verse1	
ltx/en_us_dedes/sy.m01.d19:syMA.commemoration07.couplet1.verse2	
ltx/en_us_dedes/sy.m01.d19:syMA.commemoration07.text	On this day we also commemorate our father among the saints Mark Evgenikos, Bishop of Ephesus, who single-handedly fought for, championed, and defended Orthodoxy.
ltx/en_us_dedes/sy.m01.d19:syMA.lastline	By the intercessions of Your saints, O Christ our God, have mercy on us. Amen.
