ltx/en_us_dedes/sy.m05.d17:cl.syMA.commemoration01.text	[saint/com 1]
ltx/en_us_dedes/sy.m05.d17:cl.syMA.commemoration02.text	[saint/com 2]
ltx/en_us_dedes/sy.m05.d17:cl.syMA.commemoration03.text	[saint/com 3]
ltx/en_us_dedes/sy.m05.d17:cl.syMA.commemoration04.text	[saint/com 4]
ltx/en_us_dedes/sy.m05.d17:cl.syMA.commemoration05.text	[saint/com 5]
ltx/en_us_dedes/sy.m05.d17:cl.syMA.commemoration06.text	[saint/com list]
ltx/en_us_dedes/sy.m05.d17:syMA.commemoration01.couplet1.title	Στίχοι εἰς τὸν Ἀνδρόνικον
ltx/en_us_dedes/sy.m05.d17:syMA.commemoration01.couplet1.verse1	
ltx/en_us_dedes/sy.m05.d17:syMA.commemoration01.couplet1.verse2	
ltx/en_us_dedes/sy.m05.d17:syMA.commemoration01.couplet2.title	Εἰς τὴν Ἰουνίαν
ltx/en_us_dedes/sy.m05.d17:syMA.commemoration01.couplet2.verse1	
ltx/en_us_dedes/sy.m05.d17:syMA.commemoration01.couplet2.verse2	
ltx/en_us_dedes/sy.m05.d17:syMA.commemoration01.narration.p01	
ltx/en_us_dedes/sy.m05.d17:syMA.commemoration01.single1	
ltx/en_us_dedes/sy.m05.d17:syMA.commemoration01.text	On May 17 we commemorate the holy Apostles Andronicus and Junia.
ltx/en_us_dedes/sy.m05.d17:syMA.commemoration02.couplet1.title	
ltx/en_us_dedes/sy.m05.d17:syMA.commemoration02.couplet1.verse1	
ltx/en_us_dedes/sy.m05.d17:syMA.commemoration02.couplet1.verse2	
ltx/en_us_dedes/sy.m05.d17:syMA.commemoration02.couplet2.title	
ltx/en_us_dedes/sy.m05.d17:syMA.commemoration02.couplet2.verse1	
ltx/en_us_dedes/sy.m05.d17:syMA.commemoration02.couplet2.verse2	
ltx/en_us_dedes/sy.m05.d17:syMA.commemoration02.text	On this day we also commemorate the holy Martyr Solochon and those with him, Pamphamer and Pamphylon.
ltx/en_us_dedes/sy.m05.d17:syMA.commemoration03.text	On this day we also commemorate Saints Theophanis and Nektarios, founders of the holy Varlaam Monastery at Meteora.
ltx/en_us_dedes/sy.m05.d17:syMA.lastline	By their holy intercessions, O God, have mercy on us. Amen.
