ltx/en_us_dedes/me.m12.d16:alt1.meDA.commemoration.first_name	
ltx/en_us_dedes/me.m12.d16:alt1.meDA.commemoration.first_short	
ltx/en_us_dedes/me.m12.d16:alt1.meDA.commemoration.first_title	
ltx/en_us_dedes/me.m12.d16:alt1.meDA.commemoration.full	Memory of our Father among the Saints Modestos the Wonder-worker, Archbishop of Jerusalem.
ltx/en_us_dedes/me.m12.d16:alt1.meDA.commemoration.second_name	
ltx/en_us_dedes/me.m12.d16:alt1.meDA.commemoration.second_title	
ltx/en_us_dedes/me.m12.d16:alt1.meDA.date	December 16
ltx/en_us_dedes/me.m12.d16:alt1.meDA.insert1	and our Father among the Saints Modestos, Archbishop of Jerusalem,
ltx/en_us_dedes/me.m12.d16:alt1.meDA.insert2	whose memory we observe,
ltx/en_us_dedes/me.m12.d16:alt1.meDA.note	
ltx/en_us_dedes/me.m12.d16:alt1.meHO.commemorations	
ltx/en_us_dedes/me.m12.d16:alt1.meHO.note1	
ltx/en_us_dedes/me.m12.d16:alt1.meHO.note2	
ltx/en_us_dedes/me.m12.d16:alt1.meHO.number	
ltx/en_us_dedes/me.m12.d16:alt1.meHO.rank	
ltx/en_us_dedes/me.m12.d16:alt1.meLE.commemoration1	Our Father among the Saints Modestos the Wonder-worker, Archbishop of Jerusalem.
ltx/en_us_dedes/me.m12.d16:alt1.meLE.commemoration2	
ltx/en_us_dedes/me.m12.d16:alt1.meLI.Kontakion1.incipit	@ltx/en_us_dedes/me.m12.d16:alt1.meMA.Kontakion1.incipit
ltx/en_us_dedes/me.m12.d16:alt1.meLI.Kontakion1.melody	@ltx/en_us_dedes/me.m12.d16:alt1.meMA.Kontakion1.melody
ltx/en_us_dedes/me.m12.d16:alt1.meLI.Kontakion1.mode	@ltx/en_us_dedes/me.m12.d16:alt1.meMA.Kontakion1.mode
ltx/en_us_dedes/me.m12.d16:alt1.meLI.Kontakion1.text	@ltx/en_us_dedes/me.m12.d16:alt1.meMA.Kontakion1.text
ltx/en_us_dedes/me.m12.d16:alt1.meLI.MM.CommunionHymn.text	@ltx/en_us_dedes/properties:media.key
ltx/en_us_dedes/me.m12.d16:alt1.meLI.Megalynarion.text	
ltx/en_us_dedes/me.m12.d16:alt1.meMA.C1.acrostic.notice1	
ltx/en_us_dedes/me.m12.d16:alt1.meMA.C1.acrostic.text	
ltx/en_us_dedes/me.m12.d16:alt1.meMA.C1.acrostic.title	
ltx/en_us_dedes/me.m12.d16:alt1.meMA.C1.title	@ltx/en_us_dedes/titles:ti.CanonSaintM
ltx/en_us_dedes/me.m12.d16:alt1.meMA.C1.verse	@ltx/en_us_dedes/prayers:pr.verse_SaintM.text
ltx/en_us_dedes/me.m12.d16:alt1.meMA.Exaposteilarion1.greekmelody	@ltx/en_us_dedes/he.a.m2:heAU.GynaikesAkoutisthite.greekname
ltx/en_us_dedes/me.m12.d16:alt1.meMA.Exaposteilarion1.incipit	…
ltx/en_us_dedes/me.m12.d16:alt1.meMA.Exaposteilarion1.melody	@ltx/en_us_dedes/he.a.m2:heAU.GynaikesAkoutisthite.name
ltx/en_us_dedes/me.m12.d16:alt1.meMA.Exaposteilarion1.mode	@ltx/en_us_dedes/miscellanea:misc.Mode2
ltx/en_us_dedes/me.m12.d16:alt1.meMA.Exaposteilarion1.text	
ltx/en_us_dedes/me.m12.d16:alt1.meMA.Exaposteilarion2.greekmelody	@ltx/en_us_dedes/he.a.m2:heAU.GynaikesAkoutisthite.greekname
ltx/en_us_dedes/me.m12.d16:alt1.meMA.Exaposteilarion2.incipit	…
ltx/en_us_dedes/me.m12.d16:alt1.meMA.Exaposteilarion2.melody	@ltx/en_us_dedes/he.a.m2:heAU.GynaikesAkoutisthite.name
ltx/en_us_dedes/me.m12.d16:alt1.meMA.Exaposteilarion2.mode	@ltx/en_us_dedes/miscellanea:misc.Mode2
ltx/en_us_dedes/me.m12.d16:alt1.meMA.Exaposteilarion2.text	
ltx/en_us_dedes/me.m12.d16:alt1.meMA.Kathisma11.greekmelody	@ltx/en_us_dedes/he.a.m1:heAU.TonTafonSouSotir.greekname
ltx/en_us_dedes/me.m12.d16:alt1.meMA.Kathisma11.incipit	…
ltx/en_us_dedes/me.m12.d16:alt1.meMA.Kathisma11.melody	@ltx/en_us_dedes/he.a.m1:heAU.TonTafonSouSotir.name
ltx/en_us_dedes/me.m12.d16:alt1.meMA.Kathisma11.mode	@ltx/en_us_dedes/miscellanea:misc.Mode1
ltx/en_us_dedes/me.m12.d16:alt1.meMA.Kathisma11.text	
ltx/en_us_dedes/me.m12.d16:alt1.meMA.Kathisma12.greekmelody	@ltx/en_us_dedes/he.a.m1:heAU.TonTafonSouSotir.greekname
ltx/en_us_dedes/me.m12.d16:alt1.meMA.Kathisma12.incipit	…
ltx/en_us_dedes/me.m12.d16:alt1.meMA.Kathisma12.melody	@ltx/en_us_dedes/he.a.m1:heAU.TonTafonSouSotir.name
ltx/en_us_dedes/me.m12.d16:alt1.meMA.Kathisma12.mode	@ltx/en_us_dedes/miscellanea:misc.Mode1
ltx/en_us_dedes/me.m12.d16:alt1.meMA.Kathisma12.text	
ltx/en_us_dedes/me.m12.d16:alt1.meMA.Kathisma21.greekmelody	@ltx/en_us_dedes/he.a.m4:heAU.TachyProkatalave.greekname
ltx/en_us_dedes/me.m12.d16:alt1.meMA.Kathisma21.incipit	…
ltx/en_us_dedes/me.m12.d16:alt1.meMA.Kathisma21.melody	@ltx/en_us_dedes/he.a.m4:heAU.TachyProkatalave.name
ltx/en_us_dedes/me.m12.d16:alt1.meMA.Kathisma21.mode	@ltx/en_us_dedes/miscellanea:misc.Mode2
ltx/en_us_dedes/me.m12.d16:alt1.meMA.Kathisma21.text	
ltx/en_us_dedes/me.m12.d16:alt1.meMA.Kathisma22.greekmelody	@ltx/en_us_dedes/he.a.m4:heAU.TachyProkatalave.greekname
ltx/en_us_dedes/me.m12.d16:alt1.meMA.Kathisma22.incipit	…
ltx/en_us_dedes/me.m12.d16:alt1.meMA.Kathisma22.melody	@ltx/en_us_dedes/he.a.m4:heAU.TachyProkatalave.name
ltx/en_us_dedes/me.m12.d16:alt1.meMA.Kathisma22.mode	@ltx/en_us_dedes/miscellanea:misc.Mode2
ltx/en_us_dedes/me.m12.d16:alt1.meMA.Kathisma22.text	
ltx/en_us_dedes/me.m12.d16:alt1.meMA.Kathisma31.greekmelody	@ltx/en_us_dedes/he.a.m5:heAU.TonSynanarchonLogon.greekname
ltx/en_us_dedes/me.m12.d16:alt1.meMA.Kathisma31.incipit	…
ltx/en_us_dedes/me.m12.d16:alt1.meMA.Kathisma31.melody	@ltx/en_us_dedes/he.a.m5:heAU.TonSynanarchonLogon.name
ltx/en_us_dedes/me.m12.d16:alt1.meMA.Kathisma31.mode	@ltx/en_us_dedes/miscellanea:misc.Mode5
ltx/en_us_dedes/me.m12.d16:alt1.meMA.Kathisma31.text	
ltx/en_us_dedes/me.m12.d16:alt1.meMA.Kathisma32.greekmelody	@ltx/en_us_dedes/he.a.m5:heAU.TonSynanarchonLogon.greekname
ltx/en_us_dedes/me.m12.d16:alt1.meMA.Kathisma32.incipit	…
ltx/en_us_dedes/me.m12.d16:alt1.meMA.Kathisma32.melody	@ltx/en_us_dedes/he.a.m5:heAU.TonSynanarchonLogon.name
ltx/en_us_dedes/me.m12.d16:alt1.meMA.Kathisma32.mode	@ltx/en_us_dedes/miscellanea:misc.Mode5
ltx/en_us_dedes/me.m12.d16:alt1.meMA.Kathisma32.text	
ltx/en_us_dedes/me.m12.d16:alt1.meMA.Kontakion1.greekmelody	@ltx/en_us_dedes/he.a.m4:heAU.EpefanisSimeron.greekname
ltx/en_us_dedes/me.m12.d16:alt1.meMA.Kontakion1.incipit	…
ltx/en_us_dedes/me.m12.d16:alt1.meMA.Kontakion1.melody	@ltx/en_us_dedes/he.a.m4:heAU.EpefanisSimeron.name
ltx/en_us_dedes/me.m12.d16:alt1.meMA.Kontakion1.mode	@ltx/en_us_dedes/miscellanea:misc.Mode4
ltx/en_us_dedes/me.m12.d16:alt1.meMA.Kontakion1.text	
ltx/en_us_dedes/me.m12.d16:alt1.meMA.Lauds1.greekmelody	@ltx/en_us_dedes/he.a.m1:heAU.TonOuranionTagmaton.greekname
ltx/en_us_dedes/me.m12.d16:alt1.meMA.Lauds1.incipit	…
ltx/en_us_dedes/me.m12.d16:alt1.meMA.Lauds1.melody	@ltx/en_us_dedes/he.a.m1:heAU.TonOuranionTagmaton.name
ltx/en_us_dedes/me.m12.d16:alt1.meMA.Lauds1.mode	@ltx/en_us_dedes/miscellanea:misc.Mode1
ltx/en_us_dedes/me.m12.d16:alt1.meMA.Lauds1.text	
ltx/en_us_dedes/me.m12.d16:alt1.meMA.Lauds2.incipit	…
ltx/en_us_dedes/me.m12.d16:alt1.meMA.Lauds2.melody	@ltx/en_us_dedes/he.a.m1:heAU.TonOuranionTagmaton.name
ltx/en_us_dedes/me.m12.d16:alt1.meMA.Lauds2.mode	@ltx/en_us_dedes/miscellanea:misc.Mode1
ltx/en_us_dedes/me.m12.d16:alt1.meMA.Lauds2.text	
ltx/en_us_dedes/me.m12.d16:alt1.meMA.Lauds3.incipit	…
ltx/en_us_dedes/me.m12.d16:alt1.meMA.Lauds3.melody	@ltx/en_us_dedes/he.a.m1:heAU.TonOuranionTagmaton.name
ltx/en_us_dedes/me.m12.d16:alt1.meMA.Lauds3.mode	@ltx/en_us_dedes/miscellanea:misc.Mode1
ltx/en_us_dedes/me.m12.d16:alt1.meMA.Lauds3.text	
ltx/en_us_dedes/me.m12.d16:alt1.meMA.Lauds4.incipit	…
ltx/en_us_dedes/me.m12.d16:alt1.meMA.Lauds4.melody	@ltx/en_us_dedes/he.a.m1:heAU.TonOuranionTagmaton.name
ltx/en_us_dedes/me.m12.d16:alt1.meMA.Lauds4.mode	@ltx/en_us_dedes/miscellanea:misc.Mode1
ltx/en_us_dedes/me.m12.d16:alt1.meMA.Lauds4.text	
ltx/en_us_dedes/me.m12.d16:alt1.meMA.LaudsBoth.incipit	@ltx/en_us_dedes/me.m12.d22:meMA.AposBoth.incipit
ltx/en_us_dedes/me.m12.d16:alt1.meMA.LaudsBoth.melody	
ltx/en_us_dedes/me.m12.d16:alt1.meMA.LaudsBoth.mode	@ltx/en_us_dedes/miscellanea:misc.Mode5
ltx/en_us_dedes/me.m12.d16:alt1.meMA.LaudsBoth.text	@ltx/en_us_dedes/me.m12.d22:meMA.AposBoth.text
ltx/en_us_dedes/me.m12.d16:alt1.meMA.LaudsGlory.incipit	…
ltx/en_us_dedes/me.m12.d16:alt1.meMA.LaudsGlory.melody	
ltx/en_us_dedes/me.m12.d16:alt1.meMA.LaudsGlory.mode	@ltx/en_us_dedes/miscellanea:misc.Mode5
ltx/en_us_dedes/me.m12.d16:alt1.meMA.LaudsGlory.text	
ltx/en_us_dedes/me.m12.d16:alt1.meMA.MM.LaudsSunday.text	@ltx/en_us_dedes/properties:media.key
ltx/en_us_dedes/me.m12.d16:alt1.meMA.Ode1C11.greekmelody	@ltx/en_us_dedes/he.h.m1:heHE.ChristosGennatai.greekname
ltx/en_us_dedes/me.m12.d16:alt1.meMA.Ode1C11.incipit	…
ltx/en_us_dedes/me.m12.d16:alt1.meMA.Ode1C11.melody	@ltx/en_us_dedes/he.h.m1:heHE.ChristosGennatai.name
ltx/en_us_dedes/me.m12.d16:alt1.meMA.Ode1C11.mode	@ltx/en_us_dedes/miscellanea:misc.Mode1
ltx/en_us_dedes/me.m12.d16:alt1.meMA.Ode1C11.ode	@ltx/en_us_dedes/miscellanea:misc.Ode1
ltx/en_us_dedes/me.m12.d16:alt1.meMA.Ode1C11.text	
ltx/en_us_dedes/me.m12.d16:alt1.meMA.Ode1C12.incipit	…
ltx/en_us_dedes/me.m12.d16:alt1.meMA.Ode1C12.melody	@ltx/en_us_dedes/he.h.m1:heHE.ChristosGennatai.name
ltx/en_us_dedes/me.m12.d16:alt1.meMA.Ode1C12.mode	@ltx/en_us_dedes/miscellanea:misc.Mode1
ltx/en_us_dedes/me.m12.d16:alt1.meMA.Ode1C12.ode	@ltx/en_us_dedes/miscellanea:misc.Ode1
ltx/en_us_dedes/me.m12.d16:alt1.meMA.Ode1C12.text	
ltx/en_us_dedes/me.m12.d16:alt1.meMA.Ode1C13.incipit	…
ltx/en_us_dedes/me.m12.d16:alt1.meMA.Ode1C13.melody	@ltx/en_us_dedes/he.h.m1:heHE.ChristosGennatai.name
ltx/en_us_dedes/me.m12.d16:alt1.meMA.Ode1C13.mode	@ltx/en_us_dedes/miscellanea:misc.Mode1
ltx/en_us_dedes/me.m12.d16:alt1.meMA.Ode1C13.ode	@ltx/en_us_dedes/miscellanea:misc.Ode1
ltx/en_us_dedes/me.m12.d16:alt1.meMA.Ode1C13.text	
ltx/en_us_dedes/me.m12.d16:alt1.meMA.Ode1C1T.incipit	…
ltx/en_us_dedes/me.m12.d16:alt1.meMA.Ode1C1T.melody	@ltx/en_us_dedes/he.h.m1:heHE.ChristosGennatai.name
ltx/en_us_dedes/me.m12.d16:alt1.meMA.Ode1C1T.mode	@ltx/en_us_dedes/miscellanea:misc.Mode1
ltx/en_us_dedes/me.m12.d16:alt1.meMA.Ode1C1T.ode	@ltx/en_us_dedes/miscellanea:misc.Ode1
ltx/en_us_dedes/me.m12.d16:alt1.meMA.Ode1C1T.text	
ltx/en_us_dedes/me.m12.d16:alt1.meMA.Ode3C11.greekmelody	@ltx/en_us_dedes/he.h.m1:heHE.ToProTonAionon.greekname
ltx/en_us_dedes/me.m12.d16:alt1.meMA.Ode3C11.incipit	…
ltx/en_us_dedes/me.m12.d16:alt1.meMA.Ode3C11.melody	@ltx/en_us_dedes/he.h.m1:heHE.ToProTonAionon.name
ltx/en_us_dedes/me.m12.d16:alt1.meMA.Ode3C11.mode	@ltx/en_us_dedes/miscellanea:misc.Mode1
ltx/en_us_dedes/me.m12.d16:alt1.meMA.Ode3C11.ode	@ltx/en_us_dedes/miscellanea:misc.Ode3
ltx/en_us_dedes/me.m12.d16:alt1.meMA.Ode3C11.text	
ltx/en_us_dedes/me.m12.d16:alt1.meMA.Ode3C12.incipit	…
ltx/en_us_dedes/me.m12.d16:alt1.meMA.Ode3C12.melody	@ltx/en_us_dedes/he.h.m1:heHE.ToProTonAionon.name
ltx/en_us_dedes/me.m12.d16:alt1.meMA.Ode3C12.mode	@ltx/en_us_dedes/miscellanea:misc.Mode1
ltx/en_us_dedes/me.m12.d16:alt1.meMA.Ode3C12.ode	@ltx/en_us_dedes/miscellanea:misc.Ode3
ltx/en_us_dedes/me.m12.d16:alt1.meMA.Ode3C12.text	
ltx/en_us_dedes/me.m12.d16:alt1.meMA.Ode3C13.incipit	…
ltx/en_us_dedes/me.m12.d16:alt1.meMA.Ode3C13.melody	@ltx/en_us_dedes/he.h.m1:heHE.ToProTonAionon.name
ltx/en_us_dedes/me.m12.d16:alt1.meMA.Ode3C13.mode	@ltx/en_us_dedes/miscellanea:misc.Mode1
ltx/en_us_dedes/me.m12.d16:alt1.meMA.Ode3C13.ode	@ltx/en_us_dedes/miscellanea:misc.Ode3
ltx/en_us_dedes/me.m12.d16:alt1.meMA.Ode3C13.text	
ltx/en_us_dedes/me.m12.d16:alt1.meMA.Ode3C1T.incipit	…
ltx/en_us_dedes/me.m12.d16:alt1.meMA.Ode3C1T.melody	@ltx/en_us_dedes/he.h.m1:heHE.ToProTonAionon.name
ltx/en_us_dedes/me.m12.d16:alt1.meMA.Ode3C1T.mode	@ltx/en_us_dedes/miscellanea:misc.Mode1
ltx/en_us_dedes/me.m12.d16:alt1.meMA.Ode3C1T.ode	@ltx/en_us_dedes/miscellanea:misc.Ode3
ltx/en_us_dedes/me.m12.d16:alt1.meMA.Ode3C1T.text	
ltx/en_us_dedes/me.m12.d16:alt1.meMA.Ode3Kathisma1.greekmelody	@ltx/en_us_dedes/he.a.m8:heAU.TinSofianKaiLogon.greekname
ltx/en_us_dedes/me.m12.d16:alt1.meMA.Ode3Kathisma1.incipit	…
ltx/en_us_dedes/me.m12.d16:alt1.meMA.Ode3Kathisma1.melody	@ltx/en_us_dedes/he.a.m8:heAU.TinSofianKaiLogon.name
ltx/en_us_dedes/me.m12.d16:alt1.meMA.Ode3Kathisma1.mode	@ltx/en_us_dedes/miscellanea:misc.Mode8
ltx/en_us_dedes/me.m12.d16:alt1.meMA.Ode3Kathisma1.text	
ltx/en_us_dedes/me.m12.d16:alt1.meMA.Ode3Kathisma2.greekmelody	@ltx/en_us_dedes/he.a.m8:heAU.TinSofianKaiLogon.greekname
ltx/en_us_dedes/me.m12.d16:alt1.meMA.Ode3Kathisma2.incipit	…
ltx/en_us_dedes/me.m12.d16:alt1.meMA.Ode3Kathisma2.melody	@ltx/en_us_dedes/he.a.m8:heAU.TinSofianKaiLogon.name
ltx/en_us_dedes/me.m12.d16:alt1.meMA.Ode3Kathisma2.mode	@ltx/en_us_dedes/miscellanea:misc.Mode8
ltx/en_us_dedes/me.m12.d16:alt1.meMA.Ode3Kathisma2.text	
ltx/en_us_dedes/me.m12.d16:alt1.meMA.Ode4C11.greekmelody	@ltx/en_us_dedes/he.h.m1:heHE.RavdosEkTisRizis.greekname
ltx/en_us_dedes/me.m12.d16:alt1.meMA.Ode4C11.incipit	…
ltx/en_us_dedes/me.m12.d16:alt1.meMA.Ode4C11.melody	@ltx/en_us_dedes/he.h.m1:heHE.RavdosEkTisRizis.name
ltx/en_us_dedes/me.m12.d16:alt1.meMA.Ode4C11.mode	@ltx/en_us_dedes/miscellanea:misc.Mode1
ltx/en_us_dedes/me.m12.d16:alt1.meMA.Ode4C11.ode	@ltx/en_us_dedes/miscellanea:misc.Ode4
ltx/en_us_dedes/me.m12.d16:alt1.meMA.Ode4C11.text	
ltx/en_us_dedes/me.m12.d16:alt1.meMA.Ode4C12.incipit	…
ltx/en_us_dedes/me.m12.d16:alt1.meMA.Ode4C12.melody	@ltx/en_us_dedes/he.h.m1:heHE.RavdosEkTisRizis.name
ltx/en_us_dedes/me.m12.d16:alt1.meMA.Ode4C12.mode	@ltx/en_us_dedes/miscellanea:misc.Mode1
ltx/en_us_dedes/me.m12.d16:alt1.meMA.Ode4C12.ode	@ltx/en_us_dedes/miscellanea:misc.Ode4
ltx/en_us_dedes/me.m12.d16:alt1.meMA.Ode4C12.text	
ltx/en_us_dedes/me.m12.d16:alt1.meMA.Ode4C13.incipit	…
ltx/en_us_dedes/me.m12.d16:alt1.meMA.Ode4C13.melody	@ltx/en_us_dedes/he.h.m1:heHE.RavdosEkTisRizis.name
ltx/en_us_dedes/me.m12.d16:alt1.meMA.Ode4C13.mode	@ltx/en_us_dedes/miscellanea:misc.Mode1
ltx/en_us_dedes/me.m12.d16:alt1.meMA.Ode4C13.ode	@ltx/en_us_dedes/miscellanea:misc.Ode4
ltx/en_us_dedes/me.m12.d16:alt1.meMA.Ode4C13.text	
ltx/en_us_dedes/me.m12.d16:alt1.meMA.Ode4C1T.incipit	…
ltx/en_us_dedes/me.m12.d16:alt1.meMA.Ode4C1T.melody	@ltx/en_us_dedes/he.h.m1:heHE.RavdosEkTisRizis.name
ltx/en_us_dedes/me.m12.d16:alt1.meMA.Ode4C1T.mode	@ltx/en_us_dedes/miscellanea:misc.Mode1
ltx/en_us_dedes/me.m12.d16:alt1.meMA.Ode4C1T.ode	@ltx/en_us_dedes/miscellanea:misc.Ode4
ltx/en_us_dedes/me.m12.d16:alt1.meMA.Ode4C1T.text	
ltx/en_us_dedes/me.m12.d16:alt1.meMA.Ode5C11.greekmelody	@ltx/en_us_dedes/he.h.m1:heHE.TheosOnEirinis.greekname
ltx/en_us_dedes/me.m12.d16:alt1.meMA.Ode5C11.incipit	…
ltx/en_us_dedes/me.m12.d16:alt1.meMA.Ode5C11.melody	@ltx/en_us_dedes/he.h.m1:heHE.TheosOnEirinis.name
ltx/en_us_dedes/me.m12.d16:alt1.meMA.Ode5C11.mode	@ltx/en_us_dedes/miscellanea:misc.Mode1
ltx/en_us_dedes/me.m12.d16:alt1.meMA.Ode5C11.ode	@ltx/en_us_dedes/miscellanea:misc.Ode5
ltx/en_us_dedes/me.m12.d16:alt1.meMA.Ode5C11.text	
ltx/en_us_dedes/me.m12.d16:alt1.meMA.Ode5C12.incipit	…
ltx/en_us_dedes/me.m12.d16:alt1.meMA.Ode5C12.melody	@ltx/en_us_dedes/he.h.m1:heHE.TheosOnEirinis.name
ltx/en_us_dedes/me.m12.d16:alt1.meMA.Ode5C12.mode	@ltx/en_us_dedes/miscellanea:misc.Mode1
ltx/en_us_dedes/me.m12.d16:alt1.meMA.Ode5C12.ode	@ltx/en_us_dedes/miscellanea:misc.Ode5
ltx/en_us_dedes/me.m12.d16:alt1.meMA.Ode5C12.text	
ltx/en_us_dedes/me.m12.d16:alt1.meMA.Ode5C13.incipit	…
ltx/en_us_dedes/me.m12.d16:alt1.meMA.Ode5C13.melody	@ltx/en_us_dedes/he.h.m1:heHE.TheosOnEirinis.name
ltx/en_us_dedes/me.m12.d16:alt1.meMA.Ode5C13.mode	@ltx/en_us_dedes/miscellanea:misc.Mode1
ltx/en_us_dedes/me.m12.d16:alt1.meMA.Ode5C13.ode	@ltx/en_us_dedes/miscellanea:misc.Ode5
ltx/en_us_dedes/me.m12.d16:alt1.meMA.Ode5C13.text	
ltx/en_us_dedes/me.m12.d16:alt1.meMA.Ode5C1T.incipit	…
ltx/en_us_dedes/me.m12.d16:alt1.meMA.Ode5C1T.melody	@ltx/en_us_dedes/he.h.m1:heHE.TheosOnEirinis.name
ltx/en_us_dedes/me.m12.d16:alt1.meMA.Ode5C1T.mode	@ltx/en_us_dedes/miscellanea:misc.Mode1
ltx/en_us_dedes/me.m12.d16:alt1.meMA.Ode5C1T.ode	@ltx/en_us_dedes/miscellanea:misc.Ode5
ltx/en_us_dedes/me.m12.d16:alt1.meMA.Ode5C1T.text	
ltx/en_us_dedes/me.m12.d16:alt1.meMA.Ode6C11.greekmelody	@ltx/en_us_dedes/he.h.m1:heHE.SplanchnonIonan.greekname
ltx/en_us_dedes/me.m12.d16:alt1.meMA.Ode6C11.incipit	…
ltx/en_us_dedes/me.m12.d16:alt1.meMA.Ode6C11.melody	@ltx/en_us_dedes/he.h.m1:heHE.SplanchnonIonan.name
ltx/en_us_dedes/me.m12.d16:alt1.meMA.Ode6C11.mode	@ltx/en_us_dedes/miscellanea:misc.Mode1
ltx/en_us_dedes/me.m12.d16:alt1.meMA.Ode6C11.ode	@ltx/en_us_dedes/miscellanea:misc.Ode6
ltx/en_us_dedes/me.m12.d16:alt1.meMA.Ode6C11.text	
ltx/en_us_dedes/me.m12.d16:alt1.meMA.Ode6C12.incipit	…
ltx/en_us_dedes/me.m12.d16:alt1.meMA.Ode6C12.melody	@ltx/en_us_dedes/he.h.m1:heHE.SplanchnonIonan.name
ltx/en_us_dedes/me.m12.d16:alt1.meMA.Ode6C12.mode	@ltx/en_us_dedes/miscellanea:misc.Mode1
ltx/en_us_dedes/me.m12.d16:alt1.meMA.Ode6C12.ode	@ltx/en_us_dedes/miscellanea:misc.Ode6
ltx/en_us_dedes/me.m12.d16:alt1.meMA.Ode6C12.text	
ltx/en_us_dedes/me.m12.d16:alt1.meMA.Ode6C13.incipit	…
ltx/en_us_dedes/me.m12.d16:alt1.meMA.Ode6C13.melody	@ltx/en_us_dedes/he.h.m1:heHE.SplanchnonIonan.name
ltx/en_us_dedes/me.m12.d16:alt1.meMA.Ode6C13.mode	@ltx/en_us_dedes/miscellanea:misc.Mode1
ltx/en_us_dedes/me.m12.d16:alt1.meMA.Ode6C13.ode	@ltx/en_us_dedes/miscellanea:misc.Ode6
ltx/en_us_dedes/me.m12.d16:alt1.meMA.Ode6C13.text	
ltx/en_us_dedes/me.m12.d16:alt1.meMA.Ode6C1T.incipit	…
ltx/en_us_dedes/me.m12.d16:alt1.meMA.Ode6C1T.melody	@ltx/en_us_dedes/he.h.m1:heHE.SplanchnonIonan.name
ltx/en_us_dedes/me.m12.d16:alt1.meMA.Ode6C1T.mode	@ltx/en_us_dedes/miscellanea:misc.Mode1
ltx/en_us_dedes/me.m12.d16:alt1.meMA.Ode6C1T.ode	@ltx/en_us_dedes/miscellanea:misc.Ode6
ltx/en_us_dedes/me.m12.d16:alt1.meMA.Ode6C1T.text	
ltx/en_us_dedes/me.m12.d16:alt1.meMA.Ode7C11.greekmelody	@ltx/en_us_dedes/he.h.m1:heHE.OiPaidesEfseveia.greekname
ltx/en_us_dedes/me.m12.d16:alt1.meMA.Ode7C11.incipit	…
ltx/en_us_dedes/me.m12.d16:alt1.meMA.Ode7C11.melody	@ltx/en_us_dedes/he.h.m1:heHE.OiPaidesEfseveia.name
ltx/en_us_dedes/me.m12.d16:alt1.meMA.Ode7C11.mode	@ltx/en_us_dedes/miscellanea:misc.Mode1
ltx/en_us_dedes/me.m12.d16:alt1.meMA.Ode7C11.ode	@ltx/en_us_dedes/miscellanea:misc.Ode7
ltx/en_us_dedes/me.m12.d16:alt1.meMA.Ode7C11.text	
ltx/en_us_dedes/me.m12.d16:alt1.meMA.Ode7C12.incipit	…
ltx/en_us_dedes/me.m12.d16:alt1.meMA.Ode7C12.melody	@ltx/en_us_dedes/he.h.m1:heHE.OiPaidesEfseveia.name
ltx/en_us_dedes/me.m12.d16:alt1.meMA.Ode7C12.mode	@ltx/en_us_dedes/miscellanea:misc.Mode1
ltx/en_us_dedes/me.m12.d16:alt1.meMA.Ode7C12.ode	@ltx/en_us_dedes/miscellanea:misc.Ode7
ltx/en_us_dedes/me.m12.d16:alt1.meMA.Ode7C12.text	
ltx/en_us_dedes/me.m12.d16:alt1.meMA.Ode7C13.incipit	…
ltx/en_us_dedes/me.m12.d16:alt1.meMA.Ode7C13.melody	@ltx/en_us_dedes/he.h.m1:heHE.OiPaidesEfseveia.name
ltx/en_us_dedes/me.m12.d16:alt1.meMA.Ode7C13.mode	@ltx/en_us_dedes/miscellanea:misc.Mode1
ltx/en_us_dedes/me.m12.d16:alt1.meMA.Ode7C13.ode	@ltx/en_us_dedes/miscellanea:misc.Ode7
ltx/en_us_dedes/me.m12.d16:alt1.meMA.Ode7C13.text	
ltx/en_us_dedes/me.m12.d16:alt1.meMA.Ode7C1T.incipit	…
ltx/en_us_dedes/me.m12.d16:alt1.meMA.Ode7C1T.melody	@ltx/en_us_dedes/he.h.m1:heHE.OiPaidesEfseveia.name
ltx/en_us_dedes/me.m12.d16:alt1.meMA.Ode7C1T.mode	@ltx/en_us_dedes/miscellanea:misc.Mode1
ltx/en_us_dedes/me.m12.d16:alt1.meMA.Ode7C1T.ode	@ltx/en_us_dedes/miscellanea:misc.Ode7
ltx/en_us_dedes/me.m12.d16:alt1.meMA.Ode7C1T.text	
ltx/en_us_dedes/me.m12.d16:alt1.meMA.Ode8C11.greekmelody	@ltx/en_us_dedes/he.h.m1:heHE.ThavmatosYperfyous.greekname
ltx/en_us_dedes/me.m12.d16:alt1.meMA.Ode8C11.incipit	…
ltx/en_us_dedes/me.m12.d16:alt1.meMA.Ode8C11.melody	@ltx/en_us_dedes/he.h.m1:heHE.ThavmatosYperfyous.name
ltx/en_us_dedes/me.m12.d16:alt1.meMA.Ode8C11.mode	@ltx/en_us_dedes/miscellanea:misc.Mode1
ltx/en_us_dedes/me.m12.d16:alt1.meMA.Ode8C11.ode	@ltx/en_us_dedes/miscellanea:misc.Ode8
ltx/en_us_dedes/me.m12.d16:alt1.meMA.Ode8C11.text	
ltx/en_us_dedes/me.m12.d16:alt1.meMA.Ode8C12.incipit	…
ltx/en_us_dedes/me.m12.d16:alt1.meMA.Ode8C12.melody	@ltx/en_us_dedes/he.h.m1:heHE.ThavmatosYperfyous.name
ltx/en_us_dedes/me.m12.d16:alt1.meMA.Ode8C12.mode	@ltx/en_us_dedes/miscellanea:misc.Mode1
ltx/en_us_dedes/me.m12.d16:alt1.meMA.Ode8C12.ode	@ltx/en_us_dedes/miscellanea:misc.Ode8
ltx/en_us_dedes/me.m12.d16:alt1.meMA.Ode8C12.text	
ltx/en_us_dedes/me.m12.d16:alt1.meMA.Ode8C13.incipit	…
ltx/en_us_dedes/me.m12.d16:alt1.meMA.Ode8C13.melody	@ltx/en_us_dedes/he.h.m1:heHE.ThavmatosYperfyous.name
ltx/en_us_dedes/me.m12.d16:alt1.meMA.Ode8C13.mode	@ltx/en_us_dedes/miscellanea:misc.Mode1
ltx/en_us_dedes/me.m12.d16:alt1.meMA.Ode8C13.ode	@ltx/en_us_dedes/miscellanea:misc.Ode8
ltx/en_us_dedes/me.m12.d16:alt1.meMA.Ode8C13.text	
ltx/en_us_dedes/me.m12.d16:alt1.meMA.Ode8C1T.incipit	…
ltx/en_us_dedes/me.m12.d16:alt1.meMA.Ode8C1T.melody	@ltx/en_us_dedes/he.h.m1:heHE.ThavmatosYperfyous.name
ltx/en_us_dedes/me.m12.d16:alt1.meMA.Ode8C1T.mode	@ltx/en_us_dedes/miscellanea:misc.Mode1
ltx/en_us_dedes/me.m12.d16:alt1.meMA.Ode8C1T.ode	@ltx/en_us_dedes/miscellanea:misc.Ode8
ltx/en_us_dedes/me.m12.d16:alt1.meMA.Ode8C1T.text	
ltx/en_us_dedes/me.m12.d16:alt1.meMA.Ode9C11.greekmelody	@ltx/en_us_dedes/he.h.m1:heHE.MystirionXenon.greekname
ltx/en_us_dedes/me.m12.d16:alt1.meMA.Ode9C11.incipit	…
ltx/en_us_dedes/me.m12.d16:alt1.meMA.Ode9C11.melody	@ltx/en_us_dedes/he.h.m1:heHE.MystirionXenon.name
ltx/en_us_dedes/me.m12.d16:alt1.meMA.Ode9C11.mode	@ltx/en_us_dedes/miscellanea:misc.Mode1
ltx/en_us_dedes/me.m12.d16:alt1.meMA.Ode9C11.ode	@ltx/en_us_dedes/miscellanea:misc.Ode9
ltx/en_us_dedes/me.m12.d16:alt1.meMA.Ode9C11.text	
ltx/en_us_dedes/me.m12.d16:alt1.meMA.Ode9C12.incipit	…
ltx/en_us_dedes/me.m12.d16:alt1.meMA.Ode9C12.melody	@ltx/en_us_dedes/he.h.m1:heHE.MystirionXenon.name
ltx/en_us_dedes/me.m12.d16:alt1.meMA.Ode9C12.mode	@ltx/en_us_dedes/miscellanea:misc.Mode1
ltx/en_us_dedes/me.m12.d16:alt1.meMA.Ode9C12.ode	@ltx/en_us_dedes/miscellanea:misc.Ode9
ltx/en_us_dedes/me.m12.d16:alt1.meMA.Ode9C12.text	
ltx/en_us_dedes/me.m12.d16:alt1.meMA.Ode9C13.incipit	…
ltx/en_us_dedes/me.m12.d16:alt1.meMA.Ode9C13.melody	@ltx/en_us_dedes/he.h.m1:heHE.MystirionXenon.name
ltx/en_us_dedes/me.m12.d16:alt1.meMA.Ode9C13.mode	@ltx/en_us_dedes/miscellanea:misc.Mode1
ltx/en_us_dedes/me.m12.d16:alt1.meMA.Ode9C13.ode	@ltx/en_us_dedes/miscellanea:misc.Ode9
ltx/en_us_dedes/me.m12.d16:alt1.meMA.Ode9C13.text	
ltx/en_us_dedes/me.m12.d16:alt1.meMA.Ode9C1T.incipit	…
ltx/en_us_dedes/me.m12.d16:alt1.meMA.Ode9C1T.melody	@ltx/en_us_dedes/he.h.m1:heHE.MystirionXenon.name
ltx/en_us_dedes/me.m12.d16:alt1.meMA.Ode9C1T.mode	@ltx/en_us_dedes/miscellanea:misc.Mode1
ltx/en_us_dedes/me.m12.d16:alt1.meMA.Ode9C1T.ode	@ltx/en_us_dedes/miscellanea:misc.Ode9
ltx/en_us_dedes/me.m12.d16:alt1.meMA.Ode9C1T.text	
ltx/en_us_dedes/me.m12.d16:alt1.meMA.Oikos1.text	
ltx/en_us_dedes/me.m12.d16:alt1.meMA.PostGospelBoth.incipit	@ltx/en_us_dedes/ho.ho03:hoMA.PostGospelTheotokos.incipit
ltx/en_us_dedes/me.m12.d16:alt1.meMA.PostGospelBoth.melody	
ltx/en_us_dedes/me.m12.d16:alt1.meMA.PostGospelBoth.mode	@ltx/en_us_dedes/miscellanea:misc.Mode2
ltx/en_us_dedes/me.m12.d16:alt1.meMA.PostGospelBoth.text	@ltx/en_us_dedes/ho.ho03:hoMA.PostGospelTheotokos.text
ltx/en_us_dedes/me.m12.d16:alt1.meMA.PostGospelGlory.incipit	@ltx/en_us_dedes/ho.ho03:hoMA.PostGospelHierarch.incipit
ltx/en_us_dedes/me.m12.d16:alt1.meMA.PostGospelGlory.melody	
ltx/en_us_dedes/me.m12.d16:alt1.meMA.PostGospelGlory.mode	@ltx/en_us_dedes/miscellanea:misc.Mode2
ltx/en_us_dedes/me.m12.d16:alt1.meMA.PostGospelGlory.text	@ltx/en_us_dedes/ho.ho03:hoMA.PostGospelHierarch.text
ltx/en_us_dedes/me.m12.d16:alt1.meMA.PostGospelIdiomelon.incipit	…
ltx/en_us_dedes/me.m12.d16:alt1.meMA.PostGospelIdiomelon.melody	
ltx/en_us_dedes/me.m12.d16:alt1.meMA.PostGospelIdiomelon.mode	@ltx/en_us_dedes/miscellanea:misc.Mode6
ltx/en_us_dedes/me.m12.d16:alt1.meMA.PostGospelIdiomelon.text	
ltx/en_us_dedes/me.m12.d16:alt1.meSV.AposBoth.incipit	…
ltx/en_us_dedes/me.m12.d16:alt1.meSV.AposBoth.melody	@ltx/en_us_dedes/he.a.m2:heAU.OikosTouEfratha.name
ltx/en_us_dedes/me.m12.d16:alt1.meSV.AposBoth.mode	@ltx/en_us_dedes/miscellanea:misc.Mode2
ltx/en_us_dedes/me.m12.d16:alt1.meSV.AposBoth.text	
ltx/en_us_dedes/me.m12.d16:alt1.meSV.AposGlory.incipit	…
ltx/en_us_dedes/me.m12.d16:alt1.meSV.AposGlory.melody	@ltx/en_us_dedes/he.a.m2:heAU.OikosTouEfratha.name
ltx/en_us_dedes/me.m12.d16:alt1.meSV.AposGlory.mode	@ltx/en_us_dedes/miscellanea:misc.Mode2
ltx/en_us_dedes/me.m12.d16:alt1.meSV.AposGlory.text	
ltx/en_us_dedes/me.m12.d16:alt1.meSV.Aposticha1.greekmelody	@ltx/en_us_dedes/he.a.m2:heAU.OikosTouEfratha.greekname
ltx/en_us_dedes/me.m12.d16:alt1.meSV.Aposticha1.incipit	…
ltx/en_us_dedes/me.m12.d16:alt1.meSV.Aposticha1.melody	@ltx/en_us_dedes/he.a.m2:heAU.OikosTouEfratha.name
ltx/en_us_dedes/me.m12.d16:alt1.meSV.Aposticha1.mode	@ltx/en_us_dedes/miscellanea:misc.Mode2
ltx/en_us_dedes/me.m12.d16:alt1.meSV.Aposticha1.text	
ltx/en_us_dedes/me.m12.d16:alt1.meSV.Aposticha2.incipit	…
ltx/en_us_dedes/me.m12.d16:alt1.meSV.Aposticha2.melody	@ltx/en_us_dedes/he.a.m2:heAU.OikosTouEfratha.name
ltx/en_us_dedes/me.m12.d16:alt1.meSV.Aposticha2.mode	@ltx/en_us_dedes/miscellanea:misc.Mode2
ltx/en_us_dedes/me.m12.d16:alt1.meSV.Aposticha2.text	
ltx/en_us_dedes/me.m12.d16:alt1.meSV.Aposticha3.incipit	…
ltx/en_us_dedes/me.m12.d16:alt1.meSV.Aposticha3.melody	@ltx/en_us_dedes/he.a.m2:heAU.OikosTouEfratha.name
ltx/en_us_dedes/me.m12.d16:alt1.meSV.Aposticha3.mode	@ltx/en_us_dedes/miscellanea:misc.Mode2
ltx/en_us_dedes/me.m12.d16:alt1.meSV.Aposticha3.text	
ltx/en_us_dedes/me.m12.d16:alt1.meSV.SticBoth.incipit	…
ltx/en_us_dedes/me.m12.d16:alt1.meSV.SticBoth.melody	
ltx/en_us_dedes/me.m12.d16:alt1.meSV.SticBoth.mode	@ltx/en_us_dedes/miscellanea:misc.Mode3
ltx/en_us_dedes/me.m12.d16:alt1.meSV.SticBoth.text	
ltx/en_us_dedes/me.m12.d16:alt1.meSV.SticGlory.incipit	…
ltx/en_us_dedes/me.m12.d16:alt1.meSV.SticGlory.melody	
ltx/en_us_dedes/me.m12.d16:alt1.meSV.SticGlory.mode	@ltx/en_us_dedes/miscellanea:misc.Mode3
ltx/en_us_dedes/me.m12.d16:alt1.meSV.SticGlory.text	
ltx/en_us_dedes/me.m12.d16:alt1.meSV.Stichera1.greekmelody	@ltx/en_us_dedes/he.a.m4:heAU.EdokasSimeiosin.greekname
ltx/en_us_dedes/me.m12.d16:alt1.meSV.Stichera1.incipit	…
ltx/en_us_dedes/me.m12.d16:alt1.meSV.Stichera1.melody	@ltx/en_us_dedes/he.a.m4:heAU.EdokasSimeiosin.name
ltx/en_us_dedes/me.m12.d16:alt1.meSV.Stichera1.mode	@ltx/en_us_dedes/miscellanea:misc.Mode4
ltx/en_us_dedes/me.m12.d16:alt1.meSV.Stichera1.text	
ltx/en_us_dedes/me.m12.d16:alt1.meSV.Stichera2.incipit	…
ltx/en_us_dedes/me.m12.d16:alt1.meSV.Stichera2.melody	@ltx/en_us_dedes/he.a.m4:heAU.EdokasSimeiosin.name
ltx/en_us_dedes/me.m12.d16:alt1.meSV.Stichera2.mode	@ltx/en_us_dedes/miscellanea:misc.Mode4
ltx/en_us_dedes/me.m12.d16:alt1.meSV.Stichera2.text	
ltx/en_us_dedes/me.m12.d16:alt1.meSV.Stichera3.incipit	…
ltx/en_us_dedes/me.m12.d16:alt1.meSV.Stichera3.melody	@ltx/en_us_dedes/he.a.m4:heAU.EdokasSimeiosin.name
ltx/en_us_dedes/me.m12.d16:alt1.meSV.Stichera3.mode	@ltx/en_us_dedes/miscellanea:misc.Mode4
ltx/en_us_dedes/me.m12.d16:alt1.meSV.Stichera3.text	
ltx/en_us_dedes/me.m12.d16:alt1.meSV.Stichera4.greekmelody	@ltx/en_us_dedes/he.a.m4:heAU.EdokasSimeiosin.greekname
ltx/en_us_dedes/me.m12.d16:alt1.meSV.Stichera4.incipit	…
ltx/en_us_dedes/me.m12.d16:alt1.meSV.Stichera4.melody	@ltx/en_us_dedes/he.a.m4:heAU.EdokasSimeiosin.name
ltx/en_us_dedes/me.m12.d16:alt1.meSV.Stichera4.mode	@ltx/en_us_dedes/miscellanea:misc.Mode4
ltx/en_us_dedes/me.m12.d16:alt1.meSV.Stichera4.text	
ltx/en_us_dedes/me.m12.d16:alt1.meVE.Apolytikion1.greekmelody	@ltx/en_us_dedes/he.a.m3:heAU.TheiasPisteos.greekname
ltx/en_us_dedes/me.m12.d16:alt1.meVE.Apolytikion1.incipit	@ltx/en_us_dedes/me.m12.d16:meVE.Apolytikion2ger.incipit
ltx/en_us_dedes/me.m12.d16:alt1.meVE.Apolytikion1.melody	@ltx/en_us_dedes/he.a.m3:heAU.TheiasPisteos.name
ltx/en_us_dedes/me.m12.d16:alt1.meVE.Apolytikion1.mode	@ltx/en_us_dedes/miscellanea:misc.Mode3
ltx/en_us_dedes/me.m12.d16:alt1.meVE.Apolytikion1.text	@ltx/en_us_dedes/me.m12.d16:meVE.Apolytikion2ger.text
ltx/en_us_dedes/me.m12.d16:alt1.meVE.AposBoth.incipit	@ltx/en_us_dedes/me.m11.d30:meMA.LaudsBoth.incipit
ltx/en_us_dedes/me.m12.d16:alt1.meVE.AposBoth.melody	
ltx/en_us_dedes/me.m12.d16:alt1.meVE.AposBoth.mode	@ltx/en_us_dedes/miscellanea:misc.Mode8
ltx/en_us_dedes/me.m12.d16:alt1.meVE.AposBoth.text	@ltx/en_us_dedes/me.m11.d30:meMA.LaudsBoth.text
ltx/en_us_dedes/me.m12.d16:alt1.meVE.AposGlory.incipit	…
ltx/en_us_dedes/me.m12.d16:alt1.meVE.AposGlory.melody	
ltx/en_us_dedes/me.m12.d16:alt1.meVE.AposGlory.mode	@ltx/en_us_dedes/miscellanea:misc.Mode8
ltx/en_us_dedes/me.m12.d16:alt1.meVE.AposGlory.poet	
ltx/en_us_dedes/me.m12.d16:alt1.meVE.AposGlory.text	
ltx/en_us_dedes/me.m12.d16:alt1.meVE.Aposticha1.greekmelody	@ltx/en_us_dedes/he.a.m5:heAU.ChairoisAskitikon.greekname
ltx/en_us_dedes/me.m12.d16:alt1.meVE.Aposticha1.incipit	…
ltx/en_us_dedes/me.m12.d16:alt1.meVE.Aposticha1.melody	@ltx/en_us_dedes/he.a.m5:heAU.ChairoisAskitikon.name
ltx/en_us_dedes/me.m12.d16:alt1.meVE.Aposticha1.mode	@ltx/en_us_dedes/miscellanea:misc.Mode5
ltx/en_us_dedes/me.m12.d16:alt1.meVE.Aposticha1.text	
ltx/en_us_dedes/me.m12.d16:alt1.meVE.Aposticha2.incipit	…
ltx/en_us_dedes/me.m12.d16:alt1.meVE.Aposticha2.melody	@ltx/en_us_dedes/he.a.m5:heAU.ChairoisAskitikon.name
ltx/en_us_dedes/me.m12.d16:alt1.meVE.Aposticha2.mode	@ltx/en_us_dedes/miscellanea:misc.Mode5
ltx/en_us_dedes/me.m12.d16:alt1.meVE.Aposticha2.text	
ltx/en_us_dedes/me.m12.d16:alt1.meVE.Aposticha3.incipit	…
ltx/en_us_dedes/me.m12.d16:alt1.meVE.Aposticha3.melody	@ltx/en_us_dedes/he.a.m5:heAU.ChairoisAskitikon.name
ltx/en_us_dedes/me.m12.d16:alt1.meVE.Aposticha3.mode	@ltx/en_us_dedes/miscellanea:misc.Mode5
ltx/en_us_dedes/me.m12.d16:alt1.meVE.Aposticha3.text	
ltx/en_us_dedes/me.m12.d16:alt1.meVE.Lity1.incipit	…
ltx/en_us_dedes/me.m12.d16:alt1.meVE.Lity1.melody	
ltx/en_us_dedes/me.m12.d16:alt1.meVE.Lity1.mode	@ltx/en_us_dedes/miscellanea:misc.Mode1
ltx/en_us_dedes/me.m12.d16:alt1.meVE.Lity1.text	
ltx/en_us_dedes/me.m12.d16:alt1.meVE.Lity2.incipit	…
ltx/en_us_dedes/me.m12.d16:alt1.meVE.Lity2.melody	
ltx/en_us_dedes/me.m12.d16:alt1.meVE.Lity2.mode	@ltx/en_us_dedes/miscellanea:misc.Mode2
ltx/en_us_dedes/me.m12.d16:alt1.meVE.Lity2.text	
ltx/en_us_dedes/me.m12.d16:alt1.meVE.Lity3.incipit	…
ltx/en_us_dedes/me.m12.d16:alt1.meVE.Lity3.melody	
ltx/en_us_dedes/me.m12.d16:alt1.meVE.Lity3.mode	@ltx/en_us_dedes/miscellanea:misc.Mode3
ltx/en_us_dedes/me.m12.d16:alt1.meVE.Lity3.text	
ltx/en_us_dedes/me.m12.d16:alt1.meVE.Lity4.incipit	…
ltx/en_us_dedes/me.m12.d16:alt1.meVE.Lity4.melody	
ltx/en_us_dedes/me.m12.d16:alt1.meVE.Lity4.mode	@ltx/en_us_dedes/miscellanea:misc.Mode4
ltx/en_us_dedes/me.m12.d16:alt1.meVE.Lity4.text	
ltx/en_us_dedes/me.m12.d16:alt1.meVE.LityBoth.incipit	@ltx/en_us_dedes/me.m12.d12:meVE.AposBoth.incipit
ltx/en_us_dedes/me.m12.d16:alt1.meVE.LityBoth.melody	
ltx/en_us_dedes/me.m12.d16:alt1.meVE.LityBoth.mode	@ltx/en_us_dedes/miscellanea:misc.Mode2
ltx/en_us_dedes/me.m12.d16:alt1.meVE.LityBoth.text	@ltx/en_us_dedes/me.m12.d12:meVE.AposBoth.text
ltx/en_us_dedes/me.m12.d16:alt1.meVE.LityGlory.incipit	…
ltx/en_us_dedes/me.m12.d16:alt1.meVE.LityGlory.melody	
ltx/en_us_dedes/me.m12.d16:alt1.meVE.LityGlory.mode	@ltx/en_us_dedes/miscellanea:misc.Mode2
ltx/en_us_dedes/me.m12.d16:alt1.meVE.LityGlory.text	
ltx/en_us_dedes/me.m12.d16:alt1.meVE.SticBoth.incipit	…
ltx/en_us_dedes/me.m12.d16:alt1.meVE.SticBoth.melody	
ltx/en_us_dedes/me.m12.d16:alt1.meVE.SticBoth.mode	@ltx/en_us_dedes/miscellanea:misc.Mode6
ltx/en_us_dedes/me.m12.d16:alt1.meVE.SticBoth.text	
ltx/en_us_dedes/me.m12.d16:alt1.meVE.SticGlory.incipit	…
ltx/en_us_dedes/me.m12.d16:alt1.meVE.SticGlory.melody	
ltx/en_us_dedes/me.m12.d16:alt1.meVE.SticGlory.mode	@ltx/en_us_dedes/miscellanea:misc.Mode6
ltx/en_us_dedes/me.m12.d16:alt1.meVE.SticGlory.text	
ltx/en_us_dedes/me.m12.d16:alt1.meVE.Stichera01.greekmelody	@ltx/en_us_dedes/he.a.m4:heAU.OsGennaionEnMartysi.greekname
ltx/en_us_dedes/me.m12.d16:alt1.meVE.Stichera01.incipit	…
ltx/en_us_dedes/me.m12.d16:alt1.meVE.Stichera01.melody	@ltx/en_us_dedes/he.a.m4:heAU.OsGennaionEnMartysi.name
ltx/en_us_dedes/me.m12.d16:alt1.meVE.Stichera01.mode	@ltx/en_us_dedes/miscellanea:misc.Mode4
ltx/en_us_dedes/me.m12.d16:alt1.meVE.Stichera01.text	
ltx/en_us_dedes/me.m12.d16:alt1.meVE.Stichera02.incipit	…
ltx/en_us_dedes/me.m12.d16:alt1.meVE.Stichera02.melody	@ltx/en_us_dedes/he.a.m4:heAU.OsGennaionEnMartysi.name
ltx/en_us_dedes/me.m12.d16:alt1.meVE.Stichera02.mode	@ltx/en_us_dedes/miscellanea:misc.Mode4
ltx/en_us_dedes/me.m12.d16:alt1.meVE.Stichera02.text	
ltx/en_us_dedes/me.m12.d16:alt1.meVE.Stichera03.incipit	…
ltx/en_us_dedes/me.m12.d16:alt1.meVE.Stichera03.melody	@ltx/en_us_dedes/he.a.m4:heAU.OsGennaionEnMartysi.name
ltx/en_us_dedes/me.m12.d16:alt1.meVE.Stichera03.mode	@ltx/en_us_dedes/miscellanea:misc.Mode4
ltx/en_us_dedes/me.m12.d16:alt1.meVE.Stichera03.text	
ltx/en_us_dedes/me.m12.d16:alt1.meVE.Stichera04.greekmelody	@ltx/en_us_dedes/he.a.m4:heAU.OExYpsistouKlitheis.greekname
ltx/en_us_dedes/me.m12.d16:alt1.meVE.Stichera04.incipit	…
ltx/en_us_dedes/me.m12.d16:alt1.meVE.Stichera04.melody	@ltx/en_us_dedes/he.a.m4:heAU.OExYpsistouKlitheis.name
ltx/en_us_dedes/me.m12.d16:alt1.meVE.Stichera04.mode	@ltx/en_us_dedes/miscellanea:misc.Mode4
ltx/en_us_dedes/me.m12.d16:alt1.meVE.Stichera04.text	
ltx/en_us_dedes/me.m12.d16:alt1.meVE.Stichera05.greekmelody	@ltx/en_us_dedes/he.a.m4:heAU.OExYpsistouKlitheis.greekname
ltx/en_us_dedes/me.m12.d16:alt1.meVE.Stichera05.incipit	…
ltx/en_us_dedes/me.m12.d16:alt1.meVE.Stichera05.melody	@ltx/en_us_dedes/he.a.m4:heAU.OExYpsistouKlitheis.name
ltx/en_us_dedes/me.m12.d16:alt1.meVE.Stichera05.mode	@ltx/en_us_dedes/miscellanea:misc.Mode4
ltx/en_us_dedes/me.m12.d16:alt1.meVE.Stichera05.text	
ltx/en_us_dedes/me.m12.d16:alt1.meVE.Stichera06.incipit	…
ltx/en_us_dedes/me.m12.d16:alt1.meVE.Stichera06.melody	@ltx/en_us_dedes/he.a.m4:heAU.OExYpsistouKlitheis.name
ltx/en_us_dedes/me.m12.d16:alt1.meVE.Stichera06.mode	@ltx/en_us_dedes/miscellanea:misc.Mode4
ltx/en_us_dedes/me.m12.d16:alt1.meVE.Stichera06.text	
ltx/en_us_dedes/me.m12.d16:meDA.commemoration.first	Memory of the Holy Prophet Haggai
ltx/en_us_dedes/me.m12.d16:meDA.commemoration.first_name	
ltx/en_us_dedes/me.m12.d16:meDA.commemoration.first_short	Memory of the Holy Prophet Haggai
ltx/en_us_dedes/me.m12.d16:meDA.commemoration.first_title	@ltx/en_us_dedes/titles:ti.Prophet
ltx/en_us_dedes/me.m12.d16:meDA.commemoration.full	Memory of the Holy Prophet Haggai
ltx/en_us_dedes/me.m12.d16:meDA.commemoration.second_name	
ltx/en_us_dedes/me.m12.d16:meDA.commemoration.second_title	
ltx/en_us_dedes/me.m12.d16:meDA.date	December 16
ltx/en_us_dedes/me.m12.d16:meDA.fordate	for December 16
ltx/en_us_dedes/me.m12.d16:meDA.insert1	
ltx/en_us_dedes/me.m12.d16:meDA.insert2	
ltx/en_us_dedes/me.m12.d16:meDA.note	
ltx/en_us_dedes/me.m12.d16:meDA.pdfcoverdate	December 16,
ltx/en_us_dedes/me.m12.d16:meDA.pdfheaderdate	December 16
ltx/en_us_dedes/me.m12.d16:meHO.commemorations	
ltx/en_us_dedes/me.m12.d16:meHO.note1	
ltx/en_us_dedes/me.m12.d16:meHO.note2	
ltx/en_us_dedes/me.m12.d16:meHO.number	
ltx/en_us_dedes/me.m12.d16:meHO.rank	
ltx/en_us_dedes/me.m12.d16:meLE.commemoration1	
ltx/en_us_dedes/me.m12.d16:meLE.commemoration2	
ltx/en_us_dedes/me.m12.d16:meLI.Kontakion1.incipit	…
ltx/en_us_dedes/me.m12.d16:meLI.Kontakion1.melody	
ltx/en_us_dedes/me.m12.d16:meLI.Kontakion1.mode	
ltx/en_us_dedes/me.m12.d16:meLI.Kontakion1.text	
ltx/en_us_dedes/me.m12.d16:meLI.Megalynarion.text	
ltx/en_us_dedes/me.m12.d16:meMA.C1.acrostic.notice1	
ltx/en_us_dedes/me.m12.d16:meMA.C1.acrostic.text	
ltx/en_us_dedes/me.m12.d16:meMA.C1.acrostic.title	
ltx/en_us_dedes/me.m12.d16:meMA.C1.poet	@ltx/en_us_dedes/poets:po.Theofanous
ltx/en_us_dedes/me.m12.d16:meMA.C1.title	@ltx/en_us_dedes/titles:ti.CanonProphet
ltx/en_us_dedes/me.m12.d16:meMA.C1.verse	@ltx/en_us_dedes/prayers:pr.verse_Prophet.text
ltx/en_us_dedes/me.m12.d16:meMA.Ode1C11.greekmelody	@ltx/en_us_dedes/he.h.m7:heHE.ToEktinaxantiTheo.greekname
ltx/en_us_dedes/me.m12.d16:meMA.Ode1C11.incipit	…
ltx/en_us_dedes/me.m12.d16:meMA.Ode1C11.melody	@ltx/en_us_dedes/he.h.m7:heHE.ToEktinaxantiTheo.name
ltx/en_us_dedes/me.m12.d16:meMA.Ode1C11.mode	@ltx/en_us_dedes/miscellanea:misc.Mode7
ltx/en_us_dedes/me.m12.d16:meMA.Ode1C11.ode	@ltx/en_us_dedes/miscellanea:misc.Ode1
ltx/en_us_dedes/me.m12.d16:meMA.Ode1C11.text	
ltx/en_us_dedes/me.m12.d16:meMA.Ode1C12.incipit	…
ltx/en_us_dedes/me.m12.d16:meMA.Ode1C12.melody	@ltx/en_us_dedes/he.h.m7:heHE.ToEktinaxantiTheo.name
ltx/en_us_dedes/me.m12.d16:meMA.Ode1C12.mode	@ltx/en_us_dedes/miscellanea:misc.Mode7
ltx/en_us_dedes/me.m12.d16:meMA.Ode1C12.ode	@ltx/en_us_dedes/miscellanea:misc.Ode1
ltx/en_us_dedes/me.m12.d16:meMA.Ode1C12.text	
ltx/en_us_dedes/me.m12.d16:meMA.Ode1C13.incipit	…
ltx/en_us_dedes/me.m12.d16:meMA.Ode1C13.melody	@ltx/en_us_dedes/he.h.m7:heHE.ToEktinaxantiTheo.name
ltx/en_us_dedes/me.m12.d16:meMA.Ode1C13.mode	@ltx/en_us_dedes/miscellanea:misc.Mode7
ltx/en_us_dedes/me.m12.d16:meMA.Ode1C13.ode	@ltx/en_us_dedes/miscellanea:misc.Ode1
ltx/en_us_dedes/me.m12.d16:meMA.Ode1C13.text	
ltx/en_us_dedes/me.m12.d16:meMA.Ode1C1T.incipit	…
ltx/en_us_dedes/me.m12.d16:meMA.Ode1C1T.melody	@ltx/en_us_dedes/he.h.m7:heHE.ToEktinaxantiTheo.name
ltx/en_us_dedes/me.m12.d16:meMA.Ode1C1T.mode	@ltx/en_us_dedes/miscellanea:misc.Mode7
ltx/en_us_dedes/me.m12.d16:meMA.Ode1C1T.ode	@ltx/en_us_dedes/miscellanea:misc.Ode1
ltx/en_us_dedes/me.m12.d16:meMA.Ode1C1T.text	
ltx/en_us_dedes/me.m12.d16:meMA.Ode3C11.greekmelody	@ltx/en_us_dedes/he.h.m7:heHE.EstereothiTiPistei.greekname
ltx/en_us_dedes/me.m12.d16:meMA.Ode3C11.incipit	…
ltx/en_us_dedes/me.m12.d16:meMA.Ode3C11.melody	@ltx/en_us_dedes/he.h.m7:heHE.EstereothiTiPistei.name
ltx/en_us_dedes/me.m12.d16:meMA.Ode3C11.mode	@ltx/en_us_dedes/miscellanea:misc.Mode7
ltx/en_us_dedes/me.m12.d16:meMA.Ode3C11.ode	@ltx/en_us_dedes/miscellanea:misc.Ode3
ltx/en_us_dedes/me.m12.d16:meMA.Ode3C11.text	
ltx/en_us_dedes/me.m12.d16:meMA.Ode3C12.incipit	…
ltx/en_us_dedes/me.m12.d16:meMA.Ode3C12.melody	@ltx/en_us_dedes/he.h.m7:heHE.EstereothiTiPistei.name
ltx/en_us_dedes/me.m12.d16:meMA.Ode3C12.mode	@ltx/en_us_dedes/miscellanea:misc.Mode7
ltx/en_us_dedes/me.m12.d16:meMA.Ode3C12.ode	@ltx/en_us_dedes/miscellanea:misc.Ode3
ltx/en_us_dedes/me.m12.d16:meMA.Ode3C12.text	
ltx/en_us_dedes/me.m12.d16:meMA.Ode3C13.incipit	…
ltx/en_us_dedes/me.m12.d16:meMA.Ode3C13.melody	@ltx/en_us_dedes/he.h.m7:heHE.EstereothiTiPistei.name
ltx/en_us_dedes/me.m12.d16:meMA.Ode3C13.mode	@ltx/en_us_dedes/miscellanea:misc.Mode7
ltx/en_us_dedes/me.m12.d16:meMA.Ode3C13.ode	@ltx/en_us_dedes/miscellanea:misc.Ode3
ltx/en_us_dedes/me.m12.d16:meMA.Ode3C13.text	
ltx/en_us_dedes/me.m12.d16:meMA.Ode3C1T.incipit	…
ltx/en_us_dedes/me.m12.d16:meMA.Ode3C1T.melody	@ltx/en_us_dedes/he.h.m7:heHE.EstereothiTiPistei.name
ltx/en_us_dedes/me.m12.d16:meMA.Ode3C1T.mode	@ltx/en_us_dedes/miscellanea:misc.Mode7
ltx/en_us_dedes/me.m12.d16:meMA.Ode3C1T.ode	@ltx/en_us_dedes/miscellanea:misc.Ode3
ltx/en_us_dedes/me.m12.d16:meMA.Ode3C1T.text	
ltx/en_us_dedes/me.m12.d16:meMA.Ode3H.greekmelody	@ltx/en_us_dedes/he.h.m7:heHE.EstereothiTiPistei.greekname
ltx/en_us_dedes/me.m12.d16:meMA.Ode3H.incipit	@ltx/en_us_dedes/he.h.m7:heHE.EstereothiTiPistei.incipit
ltx/en_us_dedes/me.m12.d16:meMA.Ode3H.melody	@ltx/en_us_dedes/he.h.m7:heHE.EstereothiTiPistei.melody
ltx/en_us_dedes/me.m12.d16:meMA.Ode3H.mode	@ltx/en_us_dedes/miscellanea:misc.Mode7
ltx/en_us_dedes/me.m12.d16:meMA.Ode3H.ode	@ltx/en_us_dedes/miscellanea:misc.Ode3
ltx/en_us_dedes/me.m12.d16:meMA.Ode3H.text	@ltx/en_us_dedes/he.h.m7:heHE.EstereothiTiPistei.text
ltx/en_us_dedes/me.m12.d16:meMA.Ode3Kathisma1.greekmelody	@ltx/en_us_dedes/he.a.m1:heAU.TonTafonSouSotir.greekname
ltx/en_us_dedes/me.m12.d16:meMA.Ode3Kathisma1.incipit	…
ltx/en_us_dedes/me.m12.d16:meMA.Ode3Kathisma1.melody	@ltx/en_us_dedes/he.a.m1:heAU.TonTafonSouSotir.name
ltx/en_us_dedes/me.m12.d16:meMA.Ode3Kathisma1.mode	@ltx/en_us_dedes/miscellanea:misc.Mode1
ltx/en_us_dedes/me.m12.d16:meMA.Ode3Kathisma1.text	
ltx/en_us_dedes/me.m12.d16:meMA.Ode3Kathisma2.greekmelody	@ltx/en_us_dedes/he.a.m3:heAU.TheiasPisteos.greekname
ltx/en_us_dedes/me.m12.d16:meMA.Ode3Kathisma2.incipit	…
ltx/en_us_dedes/me.m12.d16:meMA.Ode3Kathisma2.melody	@ltx/en_us_dedes/he.a.m3:heAU.TheiasPisteos.name
ltx/en_us_dedes/me.m12.d16:meMA.Ode3Kathisma2.mode	@ltx/en_us_dedes/miscellanea:misc.Mode3
ltx/en_us_dedes/me.m12.d16:meMA.Ode3Kathisma2.text	
ltx/en_us_dedes/me.m12.d16:meMA.Ode3KathismaSt.incipit	@ltx/en_us_dedes/me.m01.d29:meMA.Ode3KathismaSt.incipit
ltx/en_us_dedes/me.m12.d16:meMA.Ode3KathismaSt.melody	@ltx/en_us_dedes/he.a.m3:heAU.TheiasPisteos.name
ltx/en_us_dedes/me.m12.d16:meMA.Ode3KathismaSt.mode	@ltx/en_us_dedes/miscellanea:misc.Mode3
ltx/en_us_dedes/me.m12.d16:meMA.Ode3KathismaSt.text	@ltx/en_us_dedes/me.m01.d29:meMA.Ode3KathismaSt.text
ltx/en_us_dedes/me.m12.d16:meMA.Ode3KathismaT.incipit	@ltx/en_us_dedes/oc.m3.d2:ocMA.Kathisma23.incipit
ltx/en_us_dedes/me.m12.d16:meMA.Ode3KathismaT.melody	@ltx/en_us_dedes/he.a.m3:heAU.TheiasPisteos.name
ltx/en_us_dedes/me.m12.d16:meMA.Ode3KathismaT.mode	@ltx/en_us_dedes/miscellanea:misc.Mode3
ltx/en_us_dedes/me.m12.d16:meMA.Ode3KathismaT.text	@ltx/en_us_dedes/oc.m3.d2:ocMA.Kathisma23.text
ltx/en_us_dedes/me.m12.d16:meMA.Ode4C11.greekmelody	@ltx/en_us_dedes/he.h.m7:heHE.AkikoaTinAkoinSou.greekname
ltx/en_us_dedes/me.m12.d16:meMA.Ode4C11.incipit	…
ltx/en_us_dedes/me.m12.d16:meMA.Ode4C11.melody	@ltx/en_us_dedes/he.h.m7:heHE.AkikoaTinAkoinSou.name
ltx/en_us_dedes/me.m12.d16:meMA.Ode4C11.mode	@ltx/en_us_dedes/miscellanea:misc.Mode7
ltx/en_us_dedes/me.m12.d16:meMA.Ode4C11.ode	@ltx/en_us_dedes/miscellanea:misc.Ode4
ltx/en_us_dedes/me.m12.d16:meMA.Ode4C11.text	
ltx/en_us_dedes/me.m12.d16:meMA.Ode4C12.incipit	…
ltx/en_us_dedes/me.m12.d16:meMA.Ode4C12.melody	@ltx/en_us_dedes/he.h.m7:heHE.AkikoaTinAkoinSou.name
ltx/en_us_dedes/me.m12.d16:meMA.Ode4C12.mode	@ltx/en_us_dedes/miscellanea:misc.Mode7
ltx/en_us_dedes/me.m12.d16:meMA.Ode4C12.ode	@ltx/en_us_dedes/miscellanea:misc.Ode4
ltx/en_us_dedes/me.m12.d16:meMA.Ode4C12.text	
ltx/en_us_dedes/me.m12.d16:meMA.Ode4C13.incipit	…
ltx/en_us_dedes/me.m12.d16:meMA.Ode4C13.melody	@ltx/en_us_dedes/he.h.m7:heHE.AkikoaTinAkoinSou.name
ltx/en_us_dedes/me.m12.d16:meMA.Ode4C13.mode	@ltx/en_us_dedes/miscellanea:misc.Mode7
ltx/en_us_dedes/me.m12.d16:meMA.Ode4C13.ode	@ltx/en_us_dedes/miscellanea:misc.Ode4
ltx/en_us_dedes/me.m12.d16:meMA.Ode4C13.text	
ltx/en_us_dedes/me.m12.d16:meMA.Ode4C1T.incipit	…
ltx/en_us_dedes/me.m12.d16:meMA.Ode4C1T.melody	@ltx/en_us_dedes/he.h.m7:heHE.AkikoaTinAkoinSou.name
ltx/en_us_dedes/me.m12.d16:meMA.Ode4C1T.mode	@ltx/en_us_dedes/miscellanea:misc.Mode7
ltx/en_us_dedes/me.m12.d16:meMA.Ode4C1T.ode	@ltx/en_us_dedes/miscellanea:misc.Ode4
ltx/en_us_dedes/me.m12.d16:meMA.Ode4C1T.text	
ltx/en_us_dedes/me.m12.d16:meMA.Ode5C11.greekmelody	@ltx/en_us_dedes/he.h.m7:heHE.ProsSeOrthrizo.greekname
ltx/en_us_dedes/me.m12.d16:meMA.Ode5C11.incipit	…
ltx/en_us_dedes/me.m12.d16:meMA.Ode5C11.melody	@ltx/en_us_dedes/he.h.m7:heHE.ProsSeOrthrizo.name
ltx/en_us_dedes/me.m12.d16:meMA.Ode5C11.mode	@ltx/en_us_dedes/miscellanea:misc.Mode7
ltx/en_us_dedes/me.m12.d16:meMA.Ode5C11.ode	@ltx/en_us_dedes/miscellanea:misc.Ode5
ltx/en_us_dedes/me.m12.d16:meMA.Ode5C11.text	
ltx/en_us_dedes/me.m12.d16:meMA.Ode5C12.incipit	…
ltx/en_us_dedes/me.m12.d16:meMA.Ode5C12.melody	@ltx/en_us_dedes/he.h.m7:heHE.ProsSeOrthrizo.name
ltx/en_us_dedes/me.m12.d16:meMA.Ode5C12.mode	@ltx/en_us_dedes/miscellanea:misc.Mode7
ltx/en_us_dedes/me.m12.d16:meMA.Ode5C12.ode	@ltx/en_us_dedes/miscellanea:misc.Ode5
ltx/en_us_dedes/me.m12.d16:meMA.Ode5C12.text	
ltx/en_us_dedes/me.m12.d16:meMA.Ode5C13.incipit	…
ltx/en_us_dedes/me.m12.d16:meMA.Ode5C13.melody	@ltx/en_us_dedes/he.h.m7:heHE.ProsSeOrthrizo.name
ltx/en_us_dedes/me.m12.d16:meMA.Ode5C13.mode	@ltx/en_us_dedes/miscellanea:misc.Mode7
ltx/en_us_dedes/me.m12.d16:meMA.Ode5C13.ode	@ltx/en_us_dedes/miscellanea:misc.Ode5
ltx/en_us_dedes/me.m12.d16:meMA.Ode5C13.text	
ltx/en_us_dedes/me.m12.d16:meMA.Ode5C1T.incipit	…
ltx/en_us_dedes/me.m12.d16:meMA.Ode5C1T.melody	@ltx/en_us_dedes/he.h.m7:heHE.ProsSeOrthrizo.name
ltx/en_us_dedes/me.m12.d16:meMA.Ode5C1T.mode	@ltx/en_us_dedes/miscellanea:misc.Mode7
ltx/en_us_dedes/me.m12.d16:meMA.Ode5C1T.ode	@ltx/en_us_dedes/miscellanea:misc.Ode5
ltx/en_us_dedes/me.m12.d16:meMA.Ode5C1T.text	
ltx/en_us_dedes/me.m12.d16:meMA.Ode6C11.greekmelody	@ltx/en_us_dedes/he.h.m7:heHE.OIonasEkKoilias.greekname
ltx/en_us_dedes/me.m12.d16:meMA.Ode6C11.incipit	…
ltx/en_us_dedes/me.m12.d16:meMA.Ode6C11.melody	@ltx/en_us_dedes/he.h.m7:heHE.OIonasEkKoilias.name
ltx/en_us_dedes/me.m12.d16:meMA.Ode6C11.mode	@ltx/en_us_dedes/miscellanea:misc.Mode7
ltx/en_us_dedes/me.m12.d16:meMA.Ode6C11.ode	@ltx/en_us_dedes/miscellanea:misc.Ode6
ltx/en_us_dedes/me.m12.d16:meMA.Ode6C11.text	
ltx/en_us_dedes/me.m12.d16:meMA.Ode6C12.incipit	…
ltx/en_us_dedes/me.m12.d16:meMA.Ode6C12.melody	@ltx/en_us_dedes/he.h.m7:heHE.OIonasEkKoilias.name
ltx/en_us_dedes/me.m12.d16:meMA.Ode6C12.mode	@ltx/en_us_dedes/miscellanea:misc.Mode7
ltx/en_us_dedes/me.m12.d16:meMA.Ode6C12.ode	@ltx/en_us_dedes/miscellanea:misc.Ode6
ltx/en_us_dedes/me.m12.d16:meMA.Ode6C12.text	
ltx/en_us_dedes/me.m12.d16:meMA.Ode6C13.incipit	…
ltx/en_us_dedes/me.m12.d16:meMA.Ode6C13.melody	@ltx/en_us_dedes/he.h.m7:heHE.OIonasEkKoilias.name
ltx/en_us_dedes/me.m12.d16:meMA.Ode6C13.mode	@ltx/en_us_dedes/miscellanea:misc.Mode7
ltx/en_us_dedes/me.m12.d16:meMA.Ode6C13.ode	@ltx/en_us_dedes/miscellanea:misc.Ode6
ltx/en_us_dedes/me.m12.d16:meMA.Ode6C13.text	
ltx/en_us_dedes/me.m12.d16:meMA.Ode6C1T.incipit	…
ltx/en_us_dedes/me.m12.d16:meMA.Ode6C1T.melody	@ltx/en_us_dedes/he.h.m7:heHE.OIonasEkKoilias.name
ltx/en_us_dedes/me.m12.d16:meMA.Ode6C1T.mode	@ltx/en_us_dedes/miscellanea:misc.Mode7
ltx/en_us_dedes/me.m12.d16:meMA.Ode6C1T.ode	@ltx/en_us_dedes/miscellanea:misc.Ode6
ltx/en_us_dedes/me.m12.d16:meMA.Ode6C1T.text	
ltx/en_us_dedes/me.m12.d16:meMA.Ode6H.greekmelody	@ltx/en_us_dedes/he.h.m7:heHE.OIonasEkKoilias.greekname
ltx/en_us_dedes/me.m12.d16:meMA.Ode6H.incipit	@ltx/en_us_dedes/he.h.m7:heHE.OIonasEkKoilias.incipit
ltx/en_us_dedes/me.m12.d16:meMA.Ode6H.melody	@ltx/en_us_dedes/he.h.m7:heHE.OIonasEkKoilias.melody
ltx/en_us_dedes/me.m12.d16:meMA.Ode6H.mode	@ltx/en_us_dedes/miscellanea:misc.Mode7
ltx/en_us_dedes/me.m12.d16:meMA.Ode6H.ode	@ltx/en_us_dedes/miscellanea:misc.Ode6
ltx/en_us_dedes/me.m12.d16:meMA.Ode6H.text	@ltx/en_us_dedes/he.h.m7:heHE.OIonasEkKoilias.text
ltx/en_us_dedes/me.m12.d16:meMA.Ode7C11.greekmelody	@ltx/en_us_dedes/he.h.m7:heHE.OiEnKaminoTouPyros.greekname
ltx/en_us_dedes/me.m12.d16:meMA.Ode7C11.incipit	…
ltx/en_us_dedes/me.m12.d16:meMA.Ode7C11.melody	@ltx/en_us_dedes/he.h.m7:heHE.OiEnKaminoTouPyros.name
ltx/en_us_dedes/me.m12.d16:meMA.Ode7C11.mode	@ltx/en_us_dedes/miscellanea:misc.Mode7
ltx/en_us_dedes/me.m12.d16:meMA.Ode7C11.ode	@ltx/en_us_dedes/miscellanea:misc.Ode7
ltx/en_us_dedes/me.m12.d16:meMA.Ode7C11.text	
ltx/en_us_dedes/me.m12.d16:meMA.Ode7C12.incipit	…
ltx/en_us_dedes/me.m12.d16:meMA.Ode7C12.melody	@ltx/en_us_dedes/he.h.m7:heHE.OiEnKaminoTouPyros.name
ltx/en_us_dedes/me.m12.d16:meMA.Ode7C12.mode	@ltx/en_us_dedes/miscellanea:misc.Mode7
ltx/en_us_dedes/me.m12.d16:meMA.Ode7C12.ode	@ltx/en_us_dedes/miscellanea:misc.Ode7
ltx/en_us_dedes/me.m12.d16:meMA.Ode7C12.text	
ltx/en_us_dedes/me.m12.d16:meMA.Ode7C1T.incipit	…
ltx/en_us_dedes/me.m12.d16:meMA.Ode7C1T.melody	@ltx/en_us_dedes/he.h.m7:heHE.OiEnKaminoTouPyros.name
ltx/en_us_dedes/me.m12.d16:meMA.Ode7C1T.mode	@ltx/en_us_dedes/miscellanea:misc.Mode7
ltx/en_us_dedes/me.m12.d16:meMA.Ode7C1T.ode	@ltx/en_us_dedes/miscellanea:misc.Ode7
ltx/en_us_dedes/me.m12.d16:meMA.Ode7C1T.text	
ltx/en_us_dedes/me.m12.d16:meMA.Ode8C11.greekmelody	@ltx/en_us_dedes/he.h.m7:heHE.TonMononAnarchon.greekname
ltx/en_us_dedes/me.m12.d16:meMA.Ode8C11.incipit	…
ltx/en_us_dedes/me.m12.d16:meMA.Ode8C11.melody	@ltx/en_us_dedes/he.h.m7:heHE.TonMononAnarchon.name
ltx/en_us_dedes/me.m12.d16:meMA.Ode8C11.mode	@ltx/en_us_dedes/miscellanea:misc.Mode7
ltx/en_us_dedes/me.m12.d16:meMA.Ode8C11.ode	@ltx/en_us_dedes/miscellanea:misc.Ode8
ltx/en_us_dedes/me.m12.d16:meMA.Ode8C11.text	
ltx/en_us_dedes/me.m12.d16:meMA.Ode8C12.incipit	…
ltx/en_us_dedes/me.m12.d16:meMA.Ode8C12.melody	@ltx/en_us_dedes/he.h.m7:heHE.TonMononAnarchon.name
ltx/en_us_dedes/me.m12.d16:meMA.Ode8C12.mode	@ltx/en_us_dedes/miscellanea:misc.Mode7
ltx/en_us_dedes/me.m12.d16:meMA.Ode8C12.ode	@ltx/en_us_dedes/miscellanea:misc.Ode8
ltx/en_us_dedes/me.m12.d16:meMA.Ode8C12.text	
ltx/en_us_dedes/me.m12.d16:meMA.Ode8C1T.incipit	…
ltx/en_us_dedes/me.m12.d16:meMA.Ode8C1T.melody	@ltx/en_us_dedes/he.h.m7:heHE.TonMononAnarchon.name
ltx/en_us_dedes/me.m12.d16:meMA.Ode8C1T.mode	@ltx/en_us_dedes/miscellanea:misc.Mode7
ltx/en_us_dedes/me.m12.d16:meMA.Ode8C1T.ode	@ltx/en_us_dedes/miscellanea:misc.Ode8
ltx/en_us_dedes/me.m12.d16:meMA.Ode8C1T.text	
ltx/en_us_dedes/me.m12.d16:meMA.Ode8H.greekmelody	@ltx/en_us_dedes/he.h.m7:heHE.TonMononAnarchon.greekname
ltx/en_us_dedes/me.m12.d16:meMA.Ode8H.incipit	@ltx/en_us_dedes/he.h.m7:heHE.TonMononAnarchon.incipit
ltx/en_us_dedes/me.m12.d16:meMA.Ode8H.melody	@ltx/en_us_dedes/he.h.m7:heHE.TonMononAnarchon.melody
ltx/en_us_dedes/me.m12.d16:meMA.Ode8H.mode	@ltx/en_us_dedes/miscellanea:misc.Mode7
ltx/en_us_dedes/me.m12.d16:meMA.Ode8H.ode	@ltx/en_us_dedes/miscellanea:misc.Ode8
ltx/en_us_dedes/me.m12.d16:meMA.Ode8H.text	@ltx/en_us_dedes/he.h.m7:heHE.TonMononAnarchon.text
ltx/en_us_dedes/me.m12.d16:meMA.Ode9C11.greekmelody	@ltx/en_us_dedes/he.h.m7:heHE.PanymniteTonOuranonYpsilotera.greekname
ltx/en_us_dedes/me.m12.d16:meMA.Ode9C11.incipit	…
ltx/en_us_dedes/me.m12.d16:meMA.Ode9C11.melody	@ltx/en_us_dedes/he.h.m7:heHE.PanymniteTonOuranonYpsilotera.name
ltx/en_us_dedes/me.m12.d16:meMA.Ode9C11.mode	@ltx/en_us_dedes/miscellanea:misc.Mode7
ltx/en_us_dedes/me.m12.d16:meMA.Ode9C11.ode	@ltx/en_us_dedes/miscellanea:misc.Ode9
ltx/en_us_dedes/me.m12.d16:meMA.Ode9C11.text	
ltx/en_us_dedes/me.m12.d16:meMA.Ode9C12.incipit	…
ltx/en_us_dedes/me.m12.d16:meMA.Ode9C12.melody	@ltx/en_us_dedes/he.h.m7:heHE.PanymniteTonOuranonYpsilotera.name
ltx/en_us_dedes/me.m12.d16:meMA.Ode9C12.mode	@ltx/en_us_dedes/miscellanea:misc.Mode7
ltx/en_us_dedes/me.m12.d16:meMA.Ode9C12.ode	@ltx/en_us_dedes/miscellanea:misc.Ode9
ltx/en_us_dedes/me.m12.d16:meMA.Ode9C12.text	
ltx/en_us_dedes/me.m12.d16:meMA.Ode9C13.incipit	…
ltx/en_us_dedes/me.m12.d16:meMA.Ode9C13.melody	@ltx/en_us_dedes/he.h.m7:heHE.PanymniteTonOuranonYpsilotera.name
ltx/en_us_dedes/me.m12.d16:meMA.Ode9C13.mode	@ltx/en_us_dedes/miscellanea:misc.Mode7
ltx/en_us_dedes/me.m12.d16:meMA.Ode9C13.ode	@ltx/en_us_dedes/miscellanea:misc.Ode9
ltx/en_us_dedes/me.m12.d16:meMA.Ode9C13.text	
ltx/en_us_dedes/me.m12.d16:meMA.Ode9C1T.incipit	…
ltx/en_us_dedes/me.m12.d16:meMA.Ode9C1T.melody	@ltx/en_us_dedes/he.h.m7:heHE.PanymniteTonOuranonYpsilotera.name
ltx/en_us_dedes/me.m12.d16:meMA.Ode9C1T.mode	@ltx/en_us_dedes/miscellanea:misc.Mode7
ltx/en_us_dedes/me.m12.d16:meMA.Ode9C1T.ode	@ltx/en_us_dedes/miscellanea:misc.Ode9
ltx/en_us_dedes/me.m12.d16:meMA.Ode9C1T.text	
ltx/en_us_dedes/me.m12.d16:meMA.Ode9H.greekmelody	@ltx/en_us_dedes/he.h.m7:heHE.PanymniteTonOuranonYpsilotera.greekname
ltx/en_us_dedes/me.m12.d16:meMA.Ode9H.incipit	@ltx/en_us_dedes/he.h.m7:heHE.PanymniteTonOuranonYpsilotera.incipit
ltx/en_us_dedes/me.m12.d16:meMA.Ode9H.melody	@ltx/en_us_dedes/he.h.m7:heHE.PanymniteTonOuranonYpsilotera.melody
ltx/en_us_dedes/me.m12.d16:meMA.Ode9H.mode	@ltx/en_us_dedes/miscellanea:misc.Mode7
ltx/en_us_dedes/me.m12.d16:meMA.Ode9H.ode	@ltx/en_us_dedes/miscellanea:misc.Ode9
ltx/en_us_dedes/me.m12.d16:meMA.Ode9H.text	@ltx/en_us_dedes/he.h.m7:heHE.PanymniteTonOuranonYpsilotera.text
ltx/en_us_dedes/me.m12.d16:meVE.Apolytikion1ger.greekmelody	@ltx/en_us_dedes/he.a.m4:heAU.TachyProkatalave.greekname
ltx/en_us_dedes/me.m12.d16:meVE.Apolytikion1ger.incipit	…
ltx/en_us_dedes/me.m12.d16:meVE.Apolytikion1ger.melody	@ltx/en_us_dedes/he.a.m4:heAU.TachyProkatalave.name
ltx/en_us_dedes/me.m12.d16:meVE.Apolytikion1ger.mode	@ltx/en_us_dedes/miscellanea:misc.Mode4
ltx/en_us_dedes/me.m12.d16:meVE.Apolytikion1ger.poet	@ltx/en_us_dedes/poets:po.Gerasimou
ltx/en_us_dedes/me.m12.d16:meVE.Apolytikion1ger.text	
ltx/en_us_dedes/me.m12.d16:meVE.Apolytikion2ger.greekmelody	@ltx/en_us_dedes/he.a.m3:heAU.TheiasPisteos.greekname
ltx/en_us_dedes/me.m12.d16:meVE.Apolytikion2ger.incipit	…
ltx/en_us_dedes/me.m12.d16:meVE.Apolytikion2ger.melody	@ltx/en_us_dedes/he.a.m3:heAU.TheiasPisteos.name
ltx/en_us_dedes/me.m12.d16:meVE.Apolytikion2ger.mode	@ltx/en_us_dedes/miscellanea:misc.Mode3
ltx/en_us_dedes/me.m12.d16:meVE.Apolytikion2ger.poet	@ltx/en_us_dedes/poets:po.Gerasimou
ltx/en_us_dedes/me.m12.d16:meVE.Apolytikion2ger.text	
ltx/en_us_dedes/me.m12.d16:meVE.SticStavrotheotokion.greekmelody	@ltx/en_us_dedes/he.a.m8:heAU.OiMartyresSouKyrie.greekname
ltx/en_us_dedes/me.m12.d16:meVE.SticStavrotheotokion.incipit	@ltx/en_us_dedes/me.m01.d23:meVE.SticStavrotheotokion.incipit
ltx/en_us_dedes/me.m12.d16:meVE.SticStavrotheotokion.melody	@ltx/en_us_dedes/he.a.m8:heAU.OiMartyresSouKyrie.notmetered
ltx/en_us_dedes/me.m12.d16:meVE.SticStavrotheotokion.mode	@ltx/en_us_dedes/miscellanea:misc.Mode8
ltx/en_us_dedes/me.m12.d16:meVE.SticStavrotheotokion.text	@ltx/en_us_dedes/me.m01.d23:meVE.SticStavrotheotokion.text
ltx/en_us_dedes/me.m12.d16:meVE.SticTheotokion.greekmelody	@ltx/en_us_dedes/he.a.m8:heAU.OiMartyresSouKyrie.greekname
ltx/en_us_dedes/me.m12.d16:meVE.SticTheotokion.incipit	@ltx/en_us_dedes/me.m02.d19:meVE.SticTheotokion.incipit
ltx/en_us_dedes/me.m12.d16:meVE.SticTheotokion.melody	@ltx/en_us_dedes/he.a.m8:heAU.OiMartyresSouKyrie.notmetered
ltx/en_us_dedes/me.m12.d16:meVE.SticTheotokion.mode	@ltx/en_us_dedes/miscellanea:misc.Mode8
ltx/en_us_dedes/me.m12.d16:meVE.SticTheotokion.text	@ltx/en_us_dedes/me.m02.d19:meVE.SticTheotokion.text
ltx/en_us_dedes/me.m12.d16:meVE.Stichera01.greekmelody	@ltx/en_us_dedes/he.a.m8:heAU.OiMartyresSouKyrie.greekname
ltx/en_us_dedes/me.m12.d16:meVE.Stichera01.incipit	…
ltx/en_us_dedes/me.m12.d16:meVE.Stichera01.melody	@ltx/en_us_dedes/he.a.m8:heAU.OiMartyresSouKyrie.name
ltx/en_us_dedes/me.m12.d16:meVE.Stichera01.mode	@ltx/en_us_dedes/miscellanea:misc.Mode8
ltx/en_us_dedes/me.m12.d16:meVE.Stichera01.text	
ltx/en_us_dedes/me.m12.d16:meVE.Stichera02.incipit	…
ltx/en_us_dedes/me.m12.d16:meVE.Stichera02.melody	@ltx/en_us_dedes/he.a.m8:heAU.OiMartyresSouKyrie.name
ltx/en_us_dedes/me.m12.d16:meVE.Stichera02.mode	@ltx/en_us_dedes/miscellanea:misc.Mode8
ltx/en_us_dedes/me.m12.d16:meVE.Stichera02.text	
ltx/en_us_dedes/me.m12.d16:meVE.Stichera03.incipit	…
ltx/en_us_dedes/me.m12.d16:meVE.Stichera03.melody	@ltx/en_us_dedes/he.a.m8:heAU.OiMartyresSouKyrie.name
ltx/en_us_dedes/me.m12.d16:meVE.Stichera03.mode	@ltx/en_us_dedes/miscellanea:misc.Mode8
ltx/en_us_dedes/me.m12.d16:meVE.Stichera03.text	
