ltx/en_us_dedes/me.m12.d27:meDA.commemoration.first	Memory of the Holy Protomartyr Stephen.
ltx/en_us_dedes/me.m12.d27:meDA.commemoration.first_name	St. Stephen
ltx/en_us_dedes/me.m12.d27:meDA.commemoration.first_short	Memory of the Holy Protomartyr Stephen.
ltx/en_us_dedes/me.m12.d27:meDA.commemoration.first_title	For St. Stephen.
ltx/en_us_dedes/me.m12.d27:meDA.commemoration.full	Memory of the Holy Protomartyr and Archdeacon Stephen, and of our Devout Father and Confessor Theodore the Inscribed, brother of Theophanes the Hymnographer.
ltx/en_us_dedes/me.m12.d27:meDA.commemoration.second_name	
ltx/en_us_dedes/me.m12.d27:meDA.commemoration.second_title	For St. Theodore.
ltx/en_us_dedes/me.m12.d27:meDA.date	December 27
ltx/en_us_dedes/me.m12.d27:meDA.dismissal	@ltx/en_us_dedes/dismissals:dis00.christmas
ltx/en_us_dedes/me.m12.d27:meDA.fordate	for December 27
ltx/en_us_dedes/me.m12.d27:meDA.insert1	and the holy Protomartyr and Archdeacon Stephen,
ltx/en_us_dedes/me.m12.d27:meDA.insert2	whose memory we celebrate,
ltx/en_us_dedes/me.m12.d27:meDA.note	
ltx/en_us_dedes/me.m12.d27:meDA.pdfcoverdate	December 27,
ltx/en_us_dedes/me.m12.d27:meDA.pdfheaderdate	December 27
ltx/en_us_dedes/me.m12.d27:meHO.commemorations	
ltx/en_us_dedes/me.m12.d27:meHO.note1	
ltx/en_us_dedes/me.m12.d27:meHO.note2	
ltx/en_us_dedes/me.m12.d27:meHO.number	
ltx/en_us_dedes/me.m12.d27:meHO.rank	
ltx/en_us_dedes/me.m12.d27:meLE.commemoration1	The Holy Protomartyr Stephen the Archdeacon.
ltx/en_us_dedes/me.m12.d27:meLE.commemoration2	
ltx/en_us_dedes/me.m12.d27:meLI.Kontakion1.greekmelody	@ltx/en_us_dedes/me.m12.d27:meMA.Kontakion1.greekmelody
ltx/en_us_dedes/me.m12.d27:meLI.Kontakion1.incipit	@ltx/en_us_dedes/me.m12.d27:meMA.Kontakion1.incipit
ltx/en_us_dedes/me.m12.d27:meLI.Kontakion1.melody	@ltx/en_us_dedes/me.m12.d27:meMA.Kontakion1.melody
ltx/en_us_dedes/me.m12.d27:meLI.Kontakion1.mode	@ltx/en_us_dedes/me.m12.d27:meMA.Kontakion1.mode
ltx/en_us_dedes/me.m12.d27:meLI.Kontakion1.text	@ltx/en_us_dedes/me.m12.d27:meMA.Kontakion1.text
ltx/en_us_dedes/me.m12.d27:meLI.MM.CommunionHymn.text	@ltx/en_us_dedes/properties:media.key
ltx/en_us_dedes/me.m12.d27:meLI.Megalynarion.text	
ltx/en_us_dedes/me.m12.d27:meMA.AposBoth.incipit	@ltx/en_us_dedes/me.m12.d26:meVE.Aposticha1.incipit
ltx/en_us_dedes/me.m12.d27:meMA.AposBoth.melody	
ltx/en_us_dedes/me.m12.d27:meMA.AposBoth.mode	@ltx/en_us_dedes/miscellanea:misc.Mode8
ltx/en_us_dedes/me.m12.d27:meMA.AposBoth.text	@ltx/en_us_dedes/me.m12.d26:meVE.Aposticha1.text
ltx/en_us_dedes/me.m12.d27:meMA.AposGlory.incipit	@ltx/en_us_dedes/me.m08.d02:meVE.AposGlory.incipit
ltx/en_us_dedes/me.m12.d27:meMA.AposGlory.melody	
ltx/en_us_dedes/me.m12.d27:meMA.AposGlory.mode	@ltx/en_us_dedes/miscellanea:misc.Mode8
ltx/en_us_dedes/me.m12.d27:meMA.AposGlory.poet	@ltx/en_us_dedes/poets:po.Kyprianou
ltx/en_us_dedes/me.m12.d27:meMA.AposGlory.text	@ltx/en_us_dedes/me.m08.d02:meVE.AposGlory.text
ltx/en_us_dedes/me.m12.d27:meMA.Aposticha1.greekmelody	@ltx/en_us_dedes/he.a.m1:heAU.PaneffimoiMartyres.greekname
ltx/en_us_dedes/me.m12.d27:meMA.Aposticha1.incipit	…
ltx/en_us_dedes/me.m12.d27:meMA.Aposticha1.melody	@ltx/en_us_dedes/he.a.m1:heAU.PaneffimoiMartyres.name
ltx/en_us_dedes/me.m12.d27:meMA.Aposticha1.mode	@ltx/en_us_dedes/miscellanea:misc.Mode1
ltx/en_us_dedes/me.m12.d27:meMA.Aposticha1.text	
ltx/en_us_dedes/me.m12.d27:meMA.Aposticha2.incipit	…
ltx/en_us_dedes/me.m12.d27:meMA.Aposticha2.melody	@ltx/en_us_dedes/he.a.m1:heAU.PaneffimoiMartyres.name
ltx/en_us_dedes/me.m12.d27:meMA.Aposticha2.mode	@ltx/en_us_dedes/miscellanea:misc.Mode1
ltx/en_us_dedes/me.m12.d27:meMA.Aposticha2.text	
ltx/en_us_dedes/me.m12.d27:meMA.Aposticha3.incipit	…
ltx/en_us_dedes/me.m12.d27:meMA.Aposticha3.melody	@ltx/en_us_dedes/he.a.m1:heAU.PaneffimoiMartyres.name
ltx/en_us_dedes/me.m12.d27:meMA.Aposticha3.mode	@ltx/en_us_dedes/miscellanea:misc.Mode1
ltx/en_us_dedes/me.m12.d27:meMA.Aposticha3.text	
ltx/en_us_dedes/me.m12.d27:meMA.C1.poet	@ltx/en_us_dedes/poets:po.IoannouMonachou
ltx/en_us_dedes/me.m12.d27:meMA.C1.title	@ltx/en_us_dedes/titles:ti.CanonProtomartyrM
ltx/en_us_dedes/me.m12.d27:meMA.C1.verse	@ltx/en_us_dedes/prayers:pr.verse_SaintM.text
ltx/en_us_dedes/me.m12.d27:meMA.C2.acrostic.notice1	
ltx/en_us_dedes/me.m12.d27:meMA.C2.acrostic.text	
ltx/en_us_dedes/me.m12.d27:meMA.C2.acrostic.title	
ltx/en_us_dedes/me.m12.d27:meMA.C2.poet	@ltx/en_us_dedes/poets:po.Theofanous
ltx/en_us_dedes/me.m12.d27:meMA.C2.title	@ltx/en_us_dedes/titles:ti.CanonDevoutM
ltx/en_us_dedes/me.m12.d27:meMA.C2.verse	@ltx/en_us_dedes/prayers:pr.verse_DevoutMan.text
ltx/en_us_dedes/me.m12.d27:meMA.Exaposteilarion1.greekmelody	@ltx/en_us_dedes/he.a.m3:heAU.EpeskepsatoImas.greekname
ltx/en_us_dedes/me.m12.d27:meMA.Exaposteilarion1.incipit	As he departs now from…
ltx/en_us_dedes/me.m12.d27:meMA.Exaposteilarion1.melody	@ltx/en_us_dedes/he.a.m3:heAU.EpeskepsatoImas.name
ltx/en_us_dedes/me.m12.d27:meMA.Exaposteilarion1.mode	@ltx/en_us_dedes/miscellanea:misc.Mode3
ltx/en_us_dedes/me.m12.d27:meMA.Exaposteilarion1.text	As he departs now from his flesh, * Stephen, in keeping with his name, * presents himself as a living * and soul-endowed crown to You as King * and God the Ruler over all, * for Whom he fought the good fight * and finished in glory.
ltx/en_us_dedes/me.m12.d27:meMA.Exaposteilarion2.greekmelody	@ltx/en_us_dedes/he.a.m2:heAU.ToisMathitaisSynelthomen.greekname
ltx/en_us_dedes/me.m12.d27:meMA.Exaposteilarion2.incipit	Stephen was full of grace…
ltx/en_us_dedes/me.m12.d27:meMA.Exaposteilarion2.melody	@ltx/en_us_dedes/he.a.m2:heAU.ToisMathitaisSynelthomen.name
ltx/en_us_dedes/me.m12.d27:meMA.Exaposteilarion2.mode	@ltx/en_us_dedes/miscellanea:misc.Mode2
ltx/en_us_dedes/me.m12.d27:meMA.Exaposteilarion2.text	Stephen was full of grace divine * and faith and power truly. * He did great wonders and rebuked * the deicidal people, who meditated on vain things. * Eloquently he uttered * words of sublime theology, * saying, “I now see Jesus, the Son of Man * standing at the right hand of God the Father.” * Then he was stoned; and being crowned, * to the Lord he ascended.
ltx/en_us_dedes/me.m12.d27:meMA.Exaposteilarion3.greekmelody	@ltx/en_us_dedes/he.a.m2:heAU.ToisMathitaisSynelthomen.greekname
ltx/en_us_dedes/me.m12.d27:meMA.Exaposteilarion3.incipit	The Logos, co-beginningless * and…
ltx/en_us_dedes/me.m12.d27:meMA.Exaposteilarion3.melody	@ltx/en_us_dedes/he.a.m2:heAU.ToisMathitaisSynelthomen.name
ltx/en_us_dedes/me.m12.d27:meMA.Exaposteilarion3.mode	@ltx/en_us_dedes/miscellanea:misc.Mode2
ltx/en_us_dedes/me.m12.d27:meMA.Exaposteilarion3.text	The Logos, co-beginningless * and of one throne and nature * with the Father and Spirit, is * born today from a Virgin * in Bethlehem as an infant. * The Protomartyr Stephen * publicly preached that He is God * and the Savior, and therefore by blood-stained hands * he was stoned to death, all along rejoicing, * for he ascended with a crown * to the Master with glory.
ltx/en_us_dedes/me.m12.d27:meMA.Kathisma11.greekmelody	@ltx/en_us_dedes/he.a.m1:heAU.TouLithouSfragisthentos.greekname
ltx/en_us_dedes/me.m12.d27:meMA.Kathisma11.incipit	O Jesus, who are seated…
ltx/en_us_dedes/me.m12.d27:meMA.Kathisma11.melody	@ltx/en_us_dedes/he.a.m1:heAU.TouLithouSfragisthentos.name
ltx/en_us_dedes/me.m12.d27:meMA.Kathisma11.mode	@ltx/en_us_dedes/miscellanea:misc.Mode1
ltx/en_us_dedes/me.m12.d27:meMA.Kathisma11.text	O Jesus, who are seated in the highest on a fiery throne * with the unoriginate Father and Your divine Holy Spirit, * O Lord, You were well pleased to be born * of a virgin Maiden in the flesh. * For this reason did a star show the way to You * for the Magi from Persia. * Glory to Your all-benevolent will; * glory to Your epiphany; * glory to Your extreme condescension to us.
ltx/en_us_dedes/me.m12.d27:meMA.Kathisma21.greekmelody	@ltx/en_us_dedes/he.a.m4:heAU.KateplagiIosif.greekname
ltx/en_us_dedes/me.m12.d27:meMA.Kathisma21.incipit	As he mystically possessed *…
ltx/en_us_dedes/me.m12.d27:meMA.Kathisma21.melody	@ltx/en_us_dedes/he.a.m4:heAU.KateplagiIosif.name
ltx/en_us_dedes/me.m12.d27:meMA.Kathisma21.mode	@ltx/en_us_dedes/miscellanea:misc.Mode4
ltx/en_us_dedes/me.m12.d27:meMA.Kathisma21.text	As he mystically possessed * the Holy Spirit in his heart * welling forth the words of grace, * the Protomartyr of Christ * reproved the stubbornness of the Jews who were stiff-necked. * The glorious one was filled * with the fullness of grace * and wisdom, by which he * also proved to them * that the Son of God was a descendant * of King David and had sprung forth from his seed. * “Thrice-blessed Stephen, save us who honor you, * by your holy intercessions.”
ltx/en_us_dedes/me.m12.d27:meMA.Kathisma22.greekmelody	@ltx/en_us_dedes/he.a.m4:heAU.KateplagiIosif.greekname
ltx/en_us_dedes/me.m12.d27:meMA.Kathisma22.incipit	@ltx/en_us_dedes/me.m12.d25:meMA.Kathisma31.incipit
ltx/en_us_dedes/me.m12.d27:meMA.Kathisma22.melody	@ltx/en_us_dedes/he.a.m4:heAU.KateplagiIosif.name
ltx/en_us_dedes/me.m12.d27:meMA.Kathisma22.mode	@ltx/en_us_dedes/miscellanea:misc.Mode4
ltx/en_us_dedes/me.m12.d27:meMA.Kathisma22.text	@ltx/en_us_dedes/me.m12.d25:meMA.Kathisma31.text
ltx/en_us_dedes/me.m12.d27:meMA.Kontakion1.greekmelody	@ltx/en_us_dedes/he.a.m3:heAU.IParthenosSimeron.greekname
ltx/en_us_dedes/me.m12.d27:meMA.Kontakion1.incipit	Yesterday, the Master arrived through…
ltx/en_us_dedes/me.m12.d27:meMA.Kontakion1.melody	@ltx/en_us_dedes/he.a.m3:heAU.IParthenosSimeron.name
ltx/en_us_dedes/me.m12.d27:meMA.Kontakion1.mode	@ltx/en_us_dedes/miscellanea:misc.Mode3
ltx/en_us_dedes/me.m12.d27:meMA.Kontakion1.text	Yesterday, the Master arrived through the flesh, and today, the servant departs from the flesh. Yesterday, the King was born in the flesh, and today the servant is stoned for His sake and dies. And we know him as the holy Protomartyr Stephen.
ltx/en_us_dedes/me.m12.d27:meMA.Lauds1.incipit	Let us the faithful plait…
ltx/en_us_dedes/me.m12.d27:meMA.Lauds1.melody	@ltx/en_us_dedes/miscellanea:misc.Idiomelon
ltx/en_us_dedes/me.m12.d27:meMA.Lauds1.mode	@ltx/en_us_dedes/miscellanea:misc.Mode1
ltx/en_us_dedes/me.m12.d27:meMA.Lauds1.poet	@ltx/en_us_dedes/poets:po.Kyprianou
ltx/en_us_dedes/me.m12.d27:meMA.Lauds1.text	Let us the faithful plait a wreath of victory for the Protomartyr, using words instead of laurels. For he prepared the way for Martyrs. He joyfully cried out, “Behold, I see the heavens opened and the Son of God standing on the right hand of the unseen Father.”
ltx/en_us_dedes/me.m12.d27:meMA.Lauds2.incipit	@ltx/en_us_dedes/me.m08.d02:meVE.Stichera06.incipit
ltx/en_us_dedes/me.m12.d27:meMA.Lauds2.melody	@ltx/en_us_dedes/miscellanea:misc.Idiomelon
ltx/en_us_dedes/me.m12.d27:meMA.Lauds2.mode	@ltx/en_us_dedes/miscellanea:misc.Mode2
ltx/en_us_dedes/me.m12.d27:meMA.Lauds2.poet	@ltx/en_us_dedes/poets:po.Anatoliou
ltx/en_us_dedes/me.m12.d27:meMA.Lauds2.text	@ltx/en_us_dedes/me.m08.d02:meVE.Stichera06.text
ltx/en_us_dedes/me.m12.d27:meMA.Lauds3.incipit	@ltx/en_us_dedes/me.m08.d02:meVE.Stichera04.incipit
ltx/en_us_dedes/me.m12.d27:meMA.Lauds3.melody	@ltx/en_us_dedes/miscellanea:misc.Idiomelon
ltx/en_us_dedes/me.m12.d27:meMA.Lauds3.mode	@ltx/en_us_dedes/miscellanea:misc.Mode2
ltx/en_us_dedes/me.m12.d27:meMA.Lauds3.text	@ltx/en_us_dedes/me.m08.d02:meVE.Stichera04.text
ltx/en_us_dedes/me.m12.d27:meMA.Lauds4.incipit	@ltx/en_us_dedes/me.m08.d02:meVE.Stichera05.incipit
ltx/en_us_dedes/me.m12.d27:meMA.Lauds4.melody	@ltx/en_us_dedes/miscellanea:misc.Idiomelon
ltx/en_us_dedes/me.m12.d27:meMA.Lauds4.mode	@ltx/en_us_dedes/miscellanea:misc.Mode2
ltx/en_us_dedes/me.m12.d27:meMA.Lauds4.text	@ltx/en_us_dedes/me.m08.d02:meVE.Stichera05.text
ltx/en_us_dedes/me.m12.d27:meMA.Lauds5.incipit	Glorious Stephen, citizen of heaven…
ltx/en_us_dedes/me.m12.d27:meMA.Lauds5.melody	@ltx/en_us_dedes/miscellanea:misc.Idiomelon
ltx/en_us_dedes/me.m12.d27:meMA.Lauds5.mode	@ltx/en_us_dedes/miscellanea:misc.Mode4
ltx/en_us_dedes/me.m12.d27:meMA.Lauds5.poet	@ltx/en_us_dedes/poets:po.IoannouMonachou
ltx/en_us_dedes/me.m12.d27:meMA.Lauds5.text	Glorious Stephen, citizen of heaven, blessed servant of Christ, make intercession on behalf of our souls.
ltx/en_us_dedes/me.m12.d27:meMA.Lauds6.incipit	@ltx/en_us_dedes/me.m08.d02:meMA.LaudsGlory.incipit
ltx/en_us_dedes/me.m12.d27:meMA.Lauds6.melody	@ltx/en_us_dedes/miscellanea:misc.Idiomelon
ltx/en_us_dedes/me.m12.d27:meMA.Lauds6.mode	@ltx/en_us_dedes/miscellanea:misc.Mode4
ltx/en_us_dedes/me.m12.d27:meMA.Lauds6.text	@ltx/en_us_dedes/me.m08.d02:meMA.LaudsGlory.text
ltx/en_us_dedes/me.m12.d27:meMA.LaudsBoth.incipit	Incomprehensible is the mystery that…
ltx/en_us_dedes/me.m12.d27:meMA.LaudsBoth.melody	@ltx/en_us_dedes/miscellanea:misc.Idiomelon
ltx/en_us_dedes/me.m12.d27:meMA.LaudsBoth.mode	@ltx/en_us_dedes/miscellanea:misc.Mode5
ltx/en_us_dedes/me.m12.d27:meMA.LaudsBoth.poet	@ltx/en_us_dedes/poets:po.IoannouMonachou
ltx/en_us_dedes/me.m12.d27:meMA.LaudsBoth.text	Incomprehensible is the mystery that is accomplished today in Bethlehem! The invisible One becomes visible; the fleshless One assumes flesh; the Logos takes substance; and the One who is becomes what He was not. A Virgin gives birth in a cave to a new baby who is the Fashioner of nature. A manger portrays a heavenly throne, and animals represent an array of Cherubim. Shepherds marvel; Magi bring gifts. Angels sing praises, saying, “Glory to God in the highest, and peace on earth. For Emmanuel, without changing, is well pleased to be with mankind.”
ltx/en_us_dedes/me.m12.d27:meMA.LaudsGlory.incipit	@ltx/en_us_dedes/me.m08.d02:meMA.AposGlory.incipit
ltx/en_us_dedes/me.m12.d27:meMA.LaudsGlory.melody	@ltx/en_us_dedes/miscellanea:misc.Idiomelon
ltx/en_us_dedes/me.m12.d27:meMA.LaudsGlory.mode	@ltx/en_us_dedes/miscellanea:misc.Mode5
ltx/en_us_dedes/me.m12.d27:meMA.LaudsGlory.poet	@ltx/en_us_dedes/poets:po.Kyprianou
ltx/en_us_dedes/me.m12.d27:meMA.LaudsGlory.text	@ltx/en_us_dedes/me.m08.d02:meMA.AposGlory.text
ltx/en_us_dedes/me.m12.d27:meMA.MM.Lauds1234as5678.text	@ltx/en_us_dedes/properties:media.key
ltx/en_us_dedes/me.m12.d27:meMA.Ode1C11.greekmelody	@ltx/en_us_dedes/he.h.m5:heHE.IpponKaiAnavatin.greekname
ltx/en_us_dedes/me.m12.d27:meMA.Ode1C11.incipit	…
ltx/en_us_dedes/me.m12.d27:meMA.Ode1C11.melody	@ltx/en_us_dedes/he.h.m5:heHE.IpponKaiAnavatin.name
ltx/en_us_dedes/me.m12.d27:meMA.Ode1C11.mode	@ltx/en_us_dedes/miscellanea:misc.Mode5
ltx/en_us_dedes/me.m12.d27:meMA.Ode1C11.ode	@ltx/en_us_dedes/miscellanea:misc.Ode1
ltx/en_us_dedes/me.m12.d27:meMA.Ode1C11.text	
ltx/en_us_dedes/me.m12.d27:meMA.Ode1C12.incipit	…
ltx/en_us_dedes/me.m12.d27:meMA.Ode1C12.melody	@ltx/en_us_dedes/he.h.m5:heHE.IpponKaiAnavatin.name
ltx/en_us_dedes/me.m12.d27:meMA.Ode1C12.mode	@ltx/en_us_dedes/miscellanea:misc.Mode5
ltx/en_us_dedes/me.m12.d27:meMA.Ode1C12.ode	@ltx/en_us_dedes/miscellanea:misc.Ode1
ltx/en_us_dedes/me.m12.d27:meMA.Ode1C12.text	
ltx/en_us_dedes/me.m12.d27:meMA.Ode1C13.incipit	…
ltx/en_us_dedes/me.m12.d27:meMA.Ode1C13.melody	@ltx/en_us_dedes/he.h.m5:heHE.IpponKaiAnavatin.name
ltx/en_us_dedes/me.m12.d27:meMA.Ode1C13.mode	@ltx/en_us_dedes/miscellanea:misc.Mode5
ltx/en_us_dedes/me.m12.d27:meMA.Ode1C13.ode	@ltx/en_us_dedes/miscellanea:misc.Ode1
ltx/en_us_dedes/me.m12.d27:meMA.Ode1C13.text	
ltx/en_us_dedes/me.m12.d27:meMA.Ode1C1T.incipit	…
ltx/en_us_dedes/me.m12.d27:meMA.Ode1C1T.melody	@ltx/en_us_dedes/he.h.m5:heHE.IpponKaiAnavatin.name
ltx/en_us_dedes/me.m12.d27:meMA.Ode1C1T.mode	@ltx/en_us_dedes/miscellanea:misc.Mode5
ltx/en_us_dedes/me.m12.d27:meMA.Ode1C1T.ode	@ltx/en_us_dedes/miscellanea:misc.Ode1
ltx/en_us_dedes/me.m12.d27:meMA.Ode1C1T.text	
ltx/en_us_dedes/me.m12.d27:meMA.Ode1C21.greekmelody	@ltx/en_us_dedes/he.h.m4:heHE.ThalassisToErythraion.greekname
ltx/en_us_dedes/me.m12.d27:meMA.Ode1C21.incipit	…
ltx/en_us_dedes/me.m12.d27:meMA.Ode1C21.melody	@ltx/en_us_dedes/he.h.m4:heHE.ThalassisToErythraion.name
ltx/en_us_dedes/me.m12.d27:meMA.Ode1C21.mode	@ltx/en_us_dedes/miscellanea:misc.Mode4
ltx/en_us_dedes/me.m12.d27:meMA.Ode1C21.ode	@ltx/en_us_dedes/miscellanea:misc.Ode1
ltx/en_us_dedes/me.m12.d27:meMA.Ode1C21.text	
ltx/en_us_dedes/me.m12.d27:meMA.Ode1C22.incipit	…
ltx/en_us_dedes/me.m12.d27:meMA.Ode1C22.melody	@ltx/en_us_dedes/he.h.m4:heHE.ThalassisToErythraion.name
ltx/en_us_dedes/me.m12.d27:meMA.Ode1C22.mode	@ltx/en_us_dedes/miscellanea:misc.Mode4
ltx/en_us_dedes/me.m12.d27:meMA.Ode1C22.ode	@ltx/en_us_dedes/miscellanea:misc.Ode1
ltx/en_us_dedes/me.m12.d27:meMA.Ode1C22.text	
ltx/en_us_dedes/me.m12.d27:meMA.Ode1C23.incipit	…
ltx/en_us_dedes/me.m12.d27:meMA.Ode1C23.melody	@ltx/en_us_dedes/he.h.m4:heHE.ThalassisToErythraion.name
ltx/en_us_dedes/me.m12.d27:meMA.Ode1C23.mode	@ltx/en_us_dedes/miscellanea:misc.Mode4
ltx/en_us_dedes/me.m12.d27:meMA.Ode1C23.ode	@ltx/en_us_dedes/miscellanea:misc.Ode1
ltx/en_us_dedes/me.m12.d27:meMA.Ode1C23.text	
ltx/en_us_dedes/me.m12.d27:meMA.Ode1C24.incipit	…
ltx/en_us_dedes/me.m12.d27:meMA.Ode1C24.melody	@ltx/en_us_dedes/he.h.m4:heHE.ThalassisToErythraion.name
ltx/en_us_dedes/me.m12.d27:meMA.Ode1C24.mode	@ltx/en_us_dedes/miscellanea:misc.Mode4
ltx/en_us_dedes/me.m12.d27:meMA.Ode1C24.ode	@ltx/en_us_dedes/miscellanea:misc.Ode1
ltx/en_us_dedes/me.m12.d27:meMA.Ode1C24.text	
ltx/en_us_dedes/me.m12.d27:meMA.Ode1C2T.incipit	…
ltx/en_us_dedes/me.m12.d27:meMA.Ode1C2T.melody	@ltx/en_us_dedes/he.h.m4:heHE.ThalassisToErythraion.name
ltx/en_us_dedes/me.m12.d27:meMA.Ode1C2T.mode	@ltx/en_us_dedes/miscellanea:misc.Mode4
ltx/en_us_dedes/me.m12.d27:meMA.Ode1C2T.ode	@ltx/en_us_dedes/miscellanea:misc.Ode1
ltx/en_us_dedes/me.m12.d27:meMA.Ode1C2T.text	
ltx/en_us_dedes/me.m12.d27:meMA.Ode3C11.greekmelody	@ltx/en_us_dedes/he.h.m5:heHE.OPixasEpOudenos.greekname
ltx/en_us_dedes/me.m12.d27:meMA.Ode3C11.incipit	…
ltx/en_us_dedes/me.m12.d27:meMA.Ode3C11.melody	@ltx/en_us_dedes/he.h.m5:heHE.OPixasEpOudenos.name
ltx/en_us_dedes/me.m12.d27:meMA.Ode3C11.mode	@ltx/en_us_dedes/miscellanea:misc.Mode5
ltx/en_us_dedes/me.m12.d27:meMA.Ode3C11.ode	@ltx/en_us_dedes/miscellanea:misc.Ode3
ltx/en_us_dedes/me.m12.d27:meMA.Ode3C11.text	
ltx/en_us_dedes/me.m12.d27:meMA.Ode3C12.incipit	…
ltx/en_us_dedes/me.m12.d27:meMA.Ode3C12.melody	@ltx/en_us_dedes/he.h.m5:heHE.OPixasEpOudenos.name
ltx/en_us_dedes/me.m12.d27:meMA.Ode3C12.mode	@ltx/en_us_dedes/miscellanea:misc.Mode5
ltx/en_us_dedes/me.m12.d27:meMA.Ode3C12.ode	@ltx/en_us_dedes/miscellanea:misc.Ode3
ltx/en_us_dedes/me.m12.d27:meMA.Ode3C12.text	
ltx/en_us_dedes/me.m12.d27:meMA.Ode3C13.incipit	…
ltx/en_us_dedes/me.m12.d27:meMA.Ode3C13.melody	@ltx/en_us_dedes/he.h.m5:heHE.OPixasEpOudenos.name
ltx/en_us_dedes/me.m12.d27:meMA.Ode3C13.mode	@ltx/en_us_dedes/miscellanea:misc.Mode5
ltx/en_us_dedes/me.m12.d27:meMA.Ode3C13.ode	@ltx/en_us_dedes/miscellanea:misc.Ode3
ltx/en_us_dedes/me.m12.d27:meMA.Ode3C13.text	
ltx/en_us_dedes/me.m12.d27:meMA.Ode3C1T.incipit	…
ltx/en_us_dedes/me.m12.d27:meMA.Ode3C1T.melody	@ltx/en_us_dedes/he.h.m5:heHE.OPixasEpOudenos.name
ltx/en_us_dedes/me.m12.d27:meMA.Ode3C1T.mode	@ltx/en_us_dedes/miscellanea:misc.Mode5
ltx/en_us_dedes/me.m12.d27:meMA.Ode3C1T.ode	@ltx/en_us_dedes/miscellanea:misc.Ode3
ltx/en_us_dedes/me.m12.d27:meMA.Ode3C1T.text	
ltx/en_us_dedes/me.m12.d27:meMA.Ode3C21.greekmelody	@ltx/en_us_dedes/he.h.m4:heHE.EffrainetaiEpiSoi.greekname
ltx/en_us_dedes/me.m12.d27:meMA.Ode3C21.incipit	…
ltx/en_us_dedes/me.m12.d27:meMA.Ode3C21.melody	@ltx/en_us_dedes/he.h.m4:heHE.EffrainetaiEpiSoi.name
ltx/en_us_dedes/me.m12.d27:meMA.Ode3C21.mode	@ltx/en_us_dedes/miscellanea:misc.Mode4
ltx/en_us_dedes/me.m12.d27:meMA.Ode3C21.ode	@ltx/en_us_dedes/miscellanea:misc.Ode3
ltx/en_us_dedes/me.m12.d27:meMA.Ode3C21.text	
ltx/en_us_dedes/me.m12.d27:meMA.Ode3C22.incipit	…
ltx/en_us_dedes/me.m12.d27:meMA.Ode3C22.melody	@ltx/en_us_dedes/he.h.m4:heHE.EffrainetaiEpiSoi.name
ltx/en_us_dedes/me.m12.d27:meMA.Ode3C22.mode	@ltx/en_us_dedes/miscellanea:misc.Mode4
ltx/en_us_dedes/me.m12.d27:meMA.Ode3C22.ode	@ltx/en_us_dedes/miscellanea:misc.Ode3
ltx/en_us_dedes/me.m12.d27:meMA.Ode3C22.text	
ltx/en_us_dedes/me.m12.d27:meMA.Ode3C23.incipit	…
ltx/en_us_dedes/me.m12.d27:meMA.Ode3C23.melody	@ltx/en_us_dedes/he.h.m4:heHE.EffrainetaiEpiSoi.name
ltx/en_us_dedes/me.m12.d27:meMA.Ode3C23.mode	@ltx/en_us_dedes/miscellanea:misc.Mode4
ltx/en_us_dedes/me.m12.d27:meMA.Ode3C23.ode	@ltx/en_us_dedes/miscellanea:misc.Ode3
ltx/en_us_dedes/me.m12.d27:meMA.Ode3C23.text	
ltx/en_us_dedes/me.m12.d27:meMA.Ode3C24.incipit	…
ltx/en_us_dedes/me.m12.d27:meMA.Ode3C24.melody	@ltx/en_us_dedes/he.h.m4:heHE.EffrainetaiEpiSoi.name
ltx/en_us_dedes/me.m12.d27:meMA.Ode3C24.mode	@ltx/en_us_dedes/miscellanea:misc.Mode4
ltx/en_us_dedes/me.m12.d27:meMA.Ode3C24.ode	@ltx/en_us_dedes/miscellanea:misc.Ode3
ltx/en_us_dedes/me.m12.d27:meMA.Ode3C24.text	
ltx/en_us_dedes/me.m12.d27:meMA.Ode3C2T.incipit	…
ltx/en_us_dedes/me.m12.d27:meMA.Ode3C2T.melody	@ltx/en_us_dedes/he.h.m4:heHE.EffrainetaiEpiSoi.name
ltx/en_us_dedes/me.m12.d27:meMA.Ode3C2T.mode	@ltx/en_us_dedes/miscellanea:misc.Mode4
ltx/en_us_dedes/me.m12.d27:meMA.Ode3C2T.ode	@ltx/en_us_dedes/miscellanea:misc.Ode3
ltx/en_us_dedes/me.m12.d27:meMA.Ode3C2T.text	
ltx/en_us_dedes/me.m12.d27:meMA.Ode3Kathisma1.greekmelody	@ltx/en_us_dedes/he.a.m1:heAU.TonTafonSouSotir.greekname
ltx/en_us_dedes/me.m12.d27:meMA.Ode3Kathisma1.incipit	Apostle of Christ and the…
ltx/en_us_dedes/me.m12.d27:meMA.Ode3Kathisma1.melody	@ltx/en_us_dedes/he.a.m1:heAU.TonTafonSouSotir.notmetered
ltx/en_us_dedes/me.m12.d27:meMA.Ode3Kathisma1.mode	@ltx/en_us_dedes/miscellanea:misc.Mode1
ltx/en_us_dedes/me.m12.d27:meMA.Ode3Kathisma1.text	Apostle of Christ and the first of the Deacons, wise and foremost first martyr athlete, you sanctified the whole world by your contests, and you brightened peoples’ souls by your miracles. Now rescue us who honor you from every kind of danger, O all-lauded Stephen.
ltx/en_us_dedes/me.m12.d27:meMA.Ode3Kathisma2.greekmelody	@ltx/en_us_dedes/he.a.m3:heAU.TheiasPisteos.greekname
ltx/en_us_dedes/me.m12.d27:meMA.Ode3Kathisma2.incipit	…
ltx/en_us_dedes/me.m12.d27:meMA.Ode3Kathisma2.melody	@ltx/en_us_dedes/he.a.m3:heAU.TheiasPisteos.name
ltx/en_us_dedes/me.m12.d27:meMA.Ode3Kathisma2.mode	@ltx/en_us_dedes/miscellanea:misc.Mode3
ltx/en_us_dedes/me.m12.d27:meMA.Ode3Kathisma2.text	
ltx/en_us_dedes/me.m12.d27:meMA.Ode3Kathisma3.greekmelody	@ltx/en_us_dedes/he.a.m3:heAU.TinOraiotita.greekname
ltx/en_us_dedes/me.m12.d27:meMA.Ode3Kathisma3.incipit	…
ltx/en_us_dedes/me.m12.d27:meMA.Ode3Kathisma3.melody	@ltx/en_us_dedes/he.a.m3:heAU.TinOraiotita.name
ltx/en_us_dedes/me.m12.d27:meMA.Ode3Kathisma3.mode	@ltx/en_us_dedes/miscellanea:misc.Mode3
ltx/en_us_dedes/me.m12.d27:meMA.Ode3Kathisma3.text	
ltx/en_us_dedes/me.m12.d27:meMA.Ode4C11.greekmelody	@ltx/en_us_dedes/he.h.m5:heHE.TinTheianEnnoisas.greekname
ltx/en_us_dedes/me.m12.d27:meMA.Ode4C11.incipit	…
ltx/en_us_dedes/me.m12.d27:meMA.Ode4C11.melody	@ltx/en_us_dedes/he.h.m5:heHE.TinTheianEnnoisas.name
ltx/en_us_dedes/me.m12.d27:meMA.Ode4C11.mode	@ltx/en_us_dedes/miscellanea:misc.Mode5
ltx/en_us_dedes/me.m12.d27:meMA.Ode4C11.ode	@ltx/en_us_dedes/miscellanea:misc.Ode4
ltx/en_us_dedes/me.m12.d27:meMA.Ode4C11.text	
ltx/en_us_dedes/me.m12.d27:meMA.Ode4C12.incipit	…
ltx/en_us_dedes/me.m12.d27:meMA.Ode4C12.melody	@ltx/en_us_dedes/he.h.m5:heHE.TinTheianEnnoisas.name
ltx/en_us_dedes/me.m12.d27:meMA.Ode4C12.mode	@ltx/en_us_dedes/miscellanea:misc.Mode5
ltx/en_us_dedes/me.m12.d27:meMA.Ode4C12.ode	@ltx/en_us_dedes/miscellanea:misc.Ode4
ltx/en_us_dedes/me.m12.d27:meMA.Ode4C12.text	
ltx/en_us_dedes/me.m12.d27:meMA.Ode4C13.incipit	…
ltx/en_us_dedes/me.m12.d27:meMA.Ode4C13.melody	@ltx/en_us_dedes/he.h.m5:heHE.TinTheianEnnoisas.name
ltx/en_us_dedes/me.m12.d27:meMA.Ode4C13.mode	@ltx/en_us_dedes/miscellanea:misc.Mode5
ltx/en_us_dedes/me.m12.d27:meMA.Ode4C13.ode	@ltx/en_us_dedes/miscellanea:misc.Ode4
ltx/en_us_dedes/me.m12.d27:meMA.Ode4C13.text	
ltx/en_us_dedes/me.m12.d27:meMA.Ode4C1T.incipit	…
ltx/en_us_dedes/me.m12.d27:meMA.Ode4C1T.melody	@ltx/en_us_dedes/he.h.m5:heHE.TinTheianEnnoisas.name
ltx/en_us_dedes/me.m12.d27:meMA.Ode4C1T.mode	@ltx/en_us_dedes/miscellanea:misc.Mode5
ltx/en_us_dedes/me.m12.d27:meMA.Ode4C1T.ode	@ltx/en_us_dedes/miscellanea:misc.Ode4
ltx/en_us_dedes/me.m12.d27:meMA.Ode4C1T.text	
ltx/en_us_dedes/me.m12.d27:meMA.Ode4C21.greekmelody	@ltx/en_us_dedes/he.h.m4:heHE.EparthentaSeIdousa.greekname
ltx/en_us_dedes/me.m12.d27:meMA.Ode4C21.incipit	…
ltx/en_us_dedes/me.m12.d27:meMA.Ode4C21.melody	@ltx/en_us_dedes/he.h.m4:heHE.EparthentaSeIdousa.name
ltx/en_us_dedes/me.m12.d27:meMA.Ode4C21.mode	@ltx/en_us_dedes/miscellanea:misc.Mode4
ltx/en_us_dedes/me.m12.d27:meMA.Ode4C21.ode	@ltx/en_us_dedes/miscellanea:misc.Ode4
ltx/en_us_dedes/me.m12.d27:meMA.Ode4C21.text	
ltx/en_us_dedes/me.m12.d27:meMA.Ode4C22.incipit	…
ltx/en_us_dedes/me.m12.d27:meMA.Ode4C22.melody	@ltx/en_us_dedes/he.h.m4:heHE.EparthentaSeIdousa.name
ltx/en_us_dedes/me.m12.d27:meMA.Ode4C22.mode	@ltx/en_us_dedes/miscellanea:misc.Mode4
ltx/en_us_dedes/me.m12.d27:meMA.Ode4C22.ode	@ltx/en_us_dedes/miscellanea:misc.Ode4
ltx/en_us_dedes/me.m12.d27:meMA.Ode4C22.text	
ltx/en_us_dedes/me.m12.d27:meMA.Ode4C23.incipit	…
ltx/en_us_dedes/me.m12.d27:meMA.Ode4C23.melody	@ltx/en_us_dedes/he.h.m4:heHE.EparthentaSeIdousa.name
ltx/en_us_dedes/me.m12.d27:meMA.Ode4C23.mode	@ltx/en_us_dedes/miscellanea:misc.Mode4
ltx/en_us_dedes/me.m12.d27:meMA.Ode4C23.ode	@ltx/en_us_dedes/miscellanea:misc.Ode4
ltx/en_us_dedes/me.m12.d27:meMA.Ode4C23.text	
ltx/en_us_dedes/me.m12.d27:meMA.Ode4C2T.incipit	…
ltx/en_us_dedes/me.m12.d27:meMA.Ode4C2T.melody	@ltx/en_us_dedes/he.h.m4:heHE.EparthentaSeIdousa.name
ltx/en_us_dedes/me.m12.d27:meMA.Ode4C2T.mode	@ltx/en_us_dedes/miscellanea:misc.Mode4
ltx/en_us_dedes/me.m12.d27:meMA.Ode4C2T.ode	@ltx/en_us_dedes/miscellanea:misc.Ode4
ltx/en_us_dedes/me.m12.d27:meMA.Ode4C2T.text	
ltx/en_us_dedes/me.m12.d27:meMA.Ode5C11.greekmelody	@ltx/en_us_dedes/he.h.m5:heHE.OAnavallomenos.greekname
ltx/en_us_dedes/me.m12.d27:meMA.Ode5C11.incipit	…
ltx/en_us_dedes/me.m12.d27:meMA.Ode5C11.melody	@ltx/en_us_dedes/he.h.m5:heHE.OAnavallomenos.name
ltx/en_us_dedes/me.m12.d27:meMA.Ode5C11.mode	@ltx/en_us_dedes/miscellanea:misc.Mode5
ltx/en_us_dedes/me.m12.d27:meMA.Ode5C11.ode	@ltx/en_us_dedes/miscellanea:misc.Ode5
ltx/en_us_dedes/me.m12.d27:meMA.Ode5C11.text	
ltx/en_us_dedes/me.m12.d27:meMA.Ode5C12.incipit	…
ltx/en_us_dedes/me.m12.d27:meMA.Ode5C12.melody	@ltx/en_us_dedes/he.h.m5:heHE.OAnavallomenos.name
ltx/en_us_dedes/me.m12.d27:meMA.Ode5C12.mode	@ltx/en_us_dedes/miscellanea:misc.Mode5
ltx/en_us_dedes/me.m12.d27:meMA.Ode5C12.ode	@ltx/en_us_dedes/miscellanea:misc.Ode5
ltx/en_us_dedes/me.m12.d27:meMA.Ode5C12.text	
ltx/en_us_dedes/me.m12.d27:meMA.Ode5C13.incipit	…
ltx/en_us_dedes/me.m12.d27:meMA.Ode5C13.melody	@ltx/en_us_dedes/he.h.m5:heHE.OAnavallomenos.name
ltx/en_us_dedes/me.m12.d27:meMA.Ode5C13.mode	@ltx/en_us_dedes/miscellanea:misc.Mode5
ltx/en_us_dedes/me.m12.d27:meMA.Ode5C13.ode	@ltx/en_us_dedes/miscellanea:misc.Ode5
ltx/en_us_dedes/me.m12.d27:meMA.Ode5C13.text	
ltx/en_us_dedes/me.m12.d27:meMA.Ode5C1T.incipit	…
ltx/en_us_dedes/me.m12.d27:meMA.Ode5C1T.melody	@ltx/en_us_dedes/he.h.m5:heHE.OAnavallomenos.name
ltx/en_us_dedes/me.m12.d27:meMA.Ode5C1T.mode	@ltx/en_us_dedes/miscellanea:misc.Mode5
ltx/en_us_dedes/me.m12.d27:meMA.Ode5C1T.ode	@ltx/en_us_dedes/miscellanea:misc.Ode5
ltx/en_us_dedes/me.m12.d27:meMA.Ode5C1T.text	
ltx/en_us_dedes/me.m12.d27:meMA.Ode5C21.greekmelody	@ltx/en_us_dedes/he.h.m4:heHE.SyKyrieMouFos.greekname
ltx/en_us_dedes/me.m12.d27:meMA.Ode5C21.incipit	…
ltx/en_us_dedes/me.m12.d27:meMA.Ode5C21.melody	@ltx/en_us_dedes/he.h.m4:heHE.SyKyrieMouFos.name
ltx/en_us_dedes/me.m12.d27:meMA.Ode5C21.mode	@ltx/en_us_dedes/miscellanea:misc.Mode4
ltx/en_us_dedes/me.m12.d27:meMA.Ode5C21.ode	@ltx/en_us_dedes/miscellanea:misc.Ode5
ltx/en_us_dedes/me.m12.d27:meMA.Ode5C21.text	
ltx/en_us_dedes/me.m12.d27:meMA.Ode5C22.incipit	…
ltx/en_us_dedes/me.m12.d27:meMA.Ode5C22.melody	@ltx/en_us_dedes/he.h.m4:heHE.SyKyrieMouFos.name
ltx/en_us_dedes/me.m12.d27:meMA.Ode5C22.mode	@ltx/en_us_dedes/miscellanea:misc.Mode4
ltx/en_us_dedes/me.m12.d27:meMA.Ode5C22.ode	@ltx/en_us_dedes/miscellanea:misc.Ode5
ltx/en_us_dedes/me.m12.d27:meMA.Ode5C22.text	
ltx/en_us_dedes/me.m12.d27:meMA.Ode5C23.incipit	…
ltx/en_us_dedes/me.m12.d27:meMA.Ode5C23.melody	@ltx/en_us_dedes/he.h.m4:heHE.SyKyrieMouFos.name
ltx/en_us_dedes/me.m12.d27:meMA.Ode5C23.mode	@ltx/en_us_dedes/miscellanea:misc.Mode4
ltx/en_us_dedes/me.m12.d27:meMA.Ode5C23.ode	@ltx/en_us_dedes/miscellanea:misc.Ode5
ltx/en_us_dedes/me.m12.d27:meMA.Ode5C23.text	
ltx/en_us_dedes/me.m12.d27:meMA.Ode5C2T.incipit	…
ltx/en_us_dedes/me.m12.d27:meMA.Ode5C2T.melody	@ltx/en_us_dedes/he.h.m4:heHE.SyKyrieMouFos.name
ltx/en_us_dedes/me.m12.d27:meMA.Ode5C2T.mode	@ltx/en_us_dedes/miscellanea:misc.Mode4
ltx/en_us_dedes/me.m12.d27:meMA.Ode5C2T.ode	@ltx/en_us_dedes/miscellanea:misc.Ode5
ltx/en_us_dedes/me.m12.d27:meMA.Ode5C2T.text	
ltx/en_us_dedes/me.m12.d27:meMA.Ode6C11.greekmelody	@ltx/en_us_dedes/he.h.m5:heHE.MainomeninKlydoni.greekname
ltx/en_us_dedes/me.m12.d27:meMA.Ode6C11.incipit	O believers, Stephen, the illustrious…
ltx/en_us_dedes/me.m12.d27:meMA.Ode6C11.melody	@ltx/en_us_dedes/he.h.m5:heHE.MainomeninKlydoni.notmetered
ltx/en_us_dedes/me.m12.d27:meMA.Ode6C11.mode	@ltx/en_us_dedes/miscellanea:misc.Mode5
ltx/en_us_dedes/me.m12.d27:meMA.Ode6C11.ode	@ltx/en_us_dedes/miscellanea:misc.Ode6
ltx/en_us_dedes/me.m12.d27:meMA.Ode6C11.text	O believers, Stephen, the illustrious marshal of the Martyrs, by grace exceeded the bounds of nature, and he shines with divine glory.
ltx/en_us_dedes/me.m12.d27:meMA.Ode6C12.incipit	O Christ our Master, St…
ltx/en_us_dedes/me.m12.d27:meMA.Ode6C12.melody	@ltx/en_us_dedes/he.h.m5:heHE.MainomeninKlydoni.notmetered
ltx/en_us_dedes/me.m12.d27:meMA.Ode6C12.mode	@ltx/en_us_dedes/miscellanea:misc.Mode5
ltx/en_us_dedes/me.m12.d27:meMA.Ode6C12.ode	@ltx/en_us_dedes/miscellanea:misc.Ode6
ltx/en_us_dedes/me.m12.d27:meMA.Ode6C12.text	O Christ our Master, St. Stephen became the excellent imitator of Your revered Passion, and he repaid his murderers with a blessing.
ltx/en_us_dedes/me.m12.d27:meMA.Ode6C13.incipit	O Christ, preserve us who…
ltx/en_us_dedes/me.m12.d27:meMA.Ode6C13.melody	@ltx/en_us_dedes/he.h.m5:heHE.MainomeninKlydoni.notmetered
ltx/en_us_dedes/me.m12.d27:meMA.Ode6C13.mode	@ltx/en_us_dedes/miscellanea:misc.Mode5
ltx/en_us_dedes/me.m12.d27:meMA.Ode6C13.ode	@ltx/en_us_dedes/miscellanea:misc.Ode6
ltx/en_us_dedes/me.m12.d27:meMA.Ode6C13.text	O Christ, preserve us who sing the Protomartyr’s praises from any blood-guilty deed, but rather make them worthy of his lot, since You are compassionate.
ltx/en_us_dedes/me.m12.d27:meMA.Ode6C1T.incipit	O Christ our Master, Your…
ltx/en_us_dedes/me.m12.d27:meMA.Ode6C1T.melody	@ltx/en_us_dedes/he.h.m5:heHE.MainomeninKlydoni.notmetered
ltx/en_us_dedes/me.m12.d27:meMA.Ode6C1T.mode	@ltx/en_us_dedes/miscellanea:misc.Mode5
ltx/en_us_dedes/me.m12.d27:meMA.Ode6C1T.ode	@ltx/en_us_dedes/miscellanea:misc.Ode6
ltx/en_us_dedes/me.m12.d27:meMA.Ode6C1T.text	O Christ our Master, Your Nativity is the first-fruit of universal salvation, and the subject of the godly confession of the Martyrs.
ltx/en_us_dedes/me.m12.d27:meMA.Ode6C21.greekmelody	@ltx/en_us_dedes/he.h.m4:heHE.ThysoSoiMetaFonis.greekname
ltx/en_us_dedes/me.m12.d27:meMA.Ode6C21.incipit	…
ltx/en_us_dedes/me.m12.d27:meMA.Ode6C21.melody	@ltx/en_us_dedes/he.h.m4:heHE.ThysoSoiMetaFonis.name
ltx/en_us_dedes/me.m12.d27:meMA.Ode6C21.mode	@ltx/en_us_dedes/miscellanea:misc.Mode4
ltx/en_us_dedes/me.m12.d27:meMA.Ode6C21.ode	@ltx/en_us_dedes/miscellanea:misc.Ode6
ltx/en_us_dedes/me.m12.d27:meMA.Ode6C21.text	
ltx/en_us_dedes/me.m12.d27:meMA.Ode6C22.incipit	…
ltx/en_us_dedes/me.m12.d27:meMA.Ode6C22.melody	@ltx/en_us_dedes/he.h.m4:heHE.ThysoSoiMetaFonis.name
ltx/en_us_dedes/me.m12.d27:meMA.Ode6C22.mode	@ltx/en_us_dedes/miscellanea:misc.Mode4
ltx/en_us_dedes/me.m12.d27:meMA.Ode6C22.ode	@ltx/en_us_dedes/miscellanea:misc.Ode6
ltx/en_us_dedes/me.m12.d27:meMA.Ode6C22.text	
ltx/en_us_dedes/me.m12.d27:meMA.Ode6C23.incipit	…
ltx/en_us_dedes/me.m12.d27:meMA.Ode6C23.melody	@ltx/en_us_dedes/he.h.m4:heHE.ThysoSoiMetaFonis.name
ltx/en_us_dedes/me.m12.d27:meMA.Ode6C23.mode	@ltx/en_us_dedes/miscellanea:misc.Mode4
ltx/en_us_dedes/me.m12.d27:meMA.Ode6C23.ode	@ltx/en_us_dedes/miscellanea:misc.Ode6
ltx/en_us_dedes/me.m12.d27:meMA.Ode6C23.text	
ltx/en_us_dedes/me.m12.d27:meMA.Ode6C2T.incipit	…
ltx/en_us_dedes/me.m12.d27:meMA.Ode6C2T.melody	@ltx/en_us_dedes/he.h.m4:heHE.ThysoSoiMetaFonis.name
ltx/en_us_dedes/me.m12.d27:meMA.Ode6C2T.mode	@ltx/en_us_dedes/miscellanea:misc.Mode4
ltx/en_us_dedes/me.m12.d27:meMA.Ode6C2T.ode	@ltx/en_us_dedes/miscellanea:misc.Ode6
ltx/en_us_dedes/me.m12.d27:meMA.Ode6C2T.text	
ltx/en_us_dedes/me.m12.d27:meMA.Ode7C11.greekmelody	@ltx/en_us_dedes/he.h.m5:heHE.OYperypsoumenos.greekname
ltx/en_us_dedes/me.m12.d27:meMA.Ode7C11.incipit	…
ltx/en_us_dedes/me.m12.d27:meMA.Ode7C11.melody	@ltx/en_us_dedes/he.h.m5:heHE.OYperypsoumenos.name
ltx/en_us_dedes/me.m12.d27:meMA.Ode7C11.mode	@ltx/en_us_dedes/miscellanea:misc.Mode5
ltx/en_us_dedes/me.m12.d27:meMA.Ode7C11.ode	@ltx/en_us_dedes/miscellanea:misc.Ode7
ltx/en_us_dedes/me.m12.d27:meMA.Ode7C11.text	
ltx/en_us_dedes/me.m12.d27:meMA.Ode7C12.incipit	…
ltx/en_us_dedes/me.m12.d27:meMA.Ode7C12.melody	@ltx/en_us_dedes/he.h.m5:heHE.OYperypsoumenos.name
ltx/en_us_dedes/me.m12.d27:meMA.Ode7C12.mode	@ltx/en_us_dedes/miscellanea:misc.Mode5
ltx/en_us_dedes/me.m12.d27:meMA.Ode7C12.ode	@ltx/en_us_dedes/miscellanea:misc.Ode7
ltx/en_us_dedes/me.m12.d27:meMA.Ode7C12.text	
ltx/en_us_dedes/me.m12.d27:meMA.Ode7C13.incipit	…
ltx/en_us_dedes/me.m12.d27:meMA.Ode7C13.melody	@ltx/en_us_dedes/he.h.m5:heHE.OYperypsoumenos.name
ltx/en_us_dedes/me.m12.d27:meMA.Ode7C13.mode	@ltx/en_us_dedes/miscellanea:misc.Mode5
ltx/en_us_dedes/me.m12.d27:meMA.Ode7C13.ode	@ltx/en_us_dedes/miscellanea:misc.Ode7
ltx/en_us_dedes/me.m12.d27:meMA.Ode7C13.text	
ltx/en_us_dedes/me.m12.d27:meMA.Ode7C14.incipit	…
ltx/en_us_dedes/me.m12.d27:meMA.Ode7C14.melody	@ltx/en_us_dedes/he.h.m5:heHE.OYperypsoumenos.name
ltx/en_us_dedes/me.m12.d27:meMA.Ode7C14.mode	@ltx/en_us_dedes/miscellanea:misc.Mode5
ltx/en_us_dedes/me.m12.d27:meMA.Ode7C14.ode	@ltx/en_us_dedes/miscellanea:misc.Ode7
ltx/en_us_dedes/me.m12.d27:meMA.Ode7C14.text	
ltx/en_us_dedes/me.m12.d27:meMA.Ode7C1T.incipit	…
ltx/en_us_dedes/me.m12.d27:meMA.Ode7C1T.melody	@ltx/en_us_dedes/he.h.m5:heHE.OYperypsoumenos.name
ltx/en_us_dedes/me.m12.d27:meMA.Ode7C1T.mode	@ltx/en_us_dedes/miscellanea:misc.Mode5
ltx/en_us_dedes/me.m12.d27:meMA.Ode7C1T.ode	@ltx/en_us_dedes/miscellanea:misc.Ode7
ltx/en_us_dedes/me.m12.d27:meMA.Ode7C1T.text	
ltx/en_us_dedes/me.m12.d27:meMA.Ode7C21.greekmelody	@ltx/en_us_dedes/he.h.m4:heHE.EnTiKaminoAvramiaioi.greekname
ltx/en_us_dedes/me.m12.d27:meMA.Ode7C21.incipit	…
ltx/en_us_dedes/me.m12.d27:meMA.Ode7C21.melody	@ltx/en_us_dedes/he.h.m4:heHE.EnTiKaminoAvramiaioi.name
ltx/en_us_dedes/me.m12.d27:meMA.Ode7C21.mode	@ltx/en_us_dedes/miscellanea:misc.Mode4
ltx/en_us_dedes/me.m12.d27:meMA.Ode7C21.ode	@ltx/en_us_dedes/miscellanea:misc.Ode7
ltx/en_us_dedes/me.m12.d27:meMA.Ode7C21.text	
ltx/en_us_dedes/me.m12.d27:meMA.Ode7C22.incipit	…
ltx/en_us_dedes/me.m12.d27:meMA.Ode7C22.melody	@ltx/en_us_dedes/he.h.m4:heHE.EnTiKaminoAvramiaioi.name
ltx/en_us_dedes/me.m12.d27:meMA.Ode7C22.mode	@ltx/en_us_dedes/miscellanea:misc.Mode4
ltx/en_us_dedes/me.m12.d27:meMA.Ode7C22.ode	@ltx/en_us_dedes/miscellanea:misc.Ode7
ltx/en_us_dedes/me.m12.d27:meMA.Ode7C22.text	
ltx/en_us_dedes/me.m12.d27:meMA.Ode7C23.incipit	…
ltx/en_us_dedes/me.m12.d27:meMA.Ode7C23.melody	@ltx/en_us_dedes/he.h.m4:heHE.EnTiKaminoAvramiaioi.name
ltx/en_us_dedes/me.m12.d27:meMA.Ode7C23.mode	@ltx/en_us_dedes/miscellanea:misc.Mode4
ltx/en_us_dedes/me.m12.d27:meMA.Ode7C23.ode	@ltx/en_us_dedes/miscellanea:misc.Ode7
ltx/en_us_dedes/me.m12.d27:meMA.Ode7C23.text	
ltx/en_us_dedes/me.m12.d27:meMA.Ode7C2T.incipit	…
ltx/en_us_dedes/me.m12.d27:meMA.Ode7C2T.melody	@ltx/en_us_dedes/he.h.m4:heHE.EnTiKaminoAvramiaioi.name
ltx/en_us_dedes/me.m12.d27:meMA.Ode7C2T.mode	@ltx/en_us_dedes/miscellanea:misc.Mode4
ltx/en_us_dedes/me.m12.d27:meMA.Ode7C2T.ode	@ltx/en_us_dedes/miscellanea:misc.Ode7
ltx/en_us_dedes/me.m12.d27:meMA.Ode7C2T.text	
ltx/en_us_dedes/me.m12.d27:meMA.Ode8C11.greekmelody	@ltx/en_us_dedes/he.h.m5:heHE.SoiToPantourgo.greekname
ltx/en_us_dedes/me.m12.d27:meMA.Ode8C11.incipit	…
ltx/en_us_dedes/me.m12.d27:meMA.Ode8C11.melody	@ltx/en_us_dedes/he.h.m5:heHE.SoiToPantourgo.name
ltx/en_us_dedes/me.m12.d27:meMA.Ode8C11.mode	@ltx/en_us_dedes/miscellanea:misc.Mode5
ltx/en_us_dedes/me.m12.d27:meMA.Ode8C11.ode	@ltx/en_us_dedes/miscellanea:misc.Ode8
ltx/en_us_dedes/me.m12.d27:meMA.Ode8C11.text	
ltx/en_us_dedes/me.m12.d27:meMA.Ode8C12.incipit	…
ltx/en_us_dedes/me.m12.d27:meMA.Ode8C12.melody	@ltx/en_us_dedes/he.h.m5:heHE.SoiToPantourgo.name
ltx/en_us_dedes/me.m12.d27:meMA.Ode8C12.mode	@ltx/en_us_dedes/miscellanea:misc.Mode5
ltx/en_us_dedes/me.m12.d27:meMA.Ode8C12.ode	@ltx/en_us_dedes/miscellanea:misc.Ode8
ltx/en_us_dedes/me.m12.d27:meMA.Ode8C12.text	
ltx/en_us_dedes/me.m12.d27:meMA.Ode8C13.incipit	…
ltx/en_us_dedes/me.m12.d27:meMA.Ode8C13.melody	@ltx/en_us_dedes/he.h.m5:heHE.SoiToPantourgo.name
ltx/en_us_dedes/me.m12.d27:meMA.Ode8C13.mode	@ltx/en_us_dedes/miscellanea:misc.Mode5
ltx/en_us_dedes/me.m12.d27:meMA.Ode8C13.ode	@ltx/en_us_dedes/miscellanea:misc.Ode8
ltx/en_us_dedes/me.m12.d27:meMA.Ode8C13.text	
ltx/en_us_dedes/me.m12.d27:meMA.Ode8C14.incipit	…
ltx/en_us_dedes/me.m12.d27:meMA.Ode8C14.melody	@ltx/en_us_dedes/he.h.m5:heHE.SoiToPantourgo.name
ltx/en_us_dedes/me.m12.d27:meMA.Ode8C14.mode	@ltx/en_us_dedes/miscellanea:misc.Mode5
ltx/en_us_dedes/me.m12.d27:meMA.Ode8C14.ode	@ltx/en_us_dedes/miscellanea:misc.Ode8
ltx/en_us_dedes/me.m12.d27:meMA.Ode8C14.text	
ltx/en_us_dedes/me.m12.d27:meMA.Ode8C1T.incipit	…
ltx/en_us_dedes/me.m12.d27:meMA.Ode8C1T.melody	@ltx/en_us_dedes/he.h.m5:heHE.SoiToPantourgo.name
ltx/en_us_dedes/me.m12.d27:meMA.Ode8C1T.mode	@ltx/en_us_dedes/miscellanea:misc.Mode5
ltx/en_us_dedes/me.m12.d27:meMA.Ode8C1T.ode	@ltx/en_us_dedes/miscellanea:misc.Ode8
ltx/en_us_dedes/me.m12.d27:meMA.Ode8C1T.text	
ltx/en_us_dedes/me.m12.d27:meMA.Ode8C21.greekmelody	@ltx/en_us_dedes/he.h.m4:heHE.CheirasEkpetasasDaniil.greekname
ltx/en_us_dedes/me.m12.d27:meMA.Ode8C21.incipit	…
ltx/en_us_dedes/me.m12.d27:meMA.Ode8C21.melody	@ltx/en_us_dedes/he.h.m4:heHE.CheirasEkpetasasDaniil.name
ltx/en_us_dedes/me.m12.d27:meMA.Ode8C21.mode	@ltx/en_us_dedes/miscellanea:misc.Mode4
ltx/en_us_dedes/me.m12.d27:meMA.Ode8C21.ode	@ltx/en_us_dedes/miscellanea:misc.Ode8
ltx/en_us_dedes/me.m12.d27:meMA.Ode8C21.text	
ltx/en_us_dedes/me.m12.d27:meMA.Ode8C22.incipit	…
ltx/en_us_dedes/me.m12.d27:meMA.Ode8C22.melody	@ltx/en_us_dedes/he.h.m4:heHE.CheirasEkpetasasDaniil.name
ltx/en_us_dedes/me.m12.d27:meMA.Ode8C22.mode	@ltx/en_us_dedes/miscellanea:misc.Mode4
ltx/en_us_dedes/me.m12.d27:meMA.Ode8C22.ode	@ltx/en_us_dedes/miscellanea:misc.Ode8
ltx/en_us_dedes/me.m12.d27:meMA.Ode8C22.text	
ltx/en_us_dedes/me.m12.d27:meMA.Ode8C23.incipit	…
ltx/en_us_dedes/me.m12.d27:meMA.Ode8C23.melody	@ltx/en_us_dedes/he.h.m4:heHE.CheirasEkpetasasDaniil.name
ltx/en_us_dedes/me.m12.d27:meMA.Ode8C23.mode	@ltx/en_us_dedes/miscellanea:misc.Mode4
ltx/en_us_dedes/me.m12.d27:meMA.Ode8C23.ode	@ltx/en_us_dedes/miscellanea:misc.Ode8
ltx/en_us_dedes/me.m12.d27:meMA.Ode8C23.text	
ltx/en_us_dedes/me.m12.d27:meMA.Ode8C2T.incipit	…
ltx/en_us_dedes/me.m12.d27:meMA.Ode8C2T.melody	@ltx/en_us_dedes/he.h.m4:heHE.CheirasEkpetasasDaniil.name
ltx/en_us_dedes/me.m12.d27:meMA.Ode8C2T.mode	@ltx/en_us_dedes/miscellanea:misc.Mode4
ltx/en_us_dedes/me.m12.d27:meMA.Ode8C2T.ode	@ltx/en_us_dedes/miscellanea:misc.Ode8
ltx/en_us_dedes/me.m12.d27:meMA.Ode8C2T.text	
ltx/en_us_dedes/me.m12.d27:meMA.Ode9C11.greekmelody	@ltx/en_us_dedes/he.h.m5:heHE.IsaiaChoreve.greekname
ltx/en_us_dedes/me.m12.d27:meMA.Ode9C11.incipit	…
ltx/en_us_dedes/me.m12.d27:meMA.Ode9C11.melody	@ltx/en_us_dedes/he.h.m5:heHE.IsaiaChoreve.name
ltx/en_us_dedes/me.m12.d27:meMA.Ode9C11.mode	@ltx/en_us_dedes/miscellanea:misc.Mode5
ltx/en_us_dedes/me.m12.d27:meMA.Ode9C11.ode	@ltx/en_us_dedes/miscellanea:misc.Ode9
ltx/en_us_dedes/me.m12.d27:meMA.Ode9C11.text	
ltx/en_us_dedes/me.m12.d27:meMA.Ode9C12.incipit	…
ltx/en_us_dedes/me.m12.d27:meMA.Ode9C12.melody	@ltx/en_us_dedes/he.h.m5:heHE.IsaiaChoreve.name
ltx/en_us_dedes/me.m12.d27:meMA.Ode9C12.mode	@ltx/en_us_dedes/miscellanea:misc.Mode5
ltx/en_us_dedes/me.m12.d27:meMA.Ode9C12.ode	@ltx/en_us_dedes/miscellanea:misc.Ode9
ltx/en_us_dedes/me.m12.d27:meMA.Ode9C12.text	
ltx/en_us_dedes/me.m12.d27:meMA.Ode9C13.incipit	…
ltx/en_us_dedes/me.m12.d27:meMA.Ode9C13.melody	@ltx/en_us_dedes/he.h.m5:heHE.IsaiaChoreve.name
ltx/en_us_dedes/me.m12.d27:meMA.Ode9C13.mode	@ltx/en_us_dedes/miscellanea:misc.Mode5
ltx/en_us_dedes/me.m12.d27:meMA.Ode9C13.ode	@ltx/en_us_dedes/miscellanea:misc.Ode9
ltx/en_us_dedes/me.m12.d27:meMA.Ode9C13.text	
ltx/en_us_dedes/me.m12.d27:meMA.Ode9C1T.incipit	…
ltx/en_us_dedes/me.m12.d27:meMA.Ode9C1T.melody	@ltx/en_us_dedes/he.h.m5:heHE.IsaiaChoreve.name
ltx/en_us_dedes/me.m12.d27:meMA.Ode9C1T.mode	@ltx/en_us_dedes/miscellanea:misc.Mode5
ltx/en_us_dedes/me.m12.d27:meMA.Ode9C1T.ode	@ltx/en_us_dedes/miscellanea:misc.Ode9
ltx/en_us_dedes/me.m12.d27:meMA.Ode9C1T.text	
ltx/en_us_dedes/me.m12.d27:meMA.Ode9C21.greekmelody	@ltx/en_us_dedes/he.h.m4:heHE.LithosAcheirotmitos.greekname
ltx/en_us_dedes/me.m12.d27:meMA.Ode9C21.incipit	…
ltx/en_us_dedes/me.m12.d27:meMA.Ode9C21.melody	@ltx/en_us_dedes/he.h.m4:heHE.LithosAcheirotmitos.name
ltx/en_us_dedes/me.m12.d27:meMA.Ode9C21.mode	@ltx/en_us_dedes/miscellanea:misc.Mode4
ltx/en_us_dedes/me.m12.d27:meMA.Ode9C21.ode	@ltx/en_us_dedes/miscellanea:misc.Ode9
ltx/en_us_dedes/me.m12.d27:meMA.Ode9C21.text	
ltx/en_us_dedes/me.m12.d27:meMA.Ode9C22.incipit	…
ltx/en_us_dedes/me.m12.d27:meMA.Ode9C22.melody	@ltx/en_us_dedes/he.h.m4:heHE.LithosAcheirotmitos.name
ltx/en_us_dedes/me.m12.d27:meMA.Ode9C22.mode	@ltx/en_us_dedes/miscellanea:misc.Mode4
ltx/en_us_dedes/me.m12.d27:meMA.Ode9C22.ode	@ltx/en_us_dedes/miscellanea:misc.Ode9
ltx/en_us_dedes/me.m12.d27:meMA.Ode9C22.text	
ltx/en_us_dedes/me.m12.d27:meMA.Ode9C23.incipit	…
ltx/en_us_dedes/me.m12.d27:meMA.Ode9C23.melody	@ltx/en_us_dedes/he.h.m4:heHE.LithosAcheirotmitos.name
ltx/en_us_dedes/me.m12.d27:meMA.Ode9C23.mode	@ltx/en_us_dedes/miscellanea:misc.Mode4
ltx/en_us_dedes/me.m12.d27:meMA.Ode9C23.ode	@ltx/en_us_dedes/miscellanea:misc.Ode9
ltx/en_us_dedes/me.m12.d27:meMA.Ode9C23.text	
ltx/en_us_dedes/me.m12.d27:meMA.Ode9C2T.incipit	…
ltx/en_us_dedes/me.m12.d27:meMA.Ode9C2T.melody	@ltx/en_us_dedes/he.h.m4:heHE.LithosAcheirotmitos.name
ltx/en_us_dedes/me.m12.d27:meMA.Ode9C2T.mode	@ltx/en_us_dedes/miscellanea:misc.Mode4
ltx/en_us_dedes/me.m12.d27:meMA.Ode9C2T.ode	@ltx/en_us_dedes/miscellanea:misc.Ode9
ltx/en_us_dedes/me.m12.d27:meMA.Ode9C2T.text	
ltx/en_us_dedes/me.m12.d27:meMA.Oikos1.text	Today, together with the Nativity of Christ, the Protomartyr Stephen has shone forth like a bright shining star, flashing and illuminating all the ends of the earth, except that he cast a shadow on the impiety of the Jews, when he reproved them with his words of wisdom. For he debated with them using the Scriptures, and tried to persuade them that Jesus who was born of the Virgin was indeed the Son of God. He exposed their impious crime. And we know him as the holy Protomartyr Stephen.
ltx/en_us_dedes/me.m12.d27:meVE.Apolytikion1.greekmelody	@ltx/en_us_dedes/he.a.m4:heAU.TachyProkatalave.greekname
ltx/en_us_dedes/me.m12.d27:meVE.Apolytikion1.incipit	@ltx/en_us_dedes/me.m08.d02:meVE.Apolytikion1.incipit
ltx/en_us_dedes/me.m12.d27:meVE.Apolytikion1.melody	@ltx/en_us_dedes/he.a.m4:heAU.TachyProkatalave.name
ltx/en_us_dedes/me.m12.d27:meVE.Apolytikion1.mode	@ltx/en_us_dedes/miscellanea:misc.Mode4
ltx/en_us_dedes/me.m12.d27:meVE.Apolytikion1.text	@ltx/en_us_dedes/me.m08.d02:meVE.Apolytikion1.text
ltx/en_us_dedes/me.m12.d27:meVE.Apolytikion2ger.greekmelody	@ltx/en_us_dedes/he.a.m3:heAU.TheiasPisteos.greekname
ltx/en_us_dedes/me.m12.d27:meVE.Apolytikion2ger.incipit	…
ltx/en_us_dedes/me.m12.d27:meVE.Apolytikion2ger.melody	@ltx/en_us_dedes/he.a.m3:heAU.TheiasPisteos.name
ltx/en_us_dedes/me.m12.d27:meVE.Apolytikion2ger.mode	@ltx/en_us_dedes/miscellanea:misc.Mode3
ltx/en_us_dedes/me.m12.d27:meVE.Apolytikion2ger.poet	@ltx/en_us_dedes/poets:po.Gerasimou
ltx/en_us_dedes/me.m12.d27:meVE.Apolytikion2ger.text	
ltx/en_us_dedes/me.m12.d27:meVE.AposBoth.incipit	@ltx/en_us_dedes/me.m12.d25:meVE.LityBoth.incipit
ltx/en_us_dedes/me.m12.d27:meVE.AposBoth.melody	
ltx/en_us_dedes/me.m12.d27:meVE.AposBoth.mode	@ltx/en_us_dedes/miscellanea:misc.Mode6
ltx/en_us_dedes/me.m12.d27:meVE.AposBoth.text	@ltx/en_us_dedes/me.m12.d25:meVE.LityBoth.text
ltx/en_us_dedes/me.m12.d27:meVE.AposGlory.incipit	@ltx/en_us_dedes/me.m08.d02:meVE.SticGlory.incipit
ltx/en_us_dedes/me.m12.d27:meVE.AposGlory.melody	
ltx/en_us_dedes/me.m12.d27:meVE.AposGlory.mode	@ltx/en_us_dedes/miscellanea:misc.Mode6
ltx/en_us_dedes/me.m12.d27:meVE.AposGlory.poet	@ltx/en_us_dedes/poets:po.Anatoliou
ltx/en_us_dedes/me.m12.d27:meVE.AposGlory.text	@ltx/en_us_dedes/me.m08.d02:meVE.SticGlory.text
ltx/en_us_dedes/me.m12.d27:meVE.Aposticha1.greekmelody	@ltx/en_us_dedes/he.a.m1:heAU.TonOuranionTagmaton.greekname
ltx/en_us_dedes/me.m12.d27:meVE.Aposticha1.incipit	The Logos rose from the…
ltx/en_us_dedes/me.m12.d27:meVE.Aposticha1.melody	@ltx/en_us_dedes/he.a.m1:heAU.TonOuranionTagmaton.name
ltx/en_us_dedes/me.m12.d27:meVE.Aposticha1.mode	@ltx/en_us_dedes/miscellanea:misc.Mode1
ltx/en_us_dedes/me.m12.d27:meVE.Aposticha1.text	The Logos rose from the Father before the ages began, * and as the Son is ever * in the bosom of the Father. * Now, though, as an infant, He sits in the arms * of His Mother as on a throne; * and by the Angels and Shepherds and Magi Kings, * He is worshiped. Let us sing His praise.
ltx/en_us_dedes/me.m12.d27:meVE.Aposticha2.incipit	Let us the faithful assemble…
ltx/en_us_dedes/me.m12.d27:meVE.Aposticha2.melody	@ltx/en_us_dedes/he.a.m1:heAU.TonOuranionTagmaton.name
ltx/en_us_dedes/me.m12.d27:meVE.Aposticha2.mode	@ltx/en_us_dedes/miscellanea:misc.Mode1
ltx/en_us_dedes/me.m12.d27:meVE.Aposticha2.text	Let us the faithful assemble and go to Bethlehem. * We see the world’s Creator as a babe in the manger. * And we see the men of Chaldea present * to the Lord threefold precious gifts * fit for a King, fit for God, and fit for the man, * who for three days will be dead for us.
ltx/en_us_dedes/me.m12.d27:meVE.Aposticha3.incipit	Lord, You were born of…
ltx/en_us_dedes/me.m12.d27:meVE.Aposticha3.melody	@ltx/en_us_dedes/he.a.m1:heAU.TonOuranionTagmaton.name
ltx/en_us_dedes/me.m12.d27:meVE.Aposticha3.mode	@ltx/en_us_dedes/miscellanea:misc.Mode1
ltx/en_us_dedes/me.m12.d27:meVE.Aposticha3.text	Lord, You were born of the Virgin inside a humble cave. * The hosts of Angels came down * from the heavens and shouted: * Glory in the highest to You, our God, * who were born in a servant’s form, * and in the womb of the Mother who knew no man * you refashioned the entire world.
ltx/en_us_dedes/me.m12.d27:meVE.GeneralApolytikion2.name	Theodore,
ltx/en_us_dedes/me.m12.d27:meVE.MM.GeneralApolytikion2.text	@ltx/en_us_dedes/properties:media.key
ltx/en_us_dedes/me.m12.d27:meVE.MM.Stichera123as8910.text	@ltx/en_us_dedes/properties:media.key
ltx/en_us_dedes/me.m12.d27:meVE.SticBoth.incipit	@ltx/en_us_dedes/me.m12.d25:meVE.Aposticha1.incipit
ltx/en_us_dedes/me.m12.d27:meVE.SticBoth.melody	
ltx/en_us_dedes/me.m12.d27:meVE.SticBoth.mode	@ltx/en_us_dedes/miscellanea:misc.Mode2
ltx/en_us_dedes/me.m12.d27:meVE.SticBoth.text	@ltx/en_us_dedes/me.m12.d25:meVE.Aposticha1.text
ltx/en_us_dedes/me.m12.d27:meVE.SticGlory.incipit	To the King and Master…
ltx/en_us_dedes/me.m12.d27:meVE.SticGlory.melody	
ltx/en_us_dedes/me.m12.d27:meVE.SticGlory.mode	@ltx/en_us_dedes/miscellanea:misc.Mode2
ltx/en_us_dedes/me.m12.d27:meVE.SticGlory.poet	@ltx/en_us_dedes/poets:po.Anatoliou
ltx/en_us_dedes/me.m12.d27:meVE.SticGlory.text	To the King and Master of all, who was born on earth, Stephen is presented as a splendid crown that is decorated, not with jewels, but with his own blood. Come, you fans of the Martyrs, let us take up songs like pennants, and let us wave them above our heads; and as we sing our hymns, let us say to him: “Your soul was adorned with wisdom and grace, O Protomartyr of Christ God. Pray for us, that we may receive peace and great mercy.”
ltx/en_us_dedes/me.m12.d27:meVE.Stichera01.greekmelody	@ltx/en_us_dedes/he.a.m4:heAU.OsGennaionEnMartysi.greekname
ltx/en_us_dedes/me.m12.d27:meVE.Stichera01.incipit	@ltx/en_us_dedes/me.m08.d02:meVE.Stichera01.incipit
ltx/en_us_dedes/me.m12.d27:meVE.Stichera01.melody	@ltx/en_us_dedes/he.a.m4:heAU.OsGennaionEnMartysi.name
ltx/en_us_dedes/me.m12.d27:meVE.Stichera01.mode	@ltx/en_us_dedes/miscellanea:misc.Mode4
ltx/en_us_dedes/me.m12.d27:meVE.Stichera01.text	@ltx/en_us_dedes/me.m08.d02:meVE.Stichera01.text
ltx/en_us_dedes/me.m12.d27:meVE.Stichera02.incipit	@ltx/en_us_dedes/me.m08.d02:meVE.Stichera02.incipit
ltx/en_us_dedes/me.m12.d27:meVE.Stichera02.melody	@ltx/en_us_dedes/he.a.m4:heAU.OsGennaionEnMartysi.name
ltx/en_us_dedes/me.m12.d27:meVE.Stichera02.mode	@ltx/en_us_dedes/miscellanea:misc.Mode4
ltx/en_us_dedes/me.m12.d27:meVE.Stichera02.text	@ltx/en_us_dedes/me.m08.d02:meVE.Stichera02.text
ltx/en_us_dedes/me.m12.d27:meVE.Stichera03.incipit	@ltx/en_us_dedes/me.m08.d02:meVE.Stichera03.incipit
ltx/en_us_dedes/me.m12.d27:meVE.Stichera03.melody	@ltx/en_us_dedes/he.a.m4:heAU.OsGennaionEnMartysi.name
ltx/en_us_dedes/me.m12.d27:meVE.Stichera03.mode	@ltx/en_us_dedes/miscellanea:misc.Mode4
ltx/en_us_dedes/me.m12.d27:meVE.Stichera03.text	@ltx/en_us_dedes/me.m08.d02:meVE.Stichera03.text
ltx/en_us_dedes/me.m12.d27:meVE.Stichera04.greekmelody	@ltx/en_us_dedes/he.a.m4:heAU.OsGennaionEnMartysi.greekname
ltx/en_us_dedes/me.m12.d27:meVE.Stichera04.incipit	To the wounds of your…
ltx/en_us_dedes/me.m12.d27:meVE.Stichera04.melody	@ltx/en_us_dedes/he.a.m4:heAU.OsGennaionEnMartysi.name
ltx/en_us_dedes/me.m12.d27:meVE.Stichera04.mode	@ltx/en_us_dedes/miscellanea:misc.Mode4
ltx/en_us_dedes/me.m12.d27:meVE.Stichera04.text	To the wounds of your banishment, * wounds of exile were added on, * by the ruthless tyranny of the emperor, * who as a heretic occupied the lawful throne lawlessly; * for he terribly confused * the traditions of our true Faith, * and he had removed * the immaculate icon of the Savior; but by grace divine you shamed him, * O faithful servant of Christ our God.
ltx/en_us_dedes/me.m12.d27:meVE.Stichera05.incipit	Neither guards nor imprisonment, *…
ltx/en_us_dedes/me.m12.d27:meVE.Stichera05.melody	@ltx/en_us_dedes/he.a.m4:heAU.OsGennaionEnMartysi.name
ltx/en_us_dedes/me.m12.d27:meVE.Stichera05.mode	@ltx/en_us_dedes/miscellanea:misc.Mode4
ltx/en_us_dedes/me.m12.d27:meVE.Stichera05.text	Neither guards nor imprisonment, * nor the darkness and solitude, * neither wounds and lashings could separate you from * your ardent love for the Savior Christ, * Confessor Saint Theodore, * nor infection and disease, * that were chronic and hard to bear, * neither lack of food. * But you bore it unflinchingly, foreseeing the rewards for your endurance, * O Saint who uttered the words of God.
ltx/en_us_dedes/me.m12.d27:meVE.Stichera06.incipit	Now in place of affliction…
ltx/en_us_dedes/me.m12.d27:meVE.Stichera06.melody	@ltx/en_us_dedes/he.a.m4:heAU.OsGennaionEnMartysi.name
ltx/en_us_dedes/me.m12.d27:meVE.Stichera06.mode	@ltx/en_us_dedes/miscellanea:misc.Mode4
ltx/en_us_dedes/me.m12.d27:meVE.Stichera06.text	Now in place of affliction, praise, * and enjoyment instead of pain, * and in place of darkness, illuminating light, * has Christ the fair Judge awarded you. * Indeed to reward you for * the inscription on your face, * godly Saint, you have been inscribed * in the Book of Life; * In the Church of the Firstborn you are listed, Father Theodore, in heaven, * and with the Angels you celebrate.
