ltx/en_us_dedes/sy.m10.d15:syMA.commemoration01.couplet1.title	@ltx/en_us_dedes/titles:ti.Verses
ltx/en_us_dedes/sy.m10.d15:syMA.commemoration01.couplet1.verse1	
ltx/en_us_dedes/sy.m10.d15:syMA.commemoration01.couplet1.verse2	
ltx/en_us_dedes/sy.m10.d15:syMA.commemoration01.narration.p01	
ltx/en_us_dedes/sy.m10.d15:syMA.commemoration01.narration.p02	
ltx/en_us_dedes/sy.m10.d15:syMA.commemoration01.single1	
ltx/en_us_dedes/sy.m10.d15:syMA.commemoration01.text	On October 15, we commemorate the holy hieromartyr Lucian, Presbyter of Greater Antioch.
ltx/en_us_dedes/sy.m10.d15:syMA.commemoration02.couplet1.title	@ltx/en_us_dedes/titles:ti.Verses
ltx/en_us_dedes/sy.m10.d15:syMA.commemoration02.couplet1.verse1	
ltx/en_us_dedes/sy.m10.d15:syMA.commemoration02.couplet1.verse2	
ltx/en_us_dedes/sy.m10.d15:syMA.commemoration02.narration.p01	
ltx/en_us_dedes/sy.m10.d15:syMA.commemoration02.text	On this day we commemorate our devout father Sabinus the Bishop.
ltx/en_us_dedes/sy.m10.d15:syMA.commemoration03.couplet1.title	@ltx/en_us_dedes/titles:ti.Verses
ltx/en_us_dedes/sy.m10.d15:syMA.commemoration03.couplet1.verse1	
ltx/en_us_dedes/sy.m10.d15:syMA.commemoration03.couplet1.verse2	
ltx/en_us_dedes/sy.m10.d15:syMA.commemoration03.narration.p01	
ltx/en_us_dedes/sy.m10.d15:syMA.commemoration03.text	On this day we commemorate our devout father Barsus the Confessor, Bishop of Edessa.
ltx/en_us_dedes/sy.m10.d15:syMA.commemoration04.couplet1.title	@ltx/en_us_dedes/titles:ti.Verses
ltx/en_us_dedes/sy.m10.d15:syMA.commemoration04.couplet1.verse1	
ltx/en_us_dedes/sy.m10.d15:syMA.commemoration04.couplet1.verse2	
ltx/en_us_dedes/sy.m10.d15:syMA.commemoration04.narration.p01	
ltx/en_us_dedes/sy.m10.d15:syMA.commemoration04.narration.p02	
ltx/en_us_dedes/sy.m10.d15:syMA.commemoration04.narration.p03	
ltx/en_us_dedes/sy.m10.d15:syMA.commemoration04.text	On this day we remember the contest of a Monk who became a martyr. There is an edifying story about him.
ltx/en_us_dedes/sy.m10.d15:syMA.commemoration05.couplet1.title	@ltx/en_us_dedes/titles:ti.Verses
ltx/en_us_dedes/sy.m10.d15:syMA.commemoration05.couplet1.verse1	
ltx/en_us_dedes/sy.m10.d15:syMA.commemoration05.couplet1.verse2	
ltx/en_us_dedes/sy.m10.d15:syMA.commemoration05.text	We also commemorate our devout and God-bearing father Euthymius the New of Ancyra.
ltx/en_us_dedes/sy.m10.d15:syMA.lastline	By the intercessions of Your Saints, O God, have mercy on us. Amen.
