ltx/en_us_dedes/ty.m01.d15:tyCommemoration.text	
ltx/en_us_dedes/ty.m01.d15:tyDate.text	
ltx/en_us_dedes/ty.m01.d15:tyLI.AfterCommunion.text	
ltx/en_us_dedes/ty.m01.d15:tyLI.AmboPrayer.text	
ltx/en_us_dedes/ty.m01.d15:tyLI.Antiphons.text	
ltx/en_us_dedes/ty.m01.d15:tyLI.Apolytikia.text	
ltx/en_us_dedes/ty.m01.d15:tyLI.CommunionHymn.text	
ltx/en_us_dedes/ty.m01.d15:tyLI.Dismissal.text	
ltx/en_us_dedes/ty.m01.d15:tyLI.EntranceHymn.text	
ltx/en_us_dedes/ty.m01.d15:tyLI.Epistle.text	
ltx/en_us_dedes/ty.m01.d15:tyLI.Gospel.text	
ltx/en_us_dedes/ty.m01.d15:tyLI.Kontakion.text	
ltx/en_us_dedes/ty.m01.d15:tyLI.Megalynarion.text	
ltx/en_us_dedes/ty.m01.d15:tyLI.TheotokosHymn.text	
ltx/en_us_dedes/ty.m01.d15:tyMA.Anavathmoi.text	
ltx/en_us_dedes/ty.m01.d15:tyMA.Apolytikia.text	
ltx/en_us_dedes/ty.m01.d15:tyMA.Canons.text	
ltx/en_us_dedes/ty.m01.d15:tyMA.Doxology.text	
ltx/en_us_dedes/ty.m01.d15:tyMA.EndApolytikion.text	
ltx/en_us_dedes/ty.m01.d15:tyMA.Exaposteilaria.text	
ltx/en_us_dedes/ty.m01.d15:tyMA.Katavasias.text	
ltx/en_us_dedes/ty.m01.d15:tyMA.Kathismata.text	
ltx/en_us_dedes/ty.m01.d15:tyMA.KontakionOikos.text	
ltx/en_us_dedes/ty.m01.d15:tyMA.Lauds.text	
ltx/en_us_dedes/ty.m01.d15:tyMA.LaudsBoth.text	
ltx/en_us_dedes/ty.m01.d15:tyMA.LaudsGlory.text	
ltx/en_us_dedes/ty.m01.d15:tyMA.LaudsVerses.text	
ltx/en_us_dedes/ty.m01.d15:tyMA.Magnificat.text	
ltx/en_us_dedes/ty.m01.d15:tyMA.MatinsGospel.text	
ltx/en_us_dedes/ty.m01.d15:tyMA.MidodeKath.text	
ltx/en_us_dedes/ty.m01.d15:tyMA.MidodeKontakion.text	
ltx/en_us_dedes/ty.m01.d15:tyMA.Ode9_1.text	
ltx/en_us_dedes/ty.m01.d15:tyMA.Ode9_2.text	
ltx/en_us_dedes/ty.m01.d15:tyMA.Ode9_3.text	
ltx/en_us_dedes/ty.m01.d15:tyMA.Ode9_4.text	
ltx/en_us_dedes/ty.m01.d15:tyMA.Ode9_5.text	
ltx/en_us_dedes/ty.m01.d15:tyMA.Ode9_6.text	
ltx/en_us_dedes/ty.m01.d15:tyMA.Ode9_7.text	
ltx/en_us_dedes/ty.m01.d15:tyMA.Ode9_8.text	
ltx/en_us_dedes/ty.m01.d15:tyMA.Ode9_Katavasia1.text	
ltx/en_us_dedes/ty.m01.d15:tyMA.Ode9_Katavasia2.text	
ltx/en_us_dedes/ty.m01.d15:tyMA.ProkVerse.text	
ltx/en_us_dedes/ty.m01.d15:tyMA.Prokeimenon.text	
ltx/en_us_dedes/ty.m01.d15:tyMA.Psalm50.text	
ltx/en_us_dedes/ty.m01.d15:tyMA.Synaxarion.text	
ltx/en_us_dedes/ty.m01.d15:tyMO.Rubric1.text	
ltx/en_us_dedes/ty.m01.d15:tyNote1.text	
ltx/en_us_dedes/ty.m01.d15:tyVE.Apolytikia.text	
ltx/en_us_dedes/ty.m01.d15:tyVE.AposBoth.text	
ltx/en_us_dedes/ty.m01.d15:tyVE.AposGlory.text	
ltx/en_us_dedes/ty.m01.d15:tyVE.AposGloryBoth.text	
ltx/en_us_dedes/ty.m01.d15:tyVE.Aposticha.text	
ltx/en_us_dedes/ty.m01.d15:tyVE.Dismissal.text	
ltx/en_us_dedes/ty.m01.d15:tyVE.Entrance.text	
ltx/en_us_dedes/ty.m01.d15:tyVE.Intro.text	
ltx/en_us_dedes/ty.m01.d15:tyVE.LIHC.text	
ltx/en_us_dedes/ty.m01.d15:tyVE.Note1.text	
ltx/en_us_dedes/ty.m01.d15:tyVE.Note2.text	
ltx/en_us_dedes/ty.m01.d15:tyVE.SticBoth.text	
ltx/en_us_dedes/ty.m01.d15:tyVE.SticGlory.text	
ltx/en_us_dedes/ty.m01.d15:tyVE.SticGloryBoth.text	
ltx/en_us_dedes/ty.m01.d15:tyVE.Stichera.text	
