ltx/en_us_dedes/sy.m04.d18:cl.syMA.commemoration01.text	[saint/com 1]
ltx/en_us_dedes/sy.m04.d18:cl.syMA.commemoration02.text	[saint/com 2]
ltx/en_us_dedes/sy.m04.d18:cl.syMA.commemoration03.text	[saint/com 3]
ltx/en_us_dedes/sy.m04.d18:cl.syMA.commemoration04.text	[saint/com 4]
ltx/en_us_dedes/sy.m04.d18:cl.syMA.commemoration05.text	[saint/com 5]
ltx/en_us_dedes/sy.m04.d18:cl.syMA.commemoration06.text	[saint/com list]
ltx/en_us_dedes/sy.m04.d18:syMA.commemoration01.couplet1.title	@ltx/en_us_dedes/titles:ti.Verses
ltx/en_us_dedes/sy.m04.d18:syMA.commemoration01.couplet1.verse1	
ltx/en_us_dedes/sy.m04.d18:syMA.commemoration01.couplet1.verse2	
ltx/en_us_dedes/sy.m04.d18:syMA.commemoration01.narration.p01	
ltx/en_us_dedes/sy.m04.d18:syMA.commemoration01.single1	
ltx/en_us_dedes/sy.m04.d18:syMA.commemoration01.text	On April 18, we commemorate our devout father John, the disciple of Saint Gregory of Decapolis.
ltx/en_us_dedes/sy.m04.d18:syMA.commemoration02.couplet1.title	@ltx/en_us_dedes/titles:ti.Verses
ltx/en_us_dedes/sy.m04.d18:syMA.commemoration02.couplet1.verse1	
ltx/en_us_dedes/sy.m04.d18:syMA.commemoration02.couplet1.verse2	
ltx/en_us_dedes/sy.m04.d18:syMA.commemoration02.narration.p01	
ltx/en_us_dedes/sy.m04.d18:syMA.commemoration02.text	On this day we also commemorate the holy Martyr Savvas the Commander.
ltx/en_us_dedes/sy.m04.d18:syMA.commemoration03.couplet1.title	@ltx/en_us_dedes/titles:ti.Verses
ltx/en_us_dedes/sy.m04.d18:syMA.commemoration03.couplet1.verse1	
ltx/en_us_dedes/sy.m04.d18:syMA.commemoration03.couplet1.verse2	
ltx/en_us_dedes/sy.m04.d18:syMA.commemoration03.narration.p01	
ltx/en_us_dedes/sy.m04.d18:syMA.commemoration03.text	On this day we also commemorate our father among the saints Cosmas, Bishop of Chalcedon.
ltx/en_us_dedes/sy.m04.d18:syMA.commemoration04.couplet1.title	@ltx/en_us_dedes/titles:ti.Verses
ltx/en_us_dedes/sy.m04.d18:syMA.commemoration04.couplet1.verse1	
ltx/en_us_dedes/sy.m04.d18:syMA.commemoration04.couplet1.verse2	
ltx/en_us_dedes/sy.m04.d18:syMA.commemoration04.narration.p01	
ltx/en_us_dedes/sy.m04.d18:syMA.commemoration04.narration.p02	
ltx/en_us_dedes/sy.m04.d18:syMA.commemoration04.narration.p03	
ltx/en_us_dedes/sy.m04.d18:syMA.commemoration04.narration.p04	
ltx/en_us_dedes/sy.m04.d18:syMA.commemoration04.text	On this day we also commemorate our devout mother Athanasia.
ltx/en_us_dedes/sy.m04.d18:syMA.commemoration05.couplet1.title	@ltx/en_us_dedes/titles:ti.Verses
ltx/en_us_dedes/sy.m04.d18:syMA.commemoration05.couplet1.verse1	
ltx/en_us_dedes/sy.m04.d18:syMA.commemoration05.couplet1.verse2	
ltx/en_us_dedes/sy.m04.d18:syMA.commemoration05.text	On this day we also commemorate the holy Neo-martyr John from Ioannina, who witnessed in the 1526.
ltx/en_us_dedes/sy.m04.d18:syMA.lastline	By the intercessions of Your saints, O Christ God, have mercy on us. Amen.
