ltx/en_us_dedes/me.m10.d06:meDA.commemoration.first	Memory of the holy Apostle Thomas
ltx/en_us_dedes/me.m10.d06:meDA.commemoration.first_name	St. Thomas
ltx/en_us_dedes/me.m10.d06:meDA.commemoration.first_short	Memory of the holy Apostle Thomas
ltx/en_us_dedes/me.m10.d06:meDA.commemoration.first_title	@ltx/en_us_dedes/titles:ti.Apostle
ltx/en_us_dedes/me.m10.d06:meDA.commemoration.full	Memory of the Holy and Glorious Apostle Thomas
ltx/en_us_dedes/me.m10.d06:meDA.commemoration.second_name	
ltx/en_us_dedes/me.m10.d06:meDA.commemoration.second_title	
ltx/en_us_dedes/me.m10.d06:meDA.date	October 6
ltx/en_us_dedes/me.m10.d06:meDA.fordate	for October 6
ltx/en_us_dedes/me.m10.d06:meDA.insert1	the holy and glorious Apostle Thomas,
ltx/en_us_dedes/me.m10.d06:meDA.insert2	whose memory we observe,
ltx/en_us_dedes/me.m10.d06:meDA.note	
ltx/en_us_dedes/me.m10.d06:meDA.pdfcoverdate	October 6,
ltx/en_us_dedes/me.m10.d06:meDA.pdfheaderdate	October 6
ltx/en_us_dedes/me.m10.d06:meHO.commemorations	
ltx/en_us_dedes/me.m10.d06:meHO.note1	
ltx/en_us_dedes/me.m10.d06:meHO.note2	
ltx/en_us_dedes/me.m10.d06:meHO.number	
ltx/en_us_dedes/me.m10.d06:meHO.rank	
ltx/en_us_dedes/me.m10.d06:meLE.commemoration1	The Holy and Glorious Apostle Thomas.
ltx/en_us_dedes/me.m10.d06:meLE.commemoration2	
ltx/en_us_dedes/me.m10.d06:meLI.Kontakion1.greekmelody	@ltx/en_us_dedes/me.m10.d06:meMA.Kontakion1.greekmelody
ltx/en_us_dedes/me.m10.d06:meLI.Kontakion1.incipit	@ltx/en_us_dedes/me.m10.d06:meMA.Kontakion1.incipit
ltx/en_us_dedes/me.m10.d06:meLI.Kontakion1.melody	@ltx/en_us_dedes/me.m10.d06:meMA.Kontakion1.melody
ltx/en_us_dedes/me.m10.d06:meLI.Kontakion1.mode	@ltx/en_us_dedes/me.m10.d06:meMA.Kontakion1.mode
ltx/en_us_dedes/me.m10.d06:meLI.Kontakion1.text	@ltx/en_us_dedes/me.m10.d06:meMA.Kontakion1.text
ltx/en_us_dedes/me.m10.d06:meLI.Megalynarion.text	
ltx/en_us_dedes/me.m10.d06:meMA.C1.acrostic.notice1	
ltx/en_us_dedes/me.m10.d06:meMA.C1.acrostic.text	
ltx/en_us_dedes/me.m10.d06:meMA.C1.acrostic.title	
ltx/en_us_dedes/me.m10.d06:meMA.C1.poet	@ltx/en_us_dedes/poets:po.Theofanous
ltx/en_us_dedes/me.m10.d06:meMA.C1.title	@ltx/en_us_dedes/titles:ti.CanonApostle
ltx/en_us_dedes/me.m10.d06:meMA.C1.verse	@ltx/en_us_dedes/prayers:pr.verse_Apostle.text
ltx/en_us_dedes/me.m10.d06:meMA.ExapTheotokion.incipit	All-blameless Mother of our God…
ltx/en_us_dedes/me.m10.d06:meMA.ExapTheotokion.melody	@ltx/en_us_dedes/he.a.m2:heAU.GynaikesAkoutisthite.name
ltx/en_us_dedes/me.m10.d06:meMA.ExapTheotokion.mode	@ltx/en_us_dedes/miscellanea:misc.Mode2
ltx/en_us_dedes/me.m10.d06:meMA.ExapTheotokion.text	All-blameless Mother of our God, * you are the great resounding boast * of the Apostles and Martyrs, * of the Devout and the Prophets. * Propitiate your Son and Lord * that He be gracious unto us * your servants, O Theotokos, * when He will sit to pass judgment * on each of us as we merit.
ltx/en_us_dedes/me.m10.d06:meMA.Exaposteilarion1.greekmelody	@ltx/en_us_dedes/he.a.m2:heAU.GynaikesAkoutisthite.greekname
ltx/en_us_dedes/me.m10.d06:meMA.Exaposteilarion1.incipit	Eyewitness and Apostle of *…
ltx/en_us_dedes/me.m10.d06:meMA.Exaposteilarion1.melody	@ltx/en_us_dedes/he.a.m2:heAU.GynaikesAkoutisthite.name
ltx/en_us_dedes/me.m10.d06:meMA.Exaposteilarion1.mode	@ltx/en_us_dedes/miscellanea:misc.Mode2
ltx/en_us_dedes/me.m10.d06:meMA.Exaposteilarion1.text	Eyewitness and Apostle of * the tender-loving Christ our God, * grant peace to civilization * and victories over enemies * to Christian leaders everywhere, * and pray for our salvation and * forgiveness of our trespasses, * as we extol you, O Thomas, * Disciple and theologian.
ltx/en_us_dedes/me.m10.d06:meMA.Exaposteilarion2.greekmelody	@ltx/en_us_dedes/he.a.m2:heAU.GynaikesAkoutisthite.greekname
ltx/en_us_dedes/me.m10.d06:meMA.Exaposteilarion2.incipit	…
ltx/en_us_dedes/me.m10.d06:meMA.Exaposteilarion2.melody	@ltx/en_us_dedes/he.a.m2:heAU.GynaikesAkoutisthite.name
ltx/en_us_dedes/me.m10.d06:meMA.Exaposteilarion2.mode	@ltx/en_us_dedes/miscellanea:misc.Mode2
ltx/en_us_dedes/me.m10.d06:meMA.Exaposteilarion2.text	
ltx/en_us_dedes/me.m10.d06:meMA.Kathisma21.greekmelody	@ltx/en_us_dedes/he.a.m5:heAU.TonSynanarchonLogon.greekname
ltx/en_us_dedes/me.m10.d06:meMA.Kathisma21.incipit	…
ltx/en_us_dedes/me.m10.d06:meMA.Kathisma21.melody	@ltx/en_us_dedes/he.a.m5:heAU.TonSynanarchonLogon.name
ltx/en_us_dedes/me.m10.d06:meMA.Kathisma21.mode	@ltx/en_us_dedes/miscellanea:misc.Mode5
ltx/en_us_dedes/me.m10.d06:meMA.Kathisma21.text	
ltx/en_us_dedes/me.m10.d06:meMA.Kathisma2T.incipit	…
ltx/en_us_dedes/me.m10.d06:meMA.Kathisma2T.melody	@ltx/en_us_dedes/he.a.m5:heAU.TonSynanarchonLogon.name
ltx/en_us_dedes/me.m10.d06:meMA.Kathisma2T.mode	@ltx/en_us_dedes/miscellanea:misc.Mode5
ltx/en_us_dedes/me.m10.d06:meMA.Kathisma2T.text	
ltx/en_us_dedes/me.m10.d06:meMA.Kontakion1.greekmelody	@ltx/en_us_dedes/he.a.m4:heAU.EpefanisSimeron.greekname
ltx/en_us_dedes/me.m10.d06:meMA.Kontakion1.incipit	…
ltx/en_us_dedes/me.m10.d06:meMA.Kontakion1.melody	@ltx/en_us_dedes/he.a.m4:heAU.EpefanisSimeron.name
ltx/en_us_dedes/me.m10.d06:meMA.Kontakion1.mode	@ltx/en_us_dedes/miscellanea:misc.Mode4
ltx/en_us_dedes/me.m10.d06:meMA.Kontakion1.text	
ltx/en_us_dedes/me.m10.d06:meMA.Lauds1.incipit	You followed Christ, O Apostle…
ltx/en_us_dedes/me.m10.d06:meMA.Lauds1.melody	
ltx/en_us_dedes/me.m10.d06:meMA.Lauds1.mode	@ltx/en_us_dedes/miscellanea:misc.Mode2
ltx/en_us_dedes/me.m10.d06:meMA.Lauds1.poet	@ltx/en_us_dedes/poets:po.Anatoliou
ltx/en_us_dedes/me.m10.d06:meMA.Lauds1.text	You followed Christ, O Apostle Thomas, and you disregarded the world; you hid His teachings in your inner room, and you became an Apostle. Then you went among the Gentiles, whose souls were darkened by error and the sinful passions, and with the Savior’s commandments you enlightened them, to believe in the consubstantial Trinity.
ltx/en_us_dedes/me.m10.d06:meMA.Lauds2.incipit	Fully illumined by the divine…
ltx/en_us_dedes/me.m10.d06:meMA.Lauds2.melody	
ltx/en_us_dedes/me.m10.d06:meMA.Lauds2.mode	@ltx/en_us_dedes/miscellanea:misc.Mode4
ltx/en_us_dedes/me.m10.d06:meMA.Lauds2.text	Fully illumined by the divine fire of the knowledge of God, you imitated the Master in all things, as a lawful disciple, O Apostle Thomas. Using the fishing rod of the Cross, you pulled the souls of the pious out of the deep sea of ignorance. And with the fishing net of the Holy Spirit, you caught the minds of those in India that were in darkness. We pray you ever implore Christ God, also to deliver us from the bedarkened face of the enemy, and to save our souls.
ltx/en_us_dedes/me.m10.d06:meMA.Lauds3.incipit	You abandoned fishing in the…
ltx/en_us_dedes/me.m10.d06:meMA.Lauds3.melody	
ltx/en_us_dedes/me.m10.d06:meMA.Lauds3.mode	@ltx/en_us_dedes/miscellanea:misc.Mode4
ltx/en_us_dedes/me.m10.d06:meMA.Lauds3.text	You abandoned fishing in the sea, and instead by faith you took up the fishing rod of the Cross, and you used it to catch everyone, O Apostle Thomas. Therefore you were counted worthy to touch the immaculate side of the Logos with your hand, and to examine with your finger the wounds of the nails that had pierced Him. We pray you ever earnestly intercede with Christ God to save our souls.
ltx/en_us_dedes/me.m10.d06:meMA.LaudsGlory.incipit	@ltx/en_us_dedes/me.m10.d06:meVE.AposGlory.incipit
ltx/en_us_dedes/me.m10.d06:meMA.LaudsGlory.melody	
ltx/en_us_dedes/me.m10.d06:meMA.LaudsGlory.mode	@ltx/en_us_dedes/miscellanea:misc.Mode6
ltx/en_us_dedes/me.m10.d06:meMA.LaudsGlory.text	@ltx/en_us_dedes/me.m10.d06:meVE.AposGlory.text
ltx/en_us_dedes/me.m10.d06:meMA.LaudsTheotokion.incipit	@ltx/en_us_dedes/he.o:heOT.TheotokeSyEi.incipit
ltx/en_us_dedes/me.m10.d06:meMA.LaudsTheotokion.melody	@ltx/en_us_dedes/he.o:heOT.TheotokeSyEi.name
ltx/en_us_dedes/me.m10.d06:meMA.LaudsTheotokion.mode	@ltx/en_us_dedes/miscellanea:misc.Mode6
ltx/en_us_dedes/me.m10.d06:meMA.LaudsTheotokion.text	@ltx/en_us_dedes/he.o:heOT.TheotokeSyEiApostolou.text
ltx/en_us_dedes/me.m10.d06:meMA.MM.Lauds1123as5678.text	@ltx/en_us_dedes/properties:media.key
ltx/en_us_dedes/me.m10.d06:meMA.Ode1C11.greekmelody	@ltx/en_us_dedes/he.h.m4:heHE.TristatasKrataious.greekname
ltx/en_us_dedes/me.m10.d06:meMA.Ode1C11.incipit	…
ltx/en_us_dedes/me.m10.d06:meMA.Ode1C11.melody	@ltx/en_us_dedes/he.h.m4:heHE.TristatasKrataious.name
ltx/en_us_dedes/me.m10.d06:meMA.Ode1C11.mode	@ltx/en_us_dedes/miscellanea:misc.Mode4
ltx/en_us_dedes/me.m10.d06:meMA.Ode1C11.ode	@ltx/en_us_dedes/miscellanea:misc.Ode1
ltx/en_us_dedes/me.m10.d06:meMA.Ode1C11.text	
ltx/en_us_dedes/me.m10.d06:meMA.Ode1C12.incipit	…
ltx/en_us_dedes/me.m10.d06:meMA.Ode1C12.melody	@ltx/en_us_dedes/he.h.m4:heHE.TristatasKrataious.name
ltx/en_us_dedes/me.m10.d06:meMA.Ode1C12.mode	@ltx/en_us_dedes/miscellanea:misc.Mode4
ltx/en_us_dedes/me.m10.d06:meMA.Ode1C12.ode	@ltx/en_us_dedes/miscellanea:misc.Ode1
ltx/en_us_dedes/me.m10.d06:meMA.Ode1C12.text	
ltx/en_us_dedes/me.m10.d06:meMA.Ode1C13.incipit	…
ltx/en_us_dedes/me.m10.d06:meMA.Ode1C13.melody	@ltx/en_us_dedes/he.h.m4:heHE.TristatasKrataious.name
ltx/en_us_dedes/me.m10.d06:meMA.Ode1C13.mode	@ltx/en_us_dedes/miscellanea:misc.Mode4
ltx/en_us_dedes/me.m10.d06:meMA.Ode1C13.ode	@ltx/en_us_dedes/miscellanea:misc.Ode1
ltx/en_us_dedes/me.m10.d06:meMA.Ode1C13.text	
ltx/en_us_dedes/me.m10.d06:meMA.Ode1C1T.incipit	…
ltx/en_us_dedes/me.m10.d06:meMA.Ode1C1T.melody	@ltx/en_us_dedes/he.h.m4:heHE.TristatasKrataious.name
ltx/en_us_dedes/me.m10.d06:meMA.Ode1C1T.mode	@ltx/en_us_dedes/miscellanea:misc.Mode4
ltx/en_us_dedes/me.m10.d06:meMA.Ode1C1T.ode	@ltx/en_us_dedes/miscellanea:misc.Ode1
ltx/en_us_dedes/me.m10.d06:meMA.Ode1C1T.text	
ltx/en_us_dedes/me.m10.d06:meMA.Ode3C11.greekmelody	@ltx/en_us_dedes/he.h.m4:heHE.OukEnSofia.greekname
ltx/en_us_dedes/me.m10.d06:meMA.Ode3C11.incipit	…
ltx/en_us_dedes/me.m10.d06:meMA.Ode3C11.melody	@ltx/en_us_dedes/he.h.m4:heHE.OukEnSofia.name
ltx/en_us_dedes/me.m10.d06:meMA.Ode3C11.mode	@ltx/en_us_dedes/miscellanea:misc.Mode4
ltx/en_us_dedes/me.m10.d06:meMA.Ode3C11.ode	@ltx/en_us_dedes/miscellanea:misc.Ode3
ltx/en_us_dedes/me.m10.d06:meMA.Ode3C11.text	
ltx/en_us_dedes/me.m10.d06:meMA.Ode3C12.incipit	…
ltx/en_us_dedes/me.m10.d06:meMA.Ode3C12.melody	@ltx/en_us_dedes/he.h.m4:heHE.OukEnSofia.name
ltx/en_us_dedes/me.m10.d06:meMA.Ode3C12.mode	@ltx/en_us_dedes/miscellanea:misc.Mode4
ltx/en_us_dedes/me.m10.d06:meMA.Ode3C12.ode	@ltx/en_us_dedes/miscellanea:misc.Ode3
ltx/en_us_dedes/me.m10.d06:meMA.Ode3C12.text	
ltx/en_us_dedes/me.m10.d06:meMA.Ode3C13.incipit	…
ltx/en_us_dedes/me.m10.d06:meMA.Ode3C13.melody	@ltx/en_us_dedes/he.h.m4:heHE.OukEnSofia.name
ltx/en_us_dedes/me.m10.d06:meMA.Ode3C13.mode	@ltx/en_us_dedes/miscellanea:misc.Mode4
ltx/en_us_dedes/me.m10.d06:meMA.Ode3C13.ode	@ltx/en_us_dedes/miscellanea:misc.Ode3
ltx/en_us_dedes/me.m10.d06:meMA.Ode3C13.text	
ltx/en_us_dedes/me.m10.d06:meMA.Ode3C1T.incipit	…
ltx/en_us_dedes/me.m10.d06:meMA.Ode3C1T.melody	@ltx/en_us_dedes/he.h.m4:heHE.OukEnSofia.name
ltx/en_us_dedes/me.m10.d06:meMA.Ode3C1T.mode	@ltx/en_us_dedes/miscellanea:misc.Mode4
ltx/en_us_dedes/me.m10.d06:meMA.Ode3C1T.ode	@ltx/en_us_dedes/miscellanea:misc.Ode3
ltx/en_us_dedes/me.m10.d06:meMA.Ode3C1T.text	
ltx/en_us_dedes/me.m10.d06:meMA.Ode3H.greekmelody	@ltx/en_us_dedes/he.h.m4:heHE.OukEnSofia.greekname
ltx/en_us_dedes/me.m10.d06:meMA.Ode3H.incipit	@ltx/en_us_dedes/he.h.m4:heHE.OukEnSofia.incipit
ltx/en_us_dedes/me.m10.d06:meMA.Ode3H.melody	@ltx/en_us_dedes/he.h.m4:heHE.OukEnSofia.melody
ltx/en_us_dedes/me.m10.d06:meMA.Ode3H.mode	@ltx/en_us_dedes/miscellanea:misc.Mode4
ltx/en_us_dedes/me.m10.d06:meMA.Ode3H.ode	@ltx/en_us_dedes/miscellanea:misc.Ode3
ltx/en_us_dedes/me.m10.d06:meMA.Ode3H.text	@ltx/en_us_dedes/he.h.m4:heHE.OukEnSofia.text
ltx/en_us_dedes/me.m10.d06:meMA.Ode3Kathisma1.greekmelody	@ltx/en_us_dedes/he.a.m8:heAU.TinSofianKaiLogon.greekname
ltx/en_us_dedes/me.m10.d06:meMA.Ode3Kathisma1.incipit	…
ltx/en_us_dedes/me.m10.d06:meMA.Ode3Kathisma1.melody	@ltx/en_us_dedes/he.a.m8:heAU.TinSofianKaiLogon.name
ltx/en_us_dedes/me.m10.d06:meMA.Ode3Kathisma1.mode	@ltx/en_us_dedes/miscellanea:misc.Mode8
ltx/en_us_dedes/me.m10.d06:meMA.Ode3Kathisma1.text	
ltx/en_us_dedes/me.m10.d06:meMA.Ode3KathismaT.incipit	Let us sing hymns in…
ltx/en_us_dedes/me.m10.d06:meMA.Ode3KathismaT.melody	@ltx/en_us_dedes/he.a.m8:heAU.TinSofianKaiLogon.name
ltx/en_us_dedes/me.m10.d06:meMA.Ode3KathismaT.mode	@ltx/en_us_dedes/miscellanea:misc.Mode8
ltx/en_us_dedes/me.m10.d06:meMA.Ode3KathismaT.text	Let us sing hymns in praise of the holy ark * and the heavenly gate and the shining cloud, * the all-holy mountain and the bush that was not consumed, * the rational Paradise, and the redemption of Eve, * the magnificent treasure of the entire universe. * For in her and through her for the world was salvation * accomplished and forgiveness of its ancient transgressions. * Let us therefore cry out to her, * “Intercede with your Son and our God * that remission of offenses be bestowed * on those who piously worship the all-holy Child you bore.”
ltx/en_us_dedes/me.m10.d06:meMA.Ode4C11.greekmelody	@ltx/en_us_dedes/he.h.m4:heHE.OKathimenosEnDoxi.greekname
ltx/en_us_dedes/me.m10.d06:meMA.Ode4C11.incipit	…
ltx/en_us_dedes/me.m10.d06:meMA.Ode4C11.melody	@ltx/en_us_dedes/he.h.m4:heHE.OKathimenosEnDoxi.name
ltx/en_us_dedes/me.m10.d06:meMA.Ode4C11.mode	@ltx/en_us_dedes/miscellanea:misc.Mode4
ltx/en_us_dedes/me.m10.d06:meMA.Ode4C11.ode	@ltx/en_us_dedes/miscellanea:misc.Ode4
ltx/en_us_dedes/me.m10.d06:meMA.Ode4C11.text	
ltx/en_us_dedes/me.m10.d06:meMA.Ode4C12.incipit	…
ltx/en_us_dedes/me.m10.d06:meMA.Ode4C12.melody	@ltx/en_us_dedes/he.h.m4:heHE.OKathimenosEnDoxi.name
ltx/en_us_dedes/me.m10.d06:meMA.Ode4C12.mode	@ltx/en_us_dedes/miscellanea:misc.Mode4
ltx/en_us_dedes/me.m10.d06:meMA.Ode4C12.ode	@ltx/en_us_dedes/miscellanea:misc.Ode4
ltx/en_us_dedes/me.m10.d06:meMA.Ode4C12.text	
ltx/en_us_dedes/me.m10.d06:meMA.Ode4C13.incipit	…
ltx/en_us_dedes/me.m10.d06:meMA.Ode4C13.melody	@ltx/en_us_dedes/he.h.m4:heHE.OKathimenosEnDoxi.name
ltx/en_us_dedes/me.m10.d06:meMA.Ode4C13.mode	@ltx/en_us_dedes/miscellanea:misc.Mode4
ltx/en_us_dedes/me.m10.d06:meMA.Ode4C13.ode	@ltx/en_us_dedes/miscellanea:misc.Ode4
ltx/en_us_dedes/me.m10.d06:meMA.Ode4C13.text	
ltx/en_us_dedes/me.m10.d06:meMA.Ode4C1T.incipit	…
ltx/en_us_dedes/me.m10.d06:meMA.Ode4C1T.melody	@ltx/en_us_dedes/he.h.m4:heHE.OKathimenosEnDoxi.name
ltx/en_us_dedes/me.m10.d06:meMA.Ode4C1T.mode	@ltx/en_us_dedes/miscellanea:misc.Mode4
ltx/en_us_dedes/me.m10.d06:meMA.Ode4C1T.ode	@ltx/en_us_dedes/miscellanea:misc.Ode4
ltx/en_us_dedes/me.m10.d06:meMA.Ode4C1T.text	
ltx/en_us_dedes/me.m10.d06:meMA.Ode5C11.greekmelody	@ltx/en_us_dedes/he.h.m4:heHE.AseveisOukOpsontai.greekname
ltx/en_us_dedes/me.m10.d06:meMA.Ode5C11.incipit	…
ltx/en_us_dedes/me.m10.d06:meMA.Ode5C11.melody	@ltx/en_us_dedes/he.h.m4:heHE.AseveisOukOpsontai.name
ltx/en_us_dedes/me.m10.d06:meMA.Ode5C11.mode	@ltx/en_us_dedes/miscellanea:misc.Mode4
ltx/en_us_dedes/me.m10.d06:meMA.Ode5C11.ode	@ltx/en_us_dedes/miscellanea:misc.Ode5
ltx/en_us_dedes/me.m10.d06:meMA.Ode5C11.text	
ltx/en_us_dedes/me.m10.d06:meMA.Ode5C12.incipit	…
ltx/en_us_dedes/me.m10.d06:meMA.Ode5C12.melody	@ltx/en_us_dedes/he.h.m4:heHE.AseveisOukOpsontai.name
ltx/en_us_dedes/me.m10.d06:meMA.Ode5C12.mode	@ltx/en_us_dedes/miscellanea:misc.Mode4
ltx/en_us_dedes/me.m10.d06:meMA.Ode5C12.ode	@ltx/en_us_dedes/miscellanea:misc.Ode5
ltx/en_us_dedes/me.m10.d06:meMA.Ode5C12.text	
ltx/en_us_dedes/me.m10.d06:meMA.Ode5C13.incipit	…
ltx/en_us_dedes/me.m10.d06:meMA.Ode5C13.melody	@ltx/en_us_dedes/he.h.m4:heHE.AseveisOukOpsontai.name
ltx/en_us_dedes/me.m10.d06:meMA.Ode5C13.mode	@ltx/en_us_dedes/miscellanea:misc.Mode4
ltx/en_us_dedes/me.m10.d06:meMA.Ode5C13.ode	@ltx/en_us_dedes/miscellanea:misc.Ode5
ltx/en_us_dedes/me.m10.d06:meMA.Ode5C13.text	
ltx/en_us_dedes/me.m10.d06:meMA.Ode5C1T.incipit	…
ltx/en_us_dedes/me.m10.d06:meMA.Ode5C1T.melody	@ltx/en_us_dedes/he.h.m4:heHE.AseveisOukOpsontai.name
ltx/en_us_dedes/me.m10.d06:meMA.Ode5C1T.mode	@ltx/en_us_dedes/miscellanea:misc.Mode4
ltx/en_us_dedes/me.m10.d06:meMA.Ode5C1T.ode	@ltx/en_us_dedes/miscellanea:misc.Ode5
ltx/en_us_dedes/me.m10.d06:meMA.Ode5C1T.text	
ltx/en_us_dedes/me.m10.d06:meMA.Ode6C11.greekmelody	@ltx/en_us_dedes/he.h.m4:heHE.ThysoSoiMetaFonis.greekname
ltx/en_us_dedes/me.m10.d06:meMA.Ode6C11.incipit	…
ltx/en_us_dedes/me.m10.d06:meMA.Ode6C11.melody	@ltx/en_us_dedes/he.h.m4:heHE.ThysoSoiMetaFonis.name
ltx/en_us_dedes/me.m10.d06:meMA.Ode6C11.mode	@ltx/en_us_dedes/miscellanea:misc.Mode4
ltx/en_us_dedes/me.m10.d06:meMA.Ode6C11.ode	@ltx/en_us_dedes/miscellanea:misc.Ode6
ltx/en_us_dedes/me.m10.d06:meMA.Ode6C11.text	
ltx/en_us_dedes/me.m10.d06:meMA.Ode6C12.incipit	…
ltx/en_us_dedes/me.m10.d06:meMA.Ode6C12.melody	@ltx/en_us_dedes/he.h.m4:heHE.ThysoSoiMetaFonis.name
ltx/en_us_dedes/me.m10.d06:meMA.Ode6C12.mode	@ltx/en_us_dedes/miscellanea:misc.Mode4
ltx/en_us_dedes/me.m10.d06:meMA.Ode6C12.ode	@ltx/en_us_dedes/miscellanea:misc.Ode6
ltx/en_us_dedes/me.m10.d06:meMA.Ode6C12.text	
ltx/en_us_dedes/me.m10.d06:meMA.Ode6C13.incipit	…
ltx/en_us_dedes/me.m10.d06:meMA.Ode6C13.melody	@ltx/en_us_dedes/he.h.m4:heHE.ThysoSoiMetaFonis.name
ltx/en_us_dedes/me.m10.d06:meMA.Ode6C13.mode	@ltx/en_us_dedes/miscellanea:misc.Mode4
ltx/en_us_dedes/me.m10.d06:meMA.Ode6C13.ode	@ltx/en_us_dedes/miscellanea:misc.Ode6
ltx/en_us_dedes/me.m10.d06:meMA.Ode6C13.text	
ltx/en_us_dedes/me.m10.d06:meMA.Ode6C1T.incipit	…
ltx/en_us_dedes/me.m10.d06:meMA.Ode6C1T.melody	@ltx/en_us_dedes/he.h.m4:heHE.ThysoSoiMetaFonis.name
ltx/en_us_dedes/me.m10.d06:meMA.Ode6C1T.mode	@ltx/en_us_dedes/miscellanea:misc.Mode4
ltx/en_us_dedes/me.m10.d06:meMA.Ode6C1T.ode	@ltx/en_us_dedes/miscellanea:misc.Ode6
ltx/en_us_dedes/me.m10.d06:meMA.Ode6C1T.text	
ltx/en_us_dedes/me.m10.d06:meMA.Ode6H.greekmelody	@ltx/en_us_dedes/he.h.m4:heHE.ThysoSoiMetaFonis.greekname
ltx/en_us_dedes/me.m10.d06:meMA.Ode6H.incipit	@ltx/en_us_dedes/he.h.m4:heHE.ThysoSoiMetaFonis.incipit
ltx/en_us_dedes/me.m10.d06:meMA.Ode6H.melody	@ltx/en_us_dedes/he.h.m4:heHE.ThysoSoiMetaFonis.melody
ltx/en_us_dedes/me.m10.d06:meMA.Ode6H.mode	@ltx/en_us_dedes/miscellanea:misc.Mode4
ltx/en_us_dedes/me.m10.d06:meMA.Ode6H.ode	@ltx/en_us_dedes/miscellanea:misc.Ode6
ltx/en_us_dedes/me.m10.d06:meMA.Ode6H.text	@ltx/en_us_dedes/he.h.m4:heHE.ThysoSoiMetaFonis.text
ltx/en_us_dedes/me.m10.d06:meMA.Ode7C11.greekmelody	@ltx/en_us_dedes/he.h.m4:heHE.EnTiKaminoAvramiaioi.greekname
ltx/en_us_dedes/me.m10.d06:meMA.Ode7C11.incipit	…
ltx/en_us_dedes/me.m10.d06:meMA.Ode7C11.melody	@ltx/en_us_dedes/he.h.m4:heHE.EnTiKaminoAvramiaioi.name
ltx/en_us_dedes/me.m10.d06:meMA.Ode7C11.mode	@ltx/en_us_dedes/miscellanea:misc.Mode4
ltx/en_us_dedes/me.m10.d06:meMA.Ode7C11.ode	@ltx/en_us_dedes/miscellanea:misc.Ode7
ltx/en_us_dedes/me.m10.d06:meMA.Ode7C11.text	
ltx/en_us_dedes/me.m10.d06:meMA.Ode7C12.incipit	…
ltx/en_us_dedes/me.m10.d06:meMA.Ode7C12.melody	@ltx/en_us_dedes/he.h.m4:heHE.EnTiKaminoAvramiaioi.name
ltx/en_us_dedes/me.m10.d06:meMA.Ode7C12.mode	@ltx/en_us_dedes/miscellanea:misc.Mode4
ltx/en_us_dedes/me.m10.d06:meMA.Ode7C12.ode	@ltx/en_us_dedes/miscellanea:misc.Ode7
ltx/en_us_dedes/me.m10.d06:meMA.Ode7C12.text	
ltx/en_us_dedes/me.m10.d06:meMA.Ode7C13.incipit	…
ltx/en_us_dedes/me.m10.d06:meMA.Ode7C13.melody	@ltx/en_us_dedes/he.h.m4:heHE.EnTiKaminoAvramiaioi.name
ltx/en_us_dedes/me.m10.d06:meMA.Ode7C13.mode	@ltx/en_us_dedes/miscellanea:misc.Mode4
ltx/en_us_dedes/me.m10.d06:meMA.Ode7C13.ode	@ltx/en_us_dedes/miscellanea:misc.Ode7
ltx/en_us_dedes/me.m10.d06:meMA.Ode7C13.text	
ltx/en_us_dedes/me.m10.d06:meMA.Ode7C1T.incipit	…
ltx/en_us_dedes/me.m10.d06:meMA.Ode7C1T.melody	@ltx/en_us_dedes/he.h.m4:heHE.EnTiKaminoAvramiaioi.name
ltx/en_us_dedes/me.m10.d06:meMA.Ode7C1T.mode	@ltx/en_us_dedes/miscellanea:misc.Mode4
ltx/en_us_dedes/me.m10.d06:meMA.Ode7C1T.ode	@ltx/en_us_dedes/miscellanea:misc.Ode7
ltx/en_us_dedes/me.m10.d06:meMA.Ode7C1T.text	
ltx/en_us_dedes/me.m10.d06:meMA.Ode8C11.greekmelody	@ltx/en_us_dedes/he.h.m4:heHE.PaidasEvageis.greekname
ltx/en_us_dedes/me.m10.d06:meMA.Ode8C11.incipit	…
ltx/en_us_dedes/me.m10.d06:meMA.Ode8C11.melody	@ltx/en_us_dedes/he.h.m4:heHE.PaidasEvageis.name
ltx/en_us_dedes/me.m10.d06:meMA.Ode8C11.mode	@ltx/en_us_dedes/miscellanea:misc.Mode4
ltx/en_us_dedes/me.m10.d06:meMA.Ode8C11.ode	@ltx/en_us_dedes/miscellanea:misc.Ode8
ltx/en_us_dedes/me.m10.d06:meMA.Ode8C11.text	
ltx/en_us_dedes/me.m10.d06:meMA.Ode8C12.incipit	…
ltx/en_us_dedes/me.m10.d06:meMA.Ode8C12.melody	@ltx/en_us_dedes/he.h.m4:heHE.PaidasEvageis.name
ltx/en_us_dedes/me.m10.d06:meMA.Ode8C12.mode	@ltx/en_us_dedes/miscellanea:misc.Mode4
ltx/en_us_dedes/me.m10.d06:meMA.Ode8C12.ode	@ltx/en_us_dedes/miscellanea:misc.Ode8
ltx/en_us_dedes/me.m10.d06:meMA.Ode8C12.text	
ltx/en_us_dedes/me.m10.d06:meMA.Ode8C13.incipit	…
ltx/en_us_dedes/me.m10.d06:meMA.Ode8C13.melody	@ltx/en_us_dedes/he.h.m4:heHE.PaidasEvageis.name
ltx/en_us_dedes/me.m10.d06:meMA.Ode8C13.mode	@ltx/en_us_dedes/miscellanea:misc.Mode4
ltx/en_us_dedes/me.m10.d06:meMA.Ode8C13.ode	@ltx/en_us_dedes/miscellanea:misc.Ode8
ltx/en_us_dedes/me.m10.d06:meMA.Ode8C13.text	
ltx/en_us_dedes/me.m10.d06:meMA.Ode8C1T.incipit	…
ltx/en_us_dedes/me.m10.d06:meMA.Ode8C1T.melody	@ltx/en_us_dedes/he.h.m4:heHE.PaidasEvageis.name
ltx/en_us_dedes/me.m10.d06:meMA.Ode8C1T.mode	@ltx/en_us_dedes/miscellanea:misc.Mode4
ltx/en_us_dedes/me.m10.d06:meMA.Ode8C1T.ode	@ltx/en_us_dedes/miscellanea:misc.Ode8
ltx/en_us_dedes/me.m10.d06:meMA.Ode8C1T.text	
ltx/en_us_dedes/me.m10.d06:meMA.Ode8H.greekmelody	@ltx/en_us_dedes/he.h.m4:heHE.PaidasEvageis.greekname
ltx/en_us_dedes/me.m10.d06:meMA.Ode8H.incipit	@ltx/en_us_dedes/he.h.m4:heHE.PaidasEvageis.incipit
ltx/en_us_dedes/me.m10.d06:meMA.Ode8H.melody	@ltx/en_us_dedes/he.h.m4:heHE.PaidasEvageis.melody
ltx/en_us_dedes/me.m10.d06:meMA.Ode8H.mode	@ltx/en_us_dedes/miscellanea:misc.Mode4
ltx/en_us_dedes/me.m10.d06:meMA.Ode8H.ode	@ltx/en_us_dedes/miscellanea:misc.Ode8
ltx/en_us_dedes/me.m10.d06:meMA.Ode8H.text	@ltx/en_us_dedes/he.h.m4:heHE.PaidasEvageis.text
ltx/en_us_dedes/me.m10.d06:meMA.Ode9C11.greekmelody	@ltx/en_us_dedes/he.h.m4:heHE.LithosAcheirotmitos.greekname
ltx/en_us_dedes/me.m10.d06:meMA.Ode9C11.incipit	…
ltx/en_us_dedes/me.m10.d06:meMA.Ode9C11.melody	@ltx/en_us_dedes/he.h.m4:heHE.LithosAcheirotmitos.name
ltx/en_us_dedes/me.m10.d06:meMA.Ode9C11.mode	@ltx/en_us_dedes/miscellanea:misc.Mode4
ltx/en_us_dedes/me.m10.d06:meMA.Ode9C11.ode	@ltx/en_us_dedes/miscellanea:misc.Ode9
ltx/en_us_dedes/me.m10.d06:meMA.Ode9C11.text	
ltx/en_us_dedes/me.m10.d06:meMA.Ode9C12.incipit	…
ltx/en_us_dedes/me.m10.d06:meMA.Ode9C12.melody	@ltx/en_us_dedes/he.h.m4:heHE.LithosAcheirotmitos.name
ltx/en_us_dedes/me.m10.d06:meMA.Ode9C12.mode	@ltx/en_us_dedes/miscellanea:misc.Mode4
ltx/en_us_dedes/me.m10.d06:meMA.Ode9C12.ode	@ltx/en_us_dedes/miscellanea:misc.Ode9
ltx/en_us_dedes/me.m10.d06:meMA.Ode9C12.text	
ltx/en_us_dedes/me.m10.d06:meMA.Ode9C13.incipit	…
ltx/en_us_dedes/me.m10.d06:meMA.Ode9C13.melody	@ltx/en_us_dedes/he.h.m4:heHE.LithosAcheirotmitos.name
ltx/en_us_dedes/me.m10.d06:meMA.Ode9C13.mode	@ltx/en_us_dedes/miscellanea:misc.Mode4
ltx/en_us_dedes/me.m10.d06:meMA.Ode9C13.ode	@ltx/en_us_dedes/miscellanea:misc.Ode9
ltx/en_us_dedes/me.m10.d06:meMA.Ode9C13.text	
ltx/en_us_dedes/me.m10.d06:meMA.Ode9C1T.incipit	…
ltx/en_us_dedes/me.m10.d06:meMA.Ode9C1T.melody	@ltx/en_us_dedes/he.h.m4:heHE.LithosAcheirotmitos.name
ltx/en_us_dedes/me.m10.d06:meMA.Ode9C1T.mode	@ltx/en_us_dedes/miscellanea:misc.Mode4
ltx/en_us_dedes/me.m10.d06:meMA.Ode9C1T.ode	@ltx/en_us_dedes/miscellanea:misc.Ode9
ltx/en_us_dedes/me.m10.d06:meMA.Ode9C1T.text	
ltx/en_us_dedes/me.m10.d06:meMA.Ode9H.greekmelody	@ltx/en_us_dedes/he.h.m4:heHE.LithosAcheirotmitos.greekname
ltx/en_us_dedes/me.m10.d06:meMA.Ode9H.incipit	@ltx/en_us_dedes/he.h.m4:heHE.LithosAcheirotmitos.incipit
ltx/en_us_dedes/me.m10.d06:meMA.Ode9H.melody	@ltx/en_us_dedes/he.h.m4:heHE.LithosAcheirotmitos.melody
ltx/en_us_dedes/me.m10.d06:meMA.Ode9H.mode	@ltx/en_us_dedes/miscellanea:misc.Mode4
ltx/en_us_dedes/me.m10.d06:meMA.Ode9H.ode	@ltx/en_us_dedes/miscellanea:misc.Ode9
ltx/en_us_dedes/me.m10.d06:meMA.Ode9H.text	@ltx/en_us_dedes/he.h.m4:heHE.LithosAcheirotmitos.text
ltx/en_us_dedes/me.m10.d06:meMA.Oikos1.text	
ltx/en_us_dedes/me.m10.d06:meVE.Apolytikion2ger.greekmelody	@ltx/en_us_dedes/he.a.m4:heAU.TachyProkatalave.greekname
ltx/en_us_dedes/me.m10.d06:meVE.Apolytikion2ger.incipit	…
ltx/en_us_dedes/me.m10.d06:meVE.Apolytikion2ger.melody	@ltx/en_us_dedes/he.a.m4:heAU.TachyProkatalave.name
ltx/en_us_dedes/me.m10.d06:meVE.Apolytikion2ger.mode	@ltx/en_us_dedes/miscellanea:misc.Mode4
ltx/en_us_dedes/me.m10.d06:meVE.Apolytikion2ger.poet	@ltx/en_us_dedes/poets:po.Gerasimou
ltx/en_us_dedes/me.m10.d06:meVE.Apolytikion2ger.text	
ltx/en_us_dedes/me.m10.d06:meVE.AposGlory.incipit	…
ltx/en_us_dedes/me.m10.d06:meVE.AposGlory.melody	
ltx/en_us_dedes/me.m10.d06:meVE.AposGlory.mode	@ltx/en_us_dedes/miscellanea:misc.Mode6
ltx/en_us_dedes/me.m10.d06:meVE.AposGlory.poet	@ltx/en_us_dedes/poets:po.Anatoliou
ltx/en_us_dedes/me.m10.d06:meVE.AposGlory.text	
ltx/en_us_dedes/me.m10.d06:meVE.AposTheotokion.greekmelody	@ltx/en_us_dedes/he.a.m6:heAU.OlinApothemenoi.greekname
ltx/en_us_dedes/me.m10.d06:meVE.AposTheotokion.incipit	…
ltx/en_us_dedes/me.m10.d06:meVE.AposTheotokion.melody	@ltx/en_us_dedes/he.a.m6:heAU.OlinApothemenoi.name
ltx/en_us_dedes/me.m10.d06:meVE.AposTheotokion.mode	@ltx/en_us_dedes/miscellanea:misc.Mode6
ltx/en_us_dedes/me.m10.d06:meVE.AposTheotokion.text	
ltx/en_us_dedes/me.m10.d06:meVE.Aposticha1.greekmelody	@ltx/en_us_dedes/he.a.m4:heAU.EdokasSimeiosin.greekname
ltx/en_us_dedes/me.m10.d06:meVE.Aposticha1.incipit	…
ltx/en_us_dedes/me.m10.d06:meVE.Aposticha1.melody	@ltx/en_us_dedes/he.a.m4:heAU.EdokasSimeiosin.name
ltx/en_us_dedes/me.m10.d06:meVE.Aposticha1.mode	@ltx/en_us_dedes/miscellanea:misc.Mode4
ltx/en_us_dedes/me.m10.d06:meVE.Aposticha1.text	
ltx/en_us_dedes/me.m10.d06:meVE.Aposticha2.incipit	…
ltx/en_us_dedes/me.m10.d06:meVE.Aposticha2.melody	@ltx/en_us_dedes/he.a.m4:heAU.EdokasSimeiosin.name
ltx/en_us_dedes/me.m10.d06:meVE.Aposticha2.mode	@ltx/en_us_dedes/miscellanea:misc.Mode4
ltx/en_us_dedes/me.m10.d06:meVE.Aposticha2.text	
ltx/en_us_dedes/me.m10.d06:meVE.Aposticha3.incipit	…
ltx/en_us_dedes/me.m10.d06:meVE.Aposticha3.melody	@ltx/en_us_dedes/he.a.m4:heAU.EdokasSimeiosin.name
ltx/en_us_dedes/me.m10.d06:meVE.Aposticha3.mode	@ltx/en_us_dedes/miscellanea:misc.Mode4
ltx/en_us_dedes/me.m10.d06:meVE.Aposticha3.text	
ltx/en_us_dedes/me.m10.d06:meVE.GeneralApolytikion1.melody	@ltx/en_us_dedes/he.ga:heGA.ApostoleAgie.name
ltx/en_us_dedes/me.m10.d06:meVE.GeneralApolytikion1.mode	@ltx/en_us_dedes/miscellanea:misc.Mode3
ltx/en_us_dedes/me.m10.d06:meVE.GeneralApolytikion1.name	Thomas,
ltx/en_us_dedes/me.m10.d06:meVE.MM.GeneralApolytikion1.text	@ltx/en_us_dedes/properties:media.key
ltx/en_us_dedes/me.m10.d06:meVE.MM.Stichera1123as78910.text	@ltx/en_us_dedes/properties:media.key
ltx/en_us_dedes/me.m10.d06:meVE.SticGlory.incipit	…
ltx/en_us_dedes/me.m10.d06:meVE.SticGlory.melody	
ltx/en_us_dedes/me.m10.d06:meVE.SticGlory.mode	@ltx/en_us_dedes/miscellanea:misc.Mode6
ltx/en_us_dedes/me.m10.d06:meVE.SticGlory.text	
ltx/en_us_dedes/me.m10.d06:meVE.SticTheotokion.incipit	@ltx/en_us_dedes/he.o:heOT.TheotokeSyEi.incipit
ltx/en_us_dedes/me.m10.d06:meVE.SticTheotokion.melody	@ltx/en_us_dedes/he.o:heOT.TheotokeSyEi.name
ltx/en_us_dedes/me.m10.d06:meVE.SticTheotokion.mode	@ltx/en_us_dedes/miscellanea:misc.Mode6
ltx/en_us_dedes/me.m10.d06:meVE.SticTheotokion.text	@ltx/en_us_dedes/he.o:heOT.TheotokeSyEiApostolou.text
ltx/en_us_dedes/me.m10.d06:meVE.Stichera01.greekmelody	@ltx/en_us_dedes/he.a.m4:heAU.OsGennaionEnMartysi.greekname
ltx/en_us_dedes/me.m10.d06:meVE.Stichera01.incipit	…
ltx/en_us_dedes/me.m10.d06:meVE.Stichera01.melody	@ltx/en_us_dedes/he.a.m4:heAU.OsGennaionEnMartysi.name
ltx/en_us_dedes/me.m10.d06:meVE.Stichera01.mode	@ltx/en_us_dedes/miscellanea:misc.Mode4
ltx/en_us_dedes/me.m10.d06:meVE.Stichera01.text	
ltx/en_us_dedes/me.m10.d06:meVE.Stichera02.incipit	…
ltx/en_us_dedes/me.m10.d06:meVE.Stichera02.melody	@ltx/en_us_dedes/he.a.m4:heAU.OsGennaionEnMartysi.name
ltx/en_us_dedes/me.m10.d06:meVE.Stichera02.mode	@ltx/en_us_dedes/miscellanea:misc.Mode4
ltx/en_us_dedes/me.m10.d06:meVE.Stichera02.text	
ltx/en_us_dedes/me.m10.d06:meVE.Stichera03.incipit	…
ltx/en_us_dedes/me.m10.d06:meVE.Stichera03.melody	@ltx/en_us_dedes/he.a.m4:heAU.OsGennaionEnMartysi.name
ltx/en_us_dedes/me.m10.d06:meVE.Stichera03.mode	@ltx/en_us_dedes/miscellanea:misc.Mode4
ltx/en_us_dedes/me.m10.d06:meVE.Stichera03.text	
