ltx/en_us_dedes/sy.m12.d01:syMA.commemoration01.couplet1.title	@ltx/en_us_dedes/titles:ti.Verses
ltx/en_us_dedes/sy.m12.d01:syMA.commemoration01.couplet1.verse1	
ltx/en_us_dedes/sy.m12.d01:syMA.commemoration01.couplet1.verse2	
ltx/en_us_dedes/sy.m12.d01:syMA.commemoration01.narration.p01	
ltx/en_us_dedes/sy.m12.d01:syMA.commemoration01.single1	
ltx/en_us_dedes/sy.m12.d01:syMA.commemoration01.text	On December 1, we commemorate the holy Prophet Nahum.
ltx/en_us_dedes/sy.m12.d01:syMA.commemoration02.couplet1.title	@ltx/en_us_dedes/titles:ti.Verses
ltx/en_us_dedes/sy.m12.d01:syMA.commemoration02.couplet1.verse1	
ltx/en_us_dedes/sy.m12.d01:syMA.commemoration02.couplet1.verse2	
ltx/en_us_dedes/sy.m12.d01:syMA.commemoration02.narration.p01	
ltx/en_us_dedes/sy.m12.d01:syMA.commemoration02.text	On this day we also commemorate devout Philaretos the Merciful.
ltx/en_us_dedes/sy.m12.d01:syMA.commemoration03.couplet1.title	@ltx/en_us_dedes/titles:ti.Verses
ltx/en_us_dedes/sy.m12.d01:syMA.commemoration03.couplet1.verse1	
ltx/en_us_dedes/sy.m12.d01:syMA.commemoration03.couplet1.verse2	
ltx/en_us_dedes/sy.m12.d01:syMA.commemoration03.narration.p01	
ltx/en_us_dedes/sy.m12.d01:syMA.commemoration03.text	On this day we also commemorate the holy Martyr Ananias the Persian.
ltx/en_us_dedes/sy.m12.d01:syMA.commemoration04.couplet1.title	@ltx/en_us_dedes/titles:ti.Verses
ltx/en_us_dedes/sy.m12.d01:syMA.commemoration04.couplet1.verse1	
ltx/en_us_dedes/sy.m12.d01:syMA.commemoration04.couplet1.verse2	
ltx/en_us_dedes/sy.m12.d01:syMA.commemoration04.text	On this day we also commemorate devout Anthony the New.
ltx/en_us_dedes/sy.m12.d01:syMA.commemoration05.couplet1.title	@ltx/en_us_dedes/titles:ti.Verses
ltx/en_us_dedes/sy.m12.d01:syMA.commemoration05.couplet1.verse1	
ltx/en_us_dedes/sy.m12.d01:syMA.commemoration05.couplet1.verse2	
ltx/en_us_dedes/sy.m12.d01:syMA.commemoration05.text	On this day Saint Onisimos, Archbishop of Ephesus, died in peace.
ltx/en_us_dedes/sy.m12.d01:syMA.commemoration06.couplet1.title	@ltx/en_us_dedes/titles:ti.Verses
ltx/en_us_dedes/sy.m12.d01:syMA.commemoration06.couplet1.verse1	
ltx/en_us_dedes/sy.m12.d01:syMA.commemoration06.couplet1.verse2	
ltx/en_us_dedes/sy.m12.d01:syMA.commemoration06.text	On this day we also commemorate our father among the saints Theocletos, Archbishop of Lakedaemonia.
ltx/en_us_dedes/sy.m12.d01:syMA.commemoration07.couplet1.title	@ltx/en_us_dedes/titles:ti.Verses
ltx/en_us_dedes/sy.m12.d01:syMA.commemoration07.couplet1.verse1	
ltx/en_us_dedes/sy.m12.d01:syMA.commemoration07.couplet1.verse2	
ltx/en_us_dedes/sy.m12.d01:syMA.commemoration07.text	We also commemorate our fathers among the saints the Archbishops of Ephesus Ananias and Solochon.
ltx/en_us_dedes/sy.m12.d01:syMA.lastline	By their holy intercessions, O God, have mercy on us and save us. Amen.
ltx/en_us_dedes/sy.m12.d01:syMA.note1	
