ltx/en_us_dedes/me.m02.d05:meDA.commemoration.first	Memory of the Holy Martyr Agatha
ltx/en_us_dedes/me.m02.d05:meDA.commemoration.first_name	
ltx/en_us_dedes/me.m02.d05:meDA.commemoration.first_short	Memory of the Holy Martyr Agatha
ltx/en_us_dedes/me.m02.d05:meDA.commemoration.first_title	@ltx/en_us_dedes/titles:ti.Feast
ltx/en_us_dedes/me.m02.d05:meDA.commemoration.full	Memory of the Holy Martyr Agatha
ltx/en_us_dedes/me.m02.d05:meDA.commemoration.second_name	
ltx/en_us_dedes/me.m02.d05:meDA.commemoration.second_title	@ltx/en_us_dedes/titles:ti.SaintW
ltx/en_us_dedes/me.m02.d05:meDA.date	February 5
ltx/en_us_dedes/me.m02.d05:meDA.dismissal	@ltx/en_us_dedes/dismissals:dis00.meeting
ltx/en_us_dedes/me.m02.d05:meDA.fordate	for February 5
ltx/en_us_dedes/me.m02.d05:meDA.insert1	
ltx/en_us_dedes/me.m02.d05:meDA.insert2	
ltx/en_us_dedes/me.m02.d05:meDA.note	
ltx/en_us_dedes/me.m02.d05:meDA.pdfcoverdate	February 5,
ltx/en_us_dedes/me.m02.d05:meDA.pdfheaderdate	February 5
ltx/en_us_dedes/me.m02.d05:meHO.commemorations	
ltx/en_us_dedes/me.m02.d05:meHO.note1	
ltx/en_us_dedes/me.m02.d05:meHO.note2	
ltx/en_us_dedes/me.m02.d05:meHO.number	
ltx/en_us_dedes/me.m02.d05:meHO.rank	
ltx/en_us_dedes/me.m02.d05:meLE.commemoration1	
ltx/en_us_dedes/me.m02.d05:meLE.commemoration2	
ltx/en_us_dedes/me.m02.d05:meLI.Kontakion1.greekmelody	@ltx/en_us_dedes/me.m02.d05:meMA.Kontakion1.greekmelody
ltx/en_us_dedes/me.m02.d05:meLI.Kontakion1.incipit	@ltx/en_us_dedes/me.m02.d05:meMA.Kontakion1.incipit
ltx/en_us_dedes/me.m02.d05:meLI.Kontakion1.melody	@ltx/en_us_dedes/me.m02.d05:meMA.Kontakion1.melody
ltx/en_us_dedes/me.m02.d05:meLI.Kontakion1.mode	@ltx/en_us_dedes/me.m02.d05:meMA.Kontakion1.mode
ltx/en_us_dedes/me.m02.d05:meLI.Kontakion1.text	@ltx/en_us_dedes/me.m02.d05:meMA.Kontakion1.text
ltx/en_us_dedes/me.m02.d05:meLI.Megalynarion.text	
ltx/en_us_dedes/me.m02.d05:meMA.AposGlory.incipit	Virgin, rejoice! For you *…
ltx/en_us_dedes/me.m02.d05:meMA.AposGlory.melody	@ltx/en_us_dedes/he.a.m2:heAU.OikosTouEfratha.name
ltx/en_us_dedes/me.m02.d05:meMA.AposGlory.mode	@ltx/en_us_dedes/miscellanea:misc.Mode2
ltx/en_us_dedes/me.m02.d05:meMA.AposGlory.text	Virgin, rejoice! For you * accepted Christ, the joy of * the world and the Life-giver. * You end the pain and sorrow of our ancestral mother Eve.
ltx/en_us_dedes/me.m02.d05:meMA.Aposticha1.greekmelody	@ltx/en_us_dedes/he.a.m2:heAU.OikosTouEfratha.greekname
ltx/en_us_dedes/me.m02.d05:meMA.Aposticha1.incipit	@ltx/en_us_dedes/me.m02.d02:meSV.Aposticha3.incipit
ltx/en_us_dedes/me.m02.d05:meMA.Aposticha1.melody	@ltx/en_us_dedes/he.a.m2:heAU.OikosTouEfratha.name
ltx/en_us_dedes/me.m02.d05:meMA.Aposticha1.mode	@ltx/en_us_dedes/miscellanea:misc.Mode2
ltx/en_us_dedes/me.m02.d05:meMA.Aposticha1.text	@ltx/en_us_dedes/me.m02.d02:meSV.Aposticha3.text
ltx/en_us_dedes/me.m02.d05:meMA.Aposticha2.incipit	“Lord, let me now depart…
ltx/en_us_dedes/me.m02.d05:meMA.Aposticha2.melody	@ltx/en_us_dedes/he.a.m2:heAU.OikosTouEfratha.name
ltx/en_us_dedes/me.m02.d05:meMA.Aposticha2.mode	@ltx/en_us_dedes/miscellanea:misc.Mode2
ltx/en_us_dedes/me.m02.d05:meMA.Aposticha2.text	“Lord, let me now depart * in peace unto the true life.” * So Symeon did cry out. * “For I have now beheld You, my Savior and the light of the world.”
ltx/en_us_dedes/me.m02.d05:meMA.Aposticha3.incipit	Anna, devout and chaste, *…
ltx/en_us_dedes/me.m02.d05:meMA.Aposticha3.melody	@ltx/en_us_dedes/he.a.m2:heAU.OikosTouEfratha.name
ltx/en_us_dedes/me.m02.d05:meMA.Aposticha3.mode	@ltx/en_us_dedes/miscellanea:misc.Mode2
ltx/en_us_dedes/me.m02.d05:meMA.Aposticha3.text	Anna, devout and chaste, * prophetically announces * to all the Virgin’s Infant, * who came for the redemption of all; and she gives thanks to God.
ltx/en_us_dedes/me.m02.d05:meMA.C1.acrostic.notice1	
ltx/en_us_dedes/me.m02.d05:meMA.C1.acrostic.text	
ltx/en_us_dedes/me.m02.d05:meMA.C1.acrostic.title	
ltx/en_us_dedes/me.m02.d05:meMA.C1.poet	@ltx/en_us_dedes/poets:po.Theofanous
ltx/en_us_dedes/me.m02.d05:meMA.C1.title	@ltx/en_us_dedes/titles:ti.CanonSaintW
ltx/en_us_dedes/me.m02.d05:meMA.C1.verse	@ltx/en_us_dedes/prayers:pr.verse_SaintW.text
ltx/en_us_dedes/me.m02.d05:meMA.Exaposteilarion1.greekmelody	@ltx/en_us_dedes/he.a.m2:heAU.GynaikesAkoutisthite.greekname
ltx/en_us_dedes/me.m02.d05:meMA.Exaposteilarion1.incipit	O glorious St. Agatha, *…
ltx/en_us_dedes/me.m02.d05:meMA.Exaposteilarion1.melody	@ltx/en_us_dedes/he.a.m2:heAU.GynaikesAkoutisthite.name
ltx/en_us_dedes/me.m02.d05:meMA.Exaposteilarion1.mode	@ltx/en_us_dedes/miscellanea:misc.Mode2
ltx/en_us_dedes/me.m02.d05:meMA.Exaposteilarion1.text	O glorious St. Agatha, * the undefiled bride of Christ, * a treasure of godly beauty, * illustrious holy Martyr, * remember us who honor you, * O lovely virgin, faithfully. * And as we are celebrating * your memory, pray that we be * forgiven all our offenses.
ltx/en_us_dedes/me.m02.d05:meMA.Exaposteilarion2.greekmelody	@ltx/en_us_dedes/he.a.m2:heAU.GynaikesAkoutisthite.greekname
ltx/en_us_dedes/me.m02.d05:meMA.Exaposteilarion2.incipit	Fulfilling Your ineffable * plan…
ltx/en_us_dedes/me.m02.d05:meMA.Exaposteilarion2.melody	@ltx/en_us_dedes/he.a.m2:heAU.GynaikesAkoutisthite.name
ltx/en_us_dedes/me.m02.d05:meMA.Exaposteilarion2.mode	@ltx/en_us_dedes/miscellanea:misc.Mode2
ltx/en_us_dedes/me.m02.d05:meMA.Exaposteilarion2.text	Fulfilling Your ineffable * plan for mankind’s salvation, Lord, * You were brought into the Temple * by Your ever-virgin Mother. * The Elder saw You and exclaimed, * “O Master, let your servant now * depart in peace, as You promised. * You came to the world as Savior, * my Christ, the light of the Father.”
ltx/en_us_dedes/me.m02.d05:meMA.Kathisma11.greekmelody	@ltx/en_us_dedes/he.a.m1:heAU.ChorosAngelikos.greekname
ltx/en_us_dedes/me.m02.d05:meMA.Kathisma11.incipit	@ltx/en_us_dedes/he.a.m1:heAU.ChorosAngelikos.incipit
ltx/en_us_dedes/me.m02.d05:meMA.Kathisma11.melody	@ltx/en_us_dedes/he.a.m1:heAU.ChorosAngelikos.melody
ltx/en_us_dedes/me.m02.d05:meMA.Kathisma11.mode	@ltx/en_us_dedes/miscellanea:misc.Mode1
ltx/en_us_dedes/me.m02.d05:meMA.Kathisma11.text	@ltx/en_us_dedes/he.a.m1:heAU.ChorosAngelikos.text
ltx/en_us_dedes/me.m02.d05:meMA.Kathisma21.greekmelody	@ltx/en_us_dedes/he.a.m8:heAU.AnestisEkNekron.greekname
ltx/en_us_dedes/me.m02.d05:meMA.Kathisma21.incipit	…
ltx/en_us_dedes/me.m02.d05:meMA.Kathisma21.melody	@ltx/en_us_dedes/he.a.m8:heAU.AnestisEkNekron.name
ltx/en_us_dedes/me.m02.d05:meMA.Kathisma21.mode	@ltx/en_us_dedes/miscellanea:misc.Mode8
ltx/en_us_dedes/me.m02.d05:meMA.Kathisma21.text	
ltx/en_us_dedes/me.m02.d05:meMA.Kontakion1.greekmelody	@ltx/en_us_dedes/he.a.m4:heAU.EpefanisSimeron.greekname
ltx/en_us_dedes/me.m02.d05:meMA.Kontakion1.incipit	Let the Church of Christ…
ltx/en_us_dedes/me.m02.d05:meMA.Kontakion1.melody	@ltx/en_us_dedes/he.a.m4:heAU.EpefanisSimeron.name
ltx/en_us_dedes/me.m02.d05:meMA.Kontakion1.mode	@ltx/en_us_dedes/miscellanea:misc.Mode4
ltx/en_us_dedes/me.m02.d05:meMA.Kontakion1.text	Let the Church of Christ today * be decorated * with a splendid royal robe * dyed purple in the purest blood * of the divine Martyr Agatha, and now salute her, * Rejoice, O Catania’s boast.
ltx/en_us_dedes/me.m02.d05:meMA.Ode1C11.greekmelody	@ltx/en_us_dedes/he.h.m2:heHE.DefteLaoi.greekname
ltx/en_us_dedes/me.m02.d05:meMA.Ode1C11.incipit	…
ltx/en_us_dedes/me.m02.d05:meMA.Ode1C11.melody	@ltx/en_us_dedes/he.h.m2:heHE.DefteLaoi.name
ltx/en_us_dedes/me.m02.d05:meMA.Ode1C11.mode	@ltx/en_us_dedes/miscellanea:misc.Mode2
ltx/en_us_dedes/me.m02.d05:meMA.Ode1C11.ode	@ltx/en_us_dedes/miscellanea:misc.Ode1
ltx/en_us_dedes/me.m02.d05:meMA.Ode1C11.text	
ltx/en_us_dedes/me.m02.d05:meMA.Ode1C12.incipit	…
ltx/en_us_dedes/me.m02.d05:meMA.Ode1C12.melody	@ltx/en_us_dedes/he.h.m2:heHE.DefteLaoi.name
ltx/en_us_dedes/me.m02.d05:meMA.Ode1C12.mode	@ltx/en_us_dedes/miscellanea:misc.Mode2
ltx/en_us_dedes/me.m02.d05:meMA.Ode1C12.ode	@ltx/en_us_dedes/miscellanea:misc.Ode1
ltx/en_us_dedes/me.m02.d05:meMA.Ode1C12.text	
ltx/en_us_dedes/me.m02.d05:meMA.Ode1C13.incipit	…
ltx/en_us_dedes/me.m02.d05:meMA.Ode1C13.melody	@ltx/en_us_dedes/he.h.m2:heHE.DefteLaoi.name
ltx/en_us_dedes/me.m02.d05:meMA.Ode1C13.mode	@ltx/en_us_dedes/miscellanea:misc.Mode2
ltx/en_us_dedes/me.m02.d05:meMA.Ode1C13.ode	@ltx/en_us_dedes/miscellanea:misc.Ode1
ltx/en_us_dedes/me.m02.d05:meMA.Ode1C13.text	
ltx/en_us_dedes/me.m02.d05:meMA.Ode1C1H.greekmelody	@ltx/en_us_dedes/he.h.m2:heHE.DefteLaoi.greekname
ltx/en_us_dedes/me.m02.d05:meMA.Ode1C1H.incipit	@ltx/en_us_dedes/he.h.m2:heHE.DefteLaoi.incipit
ltx/en_us_dedes/me.m02.d05:meMA.Ode1C1H.melody	@ltx/en_us_dedes/he.h.m2:heHE.DefteLaoi.melody
ltx/en_us_dedes/me.m02.d05:meMA.Ode1C1H.mode	@ltx/en_us_dedes/miscellanea:misc.Mode2
ltx/en_us_dedes/me.m02.d05:meMA.Ode1C1H.ode	@ltx/en_us_dedes/miscellanea:misc.Ode1
ltx/en_us_dedes/me.m02.d05:meMA.Ode1C1H.text	@ltx/en_us_dedes/he.h.m2:heHE.DefteLaoi.text
ltx/en_us_dedes/me.m02.d05:meMA.Ode1C1T.incipit	…
ltx/en_us_dedes/me.m02.d05:meMA.Ode1C1T.melody	@ltx/en_us_dedes/he.h.m2:heHE.DefteLaoi.name
ltx/en_us_dedes/me.m02.d05:meMA.Ode1C1T.mode	@ltx/en_us_dedes/miscellanea:misc.Mode2
ltx/en_us_dedes/me.m02.d05:meMA.Ode1C1T.ode	@ltx/en_us_dedes/miscellanea:misc.Ode1
ltx/en_us_dedes/me.m02.d05:meMA.Ode1C1T.text	
ltx/en_us_dedes/me.m02.d05:meMA.Ode3C11.greekmelody	@ltx/en_us_dedes/he.h.m2:heHE.StereosonImasEnSoiKyrie.greekname
ltx/en_us_dedes/me.m02.d05:meMA.Ode3C11.incipit	…
ltx/en_us_dedes/me.m02.d05:meMA.Ode3C11.melody	@ltx/en_us_dedes/he.h.m2:heHE.StereosonImasEnSoiKyrie.name
ltx/en_us_dedes/me.m02.d05:meMA.Ode3C11.mode	@ltx/en_us_dedes/miscellanea:misc.Mode2
ltx/en_us_dedes/me.m02.d05:meMA.Ode3C11.ode	@ltx/en_us_dedes/miscellanea:misc.Ode3
ltx/en_us_dedes/me.m02.d05:meMA.Ode3C11.text	
ltx/en_us_dedes/me.m02.d05:meMA.Ode3C12.incipit	…
ltx/en_us_dedes/me.m02.d05:meMA.Ode3C12.melody	@ltx/en_us_dedes/he.h.m2:heHE.StereosonImasEnSoiKyrie.name
ltx/en_us_dedes/me.m02.d05:meMA.Ode3C12.mode	@ltx/en_us_dedes/miscellanea:misc.Mode2
ltx/en_us_dedes/me.m02.d05:meMA.Ode3C12.ode	@ltx/en_us_dedes/miscellanea:misc.Ode3
ltx/en_us_dedes/me.m02.d05:meMA.Ode3C12.text	
ltx/en_us_dedes/me.m02.d05:meMA.Ode3C13.incipit	…
ltx/en_us_dedes/me.m02.d05:meMA.Ode3C13.melody	@ltx/en_us_dedes/he.h.m2:heHE.StereosonImasEnSoiKyrie.name
ltx/en_us_dedes/me.m02.d05:meMA.Ode3C13.mode	@ltx/en_us_dedes/miscellanea:misc.Mode2
ltx/en_us_dedes/me.m02.d05:meMA.Ode3C13.ode	@ltx/en_us_dedes/miscellanea:misc.Ode3
ltx/en_us_dedes/me.m02.d05:meMA.Ode3C13.text	
ltx/en_us_dedes/me.m02.d05:meMA.Ode3C1H.greekmelody	@ltx/en_us_dedes/he.h.m2:heHE.StereosonImasEnSoiKyrie.greekname
ltx/en_us_dedes/me.m02.d05:meMA.Ode3C1H.incipit	@ltx/en_us_dedes/he.h.m2:heHE.StereosonImasEnSoiKyrie.incipit
ltx/en_us_dedes/me.m02.d05:meMA.Ode3C1H.melody	@ltx/en_us_dedes/he.h.m2:heHE.StereosonImasEnSoiKyrie.melody
ltx/en_us_dedes/me.m02.d05:meMA.Ode3C1H.mode	@ltx/en_us_dedes/miscellanea:misc.Mode2
ltx/en_us_dedes/me.m02.d05:meMA.Ode3C1H.ode	@ltx/en_us_dedes/miscellanea:misc.Ode3
ltx/en_us_dedes/me.m02.d05:meMA.Ode3C1H.text	@ltx/en_us_dedes/he.h.m2:heHE.StereosonImasEnSoiKyrie.text
ltx/en_us_dedes/me.m02.d05:meMA.Ode3C1T.incipit	…
ltx/en_us_dedes/me.m02.d05:meMA.Ode3C1T.melody	@ltx/en_us_dedes/he.h.m2:heHE.StereosonImasEnSoiKyrie.name
ltx/en_us_dedes/me.m02.d05:meMA.Ode3C1T.mode	@ltx/en_us_dedes/miscellanea:misc.Mode2
ltx/en_us_dedes/me.m02.d05:meMA.Ode3C1T.ode	@ltx/en_us_dedes/miscellanea:misc.Ode3
ltx/en_us_dedes/me.m02.d05:meMA.Ode3C1T.text	
ltx/en_us_dedes/me.m02.d05:meMA.Ode3Kathisma1.greekmelody	@ltx/en_us_dedes/he.a.m3:heAU.TheiasPisteos.greekname
ltx/en_us_dedes/me.m02.d05:meMA.Ode3Kathisma1.incipit	…
ltx/en_us_dedes/me.m02.d05:meMA.Ode3Kathisma1.melody	@ltx/en_us_dedes/he.a.m3:heAU.TheiasPisteos.name
ltx/en_us_dedes/me.m02.d05:meMA.Ode3Kathisma1.mode	@ltx/en_us_dedes/miscellanea:misc.Mode3
ltx/en_us_dedes/me.m02.d05:meMA.Ode3Kathisma1.text	
ltx/en_us_dedes/me.m02.d05:meMA.Ode3Kathisma2.greekmelody	@ltx/en_us_dedes/he.a.m3:heAU.TinOraiotita.greekname
ltx/en_us_dedes/me.m02.d05:meMA.Ode3Kathisma2.incipit	…
ltx/en_us_dedes/me.m02.d05:meMA.Ode3Kathisma2.melody	@ltx/en_us_dedes/he.a.m3:heAU.TinOraiotita.name
ltx/en_us_dedes/me.m02.d05:meMA.Ode3Kathisma2.mode	@ltx/en_us_dedes/miscellanea:misc.Mode3
ltx/en_us_dedes/me.m02.d05:meMA.Ode3Kathisma2.text	
ltx/en_us_dedes/me.m02.d05:meMA.Ode3KathismaSt.incipit	@ltx/en_us_dedes/me.m01.d29:meMA.Ode3KathismaSt.incipit
ltx/en_us_dedes/me.m02.d05:meMA.Ode3KathismaSt.melody	@ltx/en_us_dedes/he.a.m3:heAU.TheiasPisteos.name
ltx/en_us_dedes/me.m02.d05:meMA.Ode3KathismaSt.mode	@ltx/en_us_dedes/miscellanea:misc.Mode3
ltx/en_us_dedes/me.m02.d05:meMA.Ode3KathismaSt.text	@ltx/en_us_dedes/me.m01.d29:meMA.Ode3KathismaSt.text
ltx/en_us_dedes/me.m02.d05:meMA.Ode3KathismaT.incipit	@ltx/en_us_dedes/oc.m3.d2:ocMA.Kathisma23.incipit
ltx/en_us_dedes/me.m02.d05:meMA.Ode3KathismaT.melody	@ltx/en_us_dedes/he.a.m3:heAU.TheiasPisteos.name
ltx/en_us_dedes/me.m02.d05:meMA.Ode3KathismaT.mode	@ltx/en_us_dedes/miscellanea:misc.Mode3
ltx/en_us_dedes/me.m02.d05:meMA.Ode3KathismaT.text	@ltx/en_us_dedes/oc.m3.d2:ocMA.Kathisma23.text
ltx/en_us_dedes/me.m02.d05:meMA.Ode4C11.greekmelody	@ltx/en_us_dedes/he.h.m2:heHE.YmnoSeAkoi.greekname
ltx/en_us_dedes/me.m02.d05:meMA.Ode4C11.incipit	…
ltx/en_us_dedes/me.m02.d05:meMA.Ode4C11.melody	@ltx/en_us_dedes/he.h.m2:heHE.YmnoSeAkoi.name
ltx/en_us_dedes/me.m02.d05:meMA.Ode4C11.mode	@ltx/en_us_dedes/miscellanea:misc.Mode2
ltx/en_us_dedes/me.m02.d05:meMA.Ode4C11.ode	@ltx/en_us_dedes/miscellanea:misc.Ode4
ltx/en_us_dedes/me.m02.d05:meMA.Ode4C11.text	
ltx/en_us_dedes/me.m02.d05:meMA.Ode4C12.incipit	…
ltx/en_us_dedes/me.m02.d05:meMA.Ode4C12.melody	@ltx/en_us_dedes/he.h.m2:heHE.YmnoSeAkoi.name
ltx/en_us_dedes/me.m02.d05:meMA.Ode4C12.mode	@ltx/en_us_dedes/miscellanea:misc.Mode2
ltx/en_us_dedes/me.m02.d05:meMA.Ode4C12.ode	@ltx/en_us_dedes/miscellanea:misc.Ode4
ltx/en_us_dedes/me.m02.d05:meMA.Ode4C12.text	
ltx/en_us_dedes/me.m02.d05:meMA.Ode4C13.incipit	…
ltx/en_us_dedes/me.m02.d05:meMA.Ode4C13.melody	@ltx/en_us_dedes/he.h.m2:heHE.YmnoSeAkoi.name
ltx/en_us_dedes/me.m02.d05:meMA.Ode4C13.mode	@ltx/en_us_dedes/miscellanea:misc.Mode2
ltx/en_us_dedes/me.m02.d05:meMA.Ode4C13.ode	@ltx/en_us_dedes/miscellanea:misc.Ode4
ltx/en_us_dedes/me.m02.d05:meMA.Ode4C13.text	
ltx/en_us_dedes/me.m02.d05:meMA.Ode4C1H.greekmelody	@ltx/en_us_dedes/he.h.m2:heHE.YmnoSeAkoi.greekname
ltx/en_us_dedes/me.m02.d05:meMA.Ode4C1H.incipit	@ltx/en_us_dedes/he.h.m2:heHE.YmnoSeAkoi.incipit
ltx/en_us_dedes/me.m02.d05:meMA.Ode4C1H.melody	@ltx/en_us_dedes/he.h.m2:heHE.YmnoSeAkoi.melody
ltx/en_us_dedes/me.m02.d05:meMA.Ode4C1H.mode	@ltx/en_us_dedes/miscellanea:misc.Mode2
ltx/en_us_dedes/me.m02.d05:meMA.Ode4C1H.ode	@ltx/en_us_dedes/miscellanea:misc.Ode4
ltx/en_us_dedes/me.m02.d05:meMA.Ode4C1H.text	@ltx/en_us_dedes/he.h.m2:heHE.YmnoSeAkoi.text
ltx/en_us_dedes/me.m02.d05:meMA.Ode4C1T.incipit	…
ltx/en_us_dedes/me.m02.d05:meMA.Ode4C1T.melody	@ltx/en_us_dedes/he.h.m2:heHE.YmnoSeAkoi.name
ltx/en_us_dedes/me.m02.d05:meMA.Ode4C1T.mode	@ltx/en_us_dedes/miscellanea:misc.Mode2
ltx/en_us_dedes/me.m02.d05:meMA.Ode4C1T.ode	@ltx/en_us_dedes/miscellanea:misc.Ode4
ltx/en_us_dedes/me.m02.d05:meMA.Ode4C1T.text	
ltx/en_us_dedes/me.m02.d05:meMA.Ode5C11.greekmelody	@ltx/en_us_dedes/he.h.m2:heHE.OTouFotosChorigos.greekname
ltx/en_us_dedes/me.m02.d05:meMA.Ode5C11.incipit	…
ltx/en_us_dedes/me.m02.d05:meMA.Ode5C11.melody	@ltx/en_us_dedes/he.h.m2:heHE.OTouFotosChorigos.name
ltx/en_us_dedes/me.m02.d05:meMA.Ode5C11.mode	@ltx/en_us_dedes/miscellanea:misc.Mode2
ltx/en_us_dedes/me.m02.d05:meMA.Ode5C11.ode	@ltx/en_us_dedes/miscellanea:misc.Ode5
ltx/en_us_dedes/me.m02.d05:meMA.Ode5C11.text	
ltx/en_us_dedes/me.m02.d05:meMA.Ode5C12.incipit	…
ltx/en_us_dedes/me.m02.d05:meMA.Ode5C12.melody	@ltx/en_us_dedes/he.h.m2:heHE.OTouFotosChorigos.name
ltx/en_us_dedes/me.m02.d05:meMA.Ode5C12.mode	@ltx/en_us_dedes/miscellanea:misc.Mode2
ltx/en_us_dedes/me.m02.d05:meMA.Ode5C12.ode	@ltx/en_us_dedes/miscellanea:misc.Ode5
ltx/en_us_dedes/me.m02.d05:meMA.Ode5C12.text	
ltx/en_us_dedes/me.m02.d05:meMA.Ode5C13.incipit	…
ltx/en_us_dedes/me.m02.d05:meMA.Ode5C13.melody	@ltx/en_us_dedes/he.h.m2:heHE.OTouFotosChorigos.name
ltx/en_us_dedes/me.m02.d05:meMA.Ode5C13.mode	@ltx/en_us_dedes/miscellanea:misc.Mode2
ltx/en_us_dedes/me.m02.d05:meMA.Ode5C13.ode	@ltx/en_us_dedes/miscellanea:misc.Ode5
ltx/en_us_dedes/me.m02.d05:meMA.Ode5C13.text	
ltx/en_us_dedes/me.m02.d05:meMA.Ode5C1H.greekmelody	@ltx/en_us_dedes/he.h.m2:heHE.OTouFotosChorigos.greekname
ltx/en_us_dedes/me.m02.d05:meMA.Ode5C1H.incipit	@ltx/en_us_dedes/he.h.m2:heHE.OTouFotosChorigos.incipit
ltx/en_us_dedes/me.m02.d05:meMA.Ode5C1H.melody	@ltx/en_us_dedes/he.h.m2:heHE.OTouFotosChorigos.melody
ltx/en_us_dedes/me.m02.d05:meMA.Ode5C1H.mode	@ltx/en_us_dedes/miscellanea:misc.Mode2
ltx/en_us_dedes/me.m02.d05:meMA.Ode5C1H.ode	@ltx/en_us_dedes/miscellanea:misc.Ode5
ltx/en_us_dedes/me.m02.d05:meMA.Ode5C1H.text	@ltx/en_us_dedes/he.h.m2:heHE.OTouFotosChorigos.text
ltx/en_us_dedes/me.m02.d05:meMA.Ode5C1T.incipit	…
ltx/en_us_dedes/me.m02.d05:meMA.Ode5C1T.melody	@ltx/en_us_dedes/he.h.m2:heHE.OTouFotosChorigos.name
ltx/en_us_dedes/me.m02.d05:meMA.Ode5C1T.mode	@ltx/en_us_dedes/miscellanea:misc.Mode2
ltx/en_us_dedes/me.m02.d05:meMA.Ode5C1T.ode	@ltx/en_us_dedes/miscellanea:misc.Ode5
ltx/en_us_dedes/me.m02.d05:meMA.Ode5C1T.text	
ltx/en_us_dedes/me.m02.d05:meMA.Ode6C11.greekmelody	@ltx/en_us_dedes/he.h.m2:heHE.EnAvyssoPtaismaton.greekname
ltx/en_us_dedes/me.m02.d05:meMA.Ode6C11.incipit	…
ltx/en_us_dedes/me.m02.d05:meMA.Ode6C11.melody	@ltx/en_us_dedes/he.h.m2:heHE.EnAvyssoPtaismaton.name
ltx/en_us_dedes/me.m02.d05:meMA.Ode6C11.mode	@ltx/en_us_dedes/miscellanea:misc.Mode2
ltx/en_us_dedes/me.m02.d05:meMA.Ode6C11.ode	@ltx/en_us_dedes/miscellanea:misc.Ode6
ltx/en_us_dedes/me.m02.d05:meMA.Ode6C11.text	
ltx/en_us_dedes/me.m02.d05:meMA.Ode6C12.incipit	…
ltx/en_us_dedes/me.m02.d05:meMA.Ode6C12.melody	@ltx/en_us_dedes/he.h.m2:heHE.EnAvyssoPtaismaton.name
ltx/en_us_dedes/me.m02.d05:meMA.Ode6C12.mode	@ltx/en_us_dedes/miscellanea:misc.Mode2
ltx/en_us_dedes/me.m02.d05:meMA.Ode6C12.ode	@ltx/en_us_dedes/miscellanea:misc.Ode6
ltx/en_us_dedes/me.m02.d05:meMA.Ode6C12.text	
ltx/en_us_dedes/me.m02.d05:meMA.Ode6C13.incipit	…
ltx/en_us_dedes/me.m02.d05:meMA.Ode6C13.melody	@ltx/en_us_dedes/he.h.m2:heHE.EnAvyssoPtaismaton.name
ltx/en_us_dedes/me.m02.d05:meMA.Ode6C13.mode	@ltx/en_us_dedes/miscellanea:misc.Mode2
ltx/en_us_dedes/me.m02.d05:meMA.Ode6C13.ode	@ltx/en_us_dedes/miscellanea:misc.Ode6
ltx/en_us_dedes/me.m02.d05:meMA.Ode6C13.text	
ltx/en_us_dedes/me.m02.d05:meMA.Ode6C1H.greekmelody	@ltx/en_us_dedes/he.h.m2:heHE.EnAvyssoPtaismaton.greekname
ltx/en_us_dedes/me.m02.d05:meMA.Ode6C1H.incipit	@ltx/en_us_dedes/he.h.m2:heHE.EnAvyssoPtaismaton.incipit
ltx/en_us_dedes/me.m02.d05:meMA.Ode6C1H.melody	@ltx/en_us_dedes/he.h.m2:heHE.EnAvyssoPtaismaton.melody
ltx/en_us_dedes/me.m02.d05:meMA.Ode6C1H.mode	@ltx/en_us_dedes/miscellanea:misc.Mode2
ltx/en_us_dedes/me.m02.d05:meMA.Ode6C1H.ode	@ltx/en_us_dedes/miscellanea:misc.Ode6
ltx/en_us_dedes/me.m02.d05:meMA.Ode6C1H.text	@ltx/en_us_dedes/he.h.m2:heHE.EnAvyssoPtaismaton.text
ltx/en_us_dedes/me.m02.d05:meMA.Ode6C1T.incipit	…
ltx/en_us_dedes/me.m02.d05:meMA.Ode6C1T.melody	@ltx/en_us_dedes/he.h.m2:heHE.EnAvyssoPtaismaton.name
ltx/en_us_dedes/me.m02.d05:meMA.Ode6C1T.mode	@ltx/en_us_dedes/miscellanea:misc.Mode2
ltx/en_us_dedes/me.m02.d05:meMA.Ode6C1T.ode	@ltx/en_us_dedes/miscellanea:misc.Ode6
ltx/en_us_dedes/me.m02.d05:meMA.Ode6C1T.text	
ltx/en_us_dedes/me.m02.d05:meMA.Ode7C11.greekmelody	@ltx/en_us_dedes/he.h.m2:heHE.EikonosChrysis.greekname
ltx/en_us_dedes/me.m02.d05:meMA.Ode7C11.incipit	…
ltx/en_us_dedes/me.m02.d05:meMA.Ode7C11.melody	@ltx/en_us_dedes/he.h.m2:heHE.EikonosChrysis.name
ltx/en_us_dedes/me.m02.d05:meMA.Ode7C11.mode	@ltx/en_us_dedes/miscellanea:misc.Mode2
ltx/en_us_dedes/me.m02.d05:meMA.Ode7C11.ode	@ltx/en_us_dedes/miscellanea:misc.Ode7
ltx/en_us_dedes/me.m02.d05:meMA.Ode7C11.text	
ltx/en_us_dedes/me.m02.d05:meMA.Ode7C12.incipit	…
ltx/en_us_dedes/me.m02.d05:meMA.Ode7C12.melody	@ltx/en_us_dedes/he.h.m2:heHE.EikonosChrysis.name
ltx/en_us_dedes/me.m02.d05:meMA.Ode7C12.mode	@ltx/en_us_dedes/miscellanea:misc.Mode2
ltx/en_us_dedes/me.m02.d05:meMA.Ode7C12.ode	@ltx/en_us_dedes/miscellanea:misc.Ode7
ltx/en_us_dedes/me.m02.d05:meMA.Ode7C12.text	
ltx/en_us_dedes/me.m02.d05:meMA.Ode7C13.incipit	…
ltx/en_us_dedes/me.m02.d05:meMA.Ode7C13.melody	@ltx/en_us_dedes/he.h.m2:heHE.EikonosChrysis.name
ltx/en_us_dedes/me.m02.d05:meMA.Ode7C13.mode	@ltx/en_us_dedes/miscellanea:misc.Mode2
ltx/en_us_dedes/me.m02.d05:meMA.Ode7C13.ode	@ltx/en_us_dedes/miscellanea:misc.Ode7
ltx/en_us_dedes/me.m02.d05:meMA.Ode7C13.text	
ltx/en_us_dedes/me.m02.d05:meMA.Ode7C1H.greekmelody	@ltx/en_us_dedes/he.h.m2:heHE.EikonosChrysis.greekname
ltx/en_us_dedes/me.m02.d05:meMA.Ode7C1H.incipit	@ltx/en_us_dedes/he.h.m2:heHE.EikonosChrysis.incipit
ltx/en_us_dedes/me.m02.d05:meMA.Ode7C1H.melody	@ltx/en_us_dedes/he.h.m2:heHE.EikonosChrysis.melody
ltx/en_us_dedes/me.m02.d05:meMA.Ode7C1H.mode	@ltx/en_us_dedes/miscellanea:misc.Mode2
ltx/en_us_dedes/me.m02.d05:meMA.Ode7C1H.ode	@ltx/en_us_dedes/miscellanea:misc.Ode7
ltx/en_us_dedes/me.m02.d05:meMA.Ode7C1H.text	@ltx/en_us_dedes/he.h.m2:heHE.EikonosChrysis.text
ltx/en_us_dedes/me.m02.d05:meMA.Ode7C1T.incipit	…
ltx/en_us_dedes/me.m02.d05:meMA.Ode7C1T.melody	@ltx/en_us_dedes/he.h.m2:heHE.EikonosChrysis.name
ltx/en_us_dedes/me.m02.d05:meMA.Ode7C1T.mode	@ltx/en_us_dedes/miscellanea:misc.Mode2
ltx/en_us_dedes/me.m02.d05:meMA.Ode7C1T.ode	@ltx/en_us_dedes/miscellanea:misc.Ode7
ltx/en_us_dedes/me.m02.d05:meMA.Ode7C1T.text	
ltx/en_us_dedes/me.m02.d05:meMA.Ode8C11.greekmelody	@ltx/en_us_dedes/he.h.m2:heHE.TonEnKaminoTouPyros.greekname
ltx/en_us_dedes/me.m02.d05:meMA.Ode8C11.incipit	…
ltx/en_us_dedes/me.m02.d05:meMA.Ode8C11.melody	@ltx/en_us_dedes/he.h.m2:heHE.TonEnKaminoTouPyros.name
ltx/en_us_dedes/me.m02.d05:meMA.Ode8C11.mode	@ltx/en_us_dedes/miscellanea:misc.Mode2
ltx/en_us_dedes/me.m02.d05:meMA.Ode8C11.ode	@ltx/en_us_dedes/miscellanea:misc.Ode8
ltx/en_us_dedes/me.m02.d05:meMA.Ode8C11.text	
ltx/en_us_dedes/me.m02.d05:meMA.Ode8C12.incipit	…
ltx/en_us_dedes/me.m02.d05:meMA.Ode8C12.melody	@ltx/en_us_dedes/he.h.m2:heHE.TonEnKaminoTouPyros.name
ltx/en_us_dedes/me.m02.d05:meMA.Ode8C12.mode	@ltx/en_us_dedes/miscellanea:misc.Mode2
ltx/en_us_dedes/me.m02.d05:meMA.Ode8C12.ode	@ltx/en_us_dedes/miscellanea:misc.Ode8
ltx/en_us_dedes/me.m02.d05:meMA.Ode8C12.text	
ltx/en_us_dedes/me.m02.d05:meMA.Ode8C13.incipit	…
ltx/en_us_dedes/me.m02.d05:meMA.Ode8C13.melody	@ltx/en_us_dedes/he.h.m2:heHE.TonEnKaminoTouPyros.name
ltx/en_us_dedes/me.m02.d05:meMA.Ode8C13.mode	@ltx/en_us_dedes/miscellanea:misc.Mode2
ltx/en_us_dedes/me.m02.d05:meMA.Ode8C13.ode	@ltx/en_us_dedes/miscellanea:misc.Ode8
ltx/en_us_dedes/me.m02.d05:meMA.Ode8C13.text	
ltx/en_us_dedes/me.m02.d05:meMA.Ode8C1H.greekmelody	@ltx/en_us_dedes/he.h.m2:heHE.TonEnKaminoTouPyros.greekname
ltx/en_us_dedes/me.m02.d05:meMA.Ode8C1H.incipit	@ltx/en_us_dedes/he.h.m2:heHE.TonEnKaminoTouPyros.incipit
ltx/en_us_dedes/me.m02.d05:meMA.Ode8C1H.melody	@ltx/en_us_dedes/he.h.m2:heHE.TonEnKaminoTouPyros.melody
ltx/en_us_dedes/me.m02.d05:meMA.Ode8C1H.mode	@ltx/en_us_dedes/miscellanea:misc.Mode2
ltx/en_us_dedes/me.m02.d05:meMA.Ode8C1H.ode	@ltx/en_us_dedes/miscellanea:misc.Ode8
ltx/en_us_dedes/me.m02.d05:meMA.Ode8C1H.text	@ltx/en_us_dedes/he.h.m2:heHE.TonEnKaminoTouPyros.text
ltx/en_us_dedes/me.m02.d05:meMA.Ode8C1T.incipit	…
ltx/en_us_dedes/me.m02.d05:meMA.Ode8C1T.melody	@ltx/en_us_dedes/he.h.m2:heHE.TonEnKaminoTouPyros.name
ltx/en_us_dedes/me.m02.d05:meMA.Ode8C1T.mode	@ltx/en_us_dedes/miscellanea:misc.Mode2
ltx/en_us_dedes/me.m02.d05:meMA.Ode8C1T.ode	@ltx/en_us_dedes/miscellanea:misc.Ode8
ltx/en_us_dedes/me.m02.d05:meMA.Ode8C1T.text	
ltx/en_us_dedes/me.m02.d05:meMA.Ode9C11.greekmelody	@ltx/en_us_dedes/he.h.m2:heHE.TonEkTheouTheonLogon.greekname
ltx/en_us_dedes/me.m02.d05:meMA.Ode9C11.incipit	…
ltx/en_us_dedes/me.m02.d05:meMA.Ode9C11.melody	@ltx/en_us_dedes/he.h.m2:heHE.TonEkTheouTheonLogon.name
ltx/en_us_dedes/me.m02.d05:meMA.Ode9C11.mode	@ltx/en_us_dedes/miscellanea:misc.Mode2
ltx/en_us_dedes/me.m02.d05:meMA.Ode9C11.ode	@ltx/en_us_dedes/miscellanea:misc.Ode9
ltx/en_us_dedes/me.m02.d05:meMA.Ode9C11.text	
ltx/en_us_dedes/me.m02.d05:meMA.Ode9C12.incipit	…
ltx/en_us_dedes/me.m02.d05:meMA.Ode9C12.melody	@ltx/en_us_dedes/he.h.m2:heHE.TonEkTheouTheonLogon.name
ltx/en_us_dedes/me.m02.d05:meMA.Ode9C12.mode	@ltx/en_us_dedes/miscellanea:misc.Mode2
ltx/en_us_dedes/me.m02.d05:meMA.Ode9C12.ode	@ltx/en_us_dedes/miscellanea:misc.Ode9
ltx/en_us_dedes/me.m02.d05:meMA.Ode9C12.text	
ltx/en_us_dedes/me.m02.d05:meMA.Ode9C13.incipit	…
ltx/en_us_dedes/me.m02.d05:meMA.Ode9C13.melody	@ltx/en_us_dedes/he.h.m2:heHE.TonEkTheouTheonLogon.name
ltx/en_us_dedes/me.m02.d05:meMA.Ode9C13.mode	@ltx/en_us_dedes/miscellanea:misc.Mode2
ltx/en_us_dedes/me.m02.d05:meMA.Ode9C13.ode	@ltx/en_us_dedes/miscellanea:misc.Ode9
ltx/en_us_dedes/me.m02.d05:meMA.Ode9C13.text	
ltx/en_us_dedes/me.m02.d05:meMA.Ode9C1H.greekmelody	@ltx/en_us_dedes/he.h.m2:heHE.TonEkTheouTheonLogon.greekname
ltx/en_us_dedes/me.m02.d05:meMA.Ode9C1H.incipit	@ltx/en_us_dedes/he.h.m2:heHE.TonEkTheouTheonLogon.incipit
ltx/en_us_dedes/me.m02.d05:meMA.Ode9C1H.melody	@ltx/en_us_dedes/he.h.m2:heHE.TonEkTheouTheonLogon.melody
ltx/en_us_dedes/me.m02.d05:meMA.Ode9C1H.mode	@ltx/en_us_dedes/miscellanea:misc.Mode2
ltx/en_us_dedes/me.m02.d05:meMA.Ode9C1H.ode	@ltx/en_us_dedes/miscellanea:misc.Ode9
ltx/en_us_dedes/me.m02.d05:meMA.Ode9C1H.text	@ltx/en_us_dedes/he.h.m2:heHE.TonEkTheouTheonLogon.text
ltx/en_us_dedes/me.m02.d05:meMA.Ode9C1T.incipit	…
ltx/en_us_dedes/me.m02.d05:meMA.Ode9C1T.melody	@ltx/en_us_dedes/he.h.m2:heHE.TonEkTheouTheonLogon.name
ltx/en_us_dedes/me.m02.d05:meMA.Ode9C1T.mode	@ltx/en_us_dedes/miscellanea:misc.Mode2
ltx/en_us_dedes/me.m02.d05:meMA.Ode9C1T.ode	@ltx/en_us_dedes/miscellanea:misc.Ode9
ltx/en_us_dedes/me.m02.d05:meMA.Ode9C1T.text	
ltx/en_us_dedes/me.m02.d05:meMA.Oikos1.text	Gleaming with the beauty of chastity, you were admired by all as chosen virgin. You showed that your physical beauty was exceeded by the beauty and fineness of your soul, O all-blessed Agatha, named for goodness. For the love of God, you regarded passing wealth and fleeting glory, and all the pleasures of the world to be but a dream. You took up the Cross of Christ and followed Him in martyrdom. You disregarded the frailty of your body, and showed yourself to be stronger than fire and steel. And being helped from on high, you triumphed over all the power of the enemy. Therefore worthily made wondrous, you work miracles, and you ever save those who salute you: * Rejoice, O Catania’s boast.
ltx/en_us_dedes/me.m02.d05:meVE.Apolytikion1.incipit	@ltx/en_us_dedes/me.m02.d02:meVE.Apolytikion1.incipit
ltx/en_us_dedes/me.m02.d05:meVE.Apolytikion1.melody	
ltx/en_us_dedes/me.m02.d05:meVE.Apolytikion1.mode	@ltx/en_us_dedes/miscellanea:misc.Mode1
ltx/en_us_dedes/me.m02.d05:meVE.Apolytikion1.text	@ltx/en_us_dedes/me.m02.d02:meVE.Apolytikion1.text
ltx/en_us_dedes/me.m02.d05:meVE.Apolytikion2ger.greekmelody	@ltx/en_us_dedes/he.a.m3:heAU.TheiasPisteos.greekname
ltx/en_us_dedes/me.m02.d05:meVE.Apolytikion2ger.incipit	…
ltx/en_us_dedes/me.m02.d05:meVE.Apolytikion2ger.melody	@ltx/en_us_dedes/he.a.m3:heAU.TheiasPisteos.name
ltx/en_us_dedes/me.m02.d05:meVE.Apolytikion2ger.mode	@ltx/en_us_dedes/miscellanea:misc.Mode3
ltx/en_us_dedes/me.m02.d05:meVE.Apolytikion2ger.poet	@ltx/en_us_dedes/poets:po.Gerasimou
ltx/en_us_dedes/me.m02.d05:meVE.Apolytikion2ger.text	
ltx/en_us_dedes/me.m02.d05:meVE.AposGlory.incipit	@ltx/en_us_dedes/me.m02.d02:meVE.Lity8.incipit
ltx/en_us_dedes/me.m02.d05:meVE.AposGlory.melody	
ltx/en_us_dedes/me.m02.d05:meVE.AposGlory.mode	@ltx/en_us_dedes/miscellanea:misc.Mode4
ltx/en_us_dedes/me.m02.d05:meVE.AposGlory.poet	@ltx/en_us_dedes/poets:po.AndreouKritis
ltx/en_us_dedes/me.m02.d05:meVE.AposGlory.text	@ltx/en_us_dedes/me.m02.d02:meVE.Lity8.text
ltx/en_us_dedes/me.m02.d05:meVE.Aposticha1.greekmelody	@ltx/en_us_dedes/he.a.m1:heAU.PaneffimoiMartyres.greekname
ltx/en_us_dedes/me.m02.d05:meVE.Aposticha1.incipit	…
ltx/en_us_dedes/me.m02.d05:meVE.Aposticha1.melody	@ltx/en_us_dedes/he.a.m1:heAU.PaneffimoiMartyres.name
ltx/en_us_dedes/me.m02.d05:meVE.Aposticha1.mode	@ltx/en_us_dedes/miscellanea:misc.Mode1
ltx/en_us_dedes/me.m02.d05:meVE.Aposticha1.text	
ltx/en_us_dedes/me.m02.d05:meVE.Aposticha2.incipit	…
ltx/en_us_dedes/me.m02.d05:meVE.Aposticha2.melody	@ltx/en_us_dedes/he.a.m1:heAU.PaneffimoiMartyres.name
ltx/en_us_dedes/me.m02.d05:meVE.Aposticha2.mode	@ltx/en_us_dedes/miscellanea:misc.Mode1
ltx/en_us_dedes/me.m02.d05:meVE.Aposticha2.text	
ltx/en_us_dedes/me.m02.d05:meVE.Aposticha3.incipit	…
ltx/en_us_dedes/me.m02.d05:meVE.Aposticha3.melody	@ltx/en_us_dedes/he.a.m1:heAU.PaneffimoiMartyres.name
ltx/en_us_dedes/me.m02.d05:meVE.Aposticha3.mode	@ltx/en_us_dedes/miscellanea:misc.Mode1
ltx/en_us_dedes/me.m02.d05:meVE.Aposticha3.text	
ltx/en_us_dedes/me.m02.d05:meVE.SticBoth.incipit	@ltx/en_us_dedes/me.m02.d02:meVE.AposGlory.incipit
ltx/en_us_dedes/me.m02.d05:meVE.SticBoth.melody	
ltx/en_us_dedes/me.m02.d05:meVE.SticBoth.mode	@ltx/en_us_dedes/miscellanea:misc.Mode8
ltx/en_us_dedes/me.m02.d05:meVE.SticBoth.poet	@ltx/en_us_dedes/poets:po.AndreouKritis
ltx/en_us_dedes/me.m02.d05:meVE.SticBoth.text	@ltx/en_us_dedes/me.m02.d02:meVE.AposGlory.text
ltx/en_us_dedes/me.m02.d05:meVE.SticGlory.incipit	A marvelous miracle occurred at…
ltx/en_us_dedes/me.m02.d05:meVE.SticGlory.melody	
ltx/en_us_dedes/me.m02.d05:meVE.SticGlory.mode	@ltx/en_us_dedes/miscellanea:misc.Mode8
ltx/en_us_dedes/me.m02.d05:meVE.SticGlory.poet	@ltx/en_us_dedes/poets:po.Sykeotou
ltx/en_us_dedes/me.m02.d05:meVE.SticGlory.text	A marvelous miracle occurred at the contest of Agatha, the all-glorious Martyr of Christ God, similar to that of Moses. Of old, when Moses gave the Law to the people at the mountain, he received the Scriptures inscribed by God on tablets; and now an Angel from heaven brought to her grave a tablet, inscribed with these words: A devout mind, self-determining, honor from God, and the deliverance of her homeland.
ltx/en_us_dedes/me.m02.d05:meVE.SticStavrotheotokion.greekmelody	@ltx/en_us_dedes/he.a.m4:heAU.EdokasSimeiosin.greekname
ltx/en_us_dedes/me.m02.d05:meVE.SticStavrotheotokion.incipit	@ltx/en_us_dedes/me.m02.d03:meVE.SticStavrotheotokion.incipit
ltx/en_us_dedes/me.m02.d05:meVE.SticStavrotheotokion.melody	@ltx/en_us_dedes/he.a.m4:heAU.EdokasSimeiosin.name
ltx/en_us_dedes/me.m02.d05:meVE.SticStavrotheotokion.mode	@ltx/en_us_dedes/miscellanea:misc.Mode4
ltx/en_us_dedes/me.m02.d05:meVE.SticStavrotheotokion.text	@ltx/en_us_dedes/me.m02.d03:meVE.SticStavrotheotokion.text
ltx/en_us_dedes/me.m02.d05:meVE.SticTheotokion.greekmelody	@ltx/en_us_dedes/he.a.m4:heAU.EdokasSimeiosin.greekname
ltx/en_us_dedes/me.m02.d05:meVE.SticTheotokion.incipit	@ltx/en_us_dedes/me.m02.d03:meVE.SticTheotokion.incipit
ltx/en_us_dedes/me.m02.d05:meVE.SticTheotokion.melody	@ltx/en_us_dedes/he.a.m4:heAU.EdokasSimeiosin.name
ltx/en_us_dedes/me.m02.d05:meVE.SticTheotokion.mode	@ltx/en_us_dedes/miscellanea:misc.Mode4
ltx/en_us_dedes/me.m02.d05:meVE.SticTheotokion.text	@ltx/en_us_dedes/me.m02.d03:meVE.SticTheotokion.text
ltx/en_us_dedes/me.m02.d05:meVE.Stichera01.greekmelody	@ltx/en_us_dedes/he.a.m4:heAU.EdokasSimeiosin.greekname
ltx/en_us_dedes/me.m02.d05:meVE.Stichera01.incipit	@ltx/en_us_dedes/me.m02.d02:meMA.Lauds1.incipit
ltx/en_us_dedes/me.m02.d05:meVE.Stichera01.melody	@ltx/en_us_dedes/he.a.m4:heAU.EdokasSimeiosin.name
ltx/en_us_dedes/me.m02.d05:meVE.Stichera01.mode	@ltx/en_us_dedes/miscellanea:misc.Mode4
ltx/en_us_dedes/me.m02.d05:meVE.Stichera01.text	@ltx/en_us_dedes/me.m02.d02:meMA.Lauds1.text
ltx/en_us_dedes/me.m02.d05:meVE.Stichera02.incipit	@ltx/en_us_dedes/me.m02.d02:meMA.Lauds2.incipit
ltx/en_us_dedes/me.m02.d05:meVE.Stichera02.melody	@ltx/en_us_dedes/he.a.m4:heAU.EdokasSimeiosin.name
ltx/en_us_dedes/me.m02.d05:meVE.Stichera02.mode	@ltx/en_us_dedes/miscellanea:misc.Mode4
ltx/en_us_dedes/me.m02.d05:meVE.Stichera02.text	@ltx/en_us_dedes/me.m02.d02:meMA.Lauds2.text
ltx/en_us_dedes/me.m02.d05:meVE.Stichera03.incipit	@ltx/en_us_dedes/me.m02.d02:meMA.Lauds2.incipit
ltx/en_us_dedes/me.m02.d05:meVE.Stichera03.melody	@ltx/en_us_dedes/he.a.m4:heAU.EdokasSimeiosin.name
ltx/en_us_dedes/me.m02.d05:meVE.Stichera03.mode	@ltx/en_us_dedes/miscellanea:misc.Mode4
ltx/en_us_dedes/me.m02.d05:meVE.Stichera03.text	@ltx/en_us_dedes/me.m02.d02:meMA.Lauds2.text
ltx/en_us_dedes/me.m02.d05:meVE.Stichera04.greekmelody	@ltx/en_us_dedes/he.a.m4:heAU.EdokasSimeiosin.greekname
ltx/en_us_dedes/me.m02.d05:meVE.Stichera04.incipit	You preserved your body undefiled…
ltx/en_us_dedes/me.m02.d05:meVE.Stichera04.melody	@ltx/en_us_dedes/he.a.m4:heAU.EdokasSimeiosin.name
ltx/en_us_dedes/me.m02.d05:meVE.Stichera04.mode	@ltx/en_us_dedes/miscellanea:misc.Mode4
ltx/en_us_dedes/me.m02.d05:meVE.Stichera04.text	You preserved your body undefiled, O Bride of God Agatha, * for your Bridegroom and Master Christ. * You were with virginity’s beauty decorated. * Splendidly adorned in the gleaming rays of martyrdom, * to the divine bridal chamber you advanced. * And therefore we now celebrate worldwide feast of your memory, * glorifying the Savior who glorifies you forevermore.
ltx/en_us_dedes/me.m02.d05:meVE.Stichera05.incipit	You endured the mutilation of…
ltx/en_us_dedes/me.m02.d05:meVE.Stichera05.melody	@ltx/en_us_dedes/he.a.m4:heAU.EdokasSimeiosin.name
ltx/en_us_dedes/me.m02.d05:meVE.Stichera05.mode	@ltx/en_us_dedes/miscellanea:misc.Mode4
ltx/en_us_dedes/me.m02.d05:meVE.Stichera05.text	You endured the mutilation of your body, the cutting off * of your breast, and the burning fire, * O glorious Martyr Saint * Agatha; your heart’s eyes * foresaw the eternal rewards and blessedness on high, * promised to those who endure until the end, * and also the unwithering halo that Christ now has given you, * who competed most splendidly * for His sake, O all-lauded one.
ltx/en_us_dedes/me.m02.d05:meVE.Stichera06.incipit	Agatha, by your entreaties you…
ltx/en_us_dedes/me.m02.d05:meVE.Stichera06.melody	@ltx/en_us_dedes/he.a.m4:heAU.EdokasSimeiosin.name
ltx/en_us_dedes/me.m02.d05:meVE.Stichera06.mode	@ltx/en_us_dedes/miscellanea:misc.Mode4
ltx/en_us_dedes/me.m02.d05:meVE.Stichera06.text	Agatha, by your entreaties you stilled Etna’s volcanic fires, * its eruptions and lava flow, * and thus, holy Martyr you delivered your city, * which honors your relic, from which its people all enjoy * rivers of cures by the Holy Spirit’s grace. * For it was in that city that you won your contest, all-lauded Saint, * and you humbled the tyrant there, * and were crowned for you victory.
