ltx/en_us_dedes/sy.m01.d02:cl.syMA.commemoration01.narration.p01	
ltx/en_us_dedes/sy.m01.d02:cl.syMA.commemoration01.narration.p02	
ltx/en_us_dedes/sy.m01.d02:cl.syMA.commemoration01.narration.p03	
ltx/en_us_dedes/sy.m01.d02:cl.syMA.commemoration01.narration.p04	
ltx/en_us_dedes/sy.m01.d02:cl.syMA.commemoration01.narration.p05	
ltx/en_us_dedes/sy.m01.d02:cl.syMA.commemoration01.narration.p06	
ltx/en_us_dedes/sy.m01.d02:cl.syMA.commemoration01.narration.p07	
ltx/en_us_dedes/sy.m01.d02:cl.syMA.commemoration01.text	[saint/com 1]
ltx/en_us_dedes/sy.m01.d02:cl.syMA.commemoration02.narration.p01	
ltx/en_us_dedes/sy.m01.d02:cl.syMA.commemoration02.narration.p02	
ltx/en_us_dedes/sy.m01.d02:cl.syMA.commemoration02.narration.p03	
ltx/en_us_dedes/sy.m01.d02:cl.syMA.commemoration02.narration.p04	
ltx/en_us_dedes/sy.m01.d02:cl.syMA.commemoration02.narration.p05	
ltx/en_us_dedes/sy.m01.d02:cl.syMA.commemoration02.narration.p06	
ltx/en_us_dedes/sy.m01.d02:cl.syMA.commemoration02.narration.p07	
ltx/en_us_dedes/sy.m01.d02:cl.syMA.commemoration02.text	[saint/com 2]
ltx/en_us_dedes/sy.m01.d02:cl.syMA.commemoration03.narration.p01	
ltx/en_us_dedes/sy.m01.d02:cl.syMA.commemoration03.narration.p02	
ltx/en_us_dedes/sy.m01.d02:cl.syMA.commemoration03.narration.p03	
ltx/en_us_dedes/sy.m01.d02:cl.syMA.commemoration03.narration.p04	
ltx/en_us_dedes/sy.m01.d02:cl.syMA.commemoration03.narration.p05	
ltx/en_us_dedes/sy.m01.d02:cl.syMA.commemoration03.narration.p06	
ltx/en_us_dedes/sy.m01.d02:cl.syMA.commemoration03.narration.p07	
ltx/en_us_dedes/sy.m01.d02:cl.syMA.commemoration03.text	[saint/com 3]
ltx/en_us_dedes/sy.m01.d02:cl.syMA.commemoration04.narration.p01	
ltx/en_us_dedes/sy.m01.d02:cl.syMA.commemoration04.narration.p02	
ltx/en_us_dedes/sy.m01.d02:cl.syMA.commemoration04.narration.p03	
ltx/en_us_dedes/sy.m01.d02:cl.syMA.commemoration04.narration.p04	
ltx/en_us_dedes/sy.m01.d02:cl.syMA.commemoration04.narration.p05	
ltx/en_us_dedes/sy.m01.d02:cl.syMA.commemoration04.narration.p06	
ltx/en_us_dedes/sy.m01.d02:cl.syMA.commemoration04.narration.p07	
ltx/en_us_dedes/sy.m01.d02:cl.syMA.commemoration04.text	[saint/com 4]
ltx/en_us_dedes/sy.m01.d02:cl.syMA.commemoration05.narration.p01	
ltx/en_us_dedes/sy.m01.d02:cl.syMA.commemoration05.narration.p02	
ltx/en_us_dedes/sy.m01.d02:cl.syMA.commemoration05.narration.p03	
ltx/en_us_dedes/sy.m01.d02:cl.syMA.commemoration05.narration.p04	
ltx/en_us_dedes/sy.m01.d02:cl.syMA.commemoration05.narration.p05	
ltx/en_us_dedes/sy.m01.d02:cl.syMA.commemoration05.narration.p06	
ltx/en_us_dedes/sy.m01.d02:cl.syMA.commemoration05.narration.p07	
ltx/en_us_dedes/sy.m01.d02:cl.syMA.commemoration05.text	[saint/com 5]
ltx/en_us_dedes/sy.m01.d02:cl.syMA.commemoration06.text	[saint/com list]
ltx/en_us_dedes/sy.m01.d02:syMA.commemoration01.couplet1.title	@ltx/en_us_dedes/titles:ti.Verses
ltx/en_us_dedes/sy.m01.d02:syMA.commemoration01.couplet1.verse1	
ltx/en_us_dedes/sy.m01.d02:syMA.commemoration01.couplet1.verse2	
ltx/en_us_dedes/sy.m01.d02:syMA.commemoration01.narration.p01	
ltx/en_us_dedes/sy.m01.d02:syMA.commemoration01.single1	
ltx/en_us_dedes/sy.m01.d02:syMA.commemoration01.text	On January 2, we commemorate our father among the saints Silvester, Pope of Rome.
ltx/en_us_dedes/sy.m01.d02:syMA.commemoration02.couplet1.title	@ltx/en_us_dedes/titles:ti.Verses
ltx/en_us_dedes/sy.m01.d02:syMA.commemoration02.couplet1.verse1	
ltx/en_us_dedes/sy.m01.d02:syMA.commemoration02.couplet1.verse2	
ltx/en_us_dedes/sy.m01.d02:syMA.commemoration02.narration.p01	
ltx/en_us_dedes/sy.m01.d02:syMA.commemoration02.text	On this day we commemorate the holy hieromartyr Theagenes.
ltx/en_us_dedes/sy.m01.d02:syMA.commemoration03.couplet1.title	@ltx/en_us_dedes/titles:ti.Verses
ltx/en_us_dedes/sy.m01.d02:syMA.commemoration03.couplet1.verse1	
ltx/en_us_dedes/sy.m01.d02:syMA.commemoration03.couplet1.verse2	
ltx/en_us_dedes/sy.m01.d02:syMA.commemoration03.couplet2.verse1	
ltx/en_us_dedes/sy.m01.d02:syMA.commemoration03.couplet2.verse2	
ltx/en_us_dedes/sy.m01.d02:syMA.commemoration03.text	On this day Saints Theopemptos and Theodota, the mother of the holy Unmercenaries, reposed in peace.
ltx/en_us_dedes/sy.m01.d02:syMA.commemoration04.couplet1.title	@ltx/en_us_dedes/titles:ti.Verses
ltx/en_us_dedes/sy.m01.d02:syMA.commemoration04.couplet1.verse1	
ltx/en_us_dedes/sy.m01.d02:syMA.commemoration04.couplet1.verse2	
ltx/en_us_dedes/sy.m01.d02:syMA.commemoration04.text	On this day devout St. Mark the Deaf reposed in peace.
ltx/en_us_dedes/sy.m01.d02:syMA.commemoration05.couplet1.title	@ltx/en_us_dedes/titles:ti.Verses
ltx/en_us_dedes/sy.m01.d02:syMA.commemoration05.couplet1.verse1	
ltx/en_us_dedes/sy.m01.d02:syMA.commemoration05.couplet1.verse2	
ltx/en_us_dedes/sy.m01.d02:syMA.commemoration05.narration.p01	
ltx/en_us_dedes/sy.m01.d02:syMA.commemoration05.text	On this day we also commemorate holy martyr Basil of Ancyra.
ltx/en_us_dedes/sy.m01.d02:syMA.commemoration06.couplet1.title	@ltx/en_us_dedes/titles:ti.Verses
ltx/en_us_dedes/sy.m01.d02:syMA.commemoration06.couplet1.verse1	
ltx/en_us_dedes/sy.m01.d02:syMA.commemoration06.couplet1.verse2	
ltx/en_us_dedes/sy.m01.d02:syMA.commemoration06.text	On this day Saint Sergios died by the sword.
ltx/en_us_dedes/sy.m01.d02:syMA.commemoration07.couplet1.title	@ltx/en_us_dedes/titles:ti.Verses
ltx/en_us_dedes/sy.m01.d02:syMA.commemoration07.couplet1.verse1	
ltx/en_us_dedes/sy.m01.d02:syMA.commemoration07.couplet1.verse2	
ltx/en_us_dedes/sy.m01.d02:syMA.commemoration07.text	On this day Saint Theopistos died by stoning.
ltx/en_us_dedes/sy.m01.d02:syMA.commemoration08.couplet1.title	@ltx/en_us_dedes/titles:ti.Verses
ltx/en_us_dedes/sy.m01.d02:syMA.commemoration08.couplet1.verse1	
ltx/en_us_dedes/sy.m01.d02:syMA.commemoration08.couplet1.verse2	
ltx/en_us_dedes/sy.m01.d02:syMA.commemoration08.text	On this day we also commemorate our devout Father Cosmas, Archbishop of Constantinople, the Wonderworker, of the august Monastery of Chora.
ltx/en_us_dedes/sy.m01.d02:syMA.commemoration09.couplet1.title	@ltx/en_us_dedes/titles:ti.Verses
ltx/en_us_dedes/sy.m01.d02:syMA.commemoration09.couplet1.verse1	
ltx/en_us_dedes/sy.m01.d02:syMA.commemoration09.couplet1.verse2	
ltx/en_us_dedes/sy.m01.d02:syMA.commemoration09.text	We also commemorate the holy Neomartyr George Giourtze, who died by hanging in Mytilene in the year 1770.
ltx/en_us_dedes/sy.m01.d02:syMA.lastline	By the intercessions of Your Saints, O God, have mercy on us.
