ltx/en_us_dedes/sy.m02.d10:cl.syMA.commemoration01.text	[saint/com 1]
ltx/en_us_dedes/sy.m02.d10:cl.syMA.commemoration02.text	[saint/com 2]
ltx/en_us_dedes/sy.m02.d10:cl.syMA.commemoration03.text	[saint/com 3]
ltx/en_us_dedes/sy.m02.d10:cl.syMA.commemoration04.text	[saint/com 4]
ltx/en_us_dedes/sy.m02.d10:cl.syMA.commemoration05.text	[saint/com 5]
ltx/en_us_dedes/sy.m02.d10:cl.syMA.commemoration06.text	[saint/com list]
ltx/en_us_dedes/sy.m02.d10:syMA.commemoration01.couplet1.title	@ltx/en_us_dedes/titles:ti.Verses
ltx/en_us_dedes/sy.m02.d10:syMA.commemoration01.couplet1.verse1	
ltx/en_us_dedes/sy.m02.d10:syMA.commemoration01.couplet1.verse2	
ltx/en_us_dedes/sy.m02.d10:syMA.commemoration01.narration.p01	
ltx/en_us_dedes/sy.m02.d10:syMA.commemoration01.single1	
ltx/en_us_dedes/sy.m02.d10:syMA.commemoration01.text	On February 10, we commemorate the holy Hieromartyr Haralambos.
ltx/en_us_dedes/sy.m02.d10:syMA.commemoration02.couplet1.title	@ltx/en_us_dedes/titles:ti.Verses
ltx/en_us_dedes/sy.m02.d10:syMA.commemoration02.couplet1.verse1	
ltx/en_us_dedes/sy.m02.d10:syMA.commemoration02.couplet1.verse2	
ltx/en_us_dedes/sy.m02.d10:syMA.commemoration02.text	On this day the holy Martyrs Baptos and Porphyrios, who had tortured St. Haralambos, died by the sword.
ltx/en_us_dedes/sy.m02.d10:syMA.commemoration03.couplet1.title	@ltx/en_us_dedes/titles:ti.Verses
ltx/en_us_dedes/sy.m02.d10:syMA.commemoration03.couplet1.verse1	
ltx/en_us_dedes/sy.m02.d10:syMA.commemoration03.couplet1.verse2	
ltx/en_us_dedes/sy.m02.d10:syMA.commemoration03.text	On this day the three holy women who believed [through St. Haralambos] died by the sword.
ltx/en_us_dedes/sy.m02.d10:syMA.commemoration04.couplet1.title	@ltx/en_us_dedes/titles:ti.Verses
ltx/en_us_dedes/sy.m02.d10:syMA.commemoration04.couplet1.verse1	
ltx/en_us_dedes/sy.m02.d10:syMA.commemoration04.couplet1.verse2	
ltx/en_us_dedes/sy.m02.d10:syMA.commemoration04.couplet2.verse1	
ltx/en_us_dedes/sy.m02.d10:syMA.commemoration04.couplet2.verse2	
ltx/en_us_dedes/sy.m02.d10:syMA.commemoration04.narration.p01	
ltx/en_us_dedes/sy.m02.d10:syMA.commemoration04.narration.p02	
ltx/en_us_dedes/sy.m02.d10:syMA.commemoration04.text	On this day we also commemorate the holy Martyrs and virgins Ennatha, Valentina, and Paul.
ltx/en_us_dedes/sy.m02.d10:syMA.commemoration05.couplet1.title	@ltx/en_us_dedes/titles:ti.Verses
ltx/en_us_dedes/sy.m02.d10:syMA.commemoration05.couplet1.verse1	
ltx/en_us_dedes/sy.m02.d10:syMA.commemoration05.couplet1.verse2	
ltx/en_us_dedes/sy.m02.d10:syMA.commemoration05.text	On this day we also commemorate our father among the saints Anastasios, Archbishop of Constantinople.
ltx/en_us_dedes/sy.m02.d10:syMA.commemoration06.couplet1.title	@ltx/en_us_dedes/titles:ti.Verses
ltx/en_us_dedes/sy.m02.d10:syMA.commemoration06.couplet1.verse1	
ltx/en_us_dedes/sy.m02.d10:syMA.commemoration06.couplet1.verse2	
ltx/en_us_dedes/sy.m02.d10:syMA.commemoration06.narration.p01	
ltx/en_us_dedes/sy.m02.d10:syMA.commemoration06.text	On this day we also commemorate our devout father Zeno the courier.
ltx/en_us_dedes/sy.m02.d10:syMA.lastline	By the intercessions of Your saints, O God, have mercy on us. Amen.
