ltx/en_us_dedes/ho.ho22:hoSA.LastHymn.incipit	@ltx/en_us_dedes/he.a.m3:heAU.TinOraiotita.incipit
ltx/en_us_dedes/ho.ho22:hoSA.LastHymn.melody	@ltx/en_us_dedes/he.a.m3:heAU.TinOraiotita.melody
ltx/en_us_dedes/ho.ho22:hoSA.LastHymn.mode	@ltx/en_us_dedes/miscellanea:misc.Mode3
ltx/en_us_dedes/ho.ho22:hoSA.LastHymn.text	@ltx/en_us_dedes/he.a.m3:heAU.TinOraiotita.text
ltx/en_us_dedes/ho.ho22:hoSA.R01	The Salutations to the Most Holy Theotokos are frequently recited as a private devotion, and also inserted into the service of Compline. When recited as a personal devotion, simply read the entire poem as presented. In the context of Small Compline, the Salutations may be inserted after the Creed; in the context of Great Compline, after the Small Doxology. A designated reader stands before an icon of the Theotokos and simply reads each troparion or oikos, and a second reader repeats the appropriate refrain, simply intoning it.
ltx/en_us_dedes/ho.ho22:hoSA.title1	The Service
ltx/en_us_dedes/ho.ho22:hoSA.title2	of the Akathist Hymn
ltx/en_us_dedes/ho.ho22:hoSA.title3	of the Salutations
ltx/en_us_dedes/ho.ho22:hoSA.title4	to the Most Holy Theotokos
ltx/en_us_dedes/ho.ho22:hoSA.title5	Salutations to the Most Holy Theotokos
