ltx/en_us_dedes/me.m02.d20:meDA.commemoration.first	Memory of Saint Leo of Catania
ltx/en_us_dedes/me.m02.d20:meDA.commemoration.first_name	
ltx/en_us_dedes/me.m02.d20:meDA.commemoration.first_short	Memory of Saint Leo of Catania
ltx/en_us_dedes/me.m02.d20:meDA.commemoration.first_title	@ltx/en_us_dedes/titles:ti.SaintM
ltx/en_us_dedes/me.m02.d20:meDA.commemoration.full	Memory of our Father among the Saints Leo, Bishop of Catania
ltx/en_us_dedes/me.m02.d20:meDA.commemoration.second_name	
ltx/en_us_dedes/me.m02.d20:meDA.commemoration.second_title	
ltx/en_us_dedes/me.m02.d20:meDA.date	February 20
ltx/en_us_dedes/me.m02.d20:meDA.fordate	for February 20
ltx/en_us_dedes/me.m02.d20:meDA.insert1	
ltx/en_us_dedes/me.m02.d20:meDA.insert2	
ltx/en_us_dedes/me.m02.d20:meDA.note	
ltx/en_us_dedes/me.m02.d20:meDA.pdfcoverdate	February 20,
ltx/en_us_dedes/me.m02.d20:meDA.pdfheaderdate	February 20
ltx/en_us_dedes/me.m02.d20:meHO.commemorations	
ltx/en_us_dedes/me.m02.d20:meHO.note1	
ltx/en_us_dedes/me.m02.d20:meHO.note2	
ltx/en_us_dedes/me.m02.d20:meHO.number	
ltx/en_us_dedes/me.m02.d20:meHO.rank	
ltx/en_us_dedes/me.m02.d20:meLE.commemoration1	
ltx/en_us_dedes/me.m02.d20:meLE.commemoration2	
ltx/en_us_dedes/me.m02.d20:meLI.Kontakion1.greekmelody	@ltx/en_us_dedes/me.m02.d20:meMA.Kontakion1.greekmelody
ltx/en_us_dedes/me.m02.d20:meLI.Kontakion1.incipit	@ltx/en_us_dedes/me.m02.d20:meMA.Kontakion1.incipit
ltx/en_us_dedes/me.m02.d20:meLI.Kontakion1.melody	@ltx/en_us_dedes/me.m02.d20:meMA.Kontakion1.melody
ltx/en_us_dedes/me.m02.d20:meLI.Kontakion1.mode	@ltx/en_us_dedes/me.m02.d20:meMA.Kontakion1.mode
ltx/en_us_dedes/me.m02.d20:meLI.Kontakion1.text	@ltx/en_us_dedes/me.m02.d20:meMA.Kontakion1.text
ltx/en_us_dedes/me.m02.d20:meLI.Megalynarion.text	
ltx/en_us_dedes/me.m02.d20:meMA.C1.acrostic.notice1	
ltx/en_us_dedes/me.m02.d20:meMA.C1.acrostic.text	
ltx/en_us_dedes/me.m02.d20:meMA.C1.acrostic.title	
ltx/en_us_dedes/me.m02.d20:meMA.C1.title	@ltx/en_us_dedes/titles:ti.CanonSaintM
ltx/en_us_dedes/me.m02.d20:meMA.C1.verse	@ltx/en_us_dedes/prayers:pr.verse_SaintM.text
ltx/en_us_dedes/me.m02.d20:meMA.ExapTheotokion.incipit	Catania’s resplendent star that brightly…
ltx/en_us_dedes/me.m02.d20:meMA.ExapTheotokion.melody	@ltx/en_us_dedes/he.a.m2:heAU.GynaikesAkoutisthite.name
ltx/en_us_dedes/me.m02.d20:meMA.ExapTheotokion.mode	@ltx/en_us_dedes/miscellanea:misc.Mode2
ltx/en_us_dedes/me.m02.d20:meMA.ExapTheotokion.text	Catania’s resplendent star that brightly shines throughout the world, * the Bishop and wonder-worker, * the Holy Trinity’s mystic, * St. Leo publicly proclaimed, in soul and body, heart and mind, * that you, O pure one, are literally * Theotokos, whom we all now * extol as our God’s true Mother.
ltx/en_us_dedes/me.m02.d20:meMA.Exaposteilarion1.greekmelody	@ltx/en_us_dedes/he.a.m2:heAU.GynaikesAkoutisthite.greekname
ltx/en_us_dedes/me.m02.d20:meMA.Exaposteilarion1.incipit	The Church of Christ considers…
ltx/en_us_dedes/me.m02.d20:meMA.Exaposteilarion1.melody	@ltx/en_us_dedes/he.a.m2:heAU.GynaikesAkoutisthite.name
ltx/en_us_dedes/me.m02.d20:meMA.Exaposteilarion1.mode	@ltx/en_us_dedes/miscellanea:misc.Mode2
ltx/en_us_dedes/me.m02.d20:meMA.Exaposteilarion1.text	The Church of Christ considers you to be a leading Hierarch, * a guiding light, and a Teacher, * O Hierarch, true and holy. * You shepherded her children well, O devout Father, leading them * to the pastures of salvation, * and drove away the heretics * like savage beasts, from the sheepfold, * O godly-minded St. Leo.
ltx/en_us_dedes/me.m02.d20:meMA.Kontakion1.greekmelody	@ltx/en_us_dedes/he.a.m6:heAU.TinEnPresveiais.greekname
ltx/en_us_dedes/me.m02.d20:meMA.Kontakion1.incipit	…
ltx/en_us_dedes/me.m02.d20:meMA.Kontakion1.melody	@ltx/en_us_dedes/he.a.m6:heAU.TinEnPresveiais.name
ltx/en_us_dedes/me.m02.d20:meMA.Kontakion1.mode	@ltx/en_us_dedes/miscellanea:misc.Mode2
ltx/en_us_dedes/me.m02.d20:meMA.Kontakion1.text	
ltx/en_us_dedes/me.m02.d20:meMA.Ode1C11.greekmelody	@ltx/en_us_dedes/he.h.m8:heHE.YgranDiodefsas.greekname
ltx/en_us_dedes/me.m02.d20:meMA.Ode1C11.incipit	…
ltx/en_us_dedes/me.m02.d20:meMA.Ode1C11.melody	@ltx/en_us_dedes/he.h.m8:heHE.YgranDiodefsas.name
ltx/en_us_dedes/me.m02.d20:meMA.Ode1C11.mode	@ltx/en_us_dedes/miscellanea:misc.Mode8
ltx/en_us_dedes/me.m02.d20:meMA.Ode1C11.ode	@ltx/en_us_dedes/miscellanea:misc.Ode1
ltx/en_us_dedes/me.m02.d20:meMA.Ode1C11.text	
ltx/en_us_dedes/me.m02.d20:meMA.Ode1C12.incipit	…
ltx/en_us_dedes/me.m02.d20:meMA.Ode1C12.melody	@ltx/en_us_dedes/he.h.m8:heHE.YgranDiodefsas.name
ltx/en_us_dedes/me.m02.d20:meMA.Ode1C12.mode	@ltx/en_us_dedes/miscellanea:misc.Mode8
ltx/en_us_dedes/me.m02.d20:meMA.Ode1C12.ode	@ltx/en_us_dedes/miscellanea:misc.Ode1
ltx/en_us_dedes/me.m02.d20:meMA.Ode1C12.text	
ltx/en_us_dedes/me.m02.d20:meMA.Ode1C13.incipit	…
ltx/en_us_dedes/me.m02.d20:meMA.Ode1C13.melody	@ltx/en_us_dedes/he.h.m8:heHE.YgranDiodefsas.name
ltx/en_us_dedes/me.m02.d20:meMA.Ode1C13.mode	@ltx/en_us_dedes/miscellanea:misc.Mode8
ltx/en_us_dedes/me.m02.d20:meMA.Ode1C13.ode	@ltx/en_us_dedes/miscellanea:misc.Ode1
ltx/en_us_dedes/me.m02.d20:meMA.Ode1C13.text	
ltx/en_us_dedes/me.m02.d20:meMA.Ode1C1H.greekmelody	@ltx/en_us_dedes/he.h.m8:heHE.YgranDiodefsas.greekname
ltx/en_us_dedes/me.m02.d20:meMA.Ode1C1H.incipit	@ltx/en_us_dedes/he.h.m8:heHE.YgranDiodefsas.incipit
ltx/en_us_dedes/me.m02.d20:meMA.Ode1C1H.melody	@ltx/en_us_dedes/he.h.m8:heHE.YgranDiodefsas.melody
ltx/en_us_dedes/me.m02.d20:meMA.Ode1C1H.mode	@ltx/en_us_dedes/miscellanea:misc.Mode8
ltx/en_us_dedes/me.m02.d20:meMA.Ode1C1H.ode	@ltx/en_us_dedes/miscellanea:misc.Ode1
ltx/en_us_dedes/me.m02.d20:meMA.Ode1C1H.text	@ltx/en_us_dedes/he.h.m8:heHE.YgranDiodefsas.text
ltx/en_us_dedes/me.m02.d20:meMA.Ode1C1T.incipit	…
ltx/en_us_dedes/me.m02.d20:meMA.Ode1C1T.melody	@ltx/en_us_dedes/he.h.m8:heHE.YgranDiodefsas.name
ltx/en_us_dedes/me.m02.d20:meMA.Ode1C1T.mode	@ltx/en_us_dedes/miscellanea:misc.Mode8
ltx/en_us_dedes/me.m02.d20:meMA.Ode1C1T.ode	@ltx/en_us_dedes/miscellanea:misc.Ode1
ltx/en_us_dedes/me.m02.d20:meMA.Ode1C1T.text	
ltx/en_us_dedes/me.m02.d20:meMA.Ode3C11.greekmelody	@ltx/en_us_dedes/he.h.m8:heHE.OuraniasApsidos.greekname
ltx/en_us_dedes/me.m02.d20:meMA.Ode3C11.incipit	…
ltx/en_us_dedes/me.m02.d20:meMA.Ode3C11.melody	@ltx/en_us_dedes/he.h.m8:heHE.OuraniasApsidos.name
ltx/en_us_dedes/me.m02.d20:meMA.Ode3C11.mode	@ltx/en_us_dedes/miscellanea:misc.Mode8
ltx/en_us_dedes/me.m02.d20:meMA.Ode3C11.ode	@ltx/en_us_dedes/miscellanea:misc.Ode3
ltx/en_us_dedes/me.m02.d20:meMA.Ode3C11.text	
ltx/en_us_dedes/me.m02.d20:meMA.Ode3C12.incipit	…
ltx/en_us_dedes/me.m02.d20:meMA.Ode3C12.melody	@ltx/en_us_dedes/he.h.m8:heHE.OuraniasApsidos.name
ltx/en_us_dedes/me.m02.d20:meMA.Ode3C12.mode	@ltx/en_us_dedes/miscellanea:misc.Mode8
ltx/en_us_dedes/me.m02.d20:meMA.Ode3C12.ode	@ltx/en_us_dedes/miscellanea:misc.Ode3
ltx/en_us_dedes/me.m02.d20:meMA.Ode3C12.text	
ltx/en_us_dedes/me.m02.d20:meMA.Ode3C13.incipit	…
ltx/en_us_dedes/me.m02.d20:meMA.Ode3C13.melody	@ltx/en_us_dedes/he.h.m8:heHE.OuraniasApsidos.name
ltx/en_us_dedes/me.m02.d20:meMA.Ode3C13.mode	@ltx/en_us_dedes/miscellanea:misc.Mode8
ltx/en_us_dedes/me.m02.d20:meMA.Ode3C13.ode	@ltx/en_us_dedes/miscellanea:misc.Ode3
ltx/en_us_dedes/me.m02.d20:meMA.Ode3C13.text	
ltx/en_us_dedes/me.m02.d20:meMA.Ode3C1H.greekmelody	@ltx/en_us_dedes/he.h.m8:heHE.OuraniasApsidos.greekname
ltx/en_us_dedes/me.m02.d20:meMA.Ode3C1H.incipit	@ltx/en_us_dedes/he.h.m8:heHE.OuraniasApsidos.incipit
ltx/en_us_dedes/me.m02.d20:meMA.Ode3C1H.melody	@ltx/en_us_dedes/he.h.m8:heHE.OuraniasApsidos.melody
ltx/en_us_dedes/me.m02.d20:meMA.Ode3C1H.mode	@ltx/en_us_dedes/miscellanea:misc.Mode8
ltx/en_us_dedes/me.m02.d20:meMA.Ode3C1H.ode	@ltx/en_us_dedes/miscellanea:misc.Ode3
ltx/en_us_dedes/me.m02.d20:meMA.Ode3C1H.text	@ltx/en_us_dedes/he.h.m8:heHE.OuraniasApsidos.text
ltx/en_us_dedes/me.m02.d20:meMA.Ode3C1T.incipit	…
ltx/en_us_dedes/me.m02.d20:meMA.Ode3C1T.melody	@ltx/en_us_dedes/he.h.m8:heHE.OuraniasApsidos.name
ltx/en_us_dedes/me.m02.d20:meMA.Ode3C1T.mode	@ltx/en_us_dedes/miscellanea:misc.Mode8
ltx/en_us_dedes/me.m02.d20:meMA.Ode3C1T.ode	@ltx/en_us_dedes/miscellanea:misc.Ode3
ltx/en_us_dedes/me.m02.d20:meMA.Ode3C1T.text	
ltx/en_us_dedes/me.m02.d20:meMA.Ode3Kathisma1.greekmelody	@ltx/en_us_dedes/he.a.m3:heAU.TheiasPisteos.greekname
ltx/en_us_dedes/me.m02.d20:meMA.Ode3Kathisma1.incipit	…
ltx/en_us_dedes/me.m02.d20:meMA.Ode3Kathisma1.melody	@ltx/en_us_dedes/he.a.m3:heAU.TheiasPisteos.name
ltx/en_us_dedes/me.m02.d20:meMA.Ode3Kathisma1.mode	@ltx/en_us_dedes/miscellanea:misc.Mode3
ltx/en_us_dedes/me.m02.d20:meMA.Ode3Kathisma1.text	
ltx/en_us_dedes/me.m02.d20:meMA.Ode3KathismaSt.incipit	@ltx/en_us_dedes/me.m01.d29:meMA.Ode3KathismaSt.incipit
ltx/en_us_dedes/me.m02.d20:meMA.Ode3KathismaSt.melody	@ltx/en_us_dedes/he.a.m3:heAU.TheiasPisteos.name
ltx/en_us_dedes/me.m02.d20:meMA.Ode3KathismaSt.mode	@ltx/en_us_dedes/miscellanea:misc.Mode3
ltx/en_us_dedes/me.m02.d20:meMA.Ode3KathismaSt.text	@ltx/en_us_dedes/me.m01.d29:meMA.Ode3KathismaSt.text
ltx/en_us_dedes/me.m02.d20:meMA.Ode3KathismaT.incipit	@ltx/en_us_dedes/me.m01.d25:meMA.Kathisma1T.incipit
ltx/en_us_dedes/me.m02.d20:meMA.Ode3KathismaT.melody	@ltx/en_us_dedes/he.a.m3:heAU.TheiasPisteos.name
ltx/en_us_dedes/me.m02.d20:meMA.Ode3KathismaT.mode	@ltx/en_us_dedes/miscellanea:misc.Mode3
ltx/en_us_dedes/me.m02.d20:meMA.Ode3KathismaT.text	@ltx/en_us_dedes/me.m01.d25:meMA.Kathisma1T.text
ltx/en_us_dedes/me.m02.d20:meMA.Ode4C11.greekmelody	@ltx/en_us_dedes/he.h.m8:heHE.EisakikoaKyrie.greekname
ltx/en_us_dedes/me.m02.d20:meMA.Ode4C11.incipit	…
ltx/en_us_dedes/me.m02.d20:meMA.Ode4C11.melody	@ltx/en_us_dedes/he.h.m8:heHE.EisakikoaKyrie.name
ltx/en_us_dedes/me.m02.d20:meMA.Ode4C11.mode	@ltx/en_us_dedes/miscellanea:misc.Mode8
ltx/en_us_dedes/me.m02.d20:meMA.Ode4C11.ode	@ltx/en_us_dedes/miscellanea:misc.Ode4
ltx/en_us_dedes/me.m02.d20:meMA.Ode4C11.text	
ltx/en_us_dedes/me.m02.d20:meMA.Ode4C12.incipit	…
ltx/en_us_dedes/me.m02.d20:meMA.Ode4C12.melody	@ltx/en_us_dedes/he.h.m8:heHE.EisakikoaKyrie.name
ltx/en_us_dedes/me.m02.d20:meMA.Ode4C12.mode	@ltx/en_us_dedes/miscellanea:misc.Mode8
ltx/en_us_dedes/me.m02.d20:meMA.Ode4C12.ode	@ltx/en_us_dedes/miscellanea:misc.Ode4
ltx/en_us_dedes/me.m02.d20:meMA.Ode4C12.text	
ltx/en_us_dedes/me.m02.d20:meMA.Ode4C13.incipit	…
ltx/en_us_dedes/me.m02.d20:meMA.Ode4C13.melody	@ltx/en_us_dedes/he.h.m8:heHE.EisakikoaKyrie.name
ltx/en_us_dedes/me.m02.d20:meMA.Ode4C13.mode	@ltx/en_us_dedes/miscellanea:misc.Mode8
ltx/en_us_dedes/me.m02.d20:meMA.Ode4C13.ode	@ltx/en_us_dedes/miscellanea:misc.Ode4
ltx/en_us_dedes/me.m02.d20:meMA.Ode4C13.text	
ltx/en_us_dedes/me.m02.d20:meMA.Ode4C1H.greekmelody	@ltx/en_us_dedes/he.h.m8:heHE.EisakikoaKyrie.greekname
ltx/en_us_dedes/me.m02.d20:meMA.Ode4C1H.incipit	@ltx/en_us_dedes/he.h.m8:heHE.EisakikoaKyrie.incipit
ltx/en_us_dedes/me.m02.d20:meMA.Ode4C1H.melody	@ltx/en_us_dedes/he.h.m8:heHE.EisakikoaKyrie.melody
ltx/en_us_dedes/me.m02.d20:meMA.Ode4C1H.mode	@ltx/en_us_dedes/miscellanea:misc.Mode8
ltx/en_us_dedes/me.m02.d20:meMA.Ode4C1H.ode	@ltx/en_us_dedes/miscellanea:misc.Ode4
ltx/en_us_dedes/me.m02.d20:meMA.Ode4C1H.text	@ltx/en_us_dedes/he.h.m8:heHE.EisakikoaKyrie.text
ltx/en_us_dedes/me.m02.d20:meMA.Ode4C1T.incipit	…
ltx/en_us_dedes/me.m02.d20:meMA.Ode4C1T.melody	@ltx/en_us_dedes/he.h.m8:heHE.EisakikoaKyrie.name
ltx/en_us_dedes/me.m02.d20:meMA.Ode4C1T.mode	@ltx/en_us_dedes/miscellanea:misc.Mode8
ltx/en_us_dedes/me.m02.d20:meMA.Ode4C1T.ode	@ltx/en_us_dedes/miscellanea:misc.Ode4
ltx/en_us_dedes/me.m02.d20:meMA.Ode4C1T.text	
ltx/en_us_dedes/me.m02.d20:meMA.Ode5C11.greekmelody	@ltx/en_us_dedes/he.h.m8:heHE.InaTiMeAposo.greekname
ltx/en_us_dedes/me.m02.d20:meMA.Ode5C11.incipit	…
ltx/en_us_dedes/me.m02.d20:meMA.Ode5C11.melody	@ltx/en_us_dedes/he.h.m8:heHE.InaTiMeAposo.name
ltx/en_us_dedes/me.m02.d20:meMA.Ode5C11.mode	@ltx/en_us_dedes/miscellanea:misc.Mode8
ltx/en_us_dedes/me.m02.d20:meMA.Ode5C11.ode	@ltx/en_us_dedes/miscellanea:misc.Ode5
ltx/en_us_dedes/me.m02.d20:meMA.Ode5C11.text	
ltx/en_us_dedes/me.m02.d20:meMA.Ode5C12.incipit	…
ltx/en_us_dedes/me.m02.d20:meMA.Ode5C12.melody	@ltx/en_us_dedes/he.h.m8:heHE.InaTiMeAposo.name
ltx/en_us_dedes/me.m02.d20:meMA.Ode5C12.mode	@ltx/en_us_dedes/miscellanea:misc.Mode8
ltx/en_us_dedes/me.m02.d20:meMA.Ode5C12.ode	@ltx/en_us_dedes/miscellanea:misc.Ode5
ltx/en_us_dedes/me.m02.d20:meMA.Ode5C12.text	
ltx/en_us_dedes/me.m02.d20:meMA.Ode5C13.incipit	…
ltx/en_us_dedes/me.m02.d20:meMA.Ode5C13.melody	@ltx/en_us_dedes/he.h.m8:heHE.InaTiMeAposo.name
ltx/en_us_dedes/me.m02.d20:meMA.Ode5C13.mode	@ltx/en_us_dedes/miscellanea:misc.Mode8
ltx/en_us_dedes/me.m02.d20:meMA.Ode5C13.ode	@ltx/en_us_dedes/miscellanea:misc.Ode5
ltx/en_us_dedes/me.m02.d20:meMA.Ode5C13.text	
ltx/en_us_dedes/me.m02.d20:meMA.Ode5C1H.greekmelody	@ltx/en_us_dedes/he.h.m8:heHE.InaTiMeAposo.greekname
ltx/en_us_dedes/me.m02.d20:meMA.Ode5C1H.incipit	@ltx/en_us_dedes/he.h.m8:heHE.InaTiMeAposo.incipit
ltx/en_us_dedes/me.m02.d20:meMA.Ode5C1H.melody	@ltx/en_us_dedes/he.h.m8:heHE.InaTiMeAposo.melody
ltx/en_us_dedes/me.m02.d20:meMA.Ode5C1H.mode	@ltx/en_us_dedes/miscellanea:misc.Mode8
ltx/en_us_dedes/me.m02.d20:meMA.Ode5C1H.ode	@ltx/en_us_dedes/miscellanea:misc.Ode5
ltx/en_us_dedes/me.m02.d20:meMA.Ode5C1H.text	@ltx/en_us_dedes/he.h.m8:heHE.InaTiMeAposo.text
ltx/en_us_dedes/me.m02.d20:meMA.Ode5C1T.incipit	…
ltx/en_us_dedes/me.m02.d20:meMA.Ode5C1T.melody	@ltx/en_us_dedes/he.h.m8:heHE.InaTiMeAposo.name
ltx/en_us_dedes/me.m02.d20:meMA.Ode5C1T.mode	@ltx/en_us_dedes/miscellanea:misc.Mode8
ltx/en_us_dedes/me.m02.d20:meMA.Ode5C1T.ode	@ltx/en_us_dedes/miscellanea:misc.Ode5
ltx/en_us_dedes/me.m02.d20:meMA.Ode5C1T.text	
ltx/en_us_dedes/me.m02.d20:meMA.Ode6C11.greekmelody	@ltx/en_us_dedes/he.h.m8:heHE.TinDeisinEkcheo.greekname
ltx/en_us_dedes/me.m02.d20:meMA.Ode6C11.incipit	…
ltx/en_us_dedes/me.m02.d20:meMA.Ode6C11.melody	@ltx/en_us_dedes/he.h.m8:heHE.TinDeisinEkcheo.name
ltx/en_us_dedes/me.m02.d20:meMA.Ode6C11.mode	@ltx/en_us_dedes/miscellanea:misc.Mode8
ltx/en_us_dedes/me.m02.d20:meMA.Ode6C11.ode	@ltx/en_us_dedes/miscellanea:misc.Ode6
ltx/en_us_dedes/me.m02.d20:meMA.Ode6C11.text	
ltx/en_us_dedes/me.m02.d20:meMA.Ode6C12.incipit	…
ltx/en_us_dedes/me.m02.d20:meMA.Ode6C12.melody	@ltx/en_us_dedes/he.h.m8:heHE.TinDeisinEkcheo.name
ltx/en_us_dedes/me.m02.d20:meMA.Ode6C12.mode	@ltx/en_us_dedes/miscellanea:misc.Mode8
ltx/en_us_dedes/me.m02.d20:meMA.Ode6C12.ode	@ltx/en_us_dedes/miscellanea:misc.Ode6
ltx/en_us_dedes/me.m02.d20:meMA.Ode6C12.text	
ltx/en_us_dedes/me.m02.d20:meMA.Ode6C13.incipit	…
ltx/en_us_dedes/me.m02.d20:meMA.Ode6C13.melody	@ltx/en_us_dedes/he.h.m8:heHE.TinDeisinEkcheo.name
ltx/en_us_dedes/me.m02.d20:meMA.Ode6C13.mode	@ltx/en_us_dedes/miscellanea:misc.Mode8
ltx/en_us_dedes/me.m02.d20:meMA.Ode6C13.ode	@ltx/en_us_dedes/miscellanea:misc.Ode6
ltx/en_us_dedes/me.m02.d20:meMA.Ode6C13.text	
ltx/en_us_dedes/me.m02.d20:meMA.Ode6C1H.greekmelody	@ltx/en_us_dedes/he.h.m8:heHE.TinDeisinEkcheo.greekname
ltx/en_us_dedes/me.m02.d20:meMA.Ode6C1H.incipit	@ltx/en_us_dedes/he.h.m8:heHE.TinDeisinEkcheo.incipit
ltx/en_us_dedes/me.m02.d20:meMA.Ode6C1H.melody	@ltx/en_us_dedes/he.h.m8:heHE.TinDeisinEkcheo.melody
ltx/en_us_dedes/me.m02.d20:meMA.Ode6C1H.mode	@ltx/en_us_dedes/miscellanea:misc.Mode8
ltx/en_us_dedes/me.m02.d20:meMA.Ode6C1H.ode	@ltx/en_us_dedes/miscellanea:misc.Ode6
ltx/en_us_dedes/me.m02.d20:meMA.Ode6C1H.text	@ltx/en_us_dedes/he.h.m8:heHE.TinDeisinEkcheo.text
ltx/en_us_dedes/me.m02.d20:meMA.Ode6C1T.incipit	…
ltx/en_us_dedes/me.m02.d20:meMA.Ode6C1T.melody	@ltx/en_us_dedes/he.h.m8:heHE.TinDeisinEkcheo.name
ltx/en_us_dedes/me.m02.d20:meMA.Ode6C1T.mode	@ltx/en_us_dedes/miscellanea:misc.Mode8
ltx/en_us_dedes/me.m02.d20:meMA.Ode6C1T.ode	@ltx/en_us_dedes/miscellanea:misc.Ode6
ltx/en_us_dedes/me.m02.d20:meMA.Ode6C1T.text	
ltx/en_us_dedes/me.m02.d20:meMA.Ode7C11.greekmelody	@ltx/en_us_dedes/he.h.m8:heHE.PaidesEvraion.greekname
ltx/en_us_dedes/me.m02.d20:meMA.Ode7C11.incipit	…
ltx/en_us_dedes/me.m02.d20:meMA.Ode7C11.melody	@ltx/en_us_dedes/he.h.m8:heHE.PaidesEvraion.name
ltx/en_us_dedes/me.m02.d20:meMA.Ode7C11.mode	@ltx/en_us_dedes/miscellanea:misc.Mode8
ltx/en_us_dedes/me.m02.d20:meMA.Ode7C11.ode	@ltx/en_us_dedes/miscellanea:misc.Ode7
ltx/en_us_dedes/me.m02.d20:meMA.Ode7C11.text	
ltx/en_us_dedes/me.m02.d20:meMA.Ode7C12.incipit	…
ltx/en_us_dedes/me.m02.d20:meMA.Ode7C12.melody	@ltx/en_us_dedes/he.h.m8:heHE.PaidesEvraion.name
ltx/en_us_dedes/me.m02.d20:meMA.Ode7C12.mode	@ltx/en_us_dedes/miscellanea:misc.Mode8
ltx/en_us_dedes/me.m02.d20:meMA.Ode7C12.ode	@ltx/en_us_dedes/miscellanea:misc.Ode7
ltx/en_us_dedes/me.m02.d20:meMA.Ode7C12.text	
ltx/en_us_dedes/me.m02.d20:meMA.Ode7C13.incipit	…
ltx/en_us_dedes/me.m02.d20:meMA.Ode7C13.melody	@ltx/en_us_dedes/he.h.m8:heHE.PaidesEvraion.name
ltx/en_us_dedes/me.m02.d20:meMA.Ode7C13.mode	@ltx/en_us_dedes/miscellanea:misc.Mode8
ltx/en_us_dedes/me.m02.d20:meMA.Ode7C13.ode	@ltx/en_us_dedes/miscellanea:misc.Ode7
ltx/en_us_dedes/me.m02.d20:meMA.Ode7C13.text	
ltx/en_us_dedes/me.m02.d20:meMA.Ode7C1H.greekmelody	@ltx/en_us_dedes/he.h.m8:heHE.PaidesEvraion.greekname
ltx/en_us_dedes/me.m02.d20:meMA.Ode7C1H.incipit	@ltx/en_us_dedes/he.h.m8:heHE.PaidesEvraion.incipit
ltx/en_us_dedes/me.m02.d20:meMA.Ode7C1H.melody	@ltx/en_us_dedes/he.h.m8:heHE.PaidesEvraion.melody
ltx/en_us_dedes/me.m02.d20:meMA.Ode7C1H.mode	@ltx/en_us_dedes/miscellanea:misc.Mode8
ltx/en_us_dedes/me.m02.d20:meMA.Ode7C1H.ode	@ltx/en_us_dedes/miscellanea:misc.Ode7
ltx/en_us_dedes/me.m02.d20:meMA.Ode7C1H.text	@ltx/en_us_dedes/he.h.m8:heHE.PaidesEvraion.text
ltx/en_us_dedes/me.m02.d20:meMA.Ode7C1T.incipit	…
ltx/en_us_dedes/me.m02.d20:meMA.Ode7C1T.melody	@ltx/en_us_dedes/he.h.m8:heHE.PaidesEvraion.name
ltx/en_us_dedes/me.m02.d20:meMA.Ode7C1T.mode	@ltx/en_us_dedes/miscellanea:misc.Mode8
ltx/en_us_dedes/me.m02.d20:meMA.Ode7C1T.ode	@ltx/en_us_dedes/miscellanea:misc.Ode7
ltx/en_us_dedes/me.m02.d20:meMA.Ode7C1T.text	
ltx/en_us_dedes/me.m02.d20:meMA.Ode8C11.greekmelody	@ltx/en_us_dedes/he.h.m8:heHE.NikitaiTyrannou.greekname
ltx/en_us_dedes/me.m02.d20:meMA.Ode8C11.incipit	…
ltx/en_us_dedes/me.m02.d20:meMA.Ode8C11.melody	@ltx/en_us_dedes/he.h.m8:heHE.NikitaiTyrannou.name
ltx/en_us_dedes/me.m02.d20:meMA.Ode8C11.mode	@ltx/en_us_dedes/miscellanea:misc.Mode8
ltx/en_us_dedes/me.m02.d20:meMA.Ode8C11.ode	@ltx/en_us_dedes/miscellanea:misc.Ode8
ltx/en_us_dedes/me.m02.d20:meMA.Ode8C11.text	
ltx/en_us_dedes/me.m02.d20:meMA.Ode8C12.incipit	…
ltx/en_us_dedes/me.m02.d20:meMA.Ode8C12.melody	@ltx/en_us_dedes/he.h.m8:heHE.NikitaiTyrannou.name
ltx/en_us_dedes/me.m02.d20:meMA.Ode8C12.mode	@ltx/en_us_dedes/miscellanea:misc.Mode8
ltx/en_us_dedes/me.m02.d20:meMA.Ode8C12.ode	@ltx/en_us_dedes/miscellanea:misc.Ode8
ltx/en_us_dedes/me.m02.d20:meMA.Ode8C12.text	
ltx/en_us_dedes/me.m02.d20:meMA.Ode8C13.incipit	…
ltx/en_us_dedes/me.m02.d20:meMA.Ode8C13.melody	@ltx/en_us_dedes/he.h.m8:heHE.NikitaiTyrannou.name
ltx/en_us_dedes/me.m02.d20:meMA.Ode8C13.mode	@ltx/en_us_dedes/miscellanea:misc.Mode8
ltx/en_us_dedes/me.m02.d20:meMA.Ode8C13.ode	@ltx/en_us_dedes/miscellanea:misc.Ode8
ltx/en_us_dedes/me.m02.d20:meMA.Ode8C13.text	
ltx/en_us_dedes/me.m02.d20:meMA.Ode8C1H.greekmelody	@ltx/en_us_dedes/he.h.m8:heHE.NikitaiTyrannou.greekname
ltx/en_us_dedes/me.m02.d20:meMA.Ode8C1H.incipit	@ltx/en_us_dedes/he.h.m8:heHE.NikitaiTyrannou.incipit
ltx/en_us_dedes/me.m02.d20:meMA.Ode8C1H.melody	@ltx/en_us_dedes/he.h.m8:heHE.NikitaiTyrannou.melody
ltx/en_us_dedes/me.m02.d20:meMA.Ode8C1H.mode	@ltx/en_us_dedes/miscellanea:misc.Mode8
ltx/en_us_dedes/me.m02.d20:meMA.Ode8C1H.ode	@ltx/en_us_dedes/miscellanea:misc.Ode8
ltx/en_us_dedes/me.m02.d20:meMA.Ode8C1H.text	@ltx/en_us_dedes/he.h.m8:heHE.NikitaiTyrannou.text
ltx/en_us_dedes/me.m02.d20:meMA.Ode8C1T.incipit	…
ltx/en_us_dedes/me.m02.d20:meMA.Ode8C1T.melody	@ltx/en_us_dedes/he.h.m8:heHE.NikitaiTyrannou.name
ltx/en_us_dedes/me.m02.d20:meMA.Ode8C1T.mode	@ltx/en_us_dedes/miscellanea:misc.Mode8
ltx/en_us_dedes/me.m02.d20:meMA.Ode8C1T.ode	@ltx/en_us_dedes/miscellanea:misc.Ode8
ltx/en_us_dedes/me.m02.d20:meMA.Ode8C1T.text	
ltx/en_us_dedes/me.m02.d20:meMA.Ode9C11.greekmelody	@ltx/en_us_dedes/he.h.m8:heHE.EfrixePasaAkoi.greekname
ltx/en_us_dedes/me.m02.d20:meMA.Ode9C11.incipit	…
ltx/en_us_dedes/me.m02.d20:meMA.Ode9C11.melody	@ltx/en_us_dedes/he.h.m8:heHE.EfrixePasaAkoi.name
ltx/en_us_dedes/me.m02.d20:meMA.Ode9C11.mode	@ltx/en_us_dedes/miscellanea:misc.Mode8
ltx/en_us_dedes/me.m02.d20:meMA.Ode9C11.ode	@ltx/en_us_dedes/miscellanea:misc.Ode9
ltx/en_us_dedes/me.m02.d20:meMA.Ode9C11.text	
ltx/en_us_dedes/me.m02.d20:meMA.Ode9C12.incipit	…
ltx/en_us_dedes/me.m02.d20:meMA.Ode9C12.melody	@ltx/en_us_dedes/he.h.m8:heHE.EfrixePasaAkoi.name
ltx/en_us_dedes/me.m02.d20:meMA.Ode9C12.mode	@ltx/en_us_dedes/miscellanea:misc.Mode8
ltx/en_us_dedes/me.m02.d20:meMA.Ode9C12.ode	@ltx/en_us_dedes/miscellanea:misc.Ode9
ltx/en_us_dedes/me.m02.d20:meMA.Ode9C12.text	
ltx/en_us_dedes/me.m02.d20:meMA.Ode9C13.incipit	…
ltx/en_us_dedes/me.m02.d20:meMA.Ode9C13.melody	@ltx/en_us_dedes/he.h.m8:heHE.EfrixePasaAkoi.name
ltx/en_us_dedes/me.m02.d20:meMA.Ode9C13.mode	@ltx/en_us_dedes/miscellanea:misc.Mode8
ltx/en_us_dedes/me.m02.d20:meMA.Ode9C13.ode	@ltx/en_us_dedes/miscellanea:misc.Ode9
ltx/en_us_dedes/me.m02.d20:meMA.Ode9C13.text	
ltx/en_us_dedes/me.m02.d20:meMA.Ode9C14.incipit	…
ltx/en_us_dedes/me.m02.d20:meMA.Ode9C14.melody	@ltx/en_us_dedes/he.h.m8:heHE.EfrixePasaAkoi.name
ltx/en_us_dedes/me.m02.d20:meMA.Ode9C14.mode	@ltx/en_us_dedes/miscellanea:misc.Mode8
ltx/en_us_dedes/me.m02.d20:meMA.Ode9C14.ode	@ltx/en_us_dedes/miscellanea:misc.Ode9
ltx/en_us_dedes/me.m02.d20:meMA.Ode9C14.text	
ltx/en_us_dedes/me.m02.d20:meMA.Ode9C1H.greekmelody	@ltx/en_us_dedes/he.h.m8:heHE.EfrixePasaAkoi.greekname
ltx/en_us_dedes/me.m02.d20:meMA.Ode9C1H.incipit	@ltx/en_us_dedes/he.h.m8:heHE.EfrixePasaAkoi.incipit
ltx/en_us_dedes/me.m02.d20:meMA.Ode9C1H.melody	@ltx/en_us_dedes/he.h.m8:heHE.EfrixePasaAkoi.melody
ltx/en_us_dedes/me.m02.d20:meMA.Ode9C1H.mode	@ltx/en_us_dedes/miscellanea:misc.Mode8
ltx/en_us_dedes/me.m02.d20:meMA.Ode9C1H.ode	@ltx/en_us_dedes/miscellanea:misc.Ode9
ltx/en_us_dedes/me.m02.d20:meMA.Ode9C1H.text	@ltx/en_us_dedes/he.h.m8:heHE.EfrixePasaAkoi.text
ltx/en_us_dedes/me.m02.d20:meMA.Ode9C1T.incipit	…
ltx/en_us_dedes/me.m02.d20:meMA.Ode9C1T.melody	@ltx/en_us_dedes/he.h.m8:heHE.EfrixePasaAkoi.name
ltx/en_us_dedes/me.m02.d20:meMA.Ode9C1T.mode	@ltx/en_us_dedes/miscellanea:misc.Mode8
ltx/en_us_dedes/me.m02.d20:meMA.Ode9C1T.ode	@ltx/en_us_dedes/miscellanea:misc.Ode9
ltx/en_us_dedes/me.m02.d20:meMA.Ode9C1T.text	
ltx/en_us_dedes/me.m02.d20:meMA.Oikos1.text	
ltx/en_us_dedes/me.m02.d20:meVE.Apolytikion1ger.greekmelody	@ltx/en_us_dedes/he.a.m1:heAU.TisErimouPolitis.greekname
ltx/en_us_dedes/me.m02.d20:meVE.Apolytikion1ger.incipit	…
ltx/en_us_dedes/me.m02.d20:meVE.Apolytikion1ger.melody	@ltx/en_us_dedes/he.a.m1:heAU.TisErimouPolitis.name
ltx/en_us_dedes/me.m02.d20:meVE.Apolytikion1ger.mode	@ltx/en_us_dedes/miscellanea:misc.Mode1
ltx/en_us_dedes/me.m02.d20:meVE.Apolytikion1ger.poet	@ltx/en_us_dedes/poets:po.Gerasimou
ltx/en_us_dedes/me.m02.d20:meVE.Apolytikion1ger.text	
ltx/en_us_dedes/me.m02.d20:meVE.SticStavrotheotokion.greekmelody	@ltx/en_us_dedes/he.a.m8:heAU.OTouParadoxou.greekname
ltx/en_us_dedes/me.m02.d20:meVE.SticStavrotheotokion.incipit	…
ltx/en_us_dedes/me.m02.d20:meVE.SticStavrotheotokion.melody	@ltx/en_us_dedes/he.a.m8:heAU.OTouParadoxou.name
ltx/en_us_dedes/me.m02.d20:meVE.SticStavrotheotokion.mode	@ltx/en_us_dedes/miscellanea:misc.Mode8
ltx/en_us_dedes/me.m02.d20:meVE.SticStavrotheotokion.text	
ltx/en_us_dedes/me.m02.d20:meVE.SticTheotokion.greekmelody	@ltx/en_us_dedes/he.a.m8:heAU.OTouParadoxou.greekname
ltx/en_us_dedes/me.m02.d20:meVE.SticTheotokion.incipit	Come now, O my soul…
ltx/en_us_dedes/me.m02.d20:meVE.SticTheotokion.melody	@ltx/en_us_dedes/he.a.m8:heAU.OTouParadoxou.name
ltx/en_us_dedes/me.m02.d20:meVE.SticTheotokion.mode	@ltx/en_us_dedes/miscellanea:misc.Mode8
ltx/en_us_dedes/me.m02.d20:meVE.SticTheotokion.text	Come now, O my soul, and heave a sigh, and from the bottom of your heart * offer torrents of burning tears * to the Virgin and cry out * to the Mother of Christ our God, “In your immense tender-love deliver me * from that most frightening punishment of hell, * pure Maiden, settle me * in the place where there is rest and also joy, * holy comforts and delights for all eternity.”
ltx/en_us_dedes/me.m02.d20:meVE.Stichera01.greekmelody	@ltx/en_us_dedes/he.a.m8:heAU.OTouParadoxou.greekname
ltx/en_us_dedes/me.m02.d20:meVE.Stichera01.incipit	O godly-minded Leo, honored by…
ltx/en_us_dedes/me.m02.d20:meVE.Stichera01.melody	@ltx/en_us_dedes/he.a.m8:heAU.OTouParadoxou.notmetered
ltx/en_us_dedes/me.m02.d20:meVE.Stichera01.mode	@ltx/en_us_dedes/miscellanea:misc.Mode8
ltx/en_us_dedes/me.m02.d20:meVE.Stichera01.text	O godly-minded Leo, honored by all, you were attached in purity to your God and Creator, through ascetic feats and complete purification; and you were filled with divine light; and you obtained divine gifts of grace, to cure incurable illnesses, and to drive out unclean spirits with the scourge of your prayers.
ltx/en_us_dedes/me.m02.d20:meVE.Stichera02.incipit	Truly blessed Leo, when you…
ltx/en_us_dedes/me.m02.d20:meVE.Stichera02.melody	@ltx/en_us_dedes/he.a.m8:heAU.OTouParadoxou.notmetered
ltx/en_us_dedes/me.m02.d20:meVE.Stichera02.mode	@ltx/en_us_dedes/miscellanea:misc.Mode8
ltx/en_us_dedes/me.m02.d20:meVE.Stichera02.text	Truly blessed Leo, when you became a Hierarch, as a pastor in the truest sense, by the might of the Spirit, you led your flock to graze on the green pasture of Orthodox teachings and perfection in virtue, using the staff of the divine Faith. In the presence of your flock, you performed great miracles by God’s grace, and thus you received everlasting glory.
ltx/en_us_dedes/me.m02.d20:meVE.Stichera03.incipit	O believers, come draw divine…
ltx/en_us_dedes/me.m02.d20:meVE.Stichera03.melody	@ltx/en_us_dedes/he.a.m8:heAU.OTouParadoxou.notmetered
ltx/en_us_dedes/me.m02.d20:meVE.Stichera03.mode	@ltx/en_us_dedes/miscellanea:misc.Mode8
ltx/en_us_dedes/me.m02.d20:meVE.Stichera03.text	O believers, come draw divine oil that ever flows from the precious casket of the wise Arch-pastor, as if from a fountain; and say to the God of all, “O good Lord, who are wondrous in Your saints, at the supplications of this Saint of Yours, have mercy on us and save us, who with faith celebrate his divine memory.
