ltx/en_us_dedes/hi.hi05:hiVI.Key01.title	Vespers
ltx/en_us_dedes/hi.hi05:hiVI.Key02.title	Lity - Blessing of the Loaves
ltx/en_us_dedes/hi.hi05:hiVI.Key03.title	Matins
ltx/en_us_dedes/hi.hi05:hiVI.Key04.title	Divine Liturgy
ltx/en_us_dedes/hi.hi05:hiVI.R001	
ltx/en_us_dedes/hi.hi05:hiVI.R101	
ltx/en_us_dedes/hi.hi05:hiVI.R102	
ltx/en_us_dedes/hi.hi05:hiVI.R103	
ltx/en_us_dedes/hi.hi05:hiVI.R104	
ltx/en_us_dedes/hi.hi05:hiVI.R201	
ltx/en_us_dedes/hi.hi05:hiVI.R201b	At this point there is a reading related to the feast.
ltx/en_us_dedes/hi.hi05:hiVI.R201c	
ltx/en_us_dedes/hi.hi05:hiVI.R201d	Then Matins begins.
ltx/en_us_dedes/hi.hi05:hiVI.R201dalt	Then the Six Psalms are read, and this is how Matins begins.
ltx/en_us_dedes/hi.hi05:hiVI.R301	
ltx/en_us_dedes/hi.hi05:hiVI.R301alt	
ltx/en_us_dedes/hi.hi05:hiVI.R401	
ltx/en_us_dedes/hi.hi05:hiVI.title	The Order of the All-night Vigil
