ltx/en_us_dedes/me.m05.d07:meDA.commemoration.first	Commemoration of the Appearance of the Holy Cross in the Sky
ltx/en_us_dedes/me.m05.d07:meDA.commemoration.first_name	
ltx/en_us_dedes/me.m05.d07:meDA.commemoration.first_short	Commemoration of the Appearance of the Holy Cross in the Sky
ltx/en_us_dedes/me.m05.d07:meDA.commemoration.first_title	@ltx/en_us_dedes/titles:ti.Cross
ltx/en_us_dedes/me.m05.d07:meDA.commemoration.full	Commemoration of the Appearance of the Holy Cross in the Sky, at the Third Hour of the Day, during the Reign of Emperor Constantius, Son of Constantine the Great.
ltx/en_us_dedes/me.m05.d07:meDA.commemoration.second_name	
ltx/en_us_dedes/me.m05.d07:meDA.commemoration.second_title	
ltx/en_us_dedes/me.m05.d07:meDA.date	May 7
ltx/en_us_dedes/me.m05.d07:meDA.fordate	for May 7
ltx/en_us_dedes/me.m05.d07:meDA.insert1	
ltx/en_us_dedes/me.m05.d07:meDA.insert2	
ltx/en_us_dedes/me.m05.d07:meDA.note	
ltx/en_us_dedes/me.m05.d07:meDA.pdfcoverdate	May 7,
ltx/en_us_dedes/me.m05.d07:meDA.pdfheaderdate	May 7
ltx/en_us_dedes/me.m05.d07:meHO.commemorations	
ltx/en_us_dedes/me.m05.d07:meHO.note1	
ltx/en_us_dedes/me.m05.d07:meHO.note2	
ltx/en_us_dedes/me.m05.d07:meHO.number	
ltx/en_us_dedes/me.m05.d07:meHO.rank	
ltx/en_us_dedes/me.m05.d07:meLE.commemoration1	The Commemoration of the Appearance of the Holy Cross in the City of Jerusalem.
ltx/en_us_dedes/me.m05.d07:meLE.commemoration2	
ltx/en_us_dedes/me.m05.d07:meLI.Kontakion1.greekmelody	@ltx/en_us_dedes/me.m05.d07:meMA.Kontakion1.greekmelody
ltx/en_us_dedes/me.m05.d07:meLI.Kontakion1.incipit	@ltx/en_us_dedes/me.m05.d07:meMA.Kontakion1.incipit
ltx/en_us_dedes/me.m05.d07:meLI.Kontakion1.melody	@ltx/en_us_dedes/me.m05.d07:meMA.Kontakion1.melody
ltx/en_us_dedes/me.m05.d07:meLI.Kontakion1.mode	@ltx/en_us_dedes/me.m05.d07:meMA.Kontakion1.mode
ltx/en_us_dedes/me.m05.d07:meLI.Kontakion1.text	@ltx/en_us_dedes/me.m05.d07:meMA.Kontakion1.text
ltx/en_us_dedes/me.m05.d07:meLI.MM.CommunionHymn.text	@ltx/en_us_dedes/properties:media.key
ltx/en_us_dedes/me.m05.d07:meLI.Megalynarion.text	
ltx/en_us_dedes/me.m05.d07:meMA.C1.poet	@ltx/en_us_dedes/poets:po.IoannouMonachou
ltx/en_us_dedes/me.m05.d07:meMA.C1.title	@ltx/en_us_dedes/titles:ti.CanonCross
ltx/en_us_dedes/me.m05.d07:meMA.C1.verse	@ltx/en_us_dedes/prayers:pr.verse_Cross.text
ltx/en_us_dedes/me.m05.d07:meMA.Exaposteilarion1.greekmelody	@ltx/en_us_dedes/he.a.m2:heAU.TonMathitonOrontonSe.greekname
ltx/en_us_dedes/me.m05.d07:meMA.Exaposteilarion1.incipit	@ltx/en_us_dedes/me.m09.d14:meMA.Exaposteilarion1.incipit
ltx/en_us_dedes/me.m05.d07:meMA.Exaposteilarion1.melody	@ltx/en_us_dedes/he.a.m2:heAU.TonMathitonOrontonSe.name
ltx/en_us_dedes/me.m05.d07:meMA.Exaposteilarion1.mode	@ltx/en_us_dedes/miscellanea:misc.Mode2
ltx/en_us_dedes/me.m05.d07:meMA.Exaposteilarion1.text	@ltx/en_us_dedes/me.m09.d14:meMA.Exaposteilarion1.text
ltx/en_us_dedes/me.m05.d07:meMA.Kontakion1.greekmelody	@ltx/en_us_dedes/he.a.m8:heAU.TiYpermacho.greekname
ltx/en_us_dedes/me.m05.d07:meMA.Kontakion1.incipit	Thrice-blessed Cross, you are all-precious…
ltx/en_us_dedes/me.m05.d07:meMA.Kontakion1.melody	@ltx/en_us_dedes/he.a.m8:heAU.TiYpermacho.name
ltx/en_us_dedes/me.m05.d07:meMA.Kontakion1.mode	@ltx/en_us_dedes/miscellanea:misc.Mode8
ltx/en_us_dedes/me.m05.d07:meMA.Kontakion1.text	Thrice-blessed Cross, you are all-precious and revered by all. * As I extol and venerate you, I am sanctified, * for on you, Christ was crucified and He saved the world. * By the power that He gave you, come and rescue me, * and from every peril free me, so that unto you * I may cry aloud: * Rejoice, O blessed tree of the Cross.
ltx/en_us_dedes/me.m05.d07:meMA.Ode1C11.greekmelody	@ltx/en_us_dedes/he.h.m4:heHE.ArmataFarao.greekname
ltx/en_us_dedes/me.m05.d07:meMA.Ode1C11.incipit	…
ltx/en_us_dedes/me.m05.d07:meMA.Ode1C11.melody	@ltx/en_us_dedes/he.h.m4:heHE.ArmataFarao.name
ltx/en_us_dedes/me.m05.d07:meMA.Ode1C11.mode	@ltx/en_us_dedes/miscellanea:misc.Mode4
ltx/en_us_dedes/me.m05.d07:meMA.Ode1C11.ode	@ltx/en_us_dedes/miscellanea:misc.Ode1
ltx/en_us_dedes/me.m05.d07:meMA.Ode1C11.text	
ltx/en_us_dedes/me.m05.d07:meMA.Ode1C12.incipit	…
ltx/en_us_dedes/me.m05.d07:meMA.Ode1C12.melody	@ltx/en_us_dedes/he.h.m4:heHE.ArmataFarao.name
ltx/en_us_dedes/me.m05.d07:meMA.Ode1C12.mode	@ltx/en_us_dedes/miscellanea:misc.Mode4
ltx/en_us_dedes/me.m05.d07:meMA.Ode1C12.ode	@ltx/en_us_dedes/miscellanea:misc.Ode1
ltx/en_us_dedes/me.m05.d07:meMA.Ode1C12.text	
ltx/en_us_dedes/me.m05.d07:meMA.Ode1C13.incipit	…
ltx/en_us_dedes/me.m05.d07:meMA.Ode1C13.melody	@ltx/en_us_dedes/he.h.m4:heHE.ArmataFarao.name
ltx/en_us_dedes/me.m05.d07:meMA.Ode1C13.mode	@ltx/en_us_dedes/miscellanea:misc.Mode4
ltx/en_us_dedes/me.m05.d07:meMA.Ode1C13.ode	@ltx/en_us_dedes/miscellanea:misc.Ode1
ltx/en_us_dedes/me.m05.d07:meMA.Ode1C13.text	
ltx/en_us_dedes/me.m05.d07:meMA.Ode1C1T.incipit	…
ltx/en_us_dedes/me.m05.d07:meMA.Ode1C1T.melody	@ltx/en_us_dedes/he.h.m4:heHE.ArmataFarao.name
ltx/en_us_dedes/me.m05.d07:meMA.Ode1C1T.mode	@ltx/en_us_dedes/miscellanea:misc.Mode4
ltx/en_us_dedes/me.m05.d07:meMA.Ode1C1T.ode	@ltx/en_us_dedes/miscellanea:misc.Ode1
ltx/en_us_dedes/me.m05.d07:meMA.Ode1C1T.text	
ltx/en_us_dedes/me.m05.d07:meMA.Ode3C11.greekmelody	@ltx/en_us_dedes/he.h.m4:heHE.ToxonDynatonIsthenise.greekname
ltx/en_us_dedes/me.m05.d07:meMA.Ode3C11.incipit	…
ltx/en_us_dedes/me.m05.d07:meMA.Ode3C11.melody	@ltx/en_us_dedes/he.h.m4:heHE.ToxonDynatonIsthenise.name
ltx/en_us_dedes/me.m05.d07:meMA.Ode3C11.mode	@ltx/en_us_dedes/miscellanea:misc.Mode4
ltx/en_us_dedes/me.m05.d07:meMA.Ode3C11.ode	@ltx/en_us_dedes/miscellanea:misc.Ode3
ltx/en_us_dedes/me.m05.d07:meMA.Ode3C11.text	
ltx/en_us_dedes/me.m05.d07:meMA.Ode3C12.incipit	…
ltx/en_us_dedes/me.m05.d07:meMA.Ode3C12.melody	@ltx/en_us_dedes/he.h.m4:heHE.ToxonDynatonIsthenise.name
ltx/en_us_dedes/me.m05.d07:meMA.Ode3C12.mode	@ltx/en_us_dedes/miscellanea:misc.Mode4
ltx/en_us_dedes/me.m05.d07:meMA.Ode3C12.ode	@ltx/en_us_dedes/miscellanea:misc.Ode3
ltx/en_us_dedes/me.m05.d07:meMA.Ode3C12.text	
ltx/en_us_dedes/me.m05.d07:meMA.Ode3C13.incipit	…
ltx/en_us_dedes/me.m05.d07:meMA.Ode3C13.melody	@ltx/en_us_dedes/he.h.m4:heHE.ToxonDynatonIsthenise.name
ltx/en_us_dedes/me.m05.d07:meMA.Ode3C13.mode	@ltx/en_us_dedes/miscellanea:misc.Mode4
ltx/en_us_dedes/me.m05.d07:meMA.Ode3C13.ode	@ltx/en_us_dedes/miscellanea:misc.Ode3
ltx/en_us_dedes/me.m05.d07:meMA.Ode3C13.text	
ltx/en_us_dedes/me.m05.d07:meMA.Ode3C1T.incipit	…
ltx/en_us_dedes/me.m05.d07:meMA.Ode3C1T.melody	@ltx/en_us_dedes/he.h.m4:heHE.ToxonDynatonIsthenise.name
ltx/en_us_dedes/me.m05.d07:meMA.Ode3C1T.mode	@ltx/en_us_dedes/miscellanea:misc.Mode4
ltx/en_us_dedes/me.m05.d07:meMA.Ode3C1T.ode	@ltx/en_us_dedes/miscellanea:misc.Ode3
ltx/en_us_dedes/me.m05.d07:meMA.Ode3C1T.text	
ltx/en_us_dedes/me.m05.d07:meMA.Ode3H.greekmelody	@ltx/en_us_dedes/he.h.m4:heHE.ToxonDynatonIsthenise.greekname
ltx/en_us_dedes/me.m05.d07:meMA.Ode3H.incipit	@ltx/en_us_dedes/he.h.m4:heHE.ToxonDynatonIsthenise.incipit
ltx/en_us_dedes/me.m05.d07:meMA.Ode3H.melody	@ltx/en_us_dedes/he.h.m4:heHE.ToxonDynatonIsthenise.melody
ltx/en_us_dedes/me.m05.d07:meMA.Ode3H.mode	@ltx/en_us_dedes/miscellanea:misc.Mode4
ltx/en_us_dedes/me.m05.d07:meMA.Ode3H.ode	@ltx/en_us_dedes/miscellanea:misc.Ode3
ltx/en_us_dedes/me.m05.d07:meMA.Ode3H.text	@ltx/en_us_dedes/he.h.m4:heHE.ToxonDynatonIsthenise.text
ltx/en_us_dedes/me.m05.d07:meMA.Ode3Kathisma1.greekmelody	@ltx/en_us_dedes/he.a.m4:heAU.OYpsotheisEnToStavro.greekname
ltx/en_us_dedes/me.m05.d07:meMA.Ode3Kathisma1.incipit	…
ltx/en_us_dedes/me.m05.d07:meMA.Ode3Kathisma1.melody	@ltx/en_us_dedes/he.a.m4:heAU.OYpsotheisEnToStavro.name
ltx/en_us_dedes/me.m05.d07:meMA.Ode3Kathisma1.mode	@ltx/en_us_dedes/miscellanea:misc.Mode4
ltx/en_us_dedes/me.m05.d07:meMA.Ode3Kathisma1.text	
ltx/en_us_dedes/me.m05.d07:meMA.Ode4C11.greekmelody	@ltx/en_us_dedes/he.h.m4:heHE.EisakikoaKyrie.greekname
ltx/en_us_dedes/me.m05.d07:meMA.Ode4C11.incipit	…
ltx/en_us_dedes/me.m05.d07:meMA.Ode4C11.melody	@ltx/en_us_dedes/he.h.m4:heHE.EisakikoaKyrie.name
ltx/en_us_dedes/me.m05.d07:meMA.Ode4C11.mode	@ltx/en_us_dedes/miscellanea:misc.Mode4
ltx/en_us_dedes/me.m05.d07:meMA.Ode4C11.ode	@ltx/en_us_dedes/miscellanea:misc.Ode4
ltx/en_us_dedes/me.m05.d07:meMA.Ode4C11.text	
ltx/en_us_dedes/me.m05.d07:meMA.Ode4C12.incipit	…
ltx/en_us_dedes/me.m05.d07:meMA.Ode4C12.melody	@ltx/en_us_dedes/he.h.m4:heHE.EisakikoaKyrie.name
ltx/en_us_dedes/me.m05.d07:meMA.Ode4C12.mode	@ltx/en_us_dedes/miscellanea:misc.Mode4
ltx/en_us_dedes/me.m05.d07:meMA.Ode4C12.ode	@ltx/en_us_dedes/miscellanea:misc.Ode4
ltx/en_us_dedes/me.m05.d07:meMA.Ode4C12.text	
ltx/en_us_dedes/me.m05.d07:meMA.Ode4C13.incipit	…
ltx/en_us_dedes/me.m05.d07:meMA.Ode4C13.melody	@ltx/en_us_dedes/he.h.m4:heHE.EisakikoaKyrie.name
ltx/en_us_dedes/me.m05.d07:meMA.Ode4C13.mode	@ltx/en_us_dedes/miscellanea:misc.Mode4
ltx/en_us_dedes/me.m05.d07:meMA.Ode4C13.ode	@ltx/en_us_dedes/miscellanea:misc.Ode4
ltx/en_us_dedes/me.m05.d07:meMA.Ode4C13.text	
ltx/en_us_dedes/me.m05.d07:meMA.Ode4C1T.incipit	…
ltx/en_us_dedes/me.m05.d07:meMA.Ode4C1T.melody	@ltx/en_us_dedes/he.h.m4:heHE.EisakikoaKyrie.name
ltx/en_us_dedes/me.m05.d07:meMA.Ode4C1T.mode	@ltx/en_us_dedes/miscellanea:misc.Mode4
ltx/en_us_dedes/me.m05.d07:meMA.Ode4C1T.ode	@ltx/en_us_dedes/miscellanea:misc.Ode4
ltx/en_us_dedes/me.m05.d07:meMA.Ode4C1T.text	
ltx/en_us_dedes/me.m05.d07:meMA.Ode5C11.greekmelody	@ltx/en_us_dedes/he.h.m4:heHE.OTouFotosDiatmixas.greekname
ltx/en_us_dedes/me.m05.d07:meMA.Ode5C11.incipit	…
ltx/en_us_dedes/me.m05.d07:meMA.Ode5C11.melody	@ltx/en_us_dedes/he.h.m4:heHE.OTouFotosDiatmixas.name
ltx/en_us_dedes/me.m05.d07:meMA.Ode5C11.mode	@ltx/en_us_dedes/miscellanea:misc.Mode4
ltx/en_us_dedes/me.m05.d07:meMA.Ode5C11.ode	@ltx/en_us_dedes/miscellanea:misc.Ode5
ltx/en_us_dedes/me.m05.d07:meMA.Ode5C11.text	
ltx/en_us_dedes/me.m05.d07:meMA.Ode5C12.incipit	…
ltx/en_us_dedes/me.m05.d07:meMA.Ode5C12.melody	@ltx/en_us_dedes/he.h.m4:heHE.OTouFotosDiatmixas.name
ltx/en_us_dedes/me.m05.d07:meMA.Ode5C12.mode	@ltx/en_us_dedes/miscellanea:misc.Mode4
ltx/en_us_dedes/me.m05.d07:meMA.Ode5C12.ode	@ltx/en_us_dedes/miscellanea:misc.Ode5
ltx/en_us_dedes/me.m05.d07:meMA.Ode5C12.text	
ltx/en_us_dedes/me.m05.d07:meMA.Ode5C13.incipit	…
ltx/en_us_dedes/me.m05.d07:meMA.Ode5C13.melody	@ltx/en_us_dedes/he.h.m4:heHE.OTouFotosDiatmixas.name
ltx/en_us_dedes/me.m05.d07:meMA.Ode5C13.mode	@ltx/en_us_dedes/miscellanea:misc.Mode4
ltx/en_us_dedes/me.m05.d07:meMA.Ode5C13.ode	@ltx/en_us_dedes/miscellanea:misc.Ode5
ltx/en_us_dedes/me.m05.d07:meMA.Ode5C13.text	
ltx/en_us_dedes/me.m05.d07:meMA.Ode5C1T.incipit	…
ltx/en_us_dedes/me.m05.d07:meMA.Ode5C1T.melody	@ltx/en_us_dedes/he.h.m4:heHE.OTouFotosDiatmixas.name
ltx/en_us_dedes/me.m05.d07:meMA.Ode5C1T.mode	@ltx/en_us_dedes/miscellanea:misc.Mode4
ltx/en_us_dedes/me.m05.d07:meMA.Ode5C1T.ode	@ltx/en_us_dedes/miscellanea:misc.Ode5
ltx/en_us_dedes/me.m05.d07:meMA.Ode5C1T.text	
ltx/en_us_dedes/me.m05.d07:meMA.Ode6C11.greekmelody	@ltx/en_us_dedes/he.h.m4:heHE.EnToThlivesthaiMe.greekname
ltx/en_us_dedes/me.m05.d07:meMA.Ode6C11.incipit	…
ltx/en_us_dedes/me.m05.d07:meMA.Ode6C11.melody	@ltx/en_us_dedes/he.h.m4:heHE.EnToThlivesthaiMe.name
ltx/en_us_dedes/me.m05.d07:meMA.Ode6C11.mode	@ltx/en_us_dedes/miscellanea:misc.Mode4
ltx/en_us_dedes/me.m05.d07:meMA.Ode6C11.ode	@ltx/en_us_dedes/miscellanea:misc.Ode6
ltx/en_us_dedes/me.m05.d07:meMA.Ode6C11.text	
ltx/en_us_dedes/me.m05.d07:meMA.Ode6C12.incipit	…
ltx/en_us_dedes/me.m05.d07:meMA.Ode6C12.melody	@ltx/en_us_dedes/he.h.m4:heHE.EnToThlivesthaiMe.name
ltx/en_us_dedes/me.m05.d07:meMA.Ode6C12.mode	@ltx/en_us_dedes/miscellanea:misc.Mode4
ltx/en_us_dedes/me.m05.d07:meMA.Ode6C12.ode	@ltx/en_us_dedes/miscellanea:misc.Ode6
ltx/en_us_dedes/me.m05.d07:meMA.Ode6C12.text	
ltx/en_us_dedes/me.m05.d07:meMA.Ode6C13.incipit	…
ltx/en_us_dedes/me.m05.d07:meMA.Ode6C13.melody	@ltx/en_us_dedes/he.h.m4:heHE.EnToThlivesthaiMe.name
ltx/en_us_dedes/me.m05.d07:meMA.Ode6C13.mode	@ltx/en_us_dedes/miscellanea:misc.Mode4
ltx/en_us_dedes/me.m05.d07:meMA.Ode6C13.ode	@ltx/en_us_dedes/miscellanea:misc.Ode6
ltx/en_us_dedes/me.m05.d07:meMA.Ode6C13.text	
ltx/en_us_dedes/me.m05.d07:meMA.Ode6C1T.incipit	…
ltx/en_us_dedes/me.m05.d07:meMA.Ode6C1T.melody	@ltx/en_us_dedes/he.h.m4:heHE.EnToThlivesthaiMe.name
ltx/en_us_dedes/me.m05.d07:meMA.Ode6C1T.mode	@ltx/en_us_dedes/miscellanea:misc.Mode4
ltx/en_us_dedes/me.m05.d07:meMA.Ode6C1T.ode	@ltx/en_us_dedes/miscellanea:misc.Ode6
ltx/en_us_dedes/me.m05.d07:meMA.Ode6C1T.text	
ltx/en_us_dedes/me.m05.d07:meMA.Ode6H.greekmelody	@ltx/en_us_dedes/he.h.m4:heHE.EnToThlivesthaiMe.greekname
ltx/en_us_dedes/me.m05.d07:meMA.Ode6H.incipit	@ltx/en_us_dedes/he.h.m4:heHE.EnToThlivesthaiMe.incipit
ltx/en_us_dedes/me.m05.d07:meMA.Ode6H.melody	@ltx/en_us_dedes/he.h.m4:heHE.EnToThlivesthaiMe.melody
ltx/en_us_dedes/me.m05.d07:meMA.Ode6H.mode	@ltx/en_us_dedes/miscellanea:misc.Mode4
ltx/en_us_dedes/me.m05.d07:meMA.Ode6H.ode	@ltx/en_us_dedes/miscellanea:misc.Ode6
ltx/en_us_dedes/me.m05.d07:meMA.Ode6H.text	@ltx/en_us_dedes/he.h.m4:heHE.EnToThlivesthaiMe.text
ltx/en_us_dedes/me.m05.d07:meMA.Ode7C11.greekmelody	@ltx/en_us_dedes/he.h.m4:heHE.ODiasosasEnPyri.greekname
ltx/en_us_dedes/me.m05.d07:meMA.Ode7C11.incipit	…
ltx/en_us_dedes/me.m05.d07:meMA.Ode7C11.melody	@ltx/en_us_dedes/he.h.m4:heHE.ODiasosasEnPyri.name
ltx/en_us_dedes/me.m05.d07:meMA.Ode7C11.mode	@ltx/en_us_dedes/miscellanea:misc.Mode4
ltx/en_us_dedes/me.m05.d07:meMA.Ode7C11.ode	@ltx/en_us_dedes/miscellanea:misc.Ode7
ltx/en_us_dedes/me.m05.d07:meMA.Ode7C11.text	
ltx/en_us_dedes/me.m05.d07:meMA.Ode7C12.incipit	…
ltx/en_us_dedes/me.m05.d07:meMA.Ode7C12.melody	@ltx/en_us_dedes/he.h.m4:heHE.ODiasosasEnPyri.name
ltx/en_us_dedes/me.m05.d07:meMA.Ode7C12.mode	@ltx/en_us_dedes/miscellanea:misc.Mode4
ltx/en_us_dedes/me.m05.d07:meMA.Ode7C12.ode	@ltx/en_us_dedes/miscellanea:misc.Ode7
ltx/en_us_dedes/me.m05.d07:meMA.Ode7C12.text	
ltx/en_us_dedes/me.m05.d07:meMA.Ode7C13.incipit	…
ltx/en_us_dedes/me.m05.d07:meMA.Ode7C13.melody	@ltx/en_us_dedes/he.h.m4:heHE.ODiasosasEnPyri.name
ltx/en_us_dedes/me.m05.d07:meMA.Ode7C13.mode	@ltx/en_us_dedes/miscellanea:misc.Mode4
ltx/en_us_dedes/me.m05.d07:meMA.Ode7C13.ode	@ltx/en_us_dedes/miscellanea:misc.Ode7
ltx/en_us_dedes/me.m05.d07:meMA.Ode7C13.text	
ltx/en_us_dedes/me.m05.d07:meMA.Ode7C1T.incipit	…
ltx/en_us_dedes/me.m05.d07:meMA.Ode7C1T.melody	@ltx/en_us_dedes/he.h.m4:heHE.ODiasosasEnPyri.name
ltx/en_us_dedes/me.m05.d07:meMA.Ode7C1T.mode	@ltx/en_us_dedes/miscellanea:misc.Mode4
ltx/en_us_dedes/me.m05.d07:meMA.Ode7C1T.ode	@ltx/en_us_dedes/miscellanea:misc.Ode7
ltx/en_us_dedes/me.m05.d07:meMA.Ode7C1T.text	
ltx/en_us_dedes/me.m05.d07:meMA.Ode8C11.greekmelody	@ltx/en_us_dedes/he.h.m4:heHE.TonEnMorfiAngelou.greekname
ltx/en_us_dedes/me.m05.d07:meMA.Ode8C11.incipit	…
ltx/en_us_dedes/me.m05.d07:meMA.Ode8C11.melody	@ltx/en_us_dedes/he.h.m4:heHE.TonEnMorfiAngelou.name
ltx/en_us_dedes/me.m05.d07:meMA.Ode8C11.mode	@ltx/en_us_dedes/miscellanea:misc.Mode4
ltx/en_us_dedes/me.m05.d07:meMA.Ode8C11.ode	@ltx/en_us_dedes/miscellanea:misc.Ode8
ltx/en_us_dedes/me.m05.d07:meMA.Ode8C11.text	
ltx/en_us_dedes/me.m05.d07:meMA.Ode8C12.incipit	…
ltx/en_us_dedes/me.m05.d07:meMA.Ode8C12.melody	@ltx/en_us_dedes/he.h.m4:heHE.TonEnMorfiAngelou.name
ltx/en_us_dedes/me.m05.d07:meMA.Ode8C12.mode	@ltx/en_us_dedes/miscellanea:misc.Mode4
ltx/en_us_dedes/me.m05.d07:meMA.Ode8C12.ode	@ltx/en_us_dedes/miscellanea:misc.Ode8
ltx/en_us_dedes/me.m05.d07:meMA.Ode8C12.text	
ltx/en_us_dedes/me.m05.d07:meMA.Ode8C13.incipit	…
ltx/en_us_dedes/me.m05.d07:meMA.Ode8C13.melody	@ltx/en_us_dedes/he.h.m4:heHE.TonEnMorfiAngelou.name
ltx/en_us_dedes/me.m05.d07:meMA.Ode8C13.mode	@ltx/en_us_dedes/miscellanea:misc.Mode4
ltx/en_us_dedes/me.m05.d07:meMA.Ode8C13.ode	@ltx/en_us_dedes/miscellanea:misc.Ode8
ltx/en_us_dedes/me.m05.d07:meMA.Ode8C13.text	
ltx/en_us_dedes/me.m05.d07:meMA.Ode8C1T.incipit	…
ltx/en_us_dedes/me.m05.d07:meMA.Ode8C1T.melody	@ltx/en_us_dedes/he.h.m4:heHE.TonEnMorfiAngelou.name
ltx/en_us_dedes/me.m05.d07:meMA.Ode8C1T.mode	@ltx/en_us_dedes/miscellanea:misc.Mode4
ltx/en_us_dedes/me.m05.d07:meMA.Ode8C1T.ode	@ltx/en_us_dedes/miscellanea:misc.Ode8
ltx/en_us_dedes/me.m05.d07:meMA.Ode8C1T.text	
ltx/en_us_dedes/me.m05.d07:meMA.Ode8H.greekmelody	@ltx/en_us_dedes/he.h.m4:heHE.TonEnMorfiAngelou.greekname
ltx/en_us_dedes/me.m05.d07:meMA.Ode8H.incipit	@ltx/en_us_dedes/he.h.m4:heHE.TonEnMorfiAngelou.incipit
ltx/en_us_dedes/me.m05.d07:meMA.Ode8H.melody	@ltx/en_us_dedes/he.h.m4:heHE.TonEnMorfiAngelou.melody
ltx/en_us_dedes/me.m05.d07:meMA.Ode8H.mode	@ltx/en_us_dedes/miscellanea:misc.Mode4
ltx/en_us_dedes/me.m05.d07:meMA.Ode8H.ode	@ltx/en_us_dedes/miscellanea:misc.Ode8
ltx/en_us_dedes/me.m05.d07:meMA.Ode8H.text	@ltx/en_us_dedes/he.h.m4:heHE.TonEnMorfiAngelou.text
ltx/en_us_dedes/me.m05.d07:meMA.Ode9C11.greekmelody	@ltx/en_us_dedes/he.h.m4:heHE.LithosAcheirotmitos.greekname
ltx/en_us_dedes/me.m05.d07:meMA.Ode9C11.incipit	…
ltx/en_us_dedes/me.m05.d07:meMA.Ode9C11.melody	@ltx/en_us_dedes/he.h.m4:heHE.LithosAcheirotmitos.name
ltx/en_us_dedes/me.m05.d07:meMA.Ode9C11.mode	@ltx/en_us_dedes/miscellanea:misc.Mode4
ltx/en_us_dedes/me.m05.d07:meMA.Ode9C11.ode	@ltx/en_us_dedes/miscellanea:misc.Ode9
ltx/en_us_dedes/me.m05.d07:meMA.Ode9C11.text	
ltx/en_us_dedes/me.m05.d07:meMA.Ode9C12.incipit	…
ltx/en_us_dedes/me.m05.d07:meMA.Ode9C12.melody	@ltx/en_us_dedes/he.h.m4:heHE.LithosAcheirotmitos.name
ltx/en_us_dedes/me.m05.d07:meMA.Ode9C12.mode	@ltx/en_us_dedes/miscellanea:misc.Mode4
ltx/en_us_dedes/me.m05.d07:meMA.Ode9C12.ode	@ltx/en_us_dedes/miscellanea:misc.Ode9
ltx/en_us_dedes/me.m05.d07:meMA.Ode9C12.text	
ltx/en_us_dedes/me.m05.d07:meMA.Ode9C13.incipit	…
ltx/en_us_dedes/me.m05.d07:meMA.Ode9C13.melody	@ltx/en_us_dedes/he.h.m4:heHE.LithosAcheirotmitos.name
ltx/en_us_dedes/me.m05.d07:meMA.Ode9C13.mode	@ltx/en_us_dedes/miscellanea:misc.Mode4
ltx/en_us_dedes/me.m05.d07:meMA.Ode9C13.ode	@ltx/en_us_dedes/miscellanea:misc.Ode9
ltx/en_us_dedes/me.m05.d07:meMA.Ode9C13.text	
ltx/en_us_dedes/me.m05.d07:meMA.Ode9C1T.incipit	…
ltx/en_us_dedes/me.m05.d07:meMA.Ode9C1T.melody	@ltx/en_us_dedes/he.h.m4:heHE.LithosAcheirotmitos.name
ltx/en_us_dedes/me.m05.d07:meMA.Ode9C1T.mode	@ltx/en_us_dedes/miscellanea:misc.Mode4
ltx/en_us_dedes/me.m05.d07:meMA.Ode9C1T.ode	@ltx/en_us_dedes/miscellanea:misc.Ode9
ltx/en_us_dedes/me.m05.d07:meMA.Ode9C1T.text	
ltx/en_us_dedes/me.m05.d07:meMA.Ode9H.greekmelody	@ltx/en_us_dedes/he.h.m4:heHE.LithosAcheirotmitos.greekname
ltx/en_us_dedes/me.m05.d07:meMA.Ode9H.incipit	@ltx/en_us_dedes/he.h.m4:heHE.LithosAcheirotmitos.incipit
ltx/en_us_dedes/me.m05.d07:meMA.Ode9H.melody	@ltx/en_us_dedes/he.h.m4:heHE.LithosAcheirotmitos.melody
ltx/en_us_dedes/me.m05.d07:meMA.Ode9H.mode	@ltx/en_us_dedes/miscellanea:misc.Mode4
ltx/en_us_dedes/me.m05.d07:meMA.Ode9H.ode	@ltx/en_us_dedes/miscellanea:misc.Ode9
ltx/en_us_dedes/me.m05.d07:meMA.Ode9H.text	@ltx/en_us_dedes/he.h.m4:heHE.LithosAcheirotmitos.text
ltx/en_us_dedes/me.m05.d07:meMA.Oikos1.text	Open my mouth, O King of the ages, and illumine mind and my heart, and sanctify my soul, so that I may extol Your holy Cross, O Logos; send down Your Spirit and instruct me, so that with longing I may cry out:
ltx/en_us_dedes/me.m05.d07:meMA.Oikos12.text	Rejoice, O Cross, the universe’s glory; rejoice, O Cross, the Church’s power.
ltx/en_us_dedes/me.m05.d07:meMA.Oikos13.text	Rejoice, unshakable defense of priests; rejoice, precious crown of pious kings.
ltx/en_us_dedes/me.m05.d07:meMA.Oikos14.text	Rejoice, scepter of the Creator and King of all; rejoice, for Christ accepted to be nailed to you.
ltx/en_us_dedes/me.m05.d07:meMA.Oikos15.text	Rejoice, great comfort for those in trouble; rejoice, invincible armor for those in battle.
ltx/en_us_dedes/me.m05.d07:meMA.Oikos16.text	Rejoice, O Cross, the dignity of Angels; rejoice, O Cross, the help of the faithful.
ltx/en_us_dedes/me.m05.d07:meMA.Oikos17.text	Rejoice, through you Hades was despoiled; rejoice, through you we were all resurrected.
ltx/en_us_dedes/me.m05.d07:meMA.Oikos18.text	Rejoice, O blessed tree of the Cross.
ltx/en_us_dedes/me.m05.d07:meVE.Apolytikion1.incipit	The sign of Your Cross…
ltx/en_us_dedes/me.m05.d07:meVE.Apolytikion1.melody	
ltx/en_us_dedes/me.m05.d07:meVE.Apolytikion1.mode	@ltx/en_us_dedes/miscellanea:misc.Mode1
ltx/en_us_dedes/me.m05.d07:meVE.Apolytikion1.text	The sign of Your Cross shined more brightly than the sun. You made it stretch from Calvary to the holy Mount of Olives, and You demonstrated Your power that it possesses, O Savior. By it You strengthen our leaders who believe in You. We pray You continually preserve them in peace, at the intercessions of the Theotokos, O Christ our God, and save us.
ltx/en_us_dedes/me.m05.d07:meVE.SticGlory.incipit	The heavens proclaimed Your glory…
ltx/en_us_dedes/me.m05.d07:meVE.SticGlory.melody	
ltx/en_us_dedes/me.m05.d07:meVE.SticGlory.mode	@ltx/en_us_dedes/miscellanea:misc.Mode6
ltx/en_us_dedes/me.m05.d07:meVE.SticGlory.text	The heavens proclaimed Your glory today, O Lord, showing the awesome sign of Your Cross; and all the earth worshiped You with fear. We sing doxologies to You, and with gratitude we cry out: As God You are impassible, and You voluntarily condescended to physically suffer for us. Therefore, save the people that You obtained by Your own blood.
ltx/en_us_dedes/me.m05.d07:meVE.Stichera01.greekmelody	@ltx/en_us_dedes/he.a.m4:heAU.OExYpsistouKlitheis.greekname
ltx/en_us_dedes/me.m05.d07:meVE.Stichera01.incipit	Today the hosts of the…
ltx/en_us_dedes/me.m05.d07:meVE.Stichera01.melody	@ltx/en_us_dedes/he.a.m4:heAU.OExYpsistouKlitheis.name
ltx/en_us_dedes/me.m05.d07:meVE.Stichera01.mode	@ltx/en_us_dedes/miscellanea:misc.Mode4
ltx/en_us_dedes/me.m05.d07:meVE.Stichera01.text	Today the hosts of the faithful are rejoicing. * A heavenly Cross appears as far as one can see. * The sky shines light unapproachable, the air is glowing, * even the face of the earth is beautified. * And the Church of Christ is singing sacred songs of praise, * whereby she honors and venerates the very wondrous * and divine Cross that protects her from on high. * As by its power we are all made strong, * let us go the Master and cry aloud, * “Give Your peace to the whole world, and illumine our souls, Lord.”
ltx/en_us_dedes/me.m05.d07:meVE.Stichera02.incipit	Today the all-honored Cross appeared…
ltx/en_us_dedes/me.m05.d07:meVE.Stichera02.melody	@ltx/en_us_dedes/he.a.m4:heAU.OExYpsistouKlitheis.name
ltx/en_us_dedes/me.m05.d07:meVE.Stichera02.mode	@ltx/en_us_dedes/miscellanea:misc.Mode4
ltx/en_us_dedes/me.m05.d07:meVE.Stichera02.text	Today the all-honored Cross appeared in glory, * like a very precious ladder that transports from earth * into the heavens believers all, who now extol it, * and celebrate it with faith unwavering. * Every nation is rejoicing, and in earnest runs * to holy Baptism, and is glad. And decorated * in bridal fashion is the all-holy Church. * For now the Cross which Jewish men of old * tried to hide, has appeared in the sky above, * and it saves and illumines those run to it with faith in God.
ltx/en_us_dedes/me.m05.d07:meVE.Stichera03.incipit	Let all creation rejoice and…
ltx/en_us_dedes/me.m05.d07:meVE.Stichera03.melody	@ltx/en_us_dedes/he.a.m4:heAU.OExYpsistouKlitheis.name
ltx/en_us_dedes/me.m05.d07:meVE.Stichera03.mode	@ltx/en_us_dedes/miscellanea:misc.Mode4
ltx/en_us_dedes/me.m05.d07:meVE.Stichera03.text	Let all creation rejoice and be exultant. * For today the Cross has brightly shone throughout the world * with light from heaven, illumining the earth completely, * showing united what once could not be mixed. * Today, hosts of Angels join mortals and celebrate. * The middle wall that kept them apart has now been lifted * by the Cross, uniting all into one. * And now it shines more brightly than the sun, * and it brightens creation with grace divine, * and it saves and illumines all who honor it with faith in God.
