ltx/en_us_dedes/me.m10.d21:meDA.commemoration.first	Memory of our Devout Father Hilarion the Great
ltx/en_us_dedes/me.m10.d21:meDA.commemoration.first_name	
ltx/en_us_dedes/me.m10.d21:meDA.commemoration.first_short	Memory of our Devout Father Hilarion the Great
ltx/en_us_dedes/me.m10.d21:meDA.commemoration.first_title	@ltx/en_us_dedes/titles:ti.SaintM
ltx/en_us_dedes/me.m10.d21:meDA.commemoration.full	Memory of our Devout Father Hilarion the Great
ltx/en_us_dedes/me.m10.d21:meDA.commemoration.second_name	
ltx/en_us_dedes/me.m10.d21:meDA.commemoration.second_title	
ltx/en_us_dedes/me.m10.d21:meDA.date	October 21
ltx/en_us_dedes/me.m10.d21:meDA.fordate	for October 21
ltx/en_us_dedes/me.m10.d21:meDA.insert1	of our devout and God-bearing father Hilarion the Great,
ltx/en_us_dedes/me.m10.d21:meDA.insert2	whose memory we observe;
ltx/en_us_dedes/me.m10.d21:meDA.note	
ltx/en_us_dedes/me.m10.d21:meDA.pdfcoverdate	October 21,
ltx/en_us_dedes/me.m10.d21:meDA.pdfheaderdate	October 21
ltx/en_us_dedes/me.m10.d21:meHO.commemorations	
ltx/en_us_dedes/me.m10.d21:meHO.note1	
ltx/en_us_dedes/me.m10.d21:meHO.note2	
ltx/en_us_dedes/me.m10.d21:meHO.number	
ltx/en_us_dedes/me.m10.d21:meHO.rank	
ltx/en_us_dedes/me.m10.d21:meLE.commemoration1	Our Devout Father Hilarion the Great
ltx/en_us_dedes/me.m10.d21:meLE.commemoration2	
ltx/en_us_dedes/me.m10.d21:meLI.Kontakion1.greekmelody	@ltx/en_us_dedes/me.m10.d21:meMA.Kontakion1.greekmelody
ltx/en_us_dedes/me.m10.d21:meLI.Kontakion1.incipit	@ltx/en_us_dedes/me.m10.d21:meMA.Kontakion1.incipit
ltx/en_us_dedes/me.m10.d21:meLI.Kontakion1.melody	@ltx/en_us_dedes/me.m10.d21:meMA.Kontakion1.melody
ltx/en_us_dedes/me.m10.d21:meLI.Kontakion1.mode	@ltx/en_us_dedes/me.m10.d21:meMA.Kontakion1.mode
ltx/en_us_dedes/me.m10.d21:meLI.Kontakion1.text	@ltx/en_us_dedes/me.m10.d21:meMA.Kontakion1.text
ltx/en_us_dedes/me.m10.d21:meLI.Megalynarion.text	
ltx/en_us_dedes/me.m10.d21:meMA.AposGlory.incipit	We the multitudes of monastics…
ltx/en_us_dedes/me.m10.d21:meMA.AposGlory.melody	
ltx/en_us_dedes/me.m10.d21:meMA.AposGlory.mode	@ltx/en_us_dedes/miscellanea:misc.Mode8
ltx/en_us_dedes/me.m10.d21:meMA.AposGlory.text	We the multitudes of monastics honor you, O father Hilarion, as our teacher and guide. For through you we have learned to walk the truly straight and narrow path. Blessed are you, who served Christ and triumphed over the power of the enemy. As you consort now with the Angels and dwell with the Devout and Righteous, pray with them to the Lord, that He have mercy on our souls.
ltx/en_us_dedes/me.m10.d21:meMA.AposStavrotheotokion.greekmelody	@ltx/en_us_dedes/he.a.m8:heAU.OiMartyresSouKyrie.greekname
ltx/en_us_dedes/me.m10.d21:meMA.AposStavrotheotokion.incipit	@ltx/en_us_dedes/oc.m8.d6:ocVE.SticTheotokion.incipit
ltx/en_us_dedes/me.m10.d21:meMA.AposStavrotheotokion.melody	@ltx/en_us_dedes/he.a.m8:heAU.OiMartyresSouKyrie.name
ltx/en_us_dedes/me.m10.d21:meMA.AposStavrotheotokion.mode	@ltx/en_us_dedes/miscellanea:misc.Mode8
ltx/en_us_dedes/me.m10.d21:meMA.AposStavrotheotokion.text	@ltx/en_us_dedes/oc.m8.d6:ocVE.SticTheotokion.text
ltx/en_us_dedes/me.m10.d21:meMA.AposTheotokion.greekmelody	@ltx/en_us_dedes/he.a.m8:heAU.OiMartyresSouKyrie.greekname
ltx/en_us_dedes/me.m10.d21:meMA.AposTheotokion.incipit	Obscene and filthy words have…
ltx/en_us_dedes/me.m10.d21:meMA.AposTheotokion.melody	@ltx/en_us_dedes/he.a.m8:heAU.OiMartyresSouKyrie.name
ltx/en_us_dedes/me.m10.d21:meMA.AposTheotokion.mode	@ltx/en_us_dedes/miscellanea:misc.Mode8
ltx/en_us_dedes/me.m10.d21:meMA.AposTheotokion.text	Obscene and filthy words have come from my conniving lips; I have committed * indecent sinful acts. What am I to do? How shall I encounter the Judge? * Virgin Lady, I implore you pray for me * to your Son and Fashioner and Lord of all, * that He receive my spirit in penitence, as He is the only merciful God.
ltx/en_us_dedes/me.m10.d21:meMA.C1.acrostic.notice1	
ltx/en_us_dedes/me.m10.d21:meMA.C1.acrostic.text	
ltx/en_us_dedes/me.m10.d21:meMA.C1.acrostic.title	
ltx/en_us_dedes/me.m10.d21:meMA.C1.poet	@ltx/en_us_dedes/poets:po.Theofanous
ltx/en_us_dedes/me.m10.d21:meMA.C1.title	@ltx/en_us_dedes/titles:ti.CanonDevoutM
ltx/en_us_dedes/me.m10.d21:meMA.C1.verse	@ltx/en_us_dedes/prayers:pr.verse_DevoutMan.text
ltx/en_us_dedes/me.m10.d21:meMA.ExapTheotokion.incipit	Since you, O Virgin, are…
ltx/en_us_dedes/me.m10.d21:meMA.ExapTheotokion.melody	@ltx/en_us_dedes/he.a.m3:heAU.OOuranonToisAstrois.name
ltx/en_us_dedes/me.m10.d21:meMA.ExapTheotokion.mode	@ltx/en_us_dedes/miscellanea:misc.Mode3
ltx/en_us_dedes/me.m10.d21:meMA.ExapTheotokion.text	Since you, O Virgin, are Mother * of the Creator of ages * and of the Master of Angels, * we therefore pray you entreat Him * to grant us who are your servants * to stand on His right in heaven.
ltx/en_us_dedes/me.m10.d21:meMA.Exaposteilarion1.greekmelody	@ltx/en_us_dedes/he.a.m3:heAU.OOuranonToisAstrois.greekname
ltx/en_us_dedes/me.m10.d21:meMA.Exaposteilarion1.incipit	Devout and holy Father, *…
ltx/en_us_dedes/me.m10.d21:meMA.Exaposteilarion1.melody	@ltx/en_us_dedes/he.a.m3:heAU.OOuranonToisAstrois.name
ltx/en_us_dedes/me.m10.d21:meMA.Exaposteilarion1.mode	@ltx/en_us_dedes/miscellanea:misc.Mode3
ltx/en_us_dedes/me.m10.d21:meMA.Exaposteilarion1.text	Devout and holy Father, * the Lord who knows the thoughts of all * beholding how you were cheerful * and how your mind was very pure * made you, the pride of monastics, * a world-renowned luminary.
ltx/en_us_dedes/me.m10.d21:meMA.Kontakion1.greekmelody	@ltx/en_us_dedes/he.a.m3:heAU.IParthenosSimeron.greekname
ltx/en_us_dedes/me.m10.d21:meMA.Kontakion1.incipit	…
ltx/en_us_dedes/me.m10.d21:meMA.Kontakion1.melody	@ltx/en_us_dedes/he.a.m3:heAU.IParthenosSimeron.name
ltx/en_us_dedes/me.m10.d21:meMA.Kontakion1.mode	@ltx/en_us_dedes/miscellanea:misc.Mode3
ltx/en_us_dedes/me.m10.d21:meMA.Kontakion1.text	
ltx/en_us_dedes/me.m10.d21:meMA.Lauds1.greekmelody	@ltx/en_us_dedes/he.a.m6:heAU.OlinApothemenoi.greekname
ltx/en_us_dedes/me.m10.d21:meMA.Lauds1.incipit	Dedicated to the Lord *…
ltx/en_us_dedes/me.m10.d21:meMA.Lauds1.melody	@ltx/en_us_dedes/he.a.m6:heAU.OlinApothemenoi.name
ltx/en_us_dedes/me.m10.d21:meMA.Lauds1.mode	@ltx/en_us_dedes/miscellanea:misc.Mode6
ltx/en_us_dedes/me.m10.d21:meMA.Lauds1.text	Dedicated to the Lord * in every way and at all times, * you had mortified your flesh * by ascetic discipline in virtue from youth; * but the eye of your soul, * Father, by your radiant * contemplations you had vivified. * So when you thus became * able to receive what the Lord bestows, * you gained the gifts of grace divine, * healings and performing of miracles; * and to all in need you distribute the abundant gifts of God, * and you entreat Him with confidence, * praying that He save our souls.
ltx/en_us_dedes/me.m10.d21:meMA.Lauds2.incipit	O devout Hilarion, * when…
ltx/en_us_dedes/me.m10.d21:meMA.Lauds2.melody	@ltx/en_us_dedes/he.a.m6:heAU.OlinApothemenoi.name
ltx/en_us_dedes/me.m10.d21:meMA.Lauds2.mode	@ltx/en_us_dedes/miscellanea:misc.Mode6
ltx/en_us_dedes/me.m10.d21:meMA.Lauds2.text	O devout Hilarion, * when you received the tri-solar * radiance with brilliant light, * then like a perceptible brightly shining sun * you moved over the earth, * unto all dispersing * holy sunbeams of your miracles. * Thus the recipients * of your benefactions, who had enjoyed * the healings you performed on them, * godly-minded Father, and who obtained * by your sacred teachings, * salvation, were proclaiming that you are * a Prophet, worker of miracles, * and a saint inspired by God.
ltx/en_us_dedes/me.m10.d21:meMA.Lauds3.incipit	When you passed beyond delights…
ltx/en_us_dedes/me.m10.d21:meMA.Lauds3.melody	@ltx/en_us_dedes/he.a.m6:heAU.OlinApothemenoi.name
ltx/en_us_dedes/me.m10.d21:meMA.Lauds3.mode	@ltx/en_us_dedes/miscellanea:misc.Mode6
ltx/en_us_dedes/me.m10.d21:meMA.Lauds3.text	When you passed beyond delights * of life and all things apparent, * O devout Hilarion, * and by grace passed over to things immovable * and perceived by the mind, * you conversed then purely * with the only absolutely pure, * because of sharpness of * intellect and purity of your soul; * and though you were material * you lived like an Angel, O holy one. * Now that you are standing * beside the Master Christ, the Lord of all, * will you entreat Him with confidence, * praying that He save our souls.
ltx/en_us_dedes/me.m10.d21:meMA.LaudsGlory.incipit	…
ltx/en_us_dedes/me.m10.d21:meMA.LaudsGlory.melody	
ltx/en_us_dedes/me.m10.d21:meMA.LaudsGlory.mode	@ltx/en_us_dedes/miscellanea:misc.Mode2
ltx/en_us_dedes/me.m10.d21:meMA.LaudsGlory.text	
ltx/en_us_dedes/me.m10.d21:meMA.LaudsStavrotheotokion.greekmelody	@ltx/en_us_dedes/he.a.m2:heAU.OteEkTouXylou.greekname
ltx/en_us_dedes/me.m10.d21:meMA.LaudsStavrotheotokion.incipit	@ltx/en_us_dedes/me.m10.d02:meVE.SticStavrotheotokion.incipit
ltx/en_us_dedes/me.m10.d21:meMA.LaudsStavrotheotokion.melody	@ltx/en_us_dedes/he.a.m2:heAU.OteEkTouXylou.name
ltx/en_us_dedes/me.m10.d21:meMA.LaudsStavrotheotokion.mode	@ltx/en_us_dedes/miscellanea:misc.Mode2
ltx/en_us_dedes/me.m10.d21:meMA.LaudsStavrotheotokion.text	@ltx/en_us_dedes/me.m10.d02:meVE.SticStavrotheotokion.text
ltx/en_us_dedes/me.m10.d21:meMA.LaudsTheotokion.greekmelody	@ltx/en_us_dedes/he.a.m2:heAU.OteEkTouXylou.greekname
ltx/en_us_dedes/me.m10.d21:meMA.LaudsTheotokion.incipit	I am now entirely consumed…
ltx/en_us_dedes/me.m10.d21:meMA.LaudsTheotokion.melody	@ltx/en_us_dedes/he.a.m2:heAU.OteEkTouXylou.name
ltx/en_us_dedes/me.m10.d21:meMA.LaudsTheotokion.mode	@ltx/en_us_dedes/miscellanea:misc.Mode2
ltx/en_us_dedes/me.m10.d21:meMA.LaudsTheotokion.text	I am now entirely consumed * by destructive pleasures, succumbing to vice of every kind; * wretched that I am, from youth and even into old age, * I am wholly despicable, * a slave to bad habits. * Lady, to the One who takes away the sins of the world * you gave birth ineffably, therefore * I implore you, earnestly pray Him * to grant me forgiveness of my many sins.
ltx/en_us_dedes/me.m10.d21:meMA.MM.Lauds1123as5678.text	@ltx/en_us_dedes/properties:media.key
ltx/en_us_dedes/me.m10.d21:meMA.Ode1C11.greekmelody	@ltx/en_us_dedes/he.h.m2:heHE.EnVythoKatestrose.greekname
ltx/en_us_dedes/me.m10.d21:meMA.Ode1C11.incipit	…
ltx/en_us_dedes/me.m10.d21:meMA.Ode1C11.melody	@ltx/en_us_dedes/he.h.m2:heHE.EnVythoKatestrose.name
ltx/en_us_dedes/me.m10.d21:meMA.Ode1C11.mode	@ltx/en_us_dedes/miscellanea:misc.Mode2
ltx/en_us_dedes/me.m10.d21:meMA.Ode1C11.ode	@ltx/en_us_dedes/miscellanea:misc.Ode1
ltx/en_us_dedes/me.m10.d21:meMA.Ode1C11.text	
ltx/en_us_dedes/me.m10.d21:meMA.Ode1C12.incipit	…
ltx/en_us_dedes/me.m10.d21:meMA.Ode1C12.melody	@ltx/en_us_dedes/he.h.m2:heHE.EnVythoKatestrose.name
ltx/en_us_dedes/me.m10.d21:meMA.Ode1C12.mode	@ltx/en_us_dedes/miscellanea:misc.Mode2
ltx/en_us_dedes/me.m10.d21:meMA.Ode1C12.ode	@ltx/en_us_dedes/miscellanea:misc.Ode1
ltx/en_us_dedes/me.m10.d21:meMA.Ode1C12.text	
ltx/en_us_dedes/me.m10.d21:meMA.Ode1C13.incipit	…
ltx/en_us_dedes/me.m10.d21:meMA.Ode1C13.melody	@ltx/en_us_dedes/he.h.m2:heHE.EnVythoKatestrose.name
ltx/en_us_dedes/me.m10.d21:meMA.Ode1C13.mode	@ltx/en_us_dedes/miscellanea:misc.Mode2
ltx/en_us_dedes/me.m10.d21:meMA.Ode1C13.ode	@ltx/en_us_dedes/miscellanea:misc.Ode1
ltx/en_us_dedes/me.m10.d21:meMA.Ode1C13.text	
ltx/en_us_dedes/me.m10.d21:meMA.Ode1C1T.incipit	…
ltx/en_us_dedes/me.m10.d21:meMA.Ode1C1T.melody	@ltx/en_us_dedes/he.h.m2:heHE.EnVythoKatestrose.name
ltx/en_us_dedes/me.m10.d21:meMA.Ode1C1T.mode	@ltx/en_us_dedes/miscellanea:misc.Mode2
ltx/en_us_dedes/me.m10.d21:meMA.Ode1C1T.ode	@ltx/en_us_dedes/miscellanea:misc.Ode1
ltx/en_us_dedes/me.m10.d21:meMA.Ode1C1T.text	
ltx/en_us_dedes/me.m10.d21:meMA.Ode3C11.greekmelody	@ltx/en_us_dedes/he.h.m2:heHE.EnPetraMeTisPisteos.greekname
ltx/en_us_dedes/me.m10.d21:meMA.Ode3C11.incipit	…
ltx/en_us_dedes/me.m10.d21:meMA.Ode3C11.melody	@ltx/en_us_dedes/he.h.m2:heHE.EnPetraMeTisPisteos.name
ltx/en_us_dedes/me.m10.d21:meMA.Ode3C11.mode	@ltx/en_us_dedes/miscellanea:misc.Mode2
ltx/en_us_dedes/me.m10.d21:meMA.Ode3C11.ode	@ltx/en_us_dedes/miscellanea:misc.Ode3
ltx/en_us_dedes/me.m10.d21:meMA.Ode3C11.text	
ltx/en_us_dedes/me.m10.d21:meMA.Ode3C12.incipit	…
ltx/en_us_dedes/me.m10.d21:meMA.Ode3C12.melody	@ltx/en_us_dedes/he.h.m2:heHE.EnPetraMeTisPisteos.name
ltx/en_us_dedes/me.m10.d21:meMA.Ode3C12.mode	@ltx/en_us_dedes/miscellanea:misc.Mode2
ltx/en_us_dedes/me.m10.d21:meMA.Ode3C12.ode	@ltx/en_us_dedes/miscellanea:misc.Ode3
ltx/en_us_dedes/me.m10.d21:meMA.Ode3C12.text	
ltx/en_us_dedes/me.m10.d21:meMA.Ode3C13.incipit	…
ltx/en_us_dedes/me.m10.d21:meMA.Ode3C13.melody	@ltx/en_us_dedes/he.h.m2:heHE.EnPetraMeTisPisteos.name
ltx/en_us_dedes/me.m10.d21:meMA.Ode3C13.mode	@ltx/en_us_dedes/miscellanea:misc.Mode2
ltx/en_us_dedes/me.m10.d21:meMA.Ode3C13.ode	@ltx/en_us_dedes/miscellanea:misc.Ode3
ltx/en_us_dedes/me.m10.d21:meMA.Ode3C13.text	
ltx/en_us_dedes/me.m10.d21:meMA.Ode3C1T.incipit	…
ltx/en_us_dedes/me.m10.d21:meMA.Ode3C1T.melody	@ltx/en_us_dedes/he.h.m2:heHE.EnPetraMeTisPisteos.name
ltx/en_us_dedes/me.m10.d21:meMA.Ode3C1T.mode	@ltx/en_us_dedes/miscellanea:misc.Mode2
ltx/en_us_dedes/me.m10.d21:meMA.Ode3C1T.ode	@ltx/en_us_dedes/miscellanea:misc.Ode3
ltx/en_us_dedes/me.m10.d21:meMA.Ode3C1T.text	
ltx/en_us_dedes/me.m10.d21:meMA.Ode3H.greekmelody	@ltx/en_us_dedes/he.h.m2:heHE.EnPetraMeTisPisteos.greekname
ltx/en_us_dedes/me.m10.d21:meMA.Ode3H.incipit	@ltx/en_us_dedes/he.h.m2:heHE.EnPetraMeTisPisteos.incipit
ltx/en_us_dedes/me.m10.d21:meMA.Ode3H.melody	@ltx/en_us_dedes/he.h.m2:heHE.EnPetraMeTisPisteos.melody
ltx/en_us_dedes/me.m10.d21:meMA.Ode3H.mode	@ltx/en_us_dedes/miscellanea:misc.Mode2
ltx/en_us_dedes/me.m10.d21:meMA.Ode3H.ode	@ltx/en_us_dedes/miscellanea:misc.Ode3
ltx/en_us_dedes/me.m10.d21:meMA.Ode3H.text	@ltx/en_us_dedes/he.h.m2:heHE.EnPetraMeTisPisteos.text
ltx/en_us_dedes/me.m10.d21:meMA.Ode3Kathisma1.greekmelody	@ltx/en_us_dedes/he.a.m8:heAU.TinSofianKaiLogon.greekname
ltx/en_us_dedes/me.m10.d21:meMA.Ode3Kathisma1.incipit	…
ltx/en_us_dedes/me.m10.d21:meMA.Ode3Kathisma1.melody	@ltx/en_us_dedes/he.a.m8:heAU.TinSofianKaiLogon.name
ltx/en_us_dedes/me.m10.d21:meMA.Ode3Kathisma1.mode	@ltx/en_us_dedes/miscellanea:misc.Mode8
ltx/en_us_dedes/me.m10.d21:meMA.Ode3Kathisma1.text	
ltx/en_us_dedes/me.m10.d21:meMA.Ode3KathismaSt.incipit	@ltx/en_us_dedes/me.m10.d12:meMA.Ode3KathismaSt.incipit
ltx/en_us_dedes/me.m10.d21:meMA.Ode3KathismaSt.melody	@ltx/en_us_dedes/he.a.m8:heAU.TinSofianKaiLogon.name
ltx/en_us_dedes/me.m10.d21:meMA.Ode3KathismaSt.mode	@ltx/en_us_dedes/miscellanea:misc.Mode8
ltx/en_us_dedes/me.m10.d21:meMA.Ode3KathismaSt.text	@ltx/en_us_dedes/me.m10.d12:meMA.Ode3KathismaSt.text
ltx/en_us_dedes/me.m10.d21:meMA.Ode3KathismaT.incipit	@ltx/en_us_dedes/me.m10.d06:meMA.Ode3KathismaT.incipit
ltx/en_us_dedes/me.m10.d21:meMA.Ode3KathismaT.melody	@ltx/en_us_dedes/he.a.m8:heAU.TinSofianKaiLogon.name
ltx/en_us_dedes/me.m10.d21:meMA.Ode3KathismaT.mode	@ltx/en_us_dedes/miscellanea:misc.Mode8
ltx/en_us_dedes/me.m10.d21:meMA.Ode3KathismaT.text	@ltx/en_us_dedes/me.m10.d06:meMA.Ode3KathismaT.text
ltx/en_us_dedes/me.m10.d21:meMA.Ode4C11.greekmelody	@ltx/en_us_dedes/he.h.m2:heHE.YmnoSeAkoi.greekname
ltx/en_us_dedes/me.m10.d21:meMA.Ode4C11.incipit	…
ltx/en_us_dedes/me.m10.d21:meMA.Ode4C11.melody	@ltx/en_us_dedes/he.h.m2:heHE.YmnoSeAkoi.name
ltx/en_us_dedes/me.m10.d21:meMA.Ode4C11.mode	@ltx/en_us_dedes/miscellanea:misc.Mode2
ltx/en_us_dedes/me.m10.d21:meMA.Ode4C11.ode	@ltx/en_us_dedes/miscellanea:misc.Ode4
ltx/en_us_dedes/me.m10.d21:meMA.Ode4C11.text	
ltx/en_us_dedes/me.m10.d21:meMA.Ode4C12.incipit	…
ltx/en_us_dedes/me.m10.d21:meMA.Ode4C12.melody	@ltx/en_us_dedes/he.h.m2:heHE.YmnoSeAkoi.name
ltx/en_us_dedes/me.m10.d21:meMA.Ode4C12.mode	@ltx/en_us_dedes/miscellanea:misc.Mode2
ltx/en_us_dedes/me.m10.d21:meMA.Ode4C12.ode	@ltx/en_us_dedes/miscellanea:misc.Ode4
ltx/en_us_dedes/me.m10.d21:meMA.Ode4C12.text	
ltx/en_us_dedes/me.m10.d21:meMA.Ode4C13.incipit	…
ltx/en_us_dedes/me.m10.d21:meMA.Ode4C13.melody	@ltx/en_us_dedes/he.h.m2:heHE.YmnoSeAkoi.name
ltx/en_us_dedes/me.m10.d21:meMA.Ode4C13.mode	@ltx/en_us_dedes/miscellanea:misc.Mode2
ltx/en_us_dedes/me.m10.d21:meMA.Ode4C13.ode	@ltx/en_us_dedes/miscellanea:misc.Ode4
ltx/en_us_dedes/me.m10.d21:meMA.Ode4C13.text	
ltx/en_us_dedes/me.m10.d21:meMA.Ode4C1T.incipit	…
ltx/en_us_dedes/me.m10.d21:meMA.Ode4C1T.melody	@ltx/en_us_dedes/he.h.m2:heHE.YmnoSeAkoi.name
ltx/en_us_dedes/me.m10.d21:meMA.Ode4C1T.mode	@ltx/en_us_dedes/miscellanea:misc.Mode2
ltx/en_us_dedes/me.m10.d21:meMA.Ode4C1T.ode	@ltx/en_us_dedes/miscellanea:misc.Ode4
ltx/en_us_dedes/me.m10.d21:meMA.Ode4C1T.text	
ltx/en_us_dedes/me.m10.d21:meMA.Ode5C11.greekmelody	@ltx/en_us_dedes/he.h.m2:heHE.OFotismos.greekname
ltx/en_us_dedes/me.m10.d21:meMA.Ode5C11.incipit	…
ltx/en_us_dedes/me.m10.d21:meMA.Ode5C11.melody	@ltx/en_us_dedes/he.h.m2:heHE.OFotismos.name
ltx/en_us_dedes/me.m10.d21:meMA.Ode5C11.mode	@ltx/en_us_dedes/miscellanea:misc.Mode2
ltx/en_us_dedes/me.m10.d21:meMA.Ode5C11.ode	@ltx/en_us_dedes/miscellanea:misc.Ode5
ltx/en_us_dedes/me.m10.d21:meMA.Ode5C11.text	
ltx/en_us_dedes/me.m10.d21:meMA.Ode5C12.incipit	…
ltx/en_us_dedes/me.m10.d21:meMA.Ode5C12.melody	@ltx/en_us_dedes/he.h.m2:heHE.OFotismos.name
ltx/en_us_dedes/me.m10.d21:meMA.Ode5C12.mode	@ltx/en_us_dedes/miscellanea:misc.Mode2
ltx/en_us_dedes/me.m10.d21:meMA.Ode5C12.ode	@ltx/en_us_dedes/miscellanea:misc.Ode5
ltx/en_us_dedes/me.m10.d21:meMA.Ode5C12.text	
ltx/en_us_dedes/me.m10.d21:meMA.Ode5C13.incipit	…
ltx/en_us_dedes/me.m10.d21:meMA.Ode5C13.melody	@ltx/en_us_dedes/he.h.m2:heHE.OFotismos.name
ltx/en_us_dedes/me.m10.d21:meMA.Ode5C13.mode	@ltx/en_us_dedes/miscellanea:misc.Mode2
ltx/en_us_dedes/me.m10.d21:meMA.Ode5C13.ode	@ltx/en_us_dedes/miscellanea:misc.Ode5
ltx/en_us_dedes/me.m10.d21:meMA.Ode5C13.text	
ltx/en_us_dedes/me.m10.d21:meMA.Ode5C1T.incipit	…
ltx/en_us_dedes/me.m10.d21:meMA.Ode5C1T.melody	@ltx/en_us_dedes/he.h.m2:heHE.OFotismos.name
ltx/en_us_dedes/me.m10.d21:meMA.Ode5C1T.mode	@ltx/en_us_dedes/miscellanea:misc.Mode2
ltx/en_us_dedes/me.m10.d21:meMA.Ode5C1T.ode	@ltx/en_us_dedes/miscellanea:misc.Ode5
ltx/en_us_dedes/me.m10.d21:meMA.Ode5C1T.text	
ltx/en_us_dedes/me.m10.d21:meMA.Ode6C11.greekmelody	@ltx/en_us_dedes/he.h.m2:heHE.EnAvyssoPtaismaton.greekname
ltx/en_us_dedes/me.m10.d21:meMA.Ode6C11.incipit	…
ltx/en_us_dedes/me.m10.d21:meMA.Ode6C11.melody	@ltx/en_us_dedes/he.h.m2:heHE.EnAvyssoPtaismaton.name
ltx/en_us_dedes/me.m10.d21:meMA.Ode6C11.mode	@ltx/en_us_dedes/miscellanea:misc.Mode2
ltx/en_us_dedes/me.m10.d21:meMA.Ode6C11.ode	@ltx/en_us_dedes/miscellanea:misc.Ode6
ltx/en_us_dedes/me.m10.d21:meMA.Ode6C11.text	
ltx/en_us_dedes/me.m10.d21:meMA.Ode6C12.incipit	…
ltx/en_us_dedes/me.m10.d21:meMA.Ode6C12.melody	@ltx/en_us_dedes/he.h.m2:heHE.EnAvyssoPtaismaton.name
ltx/en_us_dedes/me.m10.d21:meMA.Ode6C12.mode	@ltx/en_us_dedes/miscellanea:misc.Mode2
ltx/en_us_dedes/me.m10.d21:meMA.Ode6C12.ode	@ltx/en_us_dedes/miscellanea:misc.Ode6
ltx/en_us_dedes/me.m10.d21:meMA.Ode6C12.text	
ltx/en_us_dedes/me.m10.d21:meMA.Ode6C13.incipit	…
ltx/en_us_dedes/me.m10.d21:meMA.Ode6C13.melody	@ltx/en_us_dedes/he.h.m2:heHE.EnAvyssoPtaismaton.name
ltx/en_us_dedes/me.m10.d21:meMA.Ode6C13.mode	@ltx/en_us_dedes/miscellanea:misc.Mode2
ltx/en_us_dedes/me.m10.d21:meMA.Ode6C13.ode	@ltx/en_us_dedes/miscellanea:misc.Ode6
ltx/en_us_dedes/me.m10.d21:meMA.Ode6C13.text	
ltx/en_us_dedes/me.m10.d21:meMA.Ode6C1T.incipit	…
ltx/en_us_dedes/me.m10.d21:meMA.Ode6C1T.melody	@ltx/en_us_dedes/he.h.m2:heHE.EnAvyssoPtaismaton.name
ltx/en_us_dedes/me.m10.d21:meMA.Ode6C1T.mode	@ltx/en_us_dedes/miscellanea:misc.Mode2
ltx/en_us_dedes/me.m10.d21:meMA.Ode6C1T.ode	@ltx/en_us_dedes/miscellanea:misc.Ode6
ltx/en_us_dedes/me.m10.d21:meMA.Ode6C1T.text	
ltx/en_us_dedes/me.m10.d21:meMA.Ode6H.greekmelody	@ltx/en_us_dedes/he.h.m2:heHE.EnAvyssoPtaismaton.greekname
ltx/en_us_dedes/me.m10.d21:meMA.Ode6H.incipit	@ltx/en_us_dedes/he.h.m2:heHE.EnAvyssoPtaismaton.incipit
ltx/en_us_dedes/me.m10.d21:meMA.Ode6H.melody	@ltx/en_us_dedes/he.h.m2:heHE.EnAvyssoPtaismaton.melody
ltx/en_us_dedes/me.m10.d21:meMA.Ode6H.mode	@ltx/en_us_dedes/miscellanea:misc.Mode2
ltx/en_us_dedes/me.m10.d21:meMA.Ode6H.ode	@ltx/en_us_dedes/miscellanea:misc.Ode6
ltx/en_us_dedes/me.m10.d21:meMA.Ode6H.text	@ltx/en_us_dedes/he.h.m2:heHE.EnAvyssoPtaismaton.text
ltx/en_us_dedes/me.m10.d21:meMA.Ode7C11.greekmelody	@ltx/en_us_dedes/he.h.m2:heHE.AntitheonProstagma.greekname
ltx/en_us_dedes/me.m10.d21:meMA.Ode7C11.incipit	…
ltx/en_us_dedes/me.m10.d21:meMA.Ode7C11.melody	@ltx/en_us_dedes/he.h.m2:heHE.AntitheonProstagma.name
ltx/en_us_dedes/me.m10.d21:meMA.Ode7C11.mode	@ltx/en_us_dedes/miscellanea:misc.Mode2
ltx/en_us_dedes/me.m10.d21:meMA.Ode7C11.ode	@ltx/en_us_dedes/miscellanea:misc.Ode7
ltx/en_us_dedes/me.m10.d21:meMA.Ode7C11.text	
ltx/en_us_dedes/me.m10.d21:meMA.Ode7C12.incipit	…
ltx/en_us_dedes/me.m10.d21:meMA.Ode7C12.melody	@ltx/en_us_dedes/he.h.m2:heHE.AntitheonProstagma.name
ltx/en_us_dedes/me.m10.d21:meMA.Ode7C12.mode	@ltx/en_us_dedes/miscellanea:misc.Mode2
ltx/en_us_dedes/me.m10.d21:meMA.Ode7C12.ode	@ltx/en_us_dedes/miscellanea:misc.Ode7
ltx/en_us_dedes/me.m10.d21:meMA.Ode7C12.text	
ltx/en_us_dedes/me.m10.d21:meMA.Ode7C13.incipit	…
ltx/en_us_dedes/me.m10.d21:meMA.Ode7C13.melody	@ltx/en_us_dedes/he.h.m2:heHE.AntitheonProstagma.name
ltx/en_us_dedes/me.m10.d21:meMA.Ode7C13.mode	@ltx/en_us_dedes/miscellanea:misc.Mode2
ltx/en_us_dedes/me.m10.d21:meMA.Ode7C13.ode	@ltx/en_us_dedes/miscellanea:misc.Ode7
ltx/en_us_dedes/me.m10.d21:meMA.Ode7C13.text	
ltx/en_us_dedes/me.m10.d21:meMA.Ode7C1T.incipit	…
ltx/en_us_dedes/me.m10.d21:meMA.Ode7C1T.melody	@ltx/en_us_dedes/he.h.m2:heHE.AntitheonProstagma.name
ltx/en_us_dedes/me.m10.d21:meMA.Ode7C1T.mode	@ltx/en_us_dedes/miscellanea:misc.Mode2
ltx/en_us_dedes/me.m10.d21:meMA.Ode7C1T.ode	@ltx/en_us_dedes/miscellanea:misc.Ode7
ltx/en_us_dedes/me.m10.d21:meMA.Ode7C1T.text	
ltx/en_us_dedes/me.m10.d21:meMA.Ode8C11.greekmelody	@ltx/en_us_dedes/he.h.m2:heHE.KaminosPote.greekname
ltx/en_us_dedes/me.m10.d21:meMA.Ode8C11.incipit	…
ltx/en_us_dedes/me.m10.d21:meMA.Ode8C11.melody	@ltx/en_us_dedes/he.h.m2:heHE.KaminosPote.name
ltx/en_us_dedes/me.m10.d21:meMA.Ode8C11.mode	@ltx/en_us_dedes/miscellanea:misc.Mode2
ltx/en_us_dedes/me.m10.d21:meMA.Ode8C11.ode	@ltx/en_us_dedes/miscellanea:misc.Ode8
ltx/en_us_dedes/me.m10.d21:meMA.Ode8C11.text	
ltx/en_us_dedes/me.m10.d21:meMA.Ode8C12.incipit	…
ltx/en_us_dedes/me.m10.d21:meMA.Ode8C12.melody	@ltx/en_us_dedes/he.h.m2:heHE.KaminosPote.name
ltx/en_us_dedes/me.m10.d21:meMA.Ode8C12.mode	@ltx/en_us_dedes/miscellanea:misc.Mode2
ltx/en_us_dedes/me.m10.d21:meMA.Ode8C12.ode	@ltx/en_us_dedes/miscellanea:misc.Ode8
ltx/en_us_dedes/me.m10.d21:meMA.Ode8C12.text	
ltx/en_us_dedes/me.m10.d21:meMA.Ode8C13.incipit	…
ltx/en_us_dedes/me.m10.d21:meMA.Ode8C13.melody	@ltx/en_us_dedes/he.h.m2:heHE.KaminosPote.name
ltx/en_us_dedes/me.m10.d21:meMA.Ode8C13.mode	@ltx/en_us_dedes/miscellanea:misc.Mode2
ltx/en_us_dedes/me.m10.d21:meMA.Ode8C13.ode	@ltx/en_us_dedes/miscellanea:misc.Ode8
ltx/en_us_dedes/me.m10.d21:meMA.Ode8C13.text	
ltx/en_us_dedes/me.m10.d21:meMA.Ode8C1T.incipit	…
ltx/en_us_dedes/me.m10.d21:meMA.Ode8C1T.melody	@ltx/en_us_dedes/he.h.m2:heHE.KaminosPote.name
ltx/en_us_dedes/me.m10.d21:meMA.Ode8C1T.mode	@ltx/en_us_dedes/miscellanea:misc.Mode2
ltx/en_us_dedes/me.m10.d21:meMA.Ode8C1T.ode	@ltx/en_us_dedes/miscellanea:misc.Ode8
ltx/en_us_dedes/me.m10.d21:meMA.Ode8C1T.text	
ltx/en_us_dedes/me.m10.d21:meMA.Ode8H.greekmelody	@ltx/en_us_dedes/he.h.m2:heHE.KaminosPote.greekname
ltx/en_us_dedes/me.m10.d21:meMA.Ode8H.incipit	@ltx/en_us_dedes/he.h.m2:heHE.KaminosPote.incipit
ltx/en_us_dedes/me.m10.d21:meMA.Ode8H.melody	@ltx/en_us_dedes/he.h.m2:heHE.KaminosPote.melody
ltx/en_us_dedes/me.m10.d21:meMA.Ode8H.mode	@ltx/en_us_dedes/miscellanea:misc.Mode2
ltx/en_us_dedes/me.m10.d21:meMA.Ode8H.ode	@ltx/en_us_dedes/miscellanea:misc.Ode8
ltx/en_us_dedes/me.m10.d21:meMA.Ode8H.text	@ltx/en_us_dedes/he.h.m2:heHE.KaminosPote.text
ltx/en_us_dedes/me.m10.d21:meMA.Ode9C11.greekmelody	@ltx/en_us_dedes/he.h.m2:heHE.AnarchouGennitoros.greekname
ltx/en_us_dedes/me.m10.d21:meMA.Ode9C11.incipit	…
ltx/en_us_dedes/me.m10.d21:meMA.Ode9C11.melody	@ltx/en_us_dedes/he.h.m2:heHE.AnarchouGennitoros.name
ltx/en_us_dedes/me.m10.d21:meMA.Ode9C11.mode	@ltx/en_us_dedes/miscellanea:misc.Mode2
ltx/en_us_dedes/me.m10.d21:meMA.Ode9C11.ode	@ltx/en_us_dedes/miscellanea:misc.Ode9
ltx/en_us_dedes/me.m10.d21:meMA.Ode9C11.text	
ltx/en_us_dedes/me.m10.d21:meMA.Ode9C12.incipit	…
ltx/en_us_dedes/me.m10.d21:meMA.Ode9C12.melody	@ltx/en_us_dedes/he.h.m2:heHE.AnarchouGennitoros.name
ltx/en_us_dedes/me.m10.d21:meMA.Ode9C12.mode	@ltx/en_us_dedes/miscellanea:misc.Mode2
ltx/en_us_dedes/me.m10.d21:meMA.Ode9C12.ode	@ltx/en_us_dedes/miscellanea:misc.Ode9
ltx/en_us_dedes/me.m10.d21:meMA.Ode9C12.text	
ltx/en_us_dedes/me.m10.d21:meMA.Ode9C13.incipit	…
ltx/en_us_dedes/me.m10.d21:meMA.Ode9C13.melody	@ltx/en_us_dedes/he.h.m2:heHE.AnarchouGennitoros.name
ltx/en_us_dedes/me.m10.d21:meMA.Ode9C13.mode	@ltx/en_us_dedes/miscellanea:misc.Mode2
ltx/en_us_dedes/me.m10.d21:meMA.Ode9C13.ode	@ltx/en_us_dedes/miscellanea:misc.Ode9
ltx/en_us_dedes/me.m10.d21:meMA.Ode9C13.text	
ltx/en_us_dedes/me.m10.d21:meMA.Ode9C1T.incipit	…
ltx/en_us_dedes/me.m10.d21:meMA.Ode9C1T.melody	@ltx/en_us_dedes/he.h.m2:heHE.AnarchouGennitoros.name
ltx/en_us_dedes/me.m10.d21:meMA.Ode9C1T.mode	@ltx/en_us_dedes/miscellanea:misc.Mode2
ltx/en_us_dedes/me.m10.d21:meMA.Ode9C1T.ode	@ltx/en_us_dedes/miscellanea:misc.Ode9
ltx/en_us_dedes/me.m10.d21:meMA.Ode9C1T.text	
ltx/en_us_dedes/me.m10.d21:meMA.Ode9H.greekmelody	@ltx/en_us_dedes/he.h.m2:heHE.AnarchouGennitoros.greekname
ltx/en_us_dedes/me.m10.d21:meMA.Ode9H.incipit	@ltx/en_us_dedes/he.h.m2:heHE.AnarchouGennitoros.incipit
ltx/en_us_dedes/me.m10.d21:meMA.Ode9H.melody	@ltx/en_us_dedes/he.h.m2:heHE.AnarchouGennitoros.melody
ltx/en_us_dedes/me.m10.d21:meMA.Ode9H.mode	@ltx/en_us_dedes/miscellanea:misc.Mode2
ltx/en_us_dedes/me.m10.d21:meMA.Ode9H.ode	@ltx/en_us_dedes/miscellanea:misc.Ode9
ltx/en_us_dedes/me.m10.d21:meMA.Ode9H.text	@ltx/en_us_dedes/he.h.m2:heHE.AnarchouGennitoros.text
ltx/en_us_dedes/me.m10.d21:meMA.Oikos1.text	When you fell in love with the divine commandments of Christ, and detested carnal and worldly pleasure, you enthusiastically went to Him, and you became a star that illumined all the ends of the earth, as you shined with the light of the Spirit. Therefore I appeal to you and entreat you: Illumine the eyes of my soul as well, so that I may extol your contests, which you demonstrated on earth for the sake of the life to come. As you enjoy that now, remember us who shout: Rejoice, O Father, the pedestal of ascetics.
ltx/en_us_dedes/me.m10.d21:meVE.Apolytikion1ger.greekmelody	@ltx/en_us_dedes/he.a.m1:heAU.TisErimouPolitis.greekname
ltx/en_us_dedes/me.m10.d21:meVE.Apolytikion1ger.incipit	…
ltx/en_us_dedes/me.m10.d21:meVE.Apolytikion1ger.melody	@ltx/en_us_dedes/he.a.m1:heAU.TisErimouPolitis.name
ltx/en_us_dedes/me.m10.d21:meVE.Apolytikion1ger.mode	@ltx/en_us_dedes/miscellanea:misc.Mode1
ltx/en_us_dedes/me.m10.d21:meVE.Apolytikion1ger.poet	@ltx/en_us_dedes/poets:po.Gerasimou
ltx/en_us_dedes/me.m10.d21:meVE.Apolytikion1ger.text	
ltx/en_us_dedes/me.m10.d21:meVE.Apolytikion2ger.greekmelody	@ltx/en_us_dedes/he.a.m3:heAU.TheiasPisteos.greekname
ltx/en_us_dedes/me.m10.d21:meVE.Apolytikion2ger.incipit	…
ltx/en_us_dedes/me.m10.d21:meVE.Apolytikion2ger.melody	@ltx/en_us_dedes/he.a.m3:heAU.TheiasPisteos.name
ltx/en_us_dedes/me.m10.d21:meVE.Apolytikion2ger.mode	@ltx/en_us_dedes/miscellanea:misc.Mode3
ltx/en_us_dedes/me.m10.d21:meVE.Apolytikion2ger.poet	@ltx/en_us_dedes/poets:po.Gerasimou
ltx/en_us_dedes/me.m10.d21:meVE.Apolytikion2ger.text	
ltx/en_us_dedes/me.m10.d21:meVE.AposGlory.incipit	…
ltx/en_us_dedes/me.m10.d21:meVE.AposGlory.melody	
ltx/en_us_dedes/me.m10.d21:meVE.AposGlory.mode	@ltx/en_us_dedes/miscellanea:misc.Mode8
ltx/en_us_dedes/me.m10.d21:meVE.AposGlory.text	
ltx/en_us_dedes/me.m10.d21:meVE.AposStavrotheotokion.greekmelody	@ltx/en_us_dedes/he.a.m8:heAU.OiMartyresSouKyrie.greekname
ltx/en_us_dedes/me.m10.d21:meVE.AposStavrotheotokion.incipit	@ltx/en_us_dedes/me.m01.d23:meVE.SticStavrotheotokion.incipit
ltx/en_us_dedes/me.m10.d21:meVE.AposStavrotheotokion.melody	@ltx/en_us_dedes/he.a.m8:heAU.OiMartyresSouKyrie.notmetered
ltx/en_us_dedes/me.m10.d21:meVE.AposStavrotheotokion.mode	@ltx/en_us_dedes/miscellanea:misc.Mode8
ltx/en_us_dedes/me.m10.d21:meVE.AposStavrotheotokion.text	@ltx/en_us_dedes/me.m01.d23:meVE.SticStavrotheotokion.text
ltx/en_us_dedes/me.m10.d21:meVE.AposTheotokion.greekmelody	@ltx/en_us_dedes/he.a.m8:heAU.OiMartyresSouKyrie.greekname
ltx/en_us_dedes/me.m10.d21:meVE.AposTheotokion.incipit	@ltx/en_us_dedes/me.m01.d31:meVE.SticTheotokion.incipit
ltx/en_us_dedes/me.m10.d21:meVE.AposTheotokion.melody	@ltx/en_us_dedes/he.a.m8:heAU.OiMartyresSouKyrie.name
ltx/en_us_dedes/me.m10.d21:meVE.AposTheotokion.mode	@ltx/en_us_dedes/miscellanea:misc.Mode8
ltx/en_us_dedes/me.m10.d21:meVE.AposTheotokion.text	@ltx/en_us_dedes/me.m01.d31:meVE.SticTheotokion.text
ltx/en_us_dedes/me.m10.d21:meVE.GeneralApolytikion1.name	Hilarion,
ltx/en_us_dedes/me.m10.d21:meVE.MM.GeneralApolytikion1.text	@ltx/en_us_dedes/properties:media.key
ltx/en_us_dedes/me.m10.d21:meVE.SticGlory.incipit	…
ltx/en_us_dedes/me.m10.d21:meVE.SticGlory.melody	
ltx/en_us_dedes/me.m10.d21:meVE.SticGlory.mode	@ltx/en_us_dedes/miscellanea:misc.Mode2
ltx/en_us_dedes/me.m10.d21:meVE.SticGlory.poet	@ltx/en_us_dedes/poets:po.Anatoliou
ltx/en_us_dedes/me.m10.d21:meVE.SticGlory.text	
ltx/en_us_dedes/me.m10.d21:meVE.SticStavrotheotokion.greekmelody	@ltx/en_us_dedes/he.a.m2:heAU.OteEkTouXylou.greekname
ltx/en_us_dedes/me.m10.d21:meVE.SticStavrotheotokion.incipit	He whom great Isaiah once…
ltx/en_us_dedes/me.m10.d21:meVE.SticStavrotheotokion.melody	@ltx/en_us_dedes/he.a.m2:heAU.OteEkTouXylou.name
ltx/en_us_dedes/me.m10.d21:meVE.SticStavrotheotokion.mode	@ltx/en_us_dedes/miscellanea:misc.Mode2
ltx/en_us_dedes/me.m10.d21:meVE.SticStavrotheotokion.text	He whom great Isaiah once foresaw * as a burning coal is incarnate. * God who begot Him so willed, * that He come forth from a Mother who was virgin and pure. * Being born, as a blameless Lamb, * He goes to be slaughtered * willingly, and thus He takes away the sins of the world. * When the Ewe and Virgin, His Mother, * saw Him on the Cross, she lamented, * as the sword of sorrow pierced her heart and soul.
ltx/en_us_dedes/me.m10.d21:meVE.SticTheotokion.greekmelody	@ltx/en_us_dedes/he.a.m2:heAU.OteEkTouXylou.greekname
ltx/en_us_dedes/me.m10.d21:meVE.SticTheotokion.incipit	@ltx/en_us_dedes/oc.m2.d7:ocMA.LaudsTheotokion.incipit
ltx/en_us_dedes/me.m10.d21:meVE.SticTheotokion.melody	@ltx/en_us_dedes/he.a.m2:heAU.OteEkTouXylou.name
ltx/en_us_dedes/me.m10.d21:meVE.SticTheotokion.mode	@ltx/en_us_dedes/miscellanea:misc.Mode2
ltx/en_us_dedes/me.m10.d21:meVE.SticTheotokion.text	@ltx/en_us_dedes/oc.m2.d7:ocMA.LaudsTheotokion.text
ltx/en_us_dedes/me.m10.d21:meVE.Stichera01.greekmelody	@ltx/en_us_dedes/he.a.m4:heAU.OExYpsistouKlitheis.greekname
ltx/en_us_dedes/me.m10.d21:meVE.Stichera01.incipit	…
ltx/en_us_dedes/me.m10.d21:meVE.Stichera01.melody	@ltx/en_us_dedes/he.a.m4:heAU.OExYpsistouKlitheis.name
ltx/en_us_dedes/me.m10.d21:meVE.Stichera01.mode	@ltx/en_us_dedes/miscellanea:misc.Mode4
ltx/en_us_dedes/me.m10.d21:meVE.Stichera01.text	
ltx/en_us_dedes/me.m10.d21:meVE.Stichera02.incipit	…
ltx/en_us_dedes/me.m10.d21:meVE.Stichera02.melody	@ltx/en_us_dedes/he.a.m4:heAU.OExYpsistouKlitheis.name
ltx/en_us_dedes/me.m10.d21:meVE.Stichera02.mode	@ltx/en_us_dedes/miscellanea:misc.Mode4
ltx/en_us_dedes/me.m10.d21:meVE.Stichera02.text	
ltx/en_us_dedes/me.m10.d21:meVE.Stichera03.incipit	…
ltx/en_us_dedes/me.m10.d21:meVE.Stichera03.melody	@ltx/en_us_dedes/he.a.m4:heAU.OExYpsistouKlitheis.name
ltx/en_us_dedes/me.m10.d21:meVE.Stichera03.mode	@ltx/en_us_dedes/miscellanea:misc.Mode4
ltx/en_us_dedes/me.m10.d21:meVE.Stichera03.text	
