ltx/en_us_dedes/sy.m05.d05:cl.syMA.commemoration01.text	[saint/com 1]
ltx/en_us_dedes/sy.m05.d05:cl.syMA.commemoration02.text	[saint/com 2]
ltx/en_us_dedes/sy.m05.d05:cl.syMA.commemoration03.text	[saint/com 3]
ltx/en_us_dedes/sy.m05.d05:cl.syMA.commemoration04.text	[saint/com 4]
ltx/en_us_dedes/sy.m05.d05:cl.syMA.commemoration05.text	[saint/com 5]
ltx/en_us_dedes/sy.m05.d05:cl.syMA.commemoration06.text	[saint/com list]
ltx/en_us_dedes/sy.m05.d05:syMA.commemoration01.couplet1.title	@ltx/en_us_dedes/titles:ti.Verses
ltx/en_us_dedes/sy.m05.d05:syMA.commemoration01.couplet1.verse1	
ltx/en_us_dedes/sy.m05.d05:syMA.commemoration01.couplet1.verse2	
ltx/en_us_dedes/sy.m05.d05:syMA.commemoration01.narration.p01	
ltx/en_us_dedes/sy.m05.d05:syMA.commemoration01.narration.p02	
ltx/en_us_dedes/sy.m05.d05:syMA.commemoration01.narration.p03	
ltx/en_us_dedes/sy.m05.d05:syMA.commemoration01.narration.p04	
ltx/en_us_dedes/sy.m05.d05:syMA.commemoration01.narration.p05	
ltx/en_us_dedes/sy.m05.d05:syMA.commemoration01.narration.p06	
ltx/en_us_dedes/sy.m05.d05:syMA.commemoration01.narration.p07	
ltx/en_us_dedes/sy.m05.d05:syMA.commemoration01.narration.p08	
ltx/en_us_dedes/sy.m05.d05:syMA.commemoration01.narration.p09	
ltx/en_us_dedes/sy.m05.d05:syMA.commemoration01.single1	
ltx/en_us_dedes/sy.m05.d05:syMA.commemoration01.text	On May 5 we commemorate the holy Great-martyr Irene.
ltx/en_us_dedes/sy.m05.d05:syMA.commemoration02.couplet1.title	@ltx/en_us_dedes/titles:ti.Verses
ltx/en_us_dedes/sy.m05.d05:syMA.commemoration02.couplet1.verse1	
ltx/en_us_dedes/sy.m05.d05:syMA.commemoration02.couplet1.verse2	
ltx/en_us_dedes/sy.m05.d05:syMA.commemoration02.text	On this day we also commemorate the contest of the holy Martyrs Neophytus, Gaius, and Gaianus. The service in their honor is celebrated in the august and venerable church of the holy, glorious, and wonderworking Unmercenaries Cosmas and Damian, in the Quarter of Darius.
ltx/en_us_dedes/sy.m05.d05:syMA.commemoration03.text	On this day we also commemorate the Consecration of the Church of the Most Holy Theotokos at the Quarter of Cyrus in Constantinople.
ltx/en_us_dedes/sy.m05.d05:syMA.commemoration04.couplet1.title	@ltx/en_us_dedes/titles:ti.Verses
ltx/en_us_dedes/sy.m05.d05:syMA.commemoration04.couplet1.verse1	
ltx/en_us_dedes/sy.m05.d05:syMA.commemoration04.couplet1.verse2	
ltx/en_us_dedes/sy.m05.d05:syMA.commemoration04.narration.p01	
ltx/en_us_dedes/sy.m05.d05:syMA.commemoration04.text	On this day we also commemorate the contest of the holy and glorious monastic martyr Ephrem, the lately revealed miracle-worker, who lived in ascetic discipline on the Mount of the Blameless in Attica, Greece, and who was martyred in the fifteenth century.
ltx/en_us_dedes/sy.m05.d05:syMA.lastline	By their holy intercessions, O God, have mercy on us. Amen.
