ltx/en_us_dedes/sy.m03.d15:cl.syMA.commemoration01.text	[saint/com 1]
ltx/en_us_dedes/sy.m03.d15:cl.syMA.commemoration02.text	[saint/com 2]
ltx/en_us_dedes/sy.m03.d15:cl.syMA.commemoration03.text	[saint/com 3]
ltx/en_us_dedes/sy.m03.d15:cl.syMA.commemoration04.text	[saint/com 4]
ltx/en_us_dedes/sy.m03.d15:cl.syMA.commemoration05.text	[saint/com 5]
ltx/en_us_dedes/sy.m03.d15:cl.syMA.commemoration06.text	[saint/com list]
ltx/en_us_dedes/sy.m03.d15:syMA.commemoration01.couplet1.title	@ltx/en_us_dedes/titles:ti.Verses
ltx/en_us_dedes/sy.m03.d15:syMA.commemoration01.couplet1.verse1	
ltx/en_us_dedes/sy.m03.d15:syMA.commemoration01.couplet1.verse2	
ltx/en_us_dedes/sy.m03.d15:syMA.commemoration01.couplet2.verse1	
ltx/en_us_dedes/sy.m03.d15:syMA.commemoration01.couplet2.verse2	
ltx/en_us_dedes/sy.m03.d15:syMA.commemoration01.couplet3.verse1	
ltx/en_us_dedes/sy.m03.d15:syMA.commemoration01.couplet3.verse2	
ltx/en_us_dedes/sy.m03.d15:syMA.commemoration01.narration.p01	
ltx/en_us_dedes/sy.m03.d15:syMA.commemoration01.single1	
ltx/en_us_dedes/sy.m03.d15:syMA.commemoration01.text	On March 15 we commemorate the holy martyr Agapios and those with him: Plesius, Romulus, Timolaos, two named Alexander, and two named Dionysius.
ltx/en_us_dedes/sy.m03.d15:syMA.commemoration02.couplet1.title	@ltx/en_us_dedes/titles:ti.Verses
ltx/en_us_dedes/sy.m03.d15:syMA.commemoration02.couplet1.verse1	
ltx/en_us_dedes/sy.m03.d15:syMA.commemoration02.couplet1.verse2	
ltx/en_us_dedes/sy.m03.d15:syMA.commemoration02.narration.p01	
ltx/en_us_dedes/sy.m03.d15:syMA.commemoration02.text	On this day we also commemorate the holy Apostle Aristobulos, Bishop of Britain, brother of Barnabas the Apostle.
ltx/en_us_dedes/sy.m03.d15:syMA.commemoration03.couplet1.title	@ltx/en_us_dedes/titles:ti.Verses
ltx/en_us_dedes/sy.m03.d15:syMA.commemoration03.couplet1.verse1	
ltx/en_us_dedes/sy.m03.d15:syMA.commemoration03.couplet1.verse2	
ltx/en_us_dedes/sy.m03.d15:syMA.commemoration03.narration.p01	
ltx/en_us_dedes/sy.m03.d15:syMA.commemoration03.text	On this day we also commemorate the holy martyr Nicander of Egpyt.
ltx/en_us_dedes/sy.m03.d15:syMA.commemoration04.couplet1.title	@ltx/en_us_dedes/titles:ti.Verses
ltx/en_us_dedes/sy.m03.d15:syMA.commemoration04.couplet1.verse1	
ltx/en_us_dedes/sy.m03.d15:syMA.commemoration04.couplet1.verse2	
ltx/en_us_dedes/sy.m03.d15:syMA.commemoration04.text	The holy new martyr Manuel the Cretan, who witnessed in Chios in the year 1792, died by the sword.
ltx/en_us_dedes/sy.m03.d15:syMA.lastline	By the intercessions of Your Saints, O God, have mercy on us. Amen.
