ltx/en_us_dedes/sy.m01.d13:cl.syMA.commemoration01.narration.p01	
ltx/en_us_dedes/sy.m01.d13:cl.syMA.commemoration01.narration.p02	
ltx/en_us_dedes/sy.m01.d13:cl.syMA.commemoration01.narration.p03	
ltx/en_us_dedes/sy.m01.d13:cl.syMA.commemoration01.narration.p04	
ltx/en_us_dedes/sy.m01.d13:cl.syMA.commemoration01.narration.p05	
ltx/en_us_dedes/sy.m01.d13:cl.syMA.commemoration01.narration.p06	
ltx/en_us_dedes/sy.m01.d13:cl.syMA.commemoration01.narration.p07	
ltx/en_us_dedes/sy.m01.d13:cl.syMA.commemoration01.text	[saint/com 1]
ltx/en_us_dedes/sy.m01.d13:cl.syMA.commemoration02.narration.p01	
ltx/en_us_dedes/sy.m01.d13:cl.syMA.commemoration02.narration.p02	
ltx/en_us_dedes/sy.m01.d13:cl.syMA.commemoration02.narration.p03	
ltx/en_us_dedes/sy.m01.d13:cl.syMA.commemoration02.narration.p04	
ltx/en_us_dedes/sy.m01.d13:cl.syMA.commemoration02.narration.p05	
ltx/en_us_dedes/sy.m01.d13:cl.syMA.commemoration02.narration.p06	
ltx/en_us_dedes/sy.m01.d13:cl.syMA.commemoration02.narration.p07	
ltx/en_us_dedes/sy.m01.d13:cl.syMA.commemoration02.text	[saint/com 2]
ltx/en_us_dedes/sy.m01.d13:cl.syMA.commemoration03.narration.p01	
ltx/en_us_dedes/sy.m01.d13:cl.syMA.commemoration03.narration.p02	
ltx/en_us_dedes/sy.m01.d13:cl.syMA.commemoration03.narration.p03	
ltx/en_us_dedes/sy.m01.d13:cl.syMA.commemoration03.narration.p04	
ltx/en_us_dedes/sy.m01.d13:cl.syMA.commemoration03.narration.p05	
ltx/en_us_dedes/sy.m01.d13:cl.syMA.commemoration03.narration.p06	
ltx/en_us_dedes/sy.m01.d13:cl.syMA.commemoration03.narration.p07	
ltx/en_us_dedes/sy.m01.d13:cl.syMA.commemoration03.text	[saint/com 3]
ltx/en_us_dedes/sy.m01.d13:cl.syMA.commemoration04.narration.p01	
ltx/en_us_dedes/sy.m01.d13:cl.syMA.commemoration04.narration.p02	
ltx/en_us_dedes/sy.m01.d13:cl.syMA.commemoration04.narration.p03	
ltx/en_us_dedes/sy.m01.d13:cl.syMA.commemoration04.narration.p04	
ltx/en_us_dedes/sy.m01.d13:cl.syMA.commemoration04.narration.p05	
ltx/en_us_dedes/sy.m01.d13:cl.syMA.commemoration04.narration.p06	
ltx/en_us_dedes/sy.m01.d13:cl.syMA.commemoration04.narration.p07	
ltx/en_us_dedes/sy.m01.d13:cl.syMA.commemoration04.text	[saint/com 4]
ltx/en_us_dedes/sy.m01.d13:cl.syMA.commemoration05.narration.p01	
ltx/en_us_dedes/sy.m01.d13:cl.syMA.commemoration05.narration.p02	
ltx/en_us_dedes/sy.m01.d13:cl.syMA.commemoration05.narration.p03	
ltx/en_us_dedes/sy.m01.d13:cl.syMA.commemoration05.narration.p04	
ltx/en_us_dedes/sy.m01.d13:cl.syMA.commemoration05.narration.p05	
ltx/en_us_dedes/sy.m01.d13:cl.syMA.commemoration05.narration.p06	
ltx/en_us_dedes/sy.m01.d13:cl.syMA.commemoration05.narration.p07	
ltx/en_us_dedes/sy.m01.d13:cl.syMA.commemoration05.text	[saint/com 5]
ltx/en_us_dedes/sy.m01.d13:cl.syMA.commemoration06.text	[saint/com list]
ltx/en_us_dedes/sy.m01.d13:syMA.commemoration01.couplet1.title	@ltx/en_us_dedes/titles:ti.Verses
ltx/en_us_dedes/sy.m01.d13:syMA.commemoration01.couplet1.verse1	
ltx/en_us_dedes/sy.m01.d13:syMA.commemoration01.couplet1.verse2	
ltx/en_us_dedes/sy.m01.d13:syMA.commemoration01.narration.p01	
ltx/en_us_dedes/sy.m01.d13:syMA.commemoration01.single1	
ltx/en_us_dedes/sy.m01.d13:syMA.commemoration01.text	On January 13 we commemorate the holy martyrs Hermylos and Stratonikos.
ltx/en_us_dedes/sy.m01.d13:syMA.commemoration02.couplet1.title	@ltx/en_us_dedes/titles:ti.Verses
ltx/en_us_dedes/sy.m01.d13:syMA.commemoration02.couplet1.verse1	
ltx/en_us_dedes/sy.m01.d13:syMA.commemoration02.couplet1.verse2	
ltx/en_us_dedes/sy.m01.d13:syMA.commemoration02.narration.p01	
ltx/en_us_dedes/sy.m01.d13:syMA.commemoration02.narration.p02	
ltx/en_us_dedes/sy.m01.d13:syMA.commemoration02.narration.p03	
ltx/en_us_dedes/sy.m01.d13:syMA.commemoration02.text	On this day we also commemorate our devout father Iakovos of Nisibis.
ltx/en_us_dedes/sy.m01.d13:syMA.commemoration03.couplet1.title	@ltx/en_us_dedes/titles:ti.Verses
ltx/en_us_dedes/sy.m01.d13:syMA.commemoration03.couplet1.verse1	
ltx/en_us_dedes/sy.m01.d13:syMA.commemoration03.couplet1.verse2	
ltx/en_us_dedes/sy.m01.d13:syMA.commemoration03.text	On this day the holy martyr Athanasios was clubbed to death.
ltx/en_us_dedes/sy.m01.d13:syMA.commemoration04.couplet1.title	@ltx/en_us_dedes/titles:ti.Verses
ltx/en_us_dedes/sy.m01.d13:syMA.commemoration04.couplet1.verse1	
ltx/en_us_dedes/sy.m01.d13:syMA.commemoration04.couplet1.verse2	
ltx/en_us_dedes/sy.m01.d13:syMA.commemoration04.text	On this day Sts. Pachomios and Papyrinos died in a river.
ltx/en_us_dedes/sy.m01.d13:syMA.commemoration05.couplet1.title	@ltx/en_us_dedes/titles:ti.Verses
ltx/en_us_dedes/sy.m01.d13:syMA.commemoration05.couplet1.verse1	
ltx/en_us_dedes/sy.m01.d13:syMA.commemoration05.couplet1.verse2	
ltx/en_us_dedes/sy.m01.d13:syMA.commemoration05.text	On this day was the consecration of the Monastery of Prophet Elias, which was also called the Monastery of the Deep Ravine.
ltx/en_us_dedes/sy.m01.d13:syMA.commemoration06.couplet1.title	@ltx/en_us_dedes/titles:ti.Verses
ltx/en_us_dedes/sy.m01.d13:syMA.commemoration06.couplet1.verse1	
ltx/en_us_dedes/sy.m01.d13:syMA.commemoration06.couplet1.verse2	
ltx/en_us_dedes/sy.m01.d13:syMA.commemoration06.text	On this day our devout father Maximos Kafsokalyvitis, who lived as an ascetic on Mt. Athos, reposed in peace in the year 1320.
ltx/en_us_dedes/sy.m01.d13:syMA.lastline	By the intercessions of Your Saints, O God, have mercy on us. Amen.
