ltx/en_us_dedes/sy.m03.d23:cl.syMA.commemoration01.text	[saint/com 1]
ltx/en_us_dedes/sy.m03.d23:cl.syMA.commemoration02.text	[saint/com 2]
ltx/en_us_dedes/sy.m03.d23:cl.syMA.commemoration03.text	[saint/com 3]
ltx/en_us_dedes/sy.m03.d23:cl.syMA.commemoration04.text	[saint/com 4]
ltx/en_us_dedes/sy.m03.d23:cl.syMA.commemoration05.text	[saint/com 5]
ltx/en_us_dedes/sy.m03.d23:cl.syMA.commemoration06.text	[saint/com list]
ltx/en_us_dedes/sy.m03.d23:syMA.commemoration01.couplet1.title	@ltx/en_us_dedes/titles:ti.Verses
ltx/en_us_dedes/sy.m03.d23:syMA.commemoration01.couplet1.verse1	
ltx/en_us_dedes/sy.m03.d23:syMA.commemoration01.couplet1.verse2	
ltx/en_us_dedes/sy.m03.d23:syMA.commemoration01.couplet2.title	For his Disciples
ltx/en_us_dedes/sy.m03.d23:syMA.commemoration01.couplet2.verse1	
ltx/en_us_dedes/sy.m03.d23:syMA.commemoration01.couplet2.verse2	
ltx/en_us_dedes/sy.m03.d23:syMA.commemoration01.narration.p01	
ltx/en_us_dedes/sy.m03.d23:syMA.commemoration01.narration.p02	
ltx/en_us_dedes/sy.m03.d23:syMA.commemoration01.narration.p03	
ltx/en_us_dedes/sy.m03.d23:syMA.commemoration01.single1	
ltx/en_us_dedes/sy.m03.d23:syMA.commemoration01.text	On March 23 we commemorate the holy Martyr Nicon and the 199 Martyrs who were his disciples.
ltx/en_us_dedes/sy.m03.d23:syMA.commemoration02.couplet1.title	@ltx/en_us_dedes/titles:ti.Verses
ltx/en_us_dedes/sy.m03.d23:syMA.commemoration02.couplet1.verse1	
ltx/en_us_dedes/sy.m03.d23:syMA.commemoration02.couplet1.verse2	
ltx/en_us_dedes/sy.m03.d23:syMA.commemoration02.text	On this day Saint Dometios died by the sword.
ltx/en_us_dedes/sy.m03.d23:syMA.commemoration03.couplet1.title	@ltx/en_us_dedes/titles:ti.Verses
ltx/en_us_dedes/sy.m03.d23:syMA.commemoration03.couplet1.verse1	
ltx/en_us_dedes/sy.m03.d23:syMA.commemoration03.couplet1.verse2	
ltx/en_us_dedes/sy.m03.d23:syMA.commemoration03.text	The holy New Monastic Martyr Luke witnessed in Mytilene in the year 1802 and died by hanging.
ltx/en_us_dedes/sy.m03.d23:syMA.lastline	By their holy intercessions, O God, have mercy on us. Amen.
