ltx/en_us_dedes/ho.ho24:R01	
ltx/en_us_dedes/ho.ho24:R17	During the feast of the Transfiguration, the following Megalynarion for that feast may be inserted here.
ltx/en_us_dedes/ho.ho24:hoCA.Apolytikion1.incipit	@ltx/en_us_dedes/oc.m4.d3:ocVE.ApolTheotokionVM.incipit
ltx/en_us_dedes/ho.ho24:hoCA.Apolytikion1.melody	@ltx/en_us_dedes/he.a.m4:heAU.OYpsotheisEnToStavro.name
ltx/en_us_dedes/ho.ho24:hoCA.Apolytikion1.mode	@ltx/en_us_dedes/miscellanea:misc.Mode4
ltx/en_us_dedes/ho.ho24:hoCA.Apolytikion1.text	@ltx/en_us_dedes/oc.m4.d3:ocVE.ApolTheotokionVM.text
ltx/en_us_dedes/ho.ho24:hoCA.Apolytikion2.incipit	@ltx/en_us_dedes/ho.ho23:hoCA.Apolytikion2.incipit
ltx/en_us_dedes/ho.ho24:hoCA.Apolytikion2.melody	@ltx/en_us_dedes/he.a.m4:heAU.OYpsotheisEnToStavro.name
ltx/en_us_dedes/ho.ho24:hoCA.Apolytikion2.mode	@ltx/en_us_dedes/miscellanea:misc.Mode4
ltx/en_us_dedes/ho.ho24:hoCA.Apolytikion2.text	@ltx/en_us_dedes/ho.ho23:hoCA.Apolytikion2.text
ltx/en_us_dedes/ho.ho24:hoCA.Exaposteilarion1.incipit	@ltx/en_us_dedes/me.m08.d15:meMA.Exaposteilarion1.incipit
ltx/en_us_dedes/ho.ho24:hoCA.Exaposteilarion1.melody	@ltx/en_us_dedes/he.a.m3:heAU.OOuranonToisAstrois.name
ltx/en_us_dedes/ho.ho24:hoCA.Exaposteilarion1.mode	@ltx/en_us_dedes/miscellanea:misc.Mode3
ltx/en_us_dedes/ho.ho24:hoCA.Exaposteilarion1.text	@ltx/en_us_dedes/me.m08.d15:meMA.Exaposteilarion1.text
ltx/en_us_dedes/ho.ho24:hoCA.Exaposteilarion2.incipit	@ltx/en_us_dedes/da.d7:daMA.ExapTheotokion1.incipit
ltx/en_us_dedes/ho.ho24:hoCA.Exaposteilarion2.melody	@ltx/en_us_dedes/he.a.m3:heAU.OOuranonToisAstrois.name
ltx/en_us_dedes/ho.ho24:hoCA.Exaposteilarion2.mode	@ltx/en_us_dedes/miscellanea:misc.Mode3
ltx/en_us_dedes/ho.ho24:hoCA.Exaposteilarion2.text	@ltx/en_us_dedes/da.d7:daMA.ExapTheotokion1.text
ltx/en_us_dedes/ho.ho24:hoCA.Exaposteilarion3.incipit	@ltx/en_us_dedes/da.d3:daMA.ExapTheotokion1.incipit
ltx/en_us_dedes/ho.ho24:hoCA.Exaposteilarion3.melody	@ltx/en_us_dedes/he.a.m3:heAU.OOuranonToisAstrois.name
ltx/en_us_dedes/ho.ho24:hoCA.Exaposteilarion3.mode	@ltx/en_us_dedes/miscellanea:misc.Mode3
ltx/en_us_dedes/ho.ho24:hoCA.Exaposteilarion3.text	@ltx/en_us_dedes/da.d3:daMA.ExapTheotokion1.text
ltx/en_us_dedes/ho.ho24:hoCA.Exaposteilarion4.incipit	@ltx/en_us_dedes/ho.ho23:hoCA.Exaposteilarion4.incipit
ltx/en_us_dedes/ho.ho24:hoCA.Exaposteilarion4.melody	@ltx/en_us_dedes/he.a.m3:heAU.OOuranonToisAstrois.name
ltx/en_us_dedes/ho.ho24:hoCA.Exaposteilarion4.mode	@ltx/en_us_dedes/miscellanea:misc.Mode3
ltx/en_us_dedes/ho.ho24:hoCA.Exaposteilarion4.text	@ltx/en_us_dedes/ho.ho23:hoCA.Exaposteilarion4.text
ltx/en_us_dedes/ho.ho24:hoCA.Kathisma11.incipit	@ltx/en_us_dedes/ho.ho23:hoCA.Kathisma11.incipit
ltx/en_us_dedes/ho.ho24:hoCA.Kathisma11.melody	@ltx/en_us_dedes/he.a.m2:heAU.TaAnoZiton.name
ltx/en_us_dedes/ho.ho24:hoCA.Kathisma11.mode	@ltx/en_us_dedes/miscellanea:misc.Mode2
ltx/en_us_dedes/ho.ho24:hoCA.Kathisma11.text	@ltx/en_us_dedes/ho.ho23:hoCA.Kathisma11.text
ltx/en_us_dedes/ho.ho24:hoCA.Kontakion.incipit	@ltx/en_us_dedes/ho.ho07:hoTY.Key0408.incipit
ltx/en_us_dedes/ho.ho24:hoCA.Kontakion.melody	
ltx/en_us_dedes/ho.ho24:hoCA.Kontakion.mode	@ltx/en_us_dedes/miscellanea:misc.Mode2
ltx/en_us_dedes/ho.ho24:hoCA.Kontakion.text	@ltx/en_us_dedes/ho.ho07:hoTY.Key0408.text
ltx/en_us_dedes/ho.ho24:hoCA.Meg00.incipit	…
ltx/en_us_dedes/ho.ho24:hoCA.Meg00.text	@ltx/en_us_dedes/ho.ho03:hoMA.Ode9.Meg00.text
ltx/en_us_dedes/ho.ho24:hoCA.Meg01.incipit	@ltx/en_us_dedes/he.h.m6:heHE.TinTimioteran.incipit
ltx/en_us_dedes/ho.ho24:hoCA.Meg01.melody	@ltx/en_us_dedes/he.h.m6:heHE.TinTimioteran.melody
ltx/en_us_dedes/ho.ho24:hoCA.Meg01.text	@ltx/en_us_dedes/he.h.m6:heHE.TinTimioteran.text
ltx/en_us_dedes/ho.ho24:hoCA.Meg02.incipit	@ltx/en_us_dedes/ho.ho23:hoCA.Meg02.incipit
ltx/en_us_dedes/ho.ho24:hoCA.Meg02.melody	@ltx/en_us_dedes/he.h.m6:heHE.TinTimioteran.name
ltx/en_us_dedes/ho.ho24:hoCA.Meg02.text	@ltx/en_us_dedes/ho.ho23:hoCA.Meg02.text
ltx/en_us_dedes/ho.ho24:hoCA.Meg03.incipit	@ltx/en_us_dedes/ho.ho23:hoCA.Meg03.incipit
ltx/en_us_dedes/ho.ho24:hoCA.Meg03.melody	@ltx/en_us_dedes/he.h.m6:heHE.TinTimioteran.name
ltx/en_us_dedes/ho.ho24:hoCA.Meg03.text	@ltx/en_us_dedes/ho.ho23:hoCA.Meg03.text
ltx/en_us_dedes/ho.ho24:hoCA.Meg04.incipit	@ltx/en_us_dedes/ho.ho23:hoCA.Meg04.incipit
ltx/en_us_dedes/ho.ho24:hoCA.Meg04.melody	@ltx/en_us_dedes/he.h.m6:heHE.TinTimioteran.name
ltx/en_us_dedes/ho.ho24:hoCA.Meg04.text	@ltx/en_us_dedes/ho.ho23:hoCA.Meg04.text
ltx/en_us_dedes/ho.ho24:hoCA.Meg05.incipit	@ltx/en_us_dedes/ho.ho23:hoCA.Meg05.incipit
ltx/en_us_dedes/ho.ho24:hoCA.Meg05.melody	@ltx/en_us_dedes/he.h.m6:heHE.TinTimioteran.name
ltx/en_us_dedes/ho.ho24:hoCA.Meg05.text	@ltx/en_us_dedes/ho.ho23:hoCA.Meg05.text
ltx/en_us_dedes/ho.ho24:hoCA.Meg06.incipit	@ltx/en_us_dedes/ho.ho23:hoCA.Meg06.incipit
ltx/en_us_dedes/ho.ho24:hoCA.Meg06.melody	@ltx/en_us_dedes/he.h.m6:heHE.TinTimioteran.name
ltx/en_us_dedes/ho.ho24:hoCA.Meg06.text	@ltx/en_us_dedes/ho.ho23:hoCA.Meg06.text
ltx/en_us_dedes/ho.ho24:hoCA.Meg0F.incipit	@ltx/en_us_dedes/ho.ho23:hoCA.Meg0F.incipit
ltx/en_us_dedes/ho.ho24:hoCA.Meg0F.melody	@ltx/en_us_dedes/he.h.m6:heHE.TinTimioteran.name
ltx/en_us_dedes/ho.ho24:hoCA.Meg0F.text	@ltx/en_us_dedes/ho.ho23:hoCA.Meg0F.text
ltx/en_us_dedes/ho.ho24:hoCA.MegTrans1.incipit	…
ltx/en_us_dedes/ho.ho24:hoCA.MegTrans1.melody	@ltx/en_us_dedes/he.h.m6:heHE.TinTimioteran.name
ltx/en_us_dedes/ho.ho24:hoCA.MegTrans1.text	@ltx/en_us_dedes/me.m08.d06:meLI.Megalynarion.text
ltx/en_us_dedes/ho.ho24:hoCA.Ode11.greekmelody	@ltx/en_us_dedes/he.h.m8:heHE.ArmatilatinFarao.greekname
ltx/en_us_dedes/ho.ho24:hoCA.Ode11.incipit	Relentless onslaughts of distressing troubles…
ltx/en_us_dedes/ho.ho24:hoCA.Ode11.melody	@ltx/en_us_dedes/he.h.m8:heHE.ArmatilatinFarao.name
ltx/en_us_dedes/ho.ho24:hoCA.Ode11.mode	@ltx/en_us_dedes/miscellanea:misc.Mode8
ltx/en_us_dedes/ho.ho24:hoCA.Ode11.ode	@ltx/en_us_dedes/miscellanea:misc.Ode1
ltx/en_us_dedes/ho.ho24:hoCA.Ode11.text	Relentless onslaughts of distressing troubles now disquiet my humble soul. * And the gloomy clouds of tribulation shroud my heart. * But since you are, O Bride of God, * Theotokos and Mother * of the divine pre-eternal Light, * shine on me the light that is full of joy.
ltx/en_us_dedes/ho.ho24:hoCA.Ode12.incipit	I have been saved from…
ltx/en_us_dedes/ho.ho24:hoCA.Ode12.melody	@ltx/en_us_dedes/he.h.m8:heHE.ArmatilatinFarao.name
ltx/en_us_dedes/ho.ho24:hoCA.Ode12.mode	@ltx/en_us_dedes/miscellanea:misc.Mode8
ltx/en_us_dedes/ho.ho24:hoCA.Ode12.ode	@ltx/en_us_dedes/miscellanea:misc.Ode1
ltx/en_us_dedes/ho.ho24:hoCA.Ode12.text	I have been saved from countless grave necessities and tribulations and woes, * hostile adversaries * and from life’s calamities * by your prevailing power; hence, * all-immaculate Maiden, * I praise and magnify the immense * sympathy and solace you offer me.
ltx/en_us_dedes/ho.ho24:hoCA.Ode13.incipit	Now trusting fully in your…
ltx/en_us_dedes/ho.ho24:hoCA.Ode13.melody	@ltx/en_us_dedes/he.h.m8:heHE.ArmatilatinFarao.name
ltx/en_us_dedes/ho.ho24:hoCA.Ode13.mode	@ltx/en_us_dedes/miscellanea:misc.Mode8
ltx/en_us_dedes/ho.ho24:hoCA.Ode13.ode	@ltx/en_us_dedes/miscellanea:misc.Ode1
ltx/en_us_dedes/ho.ho24:hoCA.Ode13.text	Now trusting fully in your mighty patronage, for safety there have I fled; * and unto your shelter * have I run wholeheartedly, * O Lady, and I bend my knees * and lament sighing deeply. * Do not disdain me the wretched one. * For you are the refuge of Christians all.
ltx/en_us_dedes/ho.ho24:hoCA.Ode14.incipit	I shall not cease from…
ltx/en_us_dedes/ho.ho24:hoCA.Ode14.melody	@ltx/en_us_dedes/he.h.m8:heHE.ArmatilatinFarao.name
ltx/en_us_dedes/ho.ho24:hoCA.Ode14.mode	@ltx/en_us_dedes/miscellanea:misc.Mode8
ltx/en_us_dedes/ho.ho24:hoCA.Ode14.ode	@ltx/en_us_dedes/miscellanea:misc.Ode1
ltx/en_us_dedes/ho.ho24:hoCA.Ode14.text	I shall not cease from speaking most emphatically of your magnificent deeds. * For were you not always * standing up on my behalf, * petitioning your Son and God, * from so violent a tempest * and such formidable jeopardy, * who else would there be to deliver me?
ltx/en_us_dedes/ho.ho24:hoCA.Ode1H.greekmelody	@ltx/en_us_dedes/he.h.m8:heHE.ArmatilatinFarao.greekname
ltx/en_us_dedes/ho.ho24:hoCA.Ode1H.incipit	@ltx/en_us_dedes/he.h.m8:heHE.ArmatilatinFarao.incipit
ltx/en_us_dedes/ho.ho24:hoCA.Ode1H.melody	@ltx/en_us_dedes/he.h.m8:heHE.ArmatilatinFarao.melody
ltx/en_us_dedes/ho.ho24:hoCA.Ode1H.mode	@ltx/en_us_dedes/miscellanea:misc.Mode8
ltx/en_us_dedes/ho.ho24:hoCA.Ode1H.ode	@ltx/en_us_dedes/miscellanea:misc.Ode1
ltx/en_us_dedes/ho.ho24:hoCA.Ode1H.text	@ltx/en_us_dedes/he.h.m8:heHE.ArmatilatinFarao.text
ltx/en_us_dedes/ho.ho24:hoCA.Ode31.greekmelody	@ltx/en_us_dedes/he.h.m8:heHE.OuraniasApsidos.greekname
ltx/en_us_dedes/ho.ho24:hoCA.Ode31.incipit	Altogether bewildered, with pain I…
ltx/en_us_dedes/ho.ho24:hoCA.Ode31.melody	@ltx/en_us_dedes/he.h.m8:heHE.OuraniasApsidos.name
ltx/en_us_dedes/ho.ho24:hoCA.Ode31.mode	@ltx/en_us_dedes/miscellanea:misc.Mode8
ltx/en_us_dedes/ho.ho24:hoCA.Ode31.ode	@ltx/en_us_dedes/miscellanea:misc.Ode3
ltx/en_us_dedes/ho.ho24:hoCA.Ode31.text	Altogether bewildered, with pain I cry unto you. * Come to me, O earnest protection, and hasten to provide * assistance unto me, * your poor and mis’rable servant * ardently imploring for * the aid which comes from you.
ltx/en_us_dedes/ho.ho24:hoCA.Ode32.incipit	Now, O Maiden, upon me…
ltx/en_us_dedes/ho.ho24:hoCA.Ode32.melody	@ltx/en_us_dedes/he.h.m8:heHE.OuraniasApsidos.name
ltx/en_us_dedes/ho.ho24:hoCA.Ode32.mode	@ltx/en_us_dedes/miscellanea:misc.Mode8
ltx/en_us_dedes/ho.ho24:hoCA.Ode32.ode	@ltx/en_us_dedes/miscellanea:misc.Ode3
ltx/en_us_dedes/ho.ho24:hoCA.Ode32.text	Now, O Maiden, upon me * your servant you have indeed * magnified your mercies, O Lady, and beneficial deeds. * Therefore I sing your praise * and glorify you and honor * your extensive patronage * to which there is no end.
ltx/en_us_dedes/ho.ho24:hoCA.Ode33.incipit	I am drowning, O Lady…
ltx/en_us_dedes/ho.ho24:hoCA.Ode33.melody	@ltx/en_us_dedes/he.h.m8:heHE.OuraniasApsidos.name
ltx/en_us_dedes/ho.ho24:hoCA.Ode33.mode	@ltx/en_us_dedes/miscellanea:misc.Mode8
ltx/en_us_dedes/ho.ho24:hoCA.Ode33.ode	@ltx/en_us_dedes/miscellanea:misc.Ode3
ltx/en_us_dedes/ho.ho24:hoCA.Ode33.text	I am drowning, O Lady, under the tide of distress, * and I am distraught by the blizzard of life’s adversities. * Come quickly, I entreat, * and lend a hand of assistance. * For you are my Patroness * earnestly helping me.
ltx/en_us_dedes/ho.ho24:hoCA.Ode34.incipit	I acknowledge, O Lady, as…
ltx/en_us_dedes/ho.ho24:hoCA.Ode34.melody	@ltx/en_us_dedes/he.h.m8:heHE.OuraniasApsidos.name
ltx/en_us_dedes/ho.ho24:hoCA.Ode34.mode	@ltx/en_us_dedes/miscellanea:misc.Mode8
ltx/en_us_dedes/ho.ho24:hoCA.Ode34.ode	@ltx/en_us_dedes/miscellanea:misc.Ode3
ltx/en_us_dedes/ho.ho24:hoCA.Ode34.text	I acknowledge, O Lady, as Theotokos in truth * you who have destroyed the dominion of death; for you gave birth * to Him who is the Life, * and from the prison of Hades * unto life you raised me up * who tumbled down to earth.
ltx/en_us_dedes/ho.ho24:hoCA.Ode3H.greekmelody	@ltx/en_us_dedes/he.h.m8:heHE.OuraniasApsidos.greekname
ltx/en_us_dedes/ho.ho24:hoCA.Ode3H.incipit	@ltx/en_us_dedes/he.h.m8:heHE.OuraniasApsidos.incipit
ltx/en_us_dedes/ho.ho24:hoCA.Ode3H.melody	@ltx/en_us_dedes/he.h.m8:heHE.OuraniasApsidos.melody
ltx/en_us_dedes/ho.ho24:hoCA.Ode3H.mode	@ltx/en_us_dedes/miscellanea:misc.Mode8
ltx/en_us_dedes/ho.ho24:hoCA.Ode3H.ode	@ltx/en_us_dedes/miscellanea:misc.Ode3
ltx/en_us_dedes/ho.ho24:hoCA.Ode3H.text	@ltx/en_us_dedes/he.h.m8:heHE.OuraniasApsidos.text
ltx/en_us_dedes/ho.ho24:hoCA.Ode41.greekmelody	@ltx/en_us_dedes/he.h.m8:heHE.SyMouIschys.greekname
ltx/en_us_dedes/ho.ho24:hoCA.Ode41.incipit	Where, in the end, *…
ltx/en_us_dedes/ho.ho24:hoCA.Ode41.melody	@ltx/en_us_dedes/he.h.m8:heHE.SyMouIschys.name
ltx/en_us_dedes/ho.ho24:hoCA.Ode41.mode	@ltx/en_us_dedes/miscellanea:misc.Mode8
ltx/en_us_dedes/ho.ho24:hoCA.Ode41.ode	@ltx/en_us_dedes/miscellanea:misc.Ode4
ltx/en_us_dedes/ho.ho24:hoCA.Ode41.text	Where, in the end, * am I to find other patronage? * Where shall I seek refuge, where shall I be saved? * Whom shall I have as my fervent aid, * who, alas, am rattled * by life’s afflictions and turbulence? * I hope and I take courage * and I boast in you only; * and I run to your shelter. Deliver me.
ltx/en_us_dedes/ho.ho24:hoCA.Ode42.incipit	O purest Maid, * now…
ltx/en_us_dedes/ho.ho24:hoCA.Ode42.melody	@ltx/en_us_dedes/he.h.m8:heHE.SyMouIschys.name
ltx/en_us_dedes/ho.ho24:hoCA.Ode42.mode	@ltx/en_us_dedes/miscellanea:misc.Mode8
ltx/en_us_dedes/ho.ho24:hoCA.Ode42.ode	@ltx/en_us_dedes/miscellanea:misc.Ode4
ltx/en_us_dedes/ho.ho24:hoCA.Ode42.text	O purest Maid, * now I proclaim and I magnify * the sweet river of your tender-loving care * which has refreshed with abundant gifts * my completely wretched * and humble soul which is burning in * the furnace of disasters * and of grievous afflictions. * And I run to your shelter. Deliver me.
ltx/en_us_dedes/ho.ho24:hoCA.Ode43.incipit	You are the pure, *…
ltx/en_us_dedes/ho.ho24:hoCA.Ode43.melody	@ltx/en_us_dedes/he.h.m8:heHE.SyMouIschys.name
ltx/en_us_dedes/ho.ho24:hoCA.Ode43.mode	@ltx/en_us_dedes/miscellanea:misc.Mode8
ltx/en_us_dedes/ho.ho24:hoCA.Ode43.ode	@ltx/en_us_dedes/miscellanea:misc.Ode4
ltx/en_us_dedes/ho.ho24:hoCA.Ode43.text	You are the pure, * you are the Virgin, the undefiled, * whom alone I have as an impregnable * fortress and wall, shelter and defense, * weapon of salvation. * Do not despise me the prodigal, * O hope of the dejected, * O ally of the feeble, * O assistance and joy of the suffering.
ltx/en_us_dedes/ho.ho24:hoCA.Ode44.incipit	O Lady, how * shall…
ltx/en_us_dedes/ho.ho24:hoCA.Ode44.melody	@ltx/en_us_dedes/he.h.m8:heHE.SyMouIschys.name
ltx/en_us_dedes/ho.ho24:hoCA.Ode44.mode	@ltx/en_us_dedes/miscellanea:misc.Mode8
ltx/en_us_dedes/ho.ho24:hoCA.Ode44.ode	@ltx/en_us_dedes/miscellanea:misc.Ode4
ltx/en_us_dedes/ho.ho24:hoCA.Ode44.text	O Lady, how * shall I be able to worthily * tell of your immeasurable charity * that you pour out constantly on me * like refreshing water * to soothe my painfully burning soul? * O providence and labors * of benevolent kindness * which from you I have plentifully enjoyed!
ltx/en_us_dedes/ho.ho24:hoCA.Ode4H.greekmelody	@ltx/en_us_dedes/he.h.m8:heHE.SyMouIschys.greekname
ltx/en_us_dedes/ho.ho24:hoCA.Ode4H.incipit	@ltx/en_us_dedes/he.h.m8:heHE.SyMouIschys.incipit
ltx/en_us_dedes/ho.ho24:hoCA.Ode4H.melody	@ltx/en_us_dedes/he.h.m8:heHE.SyMouIschys.melody
ltx/en_us_dedes/ho.ho24:hoCA.Ode4H.mode	@ltx/en_us_dedes/miscellanea:misc.Mode8
ltx/en_us_dedes/ho.ho24:hoCA.Ode4H.ode	@ltx/en_us_dedes/miscellanea:misc.Ode4
ltx/en_us_dedes/ho.ho24:hoCA.Ode4H.text	@ltx/en_us_dedes/he.h.m8:heHE.SyMouIschys.text
ltx/en_us_dedes/ho.ho24:hoCA.Ode51.greekmelody	@ltx/en_us_dedes/he.h.m8:heHE.InaTiMeAposo.greekname
ltx/en_us_dedes/ho.ho24:hoCA.Ode51.incipit	Now I gratefully cry out:…
ltx/en_us_dedes/ho.ho24:hoCA.Ode51.melody	@ltx/en_us_dedes/he.h.m8:heHE.InaTiMeAposo.name
ltx/en_us_dedes/ho.ho24:hoCA.Ode51.mode	@ltx/en_us_dedes/miscellanea:misc.Mode8
ltx/en_us_dedes/ho.ho24:hoCA.Ode51.ode	@ltx/en_us_dedes/miscellanea:misc.Ode5
ltx/en_us_dedes/ho.ho24:hoCA.Ode51.text	Now I gratefully cry out: * Rejoice, O virgin Mother; rejoice, O Bride of God! * O divine protection * and impregnable fortress and shield, rejoice! * O rejoice, the helper * and the defense and the salvation * of your servants who faithfully run to you!
ltx/en_us_dedes/ho.ho24:hoCA.Ode52.incipit	They who hate me have…
ltx/en_us_dedes/ho.ho24:hoCA.Ode52.melody	@ltx/en_us_dedes/he.h.m8:heHE.InaTiMeAposo.name
ltx/en_us_dedes/ho.ho24:hoCA.Ode52.mode	@ltx/en_us_dedes/miscellanea:misc.Mode8
ltx/en_us_dedes/ho.ho24:hoCA.Ode52.ode	@ltx/en_us_dedes/miscellanea:misc.Ode5
ltx/en_us_dedes/ho.ho24:hoCA.Ode52.text	They who hate me have vainly * readied all their arrows and swords and have dug a pit. * And my wretched body * they are seeking to strike at and tear apart. * And they are attempting, * O purest Maiden, to reduce me * to the ground. So come quickly and rescue me.
ltx/en_us_dedes/ho.ho24:hoCA.Ode53.incipit	Out of every affliction, *…
ltx/en_us_dedes/ho.ho24:hoCA.Ode53.melody	@ltx/en_us_dedes/he.h.m8:heHE.InaTiMeAposo.name
ltx/en_us_dedes/ho.ho24:hoCA.Ode53.mode	@ltx/en_us_dedes/miscellanea:misc.Mode8
ltx/en_us_dedes/ho.ho24:hoCA.Ode53.ode	@ltx/en_us_dedes/miscellanea:misc.Ode5
ltx/en_us_dedes/ho.ho24:hoCA.Ode53.text	Out of every affliction, * illness and necessity and harm deliver me. * O all-lauded Maiden, * by your power preserve me uninjured from * enemies that hate me * and war against me. And from danger * keep me covered beneath your protective veil.
ltx/en_us_dedes/ho.ho24:hoCA.Ode54.incipit	What can I now present…
ltx/en_us_dedes/ho.ho24:hoCA.Ode54.melody	@ltx/en_us_dedes/he.h.m8:heHE.InaTiMeAposo.name
ltx/en_us_dedes/ho.ho24:hoCA.Ode54.mode	@ltx/en_us_dedes/miscellanea:misc.Mode8
ltx/en_us_dedes/ho.ho24:hoCA.Ode54.ode	@ltx/en_us_dedes/miscellanea:misc.Ode5
ltx/en_us_dedes/ho.ho24:hoCA.Ode54.text	What can I now present you * as a worthy gift in token of my gratitude * for your boundless kindness * and the bounties that I have enjoyed from you? * Therefore am I praising * and glorifying and exalting * your ineffable sympathy unto me.
ltx/en_us_dedes/ho.ho24:hoCA.Ode5H.greekmelody	@ltx/en_us_dedes/he.h.m8:heHE.InaTiMeAposo.greekname
ltx/en_us_dedes/ho.ho24:hoCA.Ode5H.incipit	@ltx/en_us_dedes/he.h.m8:heHE.InaTiMeAposo.incipit
ltx/en_us_dedes/ho.ho24:hoCA.Ode5H.melody	@ltx/en_us_dedes/he.h.m8:heHE.InaTiMeAposo.melody
ltx/en_us_dedes/ho.ho24:hoCA.Ode5H.mode	@ltx/en_us_dedes/miscellanea:misc.Mode8
ltx/en_us_dedes/ho.ho24:hoCA.Ode5H.ode	@ltx/en_us_dedes/miscellanea:misc.Ode5
ltx/en_us_dedes/ho.ho24:hoCA.Ode5H.text	@ltx/en_us_dedes/he.h.m8:heHE.InaTiMeAposo.text
ltx/en_us_dedes/ho.ho24:hoCA.Ode61.greekmelody	@ltx/en_us_dedes/he.h.m8:heHE.TinDeisinEkcheo.greekname
ltx/en_us_dedes/ho.ho24:hoCA.Ode61.incipit	My mis’rable * soul and…
ltx/en_us_dedes/ho.ho24:hoCA.Ode61.melody	@ltx/en_us_dedes/he.h.m8:heHE.TinDeisinEkcheo.name
ltx/en_us_dedes/ho.ho24:hoCA.Ode61.mode	@ltx/en_us_dedes/miscellanea:misc.Mode8
ltx/en_us_dedes/ho.ho24:hoCA.Ode61.ode	@ltx/en_us_dedes/miscellanea:misc.Ode6
ltx/en_us_dedes/ho.ho24:hoCA.Ode61.text	My mis’rable * soul and heart are covered up * by the clouds of pain and sorrow, O Damsel, * causing in me a condition of darkness. * But since you gave birth to Light unapproachable, * dispel them far away from me * with the breath of your holy petitioning.
ltx/en_us_dedes/ho.ho24:hoCA.Ode62.incipit	I recognize * you as…
ltx/en_us_dedes/ho.ho24:hoCA.Ode62.melody	@ltx/en_us_dedes/he.h.m8:heHE.TinDeisinEkcheo.name
ltx/en_us_dedes/ho.ho24:hoCA.Ode62.mode	@ltx/en_us_dedes/miscellanea:misc.Mode8
ltx/en_us_dedes/ho.ho24:hoCA.Ode62.ode	@ltx/en_us_dedes/miscellanea:misc.Ode6
ltx/en_us_dedes/ho.ho24:hoCA.Ode62.text	I recognize * you as solace in trouble, * and I know you as the healer of ailments, * and as the one who to death dealt destruction, * and as a river of life inexhaustible, * and as a quick and eager source * of assistance for those in calamities.
ltx/en_us_dedes/ho.ho24:hoCA.Ode63.incipit	I do not hide *…
ltx/en_us_dedes/ho.ho24:hoCA.Ode63.melody	@ltx/en_us_dedes/he.h.m8:heHE.TinDeisinEkcheo.name
ltx/en_us_dedes/ho.ho24:hoCA.Ode63.mode	@ltx/en_us_dedes/miscellanea:misc.Mode8
ltx/en_us_dedes/ho.ho24:hoCA.Ode63.ode	@ltx/en_us_dedes/miscellanea:misc.Ode6
ltx/en_us_dedes/ho.ho24:hoCA.Ode63.text	I do not hide * the abyss of your mercy, * nor the wellspring of your infinite wonders, * nor yet the truly perpetual fountain * of the compassion, O Lady, you have for me. * But rather I confess to all * and announce and proclaim and enunciate.
ltx/en_us_dedes/ho.ho24:hoCA.Ode64.incipit	The dizzying * cares of…
ltx/en_us_dedes/ho.ho24:hoCA.Ode64.melody	@ltx/en_us_dedes/he.h.m8:heHE.TinDeisinEkcheo.name
ltx/en_us_dedes/ho.ho24:hoCA.Ode64.mode	@ltx/en_us_dedes/miscellanea:misc.Mode8
ltx/en_us_dedes/ho.ho24:hoCA.Ode64.ode	@ltx/en_us_dedes/miscellanea:misc.Ode6
ltx/en_us_dedes/ho.ho24:hoCA.Ode64.text	The dizzying * cares of life surround me now * like the bees round a honeycomb, O Virgin; * and being seized of my heart, O pure Maiden, * they sorely sting it with darts of adversities. * Oh, how I wish to find in you * a defender and helper and rescuer!
ltx/en_us_dedes/ho.ho24:hoCA.Ode6H.greekmelody	@ltx/en_us_dedes/he.h.m8:heHE.TinDeisinEkcheo.greekname
ltx/en_us_dedes/ho.ho24:hoCA.Ode6H.incipit	@ltx/en_us_dedes/he.h.m8:heHE.TinDeisinEkcheo.incipit
ltx/en_us_dedes/ho.ho24:hoCA.Ode6H.melody	@ltx/en_us_dedes/he.h.m8:heHE.TinDeisinEkcheo.melody
ltx/en_us_dedes/ho.ho24:hoCA.Ode6H.mode	@ltx/en_us_dedes/miscellanea:misc.Mode8
ltx/en_us_dedes/ho.ho24:hoCA.Ode6H.ode	@ltx/en_us_dedes/miscellanea:misc.Ode6
ltx/en_us_dedes/ho.ho24:hoCA.Ode6H.text	@ltx/en_us_dedes/he.h.m8:heHE.TinDeisinEkcheo.text
ltx/en_us_dedes/ho.ho24:hoCA.Ode71.greekmelody	@ltx/en_us_dedes/he.h.m8:heHE.PaidesEvraion.greekname
ltx/en_us_dedes/ho.ho24:hoCA.Ode71.incipit	Mother of Light and Theotokos…
ltx/en_us_dedes/ho.ho24:hoCA.Ode71.melody	@ltx/en_us_dedes/he.h.m8:heHE.PaidesEvraion.name
ltx/en_us_dedes/ho.ho24:hoCA.Ode71.mode	@ltx/en_us_dedes/miscellanea:misc.Mode8
ltx/en_us_dedes/ho.ho24:hoCA.Ode71.ode	@ltx/en_us_dedes/miscellanea:misc.Ode7
ltx/en_us_dedes/ho.ho24:hoCA.Ode71.text	Mother of Light and Theotokos, * now illuminate me lying in the darkness * of the nighttime of sin, * O pure and stainless vessel * of light, that I may glorify * you with longing, O pure Maiden.
ltx/en_us_dedes/ho.ho24:hoCA.Ode72.incipit	Shelter, assistance and protection, *…
ltx/en_us_dedes/ho.ho24:hoCA.Ode72.melody	@ltx/en_us_dedes/he.h.m8:heHE.PaidesEvraion.name
ltx/en_us_dedes/ho.ho24:hoCA.Ode72.mode	@ltx/en_us_dedes/miscellanea:misc.Mode8
ltx/en_us_dedes/ho.ho24:hoCA.Ode72.ode	@ltx/en_us_dedes/miscellanea:misc.Ode7
ltx/en_us_dedes/ho.ho24:hoCA.Ode72.text	Shelter, assistance and protection, * and the cause of boasting be for me the sinner * who am destitute now * of every help, O Virgin. * The power of the helpless are you, * and the hope of the despairing.
ltx/en_us_dedes/ho.ho24:hoCA.Ode73.incipit	I have enjoyed so many…
ltx/en_us_dedes/ho.ho24:hoCA.Ode73.melody	@ltx/en_us_dedes/he.h.m8:heHE.PaidesEvraion.name
ltx/en_us_dedes/ho.ho24:hoCA.Ode73.mode	@ltx/en_us_dedes/miscellanea:misc.Mode8
ltx/en_us_dedes/ho.ho24:hoCA.Ode73.ode	@ltx/en_us_dedes/miscellanea:misc.Ode7
ltx/en_us_dedes/ho.ho24:hoCA.Ode73.text	I have enjoyed so many favors; * hence with all my soul and reason I extol you. * With my heart and my lips * I glorify you, Lady. * How awesome are your charity * and your never ending wonders!
ltx/en_us_dedes/ho.ho24:hoCA.Ode74.incipit	Graciously look upon your servant…
ltx/en_us_dedes/ho.ho24:hoCA.Ode74.melody	@ltx/en_us_dedes/he.h.m8:heHE.PaidesEvraion.name
ltx/en_us_dedes/ho.ho24:hoCA.Ode74.mode	@ltx/en_us_dedes/miscellanea:misc.Mode8
ltx/en_us_dedes/ho.ho24:hoCA.Ode74.ode	@ltx/en_us_dedes/miscellanea:misc.Ode7
ltx/en_us_dedes/ho.ho24:hoCA.Ode74.text	Graciously look upon your servant, * and attend to the affliction that besets me. * And redeem me from all * calamities, temptations * and perils and from injury, * in your infinite compassion.
ltx/en_us_dedes/ho.ho24:hoCA.Ode7H.greekmelody	@ltx/en_us_dedes/he.h.m8:heHE.PaidesEvraion.greekname
ltx/en_us_dedes/ho.ho24:hoCA.Ode7H.incipit	@ltx/en_us_dedes/he.h.m8:heHE.PaidesEvraion.incipit
ltx/en_us_dedes/ho.ho24:hoCA.Ode7H.melody	@ltx/en_us_dedes/he.h.m8:heHE.PaidesEvraion.melody
ltx/en_us_dedes/ho.ho24:hoCA.Ode7H.mode	@ltx/en_us_dedes/miscellanea:misc.Mode8
ltx/en_us_dedes/ho.ho24:hoCA.Ode7H.ode	@ltx/en_us_dedes/miscellanea:misc.Ode7
ltx/en_us_dedes/ho.ho24:hoCA.Ode7H.text	@ltx/en_us_dedes/he.h.m8:heHE.PaidesEvraion.text
ltx/en_us_dedes/ho.ho24:hoCA.Ode81.greekmelody	@ltx/en_us_dedes/he.h.m8:heHE.TonEnOreiAgio.greekname
ltx/en_us_dedes/ho.ho24:hoCA.Ode81.incipit	Overlook not your servant who…
ltx/en_us_dedes/ho.ho24:hoCA.Ode81.melody	@ltx/en_us_dedes/he.h.m8:heHE.TonEnOreiAgio.name
ltx/en_us_dedes/ho.ho24:hoCA.Ode81.mode	@ltx/en_us_dedes/miscellanea:misc.Mode8
ltx/en_us_dedes/ho.ho24:hoCA.Ode81.ode	@ltx/en_us_dedes/miscellanea:misc.Ode8
ltx/en_us_dedes/ho.ho24:hoCA.Ode81.text	Overlook not your servant who is drowning * in the billowing waves * of everyday existence. * O noble Virgin, lend a helping hand to me * in your great compassion; * for I am exhausted by life’s unending evils.
ltx/en_us_dedes/ho.ho24:hoCA.Ode82.incipit	Tribulations and crises and privations…
ltx/en_us_dedes/ho.ho24:hoCA.Ode82.melody	@ltx/en_us_dedes/he.h.m8:heHE.TonEnOreiAgio.name
ltx/en_us_dedes/ho.ho24:hoCA.Ode82.mode	@ltx/en_us_dedes/miscellanea:misc.Mode8
ltx/en_us_dedes/ho.ho24:hoCA.Ode82.ode	@ltx/en_us_dedes/miscellanea:misc.Ode8
ltx/en_us_dedes/ho.ho24:hoCA.Ode82.text	Tribulations and crises and privations * and the trials of life * have found me, O pure Maiden. * On every side temptations have surrounded me. * Care for me and help me * and provide protection beneath your mighty shelter.
ltx/en_us_dedes/ho.ho24:hoCA.Ode83.incipit	I have found you a…
ltx/en_us_dedes/ho.ho24:hoCA.Ode83.melody	@ltx/en_us_dedes/he.h.m8:heHE.TonEnOreiAgio.name
ltx/en_us_dedes/ho.ho24:hoCA.Ode83.mode	@ltx/en_us_dedes/miscellanea:misc.Mode8
ltx/en_us_dedes/ho.ho24:hoCA.Ode83.ode	@ltx/en_us_dedes/miscellanea:misc.Ode8
ltx/en_us_dedes/ho.ho24:hoCA.Ode83.text	I have found you a harbor in the tempest, * and rejoicing and happiness in sorrows, * a speedy help in sickness and infirmity, * also a protectress * in ordeals, and likewise a rescuer in perils.
ltx/en_us_dedes/ho.ho24:hoCA.Ode84.incipit	O rejoice, fiery throne of…
ltx/en_us_dedes/ho.ho24:hoCA.Ode84.melody	@ltx/en_us_dedes/he.h.m8:heHE.TonEnOreiAgio.name
ltx/en_us_dedes/ho.ho24:hoCA.Ode84.mode	@ltx/en_us_dedes/miscellanea:misc.Mode8
ltx/en_us_dedes/ho.ho24:hoCA.Ode84.ode	@ltx/en_us_dedes/miscellanea:misc.Ode8
ltx/en_us_dedes/ho.ho24:hoCA.Ode84.text	O rejoice, fiery throne of the Master! * O rejoice, sacred manna-holding vessel! * O golden lampstand, unextinguished torch, rejoice! * Pride of pious virgins, * O rejoice, the glory and ornament of mothers!
ltx/en_us_dedes/ho.ho24:hoCA.Ode8H.greekmelody	@ltx/en_us_dedes/he.h.m8:heHE.TonEnOreiAgio.greekname
ltx/en_us_dedes/ho.ho24:hoCA.Ode8H.incipit	@ltx/en_us_dedes/he.h.m8:heHE.TonEnOreiAgio.incipit
ltx/en_us_dedes/ho.ho24:hoCA.Ode8H.melody	@ltx/en_us_dedes/he.h.m8:heHE.TonEnOreiAgio.melody
ltx/en_us_dedes/ho.ho24:hoCA.Ode8H.mode	@ltx/en_us_dedes/miscellanea:misc.Mode8
ltx/en_us_dedes/ho.ho24:hoCA.Ode8H.ode	@ltx/en_us_dedes/miscellanea:misc.Ode8
ltx/en_us_dedes/ho.ho24:hoCA.Ode8H.text	@ltx/en_us_dedes/he.h.m8:heHE.TonEnOreiAgio.text
ltx/en_us_dedes/ho.ho24:hoCA.Ode91.greekmelody	@ltx/en_us_dedes/he.h.m8:heHE.ExestiEpiTouto.greekname
ltx/en_us_dedes/ho.ho24:hoCA.Ode91.incipit	O pure one, unto whom…
ltx/en_us_dedes/ho.ho24:hoCA.Ode91.melody	@ltx/en_us_dedes/he.h.m8:heHE.ExestiEpiTouto.name
ltx/en_us_dedes/ho.ho24:hoCA.Ode91.mode	@ltx/en_us_dedes/miscellanea:misc.Mode8
ltx/en_us_dedes/ho.ho24:hoCA.Ode91.ode	@ltx/en_us_dedes/miscellanea:misc.Ode9
ltx/en_us_dedes/ho.ho24:hoCA.Ode91.text	O pure one, unto whom else am I to flee? * Where am I now to run? Where shall I be saved? Where shall I go? * Where am I to find any other place * of refuge, other fervent aid, * or another helper in my distress? * My hope is in you only. * In you alone I glory. * And taking courage, I have fled to you.
ltx/en_us_dedes/ho.ho24:hoCA.Ode92.incipit	Impossible it is to enumerate…
ltx/en_us_dedes/ho.ho24:hoCA.Ode92.melody	@ltx/en_us_dedes/he.h.m8:heHE.ExestiEpiTouto.name
ltx/en_us_dedes/ho.ho24:hoCA.Ode92.mode	@ltx/en_us_dedes/miscellanea:misc.Mode8
ltx/en_us_dedes/ho.ho24:hoCA.Ode92.ode	@ltx/en_us_dedes/miscellanea:misc.Ode9
ltx/en_us_dedes/ho.ho24:hoCA.Ode92.text	Impossible it is to enumerate * your magnificent wonders, O Bride of God, and to acclaim * aptly the unfathomable abyss * of your stupendous miracles * that are done continually for all * who honor you with longing * and faithfully pay rev’rence * to you the true Birthgiver of our God.
ltx/en_us_dedes/ho.ho24:hoCA.Ode93.incipit	With grateful hymns I glorify…
ltx/en_us_dedes/ho.ho24:hoCA.Ode93.melody	@ltx/en_us_dedes/he.h.m8:heHE.ExestiEpiTouto.name
ltx/en_us_dedes/ho.ho24:hoCA.Ode93.mode	@ltx/en_us_dedes/miscellanea:misc.Mode8
ltx/en_us_dedes/ho.ho24:hoCA.Ode93.ode	@ltx/en_us_dedes/miscellanea:misc.Ode9
ltx/en_us_dedes/ho.ho24:hoCA.Ode93.text	With grateful hymns I glorify and extol * your immeas’rable mercy, and I acknowledge unto all * the enormous power that you possess, * O Lady. And the benefits * which you have so lavishly poured on me * I magnify and herald * with heart and soul, O Virgin, * and with my mind and tongue forevermore.
ltx/en_us_dedes/ho.ho24:hoCA.Ode94.incipit	Accept my poor and negligible…
ltx/en_us_dedes/ho.ho24:hoCA.Ode94.melody	@ltx/en_us_dedes/he.h.m8:heHE.ExestiEpiTouto.name
ltx/en_us_dedes/ho.ho24:hoCA.Ode94.mode	@ltx/en_us_dedes/miscellanea:misc.Mode8
ltx/en_us_dedes/ho.ho24:hoCA.Ode94.ode	@ltx/en_us_dedes/miscellanea:misc.Ode9
ltx/en_us_dedes/ho.ho24:hoCA.Ode94.text	Accept my poor and negligible appeal; * and my weeping and tears and my sighing too do not ignore. * But since you are good, come unto my aid, * fulfilling my petitions all. * You can do all things, as the Mother of * our God and Lord Almighty. * Just nod in the direction * of my lamentable humility.
ltx/en_us_dedes/ho.ho24:hoCA.Ode9H.greekmelody	@ltx/en_us_dedes/he.h.m8:heHE.ExestiEpiTouto.greekname
ltx/en_us_dedes/ho.ho24:hoCA.Ode9H.incipit	@ltx/en_us_dedes/he.h.m8:heHE.ExestiEpiTouto.incipit
ltx/en_us_dedes/ho.ho24:hoCA.Ode9H.melody	@ltx/en_us_dedes/he.h.m8:heHE.ExestiEpiTouto.melody
ltx/en_us_dedes/ho.ho24:hoCA.Ode9H.mode	@ltx/en_us_dedes/miscellanea:misc.Mode8
ltx/en_us_dedes/ho.ho24:hoCA.Ode9H.ode	@ltx/en_us_dedes/miscellanea:misc.Ode9
ltx/en_us_dedes/ho.ho24:hoCA.Ode9H.text	@ltx/en_us_dedes/he.h.m8:heHE.ExestiEpiTouto.text
ltx/en_us_dedes/ho.ho24:hoCA.PostGospelBoth.incipit	@ltx/en_us_dedes/ho.ho23:hoCA.PostGospelBoth.incipit
ltx/en_us_dedes/ho.ho24:hoCA.PostGospelBoth.melody	
ltx/en_us_dedes/ho.ho24:hoCA.PostGospelBoth.mode	@ltx/en_us_dedes/miscellanea:misc.Mode2
ltx/en_us_dedes/ho.ho24:hoCA.PostGospelBoth.text	@ltx/en_us_dedes/ho.ho23:hoCA.PostGospelBoth.text
ltx/en_us_dedes/ho.ho24:hoCA.PostGospelGlory.incipit	@ltx/en_us_dedes/ho.ho23:hoCA.PostGospelGlory.incipit
ltx/en_us_dedes/ho.ho24:hoCA.PostGospelGlory.melody	
ltx/en_us_dedes/ho.ho24:hoCA.PostGospelGlory.mode	@ltx/en_us_dedes/miscellanea:misc.Mode2
ltx/en_us_dedes/ho.ho24:hoCA.PostGospelGlory.text	@ltx/en_us_dedes/ho.ho23:hoCA.PostGospelGlory.text
ltx/en_us_dedes/ho.ho24:hoCA.PostGospelHymn1.incipit	@ltx/en_us_dedes/ho.ho23:hoCA.PostGospelHymn1.incipit
ltx/en_us_dedes/ho.ho24:hoCA.PostGospelHymn1.melody	@ltx/en_us_dedes/he.a.m6:heAU.OlinApothemenoi.name
ltx/en_us_dedes/ho.ho24:hoCA.PostGospelHymn1.mode	@ltx/en_us_dedes/miscellanea:misc.Mode6
ltx/en_us_dedes/ho.ho24:hoCA.PostGospelHymn1.text	@ltx/en_us_dedes/ho.ho23:hoCA.PostGospelHymn1.text
ltx/en_us_dedes/ho.ho24:hoCA.PostGospelHymn2.incipit	@ltx/en_us_dedes/oc.m6.d3:ocMA.AposTheotokion.incipit
ltx/en_us_dedes/ho.ho24:hoCA.PostGospelHymn2.melody	
ltx/en_us_dedes/ho.ho24:hoCA.PostGospelHymn2.mode	@ltx/en_us_dedes/miscellanea:misc.Mode6
ltx/en_us_dedes/ho.ho24:hoCA.PostGospelHymn2.text	@ltx/en_us_dedes/oc.m6.d3:ocMA.AposTheotokion.text
ltx/en_us_dedes/ho.ho24:hoCA.PostGospelHymn3.incipit	@ltx/en_us_dedes/oc.m6.d3:ocVE.AposTheotokion.incipit
ltx/en_us_dedes/ho.ho24:hoCA.PostGospelHymn3.melody	
ltx/en_us_dedes/ho.ho24:hoCA.PostGospelHymn3.mode	@ltx/en_us_dedes/miscellanea:misc.Mode6
ltx/en_us_dedes/ho.ho24:hoCA.PostGospelHymn3.text	@ltx/en_us_dedes/oc.m6.d3:ocVE.AposTheotokion.text
ltx/en_us_dedes/ho.ho24:hoCA.PostGospelVerse.text	@ltx/en_us_dedes/ho.ho23:hoCA.PostGospelVerse.text
ltx/en_us_dedes/ho.ho24:hoCA.Troparion11.incipit	@ltx/en_us_dedes/ho.ho23:hoCA.Troparion31.incipit
ltx/en_us_dedes/ho.ho24:hoCA.Troparion11.melody	
ltx/en_us_dedes/ho.ho24:hoCA.Troparion11.mode	@ltx/en_us_dedes/miscellanea:misc.Mode8
ltx/en_us_dedes/ho.ho24:hoCA.Troparion11.text	@ltx/en_us_dedes/ho.ho23:hoCA.Troparion31.text
ltx/en_us_dedes/ho.ho24:hoCA.Troparion12.incipit	@ltx/en_us_dedes/ho.ho23:hoCA.Troparion32.incipit
ltx/en_us_dedes/ho.ho24:hoCA.Troparion12.melody	
ltx/en_us_dedes/ho.ho24:hoCA.Troparion12.mode	@ltx/en_us_dedes/miscellanea:misc.Mode8
ltx/en_us_dedes/ho.ho24:hoCA.Troparion12.text	@ltx/en_us_dedes/ho.ho23:hoCA.Troparion32.text
ltx/en_us_dedes/ho.ho24:hoCA.Troparion31.incipit	@ltx/en_us_dedes/ho.ho23:hoCA.Troparion31.incipit
ltx/en_us_dedes/ho.ho24:hoCA.Troparion31.melody	
ltx/en_us_dedes/ho.ho24:hoCA.Troparion31.mode	@ltx/en_us_dedes/miscellanea:misc.Mode8
ltx/en_us_dedes/ho.ho24:hoCA.Troparion31.text	@ltx/en_us_dedes/ho.ho23:hoCA.Troparion31.text
ltx/en_us_dedes/ho.ho24:hoCA.Troparion32.incipit	@ltx/en_us_dedes/ho.ho23:hoCA.Troparion32.incipit
ltx/en_us_dedes/ho.ho24:hoCA.Troparion32.melody	
ltx/en_us_dedes/ho.ho24:hoCA.Troparion32.mode	@ltx/en_us_dedes/miscellanea:misc.Mode8
ltx/en_us_dedes/ho.ho24:hoCA.Troparion32.text	@ltx/en_us_dedes/ho.ho23:hoCA.Troparion32.text
ltx/en_us_dedes/ho.ho24:hoCA.Troparion41.incipit	@ltx/en_us_dedes/ho.ho23:hoCA.Troparion31.incipit
ltx/en_us_dedes/ho.ho24:hoCA.Troparion41.melody	
ltx/en_us_dedes/ho.ho24:hoCA.Troparion41.mode	@ltx/en_us_dedes/miscellanea:misc.Mode8
ltx/en_us_dedes/ho.ho24:hoCA.Troparion41.text	@ltx/en_us_dedes/ho.ho23:hoCA.Troparion31.text
ltx/en_us_dedes/ho.ho24:hoCA.Troparion42.incipit	@ltx/en_us_dedes/ho.ho23:hoCA.Troparion32.incipit
ltx/en_us_dedes/ho.ho24:hoCA.Troparion42.melody	
ltx/en_us_dedes/ho.ho24:hoCA.Troparion42.mode	@ltx/en_us_dedes/miscellanea:misc.Mode8
ltx/en_us_dedes/ho.ho24:hoCA.Troparion42.text	@ltx/en_us_dedes/ho.ho23:hoCA.Troparion32.text
ltx/en_us_dedes/ho.ho24:hoCA.Troparion51.incipit	@ltx/en_us_dedes/ho.ho23:hoCA.Troparion31.incipit
ltx/en_us_dedes/ho.ho24:hoCA.Troparion51.melody	
ltx/en_us_dedes/ho.ho24:hoCA.Troparion51.mode	@ltx/en_us_dedes/miscellanea:misc.Mode8
ltx/en_us_dedes/ho.ho24:hoCA.Troparion51.text	@ltx/en_us_dedes/ho.ho23:hoCA.Troparion31.text
ltx/en_us_dedes/ho.ho24:hoCA.Troparion52.incipit	@ltx/en_us_dedes/ho.ho23:hoCA.Troparion32.incipit
ltx/en_us_dedes/ho.ho24:hoCA.Troparion52.melody	
ltx/en_us_dedes/ho.ho24:hoCA.Troparion52.mode	@ltx/en_us_dedes/miscellanea:misc.Mode8
ltx/en_us_dedes/ho.ho24:hoCA.Troparion52.text	@ltx/en_us_dedes/ho.ho23:hoCA.Troparion32.text
ltx/en_us_dedes/ho.ho24:hoCA.Troparion61.incipit	@ltx/en_us_dedes/ho.ho23:hoCA.Troparion31.incipit
ltx/en_us_dedes/ho.ho24:hoCA.Troparion61.melody	
ltx/en_us_dedes/ho.ho24:hoCA.Troparion61.mode	@ltx/en_us_dedes/miscellanea:misc.Mode8
ltx/en_us_dedes/ho.ho24:hoCA.Troparion61.text	@ltx/en_us_dedes/ho.ho23:hoCA.Troparion31.text
ltx/en_us_dedes/ho.ho24:hoCA.Troparion62.incipit	@ltx/en_us_dedes/ho.ho23:hoCA.Troparion32.incipit
ltx/en_us_dedes/ho.ho24:hoCA.Troparion62.melody	
ltx/en_us_dedes/ho.ho24:hoCA.Troparion62.mode	@ltx/en_us_dedes/miscellanea:misc.Mode8
ltx/en_us_dedes/ho.ho24:hoCA.Troparion62.text	@ltx/en_us_dedes/ho.ho23:hoCA.Troparion32.text
ltx/en_us_dedes/ho.ho24:hoCA.Troparion71.incipit	@ltx/en_us_dedes/ho.ho23:hoCA.Troparion31.incipit
ltx/en_us_dedes/ho.ho24:hoCA.Troparion71.melody	
ltx/en_us_dedes/ho.ho24:hoCA.Troparion71.mode	@ltx/en_us_dedes/miscellanea:misc.Mode8
ltx/en_us_dedes/ho.ho24:hoCA.Troparion71.text	@ltx/en_us_dedes/ho.ho23:hoCA.Troparion31.text
ltx/en_us_dedes/ho.ho24:hoCA.Troparion72.incipit	@ltx/en_us_dedes/ho.ho23:hoCA.Troparion32.incipit
ltx/en_us_dedes/ho.ho24:hoCA.Troparion72.melody	
ltx/en_us_dedes/ho.ho24:hoCA.Troparion72.mode	@ltx/en_us_dedes/miscellanea:misc.Mode8
ltx/en_us_dedes/ho.ho24:hoCA.Troparion72.text	@ltx/en_us_dedes/ho.ho23:hoCA.Troparion32.text
ltx/en_us_dedes/ho.ho24:hoCA.Troparion81.incipit	@ltx/en_us_dedes/ho.ho23:hoCA.Troparion31.incipit
ltx/en_us_dedes/ho.ho24:hoCA.Troparion81.melody	
ltx/en_us_dedes/ho.ho24:hoCA.Troparion81.mode	@ltx/en_us_dedes/miscellanea:misc.Mode8
ltx/en_us_dedes/ho.ho24:hoCA.Troparion81.text	@ltx/en_us_dedes/ho.ho23:hoCA.Troparion31.text
ltx/en_us_dedes/ho.ho24:hoCA.Troparion82.incipit	@ltx/en_us_dedes/ho.ho23:hoCA.Troparion32.incipit
ltx/en_us_dedes/ho.ho24:hoCA.Troparion82.melody	
ltx/en_us_dedes/ho.ho24:hoCA.Troparion82.mode	@ltx/en_us_dedes/miscellanea:misc.Mode8
ltx/en_us_dedes/ho.ho24:hoCA.Troparion82.text	@ltx/en_us_dedes/ho.ho23:hoCA.Troparion32.text
ltx/en_us_dedes/ho.ho24:hoCA.Troparion91.incipit	@ltx/en_us_dedes/ho.ho23:hoCA.Troparion31.incipit
ltx/en_us_dedes/ho.ho24:hoCA.Troparion91.melody	
ltx/en_us_dedes/ho.ho24:hoCA.Troparion91.mode	@ltx/en_us_dedes/miscellanea:misc.Mode8
ltx/en_us_dedes/ho.ho24:hoCA.Troparion91.text	@ltx/en_us_dedes/ho.ho23:hoCA.Troparion31.text
ltx/en_us_dedes/ho.ho24:hoCA.Troparion92.incipit	@ltx/en_us_dedes/ho.ho23:hoCA.Troparion32.incipit
ltx/en_us_dedes/ho.ho24:hoCA.Troparion92.melody	
ltx/en_us_dedes/ho.ho24:hoCA.Troparion92.mode	@ltx/en_us_dedes/miscellanea:misc.Mode8
ltx/en_us_dedes/ho.ho24:hoCA.Troparion92.text	@ltx/en_us_dedes/ho.ho23:hoCA.Troparion32.text
ltx/en_us_dedes/ho.ho24:hoCA.media.text	(Complete Score)
ltx/en_us_dedes/ho.ho24:hoCA.poet	(by Emperor Theodore Doukas Laskaris)
ltx/en_us_dedes/ho.ho24:hoCA.title	Service of the Great Paraklesis
ltx/en_us_dedes/ho.ho24:hoCA.title2	to the Most-holy Theotokos
ltx/en_us_dedes/ho.ho24:hoCA.translator	Translated by Fr. Seraphim Dedes
