ltx/en_us_dedes/tr.d035:trCO.header	(Small) with Salutations
ltx/en_us_dedes/tr.d035:trDA.commemoration.full	Saturday of the Second Week
ltx/en_us_dedes/tr.d035:trDA.commemoration.short	Saturday of the Second Week
ltx/en_us_dedes/tr.d035:trDA.dismissal	
ltx/en_us_dedes/tr.d035:trDA.insert1	
ltx/en_us_dedes/tr.d035:trDA.insert2	
ltx/en_us_dedes/tr.d035:trDA.note	
ltx/en_us_dedes/tr.d035:trDA.title	
ltx/en_us_dedes/tr.d035:trHO.commemorations	
ltx/en_us_dedes/tr.d035:trHO.daytitle	
ltx/en_us_dedes/tr.d035:trHO.description1	
ltx/en_us_dedes/tr.d035:trHO.description2	
ltx/en_us_dedes/tr.d035:trHO.note1	
ltx/en_us_dedes/tr.d035:trHO.note2	
ltx/en_us_dedes/tr.d035:trLI.Alleluia.mode	
ltx/en_us_dedes/tr.d035:trLI.AlleluiaVerse1.text	
ltx/en_us_dedes/tr.d035:trLI.AlleluiaVerse2.text	
ltx/en_us_dedes/tr.d035:trLI.Epistle.book	
ltx/en_us_dedes/tr.d035:trLI.Epistle.chapverse	
ltx/en_us_dedes/tr.d035:trLI.Epistle.text	
ltx/en_us_dedes/tr.d035:trLI.Gospel.book	
ltx/en_us_dedes/tr.d035:trLI.Gospel.chapverse	
ltx/en_us_dedes/tr.d035:trLI.Gospel.text	[paragraph el]
ltx/en_us_dedes/tr.d035:trLI.MM.CommunionHymn.text	@ltx/en_us_dedes/properties:media.key
ltx/en_us_dedes/tr.d035:trLI.MM.CommunionHymn2.text	@ltx/en_us_dedes/properties:media.key
ltx/en_us_dedes/tr.d035:trLI.Prokeimenon.incipit	…
ltx/en_us_dedes/tr.d035:trLI.Prokeimenon.mode	@ltx/en_us_dedes/miscellanea:misc.Mode6
ltx/en_us_dedes/tr.d035:trLI.Prokeimenon.text	
ltx/en_us_dedes/tr.d035:trLI.ProkeimenonVerse.text	
ltx/en_us_dedes/tr.d035:trMA.C1.acrostic.notice1	
ltx/en_us_dedes/tr.d035:trMA.C1.acrostic.text	
ltx/en_us_dedes/tr.d035:trMA.C1.acrostic.title	
ltx/en_us_dedes/tr.d035:trMA.C1.poet	@ltx/en_us_dedes/poets:po.Iosif
ltx/en_us_dedes/tr.d035:trMA.C1.title	@ltx/en_us_dedes/titles:ti.Canon1Triodion
ltx/en_us_dedes/tr.d035:trMA.C1.verse	
ltx/en_us_dedes/tr.d035:trMA.C2.poet	@ltx/en_us_dedes/poets:po.Theodorou
ltx/en_us_dedes/tr.d035:trMA.C2.title	@ltx/en_us_dedes/titles:ti.Canon2Triodion
ltx/en_us_dedes/tr.d035:trMA.C2.verse	
ltx/en_us_dedes/tr.d035:trMA.Exaposteilarion1.greekmelody	@ltx/en_us_dedes/he.a.m3:heAU.OOuranonToisAstrois.greekname
ltx/en_us_dedes/tr.d035:trMA.Exaposteilarion1.incipit	@ltx/en_us_dedes/tr.d014:trMA.Exaposteilarion1.incipit
ltx/en_us_dedes/tr.d035:trMA.Exaposteilarion1.melody	@ltx/en_us_dedes/he.a.m3:heAU.OOuranonToisAstrois.name
ltx/en_us_dedes/tr.d035:trMA.Exaposteilarion1.mode	@ltx/en_us_dedes/miscellanea:misc.Mode3
ltx/en_us_dedes/tr.d035:trMA.Exaposteilarion1.text	@ltx/en_us_dedes/tr.d014:trMA.Exaposteilarion1.text
ltx/en_us_dedes/tr.d035:trMA.Kathisma21.incipit	@ltx/en_us_dedes/tr.d014:trMA.Kathisma21.incipit
ltx/en_us_dedes/tr.d035:trMA.Kathisma21.melody	
ltx/en_us_dedes/tr.d035:trMA.Kathisma21.mode	@ltx/en_us_dedes/miscellanea:misc.Mode5
ltx/en_us_dedes/tr.d035:trMA.Kathisma21.text	@ltx/en_us_dedes/tr.d014:trMA.Kathisma21.text
ltx/en_us_dedes/tr.d035:trMA.Kathisma21b.incipit	@ltx/en_us_dedes/tr.d014:trMA.Kathisma21b.incipit
ltx/en_us_dedes/tr.d035:trMA.Kathisma21b.melody	
ltx/en_us_dedes/tr.d035:trMA.Kathisma21b.mode	@ltx/en_us_dedes/miscellanea:misc.Mode5
ltx/en_us_dedes/tr.d035:trMA.Kathisma21b.text	@ltx/en_us_dedes/tr.d014:trMA.Kathisma21b.text
ltx/en_us_dedes/tr.d035:trMA.Kathisma22.incipit	@ltx/en_us_dedes/tr.d014:trMA.Kathisma22.incipit
ltx/en_us_dedes/tr.d035:trMA.Kathisma22.melody	
ltx/en_us_dedes/tr.d035:trMA.Kathisma22.mode	@ltx/en_us_dedes/miscellanea:misc.Mode5
ltx/en_us_dedes/tr.d035:trMA.Kathisma22.text	@ltx/en_us_dedes/tr.d014:trMA.Kathisma22.text
ltx/en_us_dedes/tr.d035:trMA.Ode6C11.greekmelody	@ltx/en_us_dedes/he.h.m8:heHE.TinDeisinEkcheo.greekname
ltx/en_us_dedes/tr.d035:trMA.Ode6C11.incipit	…
ltx/en_us_dedes/tr.d035:trMA.Ode6C11.melody	@ltx/en_us_dedes/he.h.m8:heHE.TinDeisinEkcheo.name
ltx/en_us_dedes/tr.d035:trMA.Ode6C11.mode	@ltx/en_us_dedes/miscellanea:misc.Mode8
ltx/en_us_dedes/tr.d035:trMA.Ode6C11.ode	@ltx/en_us_dedes/miscellanea:misc.Ode6
ltx/en_us_dedes/tr.d035:trMA.Ode6C11.text	
ltx/en_us_dedes/tr.d035:trMA.Ode6C12.incipit	…
ltx/en_us_dedes/tr.d035:trMA.Ode6C12.melody	@ltx/en_us_dedes/he.h.m8:heHE.TinDeisinEkcheo.name
ltx/en_us_dedes/tr.d035:trMA.Ode6C12.mode	@ltx/en_us_dedes/miscellanea:misc.Mode8
ltx/en_us_dedes/tr.d035:trMA.Ode6C12.ode	@ltx/en_us_dedes/miscellanea:misc.Ode6
ltx/en_us_dedes/tr.d035:trMA.Ode6C12.text	
ltx/en_us_dedes/tr.d035:trMA.Ode6C13.incipit	…
ltx/en_us_dedes/tr.d035:trMA.Ode6C13.melody	@ltx/en_us_dedes/he.h.m8:heHE.TinDeisinEkcheo.name
ltx/en_us_dedes/tr.d035:trMA.Ode6C13.mode	@ltx/en_us_dedes/miscellanea:misc.Mode8
ltx/en_us_dedes/tr.d035:trMA.Ode6C13.ode	@ltx/en_us_dedes/miscellanea:misc.Ode6
ltx/en_us_dedes/tr.d035:trMA.Ode6C13.text	
ltx/en_us_dedes/tr.d035:trMA.Ode6C1T.incipit	…
ltx/en_us_dedes/tr.d035:trMA.Ode6C1T.melody	@ltx/en_us_dedes/he.h.m8:heHE.TinDeisinEkcheo.name
ltx/en_us_dedes/tr.d035:trMA.Ode6C1T.mode	@ltx/en_us_dedes/miscellanea:misc.Mode8
ltx/en_us_dedes/tr.d035:trMA.Ode6C1T.ode	@ltx/en_us_dedes/miscellanea:misc.Ode6
ltx/en_us_dedes/tr.d035:trMA.Ode6C1T.text	
ltx/en_us_dedes/tr.d035:trMA.Ode6C21.greekmelody	@ltx/en_us_dedes/he.h.m3:heHE.VythosMoiTonPathon.greekname
ltx/en_us_dedes/tr.d035:trMA.Ode6C21.incipit	…
ltx/en_us_dedes/tr.d035:trMA.Ode6C21.melody	@ltx/en_us_dedes/he.h.m3:heHE.VythosMoiTonPathon.name
ltx/en_us_dedes/tr.d035:trMA.Ode6C21.mode	@ltx/en_us_dedes/miscellanea:misc.Mode3
ltx/en_us_dedes/tr.d035:trMA.Ode6C21.ode	@ltx/en_us_dedes/miscellanea:misc.Ode6
ltx/en_us_dedes/tr.d035:trMA.Ode6C21.text	
ltx/en_us_dedes/tr.d035:trMA.Ode6C22.incipit	…
ltx/en_us_dedes/tr.d035:trMA.Ode6C22.melody	@ltx/en_us_dedes/he.h.m3:heHE.VythosMoiTonPathon.name
ltx/en_us_dedes/tr.d035:trMA.Ode6C22.mode	@ltx/en_us_dedes/miscellanea:misc.Mode3
ltx/en_us_dedes/tr.d035:trMA.Ode6C22.ode	@ltx/en_us_dedes/miscellanea:misc.Ode6
ltx/en_us_dedes/tr.d035:trMA.Ode6C22.text	
ltx/en_us_dedes/tr.d035:trMA.Ode6C2A1.incipit	…
ltx/en_us_dedes/tr.d035:trMA.Ode6C2A1.melody	@ltx/en_us_dedes/he.h.m3:heHE.VythosMoiTonPathon.name
ltx/en_us_dedes/tr.d035:trMA.Ode6C2A1.mode	@ltx/en_us_dedes/miscellanea:misc.Mode3
ltx/en_us_dedes/tr.d035:trMA.Ode6C2A1.ode	@ltx/en_us_dedes/miscellanea:misc.Ode6
ltx/en_us_dedes/tr.d035:trMA.Ode6C2A1.text	
ltx/en_us_dedes/tr.d035:trMA.Ode6C2A2.incipit	…
ltx/en_us_dedes/tr.d035:trMA.Ode6C2A2.melody	@ltx/en_us_dedes/he.h.m3:heHE.VythosMoiTonPathon.name
ltx/en_us_dedes/tr.d035:trMA.Ode6C2A2.mode	@ltx/en_us_dedes/miscellanea:misc.Mode3
ltx/en_us_dedes/tr.d035:trMA.Ode6C2A2.ode	@ltx/en_us_dedes/miscellanea:misc.Ode6
ltx/en_us_dedes/tr.d035:trMA.Ode6C2A2.text	
ltx/en_us_dedes/tr.d035:trMA.Ode6C2H.greekmelody	@ltx/en_us_dedes/he.h.m3:heHE.VythosMoiTonPathon.greekname
ltx/en_us_dedes/tr.d035:trMA.Ode6C2H.incipit	@ltx/en_us_dedes/he.h.m3:heHE.VythosMoiTonPathon.incipit
ltx/en_us_dedes/tr.d035:trMA.Ode6C2H.melody	@ltx/en_us_dedes/he.h.m3:heHE.VythosMoiTonPathon.melody
ltx/en_us_dedes/tr.d035:trMA.Ode6C2H.mode	@ltx/en_us_dedes/miscellanea:misc.Mode3
ltx/en_us_dedes/tr.d035:trMA.Ode6C2H.ode	@ltx/en_us_dedes/miscellanea:misc.Ode6
ltx/en_us_dedes/tr.d035:trMA.Ode6C2H.text	@ltx/en_us_dedes/he.h.m3:heHE.VythosMoiTonPathon.text
ltx/en_us_dedes/tr.d035:trMA.Ode6C2T.incipit	…
ltx/en_us_dedes/tr.d035:trMA.Ode6C2T.melody	@ltx/en_us_dedes/he.h.m3:heHE.VythosMoiTonPathon.name
ltx/en_us_dedes/tr.d035:trMA.Ode6C2T.mode	@ltx/en_us_dedes/miscellanea:misc.Mode3
ltx/en_us_dedes/tr.d035:trMA.Ode6C2T.ode	@ltx/en_us_dedes/miscellanea:misc.Ode6
ltx/en_us_dedes/tr.d035:trMA.Ode6C2T.text	
ltx/en_us_dedes/tr.d035:trMA.Ode6C2Tr.incipit	…
ltx/en_us_dedes/tr.d035:trMA.Ode6C2Tr.melody	@ltx/en_us_dedes/he.h.m3:heHE.VythosMoiTonPathon.name
ltx/en_us_dedes/tr.d035:trMA.Ode6C2Tr.mode	@ltx/en_us_dedes/miscellanea:misc.Mode3
ltx/en_us_dedes/tr.d035:trMA.Ode6C2Tr.ode	@ltx/en_us_dedes/miscellanea:misc.Ode6
ltx/en_us_dedes/tr.d035:trMA.Ode6C2Tr.text	
ltx/en_us_dedes/tr.d035:trMA.Ode7C11.greekmelody	@ltx/en_us_dedes/he.h.m8:heHE.PaidesEvraion.greekname
ltx/en_us_dedes/tr.d035:trMA.Ode7C11.incipit	…
ltx/en_us_dedes/tr.d035:trMA.Ode7C11.melody	@ltx/en_us_dedes/he.h.m8:heHE.PaidesEvraion.name
ltx/en_us_dedes/tr.d035:trMA.Ode7C11.mode	@ltx/en_us_dedes/miscellanea:misc.Mode8
ltx/en_us_dedes/tr.d035:trMA.Ode7C11.ode	@ltx/en_us_dedes/miscellanea:misc.Ode7
ltx/en_us_dedes/tr.d035:trMA.Ode7C11.text	
ltx/en_us_dedes/tr.d035:trMA.Ode7C12.incipit	…
ltx/en_us_dedes/tr.d035:trMA.Ode7C12.melody	@ltx/en_us_dedes/he.h.m8:heHE.PaidesEvraion.name
ltx/en_us_dedes/tr.d035:trMA.Ode7C12.mode	@ltx/en_us_dedes/miscellanea:misc.Mode8
ltx/en_us_dedes/tr.d035:trMA.Ode7C12.ode	@ltx/en_us_dedes/miscellanea:misc.Ode7
ltx/en_us_dedes/tr.d035:trMA.Ode7C12.text	
ltx/en_us_dedes/tr.d035:trMA.Ode7C13.incipit	…
ltx/en_us_dedes/tr.d035:trMA.Ode7C13.melody	@ltx/en_us_dedes/he.h.m8:heHE.PaidesEvraion.name
ltx/en_us_dedes/tr.d035:trMA.Ode7C13.mode	@ltx/en_us_dedes/miscellanea:misc.Mode8
ltx/en_us_dedes/tr.d035:trMA.Ode7C13.ode	@ltx/en_us_dedes/miscellanea:misc.Ode7
ltx/en_us_dedes/tr.d035:trMA.Ode7C13.text	
ltx/en_us_dedes/tr.d035:trMA.Ode7C1T.incipit	…
ltx/en_us_dedes/tr.d035:trMA.Ode7C1T.melody	@ltx/en_us_dedes/he.h.m8:heHE.PaidesEvraion.name
ltx/en_us_dedes/tr.d035:trMA.Ode7C1T.mode	@ltx/en_us_dedes/miscellanea:misc.Mode8
ltx/en_us_dedes/tr.d035:trMA.Ode7C1T.ode	@ltx/en_us_dedes/miscellanea:misc.Ode7
ltx/en_us_dedes/tr.d035:trMA.Ode7C1T.text	
ltx/en_us_dedes/tr.d035:trMA.Ode7C21.greekmelody	@ltx/en_us_dedes/he.h.m3:heHE.OTinFloga.greekname
ltx/en_us_dedes/tr.d035:trMA.Ode7C21.incipit	…
ltx/en_us_dedes/tr.d035:trMA.Ode7C21.melody	@ltx/en_us_dedes/he.h.m3:heHE.OTinFloga.name
ltx/en_us_dedes/tr.d035:trMA.Ode7C21.mode	@ltx/en_us_dedes/miscellanea:misc.Mode3
ltx/en_us_dedes/tr.d035:trMA.Ode7C21.ode	@ltx/en_us_dedes/miscellanea:misc.Ode7
ltx/en_us_dedes/tr.d035:trMA.Ode7C21.text	
ltx/en_us_dedes/tr.d035:trMA.Ode7C22.incipit	…
ltx/en_us_dedes/tr.d035:trMA.Ode7C22.melody	@ltx/en_us_dedes/he.h.m3:heHE.OTinFloga.name
ltx/en_us_dedes/tr.d035:trMA.Ode7C22.mode	@ltx/en_us_dedes/miscellanea:misc.Mode3
ltx/en_us_dedes/tr.d035:trMA.Ode7C22.ode	@ltx/en_us_dedes/miscellanea:misc.Ode7
ltx/en_us_dedes/tr.d035:trMA.Ode7C22.text	
ltx/en_us_dedes/tr.d035:trMA.Ode7C2A1.incipit	…
ltx/en_us_dedes/tr.d035:trMA.Ode7C2A1.melody	@ltx/en_us_dedes/he.h.m3:heHE.OTinFloga.name
ltx/en_us_dedes/tr.d035:trMA.Ode7C2A1.mode	@ltx/en_us_dedes/miscellanea:misc.Mode3
ltx/en_us_dedes/tr.d035:trMA.Ode7C2A1.ode	@ltx/en_us_dedes/miscellanea:misc.Ode7
ltx/en_us_dedes/tr.d035:trMA.Ode7C2A1.text	
ltx/en_us_dedes/tr.d035:trMA.Ode7C2A2.incipit	…
ltx/en_us_dedes/tr.d035:trMA.Ode7C2A2.melody	@ltx/en_us_dedes/he.h.m3:heHE.OTinFloga.name
ltx/en_us_dedes/tr.d035:trMA.Ode7C2A2.mode	@ltx/en_us_dedes/miscellanea:misc.Mode3
ltx/en_us_dedes/tr.d035:trMA.Ode7C2A2.ode	@ltx/en_us_dedes/miscellanea:misc.Ode7
ltx/en_us_dedes/tr.d035:trMA.Ode7C2A2.text	
ltx/en_us_dedes/tr.d035:trMA.Ode7C2H.greekmelody	@ltx/en_us_dedes/he.h.m3:heHE.OTinFloga.greekname
ltx/en_us_dedes/tr.d035:trMA.Ode7C2H.incipit	@ltx/en_us_dedes/he.h.m3:heHE.OTinFloga.incipit
ltx/en_us_dedes/tr.d035:trMA.Ode7C2H.melody	@ltx/en_us_dedes/he.h.m3:heHE.OTinFloga.melody
ltx/en_us_dedes/tr.d035:trMA.Ode7C2H.mode	@ltx/en_us_dedes/miscellanea:misc.Mode3
ltx/en_us_dedes/tr.d035:trMA.Ode7C2H.ode	@ltx/en_us_dedes/miscellanea:misc.Ode7
ltx/en_us_dedes/tr.d035:trMA.Ode7C2H.text	@ltx/en_us_dedes/he.h.m3:heHE.OTinFloga.text
ltx/en_us_dedes/tr.d035:trMA.Ode7C2T.incipit	…
ltx/en_us_dedes/tr.d035:trMA.Ode7C2T.melody	@ltx/en_us_dedes/he.h.m3:heHE.OTinFloga.name
ltx/en_us_dedes/tr.d035:trMA.Ode7C2T.mode	@ltx/en_us_dedes/miscellanea:misc.Mode3
ltx/en_us_dedes/tr.d035:trMA.Ode7C2T.ode	@ltx/en_us_dedes/miscellanea:misc.Ode7
ltx/en_us_dedes/tr.d035:trMA.Ode7C2T.text	
ltx/en_us_dedes/tr.d035:trMA.Ode7C2Tr.incipit	…
ltx/en_us_dedes/tr.d035:trMA.Ode7C2Tr.melody	@ltx/en_us_dedes/he.h.m3:heHE.OTinFloga.name
ltx/en_us_dedes/tr.d035:trMA.Ode7C2Tr.mode	@ltx/en_us_dedes/miscellanea:misc.Mode3
ltx/en_us_dedes/tr.d035:trMA.Ode7C2Tr.ode	@ltx/en_us_dedes/miscellanea:misc.Ode7
ltx/en_us_dedes/tr.d035:trMA.Ode7C2Tr.text	
ltx/en_us_dedes/tr.d035:trMA.Ode8C11.greekmelody	@ltx/en_us_dedes/he.h.m8:heHE.NikitaiTyrannou.greekname
ltx/en_us_dedes/tr.d035:trMA.Ode8C11.incipit	…
ltx/en_us_dedes/tr.d035:trMA.Ode8C11.melody	@ltx/en_us_dedes/he.h.m8:heHE.NikitaiTyrannou.name
ltx/en_us_dedes/tr.d035:trMA.Ode8C11.mode	@ltx/en_us_dedes/miscellanea:misc.Mode8
ltx/en_us_dedes/tr.d035:trMA.Ode8C11.ode	@ltx/en_us_dedes/miscellanea:misc.Ode8
ltx/en_us_dedes/tr.d035:trMA.Ode8C11.text	
ltx/en_us_dedes/tr.d035:trMA.Ode8C12.incipit	…
ltx/en_us_dedes/tr.d035:trMA.Ode8C12.melody	
ltx/en_us_dedes/tr.d035:trMA.Ode8C12.mode	@ltx/en_us_dedes/miscellanea:misc.Mode8
ltx/en_us_dedes/tr.d035:trMA.Ode8C12.ode	@ltx/en_us_dedes/miscellanea:misc.Ode8
ltx/en_us_dedes/tr.d035:trMA.Ode8C12.text	
ltx/en_us_dedes/tr.d035:trMA.Ode8C13.incipit	…
ltx/en_us_dedes/tr.d035:trMA.Ode8C13.melody	
ltx/en_us_dedes/tr.d035:trMA.Ode8C13.mode	@ltx/en_us_dedes/miscellanea:misc.Mode8
ltx/en_us_dedes/tr.d035:trMA.Ode8C13.ode	@ltx/en_us_dedes/miscellanea:misc.Ode8
ltx/en_us_dedes/tr.d035:trMA.Ode8C13.text	
ltx/en_us_dedes/tr.d035:trMA.Ode8C1T.incipit	…
ltx/en_us_dedes/tr.d035:trMA.Ode8C1T.melody	
ltx/en_us_dedes/tr.d035:trMA.Ode8C1T.mode	@ltx/en_us_dedes/miscellanea:misc.Mode8
ltx/en_us_dedes/tr.d035:trMA.Ode8C1T.ode	@ltx/en_us_dedes/miscellanea:misc.Ode8
ltx/en_us_dedes/tr.d035:trMA.Ode8C1T.text	
ltx/en_us_dedes/tr.d035:trMA.Ode8C21.greekmelody	@ltx/en_us_dedes/he.h.m3:heHE.TonExAnarchou.greekname
ltx/en_us_dedes/tr.d035:trMA.Ode8C21.incipit	…
ltx/en_us_dedes/tr.d035:trMA.Ode8C21.melody	@ltx/en_us_dedes/he.h.m3:heHE.TonExAnarchou.name
ltx/en_us_dedes/tr.d035:trMA.Ode8C21.mode	@ltx/en_us_dedes/miscellanea:misc.Mode3
ltx/en_us_dedes/tr.d035:trMA.Ode8C21.ode	@ltx/en_us_dedes/miscellanea:misc.Ode8
ltx/en_us_dedes/tr.d035:trMA.Ode8C21.text	
ltx/en_us_dedes/tr.d035:trMA.Ode8C22.incipit	…
ltx/en_us_dedes/tr.d035:trMA.Ode8C22.melody	@ltx/en_us_dedes/he.h.m3:heHE.TonExAnarchou.name
ltx/en_us_dedes/tr.d035:trMA.Ode8C22.mode	@ltx/en_us_dedes/miscellanea:misc.Mode3
ltx/en_us_dedes/tr.d035:trMA.Ode8C22.ode	@ltx/en_us_dedes/miscellanea:misc.Ode8
ltx/en_us_dedes/tr.d035:trMA.Ode8C22.text	
ltx/en_us_dedes/tr.d035:trMA.Ode8C2A1.incipit	…
ltx/en_us_dedes/tr.d035:trMA.Ode8C2A1.melody	@ltx/en_us_dedes/he.h.m3:heHE.TonExAnarchou.name
ltx/en_us_dedes/tr.d035:trMA.Ode8C2A1.mode	@ltx/en_us_dedes/miscellanea:misc.Mode3
ltx/en_us_dedes/tr.d035:trMA.Ode8C2A1.ode	@ltx/en_us_dedes/miscellanea:misc.Ode8
ltx/en_us_dedes/tr.d035:trMA.Ode8C2A1.text	
ltx/en_us_dedes/tr.d035:trMA.Ode8C2A2.incipit	…
ltx/en_us_dedes/tr.d035:trMA.Ode8C2A2.melody	@ltx/en_us_dedes/he.h.m3:heHE.TonExAnarchou.name
ltx/en_us_dedes/tr.d035:trMA.Ode8C2A2.mode	@ltx/en_us_dedes/miscellanea:misc.Mode3
ltx/en_us_dedes/tr.d035:trMA.Ode8C2A2.ode	@ltx/en_us_dedes/miscellanea:misc.Ode8
ltx/en_us_dedes/tr.d035:trMA.Ode8C2A2.text	
ltx/en_us_dedes/tr.d035:trMA.Ode8C2H.greekmelody	@ltx/en_us_dedes/he.h.m3:heHE.TonExAnarchou.greekname
ltx/en_us_dedes/tr.d035:trMA.Ode8C2H.incipit	@ltx/en_us_dedes/he.h.m3:heHE.TonExAnarchou.incipit
ltx/en_us_dedes/tr.d035:trMA.Ode8C2H.melody	@ltx/en_us_dedes/he.h.m3:heHE.TonExAnarchou.melody
ltx/en_us_dedes/tr.d035:trMA.Ode8C2H.mode	@ltx/en_us_dedes/miscellanea:misc.Mode3
ltx/en_us_dedes/tr.d035:trMA.Ode8C2H.ode	@ltx/en_us_dedes/miscellanea:misc.Ode8
ltx/en_us_dedes/tr.d035:trMA.Ode8C2H.text	@ltx/en_us_dedes/he.h.m3:heHE.TonExAnarchou.text
ltx/en_us_dedes/tr.d035:trMA.Ode8C2T.incipit	…
ltx/en_us_dedes/tr.d035:trMA.Ode8C2T.melody	@ltx/en_us_dedes/he.h.m3:heHE.TonExAnarchou.name
ltx/en_us_dedes/tr.d035:trMA.Ode8C2T.mode	@ltx/en_us_dedes/miscellanea:misc.Mode3
ltx/en_us_dedes/tr.d035:trMA.Ode8C2T.ode	@ltx/en_us_dedes/miscellanea:misc.Ode8
ltx/en_us_dedes/tr.d035:trMA.Ode8C2T.text	
ltx/en_us_dedes/tr.d035:trMA.Ode8C2Tr.incipit	…
ltx/en_us_dedes/tr.d035:trMA.Ode8C2Tr.melody	@ltx/en_us_dedes/he.h.m3:heHE.TonExAnarchou.name
ltx/en_us_dedes/tr.d035:trMA.Ode8C2Tr.mode	@ltx/en_us_dedes/miscellanea:misc.Mode3
ltx/en_us_dedes/tr.d035:trMA.Ode8C2Tr.ode	@ltx/en_us_dedes/miscellanea:misc.Ode8
ltx/en_us_dedes/tr.d035:trMA.Ode8C2Tr.text	
ltx/en_us_dedes/tr.d035:trMA.Ode9C11.greekmelody	@ltx/en_us_dedes/he.h.m8:heHE.OrousParilthes.greekname
ltx/en_us_dedes/tr.d035:trMA.Ode9C11.incipit	…
ltx/en_us_dedes/tr.d035:trMA.Ode9C11.melody	@ltx/en_us_dedes/he.h.m8:heHE.OrousParilthes.name
ltx/en_us_dedes/tr.d035:trMA.Ode9C11.mode	@ltx/en_us_dedes/miscellanea:misc.Mode8
ltx/en_us_dedes/tr.d035:trMA.Ode9C11.ode	@ltx/en_us_dedes/miscellanea:misc.Ode9
ltx/en_us_dedes/tr.d035:trMA.Ode9C11.text	
ltx/en_us_dedes/tr.d035:trMA.Ode9C12.incipit	…
ltx/en_us_dedes/tr.d035:trMA.Ode9C12.melody	@ltx/en_us_dedes/he.h.m8:heHE.OrousParilthes.name
ltx/en_us_dedes/tr.d035:trMA.Ode9C12.mode	@ltx/en_us_dedes/miscellanea:misc.Mode8
ltx/en_us_dedes/tr.d035:trMA.Ode9C12.ode	@ltx/en_us_dedes/miscellanea:misc.Ode9
ltx/en_us_dedes/tr.d035:trMA.Ode9C12.text	
ltx/en_us_dedes/tr.d035:trMA.Ode9C13.incipit	…
ltx/en_us_dedes/tr.d035:trMA.Ode9C13.melody	@ltx/en_us_dedes/he.h.m8:heHE.OrousParilthes.name
ltx/en_us_dedes/tr.d035:trMA.Ode9C13.mode	@ltx/en_us_dedes/miscellanea:misc.Mode8
ltx/en_us_dedes/tr.d035:trMA.Ode9C13.ode	@ltx/en_us_dedes/miscellanea:misc.Ode9
ltx/en_us_dedes/tr.d035:trMA.Ode9C13.text	
ltx/en_us_dedes/tr.d035:trMA.Ode9C1T.incipit	…
ltx/en_us_dedes/tr.d035:trMA.Ode9C1T.melody	@ltx/en_us_dedes/he.h.m8:heHE.OrousParilthes.name
ltx/en_us_dedes/tr.d035:trMA.Ode9C1T.mode	@ltx/en_us_dedes/miscellanea:misc.Mode8
ltx/en_us_dedes/tr.d035:trMA.Ode9C1T.ode	@ltx/en_us_dedes/miscellanea:misc.Ode9
ltx/en_us_dedes/tr.d035:trMA.Ode9C1T.text	
ltx/en_us_dedes/tr.d035:trMA.Ode9C21.greekmelody	@ltx/en_us_dedes/he.h.m3:heHE.SeTinAthanaton.greekname
ltx/en_us_dedes/tr.d035:trMA.Ode9C21.incipit	…
ltx/en_us_dedes/tr.d035:trMA.Ode9C21.melody	@ltx/en_us_dedes/he.h.m3:heHE.SeTinAthanaton.name
ltx/en_us_dedes/tr.d035:trMA.Ode9C21.mode	@ltx/en_us_dedes/miscellanea:misc.Mode3
ltx/en_us_dedes/tr.d035:trMA.Ode9C21.ode	@ltx/en_us_dedes/miscellanea:misc.Ode9
ltx/en_us_dedes/tr.d035:trMA.Ode9C21.text	
ltx/en_us_dedes/tr.d035:trMA.Ode9C22.incipit	…
ltx/en_us_dedes/tr.d035:trMA.Ode9C22.melody	@ltx/en_us_dedes/he.h.m3:heHE.SeTinAthanaton.name
ltx/en_us_dedes/tr.d035:trMA.Ode9C22.mode	@ltx/en_us_dedes/miscellanea:misc.Mode3
ltx/en_us_dedes/tr.d035:trMA.Ode9C22.ode	@ltx/en_us_dedes/miscellanea:misc.Ode9
ltx/en_us_dedes/tr.d035:trMA.Ode9C22.text	
ltx/en_us_dedes/tr.d035:trMA.Ode9C2A1.incipit	…
ltx/en_us_dedes/tr.d035:trMA.Ode9C2A1.melody	@ltx/en_us_dedes/he.h.m3:heHE.SeTinAthanaton.name
ltx/en_us_dedes/tr.d035:trMA.Ode9C2A1.mode	@ltx/en_us_dedes/miscellanea:misc.Mode3
ltx/en_us_dedes/tr.d035:trMA.Ode9C2A1.ode	@ltx/en_us_dedes/miscellanea:misc.Ode9
ltx/en_us_dedes/tr.d035:trMA.Ode9C2A1.text	
ltx/en_us_dedes/tr.d035:trMA.Ode9C2A2.incipit	…
ltx/en_us_dedes/tr.d035:trMA.Ode9C2A2.melody	@ltx/en_us_dedes/he.h.m3:heHE.SeTinAthanaton.name
ltx/en_us_dedes/tr.d035:trMA.Ode9C2A2.mode	@ltx/en_us_dedes/miscellanea:misc.Mode3
ltx/en_us_dedes/tr.d035:trMA.Ode9C2A2.ode	@ltx/en_us_dedes/miscellanea:misc.Ode9
ltx/en_us_dedes/tr.d035:trMA.Ode9C2A2.text	
ltx/en_us_dedes/tr.d035:trMA.Ode9C2H.greekmelody	@ltx/en_us_dedes/he.h.m3:heHE.SeTinAthanaton.greekname
ltx/en_us_dedes/tr.d035:trMA.Ode9C2H.incipit	@ltx/en_us_dedes/he.h.m3:heHE.SeTinAthanaton.incipit
ltx/en_us_dedes/tr.d035:trMA.Ode9C2H.melody	@ltx/en_us_dedes/he.h.m3:heHE.SeTinAthanaton.melody
ltx/en_us_dedes/tr.d035:trMA.Ode9C2H.mode	@ltx/en_us_dedes/miscellanea:misc.Mode3
ltx/en_us_dedes/tr.d035:trMA.Ode9C2H.ode	@ltx/en_us_dedes/miscellanea:misc.Ode9
ltx/en_us_dedes/tr.d035:trMA.Ode9C2H.text	@ltx/en_us_dedes/he.h.m3:heHE.SeTinAthanaton.text
ltx/en_us_dedes/tr.d035:trMA.Ode9C2T.incipit	…
ltx/en_us_dedes/tr.d035:trMA.Ode9C2T.melody	@ltx/en_us_dedes/he.h.m3:heHE.SeTinAthanaton.name
ltx/en_us_dedes/tr.d035:trMA.Ode9C2T.mode	@ltx/en_us_dedes/miscellanea:misc.Mode3
ltx/en_us_dedes/tr.d035:trMA.Ode9C2T.ode	@ltx/en_us_dedes/miscellanea:misc.Ode9
ltx/en_us_dedes/tr.d035:trMA.Ode9C2T.text	
ltx/en_us_dedes/tr.d035:trMA.Ode9C2Tr.incipit	…
ltx/en_us_dedes/tr.d035:trMA.Ode9C2Tr.melody	@ltx/en_us_dedes/he.h.m3:heHE.SeTinAthanaton.name
ltx/en_us_dedes/tr.d035:trMA.Ode9C2Tr.mode	@ltx/en_us_dedes/miscellanea:misc.Mode3
ltx/en_us_dedes/tr.d035:trMA.Ode9C2Tr.ode	@ltx/en_us_dedes/miscellanea:misc.Ode9
ltx/en_us_dedes/tr.d035:trMA.Ode9C2Tr.text	
ltx/en_us_dedes/tr.d035:trR001	This year, the memory of St. Gregory Palamas is also celebrated today, because the feast of the Annunciation falls on the second Sunday of Lent.
ltx/en_us_dedes/tr.d035:trVE.ApolTheotokion.incipit	@ltx/en_us_dedes/da.d7:daVE.ApolTheotokion.incipit
ltx/en_us_dedes/tr.d035:trVE.ApolTheotokion.melody	
ltx/en_us_dedes/tr.d035:trVE.ApolTheotokion.mode	@ltx/en_us_dedes/miscellanea:misc.Mode2
ltx/en_us_dedes/tr.d035:trVE.ApolTheotokion.text	@ltx/en_us_dedes/da.d7:daVE.ApolTheotokion.text
ltx/en_us_dedes/tr.d035:trVE.Apolytikion1.incipit	@ltx/en_us_dedes/da.d7:daVE.Apolytikion1.incipit
ltx/en_us_dedes/tr.d035:trVE.Apolytikion1.melody	
ltx/en_us_dedes/tr.d035:trVE.Apolytikion1.mode	@ltx/en_us_dedes/miscellanea:misc.Mode2
ltx/en_us_dedes/tr.d035:trVE.Apolytikion1.text	@ltx/en_us_dedes/da.d7:daVE.Apolytikion1.text
ltx/en_us_dedes/tr.d035:trVE.Apolytikion2.incipit	@ltx/en_us_dedes/da.d7:daVE.Apolytikion2.incipit
ltx/en_us_dedes/tr.d035:trVE.Apolytikion2.melody	
ltx/en_us_dedes/tr.d035:trVE.Apolytikion2.mode	@ltx/en_us_dedes/miscellanea:misc.Mode2
ltx/en_us_dedes/tr.d035:trVE.Apolytikion2.text	@ltx/en_us_dedes/da.d7:daVE.Apolytikion2.text
ltx/en_us_dedes/tr.d035:trVE.AposIdiomelon1.incipit	Now is the acceptable time…
ltx/en_us_dedes/tr.d035:trVE.AposIdiomelon1.melody	
ltx/en_us_dedes/tr.d035:trVE.AposIdiomelon1.mode	@ltx/en_us_dedes/miscellanea:misc.Mode4
ltx/en_us_dedes/tr.d035:trVE.AposIdiomelon1.text	Now is the acceptable time; now is the day of salvation. O Lord, in the abundance of your mercy, visit my soul, and remove the heavy burden of my iniquities, as the only One who is benevolent.
ltx/en_us_dedes/tr.d035:trVL.header	Presanctified Liturgy on Friday of the Second Week
