ltx/en_us_dedes/me.m04.d30:meDA.commemoration.first	Memory of the Holy Apostle Iakovos (James), the Brother of John the Theologian
ltx/en_us_dedes/me.m04.d30:meDA.commemoration.first_name	
ltx/en_us_dedes/me.m04.d30:meDA.commemoration.first_short	Memory of the Holy Apostle Iakovos (James), the Brother of John the Theologian
ltx/en_us_dedes/me.m04.d30:meDA.commemoration.first_title	@ltx/en_us_dedes/titles:ti.Apostle
ltx/en_us_dedes/me.m04.d30:meDA.commemoration.full	Memory of the Holy Apostle Iakovos (James), the Brother of John the Theologian
ltx/en_us_dedes/me.m04.d30:meDA.commemoration.second_name	
ltx/en_us_dedes/me.m04.d30:meDA.commemoration.second_title	
ltx/en_us_dedes/me.m04.d30:meDA.date	April 30
ltx/en_us_dedes/me.m04.d30:meDA.fordate	for April 30
ltx/en_us_dedes/me.m04.d30:meDA.insert1	the holy, glorious, and praiseworthy Apostle Iakovos (James), the Brother of John the Theologian,
ltx/en_us_dedes/me.m04.d30:meDA.insert2	whose memory we observe,
ltx/en_us_dedes/me.m04.d30:meDA.note	
ltx/en_us_dedes/me.m04.d30:meDA.pdfcoverdate	April 30,
ltx/en_us_dedes/me.m04.d30:meDA.pdfheaderdate	April 30
ltx/en_us_dedes/me.m04.d30:meHO.commemorations	
ltx/en_us_dedes/me.m04.d30:meHO.note1	
ltx/en_us_dedes/me.m04.d30:meHO.note2	
ltx/en_us_dedes/me.m04.d30:meHO.number	
ltx/en_us_dedes/me.m04.d30:meHO.rank	
ltx/en_us_dedes/me.m04.d30:meLE.commemoration1	The Holy Apostle Iakovos (James), the Brother of John the Theologian.
ltx/en_us_dedes/me.m04.d30:meLE.commemoration2	
ltx/en_us_dedes/me.m04.d30:meLI.MM.CommunionHymn.text	@ltx/en_us_dedes/properties:media.key
ltx/en_us_dedes/me.m04.d30:meLI.Megalynarion.text	
ltx/en_us_dedes/me.m04.d30:meMA.C1.acrostic.notice1	
ltx/en_us_dedes/me.m04.d30:meMA.C1.acrostic.text	
ltx/en_us_dedes/me.m04.d30:meMA.C1.acrostic.title	
ltx/en_us_dedes/me.m04.d30:meMA.C1.poet	@ltx/en_us_dedes/poets:po.Theofanous
ltx/en_us_dedes/me.m04.d30:meMA.C1.title	@ltx/en_us_dedes/titles:ti.CanonApostle
ltx/en_us_dedes/me.m04.d30:meMA.C1.verse	@ltx/en_us_dedes/prayers:pr.verse_Apostle.text
ltx/en_us_dedes/me.m04.d30:meMA.Exaposteilarion1.greekmelody	@ltx/en_us_dedes/he.a.m2:heAU.TonMathitonOrontonSe.greekname
ltx/en_us_dedes/me.m04.d30:meMA.Exaposteilarion1.incipit	In His compassion, Christ the…
ltx/en_us_dedes/me.m04.d30:meMA.Exaposteilarion1.melody	@ltx/en_us_dedes/he.a.m2:heAU.TonMathitonOrontonSe.name
ltx/en_us_dedes/me.m04.d30:meMA.Exaposteilarion1.mode	@ltx/en_us_dedes/miscellanea:misc.Mode2
ltx/en_us_dedes/me.m04.d30:meMA.Exaposteilarion1.text	In His compassion, Christ the incarnate Logos * chose you, O holy James, to be His disciple. * You were counted among the Preeminent. * All together now earnestly * entreat Him for us who honor * today your all-holy memory.
ltx/en_us_dedes/me.m04.d30:meMA.Kontakion1.greekmelody	@ltx/en_us_dedes/he.a.m2:heAU.TaAnoZiton.greekname
ltx/en_us_dedes/me.m04.d30:meMA.Kontakion1.incipit	…
ltx/en_us_dedes/me.m04.d30:meMA.Kontakion1.melody	@ltx/en_us_dedes/he.a.m2:heAU.TaAnoZiton.name
ltx/en_us_dedes/me.m04.d30:meMA.Kontakion1.mode	@ltx/en_us_dedes/miscellanea:misc.Mode2
ltx/en_us_dedes/me.m04.d30:meMA.Kontakion1.text	
ltx/en_us_dedes/me.m04.d30:meMA.Lauds1.greekmelody	@ltx/en_us_dedes/he.a.m4:heAU.OsGennaionEnMartysi.greekname
ltx/en_us_dedes/me.m04.d30:meMA.Lauds1.incipit	Having grace as a fishing-rod…
ltx/en_us_dedes/me.m04.d30:meMA.Lauds1.melody	@ltx/en_us_dedes/he.a.m4:heAU.OsGennaionEnMartysi.name
ltx/en_us_dedes/me.m04.d30:meMA.Lauds1.mode	@ltx/en_us_dedes/miscellanea:misc.Mode4
ltx/en_us_dedes/me.m04.d30:meMA.Lauds1.text	Having grace as a fishing-rod, * you succeeded in pulling up * people from futility as if from the sea; * for you obeyed the directions of * your Teacher, who filled your mind * with His light, and you became * His Apostle and God-inspired spokesman and divine * of His own incomprehensible Godhead, * O praiseworthy and all-blessed, * all-holy James, now extolled by all.
ltx/en_us_dedes/me.m04.d30:meMA.Lauds2.incipit	When the Spirit’s enlightenment *…
ltx/en_us_dedes/me.m04.d30:meMA.Lauds2.melody	@ltx/en_us_dedes/he.a.m4:heAU.OsGennaionEnMartysi.name
ltx/en_us_dedes/me.m04.d30:meMA.Lauds2.mode	@ltx/en_us_dedes/miscellanea:misc.Mode4
ltx/en_us_dedes/me.m04.d30:meMA.Lauds2.text	When the Spirit’s enlightenment * came upon you, O blessed one, * in the form of fire on the day of Pentecost, * it made you into a most divine * vessel that could drive away * godlessness as it were mist, * and illumine the whole wide world with the splendidness * of your words, full of wisdom, as a speaker * of the mysteries, Apostle * of Christ, St. James, now extolled by all.
ltx/en_us_dedes/me.m04.d30:meMA.Lauds3.incipit	By your preaching, like lightning…
ltx/en_us_dedes/me.m04.d30:meMA.Lauds3.melody	@ltx/en_us_dedes/he.a.m4:heAU.OsGennaionEnMartysi.name
ltx/en_us_dedes/me.m04.d30:meMA.Lauds3.mode	@ltx/en_us_dedes/miscellanea:misc.Mode4
ltx/en_us_dedes/me.m04.d30:meMA.Lauds3.text	By your preaching, like lightning bolts, * you enlightened the ignorant * who lay in the darkness, O glorious St. James. * Through faith you gave them new birth as sons * of God, who inspired you. * O Apostle, you aspired * to the Passion and death of Christ, our Savior and Lord, * as an heir of His uncreated glory, * as a genuine disciple, * and as a wise man who speaks of God.
ltx/en_us_dedes/me.m04.d30:meMA.LaudsGlory.incipit	Come all, and with psalms…
ltx/en_us_dedes/me.m04.d30:meMA.LaudsGlory.melody	
ltx/en_us_dedes/me.m04.d30:meMA.LaudsGlory.mode	@ltx/en_us_dedes/miscellanea:misc.Mode8
ltx/en_us_dedes/me.m04.d30:meMA.LaudsGlory.text	Come all, and with psalms and hymns let us extol James, that herald of the heavenly revelation, that oracle of the Gospel. He was like a river in the spiritual Garden of Eden, irrigating souls like fields with heavenly showers, and making them bear fruit for Christ God, who by the intercessions of this Evangelist grants to everyone forgiveness and the great mercy.
ltx/en_us_dedes/me.m04.d30:meMA.Ode1C11.greekmelody	@ltx/en_us_dedes/he.h.m8:heHE.ArmatilatinFarao.greekname
ltx/en_us_dedes/me.m04.d30:meMA.Ode1C11.incipit	…
ltx/en_us_dedes/me.m04.d30:meMA.Ode1C11.melody	@ltx/en_us_dedes/he.h.m8:heHE.ArmatilatinFarao.name
ltx/en_us_dedes/me.m04.d30:meMA.Ode1C11.mode	@ltx/en_us_dedes/miscellanea:misc.Mode8
ltx/en_us_dedes/me.m04.d30:meMA.Ode1C11.ode	@ltx/en_us_dedes/miscellanea:misc.Ode1
ltx/en_us_dedes/me.m04.d30:meMA.Ode1C11.text	
ltx/en_us_dedes/me.m04.d30:meMA.Ode1C12.incipit	…
ltx/en_us_dedes/me.m04.d30:meMA.Ode1C12.melody	@ltx/en_us_dedes/he.h.m8:heHE.ArmatilatinFarao.name
ltx/en_us_dedes/me.m04.d30:meMA.Ode1C12.mode	@ltx/en_us_dedes/miscellanea:misc.Mode8
ltx/en_us_dedes/me.m04.d30:meMA.Ode1C12.ode	@ltx/en_us_dedes/miscellanea:misc.Ode1
ltx/en_us_dedes/me.m04.d30:meMA.Ode1C12.text	
ltx/en_us_dedes/me.m04.d30:meMA.Ode1C13.incipit	…
ltx/en_us_dedes/me.m04.d30:meMA.Ode1C13.melody	@ltx/en_us_dedes/he.h.m8:heHE.ArmatilatinFarao.name
ltx/en_us_dedes/me.m04.d30:meMA.Ode1C13.mode	@ltx/en_us_dedes/miscellanea:misc.Mode8
ltx/en_us_dedes/me.m04.d30:meMA.Ode1C13.ode	@ltx/en_us_dedes/miscellanea:misc.Ode1
ltx/en_us_dedes/me.m04.d30:meMA.Ode1C13.text	
ltx/en_us_dedes/me.m04.d30:meMA.Ode1C14.incipit	…
ltx/en_us_dedes/me.m04.d30:meMA.Ode1C14.melody	@ltx/en_us_dedes/he.h.m8:heHE.ArmatilatinFarao.name
ltx/en_us_dedes/me.m04.d30:meMA.Ode1C14.mode	@ltx/en_us_dedes/miscellanea:misc.Mode8
ltx/en_us_dedes/me.m04.d30:meMA.Ode1C14.ode	@ltx/en_us_dedes/miscellanea:misc.Ode1
ltx/en_us_dedes/me.m04.d30:meMA.Ode1C14.text	
ltx/en_us_dedes/me.m04.d30:meMA.Ode1C1T.incipit	…
ltx/en_us_dedes/me.m04.d30:meMA.Ode1C1T.melody	@ltx/en_us_dedes/he.h.m8:heHE.ArmatilatinFarao.name
ltx/en_us_dedes/me.m04.d30:meMA.Ode1C1T.mode	@ltx/en_us_dedes/miscellanea:misc.Mode8
ltx/en_us_dedes/me.m04.d30:meMA.Ode1C1T.ode	@ltx/en_us_dedes/miscellanea:misc.Ode1
ltx/en_us_dedes/me.m04.d30:meMA.Ode1C1T.text	
ltx/en_us_dedes/me.m04.d30:meMA.Ode3C11.greekmelody	@ltx/en_us_dedes/he.h.m8:heHE.OStereosasKatArchas.greekname
ltx/en_us_dedes/me.m04.d30:meMA.Ode3C11.incipit	…
ltx/en_us_dedes/me.m04.d30:meMA.Ode3C11.melody	@ltx/en_us_dedes/he.h.m8:heHE.OStereosasKatArchas.name
ltx/en_us_dedes/me.m04.d30:meMA.Ode3C11.mode	@ltx/en_us_dedes/miscellanea:misc.Mode8
ltx/en_us_dedes/me.m04.d30:meMA.Ode3C11.ode	@ltx/en_us_dedes/miscellanea:misc.Ode3
ltx/en_us_dedes/me.m04.d30:meMA.Ode3C11.text	
ltx/en_us_dedes/me.m04.d30:meMA.Ode3C12.incipit	…
ltx/en_us_dedes/me.m04.d30:meMA.Ode3C12.melody	@ltx/en_us_dedes/he.h.m8:heHE.OStereosasKatArchas.name
ltx/en_us_dedes/me.m04.d30:meMA.Ode3C12.mode	@ltx/en_us_dedes/miscellanea:misc.Mode8
ltx/en_us_dedes/me.m04.d30:meMA.Ode3C12.ode	@ltx/en_us_dedes/miscellanea:misc.Ode3
ltx/en_us_dedes/me.m04.d30:meMA.Ode3C12.text	
ltx/en_us_dedes/me.m04.d30:meMA.Ode3C13.incipit	…
ltx/en_us_dedes/me.m04.d30:meMA.Ode3C13.melody	@ltx/en_us_dedes/he.h.m8:heHE.OStereosasKatArchas.name
ltx/en_us_dedes/me.m04.d30:meMA.Ode3C13.mode	@ltx/en_us_dedes/miscellanea:misc.Mode8
ltx/en_us_dedes/me.m04.d30:meMA.Ode3C13.ode	@ltx/en_us_dedes/miscellanea:misc.Ode3
ltx/en_us_dedes/me.m04.d30:meMA.Ode3C13.text	
ltx/en_us_dedes/me.m04.d30:meMA.Ode3C14.incipit	…
ltx/en_us_dedes/me.m04.d30:meMA.Ode3C14.melody	@ltx/en_us_dedes/he.h.m8:heHE.OStereosasKatArchas.name
ltx/en_us_dedes/me.m04.d30:meMA.Ode3C14.mode	@ltx/en_us_dedes/miscellanea:misc.Mode8
ltx/en_us_dedes/me.m04.d30:meMA.Ode3C14.ode	@ltx/en_us_dedes/miscellanea:misc.Ode3
ltx/en_us_dedes/me.m04.d30:meMA.Ode3C14.text	
ltx/en_us_dedes/me.m04.d30:meMA.Ode3C1T.incipit	…
ltx/en_us_dedes/me.m04.d30:meMA.Ode3C1T.melody	@ltx/en_us_dedes/he.h.m8:heHE.OStereosasKatArchas.name
ltx/en_us_dedes/me.m04.d30:meMA.Ode3C1T.mode	@ltx/en_us_dedes/miscellanea:misc.Mode8
ltx/en_us_dedes/me.m04.d30:meMA.Ode3C1T.ode	@ltx/en_us_dedes/miscellanea:misc.Ode3
ltx/en_us_dedes/me.m04.d30:meMA.Ode3C1T.text	
ltx/en_us_dedes/me.m04.d30:meMA.Ode3H.greekmelody	@ltx/en_us_dedes/he.h.m8:heHE.OStereosasKatArchas.greekname
ltx/en_us_dedes/me.m04.d30:meMA.Ode3H.incipit	@ltx/en_us_dedes/he.h.m8:heHE.OStereosasKatArchas.incipit
ltx/en_us_dedes/me.m04.d30:meMA.Ode3H.melody	@ltx/en_us_dedes/he.h.m8:heHE.OStereosasKatArchas.melody
ltx/en_us_dedes/me.m04.d30:meMA.Ode3H.mode	@ltx/en_us_dedes/miscellanea:misc.Mode8
ltx/en_us_dedes/me.m04.d30:meMA.Ode3H.ode	@ltx/en_us_dedes/miscellanea:misc.Ode3
ltx/en_us_dedes/me.m04.d30:meMA.Ode3H.text	@ltx/en_us_dedes/he.h.m8:heHE.OStereosasKatArchas.text
ltx/en_us_dedes/me.m04.d30:meMA.Ode3Kathisma1.greekmelody	@ltx/en_us_dedes/he.a.m1:heAU.TonTafonSouSotir.greekname
ltx/en_us_dedes/me.m04.d30:meMA.Ode3Kathisma1.incipit	…
ltx/en_us_dedes/me.m04.d30:meMA.Ode3Kathisma1.melody	@ltx/en_us_dedes/he.a.m1:heAU.TonTafonSouSotir.name
ltx/en_us_dedes/me.m04.d30:meMA.Ode3Kathisma1.mode	@ltx/en_us_dedes/miscellanea:misc.Mode1
ltx/en_us_dedes/me.m04.d30:meMA.Ode3Kathisma1.text	
ltx/en_us_dedes/me.m04.d30:meMA.Ode4C11.greekmelody	@ltx/en_us_dedes/he.h.m8:heHE.SyMouIschys.greekname
ltx/en_us_dedes/me.m04.d30:meMA.Ode4C11.incipit	…
ltx/en_us_dedes/me.m04.d30:meMA.Ode4C11.melody	@ltx/en_us_dedes/he.h.m8:heHE.SyMouIschys.name
ltx/en_us_dedes/me.m04.d30:meMA.Ode4C11.mode	@ltx/en_us_dedes/miscellanea:misc.Mode8
ltx/en_us_dedes/me.m04.d30:meMA.Ode4C11.ode	@ltx/en_us_dedes/miscellanea:misc.Ode4
ltx/en_us_dedes/me.m04.d30:meMA.Ode4C11.text	
ltx/en_us_dedes/me.m04.d30:meMA.Ode4C12.incipit	…
ltx/en_us_dedes/me.m04.d30:meMA.Ode4C12.melody	@ltx/en_us_dedes/he.h.m8:heHE.SyMouIschys.name
ltx/en_us_dedes/me.m04.d30:meMA.Ode4C12.mode	@ltx/en_us_dedes/miscellanea:misc.Mode8
ltx/en_us_dedes/me.m04.d30:meMA.Ode4C12.ode	@ltx/en_us_dedes/miscellanea:misc.Ode4
ltx/en_us_dedes/me.m04.d30:meMA.Ode4C12.text	
ltx/en_us_dedes/me.m04.d30:meMA.Ode4C13.incipit	…
ltx/en_us_dedes/me.m04.d30:meMA.Ode4C13.melody	@ltx/en_us_dedes/he.h.m8:heHE.SyMouIschys.name
ltx/en_us_dedes/me.m04.d30:meMA.Ode4C13.mode	@ltx/en_us_dedes/miscellanea:misc.Mode8
ltx/en_us_dedes/me.m04.d30:meMA.Ode4C13.ode	@ltx/en_us_dedes/miscellanea:misc.Ode4
ltx/en_us_dedes/me.m04.d30:meMA.Ode4C13.text	
ltx/en_us_dedes/me.m04.d30:meMA.Ode4C14.incipit	…
ltx/en_us_dedes/me.m04.d30:meMA.Ode4C14.melody	@ltx/en_us_dedes/he.h.m8:heHE.SyMouIschys.name
ltx/en_us_dedes/me.m04.d30:meMA.Ode4C14.mode	@ltx/en_us_dedes/miscellanea:misc.Mode8
ltx/en_us_dedes/me.m04.d30:meMA.Ode4C14.ode	@ltx/en_us_dedes/miscellanea:misc.Ode4
ltx/en_us_dedes/me.m04.d30:meMA.Ode4C14.text	
ltx/en_us_dedes/me.m04.d30:meMA.Ode4C1T.incipit	…
ltx/en_us_dedes/me.m04.d30:meMA.Ode4C1T.melody	@ltx/en_us_dedes/he.h.m8:heHE.SyMouIschys.name
ltx/en_us_dedes/me.m04.d30:meMA.Ode4C1T.mode	@ltx/en_us_dedes/miscellanea:misc.Mode8
ltx/en_us_dedes/me.m04.d30:meMA.Ode4C1T.ode	@ltx/en_us_dedes/miscellanea:misc.Ode4
ltx/en_us_dedes/me.m04.d30:meMA.Ode4C1T.text	
ltx/en_us_dedes/me.m04.d30:meMA.Ode5C11.greekmelody	@ltx/en_us_dedes/he.h.m8:heHE.InaTiMeAposo.greekname
ltx/en_us_dedes/me.m04.d30:meMA.Ode5C11.incipit	…
ltx/en_us_dedes/me.m04.d30:meMA.Ode5C11.melody	@ltx/en_us_dedes/he.h.m8:heHE.InaTiMeAposo.name
ltx/en_us_dedes/me.m04.d30:meMA.Ode5C11.mode	@ltx/en_us_dedes/miscellanea:misc.Mode8
ltx/en_us_dedes/me.m04.d30:meMA.Ode5C11.ode	@ltx/en_us_dedes/miscellanea:misc.Ode5
ltx/en_us_dedes/me.m04.d30:meMA.Ode5C11.text	
ltx/en_us_dedes/me.m04.d30:meMA.Ode5C12.incipit	…
ltx/en_us_dedes/me.m04.d30:meMA.Ode5C12.melody	@ltx/en_us_dedes/he.h.m8:heHE.InaTiMeAposo.name
ltx/en_us_dedes/me.m04.d30:meMA.Ode5C12.mode	@ltx/en_us_dedes/miscellanea:misc.Mode8
ltx/en_us_dedes/me.m04.d30:meMA.Ode5C12.ode	@ltx/en_us_dedes/miscellanea:misc.Ode5
ltx/en_us_dedes/me.m04.d30:meMA.Ode5C12.text	
ltx/en_us_dedes/me.m04.d30:meMA.Ode5C13.incipit	…
ltx/en_us_dedes/me.m04.d30:meMA.Ode5C13.melody	@ltx/en_us_dedes/he.h.m8:heHE.InaTiMeAposo.name
ltx/en_us_dedes/me.m04.d30:meMA.Ode5C13.mode	@ltx/en_us_dedes/miscellanea:misc.Mode8
ltx/en_us_dedes/me.m04.d30:meMA.Ode5C13.ode	@ltx/en_us_dedes/miscellanea:misc.Ode5
ltx/en_us_dedes/me.m04.d30:meMA.Ode5C13.text	
ltx/en_us_dedes/me.m04.d30:meMA.Ode5C14.incipit	…
ltx/en_us_dedes/me.m04.d30:meMA.Ode5C14.melody	@ltx/en_us_dedes/he.h.m8:heHE.InaTiMeAposo.name
ltx/en_us_dedes/me.m04.d30:meMA.Ode5C14.mode	@ltx/en_us_dedes/miscellanea:misc.Mode8
ltx/en_us_dedes/me.m04.d30:meMA.Ode5C14.ode	@ltx/en_us_dedes/miscellanea:misc.Ode5
ltx/en_us_dedes/me.m04.d30:meMA.Ode5C14.text	
ltx/en_us_dedes/me.m04.d30:meMA.Ode5C1T.incipit	…
ltx/en_us_dedes/me.m04.d30:meMA.Ode5C1T.melody	@ltx/en_us_dedes/he.h.m8:heHE.InaTiMeAposo.name
ltx/en_us_dedes/me.m04.d30:meMA.Ode5C1T.mode	@ltx/en_us_dedes/miscellanea:misc.Mode8
ltx/en_us_dedes/me.m04.d30:meMA.Ode5C1T.ode	@ltx/en_us_dedes/miscellanea:misc.Ode5
ltx/en_us_dedes/me.m04.d30:meMA.Ode5C1T.text	
ltx/en_us_dedes/me.m04.d30:meMA.Ode6C11.greekmelody	@ltx/en_us_dedes/he.h.m8:heHE.AvyssosAmartion.greekname
ltx/en_us_dedes/me.m04.d30:meMA.Ode6C11.incipit	…
ltx/en_us_dedes/me.m04.d30:meMA.Ode6C11.melody	@ltx/en_us_dedes/he.h.m8:heHE.AvyssosAmartion.name
ltx/en_us_dedes/me.m04.d30:meMA.Ode6C11.mode	@ltx/en_us_dedes/miscellanea:misc.Mode8
ltx/en_us_dedes/me.m04.d30:meMA.Ode6C11.ode	@ltx/en_us_dedes/miscellanea:misc.Ode6
ltx/en_us_dedes/me.m04.d30:meMA.Ode6C11.text	
ltx/en_us_dedes/me.m04.d30:meMA.Ode6C12.incipit	…
ltx/en_us_dedes/me.m04.d30:meMA.Ode6C12.melody	@ltx/en_us_dedes/he.h.m8:heHE.AvyssosAmartion.name
ltx/en_us_dedes/me.m04.d30:meMA.Ode6C12.mode	@ltx/en_us_dedes/miscellanea:misc.Mode8
ltx/en_us_dedes/me.m04.d30:meMA.Ode6C12.ode	@ltx/en_us_dedes/miscellanea:misc.Ode6
ltx/en_us_dedes/me.m04.d30:meMA.Ode6C12.text	
ltx/en_us_dedes/me.m04.d30:meMA.Ode6C13.incipit	…
ltx/en_us_dedes/me.m04.d30:meMA.Ode6C13.melody	@ltx/en_us_dedes/he.h.m8:heHE.AvyssosAmartion.name
ltx/en_us_dedes/me.m04.d30:meMA.Ode6C13.mode	@ltx/en_us_dedes/miscellanea:misc.Mode8
ltx/en_us_dedes/me.m04.d30:meMA.Ode6C13.ode	@ltx/en_us_dedes/miscellanea:misc.Ode6
ltx/en_us_dedes/me.m04.d30:meMA.Ode6C13.text	
ltx/en_us_dedes/me.m04.d30:meMA.Ode6C14.incipit	…
ltx/en_us_dedes/me.m04.d30:meMA.Ode6C14.melody	@ltx/en_us_dedes/he.h.m8:heHE.AvyssosAmartion.name
ltx/en_us_dedes/me.m04.d30:meMA.Ode6C14.mode	@ltx/en_us_dedes/miscellanea:misc.Mode8
ltx/en_us_dedes/me.m04.d30:meMA.Ode6C14.ode	@ltx/en_us_dedes/miscellanea:misc.Ode6
ltx/en_us_dedes/me.m04.d30:meMA.Ode6C14.text	
ltx/en_us_dedes/me.m04.d30:meMA.Ode6C1T.incipit	…
ltx/en_us_dedes/me.m04.d30:meMA.Ode6C1T.melody	@ltx/en_us_dedes/he.h.m8:heHE.AvyssosAmartion.name
ltx/en_us_dedes/me.m04.d30:meMA.Ode6C1T.mode	@ltx/en_us_dedes/miscellanea:misc.Mode8
ltx/en_us_dedes/me.m04.d30:meMA.Ode6C1T.ode	@ltx/en_us_dedes/miscellanea:misc.Ode6
ltx/en_us_dedes/me.m04.d30:meMA.Ode6C1T.text	
ltx/en_us_dedes/me.m04.d30:meMA.Ode6H.greekmelody	@ltx/en_us_dedes/he.h.m8:heHE.AvyssosAmartion.greekname
ltx/en_us_dedes/me.m04.d30:meMA.Ode6H.incipit	@ltx/en_us_dedes/he.h.m8:heHE.AvyssosAmartion.incipit
ltx/en_us_dedes/me.m04.d30:meMA.Ode6H.melody	@ltx/en_us_dedes/he.h.m8:heHE.AvyssosAmartion.melody
ltx/en_us_dedes/me.m04.d30:meMA.Ode6H.mode	@ltx/en_us_dedes/miscellanea:misc.Mode8
ltx/en_us_dedes/me.m04.d30:meMA.Ode6H.ode	@ltx/en_us_dedes/miscellanea:misc.Ode6
ltx/en_us_dedes/me.m04.d30:meMA.Ode6H.text	@ltx/en_us_dedes/he.h.m8:heHE.AvyssosAmartion.text
ltx/en_us_dedes/me.m04.d30:meMA.Ode7C11.greekmelody	@ltx/en_us_dedes/he.h.m8:heHE.TheouSynkatavasin.greekname
ltx/en_us_dedes/me.m04.d30:meMA.Ode7C11.incipit	…
ltx/en_us_dedes/me.m04.d30:meMA.Ode7C11.melody	@ltx/en_us_dedes/he.h.m8:heHE.TheouSynkatavasin.name
ltx/en_us_dedes/me.m04.d30:meMA.Ode7C11.mode	@ltx/en_us_dedes/miscellanea:misc.Mode8
ltx/en_us_dedes/me.m04.d30:meMA.Ode7C11.ode	@ltx/en_us_dedes/miscellanea:misc.Ode7
ltx/en_us_dedes/me.m04.d30:meMA.Ode7C11.text	
ltx/en_us_dedes/me.m04.d30:meMA.Ode7C12.incipit	…
ltx/en_us_dedes/me.m04.d30:meMA.Ode7C12.melody	@ltx/en_us_dedes/he.h.m8:heHE.TheouSynkatavasin.name
ltx/en_us_dedes/me.m04.d30:meMA.Ode7C12.mode	@ltx/en_us_dedes/miscellanea:misc.Mode8
ltx/en_us_dedes/me.m04.d30:meMA.Ode7C12.ode	@ltx/en_us_dedes/miscellanea:misc.Ode7
ltx/en_us_dedes/me.m04.d30:meMA.Ode7C12.text	
ltx/en_us_dedes/me.m04.d30:meMA.Ode7C13.incipit	…
ltx/en_us_dedes/me.m04.d30:meMA.Ode7C13.melody	@ltx/en_us_dedes/he.h.m8:heHE.TheouSynkatavasin.name
ltx/en_us_dedes/me.m04.d30:meMA.Ode7C13.mode	@ltx/en_us_dedes/miscellanea:misc.Mode8
ltx/en_us_dedes/me.m04.d30:meMA.Ode7C13.ode	@ltx/en_us_dedes/miscellanea:misc.Ode7
ltx/en_us_dedes/me.m04.d30:meMA.Ode7C13.text	
ltx/en_us_dedes/me.m04.d30:meMA.Ode7C14.incipit	…
ltx/en_us_dedes/me.m04.d30:meMA.Ode7C14.melody	@ltx/en_us_dedes/he.h.m8:heHE.TheouSynkatavasin.name
ltx/en_us_dedes/me.m04.d30:meMA.Ode7C14.mode	@ltx/en_us_dedes/miscellanea:misc.Mode8
ltx/en_us_dedes/me.m04.d30:meMA.Ode7C14.ode	@ltx/en_us_dedes/miscellanea:misc.Ode7
ltx/en_us_dedes/me.m04.d30:meMA.Ode7C14.text	
ltx/en_us_dedes/me.m04.d30:meMA.Ode7C1T.incipit	…
ltx/en_us_dedes/me.m04.d30:meMA.Ode7C1T.melody	@ltx/en_us_dedes/he.h.m8:heHE.TheouSynkatavasin.name
ltx/en_us_dedes/me.m04.d30:meMA.Ode7C1T.mode	@ltx/en_us_dedes/miscellanea:misc.Mode8
ltx/en_us_dedes/me.m04.d30:meMA.Ode7C1T.ode	@ltx/en_us_dedes/miscellanea:misc.Ode7
ltx/en_us_dedes/me.m04.d30:meMA.Ode7C1T.text	
ltx/en_us_dedes/me.m04.d30:meMA.Ode8C11.greekmelody	@ltx/en_us_dedes/he.h.m8:heHE.EptaplasiosKaminon.greekname
ltx/en_us_dedes/me.m04.d30:meMA.Ode8C11.incipit	…
ltx/en_us_dedes/me.m04.d30:meMA.Ode8C11.melody	@ltx/en_us_dedes/he.h.m8:heHE.EptaplasiosKaminon.name
ltx/en_us_dedes/me.m04.d30:meMA.Ode8C11.mode	@ltx/en_us_dedes/miscellanea:misc.Mode8
ltx/en_us_dedes/me.m04.d30:meMA.Ode8C11.ode	@ltx/en_us_dedes/miscellanea:misc.Ode8
ltx/en_us_dedes/me.m04.d30:meMA.Ode8C11.text	
ltx/en_us_dedes/me.m04.d30:meMA.Ode8C12.incipit	…
ltx/en_us_dedes/me.m04.d30:meMA.Ode8C12.melody	@ltx/en_us_dedes/he.h.m8:heHE.EptaplasiosKaminon.name
ltx/en_us_dedes/me.m04.d30:meMA.Ode8C12.mode	@ltx/en_us_dedes/miscellanea:misc.Mode8
ltx/en_us_dedes/me.m04.d30:meMA.Ode8C12.ode	@ltx/en_us_dedes/miscellanea:misc.Ode8
ltx/en_us_dedes/me.m04.d30:meMA.Ode8C12.text	
ltx/en_us_dedes/me.m04.d30:meMA.Ode8C13.incipit	…
ltx/en_us_dedes/me.m04.d30:meMA.Ode8C13.melody	@ltx/en_us_dedes/he.h.m8:heHE.EptaplasiosKaminon.name
ltx/en_us_dedes/me.m04.d30:meMA.Ode8C13.mode	@ltx/en_us_dedes/miscellanea:misc.Mode8
ltx/en_us_dedes/me.m04.d30:meMA.Ode8C13.ode	@ltx/en_us_dedes/miscellanea:misc.Ode8
ltx/en_us_dedes/me.m04.d30:meMA.Ode8C13.text	
ltx/en_us_dedes/me.m04.d30:meMA.Ode8C14.incipit	…
ltx/en_us_dedes/me.m04.d30:meMA.Ode8C14.melody	@ltx/en_us_dedes/he.h.m8:heHE.EptaplasiosKaminon.name
ltx/en_us_dedes/me.m04.d30:meMA.Ode8C14.mode	@ltx/en_us_dedes/miscellanea:misc.Mode8
ltx/en_us_dedes/me.m04.d30:meMA.Ode8C14.ode	@ltx/en_us_dedes/miscellanea:misc.Ode8
ltx/en_us_dedes/me.m04.d30:meMA.Ode8C14.text	
ltx/en_us_dedes/me.m04.d30:meMA.Ode8C1T.incipit	…
ltx/en_us_dedes/me.m04.d30:meMA.Ode8C1T.melody	@ltx/en_us_dedes/he.h.m8:heHE.EptaplasiosKaminon.name
ltx/en_us_dedes/me.m04.d30:meMA.Ode8C1T.mode	@ltx/en_us_dedes/miscellanea:misc.Mode8
ltx/en_us_dedes/me.m04.d30:meMA.Ode8C1T.ode	@ltx/en_us_dedes/miscellanea:misc.Ode8
ltx/en_us_dedes/me.m04.d30:meMA.Ode8C1T.text	
ltx/en_us_dedes/me.m04.d30:meMA.Ode8H.greekmelody	@ltx/en_us_dedes/he.h.m8:heHE.EptaplasiosKaminon.greekname
ltx/en_us_dedes/me.m04.d30:meMA.Ode8H.incipit	@ltx/en_us_dedes/he.h.m8:heHE.EptaplasiosKaminon.incipit
ltx/en_us_dedes/me.m04.d30:meMA.Ode8H.melody	@ltx/en_us_dedes/he.h.m8:heHE.EptaplasiosKaminon.melody
ltx/en_us_dedes/me.m04.d30:meMA.Ode8H.mode	@ltx/en_us_dedes/miscellanea:misc.Mode8
ltx/en_us_dedes/me.m04.d30:meMA.Ode8H.ode	@ltx/en_us_dedes/miscellanea:misc.Ode8
ltx/en_us_dedes/me.m04.d30:meMA.Ode8H.text	@ltx/en_us_dedes/he.h.m8:heHE.EptaplasiosKaminon.text
ltx/en_us_dedes/me.m04.d30:meMA.Ode9C11.greekmelody	@ltx/en_us_dedes/he.h.m8:heHE.ExestiEpiTouto.greekname
ltx/en_us_dedes/me.m04.d30:meMA.Ode9C11.incipit	…
ltx/en_us_dedes/me.m04.d30:meMA.Ode9C11.melody	@ltx/en_us_dedes/he.h.m8:heHE.ExestiEpiTouto.name
ltx/en_us_dedes/me.m04.d30:meMA.Ode9C11.mode	@ltx/en_us_dedes/miscellanea:misc.Mode8
ltx/en_us_dedes/me.m04.d30:meMA.Ode9C11.ode	@ltx/en_us_dedes/miscellanea:misc.Ode9
ltx/en_us_dedes/me.m04.d30:meMA.Ode9C11.text	
ltx/en_us_dedes/me.m04.d30:meMA.Ode9C12.incipit	…
ltx/en_us_dedes/me.m04.d30:meMA.Ode9C12.melody	@ltx/en_us_dedes/he.h.m8:heHE.ExestiEpiTouto.name
ltx/en_us_dedes/me.m04.d30:meMA.Ode9C12.mode	@ltx/en_us_dedes/miscellanea:misc.Mode8
ltx/en_us_dedes/me.m04.d30:meMA.Ode9C12.ode	@ltx/en_us_dedes/miscellanea:misc.Ode9
ltx/en_us_dedes/me.m04.d30:meMA.Ode9C12.text	
ltx/en_us_dedes/me.m04.d30:meMA.Ode9C13.incipit	…
ltx/en_us_dedes/me.m04.d30:meMA.Ode9C13.melody	@ltx/en_us_dedes/he.h.m8:heHE.ExestiEpiTouto.name
ltx/en_us_dedes/me.m04.d30:meMA.Ode9C13.mode	@ltx/en_us_dedes/miscellanea:misc.Mode8
ltx/en_us_dedes/me.m04.d30:meMA.Ode9C13.ode	@ltx/en_us_dedes/miscellanea:misc.Ode9
ltx/en_us_dedes/me.m04.d30:meMA.Ode9C13.text	
ltx/en_us_dedes/me.m04.d30:meMA.Ode9C14.incipit	…
ltx/en_us_dedes/me.m04.d30:meMA.Ode9C14.melody	@ltx/en_us_dedes/he.h.m8:heHE.ExestiEpiTouto.name
ltx/en_us_dedes/me.m04.d30:meMA.Ode9C14.mode	@ltx/en_us_dedes/miscellanea:misc.Mode8
ltx/en_us_dedes/me.m04.d30:meMA.Ode9C14.ode	@ltx/en_us_dedes/miscellanea:misc.Ode9
ltx/en_us_dedes/me.m04.d30:meMA.Ode9C14.text	
ltx/en_us_dedes/me.m04.d30:meMA.Ode9C1T.incipit	…
ltx/en_us_dedes/me.m04.d30:meMA.Ode9C1T.melody	@ltx/en_us_dedes/he.h.m8:heHE.ExestiEpiTouto.name
ltx/en_us_dedes/me.m04.d30:meMA.Ode9C1T.mode	@ltx/en_us_dedes/miscellanea:misc.Mode8
ltx/en_us_dedes/me.m04.d30:meMA.Ode9C1T.ode	@ltx/en_us_dedes/miscellanea:misc.Ode9
ltx/en_us_dedes/me.m04.d30:meMA.Ode9C1T.text	
ltx/en_us_dedes/me.m04.d30:meMA.Ode9H.greekmelody	@ltx/en_us_dedes/he.h.m8:heHE.ExestiEpiTouto.greekname
ltx/en_us_dedes/me.m04.d30:meMA.Ode9H.incipit	@ltx/en_us_dedes/he.h.m8:heHE.ExestiEpiTouto.incipit
ltx/en_us_dedes/me.m04.d30:meMA.Ode9H.melody	@ltx/en_us_dedes/he.h.m8:heHE.ExestiEpiTouto.melody
ltx/en_us_dedes/me.m04.d30:meMA.Ode9H.mode	@ltx/en_us_dedes/miscellanea:misc.Mode8
ltx/en_us_dedes/me.m04.d30:meMA.Ode9H.ode	@ltx/en_us_dedes/miscellanea:misc.Ode9
ltx/en_us_dedes/me.m04.d30:meMA.Ode9H.text	@ltx/en_us_dedes/he.h.m8:heHE.ExestiEpiTouto.text
ltx/en_us_dedes/me.m04.d30:meMA.Oikos1.text	I pray you, O thrice-blessed James, as a fisher of men, with the net of your holy prayers, pull up my humble soul from the sea of transgressions, for it has been the prey of the pleasures of life for a long time. Thus leading the rest of my life without wavering, I shall extol your name and glorify your blameless life, which you led on the earth, for which on Mt. Tabor you were counted worthy to behold the Lord’s divine Transfiguration.
ltx/en_us_dedes/me.m04.d30:meVE.Apolytikion1ger.greekmelody	@ltx/en_us_dedes/he.a.m3:heAU.TheiasPisteos.greekname
ltx/en_us_dedes/me.m04.d30:meVE.Apolytikion1ger.incipit	…
ltx/en_us_dedes/me.m04.d30:meVE.Apolytikion1ger.melody	@ltx/en_us_dedes/he.a.m3:heAU.TheiasPisteos.name
ltx/en_us_dedes/me.m04.d30:meVE.Apolytikion1ger.mode	@ltx/en_us_dedes/miscellanea:misc.Mode3
ltx/en_us_dedes/me.m04.d30:meVE.Apolytikion1ger.poet	@ltx/en_us_dedes/poets:po.Gerasimou
ltx/en_us_dedes/me.m04.d30:meVE.Apolytikion1ger.text	
ltx/en_us_dedes/me.m04.d30:meVE.AposGlory.incipit	O Apostle and Martyr James…
ltx/en_us_dedes/me.m04.d30:meVE.AposGlory.melody	
ltx/en_us_dedes/me.m04.d30:meVE.AposGlory.mode	@ltx/en_us_dedes/miscellanea:misc.Mode1
ltx/en_us_dedes/me.m04.d30:meVE.AposGlory.text	O Apostle and Martyr James, you were a divinely chosen sheep of the Good Shepherd. Now you rejoice in heaven together with your brother John. We who celebrate your solemn memory entreat you, to pray for the forgiveness of our sins, and that we be given the great mercy.
ltx/en_us_dedes/me.m04.d30:meVE.GeneralApolytikion1.name	James,
ltx/en_us_dedes/me.m04.d30:meVE.MM.GeneralApolytikion1.text	@ltx/en_us_dedes/properties:media.key
ltx/en_us_dedes/me.m04.d30:meVE.SticGlory.incipit	You were the first…
ltx/en_us_dedes/me.m04.d30:meVE.SticGlory.melody	
ltx/en_us_dedes/me.m04.d30:meVE.SticGlory.mode	@ltx/en_us_dedes/miscellanea:misc.Mode8
ltx/en_us_dedes/me.m04.d30:meVE.SticGlory.text	You were the first of the Twelve Disciples chosen by your divine Teacher to drink His cup of death which He promised, O all-lauded Apostle James, for you, first, suffered death by sword for His sake by command of Herod. And thus the benevolent Lord took you as a joint heir of His kingdom. And now, together with your brother John, you intercede on behalf of our souls.
ltx/en_us_dedes/me.m04.d30:meVE.Stichera01.greekmelody	@ltx/en_us_dedes/he.a.m8:heAU.OTouParadoxou.greekname
ltx/en_us_dedes/me.m04.d30:meVE.Stichera01.incipit	…
ltx/en_us_dedes/me.m04.d30:meVE.Stichera01.melody	@ltx/en_us_dedes/he.a.m8:heAU.OTouParadoxou.name
ltx/en_us_dedes/me.m04.d30:meVE.Stichera01.mode	@ltx/en_us_dedes/miscellanea:misc.Mode8
ltx/en_us_dedes/me.m04.d30:meVE.Stichera01.text	
ltx/en_us_dedes/me.m04.d30:meVE.Stichera02.incipit	…
ltx/en_us_dedes/me.m04.d30:meVE.Stichera02.melody	@ltx/en_us_dedes/he.a.m8:heAU.OTouParadoxou.name
ltx/en_us_dedes/me.m04.d30:meVE.Stichera02.mode	@ltx/en_us_dedes/miscellanea:misc.Mode8
ltx/en_us_dedes/me.m04.d30:meVE.Stichera02.text	
ltx/en_us_dedes/me.m04.d30:meVE.Stichera03.incipit	…
ltx/en_us_dedes/me.m04.d30:meVE.Stichera03.melody	@ltx/en_us_dedes/he.a.m8:heAU.OTouParadoxou.name
ltx/en_us_dedes/me.m04.d30:meVE.Stichera03.mode	@ltx/en_us_dedes/miscellanea:misc.Mode8
ltx/en_us_dedes/me.m04.d30:meVE.Stichera03.text	
