ltx/en_us_dedes/me.m08.d24:alt1.meCouplet_v1.text	
ltx/en_us_dedes/me.m08.d24:alt1.meCouplet_v2.text	
ltx/en_us_dedes/me.m08.d24:alt1.meDA.commemoration.first_name	
ltx/en_us_dedes/me.m08.d24:alt1.meDA.commemoration.first_short	Memory of St. Kosmas Aetolos
ltx/en_us_dedes/me.m08.d24:alt1.meDA.commemoration.first_title	
ltx/en_us_dedes/me.m08.d24:alt1.meDA.commemoration.full	
ltx/en_us_dedes/me.m08.d24:alt1.meDA.commemoration.second_name	
ltx/en_us_dedes/me.m08.d24:alt1.meDA.commemoration.second_title	
ltx/en_us_dedes/me.m08.d24:alt1.meDA.date	August 24
ltx/en_us_dedes/me.m08.d24:alt1.meDA.insert1	
ltx/en_us_dedes/me.m08.d24:alt1.meDA.insert2	
ltx/en_us_dedes/me.m08.d24:alt1.meDA.note	
ltx/en_us_dedes/me.m08.d24:alt1.meHO.commemorations	
ltx/en_us_dedes/me.m08.d24:alt1.meHO.note1	
ltx/en_us_dedes/me.m08.d24:alt1.meHO.note2	
ltx/en_us_dedes/me.m08.d24:alt1.meHO.number	
ltx/en_us_dedes/me.m08.d24:alt1.meHO.rank	
ltx/en_us_dedes/me.m08.d24:alt1.meLE.commemoration1	
ltx/en_us_dedes/me.m08.d24:alt1.meLE.commemoration2	
ltx/en_us_dedes/me.m08.d24:alt1.meLI.Kontakion1.incipit	@ltx/en_us_dedes/me.m08.d24:alt1.meMA.Kontakion1.incipit
ltx/en_us_dedes/me.m08.d24:alt1.meLI.Kontakion1.melody	@ltx/en_us_dedes/me.m08.d24:alt1.meMA.Kontakion1.melody
ltx/en_us_dedes/me.m08.d24:alt1.meLI.Kontakion1.mode	@ltx/en_us_dedes/me.m08.d24:alt1.meMA.Kontakion1.mode
ltx/en_us_dedes/me.m08.d24:alt1.meLI.Kontakion1.text	@ltx/en_us_dedes/me.m08.d24:alt1.meMA.Kontakion1.text
ltx/en_us_dedes/me.m08.d24:alt1.meLI.MM.CommunionHymn.text	@ltx/en_us_dedes/properties:media.key
ltx/en_us_dedes/me.m08.d24:alt1.meLI.Megalynarion.text	
ltx/en_us_dedes/me.m08.d24:alt1.meMA.C1.acrostic.notice1	
ltx/en_us_dedes/me.m08.d24:alt1.meMA.C1.acrostic.text	
ltx/en_us_dedes/me.m08.d24:alt1.meMA.C1.acrostic.title	
ltx/en_us_dedes/me.m08.d24:alt1.meMA.C1.title	@ltx/en_us_dedes/titles:ti.CanonSaintM
ltx/en_us_dedes/me.m08.d24:alt1.meMA.C1.verse	@ltx/en_us_dedes/prayers:pr.verse_SaintM.text
ltx/en_us_dedes/me.m08.d24:alt1.meMA.ExapTheotokion.incipit	…
ltx/en_us_dedes/me.m08.d24:alt1.meMA.ExapTheotokion.melody	@ltx/en_us_dedes/he.a.m2:heAU.GynaikesAkoutisthite.name
ltx/en_us_dedes/me.m08.d24:alt1.meMA.ExapTheotokion.mode	@ltx/en_us_dedes/miscellanea:misc.Mode2
ltx/en_us_dedes/me.m08.d24:alt1.meMA.ExapTheotokion.text	
ltx/en_us_dedes/me.m08.d24:alt1.meMA.Exaposteilarion1.greekmelody	@ltx/en_us_dedes/he.a.m2:heAU.GynaikesAkoutisthite.greekname
ltx/en_us_dedes/me.m08.d24:alt1.meMA.Exaposteilarion1.incipit	…
ltx/en_us_dedes/me.m08.d24:alt1.meMA.Exaposteilarion1.melody	@ltx/en_us_dedes/he.a.m2:heAU.GynaikesAkoutisthite.name
ltx/en_us_dedes/me.m08.d24:alt1.meMA.Exaposteilarion1.mode	@ltx/en_us_dedes/miscellanea:misc.Mode2
ltx/en_us_dedes/me.m08.d24:alt1.meMA.Exaposteilarion1.text	
ltx/en_us_dedes/me.m08.d24:alt1.meMA.Kathisma11.greekmelody	@ltx/en_us_dedes/he.a.m1:heAU.TonTafonSouSotir.greekname
ltx/en_us_dedes/me.m08.d24:alt1.meMA.Kathisma11.incipit	…
ltx/en_us_dedes/me.m08.d24:alt1.meMA.Kathisma11.melody	@ltx/en_us_dedes/he.a.m1:heAU.TonTafonSouSotir.name
ltx/en_us_dedes/me.m08.d24:alt1.meMA.Kathisma11.mode	@ltx/en_us_dedes/miscellanea:misc.Mode1
ltx/en_us_dedes/me.m08.d24:alt1.meMA.Kathisma11.text	
ltx/en_us_dedes/me.m08.d24:alt1.meMA.Kathisma1T.greekmelody	@ltx/en_us_dedes/he.a.m1:heAU.TonTafonSouSotir.greekname
ltx/en_us_dedes/me.m08.d24:alt1.meMA.Kathisma1T.incipit	…
ltx/en_us_dedes/me.m08.d24:alt1.meMA.Kathisma1T.melody	@ltx/en_us_dedes/he.a.m1:heAU.TonTafonSouSotir.name
ltx/en_us_dedes/me.m08.d24:alt1.meMA.Kathisma1T.mode	@ltx/en_us_dedes/miscellanea:misc.Mode1
ltx/en_us_dedes/me.m08.d24:alt1.meMA.Kathisma1T.text	
ltx/en_us_dedes/me.m08.d24:alt1.meMA.Kathisma21.greekmelody	@ltx/en_us_dedes/he.a.m4:heAU.OYpsotheisEnToStavro.greekname
ltx/en_us_dedes/me.m08.d24:alt1.meMA.Kathisma21.incipit	…
ltx/en_us_dedes/me.m08.d24:alt1.meMA.Kathisma21.melody	@ltx/en_us_dedes/he.a.m4:heAU.OYpsotheisEnToStavro.name
ltx/en_us_dedes/me.m08.d24:alt1.meMA.Kathisma21.mode	@ltx/en_us_dedes/miscellanea:misc.Mode4
ltx/en_us_dedes/me.m08.d24:alt1.meMA.Kathisma21.text	
ltx/en_us_dedes/me.m08.d24:alt1.meMA.Kathisma2T.greekmelody	@ltx/en_us_dedes/he.a.m4:heAU.OYpsotheisEnToStavro.greekname
ltx/en_us_dedes/me.m08.d24:alt1.meMA.Kathisma2T.incipit	…
ltx/en_us_dedes/me.m08.d24:alt1.meMA.Kathisma2T.melody	@ltx/en_us_dedes/he.a.m4:heAU.OYpsotheisEnToStavro.name
ltx/en_us_dedes/me.m08.d24:alt1.meMA.Kathisma2T.mode	@ltx/en_us_dedes/miscellanea:misc.Mode4
ltx/en_us_dedes/me.m08.d24:alt1.meMA.Kathisma2T.text	
ltx/en_us_dedes/me.m08.d24:alt1.meMA.Kathisma31.greekmelody	@ltx/en_us_dedes/he.a.m4:heAU.TachyProkatalave.greekname
ltx/en_us_dedes/me.m08.d24:alt1.meMA.Kathisma31.incipit	…
ltx/en_us_dedes/me.m08.d24:alt1.meMA.Kathisma31.melody	@ltx/en_us_dedes/he.a.m4:heAU.TachyProkatalave.name
ltx/en_us_dedes/me.m08.d24:alt1.meMA.Kathisma31.mode	@ltx/en_us_dedes/miscellanea:misc.Mode4
ltx/en_us_dedes/me.m08.d24:alt1.meMA.Kathisma31.text	
ltx/en_us_dedes/me.m08.d24:alt1.meMA.Kathisma3T.greekmelody	@ltx/en_us_dedes/he.a.m4:heAU.TachyProkatalave.greekname
ltx/en_us_dedes/me.m08.d24:alt1.meMA.Kathisma3T.incipit	…
ltx/en_us_dedes/me.m08.d24:alt1.meMA.Kathisma3T.melody	@ltx/en_us_dedes/he.a.m4:heAU.TachyProkatalave.name
ltx/en_us_dedes/me.m08.d24:alt1.meMA.Kathisma3T.mode	@ltx/en_us_dedes/miscellanea:misc.Mode4
ltx/en_us_dedes/me.m08.d24:alt1.meMA.Kathisma3T.text	
ltx/en_us_dedes/me.m08.d24:alt1.meMA.Kontakion1.greekmelody	@ltx/en_us_dedes/he.a.m4:heAU.EpefanisSimeron.greekname
ltx/en_us_dedes/me.m08.d24:alt1.meMA.Kontakion1.incipit	…
ltx/en_us_dedes/me.m08.d24:alt1.meMA.Kontakion1.melody	@ltx/en_us_dedes/he.a.m4:heAU.EpefanisSimeron.name
ltx/en_us_dedes/me.m08.d24:alt1.meMA.Kontakion1.mode	@ltx/en_us_dedes/miscellanea:misc.Mode4
ltx/en_us_dedes/me.m08.d24:alt1.meMA.Kontakion1.text	
ltx/en_us_dedes/me.m08.d24:alt1.meMA.Lauds1.greekmelody	@ltx/en_us_dedes/he.a.m1:heAU.TonOuranionTagmaton.greekname
ltx/en_us_dedes/me.m08.d24:alt1.meMA.Lauds1.incipit	…
ltx/en_us_dedes/me.m08.d24:alt1.meMA.Lauds1.melody	@ltx/en_us_dedes/he.a.m1:heAU.TonOuranionTagmaton.name
ltx/en_us_dedes/me.m08.d24:alt1.meMA.Lauds1.mode	@ltx/en_us_dedes/miscellanea:misc.Mode1
ltx/en_us_dedes/me.m08.d24:alt1.meMA.Lauds1.text	
ltx/en_us_dedes/me.m08.d24:alt1.meMA.Lauds2.incipit	…
ltx/en_us_dedes/me.m08.d24:alt1.meMA.Lauds2.melody	@ltx/en_us_dedes/he.a.m1:heAU.TonOuranionTagmaton.name
ltx/en_us_dedes/me.m08.d24:alt1.meMA.Lauds2.mode	@ltx/en_us_dedes/miscellanea:misc.Mode1
ltx/en_us_dedes/me.m08.d24:alt1.meMA.Lauds2.text	
ltx/en_us_dedes/me.m08.d24:alt1.meMA.Lauds3.incipit	…
ltx/en_us_dedes/me.m08.d24:alt1.meMA.Lauds3.melody	@ltx/en_us_dedes/he.a.m1:heAU.TonOuranionTagmaton.name
ltx/en_us_dedes/me.m08.d24:alt1.meMA.Lauds3.mode	@ltx/en_us_dedes/miscellanea:misc.Mode1
ltx/en_us_dedes/me.m08.d24:alt1.meMA.Lauds3.text	
ltx/en_us_dedes/me.m08.d24:alt1.meMA.Lauds4.incipit	…
ltx/en_us_dedes/me.m08.d24:alt1.meMA.Lauds4.melody	@ltx/en_us_dedes/he.a.m1:heAU.TonOuranionTagmaton.name
ltx/en_us_dedes/me.m08.d24:alt1.meMA.Lauds4.mode	@ltx/en_us_dedes/miscellanea:misc.Mode1
ltx/en_us_dedes/me.m08.d24:alt1.meMA.Lauds4.text	
ltx/en_us_dedes/me.m08.d24:alt1.meMA.LaudsGlory.incipit	…
ltx/en_us_dedes/me.m08.d24:alt1.meMA.LaudsGlory.melody	
ltx/en_us_dedes/me.m08.d24:alt1.meMA.LaudsGlory.mode	@ltx/en_us_dedes/miscellanea:misc.Mode5
ltx/en_us_dedes/me.m08.d24:alt1.meMA.LaudsGlory.text	
ltx/en_us_dedes/me.m08.d24:alt1.meMA.LaudsTheotokion.incipit	@ltx/en_us_dedes/oc.m5.d3:ocVE.AposTheotokion.incipit
ltx/en_us_dedes/me.m08.d24:alt1.meMA.LaudsTheotokion.melody	
ltx/en_us_dedes/me.m08.d24:alt1.meMA.LaudsTheotokion.mode	@ltx/en_us_dedes/miscellanea:misc.Mode5
ltx/en_us_dedes/me.m08.d24:alt1.meMA.LaudsTheotokion.text	@ltx/en_us_dedes/oc.m5.d3:ocVE.AposTheotokion.text
ltx/en_us_dedes/me.m08.d24:alt1.meMA.MM.LaudsSunday.text	@ltx/en_us_dedes/properties:media.key
ltx/en_us_dedes/me.m08.d24:alt1.meMA.Ode1C11.greekmelody	@ltx/en_us_dedes/he.h.m4:heHE.AnoixoToStomaMou.greekname
ltx/en_us_dedes/me.m08.d24:alt1.meMA.Ode1C11.incipit	…
ltx/en_us_dedes/me.m08.d24:alt1.meMA.Ode1C11.melody	@ltx/en_us_dedes/he.h.m4:heHE.AnoixoToStomaMou.name
ltx/en_us_dedes/me.m08.d24:alt1.meMA.Ode1C11.mode	@ltx/en_us_dedes/miscellanea:misc.Mode4
ltx/en_us_dedes/me.m08.d24:alt1.meMA.Ode1C11.ode	@ltx/en_us_dedes/miscellanea:misc.Ode1
ltx/en_us_dedes/me.m08.d24:alt1.meMA.Ode1C11.text	
ltx/en_us_dedes/me.m08.d24:alt1.meMA.Ode1C12.incipit	…
ltx/en_us_dedes/me.m08.d24:alt1.meMA.Ode1C12.melody	@ltx/en_us_dedes/he.h.m4:heHE.AnoixoToStomaMou.name
ltx/en_us_dedes/me.m08.d24:alt1.meMA.Ode1C12.mode	@ltx/en_us_dedes/miscellanea:misc.Mode4
ltx/en_us_dedes/me.m08.d24:alt1.meMA.Ode1C12.ode	@ltx/en_us_dedes/miscellanea:misc.Ode1
ltx/en_us_dedes/me.m08.d24:alt1.meMA.Ode1C12.text	
ltx/en_us_dedes/me.m08.d24:alt1.meMA.Ode1C13.incipit	…
ltx/en_us_dedes/me.m08.d24:alt1.meMA.Ode1C13.melody	@ltx/en_us_dedes/he.h.m4:heHE.AnoixoToStomaMou.name
ltx/en_us_dedes/me.m08.d24:alt1.meMA.Ode1C13.mode	@ltx/en_us_dedes/miscellanea:misc.Mode4
ltx/en_us_dedes/me.m08.d24:alt1.meMA.Ode1C13.ode	@ltx/en_us_dedes/miscellanea:misc.Ode1
ltx/en_us_dedes/me.m08.d24:alt1.meMA.Ode1C13.text	
ltx/en_us_dedes/me.m08.d24:alt1.meMA.Ode1C1T.incipit	…
ltx/en_us_dedes/me.m08.d24:alt1.meMA.Ode1C1T.melody	@ltx/en_us_dedes/he.h.m4:heHE.AnoixoToStomaMou.name
ltx/en_us_dedes/me.m08.d24:alt1.meMA.Ode1C1T.mode	@ltx/en_us_dedes/miscellanea:misc.Mode4
ltx/en_us_dedes/me.m08.d24:alt1.meMA.Ode1C1T.ode	@ltx/en_us_dedes/miscellanea:misc.Ode1
ltx/en_us_dedes/me.m08.d24:alt1.meMA.Ode1C1T.text	
ltx/en_us_dedes/me.m08.d24:alt1.meMA.Ode3C11.greekmelody	@ltx/en_us_dedes/he.h.m4:heHE.TousSousYmnologous.greekname
ltx/en_us_dedes/me.m08.d24:alt1.meMA.Ode3C11.incipit	…
ltx/en_us_dedes/me.m08.d24:alt1.meMA.Ode3C11.melody	@ltx/en_us_dedes/he.h.m4:heHE.TousSousYmnologous.name
ltx/en_us_dedes/me.m08.d24:alt1.meMA.Ode3C11.mode	@ltx/en_us_dedes/miscellanea:misc.Mode4
ltx/en_us_dedes/me.m08.d24:alt1.meMA.Ode3C11.ode	@ltx/en_us_dedes/miscellanea:misc.Ode3
ltx/en_us_dedes/me.m08.d24:alt1.meMA.Ode3C11.text	
ltx/en_us_dedes/me.m08.d24:alt1.meMA.Ode3C12.incipit	…
ltx/en_us_dedes/me.m08.d24:alt1.meMA.Ode3C12.melody	@ltx/en_us_dedes/he.h.m4:heHE.TousSousYmnologous.name
ltx/en_us_dedes/me.m08.d24:alt1.meMA.Ode3C12.mode	@ltx/en_us_dedes/miscellanea:misc.Mode4
ltx/en_us_dedes/me.m08.d24:alt1.meMA.Ode3C12.ode	@ltx/en_us_dedes/miscellanea:misc.Ode3
ltx/en_us_dedes/me.m08.d24:alt1.meMA.Ode3C12.text	
ltx/en_us_dedes/me.m08.d24:alt1.meMA.Ode3C13.incipit	…
ltx/en_us_dedes/me.m08.d24:alt1.meMA.Ode3C13.melody	@ltx/en_us_dedes/he.h.m4:heHE.TousSousYmnologous.name
ltx/en_us_dedes/me.m08.d24:alt1.meMA.Ode3C13.mode	@ltx/en_us_dedes/miscellanea:misc.Mode4
ltx/en_us_dedes/me.m08.d24:alt1.meMA.Ode3C13.ode	@ltx/en_us_dedes/miscellanea:misc.Ode3
ltx/en_us_dedes/me.m08.d24:alt1.meMA.Ode3C13.text	
ltx/en_us_dedes/me.m08.d24:alt1.meMA.Ode3C1T.incipit	…
ltx/en_us_dedes/me.m08.d24:alt1.meMA.Ode3C1T.melody	@ltx/en_us_dedes/he.h.m4:heHE.TousSousYmnologous.name
ltx/en_us_dedes/me.m08.d24:alt1.meMA.Ode3C1T.mode	@ltx/en_us_dedes/miscellanea:misc.Mode4
ltx/en_us_dedes/me.m08.d24:alt1.meMA.Ode3C1T.ode	@ltx/en_us_dedes/miscellanea:misc.Ode3
ltx/en_us_dedes/me.m08.d24:alt1.meMA.Ode3C1T.text	
ltx/en_us_dedes/me.m08.d24:alt1.meMA.Ode3Kathisma1.greekmelody	@ltx/en_us_dedes/he.a.m4:heAU.TachyProkatalave.greekname
ltx/en_us_dedes/me.m08.d24:alt1.meMA.Ode3Kathisma1.incipit	…
ltx/en_us_dedes/me.m08.d24:alt1.meMA.Ode3Kathisma1.melody	@ltx/en_us_dedes/he.a.m4:heAU.TachyProkatalave.name
ltx/en_us_dedes/me.m08.d24:alt1.meMA.Ode3Kathisma1.mode	@ltx/en_us_dedes/miscellanea:misc.Mode4
ltx/en_us_dedes/me.m08.d24:alt1.meMA.Ode3Kathisma1.text	
ltx/en_us_dedes/me.m08.d24:alt1.meMA.Ode3KathismaT.incipit	…
ltx/en_us_dedes/me.m08.d24:alt1.meMA.Ode3KathismaT.melody	@ltx/en_us_dedes/he.a.m4:heAU.TachyProkatalave.name
ltx/en_us_dedes/me.m08.d24:alt1.meMA.Ode3KathismaT.mode	@ltx/en_us_dedes/miscellanea:misc.Mode4
ltx/en_us_dedes/me.m08.d24:alt1.meMA.Ode3KathismaT.text	
ltx/en_us_dedes/me.m08.d24:alt1.meMA.Ode4C11.greekmelody	@ltx/en_us_dedes/he.h.m4:heHE.OKathimenosEnDoxi.greekname
ltx/en_us_dedes/me.m08.d24:alt1.meMA.Ode4C11.incipit	…
ltx/en_us_dedes/me.m08.d24:alt1.meMA.Ode4C11.melody	@ltx/en_us_dedes/he.h.m4:heHE.OKathimenosEnDoxi.name
ltx/en_us_dedes/me.m08.d24:alt1.meMA.Ode4C11.mode	@ltx/en_us_dedes/miscellanea:misc.Mode4
ltx/en_us_dedes/me.m08.d24:alt1.meMA.Ode4C11.ode	@ltx/en_us_dedes/miscellanea:misc.Ode4
ltx/en_us_dedes/me.m08.d24:alt1.meMA.Ode4C11.text	
ltx/en_us_dedes/me.m08.d24:alt1.meMA.Ode4C12.incipit	…
ltx/en_us_dedes/me.m08.d24:alt1.meMA.Ode4C12.melody	@ltx/en_us_dedes/he.h.m4:heHE.OKathimenosEnDoxi.name
ltx/en_us_dedes/me.m08.d24:alt1.meMA.Ode4C12.mode	@ltx/en_us_dedes/miscellanea:misc.Mode4
ltx/en_us_dedes/me.m08.d24:alt1.meMA.Ode4C12.ode	@ltx/en_us_dedes/miscellanea:misc.Ode4
ltx/en_us_dedes/me.m08.d24:alt1.meMA.Ode4C12.text	
ltx/en_us_dedes/me.m08.d24:alt1.meMA.Ode4C13.incipit	…
ltx/en_us_dedes/me.m08.d24:alt1.meMA.Ode4C13.melody	@ltx/en_us_dedes/he.h.m4:heHE.OKathimenosEnDoxi.name
ltx/en_us_dedes/me.m08.d24:alt1.meMA.Ode4C13.mode	@ltx/en_us_dedes/miscellanea:misc.Mode4
ltx/en_us_dedes/me.m08.d24:alt1.meMA.Ode4C13.ode	@ltx/en_us_dedes/miscellanea:misc.Ode4
ltx/en_us_dedes/me.m08.d24:alt1.meMA.Ode4C13.text	
ltx/en_us_dedes/me.m08.d24:alt1.meMA.Ode4C1T.incipit	…
ltx/en_us_dedes/me.m08.d24:alt1.meMA.Ode4C1T.melody	@ltx/en_us_dedes/he.h.m4:heHE.OKathimenosEnDoxi.name
ltx/en_us_dedes/me.m08.d24:alt1.meMA.Ode4C1T.mode	@ltx/en_us_dedes/miscellanea:misc.Mode4
ltx/en_us_dedes/me.m08.d24:alt1.meMA.Ode4C1T.ode	@ltx/en_us_dedes/miscellanea:misc.Ode4
ltx/en_us_dedes/me.m08.d24:alt1.meMA.Ode4C1T.text	
ltx/en_us_dedes/me.m08.d24:alt1.meMA.Ode5C11.greekmelody	@ltx/en_us_dedes/he.h.m4:heHE.ExestiTaSympanta.greekname
ltx/en_us_dedes/me.m08.d24:alt1.meMA.Ode5C11.incipit	…
ltx/en_us_dedes/me.m08.d24:alt1.meMA.Ode5C11.melody	@ltx/en_us_dedes/he.h.m4:heHE.ExestiTaSympanta.name
ltx/en_us_dedes/me.m08.d24:alt1.meMA.Ode5C11.mode	@ltx/en_us_dedes/miscellanea:misc.Mode4
ltx/en_us_dedes/me.m08.d24:alt1.meMA.Ode5C11.ode	@ltx/en_us_dedes/miscellanea:misc.Ode5
ltx/en_us_dedes/me.m08.d24:alt1.meMA.Ode5C11.text	
ltx/en_us_dedes/me.m08.d24:alt1.meMA.Ode5C12.incipit	…
ltx/en_us_dedes/me.m08.d24:alt1.meMA.Ode5C12.melody	@ltx/en_us_dedes/he.h.m4:heHE.ExestiTaSympanta.name
ltx/en_us_dedes/me.m08.d24:alt1.meMA.Ode5C12.mode	@ltx/en_us_dedes/miscellanea:misc.Mode4
ltx/en_us_dedes/me.m08.d24:alt1.meMA.Ode5C12.ode	@ltx/en_us_dedes/miscellanea:misc.Ode5
ltx/en_us_dedes/me.m08.d24:alt1.meMA.Ode5C12.text	
ltx/en_us_dedes/me.m08.d24:alt1.meMA.Ode5C13.incipit	…
ltx/en_us_dedes/me.m08.d24:alt1.meMA.Ode5C13.melody	@ltx/en_us_dedes/he.h.m4:heHE.ExestiTaSympanta.name
ltx/en_us_dedes/me.m08.d24:alt1.meMA.Ode5C13.mode	@ltx/en_us_dedes/miscellanea:misc.Mode4
ltx/en_us_dedes/me.m08.d24:alt1.meMA.Ode5C13.ode	@ltx/en_us_dedes/miscellanea:misc.Ode5
ltx/en_us_dedes/me.m08.d24:alt1.meMA.Ode5C13.text	
ltx/en_us_dedes/me.m08.d24:alt1.meMA.Ode5C1T.incipit	…
ltx/en_us_dedes/me.m08.d24:alt1.meMA.Ode5C1T.melody	@ltx/en_us_dedes/he.h.m4:heHE.ExestiTaSympanta.name
ltx/en_us_dedes/me.m08.d24:alt1.meMA.Ode5C1T.mode	@ltx/en_us_dedes/miscellanea:misc.Mode4
ltx/en_us_dedes/me.m08.d24:alt1.meMA.Ode5C1T.ode	@ltx/en_us_dedes/miscellanea:misc.Ode5
ltx/en_us_dedes/me.m08.d24:alt1.meMA.Ode5C1T.text	
ltx/en_us_dedes/me.m08.d24:alt1.meMA.Ode6C11.greekmelody	@ltx/en_us_dedes/he.h.m4:heHE.TinTheianTaftin.greekname
ltx/en_us_dedes/me.m08.d24:alt1.meMA.Ode6C11.incipit	…
ltx/en_us_dedes/me.m08.d24:alt1.meMA.Ode6C11.melody	@ltx/en_us_dedes/he.h.m4:heHE.TinTheianTaftin.name
ltx/en_us_dedes/me.m08.d24:alt1.meMA.Ode6C11.mode	@ltx/en_us_dedes/miscellanea:misc.Mode4
ltx/en_us_dedes/me.m08.d24:alt1.meMA.Ode6C11.ode	@ltx/en_us_dedes/miscellanea:misc.Ode6
ltx/en_us_dedes/me.m08.d24:alt1.meMA.Ode6C11.text	
ltx/en_us_dedes/me.m08.d24:alt1.meMA.Ode6C12.incipit	…
ltx/en_us_dedes/me.m08.d24:alt1.meMA.Ode6C12.melody	@ltx/en_us_dedes/he.h.m4:heHE.TinTheianTaftin.name
ltx/en_us_dedes/me.m08.d24:alt1.meMA.Ode6C12.mode	@ltx/en_us_dedes/miscellanea:misc.Mode4
ltx/en_us_dedes/me.m08.d24:alt1.meMA.Ode6C12.ode	@ltx/en_us_dedes/miscellanea:misc.Ode6
ltx/en_us_dedes/me.m08.d24:alt1.meMA.Ode6C12.text	
ltx/en_us_dedes/me.m08.d24:alt1.meMA.Ode6C13.incipit	…
ltx/en_us_dedes/me.m08.d24:alt1.meMA.Ode6C13.melody	@ltx/en_us_dedes/he.h.m4:heHE.TinTheianTaftin.name
ltx/en_us_dedes/me.m08.d24:alt1.meMA.Ode6C13.mode	@ltx/en_us_dedes/miscellanea:misc.Mode4
ltx/en_us_dedes/me.m08.d24:alt1.meMA.Ode6C13.ode	@ltx/en_us_dedes/miscellanea:misc.Ode6
ltx/en_us_dedes/me.m08.d24:alt1.meMA.Ode6C13.text	
ltx/en_us_dedes/me.m08.d24:alt1.meMA.Ode6C1T.incipit	…
ltx/en_us_dedes/me.m08.d24:alt1.meMA.Ode6C1T.melody	@ltx/en_us_dedes/he.h.m4:heHE.TinTheianTaftin.name
ltx/en_us_dedes/me.m08.d24:alt1.meMA.Ode6C1T.mode	@ltx/en_us_dedes/miscellanea:misc.Mode4
ltx/en_us_dedes/me.m08.d24:alt1.meMA.Ode6C1T.ode	@ltx/en_us_dedes/miscellanea:misc.Ode6
ltx/en_us_dedes/me.m08.d24:alt1.meMA.Ode6C1T.text	
ltx/en_us_dedes/me.m08.d24:alt1.meMA.Ode7C11.greekmelody	@ltx/en_us_dedes/he.h.m4:heHE.OukElatrefsan.greekname
ltx/en_us_dedes/me.m08.d24:alt1.meMA.Ode7C11.incipit	…
ltx/en_us_dedes/me.m08.d24:alt1.meMA.Ode7C11.melody	@ltx/en_us_dedes/he.h.m4:heHE.OukElatrefsan.name
ltx/en_us_dedes/me.m08.d24:alt1.meMA.Ode7C11.mode	@ltx/en_us_dedes/miscellanea:misc.Mode4
ltx/en_us_dedes/me.m08.d24:alt1.meMA.Ode7C11.ode	@ltx/en_us_dedes/miscellanea:misc.Ode7
ltx/en_us_dedes/me.m08.d24:alt1.meMA.Ode7C11.text	
ltx/en_us_dedes/me.m08.d24:alt1.meMA.Ode7C12.incipit	…
ltx/en_us_dedes/me.m08.d24:alt1.meMA.Ode7C12.melody	@ltx/en_us_dedes/he.h.m4:heHE.OukElatrefsan.name
ltx/en_us_dedes/me.m08.d24:alt1.meMA.Ode7C12.mode	@ltx/en_us_dedes/miscellanea:misc.Mode4
ltx/en_us_dedes/me.m08.d24:alt1.meMA.Ode7C12.ode	@ltx/en_us_dedes/miscellanea:misc.Ode7
ltx/en_us_dedes/me.m08.d24:alt1.meMA.Ode7C12.text	
ltx/en_us_dedes/me.m08.d24:alt1.meMA.Ode7C13.incipit	…
ltx/en_us_dedes/me.m08.d24:alt1.meMA.Ode7C13.melody	@ltx/en_us_dedes/he.h.m4:heHE.OukElatrefsan.name
ltx/en_us_dedes/me.m08.d24:alt1.meMA.Ode7C13.mode	@ltx/en_us_dedes/miscellanea:misc.Mode4
ltx/en_us_dedes/me.m08.d24:alt1.meMA.Ode7C13.ode	@ltx/en_us_dedes/miscellanea:misc.Ode7
ltx/en_us_dedes/me.m08.d24:alt1.meMA.Ode7C13.text	
ltx/en_us_dedes/me.m08.d24:alt1.meMA.Ode7C1T.incipit	…
ltx/en_us_dedes/me.m08.d24:alt1.meMA.Ode7C1T.melody	@ltx/en_us_dedes/he.h.m4:heHE.OukElatrefsan.name
ltx/en_us_dedes/me.m08.d24:alt1.meMA.Ode7C1T.mode	@ltx/en_us_dedes/miscellanea:misc.Mode4
ltx/en_us_dedes/me.m08.d24:alt1.meMA.Ode7C1T.ode	@ltx/en_us_dedes/miscellanea:misc.Ode7
ltx/en_us_dedes/me.m08.d24:alt1.meMA.Ode7C1T.text	
ltx/en_us_dedes/me.m08.d24:alt1.meMA.Ode8C11.greekmelody	@ltx/en_us_dedes/he.h.m4:heHE.PaidasEvageis.greekname
ltx/en_us_dedes/me.m08.d24:alt1.meMA.Ode8C11.incipit	…
ltx/en_us_dedes/me.m08.d24:alt1.meMA.Ode8C11.melody	@ltx/en_us_dedes/he.h.m4:heHE.PaidasEvageis.name
ltx/en_us_dedes/me.m08.d24:alt1.meMA.Ode8C11.mode	@ltx/en_us_dedes/miscellanea:misc.Mode4
ltx/en_us_dedes/me.m08.d24:alt1.meMA.Ode8C11.ode	@ltx/en_us_dedes/miscellanea:misc.Ode8
ltx/en_us_dedes/me.m08.d24:alt1.meMA.Ode8C11.text	
ltx/en_us_dedes/me.m08.d24:alt1.meMA.Ode8C12.incipit	…
ltx/en_us_dedes/me.m08.d24:alt1.meMA.Ode8C12.melody	@ltx/en_us_dedes/he.h.m4:heHE.PaidasEvageis.name
ltx/en_us_dedes/me.m08.d24:alt1.meMA.Ode8C12.mode	@ltx/en_us_dedes/miscellanea:misc.Mode4
ltx/en_us_dedes/me.m08.d24:alt1.meMA.Ode8C12.ode	@ltx/en_us_dedes/miscellanea:misc.Ode8
ltx/en_us_dedes/me.m08.d24:alt1.meMA.Ode8C12.text	
ltx/en_us_dedes/me.m08.d24:alt1.meMA.Ode8C13.incipit	…
ltx/en_us_dedes/me.m08.d24:alt1.meMA.Ode8C13.melody	@ltx/en_us_dedes/he.h.m4:heHE.PaidasEvageis.name
ltx/en_us_dedes/me.m08.d24:alt1.meMA.Ode8C13.mode	@ltx/en_us_dedes/miscellanea:misc.Mode4
ltx/en_us_dedes/me.m08.d24:alt1.meMA.Ode8C13.ode	@ltx/en_us_dedes/miscellanea:misc.Ode8
ltx/en_us_dedes/me.m08.d24:alt1.meMA.Ode8C13.text	
ltx/en_us_dedes/me.m08.d24:alt1.meMA.Ode8C1T.incipit	…
ltx/en_us_dedes/me.m08.d24:alt1.meMA.Ode8C1T.melody	@ltx/en_us_dedes/he.h.m4:heHE.PaidasEvageis.name
ltx/en_us_dedes/me.m08.d24:alt1.meMA.Ode8C1T.mode	@ltx/en_us_dedes/miscellanea:misc.Mode4
ltx/en_us_dedes/me.m08.d24:alt1.meMA.Ode8C1T.ode	@ltx/en_us_dedes/miscellanea:misc.Ode8
ltx/en_us_dedes/me.m08.d24:alt1.meMA.Ode8C1T.text	
ltx/en_us_dedes/me.m08.d24:alt1.meMA.Ode9C11.greekmelody	@ltx/en_us_dedes/he.h.m4:heHE.ApasGigenis.greekname
ltx/en_us_dedes/me.m08.d24:alt1.meMA.Ode9C11.incipit	…
ltx/en_us_dedes/me.m08.d24:alt1.meMA.Ode9C11.melody	@ltx/en_us_dedes/he.h.m4:heHE.ApasGigenis.name
ltx/en_us_dedes/me.m08.d24:alt1.meMA.Ode9C11.mode	@ltx/en_us_dedes/miscellanea:misc.Mode4
ltx/en_us_dedes/me.m08.d24:alt1.meMA.Ode9C11.ode	@ltx/en_us_dedes/miscellanea:misc.Ode9
ltx/en_us_dedes/me.m08.d24:alt1.meMA.Ode9C11.text	
ltx/en_us_dedes/me.m08.d24:alt1.meMA.Ode9C12.incipit	…
ltx/en_us_dedes/me.m08.d24:alt1.meMA.Ode9C12.melody	@ltx/en_us_dedes/he.h.m4:heHE.ApasGigenis.name
ltx/en_us_dedes/me.m08.d24:alt1.meMA.Ode9C12.mode	@ltx/en_us_dedes/miscellanea:misc.Mode4
ltx/en_us_dedes/me.m08.d24:alt1.meMA.Ode9C12.ode	@ltx/en_us_dedes/miscellanea:misc.Ode9
ltx/en_us_dedes/me.m08.d24:alt1.meMA.Ode9C12.text	
ltx/en_us_dedes/me.m08.d24:alt1.meMA.Ode9C13.incipit	…
ltx/en_us_dedes/me.m08.d24:alt1.meMA.Ode9C13.melody	@ltx/en_us_dedes/he.h.m4:heHE.ApasGigenis.name
ltx/en_us_dedes/me.m08.d24:alt1.meMA.Ode9C13.mode	@ltx/en_us_dedes/miscellanea:misc.Mode4
ltx/en_us_dedes/me.m08.d24:alt1.meMA.Ode9C13.ode	@ltx/en_us_dedes/miscellanea:misc.Ode9
ltx/en_us_dedes/me.m08.d24:alt1.meMA.Ode9C13.text	
ltx/en_us_dedes/me.m08.d24:alt1.meMA.Ode9C1T.incipit	…
ltx/en_us_dedes/me.m08.d24:alt1.meMA.Ode9C1T.melody	@ltx/en_us_dedes/he.h.m4:heHE.ApasGigenis.name
ltx/en_us_dedes/me.m08.d24:alt1.meMA.Ode9C1T.mode	@ltx/en_us_dedes/miscellanea:misc.Mode4
ltx/en_us_dedes/me.m08.d24:alt1.meMA.Ode9C1T.ode	@ltx/en_us_dedes/miscellanea:misc.Ode9
ltx/en_us_dedes/me.m08.d24:alt1.meMA.Ode9C1T.text	
ltx/en_us_dedes/me.m08.d24:alt1.meMA.Oikos1.text	
ltx/en_us_dedes/me.m08.d24:alt1.meMA.PostGospelBoth.incipit	@ltx/en_us_dedes/ho.ho03:hoMA.PostGospelTheotokos.incipit
ltx/en_us_dedes/me.m08.d24:alt1.meMA.PostGospelBoth.melody	
ltx/en_us_dedes/me.m08.d24:alt1.meMA.PostGospelBoth.mode	@ltx/en_us_dedes/miscellanea:misc.Mode2
ltx/en_us_dedes/me.m08.d24:alt1.meMA.PostGospelBoth.text	@ltx/en_us_dedes/ho.ho03:hoMA.PostGospelTheotokos.text
ltx/en_us_dedes/me.m08.d24:alt1.meMA.PostGospelGlory.incipit	@ltx/en_us_dedes/ho.ho03:hoMA.PostGospelTeacher.incipit
ltx/en_us_dedes/me.m08.d24:alt1.meMA.PostGospelGlory.melody	
ltx/en_us_dedes/me.m08.d24:alt1.meMA.PostGospelGlory.mode	@ltx/en_us_dedes/miscellanea:misc.Mode2
ltx/en_us_dedes/me.m08.d24:alt1.meMA.PostGospelGlory.text	@ltx/en_us_dedes/ho.ho03:hoMA.PostGospelTeacher.text
ltx/en_us_dedes/me.m08.d24:alt1.meMA.PostGospelIdiomelon.incipit	…
ltx/en_us_dedes/me.m08.d24:alt1.meMA.PostGospelIdiomelon.melody	
ltx/en_us_dedes/me.m08.d24:alt1.meMA.PostGospelIdiomelon.mode	@ltx/en_us_dedes/miscellanea:misc.Mode6
ltx/en_us_dedes/me.m08.d24:alt1.meMA.PostGospelIdiomelon.text	
ltx/en_us_dedes/me.m08.d24:alt1.meVE.Apolytikion1.greekmelody	@ltx/en_us_dedes/he.a.m3:heAU.TheiasPisteos.greekname
ltx/en_us_dedes/me.m08.d24:alt1.meVE.Apolytikion1.incipit	…
ltx/en_us_dedes/me.m08.d24:alt1.meVE.Apolytikion1.melody	@ltx/en_us_dedes/he.a.m3:heAU.TheiasPisteos.name
ltx/en_us_dedes/me.m08.d24:alt1.meVE.Apolytikion1.mode	@ltx/en_us_dedes/miscellanea:misc.Mode3
ltx/en_us_dedes/me.m08.d24:alt1.meVE.Apolytikion1.text	
ltx/en_us_dedes/me.m08.d24:alt1.meVE.AposGlory.incipit	…
ltx/en_us_dedes/me.m08.d24:alt1.meVE.AposGlory.melody	
ltx/en_us_dedes/me.m08.d24:alt1.meVE.AposGlory.mode	@ltx/en_us_dedes/miscellanea:misc.Mode8
ltx/en_us_dedes/me.m08.d24:alt1.meVE.AposGlory.text	
ltx/en_us_dedes/me.m08.d24:alt1.meVE.AposTheotokion.incipit	@ltx/en_us_dedes/oc.m8.d5:ocMA.AposTheotokion.incipit
ltx/en_us_dedes/me.m08.d24:alt1.meVE.AposTheotokion.melody	
ltx/en_us_dedes/me.m08.d24:alt1.meVE.AposTheotokion.mode	@ltx/en_us_dedes/miscellanea:misc.Mode8
ltx/en_us_dedes/me.m08.d24:alt1.meVE.AposTheotokion.text	@ltx/en_us_dedes/oc.m8.d5:ocMA.AposTheotokion.text
ltx/en_us_dedes/me.m08.d24:alt1.meVE.Aposticha1.greekmelody	@ltx/en_us_dedes/he.a.m5:heAU.ChairoisAskitikon.greekname
ltx/en_us_dedes/me.m08.d24:alt1.meVE.Aposticha1.incipit	…
ltx/en_us_dedes/me.m08.d24:alt1.meVE.Aposticha1.melody	@ltx/en_us_dedes/he.a.m5:heAU.ChairoisAskitikon.name
ltx/en_us_dedes/me.m08.d24:alt1.meVE.Aposticha1.mode	@ltx/en_us_dedes/miscellanea:misc.Mode5
ltx/en_us_dedes/me.m08.d24:alt1.meVE.Aposticha1.text	
ltx/en_us_dedes/me.m08.d24:alt1.meVE.Aposticha2.incipit	…
ltx/en_us_dedes/me.m08.d24:alt1.meVE.Aposticha2.melody	@ltx/en_us_dedes/he.a.m5:heAU.ChairoisAskitikon.name
ltx/en_us_dedes/me.m08.d24:alt1.meVE.Aposticha2.mode	@ltx/en_us_dedes/miscellanea:misc.Mode5
ltx/en_us_dedes/me.m08.d24:alt1.meVE.Aposticha2.text	
ltx/en_us_dedes/me.m08.d24:alt1.meVE.Aposticha3.incipit	…
ltx/en_us_dedes/me.m08.d24:alt1.meVE.Aposticha3.melody	@ltx/en_us_dedes/he.a.m5:heAU.ChairoisAskitikon.name
ltx/en_us_dedes/me.m08.d24:alt1.meVE.Aposticha3.mode	@ltx/en_us_dedes/miscellanea:misc.Mode5
ltx/en_us_dedes/me.m08.d24:alt1.meVE.Aposticha3.text	
ltx/en_us_dedes/me.m08.d24:alt1.meVE.Lity1.incipit	…
ltx/en_us_dedes/me.m08.d24:alt1.meVE.Lity1.melody	
ltx/en_us_dedes/me.m08.d24:alt1.meVE.Lity1.mode	@ltx/en_us_dedes/miscellanea:misc.Mode1
ltx/en_us_dedes/me.m08.d24:alt1.meVE.Lity1.text	
ltx/en_us_dedes/me.m08.d24:alt1.meVE.Lity2.incipit	…
ltx/en_us_dedes/me.m08.d24:alt1.meVE.Lity2.melody	
ltx/en_us_dedes/me.m08.d24:alt1.meVE.Lity2.mode	@ltx/en_us_dedes/miscellanea:misc.Mode2
ltx/en_us_dedes/me.m08.d24:alt1.meVE.Lity2.text	
ltx/en_us_dedes/me.m08.d24:alt1.meVE.Lity3.incipit	…
ltx/en_us_dedes/me.m08.d24:alt1.meVE.Lity3.melody	
ltx/en_us_dedes/me.m08.d24:alt1.meVE.Lity3.mode	@ltx/en_us_dedes/miscellanea:misc.Mode3
ltx/en_us_dedes/me.m08.d24:alt1.meVE.Lity3.text	
ltx/en_us_dedes/me.m08.d24:alt1.meVE.Lity4.incipit	…
ltx/en_us_dedes/me.m08.d24:alt1.meVE.Lity4.melody	
ltx/en_us_dedes/me.m08.d24:alt1.meVE.Lity4.mode	@ltx/en_us_dedes/miscellanea:misc.Mode4
ltx/en_us_dedes/me.m08.d24:alt1.meVE.Lity4.text	
ltx/en_us_dedes/me.m08.d24:alt1.meVE.LityBoth.incipit	@ltx/en_us_dedes/oc.m4.d2:ocMA.AposTheotokion.incipit
ltx/en_us_dedes/me.m08.d24:alt1.meVE.LityBoth.melody	
ltx/en_us_dedes/me.m08.d24:alt1.meVE.LityBoth.mode	@ltx/en_us_dedes/miscellanea:misc.Mode4
ltx/en_us_dedes/me.m08.d24:alt1.meVE.LityBoth.text	@ltx/en_us_dedes/oc.m4.d2:ocMA.AposTheotokion.text
ltx/en_us_dedes/me.m08.d24:alt1.meVE.LityGlory.incipit	…
ltx/en_us_dedes/me.m08.d24:alt1.meVE.LityGlory.melody	
ltx/en_us_dedes/me.m08.d24:alt1.meVE.LityGlory.mode	@ltx/en_us_dedes/miscellanea:misc.Mode4
ltx/en_us_dedes/me.m08.d24:alt1.meVE.LityGlory.text	
ltx/en_us_dedes/me.m08.d24:alt1.meVE.SticGlory.incipit	…
ltx/en_us_dedes/me.m08.d24:alt1.meVE.SticGlory.melody	
ltx/en_us_dedes/me.m08.d24:alt1.meVE.SticGlory.mode	@ltx/en_us_dedes/miscellanea:misc.Mode6
ltx/en_us_dedes/me.m08.d24:alt1.meVE.SticGlory.text	
ltx/en_us_dedes/me.m08.d24:alt1.meVE.SticTheotokion.incipit	@ltx/en_us_dedes/oc.m6.d1:ocVE.SticTheotokion.incipit
ltx/en_us_dedes/me.m08.d24:alt1.meVE.SticTheotokion.melody	
ltx/en_us_dedes/me.m08.d24:alt1.meVE.SticTheotokion.mode	@ltx/en_us_dedes/miscellanea:misc.Mode6
ltx/en_us_dedes/me.m08.d24:alt1.meVE.SticTheotokion.text	@ltx/en_us_dedes/oc.m6.d1:ocVE.SticTheotokion.text
ltx/en_us_dedes/me.m08.d24:alt1.meVE.Stichera01.greekmelody	@ltx/en_us_dedes/he.a.m4:heAU.OExYpsistouKlitheis.greekname
ltx/en_us_dedes/me.m08.d24:alt1.meVE.Stichera01.incipit	…
ltx/en_us_dedes/me.m08.d24:alt1.meVE.Stichera01.melody	@ltx/en_us_dedes/he.a.m4:heAU.OExYpsistouKlitheis.name
ltx/en_us_dedes/me.m08.d24:alt1.meVE.Stichera01.mode	@ltx/en_us_dedes/miscellanea:misc.Mode4
ltx/en_us_dedes/me.m08.d24:alt1.meVE.Stichera01.text	
ltx/en_us_dedes/me.m08.d24:alt1.meVE.Stichera02.incipit	…
ltx/en_us_dedes/me.m08.d24:alt1.meVE.Stichera02.melody	@ltx/en_us_dedes/he.a.m4:heAU.OExYpsistouKlitheis.name
ltx/en_us_dedes/me.m08.d24:alt1.meVE.Stichera02.mode	@ltx/en_us_dedes/miscellanea:misc.Mode4
ltx/en_us_dedes/me.m08.d24:alt1.meVE.Stichera02.text	
ltx/en_us_dedes/me.m08.d24:alt1.meVE.Stichera03.incipit	…
ltx/en_us_dedes/me.m08.d24:alt1.meVE.Stichera03.melody	@ltx/en_us_dedes/he.a.m4:heAU.OExYpsistouKlitheis.name
ltx/en_us_dedes/me.m08.d24:alt1.meVE.Stichera03.mode	@ltx/en_us_dedes/miscellanea:misc.Mode4
ltx/en_us_dedes/me.m08.d24:alt1.meVE.Stichera03.text	
ltx/en_us_dedes/me.m08.d24:alt1.meVE.Stichera04.greekmelody	@ltx/en_us_dedes/he.a.m4:heAU.OsGennaionEnMartysi.greekname
ltx/en_us_dedes/me.m08.d24:alt1.meVE.Stichera04.incipit	…
ltx/en_us_dedes/me.m08.d24:alt1.meVE.Stichera04.melody	@ltx/en_us_dedes/he.a.m4:heAU.OsGennaionEnMartysi.name
ltx/en_us_dedes/me.m08.d24:alt1.meVE.Stichera04.mode	@ltx/en_us_dedes/miscellanea:misc.Mode4
ltx/en_us_dedes/me.m08.d24:alt1.meVE.Stichera04.text	
ltx/en_us_dedes/me.m08.d24:alt1.meVE.Stichera05.greekmelody	@ltx/en_us_dedes/he.a.m4:heAU.OsGennaionEnMartysi.greekname
ltx/en_us_dedes/me.m08.d24:alt1.meVE.Stichera05.incipit	…
ltx/en_us_dedes/me.m08.d24:alt1.meVE.Stichera05.melody	@ltx/en_us_dedes/he.a.m4:heAU.OsGennaionEnMartysi.name
ltx/en_us_dedes/me.m08.d24:alt1.meVE.Stichera05.mode	@ltx/en_us_dedes/miscellanea:misc.Mode4
ltx/en_us_dedes/me.m08.d24:alt1.meVE.Stichera05.text	
ltx/en_us_dedes/me.m08.d24:alt1.meVE.Stichera06.incipit	…
ltx/en_us_dedes/me.m08.d24:alt1.meVE.Stichera06.melody	@ltx/en_us_dedes/he.a.m4:heAU.OsGennaionEnMartysi.name
ltx/en_us_dedes/me.m08.d24:alt1.meVE.Stichera06.mode	@ltx/en_us_dedes/miscellanea:misc.Mode4
ltx/en_us_dedes/me.m08.d24:alt1.meVE.Stichera06.text	
ltx/en_us_dedes/me.m08.d24:meDA.commemoration.first	Memory of the Holy Hieromartyr Eutyches
ltx/en_us_dedes/me.m08.d24:meDA.commemoration.first_name	
ltx/en_us_dedes/me.m08.d24:meDA.commemoration.first_short	Memory of the Holy Hieromartyr Eutyches
ltx/en_us_dedes/me.m08.d24:meDA.commemoration.first_title	@ltx/en_us_dedes/titles:ti.SaintM
ltx/en_us_dedes/me.m08.d24:meDA.commemoration.full	Memory of the Holy Hieromartyr Eutyches, Disciple of St. John the Theologian
ltx/en_us_dedes/me.m08.d24:meDA.commemoration.second_name	
ltx/en_us_dedes/me.m08.d24:meDA.commemoration.second_title	
ltx/en_us_dedes/me.m08.d24:meDA.date	August 24
ltx/en_us_dedes/me.m08.d24:meDA.fordate	for August 24
ltx/en_us_dedes/me.m08.d24:meDA.insert1	
ltx/en_us_dedes/me.m08.d24:meDA.insert2	
ltx/en_us_dedes/me.m08.d24:meDA.note	
ltx/en_us_dedes/me.m08.d24:meDA.pdfcoverdate	August 24,
ltx/en_us_dedes/me.m08.d24:meDA.pdfheaderdate	August 24
ltx/en_us_dedes/me.m08.d24:meHO.commemorations	
ltx/en_us_dedes/me.m08.d24:meHO.note1	
ltx/en_us_dedes/me.m08.d24:meHO.note2	
ltx/en_us_dedes/me.m08.d24:meHO.number	
ltx/en_us_dedes/me.m08.d24:meHO.rank	
ltx/en_us_dedes/me.m08.d24:meLE.commemoration1	
ltx/en_us_dedes/me.m08.d24:meLE.commemoration2	
ltx/en_us_dedes/me.m08.d24:meLI.Kontakion1.incipit	…
ltx/en_us_dedes/me.m08.d24:meLI.Kontakion1.melody	
ltx/en_us_dedes/me.m08.d24:meLI.Kontakion1.mode	
ltx/en_us_dedes/me.m08.d24:meLI.Kontakion1.text	
ltx/en_us_dedes/me.m08.d24:meLI.Megalynarion.text	
ltx/en_us_dedes/me.m08.d24:meMA.C1.acrostic.notice1	
ltx/en_us_dedes/me.m08.d24:meMA.C1.acrostic.text	
ltx/en_us_dedes/me.m08.d24:meMA.C1.acrostic.title	
ltx/en_us_dedes/me.m08.d24:meMA.C1.title	@ltx/en_us_dedes/titles:ti.CanonSaintM
ltx/en_us_dedes/me.m08.d24:meMA.C1.verse	@ltx/en_us_dedes/prayers:pr.verse_SaintM.text
ltx/en_us_dedes/me.m08.d24:meMA.Ode1C11.greekmelody	@ltx/en_us_dedes/he.h.m8:heHE.ArmatilatinFarao.greekname
ltx/en_us_dedes/me.m08.d24:meMA.Ode1C11.incipit	…
ltx/en_us_dedes/me.m08.d24:meMA.Ode1C11.melody	@ltx/en_us_dedes/he.h.m8:heHE.ArmatilatinFarao.name
ltx/en_us_dedes/me.m08.d24:meMA.Ode1C11.mode	@ltx/en_us_dedes/miscellanea:misc.Mode8
ltx/en_us_dedes/me.m08.d24:meMA.Ode1C11.ode	@ltx/en_us_dedes/miscellanea:misc.Ode1
ltx/en_us_dedes/me.m08.d24:meMA.Ode1C11.text	
ltx/en_us_dedes/me.m08.d24:meMA.Ode1C12.incipit	…
ltx/en_us_dedes/me.m08.d24:meMA.Ode1C12.melody	@ltx/en_us_dedes/he.h.m8:heHE.ArmatilatinFarao.name
ltx/en_us_dedes/me.m08.d24:meMA.Ode1C12.mode	@ltx/en_us_dedes/miscellanea:misc.Mode8
ltx/en_us_dedes/me.m08.d24:meMA.Ode1C12.ode	@ltx/en_us_dedes/miscellanea:misc.Ode1
ltx/en_us_dedes/me.m08.d24:meMA.Ode1C12.text	
ltx/en_us_dedes/me.m08.d24:meMA.Ode1C13.incipit	…
ltx/en_us_dedes/me.m08.d24:meMA.Ode1C13.melody	@ltx/en_us_dedes/he.h.m8:heHE.ArmatilatinFarao.name
ltx/en_us_dedes/me.m08.d24:meMA.Ode1C13.mode	@ltx/en_us_dedes/miscellanea:misc.Mode8
ltx/en_us_dedes/me.m08.d24:meMA.Ode1C13.ode	@ltx/en_us_dedes/miscellanea:misc.Ode1
ltx/en_us_dedes/me.m08.d24:meMA.Ode1C13.text	
ltx/en_us_dedes/me.m08.d24:meMA.Ode1C1T.incipit	…
ltx/en_us_dedes/me.m08.d24:meMA.Ode1C1T.melody	@ltx/en_us_dedes/he.h.m8:heHE.ArmatilatinFarao.name
ltx/en_us_dedes/me.m08.d24:meMA.Ode1C1T.mode	@ltx/en_us_dedes/miscellanea:misc.Mode8
ltx/en_us_dedes/me.m08.d24:meMA.Ode1C1T.ode	@ltx/en_us_dedes/miscellanea:misc.Ode1
ltx/en_us_dedes/me.m08.d24:meMA.Ode1C1T.text	
ltx/en_us_dedes/me.m08.d24:meMA.Ode3C11.greekmelody	@ltx/en_us_dedes/he.h.m8:heHE.OStereosasKatArchas.greekname
ltx/en_us_dedes/me.m08.d24:meMA.Ode3C11.incipit	…
ltx/en_us_dedes/me.m08.d24:meMA.Ode3C11.melody	@ltx/en_us_dedes/he.h.m8:heHE.OStereosasKatArchas.name
ltx/en_us_dedes/me.m08.d24:meMA.Ode3C11.mode	@ltx/en_us_dedes/miscellanea:misc.Mode8
ltx/en_us_dedes/me.m08.d24:meMA.Ode3C11.ode	@ltx/en_us_dedes/miscellanea:misc.Ode3
ltx/en_us_dedes/me.m08.d24:meMA.Ode3C11.text	
ltx/en_us_dedes/me.m08.d24:meMA.Ode3C12.incipit	…
ltx/en_us_dedes/me.m08.d24:meMA.Ode3C12.melody	@ltx/en_us_dedes/he.h.m8:heHE.OStereosasKatArchas.name
ltx/en_us_dedes/me.m08.d24:meMA.Ode3C12.mode	@ltx/en_us_dedes/miscellanea:misc.Mode8
ltx/en_us_dedes/me.m08.d24:meMA.Ode3C12.ode	@ltx/en_us_dedes/miscellanea:misc.Ode3
ltx/en_us_dedes/me.m08.d24:meMA.Ode3C12.text	
ltx/en_us_dedes/me.m08.d24:meMA.Ode3C13.incipit	…
ltx/en_us_dedes/me.m08.d24:meMA.Ode3C13.melody	@ltx/en_us_dedes/he.h.m8:heHE.OStereosasKatArchas.name
ltx/en_us_dedes/me.m08.d24:meMA.Ode3C13.mode	@ltx/en_us_dedes/miscellanea:misc.Mode8
ltx/en_us_dedes/me.m08.d24:meMA.Ode3C13.ode	@ltx/en_us_dedes/miscellanea:misc.Ode3
ltx/en_us_dedes/me.m08.d24:meMA.Ode3C13.text	
ltx/en_us_dedes/me.m08.d24:meMA.Ode3C1T.incipit	…
ltx/en_us_dedes/me.m08.d24:meMA.Ode3C1T.melody	@ltx/en_us_dedes/he.h.m8:heHE.OStereosasKatArchas.name
ltx/en_us_dedes/me.m08.d24:meMA.Ode3C1T.mode	@ltx/en_us_dedes/miscellanea:misc.Mode8
ltx/en_us_dedes/me.m08.d24:meMA.Ode3C1T.ode	@ltx/en_us_dedes/miscellanea:misc.Ode3
ltx/en_us_dedes/me.m08.d24:meMA.Ode3C1T.text	
ltx/en_us_dedes/me.m08.d24:meMA.Ode3H.greekmelody	@ltx/en_us_dedes/he.h.m8:heHE.OStereosasKatArchas.greekname
ltx/en_us_dedes/me.m08.d24:meMA.Ode3H.incipit	@ltx/en_us_dedes/he.h.m8:heHE.OStereosasKatArchas.incipit
ltx/en_us_dedes/me.m08.d24:meMA.Ode3H.melody	@ltx/en_us_dedes/he.h.m8:heHE.OStereosasKatArchas.melody
ltx/en_us_dedes/me.m08.d24:meMA.Ode3H.mode	@ltx/en_us_dedes/miscellanea:misc.Mode8
ltx/en_us_dedes/me.m08.d24:meMA.Ode3H.ode	@ltx/en_us_dedes/miscellanea:misc.Ode3
ltx/en_us_dedes/me.m08.d24:meMA.Ode3H.text	@ltx/en_us_dedes/he.h.m8:heHE.OStereosasKatArchas.text
ltx/en_us_dedes/me.m08.d24:meMA.Ode3Kathisma1.greekmelody	@ltx/en_us_dedes/he.a.m3:heAU.TheiasPisteos.greekname
ltx/en_us_dedes/me.m08.d24:meMA.Ode3Kathisma1.incipit	…
ltx/en_us_dedes/me.m08.d24:meMA.Ode3Kathisma1.melody	@ltx/en_us_dedes/he.a.m3:heAU.TheiasPisteos.name
ltx/en_us_dedes/me.m08.d24:meMA.Ode3Kathisma1.mode	@ltx/en_us_dedes/miscellanea:misc.Mode3
ltx/en_us_dedes/me.m08.d24:meMA.Ode3Kathisma1.text	
ltx/en_us_dedes/me.m08.d24:meMA.Ode3KathismaSt.incipit	@ltx/en_us_dedes/me.m01.d29:meMA.Ode3KathismaSt.incipit
ltx/en_us_dedes/me.m08.d24:meMA.Ode3KathismaSt.melody	@ltx/en_us_dedes/he.a.m3:heAU.TheiasPisteos.name
ltx/en_us_dedes/me.m08.d24:meMA.Ode3KathismaSt.mode	@ltx/en_us_dedes/miscellanea:misc.Mode3
ltx/en_us_dedes/me.m08.d24:meMA.Ode3KathismaSt.text	@ltx/en_us_dedes/me.m01.d29:meMA.Ode3KathismaSt.text
ltx/en_us_dedes/me.m08.d24:meMA.Ode3KathismaT.incipit	@ltx/en_us_dedes/oc.m3.d2:ocMA.Kathisma23.incipit
ltx/en_us_dedes/me.m08.d24:meMA.Ode3KathismaT.melody	@ltx/en_us_dedes/he.a.m3:heAU.TheiasPisteos.name
ltx/en_us_dedes/me.m08.d24:meMA.Ode3KathismaT.mode	@ltx/en_us_dedes/miscellanea:misc.Mode3
ltx/en_us_dedes/me.m08.d24:meMA.Ode3KathismaT.text	@ltx/en_us_dedes/oc.m3.d2:ocMA.Kathisma23.text
ltx/en_us_dedes/me.m08.d24:meMA.Ode4C11.greekmelody	@ltx/en_us_dedes/he.h.m8:heHE.SyMouIschys.greekname
ltx/en_us_dedes/me.m08.d24:meMA.Ode4C11.incipit	…
ltx/en_us_dedes/me.m08.d24:meMA.Ode4C11.melody	@ltx/en_us_dedes/he.h.m8:heHE.SyMouIschys.name
ltx/en_us_dedes/me.m08.d24:meMA.Ode4C11.mode	@ltx/en_us_dedes/miscellanea:misc.Mode8
ltx/en_us_dedes/me.m08.d24:meMA.Ode4C11.ode	@ltx/en_us_dedes/miscellanea:misc.Ode4
ltx/en_us_dedes/me.m08.d24:meMA.Ode4C11.text	
ltx/en_us_dedes/me.m08.d24:meMA.Ode4C12.incipit	…
ltx/en_us_dedes/me.m08.d24:meMA.Ode4C12.melody	@ltx/en_us_dedes/he.h.m8:heHE.SyMouIschys.name
ltx/en_us_dedes/me.m08.d24:meMA.Ode4C12.mode	@ltx/en_us_dedes/miscellanea:misc.Mode8
ltx/en_us_dedes/me.m08.d24:meMA.Ode4C12.ode	@ltx/en_us_dedes/miscellanea:misc.Ode4
ltx/en_us_dedes/me.m08.d24:meMA.Ode4C12.text	
ltx/en_us_dedes/me.m08.d24:meMA.Ode4C13.incipit	…
ltx/en_us_dedes/me.m08.d24:meMA.Ode4C13.melody	@ltx/en_us_dedes/he.h.m8:heHE.SyMouIschys.name
ltx/en_us_dedes/me.m08.d24:meMA.Ode4C13.mode	@ltx/en_us_dedes/miscellanea:misc.Mode8
ltx/en_us_dedes/me.m08.d24:meMA.Ode4C13.ode	@ltx/en_us_dedes/miscellanea:misc.Ode4
ltx/en_us_dedes/me.m08.d24:meMA.Ode4C13.text	
ltx/en_us_dedes/me.m08.d24:meMA.Ode4C14.incipit	…
ltx/en_us_dedes/me.m08.d24:meMA.Ode4C14.melody	@ltx/en_us_dedes/he.h.m8:heHE.SyMouIschys.name
ltx/en_us_dedes/me.m08.d24:meMA.Ode4C14.mode	@ltx/en_us_dedes/miscellanea:misc.Mode8
ltx/en_us_dedes/me.m08.d24:meMA.Ode4C14.ode	@ltx/en_us_dedes/miscellanea:misc.Ode4
ltx/en_us_dedes/me.m08.d24:meMA.Ode4C14.text	
ltx/en_us_dedes/me.m08.d24:meMA.Ode4C1T.incipit	…
ltx/en_us_dedes/me.m08.d24:meMA.Ode4C1T.melody	@ltx/en_us_dedes/he.h.m8:heHE.SyMouIschys.name
ltx/en_us_dedes/me.m08.d24:meMA.Ode4C1T.mode	@ltx/en_us_dedes/miscellanea:misc.Mode8
ltx/en_us_dedes/me.m08.d24:meMA.Ode4C1T.ode	@ltx/en_us_dedes/miscellanea:misc.Ode4
ltx/en_us_dedes/me.m08.d24:meMA.Ode4C1T.text	
ltx/en_us_dedes/me.m08.d24:meMA.Ode5C11.greekmelody	@ltx/en_us_dedes/he.h.m8:heHE.InaTiMeAposo.greekname
ltx/en_us_dedes/me.m08.d24:meMA.Ode5C11.incipit	…
ltx/en_us_dedes/me.m08.d24:meMA.Ode5C11.melody	@ltx/en_us_dedes/he.h.m8:heHE.InaTiMeAposo.name
ltx/en_us_dedes/me.m08.d24:meMA.Ode5C11.mode	@ltx/en_us_dedes/miscellanea:misc.Mode8
ltx/en_us_dedes/me.m08.d24:meMA.Ode5C11.ode	@ltx/en_us_dedes/miscellanea:misc.Ode5
ltx/en_us_dedes/me.m08.d24:meMA.Ode5C11.text	
ltx/en_us_dedes/me.m08.d24:meMA.Ode5C12.incipit	…
ltx/en_us_dedes/me.m08.d24:meMA.Ode5C12.melody	@ltx/en_us_dedes/he.h.m8:heHE.InaTiMeAposo.name
ltx/en_us_dedes/me.m08.d24:meMA.Ode5C12.mode	@ltx/en_us_dedes/miscellanea:misc.Mode8
ltx/en_us_dedes/me.m08.d24:meMA.Ode5C12.ode	@ltx/en_us_dedes/miscellanea:misc.Ode5
ltx/en_us_dedes/me.m08.d24:meMA.Ode5C12.text	
ltx/en_us_dedes/me.m08.d24:meMA.Ode5C13.incipit	…
ltx/en_us_dedes/me.m08.d24:meMA.Ode5C13.melody	@ltx/en_us_dedes/he.h.m8:heHE.InaTiMeAposo.name
ltx/en_us_dedes/me.m08.d24:meMA.Ode5C13.mode	@ltx/en_us_dedes/miscellanea:misc.Mode8
ltx/en_us_dedes/me.m08.d24:meMA.Ode5C13.ode	@ltx/en_us_dedes/miscellanea:misc.Ode5
ltx/en_us_dedes/me.m08.d24:meMA.Ode5C13.text	
ltx/en_us_dedes/me.m08.d24:meMA.Ode5C1T.incipit	…
ltx/en_us_dedes/me.m08.d24:meMA.Ode5C1T.melody	@ltx/en_us_dedes/he.h.m8:heHE.InaTiMeAposo.name
ltx/en_us_dedes/me.m08.d24:meMA.Ode5C1T.mode	@ltx/en_us_dedes/miscellanea:misc.Mode8
ltx/en_us_dedes/me.m08.d24:meMA.Ode5C1T.ode	@ltx/en_us_dedes/miscellanea:misc.Ode5
ltx/en_us_dedes/me.m08.d24:meMA.Ode5C1T.text	
ltx/en_us_dedes/me.m08.d24:meMA.Ode6C11.greekmelody	@ltx/en_us_dedes/he.h.m8:heHE.IlasthitiMoiSotir.greekname
ltx/en_us_dedes/me.m08.d24:meMA.Ode6C11.incipit	…
ltx/en_us_dedes/me.m08.d24:meMA.Ode6C11.melody	@ltx/en_us_dedes/he.h.m8:heHE.IlasthitiMoiSotir.name
ltx/en_us_dedes/me.m08.d24:meMA.Ode6C11.mode	@ltx/en_us_dedes/miscellanea:misc.Mode8
ltx/en_us_dedes/me.m08.d24:meMA.Ode6C11.ode	@ltx/en_us_dedes/miscellanea:misc.Ode6
ltx/en_us_dedes/me.m08.d24:meMA.Ode6C11.text	
ltx/en_us_dedes/me.m08.d24:meMA.Ode6C12.incipit	…
ltx/en_us_dedes/me.m08.d24:meMA.Ode6C12.melody	@ltx/en_us_dedes/he.h.m8:heHE.IlasthitiMoiSotir.name
ltx/en_us_dedes/me.m08.d24:meMA.Ode6C12.mode	@ltx/en_us_dedes/miscellanea:misc.Mode8
ltx/en_us_dedes/me.m08.d24:meMA.Ode6C12.ode	@ltx/en_us_dedes/miscellanea:misc.Ode6
ltx/en_us_dedes/me.m08.d24:meMA.Ode6C12.text	
ltx/en_us_dedes/me.m08.d24:meMA.Ode6C13.incipit	…
ltx/en_us_dedes/me.m08.d24:meMA.Ode6C13.melody	@ltx/en_us_dedes/he.h.m8:heHE.IlasthitiMoiSotir.name
ltx/en_us_dedes/me.m08.d24:meMA.Ode6C13.mode	@ltx/en_us_dedes/miscellanea:misc.Mode8
ltx/en_us_dedes/me.m08.d24:meMA.Ode6C13.ode	@ltx/en_us_dedes/miscellanea:misc.Ode6
ltx/en_us_dedes/me.m08.d24:meMA.Ode6C13.text	
ltx/en_us_dedes/me.m08.d24:meMA.Ode6C1T.incipit	…
ltx/en_us_dedes/me.m08.d24:meMA.Ode6C1T.melody	@ltx/en_us_dedes/he.h.m8:heHE.IlasthitiMoiSotir.name
ltx/en_us_dedes/me.m08.d24:meMA.Ode6C1T.mode	@ltx/en_us_dedes/miscellanea:misc.Mode8
ltx/en_us_dedes/me.m08.d24:meMA.Ode6C1T.ode	@ltx/en_us_dedes/miscellanea:misc.Ode6
ltx/en_us_dedes/me.m08.d24:meMA.Ode6C1T.text	
ltx/en_us_dedes/me.m08.d24:meMA.Ode6H.greekmelody	@ltx/en_us_dedes/he.h.m8:heHE.IlasthitiMoiSotir.greekname
ltx/en_us_dedes/me.m08.d24:meMA.Ode6H.incipit	@ltx/en_us_dedes/he.h.m8:heHE.IlasthitiMoiSotir.incipit
ltx/en_us_dedes/me.m08.d24:meMA.Ode6H.melody	@ltx/en_us_dedes/he.h.m8:heHE.IlasthitiMoiSotir.melody
ltx/en_us_dedes/me.m08.d24:meMA.Ode6H.mode	@ltx/en_us_dedes/miscellanea:misc.Mode8
ltx/en_us_dedes/me.m08.d24:meMA.Ode6H.ode	@ltx/en_us_dedes/miscellanea:misc.Ode6
ltx/en_us_dedes/me.m08.d24:meMA.Ode6H.text	@ltx/en_us_dedes/he.h.m8:heHE.IlasthitiMoiSotir.text
ltx/en_us_dedes/me.m08.d24:meMA.Ode7C11.greekmelody	@ltx/en_us_dedes/he.h.m8:heHE.TheouSynkatavasin.greekname
ltx/en_us_dedes/me.m08.d24:meMA.Ode7C11.incipit	…
ltx/en_us_dedes/me.m08.d24:meMA.Ode7C11.melody	@ltx/en_us_dedes/he.h.m8:heHE.TheouSynkatavasin.name
ltx/en_us_dedes/me.m08.d24:meMA.Ode7C11.mode	@ltx/en_us_dedes/miscellanea:misc.Mode8
ltx/en_us_dedes/me.m08.d24:meMA.Ode7C11.ode	@ltx/en_us_dedes/miscellanea:misc.Ode7
ltx/en_us_dedes/me.m08.d24:meMA.Ode7C11.text	
ltx/en_us_dedes/me.m08.d24:meMA.Ode7C12.incipit	…
ltx/en_us_dedes/me.m08.d24:meMA.Ode7C12.melody	@ltx/en_us_dedes/he.h.m8:heHE.TheouSynkatavasin.name
ltx/en_us_dedes/me.m08.d24:meMA.Ode7C12.mode	@ltx/en_us_dedes/miscellanea:misc.Mode8
ltx/en_us_dedes/me.m08.d24:meMA.Ode7C12.ode	@ltx/en_us_dedes/miscellanea:misc.Ode7
ltx/en_us_dedes/me.m08.d24:meMA.Ode7C12.text	
ltx/en_us_dedes/me.m08.d24:meMA.Ode7C13.incipit	…
ltx/en_us_dedes/me.m08.d24:meMA.Ode7C13.melody	@ltx/en_us_dedes/he.h.m8:heHE.TheouSynkatavasin.name
ltx/en_us_dedes/me.m08.d24:meMA.Ode7C13.mode	@ltx/en_us_dedes/miscellanea:misc.Mode8
ltx/en_us_dedes/me.m08.d24:meMA.Ode7C13.ode	@ltx/en_us_dedes/miscellanea:misc.Ode7
ltx/en_us_dedes/me.m08.d24:meMA.Ode7C13.text	
ltx/en_us_dedes/me.m08.d24:meMA.Ode7C1T.incipit	…
ltx/en_us_dedes/me.m08.d24:meMA.Ode7C1T.melody	@ltx/en_us_dedes/he.h.m8:heHE.TheouSynkatavasin.name
ltx/en_us_dedes/me.m08.d24:meMA.Ode7C1T.mode	@ltx/en_us_dedes/miscellanea:misc.Mode8
ltx/en_us_dedes/me.m08.d24:meMA.Ode7C1T.ode	@ltx/en_us_dedes/miscellanea:misc.Ode7
ltx/en_us_dedes/me.m08.d24:meMA.Ode7C1T.text	
ltx/en_us_dedes/me.m08.d24:meMA.Ode8C11.greekmelody	@ltx/en_us_dedes/he.h.m8:heHE.EptaplasiosKaminon.greekname
ltx/en_us_dedes/me.m08.d24:meMA.Ode8C11.incipit	…
ltx/en_us_dedes/me.m08.d24:meMA.Ode8C11.melody	@ltx/en_us_dedes/he.h.m8:heHE.EptaplasiosKaminon.name
ltx/en_us_dedes/me.m08.d24:meMA.Ode8C11.mode	@ltx/en_us_dedes/miscellanea:misc.Mode8
ltx/en_us_dedes/me.m08.d24:meMA.Ode8C11.ode	@ltx/en_us_dedes/miscellanea:misc.Ode8
ltx/en_us_dedes/me.m08.d24:meMA.Ode8C11.text	
ltx/en_us_dedes/me.m08.d24:meMA.Ode8C12.incipit	…
ltx/en_us_dedes/me.m08.d24:meMA.Ode8C12.melody	@ltx/en_us_dedes/he.h.m8:heHE.EptaplasiosKaminon.name
ltx/en_us_dedes/me.m08.d24:meMA.Ode8C12.mode	@ltx/en_us_dedes/miscellanea:misc.Mode8
ltx/en_us_dedes/me.m08.d24:meMA.Ode8C12.ode	@ltx/en_us_dedes/miscellanea:misc.Ode8
ltx/en_us_dedes/me.m08.d24:meMA.Ode8C12.text	
ltx/en_us_dedes/me.m08.d24:meMA.Ode8C13.incipit	…
ltx/en_us_dedes/me.m08.d24:meMA.Ode8C13.melody	@ltx/en_us_dedes/he.h.m8:heHE.EptaplasiosKaminon.name
ltx/en_us_dedes/me.m08.d24:meMA.Ode8C13.mode	@ltx/en_us_dedes/miscellanea:misc.Mode8
ltx/en_us_dedes/me.m08.d24:meMA.Ode8C13.ode	@ltx/en_us_dedes/miscellanea:misc.Ode8
ltx/en_us_dedes/me.m08.d24:meMA.Ode8C13.text	
ltx/en_us_dedes/me.m08.d24:meMA.Ode8C14.incipit	…
ltx/en_us_dedes/me.m08.d24:meMA.Ode8C14.melody	@ltx/en_us_dedes/he.h.m8:heHE.EptaplasiosKaminon.name
ltx/en_us_dedes/me.m08.d24:meMA.Ode8C14.mode	@ltx/en_us_dedes/miscellanea:misc.Mode8
ltx/en_us_dedes/me.m08.d24:meMA.Ode8C14.ode	@ltx/en_us_dedes/miscellanea:misc.Ode8
ltx/en_us_dedes/me.m08.d24:meMA.Ode8C14.text	
ltx/en_us_dedes/me.m08.d24:meMA.Ode8C1T.incipit	…
ltx/en_us_dedes/me.m08.d24:meMA.Ode8C1T.melody	@ltx/en_us_dedes/he.h.m8:heHE.EptaplasiosKaminon.name
ltx/en_us_dedes/me.m08.d24:meMA.Ode8C1T.mode	@ltx/en_us_dedes/miscellanea:misc.Mode8
ltx/en_us_dedes/me.m08.d24:meMA.Ode8C1T.ode	@ltx/en_us_dedes/miscellanea:misc.Ode8
ltx/en_us_dedes/me.m08.d24:meMA.Ode8C1T.text	
ltx/en_us_dedes/me.m08.d24:meMA.Ode8H.greekmelody	@ltx/en_us_dedes/he.h.m8:heHE.EptaplasiosKaminon.greekname
ltx/en_us_dedes/me.m08.d24:meMA.Ode8H.incipit	@ltx/en_us_dedes/he.h.m8:heHE.EptaplasiosKaminon.incipit
ltx/en_us_dedes/me.m08.d24:meMA.Ode8H.melody	@ltx/en_us_dedes/he.h.m8:heHE.EptaplasiosKaminon.melody
ltx/en_us_dedes/me.m08.d24:meMA.Ode8H.mode	@ltx/en_us_dedes/miscellanea:misc.Mode8
ltx/en_us_dedes/me.m08.d24:meMA.Ode8H.ode	@ltx/en_us_dedes/miscellanea:misc.Ode8
ltx/en_us_dedes/me.m08.d24:meMA.Ode8H.text	@ltx/en_us_dedes/he.h.m8:heHE.EptaplasiosKaminon.text
ltx/en_us_dedes/me.m08.d24:meMA.Ode9C11.greekmelody	@ltx/en_us_dedes/he.h.m8:heHE.ExestiEpiTouto.greekname
ltx/en_us_dedes/me.m08.d24:meMA.Ode9C11.incipit	…
ltx/en_us_dedes/me.m08.d24:meMA.Ode9C11.melody	@ltx/en_us_dedes/he.h.m8:heHE.ExestiEpiTouto.name
ltx/en_us_dedes/me.m08.d24:meMA.Ode9C11.mode	@ltx/en_us_dedes/miscellanea:misc.Mode8
ltx/en_us_dedes/me.m08.d24:meMA.Ode9C11.ode	@ltx/en_us_dedes/miscellanea:misc.Ode9
ltx/en_us_dedes/me.m08.d24:meMA.Ode9C11.text	
ltx/en_us_dedes/me.m08.d24:meMA.Ode9C12.incipit	…
ltx/en_us_dedes/me.m08.d24:meMA.Ode9C12.melody	@ltx/en_us_dedes/he.h.m8:heHE.ExestiEpiTouto.name
ltx/en_us_dedes/me.m08.d24:meMA.Ode9C12.mode	@ltx/en_us_dedes/miscellanea:misc.Mode8
ltx/en_us_dedes/me.m08.d24:meMA.Ode9C12.ode	@ltx/en_us_dedes/miscellanea:misc.Ode9
ltx/en_us_dedes/me.m08.d24:meMA.Ode9C12.text	
ltx/en_us_dedes/me.m08.d24:meMA.Ode9C13.incipit	…
ltx/en_us_dedes/me.m08.d24:meMA.Ode9C13.melody	@ltx/en_us_dedes/he.h.m8:heHE.ExestiEpiTouto.name
ltx/en_us_dedes/me.m08.d24:meMA.Ode9C13.mode	@ltx/en_us_dedes/miscellanea:misc.Mode8
ltx/en_us_dedes/me.m08.d24:meMA.Ode9C13.ode	@ltx/en_us_dedes/miscellanea:misc.Ode9
ltx/en_us_dedes/me.m08.d24:meMA.Ode9C13.text	
ltx/en_us_dedes/me.m08.d24:meMA.Ode9C14.incipit	…
ltx/en_us_dedes/me.m08.d24:meMA.Ode9C14.melody	@ltx/en_us_dedes/he.h.m8:heHE.ExestiEpiTouto.name
ltx/en_us_dedes/me.m08.d24:meMA.Ode9C14.mode	@ltx/en_us_dedes/miscellanea:misc.Mode8
ltx/en_us_dedes/me.m08.d24:meMA.Ode9C14.ode	@ltx/en_us_dedes/miscellanea:misc.Ode9
ltx/en_us_dedes/me.m08.d24:meMA.Ode9C14.text	
ltx/en_us_dedes/me.m08.d24:meMA.Ode9C1T.incipit	…
ltx/en_us_dedes/me.m08.d24:meMA.Ode9C1T.melody	@ltx/en_us_dedes/he.h.m8:heHE.ExestiEpiTouto.name
ltx/en_us_dedes/me.m08.d24:meMA.Ode9C1T.mode	@ltx/en_us_dedes/miscellanea:misc.Mode8
ltx/en_us_dedes/me.m08.d24:meMA.Ode9C1T.ode	@ltx/en_us_dedes/miscellanea:misc.Ode9
ltx/en_us_dedes/me.m08.d24:meMA.Ode9C1T.text	
ltx/en_us_dedes/me.m08.d24:meMA.Ode9H.greekmelody	@ltx/en_us_dedes/he.h.m8:heHE.ExestiEpiTouto.greekname
ltx/en_us_dedes/me.m08.d24:meMA.Ode9H.incipit	@ltx/en_us_dedes/he.h.m8:heHE.ExestiEpiTouto.incipit
ltx/en_us_dedes/me.m08.d24:meMA.Ode9H.melody	@ltx/en_us_dedes/he.h.m8:heHE.ExestiEpiTouto.melody
ltx/en_us_dedes/me.m08.d24:meMA.Ode9H.mode	@ltx/en_us_dedes/miscellanea:misc.Mode8
ltx/en_us_dedes/me.m08.d24:meMA.Ode9H.ode	@ltx/en_us_dedes/miscellanea:misc.Ode9
ltx/en_us_dedes/me.m08.d24:meMA.Ode9H.text	@ltx/en_us_dedes/he.h.m8:heHE.ExestiEpiTouto.text
ltx/en_us_dedes/me.m08.d24:meVE.Apolytikion1ger.greekmelody	@ltx/en_us_dedes/he.a.m4:heAU.OYpsotheisEnToStavro.greekname
ltx/en_us_dedes/me.m08.d24:meVE.Apolytikion1ger.incipit	…
ltx/en_us_dedes/me.m08.d24:meVE.Apolytikion1ger.melody	@ltx/en_us_dedes/he.a.m4:heAU.OYpsotheisEnToStavro.name
ltx/en_us_dedes/me.m08.d24:meVE.Apolytikion1ger.mode	@ltx/en_us_dedes/miscellanea:misc.Mode4
ltx/en_us_dedes/me.m08.d24:meVE.Apolytikion1ger.poet	@ltx/en_us_dedes/poets:po.Gerasimou
ltx/en_us_dedes/me.m08.d24:meVE.Apolytikion1ger.text	
ltx/en_us_dedes/me.m08.d24:meVE.Apolytikion2ger.greekmelody	@ltx/en_us_dedes/he.a.m5:heAU.TonSynanarchonLogon.greekname
ltx/en_us_dedes/me.m08.d24:meVE.Apolytikion2ger.incipit	…
ltx/en_us_dedes/me.m08.d24:meVE.Apolytikion2ger.melody	@ltx/en_us_dedes/he.a.m5:heAU.TonSynanarchonLogon.name
ltx/en_us_dedes/me.m08.d24:meVE.Apolytikion2ger.mode	@ltx/en_us_dedes/miscellanea:misc.Mode5
ltx/en_us_dedes/me.m08.d24:meVE.Apolytikion2ger.poet	@ltx/en_us_dedes/poets:po.Gerasimou
ltx/en_us_dedes/me.m08.d24:meVE.Apolytikion2ger.text	
ltx/en_us_dedes/me.m08.d24:meVE.Apolytikion3ger.greekmelody	@ltx/en_us_dedes/he.a.m3:heAU.TheiasPisteos.greekname
ltx/en_us_dedes/me.m08.d24:meVE.Apolytikion3ger.incipit	…
ltx/en_us_dedes/me.m08.d24:meVE.Apolytikion3ger.melody	@ltx/en_us_dedes/he.a.m3:heAU.TheiasPisteos.name
ltx/en_us_dedes/me.m08.d24:meVE.Apolytikion3ger.mode	@ltx/en_us_dedes/miscellanea:misc.Mode3
ltx/en_us_dedes/me.m08.d24:meVE.Apolytikion3ger.poet	@ltx/en_us_dedes/poets:po.Gerasimou
ltx/en_us_dedes/me.m08.d24:meVE.Apolytikion3ger.text	
ltx/en_us_dedes/me.m08.d24:meVE.SticStavrotheotokion.greekmelody	@ltx/en_us_dedes/he.a.m8:heAU.OTouParadoxou.greekname
ltx/en_us_dedes/me.m08.d24:meVE.SticStavrotheotokion.incipit	@ltx/en_us_dedes/me.m02.d20:meVE.SticStavrotheotokion.incipit
ltx/en_us_dedes/me.m08.d24:meVE.SticStavrotheotokion.melody	@ltx/en_us_dedes/he.a.m8:heAU.OTouParadoxou.name
ltx/en_us_dedes/me.m08.d24:meVE.SticStavrotheotokion.mode	@ltx/en_us_dedes/miscellanea:misc.Mode8
ltx/en_us_dedes/me.m08.d24:meVE.SticStavrotheotokion.text	@ltx/en_us_dedes/me.m02.d20:meVE.SticStavrotheotokion.text
ltx/en_us_dedes/me.m08.d24:meVE.SticTheotokion.greekmelody	@ltx/en_us_dedes/he.a.m8:heAU.OTouParadoxou.greekname
ltx/en_us_dedes/me.m08.d24:meVE.SticTheotokion.incipit	@ltx/en_us_dedes/me.m02.d20:meVE.SticTheotokion.incipit
ltx/en_us_dedes/me.m08.d24:meVE.SticTheotokion.melody	@ltx/en_us_dedes/he.a.m8:heAU.OTouParadoxou.name
ltx/en_us_dedes/me.m08.d24:meVE.SticTheotokion.mode	@ltx/en_us_dedes/miscellanea:misc.Mode8
ltx/en_us_dedes/me.m08.d24:meVE.SticTheotokion.text	@ltx/en_us_dedes/me.m02.d20:meVE.SticTheotokion.text
ltx/en_us_dedes/me.m08.d24:meVE.Stichera01.greekmelody	@ltx/en_us_dedes/he.a.m8:heAU.OTouParadoxou.greekname
ltx/en_us_dedes/me.m08.d24:meVE.Stichera01.incipit	…
ltx/en_us_dedes/me.m08.d24:meVE.Stichera01.melody	@ltx/en_us_dedes/he.a.m8:heAU.OTouParadoxou.name
ltx/en_us_dedes/me.m08.d24:meVE.Stichera01.mode	@ltx/en_us_dedes/miscellanea:misc.Mode8
ltx/en_us_dedes/me.m08.d24:meVE.Stichera01.text	
ltx/en_us_dedes/me.m08.d24:meVE.Stichera02.incipit	…
ltx/en_us_dedes/me.m08.d24:meVE.Stichera02.melody	@ltx/en_us_dedes/he.a.m8:heAU.OTouParadoxou.name
ltx/en_us_dedes/me.m08.d24:meVE.Stichera02.mode	@ltx/en_us_dedes/miscellanea:misc.Mode8
ltx/en_us_dedes/me.m08.d24:meVE.Stichera02.text	
ltx/en_us_dedes/me.m08.d24:meVE.Stichera03.incipit	…
ltx/en_us_dedes/me.m08.d24:meVE.Stichera03.melody	@ltx/en_us_dedes/he.a.m8:heAU.OTouParadoxou.name
ltx/en_us_dedes/me.m08.d24:meVE.Stichera03.mode	@ltx/en_us_dedes/miscellanea:misc.Mode8
ltx/en_us_dedes/me.m08.d24:meVE.Stichera03.text	
