ltx/en_us_dedes/tr.d058:trCO.header	
ltx/en_us_dedes/tr.d058:trDA.commemoration.full	
ltx/en_us_dedes/tr.d058:trDA.commemoration.short	Monday of the Sixth Week
ltx/en_us_dedes/tr.d058:trDA.insert1	
ltx/en_us_dedes/tr.d058:trDA.insert2	
ltx/en_us_dedes/tr.d058:trDA.note	
ltx/en_us_dedes/tr.d058:trDA.title	
ltx/en_us_dedes/tr.d058:trHO.commemorations	
ltx/en_us_dedes/tr.d058:trHO.daytitle	
ltx/en_us_dedes/tr.d058:trHO.description1	
ltx/en_us_dedes/tr.d058:trHO.description2	
ltx/en_us_dedes/tr.d058:trHO.note1	
ltx/en_us_dedes/tr.d058:trHO.note2	
ltx/en_us_dedes/tr.d058:trMA.AposIdiomelon1.incipit	…
ltx/en_us_dedes/tr.d058:trMA.AposIdiomelon1.melody	@ltx/en_us_dedes/miscellanea:misc.Idiomelon
ltx/en_us_dedes/tr.d058:trMA.AposIdiomelon1.mode	@ltx/en_us_dedes/miscellanea:misc.Mode5
ltx/en_us_dedes/tr.d058:trMA.AposIdiomelon1.text	
ltx/en_us_dedes/tr.d058:trMA.AposMartyric.incipit	…
ltx/en_us_dedes/tr.d058:trMA.AposMartyric.melody	
ltx/en_us_dedes/tr.d058:trMA.AposMartyric.mode	@ltx/en_us_dedes/miscellanea:misc.Mode5
ltx/en_us_dedes/tr.d058:trMA.AposMartyric.text	
ltx/en_us_dedes/tr.d058:trMA.AposTheotokion.incipit	@ltx/en_us_dedes/me.m12.d11:meVE.SticTheotokion.incipit
ltx/en_us_dedes/tr.d058:trMA.AposTheotokion.melody	
ltx/en_us_dedes/tr.d058:trMA.AposTheotokion.mode	@ltx/en_us_dedes/miscellanea:misc.Mode5
ltx/en_us_dedes/tr.d058:trMA.AposTheotokion.text	@ltx/en_us_dedes/me.m12.d11:meVE.SticTheotokion.text
ltx/en_us_dedes/tr.d058:trMA.C1.poet	@ltx/en_us_dedes/poets:po.Iosif
ltx/en_us_dedes/tr.d058:trMA.C1.title	
ltx/en_us_dedes/tr.d058:trMA.C1.verse	
ltx/en_us_dedes/tr.d058:trMA.C2.poet	@ltx/en_us_dedes/poets:po.Theodorou
ltx/en_us_dedes/tr.d058:trMA.C2.title	
ltx/en_us_dedes/tr.d058:trMA.C2.verse	
ltx/en_us_dedes/tr.d058:trMA.Kathisma21.greekmelody	@ltx/en_us_dedes/he.a.m1:heAU.TouLithouSfragisthentos.greekname
ltx/en_us_dedes/tr.d058:trMA.Kathisma21.incipit	…
ltx/en_us_dedes/tr.d058:trMA.Kathisma21.melody	@ltx/en_us_dedes/he.a.m1:heAU.TouLithouSfragisthentos.name
ltx/en_us_dedes/tr.d058:trMA.Kathisma21.mode	@ltx/en_us_dedes/miscellanea:misc.Mode1
ltx/en_us_dedes/tr.d058:trMA.Kathisma21.text	
ltx/en_us_dedes/tr.d058:trMA.Kathisma22.incipit	…
ltx/en_us_dedes/tr.d058:trMA.Kathisma22.melody	
ltx/en_us_dedes/tr.d058:trMA.Kathisma22.mode	@ltx/en_us_dedes/miscellanea:misc.Mode1
ltx/en_us_dedes/tr.d058:trMA.Kathisma22.text	
ltx/en_us_dedes/tr.d058:trMA.Kathisma31.greekmelody	@ltx/en_us_dedes/he.a.m1:heAU.TouLithouSfragisthentos.greekname
ltx/en_us_dedes/tr.d058:trMA.Kathisma31.incipit	…
ltx/en_us_dedes/tr.d058:trMA.Kathisma31.melody	@ltx/en_us_dedes/he.a.m1:heAU.TouLithouSfragisthentos.name
ltx/en_us_dedes/tr.d058:trMA.Kathisma31.mode	@ltx/en_us_dedes/miscellanea:misc.Mode1
ltx/en_us_dedes/tr.d058:trMA.Kathisma31.text	
ltx/en_us_dedes/tr.d058:trMA.Kathisma32.greekmelody	@ltx/en_us_dedes/he.a.m1:heAU.TouLithouSfragisthentos.greekname
ltx/en_us_dedes/tr.d058:trMA.Kathisma32.incipit	Extend your holy hands, with…
ltx/en_us_dedes/tr.d058:trMA.Kathisma32.melody	@ltx/en_us_dedes/he.a.m1:heAU.TouLithouSfragisthentos.name
ltx/en_us_dedes/tr.d058:trMA.Kathisma32.mode	@ltx/en_us_dedes/miscellanea:misc.Mode1
ltx/en_us_dedes/tr.d058:trMA.Kathisma32.text	Extend your holy hands, with which you held our Creator, * imploring Him who graciously for us became incarnate, * all-holy Virgin Mother, and entreat * for us who are extolling you with love, * that He free us from temptations, * from passions, and from dangers, as we sing to you: * Glory to Him who dwelt inside of you! * Glory to Him who came forth from you! * Glory be to Him who through your childbirth has set us free!
ltx/en_us_dedes/tr.d058:trMA.Ode1C11.greekmelody	@ltx/en_us_dedes/he.h.m1:heHE.OdinEpinikion.greekname
ltx/en_us_dedes/tr.d058:trMA.Ode1C11.incipit	…
ltx/en_us_dedes/tr.d058:trMA.Ode1C11.melody	@ltx/en_us_dedes/he.h.m1:heHE.OdinEpinikion.name
ltx/en_us_dedes/tr.d058:trMA.Ode1C11.mode	@ltx/en_us_dedes/miscellanea:misc.Mode1
ltx/en_us_dedes/tr.d058:trMA.Ode1C11.ode	@ltx/en_us_dedes/miscellanea:misc.Ode1
ltx/en_us_dedes/tr.d058:trMA.Ode1C11.text	
ltx/en_us_dedes/tr.d058:trMA.Ode1C12.incipit	…
ltx/en_us_dedes/tr.d058:trMA.Ode1C12.melody	@ltx/en_us_dedes/he.h.m1:heHE.OdinEpinikion.name
ltx/en_us_dedes/tr.d058:trMA.Ode1C12.mode	@ltx/en_us_dedes/miscellanea:misc.Mode1
ltx/en_us_dedes/tr.d058:trMA.Ode1C12.ode	@ltx/en_us_dedes/miscellanea:misc.Ode1
ltx/en_us_dedes/tr.d058:trMA.Ode1C12.text	
ltx/en_us_dedes/tr.d058:trMA.Ode1C13.incipit	…
ltx/en_us_dedes/tr.d058:trMA.Ode1C13.melody	@ltx/en_us_dedes/he.h.m1:heHE.OdinEpinikion.name
ltx/en_us_dedes/tr.d058:trMA.Ode1C13.mode	@ltx/en_us_dedes/miscellanea:misc.Mode1
ltx/en_us_dedes/tr.d058:trMA.Ode1C13.ode	@ltx/en_us_dedes/miscellanea:misc.Ode1
ltx/en_us_dedes/tr.d058:trMA.Ode1C13.text	
ltx/en_us_dedes/tr.d058:trMA.Ode1C1T.incipit	…
ltx/en_us_dedes/tr.d058:trMA.Ode1C1T.melody	@ltx/en_us_dedes/he.h.m1:heHE.OdinEpinikion.name
ltx/en_us_dedes/tr.d058:trMA.Ode1C1T.mode	@ltx/en_us_dedes/miscellanea:misc.Mode1
ltx/en_us_dedes/tr.d058:trMA.Ode1C1T.ode	@ltx/en_us_dedes/miscellanea:misc.Ode1
ltx/en_us_dedes/tr.d058:trMA.Ode1C1T.text	
ltx/en_us_dedes/tr.d058:trMA.Ode1C21.greekmelody	@ltx/en_us_dedes/he.h.m1:heHE.ToVoithisantiTheo.greekname
ltx/en_us_dedes/tr.d058:trMA.Ode1C21.incipit	…
ltx/en_us_dedes/tr.d058:trMA.Ode1C21.melody	@ltx/en_us_dedes/he.h.m1:heHE.ToVoithisantiTheo.name
ltx/en_us_dedes/tr.d058:trMA.Ode1C21.mode	@ltx/en_us_dedes/miscellanea:misc.Mode1
ltx/en_us_dedes/tr.d058:trMA.Ode1C21.ode	@ltx/en_us_dedes/miscellanea:misc.Ode1
ltx/en_us_dedes/tr.d058:trMA.Ode1C21.text	
ltx/en_us_dedes/tr.d058:trMA.Ode1C22.incipit	…
ltx/en_us_dedes/tr.d058:trMA.Ode1C22.melody	@ltx/en_us_dedes/he.h.m1:heHE.ToVoithisantiTheo.name
ltx/en_us_dedes/tr.d058:trMA.Ode1C22.mode	@ltx/en_us_dedes/miscellanea:misc.Mode1
ltx/en_us_dedes/tr.d058:trMA.Ode1C22.ode	@ltx/en_us_dedes/miscellanea:misc.Ode1
ltx/en_us_dedes/tr.d058:trMA.Ode1C22.text	
ltx/en_us_dedes/tr.d058:trMA.Ode1C2A1.incipit	…
ltx/en_us_dedes/tr.d058:trMA.Ode1C2A1.melody	@ltx/en_us_dedes/he.h.m1:heHE.ToVoithisantiTheo.name
ltx/en_us_dedes/tr.d058:trMA.Ode1C2A1.mode	@ltx/en_us_dedes/miscellanea:misc.Mode1
ltx/en_us_dedes/tr.d058:trMA.Ode1C2A1.ode	@ltx/en_us_dedes/miscellanea:misc.Ode1
ltx/en_us_dedes/tr.d058:trMA.Ode1C2A1.text	
ltx/en_us_dedes/tr.d058:trMA.Ode1C2H.greekmelody	@ltx/en_us_dedes/he.h.m1:heHE.ToVoithisantiTheo.greekname
ltx/en_us_dedes/tr.d058:trMA.Ode1C2H.incipit	@ltx/en_us_dedes/he.h.m1:heHE.ToVoithisantiTheo.incipit
ltx/en_us_dedes/tr.d058:trMA.Ode1C2H.melody	@ltx/en_us_dedes/he.h.m1:heHE.ToVoithisantiTheo.melody
ltx/en_us_dedes/tr.d058:trMA.Ode1C2H.mode	@ltx/en_us_dedes/miscellanea:misc.Mode1
ltx/en_us_dedes/tr.d058:trMA.Ode1C2H.ode	@ltx/en_us_dedes/miscellanea:misc.Ode1
ltx/en_us_dedes/tr.d058:trMA.Ode1C2H.text	@ltx/en_us_dedes/he.h.m1:heHE.ToVoithisantiTheo.text
ltx/en_us_dedes/tr.d058:trMA.Ode1C2T.incipit	…
ltx/en_us_dedes/tr.d058:trMA.Ode1C2T.melody	@ltx/en_us_dedes/he.h.m1:heHE.ToVoithisantiTheo.name
ltx/en_us_dedes/tr.d058:trMA.Ode1C2T.mode	@ltx/en_us_dedes/miscellanea:misc.Mode1
ltx/en_us_dedes/tr.d058:trMA.Ode1C2T.ode	@ltx/en_us_dedes/miscellanea:misc.Ode1
ltx/en_us_dedes/tr.d058:trMA.Ode1C2T.text	
ltx/en_us_dedes/tr.d058:trMA.Ode1C2Tr.incipit	…
ltx/en_us_dedes/tr.d058:trMA.Ode1C2Tr.melody	@ltx/en_us_dedes/he.h.m1:heHE.ToVoithisantiTheo.name
ltx/en_us_dedes/tr.d058:trMA.Ode1C2Tr.mode	@ltx/en_us_dedes/miscellanea:misc.Mode1
ltx/en_us_dedes/tr.d058:trMA.Ode1C2Tr.ode	@ltx/en_us_dedes/miscellanea:misc.Ode1
ltx/en_us_dedes/tr.d058:trMA.Ode1C2Tr.text	
ltx/en_us_dedes/tr.d058:trMA.Ode8C11.greekmelody	@ltx/en_us_dedes/he.h.m1:heHE.OnFrittousinAngeloi.greekname
ltx/en_us_dedes/tr.d058:trMA.Ode8C11.incipit	…
ltx/en_us_dedes/tr.d058:trMA.Ode8C11.melody	@ltx/en_us_dedes/he.h.m1:heHE.OnFrittousinAngeloi.name
ltx/en_us_dedes/tr.d058:trMA.Ode8C11.mode	@ltx/en_us_dedes/miscellanea:misc.Mode1
ltx/en_us_dedes/tr.d058:trMA.Ode8C11.ode	@ltx/en_us_dedes/miscellanea:misc.Ode8
ltx/en_us_dedes/tr.d058:trMA.Ode8C11.text	
ltx/en_us_dedes/tr.d058:trMA.Ode8C12.incipit	…
ltx/en_us_dedes/tr.d058:trMA.Ode8C12.melody	@ltx/en_us_dedes/he.h.m1:heHE.OnFrittousinAngeloi.name
ltx/en_us_dedes/tr.d058:trMA.Ode8C12.mode	@ltx/en_us_dedes/miscellanea:misc.Mode1
ltx/en_us_dedes/tr.d058:trMA.Ode8C12.ode	@ltx/en_us_dedes/miscellanea:misc.Ode8
ltx/en_us_dedes/tr.d058:trMA.Ode8C12.text	
ltx/en_us_dedes/tr.d058:trMA.Ode8C13.incipit	…
ltx/en_us_dedes/tr.d058:trMA.Ode8C13.melody	@ltx/en_us_dedes/he.h.m1:heHE.OnFrittousinAngeloi.name
ltx/en_us_dedes/tr.d058:trMA.Ode8C13.mode	@ltx/en_us_dedes/miscellanea:misc.Mode1
ltx/en_us_dedes/tr.d058:trMA.Ode8C13.ode	@ltx/en_us_dedes/miscellanea:misc.Ode8
ltx/en_us_dedes/tr.d058:trMA.Ode8C13.text	
ltx/en_us_dedes/tr.d058:trMA.Ode8C1T.incipit	…
ltx/en_us_dedes/tr.d058:trMA.Ode8C1T.melody	@ltx/en_us_dedes/he.h.m1:heHE.OnFrittousinAngeloi.name
ltx/en_us_dedes/tr.d058:trMA.Ode8C1T.mode	@ltx/en_us_dedes/miscellanea:misc.Mode1
ltx/en_us_dedes/tr.d058:trMA.Ode8C1T.ode	@ltx/en_us_dedes/miscellanea:misc.Ode8
ltx/en_us_dedes/tr.d058:trMA.Ode8C1T.text	
ltx/en_us_dedes/tr.d058:trMA.Ode8C21.greekmelody	@ltx/en_us_dedes/he.h.m1:heHE.YmnonSoiProsferomen.greekname
ltx/en_us_dedes/tr.d058:trMA.Ode8C21.incipit	…
ltx/en_us_dedes/tr.d058:trMA.Ode8C21.melody	@ltx/en_us_dedes/he.h.m1:heHE.YmnonSoiProsferomen.name
ltx/en_us_dedes/tr.d058:trMA.Ode8C21.mode	@ltx/en_us_dedes/miscellanea:misc.Mode1
ltx/en_us_dedes/tr.d058:trMA.Ode8C21.ode	@ltx/en_us_dedes/miscellanea:misc.Ode8
ltx/en_us_dedes/tr.d058:trMA.Ode8C21.text	
ltx/en_us_dedes/tr.d058:trMA.Ode8C22.incipit	…
ltx/en_us_dedes/tr.d058:trMA.Ode8C22.melody	@ltx/en_us_dedes/he.h.m1:heHE.YmnonSoiProsferomen.name
ltx/en_us_dedes/tr.d058:trMA.Ode8C22.mode	@ltx/en_us_dedes/miscellanea:misc.Mode1
ltx/en_us_dedes/tr.d058:trMA.Ode8C22.ode	@ltx/en_us_dedes/miscellanea:misc.Ode8
ltx/en_us_dedes/tr.d058:trMA.Ode8C22.text	
ltx/en_us_dedes/tr.d058:trMA.Ode8C2A1.incipit	…
ltx/en_us_dedes/tr.d058:trMA.Ode8C2A1.melody	@ltx/en_us_dedes/he.h.m1:heHE.YmnonSoiProsferomen.name
ltx/en_us_dedes/tr.d058:trMA.Ode8C2A1.mode	@ltx/en_us_dedes/miscellanea:misc.Mode1
ltx/en_us_dedes/tr.d058:trMA.Ode8C2A1.ode	@ltx/en_us_dedes/miscellanea:misc.Ode8
ltx/en_us_dedes/tr.d058:trMA.Ode8C2A1.text	
ltx/en_us_dedes/tr.d058:trMA.Ode8C2H.greekmelody	@ltx/en_us_dedes/he.h.m1:heHE.YmnonSoiProsferomen.greekname
ltx/en_us_dedes/tr.d058:trMA.Ode8C2H.incipit	@ltx/en_us_dedes/he.h.m1:heHE.YmnonSoiProsferomen.incipit
ltx/en_us_dedes/tr.d058:trMA.Ode8C2H.melody	@ltx/en_us_dedes/he.h.m1:heHE.YmnonSoiProsferomen.melody
ltx/en_us_dedes/tr.d058:trMA.Ode8C2H.mode	@ltx/en_us_dedes/miscellanea:misc.Mode1
ltx/en_us_dedes/tr.d058:trMA.Ode8C2H.ode	@ltx/en_us_dedes/miscellanea:misc.Ode8
ltx/en_us_dedes/tr.d058:trMA.Ode8C2H.text	@ltx/en_us_dedes/he.h.m1:heHE.YmnonSoiProsferomen.text
ltx/en_us_dedes/tr.d058:trMA.Ode8C2T.incipit	…
ltx/en_us_dedes/tr.d058:trMA.Ode8C2T.melody	@ltx/en_us_dedes/he.h.m1:heHE.YmnonSoiProsferomen.name
ltx/en_us_dedes/tr.d058:trMA.Ode8C2T.mode	@ltx/en_us_dedes/miscellanea:misc.Mode1
ltx/en_us_dedes/tr.d058:trMA.Ode8C2T.ode	@ltx/en_us_dedes/miscellanea:misc.Ode8
ltx/en_us_dedes/tr.d058:trMA.Ode8C2T.text	
ltx/en_us_dedes/tr.d058:trMA.Ode8C2Tr.incipit	…
ltx/en_us_dedes/tr.d058:trMA.Ode8C2Tr.melody	@ltx/en_us_dedes/he.h.m1:heHE.YmnonSoiProsferomen.name
ltx/en_us_dedes/tr.d058:trMA.Ode8C2Tr.mode	@ltx/en_us_dedes/miscellanea:misc.Mode1
ltx/en_us_dedes/tr.d058:trMA.Ode8C2Tr.ode	@ltx/en_us_dedes/miscellanea:misc.Ode8
ltx/en_us_dedes/tr.d058:trMA.Ode8C2Tr.text	
ltx/en_us_dedes/tr.d058:trMA.Ode9C11.greekmelody	@ltx/en_us_dedes/he.h.m1:heHE.TinZoodochonPigin.greekname
ltx/en_us_dedes/tr.d058:trMA.Ode9C11.incipit	…
ltx/en_us_dedes/tr.d058:trMA.Ode9C11.melody	@ltx/en_us_dedes/he.h.m1:heHE.TinZoodochonPigin.name
ltx/en_us_dedes/tr.d058:trMA.Ode9C11.mode	@ltx/en_us_dedes/miscellanea:misc.Mode1
ltx/en_us_dedes/tr.d058:trMA.Ode9C11.ode	@ltx/en_us_dedes/miscellanea:misc.Ode9
ltx/en_us_dedes/tr.d058:trMA.Ode9C11.text	
ltx/en_us_dedes/tr.d058:trMA.Ode9C12.incipit	…
ltx/en_us_dedes/tr.d058:trMA.Ode9C12.melody	@ltx/en_us_dedes/he.h.m1:heHE.TinZoodochonPigin.name
ltx/en_us_dedes/tr.d058:trMA.Ode9C12.mode	@ltx/en_us_dedes/miscellanea:misc.Mode1
ltx/en_us_dedes/tr.d058:trMA.Ode9C12.ode	@ltx/en_us_dedes/miscellanea:misc.Ode9
ltx/en_us_dedes/tr.d058:trMA.Ode9C12.text	
ltx/en_us_dedes/tr.d058:trMA.Ode9C13.incipit	…
ltx/en_us_dedes/tr.d058:trMA.Ode9C13.melody	@ltx/en_us_dedes/he.h.m1:heHE.TinZoodochonPigin.name
ltx/en_us_dedes/tr.d058:trMA.Ode9C13.mode	@ltx/en_us_dedes/miscellanea:misc.Mode1
ltx/en_us_dedes/tr.d058:trMA.Ode9C13.ode	@ltx/en_us_dedes/miscellanea:misc.Ode9
ltx/en_us_dedes/tr.d058:trMA.Ode9C13.text	
ltx/en_us_dedes/tr.d058:trMA.Ode9C1T.incipit	…
ltx/en_us_dedes/tr.d058:trMA.Ode9C1T.melody	@ltx/en_us_dedes/he.h.m1:heHE.TinZoodochonPigin.name
ltx/en_us_dedes/tr.d058:trMA.Ode9C1T.mode	@ltx/en_us_dedes/miscellanea:misc.Mode1
ltx/en_us_dedes/tr.d058:trMA.Ode9C1T.ode	@ltx/en_us_dedes/miscellanea:misc.Ode9
ltx/en_us_dedes/tr.d058:trMA.Ode9C1T.text	
ltx/en_us_dedes/tr.d058:trMA.Ode9C21.greekmelody	@ltx/en_us_dedes/he.h.m1:heHE.SeTinOratheisan.greekname
ltx/en_us_dedes/tr.d058:trMA.Ode9C21.incipit	…
ltx/en_us_dedes/tr.d058:trMA.Ode9C21.melody	@ltx/en_us_dedes/he.h.m1:heHE.SeTinOratheisan.name
ltx/en_us_dedes/tr.d058:trMA.Ode9C21.mode	@ltx/en_us_dedes/miscellanea:misc.Mode1
ltx/en_us_dedes/tr.d058:trMA.Ode9C21.ode	@ltx/en_us_dedes/miscellanea:misc.Ode9
ltx/en_us_dedes/tr.d058:trMA.Ode9C21.text	
ltx/en_us_dedes/tr.d058:trMA.Ode9C22.incipit	…
ltx/en_us_dedes/tr.d058:trMA.Ode9C22.melody	@ltx/en_us_dedes/he.h.m1:heHE.SeTinOratheisan.name
ltx/en_us_dedes/tr.d058:trMA.Ode9C22.mode	@ltx/en_us_dedes/miscellanea:misc.Mode1
ltx/en_us_dedes/tr.d058:trMA.Ode9C22.ode	@ltx/en_us_dedes/miscellanea:misc.Ode9
ltx/en_us_dedes/tr.d058:trMA.Ode9C22.text	
ltx/en_us_dedes/tr.d058:trMA.Ode9C2A1.incipit	…
ltx/en_us_dedes/tr.d058:trMA.Ode9C2A1.melody	@ltx/en_us_dedes/he.h.m1:heHE.SeTinOratheisan.name
ltx/en_us_dedes/tr.d058:trMA.Ode9C2A1.mode	@ltx/en_us_dedes/miscellanea:misc.Mode1
ltx/en_us_dedes/tr.d058:trMA.Ode9C2A1.ode	@ltx/en_us_dedes/miscellanea:misc.Ode9
ltx/en_us_dedes/tr.d058:trMA.Ode9C2A1.text	
ltx/en_us_dedes/tr.d058:trMA.Ode9C2H.greekmelody	@ltx/en_us_dedes/he.h.m1:heHE.SeTinOratheisan.greekname
ltx/en_us_dedes/tr.d058:trMA.Ode9C2H.incipit	@ltx/en_us_dedes/he.h.m1:heHE.SeTinOratheisan.incipit
ltx/en_us_dedes/tr.d058:trMA.Ode9C2H.melody	@ltx/en_us_dedes/he.h.m1:heHE.SeTinOratheisan.melody
ltx/en_us_dedes/tr.d058:trMA.Ode9C2H.mode	@ltx/en_us_dedes/miscellanea:misc.Mode1
ltx/en_us_dedes/tr.d058:trMA.Ode9C2H.ode	@ltx/en_us_dedes/miscellanea:misc.Ode9
ltx/en_us_dedes/tr.d058:trMA.Ode9C2H.text	@ltx/en_us_dedes/he.h.m1:heHE.SeTinOratheisan.text
ltx/en_us_dedes/tr.d058:trMA.Ode9C2T.incipit	…
ltx/en_us_dedes/tr.d058:trMA.Ode9C2T.melody	@ltx/en_us_dedes/he.h.m1:heHE.SeTinOratheisan.name
ltx/en_us_dedes/tr.d058:trMA.Ode9C2T.mode	@ltx/en_us_dedes/miscellanea:misc.Mode1
ltx/en_us_dedes/tr.d058:trMA.Ode9C2T.ode	@ltx/en_us_dedes/miscellanea:misc.Ode9
ltx/en_us_dedes/tr.d058:trMA.Ode9C2T.text	
ltx/en_us_dedes/tr.d058:trMA.Ode9C2Tr.incipit	…
ltx/en_us_dedes/tr.d058:trMA.Ode9C2Tr.melody	@ltx/en_us_dedes/he.h.m1:heHE.SeTinOratheisan.name
ltx/en_us_dedes/tr.d058:trMA.Ode9C2Tr.mode	@ltx/en_us_dedes/miscellanea:misc.Mode1
ltx/en_us_dedes/tr.d058:trMA.Ode9C2Tr.ode	@ltx/en_us_dedes/miscellanea:misc.Ode9
ltx/en_us_dedes/tr.d058:trMA.Ode9C2Tr.text	
ltx/en_us_dedes/tr.d058:trTE.Troparion.incipit	…
ltx/en_us_dedes/tr.d058:trTE.Troparion.melody	
ltx/en_us_dedes/tr.d058:trTE.Troparion.mode	@ltx/en_us_dedes/miscellanea:misc.Mode6
ltx/en_us_dedes/tr.d058:trTE.Troparion.text	
ltx/en_us_dedes/tr.d058:trVE.AposIdiomelon1.incipit	…
ltx/en_us_dedes/tr.d058:trVE.AposIdiomelon1.melody	@ltx/en_us_dedes/miscellanea:misc.Idiomelon
ltx/en_us_dedes/tr.d058:trVE.AposIdiomelon1.mode	@ltx/en_us_dedes/miscellanea:misc.Mode1
ltx/en_us_dedes/tr.d058:trVE.AposIdiomelon1.text	
ltx/en_us_dedes/tr.d058:trVE.AposMartyric.incipit	@ltx/en_us_dedes/oc.m1.d2:ocVE.Aposticha3.incipit
ltx/en_us_dedes/tr.d058:trVE.AposMartyric.melody	
ltx/en_us_dedes/tr.d058:trVE.AposMartyric.mode	@ltx/en_us_dedes/miscellanea:misc.Mode1
ltx/en_us_dedes/tr.d058:trVE.AposMartyric.text	@ltx/en_us_dedes/oc.m1.d2:ocVE.Aposticha3.text
ltx/en_us_dedes/tr.d058:trVE.AposTheotokion.greekmelody	@ltx/en_us_dedes/he.a.m1:heAU.TonOuranionTagmaton.greekname
ltx/en_us_dedes/tr.d058:trVE.AposTheotokion.incipit	@ltx/en_us_dedes/he.a.m1:heAU.TonOuranionTagmaton.incipit
ltx/en_us_dedes/tr.d058:trVE.AposTheotokion.melody	@ltx/en_us_dedes/he.a.m1:heAU.TonOuranionTagmaton.melody
ltx/en_us_dedes/tr.d058:trVE.AposTheotokion.mode	@ltx/en_us_dedes/miscellanea:misc.Mode1
ltx/en_us_dedes/tr.d058:trVE.AposTheotokion.text	@ltx/en_us_dedes/he.a.m1:heAU.TonOuranionTagmaton.text
ltx/en_us_dedes/tr.d058:trVE.Stichera01.greekmelody	@ltx/en_us_dedes/he.a.m1:heAU.PaneffimoiMartyres.greekname
ltx/en_us_dedes/tr.d058:trVE.Stichera01.incipit	…
ltx/en_us_dedes/tr.d058:trVE.Stichera01.melody	@ltx/en_us_dedes/he.a.m1:heAU.PaneffimoiMartyres.name
ltx/en_us_dedes/tr.d058:trVE.Stichera01.mode	@ltx/en_us_dedes/miscellanea:misc.Mode1
ltx/en_us_dedes/tr.d058:trVE.Stichera01.text	
ltx/en_us_dedes/tr.d058:trVE.Stichera02.greekmelody	@ltx/en_us_dedes/he.a.m1:heAU.PaneffimoiMartyres.greekname
ltx/en_us_dedes/tr.d058:trVE.Stichera02.incipit	…
ltx/en_us_dedes/tr.d058:trVE.Stichera02.melody	@ltx/en_us_dedes/he.a.m1:heAU.PaneffimoiMartyres.name
ltx/en_us_dedes/tr.d058:trVE.Stichera02.mode	@ltx/en_us_dedes/miscellanea:misc.Mode1
ltx/en_us_dedes/tr.d058:trVE.Stichera02.text	
ltx/en_us_dedes/tr.d058:trVE.Stichera03.greekmelody	@ltx/en_us_dedes/he.a.m1:heAU.NefelinSeFotos.greekname
ltx/en_us_dedes/tr.d058:trVE.Stichera03.incipit	…
ltx/en_us_dedes/tr.d058:trVE.Stichera03.melody	@ltx/en_us_dedes/he.a.m1:heAU.NefelinSeFotos.name
ltx/en_us_dedes/tr.d058:trVE.Stichera03.mode	@ltx/en_us_dedes/miscellanea:misc.Mode1
ltx/en_us_dedes/tr.d058:trVE.Stichera03.text	
