ltx/en_us_dedes/sy.m07.d17:cl.syMA.commemoration01.text	[saint/com 1]
ltx/en_us_dedes/sy.m07.d17:cl.syMA.commemoration02.text	[saint/com 2]
ltx/en_us_dedes/sy.m07.d17:cl.syMA.commemoration03.text	[saint/com 3]
ltx/en_us_dedes/sy.m07.d17:cl.syMA.commemoration04.text	[saint/com 4]
ltx/en_us_dedes/sy.m07.d17:cl.syMA.commemoration05.text	[saint/com 5]
ltx/en_us_dedes/sy.m07.d17:cl.syMA.commemoration06.text	[saint/com list]
ltx/en_us_dedes/sy.m07.d17:syMA.commemoration01.couplet1.title	@ltx/en_us_dedes/titles:ti.Verses
ltx/en_us_dedes/sy.m07.d17:syMA.commemoration01.couplet1.verse1	
ltx/en_us_dedes/sy.m07.d17:syMA.commemoration01.couplet1.verse2	
ltx/en_us_dedes/sy.m07.d17:syMA.commemoration01.narration.p01	
ltx/en_us_dedes/sy.m07.d17:syMA.commemoration01.narration.p02	
ltx/en_us_dedes/sy.m07.d17:syMA.commemoration01.narration.p03	
ltx/en_us_dedes/sy.m07.d17:syMA.commemoration01.single1	
ltx/en_us_dedes/sy.m07.d17:syMA.commemoration01.text	On July 17, we commemorate the holy Great-martyr Marina.
ltx/en_us_dedes/sy.m07.d17:syMA.commemoration02.couplet1.title	@ltx/en_us_dedes/titles:ti.Verses
ltx/en_us_dedes/sy.m07.d17:syMA.commemoration02.couplet1.verse1	
ltx/en_us_dedes/sy.m07.d17:syMA.commemoration02.couplet1.verse2	
ltx/en_us_dedes/sy.m07.d17:syMA.commemoration02.text	We also commemorate the holy Martyrs Seraptus and Veronica.
ltx/en_us_dedes/sy.m07.d17:syMA.lastline	By their holy intercessions, O God, have mercy on us. Amen.
