ltx/en_us_dedes/sy.m08.d16:alt1.syMA.commemoration01.couplet1.title	@ltx/en_us_dedes/titles:ti.Verses
ltx/en_us_dedes/sy.m08.d16:alt1.syMA.commemoration01.couplet1.verse1	Honors are due to Gerasimos the New,
ltx/en_us_dedes/sy.m08.d16:alt1.syMA.commemoration01.couplet1.verse2	crowned with the honors of Saints before him.
ltx/en_us_dedes/sy.m08.d16:alt1.syMA.commemoration01.text	On August 16, we commemorate our devout father St. Gerasimos the New Ascetic from the island of Kefallinia.
ltx/en_us_dedes/sy.m08.d16:syMA.commemoration01.couplet1.title	@ltx/en_us_dedes/titles:ti.Verses
ltx/en_us_dedes/sy.m08.d16:syMA.commemoration01.couplet1.verse1	
ltx/en_us_dedes/sy.m08.d16:syMA.commemoration01.couplet1.verse2	
ltx/en_us_dedes/sy.m08.d16:syMA.commemoration01.narration.p01	
ltx/en_us_dedes/sy.m08.d16:syMA.commemoration01.single1	
ltx/en_us_dedes/sy.m08.d16:syMA.commemoration01.text	On August 16 we commemorate the holy Martyr Diomedes.
ltx/en_us_dedes/sy.m08.d16:syMA.commemoration01as02.text	On this day we also commemorate the holy Martyr Diomedes.
ltx/en_us_dedes/sy.m08.d16:syMA.commemoration02.couplet1.title	@ltx/en_us_dedes/titles:ti.Verses
ltx/en_us_dedes/sy.m08.d16:syMA.commemoration02.couplet1.verse1	
ltx/en_us_dedes/sy.m08.d16:syMA.commemoration02.couplet1.verse2	
ltx/en_us_dedes/sy.m08.d16:syMA.commemoration02.text	On this day devout Saint Chaeremon died in peace.
ltx/en_us_dedes/sy.m08.d16:syMA.commemoration03.couplet1.title	@ltx/en_us_dedes/titles:ti.Verses
ltx/en_us_dedes/sy.m08.d16:syMA.commemoration03.couplet1.verse1	
ltx/en_us_dedes/sy.m08.d16:syMA.commemoration03.couplet1.verse2	
ltx/en_us_dedes/sy.m08.d16:syMA.commemoration03.text	On this day we also commemorate the holy 33 Martyrs from Palestine who died by the sword.
ltx/en_us_dedes/sy.m08.d16:syMA.commemoration04.couplet1.title	@ltx/en_us_dedes/titles:ti.Verses
ltx/en_us_dedes/sy.m08.d16:syMA.commemoration04.couplet1.verse1	
ltx/en_us_dedes/sy.m08.d16:syMA.commemoration04.couplet1.verse2	
ltx/en_us_dedes/sy.m08.d16:syMA.commemoration04.couplet2.title	For the Tile
ltx/en_us_dedes/sy.m08.d16:syMA.commemoration04.couplet2.verse1	
ltx/en_us_dedes/sy.m08.d16:syMA.commemoration04.couplet2.verse2	
ltx/en_us_dedes/sy.m08.d16:syMA.commemoration04.narration.p01	
ltx/en_us_dedes/sy.m08.d16:syMA.commemoration04.narration.p02	
ltx/en_us_dedes/sy.m08.d16:syMA.commemoration04.narration.p03	
ltx/en_us_dedes/sy.m08.d16:syMA.commemoration04.narration.p04	
ltx/en_us_dedes/sy.m08.d16:syMA.commemoration04.narration.p05	
ltx/en_us_dedes/sy.m08.d16:syMA.commemoration04.narration.p06	
ltx/en_us_dedes/sy.m08.d16:syMA.commemoration04.narration.p07	
ltx/en_us_dedes/sy.m08.d16:syMA.commemoration04.narration.p08	
ltx/en_us_dedes/sy.m08.d16:syMA.commemoration04.narration.p09	
ltx/en_us_dedes/sy.m08.d16:syMA.commemoration04.narration.p10	
ltx/en_us_dedes/sy.m08.d16:syMA.commemoration04.narration.p11	
ltx/en_us_dedes/sy.m08.d16:syMA.commemoration04.narration.p12	
ltx/en_us_dedes/sy.m08.d16:syMA.commemoration04.narration.p13	
ltx/en_us_dedes/sy.m08.d16:syMA.commemoration04.narration.p14	
ltx/en_us_dedes/sy.m08.d16:syMA.commemoration04.narration.p15	
ltx/en_us_dedes/sy.m08.d16:syMA.commemoration04.narration.p16	
ltx/en_us_dedes/sy.m08.d16:syMA.commemoration04.narration.p17	
ltx/en_us_dedes/sy.m08.d16:syMA.commemoration04.text	On this day we commemorate the entry of the Icon of the Face of our Lord God and Savior Jesus Christ, which was not made by hands, from the city of Edessa into that God-protected Queen of Cities, Constantinople.
ltx/en_us_dedes/sy.m08.d16:syMA.commemoration05.couplet1.title	@ltx/en_us_dedes/titles:ti.Verses
ltx/en_us_dedes/sy.m08.d16:syMA.commemoration05.couplet1.verse1	
ltx/en_us_dedes/sy.m08.d16:syMA.commemoration05.couplet1.verse2	
ltx/en_us_dedes/sy.m08.d16:syMA.commemoration05.narration.p01	
ltx/en_us_dedes/sy.m08.d16:syMA.commemoration05.text	On this day we remember God’s immense and unsurpassed benevolence, which He demonstrated when He routed and put to shame the godless Hagerenes, by the mediation of our all-holy Lady the Theotokos and ever-virgin Mary.
ltx/en_us_dedes/sy.m08.d16:syMA.commemoration06.couplet1.title	@ltx/en_us_dedes/titles:ti.Verses
ltx/en_us_dedes/sy.m08.d16:syMA.commemoration06.couplet1.verse1	
ltx/en_us_dedes/sy.m08.d16:syMA.commemoration06.couplet1.verse2	
ltx/en_us_dedes/sy.m08.d16:syMA.commemoration06.text	On this day we remember when the water of the Life-giving Spring stopped and then started flowing again.
ltx/en_us_dedes/sy.m08.d16:syMA.commemoration07.couplet1.title	@ltx/en_us_dedes/titles:ti.Verses
ltx/en_us_dedes/sy.m08.d16:syMA.commemoration07.couplet1.verse1	
ltx/en_us_dedes/sy.m08.d16:syMA.commemoration07.couplet1.verse2	
ltx/en_us_dedes/sy.m08.d16:syMA.commemoration07.text	On this day we also remember when at that time our humane God delivered us, against all hope, from the threat of earthquake, which was fearful and yet tempered by tender mercy.
ltx/en_us_dedes/sy.m08.d16:syMA.commemoration08.couplet1.title	@ltx/en_us_dedes/titles:ti.Verses
ltx/en_us_dedes/sy.m08.d16:syMA.commemoration08.couplet1.verse1	Honors are due to Gerasimos the New,
ltx/en_us_dedes/sy.m08.d16:syMA.commemoration08.couplet1.verse2	crowned with the honors of Saints before him.
ltx/en_us_dedes/sy.m08.d16:syMA.commemoration08.text	On this day we commemorate our devout father St. Gerasimos the New Ascetic from the island of Kefallinia.
ltx/en_us_dedes/sy.m08.d16:syMA.commemoration09.couplet1.title	@ltx/en_us_dedes/titles:ti.Verses
ltx/en_us_dedes/sy.m08.d16:syMA.commemoration09.couplet1.verse1	
ltx/en_us_dedes/sy.m08.d16:syMA.commemoration09.couplet1.verse2	
ltx/en_us_dedes/sy.m08.d16:syMA.commemoration09.text	The holy Neo-martyr Stamatios of Volos, who witnessed in Constantinople in the year 1680, died by the sword.
ltx/en_us_dedes/sy.m08.d16:syMA.commemoration10.couplet1.title	@ltx/en_us_dedes/titles:ti.Verses
ltx/en_us_dedes/sy.m08.d16:syMA.commemoration10.couplet1.verse1	
ltx/en_us_dedes/sy.m08.d16:syMA.commemoration10.couplet1.verse2	
ltx/en_us_dedes/sy.m08.d16:syMA.commemoration10.text	Our devout father St. Timothy, Archbishop of Evripos, the founder of the Holy Monastery of Pendeli, reposed in peace.
ltx/en_us_dedes/sy.m08.d16:syMA.lastline	By the intercessions of Your Saints, O God, have mercy and save us. Amen.
ltx/en_us_dedes/sy.m08.d16:syMA.note1	
