ltx/en_us_dedes/oc.m6.d7:ocBK.ModeNaked	@ltx/en_us_dedes/miscellanea:misc.Mode6.naked
ltx/en_us_dedes/oc.m6.d7:ocBK.end.title	END OF MODE PL. 2
ltx/en_us_dedes/oc.m6.d7:ocBK.end.verse1.text	
ltx/en_us_dedes/oc.m6.d7:ocBK.end.verse2.text	
ltx/en_us_dedes/oc.m6.d7:ocBK.end.verse3.text	
ltx/en_us_dedes/oc.m6.d7:ocBK.end.verse4.text	
ltx/en_us_dedes/oc.m6.d7:ocBK.end.verse5.text	
ltx/en_us_dedes/oc.m6.d7:ocBK.end.verse6.text	
ltx/en_us_dedes/oc.m6.d7:ocLI.Beatitudes1.incipit	@ltx/en_us_dedes/oc.m6.d1:ocLI.Beatitudes1.incipit
ltx/en_us_dedes/oc.m6.d7:ocLI.Beatitudes1.melody	@ltx/en_us_dedes/he.h.m6:heHE.IToChaireDiAngelou.name
ltx/en_us_dedes/oc.m6.d7:ocLI.Beatitudes1.mode	@ltx/en_us_dedes/miscellanea:misc.Mode6
ltx/en_us_dedes/oc.m6.d7:ocLI.Beatitudes1.text	@ltx/en_us_dedes/oc.m6.d1:ocLI.Beatitudes1.text
ltx/en_us_dedes/oc.m6.d7:ocLI.Beatitudes2.incipit	You have glorified the Prophets…
ltx/en_us_dedes/oc.m6.d7:ocLI.Beatitudes2.melody	@ltx/en_us_dedes/he.h.m6:heHE.IToChaireDiAngelou.name
ltx/en_us_dedes/oc.m6.d7:ocLI.Beatitudes2.mode	@ltx/en_us_dedes/miscellanea:misc.Mode6
ltx/en_us_dedes/oc.m6.d7:ocLI.Beatitudes2.text	You have glorified the Prophets and the Teachers, * the Devout and the Just, O benevolent * and gracious Lord. By their entreaties, save us all.
ltx/en_us_dedes/oc.m6.d7:ocLI.Beatitudes3.incipit	Holy Martyrs, you did not…
ltx/en_us_dedes/oc.m6.d7:ocLI.Beatitudes3.melody	@ltx/en_us_dedes/he.h.m6:heHE.IToChaireDiAngelou.name
ltx/en_us_dedes/oc.m6.d7:ocLI.Beatitudes3.mode	@ltx/en_us_dedes/miscellanea:misc.Mode6
ltx/en_us_dedes/oc.m6.d7:ocLI.Beatitudes3.text	Holy Martyrs, you did not succumb to fire, * sword, and combing, nor even to wild beasts, * glorious athletes, and you obtained eternal life.
ltx/en_us_dedes/oc.m6.d7:ocLI.Beatitudes4.incipit	Place the souls of those…
ltx/en_us_dedes/oc.m6.d7:ocLI.Beatitudes4.melody	@ltx/en_us_dedes/he.h.m6:heHE.IToChaireDiAngelou.name
ltx/en_us_dedes/oc.m6.d7:ocLI.Beatitudes4.mode	@ltx/en_us_dedes/miscellanea:misc.Mode6
ltx/en_us_dedes/oc.m6.d7:ocLI.Beatitudes4.text	Place the souls of those whom You, O Logos, transferred * from this temporal life, there with all the Saints * and Righteous, so that we may glorify You, O Lord.
ltx/en_us_dedes/oc.m6.d7:ocLI.BeatitudesT.incipit	You ineffably gave birth unto…
ltx/en_us_dedes/oc.m6.d7:ocLI.BeatitudesT.melody	@ltx/en_us_dedes/he.h.m6:heHE.IToChaireDiAngelou.name
ltx/en_us_dedes/oc.m6.d7:ocLI.BeatitudesT.mode	@ltx/en_us_dedes/miscellanea:misc.Mode6
ltx/en_us_dedes/oc.m6.d7:ocLI.BeatitudesT.text	You ineffably gave birth unto the truly * blessed God, O immaculate Maid, and thus * all generations know you to be truly blest.
ltx/en_us_dedes/oc.m6.d7:ocLI.BeatitudesTr.incipit	Holy Trinity, extolled as the…
ltx/en_us_dedes/oc.m6.d7:ocLI.BeatitudesTr.melody	@ltx/en_us_dedes/he.h.m6:heHE.IToChaireDiAngelou.name
ltx/en_us_dedes/oc.m6.d7:ocLI.BeatitudesTr.mode	@ltx/en_us_dedes/miscellanea:misc.Mode6
ltx/en_us_dedes/oc.m6.d7:ocLI.BeatitudesTr.text	Holy Trinity, extolled as the almighty * single God: in the bosom of Abraham * place the believers whom You have from earth transferred.
ltx/en_us_dedes/oc.m6.d7:ocLI.MM.Beatitudes1234TrTas78910GB.text	@ltx/en_us_dedes/properties:media.key
ltx/en_us_dedes/oc.m6.d7:ocMA.ApolTheotokion.greekmelody	@ltx/en_us_dedes/he.a.m6:heAU.ElpisTouKosmouAgathi.greekname
ltx/en_us_dedes/oc.m6.d7:ocMA.ApolTheotokion.incipit	@ltx/en_us_dedes/oc.m6.d3:ocMA.Kathisma13.incipit
ltx/en_us_dedes/oc.m6.d7:ocMA.ApolTheotokion.melody	@ltx/en_us_dedes/he.a.m6:heAU.ElpisTouKosmouAgathi.name
ltx/en_us_dedes/oc.m6.d7:ocMA.ApolTheotokion.mode	@ltx/en_us_dedes/miscellanea:misc.Mode6
ltx/en_us_dedes/oc.m6.d7:ocMA.ApolTheotokion.text	@ltx/en_us_dedes/oc.m6.d3:ocMA.Kathisma13.text
ltx/en_us_dedes/oc.m6.d7:ocMA.AposTheotokion.greekmelody	@ltx/en_us_dedes/he.a.m6:heAU.OlinApothemenoi.greekname
ltx/en_us_dedes/oc.m6.d7:ocMA.AposTheotokion.incipit	You became a dwelling place…
ltx/en_us_dedes/oc.m6.d7:ocMA.AposTheotokion.melody	@ltx/en_us_dedes/he.a.m6:heAU.OlinApothemenoi.name
ltx/en_us_dedes/oc.m6.d7:ocMA.AposTheotokion.mode	@ltx/en_us_dedes/miscellanea:misc.Mode6
ltx/en_us_dedes/oc.m6.d7:ocMA.AposTheotokion.text	You became a dwelling place that was for God most befitting; * in your body You held God, * and also gave birth to God, holy Virgin Maid. * He was seen by mankind, * as our Lord and Savior, * in one person and two essences. * Earnestly pray to Him, * your firstborn and only beloved Son, * who after being born kept you * spotless and preserved your virginity. * Ask Him to grant rest to the souls of those who fell asleep in faith, * that they may dwell in the light and pure * splendor and in blessedness.
ltx/en_us_dedes/oc.m6.d7:ocMA.Aposticha1.greekmelody	@ltx/en_us_dedes/he.a.m6:heAU.OlinApothemenoi.greekname
ltx/en_us_dedes/oc.m6.d7:ocMA.Aposticha1.incipit	Since incomprehensible is Your compassion…
ltx/en_us_dedes/oc.m6.d7:ocMA.Aposticha1.melody	@ltx/en_us_dedes/he.a.m6:heAU.OlinApothemenoi.name
ltx/en_us_dedes/oc.m6.d7:ocMA.Aposticha1.mode	@ltx/en_us_dedes/miscellanea:misc.Mode6
ltx/en_us_dedes/oc.m6.d7:ocMA.Aposticha1.text	Since incomprehensible is Your compassion towards us, * and abundant is the well of divine benevolence, Lord most merciful, * we entreat on behalf of Your faithful servants * who have died and passed away to You: * let them dwell in the land * of the living, in most beloved and * longed for dwellings, giving them * a possession which is forevermore. * You, O Christ our Savior, * have shed Your holy blood for all mankind, * and thus You ransomed the whole world * for a price that gave us life.
ltx/en_us_dedes/oc.m6.d7:ocMA.Aposticha2.greekmelody	@ltx/en_us_dedes/he.a.m6:heAU.OlinApothemenoi.greekname
ltx/en_us_dedes/oc.m6.d7:ocMA.Aposticha2.incipit	Willingly You underwent…
ltx/en_us_dedes/oc.m6.d7:ocMA.Aposticha2.melody	@ltx/en_us_dedes/he.a.m6:heAU.OlinApothemenoi.name
ltx/en_us_dedes/oc.m6.d7:ocMA.Aposticha2.mode	@ltx/en_us_dedes/miscellanea:misc.Mode6
ltx/en_us_dedes/oc.m6.d7:ocMA.Aposticha2.text	Willingly You underwent * life-giving death, as our Savior, * and became the well of life, * and to the believers gave eternal delight, * all by Your most divine * tender-love, O Master, * only sinless and compassionate. * We now entreat You for * those who have reposed in the faith and hope * of resurrection, to forgive * all their sins and place them in Your delight; * thus in every manner Your name might be extolled by all, O Christ, * and being saved we might glorify * Your plan, O benevolent God.
ltx/en_us_dedes/oc.m6.d7:ocMA.Aposticha3.greekmelody	@ltx/en_us_dedes/he.a.m6:heAU.OlinApothemenoi.greekname
ltx/en_us_dedes/oc.m6.d7:ocMA.Aposticha3.incipit	Christ, we know that You…
ltx/en_us_dedes/oc.m6.d7:ocMA.Aposticha3.melody	@ltx/en_us_dedes/he.a.m6:heAU.OlinApothemenoi.name
ltx/en_us_dedes/oc.m6.d7:ocMA.Aposticha3.mode	@ltx/en_us_dedes/miscellanea:misc.Mode6
ltx/en_us_dedes/oc.m6.d7:ocMA.Aposticha3.text	Christ, we know that You are Lord * of both the dead and the living, * and You rule by Your divine * power and authority. * Hence we pray to You * and entreat on behalf * of Your faithful servants, * who have died and passed away to You, * who are benevolent, * that You give them rest with all Your elect, * where they will be refreshed indeed, * in the brilliant splendor of all Your Saints. * You delight in mercy, * our God and benefactor, and You save * those whom You formed in Your image, O only very merciful Lord.
ltx/en_us_dedes/oc.m6.d7:ocMA.C1.acrostic.notice1	
ltx/en_us_dedes/oc.m6.d7:ocMA.C1.acrostic.text	
ltx/en_us_dedes/oc.m6.d7:ocMA.C1.acrostic.title	Canon for all the Saints.
ltx/en_us_dedes/oc.m6.d7:ocMA.C2.acrostic.notice1	
ltx/en_us_dedes/oc.m6.d7:ocMA.C2.acrostic.text	
ltx/en_us_dedes/oc.m6.d7:ocMA.C2.acrostic.title	Canon for the Deceased.
ltx/en_us_dedes/oc.m6.d7:ocMA.Kathisma11.greekmelody	@ltx/en_us_dedes/he.a.m6:heAU.AngelikaiDynameis.greekname
ltx/en_us_dedes/oc.m6.d7:ocMA.Kathisma11.incipit	@ltx/en_us_dedes/oc.m6.d3:ocMA.Kathisma32.incipit
ltx/en_us_dedes/oc.m6.d7:ocMA.Kathisma11.melody	@ltx/en_us_dedes/he.a.m6:heAU.AngelikaiDynameis.name
ltx/en_us_dedes/oc.m6.d7:ocMA.Kathisma11.mode	@ltx/en_us_dedes/miscellanea:misc.Mode6
ltx/en_us_dedes/oc.m6.d7:ocMA.Kathisma11.text	@ltx/en_us_dedes/oc.m6.d3:ocMA.Kathisma32.text
ltx/en_us_dedes/oc.m6.d7:ocMA.Kathisma12.incipit	@ltx/en_us_dedes/oc.m6.d4:ocMA.Kathisma32.incipit
ltx/en_us_dedes/oc.m6.d7:ocMA.Kathisma12.melody	
ltx/en_us_dedes/oc.m6.d7:ocMA.Kathisma12.mode	@ltx/en_us_dedes/miscellanea:misc.Mode6
ltx/en_us_dedes/oc.m6.d7:ocMA.Kathisma12.text	@ltx/en_us_dedes/oc.m6.d4:ocMA.Kathisma32.text
ltx/en_us_dedes/oc.m6.d7:ocMA.Kathisma13.incipit	@ltx/en_us_dedes/oc.m6.d5:ocMA.Kathisma32.incipit
ltx/en_us_dedes/oc.m6.d7:ocMA.Kathisma13.melody	
ltx/en_us_dedes/oc.m6.d7:ocMA.Kathisma13.mode	@ltx/en_us_dedes/miscellanea:misc.Mode6
ltx/en_us_dedes/oc.m6.d7:ocMA.Kathisma13.text	@ltx/en_us_dedes/oc.m6.d5:ocMA.Kathisma32.text
ltx/en_us_dedes/oc.m6.d7:ocMA.Kathisma14.incipit	@ltx/en_us_dedes/oc.m6.d1:ocVE.ApolTheotokionVM.incipit
ltx/en_us_dedes/oc.m6.d7:ocMA.Kathisma14.melody	
ltx/en_us_dedes/oc.m6.d7:ocMA.Kathisma14.mode	@ltx/en_us_dedes/miscellanea:misc.Mode6
ltx/en_us_dedes/oc.m6.d7:ocMA.Kathisma14.text	@ltx/en_us_dedes/oc.m6.d1:ocVE.ApolTheotokionVM.text
ltx/en_us_dedes/oc.m6.d7:ocMA.Kathisma21.incipit	@ltx/en_us_dedes/oc.m6.d2:ocMA.Kathisma32.incipit
ltx/en_us_dedes/oc.m6.d7:ocMA.Kathisma21.melody	
ltx/en_us_dedes/oc.m6.d7:ocMA.Kathisma21.mode	@ltx/en_us_dedes/miscellanea:misc.Mode6
ltx/en_us_dedes/oc.m6.d7:ocMA.Kathisma21.text	@ltx/en_us_dedes/oc.m6.d2:ocMA.Kathisma32.text
ltx/en_us_dedes/oc.m6.d7:ocMA.Kathisma22.incipit	Everything is truly vanity…
ltx/en_us_dedes/oc.m6.d7:ocMA.Kathisma22.melody	
ltx/en_us_dedes/oc.m6.d7:ocMA.Kathisma22.mode	@ltx/en_us_dedes/miscellanea:misc.Mode6
ltx/en_us_dedes/oc.m6.d7:ocMA.Kathisma22.text	Everything is truly vanity, and earthly life is a shadow and a dream. Every man stirs himself up in vain, as the Scripture says. Once we gain the world, then we attain the grave, where kings and poor dwell together. Therefore, O Christ God, grant rest to those who have passed away, since You are benevolent.
ltx/en_us_dedes/oc.m6.d7:ocMA.Kathisma23.greekmelody	@ltx/en_us_dedes/he.a.m6:heAU.ElpisTouKosmouAgathi.greekname
ltx/en_us_dedes/oc.m6.d7:ocMA.Kathisma23.incipit	You are for us who…
ltx/en_us_dedes/oc.m6.d7:ocMA.Kathisma23.melody	@ltx/en_us_dedes/he.a.m6:heAU.ElpisTouKosmouAgathi.name
ltx/en_us_dedes/oc.m6.d7:ocMA.Kathisma23.mode	@ltx/en_us_dedes/miscellanea:misc.Mode6
ltx/en_us_dedes/oc.m6.d7:ocMA.Kathisma23.text	You are for us who are on earth * a powerful protection, * as the one who in time gave birth * in the flesh to the timeless * Son and Logos of God, O Mary Mother of God. * Now as His Mother pray * to Him in earnest with the saints, * the Martyrs and the Prophets * and the ascetic Saints, * to save those who have departed.
ltx/en_us_dedes/oc.m6.d7:ocMA.Lauds1.incipit	@ltx/en_us_dedes/oc.m6.d2:ocMA.Aposticha3.incipit
ltx/en_us_dedes/oc.m6.d7:ocMA.Lauds1.melody	
ltx/en_us_dedes/oc.m6.d7:ocMA.Lauds1.mode	@ltx/en_us_dedes/miscellanea:misc.Mode6
ltx/en_us_dedes/oc.m6.d7:ocMA.Lauds1.text	@ltx/en_us_dedes/oc.m6.d2:ocMA.Aposticha3.text
ltx/en_us_dedes/oc.m6.d7:ocMA.Lauds2.incipit	@ltx/en_us_dedes/oc.m6.d3:ocMA.Aposticha3.incipit
ltx/en_us_dedes/oc.m6.d7:ocMA.Lauds2.melody	
ltx/en_us_dedes/oc.m6.d7:ocMA.Lauds2.mode	@ltx/en_us_dedes/miscellanea:misc.Mode6
ltx/en_us_dedes/oc.m6.d7:ocMA.Lauds2.text	@ltx/en_us_dedes/oc.m6.d3:ocMA.Aposticha3.text
ltx/en_us_dedes/oc.m6.d7:ocMA.Lauds3.incipit	@ltx/en_us_dedes/oc.m6.d4:ocMA.Aposticha3.incipit
ltx/en_us_dedes/oc.m6.d7:ocMA.Lauds3.melody	
ltx/en_us_dedes/oc.m6.d7:ocMA.Lauds3.mode	@ltx/en_us_dedes/miscellanea:misc.Mode6
ltx/en_us_dedes/oc.m6.d7:ocMA.Lauds3.text	@ltx/en_us_dedes/oc.m6.d4:ocMA.Aposticha3.text
ltx/en_us_dedes/oc.m6.d7:ocMA.Lauds4.incipit	@ltx/en_us_dedes/oc.m6.d5:ocMA.Aposticha3.incipit
ltx/en_us_dedes/oc.m6.d7:ocMA.Lauds4.melody	
ltx/en_us_dedes/oc.m6.d7:ocMA.Lauds4.mode	@ltx/en_us_dedes/miscellanea:misc.Mode6
ltx/en_us_dedes/oc.m6.d7:ocMA.Lauds4.text	@ltx/en_us_dedes/oc.m6.d5:ocMA.Aposticha3.text
ltx/en_us_dedes/oc.m6.d7:ocMA.LaudsGlory.incipit	Savior, You honored the work…
ltx/en_us_dedes/oc.m6.d7:ocMA.LaudsGlory.melody	
ltx/en_us_dedes/oc.m6.d7:ocMA.LaudsGlory.mode	@ltx/en_us_dedes/miscellanea:misc.Mode6
ltx/en_us_dedes/oc.m6.d7:ocMA.LaudsGlory.text	Savior, You honored the work of Your hands by Your image, depicting the likeness of the noetic essence in material form. You gave me to participate in it, by setting me to rule using free will over things on earth, O Word. Therefore, O Savior, give rest to Your servants, in the land of the living, where the righteous dwell.
ltx/en_us_dedes/oc.m6.d7:ocMA.LaudsRubric1.text	@ltx/en_us_dedes/oc.m1.d7:ocMA.LaudsRubric1.text
ltx/en_us_dedes/oc.m6.d7:ocMA.LaudsTheotokion.incipit	You are our God, who…
ltx/en_us_dedes/oc.m6.d7:ocMA.LaudsTheotokion.melody	
ltx/en_us_dedes/oc.m6.d7:ocMA.LaudsTheotokion.mode	@ltx/en_us_dedes/miscellanea:misc.Mode6
ltx/en_us_dedes/oc.m6.d7:ocMA.LaudsTheotokion.text	You are our God, who in wisdom creates and fills all things. O Christ, You sent Prophets to prophesy Your coming, and Apostles to proclaim Your mighty works. The former prophesied Your coming, and the latter illumined the nations through baptism. Martyrs suffered and attained what they longed for; and all these, together with Your Mother, intercede with You. O God, grant rest to the souls that You have taken to yourself, and also count us worthy of Your kingdom. You are the one who endured the Cross for me who am condemned, O my Redeemer and God.
ltx/en_us_dedes/oc.m6.d7:ocMA.MM.Alleluia.text	@ltx/en_us_dedes/properties:media.key
ltx/en_us_dedes/oc.m6.d7:ocMA.OdeW1C11.incipit	…
ltx/en_us_dedes/oc.m6.d7:ocMA.OdeW1C11.melody	@ltx/en_us_dedes/he.h.m6:heHE.OAisthitosFarao.name
ltx/en_us_dedes/oc.m6.d7:ocMA.OdeW1C11.mode	@ltx/en_us_dedes/miscellanea:misc.Mode6
ltx/en_us_dedes/oc.m6.d7:ocMA.OdeW1C11.ode	@ltx/en_us_dedes/miscellanea:misc.Ode1
ltx/en_us_dedes/oc.m6.d7:ocMA.OdeW1C11.text	
ltx/en_us_dedes/oc.m6.d7:ocMA.OdeW1C12.incipit	…
ltx/en_us_dedes/oc.m6.d7:ocMA.OdeW1C12.melody	@ltx/en_us_dedes/he.h.m6:heHE.OAisthitosFarao.name
ltx/en_us_dedes/oc.m6.d7:ocMA.OdeW1C12.mode	@ltx/en_us_dedes/miscellanea:misc.Mode6
ltx/en_us_dedes/oc.m6.d7:ocMA.OdeW1C12.ode	@ltx/en_us_dedes/miscellanea:misc.Ode1
ltx/en_us_dedes/oc.m6.d7:ocMA.OdeW1C12.text	
ltx/en_us_dedes/oc.m6.d7:ocMA.OdeW1C13.incipit	…
ltx/en_us_dedes/oc.m6.d7:ocMA.OdeW1C13.melody	@ltx/en_us_dedes/he.h.m6:heHE.OAisthitosFarao.name
ltx/en_us_dedes/oc.m6.d7:ocMA.OdeW1C13.mode	@ltx/en_us_dedes/miscellanea:misc.Mode6
ltx/en_us_dedes/oc.m6.d7:ocMA.OdeW1C13.ode	@ltx/en_us_dedes/miscellanea:misc.Ode1
ltx/en_us_dedes/oc.m6.d7:ocMA.OdeW1C13.text	
ltx/en_us_dedes/oc.m6.d7:ocMA.OdeW1C14.incipit	…
ltx/en_us_dedes/oc.m6.d7:ocMA.OdeW1C14.melody	@ltx/en_us_dedes/he.h.m6:heHE.OAisthitosFarao.name
ltx/en_us_dedes/oc.m6.d7:ocMA.OdeW1C14.mode	@ltx/en_us_dedes/miscellanea:misc.Mode6
ltx/en_us_dedes/oc.m6.d7:ocMA.OdeW1C14.ode	@ltx/en_us_dedes/miscellanea:misc.Ode1
ltx/en_us_dedes/oc.m6.d7:ocMA.OdeW1C14.text	
ltx/en_us_dedes/oc.m6.d7:ocMA.OdeW1C1H.greekmelody	@ltx/en_us_dedes/he.h.m6:heHE.OAisthitosFarao.greekname
ltx/en_us_dedes/oc.m6.d7:ocMA.OdeW1C1H.incipit	@ltx/en_us_dedes/he.h.m6:heHE.OAisthitosFarao.incipit
ltx/en_us_dedes/oc.m6.d7:ocMA.OdeW1C1H.melody	@ltx/en_us_dedes/he.h.m6:heHE.OAisthitosFarao.melody
ltx/en_us_dedes/oc.m6.d7:ocMA.OdeW1C1H.mode	@ltx/en_us_dedes/miscellanea:misc.Mode6
ltx/en_us_dedes/oc.m6.d7:ocMA.OdeW1C1H.ode	@ltx/en_us_dedes/miscellanea:misc.Ode1
ltx/en_us_dedes/oc.m6.d7:ocMA.OdeW1C1H.text	@ltx/en_us_dedes/he.h.m6:heHE.OAisthitosFarao.text
ltx/en_us_dedes/oc.m6.d7:ocMA.OdeW1C1T.incipit	…
ltx/en_us_dedes/oc.m6.d7:ocMA.OdeW1C1T.melody	@ltx/en_us_dedes/he.h.m6:heHE.OAisthitosFarao.name
ltx/en_us_dedes/oc.m6.d7:ocMA.OdeW1C1T.mode	@ltx/en_us_dedes/miscellanea:misc.Mode6
ltx/en_us_dedes/oc.m6.d7:ocMA.OdeW1C1T.ode	@ltx/en_us_dedes/miscellanea:misc.Ode1
ltx/en_us_dedes/oc.m6.d7:ocMA.OdeW1C1T.text	
ltx/en_us_dedes/oc.m6.d7:ocMA.OdeW1C21.greekmelody	@ltx/en_us_dedes/he.h.m6:heHE.OsEnIpeiroPezefsas.greekname
ltx/en_us_dedes/oc.m6.d7:ocMA.OdeW1C21.incipit	In the celestial chambers forevermore…
ltx/en_us_dedes/oc.m6.d7:ocMA.OdeW1C21.melody	@ltx/en_us_dedes/he.h.m6:heHE.OsEnIpeiroPezefsas.name
ltx/en_us_dedes/oc.m6.d7:ocMA.OdeW1C21.mode	@ltx/en_us_dedes/miscellanea:misc.Mode6
ltx/en_us_dedes/oc.m6.d7:ocMA.OdeW1C21.ode	@ltx/en_us_dedes/miscellanea:misc.Ode1
ltx/en_us_dedes/oc.m6.d7:ocMA.OdeW1C21.text	In the celestial chambers forevermore, * the courageous martyr saints importunely pray to You: * Grant the faithful whom You have transferred * from the earth, that they obtain eternal goods, O Christ.
ltx/en_us_dedes/oc.m6.d7:ocMA.OdeW1C22.incipit	After adorning with order all…
ltx/en_us_dedes/oc.m6.d7:ocMA.OdeW1C22.melody	@ltx/en_us_dedes/he.h.m6:heHE.OsEnIpeiroPezefsas.name
ltx/en_us_dedes/oc.m6.d7:ocMA.OdeW1C22.mode	@ltx/en_us_dedes/miscellanea:misc.Mode6
ltx/en_us_dedes/oc.m6.d7:ocMA.OdeW1C22.ode	@ltx/en_us_dedes/miscellanea:misc.Ode1
ltx/en_us_dedes/oc.m6.d7:ocMA.OdeW1C22.text	After adorning with order all things, O Lord, * You made me the human being a composite animal * between greatness and humility. * Thus, O Savior, grant repose unto Your servants’ souls.
ltx/en_us_dedes/oc.m6.d7:ocMA.OdeW1C23.incipit	In the beginning You ordered…
ltx/en_us_dedes/oc.m6.d7:ocMA.OdeW1C23.melody	@ltx/en_us_dedes/he.h.m6:heHE.OsEnIpeiroPezefsas.name
ltx/en_us_dedes/oc.m6.d7:ocMA.OdeW1C23.mode	@ltx/en_us_dedes/miscellanea:misc.Mode6
ltx/en_us_dedes/oc.m6.d7:ocMA.OdeW1C23.ode	@ltx/en_us_dedes/miscellanea:misc.Ode1
ltx/en_us_dedes/oc.m6.d7:ocMA.OdeW1C23.text	In the beginning You ordered that I should be * a citizen of Paradise and its tiller. But when I * disobeyed, then You evicted me. * Thus, O Savior, grant repose unto Your servants’ souls.
ltx/en_us_dedes/oc.m6.d7:ocMA.OdeW1C2T.incipit	He who of old formed…
ltx/en_us_dedes/oc.m6.d7:ocMA.OdeW1C2T.melody	@ltx/en_us_dedes/he.h.m6:heHE.OsEnIpeiroPezefsas.name
ltx/en_us_dedes/oc.m6.d7:ocMA.OdeW1C2T.mode	@ltx/en_us_dedes/miscellanea:misc.Mode6
ltx/en_us_dedes/oc.m6.d7:ocMA.OdeW1C2T.ode	@ltx/en_us_dedes/miscellanea:misc.Ode1
ltx/en_us_dedes/oc.m6.d7:ocMA.OdeW1C2T.text	He who of old formed our own primal mother Eve * from a rib of Adam now has arrayed himself in flesh * taken from your undefiled womb, * O pure Lady. Thereby He dissolved the might of death.
ltx/en_us_dedes/oc.m6.d7:ocMA.OdeW3C11.incipit	…
ltx/en_us_dedes/oc.m6.d7:ocMA.OdeW3C11.melody	@ltx/en_us_dedes/he.h.m6:heHE.EnTiSterraTisPisteos.name
ltx/en_us_dedes/oc.m6.d7:ocMA.OdeW3C11.mode	@ltx/en_us_dedes/miscellanea:misc.Mode6
ltx/en_us_dedes/oc.m6.d7:ocMA.OdeW3C11.ode	@ltx/en_us_dedes/miscellanea:misc.Ode3
ltx/en_us_dedes/oc.m6.d7:ocMA.OdeW3C11.text	
ltx/en_us_dedes/oc.m6.d7:ocMA.OdeW3C12.incipit	…
ltx/en_us_dedes/oc.m6.d7:ocMA.OdeW3C12.melody	@ltx/en_us_dedes/he.h.m6:heHE.EnTiSterraTisPisteos.name
ltx/en_us_dedes/oc.m6.d7:ocMA.OdeW3C12.mode	@ltx/en_us_dedes/miscellanea:misc.Mode6
ltx/en_us_dedes/oc.m6.d7:ocMA.OdeW3C12.ode	@ltx/en_us_dedes/miscellanea:misc.Ode3
ltx/en_us_dedes/oc.m6.d7:ocMA.OdeW3C12.text	
ltx/en_us_dedes/oc.m6.d7:ocMA.OdeW3C13.incipit	…
ltx/en_us_dedes/oc.m6.d7:ocMA.OdeW3C13.melody	@ltx/en_us_dedes/he.h.m6:heHE.EnTiSterraTisPisteos.name
ltx/en_us_dedes/oc.m6.d7:ocMA.OdeW3C13.mode	@ltx/en_us_dedes/miscellanea:misc.Mode6
ltx/en_us_dedes/oc.m6.d7:ocMA.OdeW3C13.ode	@ltx/en_us_dedes/miscellanea:misc.Ode3
ltx/en_us_dedes/oc.m6.d7:ocMA.OdeW3C13.text	
ltx/en_us_dedes/oc.m6.d7:ocMA.OdeW3C14.incipit	…
ltx/en_us_dedes/oc.m6.d7:ocMA.OdeW3C14.melody	@ltx/en_us_dedes/he.h.m6:heHE.EnTiSterraTisPisteos.name
ltx/en_us_dedes/oc.m6.d7:ocMA.OdeW3C14.mode	@ltx/en_us_dedes/miscellanea:misc.Mode6
ltx/en_us_dedes/oc.m6.d7:ocMA.OdeW3C14.ode	@ltx/en_us_dedes/miscellanea:misc.Ode3
ltx/en_us_dedes/oc.m6.d7:ocMA.OdeW3C14.text	
ltx/en_us_dedes/oc.m6.d7:ocMA.OdeW3C1H.greekmelody	@ltx/en_us_dedes/he.h.m6:heHE.EnTiSterraTisPisteos.greekname
ltx/en_us_dedes/oc.m6.d7:ocMA.OdeW3C1H.incipit	@ltx/en_us_dedes/he.h.m6:heHE.EnTiSterraTisPisteos.incipit
ltx/en_us_dedes/oc.m6.d7:ocMA.OdeW3C1H.melody	@ltx/en_us_dedes/he.h.m6:heHE.EnTiSterraTisPisteos.melody
ltx/en_us_dedes/oc.m6.d7:ocMA.OdeW3C1H.mode	@ltx/en_us_dedes/miscellanea:misc.Mode6
ltx/en_us_dedes/oc.m6.d7:ocMA.OdeW3C1H.ode	@ltx/en_us_dedes/miscellanea:misc.Ode3
ltx/en_us_dedes/oc.m6.d7:ocMA.OdeW3C1H.text	@ltx/en_us_dedes/he.h.m6:heHE.EnTiSterraTisPisteos.text
ltx/en_us_dedes/oc.m6.d7:ocMA.OdeW3C1T.incipit	…
ltx/en_us_dedes/oc.m6.d7:ocMA.OdeW3C1T.melody	@ltx/en_us_dedes/he.h.m6:heHE.EnTiSterraTisPisteos.name
ltx/en_us_dedes/oc.m6.d7:ocMA.OdeW3C1T.mode	@ltx/en_us_dedes/miscellanea:misc.Mode6
ltx/en_us_dedes/oc.m6.d7:ocMA.OdeW3C1T.ode	@ltx/en_us_dedes/miscellanea:misc.Ode3
ltx/en_us_dedes/oc.m6.d7:ocMA.OdeW3C1T.text	
ltx/en_us_dedes/oc.m6.d7:ocMA.OdeW3C21.greekmelody	@ltx/en_us_dedes/he.h.m6:heHE.OukEstinAgios.greekname
ltx/en_us_dedes/oc.m6.d7:ocMA.OdeW3C21.incipit	Your martyr athletes did compete…
ltx/en_us_dedes/oc.m6.d7:ocMA.OdeW3C21.melody	@ltx/en_us_dedes/he.h.m6:heHE.OukEstinAgios.name
ltx/en_us_dedes/oc.m6.d7:ocMA.OdeW3C21.mode	@ltx/en_us_dedes/miscellanea:misc.Mode6
ltx/en_us_dedes/oc.m6.d7:ocMA.OdeW3C21.ode	@ltx/en_us_dedes/miscellanea:misc.Ode3
ltx/en_us_dedes/oc.m6.d7:ocMA.OdeW3C21.text	Your martyr athletes did compete * lawfully, O Life-giver. * And adorned with the crowns of the victory by You, * from You they ask the eternal redemption for the faithful passed away.
ltx/en_us_dedes/oc.m6.d7:ocMA.OdeW3C22.incipit	With many portents and with…
ltx/en_us_dedes/oc.m6.d7:ocMA.OdeW3C22.melody	@ltx/en_us_dedes/he.h.m6:heHE.OukEstinAgios.name
ltx/en_us_dedes/oc.m6.d7:ocMA.OdeW3C22.mode	@ltx/en_us_dedes/miscellanea:misc.Mode6
ltx/en_us_dedes/oc.m6.d7:ocMA.OdeW3C22.ode	@ltx/en_us_dedes/miscellanea:misc.Ode3
ltx/en_us_dedes/oc.m6.d7:ocMA.OdeW3C22.text	With many portents and with signs * in the past You chastised me * who was wand’ring in error. * In these latter days, O Lord, * You emptied yourself, and thus sought and found and saved me, O compassionate One.
ltx/en_us_dedes/oc.m6.d7:ocMA.OdeW3C23.incipit	O Good One, justify by…
ltx/en_us_dedes/oc.m6.d7:ocMA.OdeW3C23.melody	@ltx/en_us_dedes/he.h.m6:heHE.OukEstinAgios.name
ltx/en_us_dedes/oc.m6.d7:ocMA.OdeW3C23.mode	@ltx/en_us_dedes/miscellanea:misc.Mode6
ltx/en_us_dedes/oc.m6.d7:ocMA.OdeW3C23.ode	@ltx/en_us_dedes/miscellanea:misc.Ode3
ltx/en_us_dedes/oc.m6.d7:ocMA.OdeW3C23.text	O Good One, justify by faith * and by grace those who parted * from the unstable motion of things in flux unto You, * and count them worthy to dwell in eternal habitations pleasantly.
ltx/en_us_dedes/oc.m6.d7:ocMA.OdeW3C2T.incipit	No one is free of…
ltx/en_us_dedes/oc.m6.d7:ocMA.OdeW3C2T.melody	@ltx/en_us_dedes/he.h.m6:heHE.OukEstinAgios.name
ltx/en_us_dedes/oc.m6.d7:ocMA.OdeW3C2T.mode	@ltx/en_us_dedes/miscellanea:misc.Mode6
ltx/en_us_dedes/oc.m6.d7:ocMA.OdeW3C2T.ode	@ltx/en_us_dedes/miscellanea:misc.Ode3
ltx/en_us_dedes/oc.m6.d7:ocMA.OdeW3C2T.text	No one is free of blame like you, * O all-pure Theotokos. * You alone of all women in your womb ever conceived * without a man and gave birth to the true God * who destroyed the power of death.
ltx/en_us_dedes/oc.m6.d7:ocMA.OdeW4C11.incipit	…
ltx/en_us_dedes/oc.m6.d7:ocMA.OdeW4C11.melody	@ltx/en_us_dedes/he.h.m6:heHE.AkikoaKyrieTinAkoin.name
ltx/en_us_dedes/oc.m6.d7:ocMA.OdeW4C11.mode	@ltx/en_us_dedes/miscellanea:misc.Mode6
ltx/en_us_dedes/oc.m6.d7:ocMA.OdeW4C11.ode	@ltx/en_us_dedes/miscellanea:misc.Ode4
ltx/en_us_dedes/oc.m6.d7:ocMA.OdeW4C11.text	
ltx/en_us_dedes/oc.m6.d7:ocMA.OdeW4C12.incipit	…
ltx/en_us_dedes/oc.m6.d7:ocMA.OdeW4C12.melody	@ltx/en_us_dedes/he.h.m6:heHE.AkikoaKyrieTinAkoin.name
ltx/en_us_dedes/oc.m6.d7:ocMA.OdeW4C12.mode	@ltx/en_us_dedes/miscellanea:misc.Mode6
ltx/en_us_dedes/oc.m6.d7:ocMA.OdeW4C12.ode	@ltx/en_us_dedes/miscellanea:misc.Ode4
ltx/en_us_dedes/oc.m6.d7:ocMA.OdeW4C12.text	
ltx/en_us_dedes/oc.m6.d7:ocMA.OdeW4C13.incipit	…
ltx/en_us_dedes/oc.m6.d7:ocMA.OdeW4C13.melody	@ltx/en_us_dedes/he.h.m6:heHE.AkikoaKyrieTinAkoin.name
ltx/en_us_dedes/oc.m6.d7:ocMA.OdeW4C13.mode	@ltx/en_us_dedes/miscellanea:misc.Mode6
ltx/en_us_dedes/oc.m6.d7:ocMA.OdeW4C13.ode	@ltx/en_us_dedes/miscellanea:misc.Ode4
ltx/en_us_dedes/oc.m6.d7:ocMA.OdeW4C13.text	
ltx/en_us_dedes/oc.m6.d7:ocMA.OdeW4C14.incipit	…
ltx/en_us_dedes/oc.m6.d7:ocMA.OdeW4C14.melody	@ltx/en_us_dedes/he.h.m6:heHE.AkikoaKyrieTinAkoin.name
ltx/en_us_dedes/oc.m6.d7:ocMA.OdeW4C14.mode	@ltx/en_us_dedes/miscellanea:misc.Mode6
ltx/en_us_dedes/oc.m6.d7:ocMA.OdeW4C14.ode	@ltx/en_us_dedes/miscellanea:misc.Ode4
ltx/en_us_dedes/oc.m6.d7:ocMA.OdeW4C14.text	
ltx/en_us_dedes/oc.m6.d7:ocMA.OdeW4C1H.greekmelody	@ltx/en_us_dedes/he.h.m6:heHE.AkikoaKyrieTinAkoin.greekname
ltx/en_us_dedes/oc.m6.d7:ocMA.OdeW4C1H.incipit	@ltx/en_us_dedes/he.h.m6:heHE.AkikoaKyrieTinAkoin.incipit
ltx/en_us_dedes/oc.m6.d7:ocMA.OdeW4C1H.melody	@ltx/en_us_dedes/he.h.m6:heHE.AkikoaKyrieTinAkoin.melody
ltx/en_us_dedes/oc.m6.d7:ocMA.OdeW4C1H.mode	@ltx/en_us_dedes/miscellanea:misc.Mode6
ltx/en_us_dedes/oc.m6.d7:ocMA.OdeW4C1H.ode	@ltx/en_us_dedes/miscellanea:misc.Ode4
ltx/en_us_dedes/oc.m6.d7:ocMA.OdeW4C1H.text	@ltx/en_us_dedes/he.h.m6:heHE.AkikoaKyrieTinAkoin.text
ltx/en_us_dedes/oc.m6.d7:ocMA.OdeW4C1T.incipit	…
ltx/en_us_dedes/oc.m6.d7:ocMA.OdeW4C1T.melody	@ltx/en_us_dedes/he.h.m6:heHE.AkikoaKyrieTinAkoin.name
ltx/en_us_dedes/oc.m6.d7:ocMA.OdeW4C1T.mode	@ltx/en_us_dedes/miscellanea:misc.Mode6
ltx/en_us_dedes/oc.m6.d7:ocMA.OdeW4C1T.ode	@ltx/en_us_dedes/miscellanea:misc.Ode4
ltx/en_us_dedes/oc.m6.d7:ocMA.OdeW4C1T.text	
ltx/en_us_dedes/oc.m6.d7:ocMA.OdeW4C21.greekmelody	@ltx/en_us_dedes/he.h.m6:heHE.ChristosMouDynamis.greekname
ltx/en_us_dedes/oc.m6.d7:ocMA.OdeW4C21.incipit	You put the choruses of…
ltx/en_us_dedes/oc.m6.d7:ocMA.OdeW4C21.melody	@ltx/en_us_dedes/he.h.m6:heHE.ChristosMouDynamis.name
ltx/en_us_dedes/oc.m6.d7:ocMA.OdeW4C21.mode	@ltx/en_us_dedes/miscellanea:misc.Mode6
ltx/en_us_dedes/oc.m6.d7:ocMA.OdeW4C21.ode	@ltx/en_us_dedes/miscellanea:misc.Ode4
ltx/en_us_dedes/oc.m6.d7:ocMA.OdeW4C21.text	You put the choruses of martyrs with the hosts * of the angels and showed thus the tokens of * superior wisdom and Your superexcellent goodness * with regard to gifts, O sovereign Lord.
ltx/en_us_dedes/oc.m6.d7:ocMA.OdeW4C22.incipit	That they who were translated…
ltx/en_us_dedes/oc.m6.d7:ocMA.OdeW4C22.melody	@ltx/en_us_dedes/he.h.m6:heHE.ChristosMouDynamis.name
ltx/en_us_dedes/oc.m6.d7:ocMA.OdeW4C22.mode	@ltx/en_us_dedes/miscellanea:misc.Mode6
ltx/en_us_dedes/oc.m6.d7:ocMA.OdeW4C22.ode	@ltx/en_us_dedes/miscellanea:misc.Ode4
ltx/en_us_dedes/oc.m6.d7:ocMA.OdeW4C22.text	That they who were translated unto You attain * Your ineffable glory, vouchsafe, O Christ, * wherein is the dwelling place of those who truly rejoice * and the sound of pure exultant joy.
ltx/en_us_dedes/oc.m6.d7:ocMA.OdeW4C23.incipit	Accept them praising Your divine…
ltx/en_us_dedes/oc.m6.d7:ocMA.OdeW4C23.melody	@ltx/en_us_dedes/he.h.m6:heHE.ChristosMouDynamis.name
ltx/en_us_dedes/oc.m6.d7:ocMA.OdeW4C23.mode	@ltx/en_us_dedes/miscellanea:misc.Mode6
ltx/en_us_dedes/oc.m6.d7:ocMA.OdeW4C23.ode	@ltx/en_us_dedes/miscellanea:misc.Ode4
ltx/en_us_dedes/oc.m6.d7:ocMA.OdeW4C23.text	Accept them praising Your divine and sovereign rule, * whom from earth You have taken unto yourself, * making them children of light and also purifying them * from the gloom of sin, merciful Lord.
ltx/en_us_dedes/oc.m6.d7:ocMA.OdeW4C2T.incipit	The Lord selected you, O…
ltx/en_us_dedes/oc.m6.d7:ocMA.OdeW4C2T.melody	@ltx/en_us_dedes/he.h.m6:heHE.ChristosMouDynamis.name
ltx/en_us_dedes/oc.m6.d7:ocMA.OdeW4C2T.mode	@ltx/en_us_dedes/miscellanea:misc.Mode6
ltx/en_us_dedes/oc.m6.d7:ocMA.OdeW4C2T.ode	@ltx/en_us_dedes/miscellanea:misc.Ode4
ltx/en_us_dedes/oc.m6.d7:ocMA.OdeW4C2T.text	The Lord selected you, O Damsel, for himself, * as an all-spotless temple, all-holy ark, * immaculate vessel and the beauty of Jacob, * and the virgin place of holiness.
ltx/en_us_dedes/oc.m6.d7:ocMA.OdeW5C11.incipit	…
ltx/en_us_dedes/oc.m6.d7:ocMA.OdeW5C11.melody	@ltx/en_us_dedes/he.h.m6:heHE.OToFosAnatellon.name
ltx/en_us_dedes/oc.m6.d7:ocMA.OdeW5C11.mode	@ltx/en_us_dedes/miscellanea:misc.Mode6
ltx/en_us_dedes/oc.m6.d7:ocMA.OdeW5C11.ode	@ltx/en_us_dedes/miscellanea:misc.Ode5
ltx/en_us_dedes/oc.m6.d7:ocMA.OdeW5C11.text	
ltx/en_us_dedes/oc.m6.d7:ocMA.OdeW5C12.incipit	…
ltx/en_us_dedes/oc.m6.d7:ocMA.OdeW5C12.melody	@ltx/en_us_dedes/he.h.m6:heHE.OToFosAnatellon.name
ltx/en_us_dedes/oc.m6.d7:ocMA.OdeW5C12.mode	@ltx/en_us_dedes/miscellanea:misc.Mode6
ltx/en_us_dedes/oc.m6.d7:ocMA.OdeW5C12.ode	@ltx/en_us_dedes/miscellanea:misc.Ode5
ltx/en_us_dedes/oc.m6.d7:ocMA.OdeW5C12.text	
ltx/en_us_dedes/oc.m6.d7:ocMA.OdeW5C13.incipit	…
ltx/en_us_dedes/oc.m6.d7:ocMA.OdeW5C13.melody	@ltx/en_us_dedes/he.h.m6:heHE.OToFosAnatellon.name
ltx/en_us_dedes/oc.m6.d7:ocMA.OdeW5C13.mode	@ltx/en_us_dedes/miscellanea:misc.Mode6
ltx/en_us_dedes/oc.m6.d7:ocMA.OdeW5C13.ode	@ltx/en_us_dedes/miscellanea:misc.Ode5
ltx/en_us_dedes/oc.m6.d7:ocMA.OdeW5C13.text	
ltx/en_us_dedes/oc.m6.d7:ocMA.OdeW5C1H.greekmelody	@ltx/en_us_dedes/he.h.m6:heHE.OToFosAnatellon.greekname
ltx/en_us_dedes/oc.m6.d7:ocMA.OdeW5C1H.incipit	@ltx/en_us_dedes/he.h.m6:heHE.OToFosAnatellon.incipit
ltx/en_us_dedes/oc.m6.d7:ocMA.OdeW5C1H.melody	@ltx/en_us_dedes/he.h.m6:heHE.OToFosAnatellon.melody
ltx/en_us_dedes/oc.m6.d7:ocMA.OdeW5C1H.mode	@ltx/en_us_dedes/miscellanea:misc.Mode6
ltx/en_us_dedes/oc.m6.d7:ocMA.OdeW5C1H.ode	@ltx/en_us_dedes/miscellanea:misc.Ode5
ltx/en_us_dedes/oc.m6.d7:ocMA.OdeW5C1H.text	@ltx/en_us_dedes/he.h.m6:heHE.OToFosAnatellon.text
ltx/en_us_dedes/oc.m6.d7:ocMA.OdeW5C1T.incipit	…
ltx/en_us_dedes/oc.m6.d7:ocMA.OdeW5C1T.melody	@ltx/en_us_dedes/he.h.m6:heHE.OToFosAnatellon.name
ltx/en_us_dedes/oc.m6.d7:ocMA.OdeW5C1T.mode	@ltx/en_us_dedes/miscellanea:misc.Mode6
ltx/en_us_dedes/oc.m6.d7:ocMA.OdeW5C1T.ode	@ltx/en_us_dedes/miscellanea:misc.Ode5
ltx/en_us_dedes/oc.m6.d7:ocMA.OdeW5C1T.text	
ltx/en_us_dedes/oc.m6.d7:ocMA.OdeW5C21.greekmelody	@ltx/en_us_dedes/he.h.m6:heHE.ToTheioFengeiSou.greekname
ltx/en_us_dedes/oc.m6.d7:ocMA.OdeW5C21.incipit	The martyr saints have been…
ltx/en_us_dedes/oc.m6.d7:ocMA.OdeW5C21.melody	@ltx/en_us_dedes/he.h.m6:heHE.ToTheioFengeiSou.name
ltx/en_us_dedes/oc.m6.d7:ocMA.OdeW5C21.mode	@ltx/en_us_dedes/miscellanea:misc.Mode6
ltx/en_us_dedes/oc.m6.d7:ocMA.OdeW5C21.ode	@ltx/en_us_dedes/miscellanea:misc.Ode5
ltx/en_us_dedes/oc.m6.d7:ocMA.OdeW5C21.text	The martyr saints have been offered up * even as a sacred whole-burnt offering and as the first-fruits of * human nature unto the glorified God, * and thus for our salvation they ever arbitrate.
ltx/en_us_dedes/oc.m6.d7:ocMA.OdeW5C22.incipit	Bestow the heavenly way of…
ltx/en_us_dedes/oc.m6.d7:ocMA.OdeW5C22.melody	@ltx/en_us_dedes/he.h.m6:heHE.ToTheioFengeiSou.name
ltx/en_us_dedes/oc.m6.d7:ocMA.OdeW5C22.mode	@ltx/en_us_dedes/miscellanea:misc.Mode6
ltx/en_us_dedes/oc.m6.d7:ocMA.OdeW5C22.ode	@ltx/en_us_dedes/miscellanea:misc.Ode5
ltx/en_us_dedes/oc.m6.d7:ocMA.OdeW5C22.text	Bestow the heavenly way of life, * sovereign Master, and the distribution of Your charismatic gifts * on Your faithful servants who have before us gone to sleep, * according them redemption from their offenses all.
ltx/en_us_dedes/oc.m6.d7:ocMA.OdeW5C23.incipit	Vouchsafe to those who are…
ltx/en_us_dedes/oc.m6.d7:ocMA.OdeW5C23.melody	@ltx/en_us_dedes/he.h.m6:heHE.ToTheioFengeiSou.name
ltx/en_us_dedes/oc.m6.d7:ocMA.OdeW5C23.mode	@ltx/en_us_dedes/miscellanea:misc.Mode6
ltx/en_us_dedes/oc.m6.d7:ocMA.OdeW5C23.ode	@ltx/en_us_dedes/miscellanea:misc.Ode5
ltx/en_us_dedes/oc.m6.d7:ocMA.OdeW5C23.text	Vouchsafe to those who are now deceased * Your heavenly rule, Master compassionate, only immortal Lord, * who alone by nature are the Creator of life, * the sea of benevolence truly unsearchable.
ltx/en_us_dedes/oc.m6.d7:ocMA.OdeW5C2T.incipit	O sovereign Lady of all…
ltx/en_us_dedes/oc.m6.d7:ocMA.OdeW5C2T.melody	@ltx/en_us_dedes/he.h.m6:heHE.ToTheioFengeiSou.name
ltx/en_us_dedes/oc.m6.d7:ocMA.OdeW5C2T.mode	@ltx/en_us_dedes/miscellanea:misc.Mode6
ltx/en_us_dedes/oc.m6.d7:ocMA.OdeW5C2T.ode	@ltx/en_us_dedes/miscellanea:misc.Ode5
ltx/en_us_dedes/oc.m6.d7:ocMA.OdeW5C2T.text	O sovereign Lady of all the world, * the Lord who was born from you became the strength and song and salvation of * those who were perishing, and He delivered from the gates * of Hades those who faithfully pronounce you blest.
ltx/en_us_dedes/oc.m6.d7:ocMA.OdeW6C11.incipit	…
ltx/en_us_dedes/oc.m6.d7:ocMA.OdeW6C11.melody	@ltx/en_us_dedes/he.h.m6:heHE.ToKiteiKatapotheis.name
ltx/en_us_dedes/oc.m6.d7:ocMA.OdeW6C11.mode	@ltx/en_us_dedes/miscellanea:misc.Mode6
ltx/en_us_dedes/oc.m6.d7:ocMA.OdeW6C11.ode	@ltx/en_us_dedes/miscellanea:misc.Ode6
ltx/en_us_dedes/oc.m6.d7:ocMA.OdeW6C11.text	
ltx/en_us_dedes/oc.m6.d7:ocMA.OdeW6C12.incipit	…
ltx/en_us_dedes/oc.m6.d7:ocMA.OdeW6C12.melody	@ltx/en_us_dedes/he.h.m6:heHE.ToKiteiKatapotheis.name
ltx/en_us_dedes/oc.m6.d7:ocMA.OdeW6C12.mode	@ltx/en_us_dedes/miscellanea:misc.Mode6
ltx/en_us_dedes/oc.m6.d7:ocMA.OdeW6C12.ode	@ltx/en_us_dedes/miscellanea:misc.Ode6
ltx/en_us_dedes/oc.m6.d7:ocMA.OdeW6C12.text	
ltx/en_us_dedes/oc.m6.d7:ocMA.OdeW6C13.incipit	…
ltx/en_us_dedes/oc.m6.d7:ocMA.OdeW6C13.melody	@ltx/en_us_dedes/he.h.m6:heHE.ToKiteiKatapotheis.name
ltx/en_us_dedes/oc.m6.d7:ocMA.OdeW6C13.mode	@ltx/en_us_dedes/miscellanea:misc.Mode6
ltx/en_us_dedes/oc.m6.d7:ocMA.OdeW6C13.ode	@ltx/en_us_dedes/miscellanea:misc.Ode6
ltx/en_us_dedes/oc.m6.d7:ocMA.OdeW6C13.text	
ltx/en_us_dedes/oc.m6.d7:ocMA.OdeW6C14.incipit	…
ltx/en_us_dedes/oc.m6.d7:ocMA.OdeW6C14.melody	@ltx/en_us_dedes/he.h.m6:heHE.ToKiteiKatapotheis.name
ltx/en_us_dedes/oc.m6.d7:ocMA.OdeW6C14.mode	@ltx/en_us_dedes/miscellanea:misc.Mode6
ltx/en_us_dedes/oc.m6.d7:ocMA.OdeW6C14.ode	@ltx/en_us_dedes/miscellanea:misc.Ode6
ltx/en_us_dedes/oc.m6.d7:ocMA.OdeW6C14.text	
ltx/en_us_dedes/oc.m6.d7:ocMA.OdeW6C1H.greekmelody	@ltx/en_us_dedes/he.h.m6:heHE.ToKiteiKatapotheis.greekname
ltx/en_us_dedes/oc.m6.d7:ocMA.OdeW6C1H.incipit	@ltx/en_us_dedes/he.h.m6:heHE.ToKiteiKatapotheis.incipit
ltx/en_us_dedes/oc.m6.d7:ocMA.OdeW6C1H.melody	@ltx/en_us_dedes/he.h.m6:heHE.ToKiteiKatapotheis.melody
ltx/en_us_dedes/oc.m6.d7:ocMA.OdeW6C1H.mode	@ltx/en_us_dedes/miscellanea:misc.Mode6
ltx/en_us_dedes/oc.m6.d7:ocMA.OdeW6C1H.ode	@ltx/en_us_dedes/miscellanea:misc.Ode6
ltx/en_us_dedes/oc.m6.d7:ocMA.OdeW6C1H.text	@ltx/en_us_dedes/he.h.m6:heHE.ToKiteiKatapotheis.text
ltx/en_us_dedes/oc.m6.d7:ocMA.OdeW6C1T.incipit	…
ltx/en_us_dedes/oc.m6.d7:ocMA.OdeW6C1T.melody	@ltx/en_us_dedes/he.h.m6:heHE.ToKiteiKatapotheis.name
ltx/en_us_dedes/oc.m6.d7:ocMA.OdeW6C1T.mode	@ltx/en_us_dedes/miscellanea:misc.Mode6
ltx/en_us_dedes/oc.m6.d7:ocMA.OdeW6C1T.ode	@ltx/en_us_dedes/miscellanea:misc.Ode6
ltx/en_us_dedes/oc.m6.d7:ocMA.OdeW6C1T.text	
ltx/en_us_dedes/oc.m6.d7:ocMA.OdeW6C21.greekmelody	@ltx/en_us_dedes/he.h.m6:heHE.TouViouTinThalassan.greekname
ltx/en_us_dedes/oc.m6.d7:ocMA.OdeW6C21.incipit	O good One, upon the…
ltx/en_us_dedes/oc.m6.d7:ocMA.OdeW6C21.melody	@ltx/en_us_dedes/he.h.m6:heHE.TouViouTinThalassan.name
ltx/en_us_dedes/oc.m6.d7:ocMA.OdeW6C21.mode	@ltx/en_us_dedes/miscellanea:misc.Mode6
ltx/en_us_dedes/oc.m6.d7:ocMA.OdeW6C21.ode	@ltx/en_us_dedes/miscellanea:misc.Ode6
ltx/en_us_dedes/oc.m6.d7:ocMA.OdeW6C21.text	O good One, upon the cross being nailed, You gathered thus * unto yourself the martyr saints * imitating Your passion, O only Lord. * And therefore we pray to You: * Grant repose unto those translated unto You.
ltx/en_us_dedes/oc.m6.d7:ocMA.OdeW6C22.incipit	From earth You have taken…
ltx/en_us_dedes/oc.m6.d7:ocMA.OdeW6C22.melody	@ltx/en_us_dedes/he.h.m6:heHE.TouViouTinThalassan.name
ltx/en_us_dedes/oc.m6.d7:ocMA.OdeW6C22.mode	@ltx/en_us_dedes/miscellanea:misc.Mode6
ltx/en_us_dedes/oc.m6.d7:ocMA.OdeW6C22.ode	@ltx/en_us_dedes/miscellanea:misc.Ode6
ltx/en_us_dedes/oc.m6.d7:ocMA.OdeW6C22.text	From earth You have taken Your faithful servants to yourself, * Redeemer who are awesome in * Your ineffable glory. Be now well pleased * that they meet You cheerfully on the clouds, * when You come again to judge the world.
ltx/en_us_dedes/oc.m6.d7:ocMA.OdeW6C23.incipit	The fountain of life are…
ltx/en_us_dedes/oc.m6.d7:ocMA.OdeW6C23.melody	@ltx/en_us_dedes/he.h.m6:heHE.TouViouTinThalassan.name
ltx/en_us_dedes/oc.m6.d7:ocMA.OdeW6C23.mode	@ltx/en_us_dedes/miscellanea:misc.Mode6
ltx/en_us_dedes/oc.m6.d7:ocMA.OdeW6C23.ode	@ltx/en_us_dedes/miscellanea:misc.Ode6
ltx/en_us_dedes/oc.m6.d7:ocMA.OdeW6C23.text	The fountain of life are You who in manliness divine, * O Master, brought out those who were * bound in fetters. O Lord, cause Your servants who have faithfully passed away * unto You, to settle in paradisal delight.
ltx/en_us_dedes/oc.m6.d7:ocMA.OdeW6C2T.incipit	To earth we were sent…
ltx/en_us_dedes/oc.m6.d7:ocMA.OdeW6C2T.melody	@ltx/en_us_dedes/he.h.m6:heHE.TouViouTinThalassan.name
ltx/en_us_dedes/oc.m6.d7:ocMA.OdeW6C2T.mode	@ltx/en_us_dedes/miscellanea:misc.Mode6
ltx/en_us_dedes/oc.m6.d7:ocMA.OdeW6C2T.ode	@ltx/en_us_dedes/miscellanea:misc.Ode6
ltx/en_us_dedes/oc.m6.d7:ocMA.OdeW6C2T.text	To earth we were sent again for transgressing the divine * command of our Creator God. * But through you unto heaven were we from earth * exalted, O Virgin Maid, * having shaken off the corruption of death.
ltx/en_us_dedes/oc.m6.d7:ocMA.OdeW7C11.incipit	…
ltx/en_us_dedes/oc.m6.d7:ocMA.OdeW7C11.melody	@ltx/en_us_dedes/he.h.m6:heHE.OTonOsionSouPaidon.name
ltx/en_us_dedes/oc.m6.d7:ocMA.OdeW7C11.mode	@ltx/en_us_dedes/miscellanea:misc.Mode6
ltx/en_us_dedes/oc.m6.d7:ocMA.OdeW7C11.ode	@ltx/en_us_dedes/miscellanea:misc.Ode7
ltx/en_us_dedes/oc.m6.d7:ocMA.OdeW7C11.text	
ltx/en_us_dedes/oc.m6.d7:ocMA.OdeW7C12.incipit	…
ltx/en_us_dedes/oc.m6.d7:ocMA.OdeW7C12.melody	@ltx/en_us_dedes/he.h.m6:heHE.OTonOsionSouPaidon.name
ltx/en_us_dedes/oc.m6.d7:ocMA.OdeW7C12.mode	@ltx/en_us_dedes/miscellanea:misc.Mode6
ltx/en_us_dedes/oc.m6.d7:ocMA.OdeW7C12.ode	@ltx/en_us_dedes/miscellanea:misc.Ode7
ltx/en_us_dedes/oc.m6.d7:ocMA.OdeW7C12.text	
ltx/en_us_dedes/oc.m6.d7:ocMA.OdeW7C13.incipit	…
ltx/en_us_dedes/oc.m6.d7:ocMA.OdeW7C13.melody	@ltx/en_us_dedes/he.h.m6:heHE.OTonOsionSouPaidon.name
ltx/en_us_dedes/oc.m6.d7:ocMA.OdeW7C13.mode	@ltx/en_us_dedes/miscellanea:misc.Mode6
ltx/en_us_dedes/oc.m6.d7:ocMA.OdeW7C13.ode	@ltx/en_us_dedes/miscellanea:misc.Ode7
ltx/en_us_dedes/oc.m6.d7:ocMA.OdeW7C13.text	
ltx/en_us_dedes/oc.m6.d7:ocMA.OdeW7C14.incipit	…
ltx/en_us_dedes/oc.m6.d7:ocMA.OdeW7C14.melody	@ltx/en_us_dedes/he.h.m6:heHE.OTonOsionSouPaidon.name
ltx/en_us_dedes/oc.m6.d7:ocMA.OdeW7C14.mode	@ltx/en_us_dedes/miscellanea:misc.Mode6
ltx/en_us_dedes/oc.m6.d7:ocMA.OdeW7C14.ode	@ltx/en_us_dedes/miscellanea:misc.Ode7
ltx/en_us_dedes/oc.m6.d7:ocMA.OdeW7C14.text	
ltx/en_us_dedes/oc.m6.d7:ocMA.OdeW7C1H.greekmelody	@ltx/en_us_dedes/he.h.m6:heHE.OTonOsionSouPaidon.greekname
ltx/en_us_dedes/oc.m6.d7:ocMA.OdeW7C1H.incipit	@ltx/en_us_dedes/he.h.m6:heHE.OTonOsionSouPaidon.incipit
ltx/en_us_dedes/oc.m6.d7:ocMA.OdeW7C1H.melody	@ltx/en_us_dedes/he.h.m6:heHE.OTonOsionSouPaidon.melody
ltx/en_us_dedes/oc.m6.d7:ocMA.OdeW7C1H.mode	@ltx/en_us_dedes/miscellanea:misc.Mode6
ltx/en_us_dedes/oc.m6.d7:ocMA.OdeW7C1H.ode	@ltx/en_us_dedes/miscellanea:misc.Ode7
ltx/en_us_dedes/oc.m6.d7:ocMA.OdeW7C1H.text	@ltx/en_us_dedes/he.h.m6:heHE.OTonOsionSouPaidon.text
ltx/en_us_dedes/oc.m6.d7:ocMA.OdeW7C1T.incipit	…
ltx/en_us_dedes/oc.m6.d7:ocMA.OdeW7C1T.melody	@ltx/en_us_dedes/he.h.m6:heHE.OTonOsionSouPaidon.name
ltx/en_us_dedes/oc.m6.d7:ocMA.OdeW7C1T.mode	@ltx/en_us_dedes/miscellanea:misc.Mode6
ltx/en_us_dedes/oc.m6.d7:ocMA.OdeW7C1T.ode	@ltx/en_us_dedes/miscellanea:misc.Ode7
ltx/en_us_dedes/oc.m6.d7:ocMA.OdeW7C1T.text	
ltx/en_us_dedes/oc.m6.d7:ocMA.OdeW7C21.greekmelody	@ltx/en_us_dedes/he.h.m6:heHE.DrosovolonMenTinKaminon.greekname
ltx/en_us_dedes/oc.m6.d7:ocMA.OdeW7C21.incipit	Lord, the Martyrs were redeemed…
ltx/en_us_dedes/oc.m6.d7:ocMA.OdeW7C21.melody	@ltx/en_us_dedes/he.h.m6:heHE.DrosovolonMenTinKaminon.name
ltx/en_us_dedes/oc.m6.d7:ocMA.OdeW7C21.mode	@ltx/en_us_dedes/miscellanea:misc.Mode6
ltx/en_us_dedes/oc.m6.d7:ocMA.OdeW7C21.ode	@ltx/en_us_dedes/miscellanea:misc.Ode7
ltx/en_us_dedes/oc.m6.d7:ocMA.OdeW7C21.text	Lord, the Martyrs were redeemed from the primordial * transgression by Your holy blood. * Being sprinkled now with their own blood clearly they portray * the slaughter You willingly endured. * And they cry out: O God of the fathers, blessed are You.
ltx/en_us_dedes/oc.m6.d7:ocMA.OdeW7C22.incipit	O supremely life-originating Word…
ltx/en_us_dedes/oc.m6.d7:ocMA.OdeW7C22.melody	@ltx/en_us_dedes/he.h.m6:heHE.DrosovolonMenTinKaminon.name
ltx/en_us_dedes/oc.m6.d7:ocMA.OdeW7C22.mode	@ltx/en_us_dedes/miscellanea:misc.Mode6
ltx/en_us_dedes/oc.m6.d7:ocMA.OdeW7C22.ode	@ltx/en_us_dedes/miscellanea:misc.Ode7
ltx/en_us_dedes/oc.m6.d7:ocMA.OdeW7C22.text	O supremely life-originating Word of God, * You put insolent death to death. * O benevolent Lord, receive now those who fell asleep * believing, O Christ, and who extol * and sing to You: O God of the fathers, blessed are You.
ltx/en_us_dedes/oc.m6.d7:ocMA.OdeW7C23.incipit	O divinely sovereign Master who…
ltx/en_us_dedes/oc.m6.d7:ocMA.OdeW7C23.melody	@ltx/en_us_dedes/he.h.m6:heHE.DrosovolonMenTinKaminon.name
ltx/en_us_dedes/oc.m6.d7:ocMA.OdeW7C23.mode	@ltx/en_us_dedes/miscellanea:misc.Mode6
ltx/en_us_dedes/oc.m6.d7:ocMA.OdeW7C23.ode	@ltx/en_us_dedes/miscellanea:misc.Ode7
ltx/en_us_dedes/oc.m6.d7:ocMA.OdeW7C23.text	O divinely sovereign Master who by Your divine * breath animated me the man, * in Your mercy, account worthy of Your kingly rule * Your servants who passed away, O Christ, * to sing to You: O God of the fathers, blessed are You.
ltx/en_us_dedes/oc.m6.d7:ocMA.OdeW7C2T.incipit	You became exalted higher than…
ltx/en_us_dedes/oc.m6.d7:ocMA.OdeW7C2T.melody	@ltx/en_us_dedes/he.h.m6:heHE.DrosovolonMenTinKaminon.name
ltx/en_us_dedes/oc.m6.d7:ocMA.OdeW7C2T.mode	@ltx/en_us_dedes/miscellanea:misc.Mode6
ltx/en_us_dedes/oc.m6.d7:ocMA.OdeW7C2T.ode	@ltx/en_us_dedes/miscellanea:misc.Ode7
ltx/en_us_dedes/oc.m6.d7:ocMA.OdeW7C2T.text	You became exalted higher than creation all, * O blameless one, conceiving our God * who has shattered the gates of death and crushed the bars thereof. * And therefore we faithful offer hymns * extolling you, O pure one, as the Mother of our God.
ltx/en_us_dedes/oc.m6.d7:ocMA.OdeW8C11.incipit	…
ltx/en_us_dedes/oc.m6.d7:ocMA.OdeW8C11.melody	@ltx/en_us_dedes/he.h.m6:heHE.OiOsioiSouPaides.name
ltx/en_us_dedes/oc.m6.d7:ocMA.OdeW8C11.mode	@ltx/en_us_dedes/miscellanea:misc.Mode6
ltx/en_us_dedes/oc.m6.d7:ocMA.OdeW8C11.ode	@ltx/en_us_dedes/miscellanea:misc.Ode8
ltx/en_us_dedes/oc.m6.d7:ocMA.OdeW8C11.text	
ltx/en_us_dedes/oc.m6.d7:ocMA.OdeW8C12.incipit	…
ltx/en_us_dedes/oc.m6.d7:ocMA.OdeW8C12.melody	@ltx/en_us_dedes/he.h.m6:heHE.OiOsioiSouPaides.name
ltx/en_us_dedes/oc.m6.d7:ocMA.OdeW8C12.mode	@ltx/en_us_dedes/miscellanea:misc.Mode6
ltx/en_us_dedes/oc.m6.d7:ocMA.OdeW8C12.ode	@ltx/en_us_dedes/miscellanea:misc.Ode8
ltx/en_us_dedes/oc.m6.d7:ocMA.OdeW8C12.text	
ltx/en_us_dedes/oc.m6.d7:ocMA.OdeW8C13.incipit	…
ltx/en_us_dedes/oc.m6.d7:ocMA.OdeW8C13.melody	@ltx/en_us_dedes/he.h.m6:heHE.OiOsioiSouPaides.name
ltx/en_us_dedes/oc.m6.d7:ocMA.OdeW8C13.mode	@ltx/en_us_dedes/miscellanea:misc.Mode6
ltx/en_us_dedes/oc.m6.d7:ocMA.OdeW8C13.ode	@ltx/en_us_dedes/miscellanea:misc.Ode8
ltx/en_us_dedes/oc.m6.d7:ocMA.OdeW8C13.text	
ltx/en_us_dedes/oc.m6.d7:ocMA.OdeW8C1H.greekmelody	@ltx/en_us_dedes/he.h.m6:heHE.OiOsioiSouPaides.greekname
ltx/en_us_dedes/oc.m6.d7:ocMA.OdeW8C1H.incipit	@ltx/en_us_dedes/he.h.m6:heHE.OiOsioiSouPaides.incipit
ltx/en_us_dedes/oc.m6.d7:ocMA.OdeW8C1H.melody	@ltx/en_us_dedes/he.h.m6:heHE.OiOsioiSouPaides.melody
ltx/en_us_dedes/oc.m6.d7:ocMA.OdeW8C1H.mode	@ltx/en_us_dedes/miscellanea:misc.Mode6
ltx/en_us_dedes/oc.m6.d7:ocMA.OdeW8C1H.ode	@ltx/en_us_dedes/miscellanea:misc.Ode8
ltx/en_us_dedes/oc.m6.d7:ocMA.OdeW8C1H.text	@ltx/en_us_dedes/he.h.m6:heHE.OiOsioiSouPaides.text
ltx/en_us_dedes/oc.m6.d7:ocMA.OdeW8C1T.incipit	…
ltx/en_us_dedes/oc.m6.d7:ocMA.OdeW8C1T.melody	@ltx/en_us_dedes/he.h.m6:heHE.OiOsioiSouPaides.name
ltx/en_us_dedes/oc.m6.d7:ocMA.OdeW8C1T.mode	@ltx/en_us_dedes/miscellanea:misc.Mode6
ltx/en_us_dedes/oc.m6.d7:ocMA.OdeW8C1T.ode	@ltx/en_us_dedes/miscellanea:misc.Ode8
ltx/en_us_dedes/oc.m6.d7:ocMA.OdeW8C1T.text	
ltx/en_us_dedes/oc.m6.d7:ocMA.OdeW8C21.greekmelody	@ltx/en_us_dedes/he.h.m6:heHE.EkFlogosToisOsiois.greekname
ltx/en_us_dedes/oc.m6.d7:ocMA.OdeW8C21.incipit	Demonstrating yourselves to be steadfast…
ltx/en_us_dedes/oc.m6.d7:ocMA.OdeW8C21.melody	@ltx/en_us_dedes/he.h.m6:heHE.EkFlogosToisOsiois.name
ltx/en_us_dedes/oc.m6.d7:ocMA.OdeW8C21.mode	@ltx/en_us_dedes/miscellanea:misc.Mode6
ltx/en_us_dedes/oc.m6.d7:ocMA.OdeW8C21.ode	@ltx/en_us_dedes/miscellanea:misc.Ode8
ltx/en_us_dedes/oc.m6.d7:ocMA.OdeW8C21.text	Demonstrating yourselves to be steadfast in the feats * of the contest, O Martyrs of Christ, you were adorned * with the crown of victory, O Prize-winners, crying out: * Unto all the ages, supremely we exalt You.
ltx/en_us_dedes/oc.m6.d7:ocMA.OdeW8C22.incipit	Those believers who sacredly have…
ltx/en_us_dedes/oc.m6.d7:ocMA.OdeW8C22.melody	@ltx/en_us_dedes/he.h.m6:heHE.EkFlogosToisOsiois.name
ltx/en_us_dedes/oc.m6.d7:ocMA.OdeW8C22.mode	@ltx/en_us_dedes/miscellanea:misc.Mode6
ltx/en_us_dedes/oc.m6.d7:ocMA.OdeW8C22.ode	@ltx/en_us_dedes/miscellanea:misc.Ode8
ltx/en_us_dedes/oc.m6.d7:ocMA.OdeW8C22.text	Those believers who sacredly have departed life * and to You, sovereign Master, have passed do now accept * graciously, compassionate Lord, and grant rest to them. * Unto all the ages, supremely they exalt You.
ltx/en_us_dedes/oc.m6.d7:ocMA.OdeW8C23.incipit	Be well pleased, O our…
ltx/en_us_dedes/oc.m6.d7:ocMA.OdeW8C23.melody	@ltx/en_us_dedes/he.h.m6:heHE.EkFlogosToisOsiois.name
ltx/en_us_dedes/oc.m6.d7:ocMA.OdeW8C23.mode	@ltx/en_us_dedes/miscellanea:misc.Mode6
ltx/en_us_dedes/oc.m6.d7:ocMA.OdeW8C23.ode	@ltx/en_us_dedes/miscellanea:misc.Ode8
ltx/en_us_dedes/oc.m6.d7:ocMA.OdeW8C23.text	Be well pleased, O our Savior, that those who fell asleep * before us should abide now in the land of the meek, * having justified them by grace and by faith in You. * Unto all the ages, supremely they exalt You.
ltx/en_us_dedes/oc.m6.d7:ocMA.OdeW8C2T.incipit	O all-blessed and pure one…
ltx/en_us_dedes/oc.m6.d7:ocMA.OdeW8C2T.melody	@ltx/en_us_dedes/he.h.m6:heHE.EkFlogosToisOsiois.name
ltx/en_us_dedes/oc.m6.d7:ocMA.OdeW8C2T.mode	@ltx/en_us_dedes/miscellanea:misc.Mode6
ltx/en_us_dedes/oc.m6.d7:ocMA.OdeW8C2T.ode	@ltx/en_us_dedes/miscellanea:misc.Ode8
ltx/en_us_dedes/oc.m6.d7:ocMA.OdeW8C2T.text	O all-blessed and pure one, we all pronounce you blest, * as the woman who gave birth unto the Word of God * who is truly blest, and became flesh for our sake. * Unto all the ages, supremely we exalt Him.
ltx/en_us_dedes/oc.m6.d7:ocMA.OdeW9C11.incipit	…
ltx/en_us_dedes/oc.m6.d7:ocMA.OdeW9C11.melody	@ltx/en_us_dedes/he.h.m6:heHE.IToChaireDiAngelou.name
ltx/en_us_dedes/oc.m6.d7:ocMA.OdeW9C11.mode	@ltx/en_us_dedes/miscellanea:misc.Mode6
ltx/en_us_dedes/oc.m6.d7:ocMA.OdeW9C11.ode	@ltx/en_us_dedes/miscellanea:misc.Ode9
ltx/en_us_dedes/oc.m6.d7:ocMA.OdeW9C11.text	
ltx/en_us_dedes/oc.m6.d7:ocMA.OdeW9C12.incipit	…
ltx/en_us_dedes/oc.m6.d7:ocMA.OdeW9C12.melody	@ltx/en_us_dedes/he.h.m6:heHE.IToChaireDiAngelou.name
ltx/en_us_dedes/oc.m6.d7:ocMA.OdeW9C12.mode	@ltx/en_us_dedes/miscellanea:misc.Mode6
ltx/en_us_dedes/oc.m6.d7:ocMA.OdeW9C12.ode	@ltx/en_us_dedes/miscellanea:misc.Ode9
ltx/en_us_dedes/oc.m6.d7:ocMA.OdeW9C12.text	
ltx/en_us_dedes/oc.m6.d7:ocMA.OdeW9C13.incipit	…
ltx/en_us_dedes/oc.m6.d7:ocMA.OdeW9C13.melody	@ltx/en_us_dedes/he.h.m6:heHE.IToChaireDiAngelou.name
ltx/en_us_dedes/oc.m6.d7:ocMA.OdeW9C13.mode	@ltx/en_us_dedes/miscellanea:misc.Mode6
ltx/en_us_dedes/oc.m6.d7:ocMA.OdeW9C13.ode	@ltx/en_us_dedes/miscellanea:misc.Ode9
ltx/en_us_dedes/oc.m6.d7:ocMA.OdeW9C13.text	
ltx/en_us_dedes/oc.m6.d7:ocMA.OdeW9C14.incipit	…
ltx/en_us_dedes/oc.m6.d7:ocMA.OdeW9C14.melody	@ltx/en_us_dedes/he.h.m6:heHE.IToChaireDiAngelou.name
ltx/en_us_dedes/oc.m6.d7:ocMA.OdeW9C14.mode	@ltx/en_us_dedes/miscellanea:misc.Mode6
ltx/en_us_dedes/oc.m6.d7:ocMA.OdeW9C14.ode	@ltx/en_us_dedes/miscellanea:misc.Ode9
ltx/en_us_dedes/oc.m6.d7:ocMA.OdeW9C14.text	
ltx/en_us_dedes/oc.m6.d7:ocMA.OdeW9C1H.greekmelody	@ltx/en_us_dedes/he.h.m6:heHE.IToChaireDiAngelou.greekname
ltx/en_us_dedes/oc.m6.d7:ocMA.OdeW9C1H.incipit	@ltx/en_us_dedes/he.h.m6:heHE.IToChaireDiAngelou.incipit
ltx/en_us_dedes/oc.m6.d7:ocMA.OdeW9C1H.melody	@ltx/en_us_dedes/he.h.m6:heHE.IToChaireDiAngelou.melody
ltx/en_us_dedes/oc.m6.d7:ocMA.OdeW9C1H.mode	@ltx/en_us_dedes/miscellanea:misc.Mode6
ltx/en_us_dedes/oc.m6.d7:ocMA.OdeW9C1H.ode	@ltx/en_us_dedes/miscellanea:misc.Ode9
ltx/en_us_dedes/oc.m6.d7:ocMA.OdeW9C1H.text	@ltx/en_us_dedes/he.h.m6:heHE.IToChaireDiAngelou.text
ltx/en_us_dedes/oc.m6.d7:ocMA.OdeW9C1T.incipit	…
ltx/en_us_dedes/oc.m6.d7:ocMA.OdeW9C1T.melody	@ltx/en_us_dedes/he.h.m6:heHE.IToChaireDiAngelou.name
ltx/en_us_dedes/oc.m6.d7:ocMA.OdeW9C1T.mode	@ltx/en_us_dedes/miscellanea:misc.Mode6
ltx/en_us_dedes/oc.m6.d7:ocMA.OdeW9C1T.ode	@ltx/en_us_dedes/miscellanea:misc.Ode9
ltx/en_us_dedes/oc.m6.d7:ocMA.OdeW9C1T.text	
ltx/en_us_dedes/oc.m6.d7:ocMA.OdeW9C21.greekmelody	@ltx/en_us_dedes/he.h.m6:heHE.TheonAnthropois.greekname
ltx/en_us_dedes/oc.m6.d7:ocMA.OdeW9C21.incipit	The hope of blessings to…
ltx/en_us_dedes/oc.m6.d7:ocMA.OdeW9C21.melody	@ltx/en_us_dedes/he.h.m6:heHE.TheonAnthropois.name
ltx/en_us_dedes/oc.m6.d7:ocMA.OdeW9C21.mode	@ltx/en_us_dedes/miscellanea:misc.Mode6
ltx/en_us_dedes/oc.m6.d7:ocMA.OdeW9C21.ode	@ltx/en_us_dedes/miscellanea:misc.Ode9
ltx/en_us_dedes/oc.m6.d7:ocMA.OdeW9C21.text	The hope of blessings to come intensified * the choirs of the martyr saints, and towards ardent love for You * it incited them, being for them a clear * foretoken of the truly unshakeable repose; * which to the departed faithful grant, since You are good, O Lord.
ltx/en_us_dedes/oc.m6.d7:ocMA.OdeW9C22.incipit	O Christ, deem worthy of…
ltx/en_us_dedes/oc.m6.d7:ocMA.OdeW9C22.melody	@ltx/en_us_dedes/he.h.m6:heHE.TheonAnthropois.name
ltx/en_us_dedes/oc.m6.d7:ocMA.OdeW9C22.mode	@ltx/en_us_dedes/miscellanea:misc.Mode6
ltx/en_us_dedes/oc.m6.d7:ocMA.OdeW9C22.ode	@ltx/en_us_dedes/miscellanea:misc.Ode9
ltx/en_us_dedes/oc.m6.d7:ocMA.OdeW9C22.text	O Christ, deem worthy of Your divine and bright * illumination those who have in faith been translated hence; * and as You alone are very merciful, * grant them repose within the bosom of Abraham; * and account them worthy of Your own eternal blessedness.
ltx/en_us_dedes/oc.m6.d7:ocMA.OdeW9C23.incipit	Since You are gracious and…
ltx/en_us_dedes/oc.m6.d7:ocMA.OdeW9C23.melody	@ltx/en_us_dedes/he.h.m6:heHE.TheonAnthropois.name
ltx/en_us_dedes/oc.m6.d7:ocMA.OdeW9C23.mode	@ltx/en_us_dedes/miscellanea:misc.Mode6
ltx/en_us_dedes/oc.m6.d7:ocMA.OdeW9C23.ode	@ltx/en_us_dedes/miscellanea:misc.Ode9
ltx/en_us_dedes/oc.m6.d7:ocMA.OdeW9C23.text	Since You are gracious and all-compassionate * by nature, and delight in steadfast love and are an abyss * of compassion, O Savior, to those whom You * translated from this place of punishment and from the * shadow of death, wherein shines Your light assign a place, O Lord.
ltx/en_us_dedes/oc.m6.d7:ocMA.OdeW9C2T.incipit	O pure one, we know…
ltx/en_us_dedes/oc.m6.d7:ocMA.OdeW9C2T.melody	@ltx/en_us_dedes/he.h.m6:heHE.TheonAnthropois.name
ltx/en_us_dedes/oc.m6.d7:ocMA.OdeW9C2T.mode	@ltx/en_us_dedes/miscellanea:misc.Mode6
ltx/en_us_dedes/oc.m6.d7:ocMA.OdeW9C2T.ode	@ltx/en_us_dedes/miscellanea:misc.Ode9
ltx/en_us_dedes/oc.m6.d7:ocMA.OdeW9C2T.text	O pure one, we know you as the tablet of * the law of grace, the holy tabernacle and sacred ark. * For through you to those who have been justified * by the blood of the One who became incarnate from * your womb has been given absolution, O all-blameless one.
ltx/en_us_dedes/oc.m6.d7:ocVE.ApolTheotokionVM.incipit	@ltx/en_us_dedes/oc.m6.d1:ocVE.ApolTheotokionVM.incipit
ltx/en_us_dedes/oc.m6.d7:ocVE.ApolTheotokionVM.melody	
ltx/en_us_dedes/oc.m6.d7:ocVE.ApolTheotokionVM.mode	@ltx/en_us_dedes/miscellanea:misc.Mode6
ltx/en_us_dedes/oc.m6.d7:ocVE.ApolTheotokionVM.text	@ltx/en_us_dedes/oc.m6.d1:ocVE.ApolTheotokionVM.text
ltx/en_us_dedes/oc.m6.d7:ocVE.AposTheotokion.greekmelody	@ltx/en_us_dedes/he.a.m6:heAU.TriimerosAnestis.greekname
ltx/en_us_dedes/oc.m6.d7:ocVE.AposTheotokion.incipit	O Christ, at the entreaties…
ltx/en_us_dedes/oc.m6.d7:ocVE.AposTheotokion.melody	@ltx/en_us_dedes/he.a.m6:heAU.TriimerosAnestis.name
ltx/en_us_dedes/oc.m6.d7:ocVE.AposTheotokion.mode	@ltx/en_us_dedes/miscellanea:misc.Mode6
ltx/en_us_dedes/oc.m6.d7:ocVE.AposTheotokion.text	O Christ, at the entreaties of her * who bore You, and of all the Saints, * of your Martyrs, * your Apostles, Hierarchs, * monastic Saints and Prophets, * together with the Righteous, * repose Your servants who have fallen asleep.
ltx/en_us_dedes/oc.m6.d7:ocVE.Aposticha1.incipit	@ltx/en_us_dedes/oc.m6.d2:ocVE.Aposticha3.incipit
ltx/en_us_dedes/oc.m6.d7:ocVE.Aposticha1.melody	
ltx/en_us_dedes/oc.m6.d7:ocVE.Aposticha1.mode	@ltx/en_us_dedes/miscellanea:misc.Mode6
ltx/en_us_dedes/oc.m6.d7:ocVE.Aposticha1.text	@ltx/en_us_dedes/oc.m6.d2:ocVE.Aposticha3.text
ltx/en_us_dedes/oc.m6.d7:ocVE.Aposticha2.incipit	Your creative command was my…
ltx/en_us_dedes/oc.m6.d7:ocVE.Aposticha2.melody	
ltx/en_us_dedes/oc.m6.d7:ocVE.Aposticha2.mode	@ltx/en_us_dedes/miscellanea:misc.Mode6
ltx/en_us_dedes/oc.m6.d7:ocVE.Aposticha2.text	Your creative command was my beginning and real existence; for wishing to construct me as a living creature from both visible and invisible natures, You fashioned my body from earth, and You gave me a soul by Your divine and life-giving breath. Therefore, O Savior, give rest to Your servants, in the land of the living, where the righteous dwell.
ltx/en_us_dedes/oc.m6.d7:ocVE.Aposticha3.incipit	Of old in Eden…
ltx/en_us_dedes/oc.m6.d7:ocVE.Aposticha3.melody	
ltx/en_us_dedes/oc.m6.d7:ocVE.Aposticha3.mode	@ltx/en_us_dedes/miscellanea:misc.Mode6
ltx/en_us_dedes/oc.m6.d7:ocVE.Aposticha3.text	Of old in Eden, the eating of the fruit turned out to be painful, when the serpent spat out his venom. Through Adam, death entered, and it devoured the entire human race. Then the Master came and put the dragon down, and He granted us resurrection. Let us shout to Him, “Spare us, O Savior; and to those whom You have taken grant repose with Your elect.”
ltx/en_us_dedes/oc.m6.d7:ocVE.SticTheotokion.incipit	@ltx/en_us_dedes/oc.m6.d1:ocVE.SticTheotokion.incipit
ltx/en_us_dedes/oc.m6.d7:ocVE.SticTheotokion.melody	
ltx/en_us_dedes/oc.m6.d7:ocVE.SticTheotokion.mode	@ltx/en_us_dedes/miscellanea:misc.Mode6
ltx/en_us_dedes/oc.m6.d7:ocVE.SticTheotokion.text	@ltx/en_us_dedes/oc.m6.d1:ocVE.SticTheotokion.text
ltx/en_us_dedes/oc.m6.d7:ocVE.Stichera1.greekmelody	@ltx/en_us_dedes/he.a.m6:heAU.IApegnosmeni.greekname
ltx/en_us_dedes/oc.m6.d7:ocVE.Stichera1.incipit	Save me from perdition which…
ltx/en_us_dedes/oc.m6.d7:ocVE.Stichera1.melody	@ltx/en_us_dedes/he.a.m6:heAU.IApegnosmeni.name
ltx/en_us_dedes/oc.m6.d7:ocVE.Stichera1.mode	@ltx/en_us_dedes/miscellanea:misc.Mode6
ltx/en_us_dedes/oc.m6.d7:ocVE.Stichera1.text	Save me from perdition which has been laid up. * O most righteous Judge, rescue me the convict * from the everlasting fire; O Master, I beseech You. * Make me impervious to surgings * against me, O Word of God. * Mis’rable that I am, I shudder * when I stop and consider * the multitude of my offenses, * and I fall down to You with tears and a contrite heart * humbly requesting Your mercy, O Lord.
ltx/en_us_dedes/oc.m6.d7:ocVE.Stichera2.incipit	Who would not lament me…
ltx/en_us_dedes/oc.m6.d7:ocVE.Stichera2.melody	@ltx/en_us_dedes/he.a.m6:heAU.IApegnosmeni.name
ltx/en_us_dedes/oc.m6.d7:ocVE.Stichera2.mode	@ltx/en_us_dedes/miscellanea:misc.Mode6
ltx/en_us_dedes/oc.m6.d7:ocVE.Stichera2.text	Who would not lament me who from my lack of * self-control have broken the Lord’s commandment; * for me who instead of Paradise inhabit Hades? * Food sweet to me in its appearance * has turned into bitterness. * Unto Your glory and to Angels * have I become a stranger. * Sympathetic God, as I repent now * accept me, since You are humane and very merciful, * because of Your great mercy, O Lord.
ltx/en_us_dedes/oc.m6.d7:ocVE.Stichera3.incipit	…
ltx/en_us_dedes/oc.m6.d7:ocVE.Stichera3.melody	@ltx/en_us_dedes/he.a.m6:heAU.IApegnosmeni.name
ltx/en_us_dedes/oc.m6.d7:ocVE.Stichera3.mode	@ltx/en_us_dedes/miscellanea:misc.Mode6
ltx/en_us_dedes/oc.m6.d7:ocVE.Stichera3.text	
ltx/en_us_dedes/oc.m6.d7:ocVE.Stichera4.incipit	@ltx/en_us_dedes/oc.m6.d3:ocVE.Aposticha3.incipit
ltx/en_us_dedes/oc.m6.d7:ocVE.Stichera4.melody	
ltx/en_us_dedes/oc.m6.d7:ocVE.Stichera4.mode	@ltx/en_us_dedes/miscellanea:misc.Mode6
ltx/en_us_dedes/oc.m6.d7:ocVE.Stichera4.text	@ltx/en_us_dedes/oc.m6.d3:ocVE.Aposticha3.text
ltx/en_us_dedes/oc.m6.d7:ocVE.Stichera5.incipit	@ltx/en_us_dedes/oc.m6.d4:ocVE.Aposticha3.incipit
ltx/en_us_dedes/oc.m6.d7:ocVE.Stichera5.melody	
ltx/en_us_dedes/oc.m6.d7:ocVE.Stichera5.mode	@ltx/en_us_dedes/miscellanea:misc.Mode6
ltx/en_us_dedes/oc.m6.d7:ocVE.Stichera5.text	@ltx/en_us_dedes/oc.m6.d4:ocVE.Aposticha3.text
ltx/en_us_dedes/oc.m6.d7:ocVE.Stichera6.incipit	@ltx/en_us_dedes/oc.m6.d5:ocVE.Aposticha3.incipit
ltx/en_us_dedes/oc.m6.d7:ocVE.Stichera6.melody	
ltx/en_us_dedes/oc.m6.d7:ocVE.Stichera6.mode	@ltx/en_us_dedes/miscellanea:misc.Mode6
ltx/en_us_dedes/oc.m6.d7:ocVE.Stichera6.text	@ltx/en_us_dedes/oc.m6.d5:ocVE.Aposticha3.text
ltx/en_us_dedes/oc.m6.d7:octrMA.AposTheotokion.incipit	@ltx/en_us_dedes/oc.m6.d7:ocMA.AposTheotokion.incipit
ltx/en_us_dedes/oc.m6.d7:octrMA.AposTheotokion.melody	@ltx/en_us_dedes/oc.m6.d7:ocMA.AposTheotokion.melody
ltx/en_us_dedes/oc.m6.d7:octrMA.AposTheotokion.mode	@ltx/en_us_dedes/miscellanea:misc.Mode6
ltx/en_us_dedes/oc.m6.d7:octrMA.AposTheotokion.text	@ltx/en_us_dedes/oc.m6.d7:ocMA.AposTheotokion.text
ltx/en_us_dedes/oc.m6.d7:octrMA.Aposticha1.greekmelody	@ltx/en_us_dedes/oc.m6.d7:ocMA.Aposticha1.greekmelody
ltx/en_us_dedes/oc.m6.d7:octrMA.Aposticha1.incipit	@ltx/en_us_dedes/oc.m6.d7:ocMA.Aposticha1.incipit
ltx/en_us_dedes/oc.m6.d7:octrMA.Aposticha1.melody	@ltx/en_us_dedes/oc.m6.d7:ocMA.Aposticha1.melody
ltx/en_us_dedes/oc.m6.d7:octrMA.Aposticha1.mode	@ltx/en_us_dedes/miscellanea:misc.Mode6
ltx/en_us_dedes/oc.m6.d7:octrMA.Aposticha1.text	@ltx/en_us_dedes/oc.m6.d7:ocMA.Aposticha1.text
ltx/en_us_dedes/oc.m6.d7:octrMA.Aposticha2.incipit	@ltx/en_us_dedes/oc.m6.d7:ocMA.Aposticha2.incipit
ltx/en_us_dedes/oc.m6.d7:octrMA.Aposticha2.melody	@ltx/en_us_dedes/oc.m6.d7:ocMA.Aposticha2.melody
ltx/en_us_dedes/oc.m6.d7:octrMA.Aposticha2.mode	@ltx/en_us_dedes/miscellanea:misc.Mode6
ltx/en_us_dedes/oc.m6.d7:octrMA.Aposticha2.text	@ltx/en_us_dedes/oc.m6.d7:ocMA.Aposticha2.text
ltx/en_us_dedes/oc.m6.d7:octrMA.Aposticha3.incipit	@ltx/en_us_dedes/oc.m6.d7:ocMA.Aposticha3.incipit
ltx/en_us_dedes/oc.m6.d7:octrMA.Aposticha3.melody	@ltx/en_us_dedes/oc.m6.d7:ocMA.Aposticha3.melody
ltx/en_us_dedes/oc.m6.d7:octrMA.Aposticha3.mode	@ltx/en_us_dedes/miscellanea:misc.Mode6
ltx/en_us_dedes/oc.m6.d7:octrMA.Aposticha3.text	@ltx/en_us_dedes/oc.m6.d7:ocMA.Aposticha3.text
ltx/en_us_dedes/oc.m6.d7:octrMA.Kathisma11.incipit	@ltx/en_us_dedes/oc.m6.d7:ocMA.Kathisma12.incipit
ltx/en_us_dedes/oc.m6.d7:octrMA.Kathisma11.melody	
ltx/en_us_dedes/oc.m6.d7:octrMA.Kathisma11.mode	@ltx/en_us_dedes/miscellanea:misc.Mode6
ltx/en_us_dedes/oc.m6.d7:octrMA.Kathisma11.text	@ltx/en_us_dedes/oc.m6.d7:ocMA.Kathisma12.text
ltx/en_us_dedes/oc.m6.d7:octrMA.Kathisma12.greekmelody	@ltx/en_us_dedes/oc.m6.d7:ocMA.Kathisma11.greekmelody
ltx/en_us_dedes/oc.m6.d7:octrMA.Kathisma12.incipit	@ltx/en_us_dedes/oc.m6.d7:ocMA.Kathisma11.incipit
ltx/en_us_dedes/oc.m6.d7:octrMA.Kathisma12.melody	@ltx/en_us_dedes/oc.m6.d7:ocMA.Kathisma11.melody
ltx/en_us_dedes/oc.m6.d7:octrMA.Kathisma12.mode	@ltx/en_us_dedes/miscellanea:misc.Mode6
ltx/en_us_dedes/oc.m6.d7:octrMA.Kathisma12.text	@ltx/en_us_dedes/oc.m6.d7:ocMA.Kathisma11.text
ltx/en_us_dedes/oc.m6.d7:octrMA.Kathisma13.incipit	@ltx/en_us_dedes/oc.m6.d7:ocMA.Kathisma13.incipit
ltx/en_us_dedes/oc.m6.d7:octrMA.Kathisma13.melody	
ltx/en_us_dedes/oc.m6.d7:octrMA.Kathisma13.mode	@ltx/en_us_dedes/miscellanea:misc.Mode6
ltx/en_us_dedes/oc.m6.d7:octrMA.Kathisma13.text	@ltx/en_us_dedes/oc.m6.d7:ocMA.Kathisma13.text
ltx/en_us_dedes/oc.m6.d7:octrMA.Kathisma14.incipit	@ltx/en_us_dedes/oc.m6.d7:ocMA.Kathisma22.incipit
ltx/en_us_dedes/oc.m6.d7:octrMA.Kathisma14.melody	
ltx/en_us_dedes/oc.m6.d7:octrMA.Kathisma14.mode	@ltx/en_us_dedes/miscellanea:misc.Mode6
ltx/en_us_dedes/oc.m6.d7:octrMA.Kathisma14.text	@ltx/en_us_dedes/oc.m6.d7:ocMA.Kathisma22.text
ltx/en_us_dedes/oc.m6.d7:octrMA.Kathisma1T.greekmelody	@ltx/en_us_dedes/oc.m6.d3:ocMA.Kathisma23.greekmelody
ltx/en_us_dedes/oc.m6.d7:octrMA.Kathisma1T.incipit	@ltx/en_us_dedes/oc.m6.d3:ocMA.Kathisma23.incipit
ltx/en_us_dedes/oc.m6.d7:octrMA.Kathisma1T.melody	@ltx/en_us_dedes/oc.m6.d3:ocMA.Kathisma23.melody
ltx/en_us_dedes/oc.m6.d7:octrMA.Kathisma1T.mode	@ltx/en_us_dedes/miscellanea:misc.Mode6
ltx/en_us_dedes/oc.m6.d7:octrMA.Kathisma1T.text	@ltx/en_us_dedes/oc.m6.d3:ocMA.Kathisma23.text
ltx/en_us_dedes/oc.m6.d7:octrMA.Lauds1.incipit	@ltx/en_us_dedes/oc.m6.d7:ocMA.Lauds1.incipit
ltx/en_us_dedes/oc.m6.d7:octrMA.Lauds1.melody	
ltx/en_us_dedes/oc.m6.d7:octrMA.Lauds1.mode	@ltx/en_us_dedes/miscellanea:misc.Mode6
ltx/en_us_dedes/oc.m6.d7:octrMA.Lauds1.text	@ltx/en_us_dedes/oc.m6.d7:ocMA.Lauds1.text
ltx/en_us_dedes/oc.m6.d7:octrMA.Lauds2.incipit	@ltx/en_us_dedes/oc.m6.d7:ocMA.Lauds2.incipit
ltx/en_us_dedes/oc.m6.d7:octrMA.Lauds2.melody	
ltx/en_us_dedes/oc.m6.d7:octrMA.Lauds2.mode	@ltx/en_us_dedes/miscellanea:misc.Mode6
ltx/en_us_dedes/oc.m6.d7:octrMA.Lauds2.text	@ltx/en_us_dedes/oc.m6.d7:ocMA.Lauds2.text
ltx/en_us_dedes/oc.m6.d7:octrMA.Lauds3.incipit	@ltx/en_us_dedes/oc.m6.d7:ocMA.Lauds3.incipit
ltx/en_us_dedes/oc.m6.d7:octrMA.Lauds3.melody	
ltx/en_us_dedes/oc.m6.d7:octrMA.Lauds3.mode	@ltx/en_us_dedes/miscellanea:misc.Mode6
ltx/en_us_dedes/oc.m6.d7:octrMA.Lauds3.text	@ltx/en_us_dedes/oc.m6.d7:ocMA.Lauds3.text
ltx/en_us_dedes/oc.m6.d7:octrMA.Lauds4.incipit	@ltx/en_us_dedes/oc.m6.d7:ocMA.Lauds4.incipit
ltx/en_us_dedes/oc.m6.d7:octrMA.Lauds4.melody	
ltx/en_us_dedes/oc.m6.d7:octrMA.Lauds4.mode	@ltx/en_us_dedes/miscellanea:misc.Mode6
ltx/en_us_dedes/oc.m6.d7:octrMA.Lauds4.text	@ltx/en_us_dedes/oc.m6.d7:ocMA.Lauds4.text
ltx/en_us_dedes/oc.m6.d7:octrMA.LaudsGlory.incipit	@ltx/en_us_dedes/oc.m6.d7:ocVE.Aposticha3.incipit
ltx/en_us_dedes/oc.m6.d7:octrMA.LaudsGlory.melody	
ltx/en_us_dedes/oc.m6.d7:octrMA.LaudsGlory.mode	@ltx/en_us_dedes/miscellanea:misc.Mode6
ltx/en_us_dedes/oc.m6.d7:octrMA.LaudsGlory.text	@ltx/en_us_dedes/oc.m6.d7:ocVE.Aposticha3.text
ltx/en_us_dedes/oc.m6.d7:octrMA.LaudsTheotokion.greekmelody	@ltx/en_us_dedes/oc.m6.d7:ocVE.AposTheotokion.greekmelody
ltx/en_us_dedes/oc.m6.d7:octrMA.LaudsTheotokion.incipit	@ltx/en_us_dedes/oc.m6.d7:ocVE.AposTheotokion.incipit
ltx/en_us_dedes/oc.m6.d7:octrMA.LaudsTheotokion.melody	@ltx/en_us_dedes/oc.m6.d7:ocVE.AposTheotokion.melody
ltx/en_us_dedes/oc.m6.d7:octrMA.LaudsTheotokion.mode	@ltx/en_us_dedes/miscellanea:misc.Mode6
ltx/en_us_dedes/oc.m6.d7:octrMA.LaudsTheotokion.text	@ltx/en_us_dedes/oc.m6.d7:ocVE.AposTheotokion.text
ltx/en_us_dedes/oc.m6.d7:octrMA.Photogogic.incipit	@ltx/en_us_dedes/oc.m6.d2:octrMA.Photagogic.incipit
ltx/en_us_dedes/oc.m6.d7:octrMA.Photogogic.mode	@ltx/en_us_dedes/miscellanea:misc.Mode6
ltx/en_us_dedes/oc.m6.d7:octrMA.Photogogic.text	@ltx/en_us_dedes/oc.m6.d2:octrMA.Photagogic.text
ltx/en_us_dedes/oc.m6.d7:octrVE.SticBoth.incipit	@ltx/en_us_dedes/oc.m6.d7:ocVE.SticTheotokion.incipit
ltx/en_us_dedes/oc.m6.d7:octrVE.SticBoth.melody	
ltx/en_us_dedes/oc.m6.d7:octrVE.SticBoth.mode	@ltx/en_us_dedes/miscellanea:misc.Mode6
ltx/en_us_dedes/oc.m6.d7:octrVE.SticBoth.text	@ltx/en_us_dedes/oc.m6.d7:ocVE.SticTheotokion.text
ltx/en_us_dedes/oc.m6.d7:octrVE.SticGlory.incipit	@ltx/en_us_dedes/oc.m6.d7:ocVE.Aposticha2.incipit
ltx/en_us_dedes/oc.m6.d7:octrVE.SticGlory.melody	
ltx/en_us_dedes/oc.m6.d7:octrVE.SticGlory.mode	@ltx/en_us_dedes/miscellanea:misc.Mode6
ltx/en_us_dedes/oc.m6.d7:octrVE.SticGlory.text	@ltx/en_us_dedes/oc.m6.d7:ocVE.Aposticha2.text
ltx/en_us_dedes/oc.m6.d7:octrVE.Stichera1.incipit	@ltx/en_us_dedes/oc.m6.d7:ocVE.Aposticha1.incipit
ltx/en_us_dedes/oc.m6.d7:octrVE.Stichera1.melody	
ltx/en_us_dedes/oc.m6.d7:octrVE.Stichera1.mode	@ltx/en_us_dedes/miscellanea:misc.Mode6
ltx/en_us_dedes/oc.m6.d7:octrVE.Stichera1.text	@ltx/en_us_dedes/oc.m6.d7:ocVE.Aposticha1.text
ltx/en_us_dedes/oc.m6.d7:octrVE.Stichera2.incipit	@ltx/en_us_dedes/oc.m6.d3:ocVE.Aposticha3.incipit
ltx/en_us_dedes/oc.m6.d7:octrVE.Stichera2.melody	
ltx/en_us_dedes/oc.m6.d7:octrVE.Stichera2.mode	@ltx/en_us_dedes/miscellanea:misc.Mode6
ltx/en_us_dedes/oc.m6.d7:octrVE.Stichera2.text	@ltx/en_us_dedes/oc.m6.d3:ocVE.Aposticha3.text
ltx/en_us_dedes/oc.m6.d7:octrVE.Stichera3.incipit	@ltx/en_us_dedes/oc.m6.d4:ocVE.Aposticha3.incipit
ltx/en_us_dedes/oc.m6.d7:octrVE.Stichera3.melody	
ltx/en_us_dedes/oc.m6.d7:octrVE.Stichera3.mode	@ltx/en_us_dedes/miscellanea:misc.Mode6
ltx/en_us_dedes/oc.m6.d7:octrVE.Stichera3.text	@ltx/en_us_dedes/oc.m6.d4:ocVE.Aposticha3.text
ltx/en_us_dedes/oc.m6.d7:octrVE.Stichera4.incipit	@ltx/en_us_dedes/oc.m6.d5:ocVE.Aposticha3.incipit
ltx/en_us_dedes/oc.m6.d7:octrVE.Stichera4.melody	
ltx/en_us_dedes/oc.m6.d7:octrVE.Stichera4.mode	@ltx/en_us_dedes/miscellanea:misc.Mode6
ltx/en_us_dedes/oc.m6.d7:octrVE.Stichera4.text	@ltx/en_us_dedes/oc.m6.d5:ocVE.Aposticha3.text
