ltx/en_us_dedes/sy.m04.d13:cl.syMA.commemoration01.text	[saint/com 1]
ltx/en_us_dedes/sy.m04.d13:cl.syMA.commemoration02.text	[saint/com 2]
ltx/en_us_dedes/sy.m04.d13:cl.syMA.commemoration03.text	[saint/com 3]
ltx/en_us_dedes/sy.m04.d13:cl.syMA.commemoration04.text	[saint/com 4]
ltx/en_us_dedes/sy.m04.d13:cl.syMA.commemoration05.text	[saint/com 5]
ltx/en_us_dedes/sy.m04.d13:cl.syMA.commemoration06.text	[saint/com list]
ltx/en_us_dedes/sy.m04.d13:syMA.commemoration01.couplet1.title	@ltx/en_us_dedes/titles:ti.Verses
ltx/en_us_dedes/sy.m04.d13:syMA.commemoration01.couplet1.verse1	
ltx/en_us_dedes/sy.m04.d13:syMA.commemoration01.couplet1.verse2	
ltx/en_us_dedes/sy.m04.d13:syMA.commemoration01.narration.p01	
ltx/en_us_dedes/sy.m04.d13:syMA.commemoration01.single1	
ltx/en_us_dedes/sy.m04.d13:syMA.commemoration01.text	On April 13, we commemorate our father among the saints Martin the Confessor, Pope of Rome.
ltx/en_us_dedes/sy.m04.d13:syMA.commemoration02.couplet1.title	@ltx/en_us_dedes/titles:ti.Verses
ltx/en_us_dedes/sy.m04.d13:syMA.commemoration02.couplet1.verse1	
ltx/en_us_dedes/sy.m04.d13:syMA.commemoration02.couplet1.verse2	
ltx/en_us_dedes/sy.m04.d13:syMA.commemoration02.narration.p01	
ltx/en_us_dedes/sy.m04.d13:syMA.commemoration02.text	On this day we also commemorate the holy martyrs Maximus, Quintilian, and Dadas.
ltx/en_us_dedes/sy.m04.d13:syMA.commemoration03.couplet1.title	@ltx/en_us_dedes/titles:ti.Verses
ltx/en_us_dedes/sy.m04.d13:syMA.commemoration03.couplet1.verse1	
ltx/en_us_dedes/sy.m04.d13:syMA.commemoration03.couplet1.verse2	
ltx/en_us_dedes/sy.m04.d13:syMA.commemoration03.text	On this day we also commemorate the holy martyr Eleftherios the Persian.
ltx/en_us_dedes/sy.m04.d13:syMA.commemoration04.couplet1.title	@ltx/en_us_dedes/titles:ti.Verses
ltx/en_us_dedes/sy.m04.d13:syMA.commemoration04.couplet1.verse1	
ltx/en_us_dedes/sy.m04.d13:syMA.commemoration04.couplet1.verse2	
ltx/en_us_dedes/sy.m04.d13:syMA.commemoration04.text	On this day we also commemorate the holy martyr Theodosios.
ltx/en_us_dedes/sy.m04.d13:syMA.commemoration05.couplet1.title	@ltx/en_us_dedes/titles:ti.Verses
ltx/en_us_dedes/sy.m04.d13:syMA.commemoration05.couplet1.verse1	
ltx/en_us_dedes/sy.m04.d13:syMA.commemoration05.couplet1.verse2	
ltx/en_us_dedes/sy.m04.d13:syMA.commemoration05.text	On this day we also commemorate the holy martyr Zoilos.
ltx/en_us_dedes/sy.m04.d13:syMA.lastline	By their holy intercessions, O Christ God, have mercy on us. Amen.
