ltx/en_us_dedes/me.m08.d20:meDA.commemoration.first	Memory of the Holy Prophet Samuel
ltx/en_us_dedes/me.m08.d20:meDA.commemoration.first_name	
ltx/en_us_dedes/me.m08.d20:meDA.commemoration.first_short	Memory of the Holy Prophet Samuel
ltx/en_us_dedes/me.m08.d20:meDA.commemoration.first_title	@ltx/en_us_dedes/titles:ti.Prophet
ltx/en_us_dedes/me.m08.d20:meDA.commemoration.full	Memory of the Holy Prophet Samuel
ltx/en_us_dedes/me.m08.d20:meDA.commemoration.second_name	
ltx/en_us_dedes/me.m08.d20:meDA.commemoration.second_title	
ltx/en_us_dedes/me.m08.d20:meDA.date	August 20
ltx/en_us_dedes/me.m08.d20:meDA.fordate	for August 20
ltx/en_us_dedes/me.m08.d20:meDA.insert1	
ltx/en_us_dedes/me.m08.d20:meDA.insert2	
ltx/en_us_dedes/me.m08.d20:meDA.note	
ltx/en_us_dedes/me.m08.d20:meDA.pdfcoverdate	August 20,
ltx/en_us_dedes/me.m08.d20:meDA.pdfheaderdate	August 20
ltx/en_us_dedes/me.m08.d20:meHO.commemorations	
ltx/en_us_dedes/me.m08.d20:meHO.note1	
ltx/en_us_dedes/me.m08.d20:meHO.note2	
ltx/en_us_dedes/me.m08.d20:meHO.number	
ltx/en_us_dedes/me.m08.d20:meHO.rank	
ltx/en_us_dedes/me.m08.d20:meLE.commemoration1	The Holy Prophet Samuel.
ltx/en_us_dedes/me.m08.d20:meLE.commemoration2	
ltx/en_us_dedes/me.m08.d20:meLI.Kontakion1.incipit	…
ltx/en_us_dedes/me.m08.d20:meLI.Kontakion1.melody	
ltx/en_us_dedes/me.m08.d20:meLI.Kontakion1.mode	
ltx/en_us_dedes/me.m08.d20:meLI.Kontakion1.text	
ltx/en_us_dedes/me.m08.d20:meLI.Megalynarion.text	
ltx/en_us_dedes/me.m08.d20:meMA.AposGlory.incipit	@ltx/en_us_dedes/me.m08.d16:meVE.AposGlory.incipit
ltx/en_us_dedes/me.m08.d20:meMA.AposGlory.melody	@ltx/en_us_dedes/he.a.m2:heAU.OikosTouEfratha.name
ltx/en_us_dedes/me.m08.d20:meMA.AposGlory.mode	@ltx/en_us_dedes/miscellanea:misc.Mode2
ltx/en_us_dedes/me.m08.d20:meMA.AposGlory.text	@ltx/en_us_dedes/me.m08.d16:meVE.AposGlory.text
ltx/en_us_dedes/me.m08.d20:meMA.Aposticha1.greekmelody	@ltx/en_us_dedes/he.a.m2:heAU.OikosTouEfratha.greekname
ltx/en_us_dedes/me.m08.d20:meMA.Aposticha1.incipit	@ltx/en_us_dedes/me.m08.d16:meVE.AposGlory.incipit
ltx/en_us_dedes/me.m08.d20:meMA.Aposticha1.melody	@ltx/en_us_dedes/he.a.m2:heAU.OikosTouEfratha.name
ltx/en_us_dedes/me.m08.d20:meMA.Aposticha1.mode	@ltx/en_us_dedes/miscellanea:misc.Mode2
ltx/en_us_dedes/me.m08.d20:meMA.Aposticha1.text	@ltx/en_us_dedes/me.m08.d16:meVE.AposGlory.text
ltx/en_us_dedes/me.m08.d20:meMA.Aposticha2.incipit	@ltx/en_us_dedes/me.m08.d16:meVE.Aposticha2.incipit
ltx/en_us_dedes/me.m08.d20:meMA.Aposticha2.melody	@ltx/en_us_dedes/he.a.m2:heAU.OikosTouEfratha.name
ltx/en_us_dedes/me.m08.d20:meMA.Aposticha2.mode	@ltx/en_us_dedes/miscellanea:misc.Mode2
ltx/en_us_dedes/me.m08.d20:meMA.Aposticha2.text	@ltx/en_us_dedes/me.m08.d16:meVE.Aposticha2.text
ltx/en_us_dedes/me.m08.d20:meMA.Aposticha3.incipit	Company of divine * Disciples…
ltx/en_us_dedes/me.m08.d20:meMA.Aposticha3.melody	@ltx/en_us_dedes/he.a.m2:heAU.OikosTouEfratha.name
ltx/en_us_dedes/me.m08.d20:meMA.Aposticha3.mode	@ltx/en_us_dedes/miscellanea:misc.Mode2
ltx/en_us_dedes/me.m08.d20:meMA.Aposticha3.text	Company of divine * Disciples and Apostles, * come to the only Mother * of God, and duly bury her body that had hosted God.
ltx/en_us_dedes/me.m08.d20:meMA.C1.acrostic.notice1	
ltx/en_us_dedes/me.m08.d20:meMA.C1.acrostic.text	
ltx/en_us_dedes/me.m08.d20:meMA.C1.acrostic.title	
ltx/en_us_dedes/me.m08.d20:meMA.C1.title	@ltx/en_us_dedes/titles:ti.CanonProphet
ltx/en_us_dedes/me.m08.d20:meMA.C1.verse	@ltx/en_us_dedes/prayers:pr.verse_Prophet.text
ltx/en_us_dedes/me.m08.d20:meMA.Exaposteilarion1.greekmelody	@ltx/en_us_dedes/he.a.m3:heAU.OOuranonToisAstrois.greekname
ltx/en_us_dedes/me.m08.d20:meMA.Exaposteilarion1.incipit	Let Samuel be extolled now…
ltx/en_us_dedes/me.m08.d20:meMA.Exaposteilarion1.melody	@ltx/en_us_dedes/he.a.m3:heAU.OOuranonToisAstrois.name
ltx/en_us_dedes/me.m08.d20:meMA.Exaposteilarion1.mode	@ltx/en_us_dedes/miscellanea:misc.Mode3
ltx/en_us_dedes/me.m08.d20:meMA.Exaposteilarion1.text	Let Samuel be extolled now. * Even before he was conceived * his all-renowned mother gave him * to the Most High God as a gift. * He is the one who anointed * kings, as a priest and prophet.
ltx/en_us_dedes/me.m08.d20:meMA.Exaposteilarion2.greekmelody	@ltx/en_us_dedes/he.a.m3:heAU.OOuranonToisAstrois.greekname
ltx/en_us_dedes/me.m08.d20:meMA.Exaposteilarion2.incipit	@ltx/en_us_dedes/me.m08.d15:meMA.Exaposteilarion1.incipit
ltx/en_us_dedes/me.m08.d20:meMA.Exaposteilarion2.melody	@ltx/en_us_dedes/he.a.m3:heAU.OOuranonToisAstrois.name
ltx/en_us_dedes/me.m08.d20:meMA.Exaposteilarion2.mode	@ltx/en_us_dedes/miscellanea:misc.Mode3
ltx/en_us_dedes/me.m08.d20:meMA.Exaposteilarion2.text	@ltx/en_us_dedes/me.m08.d15:meMA.Exaposteilarion1.text
ltx/en_us_dedes/me.m08.d20:meMA.Kathisma11.greekmelody	@ltx/en_us_dedes/he.a.m3:heAU.TinOraiotita.greekname
ltx/en_us_dedes/me.m08.d20:meMA.Kathisma11.incipit	@ltx/en_us_dedes/me.m08.d17:meMA.Kathisma11.incipit
ltx/en_us_dedes/me.m08.d20:meMA.Kathisma11.melody	@ltx/en_us_dedes/he.a.m3:heAU.TinOraiotita.name
ltx/en_us_dedes/me.m08.d20:meMA.Kathisma11.mode	@ltx/en_us_dedes/miscellanea:misc.Mode3
ltx/en_us_dedes/me.m08.d20:meMA.Kathisma11.text	@ltx/en_us_dedes/me.m08.d17:meMA.Kathisma11.text
ltx/en_us_dedes/me.m08.d20:meMA.Kathisma21.greekmelody	@ltx/en_us_dedes/he.a.m4:heAU.KateplagiIosif.greekname
ltx/en_us_dedes/me.m08.d20:meMA.Kathisma21.incipit	@ltx/en_us_dedes/me.m08.d16:meMA.Kathisma21.incipit
ltx/en_us_dedes/me.m08.d20:meMA.Kathisma21.melody	@ltx/en_us_dedes/he.a.m4:heAU.KateplagiIosif.name
ltx/en_us_dedes/me.m08.d20:meMA.Kathisma21.mode	@ltx/en_us_dedes/miscellanea:misc.Mode4
ltx/en_us_dedes/me.m08.d20:meMA.Kathisma21.text	@ltx/en_us_dedes/me.m08.d16:meMA.Kathisma21.text
ltx/en_us_dedes/me.m08.d20:meMA.Ode1C11.greekmelody	@ltx/en_us_dedes/he.h.m4:heHE.TristatasKrataious.greekname
ltx/en_us_dedes/me.m08.d20:meMA.Ode1C11.incipit	…
ltx/en_us_dedes/me.m08.d20:meMA.Ode1C11.melody	@ltx/en_us_dedes/he.h.m4:heHE.TristatasKrataious.name
ltx/en_us_dedes/me.m08.d20:meMA.Ode1C11.mode	@ltx/en_us_dedes/miscellanea:misc.Mode4
ltx/en_us_dedes/me.m08.d20:meMA.Ode1C11.ode	@ltx/en_us_dedes/miscellanea:misc.Ode1
ltx/en_us_dedes/me.m08.d20:meMA.Ode1C11.text	
ltx/en_us_dedes/me.m08.d20:meMA.Ode1C12.incipit	…
ltx/en_us_dedes/me.m08.d20:meMA.Ode1C12.melody	@ltx/en_us_dedes/he.h.m4:heHE.TristatasKrataious.name
ltx/en_us_dedes/me.m08.d20:meMA.Ode1C12.mode	@ltx/en_us_dedes/miscellanea:misc.Mode4
ltx/en_us_dedes/me.m08.d20:meMA.Ode1C12.ode	@ltx/en_us_dedes/miscellanea:misc.Ode1
ltx/en_us_dedes/me.m08.d20:meMA.Ode1C12.text	
ltx/en_us_dedes/me.m08.d20:meMA.Ode1C13.incipit	…
ltx/en_us_dedes/me.m08.d20:meMA.Ode1C13.melody	@ltx/en_us_dedes/he.h.m4:heHE.TristatasKrataious.name
ltx/en_us_dedes/me.m08.d20:meMA.Ode1C13.mode	@ltx/en_us_dedes/miscellanea:misc.Mode4
ltx/en_us_dedes/me.m08.d20:meMA.Ode1C13.ode	@ltx/en_us_dedes/miscellanea:misc.Ode1
ltx/en_us_dedes/me.m08.d20:meMA.Ode1C13.text	
ltx/en_us_dedes/me.m08.d20:meMA.Ode1C1T.incipit	…
ltx/en_us_dedes/me.m08.d20:meMA.Ode1C1T.melody	@ltx/en_us_dedes/he.h.m4:heHE.TristatasKrataious.name
ltx/en_us_dedes/me.m08.d20:meMA.Ode1C1T.mode	@ltx/en_us_dedes/miscellanea:misc.Mode4
ltx/en_us_dedes/me.m08.d20:meMA.Ode1C1T.ode	@ltx/en_us_dedes/miscellanea:misc.Ode1
ltx/en_us_dedes/me.m08.d20:meMA.Ode1C1T.text	
ltx/en_us_dedes/me.m08.d20:meMA.Ode3C11.greekmelody	@ltx/en_us_dedes/he.h.m4:heHE.OukEnSofia.greekname
ltx/en_us_dedes/me.m08.d20:meMA.Ode3C11.incipit	…
ltx/en_us_dedes/me.m08.d20:meMA.Ode3C11.melody	@ltx/en_us_dedes/he.h.m4:heHE.OukEnSofia.name
ltx/en_us_dedes/me.m08.d20:meMA.Ode3C11.mode	@ltx/en_us_dedes/miscellanea:misc.Mode4
ltx/en_us_dedes/me.m08.d20:meMA.Ode3C11.ode	@ltx/en_us_dedes/miscellanea:misc.Ode3
ltx/en_us_dedes/me.m08.d20:meMA.Ode3C11.text	
ltx/en_us_dedes/me.m08.d20:meMA.Ode3C12.incipit	…
ltx/en_us_dedes/me.m08.d20:meMA.Ode3C12.melody	@ltx/en_us_dedes/he.h.m4:heHE.OukEnSofia.name
ltx/en_us_dedes/me.m08.d20:meMA.Ode3C12.mode	@ltx/en_us_dedes/miscellanea:misc.Mode4
ltx/en_us_dedes/me.m08.d20:meMA.Ode3C12.ode	@ltx/en_us_dedes/miscellanea:misc.Ode3
ltx/en_us_dedes/me.m08.d20:meMA.Ode3C12.text	
ltx/en_us_dedes/me.m08.d20:meMA.Ode3C13.incipit	…
ltx/en_us_dedes/me.m08.d20:meMA.Ode3C13.melody	@ltx/en_us_dedes/he.h.m4:heHE.OukEnSofia.name
ltx/en_us_dedes/me.m08.d20:meMA.Ode3C13.mode	@ltx/en_us_dedes/miscellanea:misc.Mode4
ltx/en_us_dedes/me.m08.d20:meMA.Ode3C13.ode	@ltx/en_us_dedes/miscellanea:misc.Ode3
ltx/en_us_dedes/me.m08.d20:meMA.Ode3C13.text	
ltx/en_us_dedes/me.m08.d20:meMA.Ode3C1T.incipit	…
ltx/en_us_dedes/me.m08.d20:meMA.Ode3C1T.melody	@ltx/en_us_dedes/he.h.m4:heHE.OukEnSofia.name
ltx/en_us_dedes/me.m08.d20:meMA.Ode3C1T.mode	@ltx/en_us_dedes/miscellanea:misc.Mode4
ltx/en_us_dedes/me.m08.d20:meMA.Ode3C1T.ode	@ltx/en_us_dedes/miscellanea:misc.Ode3
ltx/en_us_dedes/me.m08.d20:meMA.Ode3C1T.text	
ltx/en_us_dedes/me.m08.d20:meMA.Ode3H.greekmelody	@ltx/en_us_dedes/he.h.m4:heHE.OukEnSofia.greekname
ltx/en_us_dedes/me.m08.d20:meMA.Ode3H.incipit	@ltx/en_us_dedes/he.h.m4:heHE.OukEnSofia.incipit
ltx/en_us_dedes/me.m08.d20:meMA.Ode3H.melody	@ltx/en_us_dedes/he.h.m4:heHE.OukEnSofia.melody
ltx/en_us_dedes/me.m08.d20:meMA.Ode3H.mode	@ltx/en_us_dedes/miscellanea:misc.Mode4
ltx/en_us_dedes/me.m08.d20:meMA.Ode3H.ode	@ltx/en_us_dedes/miscellanea:misc.Ode3
ltx/en_us_dedes/me.m08.d20:meMA.Ode3H.text	@ltx/en_us_dedes/he.h.m4:heHE.OukEnSofia.text
ltx/en_us_dedes/me.m08.d20:meMA.Ode3Kathisma1.greekmelody	@ltx/en_us_dedes/he.a.m3:heAU.TheiasPisteos.greekname
ltx/en_us_dedes/me.m08.d20:meMA.Ode3Kathisma1.incipit	…
ltx/en_us_dedes/me.m08.d20:meMA.Ode3Kathisma1.melody	@ltx/en_us_dedes/he.a.m3:heAU.TheiasPisteos.name
ltx/en_us_dedes/me.m08.d20:meMA.Ode3Kathisma1.mode	@ltx/en_us_dedes/miscellanea:misc.Mode3
ltx/en_us_dedes/me.m08.d20:meMA.Ode3Kathisma1.text	
ltx/en_us_dedes/me.m08.d20:meMA.Ode3Kathisma2.greekmelody	@ltx/en_us_dedes/he.a.m3:heAU.TinOraiotita.greekname
ltx/en_us_dedes/me.m08.d20:meMA.Ode3Kathisma2.incipit	@ltx/en_us_dedes/me.m08.d15:meMA.Kathisma31.incipit
ltx/en_us_dedes/me.m08.d20:meMA.Ode3Kathisma2.melody	@ltx/en_us_dedes/he.a.m3:heAU.TinOraiotita.name
ltx/en_us_dedes/me.m08.d20:meMA.Ode3Kathisma2.mode	@ltx/en_us_dedes/miscellanea:misc.Mode3
ltx/en_us_dedes/me.m08.d20:meMA.Ode3Kathisma2.text	@ltx/en_us_dedes/me.m08.d15:meMA.Kathisma31.text
ltx/en_us_dedes/me.m08.d20:meMA.Ode4C11.greekmelody	@ltx/en_us_dedes/he.h.m4:heHE.OKathimenosEnDoxi.greekname
ltx/en_us_dedes/me.m08.d20:meMA.Ode4C11.incipit	…
ltx/en_us_dedes/me.m08.d20:meMA.Ode4C11.melody	@ltx/en_us_dedes/he.h.m4:heHE.OKathimenosEnDoxi.name
ltx/en_us_dedes/me.m08.d20:meMA.Ode4C11.mode	@ltx/en_us_dedes/miscellanea:misc.Mode4
ltx/en_us_dedes/me.m08.d20:meMA.Ode4C11.ode	@ltx/en_us_dedes/miscellanea:misc.Ode4
ltx/en_us_dedes/me.m08.d20:meMA.Ode4C11.text	
ltx/en_us_dedes/me.m08.d20:meMA.Ode4C12.incipit	…
ltx/en_us_dedes/me.m08.d20:meMA.Ode4C12.melody	@ltx/en_us_dedes/he.h.m4:heHE.OKathimenosEnDoxi.name
ltx/en_us_dedes/me.m08.d20:meMA.Ode4C12.mode	@ltx/en_us_dedes/miscellanea:misc.Mode4
ltx/en_us_dedes/me.m08.d20:meMA.Ode4C12.ode	@ltx/en_us_dedes/miscellanea:misc.Ode4
ltx/en_us_dedes/me.m08.d20:meMA.Ode4C12.text	
ltx/en_us_dedes/me.m08.d20:meMA.Ode4C13.incipit	…
ltx/en_us_dedes/me.m08.d20:meMA.Ode4C13.melody	@ltx/en_us_dedes/he.h.m4:heHE.OKathimenosEnDoxi.name
ltx/en_us_dedes/me.m08.d20:meMA.Ode4C13.mode	@ltx/en_us_dedes/miscellanea:misc.Mode4
ltx/en_us_dedes/me.m08.d20:meMA.Ode4C13.ode	@ltx/en_us_dedes/miscellanea:misc.Ode4
ltx/en_us_dedes/me.m08.d20:meMA.Ode4C13.text	
ltx/en_us_dedes/me.m08.d20:meMA.Ode4C14.incipit	…
ltx/en_us_dedes/me.m08.d20:meMA.Ode4C14.melody	@ltx/en_us_dedes/he.h.m4:heHE.OKathimenosEnDoxi.name
ltx/en_us_dedes/me.m08.d20:meMA.Ode4C14.mode	@ltx/en_us_dedes/miscellanea:misc.Mode4
ltx/en_us_dedes/me.m08.d20:meMA.Ode4C14.ode	@ltx/en_us_dedes/miscellanea:misc.Ode4
ltx/en_us_dedes/me.m08.d20:meMA.Ode4C14.text	
ltx/en_us_dedes/me.m08.d20:meMA.Ode4C1T.incipit	…
ltx/en_us_dedes/me.m08.d20:meMA.Ode4C1T.melody	@ltx/en_us_dedes/he.h.m4:heHE.OKathimenosEnDoxi.name
ltx/en_us_dedes/me.m08.d20:meMA.Ode4C1T.mode	@ltx/en_us_dedes/miscellanea:misc.Mode4
ltx/en_us_dedes/me.m08.d20:meMA.Ode4C1T.ode	@ltx/en_us_dedes/miscellanea:misc.Ode4
ltx/en_us_dedes/me.m08.d20:meMA.Ode4C1T.text	
ltx/en_us_dedes/me.m08.d20:meMA.Ode5C11.greekmelody	@ltx/en_us_dedes/he.h.m4:heHE.AseveisOukOpsontai.greekname
ltx/en_us_dedes/me.m08.d20:meMA.Ode5C11.incipit	…
ltx/en_us_dedes/me.m08.d20:meMA.Ode5C11.melody	@ltx/en_us_dedes/he.h.m4:heHE.AseveisOukOpsontai.name
ltx/en_us_dedes/me.m08.d20:meMA.Ode5C11.mode	@ltx/en_us_dedes/miscellanea:misc.Mode4
ltx/en_us_dedes/me.m08.d20:meMA.Ode5C11.ode	@ltx/en_us_dedes/miscellanea:misc.Ode5
ltx/en_us_dedes/me.m08.d20:meMA.Ode5C11.text	
ltx/en_us_dedes/me.m08.d20:meMA.Ode5C12.incipit	…
ltx/en_us_dedes/me.m08.d20:meMA.Ode5C12.melody	@ltx/en_us_dedes/he.h.m4:heHE.AseveisOukOpsontai.name
ltx/en_us_dedes/me.m08.d20:meMA.Ode5C12.mode	@ltx/en_us_dedes/miscellanea:misc.Mode4
ltx/en_us_dedes/me.m08.d20:meMA.Ode5C12.ode	@ltx/en_us_dedes/miscellanea:misc.Ode5
ltx/en_us_dedes/me.m08.d20:meMA.Ode5C12.text	
ltx/en_us_dedes/me.m08.d20:meMA.Ode5C13.incipit	…
ltx/en_us_dedes/me.m08.d20:meMA.Ode5C13.melody	@ltx/en_us_dedes/he.h.m4:heHE.AseveisOukOpsontai.name
ltx/en_us_dedes/me.m08.d20:meMA.Ode5C13.mode	@ltx/en_us_dedes/miscellanea:misc.Mode4
ltx/en_us_dedes/me.m08.d20:meMA.Ode5C13.ode	@ltx/en_us_dedes/miscellanea:misc.Ode5
ltx/en_us_dedes/me.m08.d20:meMA.Ode5C13.text	
ltx/en_us_dedes/me.m08.d20:meMA.Ode5C1T.incipit	…
ltx/en_us_dedes/me.m08.d20:meMA.Ode5C1T.melody	@ltx/en_us_dedes/he.h.m4:heHE.AseveisOukOpsontai.name
ltx/en_us_dedes/me.m08.d20:meMA.Ode5C1T.mode	@ltx/en_us_dedes/miscellanea:misc.Mode4
ltx/en_us_dedes/me.m08.d20:meMA.Ode5C1T.ode	@ltx/en_us_dedes/miscellanea:misc.Ode5
ltx/en_us_dedes/me.m08.d20:meMA.Ode5C1T.text	
ltx/en_us_dedes/me.m08.d20:meMA.Ode6C11.greekmelody	@ltx/en_us_dedes/he.h.m4:heHE.EvoiseProtypon.greekname
ltx/en_us_dedes/me.m08.d20:meMA.Ode6C11.incipit	…
ltx/en_us_dedes/me.m08.d20:meMA.Ode6C11.melody	@ltx/en_us_dedes/he.h.m4:heHE.EvoiseProtypon.name
ltx/en_us_dedes/me.m08.d20:meMA.Ode6C11.mode	@ltx/en_us_dedes/miscellanea:misc.Mode4
ltx/en_us_dedes/me.m08.d20:meMA.Ode6C11.ode	@ltx/en_us_dedes/miscellanea:misc.Ode6
ltx/en_us_dedes/me.m08.d20:meMA.Ode6C11.text	
ltx/en_us_dedes/me.m08.d20:meMA.Ode6C12.incipit	…
ltx/en_us_dedes/me.m08.d20:meMA.Ode6C12.melody	@ltx/en_us_dedes/he.h.m4:heHE.EvoiseProtypon.name
ltx/en_us_dedes/me.m08.d20:meMA.Ode6C12.mode	@ltx/en_us_dedes/miscellanea:misc.Mode4
ltx/en_us_dedes/me.m08.d20:meMA.Ode6C12.ode	@ltx/en_us_dedes/miscellanea:misc.Ode6
ltx/en_us_dedes/me.m08.d20:meMA.Ode6C12.text	
ltx/en_us_dedes/me.m08.d20:meMA.Ode6C13.incipit	…
ltx/en_us_dedes/me.m08.d20:meMA.Ode6C13.melody	@ltx/en_us_dedes/he.h.m4:heHE.EvoiseProtypon.name
ltx/en_us_dedes/me.m08.d20:meMA.Ode6C13.mode	@ltx/en_us_dedes/miscellanea:misc.Mode4
ltx/en_us_dedes/me.m08.d20:meMA.Ode6C13.ode	@ltx/en_us_dedes/miscellanea:misc.Ode6
ltx/en_us_dedes/me.m08.d20:meMA.Ode6C13.text	
ltx/en_us_dedes/me.m08.d20:meMA.Ode6C1T.incipit	…
ltx/en_us_dedes/me.m08.d20:meMA.Ode6C1T.melody	@ltx/en_us_dedes/he.h.m4:heHE.EvoiseProtypon.name
ltx/en_us_dedes/me.m08.d20:meMA.Ode6C1T.mode	@ltx/en_us_dedes/miscellanea:misc.Mode4
ltx/en_us_dedes/me.m08.d20:meMA.Ode6C1T.ode	@ltx/en_us_dedes/miscellanea:misc.Ode6
ltx/en_us_dedes/me.m08.d20:meMA.Ode6C1T.text	
ltx/en_us_dedes/me.m08.d20:meMA.Ode6H.greekmelody	@ltx/en_us_dedes/he.h.m4:heHE.EvoiseProtypon.greekname
ltx/en_us_dedes/me.m08.d20:meMA.Ode6H.incipit	@ltx/en_us_dedes/he.h.m4:heHE.EvoiseProtypon.incipit
ltx/en_us_dedes/me.m08.d20:meMA.Ode6H.melody	@ltx/en_us_dedes/he.h.m4:heHE.EvoiseProtypon.melody
ltx/en_us_dedes/me.m08.d20:meMA.Ode6H.mode	@ltx/en_us_dedes/miscellanea:misc.Mode4
ltx/en_us_dedes/me.m08.d20:meMA.Ode6H.ode	@ltx/en_us_dedes/miscellanea:misc.Ode6
ltx/en_us_dedes/me.m08.d20:meMA.Ode6H.text	@ltx/en_us_dedes/he.h.m4:heHE.EvoiseProtypon.text
ltx/en_us_dedes/me.m08.d20:meMA.Ode7C11.greekmelody	@ltx/en_us_dedes/he.h.m4:heHE.NeoiTreisEnVavyloni.greekname
ltx/en_us_dedes/me.m08.d20:meMA.Ode7C11.incipit	…
ltx/en_us_dedes/me.m08.d20:meMA.Ode7C11.melody	@ltx/en_us_dedes/he.h.m4:heHE.NeoiTreisEnVavyloni.name
ltx/en_us_dedes/me.m08.d20:meMA.Ode7C11.mode	@ltx/en_us_dedes/miscellanea:misc.Mode4
ltx/en_us_dedes/me.m08.d20:meMA.Ode7C11.ode	@ltx/en_us_dedes/miscellanea:misc.Ode7
ltx/en_us_dedes/me.m08.d20:meMA.Ode7C11.text	
ltx/en_us_dedes/me.m08.d20:meMA.Ode7C12.incipit	…
ltx/en_us_dedes/me.m08.d20:meMA.Ode7C12.melody	@ltx/en_us_dedes/he.h.m4:heHE.NeoiTreisEnVavyloni.name
ltx/en_us_dedes/me.m08.d20:meMA.Ode7C12.mode	@ltx/en_us_dedes/miscellanea:misc.Mode4
ltx/en_us_dedes/me.m08.d20:meMA.Ode7C12.ode	@ltx/en_us_dedes/miscellanea:misc.Ode7
ltx/en_us_dedes/me.m08.d20:meMA.Ode7C12.text	
ltx/en_us_dedes/me.m08.d20:meMA.Ode7C13.incipit	…
ltx/en_us_dedes/me.m08.d20:meMA.Ode7C13.melody	@ltx/en_us_dedes/he.h.m4:heHE.NeoiTreisEnVavyloni.name
ltx/en_us_dedes/me.m08.d20:meMA.Ode7C13.mode	@ltx/en_us_dedes/miscellanea:misc.Mode4
ltx/en_us_dedes/me.m08.d20:meMA.Ode7C13.ode	@ltx/en_us_dedes/miscellanea:misc.Ode7
ltx/en_us_dedes/me.m08.d20:meMA.Ode7C13.text	
ltx/en_us_dedes/me.m08.d20:meMA.Ode7C14.incipit	…
ltx/en_us_dedes/me.m08.d20:meMA.Ode7C14.melody	@ltx/en_us_dedes/he.h.m4:heHE.NeoiTreisEnVavyloni.name
ltx/en_us_dedes/me.m08.d20:meMA.Ode7C14.mode	@ltx/en_us_dedes/miscellanea:misc.Mode4
ltx/en_us_dedes/me.m08.d20:meMA.Ode7C14.ode	@ltx/en_us_dedes/miscellanea:misc.Ode7
ltx/en_us_dedes/me.m08.d20:meMA.Ode7C14.text	
ltx/en_us_dedes/me.m08.d20:meMA.Ode7C1T.incipit	…
ltx/en_us_dedes/me.m08.d20:meMA.Ode7C1T.melody	@ltx/en_us_dedes/he.h.m4:heHE.NeoiTreisEnVavyloni.name
ltx/en_us_dedes/me.m08.d20:meMA.Ode7C1T.mode	@ltx/en_us_dedes/miscellanea:misc.Mode4
ltx/en_us_dedes/me.m08.d20:meMA.Ode7C1T.ode	@ltx/en_us_dedes/miscellanea:misc.Ode7
ltx/en_us_dedes/me.m08.d20:meMA.Ode7C1T.text	
ltx/en_us_dedes/me.m08.d20:meMA.Ode8C11.greekmelody	@ltx/en_us_dedes/he.h.m4:heHE.LytrotaTouPantos.greekname
ltx/en_us_dedes/me.m08.d20:meMA.Ode8C11.incipit	…
ltx/en_us_dedes/me.m08.d20:meMA.Ode8C11.melody	@ltx/en_us_dedes/he.h.m4:heHE.LytrotaTouPantos.name
ltx/en_us_dedes/me.m08.d20:meMA.Ode8C11.mode	@ltx/en_us_dedes/miscellanea:misc.Mode4
ltx/en_us_dedes/me.m08.d20:meMA.Ode8C11.ode	@ltx/en_us_dedes/miscellanea:misc.Ode8
ltx/en_us_dedes/me.m08.d20:meMA.Ode8C11.text	
ltx/en_us_dedes/me.m08.d20:meMA.Ode8C12.incipit	…
ltx/en_us_dedes/me.m08.d20:meMA.Ode8C12.melody	@ltx/en_us_dedes/he.h.m4:heHE.LytrotaTouPantos.name
ltx/en_us_dedes/me.m08.d20:meMA.Ode8C12.mode	@ltx/en_us_dedes/miscellanea:misc.Mode4
ltx/en_us_dedes/me.m08.d20:meMA.Ode8C12.ode	@ltx/en_us_dedes/miscellanea:misc.Ode8
ltx/en_us_dedes/me.m08.d20:meMA.Ode8C12.text	
ltx/en_us_dedes/me.m08.d20:meMA.Ode8C13.incipit	…
ltx/en_us_dedes/me.m08.d20:meMA.Ode8C13.melody	@ltx/en_us_dedes/he.h.m4:heHE.LytrotaTouPantos.name
ltx/en_us_dedes/me.m08.d20:meMA.Ode8C13.mode	@ltx/en_us_dedes/miscellanea:misc.Mode4
ltx/en_us_dedes/me.m08.d20:meMA.Ode8C13.ode	@ltx/en_us_dedes/miscellanea:misc.Ode8
ltx/en_us_dedes/me.m08.d20:meMA.Ode8C13.text	
ltx/en_us_dedes/me.m08.d20:meMA.Ode8C14.incipit	…
ltx/en_us_dedes/me.m08.d20:meMA.Ode8C14.melody	@ltx/en_us_dedes/he.h.m4:heHE.LytrotaTouPantos.name
ltx/en_us_dedes/me.m08.d20:meMA.Ode8C14.mode	@ltx/en_us_dedes/miscellanea:misc.Mode4
ltx/en_us_dedes/me.m08.d20:meMA.Ode8C14.ode	@ltx/en_us_dedes/miscellanea:misc.Ode8
ltx/en_us_dedes/me.m08.d20:meMA.Ode8C14.text	
ltx/en_us_dedes/me.m08.d20:meMA.Ode8C1T.incipit	…
ltx/en_us_dedes/me.m08.d20:meMA.Ode8C1T.melody	@ltx/en_us_dedes/he.h.m4:heHE.LytrotaTouPantos.name
ltx/en_us_dedes/me.m08.d20:meMA.Ode8C1T.mode	@ltx/en_us_dedes/miscellanea:misc.Mode4
ltx/en_us_dedes/me.m08.d20:meMA.Ode8C1T.ode	@ltx/en_us_dedes/miscellanea:misc.Ode8
ltx/en_us_dedes/me.m08.d20:meMA.Ode8C1T.text	
ltx/en_us_dedes/me.m08.d20:meMA.Ode8H.greekmelody	@ltx/en_us_dedes/he.h.m4:heHE.LytrotaTouPantos.greekname
ltx/en_us_dedes/me.m08.d20:meMA.Ode8H.incipit	@ltx/en_us_dedes/he.h.m4:heHE.LytrotaTouPantos.incipit
ltx/en_us_dedes/me.m08.d20:meMA.Ode8H.melody	@ltx/en_us_dedes/he.h.m4:heHE.LytrotaTouPantos.melody
ltx/en_us_dedes/me.m08.d20:meMA.Ode8H.mode	@ltx/en_us_dedes/miscellanea:misc.Mode4
ltx/en_us_dedes/me.m08.d20:meMA.Ode8H.ode	@ltx/en_us_dedes/miscellanea:misc.Ode8
ltx/en_us_dedes/me.m08.d20:meMA.Ode8H.text	@ltx/en_us_dedes/he.h.m4:heHE.LytrotaTouPantos.text
ltx/en_us_dedes/me.m08.d20:meMA.Ode9C11.greekmelody	@ltx/en_us_dedes/he.h.m4:heHE.EvaMenToTisParakois.greekname
ltx/en_us_dedes/me.m08.d20:meMA.Ode9C11.incipit	…
ltx/en_us_dedes/me.m08.d20:meMA.Ode9C11.melody	@ltx/en_us_dedes/he.h.m4:heHE.EvaMenToTisParakois.name
ltx/en_us_dedes/me.m08.d20:meMA.Ode9C11.mode	@ltx/en_us_dedes/miscellanea:misc.Mode4
ltx/en_us_dedes/me.m08.d20:meMA.Ode9C11.ode	@ltx/en_us_dedes/miscellanea:misc.Ode9
ltx/en_us_dedes/me.m08.d20:meMA.Ode9C11.text	
ltx/en_us_dedes/me.m08.d20:meMA.Ode9C12.incipit	…
ltx/en_us_dedes/me.m08.d20:meMA.Ode9C12.melody	@ltx/en_us_dedes/he.h.m4:heHE.EvaMenToTisParakois.name
ltx/en_us_dedes/me.m08.d20:meMA.Ode9C12.mode	@ltx/en_us_dedes/miscellanea:misc.Mode4
ltx/en_us_dedes/me.m08.d20:meMA.Ode9C12.ode	@ltx/en_us_dedes/miscellanea:misc.Ode9
ltx/en_us_dedes/me.m08.d20:meMA.Ode9C12.text	
ltx/en_us_dedes/me.m08.d20:meMA.Ode9C13.incipit	…
ltx/en_us_dedes/me.m08.d20:meMA.Ode9C13.melody	@ltx/en_us_dedes/he.h.m4:heHE.EvaMenToTisParakois.name
ltx/en_us_dedes/me.m08.d20:meMA.Ode9C13.mode	@ltx/en_us_dedes/miscellanea:misc.Mode4
ltx/en_us_dedes/me.m08.d20:meMA.Ode9C13.ode	@ltx/en_us_dedes/miscellanea:misc.Ode9
ltx/en_us_dedes/me.m08.d20:meMA.Ode9C13.text	
ltx/en_us_dedes/me.m08.d20:meMA.Ode9C14.incipit	…
ltx/en_us_dedes/me.m08.d20:meMA.Ode9C14.melody	@ltx/en_us_dedes/he.h.m4:heHE.EvaMenToTisParakois.name
ltx/en_us_dedes/me.m08.d20:meMA.Ode9C14.mode	@ltx/en_us_dedes/miscellanea:misc.Mode4
ltx/en_us_dedes/me.m08.d20:meMA.Ode9C14.ode	@ltx/en_us_dedes/miscellanea:misc.Ode9
ltx/en_us_dedes/me.m08.d20:meMA.Ode9C14.text	
ltx/en_us_dedes/me.m08.d20:meMA.Ode9C1T.incipit	…
ltx/en_us_dedes/me.m08.d20:meMA.Ode9C1T.melody	@ltx/en_us_dedes/he.h.m4:heHE.EvaMenToTisParakois.name
ltx/en_us_dedes/me.m08.d20:meMA.Ode9C1T.mode	@ltx/en_us_dedes/miscellanea:misc.Mode4
ltx/en_us_dedes/me.m08.d20:meMA.Ode9C1T.ode	@ltx/en_us_dedes/miscellanea:misc.Ode9
ltx/en_us_dedes/me.m08.d20:meMA.Ode9C1T.text	
ltx/en_us_dedes/me.m08.d20:meMA.Ode9H.greekmelody	@ltx/en_us_dedes/he.h.m4:heHE.EvaMenToTisParakois.greekname
ltx/en_us_dedes/me.m08.d20:meMA.Ode9H.incipit	@ltx/en_us_dedes/he.h.m4:heHE.EvaMenToTisParakois.incipit
ltx/en_us_dedes/me.m08.d20:meMA.Ode9H.melody	@ltx/en_us_dedes/he.h.m4:heHE.EvaMenToTisParakois.melody
ltx/en_us_dedes/me.m08.d20:meMA.Ode9H.mode	@ltx/en_us_dedes/miscellanea:misc.Mode4
ltx/en_us_dedes/me.m08.d20:meMA.Ode9H.ode	@ltx/en_us_dedes/miscellanea:misc.Ode9
ltx/en_us_dedes/me.m08.d20:meMA.Ode9H.text	@ltx/en_us_dedes/he.h.m4:heHE.EvaMenToTisParakois.text
ltx/en_us_dedes/me.m08.d20:meVE.Apolytikion1ger.greekmelody	@ltx/en_us_dedes/he.a.m4:heAU.TachyProkatalave.greekname
ltx/en_us_dedes/me.m08.d20:meVE.Apolytikion1ger.incipit	…
ltx/en_us_dedes/me.m08.d20:meVE.Apolytikion1ger.melody	@ltx/en_us_dedes/he.a.m4:heAU.TachyProkatalave.name
ltx/en_us_dedes/me.m08.d20:meVE.Apolytikion1ger.mode	@ltx/en_us_dedes/miscellanea:misc.Mode4
ltx/en_us_dedes/me.m08.d20:meVE.Apolytikion1ger.poet	@ltx/en_us_dedes/poets:po.Gerasimou
ltx/en_us_dedes/me.m08.d20:meVE.Apolytikion1ger.text	
ltx/en_us_dedes/me.m08.d20:meVE.AposGlory.incipit	@ltx/en_us_dedes/me.m08.d16:meMA.Aposticha3.incipit
ltx/en_us_dedes/me.m08.d20:meVE.AposGlory.melody	@ltx/en_us_dedes/he.a.m2:heAU.OikosTouEfratha.name
ltx/en_us_dedes/me.m08.d20:meVE.AposGlory.mode	@ltx/en_us_dedes/miscellanea:misc.Mode2
ltx/en_us_dedes/me.m08.d20:meVE.AposGlory.text	@ltx/en_us_dedes/me.m08.d16:meMA.Aposticha3.text
ltx/en_us_dedes/me.m08.d20:meVE.Aposticha1.greekmelody	@ltx/en_us_dedes/he.a.m2:heAU.OikosTouEfratha.greekname
ltx/en_us_dedes/me.m08.d20:meVE.Aposticha1.incipit	@ltx/en_us_dedes/me.m08.d16:meMA.Aposticha1.incipit
ltx/en_us_dedes/me.m08.d20:meVE.Aposticha1.melody	@ltx/en_us_dedes/he.a.m2:heAU.OikosTouEfratha.name
ltx/en_us_dedes/me.m08.d20:meVE.Aposticha1.mode	@ltx/en_us_dedes/miscellanea:misc.Mode2
ltx/en_us_dedes/me.m08.d20:meVE.Aposticha1.text	@ltx/en_us_dedes/me.m08.d16:meMA.Aposticha1.text
ltx/en_us_dedes/me.m08.d20:meVE.Aposticha2.incipit	@ltx/en_us_dedes/me.m08.d16:meMA.Aposticha2.incipit
ltx/en_us_dedes/me.m08.d20:meVE.Aposticha2.melody	@ltx/en_us_dedes/he.a.m2:heAU.OikosTouEfratha.name
ltx/en_us_dedes/me.m08.d20:meVE.Aposticha2.mode	@ltx/en_us_dedes/miscellanea:misc.Mode2
ltx/en_us_dedes/me.m08.d20:meVE.Aposticha2.text	@ltx/en_us_dedes/me.m08.d16:meMA.Aposticha2.text
ltx/en_us_dedes/me.m08.d20:meVE.Aposticha3.incipit	Be lifted up, O gates…
ltx/en_us_dedes/me.m08.d20:meVE.Aposticha3.melody	@ltx/en_us_dedes/he.a.m2:heAU.OikosTouEfratha.name
ltx/en_us_dedes/me.m08.d20:meVE.Aposticha3.mode	@ltx/en_us_dedes/miscellanea:misc.Mode2
ltx/en_us_dedes/me.m08.d20:meVE.Aposticha3.text	Be lifted up, O gates * of heaven when you see her, * the gate of the Most High God, * as she proceeds in glory toward her Son, our Lord and God.
ltx/en_us_dedes/me.m08.d20:meVE.SticGlory.incipit	@ltx/en_us_dedes/me.m08.d15:meMA.LaudsGlory.incipit
ltx/en_us_dedes/me.m08.d20:meVE.SticGlory.melody	
ltx/en_us_dedes/me.m08.d20:meVE.SticGlory.mode	@ltx/en_us_dedes/miscellanea:misc.Mode6
ltx/en_us_dedes/me.m08.d20:meVE.SticGlory.text	@ltx/en_us_dedes/me.m08.d15:meMA.LaudsGlory.text
ltx/en_us_dedes/me.m08.d20:meVE.Stichera01.greekmelody	@ltx/en_us_dedes/he.a.m5:heAU.ChairoisAskitikon.greekname
ltx/en_us_dedes/me.m08.d20:meVE.Stichera01.incipit	…
ltx/en_us_dedes/me.m08.d20:meVE.Stichera01.melody	@ltx/en_us_dedes/he.a.m5:heAU.ChairoisAskitikon.name
ltx/en_us_dedes/me.m08.d20:meVE.Stichera01.mode	@ltx/en_us_dedes/miscellanea:misc.Mode5
ltx/en_us_dedes/me.m08.d20:meVE.Stichera01.text	
ltx/en_us_dedes/me.m08.d20:meVE.Stichera02.incipit	…
ltx/en_us_dedes/me.m08.d20:meVE.Stichera02.melody	@ltx/en_us_dedes/he.a.m5:heAU.ChairoisAskitikon.name
ltx/en_us_dedes/me.m08.d20:meVE.Stichera02.mode	@ltx/en_us_dedes/miscellanea:misc.Mode5
ltx/en_us_dedes/me.m08.d20:meVE.Stichera02.text	
ltx/en_us_dedes/me.m08.d20:meVE.Stichera03.incipit	…
ltx/en_us_dedes/me.m08.d20:meVE.Stichera03.melody	@ltx/en_us_dedes/he.a.m5:heAU.ChairoisAskitikon.name
ltx/en_us_dedes/me.m08.d20:meVE.Stichera03.mode	@ltx/en_us_dedes/miscellanea:misc.Mode5
ltx/en_us_dedes/me.m08.d20:meVE.Stichera03.text	
ltx/en_us_dedes/me.m08.d20:meVE.Stichera04.greekmelody	@ltx/en_us_dedes/he.a.m4:heAU.EdokasSimeiosin.greekname
ltx/en_us_dedes/me.m08.d20:meVE.Stichera04.incipit	…
ltx/en_us_dedes/me.m08.d20:meVE.Stichera04.melody	@ltx/en_us_dedes/he.a.m4:heAU.EdokasSimeiosin.name
ltx/en_us_dedes/me.m08.d20:meVE.Stichera04.mode	@ltx/en_us_dedes/miscellanea:misc.Mode4
ltx/en_us_dedes/me.m08.d20:meVE.Stichera04.text	
ltx/en_us_dedes/me.m08.d20:meVE.Stichera05.incipit	…
ltx/en_us_dedes/me.m08.d20:meVE.Stichera05.melody	@ltx/en_us_dedes/he.a.m4:heAU.EdokasSimeiosin.name
ltx/en_us_dedes/me.m08.d20:meVE.Stichera05.mode	@ltx/en_us_dedes/miscellanea:misc.Mode4
ltx/en_us_dedes/me.m08.d20:meVE.Stichera05.text	
ltx/en_us_dedes/me.m08.d20:meVE.Stichera06.incipit	…
ltx/en_us_dedes/me.m08.d20:meVE.Stichera06.melody	@ltx/en_us_dedes/he.a.m4:heAU.EdokasSimeiosin.name
ltx/en_us_dedes/me.m08.d20:meVE.Stichera06.mode	@ltx/en_us_dedes/miscellanea:misc.Mode4
ltx/en_us_dedes/me.m08.d20:meVE.Stichera06.text	
