ltx/en_us_dedes/ty.typikon.parts:tyLDP.Eothinon	Eothinon:
ltx/en_us_dedes/ty.typikon.parts:tyLDP.ModeOfWeek	Mode of week:
ltx/en_us_dedes/ty.typikon.parts:tyNote	Note:
ltx/en_us_dedes/ty.typikon.parts:tyPart.AfterCommunion	After Communion:
ltx/en_us_dedes/ty.typikon.parts:tyPart.AfterEntrance	After the Entrance:
ltx/en_us_dedes/ty.typikon.parts:tyPart.AfterOde3	After Ode iii:
ltx/en_us_dedes/ty.typikon.parts:tyPart.AfterOde3MidodeKathisma	After Ode iii, Mid-Ode Kathisma:
ltx/en_us_dedes/ty.typikon.parts:tyPart.AfterOde6	After Ode vi:
ltx/en_us_dedes/ty.typikon.parts:tyPart.AfterPsalm50	After Psalm 50, 
ltx/en_us_dedes/ty.typikon.parts:tyPart.AmboPrayer	Ambo Prayer:
ltx/en_us_dedes/ty.typikon.parts:tyPart.Anavathmoi	Antiphons:
ltx/en_us_dedes/ty.typikon.parts:tyPart.Antiphons	Antiphons:
ltx/en_us_dedes/ty.typikon.parts:tyPart.Apolytikia	Apolytikia:
ltx/en_us_dedes/ty.typikon.parts:tyPart.Apolytikion	Apolytikion:
ltx/en_us_dedes/ty.typikon.parts:tyPart.Aposticha	Aposticha:
ltx/en_us_dedes/ty.typikon.parts:tyPart.AtDiptychs	At the Diptychs:
ltx/en_us_dedes/ty.typikon.parts:tyPart.AtEntrance	At the Entrance:
ltx/en_us_dedes/ty.typikon.parts:tyPart.AtEspecially	Hymn to the Theotokos:
ltx/en_us_dedes/ty.typikon.parts:tyPart.AtLiturgy	DIVINE LITURGY
ltx/en_us_dedes/ty.typikon.parts:tyPart.BothNow	Both now:
ltx/en_us_dedes/ty.typikon.parts:tyPart.Canon	Canon:
ltx/en_us_dedes/ty.typikon.parts:tyPart.Canons	Canons:
ltx/en_us_dedes/ty.typikon.parts:tyPart.CommunionHymn	Communion Hymn:
ltx/en_us_dedes/ty.typikon.parts:tyPart.Disclaimer.text	(Texts indicated by rubrics with shaded background may not be included in this file.)
ltx/en_us_dedes/ty.typikon.parts:tyPart.Dismissal	Dismissal:
ltx/en_us_dedes/ty.typikon.parts:tyPart.Doxology	Doxology:
ltx/en_us_dedes/ty.typikon.parts:tyPart.Efthis.text	Followed by:
ltx/en_us_dedes/ty.typikon.parts:tyPart.Eita.text	Then:
ltx/en_us_dedes/ty.typikon.parts:tyPart.Enarxis	Enarxis:
ltx/en_us_dedes/ty.typikon.parts:tyPart.Entrance	Entrance:
ltx/en_us_dedes/ty.typikon.parts:tyPart.EntranceHymn	Entrance Hymn:
ltx/en_us_dedes/ty.typikon.parts:tyPart.Epistle	Epistle:
ltx/en_us_dedes/ty.typikon.parts:tyPart.Evlogitaria	Evlogetaria:
ltx/en_us_dedes/ty.typikon.parts:tyPart.Exaposteilaria	Exaposteilaria:
ltx/en_us_dedes/ty.typikon.parts:tyPart.Exaposteilarion	Exaposteilarion:
ltx/en_us_dedes/ty.typikon.parts:tyPart.Friday.Evening	Τῇ Παρασκευῇ ἑσπέρας:
ltx/en_us_dedes/ty.typikon.parts:tyPart.Friday.Morning	Τῇ Παρασκευῇ πρωΐ:
ltx/en_us_dedes/ty.typikon.parts:tyPart.GITL	At, 
ltx/en_us_dedes/ty.typikon.parts:tyPart.Glory	Glory:
ltx/en_us_dedes/ty.typikon.parts:tyPart.GloryBoth	Glory; both now:
ltx/en_us_dedes/ty.typikon.parts:tyPart.Gospel	Gospel:
ltx/en_us_dedes/ty.typikon.parts:tyPart.GreatLitany	Great Litany
ltx/en_us_dedes/ty.typikon.parts:tyPart.HolyIsTheLord	Holy is the Lord…
ltx/en_us_dedes/ty.typikon.parts:tyPart.Hypakoe	Hypakoe:
ltx/en_us_dedes/ty.typikon.parts:tyPart.HypakoeOfMode	Hypakoe of the mode:
ltx/en_us_dedes/ty.typikon.parts:tyPart.InsteadOfTrisagion	Instead of “Holy God”:
ltx/en_us_dedes/ty.typikon.parts:tyPart.IntroductoryPsalm	Introductory Psalm 103
ltx/en_us_dedes/ty.typikon.parts:tyPart.Katavasia9	Katavasia of Ode ix:
ltx/en_us_dedes/ty.typikon.parts:tyPart.Katavasia91	Katavasia I:
ltx/en_us_dedes/ty.typikon.parts:tyPart.Katavasia92	Katavasia II:
ltx/en_us_dedes/ty.typikon.parts:tyPart.Katavasias	Katavasias:
ltx/en_us_dedes/ty.typikon.parts:tyPart.Kathisma1	Kathisma 1:
ltx/en_us_dedes/ty.typikon.parts:tyPart.Kathisma2	Kathisma 2:
ltx/en_us_dedes/ty.typikon.parts:tyPart.Kathisma3	Kathisma 3:
ltx/en_us_dedes/ty.typikon.parts:tyPart.Kathismata	Kathismata:
ltx/en_us_dedes/ty.typikon.parts:tyPart.Kontakion	Kontakion:
ltx/en_us_dedes/ty.typikon.parts:tyPart.KontakionOikos	Kontakion - Oikos:
ltx/en_us_dedes/ty.typikon.parts:tyPart.LIHC	At,
ltx/en_us_dedes/ty.typikon.parts:tyPart.Lauds	At Lauds:
ltx/en_us_dedes/ty.typikon.parts:tyPart.LaudsStichera	Lauds Stichera:
ltx/en_us_dedes/ty.typikon.parts:tyPart.Lauds_04	Use 4 verses.
ltx/en_us_dedes/ty.typikon.parts:tyPart.Lauds_06	Use 6 verses.
ltx/en_us_dedes/ty.typikon.parts:tyPart.Lauds_08	Use 8 verses.
ltx/en_us_dedes/ty.typikon.parts:tyPart.LityHymns	The Idiomela of the Lity:
ltx/en_us_dedes/ty.typikon.parts:tyPart.Magnificat	Magnificat:
ltx/en_us_dedes/ty.typikon.parts:tyPart.Matins	MATINS
ltx/en_us_dedes/ty.typikon.parts:tyPart.MatinsGospel	Matins Gospel:
ltx/en_us_dedes/ty.typikon.parts:tyPart.MatinsOrdinary	Matins Ordinary.
ltx/en_us_dedes/ty.typikon.parts:tyPart.MidnightOffice	MIDNIGHT OFFICE
ltx/en_us_dedes/ty.typikon.parts:tyPart.MidodeKathisma	Mid-Ode Kathisma:
ltx/en_us_dedes/ty.typikon.parts:tyPart.Monday.Evening	Τῇ Δευτέρᾳ ἑσπέρας:
ltx/en_us_dedes/ty.typikon.parts:tyPart.Monday.Morning	Τῇ Δευτέρᾳ πρωΐ:
ltx/en_us_dedes/ty.typikon.parts:tyPart.NoEntrance	No entrance:
ltx/en_us_dedes/ty.typikon.parts:tyPart.OdeOfSymeon	Ode of Symeon
ltx/en_us_dedes/ty.typikon.parts:tyPart.PostGospelIdiomelon	The Idiomelon:
ltx/en_us_dedes/ty.typikon.parts:tyPart.Prokeimenon	Prokeimenon:
ltx/en_us_dedes/ty.typikon.parts:tyPart.Psalm50	Psalm 50:
ltx/en_us_dedes/ty.typikon.parts:tyPart.Psalter	Psalter:
ltx/en_us_dedes/ty.typikon.parts:tyPart.Readings	The Readings.
ltx/en_us_dedes/ty.typikon.parts:tyPart.RestOfBasilLiturgy	And the rest of the Liturgy of St. Basil.
ltx/en_us_dedes/ty.typikon.parts:tyPart.Saturday.Evening	Τῷ Σαββάτῳ ἑσπέρας:
ltx/en_us_dedes/ty.typikon.parts:tyPart.Saturday.Morning	Τῷ Σαββάτῳ πρωΐ:
ltx/en_us_dedes/ty.typikon.parts:tyPart.ShortLitany	Short Litany
ltx/en_us_dedes/ty.typikon.parts:tyPart.SixPsalms	The Six Psalms.
ltx/en_us_dedes/ty.typikon.parts:tyPart.Stichera	Vespers Stichera:
ltx/en_us_dedes/ty.typikon.parts:tyPart.Sunday.Evening	Τῇ Κυριακῇ ἑσπέρας:
ltx/en_us_dedes/ty.typikon.parts:tyPart.Sunday.Morning	Τῇ Κυριακῇ πρωΐ:
ltx/en_us_dedes/ty.typikon.parts:tyPart.Synaxarion	Synaxarion:
ltx/en_us_dedes/ty.typikon.parts:tyPart.Thursday.Evening	Τῇ Πέμπτῃ ἑσπέρας:
ltx/en_us_dedes/ty.typikon.parts:tyPart.Thursday.Morning	Τῇ Πέμπτῃ πρωΐ:
ltx/en_us_dedes/ty.typikon.parts:tyPart.ToAfto.text	Repeat.
ltx/en_us_dedes/ty.typikon.parts:tyPart.TriadicCanon	Triadic Canon:
ltx/en_us_dedes/ty.typikon.parts:tyPart.TriadicMegalynaria	The Triadic Megalynaria:
ltx/en_us_dedes/ty.typikon.parts:tyPart.Trisagion	Trisagion Prayers.
ltx/en_us_dedes/ty.typikon.parts:tyPart.TrisagionHymn	Trisagion Hymn:
ltx/en_us_dedes/ty.typikon.parts:tyPart.Tuesday.Evening	Τῇ Τρίτῃ ἑσπέρας:
ltx/en_us_dedes/ty.typikon.parts:tyPart.Tuesday.Morning	Τῇ Τρίτῃ πρωΐ:
ltx/en_us_dedes/ty.typikon.parts:tyPart.Typikon	THE TYPIKON
ltx/en_us_dedes/ty.typikon.parts:tyPart.Vespers	VESPERS
ltx/en_us_dedes/ty.typikon.parts:tyPart.VespersKathisma	Kathisma
ltx/en_us_dedes/ty.typikon.parts:tyPart.Wednesday.Evening	Τῇ Τετάρτῃ ἑσπέρας:
ltx/en_us_dedes/ty.typikon.parts:tyPart.Wednesday.Morning	Τῇ Τετάρτῃ πρωΐ:
ltx/en_us_dedes/ty.typikon.parts:tyPart.vVerse	Verse:
ltx/en_us_dedes/ty.typikon.parts:tyPartLiturgicalDayProperties	
ltx/en_us_dedes/ty.typikon.parts:tyRubric.AlleluiaMode8	Instead of the Daily Prokeimenon, sing Alleluia thrice, in Mode pl. 4:
ltx/en_us_dedes/ty.typikon.parts:tyRubric.Aposticha.Resurrectional.All	The 4 Resurrectional Stichera.
ltx/en_us_dedes/ty.typikon.parts:tyRubric.Aposticha.Resurrectional.First	The first Resurrectional Sticheron.
ltx/en_us_dedes/ty.typikon.parts:tyRubric.Canon.BothIn4	4 troparia from each Canon.
ltx/en_us_dedes/ty.typikon.parts:tyRubric.Canon.In4	4 troparia.
ltx/en_us_dedes/ty.typikon.parts:tyRubric.Canon.In6	6 in each ode.
ltx/en_us_dedes/ty.typikon.parts:tyRubric.Canon.InsteadUseOde9	Instead, sing Ode ix
ltx/en_us_dedes/ty.typikon.parts:tyRubric.Canon.LastTwo	For the last two: Glory; and, Both now.
ltx/en_us_dedes/ty.typikon.parts:tyRubric.Canon.MagnificatNotSung	Not sung.
ltx/en_us_dedes/ty.typikon.parts:tyRubric.Canon.OfBothCanonsOfFeast	 of both Canons of the Feast
ltx/en_us_dedes/ty.typikon.parts:tyRubric.Canon.Resurrectional	Resurrectional:
ltx/en_us_dedes/ty.typikon.parts:tyRubric.Canon.ResurrectionalKontakionOikos	Resurrectional Kontakion-Oikos (read)
ltx/en_us_dedes/ty.typikon.parts:tyRubric.Canon.WithItsHeirmoi	including the Heirmoi.
ltx/en_us_dedes/ty.typikon.parts:tyRubric.Canon.WithItsTheotokion	and its Theotokion:
ltx/en_us_dedes/ty.typikon.parts:tyRubric.Canon.WithTheirMegalynaria	with their Megalynaria
ltx/en_us_dedes/ty.typikon.parts:tyRubric.Canon.h123	Heirmos and 3 troparia.
ltx/en_us_dedes/ty.typikon.parts:tyRubric.Canon.h12t	Heirmos and 3 troparia.
ltx/en_us_dedes/ty.typikon.parts:tyRubric.Canon.noverse	No verse.
ltx/en_us_dedes/ty.typikon.parts:tyRubric.Canon.verse	Using the verse:
ltx/en_us_dedes/ty.typikon.parts:tyRubric.Cross.Prosomoia3as4	The 3 Prosomoia for the Cross, the first one twice.
ltx/en_us_dedes/ty.typikon.parts:tyRubric.Cross.Prosomoia3as6	The 3 Prosomoia for the Cross, each one twice.
ltx/en_us_dedes/ty.typikon.parts:tyRubric.Date.Aug06.LI01	The troparion from Ode vii of Canon 2 of the Feast
ltx/en_us_dedes/ty.typikon.parts:tyRubric.Date.Aug17.MA01	(Aug 17, Kathisma 2)
ltx/en_us_dedes/ty.typikon.parts:tyRubric.Doxology.Great	Great
ltx/en_us_dedes/ty.typikon.parts:tyRubric.Doxology.Small	Small
ltx/en_us_dedes/ty.typikon.parts:tyRubric.EvlogitariaHypakoeAnavathmoiProkeimenon	The Resurrectional Evlogetaria. The Hypakoe, Antiphons, and Prokeimenon of the mode.
ltx/en_us_dedes/ty.typikon.parts:tyRubric.Fathers.Prosomoia3as4	The 3 Prosomoia for the Fathers, the first one twice.
ltx/en_us_dedes/ty.typikon.parts:tyRubric.Fathers.Prosomoia4as6	The 4 Prosomoia for the Fathers, the first two twice.
ltx/en_us_dedes/ty.typikon.parts:tyRubric.Feast.EightModeIdiomelon	The eight-mode Idiomelon of the Feast, sung by two choirs.
ltx/en_us_dedes/ty.typikon.parts:tyRubric.Feast.Idiomela3	The 3 Idiomela for the Feast.
ltx/en_us_dedes/ty.typikon.parts:tyRubric.Feast.Idiomela4	The 4 Idiomela for the Feast.
ltx/en_us_dedes/ty.typikon.parts:tyRubric.Feast.Idiomela4as6	The 4 Idiomela for the Feast, the first two twice.
ltx/en_us_dedes/ty.typikon.parts:tyRubric.Feast.Idiomela6	The 6 Idiomela for the Feast.
ltx/en_us_dedes/ty.typikon.parts:tyRubric.Feast.Idiomelon	The Idiomela for the Feast.
ltx/en_us_dedes/ty.typikon.parts:tyRubric.Feast.KontakionOikos	Kontakion and Oikos of the feast (read)
ltx/en_us_dedes/ty.typikon.parts:tyRubric.Feast.OtherIdiomelon	The other Idiomela for the Feast.
ltx/en_us_dedes/ty.typikon.parts:tyRubric.Feast.Prosomoia3	3 Prosomoia for the Feast.
ltx/en_us_dedes/ty.typikon.parts:tyRubric.Feast.Prosomoia3as4	The 3 Prosomoia for the Feast, the first one twice.
ltx/en_us_dedes/ty.typikon.parts:tyRubric.Feast.Prosomoia3as6	The 3 Prosomoia for the Feast, each one twice.
ltx/en_us_dedes/ty.typikon.parts:tyRubric.Find.Lity	Find this at the Lity.
ltx/en_us_dedes/ty.typikon.parts:tyRubric.Find.LityBoth	Find this as the Both now of the Lity.
ltx/en_us_dedes/ty.typikon.parts:tyRubric.Find.LityGlory	Find this as the Glory of the Lity.
ltx/en_us_dedes/ty.typikon.parts:tyRubric.FirstTheotokion.ModeOfWeek	The First Theotokion of the mode of the week.
ltx/en_us_dedes/ty.typikon.parts:tyRubric.FirstTheotokion.SameMode	The corresponding First Theotokion.
ltx/en_us_dedes/ty.typikon.parts:tyRubric.Forerunner.Prosomoia3as4	The 3 Prosomoia for the Forerunner, the first one twice.
ltx/en_us_dedes/ty.typikon.parts:tyRubric.IsRead	is read.
ltx/en_us_dedes/ty.typikon.parts:tyRubric.ItsTheotokion	Theotokion.
ltx/en_us_dedes/ty.typikon.parts:tyRubric.ItsTheotokionSameMode	Theotokion in the same mode.
ltx/en_us_dedes/ty.typikon.parts:tyRubric.Litanies1	The Litany of Fervent Supplication. The prayer,
ltx/en_us_dedes/ty.typikon.parts:tyRubric.Litanies2	The Litany of Completion, and the Prayer at the Bowing of Heads.
ltx/en_us_dedes/ty.typikon.parts:tyRubric.Mode4Antiphon1	First Antiphon of Mode 4.
ltx/en_us_dedes/ty.typikon.parts:tyRubric.OmitEvlogetaria	Evlogetaria are omitted. Short litany with exclamation:
ltx/en_us_dedes/ty.typikon.parts:tyRubric.Once	Once.
ltx/en_us_dedes/ty.typikon.parts:tyRubric.OnlySayEvening1	Only say,
ltx/en_us_dedes/ty.typikon.parts:tyRubric.OnlySayEvening2	and not,
ltx/en_us_dedes/ty.typikon.parts:tyRubric.Prokeimenon.Daily	Prokeimenon.
ltx/en_us_dedes/ty.typikon.parts:tyRubric.Prokeimenon.Great	Great Prokeimenon.
ltx/en_us_dedes/ty.typikon.parts:tyRubric.Prophet.Prosomoia3as4	The 3 Prosomoia for the Prophet, the first one twice.
ltx/en_us_dedes/ty.typikon.parts:tyRubric.Prosomoia3	3 Prosomoia
ltx/en_us_dedes/ty.typikon.parts:tyRubric.PsalterKathisma1Stanza1	1st stanza of Kathisma 1.
ltx/en_us_dedes/ty.typikon.parts:tyRubric.Read	(read)
ltx/en_us_dedes/ty.typikon.parts:tyRubric.Repeat	Repeat.
ltx/en_us_dedes/ty.typikon.parts:tyRubric.Resurrectional	Resurrectional.
ltx/en_us_dedes/ty.typikon.parts:tyRubric.Resurrectional.Stichera3	3 Resurrectional Stichera.
ltx/en_us_dedes/ty.typikon.parts:tyRubric.Resurrectional.Stichera4	4 Resurrectional Stichera.
ltx/en_us_dedes/ty.typikon.parts:tyRubric.Resurrectional.Stichera6	6 Resurrectional Stichera.
ltx/en_us_dedes/ty.typikon.parts:tyRubric.Resurrectional.Stichera7	7 Resurrectional Stichera.
ltx/en_us_dedes/ty.typikon.parts:tyRubric.SaintM.Prosomoia3	3 Prosomoia for the Saint.
ltx/en_us_dedes/ty.typikon.parts:tyRubric.SaintM.Prosomoia3as4	The 3 Prosomoia for the Saint, the first one twice.
ltx/en_us_dedes/ty.typikon.parts:tyRubric.SaintW.Prosomoia3	3 Prosomoia for the holy woman.
ltx/en_us_dedes/ty.typikon.parts:tyRubric.SaintW.Prosomoia3as4	The 3 Prosomoia for the holy woman, the first one twice.
ltx/en_us_dedes/ty.typikon.parts:tyRubric.Saints.Prosomoia3	3 Prosomoia for the Saints.
ltx/en_us_dedes/ty.typikon.parts:tyRubric.Saints.Prosomoia3as6	The 3 Prosomoia for the Saints, each one twice.
ltx/en_us_dedes/ty.typikon.parts:tyRubric.Synaxarion.Fathers	and of the Sunday of the Fathers
ltx/en_us_dedes/ty.typikon.parts:tyRubric.Synaxarion.Forefathers	and of the Forefathers
ltx/en_us_dedes/ty.typikon.parts:tyRubric.Synaxarion.Menaion	from Menaion
ltx/en_us_dedes/ty.typikon.parts:tyRubric.Synaxarion.OfTheDay	Commemorations of the day
ltx/en_us_dedes/ty.typikon.parts:tyRubric.Synaxarion.Pentecostarion	and from Pentecostarion
ltx/en_us_dedes/ty.typikon.parts:tyRubric.Synaxarion.SundayAC	and of the Sunday After Christmas
ltx/en_us_dedes/ty.typikon.parts:tyRubric.Synaxarion.SundayBC	and of the Sunday Before Christmas
ltx/en_us_dedes/ty.typikon.parts:tyRubric.Synaxarion.Triodion	and from Triodion
ltx/en_us_dedes/ty.typikon.parts:tyRubric.TheirTheotokion	Theotokion.
ltx/en_us_dedes/ty.typikon.parts:tyRubric.Theotokion.SameMode	The corresponding Theotokion.
ltx/en_us_dedes/ty.typikon.parts:tyRubric.TheotokionOfModeOfWeek	Theotokion of the mode of the week.
ltx/en_us_dedes/ty.typikon.parts:tyRubric.Thrice	Thrice.
ltx/en_us_dedes/ty.typikon.parts:tyRubric.Twice	Twice.
ltx/en_us_dedes/ty.typikon.parts:tyRubric.VE.LIHC_04	Use 4 verses.
ltx/en_us_dedes/ty.typikon.parts:tyRubric.VE.LIHC_06	Use 6 verses.
ltx/en_us_dedes/ty.typikon.parts:tyRubric.VE.LIHC_08	Use 8 verses.
ltx/en_us_dedes/ty.typikon.parts:tyRubric.VE.LIHC_10	Use 10 verses.
ltx/en_us_dedes/ty.typikon.parts:tyRubric.WithGospel	With Gospel book.
ltx/en_us_dedes/ty.typikon.parts:tySource.Hieratikon	Priest’s Service Book.
ltx/en_us_dedes/ty.typikon.parts:tySource.Horologion	Horologion.
ltx/en_us_dedes/ty.typikon.parts:tySource.Menaion	Menaion.
ltx/en_us_dedes/ty.typikon.parts:tySource.Octoechos	Octoechos.
ltx/en_us_dedes/ty.typikon.parts:tySource.Pentecostarion	Pentecostarion.
ltx/en_us_dedes/ty.typikon.parts:tySource.Triodion	Triodion.
ltx/en_us_dedes/ty.typikon.parts:tySources	Books - Sources:
