ltx/en_us_dedes/me.m12.d29:meDA.commemoration.first	Memory of the 14,000 Holy Innocents
ltx/en_us_dedes/me.m12.d29:meDA.commemoration.first_name	
ltx/en_us_dedes/me.m12.d29:meDA.commemoration.first_short	Memory of the 14,000 Holy Innocents
ltx/en_us_dedes/me.m12.d29:meDA.commemoration.first_title	For the Holy Innocents.
ltx/en_us_dedes/me.m12.d29:meDA.commemoration.full	Memory of the 14,000 Holy Innocents, who were Slaughtered by Herod; and our Devout Father Markellos, Abbot of the Monastery of the Unsleeping.
ltx/en_us_dedes/me.m12.d29:meDA.commemoration.second_name	
ltx/en_us_dedes/me.m12.d29:meDA.commemoration.second_title	@ltx/en_us_dedes/titles:ti.SaintM
ltx/en_us_dedes/me.m12.d29:meDA.date	December 29
ltx/en_us_dedes/me.m12.d29:meDA.dismissal	@ltx/en_us_dedes/dismissals:dis00.christmas
ltx/en_us_dedes/me.m12.d29:meDA.fordate	for December 29
ltx/en_us_dedes/me.m12.d29:meDA.insert1	
ltx/en_us_dedes/me.m12.d29:meDA.insert2	
ltx/en_us_dedes/me.m12.d29:meDA.note	
ltx/en_us_dedes/me.m12.d29:meDA.pdfcoverdate	December 29,
ltx/en_us_dedes/me.m12.d29:meDA.pdfheaderdate	December 29
ltx/en_us_dedes/me.m12.d29:meHO.commemorations	
ltx/en_us_dedes/me.m12.d29:meHO.note1	
ltx/en_us_dedes/me.m12.d29:meHO.note2	
ltx/en_us_dedes/me.m12.d29:meHO.number	
ltx/en_us_dedes/me.m12.d29:meHO.rank	
ltx/en_us_dedes/me.m12.d29:meLE.commemoration1	The Holy Fourteen Thousand Children of Bethlehem.
ltx/en_us_dedes/me.m12.d29:meLE.commemoration2	
ltx/en_us_dedes/me.m12.d29:meLI.Kontakion1.greekmelody	@ltx/en_us_dedes/me.m12.d29:meMA.Kontakion1.greekmelody
ltx/en_us_dedes/me.m12.d29:meLI.Kontakion1.incipit	@ltx/en_us_dedes/me.m12.d29:meMA.Kontakion1.incipit
ltx/en_us_dedes/me.m12.d29:meLI.Kontakion1.melody	@ltx/en_us_dedes/me.m12.d29:meMA.Kontakion1.melody
ltx/en_us_dedes/me.m12.d29:meLI.Kontakion1.mode	@ltx/en_us_dedes/me.m12.d29:meMA.Kontakion1.mode
ltx/en_us_dedes/me.m12.d29:meLI.Kontakion1.text	@ltx/en_us_dedes/me.m12.d29:meMA.Kontakion1.text
ltx/en_us_dedes/me.m12.d29:meLI.Megalynarion.text	
ltx/en_us_dedes/me.m12.d29:meMA.AposBoth.incipit	@ltx/en_us_dedes/me.m12.d25:meVE.LityBoth.incipit
ltx/en_us_dedes/me.m12.d29:meMA.AposBoth.melody	
ltx/en_us_dedes/me.m12.d29:meMA.AposBoth.mode	@ltx/en_us_dedes/miscellanea:misc.Mode6
ltx/en_us_dedes/me.m12.d29:meMA.AposBoth.text	@ltx/en_us_dedes/me.m12.d25:meVE.LityBoth.text
ltx/en_us_dedes/me.m12.d29:meMA.AposGlory.incipit	@ltx/en_us_dedes/me.m01.d15:meVE.AposGlory.incipit
ltx/en_us_dedes/me.m12.d29:meMA.AposGlory.melody	
ltx/en_us_dedes/me.m12.d29:meMA.AposGlory.mode	@ltx/en_us_dedes/miscellanea:misc.Mode6
ltx/en_us_dedes/me.m12.d29:meMA.AposGlory.text	@ltx/en_us_dedes/me.m01.d15:meVE.AposGlory.text
ltx/en_us_dedes/me.m12.d29:meMA.Aposticha1.incipit	…
ltx/en_us_dedes/me.m12.d29:meMA.Aposticha1.melody	
ltx/en_us_dedes/me.m12.d29:meMA.Aposticha1.mode	@ltx/en_us_dedes/miscellanea:misc.Mode1
ltx/en_us_dedes/me.m12.d29:meMA.Aposticha1.poet	@ltx/en_us_dedes/poets:po.Kyprianou
ltx/en_us_dedes/me.m12.d29:meMA.Aposticha1.text	
ltx/en_us_dedes/me.m12.d29:meMA.Aposticha2.incipit	…
ltx/en_us_dedes/me.m12.d29:meMA.Aposticha2.melody	
ltx/en_us_dedes/me.m12.d29:meMA.Aposticha2.mode	@ltx/en_us_dedes/miscellanea:misc.Mode2
ltx/en_us_dedes/me.m12.d29:meMA.Aposticha2.poet	@ltx/en_us_dedes/poets:po.Kyprianou
ltx/en_us_dedes/me.m12.d29:meMA.Aposticha2.text	
ltx/en_us_dedes/me.m12.d29:meMA.Aposticha3.incipit	…
ltx/en_us_dedes/me.m12.d29:meMA.Aposticha3.melody	
ltx/en_us_dedes/me.m12.d29:meMA.Aposticha3.mode	@ltx/en_us_dedes/miscellanea:misc.Mode3
ltx/en_us_dedes/me.m12.d29:meMA.Aposticha3.text	
ltx/en_us_dedes/me.m12.d29:meMA.C1.acrostic.notice1	
ltx/en_us_dedes/me.m12.d29:meMA.C1.acrostic.notice2	
ltx/en_us_dedes/me.m12.d29:meMA.C1.acrostic.text	
ltx/en_us_dedes/me.m12.d29:meMA.C1.acrostic.title	
ltx/en_us_dedes/me.m12.d29:meMA.C1.title	@ltx/en_us_dedes/titles:ti.CanonSaints
ltx/en_us_dedes/me.m12.d29:meMA.C1.verse	@ltx/en_us_dedes/prayers:pr.verse_SaintsM.text
ltx/en_us_dedes/me.m12.d29:meMA.Exaposteilarion1.greekmelody	@ltx/en_us_dedes/he.a.m2:heAU.TonMathitonOrontonSe.greekname
ltx/en_us_dedes/me.m12.d29:meMA.Exaposteilarion1.incipit	Sigh not in grief, O…
ltx/en_us_dedes/me.m12.d29:meMA.Exaposteilarion1.melody	@ltx/en_us_dedes/he.a.m2:heAU.TonMathitonOrontonSe.name
ltx/en_us_dedes/me.m12.d29:meMA.Exaposteilarion1.mode	@ltx/en_us_dedes/miscellanea:misc.Mode2
ltx/en_us_dedes/me.m12.d29:meMA.Exaposteilarion1.text	Sigh not in grief, O Bethlehem, for the slaughter * of the all-holy Innocents; rejoice, rather, * for they have been offered as perfect victims * in sacrifice to Christ the Lord. * Since they were slaughtered for His sake, * they reign with Him now in heaven.
ltx/en_us_dedes/me.m12.d29:meMA.Exaposteilarion2.greekmelody	@ltx/en_us_dedes/he.a.m2:heAU.TonMathitonOrontonSe.greekname
ltx/en_us_dedes/me.m12.d29:meMA.Exaposteilarion2.incipit	Through self-control, O holy God-bearing…
ltx/en_us_dedes/me.m12.d29:meMA.Exaposteilarion2.melody	@ltx/en_us_dedes/he.a.m2:heAU.TonMathitonOrontonSe.name
ltx/en_us_dedes/me.m12.d29:meMA.Exaposteilarion2.mode	@ltx/en_us_dedes/miscellanea:misc.Mode2
ltx/en_us_dedes/me.m12.d29:meMA.Exaposteilarion2.text	Through self-control, O holy God-bearing father, * you put to sleep the flesh’s every uprising. * Then, in your monastery, O Markellos, * you made a rule that doxology * be offered in praise of Christ God, * all night and without sleeping.
ltx/en_us_dedes/me.m12.d29:meMA.Exaposteilarion3.greekmelody	@ltx/en_us_dedes/he.a.m2:heAU.TonMathitonOrontonSe.greekname
ltx/en_us_dedes/me.m12.d29:meMA.Exaposteilarion3.incipit	O Theotokos, peace on earth…
ltx/en_us_dedes/me.m12.d29:meMA.Exaposteilarion3.melody	@ltx/en_us_dedes/he.a.m2:heAU.TonMathitonOrontonSe.name
ltx/en_us_dedes/me.m12.d29:meMA.Exaposteilarion3.mode	@ltx/en_us_dedes/miscellanea:misc.Mode2
ltx/en_us_dedes/me.m12.d29:meMA.Exaposteilarion3.text	O Theotokos, peace on earth has been given, * and the divine good pleasure has come to mankind. * Angels from on high in chorus cried aloud, * “Glory to You in the highest, * for You were born ineffably * in Bethlehem from a Virgin.”
ltx/en_us_dedes/me.m12.d29:meMA.Kathisma11.greekmelody	@ltx/en_us_dedes/he.a.m8:heAU.ToProstachthen.greekname
ltx/en_us_dedes/me.m12.d29:meMA.Kathisma11.incipit	…
ltx/en_us_dedes/me.m12.d29:meMA.Kathisma11.melody	@ltx/en_us_dedes/he.a.m8:heAU.ToProstachthen.name
ltx/en_us_dedes/me.m12.d29:meMA.Kathisma11.mode	@ltx/en_us_dedes/miscellanea:misc.Mode8
ltx/en_us_dedes/me.m12.d29:meMA.Kathisma11.text	
ltx/en_us_dedes/me.m12.d29:meMA.Kathisma21.greekmelody	@ltx/en_us_dedes/he.a.m8:heAU.TinSofianKaiLogon.greekname
ltx/en_us_dedes/me.m12.d29:meMA.Kathisma21.incipit	You seem to me to…
ltx/en_us_dedes/me.m12.d29:meMA.Kathisma21.melody	@ltx/en_us_dedes/he.a.m8:heAU.TinSofianKaiLogon.name
ltx/en_us_dedes/me.m12.d29:meMA.Kathisma21.mode	@ltx/en_us_dedes/miscellanea:misc.Mode8
ltx/en_us_dedes/me.m12.d29:meMA.Kathisma21.text	You seem to me to be heaven today, O earth; * for the Maker of all has been born on you. * He reclines in manger in Bethlehem of Judea, * and there are shepherds with Angels unceasingly extolling Him, * “Glory in the highest to God, and on earth be peace!” * Magi from the east saw a star that was leading. * They earnestly follow it, to present their most precious gifts, * gold and myrrh and frankincense, * to Him who is the God of all, eternal King, and Creator of the universe, * who in His tender mercy for mortals appeared in a cave.
ltx/en_us_dedes/me.m12.d29:meMA.Kontakion1.greekmelody	@ltx/en_us_dedes/he.a.m4:heAU.EpefanisSimeron.greekname
ltx/en_us_dedes/me.m12.d29:meMA.Kontakion1.incipit	To the Savior who was…
ltx/en_us_dedes/me.m12.d29:meMA.Kontakion1.melody	@ltx/en_us_dedes/he.a.m4:heAU.EpefanisSimeron.name
ltx/en_us_dedes/me.m12.d29:meMA.Kontakion1.mode	@ltx/en_us_dedes/miscellanea:misc.Mode4
ltx/en_us_dedes/me.m12.d29:meMA.Kontakion1.text	To the Savior who was born * the Star sent Magi. * Herod then dispatched his own * illicit forces in his vain * desire to find and assassinate * the Lord who lay in a manger as a newborn babe.
ltx/en_us_dedes/me.m12.d29:meMA.Lauds1.greekmelody	@ltx/en_us_dedes/he.a.m8:heAU.OTouParadoxou.greekname
ltx/en_us_dedes/me.m12.d29:meMA.Lauds1.incipit	…
ltx/en_us_dedes/me.m12.d29:meMA.Lauds1.melody	@ltx/en_us_dedes/he.a.m8:heAU.OTouParadoxou.name
ltx/en_us_dedes/me.m12.d29:meMA.Lauds1.mode	@ltx/en_us_dedes/miscellanea:misc.Mode8
ltx/en_us_dedes/me.m12.d29:meMA.Lauds1.text	
ltx/en_us_dedes/me.m12.d29:meMA.Lauds2.incipit	…
ltx/en_us_dedes/me.m12.d29:meMA.Lauds2.melody	@ltx/en_us_dedes/he.a.m8:heAU.OTouParadoxou.name
ltx/en_us_dedes/me.m12.d29:meMA.Lauds2.mode	@ltx/en_us_dedes/miscellanea:misc.Mode8
ltx/en_us_dedes/me.m12.d29:meMA.Lauds2.text	
ltx/en_us_dedes/me.m12.d29:meMA.Lauds3.incipit	…
ltx/en_us_dedes/me.m12.d29:meMA.Lauds3.melody	@ltx/en_us_dedes/he.a.m8:heAU.OTouParadoxou.name
ltx/en_us_dedes/me.m12.d29:meMA.Lauds3.mode	@ltx/en_us_dedes/miscellanea:misc.Mode8
ltx/en_us_dedes/me.m12.d29:meMA.Lauds3.text	
ltx/en_us_dedes/me.m12.d29:meMA.LaudsBoth.incipit	@ltx/en_us_dedes/me.m12.d26:meVE.AposGlory.incipit
ltx/en_us_dedes/me.m12.d29:meMA.LaudsBoth.melody	
ltx/en_us_dedes/me.m12.d29:meMA.LaudsBoth.mode	@ltx/en_us_dedes/miscellanea:misc.Mode8
ltx/en_us_dedes/me.m12.d29:meMA.LaudsBoth.text	@ltx/en_us_dedes/me.m12.d26:meVE.AposGlory.text
ltx/en_us_dedes/me.m12.d29:meMA.LaudsGlory.incipit	…
ltx/en_us_dedes/me.m12.d29:meMA.LaudsGlory.melody	
ltx/en_us_dedes/me.m12.d29:meMA.LaudsGlory.mode	@ltx/en_us_dedes/miscellanea:misc.Mode8
ltx/en_us_dedes/me.m12.d29:meMA.LaudsGlory.text	
ltx/en_us_dedes/me.m12.d29:meMA.Ode1C11.greekmelody	@ltx/en_us_dedes/he.h.m6:heHE.OsEnIpeiroPezefsas.greekname
ltx/en_us_dedes/me.m12.d29:meMA.Ode1C11.incipit	…
ltx/en_us_dedes/me.m12.d29:meMA.Ode1C11.melody	@ltx/en_us_dedes/he.h.m6:heHE.OsEnIpeiroPezefsas.name
ltx/en_us_dedes/me.m12.d29:meMA.Ode1C11.mode	@ltx/en_us_dedes/miscellanea:misc.Mode6
ltx/en_us_dedes/me.m12.d29:meMA.Ode1C11.ode	@ltx/en_us_dedes/miscellanea:misc.Ode1
ltx/en_us_dedes/me.m12.d29:meMA.Ode1C11.text	
ltx/en_us_dedes/me.m12.d29:meMA.Ode1C12.incipit	…
ltx/en_us_dedes/me.m12.d29:meMA.Ode1C12.melody	@ltx/en_us_dedes/he.h.m6:heHE.OsEnIpeiroPezefsas.name
ltx/en_us_dedes/me.m12.d29:meMA.Ode1C12.mode	@ltx/en_us_dedes/miscellanea:misc.Mode6
ltx/en_us_dedes/me.m12.d29:meMA.Ode1C12.ode	@ltx/en_us_dedes/miscellanea:misc.Ode1
ltx/en_us_dedes/me.m12.d29:meMA.Ode1C12.text	
ltx/en_us_dedes/me.m12.d29:meMA.Ode1C13.incipit	…
ltx/en_us_dedes/me.m12.d29:meMA.Ode1C13.melody	@ltx/en_us_dedes/he.h.m6:heHE.OsEnIpeiroPezefsas.name
ltx/en_us_dedes/me.m12.d29:meMA.Ode1C13.mode	@ltx/en_us_dedes/miscellanea:misc.Mode6
ltx/en_us_dedes/me.m12.d29:meMA.Ode1C13.ode	@ltx/en_us_dedes/miscellanea:misc.Ode1
ltx/en_us_dedes/me.m12.d29:meMA.Ode1C13.text	
ltx/en_us_dedes/me.m12.d29:meMA.Ode1C14.incipit	…
ltx/en_us_dedes/me.m12.d29:meMA.Ode1C14.melody	@ltx/en_us_dedes/he.h.m6:heHE.OsEnIpeiroPezefsas.name
ltx/en_us_dedes/me.m12.d29:meMA.Ode1C14.mode	@ltx/en_us_dedes/miscellanea:misc.Mode6
ltx/en_us_dedes/me.m12.d29:meMA.Ode1C14.ode	@ltx/en_us_dedes/miscellanea:misc.Ode1
ltx/en_us_dedes/me.m12.d29:meMA.Ode1C14.text	
ltx/en_us_dedes/me.m12.d29:meMA.Ode1C1T.incipit	…
ltx/en_us_dedes/me.m12.d29:meMA.Ode1C1T.melody	@ltx/en_us_dedes/he.h.m6:heHE.OsEnIpeiroPezefsas.name
ltx/en_us_dedes/me.m12.d29:meMA.Ode1C1T.mode	@ltx/en_us_dedes/miscellanea:misc.Mode6
ltx/en_us_dedes/me.m12.d29:meMA.Ode1C1T.ode	@ltx/en_us_dedes/miscellanea:misc.Ode1
ltx/en_us_dedes/me.m12.d29:meMA.Ode1C1T.text	
ltx/en_us_dedes/me.m12.d29:meMA.Ode3C11.greekmelody	@ltx/en_us_dedes/he.h.m6:heHE.OukEstinAgios.greekname
ltx/en_us_dedes/me.m12.d29:meMA.Ode3C11.incipit	…
ltx/en_us_dedes/me.m12.d29:meMA.Ode3C11.melody	@ltx/en_us_dedes/he.h.m6:heHE.OukEstinAgios.name
ltx/en_us_dedes/me.m12.d29:meMA.Ode3C11.mode	@ltx/en_us_dedes/miscellanea:misc.Mode6
ltx/en_us_dedes/me.m12.d29:meMA.Ode3C11.ode	@ltx/en_us_dedes/miscellanea:misc.Ode3
ltx/en_us_dedes/me.m12.d29:meMA.Ode3C11.text	
ltx/en_us_dedes/me.m12.d29:meMA.Ode3C12.incipit	…
ltx/en_us_dedes/me.m12.d29:meMA.Ode3C12.melody	@ltx/en_us_dedes/he.h.m6:heHE.OukEstinAgios.name
ltx/en_us_dedes/me.m12.d29:meMA.Ode3C12.mode	@ltx/en_us_dedes/miscellanea:misc.Mode6
ltx/en_us_dedes/me.m12.d29:meMA.Ode3C12.ode	@ltx/en_us_dedes/miscellanea:misc.Ode3
ltx/en_us_dedes/me.m12.d29:meMA.Ode3C12.text	
ltx/en_us_dedes/me.m12.d29:meMA.Ode3C13.incipit	…
ltx/en_us_dedes/me.m12.d29:meMA.Ode3C13.melody	@ltx/en_us_dedes/he.h.m6:heHE.OukEstinAgios.name
ltx/en_us_dedes/me.m12.d29:meMA.Ode3C13.mode	@ltx/en_us_dedes/miscellanea:misc.Mode6
ltx/en_us_dedes/me.m12.d29:meMA.Ode3C13.ode	@ltx/en_us_dedes/miscellanea:misc.Ode3
ltx/en_us_dedes/me.m12.d29:meMA.Ode3C13.text	
ltx/en_us_dedes/me.m12.d29:meMA.Ode3C14.incipit	…
ltx/en_us_dedes/me.m12.d29:meMA.Ode3C14.melody	@ltx/en_us_dedes/he.h.m6:heHE.OukEstinAgios.name
ltx/en_us_dedes/me.m12.d29:meMA.Ode3C14.mode	@ltx/en_us_dedes/miscellanea:misc.Mode6
ltx/en_us_dedes/me.m12.d29:meMA.Ode3C14.ode	@ltx/en_us_dedes/miscellanea:misc.Ode3
ltx/en_us_dedes/me.m12.d29:meMA.Ode3C14.text	
ltx/en_us_dedes/me.m12.d29:meMA.Ode3C1T.incipit	…
ltx/en_us_dedes/me.m12.d29:meMA.Ode3C1T.melody	@ltx/en_us_dedes/he.h.m6:heHE.OukEstinAgios.name
ltx/en_us_dedes/me.m12.d29:meMA.Ode3C1T.mode	@ltx/en_us_dedes/miscellanea:misc.Mode6
ltx/en_us_dedes/me.m12.d29:meMA.Ode3C1T.ode	@ltx/en_us_dedes/miscellanea:misc.Ode3
ltx/en_us_dedes/me.m12.d29:meMA.Ode3C1T.text	
ltx/en_us_dedes/me.m12.d29:meMA.Ode3H.greekmelody	@ltx/en_us_dedes/he.h.m6:heHE.OukEstinAgios.greekname
ltx/en_us_dedes/me.m12.d29:meMA.Ode3H.incipit	@ltx/en_us_dedes/he.h.m6:heHE.OukEstinAgios.incipit
ltx/en_us_dedes/me.m12.d29:meMA.Ode3H.melody	@ltx/en_us_dedes/he.h.m6:heHE.OukEstinAgios.melody
ltx/en_us_dedes/me.m12.d29:meMA.Ode3H.mode	@ltx/en_us_dedes/miscellanea:misc.Mode6
ltx/en_us_dedes/me.m12.d29:meMA.Ode3H.ode	@ltx/en_us_dedes/miscellanea:misc.Ode3
ltx/en_us_dedes/me.m12.d29:meMA.Ode3H.text	@ltx/en_us_dedes/he.h.m6:heHE.OukEstinAgios.text
ltx/en_us_dedes/me.m12.d29:meMA.Ode3Kathisma1.greekmelody	@ltx/en_us_dedes/he.a.m4:heAU.EpefanisSimeron.greekname
ltx/en_us_dedes/me.m12.d29:meMA.Ode3Kathisma1.incipit	…
ltx/en_us_dedes/me.m12.d29:meMA.Ode3Kathisma1.melody	@ltx/en_us_dedes/he.a.m4:heAU.EpefanisSimeron.name
ltx/en_us_dedes/me.m12.d29:meMA.Ode3Kathisma1.mode	@ltx/en_us_dedes/miscellanea:misc.Mode4
ltx/en_us_dedes/me.m12.d29:meMA.Ode3Kathisma1.text	
ltx/en_us_dedes/me.m12.d29:meMA.Ode3Kathisma2.greekmelody	@ltx/en_us_dedes/he.a.m4:heAU.TachyProkatalave.greekname
ltx/en_us_dedes/me.m12.d29:meMA.Ode3Kathisma2.incipit	…
ltx/en_us_dedes/me.m12.d29:meMA.Ode3Kathisma2.melody	@ltx/en_us_dedes/he.a.m4:heAU.TachyProkatalave.name
ltx/en_us_dedes/me.m12.d29:meMA.Ode3Kathisma2.mode	@ltx/en_us_dedes/miscellanea:misc.Mode4
ltx/en_us_dedes/me.m12.d29:meMA.Ode3Kathisma2.text	
ltx/en_us_dedes/me.m12.d29:meMA.Ode3Kathisma3.greekmelody	@ltx/en_us_dedes/he.a.m4:heAU.TachyProkatalave.greekname
ltx/en_us_dedes/me.m12.d29:meMA.Ode3Kathisma3.incipit	…
ltx/en_us_dedes/me.m12.d29:meMA.Ode3Kathisma3.melody	@ltx/en_us_dedes/he.a.m4:heAU.TachyProkatalave.name
ltx/en_us_dedes/me.m12.d29:meMA.Ode3Kathisma3.mode	@ltx/en_us_dedes/miscellanea:misc.Mode4
ltx/en_us_dedes/me.m12.d29:meMA.Ode3Kathisma3.text	
ltx/en_us_dedes/me.m12.d29:meMA.Ode4C11.greekmelody	@ltx/en_us_dedes/he.h.m6:heHE.ChristosMouDynamis.greekname
ltx/en_us_dedes/me.m12.d29:meMA.Ode4C11.incipit	…
ltx/en_us_dedes/me.m12.d29:meMA.Ode4C11.melody	@ltx/en_us_dedes/he.h.m6:heHE.ChristosMouDynamis.name
ltx/en_us_dedes/me.m12.d29:meMA.Ode4C11.mode	@ltx/en_us_dedes/miscellanea:misc.Mode6
ltx/en_us_dedes/me.m12.d29:meMA.Ode4C11.ode	@ltx/en_us_dedes/miscellanea:misc.Ode4
ltx/en_us_dedes/me.m12.d29:meMA.Ode4C11.text	
ltx/en_us_dedes/me.m12.d29:meMA.Ode4C12.incipit	…
ltx/en_us_dedes/me.m12.d29:meMA.Ode4C12.melody	@ltx/en_us_dedes/he.h.m6:heHE.ChristosMouDynamis.name
ltx/en_us_dedes/me.m12.d29:meMA.Ode4C12.mode	@ltx/en_us_dedes/miscellanea:misc.Mode6
ltx/en_us_dedes/me.m12.d29:meMA.Ode4C12.ode	@ltx/en_us_dedes/miscellanea:misc.Ode4
ltx/en_us_dedes/me.m12.d29:meMA.Ode4C12.text	
ltx/en_us_dedes/me.m12.d29:meMA.Ode4C13.incipit	…
ltx/en_us_dedes/me.m12.d29:meMA.Ode4C13.melody	@ltx/en_us_dedes/he.h.m6:heHE.ChristosMouDynamis.name
ltx/en_us_dedes/me.m12.d29:meMA.Ode4C13.mode	@ltx/en_us_dedes/miscellanea:misc.Mode6
ltx/en_us_dedes/me.m12.d29:meMA.Ode4C13.ode	@ltx/en_us_dedes/miscellanea:misc.Ode4
ltx/en_us_dedes/me.m12.d29:meMA.Ode4C13.text	
ltx/en_us_dedes/me.m12.d29:meMA.Ode4C14.incipit	…
ltx/en_us_dedes/me.m12.d29:meMA.Ode4C14.melody	@ltx/en_us_dedes/he.h.m6:heHE.ChristosMouDynamis.name
ltx/en_us_dedes/me.m12.d29:meMA.Ode4C14.mode	@ltx/en_us_dedes/miscellanea:misc.Mode6
ltx/en_us_dedes/me.m12.d29:meMA.Ode4C14.ode	@ltx/en_us_dedes/miscellanea:misc.Ode4
ltx/en_us_dedes/me.m12.d29:meMA.Ode4C14.text	
ltx/en_us_dedes/me.m12.d29:meMA.Ode4C1T.incipit	…
ltx/en_us_dedes/me.m12.d29:meMA.Ode4C1T.melody	@ltx/en_us_dedes/he.h.m6:heHE.ChristosMouDynamis.name
ltx/en_us_dedes/me.m12.d29:meMA.Ode4C1T.mode	@ltx/en_us_dedes/miscellanea:misc.Mode6
ltx/en_us_dedes/me.m12.d29:meMA.Ode4C1T.ode	@ltx/en_us_dedes/miscellanea:misc.Ode4
ltx/en_us_dedes/me.m12.d29:meMA.Ode4C1T.text	
ltx/en_us_dedes/me.m12.d29:meMA.Ode5C11.greekmelody	@ltx/en_us_dedes/he.h.m6:heHE.ToTheioFengeiSou.greekname
ltx/en_us_dedes/me.m12.d29:meMA.Ode5C11.incipit	…
ltx/en_us_dedes/me.m12.d29:meMA.Ode5C11.melody	@ltx/en_us_dedes/he.h.m6:heHE.ToTheioFengeiSou.name
ltx/en_us_dedes/me.m12.d29:meMA.Ode5C11.mode	@ltx/en_us_dedes/miscellanea:misc.Mode6
ltx/en_us_dedes/me.m12.d29:meMA.Ode5C11.ode	@ltx/en_us_dedes/miscellanea:misc.Ode5
ltx/en_us_dedes/me.m12.d29:meMA.Ode5C11.text	
ltx/en_us_dedes/me.m12.d29:meMA.Ode5C12.incipit	…
ltx/en_us_dedes/me.m12.d29:meMA.Ode5C12.melody	@ltx/en_us_dedes/he.h.m6:heHE.ToTheioFengeiSou.name
ltx/en_us_dedes/me.m12.d29:meMA.Ode5C12.mode	@ltx/en_us_dedes/miscellanea:misc.Mode6
ltx/en_us_dedes/me.m12.d29:meMA.Ode5C12.ode	@ltx/en_us_dedes/miscellanea:misc.Ode5
ltx/en_us_dedes/me.m12.d29:meMA.Ode5C12.text	
ltx/en_us_dedes/me.m12.d29:meMA.Ode5C13.incipit	…
ltx/en_us_dedes/me.m12.d29:meMA.Ode5C13.melody	@ltx/en_us_dedes/he.h.m6:heHE.ToTheioFengeiSou.name
ltx/en_us_dedes/me.m12.d29:meMA.Ode5C13.mode	@ltx/en_us_dedes/miscellanea:misc.Mode6
ltx/en_us_dedes/me.m12.d29:meMA.Ode5C13.ode	@ltx/en_us_dedes/miscellanea:misc.Ode5
ltx/en_us_dedes/me.m12.d29:meMA.Ode5C13.text	
ltx/en_us_dedes/me.m12.d29:meMA.Ode5C1T.incipit	…
ltx/en_us_dedes/me.m12.d29:meMA.Ode5C1T.melody	@ltx/en_us_dedes/he.h.m6:heHE.ToTheioFengeiSou.name
ltx/en_us_dedes/me.m12.d29:meMA.Ode5C1T.mode	@ltx/en_us_dedes/miscellanea:misc.Mode6
ltx/en_us_dedes/me.m12.d29:meMA.Ode5C1T.ode	@ltx/en_us_dedes/miscellanea:misc.Ode5
ltx/en_us_dedes/me.m12.d29:meMA.Ode5C1T.text	
ltx/en_us_dedes/me.m12.d29:meMA.Ode6C11.greekmelody	@ltx/en_us_dedes/he.h.m6:heHE.TouViouTinThalassan.greekname
ltx/en_us_dedes/me.m12.d29:meMA.Ode6C11.incipit	…
ltx/en_us_dedes/me.m12.d29:meMA.Ode6C11.melody	@ltx/en_us_dedes/he.h.m6:heHE.TouViouTinThalassan.name
ltx/en_us_dedes/me.m12.d29:meMA.Ode6C11.mode	@ltx/en_us_dedes/miscellanea:misc.Mode6
ltx/en_us_dedes/me.m12.d29:meMA.Ode6C11.ode	@ltx/en_us_dedes/miscellanea:misc.Ode6
ltx/en_us_dedes/me.m12.d29:meMA.Ode6C11.text	
ltx/en_us_dedes/me.m12.d29:meMA.Ode6C12.incipit	…
ltx/en_us_dedes/me.m12.d29:meMA.Ode6C12.melody	@ltx/en_us_dedes/he.h.m6:heHE.TouViouTinThalassan.name
ltx/en_us_dedes/me.m12.d29:meMA.Ode6C12.mode	@ltx/en_us_dedes/miscellanea:misc.Mode6
ltx/en_us_dedes/me.m12.d29:meMA.Ode6C12.ode	@ltx/en_us_dedes/miscellanea:misc.Ode6
ltx/en_us_dedes/me.m12.d29:meMA.Ode6C12.text	
ltx/en_us_dedes/me.m12.d29:meMA.Ode6C13.incipit	…
ltx/en_us_dedes/me.m12.d29:meMA.Ode6C13.melody	@ltx/en_us_dedes/he.h.m6:heHE.TouViouTinThalassan.name
ltx/en_us_dedes/me.m12.d29:meMA.Ode6C13.mode	@ltx/en_us_dedes/miscellanea:misc.Mode6
ltx/en_us_dedes/me.m12.d29:meMA.Ode6C13.ode	@ltx/en_us_dedes/miscellanea:misc.Ode6
ltx/en_us_dedes/me.m12.d29:meMA.Ode6C13.text	
ltx/en_us_dedes/me.m12.d29:meMA.Ode6C1T.incipit	…
ltx/en_us_dedes/me.m12.d29:meMA.Ode6C1T.melody	@ltx/en_us_dedes/he.h.m6:heHE.TouViouTinThalassan.name
ltx/en_us_dedes/me.m12.d29:meMA.Ode6C1T.mode	@ltx/en_us_dedes/miscellanea:misc.Mode6
ltx/en_us_dedes/me.m12.d29:meMA.Ode6C1T.ode	@ltx/en_us_dedes/miscellanea:misc.Ode6
ltx/en_us_dedes/me.m12.d29:meMA.Ode6C1T.text	
ltx/en_us_dedes/me.m12.d29:meMA.Ode6H.greekmelody	@ltx/en_us_dedes/he.h.m6:heHE.TouViouTinThalassan.greekname
ltx/en_us_dedes/me.m12.d29:meMA.Ode6H.incipit	@ltx/en_us_dedes/he.h.m6:heHE.TouViouTinThalassan.incipit
ltx/en_us_dedes/me.m12.d29:meMA.Ode6H.melody	@ltx/en_us_dedes/he.h.m6:heHE.TouViouTinThalassan.melody
ltx/en_us_dedes/me.m12.d29:meMA.Ode6H.mode	@ltx/en_us_dedes/miscellanea:misc.Mode6
ltx/en_us_dedes/me.m12.d29:meMA.Ode6H.ode	@ltx/en_us_dedes/miscellanea:misc.Ode6
ltx/en_us_dedes/me.m12.d29:meMA.Ode6H.text	@ltx/en_us_dedes/he.h.m6:heHE.TouViouTinThalassan.text
ltx/en_us_dedes/me.m12.d29:meMA.Ode7C11.greekmelody	@ltx/en_us_dedes/he.h.m6:heHE.DrosovolonMenTinKaminon.greekname
ltx/en_us_dedes/me.m12.d29:meMA.Ode7C11.incipit	…
ltx/en_us_dedes/me.m12.d29:meMA.Ode7C11.melody	@ltx/en_us_dedes/he.h.m6:heHE.DrosovolonMenTinKaminon.name
ltx/en_us_dedes/me.m12.d29:meMA.Ode7C11.mode	@ltx/en_us_dedes/miscellanea:misc.Mode6
ltx/en_us_dedes/me.m12.d29:meMA.Ode7C11.ode	@ltx/en_us_dedes/miscellanea:misc.Ode7
ltx/en_us_dedes/me.m12.d29:meMA.Ode7C11.text	
ltx/en_us_dedes/me.m12.d29:meMA.Ode7C12.incipit	…
ltx/en_us_dedes/me.m12.d29:meMA.Ode7C12.melody	@ltx/en_us_dedes/he.h.m6:heHE.DrosovolonMenTinKaminon.name
ltx/en_us_dedes/me.m12.d29:meMA.Ode7C12.mode	@ltx/en_us_dedes/miscellanea:misc.Mode6
ltx/en_us_dedes/me.m12.d29:meMA.Ode7C12.ode	@ltx/en_us_dedes/miscellanea:misc.Ode7
ltx/en_us_dedes/me.m12.d29:meMA.Ode7C12.text	
ltx/en_us_dedes/me.m12.d29:meMA.Ode7C13.incipit	…
ltx/en_us_dedes/me.m12.d29:meMA.Ode7C13.melody	@ltx/en_us_dedes/he.h.m6:heHE.DrosovolonMenTinKaminon.name
ltx/en_us_dedes/me.m12.d29:meMA.Ode7C13.mode	@ltx/en_us_dedes/miscellanea:misc.Mode6
ltx/en_us_dedes/me.m12.d29:meMA.Ode7C13.ode	@ltx/en_us_dedes/miscellanea:misc.Ode7
ltx/en_us_dedes/me.m12.d29:meMA.Ode7C13.text	
ltx/en_us_dedes/me.m12.d29:meMA.Ode7C14.incipit	…
ltx/en_us_dedes/me.m12.d29:meMA.Ode7C14.melody	@ltx/en_us_dedes/he.h.m6:heHE.DrosovolonMenTinKaminon.name
ltx/en_us_dedes/me.m12.d29:meMA.Ode7C14.mode	@ltx/en_us_dedes/miscellanea:misc.Mode6
ltx/en_us_dedes/me.m12.d29:meMA.Ode7C14.ode	@ltx/en_us_dedes/miscellanea:misc.Ode7
ltx/en_us_dedes/me.m12.d29:meMA.Ode7C14.text	
ltx/en_us_dedes/me.m12.d29:meMA.Ode7C1T.incipit	…
ltx/en_us_dedes/me.m12.d29:meMA.Ode7C1T.melody	@ltx/en_us_dedes/he.h.m6:heHE.DrosovolonMenTinKaminon.name
ltx/en_us_dedes/me.m12.d29:meMA.Ode7C1T.mode	@ltx/en_us_dedes/miscellanea:misc.Mode6
ltx/en_us_dedes/me.m12.d29:meMA.Ode7C1T.ode	@ltx/en_us_dedes/miscellanea:misc.Ode7
ltx/en_us_dedes/me.m12.d29:meMA.Ode7C1T.text	
ltx/en_us_dedes/me.m12.d29:meMA.Ode8C11.greekmelody	@ltx/en_us_dedes/he.h.m6:heHE.EkFlogosToisOsiois.greekname
ltx/en_us_dedes/me.m12.d29:meMA.Ode8C11.incipit	…
ltx/en_us_dedes/me.m12.d29:meMA.Ode8C11.melody	@ltx/en_us_dedes/he.h.m6:heHE.EkFlogosToisOsiois.name
ltx/en_us_dedes/me.m12.d29:meMA.Ode8C11.mode	@ltx/en_us_dedes/miscellanea:misc.Mode6
ltx/en_us_dedes/me.m12.d29:meMA.Ode8C11.ode	@ltx/en_us_dedes/miscellanea:misc.Ode8
ltx/en_us_dedes/me.m12.d29:meMA.Ode8C11.text	
ltx/en_us_dedes/me.m12.d29:meMA.Ode8C12.incipit	…
ltx/en_us_dedes/me.m12.d29:meMA.Ode8C12.melody	@ltx/en_us_dedes/he.h.m6:heHE.EkFlogosToisOsiois.name
ltx/en_us_dedes/me.m12.d29:meMA.Ode8C12.mode	@ltx/en_us_dedes/miscellanea:misc.Mode6
ltx/en_us_dedes/me.m12.d29:meMA.Ode8C12.ode	@ltx/en_us_dedes/miscellanea:misc.Ode8
ltx/en_us_dedes/me.m12.d29:meMA.Ode8C12.text	
ltx/en_us_dedes/me.m12.d29:meMA.Ode8C13.incipit	…
ltx/en_us_dedes/me.m12.d29:meMA.Ode8C13.melody	@ltx/en_us_dedes/he.h.m6:heHE.EkFlogosToisOsiois.name
ltx/en_us_dedes/me.m12.d29:meMA.Ode8C13.mode	@ltx/en_us_dedes/miscellanea:misc.Mode6
ltx/en_us_dedes/me.m12.d29:meMA.Ode8C13.ode	@ltx/en_us_dedes/miscellanea:misc.Ode8
ltx/en_us_dedes/me.m12.d29:meMA.Ode8C13.text	
ltx/en_us_dedes/me.m12.d29:meMA.Ode8C14.incipit	…
ltx/en_us_dedes/me.m12.d29:meMA.Ode8C14.melody	@ltx/en_us_dedes/he.h.m6:heHE.EkFlogosToisOsiois.name
ltx/en_us_dedes/me.m12.d29:meMA.Ode8C14.mode	@ltx/en_us_dedes/miscellanea:misc.Mode6
ltx/en_us_dedes/me.m12.d29:meMA.Ode8C14.ode	@ltx/en_us_dedes/miscellanea:misc.Ode8
ltx/en_us_dedes/me.m12.d29:meMA.Ode8C14.text	
ltx/en_us_dedes/me.m12.d29:meMA.Ode8C1T.incipit	…
ltx/en_us_dedes/me.m12.d29:meMA.Ode8C1T.melody	@ltx/en_us_dedes/he.h.m6:heHE.EkFlogosToisOsiois.name
ltx/en_us_dedes/me.m12.d29:meMA.Ode8C1T.mode	@ltx/en_us_dedes/miscellanea:misc.Mode6
ltx/en_us_dedes/me.m12.d29:meMA.Ode8C1T.ode	@ltx/en_us_dedes/miscellanea:misc.Ode8
ltx/en_us_dedes/me.m12.d29:meMA.Ode8C1T.text	
ltx/en_us_dedes/me.m12.d29:meMA.Ode8H.greekmelody	@ltx/en_us_dedes/he.h.m6:heHE.EkFlogosToisOsiois.greekname
ltx/en_us_dedes/me.m12.d29:meMA.Ode8H.incipit	@ltx/en_us_dedes/he.h.m6:heHE.EkFlogosToisOsiois.incipit
ltx/en_us_dedes/me.m12.d29:meMA.Ode8H.melody	@ltx/en_us_dedes/he.h.m6:heHE.EkFlogosToisOsiois.melody
ltx/en_us_dedes/me.m12.d29:meMA.Ode8H.mode	@ltx/en_us_dedes/miscellanea:misc.Mode6
ltx/en_us_dedes/me.m12.d29:meMA.Ode8H.ode	@ltx/en_us_dedes/miscellanea:misc.Ode8
ltx/en_us_dedes/me.m12.d29:meMA.Ode8H.text	@ltx/en_us_dedes/he.h.m6:heHE.EkFlogosToisOsiois.text
ltx/en_us_dedes/me.m12.d29:meMA.Ode9C11.greekmelody	@ltx/en_us_dedes/he.h.m6:heHE.TheonAnthropois.greekname
ltx/en_us_dedes/me.m12.d29:meMA.Ode9C11.incipit	…
ltx/en_us_dedes/me.m12.d29:meMA.Ode9C11.melody	@ltx/en_us_dedes/he.h.m6:heHE.TheonAnthropois.name
ltx/en_us_dedes/me.m12.d29:meMA.Ode9C11.mode	@ltx/en_us_dedes/miscellanea:misc.Mode6
ltx/en_us_dedes/me.m12.d29:meMA.Ode9C11.ode	@ltx/en_us_dedes/miscellanea:misc.Ode9
ltx/en_us_dedes/me.m12.d29:meMA.Ode9C11.text	
ltx/en_us_dedes/me.m12.d29:meMA.Ode9C12.incipit	…
ltx/en_us_dedes/me.m12.d29:meMA.Ode9C12.melody	@ltx/en_us_dedes/he.h.m6:heHE.TheonAnthropois.name
ltx/en_us_dedes/me.m12.d29:meMA.Ode9C12.mode	@ltx/en_us_dedes/miscellanea:misc.Mode6
ltx/en_us_dedes/me.m12.d29:meMA.Ode9C12.ode	@ltx/en_us_dedes/miscellanea:misc.Ode9
ltx/en_us_dedes/me.m12.d29:meMA.Ode9C12.text	
ltx/en_us_dedes/me.m12.d29:meMA.Ode9C13.incipit	…
ltx/en_us_dedes/me.m12.d29:meMA.Ode9C13.melody	@ltx/en_us_dedes/he.h.m6:heHE.TheonAnthropois.name
ltx/en_us_dedes/me.m12.d29:meMA.Ode9C13.mode	@ltx/en_us_dedes/miscellanea:misc.Mode6
ltx/en_us_dedes/me.m12.d29:meMA.Ode9C13.ode	@ltx/en_us_dedes/miscellanea:misc.Ode9
ltx/en_us_dedes/me.m12.d29:meMA.Ode9C13.text	
ltx/en_us_dedes/me.m12.d29:meMA.Ode9C14.incipit	…
ltx/en_us_dedes/me.m12.d29:meMA.Ode9C14.melody	@ltx/en_us_dedes/he.h.m6:heHE.TheonAnthropois.name
ltx/en_us_dedes/me.m12.d29:meMA.Ode9C14.mode	@ltx/en_us_dedes/miscellanea:misc.Mode6
ltx/en_us_dedes/me.m12.d29:meMA.Ode9C14.ode	@ltx/en_us_dedes/miscellanea:misc.Ode9
ltx/en_us_dedes/me.m12.d29:meMA.Ode9C14.text	
ltx/en_us_dedes/me.m12.d29:meMA.Ode9C1T.incipit	…
ltx/en_us_dedes/me.m12.d29:meMA.Ode9C1T.melody	@ltx/en_us_dedes/he.h.m6:heHE.TheonAnthropois.name
ltx/en_us_dedes/me.m12.d29:meMA.Ode9C1T.mode	@ltx/en_us_dedes/miscellanea:misc.Mode6
ltx/en_us_dedes/me.m12.d29:meMA.Ode9C1T.ode	@ltx/en_us_dedes/miscellanea:misc.Ode9
ltx/en_us_dedes/me.m12.d29:meMA.Ode9C1T.text	
ltx/en_us_dedes/me.m12.d29:meMA.Ode9H.greekmelody	@ltx/en_us_dedes/he.h.m6:heHE.TheonAnthropois.greekname
ltx/en_us_dedes/me.m12.d29:meMA.Ode9H.incipit	@ltx/en_us_dedes/he.h.m6:heHE.TheonAnthropois.incipit
ltx/en_us_dedes/me.m12.d29:meMA.Ode9H.melody	@ltx/en_us_dedes/he.h.m6:heHE.TheonAnthropois.melody
ltx/en_us_dedes/me.m12.d29:meMA.Ode9H.mode	@ltx/en_us_dedes/miscellanea:misc.Mode6
ltx/en_us_dedes/me.m12.d29:meMA.Ode9H.ode	@ltx/en_us_dedes/miscellanea:misc.Ode9
ltx/en_us_dedes/me.m12.d29:meMA.Ode9H.text	@ltx/en_us_dedes/he.h.m6:heHE.TheonAnthropois.text
ltx/en_us_dedes/me.m12.d29:meMA.Oikos1.text	As heaven and earth are together celebrating the appearance of the King of all, Herod alone aches with the Jews who murdered the Prophets. And it is right that they alone should lament; for from now on they shall no longer reign, since the reign of the Lord will continue to rule, and it will resist the audacity of the enemies, and it will gather the many believers, along with the holy Innocents, to gaze on the Lord who lay in a manger as a newborn babe.
ltx/en_us_dedes/me.m12.d29:meVE.Apolytikion1.incipit	@ltx/en_us_dedes/he.ga:heGA.TasAlgidonas.incipit
ltx/en_us_dedes/me.m12.d29:meVE.Apolytikion1.melody	
ltx/en_us_dedes/me.m12.d29:meVE.Apolytikion1.mode	@ltx/en_us_dedes/miscellanea:misc.Mode1
ltx/en_us_dedes/me.m12.d29:meVE.Apolytikion1.text	@ltx/en_us_dedes/he.ga:heGA.TasAlgidonas.text
ltx/en_us_dedes/me.m12.d29:meVE.Apolytikion2ger.greekmelody	@ltx/en_us_dedes/he.a.m1:heAU.TonTafonSouSotir.greekname
ltx/en_us_dedes/me.m12.d29:meVE.Apolytikion2ger.incipit	…
ltx/en_us_dedes/me.m12.d29:meVE.Apolytikion2ger.melody	@ltx/en_us_dedes/he.a.m1:heAU.TonTafonSouSotir.name
ltx/en_us_dedes/me.m12.d29:meVE.Apolytikion2ger.mode	@ltx/en_us_dedes/miscellanea:misc.Mode1
ltx/en_us_dedes/me.m12.d29:meVE.Apolytikion2ger.poet	@ltx/en_us_dedes/poets:po.Gerasimou
ltx/en_us_dedes/me.m12.d29:meVE.Apolytikion2ger.text	
ltx/en_us_dedes/me.m12.d29:meVE.Apolytikion3ger.greekmelody	@ltx/en_us_dedes/he.a.m3:heAU.TheiasPisteos.greekname
ltx/en_us_dedes/me.m12.d29:meVE.Apolytikion3ger.incipit	…
ltx/en_us_dedes/me.m12.d29:meVE.Apolytikion3ger.melody	@ltx/en_us_dedes/he.a.m3:heAU.TheiasPisteos.name
ltx/en_us_dedes/me.m12.d29:meVE.Apolytikion3ger.mode	@ltx/en_us_dedes/miscellanea:misc.Mode3
ltx/en_us_dedes/me.m12.d29:meVE.Apolytikion3ger.poet	@ltx/en_us_dedes/poets:po.Gerasimou
ltx/en_us_dedes/me.m12.d29:meVE.Apolytikion3ger.text	
ltx/en_us_dedes/me.m12.d29:meVE.AposBoth.incipit	@ltx/en_us_dedes/me.m12.d26:meVE.Aposticha2.incipit
ltx/en_us_dedes/me.m12.d29:meVE.AposBoth.melody	
ltx/en_us_dedes/me.m12.d29:meVE.AposBoth.mode	@ltx/en_us_dedes/miscellanea:misc.Mode8
ltx/en_us_dedes/me.m12.d29:meVE.AposBoth.text	@ltx/en_us_dedes/me.m12.d26:meVE.Aposticha2.text
ltx/en_us_dedes/me.m12.d29:meVE.AposGlory.incipit	When Jesus was born in…
ltx/en_us_dedes/me.m12.d29:meVE.AposGlory.melody	
ltx/en_us_dedes/me.m12.d29:meVE.AposGlory.mode	@ltx/en_us_dedes/miscellanea:misc.Mode8
ltx/en_us_dedes/me.m12.d29:meVE.AposGlory.poet	@ltx/en_us_dedes/poets:po.AndreouKritis
ltx/en_us_dedes/me.m12.d29:meVE.AposGlory.text	When Jesus was born in Bethlehem of Judea, the dominion of the Judeans came to an end. Let the innocent Infants leap for joy, even as they are slaughtered for Christ. But lament, O Judea; for a voice was heard in Ramah, Rachael weeps, as it is written, and laments for her children. When Herod, the lawless king, had the infants killed, he fulfilled the Scripture, by filling Judea with innocent blood. The ground turned red with the blood of the babes, but the Church of the Gentiles was mystically purified and adorned. The truth has come, God has appeared, to those sitting in darkness. He was born of a Virgin, in order to save us.
ltx/en_us_dedes/me.m12.d29:meVE.Aposticha1.greekmelody	@ltx/en_us_dedes/he.a.m6:heAU.TriimerosAnestis.greekname
ltx/en_us_dedes/me.m12.d29:meVE.Aposticha1.incipit	I see an awesome mystery…
ltx/en_us_dedes/me.m12.d29:meVE.Aposticha1.melody	@ltx/en_us_dedes/he.a.m6:heAU.TriimerosAnestis.name
ltx/en_us_dedes/me.m12.d29:meVE.Aposticha1.mode	@ltx/en_us_dedes/miscellanea:misc.Mode6
ltx/en_us_dedes/me.m12.d29:meVE.Aposticha1.text	I see an awesome mystery here; * for God, who ever holds in His hand * all creation, * is encompassed now in flesh * and lying in a manger; * and He who wraps the oceans * in fog is wrapped now in swaddling clothes.
ltx/en_us_dedes/me.m12.d29:meVE.Aposticha2.incipit	Our fleshless God has taken…
ltx/en_us_dedes/me.m12.d29:meVE.Aposticha2.melody	@ltx/en_us_dedes/he.a.m6:heAU.TriimerosAnestis.name
ltx/en_us_dedes/me.m12.d29:meVE.Aposticha2.mode	@ltx/en_us_dedes/miscellanea:misc.Mode6
ltx/en_us_dedes/me.m12.d29:meVE.Aposticha2.text	Our fleshless God has taken flesh; * and He with no beginning begins; * and the full One * now is emptying himself * inside a tiny grotto. * And nursing from a Virgin * is He who nourishes all living things.
ltx/en_us_dedes/me.m12.d29:meVE.Aposticha3.incipit	At Christ the Lord’s Nativity…
ltx/en_us_dedes/me.m12.d29:meVE.Aposticha3.melody	@ltx/en_us_dedes/he.a.m6:heAU.TriimerosAnestis.name
ltx/en_us_dedes/me.m12.d29:meVE.Aposticha3.mode	@ltx/en_us_dedes/miscellanea:misc.Mode6
ltx/en_us_dedes/me.m12.d29:meVE.Aposticha3.text	At Christ the Lord’s Nativity, * the Shepherds sing and glorify * with the Angels; * and the Star becomes a guide * for Magi, who adore Him. * And now that He has saved us, * we praise magnify the Mother of God.
ltx/en_us_dedes/me.m12.d29:meVE.GeneralApolytikion3.name	Marcellus,
ltx/en_us_dedes/me.m12.d29:meVE.MM.GeneralApolytikion3.text	@ltx/en_us_dedes/properties:media.key
ltx/en_us_dedes/me.m12.d29:meVE.SticBoth.incipit	@ltx/en_us_dedes/me.m12.d26:meVE.Aposticha1.incipit
ltx/en_us_dedes/me.m12.d29:meVE.SticBoth.melody	
ltx/en_us_dedes/me.m12.d29:meVE.SticBoth.mode	@ltx/en_us_dedes/miscellanea:misc.Mode8
ltx/en_us_dedes/me.m12.d29:meVE.SticBoth.text	@ltx/en_us_dedes/me.m12.d26:meVE.Aposticha1.text
ltx/en_us_dedes/me.m12.d29:meVE.SticGlory.incipit	Herod, the unlawful King, saw…
ltx/en_us_dedes/me.m12.d29:meVE.SticGlory.melody	
ltx/en_us_dedes/me.m12.d29:meVE.SticGlory.mode	@ltx/en_us_dedes/miscellanea:misc.Mode8
ltx/en_us_dedes/me.m12.d29:meVE.SticGlory.poet	@ltx/en_us_dedes/poets:po.AndreouKritis
ltx/en_us_dedes/me.m12.d29:meVE.SticGlory.text	Herod, the unlawful King, saw the star that was brighter than anything created, and he was troubled. And he snatched the nursing infants from their mothers’ arms. But Elizabeth escaped with John; and she begged a rock, “Take me in, a mother with her child.” And the mountain received the Forerunner. A manger guarded the Treasure, which the star had revealed. And Magi worshipped Him. Glory to You, O Lord.
ltx/en_us_dedes/me.m12.d29:meVE.Stichera01.greekmelody	@ltx/en_us_dedes/he.a.m4:heAU.OsGennaionEnMartysi.greekname
ltx/en_us_dedes/me.m12.d29:meVE.Stichera01.incipit	Herod ordered the sacrifice *…
ltx/en_us_dedes/me.m12.d29:meVE.Stichera01.melody	@ltx/en_us_dedes/he.a.m4:heAU.OsGennaionEnMartysi.name
ltx/en_us_dedes/me.m12.d29:meVE.Stichera01.mode	@ltx/en_us_dedes/miscellanea:misc.Mode4
ltx/en_us_dedes/me.m12.d29:meVE.Stichera01.text	Herod ordered the sacrifice * of the innocent boys today, * for the lawless King sought the hidden treasure, Christ. * And thus fulfilled was the prophecy, * and Rachael was unconsoled, * as she witnessed their unjust * heinous slaughter and premature * death, and so she wept * and she wailed and she keened in lamentation. But rejoices as she sees them * now in the bosom of Abraham.
ltx/en_us_dedes/me.m12.d29:meVE.Stichera02.incipit	The unlawful King Herod sought…
ltx/en_us_dedes/me.m12.d29:meVE.Stichera02.melody	@ltx/en_us_dedes/he.a.m4:heAU.OsGennaionEnMartysi.name
ltx/en_us_dedes/me.m12.d29:meVE.Stichera02.mode	@ltx/en_us_dedes/miscellanea:misc.Mode4
ltx/en_us_dedes/me.m12.d29:meVE.Stichera02.text	The unlawful King Herod sought * to destroy the eternal King * who for us was born as a babe and entered time. * Since he could not find Him anywhere, * he slaughtered the Innocents, * fourteen thousand infant boys, * and unwittingly made the all * Martyrs of the Lord. * Now as citizens of the heav’nly Kingdom, till the end of time they censure * his mad obsession and foolish rage.
ltx/en_us_dedes/me.m12.d29:meVE.Stichera03.incipit	In Your goodness and love…
ltx/en_us_dedes/me.m12.d29:meVE.Stichera03.melody	@ltx/en_us_dedes/he.a.m4:heAU.OsGennaionEnMartysi.name
ltx/en_us_dedes/me.m12.d29:meVE.Stichera03.mode	@ltx/en_us_dedes/miscellanea:misc.Mode4
ltx/en_us_dedes/me.m12.d29:meVE.Stichera03.text	Being good and benevolent, * pre-eternal and timeless Lord, * You were born of Mary the Virgin and became * for us an infant; and now a host * of Infants is brought to You; * and their unpolluted souls * are ashine with martyric blood. * And most rightfully * You have placed them in everlasting Mansions, where they stand in accusation * of Herod’s brutal insanity.
ltx/en_us_dedes/me.m12.d29:meVE.Stichera04.greekmelody	@ltx/en_us_dedes/he.a.m4:heAU.OsGennaionEnMartysi.greekname
ltx/en_us_dedes/me.m12.d29:meVE.Stichera04.incipit	O Marcellus you showed yourself…
ltx/en_us_dedes/me.m12.d29:meVE.Stichera04.melody	@ltx/en_us_dedes/he.a.m4:heAU.OsGennaionEnMartysi.name
ltx/en_us_dedes/me.m12.d29:meVE.Stichera04.mode	@ltx/en_us_dedes/miscellanea:misc.Mode4
ltx/en_us_dedes/me.m12.d29:meVE.Stichera04.text	O Marcellus you showed yourself * as a model of self-control * and as an example of true humility * and of ascetical discipline, * a pillar that soars from earth * rising to the heavens’ heights, * and a partner of chastity, * O God-bearing Saint, * a true keeper of stillness, and a living rock of manliness and courage, * the rule of virtue for everyone.
ltx/en_us_dedes/me.m12.d29:meVE.Stichera05.incipit	You disdained things ephemeral *…
ltx/en_us_dedes/me.m12.d29:meVE.Stichera05.melody	@ltx/en_us_dedes/he.a.m4:heAU.OsGennaionEnMartysi.name
ltx/en_us_dedes/me.m12.d29:meVE.Stichera05.mode	@ltx/en_us_dedes/miscellanea:misc.Mode4
ltx/en_us_dedes/me.m12.d29:meVE.Stichera05.text	You disdained things ephemeral * and mundane, once you mounted on * higher contemplation, Marcellus blessed Saint. * And you conducted your way of life * as though immaterial, * even as you lived on earth * with your body, and honored Christ; * whom will you entreat * that He free from corruption and from dangers those who loyally now honor * your ever-ven’rable memory.
ltx/en_us_dedes/me.m12.d29:meVE.Stichera06.incipit	By acquiring the virtues all…
ltx/en_us_dedes/me.m12.d29:meVE.Stichera06.melody	@ltx/en_us_dedes/he.a.m4:heAU.OsGennaionEnMartysi.name
ltx/en_us_dedes/me.m12.d29:meVE.Stichera06.mode	@ltx/en_us_dedes/miscellanea:misc.Mode4
ltx/en_us_dedes/me.m12.d29:meVE.Stichera06.text	By acquiring the virtues all, * you gave wings to your flesh and soul, * and associated with the Angelic hosts. * You took no part in mundane delights, * Marcellus, because you had * ardent longing for the Lord, * your Creator and Savior Christ; * whom will you entreat * that He free from corruption and from dangers those who loyally now honor * your ever-ven’rable memory.
