ltx/en_us_dedes/sy.m11.d02:syMA.commemoration01.couplet1.title	@ltx/en_us_dedes/titles:ti.Verses
ltx/en_us_dedes/sy.m11.d02:syMA.commemoration01.couplet1.verse1	
ltx/en_us_dedes/sy.m11.d02:syMA.commemoration01.couplet1.verse2	
ltx/en_us_dedes/sy.m11.d02:syMA.commemoration01.narration.p01	
ltx/en_us_dedes/sy.m11.d02:syMA.commemoration01.single1	
ltx/en_us_dedes/sy.m11.d02:syMA.commemoration01.text	On November 2 we commemorate the contest of the holy Martyrs Acindynos, Pegasios, Aphthonios, Elpidophoros, and Anempodistos.
ltx/en_us_dedes/sy.m11.d02:syMA.commemoration02.couplet1.title	@ltx/en_us_dedes/titles:ti.Verses
ltx/en_us_dedes/sy.m11.d02:syMA.commemoration02.couplet1.verse1	
ltx/en_us_dedes/sy.m11.d02:syMA.commemoration02.couplet1.verse2	
ltx/en_us_dedes/sy.m11.d02:syMA.commemoration02.text	On this day we also commemorate the two holy Senators who died by the sword.
ltx/en_us_dedes/sy.m11.d02:syMA.commemoration03.couplet1.title	@ltx/en_us_dedes/titles:ti.Verses
ltx/en_us_dedes/sy.m11.d02:syMA.commemoration03.couplet1.verse1	
ltx/en_us_dedes/sy.m11.d02:syMA.commemoration03.couplet1.verse2	
ltx/en_us_dedes/sy.m11.d02:syMA.commemoration03.narration.p01	
ltx/en_us_dedes/sy.m11.d02:syMA.commemoration03.text	On this day we also commemorate the holy Martyrs Evdoxios, Agapios, and the holy eight others.
ltx/en_us_dedes/sy.m11.d02:syMA.commemoration04.couplet1.title	@ltx/en_us_dedes/titles:ti.Verses
ltx/en_us_dedes/sy.m11.d02:syMA.commemoration04.couplet1.verse1	
ltx/en_us_dedes/sy.m11.d02:syMA.commemoration04.couplet1.verse2	
ltx/en_us_dedes/sy.m11.d02:syMA.commemoration04.narration.p01	
ltx/en_us_dedes/sy.m11.d02:syMA.commemoration04.narration.p02	
ltx/en_us_dedes/sy.m11.d02:syMA.commemoration04.narration.p03	
ltx/en_us_dedes/sy.m11.d02:syMA.commemoration04.narration.p04	
ltx/en_us_dedes/sy.m11.d02:syMA.commemoration04.narration.p05	
ltx/en_us_dedes/sy.m11.d02:syMA.commemoration04.text	On this day we also commemorate our devout father St. Marcian of Cyrus.
ltx/en_us_dedes/sy.m11.d02:syMA.commemoration05.couplet1.title	@ltx/en_us_dedes/titles:ti.Verses
ltx/en_us_dedes/sy.m11.d02:syMA.commemoration05.couplet1.verse1	
ltx/en_us_dedes/sy.m11.d02:syMA.commemoration05.couplet1.verse2	
ltx/en_us_dedes/sy.m11.d02:syMA.commemoration05.text	The holy women Martyrs Kyriaki, Domnina, and Domna died by the sword.
ltx/en_us_dedes/sy.m11.d02:syMA.lastline	By the intercessions of Your Saints, O God, have mercy on us. Amen.
