ltx/en_us_dedes/ty.m01.d25:tyCommemoration.text	
ltx/en_us_dedes/ty.m01.d25:tyDate.text	
ltx/en_us_dedes/ty.m01.d25:tyLI.AfterCommunion.text	
ltx/en_us_dedes/ty.m01.d25:tyLI.AmboPrayer.text	
ltx/en_us_dedes/ty.m01.d25:tyLI.Antiphons.text	
ltx/en_us_dedes/ty.m01.d25:tyLI.Apolytikia.text	
ltx/en_us_dedes/ty.m01.d25:tyLI.CommunionHymn.text	
ltx/en_us_dedes/ty.m01.d25:tyLI.Dismissal.text	
ltx/en_us_dedes/ty.m01.d25:tyLI.EntranceHymn.text	
ltx/en_us_dedes/ty.m01.d25:tyLI.Epistle.text	
ltx/en_us_dedes/ty.m01.d25:tyLI.Gospel.text	
ltx/en_us_dedes/ty.m01.d25:tyLI.Kontakion.text	
ltx/en_us_dedes/ty.m01.d25:tyLI.Megalynarion.text	
ltx/en_us_dedes/ty.m01.d25:tyLI.TheotokosHymn.text	
ltx/en_us_dedes/ty.m01.d25:tyMA.Anavathmoi.text	
ltx/en_us_dedes/ty.m01.d25:tyMA.Apolytikia.text	
ltx/en_us_dedes/ty.m01.d25:tyMA.Canons.text	
ltx/en_us_dedes/ty.m01.d25:tyMA.Doxology.text	
ltx/en_us_dedes/ty.m01.d25:tyMA.EndApolytikion.text	
ltx/en_us_dedes/ty.m01.d25:tyMA.Exaposteilaria.text	
ltx/en_us_dedes/ty.m01.d25:tyMA.Katavasias.text	
ltx/en_us_dedes/ty.m01.d25:tyMA.Kathismata.text	
ltx/en_us_dedes/ty.m01.d25:tyMA.KontakionOikos.text	
ltx/en_us_dedes/ty.m01.d25:tyMA.Lauds.text	
ltx/en_us_dedes/ty.m01.d25:tyMA.LaudsBoth.text	
ltx/en_us_dedes/ty.m01.d25:tyMA.LaudsGlory.text	
ltx/en_us_dedes/ty.m01.d25:tyMA.LaudsVerses.text	
ltx/en_us_dedes/ty.m01.d25:tyMA.Magnificat.text	
ltx/en_us_dedes/ty.m01.d25:tyMA.MatinsGospel.text	
ltx/en_us_dedes/ty.m01.d25:tyMA.MidodeKath.text	
ltx/en_us_dedes/ty.m01.d25:tyMA.MidodeKontakion.text	
ltx/en_us_dedes/ty.m01.d25:tyMA.Ode9_1.text	
ltx/en_us_dedes/ty.m01.d25:tyMA.Ode9_2.text	
ltx/en_us_dedes/ty.m01.d25:tyMA.Ode9_3.text	
ltx/en_us_dedes/ty.m01.d25:tyMA.Ode9_4.text	
ltx/en_us_dedes/ty.m01.d25:tyMA.Ode9_5.text	
ltx/en_us_dedes/ty.m01.d25:tyMA.Ode9_6.text	
ltx/en_us_dedes/ty.m01.d25:tyMA.Ode9_7.text	
ltx/en_us_dedes/ty.m01.d25:tyMA.Ode9_8.text	
ltx/en_us_dedes/ty.m01.d25:tyMA.Ode9_Katavasia1.text	
ltx/en_us_dedes/ty.m01.d25:tyMA.Ode9_Katavasia2.text	
ltx/en_us_dedes/ty.m01.d25:tyMA.ProkVerse.text	
ltx/en_us_dedes/ty.m01.d25:tyMA.Prokeimenon.text	
ltx/en_us_dedes/ty.m01.d25:tyMA.Psalm50.text	
ltx/en_us_dedes/ty.m01.d25:tyMA.Synaxarion.text	
ltx/en_us_dedes/ty.m01.d25:tyMO.Rubric1.text	
ltx/en_us_dedes/ty.m01.d25:tyNote1.text	
ltx/en_us_dedes/ty.m01.d25:tyVE.Apolytikia.text	
ltx/en_us_dedes/ty.m01.d25:tyVE.AposBoth.text	
ltx/en_us_dedes/ty.m01.d25:tyVE.AposGlory.text	
ltx/en_us_dedes/ty.m01.d25:tyVE.AposGloryBoth.text	
ltx/en_us_dedes/ty.m01.d25:tyVE.Aposticha.text	
ltx/en_us_dedes/ty.m01.d25:tyVE.Dismissal.text	
ltx/en_us_dedes/ty.m01.d25:tyVE.Entrance.text	
ltx/en_us_dedes/ty.m01.d25:tyVE.Intro.text	
ltx/en_us_dedes/ty.m01.d25:tyVE.LIHC.text	
ltx/en_us_dedes/ty.m01.d25:tyVE.Note1.text	
ltx/en_us_dedes/ty.m01.d25:tyVE.Note2.text	
ltx/en_us_dedes/ty.m01.d25:tyVE.SticBoth.text	
ltx/en_us_dedes/ty.m01.d25:tyVE.SticGlory.text	
ltx/en_us_dedes/ty.m01.d25:tyVE.SticGloryBoth.text	
ltx/en_us_dedes/ty.m01.d25:tyVE.Stichera.text	
