ltx/en_us_dedes/sy.m12.d22:syMA.commemoration01.couplet1.title	@ltx/en_us_dedes/titles:ti.Verses
ltx/en_us_dedes/sy.m12.d22:syMA.commemoration01.couplet1.verse1	
ltx/en_us_dedes/sy.m12.d22:syMA.commemoration01.couplet1.verse2	
ltx/en_us_dedes/sy.m12.d22:syMA.commemoration01.narration.p01	
ltx/en_us_dedes/sy.m12.d22:syMA.commemoration01.narration.p02	
ltx/en_us_dedes/sy.m12.d22:syMA.commemoration01.single1	
ltx/en_us_dedes/sy.m12.d22:syMA.commemoration01.text	On December 22, we commemorate the holy Great-martyr Anastasia Pharmacolytria.
ltx/en_us_dedes/sy.m12.d22:syMA.commemoration02.couplet1.title	@ltx/en_us_dedes/titles:ti.Verses
ltx/en_us_dedes/sy.m12.d22:syMA.commemoration02.couplet1.verse1	
ltx/en_us_dedes/sy.m12.d22:syMA.commemoration02.couplet1.verse2	
ltx/en_us_dedes/sy.m12.d22:syMA.commemoration02.narration.p01	
ltx/en_us_dedes/sy.m12.d22:syMA.commemoration02.text	On this day we also commemorate the holy Martyr Chrysogonos.
ltx/en_us_dedes/sy.m12.d22:syMA.commemoration03.couplet1.title	@ltx/en_us_dedes/titles:ti.Verses
ltx/en_us_dedes/sy.m12.d22:syMA.commemoration03.couplet1.verse1	
ltx/en_us_dedes/sy.m12.d22:syMA.commemoration03.couplet1.verse2	
ltx/en_us_dedes/sy.m12.d22:syMA.commemoration03.narration.p01	
ltx/en_us_dedes/sy.m12.d22:syMA.commemoration03.text	On this day we also commemorate the holy Martyr Theodota and her children.
ltx/en_us_dedes/sy.m12.d22:syMA.commemoration04.couplet1.title	@ltx/en_us_dedes/titles:ti.Verses
ltx/en_us_dedes/sy.m12.d22:syMA.commemoration04.couplet1.verse1	
ltx/en_us_dedes/sy.m12.d22:syMA.commemoration04.couplet1.verse2	
ltx/en_us_dedes/sy.m12.d22:syMA.commemoration04.text	On this day we also commemorate the holy Martyr Zoilos.
ltx/en_us_dedes/sy.m12.d22:syMA.commemoration05.couplet1.title	@ltx/en_us_dedes/titles:ti.Verses
ltx/en_us_dedes/sy.m12.d22:syMA.commemoration05.couplet1.verse1	
ltx/en_us_dedes/sy.m12.d22:syMA.commemoration05.couplet1.verse2	
ltx/en_us_dedes/sy.m12.d22:syMA.commemoration05.text	On this day was the door-opening of the Great Church of God.
ltx/en_us_dedes/sy.m12.d22:syMA.commemoration06.couplet1.title	@ltx/en_us_dedes/titles:ti.Verses
ltx/en_us_dedes/sy.m12.d22:syMA.commemoration06.couplet1.verse1	
ltx/en_us_dedes/sy.m12.d22:syMA.commemoration06.couplet1.verse2	
ltx/en_us_dedes/sy.m12.d22:syMA.commemoration06.text	On this day was the procession with lights at the Church of God.
ltx/en_us_dedes/sy.m12.d22:syMA.lastline	By the intercessions of Your saints, O God, have mercy on us and save us.
