ltx/en_us_dedes/pe.d111:peDA.commemoration.full	
ltx/en_us_dedes/pe.d111:peDA.commemoration.short	Friday of the Sixth Week
ltx/en_us_dedes/pe.d111:peDA.dismissal	@ltx/en_us_dedes/dismissals:dis00.ascension
ltx/en_us_dedes/pe.d111:peDA.insert1	
ltx/en_us_dedes/pe.d111:peDA.insert2	
ltx/en_us_dedes/pe.d111:peDA.note	
ltx/en_us_dedes/pe.d111:peHO.commemorations	
ltx/en_us_dedes/pe.d111:peHO.daytitle	
ltx/en_us_dedes/pe.d111:peHO.description1	
ltx/en_us_dedes/pe.d111:peHO.description2	
ltx/en_us_dedes/pe.d111:peHO.note1	
ltx/en_us_dedes/pe.d111:peHO.note2	
ltx/en_us_dedes/pe.d111:peMA.AposGlory.incipit	Lord, as You were being…
ltx/en_us_dedes/pe.d111:peMA.AposGlory.melody	@ltx/en_us_dedes/miscellanea:misc.Idiomelon
ltx/en_us_dedes/pe.d111:peMA.AposGlory.mode	@ltx/en_us_dedes/miscellanea:misc.Mode5
ltx/en_us_dedes/pe.d111:peMA.AposGlory.text	Lord, as You were being taken up, to where You had never departed, the armies of Angels and all the bodiless hosts shouted with exultant joy, to the Powers above them: “Lift up the gates, O you rulers, and the King of glory shall enter.” The cherubic throne took You up with Your flesh. O Lord, glory to You!
ltx/en_us_dedes/pe.d111:peMA.Aposticha1.greekmelody	@ltx/en_us_dedes/he.a.m2:heAU.OikosTouEfratha.greekname
ltx/en_us_dedes/pe.d111:peMA.Aposticha1.incipit	This wonder is unique. *…
ltx/en_us_dedes/pe.d111:peMA.Aposticha1.melody	@ltx/en_us_dedes/he.a.m2:heAU.OikosTouEfratha.name
ltx/en_us_dedes/pe.d111:peMA.Aposticha1.mode	@ltx/en_us_dedes/miscellanea:misc.Mode2
ltx/en_us_dedes/pe.d111:peMA.Aposticha1.text	This wonder is unique. * Behold, our human nature * ascended into heaven, * united with the Logos, * who is indeed almighty God.
ltx/en_us_dedes/pe.d111:peMA.Aposticha2.incipit	Glorious was the day *…
ltx/en_us_dedes/pe.d111:peMA.Aposticha2.melody	@ltx/en_us_dedes/he.a.m2:heAU.OikosTouEfratha.name
ltx/en_us_dedes/pe.d111:peMA.Aposticha2.mode	@ltx/en_us_dedes/miscellanea:misc.Mode2
ltx/en_us_dedes/pe.d111:peMA.Aposticha2.text	Glorious was the day * of the divine Ascension * of Christ our Lord and Master, * the feast of which has shone forth * on all the world resplendently.
ltx/en_us_dedes/pe.d111:peMA.Aposticha3.incipit	Savior, we pray You send…
ltx/en_us_dedes/pe.d111:peMA.Aposticha3.melody	@ltx/en_us_dedes/he.a.m2:heAU.OikosTouEfratha.name
ltx/en_us_dedes/pe.d111:peMA.Aposticha3.mode	@ltx/en_us_dedes/miscellanea:misc.Mode2
ltx/en_us_dedes/pe.d111:peMA.Aposticha3.text	Savior, we pray You send * Your grace to us, Your people, * as You sent down from heaven * Your consubstantial Spirit * of old to Your Disciples, O Christ.
ltx/en_us_dedes/pe.d111:peMA.Kathisma11.greekmelody	@ltx/en_us_dedes/he.a.m8:heAU.ToProstachthen.greekname
ltx/en_us_dedes/pe.d111:peMA.Kathisma11.incipit	Merciful Jesus, You went up…
ltx/en_us_dedes/pe.d111:peMA.Kathisma11.melody	@ltx/en_us_dedes/he.a.m8:heAU.ToProstachthen.name
ltx/en_us_dedes/pe.d111:peMA.Kathisma11.mode	@ltx/en_us_dedes/miscellanea:misc.Mode8
ltx/en_us_dedes/pe.d111:peMA.Kathisma11.text	Merciful Jesus, You went up the Mount of Olives. * It was from there that You ascended into heaven, * when from earth You were taken away in a bright cloud. * Your holy Disciples watching it were amazed. * The bodiless hosts in heaven were crying out * to superior ranks in fear, * “Lift up the gates, be lifted up!” * And all creation joins them now, * praising You, the King and God of all.
ltx/en_us_dedes/pe.d111:peMA.Kathisma21.greekmelody	@ltx/en_us_dedes/pe.d110:peMA.Ode3Kathisma1.greekmelody
ltx/en_us_dedes/pe.d111:peMA.Kathisma21.incipit	@ltx/en_us_dedes/pe.d110:peMA.Ode3Kathisma1.incipit
ltx/en_us_dedes/pe.d111:peMA.Kathisma21.melody	@ltx/en_us_dedes/pe.d110:peMA.Ode3Kathisma1.melody
ltx/en_us_dedes/pe.d111:peMA.Kathisma21.mode	@ltx/en_us_dedes/pe.d110:peMA.Ode3Kathisma1.mode
ltx/en_us_dedes/pe.d111:peMA.Kathisma21.text	@ltx/en_us_dedes/pe.d110:peMA.Ode3Kathisma1.text
ltx/en_us_dedes/pe.d111:peVE.AposGlory.incipit	@ltx/en_us_dedes/pe.d110:peVE.Stichera03.incipit
ltx/en_us_dedes/pe.d111:peVE.AposGlory.melody	@ltx/en_us_dedes/pe.d110:peVE.Stichera03.melody
ltx/en_us_dedes/pe.d111:peVE.AposGlory.mode	@ltx/en_us_dedes/pe.d110:peVE.Stichera03.mode
ltx/en_us_dedes/pe.d111:peVE.AposGlory.text	@ltx/en_us_dedes/pe.d110:peVE.Stichera03.text
ltx/en_us_dedes/pe.d111:peVE.Aposticha1.greekmelody	@ltx/en_us_dedes/he.a.m2:heAU.OteEkTouXylou.greekname
ltx/en_us_dedes/pe.d111:peVE.Aposticha1.incipit	He who fills all things…
ltx/en_us_dedes/pe.d111:peVE.Aposticha1.melody	@ltx/en_us_dedes/he.a.m2:heAU.OteEkTouXylou.name
ltx/en_us_dedes/pe.d111:peVE.Aposticha1.mode	@ltx/en_us_dedes/miscellanea:misc.Mode2
ltx/en_us_dedes/pe.d111:peVE.Aposticha1.text	He who fills all things as God went up * to the Mount of Olives together with His Disciples and said, * “My beloved friends, the time for my ascent is at hand. * I commission you, go and teach all nations the Gospel, * every word and saying that you heard come out of my mouth.” * Then He was uplifted in glory, * as if on a vessel transported. * Trembling, the Apostles were amazed by this.
ltx/en_us_dedes/pe.d111:peVE.Aposticha2.incipit	When You led as far…
ltx/en_us_dedes/pe.d111:peVE.Aposticha2.melody	@ltx/en_us_dedes/he.a.m2:heAU.OteEkTouXylou.name
ltx/en_us_dedes/pe.d111:peVE.Aposticha2.mode	@ltx/en_us_dedes/miscellanea:misc.Mode2
ltx/en_us_dedes/pe.d111:peVE.Aposticha2.text	When You led as far as Bethany * Your beloved Disciples and also Your holy Mother with them, * lifting up Your hands You blessed them, as is written, O Christ. * As You blessed, they were looking on * and saw You were taken * on a shining cloud of light that took You out of their sight. * Thus was Your ascension in glory. * Now You truly sit at the right hand * of the Father, worshiped and adored with Him.
ltx/en_us_dedes/pe.d111:peVE.Aposticha3.incipit	Come, fellow believers, let us…
ltx/en_us_dedes/pe.d111:peVE.Aposticha3.melody	@ltx/en_us_dedes/he.a.m2:heAU.OteEkTouXylou.name
ltx/en_us_dedes/pe.d111:peVE.Aposticha3.mode	@ltx/en_us_dedes/miscellanea:misc.Mode2
ltx/en_us_dedes/pe.d111:peVE.Aposticha3.text	Come, fellow believers, let us go * all together up on the prominent Mount of Olives, and be * like the Lord’s Apostles who went up with Him of old. * Let us lift up our souls and hearts, and see with our mind’s eye * as the Lord is taken up in clouds and rides away. * Then we shall with gratitude also * celebrate with joy, singing, “Glory * be to Your Ascension, O most merciful One!”
ltx/en_us_dedes/pe.d111:peVE.SticGlory.incipit	@ltx/en_us_dedes/pe.d110:peVE.Aposticha1.incipit
ltx/en_us_dedes/pe.d111:peVE.SticGlory.melody	@ltx/en_us_dedes/pe.d110:peVE.Aposticha1.melody
ltx/en_us_dedes/pe.d111:peVE.SticGlory.mode	@ltx/en_us_dedes/pe.d110:peVE.Aposticha1.mode
ltx/en_us_dedes/pe.d111:peVE.SticGlory.text	@ltx/en_us_dedes/pe.d110:peVE.Aposticha1.text
ltx/en_us_dedes/pe.d111:peVE.Stichera01.incipit	@ltx/en_us_dedes/pe.d110:peVE.Lity1.incipit
ltx/en_us_dedes/pe.d111:peVE.Stichera01.melody	@ltx/en_us_dedes/pe.d110:peVE.Lity1.melody
ltx/en_us_dedes/pe.d111:peVE.Stichera01.mode	@ltx/en_us_dedes/pe.d110:peVE.Lity1.mode
ltx/en_us_dedes/pe.d111:peVE.Stichera01.text	@ltx/en_us_dedes/pe.d110:peVE.Lity1.text
ltx/en_us_dedes/pe.d111:peVE.Stichera02.incipit	@ltx/en_us_dedes/pe.d110:peVE.Lity2.incipit
ltx/en_us_dedes/pe.d111:peVE.Stichera02.melody	@ltx/en_us_dedes/pe.d110:peVE.Lity2.melody
ltx/en_us_dedes/pe.d111:peVE.Stichera02.mode	@ltx/en_us_dedes/pe.d110:peVE.Lity2.mode
ltx/en_us_dedes/pe.d111:peVE.Stichera02.text	@ltx/en_us_dedes/pe.d110:peVE.Lity2.text
ltx/en_us_dedes/pe.d111:peVE.Stichera03.incipit	@ltx/en_us_dedes/pe.d110:peVE.Lity3.incipit
ltx/en_us_dedes/pe.d111:peVE.Stichera03.melody	@ltx/en_us_dedes/pe.d110:peVE.Lity3.melody
ltx/en_us_dedes/pe.d111:peVE.Stichera03.mode	@ltx/en_us_dedes/pe.d110:peVE.Lity3.mode
ltx/en_us_dedes/pe.d111:peVE.Stichera03.text	@ltx/en_us_dedes/pe.d110:peVE.Lity3.text
