ltx/en_us_dedes/sy.m12.d20:syMA.commemoration01.couplet1.title	@ltx/en_us_dedes/titles:ti.Verses
ltx/en_us_dedes/sy.m12.d20:syMA.commemoration01.couplet1.verse1	
ltx/en_us_dedes/sy.m12.d20:syMA.commemoration01.couplet1.verse2	
ltx/en_us_dedes/sy.m12.d20:syMA.commemoration01.narration.p01	
ltx/en_us_dedes/sy.m12.d20:syMA.commemoration01.narration.p02	
ltx/en_us_dedes/sy.m12.d20:syMA.commemoration01.narration.p03	
ltx/en_us_dedes/sy.m12.d20:syMA.commemoration01.single1	
ltx/en_us_dedes/sy.m12.d20:syMA.commemoration01.text	On December 20, we commemorate the holy hieromartyr Ignatius the God-bearer.
ltx/en_us_dedes/sy.m12.d20:syMA.commemoration02.couplet1.title	@ltx/en_us_dedes/titles:ti.Verses
ltx/en_us_dedes/sy.m12.d20:syMA.commemoration02.couplet1.verse1	
ltx/en_us_dedes/sy.m12.d20:syMA.commemoration02.couplet1.verse2	
ltx/en_us_dedes/sy.m12.d20:syMA.commemoration02.narration.p01	
ltx/en_us_dedes/sy.m12.d20:syMA.commemoration02.text	On this day we also commemorate our devout father Philogonios, a lawyer who became Bishop of Antioch.
ltx/en_us_dedes/sy.m12.d20:syMA.commemoration03.couplet1.title	@ltx/en_us_dedes/titles:ti.Verses
ltx/en_us_dedes/sy.m12.d20:syMA.commemoration03.couplet1.verse1	
ltx/en_us_dedes/sy.m12.d20:syMA.commemoration03.couplet1.verse2	
ltx/en_us_dedes/sy.m12.d20:syMA.commemoration03.text	The holy Neo-martyr John, who was from the island of Thasos and witnessed in Constantinople in 1652, died by the sword.
ltx/en_us_dedes/sy.m12.d20:syMA.commemorationDD.couplet1.title	@ltx/en_us_dedes/titles:ti.Verses
ltx/en_us_dedes/sy.m12.d20:syMA.commemorationDD.couplet1.verse1	
ltx/en_us_dedes/sy.m12.d20:syMA.commemorationDD.couplet1.verse2	
ltx/en_us_dedes/sy.m12.d20:syMA.commemorationDD.single1	
ltx/en_us_dedes/sy.m12.d20:syMA.commemorationDD.text	Today we also celebrate the memory of the holy hieromartyr Ignatius the God-bearer.
ltx/en_us_dedes/sy.m12.d20:syMA.lastline	By their holy intercessions, O God, have mercy on us. Amen.
