ltx/en_us_dedes/me.m09.d27:meDA.commemoration.first	Memory of the Holy Martyr Callistratus and those with him
ltx/en_us_dedes/me.m09.d27:meDA.commemoration.first_name	
ltx/en_us_dedes/me.m09.d27:meDA.commemoration.first_short	Memory of the Holy Martyr Callistratus and those with him
ltx/en_us_dedes/me.m09.d27:meDA.commemoration.first_title	@ltx/en_us_dedes/titles:ti.Saints
ltx/en_us_dedes/me.m09.d27:meDA.commemoration.full	Memory of the Holy Martyr Callistratus and those with him
ltx/en_us_dedes/me.m09.d27:meDA.commemoration.second_name	
ltx/en_us_dedes/me.m09.d27:meDA.commemoration.second_title	
ltx/en_us_dedes/me.m09.d27:meDA.date	September 27
ltx/en_us_dedes/me.m09.d27:meDA.fordate	for September 27
ltx/en_us_dedes/me.m09.d27:meDA.insert1	the Holy Martyr Callistratus and those with him,
ltx/en_us_dedes/me.m09.d27:meDA.insert2	whose memory we celebrate,
ltx/en_us_dedes/me.m09.d27:meDA.note	
ltx/en_us_dedes/me.m09.d27:meDA.pdfcoverdate	September 27,
ltx/en_us_dedes/me.m09.d27:meDA.pdfheaderdate	September 27
ltx/en_us_dedes/me.m09.d27:meHO.commemorations	
ltx/en_us_dedes/me.m09.d27:meHO.note1	
ltx/en_us_dedes/me.m09.d27:meHO.note2	
ltx/en_us_dedes/me.m09.d27:meHO.number	
ltx/en_us_dedes/me.m09.d27:meHO.rank	
ltx/en_us_dedes/me.m09.d27:meLE.commemoration1	The Holy Martyr Callistratus.
ltx/en_us_dedes/me.m09.d27:meLE.commemoration2	
ltx/en_us_dedes/me.m09.d27:meLI.Kontakion1.greekmelody	@ltx/en_us_dedes/me.m09.d27:meMA.Kontakion1.greekmelody
ltx/en_us_dedes/me.m09.d27:meLI.Kontakion1.incipit	@ltx/en_us_dedes/me.m09.d27:meMA.Kontakion1.incipit
ltx/en_us_dedes/me.m09.d27:meLI.Kontakion1.melody	@ltx/en_us_dedes/me.m09.d27:meMA.Kontakion1.melody
ltx/en_us_dedes/me.m09.d27:meLI.Kontakion1.mode	@ltx/en_us_dedes/me.m09.d27:meMA.Kontakion1.mode
ltx/en_us_dedes/me.m09.d27:meLI.Kontakion1.text	@ltx/en_us_dedes/me.m09.d27:meMA.Kontakion1.text
ltx/en_us_dedes/me.m09.d27:meLI.Megalynarion.text	
ltx/en_us_dedes/me.m09.d27:meMA.C1.acrostic.notice1	
ltx/en_us_dedes/me.m09.d27:meMA.C1.acrostic.text	
ltx/en_us_dedes/me.m09.d27:meMA.C1.acrostic.title	
ltx/en_us_dedes/me.m09.d27:meMA.C1.title	@ltx/en_us_dedes/titles:ti.CanonSaints
ltx/en_us_dedes/me.m09.d27:meMA.C1.verse	@ltx/en_us_dedes/prayers:pr.verse_SaintsM.text
ltx/en_us_dedes/me.m09.d27:meMA.ExapTheotokion.incipit	Master, no words are adequate…
ltx/en_us_dedes/me.m09.d27:meMA.ExapTheotokion.melody	@ltx/en_us_dedes/he.a.m2:heAU.ToisMathitaisSynelthomen.name
ltx/en_us_dedes/me.m09.d27:meMA.ExapTheotokion.mode	@ltx/en_us_dedes/miscellanea:misc.Mode2
ltx/en_us_dedes/me.m09.d27:meMA.ExapTheotokion.text	Master, no words are adequate * to make a fair description * of the abundance of the gifts * and the God-given graces, which You gave us in Your mercy. * When we had slipped and fallen, * You brought us back to better life, * assuming all my human nature, O Christ, * from the holy Virgin and Theotokos, * and saved me, O benevolent, * merciful God my Savior.
ltx/en_us_dedes/me.m09.d27:meMA.Exaposteilarion1.greekmelody	@ltx/en_us_dedes/he.a.m2:heAU.ToisMathitaisSynelthomen.greekname
ltx/en_us_dedes/me.m09.d27:meMA.Exaposteilarion1.incipit	When they were strengthened with…
ltx/en_us_dedes/me.m09.d27:meMA.Exaposteilarion1.melody	@ltx/en_us_dedes/he.a.m2:heAU.ToisMathitaisSynelthomen.name
ltx/en_us_dedes/me.m09.d27:meMA.Exaposteilarion1.mode	@ltx/en_us_dedes/miscellanea:misc.Mode2
ltx/en_us_dedes/me.m09.d27:meMA.Exaposteilarion1.text	When they were strengthened with the might * through the all-holy Spirit, * the medal-winning martyr saints * brought down the over-boldness * of tyrants. They suffered every * torture for Christ the Savior. * Such were all-wise Callistratus * and Gymnasius who was wondrous indeed, * and their fellow athletes. As we observe now * their most resplendent memory * may we find our soul’s salvation.
ltx/en_us_dedes/me.m09.d27:meMA.Kontakion1.greekmelody	@ltx/en_us_dedes/he.a.m4:heAU.EpefanisSimeron.greekname
ltx/en_us_dedes/me.m09.d27:meMA.Kontakion1.incipit	…
ltx/en_us_dedes/me.m09.d27:meMA.Kontakion1.melody	@ltx/en_us_dedes/he.a.m4:heAU.EpefanisSimeron.name
ltx/en_us_dedes/me.m09.d27:meMA.Kontakion1.mode	@ltx/en_us_dedes/miscellanea:misc.Mode4
ltx/en_us_dedes/me.m09.d27:meMA.Kontakion1.text	
ltx/en_us_dedes/me.m09.d27:meMA.Ode1C11.greekmelody	@ltx/en_us_dedes/he.h.m8:heHE.AsmaAnapempsomen.greekname
ltx/en_us_dedes/me.m09.d27:meMA.Ode1C11.incipit	We now come together to…
ltx/en_us_dedes/me.m09.d27:meMA.Ode1C11.melody	@ltx/en_us_dedes/he.h.m8:heHE.AsmaAnapempsomen.notmetered
ltx/en_us_dedes/me.m09.d27:meMA.Ode1C11.mode	@ltx/en_us_dedes/miscellanea:misc.Mode8
ltx/en_us_dedes/me.m09.d27:meMA.Ode1C11.ode	@ltx/en_us_dedes/miscellanea:misc.Ode1
ltx/en_us_dedes/me.m09.d27:meMA.Ode1C11.text	We now come together to faithfully praise you, O all-blessed Callistratus, for in unswervingly walking the course of martyrdom, you became a path to divine rest for those who were led astray.
ltx/en_us_dedes/me.m09.d27:meMA.Ode1C12.incipit	You razed the shrines of…
ltx/en_us_dedes/me.m09.d27:meMA.Ode1C12.melody	@ltx/en_us_dedes/he.h.m8:heHE.AsmaAnapempsomen.notmetered
ltx/en_us_dedes/me.m09.d27:meMA.Ode1C12.mode	@ltx/en_us_dedes/miscellanea:misc.Mode8
ltx/en_us_dedes/me.m09.d27:meMA.Ode1C12.ode	@ltx/en_us_dedes/miscellanea:misc.Ode1
ltx/en_us_dedes/me.m09.d27:meMA.Ode1C12.text	You razed the shrines of error, O Martyr, and rose on the Church of Christ as a brilliant star, driving away the gloom of ignorance with the rays of the knowledge of God.
ltx/en_us_dedes/me.m09.d27:meMA.Ode1C13.incipit	You endured every trial by…
ltx/en_us_dedes/me.m09.d27:meMA.Ode1C13.melody	@ltx/en_us_dedes/he.h.m8:heHE.AsmaAnapempsomen.notmetered
ltx/en_us_dedes/me.m09.d27:meMA.Ode1C13.mode	@ltx/en_us_dedes/miscellanea:misc.Mode8
ltx/en_us_dedes/me.m09.d27:meMA.Ode1C13.ode	@ltx/en_us_dedes/miscellanea:misc.Ode1
ltx/en_us_dedes/me.m09.d27:meMA.Ode1C13.text	You endured every trial by your perseverance, and you did not decline to die for the Life of all. For this reason, O Callistratus, you have gone over to the deathless portion with rejoicing, and you exult with the Angelic choirs.
ltx/en_us_dedes/me.m09.d27:meMA.Ode1C14.incipit	Like a coal lit by…
ltx/en_us_dedes/me.m09.d27:meMA.Ode1C14.melody	@ltx/en_us_dedes/he.h.m8:heHE.AsmaAnapempsomen.notmetered
ltx/en_us_dedes/me.m09.d27:meMA.Ode1C14.mode	@ltx/en_us_dedes/miscellanea:misc.Mode8
ltx/en_us_dedes/me.m09.d27:meMA.Ode1C14.ode	@ltx/en_us_dedes/miscellanea:misc.Ode1
ltx/en_us_dedes/me.m09.d27:meMA.Ode1C14.text	Like a coal lit by the fire of the Holy Spirit, the St. Gymnasios burns up error like kindling, and with miracles he refreshes those who are burning with fever and illness.
ltx/en_us_dedes/me.m09.d27:meMA.Ode1C1T.incipit	O all-blameless Maid, you knew…
ltx/en_us_dedes/me.m09.d27:meMA.Ode1C1T.melody	@ltx/en_us_dedes/he.h.m8:heHE.AsmaAnapempsomen.notmetered
ltx/en_us_dedes/me.m09.d27:meMA.Ode1C1T.mode	@ltx/en_us_dedes/miscellanea:misc.Mode8
ltx/en_us_dedes/me.m09.d27:meMA.Ode1C1T.ode	@ltx/en_us_dedes/miscellanea:misc.Ode1
ltx/en_us_dedes/me.m09.d27:meMA.Ode1C1T.text	O all-blameless Maid, you knew no man; yet you, alone among women, bore a one of the Trinity in a manner surpassing nature. Therefore we glorify you and your Son who was born of you inexplicably and ineffably.
ltx/en_us_dedes/me.m09.d27:meMA.Ode3C11.greekmelody	@ltx/en_us_dedes/he.h.m8:heHE.OStereosasLogo.greekname
ltx/en_us_dedes/me.m09.d27:meMA.Ode3C11.incipit	You did not sacrifice to…
ltx/en_us_dedes/me.m09.d27:meMA.Ode3C11.melody	@ltx/en_us_dedes/he.h.m8:heHE.OStereosasLogo.notmetered
ltx/en_us_dedes/me.m09.d27:meMA.Ode3C11.mode	@ltx/en_us_dedes/miscellanea:misc.Mode8
ltx/en_us_dedes/me.m09.d27:meMA.Ode3C11.ode	@ltx/en_us_dedes/miscellanea:misc.Ode3
ltx/en_us_dedes/me.m09.d27:meMA.Ode3C11.text	You did not sacrifice to graven gods, but instead you offered yourself as a pure sacrifice to God who gave himself up for us, O Martyr and prize-winner Callistratus.
ltx/en_us_dedes/me.m09.d27:meMA.Ode3C12.incipit	You stand before the King…
ltx/en_us_dedes/me.m09.d27:meMA.Ode3C12.melody	@ltx/en_us_dedes/he.h.m8:heHE.OStereosasLogo.notmetered
ltx/en_us_dedes/me.m09.d27:meMA.Ode3C12.mode	@ltx/en_us_dedes/miscellanea:misc.Mode8
ltx/en_us_dedes/me.m09.d27:meMA.Ode3C12.ode	@ltx/en_us_dedes/miscellanea:misc.Ode3
ltx/en_us_dedes/me.m09.d27:meMA.Ode3C12.text	You stand before the King of the ages, adorned with a crown and a cloak dyed in your own sacred blood, O blessed Martyr.
ltx/en_us_dedes/me.m09.d27:meMA.Ode3C13.incipit	When you and your fellow…
ltx/en_us_dedes/me.m09.d27:meMA.Ode3C13.melody	@ltx/en_us_dedes/he.h.m8:heHE.OStereosasLogo.notmetered
ltx/en_us_dedes/me.m09.d27:meMA.Ode3C13.mode	@ltx/en_us_dedes/miscellanea:misc.Mode8
ltx/en_us_dedes/me.m09.d27:meMA.Ode3C13.ode	@ltx/en_us_dedes/miscellanea:misc.Ode3
ltx/en_us_dedes/me.m09.d27:meMA.Ode3C13.text	When you and your fellow athletes were robed in divine glory from on hight, O prize-winner Gymnasios, the foe was stripped.
ltx/en_us_dedes/me.m09.d27:meMA.Ode3C1T.incipit	O Virgin, fervently entreat your…
ltx/en_us_dedes/me.m09.d27:meMA.Ode3C1T.melody	@ltx/en_us_dedes/he.h.m8:heHE.OStereosasLogo.notmetered
ltx/en_us_dedes/me.m09.d27:meMA.Ode3C1T.mode	@ltx/en_us_dedes/miscellanea:misc.Mode8
ltx/en_us_dedes/me.m09.d27:meMA.Ode3C1T.ode	@ltx/en_us_dedes/miscellanea:misc.Ode3
ltx/en_us_dedes/me.m09.d27:meMA.Ode3C1T.text	O Virgin, fervently entreat your Son to save us from coming danger and everlasting perdition.
ltx/en_us_dedes/me.m09.d27:meMA.Ode3H.greekmelody	@ltx/en_us_dedes/he.h.m8:heHE.OStereosasLogo.greekname
ltx/en_us_dedes/me.m09.d27:meMA.Ode3H.incipit	@ltx/en_us_dedes/he.h.m8:heHE.OStereosasLogo.incipit
ltx/en_us_dedes/me.m09.d27:meMA.Ode3H.melody	@ltx/en_us_dedes/he.h.m8:heHE.OStereosasLogo.melody
ltx/en_us_dedes/me.m09.d27:meMA.Ode3H.mode	@ltx/en_us_dedes/miscellanea:misc.Mode8
ltx/en_us_dedes/me.m09.d27:meMA.Ode3H.ode	@ltx/en_us_dedes/miscellanea:misc.Ode3
ltx/en_us_dedes/me.m09.d27:meMA.Ode3H.text	@ltx/en_us_dedes/he.h.m8:heHE.OStereosasLogo.text
ltx/en_us_dedes/me.m09.d27:meMA.Ode3Kathisma1.greekmelody	@ltx/en_us_dedes/he.a.m5:heAU.TonSynanarchonLogon.greekname
ltx/en_us_dedes/me.m09.d27:meMA.Ode3Kathisma1.incipit	We now honor the struggle…
ltx/en_us_dedes/me.m09.d27:meMA.Ode3Kathisma1.melody	@ltx/en_us_dedes/he.a.m5:heAU.TonSynanarchonLogon.name
ltx/en_us_dedes/me.m09.d27:meMA.Ode3Kathisma1.mode	@ltx/en_us_dedes/miscellanea:misc.Mode5
ltx/en_us_dedes/me.m09.d27:meMA.Ode3Kathisma1.text	We now honor the struggle of Saint Callistratus, * and we sing of the labors * of Saint Gymnasios, * as we bless their fellow athletes who yearned greatly for them. * Let us, the faithful, cry to them: * O ye soldiers of piety, O ye hoplites of our Lord Christ, * entreat Him now to grant us * His peace and the great mercy.
ltx/en_us_dedes/me.m09.d27:meMA.Ode3KathismaSt.incipit	@ltx/en_us_dedes/me.m09.d25:meMA.Ode3KathismaSt.incipit
ltx/en_us_dedes/me.m09.d27:meMA.Ode3KathismaSt.melody	@ltx/en_us_dedes/he.a.m5:heAU.TonSynanarchonLogon.name
ltx/en_us_dedes/me.m09.d27:meMA.Ode3KathismaSt.mode	@ltx/en_us_dedes/miscellanea:misc.Mode5
ltx/en_us_dedes/me.m09.d27:meMA.Ode3KathismaSt.text	@ltx/en_us_dedes/me.m09.d25:meMA.Ode3KathismaSt.text
ltx/en_us_dedes/me.m09.d27:meMA.Ode3KathismaT.incipit	@ltx/en_us_dedes/me.m09.d25:meMA.Ode3KathismaT.incipit
ltx/en_us_dedes/me.m09.d27:meMA.Ode3KathismaT.melody	@ltx/en_us_dedes/he.a.m5:heAU.TonSynanarchonLogon.name
ltx/en_us_dedes/me.m09.d27:meMA.Ode3KathismaT.mode	@ltx/en_us_dedes/miscellanea:misc.Mode5
ltx/en_us_dedes/me.m09.d27:meMA.Ode3KathismaT.text	@ltx/en_us_dedes/me.m09.d25:meMA.Ode3KathismaT.text
ltx/en_us_dedes/me.m09.d27:meMA.Ode4C11.greekmelody	@ltx/en_us_dedes/he.h.m8:heHE.EisakikoaKyrie.greekname
ltx/en_us_dedes/me.m09.d27:meMA.Ode4C11.incipit	Set for battle against the…
ltx/en_us_dedes/me.m09.d27:meMA.Ode4C11.melody	@ltx/en_us_dedes/he.h.m8:heHE.EisakikoaKyrie.name
ltx/en_us_dedes/me.m09.d27:meMA.Ode4C11.mode	@ltx/en_us_dedes/miscellanea:misc.Mode8
ltx/en_us_dedes/me.m09.d27:meMA.Ode4C11.ode	@ltx/en_us_dedes/miscellanea:misc.Ode4
ltx/en_us_dedes/me.m09.d27:meMA.Ode4C11.text	Set for battle against the foe, * you scoured his country and freed the prisoners, * and you led them up to life divine, * as a great commander, O Callistratus.
ltx/en_us_dedes/me.m09.d27:meMA.Ode4C12.incipit	Witht the flood of your…
ltx/en_us_dedes/me.m09.d27:meMA.Ode4C12.melody	@ltx/en_us_dedes/he.h.m8:heHE.EisakikoaKyrie.name
ltx/en_us_dedes/me.m09.d27:meMA.Ode4C12.mode	@ltx/en_us_dedes/miscellanea:misc.Mode8
ltx/en_us_dedes/me.m09.d27:meMA.Ode4C12.ode	@ltx/en_us_dedes/miscellanea:misc.Ode4
ltx/en_us_dedes/me.m09.d27:meMA.Ode4C12.text	Witht the flood of your sacred words * you watered the hearts of the people, leading them * to the water of eternal life, * admirable athlete of the Master Christ.
ltx/en_us_dedes/me.m09.d27:meMA.Ode4C13.incipit	Now we sing of Callistratus…
ltx/en_us_dedes/me.m09.d27:meMA.Ode4C13.melody	@ltx/en_us_dedes/he.h.m8:heHE.EisakikoaKyrie.name
ltx/en_us_dedes/me.m09.d27:meMA.Ode4C13.mode	@ltx/en_us_dedes/miscellanea:misc.Mode8
ltx/en_us_dedes/me.m09.d27:meMA.Ode4C13.ode	@ltx/en_us_dedes/miscellanea:misc.Ode4
ltx/en_us_dedes/me.m09.d27:meMA.Ode4C13.text	Now we sing of Callistratus, * slaughtered as he was like a sacrificial ram, * and preceded by his men-at-arms, * who like sheep were sacrified most readily.
ltx/en_us_dedes/me.m09.d27:meMA.Ode4C14.incipit	With your words you did…
ltx/en_us_dedes/me.m09.d27:meMA.Ode4C14.melody	@ltx/en_us_dedes/he.h.m8:heHE.EisakikoaKyrie.name
ltx/en_us_dedes/me.m09.d27:meMA.Ode4C14.mode	@ltx/en_us_dedes/miscellanea:misc.Mode8
ltx/en_us_dedes/me.m09.d27:meMA.Ode4C14.ode	@ltx/en_us_dedes/miscellanea:misc.Ode4
ltx/en_us_dedes/me.m09.d27:meMA.Ode4C14.text	With your words you did cultivate, * as it were a vine, blessed St. Gymnasios, * and he bore the fruit of martyrdom, * pouring forth the sweetest wine of piety.
ltx/en_us_dedes/me.m09.d27:meMA.Ode4C1T.incipit	Though my heart is polluted…
ltx/en_us_dedes/me.m09.d27:meMA.Ode4C1T.melody	@ltx/en_us_dedes/he.h.m8:heHE.EisakikoaKyrie.name
ltx/en_us_dedes/me.m09.d27:meMA.Ode4C1T.mode	@ltx/en_us_dedes/miscellanea:misc.Mode8
ltx/en_us_dedes/me.m09.d27:meMA.Ode4C1T.ode	@ltx/en_us_dedes/miscellanea:misc.Ode4
ltx/en_us_dedes/me.m09.d27:meMA.Ode4C1T.text	Though my heart is polluted by * passions, I entreat you to cleanse it, O pure Maid, * and to make it a clean vessel of * pure illuminations that come down from God.
ltx/en_us_dedes/me.m09.d27:meMA.Ode5C11.greekmelody	@ltx/en_us_dedes/he.h.m8:heHE.OEkNyktosAgnoias.greekname
ltx/en_us_dedes/me.m09.d27:meMA.Ode5C11.incipit	O Martyr, you loved Christ…
ltx/en_us_dedes/me.m09.d27:meMA.Ode5C11.melody	@ltx/en_us_dedes/he.h.m8:heHE.OEkNyktosAgnoias.notmetered
ltx/en_us_dedes/me.m09.d27:meMA.Ode5C11.mode	@ltx/en_us_dedes/miscellanea:misc.Mode8
ltx/en_us_dedes/me.m09.d27:meMA.Ode5C11.ode	@ltx/en_us_dedes/miscellanea:misc.Ode5
ltx/en_us_dedes/me.m09.d27:meMA.Ode5C11.text	O Martyr, you loved Christ our God wholeheartedly. So, you competed and vanquished the powerless dominion of the foe.
ltx/en_us_dedes/me.m09.d27:meMA.Ode5C12.incipit	O Callistratus, you rejoiced as…
ltx/en_us_dedes/me.m09.d27:meMA.Ode5C12.melody	@ltx/en_us_dedes/he.h.m8:heHE.OEkNyktosAgnoias.notmetered
ltx/en_us_dedes/me.m09.d27:meMA.Ode5C12.mode	@ltx/en_us_dedes/miscellanea:misc.Mode8
ltx/en_us_dedes/me.m09.d27:meMA.Ode5C12.ode	@ltx/en_us_dedes/miscellanea:misc.Ode5
ltx/en_us_dedes/me.m09.d27:meMA.Ode5C12.text	O Callistratus, you rejoiced as you were numbered with the Angelic armies, once you shined as a commander of a divine army.
ltx/en_us_dedes/me.m09.d27:meMA.Ode5C13.incipit	You have joyously passed over…
ltx/en_us_dedes/me.m09.d27:meMA.Ode5C13.melody	@ltx/en_us_dedes/he.h.m8:heHE.OEkNyktosAgnoias.notmetered
ltx/en_us_dedes/me.m09.d27:meMA.Ode5C13.mode	@ltx/en_us_dedes/miscellanea:misc.Mode8
ltx/en_us_dedes/me.m09.d27:meMA.Ode5C13.ode	@ltx/en_us_dedes/miscellanea:misc.Ode5
ltx/en_us_dedes/me.m09.d27:meMA.Ode5C13.text	You have joyously passed over to angelic splendors, O Gymnasios, as you radiate the glory of the triumph of your martyrdom.
ltx/en_us_dedes/me.m09.d27:meMA.Ode5C1T.incipit	O all-blameless Maid, you were…
ltx/en_us_dedes/me.m09.d27:meMA.Ode5C1T.melody	@ltx/en_us_dedes/he.h.m8:heHE.OEkNyktosAgnoias.notmetered
ltx/en_us_dedes/me.m09.d27:meMA.Ode5C1T.mode	@ltx/en_us_dedes/miscellanea:misc.Mode8
ltx/en_us_dedes/me.m09.d27:meMA.Ode5C1T.ode	@ltx/en_us_dedes/miscellanea:misc.Ode5
ltx/en_us_dedes/me.m09.d27:meMA.Ode5C1T.text	O all-blameless Maid, you were the dawn of the Sun of Righteousness. Earnestly pray to Him, to save us who glorify you wholeheartedly.
ltx/en_us_dedes/me.m09.d27:meMA.Ode6C11.greekmelody	@ltx/en_us_dedes/he.h.m8:heHE.IlasthitiMoiSotir.greekname
ltx/en_us_dedes/me.m09.d27:meMA.Ode6C11.incipit	O wise Martyr, you shattered…
ltx/en_us_dedes/me.m09.d27:meMA.Ode6C11.melody	@ltx/en_us_dedes/he.h.m8:heHE.IlasthitiMoiSotir.notmetered
ltx/en_us_dedes/me.m09.d27:meMA.Ode6C11.mode	@ltx/en_us_dedes/miscellanea:misc.Mode8
ltx/en_us_dedes/me.m09.d27:meMA.Ode6C11.ode	@ltx/en_us_dedes/miscellanea:misc.Ode6
ltx/en_us_dedes/me.m09.d27:meMA.Ode6C11.text	O wise Martyr, you shattered the teeth of the unseen lions. You made those who of old were the food of the foe to be children of God and partakers of celestial bliss, O Callistratus.
ltx/en_us_dedes/me.m09.d27:meMA.Ode6C12.incipit	By your divine eloquence regarding…
ltx/en_us_dedes/me.m09.d27:meMA.Ode6C12.melody	@ltx/en_us_dedes/he.h.m8:heHE.IlasthitiMoiSotir.notmetered
ltx/en_us_dedes/me.m09.d27:meMA.Ode6C12.mode	@ltx/en_us_dedes/miscellanea:misc.Mode8
ltx/en_us_dedes/me.m09.d27:meMA.Ode6C12.ode	@ltx/en_us_dedes/miscellanea:misc.Ode6
ltx/en_us_dedes/me.m09.d27:meMA.Ode6C12.text	By your divine eloquence regarding God, you converted to godliness those who had pitifully worshipped inanimate gods before, O renowned Callistratus; and together with them you competed in martyrdom.
ltx/en_us_dedes/me.m09.d27:meMA.Ode6C13.incipit	O Martyrs, you bent your…
ltx/en_us_dedes/me.m09.d27:meMA.Ode6C13.melody	@ltx/en_us_dedes/he.h.m8:heHE.IlasthitiMoiSotir.notmetered
ltx/en_us_dedes/me.m09.d27:meMA.Ode6C13.mode	@ltx/en_us_dedes/miscellanea:misc.Mode8
ltx/en_us_dedes/me.m09.d27:meMA.Ode6C13.ode	@ltx/en_us_dedes/miscellanea:misc.Ode6
ltx/en_us_dedes/me.m09.d27:meMA.Ode6C13.text	O Martyrs, you bent your necks before the Lord and were willingly slaughtered, offering yourselves to God as perfect sacrifices, and thus you cheered the Church of the first-born.
ltx/en_us_dedes/me.m09.d27:meMA.Ode6C1T.incipit	O holy Mother of God…
ltx/en_us_dedes/me.m09.d27:meMA.Ode6C1T.melody	@ltx/en_us_dedes/he.h.m8:heHE.IlasthitiMoiSotir.notmetered
ltx/en_us_dedes/me.m09.d27:meMA.Ode6C1T.mode	@ltx/en_us_dedes/miscellanea:misc.Mode8
ltx/en_us_dedes/me.m09.d27:meMA.Ode6C1T.ode	@ltx/en_us_dedes/miscellanea:misc.Ode6
ltx/en_us_dedes/me.m09.d27:meMA.Ode6C1T.text	O holy Mother of God and ever-virgin Theotokos, sanctify my intellect and illumine my heart, and deliver me from the difficulties that weigh heavily on me, that I may glorify you.
ltx/en_us_dedes/me.m09.d27:meMA.Ode6H.greekmelody	@ltx/en_us_dedes/he.h.m8:heHE.IlasthitiMoiSotir.greekname
ltx/en_us_dedes/me.m09.d27:meMA.Ode6H.incipit	@ltx/en_us_dedes/he.h.m8:heHE.IlasthitiMoiSotir.incipit
ltx/en_us_dedes/me.m09.d27:meMA.Ode6H.melody	@ltx/en_us_dedes/he.h.m8:heHE.IlasthitiMoiSotir.melody
ltx/en_us_dedes/me.m09.d27:meMA.Ode6H.mode	@ltx/en_us_dedes/miscellanea:misc.Mode8
ltx/en_us_dedes/me.m09.d27:meMA.Ode6H.ode	@ltx/en_us_dedes/miscellanea:misc.Ode6
ltx/en_us_dedes/me.m09.d27:meMA.Ode6H.text	@ltx/en_us_dedes/he.h.m8:heHE.IlasthitiMoiSotir.text
ltx/en_us_dedes/me.m09.d27:meMA.Ode7C11.greekmelody	@ltx/en_us_dedes/he.h.m8:heHE.OiEkTisIoudaias.greekname
ltx/en_us_dedes/me.m09.d27:meMA.Ode7C11.incipit	You were polished like gold…
ltx/en_us_dedes/me.m09.d27:meMA.Ode7C11.melody	@ltx/en_us_dedes/he.h.m8:heHE.OiEkTisIoudaias.name
ltx/en_us_dedes/me.m09.d27:meMA.Ode7C11.mode	@ltx/en_us_dedes/miscellanea:misc.Mode8
ltx/en_us_dedes/me.m09.d27:meMA.Ode7C11.ode	@ltx/en_us_dedes/miscellanea:misc.Ode7
ltx/en_us_dedes/me.m09.d27:meMA.Ode7C11.text	You were polished like gold is * in the fire of torture, O Saint, and thus became* a copy of the Passion * of Christ, and now are gathered * in the heavenly treasuries, * and sing: O blessed are You, the God of our Fathers!
ltx/en_us_dedes/me.m09.d27:meMA.Ode7C12.incipit	As a sword forged in…
ltx/en_us_dedes/me.m09.d27:meMA.Ode7C12.melody	@ltx/en_us_dedes/he.h.m8:heHE.IlasthitiMoiSotir.name
ltx/en_us_dedes/me.m09.d27:meMA.Ode7C12.mode	@ltx/en_us_dedes/miscellanea:misc.Mode8
ltx/en_us_dedes/me.m09.d27:meMA.Ode7C12.ode	@ltx/en_us_dedes/miscellanea:misc.Ode7
ltx/en_us_dedes/me.m09.d27:meMA.Ode7C12.text	As a sword forged in heaven * you were oiled in tortures that you endured for Christ. * And you cut down the armies * of invisible demons, * O all-blessed Callistratus, * and sang: O blessed are You, the God of our Fathers!
ltx/en_us_dedes/me.m09.d27:meMA.Ode7C13.incipit	O Callistratus, Martyr, * you…
ltx/en_us_dedes/me.m09.d27:meMA.Ode7C13.melody	@ltx/en_us_dedes/he.h.m8:heHE.IlasthitiMoiSotir.name
ltx/en_us_dedes/me.m09.d27:meMA.Ode7C13.mode	@ltx/en_us_dedes/miscellanea:misc.Mode8
ltx/en_us_dedes/me.m09.d27:meMA.Ode7C13.ode	@ltx/en_us_dedes/miscellanea:misc.Ode7
ltx/en_us_dedes/me.m09.d27:meMA.Ode7C13.text	O Callistratus, Martyr, * you were shown by the might of the Trinity to be * a mighty adversary * of godlessness. Illumined by the Trinity’s radiance, * you sing: O blessed are You, the God of our Fathers!
ltx/en_us_dedes/me.m09.d27:meMA.Ode7C14.incipit	O Gymnasios Martyr, * you…
ltx/en_us_dedes/me.m09.d27:meMA.Ode7C14.melody	@ltx/en_us_dedes/he.h.m8:heHE.IlasthitiMoiSotir.name
ltx/en_us_dedes/me.m09.d27:meMA.Ode7C14.mode	@ltx/en_us_dedes/miscellanea:misc.Mode8
ltx/en_us_dedes/me.m09.d27:meMA.Ode7C14.ode	@ltx/en_us_dedes/miscellanea:misc.Ode7
ltx/en_us_dedes/me.m09.d27:meMA.Ode7C14.text	O Gymnasios Martyr, * you loved Christ with a firm mind, O God-inspired Saint. * You gratefully extolled Him * as you were slain together * with the others who shared your zeal, * and sang: O blessed are You, the God of our Fathers!
ltx/en_us_dedes/me.m09.d27:meMA.Ode7C1T.incipit	Pray, O Lady, to Him…
ltx/en_us_dedes/me.m09.d27:meMA.Ode7C1T.melody	@ltx/en_us_dedes/he.h.m8:heHE.IlasthitiMoiSotir.name
ltx/en_us_dedes/me.m09.d27:meMA.Ode7C1T.mode	@ltx/en_us_dedes/miscellanea:misc.Mode8
ltx/en_us_dedes/me.m09.d27:meMA.Ode7C1T.ode	@ltx/en_us_dedes/miscellanea:misc.Ode7
ltx/en_us_dedes/me.m09.d27:meMA.Ode7C1T.text	Pray, O Lady, to Him who * was incarnate ineffably, inexplicably * from you, divinely graced one, * to save us who with longing * honor you, and in unison * now sing: O blessed are You, the God of our Fathers!
ltx/en_us_dedes/me.m09.d27:meMA.Ode8C11.greekmelody	@ltx/en_us_dedes/he.h.m8:heHE.OiTheorrimonesPaides.greekname
ltx/en_us_dedes/me.m09.d27:meMA.Ode8C11.incipit	O Martyr, you uprooted the…
ltx/en_us_dedes/me.m09.d27:meMA.Ode8C11.melody	@ltx/en_us_dedes/he.h.m8:heHE.OiTheorrimonesPaides.notmetered
ltx/en_us_dedes/me.m09.d27:meMA.Ode8C11.mode	@ltx/en_us_dedes/miscellanea:misc.Mode8
ltx/en_us_dedes/me.m09.d27:meMA.Ode8C11.ode	@ltx/en_us_dedes/miscellanea:misc.Ode8
ltx/en_us_dedes/me.m09.d27:meMA.Ode8C11.text	O Martyr, you uprooted the thorns of falsehood, and you became a most beautiful plant of Paradise; by divine grace you bore fruits of piety.
ltx/en_us_dedes/me.m09.d27:meMA.Ode8C12.incipit	You went to your contests…
ltx/en_us_dedes/me.m09.d27:meMA.Ode8C12.melody	@ltx/en_us_dedes/he.h.m8:heHE.OiTheorrimonesPaides.notmetered
ltx/en_us_dedes/me.m09.d27:meMA.Ode8C12.mode	@ltx/en_us_dedes/miscellanea:misc.Mode8
ltx/en_us_dedes/me.m09.d27:meMA.Ode8C12.ode	@ltx/en_us_dedes/miscellanea:misc.Ode8
ltx/en_us_dedes/me.m09.d27:meMA.Ode8C12.text	You went to your contests with utmost confidence, for your eyes were firmly fixed on the hope of the blessing to come, O Callistratus; and you won according to the rules, and you were crowned.
ltx/en_us_dedes/me.m09.d27:meMA.Ode8C13.incipit	Your church is like a…
ltx/en_us_dedes/me.m09.d27:meMA.Ode8C13.melody	@ltx/en_us_dedes/he.h.m8:heHE.OiTheorrimonesPaides.notmetered
ltx/en_us_dedes/me.m09.d27:meMA.Ode8C13.mode	@ltx/en_us_dedes/miscellanea:misc.Mode8
ltx/en_us_dedes/me.m09.d27:meMA.Ode8C13.ode	@ltx/en_us_dedes/miscellanea:misc.Ode8
ltx/en_us_dedes/me.m09.d27:meMA.Ode8C13.text	Your church is like a hospital, for those who approach with faith are relieved of their sufferings, and they extol you faithfully, O glorious Gymnasios.
ltx/en_us_dedes/me.m09.d27:meMA.Ode8C1T.incipit	O most-blameless Maiden full of…
ltx/en_us_dedes/me.m09.d27:meMA.Ode8C1T.melody	@ltx/en_us_dedes/he.h.m8:heHE.OiTheorrimonesPaides.notmetered
ltx/en_us_dedes/me.m09.d27:meMA.Ode8C1T.mode	@ltx/en_us_dedes/miscellanea:misc.Mode8
ltx/en_us_dedes/me.m09.d27:meMA.Ode8C1T.ode	@ltx/en_us_dedes/miscellanea:misc.Ode8
ltx/en_us_dedes/me.m09.d27:meMA.Ode8C1T.text	O most-blameless Maiden full of grace divine, as the one who is higher than all things created, make my thoughts rise higher than the scandals of the deceiver.
ltx/en_us_dedes/me.m09.d27:meMA.Ode8H.greekmelody	@ltx/en_us_dedes/he.h.m8:heHE.OiTheorrimonesPaides.greekname
ltx/en_us_dedes/me.m09.d27:meMA.Ode8H.incipit	@ltx/en_us_dedes/he.h.m8:heHE.OiTheorrimonesPaides.incipit
ltx/en_us_dedes/me.m09.d27:meMA.Ode8H.melody	@ltx/en_us_dedes/he.h.m8:heHE.OiTheorrimonesPaides.melody
ltx/en_us_dedes/me.m09.d27:meMA.Ode8H.mode	@ltx/en_us_dedes/miscellanea:misc.Mode8
ltx/en_us_dedes/me.m09.d27:meMA.Ode8H.ode	@ltx/en_us_dedes/miscellanea:misc.Ode8
ltx/en_us_dedes/me.m09.d27:meMA.Ode8H.text	@ltx/en_us_dedes/he.h.m8:heHE.OiTheorrimonesPaides.text
ltx/en_us_dedes/me.m09.d27:meMA.Ode9C11.greekmelody	@ltx/en_us_dedes/he.h.m8:heHE.EfrixePasaAkoi.greekname
ltx/en_us_dedes/me.m09.d27:meMA.Ode9C11.incipit	O Martyr Callistratus, your reliquary…
ltx/en_us_dedes/me.m09.d27:meMA.Ode9C11.melody	@ltx/en_us_dedes/he.h.m8:heHE.EfrixePasaAkoi.notmetered
ltx/en_us_dedes/me.m09.d27:meMA.Ode9C11.mode	@ltx/en_us_dedes/miscellanea:misc.Mode8
ltx/en_us_dedes/me.m09.d27:meMA.Ode9C11.ode	@ltx/en_us_dedes/miscellanea:misc.Ode9
ltx/en_us_dedes/me.m09.d27:meMA.Ode9C11.text	O Martyr Callistratus, your reliquary gushes forth healings to all who are in need, by the energy and power and grace of the Holy Spirit. It truly ends the suffering brought on by untreatable diseases, and it dispells the darkness of the evil spirits.
ltx/en_us_dedes/me.m09.d27:meMA.Ode9C12.incipit	O Martyrs of Christ, you…
ltx/en_us_dedes/me.m09.d27:meMA.Ode9C12.melody	@ltx/en_us_dedes/he.h.m8:heHE.EfrixePasaAkoi.notmetered
ltx/en_us_dedes/me.m09.d27:meMA.Ode9C12.mode	@ltx/en_us_dedes/miscellanea:misc.Mode8
ltx/en_us_dedes/me.m09.d27:meMA.Ode9C12.ode	@ltx/en_us_dedes/miscellanea:misc.Ode9
ltx/en_us_dedes/me.m09.d27:meMA.Ode9C12.text	O Martyrs of Christ, you were linked together by grace like a chain fashioned by God. You hallow the earth with the streams of your blood, and you run back to the heavenly heights. Therefore, we joyfully and loyally celebrate your memory.
ltx/en_us_dedes/me.m09.d27:meMA.Ode9C13.incipit	You received the unwhithering crown…
ltx/en_us_dedes/me.m09.d27:meMA.Ode9C13.melody	@ltx/en_us_dedes/he.h.m8:heHE.EfrixePasaAkoi.notmetered
ltx/en_us_dedes/me.m09.d27:meMA.Ode9C13.mode	@ltx/en_us_dedes/miscellanea:misc.Mode8
ltx/en_us_dedes/me.m09.d27:meMA.Ode9C13.ode	@ltx/en_us_dedes/miscellanea:misc.Ode9
ltx/en_us_dedes/me.m09.d27:meMA.Ode9C13.text	You received the unwhithering crown, celestial glory, the merriment and joy that never end, and the kingdom of heaven, O Callistratus, along with your fellow athletes. Altogether remember us in prayer before the Lord.
ltx/en_us_dedes/me.m09.d27:meMA.Ode9C14.incipit	Today the sacred memory of…
ltx/en_us_dedes/me.m09.d27:meMA.Ode9C14.melody	@ltx/en_us_dedes/he.h.m8:heHE.EfrixePasaAkoi.notmetered
ltx/en_us_dedes/me.m09.d27:meMA.Ode9C14.mode	@ltx/en_us_dedes/miscellanea:misc.Mode8
ltx/en_us_dedes/me.m09.d27:meMA.Ode9C14.ode	@ltx/en_us_dedes/miscellanea:misc.Ode9
ltx/en_us_dedes/me.m09.d27:meMA.Ode9C14.text	Today the sacred memory of wise Callistratus and Gymnasios and their fellow athletes shines brighter than the sun. It illumines the ends of the earth with beams of light. O Christ, free us from condemnation, by their intercessions.
ltx/en_us_dedes/me.m09.d27:meMA.Ode9C1T.incipit	O all-blessed Virgin, we salute…
ltx/en_us_dedes/me.m09.d27:meMA.Ode9C1T.melody	@ltx/en_us_dedes/he.h.m8:heHE.EfrixePasaAkoi.notmetered
ltx/en_us_dedes/me.m09.d27:meMA.Ode9C1T.mode	@ltx/en_us_dedes/miscellanea:misc.Mode8
ltx/en_us_dedes/me.m09.d27:meMA.Ode9C1T.ode	@ltx/en_us_dedes/miscellanea:misc.Ode9
ltx/en_us_dedes/me.m09.d27:meMA.Ode9C1T.text	O all-blessed Virgin, we salute you with the words of Gabriel, and we joyfully cry out: Rejoice, O joy of the faithful! Rejoice O golden lampstand and table and mountain and noetic gate! Rejoice, O divine chariot of Christ the King! Rejoice, for you released us from the curse.me.m
ltx/en_us_dedes/me.m09.d27:meMA.Ode9H.greekmelody	@ltx/en_us_dedes/he.h.m8:heHE.EfrixePasaAkoi.greekname
ltx/en_us_dedes/me.m09.d27:meMA.Ode9H.incipit	@ltx/en_us_dedes/he.h.m8:heHE.EfrixePasaAkoi.incipit
ltx/en_us_dedes/me.m09.d27:meMA.Ode9H.melody	@ltx/en_us_dedes/he.h.m8:heHE.EfrixePasaAkoi.melody
ltx/en_us_dedes/me.m09.d27:meMA.Ode9H.mode	@ltx/en_us_dedes/miscellanea:misc.Mode8
ltx/en_us_dedes/me.m09.d27:meMA.Ode9H.ode	@ltx/en_us_dedes/miscellanea:misc.Ode9
ltx/en_us_dedes/me.m09.d27:meMA.Ode9H.text	@ltx/en_us_dedes/he.h.m8:heHE.EfrixePasaAkoi.text
ltx/en_us_dedes/me.m09.d27:meMA.Oikos1.text	
ltx/en_us_dedes/me.m09.d27:meVE.Apolytikion1ger.greekmelody	@ltx/en_us_dedes/he.a.m3:heAU.TinOraiotita.greekname
ltx/en_us_dedes/me.m09.d27:meVE.Apolytikion1ger.incipit	…
ltx/en_us_dedes/me.m09.d27:meVE.Apolytikion1ger.melody	@ltx/en_us_dedes/he.a.m3:heAU.TinOraiotita.name
ltx/en_us_dedes/me.m09.d27:meVE.Apolytikion1ger.mode	@ltx/en_us_dedes/miscellanea:misc.Mode3
ltx/en_us_dedes/me.m09.d27:meVE.Apolytikion1ger.poet	@ltx/en_us_dedes/poets:po.Gerasimou
ltx/en_us_dedes/me.m09.d27:meVE.Apolytikion1ger.text	
ltx/en_us_dedes/me.m09.d27:meVE.Apolytikion2ger.greekmelody	@ltx/en_us_dedes/he.a.m5:heAU.TonSynanarchonLogon.greekname
ltx/en_us_dedes/me.m09.d27:meVE.Apolytikion2ger.incipit	…
ltx/en_us_dedes/me.m09.d27:meVE.Apolytikion2ger.melody	@ltx/en_us_dedes/he.a.m5:heAU.TonSynanarchonLogon.name
ltx/en_us_dedes/me.m09.d27:meVE.Apolytikion2ger.mode	@ltx/en_us_dedes/miscellanea:misc.Mode5
ltx/en_us_dedes/me.m09.d27:meVE.Apolytikion2ger.poet	@ltx/en_us_dedes/poets:po.Gerasimou
ltx/en_us_dedes/me.m09.d27:meVE.Apolytikion2ger.text	
ltx/en_us_dedes/me.m09.d27:meVE.SticGlory.incipit	…
ltx/en_us_dedes/me.m09.d27:meVE.SticGlory.melody	
ltx/en_us_dedes/me.m09.d27:meVE.SticGlory.mode	@ltx/en_us_dedes/miscellanea:misc.Mode4
ltx/en_us_dedes/me.m09.d27:meVE.SticGlory.poet	@ltx/en_us_dedes/poets:po.Vyzantiou
ltx/en_us_dedes/me.m09.d27:meVE.SticGlory.text	
ltx/en_us_dedes/me.m09.d27:meVE.SticStavrotheotokion.greekmelody	@ltx/en_us_dedes/he.a.m4:heAU.EdokasSimeiosin.greekname
ltx/en_us_dedes/me.m09.d27:meVE.SticStavrotheotokion.incipit	@ltx/en_us_dedes/me.m07.d18:meVE.SticStavrotheotokion.incipit
ltx/en_us_dedes/me.m09.d27:meVE.SticStavrotheotokion.melody	@ltx/en_us_dedes/he.a.m4:heAU.EdokasSimeiosin.name
ltx/en_us_dedes/me.m09.d27:meVE.SticStavrotheotokion.mode	@ltx/en_us_dedes/miscellanea:misc.Mode4
ltx/en_us_dedes/me.m09.d27:meVE.SticStavrotheotokion.text	@ltx/en_us_dedes/me.m07.d18:meVE.SticStavrotheotokion.text
ltx/en_us_dedes/me.m09.d27:meVE.SticTheotokion.greekmelody	@ltx/en_us_dedes/he.a.m4:heAU.EdokasSimeiosin.greekname
ltx/en_us_dedes/me.m09.d27:meVE.SticTheotokion.incipit	…
ltx/en_us_dedes/me.m09.d27:meVE.SticTheotokion.melody	@ltx/en_us_dedes/he.a.m4:heAU.EdokasSimeiosin.name
ltx/en_us_dedes/me.m09.d27:meVE.SticTheotokion.mode	@ltx/en_us_dedes/miscellanea:misc.Mode4
ltx/en_us_dedes/me.m09.d27:meVE.SticTheotokion.text	
ltx/en_us_dedes/me.m09.d27:meVE.Stichera01.greekmelody	@ltx/en_us_dedes/he.a.m8:heAU.OTouParadoxou.greekname
ltx/en_us_dedes/me.m09.d27:meVE.Stichera01.incipit	…
ltx/en_us_dedes/me.m09.d27:meVE.Stichera01.melody	@ltx/en_us_dedes/he.a.m8:heAU.OTouParadoxou.name
ltx/en_us_dedes/me.m09.d27:meVE.Stichera01.mode	@ltx/en_us_dedes/miscellanea:misc.Mode8
ltx/en_us_dedes/me.m09.d27:meVE.Stichera01.text	
ltx/en_us_dedes/me.m09.d27:meVE.Stichera02.incipit	…
ltx/en_us_dedes/me.m09.d27:meVE.Stichera02.melody	@ltx/en_us_dedes/he.a.m8:heAU.OTouParadoxou.name
ltx/en_us_dedes/me.m09.d27:meVE.Stichera02.mode	@ltx/en_us_dedes/miscellanea:misc.Mode8
ltx/en_us_dedes/me.m09.d27:meVE.Stichera02.text	
ltx/en_us_dedes/me.m09.d27:meVE.Stichera03.incipit	…
ltx/en_us_dedes/me.m09.d27:meVE.Stichera03.melody	@ltx/en_us_dedes/he.a.m8:heAU.OTouParadoxou.name
ltx/en_us_dedes/me.m09.d27:meVE.Stichera03.mode	@ltx/en_us_dedes/miscellanea:misc.Mode8
ltx/en_us_dedes/me.m09.d27:meVE.Stichera03.text	
