ltx/en_us_dedes/me.m07.d26:meDA.commemoration.first	
ltx/en_us_dedes/me.m07.d26:meDA.commemoration.first_name	St. Paraskeve
ltx/en_us_dedes/me.m07.d26:meDA.commemoration.first_short	
ltx/en_us_dedes/me.m07.d26:meDA.commemoration.first_title	@ltx/en_us_dedes/titles:ti.Saints
ltx/en_us_dedes/me.m07.d26:meDA.commemoration.full	Memory of the Holy Hieromartyrs Hermolaus, Hermippus, and Hermocrates; and the Devout Martyr St. Paraskeve.
ltx/en_us_dedes/me.m07.d26:meDA.commemoration.second_name	
ltx/en_us_dedes/me.m07.d26:meDA.commemoration.second_short	Memory of St. Paraskeve
ltx/en_us_dedes/me.m07.d26:meDA.commemoration.second_title	For St. Paraskeve.
ltx/en_us_dedes/me.m07.d26:meDA.date	July 26
ltx/en_us_dedes/me.m07.d26:meDA.fordate	for July 26
ltx/en_us_dedes/me.m07.d26:meDA.insert1	and St. Paraskeve, the monastic martyr,
ltx/en_us_dedes/me.m07.d26:meDA.insert2	whose memory we celebrate,
ltx/en_us_dedes/me.m07.d26:meDA.note	
ltx/en_us_dedes/me.m07.d26:meDA.pdfcoverdate	July 26,
ltx/en_us_dedes/me.m07.d26:meDA.pdfheaderdate	July 26
ltx/en_us_dedes/me.m07.d26:meHO.commemorations	
ltx/en_us_dedes/me.m07.d26:meHO.note1	
ltx/en_us_dedes/me.m07.d26:meHO.note2	
ltx/en_us_dedes/me.m07.d26:meHO.number	
ltx/en_us_dedes/me.m07.d26:meHO.rank	
ltx/en_us_dedes/me.m07.d26:meLE.commemoration1	The Holy Hieromartyr Hermolaos.
ltx/en_us_dedes/me.m07.d26:meLE.commemoration2	The Venerable Martyr Paraskeve.
ltx/en_us_dedes/me.m07.d26:meLI.Kontakion1.greekmelody	@ltx/en_us_dedes/me.m07.d26:meMA.Kontakion1.greekmelody
ltx/en_us_dedes/me.m07.d26:meLI.Kontakion1.incipit	@ltx/en_us_dedes/me.m07.d26:meMA.Kontakion1.incipit
ltx/en_us_dedes/me.m07.d26:meLI.Kontakion1.melody	@ltx/en_us_dedes/me.m07.d26:meMA.Kontakion1.melody
ltx/en_us_dedes/me.m07.d26:meLI.Kontakion1.mode	@ltx/en_us_dedes/me.m07.d26:meMA.Kontakion1.mode
ltx/en_us_dedes/me.m07.d26:meLI.Kontakion1.text	@ltx/en_us_dedes/me.m07.d26:meMA.Kontakion1.text
ltx/en_us_dedes/me.m07.d26:meLI.MM.CommunionHymn.text	@ltx/en_us_dedes/properties:media.key
ltx/en_us_dedes/me.m07.d26:meLI.Megalynarion.text	Godly-minded martyr Paraskeve, * as the Church’s bright star, and a fountain of many cures, * heaven-sent protection and shelter of the faithful, * who honor and salute you, crying aloud, “Rejoice!”
ltx/en_us_dedes/me.m07.d26:meMA.C1.acrostic.notice1	
ltx/en_us_dedes/me.m07.d26:meMA.C1.acrostic.text	
ltx/en_us_dedes/me.m07.d26:meMA.C1.acrostic.title	
ltx/en_us_dedes/me.m07.d26:meMA.C1.title	@ltx/en_us_dedes/titles:ti.CanonSaintM
ltx/en_us_dedes/me.m07.d26:meMA.C1.verse	@ltx/en_us_dedes/prayers:pr.verse_SaintM.text
ltx/en_us_dedes/me.m07.d26:meMA.C2.acrostic.notice1	
ltx/en_us_dedes/me.m07.d26:meMA.C2.acrostic.text	
ltx/en_us_dedes/me.m07.d26:meMA.C2.acrostic.title	Canon for St. Paraskeve.
ltx/en_us_dedes/me.m07.d26:meMA.C2.poet	@ltx/en_us_dedes/poets:po.Theofanous
ltx/en_us_dedes/me.m07.d26:meMA.C2.title	@ltx/en_us_dedes/titles:ti.CanonSaintW
ltx/en_us_dedes/me.m07.d26:meMA.C2.verse	@ltx/en_us_dedes/prayers:pr.verse_SaintW.text
ltx/en_us_dedes/me.m07.d26:meMA.ExapTheotokion.incipit	@ltx/en_us_dedes/ho.ho03:hoMA.ExapThuTh.incipit
ltx/en_us_dedes/me.m07.d26:meMA.ExapTheotokion.melody	@ltx/en_us_dedes/he.a.m2:heAU.GynaikesAkoutisthite.name
ltx/en_us_dedes/me.m07.d26:meMA.ExapTheotokion.mode	@ltx/en_us_dedes/miscellanea:misc.Mode2
ltx/en_us_dedes/me.m07.d26:meMA.ExapTheotokion.text	@ltx/en_us_dedes/ho.ho03:hoMA.ExapThuTh.text
ltx/en_us_dedes/me.m07.d26:meMA.Exaposteilarion1.greekmelody	@ltx/en_us_dedes/he.a.m2:heAU.GynaikesAkoutisthite.greekname
ltx/en_us_dedes/me.m07.d26:meMA.Exaposteilarion1.incipit	Fair virgin, being strengthened by…
ltx/en_us_dedes/me.m07.d26:meMA.Exaposteilarion1.melody	@ltx/en_us_dedes/he.a.m2:heAU.GynaikesAkoutisthite.name
ltx/en_us_dedes/me.m07.d26:meMA.Exaposteilarion1.mode	@ltx/en_us_dedes/miscellanea:misc.Mode2
ltx/en_us_dedes/me.m07.d26:meMA.Exaposteilarion1.text	Fair virgin, being strengthened by the Cross of Christ your King and Lord, * O Martyr, you bravely contended * and humbled the tyrants’ arrogance. * All-wise one, you received from Christ the medals for your victories, * all-wonderful Paraskeve. * And now you entreat in earnest * for us who with love extol you.
ltx/en_us_dedes/me.m07.d26:meMA.Kathisma11.greekmelody	@ltx/en_us_dedes/he.a.m4:heAU.OYpsotheisEnToStavro.greekname
ltx/en_us_dedes/me.m07.d26:meMA.Kathisma11.incipit	You truly loved the Savior…
ltx/en_us_dedes/me.m07.d26:meMA.Kathisma11.melody	@ltx/en_us_dedes/he.a.m4:heAU.OYpsotheisEnToStavro.name
ltx/en_us_dedes/me.m07.d26:meMA.Kathisma11.mode	@ltx/en_us_dedes/miscellanea:misc.Mode4
ltx/en_us_dedes/me.m07.d26:meMA.Kathisma11.text	You truly loved the Savior Christ who is handsome, * and through your chastity your soul shone with beauty, * and thus by means of every kind of labor and distress, * you betrothed yourself to Him, as a bride who is blameless. * So He gave you access to the heavenly chambers. * And you, all-lauded Saint Paraskeve * earnestly pray Him * for us who now honor you.
ltx/en_us_dedes/me.m07.d26:meMA.Kathisma1T.incipit	@ltx/en_us_dedes/ho.ho23:hoCA.Apolytikion2.incipit
ltx/en_us_dedes/me.m07.d26:meMA.Kathisma1T.melody	@ltx/en_us_dedes/he.a.m4:heAU.OYpsotheisEnToStavro.name
ltx/en_us_dedes/me.m07.d26:meMA.Kathisma1T.mode	@ltx/en_us_dedes/miscellanea:misc.Mode4
ltx/en_us_dedes/me.m07.d26:meMA.Kathisma1T.text	@ltx/en_us_dedes/ho.ho23:hoCA.Apolytikion2.text
ltx/en_us_dedes/me.m07.d26:meMA.Kathisma21.greekmelody	@ltx/en_us_dedes/he.a.m1:heAU.TonTafonSouSotir.greekname
ltx/en_us_dedes/me.m07.d26:meMA.Kathisma21.incipit	By purity of life, as…
ltx/en_us_dedes/me.m07.d26:meMA.Kathisma21.melody	@ltx/en_us_dedes/he.a.m1:heAU.TonTafonSouSotir.name
ltx/en_us_dedes/me.m07.d26:meMA.Kathisma21.mode	@ltx/en_us_dedes/miscellanea:misc.Mode1
ltx/en_us_dedes/me.m07.d26:meMA.Kathisma21.text	By purity of life, as a lamb without blemish, * you mystically were joined to the Lord, O pure maiden, * and also adorned yourself with the beauty of martyrdom. * Therefore you received the grace of God to work healings; * by the power of the Spirit, you cure diseases * and illness of every kind.
ltx/en_us_dedes/me.m07.d26:meMA.Kathisma2T.incipit	@ltx/en_us_dedes/oc.m1.d1:ocMA.Kathisma13.incipit
ltx/en_us_dedes/me.m07.d26:meMA.Kathisma2T.melody	@ltx/en_us_dedes/he.a.m1:heAU.TonTafonSouSotir.name
ltx/en_us_dedes/me.m07.d26:meMA.Kathisma2T.mode	@ltx/en_us_dedes/miscellanea:misc.Mode1
ltx/en_us_dedes/me.m07.d26:meMA.Kathisma2T.text	@ltx/en_us_dedes/oc.m1.d1:ocMA.Kathisma13.text
ltx/en_us_dedes/me.m07.d26:meMA.Kontakion1.greekmelody	@ltx/en_us_dedes/he.a.m4:heAU.EpefanisSimeron.greekname
ltx/en_us_dedes/me.m07.d26:meMA.Kontakion1.incipit	We have found your sacred…
ltx/en_us_dedes/me.m07.d26:meMA.Kontakion1.melody	@ltx/en_us_dedes/he.a.m4:heAU.EpefanisSimeron.name
ltx/en_us_dedes/me.m07.d26:meMA.Kontakion1.mode	@ltx/en_us_dedes/miscellanea:misc.Mode4
ltx/en_us_dedes/me.m07.d26:meMA.Kontakion1.text	We have found your sacred shrine to be a clinic of the soul, O holy one, and all we faithful now accord honor to you with our voices strong, devout Martyr Paraskeve extolled by all.
ltx/en_us_dedes/me.m07.d26:meMA.Lauds1.greekmelody	@ltx/en_us_dedes/he.a.m1:heAU.TonOuranionTagmaton.greekname
ltx/en_us_dedes/me.m07.d26:meMA.Lauds1.incipit	Dancing in chorus in heaven…
ltx/en_us_dedes/me.m07.d26:meMA.Lauds1.melody	@ltx/en_us_dedes/he.a.m1:heAU.TonOuranionTagmaton.name
ltx/en_us_dedes/me.m07.d26:meMA.Lauds1.mode	@ltx/en_us_dedes/miscellanea:misc.Mode1
ltx/en_us_dedes/me.m07.d26:meMA.Lauds1.text	Dancing in chorus in heaven and in the courts of the Lord * with those renowned wise virgins, O devout holy Martyr, * most wise Paraskeve, you were given the grace * from the Lord to cure illnesses, * and to expel the unclean spirits and to heal * those who come to you for this with faith.
ltx/en_us_dedes/me.m07.d26:meMA.Lauds2.incipit	You dashed the might of…
ltx/en_us_dedes/me.m07.d26:meMA.Lauds2.melody	@ltx/en_us_dedes/he.a.m1:heAU.TonOuranionTagmaton.name
ltx/en_us_dedes/me.m07.d26:meMA.Lauds2.mode	@ltx/en_us_dedes/miscellanea:misc.Mode1
ltx/en_us_dedes/me.m07.d26:meMA.Lauds2.text	You dashed the might of the godless impious kings to the ground, * and unto God, O Virgin, * you directed your footsteps. * Therefore you were not frightened by the lead * hammers pounding you, nor the fire, * nor by the scraping of your body, nor by the heat * of the cauldron, nor the death by sword.
ltx/en_us_dedes/me.m07.d26:meMA.Lauds3.incipit	Firstly you wore out your…
ltx/en_us_dedes/me.m07.d26:meMA.Lauds3.melody	@ltx/en_us_dedes/he.a.m1:heAU.TonOuranionTagmaton.name
ltx/en_us_dedes/me.m07.d26:meMA.Lauds3.mode	@ltx/en_us_dedes/miscellanea:misc.Mode1
ltx/en_us_dedes/me.m07.d26:meMA.Lauds3.text	Firstly you wore out your body with your ascetic feats, * fair Virgin, then you hardened * your resolve in the contest. * Thus, O holy glorious Martyr of Christ, * you became like a holy sword * wrought in the heavens, like gold smelted and refined * by the tortures you endured for God.
ltx/en_us_dedes/me.m07.d26:meMA.LaudsGlory.incipit	In the city of our…
ltx/en_us_dedes/me.m07.d26:meMA.LaudsGlory.melody	
ltx/en_us_dedes/me.m07.d26:meMA.LaudsGlory.mode	@ltx/en_us_dedes/miscellanea:misc.Mode2
ltx/en_us_dedes/me.m07.d26:meMA.LaudsGlory.text	In the city of our God, in His holy mountain, that is where Saint Paraskeve made her dwelling, and she kept her lamp from going out. Hear the praise of this virgin: “Oh virginity, the temple of God! Oh Virginity, the glory of the Martyrs! Oh Virginity, the partner of Angels!”
ltx/en_us_dedes/me.m07.d26:meMA.LaudsTheotokion.incipit	@ltx/en_us_dedes/ho.ho23:hoCA.Troparion7.incipit
ltx/en_us_dedes/me.m07.d26:meMA.LaudsTheotokion.melody	
ltx/en_us_dedes/me.m07.d26:meMA.LaudsTheotokion.mode	@ltx/en_us_dedes/miscellanea:misc.Mode2
ltx/en_us_dedes/me.m07.d26:meMA.LaudsTheotokion.text	@ltx/en_us_dedes/ho.ho23:hoCA.Troparion7.text
ltx/en_us_dedes/me.m07.d26:meMA.MM.Lauds1123as5678.text	@ltx/en_us_dedes/properties:media.key
ltx/en_us_dedes/me.m07.d26:meMA.Ode1C11.greekmelody	@ltx/en_us_dedes/he.h.m8:heHE.AsomenToKyrio.greekname
ltx/en_us_dedes/me.m07.d26:meMA.Ode1C11.incipit	…
ltx/en_us_dedes/me.m07.d26:meMA.Ode1C11.melody	@ltx/en_us_dedes/he.h.m8:heHE.AsomenToKyrio.name
ltx/en_us_dedes/me.m07.d26:meMA.Ode1C11.mode	@ltx/en_us_dedes/miscellanea:misc.Mode8
ltx/en_us_dedes/me.m07.d26:meMA.Ode1C11.ode	@ltx/en_us_dedes/miscellanea:misc.Ode1
ltx/en_us_dedes/me.m07.d26:meMA.Ode1C11.text	
ltx/en_us_dedes/me.m07.d26:meMA.Ode1C12.incipit	…
ltx/en_us_dedes/me.m07.d26:meMA.Ode1C12.melody	@ltx/en_us_dedes/he.h.m8:heHE.AsomenToKyrio.name
ltx/en_us_dedes/me.m07.d26:meMA.Ode1C12.mode	@ltx/en_us_dedes/miscellanea:misc.Mode8
ltx/en_us_dedes/me.m07.d26:meMA.Ode1C12.ode	@ltx/en_us_dedes/miscellanea:misc.Ode1
ltx/en_us_dedes/me.m07.d26:meMA.Ode1C12.text	
ltx/en_us_dedes/me.m07.d26:meMA.Ode1C13.incipit	…
ltx/en_us_dedes/me.m07.d26:meMA.Ode1C13.melody	@ltx/en_us_dedes/he.h.m8:heHE.AsomenToKyrio.name
ltx/en_us_dedes/me.m07.d26:meMA.Ode1C13.mode	@ltx/en_us_dedes/miscellanea:misc.Mode8
ltx/en_us_dedes/me.m07.d26:meMA.Ode1C13.ode	@ltx/en_us_dedes/miscellanea:misc.Ode1
ltx/en_us_dedes/me.m07.d26:meMA.Ode1C13.text	
ltx/en_us_dedes/me.m07.d26:meMA.Ode1C14.incipit	…
ltx/en_us_dedes/me.m07.d26:meMA.Ode1C14.melody	@ltx/en_us_dedes/he.h.m8:heHE.AsomenToKyrio.name
ltx/en_us_dedes/me.m07.d26:meMA.Ode1C14.mode	@ltx/en_us_dedes/miscellanea:misc.Mode8
ltx/en_us_dedes/me.m07.d26:meMA.Ode1C14.ode	@ltx/en_us_dedes/miscellanea:misc.Ode1
ltx/en_us_dedes/me.m07.d26:meMA.Ode1C14.text	
ltx/en_us_dedes/me.m07.d26:meMA.Ode1C1T.incipit	…
ltx/en_us_dedes/me.m07.d26:meMA.Ode1C1T.melody	@ltx/en_us_dedes/he.h.m8:heHE.AsomenToKyrio.name
ltx/en_us_dedes/me.m07.d26:meMA.Ode1C1T.mode	@ltx/en_us_dedes/miscellanea:misc.Mode8
ltx/en_us_dedes/me.m07.d26:meMA.Ode1C1T.ode	@ltx/en_us_dedes/miscellanea:misc.Ode1
ltx/en_us_dedes/me.m07.d26:meMA.Ode1C1T.text	
ltx/en_us_dedes/me.m07.d26:meMA.Ode1C21.greekmelody	@ltx/en_us_dedes/he.h.m4:heHE.ThalassisToErythraion.greekname
ltx/en_us_dedes/me.m07.d26:meMA.Ode1C21.incipit	All-lauded Martyr, renowned Paraskeve…
ltx/en_us_dedes/me.m07.d26:meMA.Ode1C21.melody	@ltx/en_us_dedes/he.h.m4:heHE.ThalassisToErythraion.notmetered
ltx/en_us_dedes/me.m07.d26:meMA.Ode1C21.mode	@ltx/en_us_dedes/miscellanea:misc.Mode4
ltx/en_us_dedes/me.m07.d26:meMA.Ode1C21.ode	@ltx/en_us_dedes/miscellanea:misc.Ode1
ltx/en_us_dedes/me.m07.d26:meMA.Ode1C21.text	All-lauded Martyr, renowned Paraskeve, when you entreat the Lord, pray that grace and forgiveness of offenses be granted to us who extol your luminous memory.
ltx/en_us_dedes/me.m07.d26:meMA.Ode1C22.incipit	When you cast down the…
ltx/en_us_dedes/me.m07.d26:meMA.Ode1C22.melody	@ltx/en_us_dedes/he.h.m4:heHE.ThalassisToErythraion.notmetered
ltx/en_us_dedes/me.m07.d26:meMA.Ode1C22.mode	@ltx/en_us_dedes/miscellanea:misc.Mode4
ltx/en_us_dedes/me.m07.d26:meMA.Ode1C22.ode	@ltx/en_us_dedes/miscellanea:misc.Ode1
ltx/en_us_dedes/me.m07.d26:meMA.Ode1C22.text	When you cast down the enemy’s devices with the weapon of the Cross, you were shown to be the beauty of Martyrs. You wrestled with the brutality of the tyrants as an athlete in contest, you did preach the Christian Faith.
ltx/en_us_dedes/me.m07.d26:meMA.Ode1C23.incipit	The tyrant who wickedly offered…
ltx/en_us_dedes/me.m07.d26:meMA.Ode1C23.melody	@ltx/en_us_dedes/he.h.m4:heHE.ThalassisToErythraion.notmetered
ltx/en_us_dedes/me.m07.d26:meMA.Ode1C23.mode	@ltx/en_us_dedes/miscellanea:misc.Mode4
ltx/en_us_dedes/me.m07.d26:meMA.Ode1C23.ode	@ltx/en_us_dedes/miscellanea:misc.Ode1
ltx/en_us_dedes/me.m07.d26:meMA.Ode1C23.text	The tyrant who wickedly offered worship to idols thought he could destroy the firmness of your endurance, O Martyr; but by your wise words, all his arrogance was undone.
ltx/en_us_dedes/me.m07.d26:meMA.Ode1C2T.incipit	The Logos was born of…
ltx/en_us_dedes/me.m07.d26:meMA.Ode1C2T.melody	@ltx/en_us_dedes/he.h.m4:heHE.ThalassisToErythraion.notmetered
ltx/en_us_dedes/me.m07.d26:meMA.Ode1C2T.mode	@ltx/en_us_dedes/miscellanea:misc.Mode4
ltx/en_us_dedes/me.m07.d26:meMA.Ode1C2T.ode	@ltx/en_us_dedes/miscellanea:misc.Ode1
ltx/en_us_dedes/me.m07.d26:meMA.Ode1C2T.text	The Logos was born of your immaculate blood, O Lady, receiving flesh endowed with a soul; and by divine might, He refashioned us who had slipped when we were bitten by the deceiver.
ltx/en_us_dedes/me.m07.d26:meMA.Ode3C11.greekmelody	@ltx/en_us_dedes/he.h.m8:heHE.SyEiToStereoma.greekname
ltx/en_us_dedes/me.m07.d26:meMA.Ode3C11.incipit	…
ltx/en_us_dedes/me.m07.d26:meMA.Ode3C11.melody	@ltx/en_us_dedes/he.h.m8:heHE.SyEiToStereoma.name
ltx/en_us_dedes/me.m07.d26:meMA.Ode3C11.mode	@ltx/en_us_dedes/miscellanea:misc.Mode8
ltx/en_us_dedes/me.m07.d26:meMA.Ode3C11.ode	@ltx/en_us_dedes/miscellanea:misc.Ode3
ltx/en_us_dedes/me.m07.d26:meMA.Ode3C11.text	
ltx/en_us_dedes/me.m07.d26:meMA.Ode3C12.incipit	…
ltx/en_us_dedes/me.m07.d26:meMA.Ode3C12.melody	@ltx/en_us_dedes/he.h.m8:heHE.SyEiToStereoma.name
ltx/en_us_dedes/me.m07.d26:meMA.Ode3C12.mode	@ltx/en_us_dedes/miscellanea:misc.Mode8
ltx/en_us_dedes/me.m07.d26:meMA.Ode3C12.ode	@ltx/en_us_dedes/miscellanea:misc.Ode3
ltx/en_us_dedes/me.m07.d26:meMA.Ode3C12.text	
ltx/en_us_dedes/me.m07.d26:meMA.Ode3C13.incipit	…
ltx/en_us_dedes/me.m07.d26:meMA.Ode3C13.melody	@ltx/en_us_dedes/he.h.m8:heHE.SyEiToStereoma.name
ltx/en_us_dedes/me.m07.d26:meMA.Ode3C13.mode	@ltx/en_us_dedes/miscellanea:misc.Mode8
ltx/en_us_dedes/me.m07.d26:meMA.Ode3C13.ode	@ltx/en_us_dedes/miscellanea:misc.Ode3
ltx/en_us_dedes/me.m07.d26:meMA.Ode3C13.text	
ltx/en_us_dedes/me.m07.d26:meMA.Ode3C1T.incipit	…
ltx/en_us_dedes/me.m07.d26:meMA.Ode3C1T.melody	@ltx/en_us_dedes/he.h.m8:heHE.SyEiToStereoma.name
ltx/en_us_dedes/me.m07.d26:meMA.Ode3C1T.mode	@ltx/en_us_dedes/miscellanea:misc.Mode8
ltx/en_us_dedes/me.m07.d26:meMA.Ode3C1T.ode	@ltx/en_us_dedes/miscellanea:misc.Ode3
ltx/en_us_dedes/me.m07.d26:meMA.Ode3C1T.text	
ltx/en_us_dedes/me.m07.d26:meMA.Ode3C21.greekmelody	@ltx/en_us_dedes/he.h.m4:heHE.EffrainetaiEpiSoi.greekname
ltx/en_us_dedes/me.m07.d26:meMA.Ode3C21.incipit	The Holy Spirit strengthened your…
ltx/en_us_dedes/me.m07.d26:meMA.Ode3C21.melody	@ltx/en_us_dedes/he.h.m4:heHE.EffrainetaiEpiSoi.notmetered
ltx/en_us_dedes/me.m07.d26:meMA.Ode3C21.mode	@ltx/en_us_dedes/miscellanea:misc.Mode4
ltx/en_us_dedes/me.m07.d26:meMA.Ode3C21.ode	@ltx/en_us_dedes/miscellanea:misc.Ode3
ltx/en_us_dedes/me.m07.d26:meMA.Ode3C21.text	The Holy Spirit strengthened your infirmity and made you radiant, O Paraskeve, and excellently displayed the illumination of your spotless soul.
ltx/en_us_dedes/me.m07.d26:meMA.Ode3C22.incipit	Strengthened by the might of…
ltx/en_us_dedes/me.m07.d26:meMA.Ode3C22.melody	@ltx/en_us_dedes/he.h.m4:heHE.EffrainetaiEpiSoi.notmetered
ltx/en_us_dedes/me.m07.d26:meMA.Ode3C22.mode	@ltx/en_us_dedes/miscellanea:misc.Mode4
ltx/en_us_dedes/me.m07.d26:meMA.Ode3C22.ode	@ltx/en_us_dedes/miscellanea:misc.Ode3
ltx/en_us_dedes/me.m07.d26:meMA.Ode3C22.text	Strengthened by the might of Christ, you endured like a very hard diamond when you were mercilessly whipped, O Martyr of Christ.
ltx/en_us_dedes/me.m07.d26:meMA.Ode3C23.incipit	During your contest, you patiently…
ltx/en_us_dedes/me.m07.d26:meMA.Ode3C23.melody	@ltx/en_us_dedes/he.h.m4:heHE.EffrainetaiEpiSoi.notmetered
ltx/en_us_dedes/me.m07.d26:meMA.Ode3C23.mode	@ltx/en_us_dedes/miscellanea:misc.Mode4
ltx/en_us_dedes/me.m07.d26:meMA.Ode3C23.ode	@ltx/en_us_dedes/miscellanea:misc.Ode3
ltx/en_us_dedes/me.m07.d26:meMA.Ode3C23.text	During your contest, you patiently endured the ripping up of your body and the unbearably bitter tortures, in your love for God.
ltx/en_us_dedes/me.m07.d26:meMA.Ode3C2T.incipit	O Mother of God, you…
ltx/en_us_dedes/me.m07.d26:meMA.Ode3C2T.melody	@ltx/en_us_dedes/he.h.m4:heHE.EffrainetaiEpiSoi.notmetered
ltx/en_us_dedes/me.m07.d26:meMA.Ode3C2T.mode	@ltx/en_us_dedes/miscellanea:misc.Mode4
ltx/en_us_dedes/me.m07.d26:meMA.Ode3C2T.ode	@ltx/en_us_dedes/miscellanea:misc.Ode3
ltx/en_us_dedes/me.m07.d26:meMA.Ode3C2T.text	O Mother of God, you alone became the provider of supernatural blessings for those on the earth; therefore, we cry to you the salutation: Rejoice.
ltx/en_us_dedes/me.m07.d26:meMA.Ode3H.greekmelody	@ltx/en_us_dedes/he.h.m4:heHE.EffrainetaiEpiSoi.greekname
ltx/en_us_dedes/me.m07.d26:meMA.Ode3H.incipit	@ltx/en_us_dedes/he.h.m4:heHE.EffrainetaiEpiSoi.incipit
ltx/en_us_dedes/me.m07.d26:meMA.Ode3H.melody	@ltx/en_us_dedes/he.h.m4:heHE.EffrainetaiEpiSoi.melody
ltx/en_us_dedes/me.m07.d26:meMA.Ode3H.mode	@ltx/en_us_dedes/miscellanea:misc.Mode4
ltx/en_us_dedes/me.m07.d26:meMA.Ode3H.ode	@ltx/en_us_dedes/miscellanea:misc.Ode3
ltx/en_us_dedes/me.m07.d26:meMA.Ode3H.text	@ltx/en_us_dedes/he.h.m4:heHE.EffrainetaiEpiSoi.text
ltx/en_us_dedes/me.m07.d26:meMA.Ode3Kathisma1.greekmelody	@ltx/en_us_dedes/he.a.m8:heAU.TinSofianKaiLogon.greekname
ltx/en_us_dedes/me.m07.d26:meMA.Ode3Kathisma1.incipit	…
ltx/en_us_dedes/me.m07.d26:meMA.Ode3Kathisma1.melody	@ltx/en_us_dedes/he.a.m8:heAU.TinSofianKaiLogon.name
ltx/en_us_dedes/me.m07.d26:meMA.Ode3Kathisma1.mode	@ltx/en_us_dedes/miscellanea:misc.Mode8
ltx/en_us_dedes/me.m07.d26:meMA.Ode3Kathisma1.text	
ltx/en_us_dedes/me.m07.d26:meMA.Ode3Kathisma2.greekmelody	@ltx/en_us_dedes/he.a.m8:heAU.TinSofianKaiLogon.greekname
ltx/en_us_dedes/me.m07.d26:meMA.Ode3Kathisma2.incipit	Dedicating yourself wholly to the…
ltx/en_us_dedes/me.m07.d26:meMA.Ode3Kathisma2.melody	@ltx/en_us_dedes/he.a.m8:heAU.TinSofianKaiLogon.name
ltx/en_us_dedes/me.m07.d26:meMA.Ode3Kathisma2.mode	@ltx/en_us_dedes/miscellanea:misc.Mode8
ltx/en_us_dedes/me.m07.d26:meMA.Ode3Kathisma2.text	Dedicating yourself wholly to the Lord * from your earliest years, you continually * were well-pleasing unto Him * who is Savior of all the world. * You courageously trampled the tyrants’ audacity, * and you manfully bore painful torments until the end. * Therefore, Christ adorned you with the crowns for your triumph * and gloriously let you in * to the heavenly bridal hall, * O praiseworthy Paraskeve. * Intercede with Christ our God * that He grant forgiveness of offenses * to those who keep your all-holy memory with faith and love.
ltx/en_us_dedes/me.m07.d26:meMA.Ode3KathismaT.incipit	@ltx/en_us_dedes/me.m07.d20:meMA.Ode3KathismaT.incipit
ltx/en_us_dedes/me.m07.d26:meMA.Ode3KathismaT.melody	@ltx/en_us_dedes/he.a.m8:heAU.TinSofianKaiLogon.name
ltx/en_us_dedes/me.m07.d26:meMA.Ode3KathismaT.mode	@ltx/en_us_dedes/miscellanea:misc.Mode8
ltx/en_us_dedes/me.m07.d26:meMA.Ode3KathismaT.text	@ltx/en_us_dedes/me.m07.d20:meMA.Ode3KathismaT.text
ltx/en_us_dedes/me.m07.d26:meMA.Ode4C11.greekmelody	@ltx/en_us_dedes/he.h.m8:heHE.EisakikoaKyrie.greekname
ltx/en_us_dedes/me.m07.d26:meMA.Ode4C11.incipit	…
ltx/en_us_dedes/me.m07.d26:meMA.Ode4C11.melody	@ltx/en_us_dedes/he.h.m8:heHE.EisakikoaKyrie.name
ltx/en_us_dedes/me.m07.d26:meMA.Ode4C11.mode	@ltx/en_us_dedes/miscellanea:misc.Mode8
ltx/en_us_dedes/me.m07.d26:meMA.Ode4C11.ode	@ltx/en_us_dedes/miscellanea:misc.Ode4
ltx/en_us_dedes/me.m07.d26:meMA.Ode4C11.text	
ltx/en_us_dedes/me.m07.d26:meMA.Ode4C12.incipit	…
ltx/en_us_dedes/me.m07.d26:meMA.Ode4C12.melody	@ltx/en_us_dedes/he.h.m8:heHE.EisakikoaKyrie.name
ltx/en_us_dedes/me.m07.d26:meMA.Ode4C12.mode	@ltx/en_us_dedes/miscellanea:misc.Mode8
ltx/en_us_dedes/me.m07.d26:meMA.Ode4C12.ode	@ltx/en_us_dedes/miscellanea:misc.Ode4
ltx/en_us_dedes/me.m07.d26:meMA.Ode4C12.text	
ltx/en_us_dedes/me.m07.d26:meMA.Ode4C13.incipit	…
ltx/en_us_dedes/me.m07.d26:meMA.Ode4C13.melody	@ltx/en_us_dedes/he.h.m8:heHE.EisakikoaKyrie.name
ltx/en_us_dedes/me.m07.d26:meMA.Ode4C13.mode	@ltx/en_us_dedes/miscellanea:misc.Mode8
ltx/en_us_dedes/me.m07.d26:meMA.Ode4C13.ode	@ltx/en_us_dedes/miscellanea:misc.Ode4
ltx/en_us_dedes/me.m07.d26:meMA.Ode4C13.text	
ltx/en_us_dedes/me.m07.d26:meMA.Ode4C1T.incipit	…
ltx/en_us_dedes/me.m07.d26:meMA.Ode4C1T.melody	@ltx/en_us_dedes/he.h.m8:heHE.EisakikoaKyrie.name
ltx/en_us_dedes/me.m07.d26:meMA.Ode4C1T.mode	@ltx/en_us_dedes/miscellanea:misc.Mode8
ltx/en_us_dedes/me.m07.d26:meMA.Ode4C1T.ode	@ltx/en_us_dedes/miscellanea:misc.Ode4
ltx/en_us_dedes/me.m07.d26:meMA.Ode4C1T.text	
ltx/en_us_dedes/me.m07.d26:meMA.Ode4C21.greekmelody	@ltx/en_us_dedes/he.h.m4:heHE.EparthentaSeIdousa.greekname
ltx/en_us_dedes/me.m07.d26:meMA.Ode4C21.incipit	O glorious Paraskeve, you have…
ltx/en_us_dedes/me.m07.d26:meMA.Ode4C21.melody	@ltx/en_us_dedes/he.h.m4:heHE.EparthentaSeIdousa.notmetered
ltx/en_us_dedes/me.m07.d26:meMA.Ode4C21.mode	@ltx/en_us_dedes/miscellanea:misc.Mode4
ltx/en_us_dedes/me.m07.d26:meMA.Ode4C21.ode	@ltx/en_us_dedes/miscellanea:misc.Ode4
ltx/en_us_dedes/me.m07.d26:meMA.Ode4C21.text	O glorious Paraskeve, you have the divine gifts of healing and restoring vision; thus you daily well up divine graces for those who honor you in faith and who come to your temple.
ltx/en_us_dedes/me.m07.d26:meMA.Ode4C22.incipit	Having neither wrinkle nor any…
ltx/en_us_dedes/me.m07.d26:meMA.Ode4C22.melody	@ltx/en_us_dedes/he.h.m4:heHE.EparthentaSeIdousa.notmetered
ltx/en_us_dedes/me.m07.d26:meMA.Ode4C22.mode	@ltx/en_us_dedes/miscellanea:misc.Mode4
ltx/en_us_dedes/me.m07.d26:meMA.Ode4C22.ode	@ltx/en_us_dedes/miscellanea:misc.Ode4
ltx/en_us_dedes/me.m07.d26:meMA.Ode4C22.text	Having neither wrinkle nor any spot at all, and possessing holiness of body, you saw Angels, with whom you cried: Glory to Your strength, O Lord.
ltx/en_us_dedes/me.m07.d26:meMA.Ode4C23.incipit	What an astonishing sign of…
ltx/en_us_dedes/me.m07.d26:meMA.Ode4C23.melody	@ltx/en_us_dedes/he.h.m4:heHE.EparthentaSeIdousa.notmetered
ltx/en_us_dedes/me.m07.d26:meMA.Ode4C23.mode	@ltx/en_us_dedes/miscellanea:misc.Mode4
ltx/en_us_dedes/me.m07.d26:meMA.Ode4C23.ode	@ltx/en_us_dedes/miscellanea:misc.Ode4
ltx/en_us_dedes/me.m07.d26:meMA.Ode4C23.text	What an astonishing sign of that awe-inspiring day! While portraying the saving Passion in a female body, you beheld the Cross, the Reed, the Crown, and the Sponge.
ltx/en_us_dedes/me.m07.d26:meMA.Ode4C2T.incipit	O Virgin, you conceived without…
ltx/en_us_dedes/me.m07.d26:meMA.Ode4C2T.melody	@ltx/en_us_dedes/he.h.m4:heHE.EparthentaSeIdousa.notmetered
ltx/en_us_dedes/me.m07.d26:meMA.Ode4C2T.mode	@ltx/en_us_dedes/miscellanea:misc.Mode4
ltx/en_us_dedes/me.m07.d26:meMA.Ode4C2T.ode	@ltx/en_us_dedes/miscellanea:misc.Ode4
ltx/en_us_dedes/me.m07.d26:meMA.Ode4C2T.text	O Virgin, you conceived without intercourse, and after childbirth you were still a virgin; therefore, O Lady, with undoubting faith we cry out, Rejoice, to you with never-silent voices.
ltx/en_us_dedes/me.m07.d26:meMA.Ode5C11.greekmelody	@ltx/en_us_dedes/he.h.m8:heHE.OEkNyktosAgnoias.greekname
ltx/en_us_dedes/me.m07.d26:meMA.Ode5C11.incipit	…
ltx/en_us_dedes/me.m07.d26:meMA.Ode5C11.melody	@ltx/en_us_dedes/he.h.m8:heHE.OEkNyktosAgnoias.name
ltx/en_us_dedes/me.m07.d26:meMA.Ode5C11.mode	@ltx/en_us_dedes/miscellanea:misc.Mode8
ltx/en_us_dedes/me.m07.d26:meMA.Ode5C11.ode	@ltx/en_us_dedes/miscellanea:misc.Ode5
ltx/en_us_dedes/me.m07.d26:meMA.Ode5C11.text	
ltx/en_us_dedes/me.m07.d26:meMA.Ode5C12.incipit	…
ltx/en_us_dedes/me.m07.d26:meMA.Ode5C12.melody	@ltx/en_us_dedes/he.h.m8:heHE.OEkNyktosAgnoias.name
ltx/en_us_dedes/me.m07.d26:meMA.Ode5C12.mode	@ltx/en_us_dedes/miscellanea:misc.Mode8
ltx/en_us_dedes/me.m07.d26:meMA.Ode5C12.ode	@ltx/en_us_dedes/miscellanea:misc.Ode5
ltx/en_us_dedes/me.m07.d26:meMA.Ode5C12.text	
ltx/en_us_dedes/me.m07.d26:meMA.Ode5C13.incipit	…
ltx/en_us_dedes/me.m07.d26:meMA.Ode5C13.melody	@ltx/en_us_dedes/he.h.m8:heHE.OEkNyktosAgnoias.name
ltx/en_us_dedes/me.m07.d26:meMA.Ode5C13.mode	@ltx/en_us_dedes/miscellanea:misc.Mode8
ltx/en_us_dedes/me.m07.d26:meMA.Ode5C13.ode	@ltx/en_us_dedes/miscellanea:misc.Ode5
ltx/en_us_dedes/me.m07.d26:meMA.Ode5C13.text	
ltx/en_us_dedes/me.m07.d26:meMA.Ode5C1T.incipit	…
ltx/en_us_dedes/me.m07.d26:meMA.Ode5C1T.melody	@ltx/en_us_dedes/he.h.m8:heHE.OEkNyktosAgnoias.name
ltx/en_us_dedes/me.m07.d26:meMA.Ode5C1T.mode	@ltx/en_us_dedes/miscellanea:misc.Mode8
ltx/en_us_dedes/me.m07.d26:meMA.Ode5C1T.ode	@ltx/en_us_dedes/miscellanea:misc.Ode5
ltx/en_us_dedes/me.m07.d26:meMA.Ode5C1T.text	
ltx/en_us_dedes/me.m07.d26:meMA.Ode5C21.greekmelody	@ltx/en_us_dedes/he.h.m4:heHE.SyKyrieMouFos.greekname
ltx/en_us_dedes/me.m07.d26:meMA.Ode5C21.incipit	O august Paraskeve, you competed…
ltx/en_us_dedes/me.m07.d26:meMA.Ode5C21.melody	@ltx/en_us_dedes/he.h.m4:heHE.SyKyrieMouFos.notmetered
ltx/en_us_dedes/me.m07.d26:meMA.Ode5C21.mode	@ltx/en_us_dedes/miscellanea:misc.Mode4
ltx/en_us_dedes/me.m07.d26:meMA.Ode5C21.ode	@ltx/en_us_dedes/miscellanea:misc.Ode5
ltx/en_us_dedes/me.m07.d26:meMA.Ode5C21.text	O august Paraskeve, you competed and you slew the tyrant with your all-wise sayings, intelligently proclaiming Christ before the tribunal.
ltx/en_us_dedes/me.m07.d26:meMA.Ode5C22.incipit	Your mind was set and…
ltx/en_us_dedes/me.m07.d26:meMA.Ode5C22.melody	@ltx/en_us_dedes/he.h.m4:heHE.SyKyrieMouFos.notmetered
ltx/en_us_dedes/me.m07.d26:meMA.Ode5C22.mode	@ltx/en_us_dedes/miscellanea:misc.Mode4
ltx/en_us_dedes/me.m07.d26:meMA.Ode5C22.ode	@ltx/en_us_dedes/miscellanea:misc.Ode5
ltx/en_us_dedes/me.m07.d26:meMA.Ode5C22.text	Your mind was set and your thoughts were steadfast, and you have put to shame all the religion of the idols using proofs from holy Scripture.
ltx/en_us_dedes/me.m07.d26:meMA.Ode5C23.incipit	You were counted worthy of…
ltx/en_us_dedes/me.m07.d26:meMA.Ode5C23.melody	@ltx/en_us_dedes/he.h.m4:heHE.SyKyrieMouFos.notmetered
ltx/en_us_dedes/me.m07.d26:meMA.Ode5C23.mode	@ltx/en_us_dedes/miscellanea:misc.Mode4
ltx/en_us_dedes/me.m07.d26:meMA.Ode5C23.ode	@ltx/en_us_dedes/miscellanea:misc.Ode5
ltx/en_us_dedes/me.m07.d26:meMA.Ode5C23.text	You were counted worthy of the spiritual bridal chamber and wedding hall; and filled with God, you danced for joy with the wise virgins, O renowned Paraskeve.
ltx/en_us_dedes/me.m07.d26:meMA.Ode5C2T.incipit	O Bride of God, we…
ltx/en_us_dedes/me.m07.d26:meMA.Ode5C2T.melody	@ltx/en_us_dedes/he.h.m4:heHE.SyKyrieMouFos.notmetered
ltx/en_us_dedes/me.m07.d26:meMA.Ode5C2T.mode	@ltx/en_us_dedes/miscellanea:misc.Mode4
ltx/en_us_dedes/me.m07.d26:meMA.Ode5C2T.ode	@ltx/en_us_dedes/miscellanea:misc.Ode5
ltx/en_us_dedes/me.m07.d26:meMA.Ode5C2T.text	O Bride of God, we have you as an unbreakable shield against enemies; we possess you as an anchor and hope of our salvation.
ltx/en_us_dedes/me.m07.d26:meMA.Ode6C11.greekmelody	@ltx/en_us_dedes/he.h.m8:heHE.TinDeisinEkcheo.greekname
ltx/en_us_dedes/me.m07.d26:meMA.Ode6C11.incipit	…
ltx/en_us_dedes/me.m07.d26:meMA.Ode6C11.melody	@ltx/en_us_dedes/he.h.m8:heHE.TinDeisinEkcheo.name
ltx/en_us_dedes/me.m07.d26:meMA.Ode6C11.mode	@ltx/en_us_dedes/miscellanea:misc.Mode8
ltx/en_us_dedes/me.m07.d26:meMA.Ode6C11.ode	@ltx/en_us_dedes/miscellanea:misc.Ode6
ltx/en_us_dedes/me.m07.d26:meMA.Ode6C11.text	
ltx/en_us_dedes/me.m07.d26:meMA.Ode6C12.incipit	…
ltx/en_us_dedes/me.m07.d26:meMA.Ode6C12.melody	@ltx/en_us_dedes/he.h.m8:heHE.TinDeisinEkcheo.name
ltx/en_us_dedes/me.m07.d26:meMA.Ode6C12.mode	@ltx/en_us_dedes/miscellanea:misc.Mode8
ltx/en_us_dedes/me.m07.d26:meMA.Ode6C12.ode	@ltx/en_us_dedes/miscellanea:misc.Ode6
ltx/en_us_dedes/me.m07.d26:meMA.Ode6C12.text	
ltx/en_us_dedes/me.m07.d26:meMA.Ode6C13.incipit	…
ltx/en_us_dedes/me.m07.d26:meMA.Ode6C13.melody	@ltx/en_us_dedes/he.h.m8:heHE.TinDeisinEkcheo.name
ltx/en_us_dedes/me.m07.d26:meMA.Ode6C13.mode	@ltx/en_us_dedes/miscellanea:misc.Mode8
ltx/en_us_dedes/me.m07.d26:meMA.Ode6C13.ode	@ltx/en_us_dedes/miscellanea:misc.Ode6
ltx/en_us_dedes/me.m07.d26:meMA.Ode6C13.text	
ltx/en_us_dedes/me.m07.d26:meMA.Ode6C1T.incipit	…
ltx/en_us_dedes/me.m07.d26:meMA.Ode6C1T.melody	@ltx/en_us_dedes/he.h.m8:heHE.TinDeisinEkcheo.name
ltx/en_us_dedes/me.m07.d26:meMA.Ode6C1T.mode	@ltx/en_us_dedes/miscellanea:misc.Mode8
ltx/en_us_dedes/me.m07.d26:meMA.Ode6C1T.ode	@ltx/en_us_dedes/miscellanea:misc.Ode6
ltx/en_us_dedes/me.m07.d26:meMA.Ode6C1T.text	
ltx/en_us_dedes/me.m07.d26:meMA.Ode6C21.greekmelody	@ltx/en_us_dedes/he.h.m4:heHE.ThysoSoiMetaFonis.greekname
ltx/en_us_dedes/me.m07.d26:meMA.Ode6C21.incipit	By the coming of an…
ltx/en_us_dedes/me.m07.d26:meMA.Ode6C21.melody	@ltx/en_us_dedes/he.h.m4:heHE.ThysoSoiMetaFonis.notmetered
ltx/en_us_dedes/me.m07.d26:meMA.Ode6C21.mode	@ltx/en_us_dedes/miscellanea:misc.Mode4
ltx/en_us_dedes/me.m07.d26:meMA.Ode6C21.ode	@ltx/en_us_dedes/miscellanea:misc.Ode6
ltx/en_us_dedes/me.m07.d26:meMA.Ode6C21.text	By the coming of an Angel, the Master, with one divine stroke, swiftly removed the great stone that was set on your breast and the nails piercing your hands, O all-venerable Paraskeve, glorious Martyr.
ltx/en_us_dedes/me.m07.d26:meMA.Ode6C22.incipit	You were like another Protomartyr…
ltx/en_us_dedes/me.m07.d26:meMA.Ode6C22.melody	@ltx/en_us_dedes/he.h.m4:heHE.ThysoSoiMetaFonis.notmetered
ltx/en_us_dedes/me.m07.d26:meMA.Ode6C22.mode	@ltx/en_us_dedes/miscellanea:misc.Mode4
ltx/en_us_dedes/me.m07.d26:meMA.Ode6C22.ode	@ltx/en_us_dedes/miscellanea:misc.Ode6
ltx/en_us_dedes/me.m07.d26:meMA.Ode6C22.text	You were like another Protomartyr Thecla, preaching to all, and enlightening many with the divine doctrine, and bringing unbelievers to the godly Faith. And for this we glorify you.
ltx/en_us_dedes/me.m07.d26:meMA.Ode6C23.incipit	The words of your divine…
ltx/en_us_dedes/me.m07.d26:meMA.Ode6C23.melody	@ltx/en_us_dedes/he.h.m4:heHE.ThysoSoiMetaFonis.notmetered
ltx/en_us_dedes/me.m07.d26:meMA.Ode6C23.mode	@ltx/en_us_dedes/miscellanea:misc.Mode4
ltx/en_us_dedes/me.m07.d26:meMA.Ode6C23.ode	@ltx/en_us_dedes/miscellanea:misc.Ode6
ltx/en_us_dedes/me.m07.d26:meMA.Ode6C23.text	The words of your divine doctrines flowed from your lips, dripping with sweetness, and with boldness you taught knowledge of all things, O Paraskeve, adornment of Martyrs.
ltx/en_us_dedes/me.m07.d26:meMA.Ode6C2T.incipit	Miracle, more novel than all…
ltx/en_us_dedes/me.m07.d26:meMA.Ode6C2T.melody	@ltx/en_us_dedes/he.h.m4:heHE.ThysoSoiMetaFonis.notmetered
ltx/en_us_dedes/me.m07.d26:meMA.Ode6C2T.mode	@ltx/en_us_dedes/miscellanea:misc.Mode4
ltx/en_us_dedes/me.m07.d26:meMA.Ode6C2T.ode	@ltx/en_us_dedes/miscellanea:misc.Ode6
ltx/en_us_dedes/me.m07.d26:meMA.Ode6C2T.text	Miracle, more novel than all other miracles! that a Virgin, without knowing a man, in her womb conceived the One who has the care of the whole universe, and yet she did not constrain Him in any way.
ltx/en_us_dedes/me.m07.d26:meMA.Ode6H.greekmelody	@ltx/en_us_dedes/he.h.m4:heHE.ThysoSoiMetaFonis.greekname
ltx/en_us_dedes/me.m07.d26:meMA.Ode6H.incipit	@ltx/en_us_dedes/he.h.m4:heHE.ThysoSoiMetaFonis.incipit
ltx/en_us_dedes/me.m07.d26:meMA.Ode6H.melody	@ltx/en_us_dedes/he.h.m4:heHE.ThysoSoiMetaFonis.melody
ltx/en_us_dedes/me.m07.d26:meMA.Ode6H.mode	@ltx/en_us_dedes/miscellanea:misc.Mode4
ltx/en_us_dedes/me.m07.d26:meMA.Ode6H.ode	@ltx/en_us_dedes/miscellanea:misc.Ode6
ltx/en_us_dedes/me.m07.d26:meMA.Ode6H.text	@ltx/en_us_dedes/he.h.m4:heHE.ThysoSoiMetaFonis.text
ltx/en_us_dedes/me.m07.d26:meMA.Ode7C11.greekmelody	@ltx/en_us_dedes/he.h.m8:heHE.OiEkTisIoudaias.greekname
ltx/en_us_dedes/me.m07.d26:meMA.Ode7C11.incipit	…
ltx/en_us_dedes/me.m07.d26:meMA.Ode7C11.melody	@ltx/en_us_dedes/he.h.m8:heHE.OiEkTisIoudaias.name
ltx/en_us_dedes/me.m07.d26:meMA.Ode7C11.mode	@ltx/en_us_dedes/miscellanea:misc.Mode8
ltx/en_us_dedes/me.m07.d26:meMA.Ode7C11.ode	@ltx/en_us_dedes/miscellanea:misc.Ode7
ltx/en_us_dedes/me.m07.d26:meMA.Ode7C11.text	
ltx/en_us_dedes/me.m07.d26:meMA.Ode7C12.incipit	…
ltx/en_us_dedes/me.m07.d26:meMA.Ode7C12.melody	@ltx/en_us_dedes/he.h.m8:heHE.OiEkTisIoudaias.name
ltx/en_us_dedes/me.m07.d26:meMA.Ode7C12.mode	@ltx/en_us_dedes/miscellanea:misc.Mode8
ltx/en_us_dedes/me.m07.d26:meMA.Ode7C12.ode	@ltx/en_us_dedes/miscellanea:misc.Ode7
ltx/en_us_dedes/me.m07.d26:meMA.Ode7C12.text	
ltx/en_us_dedes/me.m07.d26:meMA.Ode7C13.incipit	…
ltx/en_us_dedes/me.m07.d26:meMA.Ode7C13.melody	@ltx/en_us_dedes/he.h.m8:heHE.OiEkTisIoudaias.name
ltx/en_us_dedes/me.m07.d26:meMA.Ode7C13.mode	@ltx/en_us_dedes/miscellanea:misc.Mode8
ltx/en_us_dedes/me.m07.d26:meMA.Ode7C13.ode	@ltx/en_us_dedes/miscellanea:misc.Ode7
ltx/en_us_dedes/me.m07.d26:meMA.Ode7C13.text	
ltx/en_us_dedes/me.m07.d26:meMA.Ode7C14.incipit	…
ltx/en_us_dedes/me.m07.d26:meMA.Ode7C14.melody	@ltx/en_us_dedes/he.h.m8:heHE.OiEkTisIoudaias.name
ltx/en_us_dedes/me.m07.d26:meMA.Ode7C14.mode	@ltx/en_us_dedes/miscellanea:misc.Mode8
ltx/en_us_dedes/me.m07.d26:meMA.Ode7C14.ode	@ltx/en_us_dedes/miscellanea:misc.Ode7
ltx/en_us_dedes/me.m07.d26:meMA.Ode7C14.text	
ltx/en_us_dedes/me.m07.d26:meMA.Ode7C1T.incipit	…
ltx/en_us_dedes/me.m07.d26:meMA.Ode7C1T.melody	@ltx/en_us_dedes/he.h.m8:heHE.OiEkTisIoudaias.name
ltx/en_us_dedes/me.m07.d26:meMA.Ode7C1T.mode	@ltx/en_us_dedes/miscellanea:misc.Mode8
ltx/en_us_dedes/me.m07.d26:meMA.Ode7C1T.ode	@ltx/en_us_dedes/miscellanea:misc.Ode7
ltx/en_us_dedes/me.m07.d26:meMA.Ode7C1T.text	
ltx/en_us_dedes/me.m07.d26:meMA.Ode7C21.greekmelody	@ltx/en_us_dedes/he.h.m4:heHE.EnTiKaminoAvramiaioi.greekname
ltx/en_us_dedes/me.m07.d26:meMA.Ode7C21.incipit	The Lord protected you before…
ltx/en_us_dedes/me.m07.d26:meMA.Ode7C21.melody	@ltx/en_us_dedes/he.h.m4:heHE.EnTiKaminoAvramiaioi.notmetered
ltx/en_us_dedes/me.m07.d26:meMA.Ode7C21.mode	@ltx/en_us_dedes/miscellanea:misc.Mode4
ltx/en_us_dedes/me.m07.d26:meMA.Ode7C21.ode	@ltx/en_us_dedes/miscellanea:misc.Ode7
ltx/en_us_dedes/me.m07.d26:meMA.Ode7C21.text	The Lord protected you before the tribunal of the ungodly, O Martyr Paraskeve, and thus you patiently endured the burning of your armpits and sang: Blessed are You, O my God and Lord.
ltx/en_us_dedes/me.m07.d26:meMA.Ode7C22.incipit	The fire burned the lawless…
ltx/en_us_dedes/me.m07.d26:meMA.Ode7C22.melody	@ltx/en_us_dedes/he.h.m4:heHE.EnTiKaminoAvramiaioi.notmetered
ltx/en_us_dedes/me.m07.d26:meMA.Ode7C22.mode	@ltx/en_us_dedes/miscellanea:misc.Mode4
ltx/en_us_dedes/me.m07.d26:meMA.Ode7C22.ode	@ltx/en_us_dedes/miscellanea:misc.Ode7
ltx/en_us_dedes/me.m07.d26:meMA.Ode7C22.text	The fire burned the lawless but did not scorch you at all, O maiden, for Christ preserved you unharmed, as when of old with mighty hand He preserved the Young Men unafraid in the raging furnace fire.
ltx/en_us_dedes/me.m07.d26:meMA.Ode7C23.incipit	O Martyr, you shouted, “Since…
ltx/en_us_dedes/me.m07.d26:meMA.Ode7C23.melody	@ltx/en_us_dedes/he.h.m4:heHE.EnTiKaminoAvramiaioi.notmetered
ltx/en_us_dedes/me.m07.d26:meMA.Ode7C23.mode	@ltx/en_us_dedes/miscellanea:misc.Mode4
ltx/en_us_dedes/me.m07.d26:meMA.Ode7C23.ode	@ltx/en_us_dedes/miscellanea:misc.Ode7
ltx/en_us_dedes/me.m07.d26:meMA.Ode7C23.text	O Martyr, you shouted, “Since the demonic idols and gods clearly did not make either the land or the sky, let them perish!” And you proclaimed that Christ the Lord is the Fashioner of all things.
ltx/en_us_dedes/me.m07.d26:meMA.Ode7C2T.incipit	@ltx/en_us_dedes/oc.m4.d1:ocMA.OdeS7C1T.incipit
ltx/en_us_dedes/me.m07.d26:meMA.Ode7C2T.melody	@ltx/en_us_dedes/he.h.m4:heHE.EnTiKaminoAvramiaioi.notmetered
ltx/en_us_dedes/me.m07.d26:meMA.Ode7C2T.mode	@ltx/en_us_dedes/miscellanea:misc.Mode4
ltx/en_us_dedes/me.m07.d26:meMA.Ode7C2T.ode	@ltx/en_us_dedes/miscellanea:misc.Ode7
ltx/en_us_dedes/me.m07.d26:meMA.Ode7C2T.text	@ltx/en_us_dedes/oc.m4.d1:ocMA.OdeS7C1T.text
ltx/en_us_dedes/me.m07.d26:meMA.Ode8C11.greekmelody	@ltx/en_us_dedes/he.h.m8:heHE.EptaplasiosKaminon.greekname
ltx/en_us_dedes/me.m07.d26:meMA.Ode8C11.incipit	…
ltx/en_us_dedes/me.m07.d26:meMA.Ode8C11.melody	@ltx/en_us_dedes/he.h.m8:heHE.EptaplasiosKaminon.name
ltx/en_us_dedes/me.m07.d26:meMA.Ode8C11.mode	@ltx/en_us_dedes/miscellanea:misc.Mode8
ltx/en_us_dedes/me.m07.d26:meMA.Ode8C11.ode	@ltx/en_us_dedes/miscellanea:misc.Ode8
ltx/en_us_dedes/me.m07.d26:meMA.Ode8C11.text	
ltx/en_us_dedes/me.m07.d26:meMA.Ode8C12.incipit	…
ltx/en_us_dedes/me.m07.d26:meMA.Ode8C12.melody	@ltx/en_us_dedes/he.h.m8:heHE.EptaplasiosKaminon.name
ltx/en_us_dedes/me.m07.d26:meMA.Ode8C12.mode	@ltx/en_us_dedes/miscellanea:misc.Mode8
ltx/en_us_dedes/me.m07.d26:meMA.Ode8C12.ode	@ltx/en_us_dedes/miscellanea:misc.Ode8
ltx/en_us_dedes/me.m07.d26:meMA.Ode8C12.text	
ltx/en_us_dedes/me.m07.d26:meMA.Ode8C13.incipit	…
ltx/en_us_dedes/me.m07.d26:meMA.Ode8C13.melody	@ltx/en_us_dedes/he.h.m8:heHE.EptaplasiosKaminon.name
ltx/en_us_dedes/me.m07.d26:meMA.Ode8C13.mode	@ltx/en_us_dedes/miscellanea:misc.Mode8
ltx/en_us_dedes/me.m07.d26:meMA.Ode8C13.ode	@ltx/en_us_dedes/miscellanea:misc.Ode8
ltx/en_us_dedes/me.m07.d26:meMA.Ode8C13.text	
ltx/en_us_dedes/me.m07.d26:meMA.Ode8C14.incipit	…
ltx/en_us_dedes/me.m07.d26:meMA.Ode8C14.melody	@ltx/en_us_dedes/he.h.m8:heHE.EptaplasiosKaminon.name
ltx/en_us_dedes/me.m07.d26:meMA.Ode8C14.mode	@ltx/en_us_dedes/miscellanea:misc.Mode8
ltx/en_us_dedes/me.m07.d26:meMA.Ode8C14.ode	@ltx/en_us_dedes/miscellanea:misc.Ode8
ltx/en_us_dedes/me.m07.d26:meMA.Ode8C14.text	
ltx/en_us_dedes/me.m07.d26:meMA.Ode8C1T.incipit	…
ltx/en_us_dedes/me.m07.d26:meMA.Ode8C1T.melody	@ltx/en_us_dedes/he.h.m8:heHE.EptaplasiosKaminon.name
ltx/en_us_dedes/me.m07.d26:meMA.Ode8C1T.mode	@ltx/en_us_dedes/miscellanea:misc.Mode8
ltx/en_us_dedes/me.m07.d26:meMA.Ode8C1T.ode	@ltx/en_us_dedes/miscellanea:misc.Ode8
ltx/en_us_dedes/me.m07.d26:meMA.Ode8C1T.text	
ltx/en_us_dedes/me.m07.d26:meMA.Ode8C21.greekmelody	@ltx/en_us_dedes/he.h.m4:heHE.CheirasEkpetasasDaniil.greekname
ltx/en_us_dedes/me.m07.d26:meMA.Ode8C21.incipit	Martyr, you proved that idols…
ltx/en_us_dedes/me.m07.d26:meMA.Ode8C21.melody	@ltx/en_us_dedes/he.h.m4:heHE.CheirasEkpetasasDaniil.notmetered
ltx/en_us_dedes/me.m07.d26:meMA.Ode8C21.mode	@ltx/en_us_dedes/miscellanea:misc.Mode4
ltx/en_us_dedes/me.m07.d26:meMA.Ode8C21.ode	@ltx/en_us_dedes/miscellanea:misc.Ode8
ltx/en_us_dedes/me.m07.d26:meMA.Ode8C21.text	Martyr, you proved that idols are not gods but the deceptive apparitions of demons, and you completely dashed them to the ground and utterly ground them to dust, unceasingly singing with joy to Christ: Bless the Lord, all you works of the Lord.
ltx/en_us_dedes/me.m07.d26:meMA.Ode8C22.incipit	When his temple quaked on…
ltx/en_us_dedes/me.m07.d26:meMA.Ode8C22.melody	@ltx/en_us_dedes/he.h.m4:heHE.CheirasEkpetasasDaniil.notmetered
ltx/en_us_dedes/me.m07.d26:meMA.Ode8C22.mode	@ltx/en_us_dedes/miscellanea:misc.Mode4
ltx/en_us_dedes/me.m07.d26:meMA.Ode8C22.ode	@ltx/en_us_dedes/miscellanea:misc.Ode8
ltx/en_us_dedes/me.m07.d26:meMA.Ode8C22.text	When his temple quaked on the ground at your arrival, Apollo fell and the idols were destroyed by the power of the immaculate Cross. Being mystically protected by the Cross, you sang with great confidence: Bless the Lord, all you works of the Lord.
ltx/en_us_dedes/me.m07.d26:meMA.Ode8C23.incipit	The pure Paraskeve, was smitten…
ltx/en_us_dedes/me.m07.d26:meMA.Ode8C23.melody	@ltx/en_us_dedes/he.h.m4:heHE.CheirasEkpetasasDaniil.notmetered
ltx/en_us_dedes/me.m07.d26:meMA.Ode8C23.mode	@ltx/en_us_dedes/miscellanea:misc.Mode4
ltx/en_us_dedes/me.m07.d26:meMA.Ode8C23.ode	@ltx/en_us_dedes/miscellanea:misc.Ode8
ltx/en_us_dedes/me.m07.d26:meMA.Ode8C23.text	The pure Paraskeve, was smitten with Your handsomeness and with longing for You, O Christ; she endured the searing heat of fire as she cried: To the sweet scent of Your divine myrrh I run after You and rest not, striving patiently now in martyrdom, and blessing Your divine Name.
ltx/en_us_dedes/me.m07.d26:meMA.Ode8C2T.incipit	In all generations, only you…
ltx/en_us_dedes/me.m07.d26:meMA.Ode8C2T.melody	@ltx/en_us_dedes/he.h.m4:heHE.CheirasEkpetasasDaniil.notmetered
ltx/en_us_dedes/me.m07.d26:meMA.Ode8C2T.mode	@ltx/en_us_dedes/miscellanea:misc.Mode4
ltx/en_us_dedes/me.m07.d26:meMA.Ode8C2T.ode	@ltx/en_us_dedes/miscellanea:misc.Ode8
ltx/en_us_dedes/me.m07.d26:meMA.Ode8C2T.text	In all generations, only you were shown to be the Mother of God, O immaculate Virgin; you became the dwelling-place of the Godhead, without being seared by the fire of the unapproachable Light; therefore we all bless you, O Mary, all-blameless Bride of God.
ltx/en_us_dedes/me.m07.d26:meMA.Ode8H.greekmelody	@ltx/en_us_dedes/he.h.m4:heHE.CheirasEkpetasasDaniil.greekname
ltx/en_us_dedes/me.m07.d26:meMA.Ode8H.incipit	@ltx/en_us_dedes/he.h.m4:heHE.CheirasEkpetasasDaniil.incipit
ltx/en_us_dedes/me.m07.d26:meMA.Ode8H.melody	@ltx/en_us_dedes/he.h.m4:heHE.CheirasEkpetasasDaniil.melody
ltx/en_us_dedes/me.m07.d26:meMA.Ode8H.mode	@ltx/en_us_dedes/miscellanea:misc.Mode4
ltx/en_us_dedes/me.m07.d26:meMA.Ode8H.ode	@ltx/en_us_dedes/miscellanea:misc.Ode8
ltx/en_us_dedes/me.m07.d26:meMA.Ode8H.text	@ltx/en_us_dedes/he.h.m4:heHE.CheirasEkpetasasDaniil.text
ltx/en_us_dedes/me.m07.d26:meMA.Ode9C11.greekmelody	@ltx/en_us_dedes/he.h.m8:heHE.EfrixePasaAkoi.greekname
ltx/en_us_dedes/me.m07.d26:meMA.Ode9C11.incipit	…
ltx/en_us_dedes/me.m07.d26:meMA.Ode9C11.melody	@ltx/en_us_dedes/he.h.m8:heHE.EfrixePasaAkoi.name
ltx/en_us_dedes/me.m07.d26:meMA.Ode9C11.mode	@ltx/en_us_dedes/miscellanea:misc.Mode8
ltx/en_us_dedes/me.m07.d26:meMA.Ode9C11.ode	@ltx/en_us_dedes/miscellanea:misc.Ode9
ltx/en_us_dedes/me.m07.d26:meMA.Ode9C11.text	
ltx/en_us_dedes/me.m07.d26:meMA.Ode9C12.incipit	…
ltx/en_us_dedes/me.m07.d26:meMA.Ode9C12.melody	@ltx/en_us_dedes/he.h.m8:heHE.EfrixePasaAkoi.name
ltx/en_us_dedes/me.m07.d26:meMA.Ode9C12.mode	@ltx/en_us_dedes/miscellanea:misc.Mode8
ltx/en_us_dedes/me.m07.d26:meMA.Ode9C12.ode	@ltx/en_us_dedes/miscellanea:misc.Ode9
ltx/en_us_dedes/me.m07.d26:meMA.Ode9C12.text	
ltx/en_us_dedes/me.m07.d26:meMA.Ode9C13.incipit	…
ltx/en_us_dedes/me.m07.d26:meMA.Ode9C13.melody	@ltx/en_us_dedes/he.h.m8:heHE.EfrixePasaAkoi.name
ltx/en_us_dedes/me.m07.d26:meMA.Ode9C13.mode	@ltx/en_us_dedes/miscellanea:misc.Mode8
ltx/en_us_dedes/me.m07.d26:meMA.Ode9C13.ode	@ltx/en_us_dedes/miscellanea:misc.Ode9
ltx/en_us_dedes/me.m07.d26:meMA.Ode9C13.text	
ltx/en_us_dedes/me.m07.d26:meMA.Ode9C14.incipit	…
ltx/en_us_dedes/me.m07.d26:meMA.Ode9C14.melody	@ltx/en_us_dedes/he.h.m8:heHE.EfrixePasaAkoi.name
ltx/en_us_dedes/me.m07.d26:meMA.Ode9C14.mode	@ltx/en_us_dedes/miscellanea:misc.Mode8
ltx/en_us_dedes/me.m07.d26:meMA.Ode9C14.ode	@ltx/en_us_dedes/miscellanea:misc.Ode9
ltx/en_us_dedes/me.m07.d26:meMA.Ode9C14.text	
ltx/en_us_dedes/me.m07.d26:meMA.Ode9C1T.incipit	…
ltx/en_us_dedes/me.m07.d26:meMA.Ode9C1T.melody	@ltx/en_us_dedes/he.h.m8:heHE.EfrixePasaAkoi.name
ltx/en_us_dedes/me.m07.d26:meMA.Ode9C1T.mode	@ltx/en_us_dedes/miscellanea:misc.Mode8
ltx/en_us_dedes/me.m07.d26:meMA.Ode9C1T.ode	@ltx/en_us_dedes/miscellanea:misc.Ode9
ltx/en_us_dedes/me.m07.d26:meMA.Ode9C1T.text	
ltx/en_us_dedes/me.m07.d26:meMA.Ode9C21.greekmelody	@ltx/en_us_dedes/he.h.m4:heHE.LithosAcheirotmitos.greekname
ltx/en_us_dedes/me.m07.d26:meMA.Ode9C21.incipit	You exchanged this mutable and…
ltx/en_us_dedes/me.m07.d26:meMA.Ode9C21.melody	@ltx/en_us_dedes/he.h.m4:heHE.LithosAcheirotmitos.notmetered
ltx/en_us_dedes/me.m07.d26:meMA.Ode9C21.mode	@ltx/en_us_dedes/miscellanea:misc.Mode4
ltx/en_us_dedes/me.m07.d26:meMA.Ode9C21.ode	@ltx/en_us_dedes/miscellanea:misc.Ode9
ltx/en_us_dedes/me.m07.d26:meMA.Ode9C21.text	You exchanged this mutable and temporal life for that which is to come, O Martyr, pressing forward to see clearly the inconceivable beauty of your Bridegroom; therefore, you have obtained immortal crowns, O beautiful virgin.
ltx/en_us_dedes/me.m07.d26:meMA.Ode9C22.incipit	You heard a voice from…
ltx/en_us_dedes/me.m07.d26:meMA.Ode9C22.melody	@ltx/en_us_dedes/he.h.m4:heHE.LithosAcheirotmitos.notmetered
ltx/en_us_dedes/me.m07.d26:meMA.Ode9C22.mode	@ltx/en_us_dedes/miscellanea:misc.Mode4
ltx/en_us_dedes/me.m07.d26:meMA.Ode9C22.ode	@ltx/en_us_dedes/miscellanea:misc.Ode9
ltx/en_us_dedes/me.m07.d26:meMA.Ode9C22.text	You heard a voice from heaven assuring you that your prayers to God had been heard, O modest Martyr Paraskeve, and you eagerly finished the race; and when your honorable head was cut off, you swiftly ascended to Him.
ltx/en_us_dedes/me.m07.d26:meMA.Ode9C23.incipit	O Paraskeve, we pray you…
ltx/en_us_dedes/me.m07.d26:meMA.Ode9C23.melody	@ltx/en_us_dedes/he.h.m4:heHE.LithosAcheirotmitos.notmetered
ltx/en_us_dedes/me.m07.d26:meMA.Ode9C23.mode	@ltx/en_us_dedes/miscellanea:misc.Mode4
ltx/en_us_dedes/me.m07.d26:meMA.Ode9C23.ode	@ltx/en_us_dedes/miscellanea:misc.Ode9
ltx/en_us_dedes/me.m07.d26:meMA.Ode9C23.text	O Paraskeve, we pray you to ask of Christ that victory over enemies, forgiveness of offenses, and deliverance from adversities be granted to all who come to your sacred temple with fervent faith.
ltx/en_us_dedes/me.m07.d26:meMA.Ode9C2T.incipit	We know you to be…
ltx/en_us_dedes/me.m07.d26:meMA.Ode9C2T.melody	@ltx/en_us_dedes/he.h.m4:heHE.LithosAcheirotmitos.notmetered
ltx/en_us_dedes/me.m07.d26:meMA.Ode9C2T.mode	@ltx/en_us_dedes/miscellanea:misc.Mode4
ltx/en_us_dedes/me.m07.d26:meMA.Ode9C2T.ode	@ltx/en_us_dedes/miscellanea:misc.Ode9
ltx/en_us_dedes/me.m07.d26:meMA.Ode9C2T.text	We know you to be higher than the Cherubim and more exalted than the heavens, O immaculate Virgin Mary, for you gave birth to the Angel of Great Counsel, who together with the Father is without beginning, and who is to come as the Judge of all.
ltx/en_us_dedes/me.m07.d26:meMA.Ode9H.greekmelody	@ltx/en_us_dedes/he.h.m4:heHE.LithosAcheirotmitos.greekname
ltx/en_us_dedes/me.m07.d26:meMA.Ode9H.incipit	@ltx/en_us_dedes/he.h.m4:heHE.LithosAcheirotmitos.incipit
ltx/en_us_dedes/me.m07.d26:meMA.Ode9H.melody	@ltx/en_us_dedes/he.h.m4:heHE.LithosAcheirotmitos.melody
ltx/en_us_dedes/me.m07.d26:meMA.Ode9H.mode	@ltx/en_us_dedes/miscellanea:misc.Mode4
ltx/en_us_dedes/me.m07.d26:meMA.Ode9H.ode	@ltx/en_us_dedes/miscellanea:misc.Ode9
ltx/en_us_dedes/me.m07.d26:meMA.Ode9H.text	@ltx/en_us_dedes/he.h.m4:heHE.LithosAcheirotmitos.text
ltx/en_us_dedes/me.m07.d26:meMA.Oikos1.text	The voice of the Bridegroom called you as a bride, and gave you an incorruptible crown, O godly-minded and all-glorious Paraskeve; and He enrolled you, as one worthy, together with the august martyrs and prize-winners. As you rejoice with them, remember us who observe your holy feast and who assemble in your church. For as we stand in it now, we soulfully offer up hymns to you, devout Martyr Paraskeve extolled by all.
ltx/en_us_dedes/me.m07.d26:meVE.Apolytikion1ger.greekmelody	@ltx/en_us_dedes/he.a.m3:heAU.TinOraiotita.greekname
ltx/en_us_dedes/me.m07.d26:meVE.Apolytikion1ger.incipit	…
ltx/en_us_dedes/me.m07.d26:meVE.Apolytikion1ger.melody	@ltx/en_us_dedes/he.a.m3:heAU.TinOraiotita.name
ltx/en_us_dedes/me.m07.d26:meVE.Apolytikion1ger.mode	@ltx/en_us_dedes/miscellanea:misc.Mode3
ltx/en_us_dedes/me.m07.d26:meVE.Apolytikion1ger.poet	@ltx/en_us_dedes/poets:po.Gerasimou
ltx/en_us_dedes/me.m07.d26:meVE.Apolytikion1ger.text	
ltx/en_us_dedes/me.m07.d26:meVE.Apolytikion2.incipit	Your diligence corresponded to your…
ltx/en_us_dedes/me.m07.d26:meVE.Apolytikion2.melody	
ltx/en_us_dedes/me.m07.d26:meVE.Apolytikion2.mode	@ltx/en_us_dedes/miscellanea:misc.Mode1
ltx/en_us_dedes/me.m07.d26:meVE.Apolytikion2.text	Your diligence corresponded to your name, Paraskeve, which denotes preparedness. Through faith you inherited the promised dwelling that was prepared for you, O prize-winning Martyr. Therefore you pour out cures and healings, and you intercede on behalf of our souls.
ltx/en_us_dedes/me.m07.d26:meVE.AposGlory.incipit	Come all, from the ends…
ltx/en_us_dedes/me.m07.d26:meVE.AposGlory.melody	
ltx/en_us_dedes/me.m07.d26:meVE.AposGlory.mode	@ltx/en_us_dedes/miscellanea:misc.Mode6
ltx/en_us_dedes/me.m07.d26:meVE.AposGlory.text	Come all, from the ends of the earth, let us form a spiritual chorus, and let us extol the virgin martyr of Christ; and let us salute her and say: “Rejoice! O devout Paraskeve, you are honored by God! Rejoice! You accepted martyrdom with dignity. Rejoice! You stand with all the martyrs and dwell with all the devout ascetics. We beseech you, join them and pray for the salvation of our souls.”
ltx/en_us_dedes/me.m07.d26:meVE.AposTheotokion.incipit	@ltx/en_us_dedes/he.o:heOT.TheotokeSyEi.incipit
ltx/en_us_dedes/me.m07.d26:meVE.AposTheotokion.melody	@ltx/en_us_dedes/he.o:heOT.TheotokeSyEi.name
ltx/en_us_dedes/me.m07.d26:meVE.AposTheotokion.mode	@ltx/en_us_dedes/miscellanea:misc.Mode6
ltx/en_us_dedes/me.m07.d26:meVE.AposTheotokion.text	@ltx/en_us_dedes/he.o:heOT.TheotokeSyEiAthloforon.text
ltx/en_us_dedes/me.m07.d26:meVE.Aposticha1.greekmelody	@ltx/en_us_dedes/he.a.m4:heAU.OsGennaionEnMartysi.greekname
ltx/en_us_dedes/me.m07.d26:meVE.Aposticha1.incipit	O all-glorious martyr Saint, *…
ltx/en_us_dedes/me.m07.d26:meVE.Aposticha1.melody	@ltx/en_us_dedes/he.a.m4:heAU.OsGennaionEnMartysi.name
ltx/en_us_dedes/me.m07.d26:meVE.Aposticha1.mode	@ltx/en_us_dedes/miscellanea:misc.Mode4
ltx/en_us_dedes/me.m07.d26:meVE.Aposticha1.text	O all-glorious martyr Saint, * of your own will you manfully * underwent the various tortures for the Lord; * and in so doing you pulverized the idols of pagan Greeks. * By the power of the Cross, * you extinguished the enemy * who had boasted that * he would set his own throne above heavens. But instead the wretch was shattered, * crushed by your feet like a little bird.
ltx/en_us_dedes/me.m07.d26:meVE.Aposticha2.incipit	As you suffered beneath the…
ltx/en_us_dedes/me.m07.d26:meVE.Aposticha2.melody	@ltx/en_us_dedes/he.a.m4:heAU.OsGennaionEnMartysi.name
ltx/en_us_dedes/me.m07.d26:meVE.Aposticha2.mode	@ltx/en_us_dedes/miscellanea:misc.Mode4
ltx/en_us_dedes/me.m07.d26:meVE.Aposticha2.text	As you suffered beneath the weight * of the stone and the burning flame, * by the Master’s providence was an Angel sent. * At his appearance the heavy stone became light; the burning fire * turned into refreshing dew, * as it did for those Servants once * when the Fourth appeared. * And you cried out, “O tender-loving Lord, great is Your mercy. Now rejoicing * do I adore Your all-lauded name.”
ltx/en_us_dedes/me.m07.d26:meVE.Aposticha3.incipit	You continually possessed * total…
ltx/en_us_dedes/me.m07.d26:meVE.Aposticha3.melody	@ltx/en_us_dedes/he.a.m4:heAU.OsGennaionEnMartysi.name
ltx/en_us_dedes/me.m07.d26:meVE.Aposticha3.mode	@ltx/en_us_dedes/miscellanea:misc.Mode4
ltx/en_us_dedes/me.m07.d26:meVE.Aposticha3.text	You continually possessed * total bodily chastity * and a shining soul, making you above reproach. * In your desire for the Bridegroom Christ, * you followed Him in His tracks, * like sweet ointment and perfume. * Ever-lauded and decorous St. Paraskeve, * intercede with the Savior to forgive us our offenses as with faith now * we keep your annual memory.
ltx/en_us_dedes/me.m07.d26:meVE.SticGlory.incipit	O victorious virgin martyr, glorious…
ltx/en_us_dedes/me.m07.d26:meVE.SticGlory.melody	
ltx/en_us_dedes/me.m07.d26:meVE.SticGlory.mode	@ltx/en_us_dedes/miscellanea:misc.Mode6
ltx/en_us_dedes/me.m07.d26:meVE.SticGlory.text	O victorious virgin martyr, glorious Paraskeve, for us who hold a worthy celebration of your contest, pray and intercede with God, to deliver us from trials and tribulations, and from the looming crisis, O all-honored Martyr.
ltx/en_us_dedes/me.m07.d26:meVE.SticTheotokion.incipit	@ltx/en_us_dedes/oc.m6.d1:ocVE.SticTheotokion.incipit
ltx/en_us_dedes/me.m07.d26:meVE.SticTheotokion.melody	
ltx/en_us_dedes/me.m07.d26:meVE.SticTheotokion.mode	@ltx/en_us_dedes/miscellanea:misc.Mode6
ltx/en_us_dedes/me.m07.d26:meVE.SticTheotokion.text	@ltx/en_us_dedes/oc.m6.d1:ocVE.SticTheotokion.text
ltx/en_us_dedes/me.m07.d26:meVE.Stichera01.greekmelody	@ltx/en_us_dedes/he.a.m8:heAU.OTouParadoxou.greekname
ltx/en_us_dedes/me.m07.d26:meVE.Stichera01.incipit	…
ltx/en_us_dedes/me.m07.d26:meVE.Stichera01.melody	@ltx/en_us_dedes/he.a.m8:heAU.OTouParadoxou.name
ltx/en_us_dedes/me.m07.d26:meVE.Stichera01.mode	@ltx/en_us_dedes/miscellanea:misc.Mode8
ltx/en_us_dedes/me.m07.d26:meVE.Stichera01.text	
ltx/en_us_dedes/me.m07.d26:meVE.Stichera02.incipit	…
ltx/en_us_dedes/me.m07.d26:meVE.Stichera02.melody	@ltx/en_us_dedes/he.a.m8:heAU.OTouParadoxou.name
ltx/en_us_dedes/me.m07.d26:meVE.Stichera02.mode	@ltx/en_us_dedes/miscellanea:misc.Mode8
ltx/en_us_dedes/me.m07.d26:meVE.Stichera02.text	
ltx/en_us_dedes/me.m07.d26:meVE.Stichera03.incipit	…
ltx/en_us_dedes/me.m07.d26:meVE.Stichera03.melody	@ltx/en_us_dedes/he.a.m8:heAU.OTouParadoxou.name
ltx/en_us_dedes/me.m07.d26:meVE.Stichera03.mode	@ltx/en_us_dedes/miscellanea:misc.Mode8
ltx/en_us_dedes/me.m07.d26:meVE.Stichera03.text	
ltx/en_us_dedes/me.m07.d26:meVE.Stichera04.greekmelody	@ltx/en_us_dedes/he.a.m8:heAU.OTouParadoxou.greekname
ltx/en_us_dedes/me.m07.d26:meVE.Stichera04.incipit	What a paradoxal miracle! Paraskeve…
ltx/en_us_dedes/me.m07.d26:meVE.Stichera04.melody	@ltx/en_us_dedes/he.a.m8:heAU.OTouParadoxou.name
ltx/en_us_dedes/me.m07.d26:meVE.Stichera04.mode	@ltx/en_us_dedes/miscellanea:misc.Mode8
ltx/en_us_dedes/me.m07.d26:meVE.Stichera04.text	What a paradoxal miracle! Paraskeve, readily * you competed in martyrdom * and you manfully brought down * Antoninus’s insolence. * You were awarded the medals and the crowns * of your high calling, O maiden chaste and wise. * Ever remember us * who are loyally extolling you today, * and for us pray to the Lord, that He have mercy on us.
ltx/en_us_dedes/me.m07.d26:meVE.Stichera05.incipit	O all-lauded martyr saint of…
ltx/en_us_dedes/me.m07.d26:meVE.Stichera05.melody	@ltx/en_us_dedes/he.a.m8:heAU.OTouParadoxou.name
ltx/en_us_dedes/me.m07.d26:meVE.Stichera05.mode	@ltx/en_us_dedes/miscellanea:misc.Mode8
ltx/en_us_dedes/me.m07.d26:meVE.Stichera05.text	O all-lauded martyr saint of Christ, * with all your soul you had loved * Christ the Master and longed for Him, * so you patiently endured * every torture that wounded you: * they whipped your body and tore away your flesh; * and you were glad to accept to suffer all * for the Object of your love. * And from Him you have received the martyr’s crowns. * Therefore we extol and praise you who are blest by God.
ltx/en_us_dedes/me.m07.d26:meVE.Stichera06.incipit	Glorious devout and martyr saint…
ltx/en_us_dedes/me.m07.d26:meVE.Stichera06.melody	@ltx/en_us_dedes/he.a.m8:heAU.OTouParadoxou.name
ltx/en_us_dedes/me.m07.d26:meVE.Stichera06.mode	@ltx/en_us_dedes/miscellanea:misc.Mode8
ltx/en_us_dedes/me.m07.d26:meVE.Stichera06.text	Glorious devout and martyr saint, * no one can aptly describe * all the pain and the suffering * you endured in martyrdom * and your wonderful manly feats. * You demonstrated patience and gentleness, * as if you had no flesh, O modest one. * Therefore, Paraskeve, * you are a companion of angels on high, * vessel of the Spirit and bride of the King of all.
