ltx/en_us_dedes/me.m05.d11:meDA.commemoration.first	Commemoration of the Birthday of Constantinople; and Memory of the St. Mokios
ltx/en_us_dedes/me.m05.d11:meDA.commemoration.first_name	
ltx/en_us_dedes/me.m05.d11:meDA.commemoration.first_short	Commemoration of the Birthday of Constantinople; and Memory of the St. Mokios
ltx/en_us_dedes/me.m05.d11:meDA.commemoration.first_title	For the City’s Birthday.
ltx/en_us_dedes/me.m05.d11:meDA.commemoration.full	Commemoration of the Birthday, i.e. the Dedication, of Constantinople; and Memory of the Holy Hieromartyr Mokios
ltx/en_us_dedes/me.m05.d11:meDA.commemoration.second_name	
ltx/en_us_dedes/me.m05.d11:meDA.commemoration.second_title	@ltx/en_us_dedes/titles:ti.SaintM
ltx/en_us_dedes/me.m05.d11:meDA.date	May 11
ltx/en_us_dedes/me.m05.d11:meDA.fordate	for May 11
ltx/en_us_dedes/me.m05.d11:meDA.insert1	
ltx/en_us_dedes/me.m05.d11:meDA.insert2	
ltx/en_us_dedes/me.m05.d11:meDA.note	
ltx/en_us_dedes/me.m05.d11:meDA.pdfcoverdate	May 11,
ltx/en_us_dedes/me.m05.d11:meDA.pdfheaderdate	May 11
ltx/en_us_dedes/me.m05.d11:meHO.commemorations	
ltx/en_us_dedes/me.m05.d11:meHO.note1	
ltx/en_us_dedes/me.m05.d11:meHO.note2	
ltx/en_us_dedes/me.m05.d11:meHO.number	
ltx/en_us_dedes/me.m05.d11:meHO.rank	
ltx/en_us_dedes/me.m05.d11:meLE.commemoration1	The Holy Hieromartyr Mokios.
ltx/en_us_dedes/me.m05.d11:meLE.commemoration2	
ltx/en_us_dedes/me.m05.d11:meLI.Kontakion1.incipit	…
ltx/en_us_dedes/me.m05.d11:meLI.Kontakion1.melody	
ltx/en_us_dedes/me.m05.d11:meLI.Kontakion1.mode	
ltx/en_us_dedes/me.m05.d11:meLI.Kontakion1.text	
ltx/en_us_dedes/me.m05.d11:meLI.MM.CommunionHymn.text	@ltx/en_us_dedes/properties:media.key
ltx/en_us_dedes/me.m05.d11:meLI.Megalynarion.text	
ltx/en_us_dedes/me.m05.d11:meMA.C1.title	
ltx/en_us_dedes/me.m05.d11:meMA.C1.verse	@ltx/en_us_dedes/prayers:pr.verse_SaintM.text
ltx/en_us_dedes/me.m05.d11:meMA.Ode1C11.greekmelody	@ltx/en_us_dedes/he.h.m4:heHE.AnoixoToStomaMou.greekname
ltx/en_us_dedes/me.m05.d11:meMA.Ode1C11.incipit	…
ltx/en_us_dedes/me.m05.d11:meMA.Ode1C11.melody	@ltx/en_us_dedes/he.h.m4:heHE.AnoixoToStomaMou.name
ltx/en_us_dedes/me.m05.d11:meMA.Ode1C11.mode	@ltx/en_us_dedes/miscellanea:misc.Mode4
ltx/en_us_dedes/me.m05.d11:meMA.Ode1C11.ode	@ltx/en_us_dedes/miscellanea:misc.Ode1
ltx/en_us_dedes/me.m05.d11:meMA.Ode1C11.text	
ltx/en_us_dedes/me.m05.d11:meMA.Ode1C12.incipit	…
ltx/en_us_dedes/me.m05.d11:meMA.Ode1C12.melody	@ltx/en_us_dedes/he.h.m4:heHE.AnoixoToStomaMou.name
ltx/en_us_dedes/me.m05.d11:meMA.Ode1C12.mode	@ltx/en_us_dedes/miscellanea:misc.Mode4
ltx/en_us_dedes/me.m05.d11:meMA.Ode1C12.ode	@ltx/en_us_dedes/miscellanea:misc.Ode1
ltx/en_us_dedes/me.m05.d11:meMA.Ode1C12.text	
ltx/en_us_dedes/me.m05.d11:meMA.Ode1C13.incipit	…
ltx/en_us_dedes/me.m05.d11:meMA.Ode1C13.melody	@ltx/en_us_dedes/he.h.m4:heHE.AnoixoToStomaMou.name
ltx/en_us_dedes/me.m05.d11:meMA.Ode1C13.mode	@ltx/en_us_dedes/miscellanea:misc.Mode4
ltx/en_us_dedes/me.m05.d11:meMA.Ode1C13.ode	@ltx/en_us_dedes/miscellanea:misc.Ode1
ltx/en_us_dedes/me.m05.d11:meMA.Ode1C13.text	
ltx/en_us_dedes/me.m05.d11:meMA.Ode1C1T.incipit	…
ltx/en_us_dedes/me.m05.d11:meMA.Ode1C1T.melody	@ltx/en_us_dedes/he.h.m4:heHE.AnoixoToStomaMou.name
ltx/en_us_dedes/me.m05.d11:meMA.Ode1C1T.mode	@ltx/en_us_dedes/miscellanea:misc.Mode4
ltx/en_us_dedes/me.m05.d11:meMA.Ode1C1T.ode	@ltx/en_us_dedes/miscellanea:misc.Ode1
ltx/en_us_dedes/me.m05.d11:meMA.Ode1C1T.text	
ltx/en_us_dedes/me.m05.d11:meMA.Ode3C11.greekmelody	@ltx/en_us_dedes/he.h.m4:heHE.OukEnSofia.greekname
ltx/en_us_dedes/me.m05.d11:meMA.Ode3C11.incipit	…
ltx/en_us_dedes/me.m05.d11:meMA.Ode3C11.melody	@ltx/en_us_dedes/he.h.m4:heHE.OukEnSofia.name
ltx/en_us_dedes/me.m05.d11:meMA.Ode3C11.mode	@ltx/en_us_dedes/miscellanea:misc.Mode4
ltx/en_us_dedes/me.m05.d11:meMA.Ode3C11.ode	@ltx/en_us_dedes/miscellanea:misc.Ode3
ltx/en_us_dedes/me.m05.d11:meMA.Ode3C11.text	
ltx/en_us_dedes/me.m05.d11:meMA.Ode3C12.incipit	…
ltx/en_us_dedes/me.m05.d11:meMA.Ode3C12.melody	@ltx/en_us_dedes/he.h.m4:heHE.OukEnSofia.name
ltx/en_us_dedes/me.m05.d11:meMA.Ode3C12.mode	@ltx/en_us_dedes/miscellanea:misc.Mode4
ltx/en_us_dedes/me.m05.d11:meMA.Ode3C12.ode	@ltx/en_us_dedes/miscellanea:misc.Ode3
ltx/en_us_dedes/me.m05.d11:meMA.Ode3C12.text	
ltx/en_us_dedes/me.m05.d11:meMA.Ode3C13.incipit	…
ltx/en_us_dedes/me.m05.d11:meMA.Ode3C13.melody	@ltx/en_us_dedes/he.h.m4:heHE.OukEnSofia.name
ltx/en_us_dedes/me.m05.d11:meMA.Ode3C13.mode	@ltx/en_us_dedes/miscellanea:misc.Mode4
ltx/en_us_dedes/me.m05.d11:meMA.Ode3C13.ode	@ltx/en_us_dedes/miscellanea:misc.Ode3
ltx/en_us_dedes/me.m05.d11:meMA.Ode3C13.text	
ltx/en_us_dedes/me.m05.d11:meMA.Ode3C1T.incipit	…
ltx/en_us_dedes/me.m05.d11:meMA.Ode3C1T.melody	@ltx/en_us_dedes/he.h.m4:heHE.OukEnSofia.name
ltx/en_us_dedes/me.m05.d11:meMA.Ode3C1T.mode	@ltx/en_us_dedes/miscellanea:misc.Mode4
ltx/en_us_dedes/me.m05.d11:meMA.Ode3C1T.ode	@ltx/en_us_dedes/miscellanea:misc.Ode3
ltx/en_us_dedes/me.m05.d11:meMA.Ode3C1T.text	
ltx/en_us_dedes/me.m05.d11:meMA.Ode3H.greekmelody	@ltx/en_us_dedes/he.h.m4:heHE.OukEnSofia.greekname
ltx/en_us_dedes/me.m05.d11:meMA.Ode3H.incipit	@ltx/en_us_dedes/he.h.m4:heHE.OukEnSofia.incipit
ltx/en_us_dedes/me.m05.d11:meMA.Ode3H.melody	@ltx/en_us_dedes/he.h.m4:heHE.OukEnSofia.melody
ltx/en_us_dedes/me.m05.d11:meMA.Ode3H.mode	@ltx/en_us_dedes/miscellanea:misc.Mode4
ltx/en_us_dedes/me.m05.d11:meMA.Ode3H.ode	@ltx/en_us_dedes/miscellanea:misc.Ode3
ltx/en_us_dedes/me.m05.d11:meMA.Ode3H.text	@ltx/en_us_dedes/he.h.m4:heHE.OukEnSofia.text
ltx/en_us_dedes/me.m05.d11:meMA.Ode3Kathisma1.greekmelody	@ltx/en_us_dedes/he.a.m4:heAU.TachyProkatalave.greekname
ltx/en_us_dedes/me.m05.d11:meMA.Ode3Kathisma1.incipit	…
ltx/en_us_dedes/me.m05.d11:meMA.Ode3Kathisma1.melody	@ltx/en_us_dedes/he.a.m4:heAU.TachyProkatalave.name
ltx/en_us_dedes/me.m05.d11:meMA.Ode3Kathisma1.mode	@ltx/en_us_dedes/miscellanea:misc.Mode4
ltx/en_us_dedes/me.m05.d11:meMA.Ode3Kathisma1.text	
ltx/en_us_dedes/me.m05.d11:meMA.Ode4C11.greekmelody	@ltx/en_us_dedes/he.h.m4:heHE.OKathimenosEnDoxi.greekname
ltx/en_us_dedes/me.m05.d11:meMA.Ode4C11.incipit	…
ltx/en_us_dedes/me.m05.d11:meMA.Ode4C11.melody	@ltx/en_us_dedes/he.h.m4:heHE.OKathimenosEnDoxi.name
ltx/en_us_dedes/me.m05.d11:meMA.Ode4C11.mode	@ltx/en_us_dedes/miscellanea:misc.Mode4
ltx/en_us_dedes/me.m05.d11:meMA.Ode4C11.ode	@ltx/en_us_dedes/miscellanea:misc.Ode4
ltx/en_us_dedes/me.m05.d11:meMA.Ode4C11.text	
ltx/en_us_dedes/me.m05.d11:meMA.Ode4C12.incipit	…
ltx/en_us_dedes/me.m05.d11:meMA.Ode4C12.melody	@ltx/en_us_dedes/he.h.m4:heHE.OKathimenosEnDoxi.name
ltx/en_us_dedes/me.m05.d11:meMA.Ode4C12.mode	@ltx/en_us_dedes/miscellanea:misc.Mode4
ltx/en_us_dedes/me.m05.d11:meMA.Ode4C12.ode	@ltx/en_us_dedes/miscellanea:misc.Ode4
ltx/en_us_dedes/me.m05.d11:meMA.Ode4C12.text	
ltx/en_us_dedes/me.m05.d11:meMA.Ode4C13.incipit	…
ltx/en_us_dedes/me.m05.d11:meMA.Ode4C13.melody	@ltx/en_us_dedes/he.h.m4:heHE.OKathimenosEnDoxi.name
ltx/en_us_dedes/me.m05.d11:meMA.Ode4C13.mode	@ltx/en_us_dedes/miscellanea:misc.Mode4
ltx/en_us_dedes/me.m05.d11:meMA.Ode4C13.ode	@ltx/en_us_dedes/miscellanea:misc.Ode4
ltx/en_us_dedes/me.m05.d11:meMA.Ode4C13.text	
ltx/en_us_dedes/me.m05.d11:meMA.Ode4C1T.incipit	…
ltx/en_us_dedes/me.m05.d11:meMA.Ode4C1T.melody	@ltx/en_us_dedes/he.h.m4:heHE.OKathimenosEnDoxi.name
ltx/en_us_dedes/me.m05.d11:meMA.Ode4C1T.mode	@ltx/en_us_dedes/miscellanea:misc.Mode4
ltx/en_us_dedes/me.m05.d11:meMA.Ode4C1T.ode	@ltx/en_us_dedes/miscellanea:misc.Ode4
ltx/en_us_dedes/me.m05.d11:meMA.Ode4C1T.text	
ltx/en_us_dedes/me.m05.d11:meMA.Ode5C11.greekmelody	@ltx/en_us_dedes/he.h.m4:heHE.SyKyrieMouFos.greekname
ltx/en_us_dedes/me.m05.d11:meMA.Ode5C11.incipit	…
ltx/en_us_dedes/me.m05.d11:meMA.Ode5C11.melody	@ltx/en_us_dedes/he.h.m4:heHE.SyKyrieMouFos.name
ltx/en_us_dedes/me.m05.d11:meMA.Ode5C11.mode	@ltx/en_us_dedes/miscellanea:misc.Mode4
ltx/en_us_dedes/me.m05.d11:meMA.Ode5C11.ode	@ltx/en_us_dedes/miscellanea:misc.Ode5
ltx/en_us_dedes/me.m05.d11:meMA.Ode5C11.text	
ltx/en_us_dedes/me.m05.d11:meMA.Ode5C12.incipit	…
ltx/en_us_dedes/me.m05.d11:meMA.Ode5C12.melody	@ltx/en_us_dedes/he.h.m4:heHE.SyKyrieMouFos.name
ltx/en_us_dedes/me.m05.d11:meMA.Ode5C12.mode	@ltx/en_us_dedes/miscellanea:misc.Mode4
ltx/en_us_dedes/me.m05.d11:meMA.Ode5C12.ode	@ltx/en_us_dedes/miscellanea:misc.Ode5
ltx/en_us_dedes/me.m05.d11:meMA.Ode5C12.text	
ltx/en_us_dedes/me.m05.d11:meMA.Ode5C13.incipit	…
ltx/en_us_dedes/me.m05.d11:meMA.Ode5C13.melody	@ltx/en_us_dedes/he.h.m4:heHE.SyKyrieMouFos.name
ltx/en_us_dedes/me.m05.d11:meMA.Ode5C13.mode	@ltx/en_us_dedes/miscellanea:misc.Mode4
ltx/en_us_dedes/me.m05.d11:meMA.Ode5C13.ode	@ltx/en_us_dedes/miscellanea:misc.Ode5
ltx/en_us_dedes/me.m05.d11:meMA.Ode5C13.text	
ltx/en_us_dedes/me.m05.d11:meMA.Ode5C1T.incipit	…
ltx/en_us_dedes/me.m05.d11:meMA.Ode5C1T.melody	@ltx/en_us_dedes/he.h.m4:heHE.SyKyrieMouFos.name
ltx/en_us_dedes/me.m05.d11:meMA.Ode5C1T.mode	@ltx/en_us_dedes/miscellanea:misc.Mode4
ltx/en_us_dedes/me.m05.d11:meMA.Ode5C1T.ode	@ltx/en_us_dedes/miscellanea:misc.Ode5
ltx/en_us_dedes/me.m05.d11:meMA.Ode5C1T.text	
ltx/en_us_dedes/me.m05.d11:meMA.Ode6C11.greekmelody	@ltx/en_us_dedes/he.h.m4:heHE.ThysoSoiMetaFonis.greekname
ltx/en_us_dedes/me.m05.d11:meMA.Ode6C11.incipit	…
ltx/en_us_dedes/me.m05.d11:meMA.Ode6C11.melody	@ltx/en_us_dedes/he.h.m4:heHE.ThysoSoiMetaFonis.name
ltx/en_us_dedes/me.m05.d11:meMA.Ode6C11.mode	@ltx/en_us_dedes/miscellanea:misc.Mode4
ltx/en_us_dedes/me.m05.d11:meMA.Ode6C11.ode	@ltx/en_us_dedes/miscellanea:misc.Ode6
ltx/en_us_dedes/me.m05.d11:meMA.Ode6C11.text	
ltx/en_us_dedes/me.m05.d11:meMA.Ode6C12.incipit	…
ltx/en_us_dedes/me.m05.d11:meMA.Ode6C12.melody	@ltx/en_us_dedes/he.h.m4:heHE.ThysoSoiMetaFonis.name
ltx/en_us_dedes/me.m05.d11:meMA.Ode6C12.mode	@ltx/en_us_dedes/miscellanea:misc.Mode4
ltx/en_us_dedes/me.m05.d11:meMA.Ode6C12.ode	@ltx/en_us_dedes/miscellanea:misc.Ode6
ltx/en_us_dedes/me.m05.d11:meMA.Ode6C12.text	
ltx/en_us_dedes/me.m05.d11:meMA.Ode6C13.incipit	…
ltx/en_us_dedes/me.m05.d11:meMA.Ode6C13.melody	@ltx/en_us_dedes/he.h.m4:heHE.ThysoSoiMetaFonis.name
ltx/en_us_dedes/me.m05.d11:meMA.Ode6C13.mode	@ltx/en_us_dedes/miscellanea:misc.Mode4
ltx/en_us_dedes/me.m05.d11:meMA.Ode6C13.ode	@ltx/en_us_dedes/miscellanea:misc.Ode6
ltx/en_us_dedes/me.m05.d11:meMA.Ode6C13.text	
ltx/en_us_dedes/me.m05.d11:meMA.Ode6C1T.incipit	…
ltx/en_us_dedes/me.m05.d11:meMA.Ode6C1T.melody	@ltx/en_us_dedes/he.h.m4:heHE.ThysoSoiMetaFonis.name
ltx/en_us_dedes/me.m05.d11:meMA.Ode6C1T.mode	@ltx/en_us_dedes/miscellanea:misc.Mode4
ltx/en_us_dedes/me.m05.d11:meMA.Ode6C1T.ode	@ltx/en_us_dedes/miscellanea:misc.Ode6
ltx/en_us_dedes/me.m05.d11:meMA.Ode6C1T.text	
ltx/en_us_dedes/me.m05.d11:meMA.Ode6H.greekmelody	@ltx/en_us_dedes/he.h.m4:heHE.ThysoSoiMetaFonis.greekname
ltx/en_us_dedes/me.m05.d11:meMA.Ode6H.incipit	@ltx/en_us_dedes/he.h.m4:heHE.ThysoSoiMetaFonis.incipit
ltx/en_us_dedes/me.m05.d11:meMA.Ode6H.melody	@ltx/en_us_dedes/he.h.m4:heHE.ThysoSoiMetaFonis.melody
ltx/en_us_dedes/me.m05.d11:meMA.Ode6H.mode	@ltx/en_us_dedes/miscellanea:misc.Mode4
ltx/en_us_dedes/me.m05.d11:meMA.Ode6H.ode	@ltx/en_us_dedes/miscellanea:misc.Ode6
ltx/en_us_dedes/me.m05.d11:meMA.Ode6H.text	@ltx/en_us_dedes/he.h.m4:heHE.ThysoSoiMetaFonis.text
ltx/en_us_dedes/me.m05.d11:meMA.Ode7C11.greekmelody	@ltx/en_us_dedes/he.h.m4:heHE.ODiasosasEnPyri.greekname
ltx/en_us_dedes/me.m05.d11:meMA.Ode7C11.incipit	…
ltx/en_us_dedes/me.m05.d11:meMA.Ode7C11.melody	@ltx/en_us_dedes/he.h.m4:heHE.ODiasosasEnPyri.name
ltx/en_us_dedes/me.m05.d11:meMA.Ode7C11.mode	@ltx/en_us_dedes/miscellanea:misc.Mode4
ltx/en_us_dedes/me.m05.d11:meMA.Ode7C11.ode	@ltx/en_us_dedes/miscellanea:misc.Ode7
ltx/en_us_dedes/me.m05.d11:meMA.Ode7C11.text	
ltx/en_us_dedes/me.m05.d11:meMA.Ode7C12.incipit	…
ltx/en_us_dedes/me.m05.d11:meMA.Ode7C12.melody	@ltx/en_us_dedes/he.h.m4:heHE.ODiasosasEnPyri.name
ltx/en_us_dedes/me.m05.d11:meMA.Ode7C12.mode	@ltx/en_us_dedes/miscellanea:misc.Mode4
ltx/en_us_dedes/me.m05.d11:meMA.Ode7C12.ode	@ltx/en_us_dedes/miscellanea:misc.Ode7
ltx/en_us_dedes/me.m05.d11:meMA.Ode7C12.text	
ltx/en_us_dedes/me.m05.d11:meMA.Ode7C13.incipit	…
ltx/en_us_dedes/me.m05.d11:meMA.Ode7C13.melody	@ltx/en_us_dedes/he.h.m4:heHE.ODiasosasEnPyri.name
ltx/en_us_dedes/me.m05.d11:meMA.Ode7C13.mode	@ltx/en_us_dedes/miscellanea:misc.Mode4
ltx/en_us_dedes/me.m05.d11:meMA.Ode7C13.ode	@ltx/en_us_dedes/miscellanea:misc.Ode7
ltx/en_us_dedes/me.m05.d11:meMA.Ode7C13.text	
ltx/en_us_dedes/me.m05.d11:meMA.Ode7C1T.incipit	…
ltx/en_us_dedes/me.m05.d11:meMA.Ode7C1T.melody	@ltx/en_us_dedes/he.h.m4:heHE.ODiasosasEnPyri.name
ltx/en_us_dedes/me.m05.d11:meMA.Ode7C1T.mode	@ltx/en_us_dedes/miscellanea:misc.Mode4
ltx/en_us_dedes/me.m05.d11:meMA.Ode7C1T.ode	@ltx/en_us_dedes/miscellanea:misc.Ode7
ltx/en_us_dedes/me.m05.d11:meMA.Ode7C1T.text	
ltx/en_us_dedes/me.m05.d11:meMA.Ode8C11.greekmelody	@ltx/en_us_dedes/he.h.m4:heHE.PaidasEvageis.greekname
ltx/en_us_dedes/me.m05.d11:meMA.Ode8C11.incipit	…
ltx/en_us_dedes/me.m05.d11:meMA.Ode8C11.melody	@ltx/en_us_dedes/he.h.m4:heHE.PaidasEvageis.name
ltx/en_us_dedes/me.m05.d11:meMA.Ode8C11.mode	@ltx/en_us_dedes/miscellanea:misc.Mode4
ltx/en_us_dedes/me.m05.d11:meMA.Ode8C11.ode	@ltx/en_us_dedes/miscellanea:misc.Ode8
ltx/en_us_dedes/me.m05.d11:meMA.Ode8C11.text	
ltx/en_us_dedes/me.m05.d11:meMA.Ode8C12.incipit	…
ltx/en_us_dedes/me.m05.d11:meMA.Ode8C12.melody	@ltx/en_us_dedes/he.h.m4:heHE.PaidasEvageis.name
ltx/en_us_dedes/me.m05.d11:meMA.Ode8C12.mode	@ltx/en_us_dedes/miscellanea:misc.Mode4
ltx/en_us_dedes/me.m05.d11:meMA.Ode8C12.ode	@ltx/en_us_dedes/miscellanea:misc.Ode8
ltx/en_us_dedes/me.m05.d11:meMA.Ode8C12.text	
ltx/en_us_dedes/me.m05.d11:meMA.Ode8C13.incipit	…
ltx/en_us_dedes/me.m05.d11:meMA.Ode8C13.melody	@ltx/en_us_dedes/he.h.m4:heHE.PaidasEvageis.name
ltx/en_us_dedes/me.m05.d11:meMA.Ode8C13.mode	@ltx/en_us_dedes/miscellanea:misc.Mode4
ltx/en_us_dedes/me.m05.d11:meMA.Ode8C13.ode	@ltx/en_us_dedes/miscellanea:misc.Ode8
ltx/en_us_dedes/me.m05.d11:meMA.Ode8C13.text	
ltx/en_us_dedes/me.m05.d11:meMA.Ode8C1T.incipit	…
ltx/en_us_dedes/me.m05.d11:meMA.Ode8C1T.melody	@ltx/en_us_dedes/he.h.m4:heHE.PaidasEvageis.name
ltx/en_us_dedes/me.m05.d11:meMA.Ode8C1T.mode	@ltx/en_us_dedes/miscellanea:misc.Mode4
ltx/en_us_dedes/me.m05.d11:meMA.Ode8C1T.ode	@ltx/en_us_dedes/miscellanea:misc.Ode8
ltx/en_us_dedes/me.m05.d11:meMA.Ode8C1T.text	
ltx/en_us_dedes/me.m05.d11:meMA.Ode8H.greekmelody	@ltx/en_us_dedes/he.h.m4:heHE.PaidasEvageis.greekname
ltx/en_us_dedes/me.m05.d11:meMA.Ode8H.incipit	@ltx/en_us_dedes/he.h.m4:heHE.PaidasEvageis.incipit
ltx/en_us_dedes/me.m05.d11:meMA.Ode8H.melody	@ltx/en_us_dedes/he.h.m4:heHE.PaidasEvageis.melody
ltx/en_us_dedes/me.m05.d11:meMA.Ode8H.mode	@ltx/en_us_dedes/miscellanea:misc.Mode4
ltx/en_us_dedes/me.m05.d11:meMA.Ode8H.ode	@ltx/en_us_dedes/miscellanea:misc.Ode8
ltx/en_us_dedes/me.m05.d11:meMA.Ode8H.text	@ltx/en_us_dedes/he.h.m4:heHE.PaidasEvageis.text
ltx/en_us_dedes/me.m05.d11:meMA.Ode9C11.greekmelody	@ltx/en_us_dedes/he.h.m4:heHE.EvaMenToTisParakois.greekname
ltx/en_us_dedes/me.m05.d11:meMA.Ode9C11.incipit	…
ltx/en_us_dedes/me.m05.d11:meMA.Ode9C11.melody	@ltx/en_us_dedes/he.h.m4:heHE.EvaMenToTisParakois.name
ltx/en_us_dedes/me.m05.d11:meMA.Ode9C11.mode	@ltx/en_us_dedes/miscellanea:misc.Mode4
ltx/en_us_dedes/me.m05.d11:meMA.Ode9C11.ode	@ltx/en_us_dedes/miscellanea:misc.Ode9
ltx/en_us_dedes/me.m05.d11:meMA.Ode9C11.text	
ltx/en_us_dedes/me.m05.d11:meMA.Ode9C12.incipit	…
ltx/en_us_dedes/me.m05.d11:meMA.Ode9C12.melody	@ltx/en_us_dedes/he.h.m4:heHE.EvaMenToTisParakois.name
ltx/en_us_dedes/me.m05.d11:meMA.Ode9C12.mode	@ltx/en_us_dedes/miscellanea:misc.Mode4
ltx/en_us_dedes/me.m05.d11:meMA.Ode9C12.ode	@ltx/en_us_dedes/miscellanea:misc.Ode9
ltx/en_us_dedes/me.m05.d11:meMA.Ode9C12.text	
ltx/en_us_dedes/me.m05.d11:meMA.Ode9C13.incipit	…
ltx/en_us_dedes/me.m05.d11:meMA.Ode9C13.melody	@ltx/en_us_dedes/he.h.m4:heHE.EvaMenToTisParakois.name
ltx/en_us_dedes/me.m05.d11:meMA.Ode9C13.mode	@ltx/en_us_dedes/miscellanea:misc.Mode4
ltx/en_us_dedes/me.m05.d11:meMA.Ode9C13.ode	@ltx/en_us_dedes/miscellanea:misc.Ode9
ltx/en_us_dedes/me.m05.d11:meMA.Ode9C13.text	
ltx/en_us_dedes/me.m05.d11:meMA.Ode9C1T.incipit	…
ltx/en_us_dedes/me.m05.d11:meMA.Ode9C1T.melody	@ltx/en_us_dedes/he.h.m4:heHE.EvaMenToTisParakois.name
ltx/en_us_dedes/me.m05.d11:meMA.Ode9C1T.mode	@ltx/en_us_dedes/miscellanea:misc.Mode4
ltx/en_us_dedes/me.m05.d11:meMA.Ode9C1T.ode	@ltx/en_us_dedes/miscellanea:misc.Ode9
ltx/en_us_dedes/me.m05.d11:meMA.Ode9C1T.text	
ltx/en_us_dedes/me.m05.d11:meMA.Ode9H.greekmelody	@ltx/en_us_dedes/he.h.m4:heHE.EvaMenToTisParakois.greekname
ltx/en_us_dedes/me.m05.d11:meMA.Ode9H.incipit	@ltx/en_us_dedes/he.h.m4:heHE.EvaMenToTisParakois.incipit
ltx/en_us_dedes/me.m05.d11:meMA.Ode9H.melody	@ltx/en_us_dedes/he.h.m4:heHE.EvaMenToTisParakois.melody
ltx/en_us_dedes/me.m05.d11:meMA.Ode9H.mode	@ltx/en_us_dedes/miscellanea:misc.Mode4
ltx/en_us_dedes/me.m05.d11:meMA.Ode9H.ode	@ltx/en_us_dedes/miscellanea:misc.Ode9
ltx/en_us_dedes/me.m05.d11:meMA.Ode9H.text	@ltx/en_us_dedes/he.h.m4:heHE.EvaMenToTisParakois.text
ltx/en_us_dedes/me.m05.d11:meVE.Apolytikion1.incipit	The City of the Theotokos…
ltx/en_us_dedes/me.m05.d11:meVE.Apolytikion1.melody	
ltx/en_us_dedes/me.m05.d11:meVE.Apolytikion1.mode	@ltx/en_us_dedes/miscellanea:misc.Mode4
ltx/en_us_dedes/me.m05.d11:meVE.Apolytikion1.text	The City of the Theotokos duly attributes its founding to the Theotokos. For in her it stands for the duration, and through her it is preserved and prevails, as it salutes her and proclaims, “Rejoice! You are the hope of all the ends of the earth!”
ltx/en_us_dedes/me.m05.d11:meVE.Stichera01.greekmelody	@ltx/en_us_dedes/he.a.m4:heAU.OsGennaionEnMartysi.greekname
ltx/en_us_dedes/me.m05.d11:meVE.Stichera01.incipit	Now the Queen of all…
ltx/en_us_dedes/me.m05.d11:meVE.Stichera01.melody	@ltx/en_us_dedes/he.a.m4:heAU.OsGennaionEnMartysi.name
ltx/en_us_dedes/me.m05.d11:meVE.Stichera01.mode	@ltx/en_us_dedes/miscellanea:misc.Mode4
ltx/en_us_dedes/me.m05.d11:meVE.Stichera01.text	Now the Queen of all cities owes * her foundation to her who is * Lady of creation, the Mother of our God. * By her the City was powerful: * the hordes of combatant foes, * who attacked her, were subdued * under foot of her emperors, * who believed in Christ. * And she gratefully cried out, “You, O Virgin, are the power that upholds me, * my crown, my scepters, my emperors.”
ltx/en_us_dedes/me.m05.d11:meVE.Stichera02.incipit	Like a luminous sun you…
ltx/en_us_dedes/me.m05.d11:meVE.Stichera02.melody	@ltx/en_us_dedes/he.a.m4:heAU.OsGennaionEnMartysi.name
ltx/en_us_dedes/me.m05.d11:meVE.Stichera02.mode	@ltx/en_us_dedes/miscellanea:misc.Mode4
ltx/en_us_dedes/me.m05.d11:meVE.Stichera02.text	Like a luminous sun you rose * from the west and you brightly shone * with the flashing light of your holy martyrdom, * that has illumined the whole wide world. * You are godly-minded and * truly happy, and the jewel * of the martyrs, the dignity * of your fellow priests. * and peer of the Angels, you who made the might of pagan error vanish, * divinely blessed St. Mokios.
ltx/en_us_dedes/me.m05.d11:meVE.Stichera03.incipit	Being forged by your pious…
ltx/en_us_dedes/me.m05.d11:meVE.Stichera03.melody	@ltx/en_us_dedes/he.a.m4:heAU.OsGennaionEnMartysi.name
ltx/en_us_dedes/me.m05.d11:meVE.Stichera03.mode	@ltx/en_us_dedes/miscellanea:misc.Mode4
ltx/en_us_dedes/me.m05.d11:meVE.Stichera03.text	Being forged by your pious faith, * being hardened through martyrdom, * oiled with your valor, O holy Mokios, * you thus became like a heaven-made * mighty sword, O famous Saint, * that has vanquished all the hordes * of combatants and enemies. Therefore we today * celebrate your all-holy and resplendent solemn memory with longing, * O pride and joy of the martyr saints.
