ltx/en_us_dedes/sy.m04.d27:cl.syMA.commemoration01.text	[saint/com 1]
ltx/en_us_dedes/sy.m04.d27:cl.syMA.commemoration02.text	[saint/com 2]
ltx/en_us_dedes/sy.m04.d27:cl.syMA.commemoration03.text	[saint/com 3]
ltx/en_us_dedes/sy.m04.d27:cl.syMA.commemoration04.text	[saint/com 4]
ltx/en_us_dedes/sy.m04.d27:cl.syMA.commemoration05.text	[saint/com 5]
ltx/en_us_dedes/sy.m04.d27:cl.syMA.commemoration06.text	[saint/com list]
ltx/en_us_dedes/sy.m04.d27:syMA.commemoration01.couplet1.title	@ltx/en_us_dedes/titles:ti.Verses
ltx/en_us_dedes/sy.m04.d27:syMA.commemoration01.couplet1.verse1	
ltx/en_us_dedes/sy.m04.d27:syMA.commemoration01.couplet1.verse2	
ltx/en_us_dedes/sy.m04.d27:syMA.commemoration01.narration.p01	
ltx/en_us_dedes/sy.m04.d27:syMA.commemoration01.single1	
ltx/en_us_dedes/sy.m04.d27:syMA.commemoration01.text	On April 27, we commemorate the holy Hieromartyr Simeon, Bishop of Jerusalem, the kinsman of the Lord.
ltx/en_us_dedes/sy.m04.d27:syMA.commemoration02.couplet1.title	@ltx/en_us_dedes/titles:ti.Verses
ltx/en_us_dedes/sy.m04.d27:syMA.commemoration02.couplet1.verse1	
ltx/en_us_dedes/sy.m04.d27:syMA.commemoration02.couplet1.verse2	
ltx/en_us_dedes/sy.m04.d27:syMA.commemoration02.narration.p01	
ltx/en_us_dedes/sy.m04.d27:syMA.commemoration02.narration.p02	
ltx/en_us_dedes/sy.m04.d27:syMA.commemoration02.narration.p03	
ltx/en_us_dedes/sy.m04.d27:syMA.commemoration02.narration.p04	
ltx/en_us_dedes/sy.m04.d27:syMA.commemoration02.text	On this day we commemorate our devout father John the Confessor, Abbot of the Monastery of the Pure.
ltx/en_us_dedes/sy.m04.d27:syMA.commemoration03.couplet1.title	@ltx/en_us_dedes/titles:ti.Verses
ltx/en_us_dedes/sy.m04.d27:syMA.commemoration03.couplet1.verse1	
ltx/en_us_dedes/sy.m04.d27:syMA.commemoration03.couplet1.verse2	
ltx/en_us_dedes/sy.m04.d27:syMA.commemoration03.text	On this day we also commemorate the holy Martyr Publius, who died by the sword.
ltx/en_us_dedes/sy.m04.d27:syMA.commemoration04.couplet1.title	@ltx/en_us_dedes/titles:ti.Verses
ltx/en_us_dedes/sy.m04.d27:syMA.commemoration04.couplet1.verse1	
ltx/en_us_dedes/sy.m04.d27:syMA.commemoration04.couplet1.verse2	
ltx/en_us_dedes/sy.m04.d27:syMA.commemoration04.text	On this day we also commemorate Saint Evlogios the inn-keeper, who died in peace.
ltx/en_us_dedes/sy.m04.d27:syMA.commemoration05.couplet1.title	@ltx/en_us_dedes/titles:ti.Verses
ltx/en_us_dedes/sy.m04.d27:syMA.commemoration05.couplet1.verse1	
ltx/en_us_dedes/sy.m04.d27:syMA.commemoration05.couplet1.verse2	
ltx/en_us_dedes/sy.m04.d27:syMA.commemoration05.text	On this day we also commemorate the holy Martyr Lollion the Younger, who died after being dragged on the ground.
ltx/en_us_dedes/sy.m04.d27:syMA.lastline	By the intercessions of Your saints, O Christ God, have mercy on us. Amen.
