ltx/en_us_dedes/other.ecloge.ps44:other.poet	
ltx/en_us_dedes/other.ecloge.ps44:other.title	
ltx/en_us_dedes/other.ecloge.ps44:other.verse01.text	Rejoice, O Queen of all extolled by all, Mother of Christ our God.
ltx/en_us_dedes/other.ecloge.ps44:other.verse02.text	Rejoice, O Queen of the Angels, Lady of the world.
ltx/en_us_dedes/other.ecloge.ps44:other.verse03.text	Rejoice, the proclamation of the Prophets, the glory of the Patriarchs.
ltx/en_us_dedes/other.ecloge.ps44:other.verse04.text	Rejoice, O pure Virgin, Lady, Bride of God.
ltx/en_us_dedes/other.ecloge.ps44:other.verse05.text	Rejoice, spotless, undefiled, incorrupt, all-holy Lady.
ltx/en_us_dedes/other.ecloge.ps44:other.verse06.text	Rejoice, the hope of the hopeless, and help of the embattled.
ltx/en_us_dedes/other.ecloge.ps44:other.verse07.text	Rejoice, O Maiden full of grace. The Lord is with you, and through you He is with us.
ltx/en_us_dedes/other.ecloge.ps44:other.verse08.text	Rejoice, for blessed are you among women, and blessed is the fruit of your womb.
ltx/en_us_dedes/other.ecloge.ps44:other.verse09.text	Rejoice, Virgin Theotokos, blessed among women.
ltx/en_us_dedes/other.ecloge.ps44:other.verse10.text	Rejoice, O Mary, Lady of us all. The Lord of hosts is with you.
ltx/en_us_dedes/other.ecloge.ps44:other.verse11.text	Rejoice, O fiery throne, more glorious than the four living creatures.
ltx/en_us_dedes/other.ecloge.ps44:other.verse12.text	Rejoice, O Mary, Lady of us all. Rejoice, O Mother of life.
ltx/en_us_dedes/other.ecloge.ps44:other.verse13.text	Rejoice, most blessed and most glorified Lady.
ltx/en_us_dedes/other.ecloge.ps44:other.verse14.text	Rejoice, immaculate Theotokos, for you gave birth to the Savior of our souls.
ltx/en_us_dedes/other.ecloge.ps44:other.verse15.text	Rejoice, most holy Paradise. Rejoice, O unwedded Bride.
ltx/en_us_dedes/other.ecloge.ps44:other.verse16.text	Rejoice, holy Virgin, greater than all the saints. Rejoice, O unwedded Bride.
ltx/en_us_dedes/other.ecloge.ps44:other.verse17.text	O all-holy Virgin, hear the voice of me your unprofitable servant. Help me to offer you the unceasing sighs of my heart, O Lady.
ltx/en_us_dedes/other.ecloge.ps44:other.verse18.text	O all-holy Virgin, Bride of God, accept my heart-felt devotion, and bring it to our compassionate God, that I may joyfully glorify you, O all-blameless one.
