ltx/en_us_dedes/me.m11.d11:meDA.commemoration.first	Memory of the Holy Martyrs Menas, Victor and Vincent; and the Holy Martyr Stephanie
ltx/en_us_dedes/me.m11.d11:meDA.commemoration.first_name	
ltx/en_us_dedes/me.m11.d11:meDA.commemoration.first_short	Memory of the Holy Martyrs Menas, Victor and Vincent; and the Holy Martyr Stephanie
ltx/en_us_dedes/me.m11.d11:meDA.commemoration.first_title	@ltx/en_us_dedes/titles:ti.Martyrs
ltx/en_us_dedes/me.m11.d11:meDA.commemoration.full	Memory of the Holy Martyrs Menas, Victor and Vincent; and the Holy Martyr Stephanie; and our Devout Father and Confessor Theodore the Studite.
ltx/en_us_dedes/me.m11.d11:meDA.commemoration.second_name	
ltx/en_us_dedes/me.m11.d11:meDA.commemoration.second_title	For St. Theodore.
ltx/en_us_dedes/me.m11.d11:meDA.date	November 11
ltx/en_us_dedes/me.m11.d11:meDA.fordate	for November 11
ltx/en_us_dedes/me.m11.d11:meDA.insert1	the holy martyrs Menas, Victor and Vincent, the holy martyr Stephanie,
ltx/en_us_dedes/me.m11.d11:meDA.insert2	whose memory we observe,
ltx/en_us_dedes/me.m11.d11:meDA.note	
ltx/en_us_dedes/me.m11.d11:meDA.pdfcoverdate	November 11,
ltx/en_us_dedes/me.m11.d11:meDA.pdfheaderdate	November 11
ltx/en_us_dedes/me.m11.d11:meHO.commemorations	
ltx/en_us_dedes/me.m11.d11:meHO.note1	
ltx/en_us_dedes/me.m11.d11:meHO.note2	
ltx/en_us_dedes/me.m11.d11:meHO.number	
ltx/en_us_dedes/me.m11.d11:meHO.rank	
ltx/en_us_dedes/me.m11.d11:meLE.commemoration1	The Holy Martyrs Menas, Victor, and Vikentios. Our Venerable Father Theodore the Studites the Confessor.
ltx/en_us_dedes/me.m11.d11:meLE.commemoration2	
ltx/en_us_dedes/me.m11.d11:meLI.Kontakion1.greekmelody	@ltx/en_us_dedes/me.m11.d11:meMA.Kontakion1.greekmelody
ltx/en_us_dedes/me.m11.d11:meLI.Kontakion1.incipit	@ltx/en_us_dedes/me.m11.d11:meMA.Kontakion1.incipit
ltx/en_us_dedes/me.m11.d11:meLI.Kontakion1.melody	@ltx/en_us_dedes/me.m11.d11:meMA.Kontakion1.melody
ltx/en_us_dedes/me.m11.d11:meLI.Kontakion1.mode	@ltx/en_us_dedes/me.m11.d11:meMA.Kontakion1.mode
ltx/en_us_dedes/me.m11.d11:meLI.Kontakion1.text	@ltx/en_us_dedes/me.m11.d11:meMA.Kontakion1.text
ltx/en_us_dedes/me.m11.d11:meLI.Megalynarion.text	
ltx/en_us_dedes/me.m11.d11:meLI.Megalynarion2.text	
ltx/en_us_dedes/me.m11.d11:meMA.AposGlory.incipit	O believers, let us congregate…
ltx/en_us_dedes/me.m11.d11:meMA.AposGlory.melody	
ltx/en_us_dedes/me.m11.d11:meMA.AposGlory.mode	@ltx/en_us_dedes/miscellanea:misc.Mode1
ltx/en_us_dedes/me.m11.d11:meMA.AposGlory.poet	@ltx/en_us_dedes/poets:po.Anatoliou
ltx/en_us_dedes/me.m11.d11:meMA.AposGlory.text	O believers, let us congregate today, and with spiritual songs and praises fit for martyrs, let us extol most renowned Menas, who excelled in valor for Christ. This Martyr waged war with the unseen enemies, and he fought according to the rules, and rightly received the medal of victory. Now in heaven with the Angels, he dances the dance that never ends, and he prays for peace and great mercy for the world.
ltx/en_us_dedes/me.m11.d11:meMA.AposStavrotheotokion.greekmelody	@ltx/en_us_dedes/he.a.m1:heAU.PaneffimoiMartyres.greekname
ltx/en_us_dedes/me.m11.d11:meMA.AposStavrotheotokion.incipit	@ltx/en_us_dedes/oc.m1.d4:ocVE.SticTheotokion.incipit
ltx/en_us_dedes/me.m11.d11:meMA.AposStavrotheotokion.melody	@ltx/en_us_dedes/he.a.m1:heAU.PaneffimoiMartyres.name
ltx/en_us_dedes/me.m11.d11:meMA.AposStavrotheotokion.mode	@ltx/en_us_dedes/miscellanea:misc.Mode1
ltx/en_us_dedes/me.m11.d11:meMA.AposStavrotheotokion.text	@ltx/en_us_dedes/oc.m1.d4:ocVE.SticTheotokion.text
ltx/en_us_dedes/me.m11.d11:meMA.AposTheotokion.greekmelody	@ltx/en_us_dedes/he.a.m1:heAU.PaneffimoiMartyres.greekname
ltx/en_us_dedes/me.m11.d11:meMA.AposTheotokion.incipit	@ltx/en_us_dedes/oc.m1.d3:ocVE.SticTheotokion.incipit
ltx/en_us_dedes/me.m11.d11:meMA.AposTheotokion.melody	@ltx/en_us_dedes/he.a.m1:heAU.PaneffimoiMartyres.name
ltx/en_us_dedes/me.m11.d11:meMA.AposTheotokion.mode	@ltx/en_us_dedes/miscellanea:misc.Mode1
ltx/en_us_dedes/me.m11.d11:meMA.AposTheotokion.text	@ltx/en_us_dedes/oc.m1.d3:ocVE.SticTheotokion.text
ltx/en_us_dedes/me.m11.d11:meMA.Aposticha4.incipit	…
ltx/en_us_dedes/me.m11.d11:meMA.Aposticha4.melody	
ltx/en_us_dedes/me.m11.d11:meMA.Aposticha4.mode	@ltx/en_us_dedes/miscellanea:misc.Mode2
ltx/en_us_dedes/me.m11.d11:meMA.Aposticha4.text	
ltx/en_us_dedes/me.m11.d11:meMA.C1.acrostic.notice1	
ltx/en_us_dedes/me.m11.d11:meMA.C1.acrostic.text	
ltx/en_us_dedes/me.m11.d11:meMA.C1.acrostic.title	
ltx/en_us_dedes/me.m11.d11:meMA.C1.poet	@ltx/en_us_dedes/poets:po.Theofanous
ltx/en_us_dedes/me.m11.d11:meMA.C1.title	@ltx/en_us_dedes/titles:ti.CanonSaintM
ltx/en_us_dedes/me.m11.d11:meMA.C1.verse	@ltx/en_us_dedes/prayers:pr.verse_SaintM.text
ltx/en_us_dedes/me.m11.d11:meMA.C2.acrostic.notice1	
ltx/en_us_dedes/me.m11.d11:meMA.C2.acrostic.text	
ltx/en_us_dedes/me.m11.d11:meMA.C2.acrostic.title	
ltx/en_us_dedes/me.m11.d11:meMA.C2.poet	@ltx/en_us_dedes/poets:po.Theofanous
ltx/en_us_dedes/me.m11.d11:meMA.C2.title	@ltx/en_us_dedes/titles:ti.CanonDevoutM
ltx/en_us_dedes/me.m11.d11:meMA.C2.verse	@ltx/en_us_dedes/prayers:pr.verse_DevoutMan.text
ltx/en_us_dedes/me.m11.d11:meMA.ExapTheotokion.incipit	O all-immaculate Maiden, * as…
ltx/en_us_dedes/me.m11.d11:meMA.ExapTheotokion.melody	@ltx/en_us_dedes/he.a.m3:heAU.OOuranonToisAstrois.name
ltx/en_us_dedes/me.m11.d11:meMA.ExapTheotokion.mode	@ltx/en_us_dedes/miscellanea:misc.Mode3
ltx/en_us_dedes/me.m11.d11:meMA.ExapTheotokion.text	O all-immaculate Maiden, * as David said, in you were seen * the Master’s solemn processions; * and they direct humanity * to where the choirs of Angels are * and also the host of all Saints.
ltx/en_us_dedes/me.m11.d11:meMA.Exaposteilarion1.greekmelody	@ltx/en_us_dedes/he.a.m3:heAU.OOuranonToisAstrois.greekname
ltx/en_us_dedes/me.m11.d11:meMA.Exaposteilarion1.incipit	You have embellished heaven *…
ltx/en_us_dedes/me.m11.d11:meMA.Exaposteilarion1.melody	@ltx/en_us_dedes/he.a.m3:heAU.OOuranonToisAstrois.name
ltx/en_us_dedes/me.m11.d11:meMA.Exaposteilarion1.mode	@ltx/en_us_dedes/miscellanea:misc.Mode3
ltx/en_us_dedes/me.m11.d11:meMA.Exaposteilarion1.text	You have embellished heaven * with stars, O tender-loving Lord. * You have adorned the Church likewise * with Victor, Vincent, and Menas, * and Stephanie. Through these Martyrs, * we pray You save those who praise You.
ltx/en_us_dedes/me.m11.d11:meMA.Exaposteilarion2.greekmelody	@ltx/en_us_dedes/he.a.m3:heAU.OOuranonToisAstrois.greekname
ltx/en_us_dedes/me.m11.d11:meMA.Exaposteilarion2.incipit	…
ltx/en_us_dedes/me.m11.d11:meMA.Exaposteilarion2.melody	@ltx/en_us_dedes/he.a.m3:heAU.OOuranonToisAstrois.name
ltx/en_us_dedes/me.m11.d11:meMA.Exaposteilarion2.mode	@ltx/en_us_dedes/miscellanea:misc.Mode3
ltx/en_us_dedes/me.m11.d11:meMA.Exaposteilarion2.text	
ltx/en_us_dedes/me.m11.d11:meMA.Kontakion1.greekmelody	@ltx/en_us_dedes/he.a.m2:heAU.TaAnoZiton.greekname
ltx/en_us_dedes/me.m11.d11:meMA.Kontakion1.incipit	…
ltx/en_us_dedes/me.m11.d11:meMA.Kontakion1.melody	@ltx/en_us_dedes/he.a.m2:heAU.TaAnoZiton.name
ltx/en_us_dedes/me.m11.d11:meMA.Kontakion1.mode	@ltx/en_us_dedes/miscellanea:misc.Mode2
ltx/en_us_dedes/me.m11.d11:meMA.Kontakion1.text	
ltx/en_us_dedes/me.m11.d11:meMA.Kontakion2.greekmelody	@ltx/en_us_dedes/he.a.m4:heAU.EpefanisSimeron.greekname
ltx/en_us_dedes/me.m11.d11:meMA.Kontakion2.incipit	You were snatched from the…
ltx/en_us_dedes/me.m11.d11:meMA.Kontakion2.melody	@ltx/en_us_dedes/he.a.m4:heAU.EpefanisSimeron.name
ltx/en_us_dedes/me.m11.d11:meMA.Kontakion2.mode	@ltx/en_us_dedes/miscellanea:misc.Mode4
ltx/en_us_dedes/me.m11.d11:meMA.Kontakion2.text	You were snatched from the worldly army and made a part of the incorruptible one, O victorious Martyr Menas, by Christ our God, the immortal crown of the Martyrs.
ltx/en_us_dedes/me.m11.d11:meMA.MM.VeApos1123as5678.text	@ltx/en_us_dedes/properties:media.key
ltx/en_us_dedes/me.m11.d11:meMA.Ode1C11.greekmelody	@ltx/en_us_dedes/he.h.m4:heHE.AnoixoToStomaMou.greekname
ltx/en_us_dedes/me.m11.d11:meMA.Ode1C11.incipit	…
ltx/en_us_dedes/me.m11.d11:meMA.Ode1C11.melody	@ltx/en_us_dedes/he.h.m4:heHE.AnoixoToStomaMou.name
ltx/en_us_dedes/me.m11.d11:meMA.Ode1C11.mode	@ltx/en_us_dedes/miscellanea:misc.Mode4
ltx/en_us_dedes/me.m11.d11:meMA.Ode1C11.ode	@ltx/en_us_dedes/miscellanea:misc.Ode1
ltx/en_us_dedes/me.m11.d11:meMA.Ode1C11.text	
ltx/en_us_dedes/me.m11.d11:meMA.Ode1C12.incipit	…
ltx/en_us_dedes/me.m11.d11:meMA.Ode1C12.melody	@ltx/en_us_dedes/he.h.m4:heHE.AnoixoToStomaMou.name
ltx/en_us_dedes/me.m11.d11:meMA.Ode1C12.mode	@ltx/en_us_dedes/miscellanea:misc.Mode4
ltx/en_us_dedes/me.m11.d11:meMA.Ode1C12.ode	@ltx/en_us_dedes/miscellanea:misc.Ode1
ltx/en_us_dedes/me.m11.d11:meMA.Ode1C12.text	
ltx/en_us_dedes/me.m11.d11:meMA.Ode1C13.incipit	…
ltx/en_us_dedes/me.m11.d11:meMA.Ode1C13.melody	@ltx/en_us_dedes/he.h.m4:heHE.AnoixoToStomaMou.name
ltx/en_us_dedes/me.m11.d11:meMA.Ode1C13.mode	@ltx/en_us_dedes/miscellanea:misc.Mode4
ltx/en_us_dedes/me.m11.d11:meMA.Ode1C13.ode	@ltx/en_us_dedes/miscellanea:misc.Ode1
ltx/en_us_dedes/me.m11.d11:meMA.Ode1C13.text	
ltx/en_us_dedes/me.m11.d11:meMA.Ode1C1T.incipit	…
ltx/en_us_dedes/me.m11.d11:meMA.Ode1C1T.melody	@ltx/en_us_dedes/he.h.m4:heHE.AnoixoToStomaMou.name
ltx/en_us_dedes/me.m11.d11:meMA.Ode1C1T.mode	@ltx/en_us_dedes/miscellanea:misc.Mode4
ltx/en_us_dedes/me.m11.d11:meMA.Ode1C1T.ode	@ltx/en_us_dedes/miscellanea:misc.Ode1
ltx/en_us_dedes/me.m11.d11:meMA.Ode1C1T.text	
ltx/en_us_dedes/me.m11.d11:meMA.Ode1C21.greekmelody	@ltx/en_us_dedes/he.h.m8:heHE.ArmatilatinFarao.greekname
ltx/en_us_dedes/me.m11.d11:meMA.Ode1C21.incipit	…
ltx/en_us_dedes/me.m11.d11:meMA.Ode1C21.melody	@ltx/en_us_dedes/he.h.m8:heHE.ArmatilatinFarao.name
ltx/en_us_dedes/me.m11.d11:meMA.Ode1C21.mode	@ltx/en_us_dedes/miscellanea:misc.Mode8
ltx/en_us_dedes/me.m11.d11:meMA.Ode1C21.ode	@ltx/en_us_dedes/miscellanea:misc.Ode1
ltx/en_us_dedes/me.m11.d11:meMA.Ode1C21.text	
ltx/en_us_dedes/me.m11.d11:meMA.Ode1C22.incipit	…
ltx/en_us_dedes/me.m11.d11:meMA.Ode1C22.melody	@ltx/en_us_dedes/he.h.m8:heHE.ArmatilatinFarao.name
ltx/en_us_dedes/me.m11.d11:meMA.Ode1C22.mode	@ltx/en_us_dedes/miscellanea:misc.Mode8
ltx/en_us_dedes/me.m11.d11:meMA.Ode1C22.ode	@ltx/en_us_dedes/miscellanea:misc.Ode1
ltx/en_us_dedes/me.m11.d11:meMA.Ode1C22.text	
ltx/en_us_dedes/me.m11.d11:meMA.Ode1C23.incipit	…
ltx/en_us_dedes/me.m11.d11:meMA.Ode1C23.melody	@ltx/en_us_dedes/he.h.m8:heHE.ArmatilatinFarao.name
ltx/en_us_dedes/me.m11.d11:meMA.Ode1C23.mode	@ltx/en_us_dedes/miscellanea:misc.Mode8
ltx/en_us_dedes/me.m11.d11:meMA.Ode1C23.ode	@ltx/en_us_dedes/miscellanea:misc.Ode1
ltx/en_us_dedes/me.m11.d11:meMA.Ode1C23.text	
ltx/en_us_dedes/me.m11.d11:meMA.Ode1C24.incipit	…
ltx/en_us_dedes/me.m11.d11:meMA.Ode1C24.melody	@ltx/en_us_dedes/he.h.m8:heHE.ArmatilatinFarao.name
ltx/en_us_dedes/me.m11.d11:meMA.Ode1C24.mode	@ltx/en_us_dedes/miscellanea:misc.Mode8
ltx/en_us_dedes/me.m11.d11:meMA.Ode1C24.ode	@ltx/en_us_dedes/miscellanea:misc.Ode1
ltx/en_us_dedes/me.m11.d11:meMA.Ode1C24.text	
ltx/en_us_dedes/me.m11.d11:meMA.Ode1C2T.incipit	…
ltx/en_us_dedes/me.m11.d11:meMA.Ode1C2T.melody	@ltx/en_us_dedes/he.h.m8:heHE.ArmatilatinFarao.name
ltx/en_us_dedes/me.m11.d11:meMA.Ode1C2T.mode	@ltx/en_us_dedes/miscellanea:misc.Mode8
ltx/en_us_dedes/me.m11.d11:meMA.Ode1C2T.ode	@ltx/en_us_dedes/miscellanea:misc.Ode1
ltx/en_us_dedes/me.m11.d11:meMA.Ode1C2T.text	
ltx/en_us_dedes/me.m11.d11:meMA.Ode3C11.greekmelody	@ltx/en_us_dedes/he.h.m4:heHE.OukEnSofia.greekname
ltx/en_us_dedes/me.m11.d11:meMA.Ode3C11.incipit	…
ltx/en_us_dedes/me.m11.d11:meMA.Ode3C11.melody	@ltx/en_us_dedes/he.h.m4:heHE.OukEnSofia.name
ltx/en_us_dedes/me.m11.d11:meMA.Ode3C11.mode	@ltx/en_us_dedes/miscellanea:misc.Mode4
ltx/en_us_dedes/me.m11.d11:meMA.Ode3C11.ode	@ltx/en_us_dedes/miscellanea:misc.Ode3
ltx/en_us_dedes/me.m11.d11:meMA.Ode3C11.text	
ltx/en_us_dedes/me.m11.d11:meMA.Ode3C12.incipit	…
ltx/en_us_dedes/me.m11.d11:meMA.Ode3C12.melody	@ltx/en_us_dedes/he.h.m4:heHE.OukEnSofia.name
ltx/en_us_dedes/me.m11.d11:meMA.Ode3C12.mode	@ltx/en_us_dedes/miscellanea:misc.Mode4
ltx/en_us_dedes/me.m11.d11:meMA.Ode3C12.ode	@ltx/en_us_dedes/miscellanea:misc.Ode3
ltx/en_us_dedes/me.m11.d11:meMA.Ode3C12.text	
ltx/en_us_dedes/me.m11.d11:meMA.Ode3C13.incipit	…
ltx/en_us_dedes/me.m11.d11:meMA.Ode3C13.melody	@ltx/en_us_dedes/he.h.m4:heHE.OukEnSofia.name
ltx/en_us_dedes/me.m11.d11:meMA.Ode3C13.mode	@ltx/en_us_dedes/miscellanea:misc.Mode4
ltx/en_us_dedes/me.m11.d11:meMA.Ode3C13.ode	@ltx/en_us_dedes/miscellanea:misc.Ode3
ltx/en_us_dedes/me.m11.d11:meMA.Ode3C13.text	
ltx/en_us_dedes/me.m11.d11:meMA.Ode3C1T.incipit	…
ltx/en_us_dedes/me.m11.d11:meMA.Ode3C1T.melody	@ltx/en_us_dedes/he.h.m4:heHE.OukEnSofia.name
ltx/en_us_dedes/me.m11.d11:meMA.Ode3C1T.mode	@ltx/en_us_dedes/miscellanea:misc.Mode4
ltx/en_us_dedes/me.m11.d11:meMA.Ode3C1T.ode	@ltx/en_us_dedes/miscellanea:misc.Ode3
ltx/en_us_dedes/me.m11.d11:meMA.Ode3C1T.text	
ltx/en_us_dedes/me.m11.d11:meMA.Ode3C21.greekmelody	@ltx/en_us_dedes/he.h.m8:heHE.OStereosasKatArchas.greekname
ltx/en_us_dedes/me.m11.d11:meMA.Ode3C21.incipit	…
ltx/en_us_dedes/me.m11.d11:meMA.Ode3C21.melody	@ltx/en_us_dedes/he.h.m8:heHE.OStereosasKatArchas.name
ltx/en_us_dedes/me.m11.d11:meMA.Ode3C21.mode	@ltx/en_us_dedes/miscellanea:misc.Mode8
ltx/en_us_dedes/me.m11.d11:meMA.Ode3C21.ode	@ltx/en_us_dedes/miscellanea:misc.Ode3
ltx/en_us_dedes/me.m11.d11:meMA.Ode3C21.text	
ltx/en_us_dedes/me.m11.d11:meMA.Ode3C22.incipit	…
ltx/en_us_dedes/me.m11.d11:meMA.Ode3C22.melody	@ltx/en_us_dedes/he.h.m8:heHE.OStereosasKatArchas.name
ltx/en_us_dedes/me.m11.d11:meMA.Ode3C22.mode	@ltx/en_us_dedes/miscellanea:misc.Mode8
ltx/en_us_dedes/me.m11.d11:meMA.Ode3C22.ode	@ltx/en_us_dedes/miscellanea:misc.Ode3
ltx/en_us_dedes/me.m11.d11:meMA.Ode3C22.text	
ltx/en_us_dedes/me.m11.d11:meMA.Ode3C23.incipit	…
ltx/en_us_dedes/me.m11.d11:meMA.Ode3C23.melody	@ltx/en_us_dedes/he.h.m8:heHE.OStereosasKatArchas.name
ltx/en_us_dedes/me.m11.d11:meMA.Ode3C23.mode	@ltx/en_us_dedes/miscellanea:misc.Mode8
ltx/en_us_dedes/me.m11.d11:meMA.Ode3C23.ode	@ltx/en_us_dedes/miscellanea:misc.Ode3
ltx/en_us_dedes/me.m11.d11:meMA.Ode3C23.text	
ltx/en_us_dedes/me.m11.d11:meMA.Ode3C2T.incipit	…
ltx/en_us_dedes/me.m11.d11:meMA.Ode3C2T.melody	@ltx/en_us_dedes/he.h.m8:heHE.OStereosasKatArchas.name
ltx/en_us_dedes/me.m11.d11:meMA.Ode3C2T.mode	@ltx/en_us_dedes/miscellanea:misc.Mode8
ltx/en_us_dedes/me.m11.d11:meMA.Ode3C2T.ode	@ltx/en_us_dedes/miscellanea:misc.Ode3
ltx/en_us_dedes/me.m11.d11:meMA.Ode3C2T.text	
ltx/en_us_dedes/me.m11.d11:meMA.Ode3H.greekmelody	@ltx/en_us_dedes/he.h.m8:heHE.OStereosasKatArchas.greekname
ltx/en_us_dedes/me.m11.d11:meMA.Ode3H.incipit	@ltx/en_us_dedes/he.h.m8:heHE.OStereosasKatArchas.incipit
ltx/en_us_dedes/me.m11.d11:meMA.Ode3H.melody	@ltx/en_us_dedes/he.h.m8:heHE.OStereosasKatArchas.melody
ltx/en_us_dedes/me.m11.d11:meMA.Ode3H.mode	@ltx/en_us_dedes/miscellanea:misc.Mode8
ltx/en_us_dedes/me.m11.d11:meMA.Ode3H.ode	@ltx/en_us_dedes/miscellanea:misc.Ode3
ltx/en_us_dedes/me.m11.d11:meMA.Ode3H.text	@ltx/en_us_dedes/he.h.m8:heHE.OStereosasKatArchas.text
ltx/en_us_dedes/me.m11.d11:meMA.Ode3Kathisma1.greekmelody	@ltx/en_us_dedes/he.a.m8:heAU.TinSofianKaiLogon.greekname
ltx/en_us_dedes/me.m11.d11:meMA.Ode3Kathisma1.incipit	…
ltx/en_us_dedes/me.m11.d11:meMA.Ode3Kathisma1.melody	@ltx/en_us_dedes/he.a.m8:heAU.TinSofianKaiLogon.name
ltx/en_us_dedes/me.m11.d11:meMA.Ode3Kathisma1.mode	@ltx/en_us_dedes/miscellanea:misc.Mode8
ltx/en_us_dedes/me.m11.d11:meMA.Ode3Kathisma1.text	
ltx/en_us_dedes/me.m11.d11:meMA.Ode3Kathisma2.greekmelody	@ltx/en_us_dedes/he.a.m3:heAU.TheiasPisteos.greekname
ltx/en_us_dedes/me.m11.d11:meMA.Ode3Kathisma2.incipit	…
ltx/en_us_dedes/me.m11.d11:meMA.Ode3Kathisma2.melody	@ltx/en_us_dedes/he.a.m3:heAU.TheiasPisteos.name
ltx/en_us_dedes/me.m11.d11:meMA.Ode3Kathisma2.mode	@ltx/en_us_dedes/miscellanea:misc.Mode3
ltx/en_us_dedes/me.m11.d11:meMA.Ode3Kathisma2.text	
ltx/en_us_dedes/me.m11.d11:meMA.Ode3KathismaSt.incipit	@ltx/en_us_dedes/me.m01.d29:meMA.Ode3KathismaSt.incipit
ltx/en_us_dedes/me.m11.d11:meMA.Ode3KathismaSt.melody	@ltx/en_us_dedes/he.a.m3:heAU.TheiasPisteos.name
ltx/en_us_dedes/me.m11.d11:meMA.Ode3KathismaSt.mode	@ltx/en_us_dedes/miscellanea:misc.Mode3
ltx/en_us_dedes/me.m11.d11:meMA.Ode3KathismaSt.text	@ltx/en_us_dedes/me.m01.d29:meMA.Ode3KathismaSt.text
ltx/en_us_dedes/me.m11.d11:meMA.Ode3KathismaT.incipit	@ltx/en_us_dedes/oc.m3.d2:ocMA.Kathisma23.incipit
ltx/en_us_dedes/me.m11.d11:meMA.Ode3KathismaT.melody	@ltx/en_us_dedes/he.a.m3:heAU.TheiasPisteos.name
ltx/en_us_dedes/me.m11.d11:meMA.Ode3KathismaT.mode	@ltx/en_us_dedes/miscellanea:misc.Mode3
ltx/en_us_dedes/me.m11.d11:meMA.Ode3KathismaT.text	@ltx/en_us_dedes/oc.m3.d2:ocMA.Kathisma23.text
ltx/en_us_dedes/me.m11.d11:meMA.Ode4C11.greekmelody	@ltx/en_us_dedes/he.h.m4:heHE.OKathimenosEnDoxi.greekname
ltx/en_us_dedes/me.m11.d11:meMA.Ode4C11.incipit	…
ltx/en_us_dedes/me.m11.d11:meMA.Ode4C11.melody	@ltx/en_us_dedes/he.h.m4:heHE.OKathimenosEnDoxi.name
ltx/en_us_dedes/me.m11.d11:meMA.Ode4C11.mode	@ltx/en_us_dedes/miscellanea:misc.Mode4
ltx/en_us_dedes/me.m11.d11:meMA.Ode4C11.ode	@ltx/en_us_dedes/miscellanea:misc.Ode4
ltx/en_us_dedes/me.m11.d11:meMA.Ode4C11.text	
ltx/en_us_dedes/me.m11.d11:meMA.Ode4C12.incipit	…
ltx/en_us_dedes/me.m11.d11:meMA.Ode4C12.melody	@ltx/en_us_dedes/he.h.m4:heHE.OKathimenosEnDoxi.name
ltx/en_us_dedes/me.m11.d11:meMA.Ode4C12.mode	@ltx/en_us_dedes/miscellanea:misc.Mode4
ltx/en_us_dedes/me.m11.d11:meMA.Ode4C12.ode	@ltx/en_us_dedes/miscellanea:misc.Ode4
ltx/en_us_dedes/me.m11.d11:meMA.Ode4C12.text	
ltx/en_us_dedes/me.m11.d11:meMA.Ode4C13.incipit	…
ltx/en_us_dedes/me.m11.d11:meMA.Ode4C13.melody	@ltx/en_us_dedes/he.h.m4:heHE.OKathimenosEnDoxi.name
ltx/en_us_dedes/me.m11.d11:meMA.Ode4C13.mode	@ltx/en_us_dedes/miscellanea:misc.Mode4
ltx/en_us_dedes/me.m11.d11:meMA.Ode4C13.ode	@ltx/en_us_dedes/miscellanea:misc.Ode4
ltx/en_us_dedes/me.m11.d11:meMA.Ode4C13.text	
ltx/en_us_dedes/me.m11.d11:meMA.Ode4C1T.incipit	…
ltx/en_us_dedes/me.m11.d11:meMA.Ode4C1T.melody	@ltx/en_us_dedes/he.h.m4:heHE.OKathimenosEnDoxi.name
ltx/en_us_dedes/me.m11.d11:meMA.Ode4C1T.mode	@ltx/en_us_dedes/miscellanea:misc.Mode4
ltx/en_us_dedes/me.m11.d11:meMA.Ode4C1T.ode	@ltx/en_us_dedes/miscellanea:misc.Ode4
ltx/en_us_dedes/me.m11.d11:meMA.Ode4C1T.text	
ltx/en_us_dedes/me.m11.d11:meMA.Ode4C21.greekmelody	@ltx/en_us_dedes/he.h.m8:heHE.SyMouIschys.greekname
ltx/en_us_dedes/me.m11.d11:meMA.Ode4C21.incipit	…
ltx/en_us_dedes/me.m11.d11:meMA.Ode4C21.melody	@ltx/en_us_dedes/he.h.m8:heHE.SyMouIschys.name
ltx/en_us_dedes/me.m11.d11:meMA.Ode4C21.mode	@ltx/en_us_dedes/miscellanea:misc.Mode8
ltx/en_us_dedes/me.m11.d11:meMA.Ode4C21.ode	@ltx/en_us_dedes/miscellanea:misc.Ode4
ltx/en_us_dedes/me.m11.d11:meMA.Ode4C21.text	
ltx/en_us_dedes/me.m11.d11:meMA.Ode4C22.incipit	…
ltx/en_us_dedes/me.m11.d11:meMA.Ode4C22.melody	@ltx/en_us_dedes/he.h.m8:heHE.SyMouIschys.name
ltx/en_us_dedes/me.m11.d11:meMA.Ode4C22.mode	@ltx/en_us_dedes/miscellanea:misc.Mode8
ltx/en_us_dedes/me.m11.d11:meMA.Ode4C22.ode	@ltx/en_us_dedes/miscellanea:misc.Ode4
ltx/en_us_dedes/me.m11.d11:meMA.Ode4C22.text	
ltx/en_us_dedes/me.m11.d11:meMA.Ode4C23.incipit	…
ltx/en_us_dedes/me.m11.d11:meMA.Ode4C23.melody	@ltx/en_us_dedes/he.h.m8:heHE.SyMouIschys.name
ltx/en_us_dedes/me.m11.d11:meMA.Ode4C23.mode	@ltx/en_us_dedes/miscellanea:misc.Mode8
ltx/en_us_dedes/me.m11.d11:meMA.Ode4C23.ode	@ltx/en_us_dedes/miscellanea:misc.Ode4
ltx/en_us_dedes/me.m11.d11:meMA.Ode4C23.text	
ltx/en_us_dedes/me.m11.d11:meMA.Ode4C2T.incipit	…
ltx/en_us_dedes/me.m11.d11:meMA.Ode4C2T.melody	@ltx/en_us_dedes/he.h.m8:heHE.SyMouIschys.name
ltx/en_us_dedes/me.m11.d11:meMA.Ode4C2T.mode	@ltx/en_us_dedes/miscellanea:misc.Mode8
ltx/en_us_dedes/me.m11.d11:meMA.Ode4C2T.ode	@ltx/en_us_dedes/miscellanea:misc.Ode4
ltx/en_us_dedes/me.m11.d11:meMA.Ode4C2T.text	
ltx/en_us_dedes/me.m11.d11:meMA.Ode5C11.greekmelody	@ltx/en_us_dedes/he.h.m4:heHE.AseveisOukOpsontai.greekname
ltx/en_us_dedes/me.m11.d11:meMA.Ode5C11.incipit	…
ltx/en_us_dedes/me.m11.d11:meMA.Ode5C11.melody	@ltx/en_us_dedes/he.h.m4:heHE.AseveisOukOpsontai.name
ltx/en_us_dedes/me.m11.d11:meMA.Ode5C11.mode	@ltx/en_us_dedes/miscellanea:misc.Mode4
ltx/en_us_dedes/me.m11.d11:meMA.Ode5C11.ode	@ltx/en_us_dedes/miscellanea:misc.Ode5
ltx/en_us_dedes/me.m11.d11:meMA.Ode5C11.text	
ltx/en_us_dedes/me.m11.d11:meMA.Ode5C12.incipit	…
ltx/en_us_dedes/me.m11.d11:meMA.Ode5C12.melody	@ltx/en_us_dedes/he.h.m4:heHE.AseveisOukOpsontai.name
ltx/en_us_dedes/me.m11.d11:meMA.Ode5C12.mode	@ltx/en_us_dedes/miscellanea:misc.Mode4
ltx/en_us_dedes/me.m11.d11:meMA.Ode5C12.ode	@ltx/en_us_dedes/miscellanea:misc.Ode5
ltx/en_us_dedes/me.m11.d11:meMA.Ode5C12.text	
ltx/en_us_dedes/me.m11.d11:meMA.Ode5C1T.incipit	…
ltx/en_us_dedes/me.m11.d11:meMA.Ode5C1T.melody	@ltx/en_us_dedes/he.h.m4:heHE.AseveisOukOpsontai.name
ltx/en_us_dedes/me.m11.d11:meMA.Ode5C1T.mode	@ltx/en_us_dedes/miscellanea:misc.Mode4
ltx/en_us_dedes/me.m11.d11:meMA.Ode5C1T.ode	@ltx/en_us_dedes/miscellanea:misc.Ode5
ltx/en_us_dedes/me.m11.d11:meMA.Ode5C1T.text	
ltx/en_us_dedes/me.m11.d11:meMA.Ode5C21.greekmelody	@ltx/en_us_dedes/he.h.m8:heHE.InaTiMeAposo.greekname
ltx/en_us_dedes/me.m11.d11:meMA.Ode5C21.incipit	…
ltx/en_us_dedes/me.m11.d11:meMA.Ode5C21.melody	@ltx/en_us_dedes/he.h.m8:heHE.InaTiMeAposo.name
ltx/en_us_dedes/me.m11.d11:meMA.Ode5C21.mode	@ltx/en_us_dedes/miscellanea:misc.Mode8
ltx/en_us_dedes/me.m11.d11:meMA.Ode5C21.ode	@ltx/en_us_dedes/miscellanea:misc.Ode5
ltx/en_us_dedes/me.m11.d11:meMA.Ode5C21.text	
ltx/en_us_dedes/me.m11.d11:meMA.Ode5C22.incipit	…
ltx/en_us_dedes/me.m11.d11:meMA.Ode5C22.melody	@ltx/en_us_dedes/he.h.m8:heHE.InaTiMeAposo.name
ltx/en_us_dedes/me.m11.d11:meMA.Ode5C22.mode	@ltx/en_us_dedes/miscellanea:misc.Mode8
ltx/en_us_dedes/me.m11.d11:meMA.Ode5C22.ode	@ltx/en_us_dedes/miscellanea:misc.Ode5
ltx/en_us_dedes/me.m11.d11:meMA.Ode5C22.text	
ltx/en_us_dedes/me.m11.d11:meMA.Ode5C23.incipit	…
ltx/en_us_dedes/me.m11.d11:meMA.Ode5C23.melody	@ltx/en_us_dedes/he.h.m8:heHE.InaTiMeAposo.name
ltx/en_us_dedes/me.m11.d11:meMA.Ode5C23.mode	@ltx/en_us_dedes/miscellanea:misc.Mode8
ltx/en_us_dedes/me.m11.d11:meMA.Ode5C23.ode	@ltx/en_us_dedes/miscellanea:misc.Ode5
ltx/en_us_dedes/me.m11.d11:meMA.Ode5C23.text	
ltx/en_us_dedes/me.m11.d11:meMA.Ode5C2T.incipit	…
ltx/en_us_dedes/me.m11.d11:meMA.Ode5C2T.melody	@ltx/en_us_dedes/he.h.m8:heHE.InaTiMeAposo.name
ltx/en_us_dedes/me.m11.d11:meMA.Ode5C2T.mode	@ltx/en_us_dedes/miscellanea:misc.Mode8
ltx/en_us_dedes/me.m11.d11:meMA.Ode5C2T.ode	@ltx/en_us_dedes/miscellanea:misc.Ode5
ltx/en_us_dedes/me.m11.d11:meMA.Ode5C2T.text	
ltx/en_us_dedes/me.m11.d11:meMA.Ode6C11.greekmelody	@ltx/en_us_dedes/he.h.m4:heHE.EvoiseProtypon.greekname
ltx/en_us_dedes/me.m11.d11:meMA.Ode6C11.incipit	…
ltx/en_us_dedes/me.m11.d11:meMA.Ode6C11.melody	@ltx/en_us_dedes/he.h.m4:heHE.EvoiseProtypon.name
ltx/en_us_dedes/me.m11.d11:meMA.Ode6C11.mode	@ltx/en_us_dedes/miscellanea:misc.Mode4
ltx/en_us_dedes/me.m11.d11:meMA.Ode6C11.ode	@ltx/en_us_dedes/miscellanea:misc.Ode6
ltx/en_us_dedes/me.m11.d11:meMA.Ode6C11.text	
ltx/en_us_dedes/me.m11.d11:meMA.Ode6C12.incipit	…
ltx/en_us_dedes/me.m11.d11:meMA.Ode6C12.melody	@ltx/en_us_dedes/he.h.m4:heHE.EvoiseProtypon.name
ltx/en_us_dedes/me.m11.d11:meMA.Ode6C12.mode	@ltx/en_us_dedes/miscellanea:misc.Mode4
ltx/en_us_dedes/me.m11.d11:meMA.Ode6C12.ode	@ltx/en_us_dedes/miscellanea:misc.Ode6
ltx/en_us_dedes/me.m11.d11:meMA.Ode6C12.text	
ltx/en_us_dedes/me.m11.d11:meMA.Ode6C13.incipit	…
ltx/en_us_dedes/me.m11.d11:meMA.Ode6C13.melody	@ltx/en_us_dedes/he.h.m4:heHE.EvoiseProtypon.name
ltx/en_us_dedes/me.m11.d11:meMA.Ode6C13.mode	@ltx/en_us_dedes/miscellanea:misc.Mode4
ltx/en_us_dedes/me.m11.d11:meMA.Ode6C13.ode	@ltx/en_us_dedes/miscellanea:misc.Ode6
ltx/en_us_dedes/me.m11.d11:meMA.Ode6C13.text	
ltx/en_us_dedes/me.m11.d11:meMA.Ode6C1T.incipit	…
ltx/en_us_dedes/me.m11.d11:meMA.Ode6C1T.melody	@ltx/en_us_dedes/he.h.m4:heHE.EvoiseProtypon.name
ltx/en_us_dedes/me.m11.d11:meMA.Ode6C1T.mode	@ltx/en_us_dedes/miscellanea:misc.Mode4
ltx/en_us_dedes/me.m11.d11:meMA.Ode6C1T.ode	@ltx/en_us_dedes/miscellanea:misc.Ode6
ltx/en_us_dedes/me.m11.d11:meMA.Ode6C1T.text	
ltx/en_us_dedes/me.m11.d11:meMA.Ode6C21.greekmelody	@ltx/en_us_dedes/he.h.m8:heHE.IlasthitiMoiSotir.greekname
ltx/en_us_dedes/me.m11.d11:meMA.Ode6C21.incipit	O blessed Theodore, you lived…
ltx/en_us_dedes/me.m11.d11:meMA.Ode6C21.melody	@ltx/en_us_dedes/he.h.m8:heHE.IlasthitiMoiSotir.notmetered
ltx/en_us_dedes/me.m11.d11:meMA.Ode6C21.mode	@ltx/en_us_dedes/miscellanea:misc.Mode8
ltx/en_us_dedes/me.m11.d11:meMA.Ode6C21.ode	@ltx/en_us_dedes/miscellanea:misc.Ode6
ltx/en_us_dedes/me.m11.d11:meMA.Ode6C21.text	O blessed Theodore, you lived your life soberly, O devout and godly-minded Saint, and with righteousness, valor, and prudence, you assemble for yourself a most luxurious carriage of virtues.
ltx/en_us_dedes/me.m11.d11:meMA.Ode6C22.incipit	O all-wise Theodore, the divine…
ltx/en_us_dedes/me.m11.d11:meMA.Ode6C22.melody	@ltx/en_us_dedes/he.h.m8:heHE.IlasthitiMoiSotir.notmetered
ltx/en_us_dedes/me.m11.d11:meMA.Ode6C22.mode	@ltx/en_us_dedes/miscellanea:misc.Mode8
ltx/en_us_dedes/me.m11.d11:meMA.Ode6C22.ode	@ltx/en_us_dedes/miscellanea:misc.Ode6
ltx/en_us_dedes/me.m11.d11:meMA.Ode6C22.text	O all-wise Theodore, the divine words of your doctrines are magnificently fragrant, and they extract all people from the pit of wicked heresies, and they lift them to Orthodoxy’s exalted summit.
ltx/en_us_dedes/me.m11.d11:meMA.Ode6C23.incipit	O admirable Father, now light…
ltx/en_us_dedes/me.m11.d11:meMA.Ode6C23.melody	@ltx/en_us_dedes/he.h.m8:heHE.IlasthitiMoiSotir.notmetered
ltx/en_us_dedes/me.m11.d11:meMA.Ode6C23.mode	@ltx/en_us_dedes/miscellanea:misc.Mode8
ltx/en_us_dedes/me.m11.d11:meMA.Ode6C23.ode	@ltx/en_us_dedes/miscellanea:misc.Ode6
ltx/en_us_dedes/me.m11.d11:meMA.Ode6C23.text	O admirable Father, now light and its partner joy have risen and shined on you. O all-blessed Theodore, you flourished like a palm tree and were multiplied like a cedar.
ltx/en_us_dedes/me.m11.d11:meMA.Ode6C2T.incipit	O immaculate Theotokos and all-blameless…
ltx/en_us_dedes/me.m11.d11:meMA.Ode6C2T.melody	@ltx/en_us_dedes/he.h.m8:heHE.IlasthitiMoiSotir.notmetered
ltx/en_us_dedes/me.m11.d11:meMA.Ode6C2T.mode	@ltx/en_us_dedes/miscellanea:misc.Mode8
ltx/en_us_dedes/me.m11.d11:meMA.Ode6C2T.ode	@ltx/en_us_dedes/miscellanea:misc.Ode6
ltx/en_us_dedes/me.m11.d11:meMA.Ode6C2T.text	O immaculate Theotokos and all-blameless Mother of God, may we be saved through you, and truly obtain the divine illumination of the Son of God, who was ineffably incarnate of you.
ltx/en_us_dedes/me.m11.d11:meMA.Ode6H.greekmelody	@ltx/en_us_dedes/he.h.m8:heHE.IlasthitiMoiSotir.greekname
ltx/en_us_dedes/me.m11.d11:meMA.Ode6H.incipit	@ltx/en_us_dedes/he.h.m8:heHE.IlasthitiMoiSotir.incipit
ltx/en_us_dedes/me.m11.d11:meMA.Ode6H.melody	@ltx/en_us_dedes/he.h.m8:heHE.IlasthitiMoiSotir.melody
ltx/en_us_dedes/me.m11.d11:meMA.Ode6H.mode	@ltx/en_us_dedes/miscellanea:misc.Mode8
ltx/en_us_dedes/me.m11.d11:meMA.Ode6H.ode	@ltx/en_us_dedes/miscellanea:misc.Ode6
ltx/en_us_dedes/me.m11.d11:meMA.Ode6H.text	@ltx/en_us_dedes/he.h.m8:heHE.IlasthitiMoiSotir.text
ltx/en_us_dedes/me.m11.d11:meMA.Ode7C11.greekmelody	@ltx/en_us_dedes/he.h.m4:heHE.ODiasosasEnPyri.greekname
ltx/en_us_dedes/me.m11.d11:meMA.Ode7C11.incipit	…
ltx/en_us_dedes/me.m11.d11:meMA.Ode7C11.melody	@ltx/en_us_dedes/he.h.m4:heHE.ODiasosasEnPyri.name
ltx/en_us_dedes/me.m11.d11:meMA.Ode7C11.mode	@ltx/en_us_dedes/miscellanea:misc.Mode4
ltx/en_us_dedes/me.m11.d11:meMA.Ode7C11.ode	@ltx/en_us_dedes/miscellanea:misc.Ode7
ltx/en_us_dedes/me.m11.d11:meMA.Ode7C11.text	
ltx/en_us_dedes/me.m11.d11:meMA.Ode7C12.incipit	…
ltx/en_us_dedes/me.m11.d11:meMA.Ode7C12.melody	@ltx/en_us_dedes/he.h.m4:heHE.ODiasosasEnPyri.name
ltx/en_us_dedes/me.m11.d11:meMA.Ode7C12.mode	@ltx/en_us_dedes/miscellanea:misc.Mode4
ltx/en_us_dedes/me.m11.d11:meMA.Ode7C12.ode	@ltx/en_us_dedes/miscellanea:misc.Ode7
ltx/en_us_dedes/me.m11.d11:meMA.Ode7C12.text	
ltx/en_us_dedes/me.m11.d11:meMA.Ode7C13.incipit	…
ltx/en_us_dedes/me.m11.d11:meMA.Ode7C13.melody	@ltx/en_us_dedes/he.h.m4:heHE.ODiasosasEnPyri.name
ltx/en_us_dedes/me.m11.d11:meMA.Ode7C13.mode	@ltx/en_us_dedes/miscellanea:misc.Mode4
ltx/en_us_dedes/me.m11.d11:meMA.Ode7C13.ode	@ltx/en_us_dedes/miscellanea:misc.Ode7
ltx/en_us_dedes/me.m11.d11:meMA.Ode7C13.text	
ltx/en_us_dedes/me.m11.d11:meMA.Ode7C1T.incipit	…
ltx/en_us_dedes/me.m11.d11:meMA.Ode7C1T.melody	@ltx/en_us_dedes/he.h.m4:heHE.ODiasosasEnPyri.name
ltx/en_us_dedes/me.m11.d11:meMA.Ode7C1T.mode	@ltx/en_us_dedes/miscellanea:misc.Mode4
ltx/en_us_dedes/me.m11.d11:meMA.Ode7C1T.ode	@ltx/en_us_dedes/miscellanea:misc.Ode7
ltx/en_us_dedes/me.m11.d11:meMA.Ode7C1T.text	
ltx/en_us_dedes/me.m11.d11:meMA.Ode7C21.greekmelody	@ltx/en_us_dedes/he.h.m8:heHE.TheouSynkatavasin.greekname
ltx/en_us_dedes/me.m11.d11:meMA.Ode7C21.incipit	…
ltx/en_us_dedes/me.m11.d11:meMA.Ode7C21.melody	@ltx/en_us_dedes/he.h.m8:heHE.TheouSynkatavasin.name
ltx/en_us_dedes/me.m11.d11:meMA.Ode7C21.mode	@ltx/en_us_dedes/miscellanea:misc.Mode8
ltx/en_us_dedes/me.m11.d11:meMA.Ode7C21.ode	@ltx/en_us_dedes/miscellanea:misc.Ode7
ltx/en_us_dedes/me.m11.d11:meMA.Ode7C21.text	
ltx/en_us_dedes/me.m11.d11:meMA.Ode7C22.incipit	…
ltx/en_us_dedes/me.m11.d11:meMA.Ode7C22.melody	@ltx/en_us_dedes/he.h.m8:heHE.TheouSynkatavasin.name
ltx/en_us_dedes/me.m11.d11:meMA.Ode7C22.mode	@ltx/en_us_dedes/miscellanea:misc.Mode8
ltx/en_us_dedes/me.m11.d11:meMA.Ode7C22.ode	@ltx/en_us_dedes/miscellanea:misc.Ode7
ltx/en_us_dedes/me.m11.d11:meMA.Ode7C22.text	
ltx/en_us_dedes/me.m11.d11:meMA.Ode7C23.incipit	…
ltx/en_us_dedes/me.m11.d11:meMA.Ode7C23.melody	@ltx/en_us_dedes/he.h.m8:heHE.TheouSynkatavasin.name
ltx/en_us_dedes/me.m11.d11:meMA.Ode7C23.mode	@ltx/en_us_dedes/miscellanea:misc.Mode8
ltx/en_us_dedes/me.m11.d11:meMA.Ode7C23.ode	@ltx/en_us_dedes/miscellanea:misc.Ode7
ltx/en_us_dedes/me.m11.d11:meMA.Ode7C23.text	
ltx/en_us_dedes/me.m11.d11:meMA.Ode7C2T.incipit	…
ltx/en_us_dedes/me.m11.d11:meMA.Ode7C2T.melody	@ltx/en_us_dedes/he.h.m8:heHE.TheouSynkatavasin.name
ltx/en_us_dedes/me.m11.d11:meMA.Ode7C2T.mode	@ltx/en_us_dedes/miscellanea:misc.Mode8
ltx/en_us_dedes/me.m11.d11:meMA.Ode7C2T.ode	@ltx/en_us_dedes/miscellanea:misc.Ode7
ltx/en_us_dedes/me.m11.d11:meMA.Ode7C2T.text	
ltx/en_us_dedes/me.m11.d11:meMA.Ode8C11.greekmelody	@ltx/en_us_dedes/he.h.m4:heHE.PaidasEvageis.greekname
ltx/en_us_dedes/me.m11.d11:meMA.Ode8C11.incipit	…
ltx/en_us_dedes/me.m11.d11:meMA.Ode8C11.melody	@ltx/en_us_dedes/he.h.m4:heHE.PaidasEvageis.name
ltx/en_us_dedes/me.m11.d11:meMA.Ode8C11.mode	@ltx/en_us_dedes/miscellanea:misc.Mode4
ltx/en_us_dedes/me.m11.d11:meMA.Ode8C11.ode	@ltx/en_us_dedes/miscellanea:misc.Ode8
ltx/en_us_dedes/me.m11.d11:meMA.Ode8C11.text	
ltx/en_us_dedes/me.m11.d11:meMA.Ode8C12.incipit	…
ltx/en_us_dedes/me.m11.d11:meMA.Ode8C12.melody	@ltx/en_us_dedes/he.h.m4:heHE.PaidasEvageis.name
ltx/en_us_dedes/me.m11.d11:meMA.Ode8C12.mode	@ltx/en_us_dedes/miscellanea:misc.Mode4
ltx/en_us_dedes/me.m11.d11:meMA.Ode8C12.ode	@ltx/en_us_dedes/miscellanea:misc.Ode8
ltx/en_us_dedes/me.m11.d11:meMA.Ode8C12.text	
ltx/en_us_dedes/me.m11.d11:meMA.Ode8C13.incipit	…
ltx/en_us_dedes/me.m11.d11:meMA.Ode8C13.melody	@ltx/en_us_dedes/he.h.m4:heHE.PaidasEvageis.name
ltx/en_us_dedes/me.m11.d11:meMA.Ode8C13.mode	@ltx/en_us_dedes/miscellanea:misc.Mode4
ltx/en_us_dedes/me.m11.d11:meMA.Ode8C13.ode	@ltx/en_us_dedes/miscellanea:misc.Ode8
ltx/en_us_dedes/me.m11.d11:meMA.Ode8C13.text	
ltx/en_us_dedes/me.m11.d11:meMA.Ode8C1T.incipit	…
ltx/en_us_dedes/me.m11.d11:meMA.Ode8C1T.melody	@ltx/en_us_dedes/he.h.m4:heHE.PaidasEvageis.name
ltx/en_us_dedes/me.m11.d11:meMA.Ode8C1T.mode	@ltx/en_us_dedes/miscellanea:misc.Mode4
ltx/en_us_dedes/me.m11.d11:meMA.Ode8C1T.ode	@ltx/en_us_dedes/miscellanea:misc.Ode8
ltx/en_us_dedes/me.m11.d11:meMA.Ode8C1T.text	
ltx/en_us_dedes/me.m11.d11:meMA.Ode8C21.greekmelody	@ltx/en_us_dedes/he.h.m8:heHE.EptaplasiosKaminon.greekname
ltx/en_us_dedes/me.m11.d11:meMA.Ode8C21.incipit	…
ltx/en_us_dedes/me.m11.d11:meMA.Ode8C21.melody	@ltx/en_us_dedes/he.h.m8:heHE.EptaplasiosKaminon.name
ltx/en_us_dedes/me.m11.d11:meMA.Ode8C21.mode	@ltx/en_us_dedes/miscellanea:misc.Mode8
ltx/en_us_dedes/me.m11.d11:meMA.Ode8C21.ode	@ltx/en_us_dedes/miscellanea:misc.Ode8
ltx/en_us_dedes/me.m11.d11:meMA.Ode8C21.text	
ltx/en_us_dedes/me.m11.d11:meMA.Ode8C22.incipit	…
ltx/en_us_dedes/me.m11.d11:meMA.Ode8C22.melody	@ltx/en_us_dedes/he.h.m8:heHE.EptaplasiosKaminon.name
ltx/en_us_dedes/me.m11.d11:meMA.Ode8C22.mode	@ltx/en_us_dedes/miscellanea:misc.Mode8
ltx/en_us_dedes/me.m11.d11:meMA.Ode8C22.ode	@ltx/en_us_dedes/miscellanea:misc.Ode8
ltx/en_us_dedes/me.m11.d11:meMA.Ode8C22.text	
ltx/en_us_dedes/me.m11.d11:meMA.Ode8C23.incipit	…
ltx/en_us_dedes/me.m11.d11:meMA.Ode8C23.melody	@ltx/en_us_dedes/he.h.m8:heHE.EptaplasiosKaminon.name
ltx/en_us_dedes/me.m11.d11:meMA.Ode8C23.mode	@ltx/en_us_dedes/miscellanea:misc.Mode8
ltx/en_us_dedes/me.m11.d11:meMA.Ode8C23.ode	@ltx/en_us_dedes/miscellanea:misc.Ode8
ltx/en_us_dedes/me.m11.d11:meMA.Ode8C23.text	
ltx/en_us_dedes/me.m11.d11:meMA.Ode8C24.incipit	…
ltx/en_us_dedes/me.m11.d11:meMA.Ode8C24.melody	@ltx/en_us_dedes/he.h.m8:heHE.EptaplasiosKaminon.name
ltx/en_us_dedes/me.m11.d11:meMA.Ode8C24.mode	@ltx/en_us_dedes/miscellanea:misc.Mode8
ltx/en_us_dedes/me.m11.d11:meMA.Ode8C24.ode	@ltx/en_us_dedes/miscellanea:misc.Ode8
ltx/en_us_dedes/me.m11.d11:meMA.Ode8C24.text	
ltx/en_us_dedes/me.m11.d11:meMA.Ode8C2T.incipit	…
ltx/en_us_dedes/me.m11.d11:meMA.Ode8C2T.melody	@ltx/en_us_dedes/he.h.m8:heHE.EptaplasiosKaminon.name
ltx/en_us_dedes/me.m11.d11:meMA.Ode8C2T.mode	@ltx/en_us_dedes/miscellanea:misc.Mode8
ltx/en_us_dedes/me.m11.d11:meMA.Ode8C2T.ode	@ltx/en_us_dedes/miscellanea:misc.Ode8
ltx/en_us_dedes/me.m11.d11:meMA.Ode8C2T.text	
ltx/en_us_dedes/me.m11.d11:meMA.Ode8H.greekmelody	@ltx/en_us_dedes/he.h.m8:heHE.EptaplasiosKaminon.greekname
ltx/en_us_dedes/me.m11.d11:meMA.Ode8H.incipit	@ltx/en_us_dedes/he.h.m8:heHE.EptaplasiosKaminon.incipit
ltx/en_us_dedes/me.m11.d11:meMA.Ode8H.melody	@ltx/en_us_dedes/he.h.m8:heHE.EptaplasiosKaminon.melody
ltx/en_us_dedes/me.m11.d11:meMA.Ode8H.mode	@ltx/en_us_dedes/miscellanea:misc.Mode8
ltx/en_us_dedes/me.m11.d11:meMA.Ode8H.ode	@ltx/en_us_dedes/miscellanea:misc.Ode8
ltx/en_us_dedes/me.m11.d11:meMA.Ode8H.text	@ltx/en_us_dedes/he.h.m8:heHE.EptaplasiosKaminon.text
ltx/en_us_dedes/me.m11.d11:meMA.Ode9C11.greekmelody	@ltx/en_us_dedes/he.h.m4:heHE.EvaMenToTisParakois.greekname
ltx/en_us_dedes/me.m11.d11:meMA.Ode9C11.incipit	…
ltx/en_us_dedes/me.m11.d11:meMA.Ode9C11.melody	@ltx/en_us_dedes/he.h.m4:heHE.EvaMenToTisParakois.name
ltx/en_us_dedes/me.m11.d11:meMA.Ode9C11.mode	@ltx/en_us_dedes/miscellanea:misc.Mode4
ltx/en_us_dedes/me.m11.d11:meMA.Ode9C11.ode	@ltx/en_us_dedes/miscellanea:misc.Ode9
ltx/en_us_dedes/me.m11.d11:meMA.Ode9C11.text	
ltx/en_us_dedes/me.m11.d11:meMA.Ode9C12.incipit	…
ltx/en_us_dedes/me.m11.d11:meMA.Ode9C12.melody	@ltx/en_us_dedes/he.h.m4:heHE.EvaMenToTisParakois.name
ltx/en_us_dedes/me.m11.d11:meMA.Ode9C12.mode	@ltx/en_us_dedes/miscellanea:misc.Mode4
ltx/en_us_dedes/me.m11.d11:meMA.Ode9C12.ode	@ltx/en_us_dedes/miscellanea:misc.Ode9
ltx/en_us_dedes/me.m11.d11:meMA.Ode9C12.text	
ltx/en_us_dedes/me.m11.d11:meMA.Ode9C13.incipit	…
ltx/en_us_dedes/me.m11.d11:meMA.Ode9C13.melody	@ltx/en_us_dedes/he.h.m4:heHE.EvaMenToTisParakois.name
ltx/en_us_dedes/me.m11.d11:meMA.Ode9C13.mode	@ltx/en_us_dedes/miscellanea:misc.Mode4
ltx/en_us_dedes/me.m11.d11:meMA.Ode9C13.ode	@ltx/en_us_dedes/miscellanea:misc.Ode9
ltx/en_us_dedes/me.m11.d11:meMA.Ode9C13.text	
ltx/en_us_dedes/me.m11.d11:meMA.Ode9C1T.incipit	…
ltx/en_us_dedes/me.m11.d11:meMA.Ode9C1T.melody	@ltx/en_us_dedes/he.h.m4:heHE.EvaMenToTisParakois.name
ltx/en_us_dedes/me.m11.d11:meMA.Ode9C1T.mode	@ltx/en_us_dedes/miscellanea:misc.Mode4
ltx/en_us_dedes/me.m11.d11:meMA.Ode9C1T.ode	@ltx/en_us_dedes/miscellanea:misc.Ode9
ltx/en_us_dedes/me.m11.d11:meMA.Ode9C1T.text	
ltx/en_us_dedes/me.m11.d11:meMA.Ode9C21.greekmelody	@ltx/en_us_dedes/he.h.m8:heHE.ExestiEpiTouto.greekname
ltx/en_us_dedes/me.m11.d11:meMA.Ode9C21.incipit	…
ltx/en_us_dedes/me.m11.d11:meMA.Ode9C21.melody	@ltx/en_us_dedes/he.h.m8:heHE.ExestiEpiTouto.name
ltx/en_us_dedes/me.m11.d11:meMA.Ode9C21.mode	@ltx/en_us_dedes/miscellanea:misc.Mode8
ltx/en_us_dedes/me.m11.d11:meMA.Ode9C21.ode	@ltx/en_us_dedes/miscellanea:misc.Ode9
ltx/en_us_dedes/me.m11.d11:meMA.Ode9C21.text	
ltx/en_us_dedes/me.m11.d11:meMA.Ode9C22.incipit	…
ltx/en_us_dedes/me.m11.d11:meMA.Ode9C22.melody	@ltx/en_us_dedes/he.h.m8:heHE.ExestiEpiTouto.name
ltx/en_us_dedes/me.m11.d11:meMA.Ode9C22.mode	@ltx/en_us_dedes/miscellanea:misc.Mode8
ltx/en_us_dedes/me.m11.d11:meMA.Ode9C22.ode	@ltx/en_us_dedes/miscellanea:misc.Ode9
ltx/en_us_dedes/me.m11.d11:meMA.Ode9C22.text	
ltx/en_us_dedes/me.m11.d11:meMA.Ode9C23.incipit	…
ltx/en_us_dedes/me.m11.d11:meMA.Ode9C23.melody	@ltx/en_us_dedes/he.h.m8:heHE.ExestiEpiTouto.name
ltx/en_us_dedes/me.m11.d11:meMA.Ode9C23.mode	@ltx/en_us_dedes/miscellanea:misc.Mode8
ltx/en_us_dedes/me.m11.d11:meMA.Ode9C23.ode	@ltx/en_us_dedes/miscellanea:misc.Ode9
ltx/en_us_dedes/me.m11.d11:meMA.Ode9C23.text	
ltx/en_us_dedes/me.m11.d11:meMA.Ode9C24.incipit	…
ltx/en_us_dedes/me.m11.d11:meMA.Ode9C24.melody	@ltx/en_us_dedes/he.h.m8:heHE.ExestiEpiTouto.name
ltx/en_us_dedes/me.m11.d11:meMA.Ode9C24.mode	@ltx/en_us_dedes/miscellanea:misc.Mode8
ltx/en_us_dedes/me.m11.d11:meMA.Ode9C24.ode	@ltx/en_us_dedes/miscellanea:misc.Ode9
ltx/en_us_dedes/me.m11.d11:meMA.Ode9C24.text	
ltx/en_us_dedes/me.m11.d11:meMA.Ode9C2T.incipit	…
ltx/en_us_dedes/me.m11.d11:meMA.Ode9C2T.melody	@ltx/en_us_dedes/he.h.m8:heHE.ExestiEpiTouto.name
ltx/en_us_dedes/me.m11.d11:meMA.Ode9C2T.mode	@ltx/en_us_dedes/miscellanea:misc.Mode8
ltx/en_us_dedes/me.m11.d11:meMA.Ode9C2T.ode	@ltx/en_us_dedes/miscellanea:misc.Ode9
ltx/en_us_dedes/me.m11.d11:meMA.Ode9C2T.text	
ltx/en_us_dedes/me.m11.d11:meMA.Ode9H.greekmelody	@ltx/en_us_dedes/he.h.m8:heHE.ExestiEpiTouto.greekname
ltx/en_us_dedes/me.m11.d11:meMA.Ode9H.incipit	@ltx/en_us_dedes/he.h.m8:heHE.ExestiEpiTouto.incipit
ltx/en_us_dedes/me.m11.d11:meMA.Ode9H.melody	@ltx/en_us_dedes/he.h.m8:heHE.ExestiEpiTouto.melody
ltx/en_us_dedes/me.m11.d11:meMA.Ode9H.mode	@ltx/en_us_dedes/miscellanea:misc.Mode8
ltx/en_us_dedes/me.m11.d11:meMA.Ode9H.ode	@ltx/en_us_dedes/miscellanea:misc.Ode9
ltx/en_us_dedes/me.m11.d11:meMA.Ode9H.text	@ltx/en_us_dedes/he.h.m8:heHE.ExestiEpiTouto.text
ltx/en_us_dedes/me.m11.d11:meMA.Oikos2.text	The memory of the Martyrs brings us great gladness, as it showcases their manliness in suffering and their triumph over enemies, by the bright and gentle grace of their confession. So come, all you lovers of feast-days, let us rejoice not with mere fleeting joy but with that which is better and more perfect, as we observe the memory of the holy athlete Menas, and as we receive the gift of release from the passions. The giver of this is Christ our God, the immortal crown of the Martyrs.
ltx/en_us_dedes/me.m11.d11:meVE.Apolytikion1ger.greekmelody	@ltx/en_us_dedes/he.a.m4:heAU.TachyProkatalave.greekname
ltx/en_us_dedes/me.m11.d11:meVE.Apolytikion1ger.incipit	…
ltx/en_us_dedes/me.m11.d11:meVE.Apolytikion1ger.melody	@ltx/en_us_dedes/he.a.m4:heAU.TachyProkatalave.name
ltx/en_us_dedes/me.m11.d11:meVE.Apolytikion1ger.mode	@ltx/en_us_dedes/miscellanea:misc.Mode4
ltx/en_us_dedes/me.m11.d11:meVE.Apolytikion1ger.poet	@ltx/en_us_dedes/poets:po.Gerasimou
ltx/en_us_dedes/me.m11.d11:meVE.Apolytikion1ger.text	
ltx/en_us_dedes/me.m11.d11:meVE.Apolytikion2ger.greekmelody	@ltx/en_us_dedes/he.a.m3:heAU.TheiasPisteos.greekname
ltx/en_us_dedes/me.m11.d11:meVE.Apolytikion2ger.incipit	…
ltx/en_us_dedes/me.m11.d11:meVE.Apolytikion2ger.melody	@ltx/en_us_dedes/he.a.m3:heAU.TheiasPisteos.name
ltx/en_us_dedes/me.m11.d11:meVE.Apolytikion2ger.mode	@ltx/en_us_dedes/miscellanea:misc.Mode3
ltx/en_us_dedes/me.m11.d11:meVE.Apolytikion2ger.poet	@ltx/en_us_dedes/poets:po.Gerasimou
ltx/en_us_dedes/me.m11.d11:meVE.Apolytikion2ger.text	
ltx/en_us_dedes/me.m11.d11:meVE.Apolytikion3ger.greekmelody	@ltx/en_us_dedes/he.a.m5:heAU.TonSynanarchonLogon.greekname
ltx/en_us_dedes/me.m11.d11:meVE.Apolytikion3ger.incipit	…
ltx/en_us_dedes/me.m11.d11:meVE.Apolytikion3ger.melody	@ltx/en_us_dedes/he.a.m5:heAU.TonSynanarchonLogon.name
ltx/en_us_dedes/me.m11.d11:meVE.Apolytikion3ger.mode	@ltx/en_us_dedes/miscellanea:misc.Mode5
ltx/en_us_dedes/me.m11.d11:meVE.Apolytikion3ger.poet	@ltx/en_us_dedes/poets:po.Gerasimou
ltx/en_us_dedes/me.m11.d11:meVE.Apolytikion3ger.text	
ltx/en_us_dedes/me.m11.d11:meVE.AposGlory.incipit	@ltx/en_us_dedes/me.m01.d15:meVE.AposGlory.incipit
ltx/en_us_dedes/me.m11.d11:meVE.AposGlory.melody	
ltx/en_us_dedes/me.m11.d11:meVE.AposGlory.mode	@ltx/en_us_dedes/miscellanea:misc.Mode6
ltx/en_us_dedes/me.m11.d11:meVE.AposGlory.text	@ltx/en_us_dedes/me.m01.d15:meVE.AposGlory.text
ltx/en_us_dedes/me.m11.d11:meVE.AposStavrotheotokion.greekmelody	@ltx/en_us_dedes/he.a.m6:heAU.TriimerosAnestis.greekname
ltx/en_us_dedes/me.m11.d11:meVE.AposStavrotheotokion.incipit	@ltx/en_us_dedes/oc.m6.d4:ocVE.AposTheotokion.incipit
ltx/en_us_dedes/me.m11.d11:meVE.AposStavrotheotokion.melody	@ltx/en_us_dedes/he.a.m6:heAU.TriimerosAnestis.name
ltx/en_us_dedes/me.m11.d11:meVE.AposStavrotheotokion.mode	@ltx/en_us_dedes/miscellanea:misc.Mode6
ltx/en_us_dedes/me.m11.d11:meVE.AposStavrotheotokion.text	@ltx/en_us_dedes/oc.m6.d4:ocVE.AposTheotokion.text
ltx/en_us_dedes/me.m11.d11:meVE.AposTheotokion.greekmelody	@ltx/en_us_dedes/he.a.m6:heAU.TriimerosAnestis.greekname
ltx/en_us_dedes/me.m11.d11:meVE.AposTheotokion.incipit	@ltx/en_us_dedes/me.m07.d08:meVE.SticTheotokion.incipit
ltx/en_us_dedes/me.m11.d11:meVE.AposTheotokion.melody	@ltx/en_us_dedes/he.a.m6:heAU.TriimerosAnestis.name
ltx/en_us_dedes/me.m11.d11:meVE.AposTheotokion.mode	@ltx/en_us_dedes/miscellanea:misc.Mode6
ltx/en_us_dedes/me.m11.d11:meVE.AposTheotokion.text	@ltx/en_us_dedes/me.m07.d08:meVE.SticTheotokion.text
ltx/en_us_dedes/me.m11.d11:meVE.Aposticha1.greekmelody	@ltx/en_us_dedes/he.a.m4:heAU.OsGennaionEnMartysi.greekname
ltx/en_us_dedes/me.m11.d11:meVE.Aposticha1.incipit	Even though you were pierced…
ltx/en_us_dedes/me.m11.d11:meVE.Aposticha1.melody	@ltx/en_us_dedes/he.a.m4:heAU.OsGennaionEnMartysi.name
ltx/en_us_dedes/me.m11.d11:meVE.Aposticha1.mode	@ltx/en_us_dedes/miscellanea:misc.Mode4
ltx/en_us_dedes/me.m11.d11:meVE.Aposticha1.text	Even though you were pierced with spikes * and were beaten with leather whips, * even though your body was burned up in the fire, * still you, O Martyr, did not succumb * in thought, nor did you renounce * the salvific name of Christ, * nor to idols made sacrifice, * but instead became * of your own will a pure and perfect sacrifice and off’ring to your Master, * O Saint Menas, by your martyrdom.
ltx/en_us_dedes/me.m11.d11:meVE.Aposticha2.incipit	While they plucked out your…
ltx/en_us_dedes/me.m11.d11:meVE.Aposticha2.melody	@ltx/en_us_dedes/he.a.m4:heAU.OsGennaionEnMartysi.name
ltx/en_us_dedes/me.m11.d11:meVE.Aposticha2.mode	@ltx/en_us_dedes/miscellanea:misc.Mode4
ltx/en_us_dedes/me.m11.d11:meVE.Aposticha2.text	While they plucked out your eyes, O Saint, * and suspended you from a tree, * and with torches burned every member of your flesh, * and by the judge’s severe decree * they severed your ligaments * and decapitated you * with a sword, O most glorious * Victor, you rejoiced, * as a Prize-winning Martyr of the Savior; by the working of the Spirit * you have defeated the enemy.
ltx/en_us_dedes/me.m11.d11:meVE.Aposticha3.incipit	O much suffering Stephanie, *…
ltx/en_us_dedes/me.m11.d11:meVE.Aposticha3.melody	@ltx/en_us_dedes/he.a.m4:heAU.OsGennaionEnMartysi.name
ltx/en_us_dedes/me.m11.d11:meVE.Aposticha3.mode	@ltx/en_us_dedes/miscellanea:misc.Mode4
ltx/en_us_dedes/me.m11.d11:meVE.Aposticha3.text	O much suffering Stephanie, * you were crowned by the Lord of all * with the crown of grace for surrendering yourself * of your own will so courageously * to tortures of every kind. * When they fastened you to two * trees and when they dismembered you, * then you flew to God * like a sparrow and left your holy body in the hunters’ hands, O Martyr * worthy of honor and dignity.
ltx/en_us_dedes/me.m11.d11:meVE.MM.GeneralApolytikion2.text	@ltx/en_us_dedes/properties:media.key
ltx/en_us_dedes/me.m11.d11:meVE.SticGlory.incipit	Once again, the annual memory…
ltx/en_us_dedes/me.m11.d11:meVE.SticGlory.melody	
ltx/en_us_dedes/me.m11.d11:meVE.SticGlory.mode	@ltx/en_us_dedes/miscellanea:misc.Mode6
ltx/en_us_dedes/me.m11.d11:meVE.SticGlory.poet	@ltx/en_us_dedes/poets:po.Vyzantiou
ltx/en_us_dedes/me.m11.d11:meVE.SticGlory.text	Once again, the annual memory of those luminaries of the world has risen, namely of Menas and Victor and Vincent. Their feast day illumines the hearts of the believers, with their contests and crucifixion for the sake of Christ. Therefore let us sing hymns in honor of Christ our God, who has crowned them with glory and honor.
ltx/en_us_dedes/me.m11.d11:meVE.SticStavrotheotokion.greekmelody	@ltx/en_us_dedes/he.a.m6:heAU.TriimerosAnestis.greekname
ltx/en_us_dedes/me.m11.d11:meVE.SticStavrotheotokion.incipit	@ltx/en_us_dedes/me.m01.d21:meVE.SticStavrotheotokion.incipit
ltx/en_us_dedes/me.m11.d11:meVE.SticStavrotheotokion.melody	@ltx/en_us_dedes/he.a.m6:heAU.TriimerosAnestis.name
ltx/en_us_dedes/me.m11.d11:meVE.SticStavrotheotokion.mode	@ltx/en_us_dedes/miscellanea:misc.Mode6
ltx/en_us_dedes/me.m11.d11:meVE.SticStavrotheotokion.text	@ltx/en_us_dedes/me.m01.d21:meVE.SticStavrotheotokion.text
ltx/en_us_dedes/me.m11.d11:meVE.SticTheotokion.greekmelody	@ltx/en_us_dedes/he.a.m6:heAU.TriimerosAnestis.greekname
ltx/en_us_dedes/me.m11.d11:meVE.SticTheotokion.incipit	@ltx/en_us_dedes/oc.m6.d5:ocMA.AposTheotokion.incipit
ltx/en_us_dedes/me.m11.d11:meVE.SticTheotokion.melody	@ltx/en_us_dedes/he.a.m6:heAU.TriimerosAnestis.name
ltx/en_us_dedes/me.m11.d11:meVE.SticTheotokion.mode	@ltx/en_us_dedes/miscellanea:misc.Mode6
ltx/en_us_dedes/me.m11.d11:meVE.SticTheotokion.text	@ltx/en_us_dedes/oc.m6.d5:ocMA.AposTheotokion.text
ltx/en_us_dedes/me.m11.d11:meVE.Stichera01.greekmelody	@ltx/en_us_dedes/he.a.m8:heAU.OTouParadoxou.greekname
ltx/en_us_dedes/me.m11.d11:meVE.Stichera01.incipit	In imitating the Passion of…
ltx/en_us_dedes/me.m11.d11:meVE.Stichera01.melody	@ltx/en_us_dedes/he.a.m8:heAU.OTouParadoxou.name
ltx/en_us_dedes/me.m11.d11:meVE.Stichera01.mode	@ltx/en_us_dedes/miscellanea:misc.Mode8
ltx/en_us_dedes/me.m11.d11:meVE.Stichera01.text	In imitating the Passion of the Lord impassible, * you went forth like a sheep to be * slaughtered voluntarily, * O all-lauded and medaled Saint. * The rulers’ anger did not make you afraid. * Bodily tortures did not cause you to faint. * Such were your sacred feats! * Such was your prolonged resistance! Whereby you * cast the proud one to the ground, O holy Martyr Menas.
ltx/en_us_dedes/me.m11.d11:meVE.Stichera02.incipit	Flogged and whipped with scourges…
ltx/en_us_dedes/me.m11.d11:meVE.Stichera02.melody	@ltx/en_us_dedes/he.a.m8:heAU.OTouParadoxou.name
ltx/en_us_dedes/me.m11.d11:meVE.Stichera02.mode	@ltx/en_us_dedes/miscellanea:misc.Mode8
ltx/en_us_dedes/me.m11.d11:meVE.Stichera02.text	Flogged and whipped with scourges, you were flayed, * and you were hung on a cross, * like your Master and Lord of old. * You were beaten everywhere * on your body with metal rods, * and yet you never renounced the name of Christ, * having the eyes of your soul focused on Him. * And as you gazed at Him * so intensely, you were able to endure * every torment of your flesh, O blessed St. Menas.
ltx/en_us_dedes/me.m11.d11:meVE.Stichera03.incipit	Martyr Menas, now extolled by…
ltx/en_us_dedes/me.m11.d11:meVE.Stichera03.melody	@ltx/en_us_dedes/he.a.m8:heAU.OTouParadoxou.name
ltx/en_us_dedes/me.m11.d11:meVE.Stichera03.mode	@ltx/en_us_dedes/miscellanea:misc.Mode8
ltx/en_us_dedes/me.m11.d11:meVE.Stichera03.text	Martyr Menas, now extolled by all, in your intense love for Christ, * you withdrew from mundane pursuits, * darkness and impiety * of the pagan society. * You quit your service in military corps, * and you were numbered instead among the ranks * of the elect of God. * Thus, O Martyr, in competing for His sake, * you were clearly shown to be indeed invincible.
ltx/en_us_dedes/me.m11.d11:meVE.Stichera04.greekmelody	@ltx/en_us_dedes/he.a.m8:heAU.OTouParadoxou.greekname
ltx/en_us_dedes/me.m11.d11:meVE.Stichera04.incipit	Father, your name is appropriate…
ltx/en_us_dedes/me.m11.d11:meVE.Stichera04.melody	@ltx/en_us_dedes/he.a.m8:heAU.OTouParadoxou.name
ltx/en_us_dedes/me.m11.d11:meVE.Stichera04.mode	@ltx/en_us_dedes/miscellanea:misc.Mode8
ltx/en_us_dedes/me.m11.d11:meVE.Stichera04.text	Father, your name is appropriate, for it means gift of God. * You received the ineffable * gifts from heaven, which you then * shared with those who desired them. * You multiplied your talent, O Theodore; * then, O devout Saint, you heard the blessed voice, * “Enter into the joy * of the Master’s bridal hall”; wherein you now * appear standing near the throne of God the King of all.
ltx/en_us_dedes/me.m11.d11:meVE.Stichera05.incipit	Father of fathers, St. Theodore…
ltx/en_us_dedes/me.m11.d11:meVE.Stichera05.melody	@ltx/en_us_dedes/he.a.m8:heAU.OTouParadoxou.name
ltx/en_us_dedes/me.m11.d11:meVE.Stichera05.mode	@ltx/en_us_dedes/miscellanea:misc.Mode8
ltx/en_us_dedes/me.m11.d11:meVE.Stichera05.text	Father of fathers, St. Theodore, you led a countless host * of monastics to Christ our God. * They attributed to you * their salvation, O Christ-like Saint. * Your sound instructions made you illustrious, * and your protection of souls made you renowned. * You were shown forth to be * an all-wise prophetic mouthpiece of the Lord. * Standing near Him as you do, remember us, we pray.
ltx/en_us_dedes/me.m11.d11:meVE.Stichera06.incipit	All-wise holy mystic Theodore, the…
ltx/en_us_dedes/me.m11.d11:meVE.Stichera06.melody	@ltx/en_us_dedes/he.a.m8:heAU.OTouParadoxou.name
ltx/en_us_dedes/me.m11.d11:meVE.Stichera06.mode	@ltx/en_us_dedes/miscellanea:misc.Mode8
ltx/en_us_dedes/me.m11.d11:meVE.Stichera06.text	All-wise holy mystic Theodore, the Spirit’s grace clearly poured * on your lips most abundantly, * and it made of you a source * of instruction inspired by God, * a staunch defender of true and right beliefs, * mighty confessor and advocate of truth, * pillar and bulwark of * the all-holy and divine Orthodox Faith, * and a model and the rule of the monastic life.
