ltx/en_us_dedes/me.m03.d20:meDA.commemoration.first	Memory of our Devout Fathers who were killed in the Monastery of St. Savas
ltx/en_us_dedes/me.m03.d20:meDA.commemoration.first_name	
ltx/en_us_dedes/me.m03.d20:meDA.commemoration.first_short	Memory of our Devout Fathers who were killed in the Monastery of St. Savas
ltx/en_us_dedes/me.m03.d20:meDA.commemoration.first_title	@ltx/en_us_dedes/titles:ti.Saints
ltx/en_us_dedes/me.m03.d20:meDA.commemoration.full	Memory of our Devout Fathers who were killed in the Monastery of St. Savas
ltx/en_us_dedes/me.m03.d20:meDA.commemoration.second_name	
ltx/en_us_dedes/me.m03.d20:meDA.commemoration.second_title	
ltx/en_us_dedes/me.m03.d20:meDA.date	March 20
ltx/en_us_dedes/me.m03.d20:meDA.fordate	for March 20
ltx/en_us_dedes/me.m03.d20:meDA.insert1	
ltx/en_us_dedes/me.m03.d20:meDA.insert2	
ltx/en_us_dedes/me.m03.d20:meDA.note	
ltx/en_us_dedes/me.m03.d20:meDA.pdfcoverdate	March 20,
ltx/en_us_dedes/me.m03.d20:meDA.pdfheaderdate	March 20
ltx/en_us_dedes/me.m03.d20:meHO.commemorations	
ltx/en_us_dedes/me.m03.d20:meHO.note1	
ltx/en_us_dedes/me.m03.d20:meHO.note2	
ltx/en_us_dedes/me.m03.d20:meHO.number	
ltx/en_us_dedes/me.m03.d20:meHO.rank	
ltx/en_us_dedes/me.m03.d20:meLE.commemoration1	Memory of our Devout Fathers who were killed in the Monastery of St. Savas.
ltx/en_us_dedes/me.m03.d20:meLE.commemoration2	
ltx/en_us_dedes/me.m03.d20:meLI.Kontakion1.incipit	@ltx/en_us_dedes/me.m03.d20:meMA.Kontakion1ger.incipit
ltx/en_us_dedes/me.m03.d20:meLI.Kontakion1.melody	@ltx/en_us_dedes/me.m03.d20:meMA.Kontakion1ger.melody
ltx/en_us_dedes/me.m03.d20:meLI.Kontakion1.mode	@ltx/en_us_dedes/me.m03.d20:meMA.Kontakion1ger.mode
ltx/en_us_dedes/me.m03.d20:meLI.Kontakion1.text	@ltx/en_us_dedes/me.m03.d20:meMA.Kontakion1ger.text
ltx/en_us_dedes/me.m03.d20:meLI.Megalynarion.text	
ltx/en_us_dedes/me.m03.d20:meMA.C1.acrostic.notice1	
ltx/en_us_dedes/me.m03.d20:meMA.C1.acrostic.text	
ltx/en_us_dedes/me.m03.d20:meMA.C1.acrostic.title	
ltx/en_us_dedes/me.m03.d20:meMA.C1.poet	@ltx/en_us_dedes/poets:po.StefanouTouSavaitou
ltx/en_us_dedes/me.m03.d20:meMA.C1.title	@ltx/en_us_dedes/titles:ti.CanonSaints
ltx/en_us_dedes/me.m03.d20:meMA.C1.verse	@ltx/en_us_dedes/prayers:pr.verse_SaintsM.text
ltx/en_us_dedes/me.m03.d20:meMA.Kontakion1ger.incipit	…
ltx/en_us_dedes/me.m03.d20:meMA.Kontakion1ger.melody	@ltx/en_us_dedes/he.a.m6:heAU.TinEnPresveiais.name
ltx/en_us_dedes/me.m03.d20:meMA.Kontakion1ger.mode	@ltx/en_us_dedes/miscellanea:misc.Mode2
ltx/en_us_dedes/me.m03.d20:meMA.Kontakion1ger.poet	@ltx/en_us_dedes/poets:po.Gerasimou
ltx/en_us_dedes/me.m03.d20:meMA.Kontakion1ger.text	
ltx/en_us_dedes/me.m03.d20:meMA.Ode1C11.greekmelody	@ltx/en_us_dedes/he.h.m8:heHE.AsmaAnapempsomen.greekname
ltx/en_us_dedes/me.m03.d20:meMA.Ode1C11.incipit	…
ltx/en_us_dedes/me.m03.d20:meMA.Ode1C11.melody	@ltx/en_us_dedes/he.h.m8:heHE.AsmaAnapempsomen.name
ltx/en_us_dedes/me.m03.d20:meMA.Ode1C11.mode	@ltx/en_us_dedes/miscellanea:misc.Mode8
ltx/en_us_dedes/me.m03.d20:meMA.Ode1C11.ode	@ltx/en_us_dedes/miscellanea:misc.Ode1
ltx/en_us_dedes/me.m03.d20:meMA.Ode1C11.text	
ltx/en_us_dedes/me.m03.d20:meMA.Ode1C12.incipit	…
ltx/en_us_dedes/me.m03.d20:meMA.Ode1C12.melody	@ltx/en_us_dedes/he.h.m8:heHE.AsmaAnapempsomen.name
ltx/en_us_dedes/me.m03.d20:meMA.Ode1C12.mode	@ltx/en_us_dedes/miscellanea:misc.Mode8
ltx/en_us_dedes/me.m03.d20:meMA.Ode1C12.ode	@ltx/en_us_dedes/miscellanea:misc.Ode1
ltx/en_us_dedes/me.m03.d20:meMA.Ode1C12.text	
ltx/en_us_dedes/me.m03.d20:meMA.Ode1C13.incipit	…
ltx/en_us_dedes/me.m03.d20:meMA.Ode1C13.melody	@ltx/en_us_dedes/he.h.m8:heHE.AsmaAnapempsomen.name
ltx/en_us_dedes/me.m03.d20:meMA.Ode1C13.mode	@ltx/en_us_dedes/miscellanea:misc.Mode8
ltx/en_us_dedes/me.m03.d20:meMA.Ode1C13.ode	@ltx/en_us_dedes/miscellanea:misc.Ode1
ltx/en_us_dedes/me.m03.d20:meMA.Ode1C13.text	
ltx/en_us_dedes/me.m03.d20:meMA.Ode1C1H.greekmelody	@ltx/en_us_dedes/he.h.m8:heHE.AsmaAnapempsomen.greekname
ltx/en_us_dedes/me.m03.d20:meMA.Ode1C1H.incipit	@ltx/en_us_dedes/he.h.m8:heHE.AsmaAnapempsomen.incipit
ltx/en_us_dedes/me.m03.d20:meMA.Ode1C1H.melody	@ltx/en_us_dedes/he.h.m8:heHE.AsmaAnapempsomen.melody
ltx/en_us_dedes/me.m03.d20:meMA.Ode1C1H.mode	@ltx/en_us_dedes/miscellanea:misc.Mode8
ltx/en_us_dedes/me.m03.d20:meMA.Ode1C1H.ode	@ltx/en_us_dedes/miscellanea:misc.Ode1
ltx/en_us_dedes/me.m03.d20:meMA.Ode1C1H.text	@ltx/en_us_dedes/he.h.m8:heHE.AsmaAnapempsomen.text
ltx/en_us_dedes/me.m03.d20:meMA.Ode1C1T.incipit	…
ltx/en_us_dedes/me.m03.d20:meMA.Ode1C1T.melody	@ltx/en_us_dedes/he.h.m8:heHE.AsmaAnapempsomen.name
ltx/en_us_dedes/me.m03.d20:meMA.Ode1C1T.mode	@ltx/en_us_dedes/miscellanea:misc.Mode8
ltx/en_us_dedes/me.m03.d20:meMA.Ode1C1T.ode	@ltx/en_us_dedes/miscellanea:misc.Ode1
ltx/en_us_dedes/me.m03.d20:meMA.Ode1C1T.text	
ltx/en_us_dedes/me.m03.d20:meMA.Ode3C11.greekmelody	@ltx/en_us_dedes/he.h.m8:heHE.OuraniasApsidos.greekname
ltx/en_us_dedes/me.m03.d20:meMA.Ode3C11.incipit	…
ltx/en_us_dedes/me.m03.d20:meMA.Ode3C11.melody	@ltx/en_us_dedes/he.h.m8:heHE.OuraniasApsidos.name
ltx/en_us_dedes/me.m03.d20:meMA.Ode3C11.mode	@ltx/en_us_dedes/miscellanea:misc.Mode8
ltx/en_us_dedes/me.m03.d20:meMA.Ode3C11.ode	@ltx/en_us_dedes/miscellanea:misc.Ode3
ltx/en_us_dedes/me.m03.d20:meMA.Ode3C11.text	
ltx/en_us_dedes/me.m03.d20:meMA.Ode3C12.incipit	…
ltx/en_us_dedes/me.m03.d20:meMA.Ode3C12.melody	@ltx/en_us_dedes/he.h.m8:heHE.OuraniasApsidos.name
ltx/en_us_dedes/me.m03.d20:meMA.Ode3C12.mode	@ltx/en_us_dedes/miscellanea:misc.Mode8
ltx/en_us_dedes/me.m03.d20:meMA.Ode3C12.ode	@ltx/en_us_dedes/miscellanea:misc.Ode3
ltx/en_us_dedes/me.m03.d20:meMA.Ode3C12.text	
ltx/en_us_dedes/me.m03.d20:meMA.Ode3C13.incipit	…
ltx/en_us_dedes/me.m03.d20:meMA.Ode3C13.melody	@ltx/en_us_dedes/he.h.m8:heHE.OuraniasApsidos.name
ltx/en_us_dedes/me.m03.d20:meMA.Ode3C13.mode	@ltx/en_us_dedes/miscellanea:misc.Mode8
ltx/en_us_dedes/me.m03.d20:meMA.Ode3C13.ode	@ltx/en_us_dedes/miscellanea:misc.Ode3
ltx/en_us_dedes/me.m03.d20:meMA.Ode3C13.text	
ltx/en_us_dedes/me.m03.d20:meMA.Ode3C1H.greekmelody	@ltx/en_us_dedes/he.h.m8:heHE.OuraniasApsidos.greekname
ltx/en_us_dedes/me.m03.d20:meMA.Ode3C1H.incipit	@ltx/en_us_dedes/he.h.m8:heHE.OuraniasApsidos.incipit
ltx/en_us_dedes/me.m03.d20:meMA.Ode3C1H.melody	@ltx/en_us_dedes/he.h.m8:heHE.OuraniasApsidos.melody
ltx/en_us_dedes/me.m03.d20:meMA.Ode3C1H.mode	@ltx/en_us_dedes/miscellanea:misc.Mode8
ltx/en_us_dedes/me.m03.d20:meMA.Ode3C1H.ode	@ltx/en_us_dedes/miscellanea:misc.Ode3
ltx/en_us_dedes/me.m03.d20:meMA.Ode3C1H.text	@ltx/en_us_dedes/he.h.m8:heHE.OuraniasApsidos.text
ltx/en_us_dedes/me.m03.d20:meMA.Ode3C1T.incipit	…
ltx/en_us_dedes/me.m03.d20:meMA.Ode3C1T.melody	@ltx/en_us_dedes/he.h.m8:heHE.OuraniasApsidos.name
ltx/en_us_dedes/me.m03.d20:meMA.Ode3C1T.mode	@ltx/en_us_dedes/miscellanea:misc.Mode8
ltx/en_us_dedes/me.m03.d20:meMA.Ode3C1T.ode	@ltx/en_us_dedes/miscellanea:misc.Ode3
ltx/en_us_dedes/me.m03.d20:meMA.Ode3C1T.text	
ltx/en_us_dedes/me.m03.d20:meMA.Ode3Kathisma1.greekmelody	@ltx/en_us_dedes/he.a.m8:heAU.ToProstachthen.greekname
ltx/en_us_dedes/me.m03.d20:meMA.Ode3Kathisma1.incipit	…
ltx/en_us_dedes/me.m03.d20:meMA.Ode3Kathisma1.melody	@ltx/en_us_dedes/he.a.m8:heAU.ToProstachthen.name
ltx/en_us_dedes/me.m03.d20:meMA.Ode3Kathisma1.mode	@ltx/en_us_dedes/miscellanea:misc.Mode8
ltx/en_us_dedes/me.m03.d20:meMA.Ode3Kathisma1.text	
ltx/en_us_dedes/me.m03.d20:meMA.Ode3KathismaSt.incipit	…
ltx/en_us_dedes/me.m03.d20:meMA.Ode3KathismaSt.melody	@ltx/en_us_dedes/he.a.m8:heAU.ToProstachthen.name
ltx/en_us_dedes/me.m03.d20:meMA.Ode3KathismaSt.mode	@ltx/en_us_dedes/miscellanea:misc.Mode8
ltx/en_us_dedes/me.m03.d20:meMA.Ode3KathismaSt.text	
ltx/en_us_dedes/me.m03.d20:meMA.Ode3KathismaT.incipit	@ltx/en_us_dedes/me.m11.d08:meMA.Kathisma3T.incipit
ltx/en_us_dedes/me.m03.d20:meMA.Ode3KathismaT.melody	@ltx/en_us_dedes/he.a.m8:heAU.ToProstachthen.name
ltx/en_us_dedes/me.m03.d20:meMA.Ode3KathismaT.mode	@ltx/en_us_dedes/miscellanea:misc.Mode8
ltx/en_us_dedes/me.m03.d20:meMA.Ode3KathismaT.text	@ltx/en_us_dedes/me.m11.d08:meMA.Kathisma3T.text
ltx/en_us_dedes/me.m03.d20:meMA.Ode4C11.greekmelody	@ltx/en_us_dedes/he.h.m8:heHE.EpevisEfIppous.greekname
ltx/en_us_dedes/me.m03.d20:meMA.Ode4C11.incipit	…
ltx/en_us_dedes/me.m03.d20:meMA.Ode4C11.melody	@ltx/en_us_dedes/he.h.m8:heHE.EpevisEfIppous.name
ltx/en_us_dedes/me.m03.d20:meMA.Ode4C11.mode	@ltx/en_us_dedes/miscellanea:misc.Mode8
ltx/en_us_dedes/me.m03.d20:meMA.Ode4C11.ode	@ltx/en_us_dedes/miscellanea:misc.Ode4
ltx/en_us_dedes/me.m03.d20:meMA.Ode4C11.text	
ltx/en_us_dedes/me.m03.d20:meMA.Ode4C12.incipit	…
ltx/en_us_dedes/me.m03.d20:meMA.Ode4C12.melody	@ltx/en_us_dedes/he.h.m8:heHE.EpevisEfIppous.name
ltx/en_us_dedes/me.m03.d20:meMA.Ode4C12.mode	@ltx/en_us_dedes/miscellanea:misc.Mode8
ltx/en_us_dedes/me.m03.d20:meMA.Ode4C12.ode	@ltx/en_us_dedes/miscellanea:misc.Ode4
ltx/en_us_dedes/me.m03.d20:meMA.Ode4C12.text	
ltx/en_us_dedes/me.m03.d20:meMA.Ode4C13.incipit	…
ltx/en_us_dedes/me.m03.d20:meMA.Ode4C13.melody	@ltx/en_us_dedes/he.h.m8:heHE.EpevisEfIppous.name
ltx/en_us_dedes/me.m03.d20:meMA.Ode4C13.mode	@ltx/en_us_dedes/miscellanea:misc.Mode8
ltx/en_us_dedes/me.m03.d20:meMA.Ode4C13.ode	@ltx/en_us_dedes/miscellanea:misc.Ode4
ltx/en_us_dedes/me.m03.d20:meMA.Ode4C13.text	
ltx/en_us_dedes/me.m03.d20:meMA.Ode4C14.incipit	…
ltx/en_us_dedes/me.m03.d20:meMA.Ode4C14.melody	@ltx/en_us_dedes/he.h.m8:heHE.EpevisEfIppous.name
ltx/en_us_dedes/me.m03.d20:meMA.Ode4C14.mode	@ltx/en_us_dedes/miscellanea:misc.Mode8
ltx/en_us_dedes/me.m03.d20:meMA.Ode4C14.ode	@ltx/en_us_dedes/miscellanea:misc.Ode4
ltx/en_us_dedes/me.m03.d20:meMA.Ode4C14.text	
ltx/en_us_dedes/me.m03.d20:meMA.Ode4C15.incipit	…
ltx/en_us_dedes/me.m03.d20:meMA.Ode4C15.melody	@ltx/en_us_dedes/he.h.m8:heHE.EpevisEfIppous.name
ltx/en_us_dedes/me.m03.d20:meMA.Ode4C15.mode	@ltx/en_us_dedes/miscellanea:misc.Mode8
ltx/en_us_dedes/me.m03.d20:meMA.Ode4C15.ode	@ltx/en_us_dedes/miscellanea:misc.Ode4
ltx/en_us_dedes/me.m03.d20:meMA.Ode4C15.text	
ltx/en_us_dedes/me.m03.d20:meMA.Ode4C16.incipit	…
ltx/en_us_dedes/me.m03.d20:meMA.Ode4C16.melody	@ltx/en_us_dedes/he.h.m8:heHE.EpevisEfIppous.name
ltx/en_us_dedes/me.m03.d20:meMA.Ode4C16.mode	@ltx/en_us_dedes/miscellanea:misc.Mode8
ltx/en_us_dedes/me.m03.d20:meMA.Ode4C16.ode	@ltx/en_us_dedes/miscellanea:misc.Ode4
ltx/en_us_dedes/me.m03.d20:meMA.Ode4C16.text	
ltx/en_us_dedes/me.m03.d20:meMA.Ode4C1H.greekmelody	@ltx/en_us_dedes/he.h.m8:heHE.EpevisEfIppous.greekname
ltx/en_us_dedes/me.m03.d20:meMA.Ode4C1H.incipit	@ltx/en_us_dedes/he.h.m8:heHE.EpevisEfIppous.incipit
ltx/en_us_dedes/me.m03.d20:meMA.Ode4C1H.melody	@ltx/en_us_dedes/he.h.m8:heHE.EpevisEfIppous.melody
ltx/en_us_dedes/me.m03.d20:meMA.Ode4C1H.mode	@ltx/en_us_dedes/miscellanea:misc.Mode8
ltx/en_us_dedes/me.m03.d20:meMA.Ode4C1H.ode	@ltx/en_us_dedes/miscellanea:misc.Ode4
ltx/en_us_dedes/me.m03.d20:meMA.Ode4C1H.text	@ltx/en_us_dedes/he.h.m8:heHE.EpevisEfIppous.text
ltx/en_us_dedes/me.m03.d20:meMA.Ode4C1T.incipit	…
ltx/en_us_dedes/me.m03.d20:meMA.Ode4C1T.melody	@ltx/en_us_dedes/he.h.m8:heHE.EpevisEfIppous.name
ltx/en_us_dedes/me.m03.d20:meMA.Ode4C1T.mode	@ltx/en_us_dedes/miscellanea:misc.Mode8
ltx/en_us_dedes/me.m03.d20:meMA.Ode4C1T.ode	@ltx/en_us_dedes/miscellanea:misc.Ode4
ltx/en_us_dedes/me.m03.d20:meMA.Ode4C1T.text	
ltx/en_us_dedes/me.m03.d20:meMA.Ode5C11.greekmelody	@ltx/en_us_dedes/he.h.m8:heHE.InaTiMeAposo.greekname
ltx/en_us_dedes/me.m03.d20:meMA.Ode5C11.incipit	…
ltx/en_us_dedes/me.m03.d20:meMA.Ode5C11.melody	@ltx/en_us_dedes/he.h.m8:heHE.InaTiMeAposo.name
ltx/en_us_dedes/me.m03.d20:meMA.Ode5C11.mode	@ltx/en_us_dedes/miscellanea:misc.Mode8
ltx/en_us_dedes/me.m03.d20:meMA.Ode5C11.ode	@ltx/en_us_dedes/miscellanea:misc.Ode5
ltx/en_us_dedes/me.m03.d20:meMA.Ode5C11.text	
ltx/en_us_dedes/me.m03.d20:meMA.Ode5C12.incipit	…
ltx/en_us_dedes/me.m03.d20:meMA.Ode5C12.melody	@ltx/en_us_dedes/he.h.m8:heHE.InaTiMeAposo.name
ltx/en_us_dedes/me.m03.d20:meMA.Ode5C12.mode	@ltx/en_us_dedes/miscellanea:misc.Mode8
ltx/en_us_dedes/me.m03.d20:meMA.Ode5C12.ode	@ltx/en_us_dedes/miscellanea:misc.Ode5
ltx/en_us_dedes/me.m03.d20:meMA.Ode5C12.text	
ltx/en_us_dedes/me.m03.d20:meMA.Ode5C13.incipit	…
ltx/en_us_dedes/me.m03.d20:meMA.Ode5C13.melody	@ltx/en_us_dedes/he.h.m8:heHE.InaTiMeAposo.name
ltx/en_us_dedes/me.m03.d20:meMA.Ode5C13.mode	@ltx/en_us_dedes/miscellanea:misc.Mode8
ltx/en_us_dedes/me.m03.d20:meMA.Ode5C13.ode	@ltx/en_us_dedes/miscellanea:misc.Ode5
ltx/en_us_dedes/me.m03.d20:meMA.Ode5C13.text	
ltx/en_us_dedes/me.m03.d20:meMA.Ode5C1H.greekmelody	@ltx/en_us_dedes/he.h.m8:heHE.InaTiMeAposo.greekname
ltx/en_us_dedes/me.m03.d20:meMA.Ode5C1H.incipit	@ltx/en_us_dedes/he.h.m8:heHE.InaTiMeAposo.incipit
ltx/en_us_dedes/me.m03.d20:meMA.Ode5C1H.melody	@ltx/en_us_dedes/he.h.m8:heHE.InaTiMeAposo.melody
ltx/en_us_dedes/me.m03.d20:meMA.Ode5C1H.mode	@ltx/en_us_dedes/miscellanea:misc.Mode8
ltx/en_us_dedes/me.m03.d20:meMA.Ode5C1H.ode	@ltx/en_us_dedes/miscellanea:misc.Ode5
ltx/en_us_dedes/me.m03.d20:meMA.Ode5C1H.text	@ltx/en_us_dedes/he.h.m8:heHE.InaTiMeAposo.text
ltx/en_us_dedes/me.m03.d20:meMA.Ode5C1T.incipit	…
ltx/en_us_dedes/me.m03.d20:meMA.Ode5C1T.melody	@ltx/en_us_dedes/he.h.m8:heHE.InaTiMeAposo.name
ltx/en_us_dedes/me.m03.d20:meMA.Ode5C1T.mode	@ltx/en_us_dedes/miscellanea:misc.Mode8
ltx/en_us_dedes/me.m03.d20:meMA.Ode5C1T.ode	@ltx/en_us_dedes/miscellanea:misc.Ode5
ltx/en_us_dedes/me.m03.d20:meMA.Ode5C1T.text	
ltx/en_us_dedes/me.m03.d20:meMA.Ode6C11.greekmelody	@ltx/en_us_dedes/he.h.m8:heHE.ProsTonDynamenonSozein.greekname
ltx/en_us_dedes/me.m03.d20:meMA.Ode6C11.incipit	…
ltx/en_us_dedes/me.m03.d20:meMA.Ode6C11.melody	@ltx/en_us_dedes/he.h.m8:heHE.ProsTonDynamenonSozein.name
ltx/en_us_dedes/me.m03.d20:meMA.Ode6C11.mode	@ltx/en_us_dedes/miscellanea:misc.Mode8
ltx/en_us_dedes/me.m03.d20:meMA.Ode6C11.ode	@ltx/en_us_dedes/miscellanea:misc.Ode6
ltx/en_us_dedes/me.m03.d20:meMA.Ode6C11.text	
ltx/en_us_dedes/me.m03.d20:meMA.Ode6C12.incipit	…
ltx/en_us_dedes/me.m03.d20:meMA.Ode6C12.melody	@ltx/en_us_dedes/he.h.m8:heHE.ProsTonDynamenonSozein.name
ltx/en_us_dedes/me.m03.d20:meMA.Ode6C12.mode	@ltx/en_us_dedes/miscellanea:misc.Mode8
ltx/en_us_dedes/me.m03.d20:meMA.Ode6C12.ode	@ltx/en_us_dedes/miscellanea:misc.Ode6
ltx/en_us_dedes/me.m03.d20:meMA.Ode6C12.text	
ltx/en_us_dedes/me.m03.d20:meMA.Ode6C13.incipit	…
ltx/en_us_dedes/me.m03.d20:meMA.Ode6C13.melody	@ltx/en_us_dedes/he.h.m8:heHE.ProsTonDynamenonSozein.name
ltx/en_us_dedes/me.m03.d20:meMA.Ode6C13.mode	@ltx/en_us_dedes/miscellanea:misc.Mode8
ltx/en_us_dedes/me.m03.d20:meMA.Ode6C13.ode	@ltx/en_us_dedes/miscellanea:misc.Ode6
ltx/en_us_dedes/me.m03.d20:meMA.Ode6C13.text	
ltx/en_us_dedes/me.m03.d20:meMA.Ode6C1H.greekmelody	@ltx/en_us_dedes/he.h.m8:heHE.ProsTonDynamenonSozein.greekname
ltx/en_us_dedes/me.m03.d20:meMA.Ode6C1H.incipit	@ltx/en_us_dedes/he.h.m8:heHE.ProsTonDynamenonSozein.incipit
ltx/en_us_dedes/me.m03.d20:meMA.Ode6C1H.melody	@ltx/en_us_dedes/he.h.m8:heHE.ProsTonDynamenonSozein.melody
ltx/en_us_dedes/me.m03.d20:meMA.Ode6C1H.mode	@ltx/en_us_dedes/miscellanea:misc.Mode8
ltx/en_us_dedes/me.m03.d20:meMA.Ode6C1H.ode	@ltx/en_us_dedes/miscellanea:misc.Ode6
ltx/en_us_dedes/me.m03.d20:meMA.Ode6C1H.text	@ltx/en_us_dedes/he.h.m8:heHE.ProsTonDynamenonSozein.text
ltx/en_us_dedes/me.m03.d20:meMA.Ode6C1T.incipit	…
ltx/en_us_dedes/me.m03.d20:meMA.Ode6C1T.melody	@ltx/en_us_dedes/he.h.m8:heHE.ProsTonDynamenonSozein.name
ltx/en_us_dedes/me.m03.d20:meMA.Ode6C1T.mode	@ltx/en_us_dedes/miscellanea:misc.Mode8
ltx/en_us_dedes/me.m03.d20:meMA.Ode6C1T.ode	@ltx/en_us_dedes/miscellanea:misc.Ode6
ltx/en_us_dedes/me.m03.d20:meMA.Ode6C1T.text	
ltx/en_us_dedes/me.m03.d20:meMA.Ode7C11.greekmelody	@ltx/en_us_dedes/he.h.m8:heHE.OiEkTisIoudaias.greekname
ltx/en_us_dedes/me.m03.d20:meMA.Ode7C11.incipit	…
ltx/en_us_dedes/me.m03.d20:meMA.Ode7C11.melody	@ltx/en_us_dedes/he.h.m8:heHE.OiEkTisIoudaias.name
ltx/en_us_dedes/me.m03.d20:meMA.Ode7C11.mode	@ltx/en_us_dedes/miscellanea:misc.Mode8
ltx/en_us_dedes/me.m03.d20:meMA.Ode7C11.ode	@ltx/en_us_dedes/miscellanea:misc.Ode7
ltx/en_us_dedes/me.m03.d20:meMA.Ode7C11.text	
ltx/en_us_dedes/me.m03.d20:meMA.Ode7C12.incipit	…
ltx/en_us_dedes/me.m03.d20:meMA.Ode7C12.melody	@ltx/en_us_dedes/he.h.m8:heHE.OiEkTisIoudaias.name
ltx/en_us_dedes/me.m03.d20:meMA.Ode7C12.mode	@ltx/en_us_dedes/miscellanea:misc.Mode8
ltx/en_us_dedes/me.m03.d20:meMA.Ode7C12.ode	@ltx/en_us_dedes/miscellanea:misc.Ode7
ltx/en_us_dedes/me.m03.d20:meMA.Ode7C12.text	
ltx/en_us_dedes/me.m03.d20:meMA.Ode7C13.incipit	…
ltx/en_us_dedes/me.m03.d20:meMA.Ode7C13.melody	@ltx/en_us_dedes/he.h.m8:heHE.OiEkTisIoudaias.name
ltx/en_us_dedes/me.m03.d20:meMA.Ode7C13.mode	@ltx/en_us_dedes/miscellanea:misc.Mode8
ltx/en_us_dedes/me.m03.d20:meMA.Ode7C13.ode	@ltx/en_us_dedes/miscellanea:misc.Ode7
ltx/en_us_dedes/me.m03.d20:meMA.Ode7C13.text	
ltx/en_us_dedes/me.m03.d20:meMA.Ode7C14.incipit	…
ltx/en_us_dedes/me.m03.d20:meMA.Ode7C14.melody	@ltx/en_us_dedes/he.h.m8:heHE.OiEkTisIoudaias.name
ltx/en_us_dedes/me.m03.d20:meMA.Ode7C14.mode	@ltx/en_us_dedes/miscellanea:misc.Mode8
ltx/en_us_dedes/me.m03.d20:meMA.Ode7C14.ode	@ltx/en_us_dedes/miscellanea:misc.Ode7
ltx/en_us_dedes/me.m03.d20:meMA.Ode7C14.text	
ltx/en_us_dedes/me.m03.d20:meMA.Ode7C15.incipit	…
ltx/en_us_dedes/me.m03.d20:meMA.Ode7C15.melody	@ltx/en_us_dedes/he.h.m8:heHE.OiEkTisIoudaias.name
ltx/en_us_dedes/me.m03.d20:meMA.Ode7C15.mode	@ltx/en_us_dedes/miscellanea:misc.Mode8
ltx/en_us_dedes/me.m03.d20:meMA.Ode7C15.ode	@ltx/en_us_dedes/miscellanea:misc.Ode7
ltx/en_us_dedes/me.m03.d20:meMA.Ode7C15.text	
ltx/en_us_dedes/me.m03.d20:meMA.Ode7C1H.greekmelody	@ltx/en_us_dedes/he.h.m8:heHE.OiEkTisIoudaias.greekname
ltx/en_us_dedes/me.m03.d20:meMA.Ode7C1H.incipit	@ltx/en_us_dedes/he.h.m8:heHE.OiEkTisIoudaias.incipit
ltx/en_us_dedes/me.m03.d20:meMA.Ode7C1H.melody	@ltx/en_us_dedes/he.h.m8:heHE.OiEkTisIoudaias.melody
ltx/en_us_dedes/me.m03.d20:meMA.Ode7C1H.mode	@ltx/en_us_dedes/miscellanea:misc.Mode8
ltx/en_us_dedes/me.m03.d20:meMA.Ode7C1H.ode	@ltx/en_us_dedes/miscellanea:misc.Ode7
ltx/en_us_dedes/me.m03.d20:meMA.Ode7C1H.text	@ltx/en_us_dedes/he.h.m8:heHE.OiEkTisIoudaias.text
ltx/en_us_dedes/me.m03.d20:meMA.Ode7C1T.incipit	…
ltx/en_us_dedes/me.m03.d20:meMA.Ode7C1T.melody	@ltx/en_us_dedes/he.h.m8:heHE.OiEkTisIoudaias.name
ltx/en_us_dedes/me.m03.d20:meMA.Ode7C1T.mode	@ltx/en_us_dedes/miscellanea:misc.Mode8
ltx/en_us_dedes/me.m03.d20:meMA.Ode7C1T.ode	@ltx/en_us_dedes/miscellanea:misc.Ode7
ltx/en_us_dedes/me.m03.d20:meMA.Ode7C1T.text	
ltx/en_us_dedes/me.m03.d20:meMA.Ode8C11.greekmelody	@ltx/en_us_dedes/he.h.m4:heHE.AseveisOukOpsontai.greekname
ltx/en_us_dedes/me.m03.d20:meMA.Ode8C11.incipit	…
ltx/en_us_dedes/me.m03.d20:meMA.Ode8C11.melody	@ltx/en_us_dedes/he.h.m4:heHE.AseveisOukOpsontai.name
ltx/en_us_dedes/me.m03.d20:meMA.Ode8C11.mode	@ltx/en_us_dedes/miscellanea:misc.Mode8
ltx/en_us_dedes/me.m03.d20:meMA.Ode8C11.ode	@ltx/en_us_dedes/miscellanea:misc.Ode8
ltx/en_us_dedes/me.m03.d20:meMA.Ode8C11.text	
ltx/en_us_dedes/me.m03.d20:meMA.Ode8C12.incipit	…
ltx/en_us_dedes/me.m03.d20:meMA.Ode8C12.melody	@ltx/en_us_dedes/he.h.m4:heHE.AseveisOukOpsontai.name
ltx/en_us_dedes/me.m03.d20:meMA.Ode8C12.mode	@ltx/en_us_dedes/miscellanea:misc.Mode8
ltx/en_us_dedes/me.m03.d20:meMA.Ode8C12.ode	@ltx/en_us_dedes/miscellanea:misc.Ode8
ltx/en_us_dedes/me.m03.d20:meMA.Ode8C12.text	
ltx/en_us_dedes/me.m03.d20:meMA.Ode8C13.incipit	…
ltx/en_us_dedes/me.m03.d20:meMA.Ode8C13.melody	@ltx/en_us_dedes/he.h.m4:heHE.AseveisOukOpsontai.name
ltx/en_us_dedes/me.m03.d20:meMA.Ode8C13.mode	@ltx/en_us_dedes/miscellanea:misc.Mode8
ltx/en_us_dedes/me.m03.d20:meMA.Ode8C13.ode	@ltx/en_us_dedes/miscellanea:misc.Ode8
ltx/en_us_dedes/me.m03.d20:meMA.Ode8C13.text	
ltx/en_us_dedes/me.m03.d20:meMA.Ode8C14.incipit	…
ltx/en_us_dedes/me.m03.d20:meMA.Ode8C14.melody	@ltx/en_us_dedes/he.h.m4:heHE.AseveisOukOpsontai.name
ltx/en_us_dedes/me.m03.d20:meMA.Ode8C14.mode	@ltx/en_us_dedes/miscellanea:misc.Mode8
ltx/en_us_dedes/me.m03.d20:meMA.Ode8C14.ode	@ltx/en_us_dedes/miscellanea:misc.Ode8
ltx/en_us_dedes/me.m03.d20:meMA.Ode8C14.text	
ltx/en_us_dedes/me.m03.d20:meMA.Ode8C15.incipit	…
ltx/en_us_dedes/me.m03.d20:meMA.Ode8C15.melody	@ltx/en_us_dedes/he.h.m4:heHE.AseveisOukOpsontai.name
ltx/en_us_dedes/me.m03.d20:meMA.Ode8C15.mode	@ltx/en_us_dedes/miscellanea:misc.Mode8
ltx/en_us_dedes/me.m03.d20:meMA.Ode8C15.ode	@ltx/en_us_dedes/miscellanea:misc.Ode8
ltx/en_us_dedes/me.m03.d20:meMA.Ode8C15.text	
ltx/en_us_dedes/me.m03.d20:meMA.Ode8C1H.greekmelody	@ltx/en_us_dedes/he.h.m4:heHE.AseveisOukOpsontai.greekname
ltx/en_us_dedes/me.m03.d20:meMA.Ode8C1H.incipit	@ltx/en_us_dedes/he.h.m4:heHE.AseveisOukOpsontai.incipit
ltx/en_us_dedes/me.m03.d20:meMA.Ode8C1H.melody	@ltx/en_us_dedes/he.h.m4:heHE.AseveisOukOpsontai.melody
ltx/en_us_dedes/me.m03.d20:meMA.Ode8C1H.mode	@ltx/en_us_dedes/miscellanea:misc.Mode8
ltx/en_us_dedes/me.m03.d20:meMA.Ode8C1H.ode	@ltx/en_us_dedes/miscellanea:misc.Ode8
ltx/en_us_dedes/me.m03.d20:meMA.Ode8C1H.text	@ltx/en_us_dedes/he.h.m4:heHE.AseveisOukOpsontai.text
ltx/en_us_dedes/me.m03.d20:meMA.Ode9C11.greekmelody	@ltx/en_us_dedes/he.h.m8:heHE.ExestiEpiTouto.greekname
ltx/en_us_dedes/me.m03.d20:meMA.Ode9C11.incipit	…
ltx/en_us_dedes/me.m03.d20:meMA.Ode9C11.melody	@ltx/en_us_dedes/he.h.m8:heHE.ExestiEpiTouto.name
ltx/en_us_dedes/me.m03.d20:meMA.Ode9C11.mode	@ltx/en_us_dedes/miscellanea:misc.Mode8
ltx/en_us_dedes/me.m03.d20:meMA.Ode9C11.ode	@ltx/en_us_dedes/miscellanea:misc.Ode9
ltx/en_us_dedes/me.m03.d20:meMA.Ode9C11.text	
ltx/en_us_dedes/me.m03.d20:meMA.Ode9C12.incipit	…
ltx/en_us_dedes/me.m03.d20:meMA.Ode9C12.melody	@ltx/en_us_dedes/he.h.m8:heHE.ExestiEpiTouto.name
ltx/en_us_dedes/me.m03.d20:meMA.Ode9C12.mode	@ltx/en_us_dedes/miscellanea:misc.Mode8
ltx/en_us_dedes/me.m03.d20:meMA.Ode9C12.ode	@ltx/en_us_dedes/miscellanea:misc.Ode9
ltx/en_us_dedes/me.m03.d20:meMA.Ode9C12.text	
ltx/en_us_dedes/me.m03.d20:meMA.Ode9C13.incipit	…
ltx/en_us_dedes/me.m03.d20:meMA.Ode9C13.melody	@ltx/en_us_dedes/he.h.m8:heHE.ExestiEpiTouto.name
ltx/en_us_dedes/me.m03.d20:meMA.Ode9C13.mode	@ltx/en_us_dedes/miscellanea:misc.Mode8
ltx/en_us_dedes/me.m03.d20:meMA.Ode9C13.ode	@ltx/en_us_dedes/miscellanea:misc.Ode9
ltx/en_us_dedes/me.m03.d20:meMA.Ode9C13.text	
ltx/en_us_dedes/me.m03.d20:meMA.Ode9C14.incipit	…
ltx/en_us_dedes/me.m03.d20:meMA.Ode9C14.melody	@ltx/en_us_dedes/he.h.m8:heHE.ExestiEpiTouto.name
ltx/en_us_dedes/me.m03.d20:meMA.Ode9C14.mode	@ltx/en_us_dedes/miscellanea:misc.Mode8
ltx/en_us_dedes/me.m03.d20:meMA.Ode9C14.ode	@ltx/en_us_dedes/miscellanea:misc.Ode9
ltx/en_us_dedes/me.m03.d20:meMA.Ode9C14.text	
ltx/en_us_dedes/me.m03.d20:meMA.Ode9C1H.greekmelody	@ltx/en_us_dedes/he.h.m8:heHE.ExestiEpiTouto.greekname
ltx/en_us_dedes/me.m03.d20:meMA.Ode9C1H.incipit	@ltx/en_us_dedes/he.h.m8:heHE.ExestiEpiTouto.incipit
ltx/en_us_dedes/me.m03.d20:meMA.Ode9C1H.melody	@ltx/en_us_dedes/he.h.m8:heHE.ExestiEpiTouto.melody
ltx/en_us_dedes/me.m03.d20:meMA.Ode9C1H.mode	@ltx/en_us_dedes/miscellanea:misc.Mode8
ltx/en_us_dedes/me.m03.d20:meMA.Ode9C1H.ode	@ltx/en_us_dedes/miscellanea:misc.Ode9
ltx/en_us_dedes/me.m03.d20:meMA.Ode9C1H.text	@ltx/en_us_dedes/he.h.m8:heHE.ExestiEpiTouto.text
ltx/en_us_dedes/me.m03.d20:meMA.Ode9C1T.incipit	…
ltx/en_us_dedes/me.m03.d20:meMA.Ode9C1T.melody	@ltx/en_us_dedes/he.h.m8:heHE.ExestiEpiTouto.name
ltx/en_us_dedes/me.m03.d20:meMA.Ode9C1T.mode	@ltx/en_us_dedes/miscellanea:misc.Mode8
ltx/en_us_dedes/me.m03.d20:meMA.Ode9C1T.ode	@ltx/en_us_dedes/miscellanea:misc.Ode9
ltx/en_us_dedes/me.m03.d20:meMA.Ode9C1T.text	
ltx/en_us_dedes/me.m03.d20:meVE.Apolytikion1ger.greekmelody	@ltx/en_us_dedes/he.a.m4:heAU.OYpsotheisEnToStavro.greekname
ltx/en_us_dedes/me.m03.d20:meVE.Apolytikion1ger.incipit	…
ltx/en_us_dedes/me.m03.d20:meVE.Apolytikion1ger.melody	@ltx/en_us_dedes/he.a.m4:heAU.OYpsotheisEnToStavro.name
ltx/en_us_dedes/me.m03.d20:meVE.Apolytikion1ger.mode	@ltx/en_us_dedes/miscellanea:misc.Mode4
ltx/en_us_dedes/me.m03.d20:meVE.Apolytikion1ger.poet	@ltx/en_us_dedes/poets:po.Gerasimou
ltx/en_us_dedes/me.m03.d20:meVE.Apolytikion1ger.text	
ltx/en_us_dedes/me.m03.d20:meVE.SticStavrotheotokion.greekmelody	@ltx/en_us_dedes/he.a.m4:heAU.OsGennaionEnMartysi.greekname
ltx/en_us_dedes/me.m03.d20:meVE.SticStavrotheotokion.incipit	I have sinned…
ltx/en_us_dedes/me.m03.d20:meVE.SticStavrotheotokion.melody	@ltx/en_us_dedes/he.a.m4:heAU.OsGennaionEnMartysi.name
ltx/en_us_dedes/me.m03.d20:meVE.SticStavrotheotokion.mode	@ltx/en_us_dedes/miscellanea:misc.Mode4
ltx/en_us_dedes/me.m03.d20:meVE.SticStavrotheotokion.text	I have sinned and am therefore stripped * of divine incorruption. Woe! * I entreat you, Lady, to clothe me in the coat * of grace divine, as if made of wool * from your Son, the innocent * Lamb who came to heal the sin * of the whole world by His own blood, * and who for our sakes * has been slaughtered and thereby to the universe gave life and incorruption, * O Theotokos the Ewe of God.
ltx/en_us_dedes/me.m03.d20:meVE.SticTheotokion.greekmelody	@ltx/en_us_dedes/he.a.m4:heAU.OsGennaionEnMartysi.greekname
ltx/en_us_dedes/me.m03.d20:meVE.SticTheotokion.incipit	I entreat you who bore…
ltx/en_us_dedes/me.m03.d20:meVE.SticTheotokion.melody	@ltx/en_us_dedes/he.a.m4:heAU.OsGennaionEnMartysi.name
ltx/en_us_dedes/me.m03.d20:meVE.SticTheotokion.mode	@ltx/en_us_dedes/miscellanea:misc.Mode4
ltx/en_us_dedes/me.m03.d20:meVE.SticTheotokion.text	I entreat you who bore my God * and my Savior to grant to me * penitence, that excellent saving medicine, * and also tears in abundant streams, * recollection of the hour * of the frightening and grim * and unprejudiced inquiry * then on Judgment Day. * By your prayers grant that I escape the trembling * of the punishments, O Virgin, * and that divine grace be given me.
ltx/en_us_dedes/me.m03.d20:meVE.Stichera01.greekmelody	@ltx/en_us_dedes/he.a.m4:heAU.OsGennaionEnMartysi.greekname
ltx/en_us_dedes/me.m03.d20:meVE.Stichera01.incipit	You wholeheartedly loved the One…
ltx/en_us_dedes/me.m03.d20:meVE.Stichera01.melody	@ltx/en_us_dedes/he.a.m4:heAU.OsGennaionEnMartysi.name
ltx/en_us_dedes/me.m03.d20:meVE.Stichera01.mode	@ltx/en_us_dedes/miscellanea:misc.Mode4
ltx/en_us_dedes/me.m03.d20:meVE.Stichera01.text	You wholeheartedly loved the One * who is highest of all desired, * and you counted all of the pleasures of this life * to be as rubbish, O holy men, * and only things permanent * did you long for day and night, * by your vigilance and your prayer, * in the cold and heat. * You inhabited caves, and in divine grace * you were clearly shown as being * the Angels’ peers and compatriots.
ltx/en_us_dedes/me.m03.d20:meVE.Stichera02.incipit	You were bludgeoned with wooden…
ltx/en_us_dedes/me.m03.d20:meVE.Stichera02.melody	@ltx/en_us_dedes/he.a.m4:heAU.OsGennaionEnMartysi.name
ltx/en_us_dedes/me.m03.d20:meVE.Stichera02.mode	@ltx/en_us_dedes/miscellanea:misc.Mode4
ltx/en_us_dedes/me.m03.d20:meVE.Stichera02.text	You were bludgeoned with wooden clubs * and assailed with a hail of stones, * buffeted with fists; still your singleness of mind * was never severed, O Martyr saints; * for yours was a holy bond * of fraternity and love. * Hence, O Prizewinners, all in one * you were put to death * and dismembered, and on the holy table * you were offered up as blameless * and perfect victims for sacrifice.
ltx/en_us_dedes/me.m03.d20:meVE.Stichera03.incipit	Suffocating in stifling heat, *…
ltx/en_us_dedes/me.m03.d20:meVE.Stichera03.melody	@ltx/en_us_dedes/he.a.m4:heAU.OsGennaionEnMartysi.name
ltx/en_us_dedes/me.m03.d20:meVE.Stichera03.mode	@ltx/en_us_dedes/miscellanea:misc.Mode4
ltx/en_us_dedes/me.m03.d20:meVE.Stichera03.text	Suffocating in stifling heat, * burning up in a holocaust, * you gave up your souls as a blameless sacrifice * into the hand of the King of all, * O glorious martyr saints. * You were added to the choirs * of the bodiless hosts on high, * having now obtained * incorruptible glory. Without ceasing * intercede that we who praise you * may in this glory participate.
