ltx/en_us_dedes/sy.m06.d23:cl.syMA.commemoration01.text	[saint/com 1]
ltx/en_us_dedes/sy.m06.d23:cl.syMA.commemoration02.text	[saint/com 2]
ltx/en_us_dedes/sy.m06.d23:cl.syMA.commemoration03.text	[saint/com 3]
ltx/en_us_dedes/sy.m06.d23:cl.syMA.commemoration04.text	[saint/com 4]
ltx/en_us_dedes/sy.m06.d23:cl.syMA.commemoration05.text	[saint/com 5]
ltx/en_us_dedes/sy.m06.d23:cl.syMA.commemoration06.text	[saint/com list]
ltx/en_us_dedes/sy.m06.d23:syMA.commemoration01.couplet1.title	@ltx/en_us_dedes/titles:ti.Verses
ltx/en_us_dedes/sy.m06.d23:syMA.commemoration01.couplet1.verse1	
ltx/en_us_dedes/sy.m06.d23:syMA.commemoration01.couplet1.verse2	
ltx/en_us_dedes/sy.m06.d23:syMA.commemoration01.narration.p01	
ltx/en_us_dedes/sy.m06.d23:syMA.commemoration01.narration.p02	
ltx/en_us_dedes/sy.m06.d23:syMA.commemoration01.single1	
ltx/en_us_dedes/sy.m06.d23:syMA.commemoration01.text	On the June 23 we commemorate the Holy Martyr Agrippina of Rome.
ltx/en_us_dedes/sy.m06.d23:syMA.commemoration02.couplet1.title	@ltx/en_us_dedes/titles:ti.Verses
ltx/en_us_dedes/sy.m06.d23:syMA.commemoration02.couplet1.verse1	
ltx/en_us_dedes/sy.m06.d23:syMA.commemoration02.couplet1.verse2	
ltx/en_us_dedes/sy.m06.d23:syMA.commemoration02.couplet2.title	
ltx/en_us_dedes/sy.m06.d23:syMA.commemoration02.couplet2.verse1	
ltx/en_us_dedes/sy.m06.d23:syMA.commemoration02.couplet2.verse2	
ltx/en_us_dedes/sy.m06.d23:syMA.commemoration02.text	On this day we also commemorate the Holy Hieromartyrs Aristocles the Presbyter, Demetrius the Deacon, and Athanasios the Reader.
ltx/en_us_dedes/sy.m06.d23:syMA.lastline	By their holy intercessions, Christ God, have mercy on us. Amen.
