ltx/en_us_dedes/tr.d001:trCO.header	
ltx/en_us_dedes/tr.d001:trDA.commemoration.full	Sunday of the Publican and the Pharisee
ltx/en_us_dedes/tr.d001:trDA.commemoration.short	Sunday of the Publican and Pharisee
ltx/en_us_dedes/tr.d001:trDA.dismissal	@ltx/en_us_dedes/dismissals:dis00.resurrection
ltx/en_us_dedes/tr.d001:trDA.insert1	
ltx/en_us_dedes/tr.d001:trDA.insert2	
ltx/en_us_dedes/tr.d001:trDA.note	
ltx/en_us_dedes/tr.d001:trDA.title	
ltx/en_us_dedes/tr.d001:trHO.commemorations	
ltx/en_us_dedes/tr.d001:trHO.daytitle	
ltx/en_us_dedes/tr.d001:trHO.description1	
ltx/en_us_dedes/tr.d001:trHO.description2	
ltx/en_us_dedes/tr.d001:trHO.note1	
ltx/en_us_dedes/tr.d001:trHO.note2	
ltx/en_us_dedes/tr.d001:trLI.Kontakion1.incipit	@ltx/en_us_dedes/tr.d001:trMA.Kontakion0.incipit
ltx/en_us_dedes/tr.d001:trLI.Kontakion1.melody	@ltx/en_us_dedes/tr.d001:trMA.Kontakion0.melody
ltx/en_us_dedes/tr.d001:trLI.Kontakion1.mode	@ltx/en_us_dedes/tr.d001:trMA.Kontakion0.mode
ltx/en_us_dedes/tr.d001:trLI.Kontakion1.text	@ltx/en_us_dedes/tr.d001:trMA.Kontakion0.text
ltx/en_us_dedes/tr.d001:trLI.MM.CommunionHymn.text	@ltx/en_us_dedes/properties:media.key
ltx/en_us_dedes/tr.d001:trLI.Megalynarion.text	
ltx/en_us_dedes/tr.d001:trMA.C1.acrostic.notice1	
ltx/en_us_dedes/tr.d001:trMA.C1.acrostic.text	
ltx/en_us_dedes/tr.d001:trMA.C1.acrostic.title	
ltx/en_us_dedes/tr.d001:trMA.C1.poet	@ltx/en_us_dedes/poets:po.Georgiou
ltx/en_us_dedes/tr.d001:trMA.C1.title	@ltx/en_us_dedes/titles:ti.CanonTriodion
ltx/en_us_dedes/tr.d001:trMA.C1.verse	@ltx/en_us_dedes/prayers:pr.verse_God.text
ltx/en_us_dedes/tr.d001:trMA.ExapTheotokion.greekmelody	@ltx/en_us_dedes/he.a.m2:heAU.ToisMathitaisSynelthomen.greekname
ltx/en_us_dedes/tr.d001:trMA.ExapTheotokion.incipit	The God of all the…
ltx/en_us_dedes/tr.d001:trMA.ExapTheotokion.melody	@ltx/en_us_dedes/he.a.m2:heAU.ToisMathitaisSynelthomen.name
ltx/en_us_dedes/tr.d001:trMA.ExapTheotokion.mode	@ltx/en_us_dedes/miscellanea:misc.Mode2
ltx/en_us_dedes/tr.d001:trMA.ExapTheotokion.text	The God of all the universe * and Maker of creation * assumed our mortal human flesh * from your unsullied womb, O all-laudable Theotokos, * and my corrupted nature * He made completely new again. * After His birth He left you as you had been * before giving birth to Him. Hence we cry out * with faith extolling you, Rejoice, * the universe’s glory.
ltx/en_us_dedes/tr.d001:trMA.Exaposteilarion1.greekmelody	@ltx/en_us_dedes/he.a.m2:heAU.ToisMathitaisSynelthomen.greekname
ltx/en_us_dedes/tr.d001:trMA.Exaposteilarion1.incipit	Let us all flee the…
ltx/en_us_dedes/tr.d001:trMA.Exaposteilarion1.melody	@ltx/en_us_dedes/he.a.m2:heAU.ToisMathitaisSynelthomen.name
ltx/en_us_dedes/tr.d001:trMA.Exaposteilarion1.mode	@ltx/en_us_dedes/miscellanea:misc.Mode2
ltx/en_us_dedes/tr.d001:trMA.Exaposteilarion1.text	Let us all flee the Pharisee’s * abusive ostentation, * and rather learn the Publican’s * excellent self-abasement, * so that we too be exalted,* crying to God like he did, * Be gracious to Your servants, Lord * voluntarily born of a Virgin Maid, * Christ our Savior who endured crucifixion, * and with yourself raised up Your world, * by Your divine dominion.
ltx/en_us_dedes/tr.d001:trMA.Kontakion0.incipit	Let us flee the Pharisee’s…
ltx/en_us_dedes/tr.d001:trMA.Kontakion0.melody	@ltx/en_us_dedes/he.a.m4:heAU.EpefanisSimeron.name
ltx/en_us_dedes/tr.d001:trMA.Kontakion0.mode	@ltx/en_us_dedes/miscellanea:misc.Mode4
ltx/en_us_dedes/tr.d001:trMA.Kontakion0.text	Let us flee the Pharisee’s * exalted parlance; * let us learn the Publican’s * humble demeanor, and with sighs * unto the Savior cry out and say, * To us be gracious, O only forgiving Lord.
ltx/en_us_dedes/tr.d001:trMA.Kontakion1.incipit	Sinners, let us fall before…
ltx/en_us_dedes/tr.d001:trMA.Kontakion1.melody	@ltx/en_us_dedes/he.a.m3:heAU.IParthenosSimeron.name
ltx/en_us_dedes/tr.d001:trMA.Kontakion1.mode	@ltx/en_us_dedes/miscellanea:misc.Mode3
ltx/en_us_dedes/tr.d001:trMA.Kontakion1.text	Sinners, let us fall before * the Lord and Master in prayer, * and as once the Publican * let us present Him our sighing. * He desires that all humanity gain salvation. * And to all who are repentant He grants forgiveness. * He became a man for our sake, * though with the Father without beginning as God.
ltx/en_us_dedes/tr.d001:trMA.Lauds1.incipit	@ltx/en_us_dedes/tr.d001:trVE.Stichera01.incipit
ltx/en_us_dedes/tr.d001:trMA.Lauds1.melody	@ltx/en_us_dedes/miscellanea:misc.Idiomelon
ltx/en_us_dedes/tr.d001:trMA.Lauds1.mode	@ltx/en_us_dedes/miscellanea:misc.Mode1
ltx/en_us_dedes/tr.d001:trMA.Lauds1.text	@ltx/en_us_dedes/tr.d001:trVE.Stichera01.text
ltx/en_us_dedes/tr.d001:trMA.Lauds2.incipit	@ltx/en_us_dedes/tr.d001:trVE.Stichera02.incipit
ltx/en_us_dedes/tr.d001:trMA.Lauds2.melody	@ltx/en_us_dedes/miscellanea:misc.Idiomelon
ltx/en_us_dedes/tr.d001:trMA.Lauds2.mode	@ltx/en_us_dedes/miscellanea:misc.Mode1
ltx/en_us_dedes/tr.d001:trMA.Lauds2.text	@ltx/en_us_dedes/tr.d001:trVE.Stichera02.text
ltx/en_us_dedes/tr.d001:trMA.Lauds3.incipit	…
ltx/en_us_dedes/tr.d001:trMA.Lauds3.melody	@ltx/en_us_dedes/miscellanea:misc.Idiomelon
ltx/en_us_dedes/tr.d001:trMA.Lauds3.mode	@ltx/en_us_dedes/miscellanea:misc.Mode3
ltx/en_us_dedes/tr.d001:trMA.Lauds3.text	
ltx/en_us_dedes/tr.d001:trMA.Lauds4.incipit	…
ltx/en_us_dedes/tr.d001:trMA.Lauds4.melody	@ltx/en_us_dedes/miscellanea:misc.Idiomelon
ltx/en_us_dedes/tr.d001:trMA.Lauds4.mode	@ltx/en_us_dedes/miscellanea:misc.Mode3
ltx/en_us_dedes/tr.d001:trMA.Lauds4.text	
ltx/en_us_dedes/tr.d001:trMA.LaudsGlory.incipit	…
ltx/en_us_dedes/tr.d001:trMA.LaudsGlory.melody	@ltx/en_us_dedes/miscellanea:misc.Idiomelon
ltx/en_us_dedes/tr.d001:trMA.LaudsGlory.mode	@ltx/en_us_dedes/miscellanea:misc.Mode8
ltx/en_us_dedes/tr.d001:trMA.LaudsGlory.text	
ltx/en_us_dedes/tr.d001:trMA.LaudsTheotokion.incipit	@ltx/en_us_dedes/oc.m2.d1:ocMA.Kathisma23.incipit
ltx/en_us_dedes/tr.d001:trMA.LaudsTheotokion.melody	
ltx/en_us_dedes/tr.d001:trMA.LaudsTheotokion.mode	
ltx/en_us_dedes/tr.d001:trMA.LaudsTheotokion.text	@ltx/en_us_dedes/oc.m2.d1:ocMA.Kathisma23.text
ltx/en_us_dedes/tr.d001:trMA.MM.Lauds12as45.text	@ltx/en_us_dedes/properties:media.key
ltx/en_us_dedes/tr.d001:trMA.Ode1C11.greekmelody	@ltx/en_us_dedes/he.h.m6:heHE.OsEnIpeiroPezefsas.greekname
ltx/en_us_dedes/tr.d001:trMA.Ode1C11.incipit	…
ltx/en_us_dedes/tr.d001:trMA.Ode1C11.melody	@ltx/en_us_dedes/he.h.m6:heHE.OsEnIpeiroPezefsas.name
ltx/en_us_dedes/tr.d001:trMA.Ode1C11.mode	@ltx/en_us_dedes/miscellanea:misc.Mode6
ltx/en_us_dedes/tr.d001:trMA.Ode1C11.ode	@ltx/en_us_dedes/miscellanea:misc.Ode1
ltx/en_us_dedes/tr.d001:trMA.Ode1C11.text	
ltx/en_us_dedes/tr.d001:trMA.Ode1C12.incipit	…
ltx/en_us_dedes/tr.d001:trMA.Ode1C12.melody	@ltx/en_us_dedes/he.h.m6:heHE.OsEnIpeiroPezefsas.name
ltx/en_us_dedes/tr.d001:trMA.Ode1C12.mode	@ltx/en_us_dedes/miscellanea:misc.Mode6
ltx/en_us_dedes/tr.d001:trMA.Ode1C12.ode	@ltx/en_us_dedes/miscellanea:misc.Ode1
ltx/en_us_dedes/tr.d001:trMA.Ode1C12.text	
ltx/en_us_dedes/tr.d001:trMA.Ode1C13.incipit	…
ltx/en_us_dedes/tr.d001:trMA.Ode1C13.melody	@ltx/en_us_dedes/he.h.m6:heHE.OsEnIpeiroPezefsas.name
ltx/en_us_dedes/tr.d001:trMA.Ode1C13.mode	@ltx/en_us_dedes/miscellanea:misc.Mode6
ltx/en_us_dedes/tr.d001:trMA.Ode1C13.ode	@ltx/en_us_dedes/miscellanea:misc.Ode1
ltx/en_us_dedes/tr.d001:trMA.Ode1C13.text	
ltx/en_us_dedes/tr.d001:trMA.Ode1C14.incipit	…
ltx/en_us_dedes/tr.d001:trMA.Ode1C14.melody	@ltx/en_us_dedes/he.h.m6:heHE.OsEnIpeiroPezefsas.name
ltx/en_us_dedes/tr.d001:trMA.Ode1C14.mode	@ltx/en_us_dedes/miscellanea:misc.Mode6
ltx/en_us_dedes/tr.d001:trMA.Ode1C14.ode	@ltx/en_us_dedes/miscellanea:misc.Ode1
ltx/en_us_dedes/tr.d001:trMA.Ode1C14.text	
ltx/en_us_dedes/tr.d001:trMA.Ode1C15.incipit	…
ltx/en_us_dedes/tr.d001:trMA.Ode1C15.melody	@ltx/en_us_dedes/he.h.m6:heHE.OsEnIpeiroPezefsas.name
ltx/en_us_dedes/tr.d001:trMA.Ode1C15.mode	@ltx/en_us_dedes/miscellanea:misc.Mode6
ltx/en_us_dedes/tr.d001:trMA.Ode1C15.ode	@ltx/en_us_dedes/miscellanea:misc.Ode1
ltx/en_us_dedes/tr.d001:trMA.Ode1C15.text	
ltx/en_us_dedes/tr.d001:trMA.Ode1C1T.incipit	…
ltx/en_us_dedes/tr.d001:trMA.Ode1C1T.melody	@ltx/en_us_dedes/he.h.m6:heHE.OsEnIpeiroPezefsas.name
ltx/en_us_dedes/tr.d001:trMA.Ode1C1T.mode	@ltx/en_us_dedes/miscellanea:misc.Mode6
ltx/en_us_dedes/tr.d001:trMA.Ode1C1T.ode	@ltx/en_us_dedes/miscellanea:misc.Ode1
ltx/en_us_dedes/tr.d001:trMA.Ode1C1T.text	
ltx/en_us_dedes/tr.d001:trMA.Ode3C11.greekmelody	@ltx/en_us_dedes/he.h.m6:heHE.OukEstinAgios.greekname
ltx/en_us_dedes/tr.d001:trMA.Ode3C11.incipit	…
ltx/en_us_dedes/tr.d001:trMA.Ode3C11.melody	@ltx/en_us_dedes/he.h.m6:heHE.OukEstinAgios.name
ltx/en_us_dedes/tr.d001:trMA.Ode3C11.mode	@ltx/en_us_dedes/miscellanea:misc.Mode6
ltx/en_us_dedes/tr.d001:trMA.Ode3C11.ode	@ltx/en_us_dedes/miscellanea:misc.Ode3
ltx/en_us_dedes/tr.d001:trMA.Ode3C11.text	
ltx/en_us_dedes/tr.d001:trMA.Ode3C12.incipit	…
ltx/en_us_dedes/tr.d001:trMA.Ode3C12.melody	@ltx/en_us_dedes/he.h.m6:heHE.OukEstinAgios.name
ltx/en_us_dedes/tr.d001:trMA.Ode3C12.mode	@ltx/en_us_dedes/miscellanea:misc.Mode6
ltx/en_us_dedes/tr.d001:trMA.Ode3C12.ode	@ltx/en_us_dedes/miscellanea:misc.Ode3
ltx/en_us_dedes/tr.d001:trMA.Ode3C12.text	
ltx/en_us_dedes/tr.d001:trMA.Ode3C13.incipit	…
ltx/en_us_dedes/tr.d001:trMA.Ode3C13.melody	@ltx/en_us_dedes/he.h.m6:heHE.OukEstinAgios.name
ltx/en_us_dedes/tr.d001:trMA.Ode3C13.mode	@ltx/en_us_dedes/miscellanea:misc.Mode6
ltx/en_us_dedes/tr.d001:trMA.Ode3C13.ode	@ltx/en_us_dedes/miscellanea:misc.Ode3
ltx/en_us_dedes/tr.d001:trMA.Ode3C13.text	
ltx/en_us_dedes/tr.d001:trMA.Ode3C14.incipit	…
ltx/en_us_dedes/tr.d001:trMA.Ode3C14.melody	@ltx/en_us_dedes/he.h.m6:heHE.OukEstinAgios.name
ltx/en_us_dedes/tr.d001:trMA.Ode3C14.mode	@ltx/en_us_dedes/miscellanea:misc.Mode6
ltx/en_us_dedes/tr.d001:trMA.Ode3C14.ode	@ltx/en_us_dedes/miscellanea:misc.Ode3
ltx/en_us_dedes/tr.d001:trMA.Ode3C14.text	
ltx/en_us_dedes/tr.d001:trMA.Ode3C15.incipit	…
ltx/en_us_dedes/tr.d001:trMA.Ode3C15.melody	@ltx/en_us_dedes/he.h.m6:heHE.OukEstinAgios.name
ltx/en_us_dedes/tr.d001:trMA.Ode3C15.mode	@ltx/en_us_dedes/miscellanea:misc.Mode6
ltx/en_us_dedes/tr.d001:trMA.Ode3C15.ode	@ltx/en_us_dedes/miscellanea:misc.Ode3
ltx/en_us_dedes/tr.d001:trMA.Ode3C15.text	
ltx/en_us_dedes/tr.d001:trMA.Ode3C1T.incipit	…
ltx/en_us_dedes/tr.d001:trMA.Ode3C1T.melody	@ltx/en_us_dedes/he.h.m6:heHE.OukEstinAgios.name
ltx/en_us_dedes/tr.d001:trMA.Ode3C1T.mode	@ltx/en_us_dedes/miscellanea:misc.Mode6
ltx/en_us_dedes/tr.d001:trMA.Ode3C1T.ode	@ltx/en_us_dedes/miscellanea:misc.Ode3
ltx/en_us_dedes/tr.d001:trMA.Ode3C1T.text	
ltx/en_us_dedes/tr.d001:trMA.Ode3Kathisma1.greekmelody	@ltx/en_us_dedes/he.a.m4:heAU.TachyProkatalave.greekname
ltx/en_us_dedes/tr.d001:trMA.Ode3Kathisma1.incipit	…
ltx/en_us_dedes/tr.d001:trMA.Ode3Kathisma1.melody	@ltx/en_us_dedes/he.a.m4:heAU.TachyProkatalave.name
ltx/en_us_dedes/tr.d001:trMA.Ode3Kathisma1.mode	@ltx/en_us_dedes/miscellanea:misc.Mode4
ltx/en_us_dedes/tr.d001:trMA.Ode3Kathisma1.text	
ltx/en_us_dedes/tr.d001:trMA.Ode3Kathisma2.greekmelody	@ltx/en_us_dedes/he.a.m4:heAU.TachyProkatalave.greekname
ltx/en_us_dedes/tr.d001:trMA.Ode3Kathisma2.incipit	…
ltx/en_us_dedes/tr.d001:trMA.Ode3Kathisma2.melody	@ltx/en_us_dedes/he.a.m4:heAU.TachyProkatalave.name
ltx/en_us_dedes/tr.d001:trMA.Ode3Kathisma2.mode	@ltx/en_us_dedes/miscellanea:misc.Mode4
ltx/en_us_dedes/tr.d001:trMA.Ode3Kathisma2.text	
ltx/en_us_dedes/tr.d001:trMA.Ode3Kathisma3.greekmelody	@ltx/en_us_dedes/he.a.m4:heAU.TachyProkatalave.greekname
ltx/en_us_dedes/tr.d001:trMA.Ode3Kathisma3.incipit	@ltx/en_us_dedes/me.m12.d06:meMA.Kathisma3T.incipit
ltx/en_us_dedes/tr.d001:trMA.Ode3Kathisma3.melody	@ltx/en_us_dedes/he.a.m4:heAU.TachyProkatalave.name
ltx/en_us_dedes/tr.d001:trMA.Ode3Kathisma3.mode	@ltx/en_us_dedes/miscellanea:misc.Mode4
ltx/en_us_dedes/tr.d001:trMA.Ode3Kathisma3.text	@ltx/en_us_dedes/me.m12.d06:meMA.Kathisma3T.text
ltx/en_us_dedes/tr.d001:trMA.Ode4C11.greekmelody	@ltx/en_us_dedes/he.h.m6:heHE.ChristosMouDynamis.greekname
ltx/en_us_dedes/tr.d001:trMA.Ode4C11.incipit	…
ltx/en_us_dedes/tr.d001:trMA.Ode4C11.melody	@ltx/en_us_dedes/he.h.m6:heHE.ChristosMouDynamis.name
ltx/en_us_dedes/tr.d001:trMA.Ode4C11.mode	@ltx/en_us_dedes/miscellanea:misc.Mode6
ltx/en_us_dedes/tr.d001:trMA.Ode4C11.ode	@ltx/en_us_dedes/miscellanea:misc.Ode4
ltx/en_us_dedes/tr.d001:trMA.Ode4C11.text	
ltx/en_us_dedes/tr.d001:trMA.Ode4C12.incipit	…
ltx/en_us_dedes/tr.d001:trMA.Ode4C12.melody	@ltx/en_us_dedes/he.h.m6:heHE.ChristosMouDynamis.name
ltx/en_us_dedes/tr.d001:trMA.Ode4C12.mode	@ltx/en_us_dedes/miscellanea:misc.Mode6
ltx/en_us_dedes/tr.d001:trMA.Ode4C12.ode	@ltx/en_us_dedes/miscellanea:misc.Ode4
ltx/en_us_dedes/tr.d001:trMA.Ode4C12.text	
ltx/en_us_dedes/tr.d001:trMA.Ode4C13.incipit	…
ltx/en_us_dedes/tr.d001:trMA.Ode4C13.melody	@ltx/en_us_dedes/he.h.m6:heHE.ChristosMouDynamis.name
ltx/en_us_dedes/tr.d001:trMA.Ode4C13.mode	@ltx/en_us_dedes/miscellanea:misc.Mode6
ltx/en_us_dedes/tr.d001:trMA.Ode4C13.ode	@ltx/en_us_dedes/miscellanea:misc.Ode4
ltx/en_us_dedes/tr.d001:trMA.Ode4C13.text	
ltx/en_us_dedes/tr.d001:trMA.Ode4C14.incipit	…
ltx/en_us_dedes/tr.d001:trMA.Ode4C14.melody	@ltx/en_us_dedes/he.h.m6:heHE.ChristosMouDynamis.name
ltx/en_us_dedes/tr.d001:trMA.Ode4C14.mode	@ltx/en_us_dedes/miscellanea:misc.Mode6
ltx/en_us_dedes/tr.d001:trMA.Ode4C14.ode	@ltx/en_us_dedes/miscellanea:misc.Ode4
ltx/en_us_dedes/tr.d001:trMA.Ode4C14.text	
ltx/en_us_dedes/tr.d001:trMA.Ode4C15.incipit	…
ltx/en_us_dedes/tr.d001:trMA.Ode4C15.melody	@ltx/en_us_dedes/he.h.m6:heHE.ChristosMouDynamis.name
ltx/en_us_dedes/tr.d001:trMA.Ode4C15.mode	@ltx/en_us_dedes/miscellanea:misc.Mode6
ltx/en_us_dedes/tr.d001:trMA.Ode4C15.ode	@ltx/en_us_dedes/miscellanea:misc.Ode4
ltx/en_us_dedes/tr.d001:trMA.Ode4C15.text	
ltx/en_us_dedes/tr.d001:trMA.Ode4C1T.incipit	…
ltx/en_us_dedes/tr.d001:trMA.Ode4C1T.melody	@ltx/en_us_dedes/he.h.m6:heHE.ChristosMouDynamis.name
ltx/en_us_dedes/tr.d001:trMA.Ode4C1T.mode	@ltx/en_us_dedes/miscellanea:misc.Mode6
ltx/en_us_dedes/tr.d001:trMA.Ode4C1T.ode	@ltx/en_us_dedes/miscellanea:misc.Ode4
ltx/en_us_dedes/tr.d001:trMA.Ode4C1T.text	
ltx/en_us_dedes/tr.d001:trMA.Ode5C11.greekmelody	@ltx/en_us_dedes/he.h.m6:heHE.ToTheioFengeiSou.greekname
ltx/en_us_dedes/tr.d001:trMA.Ode5C11.incipit	…
ltx/en_us_dedes/tr.d001:trMA.Ode5C11.melody	@ltx/en_us_dedes/he.h.m6:heHE.ToTheioFengeiSou.name
ltx/en_us_dedes/tr.d001:trMA.Ode5C11.mode	@ltx/en_us_dedes/miscellanea:misc.Mode6
ltx/en_us_dedes/tr.d001:trMA.Ode5C11.ode	@ltx/en_us_dedes/miscellanea:misc.Ode5
ltx/en_us_dedes/tr.d001:trMA.Ode5C11.text	
ltx/en_us_dedes/tr.d001:trMA.Ode5C12.incipit	…
ltx/en_us_dedes/tr.d001:trMA.Ode5C12.melody	@ltx/en_us_dedes/he.h.m6:heHE.ToTheioFengeiSou.name
ltx/en_us_dedes/tr.d001:trMA.Ode5C12.mode	@ltx/en_us_dedes/miscellanea:misc.Mode6
ltx/en_us_dedes/tr.d001:trMA.Ode5C12.ode	@ltx/en_us_dedes/miscellanea:misc.Ode5
ltx/en_us_dedes/tr.d001:trMA.Ode5C12.text	
ltx/en_us_dedes/tr.d001:trMA.Ode5C13.incipit	…
ltx/en_us_dedes/tr.d001:trMA.Ode5C13.melody	@ltx/en_us_dedes/he.h.m6:heHE.ToTheioFengeiSou.name
ltx/en_us_dedes/tr.d001:trMA.Ode5C13.mode	@ltx/en_us_dedes/miscellanea:misc.Mode6
ltx/en_us_dedes/tr.d001:trMA.Ode5C13.ode	@ltx/en_us_dedes/miscellanea:misc.Ode5
ltx/en_us_dedes/tr.d001:trMA.Ode5C13.text	
ltx/en_us_dedes/tr.d001:trMA.Ode5C14.incipit	…
ltx/en_us_dedes/tr.d001:trMA.Ode5C14.melody	@ltx/en_us_dedes/he.h.m6:heHE.ToTheioFengeiSou.name
ltx/en_us_dedes/tr.d001:trMA.Ode5C14.mode	@ltx/en_us_dedes/miscellanea:misc.Mode6
ltx/en_us_dedes/tr.d001:trMA.Ode5C14.ode	@ltx/en_us_dedes/miscellanea:misc.Ode5
ltx/en_us_dedes/tr.d001:trMA.Ode5C14.text	
ltx/en_us_dedes/tr.d001:trMA.Ode5C15.incipit	…
ltx/en_us_dedes/tr.d001:trMA.Ode5C15.melody	@ltx/en_us_dedes/he.h.m6:heHE.ToTheioFengeiSou.name
ltx/en_us_dedes/tr.d001:trMA.Ode5C15.mode	@ltx/en_us_dedes/miscellanea:misc.Mode6
ltx/en_us_dedes/tr.d001:trMA.Ode5C15.ode	@ltx/en_us_dedes/miscellanea:misc.Ode5
ltx/en_us_dedes/tr.d001:trMA.Ode5C15.text	
ltx/en_us_dedes/tr.d001:trMA.Ode5C1T.incipit	…
ltx/en_us_dedes/tr.d001:trMA.Ode5C1T.melody	@ltx/en_us_dedes/he.h.m6:heHE.ToTheioFengeiSou.name
ltx/en_us_dedes/tr.d001:trMA.Ode5C1T.mode	@ltx/en_us_dedes/miscellanea:misc.Mode6
ltx/en_us_dedes/tr.d001:trMA.Ode5C1T.ode	@ltx/en_us_dedes/miscellanea:misc.Ode5
ltx/en_us_dedes/tr.d001:trMA.Ode5C1T.text	
ltx/en_us_dedes/tr.d001:trMA.Ode6C11.greekmelody	@ltx/en_us_dedes/he.h.m6:heHE.TouViouTinThalassan.greekname
ltx/en_us_dedes/tr.d001:trMA.Ode6C11.incipit	…
ltx/en_us_dedes/tr.d001:trMA.Ode6C11.melody	@ltx/en_us_dedes/he.h.m6:heHE.TouViouTinThalassan.name
ltx/en_us_dedes/tr.d001:trMA.Ode6C11.mode	@ltx/en_us_dedes/miscellanea:misc.Mode6
ltx/en_us_dedes/tr.d001:trMA.Ode6C11.ode	@ltx/en_us_dedes/miscellanea:misc.Ode6
ltx/en_us_dedes/tr.d001:trMA.Ode6C11.text	
ltx/en_us_dedes/tr.d001:trMA.Ode6C12.incipit	…
ltx/en_us_dedes/tr.d001:trMA.Ode6C12.melody	@ltx/en_us_dedes/he.h.m6:heHE.TouViouTinThalassan.name
ltx/en_us_dedes/tr.d001:trMA.Ode6C12.mode	@ltx/en_us_dedes/miscellanea:misc.Mode6
ltx/en_us_dedes/tr.d001:trMA.Ode6C12.ode	@ltx/en_us_dedes/miscellanea:misc.Ode6
ltx/en_us_dedes/tr.d001:trMA.Ode6C12.text	
ltx/en_us_dedes/tr.d001:trMA.Ode6C13.incipit	…
ltx/en_us_dedes/tr.d001:trMA.Ode6C13.melody	@ltx/en_us_dedes/he.h.m6:heHE.TouViouTinThalassan.name
ltx/en_us_dedes/tr.d001:trMA.Ode6C13.mode	@ltx/en_us_dedes/miscellanea:misc.Mode6
ltx/en_us_dedes/tr.d001:trMA.Ode6C13.ode	@ltx/en_us_dedes/miscellanea:misc.Ode6
ltx/en_us_dedes/tr.d001:trMA.Ode6C13.text	
ltx/en_us_dedes/tr.d001:trMA.Ode6C14.incipit	…
ltx/en_us_dedes/tr.d001:trMA.Ode6C14.melody	@ltx/en_us_dedes/he.h.m6:heHE.TouViouTinThalassan.name
ltx/en_us_dedes/tr.d001:trMA.Ode6C14.mode	@ltx/en_us_dedes/miscellanea:misc.Mode6
ltx/en_us_dedes/tr.d001:trMA.Ode6C14.ode	@ltx/en_us_dedes/miscellanea:misc.Ode6
ltx/en_us_dedes/tr.d001:trMA.Ode6C14.text	
ltx/en_us_dedes/tr.d001:trMA.Ode6C15.incipit	…
ltx/en_us_dedes/tr.d001:trMA.Ode6C15.melody	@ltx/en_us_dedes/he.h.m6:heHE.TouViouTinThalassan.name
ltx/en_us_dedes/tr.d001:trMA.Ode6C15.mode	@ltx/en_us_dedes/miscellanea:misc.Mode6
ltx/en_us_dedes/tr.d001:trMA.Ode6C15.ode	@ltx/en_us_dedes/miscellanea:misc.Ode6
ltx/en_us_dedes/tr.d001:trMA.Ode6C15.text	
ltx/en_us_dedes/tr.d001:trMA.Ode6C1T.incipit	…
ltx/en_us_dedes/tr.d001:trMA.Ode6C1T.melody	@ltx/en_us_dedes/he.h.m6:heHE.TouViouTinThalassan.name
ltx/en_us_dedes/tr.d001:trMA.Ode6C1T.mode	@ltx/en_us_dedes/miscellanea:misc.Mode6
ltx/en_us_dedes/tr.d001:trMA.Ode6C1T.ode	@ltx/en_us_dedes/miscellanea:misc.Ode6
ltx/en_us_dedes/tr.d001:trMA.Ode6C1T.text	
ltx/en_us_dedes/tr.d001:trMA.Ode7C11.greekmelody	@ltx/en_us_dedes/he.h.m6:heHE.DrosovolonMenTinKaminon.greekname
ltx/en_us_dedes/tr.d001:trMA.Ode7C11.incipit	…
ltx/en_us_dedes/tr.d001:trMA.Ode7C11.melody	@ltx/en_us_dedes/he.h.m6:heHE.DrosovolonMenTinKaminon.name
ltx/en_us_dedes/tr.d001:trMA.Ode7C11.mode	@ltx/en_us_dedes/miscellanea:misc.Mode6
ltx/en_us_dedes/tr.d001:trMA.Ode7C11.ode	@ltx/en_us_dedes/miscellanea:misc.Ode7
ltx/en_us_dedes/tr.d001:trMA.Ode7C11.text	
ltx/en_us_dedes/tr.d001:trMA.Ode7C12.incipit	…
ltx/en_us_dedes/tr.d001:trMA.Ode7C12.melody	@ltx/en_us_dedes/he.h.m6:heHE.DrosovolonMenTinKaminon.name
ltx/en_us_dedes/tr.d001:trMA.Ode7C12.mode	@ltx/en_us_dedes/miscellanea:misc.Mode6
ltx/en_us_dedes/tr.d001:trMA.Ode7C12.ode	@ltx/en_us_dedes/miscellanea:misc.Ode7
ltx/en_us_dedes/tr.d001:trMA.Ode7C12.text	
ltx/en_us_dedes/tr.d001:trMA.Ode7C13.incipit	…
ltx/en_us_dedes/tr.d001:trMA.Ode7C13.melody	@ltx/en_us_dedes/he.h.m6:heHE.DrosovolonMenTinKaminon.name
ltx/en_us_dedes/tr.d001:trMA.Ode7C13.mode	@ltx/en_us_dedes/miscellanea:misc.Mode6
ltx/en_us_dedes/tr.d001:trMA.Ode7C13.ode	@ltx/en_us_dedes/miscellanea:misc.Ode7
ltx/en_us_dedes/tr.d001:trMA.Ode7C13.text	
ltx/en_us_dedes/tr.d001:trMA.Ode7C14.incipit	…
ltx/en_us_dedes/tr.d001:trMA.Ode7C14.melody	@ltx/en_us_dedes/he.h.m6:heHE.DrosovolonMenTinKaminon.name
ltx/en_us_dedes/tr.d001:trMA.Ode7C14.mode	@ltx/en_us_dedes/miscellanea:misc.Mode6
ltx/en_us_dedes/tr.d001:trMA.Ode7C14.ode	@ltx/en_us_dedes/miscellanea:misc.Ode7
ltx/en_us_dedes/tr.d001:trMA.Ode7C14.text	
ltx/en_us_dedes/tr.d001:trMA.Ode7C15.incipit	…
ltx/en_us_dedes/tr.d001:trMA.Ode7C15.melody	@ltx/en_us_dedes/he.h.m6:heHE.DrosovolonMenTinKaminon.name
ltx/en_us_dedes/tr.d001:trMA.Ode7C15.mode	@ltx/en_us_dedes/miscellanea:misc.Mode6
ltx/en_us_dedes/tr.d001:trMA.Ode7C15.ode	@ltx/en_us_dedes/miscellanea:misc.Ode7
ltx/en_us_dedes/tr.d001:trMA.Ode7C15.text	
ltx/en_us_dedes/tr.d001:trMA.Ode7C1T.incipit	…
ltx/en_us_dedes/tr.d001:trMA.Ode7C1T.melody	@ltx/en_us_dedes/he.h.m6:heHE.DrosovolonMenTinKaminon.name
ltx/en_us_dedes/tr.d001:trMA.Ode7C1T.mode	@ltx/en_us_dedes/miscellanea:misc.Mode6
ltx/en_us_dedes/tr.d001:trMA.Ode7C1T.ode	@ltx/en_us_dedes/miscellanea:misc.Ode7
ltx/en_us_dedes/tr.d001:trMA.Ode7C1T.text	
ltx/en_us_dedes/tr.d001:trMA.Ode8C11.greekmelody	@ltx/en_us_dedes/he.h.m6:heHE.EkFlogosToisOsiois.greekname
ltx/en_us_dedes/tr.d001:trMA.Ode8C11.incipit	…
ltx/en_us_dedes/tr.d001:trMA.Ode8C11.melody	@ltx/en_us_dedes/he.h.m6:heHE.EkFlogosToisOsiois.name
ltx/en_us_dedes/tr.d001:trMA.Ode8C11.mode	@ltx/en_us_dedes/miscellanea:misc.Mode6
ltx/en_us_dedes/tr.d001:trMA.Ode8C11.ode	@ltx/en_us_dedes/miscellanea:misc.Ode8
ltx/en_us_dedes/tr.d001:trMA.Ode8C11.text	
ltx/en_us_dedes/tr.d001:trMA.Ode8C12.incipit	…
ltx/en_us_dedes/tr.d001:trMA.Ode8C12.melody	@ltx/en_us_dedes/he.h.m6:heHE.EkFlogosToisOsiois.name
ltx/en_us_dedes/tr.d001:trMA.Ode8C12.mode	@ltx/en_us_dedes/miscellanea:misc.Mode6
ltx/en_us_dedes/tr.d001:trMA.Ode8C12.ode	@ltx/en_us_dedes/miscellanea:misc.Ode8
ltx/en_us_dedes/tr.d001:trMA.Ode8C12.text	
ltx/en_us_dedes/tr.d001:trMA.Ode8C13.incipit	…
ltx/en_us_dedes/tr.d001:trMA.Ode8C13.melody	@ltx/en_us_dedes/he.h.m6:heHE.EkFlogosToisOsiois.name
ltx/en_us_dedes/tr.d001:trMA.Ode8C13.mode	@ltx/en_us_dedes/miscellanea:misc.Mode6
ltx/en_us_dedes/tr.d001:trMA.Ode8C13.ode	@ltx/en_us_dedes/miscellanea:misc.Ode8
ltx/en_us_dedes/tr.d001:trMA.Ode8C13.text	
ltx/en_us_dedes/tr.d001:trMA.Ode8C14.incipit	…
ltx/en_us_dedes/tr.d001:trMA.Ode8C14.melody	@ltx/en_us_dedes/he.h.m6:heHE.EkFlogosToisOsiois.name
ltx/en_us_dedes/tr.d001:trMA.Ode8C14.mode	@ltx/en_us_dedes/miscellanea:misc.Mode6
ltx/en_us_dedes/tr.d001:trMA.Ode8C14.ode	@ltx/en_us_dedes/miscellanea:misc.Ode8
ltx/en_us_dedes/tr.d001:trMA.Ode8C14.text	
ltx/en_us_dedes/tr.d001:trMA.Ode8C15.incipit	…
ltx/en_us_dedes/tr.d001:trMA.Ode8C15.melody	@ltx/en_us_dedes/he.h.m6:heHE.EkFlogosToisOsiois.name
ltx/en_us_dedes/tr.d001:trMA.Ode8C15.mode	@ltx/en_us_dedes/miscellanea:misc.Mode6
ltx/en_us_dedes/tr.d001:trMA.Ode8C15.ode	@ltx/en_us_dedes/miscellanea:misc.Ode8
ltx/en_us_dedes/tr.d001:trMA.Ode8C15.text	
ltx/en_us_dedes/tr.d001:trMA.Ode8C1T.incipit	…
ltx/en_us_dedes/tr.d001:trMA.Ode8C1T.melody	@ltx/en_us_dedes/he.h.m6:heHE.EkFlogosToisOsiois.name
ltx/en_us_dedes/tr.d001:trMA.Ode8C1T.mode	@ltx/en_us_dedes/miscellanea:misc.Mode6
ltx/en_us_dedes/tr.d001:trMA.Ode8C1T.ode	@ltx/en_us_dedes/miscellanea:misc.Ode8
ltx/en_us_dedes/tr.d001:trMA.Ode8C1T.text	
ltx/en_us_dedes/tr.d001:trMA.Ode9C11.greekmelody	@ltx/en_us_dedes/he.h.m6:heHE.TheonAnthropois.greekname
ltx/en_us_dedes/tr.d001:trMA.Ode9C11.incipit	…
ltx/en_us_dedes/tr.d001:trMA.Ode9C11.melody	@ltx/en_us_dedes/he.h.m6:heHE.TheonAnthropois.name
ltx/en_us_dedes/tr.d001:trMA.Ode9C11.mode	@ltx/en_us_dedes/miscellanea:misc.Mode6
ltx/en_us_dedes/tr.d001:trMA.Ode9C11.ode	@ltx/en_us_dedes/miscellanea:misc.Ode9
ltx/en_us_dedes/tr.d001:trMA.Ode9C11.text	
ltx/en_us_dedes/tr.d001:trMA.Ode9C12.incipit	…
ltx/en_us_dedes/tr.d001:trMA.Ode9C12.melody	@ltx/en_us_dedes/he.h.m6:heHE.TheonAnthropois.name
ltx/en_us_dedes/tr.d001:trMA.Ode9C12.mode	@ltx/en_us_dedes/miscellanea:misc.Mode6
ltx/en_us_dedes/tr.d001:trMA.Ode9C12.ode	@ltx/en_us_dedes/miscellanea:misc.Ode9
ltx/en_us_dedes/tr.d001:trMA.Ode9C12.text	
ltx/en_us_dedes/tr.d001:trMA.Ode9C13.incipit	…
ltx/en_us_dedes/tr.d001:trMA.Ode9C13.melody	@ltx/en_us_dedes/he.h.m6:heHE.TheonAnthropois.name
ltx/en_us_dedes/tr.d001:trMA.Ode9C13.mode	@ltx/en_us_dedes/miscellanea:misc.Mode6
ltx/en_us_dedes/tr.d001:trMA.Ode9C13.ode	@ltx/en_us_dedes/miscellanea:misc.Ode9
ltx/en_us_dedes/tr.d001:trMA.Ode9C13.text	
ltx/en_us_dedes/tr.d001:trMA.Ode9C14.incipit	…
ltx/en_us_dedes/tr.d001:trMA.Ode9C14.melody	@ltx/en_us_dedes/he.h.m6:heHE.TheonAnthropois.name
ltx/en_us_dedes/tr.d001:trMA.Ode9C14.mode	@ltx/en_us_dedes/miscellanea:misc.Mode6
ltx/en_us_dedes/tr.d001:trMA.Ode9C14.ode	@ltx/en_us_dedes/miscellanea:misc.Ode9
ltx/en_us_dedes/tr.d001:trMA.Ode9C14.text	
ltx/en_us_dedes/tr.d001:trMA.Ode9C15.incipit	…
ltx/en_us_dedes/tr.d001:trMA.Ode9C15.melody	@ltx/en_us_dedes/he.h.m6:heHE.TheonAnthropois.name
ltx/en_us_dedes/tr.d001:trMA.Ode9C15.mode	@ltx/en_us_dedes/miscellanea:misc.Mode6
ltx/en_us_dedes/tr.d001:trMA.Ode9C15.ode	@ltx/en_us_dedes/miscellanea:misc.Ode9
ltx/en_us_dedes/tr.d001:trMA.Ode9C15.text	
ltx/en_us_dedes/tr.d001:trMA.Ode9C16.incipit	…
ltx/en_us_dedes/tr.d001:trMA.Ode9C16.melody	@ltx/en_us_dedes/he.h.m6:heHE.TheonAnthropois.name
ltx/en_us_dedes/tr.d001:trMA.Ode9C16.mode	@ltx/en_us_dedes/miscellanea:misc.Mode6
ltx/en_us_dedes/tr.d001:trMA.Ode9C16.ode	@ltx/en_us_dedes/miscellanea:misc.Ode9
ltx/en_us_dedes/tr.d001:trMA.Ode9C16.text	
ltx/en_us_dedes/tr.d001:trMA.Ode9C1T.incipit	…
ltx/en_us_dedes/tr.d001:trMA.Ode9C1T.melody	@ltx/en_us_dedes/he.h.m6:heHE.TheonAnthropois.name
ltx/en_us_dedes/tr.d001:trMA.Ode9C1T.mode	@ltx/en_us_dedes/miscellanea:misc.Mode6
ltx/en_us_dedes/tr.d001:trMA.Ode9C1T.ode	@ltx/en_us_dedes/miscellanea:misc.Ode9
ltx/en_us_dedes/tr.d001:trMA.Ode9C1T.text	
ltx/en_us_dedes/tr.d001:trMA.Oikos1.text	Brethren, let us all garb ourselves in lowliness, and with laments and sighs strike at our conscience, that at the judgment then, which is in perpetuity, we shall be viewed guiltless, attaining our impunity. For there we have true mitigation; to see it, let us make supplication. For there is pain and sorrow’s unseating, gone the deep sighs, there in wondrous Eden, of which Christ was fashioner, He being with the Father without beginning as God.
ltx/en_us_dedes/tr.d001:trMA.PostGospelBoth.incipit	Guide me in the paths…
ltx/en_us_dedes/tr.d001:trMA.PostGospelBoth.melody	
ltx/en_us_dedes/tr.d001:trMA.PostGospelBoth.mode	@ltx/en_us_dedes/miscellanea:misc.Mode8
ltx/en_us_dedes/tr.d001:trMA.PostGospelBoth.text	Guide me in the paths of salvation, O Theotokos, for I have befouled my soul with shameful sins and I heedlessly squandered all of my life’s resources. By your intercession deliver me from every uncleanness.
ltx/en_us_dedes/tr.d001:trMA.PostGospelGlory.incipit	Open to me the gates…
ltx/en_us_dedes/tr.d001:trMA.PostGospelGlory.melody	
ltx/en_us_dedes/tr.d001:trMA.PostGospelGlory.mode	@ltx/en_us_dedes/miscellanea:misc.Mode8
ltx/en_us_dedes/tr.d001:trMA.PostGospelGlory.text	Open to me the gates of repentance, O Giver of Life, for early in the morning my spirit hastens to Your holy temple, bringing the temple of my body all defiled. But as one compassionate, cleanse me, I pray, by Your loving-kindness and mercy.
ltx/en_us_dedes/tr.d001:trMA.PostGospelIdiomelon.incipit	When I ponder in my…
ltx/en_us_dedes/tr.d001:trMA.PostGospelIdiomelon.melody	
ltx/en_us_dedes/tr.d001:trMA.PostGospelIdiomelon.mode	@ltx/en_us_dedes/miscellanea:misc.Mode6
ltx/en_us_dedes/tr.d001:trMA.PostGospelIdiomelon.text	When I ponder in my wretchedness on the many terrible things that I have done, I tremble for that fearful day, the Day of Judgment. But trusting in the mercy of Your compassion, like David I cry to You, “Have mercy on me, O God, according to Your great mercy.”
ltx/en_us_dedes/tr.d001:trSY.commemoration.couplet1.title	@ltx/en_us_dedes/titles:ti.Verses
ltx/en_us_dedes/tr.d001:trSY.commemoration.couplet1.verse1	Pharisaical man, stay away from the Temple,
ltx/en_us_dedes/tr.d001:trSY.commemoration.couplet1.verse2	for Christ is therein, where He accepts the humble.
ltx/en_us_dedes/tr.d001:trSY.commemoration.couplet2.title	For the Triodion
ltx/en_us_dedes/tr.d001:trSY.commemoration.couplet2.verse1	O Creator of all in earth and in heaven,
ltx/en_us_dedes/tr.d001:trSY.commemoration.couplet2.verse2	As You receive the thrice-holy hymn from the Angels,
ltx/en_us_dedes/tr.d001:trSY.commemoration.couplet2.verse3	So also accept the Triodion from us humans.
ltx/en_us_dedes/tr.d001:trSY.commemoration.narration.p01	[paragraph 01]
ltx/en_us_dedes/tr.d001:trSY.commemoration.narration.p02	[paragraph 02]
ltx/en_us_dedes/tr.d001:trSY.commemoration.narration.p03	[paragraph 03]
ltx/en_us_dedes/tr.d001:trSY.commemoration.narration.p04	[paragraph 04]
ltx/en_us_dedes/tr.d001:trSY.commemoration.narration.p05	[paragraph 05]
ltx/en_us_dedes/tr.d001:trSY.commemoration.narration.p06	[paragraph 06]
ltx/en_us_dedes/tr.d001:trSY.commemoration.narration.p07	[paragraph 07]
ltx/en_us_dedes/tr.d001:trSY.commemoration.text	On this day, we remember the parable of the Publican and the Pharisee from the holy Gospel of the Evangelist Luke (18:10-14).
ltx/en_us_dedes/tr.d001:trSY.lastline	By the intercessions of all Your Saints, who have done great things, O Christ our God, have mercy on us and save us. Amen.
ltx/en_us_dedes/tr.d001:trVE.AposGlory.incipit	My eyes are weighed down…
ltx/en_us_dedes/tr.d001:trVE.AposGlory.melody	@ltx/en_us_dedes/miscellanea:misc.Idiomelon
ltx/en_us_dedes/tr.d001:trVE.AposGlory.mode	@ltx/en_us_dedes/miscellanea:misc.Mode5
ltx/en_us_dedes/tr.d001:trVE.AposGlory.text	My eyes are weighed down by my transgressions, and I cannot lift them up and see the height of heaven. But receive me, now repenting like the Publican, and have mercy on me, Savior.
ltx/en_us_dedes/tr.d001:trVE.AposTheotokion.incipit	@ltx/en_us_dedes/oc.m5.d1:ocVE.AposTheotokion.incipit
ltx/en_us_dedes/tr.d001:trVE.AposTheotokion.melody	
ltx/en_us_dedes/tr.d001:trVE.AposTheotokion.mode	@ltx/en_us_dedes/oc.m5.d1:ocVE.AposTheotokion.mode
ltx/en_us_dedes/tr.d001:trVE.AposTheotokion.text	@ltx/en_us_dedes/oc.m5.d1:ocVE.AposTheotokion.text
ltx/en_us_dedes/tr.d001:trVE.MM.Stichera112as567.text	@ltx/en_us_dedes/properties:media.key
ltx/en_us_dedes/tr.d001:trVE.MM.Stichera112as8910.text	@ltx/en_us_dedes/properties:media.key
ltx/en_us_dedes/tr.d001:trVE.MM.Stichera12as56.text	@ltx/en_us_dedes/properties:media.key
ltx/en_us_dedes/tr.d001:trVE.SticGlory.incipit	Lord and Ruler over all…
ltx/en_us_dedes/tr.d001:trVE.SticGlory.melody	@ltx/en_us_dedes/miscellanea:misc.Idiomelon
ltx/en_us_dedes/tr.d001:trVE.SticGlory.mode	@ltx/en_us_dedes/miscellanea:misc.Mode8
ltx/en_us_dedes/tr.d001:trVE.SticGlory.text	Lord and Ruler over all, I know how effective tears can be. They raised Hezekiah from the gates of death. They delivered the sinful woman from her chronic sins. They justified the Publican over the Pharisee. I pray You, count me with them and have mercy on me.
ltx/en_us_dedes/tr.d001:trVE.Stichera01.incipit	…
ltx/en_us_dedes/tr.d001:trVE.Stichera01.melody	@ltx/en_us_dedes/miscellanea:misc.Idiomelon
ltx/en_us_dedes/tr.d001:trVE.Stichera01.mode	@ltx/en_us_dedes/miscellanea:misc.Mode1
ltx/en_us_dedes/tr.d001:trVE.Stichera01.text	
ltx/en_us_dedes/tr.d001:trVE.Stichera02.incipit	…
ltx/en_us_dedes/tr.d001:trVE.Stichera02.melody	@ltx/en_us_dedes/miscellanea:misc.Idiomelon
ltx/en_us_dedes/tr.d001:trVE.Stichera02.mode	@ltx/en_us_dedes/miscellanea:misc.Mode1
ltx/en_us_dedes/tr.d001:trVE.Stichera02.text	
