ltx/en_us_dedes/sy.m02.d27:cl.syMA.commemoration01.text	[saint/com 1]
ltx/en_us_dedes/sy.m02.d27:cl.syMA.commemoration02.text	[saint/com 2]
ltx/en_us_dedes/sy.m02.d27:cl.syMA.commemoration03.text	[saint/com 3]
ltx/en_us_dedes/sy.m02.d27:cl.syMA.commemoration04.text	[saint/com 4]
ltx/en_us_dedes/sy.m02.d27:cl.syMA.commemoration05.text	[saint/com 5]
ltx/en_us_dedes/sy.m02.d27:cl.syMA.commemoration06.text	[saint/com list]
ltx/en_us_dedes/sy.m02.d27:syMA.commemoration01.couplet1.title	@ltx/en_us_dedes/titles:ti.Verses
ltx/en_us_dedes/sy.m02.d27:syMA.commemoration01.couplet1.verse1	
ltx/en_us_dedes/sy.m02.d27:syMA.commemoration01.couplet1.verse2	
ltx/en_us_dedes/sy.m02.d27:syMA.commemoration01.narration.p01	
ltx/en_us_dedes/sy.m02.d27:syMA.commemoration01.single1	
ltx/en_us_dedes/sy.m02.d27:syMA.commemoration01.text	On February 27 we commemorate our devout father and confessor Procopius of Decapolis.
ltx/en_us_dedes/sy.m02.d27:syMA.commemoration02.couplet1.title	@ltx/en_us_dedes/titles:ti.Verses
ltx/en_us_dedes/sy.m02.d27:syMA.commemoration02.couplet1.verse1	
ltx/en_us_dedes/sy.m02.d27:syMA.commemoration02.couplet1.verse2	
ltx/en_us_dedes/sy.m02.d27:syMA.commemoration02.text	On this day we also commemorate the holy martyr Gelasios, who was commanded by the ruler to mock baptism, but was truly baptized and died by the sword.
ltx/en_us_dedes/sy.m02.d27:syMA.commemoration03.couplet1.title	@ltx/en_us_dedes/titles:ti.Verses
ltx/en_us_dedes/sy.m02.d27:syMA.commemoration03.couplet1.verse1	
ltx/en_us_dedes/sy.m02.d27:syMA.commemoration03.couplet1.verse2	
ltx/en_us_dedes/sy.m02.d27:syMA.commemoration03.narration.p01	
ltx/en_us_dedes/sy.m02.d27:syMA.commemoration03.text	On this day we also commemorate our devout father Thallelaios.
ltx/en_us_dedes/sy.m02.d27:syMA.commemoration04.couplet1.title	@ltx/en_us_dedes/titles:ti.Verses
ltx/en_us_dedes/sy.m02.d27:syMA.commemoration04.couplet1.verse1	
ltx/en_us_dedes/sy.m02.d27:syMA.commemoration04.couplet1.verse2	
ltx/en_us_dedes/sy.m02.d27:syMA.commemoration04.text	On this day the devout Stephen, who founded the home for the elderly in Armatios, reposed in peace.
ltx/en_us_dedes/sy.m02.d27:syMA.commemoration05.couplet1.title	@ltx/en_us_dedes/titles:ti.Verses
ltx/en_us_dedes/sy.m02.d27:syMA.commemoration05.couplet1.verse1	
ltx/en_us_dedes/sy.m02.d27:syMA.commemoration05.couplet1.verse2	
ltx/en_us_dedes/sy.m02.d27:syMA.commemoration05.text	On this day St. Nisios died after being beaten with ox hide whips.
ltx/en_us_dedes/sy.m02.d27:syMA.lastline	By the intercessions of Your Saints, O God, have mercy on us. Amen.
