ltx/en_us_dedes/sy.m01.d10:cl.syMA.commemoration01.narration.p01	
ltx/en_us_dedes/sy.m01.d10:cl.syMA.commemoration01.narration.p02	
ltx/en_us_dedes/sy.m01.d10:cl.syMA.commemoration01.narration.p03	
ltx/en_us_dedes/sy.m01.d10:cl.syMA.commemoration01.narration.p04	
ltx/en_us_dedes/sy.m01.d10:cl.syMA.commemoration01.narration.p05	
ltx/en_us_dedes/sy.m01.d10:cl.syMA.commemoration01.narration.p06	
ltx/en_us_dedes/sy.m01.d10:cl.syMA.commemoration01.narration.p07	
ltx/en_us_dedes/sy.m01.d10:cl.syMA.commemoration01.text	[saint/com 1]
ltx/en_us_dedes/sy.m01.d10:cl.syMA.commemoration02.narration.p01	
ltx/en_us_dedes/sy.m01.d10:cl.syMA.commemoration02.narration.p02	
ltx/en_us_dedes/sy.m01.d10:cl.syMA.commemoration02.narration.p03	
ltx/en_us_dedes/sy.m01.d10:cl.syMA.commemoration02.narration.p04	
ltx/en_us_dedes/sy.m01.d10:cl.syMA.commemoration02.narration.p05	
ltx/en_us_dedes/sy.m01.d10:cl.syMA.commemoration02.narration.p06	
ltx/en_us_dedes/sy.m01.d10:cl.syMA.commemoration02.narration.p07	
ltx/en_us_dedes/sy.m01.d10:cl.syMA.commemoration02.text	[saint/com 2]
ltx/en_us_dedes/sy.m01.d10:cl.syMA.commemoration03.narration.p01	
ltx/en_us_dedes/sy.m01.d10:cl.syMA.commemoration03.narration.p02	
ltx/en_us_dedes/sy.m01.d10:cl.syMA.commemoration03.narration.p03	
ltx/en_us_dedes/sy.m01.d10:cl.syMA.commemoration03.narration.p04	
ltx/en_us_dedes/sy.m01.d10:cl.syMA.commemoration03.narration.p05	
ltx/en_us_dedes/sy.m01.d10:cl.syMA.commemoration03.narration.p06	
ltx/en_us_dedes/sy.m01.d10:cl.syMA.commemoration03.narration.p07	
ltx/en_us_dedes/sy.m01.d10:cl.syMA.commemoration03.text	[saint/com 3]
ltx/en_us_dedes/sy.m01.d10:cl.syMA.commemoration04.narration.p01	
ltx/en_us_dedes/sy.m01.d10:cl.syMA.commemoration04.narration.p02	
ltx/en_us_dedes/sy.m01.d10:cl.syMA.commemoration04.narration.p03	
ltx/en_us_dedes/sy.m01.d10:cl.syMA.commemoration04.narration.p04	
ltx/en_us_dedes/sy.m01.d10:cl.syMA.commemoration04.narration.p05	
ltx/en_us_dedes/sy.m01.d10:cl.syMA.commemoration04.narration.p06	
ltx/en_us_dedes/sy.m01.d10:cl.syMA.commemoration04.narration.p07	
ltx/en_us_dedes/sy.m01.d10:cl.syMA.commemoration04.text	[saint/com 4]
ltx/en_us_dedes/sy.m01.d10:cl.syMA.commemoration05.narration.p01	
ltx/en_us_dedes/sy.m01.d10:cl.syMA.commemoration05.narration.p02	
ltx/en_us_dedes/sy.m01.d10:cl.syMA.commemoration05.narration.p03	
ltx/en_us_dedes/sy.m01.d10:cl.syMA.commemoration05.narration.p04	
ltx/en_us_dedes/sy.m01.d10:cl.syMA.commemoration05.narration.p05	
ltx/en_us_dedes/sy.m01.d10:cl.syMA.commemoration05.narration.p06	
ltx/en_us_dedes/sy.m01.d10:cl.syMA.commemoration05.narration.p07	
ltx/en_us_dedes/sy.m01.d10:cl.syMA.commemoration05.text	[saint/com 5]
ltx/en_us_dedes/sy.m01.d10:cl.syMA.commemoration06.text	[saint/com list]
ltx/en_us_dedes/sy.m01.d10:syMA.commemoration01.couplet1.title	@ltx/en_us_dedes/titles:ti.Verses
ltx/en_us_dedes/sy.m01.d10:syMA.commemoration01.couplet1.verse1	
ltx/en_us_dedes/sy.m01.d10:syMA.commemoration01.couplet1.verse2	
ltx/en_us_dedes/sy.m01.d10:syMA.commemoration01.narration.p01	
ltx/en_us_dedes/sy.m01.d10:syMA.commemoration01.single1	
ltx/en_us_dedes/sy.m01.d10:syMA.commemoration01.text	On January 10 we commemorate our father among the saints Gregory Bishop of Nyssa.
ltx/en_us_dedes/sy.m01.d10:syMA.commemoration02.couplet1.title	@ltx/en_us_dedes/titles:ti.Verses
ltx/en_us_dedes/sy.m01.d10:syMA.commemoration02.couplet1.verse1	
ltx/en_us_dedes/sy.m01.d10:syMA.commemoration02.couplet1.verse2	
ltx/en_us_dedes/sy.m01.d10:syMA.commemoration02.narration.p01	
ltx/en_us_dedes/sy.m01.d10:syMA.commemoration02.narration.p02	
ltx/en_us_dedes/sy.m01.d10:syMA.commemoration02.narration.p03	
ltx/en_us_dedes/sy.m01.d10:syMA.commemoration02.text	On this day we also commemorate our devout father Dometian Bishop of Melitene.
ltx/en_us_dedes/sy.m01.d10:syMA.commemoration03.couplet1.title	@ltx/en_us_dedes/titles:ti.Verses
ltx/en_us_dedes/sy.m01.d10:syMA.commemoration03.couplet1.verse1	
ltx/en_us_dedes/sy.m01.d10:syMA.commemoration03.couplet1.verse2	
ltx/en_us_dedes/sy.m01.d10:syMA.commemoration03.narration.p01	
ltx/en_us_dedes/sy.m01.d10:syMA.commemoration03.text	On this day we also commemorate our father among the Saints Marcian, Presbyter and Oikonomos of the Great Church.
ltx/en_us_dedes/sy.m01.d10:syMA.commemoration04.couplet1.title	@ltx/en_us_dedes/titles:ti.Verses
ltx/en_us_dedes/sy.m01.d10:syMA.commemoration04.couplet1.verse1	
ltx/en_us_dedes/sy.m01.d10:syMA.commemoration04.couplet1.verse2	
ltx/en_us_dedes/sy.m01.d10:syMA.commemoration04.text	On this day St. Ammonios reposed in peace.
ltx/en_us_dedes/sy.m01.d10:syMA.lastline	By the intercessions of Your Saints, O God, have mercy on us and save us. Amen.
