ltx/en_us_dedes/tr.d041:trCO.header	(Great)
ltx/en_us_dedes/tr.d041:trDA.commemoration.full	
ltx/en_us_dedes/tr.d041:trDA.commemoration.short	Friday of the Third Week
ltx/en_us_dedes/tr.d041:trDA.insert1	
ltx/en_us_dedes/tr.d041:trDA.insert2	
ltx/en_us_dedes/tr.d041:trDA.note	
ltx/en_us_dedes/tr.d041:trDA.title	
ltx/en_us_dedes/tr.d041:trHO.commemorations	
ltx/en_us_dedes/tr.d041:trHO.daytitle	
ltx/en_us_dedes/tr.d041:trHO.description1	
ltx/en_us_dedes/tr.d041:trHO.description2	
ltx/en_us_dedes/tr.d041:trHO.note1	
ltx/en_us_dedes/tr.d041:trHO.note2	
ltx/en_us_dedes/tr.d041:trMA.AposIdiomelon1.incipit	…
ltx/en_us_dedes/tr.d041:trMA.AposIdiomelon1.melody	@ltx/en_us_dedes/miscellanea:misc.Idiomelon
ltx/en_us_dedes/tr.d041:trMA.AposIdiomelon1.mode	@ltx/en_us_dedes/miscellanea:misc.Mode6
ltx/en_us_dedes/tr.d041:trMA.AposIdiomelon1.text	
ltx/en_us_dedes/tr.d041:trMA.AposMartyric.incipit	…
ltx/en_us_dedes/tr.d041:trMA.AposMartyric.melody	
ltx/en_us_dedes/tr.d041:trMA.AposMartyric.mode	@ltx/en_us_dedes/miscellanea:misc.Mode6
ltx/en_us_dedes/tr.d041:trMA.AposMartyric.text	
ltx/en_us_dedes/tr.d041:trMA.AposTheotokion.greekmelody	@ltx/en_us_dedes/he.a.m6:heAU.TriimerosAnestis.greekname
ltx/en_us_dedes/tr.d041:trMA.AposTheotokion.incipit	@ltx/en_us_dedes/oc.m6.d4:ocMA.AposTheotokion.incipit
ltx/en_us_dedes/tr.d041:trMA.AposTheotokion.melody	@ltx/en_us_dedes/he.a.m6:heAU.TriimerosAnestis.name
ltx/en_us_dedes/tr.d041:trMA.AposTheotokion.mode	@ltx/en_us_dedes/miscellanea:misc.Mode6
ltx/en_us_dedes/tr.d041:trMA.AposTheotokion.text	@ltx/en_us_dedes/oc.m6.d4:ocMA.AposTheotokion.text
ltx/en_us_dedes/tr.d041:trMA.C1.poet	@ltx/en_us_dedes/poets:po.Iosif
ltx/en_us_dedes/tr.d041:trMA.C2.poet	@ltx/en_us_dedes/poets:po.Theodorou
ltx/en_us_dedes/tr.d041:trMA.Kathisma21.greekmelody	@ltx/en_us_dedes/he.a.m5:heAU.TonSynanarchonLogon.greekname
ltx/en_us_dedes/tr.d041:trMA.Kathisma21.incipit	…
ltx/en_us_dedes/tr.d041:trMA.Kathisma21.melody	@ltx/en_us_dedes/he.a.m5:heAU.TonSynanarchonLogon.name
ltx/en_us_dedes/tr.d041:trMA.Kathisma21.mode	@ltx/en_us_dedes/miscellanea:misc.Mode5
ltx/en_us_dedes/tr.d041:trMA.Kathisma21.text	
ltx/en_us_dedes/tr.d041:trMA.Kathisma22.greekmelody	@ltx/en_us_dedes/he.a.m5:heAU.TonSynanarchonLogon.greekname
ltx/en_us_dedes/tr.d041:trMA.Kathisma22.incipit	@ltx/en_us_dedes/oc.m5.d4:ocMA.Kathisma13.incipit
ltx/en_us_dedes/tr.d041:trMA.Kathisma22.melody	@ltx/en_us_dedes/he.a.m5:heAU.TonSynanarchonLogon.name
ltx/en_us_dedes/tr.d041:trMA.Kathisma22.mode	@ltx/en_us_dedes/miscellanea:misc.Mode5
ltx/en_us_dedes/tr.d041:trMA.Kathisma22.text	@ltx/en_us_dedes/oc.m5.d4:ocMA.Kathisma13.text
ltx/en_us_dedes/tr.d041:trMA.Kathisma31.greekmelody	@ltx/en_us_dedes/he.a.m1:heAU.TouLithouSfragisthentos.greekname
ltx/en_us_dedes/tr.d041:trMA.Kathisma31.incipit	…
ltx/en_us_dedes/tr.d041:trMA.Kathisma31.melody	@ltx/en_us_dedes/he.a.m1:heAU.TouLithouSfragisthentos.name
ltx/en_us_dedes/tr.d041:trMA.Kathisma31.mode	@ltx/en_us_dedes/miscellanea:misc.Mode1
ltx/en_us_dedes/tr.d041:trMA.Kathisma31.text	
ltx/en_us_dedes/tr.d041:trMA.Kathisma32.greekmelody	@ltx/en_us_dedes/he.a.m1:heAU.TouLithouSfragisthentos.greekname
ltx/en_us_dedes/tr.d041:trMA.Kathisma32.incipit	…
ltx/en_us_dedes/tr.d041:trMA.Kathisma32.melody	@ltx/en_us_dedes/he.a.m1:heAU.TouLithouSfragisthentos.name
ltx/en_us_dedes/tr.d041:trMA.Kathisma32.mode	@ltx/en_us_dedes/miscellanea:misc.Mode1
ltx/en_us_dedes/tr.d041:trMA.Kathisma32.text	
ltx/en_us_dedes/tr.d041:trMA.Ode5C11.greekmelody	@ltx/en_us_dedes/he.h.m5:heHE.OAnavallomenos.greekname
ltx/en_us_dedes/tr.d041:trMA.Ode5C11.incipit	…
ltx/en_us_dedes/tr.d041:trMA.Ode5C11.melody	@ltx/en_us_dedes/he.h.m5:heHE.OAnavallomenos.name
ltx/en_us_dedes/tr.d041:trMA.Ode5C11.mode	@ltx/en_us_dedes/miscellanea:misc.Mode5
ltx/en_us_dedes/tr.d041:trMA.Ode5C11.ode	@ltx/en_us_dedes/miscellanea:misc.Ode5
ltx/en_us_dedes/tr.d041:trMA.Ode5C11.text	
ltx/en_us_dedes/tr.d041:trMA.Ode5C12.incipit	…
ltx/en_us_dedes/tr.d041:trMA.Ode5C12.melody	@ltx/en_us_dedes/he.h.m5:heHE.OAnavallomenos.name
ltx/en_us_dedes/tr.d041:trMA.Ode5C12.mode	@ltx/en_us_dedes/miscellanea:misc.Mode5
ltx/en_us_dedes/tr.d041:trMA.Ode5C12.ode	@ltx/en_us_dedes/miscellanea:misc.Ode5
ltx/en_us_dedes/tr.d041:trMA.Ode5C12.text	
ltx/en_us_dedes/tr.d041:trMA.Ode5C13.incipit	…
ltx/en_us_dedes/tr.d041:trMA.Ode5C13.melody	@ltx/en_us_dedes/he.h.m5:heHE.OAnavallomenos.name
ltx/en_us_dedes/tr.d041:trMA.Ode5C13.mode	@ltx/en_us_dedes/miscellanea:misc.Mode5
ltx/en_us_dedes/tr.d041:trMA.Ode5C13.ode	@ltx/en_us_dedes/miscellanea:misc.Ode5
ltx/en_us_dedes/tr.d041:trMA.Ode5C13.text	
ltx/en_us_dedes/tr.d041:trMA.Ode5C1T.incipit	…
ltx/en_us_dedes/tr.d041:trMA.Ode5C1T.melody	@ltx/en_us_dedes/he.h.m5:heHE.OAnavallomenos.name
ltx/en_us_dedes/tr.d041:trMA.Ode5C1T.mode	@ltx/en_us_dedes/miscellanea:misc.Mode5
ltx/en_us_dedes/tr.d041:trMA.Ode5C1T.ode	@ltx/en_us_dedes/miscellanea:misc.Ode5
ltx/en_us_dedes/tr.d041:trMA.Ode5C1T.text	
ltx/en_us_dedes/tr.d041:trMA.Ode5C21.greekmelody	@ltx/en_us_dedes/he.h.m1:heHE.EkNyktosOrthrizontes.greekname
ltx/en_us_dedes/tr.d041:trMA.Ode5C21.incipit	…
ltx/en_us_dedes/tr.d041:trMA.Ode5C21.melody	@ltx/en_us_dedes/he.h.m1:heHE.EkNyktosOrthrizontes.name
ltx/en_us_dedes/tr.d041:trMA.Ode5C21.mode	@ltx/en_us_dedes/miscellanea:misc.Mode1
ltx/en_us_dedes/tr.d041:trMA.Ode5C21.ode	@ltx/en_us_dedes/miscellanea:misc.Ode5
ltx/en_us_dedes/tr.d041:trMA.Ode5C21.text	
ltx/en_us_dedes/tr.d041:trMA.Ode5C22.incipit	…
ltx/en_us_dedes/tr.d041:trMA.Ode5C22.melody	@ltx/en_us_dedes/he.h.m1:heHE.EkNyktosOrthrizontes.name
ltx/en_us_dedes/tr.d041:trMA.Ode5C22.mode	@ltx/en_us_dedes/miscellanea:misc.Mode1
ltx/en_us_dedes/tr.d041:trMA.Ode5C22.ode	@ltx/en_us_dedes/miscellanea:misc.Ode5
ltx/en_us_dedes/tr.d041:trMA.Ode5C22.text	
ltx/en_us_dedes/tr.d041:trMA.Ode5C2A1.incipit	…
ltx/en_us_dedes/tr.d041:trMA.Ode5C2A1.melody	@ltx/en_us_dedes/he.h.m1:heHE.EkNyktosOrthrizontes.name
ltx/en_us_dedes/tr.d041:trMA.Ode5C2A1.mode	@ltx/en_us_dedes/miscellanea:misc.Mode1
ltx/en_us_dedes/tr.d041:trMA.Ode5C2A1.ode	@ltx/en_us_dedes/miscellanea:misc.Ode5
ltx/en_us_dedes/tr.d041:trMA.Ode5C2A1.text	
ltx/en_us_dedes/tr.d041:trMA.Ode5C2H.greekmelody	@ltx/en_us_dedes/he.h.m1:heHE.EkNyktosOrthrizontes.greekname
ltx/en_us_dedes/tr.d041:trMA.Ode5C2H.incipit	@ltx/en_us_dedes/he.h.m1:heHE.EkNyktosOrthrizontes.incipit
ltx/en_us_dedes/tr.d041:trMA.Ode5C2H.melody	@ltx/en_us_dedes/he.h.m1:heHE.EkNyktosOrthrizontes.melody
ltx/en_us_dedes/tr.d041:trMA.Ode5C2H.mode	@ltx/en_us_dedes/miscellanea:misc.Mode1
ltx/en_us_dedes/tr.d041:trMA.Ode5C2H.ode	@ltx/en_us_dedes/miscellanea:misc.Ode5
ltx/en_us_dedes/tr.d041:trMA.Ode5C2H.text	@ltx/en_us_dedes/he.h.m1:heHE.EkNyktosOrthrizontes.text
ltx/en_us_dedes/tr.d041:trMA.Ode5C2T.incipit	…
ltx/en_us_dedes/tr.d041:trMA.Ode5C2T.melody	@ltx/en_us_dedes/he.h.m1:heHE.EkNyktosOrthrizontes.name
ltx/en_us_dedes/tr.d041:trMA.Ode5C2T.mode	@ltx/en_us_dedes/miscellanea:misc.Mode1
ltx/en_us_dedes/tr.d041:trMA.Ode5C2T.ode	@ltx/en_us_dedes/miscellanea:misc.Ode5
ltx/en_us_dedes/tr.d041:trMA.Ode5C2T.text	
ltx/en_us_dedes/tr.d041:trMA.Ode5C2Tr.incipit	…
ltx/en_us_dedes/tr.d041:trMA.Ode5C2Tr.melody	@ltx/en_us_dedes/he.h.m1:heHE.EkNyktosOrthrizontes.name
ltx/en_us_dedes/tr.d041:trMA.Ode5C2Tr.mode	@ltx/en_us_dedes/miscellanea:misc.Mode1
ltx/en_us_dedes/tr.d041:trMA.Ode5C2Tr.ode	@ltx/en_us_dedes/miscellanea:misc.Ode5
ltx/en_us_dedes/tr.d041:trMA.Ode5C2Tr.text	
ltx/en_us_dedes/tr.d041:trMA.Ode8C11.greekmelody	@ltx/en_us_dedes/he.h.m5:heHE.SoiToPantourgo.greekname
ltx/en_us_dedes/tr.d041:trMA.Ode8C11.incipit	…
ltx/en_us_dedes/tr.d041:trMA.Ode8C11.melody	@ltx/en_us_dedes/he.h.m5:heHE.SoiToPantourgo.name
ltx/en_us_dedes/tr.d041:trMA.Ode8C11.mode	@ltx/en_us_dedes/miscellanea:misc.Mode5
ltx/en_us_dedes/tr.d041:trMA.Ode8C11.ode	@ltx/en_us_dedes/miscellanea:misc.Ode8
ltx/en_us_dedes/tr.d041:trMA.Ode8C11.text	
ltx/en_us_dedes/tr.d041:trMA.Ode8C12.incipit	…
ltx/en_us_dedes/tr.d041:trMA.Ode8C12.melody	@ltx/en_us_dedes/he.h.m5:heHE.SoiToPantourgo.name
ltx/en_us_dedes/tr.d041:trMA.Ode8C12.mode	@ltx/en_us_dedes/miscellanea:misc.Mode5
ltx/en_us_dedes/tr.d041:trMA.Ode8C12.ode	@ltx/en_us_dedes/miscellanea:misc.Ode8
ltx/en_us_dedes/tr.d041:trMA.Ode8C12.text	
ltx/en_us_dedes/tr.d041:trMA.Ode8C13.incipit	…
ltx/en_us_dedes/tr.d041:trMA.Ode8C13.melody	@ltx/en_us_dedes/he.h.m5:heHE.SoiToPantourgo.name
ltx/en_us_dedes/tr.d041:trMA.Ode8C13.mode	@ltx/en_us_dedes/miscellanea:misc.Mode5
ltx/en_us_dedes/tr.d041:trMA.Ode8C13.ode	@ltx/en_us_dedes/miscellanea:misc.Ode8
ltx/en_us_dedes/tr.d041:trMA.Ode8C13.text	
ltx/en_us_dedes/tr.d041:trMA.Ode8C1T.incipit	…
ltx/en_us_dedes/tr.d041:trMA.Ode8C1T.melody	@ltx/en_us_dedes/he.h.m5:heHE.SoiToPantourgo.name
ltx/en_us_dedes/tr.d041:trMA.Ode8C1T.mode	@ltx/en_us_dedes/miscellanea:misc.Mode5
ltx/en_us_dedes/tr.d041:trMA.Ode8C1T.ode	@ltx/en_us_dedes/miscellanea:misc.Ode8
ltx/en_us_dedes/tr.d041:trMA.Ode8C1T.text	
ltx/en_us_dedes/tr.d041:trMA.Ode8C21.greekmelody	@ltx/en_us_dedes/he.h.m1:heHE.TonTousYmnologousEnKamino.greekname
ltx/en_us_dedes/tr.d041:trMA.Ode8C21.incipit	…
ltx/en_us_dedes/tr.d041:trMA.Ode8C21.melody	@ltx/en_us_dedes/he.h.m1:heHE.TonTousYmnologousEnKamino.name
ltx/en_us_dedes/tr.d041:trMA.Ode8C21.mode	@ltx/en_us_dedes/miscellanea:misc.Mode1
ltx/en_us_dedes/tr.d041:trMA.Ode8C21.ode	@ltx/en_us_dedes/miscellanea:misc.Ode8
ltx/en_us_dedes/tr.d041:trMA.Ode8C21.text	
ltx/en_us_dedes/tr.d041:trMA.Ode8C22.incipit	…
ltx/en_us_dedes/tr.d041:trMA.Ode8C22.melody	@ltx/en_us_dedes/he.h.m1:heHE.TonTousYmnologousEnKamino.name
ltx/en_us_dedes/tr.d041:trMA.Ode8C22.mode	@ltx/en_us_dedes/miscellanea:misc.Mode1
ltx/en_us_dedes/tr.d041:trMA.Ode8C22.ode	@ltx/en_us_dedes/miscellanea:misc.Ode8
ltx/en_us_dedes/tr.d041:trMA.Ode8C22.text	
ltx/en_us_dedes/tr.d041:trMA.Ode8C2A1.incipit	…
ltx/en_us_dedes/tr.d041:trMA.Ode8C2A1.melody	@ltx/en_us_dedes/he.h.m1:heHE.TonTousYmnologousEnKamino.name
ltx/en_us_dedes/tr.d041:trMA.Ode8C2A1.mode	@ltx/en_us_dedes/miscellanea:misc.Mode1
ltx/en_us_dedes/tr.d041:trMA.Ode8C2A1.ode	@ltx/en_us_dedes/miscellanea:misc.Ode8
ltx/en_us_dedes/tr.d041:trMA.Ode8C2A1.text	
ltx/en_us_dedes/tr.d041:trMA.Ode8C2H.greekmelody	@ltx/en_us_dedes/he.h.m1:heHE.TonTousYmnologousEnKamino.greekname
ltx/en_us_dedes/tr.d041:trMA.Ode8C2H.incipit	@ltx/en_us_dedes/he.h.m1:heHE.TonTousYmnologousEnKamino.incipit
ltx/en_us_dedes/tr.d041:trMA.Ode8C2H.melody	@ltx/en_us_dedes/he.h.m1:heHE.TonTousYmnologousEnKamino.melody
ltx/en_us_dedes/tr.d041:trMA.Ode8C2H.mode	@ltx/en_us_dedes/miscellanea:misc.Mode1
ltx/en_us_dedes/tr.d041:trMA.Ode8C2H.ode	@ltx/en_us_dedes/miscellanea:misc.Ode8
ltx/en_us_dedes/tr.d041:trMA.Ode8C2H.text	@ltx/en_us_dedes/he.h.m1:heHE.TonTousYmnologousEnKamino.text
ltx/en_us_dedes/tr.d041:trMA.Ode8C2T.incipit	…
ltx/en_us_dedes/tr.d041:trMA.Ode8C2T.melody	@ltx/en_us_dedes/he.h.m1:heHE.TonTousYmnologousEnKamino.name
ltx/en_us_dedes/tr.d041:trMA.Ode8C2T.mode	@ltx/en_us_dedes/miscellanea:misc.Mode1
ltx/en_us_dedes/tr.d041:trMA.Ode8C2T.ode	@ltx/en_us_dedes/miscellanea:misc.Ode8
ltx/en_us_dedes/tr.d041:trMA.Ode8C2T.text	
ltx/en_us_dedes/tr.d041:trMA.Ode8C2Tr.incipit	…
ltx/en_us_dedes/tr.d041:trMA.Ode8C2Tr.melody	@ltx/en_us_dedes/he.h.m1:heHE.TonTousYmnologousEnKamino.name
ltx/en_us_dedes/tr.d041:trMA.Ode8C2Tr.mode	@ltx/en_us_dedes/miscellanea:misc.Mode1
ltx/en_us_dedes/tr.d041:trMA.Ode8C2Tr.ode	@ltx/en_us_dedes/miscellanea:misc.Ode8
ltx/en_us_dedes/tr.d041:trMA.Ode8C2Tr.text	
ltx/en_us_dedes/tr.d041:trMA.Ode9C11.greekmelody	@ltx/en_us_dedes/he.h.m5:heHE.IsaiaChoreve.greekname
ltx/en_us_dedes/tr.d041:trMA.Ode9C11.incipit	…
ltx/en_us_dedes/tr.d041:trMA.Ode9C11.melody	@ltx/en_us_dedes/he.h.m5:heHE.IsaiaChoreve.name
ltx/en_us_dedes/tr.d041:trMA.Ode9C11.mode	@ltx/en_us_dedes/miscellanea:misc.Mode5
ltx/en_us_dedes/tr.d041:trMA.Ode9C11.ode	@ltx/en_us_dedes/miscellanea:misc.Ode9
ltx/en_us_dedes/tr.d041:trMA.Ode9C11.text	
ltx/en_us_dedes/tr.d041:trMA.Ode9C12.incipit	…
ltx/en_us_dedes/tr.d041:trMA.Ode9C12.melody	@ltx/en_us_dedes/he.h.m5:heHE.IsaiaChoreve.name
ltx/en_us_dedes/tr.d041:trMA.Ode9C12.mode	@ltx/en_us_dedes/miscellanea:misc.Mode5
ltx/en_us_dedes/tr.d041:trMA.Ode9C12.ode	@ltx/en_us_dedes/miscellanea:misc.Ode9
ltx/en_us_dedes/tr.d041:trMA.Ode9C12.text	
ltx/en_us_dedes/tr.d041:trMA.Ode9C13.incipit	…
ltx/en_us_dedes/tr.d041:trMA.Ode9C13.melody	@ltx/en_us_dedes/he.h.m5:heHE.IsaiaChoreve.name
ltx/en_us_dedes/tr.d041:trMA.Ode9C13.mode	@ltx/en_us_dedes/miscellanea:misc.Mode5
ltx/en_us_dedes/tr.d041:trMA.Ode9C13.ode	@ltx/en_us_dedes/miscellanea:misc.Ode9
ltx/en_us_dedes/tr.d041:trMA.Ode9C13.text	
ltx/en_us_dedes/tr.d041:trMA.Ode9C1T.incipit	…
ltx/en_us_dedes/tr.d041:trMA.Ode9C1T.melody	@ltx/en_us_dedes/he.h.m5:heHE.IsaiaChoreve.name
ltx/en_us_dedes/tr.d041:trMA.Ode9C1T.mode	@ltx/en_us_dedes/miscellanea:misc.Mode5
ltx/en_us_dedes/tr.d041:trMA.Ode9C1T.ode	@ltx/en_us_dedes/miscellanea:misc.Ode9
ltx/en_us_dedes/tr.d041:trMA.Ode9C1T.text	
ltx/en_us_dedes/tr.d041:trMA.Ode9C21.greekmelody	@ltx/en_us_dedes/he.h.m1:heHE.SeInPerEideMoysis.greekname
ltx/en_us_dedes/tr.d041:trMA.Ode9C21.incipit	…
ltx/en_us_dedes/tr.d041:trMA.Ode9C21.melody	@ltx/en_us_dedes/he.h.m1:heHE.SeInPerEideMoysis.name
ltx/en_us_dedes/tr.d041:trMA.Ode9C21.mode	@ltx/en_us_dedes/miscellanea:misc.Mode1
ltx/en_us_dedes/tr.d041:trMA.Ode9C21.ode	@ltx/en_us_dedes/miscellanea:misc.Ode9
ltx/en_us_dedes/tr.d041:trMA.Ode9C21.text	
ltx/en_us_dedes/tr.d041:trMA.Ode9C22.incipit	…
ltx/en_us_dedes/tr.d041:trMA.Ode9C22.melody	@ltx/en_us_dedes/he.h.m1:heHE.SeInPerEideMoysis.name
ltx/en_us_dedes/tr.d041:trMA.Ode9C22.mode	@ltx/en_us_dedes/miscellanea:misc.Mode1
ltx/en_us_dedes/tr.d041:trMA.Ode9C22.ode	@ltx/en_us_dedes/miscellanea:misc.Ode9
ltx/en_us_dedes/tr.d041:trMA.Ode9C22.text	
ltx/en_us_dedes/tr.d041:trMA.Ode9C2A1.incipit	…
ltx/en_us_dedes/tr.d041:trMA.Ode9C2A1.melody	@ltx/en_us_dedes/he.h.m1:heHE.SeInPerEideMoysis.name
ltx/en_us_dedes/tr.d041:trMA.Ode9C2A1.mode	@ltx/en_us_dedes/miscellanea:misc.Mode1
ltx/en_us_dedes/tr.d041:trMA.Ode9C2A1.ode	@ltx/en_us_dedes/miscellanea:misc.Ode9
ltx/en_us_dedes/tr.d041:trMA.Ode9C2A1.text	
ltx/en_us_dedes/tr.d041:trMA.Ode9C2H.greekmelody	@ltx/en_us_dedes/he.h.m1:heHE.SeInPerEideMoysis.greekname
ltx/en_us_dedes/tr.d041:trMA.Ode9C2H.incipit	@ltx/en_us_dedes/he.h.m1:heHE.SeInPerEideMoysis.incipit
ltx/en_us_dedes/tr.d041:trMA.Ode9C2H.melody	@ltx/en_us_dedes/he.h.m1:heHE.SeInPerEideMoysis.melody
ltx/en_us_dedes/tr.d041:trMA.Ode9C2H.mode	@ltx/en_us_dedes/miscellanea:misc.Mode1
ltx/en_us_dedes/tr.d041:trMA.Ode9C2H.ode	@ltx/en_us_dedes/miscellanea:misc.Ode9
ltx/en_us_dedes/tr.d041:trMA.Ode9C2H.text	@ltx/en_us_dedes/he.h.m1:heHE.SeInPerEideMoysis.text
ltx/en_us_dedes/tr.d041:trMA.Ode9C2T.incipit	…
ltx/en_us_dedes/tr.d041:trMA.Ode9C2T.melody	@ltx/en_us_dedes/he.h.m1:heHE.SeInPerEideMoysis.name
ltx/en_us_dedes/tr.d041:trMA.Ode9C2T.mode	@ltx/en_us_dedes/miscellanea:misc.Mode1
ltx/en_us_dedes/tr.d041:trMA.Ode9C2T.ode	@ltx/en_us_dedes/miscellanea:misc.Ode9
ltx/en_us_dedes/tr.d041:trMA.Ode9C2T.text	
ltx/en_us_dedes/tr.d041:trMA.Ode9C2Tr.incipit	…
ltx/en_us_dedes/tr.d041:trMA.Ode9C2Tr.melody	@ltx/en_us_dedes/he.h.m1:heHE.SeInPerEideMoysis.name
ltx/en_us_dedes/tr.d041:trMA.Ode9C2Tr.mode	@ltx/en_us_dedes/miscellanea:misc.Mode1
ltx/en_us_dedes/tr.d041:trMA.Ode9C2Tr.ode	@ltx/en_us_dedes/miscellanea:misc.Ode9
ltx/en_us_dedes/tr.d041:trMA.Ode9C2Tr.text	
ltx/en_us_dedes/tr.d041:trTE.Troparion.incipit	…
ltx/en_us_dedes/tr.d041:trTE.Troparion.melody	
ltx/en_us_dedes/tr.d041:trTE.Troparion.mode	@ltx/en_us_dedes/miscellanea:misc.Mode8
ltx/en_us_dedes/tr.d041:trTE.Troparion.text	
ltx/en_us_dedes/tr.d041:trVE.AposIdiomelon1.incipit	O Christ our God, the…
ltx/en_us_dedes/tr.d041:trVE.AposIdiomelon1.melody	@ltx/en_us_dedes/miscellanea:misc.Idiomelon
ltx/en_us_dedes/tr.d041:trVE.AposIdiomelon1.mode	@ltx/en_us_dedes/miscellanea:misc.Mode6
ltx/en_us_dedes/tr.d041:trVE.AposIdiomelon1.text	O Christ our God, the life of all, who were hung on the tree of the Cross, I pray You, make my soul alive again, for it has died because of transgressions. Forgive me, Your sheep, lest I be utterly lost, O Good Shepherd. Alas, I took a break from Your commandments, and thus willfully sinning, I squandered the fortune of sinlessness that You had given me. I have been corrupted, I have become abhorrent, for I have engaged in what is depraved. So I implore You to draw me to repentance and to renew me, O only very merciful Lord.
ltx/en_us_dedes/tr.d041:trVE.AposMartyric.incipit	@ltx/en_us_dedes/oc.m6.d2:ocVE.Aposticha3.incipit
ltx/en_us_dedes/tr.d041:trVE.AposMartyric.melody	
ltx/en_us_dedes/tr.d041:trVE.AposMartyric.mode	@ltx/en_us_dedes/miscellanea:misc.Mode6
ltx/en_us_dedes/tr.d041:trVE.AposMartyric.text	@ltx/en_us_dedes/oc.m6.d2:ocVE.Aposticha3.text
ltx/en_us_dedes/tr.d041:trVE.AposTheotokion.greekmelody	@ltx/en_us_dedes/he.a.m6:heAU.TriimerosAnestis.greekname
ltx/en_us_dedes/tr.d041:trVE.AposTheotokion.incipit	@ltx/en_us_dedes/oc.m6.d4:ocVE.AposTheotokion.incipit
ltx/en_us_dedes/tr.d041:trVE.AposTheotokion.melody	@ltx/en_us_dedes/he.a.m6:heAU.TriimerosAnestis.name
ltx/en_us_dedes/tr.d041:trVE.AposTheotokion.mode	@ltx/en_us_dedes/miscellanea:misc.Mode6
ltx/en_us_dedes/tr.d041:trVE.AposTheotokion.text	@ltx/en_us_dedes/oc.m6.d4:ocVE.AposTheotokion.text
ltx/en_us_dedes/tr.d041:trVE.Stichera01.greekmelody	@ltx/en_us_dedes/he.a.m5:heAU.ChairoisAskitikon.greekname
ltx/en_us_dedes/tr.d041:trVE.Stichera01.incipit	O Savior, the true sweetness…
ltx/en_us_dedes/tr.d041:trVE.Stichera01.melody	@ltx/en_us_dedes/he.a.m5:heAU.ChairoisAskitikon.notmetered
ltx/en_us_dedes/tr.d041:trVE.Stichera01.mode	@ltx/en_us_dedes/miscellanea:misc.Mode5
ltx/en_us_dedes/tr.d041:trVE.Stichera01.poet	@ltx/en_us_dedes/poets:po.Iosif
ltx/en_us_dedes/tr.d041:trVE.Stichera01.text	O Savior, the true sweetness, of old You made the bitter waters of Marah sweet with the wood, which was a figure of the divine Cross. When You were crucified on it, it was Your good pleasure to taste gall. When Your side was pierced, You poured out the water of forgiveness and refashioned our mortal nature. Therefore we glorify Your ineffable power, and we implore You: O Lord, during this season of Lent, grant us the fear of You, forgiveness of offenses, and the great mercy.
ltx/en_us_dedes/tr.d041:trVE.Stichera02.greekmelody	@ltx/en_us_dedes/he.a.m5:heAU.ChairoisAskitikon.greekname
ltx/en_us_dedes/tr.d041:trVE.Stichera02.incipit	O Logos, You were stretched…
ltx/en_us_dedes/tr.d041:trVE.Stichera02.melody	@ltx/en_us_dedes/he.a.m5:heAU.ChairoisAskitikon.notmetered
ltx/en_us_dedes/tr.d041:trVE.Stichera02.mode	@ltx/en_us_dedes/miscellanea:misc.Mode5
ltx/en_us_dedes/tr.d041:trVE.Stichera02.text	O Logos, You were stretched out on the Cross, and You gathered those who had gone far from You. Lift my thoughts from the dunghill of the sinful passions, and make it rich in all the virtues. To my heart grant the purest fear of You; to my soul grant perfect love, that severs me from love for my body, so that through self-control, prayer, and supplication I might be pleasing to You in these days of Lent, and may cheerfully celebrate the day of Your Resurrection, and receive the great mercy.
ltx/en_us_dedes/tr.d041:trVE.Stichera03.greekmelody	@ltx/en_us_dedes/he.a.m1:heAU.NefelinSeFotos.greekname
ltx/en_us_dedes/tr.d041:trVE.Stichera03.incipit	O Christ the Logos, when…
ltx/en_us_dedes/tr.d041:trVE.Stichera03.melody	@ltx/en_us_dedes/he.a.m1:heAU.NefelinSeFotos.notmetered
ltx/en_us_dedes/tr.d041:trVE.Stichera03.mode	@ltx/en_us_dedes/miscellanea:misc.Mode1
ltx/en_us_dedes/tr.d041:trVE.Stichera03.poet	@ltx/en_us_dedes/poets:po.Theodorou
ltx/en_us_dedes/tr.d041:trVE.Stichera03.text	O Christ the Logos, when we have finished this third we of holy Lent, grant us to look upon the wood of your life-bearing Cross, and to solemnly venerate it. Grant us to sing in a manner that is worthy, to glorify Your power, to extol Your Passion, and in purity to arrive at the feast of Your glorious and holy Resurrection, Pascha, that mystical Passover, through which Adam returned to Paradise.
