ltx/en_us_dedes/pe.d072:peDA.commemoration.full	
ltx/en_us_dedes/pe.d072:peDA.commemoration.short	Bright Monday
ltx/en_us_dedes/pe.d072:peDA.dismissal	@ltx/en_us_dedes/dismissals:dis00.resurrection
ltx/en_us_dedes/pe.d072:peDA.insert1	
ltx/en_us_dedes/pe.d072:peDA.insert2	
ltx/en_us_dedes/pe.d072:peDA.note	
ltx/en_us_dedes/pe.d072:peHO.commemorations	
ltx/en_us_dedes/pe.d072:peHO.daytitle	
ltx/en_us_dedes/pe.d072:peHO.description1	
ltx/en_us_dedes/pe.d072:peHO.description2	
ltx/en_us_dedes/pe.d072:peHO.note1	
ltx/en_us_dedes/pe.d072:peHO.note2	
ltx/en_us_dedes/pe.d072:peMA.Lauds1.incipit	@ltx/en_us_dedes/oc.m2.d1:ocMA.Lauds1.incipit
ltx/en_us_dedes/pe.d072:peMA.Lauds1.melody	
ltx/en_us_dedes/pe.d072:peMA.Lauds1.mode	@ltx/en_us_dedes/miscellanea:misc.Mode2
ltx/en_us_dedes/pe.d072:peMA.Lauds1.text	@ltx/en_us_dedes/oc.m2.d1:ocMA.Lauds1.text
ltx/en_us_dedes/pe.d072:peMA.Lauds2.incipit	@ltx/en_us_dedes/oc.m2.d1:ocMA.Lauds2.incipit
ltx/en_us_dedes/pe.d072:peMA.Lauds2.melody	
ltx/en_us_dedes/pe.d072:peMA.Lauds2.mode	@ltx/en_us_dedes/miscellanea:misc.Mode2
ltx/en_us_dedes/pe.d072:peMA.Lauds2.text	@ltx/en_us_dedes/oc.m2.d1:ocMA.Lauds2.text
ltx/en_us_dedes/pe.d072:peMA.Lauds3.incipit	@ltx/en_us_dedes/oc.m2.d1:ocMA.Lauds3.incipit
ltx/en_us_dedes/pe.d072:peMA.Lauds3.melody	
ltx/en_us_dedes/pe.d072:peMA.Lauds3.mode	@ltx/en_us_dedes/miscellanea:misc.Mode2
ltx/en_us_dedes/pe.d072:peMA.Lauds3.text	@ltx/en_us_dedes/oc.m2.d1:ocMA.Lauds3.text
ltx/en_us_dedes/pe.d072:peMA.Lauds4.incipit	@ltx/en_us_dedes/oc.m2.d1:ocMA.Lauds4.incipit
ltx/en_us_dedes/pe.d072:peMA.Lauds4.melody	
ltx/en_us_dedes/pe.d072:peMA.Lauds4.mode	@ltx/en_us_dedes/miscellanea:misc.Mode2
ltx/en_us_dedes/pe.d072:peMA.Lauds4.text	@ltx/en_us_dedes/oc.m2.d1:ocMA.Lauds4.text
ltx/en_us_dedes/pe.d072:peMA.MM.Lauds1234as1234.text	@ltx/en_us_dedes/properties:media.key
ltx/en_us_dedes/pe.d072:peMA.MM.Lauds123as123.text	@ltx/en_us_dedes/properties:media.key
ltx/en_us_dedes/pe.d072:peVE.Aposticha1.incipit	@ltx/en_us_dedes/oc.m2.d1:ocVE.Aposticha1.incipit
ltx/en_us_dedes/pe.d072:peVE.Aposticha1.melody	
ltx/en_us_dedes/pe.d072:peVE.Aposticha1.mode	@ltx/en_us_dedes/miscellanea:misc.Mode2
ltx/en_us_dedes/pe.d072:peVE.Aposticha1.text	@ltx/en_us_dedes/oc.m2.d1:ocVE.Aposticha1.text
ltx/en_us_dedes/pe.d072:peVE.MM.Stichera1234as3456.text	
ltx/en_us_dedes/pe.d072:peVE.SticBoth.incipit	@ltx/en_us_dedes/oc.m2.d1:ocVE.SticTheotokion.incipit
ltx/en_us_dedes/pe.d072:peVE.SticBoth.melody	
ltx/en_us_dedes/pe.d072:peVE.SticBoth.mode	@ltx/en_us_dedes/miscellanea:misc.Mode2
ltx/en_us_dedes/pe.d072:peVE.SticBoth.text	@ltx/en_us_dedes/oc.m2.d1:ocVE.SticTheotokion.text
ltx/en_us_dedes/pe.d072:peVE.SticGlory.incipit	@ltx/en_us_dedes/oc.m2.d1:ocVE.Stichera7.incipit
ltx/en_us_dedes/pe.d072:peVE.SticGlory.melody	
ltx/en_us_dedes/pe.d072:peVE.SticGlory.mode	@ltx/en_us_dedes/miscellanea:misc.Mode2
ltx/en_us_dedes/pe.d072:peVE.SticGlory.text	@ltx/en_us_dedes/oc.m2.d1:ocVE.Stichera7.text
ltx/en_us_dedes/pe.d072:peVE.Stichera01.incipit	@ltx/en_us_dedes/oc.m2.d1:ocVE.Stichera1.incipit
ltx/en_us_dedes/pe.d072:peVE.Stichera01.melody	
ltx/en_us_dedes/pe.d072:peVE.Stichera01.mode	@ltx/en_us_dedes/miscellanea:misc.Mode2
ltx/en_us_dedes/pe.d072:peVE.Stichera01.text	@ltx/en_us_dedes/oc.m2.d1:ocVE.Stichera1.text
ltx/en_us_dedes/pe.d072:peVE.Stichera02.incipit	@ltx/en_us_dedes/oc.m2.d1:ocVE.Stichera2.incipit
ltx/en_us_dedes/pe.d072:peVE.Stichera02.melody	
ltx/en_us_dedes/pe.d072:peVE.Stichera02.mode	@ltx/en_us_dedes/miscellanea:misc.Mode2
ltx/en_us_dedes/pe.d072:peVE.Stichera02.text	@ltx/en_us_dedes/oc.m2.d1:ocVE.Stichera2.text
ltx/en_us_dedes/pe.d072:peVE.Stichera03.incipit	@ltx/en_us_dedes/oc.m2.d1:ocVE.Stichera3.incipit
ltx/en_us_dedes/pe.d072:peVE.Stichera03.melody	
ltx/en_us_dedes/pe.d072:peVE.Stichera03.mode	@ltx/en_us_dedes/miscellanea:misc.Mode2
ltx/en_us_dedes/pe.d072:peVE.Stichera03.text	@ltx/en_us_dedes/oc.m2.d1:ocVE.Stichera3.text
ltx/en_us_dedes/pe.d072:peVE.Stichera04.incipit	@ltx/en_us_dedes/oc.m2.d1:ocVE.Stichera4.incipit
ltx/en_us_dedes/pe.d072:peVE.Stichera04.melody	
ltx/en_us_dedes/pe.d072:peVE.Stichera04.mode	@ltx/en_us_dedes/miscellanea:misc.Mode2
ltx/en_us_dedes/pe.d072:peVE.Stichera04.text	@ltx/en_us_dedes/oc.m2.d1:ocVE.Stichera4.text
ltx/en_us_dedes/pe.d072:peVE.Stichera05.incipit	@ltx/en_us_dedes/oc.m2.d1:ocVE.Stichera5.incipit
ltx/en_us_dedes/pe.d072:peVE.Stichera05.melody	
ltx/en_us_dedes/pe.d072:peVE.Stichera05.mode	@ltx/en_us_dedes/miscellanea:misc.Mode2
ltx/en_us_dedes/pe.d072:peVE.Stichera05.text	@ltx/en_us_dedes/oc.m2.d1:ocVE.Stichera5.text
ltx/en_us_dedes/pe.d072:peVE.Stichera06.incipit	@ltx/en_us_dedes/oc.m2.d1:ocVE.Stichera6.incipit
ltx/en_us_dedes/pe.d072:peVE.Stichera06.melody	
ltx/en_us_dedes/pe.d072:peVE.Stichera06.mode	@ltx/en_us_dedes/miscellanea:misc.Mode2
ltx/en_us_dedes/pe.d072:peVE.Stichera06.text	@ltx/en_us_dedes/oc.m2.d1:ocVE.Stichera6.text
