ltx/en_us_dedes/me.m01.d29:meDA.commemoration.first	Transfer of the Relics of St. Ignatius the God-bearer
ltx/en_us_dedes/me.m01.d29:meDA.commemoration.first_name	
ltx/en_us_dedes/me.m01.d29:meDA.commemoration.first_short	Transfer of the Relics of St. Ignatius the God-bearer
ltx/en_us_dedes/me.m01.d29:meDA.commemoration.first_title	@ltx/en_us_dedes/titles:ti.SaintM
ltx/en_us_dedes/me.m01.d29:meDA.commemoration.full	The Transfer of the Relics of the Holy Hieromartyr Ignatius the God-bearer
ltx/en_us_dedes/me.m01.d29:meDA.commemoration.second_name	
ltx/en_us_dedes/me.m01.d29:meDA.commemoration.second_title	
ltx/en_us_dedes/me.m01.d29:meDA.date	January 29
ltx/en_us_dedes/me.m01.d29:meDA.fordate	for January 29
ltx/en_us_dedes/me.m01.d29:meDA.insert1	the holy and glorious hieromartyr Ignatius the God-bearer,
ltx/en_us_dedes/me.m01.d29:meDA.insert2	the memory of the transfer of whose holy relic we observe;
ltx/en_us_dedes/me.m01.d29:meDA.note	
ltx/en_us_dedes/me.m01.d29:meDA.pdfcoverdate	January 29,
ltx/en_us_dedes/me.m01.d29:meDA.pdfheaderdate	January 29
ltx/en_us_dedes/me.m01.d29:meHO.commemorations	
ltx/en_us_dedes/me.m01.d29:meHO.note1	
ltx/en_us_dedes/me.m01.d29:meHO.note2	
ltx/en_us_dedes/me.m01.d29:meHO.number	29.
ltx/en_us_dedes/me.m01.d29:meHO.rank	
ltx/en_us_dedes/me.m01.d29:meLE.commemoration1	The Translation of the Relics of the Holy Hieromartyr Ignatios the God-bearer.
ltx/en_us_dedes/me.m01.d29:meLE.commemoration2	
ltx/en_us_dedes/me.m01.d29:meLI.Kontakion1.greekmelody	@ltx/en_us_dedes/me.m01.d29:meMA.Kontakion1.greekmelody
ltx/en_us_dedes/me.m01.d29:meLI.Kontakion1.incipit	@ltx/en_us_dedes/me.m01.d29:meMA.Kontakion1.incipit
ltx/en_us_dedes/me.m01.d29:meLI.Kontakion1.melody	@ltx/en_us_dedes/me.m01.d29:meMA.Kontakion1.melody
ltx/en_us_dedes/me.m01.d29:meLI.Kontakion1.mode	@ltx/en_us_dedes/me.m01.d29:meMA.Kontakion1.mode
ltx/en_us_dedes/me.m01.d29:meLI.Kontakion1.text	@ltx/en_us_dedes/me.m01.d29:meMA.Kontakion1.text
ltx/en_us_dedes/me.m01.d29:meLI.MM.CommunionHymn.text	@ltx/en_us_dedes/properties:media.key
ltx/en_us_dedes/me.m01.d29:meLI.Megalynarion.text	
ltx/en_us_dedes/me.m01.d29:meMA.AposGlory.incipit	…
ltx/en_us_dedes/me.m01.d29:meMA.AposGlory.melody	
ltx/en_us_dedes/me.m01.d29:meMA.AposGlory.mode	@ltx/en_us_dedes/miscellanea:misc.Mode1
ltx/en_us_dedes/me.m01.d29:meMA.AposGlory.text	
ltx/en_us_dedes/me.m01.d29:meMA.AposStavrotheotokion.greekmelody	@ltx/en_us_dedes/he.a.m1:heAU.PaneffimoiMartyres.greekname
ltx/en_us_dedes/me.m01.d29:meMA.AposStavrotheotokion.incipit	@ltx/en_us_dedes/oc.m1.d4:ocVE.SticTheotokion.incipit
ltx/en_us_dedes/me.m01.d29:meMA.AposStavrotheotokion.melody	@ltx/en_us_dedes/he.a.m1:heAU.PaneffimoiMartyres.name
ltx/en_us_dedes/me.m01.d29:meMA.AposStavrotheotokion.mode	@ltx/en_us_dedes/miscellanea:misc.Mode1
ltx/en_us_dedes/me.m01.d29:meMA.AposStavrotheotokion.text	@ltx/en_us_dedes/oc.m1.d4:ocVE.SticTheotokion.text
ltx/en_us_dedes/me.m01.d29:meMA.AposTheotokion.greekmelody	@ltx/en_us_dedes/he.a.m1:heAU.PaneffimoiMartyres.greekname
ltx/en_us_dedes/me.m01.d29:meMA.AposTheotokion.incipit	I pray you to heal…
ltx/en_us_dedes/me.m01.d29:meMA.AposTheotokion.melody	@ltx/en_us_dedes/he.a.m1:heAU.PaneffimoiMartyres.name
ltx/en_us_dedes/me.m01.d29:meMA.AposTheotokion.mode	@ltx/en_us_dedes/miscellanea:misc.Mode1
ltx/en_us_dedes/me.m01.d29:meMA.AposTheotokion.text	I pray you to heal my wretched soul, * which is seriously ill with the most wicked of passions, O all-lauded Virgin pure, * as the one who gave birth * to the Savior of us all, to Christ God, the Healer, who cures every infirmity of ours, * and who wounded all the wickedness * of the devil, * and freed us from sin and death.
ltx/en_us_dedes/me.m01.d29:meMA.C1.acrostic.notice1	
ltx/en_us_dedes/me.m01.d29:meMA.C1.acrostic.text	
ltx/en_us_dedes/me.m01.d29:meMA.C1.acrostic.title	Canon for the Saint.
ltx/en_us_dedes/me.m01.d29:meMA.C1.poet	@ltx/en_us_dedes/poets:po.Theofanous
ltx/en_us_dedes/me.m01.d29:meMA.C1.title	@ltx/en_us_dedes/titles:ti.CanonSaintM
ltx/en_us_dedes/me.m01.d29:meMA.C1.verse	@ltx/en_us_dedes/prayers:pr.verse_SaintM.text
ltx/en_us_dedes/me.m01.d29:meMA.ExapTheotokion.incipit	All-blameless one, you did indeed…
ltx/en_us_dedes/me.m01.d29:meMA.ExapTheotokion.melody	@ltx/en_us_dedes/he.a.m2:heAU.GynaikesAkoutisthite.name
ltx/en_us_dedes/me.m01.d29:meMA.ExapTheotokion.mode	@ltx/en_us_dedes/miscellanea:misc.Mode2
ltx/en_us_dedes/me.m01.d29:meMA.ExapTheotokion.text	All-blameless one, you did indeed * ineffably give birth to God * in two wills and in two natures, * but in a single hypostasis. * And for our sakes He willingly * was poor and even crucified. * He generously granted us * the riches of the Godhead, * O Virgin Theotokos.
ltx/en_us_dedes/me.m01.d29:meMA.Exaposteilarion1.greekmelody	@ltx/en_us_dedes/he.a.m2:heAU.GynaikesAkoutisthite.greekname
ltx/en_us_dedes/me.m01.d29:meMA.Exaposteilarion1.incipit	Save those who longingly observe…
ltx/en_us_dedes/me.m01.d29:meMA.Exaposteilarion1.melody	@ltx/en_us_dedes/he.a.m2:heAU.GynaikesAkoutisthite.name
ltx/en_us_dedes/me.m01.d29:meMA.Exaposteilarion1.mode	@ltx/en_us_dedes/miscellanea:misc.Mode2
ltx/en_us_dedes/me.m01.d29:meMA.Exaposteilarion1.text	Save those who longingly observe * the joyous feast of your return, * O God-bearer, Saint Ignatius, * and all-blessed Hieromartyr,* from every tribulation and * injury from the evil one; * and since from Christ you have received * authority to forgive sins, * forgive us all our offenses.
ltx/en_us_dedes/me.m01.d29:meMA.Kontakion1.greekmelody	@ltx/en_us_dedes/he.a.m4:heAU.EpefanisSimeron.greekname
ltx/en_us_dedes/me.m01.d29:meMA.Kontakion1.incipit	Having risen in the East…
ltx/en_us_dedes/me.m01.d29:meMA.Kontakion1.melody	@ltx/en_us_dedes/he.a.m4:heAU.EpefanisSimeron.name
ltx/en_us_dedes/me.m01.d29:meMA.Kontakion1.mode	@ltx/en_us_dedes/miscellanea:misc.Mode4
ltx/en_us_dedes/me.m01.d29:meMA.Kontakion1.text	Having risen in the East, and by his teachings * shedding light throughout the world, * the holy God-bearer is now * indeed adorned by his martyrdom, * divine Ignatius, who truly was held by God.
ltx/en_us_dedes/me.m01.d29:meMA.MM.Ve1234as5678.text	@ltx/en_us_dedes/properties:media.key
ltx/en_us_dedes/me.m01.d29:meMA.Ode1C11.greekmelody	@ltx/en_us_dedes/he.h.m4:heHE.ThalassisToErythraion.greekname
ltx/en_us_dedes/me.m01.d29:meMA.Ode1C11.incipit	…
ltx/en_us_dedes/me.m01.d29:meMA.Ode1C11.melody	@ltx/en_us_dedes/he.h.m4:heHE.ThalassisToErythraion.name
ltx/en_us_dedes/me.m01.d29:meMA.Ode1C11.mode	@ltx/en_us_dedes/miscellanea:misc.Mode4
ltx/en_us_dedes/me.m01.d29:meMA.Ode1C11.ode	@ltx/en_us_dedes/miscellanea:misc.Ode1
ltx/en_us_dedes/me.m01.d29:meMA.Ode1C11.text	
ltx/en_us_dedes/me.m01.d29:meMA.Ode1C12.incipit	…
ltx/en_us_dedes/me.m01.d29:meMA.Ode1C12.melody	@ltx/en_us_dedes/he.h.m4:heHE.ThalassisToErythraion.name
ltx/en_us_dedes/me.m01.d29:meMA.Ode1C12.mode	@ltx/en_us_dedes/miscellanea:misc.Mode4
ltx/en_us_dedes/me.m01.d29:meMA.Ode1C12.ode	@ltx/en_us_dedes/miscellanea:misc.Ode1
ltx/en_us_dedes/me.m01.d29:meMA.Ode1C12.text	
ltx/en_us_dedes/me.m01.d29:meMA.Ode1C13.incipit	…
ltx/en_us_dedes/me.m01.d29:meMA.Ode1C13.melody	@ltx/en_us_dedes/he.h.m4:heHE.ThalassisToErythraion.name
ltx/en_us_dedes/me.m01.d29:meMA.Ode1C13.mode	@ltx/en_us_dedes/miscellanea:misc.Mode4
ltx/en_us_dedes/me.m01.d29:meMA.Ode1C13.ode	@ltx/en_us_dedes/miscellanea:misc.Ode1
ltx/en_us_dedes/me.m01.d29:meMA.Ode1C13.text	
ltx/en_us_dedes/me.m01.d29:meMA.Ode1C14.incipit	…
ltx/en_us_dedes/me.m01.d29:meMA.Ode1C14.melody	@ltx/en_us_dedes/he.h.m4:heHE.ThalassisToErythraion.name
ltx/en_us_dedes/me.m01.d29:meMA.Ode1C14.mode	@ltx/en_us_dedes/miscellanea:misc.Mode4
ltx/en_us_dedes/me.m01.d29:meMA.Ode1C14.ode	@ltx/en_us_dedes/miscellanea:misc.Ode1
ltx/en_us_dedes/me.m01.d29:meMA.Ode1C14.text	
ltx/en_us_dedes/me.m01.d29:meMA.Ode1C1T.incipit	…
ltx/en_us_dedes/me.m01.d29:meMA.Ode1C1T.melody	@ltx/en_us_dedes/he.h.m4:heHE.ThalassisToErythraion.name
ltx/en_us_dedes/me.m01.d29:meMA.Ode1C1T.mode	@ltx/en_us_dedes/miscellanea:misc.Mode4
ltx/en_us_dedes/me.m01.d29:meMA.Ode1C1T.ode	@ltx/en_us_dedes/miscellanea:misc.Ode1
ltx/en_us_dedes/me.m01.d29:meMA.Ode1C1T.text	
ltx/en_us_dedes/me.m01.d29:meMA.Ode3C11.greekmelody	@ltx/en_us_dedes/he.h.m4:heHE.EffrainetaiEpiSoi.greekname
ltx/en_us_dedes/me.m01.d29:meMA.Ode3C11.incipit	…
ltx/en_us_dedes/me.m01.d29:meMA.Ode3C11.melody	@ltx/en_us_dedes/he.h.m4:heHE.EffrainetaiEpiSoi.name
ltx/en_us_dedes/me.m01.d29:meMA.Ode3C11.mode	@ltx/en_us_dedes/miscellanea:misc.Mode4
ltx/en_us_dedes/me.m01.d29:meMA.Ode3C11.ode	@ltx/en_us_dedes/miscellanea:misc.Ode3
ltx/en_us_dedes/me.m01.d29:meMA.Ode3C11.text	
ltx/en_us_dedes/me.m01.d29:meMA.Ode3C12.incipit	…
ltx/en_us_dedes/me.m01.d29:meMA.Ode3C12.melody	@ltx/en_us_dedes/he.h.m4:heHE.EffrainetaiEpiSoi.name
ltx/en_us_dedes/me.m01.d29:meMA.Ode3C12.mode	@ltx/en_us_dedes/miscellanea:misc.Mode4
ltx/en_us_dedes/me.m01.d29:meMA.Ode3C12.ode	@ltx/en_us_dedes/miscellanea:misc.Ode3
ltx/en_us_dedes/me.m01.d29:meMA.Ode3C12.text	
ltx/en_us_dedes/me.m01.d29:meMA.Ode3C13.incipit	…
ltx/en_us_dedes/me.m01.d29:meMA.Ode3C13.melody	@ltx/en_us_dedes/he.h.m4:heHE.EffrainetaiEpiSoi.name
ltx/en_us_dedes/me.m01.d29:meMA.Ode3C13.mode	@ltx/en_us_dedes/miscellanea:misc.Mode4
ltx/en_us_dedes/me.m01.d29:meMA.Ode3C13.ode	@ltx/en_us_dedes/miscellanea:misc.Ode3
ltx/en_us_dedes/me.m01.d29:meMA.Ode3C13.text	
ltx/en_us_dedes/me.m01.d29:meMA.Ode3C1T.incipit	…
ltx/en_us_dedes/me.m01.d29:meMA.Ode3C1T.melody	@ltx/en_us_dedes/he.h.m4:heHE.EffrainetaiEpiSoi.name
ltx/en_us_dedes/me.m01.d29:meMA.Ode3C1T.mode	@ltx/en_us_dedes/miscellanea:misc.Mode4
ltx/en_us_dedes/me.m01.d29:meMA.Ode3C1T.ode	@ltx/en_us_dedes/miscellanea:misc.Ode3
ltx/en_us_dedes/me.m01.d29:meMA.Ode3C1T.text	
ltx/en_us_dedes/me.m01.d29:meMA.Ode3H.greekmelody	@ltx/en_us_dedes/he.h.m4:heHE.EffrainetaiEpiSoi.greekname
ltx/en_us_dedes/me.m01.d29:meMA.Ode3H.incipit	@ltx/en_us_dedes/he.h.m4:heHE.EffrainetaiEpiSoi.incipit
ltx/en_us_dedes/me.m01.d29:meMA.Ode3H.melody	@ltx/en_us_dedes/he.h.m4:heHE.EffrainetaiEpiSoi.melody
ltx/en_us_dedes/me.m01.d29:meMA.Ode3H.mode	@ltx/en_us_dedes/miscellanea:misc.Mode4
ltx/en_us_dedes/me.m01.d29:meMA.Ode3H.ode	@ltx/en_us_dedes/miscellanea:misc.Ode3
ltx/en_us_dedes/me.m01.d29:meMA.Ode3H.text	@ltx/en_us_dedes/he.h.m4:heHE.EffrainetaiEpiSoi.text
ltx/en_us_dedes/me.m01.d29:meMA.Ode3Kathisma1.greekmelody	@ltx/en_us_dedes/he.a.m3:heAU.TheiasPisteos.greekname
ltx/en_us_dedes/me.m01.d29:meMA.Ode3Kathisma1.incipit	…
ltx/en_us_dedes/me.m01.d29:meMA.Ode3Kathisma1.melody	@ltx/en_us_dedes/he.a.m3:heAU.TheiasPisteos.name
ltx/en_us_dedes/me.m01.d29:meMA.Ode3Kathisma1.mode	@ltx/en_us_dedes/miscellanea:misc.Mode3
ltx/en_us_dedes/me.m01.d29:meMA.Ode3Kathisma1.text	
ltx/en_us_dedes/me.m01.d29:meMA.Ode3KathismaSt.incipit	When the undefiled Ewe of…
ltx/en_us_dedes/me.m01.d29:meMA.Ode3KathismaSt.melody	@ltx/en_us_dedes/he.a.m3:heAU.TheiasPisteos.name
ltx/en_us_dedes/me.m01.d29:meMA.Ode3KathismaSt.mode	@ltx/en_us_dedes/miscellanea:misc.Mode3
ltx/en_us_dedes/me.m01.d29:meMA.Ode3KathismaSt.text	When the undefiled Ewe of the Logos, * the immaculate Mother and Virgin, * watched as her Son who was born without labor from her * was at His Passion mistreated and crucified, * she as a mother lamented and cried aloud, * “Alas! My Child, how is it that You suffer now? * To rescue from the sinful passions all mankind.”
ltx/en_us_dedes/me.m01.d29:meMA.Ode3KathismaT.incipit	@ltx/en_us_dedes/me.m01.d25:meMA.Kathisma1T.incipit
ltx/en_us_dedes/me.m01.d29:meMA.Ode3KathismaT.melody	@ltx/en_us_dedes/he.a.m3:heAU.TheiasPisteos.name
ltx/en_us_dedes/me.m01.d29:meMA.Ode3KathismaT.mode	@ltx/en_us_dedes/miscellanea:misc.Mode3
ltx/en_us_dedes/me.m01.d29:meMA.Ode3KathismaT.text	@ltx/en_us_dedes/me.m01.d25:meMA.Kathisma1T.text
ltx/en_us_dedes/me.m01.d29:meMA.Ode4C11.greekmelody	@ltx/en_us_dedes/he.h.m4:heHE.EparthentaSeIdousa.greekname
ltx/en_us_dedes/me.m01.d29:meMA.Ode4C11.incipit	…
ltx/en_us_dedes/me.m01.d29:meMA.Ode4C11.melody	@ltx/en_us_dedes/he.h.m4:heHE.EparthentaSeIdousa.name
ltx/en_us_dedes/me.m01.d29:meMA.Ode4C11.mode	@ltx/en_us_dedes/miscellanea:misc.Mode4
ltx/en_us_dedes/me.m01.d29:meMA.Ode4C11.ode	@ltx/en_us_dedes/miscellanea:misc.Ode4
ltx/en_us_dedes/me.m01.d29:meMA.Ode4C11.text	
ltx/en_us_dedes/me.m01.d29:meMA.Ode4C12.incipit	…
ltx/en_us_dedes/me.m01.d29:meMA.Ode4C12.melody	@ltx/en_us_dedes/he.h.m4:heHE.EparthentaSeIdousa.name
ltx/en_us_dedes/me.m01.d29:meMA.Ode4C12.mode	@ltx/en_us_dedes/miscellanea:misc.Mode4
ltx/en_us_dedes/me.m01.d29:meMA.Ode4C12.ode	@ltx/en_us_dedes/miscellanea:misc.Ode4
ltx/en_us_dedes/me.m01.d29:meMA.Ode4C12.text	
ltx/en_us_dedes/me.m01.d29:meMA.Ode4C13.incipit	…
ltx/en_us_dedes/me.m01.d29:meMA.Ode4C13.melody	@ltx/en_us_dedes/he.h.m4:heHE.EparthentaSeIdousa.name
ltx/en_us_dedes/me.m01.d29:meMA.Ode4C13.mode	@ltx/en_us_dedes/miscellanea:misc.Mode4
ltx/en_us_dedes/me.m01.d29:meMA.Ode4C13.ode	@ltx/en_us_dedes/miscellanea:misc.Ode4
ltx/en_us_dedes/me.m01.d29:meMA.Ode4C13.text	
ltx/en_us_dedes/me.m01.d29:meMA.Ode4C14.incipit	…
ltx/en_us_dedes/me.m01.d29:meMA.Ode4C14.melody	@ltx/en_us_dedes/he.h.m4:heHE.EparthentaSeIdousa.name
ltx/en_us_dedes/me.m01.d29:meMA.Ode4C14.mode	@ltx/en_us_dedes/miscellanea:misc.Mode4
ltx/en_us_dedes/me.m01.d29:meMA.Ode4C14.ode	@ltx/en_us_dedes/miscellanea:misc.Ode4
ltx/en_us_dedes/me.m01.d29:meMA.Ode4C14.text	
ltx/en_us_dedes/me.m01.d29:meMA.Ode4C1T.incipit	…
ltx/en_us_dedes/me.m01.d29:meMA.Ode4C1T.melody	@ltx/en_us_dedes/he.h.m4:heHE.EparthentaSeIdousa.name
ltx/en_us_dedes/me.m01.d29:meMA.Ode4C1T.mode	@ltx/en_us_dedes/miscellanea:misc.Mode4
ltx/en_us_dedes/me.m01.d29:meMA.Ode4C1T.ode	@ltx/en_us_dedes/miscellanea:misc.Ode4
ltx/en_us_dedes/me.m01.d29:meMA.Ode4C1T.text	
ltx/en_us_dedes/me.m01.d29:meMA.Ode5C11.greekmelody	@ltx/en_us_dedes/he.h.m4:heHE.SyKyrieMouFos.greekname
ltx/en_us_dedes/me.m01.d29:meMA.Ode5C11.incipit	…
ltx/en_us_dedes/me.m01.d29:meMA.Ode5C11.melody	@ltx/en_us_dedes/he.h.m4:heHE.SyKyrieMouFos.name
ltx/en_us_dedes/me.m01.d29:meMA.Ode5C11.mode	@ltx/en_us_dedes/miscellanea:misc.Mode4
ltx/en_us_dedes/me.m01.d29:meMA.Ode5C11.ode	@ltx/en_us_dedes/miscellanea:misc.Ode5
ltx/en_us_dedes/me.m01.d29:meMA.Ode5C11.text	
ltx/en_us_dedes/me.m01.d29:meMA.Ode5C12.incipit	…
ltx/en_us_dedes/me.m01.d29:meMA.Ode5C12.melody	@ltx/en_us_dedes/he.h.m4:heHE.SyKyrieMouFos.name
ltx/en_us_dedes/me.m01.d29:meMA.Ode5C12.mode	@ltx/en_us_dedes/miscellanea:misc.Mode4
ltx/en_us_dedes/me.m01.d29:meMA.Ode5C12.ode	@ltx/en_us_dedes/miscellanea:misc.Ode5
ltx/en_us_dedes/me.m01.d29:meMA.Ode5C12.text	
ltx/en_us_dedes/me.m01.d29:meMA.Ode5C13.incipit	…
ltx/en_us_dedes/me.m01.d29:meMA.Ode5C13.melody	@ltx/en_us_dedes/he.h.m4:heHE.SyKyrieMouFos.name
ltx/en_us_dedes/me.m01.d29:meMA.Ode5C13.mode	@ltx/en_us_dedes/miscellanea:misc.Mode4
ltx/en_us_dedes/me.m01.d29:meMA.Ode5C13.ode	@ltx/en_us_dedes/miscellanea:misc.Ode5
ltx/en_us_dedes/me.m01.d29:meMA.Ode5C13.text	
ltx/en_us_dedes/me.m01.d29:meMA.Ode5C1T.incipit	…
ltx/en_us_dedes/me.m01.d29:meMA.Ode5C1T.melody	@ltx/en_us_dedes/he.h.m4:heHE.SyKyrieMouFos.name
ltx/en_us_dedes/me.m01.d29:meMA.Ode5C1T.mode	@ltx/en_us_dedes/miscellanea:misc.Mode4
ltx/en_us_dedes/me.m01.d29:meMA.Ode5C1T.ode	@ltx/en_us_dedes/miscellanea:misc.Ode5
ltx/en_us_dedes/me.m01.d29:meMA.Ode5C1T.text	
ltx/en_us_dedes/me.m01.d29:meMA.Ode6C11.greekmelody	@ltx/en_us_dedes/he.h.m4:heHE.ThysoSoiMetaFonis.greekname
ltx/en_us_dedes/me.m01.d29:meMA.Ode6C11.incipit	…
ltx/en_us_dedes/me.m01.d29:meMA.Ode6C11.melody	@ltx/en_us_dedes/he.h.m4:heHE.ThysoSoiMetaFonis.name
ltx/en_us_dedes/me.m01.d29:meMA.Ode6C11.mode	@ltx/en_us_dedes/miscellanea:misc.Mode4
ltx/en_us_dedes/me.m01.d29:meMA.Ode6C11.ode	@ltx/en_us_dedes/miscellanea:misc.Ode6
ltx/en_us_dedes/me.m01.d29:meMA.Ode6C11.text	
ltx/en_us_dedes/me.m01.d29:meMA.Ode6C12.incipit	…
ltx/en_us_dedes/me.m01.d29:meMA.Ode6C12.melody	@ltx/en_us_dedes/he.h.m4:heHE.ThysoSoiMetaFonis.name
ltx/en_us_dedes/me.m01.d29:meMA.Ode6C12.mode	@ltx/en_us_dedes/miscellanea:misc.Mode4
ltx/en_us_dedes/me.m01.d29:meMA.Ode6C12.ode	@ltx/en_us_dedes/miscellanea:misc.Ode6
ltx/en_us_dedes/me.m01.d29:meMA.Ode6C12.text	
ltx/en_us_dedes/me.m01.d29:meMA.Ode6C13.incipit	…
ltx/en_us_dedes/me.m01.d29:meMA.Ode6C13.melody	@ltx/en_us_dedes/he.h.m4:heHE.ThysoSoiMetaFonis.name
ltx/en_us_dedes/me.m01.d29:meMA.Ode6C13.mode	@ltx/en_us_dedes/miscellanea:misc.Mode4
ltx/en_us_dedes/me.m01.d29:meMA.Ode6C13.ode	@ltx/en_us_dedes/miscellanea:misc.Ode6
ltx/en_us_dedes/me.m01.d29:meMA.Ode6C13.text	
ltx/en_us_dedes/me.m01.d29:meMA.Ode6C1T.incipit	…
ltx/en_us_dedes/me.m01.d29:meMA.Ode6C1T.melody	@ltx/en_us_dedes/he.h.m4:heHE.ThysoSoiMetaFonis.name
ltx/en_us_dedes/me.m01.d29:meMA.Ode6C1T.mode	@ltx/en_us_dedes/miscellanea:misc.Mode4
ltx/en_us_dedes/me.m01.d29:meMA.Ode6C1T.ode	@ltx/en_us_dedes/miscellanea:misc.Ode6
ltx/en_us_dedes/me.m01.d29:meMA.Ode6C1T.text	
ltx/en_us_dedes/me.m01.d29:meMA.Ode6H.greekmelody	@ltx/en_us_dedes/he.h.m4:heHE.ThysoSoiMetaFonis.greekname
ltx/en_us_dedes/me.m01.d29:meMA.Ode6H.incipit	@ltx/en_us_dedes/he.h.m4:heHE.ThysoSoiMetaFonis.incipit
ltx/en_us_dedes/me.m01.d29:meMA.Ode6H.melody	@ltx/en_us_dedes/he.h.m4:heHE.ThysoSoiMetaFonis.melody
ltx/en_us_dedes/me.m01.d29:meMA.Ode6H.mode	@ltx/en_us_dedes/miscellanea:misc.Mode4
ltx/en_us_dedes/me.m01.d29:meMA.Ode6H.ode	@ltx/en_us_dedes/miscellanea:misc.Ode6
ltx/en_us_dedes/me.m01.d29:meMA.Ode6H.text	@ltx/en_us_dedes/he.h.m4:heHE.ThysoSoiMetaFonis.text
ltx/en_us_dedes/me.m01.d29:meMA.Ode7C11.greekmelody	@ltx/en_us_dedes/he.h.m4:heHE.EnTiKaminoAvramiaioi.greekname
ltx/en_us_dedes/me.m01.d29:meMA.Ode7C11.incipit	…
ltx/en_us_dedes/me.m01.d29:meMA.Ode7C11.melody	@ltx/en_us_dedes/he.h.m4:heHE.EnTiKaminoAvramiaioi.name
ltx/en_us_dedes/me.m01.d29:meMA.Ode7C11.mode	@ltx/en_us_dedes/miscellanea:misc.Mode4
ltx/en_us_dedes/me.m01.d29:meMA.Ode7C11.ode	@ltx/en_us_dedes/miscellanea:misc.Ode7
ltx/en_us_dedes/me.m01.d29:meMA.Ode7C11.text	
ltx/en_us_dedes/me.m01.d29:meMA.Ode7C12.incipit	…
ltx/en_us_dedes/me.m01.d29:meMA.Ode7C12.melody	@ltx/en_us_dedes/he.h.m4:heHE.EnTiKaminoAvramiaioi.name
ltx/en_us_dedes/me.m01.d29:meMA.Ode7C12.mode	@ltx/en_us_dedes/miscellanea:misc.Mode4
ltx/en_us_dedes/me.m01.d29:meMA.Ode7C12.ode	@ltx/en_us_dedes/miscellanea:misc.Ode7
ltx/en_us_dedes/me.m01.d29:meMA.Ode7C12.text	
ltx/en_us_dedes/me.m01.d29:meMA.Ode7C13.incipit	…
ltx/en_us_dedes/me.m01.d29:meMA.Ode7C13.melody	@ltx/en_us_dedes/he.h.m4:heHE.EnTiKaminoAvramiaioi.name
ltx/en_us_dedes/me.m01.d29:meMA.Ode7C13.mode	@ltx/en_us_dedes/miscellanea:misc.Mode4
ltx/en_us_dedes/me.m01.d29:meMA.Ode7C13.ode	@ltx/en_us_dedes/miscellanea:misc.Ode7
ltx/en_us_dedes/me.m01.d29:meMA.Ode7C13.text	
ltx/en_us_dedes/me.m01.d29:meMA.Ode7C14.incipit	…
ltx/en_us_dedes/me.m01.d29:meMA.Ode7C14.melody	@ltx/en_us_dedes/he.h.m4:heHE.EnTiKaminoAvramiaioi.name
ltx/en_us_dedes/me.m01.d29:meMA.Ode7C14.mode	@ltx/en_us_dedes/miscellanea:misc.Mode4
ltx/en_us_dedes/me.m01.d29:meMA.Ode7C14.ode	@ltx/en_us_dedes/miscellanea:misc.Ode7
ltx/en_us_dedes/me.m01.d29:meMA.Ode7C14.text	
ltx/en_us_dedes/me.m01.d29:meMA.Ode7C1T.incipit	…
ltx/en_us_dedes/me.m01.d29:meMA.Ode7C1T.melody	@ltx/en_us_dedes/he.h.m4:heHE.EnTiKaminoAvramiaioi.name
ltx/en_us_dedes/me.m01.d29:meMA.Ode7C1T.mode	@ltx/en_us_dedes/miscellanea:misc.Mode4
ltx/en_us_dedes/me.m01.d29:meMA.Ode7C1T.ode	@ltx/en_us_dedes/miscellanea:misc.Ode7
ltx/en_us_dedes/me.m01.d29:meMA.Ode7C1T.text	
ltx/en_us_dedes/me.m01.d29:meMA.Ode8C11.greekmelody	@ltx/en_us_dedes/he.h.m4:heHE.CheirasEkpetasasDaniil.greekname
ltx/en_us_dedes/me.m01.d29:meMA.Ode8C11.incipit	…
ltx/en_us_dedes/me.m01.d29:meMA.Ode8C11.melody	@ltx/en_us_dedes/he.h.m4:heHE.CheirasEkpetasasDaniil.name
ltx/en_us_dedes/me.m01.d29:meMA.Ode8C11.mode	@ltx/en_us_dedes/miscellanea:misc.Mode4
ltx/en_us_dedes/me.m01.d29:meMA.Ode8C11.ode	@ltx/en_us_dedes/miscellanea:misc.Ode8
ltx/en_us_dedes/me.m01.d29:meMA.Ode8C11.text	
ltx/en_us_dedes/me.m01.d29:meMA.Ode8C12.incipit	…
ltx/en_us_dedes/me.m01.d29:meMA.Ode8C12.melody	@ltx/en_us_dedes/he.h.m4:heHE.CheirasEkpetasasDaniil.name
ltx/en_us_dedes/me.m01.d29:meMA.Ode8C12.mode	@ltx/en_us_dedes/miscellanea:misc.Mode4
ltx/en_us_dedes/me.m01.d29:meMA.Ode8C12.ode	@ltx/en_us_dedes/miscellanea:misc.Ode8
ltx/en_us_dedes/me.m01.d29:meMA.Ode8C12.text	
ltx/en_us_dedes/me.m01.d29:meMA.Ode8C13.incipit	…
ltx/en_us_dedes/me.m01.d29:meMA.Ode8C13.melody	@ltx/en_us_dedes/he.h.m4:heHE.CheirasEkpetasasDaniil.name
ltx/en_us_dedes/me.m01.d29:meMA.Ode8C13.mode	@ltx/en_us_dedes/miscellanea:misc.Mode4
ltx/en_us_dedes/me.m01.d29:meMA.Ode8C13.ode	@ltx/en_us_dedes/miscellanea:misc.Ode8
ltx/en_us_dedes/me.m01.d29:meMA.Ode8C13.text	
ltx/en_us_dedes/me.m01.d29:meMA.Ode8C1T.incipit	…
ltx/en_us_dedes/me.m01.d29:meMA.Ode8C1T.melody	@ltx/en_us_dedes/he.h.m4:heHE.CheirasEkpetasasDaniil.name
ltx/en_us_dedes/me.m01.d29:meMA.Ode8C1T.mode	@ltx/en_us_dedes/miscellanea:misc.Mode4
ltx/en_us_dedes/me.m01.d29:meMA.Ode8C1T.ode	@ltx/en_us_dedes/miscellanea:misc.Ode8
ltx/en_us_dedes/me.m01.d29:meMA.Ode8C1T.text	
ltx/en_us_dedes/me.m01.d29:meMA.Ode8H.greekmelody	@ltx/en_us_dedes/he.h.m4:heHE.CheirasEkpetasasDaniil.greekname
ltx/en_us_dedes/me.m01.d29:meMA.Ode8H.incipit	@ltx/en_us_dedes/he.h.m4:heHE.CheirasEkpetasasDaniil.incipit
ltx/en_us_dedes/me.m01.d29:meMA.Ode8H.melody	@ltx/en_us_dedes/he.h.m4:heHE.CheirasEkpetasasDaniil.melody
ltx/en_us_dedes/me.m01.d29:meMA.Ode8H.mode	@ltx/en_us_dedes/miscellanea:misc.Mode4
ltx/en_us_dedes/me.m01.d29:meMA.Ode8H.ode	@ltx/en_us_dedes/miscellanea:misc.Ode8
ltx/en_us_dedes/me.m01.d29:meMA.Ode8H.text	@ltx/en_us_dedes/he.h.m4:heHE.CheirasEkpetasasDaniil.text
ltx/en_us_dedes/me.m01.d29:meMA.Ode9C11.greekmelody	@ltx/en_us_dedes/he.h.m4:heHE.LithosAcheirotmitos.greekname
ltx/en_us_dedes/me.m01.d29:meMA.Ode9C11.incipit	…
ltx/en_us_dedes/me.m01.d29:meMA.Ode9C11.melody	@ltx/en_us_dedes/he.h.m4:heHE.LithosAcheirotmitos.name
ltx/en_us_dedes/me.m01.d29:meMA.Ode9C11.mode	@ltx/en_us_dedes/miscellanea:misc.Mode4
ltx/en_us_dedes/me.m01.d29:meMA.Ode9C11.ode	@ltx/en_us_dedes/miscellanea:misc.Ode9
ltx/en_us_dedes/me.m01.d29:meMA.Ode9C11.text	
ltx/en_us_dedes/me.m01.d29:meMA.Ode9C12.incipit	…
ltx/en_us_dedes/me.m01.d29:meMA.Ode9C12.melody	@ltx/en_us_dedes/he.h.m4:heHE.LithosAcheirotmitos.name
ltx/en_us_dedes/me.m01.d29:meMA.Ode9C12.mode	@ltx/en_us_dedes/miscellanea:misc.Mode4
ltx/en_us_dedes/me.m01.d29:meMA.Ode9C12.ode	@ltx/en_us_dedes/miscellanea:misc.Ode9
ltx/en_us_dedes/me.m01.d29:meMA.Ode9C12.text	
ltx/en_us_dedes/me.m01.d29:meMA.Ode9C13.incipit	…
ltx/en_us_dedes/me.m01.d29:meMA.Ode9C13.melody	@ltx/en_us_dedes/he.h.m4:heHE.LithosAcheirotmitos.name
ltx/en_us_dedes/me.m01.d29:meMA.Ode9C13.mode	@ltx/en_us_dedes/miscellanea:misc.Mode4
ltx/en_us_dedes/me.m01.d29:meMA.Ode9C13.ode	@ltx/en_us_dedes/miscellanea:misc.Ode9
ltx/en_us_dedes/me.m01.d29:meMA.Ode9C13.text	
ltx/en_us_dedes/me.m01.d29:meMA.Ode9C14.incipit	…
ltx/en_us_dedes/me.m01.d29:meMA.Ode9C14.melody	@ltx/en_us_dedes/he.h.m4:heHE.LithosAcheirotmitos.name
ltx/en_us_dedes/me.m01.d29:meMA.Ode9C14.mode	@ltx/en_us_dedes/miscellanea:misc.Mode4
ltx/en_us_dedes/me.m01.d29:meMA.Ode9C14.ode	@ltx/en_us_dedes/miscellanea:misc.Ode9
ltx/en_us_dedes/me.m01.d29:meMA.Ode9C14.text	
ltx/en_us_dedes/me.m01.d29:meMA.Ode9C1T.incipit	…
ltx/en_us_dedes/me.m01.d29:meMA.Ode9C1T.melody	@ltx/en_us_dedes/he.h.m4:heHE.LithosAcheirotmitos.name
ltx/en_us_dedes/me.m01.d29:meMA.Ode9C1T.mode	@ltx/en_us_dedes/miscellanea:misc.Mode4
ltx/en_us_dedes/me.m01.d29:meMA.Ode9C1T.ode	@ltx/en_us_dedes/miscellanea:misc.Ode9
ltx/en_us_dedes/me.m01.d29:meMA.Ode9C1T.text	
ltx/en_us_dedes/me.m01.d29:meMA.Ode9H.greekmelody	@ltx/en_us_dedes/he.h.m4:heHE.LithosAcheirotmitos.greekname
ltx/en_us_dedes/me.m01.d29:meMA.Ode9H.incipit	@ltx/en_us_dedes/he.h.m4:heHE.LithosAcheirotmitos.incipit
ltx/en_us_dedes/me.m01.d29:meMA.Ode9H.melody	@ltx/en_us_dedes/he.h.m4:heHE.LithosAcheirotmitos.melody
ltx/en_us_dedes/me.m01.d29:meMA.Ode9H.mode	@ltx/en_us_dedes/miscellanea:misc.Mode4
ltx/en_us_dedes/me.m01.d29:meMA.Ode9H.ode	@ltx/en_us_dedes/miscellanea:misc.Ode9
ltx/en_us_dedes/me.m01.d29:meMA.Ode9H.text	@ltx/en_us_dedes/he.h.m4:heHE.LithosAcheirotmitos.text
ltx/en_us_dedes/me.m01.d29:meMA.Oikos1.text	God sanctified Jeremiah from his mother’s womb, and as Prognosticator knew before he was born that he would be a vessel of the Holy Spirit, with which He filled him early in life. Then He sent him as a Prophet and herald to all, to announce His holy advent and appearance on earth. And when God was born of the Virgin and came to preach, He found a child who would become a worthy minister of His grace, divine Ignatius, who truly was held by God.
ltx/en_us_dedes/me.m01.d29:meVE.Apolytikion1.melody	@ltx/en_us_dedes/he.ga:heGA.KaiTroponMetochos.name
ltx/en_us_dedes/me.m01.d29:meVE.Apolytikion1.mode	@ltx/en_us_dedes/miscellanea:misc.Mode4
ltx/en_us_dedes/me.m01.d29:meVE.AposGlory.incipit	We marvel how your soul…
ltx/en_us_dedes/me.m01.d29:meVE.AposGlory.melody	
ltx/en_us_dedes/me.m01.d29:meVE.AposGlory.mode	@ltx/en_us_dedes/miscellanea:misc.Mode1
ltx/en_us_dedes/me.m01.d29:meVE.AposGlory.poet	@ltx/en_us_dedes/poets:po.Stouditou
ltx/en_us_dedes/me.m01.d29:meVE.AposGlory.text	We marvel how your soul was so steadfast and adamant, O praiseworthy Ignatius. You were so firmly attached to your true Love, that you said, “There is no fire of material longing within me, but only water living and speaking in me, saying within me, ‘Come to the Father.’” Thus, on fire with the Spirit, you provoked the beasts to separate you from this world, and to send you on to Christ, for whom you longed. And now entreat Him, to save our souls.
ltx/en_us_dedes/me.m01.d29:meVE.AposStavrotheotokion.greekmelody	@ltx/en_us_dedes/he.a.m1:heAU.TonOuranionTagmaton.greekname
ltx/en_us_dedes/me.m01.d29:meVE.AposStavrotheotokion.incipit	@ltx/en_us_dedes/me.m01.d23:meVE.AposStavrotheotokion.incipit
ltx/en_us_dedes/me.m01.d29:meVE.AposStavrotheotokion.melody	@ltx/en_us_dedes/he.a.m1:heAU.TonOuranionTagmaton.name
ltx/en_us_dedes/me.m01.d29:meVE.AposStavrotheotokion.mode	@ltx/en_us_dedes/miscellanea:misc.Mode1
ltx/en_us_dedes/me.m01.d29:meVE.AposStavrotheotokion.text	@ltx/en_us_dedes/me.m01.d23:meVE.AposStavrotheotokion.text
ltx/en_us_dedes/me.m01.d29:meVE.AposTheotokion.incipit	@ltx/en_us_dedes/oc.m1.d3:ocVE.AposTheotokion.incipit
ltx/en_us_dedes/me.m01.d29:meVE.AposTheotokion.melody	
ltx/en_us_dedes/me.m01.d29:meVE.AposTheotokion.mode	@ltx/en_us_dedes/miscellanea:misc.Mode1
ltx/en_us_dedes/me.m01.d29:meVE.AposTheotokion.text	@ltx/en_us_dedes/oc.m1.d3:ocVE.AposTheotokion.text
ltx/en_us_dedes/me.m01.d29:meVE.GeneralApolytikion1.name	Ignatius.
ltx/en_us_dedes/me.m01.d29:meVE.MM.GeneralApolytikion1.text	@ltx/en_us_dedes/properties:media.key
ltx/en_us_dedes/me.m01.d29:meVE.MM.Stichera1234as78910.text	@ltx/en_us_dedes/properties:media.key
ltx/en_us_dedes/me.m01.d29:meVE.SticGlory.incipit	O God-bearing St. Ignatius, you…
ltx/en_us_dedes/me.m01.d29:meVE.SticGlory.melody	
ltx/en_us_dedes/me.m01.d29:meVE.SticGlory.mode	@ltx/en_us_dedes/miscellanea:misc.Mode8
ltx/en_us_dedes/me.m01.d29:meVE.SticGlory.text	O God-bearing St. Ignatius, you were held in the bosom of Christ, the object of your love. For your sacred work of spreading the Gospel of Christ, you received your reward, namely death by blood. You were ground by the teeth of wild beasts, and thus you became the wheat of the immortal Farmer, and became His pure and sweet bread. And now you intercede on our behalf, O blessed Martyr.
ltx/en_us_dedes/me.m01.d29:meVE.SticStavrotheotokion.greekmelody	@ltx/en_us_dedes/he.a.m8:heAU.OTouParadoxou.greekname
ltx/en_us_dedes/me.m01.d29:meVE.SticStavrotheotokion.incipit	@ltx/en_us_dedes/me.m01.d15:meMA.AposStavrotheotokion.incipit
ltx/en_us_dedes/me.m01.d29:meVE.SticStavrotheotokion.melody	@ltx/en_us_dedes/he.a.m8:heAU.OTouParadoxou.name
ltx/en_us_dedes/me.m01.d29:meVE.SticStavrotheotokion.mode	@ltx/en_us_dedes/miscellanea:misc.Mode8
ltx/en_us_dedes/me.m01.d29:meVE.SticStavrotheotokion.text	@ltx/en_us_dedes/me.m01.d15:meMA.AposStavrotheotokion.text
ltx/en_us_dedes/me.m01.d29:meVE.SticTheotokion.greekmelody	@ltx/en_us_dedes/he.a.m8:heAU.OTouParadoxou.greekname
ltx/en_us_dedes/me.m01.d29:meVE.SticTheotokion.incipit	…
ltx/en_us_dedes/me.m01.d29:meVE.SticTheotokion.melody	@ltx/en_us_dedes/he.a.m8:heAU.OTouParadoxou.name
ltx/en_us_dedes/me.m01.d29:meVE.SticTheotokion.mode	@ltx/en_us_dedes/miscellanea:misc.Mode8
ltx/en_us_dedes/me.m01.d29:meVE.SticTheotokion.text	
ltx/en_us_dedes/me.m01.d29:meVE.Stichera01.greekmelody	@ltx/en_us_dedes/he.a.m4:heAU.OsGennaionEnMartysi.greekname
ltx/en_us_dedes/me.m01.d29:meVE.Stichera01.incipit	The successor of excellent *…
ltx/en_us_dedes/me.m01.d29:meVE.Stichera01.melody	@ltx/en_us_dedes/he.a.m4:heAU.OsGennaionEnMartysi.name
ltx/en_us_dedes/me.m01.d29:meVE.Stichera01.mode	@ltx/en_us_dedes/miscellanea:misc.Mode4
ltx/en_us_dedes/me.m01.d29:meVE.Stichera01.text	The successor of excellent * theologians were you, O Saint; * for you followed faithfully in their holy steps. * Having set out from the East you did appear in the West as well, * illumining with the rays * of your preaching inspired by God. * Therein, all-wise one, * you did sink from the world just like the sun sets, but to God you have arisen, * crowned with the halo of grace divine.
ltx/en_us_dedes/me.m01.d29:meVE.Stichera02.incipit	To your city with sacred…
ltx/en_us_dedes/me.m01.d29:meVE.Stichera02.melody	@ltx/en_us_dedes/he.a.m4:heAU.OsGennaionEnMartysi.name
ltx/en_us_dedes/me.m01.d29:meVE.Stichera02.mode	@ltx/en_us_dedes/miscellanea:misc.Mode4
ltx/en_us_dedes/me.m01.d29:meVE.Stichera02.text	To your city with sacred pomp were your holy remains returned, * O all-wise Ignatius the holy God-bearer. * They were through martyrdom sanctified, and brightly they shine with grace. * Their return has given us * the occasion to celebrate these festivities, * and they fill us with God-inspired gladness, and with spiritual pleasure, * as we all piously honor you.
ltx/en_us_dedes/me.m01.d29:meVE.Stichera03.incipit	When you shined brightly like…
ltx/en_us_dedes/me.m01.d29:meVE.Stichera03.melody	@ltx/en_us_dedes/he.a.m4:heAU.OsGennaionEnMartysi.name
ltx/en_us_dedes/me.m01.d29:meVE.Stichera03.mode	@ltx/en_us_dedes/miscellanea:misc.Mode4
ltx/en_us_dedes/me.m01.d29:meVE.Stichera03.text	When you shined brightly like the sun * with the rays of the Spirit’s grace, * you brought light and joy to the corners of the earth, * and with the glow of your martyrdom.* You zealously led the Church * and you wrote the saving truth * of the doctrines of piety. * Therefore you became * even food for the Master who does nourish all, O blessed Saint Ignatius, * with His unceasing benevolence.
ltx/en_us_dedes/me.m01.d29:meVE.Stichera04.greekmelody	@ltx/en_us_dedes/he.a.m4:heAU.OsGennaionEnMartysi.greekname
ltx/en_us_dedes/me.m01.d29:meVE.Stichera04.incipit	O Ignatius the Morning Star…
ltx/en_us_dedes/me.m01.d29:meVE.Stichera04.melody	@ltx/en_us_dedes/he.a.m4:heAU.OsGennaionEnMartysi.name
ltx/en_us_dedes/me.m01.d29:meVE.Stichera04.mode	@ltx/en_us_dedes/miscellanea:misc.Mode4
ltx/en_us_dedes/me.m01.d29:meVE.Stichera04.text	O Ignatius the Morning Star, from the East you had risen once, * also in the West you did shine most brilliantly. * But in the final return of your divine relics you have spread * the bright shining rays of joy * from the West over all the earth. * Therefore intercede * so that we be delivered from corruption and from perils for observing * this your time-honored memorial.
