ltx/en_us_dedes/me.m10.d09:meDA.commemoration.first	Memory of the Holy Apostle James (Iakovos) the Son of Alphaeus
ltx/en_us_dedes/me.m10.d09:meDA.commemoration.first_name	
ltx/en_us_dedes/me.m10.d09:meDA.commemoration.first_short	Memory of the Holy Apostle James (Iakovos) the Son of Alphaeus
ltx/en_us_dedes/me.m10.d09:meDA.commemoration.first_title	@ltx/en_us_dedes/titles:ti.Apostle
ltx/en_us_dedes/me.m10.d09:meDA.commemoration.full	Memory of the Holy Apostle James (Iakovos) the Son of Alphaeus, and our Devout Father Andronicos and his Wife.
ltx/en_us_dedes/me.m10.d09:meDA.commemoration.second_name	
ltx/en_us_dedes/me.m10.d09:meDA.commemoration.second_title	@ltx/en_us_dedes/titles:ti.DevoutSaints
ltx/en_us_dedes/me.m10.d09:meDA.date	October 9
ltx/en_us_dedes/me.m10.d09:meDA.fordate	for October 9
ltx/en_us_dedes/me.m10.d09:meDA.insert1	and the holy Apostle James, the son of Alphaeus,
ltx/en_us_dedes/me.m10.d09:meDA.insert2	whose memory we observe,
ltx/en_us_dedes/me.m10.d09:meDA.note	
ltx/en_us_dedes/me.m10.d09:meDA.pdfcoverdate	October 9,
ltx/en_us_dedes/me.m10.d09:meDA.pdfheaderdate	October 9
ltx/en_us_dedes/me.m10.d09:meHO.commemorations	
ltx/en_us_dedes/me.m10.d09:meHO.note1	
ltx/en_us_dedes/me.m10.d09:meHO.note2	
ltx/en_us_dedes/me.m10.d09:meHO.number	
ltx/en_us_dedes/me.m10.d09:meHO.rank	
ltx/en_us_dedes/me.m10.d09:meLE.commemoration1	The Holy Apostle Iakovos (James), the son of Alphaios.
ltx/en_us_dedes/me.m10.d09:meLE.commemoration2	
ltx/en_us_dedes/me.m10.d09:meLI.Kontakion1.greekmelody	@ltx/en_us_dedes/me.m10.d09:meMA.Kontakion1.greekmelody
ltx/en_us_dedes/me.m10.d09:meLI.Kontakion1.incipit	@ltx/en_us_dedes/me.m10.d09:meMA.Kontakion1.incipit
ltx/en_us_dedes/me.m10.d09:meLI.Kontakion1.melody	@ltx/en_us_dedes/me.m10.d09:meMA.Kontakion1.melody
ltx/en_us_dedes/me.m10.d09:meLI.Kontakion1.mode	@ltx/en_us_dedes/me.m10.d09:meMA.Kontakion1.mode
ltx/en_us_dedes/me.m10.d09:meLI.Kontakion1.text	@ltx/en_us_dedes/me.m10.d09:meMA.Kontakion1.text
ltx/en_us_dedes/me.m10.d09:meLI.Megalynarion.text	
ltx/en_us_dedes/me.m10.d09:meMA.C1.acrostic.notice1	
ltx/en_us_dedes/me.m10.d09:meMA.C1.acrostic.text	
ltx/en_us_dedes/me.m10.d09:meMA.C1.acrostic.title	
ltx/en_us_dedes/me.m10.d09:meMA.C1.poet	@ltx/en_us_dedes/poets:po.Theofanous
ltx/en_us_dedes/me.m10.d09:meMA.C1.title	@ltx/en_us_dedes/titles:ti.CanonApostle
ltx/en_us_dedes/me.m10.d09:meMA.C1.verse	@ltx/en_us_dedes/prayers:pr.verse_Apostle.text
ltx/en_us_dedes/me.m10.d09:meMA.C2.acrostic.notice1	
ltx/en_us_dedes/me.m10.d09:meMA.C2.acrostic.text	
ltx/en_us_dedes/me.m10.d09:meMA.C2.acrostic.title	
ltx/en_us_dedes/me.m10.d09:meMA.C2.title	@ltx/en_us_dedes/titles:ti.CanonDevoutSaints
ltx/en_us_dedes/me.m10.d09:meMA.C2.verse	@ltx/en_us_dedes/prayers:pr.verse_SaintsM.text
ltx/en_us_dedes/me.m10.d09:meMA.ExapTheotokion.incipit	O Virgin Maid, the Prophets…
ltx/en_us_dedes/me.m10.d09:meMA.ExapTheotokion.melody	@ltx/en_us_dedes/he.a.m2:heAU.GynaikesAkoutisthite.name
ltx/en_us_dedes/me.m10.d09:meMA.ExapTheotokion.mode	@ltx/en_us_dedes/miscellanea:misc.Mode2
ltx/en_us_dedes/me.m10.d09:meMA.ExapTheotokion.text	O Virgin Maid, the Prophets all * have prophesied concerning you. * They called you the jar of manna, * the blossoming rod, the tablet, * the mountain that was quarried not, * the table, ark, and golden lamp; * and we, as is right, extol you, * for you are the Theotokos.
ltx/en_us_dedes/me.m10.d09:meMA.Exaposteilarion1.greekmelody	@ltx/en_us_dedes/he.a.m2:heAU.GynaikesAkoutisthite.greekname
ltx/en_us_dedes/me.m10.d09:meMA.Exaposteilarion1.incipit	We pray you, preacher sent…
ltx/en_us_dedes/me.m10.d09:meMA.Exaposteilarion1.melody	@ltx/en_us_dedes/he.a.m2:heAU.GynaikesAkoutisthite.name
ltx/en_us_dedes/me.m10.d09:meMA.Exaposteilarion1.mode	@ltx/en_us_dedes/miscellanea:misc.Mode2
ltx/en_us_dedes/me.m10.d09:meMA.Exaposteilarion1.text	We pray you, preacher sent by God, * Saint James, as an initiate, * Apostle, and excellent servant * of Christ the only Master; * entreat Him to bestow upon * our leaders peace and victory, * and the forgiveness of their sins* to those who observe your holy * memorial, O all-praise one.
ltx/en_us_dedes/me.m10.d09:meMA.Kontakion1.greekmelody	@ltx/en_us_dedes/he.a.m6:heAU.TinEnPresveiais.greekname
ltx/en_us_dedes/me.m10.d09:meMA.Kontakion1.incipit	Let us extol James and…
ltx/en_us_dedes/me.m10.d09:meMA.Kontakion1.melody	@ltx/en_us_dedes/he.a.m6:heAU.TinEnPresveiais.notmetered
ltx/en_us_dedes/me.m10.d09:meMA.Kontakion1.mode	@ltx/en_us_dedes/miscellanea:misc.Mode6
ltx/en_us_dedes/me.m10.d09:meMA.Kontakion1.text	Let us extol James and praise him in song, as we festively honor his memory today. He was an eyewitness of Christ and a preacher of God, and he shined on the whole world like a morning star. And he continually intercedes on behalf of us all.
ltx/en_us_dedes/me.m10.d09:meMA.Lauds1.greekmelody	@ltx/en_us_dedes/he.a.m4:heAU.EdokasSimeiosin.greekname
ltx/en_us_dedes/me.m10.d09:meMA.Lauds1.incipit	With the Holy Spirit’s rays…
ltx/en_us_dedes/me.m10.d09:meMA.Lauds1.melody	@ltx/en_us_dedes/he.a.m4:heAU.EdokasSimeiosin.name
ltx/en_us_dedes/me.m10.d09:meMA.Lauds1.mode	@ltx/en_us_dedes/miscellanea:misc.Mode4
ltx/en_us_dedes/me.m10.d09:meMA.Lauds1.text	With the Holy Spirit’s rays you brightly shone, being luminous * like the sun, O Apostle James; * with knowledge of God you have enlightened the whole world, * O blessed Disciple; preaching the word of God you drove * away the darkness of polytheism. * And therefore we are celebrating your most splendid memorial * and your praiseworthy feast today,* and we piously honor you.
ltx/en_us_dedes/me.m10.d09:meMA.Lauds2.incipit	Sitting in the height of…
ltx/en_us_dedes/me.m10.d09:meMA.Lauds2.melody	@ltx/en_us_dedes/he.a.m4:heAU.EdokasSimeiosin.name
ltx/en_us_dedes/me.m10.d09:meMA.Lauds2.mode	@ltx/en_us_dedes/miscellanea:misc.Mode4
ltx/en_us_dedes/me.m10.d09:meMA.Lauds2.text	Sitting in the height of knowledge of our God, O most holy James, * you accepted the Spirit’s grace, * appearing that day to you in the form of fire.* Clearly by your preaching with fiery tongue you burned away * the very essence of polytheism. * And therefore do we honor you as an Apostle who spoke of God * on this day as we celebrate * your all-holy memorial.
ltx/en_us_dedes/me.m10.d09:meMA.Lauds3.incipit	O all-wise Apostle James, you…
ltx/en_us_dedes/me.m10.d09:meMA.Lauds3.melody	@ltx/en_us_dedes/he.a.m4:heAU.EdokasSimeiosin.name
ltx/en_us_dedes/me.m10.d09:meMA.Lauds3.mode	@ltx/en_us_dedes/miscellanea:misc.Mode4
ltx/en_us_dedes/me.m10.d09:meMA.Lauds3.text	O all-wise Apostle James, you thundered forth to the whole wide world * sacred teachings that save our souls. * You cleansed and you purified the world of its idols * and its pagan madness. * And you enlightened with the rays * of Godly knowledge the peoples everywhere. * And when you had destroyed the temples of the idols by grace divine, * you built Churches in place of them, * for the praise of our Lord and God.
ltx/en_us_dedes/me.m10.d09:meMA.LaudsGlory.incipit	…
ltx/en_us_dedes/me.m10.d09:meMA.LaudsGlory.melody	
ltx/en_us_dedes/me.m10.d09:meMA.LaudsGlory.mode	@ltx/en_us_dedes/miscellanea:misc.Mode5
ltx/en_us_dedes/me.m10.d09:meMA.LaudsGlory.text	
ltx/en_us_dedes/me.m10.d09:meMA.LaudsTheotokion.incipit	@ltx/en_us_dedes/oc.m5.d5:ocVE.AposTheotokion.incipit
ltx/en_us_dedes/me.m10.d09:meMA.LaudsTheotokion.melody	
ltx/en_us_dedes/me.m10.d09:meMA.LaudsTheotokion.mode	@ltx/en_us_dedes/miscellanea:misc.Mode5
ltx/en_us_dedes/me.m10.d09:meMA.LaudsTheotokion.text	@ltx/en_us_dedes/oc.m5.d5:ocVE.AposTheotokion.text
ltx/en_us_dedes/me.m10.d09:meMA.MM.Lauds1123as5678.text	@ltx/en_us_dedes/properties:media.key
ltx/en_us_dedes/me.m10.d09:meMA.Ode1C11.greekmelody	@ltx/en_us_dedes/he.h.m6:heHE.OsEnIpeiroPezefsas.greekname
ltx/en_us_dedes/me.m10.d09:meMA.Ode1C11.incipit	…
ltx/en_us_dedes/me.m10.d09:meMA.Ode1C11.melody	@ltx/en_us_dedes/he.h.m6:heHE.OsEnIpeiroPezefsas.name
ltx/en_us_dedes/me.m10.d09:meMA.Ode1C11.mode	@ltx/en_us_dedes/miscellanea:misc.Mode6
ltx/en_us_dedes/me.m10.d09:meMA.Ode1C11.ode	@ltx/en_us_dedes/miscellanea:misc.Ode1
ltx/en_us_dedes/me.m10.d09:meMA.Ode1C11.text	
ltx/en_us_dedes/me.m10.d09:meMA.Ode1C12.incipit	…
ltx/en_us_dedes/me.m10.d09:meMA.Ode1C12.melody	@ltx/en_us_dedes/he.h.m6:heHE.OsEnIpeiroPezefsas.name
ltx/en_us_dedes/me.m10.d09:meMA.Ode1C12.mode	@ltx/en_us_dedes/miscellanea:misc.Mode6
ltx/en_us_dedes/me.m10.d09:meMA.Ode1C12.ode	@ltx/en_us_dedes/miscellanea:misc.Ode1
ltx/en_us_dedes/me.m10.d09:meMA.Ode1C12.text	
ltx/en_us_dedes/me.m10.d09:meMA.Ode1C13.incipit	…
ltx/en_us_dedes/me.m10.d09:meMA.Ode1C13.melody	@ltx/en_us_dedes/he.h.m6:heHE.OsEnIpeiroPezefsas.name
ltx/en_us_dedes/me.m10.d09:meMA.Ode1C13.mode	@ltx/en_us_dedes/miscellanea:misc.Mode6
ltx/en_us_dedes/me.m10.d09:meMA.Ode1C13.ode	@ltx/en_us_dedes/miscellanea:misc.Ode1
ltx/en_us_dedes/me.m10.d09:meMA.Ode1C13.text	
ltx/en_us_dedes/me.m10.d09:meMA.Ode1C1T.incipit	…
ltx/en_us_dedes/me.m10.d09:meMA.Ode1C1T.melody	@ltx/en_us_dedes/he.h.m6:heHE.OsEnIpeiroPezefsas.name
ltx/en_us_dedes/me.m10.d09:meMA.Ode1C1T.mode	@ltx/en_us_dedes/miscellanea:misc.Mode6
ltx/en_us_dedes/me.m10.d09:meMA.Ode1C1T.ode	@ltx/en_us_dedes/miscellanea:misc.Ode1
ltx/en_us_dedes/me.m10.d09:meMA.Ode1C1T.text	
ltx/en_us_dedes/me.m10.d09:meMA.Ode1C21.greekmelody	@ltx/en_us_dedes/he.h.m8:heHE.ArmatilatinFarao.greekname
ltx/en_us_dedes/me.m10.d09:meMA.Ode1C21.incipit	…
ltx/en_us_dedes/me.m10.d09:meMA.Ode1C21.melody	@ltx/en_us_dedes/he.h.m8:heHE.ArmatilatinFarao.name
ltx/en_us_dedes/me.m10.d09:meMA.Ode1C21.mode	@ltx/en_us_dedes/miscellanea:misc.Mode8
ltx/en_us_dedes/me.m10.d09:meMA.Ode1C21.ode	@ltx/en_us_dedes/miscellanea:misc.Ode1
ltx/en_us_dedes/me.m10.d09:meMA.Ode1C21.text	
ltx/en_us_dedes/me.m10.d09:meMA.Ode1C22.incipit	…
ltx/en_us_dedes/me.m10.d09:meMA.Ode1C22.melody	@ltx/en_us_dedes/he.h.m8:heHE.ArmatilatinFarao.name
ltx/en_us_dedes/me.m10.d09:meMA.Ode1C22.mode	@ltx/en_us_dedes/miscellanea:misc.Mode8
ltx/en_us_dedes/me.m10.d09:meMA.Ode1C22.ode	@ltx/en_us_dedes/miscellanea:misc.Ode1
ltx/en_us_dedes/me.m10.d09:meMA.Ode1C22.text	
ltx/en_us_dedes/me.m10.d09:meMA.Ode1C23.incipit	…
ltx/en_us_dedes/me.m10.d09:meMA.Ode1C23.melody	@ltx/en_us_dedes/he.h.m8:heHE.ArmatilatinFarao.name
ltx/en_us_dedes/me.m10.d09:meMA.Ode1C23.mode	@ltx/en_us_dedes/miscellanea:misc.Mode8
ltx/en_us_dedes/me.m10.d09:meMA.Ode1C23.ode	@ltx/en_us_dedes/miscellanea:misc.Ode1
ltx/en_us_dedes/me.m10.d09:meMA.Ode1C23.text	
ltx/en_us_dedes/me.m10.d09:meMA.Ode1C2T.incipit	…
ltx/en_us_dedes/me.m10.d09:meMA.Ode1C2T.melody	@ltx/en_us_dedes/he.h.m8:heHE.ArmatilatinFarao.name
ltx/en_us_dedes/me.m10.d09:meMA.Ode1C2T.mode	@ltx/en_us_dedes/miscellanea:misc.Mode8
ltx/en_us_dedes/me.m10.d09:meMA.Ode1C2T.ode	@ltx/en_us_dedes/miscellanea:misc.Ode1
ltx/en_us_dedes/me.m10.d09:meMA.Ode1C2T.text	
ltx/en_us_dedes/me.m10.d09:meMA.Ode3C11.greekmelody	@ltx/en_us_dedes/he.h.m6:heHE.OukEstinAgios.greekname
ltx/en_us_dedes/me.m10.d09:meMA.Ode3C11.incipit	…
ltx/en_us_dedes/me.m10.d09:meMA.Ode3C11.melody	@ltx/en_us_dedes/he.h.m6:heHE.OukEstinAgios.name
ltx/en_us_dedes/me.m10.d09:meMA.Ode3C11.mode	@ltx/en_us_dedes/miscellanea:misc.Mode6
ltx/en_us_dedes/me.m10.d09:meMA.Ode3C11.ode	@ltx/en_us_dedes/miscellanea:misc.Ode3
ltx/en_us_dedes/me.m10.d09:meMA.Ode3C11.text	
ltx/en_us_dedes/me.m10.d09:meMA.Ode3C12.incipit	…
ltx/en_us_dedes/me.m10.d09:meMA.Ode3C12.melody	@ltx/en_us_dedes/he.h.m6:heHE.OukEstinAgios.name
ltx/en_us_dedes/me.m10.d09:meMA.Ode3C12.mode	@ltx/en_us_dedes/miscellanea:misc.Mode6
ltx/en_us_dedes/me.m10.d09:meMA.Ode3C12.ode	@ltx/en_us_dedes/miscellanea:misc.Ode3
ltx/en_us_dedes/me.m10.d09:meMA.Ode3C12.text	
ltx/en_us_dedes/me.m10.d09:meMA.Ode3C13.incipit	…
ltx/en_us_dedes/me.m10.d09:meMA.Ode3C13.melody	@ltx/en_us_dedes/he.h.m6:heHE.OukEstinAgios.name
ltx/en_us_dedes/me.m10.d09:meMA.Ode3C13.mode	@ltx/en_us_dedes/miscellanea:misc.Mode6
ltx/en_us_dedes/me.m10.d09:meMA.Ode3C13.ode	@ltx/en_us_dedes/miscellanea:misc.Ode3
ltx/en_us_dedes/me.m10.d09:meMA.Ode3C13.text	
ltx/en_us_dedes/me.m10.d09:meMA.Ode3C1T.incipit	…
ltx/en_us_dedes/me.m10.d09:meMA.Ode3C1T.melody	@ltx/en_us_dedes/he.h.m6:heHE.OukEstinAgios.name
ltx/en_us_dedes/me.m10.d09:meMA.Ode3C1T.mode	@ltx/en_us_dedes/miscellanea:misc.Mode6
ltx/en_us_dedes/me.m10.d09:meMA.Ode3C1T.ode	@ltx/en_us_dedes/miscellanea:misc.Ode3
ltx/en_us_dedes/me.m10.d09:meMA.Ode3C1T.text	
ltx/en_us_dedes/me.m10.d09:meMA.Ode3C21.greekmelody	@ltx/en_us_dedes/he.h.m8:heHE.OStereosasKatArchas.greekname
ltx/en_us_dedes/me.m10.d09:meMA.Ode3C21.incipit	…
ltx/en_us_dedes/me.m10.d09:meMA.Ode3C21.melody	@ltx/en_us_dedes/he.h.m8:heHE.OStereosasKatArchas.name
ltx/en_us_dedes/me.m10.d09:meMA.Ode3C21.mode	@ltx/en_us_dedes/miscellanea:misc.Mode8
ltx/en_us_dedes/me.m10.d09:meMA.Ode3C21.ode	@ltx/en_us_dedes/miscellanea:misc.Ode3
ltx/en_us_dedes/me.m10.d09:meMA.Ode3C21.text	
ltx/en_us_dedes/me.m10.d09:meMA.Ode3C22.incipit	…
ltx/en_us_dedes/me.m10.d09:meMA.Ode3C22.melody	@ltx/en_us_dedes/he.h.m8:heHE.OStereosasKatArchas.name
ltx/en_us_dedes/me.m10.d09:meMA.Ode3C22.mode	@ltx/en_us_dedes/miscellanea:misc.Mode8
ltx/en_us_dedes/me.m10.d09:meMA.Ode3C22.ode	@ltx/en_us_dedes/miscellanea:misc.Ode3
ltx/en_us_dedes/me.m10.d09:meMA.Ode3C22.text	
ltx/en_us_dedes/me.m10.d09:meMA.Ode3C23.incipit	…
ltx/en_us_dedes/me.m10.d09:meMA.Ode3C23.melody	@ltx/en_us_dedes/he.h.m8:heHE.OStereosasKatArchas.name
ltx/en_us_dedes/me.m10.d09:meMA.Ode3C23.mode	@ltx/en_us_dedes/miscellanea:misc.Mode8
ltx/en_us_dedes/me.m10.d09:meMA.Ode3C23.ode	@ltx/en_us_dedes/miscellanea:misc.Ode3
ltx/en_us_dedes/me.m10.d09:meMA.Ode3C23.text	
ltx/en_us_dedes/me.m10.d09:meMA.Ode3C2T.incipit	…
ltx/en_us_dedes/me.m10.d09:meMA.Ode3C2T.melody	@ltx/en_us_dedes/he.h.m8:heHE.OStereosasKatArchas.name
ltx/en_us_dedes/me.m10.d09:meMA.Ode3C2T.mode	@ltx/en_us_dedes/miscellanea:misc.Mode8
ltx/en_us_dedes/me.m10.d09:meMA.Ode3C2T.ode	@ltx/en_us_dedes/miscellanea:misc.Ode3
ltx/en_us_dedes/me.m10.d09:meMA.Ode3C2T.text	
ltx/en_us_dedes/me.m10.d09:meMA.Ode3H.greekmelody	@ltx/en_us_dedes/he.h.m8:heHE.OStereosasKatArchas.greekname
ltx/en_us_dedes/me.m10.d09:meMA.Ode3H.incipit	@ltx/en_us_dedes/he.h.m8:heHE.OStereosasKatArchas.incipit
ltx/en_us_dedes/me.m10.d09:meMA.Ode3H.melody	@ltx/en_us_dedes/he.h.m8:heHE.OStereosasKatArchas.melody
ltx/en_us_dedes/me.m10.d09:meMA.Ode3H.mode	@ltx/en_us_dedes/miscellanea:misc.Mode8
ltx/en_us_dedes/me.m10.d09:meMA.Ode3H.ode	@ltx/en_us_dedes/miscellanea:misc.Ode3
ltx/en_us_dedes/me.m10.d09:meMA.Ode3H.text	@ltx/en_us_dedes/he.h.m8:heHE.OStereosasKatArchas.text
ltx/en_us_dedes/me.m10.d09:meMA.Ode3Kathisma1.greekmelody	@ltx/en_us_dedes/he.a.m8:heAU.TinSofianKaiLogon.greekname
ltx/en_us_dedes/me.m10.d09:meMA.Ode3Kathisma1.incipit	…
ltx/en_us_dedes/me.m10.d09:meMA.Ode3Kathisma1.melody	@ltx/en_us_dedes/he.a.m8:heAU.TinSofianKaiLogon.name
ltx/en_us_dedes/me.m10.d09:meMA.Ode3Kathisma1.mode	@ltx/en_us_dedes/miscellanea:misc.Mode8
ltx/en_us_dedes/me.m10.d09:meMA.Ode3Kathisma1.text	
ltx/en_us_dedes/me.m10.d09:meMA.Ode3Kathisma2.greekmelody	@ltx/en_us_dedes/he.a.m8:heAU.TinSofianKaiLogon.greekname
ltx/en_us_dedes/me.m10.d09:meMA.Ode3Kathisma2.incipit	…
ltx/en_us_dedes/me.m10.d09:meMA.Ode3Kathisma2.melody	@ltx/en_us_dedes/he.a.m8:heAU.TinSofianKaiLogon.name
ltx/en_us_dedes/me.m10.d09:meMA.Ode3Kathisma2.mode	@ltx/en_us_dedes/miscellanea:misc.Mode8
ltx/en_us_dedes/me.m10.d09:meMA.Ode3Kathisma2.text	
ltx/en_us_dedes/me.m10.d09:meMA.Ode3KathismaSt.incipit	…
ltx/en_us_dedes/me.m10.d09:meMA.Ode3KathismaSt.melody	@ltx/en_us_dedes/he.a.m8:heAU.TinSofianKaiLogon.name
ltx/en_us_dedes/me.m10.d09:meMA.Ode3KathismaSt.mode	@ltx/en_us_dedes/miscellanea:misc.Mode8
ltx/en_us_dedes/me.m10.d09:meMA.Ode3KathismaSt.text	
ltx/en_us_dedes/me.m10.d09:meMA.Ode3KathismaT.incipit	You are the all-blameless Bride…
ltx/en_us_dedes/me.m10.d09:meMA.Ode3KathismaT.melody	@ltx/en_us_dedes/he.a.m8:heAU.TinSofianKaiLogon.notmetered
ltx/en_us_dedes/me.m10.d09:meMA.Ode3KathismaT.mode	@ltx/en_us_dedes/miscellanea:misc.Mode8
ltx/en_us_dedes/me.m10.d09:meMA.Ode3KathismaT.text	You are the all-blameless Bride of the Creator and the virgin Mother of the Redeemer, and the vessel of the Comforter, O all-blameless Lady; whereas I am a shameful habitat of iniquities, and I have knowingly become the plaything of demons. Therefore, come quickly and rescue me from their wickedness, and change me through virtue into a bright house of virtue, O inviolate vessel of light. By your intercessions, dispel the cloud of the sinful passions, O immaculate Maid, and make me worthy of experiencing heaven and of the light that never sets.
ltx/en_us_dedes/me.m10.d09:meMA.Ode4C11.greekmelody	@ltx/en_us_dedes/he.h.m6:heHE.ChristosMouDynamis.greekname
ltx/en_us_dedes/me.m10.d09:meMA.Ode4C11.incipit	…
ltx/en_us_dedes/me.m10.d09:meMA.Ode4C11.melody	@ltx/en_us_dedes/he.h.m6:heHE.ChristosMouDynamis.name
ltx/en_us_dedes/me.m10.d09:meMA.Ode4C11.mode	@ltx/en_us_dedes/miscellanea:misc.Mode6
ltx/en_us_dedes/me.m10.d09:meMA.Ode4C11.ode	@ltx/en_us_dedes/miscellanea:misc.Ode4
ltx/en_us_dedes/me.m10.d09:meMA.Ode4C11.text	
ltx/en_us_dedes/me.m10.d09:meMA.Ode4C12.incipit	…
ltx/en_us_dedes/me.m10.d09:meMA.Ode4C12.melody	@ltx/en_us_dedes/he.h.m6:heHE.ChristosMouDynamis.name
ltx/en_us_dedes/me.m10.d09:meMA.Ode4C12.mode	@ltx/en_us_dedes/miscellanea:misc.Mode6
ltx/en_us_dedes/me.m10.d09:meMA.Ode4C12.ode	@ltx/en_us_dedes/miscellanea:misc.Ode4
ltx/en_us_dedes/me.m10.d09:meMA.Ode4C12.text	
ltx/en_us_dedes/me.m10.d09:meMA.Ode4C13.incipit	…
ltx/en_us_dedes/me.m10.d09:meMA.Ode4C13.melody	@ltx/en_us_dedes/he.h.m6:heHE.ChristosMouDynamis.name
ltx/en_us_dedes/me.m10.d09:meMA.Ode4C13.mode	@ltx/en_us_dedes/miscellanea:misc.Mode6
ltx/en_us_dedes/me.m10.d09:meMA.Ode4C13.ode	@ltx/en_us_dedes/miscellanea:misc.Ode4
ltx/en_us_dedes/me.m10.d09:meMA.Ode4C13.text	
ltx/en_us_dedes/me.m10.d09:meMA.Ode4C1T.incipit	…
ltx/en_us_dedes/me.m10.d09:meMA.Ode4C1T.melody	@ltx/en_us_dedes/he.h.m6:heHE.ChristosMouDynamis.name
ltx/en_us_dedes/me.m10.d09:meMA.Ode4C1T.mode	@ltx/en_us_dedes/miscellanea:misc.Mode6
ltx/en_us_dedes/me.m10.d09:meMA.Ode4C1T.ode	@ltx/en_us_dedes/miscellanea:misc.Ode4
ltx/en_us_dedes/me.m10.d09:meMA.Ode4C1T.text	
ltx/en_us_dedes/me.m10.d09:meMA.Ode4C21.greekmelody	@ltx/en_us_dedes/he.h.m8:heHE.EisakikoaKyrie.greekname
ltx/en_us_dedes/me.m10.d09:meMA.Ode4C21.incipit	…
ltx/en_us_dedes/me.m10.d09:meMA.Ode4C21.melody	@ltx/en_us_dedes/he.h.m8:heHE.EisakikoaKyrie.name
ltx/en_us_dedes/me.m10.d09:meMA.Ode4C21.mode	@ltx/en_us_dedes/miscellanea:misc.Mode8
ltx/en_us_dedes/me.m10.d09:meMA.Ode4C21.ode	@ltx/en_us_dedes/miscellanea:misc.Ode4
ltx/en_us_dedes/me.m10.d09:meMA.Ode4C21.text	
ltx/en_us_dedes/me.m10.d09:meMA.Ode4C22.incipit	…
ltx/en_us_dedes/me.m10.d09:meMA.Ode4C22.melody	@ltx/en_us_dedes/he.h.m8:heHE.EisakikoaKyrie.name
ltx/en_us_dedes/me.m10.d09:meMA.Ode4C22.mode	@ltx/en_us_dedes/miscellanea:misc.Mode8
ltx/en_us_dedes/me.m10.d09:meMA.Ode4C22.ode	@ltx/en_us_dedes/miscellanea:misc.Ode4
ltx/en_us_dedes/me.m10.d09:meMA.Ode4C22.text	
ltx/en_us_dedes/me.m10.d09:meMA.Ode4C23.incipit	…
ltx/en_us_dedes/me.m10.d09:meMA.Ode4C23.melody	@ltx/en_us_dedes/he.h.m8:heHE.EisakikoaKyrie.name
ltx/en_us_dedes/me.m10.d09:meMA.Ode4C23.mode	@ltx/en_us_dedes/miscellanea:misc.Mode8
ltx/en_us_dedes/me.m10.d09:meMA.Ode4C23.ode	@ltx/en_us_dedes/miscellanea:misc.Ode4
ltx/en_us_dedes/me.m10.d09:meMA.Ode4C23.text	
ltx/en_us_dedes/me.m10.d09:meMA.Ode4C2T.incipit	…
ltx/en_us_dedes/me.m10.d09:meMA.Ode4C2T.melody	@ltx/en_us_dedes/he.h.m8:heHE.EisakikoaKyrie.name
ltx/en_us_dedes/me.m10.d09:meMA.Ode4C2T.mode	@ltx/en_us_dedes/miscellanea:misc.Mode8
ltx/en_us_dedes/me.m10.d09:meMA.Ode4C2T.ode	@ltx/en_us_dedes/miscellanea:misc.Ode4
ltx/en_us_dedes/me.m10.d09:meMA.Ode4C2T.text	
ltx/en_us_dedes/me.m10.d09:meMA.Ode5C11.greekmelody	@ltx/en_us_dedes/he.h.m6:heHE.ToTheioFengeiSou.greekname
ltx/en_us_dedes/me.m10.d09:meMA.Ode5C11.incipit	…
ltx/en_us_dedes/me.m10.d09:meMA.Ode5C11.melody	@ltx/en_us_dedes/he.h.m6:heHE.ToTheioFengeiSou.name
ltx/en_us_dedes/me.m10.d09:meMA.Ode5C11.mode	@ltx/en_us_dedes/miscellanea:misc.Mode6
ltx/en_us_dedes/me.m10.d09:meMA.Ode5C11.ode	@ltx/en_us_dedes/miscellanea:misc.Ode5
ltx/en_us_dedes/me.m10.d09:meMA.Ode5C11.text	
ltx/en_us_dedes/me.m10.d09:meMA.Ode5C12.incipit	…
ltx/en_us_dedes/me.m10.d09:meMA.Ode5C12.melody	@ltx/en_us_dedes/he.h.m6:heHE.ToTheioFengeiSou.name
ltx/en_us_dedes/me.m10.d09:meMA.Ode5C12.mode	@ltx/en_us_dedes/miscellanea:misc.Mode6
ltx/en_us_dedes/me.m10.d09:meMA.Ode5C12.ode	@ltx/en_us_dedes/miscellanea:misc.Ode5
ltx/en_us_dedes/me.m10.d09:meMA.Ode5C12.text	
ltx/en_us_dedes/me.m10.d09:meMA.Ode5C13.incipit	…
ltx/en_us_dedes/me.m10.d09:meMA.Ode5C13.melody	@ltx/en_us_dedes/he.h.m6:heHE.ToTheioFengeiSou.name
ltx/en_us_dedes/me.m10.d09:meMA.Ode5C13.mode	@ltx/en_us_dedes/miscellanea:misc.Mode6
ltx/en_us_dedes/me.m10.d09:meMA.Ode5C13.ode	@ltx/en_us_dedes/miscellanea:misc.Ode5
ltx/en_us_dedes/me.m10.d09:meMA.Ode5C13.text	
ltx/en_us_dedes/me.m10.d09:meMA.Ode5C1T.incipit	…
ltx/en_us_dedes/me.m10.d09:meMA.Ode5C1T.melody	@ltx/en_us_dedes/he.h.m6:heHE.ToTheioFengeiSou.name
ltx/en_us_dedes/me.m10.d09:meMA.Ode5C1T.mode	@ltx/en_us_dedes/miscellanea:misc.Mode6
ltx/en_us_dedes/me.m10.d09:meMA.Ode5C1T.ode	@ltx/en_us_dedes/miscellanea:misc.Ode5
ltx/en_us_dedes/me.m10.d09:meMA.Ode5C1T.text	
ltx/en_us_dedes/me.m10.d09:meMA.Ode5C21.greekmelody	@ltx/en_us_dedes/he.h.m8:heHE.OrthrizontesVoomenSoi.greekname
ltx/en_us_dedes/me.m10.d09:meMA.Ode5C21.incipit	…
ltx/en_us_dedes/me.m10.d09:meMA.Ode5C21.melody	@ltx/en_us_dedes/he.h.m8:heHE.OrthrizontesVoomenSoi.name
ltx/en_us_dedes/me.m10.d09:meMA.Ode5C21.mode	@ltx/en_us_dedes/miscellanea:misc.Mode8
ltx/en_us_dedes/me.m10.d09:meMA.Ode5C21.ode	@ltx/en_us_dedes/miscellanea:misc.Ode5
ltx/en_us_dedes/me.m10.d09:meMA.Ode5C21.text	
ltx/en_us_dedes/me.m10.d09:meMA.Ode5C22.incipit	…
ltx/en_us_dedes/me.m10.d09:meMA.Ode5C22.melody	@ltx/en_us_dedes/he.h.m8:heHE.OrthrizontesVoomenSoi.name
ltx/en_us_dedes/me.m10.d09:meMA.Ode5C22.mode	@ltx/en_us_dedes/miscellanea:misc.Mode8
ltx/en_us_dedes/me.m10.d09:meMA.Ode5C22.ode	@ltx/en_us_dedes/miscellanea:misc.Ode5
ltx/en_us_dedes/me.m10.d09:meMA.Ode5C22.text	
ltx/en_us_dedes/me.m10.d09:meMA.Ode5C23.incipit	…
ltx/en_us_dedes/me.m10.d09:meMA.Ode5C23.melody	@ltx/en_us_dedes/he.h.m8:heHE.OrthrizontesVoomenSoi.name
ltx/en_us_dedes/me.m10.d09:meMA.Ode5C23.mode	@ltx/en_us_dedes/miscellanea:misc.Mode8
ltx/en_us_dedes/me.m10.d09:meMA.Ode5C23.ode	@ltx/en_us_dedes/miscellanea:misc.Ode5
ltx/en_us_dedes/me.m10.d09:meMA.Ode5C23.text	
ltx/en_us_dedes/me.m10.d09:meMA.Ode5C2T.incipit	…
ltx/en_us_dedes/me.m10.d09:meMA.Ode5C2T.melody	@ltx/en_us_dedes/he.h.m8:heHE.OrthrizontesVoomenSoi.name
ltx/en_us_dedes/me.m10.d09:meMA.Ode5C2T.mode	@ltx/en_us_dedes/miscellanea:misc.Mode8
ltx/en_us_dedes/me.m10.d09:meMA.Ode5C2T.ode	@ltx/en_us_dedes/miscellanea:misc.Ode5
ltx/en_us_dedes/me.m10.d09:meMA.Ode5C2T.text	
ltx/en_us_dedes/me.m10.d09:meMA.Ode6C11.greekmelody	@ltx/en_us_dedes/he.h.m6:heHE.TouViouTinThalassan.greekname
ltx/en_us_dedes/me.m10.d09:meMA.Ode6C11.incipit	…
ltx/en_us_dedes/me.m10.d09:meMA.Ode6C11.melody	@ltx/en_us_dedes/he.h.m6:heHE.TouViouTinThalassan.name
ltx/en_us_dedes/me.m10.d09:meMA.Ode6C11.mode	@ltx/en_us_dedes/miscellanea:misc.Mode6
ltx/en_us_dedes/me.m10.d09:meMA.Ode6C11.ode	@ltx/en_us_dedes/miscellanea:misc.Ode6
ltx/en_us_dedes/me.m10.d09:meMA.Ode6C11.text	
ltx/en_us_dedes/me.m10.d09:meMA.Ode6C12.incipit	…
ltx/en_us_dedes/me.m10.d09:meMA.Ode6C12.melody	@ltx/en_us_dedes/he.h.m6:heHE.TouViouTinThalassan.name
ltx/en_us_dedes/me.m10.d09:meMA.Ode6C12.mode	@ltx/en_us_dedes/miscellanea:misc.Mode6
ltx/en_us_dedes/me.m10.d09:meMA.Ode6C12.ode	@ltx/en_us_dedes/miscellanea:misc.Ode6
ltx/en_us_dedes/me.m10.d09:meMA.Ode6C12.text	
ltx/en_us_dedes/me.m10.d09:meMA.Ode6C13.incipit	…
ltx/en_us_dedes/me.m10.d09:meMA.Ode6C13.melody	@ltx/en_us_dedes/he.h.m6:heHE.TouViouTinThalassan.name
ltx/en_us_dedes/me.m10.d09:meMA.Ode6C13.mode	@ltx/en_us_dedes/miscellanea:misc.Mode6
ltx/en_us_dedes/me.m10.d09:meMA.Ode6C13.ode	@ltx/en_us_dedes/miscellanea:misc.Ode6
ltx/en_us_dedes/me.m10.d09:meMA.Ode6C13.text	
ltx/en_us_dedes/me.m10.d09:meMA.Ode6C1T.incipit	…
ltx/en_us_dedes/me.m10.d09:meMA.Ode6C1T.melody	@ltx/en_us_dedes/he.h.m6:heHE.TouViouTinThalassan.name
ltx/en_us_dedes/me.m10.d09:meMA.Ode6C1T.mode	@ltx/en_us_dedes/miscellanea:misc.Mode6
ltx/en_us_dedes/me.m10.d09:meMA.Ode6C1T.ode	@ltx/en_us_dedes/miscellanea:misc.Ode6
ltx/en_us_dedes/me.m10.d09:meMA.Ode6C1T.text	
ltx/en_us_dedes/me.m10.d09:meMA.Ode6C21.greekmelody	@ltx/en_us_dedes/he.h.m8:heHE.ChitonaMoiParaschou.greekname
ltx/en_us_dedes/me.m10.d09:meMA.Ode6C21.incipit	…
ltx/en_us_dedes/me.m10.d09:meMA.Ode6C21.melody	@ltx/en_us_dedes/he.h.m8:heHE.ChitonaMoiParaschou.name
ltx/en_us_dedes/me.m10.d09:meMA.Ode6C21.mode	@ltx/en_us_dedes/miscellanea:misc.Mode8
ltx/en_us_dedes/me.m10.d09:meMA.Ode6C21.ode	@ltx/en_us_dedes/miscellanea:misc.Ode6
ltx/en_us_dedes/me.m10.d09:meMA.Ode6C21.text	
ltx/en_us_dedes/me.m10.d09:meMA.Ode6C22.incipit	…
ltx/en_us_dedes/me.m10.d09:meMA.Ode6C22.melody	@ltx/en_us_dedes/he.h.m8:heHE.ChitonaMoiParaschou.name
ltx/en_us_dedes/me.m10.d09:meMA.Ode6C22.mode	@ltx/en_us_dedes/miscellanea:misc.Mode8
ltx/en_us_dedes/me.m10.d09:meMA.Ode6C22.ode	@ltx/en_us_dedes/miscellanea:misc.Ode6
ltx/en_us_dedes/me.m10.d09:meMA.Ode6C22.text	
ltx/en_us_dedes/me.m10.d09:meMA.Ode6C23.incipit	…
ltx/en_us_dedes/me.m10.d09:meMA.Ode6C23.melody	@ltx/en_us_dedes/he.h.m8:heHE.ChitonaMoiParaschou.name
ltx/en_us_dedes/me.m10.d09:meMA.Ode6C23.mode	@ltx/en_us_dedes/miscellanea:misc.Mode8
ltx/en_us_dedes/me.m10.d09:meMA.Ode6C23.ode	@ltx/en_us_dedes/miscellanea:misc.Ode6
ltx/en_us_dedes/me.m10.d09:meMA.Ode6C23.text	
ltx/en_us_dedes/me.m10.d09:meMA.Ode6C2T.incipit	…
ltx/en_us_dedes/me.m10.d09:meMA.Ode6C2T.melody	@ltx/en_us_dedes/he.h.m8:heHE.ChitonaMoiParaschou.name
ltx/en_us_dedes/me.m10.d09:meMA.Ode6C2T.mode	@ltx/en_us_dedes/miscellanea:misc.Mode8
ltx/en_us_dedes/me.m10.d09:meMA.Ode6C2T.ode	@ltx/en_us_dedes/miscellanea:misc.Ode6
ltx/en_us_dedes/me.m10.d09:meMA.Ode6C2T.text	
ltx/en_us_dedes/me.m10.d09:meMA.Ode6H.greekmelody	@ltx/en_us_dedes/he.h.m8:heHE.ChitonaMoiParaschou.greekname
ltx/en_us_dedes/me.m10.d09:meMA.Ode6H.incipit	@ltx/en_us_dedes/he.h.m8:heHE.ChitonaMoiParaschou.incipit
ltx/en_us_dedes/me.m10.d09:meMA.Ode6H.melody	@ltx/en_us_dedes/he.h.m8:heHE.ChitonaMoiParaschou.melody
ltx/en_us_dedes/me.m10.d09:meMA.Ode6H.mode	@ltx/en_us_dedes/miscellanea:misc.Mode8
ltx/en_us_dedes/me.m10.d09:meMA.Ode6H.ode	@ltx/en_us_dedes/miscellanea:misc.Ode6
ltx/en_us_dedes/me.m10.d09:meMA.Ode6H.text	@ltx/en_us_dedes/he.h.m8:heHE.ChitonaMoiParaschou.text
ltx/en_us_dedes/me.m10.d09:meMA.Ode7C11.greekmelody	@ltx/en_us_dedes/he.h.m6:heHE.OiPaidesEnVavyloni.greekname
ltx/en_us_dedes/me.m10.d09:meMA.Ode7C11.incipit	…
ltx/en_us_dedes/me.m10.d09:meMA.Ode7C11.melody	@ltx/en_us_dedes/he.h.m6:heHE.OiPaidesEnVavyloni.name
ltx/en_us_dedes/me.m10.d09:meMA.Ode7C11.mode	@ltx/en_us_dedes/miscellanea:misc.Mode6
ltx/en_us_dedes/me.m10.d09:meMA.Ode7C11.ode	@ltx/en_us_dedes/miscellanea:misc.Ode7
ltx/en_us_dedes/me.m10.d09:meMA.Ode7C11.text	
ltx/en_us_dedes/me.m10.d09:meMA.Ode7C12.incipit	…
ltx/en_us_dedes/me.m10.d09:meMA.Ode7C12.melody	@ltx/en_us_dedes/he.h.m6:heHE.OiPaidesEnVavyloni.name
ltx/en_us_dedes/me.m10.d09:meMA.Ode7C12.mode	@ltx/en_us_dedes/miscellanea:misc.Mode6
ltx/en_us_dedes/me.m10.d09:meMA.Ode7C12.ode	@ltx/en_us_dedes/miscellanea:misc.Ode7
ltx/en_us_dedes/me.m10.d09:meMA.Ode7C12.text	
ltx/en_us_dedes/me.m10.d09:meMA.Ode7C13.incipit	…
ltx/en_us_dedes/me.m10.d09:meMA.Ode7C13.melody	@ltx/en_us_dedes/he.h.m6:heHE.OiPaidesEnVavyloni.name
ltx/en_us_dedes/me.m10.d09:meMA.Ode7C13.mode	@ltx/en_us_dedes/miscellanea:misc.Mode6
ltx/en_us_dedes/me.m10.d09:meMA.Ode7C13.ode	@ltx/en_us_dedes/miscellanea:misc.Ode7
ltx/en_us_dedes/me.m10.d09:meMA.Ode7C13.text	
ltx/en_us_dedes/me.m10.d09:meMA.Ode7C1T.incipit	…
ltx/en_us_dedes/me.m10.d09:meMA.Ode7C1T.melody	@ltx/en_us_dedes/he.h.m6:heHE.OiPaidesEnVavyloni.name
ltx/en_us_dedes/me.m10.d09:meMA.Ode7C1T.mode	@ltx/en_us_dedes/miscellanea:misc.Mode6
ltx/en_us_dedes/me.m10.d09:meMA.Ode7C1T.ode	@ltx/en_us_dedes/miscellanea:misc.Ode7
ltx/en_us_dedes/me.m10.d09:meMA.Ode7C1T.text	
ltx/en_us_dedes/me.m10.d09:meMA.Ode7C21.greekmelody	@ltx/en_us_dedes/he.h.m8:heHE.PaidesEvraion.greekname
ltx/en_us_dedes/me.m10.d09:meMA.Ode7C21.incipit	…
ltx/en_us_dedes/me.m10.d09:meMA.Ode7C21.melody	@ltx/en_us_dedes/he.h.m8:heHE.PaidesEvraion.name
ltx/en_us_dedes/me.m10.d09:meMA.Ode7C21.mode	@ltx/en_us_dedes/miscellanea:misc.Mode8
ltx/en_us_dedes/me.m10.d09:meMA.Ode7C21.ode	@ltx/en_us_dedes/miscellanea:misc.Ode7
ltx/en_us_dedes/me.m10.d09:meMA.Ode7C21.text	
ltx/en_us_dedes/me.m10.d09:meMA.Ode7C22.incipit	…
ltx/en_us_dedes/me.m10.d09:meMA.Ode7C22.melody	@ltx/en_us_dedes/he.h.m8:heHE.PaidesEvraion.name
ltx/en_us_dedes/me.m10.d09:meMA.Ode7C22.mode	@ltx/en_us_dedes/miscellanea:misc.Mode8
ltx/en_us_dedes/me.m10.d09:meMA.Ode7C22.ode	@ltx/en_us_dedes/miscellanea:misc.Ode7
ltx/en_us_dedes/me.m10.d09:meMA.Ode7C22.text	
ltx/en_us_dedes/me.m10.d09:meMA.Ode7C23.incipit	…
ltx/en_us_dedes/me.m10.d09:meMA.Ode7C23.melody	@ltx/en_us_dedes/he.h.m8:heHE.PaidesEvraion.name
ltx/en_us_dedes/me.m10.d09:meMA.Ode7C23.mode	@ltx/en_us_dedes/miscellanea:misc.Mode8
ltx/en_us_dedes/me.m10.d09:meMA.Ode7C23.ode	@ltx/en_us_dedes/miscellanea:misc.Ode7
ltx/en_us_dedes/me.m10.d09:meMA.Ode7C23.text	
ltx/en_us_dedes/me.m10.d09:meMA.Ode7C2T.incipit	…
ltx/en_us_dedes/me.m10.d09:meMA.Ode7C2T.melody	@ltx/en_us_dedes/he.h.m8:heHE.PaidesEvraion.name
ltx/en_us_dedes/me.m10.d09:meMA.Ode7C2T.mode	@ltx/en_us_dedes/miscellanea:misc.Mode8
ltx/en_us_dedes/me.m10.d09:meMA.Ode7C2T.ode	@ltx/en_us_dedes/miscellanea:misc.Ode7
ltx/en_us_dedes/me.m10.d09:meMA.Ode7C2T.text	
ltx/en_us_dedes/me.m10.d09:meMA.Ode8C11.greekmelody	@ltx/en_us_dedes/he.h.m6:heHE.NomonPatroon.greekname
ltx/en_us_dedes/me.m10.d09:meMA.Ode8C11.incipit	…
ltx/en_us_dedes/me.m10.d09:meMA.Ode8C11.melody	@ltx/en_us_dedes/he.h.m6:heHE.NomonPatroon.name
ltx/en_us_dedes/me.m10.d09:meMA.Ode8C11.mode	@ltx/en_us_dedes/miscellanea:misc.Mode6
ltx/en_us_dedes/me.m10.d09:meMA.Ode8C11.ode	@ltx/en_us_dedes/miscellanea:misc.Ode8
ltx/en_us_dedes/me.m10.d09:meMA.Ode8C11.text	
ltx/en_us_dedes/me.m10.d09:meMA.Ode8C12.incipit	…
ltx/en_us_dedes/me.m10.d09:meMA.Ode8C12.melody	@ltx/en_us_dedes/he.h.m6:heHE.NomonPatroon.name
ltx/en_us_dedes/me.m10.d09:meMA.Ode8C12.mode	@ltx/en_us_dedes/miscellanea:misc.Mode6
ltx/en_us_dedes/me.m10.d09:meMA.Ode8C12.ode	@ltx/en_us_dedes/miscellanea:misc.Ode8
ltx/en_us_dedes/me.m10.d09:meMA.Ode8C12.text	
ltx/en_us_dedes/me.m10.d09:meMA.Ode8C13.incipit	…
ltx/en_us_dedes/me.m10.d09:meMA.Ode8C13.melody	@ltx/en_us_dedes/he.h.m6:heHE.NomonPatroon.name
ltx/en_us_dedes/me.m10.d09:meMA.Ode8C13.mode	@ltx/en_us_dedes/miscellanea:misc.Mode6
ltx/en_us_dedes/me.m10.d09:meMA.Ode8C13.ode	@ltx/en_us_dedes/miscellanea:misc.Ode8
ltx/en_us_dedes/me.m10.d09:meMA.Ode8C13.text	
ltx/en_us_dedes/me.m10.d09:meMA.Ode8C1T.incipit	…
ltx/en_us_dedes/me.m10.d09:meMA.Ode8C1T.melody	@ltx/en_us_dedes/he.h.m6:heHE.NomonPatroon.name
ltx/en_us_dedes/me.m10.d09:meMA.Ode8C1T.mode	@ltx/en_us_dedes/miscellanea:misc.Mode6
ltx/en_us_dedes/me.m10.d09:meMA.Ode8C1T.ode	@ltx/en_us_dedes/miscellanea:misc.Ode8
ltx/en_us_dedes/me.m10.d09:meMA.Ode8C1T.text	
ltx/en_us_dedes/me.m10.d09:meMA.Ode8C21.greekmelody	@ltx/en_us_dedes/he.h.m8:heHE.TonVasileaTonOuranon.greekname
ltx/en_us_dedes/me.m10.d09:meMA.Ode8C21.incipit	…
ltx/en_us_dedes/me.m10.d09:meMA.Ode8C21.melody	@ltx/en_us_dedes/he.h.m8:heHE.TonVasileaTonOuranon.name
ltx/en_us_dedes/me.m10.d09:meMA.Ode8C21.mode	@ltx/en_us_dedes/miscellanea:misc.Mode8
ltx/en_us_dedes/me.m10.d09:meMA.Ode8C21.ode	@ltx/en_us_dedes/miscellanea:misc.Ode8
ltx/en_us_dedes/me.m10.d09:meMA.Ode8C21.text	
ltx/en_us_dedes/me.m10.d09:meMA.Ode8C22.incipit	…
ltx/en_us_dedes/me.m10.d09:meMA.Ode8C22.melody	@ltx/en_us_dedes/he.h.m8:heHE.TonVasileaTonOuranon.name
ltx/en_us_dedes/me.m10.d09:meMA.Ode8C22.mode	@ltx/en_us_dedes/miscellanea:misc.Mode8
ltx/en_us_dedes/me.m10.d09:meMA.Ode8C22.ode	@ltx/en_us_dedes/miscellanea:misc.Ode8
ltx/en_us_dedes/me.m10.d09:meMA.Ode8C22.text	
ltx/en_us_dedes/me.m10.d09:meMA.Ode8C23.incipit	…
ltx/en_us_dedes/me.m10.d09:meMA.Ode8C23.melody	@ltx/en_us_dedes/he.h.m8:heHE.TonVasileaTonOuranon.name
ltx/en_us_dedes/me.m10.d09:meMA.Ode8C23.mode	@ltx/en_us_dedes/miscellanea:misc.Mode8
ltx/en_us_dedes/me.m10.d09:meMA.Ode8C23.ode	@ltx/en_us_dedes/miscellanea:misc.Ode8
ltx/en_us_dedes/me.m10.d09:meMA.Ode8C23.text	
ltx/en_us_dedes/me.m10.d09:meMA.Ode8C2T.incipit	…
ltx/en_us_dedes/me.m10.d09:meMA.Ode8C2T.melody	@ltx/en_us_dedes/he.h.m8:heHE.TonVasileaTonOuranon.name
ltx/en_us_dedes/me.m10.d09:meMA.Ode8C2T.mode	@ltx/en_us_dedes/miscellanea:misc.Mode8
ltx/en_us_dedes/me.m10.d09:meMA.Ode8C2T.ode	@ltx/en_us_dedes/miscellanea:misc.Ode8
ltx/en_us_dedes/me.m10.d09:meMA.Ode8C2T.text	
ltx/en_us_dedes/me.m10.d09:meMA.Ode8H.greekmelody	@ltx/en_us_dedes/he.h.m8:heHE.TonVasileaTonOuranon.greekname
ltx/en_us_dedes/me.m10.d09:meMA.Ode8H.incipit	@ltx/en_us_dedes/he.h.m8:heHE.TonVasileaTonOuranon.incipit
ltx/en_us_dedes/me.m10.d09:meMA.Ode8H.melody	@ltx/en_us_dedes/he.h.m8:heHE.TonVasileaTonOuranon.melody
ltx/en_us_dedes/me.m10.d09:meMA.Ode8H.mode	@ltx/en_us_dedes/miscellanea:misc.Mode8
ltx/en_us_dedes/me.m10.d09:meMA.Ode8H.ode	@ltx/en_us_dedes/miscellanea:misc.Ode8
ltx/en_us_dedes/me.m10.d09:meMA.Ode8H.text	@ltx/en_us_dedes/he.h.m8:heHE.TonVasileaTonOuranon.text
ltx/en_us_dedes/me.m10.d09:meMA.Ode9C11.greekmelody	@ltx/en_us_dedes/he.h.m2:heHE.AporeiPasaGlossa.greekname
ltx/en_us_dedes/me.m10.d09:meMA.Ode9C11.incipit	…
ltx/en_us_dedes/me.m10.d09:meMA.Ode9C11.melody	@ltx/en_us_dedes/he.h.m2:heHE.AporeiPasaGlossa.name
ltx/en_us_dedes/me.m10.d09:meMA.Ode9C11.mode	@ltx/en_us_dedes/miscellanea:misc.Mode6
ltx/en_us_dedes/me.m10.d09:meMA.Ode9C11.ode	@ltx/en_us_dedes/miscellanea:misc.Ode9
ltx/en_us_dedes/me.m10.d09:meMA.Ode9C11.text	
ltx/en_us_dedes/me.m10.d09:meMA.Ode9C12.incipit	…
ltx/en_us_dedes/me.m10.d09:meMA.Ode9C12.melody	@ltx/en_us_dedes/he.h.m2:heHE.AporeiPasaGlossa.name
ltx/en_us_dedes/me.m10.d09:meMA.Ode9C12.mode	@ltx/en_us_dedes/miscellanea:misc.Mode6
ltx/en_us_dedes/me.m10.d09:meMA.Ode9C12.ode	@ltx/en_us_dedes/miscellanea:misc.Ode9
ltx/en_us_dedes/me.m10.d09:meMA.Ode9C12.text	
ltx/en_us_dedes/me.m10.d09:meMA.Ode9C13.incipit	…
ltx/en_us_dedes/me.m10.d09:meMA.Ode9C13.melody	@ltx/en_us_dedes/he.h.m2:heHE.AporeiPasaGlossa.name
ltx/en_us_dedes/me.m10.d09:meMA.Ode9C13.mode	@ltx/en_us_dedes/miscellanea:misc.Mode6
ltx/en_us_dedes/me.m10.d09:meMA.Ode9C13.ode	@ltx/en_us_dedes/miscellanea:misc.Ode9
ltx/en_us_dedes/me.m10.d09:meMA.Ode9C13.text	
ltx/en_us_dedes/me.m10.d09:meMA.Ode9C1T.incipit	…
ltx/en_us_dedes/me.m10.d09:meMA.Ode9C1T.melody	@ltx/en_us_dedes/he.h.m2:heHE.AporeiPasaGlossa.name
ltx/en_us_dedes/me.m10.d09:meMA.Ode9C1T.mode	@ltx/en_us_dedes/miscellanea:misc.Mode6
ltx/en_us_dedes/me.m10.d09:meMA.Ode9C1T.ode	@ltx/en_us_dedes/miscellanea:misc.Ode9
ltx/en_us_dedes/me.m10.d09:meMA.Ode9C1T.text	
ltx/en_us_dedes/me.m10.d09:meMA.Ode9C21.greekmelody	@ltx/en_us_dedes/he.h.m8:heHE.KyriosTheotokon.greekname
ltx/en_us_dedes/me.m10.d09:meMA.Ode9C21.incipit	…
ltx/en_us_dedes/me.m10.d09:meMA.Ode9C21.melody	@ltx/en_us_dedes/he.h.m8:heHE.KyriosTheotokon.name
ltx/en_us_dedes/me.m10.d09:meMA.Ode9C21.mode	@ltx/en_us_dedes/miscellanea:misc.Mode8
ltx/en_us_dedes/me.m10.d09:meMA.Ode9C21.ode	@ltx/en_us_dedes/miscellanea:misc.Ode9
ltx/en_us_dedes/me.m10.d09:meMA.Ode9C21.text	
ltx/en_us_dedes/me.m10.d09:meMA.Ode9C22.incipit	…
ltx/en_us_dedes/me.m10.d09:meMA.Ode9C22.melody	@ltx/en_us_dedes/he.h.m8:heHE.KyriosTheotokon.name
ltx/en_us_dedes/me.m10.d09:meMA.Ode9C22.mode	@ltx/en_us_dedes/miscellanea:misc.Mode8
ltx/en_us_dedes/me.m10.d09:meMA.Ode9C22.ode	@ltx/en_us_dedes/miscellanea:misc.Ode9
ltx/en_us_dedes/me.m10.d09:meMA.Ode9C22.text	
ltx/en_us_dedes/me.m10.d09:meMA.Ode9C23.incipit	…
ltx/en_us_dedes/me.m10.d09:meMA.Ode9C23.melody	@ltx/en_us_dedes/he.h.m8:heHE.KyriosTheotokon.name
ltx/en_us_dedes/me.m10.d09:meMA.Ode9C23.mode	@ltx/en_us_dedes/miscellanea:misc.Mode8
ltx/en_us_dedes/me.m10.d09:meMA.Ode9C23.ode	@ltx/en_us_dedes/miscellanea:misc.Ode9
ltx/en_us_dedes/me.m10.d09:meMA.Ode9C23.text	
ltx/en_us_dedes/me.m10.d09:meMA.Ode9C2T.incipit	…
ltx/en_us_dedes/me.m10.d09:meMA.Ode9C2T.melody	@ltx/en_us_dedes/he.h.m8:heHE.KyriosTheotokon.name
ltx/en_us_dedes/me.m10.d09:meMA.Ode9C2T.mode	@ltx/en_us_dedes/miscellanea:misc.Mode8
ltx/en_us_dedes/me.m10.d09:meMA.Ode9C2T.ode	@ltx/en_us_dedes/miscellanea:misc.Ode9
ltx/en_us_dedes/me.m10.d09:meMA.Ode9C2T.text	
ltx/en_us_dedes/me.m10.d09:meMA.Ode9H.greekmelody	@ltx/en_us_dedes/he.h.m8:heHE.KyriosTheotokon.greekname
ltx/en_us_dedes/me.m10.d09:meMA.Ode9H.incipit	@ltx/en_us_dedes/he.h.m8:heHE.KyriosTheotokon.incipit
ltx/en_us_dedes/me.m10.d09:meMA.Ode9H.melody	@ltx/en_us_dedes/he.h.m8:heHE.KyriosTheotokon.melody
ltx/en_us_dedes/me.m10.d09:meMA.Ode9H.mode	@ltx/en_us_dedes/miscellanea:misc.Mode8
ltx/en_us_dedes/me.m10.d09:meMA.Ode9H.ode	@ltx/en_us_dedes/miscellanea:misc.Ode9
ltx/en_us_dedes/me.m10.d09:meMA.Ode9H.text	@ltx/en_us_dedes/he.h.m8:heHE.KyriosTheotokon.text
ltx/en_us_dedes/me.m10.d09:meMA.Oikos1.text	O Jesus Christ, I implore You to send me Your grace, so that I might extol Your great Apostle James, the son of Alphaeus, who from heaven was initiated into the knowledge of the Logos, and to those on earth publicly preached the Gospel. You, Lord, are the one who filled Your wise disciple with the Holy Spirit, and You gave him to be a herald to all the ends of the world, and to be an acceptable intercessor before You. And he continually intercedes on behalf of us all.
ltx/en_us_dedes/me.m10.d09:meVE.Apolytikion1ger.greekmelody	@ltx/en_us_dedes/he.a.m4:heAU.TachyProkatalave.greekname
ltx/en_us_dedes/me.m10.d09:meVE.Apolytikion1ger.incipit	…
ltx/en_us_dedes/me.m10.d09:meVE.Apolytikion1ger.melody	@ltx/en_us_dedes/he.a.m4:heAU.TachyProkatalave.name
ltx/en_us_dedes/me.m10.d09:meVE.Apolytikion1ger.mode	@ltx/en_us_dedes/miscellanea:misc.Mode4
ltx/en_us_dedes/me.m10.d09:meVE.Apolytikion1ger.poet	@ltx/en_us_dedes/poets:po.Gerasimou
ltx/en_us_dedes/me.m10.d09:meVE.Apolytikion1ger.text	
ltx/en_us_dedes/me.m10.d09:meVE.Apolytikion2ger.greekmelody	@ltx/en_us_dedes/he.a.m5:heAU.TonSynanarchonLogon.greekname
ltx/en_us_dedes/me.m10.d09:meVE.Apolytikion2ger.incipit	…
ltx/en_us_dedes/me.m10.d09:meVE.Apolytikion2ger.melody	@ltx/en_us_dedes/he.a.m5:heAU.TonSynanarchonLogon.name
ltx/en_us_dedes/me.m10.d09:meVE.Apolytikion2ger.mode	@ltx/en_us_dedes/miscellanea:misc.Mode5
ltx/en_us_dedes/me.m10.d09:meVE.Apolytikion2ger.poet	@ltx/en_us_dedes/poets:po.Gerasimou
ltx/en_us_dedes/me.m10.d09:meVE.Apolytikion2ger.text	
ltx/en_us_dedes/me.m10.d09:meVE.AposGlory.incipit	…
ltx/en_us_dedes/me.m10.d09:meVE.AposGlory.melody	
ltx/en_us_dedes/me.m10.d09:meVE.AposGlory.mode	@ltx/en_us_dedes/miscellanea:misc.Mode5
ltx/en_us_dedes/me.m10.d09:meVE.AposGlory.text	
ltx/en_us_dedes/me.m10.d09:meVE.AposStavrotheotokion.greekmelody	@ltx/en_us_dedes/he.a.m5:heAU.ChairoisAskitikon.greekname
ltx/en_us_dedes/me.m10.d09:meVE.AposStavrotheotokion.incipit	When she who is compared…
ltx/en_us_dedes/me.m10.d09:meVE.AposStavrotheotokion.melody	@ltx/en_us_dedes/he.a.m5:heAU.ChairoisAskitikon.name
ltx/en_us_dedes/me.m10.d09:meVE.AposStavrotheotokion.mode	@ltx/en_us_dedes/miscellanea:misc.Mode5
ltx/en_us_dedes/me.m10.d09:meVE.AposStavrotheotokion.text	When she who is compared to a Ewe * beheld her Son, whom John the Baptist called Lamb of God * who takes away the transgressions of all the world, crucified * and pierced in the side, she cried out in lament: * “My Son, how can you endure being unjustly put to death * as a mere human, being God and creation’s Lord, * even if it was by Your will that You took on flesh? * Why have You hurried down the path * that leads to Your death, my Child, * and have abandoned me? Tell me who as a virgin gave birth to You, * divine Benefactor. * Hurry back and grant great mercy to me and to the world!”
ltx/en_us_dedes/me.m10.d09:meVE.AposTheotokion.greekmelody	@ltx/en_us_dedes/he.a.m5:heAU.ChairoisAskitikon.greekname
ltx/en_us_dedes/me.m10.d09:meVE.AposTheotokion.incipit	O all-blameless Mother of God…
ltx/en_us_dedes/me.m10.d09:meVE.AposTheotokion.melody	@ltx/en_us_dedes/he.a.m5:heAU.ChairoisAskitikon.notmetered
ltx/en_us_dedes/me.m10.d09:meVE.AposTheotokion.mode	@ltx/en_us_dedes/miscellanea:misc.Mode5
ltx/en_us_dedes/me.m10.d09:meVE.AposTheotokion.text	O all-blameless Mother of God, rescue me from the sword of the enemies. For by you, pure Virgin, and by your Son, all the power of the devil is destroyed, and the might of demonic forces is vanquished, and salvation and rest from labors come to those who believe in your Son. Therefore I cry out to you: O Lady, declare war on those who continually war against me, and exact revenge on them for the evil they did before, by which they were the cause of all my woes.
ltx/en_us_dedes/me.m10.d09:meVE.GeneralApolytikion1.name	James,
ltx/en_us_dedes/me.m10.d09:meVE.MM.GeneralApolytikion1.text	@ltx/en_us_dedes/properties:media.key
ltx/en_us_dedes/me.m10.d09:meVE.MM.GeneralApolytikion3.text	@ltx/en_us_dedes/properties:media.key
ltx/en_us_dedes/me.m10.d09:meVE.SticGlory.incipit	…
ltx/en_us_dedes/me.m10.d09:meVE.SticGlory.melody	
ltx/en_us_dedes/me.m10.d09:meVE.SticGlory.mode	@ltx/en_us_dedes/miscellanea:misc.Mode4
ltx/en_us_dedes/me.m10.d09:meVE.SticGlory.poet	@ltx/en_us_dedes/poets:po.Theofanous
ltx/en_us_dedes/me.m10.d09:meVE.SticGlory.text	
ltx/en_us_dedes/me.m10.d09:meVE.SticStavrotheotokion.greekmelody	@ltx/en_us_dedes/he.a.m4:heAU.OsGennaionEnMartysi.greekname
ltx/en_us_dedes/me.m10.d09:meVE.SticStavrotheotokion.incipit	@ltx/en_us_dedes/me.m10.d05:meVE.SticStavrotheotokion.incipit
ltx/en_us_dedes/me.m10.d09:meVE.SticStavrotheotokion.melody	@ltx/en_us_dedes/he.a.m4:heAU.OsGennaionEnMartysi.name
ltx/en_us_dedes/me.m10.d09:meVE.SticStavrotheotokion.mode	@ltx/en_us_dedes/miscellanea:misc.Mode4
ltx/en_us_dedes/me.m10.d09:meVE.SticStavrotheotokion.text	@ltx/en_us_dedes/me.m10.d05:meVE.SticStavrotheotokion.text
ltx/en_us_dedes/me.m10.d09:meVE.SticTheotokion.greekmelody	@ltx/en_us_dedes/he.a.m4:heAU.OsGennaionEnMartysi.greekname
ltx/en_us_dedes/me.m10.d09:meVE.SticTheotokion.incipit	The Judge has arrived…
ltx/en_us_dedes/me.m10.d09:meVE.SticTheotokion.melody	@ltx/en_us_dedes/he.a.m4:heAU.OsGennaionEnMartysi.notmetered
ltx/en_us_dedes/me.m10.d09:meVE.SticTheotokion.mode	@ltx/en_us_dedes/miscellanea:misc.Mode4
ltx/en_us_dedes/me.m10.d09:meVE.SticTheotokion.text	The Judge has arrived, and the trial is ready to begin; death is at hand, the ministers are ready, and everything is prepared. So what will you do, O my soul? What are you waiting for? Cry out: “Our God, O God of mercy, take pity on my, by the intercessions of Your Mother, and deliver me from perdition and all punishment.”
ltx/en_us_dedes/me.m10.d09:meVE.Stichera01.greekmelody	@ltx/en_us_dedes/he.a.m4:heAU.OsGennaionEnMartysi.greekname
ltx/en_us_dedes/me.m10.d09:meVE.Stichera01.incipit	@ltx/en_us_dedes/me.m04.d30:meMA.Lauds1.incipit
ltx/en_us_dedes/me.m10.d09:meVE.Stichera01.melody	@ltx/en_us_dedes/he.a.m4:heAU.OsGennaionEnMartysi.name
ltx/en_us_dedes/me.m10.d09:meVE.Stichera01.mode	@ltx/en_us_dedes/miscellanea:misc.Mode4
ltx/en_us_dedes/me.m10.d09:meVE.Stichera01.text	@ltx/en_us_dedes/me.m04.d30:meMA.Lauds1.text
ltx/en_us_dedes/me.m10.d09:meVE.Stichera02.incipit	@ltx/en_us_dedes/me.m04.d30:meMA.Lauds2.incipit
ltx/en_us_dedes/me.m10.d09:meVE.Stichera02.melody	@ltx/en_us_dedes/he.a.m4:heAU.OsGennaionEnMartysi.name
ltx/en_us_dedes/me.m10.d09:meVE.Stichera02.mode	@ltx/en_us_dedes/miscellanea:misc.Mode4
ltx/en_us_dedes/me.m10.d09:meVE.Stichera02.text	@ltx/en_us_dedes/me.m04.d30:meMA.Lauds2.text
ltx/en_us_dedes/me.m10.d09:meVE.Stichera03.incipit	@ltx/en_us_dedes/me.m04.d30:meMA.Lauds3.incipit
ltx/en_us_dedes/me.m10.d09:meVE.Stichera03.melody	@ltx/en_us_dedes/he.a.m4:heAU.OsGennaionEnMartysi.name
ltx/en_us_dedes/me.m10.d09:meVE.Stichera03.mode	@ltx/en_us_dedes/miscellanea:misc.Mode4
ltx/en_us_dedes/me.m10.d09:meVE.Stichera03.text	@ltx/en_us_dedes/me.m04.d30:meMA.Lauds3.text
ltx/en_us_dedes/me.m10.d09:meVE.Stichera04.greekmelody	@ltx/en_us_dedes/he.a.m6:heAU.OlinApothemenoi.greekname
ltx/en_us_dedes/me.m10.d09:meVE.Stichera04.incipit	O Saints, you put all…
ltx/en_us_dedes/me.m10.d09:meVE.Stichera04.melody	@ltx/en_us_dedes/he.a.m6:heAU.OlinApothemenoi.notmetered
ltx/en_us_dedes/me.m10.d09:meVE.Stichera04.mode	@ltx/en_us_dedes/miscellanea:misc.Mode6
ltx/en_us_dedes/me.m10.d09:meVE.Stichera04.text	O Saints, you put all mundane attachments behind you, and you despised wealth and abhored fleeting pleasure; then you took up the Cross, like a godly yoke, and you followed Christ, and you went to dwell in heavenly pastures. And now, as you delight there together, remember us who remember you in faith, and who with love and reverence observe your sacred and venerable memory.
ltx/en_us_dedes/me.m10.d09:meVE.Stichera05.incipit	That famous husband and wife…
ltx/en_us_dedes/me.m10.d09:meVE.Stichera05.melody	@ltx/en_us_dedes/he.a.m6:heAU.OlinApothemenoi.notmetered
ltx/en_us_dedes/me.m10.d09:meVE.Stichera05.mode	@ltx/en_us_dedes/miscellanea:misc.Mode6
ltx/en_us_dedes/me.m10.d09:meVE.Stichera05.text	That famous husband and wife couple loved You completely from the depths of their soul, O Master, and they ran after You; and they left behind all delights, and they broke their attachment to them, as if it were a spiders’s web. That is why they obtained Your kingdom, O immortal King. By their entreaties, will You, O merciful Lord, grant me forgiveness of offenses, and give me the upper hand against the passions that perturb my soul each day.
ltx/en_us_dedes/me.m10.d09:meVE.Stichera06.incipit	You were deprived of your…
ltx/en_us_dedes/me.m10.d09:meVE.Stichera06.melody	@ltx/en_us_dedes/he.a.m6:heAU.OlinApothemenoi.notmetered
ltx/en_us_dedes/me.m10.d09:meVE.Stichera06.mode	@ltx/en_us_dedes/miscellanea:misc.Mode6
ltx/en_us_dedes/me.m10.d09:meVE.Stichera06.text	You were deprived of your two beloved children, by an inscrutable command from on high; and your life was inconsolable. Then you uttered those brave words of Job and cried out, “The Lord gave, and the Lord has taken away.” And with this, you easily accomplished the labor you longed to do: you joyfully moved to the deserts and the Holy Land, and you were a most sacred couple.
