ltx/en_us_dedes/me.m06.d20:meDA.commemoration.first	Memory of the Holy Hieromartyr Methodius of Patara
ltx/en_us_dedes/me.m06.d20:meDA.commemoration.first_name	
ltx/en_us_dedes/me.m06.d20:meDA.commemoration.first_short	Memory of the Holy Hieromartyr Methodius of Patara
ltx/en_us_dedes/me.m06.d20:meDA.commemoration.first_title	@ltx/en_us_dedes/titles:ti.SaintM
ltx/en_us_dedes/me.m06.d20:meDA.commemoration.full	Memory of the Holy Hieromartyr Methodius, Bishop of Patara
ltx/en_us_dedes/me.m06.d20:meDA.commemoration.second_name	
ltx/en_us_dedes/me.m06.d20:meDA.commemoration.second_title	
ltx/en_us_dedes/me.m06.d20:meDA.date	June 20
ltx/en_us_dedes/me.m06.d20:meDA.dismissal	
ltx/en_us_dedes/me.m06.d20:meDA.fordate	for June 20
ltx/en_us_dedes/me.m06.d20:meDA.insert1	
ltx/en_us_dedes/me.m06.d20:meDA.insert2	
ltx/en_us_dedes/me.m06.d20:meDA.note	
ltx/en_us_dedes/me.m06.d20:meDA.pdfcoverdate	June 20,
ltx/en_us_dedes/me.m06.d20:meDA.pdfheaderdate	June 20
ltx/en_us_dedes/me.m06.d20:meHO.commemorations	
ltx/en_us_dedes/me.m06.d20:meHO.note1	
ltx/en_us_dedes/me.m06.d20:meHO.note2	
ltx/en_us_dedes/me.m06.d20:meHO.number	
ltx/en_us_dedes/me.m06.d20:meHO.rank	
ltx/en_us_dedes/me.m06.d20:meLE.commemoration1	
ltx/en_us_dedes/me.m06.d20:meLE.commemoration2	
ltx/en_us_dedes/me.m06.d20:meLI.Kontakion1.incipit	…
ltx/en_us_dedes/me.m06.d20:meLI.Kontakion1.melody	
ltx/en_us_dedes/me.m06.d20:meLI.Kontakion1.mode	
ltx/en_us_dedes/me.m06.d20:meLI.Kontakion1.text	
ltx/en_us_dedes/me.m06.d20:meLI.MM.CommunionHymn.text	@ltx/en_us_dedes/properties:media.key
ltx/en_us_dedes/me.m06.d20:meLI.Megalynarion.text	
ltx/en_us_dedes/me.m06.d20:meMA.C1.acrostic.notice1	
ltx/en_us_dedes/me.m06.d20:meMA.C1.acrostic.text	
ltx/en_us_dedes/me.m06.d20:meMA.C1.acrostic.title	
ltx/en_us_dedes/me.m06.d20:meMA.C1.poet	@ltx/en_us_dedes/poets:po.Theofanous
ltx/en_us_dedes/me.m06.d20:meMA.C1.title	@ltx/en_us_dedes/titles:ti.CanonSaintM
ltx/en_us_dedes/me.m06.d20:meMA.C1.verse	@ltx/en_us_dedes/prayers:pr.verse_SaintM.text
ltx/en_us_dedes/me.m06.d20:meMA.Ode1C11.greekmelody	@ltx/en_us_dedes/he.h.m7:heHE.NefseiSouProsGeodi.greekname
ltx/en_us_dedes/me.m06.d20:meMA.Ode1C11.incipit	…
ltx/en_us_dedes/me.m06.d20:meMA.Ode1C11.melody	@ltx/en_us_dedes/he.h.m7:heHE.NefseiSouProsGeodi.name
ltx/en_us_dedes/me.m06.d20:meMA.Ode1C11.mode	@ltx/en_us_dedes/miscellanea:misc.Mode7
ltx/en_us_dedes/me.m06.d20:meMA.Ode1C11.ode	@ltx/en_us_dedes/miscellanea:misc.Ode1
ltx/en_us_dedes/me.m06.d20:meMA.Ode1C11.text	
ltx/en_us_dedes/me.m06.d20:meMA.Ode1C12.incipit	…
ltx/en_us_dedes/me.m06.d20:meMA.Ode1C12.melody	@ltx/en_us_dedes/he.h.m7:heHE.NefseiSouProsGeodi.name
ltx/en_us_dedes/me.m06.d20:meMA.Ode1C12.mode	@ltx/en_us_dedes/miscellanea:misc.Mode7
ltx/en_us_dedes/me.m06.d20:meMA.Ode1C12.ode	@ltx/en_us_dedes/miscellanea:misc.Ode1
ltx/en_us_dedes/me.m06.d20:meMA.Ode1C12.text	
ltx/en_us_dedes/me.m06.d20:meMA.Ode1C13.incipit	…
ltx/en_us_dedes/me.m06.d20:meMA.Ode1C13.melody	@ltx/en_us_dedes/he.h.m7:heHE.NefseiSouProsGeodi.name
ltx/en_us_dedes/me.m06.d20:meMA.Ode1C13.mode	@ltx/en_us_dedes/miscellanea:misc.Mode7
ltx/en_us_dedes/me.m06.d20:meMA.Ode1C13.ode	@ltx/en_us_dedes/miscellanea:misc.Ode1
ltx/en_us_dedes/me.m06.d20:meMA.Ode1C13.text	
ltx/en_us_dedes/me.m06.d20:meMA.Ode1C14.incipit	…
ltx/en_us_dedes/me.m06.d20:meMA.Ode1C14.melody	@ltx/en_us_dedes/he.h.m7:heHE.NefseiSouProsGeodi.name
ltx/en_us_dedes/me.m06.d20:meMA.Ode1C14.mode	@ltx/en_us_dedes/miscellanea:misc.Mode7
ltx/en_us_dedes/me.m06.d20:meMA.Ode1C14.ode	@ltx/en_us_dedes/miscellanea:misc.Ode1
ltx/en_us_dedes/me.m06.d20:meMA.Ode1C14.text	
ltx/en_us_dedes/me.m06.d20:meMA.Ode1C1T.incipit	…
ltx/en_us_dedes/me.m06.d20:meMA.Ode1C1T.melody	@ltx/en_us_dedes/he.h.m7:heHE.NefseiSouProsGeodi.name
ltx/en_us_dedes/me.m06.d20:meMA.Ode1C1T.mode	@ltx/en_us_dedes/miscellanea:misc.Mode7
ltx/en_us_dedes/me.m06.d20:meMA.Ode1C1T.ode	@ltx/en_us_dedes/miscellanea:misc.Ode1
ltx/en_us_dedes/me.m06.d20:meMA.Ode1C1T.text	
ltx/en_us_dedes/me.m06.d20:meMA.Ode3C11.greekmelody	@ltx/en_us_dedes/he.h.m7:heHE.OKatArchasTousOuranous.greekname
ltx/en_us_dedes/me.m06.d20:meMA.Ode3C11.incipit	…
ltx/en_us_dedes/me.m06.d20:meMA.Ode3C11.melody	@ltx/en_us_dedes/he.h.m7:heHE.OKatArchasTousOuranous.name
ltx/en_us_dedes/me.m06.d20:meMA.Ode3C11.mode	@ltx/en_us_dedes/miscellanea:misc.Mode7
ltx/en_us_dedes/me.m06.d20:meMA.Ode3C11.ode	@ltx/en_us_dedes/miscellanea:misc.Ode3
ltx/en_us_dedes/me.m06.d20:meMA.Ode3C11.text	
ltx/en_us_dedes/me.m06.d20:meMA.Ode3C12.incipit	…
ltx/en_us_dedes/me.m06.d20:meMA.Ode3C12.melody	@ltx/en_us_dedes/he.h.m7:heHE.OKatArchasTousOuranous.name
ltx/en_us_dedes/me.m06.d20:meMA.Ode3C12.mode	@ltx/en_us_dedes/miscellanea:misc.Mode7
ltx/en_us_dedes/me.m06.d20:meMA.Ode3C12.ode	@ltx/en_us_dedes/miscellanea:misc.Ode3
ltx/en_us_dedes/me.m06.d20:meMA.Ode3C12.text	
ltx/en_us_dedes/me.m06.d20:meMA.Ode3C13.incipit	…
ltx/en_us_dedes/me.m06.d20:meMA.Ode3C13.melody	@ltx/en_us_dedes/he.h.m7:heHE.OKatArchasTousOuranous.name
ltx/en_us_dedes/me.m06.d20:meMA.Ode3C13.mode	@ltx/en_us_dedes/miscellanea:misc.Mode7
ltx/en_us_dedes/me.m06.d20:meMA.Ode3C13.ode	@ltx/en_us_dedes/miscellanea:misc.Ode3
ltx/en_us_dedes/me.m06.d20:meMA.Ode3C13.text	
ltx/en_us_dedes/me.m06.d20:meMA.Ode3C14.incipit	…
ltx/en_us_dedes/me.m06.d20:meMA.Ode3C14.melody	@ltx/en_us_dedes/he.h.m7:heHE.OKatArchasTousOuranous.name
ltx/en_us_dedes/me.m06.d20:meMA.Ode3C14.mode	@ltx/en_us_dedes/miscellanea:misc.Mode7
ltx/en_us_dedes/me.m06.d20:meMA.Ode3C14.ode	@ltx/en_us_dedes/miscellanea:misc.Ode3
ltx/en_us_dedes/me.m06.d20:meMA.Ode3C14.text	
ltx/en_us_dedes/me.m06.d20:meMA.Ode3C1T.incipit	…
ltx/en_us_dedes/me.m06.d20:meMA.Ode3C1T.melody	@ltx/en_us_dedes/he.h.m7:heHE.OKatArchasTousOuranous.name
ltx/en_us_dedes/me.m06.d20:meMA.Ode3C1T.mode	@ltx/en_us_dedes/miscellanea:misc.Mode7
ltx/en_us_dedes/me.m06.d20:meMA.Ode3C1T.ode	@ltx/en_us_dedes/miscellanea:misc.Ode3
ltx/en_us_dedes/me.m06.d20:meMA.Ode3C1T.text	
ltx/en_us_dedes/me.m06.d20:meMA.Ode3H.greekmelody	@ltx/en_us_dedes/he.h.m7:heHE.OKatArchasTousOuranous.greekname
ltx/en_us_dedes/me.m06.d20:meMA.Ode3H.incipit	@ltx/en_us_dedes/he.h.m7:heHE.OKatArchasTousOuranous.incipit
ltx/en_us_dedes/me.m06.d20:meMA.Ode3H.melody	@ltx/en_us_dedes/he.h.m7:heHE.OKatArchasTousOuranous.melody
ltx/en_us_dedes/me.m06.d20:meMA.Ode3H.mode	@ltx/en_us_dedes/miscellanea:misc.Mode7
ltx/en_us_dedes/me.m06.d20:meMA.Ode3H.ode	@ltx/en_us_dedes/miscellanea:misc.Ode3
ltx/en_us_dedes/me.m06.d20:meMA.Ode3H.text	@ltx/en_us_dedes/he.h.m7:heHE.OKatArchasTousOuranous.text
ltx/en_us_dedes/me.m06.d20:meMA.Ode3Kathisma1.greekmelody	@ltx/en_us_dedes/he.a.m4:heAU.OYpsotheisEnToStavro.greekname
ltx/en_us_dedes/me.m06.d20:meMA.Ode3Kathisma1.incipit	…
ltx/en_us_dedes/me.m06.d20:meMA.Ode3Kathisma1.melody	@ltx/en_us_dedes/he.a.m4:heAU.OYpsotheisEnToStavro.name
ltx/en_us_dedes/me.m06.d20:meMA.Ode3Kathisma1.mode	@ltx/en_us_dedes/miscellanea:misc.Mode4
ltx/en_us_dedes/me.m06.d20:meMA.Ode3Kathisma1.text	
ltx/en_us_dedes/me.m06.d20:meMA.Ode3KathismaSt.incipit	…
ltx/en_us_dedes/me.m06.d20:meMA.Ode3KathismaSt.melody	@ltx/en_us_dedes/he.a.m4:heAU.OYpsotheisEnToStavro.name
ltx/en_us_dedes/me.m06.d20:meMA.Ode3KathismaSt.mode	@ltx/en_us_dedes/miscellanea:misc.Mode4
ltx/en_us_dedes/me.m06.d20:meMA.Ode3KathismaSt.text	
ltx/en_us_dedes/me.m06.d20:meMA.Ode3KathismaT.incipit	@ltx/en_us_dedes/oc.m4.d3:ocVE.ApolTheotokionVM.incipit
ltx/en_us_dedes/me.m06.d20:meMA.Ode3KathismaT.melody	@ltx/en_us_dedes/he.a.m4:heAU.OYpsotheisEnToStavro.name
ltx/en_us_dedes/me.m06.d20:meMA.Ode3KathismaT.mode	@ltx/en_us_dedes/miscellanea:misc.Mode4
ltx/en_us_dedes/me.m06.d20:meMA.Ode3KathismaT.text	@ltx/en_us_dedes/oc.m4.d3:ocVE.ApolTheotokionVM.text
ltx/en_us_dedes/me.m06.d20:meMA.Ode4C11.greekmelody	@ltx/en_us_dedes/he.h.m7:heHE.OPatrikousKolpous.greekname
ltx/en_us_dedes/me.m06.d20:meMA.Ode4C11.incipit	…
ltx/en_us_dedes/me.m06.d20:meMA.Ode4C11.melody	@ltx/en_us_dedes/he.h.m7:heHE.OPatrikousKolpous.name
ltx/en_us_dedes/me.m06.d20:meMA.Ode4C11.mode	@ltx/en_us_dedes/miscellanea:misc.Mode7
ltx/en_us_dedes/me.m06.d20:meMA.Ode4C11.ode	@ltx/en_us_dedes/miscellanea:misc.Ode4
ltx/en_us_dedes/me.m06.d20:meMA.Ode4C11.text	
ltx/en_us_dedes/me.m06.d20:meMA.Ode4C12.incipit	…
ltx/en_us_dedes/me.m06.d20:meMA.Ode4C12.melody	@ltx/en_us_dedes/he.h.m7:heHE.OPatrikousKolpous.name
ltx/en_us_dedes/me.m06.d20:meMA.Ode4C12.mode	@ltx/en_us_dedes/miscellanea:misc.Mode7
ltx/en_us_dedes/me.m06.d20:meMA.Ode4C12.ode	@ltx/en_us_dedes/miscellanea:misc.Ode4
ltx/en_us_dedes/me.m06.d20:meMA.Ode4C12.text	
ltx/en_us_dedes/me.m06.d20:meMA.Ode4C13.incipit	…
ltx/en_us_dedes/me.m06.d20:meMA.Ode4C13.melody	@ltx/en_us_dedes/he.h.m7:heHE.OPatrikousKolpous.name
ltx/en_us_dedes/me.m06.d20:meMA.Ode4C13.mode	@ltx/en_us_dedes/miscellanea:misc.Mode7
ltx/en_us_dedes/me.m06.d20:meMA.Ode4C13.ode	@ltx/en_us_dedes/miscellanea:misc.Ode4
ltx/en_us_dedes/me.m06.d20:meMA.Ode4C13.text	
ltx/en_us_dedes/me.m06.d20:meMA.Ode4C14.incipit	…
ltx/en_us_dedes/me.m06.d20:meMA.Ode4C14.melody	@ltx/en_us_dedes/he.h.m7:heHE.OPatrikousKolpous.name
ltx/en_us_dedes/me.m06.d20:meMA.Ode4C14.mode	@ltx/en_us_dedes/miscellanea:misc.Mode7
ltx/en_us_dedes/me.m06.d20:meMA.Ode4C14.ode	@ltx/en_us_dedes/miscellanea:misc.Ode4
ltx/en_us_dedes/me.m06.d20:meMA.Ode4C14.text	
ltx/en_us_dedes/me.m06.d20:meMA.Ode4C1T.incipit	…
ltx/en_us_dedes/me.m06.d20:meMA.Ode4C1T.melody	@ltx/en_us_dedes/he.h.m7:heHE.OPatrikousKolpous.name
ltx/en_us_dedes/me.m06.d20:meMA.Ode4C1T.mode	@ltx/en_us_dedes/miscellanea:misc.Mode7
ltx/en_us_dedes/me.m06.d20:meMA.Ode4C1T.ode	@ltx/en_us_dedes/miscellanea:misc.Ode4
ltx/en_us_dedes/me.m06.d20:meMA.Ode4C1T.text	
ltx/en_us_dedes/me.m06.d20:meMA.Ode5C11.greekmelody	@ltx/en_us_dedes/he.h.m7:heHE.KyrieOTheosMou.greekname
ltx/en_us_dedes/me.m06.d20:meMA.Ode5C11.incipit	…
ltx/en_us_dedes/me.m06.d20:meMA.Ode5C11.melody	@ltx/en_us_dedes/he.h.m7:heHE.KyrieOTheosMou.name
ltx/en_us_dedes/me.m06.d20:meMA.Ode5C11.mode	@ltx/en_us_dedes/miscellanea:misc.Mode7
ltx/en_us_dedes/me.m06.d20:meMA.Ode5C11.ode	@ltx/en_us_dedes/miscellanea:misc.Ode5
ltx/en_us_dedes/me.m06.d20:meMA.Ode5C11.text	
ltx/en_us_dedes/me.m06.d20:meMA.Ode5C12.incipit	…
ltx/en_us_dedes/me.m06.d20:meMA.Ode5C12.melody	@ltx/en_us_dedes/he.h.m7:heHE.KyrieOTheosMou.name
ltx/en_us_dedes/me.m06.d20:meMA.Ode5C12.mode	@ltx/en_us_dedes/miscellanea:misc.Mode7
ltx/en_us_dedes/me.m06.d20:meMA.Ode5C12.ode	@ltx/en_us_dedes/miscellanea:misc.Ode5
ltx/en_us_dedes/me.m06.d20:meMA.Ode5C12.text	
ltx/en_us_dedes/me.m06.d20:meMA.Ode5C13.incipit	…
ltx/en_us_dedes/me.m06.d20:meMA.Ode5C13.melody	@ltx/en_us_dedes/he.h.m7:heHE.KyrieOTheosMou.name
ltx/en_us_dedes/me.m06.d20:meMA.Ode5C13.mode	@ltx/en_us_dedes/miscellanea:misc.Mode7
ltx/en_us_dedes/me.m06.d20:meMA.Ode5C13.ode	@ltx/en_us_dedes/miscellanea:misc.Ode5
ltx/en_us_dedes/me.m06.d20:meMA.Ode5C13.text	
ltx/en_us_dedes/me.m06.d20:meMA.Ode5C14.incipit	…
ltx/en_us_dedes/me.m06.d20:meMA.Ode5C14.melody	@ltx/en_us_dedes/he.h.m7:heHE.KyrieOTheosMou.name
ltx/en_us_dedes/me.m06.d20:meMA.Ode5C14.mode	@ltx/en_us_dedes/miscellanea:misc.Mode7
ltx/en_us_dedes/me.m06.d20:meMA.Ode5C14.ode	@ltx/en_us_dedes/miscellanea:misc.Ode5
ltx/en_us_dedes/me.m06.d20:meMA.Ode5C14.text	
ltx/en_us_dedes/me.m06.d20:meMA.Ode5C1T.incipit	…
ltx/en_us_dedes/me.m06.d20:meMA.Ode5C1T.melody	@ltx/en_us_dedes/he.h.m7:heHE.KyrieOTheosMou.name
ltx/en_us_dedes/me.m06.d20:meMA.Ode5C1T.mode	@ltx/en_us_dedes/miscellanea:misc.Mode7
ltx/en_us_dedes/me.m06.d20:meMA.Ode5C1T.ode	@ltx/en_us_dedes/miscellanea:misc.Ode5
ltx/en_us_dedes/me.m06.d20:meMA.Ode5C1T.text	
ltx/en_us_dedes/me.m06.d20:meMA.Ode6C11.greekmelody	@ltx/en_us_dedes/he.h.m7:heHE.NaftionToSalo.greekname
ltx/en_us_dedes/me.m06.d20:meMA.Ode6C11.incipit	…
ltx/en_us_dedes/me.m06.d20:meMA.Ode6C11.melody	@ltx/en_us_dedes/he.h.m7:heHE.NaftionToSalo.name
ltx/en_us_dedes/me.m06.d20:meMA.Ode6C11.mode	@ltx/en_us_dedes/miscellanea:misc.Mode7
ltx/en_us_dedes/me.m06.d20:meMA.Ode6C11.ode	@ltx/en_us_dedes/miscellanea:misc.Ode6
ltx/en_us_dedes/me.m06.d20:meMA.Ode6C11.text	
ltx/en_us_dedes/me.m06.d20:meMA.Ode6C12.incipit	…
ltx/en_us_dedes/me.m06.d20:meMA.Ode6C12.melody	@ltx/en_us_dedes/he.h.m7:heHE.NaftionToSalo.name
ltx/en_us_dedes/me.m06.d20:meMA.Ode6C12.mode	@ltx/en_us_dedes/miscellanea:misc.Mode7
ltx/en_us_dedes/me.m06.d20:meMA.Ode6C12.ode	@ltx/en_us_dedes/miscellanea:misc.Ode6
ltx/en_us_dedes/me.m06.d20:meMA.Ode6C12.text	
ltx/en_us_dedes/me.m06.d20:meMA.Ode6C13.incipit	…
ltx/en_us_dedes/me.m06.d20:meMA.Ode6C13.melody	@ltx/en_us_dedes/he.h.m7:heHE.NaftionToSalo.name
ltx/en_us_dedes/me.m06.d20:meMA.Ode6C13.mode	@ltx/en_us_dedes/miscellanea:misc.Mode7
ltx/en_us_dedes/me.m06.d20:meMA.Ode6C13.ode	@ltx/en_us_dedes/miscellanea:misc.Ode6
ltx/en_us_dedes/me.m06.d20:meMA.Ode6C13.text	
ltx/en_us_dedes/me.m06.d20:meMA.Ode6C1T.incipit	…
ltx/en_us_dedes/me.m06.d20:meMA.Ode6C1T.melody	@ltx/en_us_dedes/he.h.m7:heHE.NaftionToSalo.name
ltx/en_us_dedes/me.m06.d20:meMA.Ode6C1T.mode	@ltx/en_us_dedes/miscellanea:misc.Mode7
ltx/en_us_dedes/me.m06.d20:meMA.Ode6C1T.ode	@ltx/en_us_dedes/miscellanea:misc.Ode6
ltx/en_us_dedes/me.m06.d20:meMA.Ode6C1T.text	
ltx/en_us_dedes/me.m06.d20:meMA.Ode6H.greekmelody	@ltx/en_us_dedes/he.h.m7:heHE.NaftionToSalo.greekname
ltx/en_us_dedes/me.m06.d20:meMA.Ode6H.incipit	@ltx/en_us_dedes/he.h.m7:heHE.NaftionToSalo.incipit
ltx/en_us_dedes/me.m06.d20:meMA.Ode6H.melody	@ltx/en_us_dedes/he.h.m7:heHE.NaftionToSalo.melody
ltx/en_us_dedes/me.m06.d20:meMA.Ode6H.mode	@ltx/en_us_dedes/miscellanea:misc.Mode7
ltx/en_us_dedes/me.m06.d20:meMA.Ode6H.ode	@ltx/en_us_dedes/miscellanea:misc.Ode6
ltx/en_us_dedes/me.m06.d20:meMA.Ode6H.text	@ltx/en_us_dedes/he.h.m7:heHE.NaftionToSalo.text
ltx/en_us_dedes/me.m06.d20:meMA.Ode7C11.greekmelody	@ltx/en_us_dedes/he.h.m7:heHE.OiEnKaminoTouPyros.greekname
ltx/en_us_dedes/me.m06.d20:meMA.Ode7C11.incipit	…
ltx/en_us_dedes/me.m06.d20:meMA.Ode7C11.melody	@ltx/en_us_dedes/he.h.m7:heHE.OiEnKaminoTouPyros.name
ltx/en_us_dedes/me.m06.d20:meMA.Ode7C11.mode	@ltx/en_us_dedes/miscellanea:misc.Mode7
ltx/en_us_dedes/me.m06.d20:meMA.Ode7C11.ode	@ltx/en_us_dedes/miscellanea:misc.Ode7
ltx/en_us_dedes/me.m06.d20:meMA.Ode7C11.text	
ltx/en_us_dedes/me.m06.d20:meMA.Ode7C12.incipit	…
ltx/en_us_dedes/me.m06.d20:meMA.Ode7C12.melody	@ltx/en_us_dedes/he.h.m7:heHE.OiEnKaminoTouPyros.name
ltx/en_us_dedes/me.m06.d20:meMA.Ode7C12.mode	@ltx/en_us_dedes/miscellanea:misc.Mode7
ltx/en_us_dedes/me.m06.d20:meMA.Ode7C12.ode	@ltx/en_us_dedes/miscellanea:misc.Ode7
ltx/en_us_dedes/me.m06.d20:meMA.Ode7C12.text	
ltx/en_us_dedes/me.m06.d20:meMA.Ode7C13.incipit	…
ltx/en_us_dedes/me.m06.d20:meMA.Ode7C13.melody	@ltx/en_us_dedes/he.h.m7:heHE.OiEnKaminoTouPyros.name
ltx/en_us_dedes/me.m06.d20:meMA.Ode7C13.mode	@ltx/en_us_dedes/miscellanea:misc.Mode7
ltx/en_us_dedes/me.m06.d20:meMA.Ode7C13.ode	@ltx/en_us_dedes/miscellanea:misc.Ode7
ltx/en_us_dedes/me.m06.d20:meMA.Ode7C13.text	
ltx/en_us_dedes/me.m06.d20:meMA.Ode7C1T.incipit	…
ltx/en_us_dedes/me.m06.d20:meMA.Ode7C1T.melody	@ltx/en_us_dedes/he.h.m7:heHE.OiEnKaminoTouPyros.name
ltx/en_us_dedes/me.m06.d20:meMA.Ode7C1T.mode	@ltx/en_us_dedes/miscellanea:misc.Mode7
ltx/en_us_dedes/me.m06.d20:meMA.Ode7C1T.ode	@ltx/en_us_dedes/miscellanea:misc.Ode7
ltx/en_us_dedes/me.m06.d20:meMA.Ode7C1T.text	
ltx/en_us_dedes/me.m06.d20:meMA.Ode8C11.greekmelody	@ltx/en_us_dedes/he.h.m7:heHE.TonMononAnarchon.greekname
ltx/en_us_dedes/me.m06.d20:meMA.Ode8C11.incipit	…
ltx/en_us_dedes/me.m06.d20:meMA.Ode8C11.melody	@ltx/en_us_dedes/he.h.m7:heHE.TonMononAnarchon.name
ltx/en_us_dedes/me.m06.d20:meMA.Ode8C11.mode	@ltx/en_us_dedes/miscellanea:misc.Mode7
ltx/en_us_dedes/me.m06.d20:meMA.Ode8C11.ode	@ltx/en_us_dedes/miscellanea:misc.Ode8
ltx/en_us_dedes/me.m06.d20:meMA.Ode8C11.text	
ltx/en_us_dedes/me.m06.d20:meMA.Ode8C12.incipit	…
ltx/en_us_dedes/me.m06.d20:meMA.Ode8C12.melody	@ltx/en_us_dedes/he.h.m7:heHE.TonMononAnarchon.name
ltx/en_us_dedes/me.m06.d20:meMA.Ode8C12.mode	@ltx/en_us_dedes/miscellanea:misc.Mode7
ltx/en_us_dedes/me.m06.d20:meMA.Ode8C12.ode	@ltx/en_us_dedes/miscellanea:misc.Ode8
ltx/en_us_dedes/me.m06.d20:meMA.Ode8C12.text	
ltx/en_us_dedes/me.m06.d20:meMA.Ode8C13.incipit	…
ltx/en_us_dedes/me.m06.d20:meMA.Ode8C13.melody	@ltx/en_us_dedes/he.h.m7:heHE.TonMononAnarchon.name
ltx/en_us_dedes/me.m06.d20:meMA.Ode8C13.mode	@ltx/en_us_dedes/miscellanea:misc.Mode7
ltx/en_us_dedes/me.m06.d20:meMA.Ode8C13.ode	@ltx/en_us_dedes/miscellanea:misc.Ode8
ltx/en_us_dedes/me.m06.d20:meMA.Ode8C13.text	
ltx/en_us_dedes/me.m06.d20:meMA.Ode8C14.incipit	…
ltx/en_us_dedes/me.m06.d20:meMA.Ode8C14.melody	@ltx/en_us_dedes/he.h.m7:heHE.TonMononAnarchon.name
ltx/en_us_dedes/me.m06.d20:meMA.Ode8C14.mode	@ltx/en_us_dedes/miscellanea:misc.Mode7
ltx/en_us_dedes/me.m06.d20:meMA.Ode8C14.ode	@ltx/en_us_dedes/miscellanea:misc.Ode8
ltx/en_us_dedes/me.m06.d20:meMA.Ode8C14.text	
ltx/en_us_dedes/me.m06.d20:meMA.Ode8C1T.incipit	…
ltx/en_us_dedes/me.m06.d20:meMA.Ode8C1T.melody	@ltx/en_us_dedes/he.h.m7:heHE.TonMononAnarchon.name
ltx/en_us_dedes/me.m06.d20:meMA.Ode8C1T.mode	@ltx/en_us_dedes/miscellanea:misc.Mode7
ltx/en_us_dedes/me.m06.d20:meMA.Ode8C1T.ode	@ltx/en_us_dedes/miscellanea:misc.Ode8
ltx/en_us_dedes/me.m06.d20:meMA.Ode8C1T.text	
ltx/en_us_dedes/me.m06.d20:meMA.Ode8H.greekmelody	@ltx/en_us_dedes/he.h.m7:heHE.TonMononAnarchon.greekname
ltx/en_us_dedes/me.m06.d20:meMA.Ode8H.incipit	@ltx/en_us_dedes/he.h.m7:heHE.TonMononAnarchon.incipit
ltx/en_us_dedes/me.m06.d20:meMA.Ode8H.melody	@ltx/en_us_dedes/he.h.m7:heHE.TonMononAnarchon.melody
ltx/en_us_dedes/me.m06.d20:meMA.Ode8H.mode	@ltx/en_us_dedes/miscellanea:misc.Mode7
ltx/en_us_dedes/me.m06.d20:meMA.Ode8H.ode	@ltx/en_us_dedes/miscellanea:misc.Ode8
ltx/en_us_dedes/me.m06.d20:meMA.Ode8H.text	@ltx/en_us_dedes/he.h.m7:heHE.TonMononAnarchon.text
ltx/en_us_dedes/me.m06.d20:meMA.Ode9C11.greekmelody	@ltx/en_us_dedes/he.h.m7:heHE.MitirTheouKaiParthenos.greekname
ltx/en_us_dedes/me.m06.d20:meMA.Ode9C11.incipit	…
ltx/en_us_dedes/me.m06.d20:meMA.Ode9C11.melody	@ltx/en_us_dedes/he.h.m7:heHE.MitirTheouKaiParthenos.name
ltx/en_us_dedes/me.m06.d20:meMA.Ode9C11.mode	@ltx/en_us_dedes/miscellanea:misc.Mode7
ltx/en_us_dedes/me.m06.d20:meMA.Ode9C11.ode	@ltx/en_us_dedes/miscellanea:misc.Ode9
ltx/en_us_dedes/me.m06.d20:meMA.Ode9C11.text	
ltx/en_us_dedes/me.m06.d20:meMA.Ode9C12.incipit	…
ltx/en_us_dedes/me.m06.d20:meMA.Ode9C12.melody	@ltx/en_us_dedes/he.h.m7:heHE.MitirTheouKaiParthenos.name
ltx/en_us_dedes/me.m06.d20:meMA.Ode9C12.mode	@ltx/en_us_dedes/miscellanea:misc.Mode7
ltx/en_us_dedes/me.m06.d20:meMA.Ode9C12.ode	@ltx/en_us_dedes/miscellanea:misc.Ode9
ltx/en_us_dedes/me.m06.d20:meMA.Ode9C12.text	
ltx/en_us_dedes/me.m06.d20:meMA.Ode9C13.incipit	…
ltx/en_us_dedes/me.m06.d20:meMA.Ode9C13.melody	@ltx/en_us_dedes/he.h.m7:heHE.MitirTheouKaiParthenos.name
ltx/en_us_dedes/me.m06.d20:meMA.Ode9C13.mode	@ltx/en_us_dedes/miscellanea:misc.Mode7
ltx/en_us_dedes/me.m06.d20:meMA.Ode9C13.ode	@ltx/en_us_dedes/miscellanea:misc.Ode9
ltx/en_us_dedes/me.m06.d20:meMA.Ode9C13.text	
ltx/en_us_dedes/me.m06.d20:meMA.Ode9C14.incipit	…
ltx/en_us_dedes/me.m06.d20:meMA.Ode9C14.melody	@ltx/en_us_dedes/he.h.m7:heHE.MitirTheouKaiParthenos.name
ltx/en_us_dedes/me.m06.d20:meMA.Ode9C14.mode	@ltx/en_us_dedes/miscellanea:misc.Mode7
ltx/en_us_dedes/me.m06.d20:meMA.Ode9C14.ode	@ltx/en_us_dedes/miscellanea:misc.Ode9
ltx/en_us_dedes/me.m06.d20:meMA.Ode9C14.text	
ltx/en_us_dedes/me.m06.d20:meMA.Ode9C1T.incipit	…
ltx/en_us_dedes/me.m06.d20:meMA.Ode9C1T.melody	@ltx/en_us_dedes/he.h.m7:heHE.MitirTheouKaiParthenos.name
ltx/en_us_dedes/me.m06.d20:meMA.Ode9C1T.mode	@ltx/en_us_dedes/miscellanea:misc.Mode7
ltx/en_us_dedes/me.m06.d20:meMA.Ode9C1T.ode	@ltx/en_us_dedes/miscellanea:misc.Ode9
ltx/en_us_dedes/me.m06.d20:meMA.Ode9C1T.text	
ltx/en_us_dedes/me.m06.d20:meMA.Ode9H.greekmelody	@ltx/en_us_dedes/he.h.m7:heHE.MitirTheouKaiParthenos.greekname
ltx/en_us_dedes/me.m06.d20:meMA.Ode9H.incipit	@ltx/en_us_dedes/he.h.m7:heHE.MitirTheouKaiParthenos.incipit
ltx/en_us_dedes/me.m06.d20:meMA.Ode9H.melody	@ltx/en_us_dedes/he.h.m7:heHE.MitirTheouKaiParthenos.melody
ltx/en_us_dedes/me.m06.d20:meMA.Ode9H.mode	@ltx/en_us_dedes/miscellanea:misc.Mode7
ltx/en_us_dedes/me.m06.d20:meMA.Ode9H.ode	@ltx/en_us_dedes/miscellanea:misc.Ode9
ltx/en_us_dedes/me.m06.d20:meMA.Ode9H.text	@ltx/en_us_dedes/he.h.m7:heHE.MitirTheouKaiParthenos.text
ltx/en_us_dedes/me.m06.d20:meVE.Apolytikion1ger.greekmelody	@ltx/en_us_dedes/he.a.m3:heAU.TheiasPisteos.greekname
ltx/en_us_dedes/me.m06.d20:meVE.Apolytikion1ger.incipit	O Methodius, your divine method…
ltx/en_us_dedes/me.m06.d20:meVE.Apolytikion1ger.melody	@ltx/en_us_dedes/he.a.m3:heAU.TheiasPisteos.name
ltx/en_us_dedes/me.m06.d20:meVE.Apolytikion1ger.mode	@ltx/en_us_dedes/miscellanea:misc.Mode3
ltx/en_us_dedes/me.m06.d20:meVE.Apolytikion1ger.poet	@ltx/en_us_dedes/poets:po.Gerasimou
ltx/en_us_dedes/me.m06.d20:meVE.Apolytikion1ger.text	O Methodius, your divine method * as a hierarch and martyr added * to the treasures and the wealth of the Church of Christ. * You took possession of wisdom as capital * and you increased it by means of your martyrdom. * Holy Father, pray earnestly to Christ our God, * entreating Him to grant us His great mercy.
ltx/en_us_dedes/me.m06.d20:meVE.SticStavrotheotokion.greekmelody	@ltx/en_us_dedes/he.a.m4:heAU.EdokasSimeiosin.greekname
ltx/en_us_dedes/me.m06.d20:meVE.SticStavrotheotokion.incipit	When the all-pure Lady witnessed…
ltx/en_us_dedes/me.m06.d20:meVE.SticStavrotheotokion.melody	@ltx/en_us_dedes/he.a.m4:heAU.EdokasSimeiosin.name
ltx/en_us_dedes/me.m06.d20:meVE.SticStavrotheotokion.mode	@ltx/en_us_dedes/miscellanea:misc.Mode8
ltx/en_us_dedes/me.m06.d20:meVE.SticStavrotheotokion.text	When the all-pure Lady witnessed our benevolent Savior Christ * being crucified, and His side * was pierced with a spear, she wept. * Tearfully she cried out, * “How have these ungrateful people rewarded You, my Son, * for all the good things that You have done for them? * What is this, my beloved? Why the rush to render me childless? * I am stunned by Your willingness * to be crucified, glorious Lord.”
ltx/en_us_dedes/me.m06.d20:meVE.SticTheotokion.greekmelody	@ltx/en_us_dedes/he.a.m4:heAU.EdokasSimeiosin.greekname
ltx/en_us_dedes/me.m06.d20:meVE.SticTheotokion.incipit	Lady, I implore you now…
ltx/en_us_dedes/me.m06.d20:meVE.SticTheotokion.melody	@ltx/en_us_dedes/he.a.m4:heAU.EdokasSimeiosin.name
ltx/en_us_dedes/me.m06.d20:meVE.SticTheotokion.mode	@ltx/en_us_dedes/miscellanea:misc.Mode8
ltx/en_us_dedes/me.m06.d20:meVE.SticTheotokion.text	Lady, I implore you now, the cleanest Palace of God the King, * holy Virgin extolled by all. * Purify my intellect, soiled by my shameful * thoughts and sinful actions. Make it a dwelling that is bright * and a delight for the Holy Trinity. * And I your worthless servant, being by you rescued, shall magnify * and extol your commanding might and immeasurable tender love.
ltx/en_us_dedes/me.m06.d20:meVE.Stichera01.greekmelody	@ltx/en_us_dedes/he.a.m4:heAU.EdokasSimeiosin.greekname
ltx/en_us_dedes/me.m06.d20:meVE.Stichera01.incipit	…
ltx/en_us_dedes/me.m06.d20:meVE.Stichera01.melody	@ltx/en_us_dedes/he.a.m4:heAU.EdokasSimeiosin.name
ltx/en_us_dedes/me.m06.d20:meVE.Stichera01.mode	@ltx/en_us_dedes/miscellanea:misc.Mode8
ltx/en_us_dedes/me.m06.d20:meVE.Stichera01.text	
ltx/en_us_dedes/me.m06.d20:meVE.Stichera02.incipit	…
ltx/en_us_dedes/me.m06.d20:meVE.Stichera02.melody	@ltx/en_us_dedes/he.a.m4:heAU.EdokasSimeiosin.name
ltx/en_us_dedes/me.m06.d20:meVE.Stichera02.mode	@ltx/en_us_dedes/miscellanea:misc.Mode8
ltx/en_us_dedes/me.m06.d20:meVE.Stichera02.text	
ltx/en_us_dedes/me.m06.d20:meVE.Stichera03.incipit	…
ltx/en_us_dedes/me.m06.d20:meVE.Stichera03.melody	@ltx/en_us_dedes/he.a.m4:heAU.EdokasSimeiosin.name
ltx/en_us_dedes/me.m06.d20:meVE.Stichera03.mode	@ltx/en_us_dedes/miscellanea:misc.Mode8
ltx/en_us_dedes/me.m06.d20:meVE.Stichera03.text	
