ltx/en_us_dedes/me.m08.d13:meDA.commemoration.first	Leave-taking of the Feast of the Transfiguration
ltx/en_us_dedes/me.m08.d13:meDA.commemoration.first_name	
ltx/en_us_dedes/me.m08.d13:meDA.commemoration.first_short	Leave-taking of the Feast of the Transfiguration
ltx/en_us_dedes/me.m08.d13:meDA.commemoration.first_title	@ltx/en_us_dedes/titles:ti.Feast
ltx/en_us_dedes/me.m08.d13:meDA.commemoration.full	Memory of our Devout Father Maximus the Confessor
ltx/en_us_dedes/me.m08.d13:meDA.commemoration.second_name	
ltx/en_us_dedes/me.m08.d13:meDA.commemoration.second_title	
ltx/en_us_dedes/me.m08.d13:meDA.date	August 13
ltx/en_us_dedes/me.m08.d13:meDA.dismissal	@ltx/en_us_dedes/dismissals:dis00.transfiguration
ltx/en_us_dedes/me.m08.d13:meDA.fordate	for August 13
ltx/en_us_dedes/me.m08.d13:meDA.insert1	
ltx/en_us_dedes/me.m08.d13:meDA.insert2	
ltx/en_us_dedes/me.m08.d13:meDA.note	
ltx/en_us_dedes/me.m08.d13:meDA.pdfcoverdate	August 13,
ltx/en_us_dedes/me.m08.d13:meDA.pdfheaderdate	August 13
ltx/en_us_dedes/me.m08.d13:meHO.commemorations	
ltx/en_us_dedes/me.m08.d13:meHO.note1	
ltx/en_us_dedes/me.m08.d13:meHO.note2	
ltx/en_us_dedes/me.m08.d13:meHO.number	
ltx/en_us_dedes/me.m08.d13:meHO.rank	
ltx/en_us_dedes/me.m08.d13:meLE.commemoration1	Our Venerable Father Maximos the Confessor.
ltx/en_us_dedes/me.m08.d13:meLE.commemoration2	
ltx/en_us_dedes/me.m08.d13:meLI.Kontakion1.incipit	…
ltx/en_us_dedes/me.m08.d13:meLI.Kontakion1.melody	
ltx/en_us_dedes/me.m08.d13:meLI.Kontakion1.mode	
ltx/en_us_dedes/me.m08.d13:meLI.Kontakion1.text	
ltx/en_us_dedes/me.m08.d13:meLI.TheotokosHymn.incipit	@ltx/en_us_dedes/he.h.m4:heHE.OTokosSouAfthoros.incipit
ltx/en_us_dedes/me.m08.d13:meLI.TheotokosHymn.mode	@ltx/en_us_dedes/miscellanea:misc.Mode4
ltx/en_us_dedes/me.m08.d13:meLI.TheotokosHymn.text	@ltx/en_us_dedes/he.h.m4:heHE.OTokosSouAfthoros.text
