ltx/en_us_dedes/me.m07.d23:meDA.commemoration.first	Memory of the Holy Hieromartyr Phocas
ltx/en_us_dedes/me.m07.d23:meDA.commemoration.first_name	
ltx/en_us_dedes/me.m07.d23:meDA.commemoration.first_short	Memory of the Holy Hieromartyr Phocas
ltx/en_us_dedes/me.m07.d23:meDA.commemoration.first_title	@ltx/en_us_dedes/titles:ti.SaintM
ltx/en_us_dedes/me.m07.d23:meDA.commemoration.full	Memory of the Holy Hieromartyr Phocas, the Prophet Ezekiel, and our Devout Mother Pelagia of Tinos
ltx/en_us_dedes/me.m07.d23:meDA.commemoration.second_name	
ltx/en_us_dedes/me.m07.d23:meDA.commemoration.second_title	
ltx/en_us_dedes/me.m07.d23:meDA.date	July 23
ltx/en_us_dedes/me.m07.d23:meDA.fordate	for July 23
ltx/en_us_dedes/me.m07.d23:meDA.insert1	of the holy hieromartyr Phocas,
ltx/en_us_dedes/me.m07.d23:meDA.insert2	whose memory we observe,
ltx/en_us_dedes/me.m07.d23:meDA.note	
ltx/en_us_dedes/me.m07.d23:meDA.pdfcoverdate	July 23,
ltx/en_us_dedes/me.m07.d23:meDA.pdfheaderdate	July 23
ltx/en_us_dedes/me.m07.d23:meHO.commemorations	
ltx/en_us_dedes/me.m07.d23:meHO.note1	
ltx/en_us_dedes/me.m07.d23:meHO.note2	
ltx/en_us_dedes/me.m07.d23:meHO.number	
ltx/en_us_dedes/me.m07.d23:meHO.rank	
ltx/en_us_dedes/me.m07.d23:meLE.commemoration1	
ltx/en_us_dedes/me.m07.d23:meLE.commemoration2	
ltx/en_us_dedes/me.m07.d23:meLI.Kontakion1.incipit	…
ltx/en_us_dedes/me.m07.d23:meLI.Kontakion1.melody	
ltx/en_us_dedes/me.m07.d23:meLI.Kontakion1.mode	
ltx/en_us_dedes/me.m07.d23:meLI.Kontakion1.text	
ltx/en_us_dedes/me.m07.d23:meLI.Megalynarion.text	
ltx/en_us_dedes/me.m07.d23:meLI.Megalynarion2.text	
ltx/en_us_dedes/me.m07.d23:meMA.C1.acrostic.notice1	
ltx/en_us_dedes/me.m07.d23:meMA.C1.acrostic.text	
ltx/en_us_dedes/me.m07.d23:meMA.C1.acrostic.title	
ltx/en_us_dedes/me.m07.d23:meMA.C1.title	@ltx/en_us_dedes/titles:ti.CanonSaintM
ltx/en_us_dedes/me.m07.d23:meMA.C1.verse	@ltx/en_us_dedes/prayers:pr.verse_SaintM.text
ltx/en_us_dedes/me.m07.d23:meMA.Ode1C11.greekmelody	@ltx/en_us_dedes/he.h.m4:heHE.ThalassisToErythraion.greekname
ltx/en_us_dedes/me.m07.d23:meMA.Ode1C11.incipit	…
ltx/en_us_dedes/me.m07.d23:meMA.Ode1C11.melody	@ltx/en_us_dedes/he.h.m4:heHE.ThalassisToErythraion.name
ltx/en_us_dedes/me.m07.d23:meMA.Ode1C11.mode	@ltx/en_us_dedes/miscellanea:misc.Mode4
ltx/en_us_dedes/me.m07.d23:meMA.Ode1C11.ode	@ltx/en_us_dedes/miscellanea:misc.Ode1
ltx/en_us_dedes/me.m07.d23:meMA.Ode1C11.text	
ltx/en_us_dedes/me.m07.d23:meMA.Ode1C12.incipit	…
ltx/en_us_dedes/me.m07.d23:meMA.Ode1C12.melody	@ltx/en_us_dedes/he.h.m4:heHE.ThalassisToErythraion.name
ltx/en_us_dedes/me.m07.d23:meMA.Ode1C12.mode	@ltx/en_us_dedes/miscellanea:misc.Mode4
ltx/en_us_dedes/me.m07.d23:meMA.Ode1C12.ode	@ltx/en_us_dedes/miscellanea:misc.Ode1
ltx/en_us_dedes/me.m07.d23:meMA.Ode1C12.text	
ltx/en_us_dedes/me.m07.d23:meMA.Ode1C13.incipit	…
ltx/en_us_dedes/me.m07.d23:meMA.Ode1C13.melody	@ltx/en_us_dedes/he.h.m4:heHE.ThalassisToErythraion.name
ltx/en_us_dedes/me.m07.d23:meMA.Ode1C13.mode	@ltx/en_us_dedes/miscellanea:misc.Mode4
ltx/en_us_dedes/me.m07.d23:meMA.Ode1C13.ode	@ltx/en_us_dedes/miscellanea:misc.Ode1
ltx/en_us_dedes/me.m07.d23:meMA.Ode1C13.text	
ltx/en_us_dedes/me.m07.d23:meMA.Ode1C14.incipit	…
ltx/en_us_dedes/me.m07.d23:meMA.Ode1C14.melody	@ltx/en_us_dedes/he.h.m4:heHE.ThalassisToErythraion.name
ltx/en_us_dedes/me.m07.d23:meMA.Ode1C14.mode	@ltx/en_us_dedes/miscellanea:misc.Mode4
ltx/en_us_dedes/me.m07.d23:meMA.Ode1C14.ode	@ltx/en_us_dedes/miscellanea:misc.Ode1
ltx/en_us_dedes/me.m07.d23:meMA.Ode1C14.text	
ltx/en_us_dedes/me.m07.d23:meMA.Ode1C1T.incipit	…
ltx/en_us_dedes/me.m07.d23:meMA.Ode1C1T.melody	@ltx/en_us_dedes/he.h.m4:heHE.ThalassisToErythraion.name
ltx/en_us_dedes/me.m07.d23:meMA.Ode1C1T.mode	@ltx/en_us_dedes/miscellanea:misc.Mode4
ltx/en_us_dedes/me.m07.d23:meMA.Ode1C1T.ode	@ltx/en_us_dedes/miscellanea:misc.Ode1
ltx/en_us_dedes/me.m07.d23:meMA.Ode1C1T.text	
ltx/en_us_dedes/me.m07.d23:meMA.Ode3C11.greekmelody	@ltx/en_us_dedes/he.h.m4:heHE.EffrainetaiEpiSoi.greekname
ltx/en_us_dedes/me.m07.d23:meMA.Ode3C11.incipit	…
ltx/en_us_dedes/me.m07.d23:meMA.Ode3C11.melody	@ltx/en_us_dedes/he.h.m4:heHE.EffrainetaiEpiSoi.name
ltx/en_us_dedes/me.m07.d23:meMA.Ode3C11.mode	@ltx/en_us_dedes/miscellanea:misc.Mode4
ltx/en_us_dedes/me.m07.d23:meMA.Ode3C11.ode	@ltx/en_us_dedes/miscellanea:misc.Ode3
ltx/en_us_dedes/me.m07.d23:meMA.Ode3C11.text	
ltx/en_us_dedes/me.m07.d23:meMA.Ode3C12.incipit	…
ltx/en_us_dedes/me.m07.d23:meMA.Ode3C12.melody	@ltx/en_us_dedes/he.h.m4:heHE.EffrainetaiEpiSoi.name
ltx/en_us_dedes/me.m07.d23:meMA.Ode3C12.mode	@ltx/en_us_dedes/miscellanea:misc.Mode4
ltx/en_us_dedes/me.m07.d23:meMA.Ode3C12.ode	@ltx/en_us_dedes/miscellanea:misc.Ode3
ltx/en_us_dedes/me.m07.d23:meMA.Ode3C12.text	
ltx/en_us_dedes/me.m07.d23:meMA.Ode3C13.incipit	…
ltx/en_us_dedes/me.m07.d23:meMA.Ode3C13.melody	@ltx/en_us_dedes/he.h.m4:heHE.EffrainetaiEpiSoi.name
ltx/en_us_dedes/me.m07.d23:meMA.Ode3C13.mode	@ltx/en_us_dedes/miscellanea:misc.Mode4
ltx/en_us_dedes/me.m07.d23:meMA.Ode3C13.ode	@ltx/en_us_dedes/miscellanea:misc.Ode3
ltx/en_us_dedes/me.m07.d23:meMA.Ode3C13.text	
ltx/en_us_dedes/me.m07.d23:meMA.Ode3C14.incipit	…
ltx/en_us_dedes/me.m07.d23:meMA.Ode3C14.melody	@ltx/en_us_dedes/he.h.m4:heHE.EffrainetaiEpiSoi.name
ltx/en_us_dedes/me.m07.d23:meMA.Ode3C14.mode	@ltx/en_us_dedes/miscellanea:misc.Mode4
ltx/en_us_dedes/me.m07.d23:meMA.Ode3C14.ode	@ltx/en_us_dedes/miscellanea:misc.Ode3
ltx/en_us_dedes/me.m07.d23:meMA.Ode3C14.text	
ltx/en_us_dedes/me.m07.d23:meMA.Ode3C1T.incipit	…
ltx/en_us_dedes/me.m07.d23:meMA.Ode3C1T.melody	@ltx/en_us_dedes/he.h.m4:heHE.EffrainetaiEpiSoi.name
ltx/en_us_dedes/me.m07.d23:meMA.Ode3C1T.mode	@ltx/en_us_dedes/miscellanea:misc.Mode4
ltx/en_us_dedes/me.m07.d23:meMA.Ode3C1T.ode	@ltx/en_us_dedes/miscellanea:misc.Ode3
ltx/en_us_dedes/me.m07.d23:meMA.Ode3C1T.text	
ltx/en_us_dedes/me.m07.d23:meMA.Ode3H.greekmelody	@ltx/en_us_dedes/he.h.m4:heHE.EffrainetaiEpiSoi.greekname
ltx/en_us_dedes/me.m07.d23:meMA.Ode3H.incipit	@ltx/en_us_dedes/he.h.m4:heHE.EffrainetaiEpiSoi.incipit
ltx/en_us_dedes/me.m07.d23:meMA.Ode3H.melody	@ltx/en_us_dedes/he.h.m4:heHE.EffrainetaiEpiSoi.melody
ltx/en_us_dedes/me.m07.d23:meMA.Ode3H.mode	@ltx/en_us_dedes/miscellanea:misc.Mode4
ltx/en_us_dedes/me.m07.d23:meMA.Ode3H.ode	@ltx/en_us_dedes/miscellanea:misc.Ode3
ltx/en_us_dedes/me.m07.d23:meMA.Ode3H.text	@ltx/en_us_dedes/he.h.m4:heHE.EffrainetaiEpiSoi.text
ltx/en_us_dedes/me.m07.d23:meMA.Ode3Kathisma1.greekmelody	@ltx/en_us_dedes/he.a.m4:heAU.TachyProkatalave.greekname
ltx/en_us_dedes/me.m07.d23:meMA.Ode3Kathisma1.incipit	…
ltx/en_us_dedes/me.m07.d23:meMA.Ode3Kathisma1.melody	@ltx/en_us_dedes/he.a.m4:heAU.TachyProkatalave.name
ltx/en_us_dedes/me.m07.d23:meMA.Ode3Kathisma1.mode	@ltx/en_us_dedes/miscellanea:misc.Mode4
ltx/en_us_dedes/me.m07.d23:meMA.Ode3Kathisma1.text	
ltx/en_us_dedes/me.m07.d23:meMA.Ode3KathismaSt.incipit	…
ltx/en_us_dedes/me.m07.d23:meMA.Ode3KathismaSt.melody	@ltx/en_us_dedes/he.a.m4:heAU.TachyProkatalave.name
ltx/en_us_dedes/me.m07.d23:meMA.Ode3KathismaSt.mode	@ltx/en_us_dedes/miscellanea:misc.Mode4
ltx/en_us_dedes/me.m07.d23:meMA.Ode3KathismaSt.text	
ltx/en_us_dedes/me.m07.d23:meMA.Ode3KathismaT.incipit	@ltx/en_us_dedes/oc.m4.d3:ocMA.Kathisma33.incipit
ltx/en_us_dedes/me.m07.d23:meMA.Ode3KathismaT.melody	@ltx/en_us_dedes/he.a.m4:heAU.TachyProkatalave.name
ltx/en_us_dedes/me.m07.d23:meMA.Ode3KathismaT.mode	@ltx/en_us_dedes/miscellanea:misc.Mode4
ltx/en_us_dedes/me.m07.d23:meMA.Ode3KathismaT.text	@ltx/en_us_dedes/oc.m4.d3:ocMA.Kathisma33.text
ltx/en_us_dedes/me.m07.d23:meMA.Ode4C11.greekmelody	@ltx/en_us_dedes/he.h.m4:heHE.EparthentaSeIdousa.greekname
ltx/en_us_dedes/me.m07.d23:meMA.Ode4C11.incipit	…
ltx/en_us_dedes/me.m07.d23:meMA.Ode4C11.melody	@ltx/en_us_dedes/he.h.m4:heHE.EparthentaSeIdousa.name
ltx/en_us_dedes/me.m07.d23:meMA.Ode4C11.mode	@ltx/en_us_dedes/miscellanea:misc.Mode4
ltx/en_us_dedes/me.m07.d23:meMA.Ode4C11.ode	@ltx/en_us_dedes/miscellanea:misc.Ode4
ltx/en_us_dedes/me.m07.d23:meMA.Ode4C11.text	
ltx/en_us_dedes/me.m07.d23:meMA.Ode4C12.incipit	…
ltx/en_us_dedes/me.m07.d23:meMA.Ode4C12.melody	@ltx/en_us_dedes/he.h.m4:heHE.EparthentaSeIdousa.name
ltx/en_us_dedes/me.m07.d23:meMA.Ode4C12.mode	@ltx/en_us_dedes/miscellanea:misc.Mode4
ltx/en_us_dedes/me.m07.d23:meMA.Ode4C12.ode	@ltx/en_us_dedes/miscellanea:misc.Ode4
ltx/en_us_dedes/me.m07.d23:meMA.Ode4C12.text	
ltx/en_us_dedes/me.m07.d23:meMA.Ode4C13.incipit	…
ltx/en_us_dedes/me.m07.d23:meMA.Ode4C13.melody	@ltx/en_us_dedes/he.h.m4:heHE.EparthentaSeIdousa.name
ltx/en_us_dedes/me.m07.d23:meMA.Ode4C13.mode	@ltx/en_us_dedes/miscellanea:misc.Mode4
ltx/en_us_dedes/me.m07.d23:meMA.Ode4C13.ode	@ltx/en_us_dedes/miscellanea:misc.Ode4
ltx/en_us_dedes/me.m07.d23:meMA.Ode4C13.text	
ltx/en_us_dedes/me.m07.d23:meMA.Ode4C1T.incipit	…
ltx/en_us_dedes/me.m07.d23:meMA.Ode4C1T.melody	@ltx/en_us_dedes/he.h.m4:heHE.EparthentaSeIdousa.name
ltx/en_us_dedes/me.m07.d23:meMA.Ode4C1T.mode	@ltx/en_us_dedes/miscellanea:misc.Mode4
ltx/en_us_dedes/me.m07.d23:meMA.Ode4C1T.ode	@ltx/en_us_dedes/miscellanea:misc.Ode4
ltx/en_us_dedes/me.m07.d23:meMA.Ode4C1T.text	
ltx/en_us_dedes/me.m07.d23:meMA.Ode5C11.greekmelody	@ltx/en_us_dedes/he.h.m4:heHE.SyKyrieMouFos.greekname
ltx/en_us_dedes/me.m07.d23:meMA.Ode5C11.incipit	…
ltx/en_us_dedes/me.m07.d23:meMA.Ode5C11.melody	@ltx/en_us_dedes/he.h.m4:heHE.SyKyrieMouFos.name
ltx/en_us_dedes/me.m07.d23:meMA.Ode5C11.mode	@ltx/en_us_dedes/miscellanea:misc.Mode4
ltx/en_us_dedes/me.m07.d23:meMA.Ode5C11.ode	@ltx/en_us_dedes/miscellanea:misc.Ode5
ltx/en_us_dedes/me.m07.d23:meMA.Ode5C11.text	
ltx/en_us_dedes/me.m07.d23:meMA.Ode5C12.incipit	…
ltx/en_us_dedes/me.m07.d23:meMA.Ode5C12.melody	@ltx/en_us_dedes/he.h.m4:heHE.SyKyrieMouFos.name
ltx/en_us_dedes/me.m07.d23:meMA.Ode5C12.mode	@ltx/en_us_dedes/miscellanea:misc.Mode4
ltx/en_us_dedes/me.m07.d23:meMA.Ode5C12.ode	@ltx/en_us_dedes/miscellanea:misc.Ode5
ltx/en_us_dedes/me.m07.d23:meMA.Ode5C12.text	
ltx/en_us_dedes/me.m07.d23:meMA.Ode5C13.incipit	…
ltx/en_us_dedes/me.m07.d23:meMA.Ode5C13.melody	@ltx/en_us_dedes/he.h.m4:heHE.SyKyrieMouFos.name
ltx/en_us_dedes/me.m07.d23:meMA.Ode5C13.mode	@ltx/en_us_dedes/miscellanea:misc.Mode4
ltx/en_us_dedes/me.m07.d23:meMA.Ode5C13.ode	@ltx/en_us_dedes/miscellanea:misc.Ode5
ltx/en_us_dedes/me.m07.d23:meMA.Ode5C13.text	
ltx/en_us_dedes/me.m07.d23:meMA.Ode5C1T.incipit	…
ltx/en_us_dedes/me.m07.d23:meMA.Ode5C1T.melody	@ltx/en_us_dedes/he.h.m4:heHE.SyKyrieMouFos.name
ltx/en_us_dedes/me.m07.d23:meMA.Ode5C1T.mode	@ltx/en_us_dedes/miscellanea:misc.Mode4
ltx/en_us_dedes/me.m07.d23:meMA.Ode5C1T.ode	@ltx/en_us_dedes/miscellanea:misc.Ode5
ltx/en_us_dedes/me.m07.d23:meMA.Ode5C1T.text	
ltx/en_us_dedes/me.m07.d23:meMA.Ode6C11.greekmelody	@ltx/en_us_dedes/he.h.m4:heHE.ThysoSoiMetaFonis.greekname
ltx/en_us_dedes/me.m07.d23:meMA.Ode6C11.incipit	…
ltx/en_us_dedes/me.m07.d23:meMA.Ode6C11.melody	@ltx/en_us_dedes/he.h.m4:heHE.ThysoSoiMetaFonis.name
ltx/en_us_dedes/me.m07.d23:meMA.Ode6C11.mode	@ltx/en_us_dedes/miscellanea:misc.Mode4
ltx/en_us_dedes/me.m07.d23:meMA.Ode6C11.ode	@ltx/en_us_dedes/miscellanea:misc.Ode6
ltx/en_us_dedes/me.m07.d23:meMA.Ode6C11.text	
ltx/en_us_dedes/me.m07.d23:meMA.Ode6C12.incipit	…
ltx/en_us_dedes/me.m07.d23:meMA.Ode6C12.melody	@ltx/en_us_dedes/he.h.m4:heHE.ThysoSoiMetaFonis.name
ltx/en_us_dedes/me.m07.d23:meMA.Ode6C12.mode	@ltx/en_us_dedes/miscellanea:misc.Mode4
ltx/en_us_dedes/me.m07.d23:meMA.Ode6C12.ode	@ltx/en_us_dedes/miscellanea:misc.Ode6
ltx/en_us_dedes/me.m07.d23:meMA.Ode6C12.text	
ltx/en_us_dedes/me.m07.d23:meMA.Ode6C13.incipit	…
ltx/en_us_dedes/me.m07.d23:meMA.Ode6C13.melody	@ltx/en_us_dedes/he.h.m4:heHE.ThysoSoiMetaFonis.name
ltx/en_us_dedes/me.m07.d23:meMA.Ode6C13.mode	@ltx/en_us_dedes/miscellanea:misc.Mode4
ltx/en_us_dedes/me.m07.d23:meMA.Ode6C13.ode	@ltx/en_us_dedes/miscellanea:misc.Ode6
ltx/en_us_dedes/me.m07.d23:meMA.Ode6C13.text	
ltx/en_us_dedes/me.m07.d23:meMA.Ode6C1T.incipit	…
ltx/en_us_dedes/me.m07.d23:meMA.Ode6C1T.melody	@ltx/en_us_dedes/he.h.m4:heHE.ThysoSoiMetaFonis.name
ltx/en_us_dedes/me.m07.d23:meMA.Ode6C1T.mode	@ltx/en_us_dedes/miscellanea:misc.Mode4
ltx/en_us_dedes/me.m07.d23:meMA.Ode6C1T.ode	@ltx/en_us_dedes/miscellanea:misc.Ode6
ltx/en_us_dedes/me.m07.d23:meMA.Ode6C1T.text	
ltx/en_us_dedes/me.m07.d23:meMA.Ode6H.greekmelody	@ltx/en_us_dedes/he.h.m4:heHE.ThysoSoiMetaFonis.greekname
ltx/en_us_dedes/me.m07.d23:meMA.Ode6H.incipit	@ltx/en_us_dedes/he.h.m4:heHE.ThysoSoiMetaFonis.incipit
ltx/en_us_dedes/me.m07.d23:meMA.Ode6H.melody	@ltx/en_us_dedes/he.h.m4:heHE.ThysoSoiMetaFonis.melody
ltx/en_us_dedes/me.m07.d23:meMA.Ode6H.mode	@ltx/en_us_dedes/miscellanea:misc.Mode4
ltx/en_us_dedes/me.m07.d23:meMA.Ode6H.ode	@ltx/en_us_dedes/miscellanea:misc.Ode6
ltx/en_us_dedes/me.m07.d23:meMA.Ode6H.text	@ltx/en_us_dedes/he.h.m4:heHE.ThysoSoiMetaFonis.text
ltx/en_us_dedes/me.m07.d23:meMA.Ode7C11.greekmelody	@ltx/en_us_dedes/he.h.m4:heHE.EnTiKaminoAvramiaioi.greekname
ltx/en_us_dedes/me.m07.d23:meMA.Ode7C11.incipit	…
ltx/en_us_dedes/me.m07.d23:meMA.Ode7C11.melody	@ltx/en_us_dedes/he.h.m4:heHE.EnTiKaminoAvramiaioi.name
ltx/en_us_dedes/me.m07.d23:meMA.Ode7C11.mode	@ltx/en_us_dedes/miscellanea:misc.Mode4
ltx/en_us_dedes/me.m07.d23:meMA.Ode7C11.ode	@ltx/en_us_dedes/miscellanea:misc.Ode7
ltx/en_us_dedes/me.m07.d23:meMA.Ode7C11.text	
ltx/en_us_dedes/me.m07.d23:meMA.Ode7C12.incipit	…
ltx/en_us_dedes/me.m07.d23:meMA.Ode7C12.melody	@ltx/en_us_dedes/he.h.m4:heHE.EnTiKaminoAvramiaioi.name
ltx/en_us_dedes/me.m07.d23:meMA.Ode7C12.mode	@ltx/en_us_dedes/miscellanea:misc.Mode4
ltx/en_us_dedes/me.m07.d23:meMA.Ode7C12.ode	@ltx/en_us_dedes/miscellanea:misc.Ode7
ltx/en_us_dedes/me.m07.d23:meMA.Ode7C12.text	
ltx/en_us_dedes/me.m07.d23:meMA.Ode7C13.incipit	…
ltx/en_us_dedes/me.m07.d23:meMA.Ode7C13.melody	@ltx/en_us_dedes/he.h.m4:heHE.EnTiKaminoAvramiaioi.name
ltx/en_us_dedes/me.m07.d23:meMA.Ode7C13.mode	@ltx/en_us_dedes/miscellanea:misc.Mode4
ltx/en_us_dedes/me.m07.d23:meMA.Ode7C13.ode	@ltx/en_us_dedes/miscellanea:misc.Ode7
ltx/en_us_dedes/me.m07.d23:meMA.Ode7C13.text	
ltx/en_us_dedes/me.m07.d23:meMA.Ode7C1T.incipit	…
ltx/en_us_dedes/me.m07.d23:meMA.Ode7C1T.melody	@ltx/en_us_dedes/he.h.m4:heHE.EnTiKaminoAvramiaioi.name
ltx/en_us_dedes/me.m07.d23:meMA.Ode7C1T.mode	@ltx/en_us_dedes/miscellanea:misc.Mode4
ltx/en_us_dedes/me.m07.d23:meMA.Ode7C1T.ode	@ltx/en_us_dedes/miscellanea:misc.Ode7
ltx/en_us_dedes/me.m07.d23:meMA.Ode7C1T.text	
ltx/en_us_dedes/me.m07.d23:meMA.Ode8C11.greekmelody	@ltx/en_us_dedes/he.h.m4:heHE.CheirasEkpetasasDaniil.greekname
ltx/en_us_dedes/me.m07.d23:meMA.Ode8C11.incipit	…
ltx/en_us_dedes/me.m07.d23:meMA.Ode8C11.melody	@ltx/en_us_dedes/he.h.m4:heHE.CheirasEkpetasasDaniil.name
ltx/en_us_dedes/me.m07.d23:meMA.Ode8C11.mode	@ltx/en_us_dedes/miscellanea:misc.Mode4
ltx/en_us_dedes/me.m07.d23:meMA.Ode8C11.ode	@ltx/en_us_dedes/miscellanea:misc.Ode8
ltx/en_us_dedes/me.m07.d23:meMA.Ode8C11.text	
ltx/en_us_dedes/me.m07.d23:meMA.Ode8C12.incipit	…
ltx/en_us_dedes/me.m07.d23:meMA.Ode8C12.melody	@ltx/en_us_dedes/he.h.m4:heHE.CheirasEkpetasasDaniil.name
ltx/en_us_dedes/me.m07.d23:meMA.Ode8C12.mode	@ltx/en_us_dedes/miscellanea:misc.Mode4
ltx/en_us_dedes/me.m07.d23:meMA.Ode8C12.ode	@ltx/en_us_dedes/miscellanea:misc.Ode8
ltx/en_us_dedes/me.m07.d23:meMA.Ode8C12.text	
ltx/en_us_dedes/me.m07.d23:meMA.Ode8C13.incipit	…
ltx/en_us_dedes/me.m07.d23:meMA.Ode8C13.melody	@ltx/en_us_dedes/he.h.m4:heHE.CheirasEkpetasasDaniil.name
ltx/en_us_dedes/me.m07.d23:meMA.Ode8C13.mode	@ltx/en_us_dedes/miscellanea:misc.Mode4
ltx/en_us_dedes/me.m07.d23:meMA.Ode8C13.ode	@ltx/en_us_dedes/miscellanea:misc.Ode8
ltx/en_us_dedes/me.m07.d23:meMA.Ode8C13.text	
ltx/en_us_dedes/me.m07.d23:meMA.Ode8C14.incipit	…
ltx/en_us_dedes/me.m07.d23:meMA.Ode8C14.melody	@ltx/en_us_dedes/he.h.m4:heHE.CheirasEkpetasasDaniil.name
ltx/en_us_dedes/me.m07.d23:meMA.Ode8C14.mode	@ltx/en_us_dedes/miscellanea:misc.Mode4
ltx/en_us_dedes/me.m07.d23:meMA.Ode8C14.ode	@ltx/en_us_dedes/miscellanea:misc.Ode8
ltx/en_us_dedes/me.m07.d23:meMA.Ode8C14.text	
ltx/en_us_dedes/me.m07.d23:meMA.Ode8C1T.incipit	…
ltx/en_us_dedes/me.m07.d23:meMA.Ode8C1T.melody	@ltx/en_us_dedes/he.h.m4:heHE.CheirasEkpetasasDaniil.name
ltx/en_us_dedes/me.m07.d23:meMA.Ode8C1T.mode	@ltx/en_us_dedes/miscellanea:misc.Mode4
ltx/en_us_dedes/me.m07.d23:meMA.Ode8C1T.ode	@ltx/en_us_dedes/miscellanea:misc.Ode8
ltx/en_us_dedes/me.m07.d23:meMA.Ode8C1T.text	
ltx/en_us_dedes/me.m07.d23:meMA.Ode8H.greekmelody	@ltx/en_us_dedes/he.h.m4:heHE.CheirasEkpetasasDaniil.greekname
ltx/en_us_dedes/me.m07.d23:meMA.Ode8H.incipit	@ltx/en_us_dedes/he.h.m4:heHE.CheirasEkpetasasDaniil.incipit
ltx/en_us_dedes/me.m07.d23:meMA.Ode8H.melody	@ltx/en_us_dedes/he.h.m4:heHE.CheirasEkpetasasDaniil.melody
ltx/en_us_dedes/me.m07.d23:meMA.Ode8H.mode	@ltx/en_us_dedes/miscellanea:misc.Mode4
ltx/en_us_dedes/me.m07.d23:meMA.Ode8H.ode	@ltx/en_us_dedes/miscellanea:misc.Ode8
ltx/en_us_dedes/me.m07.d23:meMA.Ode8H.text	@ltx/en_us_dedes/he.h.m4:heHE.CheirasEkpetasasDaniil.text
ltx/en_us_dedes/me.m07.d23:meMA.Ode9C11.greekmelody	@ltx/en_us_dedes/he.h.m4:heHE.LithosAcheirotmitos.greekname
ltx/en_us_dedes/me.m07.d23:meMA.Ode9C11.incipit	…
ltx/en_us_dedes/me.m07.d23:meMA.Ode9C11.melody	@ltx/en_us_dedes/he.h.m4:heHE.LithosAcheirotmitos.name
ltx/en_us_dedes/me.m07.d23:meMA.Ode9C11.mode	@ltx/en_us_dedes/miscellanea:misc.Mode4
ltx/en_us_dedes/me.m07.d23:meMA.Ode9C11.ode	@ltx/en_us_dedes/miscellanea:misc.Ode9
ltx/en_us_dedes/me.m07.d23:meMA.Ode9C11.text	
ltx/en_us_dedes/me.m07.d23:meMA.Ode9C12.incipit	…
ltx/en_us_dedes/me.m07.d23:meMA.Ode9C12.melody	@ltx/en_us_dedes/he.h.m4:heHE.LithosAcheirotmitos.name
ltx/en_us_dedes/me.m07.d23:meMA.Ode9C12.mode	@ltx/en_us_dedes/miscellanea:misc.Mode4
ltx/en_us_dedes/me.m07.d23:meMA.Ode9C12.ode	@ltx/en_us_dedes/miscellanea:misc.Ode9
ltx/en_us_dedes/me.m07.d23:meMA.Ode9C12.text	
ltx/en_us_dedes/me.m07.d23:meMA.Ode9C13.incipit	…
ltx/en_us_dedes/me.m07.d23:meMA.Ode9C13.melody	@ltx/en_us_dedes/he.h.m4:heHE.LithosAcheirotmitos.name
ltx/en_us_dedes/me.m07.d23:meMA.Ode9C13.mode	@ltx/en_us_dedes/miscellanea:misc.Mode4
ltx/en_us_dedes/me.m07.d23:meMA.Ode9C13.ode	@ltx/en_us_dedes/miscellanea:misc.Ode9
ltx/en_us_dedes/me.m07.d23:meMA.Ode9C13.text	
ltx/en_us_dedes/me.m07.d23:meMA.Ode9C14.incipit	…
ltx/en_us_dedes/me.m07.d23:meMA.Ode9C14.melody	@ltx/en_us_dedes/he.h.m4:heHE.LithosAcheirotmitos.name
ltx/en_us_dedes/me.m07.d23:meMA.Ode9C14.mode	@ltx/en_us_dedes/miscellanea:misc.Mode4
ltx/en_us_dedes/me.m07.d23:meMA.Ode9C14.ode	@ltx/en_us_dedes/miscellanea:misc.Ode9
ltx/en_us_dedes/me.m07.d23:meMA.Ode9C14.text	
ltx/en_us_dedes/me.m07.d23:meMA.Ode9C1T.incipit	…
ltx/en_us_dedes/me.m07.d23:meMA.Ode9C1T.melody	@ltx/en_us_dedes/he.h.m4:heHE.LithosAcheirotmitos.name
ltx/en_us_dedes/me.m07.d23:meMA.Ode9C1T.mode	@ltx/en_us_dedes/miscellanea:misc.Mode4
ltx/en_us_dedes/me.m07.d23:meMA.Ode9C1T.ode	@ltx/en_us_dedes/miscellanea:misc.Ode9
ltx/en_us_dedes/me.m07.d23:meMA.Ode9C1T.text	
ltx/en_us_dedes/me.m07.d23:meMA.Ode9H.greekmelody	@ltx/en_us_dedes/he.h.m4:heHE.LithosAcheirotmitos.greekname
ltx/en_us_dedes/me.m07.d23:meMA.Ode9H.incipit	@ltx/en_us_dedes/he.h.m4:heHE.LithosAcheirotmitos.incipit
ltx/en_us_dedes/me.m07.d23:meMA.Ode9H.melody	@ltx/en_us_dedes/he.h.m4:heHE.LithosAcheirotmitos.melody
ltx/en_us_dedes/me.m07.d23:meMA.Ode9H.mode	@ltx/en_us_dedes/miscellanea:misc.Mode4
ltx/en_us_dedes/me.m07.d23:meMA.Ode9H.ode	@ltx/en_us_dedes/miscellanea:misc.Ode9
ltx/en_us_dedes/me.m07.d23:meMA.Ode9H.text	@ltx/en_us_dedes/he.h.m4:heHE.LithosAcheirotmitos.text
ltx/en_us_dedes/me.m07.d23:meVE.Apolytikion1ger.greekmelody	@ltx/en_us_dedes/he.a.m3:heAU.TheiasPisteos.greekname
ltx/en_us_dedes/me.m07.d23:meVE.Apolytikion1ger.incipit	…
ltx/en_us_dedes/me.m07.d23:meVE.Apolytikion1ger.melody	@ltx/en_us_dedes/he.a.m3:heAU.TheiasPisteos.name
ltx/en_us_dedes/me.m07.d23:meVE.Apolytikion1ger.mode	@ltx/en_us_dedes/miscellanea:misc.Mode3
ltx/en_us_dedes/me.m07.d23:meVE.Apolytikion1ger.poet	@ltx/en_us_dedes/poets:po.Gerasimou
ltx/en_us_dedes/me.m07.d23:meVE.Apolytikion1ger.text	
ltx/en_us_dedes/me.m07.d23:meVE.Apolytikion2ger.greekmelody	@ltx/en_us_dedes/he.a.m3:heAU.TheiasPisteos.greekname
ltx/en_us_dedes/me.m07.d23:meVE.Apolytikion2ger.incipit	…
ltx/en_us_dedes/me.m07.d23:meVE.Apolytikion2ger.melody	@ltx/en_us_dedes/he.a.m3:heAU.TheiasPisteos.name
ltx/en_us_dedes/me.m07.d23:meVE.Apolytikion2ger.mode	@ltx/en_us_dedes/miscellanea:misc.Mode3
ltx/en_us_dedes/me.m07.d23:meVE.Apolytikion2ger.poet	@ltx/en_us_dedes/poets:po.Gerasimou
ltx/en_us_dedes/me.m07.d23:meVE.Apolytikion2ger.text	
ltx/en_us_dedes/me.m07.d23:meVE.Apolytikion3ger.greekmelody	@ltx/en_us_dedes/he.a.m4:heAU.TachyProkatalave.greekname
ltx/en_us_dedes/me.m07.d23:meVE.Apolytikion3ger.incipit	…
ltx/en_us_dedes/me.m07.d23:meVE.Apolytikion3ger.melody	@ltx/en_us_dedes/he.a.m4:heAU.TachyProkatalave.name
ltx/en_us_dedes/me.m07.d23:meVE.Apolytikion3ger.mode	@ltx/en_us_dedes/miscellanea:misc.Mode4
ltx/en_us_dedes/me.m07.d23:meVE.Apolytikion3ger.poet	@ltx/en_us_dedes/poets:po.Gerasimou
ltx/en_us_dedes/me.m07.d23:meVE.Apolytikion3ger.text	
ltx/en_us_dedes/me.m07.d23:meVE.GeneralApolytikion1.name	Phocas.
ltx/en_us_dedes/me.m07.d23:meVE.MM.GeneralApolytikion1.text	@ltx/en_us_dedes/properties:media.key
ltx/en_us_dedes/me.m07.d23:meVE.SticGlory.incipit	You were in love with…
ltx/en_us_dedes/me.m07.d23:meVE.SticGlory.melody	
ltx/en_us_dedes/me.m07.d23:meVE.SticGlory.mode	@ltx/en_us_dedes/miscellanea:misc.Mode4
ltx/en_us_dedes/me.m07.d23:meVE.SticGlory.text	You were in love with the Lord from the time of your youth, O Phocas, the all-blessed and wise Hieromartyr. You carried on your shoulders the armor of the cross, and without wavering you walked the way of truth, through which you became a friend of angels and a foe of demons; and you fervently intercede on behalf of the world.
ltx/en_us_dedes/me.m07.d23:meVE.SticStavrotheotokion.greekmelody	@ltx/en_us_dedes/he.a.m4:heAU.OsGennaionEnMartysi.greekname
ltx/en_us_dedes/me.m07.d23:meVE.SticStavrotheotokion.incipit	@ltx/en_us_dedes/me.m02.d11:meVE.AposStavrotheotokion.incipit
ltx/en_us_dedes/me.m07.d23:meVE.SticStavrotheotokion.melody	@ltx/en_us_dedes/he.a.m4:heAU.OsGennaionEnMartysi.name
ltx/en_us_dedes/me.m07.d23:meVE.SticStavrotheotokion.mode	@ltx/en_us_dedes/miscellanea:misc.Mode4
ltx/en_us_dedes/me.m07.d23:meVE.SticStavrotheotokion.text	@ltx/en_us_dedes/me.m02.d11:meVE.AposStavrotheotokion.text
ltx/en_us_dedes/me.m07.d23:meVE.SticTheotokion.incipit	@ltx/en_us_dedes/oc.m4.d2:ocMA.AposTheotokion.incipit
ltx/en_us_dedes/me.m07.d23:meVE.SticTheotokion.melody	
ltx/en_us_dedes/me.m07.d23:meVE.SticTheotokion.mode	@ltx/en_us_dedes/miscellanea:misc.Mode4
ltx/en_us_dedes/me.m07.d23:meVE.SticTheotokion.text	@ltx/en_us_dedes/oc.m4.d2:ocMA.AposTheotokion.text
ltx/en_us_dedes/me.m07.d23:meVE.Stichera01.greekmelody	@ltx/en_us_dedes/he.a.m1:heAU.TonOuranionTagmaton.greekname
ltx/en_us_dedes/me.m07.d23:meVE.Stichera01.incipit	Phocas the Martyr of Christ…
ltx/en_us_dedes/me.m07.d23:meVE.Stichera01.melody	@ltx/en_us_dedes/he.a.m1:heAU.TonOuranionTagmaton.name
ltx/en_us_dedes/me.m07.d23:meVE.Stichera01.mode	@ltx/en_us_dedes/miscellanea:misc.Mode1
ltx/en_us_dedes/me.m07.d23:meVE.Stichera01.text	Phocas the Martyr of Christ God * has with martyric blood * filled the Proverbial wine bowl, * and he pours on the faithful * healings, and he drives away all disease, * calling all from the highest place, * “You who are thirsty, now faithfully come and drink * from the rivers of the gifts of grace.”
ltx/en_us_dedes/me.m07.d23:meVE.Stichera02.incipit	Martyr Phocas, when you thwarted…
ltx/en_us_dedes/me.m07.d23:meVE.Stichera02.melody	@ltx/en_us_dedes/he.a.m1:heAU.TonOuranionTagmaton.name
ltx/en_us_dedes/me.m07.d23:meVE.Stichera02.mode	@ltx/en_us_dedes/miscellanea:misc.Mode1
ltx/en_us_dedes/me.m07.d23:meVE.Stichera02.text	Martyr Phocas, when you thwarted the ruse of godlessness * by your divine resistance, * and exposed the confusion * of paganism by the Trinity’s might, * you endured the edge of the sword * and being scorched by the fire, and all the storm * of the tortures, as if children’s darts.
ltx/en_us_dedes/me.m07.d23:meVE.Stichera03.incipit	Martyr Phocas, as a herald…
ltx/en_us_dedes/me.m07.d23:meVE.Stichera03.melody	@ltx/en_us_dedes/he.a.m1:heAU.TonOuranionTagmaton.name
ltx/en_us_dedes/me.m07.d23:meVE.Stichera03.mode	@ltx/en_us_dedes/miscellanea:misc.Mode1
ltx/en_us_dedes/me.m07.d23:meVE.Stichera03.text	Martyr Phocas, as a herald * of God the Giver of life, * you overthrew the tyrants, * and were duly awarded * as a godly Athlete. And when you received * the assurance of life from God * who is immortal, you passed on to the divine * never-setting light, O blessed one.
