ltx/en_us_dedes/me.m04.d13:meDA.commemoration.first	Memory of St. Martin, Pope of Rome
ltx/en_us_dedes/me.m04.d13:meDA.commemoration.first_name	
ltx/en_us_dedes/me.m04.d13:meDA.commemoration.first_short	Memory of St. Martin, Pope of Rome
ltx/en_us_dedes/me.m04.d13:meDA.commemoration.first_title	@ltx/en_us_dedes/titles:ti.SaintM
ltx/en_us_dedes/me.m04.d13:meDA.commemoration.full	Memory of our Holy Father Martin, Pope of Rome
ltx/en_us_dedes/me.m04.d13:meDA.commemoration.second_name	
ltx/en_us_dedes/me.m04.d13:meDA.commemoration.second_title	
ltx/en_us_dedes/me.m04.d13:meDA.date	April 13
ltx/en_us_dedes/me.m04.d13:meDA.fordate	for April 13
ltx/en_us_dedes/me.m04.d13:meDA.insert1	
ltx/en_us_dedes/me.m04.d13:meDA.insert2	
ltx/en_us_dedes/me.m04.d13:meDA.note	
ltx/en_us_dedes/me.m04.d13:meDA.pdfcoverdate	April 13,
ltx/en_us_dedes/me.m04.d13:meDA.pdfheaderdate	April 13
ltx/en_us_dedes/me.m04.d13:meHO.commemorations	
ltx/en_us_dedes/me.m04.d13:meHO.note1	
ltx/en_us_dedes/me.m04.d13:meHO.note2	
ltx/en_us_dedes/me.m04.d13:meHO.number	
ltx/en_us_dedes/me.m04.d13:meHO.rank	
ltx/en_us_dedes/me.m04.d13:meLE.commemoration1	
ltx/en_us_dedes/me.m04.d13:meLE.commemoration2	
ltx/en_us_dedes/me.m04.d13:meLI.Kontakion1.incipit	@ltx/en_us_dedes/me.m04.d13:meMA.Kontakion1ger.incipit
ltx/en_us_dedes/me.m04.d13:meLI.Kontakion1.melody	@ltx/en_us_dedes/me.m04.d13:meMA.Kontakion1ger.melody
ltx/en_us_dedes/me.m04.d13:meLI.Kontakion1.mode	@ltx/en_us_dedes/me.m04.d13:meMA.Kontakion1ger.mode
ltx/en_us_dedes/me.m04.d13:meLI.Kontakion1.text	@ltx/en_us_dedes/me.m04.d13:meMA.Kontakion1ger.text
ltx/en_us_dedes/me.m04.d13:meLI.MM.CommunionHymn.text	@ltx/en_us_dedes/properties:media.key
ltx/en_us_dedes/me.m04.d13:meLI.Megalynarion.text	
ltx/en_us_dedes/me.m04.d13:meMA.C1.acrostic.notice1	
ltx/en_us_dedes/me.m04.d13:meMA.C1.acrostic.text	
ltx/en_us_dedes/me.m04.d13:meMA.C1.acrostic.title	
ltx/en_us_dedes/me.m04.d13:meMA.C1.title	@ltx/en_us_dedes/titles:ti.CanonSaintM
ltx/en_us_dedes/me.m04.d13:meMA.C1.verse	@ltx/en_us_dedes/prayers:pr.verse_SaintM.text
ltx/en_us_dedes/me.m04.d13:meMA.Kontakion1ger.incipit	…
ltx/en_us_dedes/me.m04.d13:meMA.Kontakion1ger.melody	@ltx/en_us_dedes/he.a.m8:heAU.TiYpermacho.name
ltx/en_us_dedes/me.m04.d13:meMA.Kontakion1ger.mode	@ltx/en_us_dedes/miscellanea:misc.Mode8
ltx/en_us_dedes/me.m04.d13:meMA.Kontakion1ger.poet	@ltx/en_us_dedes/poets:po.Gerasimou
ltx/en_us_dedes/me.m04.d13:meMA.Kontakion1ger.text	
ltx/en_us_dedes/me.m04.d13:meMA.Ode1C11.greekmelody	@ltx/en_us_dedes/he.h.m8:heHE.IKekommeni.greekname
ltx/en_us_dedes/me.m04.d13:meMA.Ode1C11.incipit	…
ltx/en_us_dedes/me.m04.d13:meMA.Ode1C11.melody	@ltx/en_us_dedes/he.h.m8:heHE.IKekommeni.name
ltx/en_us_dedes/me.m04.d13:meMA.Ode1C11.mode	@ltx/en_us_dedes/miscellanea:misc.Mode8
ltx/en_us_dedes/me.m04.d13:meMA.Ode1C11.ode	@ltx/en_us_dedes/miscellanea:misc.Ode1
ltx/en_us_dedes/me.m04.d13:meMA.Ode1C11.text	
ltx/en_us_dedes/me.m04.d13:meMA.Ode1C12.incipit	…
ltx/en_us_dedes/me.m04.d13:meMA.Ode1C12.melody	@ltx/en_us_dedes/he.h.m8:heHE.IKekommeni.name
ltx/en_us_dedes/me.m04.d13:meMA.Ode1C12.mode	@ltx/en_us_dedes/miscellanea:misc.Mode8
ltx/en_us_dedes/me.m04.d13:meMA.Ode1C12.ode	@ltx/en_us_dedes/miscellanea:misc.Ode1
ltx/en_us_dedes/me.m04.d13:meMA.Ode1C12.text	
ltx/en_us_dedes/me.m04.d13:meMA.Ode1C13.incipit	…
ltx/en_us_dedes/me.m04.d13:meMA.Ode1C13.melody	@ltx/en_us_dedes/he.h.m8:heHE.IKekommeni.name
ltx/en_us_dedes/me.m04.d13:meMA.Ode1C13.mode	@ltx/en_us_dedes/miscellanea:misc.Mode8
ltx/en_us_dedes/me.m04.d13:meMA.Ode1C13.ode	@ltx/en_us_dedes/miscellanea:misc.Ode1
ltx/en_us_dedes/me.m04.d13:meMA.Ode1C13.text	
ltx/en_us_dedes/me.m04.d13:meMA.Ode1C1H.greekmelody	@ltx/en_us_dedes/he.h.m8:heHE.IKekommeni.greekname
ltx/en_us_dedes/me.m04.d13:meMA.Ode1C1H.incipit	@ltx/en_us_dedes/he.h.m8:heHE.IKekommeni.incipit
ltx/en_us_dedes/me.m04.d13:meMA.Ode1C1H.melody	@ltx/en_us_dedes/he.h.m8:heHE.IKekommeni.melody
ltx/en_us_dedes/me.m04.d13:meMA.Ode1C1H.mode	@ltx/en_us_dedes/miscellanea:misc.Mode8
ltx/en_us_dedes/me.m04.d13:meMA.Ode1C1H.ode	@ltx/en_us_dedes/miscellanea:misc.Ode1
ltx/en_us_dedes/me.m04.d13:meMA.Ode1C1H.text	@ltx/en_us_dedes/he.h.m8:heHE.IKekommeni.text
ltx/en_us_dedes/me.m04.d13:meMA.Ode1C1T.incipit	…
ltx/en_us_dedes/me.m04.d13:meMA.Ode1C1T.melody	@ltx/en_us_dedes/he.h.m8:heHE.IKekommeni.name
ltx/en_us_dedes/me.m04.d13:meMA.Ode1C1T.mode	@ltx/en_us_dedes/miscellanea:misc.Mode8
ltx/en_us_dedes/me.m04.d13:meMA.Ode1C1T.ode	@ltx/en_us_dedes/miscellanea:misc.Ode1
ltx/en_us_dedes/me.m04.d13:meMA.Ode1C1T.text	
ltx/en_us_dedes/me.m04.d13:meMA.Ode3C11.greekmelody	@ltx/en_us_dedes/he.h.m8:heHE.TonFovonSouKyrie.greekname
ltx/en_us_dedes/me.m04.d13:meMA.Ode3C11.incipit	…
ltx/en_us_dedes/me.m04.d13:meMA.Ode3C11.melody	@ltx/en_us_dedes/he.h.m8:heHE.TonFovonSouKyrie.name
ltx/en_us_dedes/me.m04.d13:meMA.Ode3C11.mode	@ltx/en_us_dedes/miscellanea:misc.Mode8
ltx/en_us_dedes/me.m04.d13:meMA.Ode3C11.ode	@ltx/en_us_dedes/miscellanea:misc.Ode3
ltx/en_us_dedes/me.m04.d13:meMA.Ode3C11.text	
ltx/en_us_dedes/me.m04.d13:meMA.Ode3C12.incipit	…
ltx/en_us_dedes/me.m04.d13:meMA.Ode3C12.melody	@ltx/en_us_dedes/he.h.m8:heHE.TonFovonSouKyrie.name
ltx/en_us_dedes/me.m04.d13:meMA.Ode3C12.mode	@ltx/en_us_dedes/miscellanea:misc.Mode8
ltx/en_us_dedes/me.m04.d13:meMA.Ode3C12.ode	@ltx/en_us_dedes/miscellanea:misc.Ode3
ltx/en_us_dedes/me.m04.d13:meMA.Ode3C12.text	
ltx/en_us_dedes/me.m04.d13:meMA.Ode3C13.incipit	…
ltx/en_us_dedes/me.m04.d13:meMA.Ode3C13.melody	@ltx/en_us_dedes/he.h.m8:heHE.TonFovonSouKyrie.name
ltx/en_us_dedes/me.m04.d13:meMA.Ode3C13.mode	@ltx/en_us_dedes/miscellanea:misc.Mode8
ltx/en_us_dedes/me.m04.d13:meMA.Ode3C13.ode	@ltx/en_us_dedes/miscellanea:misc.Ode3
ltx/en_us_dedes/me.m04.d13:meMA.Ode3C13.text	
ltx/en_us_dedes/me.m04.d13:meMA.Ode3C1H.greekmelody	@ltx/en_us_dedes/he.h.m8:heHE.TonFovonSouKyrie.greekname
ltx/en_us_dedes/me.m04.d13:meMA.Ode3C1H.incipit	@ltx/en_us_dedes/he.h.m8:heHE.TonFovonSouKyrie.incipit
ltx/en_us_dedes/me.m04.d13:meMA.Ode3C1H.melody	@ltx/en_us_dedes/he.h.m8:heHE.TonFovonSouKyrie.melody
ltx/en_us_dedes/me.m04.d13:meMA.Ode3C1H.mode	@ltx/en_us_dedes/miscellanea:misc.Mode8
ltx/en_us_dedes/me.m04.d13:meMA.Ode3C1H.ode	@ltx/en_us_dedes/miscellanea:misc.Ode3
ltx/en_us_dedes/me.m04.d13:meMA.Ode3C1H.text	@ltx/en_us_dedes/he.h.m8:heHE.TonFovonSouKyrie.text
ltx/en_us_dedes/me.m04.d13:meMA.Ode3C1T.incipit	…
ltx/en_us_dedes/me.m04.d13:meMA.Ode3C1T.melody	@ltx/en_us_dedes/he.h.m8:heHE.TonFovonSouKyrie.name
ltx/en_us_dedes/me.m04.d13:meMA.Ode3C1T.mode	@ltx/en_us_dedes/miscellanea:misc.Mode8
ltx/en_us_dedes/me.m04.d13:meMA.Ode3C1T.ode	@ltx/en_us_dedes/miscellanea:misc.Ode3
ltx/en_us_dedes/me.m04.d13:meMA.Ode3C1T.text	
ltx/en_us_dedes/me.m04.d13:meMA.Ode3Kathisma1.greekmelody	@ltx/en_us_dedes/he.a.m8:heAU.TinSofianKaiLogon.greekname
ltx/en_us_dedes/me.m04.d13:meMA.Ode3Kathisma1.incipit	…
ltx/en_us_dedes/me.m04.d13:meMA.Ode3Kathisma1.melody	@ltx/en_us_dedes/he.a.m8:heAU.TinSofianKaiLogon.name
ltx/en_us_dedes/me.m04.d13:meMA.Ode3Kathisma1.mode	@ltx/en_us_dedes/miscellanea:misc.Mode8
ltx/en_us_dedes/me.m04.d13:meMA.Ode3Kathisma1.text	
ltx/en_us_dedes/me.m04.d13:meMA.Ode3KathismaSt.incipit	…
ltx/en_us_dedes/me.m04.d13:meMA.Ode3KathismaSt.melody	@ltx/en_us_dedes/he.a.m8:heAU.TinSofianKaiLogon.name
ltx/en_us_dedes/me.m04.d13:meMA.Ode3KathismaSt.mode	@ltx/en_us_dedes/miscellanea:misc.Mode8
ltx/en_us_dedes/me.m04.d13:meMA.Ode3KathismaSt.text	
ltx/en_us_dedes/me.m04.d13:meMA.Ode3KathismaT.incipit	…
ltx/en_us_dedes/me.m04.d13:meMA.Ode3KathismaT.melody	@ltx/en_us_dedes/he.a.m8:heAU.TinSofianKaiLogon.name
ltx/en_us_dedes/me.m04.d13:meMA.Ode3KathismaT.mode	@ltx/en_us_dedes/miscellanea:misc.Mode8
ltx/en_us_dedes/me.m04.d13:meMA.Ode3KathismaT.text	
ltx/en_us_dedes/me.m04.d13:meMA.Ode4C11.greekmelody	@ltx/en_us_dedes/he.h.m8:heHE.EpevisEfIppous.greekname
ltx/en_us_dedes/me.m04.d13:meMA.Ode4C11.incipit	…
ltx/en_us_dedes/me.m04.d13:meMA.Ode4C11.melody	@ltx/en_us_dedes/he.h.m8:heHE.EpevisEfIppous.name
ltx/en_us_dedes/me.m04.d13:meMA.Ode4C11.mode	@ltx/en_us_dedes/miscellanea:misc.Mode8
ltx/en_us_dedes/me.m04.d13:meMA.Ode4C11.ode	@ltx/en_us_dedes/miscellanea:misc.Ode4
ltx/en_us_dedes/me.m04.d13:meMA.Ode4C11.text	
ltx/en_us_dedes/me.m04.d13:meMA.Ode4C12.incipit	…
ltx/en_us_dedes/me.m04.d13:meMA.Ode4C12.melody	@ltx/en_us_dedes/he.h.m8:heHE.EpevisEfIppous.name
ltx/en_us_dedes/me.m04.d13:meMA.Ode4C12.mode	@ltx/en_us_dedes/miscellanea:misc.Mode8
ltx/en_us_dedes/me.m04.d13:meMA.Ode4C12.ode	@ltx/en_us_dedes/miscellanea:misc.Ode4
ltx/en_us_dedes/me.m04.d13:meMA.Ode4C12.text	
ltx/en_us_dedes/me.m04.d13:meMA.Ode4C13.incipit	…
ltx/en_us_dedes/me.m04.d13:meMA.Ode4C13.melody	@ltx/en_us_dedes/he.h.m8:heHE.EpevisEfIppous.name
ltx/en_us_dedes/me.m04.d13:meMA.Ode4C13.mode	@ltx/en_us_dedes/miscellanea:misc.Mode8
ltx/en_us_dedes/me.m04.d13:meMA.Ode4C13.ode	@ltx/en_us_dedes/miscellanea:misc.Ode4
ltx/en_us_dedes/me.m04.d13:meMA.Ode4C13.text	
ltx/en_us_dedes/me.m04.d13:meMA.Ode4C1H.greekmelody	@ltx/en_us_dedes/he.h.m8:heHE.EpevisEfIppous.greekname
ltx/en_us_dedes/me.m04.d13:meMA.Ode4C1H.incipit	@ltx/en_us_dedes/he.h.m8:heHE.EpevisEfIppous.incipit
ltx/en_us_dedes/me.m04.d13:meMA.Ode4C1H.melody	@ltx/en_us_dedes/he.h.m8:heHE.EpevisEfIppous.melody
ltx/en_us_dedes/me.m04.d13:meMA.Ode4C1H.mode	@ltx/en_us_dedes/miscellanea:misc.Mode8
ltx/en_us_dedes/me.m04.d13:meMA.Ode4C1H.ode	@ltx/en_us_dedes/miscellanea:misc.Ode4
ltx/en_us_dedes/me.m04.d13:meMA.Ode4C1H.text	@ltx/en_us_dedes/he.h.m8:heHE.EpevisEfIppous.text
ltx/en_us_dedes/me.m04.d13:meMA.Ode4C1T.incipit	…
ltx/en_us_dedes/me.m04.d13:meMA.Ode4C1T.melody	@ltx/en_us_dedes/he.h.m8:heHE.EpevisEfIppous.name
ltx/en_us_dedes/me.m04.d13:meMA.Ode4C1T.mode	@ltx/en_us_dedes/miscellanea:misc.Mode8
ltx/en_us_dedes/me.m04.d13:meMA.Ode4C1T.ode	@ltx/en_us_dedes/miscellanea:misc.Ode4
ltx/en_us_dedes/me.m04.d13:meMA.Ode4C1T.text	
ltx/en_us_dedes/me.m04.d13:meMA.Ode5C11.greekmelody	@ltx/en_us_dedes/he.h.m8:heHE.TonEkNyktosAgnosias.greekname
ltx/en_us_dedes/me.m04.d13:meMA.Ode5C11.incipit	…
ltx/en_us_dedes/me.m04.d13:meMA.Ode5C11.melody	@ltx/en_us_dedes/he.h.m8:heHE.TonEkNyktosAgnosias.name
ltx/en_us_dedes/me.m04.d13:meMA.Ode5C11.mode	@ltx/en_us_dedes/miscellanea:misc.Mode8
ltx/en_us_dedes/me.m04.d13:meMA.Ode5C11.ode	@ltx/en_us_dedes/miscellanea:misc.Ode5
ltx/en_us_dedes/me.m04.d13:meMA.Ode5C11.text	
ltx/en_us_dedes/me.m04.d13:meMA.Ode5C12.incipit	…
ltx/en_us_dedes/me.m04.d13:meMA.Ode5C12.melody	@ltx/en_us_dedes/he.h.m8:heHE.TonEkNyktosAgnosias.name
ltx/en_us_dedes/me.m04.d13:meMA.Ode5C12.mode	@ltx/en_us_dedes/miscellanea:misc.Mode8
ltx/en_us_dedes/me.m04.d13:meMA.Ode5C12.ode	@ltx/en_us_dedes/miscellanea:misc.Ode5
ltx/en_us_dedes/me.m04.d13:meMA.Ode5C12.text	
ltx/en_us_dedes/me.m04.d13:meMA.Ode5C13.incipit	…
ltx/en_us_dedes/me.m04.d13:meMA.Ode5C13.melody	@ltx/en_us_dedes/he.h.m8:heHE.TonEkNyktosAgnosias.name
ltx/en_us_dedes/me.m04.d13:meMA.Ode5C13.mode	@ltx/en_us_dedes/miscellanea:misc.Mode8
ltx/en_us_dedes/me.m04.d13:meMA.Ode5C13.ode	@ltx/en_us_dedes/miscellanea:misc.Ode5
ltx/en_us_dedes/me.m04.d13:meMA.Ode5C13.text	
ltx/en_us_dedes/me.m04.d13:meMA.Ode5C1H.greekmelody	@ltx/en_us_dedes/he.h.m8:heHE.TonEkNyktosAgnosias.greekname
ltx/en_us_dedes/me.m04.d13:meMA.Ode5C1H.incipit	@ltx/en_us_dedes/he.h.m8:heHE.TonEkNyktosAgnosias.incipit
ltx/en_us_dedes/me.m04.d13:meMA.Ode5C1H.melody	@ltx/en_us_dedes/he.h.m8:heHE.TonEkNyktosAgnosias.melody
ltx/en_us_dedes/me.m04.d13:meMA.Ode5C1H.mode	@ltx/en_us_dedes/miscellanea:misc.Mode8
ltx/en_us_dedes/me.m04.d13:meMA.Ode5C1H.ode	@ltx/en_us_dedes/miscellanea:misc.Ode5
ltx/en_us_dedes/me.m04.d13:meMA.Ode5C1H.text	@ltx/en_us_dedes/he.h.m8:heHE.TonEkNyktosAgnosias.text
ltx/en_us_dedes/me.m04.d13:meMA.Ode5C1T.incipit	…
ltx/en_us_dedes/me.m04.d13:meMA.Ode5C1T.melody	@ltx/en_us_dedes/he.h.m8:heHE.TonEkNyktosAgnosias.name
ltx/en_us_dedes/me.m04.d13:meMA.Ode5C1T.mode	@ltx/en_us_dedes/miscellanea:misc.Mode8
ltx/en_us_dedes/me.m04.d13:meMA.Ode5C1T.ode	@ltx/en_us_dedes/miscellanea:misc.Ode5
ltx/en_us_dedes/me.m04.d13:meMA.Ode5C1T.text	
ltx/en_us_dedes/me.m04.d13:meMA.Ode6C11.greekmelody	@ltx/en_us_dedes/he.h.m8:heHE.AvyssosAmartion.greekname
ltx/en_us_dedes/me.m04.d13:meMA.Ode6C11.incipit	…
ltx/en_us_dedes/me.m04.d13:meMA.Ode6C11.melody	@ltx/en_us_dedes/he.h.m8:heHE.AvyssosAmartion.name
ltx/en_us_dedes/me.m04.d13:meMA.Ode6C11.mode	@ltx/en_us_dedes/miscellanea:misc.Mode8
ltx/en_us_dedes/me.m04.d13:meMA.Ode6C11.ode	@ltx/en_us_dedes/miscellanea:misc.Ode6
ltx/en_us_dedes/me.m04.d13:meMA.Ode6C11.text	
ltx/en_us_dedes/me.m04.d13:meMA.Ode6C12.incipit	…
ltx/en_us_dedes/me.m04.d13:meMA.Ode6C12.melody	@ltx/en_us_dedes/he.h.m8:heHE.AvyssosAmartion.name
ltx/en_us_dedes/me.m04.d13:meMA.Ode6C12.mode	@ltx/en_us_dedes/miscellanea:misc.Mode8
ltx/en_us_dedes/me.m04.d13:meMA.Ode6C12.ode	@ltx/en_us_dedes/miscellanea:misc.Ode6
ltx/en_us_dedes/me.m04.d13:meMA.Ode6C12.text	
ltx/en_us_dedes/me.m04.d13:meMA.Ode6C13.incipit	…
ltx/en_us_dedes/me.m04.d13:meMA.Ode6C13.melody	@ltx/en_us_dedes/he.h.m8:heHE.AvyssosAmartion.name
ltx/en_us_dedes/me.m04.d13:meMA.Ode6C13.mode	@ltx/en_us_dedes/miscellanea:misc.Mode8
ltx/en_us_dedes/me.m04.d13:meMA.Ode6C13.ode	@ltx/en_us_dedes/miscellanea:misc.Ode6
ltx/en_us_dedes/me.m04.d13:meMA.Ode6C13.text	
ltx/en_us_dedes/me.m04.d13:meMA.Ode6C1H.greekmelody	@ltx/en_us_dedes/he.h.m8:heHE.AvyssosAmartion.greekname
ltx/en_us_dedes/me.m04.d13:meMA.Ode6C1H.incipit	@ltx/en_us_dedes/he.h.m8:heHE.AvyssosAmartion.incipit
ltx/en_us_dedes/me.m04.d13:meMA.Ode6C1H.melody	@ltx/en_us_dedes/he.h.m8:heHE.AvyssosAmartion.melody
ltx/en_us_dedes/me.m04.d13:meMA.Ode6C1H.mode	@ltx/en_us_dedes/miscellanea:misc.Mode8
ltx/en_us_dedes/me.m04.d13:meMA.Ode6C1H.ode	@ltx/en_us_dedes/miscellanea:misc.Ode6
ltx/en_us_dedes/me.m04.d13:meMA.Ode6C1H.text	@ltx/en_us_dedes/he.h.m8:heHE.AvyssosAmartion.text
ltx/en_us_dedes/me.m04.d13:meMA.Ode6C1T.incipit	…
ltx/en_us_dedes/me.m04.d13:meMA.Ode6C1T.melody	@ltx/en_us_dedes/he.h.m8:heHE.AvyssosAmartion.name
ltx/en_us_dedes/me.m04.d13:meMA.Ode6C1T.mode	@ltx/en_us_dedes/miscellanea:misc.Mode8
ltx/en_us_dedes/me.m04.d13:meMA.Ode6C1T.ode	@ltx/en_us_dedes/miscellanea:misc.Ode6
ltx/en_us_dedes/me.m04.d13:meMA.Ode6C1T.text	
ltx/en_us_dedes/me.m04.d13:meMA.Ode7C11.greekmelody	@ltx/en_us_dedes/he.h.m8:heHE.OiEkTisIoudaias.greekname
ltx/en_us_dedes/me.m04.d13:meMA.Ode7C11.incipit	…
ltx/en_us_dedes/me.m04.d13:meMA.Ode7C11.melody	@ltx/en_us_dedes/he.h.m8:heHE.OiEkTisIoudaias.name
ltx/en_us_dedes/me.m04.d13:meMA.Ode7C11.mode	@ltx/en_us_dedes/miscellanea:misc.Mode8
ltx/en_us_dedes/me.m04.d13:meMA.Ode7C11.ode	@ltx/en_us_dedes/miscellanea:misc.Ode7
ltx/en_us_dedes/me.m04.d13:meMA.Ode7C11.text	
ltx/en_us_dedes/me.m04.d13:meMA.Ode7C12.incipit	…
ltx/en_us_dedes/me.m04.d13:meMA.Ode7C12.melody	@ltx/en_us_dedes/he.h.m8:heHE.OiEkTisIoudaias.name
ltx/en_us_dedes/me.m04.d13:meMA.Ode7C12.mode	@ltx/en_us_dedes/miscellanea:misc.Mode8
ltx/en_us_dedes/me.m04.d13:meMA.Ode7C12.ode	@ltx/en_us_dedes/miscellanea:misc.Ode7
ltx/en_us_dedes/me.m04.d13:meMA.Ode7C12.text	
ltx/en_us_dedes/me.m04.d13:meMA.Ode7C13.incipit	…
ltx/en_us_dedes/me.m04.d13:meMA.Ode7C13.melody	@ltx/en_us_dedes/he.h.m8:heHE.OiEkTisIoudaias.name
ltx/en_us_dedes/me.m04.d13:meMA.Ode7C13.mode	@ltx/en_us_dedes/miscellanea:misc.Mode8
ltx/en_us_dedes/me.m04.d13:meMA.Ode7C13.ode	@ltx/en_us_dedes/miscellanea:misc.Ode7
ltx/en_us_dedes/me.m04.d13:meMA.Ode7C13.text	
ltx/en_us_dedes/me.m04.d13:meMA.Ode7C1H.greekmelody	@ltx/en_us_dedes/he.h.m8:heHE.OiEkTisIoudaias.greekname
ltx/en_us_dedes/me.m04.d13:meMA.Ode7C1H.incipit	@ltx/en_us_dedes/he.h.m8:heHE.OiEkTisIoudaias.incipit
ltx/en_us_dedes/me.m04.d13:meMA.Ode7C1H.melody	@ltx/en_us_dedes/he.h.m8:heHE.OiEkTisIoudaias.melody
ltx/en_us_dedes/me.m04.d13:meMA.Ode7C1H.mode	@ltx/en_us_dedes/miscellanea:misc.Mode8
ltx/en_us_dedes/me.m04.d13:meMA.Ode7C1H.ode	@ltx/en_us_dedes/miscellanea:misc.Ode7
ltx/en_us_dedes/me.m04.d13:meMA.Ode7C1H.text	@ltx/en_us_dedes/he.h.m8:heHE.OiEkTisIoudaias.text
ltx/en_us_dedes/me.m04.d13:meMA.Ode7C1T.incipit	…
ltx/en_us_dedes/me.m04.d13:meMA.Ode7C1T.melody	@ltx/en_us_dedes/he.h.m8:heHE.OiEkTisIoudaias.name
ltx/en_us_dedes/me.m04.d13:meMA.Ode7C1T.mode	@ltx/en_us_dedes/miscellanea:misc.Mode8
ltx/en_us_dedes/me.m04.d13:meMA.Ode7C1T.ode	@ltx/en_us_dedes/miscellanea:misc.Ode7
ltx/en_us_dedes/me.m04.d13:meMA.Ode7C1T.text	
ltx/en_us_dedes/me.m04.d13:meMA.Ode7C1Tr.incipit	…
ltx/en_us_dedes/me.m04.d13:meMA.Ode7C1Tr.melody	@ltx/en_us_dedes/he.h.m8:heHE.OiEkTisIoudaias.name
ltx/en_us_dedes/me.m04.d13:meMA.Ode7C1Tr.mode	@ltx/en_us_dedes/miscellanea:misc.Mode8
ltx/en_us_dedes/me.m04.d13:meMA.Ode7C1Tr.ode	@ltx/en_us_dedes/miscellanea:misc.Ode7
ltx/en_us_dedes/me.m04.d13:meMA.Ode7C1Tr.text	
ltx/en_us_dedes/me.m04.d13:meMA.Ode8C11.greekmelody	@ltx/en_us_dedes/he.h.m8:heHE.OiTheorrimonesPaides.greekname
ltx/en_us_dedes/me.m04.d13:meMA.Ode8C11.incipit	…
ltx/en_us_dedes/me.m04.d13:meMA.Ode8C11.melody	@ltx/en_us_dedes/he.h.m8:heHE.OiTheorrimonesPaides.name
ltx/en_us_dedes/me.m04.d13:meMA.Ode8C11.mode	@ltx/en_us_dedes/miscellanea:misc.Mode8
ltx/en_us_dedes/me.m04.d13:meMA.Ode8C11.ode	@ltx/en_us_dedes/miscellanea:misc.Ode8
ltx/en_us_dedes/me.m04.d13:meMA.Ode8C11.text	
ltx/en_us_dedes/me.m04.d13:meMA.Ode8C12.incipit	…
ltx/en_us_dedes/me.m04.d13:meMA.Ode8C12.melody	@ltx/en_us_dedes/he.h.m8:heHE.OiTheorrimonesPaides.name
ltx/en_us_dedes/me.m04.d13:meMA.Ode8C12.mode	@ltx/en_us_dedes/miscellanea:misc.Mode8
ltx/en_us_dedes/me.m04.d13:meMA.Ode8C12.ode	@ltx/en_us_dedes/miscellanea:misc.Ode8
ltx/en_us_dedes/me.m04.d13:meMA.Ode8C12.text	
ltx/en_us_dedes/me.m04.d13:meMA.Ode8C13.incipit	…
ltx/en_us_dedes/me.m04.d13:meMA.Ode8C13.melody	@ltx/en_us_dedes/he.h.m8:heHE.OiTheorrimonesPaides.name
ltx/en_us_dedes/me.m04.d13:meMA.Ode8C13.mode	@ltx/en_us_dedes/miscellanea:misc.Mode8
ltx/en_us_dedes/me.m04.d13:meMA.Ode8C13.ode	@ltx/en_us_dedes/miscellanea:misc.Ode8
ltx/en_us_dedes/me.m04.d13:meMA.Ode8C13.text	
ltx/en_us_dedes/me.m04.d13:meMA.Ode8C1H.greekmelody	@ltx/en_us_dedes/he.h.m8:heHE.OiTheorrimonesPaides.greekname
ltx/en_us_dedes/me.m04.d13:meMA.Ode8C1H.incipit	@ltx/en_us_dedes/he.h.m8:heHE.OiTheorrimonesPaides.incipit
ltx/en_us_dedes/me.m04.d13:meMA.Ode8C1H.melody	@ltx/en_us_dedes/he.h.m8:heHE.OiTheorrimonesPaides.melody
ltx/en_us_dedes/me.m04.d13:meMA.Ode8C1H.mode	@ltx/en_us_dedes/miscellanea:misc.Mode8
ltx/en_us_dedes/me.m04.d13:meMA.Ode8C1H.ode	@ltx/en_us_dedes/miscellanea:misc.Ode8
ltx/en_us_dedes/me.m04.d13:meMA.Ode8C1H.text	@ltx/en_us_dedes/he.h.m8:heHE.OiTheorrimonesPaides.text
ltx/en_us_dedes/me.m04.d13:meMA.Ode8C1T.incipit	…
ltx/en_us_dedes/me.m04.d13:meMA.Ode8C1T.melody	@ltx/en_us_dedes/he.h.m8:heHE.OiTheorrimonesPaides.name
ltx/en_us_dedes/me.m04.d13:meMA.Ode8C1T.mode	@ltx/en_us_dedes/miscellanea:misc.Mode8
ltx/en_us_dedes/me.m04.d13:meMA.Ode8C1T.ode	@ltx/en_us_dedes/miscellanea:misc.Ode8
ltx/en_us_dedes/me.m04.d13:meMA.Ode8C1T.text	
ltx/en_us_dedes/me.m04.d13:meMA.Ode8C1Tr.incipit	…
ltx/en_us_dedes/me.m04.d13:meMA.Ode8C1Tr.melody	@ltx/en_us_dedes/he.h.m8:heHE.OiTheorrimonesPaides.name
ltx/en_us_dedes/me.m04.d13:meMA.Ode8C1Tr.mode	@ltx/en_us_dedes/miscellanea:misc.Mode8
ltx/en_us_dedes/me.m04.d13:meMA.Ode8C1Tr.ode	@ltx/en_us_dedes/miscellanea:misc.Ode8
ltx/en_us_dedes/me.m04.d13:meMA.Ode8C1Tr.text	
ltx/en_us_dedes/me.m04.d13:meMA.Ode9C11.greekmelody	@ltx/en_us_dedes/he.h.m8:heHE.OrousParilthes.greekname
ltx/en_us_dedes/me.m04.d13:meMA.Ode9C11.incipit	…
ltx/en_us_dedes/me.m04.d13:meMA.Ode9C11.melody	@ltx/en_us_dedes/he.h.m8:heHE.OrousParilthes.name
ltx/en_us_dedes/me.m04.d13:meMA.Ode9C11.mode	@ltx/en_us_dedes/miscellanea:misc.Mode8
ltx/en_us_dedes/me.m04.d13:meMA.Ode9C11.ode	@ltx/en_us_dedes/miscellanea:misc.Ode9
ltx/en_us_dedes/me.m04.d13:meMA.Ode9C11.text	
ltx/en_us_dedes/me.m04.d13:meMA.Ode9C12.incipit	…
ltx/en_us_dedes/me.m04.d13:meMA.Ode9C12.melody	@ltx/en_us_dedes/he.h.m8:heHE.OrousParilthes.name
ltx/en_us_dedes/me.m04.d13:meMA.Ode9C12.mode	@ltx/en_us_dedes/miscellanea:misc.Mode8
ltx/en_us_dedes/me.m04.d13:meMA.Ode9C12.ode	@ltx/en_us_dedes/miscellanea:misc.Ode9
ltx/en_us_dedes/me.m04.d13:meMA.Ode9C12.text	
ltx/en_us_dedes/me.m04.d13:meMA.Ode9C13.incipit	…
ltx/en_us_dedes/me.m04.d13:meMA.Ode9C13.melody	@ltx/en_us_dedes/he.h.m8:heHE.OrousParilthes.name
ltx/en_us_dedes/me.m04.d13:meMA.Ode9C13.mode	@ltx/en_us_dedes/miscellanea:misc.Mode8
ltx/en_us_dedes/me.m04.d13:meMA.Ode9C13.ode	@ltx/en_us_dedes/miscellanea:misc.Ode9
ltx/en_us_dedes/me.m04.d13:meMA.Ode9C13.text	
ltx/en_us_dedes/me.m04.d13:meMA.Ode9C14.incipit	…
ltx/en_us_dedes/me.m04.d13:meMA.Ode9C14.melody	@ltx/en_us_dedes/he.h.m8:heHE.OrousParilthes.name
ltx/en_us_dedes/me.m04.d13:meMA.Ode9C14.mode	@ltx/en_us_dedes/miscellanea:misc.Mode8
ltx/en_us_dedes/me.m04.d13:meMA.Ode9C14.ode	@ltx/en_us_dedes/miscellanea:misc.Ode9
ltx/en_us_dedes/me.m04.d13:meMA.Ode9C14.text	
ltx/en_us_dedes/me.m04.d13:meMA.Ode9C1H.greekmelody	@ltx/en_us_dedes/he.h.m8:heHE.OrousParilthes.greekname
ltx/en_us_dedes/me.m04.d13:meMA.Ode9C1H.incipit	@ltx/en_us_dedes/he.h.m8:heHE.OrousParilthes.incipit
ltx/en_us_dedes/me.m04.d13:meMA.Ode9C1H.melody	@ltx/en_us_dedes/he.h.m8:heHE.OrousParilthes.melody
ltx/en_us_dedes/me.m04.d13:meMA.Ode9C1H.mode	@ltx/en_us_dedes/miscellanea:misc.Mode8
ltx/en_us_dedes/me.m04.d13:meMA.Ode9C1H.ode	@ltx/en_us_dedes/miscellanea:misc.Ode9
ltx/en_us_dedes/me.m04.d13:meMA.Ode9C1H.text	@ltx/en_us_dedes/he.h.m8:heHE.OrousParilthes.text
ltx/en_us_dedes/me.m04.d13:meMA.Ode9C1T.incipit	…
ltx/en_us_dedes/me.m04.d13:meMA.Ode9C1T.melody	@ltx/en_us_dedes/he.h.m8:heHE.OrousParilthes.name
ltx/en_us_dedes/me.m04.d13:meMA.Ode9C1T.mode	@ltx/en_us_dedes/miscellanea:misc.Mode8
ltx/en_us_dedes/me.m04.d13:meMA.Ode9C1T.ode	@ltx/en_us_dedes/miscellanea:misc.Ode9
ltx/en_us_dedes/me.m04.d13:meMA.Ode9C1T.text	
ltx/en_us_dedes/me.m04.d13:meVE.Apolytikion1ger.greekmelody	@ltx/en_us_dedes/he.a.m3:heAU.TheiasPisteos.greekname
ltx/en_us_dedes/me.m04.d13:meVE.Apolytikion1ger.incipit	…
ltx/en_us_dedes/me.m04.d13:meVE.Apolytikion1ger.melody	@ltx/en_us_dedes/he.a.m3:heAU.TheiasPisteos.name
ltx/en_us_dedes/me.m04.d13:meVE.Apolytikion1ger.mode	@ltx/en_us_dedes/miscellanea:misc.Mode3
ltx/en_us_dedes/me.m04.d13:meVE.Apolytikion1ger.poet	@ltx/en_us_dedes/poets:po.Gerasimou
ltx/en_us_dedes/me.m04.d13:meVE.Apolytikion1ger.text	
ltx/en_us_dedes/me.m04.d13:meVE.SticStavrotheotokion.greekmelody	@ltx/en_us_dedes/he.a.m8:heAU.TiYmasKalesomen.greekname
ltx/en_us_dedes/me.m04.d13:meVE.SticStavrotheotokion.incipit	…
ltx/en_us_dedes/me.m04.d13:meVE.SticStavrotheotokion.melody	@ltx/en_us_dedes/he.a.m8:heAU.TiYmasKalesomen.name
ltx/en_us_dedes/me.m04.d13:meVE.SticStavrotheotokion.mode	@ltx/en_us_dedes/miscellanea:misc.Mode8
ltx/en_us_dedes/me.m04.d13:meVE.SticStavrotheotokion.text	
ltx/en_us_dedes/me.m04.d13:meVE.SticTheotokion.greekmelody	@ltx/en_us_dedes/he.a.m8:heAU.TiYmasKalesomen.greekname
ltx/en_us_dedes/me.m04.d13:meVE.SticTheotokion.incipit	What is more amazing than…
ltx/en_us_dedes/me.m04.d13:meVE.SticTheotokion.melody	@ltx/en_us_dedes/he.a.m8:heAU.TiYmasKalesomen.name
ltx/en_us_dedes/me.m04.d13:meVE.SticTheotokion.mode	@ltx/en_us_dedes/miscellanea:misc.Mode8
ltx/en_us_dedes/me.m04.d13:meVE.SticTheotokion.text	What is more amazing than all the good * that you do! You liberate us from the passions, curing all. * You repel lawless assaults on us by those opposing us. * From perils you have rescued us who honor you. * From troubles you deliver us, O Bride of God. * For us who serve you, O Virgin pure, * be the occasion for utter joy, * and intercede with your Son and God to save our souls.
ltx/en_us_dedes/me.m04.d13:meVE.Stichera01.greekmelody	@ltx/en_us_dedes/he.a.m8:heAU.TiYmasKalesomen.greekname
ltx/en_us_dedes/me.m04.d13:meVE.Stichera01.incipit	…
ltx/en_us_dedes/me.m04.d13:meVE.Stichera01.melody	@ltx/en_us_dedes/he.a.m8:heAU.TiYmasKalesomen.name
ltx/en_us_dedes/me.m04.d13:meVE.Stichera01.mode	@ltx/en_us_dedes/miscellanea:misc.Mode8
ltx/en_us_dedes/me.m04.d13:meVE.Stichera01.text	
ltx/en_us_dedes/me.m04.d13:meVE.Stichera02.incipit	…
ltx/en_us_dedes/me.m04.d13:meVE.Stichera02.melody	@ltx/en_us_dedes/he.a.m8:heAU.TiYmasKalesomen.name
ltx/en_us_dedes/me.m04.d13:meVE.Stichera02.mode	@ltx/en_us_dedes/miscellanea:misc.Mode8
ltx/en_us_dedes/me.m04.d13:meVE.Stichera02.text	
ltx/en_us_dedes/me.m04.d13:meVE.Stichera03.incipit	…
ltx/en_us_dedes/me.m04.d13:meVE.Stichera03.melody	@ltx/en_us_dedes/he.a.m8:heAU.TiYmasKalesomen.name
ltx/en_us_dedes/me.m04.d13:meVE.Stichera03.mode	@ltx/en_us_dedes/miscellanea:misc.Mode8
ltx/en_us_dedes/me.m04.d13:meVE.Stichera03.text	
