ltx/en_us_dedes/me.m03.d24:meDA.commemoration.first	Forefeast of the Annunciation
ltx/en_us_dedes/me.m03.d24:meDA.commemoration.first_name	
ltx/en_us_dedes/me.m03.d24:meDA.commemoration.first_short	Forefeast of the Annunciation
ltx/en_us_dedes/me.m03.d24:meDA.commemoration.first_title	@ltx/en_us_dedes/titles:ti.Feast
ltx/en_us_dedes/me.m03.d24:meDA.commemoration.full	Forefeast of the Annunciation of the Most Holy Theotokos
ltx/en_us_dedes/me.m03.d24:meDA.commemoration.second_name	
ltx/en_us_dedes/me.m03.d24:meDA.commemoration.second_title	
ltx/en_us_dedes/me.m03.d24:meDA.date	March 24
ltx/en_us_dedes/me.m03.d24:meDA.fordate	for March 24
ltx/en_us_dedes/me.m03.d24:meDA.insert1	
ltx/en_us_dedes/me.m03.d24:meDA.insert2	
ltx/en_us_dedes/me.m03.d24:meDA.note	
ltx/en_us_dedes/me.m03.d24:meDA.pdfcoverdate	March 24,
ltx/en_us_dedes/me.m03.d24:meDA.pdfheaderdate	March 24
ltx/en_us_dedes/me.m03.d24:meHO.commemorations	
ltx/en_us_dedes/me.m03.d24:meHO.note1	
ltx/en_us_dedes/me.m03.d24:meHO.note2	
ltx/en_us_dedes/me.m03.d24:meHO.number	
ltx/en_us_dedes/me.m03.d24:meHO.rank	
ltx/en_us_dedes/me.m03.d24:meLE.commemoration1	Forefeast of the Annunciation of the Most Holy Theotokos.
ltx/en_us_dedes/me.m03.d24:meLE.commemoration2	
ltx/en_us_dedes/me.m03.d24:meLI.Kontakion1.greekmelody	@ltx/en_us_dedes/me.m03.d24:meMA.Kontakion1.greekmelody
ltx/en_us_dedes/me.m03.d24:meLI.Kontakion1.incipit	@ltx/en_us_dedes/me.m03.d24:meMA.Kontakion1.incipit
ltx/en_us_dedes/me.m03.d24:meLI.Kontakion1.melody	@ltx/en_us_dedes/me.m03.d24:meMA.Kontakion1.melody
ltx/en_us_dedes/me.m03.d24:meLI.Kontakion1.mode	@ltx/en_us_dedes/me.m03.d24:meMA.Kontakion1.mode
ltx/en_us_dedes/me.m03.d24:meLI.Kontakion1.text	@ltx/en_us_dedes/me.m03.d24:meMA.Kontakion1.text
ltx/en_us_dedes/me.m03.d24:meLI.MM.CommunionHymn.text	@ltx/en_us_dedes/properties:media.key
ltx/en_us_dedes/me.m03.d24:meLI.Megalynarion.text	
ltx/en_us_dedes/me.m03.d24:meMA.AposGlory.incipit	The Theotokos heard a tongue…
ltx/en_us_dedes/me.m03.d24:meMA.AposGlory.melody	
ltx/en_us_dedes/me.m03.d24:meMA.AposGlory.mode	@ltx/en_us_dedes/miscellanea:misc.Mode4
ltx/en_us_dedes/me.m03.d24:meMA.AposGlory.text	The Theotokos heard a tongue she knew not. For the Archangel spoke to her the words of the Annunciation. When she accepted the salutation with faith, she conceived You, the pre-eternal God. We also greatly rejoice, and we say to You: O God, Who without changing became incarnate of her, grant peace to the world, and great mercy to our souls.
ltx/en_us_dedes/me.m03.d24:meMA.C1.poet	@ltx/en_us_dedes/poets:po.Georgiou
ltx/en_us_dedes/me.m03.d24:meMA.C1.title	@ltx/en_us_dedes/titles:ti.CanonForefeast
ltx/en_us_dedes/me.m03.d24:meMA.C1.verse	@ltx/en_us_dedes/prayers:pr.verse_God.text
ltx/en_us_dedes/me.m03.d24:meMA.Exaposteilarion1.greekmelody	@ltx/en_us_dedes/he.a.m2:heAU.GynaikesAkoutisthite.greekname
ltx/en_us_dedes/me.m03.d24:meMA.Exaposteilarion1.incipit	O Virgin pure, we bring…
ltx/en_us_dedes/me.m03.d24:meMA.Exaposteilarion1.melody	@ltx/en_us_dedes/he.a.m2:heAU.GynaikesAkoutisthite.name
ltx/en_us_dedes/me.m03.d24:meMA.Exaposteilarion1.mode	@ltx/en_us_dedes/miscellanea:misc.Mode2
ltx/en_us_dedes/me.m03.d24:meMA.Exaposteilarion1.text	O Virgin pure, we bring to you * the virtues as pre-festal gifts: * the love for the poor like riches, * and chastity and self-restraint,* our sacred hymns and prayers tears, * our fasting and humility. * Please help us all to do these works, * and watch over us, O Lady * compassionate Theotokos.
ltx/en_us_dedes/me.m03.d24:meMA.Kontakion1.greekmelody	@ltx/en_us_dedes/he.a.m4:heAU.EpefanisSimeron.greekname
ltx/en_us_dedes/me.m03.d24:meMA.Kontakion1.incipit	The Archangel spoke to you…
ltx/en_us_dedes/me.m03.d24:meMA.Kontakion1.melody	@ltx/en_us_dedes/he.a.m4:heAU.EpefanisSimeron.name
ltx/en_us_dedes/me.m03.d24:meMA.Kontakion1.mode	@ltx/en_us_dedes/miscellanea:misc.Mode4
ltx/en_us_dedes/me.m03.d24:meMA.Kontakion1.text	The Archangel spoke to you, * O Theotokos, * and the Holy Spirit came * on you and thus you did conceive * the Father’s Son, who is one in throne * and one in essence. * Through you, thus, was Adam recalled.
ltx/en_us_dedes/me.m03.d24:meMA.MM.Mar25Sv123asLauds345.text	@ltx/en_us_dedes/properties:media.key
ltx/en_us_dedes/me.m03.d24:meMA.Ode1C11.greekmelody	@ltx/en_us_dedes/he.h.m4:heHE.ThalassisToErythraion.greekname
ltx/en_us_dedes/me.m03.d24:meMA.Ode1C11.incipit	O world, be glad and…
ltx/en_us_dedes/me.m03.d24:meMA.Ode1C11.melody	@ltx/en_us_dedes/he.h.m4:heHE.ThalassisToErythraion.notmetered
ltx/en_us_dedes/me.m03.d24:meMA.Ode1C11.mode	@ltx/en_us_dedes/miscellanea:misc.Mode4
ltx/en_us_dedes/me.m03.d24:meMA.Ode1C11.ode	@ltx/en_us_dedes/miscellanea:misc.Ode1
ltx/en_us_dedes/me.m03.d24:meMA.Ode1C11.text	O world, be glad and filled with joy, as you experience the Lord descending to you. In His tender mercy, He comes down from heaven, and He receives bodily form in a Virgin’s womb.
ltx/en_us_dedes/me.m03.d24:meMA.Ode1C12.incipit	O Virgin, behold, a divine…
ltx/en_us_dedes/me.m03.d24:meMA.Ode1C12.melody	@ltx/en_us_dedes/he.h.m4:heHE.ThalassisToErythraion.notmetered
ltx/en_us_dedes/me.m03.d24:meMA.Ode1C12.mode	@ltx/en_us_dedes/miscellanea:misc.Mode4
ltx/en_us_dedes/me.m03.d24:meMA.Ode1C12.ode	@ltx/en_us_dedes/miscellanea:misc.Ode1
ltx/en_us_dedes/me.m03.d24:meMA.Ode1C12.text	O Virgin, behold, a divine Archangel of God the King of all is sent to you, the Queen, to announce His coming, and to salute you with the greeting “Rejoice,” for the restoration of the forefather Adam.
ltx/en_us_dedes/me.m03.d24:meMA.Ode1C13.incipit	O Maiden, prepare yourself to…
ltx/en_us_dedes/me.m03.d24:meMA.Ode1C13.melody	@ltx/en_us_dedes/he.h.m4:heHE.ThalassisToErythraion.notmetered
ltx/en_us_dedes/me.m03.d24:meMA.Ode1C13.mode	@ltx/en_us_dedes/miscellanea:misc.Mode4
ltx/en_us_dedes/me.m03.d24:meMA.Ode1C13.ode	@ltx/en_us_dedes/miscellanea:misc.Ode1
ltx/en_us_dedes/me.m03.d24:meMA.Ode1C13.text	O Maiden, prepare yourself to be the gleaming solid gold jar, that will receive the Manna of Life. For at the voice of the Angel, He shall come upon you, and He shall come to dwell in you supernaturally
ltx/en_us_dedes/me.m03.d24:meMA.Ode1C14.incipit	O pure one, the Lord…
ltx/en_us_dedes/me.m03.d24:meMA.Ode1C14.melody	@ltx/en_us_dedes/he.h.m4:heHE.ThalassisToErythraion.notmetered
ltx/en_us_dedes/me.m03.d24:meMA.Ode1C14.mode	@ltx/en_us_dedes/miscellanea:misc.Mode4
ltx/en_us_dedes/me.m03.d24:meMA.Ode1C14.ode	@ltx/en_us_dedes/miscellanea:misc.Ode1
ltx/en_us_dedes/me.m03.d24:meMA.Ode1C14.text	O pure one, the Lord, who ever dwells in heaven, will make His dwelling in your body; for He comes to clothe himself with the nature of those born on earth, and thus to make it heavenly.
ltx/en_us_dedes/me.m03.d24:meMA.Ode1C1H.greekmelody	@ltx/en_us_dedes/he.h.m4:heHE.ThalassisToErythraion.greekname
ltx/en_us_dedes/me.m03.d24:meMA.Ode1C1H.incipit	@ltx/en_us_dedes/he.h.m4:heHE.ThalassisToErythraion.incipit
ltx/en_us_dedes/me.m03.d24:meMA.Ode1C1H.melody	@ltx/en_us_dedes/he.h.m4:heHE.ThalassisToErythraion.melody
ltx/en_us_dedes/me.m03.d24:meMA.Ode1C1H.mode	@ltx/en_us_dedes/miscellanea:misc.Mode4
ltx/en_us_dedes/me.m03.d24:meMA.Ode1C1H.ode	@ltx/en_us_dedes/miscellanea:misc.Ode1
ltx/en_us_dedes/me.m03.d24:meMA.Ode1C1H.text	@ltx/en_us_dedes/he.h.m4:heHE.ThalassisToErythraion.text
ltx/en_us_dedes/me.m03.d24:meMA.Ode3C11.greekmelody	@ltx/en_us_dedes/he.h.m4:heHE.OukEnSofia.greekname
ltx/en_us_dedes/me.m03.d24:meMA.Ode3C11.incipit	Exult and dance for joy…
ltx/en_us_dedes/me.m03.d24:meMA.Ode3C11.melody	@ltx/en_us_dedes/he.h.m4:heHE.OukEnSofia.notmetered
ltx/en_us_dedes/me.m03.d24:meMA.Ode3C11.mode	@ltx/en_us_dedes/miscellanea:misc.Mode4
ltx/en_us_dedes/me.m03.d24:meMA.Ode3C11.ode	@ltx/en_us_dedes/miscellanea:misc.Ode3
ltx/en_us_dedes/me.m03.d24:meMA.Ode3C11.text	Exult and dance for joy now, O earth, that with labor and sorrow had sprouted the passions like thorns. Behold, the immortal Husbandman shall come now, and He lift the curse from you.
ltx/en_us_dedes/me.m03.d24:meMA.Ode3C12.incipit	O undefiled Virgin, prepare to…
ltx/en_us_dedes/me.m03.d24:meMA.Ode3C12.melody	@ltx/en_us_dedes/he.h.m4:heHE.OukEnSofia.notmetered
ltx/en_us_dedes/me.m03.d24:meMA.Ode3C12.mode	@ltx/en_us_dedes/miscellanea:misc.Mode4
ltx/en_us_dedes/me.m03.d24:meMA.Ode3C12.ode	@ltx/en_us_dedes/miscellanea:misc.Ode3
ltx/en_us_dedes/me.m03.d24:meMA.Ode3C12.text	O undefiled Virgin, prepare to be the divine fleece; for God shall descend on you like rain, to dry up the streams of human disobedience.
ltx/en_us_dedes/me.m03.d24:meMA.Ode3C13.incipit	O Maiden, prepare to be…
ltx/en_us_dedes/me.m03.d24:meMA.Ode3C13.melody	@ltx/en_us_dedes/he.h.m4:heHE.OukEnSofia.notmetered
ltx/en_us_dedes/me.m03.d24:meMA.Ode3C13.mode	@ltx/en_us_dedes/miscellanea:misc.Mode4
ltx/en_us_dedes/me.m03.d24:meMA.Ode3C13.ode	@ltx/en_us_dedes/miscellanea:misc.Ode3
ltx/en_us_dedes/me.m03.d24:meMA.Ode3C13.text	O Maiden, prepare to be the divine tablet; for by the finger of the Father, the divine Logos incarnate shall be inscribed in you, and He shall loose my illogical transgression.
ltx/en_us_dedes/me.m03.d24:meMA.Ode3C14.incipit	O Virgin, receive the fire…
ltx/en_us_dedes/me.m03.d24:meMA.Ode3C14.melody	@ltx/en_us_dedes/he.h.m4:heHE.OukEnSofia.notmetered
ltx/en_us_dedes/me.m03.d24:meMA.Ode3C14.mode	@ltx/en_us_dedes/miscellanea:misc.Mode4
ltx/en_us_dedes/me.m03.d24:meMA.Ode3C14.ode	@ltx/en_us_dedes/miscellanea:misc.Ode3
ltx/en_us_dedes/me.m03.d24:meMA.Ode3C14.text	O Virgin, receive the fire of the Godhead, like the golden lamp. It will shine through you and give light to the world; and it will disperse the darkness of our evils.
ltx/en_us_dedes/me.m03.d24:meMA.Ode3C1H.greekmelody	@ltx/en_us_dedes/he.h.m4:heHE.OukEnSofia.greekname
ltx/en_us_dedes/me.m03.d24:meMA.Ode3C1H.incipit	@ltx/en_us_dedes/he.h.m4:heHE.OukEnSofia.incipit
ltx/en_us_dedes/me.m03.d24:meMA.Ode3C1H.melody	@ltx/en_us_dedes/he.h.m4:heHE.OukEnSofia.melody
ltx/en_us_dedes/me.m03.d24:meMA.Ode3C1H.mode	@ltx/en_us_dedes/miscellanea:misc.Mode4
ltx/en_us_dedes/me.m03.d24:meMA.Ode3C1H.ode	@ltx/en_us_dedes/miscellanea:misc.Ode3
ltx/en_us_dedes/me.m03.d24:meMA.Ode3C1H.text	@ltx/en_us_dedes/he.h.m4:heHE.OukEnSofia.text
ltx/en_us_dedes/me.m03.d24:meMA.Ode3Kathisma1.greekmelody	@ltx/en_us_dedes/he.a.m3:heAU.TinOraiotita.greekname
ltx/en_us_dedes/me.m03.d24:meMA.Ode3Kathisma1.incipit	Today creation all exults with…
ltx/en_us_dedes/me.m03.d24:meMA.Ode3Kathisma1.melody	@ltx/en_us_dedes/he.a.m3:heAU.TinOraiotita.name
ltx/en_us_dedes/me.m03.d24:meMA.Ode3Kathisma1.mode	@ltx/en_us_dedes/miscellanea:misc.Mode3
ltx/en_us_dedes/me.m03.d24:meMA.Ode3Kathisma1.text	Today creation all exults with greatest joy, * for the Archangel came and said to you, “Rejoice! * Blessed are you, O purest Maid, immaculate Mother of Christ.” * And today the insolence * of the serpent is mortified. * The fetters of the curse once laid * on our forefather now are loosed. * And so with all the world we cry out to you: * Rejoice, O Maiden full of grace.
ltx/en_us_dedes/me.m03.d24:meMA.Ode4C11.greekmelody	@ltx/en_us_dedes/he.h.m4:heHE.EparthentaSeIdousa.greekname
ltx/en_us_dedes/me.m03.d24:meMA.Ode4C11.incipit	Now the mystery that was…
ltx/en_us_dedes/me.m03.d24:meMA.Ode4C11.melody	@ltx/en_us_dedes/he.h.m4:heHE.EparthentaSeIdousa.notmetered
ltx/en_us_dedes/me.m03.d24:meMA.Ode4C11.mode	@ltx/en_us_dedes/miscellanea:misc.Mode4
ltx/en_us_dedes/me.m03.d24:meMA.Ode4C11.ode	@ltx/en_us_dedes/miscellanea:misc.Ode4
ltx/en_us_dedes/me.m03.d24:meMA.Ode4C11.text	Now the mystery that was foreordained before the ages begins to be revealed. O earth and heavens, celebrate in unison and joyfully sing and jubilate aloud.
ltx/en_us_dedes/me.m03.d24:meMA.Ode4C12.incipit	Open your aural entrances to…
ltx/en_us_dedes/me.m03.d24:meMA.Ode4C12.melody	@ltx/en_us_dedes/he.h.m4:heHE.EparthentaSeIdousa.notmetered
ltx/en_us_dedes/me.m03.d24:meMA.Ode4C12.mode	@ltx/en_us_dedes/miscellanea:misc.Mode4
ltx/en_us_dedes/me.m03.d24:meMA.Ode4C12.ode	@ltx/en_us_dedes/miscellanea:misc.Ode4
ltx/en_us_dedes/me.m03.d24:meMA.Ode4C12.text	Open your aural entrances to things divine, O great palace of the King; for Christ the Truth shall come now, and shall dwell inside you.
ltx/en_us_dedes/me.m03.d24:meMA.Ode4C13.incipit	Our Redeemer shall be seen…
ltx/en_us_dedes/me.m03.d24:meMA.Ode4C13.melody	@ltx/en_us_dedes/he.h.m4:heHE.EparthentaSeIdousa.notmetered
ltx/en_us_dedes/me.m03.d24:meMA.Ode4C13.mode	@ltx/en_us_dedes/miscellanea:misc.Mode4
ltx/en_us_dedes/me.m03.d24:meMA.Ode4C13.ode	@ltx/en_us_dedes/miscellanea:misc.Ode4
ltx/en_us_dedes/me.m03.d24:meMA.Ode4C13.text	Our Redeemer shall be seen to dwell in a virgin womb, in order to restore our ancestral mother who slipped and fell. Let us sing to Him, “Glory to Your strength, O Lord!”
ltx/en_us_dedes/me.m03.d24:meMA.Ode4C14.incipit	O all-blameless Virgin and only…
ltx/en_us_dedes/me.m03.d24:meMA.Ode4C14.melody	@ltx/en_us_dedes/he.h.m4:heHE.EparthentaSeIdousa.notmetered
ltx/en_us_dedes/me.m03.d24:meMA.Ode4C14.mode	@ltx/en_us_dedes/miscellanea:misc.Mode4
ltx/en_us_dedes/me.m03.d24:meMA.Ode4C14.ode	@ltx/en_us_dedes/miscellanea:misc.Ode4
ltx/en_us_dedes/me.m03.d24:meMA.Ode4C14.text	O all-blameless Virgin and only adornment of mortals, the Prophet Habakkuk of old spoke of you as being a mountain overshadowed with virtues, and from which our God was to appear.
ltx/en_us_dedes/me.m03.d24:meMA.Ode4C1H.greekmelody	@ltx/en_us_dedes/he.h.m4:heHE.EparthentaSeIdousa.greekname
ltx/en_us_dedes/me.m03.d24:meMA.Ode4C1H.incipit	@ltx/en_us_dedes/he.h.m4:heHE.EparthentaSeIdousa.incipit
ltx/en_us_dedes/me.m03.d24:meMA.Ode4C1H.melody	@ltx/en_us_dedes/he.h.m4:heHE.EparthentaSeIdousa.melody
ltx/en_us_dedes/me.m03.d24:meMA.Ode4C1H.mode	@ltx/en_us_dedes/miscellanea:misc.Mode4
ltx/en_us_dedes/me.m03.d24:meMA.Ode4C1H.ode	@ltx/en_us_dedes/miscellanea:misc.Ode4
ltx/en_us_dedes/me.m03.d24:meMA.Ode4C1H.text	@ltx/en_us_dedes/he.h.m4:heHE.EparthentaSeIdousa.text
ltx/en_us_dedes/me.m03.d24:meMA.Ode5C11.greekmelody	@ltx/en_us_dedes/he.h.m4:heHE.SyKyrieMouFos.greekname
ltx/en_us_dedes/me.m03.d24:meMA.Ode5C11.incipit	The Lamb of our God…
ltx/en_us_dedes/me.m03.d24:meMA.Ode5C11.melody	@ltx/en_us_dedes/he.h.m4:heHE.SyKyrieMouFos.notmetered
ltx/en_us_dedes/me.m03.d24:meMA.Ode5C11.mode	@ltx/en_us_dedes/miscellanea:misc.Mode4
ltx/en_us_dedes/me.m03.d24:meMA.Ode5C11.ode	@ltx/en_us_dedes/miscellanea:misc.Ode5
ltx/en_us_dedes/me.m03.d24:meMA.Ode5C11.text	The Lamb of our God is urgent in coming to enter your womb, O spotless Ewe-lamb, and to take away our sins.
ltx/en_us_dedes/me.m03.d24:meMA.Ode5C12.incipit	As it is written, may…
ltx/en_us_dedes/me.m03.d24:meMA.Ode5C12.melody	@ltx/en_us_dedes/he.h.m4:heHE.SyKyrieMouFos.notmetered
ltx/en_us_dedes/me.m03.d24:meMA.Ode5C12.mode	@ltx/en_us_dedes/miscellanea:misc.Mode4
ltx/en_us_dedes/me.m03.d24:meMA.Ode5C12.ode	@ltx/en_us_dedes/miscellanea:misc.Ode5
ltx/en_us_dedes/me.m03.d24:meMA.Ode5C12.text	As it is written, may the divine Flower blossom from you in due time, O mystical Rod from the root of Jesse, and appear to us.
ltx/en_us_dedes/me.m03.d24:meMA.Ode5C13.incipit	O Virgin, at the voice…
ltx/en_us_dedes/me.m03.d24:meMA.Ode5C13.melody	@ltx/en_us_dedes/he.h.m4:heHE.SyKyrieMouFos.notmetered
ltx/en_us_dedes/me.m03.d24:meMA.Ode5C13.mode	@ltx/en_us_dedes/miscellanea:misc.Mode4
ltx/en_us_dedes/me.m03.d24:meMA.Ode5C13.ode	@ltx/en_us_dedes/miscellanea:misc.Ode5
ltx/en_us_dedes/me.m03.d24:meMA.Ode5C13.text	O Virgin, at the voice of the Archangel, prepare to grow like a vine and to bring forth the ripe and undefiled Cluster.
ltx/en_us_dedes/me.m03.d24:meMA.Ode5C14.incipit	Be glad, O Isaiah, one…
ltx/en_us_dedes/me.m03.d24:meMA.Ode5C14.melody	@ltx/en_us_dedes/he.h.m4:heHE.SyKyrieMouFos.notmetered
ltx/en_us_dedes/me.m03.d24:meMA.Ode5C14.mode	@ltx/en_us_dedes/miscellanea:misc.Mode4
ltx/en_us_dedes/me.m03.d24:meMA.Ode5C14.ode	@ltx/en_us_dedes/miscellanea:misc.Ode5
ltx/en_us_dedes/me.m03.d24:meMA.Ode5C14.text	Be glad, O Isaiah, one of the great Prophets; for the Virgin, of whom you foretold, in her womb conceives the Angel of Great Counsel.
ltx/en_us_dedes/me.m03.d24:meMA.Ode5C1H.greekmelody	@ltx/en_us_dedes/he.h.m4:heHE.SyKyrieMouFos.greekname
ltx/en_us_dedes/me.m03.d24:meMA.Ode5C1H.incipit	@ltx/en_us_dedes/he.h.m4:heHE.SyKyrieMouFos.incipit
ltx/en_us_dedes/me.m03.d24:meMA.Ode5C1H.melody	@ltx/en_us_dedes/he.h.m4:heHE.SyKyrieMouFos.melody
ltx/en_us_dedes/me.m03.d24:meMA.Ode5C1H.mode	@ltx/en_us_dedes/miscellanea:misc.Mode4
ltx/en_us_dedes/me.m03.d24:meMA.Ode5C1H.ode	@ltx/en_us_dedes/miscellanea:misc.Ode5
ltx/en_us_dedes/me.m03.d24:meMA.Ode5C1H.text	@ltx/en_us_dedes/he.h.m4:heHE.SyKyrieMouFos.text
ltx/en_us_dedes/me.m03.d24:meMA.Ode6C11.greekmelody	@ltx/en_us_dedes/he.h.m4:heHE.ThysoSoiMetaFonis.greekname
ltx/en_us_dedes/me.m03.d24:meMA.Ode6C11.incipit	Archangel Gabriel says to you…
ltx/en_us_dedes/me.m03.d24:meMA.Ode6C11.melody	@ltx/en_us_dedes/he.h.m4:heHE.ThysoSoiMetaFonis.notmetered
ltx/en_us_dedes/me.m03.d24:meMA.Ode6C11.mode	@ltx/en_us_dedes/miscellanea:misc.Mode4
ltx/en_us_dedes/me.m03.d24:meMA.Ode6C11.ode	@ltx/en_us_dedes/miscellanea:misc.Ode6
ltx/en_us_dedes/me.m03.d24:meMA.Ode6C11.text	Archangel Gabriel says to you, “Rejoice, O Virgin! You shall inexplicably conceive in your womb the joy that Eve lost because she disobeyed.
ltx/en_us_dedes/me.m03.d24:meMA.Ode6C12.incipit	O all-pure Maid, be not…
ltx/en_us_dedes/me.m03.d24:meMA.Ode6C12.melody	@ltx/en_us_dedes/he.h.m4:heHE.ThysoSoiMetaFonis.notmetered
ltx/en_us_dedes/me.m03.d24:meMA.Ode6C12.mode	@ltx/en_us_dedes/miscellanea:misc.Mode4
ltx/en_us_dedes/me.m03.d24:meMA.Ode6C12.ode	@ltx/en_us_dedes/miscellanea:misc.Ode6
ltx/en_us_dedes/me.m03.d24:meMA.Ode6C12.text	O all-pure Maid, be not at all afraid; the fire of the Divinity shall not consume your womb; for the bush of old prefigured you: it was burning and was not at all consumed.
ltx/en_us_dedes/me.m03.d24:meMA.Ode6C13.incipit	O Virgin, rejoice! You are…
ltx/en_us_dedes/me.m03.d24:meMA.Ode6C13.melody	@ltx/en_us_dedes/he.h.m4:heHE.ThysoSoiMetaFonis.notmetered
ltx/en_us_dedes/me.m03.d24:meMA.Ode6C13.mode	@ltx/en_us_dedes/miscellanea:misc.Mode4
ltx/en_us_dedes/me.m03.d24:meMA.Ode6C13.ode	@ltx/en_us_dedes/miscellanea:misc.Ode6
ltx/en_us_dedes/me.m03.d24:meMA.Ode6C13.text	O Virgin, rejoice! You are that mountain, which Daniel foresaw in the Spirit; Christ, the noetic Stone shall be cut from you, and He shall crush the lifeless idols of the demons.
ltx/en_us_dedes/me.m03.d24:meMA.Ode6C14.incipit	O Mother of God, the…
ltx/en_us_dedes/me.m03.d24:meMA.Ode6C14.melody	@ltx/en_us_dedes/he.h.m4:heHE.ThysoSoiMetaFonis.notmetered
ltx/en_us_dedes/me.m03.d24:meMA.Ode6C14.mode	@ltx/en_us_dedes/miscellanea:misc.Mode4
ltx/en_us_dedes/me.m03.d24:meMA.Ode6C14.ode	@ltx/en_us_dedes/miscellanea:misc.Ode6
ltx/en_us_dedes/me.m03.d24:meMA.Ode6C14.text	O Mother of God, the King of Peace shall come upon you, to bring peace to those are beleaguered and defeated by the evil counsel of the serpent.
ltx/en_us_dedes/me.m03.d24:meMA.Ode6C1H.greekmelody	@ltx/en_us_dedes/he.h.m4:heHE.ThysoSoiMetaFonis.greekname
ltx/en_us_dedes/me.m03.d24:meMA.Ode6C1H.incipit	@ltx/en_us_dedes/he.h.m4:heHE.ThysoSoiMetaFonis.incipit
ltx/en_us_dedes/me.m03.d24:meMA.Ode6C1H.melody	@ltx/en_us_dedes/he.h.m4:heHE.ThysoSoiMetaFonis.melody
ltx/en_us_dedes/me.m03.d24:meMA.Ode6C1H.mode	@ltx/en_us_dedes/miscellanea:misc.Mode4
ltx/en_us_dedes/me.m03.d24:meMA.Ode6C1H.ode	@ltx/en_us_dedes/miscellanea:misc.Ode6
ltx/en_us_dedes/me.m03.d24:meMA.Ode6C1H.text	@ltx/en_us_dedes/he.h.m4:heHE.ThysoSoiMetaFonis.text
ltx/en_us_dedes/me.m03.d24:meMA.Ode7C11.greekmelody	@ltx/en_us_dedes/he.h.m4:heHE.ODiasosasEnPyri.greekname
ltx/en_us_dedes/me.m03.d24:meMA.Ode7C11.incipit	You are the rational Ark…
ltx/en_us_dedes/me.m03.d24:meMA.Ode7C11.melody	@ltx/en_us_dedes/he.h.m4:heHE.ODiasosasEnPyri.notmetered
ltx/en_us_dedes/me.m03.d24:meMA.Ode7C11.mode	@ltx/en_us_dedes/miscellanea:misc.Mode4
ltx/en_us_dedes/me.m03.d24:meMA.Ode7C11.ode	@ltx/en_us_dedes/miscellanea:misc.Ode7
ltx/en_us_dedes/me.m03.d24:meMA.Ode7C11.text	You are the rational Ark of the Covenant, loved by the true Giver of the Law. He is shall make His dwelling in you. So, be filled with gladness, for through you He shall renew those who have succumbed to corruption.
ltx/en_us_dedes/me.m03.d24:meMA.Ode7C12.incipit	O Maiden, the divine choir…
ltx/en_us_dedes/me.m03.d24:meMA.Ode7C12.melody	@ltx/en_us_dedes/he.h.m4:heHE.ODiasosasEnPyri.notmetered
ltx/en_us_dedes/me.m03.d24:meMA.Ode7C12.mode	@ltx/en_us_dedes/miscellanea:misc.Mode4
ltx/en_us_dedes/me.m03.d24:meMA.Ode7C12.ode	@ltx/en_us_dedes/miscellanea:misc.Ode7
ltx/en_us_dedes/me.m03.d24:meMA.Ode7C12.text	O Maiden, the divine choir of the Prophets, perceiving that the Redeemer comes upon you in peace, cries aloud to you, “Rejoice, redemption of all! Rejoice, only salvation of humanity!”
ltx/en_us_dedes/me.m03.d24:meMA.Ode7C13.incipit	O blessed Virgin Mary, do…
ltx/en_us_dedes/me.m03.d24:meMA.Ode7C13.melody	@ltx/en_us_dedes/he.h.m4:heHE.ODiasosasEnPyri.notmetered
ltx/en_us_dedes/me.m03.d24:meMA.Ode7C13.mode	@ltx/en_us_dedes/miscellanea:misc.Mode4
ltx/en_us_dedes/me.m03.d24:meMA.Ode7C13.ode	@ltx/en_us_dedes/miscellanea:misc.Ode7
ltx/en_us_dedes/me.m03.d24:meMA.Ode7C13.text	O blessed Virgin Mary, do not be afraid of the voice. Do not be perplexed by the one speaking to you; he is a minister of God. He comes to reveal to you the mystery that was kept secret from the Angels.
ltx/en_us_dedes/me.m03.d24:meMA.Ode7C14.incipit	O Virgin, you see how…
ltx/en_us_dedes/me.m03.d24:meMA.Ode7C14.melody	@ltx/en_us_dedes/he.h.m4:heHE.ODiasosasEnPyri.notmetered
ltx/en_us_dedes/me.m03.d24:meMA.Ode7C14.mode	@ltx/en_us_dedes/miscellanea:misc.Mode4
ltx/en_us_dedes/me.m03.d24:meMA.Ode7C14.ode	@ltx/en_us_dedes/miscellanea:misc.Ode7
ltx/en_us_dedes/me.m03.d24:meMA.Ode7C14.text	O Virgin, you see how the whole world is enslaved to the enemy. And you see that, in His tender mercy, good and gracious God has willed to have mercy on it through you. So do not disbelieve the words of the Angel.
ltx/en_us_dedes/me.m03.d24:meMA.Ode7C1H.greekmelody	@ltx/en_us_dedes/he.h.m4:heHE.ODiasosasEnPyri.greekname
ltx/en_us_dedes/me.m03.d24:meMA.Ode7C1H.incipit	@ltx/en_us_dedes/he.h.m4:heHE.ODiasosasEnPyri.incipit
ltx/en_us_dedes/me.m03.d24:meMA.Ode7C1H.melody	@ltx/en_us_dedes/he.h.m4:heHE.ODiasosasEnPyri.melody
ltx/en_us_dedes/me.m03.d24:meMA.Ode7C1H.mode	@ltx/en_us_dedes/miscellanea:misc.Mode4
ltx/en_us_dedes/me.m03.d24:meMA.Ode7C1H.ode	@ltx/en_us_dedes/miscellanea:misc.Ode7
ltx/en_us_dedes/me.m03.d24:meMA.Ode7C1H.text	@ltx/en_us_dedes/he.h.m4:heHE.ODiasosasEnPyri.text
ltx/en_us_dedes/me.m03.d24:meMA.Ode8C11.greekmelody	@ltx/en_us_dedes/he.h.m4:heHE.CheirasEkpetasasDaniil.greekname
ltx/en_us_dedes/me.m03.d24:meMA.Ode8C11.incipit	Unwedded Maiden, prepare yourself to…
ltx/en_us_dedes/me.m03.d24:meMA.Ode8C11.melody	@ltx/en_us_dedes/he.h.m4:heHE.CheirasEkpetasasDaniil.notmetered
ltx/en_us_dedes/me.m03.d24:meMA.Ode8C11.mode	@ltx/en_us_dedes/miscellanea:misc.Mode4
ltx/en_us_dedes/me.m03.d24:meMA.Ode8C11.ode	@ltx/en_us_dedes/miscellanea:misc.Ode8
ltx/en_us_dedes/me.m03.d24:meMA.Ode8C11.text	Unwedded Maiden, prepare yourself to become that swift cloud of the Light. Behold, the unsetting Sun from on high will shine on you; and after being concealed within you for a little, He will shine on the world and dissolve the darkness of wickedness.
ltx/en_us_dedes/me.m03.d24:meMA.Ode8C12.incipit	O immaculate Virgin, the premiere…
ltx/en_us_dedes/me.m03.d24:meMA.Ode8C12.melody	@ltx/en_us_dedes/he.h.m4:heHE.CheirasEkpetasasDaniil.notmetered
ltx/en_us_dedes/me.m03.d24:meMA.Ode8C12.mode	@ltx/en_us_dedes/miscellanea:misc.Mode4
ltx/en_us_dedes/me.m03.d24:meMA.Ode8C12.ode	@ltx/en_us_dedes/miscellanea:misc.Ode8
ltx/en_us_dedes/me.m03.d24:meMA.Ode8C12.text	O immaculate Virgin, the premiere angelic minister shall project a joyful voice, and announce to you, that the Angel of Great Counsel shall, in His goodness, be incarnate of you. To Him we cry aloud, “O all you works, praise you the Lord.”
ltx/en_us_dedes/me.m03.d24:meMA.Ode8C13.incipit	O pure one, our Fashioner…
ltx/en_us_dedes/me.m03.d24:meMA.Ode8C13.melody	@ltx/en_us_dedes/he.h.m4:heHE.CheirasEkpetasasDaniil.notmetered
ltx/en_us_dedes/me.m03.d24:meMA.Ode8C13.mode	@ltx/en_us_dedes/miscellanea:misc.Mode4
ltx/en_us_dedes/me.m03.d24:meMA.Ode8C13.ode	@ltx/en_us_dedes/miscellanea:misc.Ode8
ltx/en_us_dedes/me.m03.d24:meMA.Ode8C13.text	O pure one, our Fashioner and Lord knew you to be a pure rose of Sharon and a fragrant lily of the valley; and now He has loved your beauty, and He wills to become incarnate of your blood, so that in His kindness He might banish the foul odor of deceptive error.
ltx/en_us_dedes/me.m03.d24:meMA.Ode8C14.incipit	O immaculate Virgin, without departing…
ltx/en_us_dedes/me.m03.d24:meMA.Ode8C14.melody	@ltx/en_us_dedes/he.h.m4:heHE.CheirasEkpetasasDaniil.notmetered
ltx/en_us_dedes/me.m03.d24:meMA.Ode8C14.mode	@ltx/en_us_dedes/miscellanea:misc.Mode4
ltx/en_us_dedes/me.m03.d24:meMA.Ode8C14.ode	@ltx/en_us_dedes/miscellanea:misc.Ode8
ltx/en_us_dedes/me.m03.d24:meMA.Ode8C14.text	O immaculate Virgin, without departing from the right hand of the Father, the super-essential Son will soon be dwelling in you, so that He might set you, His fair companion, as a Queen at His right hand, and might extend His right hand to all the fallen, and might save us.
ltx/en_us_dedes/me.m03.d24:meMA.Ode8C1H.greekmelody	@ltx/en_us_dedes/he.h.m4:heHE.CheirasEkpetasasDaniil.greekname
ltx/en_us_dedes/me.m03.d24:meMA.Ode8C1H.incipit	@ltx/en_us_dedes/he.h.m4:heHE.CheirasEkpetasasDaniil.incipit
ltx/en_us_dedes/me.m03.d24:meMA.Ode8C1H.melody	@ltx/en_us_dedes/he.h.m4:heHE.CheirasEkpetasasDaniil.melody
ltx/en_us_dedes/me.m03.d24:meMA.Ode8C1H.mode	@ltx/en_us_dedes/miscellanea:misc.Mode4
ltx/en_us_dedes/me.m03.d24:meMA.Ode8C1H.ode	@ltx/en_us_dedes/miscellanea:misc.Ode8
ltx/en_us_dedes/me.m03.d24:meMA.Ode8C1H.text	@ltx/en_us_dedes/he.h.m4:heHE.CheirasEkpetasasDaniil.text
ltx/en_us_dedes/me.m03.d24:meMA.Ode9C11.greekmelody	@ltx/en_us_dedes/he.h.m4:heHE.EvaMenToTisParakois.greekname
ltx/en_us_dedes/me.m03.d24:meMA.Ode9C11.incipit	Eve reaped the destructive…
ltx/en_us_dedes/me.m03.d24:meMA.Ode9C11.melody	@ltx/en_us_dedes/he.h.m4:heHE.EvaMenToTisParakois.notmetered
ltx/en_us_dedes/me.m03.d24:meMA.Ode9C11.mode	@ltx/en_us_dedes/miscellanea:misc.Mode4
ltx/en_us_dedes/me.m03.d24:meMA.Ode9C11.ode	@ltx/en_us_dedes/miscellanea:misc.Ode9
ltx/en_us_dedes/me.m03.d24:meMA.Ode9C11.text	Eve reaped the destructive fruit that brought death; but in you, O Lady, shall the Provider of Immortality, Christ our Sweetness, grow as a fruit. We extol Him, and we glorify you.
ltx/en_us_dedes/me.m03.d24:meMA.Ode9C12.incipit	O Logos, bow the heavens…
ltx/en_us_dedes/me.m03.d24:meMA.Ode9C12.melody	@ltx/en_us_dedes/he.h.m4:heHE.EvaMenToTisParakois.notmetered
ltx/en_us_dedes/me.m03.d24:meMA.Ode9C12.mode	@ltx/en_us_dedes/miscellanea:misc.Mode4
ltx/en_us_dedes/me.m03.d24:meMA.Ode9C12.ode	@ltx/en_us_dedes/miscellanea:misc.Ode9
ltx/en_us_dedes/me.m03.d24:meMA.Ode9C12.text	O Logos, bow the heavens now and come down to us. The Virgin’s womb has been prepared to be a throne for You, where You shall sit as a most handsome King, to raise from its fall the creation of Your right hand.
ltx/en_us_dedes/me.m03.d24:meMA.Ode9C13.incipit	O all-blameless Virgin, Christ desired…
ltx/en_us_dedes/me.m03.d24:meMA.Ode9C13.melody	@ltx/en_us_dedes/he.h.m4:heHE.EvaMenToTisParakois.notmetered
ltx/en_us_dedes/me.m03.d24:meMA.Ode9C13.mode	@ltx/en_us_dedes/miscellanea:misc.Mode4
ltx/en_us_dedes/me.m03.d24:meMA.Ode9C13.ode	@ltx/en_us_dedes/miscellanea:misc.Ode9
ltx/en_us_dedes/me.m03.d24:meMA.Ode9C13.text	O all-blameless Virgin, Christ desired your beauty, and He dwelt in your womb, to rescue the human race from the distortion of the passions, and to restore its ancient beauty. We worship Him, and we glorify you.
ltx/en_us_dedes/me.m03.d24:meMA.Ode9C14.incipit	O pure Virgin, you are…
ltx/en_us_dedes/me.m03.d24:meMA.Ode9C14.melody	@ltx/en_us_dedes/he.h.m4:heHE.EvaMenToTisParakois.notmetered
ltx/en_us_dedes/me.m03.d24:meMA.Ode9C14.mode	@ltx/en_us_dedes/miscellanea:misc.Mode4
ltx/en_us_dedes/me.m03.d24:meMA.Ode9C14.ode	@ltx/en_us_dedes/miscellanea:misc.Ode9
ltx/en_us_dedes/me.m03.d24:meMA.Ode9C14.text	O pure Virgin, you are like unsown ground. By a word receive the heavenly Word, like fruitful wheat, that shall sprout from you, and shall nourish the ends of the world with the bread of knowledge. We worship Him, and we glorify you.
ltx/en_us_dedes/me.m03.d24:meMA.Ode9C1H.greekmelody	@ltx/en_us_dedes/he.h.m4:heHE.EvaMenToTisParakois.greekname
ltx/en_us_dedes/me.m03.d24:meMA.Ode9C1H.incipit	@ltx/en_us_dedes/he.h.m4:heHE.EvaMenToTisParakois.incipit
ltx/en_us_dedes/me.m03.d24:meMA.Ode9C1H.melody	@ltx/en_us_dedes/he.h.m4:heHE.EvaMenToTisParakois.melody
ltx/en_us_dedes/me.m03.d24:meMA.Ode9C1H.mode	@ltx/en_us_dedes/miscellanea:misc.Mode4
ltx/en_us_dedes/me.m03.d24:meMA.Ode9C1H.ode	@ltx/en_us_dedes/miscellanea:misc.Ode9
ltx/en_us_dedes/me.m03.d24:meMA.Ode9C1H.text	@ltx/en_us_dedes/he.h.m4:heHE.EvaMenToTisParakois.text
ltx/en_us_dedes/me.m03.d24:meVE.Apolytikion1.incipit	Today is the prelude of…
ltx/en_us_dedes/me.m03.d24:meVE.Apolytikion1.melody	
ltx/en_us_dedes/me.m03.d24:meVE.Apolytikion1.mode	@ltx/en_us_dedes/miscellanea:misc.Mode4
ltx/en_us_dedes/me.m03.d24:meVE.Apolytikion1.text	Today is the prelude of the joy of the universe, and it incites us to sing the forefestal hymns. For behold, Gabriel is coming, and he will say to the Virgin: Rejoice, Maiden full of grace; the Lord is with you.
ltx/en_us_dedes/me.m03.d24:meVE.MM.Stichera123as567.text	@ltx/en_us_dedes/properties:media.key
ltx/en_us_dedes/me.m03.d24:meVE.SticGlory.incipit	Gabriel annunciates good tidings today…
ltx/en_us_dedes/me.m03.d24:meVE.SticGlory.melody	
ltx/en_us_dedes/me.m03.d24:meVE.SticGlory.mode	@ltx/en_us_dedes/miscellanea:misc.Mode2
ltx/en_us_dedes/me.m03.d24:meVE.SticGlory.text	Gabriel annunciates good tidings today to her who is full of grace: “Rejoice, O Maiden unmarried and unwed. Be not astonished by my strange appearance, nor be dismayed. For an Archangel am I. The serpent once beguiled Eve, but I am now announcing to you the joy. You shall remain inviolate, and yet shall bear the Lord, O Immaculate.”
ltx/en_us_dedes/me.m03.d24:meVE.Stichera01.greekmelody	@ltx/en_us_dedes/he.a.m4:heAU.OsGennaionEnMartysi.greekname
ltx/en_us_dedes/me.m03.d24:meVE.Stichera01.incipit	Now the Archangel Gabriel *…
ltx/en_us_dedes/me.m03.d24:meVE.Stichera01.melody	@ltx/en_us_dedes/he.a.m4:heAU.OsGennaionEnMartysi.name
ltx/en_us_dedes/me.m03.d24:meVE.Stichera01.mode	@ltx/en_us_dedes/miscellanea:misc.Mode4
ltx/en_us_dedes/me.m03.d24:meVE.Stichera01.text	Now the Archangel Gabriel * is entrusted the mystery * which even to Angels was hidden and unknown. * And he shall presently come to you, * the dove that alone is fair * and completely undefiled, * restoration of humankind, * and shall say to you: * “Rejoice, O all-holy one! Make ready through a word to grant admission * into your womb unto God the Word.”
ltx/en_us_dedes/me.m03.d24:meVE.Stichera02.incipit	A most radiant palace has…
ltx/en_us_dedes/me.m03.d24:meVE.Stichera02.melody	@ltx/en_us_dedes/he.a.m4:heAU.OsGennaionEnMartysi.name
ltx/en_us_dedes/me.m03.d24:meVE.Stichera02.mode	@ltx/en_us_dedes/miscellanea:misc.Mode4
ltx/en_us_dedes/me.m03.d24:meVE.Stichera02.text	A most radiant palace has * been prepared just for You, O Lord, * in the undefiled womb of the Maid of God. * Come down and enter it, pitying * Your creature. For he endured * envious hostilities; * he is held in the bondage of * the avenging foe; * he has utterly lost his former beauty, but he anxiously is waiting * for his salvation through Your descent.
ltx/en_us_dedes/me.m03.d24:meVE.Stichera03.incipit	O all-blameless one, presently *…
ltx/en_us_dedes/me.m03.d24:meVE.Stichera03.melody	@ltx/en_us_dedes/he.a.m4:heAU.OsGennaionEnMartysi.name
ltx/en_us_dedes/me.m03.d24:meVE.Stichera03.mode	@ltx/en_us_dedes/miscellanea:misc.Mode4
ltx/en_us_dedes/me.m03.d24:meVE.Stichera03.text	O all-blameless one, presently * shall the Archangel Gabriel * come to you perceptibly and shall say to you, * “Rejoice, deliverance from the curse, * the raising of fallen man! * O rejoice! For only you * among women are rightly called * chosen one of God. * Living cloud of the Sun, rejoice, and welcome in your womb the Uncontainable, * Whose perfect will is to dwell therein.”
