ltx/en_us_dedes/me.m03.d04:meDA.commemoration.first	Memory of St. Gerasimos of Jordan
ltx/en_us_dedes/me.m03.d04:meDA.commemoration.first_name	
ltx/en_us_dedes/me.m03.d04:meDA.commemoration.first_short	Memory of St. Gerasimos of Jordan
ltx/en_us_dedes/me.m03.d04:meDA.commemoration.first_title	@ltx/en_us_dedes/titles:ti.DevoutSaintM
ltx/en_us_dedes/me.m03.d04:meDA.commemoration.full	Memory of our Devout Father Gerasimos of Jordan
ltx/en_us_dedes/me.m03.d04:meDA.commemoration.second_name	
ltx/en_us_dedes/me.m03.d04:meDA.commemoration.second_title	
ltx/en_us_dedes/me.m03.d04:meDA.date	March 4
ltx/en_us_dedes/me.m03.d04:meDA.fordate	for March 4
ltx/en_us_dedes/me.m03.d04:meDA.insert1	
ltx/en_us_dedes/me.m03.d04:meDA.insert2	
ltx/en_us_dedes/me.m03.d04:meDA.note	
ltx/en_us_dedes/me.m03.d04:meDA.pdfcoverdate	March 4,
ltx/en_us_dedes/me.m03.d04:meDA.pdfheaderdate	March 4
ltx/en_us_dedes/me.m03.d04:meHO.commemorations	
ltx/en_us_dedes/me.m03.d04:meHO.note1	
ltx/en_us_dedes/me.m03.d04:meHO.note2	
ltx/en_us_dedes/me.m03.d04:meHO.number	
ltx/en_us_dedes/me.m03.d04:meHO.rank	
ltx/en_us_dedes/me.m03.d04:meLE.commemoration1	Memory of our Devout Father Gerasimos of Jordan.
ltx/en_us_dedes/me.m03.d04:meLE.commemoration2	
ltx/en_us_dedes/me.m03.d04:meLI.Kontakion1.incipit	@ltx/en_us_dedes/me.m03.d04:meMA.Kontakion1ger.incipit
ltx/en_us_dedes/me.m03.d04:meLI.Kontakion1.melody	@ltx/en_us_dedes/me.m03.d04:meMA.Kontakion1ger.melody
ltx/en_us_dedes/me.m03.d04:meLI.Kontakion1.mode	@ltx/en_us_dedes/me.m03.d04:meMA.Kontakion1ger.mode
ltx/en_us_dedes/me.m03.d04:meLI.Kontakion1.text	@ltx/en_us_dedes/me.m03.d04:meMA.Kontakion1ger.text
ltx/en_us_dedes/me.m03.d04:meLI.Megalynarion.text	
ltx/en_us_dedes/me.m03.d04:meMA.C1.acrostic.notice1	
ltx/en_us_dedes/me.m03.d04:meMA.C1.acrostic.text	
ltx/en_us_dedes/me.m03.d04:meMA.C1.acrostic.title	
ltx/en_us_dedes/me.m03.d04:meMA.C1.title	@ltx/en_us_dedes/titles:ti.CanonSaintM
ltx/en_us_dedes/me.m03.d04:meMA.C1.verse	@ltx/en_us_dedes/prayers:pr.verse_SaintM.text
ltx/en_us_dedes/me.m03.d04:meMA.Kontakion1ger.incipit	Like a star from heaven…
ltx/en_us_dedes/me.m03.d04:meMA.Kontakion1ger.melody	@ltx/en_us_dedes/he.a.m4:heAU.EpefanisSimeron.name
ltx/en_us_dedes/me.m03.d04:meMA.Kontakion1ger.mode	@ltx/en_us_dedes/miscellanea:misc.Mode4
ltx/en_us_dedes/me.m03.d04:meMA.Kontakion1ger.poet	@ltx/en_us_dedes/poets:po.Gerasimou
ltx/en_us_dedes/me.m03.d04:meMA.Kontakion1ger.text	Like a star from heaven you arose and shone forth; * with the light of your divine and sacred virtues you made bright * the whole Jordanian wilderness, * devout and God-bearing father Gerasimos.
ltx/en_us_dedes/me.m03.d04:meMA.Ode1C11.greekmelody	@ltx/en_us_dedes/he.h.m4:heHE.AsomaiSoiKyrie.greekname
ltx/en_us_dedes/me.m03.d04:meMA.Ode1C11.incipit	…
ltx/en_us_dedes/me.m03.d04:meMA.Ode1C11.melody	@ltx/en_us_dedes/he.h.m4:heHE.AsomaiSoiKyrie.name
ltx/en_us_dedes/me.m03.d04:meMA.Ode1C11.mode	@ltx/en_us_dedes/miscellanea:misc.Mode4
ltx/en_us_dedes/me.m03.d04:meMA.Ode1C11.ode	@ltx/en_us_dedes/miscellanea:misc.Ode1
ltx/en_us_dedes/me.m03.d04:meMA.Ode1C11.text	
ltx/en_us_dedes/me.m03.d04:meMA.Ode1C12.incipit	…
ltx/en_us_dedes/me.m03.d04:meMA.Ode1C12.melody	@ltx/en_us_dedes/he.h.m4:heHE.AsomaiSoiKyrie.name
ltx/en_us_dedes/me.m03.d04:meMA.Ode1C12.mode	@ltx/en_us_dedes/miscellanea:misc.Mode4
ltx/en_us_dedes/me.m03.d04:meMA.Ode1C12.ode	@ltx/en_us_dedes/miscellanea:misc.Ode1
ltx/en_us_dedes/me.m03.d04:meMA.Ode1C12.text	
ltx/en_us_dedes/me.m03.d04:meMA.Ode1C13.incipit	…
ltx/en_us_dedes/me.m03.d04:meMA.Ode1C13.melody	@ltx/en_us_dedes/he.h.m4:heHE.AsomaiSoiKyrie.name
ltx/en_us_dedes/me.m03.d04:meMA.Ode1C13.mode	@ltx/en_us_dedes/miscellanea:misc.Mode4
ltx/en_us_dedes/me.m03.d04:meMA.Ode1C13.ode	@ltx/en_us_dedes/miscellanea:misc.Ode1
ltx/en_us_dedes/me.m03.d04:meMA.Ode1C13.text	
ltx/en_us_dedes/me.m03.d04:meMA.Ode1C1H.greekmelody	@ltx/en_us_dedes/he.h.m4:heHE.AsomaiSoiKyrie.greekname
ltx/en_us_dedes/me.m03.d04:meMA.Ode1C1H.incipit	@ltx/en_us_dedes/he.h.m4:heHE.AsomaiSoiKyrie.incipit
ltx/en_us_dedes/me.m03.d04:meMA.Ode1C1H.melody	@ltx/en_us_dedes/he.h.m4:heHE.AsomaiSoiKyrie.melody
ltx/en_us_dedes/me.m03.d04:meMA.Ode1C1H.mode	@ltx/en_us_dedes/miscellanea:misc.Mode4
ltx/en_us_dedes/me.m03.d04:meMA.Ode1C1H.ode	@ltx/en_us_dedes/miscellanea:misc.Ode1
ltx/en_us_dedes/me.m03.d04:meMA.Ode1C1H.text	@ltx/en_us_dedes/he.h.m4:heHE.AsomaiSoiKyrie.text
ltx/en_us_dedes/me.m03.d04:meMA.Ode1C1T.incipit	…
ltx/en_us_dedes/me.m03.d04:meMA.Ode1C1T.melody	@ltx/en_us_dedes/he.h.m4:heHE.AsomaiSoiKyrie.name
ltx/en_us_dedes/me.m03.d04:meMA.Ode1C1T.mode	@ltx/en_us_dedes/miscellanea:misc.Mode4
ltx/en_us_dedes/me.m03.d04:meMA.Ode1C1T.ode	@ltx/en_us_dedes/miscellanea:misc.Ode1
ltx/en_us_dedes/me.m03.d04:meMA.Ode1C1T.text	
ltx/en_us_dedes/me.m03.d04:meMA.Ode3C11.greekmelody	@ltx/en_us_dedes/he.h.m4:heHE.EnKyrioTheoMou.greekname
ltx/en_us_dedes/me.m03.d04:meMA.Ode3C11.incipit	…
ltx/en_us_dedes/me.m03.d04:meMA.Ode3C11.melody	@ltx/en_us_dedes/he.h.m4:heHE.EnKyrioTheoMou.name
ltx/en_us_dedes/me.m03.d04:meMA.Ode3C11.mode	@ltx/en_us_dedes/miscellanea:misc.Mode4
ltx/en_us_dedes/me.m03.d04:meMA.Ode3C11.ode	@ltx/en_us_dedes/miscellanea:misc.Ode3
ltx/en_us_dedes/me.m03.d04:meMA.Ode3C11.text	
ltx/en_us_dedes/me.m03.d04:meMA.Ode3C12.incipit	…
ltx/en_us_dedes/me.m03.d04:meMA.Ode3C12.melody	@ltx/en_us_dedes/he.h.m4:heHE.EnKyrioTheoMou.name
ltx/en_us_dedes/me.m03.d04:meMA.Ode3C12.mode	@ltx/en_us_dedes/miscellanea:misc.Mode4
ltx/en_us_dedes/me.m03.d04:meMA.Ode3C12.ode	@ltx/en_us_dedes/miscellanea:misc.Ode3
ltx/en_us_dedes/me.m03.d04:meMA.Ode3C12.text	
ltx/en_us_dedes/me.m03.d04:meMA.Ode3C13.incipit	…
ltx/en_us_dedes/me.m03.d04:meMA.Ode3C13.melody	@ltx/en_us_dedes/he.h.m4:heHE.EnKyrioTheoMou.name
ltx/en_us_dedes/me.m03.d04:meMA.Ode3C13.mode	@ltx/en_us_dedes/miscellanea:misc.Mode4
ltx/en_us_dedes/me.m03.d04:meMA.Ode3C13.ode	@ltx/en_us_dedes/miscellanea:misc.Ode3
ltx/en_us_dedes/me.m03.d04:meMA.Ode3C13.text	
ltx/en_us_dedes/me.m03.d04:meMA.Ode3C1H.greekmelody	@ltx/en_us_dedes/he.h.m4:heHE.EnKyrioTheoMou.greekname
ltx/en_us_dedes/me.m03.d04:meMA.Ode3C1H.incipit	@ltx/en_us_dedes/he.h.m4:heHE.EnKyrioTheoMou.incipit
ltx/en_us_dedes/me.m03.d04:meMA.Ode3C1H.melody	@ltx/en_us_dedes/he.h.m4:heHE.EnKyrioTheoMou.melody
ltx/en_us_dedes/me.m03.d04:meMA.Ode3C1H.mode	@ltx/en_us_dedes/miscellanea:misc.Mode4
ltx/en_us_dedes/me.m03.d04:meMA.Ode3C1H.ode	@ltx/en_us_dedes/miscellanea:misc.Ode3
ltx/en_us_dedes/me.m03.d04:meMA.Ode3C1H.text	@ltx/en_us_dedes/he.h.m4:heHE.EnKyrioTheoMou.text
ltx/en_us_dedes/me.m03.d04:meMA.Ode3C1T.incipit	…
ltx/en_us_dedes/me.m03.d04:meMA.Ode3C1T.melody	@ltx/en_us_dedes/he.h.m4:heHE.EnKyrioTheoMou.name
ltx/en_us_dedes/me.m03.d04:meMA.Ode3C1T.mode	@ltx/en_us_dedes/miscellanea:misc.Mode4
ltx/en_us_dedes/me.m03.d04:meMA.Ode3C1T.ode	@ltx/en_us_dedes/miscellanea:misc.Ode3
ltx/en_us_dedes/me.m03.d04:meMA.Ode3C1T.text	
ltx/en_us_dedes/me.m03.d04:meMA.Ode3Kathisma1.greekmelody	@ltx/en_us_dedes/he.a.m1:heAU.TouLithouSfragisthentos.greekname
ltx/en_us_dedes/me.m03.d04:meMA.Ode3Kathisma1.incipit	…
ltx/en_us_dedes/me.m03.d04:meMA.Ode3Kathisma1.melody	@ltx/en_us_dedes/he.a.m1:heAU.TouLithouSfragisthentos.name
ltx/en_us_dedes/me.m03.d04:meMA.Ode3Kathisma1.mode	@ltx/en_us_dedes/miscellanea:misc.Mode1
ltx/en_us_dedes/me.m03.d04:meMA.Ode3Kathisma1.text	
ltx/en_us_dedes/me.m03.d04:meMA.Ode3KathismaSt.incipit	…
ltx/en_us_dedes/me.m03.d04:meMA.Ode3KathismaSt.melody	@ltx/en_us_dedes/he.a.m1:heAU.TouLithouSfragisthentos.name
ltx/en_us_dedes/me.m03.d04:meMA.Ode3KathismaSt.mode	@ltx/en_us_dedes/miscellanea:misc.Mode1
ltx/en_us_dedes/me.m03.d04:meMA.Ode3KathismaSt.text	
ltx/en_us_dedes/me.m03.d04:meMA.Ode3KathismaT.incipit	Extend your holy hands, with…
ltx/en_us_dedes/me.m03.d04:meMA.Ode3KathismaT.melody	@ltx/en_us_dedes/he.a.m1:heAU.TouLithouSfragisthentos.name
ltx/en_us_dedes/me.m03.d04:meMA.Ode3KathismaT.mode	@ltx/en_us_dedes/miscellanea:misc.Mode1
ltx/en_us_dedes/me.m03.d04:meMA.Ode3KathismaT.text	Extend your holy hands, with which you held our Creator, * imploring Him who graciously for us became incarnate, * all-holy Virgin Mother, and entreat * for us who are extolling you with love, * that He free us from temptations, * from passions, and from dangers, as we sing to you: * Glory to Him who dwelt inside of you! * Glory to Him who came forth from you! * Glory be to Him who through your childbirth has set us free!
ltx/en_us_dedes/me.m03.d04:meMA.Ode4C11.greekmelody	@ltx/en_us_dedes/he.h.m4:heHE.TisSisEpiGis.greekname
ltx/en_us_dedes/me.m03.d04:meMA.Ode4C11.incipit	…
ltx/en_us_dedes/me.m03.d04:meMA.Ode4C11.melody	@ltx/en_us_dedes/he.h.m4:heHE.TisSisEpiGis.name
ltx/en_us_dedes/me.m03.d04:meMA.Ode4C11.mode	@ltx/en_us_dedes/miscellanea:misc.Mode4
ltx/en_us_dedes/me.m03.d04:meMA.Ode4C11.ode	@ltx/en_us_dedes/miscellanea:misc.Ode4
ltx/en_us_dedes/me.m03.d04:meMA.Ode4C11.text	
ltx/en_us_dedes/me.m03.d04:meMA.Ode4C12.incipit	…
ltx/en_us_dedes/me.m03.d04:meMA.Ode4C12.melody	@ltx/en_us_dedes/he.h.m4:heHE.TisSisEpiGis.name
ltx/en_us_dedes/me.m03.d04:meMA.Ode4C12.mode	@ltx/en_us_dedes/miscellanea:misc.Mode4
ltx/en_us_dedes/me.m03.d04:meMA.Ode4C12.ode	@ltx/en_us_dedes/miscellanea:misc.Ode4
ltx/en_us_dedes/me.m03.d04:meMA.Ode4C12.text	
ltx/en_us_dedes/me.m03.d04:meMA.Ode4C13.incipit	…
ltx/en_us_dedes/me.m03.d04:meMA.Ode4C13.melody	@ltx/en_us_dedes/he.h.m4:heHE.TisSisEpiGis.name
ltx/en_us_dedes/me.m03.d04:meMA.Ode4C13.mode	@ltx/en_us_dedes/miscellanea:misc.Mode4
ltx/en_us_dedes/me.m03.d04:meMA.Ode4C13.ode	@ltx/en_us_dedes/miscellanea:misc.Ode4
ltx/en_us_dedes/me.m03.d04:meMA.Ode4C13.text	
ltx/en_us_dedes/me.m03.d04:meMA.Ode4C1H.greekmelody	@ltx/en_us_dedes/he.h.m4:heHE.TisSisEpiGis.greekname
ltx/en_us_dedes/me.m03.d04:meMA.Ode4C1H.incipit	@ltx/en_us_dedes/he.h.m4:heHE.TisSisEpiGis.incipit
ltx/en_us_dedes/me.m03.d04:meMA.Ode4C1H.melody	@ltx/en_us_dedes/he.h.m4:heHE.TisSisEpiGis.melody
ltx/en_us_dedes/me.m03.d04:meMA.Ode4C1H.mode	@ltx/en_us_dedes/miscellanea:misc.Mode4
ltx/en_us_dedes/me.m03.d04:meMA.Ode4C1H.ode	@ltx/en_us_dedes/miscellanea:misc.Ode4
ltx/en_us_dedes/me.m03.d04:meMA.Ode4C1H.text	@ltx/en_us_dedes/he.h.m4:heHE.TisSisEpiGis.text
ltx/en_us_dedes/me.m03.d04:meMA.Ode4C1T.incipit	…
ltx/en_us_dedes/me.m03.d04:meMA.Ode4C1T.melody	@ltx/en_us_dedes/he.h.m4:heHE.TisSisEpiGis.name
ltx/en_us_dedes/me.m03.d04:meMA.Ode4C1T.mode	@ltx/en_us_dedes/miscellanea:misc.Mode4
ltx/en_us_dedes/me.m03.d04:meMA.Ode4C1T.ode	@ltx/en_us_dedes/miscellanea:misc.Ode4
ltx/en_us_dedes/me.m03.d04:meMA.Ode4C1T.text	
ltx/en_us_dedes/me.m03.d04:meMA.Ode5C11.greekmelody	@ltx/en_us_dedes/he.h.m4:heHE.OAnateilasToFos.greekname
ltx/en_us_dedes/me.m03.d04:meMA.Ode5C11.incipit	…
ltx/en_us_dedes/me.m03.d04:meMA.Ode5C11.melody	@ltx/en_us_dedes/he.h.m4:heHE.OAnateilasToFos.name
ltx/en_us_dedes/me.m03.d04:meMA.Ode5C11.mode	@ltx/en_us_dedes/miscellanea:misc.Mode4
ltx/en_us_dedes/me.m03.d04:meMA.Ode5C11.ode	@ltx/en_us_dedes/miscellanea:misc.Ode5
ltx/en_us_dedes/me.m03.d04:meMA.Ode5C11.text	
ltx/en_us_dedes/me.m03.d04:meMA.Ode5C12.incipit	…
ltx/en_us_dedes/me.m03.d04:meMA.Ode5C12.melody	@ltx/en_us_dedes/he.h.m4:heHE.OAnateilasToFos.name
ltx/en_us_dedes/me.m03.d04:meMA.Ode5C12.mode	@ltx/en_us_dedes/miscellanea:misc.Mode4
ltx/en_us_dedes/me.m03.d04:meMA.Ode5C12.ode	@ltx/en_us_dedes/miscellanea:misc.Ode5
ltx/en_us_dedes/me.m03.d04:meMA.Ode5C12.text	
ltx/en_us_dedes/me.m03.d04:meMA.Ode5C13.incipit	…
ltx/en_us_dedes/me.m03.d04:meMA.Ode5C13.melody	@ltx/en_us_dedes/he.h.m4:heHE.OAnateilasToFos.name
ltx/en_us_dedes/me.m03.d04:meMA.Ode5C13.mode	@ltx/en_us_dedes/miscellanea:misc.Mode4
ltx/en_us_dedes/me.m03.d04:meMA.Ode5C13.ode	@ltx/en_us_dedes/miscellanea:misc.Ode5
ltx/en_us_dedes/me.m03.d04:meMA.Ode5C13.text	
ltx/en_us_dedes/me.m03.d04:meMA.Ode5C1H.greekmelody	@ltx/en_us_dedes/he.h.m4:heHE.OAnateilasToFos.greekname
ltx/en_us_dedes/me.m03.d04:meMA.Ode5C1H.incipit	@ltx/en_us_dedes/he.h.m4:heHE.OAnateilasToFos.incipit
ltx/en_us_dedes/me.m03.d04:meMA.Ode5C1H.melody	@ltx/en_us_dedes/he.h.m4:heHE.OAnateilasToFos.melody
ltx/en_us_dedes/me.m03.d04:meMA.Ode5C1H.mode	@ltx/en_us_dedes/miscellanea:misc.Mode4
ltx/en_us_dedes/me.m03.d04:meMA.Ode5C1H.ode	@ltx/en_us_dedes/miscellanea:misc.Ode5
ltx/en_us_dedes/me.m03.d04:meMA.Ode5C1H.text	@ltx/en_us_dedes/he.h.m4:heHE.OAnateilasToFos.text
ltx/en_us_dedes/me.m03.d04:meMA.Ode5C1T.incipit	…
ltx/en_us_dedes/me.m03.d04:meMA.Ode5C1T.melody	@ltx/en_us_dedes/he.h.m4:heHE.OAnateilasToFos.name
ltx/en_us_dedes/me.m03.d04:meMA.Ode5C1T.mode	@ltx/en_us_dedes/miscellanea:misc.Mode4
ltx/en_us_dedes/me.m03.d04:meMA.Ode5C1T.ode	@ltx/en_us_dedes/miscellanea:misc.Ode5
ltx/en_us_dedes/me.m03.d04:meMA.Ode5C1T.text	
ltx/en_us_dedes/me.m03.d04:meMA.Ode6C11.greekmelody	@ltx/en_us_dedes/he.h.m4:heHE.OsIonanTonProfitin.greekname
ltx/en_us_dedes/me.m03.d04:meMA.Ode6C11.incipit	…
ltx/en_us_dedes/me.m03.d04:meMA.Ode6C11.melody	@ltx/en_us_dedes/he.h.m4:heHE.OsIonanTonProfitin.name
ltx/en_us_dedes/me.m03.d04:meMA.Ode6C11.mode	@ltx/en_us_dedes/miscellanea:misc.Mode4
ltx/en_us_dedes/me.m03.d04:meMA.Ode6C11.ode	@ltx/en_us_dedes/miscellanea:misc.Ode6
ltx/en_us_dedes/me.m03.d04:meMA.Ode6C11.text	
ltx/en_us_dedes/me.m03.d04:meMA.Ode6C12.incipit	…
ltx/en_us_dedes/me.m03.d04:meMA.Ode6C12.melody	@ltx/en_us_dedes/he.h.m4:heHE.OsIonanTonProfitin.name
ltx/en_us_dedes/me.m03.d04:meMA.Ode6C12.mode	@ltx/en_us_dedes/miscellanea:misc.Mode4
ltx/en_us_dedes/me.m03.d04:meMA.Ode6C12.ode	@ltx/en_us_dedes/miscellanea:misc.Ode6
ltx/en_us_dedes/me.m03.d04:meMA.Ode6C12.text	
ltx/en_us_dedes/me.m03.d04:meMA.Ode6C13.incipit	…
ltx/en_us_dedes/me.m03.d04:meMA.Ode6C13.melody	@ltx/en_us_dedes/he.h.m4:heHE.OsIonanTonProfitin.name
ltx/en_us_dedes/me.m03.d04:meMA.Ode6C13.mode	@ltx/en_us_dedes/miscellanea:misc.Mode4
ltx/en_us_dedes/me.m03.d04:meMA.Ode6C13.ode	@ltx/en_us_dedes/miscellanea:misc.Ode6
ltx/en_us_dedes/me.m03.d04:meMA.Ode6C13.text	
ltx/en_us_dedes/me.m03.d04:meMA.Ode6C1H.greekmelody	@ltx/en_us_dedes/he.h.m4:heHE.OsIonanTonProfitin.greekname
ltx/en_us_dedes/me.m03.d04:meMA.Ode6C1H.incipit	@ltx/en_us_dedes/he.h.m4:heHE.OsIonanTonProfitin.incipit
ltx/en_us_dedes/me.m03.d04:meMA.Ode6C1H.melody	@ltx/en_us_dedes/he.h.m4:heHE.OsIonanTonProfitin.melody
ltx/en_us_dedes/me.m03.d04:meMA.Ode6C1H.mode	@ltx/en_us_dedes/miscellanea:misc.Mode4
ltx/en_us_dedes/me.m03.d04:meMA.Ode6C1H.ode	@ltx/en_us_dedes/miscellanea:misc.Ode6
ltx/en_us_dedes/me.m03.d04:meMA.Ode6C1H.text	@ltx/en_us_dedes/he.h.m4:heHE.OsIonanTonProfitin.text
ltx/en_us_dedes/me.m03.d04:meMA.Ode6C1T.incipit	…
ltx/en_us_dedes/me.m03.d04:meMA.Ode6C1T.melody	@ltx/en_us_dedes/he.h.m4:heHE.OsIonanTonProfitin.name
ltx/en_us_dedes/me.m03.d04:meMA.Ode6C1T.mode	@ltx/en_us_dedes/miscellanea:misc.Mode4
ltx/en_us_dedes/me.m03.d04:meMA.Ode6C1T.ode	@ltx/en_us_dedes/miscellanea:misc.Ode6
ltx/en_us_dedes/me.m03.d04:meMA.Ode6C1T.text	
ltx/en_us_dedes/me.m03.d04:meMA.Ode7C11.greekmelody	@ltx/en_us_dedes/he.h.m4:heHE.OEnToOreiToMosei.greekname
ltx/en_us_dedes/me.m03.d04:meMA.Ode7C11.incipit	…
ltx/en_us_dedes/me.m03.d04:meMA.Ode7C11.melody	@ltx/en_us_dedes/he.h.m4:heHE.OEnToOreiToMosei.name
ltx/en_us_dedes/me.m03.d04:meMA.Ode7C11.mode	@ltx/en_us_dedes/miscellanea:misc.Mode4
ltx/en_us_dedes/me.m03.d04:meMA.Ode7C11.ode	@ltx/en_us_dedes/miscellanea:misc.Ode7
ltx/en_us_dedes/me.m03.d04:meMA.Ode7C11.text	
ltx/en_us_dedes/me.m03.d04:meMA.Ode7C12.incipit	…
ltx/en_us_dedes/me.m03.d04:meMA.Ode7C12.melody	@ltx/en_us_dedes/he.h.m4:heHE.OEnToOreiToMosei.name
ltx/en_us_dedes/me.m03.d04:meMA.Ode7C12.mode	@ltx/en_us_dedes/miscellanea:misc.Mode4
ltx/en_us_dedes/me.m03.d04:meMA.Ode7C12.ode	@ltx/en_us_dedes/miscellanea:misc.Ode7
ltx/en_us_dedes/me.m03.d04:meMA.Ode7C12.text	
ltx/en_us_dedes/me.m03.d04:meMA.Ode7C13.incipit	…
ltx/en_us_dedes/me.m03.d04:meMA.Ode7C13.melody	@ltx/en_us_dedes/he.h.m4:heHE.OEnToOreiToMosei.name
ltx/en_us_dedes/me.m03.d04:meMA.Ode7C13.mode	@ltx/en_us_dedes/miscellanea:misc.Mode4
ltx/en_us_dedes/me.m03.d04:meMA.Ode7C13.ode	@ltx/en_us_dedes/miscellanea:misc.Ode7
ltx/en_us_dedes/me.m03.d04:meMA.Ode7C13.text	
ltx/en_us_dedes/me.m03.d04:meMA.Ode7C1H.greekmelody	@ltx/en_us_dedes/he.h.m4:heHE.OEnToOreiToMosei.greekname
ltx/en_us_dedes/me.m03.d04:meMA.Ode7C1H.incipit	@ltx/en_us_dedes/he.h.m4:heHE.OEnToOreiToMosei.incipit
ltx/en_us_dedes/me.m03.d04:meMA.Ode7C1H.melody	@ltx/en_us_dedes/he.h.m4:heHE.OEnToOreiToMosei.melody
ltx/en_us_dedes/me.m03.d04:meMA.Ode7C1H.mode	@ltx/en_us_dedes/miscellanea:misc.Mode4
ltx/en_us_dedes/me.m03.d04:meMA.Ode7C1H.ode	@ltx/en_us_dedes/miscellanea:misc.Ode7
ltx/en_us_dedes/me.m03.d04:meMA.Ode7C1H.text	@ltx/en_us_dedes/he.h.m4:heHE.OEnToOreiToMosei.text
ltx/en_us_dedes/me.m03.d04:meMA.Ode7C1T.incipit	…
ltx/en_us_dedes/me.m03.d04:meMA.Ode7C1T.melody	@ltx/en_us_dedes/he.h.m4:heHE.OEnToOreiToMosei.name
ltx/en_us_dedes/me.m03.d04:meMA.Ode7C1T.mode	@ltx/en_us_dedes/miscellanea:misc.Mode4
ltx/en_us_dedes/me.m03.d04:meMA.Ode7C1T.ode	@ltx/en_us_dedes/miscellanea:misc.Ode7
ltx/en_us_dedes/me.m03.d04:meMA.Ode7C1T.text	
ltx/en_us_dedes/me.m03.d04:meMA.Ode8C11.greekmelody	@ltx/en_us_dedes/he.h.m4:heHE.TonVasileaChriston.greekname
ltx/en_us_dedes/me.m03.d04:meMA.Ode8C11.incipit	…
ltx/en_us_dedes/me.m03.d04:meMA.Ode8C11.melody	@ltx/en_us_dedes/he.h.m4:heHE.TonVasileaChriston.name
ltx/en_us_dedes/me.m03.d04:meMA.Ode8C11.mode	@ltx/en_us_dedes/miscellanea:misc.Mode4
ltx/en_us_dedes/me.m03.d04:meMA.Ode8C11.ode	@ltx/en_us_dedes/miscellanea:misc.Ode8
ltx/en_us_dedes/me.m03.d04:meMA.Ode8C11.text	
ltx/en_us_dedes/me.m03.d04:meMA.Ode8C12.incipit	…
ltx/en_us_dedes/me.m03.d04:meMA.Ode8C12.melody	@ltx/en_us_dedes/he.h.m4:heHE.TonVasileaChriston.name
ltx/en_us_dedes/me.m03.d04:meMA.Ode8C12.mode	@ltx/en_us_dedes/miscellanea:misc.Mode4
ltx/en_us_dedes/me.m03.d04:meMA.Ode8C12.ode	@ltx/en_us_dedes/miscellanea:misc.Ode8
ltx/en_us_dedes/me.m03.d04:meMA.Ode8C12.text	
ltx/en_us_dedes/me.m03.d04:meMA.Ode8C13.incipit	…
ltx/en_us_dedes/me.m03.d04:meMA.Ode8C13.melody	@ltx/en_us_dedes/he.h.m4:heHE.TonVasileaChriston.name
ltx/en_us_dedes/me.m03.d04:meMA.Ode8C13.mode	@ltx/en_us_dedes/miscellanea:misc.Mode4
ltx/en_us_dedes/me.m03.d04:meMA.Ode8C13.ode	@ltx/en_us_dedes/miscellanea:misc.Ode8
ltx/en_us_dedes/me.m03.d04:meMA.Ode8C13.text	
ltx/en_us_dedes/me.m03.d04:meMA.Ode8C1H.greekmelody	@ltx/en_us_dedes/he.h.m4:heHE.TonVasileaChriston.greekname
ltx/en_us_dedes/me.m03.d04:meMA.Ode8C1H.incipit	@ltx/en_us_dedes/he.h.m4:heHE.TonVasileaChriston.incipit
ltx/en_us_dedes/me.m03.d04:meMA.Ode8C1H.melody	@ltx/en_us_dedes/he.h.m4:heHE.TonVasileaChriston.melody
ltx/en_us_dedes/me.m03.d04:meMA.Ode8C1H.mode	@ltx/en_us_dedes/miscellanea:misc.Mode4
ltx/en_us_dedes/me.m03.d04:meMA.Ode8C1H.ode	@ltx/en_us_dedes/miscellanea:misc.Ode8
ltx/en_us_dedes/me.m03.d04:meMA.Ode8C1H.text	@ltx/en_us_dedes/he.h.m4:heHE.TonVasileaChriston.text
ltx/en_us_dedes/me.m03.d04:meMA.Ode8C1T.incipit	…
ltx/en_us_dedes/me.m03.d04:meMA.Ode8C1T.melody	@ltx/en_us_dedes/he.h.m4:heHE.TonVasileaChriston.name
ltx/en_us_dedes/me.m03.d04:meMA.Ode8C1T.mode	@ltx/en_us_dedes/miscellanea:misc.Mode4
ltx/en_us_dedes/me.m03.d04:meMA.Ode8C1T.ode	@ltx/en_us_dedes/miscellanea:misc.Ode8
ltx/en_us_dedes/me.m03.d04:meMA.Ode8C1T.text	
ltx/en_us_dedes/me.m03.d04:meMA.Ode9C11.greekmelody	@ltx/en_us_dedes/he.h.m4:heHE.TonAsporonTokonSou.greekname
ltx/en_us_dedes/me.m03.d04:meMA.Ode9C11.incipit	…
ltx/en_us_dedes/me.m03.d04:meMA.Ode9C11.melody	@ltx/en_us_dedes/he.h.m4:heHE.TonAsporonTokonSou.name
ltx/en_us_dedes/me.m03.d04:meMA.Ode9C11.mode	@ltx/en_us_dedes/miscellanea:misc.Mode4
ltx/en_us_dedes/me.m03.d04:meMA.Ode9C11.ode	@ltx/en_us_dedes/miscellanea:misc.Ode9
ltx/en_us_dedes/me.m03.d04:meMA.Ode9C11.text	
ltx/en_us_dedes/me.m03.d04:meMA.Ode9C12.incipit	…
ltx/en_us_dedes/me.m03.d04:meMA.Ode9C12.melody	@ltx/en_us_dedes/he.h.m4:heHE.TonAsporonTokonSou.name
ltx/en_us_dedes/me.m03.d04:meMA.Ode9C12.mode	@ltx/en_us_dedes/miscellanea:misc.Mode4
ltx/en_us_dedes/me.m03.d04:meMA.Ode9C12.ode	@ltx/en_us_dedes/miscellanea:misc.Ode9
ltx/en_us_dedes/me.m03.d04:meMA.Ode9C12.text	
ltx/en_us_dedes/me.m03.d04:meMA.Ode9C13.incipit	…
ltx/en_us_dedes/me.m03.d04:meMA.Ode9C13.melody	@ltx/en_us_dedes/he.h.m4:heHE.TonAsporonTokonSou.name
ltx/en_us_dedes/me.m03.d04:meMA.Ode9C13.mode	@ltx/en_us_dedes/miscellanea:misc.Mode4
ltx/en_us_dedes/me.m03.d04:meMA.Ode9C13.ode	@ltx/en_us_dedes/miscellanea:misc.Ode9
ltx/en_us_dedes/me.m03.d04:meMA.Ode9C13.text	
ltx/en_us_dedes/me.m03.d04:meMA.Ode9C14.incipit	…
ltx/en_us_dedes/me.m03.d04:meMA.Ode9C14.melody	@ltx/en_us_dedes/he.h.m4:heHE.TonAsporonTokonSou.name
ltx/en_us_dedes/me.m03.d04:meMA.Ode9C14.mode	@ltx/en_us_dedes/miscellanea:misc.Mode4
ltx/en_us_dedes/me.m03.d04:meMA.Ode9C14.ode	@ltx/en_us_dedes/miscellanea:misc.Ode9
ltx/en_us_dedes/me.m03.d04:meMA.Ode9C14.text	
ltx/en_us_dedes/me.m03.d04:meMA.Ode9C1H.greekmelody	@ltx/en_us_dedes/he.h.m4:heHE.TonAsporonTokonSou.greekname
ltx/en_us_dedes/me.m03.d04:meMA.Ode9C1H.incipit	@ltx/en_us_dedes/he.h.m4:heHE.TonAsporonTokonSou.incipit
ltx/en_us_dedes/me.m03.d04:meMA.Ode9C1H.melody	@ltx/en_us_dedes/he.h.m4:heHE.TonAsporonTokonSou.melody
ltx/en_us_dedes/me.m03.d04:meMA.Ode9C1H.mode	@ltx/en_us_dedes/miscellanea:misc.Mode4
ltx/en_us_dedes/me.m03.d04:meMA.Ode9C1H.ode	@ltx/en_us_dedes/miscellanea:misc.Ode9
ltx/en_us_dedes/me.m03.d04:meMA.Ode9C1H.text	@ltx/en_us_dedes/he.h.m4:heHE.TonAsporonTokonSou.text
ltx/en_us_dedes/me.m03.d04:meMA.Ode9C1T.incipit	…
ltx/en_us_dedes/me.m03.d04:meMA.Ode9C1T.melody	
ltx/en_us_dedes/me.m03.d04:meMA.Ode9C1T.mode	@ltx/en_us_dedes/miscellanea:misc.Mode4
ltx/en_us_dedes/me.m03.d04:meMA.Ode9C1T.ode	@ltx/en_us_dedes/miscellanea:misc.Ode9
ltx/en_us_dedes/me.m03.d04:meMA.Ode9C1T.text	
ltx/en_us_dedes/me.m03.d04:meMA.Oikos12ger.text	
ltx/en_us_dedes/me.m03.d04:meMA.Oikos13ger.text	
ltx/en_us_dedes/me.m03.d04:meMA.Oikos14ger.text	
ltx/en_us_dedes/me.m03.d04:meMA.Oikos15ger.text	
ltx/en_us_dedes/me.m03.d04:meMA.Oikos16ger.text	
ltx/en_us_dedes/me.m03.d04:meMA.Oikos17ger.text	
ltx/en_us_dedes/me.m03.d04:meMA.Oikos18ger.text	
ltx/en_us_dedes/me.m03.d04:meMA.Oikos1ger.text	
ltx/en_us_dedes/me.m03.d04:meVE.Apolytikion1ger.greekmelody	@ltx/en_us_dedes/he.a.m4:heAU.TachyProkatalave.greekname
ltx/en_us_dedes/me.m03.d04:meVE.Apolytikion1ger.incipit	…
ltx/en_us_dedes/me.m03.d04:meVE.Apolytikion1ger.melody	@ltx/en_us_dedes/he.a.m4:heAU.TachyProkatalave.name
ltx/en_us_dedes/me.m03.d04:meVE.Apolytikion1ger.mode	@ltx/en_us_dedes/miscellanea:misc.Mode4
ltx/en_us_dedes/me.m03.d04:meVE.Apolytikion1ger.poet	@ltx/en_us_dedes/poets:po.Gerasimou
ltx/en_us_dedes/me.m03.d04:meVE.Apolytikion1ger.text	
ltx/en_us_dedes/me.m03.d04:meVE.SticStavrotheotokion.greekmelody	@ltx/en_us_dedes/he.a.m8:heAU.OTouParadoxou.greekname
ltx/en_us_dedes/me.m03.d04:meVE.SticStavrotheotokion.incipit	…
ltx/en_us_dedes/me.m03.d04:meVE.SticStavrotheotokion.melody	@ltx/en_us_dedes/he.a.m8:heAU.OTouParadoxou.name
ltx/en_us_dedes/me.m03.d04:meVE.SticStavrotheotokion.mode	@ltx/en_us_dedes/miscellanea:misc.Mode8
ltx/en_us_dedes/me.m03.d04:meVE.SticStavrotheotokion.text	
ltx/en_us_dedes/me.m03.d04:meVE.SticTheotokion.greekmelody	@ltx/en_us_dedes/he.a.m8:heAU.OTouParadoxou.greekname
ltx/en_us_dedes/me.m03.d04:meVE.SticTheotokion.incipit	O all-immaculate Maid, we pray…
ltx/en_us_dedes/me.m03.d04:meVE.SticTheotokion.melody	@ltx/en_us_dedes/he.a.m8:heAU.OTouParadoxou.name
ltx/en_us_dedes/me.m03.d04:meVE.SticTheotokion.mode	@ltx/en_us_dedes/miscellanea:misc.Mode8
ltx/en_us_dedes/me.m03.d04:meVE.SticTheotokion.text	O all-immaculate Maid, we pray * to you our aid and defense. * We are caught in adversity. * Do not overlook us now, * lest we all parish utterly. * But quickly come to our aid and rescue us * out of the trouble and wrath besetting us. * You, O immaculate * Theotokos, glorified by God, indeed * for your servants are a fortress unassailable.
ltx/en_us_dedes/me.m03.d04:meVE.Stichera01.greekmelody	@ltx/en_us_dedes/he.a.m8:heAU.OTouParadoxou.greekname
ltx/en_us_dedes/me.m03.d04:meVE.Stichera01.incipit	Godly-minded Saint Gerasimos, when you…
ltx/en_us_dedes/me.m03.d04:meVE.Stichera01.melody	@ltx/en_us_dedes/he.a.m8:heAU.OTouParadoxou.name
ltx/en_us_dedes/me.m03.d04:meVE.Stichera01.mode	@ltx/en_us_dedes/miscellanea:misc.Mode8
ltx/en_us_dedes/me.m03.d04:meVE.Stichera01.text	Godly-minded Saint Gerasimos, when you had lifted your mind * up to God, you detested all * the unstable character * and confusion of things mundane. * And when by faith you had taken up your cross, * you followed after the Lord who sees all things; * for you prepared yourself, * subjecting to reason the unruly flesh * through ascetic practices, * by the divine Spirit’s might.
ltx/en_us_dedes/me.m03.d04:meVE.Stichera02.incipit	Holy and devout Gerasimos, *…
ltx/en_us_dedes/me.m03.d04:meVE.Stichera02.melody	@ltx/en_us_dedes/he.a.m8:heAU.OTouParadoxou.name
ltx/en_us_dedes/me.m03.d04:meVE.Stichera02.mode	@ltx/en_us_dedes/miscellanea:misc.Mode8
ltx/en_us_dedes/me.m03.d04:meVE.Stichera02.text	Holy and devout Gerasimos, * you dwelt continually * in the deserts and caves and dens, * on the mountains, by your faith, * and you earnestly sought after God. * And when you found Him, for whom you greatly longed, * your never-wavering soul was given strength, * through the divine ascents * that you had each day; and thus you led to Christ * thousands of monastics, who were being saved through you.
ltx/en_us_dedes/me.m03.d04:meVE.Stichera03.incipit	Father, you passed your entire…
ltx/en_us_dedes/me.m03.d04:meVE.Stichera03.melody	@ltx/en_us_dedes/he.a.m8:heAU.OTouParadoxou.name
ltx/en_us_dedes/me.m03.d04:meVE.Stichera03.mode	@ltx/en_us_dedes/miscellanea:misc.Mode8
ltx/en_us_dedes/me.m03.d04:meVE.Stichera03.text	Father, you passed your entire life * in utmost stillness alone, * and in mourning and tears of grief. * You became the trainer of * pious monks, by their faith in God. * The lack of personal wealth adorned your soul, * and you looked handsome in righteous self-control. * You were a foreigner * and a sojourner on earth, O blest of God. * Therefore you have rightly found delight and rest on high.
