ltx/en_us_dedes/me.m12.dBC:meDA.commemoration.first	Sunday Before Christmas
ltx/en_us_dedes/me.m12.dBC:meDA.commemoration.first_name	
ltx/en_us_dedes/me.m12.dBC:meDA.commemoration.first_short	Sunday Before Christmas
ltx/en_us_dedes/me.m12.dBC:meDA.commemoration.first_title	@ltx/en_us_dedes/titles:ti.Fathers
ltx/en_us_dedes/me.m12.dBC:meDA.commemoration.full	Sunday Before Christmas
ltx/en_us_dedes/me.m12.dBC:meDA.commemoration.second_name	
ltx/en_us_dedes/me.m12.dBC:meDA.commemoration.second_title	
ltx/en_us_dedes/me.m12.dBC:meDA.date	December 18-24
ltx/en_us_dedes/me.m12.dBC:meDA.fordate	for December 18-24
ltx/en_us_dedes/me.m12.dBC:meDA.insert1	all those who from the beginning of time were well-pleasing to God, from Adam to Joseph the Betrothed of the Most Holy Theotokos,
ltx/en_us_dedes/me.m12.dBC:meDA.insert2	whose memory we observe;
ltx/en_us_dedes/me.m12.dBC:meDA.note	
ltx/en_us_dedes/me.m12.dBC:meDA.pdfcoverdate	December 18-24,
ltx/en_us_dedes/me.m12.dBC:meDA.pdfheaderdate	December 18-24
ltx/en_us_dedes/me.m12.dBC:meHO.commemorations	
ltx/en_us_dedes/me.m12.dBC:meHO.note1	
ltx/en_us_dedes/me.m12.dBC:meHO.note2	
ltx/en_us_dedes/me.m12.dBC:meHO.number	
ltx/en_us_dedes/me.m12.dBC:meHO.rank	
ltx/en_us_dedes/me.m12.dBC:meLE.commemoration1	Sunday Before the Nativity of Christ.
ltx/en_us_dedes/me.m12.dBC:meLE.commemoration2	
ltx/en_us_dedes/me.m12.dBC:meLI.Kontakion1.incipit	@ltx/en_us_dedes/me.m12.dBC:meMA.Kontakion1.incipit
ltx/en_us_dedes/me.m12.dBC:meLI.Kontakion1.melody	@ltx/en_us_dedes/me.m12.dBC:meMA.Kontakion1.melody
ltx/en_us_dedes/me.m12.dBC:meLI.Kontakion1.mode	@ltx/en_us_dedes/me.m12.dBC:meMA.Kontakion1.mode
ltx/en_us_dedes/me.m12.dBC:meLI.Kontakion1.text	@ltx/en_us_dedes/me.m12.dBC:meMA.Kontakion1.text
ltx/en_us_dedes/me.m12.dBC:meLI.Megalynarion.text	
ltx/en_us_dedes/me.m12.dBC:meMA.C1.title	Canon for the Fathers.
ltx/en_us_dedes/me.m12.dBC:meMA.C1.verse	@ltx/en_us_dedes/prayers:pr.verse_SaintsM.text
ltx/en_us_dedes/me.m12.dBC:meMA.C2.title	@ltx/en_us_dedes/titles:ti.CanonForefeast
ltx/en_us_dedes/me.m12.dBC:meMA.C2.verse	@ltx/en_us_dedes/prayers:pr.verse_God.text
ltx/en_us_dedes/me.m12.dBC:meMA.Exaposteilarion1.greekmelody	@ltx/en_us_dedes/he.a.m2:heAU.ToisMathitaisSynelthomen.greekname
ltx/en_us_dedes/me.m12.dBC:meMA.Exaposteilarion1.incipit	The foremost of the Patriarchs,*…
ltx/en_us_dedes/me.m12.dBC:meMA.Exaposteilarion1.melody	@ltx/en_us_dedes/he.a.m2:heAU.ToisMathitaisSynelthomen.name
ltx/en_us_dedes/me.m12.dBC:meMA.Exaposteilarion1.mode	@ltx/en_us_dedes/miscellanea:misc.Mode2
ltx/en_us_dedes/me.m12.dBC:meMA.Exaposteilarion1.text	The foremost of the Patriarchs,* Fathers before the Law came,* brightly shone forth by means of faith,* Abraham, Isaac, and Jacob,* as very bright luminaries.* Thereafter all the Prophets* and all the Righteous were from them* lit up as lamps, and thus they began to shine;* Therefore by the rays of their God-inspired* Prophecy they illumined all* the bedarkened creation.
ltx/en_us_dedes/me.m12.dBC:meMA.Exaposteilarion2.greekmelody	@ltx/en_us_dedes/he.a.m2:heAU.ToisMathitaisSynelthomen.greekname
ltx/en_us_dedes/me.m12.dBC:meMA.Exaposteilarion2.incipit	O Bethlehem, rejoice; and you…
ltx/en_us_dedes/me.m12.dBC:meMA.Exaposteilarion2.melody	@ltx/en_us_dedes/he.a.m2:heAU.ToisMathitaisSynelthomen.name
ltx/en_us_dedes/me.m12.dBC:meMA.Exaposteilarion2.mode	@ltx/en_us_dedes/miscellanea:misc.Mode2
ltx/en_us_dedes/me.m12.dBC:meMA.Exaposteilarion2.text	O Bethlehem, rejoice; and you * Ephrata, now make ready. * The Theotokos comes to give * birth unto God ineffably * in a cave and a manger. * O! what an awesome mystery. * Prophets and all the Patriarchs, * Abraham, Isaac, Jacob and all the rest, * now together merrily keep the Forefeast * of His divine Nativity* with mankind and the angels.
ltx/en_us_dedes/me.m12.dBC:meMA.Hypakoe.incipit	…
ltx/en_us_dedes/me.m12.dBC:meMA.Hypakoe.melody	
ltx/en_us_dedes/me.m12.dBC:meMA.Hypakoe.mode	@ltx/en_us_dedes/miscellanea:misc.Mode8
ltx/en_us_dedes/me.m12.dBC:meMA.Hypakoe.text	
ltx/en_us_dedes/me.m12.dBC:meMA.Kontakion1.incipit	@ltx/en_us_dedes/me.m12.d17:meMA.Kontakion2.incipit
ltx/en_us_dedes/me.m12.dBC:meMA.Kontakion1.melody	
ltx/en_us_dedes/me.m12.dBC:meMA.Kontakion1.mode	@ltx/en_us_dedes/miscellanea:misc.Mode6
ltx/en_us_dedes/me.m12.dBC:meMA.Kontakion1.text	@ltx/en_us_dedes/me.m12.d17:meMA.Kontakion2.text
ltx/en_us_dedes/me.m12.dBC:meMA.Kontakion2.greekmelody	@ltx/en_us_dedes/he.a.m1:heAU.ChorosAngelikos.greekname
ltx/en_us_dedes/me.m12.dBC:meMA.Kontakion2.incipit	O Bethlehem, be glad, Ephrata…
ltx/en_us_dedes/me.m12.dBC:meMA.Kontakion2.melody	@ltx/en_us_dedes/he.a.m1:heAU.ChorosAngelikos.name
ltx/en_us_dedes/me.m12.dBC:meMA.Kontakion2.mode	@ltx/en_us_dedes/miscellanea:misc.Mode1
ltx/en_us_dedes/me.m12.dBC:meMA.Kontakion2.text	O Bethlehem, be glad, Ephrata, now be ready. * Behold, the human Ewe comes in haste to deliver * the great Shepherd, whom she bears * as a babe in her virgin womb. * And beholding Him, God-bearing Fathers and Shepherds * now exult in Him, and they sing praises extolling * the Virgin who nurses Him.
ltx/en_us_dedes/me.m12.dBC:meMA.Lauds1.greekmelody	@ltx/en_us_dedes/he.a.m5:heAU.ChairoisAskitikon.greekname
ltx/en_us_dedes/me.m12.dBC:meMA.Lauds1.incipit	Zion the holy city of…
ltx/en_us_dedes/me.m12.dBC:meMA.Lauds1.melody	@ltx/en_us_dedes/he.a.m5:heAU.ChairoisAskitikon.name
ltx/en_us_dedes/me.m12.dBC:meMA.Lauds1.mode	@ltx/en_us_dedes/miscellanea:misc.Mode5
ltx/en_us_dedes/me.m12.dBC:meMA.Lauds1.text	Zion the holy city of God, * lift up your voices, truly heralding the divine * memorial of the Fathers, * as you pay honor to them, * Abraham and Isaac, with Jacob the acclaimed. * With Judah and Levi, behold we now also magnify * Moses the great one, along with Aaron the God-inspired, * and we honor David and Joshua and Samuel. * All of us, striking up divine * and sacred forefestal hymns * in praise of Christ, are in earnest * entreating Him that we may obtain * the gift of His goodness * that derives from Him who grants His great mercy to the world.
ltx/en_us_dedes/me.m12.dBC:meMA.Lauds2.incipit	Come now Prophet Elias who…
ltx/en_us_dedes/me.m12.dBC:meMA.Lauds2.melody	@ltx/en_us_dedes/he.a.m5:heAU.ChairoisAskitikon.name
ltx/en_us_dedes/me.m12.dBC:meMA.Lauds2.mode	@ltx/en_us_dedes/miscellanea:misc.Mode5
ltx/en_us_dedes/me.m12.dBC:meMA.Lauds2.text	Come now Prophet Elias who once * became the rider of the divine fiery chariot, * Elisha the godly-minded, * and Hezekiah as well, * with Josiah also, together rejoice. * And you the august band of dozen Prophets inspired by God, * join in the chorus for the Savior’s Nativity, * and you Righteous all sing His praises in holy song. * Trinity of the blessed Youths * who put out the furnace fire * with the dew of the Spirit, * make supplication on our behalf * to Christ importunely * and implore Him that great mercy be given to our souls.
ltx/en_us_dedes/me.m12.dBC:meMA.Lauds3.incipit	She who from all the…
ltx/en_us_dedes/me.m12.dBC:meMA.Lauds3.melody	@ltx/en_us_dedes/he.a.m5:heAU.ChairoisAskitikon.name
ltx/en_us_dedes/me.m12.dBC:meMA.Lauds3.mode	@ltx/en_us_dedes/miscellanea:misc.Mode5
ltx/en_us_dedes/me.m12.dBC:meMA.Lauds3.text	She who from all the ages on earth * in the predictions of the Prophets is heralded, * the Virgin and Theotokos, * has now appeared, whom the wise * Patriarchs and Righteous openly declare. * With them joining chorus is the adornment of womanhood, * Sarah, Rebecca, also Rachel and Hannah too, * as well as Moses’ sister the glorious Miriam. * With them together now exult * the far reaches of the world, * and all creation rejoices. * For His nativity in the flesh * is God himself coming, * and in order to bestow His great mercy on the world.
ltx/en_us_dedes/me.m12.dBC:meMA.LaudsGlory.incipit	The collection of the teachings…
ltx/en_us_dedes/me.m12.dBC:meMA.LaudsGlory.melody	
ltx/en_us_dedes/me.m12.dBC:meMA.LaudsGlory.mode	@ltx/en_us_dedes/miscellanea:misc.Mode8
ltx/en_us_dedes/me.m12.dBC:meMA.LaudsGlory.text	The collection of the teachings of the Law makes Christ’s divine Nativity in the flesh apparent to those who preached the gospel of Grace before the Law was given and were above the Law by virtue of their faith. Therefore to the souls held in Hades, they announced the Nativity beforehand, that it would be the cause of the deliverance from corruption, through the resurrection. Glory to You, O Lord.
ltx/en_us_dedes/me.m12.dBC:meMA.MM.Lauds1123as5678.text	@ltx/en_us_dedes/properties:media.key
ltx/en_us_dedes/me.m12.dBC:meMA.Ode1C11.greekmelody	@ltx/en_us_dedes/he.h.m6:heHE.KymatiThalassis.greekname
ltx/en_us_dedes/me.m12.dBC:meMA.Ode1C11.incipit	…
ltx/en_us_dedes/me.m12.dBC:meMA.Ode1C11.melody	@ltx/en_us_dedes/he.h.m6:heHE.KymatiThalassis.name
ltx/en_us_dedes/me.m12.dBC:meMA.Ode1C11.mode	@ltx/en_us_dedes/miscellanea:misc.Mode6
ltx/en_us_dedes/me.m12.dBC:meMA.Ode1C11.ode	@ltx/en_us_dedes/miscellanea:misc.Ode1
ltx/en_us_dedes/me.m12.dBC:meMA.Ode1C11.text	
ltx/en_us_dedes/me.m12.dBC:meMA.Ode1C12.incipit	…
ltx/en_us_dedes/me.m12.dBC:meMA.Ode1C12.melody	@ltx/en_us_dedes/he.h.m6:heHE.KymatiThalassis.name
ltx/en_us_dedes/me.m12.dBC:meMA.Ode1C12.mode	@ltx/en_us_dedes/miscellanea:misc.Mode6
ltx/en_us_dedes/me.m12.dBC:meMA.Ode1C12.ode	@ltx/en_us_dedes/miscellanea:misc.Ode1
ltx/en_us_dedes/me.m12.dBC:meMA.Ode1C12.text	
ltx/en_us_dedes/me.m12.dBC:meMA.Ode1C13.incipit	…
ltx/en_us_dedes/me.m12.dBC:meMA.Ode1C13.melody	@ltx/en_us_dedes/he.h.m6:heHE.KymatiThalassis.name
ltx/en_us_dedes/me.m12.dBC:meMA.Ode1C13.mode	@ltx/en_us_dedes/miscellanea:misc.Mode6
ltx/en_us_dedes/me.m12.dBC:meMA.Ode1C13.ode	@ltx/en_us_dedes/miscellanea:misc.Ode1
ltx/en_us_dedes/me.m12.dBC:meMA.Ode1C13.text	
ltx/en_us_dedes/me.m12.dBC:meMA.Ode1C14.incipit	…
ltx/en_us_dedes/me.m12.dBC:meMA.Ode1C14.melody	@ltx/en_us_dedes/he.h.m6:heHE.KymatiThalassis.name
ltx/en_us_dedes/me.m12.dBC:meMA.Ode1C14.mode	@ltx/en_us_dedes/miscellanea:misc.Mode6
ltx/en_us_dedes/me.m12.dBC:meMA.Ode1C14.ode	@ltx/en_us_dedes/miscellanea:misc.Ode1
ltx/en_us_dedes/me.m12.dBC:meMA.Ode1C14.text	
ltx/en_us_dedes/me.m12.dBC:meMA.Ode1C15.incipit	…
ltx/en_us_dedes/me.m12.dBC:meMA.Ode1C15.melody	@ltx/en_us_dedes/he.h.m6:heHE.KymatiThalassis.name
ltx/en_us_dedes/me.m12.dBC:meMA.Ode1C15.mode	@ltx/en_us_dedes/miscellanea:misc.Mode6
ltx/en_us_dedes/me.m12.dBC:meMA.Ode1C15.ode	@ltx/en_us_dedes/miscellanea:misc.Ode1
ltx/en_us_dedes/me.m12.dBC:meMA.Ode1C15.text	
ltx/en_us_dedes/me.m12.dBC:meMA.Ode1C1H.greekmelody	@ltx/en_us_dedes/he.h.m6:heHE.KymatiThalassis.greekname
ltx/en_us_dedes/me.m12.dBC:meMA.Ode1C1H.incipit	@ltx/en_us_dedes/he.h.m6:heHE.KymatiThalassis.incipit
ltx/en_us_dedes/me.m12.dBC:meMA.Ode1C1H.melody	@ltx/en_us_dedes/he.h.m6:heHE.KymatiThalassis.melody
ltx/en_us_dedes/me.m12.dBC:meMA.Ode1C1H.mode	@ltx/en_us_dedes/miscellanea:misc.Mode6
ltx/en_us_dedes/me.m12.dBC:meMA.Ode1C1H.ode	@ltx/en_us_dedes/miscellanea:misc.Ode1
ltx/en_us_dedes/me.m12.dBC:meMA.Ode1C1H.text	@ltx/en_us_dedes/he.h.m6:heHE.KymatiThalassis.text
ltx/en_us_dedes/me.m12.dBC:meMA.Ode1C1T.incipit	…
ltx/en_us_dedes/me.m12.dBC:meMA.Ode1C1T.melody	@ltx/en_us_dedes/he.h.m6:heHE.KymatiThalassis.name
ltx/en_us_dedes/me.m12.dBC:meMA.Ode1C1T.mode	@ltx/en_us_dedes/miscellanea:misc.Mode6
ltx/en_us_dedes/me.m12.dBC:meMA.Ode1C1T.ode	@ltx/en_us_dedes/miscellanea:misc.Ode1
ltx/en_us_dedes/me.m12.dBC:meMA.Ode1C1T.text	
ltx/en_us_dedes/me.m12.dBC:meMA.Ode1C21.greekmelody	@ltx/en_us_dedes/he.h.m1:heHE.ChristosGennatai.greekname
ltx/en_us_dedes/me.m12.dBC:meMA.Ode1C21.incipit	…
ltx/en_us_dedes/me.m12.dBC:meMA.Ode1C21.melody	@ltx/en_us_dedes/he.h.m1:heHE.ChristosGennatai.name
ltx/en_us_dedes/me.m12.dBC:meMA.Ode1C21.mode	@ltx/en_us_dedes/miscellanea:misc.Mode1
ltx/en_us_dedes/me.m12.dBC:meMA.Ode1C21.ode	@ltx/en_us_dedes/miscellanea:misc.Ode1
ltx/en_us_dedes/me.m12.dBC:meMA.Ode1C21.text	
ltx/en_us_dedes/me.m12.dBC:meMA.Ode1C22.incipit	…
ltx/en_us_dedes/me.m12.dBC:meMA.Ode1C22.melody	@ltx/en_us_dedes/he.h.m1:heHE.ChristosGennatai.name
ltx/en_us_dedes/me.m12.dBC:meMA.Ode1C22.mode	@ltx/en_us_dedes/miscellanea:misc.Mode1
ltx/en_us_dedes/me.m12.dBC:meMA.Ode1C22.ode	@ltx/en_us_dedes/miscellanea:misc.Ode1
ltx/en_us_dedes/me.m12.dBC:meMA.Ode1C22.text	
ltx/en_us_dedes/me.m12.dBC:meMA.Ode1C2T.incipit	…
ltx/en_us_dedes/me.m12.dBC:meMA.Ode1C2T.melody	@ltx/en_us_dedes/he.h.m1:heHE.ChristosGennatai.name
ltx/en_us_dedes/me.m12.dBC:meMA.Ode1C2T.mode	@ltx/en_us_dedes/miscellanea:misc.Mode1
ltx/en_us_dedes/me.m12.dBC:meMA.Ode1C2T.ode	@ltx/en_us_dedes/miscellanea:misc.Ode1
ltx/en_us_dedes/me.m12.dBC:meMA.Ode1C2T.text	
ltx/en_us_dedes/me.m12.dBC:meMA.Ode3C11.greekmelody	@ltx/en_us_dedes/he.h.m6:heHE.SeTonEpiYdaton.greekname
ltx/en_us_dedes/me.m12.dBC:meMA.Ode3C11.incipit	…
ltx/en_us_dedes/me.m12.dBC:meMA.Ode3C11.melody	@ltx/en_us_dedes/he.h.m6:heHE.SeTonEpiYdaton.name
ltx/en_us_dedes/me.m12.dBC:meMA.Ode3C11.mode	@ltx/en_us_dedes/miscellanea:misc.Mode6
ltx/en_us_dedes/me.m12.dBC:meMA.Ode3C11.ode	@ltx/en_us_dedes/miscellanea:misc.Ode3
ltx/en_us_dedes/me.m12.dBC:meMA.Ode3C11.text	
ltx/en_us_dedes/me.m12.dBC:meMA.Ode3C12.incipit	…
ltx/en_us_dedes/me.m12.dBC:meMA.Ode3C12.melody	@ltx/en_us_dedes/he.h.m6:heHE.SeTonEpiYdaton.name
ltx/en_us_dedes/me.m12.dBC:meMA.Ode3C12.mode	@ltx/en_us_dedes/miscellanea:misc.Mode6
ltx/en_us_dedes/me.m12.dBC:meMA.Ode3C12.ode	@ltx/en_us_dedes/miscellanea:misc.Ode3
ltx/en_us_dedes/me.m12.dBC:meMA.Ode3C12.text	
ltx/en_us_dedes/me.m12.dBC:meMA.Ode3C13.incipit	…
ltx/en_us_dedes/me.m12.dBC:meMA.Ode3C13.melody	@ltx/en_us_dedes/he.h.m6:heHE.SeTonEpiYdaton.name
ltx/en_us_dedes/me.m12.dBC:meMA.Ode3C13.mode	@ltx/en_us_dedes/miscellanea:misc.Mode6
ltx/en_us_dedes/me.m12.dBC:meMA.Ode3C13.ode	@ltx/en_us_dedes/miscellanea:misc.Ode3
ltx/en_us_dedes/me.m12.dBC:meMA.Ode3C13.text	
ltx/en_us_dedes/me.m12.dBC:meMA.Ode3C14.incipit	…
ltx/en_us_dedes/me.m12.dBC:meMA.Ode3C14.melody	@ltx/en_us_dedes/he.h.m6:heHE.SeTonEpiYdaton.name
ltx/en_us_dedes/me.m12.dBC:meMA.Ode3C14.mode	@ltx/en_us_dedes/miscellanea:misc.Mode6
ltx/en_us_dedes/me.m12.dBC:meMA.Ode3C14.ode	@ltx/en_us_dedes/miscellanea:misc.Ode3
ltx/en_us_dedes/me.m12.dBC:meMA.Ode3C14.text	
ltx/en_us_dedes/me.m12.dBC:meMA.Ode3C1H.greekmelody	@ltx/en_us_dedes/he.h.m6:heHE.SeTonEpiYdaton.greekname
ltx/en_us_dedes/me.m12.dBC:meMA.Ode3C1H.incipit	@ltx/en_us_dedes/he.h.m6:heHE.SeTonEpiYdaton.incipit
ltx/en_us_dedes/me.m12.dBC:meMA.Ode3C1H.melody	@ltx/en_us_dedes/he.h.m6:heHE.SeTonEpiYdaton.melody
ltx/en_us_dedes/me.m12.dBC:meMA.Ode3C1H.mode	@ltx/en_us_dedes/miscellanea:misc.Mode6
ltx/en_us_dedes/me.m12.dBC:meMA.Ode3C1H.ode	@ltx/en_us_dedes/miscellanea:misc.Ode3
ltx/en_us_dedes/me.m12.dBC:meMA.Ode3C1H.text	@ltx/en_us_dedes/he.h.m6:heHE.SeTonEpiYdaton.text
ltx/en_us_dedes/me.m12.dBC:meMA.Ode3C1T.incipit	…
ltx/en_us_dedes/me.m12.dBC:meMA.Ode3C1T.melody	@ltx/en_us_dedes/he.h.m6:heHE.SeTonEpiYdaton.name
ltx/en_us_dedes/me.m12.dBC:meMA.Ode3C1T.mode	@ltx/en_us_dedes/miscellanea:misc.Mode6
ltx/en_us_dedes/me.m12.dBC:meMA.Ode3C1T.ode	@ltx/en_us_dedes/miscellanea:misc.Ode3
ltx/en_us_dedes/me.m12.dBC:meMA.Ode3C1T.text	
ltx/en_us_dedes/me.m12.dBC:meMA.Ode3C21.greekmelody	@ltx/en_us_dedes/he.h.m1:heHE.ToProTonAionon.greekname
ltx/en_us_dedes/me.m12.dBC:meMA.Ode3C21.incipit	…
ltx/en_us_dedes/me.m12.dBC:meMA.Ode3C21.melody	@ltx/en_us_dedes/he.h.m1:heHE.ToProTonAionon.name
ltx/en_us_dedes/me.m12.dBC:meMA.Ode3C21.mode	@ltx/en_us_dedes/miscellanea:misc.Mode1
ltx/en_us_dedes/me.m12.dBC:meMA.Ode3C21.ode	@ltx/en_us_dedes/miscellanea:misc.Ode3
ltx/en_us_dedes/me.m12.dBC:meMA.Ode3C21.text	
ltx/en_us_dedes/me.m12.dBC:meMA.Ode3C22.incipit	…
ltx/en_us_dedes/me.m12.dBC:meMA.Ode3C22.melody	@ltx/en_us_dedes/he.h.m1:heHE.ToProTonAionon.name
ltx/en_us_dedes/me.m12.dBC:meMA.Ode3C22.mode	@ltx/en_us_dedes/miscellanea:misc.Mode1
ltx/en_us_dedes/me.m12.dBC:meMA.Ode3C22.ode	@ltx/en_us_dedes/miscellanea:misc.Ode3
ltx/en_us_dedes/me.m12.dBC:meMA.Ode3C22.text	
ltx/en_us_dedes/me.m12.dBC:meMA.Ode3C2T.incipit	…
ltx/en_us_dedes/me.m12.dBC:meMA.Ode3C2T.melody	@ltx/en_us_dedes/he.h.m1:heHE.ToProTonAionon.name
ltx/en_us_dedes/me.m12.dBC:meMA.Ode3C2T.mode	@ltx/en_us_dedes/miscellanea:misc.Mode1
ltx/en_us_dedes/me.m12.dBC:meMA.Ode3C2T.ode	@ltx/en_us_dedes/miscellanea:misc.Ode3
ltx/en_us_dedes/me.m12.dBC:meMA.Ode3C2T.text	
ltx/en_us_dedes/me.m12.dBC:meMA.Ode4C11.greekmelody	@ltx/en_us_dedes/he.h.m6:heHE.TinEnStavroSou.greekname
ltx/en_us_dedes/me.m12.dBC:meMA.Ode4C11.incipit	…
ltx/en_us_dedes/me.m12.dBC:meMA.Ode4C11.melody	@ltx/en_us_dedes/he.h.m6:heHE.TinEnStavroSou.name
ltx/en_us_dedes/me.m12.dBC:meMA.Ode4C11.mode	@ltx/en_us_dedes/miscellanea:misc.Mode6
ltx/en_us_dedes/me.m12.dBC:meMA.Ode4C11.ode	@ltx/en_us_dedes/miscellanea:misc.Ode4
ltx/en_us_dedes/me.m12.dBC:meMA.Ode4C11.text	
ltx/en_us_dedes/me.m12.dBC:meMA.Ode4C12.incipit	…
ltx/en_us_dedes/me.m12.dBC:meMA.Ode4C12.melody	@ltx/en_us_dedes/he.h.m6:heHE.TinEnStavroSou.name
ltx/en_us_dedes/me.m12.dBC:meMA.Ode4C12.mode	@ltx/en_us_dedes/miscellanea:misc.Mode6
ltx/en_us_dedes/me.m12.dBC:meMA.Ode4C12.ode	@ltx/en_us_dedes/miscellanea:misc.Ode4
ltx/en_us_dedes/me.m12.dBC:meMA.Ode4C12.text	
ltx/en_us_dedes/me.m12.dBC:meMA.Ode4C13.incipit	…
ltx/en_us_dedes/me.m12.dBC:meMA.Ode4C13.melody	@ltx/en_us_dedes/he.h.m6:heHE.TinEnStavroSou.name
ltx/en_us_dedes/me.m12.dBC:meMA.Ode4C13.mode	@ltx/en_us_dedes/miscellanea:misc.Mode6
ltx/en_us_dedes/me.m12.dBC:meMA.Ode4C13.ode	@ltx/en_us_dedes/miscellanea:misc.Ode4
ltx/en_us_dedes/me.m12.dBC:meMA.Ode4C13.text	
ltx/en_us_dedes/me.m12.dBC:meMA.Ode4C14.incipit	…
ltx/en_us_dedes/me.m12.dBC:meMA.Ode4C14.melody	@ltx/en_us_dedes/he.h.m6:heHE.TinEnStavroSou.name
ltx/en_us_dedes/me.m12.dBC:meMA.Ode4C14.mode	@ltx/en_us_dedes/miscellanea:misc.Mode6
ltx/en_us_dedes/me.m12.dBC:meMA.Ode4C14.ode	@ltx/en_us_dedes/miscellanea:misc.Ode4
ltx/en_us_dedes/me.m12.dBC:meMA.Ode4C14.text	
ltx/en_us_dedes/me.m12.dBC:meMA.Ode4C1H.greekmelody	@ltx/en_us_dedes/he.h.m6:heHE.TinEnStavroSou.greekname
ltx/en_us_dedes/me.m12.dBC:meMA.Ode4C1H.incipit	@ltx/en_us_dedes/he.h.m6:heHE.TinEnStavroSou.incipit
ltx/en_us_dedes/me.m12.dBC:meMA.Ode4C1H.melody	@ltx/en_us_dedes/he.h.m6:heHE.TinEnStavroSou.melody
ltx/en_us_dedes/me.m12.dBC:meMA.Ode4C1H.mode	@ltx/en_us_dedes/miscellanea:misc.Mode6
ltx/en_us_dedes/me.m12.dBC:meMA.Ode4C1H.ode	@ltx/en_us_dedes/miscellanea:misc.Ode4
ltx/en_us_dedes/me.m12.dBC:meMA.Ode4C1H.text	@ltx/en_us_dedes/he.h.m6:heHE.TinEnStavroSou.text
ltx/en_us_dedes/me.m12.dBC:meMA.Ode4C1T.incipit	…
ltx/en_us_dedes/me.m12.dBC:meMA.Ode4C1T.melody	@ltx/en_us_dedes/he.h.m6:heHE.TinEnStavroSou.name
ltx/en_us_dedes/me.m12.dBC:meMA.Ode4C1T.mode	@ltx/en_us_dedes/miscellanea:misc.Mode6
ltx/en_us_dedes/me.m12.dBC:meMA.Ode4C1T.ode	@ltx/en_us_dedes/miscellanea:misc.Ode4
ltx/en_us_dedes/me.m12.dBC:meMA.Ode4C1T.text	
ltx/en_us_dedes/me.m12.dBC:meMA.Ode4C21.greekmelody	@ltx/en_us_dedes/he.h.m1:heHE.RavdosEkTisRizis.greekname
ltx/en_us_dedes/me.m12.dBC:meMA.Ode4C21.incipit	…
ltx/en_us_dedes/me.m12.dBC:meMA.Ode4C21.melody	@ltx/en_us_dedes/he.h.m1:heHE.RavdosEkTisRizis.name
ltx/en_us_dedes/me.m12.dBC:meMA.Ode4C21.mode	@ltx/en_us_dedes/miscellanea:misc.Mode1
ltx/en_us_dedes/me.m12.dBC:meMA.Ode4C21.ode	@ltx/en_us_dedes/miscellanea:misc.Ode4
ltx/en_us_dedes/me.m12.dBC:meMA.Ode4C21.text	
ltx/en_us_dedes/me.m12.dBC:meMA.Ode4C22.incipit	…
ltx/en_us_dedes/me.m12.dBC:meMA.Ode4C22.melody	@ltx/en_us_dedes/he.h.m1:heHE.RavdosEkTisRizis.name
ltx/en_us_dedes/me.m12.dBC:meMA.Ode4C22.mode	@ltx/en_us_dedes/miscellanea:misc.Mode1
ltx/en_us_dedes/me.m12.dBC:meMA.Ode4C22.ode	@ltx/en_us_dedes/miscellanea:misc.Ode4
ltx/en_us_dedes/me.m12.dBC:meMA.Ode4C22.text	
ltx/en_us_dedes/me.m12.dBC:meMA.Ode4C2T.incipit	…
ltx/en_us_dedes/me.m12.dBC:meMA.Ode4C2T.melody	@ltx/en_us_dedes/he.h.m1:heHE.RavdosEkTisRizis.name
ltx/en_us_dedes/me.m12.dBC:meMA.Ode4C2T.mode	@ltx/en_us_dedes/miscellanea:misc.Mode1
ltx/en_us_dedes/me.m12.dBC:meMA.Ode4C2T.ode	@ltx/en_us_dedes/miscellanea:misc.Ode4
ltx/en_us_dedes/me.m12.dBC:meMA.Ode4C2T.text	
ltx/en_us_dedes/me.m12.dBC:meMA.Ode5C11.greekmelody	@ltx/en_us_dedes/he.h.m6:heHE.TheofaneiasSouChriste.greekname
ltx/en_us_dedes/me.m12.dBC:meMA.Ode5C11.incipit	…
ltx/en_us_dedes/me.m12.dBC:meMA.Ode5C11.melody	@ltx/en_us_dedes/he.h.m6:heHE.TheofaneiasSouChriste.name
ltx/en_us_dedes/me.m12.dBC:meMA.Ode5C11.mode	@ltx/en_us_dedes/miscellanea:misc.Mode6
ltx/en_us_dedes/me.m12.dBC:meMA.Ode5C11.ode	@ltx/en_us_dedes/miscellanea:misc.Ode5
ltx/en_us_dedes/me.m12.dBC:meMA.Ode5C11.text	
ltx/en_us_dedes/me.m12.dBC:meMA.Ode5C12.incipit	…
ltx/en_us_dedes/me.m12.dBC:meMA.Ode5C12.melody	@ltx/en_us_dedes/he.h.m6:heHE.TheofaneiasSouChriste.name
ltx/en_us_dedes/me.m12.dBC:meMA.Ode5C12.mode	@ltx/en_us_dedes/miscellanea:misc.Mode6
ltx/en_us_dedes/me.m12.dBC:meMA.Ode5C12.ode	@ltx/en_us_dedes/miscellanea:misc.Ode5
ltx/en_us_dedes/me.m12.dBC:meMA.Ode5C12.text	
ltx/en_us_dedes/me.m12.dBC:meMA.Ode5C13.incipit	…
ltx/en_us_dedes/me.m12.dBC:meMA.Ode5C13.melody	@ltx/en_us_dedes/he.h.m6:heHE.TheofaneiasSouChriste.name
ltx/en_us_dedes/me.m12.dBC:meMA.Ode5C13.mode	@ltx/en_us_dedes/miscellanea:misc.Mode6
ltx/en_us_dedes/me.m12.dBC:meMA.Ode5C13.ode	@ltx/en_us_dedes/miscellanea:misc.Ode5
ltx/en_us_dedes/me.m12.dBC:meMA.Ode5C13.text	
ltx/en_us_dedes/me.m12.dBC:meMA.Ode5C14.incipit	…
ltx/en_us_dedes/me.m12.dBC:meMA.Ode5C14.melody	@ltx/en_us_dedes/he.h.m6:heHE.TheofaneiasSouChriste.name
ltx/en_us_dedes/me.m12.dBC:meMA.Ode5C14.mode	@ltx/en_us_dedes/miscellanea:misc.Mode6
ltx/en_us_dedes/me.m12.dBC:meMA.Ode5C14.ode	@ltx/en_us_dedes/miscellanea:misc.Ode5
ltx/en_us_dedes/me.m12.dBC:meMA.Ode5C14.text	
ltx/en_us_dedes/me.m12.dBC:meMA.Ode5C1H.greekmelody	@ltx/en_us_dedes/he.h.m6:heHE.TheofaneiasSouChriste.greekname
ltx/en_us_dedes/me.m12.dBC:meMA.Ode5C1H.incipit	@ltx/en_us_dedes/he.h.m6:heHE.TheofaneiasSouChriste.incipit
ltx/en_us_dedes/me.m12.dBC:meMA.Ode5C1H.melody	@ltx/en_us_dedes/he.h.m6:heHE.TheofaneiasSouChriste.melody
ltx/en_us_dedes/me.m12.dBC:meMA.Ode5C1H.mode	@ltx/en_us_dedes/miscellanea:misc.Mode6
ltx/en_us_dedes/me.m12.dBC:meMA.Ode5C1H.ode	@ltx/en_us_dedes/miscellanea:misc.Ode5
ltx/en_us_dedes/me.m12.dBC:meMA.Ode5C1H.text	@ltx/en_us_dedes/he.h.m6:heHE.TheofaneiasSouChriste.text
ltx/en_us_dedes/me.m12.dBC:meMA.Ode5C1T.incipit	…
ltx/en_us_dedes/me.m12.dBC:meMA.Ode5C1T.melody	@ltx/en_us_dedes/he.h.m6:heHE.TheofaneiasSouChriste.name
ltx/en_us_dedes/me.m12.dBC:meMA.Ode5C1T.mode	@ltx/en_us_dedes/miscellanea:misc.Mode6
ltx/en_us_dedes/me.m12.dBC:meMA.Ode5C1T.ode	@ltx/en_us_dedes/miscellanea:misc.Ode5
ltx/en_us_dedes/me.m12.dBC:meMA.Ode5C1T.text	
ltx/en_us_dedes/me.m12.dBC:meMA.Ode5C21.greekmelody	@ltx/en_us_dedes/he.h.m1:heHE.TheosOnEirinis.greekname
ltx/en_us_dedes/me.m12.dBC:meMA.Ode5C21.incipit	…
ltx/en_us_dedes/me.m12.dBC:meMA.Ode5C21.melody	@ltx/en_us_dedes/he.h.m1:heHE.TheosOnEirinis.name
ltx/en_us_dedes/me.m12.dBC:meMA.Ode5C21.mode	@ltx/en_us_dedes/miscellanea:misc.Mode1
ltx/en_us_dedes/me.m12.dBC:meMA.Ode5C21.ode	@ltx/en_us_dedes/miscellanea:misc.Ode5
ltx/en_us_dedes/me.m12.dBC:meMA.Ode5C21.text	
ltx/en_us_dedes/me.m12.dBC:meMA.Ode5C22.incipit	…
ltx/en_us_dedes/me.m12.dBC:meMA.Ode5C22.melody	@ltx/en_us_dedes/he.h.m1:heHE.TheosOnEirinis.name
ltx/en_us_dedes/me.m12.dBC:meMA.Ode5C22.mode	@ltx/en_us_dedes/miscellanea:misc.Mode1
ltx/en_us_dedes/me.m12.dBC:meMA.Ode5C22.ode	@ltx/en_us_dedes/miscellanea:misc.Ode5
ltx/en_us_dedes/me.m12.dBC:meMA.Ode5C22.text	
ltx/en_us_dedes/me.m12.dBC:meMA.Ode5C2T.incipit	…
ltx/en_us_dedes/me.m12.dBC:meMA.Ode5C2T.melody	@ltx/en_us_dedes/he.h.m1:heHE.TheosOnEirinis.name
ltx/en_us_dedes/me.m12.dBC:meMA.Ode5C2T.mode	@ltx/en_us_dedes/miscellanea:misc.Mode1
ltx/en_us_dedes/me.m12.dBC:meMA.Ode5C2T.ode	@ltx/en_us_dedes/miscellanea:misc.Ode5
ltx/en_us_dedes/me.m12.dBC:meMA.Ode5C2T.text	
ltx/en_us_dedes/me.m12.dBC:meMA.Ode6C11.greekmelody	@ltx/en_us_dedes/he.h.m6:heHE.TouViouTinThalassan.greekname
ltx/en_us_dedes/me.m12.dBC:meMA.Ode6C11.incipit	…
ltx/en_us_dedes/me.m12.dBC:meMA.Ode6C11.melody	@ltx/en_us_dedes/he.h.m6:heHE.TouViouTinThalassan.name
ltx/en_us_dedes/me.m12.dBC:meMA.Ode6C11.mode	@ltx/en_us_dedes/miscellanea:misc.Mode6
ltx/en_us_dedes/me.m12.dBC:meMA.Ode6C11.ode	@ltx/en_us_dedes/miscellanea:misc.Ode6
ltx/en_us_dedes/me.m12.dBC:meMA.Ode6C11.text	
ltx/en_us_dedes/me.m12.dBC:meMA.Ode6C12.incipit	…
ltx/en_us_dedes/me.m12.dBC:meMA.Ode6C12.melody	@ltx/en_us_dedes/he.h.m6:heHE.TouViouTinThalassan.name
ltx/en_us_dedes/me.m12.dBC:meMA.Ode6C12.mode	@ltx/en_us_dedes/miscellanea:misc.Mode6
ltx/en_us_dedes/me.m12.dBC:meMA.Ode6C12.ode	@ltx/en_us_dedes/miscellanea:misc.Ode6
ltx/en_us_dedes/me.m12.dBC:meMA.Ode6C12.text	
ltx/en_us_dedes/me.m12.dBC:meMA.Ode6C13.incipit	…
ltx/en_us_dedes/me.m12.dBC:meMA.Ode6C13.melody	@ltx/en_us_dedes/he.h.m6:heHE.TouViouTinThalassan.name
ltx/en_us_dedes/me.m12.dBC:meMA.Ode6C13.mode	@ltx/en_us_dedes/miscellanea:misc.Mode6
ltx/en_us_dedes/me.m12.dBC:meMA.Ode6C13.ode	@ltx/en_us_dedes/miscellanea:misc.Ode6
ltx/en_us_dedes/me.m12.dBC:meMA.Ode6C13.text	
ltx/en_us_dedes/me.m12.dBC:meMA.Ode6C14.incipit	…
ltx/en_us_dedes/me.m12.dBC:meMA.Ode6C14.melody	@ltx/en_us_dedes/he.h.m6:heHE.TouViouTinThalassan.name
ltx/en_us_dedes/me.m12.dBC:meMA.Ode6C14.mode	@ltx/en_us_dedes/miscellanea:misc.Mode6
ltx/en_us_dedes/me.m12.dBC:meMA.Ode6C14.ode	@ltx/en_us_dedes/miscellanea:misc.Ode6
ltx/en_us_dedes/me.m12.dBC:meMA.Ode6C14.text	
ltx/en_us_dedes/me.m12.dBC:meMA.Ode6C1H.greekmelody	@ltx/en_us_dedes/he.h.m6:heHE.TouViouTinThalassan.greekname
ltx/en_us_dedes/me.m12.dBC:meMA.Ode6C1H.incipit	@ltx/en_us_dedes/he.h.m6:heHE.TouViouTinThalassan.incipit
ltx/en_us_dedes/me.m12.dBC:meMA.Ode6C1H.melody	@ltx/en_us_dedes/he.h.m6:heHE.TouViouTinThalassan.melody
ltx/en_us_dedes/me.m12.dBC:meMA.Ode6C1H.mode	@ltx/en_us_dedes/miscellanea:misc.Mode6
ltx/en_us_dedes/me.m12.dBC:meMA.Ode6C1H.ode	@ltx/en_us_dedes/miscellanea:misc.Ode6
ltx/en_us_dedes/me.m12.dBC:meMA.Ode6C1H.text	@ltx/en_us_dedes/he.h.m6:heHE.TouViouTinThalassan.text
ltx/en_us_dedes/me.m12.dBC:meMA.Ode6C1T.incipit	…
ltx/en_us_dedes/me.m12.dBC:meMA.Ode6C1T.melody	@ltx/en_us_dedes/he.h.m6:heHE.TouViouTinThalassan.name
ltx/en_us_dedes/me.m12.dBC:meMA.Ode6C1T.mode	@ltx/en_us_dedes/miscellanea:misc.Mode6
ltx/en_us_dedes/me.m12.dBC:meMA.Ode6C1T.ode	@ltx/en_us_dedes/miscellanea:misc.Ode6
ltx/en_us_dedes/me.m12.dBC:meMA.Ode6C1T.text	
ltx/en_us_dedes/me.m12.dBC:meMA.Ode6C21.greekmelody	@ltx/en_us_dedes/he.h.m1:heHE.SplanchnonIonan.greekname
ltx/en_us_dedes/me.m12.dBC:meMA.Ode6C21.incipit	…
ltx/en_us_dedes/me.m12.dBC:meMA.Ode6C21.melody	@ltx/en_us_dedes/he.h.m1:heHE.SplanchnonIonan.name
ltx/en_us_dedes/me.m12.dBC:meMA.Ode6C21.mode	@ltx/en_us_dedes/miscellanea:misc.Mode1
ltx/en_us_dedes/me.m12.dBC:meMA.Ode6C21.ode	@ltx/en_us_dedes/miscellanea:misc.Ode6
ltx/en_us_dedes/me.m12.dBC:meMA.Ode6C21.text	
ltx/en_us_dedes/me.m12.dBC:meMA.Ode6C22.incipit	…
ltx/en_us_dedes/me.m12.dBC:meMA.Ode6C22.melody	@ltx/en_us_dedes/he.h.m1:heHE.SplanchnonIonan.name
ltx/en_us_dedes/me.m12.dBC:meMA.Ode6C22.mode	@ltx/en_us_dedes/miscellanea:misc.Mode1
ltx/en_us_dedes/me.m12.dBC:meMA.Ode6C22.ode	@ltx/en_us_dedes/miscellanea:misc.Ode6
ltx/en_us_dedes/me.m12.dBC:meMA.Ode6C22.text	
ltx/en_us_dedes/me.m12.dBC:meMA.Ode6C2T.incipit	…
ltx/en_us_dedes/me.m12.dBC:meMA.Ode6C2T.melody	@ltx/en_us_dedes/he.h.m1:heHE.SplanchnonIonan.name
ltx/en_us_dedes/me.m12.dBC:meMA.Ode6C2T.mode	@ltx/en_us_dedes/miscellanea:misc.Mode1
ltx/en_us_dedes/me.m12.dBC:meMA.Ode6C2T.ode	@ltx/en_us_dedes/miscellanea:misc.Ode6
ltx/en_us_dedes/me.m12.dBC:meMA.Ode6C2T.text	
ltx/en_us_dedes/me.m12.dBC:meMA.Ode7C11.greekmelody	@ltx/en_us_dedes/he.h.m6:heHE.AfrastonThavma.greekname
ltx/en_us_dedes/me.m12.dBC:meMA.Ode7C11.incipit	…
ltx/en_us_dedes/me.m12.dBC:meMA.Ode7C11.melody	@ltx/en_us_dedes/he.h.m6:heHE.AfrastonThavma.name
ltx/en_us_dedes/me.m12.dBC:meMA.Ode7C11.mode	@ltx/en_us_dedes/miscellanea:misc.Mode6
ltx/en_us_dedes/me.m12.dBC:meMA.Ode7C11.ode	@ltx/en_us_dedes/miscellanea:misc.Ode7
ltx/en_us_dedes/me.m12.dBC:meMA.Ode7C11.text	
ltx/en_us_dedes/me.m12.dBC:meMA.Ode7C12.incipit	…
ltx/en_us_dedes/me.m12.dBC:meMA.Ode7C12.melody	@ltx/en_us_dedes/he.h.m6:heHE.AfrastonThavma.name
ltx/en_us_dedes/me.m12.dBC:meMA.Ode7C12.mode	@ltx/en_us_dedes/miscellanea:misc.Mode6
ltx/en_us_dedes/me.m12.dBC:meMA.Ode7C12.ode	@ltx/en_us_dedes/miscellanea:misc.Ode7
ltx/en_us_dedes/me.m12.dBC:meMA.Ode7C12.text	
ltx/en_us_dedes/me.m12.dBC:meMA.Ode7C13.incipit	…
ltx/en_us_dedes/me.m12.dBC:meMA.Ode7C13.melody	@ltx/en_us_dedes/he.h.m6:heHE.AfrastonThavma.name
ltx/en_us_dedes/me.m12.dBC:meMA.Ode7C13.mode	@ltx/en_us_dedes/miscellanea:misc.Mode6
ltx/en_us_dedes/me.m12.dBC:meMA.Ode7C13.ode	@ltx/en_us_dedes/miscellanea:misc.Ode7
ltx/en_us_dedes/me.m12.dBC:meMA.Ode7C13.text	
ltx/en_us_dedes/me.m12.dBC:meMA.Ode7C14.incipit	…
ltx/en_us_dedes/me.m12.dBC:meMA.Ode7C14.melody	@ltx/en_us_dedes/he.h.m6:heHE.AfrastonThavma.name
ltx/en_us_dedes/me.m12.dBC:meMA.Ode7C14.mode	@ltx/en_us_dedes/miscellanea:misc.Mode6
ltx/en_us_dedes/me.m12.dBC:meMA.Ode7C14.ode	@ltx/en_us_dedes/miscellanea:misc.Ode7
ltx/en_us_dedes/me.m12.dBC:meMA.Ode7C14.text	
ltx/en_us_dedes/me.m12.dBC:meMA.Ode7C1H.greekmelody	@ltx/en_us_dedes/he.h.m6:heHE.AfrastonThavma.greekname
ltx/en_us_dedes/me.m12.dBC:meMA.Ode7C1H.incipit	@ltx/en_us_dedes/he.h.m6:heHE.AfrastonThavma.incipit
ltx/en_us_dedes/me.m12.dBC:meMA.Ode7C1H.melody	@ltx/en_us_dedes/he.h.m6:heHE.AfrastonThavma.melody
ltx/en_us_dedes/me.m12.dBC:meMA.Ode7C1H.mode	@ltx/en_us_dedes/miscellanea:misc.Mode6
ltx/en_us_dedes/me.m12.dBC:meMA.Ode7C1H.ode	@ltx/en_us_dedes/miscellanea:misc.Ode7
ltx/en_us_dedes/me.m12.dBC:meMA.Ode7C1H.text	@ltx/en_us_dedes/he.h.m6:heHE.AfrastonThavma.text
ltx/en_us_dedes/me.m12.dBC:meMA.Ode7C1T.incipit	…
ltx/en_us_dedes/me.m12.dBC:meMA.Ode7C1T.melody	@ltx/en_us_dedes/he.h.m6:heHE.AfrastonThavma.name
ltx/en_us_dedes/me.m12.dBC:meMA.Ode7C1T.mode	@ltx/en_us_dedes/miscellanea:misc.Mode6
ltx/en_us_dedes/me.m12.dBC:meMA.Ode7C1T.ode	@ltx/en_us_dedes/miscellanea:misc.Ode7
ltx/en_us_dedes/me.m12.dBC:meMA.Ode7C1T.text	
ltx/en_us_dedes/me.m12.dBC:meMA.Ode7C21.greekmelody	@ltx/en_us_dedes/he.h.m1:heHE.OiPaidesEfseveia.greekname
ltx/en_us_dedes/me.m12.dBC:meMA.Ode7C21.incipit	…
ltx/en_us_dedes/me.m12.dBC:meMA.Ode7C21.melody	@ltx/en_us_dedes/he.h.m1:heHE.OiPaidesEfseveia.name
ltx/en_us_dedes/me.m12.dBC:meMA.Ode7C21.mode	@ltx/en_us_dedes/miscellanea:misc.Mode1
ltx/en_us_dedes/me.m12.dBC:meMA.Ode7C21.ode	@ltx/en_us_dedes/miscellanea:misc.Ode7
ltx/en_us_dedes/me.m12.dBC:meMA.Ode7C21.text	
ltx/en_us_dedes/me.m12.dBC:meMA.Ode7C22.incipit	…
ltx/en_us_dedes/me.m12.dBC:meMA.Ode7C22.melody	@ltx/en_us_dedes/he.h.m1:heHE.OiPaidesEfseveia.name
ltx/en_us_dedes/me.m12.dBC:meMA.Ode7C22.mode	@ltx/en_us_dedes/miscellanea:misc.Mode1
ltx/en_us_dedes/me.m12.dBC:meMA.Ode7C22.ode	@ltx/en_us_dedes/miscellanea:misc.Ode7
ltx/en_us_dedes/me.m12.dBC:meMA.Ode7C22.text	
ltx/en_us_dedes/me.m12.dBC:meMA.Ode7C2T.incipit	…
ltx/en_us_dedes/me.m12.dBC:meMA.Ode7C2T.melody	@ltx/en_us_dedes/he.h.m1:heHE.OiPaidesEfseveia.name
ltx/en_us_dedes/me.m12.dBC:meMA.Ode7C2T.mode	@ltx/en_us_dedes/miscellanea:misc.Mode1
ltx/en_us_dedes/me.m12.dBC:meMA.Ode7C2T.ode	@ltx/en_us_dedes/miscellanea:misc.Ode7
ltx/en_us_dedes/me.m12.dBC:meMA.Ode7C2T.text	
ltx/en_us_dedes/me.m12.dBC:meMA.Ode8C11.greekmelody	@ltx/en_us_dedes/he.h.m6:heHE.EkstithiFrittonOurane.greekname
ltx/en_us_dedes/me.m12.dBC:meMA.Ode8C11.incipit	…
ltx/en_us_dedes/me.m12.dBC:meMA.Ode8C11.melody	@ltx/en_us_dedes/he.h.m6:heHE.EkstithiFrittonOurane.name
ltx/en_us_dedes/me.m12.dBC:meMA.Ode8C11.mode	@ltx/en_us_dedes/miscellanea:misc.Mode6
ltx/en_us_dedes/me.m12.dBC:meMA.Ode8C11.ode	@ltx/en_us_dedes/miscellanea:misc.Ode8
ltx/en_us_dedes/me.m12.dBC:meMA.Ode8C11.text	
ltx/en_us_dedes/me.m12.dBC:meMA.Ode8C12.incipit	…
ltx/en_us_dedes/me.m12.dBC:meMA.Ode8C12.melody	@ltx/en_us_dedes/he.h.m6:heHE.EkstithiFrittonOurane.name
ltx/en_us_dedes/me.m12.dBC:meMA.Ode8C12.mode	@ltx/en_us_dedes/miscellanea:misc.Mode6
ltx/en_us_dedes/me.m12.dBC:meMA.Ode8C12.ode	@ltx/en_us_dedes/miscellanea:misc.Ode8
ltx/en_us_dedes/me.m12.dBC:meMA.Ode8C12.text	
ltx/en_us_dedes/me.m12.dBC:meMA.Ode8C13.incipit	…
ltx/en_us_dedes/me.m12.dBC:meMA.Ode8C13.melody	@ltx/en_us_dedes/he.h.m6:heHE.EkstithiFrittonOurane.name
ltx/en_us_dedes/me.m12.dBC:meMA.Ode8C13.mode	@ltx/en_us_dedes/miscellanea:misc.Mode6
ltx/en_us_dedes/me.m12.dBC:meMA.Ode8C13.ode	@ltx/en_us_dedes/miscellanea:misc.Ode8
ltx/en_us_dedes/me.m12.dBC:meMA.Ode8C13.text	
ltx/en_us_dedes/me.m12.dBC:meMA.Ode8C14.incipit	…
ltx/en_us_dedes/me.m12.dBC:meMA.Ode8C14.melody	@ltx/en_us_dedes/he.h.m6:heHE.EkstithiFrittonOurane.name
ltx/en_us_dedes/me.m12.dBC:meMA.Ode8C14.mode	@ltx/en_us_dedes/miscellanea:misc.Mode6
ltx/en_us_dedes/me.m12.dBC:meMA.Ode8C14.ode	@ltx/en_us_dedes/miscellanea:misc.Ode8
ltx/en_us_dedes/me.m12.dBC:meMA.Ode8C14.text	
ltx/en_us_dedes/me.m12.dBC:meMA.Ode8C1H.greekmelody	@ltx/en_us_dedes/he.h.m6:heHE.EkstithiFrittonOurane.greekname
ltx/en_us_dedes/me.m12.dBC:meMA.Ode8C1H.incipit	@ltx/en_us_dedes/he.h.m6:heHE.EkstithiFrittonOurane.incipit
ltx/en_us_dedes/me.m12.dBC:meMA.Ode8C1H.melody	@ltx/en_us_dedes/he.h.m6:heHE.EkstithiFrittonOurane.melody
ltx/en_us_dedes/me.m12.dBC:meMA.Ode8C1H.mode	@ltx/en_us_dedes/miscellanea:misc.Mode6
ltx/en_us_dedes/me.m12.dBC:meMA.Ode8C1H.ode	@ltx/en_us_dedes/miscellanea:misc.Ode8
ltx/en_us_dedes/me.m12.dBC:meMA.Ode8C1H.text	@ltx/en_us_dedes/he.h.m6:heHE.EkstithiFrittonOurane.text
ltx/en_us_dedes/me.m12.dBC:meMA.Ode8C1T.incipit	…
ltx/en_us_dedes/me.m12.dBC:meMA.Ode8C1T.melody	@ltx/en_us_dedes/he.h.m6:heHE.EkstithiFrittonOurane.name
ltx/en_us_dedes/me.m12.dBC:meMA.Ode8C1T.mode	@ltx/en_us_dedes/miscellanea:misc.Mode6
ltx/en_us_dedes/me.m12.dBC:meMA.Ode8C1T.ode	@ltx/en_us_dedes/miscellanea:misc.Ode8
ltx/en_us_dedes/me.m12.dBC:meMA.Ode8C1T.text	
ltx/en_us_dedes/me.m12.dBC:meMA.Ode8C21.greekmelody	@ltx/en_us_dedes/he.h.m1:heHE.ThavmatosYperfyous.greekname
ltx/en_us_dedes/me.m12.dBC:meMA.Ode8C21.incipit	…
ltx/en_us_dedes/me.m12.dBC:meMA.Ode8C21.melody	@ltx/en_us_dedes/he.h.m1:heHE.ThavmatosYperfyous.name
ltx/en_us_dedes/me.m12.dBC:meMA.Ode8C21.mode	@ltx/en_us_dedes/miscellanea:misc.Mode1
ltx/en_us_dedes/me.m12.dBC:meMA.Ode8C21.ode	@ltx/en_us_dedes/miscellanea:misc.Ode8
ltx/en_us_dedes/me.m12.dBC:meMA.Ode8C21.text	
ltx/en_us_dedes/me.m12.dBC:meMA.Ode8C22.incipit	…
ltx/en_us_dedes/me.m12.dBC:meMA.Ode8C22.melody	@ltx/en_us_dedes/he.h.m1:heHE.ThavmatosYperfyous.name
ltx/en_us_dedes/me.m12.dBC:meMA.Ode8C22.mode	@ltx/en_us_dedes/miscellanea:misc.Mode1
ltx/en_us_dedes/me.m12.dBC:meMA.Ode8C22.ode	@ltx/en_us_dedes/miscellanea:misc.Ode8
ltx/en_us_dedes/me.m12.dBC:meMA.Ode8C22.text	
ltx/en_us_dedes/me.m12.dBC:meMA.Ode8C2T.incipit	…
ltx/en_us_dedes/me.m12.dBC:meMA.Ode8C2T.melody	@ltx/en_us_dedes/he.h.m1:heHE.ThavmatosYperfyous.name
ltx/en_us_dedes/me.m12.dBC:meMA.Ode8C2T.mode	@ltx/en_us_dedes/miscellanea:misc.Mode1
ltx/en_us_dedes/me.m12.dBC:meMA.Ode8C2T.ode	@ltx/en_us_dedes/miscellanea:misc.Ode8
ltx/en_us_dedes/me.m12.dBC:meMA.Ode8C2T.text	
ltx/en_us_dedes/me.m12.dBC:meMA.Ode9C11.greekmelody	@ltx/en_us_dedes/he.h.m6:heHE.MiEpodyrouMouMiter.greekname
ltx/en_us_dedes/me.m12.dBC:meMA.Ode9C11.incipit	…
ltx/en_us_dedes/me.m12.dBC:meMA.Ode9C11.melody	@ltx/en_us_dedes/he.h.m6:heHE.MiEpodyrouMouMiter.name
ltx/en_us_dedes/me.m12.dBC:meMA.Ode9C11.mode	@ltx/en_us_dedes/miscellanea:misc.Mode6
ltx/en_us_dedes/me.m12.dBC:meMA.Ode9C11.ode	@ltx/en_us_dedes/miscellanea:misc.Ode9
ltx/en_us_dedes/me.m12.dBC:meMA.Ode9C11.text	
ltx/en_us_dedes/me.m12.dBC:meMA.Ode9C12.incipit	…
ltx/en_us_dedes/me.m12.dBC:meMA.Ode9C12.melody	@ltx/en_us_dedes/he.h.m6:heHE.MiEpodyrouMouMiter.name
ltx/en_us_dedes/me.m12.dBC:meMA.Ode9C12.mode	@ltx/en_us_dedes/miscellanea:misc.Mode6
ltx/en_us_dedes/me.m12.dBC:meMA.Ode9C12.ode	@ltx/en_us_dedes/miscellanea:misc.Ode9
ltx/en_us_dedes/me.m12.dBC:meMA.Ode9C12.text	
ltx/en_us_dedes/me.m12.dBC:meMA.Ode9C13.incipit	…
ltx/en_us_dedes/me.m12.dBC:meMA.Ode9C13.melody	@ltx/en_us_dedes/he.h.m6:heHE.MiEpodyrouMouMiter.name
ltx/en_us_dedes/me.m12.dBC:meMA.Ode9C13.mode	@ltx/en_us_dedes/miscellanea:misc.Mode6
ltx/en_us_dedes/me.m12.dBC:meMA.Ode9C13.ode	@ltx/en_us_dedes/miscellanea:misc.Ode9
ltx/en_us_dedes/me.m12.dBC:meMA.Ode9C13.text	
ltx/en_us_dedes/me.m12.dBC:meMA.Ode9C14.incipit	…
ltx/en_us_dedes/me.m12.dBC:meMA.Ode9C14.melody	@ltx/en_us_dedes/he.h.m6:heHE.MiEpodyrouMouMiter.name
ltx/en_us_dedes/me.m12.dBC:meMA.Ode9C14.mode	@ltx/en_us_dedes/miscellanea:misc.Mode6
ltx/en_us_dedes/me.m12.dBC:meMA.Ode9C14.ode	@ltx/en_us_dedes/miscellanea:misc.Ode9
ltx/en_us_dedes/me.m12.dBC:meMA.Ode9C14.text	
ltx/en_us_dedes/me.m12.dBC:meMA.Ode9C1H.greekmelody	@ltx/en_us_dedes/he.h.m6:heHE.MiEpodyrouMouMiter.greekname
ltx/en_us_dedes/me.m12.dBC:meMA.Ode9C1H.incipit	@ltx/en_us_dedes/he.h.m6:heHE.MiEpodyrouMouMiter.incipit
ltx/en_us_dedes/me.m12.dBC:meMA.Ode9C1H.melody	@ltx/en_us_dedes/he.h.m6:heHE.MiEpodyrouMouMiter.melody
ltx/en_us_dedes/me.m12.dBC:meMA.Ode9C1H.mode	@ltx/en_us_dedes/miscellanea:misc.Mode6
ltx/en_us_dedes/me.m12.dBC:meMA.Ode9C1H.ode	@ltx/en_us_dedes/miscellanea:misc.Ode9
ltx/en_us_dedes/me.m12.dBC:meMA.Ode9C1H.text	@ltx/en_us_dedes/he.h.m6:heHE.MiEpodyrouMouMiter.text
ltx/en_us_dedes/me.m12.dBC:meMA.Ode9C1T.incipit	…
ltx/en_us_dedes/me.m12.dBC:meMA.Ode9C1T.melody	@ltx/en_us_dedes/he.h.m6:heHE.MiEpodyrouMouMiter.name
ltx/en_us_dedes/me.m12.dBC:meMA.Ode9C1T.mode	@ltx/en_us_dedes/miscellanea:misc.Mode6
ltx/en_us_dedes/me.m12.dBC:meMA.Ode9C1T.ode	@ltx/en_us_dedes/miscellanea:misc.Ode9
ltx/en_us_dedes/me.m12.dBC:meMA.Ode9C1T.text	
ltx/en_us_dedes/me.m12.dBC:meMA.Ode9C21.greekmelody	@ltx/en_us_dedes/he.h.m1:heHE.MystirionXenon.greekname
ltx/en_us_dedes/me.m12.dBC:meMA.Ode9C21.incipit	…
ltx/en_us_dedes/me.m12.dBC:meMA.Ode9C21.melody	@ltx/en_us_dedes/he.h.m1:heHE.MystirionXenon.name
ltx/en_us_dedes/me.m12.dBC:meMA.Ode9C21.mode	@ltx/en_us_dedes/miscellanea:misc.Mode1
ltx/en_us_dedes/me.m12.dBC:meMA.Ode9C21.ode	@ltx/en_us_dedes/miscellanea:misc.Ode9
ltx/en_us_dedes/me.m12.dBC:meMA.Ode9C21.text	
ltx/en_us_dedes/me.m12.dBC:meMA.Ode9C22.incipit	…
ltx/en_us_dedes/me.m12.dBC:meMA.Ode9C22.melody	@ltx/en_us_dedes/he.h.m1:heHE.MystirionXenon.name
ltx/en_us_dedes/me.m12.dBC:meMA.Ode9C22.mode	@ltx/en_us_dedes/miscellanea:misc.Mode1
ltx/en_us_dedes/me.m12.dBC:meMA.Ode9C22.ode	@ltx/en_us_dedes/miscellanea:misc.Ode9
ltx/en_us_dedes/me.m12.dBC:meMA.Ode9C22.text	
ltx/en_us_dedes/me.m12.dBC:meMA.Ode9C2T.incipit	…
ltx/en_us_dedes/me.m12.dBC:meMA.Ode9C2T.melody	@ltx/en_us_dedes/he.h.m1:heHE.MystirionXenon.name
ltx/en_us_dedes/me.m12.dBC:meMA.Ode9C2T.mode	@ltx/en_us_dedes/miscellanea:misc.Mode1
ltx/en_us_dedes/me.m12.dBC:meMA.Ode9C2T.ode	@ltx/en_us_dedes/miscellanea:misc.Ode9
ltx/en_us_dedes/me.m12.dBC:meMA.Ode9C2T.text	
ltx/en_us_dedes/me.m12.dBC:meMA.Oikos1.text	@ltx/en_us_dedes/me.m12.d17:meMA.Oikos2.text
ltx/en_us_dedes/me.m12.dBC:meMA.Oikos2.text	Perceiving the splendor of your childbirth shine forth, O Virgin, God-loving Abraham and the renowned Isaac and Jacob and the entire choir of saints assembled by God all rejoice. They have brought creation to greet you with joyful words. For you are the cause of joy for all, having conceived in your womb the very One who was seen in Babylon of old, and in a manner passing all understanding preserved unscathed the Servants who were thrown unjustly into the furnace. Therefore they sing praises to the One who was seen in the arms of the Maiden, extolling the Virgin who nurses Him.
ltx/en_us_dedes/me.m12.dBC:meVE.Apolytikion1.incipit	@ltx/en_us_dedes/me.m12.d17:meVE.Apolytikion1.incipit
ltx/en_us_dedes/me.m12.dBC:meVE.Apolytikion1.melody	
ltx/en_us_dedes/me.m12.dBC:meVE.Apolytikion1.mode	@ltx/en_us_dedes/miscellanea:misc.Mode2
ltx/en_us_dedes/me.m12.dBC:meVE.Apolytikion1.text	@ltx/en_us_dedes/me.m12.d17:meVE.Apolytikion1.text
ltx/en_us_dedes/me.m12.dBC:meVE.AposBoth.incipit	@ltx/en_us_dedes/me.m12.d12:meVE.AposBoth.incipit
ltx/en_us_dedes/me.m12.dBC:meVE.AposBoth.melody	
ltx/en_us_dedes/me.m12.dBC:meVE.AposBoth.mode	@ltx/en_us_dedes/miscellanea:misc.Mode2
ltx/en_us_dedes/me.m12.dBC:meVE.AposBoth.text	@ltx/en_us_dedes/me.m12.d12:meVE.AposBoth.text
ltx/en_us_dedes/me.m12.dBC:meVE.AposGlory.incipit	Rejoice, O honorable Prophets! You…
ltx/en_us_dedes/me.m12.dBC:meVE.AposGlory.melody	
ltx/en_us_dedes/me.m12.dBC:meVE.AposGlory.mode	@ltx/en_us_dedes/miscellanea:misc.Mode2
ltx/en_us_dedes/me.m12.dBC:meVE.AposGlory.poet	@ltx/en_us_dedes/poets:po.Kyprianou
ltx/en_us_dedes/me.m12.dBC:meVE.AposGlory.text	Rejoice, O honorable Prophets! You did well in decreeing the Law of the Lord, and you were immovable in your faith, like sturdy pillars. You were also mediators of the New Testament of Christ. Now that you have crossed over into heaven, entreat Him to bring peace to the world and to save our souls.
ltx/en_us_dedes/me.m12.dBC:meVE.LityBoth.incipit	@ltx/en_us_dedes/me.m12.d20:meVE.Stichera03.incipit
ltx/en_us_dedes/me.m12.dBC:meVE.LityBoth.melody	
ltx/en_us_dedes/me.m12.dBC:meVE.LityBoth.mode	@ltx/en_us_dedes/miscellanea:misc.Mode1
ltx/en_us_dedes/me.m12.dBC:meVE.LityBoth.text	@ltx/en_us_dedes/me.m12.d20:meVE.Stichera03.text
ltx/en_us_dedes/me.m12.dBC:meVE.LityGlory.incipit	…
ltx/en_us_dedes/me.m12.dBC:meVE.LityGlory.melody	
ltx/en_us_dedes/me.m12.dBC:meVE.LityGlory.mode	@ltx/en_us_dedes/miscellanea:misc.Mode1
ltx/en_us_dedes/me.m12.dBC:meVE.LityGlory.text	
ltx/en_us_dedes/me.m12.dBC:meVE.SticBoth.incipit	@ltx/en_us_dedes/me.m12.d06:meVE.SticBoth.incipit
ltx/en_us_dedes/me.m12.dBC:meVE.SticBoth.melody	
ltx/en_us_dedes/me.m12.dBC:meVE.SticBoth.mode	@ltx/en_us_dedes/miscellanea:misc.Mode6
ltx/en_us_dedes/me.m12.dBC:meVE.SticBoth.text	@ltx/en_us_dedes/me.m12.d06:meVE.SticBoth.text
ltx/en_us_dedes/me.m12.dBC:meVE.SticGlory.incipit	@ltx/en_us_dedes/me.m12.d17:meVE.AposBoth.incipit
ltx/en_us_dedes/me.m12.dBC:meVE.SticGlory.melody	
ltx/en_us_dedes/me.m12.dBC:meVE.SticGlory.mode	@ltx/en_us_dedes/miscellanea:misc.Mode6
ltx/en_us_dedes/me.m12.dBC:meVE.SticGlory.text	@ltx/en_us_dedes/me.m12.d17:meVE.AposBoth.text
ltx/en_us_dedes/me.m12.dBC:meVE.Stichera01.greekmelody	@ltx/en_us_dedes/he.a.m1:heAU.PaneffimoiMartyres.greekname
ltx/en_us_dedes/me.m12.dBC:meVE.Stichera01.incipit	…
ltx/en_us_dedes/me.m12.dBC:meVE.Stichera01.melody	@ltx/en_us_dedes/he.a.m1:heAU.PaneffimoiMartyres.name
ltx/en_us_dedes/me.m12.dBC:meVE.Stichera01.mode	@ltx/en_us_dedes/miscellanea:misc.Mode1
ltx/en_us_dedes/me.m12.dBC:meVE.Stichera01.text	
ltx/en_us_dedes/me.m12.dBC:meVE.Stichera02.incipit	…
ltx/en_us_dedes/me.m12.dBC:meVE.Stichera02.melody	@ltx/en_us_dedes/he.a.m1:heAU.PaneffimoiMartyres.name
ltx/en_us_dedes/me.m12.dBC:meVE.Stichera02.mode	@ltx/en_us_dedes/miscellanea:misc.Mode1
ltx/en_us_dedes/me.m12.dBC:meVE.Stichera02.text	
ltx/en_us_dedes/me.m12.dBC:meVE.Stichera03.incipit	…
ltx/en_us_dedes/me.m12.dBC:meVE.Stichera03.melody	@ltx/en_us_dedes/he.a.m1:heAU.PaneffimoiMartyres.name
ltx/en_us_dedes/me.m12.dBC:meVE.Stichera03.mode	@ltx/en_us_dedes/miscellanea:misc.Mode1
ltx/en_us_dedes/me.m12.dBC:meVE.Stichera03.text	
ltx/en_us_dedes/me.m12.dBC:meVE.Stichera04.greekmelody	@ltx/en_us_dedes/he.a.m8:heAU.OEnEdemParadeisos.greekname
ltx/en_us_dedes/me.m12.dBC:meVE.Stichera04.incipit	…
ltx/en_us_dedes/me.m12.dBC:meVE.Stichera04.melody	@ltx/en_us_dedes/he.a.m8:heAU.OEnEdemParadeisos.name
ltx/en_us_dedes/me.m12.dBC:meVE.Stichera04.mode	@ltx/en_us_dedes/miscellanea:misc.Mode8
ltx/en_us_dedes/me.m12.dBC:meVE.Stichera04.text	
ltx/en_us_dedes/me.m12.dBC:meVE.Stichera05.incipit	…
ltx/en_us_dedes/me.m12.dBC:meVE.Stichera05.melody	@ltx/en_us_dedes/he.a.m8:heAU.OEnEdemParadeisos.name
ltx/en_us_dedes/me.m12.dBC:meVE.Stichera05.mode	@ltx/en_us_dedes/miscellanea:misc.Mode8
ltx/en_us_dedes/me.m12.dBC:meVE.Stichera05.text	@ltx/en_us_dedes/me.m12.dFF:meVE.Stichera03.text
ltx/en_us_dedes/me.m12.dBC:meVE.Stichera06.incipit	@ltx/en_us_dedes/me.m12.dFF:meVE.Stichera04.incipit
ltx/en_us_dedes/me.m12.dBC:meVE.Stichera06.melody	@ltx/en_us_dedes/he.a.m8:heAU.OEnEdemParadeisos.name
ltx/en_us_dedes/me.m12.dBC:meVE.Stichera06.mode	@ltx/en_us_dedes/miscellanea:misc.Mode8
ltx/en_us_dedes/me.m12.dBC:meVE.Stichera06.text	@ltx/en_us_dedes/me.m12.dFF:meVE.Stichera04.text
