ltx/en_us_dedes/me.m01.d15:meDA.commemoration.first	Memory of our Devout Father Paul of Thebes
ltx/en_us_dedes/me.m01.d15:meDA.commemoration.first_name	
ltx/en_us_dedes/me.m01.d15:meDA.commemoration.first_short	Memory of St. Paul of Thebes
ltx/en_us_dedes/me.m01.d15:meDA.commemoration.first_title	For St. Paul.
ltx/en_us_dedes/me.m01.d15:meDA.commemoration.full	Memory of our Devout Father Paul of Thebes and Saint John the Hut-Dweller.
ltx/en_us_dedes/me.m01.d15:meDA.commemoration.second	
ltx/en_us_dedes/me.m01.d15:meDA.commemoration.second_name	
ltx/en_us_dedes/me.m01.d15:meDA.commemoration.second_short	Memory of St. John the Hut-Dweller
ltx/en_us_dedes/me.m01.d15:meDA.commemoration.second_title	For St. John.
ltx/en_us_dedes/me.m01.d15:meDA.date	January 15
ltx/en_us_dedes/me.m01.d15:meDA.fordate	for January 15
ltx/en_us_dedes/me.m01.d15:meDA.insert1	our devout and God-bearing father John the Hut-Dweller,
ltx/en_us_dedes/me.m01.d15:meDA.insert2	whose memory we observe;
ltx/en_us_dedes/me.m01.d15:meDA.note	
ltx/en_us_dedes/me.m01.d15:meDA.pdfcoverdate	January 15,
ltx/en_us_dedes/me.m01.d15:meDA.pdfheaderdate	January 15
ltx/en_us_dedes/me.m01.d15:meHO.commemorations	
ltx/en_us_dedes/me.m01.d15:meHO.note1	
ltx/en_us_dedes/me.m01.d15:meHO.note2	
ltx/en_us_dedes/me.m01.d15:meHO.number	15.
ltx/en_us_dedes/me.m01.d15:meHO.rank	
ltx/en_us_dedes/me.m01.d15:meLE.commemoration1	Our Devout Fathers Paul of Thebes and John the Hut-Dweller.
ltx/en_us_dedes/me.m01.d15:meLE.commemoration2	
ltx/en_us_dedes/me.m01.d15:meLI.Kontakion1.greekmelody	@ltx/en_us_dedes/me.m01.d15:meMA.Kontakion1.greekmelody
ltx/en_us_dedes/me.m01.d15:meLI.Kontakion1.incipit	@ltx/en_us_dedes/me.m01.d15:meMA.Kontakion1.incipit
ltx/en_us_dedes/me.m01.d15:meLI.Kontakion1.melody	@ltx/en_us_dedes/me.m01.d15:meMA.Kontakion1.melody
ltx/en_us_dedes/me.m01.d15:meLI.Kontakion1.mode	@ltx/en_us_dedes/me.m01.d15:meMA.Kontakion1.mode
ltx/en_us_dedes/me.m01.d15:meLI.Kontakion1.text	@ltx/en_us_dedes/me.m01.d15:meMA.Kontakion1.text
ltx/en_us_dedes/me.m01.d15:meLI.Megalynarion.text	
ltx/en_us_dedes/me.m01.d15:meMA.AposGlory.incipit	We the multitudes of monastics…
ltx/en_us_dedes/me.m01.d15:meMA.AposGlory.melody	
ltx/en_us_dedes/me.m01.d15:meMA.AposGlory.mode	@ltx/en_us_dedes/miscellanea:misc.Mode8
ltx/en_us_dedes/me.m01.d15:meMA.AposGlory.poet	@ltx/en_us_dedes/poets:po.Sykeotou
ltx/en_us_dedes/me.m01.d15:meMA.AposGlory.text	We the multitudes of monastics honor you, O Paul, as our teacher and guide. For through you we have learned to walk the truly straight and narrow path. Blessed are you, who served Christ and triumphed over the power of the enemy. As you consort now with the Angels and dwell with the Devout and Righteous, pray with them to the Lord, that He have mercy on our souls.
ltx/en_us_dedes/me.m01.d15:meMA.AposStavrotheotokion.greekmelody	@ltx/en_us_dedes/he.a.m8:heAU.OTouParadoxou.greekname
ltx/en_us_dedes/me.m01.d15:meMA.AposStavrotheotokion.incipit	“What is this spectacle that…
ltx/en_us_dedes/me.m01.d15:meMA.AposStavrotheotokion.melody	@ltx/en_us_dedes/he.a.m8:heAU.OTouParadoxou.name
ltx/en_us_dedes/me.m01.d15:meMA.AposStavrotheotokion.mode	@ltx/en_us_dedes/miscellanea:misc.Mode8
ltx/en_us_dedes/me.m01.d15:meMA.AposStavrotheotokion.text	“What is this spectacle that I see * with my own eyes, O my Son * the Creator of all the world? * You who hold creation all * in Your hand have been crucified! * You who give life to all living things have died!” * So did the Mother of God cry out and say, * as she was watching You * being lifted on the Cross, who had shone forth * from her womb ineffably, being both God and man.
ltx/en_us_dedes/me.m01.d15:meMA.AposTheotokion.incipit	@ltx/en_us_dedes/oc.m8.d7:ocVE.AposTheotokion.incipit
ltx/en_us_dedes/me.m01.d15:meMA.AposTheotokion.melody	
ltx/en_us_dedes/me.m01.d15:meMA.AposTheotokion.mode	@ltx/en_us_dedes/miscellanea:misc.Mode8
ltx/en_us_dedes/me.m01.d15:meMA.AposTheotokion.text	@ltx/en_us_dedes/oc.m8.d7:ocVE.AposTheotokion.text
ltx/en_us_dedes/me.m01.d15:meMA.C1.poet	@ltx/en_us_dedes/poets:po.IoannouTouDamaskinou
ltx/en_us_dedes/me.m01.d15:meMA.C1.title	Canon for St. Paul.
ltx/en_us_dedes/me.m01.d15:meMA.C1.verse	@ltx/en_us_dedes/prayers:pr.verse_DevoutMan.text
ltx/en_us_dedes/me.m01.d15:meMA.C2.acrostic.notice1	
ltx/en_us_dedes/me.m01.d15:meMA.C2.acrostic.text	
ltx/en_us_dedes/me.m01.d15:meMA.C2.acrostic.title	Canon for Saint John.
ltx/en_us_dedes/me.m01.d15:meMA.C2.title	Canon for St. John.
ltx/en_us_dedes/me.m01.d15:meMA.C2.verse	@ltx/en_us_dedes/prayers:pr.verse_SaintM.text
ltx/en_us_dedes/me.m01.d15:meMA.ExapTheotokion.incipit	O Maiden, you are praised…
ltx/en_us_dedes/me.m01.d15:meMA.ExapTheotokion.melody	@ltx/en_us_dedes/he.a.m2:heAU.GynaikesAkoutisthite.name
ltx/en_us_dedes/me.m01.d15:meMA.ExapTheotokion.mode	@ltx/en_us_dedes/miscellanea:misc.Mode2
ltx/en_us_dedes/me.m01.d15:meMA.ExapTheotokion.text	O Maiden, you are praised by all, * for you have given birth to Christ, * the Angel of the Father’s * great Counsel, and King of glory. * Devout ascetics, holy men * and women, having taken up * His Cross, have hastened after Him. * With them entreat without ceasing * on our behalf, Theotokos.
ltx/en_us_dedes/me.m01.d15:meMA.Exaposteilarion1.greekmelody	@ltx/en_us_dedes/he.a.m2:heAU.GynaikesAkoutisthite.greekname
ltx/en_us_dedes/me.m01.d15:meMA.Exaposteilarion1.incipit	By your participation in divinity…
ltx/en_us_dedes/me.m01.d15:meMA.Exaposteilarion1.melody	@ltx/en_us_dedes/he.a.m2:heAU.GynaikesAkoutisthite.name
ltx/en_us_dedes/me.m01.d15:meMA.Exaposteilarion1.mode	@ltx/en_us_dedes/miscellanea:misc.Mode2
ltx/en_us_dedes/me.m01.d15:meMA.Exaposteilarion1.text	By your participation in divinity did you, O Saint, * become a god by adoption, * with Anthony, O all-blessed. * With him commemorate us who each year on this day celebrate * your most resplendent memory * and honor you, O devout Paul, * the guiding star of monastics.
ltx/en_us_dedes/me.m01.d15:meMA.Exaposteilarion2.greekmelody	@ltx/en_us_dedes/he.a.m2:heAU.GynaikesAkoutisthite.greekname
ltx/en_us_dedes/me.m01.d15:meMA.Exaposteilarion2.incipit	A poor man, just like…
ltx/en_us_dedes/me.m01.d15:meMA.Exaposteilarion2.melody	@ltx/en_us_dedes/he.a.m2:heAU.GynaikesAkoutisthite.name
ltx/en_us_dedes/me.m01.d15:meMA.Exaposteilarion2.mode	@ltx/en_us_dedes/miscellanea:misc.Mode2
ltx/en_us_dedes/me.m01.d15:meMA.Exaposteilarion2.text	A poor man, just like Lazarus, * and cramped inside your tiny hut, * you stayed with persistent patience * before the gates of your parents, * O Father John, devout and wise. * But in return you have received * your due rewards, O holy one: * your dwelling is now in heaven * with all the saints and the angels.
ltx/en_us_dedes/me.m01.d15:meMA.Exaposteilarion3.greekmelody	@ltx/en_us_dedes/he.a.m2:heAU.GynaikesAkoutisthite.greekname
ltx/en_us_dedes/me.m01.d15:meMA.Exaposteilarion3.incipit	…
ltx/en_us_dedes/me.m01.d15:meMA.Exaposteilarion3.melody	@ltx/en_us_dedes/he.a.m2:heAU.GynaikesAkoutisthite.name
ltx/en_us_dedes/me.m01.d15:meMA.Exaposteilarion3.mode	@ltx/en_us_dedes/miscellanea:misc.Mode2
ltx/en_us_dedes/me.m01.d15:meMA.Exaposteilarion3.text	
ltx/en_us_dedes/me.m01.d15:meMA.Kontakion1.greekmelody	@ltx/en_us_dedes/he.a.m2:heAU.TaAnoZiton.greekname
ltx/en_us_dedes/me.m01.d15:meMA.Kontakion1.incipit	…
ltx/en_us_dedes/me.m01.d15:meMA.Kontakion1.melody	@ltx/en_us_dedes/he.a.m2:heAU.TaAnoZiton.name
ltx/en_us_dedes/me.m01.d15:meMA.Kontakion1.mode	@ltx/en_us_dedes/miscellanea:misc.Mode2
ltx/en_us_dedes/me.m01.d15:meMA.Kontakion1.text	
ltx/en_us_dedes/me.m01.d15:meMA.MM.Ve4456as5678.text	@ltx/en_us_dedes/properties:media.key
ltx/en_us_dedes/me.m01.d15:meMA.Ode1C11.greekmelody	@ltx/en_us_dedes/he.h.m8:heHE.AsomenToKyrio.greekname
ltx/en_us_dedes/me.m01.d15:meMA.Ode1C11.incipit	…
ltx/en_us_dedes/me.m01.d15:meMA.Ode1C11.melody	@ltx/en_us_dedes/he.h.m8:heHE.AsomenToKyrio.name
ltx/en_us_dedes/me.m01.d15:meMA.Ode1C11.mode	@ltx/en_us_dedes/miscellanea:misc.Mode8
ltx/en_us_dedes/me.m01.d15:meMA.Ode1C11.ode	@ltx/en_us_dedes/miscellanea:misc.Ode1
ltx/en_us_dedes/me.m01.d15:meMA.Ode1C11.text	
ltx/en_us_dedes/me.m01.d15:meMA.Ode1C12.incipit	…
ltx/en_us_dedes/me.m01.d15:meMA.Ode1C12.melody	@ltx/en_us_dedes/he.h.m8:heHE.AsomenToKyrio.name
ltx/en_us_dedes/me.m01.d15:meMA.Ode1C12.mode	@ltx/en_us_dedes/miscellanea:misc.Mode8
ltx/en_us_dedes/me.m01.d15:meMA.Ode1C12.ode	@ltx/en_us_dedes/miscellanea:misc.Ode1
ltx/en_us_dedes/me.m01.d15:meMA.Ode1C12.text	
ltx/en_us_dedes/me.m01.d15:meMA.Ode1C13.incipit	…
ltx/en_us_dedes/me.m01.d15:meMA.Ode1C13.melody	@ltx/en_us_dedes/he.h.m8:heHE.AsomenToKyrio.name
ltx/en_us_dedes/me.m01.d15:meMA.Ode1C13.mode	@ltx/en_us_dedes/miscellanea:misc.Mode8
ltx/en_us_dedes/me.m01.d15:meMA.Ode1C13.ode	@ltx/en_us_dedes/miscellanea:misc.Ode1
ltx/en_us_dedes/me.m01.d15:meMA.Ode1C13.text	
ltx/en_us_dedes/me.m01.d15:meMA.Ode1C1T.incipit	…
ltx/en_us_dedes/me.m01.d15:meMA.Ode1C1T.melody	@ltx/en_us_dedes/he.h.m8:heHE.AsomenToKyrio.name
ltx/en_us_dedes/me.m01.d15:meMA.Ode1C1T.mode	@ltx/en_us_dedes/miscellanea:misc.Mode8
ltx/en_us_dedes/me.m01.d15:meMA.Ode1C1T.ode	@ltx/en_us_dedes/miscellanea:misc.Ode1
ltx/en_us_dedes/me.m01.d15:meMA.Ode1C1T.text	
ltx/en_us_dedes/me.m01.d15:meMA.Ode1C21.greekmelody	@ltx/en_us_dedes/he.h.m2:heHE.EnVythoKatestrose.greekname
ltx/en_us_dedes/me.m01.d15:meMA.Ode1C21.incipit	…
ltx/en_us_dedes/me.m01.d15:meMA.Ode1C21.melody	@ltx/en_us_dedes/he.h.m2:heHE.EnVythoKatestrose.name
ltx/en_us_dedes/me.m01.d15:meMA.Ode1C21.mode	@ltx/en_us_dedes/miscellanea:misc.Mode2
ltx/en_us_dedes/me.m01.d15:meMA.Ode1C21.ode	@ltx/en_us_dedes/miscellanea:misc.Ode1
ltx/en_us_dedes/me.m01.d15:meMA.Ode1C21.text	
ltx/en_us_dedes/me.m01.d15:meMA.Ode1C22.incipit	…
ltx/en_us_dedes/me.m01.d15:meMA.Ode1C22.melody	@ltx/en_us_dedes/he.h.m2:heHE.EnVythoKatestrose.name
ltx/en_us_dedes/me.m01.d15:meMA.Ode1C22.mode	@ltx/en_us_dedes/miscellanea:misc.Mode2
ltx/en_us_dedes/me.m01.d15:meMA.Ode1C22.ode	@ltx/en_us_dedes/miscellanea:misc.Ode1
ltx/en_us_dedes/me.m01.d15:meMA.Ode1C22.text	
ltx/en_us_dedes/me.m01.d15:meMA.Ode1C23.incipit	…
ltx/en_us_dedes/me.m01.d15:meMA.Ode1C23.melody	@ltx/en_us_dedes/he.h.m2:heHE.EnVythoKatestrose.name
ltx/en_us_dedes/me.m01.d15:meMA.Ode1C23.mode	@ltx/en_us_dedes/miscellanea:misc.Mode2
ltx/en_us_dedes/me.m01.d15:meMA.Ode1C23.ode	@ltx/en_us_dedes/miscellanea:misc.Ode1
ltx/en_us_dedes/me.m01.d15:meMA.Ode1C23.text	
ltx/en_us_dedes/me.m01.d15:meMA.Ode1C2T.incipit	…
ltx/en_us_dedes/me.m01.d15:meMA.Ode1C2T.melody	@ltx/en_us_dedes/he.h.m2:heHE.EnVythoKatestrose.name
ltx/en_us_dedes/me.m01.d15:meMA.Ode1C2T.mode	@ltx/en_us_dedes/miscellanea:misc.Mode2
ltx/en_us_dedes/me.m01.d15:meMA.Ode1C2T.ode	@ltx/en_us_dedes/miscellanea:misc.Ode1
ltx/en_us_dedes/me.m01.d15:meMA.Ode1C2T.text	
ltx/en_us_dedes/me.m01.d15:meMA.Ode3C11.greekmelody	@ltx/en_us_dedes/he.h.m8:heHE.OStereosasLogo.greekname
ltx/en_us_dedes/me.m01.d15:meMA.Ode3C11.incipit	…
ltx/en_us_dedes/me.m01.d15:meMA.Ode3C11.melody	@ltx/en_us_dedes/he.h.m8:heHE.OStereosasLogo.name
ltx/en_us_dedes/me.m01.d15:meMA.Ode3C11.mode	@ltx/en_us_dedes/miscellanea:misc.Mode8
ltx/en_us_dedes/me.m01.d15:meMA.Ode3C11.ode	@ltx/en_us_dedes/miscellanea:misc.Ode3
ltx/en_us_dedes/me.m01.d15:meMA.Ode3C11.text	
ltx/en_us_dedes/me.m01.d15:meMA.Ode3C12.incipit	…
ltx/en_us_dedes/me.m01.d15:meMA.Ode3C12.melody	@ltx/en_us_dedes/he.h.m8:heHE.OStereosasLogo.name
ltx/en_us_dedes/me.m01.d15:meMA.Ode3C12.mode	@ltx/en_us_dedes/miscellanea:misc.Mode8
ltx/en_us_dedes/me.m01.d15:meMA.Ode3C12.ode	@ltx/en_us_dedes/miscellanea:misc.Ode3
ltx/en_us_dedes/me.m01.d15:meMA.Ode3C12.text	
ltx/en_us_dedes/me.m01.d15:meMA.Ode3C13.incipit	…
ltx/en_us_dedes/me.m01.d15:meMA.Ode3C13.melody	@ltx/en_us_dedes/he.h.m8:heHE.OStereosasLogo.name
ltx/en_us_dedes/me.m01.d15:meMA.Ode3C13.mode	@ltx/en_us_dedes/miscellanea:misc.Mode8
ltx/en_us_dedes/me.m01.d15:meMA.Ode3C13.ode	@ltx/en_us_dedes/miscellanea:misc.Ode3
ltx/en_us_dedes/me.m01.d15:meMA.Ode3C13.text	
ltx/en_us_dedes/me.m01.d15:meMA.Ode3C1T.incipit	…
ltx/en_us_dedes/me.m01.d15:meMA.Ode3C1T.melody	@ltx/en_us_dedes/he.h.m8:heHE.OStereosasLogo.name
ltx/en_us_dedes/me.m01.d15:meMA.Ode3C1T.mode	@ltx/en_us_dedes/miscellanea:misc.Mode8
ltx/en_us_dedes/me.m01.d15:meMA.Ode3C1T.ode	@ltx/en_us_dedes/miscellanea:misc.Ode3
ltx/en_us_dedes/me.m01.d15:meMA.Ode3C1T.text	
ltx/en_us_dedes/me.m01.d15:meMA.Ode3C21.greekmelody	@ltx/en_us_dedes/he.h.m2:heHE.ExinthisenIErimos.greekname
ltx/en_us_dedes/me.m01.d15:meMA.Ode3C21.incipit	…
ltx/en_us_dedes/me.m01.d15:meMA.Ode3C21.melody	@ltx/en_us_dedes/he.h.m2:heHE.ExinthisenIErimos.name
ltx/en_us_dedes/me.m01.d15:meMA.Ode3C21.mode	@ltx/en_us_dedes/miscellanea:misc.Mode2
ltx/en_us_dedes/me.m01.d15:meMA.Ode3C21.ode	@ltx/en_us_dedes/miscellanea:misc.Ode3
ltx/en_us_dedes/me.m01.d15:meMA.Ode3C21.text	
ltx/en_us_dedes/me.m01.d15:meMA.Ode3C22.incipit	…
ltx/en_us_dedes/me.m01.d15:meMA.Ode3C22.melody	@ltx/en_us_dedes/he.h.m2:heHE.ExinthisenIErimos.name
ltx/en_us_dedes/me.m01.d15:meMA.Ode3C22.mode	@ltx/en_us_dedes/miscellanea:misc.Mode2
ltx/en_us_dedes/me.m01.d15:meMA.Ode3C22.ode	@ltx/en_us_dedes/miscellanea:misc.Ode3
ltx/en_us_dedes/me.m01.d15:meMA.Ode3C22.text	
ltx/en_us_dedes/me.m01.d15:meMA.Ode3C23.incipit	…
ltx/en_us_dedes/me.m01.d15:meMA.Ode3C23.melody	@ltx/en_us_dedes/he.h.m2:heHE.ExinthisenIErimos.name
ltx/en_us_dedes/me.m01.d15:meMA.Ode3C23.mode	@ltx/en_us_dedes/miscellanea:misc.Mode2
ltx/en_us_dedes/me.m01.d15:meMA.Ode3C23.ode	@ltx/en_us_dedes/miscellanea:misc.Ode3
ltx/en_us_dedes/me.m01.d15:meMA.Ode3C23.text	
ltx/en_us_dedes/me.m01.d15:meMA.Ode3C2T.incipit	…
ltx/en_us_dedes/me.m01.d15:meMA.Ode3C2T.melody	@ltx/en_us_dedes/he.h.m2:heHE.ExinthisenIErimos.name
ltx/en_us_dedes/me.m01.d15:meMA.Ode3C2T.mode	@ltx/en_us_dedes/miscellanea:misc.Mode2
ltx/en_us_dedes/me.m01.d15:meMA.Ode3C2T.ode	@ltx/en_us_dedes/miscellanea:misc.Ode3
ltx/en_us_dedes/me.m01.d15:meMA.Ode3C2T.text	
ltx/en_us_dedes/me.m01.d15:meMA.Ode3H.greekmelody	@ltx/en_us_dedes/he.h.m2:heHE.ExinthisenIErimos.greekname
ltx/en_us_dedes/me.m01.d15:meMA.Ode3H.incipit	@ltx/en_us_dedes/he.h.m2:heHE.ExinthisenIErimos.incipit
ltx/en_us_dedes/me.m01.d15:meMA.Ode3H.melody	@ltx/en_us_dedes/he.h.m2:heHE.ExinthisenIErimos.melody
ltx/en_us_dedes/me.m01.d15:meMA.Ode3H.mode	@ltx/en_us_dedes/miscellanea:misc.Mode2
ltx/en_us_dedes/me.m01.d15:meMA.Ode3H.ode	@ltx/en_us_dedes/miscellanea:misc.Ode3
ltx/en_us_dedes/me.m01.d15:meMA.Ode3H.text	@ltx/en_us_dedes/he.h.m2:heHE.ExinthisenIErimos.text
ltx/en_us_dedes/me.m01.d15:meMA.Ode3Kathisma1.greekmelody	@ltx/en_us_dedes/he.a.m1:heAU.TonTafonSouSotir.greekname
ltx/en_us_dedes/me.m01.d15:meMA.Ode3Kathisma1.incipit	…
ltx/en_us_dedes/me.m01.d15:meMA.Ode3Kathisma1.melody	@ltx/en_us_dedes/he.a.m1:heAU.TonTafonSouSotir.name
ltx/en_us_dedes/me.m01.d15:meMA.Ode3Kathisma1.mode	@ltx/en_us_dedes/miscellanea:misc.Mode1
ltx/en_us_dedes/me.m01.d15:meMA.Ode3Kathisma1.text	
ltx/en_us_dedes/me.m01.d15:meMA.Ode3Kathisma2.greekmelody	@ltx/en_us_dedes/he.a.m3:heAU.TinOraiotita.greekname
ltx/en_us_dedes/me.m01.d15:meMA.Ode3Kathisma2.incipit	…
ltx/en_us_dedes/me.m01.d15:meMA.Ode3Kathisma2.melody	@ltx/en_us_dedes/he.a.m3:heAU.TinOraiotita.name
ltx/en_us_dedes/me.m01.d15:meMA.Ode3Kathisma2.mode	@ltx/en_us_dedes/miscellanea:misc.Mode3
ltx/en_us_dedes/me.m01.d15:meMA.Ode3Kathisma2.text	
ltx/en_us_dedes/me.m01.d15:meMA.Ode3KathismaSt.incipit	@ltx/en_us_dedes/oc.m3.d4:ocMA.Kathisma23.incipit
ltx/en_us_dedes/me.m01.d15:meMA.Ode3KathismaSt.melody	@ltx/en_us_dedes/he.a.m3:heAU.TinOraiotita.name
ltx/en_us_dedes/me.m01.d15:meMA.Ode3KathismaSt.mode	@ltx/en_us_dedes/miscellanea:misc.Mode3
ltx/en_us_dedes/me.m01.d15:meMA.Ode3KathismaSt.text	@ltx/en_us_dedes/oc.m3.d4:ocMA.Kathisma23.text
ltx/en_us_dedes/me.m01.d15:meMA.Ode3KathismaT.incipit	@ltx/en_us_dedes/oc.m3.d5:octrMA.Kathisma1T.incipit
ltx/en_us_dedes/me.m01.d15:meMA.Ode3KathismaT.melody	@ltx/en_us_dedes/he.a.m3:heAU.TinOraiotita.name
ltx/en_us_dedes/me.m01.d15:meMA.Ode3KathismaT.mode	@ltx/en_us_dedes/miscellanea:misc.Mode3
ltx/en_us_dedes/me.m01.d15:meMA.Ode3KathismaT.text	@ltx/en_us_dedes/oc.m3.d5:octrMA.Kathisma1T.text
ltx/en_us_dedes/me.m01.d15:meMA.Ode4C11.greekmelody	@ltx/en_us_dedes/he.h.m8:heHE.MystikosOProfitis.greekname
ltx/en_us_dedes/me.m01.d15:meMA.Ode4C11.incipit	…
ltx/en_us_dedes/me.m01.d15:meMA.Ode4C11.melody	@ltx/en_us_dedes/he.h.m8:heHE.MystikosOProfitis.name
ltx/en_us_dedes/me.m01.d15:meMA.Ode4C11.mode	@ltx/en_us_dedes/miscellanea:misc.Mode8
ltx/en_us_dedes/me.m01.d15:meMA.Ode4C11.ode	@ltx/en_us_dedes/miscellanea:misc.Ode4
ltx/en_us_dedes/me.m01.d15:meMA.Ode4C11.text	
ltx/en_us_dedes/me.m01.d15:meMA.Ode4C12.incipit	…
ltx/en_us_dedes/me.m01.d15:meMA.Ode4C12.melody	@ltx/en_us_dedes/he.h.m8:heHE.MystikosOProfitis.name
ltx/en_us_dedes/me.m01.d15:meMA.Ode4C12.mode	@ltx/en_us_dedes/miscellanea:misc.Mode8
ltx/en_us_dedes/me.m01.d15:meMA.Ode4C12.ode	@ltx/en_us_dedes/miscellanea:misc.Ode4
ltx/en_us_dedes/me.m01.d15:meMA.Ode4C12.text	
ltx/en_us_dedes/me.m01.d15:meMA.Ode4C13.incipit	…
ltx/en_us_dedes/me.m01.d15:meMA.Ode4C13.melody	@ltx/en_us_dedes/he.h.m8:heHE.MystikosOProfitis.name
ltx/en_us_dedes/me.m01.d15:meMA.Ode4C13.mode	@ltx/en_us_dedes/miscellanea:misc.Mode8
ltx/en_us_dedes/me.m01.d15:meMA.Ode4C13.ode	@ltx/en_us_dedes/miscellanea:misc.Ode4
ltx/en_us_dedes/me.m01.d15:meMA.Ode4C13.text	
ltx/en_us_dedes/me.m01.d15:meMA.Ode4C1T.incipit	…
ltx/en_us_dedes/me.m01.d15:meMA.Ode4C1T.melody	@ltx/en_us_dedes/he.h.m8:heHE.MystikosOProfitis.name
ltx/en_us_dedes/me.m01.d15:meMA.Ode4C1T.mode	@ltx/en_us_dedes/miscellanea:misc.Mode8
ltx/en_us_dedes/me.m01.d15:meMA.Ode4C1T.ode	@ltx/en_us_dedes/miscellanea:misc.Ode4
ltx/en_us_dedes/me.m01.d15:meMA.Ode4C1T.text	
ltx/en_us_dedes/me.m01.d15:meMA.Ode4C21.greekmelody	@ltx/en_us_dedes/he.h.m2:heHE.ElilythasEkParthenou.greekname
ltx/en_us_dedes/me.m01.d15:meMA.Ode4C21.incipit	…
ltx/en_us_dedes/me.m01.d15:meMA.Ode4C21.melody	@ltx/en_us_dedes/he.h.m2:heHE.ElilythasEkParthenou.name
ltx/en_us_dedes/me.m01.d15:meMA.Ode4C21.mode	@ltx/en_us_dedes/miscellanea:misc.Mode2
ltx/en_us_dedes/me.m01.d15:meMA.Ode4C21.ode	@ltx/en_us_dedes/miscellanea:misc.Ode4
ltx/en_us_dedes/me.m01.d15:meMA.Ode4C21.text	
ltx/en_us_dedes/me.m01.d15:meMA.Ode4C22.incipit	…
ltx/en_us_dedes/me.m01.d15:meMA.Ode4C22.melody	@ltx/en_us_dedes/he.h.m2:heHE.ElilythasEkParthenou.name
ltx/en_us_dedes/me.m01.d15:meMA.Ode4C22.mode	@ltx/en_us_dedes/miscellanea:misc.Mode2
ltx/en_us_dedes/me.m01.d15:meMA.Ode4C22.ode	@ltx/en_us_dedes/miscellanea:misc.Ode4
ltx/en_us_dedes/me.m01.d15:meMA.Ode4C22.text	
ltx/en_us_dedes/me.m01.d15:meMA.Ode4C23.incipit	…
ltx/en_us_dedes/me.m01.d15:meMA.Ode4C23.melody	@ltx/en_us_dedes/he.h.m2:heHE.ElilythasEkParthenou.name
ltx/en_us_dedes/me.m01.d15:meMA.Ode4C23.mode	@ltx/en_us_dedes/miscellanea:misc.Mode2
ltx/en_us_dedes/me.m01.d15:meMA.Ode4C23.ode	@ltx/en_us_dedes/miscellanea:misc.Ode4
ltx/en_us_dedes/me.m01.d15:meMA.Ode4C23.text	
ltx/en_us_dedes/me.m01.d15:meMA.Ode4C2T.incipit	…
ltx/en_us_dedes/me.m01.d15:meMA.Ode4C2T.melody	@ltx/en_us_dedes/he.h.m2:heHE.ElilythasEkParthenou.name
ltx/en_us_dedes/me.m01.d15:meMA.Ode4C2T.mode	@ltx/en_us_dedes/miscellanea:misc.Mode2
ltx/en_us_dedes/me.m01.d15:meMA.Ode4C2T.ode	@ltx/en_us_dedes/miscellanea:misc.Ode4
ltx/en_us_dedes/me.m01.d15:meMA.Ode4C2T.text	
ltx/en_us_dedes/me.m01.d15:meMA.Ode5C11.greekmelody	@ltx/en_us_dedes/he.h.m8:heHE.OrthrizontesVoomenSoi.greekname
ltx/en_us_dedes/me.m01.d15:meMA.Ode5C11.incipit	…
ltx/en_us_dedes/me.m01.d15:meMA.Ode5C11.melody	@ltx/en_us_dedes/he.h.m8:heHE.OrthrizontesVoomenSoi.name
ltx/en_us_dedes/me.m01.d15:meMA.Ode5C11.mode	@ltx/en_us_dedes/miscellanea:misc.Mode8
ltx/en_us_dedes/me.m01.d15:meMA.Ode5C11.ode	@ltx/en_us_dedes/miscellanea:misc.Ode5
ltx/en_us_dedes/me.m01.d15:meMA.Ode5C11.text	
ltx/en_us_dedes/me.m01.d15:meMA.Ode5C12.incipit	…
ltx/en_us_dedes/me.m01.d15:meMA.Ode5C12.melody	@ltx/en_us_dedes/he.h.m8:heHE.OrthrizontesVoomenSoi.name
ltx/en_us_dedes/me.m01.d15:meMA.Ode5C12.mode	@ltx/en_us_dedes/miscellanea:misc.Mode8
ltx/en_us_dedes/me.m01.d15:meMA.Ode5C12.ode	@ltx/en_us_dedes/miscellanea:misc.Ode5
ltx/en_us_dedes/me.m01.d15:meMA.Ode5C12.text	
ltx/en_us_dedes/me.m01.d15:meMA.Ode5C13.incipit	…
ltx/en_us_dedes/me.m01.d15:meMA.Ode5C13.melody	@ltx/en_us_dedes/he.h.m8:heHE.OrthrizontesVoomenSoi.name
ltx/en_us_dedes/me.m01.d15:meMA.Ode5C13.mode	@ltx/en_us_dedes/miscellanea:misc.Mode8
ltx/en_us_dedes/me.m01.d15:meMA.Ode5C13.ode	@ltx/en_us_dedes/miscellanea:misc.Ode5
ltx/en_us_dedes/me.m01.d15:meMA.Ode5C13.text	
ltx/en_us_dedes/me.m01.d15:meMA.Ode5C1T.incipit	…
ltx/en_us_dedes/me.m01.d15:meMA.Ode5C1T.melody	@ltx/en_us_dedes/he.h.m8:heHE.OrthrizontesVoomenSoi.name
ltx/en_us_dedes/me.m01.d15:meMA.Ode5C1T.mode	@ltx/en_us_dedes/miscellanea:misc.Mode8
ltx/en_us_dedes/me.m01.d15:meMA.Ode5C1T.ode	@ltx/en_us_dedes/miscellanea:misc.Ode5
ltx/en_us_dedes/me.m01.d15:meMA.Ode5C1T.text	
ltx/en_us_dedes/me.m01.d15:meMA.Ode5C21.greekmelody	@ltx/en_us_dedes/he.h.m2:heHE.OFotismos.greekname
ltx/en_us_dedes/me.m01.d15:meMA.Ode5C21.incipit	…
ltx/en_us_dedes/me.m01.d15:meMA.Ode5C21.melody	@ltx/en_us_dedes/he.h.m2:heHE.OFotismos.name
ltx/en_us_dedes/me.m01.d15:meMA.Ode5C21.mode	@ltx/en_us_dedes/miscellanea:misc.Mode2
ltx/en_us_dedes/me.m01.d15:meMA.Ode5C21.ode	@ltx/en_us_dedes/miscellanea:misc.Ode5
ltx/en_us_dedes/me.m01.d15:meMA.Ode5C21.text	
ltx/en_us_dedes/me.m01.d15:meMA.Ode5C22.incipit	…
ltx/en_us_dedes/me.m01.d15:meMA.Ode5C22.melody	@ltx/en_us_dedes/he.h.m2:heHE.OFotismos.name
ltx/en_us_dedes/me.m01.d15:meMA.Ode5C22.mode	@ltx/en_us_dedes/miscellanea:misc.Mode2
ltx/en_us_dedes/me.m01.d15:meMA.Ode5C22.ode	@ltx/en_us_dedes/miscellanea:misc.Ode5
ltx/en_us_dedes/me.m01.d15:meMA.Ode5C22.text	
ltx/en_us_dedes/me.m01.d15:meMA.Ode5C23.incipit	…
ltx/en_us_dedes/me.m01.d15:meMA.Ode5C23.melody	@ltx/en_us_dedes/he.h.m2:heHE.OFotismos.name
ltx/en_us_dedes/me.m01.d15:meMA.Ode5C23.mode	@ltx/en_us_dedes/miscellanea:misc.Mode2
ltx/en_us_dedes/me.m01.d15:meMA.Ode5C23.ode	@ltx/en_us_dedes/miscellanea:misc.Ode5
ltx/en_us_dedes/me.m01.d15:meMA.Ode5C23.text	
ltx/en_us_dedes/me.m01.d15:meMA.Ode5C2T.incipit	…
ltx/en_us_dedes/me.m01.d15:meMA.Ode5C2T.melody	@ltx/en_us_dedes/he.h.m2:heHE.OFotismos.name
ltx/en_us_dedes/me.m01.d15:meMA.Ode5C2T.mode	@ltx/en_us_dedes/miscellanea:misc.Mode2
ltx/en_us_dedes/me.m01.d15:meMA.Ode5C2T.ode	@ltx/en_us_dedes/miscellanea:misc.Ode5
ltx/en_us_dedes/me.m01.d15:meMA.Ode5C2T.text	
ltx/en_us_dedes/me.m01.d15:meMA.Ode6C11.greekmelody	@ltx/en_us_dedes/he.h.m8:heHE.ChitonaMoiParaschou.greekname
ltx/en_us_dedes/me.m01.d15:meMA.Ode6C11.incipit	…
ltx/en_us_dedes/me.m01.d15:meMA.Ode6C11.melody	@ltx/en_us_dedes/he.h.m8:heHE.ChitonaMoiParaschou.name
ltx/en_us_dedes/me.m01.d15:meMA.Ode6C11.mode	@ltx/en_us_dedes/miscellanea:misc.Mode8
ltx/en_us_dedes/me.m01.d15:meMA.Ode6C11.ode	@ltx/en_us_dedes/miscellanea:misc.Ode6
ltx/en_us_dedes/me.m01.d15:meMA.Ode6C11.text	
ltx/en_us_dedes/me.m01.d15:meMA.Ode6C12.incipit	…
ltx/en_us_dedes/me.m01.d15:meMA.Ode6C12.melody	@ltx/en_us_dedes/he.h.m8:heHE.ChitonaMoiParaschou.name
ltx/en_us_dedes/me.m01.d15:meMA.Ode6C12.mode	@ltx/en_us_dedes/miscellanea:misc.Mode8
ltx/en_us_dedes/me.m01.d15:meMA.Ode6C12.ode	@ltx/en_us_dedes/miscellanea:misc.Ode6
ltx/en_us_dedes/me.m01.d15:meMA.Ode6C12.text	
ltx/en_us_dedes/me.m01.d15:meMA.Ode6C13.incipit	…
ltx/en_us_dedes/me.m01.d15:meMA.Ode6C13.melody	@ltx/en_us_dedes/he.h.m8:heHE.ChitonaMoiParaschou.name
ltx/en_us_dedes/me.m01.d15:meMA.Ode6C13.mode	@ltx/en_us_dedes/miscellanea:misc.Mode8
ltx/en_us_dedes/me.m01.d15:meMA.Ode6C13.ode	@ltx/en_us_dedes/miscellanea:misc.Ode6
ltx/en_us_dedes/me.m01.d15:meMA.Ode6C13.text	
ltx/en_us_dedes/me.m01.d15:meMA.Ode6C1T.incipit	…
ltx/en_us_dedes/me.m01.d15:meMA.Ode6C1T.melody	@ltx/en_us_dedes/he.h.m8:heHE.ChitonaMoiParaschou.name
ltx/en_us_dedes/me.m01.d15:meMA.Ode6C1T.mode	@ltx/en_us_dedes/miscellanea:misc.Mode8
ltx/en_us_dedes/me.m01.d15:meMA.Ode6C1T.ode	@ltx/en_us_dedes/miscellanea:misc.Ode6
ltx/en_us_dedes/me.m01.d15:meMA.Ode6C1T.text	
ltx/en_us_dedes/me.m01.d15:meMA.Ode6C21.greekmelody	@ltx/en_us_dedes/he.h.m2:heHE.EnAvyssoPtaismaton.greekname
ltx/en_us_dedes/me.m01.d15:meMA.Ode6C21.incipit	…
ltx/en_us_dedes/me.m01.d15:meMA.Ode6C21.melody	@ltx/en_us_dedes/he.h.m2:heHE.EnAvyssoPtaismaton.name
ltx/en_us_dedes/me.m01.d15:meMA.Ode6C21.mode	@ltx/en_us_dedes/miscellanea:misc.Mode2
ltx/en_us_dedes/me.m01.d15:meMA.Ode6C21.ode	@ltx/en_us_dedes/miscellanea:misc.Ode6
ltx/en_us_dedes/me.m01.d15:meMA.Ode6C21.text	
ltx/en_us_dedes/me.m01.d15:meMA.Ode6C22.incipit	…
ltx/en_us_dedes/me.m01.d15:meMA.Ode6C22.melody	@ltx/en_us_dedes/he.h.m2:heHE.EnAvyssoPtaismaton.name
ltx/en_us_dedes/me.m01.d15:meMA.Ode6C22.mode	@ltx/en_us_dedes/miscellanea:misc.Mode2
ltx/en_us_dedes/me.m01.d15:meMA.Ode6C22.ode	@ltx/en_us_dedes/miscellanea:misc.Ode6
ltx/en_us_dedes/me.m01.d15:meMA.Ode6C22.text	
ltx/en_us_dedes/me.m01.d15:meMA.Ode6C23.incipit	…
ltx/en_us_dedes/me.m01.d15:meMA.Ode6C23.melody	@ltx/en_us_dedes/he.h.m2:heHE.EnAvyssoPtaismaton.name
ltx/en_us_dedes/me.m01.d15:meMA.Ode6C23.mode	@ltx/en_us_dedes/miscellanea:misc.Mode2
ltx/en_us_dedes/me.m01.d15:meMA.Ode6C23.ode	@ltx/en_us_dedes/miscellanea:misc.Ode6
ltx/en_us_dedes/me.m01.d15:meMA.Ode6C23.text	
ltx/en_us_dedes/me.m01.d15:meMA.Ode6C2T.incipit	…
ltx/en_us_dedes/me.m01.d15:meMA.Ode6C2T.melody	@ltx/en_us_dedes/he.h.m2:heHE.EnAvyssoPtaismaton.name
ltx/en_us_dedes/me.m01.d15:meMA.Ode6C2T.mode	@ltx/en_us_dedes/miscellanea:misc.Mode2
ltx/en_us_dedes/me.m01.d15:meMA.Ode6C2T.ode	@ltx/en_us_dedes/miscellanea:misc.Ode6
ltx/en_us_dedes/me.m01.d15:meMA.Ode6C2T.text	
ltx/en_us_dedes/me.m01.d15:meMA.Ode6H.greekmelody	@ltx/en_us_dedes/he.h.m2:heHE.EnAvyssoPtaismaton.greekname
ltx/en_us_dedes/me.m01.d15:meMA.Ode6H.incipit	@ltx/en_us_dedes/he.h.m2:heHE.EnAvyssoPtaismaton.incipit
ltx/en_us_dedes/me.m01.d15:meMA.Ode6H.melody	@ltx/en_us_dedes/he.h.m2:heHE.EnAvyssoPtaismaton.melody
ltx/en_us_dedes/me.m01.d15:meMA.Ode6H.mode	@ltx/en_us_dedes/miscellanea:misc.Mode2
ltx/en_us_dedes/me.m01.d15:meMA.Ode6H.ode	@ltx/en_us_dedes/miscellanea:misc.Ode6
ltx/en_us_dedes/me.m01.d15:meMA.Ode6H.text	@ltx/en_us_dedes/he.h.m2:heHE.EnAvyssoPtaismaton.text
ltx/en_us_dedes/me.m01.d15:meMA.Ode7C11.greekmelody	@ltx/en_us_dedes/he.h.m8:heHE.OEnArchiTinGin.greekname
ltx/en_us_dedes/me.m01.d15:meMA.Ode7C11.incipit	…
ltx/en_us_dedes/me.m01.d15:meMA.Ode7C11.melody	@ltx/en_us_dedes/he.h.m8:heHE.OEnArchiTinGin.name
ltx/en_us_dedes/me.m01.d15:meMA.Ode7C11.mode	@ltx/en_us_dedes/miscellanea:misc.Mode8
ltx/en_us_dedes/me.m01.d15:meMA.Ode7C11.ode	@ltx/en_us_dedes/miscellanea:misc.Ode7
ltx/en_us_dedes/me.m01.d15:meMA.Ode7C11.text	
ltx/en_us_dedes/me.m01.d15:meMA.Ode7C12.incipit	…
ltx/en_us_dedes/me.m01.d15:meMA.Ode7C12.melody	@ltx/en_us_dedes/he.h.m8:heHE.OEnArchiTinGin.name
ltx/en_us_dedes/me.m01.d15:meMA.Ode7C12.mode	@ltx/en_us_dedes/miscellanea:misc.Mode8
ltx/en_us_dedes/me.m01.d15:meMA.Ode7C12.ode	@ltx/en_us_dedes/miscellanea:misc.Ode7
ltx/en_us_dedes/me.m01.d15:meMA.Ode7C12.text	
ltx/en_us_dedes/me.m01.d15:meMA.Ode7C13.incipit	…
ltx/en_us_dedes/me.m01.d15:meMA.Ode7C13.melody	@ltx/en_us_dedes/he.h.m8:heHE.OEnArchiTinGin.name
ltx/en_us_dedes/me.m01.d15:meMA.Ode7C13.mode	@ltx/en_us_dedes/miscellanea:misc.Mode8
ltx/en_us_dedes/me.m01.d15:meMA.Ode7C13.ode	@ltx/en_us_dedes/miscellanea:misc.Ode7
ltx/en_us_dedes/me.m01.d15:meMA.Ode7C13.text	
ltx/en_us_dedes/me.m01.d15:meMA.Ode7C1T.incipit	…
ltx/en_us_dedes/me.m01.d15:meMA.Ode7C1T.melody	@ltx/en_us_dedes/he.h.m8:heHE.OEnArchiTinGin.name
ltx/en_us_dedes/me.m01.d15:meMA.Ode7C1T.mode	@ltx/en_us_dedes/miscellanea:misc.Mode8
ltx/en_us_dedes/me.m01.d15:meMA.Ode7C1T.ode	@ltx/en_us_dedes/miscellanea:misc.Ode7
ltx/en_us_dedes/me.m01.d15:meMA.Ode7C1T.text	
ltx/en_us_dedes/me.m01.d15:meMA.Ode7C21.greekmelody	@ltx/en_us_dedes/he.h.m2:heHE.AntitheonProstagma.greekname
ltx/en_us_dedes/me.m01.d15:meMA.Ode7C21.incipit	…
ltx/en_us_dedes/me.m01.d15:meMA.Ode7C21.melody	@ltx/en_us_dedes/he.h.m2:heHE.AntitheonProstagma.name
ltx/en_us_dedes/me.m01.d15:meMA.Ode7C21.mode	@ltx/en_us_dedes/miscellanea:misc.Mode2
ltx/en_us_dedes/me.m01.d15:meMA.Ode7C21.ode	@ltx/en_us_dedes/miscellanea:misc.Ode7
ltx/en_us_dedes/me.m01.d15:meMA.Ode7C21.text	
ltx/en_us_dedes/me.m01.d15:meMA.Ode7C22.incipit	…
ltx/en_us_dedes/me.m01.d15:meMA.Ode7C22.melody	@ltx/en_us_dedes/he.h.m2:heHE.AntitheonProstagma.name
ltx/en_us_dedes/me.m01.d15:meMA.Ode7C22.mode	@ltx/en_us_dedes/miscellanea:misc.Mode2
ltx/en_us_dedes/me.m01.d15:meMA.Ode7C22.ode	@ltx/en_us_dedes/miscellanea:misc.Ode7
ltx/en_us_dedes/me.m01.d15:meMA.Ode7C22.text	
ltx/en_us_dedes/me.m01.d15:meMA.Ode7C23.incipit	…
ltx/en_us_dedes/me.m01.d15:meMA.Ode7C23.melody	@ltx/en_us_dedes/he.h.m2:heHE.AntitheonProstagma.name
ltx/en_us_dedes/me.m01.d15:meMA.Ode7C23.mode	@ltx/en_us_dedes/miscellanea:misc.Mode2
ltx/en_us_dedes/me.m01.d15:meMA.Ode7C23.ode	@ltx/en_us_dedes/miscellanea:misc.Ode7
ltx/en_us_dedes/me.m01.d15:meMA.Ode7C23.text	
ltx/en_us_dedes/me.m01.d15:meMA.Ode7C2T.incipit	…
ltx/en_us_dedes/me.m01.d15:meMA.Ode7C2T.melody	@ltx/en_us_dedes/he.h.m2:heHE.AntitheonProstagma.name
ltx/en_us_dedes/me.m01.d15:meMA.Ode7C2T.mode	@ltx/en_us_dedes/miscellanea:misc.Mode2
ltx/en_us_dedes/me.m01.d15:meMA.Ode7C2T.ode	@ltx/en_us_dedes/miscellanea:misc.Ode7
ltx/en_us_dedes/me.m01.d15:meMA.Ode7C2T.text	
ltx/en_us_dedes/me.m01.d15:meMA.Ode8C11.greekmelody	@ltx/en_us_dedes/he.h.m8:heHE.TonAnarchonVasilea.greekname
ltx/en_us_dedes/me.m01.d15:meMA.Ode8C11.incipit	…
ltx/en_us_dedes/me.m01.d15:meMA.Ode8C11.melody	@ltx/en_us_dedes/he.h.m8:heHE.TonAnarchonVasilea.name
ltx/en_us_dedes/me.m01.d15:meMA.Ode8C11.mode	@ltx/en_us_dedes/miscellanea:misc.Mode8
ltx/en_us_dedes/me.m01.d15:meMA.Ode8C11.ode	@ltx/en_us_dedes/miscellanea:misc.Ode8
ltx/en_us_dedes/me.m01.d15:meMA.Ode8C11.text	
ltx/en_us_dedes/me.m01.d15:meMA.Ode8C12.incipit	…
ltx/en_us_dedes/me.m01.d15:meMA.Ode8C12.melody	@ltx/en_us_dedes/he.h.m8:heHE.TonAnarchonVasilea.name
ltx/en_us_dedes/me.m01.d15:meMA.Ode8C12.mode	@ltx/en_us_dedes/miscellanea:misc.Mode8
ltx/en_us_dedes/me.m01.d15:meMA.Ode8C12.ode	@ltx/en_us_dedes/miscellanea:misc.Ode8
ltx/en_us_dedes/me.m01.d15:meMA.Ode8C12.text	
ltx/en_us_dedes/me.m01.d15:meMA.Ode8C13.incipit	…
ltx/en_us_dedes/me.m01.d15:meMA.Ode8C13.melody	@ltx/en_us_dedes/he.h.m8:heHE.TonAnarchonVasilea.name
ltx/en_us_dedes/me.m01.d15:meMA.Ode8C13.mode	@ltx/en_us_dedes/miscellanea:misc.Mode8
ltx/en_us_dedes/me.m01.d15:meMA.Ode8C13.ode	@ltx/en_us_dedes/miscellanea:misc.Ode8
ltx/en_us_dedes/me.m01.d15:meMA.Ode8C13.text	
ltx/en_us_dedes/me.m01.d15:meMA.Ode8C1T.incipit	…
ltx/en_us_dedes/me.m01.d15:meMA.Ode8C1T.melody	@ltx/en_us_dedes/he.h.m8:heHE.TonAnarchonVasilea.name
ltx/en_us_dedes/me.m01.d15:meMA.Ode8C1T.mode	@ltx/en_us_dedes/miscellanea:misc.Mode8
ltx/en_us_dedes/me.m01.d15:meMA.Ode8C1T.ode	@ltx/en_us_dedes/miscellanea:misc.Ode8
ltx/en_us_dedes/me.m01.d15:meMA.Ode8C1T.text	
ltx/en_us_dedes/me.m01.d15:meMA.Ode8C21.greekmelody	@ltx/en_us_dedes/he.h.m2:heHE.TonEnKaminoTouPyros.greekname
ltx/en_us_dedes/me.m01.d15:meMA.Ode8C21.incipit	…
ltx/en_us_dedes/me.m01.d15:meMA.Ode8C21.melody	@ltx/en_us_dedes/he.h.m2:heHE.TonEnKaminoTouPyros.name
ltx/en_us_dedes/me.m01.d15:meMA.Ode8C21.mode	@ltx/en_us_dedes/miscellanea:misc.Mode2
ltx/en_us_dedes/me.m01.d15:meMA.Ode8C21.ode	@ltx/en_us_dedes/miscellanea:misc.Ode8
ltx/en_us_dedes/me.m01.d15:meMA.Ode8C21.text	
ltx/en_us_dedes/me.m01.d15:meMA.Ode8C22.incipit	…
ltx/en_us_dedes/me.m01.d15:meMA.Ode8C22.melody	@ltx/en_us_dedes/he.h.m2:heHE.TonEnKaminoTouPyros.name
ltx/en_us_dedes/me.m01.d15:meMA.Ode8C22.mode	@ltx/en_us_dedes/miscellanea:misc.Mode2
ltx/en_us_dedes/me.m01.d15:meMA.Ode8C22.ode	@ltx/en_us_dedes/miscellanea:misc.Ode8
ltx/en_us_dedes/me.m01.d15:meMA.Ode8C22.text	
ltx/en_us_dedes/me.m01.d15:meMA.Ode8C23.incipit	…
ltx/en_us_dedes/me.m01.d15:meMA.Ode8C23.melody	@ltx/en_us_dedes/he.h.m2:heHE.TonEnKaminoTouPyros.name
ltx/en_us_dedes/me.m01.d15:meMA.Ode8C23.mode	@ltx/en_us_dedes/miscellanea:misc.Mode2
ltx/en_us_dedes/me.m01.d15:meMA.Ode8C23.ode	@ltx/en_us_dedes/miscellanea:misc.Ode8
ltx/en_us_dedes/me.m01.d15:meMA.Ode8C23.text	
ltx/en_us_dedes/me.m01.d15:meMA.Ode8C24.incipit	…
ltx/en_us_dedes/me.m01.d15:meMA.Ode8C24.melody	@ltx/en_us_dedes/he.h.m2:heHE.TonEnKaminoTouPyros.name
ltx/en_us_dedes/me.m01.d15:meMA.Ode8C24.mode	@ltx/en_us_dedes/miscellanea:misc.Mode2
ltx/en_us_dedes/me.m01.d15:meMA.Ode8C24.ode	@ltx/en_us_dedes/miscellanea:misc.Ode8
ltx/en_us_dedes/me.m01.d15:meMA.Ode8C24.text	
ltx/en_us_dedes/me.m01.d15:meMA.Ode8C2T.incipit	…
ltx/en_us_dedes/me.m01.d15:meMA.Ode8C2T.melody	@ltx/en_us_dedes/he.h.m2:heHE.TonEnKaminoTouPyros.name
ltx/en_us_dedes/me.m01.d15:meMA.Ode8C2T.mode	@ltx/en_us_dedes/miscellanea:misc.Mode2
ltx/en_us_dedes/me.m01.d15:meMA.Ode8C2T.ode	@ltx/en_us_dedes/miscellanea:misc.Ode8
ltx/en_us_dedes/me.m01.d15:meMA.Ode8C2T.text	
ltx/en_us_dedes/me.m01.d15:meMA.Ode8H.greekmelody	@ltx/en_us_dedes/he.h.m2:heHE.TonEnKaminoTouPyros.greekname
ltx/en_us_dedes/me.m01.d15:meMA.Ode8H.incipit	@ltx/en_us_dedes/he.h.m2:heHE.TonEnKaminoTouPyros.incipit
ltx/en_us_dedes/me.m01.d15:meMA.Ode8H.melody	@ltx/en_us_dedes/he.h.m2:heHE.TonEnKaminoTouPyros.melody
ltx/en_us_dedes/me.m01.d15:meMA.Ode8H.mode	@ltx/en_us_dedes/miscellanea:misc.Mode2
ltx/en_us_dedes/me.m01.d15:meMA.Ode8H.ode	@ltx/en_us_dedes/miscellanea:misc.Ode8
ltx/en_us_dedes/me.m01.d15:meMA.Ode8H.text	@ltx/en_us_dedes/he.h.m2:heHE.TonEnKaminoTouPyros.text
ltx/en_us_dedes/me.m01.d15:meMA.Ode9C11.greekmelody	@ltx/en_us_dedes/he.h.m8:heHE.TonAoratonMorfi.greekname
ltx/en_us_dedes/me.m01.d15:meMA.Ode9C11.incipit	…
ltx/en_us_dedes/me.m01.d15:meMA.Ode9C11.melody	@ltx/en_us_dedes/he.h.m8:heHE.TonAoratonMorfi.name
ltx/en_us_dedes/me.m01.d15:meMA.Ode9C11.mode	@ltx/en_us_dedes/miscellanea:misc.Mode8
ltx/en_us_dedes/me.m01.d15:meMA.Ode9C11.ode	@ltx/en_us_dedes/miscellanea:misc.Ode9
ltx/en_us_dedes/me.m01.d15:meMA.Ode9C11.text	
ltx/en_us_dedes/me.m01.d15:meMA.Ode9C12.incipit	…
ltx/en_us_dedes/me.m01.d15:meMA.Ode9C12.melody	@ltx/en_us_dedes/he.h.m8:heHE.TonAoratonMorfi.name
ltx/en_us_dedes/me.m01.d15:meMA.Ode9C12.mode	@ltx/en_us_dedes/miscellanea:misc.Mode8
ltx/en_us_dedes/me.m01.d15:meMA.Ode9C12.ode	@ltx/en_us_dedes/miscellanea:misc.Ode9
ltx/en_us_dedes/me.m01.d15:meMA.Ode9C12.text	
ltx/en_us_dedes/me.m01.d15:meMA.Ode9C13.incipit	…
ltx/en_us_dedes/me.m01.d15:meMA.Ode9C13.melody	@ltx/en_us_dedes/he.h.m8:heHE.TonAoratonMorfi.name
ltx/en_us_dedes/me.m01.d15:meMA.Ode9C13.mode	@ltx/en_us_dedes/miscellanea:misc.Mode8
ltx/en_us_dedes/me.m01.d15:meMA.Ode9C13.ode	@ltx/en_us_dedes/miscellanea:misc.Ode9
ltx/en_us_dedes/me.m01.d15:meMA.Ode9C13.text	
ltx/en_us_dedes/me.m01.d15:meMA.Ode9C1T.incipit	…
ltx/en_us_dedes/me.m01.d15:meMA.Ode9C1T.melody	@ltx/en_us_dedes/he.h.m8:heHE.TonAoratonMorfi.name
ltx/en_us_dedes/me.m01.d15:meMA.Ode9C1T.mode	@ltx/en_us_dedes/miscellanea:misc.Mode8
ltx/en_us_dedes/me.m01.d15:meMA.Ode9C1T.ode	@ltx/en_us_dedes/miscellanea:misc.Ode9
ltx/en_us_dedes/me.m01.d15:meMA.Ode9C1T.text	
ltx/en_us_dedes/me.m01.d15:meMA.Ode9C21.greekmelody	@ltx/en_us_dedes/he.h.m2:heHE.AnarchouGennitoros.greekname
ltx/en_us_dedes/me.m01.d15:meMA.Ode9C21.incipit	…
ltx/en_us_dedes/me.m01.d15:meMA.Ode9C21.melody	@ltx/en_us_dedes/he.h.m2:heHE.AnarchouGennitoros.name
ltx/en_us_dedes/me.m01.d15:meMA.Ode9C21.mode	@ltx/en_us_dedes/miscellanea:misc.Mode2
ltx/en_us_dedes/me.m01.d15:meMA.Ode9C21.ode	@ltx/en_us_dedes/miscellanea:misc.Ode9
ltx/en_us_dedes/me.m01.d15:meMA.Ode9C21.text	
ltx/en_us_dedes/me.m01.d15:meMA.Ode9C22.incipit	…
ltx/en_us_dedes/me.m01.d15:meMA.Ode9C22.melody	@ltx/en_us_dedes/he.h.m2:heHE.AnarchouGennitoros.name
ltx/en_us_dedes/me.m01.d15:meMA.Ode9C22.mode	@ltx/en_us_dedes/miscellanea:misc.Mode2
ltx/en_us_dedes/me.m01.d15:meMA.Ode9C22.ode	@ltx/en_us_dedes/miscellanea:misc.Ode9
ltx/en_us_dedes/me.m01.d15:meMA.Ode9C22.text	
ltx/en_us_dedes/me.m01.d15:meMA.Ode9C23.incipit	…
ltx/en_us_dedes/me.m01.d15:meMA.Ode9C23.melody	@ltx/en_us_dedes/he.h.m2:heHE.AnarchouGennitoros.name
ltx/en_us_dedes/me.m01.d15:meMA.Ode9C23.mode	@ltx/en_us_dedes/miscellanea:misc.Mode2
ltx/en_us_dedes/me.m01.d15:meMA.Ode9C23.ode	@ltx/en_us_dedes/miscellanea:misc.Ode9
ltx/en_us_dedes/me.m01.d15:meMA.Ode9C23.text	
ltx/en_us_dedes/me.m01.d15:meMA.Ode9C24.incipit	…
ltx/en_us_dedes/me.m01.d15:meMA.Ode9C24.melody	@ltx/en_us_dedes/he.h.m2:heHE.AnarchouGennitoros.name
ltx/en_us_dedes/me.m01.d15:meMA.Ode9C24.mode	@ltx/en_us_dedes/miscellanea:misc.Mode2
ltx/en_us_dedes/me.m01.d15:meMA.Ode9C24.ode	@ltx/en_us_dedes/miscellanea:misc.Ode9
ltx/en_us_dedes/me.m01.d15:meMA.Ode9C24.text	
ltx/en_us_dedes/me.m01.d15:meMA.Ode9C2T.incipit	…
ltx/en_us_dedes/me.m01.d15:meMA.Ode9C2T.melody	@ltx/en_us_dedes/he.h.m2:heHE.AnarchouGennitoros.name
ltx/en_us_dedes/me.m01.d15:meMA.Ode9C2T.mode	@ltx/en_us_dedes/miscellanea:misc.Mode2
ltx/en_us_dedes/me.m01.d15:meMA.Ode9C2T.ode	@ltx/en_us_dedes/miscellanea:misc.Ode9
ltx/en_us_dedes/me.m01.d15:meMA.Ode9C2T.text	
ltx/en_us_dedes/me.m01.d15:meMA.Ode9H.greekmelody	@ltx/en_us_dedes/he.h.m2:heHE.AnarchouGennitoros.greekname
ltx/en_us_dedes/me.m01.d15:meMA.Ode9H.incipit	@ltx/en_us_dedes/he.h.m2:heHE.AnarchouGennitoros.incipit
ltx/en_us_dedes/me.m01.d15:meMA.Ode9H.melody	@ltx/en_us_dedes/he.h.m2:heHE.AnarchouGennitoros.melody
ltx/en_us_dedes/me.m01.d15:meMA.Ode9H.mode	@ltx/en_us_dedes/miscellanea:misc.Mode2
ltx/en_us_dedes/me.m01.d15:meMA.Ode9H.ode	@ltx/en_us_dedes/miscellanea:misc.Ode9
ltx/en_us_dedes/me.m01.d15:meMA.Ode9H.text	@ltx/en_us_dedes/he.h.m2:heHE.AnarchouGennitoros.text
ltx/en_us_dedes/me.m01.d15:meMA.Oikos1.text	Who is capable of worthily extolling the glory and greatness of your many labors, toils, and troubles? Yet, by your acceptable prayers to God, grant me now the Spirit’s grace, so that I might faithfully describe your struggles that exceeded nature, and that I may praise your ineffable endurance, and the patience of your conscience, O all-blessed Saint. By your patience, your put the enemy to shame, and you ever intercede with Him for us all.
ltx/en_us_dedes/me.m01.d15:meVE.Apolytikion1.greekmelody	@ltx/en_us_dedes/he.a.m4:heAU.TachyProkatalave.greekname
ltx/en_us_dedes/me.m01.d15:meVE.Apolytikion1.incipit	From infancy fervently…
ltx/en_us_dedes/me.m01.d15:meVE.Apolytikion1.melody	@ltx/en_us_dedes/he.a.m4:heAU.TachyProkatalave.name
ltx/en_us_dedes/me.m01.d15:meVE.Apolytikion1.mode	@ltx/en_us_dedes/miscellanea:misc.Mode4
ltx/en_us_dedes/me.m01.d15:meVE.Apolytikion1.text	From infancy fervently you loved and longed for the Lord; * you therefore renounced the world and every worldly delight, * and excelled in ascetic feats. * You set the hut you dwelt in before the gates of your parents. * Therein, all-blessed struggler, you crushed the snares of the demons. * And therefore, O John, Christ has glorified you worthily.
ltx/en_us_dedes/me.m01.d15:meVE.AposGlory.incipit	Devout Father, the proclamation…
ltx/en_us_dedes/me.m01.d15:meVE.AposGlory.melody	
ltx/en_us_dedes/me.m01.d15:meVE.AposGlory.mode	@ltx/en_us_dedes/miscellanea:misc.Mode6
ltx/en_us_dedes/me.m01.d15:meVE.AposGlory.text	Devout Father, the proclamation of your achievements went forth into all the earth. For your labors you found the reward in heaven. You destroyed the arrays of demons, and you attained to the orders of the Angels, whose lifestyle you emulated blamelessly. Since you have confidence before Christ our God, ask Him to grant peace to our souls.
ltx/en_us_dedes/me.m01.d15:meVE.AposStavrotheotokion.greekmelody	@ltx/en_us_dedes/he.a.m6:heAU.OlinApothemenoi.greekname
ltx/en_us_dedes/me.m01.d15:meVE.AposStavrotheotokion.incipit	O all-holy Lady, when your…
ltx/en_us_dedes/me.m01.d15:meVE.AposStavrotheotokion.melody	@ltx/en_us_dedes/he.a.m6:heAU.OlinApothemenoi.name
ltx/en_us_dedes/me.m01.d15:meVE.AposStavrotheotokion.mode	@ltx/en_us_dedes/miscellanea:misc.Mode6
ltx/en_us_dedes/me.m01.d15:meVE.AposStavrotheotokion.text	O all-holy Lady, when your divine Son, who had shone forth * by a word ineffably * from your womb, was crucified by unlawful men, * as a base criminal, * you were present watching. * And you saw His hands and feet be nailed. * He tasted vinegar, and was offered gall, and His side was pierced. * And as you watched this all unfold, * then the sword that Simeon had foretold * pierced your heart, O Virgin. * Maternally lamenting, you cried out, * “My sweetest boy, what is this I see? * Oh unheard-of mystery!”
ltx/en_us_dedes/me.m01.d15:meVE.AposTheotokion.greekmelody	@ltx/en_us_dedes/he.a.m6:heAU.OlinApothemenoi.greekname
ltx/en_us_dedes/me.m01.d15:meVE.AposTheotokion.incipit	We salute you, crying out:…
ltx/en_us_dedes/me.m01.d15:meVE.AposTheotokion.melody	@ltx/en_us_dedes/he.a.m6:heAU.OlinApothemenoi.name
ltx/en_us_dedes/me.m01.d15:meVE.AposTheotokion.mode	@ltx/en_us_dedes/miscellanea:misc.Mode6
ltx/en_us_dedes/me.m01.d15:meVE.AposTheotokion.text	We salute you, crying out: Rejoice, immaculate Lady! * You are the most luminous * lamp whose light is glowing more brightly than the sun. * Hope of those in despair, rejoice! Curdled mountain * from which Christ who has redeemed us came, * rejoice! Through your childbirth * we have been released from the ancient curse; * our race has been restored through you, * magnificent palace of the King of all. * Divine and delightful * most luminously shining torch and lamp * of God the Logos, and fiery throne, * Lady, we salute you: Rejoice!
ltx/en_us_dedes/me.m01.d15:meVE.MM.Stichera4456as78910.text	@ltx/en_us_dedes/properties:media.key
ltx/en_us_dedes/me.m01.d15:meVE.SticGlory.incipit	You renounced the world and…
ltx/en_us_dedes/me.m01.d15:meVE.SticGlory.melody	
ltx/en_us_dedes/me.m01.d15:meVE.SticGlory.mode	@ltx/en_us_dedes/miscellanea:misc.Mode2
ltx/en_us_dedes/me.m01.d15:meVE.SticGlory.poet	@ltx/en_us_dedes/poets:po.TheodorouTouStouditou
ltx/en_us_dedes/me.m01.d15:meVE.SticGlory.text	You renounced the world and whatever is in the world, O devout Saint. You took hold of a Gospel book, and evangelically you followed the Lord. You dwelt in your hut, but mystically as if in Paradise. By extreme physical hardships, you killed the man-killing dragon. Now as you dwell in the heavens, O blessed John, pray that we may obtain the great mercy.
ltx/en_us_dedes/me.m01.d15:meVE.SticStavrotheotokion.greekmelody	@ltx/en_us_dedes/he.a.m2:heAU.OteEkTouXylou.greekname
ltx/en_us_dedes/me.m01.d15:meVE.SticStavrotheotokion.incipit	Savior, when the Ewe-lamb…
ltx/en_us_dedes/me.m01.d15:meVE.SticStavrotheotokion.melody	@ltx/en_us_dedes/he.a.m2:heAU.OteEkTouXylou.name
ltx/en_us_dedes/me.m01.d15:meVE.SticStavrotheotokion.mode	@ltx/en_us_dedes/miscellanea:misc.Mode2
ltx/en_us_dedes/me.m01.d15:meVE.SticStavrotheotokion.text	Savior, when the Ewe-lamb without spot * watched as You her Lamb, as a mortal, were being willingly led * to the slaughter, she lamented and she tearfully said, “Now You hasten, O Christ, to make * Your own Mother childless. * O Redeemer of the world, why have You done this to me? * Yet, I glorify and I honor * the extreme ineffable goodness * that is Yours, O Master most benevolent.”
ltx/en_us_dedes/me.m01.d15:meVE.SticTheotokion.greekmelody	@ltx/en_us_dedes/he.a.m2:heAU.OteEkTouXylou.greekname
ltx/en_us_dedes/me.m01.d15:meVE.SticTheotokion.incipit	…
ltx/en_us_dedes/me.m01.d15:meVE.SticTheotokion.melody	@ltx/en_us_dedes/he.a.m2:heAU.OteEkTouXylou.name
ltx/en_us_dedes/me.m01.d15:meVE.SticTheotokion.mode	@ltx/en_us_dedes/miscellanea:misc.Mode2
ltx/en_us_dedes/me.m01.d15:meVE.SticTheotokion.text	
ltx/en_us_dedes/me.m01.d15:meVE.Stichera01.greekmelody	@ltx/en_us_dedes/he.a.m2:heAU.OteEkTouXylou.greekname
ltx/en_us_dedes/me.m01.d15:meVE.Stichera01.incipit	Father, by divine encouragement, *…
ltx/en_us_dedes/me.m01.d15:meVE.Stichera01.melody	@ltx/en_us_dedes/he.a.m2:heAU.OteEkTouXylou.name
ltx/en_us_dedes/me.m01.d15:meVE.Stichera01.mode	@ltx/en_us_dedes/miscellanea:misc.Mode2
ltx/en_us_dedes/me.m01.d15:meVE.Stichera01.text	Father, by divine encouragement, * prudently you left behind every mundane anxiety * and proceeded to the labors of ascetic life. * From that time you were happy to inhabit the desert, * for the love of God and His affection burned in you. * Then you lived on earth like an angel, * for by your persistence in virtue * you obliterated sinful passions all.
ltx/en_us_dedes/me.m01.d15:meVE.Stichera02.incipit	Father, from the time you…
ltx/en_us_dedes/me.m01.d15:meVE.Stichera02.melody	@ltx/en_us_dedes/he.a.m2:heAU.OteEkTouXylou.name
ltx/en_us_dedes/me.m01.d15:meVE.Stichera02.mode	@ltx/en_us_dedes/miscellanea:misc.Mode2
ltx/en_us_dedes/me.m01.d15:meVE.Stichera02.text	Father, from the time you were a youth * having isolated yourself from all human intercourse, * you were first to dwell in the Egyptian desert alone, * in ascetical discipline surpassing all others. * All your life you were unknown, until St. Anthony, * guided by divine revelation, * found you, Paul, a great hidden treasure. * Whereupon he made you known to all the world.
ltx/en_us_dedes/me.m01.d15:meVE.Stichera03.incipit	Father Paul, you practiced a…
ltx/en_us_dedes/me.m01.d15:meVE.Stichera03.melody	@ltx/en_us_dedes/he.a.m2:heAU.OteEkTouXylou.name
ltx/en_us_dedes/me.m01.d15:meVE.Stichera03.mode	@ltx/en_us_dedes/miscellanea:misc.Mode2
ltx/en_us_dedes/me.m01.d15:meVE.Stichera03.text	Father Paul, you practiced a most strange * way of life on earth, coexisting in peace with wild beasts. * By divine command a bird ministered to your needs, * O devout one. And Anthony * the Great, when he found you, * witnessed this himself, and he was filled with awe and joy. * Therefore in amazement he sent up * glory unto God, the Provider and the Master of all things, unceasingly.
ltx/en_us_dedes/me.m01.d15:meVE.Stichera04.greekmelody	@ltx/en_us_dedes/he.a.m2:heAU.OteEkTouXylou.greekname
ltx/en_us_dedes/me.m01.d15:meVE.Stichera04.incipit	Father, by divine encouragement, *…
ltx/en_us_dedes/me.m01.d15:meVE.Stichera04.melody	@ltx/en_us_dedes/he.a.m2:heAU.OteEkTouXylou.name
ltx/en_us_dedes/me.m01.d15:meVE.Stichera04.mode	@ltx/en_us_dedes/miscellanea:misc.Mode2
ltx/en_us_dedes/me.m01.d15:meVE.Stichera04.text	Father, by divine encouragement, * joyfully you fled from the pleasures and the delights of the world. * From that time on you selected and preferred the way * that is narrow and straight indeed, * and painful and rugged. * Then you found your way to the monastic school of the soul. * Donning the divine, holy habit, * you avoided all sinful passions, * and you stripped yourself of them, O blessed man.
ltx/en_us_dedes/me.m01.d15:meVE.Stichera05.incipit	You devised a strange way…
ltx/en_us_dedes/me.m01.d15:meVE.Stichera05.melody	@ltx/en_us_dedes/he.a.m2:heAU.OteEkTouXylou.name
ltx/en_us_dedes/me.m01.d15:meVE.Stichera05.mode	@ltx/en_us_dedes/miscellanea:misc.Mode2
ltx/en_us_dedes/me.m01.d15:meVE.Stichera05.text	You devised a strange way of life * and a novel practice, enraptured with your affection for Christ. * Gladly you accepted His amazing poverty. * You were homeless, and you endured * with sighs and affliction, * living thus outside the gates of your own parents’ home. * Therefore you were filled with divine gifts, * and you have inherited great wealth * in the heavens, which no one can take away.
ltx/en_us_dedes/me.m01.d15:meVE.Stichera06.incipit	Father, in your hands you…
ltx/en_us_dedes/me.m01.d15:meVE.Stichera06.melody	@ltx/en_us_dedes/he.a.m2:heAU.OteEkTouXylou.name
ltx/en_us_dedes/me.m01.d15:meVE.Stichera06.mode	@ltx/en_us_dedes/miscellanea:misc.Mode2
ltx/en_us_dedes/me.m01.d15:meVE.Stichera06.text	Father, in your hands you held the book * of the holy Gospel; and truly you have fulfilled it all. * You renounced the property and wealth your parents had, * and you lived your entire life * with tears and with hardships. * Therefore, O devout Saint John whom God has glorified, * you now are forever enjoying * comfort and divine consolation * and great joy and happiness continually.
