ltx/en_us_dedes/sy.m12.d03:syMA.commemoration01.couplet1.title	@ltx/en_us_dedes/titles:ti.Verses
ltx/en_us_dedes/sy.m12.d03:syMA.commemoration01.couplet1.verse1	
ltx/en_us_dedes/sy.m12.d03:syMA.commemoration01.couplet1.verse2	
ltx/en_us_dedes/sy.m12.d03:syMA.commemoration01.narration.p01	
ltx/en_us_dedes/sy.m12.d03:syMA.commemoration01.single1	
ltx/en_us_dedes/sy.m12.d03:syMA.commemoration01.text	On December 3, we commemorate the holy Prophet Zephaniah.
ltx/en_us_dedes/sy.m12.d03:syMA.commemoration02.couplet1.title	@ltx/en_us_dedes/titles:ti.Verses
ltx/en_us_dedes/sy.m12.d03:syMA.commemoration02.couplet1.verse1	
ltx/en_us_dedes/sy.m12.d03:syMA.commemoration02.couplet1.verse2	
ltx/en_us_dedes/sy.m12.d03:syMA.commemoration02.narration.p01	
ltx/en_us_dedes/sy.m12.d03:syMA.commemoration02.text	On this day we also commemorate the holy Hieromartyr Theodore, Archbishop of Alexandria.
ltx/en_us_dedes/sy.m12.d03:syMA.commemoration03.couplet1.title	@ltx/en_us_dedes/titles:ti.Verses
ltx/en_us_dedes/sy.m12.d03:syMA.commemoration03.couplet1.verse1	
ltx/en_us_dedes/sy.m12.d03:syMA.commemoration03.couplet1.verse2	
ltx/en_us_dedes/sy.m12.d03:syMA.commemoration03.narration.p01	
ltx/en_us_dedes/sy.m12.d03:syMA.commemoration03.narration.p02	
ltx/en_us_dedes/sy.m12.d03:syMA.commemoration03.narration.p03	
ltx/en_us_dedes/sy.m12.d03:syMA.commemoration03.narration.p04	
ltx/en_us_dedes/sy.m12.d03:syMA.commemoration03.text	On this day we also commemorate our devout father Theodoulos the Eparch.
ltx/en_us_dedes/sy.m12.d03:syMA.commemoration04.couplet1.title	@ltx/en_us_dedes/titles:ti.Verses
ltx/en_us_dedes/sy.m12.d03:syMA.commemoration04.couplet1.verse1	
ltx/en_us_dedes/sy.m12.d03:syMA.commemoration04.couplet1.verse2	
ltx/en_us_dedes/sy.m12.d03:syMA.commemoration04.narration.p01	
ltx/en_us_dedes/sy.m12.d03:syMA.commemoration04.narration.p02	
ltx/en_us_dedes/sy.m12.d03:syMA.commemoration04.narration.p03	
ltx/en_us_dedes/sy.m12.d03:syMA.commemoration04.narration.p04	
ltx/en_us_dedes/sy.m12.d03:syMA.commemoration04.text	On this day we also commemorate our devout father John the Hesychast, Bishop of Cologne.
ltx/en_us_dedes/sy.m12.d03:syMA.commemoration05.couplet1.title	@ltx/en_us_dedes/titles:ti.Verses
ltx/en_us_dedes/sy.m12.d03:syMA.commemoration05.couplet1.verse1	
ltx/en_us_dedes/sy.m12.d03:syMA.commemoration05.couplet1.verse2	
ltx/en_us_dedes/sy.m12.d03:syMA.commemoration05.text	On this day Saints Agapios, Seleukos, and Mamas died by the sword.
ltx/en_us_dedes/sy.m12.d03:syMA.commemoration06.couplet1.title	@ltx/en_us_dedes/titles:ti.Verses
ltx/en_us_dedes/sy.m12.d03:syMA.commemoration06.couplet1.verse1	
ltx/en_us_dedes/sy.m12.d03:syMA.commemoration06.couplet1.verse2	
ltx/en_us_dedes/sy.m12.d03:syMA.commemoration06.text	Our devout father Theodoulos the Cypriot, the fool for Christ, died in peace.
ltx/en_us_dedes/sy.m12.d03:syMA.commemoration07.couplet1.title	@ltx/en_us_dedes/titles:ti.Verses
ltx/en_us_dedes/sy.m12.d03:syMA.commemoration07.couplet1.verse1	
ltx/en_us_dedes/sy.m12.d03:syMA.commemoration07.couplet1.verse2	
ltx/en_us_dedes/sy.m12.d03:syMA.commemoration07.text	We also commemorate the holy Hieromartyr Gabriel, formerly Bishop of Ganos, and then of Constantinople, who was martyred in Prousa in the year 1659.
ltx/en_us_dedes/sy.m12.d03:syMA.commemoration08.couplet1.title	@ltx/en_us_dedes/titles:ti.Verses
ltx/en_us_dedes/sy.m12.d03:syMA.commemoration08.couplet1.verse1	
ltx/en_us_dedes/sy.m12.d03:syMA.commemoration08.couplet1.verse2	
ltx/en_us_dedes/sy.m12.d03:syMA.commemoration08.text	Holy Neo-Martyr Angeles, who competed in Chios in the year 1813, died by the sword.
ltx/en_us_dedes/sy.m12.d03:syMA.lastline	By the intercessions of Your Saints, O God, have mercy on us and save us. Amen.
