ltx/en_us_dedes/sy.m07.d04:syMA.commemoration01.couplet1.title	@ltx/en_us_dedes/titles:ti.Verses
ltx/en_us_dedes/sy.m07.d04:syMA.commemoration01.couplet1.verse1	
ltx/en_us_dedes/sy.m07.d04:syMA.commemoration01.couplet1.verse2	
ltx/en_us_dedes/sy.m07.d04:syMA.commemoration01.narration.p01	
ltx/en_us_dedes/sy.m07.d04:syMA.commemoration01.single1	
ltx/en_us_dedes/sy.m07.d04:syMA.commemoration01.text	On July 4, we commemorate our Father among the Saints Andrew, Archbishop of Crete, the Jerusalemite.
ltx/en_us_dedes/sy.m07.d04:syMA.commemoration02.couplet1.title	@ltx/en_us_dedes/titles:ti.Verses
ltx/en_us_dedes/sy.m07.d04:syMA.commemoration02.couplet1.verse1	
ltx/en_us_dedes/sy.m07.d04:syMA.commemoration02.couplet1.verse2	
ltx/en_us_dedes/sy.m07.d04:syMA.commemoration02.text	On this day we also commemorate the contest of the holy Hieromartyr Theodore, Bishop of Cyrene.
ltx/en_us_dedes/sy.m07.d04:syMA.commemoration03.couplet1.title	@ltx/en_us_dedes/titles:ti.Verses
ltx/en_us_dedes/sy.m07.d04:syMA.commemoration03.couplet1.verse1	
ltx/en_us_dedes/sy.m07.d04:syMA.commemoration03.couplet1.verse2	
ltx/en_us_dedes/sy.m07.d04:syMA.commemoration03.couplet2.verse1	
ltx/en_us_dedes/sy.m07.d04:syMA.commemoration03.couplet2.verse2	
ltx/en_us_dedes/sy.m07.d04:syMA.commemoration03.text	It is also the commemoration of the holy Martyrs Cyprilla, Aroa, and Lucia.
ltx/en_us_dedes/sy.m07.d04:syMA.commemoration04.couplet1.title	@ltx/en_us_dedes/titles:ti.Verses
ltx/en_us_dedes/sy.m07.d04:syMA.commemoration04.couplet1.verse1	
ltx/en_us_dedes/sy.m07.d04:syMA.commemoration04.couplet1.verse2	
ltx/en_us_dedes/sy.m07.d04:syMA.commemoration04.couplet2.verse1	
ltx/en_us_dedes/sy.m07.d04:syMA.commemoration04.couplet2.verse2	
ltx/en_us_dedes/sy.m07.d04:syMA.commemoration04.couplet3.verse1	
ltx/en_us_dedes/sy.m07.d04:syMA.commemoration04.couplet3.verse2	
ltx/en_us_dedes/sy.m07.d04:syMA.commemoration04.text	On this day we commemorate the holy Martyr Theodotus; and Saint Donatus, Bishop of Libya; and the devout Martha, mother of Saint Symeon of Wonderful Mountain.
ltx/en_us_dedes/sy.m07.d04:syMA.commemoration05.couplet1.title	@ltx/en_us_dedes/titles:ti.Verses
ltx/en_us_dedes/sy.m07.d04:syMA.commemoration05.couplet1.verse1	
ltx/en_us_dedes/sy.m07.d04:syMA.commemoration05.couplet1.verse2	
ltx/en_us_dedes/sy.m07.d04:syMA.commemoration05.text	Saint Asclepias the Wonderworker reposed in peace.
ltx/en_us_dedes/sy.m07.d04:syMA.commemoration06.couplet1.title	@ltx/en_us_dedes/titles:ti.Verses
ltx/en_us_dedes/sy.m07.d04:syMA.commemoration06.couplet1.verse1	
ltx/en_us_dedes/sy.m07.d04:syMA.commemoration06.couplet1.verse2	
ltx/en_us_dedes/sy.m07.d04:syMA.commemoration06.text	The holy Hieromartyr Theophilus died by the sword.
ltx/en_us_dedes/sy.m07.d04:syMA.commemoration07.couplet1.title	@ltx/en_us_dedes/titles:ti.Verses
ltx/en_us_dedes/sy.m07.d04:syMA.commemoration07.couplet1.verse1	
ltx/en_us_dedes/sy.m07.d04:syMA.commemoration07.couplet1.verse2	
ltx/en_us_dedes/sy.m07.d04:syMA.commemoration07.text	The devout Menignus reposed in peace.
ltx/en_us_dedes/sy.m07.d04:syMA.lastline	By their holy intercessions, O God, have mercy on us. Amen.
