ltx/en_us_dedes/sy.m11.d04:syMA.commemoration01.couplet1.title	@ltx/en_us_dedes/titles:ti.Verses
ltx/en_us_dedes/sy.m11.d04:syMA.commemoration01.couplet1.verse1	
ltx/en_us_dedes/sy.m11.d04:syMA.commemoration01.couplet1.verse2	
ltx/en_us_dedes/sy.m11.d04:syMA.commemoration01.narration.p01	
ltx/en_us_dedes/sy.m11.d04:syMA.commemoration01.narration.p02	
ltx/en_us_dedes/sy.m11.d04:syMA.commemoration01.single1	
ltx/en_us_dedes/sy.m11.d04:syMA.commemoration01.text	On November 4, we commemorate our devout father Ioannikios the Great, of Mt. Olympus.
ltx/en_us_dedes/sy.m11.d04:syMA.commemoration02.couplet1.title	@ltx/en_us_dedes/titles:ti.Verses
ltx/en_us_dedes/sy.m11.d04:syMA.commemoration02.couplet1.verse1	
ltx/en_us_dedes/sy.m11.d04:syMA.commemoration02.couplet1.verse2	
ltx/en_us_dedes/sy.m11.d04:syMA.commemoration02.narration.p01	
ltx/en_us_dedes/sy.m11.d04:syMA.commemoration02.text	On this day we also commemorate the holy hieromartyrs Nikandros, Bishop of Myra, and Hermaios the Priest, who were ordained by the holy Apostle Titus.
ltx/en_us_dedes/sy.m11.d04:syMA.commemoration03.couplet1.title	@ltx/en_us_dedes/titles:ti.Verses
ltx/en_us_dedes/sy.m11.d04:syMA.commemoration03.couplet1.verse1	
ltx/en_us_dedes/sy.m11.d04:syMA.commemoration03.couplet1.verse2	
ltx/en_us_dedes/sy.m11.d04:syMA.commemoration03.narration.p01	
ltx/en_us_dedes/sy.m11.d04:syMA.commemoration03.text	On this day we also commemorate the holy martyr Porphyrios.
ltx/en_us_dedes/sy.m11.d04:syMA.commemoration04.couplet1.title	@ltx/en_us_dedes/titles:ti.Verses
ltx/en_us_dedes/sy.m11.d04:syMA.commemoration04.couplet1.verse1	
ltx/en_us_dedes/sy.m11.d04:syMA.commemoration04.couplet1.verse2	
ltx/en_us_dedes/sy.m11.d04:syMA.commemoration04.narration.p01	
ltx/en_us_dedes/sy.m11.d04:syMA.commemoration04.narration.p02	
ltx/en_us_dedes/sy.m11.d04:syMA.commemoration04.narration.p03	
ltx/en_us_dedes/sy.m11.d04:syMA.commemoration04.narration.p04	
ltx/en_us_dedes/sy.m11.d04:syMA.commemoration04.narration.p05	
ltx/en_us_dedes/sy.m11.d04:syMA.commemoration04.text	On this day we relate a story about the Prophet Jeremiah’s Lamentation over Jerusalem, and its fall, and about Abimelech’s ecstasy.
ltx/en_us_dedes/sy.m11.d04:syMA.commemoration05.couplet1.title	@ltx/en_us_dedes/titles:ti.Verses
ltx/en_us_dedes/sy.m11.d04:syMA.commemoration05.couplet1.verse1	
ltx/en_us_dedes/sy.m11.d04:syMA.commemoration05.couplet1.verse2	
ltx/en_us_dedes/sy.m11.d04:syMA.commemoration05.text	We also commemorate the Orthodox emperor St. John Vatatzes the Merciful King.
ltx/en_us_dedes/sy.m11.d04:syMA.lastline	By the intercessions of Your Saints, O God, have mercy on us.
ltx/en_us_dedes/sy.m11.d04:syMA.note1	
