ltx/en_us_dedes/oc.m2.d7:ocBK.ModeNaked	@ltx/en_us_dedes/miscellanea:misc.Mode2.naked
ltx/en_us_dedes/oc.m2.d7:ocBK.end.title	END OF MODE 2
ltx/en_us_dedes/oc.m2.d7:ocBK.end.verse1.text	
ltx/en_us_dedes/oc.m2.d7:ocBK.end.verse2.text	
ltx/en_us_dedes/oc.m2.d7:ocBK.end.verse3.text	
ltx/en_us_dedes/oc.m2.d7:ocBK.end.verse4.text	
ltx/en_us_dedes/oc.m2.d7:ocBK.end.verse5.text	
ltx/en_us_dedes/oc.m2.d7:ocBK.end.verse6.text	
ltx/en_us_dedes/oc.m2.d7:ocLI.Beatitudes1.incipit	@ltx/en_us_dedes/oc.m2.d1:ocLI.Beatitudes1.incipit
ltx/en_us_dedes/oc.m2.d7:ocLI.Beatitudes1.melody	
ltx/en_us_dedes/oc.m2.d7:ocLI.Beatitudes1.mode	@ltx/en_us_dedes/miscellanea:misc.Mode2
ltx/en_us_dedes/oc.m2.d7:ocLI.Beatitudes1.text	@ltx/en_us_dedes/oc.m2.d1:ocLI.Beatitudes1.text
ltx/en_us_dedes/oc.m2.d7:ocLI.Beatitudes2.incipit	Holy Martyrs, since you have…
ltx/en_us_dedes/oc.m2.d7:ocLI.Beatitudes2.melody	
ltx/en_us_dedes/oc.m2.d7:ocLI.Beatitudes2.mode	@ltx/en_us_dedes/miscellanea:misc.Mode2
ltx/en_us_dedes/oc.m2.d7:ocLI.Beatitudes2.text	Holy Martyrs, since you have imitated Christ’s sufferings, * you continually cure all kinds of human suffering.
ltx/en_us_dedes/oc.m2.d7:ocLI.Beatitudes3.incipit	The Apostles, monastic Saints, holy…
ltx/en_us_dedes/oc.m2.d7:ocLI.Beatitudes3.melody	
ltx/en_us_dedes/oc.m2.d7:ocLI.Beatitudes3.mode	@ltx/en_us_dedes/miscellanea:misc.Mode2
ltx/en_us_dedes/oc.m2.d7:ocLI.Beatitudes3.text	The Apostles, monastic Saints, holy Teachers and Prophets all * were well pleasing to the Lord and Creator of the universe.
ltx/en_us_dedes/oc.m2.d7:ocLI.Beatitudes4.incipit	We entreat You, O God…
ltx/en_us_dedes/oc.m2.d7:ocLI.Beatitudes4.melody	
ltx/en_us_dedes/oc.m2.d7:ocLI.Beatitudes4.mode	@ltx/en_us_dedes/miscellanea:misc.Mode2
ltx/en_us_dedes/oc.m2.d7:ocLI.Beatitudes4.text	We entreat You, O God on high, grant repose there with all Your saints * to Your faithful servants whom You took to yourself, O Lord.
ltx/en_us_dedes/oc.m2.d7:ocLI.BeatitudesT.incipit	Overlook not the prayers of…
ltx/en_us_dedes/oc.m2.d7:ocLI.BeatitudesT.melody	
ltx/en_us_dedes/oc.m2.d7:ocLI.BeatitudesT.mode	@ltx/en_us_dedes/miscellanea:misc.Mode2
ltx/en_us_dedes/oc.m2.d7:ocLI.BeatitudesT.text	Overlook not the prayers of us your servants, all-blameless Maid; * save us from afflictions that result from our many sins.
ltx/en_us_dedes/oc.m2.d7:ocLI.BeatitudesTr.incipit	Consubstantial Trinity, have compassion on…
ltx/en_us_dedes/oc.m2.d7:ocLI.BeatitudesTr.melody	
ltx/en_us_dedes/oc.m2.d7:ocLI.BeatitudesTr.mode	@ltx/en_us_dedes/miscellanea:misc.Mode2
ltx/en_us_dedes/oc.m2.d7:ocLI.BeatitudesTr.text	Consubstantial Trinity, have compassion on those who sing * glorifying You, and ever save them from the snares of the foe.
ltx/en_us_dedes/oc.m2.d7:ocLI.MM.Beatitudes1234TrTas78910GB.text	@ltx/en_us_dedes/properties:media.key
ltx/en_us_dedes/oc.m2.d7:ocMA.ApolTheotokion.incipit	@ltx/en_us_dedes/oc.m2.d2:ocMA.ApolTheotokion.incipit
ltx/en_us_dedes/oc.m2.d7:ocMA.ApolTheotokion.melody	
ltx/en_us_dedes/oc.m2.d7:ocMA.ApolTheotokion.mode	@ltx/en_us_dedes/miscellanea:misc.Mode2
ltx/en_us_dedes/oc.m2.d7:ocMA.ApolTheotokion.text	@ltx/en_us_dedes/oc.m2.d2:ocMA.ApolTheotokion.text
ltx/en_us_dedes/oc.m2.d7:ocMA.AposTheotokion.greekmelody	@ltx/en_us_dedes/he.a.m2:heAU.OteEkTouXylou.greekname
ltx/en_us_dedes/oc.m2.d7:ocMA.AposTheotokion.incipit	Let us praise the Mother…
ltx/en_us_dedes/oc.m2.d7:ocMA.AposTheotokion.melody	@ltx/en_us_dedes/he.a.m2:heAU.OteEkTouXylou.name
ltx/en_us_dedes/oc.m2.d7:ocMA.AposTheotokion.mode	@ltx/en_us_dedes/miscellanea:misc.Mode2
ltx/en_us_dedes/oc.m2.d7:ocMA.AposTheotokion.text	Let us praise the Mother of the Light * glorifying her, O believers, with our unceasing hymns. * Since she carried our salvation in her womb, let us all * now salute her and say, “Rejoice, * for you only gave birth * to the pre-eternal God, who is more ancient than all. * Unwed and immaculate Virgin, * rejoice, holy Mother of Christ God * Who refashioned our ancestral mother Eve.
ltx/en_us_dedes/oc.m2.d7:ocMA.Aposticha1.greekmelody	@ltx/en_us_dedes/he.a.m2:heAU.OteEkTouXylou.greekname
ltx/en_us_dedes/oc.m2.d7:ocMA.Aposticha1.incipit	Master, by Your own life-bearing…
ltx/en_us_dedes/oc.m2.d7:ocMA.Aposticha1.melody	@ltx/en_us_dedes/he.a.m2:heAU.OteEkTouXylou.name
ltx/en_us_dedes/oc.m2.d7:ocMA.Aposticha1.mode	@ltx/en_us_dedes/miscellanea:misc.Mode2
ltx/en_us_dedes/oc.m2.d7:ocMA.Aposticha1.text	Master, by Your own life-bearing death * You destroyed the force and corruption that once belonged to death. * You became the source of everlasting life to all * mortal men, and unto the dead * You gave resurrection. * Therefore, Savior, we entreat You to give rest to all * who with faith have passed away to You; * count them worthy of Your immortal * glory, O benevolent and gracious Lord.
ltx/en_us_dedes/oc.m2.d7:ocMA.Aposticha2.greekmelody	@ltx/en_us_dedes/he.a.m2:heAU.OteEkTouXylou.greekname
ltx/en_us_dedes/oc.m2.d7:ocMA.Aposticha2.incipit	You accepted voluntary death *…
ltx/en_us_dedes/oc.m2.d7:ocMA.Aposticha2.melody	@ltx/en_us_dedes/he.a.m2:heAU.OteEkTouXylou.name
ltx/en_us_dedes/oc.m2.d7:ocMA.Aposticha2.mode	@ltx/en_us_dedes/miscellanea:misc.Mode2
ltx/en_us_dedes/oc.m2.d7:ocMA.Aposticha2.text	You accepted voluntary death * after You endured crucifixion, * O Lord, in order to make * human beings sharers in Your divine kingdom and rule. * Therefore, Savior, we pray to You, * that in Your compassion, * You will make the ones who passed away to You with faith * sharers in Your kingdom, O Master; * count them worthy of Your eternal, * everlasting glory and beatitude.
ltx/en_us_dedes/oc.m2.d7:ocMA.Aposticha3.greekmelody	@ltx/en_us_dedes/he.a.m2:heAU.OteEkTouXylou.greekname
ltx/en_us_dedes/oc.m2.d7:ocMA.Aposticha3.incipit	Wishing to redeem what You…
ltx/en_us_dedes/oc.m2.d7:ocMA.Aposticha3.melody	@ltx/en_us_dedes/he.a.m2:heAU.OteEkTouXylou.name
ltx/en_us_dedes/oc.m2.d7:ocMA.Aposticha3.mode	@ltx/en_us_dedes/miscellanea:misc.Mode2
ltx/en_us_dedes/oc.m2.d7:ocMA.Aposticha3.text	Wishing to redeem what You had made, * Lord exceeding good, You rejoiced as You executed Your plan * of salvation, which was a profound mystery. * And You offered Your precious Blood * as payment and ransom * for the world. Therefore we entreat You grant to all * who with faith have passed away to You, * that they may enjoy Your sweet beauty, * since You are benevolent, O gracious Lord.
ltx/en_us_dedes/oc.m2.d7:ocMA.Aposticha4.greekmelody	@ltx/en_us_dedes/he.a.m2:heAU.OteEkTouXylou.greekname
ltx/en_us_dedes/oc.m2.d7:ocMA.Aposticha4.incipit	Trembling will the dead of…
ltx/en_us_dedes/oc.m2.d7:ocMA.Aposticha4.melody	@ltx/en_us_dedes/he.a.m2:heAU.OteEkTouXylou.name
ltx/en_us_dedes/oc.m2.d7:ocMA.Aposticha4.mode	@ltx/en_us_dedes/miscellanea:misc.Mode2
ltx/en_us_dedes/oc.m2.d7:ocMA.Aposticha4.text	Trembling will the dead of every age * stand before Your frightful and awesome throne and tribunal, O Christ, * waiting for Your righteous verdict, O our Savior and God, * and in anticipation of Your just divine judgment. * Then, O Master and our Savior, spare Your servants, we pray, * all those who in faith have departed * to You, O Lord, and count them worthy * of Your everlasting bliss and blessedness.
ltx/en_us_dedes/oc.m2.d7:ocMA.C1.acrostic.notice1	
ltx/en_us_dedes/oc.m2.d7:ocMA.C1.acrostic.text	
ltx/en_us_dedes/oc.m2.d7:ocMA.C1.acrostic.title	Canon for all the Saints.
ltx/en_us_dedes/oc.m2.d7:ocMA.C2.acrostic.notice1	
ltx/en_us_dedes/oc.m2.d7:ocMA.C2.acrostic.text	
ltx/en_us_dedes/oc.m2.d7:ocMA.C2.acrostic.title	Canon for the Deceased.
ltx/en_us_dedes/oc.m2.d7:ocMA.C2.poet	@ltx/en_us_dedes/poets:po.Theofanous
ltx/en_us_dedes/oc.m2.d7:ocMA.Kathisma11.incipit	@ltx/en_us_dedes/oc.m2.d3:ocMA.Kathisma32.incipit
ltx/en_us_dedes/oc.m2.d7:ocMA.Kathisma11.melody	
ltx/en_us_dedes/oc.m2.d7:ocMA.Kathisma11.mode	@ltx/en_us_dedes/miscellanea:misc.Mode2
ltx/en_us_dedes/oc.m2.d7:ocMA.Kathisma11.text	@ltx/en_us_dedes/oc.m2.d3:ocMA.Kathisma32.text
ltx/en_us_dedes/oc.m2.d7:ocMA.Kathisma12.incipit	@ltx/en_us_dedes/oc.m2.d4:ocMA.Kathisma32.incipit
ltx/en_us_dedes/oc.m2.d7:ocMA.Kathisma12.melody	
ltx/en_us_dedes/oc.m2.d7:ocMA.Kathisma12.mode	@ltx/en_us_dedes/miscellanea:misc.Mode2
ltx/en_us_dedes/oc.m2.d7:ocMA.Kathisma12.text	@ltx/en_us_dedes/oc.m2.d4:ocMA.Kathisma32.text
ltx/en_us_dedes/oc.m2.d7:ocMA.Kathisma13.incipit	@ltx/en_us_dedes/oc.m2.d5:ocMA.Kathisma32.incipit
ltx/en_us_dedes/oc.m2.d7:ocMA.Kathisma13.melody	
ltx/en_us_dedes/oc.m2.d7:ocMA.Kathisma13.mode	@ltx/en_us_dedes/miscellanea:misc.Mode2
ltx/en_us_dedes/oc.m2.d7:ocMA.Kathisma13.text	@ltx/en_us_dedes/oc.m2.d5:ocMA.Kathisma32.text
ltx/en_us_dedes/oc.m2.d7:ocMA.Kathisma14.incipit	@ltx/en_us_dedes/oc.m2.d1:ocVE.ApolTheotokionVM.incipit
ltx/en_us_dedes/oc.m2.d7:ocMA.Kathisma14.melody	
ltx/en_us_dedes/oc.m2.d7:ocMA.Kathisma14.mode	@ltx/en_us_dedes/miscellanea:misc.Mode2
ltx/en_us_dedes/oc.m2.d7:ocMA.Kathisma14.text	@ltx/en_us_dedes/oc.m2.d1:ocVE.ApolTheotokionVM.text
ltx/en_us_dedes/oc.m2.d7:ocMA.Kathisma21.incipit	@ltx/en_us_dedes/oc.m2.d2:ocMA.Kathisma32.incipit
ltx/en_us_dedes/oc.m2.d7:ocMA.Kathisma21.melody	
ltx/en_us_dedes/oc.m2.d7:ocMA.Kathisma21.mode	@ltx/en_us_dedes/miscellanea:misc.Mode2
ltx/en_us_dedes/oc.m2.d7:ocMA.Kathisma21.text	@ltx/en_us_dedes/oc.m2.d2:ocMA.Kathisma32.text
ltx/en_us_dedes/oc.m2.d7:ocMA.Kathisma22.greekmelody	@ltx/en_us_dedes/he.a.m2:heAU.EfsplagchniasYparchousa.greekname
ltx/en_us_dedes/oc.m2.d7:ocMA.Kathisma22.incipit	…
ltx/en_us_dedes/oc.m2.d7:ocMA.Kathisma22.melody	@ltx/en_us_dedes/he.a.m2:heAU.EfsplagchniasYparchousa.name
ltx/en_us_dedes/oc.m2.d7:ocMA.Kathisma22.mode	@ltx/en_us_dedes/miscellanea:misc.Mode2
ltx/en_us_dedes/oc.m2.d7:ocMA.Kathisma22.text	
ltx/en_us_dedes/oc.m2.d7:ocMA.Kathisma23.incipit	Remember Your servants, O Lord…
ltx/en_us_dedes/oc.m2.d7:ocMA.Kathisma23.melody	
ltx/en_us_dedes/oc.m2.d7:ocMA.Kathisma23.mode	@ltx/en_us_dedes/miscellanea:misc.Mode2
ltx/en_us_dedes/oc.m2.d7:ocMA.Kathisma23.text	Remember Your servants, O Lord, since You are good, and forgive them for all their sins in life; for no one is without sin except for You who are able to give rest to those who have passed away.
ltx/en_us_dedes/oc.m2.d7:ocMA.Kathisma24.incipit	@ltx/en_us_dedes/oc.m2.d2:ocMA.ApolTheotokion.incipit
ltx/en_us_dedes/oc.m2.d7:ocMA.Kathisma24.melody	
ltx/en_us_dedes/oc.m2.d7:ocMA.Kathisma24.mode	@ltx/en_us_dedes/miscellanea:misc.Mode2
ltx/en_us_dedes/oc.m2.d7:ocMA.Kathisma24.text	@ltx/en_us_dedes/oc.m2.d2:ocMA.ApolTheotokion.text
ltx/en_us_dedes/oc.m2.d7:ocMA.Lauds1.incipit	@ltx/en_us_dedes/oc.m2.d3:ocMA.Aposticha3.incipit
ltx/en_us_dedes/oc.m2.d7:ocMA.Lauds1.melody	
ltx/en_us_dedes/oc.m2.d7:ocMA.Lauds1.mode	@ltx/en_us_dedes/miscellanea:misc.Mode2
ltx/en_us_dedes/oc.m2.d7:ocMA.Lauds1.text	@ltx/en_us_dedes/oc.m2.d3:ocMA.Aposticha3.text
ltx/en_us_dedes/oc.m2.d7:ocMA.Lauds2.incipit	@ltx/en_us_dedes/oc.m2.d4:ocMA.Aposticha3.incipit
ltx/en_us_dedes/oc.m2.d7:ocMA.Lauds2.melody	
ltx/en_us_dedes/oc.m2.d7:ocMA.Lauds2.mode	@ltx/en_us_dedes/miscellanea:misc.Mode2
ltx/en_us_dedes/oc.m2.d7:ocMA.Lauds2.text	@ltx/en_us_dedes/oc.m2.d4:ocMA.Aposticha3.text
ltx/en_us_dedes/oc.m2.d7:ocMA.Lauds3.incipit	@ltx/en_us_dedes/oc.m2.d5:ocMA.Aposticha3.incipit
ltx/en_us_dedes/oc.m2.d7:ocMA.Lauds3.melody	
ltx/en_us_dedes/oc.m2.d7:ocMA.Lauds3.mode	@ltx/en_us_dedes/miscellanea:misc.Mode2
ltx/en_us_dedes/oc.m2.d7:ocMA.Lauds3.text	@ltx/en_us_dedes/oc.m2.d5:ocMA.Aposticha3.text
ltx/en_us_dedes/oc.m2.d7:ocMA.Lauds4.incipit	Alas! Such agony afflicts a…
ltx/en_us_dedes/oc.m2.d7:ocMA.Lauds4.melody	
ltx/en_us_dedes/oc.m2.d7:ocMA.Lauds4.mode	@ltx/en_us_dedes/miscellanea:misc.Mode2
ltx/en_us_dedes/oc.m2.d7:ocMA.Lauds4.text	Alas! Such agony afflicts a soul when it is separated from its body. Alas! How it weeps then, but there is no one to have mercy on it. It turns its eyes towards the Angels and prays to no avail. It reaches for other people, but there is no one who can help. Therefore, my beloved brethren, let us realize how short is our life, and let us pray to Christ to grant repose to the departed, and great mercy to our souls.
ltx/en_us_dedes/oc.m2.d7:ocMA.LaudsRubric1.text	@ltx/en_us_dedes/oc.m1.d7:ocMA.LaudsRubric1.text
ltx/en_us_dedes/oc.m2.d7:ocMA.LaudsTheotokion.incipit	I, the wretch, have wasted…
ltx/en_us_dedes/oc.m2.d7:ocMA.LaudsTheotokion.melody	@ltx/en_us_dedes/he.a.m2:heAU.OteEkTouXylou.name
ltx/en_us_dedes/oc.m2.d7:ocMA.LaudsTheotokion.mode	@ltx/en_us_dedes/miscellanea:misc.Mode2
ltx/en_us_dedes/oc.m2.d7:ocMA.LaudsTheotokion.text	I, the wretch, have wasted all the time * of my life in sins and in vices, O pure one; now I am left * destitute completely of all good and virtuous deeds. * And I see now that death, alas, * is quickly approaching, * and I shudder at the judgment of your Son, our God. * Rescue me from this, holy Virgin, * and before that anguish, O Lady, * save me and return me to the path of life.
ltx/en_us_dedes/oc.m2.d7:ocMA.MM.Alleluia.text	@ltx/en_us_dedes/properties:media.key
ltx/en_us_dedes/oc.m2.d7:ocMA.OdeW1C11.incipit	…
ltx/en_us_dedes/oc.m2.d7:ocMA.OdeW1C11.melody	@ltx/en_us_dedes/he.h.m2:heHE.TinMoseosOdin.name
ltx/en_us_dedes/oc.m2.d7:ocMA.OdeW1C11.mode	@ltx/en_us_dedes/miscellanea:misc.Mode2
ltx/en_us_dedes/oc.m2.d7:ocMA.OdeW1C11.ode	@ltx/en_us_dedes/miscellanea:misc.Ode1
ltx/en_us_dedes/oc.m2.d7:ocMA.OdeW1C11.text	
ltx/en_us_dedes/oc.m2.d7:ocMA.OdeW1C12.incipit	…
ltx/en_us_dedes/oc.m2.d7:ocMA.OdeW1C12.melody	@ltx/en_us_dedes/he.h.m2:heHE.TinMoseosOdin.name
ltx/en_us_dedes/oc.m2.d7:ocMA.OdeW1C12.mode	@ltx/en_us_dedes/miscellanea:misc.Mode2
ltx/en_us_dedes/oc.m2.d7:ocMA.OdeW1C12.ode	@ltx/en_us_dedes/miscellanea:misc.Ode1
ltx/en_us_dedes/oc.m2.d7:ocMA.OdeW1C12.text	
ltx/en_us_dedes/oc.m2.d7:ocMA.OdeW1C13.incipit	…
ltx/en_us_dedes/oc.m2.d7:ocMA.OdeW1C13.melody	@ltx/en_us_dedes/he.h.m2:heHE.TinMoseosOdin.name
ltx/en_us_dedes/oc.m2.d7:ocMA.OdeW1C13.mode	@ltx/en_us_dedes/miscellanea:misc.Mode2
ltx/en_us_dedes/oc.m2.d7:ocMA.OdeW1C13.ode	@ltx/en_us_dedes/miscellanea:misc.Ode1
ltx/en_us_dedes/oc.m2.d7:ocMA.OdeW1C13.text	
ltx/en_us_dedes/oc.m2.d7:ocMA.OdeW1C14.incipit	…
ltx/en_us_dedes/oc.m2.d7:ocMA.OdeW1C14.melody	@ltx/en_us_dedes/he.h.m2:heHE.TinMoseosOdin.name
ltx/en_us_dedes/oc.m2.d7:ocMA.OdeW1C14.mode	@ltx/en_us_dedes/miscellanea:misc.Mode2
ltx/en_us_dedes/oc.m2.d7:ocMA.OdeW1C14.ode	@ltx/en_us_dedes/miscellanea:misc.Ode1
ltx/en_us_dedes/oc.m2.d7:ocMA.OdeW1C14.text	
ltx/en_us_dedes/oc.m2.d7:ocMA.OdeW1C1H.greekmelody	@ltx/en_us_dedes/he.h.m2:heHE.TinMoseosOdin.greekname
ltx/en_us_dedes/oc.m2.d7:ocMA.OdeW1C1H.incipit	@ltx/en_us_dedes/he.h.m2:heHE.TinMoseosOdin.incipit
ltx/en_us_dedes/oc.m2.d7:ocMA.OdeW1C1H.melody	@ltx/en_us_dedes/he.h.m2:heHE.TinMoseosOdin.melody
ltx/en_us_dedes/oc.m2.d7:ocMA.OdeW1C1H.mode	@ltx/en_us_dedes/miscellanea:misc.Mode2
ltx/en_us_dedes/oc.m2.d7:ocMA.OdeW1C1H.ode	@ltx/en_us_dedes/miscellanea:misc.Ode1
ltx/en_us_dedes/oc.m2.d7:ocMA.OdeW1C1H.text	@ltx/en_us_dedes/he.h.m2:heHE.TinMoseosOdin.text
ltx/en_us_dedes/oc.m2.d7:ocMA.OdeW1C1T.incipit	…
ltx/en_us_dedes/oc.m2.d7:ocMA.OdeW1C1T.melody	@ltx/en_us_dedes/he.h.m2:heHE.TinMoseosOdin.name
ltx/en_us_dedes/oc.m2.d7:ocMA.OdeW1C1T.mode	@ltx/en_us_dedes/miscellanea:misc.Mode2
ltx/en_us_dedes/oc.m2.d7:ocMA.OdeW1C1T.ode	@ltx/en_us_dedes/miscellanea:misc.Ode1
ltx/en_us_dedes/oc.m2.d7:ocMA.OdeW1C1T.text	
ltx/en_us_dedes/oc.m2.d7:ocMA.OdeW1C21.greekmelody	@ltx/en_us_dedes/he.h.m2:heHE.ToTinAvaton.greekname
ltx/en_us_dedes/oc.m2.d7:ocMA.OdeW1C21.incipit	…
ltx/en_us_dedes/oc.m2.d7:ocMA.OdeW1C21.melody	@ltx/en_us_dedes/he.h.m2:heHE.ToTinAvaton.name
ltx/en_us_dedes/oc.m2.d7:ocMA.OdeW1C21.mode	@ltx/en_us_dedes/miscellanea:misc.Mode2
ltx/en_us_dedes/oc.m2.d7:ocMA.OdeW1C21.ode	@ltx/en_us_dedes/miscellanea:misc.Ode1
ltx/en_us_dedes/oc.m2.d7:ocMA.OdeW1C21.text	
ltx/en_us_dedes/oc.m2.d7:ocMA.OdeW1C22.incipit	…
ltx/en_us_dedes/oc.m2.d7:ocMA.OdeW1C22.melody	@ltx/en_us_dedes/he.h.m2:heHE.ToTinAvaton.name
ltx/en_us_dedes/oc.m2.d7:ocMA.OdeW1C22.mode	@ltx/en_us_dedes/miscellanea:misc.Mode2
ltx/en_us_dedes/oc.m2.d7:ocMA.OdeW1C22.ode	@ltx/en_us_dedes/miscellanea:misc.Ode1
ltx/en_us_dedes/oc.m2.d7:ocMA.OdeW1C22.text	
ltx/en_us_dedes/oc.m2.d7:ocMA.OdeW1C23.incipit	…
ltx/en_us_dedes/oc.m2.d7:ocMA.OdeW1C23.melody	@ltx/en_us_dedes/he.h.m2:heHE.ToTinAvaton.name
ltx/en_us_dedes/oc.m2.d7:ocMA.OdeW1C23.mode	@ltx/en_us_dedes/miscellanea:misc.Mode2
ltx/en_us_dedes/oc.m2.d7:ocMA.OdeW1C23.ode	@ltx/en_us_dedes/miscellanea:misc.Ode1
ltx/en_us_dedes/oc.m2.d7:ocMA.OdeW1C23.text	
ltx/en_us_dedes/oc.m2.d7:ocMA.OdeW1C2T.incipit	…
ltx/en_us_dedes/oc.m2.d7:ocMA.OdeW1C2T.melody	@ltx/en_us_dedes/he.h.m2:heHE.ToTinAvaton.name
ltx/en_us_dedes/oc.m2.d7:ocMA.OdeW1C2T.mode	@ltx/en_us_dedes/miscellanea:misc.Mode2
ltx/en_us_dedes/oc.m2.d7:ocMA.OdeW1C2T.ode	@ltx/en_us_dedes/miscellanea:misc.Ode1
ltx/en_us_dedes/oc.m2.d7:ocMA.OdeW1C2T.text	
ltx/en_us_dedes/oc.m2.d7:ocMA.OdeW3C11.incipit	…
ltx/en_us_dedes/oc.m2.d7:ocMA.OdeW3C11.melody	@ltx/en_us_dedes/he.h.m2:heHE.SteirothentaMouTonNoun.name
ltx/en_us_dedes/oc.m2.d7:ocMA.OdeW3C11.mode	@ltx/en_us_dedes/miscellanea:misc.Mode2
ltx/en_us_dedes/oc.m2.d7:ocMA.OdeW3C11.ode	@ltx/en_us_dedes/miscellanea:misc.Ode3
ltx/en_us_dedes/oc.m2.d7:ocMA.OdeW3C11.text	
ltx/en_us_dedes/oc.m2.d7:ocMA.OdeW3C12.incipit	…
ltx/en_us_dedes/oc.m2.d7:ocMA.OdeW3C12.melody	@ltx/en_us_dedes/he.h.m2:heHE.SteirothentaMouTonNoun.name
ltx/en_us_dedes/oc.m2.d7:ocMA.OdeW3C12.mode	@ltx/en_us_dedes/miscellanea:misc.Mode2
ltx/en_us_dedes/oc.m2.d7:ocMA.OdeW3C12.ode	@ltx/en_us_dedes/miscellanea:misc.Ode3
ltx/en_us_dedes/oc.m2.d7:ocMA.OdeW3C12.text	
ltx/en_us_dedes/oc.m2.d7:ocMA.OdeW3C13.incipit	…
ltx/en_us_dedes/oc.m2.d7:ocMA.OdeW3C13.melody	@ltx/en_us_dedes/he.h.m2:heHE.SteirothentaMouTonNoun.name
ltx/en_us_dedes/oc.m2.d7:ocMA.OdeW3C13.mode	@ltx/en_us_dedes/miscellanea:misc.Mode2
ltx/en_us_dedes/oc.m2.d7:ocMA.OdeW3C13.ode	@ltx/en_us_dedes/miscellanea:misc.Ode3
ltx/en_us_dedes/oc.m2.d7:ocMA.OdeW3C13.text	
ltx/en_us_dedes/oc.m2.d7:ocMA.OdeW3C14.incipit	…
ltx/en_us_dedes/oc.m2.d7:ocMA.OdeW3C14.melody	@ltx/en_us_dedes/he.h.m2:heHE.SteirothentaMouTonNoun.name
ltx/en_us_dedes/oc.m2.d7:ocMA.OdeW3C14.mode	@ltx/en_us_dedes/miscellanea:misc.Mode2
ltx/en_us_dedes/oc.m2.d7:ocMA.OdeW3C14.ode	@ltx/en_us_dedes/miscellanea:misc.Ode3
ltx/en_us_dedes/oc.m2.d7:ocMA.OdeW3C14.text	
ltx/en_us_dedes/oc.m2.d7:ocMA.OdeW3C1H.greekmelody	@ltx/en_us_dedes/he.h.m2:heHE.SteirothentaMouTonNoun.greekname
ltx/en_us_dedes/oc.m2.d7:ocMA.OdeW3C1H.incipit	@ltx/en_us_dedes/he.h.m2:heHE.SteirothentaMouTonNoun.incipit
ltx/en_us_dedes/oc.m2.d7:ocMA.OdeW3C1H.melody	@ltx/en_us_dedes/he.h.m2:heHE.SteirothentaMouTonNoun.melody
ltx/en_us_dedes/oc.m2.d7:ocMA.OdeW3C1H.mode	@ltx/en_us_dedes/miscellanea:misc.Mode2
ltx/en_us_dedes/oc.m2.d7:ocMA.OdeW3C1H.ode	@ltx/en_us_dedes/miscellanea:misc.Ode3
ltx/en_us_dedes/oc.m2.d7:ocMA.OdeW3C1H.text	@ltx/en_us_dedes/he.h.m2:heHE.SteirothentaMouTonNoun.text
ltx/en_us_dedes/oc.m2.d7:ocMA.OdeW3C1T.incipit	…
ltx/en_us_dedes/oc.m2.d7:ocMA.OdeW3C1T.melody	@ltx/en_us_dedes/he.h.m2:heHE.SteirothentaMouTonNoun.name
ltx/en_us_dedes/oc.m2.d7:ocMA.OdeW3C1T.mode	@ltx/en_us_dedes/miscellanea:misc.Mode2
ltx/en_us_dedes/oc.m2.d7:ocMA.OdeW3C1T.ode	@ltx/en_us_dedes/miscellanea:misc.Ode3
ltx/en_us_dedes/oc.m2.d7:ocMA.OdeW3C1T.text	
ltx/en_us_dedes/oc.m2.d7:ocMA.OdeW3C21.greekmelody	@ltx/en_us_dedes/he.h.m2:heHE.EnPetraMeTisPisteos.greekname
ltx/en_us_dedes/oc.m2.d7:ocMA.OdeW3C21.incipit	…
ltx/en_us_dedes/oc.m2.d7:ocMA.OdeW3C21.melody	@ltx/en_us_dedes/he.h.m2:heHE.EnPetraMeTisPisteos.name
ltx/en_us_dedes/oc.m2.d7:ocMA.OdeW3C21.mode	@ltx/en_us_dedes/miscellanea:misc.Mode2
ltx/en_us_dedes/oc.m2.d7:ocMA.OdeW3C21.ode	@ltx/en_us_dedes/miscellanea:misc.Ode3
ltx/en_us_dedes/oc.m2.d7:ocMA.OdeW3C21.text	
ltx/en_us_dedes/oc.m2.d7:ocMA.OdeW3C22.incipit	…
ltx/en_us_dedes/oc.m2.d7:ocMA.OdeW3C22.melody	@ltx/en_us_dedes/he.h.m2:heHE.EnPetraMeTisPisteos.name
ltx/en_us_dedes/oc.m2.d7:ocMA.OdeW3C22.mode	@ltx/en_us_dedes/miscellanea:misc.Mode2
ltx/en_us_dedes/oc.m2.d7:ocMA.OdeW3C22.ode	@ltx/en_us_dedes/miscellanea:misc.Ode3
ltx/en_us_dedes/oc.m2.d7:ocMA.OdeW3C22.text	
ltx/en_us_dedes/oc.m2.d7:ocMA.OdeW3C23.incipit	…
ltx/en_us_dedes/oc.m2.d7:ocMA.OdeW3C23.melody	@ltx/en_us_dedes/he.h.m2:heHE.EnPetraMeTisPisteos.name
ltx/en_us_dedes/oc.m2.d7:ocMA.OdeW3C23.mode	@ltx/en_us_dedes/miscellanea:misc.Mode2
ltx/en_us_dedes/oc.m2.d7:ocMA.OdeW3C23.ode	@ltx/en_us_dedes/miscellanea:misc.Ode3
ltx/en_us_dedes/oc.m2.d7:ocMA.OdeW3C23.text	
ltx/en_us_dedes/oc.m2.d7:ocMA.OdeW3C2T.incipit	…
ltx/en_us_dedes/oc.m2.d7:ocMA.OdeW3C2T.melody	@ltx/en_us_dedes/he.h.m2:heHE.EnPetraMeTisPisteos.name
ltx/en_us_dedes/oc.m2.d7:ocMA.OdeW3C2T.mode	@ltx/en_us_dedes/miscellanea:misc.Mode2
ltx/en_us_dedes/oc.m2.d7:ocMA.OdeW3C2T.ode	@ltx/en_us_dedes/miscellanea:misc.Ode3
ltx/en_us_dedes/oc.m2.d7:ocMA.OdeW3C2T.text	
ltx/en_us_dedes/oc.m2.d7:ocMA.OdeW4C11.incipit	…
ltx/en_us_dedes/oc.m2.d7:ocMA.OdeW4C11.melody	@ltx/en_us_dedes/he.h.m2:heHE.TinEkParthenou.name
ltx/en_us_dedes/oc.m2.d7:ocMA.OdeW4C11.mode	@ltx/en_us_dedes/miscellanea:misc.Mode2
ltx/en_us_dedes/oc.m2.d7:ocMA.OdeW4C11.ode	@ltx/en_us_dedes/miscellanea:misc.Ode4
ltx/en_us_dedes/oc.m2.d7:ocMA.OdeW4C11.text	
ltx/en_us_dedes/oc.m2.d7:ocMA.OdeW4C12.incipit	…
ltx/en_us_dedes/oc.m2.d7:ocMA.OdeW4C12.melody	@ltx/en_us_dedes/he.h.m2:heHE.TinEkParthenou.name
ltx/en_us_dedes/oc.m2.d7:ocMA.OdeW4C12.mode	@ltx/en_us_dedes/miscellanea:misc.Mode2
ltx/en_us_dedes/oc.m2.d7:ocMA.OdeW4C12.ode	@ltx/en_us_dedes/miscellanea:misc.Ode4
ltx/en_us_dedes/oc.m2.d7:ocMA.OdeW4C12.text	
ltx/en_us_dedes/oc.m2.d7:ocMA.OdeW4C13.incipit	…
ltx/en_us_dedes/oc.m2.d7:ocMA.OdeW4C13.melody	@ltx/en_us_dedes/he.h.m2:heHE.TinEkParthenou.name
ltx/en_us_dedes/oc.m2.d7:ocMA.OdeW4C13.mode	@ltx/en_us_dedes/miscellanea:misc.Mode2
ltx/en_us_dedes/oc.m2.d7:ocMA.OdeW4C13.ode	@ltx/en_us_dedes/miscellanea:misc.Ode4
ltx/en_us_dedes/oc.m2.d7:ocMA.OdeW4C13.text	
ltx/en_us_dedes/oc.m2.d7:ocMA.OdeW4C14.incipit	…
ltx/en_us_dedes/oc.m2.d7:ocMA.OdeW4C14.melody	@ltx/en_us_dedes/he.h.m2:heHE.TinEkParthenou.name
ltx/en_us_dedes/oc.m2.d7:ocMA.OdeW4C14.mode	@ltx/en_us_dedes/miscellanea:misc.Mode2
ltx/en_us_dedes/oc.m2.d7:ocMA.OdeW4C14.ode	@ltx/en_us_dedes/miscellanea:misc.Ode4
ltx/en_us_dedes/oc.m2.d7:ocMA.OdeW4C14.text	
ltx/en_us_dedes/oc.m2.d7:ocMA.OdeW4C15.incipit	…
ltx/en_us_dedes/oc.m2.d7:ocMA.OdeW4C15.melody	@ltx/en_us_dedes/he.h.m2:heHE.TinEkParthenou.name
ltx/en_us_dedes/oc.m2.d7:ocMA.OdeW4C15.mode	@ltx/en_us_dedes/miscellanea:misc.Mode2
ltx/en_us_dedes/oc.m2.d7:ocMA.OdeW4C15.ode	@ltx/en_us_dedes/miscellanea:misc.Ode4
ltx/en_us_dedes/oc.m2.d7:ocMA.OdeW4C15.text	
ltx/en_us_dedes/oc.m2.d7:ocMA.OdeW4C1H.greekmelody	@ltx/en_us_dedes/he.h.m2:heHE.TinEkParthenou.greekname
ltx/en_us_dedes/oc.m2.d7:ocMA.OdeW4C1H.incipit	@ltx/en_us_dedes/he.h.m2:heHE.TinEkParthenou.incipit
ltx/en_us_dedes/oc.m2.d7:ocMA.OdeW4C1H.melody	@ltx/en_us_dedes/he.h.m2:heHE.TinEkParthenou.melody
ltx/en_us_dedes/oc.m2.d7:ocMA.OdeW4C1H.mode	@ltx/en_us_dedes/miscellanea:misc.Mode2
ltx/en_us_dedes/oc.m2.d7:ocMA.OdeW4C1H.ode	@ltx/en_us_dedes/miscellanea:misc.Ode4
ltx/en_us_dedes/oc.m2.d7:ocMA.OdeW4C1H.text	@ltx/en_us_dedes/he.h.m2:heHE.TinEkParthenou.text
ltx/en_us_dedes/oc.m2.d7:ocMA.OdeW4C1T.incipit	…
ltx/en_us_dedes/oc.m2.d7:ocMA.OdeW4C1T.melody	@ltx/en_us_dedes/he.h.m2:heHE.TinEkParthenou.name
ltx/en_us_dedes/oc.m2.d7:ocMA.OdeW4C1T.mode	@ltx/en_us_dedes/miscellanea:misc.Mode2
ltx/en_us_dedes/oc.m2.d7:ocMA.OdeW4C1T.ode	@ltx/en_us_dedes/miscellanea:misc.Ode4
ltx/en_us_dedes/oc.m2.d7:ocMA.OdeW4C1T.text	
ltx/en_us_dedes/oc.m2.d7:ocMA.OdeW4C21.greekmelody	@ltx/en_us_dedes/he.h.m2:heHE.YmnoSeAkoi.greekname
ltx/en_us_dedes/oc.m2.d7:ocMA.OdeW4C21.incipit	…
ltx/en_us_dedes/oc.m2.d7:ocMA.OdeW4C21.melody	@ltx/en_us_dedes/he.h.m2:heHE.YmnoSeAkoi.name
ltx/en_us_dedes/oc.m2.d7:ocMA.OdeW4C21.mode	@ltx/en_us_dedes/miscellanea:misc.Mode2
ltx/en_us_dedes/oc.m2.d7:ocMA.OdeW4C21.ode	@ltx/en_us_dedes/miscellanea:misc.Ode4
ltx/en_us_dedes/oc.m2.d7:ocMA.OdeW4C21.text	
ltx/en_us_dedes/oc.m2.d7:ocMA.OdeW4C22.incipit	…
ltx/en_us_dedes/oc.m2.d7:ocMA.OdeW4C22.melody	@ltx/en_us_dedes/he.h.m2:heHE.YmnoSeAkoi.name
ltx/en_us_dedes/oc.m2.d7:ocMA.OdeW4C22.mode	@ltx/en_us_dedes/miscellanea:misc.Mode2
ltx/en_us_dedes/oc.m2.d7:ocMA.OdeW4C22.ode	@ltx/en_us_dedes/miscellanea:misc.Ode4
ltx/en_us_dedes/oc.m2.d7:ocMA.OdeW4C22.text	
ltx/en_us_dedes/oc.m2.d7:ocMA.OdeW4C23.incipit	…
ltx/en_us_dedes/oc.m2.d7:ocMA.OdeW4C23.melody	@ltx/en_us_dedes/he.h.m2:heHE.YmnoSeAkoi.name
ltx/en_us_dedes/oc.m2.d7:ocMA.OdeW4C23.mode	@ltx/en_us_dedes/miscellanea:misc.Mode2
ltx/en_us_dedes/oc.m2.d7:ocMA.OdeW4C23.ode	@ltx/en_us_dedes/miscellanea:misc.Ode4
ltx/en_us_dedes/oc.m2.d7:ocMA.OdeW4C23.text	
ltx/en_us_dedes/oc.m2.d7:ocMA.OdeW4C2T.incipit	…
ltx/en_us_dedes/oc.m2.d7:ocMA.OdeW4C2T.melody	@ltx/en_us_dedes/he.h.m2:heHE.YmnoSeAkoi.name
ltx/en_us_dedes/oc.m2.d7:ocMA.OdeW4C2T.mode	@ltx/en_us_dedes/miscellanea:misc.Mode2
ltx/en_us_dedes/oc.m2.d7:ocMA.OdeW4C2T.ode	@ltx/en_us_dedes/miscellanea:misc.Ode4
ltx/en_us_dedes/oc.m2.d7:ocMA.OdeW4C2T.text	
ltx/en_us_dedes/oc.m2.d7:ocMA.OdeW5C11.incipit	…
ltx/en_us_dedes/oc.m2.d7:ocMA.OdeW5C11.melody	@ltx/en_us_dedes/he.h.m2:heHE.TinAchlynTisPsychisMou.name
ltx/en_us_dedes/oc.m2.d7:ocMA.OdeW5C11.mode	@ltx/en_us_dedes/miscellanea:misc.Mode2
ltx/en_us_dedes/oc.m2.d7:ocMA.OdeW5C11.ode	@ltx/en_us_dedes/miscellanea:misc.Ode5
ltx/en_us_dedes/oc.m2.d7:ocMA.OdeW5C11.text	
ltx/en_us_dedes/oc.m2.d7:ocMA.OdeW5C12.incipit	…
ltx/en_us_dedes/oc.m2.d7:ocMA.OdeW5C12.melody	@ltx/en_us_dedes/he.h.m2:heHE.TinAchlynTisPsychisMou.name
ltx/en_us_dedes/oc.m2.d7:ocMA.OdeW5C12.mode	@ltx/en_us_dedes/miscellanea:misc.Mode2
ltx/en_us_dedes/oc.m2.d7:ocMA.OdeW5C12.ode	@ltx/en_us_dedes/miscellanea:misc.Ode5
ltx/en_us_dedes/oc.m2.d7:ocMA.OdeW5C12.text	
ltx/en_us_dedes/oc.m2.d7:ocMA.OdeW5C13.incipit	…
ltx/en_us_dedes/oc.m2.d7:ocMA.OdeW5C13.melody	@ltx/en_us_dedes/he.h.m2:heHE.TinAchlynTisPsychisMou.name
ltx/en_us_dedes/oc.m2.d7:ocMA.OdeW5C13.mode	@ltx/en_us_dedes/miscellanea:misc.Mode2
ltx/en_us_dedes/oc.m2.d7:ocMA.OdeW5C13.ode	@ltx/en_us_dedes/miscellanea:misc.Ode5
ltx/en_us_dedes/oc.m2.d7:ocMA.OdeW5C13.text	
ltx/en_us_dedes/oc.m2.d7:ocMA.OdeW5C14.incipit	…
ltx/en_us_dedes/oc.m2.d7:ocMA.OdeW5C14.melody	@ltx/en_us_dedes/he.h.m2:heHE.TinAchlynTisPsychisMou.name
ltx/en_us_dedes/oc.m2.d7:ocMA.OdeW5C14.mode	@ltx/en_us_dedes/miscellanea:misc.Mode2
ltx/en_us_dedes/oc.m2.d7:ocMA.OdeW5C14.ode	@ltx/en_us_dedes/miscellanea:misc.Ode5
ltx/en_us_dedes/oc.m2.d7:ocMA.OdeW5C14.text	
ltx/en_us_dedes/oc.m2.d7:ocMA.OdeW5C1H.greekmelody	@ltx/en_us_dedes/he.h.m2:heHE.TinAchlynTisPsychisMou.greekname
ltx/en_us_dedes/oc.m2.d7:ocMA.OdeW5C1H.incipit	@ltx/en_us_dedes/he.h.m2:heHE.TinAchlynTisPsychisMou.incipit
ltx/en_us_dedes/oc.m2.d7:ocMA.OdeW5C1H.melody	@ltx/en_us_dedes/he.h.m2:heHE.TinAchlynTisPsychisMou.melody
ltx/en_us_dedes/oc.m2.d7:ocMA.OdeW5C1H.mode	@ltx/en_us_dedes/miscellanea:misc.Mode2
ltx/en_us_dedes/oc.m2.d7:ocMA.OdeW5C1H.ode	@ltx/en_us_dedes/miscellanea:misc.Ode5
ltx/en_us_dedes/oc.m2.d7:ocMA.OdeW5C1H.text	@ltx/en_us_dedes/he.h.m2:heHE.TinAchlynTisPsychisMou.text
ltx/en_us_dedes/oc.m2.d7:ocMA.OdeW5C1T.incipit	…
ltx/en_us_dedes/oc.m2.d7:ocMA.OdeW5C1T.melody	@ltx/en_us_dedes/he.h.m2:heHE.TinAchlynTisPsychisMou.name
ltx/en_us_dedes/oc.m2.d7:ocMA.OdeW5C1T.mode	@ltx/en_us_dedes/miscellanea:misc.Mode2
ltx/en_us_dedes/oc.m2.d7:ocMA.OdeW5C1T.ode	@ltx/en_us_dedes/miscellanea:misc.Ode5
ltx/en_us_dedes/oc.m2.d7:ocMA.OdeW5C1T.text	
ltx/en_us_dedes/oc.m2.d7:ocMA.OdeW5C21.greekmelody	@ltx/en_us_dedes/he.h.m2:heHE.OTouFotosChorigos.greekname
ltx/en_us_dedes/oc.m2.d7:ocMA.OdeW5C21.incipit	…
ltx/en_us_dedes/oc.m2.d7:ocMA.OdeW5C21.melody	@ltx/en_us_dedes/he.h.m2:heHE.OTouFotosChorigos.name
ltx/en_us_dedes/oc.m2.d7:ocMA.OdeW5C21.mode	@ltx/en_us_dedes/miscellanea:misc.Mode2
ltx/en_us_dedes/oc.m2.d7:ocMA.OdeW5C21.ode	@ltx/en_us_dedes/miscellanea:misc.Ode5
ltx/en_us_dedes/oc.m2.d7:ocMA.OdeW5C21.text	
ltx/en_us_dedes/oc.m2.d7:ocMA.OdeW5C22.incipit	…
ltx/en_us_dedes/oc.m2.d7:ocMA.OdeW5C22.melody	@ltx/en_us_dedes/he.h.m2:heHE.OTouFotosChorigos.name
ltx/en_us_dedes/oc.m2.d7:ocMA.OdeW5C22.mode	@ltx/en_us_dedes/miscellanea:misc.Mode2
ltx/en_us_dedes/oc.m2.d7:ocMA.OdeW5C22.ode	@ltx/en_us_dedes/miscellanea:misc.Ode5
ltx/en_us_dedes/oc.m2.d7:ocMA.OdeW5C22.text	
ltx/en_us_dedes/oc.m2.d7:ocMA.OdeW5C23.incipit	…
ltx/en_us_dedes/oc.m2.d7:ocMA.OdeW5C23.melody	@ltx/en_us_dedes/he.h.m2:heHE.OTouFotosChorigos.name
ltx/en_us_dedes/oc.m2.d7:ocMA.OdeW5C23.mode	@ltx/en_us_dedes/miscellanea:misc.Mode2
ltx/en_us_dedes/oc.m2.d7:ocMA.OdeW5C23.ode	@ltx/en_us_dedes/miscellanea:misc.Ode5
ltx/en_us_dedes/oc.m2.d7:ocMA.OdeW5C23.text	
ltx/en_us_dedes/oc.m2.d7:ocMA.OdeW5C2T.incipit	…
ltx/en_us_dedes/oc.m2.d7:ocMA.OdeW5C2T.melody	@ltx/en_us_dedes/he.h.m2:heHE.OTouFotosChorigos.name
ltx/en_us_dedes/oc.m2.d7:ocMA.OdeW5C2T.mode	@ltx/en_us_dedes/miscellanea:misc.Mode2
ltx/en_us_dedes/oc.m2.d7:ocMA.OdeW5C2T.ode	@ltx/en_us_dedes/miscellanea:misc.Ode5
ltx/en_us_dedes/oc.m2.d7:ocMA.OdeW5C2T.text	
ltx/en_us_dedes/oc.m2.d7:ocMA.OdeW6C11.incipit	…
ltx/en_us_dedes/oc.m2.d7:ocMA.OdeW6C11.melody	@ltx/en_us_dedes/he.h.m2:heHE.VythoAmartimaton.name
ltx/en_us_dedes/oc.m2.d7:ocMA.OdeW6C11.mode	@ltx/en_us_dedes/miscellanea:misc.Mode2
ltx/en_us_dedes/oc.m2.d7:ocMA.OdeW6C11.ode	@ltx/en_us_dedes/miscellanea:misc.Ode6
ltx/en_us_dedes/oc.m2.d7:ocMA.OdeW6C11.text	
ltx/en_us_dedes/oc.m2.d7:ocMA.OdeW6C12.incipit	…
ltx/en_us_dedes/oc.m2.d7:ocMA.OdeW6C12.melody	@ltx/en_us_dedes/he.h.m2:heHE.VythoAmartimaton.name
ltx/en_us_dedes/oc.m2.d7:ocMA.OdeW6C12.mode	@ltx/en_us_dedes/miscellanea:misc.Mode2
ltx/en_us_dedes/oc.m2.d7:ocMA.OdeW6C12.ode	@ltx/en_us_dedes/miscellanea:misc.Ode6
ltx/en_us_dedes/oc.m2.d7:ocMA.OdeW6C12.text	
ltx/en_us_dedes/oc.m2.d7:ocMA.OdeW6C13.incipit	…
ltx/en_us_dedes/oc.m2.d7:ocMA.OdeW6C13.melody	@ltx/en_us_dedes/he.h.m2:heHE.VythoAmartimaton.name
ltx/en_us_dedes/oc.m2.d7:ocMA.OdeW6C13.mode	@ltx/en_us_dedes/miscellanea:misc.Mode2
ltx/en_us_dedes/oc.m2.d7:ocMA.OdeW6C13.ode	@ltx/en_us_dedes/miscellanea:misc.Ode6
ltx/en_us_dedes/oc.m2.d7:ocMA.OdeW6C13.text	
ltx/en_us_dedes/oc.m2.d7:ocMA.OdeW6C14.incipit	…
ltx/en_us_dedes/oc.m2.d7:ocMA.OdeW6C14.melody	@ltx/en_us_dedes/he.h.m2:heHE.VythoAmartimaton.name
ltx/en_us_dedes/oc.m2.d7:ocMA.OdeW6C14.mode	@ltx/en_us_dedes/miscellanea:misc.Mode2
ltx/en_us_dedes/oc.m2.d7:ocMA.OdeW6C14.ode	@ltx/en_us_dedes/miscellanea:misc.Ode6
ltx/en_us_dedes/oc.m2.d7:ocMA.OdeW6C14.text	
ltx/en_us_dedes/oc.m2.d7:ocMA.OdeW6C1H.greekmelody	@ltx/en_us_dedes/he.h.m2:heHE.VythoAmartimaton.greekname
ltx/en_us_dedes/oc.m2.d7:ocMA.OdeW6C1H.incipit	@ltx/en_us_dedes/he.h.m2:heHE.VythoAmartimaton.incipit
ltx/en_us_dedes/oc.m2.d7:ocMA.OdeW6C1H.melody	@ltx/en_us_dedes/he.h.m2:heHE.VythoAmartimaton.melody
ltx/en_us_dedes/oc.m2.d7:ocMA.OdeW6C1H.mode	@ltx/en_us_dedes/miscellanea:misc.Mode2
ltx/en_us_dedes/oc.m2.d7:ocMA.OdeW6C1H.ode	@ltx/en_us_dedes/miscellanea:misc.Ode6
ltx/en_us_dedes/oc.m2.d7:ocMA.OdeW6C1H.text	@ltx/en_us_dedes/he.h.m2:heHE.VythoAmartimaton.text
ltx/en_us_dedes/oc.m2.d7:ocMA.OdeW6C1T.incipit	…
ltx/en_us_dedes/oc.m2.d7:ocMA.OdeW6C1T.melody	@ltx/en_us_dedes/he.h.m2:heHE.VythoAmartimaton.name
ltx/en_us_dedes/oc.m2.d7:ocMA.OdeW6C1T.mode	@ltx/en_us_dedes/miscellanea:misc.Mode2
ltx/en_us_dedes/oc.m2.d7:ocMA.OdeW6C1T.ode	@ltx/en_us_dedes/miscellanea:misc.Ode6
ltx/en_us_dedes/oc.m2.d7:ocMA.OdeW6C1T.text	
ltx/en_us_dedes/oc.m2.d7:ocMA.OdeW6C21.greekmelody	@ltx/en_us_dedes/he.h.m2:heHE.EnAvyssoPtaismaton.greekname
ltx/en_us_dedes/oc.m2.d7:ocMA.OdeW6C21.incipit	…
ltx/en_us_dedes/oc.m2.d7:ocMA.OdeW6C21.melody	@ltx/en_us_dedes/he.h.m2:heHE.EnAvyssoPtaismaton.name
ltx/en_us_dedes/oc.m2.d7:ocMA.OdeW6C21.mode	@ltx/en_us_dedes/miscellanea:misc.Mode2
ltx/en_us_dedes/oc.m2.d7:ocMA.OdeW6C21.ode	@ltx/en_us_dedes/miscellanea:misc.Ode6
ltx/en_us_dedes/oc.m2.d7:ocMA.OdeW6C21.text	
ltx/en_us_dedes/oc.m2.d7:ocMA.OdeW6C22.incipit	…
ltx/en_us_dedes/oc.m2.d7:ocMA.OdeW6C22.melody	@ltx/en_us_dedes/he.h.m2:heHE.EnAvyssoPtaismaton.name
ltx/en_us_dedes/oc.m2.d7:ocMA.OdeW6C22.mode	@ltx/en_us_dedes/miscellanea:misc.Mode2
ltx/en_us_dedes/oc.m2.d7:ocMA.OdeW6C22.ode	@ltx/en_us_dedes/miscellanea:misc.Ode6
ltx/en_us_dedes/oc.m2.d7:ocMA.OdeW6C22.text	
ltx/en_us_dedes/oc.m2.d7:ocMA.OdeW6C2T.incipit	…
ltx/en_us_dedes/oc.m2.d7:ocMA.OdeW6C2T.melody	@ltx/en_us_dedes/he.h.m2:heHE.EnAvyssoPtaismaton.name
ltx/en_us_dedes/oc.m2.d7:ocMA.OdeW6C2T.mode	@ltx/en_us_dedes/miscellanea:misc.Mode2
ltx/en_us_dedes/oc.m2.d7:ocMA.OdeW6C2T.ode	@ltx/en_us_dedes/miscellanea:misc.Ode6
ltx/en_us_dedes/oc.m2.d7:ocMA.OdeW6C2T.text	
ltx/en_us_dedes/oc.m2.d7:ocMA.OdeW7C11.incipit	…
ltx/en_us_dedes/oc.m2.d7:ocMA.OdeW7C11.melody	@ltx/en_us_dedes/he.h.m2:heHE.TaCherouvimMimoumenoi.name
ltx/en_us_dedes/oc.m2.d7:ocMA.OdeW7C11.mode	@ltx/en_us_dedes/miscellanea:misc.Mode2
ltx/en_us_dedes/oc.m2.d7:ocMA.OdeW7C11.ode	@ltx/en_us_dedes/miscellanea:misc.Ode7
ltx/en_us_dedes/oc.m2.d7:ocMA.OdeW7C11.text	
ltx/en_us_dedes/oc.m2.d7:ocMA.OdeW7C12.incipit	…
ltx/en_us_dedes/oc.m2.d7:ocMA.OdeW7C12.melody	@ltx/en_us_dedes/he.h.m2:heHE.TaCherouvimMimoumenoi.name
ltx/en_us_dedes/oc.m2.d7:ocMA.OdeW7C12.mode	@ltx/en_us_dedes/miscellanea:misc.Mode2
ltx/en_us_dedes/oc.m2.d7:ocMA.OdeW7C12.ode	@ltx/en_us_dedes/miscellanea:misc.Ode7
ltx/en_us_dedes/oc.m2.d7:ocMA.OdeW7C12.text	
ltx/en_us_dedes/oc.m2.d7:ocMA.OdeW7C13.incipit	…
ltx/en_us_dedes/oc.m2.d7:ocMA.OdeW7C13.melody	@ltx/en_us_dedes/he.h.m2:heHE.TaCherouvimMimoumenoi.name
ltx/en_us_dedes/oc.m2.d7:ocMA.OdeW7C13.mode	@ltx/en_us_dedes/miscellanea:misc.Mode2
ltx/en_us_dedes/oc.m2.d7:ocMA.OdeW7C13.ode	@ltx/en_us_dedes/miscellanea:misc.Ode7
ltx/en_us_dedes/oc.m2.d7:ocMA.OdeW7C13.text	
ltx/en_us_dedes/oc.m2.d7:ocMA.OdeW7C1H.greekmelody	@ltx/en_us_dedes/he.h.m2:heHE.TaCherouvimMimoumenoi.greekname
ltx/en_us_dedes/oc.m2.d7:ocMA.OdeW7C1H.incipit	@ltx/en_us_dedes/he.h.m2:heHE.TaCherouvimMimoumenoi.incipit
ltx/en_us_dedes/oc.m2.d7:ocMA.OdeW7C1H.melody	@ltx/en_us_dedes/he.h.m2:heHE.TaCherouvimMimoumenoi.melody
ltx/en_us_dedes/oc.m2.d7:ocMA.OdeW7C1H.mode	@ltx/en_us_dedes/miscellanea:misc.Mode2
ltx/en_us_dedes/oc.m2.d7:ocMA.OdeW7C1H.ode	@ltx/en_us_dedes/miscellanea:misc.Ode7
ltx/en_us_dedes/oc.m2.d7:ocMA.OdeW7C1H.text	@ltx/en_us_dedes/he.h.m2:heHE.TaCherouvimMimoumenoi.text
ltx/en_us_dedes/oc.m2.d7:ocMA.OdeW7C1T.incipit	…
ltx/en_us_dedes/oc.m2.d7:ocMA.OdeW7C1T.melody	@ltx/en_us_dedes/he.h.m2:heHE.TaCherouvimMimoumenoi.name
ltx/en_us_dedes/oc.m2.d7:ocMA.OdeW7C1T.mode	@ltx/en_us_dedes/miscellanea:misc.Mode2
ltx/en_us_dedes/oc.m2.d7:ocMA.OdeW7C1T.ode	@ltx/en_us_dedes/miscellanea:misc.Ode7
ltx/en_us_dedes/oc.m2.d7:ocMA.OdeW7C1T.text	
ltx/en_us_dedes/oc.m2.d7:ocMA.OdeW7C21.greekmelody	@ltx/en_us_dedes/he.h.m2:heHE.AntitheonProstagma.greekname
ltx/en_us_dedes/oc.m2.d7:ocMA.OdeW7C21.incipit	…
ltx/en_us_dedes/oc.m2.d7:ocMA.OdeW7C21.melody	@ltx/en_us_dedes/he.h.m2:heHE.AntitheonProstagma.name
ltx/en_us_dedes/oc.m2.d7:ocMA.OdeW7C21.mode	@ltx/en_us_dedes/miscellanea:misc.Mode2
ltx/en_us_dedes/oc.m2.d7:ocMA.OdeW7C21.ode	@ltx/en_us_dedes/miscellanea:misc.Ode7
ltx/en_us_dedes/oc.m2.d7:ocMA.OdeW7C21.text	
ltx/en_us_dedes/oc.m2.d7:ocMA.OdeW7C22.incipit	…
ltx/en_us_dedes/oc.m2.d7:ocMA.OdeW7C22.melody	@ltx/en_us_dedes/he.h.m2:heHE.AntitheonProstagma.name
ltx/en_us_dedes/oc.m2.d7:ocMA.OdeW7C22.mode	@ltx/en_us_dedes/miscellanea:misc.Mode2
ltx/en_us_dedes/oc.m2.d7:ocMA.OdeW7C22.ode	@ltx/en_us_dedes/miscellanea:misc.Ode7
ltx/en_us_dedes/oc.m2.d7:ocMA.OdeW7C22.text	
ltx/en_us_dedes/oc.m2.d7:ocMA.OdeW7C23.incipit	…
ltx/en_us_dedes/oc.m2.d7:ocMA.OdeW7C23.melody	@ltx/en_us_dedes/he.h.m2:heHE.AntitheonProstagma.name
ltx/en_us_dedes/oc.m2.d7:ocMA.OdeW7C23.mode	@ltx/en_us_dedes/miscellanea:misc.Mode2
ltx/en_us_dedes/oc.m2.d7:ocMA.OdeW7C23.ode	@ltx/en_us_dedes/miscellanea:misc.Ode7
ltx/en_us_dedes/oc.m2.d7:ocMA.OdeW7C23.text	
ltx/en_us_dedes/oc.m2.d7:ocMA.OdeW7C2T.incipit	…
ltx/en_us_dedes/oc.m2.d7:ocMA.OdeW7C2T.melody	@ltx/en_us_dedes/he.h.m2:heHE.AntitheonProstagma.name
ltx/en_us_dedes/oc.m2.d7:ocMA.OdeW7C2T.mode	@ltx/en_us_dedes/miscellanea:misc.Mode2
ltx/en_us_dedes/oc.m2.d7:ocMA.OdeW7C2T.ode	@ltx/en_us_dedes/miscellanea:misc.Ode7
ltx/en_us_dedes/oc.m2.d7:ocMA.OdeW7C2T.text	
ltx/en_us_dedes/oc.m2.d7:ocMA.OdeW8C11.incipit	…
ltx/en_us_dedes/oc.m2.d7:ocMA.OdeW8C11.melody	@ltx/en_us_dedes/he.h.m2:heHE.TonEnTiVatoMosi.name
ltx/en_us_dedes/oc.m2.d7:ocMA.OdeW8C11.mode	@ltx/en_us_dedes/miscellanea:misc.Mode2
ltx/en_us_dedes/oc.m2.d7:ocMA.OdeW8C11.ode	@ltx/en_us_dedes/miscellanea:misc.Ode8
ltx/en_us_dedes/oc.m2.d7:ocMA.OdeW8C11.text	
ltx/en_us_dedes/oc.m2.d7:ocMA.OdeW8C12.incipit	…
ltx/en_us_dedes/oc.m2.d7:ocMA.OdeW8C12.melody	@ltx/en_us_dedes/he.h.m2:heHE.TonEnTiVatoMosi.name
ltx/en_us_dedes/oc.m2.d7:ocMA.OdeW8C12.mode	@ltx/en_us_dedes/miscellanea:misc.Mode2
ltx/en_us_dedes/oc.m2.d7:ocMA.OdeW8C12.ode	@ltx/en_us_dedes/miscellanea:misc.Ode8
ltx/en_us_dedes/oc.m2.d7:ocMA.OdeW8C12.text	
ltx/en_us_dedes/oc.m2.d7:ocMA.OdeW8C13.incipit	…
ltx/en_us_dedes/oc.m2.d7:ocMA.OdeW8C13.melody	@ltx/en_us_dedes/he.h.m2:heHE.TonEnTiVatoMosi.name
ltx/en_us_dedes/oc.m2.d7:ocMA.OdeW8C13.mode	@ltx/en_us_dedes/miscellanea:misc.Mode2
ltx/en_us_dedes/oc.m2.d7:ocMA.OdeW8C13.ode	@ltx/en_us_dedes/miscellanea:misc.Ode8
ltx/en_us_dedes/oc.m2.d7:ocMA.OdeW8C13.text	
ltx/en_us_dedes/oc.m2.d7:ocMA.OdeW8C1H.greekmelody	@ltx/en_us_dedes/he.h.m2:heHE.TonEnTiVatoMosi.greekname
ltx/en_us_dedes/oc.m2.d7:ocMA.OdeW8C1H.incipit	@ltx/en_us_dedes/he.h.m2:heHE.TonEnTiVatoMosi.incipit
ltx/en_us_dedes/oc.m2.d7:ocMA.OdeW8C1H.melody	@ltx/en_us_dedes/he.h.m2:heHE.TonEnTiVatoMosi.melody
ltx/en_us_dedes/oc.m2.d7:ocMA.OdeW8C1H.mode	@ltx/en_us_dedes/miscellanea:misc.Mode2
ltx/en_us_dedes/oc.m2.d7:ocMA.OdeW8C1H.ode	@ltx/en_us_dedes/miscellanea:misc.Ode8
ltx/en_us_dedes/oc.m2.d7:ocMA.OdeW8C1H.text	@ltx/en_us_dedes/he.h.m2:heHE.TonEnTiVatoMosi.text
ltx/en_us_dedes/oc.m2.d7:ocMA.OdeW8C1T.incipit	…
ltx/en_us_dedes/oc.m2.d7:ocMA.OdeW8C1T.melody	@ltx/en_us_dedes/he.h.m2:heHE.TonEnTiVatoMosi.name
ltx/en_us_dedes/oc.m2.d7:ocMA.OdeW8C1T.mode	@ltx/en_us_dedes/miscellanea:misc.Mode2
ltx/en_us_dedes/oc.m2.d7:ocMA.OdeW8C1T.ode	@ltx/en_us_dedes/miscellanea:misc.Ode8
ltx/en_us_dedes/oc.m2.d7:ocMA.OdeW8C1T.text	
ltx/en_us_dedes/oc.m2.d7:ocMA.OdeW8C21.greekmelody	@ltx/en_us_dedes/he.h.m2:heHE.KaminosPote.greekname
ltx/en_us_dedes/oc.m2.d7:ocMA.OdeW8C21.incipit	…
ltx/en_us_dedes/oc.m2.d7:ocMA.OdeW8C21.melody	@ltx/en_us_dedes/he.h.m2:heHE.KaminosPote.name
ltx/en_us_dedes/oc.m2.d7:ocMA.OdeW8C21.mode	@ltx/en_us_dedes/miscellanea:misc.Mode2
ltx/en_us_dedes/oc.m2.d7:ocMA.OdeW8C21.ode	@ltx/en_us_dedes/miscellanea:misc.Ode8
ltx/en_us_dedes/oc.m2.d7:ocMA.OdeW8C21.text	
ltx/en_us_dedes/oc.m2.d7:ocMA.OdeW8C22.incipit	…
ltx/en_us_dedes/oc.m2.d7:ocMA.OdeW8C22.melody	@ltx/en_us_dedes/he.h.m2:heHE.KaminosPote.name
ltx/en_us_dedes/oc.m2.d7:ocMA.OdeW8C22.mode	@ltx/en_us_dedes/miscellanea:misc.Mode2
ltx/en_us_dedes/oc.m2.d7:ocMA.OdeW8C22.ode	@ltx/en_us_dedes/miscellanea:misc.Ode8
ltx/en_us_dedes/oc.m2.d7:ocMA.OdeW8C22.text	
ltx/en_us_dedes/oc.m2.d7:ocMA.OdeW8C23.incipit	…
ltx/en_us_dedes/oc.m2.d7:ocMA.OdeW8C23.melody	@ltx/en_us_dedes/he.h.m2:heHE.KaminosPote.name
ltx/en_us_dedes/oc.m2.d7:ocMA.OdeW8C23.mode	@ltx/en_us_dedes/miscellanea:misc.Mode2
ltx/en_us_dedes/oc.m2.d7:ocMA.OdeW8C23.ode	@ltx/en_us_dedes/miscellanea:misc.Ode8
ltx/en_us_dedes/oc.m2.d7:ocMA.OdeW8C23.text	
ltx/en_us_dedes/oc.m2.d7:ocMA.OdeW8C2T.incipit	…
ltx/en_us_dedes/oc.m2.d7:ocMA.OdeW8C2T.melody	@ltx/en_us_dedes/he.h.m2:heHE.KaminosPote.name
ltx/en_us_dedes/oc.m2.d7:ocMA.OdeW8C2T.mode	@ltx/en_us_dedes/miscellanea:misc.Mode2
ltx/en_us_dedes/oc.m2.d7:ocMA.OdeW8C2T.ode	@ltx/en_us_dedes/miscellanea:misc.Ode8
ltx/en_us_dedes/oc.m2.d7:ocMA.OdeW8C2T.text	
ltx/en_us_dedes/oc.m2.d7:ocMA.OdeW9C11.incipit	…
ltx/en_us_dedes/oc.m2.d7:ocMA.OdeW9C11.melody	@ltx/en_us_dedes/he.h.m2:heHE.TinYperfyosSarki.name
ltx/en_us_dedes/oc.m2.d7:ocMA.OdeW9C11.mode	@ltx/en_us_dedes/miscellanea:misc.Mode2
ltx/en_us_dedes/oc.m2.d7:ocMA.OdeW9C11.ode	@ltx/en_us_dedes/miscellanea:misc.Ode9
ltx/en_us_dedes/oc.m2.d7:ocMA.OdeW9C11.text	
ltx/en_us_dedes/oc.m2.d7:ocMA.OdeW9C12.incipit	…
ltx/en_us_dedes/oc.m2.d7:ocMA.OdeW9C12.melody	@ltx/en_us_dedes/he.h.m2:heHE.TinYperfyosSarki.name
ltx/en_us_dedes/oc.m2.d7:ocMA.OdeW9C12.mode	@ltx/en_us_dedes/miscellanea:misc.Mode2
ltx/en_us_dedes/oc.m2.d7:ocMA.OdeW9C12.ode	@ltx/en_us_dedes/miscellanea:misc.Ode9
ltx/en_us_dedes/oc.m2.d7:ocMA.OdeW9C12.text	
ltx/en_us_dedes/oc.m2.d7:ocMA.OdeW9C13.incipit	…
ltx/en_us_dedes/oc.m2.d7:ocMA.OdeW9C13.melody	@ltx/en_us_dedes/he.h.m2:heHE.TinYperfyosSarki.name
ltx/en_us_dedes/oc.m2.d7:ocMA.OdeW9C13.mode	@ltx/en_us_dedes/miscellanea:misc.Mode2
ltx/en_us_dedes/oc.m2.d7:ocMA.OdeW9C13.ode	@ltx/en_us_dedes/miscellanea:misc.Ode9
ltx/en_us_dedes/oc.m2.d7:ocMA.OdeW9C13.text	
ltx/en_us_dedes/oc.m2.d7:ocMA.OdeW9C14.incipit	…
ltx/en_us_dedes/oc.m2.d7:ocMA.OdeW9C14.melody	@ltx/en_us_dedes/he.h.m2:heHE.TinYperfyosSarki.name
ltx/en_us_dedes/oc.m2.d7:ocMA.OdeW9C14.mode	@ltx/en_us_dedes/miscellanea:misc.Mode2
ltx/en_us_dedes/oc.m2.d7:ocMA.OdeW9C14.ode	@ltx/en_us_dedes/miscellanea:misc.Ode9
ltx/en_us_dedes/oc.m2.d7:ocMA.OdeW9C14.text	
ltx/en_us_dedes/oc.m2.d7:ocMA.OdeW9C1H.greekmelody	@ltx/en_us_dedes/he.h.m2:heHE.TinYperfyosSarki.greekname
ltx/en_us_dedes/oc.m2.d7:ocMA.OdeW9C1H.incipit	@ltx/en_us_dedes/he.h.m2:heHE.TinYperfyosSarki.incipit
ltx/en_us_dedes/oc.m2.d7:ocMA.OdeW9C1H.melody	@ltx/en_us_dedes/he.h.m2:heHE.TinYperfyosSarki.melody
ltx/en_us_dedes/oc.m2.d7:ocMA.OdeW9C1H.mode	@ltx/en_us_dedes/miscellanea:misc.Mode2
ltx/en_us_dedes/oc.m2.d7:ocMA.OdeW9C1H.ode	@ltx/en_us_dedes/miscellanea:misc.Ode9
ltx/en_us_dedes/oc.m2.d7:ocMA.OdeW9C1H.text	@ltx/en_us_dedes/he.h.m2:heHE.TinYperfyosSarki.text
ltx/en_us_dedes/oc.m2.d7:ocMA.OdeW9C1T.incipit	…
ltx/en_us_dedes/oc.m2.d7:ocMA.OdeW9C1T.melody	@ltx/en_us_dedes/he.h.m2:heHE.TinYperfyosSarki.name
ltx/en_us_dedes/oc.m2.d7:ocMA.OdeW9C1T.mode	@ltx/en_us_dedes/miscellanea:misc.Mode2
ltx/en_us_dedes/oc.m2.d7:ocMA.OdeW9C1T.ode	@ltx/en_us_dedes/miscellanea:misc.Ode9
ltx/en_us_dedes/oc.m2.d7:ocMA.OdeW9C1T.text	
ltx/en_us_dedes/oc.m2.d7:ocMA.OdeW9C21.greekmelody	@ltx/en_us_dedes/he.h.m2:heHE.ITonProIliouFostira.greekname
ltx/en_us_dedes/oc.m2.d7:ocMA.OdeW9C21.incipit	…
ltx/en_us_dedes/oc.m2.d7:ocMA.OdeW9C21.melody	@ltx/en_us_dedes/he.h.m2:heHE.ITonProIliouFostira.name
ltx/en_us_dedes/oc.m2.d7:ocMA.OdeW9C21.mode	@ltx/en_us_dedes/miscellanea:misc.Mode2
ltx/en_us_dedes/oc.m2.d7:ocMA.OdeW9C21.ode	@ltx/en_us_dedes/miscellanea:misc.Ode9
ltx/en_us_dedes/oc.m2.d7:ocMA.OdeW9C21.text	
ltx/en_us_dedes/oc.m2.d7:ocMA.OdeW9C22.incipit	…
ltx/en_us_dedes/oc.m2.d7:ocMA.OdeW9C22.melody	@ltx/en_us_dedes/he.h.m2:heHE.ITonProIliouFostira.name
ltx/en_us_dedes/oc.m2.d7:ocMA.OdeW9C22.mode	@ltx/en_us_dedes/miscellanea:misc.Mode2
ltx/en_us_dedes/oc.m2.d7:ocMA.OdeW9C22.ode	@ltx/en_us_dedes/miscellanea:misc.Ode9
ltx/en_us_dedes/oc.m2.d7:ocMA.OdeW9C22.text	
ltx/en_us_dedes/oc.m2.d7:ocMA.OdeW9C23.incipit	…
ltx/en_us_dedes/oc.m2.d7:ocMA.OdeW9C23.melody	@ltx/en_us_dedes/he.h.m2:heHE.ITonProIliouFostira.name
ltx/en_us_dedes/oc.m2.d7:ocMA.OdeW9C23.mode	@ltx/en_us_dedes/miscellanea:misc.Mode2
ltx/en_us_dedes/oc.m2.d7:ocMA.OdeW9C23.ode	@ltx/en_us_dedes/miscellanea:misc.Ode9
ltx/en_us_dedes/oc.m2.d7:ocMA.OdeW9C23.text	
ltx/en_us_dedes/oc.m2.d7:ocMA.OdeW9C2T.incipit	…
ltx/en_us_dedes/oc.m2.d7:ocMA.OdeW9C2T.melody	@ltx/en_us_dedes/he.h.m2:heHE.ITonProIliouFostira.name
ltx/en_us_dedes/oc.m2.d7:ocMA.OdeW9C2T.mode	@ltx/en_us_dedes/miscellanea:misc.Mode2
ltx/en_us_dedes/oc.m2.d7:ocMA.OdeW9C2T.ode	@ltx/en_us_dedes/miscellanea:misc.Ode9
ltx/en_us_dedes/oc.m2.d7:ocMA.OdeW9C2T.text	
ltx/en_us_dedes/oc.m2.d7:ocVE.ApolTheotokionVM.incipit	@ltx/en_us_dedes/oc.m2.d1:ocVE.ApolTheotokionVM.incipit
ltx/en_us_dedes/oc.m2.d7:ocVE.ApolTheotokionVM.melody	
ltx/en_us_dedes/oc.m2.d7:ocVE.ApolTheotokionVM.mode	@ltx/en_us_dedes/miscellanea:misc.Mode2
ltx/en_us_dedes/oc.m2.d7:ocVE.ApolTheotokionVM.text	@ltx/en_us_dedes/oc.m2.d1:ocVE.ApolTheotokionVM.text
ltx/en_us_dedes/oc.m2.d7:ocVE.AposTheotokion.incipit	O Mother of Light, I…
ltx/en_us_dedes/oc.m2.d7:ocVE.AposTheotokion.melody	
ltx/en_us_dedes/oc.m2.d7:ocVE.AposTheotokion.mode	@ltx/en_us_dedes/miscellanea:misc.Mode2
ltx/en_us_dedes/oc.m2.d7:ocVE.AposTheotokion.text	O Mother of Light, I have committed my every hope wholly unto you. Keep me under your shelter.
ltx/en_us_dedes/oc.m2.d7:ocVE.Aposticha1.incipit	@ltx/en_us_dedes/oc.m2.d3:ocVE.Aposticha3.incipit
ltx/en_us_dedes/oc.m2.d7:ocVE.Aposticha1.melody	
ltx/en_us_dedes/oc.m2.d7:ocVE.Aposticha1.mode	@ltx/en_us_dedes/miscellanea:misc.Mode2
ltx/en_us_dedes/oc.m2.d7:ocVE.Aposticha1.text	@ltx/en_us_dedes/oc.m2.d3:ocVE.Aposticha3.text
ltx/en_us_dedes/oc.m2.d7:ocVE.Aposticha2.incipit	@ltx/en_us_dedes/oc.m2.d4:ocVE.Aposticha3.incipit
ltx/en_us_dedes/oc.m2.d7:ocVE.Aposticha2.melody	
ltx/en_us_dedes/oc.m2.d7:ocVE.Aposticha2.mode	@ltx/en_us_dedes/miscellanea:misc.Mode2
ltx/en_us_dedes/oc.m2.d7:ocVE.Aposticha2.text	@ltx/en_us_dedes/oc.m2.d4:ocVE.Aposticha3.text
ltx/en_us_dedes/oc.m2.d7:ocVE.Aposticha3.incipit	@ltx/en_us_dedes/oc.m2.d5:ocVE.Aposticha3.incipit
ltx/en_us_dedes/oc.m2.d7:ocVE.Aposticha3.melody	
ltx/en_us_dedes/oc.m2.d7:ocVE.Aposticha3.mode	@ltx/en_us_dedes/miscellanea:misc.Mode2
ltx/en_us_dedes/oc.m2.d7:ocVE.Aposticha3.text	@ltx/en_us_dedes/oc.m2.d5:ocVE.Aposticha3.text
ltx/en_us_dedes/oc.m2.d7:ocVE.Aposticha4.incipit	A flower withers and a…
ltx/en_us_dedes/oc.m2.d7:ocVE.Aposticha4.melody	
ltx/en_us_dedes/oc.m2.d7:ocVE.Aposticha4.mode	@ltx/en_us_dedes/miscellanea:misc.Mode2
ltx/en_us_dedes/oc.m2.d7:ocVE.Aposticha4.text	A flower withers and a dream passes: likewise every human being disintegrates. Then, at the sound of the trumpet, there will be like an earthquake, and all the dead will rise to meet You, O Christ God. We pray You will then place the spirits of Your servants, whom You have taken from us, in the dwellings of Your Saints, O Master Christ.
ltx/en_us_dedes/oc.m2.d7:ocVE.SticTheotokion.incipit	@ltx/en_us_dedes/oc.m2.d1:ocVE.SticTheotokion.incipit
ltx/en_us_dedes/oc.m2.d7:ocVE.SticTheotokion.melody	
ltx/en_us_dedes/oc.m2.d7:ocVE.SticTheotokion.mode	@ltx/en_us_dedes/miscellanea:misc.Mode2
ltx/en_us_dedes/oc.m2.d7:ocVE.SticTheotokion.text	@ltx/en_us_dedes/oc.m2.d1:ocVE.SticTheotokion.text
ltx/en_us_dedes/oc.m2.d7:ocVE.Stichera1.greekmelody	@ltx/en_us_dedes/he.a.m2:heAU.OteEkTouXylou.greekname
ltx/en_us_dedes/oc.m2.d7:ocVE.Stichera1.incipit	When You come again, O…
ltx/en_us_dedes/oc.m2.d7:ocVE.Stichera1.melody	@ltx/en_us_dedes/he.a.m2:heAU.OteEkTouXylou.name
ltx/en_us_dedes/oc.m2.d7:ocVE.Stichera1.mode	@ltx/en_us_dedes/miscellanea:misc.Mode2
ltx/en_us_dedes/oc.m2.d7:ocVE.Stichera1.text	When You come again, O Christ our God, * with Your holy Angels in glory to judge the universe, * when all men who ever lived shall stand before You exposed, * there to render a full account * for their every action; * then, O Word, include me in the number of Your sheep, * granting me from now absolution * of my every sin and transgression * which I have committed in this present life.
ltx/en_us_dedes/oc.m2.d7:ocVE.Stichera2.incipit	Only most benevolent God…
ltx/en_us_dedes/oc.m2.d7:ocVE.Stichera2.melody	@ltx/en_us_dedes/he.a.m2:heAU.OteEkTouXylou.name
ltx/en_us_dedes/oc.m2.d7:ocVE.Stichera2.mode	@ltx/en_us_dedes/miscellanea:misc.Mode2
ltx/en_us_dedes/oc.m2.d7:ocVE.Stichera2.text	Only most benevolent God, * break apart the chains of my passions, dry up the festering * of my soul and grant me tears of true compunction, O Lord; * and illumine my darkened heart, * I fervently pray You, * and deliver me from all adverse predicaments, * turmoils and unhappy disasters, * and from all the cunning temptations * of the dreadful foe and ruler of this world.
ltx/en_us_dedes/oc.m2.d7:ocVE.Stichera3.incipit	…
ltx/en_us_dedes/oc.m2.d7:ocVE.Stichera3.melody	@ltx/en_us_dedes/he.a.m2:heAU.OteEkTouXylou.name
ltx/en_us_dedes/oc.m2.d7:ocVE.Stichera3.mode	@ltx/en_us_dedes/miscellanea:misc.Mode2
ltx/en_us_dedes/oc.m2.d7:ocVE.Stichera3.text	
ltx/en_us_dedes/oc.m2.d7:ocVE.Stichera4.greekmelody	@ltx/en_us_dedes/he.a.m2:heAU.OteEkTouXylou.greekname
ltx/en_us_dedes/oc.m2.d7:ocVE.Stichera4.incipit	…
ltx/en_us_dedes/oc.m2.d7:ocVE.Stichera4.melody	@ltx/en_us_dedes/he.a.m2:heAU.OteEkTouXylou.name
ltx/en_us_dedes/oc.m2.d7:ocVE.Stichera4.mode	@ltx/en_us_dedes/miscellanea:misc.Mode2
ltx/en_us_dedes/oc.m2.d7:ocVE.Stichera4.text	
ltx/en_us_dedes/oc.m2.d7:ocVE.Stichera5.incipit	…
ltx/en_us_dedes/oc.m2.d7:ocVE.Stichera5.melody	@ltx/en_us_dedes/he.a.m2:heAU.OteEkTouXylou.name
ltx/en_us_dedes/oc.m2.d7:ocVE.Stichera5.mode	@ltx/en_us_dedes/miscellanea:misc.Mode2
ltx/en_us_dedes/oc.m2.d7:ocVE.Stichera5.text	
ltx/en_us_dedes/oc.m2.d7:ocVE.Stichera6.incipit	Stand by me, all-holy Bride…
ltx/en_us_dedes/oc.m2.d7:ocVE.Stichera6.melody	@ltx/en_us_dedes/he.a.m2:heAU.OteEkTouXylou.name
ltx/en_us_dedes/oc.m2.d7:ocVE.Stichera6.mode	@ltx/en_us_dedes/miscellanea:misc.Mode2
ltx/en_us_dedes/oc.m2.d7:ocVE.Stichera6.text	Stand by me, all-holy Bride of God, * when my wretched soul is about to be parted forcibly * from the members of my body. Also frustrate the plans * of the bodiless enemies, * and shatter the fangs of * those who seek to swallow up my life unsparingly, * so that having nothing to block me, * I may unimpededly rise past * the rulers of darkness standing in the air.
ltx/en_us_dedes/oc.m2.d7:octrMA.AposGlory.incipit	@ltx/en_us_dedes/oc.m2.d7:ocMA.Aposticha4.incipit
ltx/en_us_dedes/oc.m2.d7:octrMA.AposGlory.melody	@ltx/en_us_dedes/he.a.m2:heAU.OteEkTouXylou.name
ltx/en_us_dedes/oc.m2.d7:octrMA.AposGlory.mode	@ltx/en_us_dedes/miscellanea:misc.Mode2
ltx/en_us_dedes/oc.m2.d7:octrMA.AposGlory.text	@ltx/en_us_dedes/oc.m2.d7:ocMA.Aposticha4.text
ltx/en_us_dedes/oc.m2.d7:octrMA.AposTheotokion.incipit	…
ltx/en_us_dedes/oc.m2.d7:octrMA.AposTheotokion.melody	@ltx/en_us_dedes/he.a.m2:heAU.OteEkTouXylou.name
ltx/en_us_dedes/oc.m2.d7:octrMA.AposTheotokion.mode	@ltx/en_us_dedes/miscellanea:misc.Mode2
ltx/en_us_dedes/oc.m2.d7:octrMA.AposTheotokion.text	
ltx/en_us_dedes/oc.m2.d7:octrMA.Aposticha1.greekmelody	@ltx/en_us_dedes/he.a.m2:heAU.OteEkTouXylou.greekname
ltx/en_us_dedes/oc.m2.d7:octrMA.Aposticha1.incipit	@ltx/en_us_dedes/oc.m2.d7:ocMA.Aposticha1.incipit
ltx/en_us_dedes/oc.m2.d7:octrMA.Aposticha1.melody	@ltx/en_us_dedes/he.a.m2:heAU.OteEkTouXylou.name
ltx/en_us_dedes/oc.m2.d7:octrMA.Aposticha1.mode	@ltx/en_us_dedes/miscellanea:misc.Mode2
ltx/en_us_dedes/oc.m2.d7:octrMA.Aposticha1.text	@ltx/en_us_dedes/oc.m2.d7:ocMA.Aposticha1.text
ltx/en_us_dedes/oc.m2.d7:octrMA.Aposticha2.incipit	@ltx/en_us_dedes/oc.m2.d7:ocMA.Aposticha2.incipit
ltx/en_us_dedes/oc.m2.d7:octrMA.Aposticha2.melody	@ltx/en_us_dedes/he.a.m2:heAU.OteEkTouXylou.name
ltx/en_us_dedes/oc.m2.d7:octrMA.Aposticha2.mode	@ltx/en_us_dedes/miscellanea:misc.Mode2
ltx/en_us_dedes/oc.m2.d7:octrMA.Aposticha2.text	@ltx/en_us_dedes/oc.m2.d7:ocMA.Aposticha2.text
ltx/en_us_dedes/oc.m2.d7:octrMA.Aposticha3.incipit	@ltx/en_us_dedes/oc.m2.d7:ocMA.Aposticha3.incipit
ltx/en_us_dedes/oc.m2.d7:octrMA.Aposticha3.melody	@ltx/en_us_dedes/he.a.m2:heAU.OteEkTouXylou.name
ltx/en_us_dedes/oc.m2.d7:octrMA.Aposticha3.mode	@ltx/en_us_dedes/miscellanea:misc.Mode2
ltx/en_us_dedes/oc.m2.d7:octrMA.Aposticha3.text	@ltx/en_us_dedes/oc.m2.d7:ocMA.Aposticha3.text
ltx/en_us_dedes/oc.m2.d7:octrMA.Kathisma11.incipit	@ltx/en_us_dedes/oc.m2.d7:ocMA.Kathisma11.incipit
ltx/en_us_dedes/oc.m2.d7:octrMA.Kathisma11.melody	
ltx/en_us_dedes/oc.m2.d7:octrMA.Kathisma11.mode	@ltx/en_us_dedes/miscellanea:misc.Mode2
ltx/en_us_dedes/oc.m2.d7:octrMA.Kathisma11.text	@ltx/en_us_dedes/oc.m2.d7:ocMA.Kathisma11.text
ltx/en_us_dedes/oc.m2.d7:octrMA.Kathisma12.incipit	@ltx/en_us_dedes/oc.m2.d7:ocMA.Kathisma12.incipit
ltx/en_us_dedes/oc.m2.d7:octrMA.Kathisma12.melody	
ltx/en_us_dedes/oc.m2.d7:octrMA.Kathisma12.mode	@ltx/en_us_dedes/miscellanea:misc.Mode2
ltx/en_us_dedes/oc.m2.d7:octrMA.Kathisma12.text	@ltx/en_us_dedes/oc.m2.d7:ocMA.Kathisma12.text
ltx/en_us_dedes/oc.m2.d7:octrMA.Kathisma13.incipit	@ltx/en_us_dedes/oc.m2.d7:ocMA.Kathisma13.incipit
ltx/en_us_dedes/oc.m2.d7:octrMA.Kathisma13.melody	
ltx/en_us_dedes/oc.m2.d7:octrMA.Kathisma13.mode	@ltx/en_us_dedes/miscellanea:misc.Mode2
ltx/en_us_dedes/oc.m2.d7:octrMA.Kathisma13.text	@ltx/en_us_dedes/oc.m2.d7:ocMA.Kathisma13.text
ltx/en_us_dedes/oc.m2.d7:octrMA.Kathisma14.incipit	O Lord, the memory of…
ltx/en_us_dedes/oc.m2.d7:octrMA.Kathisma14.melody	
ltx/en_us_dedes/oc.m2.d7:octrMA.Kathisma14.mode	@ltx/en_us_dedes/miscellanea:misc.Mode2
ltx/en_us_dedes/oc.m2.d7:octrMA.Kathisma14.text	O Lord, the memory of the deceased leads me to recall what is in store for me. As I envision my condemnation, I bring to You my tortured plea: O merciful Lord, have mercy on me.
ltx/en_us_dedes/oc.m2.d7:octrMA.Kathisma1T.incipit	@ltx/en_us_dedes/oc.m2.d7:ocMA.Kathisma24.incipit
ltx/en_us_dedes/oc.m2.d7:octrMA.Kathisma1T.melody	
ltx/en_us_dedes/oc.m2.d7:octrMA.Kathisma1T.mode	@ltx/en_us_dedes/miscellanea:misc.Mode2
ltx/en_us_dedes/oc.m2.d7:octrMA.Kathisma1T.text	@ltx/en_us_dedes/oc.m2.d7:ocMA.Kathisma24.text
ltx/en_us_dedes/oc.m2.d7:octrMA.Lauds1.incipit	@ltx/en_us_dedes/oc.m2.d2:ocMA.Aposticha3.incipit
ltx/en_us_dedes/oc.m2.d7:octrMA.Lauds1.melody	
ltx/en_us_dedes/oc.m2.d7:octrMA.Lauds1.mode	@ltx/en_us_dedes/miscellanea:misc.Mode2
ltx/en_us_dedes/oc.m2.d7:octrMA.Lauds1.text	@ltx/en_us_dedes/oc.m2.d2:ocMA.Aposticha3.text
ltx/en_us_dedes/oc.m2.d7:octrMA.Lauds2.incipit	@ltx/en_us_dedes/oc.m2.d7:ocMA.Lauds1.incipit
ltx/en_us_dedes/oc.m2.d7:octrMA.Lauds2.melody	
ltx/en_us_dedes/oc.m2.d7:octrMA.Lauds2.mode	@ltx/en_us_dedes/miscellanea:misc.Mode2
ltx/en_us_dedes/oc.m2.d7:octrMA.Lauds2.text	@ltx/en_us_dedes/oc.m2.d7:ocMA.Lauds1.text
ltx/en_us_dedes/oc.m2.d7:octrMA.Lauds3.incipit	@ltx/en_us_dedes/oc.m2.d7:ocMA.Lauds2.incipit
ltx/en_us_dedes/oc.m2.d7:octrMA.Lauds3.melody	
ltx/en_us_dedes/oc.m2.d7:octrMA.Lauds3.mode	@ltx/en_us_dedes/miscellanea:misc.Mode2
ltx/en_us_dedes/oc.m2.d7:octrMA.Lauds3.text	@ltx/en_us_dedes/oc.m2.d7:ocMA.Lauds2.text
ltx/en_us_dedes/oc.m2.d7:octrMA.Lauds4.incipit	@ltx/en_us_dedes/oc.m2.d7:ocMA.Lauds3.incipit
ltx/en_us_dedes/oc.m2.d7:octrMA.Lauds4.melody	
ltx/en_us_dedes/oc.m2.d7:octrMA.Lauds4.mode	@ltx/en_us_dedes/miscellanea:misc.Mode2
ltx/en_us_dedes/oc.m2.d7:octrMA.Lauds4.text	@ltx/en_us_dedes/oc.m2.d7:ocMA.Lauds3.text
ltx/en_us_dedes/oc.m2.d7:octrMA.LaudsGlory.incipit	…
ltx/en_us_dedes/oc.m2.d7:octrMA.LaudsGlory.melody	
ltx/en_us_dedes/oc.m2.d7:octrMA.LaudsGlory.mode	@ltx/en_us_dedes/miscellanea:misc.Mode2
ltx/en_us_dedes/oc.m2.d7:octrMA.LaudsGlory.poet	@ltx/en_us_dedes/poets:po.IoannouTouDamaskinou
ltx/en_us_dedes/oc.m2.d7:octrMA.LaudsGlory.text	
ltx/en_us_dedes/oc.m2.d7:octrMA.LaudsTheotokion.incipit	@ltx/en_us_dedes/oc.m2.d3:ocMA.AposTheotokion.incipit
ltx/en_us_dedes/oc.m2.d7:octrMA.LaudsTheotokion.melody	
ltx/en_us_dedes/oc.m2.d7:octrMA.LaudsTheotokion.mode	@ltx/en_us_dedes/miscellanea:misc.Mode2
ltx/en_us_dedes/oc.m2.d7:octrMA.LaudsTheotokion.text	@ltx/en_us_dedes/oc.m2.d3:ocMA.AposTheotokion.text
ltx/en_us_dedes/oc.m2.d7:octrMA.Photogogic.incipit	@ltx/en_us_dedes/oc.m2.d2:octrMA.Photagogic.incipit
ltx/en_us_dedes/oc.m2.d7:octrMA.Photogogic.mode	@ltx/en_us_dedes/miscellanea:misc.Mode2
ltx/en_us_dedes/oc.m2.d7:octrMA.Photogogic.text	@ltx/en_us_dedes/oc.m2.d2:octrMA.Photagogic.text
ltx/en_us_dedes/oc.m2.d7:octrVE.SticBoth.incipit	@ltx/en_us_dedes/oc.m2.d7:ocVE.SticTheotokion.incipit
ltx/en_us_dedes/oc.m2.d7:octrVE.SticBoth.melody	
ltx/en_us_dedes/oc.m2.d7:octrVE.SticBoth.mode	@ltx/en_us_dedes/miscellanea:misc.Mode2
ltx/en_us_dedes/oc.m2.d7:octrVE.SticBoth.text	@ltx/en_us_dedes/oc.m2.d7:ocVE.SticTheotokion.text
ltx/en_us_dedes/oc.m2.d7:octrVE.SticGlory.incipit	@ltx/en_us_dedes/oc.m2.d7:ocMA.Lauds4.incipit
ltx/en_us_dedes/oc.m2.d7:octrVE.SticGlory.melody	
ltx/en_us_dedes/oc.m2.d7:octrVE.SticGlory.mode	@ltx/en_us_dedes/miscellanea:misc.Mode2
ltx/en_us_dedes/oc.m2.d7:octrVE.SticGlory.text	@ltx/en_us_dedes/oc.m2.d7:ocMA.Lauds4.text
ltx/en_us_dedes/oc.m2.d7:octrVE.Stichera1.incipit	@ltx/en_us_dedes/oc.m2.d2:ocVE.Aposticha3.incipit
ltx/en_us_dedes/oc.m2.d7:octrVE.Stichera1.melody	
ltx/en_us_dedes/oc.m2.d7:octrVE.Stichera1.mode	@ltx/en_us_dedes/miscellanea:misc.Mode2
ltx/en_us_dedes/oc.m2.d7:octrVE.Stichera1.text	@ltx/en_us_dedes/oc.m2.d2:ocVE.Aposticha3.text
ltx/en_us_dedes/oc.m2.d7:octrVE.Stichera2.incipit	@ltx/en_us_dedes/oc.m2.d3:ocVE.Aposticha3.incipit
ltx/en_us_dedes/oc.m2.d7:octrVE.Stichera2.melody	
ltx/en_us_dedes/oc.m2.d7:octrVE.Stichera2.mode	@ltx/en_us_dedes/miscellanea:misc.Mode2
ltx/en_us_dedes/oc.m2.d7:octrVE.Stichera2.text	@ltx/en_us_dedes/oc.m2.d3:ocVE.Aposticha3.text
ltx/en_us_dedes/oc.m2.d7:octrVE.Stichera3.incipit	@ltx/en_us_dedes/oc.m2.d4:ocVE.Aposticha3.incipit
ltx/en_us_dedes/oc.m2.d7:octrVE.Stichera3.melody	
ltx/en_us_dedes/oc.m2.d7:octrVE.Stichera3.mode	@ltx/en_us_dedes/miscellanea:misc.Mode2
ltx/en_us_dedes/oc.m2.d7:octrVE.Stichera3.text	@ltx/en_us_dedes/oc.m2.d4:ocVE.Aposticha3.text
ltx/en_us_dedes/oc.m2.d7:octrVE.Stichera4.incipit	@ltx/en_us_dedes/oc.m2.d5:ocVE.Aposticha3.incipit
ltx/en_us_dedes/oc.m2.d7:octrVE.Stichera4.melody	
ltx/en_us_dedes/oc.m2.d7:octrVE.Stichera4.mode	@ltx/en_us_dedes/miscellanea:misc.Mode2
ltx/en_us_dedes/oc.m2.d7:octrVE.Stichera4.text	@ltx/en_us_dedes/oc.m2.d5:ocVE.Aposticha3.text
