ltx/en_us_dedes/sy.m09.d12:syMA.commemoration01.couplet1.title	@ltx/en_us_dedes/titles:ti.Verses
ltx/en_us_dedes/sy.m09.d12:syMA.commemoration01.couplet1.verse1	
ltx/en_us_dedes/sy.m09.d12:syMA.commemoration01.couplet1.verse2	
ltx/en_us_dedes/sy.m09.d12:syMA.commemoration01.narration.p01	
ltx/en_us_dedes/sy.m09.d12:syMA.commemoration01.single1	
ltx/en_us_dedes/sy.m09.d12:syMA.commemoration01.text	On September 12 was the veneration of the precious staves, and the contest of the holy hieromartyr Autonomus.
ltx/en_us_dedes/sy.m09.d12:syMA.commemoration02.couplet1.title	@ltx/en_us_dedes/titles:ti.Verses
ltx/en_us_dedes/sy.m09.d12:syMA.commemoration02.couplet1.verse1	
ltx/en_us_dedes/sy.m09.d12:syMA.commemoration02.couplet1.verse2	
ltx/en_us_dedes/sy.m09.d12:syMA.commemoration02.narration.p01	
ltx/en_us_dedes/sy.m09.d12:syMA.commemoration02.text	On this day we commemorate the holy hieromartyr Coronatus, bishop of Iconium.
ltx/en_us_dedes/sy.m09.d12:syMA.commemoration03.couplet1.title	@ltx/en_us_dedes/titles:ti.Verses
ltx/en_us_dedes/sy.m09.d12:syMA.commemoration03.couplet1.verse1	
ltx/en_us_dedes/sy.m09.d12:syMA.commemoration03.couplet1.verse2	
ltx/en_us_dedes/sy.m09.d12:syMA.commemoration03.narration.p01	
ltx/en_us_dedes/sy.m09.d12:syMA.commemoration03.text	On this day we commemorate the holy hieromartyr Theodore, bishop of Alexandria.
ltx/en_us_dedes/sy.m09.d12:syMA.commemoration04.couplet1.title	@ltx/en_us_dedes/titles:ti.Verses
ltx/en_us_dedes/sy.m09.d12:syMA.commemoration04.couplet1.verse1	
ltx/en_us_dedes/sy.m09.d12:syMA.commemoration04.couplet1.verse2	
ltx/en_us_dedes/sy.m09.d12:syMA.commemoration04.narration.p01	
ltx/en_us_dedes/sy.m09.d12:syMA.commemoration04.narration.p02	
ltx/en_us_dedes/sy.m09.d12:syMA.commemoration04.narration.p03	
ltx/en_us_dedes/sy.m09.d12:syMA.commemoration04.narration.p04	
ltx/en_us_dedes/sy.m09.d12:syMA.commemoration04.text	On this day we commemorate the holy martyr Julian of Galatia.
ltx/en_us_dedes/sy.m09.d12:syMA.commemoration05.text	On this day we commemorate the holy martyrs Macedonius, Tatian and Theodulus and devout St. Daniel of Thasios.
ltx/en_us_dedes/sy.m09.d12:syMA.commemoration06.couplet1.title	@ltx/en_us_dedes/titles:ti.Verses
ltx/en_us_dedes/sy.m09.d12:syMA.commemoration06.couplet1.verse1	
ltx/en_us_dedes/sy.m09.d12:syMA.commemoration06.couplet1.verse2	
ltx/en_us_dedes/sy.m09.d12:syMA.commemoration06.text	On this day the holy martyr Oceanus died by fire.
ltx/en_us_dedes/sy.m09.d12:syMA.lastline	By the intercessions of Your Saints, O God, have mercy on us. Amen.
