ltx/en_us_dedes/sy.m01.d23:cl.syMA.commemoration01.text	[saint/com 1]
ltx/en_us_dedes/sy.m01.d23:cl.syMA.commemoration02.text	[saint/com 2]
ltx/en_us_dedes/sy.m01.d23:cl.syMA.commemoration03.text	[saint/com 3]
ltx/en_us_dedes/sy.m01.d23:cl.syMA.commemoration04.text	[saint/com 4]
ltx/en_us_dedes/sy.m01.d23:cl.syMA.commemoration05.text	[saint/com 5]
ltx/en_us_dedes/sy.m01.d23:cl.syMA.commemoration06.text	[saint/com list]
ltx/en_us_dedes/sy.m01.d23:syMA.commemoration01.couplet1.title	@ltx/en_us_dedes/titles:ti.Verses
ltx/en_us_dedes/sy.m01.d23:syMA.commemoration01.couplet1.verse1	
ltx/en_us_dedes/sy.m01.d23:syMA.commemoration01.couplet1.verse2	
ltx/en_us_dedes/sy.m01.d23:syMA.commemoration01.narration.p01	
ltx/en_us_dedes/sy.m01.d23:syMA.commemoration01.narration.p02	
ltx/en_us_dedes/sy.m01.d23:syMA.commemoration01.narration.p03	
ltx/en_us_dedes/sy.m01.d23:syMA.commemoration01.narration.p04	
ltx/en_us_dedes/sy.m01.d23:syMA.commemoration01.narration.p05	
ltx/en_us_dedes/sy.m01.d23:syMA.commemoration01.narration.p06	
ltx/en_us_dedes/sy.m01.d23:syMA.commemoration01.single1	
ltx/en_us_dedes/sy.m01.d23:syMA.commemoration01.text	On January 23 we commemorate the holy hieromartyr Clement, bishop of Ancyra, and the holy martyr Agathangelos.
ltx/en_us_dedes/sy.m01.d23:syMA.commemoration02.couplet1.title	@ltx/en_us_dedes/titles:ti.Verses
ltx/en_us_dedes/sy.m01.d23:syMA.commemoration02.couplet1.verse1	
ltx/en_us_dedes/sy.m01.d23:syMA.commemoration02.couplet1.verse2	
ltx/en_us_dedes/sy.m01.d23:syMA.commemoration02.text	On this day we also commemorate our devout father Efsevios.
ltx/en_us_dedes/sy.m01.d23:syMA.commemoration03.couplet1.title	@ltx/en_us_dedes/titles:ti.Verses
ltx/en_us_dedes/sy.m01.d23:syMA.commemoration03.couplet1.verse1	
ltx/en_us_dedes/sy.m01.d23:syMA.commemoration03.couplet1.verse2	
ltx/en_us_dedes/sy.m01.d23:syMA.commemoration03.narration.p01	
ltx/en_us_dedes/sy.m01.d23:syMA.commemoration03.text	On this day we also commemorate our devout father Maysimas the Syrian.
ltx/en_us_dedes/sy.m01.d23:syMA.commemoration04.couplet1.title	@ltx/en_us_dedes/titles:ti.Verses
ltx/en_us_dedes/sy.m01.d23:syMA.commemoration04.couplet1.verse1	
ltx/en_us_dedes/sy.m01.d23:syMA.commemoration04.couplet1.verse2	
ltx/en_us_dedes/sy.m01.d23:syMA.commemoration04.narration.p01	
ltx/en_us_dedes/sy.m01.d23:syMA.commemoration04.narration.p02	
ltx/en_us_dedes/sy.m01.d23:syMA.commemoration04.narration.p03	
ltx/en_us_dedes/sy.m01.d23:syMA.commemoration04.text	On this day we also commemorate our devout father Salamanes the hesychast.
ltx/en_us_dedes/sy.m01.d23:syMA.commemoration05.couplet1.title	@ltx/en_us_dedes/titles:ti.Verses
ltx/en_us_dedes/sy.m01.d23:syMA.commemoration05.couplet1.verse1	
ltx/en_us_dedes/sy.m01.d23:syMA.commemoration05.couplet1.verse2	
ltx/en_us_dedes/sy.m01.d23:syMA.commemoration05.text	On this day the holy Two Martyrs of Parium were thrown into a pit and died there.
ltx/en_us_dedes/sy.m01.d23:syMA.lastline	By the intercession of Your Saints, O Christ our God, have mercy on us. Amen.
