ltx/en_us_dedes/me.m08.d18:meDA.commemoration.first	Memory of the Holy Martyrs Florus and Laurus
ltx/en_us_dedes/me.m08.d18:meDA.commemoration.first_name	
ltx/en_us_dedes/me.m08.d18:meDA.commemoration.first_short	Memory of the Holy Martyrs Florus and Laurus
ltx/en_us_dedes/me.m08.d18:meDA.commemoration.first_title	@ltx/en_us_dedes/titles:ti.Saints
ltx/en_us_dedes/me.m08.d18:meDA.commemoration.full	Memory of the Holy Martyrs Florus and Laurus
ltx/en_us_dedes/me.m08.d18:meDA.commemoration.second_name	
ltx/en_us_dedes/me.m08.d18:meDA.commemoration.second_title	
ltx/en_us_dedes/me.m08.d18:meDA.date	August 18
ltx/en_us_dedes/me.m08.d18:meDA.fordate	for August 18
ltx/en_us_dedes/me.m08.d18:meDA.insert1	
ltx/en_us_dedes/me.m08.d18:meDA.insert2	
ltx/en_us_dedes/me.m08.d18:meDA.note	
ltx/en_us_dedes/me.m08.d18:meDA.pdfcoverdate	August 18,
ltx/en_us_dedes/me.m08.d18:meDA.pdfheaderdate	August 18
ltx/en_us_dedes/me.m08.d18:meHO.commemorations	
ltx/en_us_dedes/me.m08.d18:meHO.note1	
ltx/en_us_dedes/me.m08.d18:meHO.note2	
ltx/en_us_dedes/me.m08.d18:meHO.number	
ltx/en_us_dedes/me.m08.d18:meHO.rank	
ltx/en_us_dedes/me.m08.d18:meLE.commemoration1	The Holy Martyrs Phloros and Lauros.
ltx/en_us_dedes/me.m08.d18:meLE.commemoration2	
ltx/en_us_dedes/me.m08.d18:meLI.Kontakion1.incipit	…
ltx/en_us_dedes/me.m08.d18:meLI.Kontakion1.melody	
ltx/en_us_dedes/me.m08.d18:meLI.Kontakion1.mode	
ltx/en_us_dedes/me.m08.d18:meLI.Kontakion1.text	
ltx/en_us_dedes/me.m08.d18:meLI.Megalynarion.text	
ltx/en_us_dedes/me.m08.d18:meMA.AposGlory.incipit	@ltx/en_us_dedes/me.m08.d15:meVE.Aposticha2.incipit
ltx/en_us_dedes/me.m08.d18:meMA.AposGlory.melody	
ltx/en_us_dedes/me.m08.d18:meMA.AposGlory.mode	@ltx/en_us_dedes/miscellanea:misc.Mode4
ltx/en_us_dedes/me.m08.d18:meMA.AposGlory.text	@ltx/en_us_dedes/me.m08.d15:meVE.Aposticha2.text
ltx/en_us_dedes/me.m08.d18:meMA.Aposticha1.greekmelody	@ltx/en_us_dedes/he.a.m2:heAU.OikosTouEfratha.greekname
ltx/en_us_dedes/me.m08.d18:meMA.Aposticha1.incipit	Rejoice, Gethsemane, * the consecrated…
ltx/en_us_dedes/me.m08.d18:meMA.Aposticha1.melody	@ltx/en_us_dedes/he.a.m2:heAU.OikosTouEfratha.name
ltx/en_us_dedes/me.m08.d18:meMA.Aposticha1.mode	@ltx/en_us_dedes/miscellanea:misc.Mode2
ltx/en_us_dedes/me.m08.d18:meMA.Aposticha1.text	Rejoice, Gethsemane, * the consecrated city * of the Theotokos, * wherein the Queen and Lady of the world was laid to rest.
ltx/en_us_dedes/me.m08.d18:meMA.Aposticha2.incipit	The Mother of our God…
ltx/en_us_dedes/me.m08.d18:meMA.Aposticha2.melody	@ltx/en_us_dedes/he.a.m2:heAU.OikosTouEfratha.name
ltx/en_us_dedes/me.m08.d18:meMA.Aposticha2.mode	@ltx/en_us_dedes/miscellanea:misc.Mode2
ltx/en_us_dedes/me.m08.d18:meMA.Aposticha2.text	The Mother of our God, * the only Theotokos * and the most blessed Lady, * is gloriously transferred from earth into celestial heights.
ltx/en_us_dedes/me.m08.d18:meMA.Aposticha3.incipit	Solemnly sing, all you *…
ltx/en_us_dedes/me.m08.d18:meMA.Aposticha3.melody	@ltx/en_us_dedes/he.a.m2:heAU.OikosTouEfratha.name
ltx/en_us_dedes/me.m08.d18:meMA.Aposticha3.mode	@ltx/en_us_dedes/miscellanea:misc.Mode2
ltx/en_us_dedes/me.m08.d18:meMA.Aposticha3.text	Solemnly sing, all you * angelic choirs of heaven; * for now the Virgin Mother * is gloriously transferred from earth into celestial heights.
ltx/en_us_dedes/me.m08.d18:meMA.C1.acrostic.notice1	
ltx/en_us_dedes/me.m08.d18:meMA.C1.acrostic.text	
ltx/en_us_dedes/me.m08.d18:meMA.C1.acrostic.title	
ltx/en_us_dedes/me.m08.d18:meMA.C1.title	@ltx/en_us_dedes/titles:ti.CanonSaints
ltx/en_us_dedes/me.m08.d18:meMA.C1.verse	@ltx/en_us_dedes/prayers:pr.verse_SaintsM.text
ltx/en_us_dedes/me.m08.d18:meMA.Exaposteilarion1.greekmelody	@ltx/en_us_dedes/he.a.m2:heAU.GynaikesAkoutisthite.greekname
ltx/en_us_dedes/me.m08.d18:meMA.Exaposteilarion1.incipit	All-honored Saints, with faith we…
ltx/en_us_dedes/me.m08.d18:meMA.Exaposteilarion1.melody	@ltx/en_us_dedes/he.a.m2:heAU.GynaikesAkoutisthite.name
ltx/en_us_dedes/me.m08.d18:meMA.Exaposteilarion1.mode	@ltx/en_us_dedes/miscellanea:misc.Mode2
ltx/en_us_dedes/me.m08.d18:meMA.Exaposteilarion1.text	All-honored Saints, with faith we touch * your holy relics and become * healthy and strong in body * and soul, O Laurus and Florus. * Great-martyrs, now we pray to you * who stand before the Lord of all: * Remember us to the Master, * as we are now celebrating * your memory, bright and festive.
ltx/en_us_dedes/me.m08.d18:meMA.Exaposteilarion2.greekmelody	@ltx/en_us_dedes/he.a.m3:heAU.OOuranonToisAstrois.greekname
ltx/en_us_dedes/me.m08.d18:meMA.Exaposteilarion2.incipit	@ltx/en_us_dedes/me.m08.d16:meMA.Exaposteilarion2.incipit
ltx/en_us_dedes/me.m08.d18:meMA.Exaposteilarion2.melody	@ltx/en_us_dedes/he.a.m3:heAU.OOuranonToisAstrois.name
ltx/en_us_dedes/me.m08.d18:meMA.Exaposteilarion2.mode	@ltx/en_us_dedes/miscellanea:misc.Mode3
ltx/en_us_dedes/me.m08.d18:meMA.Exaposteilarion2.text	@ltx/en_us_dedes/me.m08.d16:meMA.Exaposteilarion2.text
ltx/en_us_dedes/me.m08.d18:meMA.Kathisma11.greekmelody	@ltx/en_us_dedes/he.a.m4:heAU.EpefanisSimeron.greekname
ltx/en_us_dedes/me.m08.d18:meMA.Kathisma11.incipit	By the immaterial Spirit the…
ltx/en_us_dedes/me.m08.d18:meMA.Kathisma11.melody	@ltx/en_us_dedes/he.a.m4:heAU.EpefanisSimeron.name
ltx/en_us_dedes/me.m08.d18:meMA.Kathisma11.mode	@ltx/en_us_dedes/miscellanea:misc.Mode4
ltx/en_us_dedes/me.m08.d18:meMA.Kathisma11.text	By the immaterial Spirit the whole world * on your bright memorial has been noetically adorned, * and it exultantly cries to you, * Rejoice, O Virgin, the pride and joy of Christians all.
ltx/en_us_dedes/me.m08.d18:meMA.Kathisma21.greekmelody	@ltx/en_us_dedes/he.a.m4:heAU.TachyProkatalave.greekname
ltx/en_us_dedes/me.m08.d18:meMA.Kathisma21.incipit	You gathered together the Apostles…
ltx/en_us_dedes/me.m08.d18:meMA.Kathisma21.melody	@ltx/en_us_dedes/he.a.m4:heAU.TachyProkatalave.name
ltx/en_us_dedes/me.m08.d18:meMA.Kathisma21.mode	@ltx/en_us_dedes/miscellanea:misc.Mode4
ltx/en_us_dedes/me.m08.d18:meMA.Kathisma21.text	You gathered together the Apostles borne on a cloud, * to see your divine translation, at the summons of your * Creator, the Son you bore. * Thereforewith great rejoicing and with manifest glory * they hymned you as they buried the immaculate body * of your sublime beatitude, O Mother of Christ our God.
ltx/en_us_dedes/me.m08.d18:meMA.Ode1C11.greekmelody	@ltx/en_us_dedes/he.h.m8:heHE.ArmatilatinFarao.greekname
ltx/en_us_dedes/me.m08.d18:meMA.Ode1C11.incipit	…
ltx/en_us_dedes/me.m08.d18:meMA.Ode1C11.melody	@ltx/en_us_dedes/he.h.m8:heHE.ArmatilatinFarao.name
ltx/en_us_dedes/me.m08.d18:meMA.Ode1C11.mode	@ltx/en_us_dedes/miscellanea:misc.Mode8
ltx/en_us_dedes/me.m08.d18:meMA.Ode1C11.ode	@ltx/en_us_dedes/miscellanea:misc.Ode1
ltx/en_us_dedes/me.m08.d18:meMA.Ode1C11.text	
ltx/en_us_dedes/me.m08.d18:meMA.Ode1C12.incipit	…
ltx/en_us_dedes/me.m08.d18:meMA.Ode1C12.melody	@ltx/en_us_dedes/he.h.m8:heHE.ArmatilatinFarao.name
ltx/en_us_dedes/me.m08.d18:meMA.Ode1C12.mode	@ltx/en_us_dedes/miscellanea:misc.Mode8
ltx/en_us_dedes/me.m08.d18:meMA.Ode1C12.ode	@ltx/en_us_dedes/miscellanea:misc.Ode1
ltx/en_us_dedes/me.m08.d18:meMA.Ode1C12.text	
ltx/en_us_dedes/me.m08.d18:meMA.Ode1C13.incipit	…
ltx/en_us_dedes/me.m08.d18:meMA.Ode1C13.melody	@ltx/en_us_dedes/he.h.m8:heHE.ArmatilatinFarao.name
ltx/en_us_dedes/me.m08.d18:meMA.Ode1C13.mode	@ltx/en_us_dedes/miscellanea:misc.Mode8
ltx/en_us_dedes/me.m08.d18:meMA.Ode1C13.ode	@ltx/en_us_dedes/miscellanea:misc.Ode1
ltx/en_us_dedes/me.m08.d18:meMA.Ode1C13.text	
ltx/en_us_dedes/me.m08.d18:meMA.Ode1C1T.incipit	…
ltx/en_us_dedes/me.m08.d18:meMA.Ode1C1T.melody	@ltx/en_us_dedes/he.h.m8:heHE.ArmatilatinFarao.name
ltx/en_us_dedes/me.m08.d18:meMA.Ode1C1T.mode	@ltx/en_us_dedes/miscellanea:misc.Mode8
ltx/en_us_dedes/me.m08.d18:meMA.Ode1C1T.ode	@ltx/en_us_dedes/miscellanea:misc.Ode1
ltx/en_us_dedes/me.m08.d18:meMA.Ode1C1T.text	
ltx/en_us_dedes/me.m08.d18:meMA.Ode3C11.greekmelody	@ltx/en_us_dedes/he.h.m8:heHE.OuraniasApsidos.greekname
ltx/en_us_dedes/me.m08.d18:meMA.Ode3C11.incipit	…
ltx/en_us_dedes/me.m08.d18:meMA.Ode3C11.melody	@ltx/en_us_dedes/he.h.m8:heHE.OuraniasApsidos.name
ltx/en_us_dedes/me.m08.d18:meMA.Ode3C11.mode	@ltx/en_us_dedes/miscellanea:misc.Mode8
ltx/en_us_dedes/me.m08.d18:meMA.Ode3C11.ode	@ltx/en_us_dedes/miscellanea:misc.Ode3
ltx/en_us_dedes/me.m08.d18:meMA.Ode3C11.text	
ltx/en_us_dedes/me.m08.d18:meMA.Ode3C12.incipit	…
ltx/en_us_dedes/me.m08.d18:meMA.Ode3C12.melody	@ltx/en_us_dedes/he.h.m8:heHE.OuraniasApsidos.name
ltx/en_us_dedes/me.m08.d18:meMA.Ode3C12.mode	@ltx/en_us_dedes/miscellanea:misc.Mode3
ltx/en_us_dedes/me.m08.d18:meMA.Ode3C12.ode	@ltx/en_us_dedes/miscellanea:misc.Ode8
ltx/en_us_dedes/me.m08.d18:meMA.Ode3C12.text	
ltx/en_us_dedes/me.m08.d18:meMA.Ode3C13.incipit	…
ltx/en_us_dedes/me.m08.d18:meMA.Ode3C13.melody	@ltx/en_us_dedes/he.h.m8:heHE.OuraniasApsidos.name
ltx/en_us_dedes/me.m08.d18:meMA.Ode3C13.mode	@ltx/en_us_dedes/miscellanea:misc.Mode3
ltx/en_us_dedes/me.m08.d18:meMA.Ode3C13.ode	@ltx/en_us_dedes/miscellanea:misc.Ode8
ltx/en_us_dedes/me.m08.d18:meMA.Ode3C13.text	
ltx/en_us_dedes/me.m08.d18:meMA.Ode3C1T.incipit	…
ltx/en_us_dedes/me.m08.d18:meMA.Ode3C1T.melody	@ltx/en_us_dedes/he.h.m8:heHE.OuraniasApsidos.name
ltx/en_us_dedes/me.m08.d18:meMA.Ode3C1T.mode	@ltx/en_us_dedes/miscellanea:misc.Mode8
ltx/en_us_dedes/me.m08.d18:meMA.Ode3C1T.ode	@ltx/en_us_dedes/miscellanea:misc.Ode3
ltx/en_us_dedes/me.m08.d18:meMA.Ode3C1T.text	
ltx/en_us_dedes/me.m08.d18:meMA.Ode3H.greekmelody	@ltx/en_us_dedes/he.h.m8:heHE.OuraniasApsidos.greekname
ltx/en_us_dedes/me.m08.d18:meMA.Ode3H.incipit	@ltx/en_us_dedes/he.h.m8:heHE.OuraniasApsidos.incipit
ltx/en_us_dedes/me.m08.d18:meMA.Ode3H.melody	@ltx/en_us_dedes/he.h.m8:heHE.OuraniasApsidos.melody
ltx/en_us_dedes/me.m08.d18:meMA.Ode3H.mode	@ltx/en_us_dedes/miscellanea:misc.Mode8
ltx/en_us_dedes/me.m08.d18:meMA.Ode3H.ode	@ltx/en_us_dedes/miscellanea:misc.Ode3
ltx/en_us_dedes/me.m08.d18:meMA.Ode3H.text	@ltx/en_us_dedes/he.h.m8:heHE.OuraniasApsidos.text
ltx/en_us_dedes/me.m08.d18:meMA.Ode3Kathisma1.greekmelody	@ltx/en_us_dedes/he.a.m8:heAU.TinSofianKaiLogon.greekname
ltx/en_us_dedes/me.m08.d18:meMA.Ode3Kathisma1.incipit	…
ltx/en_us_dedes/me.m08.d18:meMA.Ode3Kathisma1.melody	@ltx/en_us_dedes/he.a.m8:heAU.TinSofianKaiLogon.name
ltx/en_us_dedes/me.m08.d18:meMA.Ode3Kathisma1.mode	@ltx/en_us_dedes/miscellanea:misc.Mode8
ltx/en_us_dedes/me.m08.d18:meMA.Ode3Kathisma1.text	
ltx/en_us_dedes/me.m08.d18:meMA.Ode3Kathisma2.greekmelody	@ltx/en_us_dedes/he.a.m8:heAU.TinSofianKaiLogon.greekname
ltx/en_us_dedes/me.m08.d18:meMA.Ode3Kathisma2.incipit	@ltx/en_us_dedes/me.m08.d16:meMA.Ode3Kathisma3.incipit
ltx/en_us_dedes/me.m08.d18:meMA.Ode3Kathisma2.melody	@ltx/en_us_dedes/he.a.m8:heAU.TinSofianKaiLogon.name
ltx/en_us_dedes/me.m08.d18:meMA.Ode3Kathisma2.mode	@ltx/en_us_dedes/miscellanea:misc.Mode8
ltx/en_us_dedes/me.m08.d18:meMA.Ode3Kathisma2.text	@ltx/en_us_dedes/me.m08.d16:meMA.Ode3Kathisma3.text
ltx/en_us_dedes/me.m08.d18:meMA.Ode4C11.greekmelody	@ltx/en_us_dedes/he.h.m8:heHE.SyMouIschys.greekname
ltx/en_us_dedes/me.m08.d18:meMA.Ode4C11.incipit	…
ltx/en_us_dedes/me.m08.d18:meMA.Ode4C11.melody	@ltx/en_us_dedes/he.h.m8:heHE.SyMouIschys.name
ltx/en_us_dedes/me.m08.d18:meMA.Ode4C11.mode	@ltx/en_us_dedes/miscellanea:misc.Mode8
ltx/en_us_dedes/me.m08.d18:meMA.Ode4C11.ode	@ltx/en_us_dedes/miscellanea:misc.Ode4
ltx/en_us_dedes/me.m08.d18:meMA.Ode4C11.text	
ltx/en_us_dedes/me.m08.d18:meMA.Ode4C12.incipit	…
ltx/en_us_dedes/me.m08.d18:meMA.Ode4C12.melody	@ltx/en_us_dedes/he.h.m8:heHE.SyMouIschys.name
ltx/en_us_dedes/me.m08.d18:meMA.Ode4C12.mode	@ltx/en_us_dedes/miscellanea:misc.Mode8
ltx/en_us_dedes/me.m08.d18:meMA.Ode4C12.ode	@ltx/en_us_dedes/miscellanea:misc.Ode4
ltx/en_us_dedes/me.m08.d18:meMA.Ode4C12.text	
ltx/en_us_dedes/me.m08.d18:meMA.Ode4C13.incipit	…
ltx/en_us_dedes/me.m08.d18:meMA.Ode4C13.melody	@ltx/en_us_dedes/he.h.m8:heHE.SyMouIschys.name
ltx/en_us_dedes/me.m08.d18:meMA.Ode4C13.mode	@ltx/en_us_dedes/miscellanea:misc.Mode8
ltx/en_us_dedes/me.m08.d18:meMA.Ode4C13.ode	@ltx/en_us_dedes/miscellanea:misc.Ode4
ltx/en_us_dedes/me.m08.d18:meMA.Ode4C13.text	
ltx/en_us_dedes/me.m08.d18:meMA.Ode4C14.incipit	…
ltx/en_us_dedes/me.m08.d18:meMA.Ode4C14.melody	@ltx/en_us_dedes/he.h.m8:heHE.SyMouIschys.name
ltx/en_us_dedes/me.m08.d18:meMA.Ode4C14.mode	@ltx/en_us_dedes/miscellanea:misc.Mode8
ltx/en_us_dedes/me.m08.d18:meMA.Ode4C14.ode	@ltx/en_us_dedes/miscellanea:misc.Ode4
ltx/en_us_dedes/me.m08.d18:meMA.Ode4C14.text	
ltx/en_us_dedes/me.m08.d18:meMA.Ode4C1T.incipit	…
ltx/en_us_dedes/me.m08.d18:meMA.Ode4C1T.melody	@ltx/en_us_dedes/he.h.m8:heHE.SyMouIschys.name
ltx/en_us_dedes/me.m08.d18:meMA.Ode4C1T.mode	@ltx/en_us_dedes/miscellanea:misc.Mode8
ltx/en_us_dedes/me.m08.d18:meMA.Ode4C1T.ode	@ltx/en_us_dedes/miscellanea:misc.Ode4
ltx/en_us_dedes/me.m08.d18:meMA.Ode4C1T.text	
ltx/en_us_dedes/me.m08.d18:meMA.Ode5C11.greekmelody	@ltx/en_us_dedes/he.h.m8:heHE.InaTiMeAposo.greekname
ltx/en_us_dedes/me.m08.d18:meMA.Ode5C11.incipit	…
ltx/en_us_dedes/me.m08.d18:meMA.Ode5C11.melody	@ltx/en_us_dedes/he.h.m8:heHE.InaTiMeAposo.name
ltx/en_us_dedes/me.m08.d18:meMA.Ode5C11.mode	@ltx/en_us_dedes/miscellanea:misc.Mode8
ltx/en_us_dedes/me.m08.d18:meMA.Ode5C11.ode	@ltx/en_us_dedes/miscellanea:misc.Ode5
ltx/en_us_dedes/me.m08.d18:meMA.Ode5C11.text	
ltx/en_us_dedes/me.m08.d18:meMA.Ode5C12.incipit	…
ltx/en_us_dedes/me.m08.d18:meMA.Ode5C12.melody	@ltx/en_us_dedes/he.h.m8:heHE.InaTiMeAposo.name
ltx/en_us_dedes/me.m08.d18:meMA.Ode5C12.mode	@ltx/en_us_dedes/miscellanea:misc.Mode8
ltx/en_us_dedes/me.m08.d18:meMA.Ode5C12.ode	@ltx/en_us_dedes/miscellanea:misc.Ode5
ltx/en_us_dedes/me.m08.d18:meMA.Ode5C12.text	
ltx/en_us_dedes/me.m08.d18:meMA.Ode5C13.incipit	…
ltx/en_us_dedes/me.m08.d18:meMA.Ode5C13.melody	@ltx/en_us_dedes/he.h.m8:heHE.InaTiMeAposo.name
ltx/en_us_dedes/me.m08.d18:meMA.Ode5C13.mode	@ltx/en_us_dedes/miscellanea:misc.Mode8
ltx/en_us_dedes/me.m08.d18:meMA.Ode5C13.ode	@ltx/en_us_dedes/miscellanea:misc.Ode5
ltx/en_us_dedes/me.m08.d18:meMA.Ode5C13.text	
ltx/en_us_dedes/me.m08.d18:meMA.Ode5C1T.incipit	…
ltx/en_us_dedes/me.m08.d18:meMA.Ode5C1T.melody	@ltx/en_us_dedes/he.h.m8:heHE.InaTiMeAposo.name
ltx/en_us_dedes/me.m08.d18:meMA.Ode5C1T.mode	@ltx/en_us_dedes/miscellanea:misc.Mode8
ltx/en_us_dedes/me.m08.d18:meMA.Ode5C1T.ode	@ltx/en_us_dedes/miscellanea:misc.Ode5
ltx/en_us_dedes/me.m08.d18:meMA.Ode5C1T.text	
ltx/en_us_dedes/me.m08.d18:meMA.Ode6C11.greekmelody	@ltx/en_us_dedes/he.h.m8:heHE.IlasthitiMoiSotir.greekname
ltx/en_us_dedes/me.m08.d18:meMA.Ode6C11.incipit	…
ltx/en_us_dedes/me.m08.d18:meMA.Ode6C11.melody	@ltx/en_us_dedes/he.h.m8:heHE.IlasthitiMoiSotir.name
ltx/en_us_dedes/me.m08.d18:meMA.Ode6C11.mode	@ltx/en_us_dedes/miscellanea:misc.Mode8
ltx/en_us_dedes/me.m08.d18:meMA.Ode6C11.ode	@ltx/en_us_dedes/miscellanea:misc.Ode6
ltx/en_us_dedes/me.m08.d18:meMA.Ode6C11.text	
ltx/en_us_dedes/me.m08.d18:meMA.Ode6C12.incipit	…
ltx/en_us_dedes/me.m08.d18:meMA.Ode6C12.melody	@ltx/en_us_dedes/he.h.m8:heHE.IlasthitiMoiSotir.name
ltx/en_us_dedes/me.m08.d18:meMA.Ode6C12.mode	@ltx/en_us_dedes/miscellanea:misc.Mode8
ltx/en_us_dedes/me.m08.d18:meMA.Ode6C12.ode	@ltx/en_us_dedes/miscellanea:misc.Ode6
ltx/en_us_dedes/me.m08.d18:meMA.Ode6C12.text	
ltx/en_us_dedes/me.m08.d18:meMA.Ode6C13.incipit	…
ltx/en_us_dedes/me.m08.d18:meMA.Ode6C13.melody	@ltx/en_us_dedes/he.h.m8:heHE.IlasthitiMoiSotir.name
ltx/en_us_dedes/me.m08.d18:meMA.Ode6C13.mode	@ltx/en_us_dedes/miscellanea:misc.Mode8
ltx/en_us_dedes/me.m08.d18:meMA.Ode6C13.ode	@ltx/en_us_dedes/miscellanea:misc.Ode6
ltx/en_us_dedes/me.m08.d18:meMA.Ode6C13.text	
ltx/en_us_dedes/me.m08.d18:meMA.Ode6C1T.incipit	…
ltx/en_us_dedes/me.m08.d18:meMA.Ode6C1T.melody	@ltx/en_us_dedes/he.h.m8:heHE.IlasthitiMoiSotir.name
ltx/en_us_dedes/me.m08.d18:meMA.Ode6C1T.mode	@ltx/en_us_dedes/miscellanea:misc.Mode8
ltx/en_us_dedes/me.m08.d18:meMA.Ode6C1T.ode	@ltx/en_us_dedes/miscellanea:misc.Ode6
ltx/en_us_dedes/me.m08.d18:meMA.Ode6C1T.text	
ltx/en_us_dedes/me.m08.d18:meMA.Ode6H.greekmelody	@ltx/en_us_dedes/he.h.m8:heHE.IlasthitiMoiSotir.greekname
ltx/en_us_dedes/me.m08.d18:meMA.Ode6H.incipit	@ltx/en_us_dedes/he.h.m8:heHE.IlasthitiMoiSotir.incipit
ltx/en_us_dedes/me.m08.d18:meMA.Ode6H.melody	@ltx/en_us_dedes/he.h.m8:heHE.IlasthitiMoiSotir.melody
ltx/en_us_dedes/me.m08.d18:meMA.Ode6H.mode	@ltx/en_us_dedes/miscellanea:misc.Mode8
ltx/en_us_dedes/me.m08.d18:meMA.Ode6H.ode	@ltx/en_us_dedes/miscellanea:misc.Ode6
ltx/en_us_dedes/me.m08.d18:meMA.Ode6H.text	@ltx/en_us_dedes/he.h.m8:heHE.IlasthitiMoiSotir.text
ltx/en_us_dedes/me.m08.d18:meMA.Ode7C11.greekmelody	@ltx/en_us_dedes/he.h.m8:heHE.TheouSynkatavasin.greekname
ltx/en_us_dedes/me.m08.d18:meMA.Ode7C11.incipit	…
ltx/en_us_dedes/me.m08.d18:meMA.Ode7C11.melody	@ltx/en_us_dedes/he.h.m8:heHE.TheouSynkatavasin.name
ltx/en_us_dedes/me.m08.d18:meMA.Ode7C11.mode	@ltx/en_us_dedes/miscellanea:misc.Mode8
ltx/en_us_dedes/me.m08.d18:meMA.Ode7C11.ode	@ltx/en_us_dedes/miscellanea:misc.Ode7
ltx/en_us_dedes/me.m08.d18:meMA.Ode7C11.text	
ltx/en_us_dedes/me.m08.d18:meMA.Ode7C12.incipit	…
ltx/en_us_dedes/me.m08.d18:meMA.Ode7C12.melody	@ltx/en_us_dedes/he.h.m8:heHE.TheouSynkatavasin.name
ltx/en_us_dedes/me.m08.d18:meMA.Ode7C12.mode	@ltx/en_us_dedes/miscellanea:misc.Mode8
ltx/en_us_dedes/me.m08.d18:meMA.Ode7C12.ode	@ltx/en_us_dedes/miscellanea:misc.Ode7
ltx/en_us_dedes/me.m08.d18:meMA.Ode7C12.text	
ltx/en_us_dedes/me.m08.d18:meMA.Ode7C13.incipit	…
ltx/en_us_dedes/me.m08.d18:meMA.Ode7C13.melody	@ltx/en_us_dedes/he.h.m8:heHE.TheouSynkatavasin.name
ltx/en_us_dedes/me.m08.d18:meMA.Ode7C13.mode	@ltx/en_us_dedes/miscellanea:misc.Mode8
ltx/en_us_dedes/me.m08.d18:meMA.Ode7C13.ode	@ltx/en_us_dedes/miscellanea:misc.Ode7
ltx/en_us_dedes/me.m08.d18:meMA.Ode7C13.text	
ltx/en_us_dedes/me.m08.d18:meMA.Ode7C1T.incipit	…
ltx/en_us_dedes/me.m08.d18:meMA.Ode7C1T.melody	@ltx/en_us_dedes/he.h.m8:heHE.TheouSynkatavasin.name
ltx/en_us_dedes/me.m08.d18:meMA.Ode7C1T.mode	@ltx/en_us_dedes/miscellanea:misc.Mode8
ltx/en_us_dedes/me.m08.d18:meMA.Ode7C1T.ode	@ltx/en_us_dedes/miscellanea:misc.Ode7
ltx/en_us_dedes/me.m08.d18:meMA.Ode7C1T.text	
ltx/en_us_dedes/me.m08.d18:meMA.Ode8C11.greekmelody	@ltx/en_us_dedes/he.h.m8:heHE.EptaplasiosKaminon.greekname
ltx/en_us_dedes/me.m08.d18:meMA.Ode8C11.incipit	…
ltx/en_us_dedes/me.m08.d18:meMA.Ode8C11.melody	@ltx/en_us_dedes/he.h.m8:heHE.EptaplasiosKaminon.name
ltx/en_us_dedes/me.m08.d18:meMA.Ode8C11.mode	@ltx/en_us_dedes/miscellanea:misc.Mode8
ltx/en_us_dedes/me.m08.d18:meMA.Ode8C11.ode	@ltx/en_us_dedes/miscellanea:misc.Ode8
ltx/en_us_dedes/me.m08.d18:meMA.Ode8C11.text	
ltx/en_us_dedes/me.m08.d18:meMA.Ode8C12.incipit	…
ltx/en_us_dedes/me.m08.d18:meMA.Ode8C12.melody	@ltx/en_us_dedes/he.h.m8:heHE.EptaplasiosKaminon.name
ltx/en_us_dedes/me.m08.d18:meMA.Ode8C12.mode	@ltx/en_us_dedes/miscellanea:misc.Mode8
ltx/en_us_dedes/me.m08.d18:meMA.Ode8C12.ode	@ltx/en_us_dedes/miscellanea:misc.Ode8
ltx/en_us_dedes/me.m08.d18:meMA.Ode8C12.text	
ltx/en_us_dedes/me.m08.d18:meMA.Ode8C13.incipit	…
ltx/en_us_dedes/me.m08.d18:meMA.Ode8C13.melody	@ltx/en_us_dedes/he.h.m8:heHE.EptaplasiosKaminon.name
ltx/en_us_dedes/me.m08.d18:meMA.Ode8C13.mode	@ltx/en_us_dedes/miscellanea:misc.Mode8
ltx/en_us_dedes/me.m08.d18:meMA.Ode8C13.ode	@ltx/en_us_dedes/miscellanea:misc.Ode8
ltx/en_us_dedes/me.m08.d18:meMA.Ode8C13.text	
ltx/en_us_dedes/me.m08.d18:meMA.Ode8C1T.incipit	…
ltx/en_us_dedes/me.m08.d18:meMA.Ode8C1T.melody	@ltx/en_us_dedes/he.h.m8:heHE.EptaplasiosKaminon.name
ltx/en_us_dedes/me.m08.d18:meMA.Ode8C1T.mode	@ltx/en_us_dedes/miscellanea:misc.Mode8
ltx/en_us_dedes/me.m08.d18:meMA.Ode8C1T.ode	@ltx/en_us_dedes/miscellanea:misc.Ode8
ltx/en_us_dedes/me.m08.d18:meMA.Ode8C1T.text	
ltx/en_us_dedes/me.m08.d18:meMA.Ode8H.greekmelody	@ltx/en_us_dedes/he.h.m8:heHE.EptaplasiosKaminon.greekname
ltx/en_us_dedes/me.m08.d18:meMA.Ode8H.incipit	@ltx/en_us_dedes/he.h.m8:heHE.EptaplasiosKaminon.incipit
ltx/en_us_dedes/me.m08.d18:meMA.Ode8H.melody	@ltx/en_us_dedes/he.h.m8:heHE.EptaplasiosKaminon.melody
ltx/en_us_dedes/me.m08.d18:meMA.Ode8H.mode	@ltx/en_us_dedes/miscellanea:misc.Mode8
ltx/en_us_dedes/me.m08.d18:meMA.Ode8H.ode	@ltx/en_us_dedes/miscellanea:misc.Ode8
ltx/en_us_dedes/me.m08.d18:meMA.Ode8H.text	@ltx/en_us_dedes/he.h.m8:heHE.EptaplasiosKaminon.text
ltx/en_us_dedes/me.m08.d18:meMA.Ode9C11.greekmelody	@ltx/en_us_dedes/he.h.m8:heHE.ExestiEpiTouto.greekname
ltx/en_us_dedes/me.m08.d18:meMA.Ode9C11.incipit	…
ltx/en_us_dedes/me.m08.d18:meMA.Ode9C11.melody	@ltx/en_us_dedes/he.h.m8:heHE.ExestiEpiTouto.name
ltx/en_us_dedes/me.m08.d18:meMA.Ode9C11.mode	@ltx/en_us_dedes/miscellanea:misc.Mode8
ltx/en_us_dedes/me.m08.d18:meMA.Ode9C11.ode	@ltx/en_us_dedes/miscellanea:misc.Ode9
ltx/en_us_dedes/me.m08.d18:meMA.Ode9C11.text	
ltx/en_us_dedes/me.m08.d18:meMA.Ode9C12.incipit	…
ltx/en_us_dedes/me.m08.d18:meMA.Ode9C12.melody	@ltx/en_us_dedes/he.h.m8:heHE.ExestiEpiTouto.name
ltx/en_us_dedes/me.m08.d18:meMA.Ode9C12.mode	@ltx/en_us_dedes/miscellanea:misc.Mode8
ltx/en_us_dedes/me.m08.d18:meMA.Ode9C12.ode	@ltx/en_us_dedes/miscellanea:misc.Ode9
ltx/en_us_dedes/me.m08.d18:meMA.Ode9C12.text	
ltx/en_us_dedes/me.m08.d18:meMA.Ode9C13.incipit	…
ltx/en_us_dedes/me.m08.d18:meMA.Ode9C13.melody	@ltx/en_us_dedes/he.h.m8:heHE.ExestiEpiTouto.name
ltx/en_us_dedes/me.m08.d18:meMA.Ode9C13.mode	@ltx/en_us_dedes/miscellanea:misc.Mode8
ltx/en_us_dedes/me.m08.d18:meMA.Ode9C13.ode	@ltx/en_us_dedes/miscellanea:misc.Ode9
ltx/en_us_dedes/me.m08.d18:meMA.Ode9C13.text	
ltx/en_us_dedes/me.m08.d18:meMA.Ode9C14.incipit	…
ltx/en_us_dedes/me.m08.d18:meMA.Ode9C14.melody	@ltx/en_us_dedes/he.h.m8:heHE.ExestiEpiTouto.name
ltx/en_us_dedes/me.m08.d18:meMA.Ode9C14.mode	@ltx/en_us_dedes/miscellanea:misc.Mode8
ltx/en_us_dedes/me.m08.d18:meMA.Ode9C14.ode	@ltx/en_us_dedes/miscellanea:misc.Ode9
ltx/en_us_dedes/me.m08.d18:meMA.Ode9C14.text	
ltx/en_us_dedes/me.m08.d18:meMA.Ode9C1T.incipit	…
ltx/en_us_dedes/me.m08.d18:meMA.Ode9C1T.melody	@ltx/en_us_dedes/he.h.m8:heHE.ExestiEpiTouto.name
ltx/en_us_dedes/me.m08.d18:meMA.Ode9C1T.mode	@ltx/en_us_dedes/miscellanea:misc.Mode8
ltx/en_us_dedes/me.m08.d18:meMA.Ode9C1T.ode	@ltx/en_us_dedes/miscellanea:misc.Ode9
ltx/en_us_dedes/me.m08.d18:meMA.Ode9C1T.text	
ltx/en_us_dedes/me.m08.d18:meMA.Ode9H.greekmelody	@ltx/en_us_dedes/he.h.m8:heHE.ExestiEpiTouto.greekname
ltx/en_us_dedes/me.m08.d18:meMA.Ode9H.incipit	@ltx/en_us_dedes/he.h.m8:heHE.ExestiEpiTouto.incipit
ltx/en_us_dedes/me.m08.d18:meMA.Ode9H.melody	@ltx/en_us_dedes/he.h.m8:heHE.ExestiEpiTouto.melody
ltx/en_us_dedes/me.m08.d18:meMA.Ode9H.mode	@ltx/en_us_dedes/miscellanea:misc.Mode8
ltx/en_us_dedes/me.m08.d18:meMA.Ode9H.ode	@ltx/en_us_dedes/miscellanea:misc.Ode9
ltx/en_us_dedes/me.m08.d18:meMA.Ode9H.text	@ltx/en_us_dedes/he.h.m8:heHE.ExestiEpiTouto.text
ltx/en_us_dedes/me.m08.d18:meVE.Apolytikion1ger.greekmelody	@ltx/en_us_dedes/he.a.m5:heAU.TonSynanarchonLogon.greekname
ltx/en_us_dedes/me.m08.d18:meVE.Apolytikion1ger.incipit	…
ltx/en_us_dedes/me.m08.d18:meVE.Apolytikion1ger.melody	@ltx/en_us_dedes/he.a.m5:heAU.TonSynanarchonLogon.name
ltx/en_us_dedes/me.m08.d18:meVE.Apolytikion1ger.mode	@ltx/en_us_dedes/miscellanea:misc.Mode5
ltx/en_us_dedes/me.m08.d18:meVE.Apolytikion1ger.poet	@ltx/en_us_dedes/poets:po.Gerasimou
ltx/en_us_dedes/me.m08.d18:meVE.Apolytikion1ger.text	
ltx/en_us_dedes/me.m08.d18:meVE.Apolytikion2ger.greekmelody	@ltx/en_us_dedes/he.a.m1:heAU.TisErimouPolitis.greekname
ltx/en_us_dedes/me.m08.d18:meVE.Apolytikion2ger.incipit	…
ltx/en_us_dedes/me.m08.d18:meVE.Apolytikion2ger.melody	@ltx/en_us_dedes/he.a.m1:heAU.TisErimouPolitis.name
ltx/en_us_dedes/me.m08.d18:meVE.Apolytikion2ger.mode	@ltx/en_us_dedes/miscellanea:misc.Mode1
ltx/en_us_dedes/me.m08.d18:meVE.Apolytikion2ger.poet	@ltx/en_us_dedes/poets:po.Gerasimou
ltx/en_us_dedes/me.m08.d18:meVE.Apolytikion2ger.text	
ltx/en_us_dedes/me.m08.d18:meVE.Apolytikion3ger.greekmelody	@ltx/en_us_dedes/he.a.m4:heAU.TachyProkatalave.greekname
ltx/en_us_dedes/me.m08.d18:meVE.Apolytikion3ger.incipit	…
ltx/en_us_dedes/me.m08.d18:meVE.Apolytikion3ger.melody	@ltx/en_us_dedes/he.a.m4:heAU.TachyProkatalave.name
ltx/en_us_dedes/me.m08.d18:meVE.Apolytikion3ger.mode	@ltx/en_us_dedes/miscellanea:misc.Mode4
ltx/en_us_dedes/me.m08.d18:meVE.Apolytikion3ger.poet	@ltx/en_us_dedes/poets:po.Gerasimou
ltx/en_us_dedes/me.m08.d18:meVE.Apolytikion3ger.text	
ltx/en_us_dedes/me.m08.d18:meVE.AposGlory.incipit	@ltx/en_us_dedes/me.m08.d15:meVE.Aposticha3.incipit
ltx/en_us_dedes/me.m08.d18:meVE.AposGlory.melody	
ltx/en_us_dedes/me.m08.d18:meVE.AposGlory.mode	@ltx/en_us_dedes/miscellanea:misc.Mode4
ltx/en_us_dedes/me.m08.d18:meVE.AposGlory.text	@ltx/en_us_dedes/me.m08.d15:meVE.Aposticha3.text
ltx/en_us_dedes/me.m08.d18:meVE.Aposticha1.greekmelody	@ltx/en_us_dedes/he.a.m2:heAU.OikosTouEfratha.greekname
ltx/en_us_dedes/me.m08.d18:meVE.Aposticha1.incipit	Open, O pearly gates *…
ltx/en_us_dedes/me.m08.d18:meVE.Aposticha1.melody	@ltx/en_us_dedes/he.a.m2:heAU.OikosTouEfratha.name
ltx/en_us_dedes/me.m08.d18:meVE.Aposticha1.mode	@ltx/en_us_dedes/miscellanea:misc.Mode2
ltx/en_us_dedes/me.m08.d18:meVE.Aposticha1.text	Open, O pearly gates * of heaven; for the Mother * of the Most High is coming. * The pure and holy Virgin has died and is arriving now.
ltx/en_us_dedes/me.m08.d18:meVE.Aposticha2.incipit	@ltx/en_us_dedes/me.m08.d15:meSV.Aposticha3.incipit
ltx/en_us_dedes/me.m08.d18:meVE.Aposticha2.melody	@ltx/en_us_dedes/he.a.m2:heAU.OikosTouEfratha.name
ltx/en_us_dedes/me.m08.d18:meVE.Aposticha2.mode	@ltx/en_us_dedes/miscellanea:misc.Mode2
ltx/en_us_dedes/me.m08.d18:meVE.Aposticha2.text	@ltx/en_us_dedes/me.m08.d15:meSV.Aposticha3.text
ltx/en_us_dedes/me.m08.d18:meVE.Aposticha3.incipit	Lead the singing, O hosts…
ltx/en_us_dedes/me.m08.d18:meVE.Aposticha3.melody	@ltx/en_us_dedes/he.a.m2:heAU.OikosTouEfratha.name
ltx/en_us_dedes/me.m08.d18:meVE.Aposticha3.mode	@ltx/en_us_dedes/miscellanea:misc.Mode2
ltx/en_us_dedes/me.m08.d18:meVE.Aposticha3.text	Lead the singing, O hosts * of heaven, with the Mystics * of Christ, for they have come now * from everywhere to bury the only Mother of our God.
ltx/en_us_dedes/me.m08.d18:meVE.SticGlory.incipit	@ltx/en_us_dedes/me.m08.d15:meVE.Aposticha1.incipit
ltx/en_us_dedes/me.m08.d18:meVE.SticGlory.melody	
ltx/en_us_dedes/me.m08.d18:meVE.SticGlory.mode	@ltx/en_us_dedes/miscellanea:misc.Mode4
ltx/en_us_dedes/me.m08.d18:meVE.SticGlory.text	@ltx/en_us_dedes/me.m08.d15:meVE.Aposticha1.text
ltx/en_us_dedes/me.m08.d18:meVE.Stichera01.greekmelody	@ltx/en_us_dedes/he.a.m4:heAU.EdokasSimeiosin.greekname
ltx/en_us_dedes/me.m08.d18:meVE.Stichera01.incipit	…
ltx/en_us_dedes/me.m08.d18:meVE.Stichera01.melody	@ltx/en_us_dedes/he.a.m4:heAU.EdokasSimeiosin.name
ltx/en_us_dedes/me.m08.d18:meVE.Stichera01.mode	@ltx/en_us_dedes/miscellanea:misc.Mode4
ltx/en_us_dedes/me.m08.d18:meVE.Stichera01.text	
ltx/en_us_dedes/me.m08.d18:meVE.Stichera02.incipit	…
ltx/en_us_dedes/me.m08.d18:meVE.Stichera02.melody	@ltx/en_us_dedes/he.a.m4:heAU.EdokasSimeiosin.name
ltx/en_us_dedes/me.m08.d18:meVE.Stichera02.mode	@ltx/en_us_dedes/miscellanea:misc.Mode4
ltx/en_us_dedes/me.m08.d18:meVE.Stichera02.text	
ltx/en_us_dedes/me.m08.d18:meVE.Stichera03.incipit	…
ltx/en_us_dedes/me.m08.d18:meVE.Stichera03.melody	@ltx/en_us_dedes/he.a.m4:heAU.EdokasSimeiosin.name
ltx/en_us_dedes/me.m08.d18:meVE.Stichera03.mode	@ltx/en_us_dedes/miscellanea:misc.Mode4
ltx/en_us_dedes/me.m08.d18:meVE.Stichera03.text	
ltx/en_us_dedes/me.m08.d18:meVE.Stichera04.greekmelody	@ltx/en_us_dedes/he.a.m4:heAU.EdokasSimeiosin.greekname
ltx/en_us_dedes/me.m08.d18:meVE.Stichera04.incipit	…
ltx/en_us_dedes/me.m08.d18:meVE.Stichera04.melody	@ltx/en_us_dedes/he.a.m4:heAU.EdokasSimeiosin.name
ltx/en_us_dedes/me.m08.d18:meVE.Stichera04.mode	@ltx/en_us_dedes/miscellanea:misc.Mode4
ltx/en_us_dedes/me.m08.d18:meVE.Stichera04.text	
ltx/en_us_dedes/me.m08.d18:meVE.Stichera05.incipit	…
ltx/en_us_dedes/me.m08.d18:meVE.Stichera05.melody	@ltx/en_us_dedes/he.a.m4:heAU.EdokasSimeiosin.name
ltx/en_us_dedes/me.m08.d18:meVE.Stichera05.mode	@ltx/en_us_dedes/miscellanea:misc.Mode4
ltx/en_us_dedes/me.m08.d18:meVE.Stichera05.text	
ltx/en_us_dedes/me.m08.d18:meVE.Stichera06.incipit	…
ltx/en_us_dedes/me.m08.d18:meVE.Stichera06.melody	@ltx/en_us_dedes/he.a.m4:heAU.EdokasSimeiosin.name
ltx/en_us_dedes/me.m08.d18:meVE.Stichera06.mode	@ltx/en_us_dedes/miscellanea:misc.Mode4
ltx/en_us_dedes/me.m08.d18:meVE.Stichera06.text	
