ltx/en_us_dedes/pe.d120:peDA.commemoration.full	Sunday of Holy Pentecost
ltx/en_us_dedes/pe.d120:peDA.commemoration.name	Holy Trinity
ltx/en_us_dedes/pe.d120:peDA.commemoration.short	Pentecost Sunday
ltx/en_us_dedes/pe.d120:peDA.commemoration.title	For Pentecost.
ltx/en_us_dedes/pe.d120:peDA.dismissal	@ltx/en_us_dedes/dismissals:dis00.pentecost
ltx/en_us_dedes/pe.d120:peDA.insert1	
ltx/en_us_dedes/pe.d120:peDA.insert2	
ltx/en_us_dedes/pe.d120:peDA.note	
ltx/en_us_dedes/pe.d120:peHO.commemorations	
ltx/en_us_dedes/pe.d120:peHO.daytitle	
ltx/en_us_dedes/pe.d120:peHO.description1	
ltx/en_us_dedes/pe.d120:peHO.description2	
ltx/en_us_dedes/pe.d120:peHO.note1	
ltx/en_us_dedes/pe.d120:peHO.note2	
ltx/en_us_dedes/pe.d120:peLI.AfterCommunion.incipit	@ltx/en_us_dedes/pe.d120:peVE.Apolytikion1.incipit
ltx/en_us_dedes/pe.d120:peLI.AfterCommunion.mode	@ltx/en_us_dedes/pe.d120:peVE.Apolytikion1.mode
ltx/en_us_dedes/pe.d120:peLI.AfterCommunion.text	@ltx/en_us_dedes/pe.d120:peVE.Apolytikion1.text
ltx/en_us_dedes/pe.d120:peLI.Kontakion1.incipit	@ltx/en_us_dedes/pe.d120:peMA.Kontakion1.incipit
ltx/en_us_dedes/pe.d120:peLI.Kontakion1.melody	@ltx/en_us_dedes/pe.d120:peMA.Kontakion1.melody
ltx/en_us_dedes/pe.d120:peLI.Kontakion1.mode	@ltx/en_us_dedes/pe.d120:peMA.Kontakion1.mode
ltx/en_us_dedes/pe.d120:peLI.Kontakion1.text	@ltx/en_us_dedes/pe.d120:peMA.Kontakion1.text
ltx/en_us_dedes/pe.d120:peLI.MM.Antiphon2.text	@ltx/en_us_dedes/properties:media.key
ltx/en_us_dedes/pe.d120:peLI.MM.CommunionHymn.text	@ltx/en_us_dedes/properties:media.key
ltx/en_us_dedes/pe.d120:peLI.MM.EntranceHymn.text	@ltx/en_us_dedes/properties:media.key
ltx/en_us_dedes/pe.d120:peLI.MM.EntranceHymnAF.text	@ltx/en_us_dedes/properties:media.key
ltx/en_us_dedes/pe.d120:peLI.Megalynarion.text	
ltx/en_us_dedes/pe.d120:peLI.TheotokosHymn.incipit	@ltx/en_us_dedes/pe.d120:peMA.Ode9C1H.incipit
ltx/en_us_dedes/pe.d120:peLI.TheotokosHymn.mode	@ltx/en_us_dedes/pe.d120:peMA.Ode9C1H.mode
ltx/en_us_dedes/pe.d120:peLI.TheotokosHymn.text	@ltx/en_us_dedes/pe.d120:peMA.Ode9C1H.text
ltx/en_us_dedes/pe.d120:peMA.C1.poet	@ltx/en_us_dedes/poets:po.KosmaMonachou
ltx/en_us_dedes/pe.d120:peMA.C1.title	@ltx/en_us_dedes/titles:ti.Canon1Feast
ltx/en_us_dedes/pe.d120:peMA.C1.verse	@ltx/en_us_dedes/prayers:pr.verse_God.text
ltx/en_us_dedes/pe.d120:peMA.C2.acrostic.line1.text	
ltx/en_us_dedes/pe.d120:peMA.C2.acrostic.line2.text	
ltx/en_us_dedes/pe.d120:peMA.C2.acrostic.line3.text	
ltx/en_us_dedes/pe.d120:peMA.C2.acrostic.line4.text	
ltx/en_us_dedes/pe.d120:peMA.C2.poet	@ltx/en_us_dedes/poets:po.KyriouIoannouArkla
ltx/en_us_dedes/pe.d120:peMA.C2.title	@ltx/en_us_dedes/titles:ti.Canon2Feast
ltx/en_us_dedes/pe.d120:peMA.C2.verse	@ltx/en_us_dedes/prayers:pr.verse_God.text
ltx/en_us_dedes/pe.d120:peMA.Exaposteilarion1.greekmelody	@ltx/en_us_dedes/he.a.m3:heAU.OOuranonToisAstrois.greekname
ltx/en_us_dedes/pe.d120:peMA.Exaposteilarion1.incipit	O all-holy Spirit * who…
ltx/en_us_dedes/pe.d120:peMA.Exaposteilarion1.melody	@ltx/en_us_dedes/he.a.m3:heAU.OOuranonToisAstrois.name
ltx/en_us_dedes/pe.d120:peMA.Exaposteilarion1.mode	@ltx/en_us_dedes/miscellanea:misc.Mode3
ltx/en_us_dedes/pe.d120:peMA.Exaposteilarion1.text	O all-holy Spirit * who from the Father issues forth, * and through the Son was indwelling * in the unlettered Disciples, * sanctify all who acknowledge * You to be God, and save us.
ltx/en_us_dedes/pe.d120:peMA.Exaposteilarion2.greekmelody	@ltx/en_us_dedes/he.a.m3:heAU.OOuranonToisAstrois.greekname
ltx/en_us_dedes/pe.d120:peMA.Exaposteilarion2.incipit	Light is the Father, light…
ltx/en_us_dedes/pe.d120:peMA.Exaposteilarion2.melody	@ltx/en_us_dedes/he.a.m3:heAU.OOuranonToisAstrois.name
ltx/en_us_dedes/pe.d120:peMA.Exaposteilarion2.mode	@ltx/en_us_dedes/miscellanea:misc.Mode3
ltx/en_us_dedes/pe.d120:peMA.Exaposteilarion2.text	Light is the Father, light the Logos; * light is the Holy Spirit, * which was sent to the Apostles * in the form of fiery tongues, * and through which the entire world is guided by the light * to worship the Holy Trinity.
ltx/en_us_dedes/pe.d120:peMA.Kathisma11.greekmelody	@ltx/en_us_dedes/he.a.m4:heAU.KateplagiIosif.greekname
ltx/en_us_dedes/pe.d120:peMA.Kathisma11.incipit	Let us celebrate with joy…
ltx/en_us_dedes/pe.d120:peMA.Kathisma11.melody	@ltx/en_us_dedes/he.a.m4:heAU.KateplagiIosif.name
ltx/en_us_dedes/pe.d120:peMA.Kathisma11.mode	@ltx/en_us_dedes/miscellanea:misc.Mode4
ltx/en_us_dedes/pe.d120:peMA.Kathisma11.text	Let us celebrate with joy this final post-festal feast, * O believers; for it is the feast of Pentecost today, * and the fulfillment of the promise and the appointed time. * For on this day the fire of the Paraclete * descended to the earth immediately, * as in the form of tongues, and illumined the Disciples * and made them initiates of heaven. * The holy light of the Holy Spirit * has appeared and illumined the world.
ltx/en_us_dedes/pe.d120:peMA.Kathisma21.greekmelody	@ltx/en_us_dedes/he.a.m4:heAU.KateplagiIosif.greekname
ltx/en_us_dedes/pe.d120:peMA.Kathisma21.incipit	When the well-spring of the…
ltx/en_us_dedes/pe.d120:peMA.Kathisma21.melody	@ltx/en_us_dedes/he.a.m4:heAU.KateplagiIosif.name
ltx/en_us_dedes/pe.d120:peMA.Kathisma21.mode	@ltx/en_us_dedes/miscellanea:misc.Mode4
ltx/en_us_dedes/pe.d120:peMA.Kathisma21.text	When the well-spring of the grace of the divine Spirit came * down to those upon the earth and into fire-bearing streams * parted noetically, it refreshed the Apostles * and led them to the light. The fire became for them * a dewy cloud and rainy flame illumining them. * And we in turn through them received divine grace * by means of fire and water. * The holy light of the Holy Spirit * has appeared and illumined the world.
ltx/en_us_dedes/pe.d120:peMA.Kathisma31.greekmelody	@ltx/en_us_dedes/he.a.m8:heAU.ToProstachthen.greekname
ltx/en_us_dedes/pe.d120:peMA.Kathisma31.incipit	After Your rising from the…
ltx/en_us_dedes/pe.d120:peMA.Kathisma31.melody	@ltx/en_us_dedes/he.a.m8:heAU.ToProstachthen.name
ltx/en_us_dedes/pe.d120:peMA.Kathisma31.mode	@ltx/en_us_dedes/miscellanea:misc.Mode8
ltx/en_us_dedes/pe.d120:peMA.Kathisma31.text	After Your rising from the sepulcher, O Savior, * and Your divine Ascension to the heights of heaven, * You sent down on Your Disciples Your glory, O Good One, * renewing an upright Spirit in them, O Christ. * And therefore those men who saw God proclaimed to all * Your sayings and Your economy, as if melodious guitars * that mystically are played with the pick * of the Spirit, O merciful Lord.
ltx/en_us_dedes/pe.d120:peMA.Kontakion1.incipit	When the Most High God…
ltx/en_us_dedes/pe.d120:peMA.Kontakion1.melody	
ltx/en_us_dedes/pe.d120:peMA.Kontakion1.mode	@ltx/en_us_dedes/miscellanea:misc.Mode8
ltx/en_us_dedes/pe.d120:peMA.Kontakion1.text	When the Most High God came down and confused the tongues, * He divided the nations. * When He distributed the tongues of fire, * He called all to unity. * And with one voice we glorify the all-holy Spirit.
ltx/en_us_dedes/pe.d120:peMA.Lauds1.incipit	Today, all the nations in…
ltx/en_us_dedes/pe.d120:peMA.Lauds1.melody	
ltx/en_us_dedes/pe.d120:peMA.Lauds1.mode	@ltx/en_us_dedes/miscellanea:misc.Mode4
ltx/en_us_dedes/pe.d120:peMA.Lauds1.text	Today, all the nations in the city of David saw paradoxical things, when the Holy Spirit descended in fiery tongues, according to the utterance of Luke the theologian. For he said, when the Disciples of Christ were gathered together, a sound came like the rush of a mighty wind, and it filled all the house where they were sitting. And they all began to speak with strange words, strange dogmas, strange teachings of the Holy Trinity.
ltx/en_us_dedes/pe.d120:peMA.Lauds2.incipit	The Holy Spirit forever was…
ltx/en_us_dedes/pe.d120:peMA.Lauds2.melody	
ltx/en_us_dedes/pe.d120:peMA.Lauds2.mode	@ltx/en_us_dedes/miscellanea:misc.Mode4
ltx/en_us_dedes/pe.d120:peMA.Lauds2.text	The Holy Spirit forever was, and is and will be, never beginning, never ending, but forever ranked and numbered with the Father and the Son. He is life and life-giving, light and giver of light; goodness itself and the source of goodness; through whom the Father is known and the Son is glorified, and by all is known the one power, one order, one worship of the Holy Trinity.
ltx/en_us_dedes/pe.d120:peMA.Lauds3.incipit	The Holy Spirit is light…
ltx/en_us_dedes/pe.d120:peMA.Lauds3.melody	
ltx/en_us_dedes/pe.d120:peMA.Lauds3.mode	@ltx/en_us_dedes/miscellanea:misc.Mode4
ltx/en_us_dedes/pe.d120:peMA.Lauds3.text	The Holy Spirit is light and life, and a living noetic fount. Spirit of wisdom, Spirit of understanding; good, upright, noetic, ruling, purging offenses; God and deifying; He is fire issuing from fire, uttering, inciting, distributing the gifts of grace. Through Him the Prophets and the Apostles of God and the Martyrs all were crowned. Strange to hear, strange to see, fire distributed for the apportioning of gifts.
ltx/en_us_dedes/pe.d120:peMA.LaudsGlory.incipit	@ltx/en_us_dedes/pe.d120:peVE.Aposticha3.incipit
ltx/en_us_dedes/pe.d120:peMA.LaudsGlory.melody	@ltx/en_us_dedes/miscellanea:misc.Idiomelon
ltx/en_us_dedes/pe.d120:peMA.LaudsGlory.mode	@ltx/en_us_dedes/miscellanea:misc.Mode6
ltx/en_us_dedes/pe.d120:peMA.LaudsGlory.text	@ltx/en_us_dedes/pe.d120:peVE.Aposticha3.text
ltx/en_us_dedes/pe.d120:peMA.MM.Lauds123as123.text	@ltx/en_us_dedes/properties:media.key
ltx/en_us_dedes/pe.d120:peMA.MM.Prokeimenon.text	@ltx/en_us_dedes/properties:media.key
ltx/en_us_dedes/pe.d120:peMA.Ode1C11.greekmelody	@ltx/en_us_dedes/he.h.m7:heHE.PontoEkalypse.greekname
ltx/en_us_dedes/pe.d120:peMA.Ode1C11.incipit	…
ltx/en_us_dedes/pe.d120:peMA.Ode1C11.melody	@ltx/en_us_dedes/he.h.m7:heHE.PontoEkalypse.name
ltx/en_us_dedes/pe.d120:peMA.Ode1C11.mode	@ltx/en_us_dedes/miscellanea:misc.Mode7
ltx/en_us_dedes/pe.d120:peMA.Ode1C11.ode	@ltx/en_us_dedes/miscellanea:misc.Ode1
ltx/en_us_dedes/pe.d120:peMA.Ode1C11.text	
ltx/en_us_dedes/pe.d120:peMA.Ode1C12.incipit	…
ltx/en_us_dedes/pe.d120:peMA.Ode1C12.melody	@ltx/en_us_dedes/he.h.m7:heHE.PontoEkalypse.name
ltx/en_us_dedes/pe.d120:peMA.Ode1C12.mode	@ltx/en_us_dedes/miscellanea:misc.Mode7
ltx/en_us_dedes/pe.d120:peMA.Ode1C12.ode	@ltx/en_us_dedes/miscellanea:misc.Ode1
ltx/en_us_dedes/pe.d120:peMA.Ode1C12.text	
ltx/en_us_dedes/pe.d120:peMA.Ode1C1H.greekmelody	@ltx/en_us_dedes/he.h.m7:heHE.PontoEkalypse.greekname
ltx/en_us_dedes/pe.d120:peMA.Ode1C1H.incipit	@ltx/en_us_dedes/he.h.m7:heHE.PontoEkalypse.incipit
ltx/en_us_dedes/pe.d120:peMA.Ode1C1H.melody	@ltx/en_us_dedes/he.h.m7:heHE.PontoEkalypse.melody
ltx/en_us_dedes/pe.d120:peMA.Ode1C1H.mode	@ltx/en_us_dedes/miscellanea:misc.Mode7
ltx/en_us_dedes/pe.d120:peMA.Ode1C1H.ode	@ltx/en_us_dedes/miscellanea:misc.Ode1
ltx/en_us_dedes/pe.d120:peMA.Ode1C1H.text	@ltx/en_us_dedes/he.h.m7:heHE.PontoEkalypse.text
ltx/en_us_dedes/pe.d120:peMA.Ode1C21.greekmelody	@ltx/en_us_dedes/he.h.m4:heHE.TheioKalyftheis.greekname
ltx/en_us_dedes/pe.d120:peMA.Ode1C21.incipit	…
ltx/en_us_dedes/pe.d120:peMA.Ode1C21.melody	@ltx/en_us_dedes/he.h.m4:heHE.TheioKalyftheis.name
ltx/en_us_dedes/pe.d120:peMA.Ode1C21.mode	@ltx/en_us_dedes/miscellanea:misc.Mode4
ltx/en_us_dedes/pe.d120:peMA.Ode1C21.ode	@ltx/en_us_dedes/miscellanea:misc.Ode1
ltx/en_us_dedes/pe.d120:peMA.Ode1C21.text	
ltx/en_us_dedes/pe.d120:peMA.Ode1C211.text	
ltx/en_us_dedes/pe.d120:peMA.Ode1C212.text	
ltx/en_us_dedes/pe.d120:peMA.Ode1C213.text	
ltx/en_us_dedes/pe.d120:peMA.Ode1C214.text	
ltx/en_us_dedes/pe.d120:peMA.Ode1C215.text	
ltx/en_us_dedes/pe.d120:peMA.Ode1C22.incipit	…
ltx/en_us_dedes/pe.d120:peMA.Ode1C22.melody	@ltx/en_us_dedes/he.h.m4:heHE.TheioKalyftheis.name
ltx/en_us_dedes/pe.d120:peMA.Ode1C22.mode	@ltx/en_us_dedes/miscellanea:misc.Mode4
ltx/en_us_dedes/pe.d120:peMA.Ode1C22.ode	@ltx/en_us_dedes/miscellanea:misc.Ode1
ltx/en_us_dedes/pe.d120:peMA.Ode1C22.text	
ltx/en_us_dedes/pe.d120:peMA.Ode1C221.text	
ltx/en_us_dedes/pe.d120:peMA.Ode1C222.text	
ltx/en_us_dedes/pe.d120:peMA.Ode1C223.text	
ltx/en_us_dedes/pe.d120:peMA.Ode1C224.text	
ltx/en_us_dedes/pe.d120:peMA.Ode1C225.text	
ltx/en_us_dedes/pe.d120:peMA.Ode1C2H.greekmelody	@ltx/en_us_dedes/he.h.m4:heHE.TheioKalyftheis.greekname
ltx/en_us_dedes/pe.d120:peMA.Ode1C2H.incipit	@ltx/en_us_dedes/he.h.m4:heHE.TheioKalyftheis.incipit
ltx/en_us_dedes/pe.d120:peMA.Ode1C2H.melody	@ltx/en_us_dedes/he.h.m4:heHE.TheioKalyftheis.melody
ltx/en_us_dedes/pe.d120:peMA.Ode1C2H.mode	@ltx/en_us_dedes/miscellanea:misc.Mode4
ltx/en_us_dedes/pe.d120:peMA.Ode1C2H.ode	@ltx/en_us_dedes/miscellanea:misc.Ode1
ltx/en_us_dedes/pe.d120:peMA.Ode1C2H.text	@ltx/en_us_dedes/he.h.m4:heHE.TheioKalyftheis.text
ltx/en_us_dedes/pe.d120:peMA.Ode1C2H1.text	@ltx/en_us_dedes/he.h.m4:heHE.TheioKalyftheis1.text
ltx/en_us_dedes/pe.d120:peMA.Ode1C2H2.text	@ltx/en_us_dedes/he.h.m4:heHE.TheioKalyftheis2.text
ltx/en_us_dedes/pe.d120:peMA.Ode1C2H3.text	@ltx/en_us_dedes/he.h.m4:heHE.TheioKalyftheis3.text
ltx/en_us_dedes/pe.d120:peMA.Ode1C2H4.text	@ltx/en_us_dedes/he.h.m4:heHE.TheioKalyftheis4.text
ltx/en_us_dedes/pe.d120:peMA.Ode1C2H5.text	@ltx/en_us_dedes/he.h.m4:heHE.TheioKalyftheis5.text
ltx/en_us_dedes/pe.d120:peMA.Ode3C11.greekmelody	@ltx/en_us_dedes/he.h.m7:heHE.TinExYpsousDynamin.greekname
ltx/en_us_dedes/pe.d120:peMA.Ode3C11.incipit	…
ltx/en_us_dedes/pe.d120:peMA.Ode3C11.melody	@ltx/en_us_dedes/he.h.m7:heHE.TinExYpsousDynamin.name
ltx/en_us_dedes/pe.d120:peMA.Ode3C11.mode	@ltx/en_us_dedes/miscellanea:misc.Mode7
ltx/en_us_dedes/pe.d120:peMA.Ode3C11.ode	@ltx/en_us_dedes/miscellanea:misc.Ode3
ltx/en_us_dedes/pe.d120:peMA.Ode3C11.text	
ltx/en_us_dedes/pe.d120:peMA.Ode3C1H.greekmelody	@ltx/en_us_dedes/he.h.m7:heHE.TinExYpsousDynamin.greekname
ltx/en_us_dedes/pe.d120:peMA.Ode3C1H.incipit	@ltx/en_us_dedes/he.h.m7:heHE.TinExYpsousDynamin.incipit
ltx/en_us_dedes/pe.d120:peMA.Ode3C1H.melody	@ltx/en_us_dedes/he.h.m7:heHE.TinExYpsousDynamin.melody
ltx/en_us_dedes/pe.d120:peMA.Ode3C1H.mode	@ltx/en_us_dedes/miscellanea:misc.Mode7
ltx/en_us_dedes/pe.d120:peMA.Ode3C1H.ode	@ltx/en_us_dedes/miscellanea:misc.Ode3
ltx/en_us_dedes/pe.d120:peMA.Ode3C1H.text	@ltx/en_us_dedes/he.h.m7:heHE.TinExYpsousDynamin.text
ltx/en_us_dedes/pe.d120:peMA.Ode3C21.greekmelody	@ltx/en_us_dedes/he.h.m4:heHE.ErrixeGastros.greekname
ltx/en_us_dedes/pe.d120:peMA.Ode3C21.incipit	…
ltx/en_us_dedes/pe.d120:peMA.Ode3C21.melody	@ltx/en_us_dedes/he.h.m4:heHE.ErrixeGastros.name
ltx/en_us_dedes/pe.d120:peMA.Ode3C21.mode	@ltx/en_us_dedes/miscellanea:misc.Mode4
ltx/en_us_dedes/pe.d120:peMA.Ode3C21.ode	@ltx/en_us_dedes/miscellanea:misc.Ode3
ltx/en_us_dedes/pe.d120:peMA.Ode3C21.text	
ltx/en_us_dedes/pe.d120:peMA.Ode3C211.text	
ltx/en_us_dedes/pe.d120:peMA.Ode3C212.text	
ltx/en_us_dedes/pe.d120:peMA.Ode3C213.text	
ltx/en_us_dedes/pe.d120:peMA.Ode3C214.text	
ltx/en_us_dedes/pe.d120:peMA.Ode3C215.text	
ltx/en_us_dedes/pe.d120:peMA.Ode3C22.incipit	…
ltx/en_us_dedes/pe.d120:peMA.Ode3C22.melody	@ltx/en_us_dedes/he.h.m4:heHE.ErrixeGastros.name
ltx/en_us_dedes/pe.d120:peMA.Ode3C22.mode	@ltx/en_us_dedes/miscellanea:misc.Mode4
ltx/en_us_dedes/pe.d120:peMA.Ode3C22.ode	@ltx/en_us_dedes/miscellanea:misc.Ode3
ltx/en_us_dedes/pe.d120:peMA.Ode3C22.text	
ltx/en_us_dedes/pe.d120:peMA.Ode3C221.text	
ltx/en_us_dedes/pe.d120:peMA.Ode3C222.text	
ltx/en_us_dedes/pe.d120:peMA.Ode3C223.text	
ltx/en_us_dedes/pe.d120:peMA.Ode3C224.text	
ltx/en_us_dedes/pe.d120:peMA.Ode3C225.text	
ltx/en_us_dedes/pe.d120:peMA.Ode3C2H.greekmelody	@ltx/en_us_dedes/he.h.m4:heHE.ErrixeGastros.greekname
ltx/en_us_dedes/pe.d120:peMA.Ode3C2H.incipit	@ltx/en_us_dedes/he.h.m4:heHE.ErrixeGastros.incipit
ltx/en_us_dedes/pe.d120:peMA.Ode3C2H.melody	@ltx/en_us_dedes/he.h.m4:heHE.ErrixeGastros.melody
ltx/en_us_dedes/pe.d120:peMA.Ode3C2H.mode	@ltx/en_us_dedes/miscellanea:misc.Mode4
ltx/en_us_dedes/pe.d120:peMA.Ode3C2H.ode	@ltx/en_us_dedes/miscellanea:misc.Ode3
ltx/en_us_dedes/pe.d120:peMA.Ode3C2H.text	@ltx/en_us_dedes/he.h.m4:heHE.ErrixeGastros.text
ltx/en_us_dedes/pe.d120:peMA.Ode3C2H1.text	@ltx/en_us_dedes/he.h.m4:heHE.ErrixeGastros1.text
ltx/en_us_dedes/pe.d120:peMA.Ode3C2H2.text	@ltx/en_us_dedes/he.h.m4:heHE.ErrixeGastros2.text
ltx/en_us_dedes/pe.d120:peMA.Ode3C2H3.text	@ltx/en_us_dedes/he.h.m4:heHE.ErrixeGastros3.text
ltx/en_us_dedes/pe.d120:peMA.Ode3C2H4.text	@ltx/en_us_dedes/he.h.m4:heHE.ErrixeGastros4.text
ltx/en_us_dedes/pe.d120:peMA.Ode3C2H5.text	@ltx/en_us_dedes/he.h.m4:heHE.ErrixeGastros5.text
ltx/en_us_dedes/pe.d120:peMA.Ode3Kathisma1.greekmelody	@ltx/en_us_dedes/he.a.m8:heAU.ToProstachthen.greekname
ltx/en_us_dedes/pe.d120:peMA.Ode3Kathisma1.incipit	…
ltx/en_us_dedes/pe.d120:peMA.Ode3Kathisma1.melody	@ltx/en_us_dedes/he.a.m8:heAU.ToProstachthen.name
ltx/en_us_dedes/pe.d120:peMA.Ode3Kathisma1.mode	@ltx/en_us_dedes/miscellanea:misc.Mode8
ltx/en_us_dedes/pe.d120:peMA.Ode3Kathisma1.text	
ltx/en_us_dedes/pe.d120:peMA.Ode4C11.greekmelody	@ltx/en_us_dedes/he.h.m7:heHE.KatanoonOProfitis.greekname
ltx/en_us_dedes/pe.d120:peMA.Ode4C11.incipit	…
ltx/en_us_dedes/pe.d120:peMA.Ode4C11.melody	@ltx/en_us_dedes/he.h.m7:heHE.KatanoonOProfitis.name
ltx/en_us_dedes/pe.d120:peMA.Ode4C11.mode	@ltx/en_us_dedes/miscellanea:misc.Mode7
ltx/en_us_dedes/pe.d120:peMA.Ode4C11.ode	@ltx/en_us_dedes/miscellanea:misc.Ode4
ltx/en_us_dedes/pe.d120:peMA.Ode4C11.text	
ltx/en_us_dedes/pe.d120:peMA.Ode4C12.incipit	…
ltx/en_us_dedes/pe.d120:peMA.Ode4C12.melody	@ltx/en_us_dedes/he.h.m7:heHE.KatanoonOProfitis.name
ltx/en_us_dedes/pe.d120:peMA.Ode4C12.mode	@ltx/en_us_dedes/miscellanea:misc.Mode7
ltx/en_us_dedes/pe.d120:peMA.Ode4C12.ode	@ltx/en_us_dedes/miscellanea:misc.Ode4
ltx/en_us_dedes/pe.d120:peMA.Ode4C12.text	
ltx/en_us_dedes/pe.d120:peMA.Ode4C1H.greekmelody	@ltx/en_us_dedes/he.h.m7:heHE.KatanoonOProfitis.greekname
ltx/en_us_dedes/pe.d120:peMA.Ode4C1H.incipit	@ltx/en_us_dedes/he.h.m7:heHE.KatanoonOProfitis.incipit
ltx/en_us_dedes/pe.d120:peMA.Ode4C1H.melody	@ltx/en_us_dedes/he.h.m7:heHE.KatanoonOProfitis.melody
ltx/en_us_dedes/pe.d120:peMA.Ode4C1H.mode	@ltx/en_us_dedes/miscellanea:misc.Mode7
ltx/en_us_dedes/pe.d120:peMA.Ode4C1H.ode	@ltx/en_us_dedes/miscellanea:misc.Ode4
ltx/en_us_dedes/pe.d120:peMA.Ode4C1H.text	@ltx/en_us_dedes/he.h.m7:heHE.KatanoonOProfitis.text
ltx/en_us_dedes/pe.d120:peMA.Ode4C21.greekmelody	@ltx/en_us_dedes/he.h.m4:heHE.AnaxAnakton.greekname
ltx/en_us_dedes/pe.d120:peMA.Ode4C21.incipit	…
ltx/en_us_dedes/pe.d120:peMA.Ode4C21.melody	@ltx/en_us_dedes/he.h.m4:heHE.AnaxAnakton.name
ltx/en_us_dedes/pe.d120:peMA.Ode4C21.mode	@ltx/en_us_dedes/miscellanea:misc.Mode4
ltx/en_us_dedes/pe.d120:peMA.Ode4C21.ode	@ltx/en_us_dedes/miscellanea:misc.Ode4
ltx/en_us_dedes/pe.d120:peMA.Ode4C21.text	
ltx/en_us_dedes/pe.d120:peMA.Ode4C211.text	
ltx/en_us_dedes/pe.d120:peMA.Ode4C212.text	
ltx/en_us_dedes/pe.d120:peMA.Ode4C213.text	
ltx/en_us_dedes/pe.d120:peMA.Ode4C214.text	
ltx/en_us_dedes/pe.d120:peMA.Ode4C215.text	
ltx/en_us_dedes/pe.d120:peMA.Ode4C22.incipit	…
ltx/en_us_dedes/pe.d120:peMA.Ode4C22.melody	@ltx/en_us_dedes/he.h.m4:heHE.AnaxAnakton.name
ltx/en_us_dedes/pe.d120:peMA.Ode4C22.mode	@ltx/en_us_dedes/miscellanea:misc.Mode4
ltx/en_us_dedes/pe.d120:peMA.Ode4C22.ode	@ltx/en_us_dedes/miscellanea:misc.Ode4
ltx/en_us_dedes/pe.d120:peMA.Ode4C22.text	
ltx/en_us_dedes/pe.d120:peMA.Ode4C221.text	
ltx/en_us_dedes/pe.d120:peMA.Ode4C222.text	
ltx/en_us_dedes/pe.d120:peMA.Ode4C223.text	
ltx/en_us_dedes/pe.d120:peMA.Ode4C224.text	
ltx/en_us_dedes/pe.d120:peMA.Ode4C225.text	
ltx/en_us_dedes/pe.d120:peMA.Ode4C23.incipit	
ltx/en_us_dedes/pe.d120:peMA.Ode4C23.melody	@ltx/en_us_dedes/he.h.m4:heHE.AnaxAnakton.name
ltx/en_us_dedes/pe.d120:peMA.Ode4C23.mode	@ltx/en_us_dedes/miscellanea:misc.Mode4
ltx/en_us_dedes/pe.d120:peMA.Ode4C23.ode	@ltx/en_us_dedes/miscellanea:misc.Ode4
ltx/en_us_dedes/pe.d120:peMA.Ode4C23.text	
ltx/en_us_dedes/pe.d120:peMA.Ode4C231.text	
ltx/en_us_dedes/pe.d120:peMA.Ode4C232.text	
ltx/en_us_dedes/pe.d120:peMA.Ode4C233.text	
ltx/en_us_dedes/pe.d120:peMA.Ode4C234.text	
ltx/en_us_dedes/pe.d120:peMA.Ode4C235.text	
ltx/en_us_dedes/pe.d120:peMA.Ode4C2H.greekmelody	@ltx/en_us_dedes/he.h.m4:heHE.AnaxAnakton.greekname
ltx/en_us_dedes/pe.d120:peMA.Ode4C2H.incipit	@ltx/en_us_dedes/he.h.m4:heHE.AnaxAnakton.incipit
ltx/en_us_dedes/pe.d120:peMA.Ode4C2H.melody	@ltx/en_us_dedes/he.h.m4:heHE.AnaxAnakton.melody
ltx/en_us_dedes/pe.d120:peMA.Ode4C2H.mode	@ltx/en_us_dedes/miscellanea:misc.Mode4
ltx/en_us_dedes/pe.d120:peMA.Ode4C2H.ode	@ltx/en_us_dedes/miscellanea:misc.Ode4
ltx/en_us_dedes/pe.d120:peMA.Ode4C2H.text	@ltx/en_us_dedes/he.h.m4:heHE.AnaxAnakton.text
ltx/en_us_dedes/pe.d120:peMA.Ode4C2H1.text	@ltx/en_us_dedes/he.h.m4:heHE.AnaxAnakton1.text
ltx/en_us_dedes/pe.d120:peMA.Ode4C2H2.text	@ltx/en_us_dedes/he.h.m4:heHE.AnaxAnakton2.text
ltx/en_us_dedes/pe.d120:peMA.Ode4C2H3.text	@ltx/en_us_dedes/he.h.m4:heHE.AnaxAnakton3.text
ltx/en_us_dedes/pe.d120:peMA.Ode4C2H4.text	@ltx/en_us_dedes/he.h.m4:heHE.AnaxAnakton4.text
ltx/en_us_dedes/pe.d120:peMA.Ode4C2H5.text	@ltx/en_us_dedes/he.h.m4:heHE.AnaxAnakton5.text
ltx/en_us_dedes/pe.d120:peMA.Ode5C11.greekmelody	@ltx/en_us_dedes/he.h.m7:heHE.ToDiaTonFovonSou.greekname
ltx/en_us_dedes/pe.d120:peMA.Ode5C11.incipit	…
ltx/en_us_dedes/pe.d120:peMA.Ode5C11.melody	@ltx/en_us_dedes/he.h.m7:heHE.ToDiaTonFovonSou.name
ltx/en_us_dedes/pe.d120:peMA.Ode5C11.mode	@ltx/en_us_dedes/miscellanea:misc.Mode7
ltx/en_us_dedes/pe.d120:peMA.Ode5C11.ode	@ltx/en_us_dedes/miscellanea:misc.Ode5
ltx/en_us_dedes/pe.d120:peMA.Ode5C11.text	
ltx/en_us_dedes/pe.d120:peMA.Ode5C1H.greekmelody	@ltx/en_us_dedes/he.h.m7:heHE.ToDiaTonFovonSou.greekname
ltx/en_us_dedes/pe.d120:peMA.Ode5C1H.incipit	@ltx/en_us_dedes/he.h.m7:heHE.ToDiaTonFovonSou.incipit
ltx/en_us_dedes/pe.d120:peMA.Ode5C1H.melody	@ltx/en_us_dedes/he.h.m7:heHE.ToDiaTonFovonSou.melody
ltx/en_us_dedes/pe.d120:peMA.Ode5C1H.mode	@ltx/en_us_dedes/miscellanea:misc.Mode7
ltx/en_us_dedes/pe.d120:peMA.Ode5C1H.ode	@ltx/en_us_dedes/miscellanea:misc.Ode5
ltx/en_us_dedes/pe.d120:peMA.Ode5C1H.text	@ltx/en_us_dedes/he.h.m7:heHE.ToDiaTonFovonSou.text
ltx/en_us_dedes/pe.d120:peMA.Ode5C21.greekmelody	@ltx/en_us_dedes/he.h.m4:heHE.LytirionKatharsin.greekname
ltx/en_us_dedes/pe.d120:peMA.Ode5C21.incipit	…
ltx/en_us_dedes/pe.d120:peMA.Ode5C21.melody	@ltx/en_us_dedes/he.h.m4:heHE.LytirionKatharsin.name
ltx/en_us_dedes/pe.d120:peMA.Ode5C21.mode	@ltx/en_us_dedes/miscellanea:misc.Mode4
ltx/en_us_dedes/pe.d120:peMA.Ode5C21.ode	@ltx/en_us_dedes/miscellanea:misc.Ode5
ltx/en_us_dedes/pe.d120:peMA.Ode5C21.text	
ltx/en_us_dedes/pe.d120:peMA.Ode5C211.text	
ltx/en_us_dedes/pe.d120:peMA.Ode5C212.text	
ltx/en_us_dedes/pe.d120:peMA.Ode5C213.text	
ltx/en_us_dedes/pe.d120:peMA.Ode5C214.text	
ltx/en_us_dedes/pe.d120:peMA.Ode5C215.text	
ltx/en_us_dedes/pe.d120:peMA.Ode5C22.incipit	…
ltx/en_us_dedes/pe.d120:peMA.Ode5C22.melody	@ltx/en_us_dedes/he.h.m4:heHE.LytirionKatharsin.name
ltx/en_us_dedes/pe.d120:peMA.Ode5C22.mode	@ltx/en_us_dedes/miscellanea:misc.Mode4
ltx/en_us_dedes/pe.d120:peMA.Ode5C22.ode	@ltx/en_us_dedes/miscellanea:misc.Ode5
ltx/en_us_dedes/pe.d120:peMA.Ode5C22.text	
ltx/en_us_dedes/pe.d120:peMA.Ode5C221.text	
ltx/en_us_dedes/pe.d120:peMA.Ode5C222.text	
ltx/en_us_dedes/pe.d120:peMA.Ode5C223.text	
ltx/en_us_dedes/pe.d120:peMA.Ode5C224.text	
ltx/en_us_dedes/pe.d120:peMA.Ode5C225.text	
ltx/en_us_dedes/pe.d120:peMA.Ode5C2H.greekmelody	@ltx/en_us_dedes/he.h.m4:heHE.LytirionKatharsin.greekname
ltx/en_us_dedes/pe.d120:peMA.Ode5C2H.incipit	@ltx/en_us_dedes/he.h.m4:heHE.LytirionKatharsin.incipit
ltx/en_us_dedes/pe.d120:peMA.Ode5C2H.melody	@ltx/en_us_dedes/he.h.m4:heHE.LytirionKatharsin.melody
ltx/en_us_dedes/pe.d120:peMA.Ode5C2H.mode	@ltx/en_us_dedes/miscellanea:misc.Mode4
ltx/en_us_dedes/pe.d120:peMA.Ode5C2H.ode	@ltx/en_us_dedes/miscellanea:misc.Ode5
ltx/en_us_dedes/pe.d120:peMA.Ode5C2H.text	@ltx/en_us_dedes/he.h.m4:heHE.LytirionKatharsin.text
ltx/en_us_dedes/pe.d120:peMA.Ode5C2H1.text	@ltx/en_us_dedes/he.h.m4:heHE.LytirionKatharsin1.text
ltx/en_us_dedes/pe.d120:peMA.Ode5C2H2.text	@ltx/en_us_dedes/he.h.m4:heHE.LytirionKatharsin2.text
ltx/en_us_dedes/pe.d120:peMA.Ode5C2H3.text	@ltx/en_us_dedes/he.h.m4:heHE.LytirionKatharsin3.text
ltx/en_us_dedes/pe.d120:peMA.Ode5C2H4.text	@ltx/en_us_dedes/he.h.m4:heHE.LytirionKatharsin4.text
ltx/en_us_dedes/pe.d120:peMA.Ode5C2H5.text	@ltx/en_us_dedes/he.h.m4:heHE.LytirionKatharsin5.text
ltx/en_us_dedes/pe.d120:peMA.Ode6C11.greekmelody	@ltx/en_us_dedes/he.h.m7:heHE.NaftionToSalo.greekname
ltx/en_us_dedes/pe.d120:peMA.Ode6C11.incipit	…
ltx/en_us_dedes/pe.d120:peMA.Ode6C11.melody	@ltx/en_us_dedes/he.h.m7:heHE.NaftionToSalo.name
ltx/en_us_dedes/pe.d120:peMA.Ode6C11.mode	@ltx/en_us_dedes/miscellanea:misc.Mode7
ltx/en_us_dedes/pe.d120:peMA.Ode6C11.ode	@ltx/en_us_dedes/miscellanea:misc.Ode6
ltx/en_us_dedes/pe.d120:peMA.Ode6C11.text	
ltx/en_us_dedes/pe.d120:peMA.Ode6C1H.greekmelody	@ltx/en_us_dedes/he.h.m7:heHE.NaftionToSalo.greekname
ltx/en_us_dedes/pe.d120:peMA.Ode6C1H.incipit	@ltx/en_us_dedes/he.h.m7:heHE.NaftionToSalo.incipit
ltx/en_us_dedes/pe.d120:peMA.Ode6C1H.melody	@ltx/en_us_dedes/he.h.m7:heHE.NaftionToSalo.melody
ltx/en_us_dedes/pe.d120:peMA.Ode6C1H.mode	@ltx/en_us_dedes/miscellanea:misc.Mode7
ltx/en_us_dedes/pe.d120:peMA.Ode6C1H.ode	@ltx/en_us_dedes/miscellanea:misc.Ode6
ltx/en_us_dedes/pe.d120:peMA.Ode6C1H.text	@ltx/en_us_dedes/he.h.m7:heHE.NaftionToSalo.text
ltx/en_us_dedes/pe.d120:peMA.Ode6C21.greekmelody	@ltx/en_us_dedes/he.h.m4:heHE.IlasmosIminChriste.greekname
ltx/en_us_dedes/pe.d120:peMA.Ode6C21.incipit	…
ltx/en_us_dedes/pe.d120:peMA.Ode6C21.melody	@ltx/en_us_dedes/he.h.m4:heHE.IlasmosIminChriste.name
ltx/en_us_dedes/pe.d120:peMA.Ode6C21.mode	@ltx/en_us_dedes/miscellanea:misc.Mode4
ltx/en_us_dedes/pe.d120:peMA.Ode6C21.ode	@ltx/en_us_dedes/miscellanea:misc.Ode6
ltx/en_us_dedes/pe.d120:peMA.Ode6C21.text	
ltx/en_us_dedes/pe.d120:peMA.Ode6C211.text	
ltx/en_us_dedes/pe.d120:peMA.Ode6C212.text	
ltx/en_us_dedes/pe.d120:peMA.Ode6C213.text	
ltx/en_us_dedes/pe.d120:peMA.Ode6C214.text	
ltx/en_us_dedes/pe.d120:peMA.Ode6C215.text	
ltx/en_us_dedes/pe.d120:peMA.Ode6C22.incipit	…
ltx/en_us_dedes/pe.d120:peMA.Ode6C22.melody	@ltx/en_us_dedes/he.h.m4:heHE.IlasmosIminChriste.name
ltx/en_us_dedes/pe.d120:peMA.Ode6C22.mode	@ltx/en_us_dedes/miscellanea:misc.Mode4
ltx/en_us_dedes/pe.d120:peMA.Ode6C22.ode	@ltx/en_us_dedes/miscellanea:misc.Ode6
ltx/en_us_dedes/pe.d120:peMA.Ode6C22.text	
ltx/en_us_dedes/pe.d120:peMA.Ode6C221.text	
ltx/en_us_dedes/pe.d120:peMA.Ode6C222.text	
ltx/en_us_dedes/pe.d120:peMA.Ode6C223.text	
ltx/en_us_dedes/pe.d120:peMA.Ode6C224.text	
ltx/en_us_dedes/pe.d120:peMA.Ode6C225.text	
ltx/en_us_dedes/pe.d120:peMA.Ode6C2H.greekmelody	@ltx/en_us_dedes/he.h.m4:heHE.IlasmosIminChriste.greekname
ltx/en_us_dedes/pe.d120:peMA.Ode6C2H.incipit	@ltx/en_us_dedes/he.h.m4:heHE.IlasmosIminChriste.incipit
ltx/en_us_dedes/pe.d120:peMA.Ode6C2H.melody	@ltx/en_us_dedes/he.h.m4:heHE.IlasmosIminChriste.melody
ltx/en_us_dedes/pe.d120:peMA.Ode6C2H.mode	@ltx/en_us_dedes/miscellanea:misc.Mode4
ltx/en_us_dedes/pe.d120:peMA.Ode6C2H.ode	@ltx/en_us_dedes/miscellanea:misc.Ode6
ltx/en_us_dedes/pe.d120:peMA.Ode6C2H.text	@ltx/en_us_dedes/he.h.m4:heHE.IlasmosIminChriste.text
ltx/en_us_dedes/pe.d120:peMA.Ode6C2H1.text	@ltx/en_us_dedes/he.h.m4:heHE.IlasmosIminChriste1.text
ltx/en_us_dedes/pe.d120:peMA.Ode6C2H2.text	@ltx/en_us_dedes/he.h.m4:heHE.IlasmosIminChriste2.text
ltx/en_us_dedes/pe.d120:peMA.Ode6C2H3.text	@ltx/en_us_dedes/he.h.m4:heHE.IlasmosIminChriste3.text
ltx/en_us_dedes/pe.d120:peMA.Ode6C2H4.text	@ltx/en_us_dedes/he.h.m4:heHE.IlasmosIminChriste4.text
ltx/en_us_dedes/pe.d120:peMA.Ode6C2H5.text	@ltx/en_us_dedes/he.h.m4:heHE.IlasmosIminChriste5.text
ltx/en_us_dedes/pe.d120:peMA.Ode7C11.greekmelody	@ltx/en_us_dedes/he.h.m7:heHE.OiEnKaminoTouPyros.greekname
ltx/en_us_dedes/pe.d120:peMA.Ode7C11.incipit	…
ltx/en_us_dedes/pe.d120:peMA.Ode7C11.melody	@ltx/en_us_dedes/he.h.m7:heHE.OiEnKaminoTouPyros.name
ltx/en_us_dedes/pe.d120:peMA.Ode7C11.mode	@ltx/en_us_dedes/miscellanea:misc.Mode7
ltx/en_us_dedes/pe.d120:peMA.Ode7C11.ode	@ltx/en_us_dedes/miscellanea:misc.Ode7
ltx/en_us_dedes/pe.d120:peMA.Ode7C11.text	
ltx/en_us_dedes/pe.d120:peMA.Ode7C12.incipit	…
ltx/en_us_dedes/pe.d120:peMA.Ode7C12.melody	@ltx/en_us_dedes/he.h.m7:heHE.OiEnKaminoTouPyros.name
ltx/en_us_dedes/pe.d120:peMA.Ode7C12.mode	@ltx/en_us_dedes/miscellanea:misc.Mode7
ltx/en_us_dedes/pe.d120:peMA.Ode7C12.ode	@ltx/en_us_dedes/miscellanea:misc.Ode7
ltx/en_us_dedes/pe.d120:peMA.Ode7C12.text	
ltx/en_us_dedes/pe.d120:peMA.Ode7C1H.greekmelody	@ltx/en_us_dedes/he.h.m7:heHE.OiEnKaminoTouPyros.greekname
ltx/en_us_dedes/pe.d120:peMA.Ode7C1H.incipit	@ltx/en_us_dedes/he.h.m7:heHE.OiEnKaminoTouPyros.incipit
ltx/en_us_dedes/pe.d120:peMA.Ode7C1H.melody	@ltx/en_us_dedes/he.h.m7:heHE.OiEnKaminoTouPyros.melody
ltx/en_us_dedes/pe.d120:peMA.Ode7C1H.mode	@ltx/en_us_dedes/miscellanea:misc.Mode7
ltx/en_us_dedes/pe.d120:peMA.Ode7C1H.ode	@ltx/en_us_dedes/miscellanea:misc.Ode7
ltx/en_us_dedes/pe.d120:peMA.Ode7C1H.text	@ltx/en_us_dedes/he.h.m7:heHE.OiEnKaminoTouPyros.text
ltx/en_us_dedes/pe.d120:peMA.Ode7C21.greekmelody	@ltx/en_us_dedes/he.h.m4:heHE.SymfononEthroisen.greekname
ltx/en_us_dedes/pe.d120:peMA.Ode7C21.incipit	…
ltx/en_us_dedes/pe.d120:peMA.Ode7C21.melody	@ltx/en_us_dedes/he.h.m4:heHE.SymfononEthroisen.name
ltx/en_us_dedes/pe.d120:peMA.Ode7C21.mode	@ltx/en_us_dedes/miscellanea:misc.Mode4
ltx/en_us_dedes/pe.d120:peMA.Ode7C21.ode	@ltx/en_us_dedes/miscellanea:misc.Ode7
ltx/en_us_dedes/pe.d120:peMA.Ode7C21.text	
ltx/en_us_dedes/pe.d120:peMA.Ode7C211.text	
ltx/en_us_dedes/pe.d120:peMA.Ode7C212.text	
ltx/en_us_dedes/pe.d120:peMA.Ode7C213.text	
ltx/en_us_dedes/pe.d120:peMA.Ode7C214.text	
ltx/en_us_dedes/pe.d120:peMA.Ode7C215.text	
ltx/en_us_dedes/pe.d120:peMA.Ode7C22.incipit	…
ltx/en_us_dedes/pe.d120:peMA.Ode7C22.melody	@ltx/en_us_dedes/he.h.m4:heHE.SymfononEthroisen.name
ltx/en_us_dedes/pe.d120:peMA.Ode7C22.mode	@ltx/en_us_dedes/miscellanea:misc.Mode4
ltx/en_us_dedes/pe.d120:peMA.Ode7C22.ode	@ltx/en_us_dedes/miscellanea:misc.Ode7
ltx/en_us_dedes/pe.d120:peMA.Ode7C22.text	
ltx/en_us_dedes/pe.d120:peMA.Ode7C221.text	
ltx/en_us_dedes/pe.d120:peMA.Ode7C222.text	
ltx/en_us_dedes/pe.d120:peMA.Ode7C223.text	
ltx/en_us_dedes/pe.d120:peMA.Ode7C224.text	
ltx/en_us_dedes/pe.d120:peMA.Ode7C225.text	
ltx/en_us_dedes/pe.d120:peMA.Ode7C23.incipit	…
ltx/en_us_dedes/pe.d120:peMA.Ode7C23.melody	@ltx/en_us_dedes/he.h.m4:heHE.SymfononEthroisen.name
ltx/en_us_dedes/pe.d120:peMA.Ode7C23.mode	@ltx/en_us_dedes/miscellanea:misc.Mode4
ltx/en_us_dedes/pe.d120:peMA.Ode7C23.ode	@ltx/en_us_dedes/miscellanea:misc.Ode7
ltx/en_us_dedes/pe.d120:peMA.Ode7C23.text	
ltx/en_us_dedes/pe.d120:peMA.Ode7C231.text	
ltx/en_us_dedes/pe.d120:peMA.Ode7C232.text	
ltx/en_us_dedes/pe.d120:peMA.Ode7C233.text	
ltx/en_us_dedes/pe.d120:peMA.Ode7C234.text	
ltx/en_us_dedes/pe.d120:peMA.Ode7C235.text	
ltx/en_us_dedes/pe.d120:peMA.Ode7C2H.greekmelody	@ltx/en_us_dedes/he.h.m4:heHE.SymfononEthroisen.greekname
ltx/en_us_dedes/pe.d120:peMA.Ode7C2H.incipit	@ltx/en_us_dedes/he.h.m4:heHE.SymfononEthroisen.incipit
ltx/en_us_dedes/pe.d120:peMA.Ode7C2H.melody	@ltx/en_us_dedes/he.h.m4:heHE.SymfononEthroisen.melody
ltx/en_us_dedes/pe.d120:peMA.Ode7C2H.mode	@ltx/en_us_dedes/miscellanea:misc.Mode4
ltx/en_us_dedes/pe.d120:peMA.Ode7C2H.ode	@ltx/en_us_dedes/miscellanea:misc.Ode7
ltx/en_us_dedes/pe.d120:peMA.Ode7C2H.text	@ltx/en_us_dedes/he.h.m4:heHE.SymfononEthroisen.text
ltx/en_us_dedes/pe.d120:peMA.Ode7C2H1.text	@ltx/en_us_dedes/he.h.m4:heHE.SymfononEthroisen1.text
ltx/en_us_dedes/pe.d120:peMA.Ode7C2H2.text	@ltx/en_us_dedes/he.h.m4:heHE.SymfononEthroisen2.text
ltx/en_us_dedes/pe.d120:peMA.Ode7C2H3.text	@ltx/en_us_dedes/he.h.m4:heHE.SymfononEthroisen3.text
ltx/en_us_dedes/pe.d120:peMA.Ode7C2H4.text	@ltx/en_us_dedes/he.h.m4:heHE.SymfononEthroisen4.text
ltx/en_us_dedes/pe.d120:peMA.Ode7C2H5.text	@ltx/en_us_dedes/he.h.m4:heHE.SymfononEthroisen5.text
ltx/en_us_dedes/pe.d120:peMA.Ode8C11.greekmelody	@ltx/en_us_dedes/he.h.m7:heHE.AflektosPyri.greekname
ltx/en_us_dedes/pe.d120:peMA.Ode8C11.incipit	…
ltx/en_us_dedes/pe.d120:peMA.Ode8C11.melody	@ltx/en_us_dedes/he.h.m7:heHE.AflektosPyri.name
ltx/en_us_dedes/pe.d120:peMA.Ode8C11.mode	@ltx/en_us_dedes/miscellanea:misc.Mode7
ltx/en_us_dedes/pe.d120:peMA.Ode8C11.ode	@ltx/en_us_dedes/miscellanea:misc.Ode8
ltx/en_us_dedes/pe.d120:peMA.Ode8C11.text	
ltx/en_us_dedes/pe.d120:peMA.Ode8C12.incipit	…
ltx/en_us_dedes/pe.d120:peMA.Ode8C12.melody	@ltx/en_us_dedes/he.h.m7:heHE.AflektosPyri.name
ltx/en_us_dedes/pe.d120:peMA.Ode8C12.mode	@ltx/en_us_dedes/miscellanea:misc.Mode7
ltx/en_us_dedes/pe.d120:peMA.Ode8C12.ode	@ltx/en_us_dedes/miscellanea:misc.Ode8
ltx/en_us_dedes/pe.d120:peMA.Ode8C12.text	
ltx/en_us_dedes/pe.d120:peMA.Ode8C1H.greekmelody	@ltx/en_us_dedes/he.h.m7:heHE.AflektosPyri.greekname
ltx/en_us_dedes/pe.d120:peMA.Ode8C1H.incipit	@ltx/en_us_dedes/he.h.m7:heHE.AflektosPyri.incipit
ltx/en_us_dedes/pe.d120:peMA.Ode8C1H.melody	@ltx/en_us_dedes/he.h.m7:heHE.AflektosPyri.melody
ltx/en_us_dedes/pe.d120:peMA.Ode8C1H.mode	@ltx/en_us_dedes/miscellanea:misc.Mode7
ltx/en_us_dedes/pe.d120:peMA.Ode8C1H.ode	@ltx/en_us_dedes/miscellanea:misc.Ode8
ltx/en_us_dedes/pe.d120:peMA.Ode8C1H.text	@ltx/en_us_dedes/he.h.m7:heHE.AflektosPyri.text
ltx/en_us_dedes/pe.d120:peMA.Ode8C21.greekmelody	@ltx/en_us_dedes/he.h.m4:heHE.LyeiTaDesma.greekname
ltx/en_us_dedes/pe.d120:peMA.Ode8C21.incipit	…
ltx/en_us_dedes/pe.d120:peMA.Ode8C21.melody	@ltx/en_us_dedes/he.h.m4:heHE.LyeiTaDesma.name
ltx/en_us_dedes/pe.d120:peMA.Ode8C21.mode	@ltx/en_us_dedes/miscellanea:misc.Mode4
ltx/en_us_dedes/pe.d120:peMA.Ode8C21.ode	@ltx/en_us_dedes/miscellanea:misc.Ode8
ltx/en_us_dedes/pe.d120:peMA.Ode8C21.text	
ltx/en_us_dedes/pe.d120:peMA.Ode8C211.text	
ltx/en_us_dedes/pe.d120:peMA.Ode8C212.text	
ltx/en_us_dedes/pe.d120:peMA.Ode8C213.text	
ltx/en_us_dedes/pe.d120:peMA.Ode8C214.text	
ltx/en_us_dedes/pe.d120:peMA.Ode8C215.text	
ltx/en_us_dedes/pe.d120:peMA.Ode8C22.incipit	…
ltx/en_us_dedes/pe.d120:peMA.Ode8C22.melody	@ltx/en_us_dedes/he.h.m4:heHE.LyeiTaDesma.name
ltx/en_us_dedes/pe.d120:peMA.Ode8C22.mode	@ltx/en_us_dedes/miscellanea:misc.Mode4
ltx/en_us_dedes/pe.d120:peMA.Ode8C22.ode	@ltx/en_us_dedes/miscellanea:misc.Ode8
ltx/en_us_dedes/pe.d120:peMA.Ode8C22.text	
ltx/en_us_dedes/pe.d120:peMA.Ode8C221.text	
ltx/en_us_dedes/pe.d120:peMA.Ode8C222.text	
ltx/en_us_dedes/pe.d120:peMA.Ode8C223.text	
ltx/en_us_dedes/pe.d120:peMA.Ode8C224.text	
ltx/en_us_dedes/pe.d120:peMA.Ode8C225.text	
ltx/en_us_dedes/pe.d120:peMA.Ode8C23.incipit	…
ltx/en_us_dedes/pe.d120:peMA.Ode8C23.melody	@ltx/en_us_dedes/he.h.m4:heHE.LyeiTaDesma.name
ltx/en_us_dedes/pe.d120:peMA.Ode8C23.mode	@ltx/en_us_dedes/miscellanea:misc.Mode4
ltx/en_us_dedes/pe.d120:peMA.Ode8C23.ode	@ltx/en_us_dedes/miscellanea:misc.Ode8
ltx/en_us_dedes/pe.d120:peMA.Ode8C23.text	
ltx/en_us_dedes/pe.d120:peMA.Ode8C231.text	
ltx/en_us_dedes/pe.d120:peMA.Ode8C232.text	
ltx/en_us_dedes/pe.d120:peMA.Ode8C233.text	
ltx/en_us_dedes/pe.d120:peMA.Ode8C234.text	
ltx/en_us_dedes/pe.d120:peMA.Ode8C235.text	
ltx/en_us_dedes/pe.d120:peMA.Ode8C2H.greekmelody	@ltx/en_us_dedes/he.h.m4:heHE.LyeiTaDesma.greekname
ltx/en_us_dedes/pe.d120:peMA.Ode8C2H.incipit	@ltx/en_us_dedes/he.h.m4:heHE.LyeiTaDesma.incipit
ltx/en_us_dedes/pe.d120:peMA.Ode8C2H.melody	@ltx/en_us_dedes/he.h.m4:heHE.LyeiTaDesma.melody
ltx/en_us_dedes/pe.d120:peMA.Ode8C2H.mode	@ltx/en_us_dedes/miscellanea:misc.Mode4
ltx/en_us_dedes/pe.d120:peMA.Ode8C2H.ode	@ltx/en_us_dedes/miscellanea:misc.Ode8
ltx/en_us_dedes/pe.d120:peMA.Ode8C2H.text	@ltx/en_us_dedes/he.h.m4:heHE.LyeiTaDesma.text
ltx/en_us_dedes/pe.d120:peMA.Ode8C2H1.text	@ltx/en_us_dedes/he.h.m4:heHE.LyeiTaDesma1.text
ltx/en_us_dedes/pe.d120:peMA.Ode8C2H2.text	@ltx/en_us_dedes/he.h.m4:heHE.LyeiTaDesma2.text
ltx/en_us_dedes/pe.d120:peMA.Ode8C2H3.text	@ltx/en_us_dedes/he.h.m4:heHE.LyeiTaDesma3.text
ltx/en_us_dedes/pe.d120:peMA.Ode8C2H4.text	@ltx/en_us_dedes/he.h.m4:heHE.LyeiTaDesma4.text
ltx/en_us_dedes/pe.d120:peMA.Ode8C2H5.text	@ltx/en_us_dedes/he.h.m4:heHE.LyeiTaDesma5.text
ltx/en_us_dedes/pe.d120:peMA.Ode9C11.greekmelody	@ltx/en_us_dedes/he.h.m7:heHE.MiTisFthoras.greekname
ltx/en_us_dedes/pe.d120:peMA.Ode9C11.incipit	…
ltx/en_us_dedes/pe.d120:peMA.Ode9C11.melody	@ltx/en_us_dedes/he.h.m7:heHE.MiTisFthoras.name
ltx/en_us_dedes/pe.d120:peMA.Ode9C11.mode	@ltx/en_us_dedes/miscellanea:misc.Mode7
ltx/en_us_dedes/pe.d120:peMA.Ode9C11.ode	@ltx/en_us_dedes/miscellanea:misc.Ode9
ltx/en_us_dedes/pe.d120:peMA.Ode9C11.text	
ltx/en_us_dedes/pe.d120:peMA.Ode9C12.incipit	…
ltx/en_us_dedes/pe.d120:peMA.Ode9C12.melody	@ltx/en_us_dedes/he.h.m7:heHE.MiTisFthoras.name
ltx/en_us_dedes/pe.d120:peMA.Ode9C12.mode	@ltx/en_us_dedes/miscellanea:misc.Mode7
ltx/en_us_dedes/pe.d120:peMA.Ode9C12.ode	@ltx/en_us_dedes/miscellanea:misc.Ode9
ltx/en_us_dedes/pe.d120:peMA.Ode9C12.text	
ltx/en_us_dedes/pe.d120:peMA.Ode9C1H.greekmelody	@ltx/en_us_dedes/he.h.m7:heHE.MiTisFthoras.greekname
ltx/en_us_dedes/pe.d120:peMA.Ode9C1H.incipit	@ltx/en_us_dedes/he.h.m7:heHE.MiTisFthoras.incipit
ltx/en_us_dedes/pe.d120:peMA.Ode9C1H.melody	@ltx/en_us_dedes/he.h.m7:heHE.MiTisFthoras.melody
ltx/en_us_dedes/pe.d120:peMA.Ode9C1H.mode	@ltx/en_us_dedes/miscellanea:misc.Mode7
ltx/en_us_dedes/pe.d120:peMA.Ode9C1H.ode	@ltx/en_us_dedes/miscellanea:misc.Ode9
ltx/en_us_dedes/pe.d120:peMA.Ode9C1H.text	@ltx/en_us_dedes/he.h.m7:heHE.MiTisFthoras.text
ltx/en_us_dedes/pe.d120:peMA.Ode9C21.greekmelody	@ltx/en_us_dedes/he.h.m4:heHE.ChairoisAnassa.greekname
ltx/en_us_dedes/pe.d120:peMA.Ode9C21.incipit	
ltx/en_us_dedes/pe.d120:peMA.Ode9C21.melody	@ltx/en_us_dedes/he.h.m4:heHE.ChairoisAnassa.name
ltx/en_us_dedes/pe.d120:peMA.Ode9C21.mode	@ltx/en_us_dedes/miscellanea:misc.Mode4
ltx/en_us_dedes/pe.d120:peMA.Ode9C21.ode	@ltx/en_us_dedes/miscellanea:misc.Ode9
ltx/en_us_dedes/pe.d120:peMA.Ode9C21.text	
ltx/en_us_dedes/pe.d120:peMA.Ode9C211.text	
ltx/en_us_dedes/pe.d120:peMA.Ode9C212.text	
ltx/en_us_dedes/pe.d120:peMA.Ode9C213.text	
ltx/en_us_dedes/pe.d120:peMA.Ode9C214.text	
ltx/en_us_dedes/pe.d120:peMA.Ode9C215.text	
ltx/en_us_dedes/pe.d120:peMA.Ode9C22.incipit	
ltx/en_us_dedes/pe.d120:peMA.Ode9C22.melody	@ltx/en_us_dedes/he.h.m4:heHE.ChairoisAnassa.name
ltx/en_us_dedes/pe.d120:peMA.Ode9C22.mode	@ltx/en_us_dedes/miscellanea:misc.Mode4
ltx/en_us_dedes/pe.d120:peMA.Ode9C22.ode	@ltx/en_us_dedes/miscellanea:misc.Ode9
ltx/en_us_dedes/pe.d120:peMA.Ode9C22.text	
ltx/en_us_dedes/pe.d120:peMA.Ode9C221.text	
ltx/en_us_dedes/pe.d120:peMA.Ode9C222.text	
ltx/en_us_dedes/pe.d120:peMA.Ode9C223.text	
ltx/en_us_dedes/pe.d120:peMA.Ode9C224.text	
ltx/en_us_dedes/pe.d120:peMA.Ode9C225.text	
ltx/en_us_dedes/pe.d120:peMA.Ode9C2H.greekmelody	@ltx/en_us_dedes/he.h.m4:heHE.ChairoisAnassa.greekname
ltx/en_us_dedes/pe.d120:peMA.Ode9C2H.incipit	@ltx/en_us_dedes/he.h.m4:heHE.ChairoisAnassa.incipit
ltx/en_us_dedes/pe.d120:peMA.Ode9C2H.melody	@ltx/en_us_dedes/he.h.m4:heHE.ChairoisAnassa.melody
ltx/en_us_dedes/pe.d120:peMA.Ode9C2H.mode	@ltx/en_us_dedes/miscellanea:misc.Mode4
ltx/en_us_dedes/pe.d120:peMA.Ode9C2H.ode	@ltx/en_us_dedes/miscellanea:misc.Ode9
ltx/en_us_dedes/pe.d120:peMA.Ode9C2H.text	@ltx/en_us_dedes/he.h.m4:heHE.ChairoisAnassa.text
ltx/en_us_dedes/pe.d120:peMA.Ode9C2H1.text	@ltx/en_us_dedes/he.h.m4:heHE.ChairoisAnassa1.text
ltx/en_us_dedes/pe.d120:peMA.Ode9C2H2.text	@ltx/en_us_dedes/he.h.m4:heHE.ChairoisAnassa2.text
ltx/en_us_dedes/pe.d120:peMA.Ode9C2H3.text	@ltx/en_us_dedes/he.h.m4:heHE.ChairoisAnassa3.text
ltx/en_us_dedes/pe.d120:peMA.Ode9C2H4.text	@ltx/en_us_dedes/he.h.m4:heHE.ChairoisAnassa4.text
ltx/en_us_dedes/pe.d120:peMA.Ode9C2H5.text	@ltx/en_us_dedes/he.h.m4:heHE.ChairoisAnassa5.text
ltx/en_us_dedes/pe.d120:peMA.Oikos1.incipit	…
ltx/en_us_dedes/pe.d120:peMA.Oikos1.text	
ltx/en_us_dedes/pe.d120:peMA.PostGospelBoth.incipit	@ltx/en_us_dedes/ho.ho03:hoMA.PostGospelTheotokos.incipit
ltx/en_us_dedes/pe.d120:peMA.PostGospelBoth.melody	
ltx/en_us_dedes/pe.d120:peMA.PostGospelBoth.mode	@ltx/en_us_dedes/miscellanea:misc.Mode2
ltx/en_us_dedes/pe.d120:peMA.PostGospelBoth.text	@ltx/en_us_dedes/ho.ho03:hoMA.PostGospelTheotokos.text
ltx/en_us_dedes/pe.d120:peMA.PostGospelGlory.incipit	@ltx/en_us_dedes/ho.ho03:hoMA.PostGospelApostles.incipit
ltx/en_us_dedes/pe.d120:peMA.PostGospelGlory.melody	
ltx/en_us_dedes/pe.d120:peMA.PostGospelGlory.mode	@ltx/en_us_dedes/miscellanea:misc.Mode2
ltx/en_us_dedes/pe.d120:peMA.PostGospelGlory.text	@ltx/en_us_dedes/ho.ho03:hoMA.PostGospelApostles.text
ltx/en_us_dedes/pe.d120:peMA.PostGospelIdiomelon.incipit	@ltx/en_us_dedes/pe.d120:peVE.Aposticha3.incipit
ltx/en_us_dedes/pe.d120:peMA.PostGospelIdiomelon.melody	@ltx/en_us_dedes/miscellanea:misc.Idiomelon
ltx/en_us_dedes/pe.d120:peMA.PostGospelIdiomelon.mode	@ltx/en_us_dedes/miscellanea:misc.Mode6
ltx/en_us_dedes/pe.d120:peMA.PostGospelIdiomelon.text	@ltx/en_us_dedes/pe.d120:peVE.Aposticha3.text
ltx/en_us_dedes/pe.d120:peSY.commemoration.couplet1.title	@ltx/en_us_dedes/titles:ti.Verses
ltx/en_us_dedes/pe.d120:peSY.commemoration.couplet1.verse1	In a violent wind Christ distributes
ltx/en_us_dedes/pe.d120:peSY.commemoration.couplet1.verse2	to the Apostles the Spirit in tongues of fire.
ltx/en_us_dedes/pe.d120:peSY.commemoration.narration.p01	[paragraph 01]
ltx/en_us_dedes/pe.d120:peSY.commemoration.narration.p02	[paragraph 02]
ltx/en_us_dedes/pe.d120:peSY.commemoration.narration.p03	[paragraph 03]
ltx/en_us_dedes/pe.d120:peSY.commemoration.narration.p04	[paragraph 04]
ltx/en_us_dedes/pe.d120:peSY.commemoration.narration.p05	[paragraph 05]
ltx/en_us_dedes/pe.d120:peSY.commemoration.narration.p06	[paragraph 06]
ltx/en_us_dedes/pe.d120:peSY.commemoration.narration.p07	[paragraph 07]
ltx/en_us_dedes/pe.d120:peSY.commemoration.single1	On one great day, the Spirit is poured out on the fishermen.
ltx/en_us_dedes/pe.d120:peSY.commemoration.text	On this day, the eighth Sunday from Pascha, we celebrate holy Pentecost.
ltx/en_us_dedes/pe.d120:peSY.lastline	By the intercessions of the holy Apostles, O Christ our God, have mercy on us. Amen.
ltx/en_us_dedes/pe.d120:peVE.Apolytikion1.incipit	Blessed are You, O Christ…
ltx/en_us_dedes/pe.d120:peVE.Apolytikion1.melody	
ltx/en_us_dedes/pe.d120:peVE.Apolytikion1.mode	@ltx/en_us_dedes/miscellanea:misc.Mode8
ltx/en_us_dedes/pe.d120:peVE.Apolytikion1.text	Blessed are You, O Christ our God. You sent down the Holy Spirit into the fishermen, and You gave them knowledge and wisdom in everything; and through them, as in a net You caught the whole world. O Lord who loves humanity, glory to You!
ltx/en_us_dedes/pe.d120:peVE.AposGlory.incipit	Tongues were confused once because…
ltx/en_us_dedes/pe.d120:peVE.AposGlory.melody	@ltx/en_us_dedes/miscellanea:misc.Idiomelon
ltx/en_us_dedes/pe.d120:peVE.AposGlory.mode	@ltx/en_us_dedes/miscellanea:misc.Mode8
ltx/en_us_dedes/pe.d120:peVE.AposGlory.text	Tongues were confused once because people dared to build the Tower. Tongues now obtain skill, for the glory of divine knowledge. There, God condemned the impious for their transgression; here, by the Spirit, Christ illumined the fishermen. Then, discord was contrived as penalization; now a new concord has arrived, for the salvation of our souls.
ltx/en_us_dedes/pe.d120:peVE.Aposticha1.incipit	The Gentiles were unaware…
ltx/en_us_dedes/pe.d120:peVE.Aposticha1.melody	@ltx/en_us_dedes/miscellanea:misc.Idiomelon
ltx/en_us_dedes/pe.d120:peVE.Aposticha1.mode	@ltx/en_us_dedes/miscellanea:misc.Mode6
ltx/en_us_dedes/pe.d120:peVE.Aposticha1.text	The Gentiles were unaware of the mighty work of the all-holy Spirit that was done in Your Apostles, O Lord, and so they thought that the alternation of languages was caused by drunkenness. But we have been strengthened by them, and so we say, “Do not take Your Holy Spirit from us, we pray, O benevolent God.”
ltx/en_us_dedes/pe.d120:peVE.Aposticha2.incipit	O Lord, the coming…
ltx/en_us_dedes/pe.d120:peVE.Aposticha2.melody	@ltx/en_us_dedes/miscellanea:misc.Idiomelon
ltx/en_us_dedes/pe.d120:peVE.Aposticha2.mode	@ltx/en_us_dedes/miscellanea:misc.Mode6
ltx/en_us_dedes/pe.d120:peVE.Aposticha2.text	O Lord, the coming of the Holy Spirit filled Your Apostles and enabled them to speak in other languages. The unbelievers thought this strange occurrence was mere intoxication, but for the believers it was the means of salvation. Count us also worthy of that illumination, we pray, O benevolent God.
ltx/en_us_dedes/pe.d120:peVE.Aposticha3.incipit	Heavenly King, Comforter…
ltx/en_us_dedes/pe.d120:peVE.Aposticha3.melody	@ltx/en_us_dedes/miscellanea:misc.Idiomelon
ltx/en_us_dedes/pe.d120:peVE.Aposticha3.mode	@ltx/en_us_dedes/miscellanea:misc.Mode6
ltx/en_us_dedes/pe.d120:peVE.Aposticha3.text	Heavenly King, Comforter, Spirit of Truth, present in all places and filling all things, treasury of good things and giver of life: come; take Your abode in us; cleanse us of every stain, and save our souls, O Good one.
ltx/en_us_dedes/pe.d120:peVE.Lity1.incipit	@ltx/en_us_dedes/pe.d120:peVE.Stichera05.incipit
ltx/en_us_dedes/pe.d120:peVE.Lity1.melody	@ltx/en_us_dedes/miscellanea:misc.Idiomelon
ltx/en_us_dedes/pe.d120:peVE.Lity1.mode	@ltx/en_us_dedes/miscellanea:misc.Mode2
ltx/en_us_dedes/pe.d120:peVE.Lity1.text	@ltx/en_us_dedes/pe.d120:peVE.Stichera05.text
ltx/en_us_dedes/pe.d120:peVE.Lity2.incipit	@ltx/en_us_dedes/pe.d120:peVE.Stichera06.incipit
ltx/en_us_dedes/pe.d120:peVE.Lity2.melody	@ltx/en_us_dedes/miscellanea:misc.Idiomelon
ltx/en_us_dedes/pe.d120:peVE.Lity2.mode	@ltx/en_us_dedes/miscellanea:misc.Mode2
ltx/en_us_dedes/pe.d120:peVE.Lity2.text	@ltx/en_us_dedes/pe.d120:peVE.Stichera06.text
ltx/en_us_dedes/pe.d120:peVE.Lity3.incipit	@ltx/en_us_dedes/pe.d120:peVE.Stichera07.incipit
ltx/en_us_dedes/pe.d120:peVE.Lity3.melody	@ltx/en_us_dedes/miscellanea:misc.Idiomelon
ltx/en_us_dedes/pe.d120:peVE.Lity3.mode	@ltx/en_us_dedes/miscellanea:misc.Mode2
ltx/en_us_dedes/pe.d120:peVE.Lity3.text	@ltx/en_us_dedes/pe.d120:peVE.Stichera07.text
ltx/en_us_dedes/pe.d120:peVE.LityGlory.incipit	Lord, when You sent down…
ltx/en_us_dedes/pe.d120:peVE.LityGlory.melody	@ltx/en_us_dedes/miscellanea:misc.Idiomelon
ltx/en_us_dedes/pe.d120:peVE.LityGlory.mode	@ltx/en_us_dedes/miscellanea:misc.Mode8
ltx/en_us_dedes/pe.d120:peVE.LityGlory.text	Lord, when You sent down Your Spirit to the Apostles as they were sitting, the descendants of the Hebrews who witnessed it were bewildered and amazed; for they heard them speaking in other tongues and foreign languages, as the Spirit gave them utterance. Previously simple men, they were made wise; and with captivating speech, they told the mighty works of God, as they captured the Gentiles alive for the Faith. And we, for our part, now sing to You, “O Lord, You appeared on earth and You saved us from delusion. Glory to You!”
ltx/en_us_dedes/pe.d120:peVE.MM.Stichera1234as3456.text	@ltx/en_us_dedes/properties:media.key
ltx/en_us_dedes/pe.d120:peVE.SticGlory.incipit	Come, all people, let us…
ltx/en_us_dedes/pe.d120:peVE.SticGlory.melody	@ltx/en_us_dedes/miscellanea:misc.Idiomelon
ltx/en_us_dedes/pe.d120:peVE.SticGlory.mode	@ltx/en_us_dedes/miscellanea:misc.Mode8
ltx/en_us_dedes/pe.d120:peVE.SticGlory.poet	@ltx/en_us_dedes/poets:po.LeontosDespotou
ltx/en_us_dedes/pe.d120:peVE.SticGlory.text	Come, all people, let us worship the one God in three hypostases: the Son in the Father and the Holy Spirit. The Father, outside of time, begat the Son, co-eternal and sharing the throne, and the Holy Spirit was in the Father, glorified with the Son. One power, one essence, one Godhead, which we all worship and we say: “Holy God, You created all things through the Son by the cooperation of the Holy Spirit. Holy Mighty, through You we came to know the Father and the Holy Spirit came to the world. Holy Immortal, the Comforter Spirit, You proceed from the Father and rest in the Son. O Holy Trinity, glory to You!”
ltx/en_us_dedes/pe.d120:peVE.Stichera01.incipit	We are celebrating Pentecost, and…
ltx/en_us_dedes/pe.d120:peVE.Stichera01.melody	@ltx/en_us_dedes/miscellanea:misc.Idiomelon
ltx/en_us_dedes/pe.d120:peVE.Stichera01.mode	@ltx/en_us_dedes/miscellanea:misc.Mode1
ltx/en_us_dedes/pe.d120:peVE.Stichera01.text	We are celebrating Pentecost, and the coming of the Spirit: the appointed time of the promise, and the fulfillment of our hope. How great is the mystery? Great indeed and venerable! Therefore we cry to You, O Creator of all: Glory to You, O Lord!
ltx/en_us_dedes/pe.d120:peVE.Stichera02.incipit	You renewed Your Disciples, O…
ltx/en_us_dedes/pe.d120:peVE.Stichera02.melody	@ltx/en_us_dedes/miscellanea:misc.Idiomelon
ltx/en_us_dedes/pe.d120:peVE.Stichera02.mode	@ltx/en_us_dedes/miscellanea:misc.Mode1
ltx/en_us_dedes/pe.d120:peVE.Stichera02.text	You renewed Your Disciples, O Christ, with foreign languages, so that they might use them to proclaim You, the immortal Logos and God, who grants to our souls the great mercy.
ltx/en_us_dedes/pe.d120:peVE.Stichera03.incipit	The Holy Spirit supplies all…
ltx/en_us_dedes/pe.d120:peVE.Stichera03.melody	@ltx/en_us_dedes/miscellanea:misc.Idiomelon
ltx/en_us_dedes/pe.d120:peVE.Stichera03.mode	@ltx/en_us_dedes/miscellanea:misc.Mode1
ltx/en_us_dedes/pe.d120:peVE.Stichera03.text	The Holy Spirit supplies all things: He pours out prophecies, He perfects priests; He taught wisdom to the unlettered, He showed fishermen to be theologians; He welds together the whole institution of the Church. “O Comforter, You who share the same essence and throne with the Father and the Son, glory to You!”
ltx/en_us_dedes/pe.d120:peVE.Stichera04.incipit	We have seen the true…
ltx/en_us_dedes/pe.d120:peVE.Stichera04.melody	@ltx/en_us_dedes/miscellanea:misc.Idiomelon
ltx/en_us_dedes/pe.d120:peVE.Stichera04.mode	@ltx/en_us_dedes/miscellanea:misc.Mode2
ltx/en_us_dedes/pe.d120:peVE.Stichera04.text	We have seen the true light; we have received the heavenly Spirit. We have found the true Faith, worshiping the undivided Trinity; for this has saved us.
ltx/en_us_dedes/pe.d120:peVE.Stichera05.incipit	In the Prophets You announced…
ltx/en_us_dedes/pe.d120:peVE.Stichera05.melody	@ltx/en_us_dedes/miscellanea:misc.Idiomelon
ltx/en_us_dedes/pe.d120:peVE.Stichera05.mode	@ltx/en_us_dedes/miscellanea:misc.Mode2
ltx/en_us_dedes/pe.d120:peVE.Stichera05.text	In the Prophets You announced to us the way of salvation; and now the grace of Your Spirit has shined in Your Apostles, our Savior. You are God, the first and the last; and to the ages You are our God.
ltx/en_us_dedes/pe.d120:peVE.Stichera06.incipit	In Your courts, I will…
ltx/en_us_dedes/pe.d120:peVE.Stichera06.melody	@ltx/en_us_dedes/miscellanea:misc.Idiomelon
ltx/en_us_dedes/pe.d120:peVE.Stichera06.mode	@ltx/en_us_dedes/miscellanea:misc.Mode2
ltx/en_us_dedes/pe.d120:peVE.Stichera06.text	In Your courts, I will sing praise to You, the Savior of the world; and on bended knee I will worship Your invincible power. And I will bless You, O Lord, in the evening and the morning, in the middle of the day, and at every time.
ltx/en_us_dedes/pe.d120:peVE.Stichera07.incipit	In Your courts, O Lord…
ltx/en_us_dedes/pe.d120:peVE.Stichera07.melody	@ltx/en_us_dedes/miscellanea:misc.Idiomelon
ltx/en_us_dedes/pe.d120:peVE.Stichera07.mode	@ltx/en_us_dedes/miscellanea:misc.Mode2
ltx/en_us_dedes/pe.d120:peVE.Stichera07.text	In Your courts, O Lord, we the faithful bend the knee of soul and body, and we extol You, the unoriginate Father, and the Son who is also without beginning, and the co-eternal and all-holy Spirit, which illumines and sanctifies our souls.
ltx/en_us_dedes/pe.d120:peVE.Stichera08.incipit	Let us sing hymns of…
ltx/en_us_dedes/pe.d120:peVE.Stichera08.melody	@ltx/en_us_dedes/miscellanea:misc.Idiomelon
ltx/en_us_dedes/pe.d120:peVE.Stichera08.mode	@ltx/en_us_dedes/miscellanea:misc.Mode2
ltx/en_us_dedes/pe.d120:peVE.Stichera08.text	Let us sing hymns of praise to the consubstantial Trinity: Father, Son and Holy Spirit. For this is what was proclaimed by the Prophets and Apostles and the Martyrs.
