ltx/en_us_dedes/sy.m12.d27:syMA.commemoration01.couplet1.title	@ltx/en_us_dedes/titles:ti.Verses
ltx/en_us_dedes/sy.m12.d27:syMA.commemoration01.couplet1.verse1	
ltx/en_us_dedes/sy.m12.d27:syMA.commemoration01.couplet1.verse2	
ltx/en_us_dedes/sy.m12.d27:syMA.commemoration01.narration.p01	
ltx/en_us_dedes/sy.m12.d27:syMA.commemoration01.narration.p02	
ltx/en_us_dedes/sy.m12.d27:syMA.commemoration01.narration.p03	
ltx/en_us_dedes/sy.m12.d27:syMA.commemoration01.single1	
ltx/en_us_dedes/sy.m12.d27:syMA.commemoration01.text	On December 27 we commemorate the holy Apostle, Protomartyr, and Archdeacon Stephen, one of the Seven Deacons.
ltx/en_us_dedes/sy.m12.d27:syMA.commemoration02.couplet1.title	@ltx/en_us_dedes/titles:ti.Verses
ltx/en_us_dedes/sy.m12.d27:syMA.commemoration02.couplet1.verse1	
ltx/en_us_dedes/sy.m12.d27:syMA.commemoration02.couplet1.verse2	
ltx/en_us_dedes/sy.m12.d27:syMA.commemoration02.narration.p01	
ltx/en_us_dedes/sy.m12.d27:syMA.commemoration02.poem.title	Iambic verses branded on the foreheads of St. Theodore and his brother Theophanes, by Emperor Theophilos.
ltx/en_us_dedes/sy.m12.d27:syMA.commemoration02.poem.verse01	
ltx/en_us_dedes/sy.m12.d27:syMA.commemoration02.poem.verse02	
ltx/en_us_dedes/sy.m12.d27:syMA.commemoration02.poem.verse03	
ltx/en_us_dedes/sy.m12.d27:syMA.commemoration02.poem.verse04	
ltx/en_us_dedes/sy.m12.d27:syMA.commemoration02.poem.verse05	
ltx/en_us_dedes/sy.m12.d27:syMA.commemoration02.poem.verse06	
ltx/en_us_dedes/sy.m12.d27:syMA.commemoration02.poem.verse07	
ltx/en_us_dedes/sy.m12.d27:syMA.commemoration02.poem.verse08	
ltx/en_us_dedes/sy.m12.d27:syMA.commemoration02.poem.verse09	
ltx/en_us_dedes/sy.m12.d27:syMA.commemoration02.poem.verse10	
ltx/en_us_dedes/sy.m12.d27:syMA.commemoration02.poem.verse11	
ltx/en_us_dedes/sy.m12.d27:syMA.commemoration02.poem.verse12	
ltx/en_us_dedes/sy.m12.d27:syMA.commemoration02.text	On this day we also commemorate our devout father Theodore the Inscribed, brother of Theophanes the Poet.
ltx/en_us_dedes/sy.m12.d27:syMA.commemoration03.couplet1.title	@ltx/en_us_dedes/titles:ti.Verses
ltx/en_us_dedes/sy.m12.d27:syMA.commemoration03.couplet1.verse1	
ltx/en_us_dedes/sy.m12.d27:syMA.commemoration03.couplet1.verse2	
ltx/en_us_dedes/sy.m12.d27:syMA.commemoration03.narration.p01	
ltx/en_us_dedes/sy.m12.d27:syMA.commemoration03.text	On this day we also commemorate our devout father Theodore, Archbishop of Constantinople.
ltx/en_us_dedes/sy.m12.d27:syMA.commemoration04.couplet1.title	@ltx/en_us_dedes/titles:ti.Verses
ltx/en_us_dedes/sy.m12.d27:syMA.commemoration04.couplet1.verse1	
ltx/en_us_dedes/sy.m12.d27:syMA.commemoration04.couplet1.verse2	
ltx/en_us_dedes/sy.m12.d27:syMA.commemoration04.narration.p01	
ltx/en_us_dedes/sy.m12.d27:syMA.commemoration04.text	On this day we also commemorate the holy Hieromartyr Maurice, and the seventy martyrs with him.
ltx/en_us_dedes/sy.m12.d27:syMA.lastline	By their holy intercessions, O God, have mercy on us and save us. Amen.
