ltx/en_us_dedes/ty.m01.d28:tyCommemoration.text	
ltx/en_us_dedes/ty.m01.d28:tyDate.text	
ltx/en_us_dedes/ty.m01.d28:tyLI.AfterCommunion.text	
ltx/en_us_dedes/ty.m01.d28:tyLI.AmboPrayer.text	
ltx/en_us_dedes/ty.m01.d28:tyLI.Antiphons.text	
ltx/en_us_dedes/ty.m01.d28:tyLI.Apolytikia.text	
ltx/en_us_dedes/ty.m01.d28:tyLI.CommunionHymn.text	
ltx/en_us_dedes/ty.m01.d28:tyLI.Dismissal.text	
ltx/en_us_dedes/ty.m01.d28:tyLI.EntranceHymn.text	
ltx/en_us_dedes/ty.m01.d28:tyLI.Epistle.text	
ltx/en_us_dedes/ty.m01.d28:tyLI.Gospel.text	
ltx/en_us_dedes/ty.m01.d28:tyLI.Kontakion.text	
ltx/en_us_dedes/ty.m01.d28:tyLI.Megalynarion.text	
ltx/en_us_dedes/ty.m01.d28:tyLI.TheotokosHymn.text	
ltx/en_us_dedes/ty.m01.d28:tyMA.Anavathmoi.text	
ltx/en_us_dedes/ty.m01.d28:tyMA.Apolytikia.text	
ltx/en_us_dedes/ty.m01.d28:tyMA.Canons.text	
ltx/en_us_dedes/ty.m01.d28:tyMA.Doxology.text	
ltx/en_us_dedes/ty.m01.d28:tyMA.EndApolytikion.text	
ltx/en_us_dedes/ty.m01.d28:tyMA.Exaposteilaria.text	
ltx/en_us_dedes/ty.m01.d28:tyMA.Katavasias.text	
ltx/en_us_dedes/ty.m01.d28:tyMA.Kathismata.text	
ltx/en_us_dedes/ty.m01.d28:tyMA.KontakionOikos.text	
ltx/en_us_dedes/ty.m01.d28:tyMA.Lauds.text	
ltx/en_us_dedes/ty.m01.d28:tyMA.LaudsBoth.text	
ltx/en_us_dedes/ty.m01.d28:tyMA.LaudsGlory.text	
ltx/en_us_dedes/ty.m01.d28:tyMA.LaudsVerses.text	
ltx/en_us_dedes/ty.m01.d28:tyMA.Magnificat.text	
ltx/en_us_dedes/ty.m01.d28:tyMA.MatinsGospel.text	
ltx/en_us_dedes/ty.m01.d28:tyMA.MidodeKath.text	
ltx/en_us_dedes/ty.m01.d28:tyMA.MidodeKontakion.text	
ltx/en_us_dedes/ty.m01.d28:tyMA.Ode9_1.text	
ltx/en_us_dedes/ty.m01.d28:tyMA.Ode9_2.text	
ltx/en_us_dedes/ty.m01.d28:tyMA.Ode9_3.text	
ltx/en_us_dedes/ty.m01.d28:tyMA.Ode9_4.text	
ltx/en_us_dedes/ty.m01.d28:tyMA.Ode9_5.text	
ltx/en_us_dedes/ty.m01.d28:tyMA.Ode9_6.text	
ltx/en_us_dedes/ty.m01.d28:tyMA.Ode9_7.text	
ltx/en_us_dedes/ty.m01.d28:tyMA.Ode9_8.text	
ltx/en_us_dedes/ty.m01.d28:tyMA.Ode9_Katavasia1.text	
ltx/en_us_dedes/ty.m01.d28:tyMA.Ode9_Katavasia2.text	
ltx/en_us_dedes/ty.m01.d28:tyMA.ProkVerse.text	
ltx/en_us_dedes/ty.m01.d28:tyMA.Prokeimenon.text	
ltx/en_us_dedes/ty.m01.d28:tyMA.Psalm50.text	
ltx/en_us_dedes/ty.m01.d28:tyMA.Synaxarion.text	
ltx/en_us_dedes/ty.m01.d28:tyMO.Rubric1.text	
ltx/en_us_dedes/ty.m01.d28:tyNote1.text	
ltx/en_us_dedes/ty.m01.d28:tyVE.Apolytikia.text	
ltx/en_us_dedes/ty.m01.d28:tyVE.AposBoth.text	
ltx/en_us_dedes/ty.m01.d28:tyVE.AposGlory.text	
ltx/en_us_dedes/ty.m01.d28:tyVE.AposGloryBoth.text	
ltx/en_us_dedes/ty.m01.d28:tyVE.Aposticha.text	
ltx/en_us_dedes/ty.m01.d28:tyVE.Dismissal.text	
ltx/en_us_dedes/ty.m01.d28:tyVE.Entrance.text	
ltx/en_us_dedes/ty.m01.d28:tyVE.Intro.text	
ltx/en_us_dedes/ty.m01.d28:tyVE.LIHC.text	
ltx/en_us_dedes/ty.m01.d28:tyVE.Note1.text	
ltx/en_us_dedes/ty.m01.d28:tyVE.Note2.text	
ltx/en_us_dedes/ty.m01.d28:tyVE.SticBoth.text	
ltx/en_us_dedes/ty.m01.d28:tyVE.SticGlory.text	
ltx/en_us_dedes/ty.m01.d28:tyVE.SticGloryBoth.text	
ltx/en_us_dedes/ty.m01.d28:tyVE.Stichera.text	
