ltx/en_us_dedes/me.m01.d26:meDA.commemoration.first	Memory of St. Xenophon
ltx/en_us_dedes/me.m01.d26:meDA.commemoration.first_name	
ltx/en_us_dedes/me.m01.d26:meDA.commemoration.first_short	Memory of St. Xenophon
ltx/en_us_dedes/me.m01.d26:meDA.commemoration.first_title	@ltx/en_us_dedes/titles:ti.Saints
ltx/en_us_dedes/me.m01.d26:meDA.commemoration.full	Memory of our Devout Father Xenophon and his Household
ltx/en_us_dedes/me.m01.d26:meDA.commemoration.second_name	
ltx/en_us_dedes/me.m01.d26:meDA.commemoration.second_title	
ltx/en_us_dedes/me.m01.d26:meDA.date	January 26
ltx/en_us_dedes/me.m01.d26:meDA.fordate	for January 26
ltx/en_us_dedes/me.m01.d26:meDA.insert1	our devout father Xenophon and his household,
ltx/en_us_dedes/me.m01.d26:meDA.insert2	whose memory we observe;
ltx/en_us_dedes/me.m01.d26:meDA.note	
ltx/en_us_dedes/me.m01.d26:meDA.pdfcoverdate	January 26,
ltx/en_us_dedes/me.m01.d26:meDA.pdfheaderdate	January 26
ltx/en_us_dedes/me.m01.d26:meHO.commemorations	
ltx/en_us_dedes/me.m01.d26:meHO.note1	
ltx/en_us_dedes/me.m01.d26:meHO.note2	
ltx/en_us_dedes/me.m01.d26:meHO.number	26.
ltx/en_us_dedes/me.m01.d26:meHO.rank	
ltx/en_us_dedes/me.m01.d26:meLE.commemoration1	Memory of our Devout Father Xenophon and his Household
ltx/en_us_dedes/me.m01.d26:meLE.commemoration2	
ltx/en_us_dedes/me.m01.d26:meLI.Kontakion1.greekmelody	@ltx/en_us_dedes/me.m01.d26:meMA.Kontakion1.greekmelody
ltx/en_us_dedes/me.m01.d26:meLI.Kontakion1.incipit	@ltx/en_us_dedes/me.m01.d26:meMA.Kontakion1.incipit
ltx/en_us_dedes/me.m01.d26:meLI.Kontakion1.melody	@ltx/en_us_dedes/me.m01.d26:meMA.Kontakion1.melody
ltx/en_us_dedes/me.m01.d26:meLI.Kontakion1.mode	@ltx/en_us_dedes/me.m01.d26:meMA.Kontakion1.mode
ltx/en_us_dedes/me.m01.d26:meLI.Kontakion1.text	@ltx/en_us_dedes/me.m01.d26:meMA.Kontakion1.text
ltx/en_us_dedes/me.m01.d26:meLI.MM.CommunionHymn.text	@ltx/en_us_dedes/properties:media.key
ltx/en_us_dedes/me.m01.d26:meLI.Megalynarion.text	
ltx/en_us_dedes/me.m01.d26:meMA.C1.acrostic.notice1	
ltx/en_us_dedes/me.m01.d26:meMA.C1.acrostic.text	
ltx/en_us_dedes/me.m01.d26:meMA.C1.acrostic.title	Canon for the Saints.
ltx/en_us_dedes/me.m01.d26:meMA.C1.poet	@ltx/en_us_dedes/poets:po.Theofanous
ltx/en_us_dedes/me.m01.d26:meMA.C1.title	@ltx/en_us_dedes/titles:ti.CanonSaints
ltx/en_us_dedes/me.m01.d26:meMA.C1.verse	@ltx/en_us_dedes/prayers:pr.verse_SaintsM.text
ltx/en_us_dedes/me.m01.d26:meMA.ExapTheotokion.incipit	O pure and most holy…
ltx/en_us_dedes/me.m01.d26:meMA.ExapTheotokion.melody	@ltx/en_us_dedes/he.a.m3:heAU.OOuranonToisAstrois.name
ltx/en_us_dedes/me.m01.d26:meMA.ExapTheotokion.mode	@ltx/en_us_dedes/miscellanea:misc.Mode3
ltx/en_us_dedes/me.m01.d26:meMA.ExapTheotokion.text	O pure and most holy Virgin, * truly your majesty transcends * all the battalions of Angels * and all the choruses of saints. * Therefore make fervent entreaty * to Christ for a sinful people.
ltx/en_us_dedes/me.m01.d26:meMA.Exaposteilarion1.greekmelody	@ltx/en_us_dedes/he.a.m3:heAU.OOuranonToisAstrois.greekname
ltx/en_us_dedes/me.m01.d26:meMA.Exaposteilarion1.incipit	When you dispersed your riches…
ltx/en_us_dedes/me.m01.d26:meMA.Exaposteilarion1.melody	@ltx/en_us_dedes/he.a.m3:heAU.OOuranonToisAstrois.name
ltx/en_us_dedes/me.m01.d26:meMA.Exaposteilarion1.mode	@ltx/en_us_dedes/miscellanea:misc.Mode3
ltx/en_us_dedes/me.m01.d26:meMA.Exaposteilarion1.text	When you dispersed your riches * unto the poor, you thus pleased God. * And leaving home as a stranger * you were familiar with the Lord. * All-blessed Xenophon, pray Him * that we be freed from passions.
ltx/en_us_dedes/me.m01.d26:meMA.Kontakion1.greekmelody	@ltx/en_us_dedes/he.a.m4:heAU.EpefanisSimeron.greekname
ltx/en_us_dedes/me.m01.d26:meMA.Kontakion1.incipit	Since the righteous Xenophon *…
ltx/en_us_dedes/me.m01.d26:meMA.Kontakion1.melody	@ltx/en_us_dedes/he.a.m4:heAU.EpefanisSimeron.name
ltx/en_us_dedes/me.m01.d26:meMA.Kontakion1.mode	@ltx/en_us_dedes/miscellanea:misc.Mode4
ltx/en_us_dedes/me.m01.d26:meMA.Kontakion1.text	Since the righteous Xenophon * and his august wife * have escaped the surging sea * of earthly life, they now rejoice * above in heaven, where they are joined * by their own offspring. * And Christ do they magnify.
ltx/en_us_dedes/me.m01.d26:meMA.Ode1C11.greekmelody	@ltx/en_us_dedes/he.h.m2:heHE.DefteLaoi.greekname
ltx/en_us_dedes/me.m01.d26:meMA.Ode1C11.incipit	…
ltx/en_us_dedes/me.m01.d26:meMA.Ode1C11.melody	@ltx/en_us_dedes/he.h.m2:heHE.DefteLaoi.name
ltx/en_us_dedes/me.m01.d26:meMA.Ode1C11.mode	@ltx/en_us_dedes/miscellanea:misc.Mode2
ltx/en_us_dedes/me.m01.d26:meMA.Ode1C11.ode	@ltx/en_us_dedes/miscellanea:misc.Ode1
ltx/en_us_dedes/me.m01.d26:meMA.Ode1C11.text	
ltx/en_us_dedes/me.m01.d26:meMA.Ode1C12.incipit	…
ltx/en_us_dedes/me.m01.d26:meMA.Ode1C12.melody	@ltx/en_us_dedes/he.h.m2:heHE.DefteLaoi.name
ltx/en_us_dedes/me.m01.d26:meMA.Ode1C12.mode	@ltx/en_us_dedes/miscellanea:misc.Mode2
ltx/en_us_dedes/me.m01.d26:meMA.Ode1C12.ode	@ltx/en_us_dedes/miscellanea:misc.Ode1
ltx/en_us_dedes/me.m01.d26:meMA.Ode1C12.text	
ltx/en_us_dedes/me.m01.d26:meMA.Ode1C13.incipit	…
ltx/en_us_dedes/me.m01.d26:meMA.Ode1C13.melody	@ltx/en_us_dedes/he.h.m2:heHE.DefteLaoi.name
ltx/en_us_dedes/me.m01.d26:meMA.Ode1C13.mode	@ltx/en_us_dedes/miscellanea:misc.Mode2
ltx/en_us_dedes/me.m01.d26:meMA.Ode1C13.ode	@ltx/en_us_dedes/miscellanea:misc.Ode1
ltx/en_us_dedes/me.m01.d26:meMA.Ode1C13.text	
ltx/en_us_dedes/me.m01.d26:meMA.Ode1C1T.incipit	…
ltx/en_us_dedes/me.m01.d26:meMA.Ode1C1T.melody	@ltx/en_us_dedes/he.h.m2:heHE.DefteLaoi.name
ltx/en_us_dedes/me.m01.d26:meMA.Ode1C1T.mode	@ltx/en_us_dedes/miscellanea:misc.Mode2
ltx/en_us_dedes/me.m01.d26:meMA.Ode1C1T.ode	@ltx/en_us_dedes/miscellanea:misc.Ode1
ltx/en_us_dedes/me.m01.d26:meMA.Ode1C1T.text	
ltx/en_us_dedes/me.m01.d26:meMA.Ode3C11.greekmelody	@ltx/en_us_dedes/he.h.m2:heHE.EnPetraMeTisPisteos.greekname
ltx/en_us_dedes/me.m01.d26:meMA.Ode3C11.incipit	…
ltx/en_us_dedes/me.m01.d26:meMA.Ode3C11.melody	@ltx/en_us_dedes/he.h.m2:heHE.EnPetraMeTisPisteos.name
ltx/en_us_dedes/me.m01.d26:meMA.Ode3C11.mode	@ltx/en_us_dedes/miscellanea:misc.Mode2
ltx/en_us_dedes/me.m01.d26:meMA.Ode3C11.ode	@ltx/en_us_dedes/miscellanea:misc.Ode3
ltx/en_us_dedes/me.m01.d26:meMA.Ode3C11.text	
ltx/en_us_dedes/me.m01.d26:meMA.Ode3C12.incipit	…
ltx/en_us_dedes/me.m01.d26:meMA.Ode3C12.melody	@ltx/en_us_dedes/he.h.m2:heHE.EnPetraMeTisPisteos.name
ltx/en_us_dedes/me.m01.d26:meMA.Ode3C12.mode	@ltx/en_us_dedes/miscellanea:misc.Mode2
ltx/en_us_dedes/me.m01.d26:meMA.Ode3C12.ode	@ltx/en_us_dedes/miscellanea:misc.Ode3
ltx/en_us_dedes/me.m01.d26:meMA.Ode3C12.text	
ltx/en_us_dedes/me.m01.d26:meMA.Ode3C13.incipit	…
ltx/en_us_dedes/me.m01.d26:meMA.Ode3C13.melody	@ltx/en_us_dedes/he.h.m2:heHE.EnPetraMeTisPisteos.name
ltx/en_us_dedes/me.m01.d26:meMA.Ode3C13.mode	@ltx/en_us_dedes/miscellanea:misc.Mode2
ltx/en_us_dedes/me.m01.d26:meMA.Ode3C13.ode	@ltx/en_us_dedes/miscellanea:misc.Ode3
ltx/en_us_dedes/me.m01.d26:meMA.Ode3C13.text	
ltx/en_us_dedes/me.m01.d26:meMA.Ode3C1T.incipit	…
ltx/en_us_dedes/me.m01.d26:meMA.Ode3C1T.melody	@ltx/en_us_dedes/he.h.m2:heHE.EnPetraMeTisPisteos.name
ltx/en_us_dedes/me.m01.d26:meMA.Ode3C1T.mode	@ltx/en_us_dedes/miscellanea:misc.Mode2
ltx/en_us_dedes/me.m01.d26:meMA.Ode3C1T.ode	@ltx/en_us_dedes/miscellanea:misc.Ode3
ltx/en_us_dedes/me.m01.d26:meMA.Ode3C1T.text	
ltx/en_us_dedes/me.m01.d26:meMA.Ode3H.greekmelody	@ltx/en_us_dedes/he.h.m2:heHE.EnPetraMeTisPisteos.greekname
ltx/en_us_dedes/me.m01.d26:meMA.Ode3H.incipit	@ltx/en_us_dedes/he.h.m2:heHE.EnPetraMeTisPisteos.incipit
ltx/en_us_dedes/me.m01.d26:meMA.Ode3H.melody	@ltx/en_us_dedes/he.h.m2:heHE.EnPetraMeTisPisteos.melody
ltx/en_us_dedes/me.m01.d26:meMA.Ode3H.mode	@ltx/en_us_dedes/miscellanea:misc.Mode2
ltx/en_us_dedes/me.m01.d26:meMA.Ode3H.ode	@ltx/en_us_dedes/miscellanea:misc.Ode3
ltx/en_us_dedes/me.m01.d26:meMA.Ode3H.text	@ltx/en_us_dedes/he.h.m2:heHE.EnPetraMeTisPisteos.text
ltx/en_us_dedes/me.m01.d26:meMA.Ode3Kathisma1.greekmelody	@ltx/en_us_dedes/he.a.m8:heAU.TinSofianKaiLogon.greekname
ltx/en_us_dedes/me.m01.d26:meMA.Ode3Kathisma1.incipit	You were careful to keep…
ltx/en_us_dedes/me.m01.d26:meMA.Ode3Kathisma1.melody	@ltx/en_us_dedes/he.a.m8:heAU.TinSofianKaiLogon.name
ltx/en_us_dedes/me.m01.d26:meMA.Ode3Kathisma1.mode	@ltx/en_us_dedes/miscellanea:misc.Mode8
ltx/en_us_dedes/me.m01.d26:meMA.Ode3Kathisma1.text	You were careful to keep all the Lord’s commands, * and you brought up children to do the same, * O blessed St. Xenophon. Then along with your pious wife * together with your sons, you departed from all the storms * and trials of this life to obtain the kingdom on high. * Therefore now with reverence we extol you together * and lovingly honor you, as we faithfully cry aloud: * O all-blessed and God-bearing Saints, * Intercede with Christ our God, * that He grant forgiveness of offenses * to us who with longing observe your holy memory.
ltx/en_us_dedes/me.m01.d26:meMA.Ode3KathismaSt.incipit	@ltx/en_us_dedes/me.m01.d24:meMA.Ode3KathismaSt.incipit
ltx/en_us_dedes/me.m01.d26:meMA.Ode3KathismaSt.melody	@ltx/en_us_dedes/he.a.m8:heAU.TinSofianKaiLogon.name
ltx/en_us_dedes/me.m01.d26:meMA.Ode3KathismaSt.mode	@ltx/en_us_dedes/miscellanea:misc.Mode8
ltx/en_us_dedes/me.m01.d26:meMA.Ode3KathismaSt.text	@ltx/en_us_dedes/me.m01.d24:meMA.Ode3KathismaSt.text
ltx/en_us_dedes/me.m01.d26:meMA.Ode3KathismaT.incipit	You alone among women…
ltx/en_us_dedes/me.m01.d26:meMA.Ode3KathismaT.melody	@ltx/en_us_dedes/he.a.m8:heAU.TinSofianKaiLogon.name
ltx/en_us_dedes/me.m01.d26:meMA.Ode3KathismaT.mode	@ltx/en_us_dedes/miscellanea:misc.Mode8
ltx/en_us_dedes/me.m01.d26:meMA.Ode3KathismaT.text	You alone among women have without seed * given birth, as a Virgin, to God in the flesh. * We, all generations, now * call you blessed, as you foretold. * For the fire of Divinity has dwelt in your womb indeed; * and you nursed the Creator and Lord in His infancy. * Therefore does the human race along with the Angels * give glory and worthily extol your all-holy childbirth, * and with one voice we sing to you: * Intercede with your Son and our God, * that He grant forgiveness of offenses * to us now rightly extolling your glory, O immaculate one.
ltx/en_us_dedes/me.m01.d26:meMA.Ode4C11.greekmelody	@ltx/en_us_dedes/he.h.m2:heHE.EisakikoaKyrieTinAkoin.greekname
ltx/en_us_dedes/me.m01.d26:meMA.Ode4C11.incipit	…
ltx/en_us_dedes/me.m01.d26:meMA.Ode4C11.melody	@ltx/en_us_dedes/he.h.m2:heHE.EisakikoaKyrieTinAkoin.name
ltx/en_us_dedes/me.m01.d26:meMA.Ode4C11.mode	@ltx/en_us_dedes/miscellanea:misc.Mode2
ltx/en_us_dedes/me.m01.d26:meMA.Ode4C11.ode	@ltx/en_us_dedes/miscellanea:misc.Ode4
ltx/en_us_dedes/me.m01.d26:meMA.Ode4C11.text	
ltx/en_us_dedes/me.m01.d26:meMA.Ode4C12.incipit	…
ltx/en_us_dedes/me.m01.d26:meMA.Ode4C12.melody	@ltx/en_us_dedes/he.h.m2:heHE.EisakikoaKyrieTinAkoin.name
ltx/en_us_dedes/me.m01.d26:meMA.Ode4C12.mode	@ltx/en_us_dedes/miscellanea:misc.Mode2
ltx/en_us_dedes/me.m01.d26:meMA.Ode4C12.ode	@ltx/en_us_dedes/miscellanea:misc.Ode4
ltx/en_us_dedes/me.m01.d26:meMA.Ode4C12.text	
ltx/en_us_dedes/me.m01.d26:meMA.Ode4C13.incipit	…
ltx/en_us_dedes/me.m01.d26:meMA.Ode4C13.melody	@ltx/en_us_dedes/he.h.m2:heHE.EisakikoaKyrieTinAkoin.name
ltx/en_us_dedes/me.m01.d26:meMA.Ode4C13.mode	@ltx/en_us_dedes/miscellanea:misc.Mode2
ltx/en_us_dedes/me.m01.d26:meMA.Ode4C13.ode	@ltx/en_us_dedes/miscellanea:misc.Ode4
ltx/en_us_dedes/me.m01.d26:meMA.Ode4C13.text	
ltx/en_us_dedes/me.m01.d26:meMA.Ode4C1T.incipit	…
ltx/en_us_dedes/me.m01.d26:meMA.Ode4C1T.melody	@ltx/en_us_dedes/he.h.m2:heHE.EisakikoaKyrieTinAkoin.name
ltx/en_us_dedes/me.m01.d26:meMA.Ode4C1T.mode	@ltx/en_us_dedes/miscellanea:misc.Mode2
ltx/en_us_dedes/me.m01.d26:meMA.Ode4C1T.ode	@ltx/en_us_dedes/miscellanea:misc.Ode4
ltx/en_us_dedes/me.m01.d26:meMA.Ode4C1T.text	
ltx/en_us_dedes/me.m01.d26:meMA.Ode5C11.greekmelody	@ltx/en_us_dedes/he.h.m2:heHE.OTouFotosChorigos.greekname
ltx/en_us_dedes/me.m01.d26:meMA.Ode5C11.incipit	…
ltx/en_us_dedes/me.m01.d26:meMA.Ode5C11.melody	@ltx/en_us_dedes/he.h.m2:heHE.OTouFotosChorigos.name
ltx/en_us_dedes/me.m01.d26:meMA.Ode5C11.mode	@ltx/en_us_dedes/miscellanea:misc.Mode2
ltx/en_us_dedes/me.m01.d26:meMA.Ode5C11.ode	@ltx/en_us_dedes/miscellanea:misc.Ode5
ltx/en_us_dedes/me.m01.d26:meMA.Ode5C11.text	
ltx/en_us_dedes/me.m01.d26:meMA.Ode5C12.incipit	…
ltx/en_us_dedes/me.m01.d26:meMA.Ode5C12.melody	@ltx/en_us_dedes/he.h.m2:heHE.OTouFotosChorigos.name
ltx/en_us_dedes/me.m01.d26:meMA.Ode5C12.mode	@ltx/en_us_dedes/miscellanea:misc.Mode2
ltx/en_us_dedes/me.m01.d26:meMA.Ode5C12.ode	@ltx/en_us_dedes/miscellanea:misc.Ode5
ltx/en_us_dedes/me.m01.d26:meMA.Ode5C12.text	
ltx/en_us_dedes/me.m01.d26:meMA.Ode5C13.incipit	…
ltx/en_us_dedes/me.m01.d26:meMA.Ode5C13.melody	@ltx/en_us_dedes/he.h.m2:heHE.OTouFotosChorigos.name
ltx/en_us_dedes/me.m01.d26:meMA.Ode5C13.mode	@ltx/en_us_dedes/miscellanea:misc.Mode2
ltx/en_us_dedes/me.m01.d26:meMA.Ode5C13.ode	@ltx/en_us_dedes/miscellanea:misc.Ode5
ltx/en_us_dedes/me.m01.d26:meMA.Ode5C13.text	
ltx/en_us_dedes/me.m01.d26:meMA.Ode5C1T.incipit	…
ltx/en_us_dedes/me.m01.d26:meMA.Ode5C1T.melody	@ltx/en_us_dedes/he.h.m2:heHE.OTouFotosChorigos.name
ltx/en_us_dedes/me.m01.d26:meMA.Ode5C1T.mode	@ltx/en_us_dedes/miscellanea:misc.Mode2
ltx/en_us_dedes/me.m01.d26:meMA.Ode5C1T.ode	@ltx/en_us_dedes/miscellanea:misc.Ode5
ltx/en_us_dedes/me.m01.d26:meMA.Ode5C1T.text	
ltx/en_us_dedes/me.m01.d26:meMA.Ode6C11.greekmelody	@ltx/en_us_dedes/he.h.m2:heHE.EnAvyssoPtaismaton.greekname
ltx/en_us_dedes/me.m01.d26:meMA.Ode6C11.incipit	…
ltx/en_us_dedes/me.m01.d26:meMA.Ode6C11.melody	@ltx/en_us_dedes/he.h.m2:heHE.EnAvyssoPtaismaton.name
ltx/en_us_dedes/me.m01.d26:meMA.Ode6C11.mode	@ltx/en_us_dedes/miscellanea:misc.Mode2
ltx/en_us_dedes/me.m01.d26:meMA.Ode6C11.ode	@ltx/en_us_dedes/miscellanea:misc.Ode6
ltx/en_us_dedes/me.m01.d26:meMA.Ode6C11.text	
ltx/en_us_dedes/me.m01.d26:meMA.Ode6C12.incipit	…
ltx/en_us_dedes/me.m01.d26:meMA.Ode6C12.melody	@ltx/en_us_dedes/he.h.m2:heHE.EnAvyssoPtaismaton.name
ltx/en_us_dedes/me.m01.d26:meMA.Ode6C12.mode	@ltx/en_us_dedes/miscellanea:misc.Mode2
ltx/en_us_dedes/me.m01.d26:meMA.Ode6C12.ode	@ltx/en_us_dedes/miscellanea:misc.Ode6
ltx/en_us_dedes/me.m01.d26:meMA.Ode6C12.text	
ltx/en_us_dedes/me.m01.d26:meMA.Ode6C13.incipit	…
ltx/en_us_dedes/me.m01.d26:meMA.Ode6C13.melody	@ltx/en_us_dedes/he.h.m2:heHE.EnAvyssoPtaismaton.name
ltx/en_us_dedes/me.m01.d26:meMA.Ode6C13.mode	@ltx/en_us_dedes/miscellanea:misc.Mode2
ltx/en_us_dedes/me.m01.d26:meMA.Ode6C13.ode	@ltx/en_us_dedes/miscellanea:misc.Ode6
ltx/en_us_dedes/me.m01.d26:meMA.Ode6C13.text	
ltx/en_us_dedes/me.m01.d26:meMA.Ode6C1T.incipit	…
ltx/en_us_dedes/me.m01.d26:meMA.Ode6C1T.melody	@ltx/en_us_dedes/he.h.m2:heHE.EnAvyssoPtaismaton.name
ltx/en_us_dedes/me.m01.d26:meMA.Ode6C1T.mode	@ltx/en_us_dedes/miscellanea:misc.Mode2
ltx/en_us_dedes/me.m01.d26:meMA.Ode6C1T.ode	@ltx/en_us_dedes/miscellanea:misc.Ode6
ltx/en_us_dedes/me.m01.d26:meMA.Ode6C1T.text	
ltx/en_us_dedes/me.m01.d26:meMA.Ode6H.greekmelody	@ltx/en_us_dedes/he.h.m2:heHE.EnAvyssoPtaismaton.greekname
ltx/en_us_dedes/me.m01.d26:meMA.Ode6H.incipit	@ltx/en_us_dedes/he.h.m2:heHE.EnAvyssoPtaismaton.incipit
ltx/en_us_dedes/me.m01.d26:meMA.Ode6H.melody	@ltx/en_us_dedes/he.h.m2:heHE.EnAvyssoPtaismaton.melody
ltx/en_us_dedes/me.m01.d26:meMA.Ode6H.mode	@ltx/en_us_dedes/miscellanea:misc.Mode2
ltx/en_us_dedes/me.m01.d26:meMA.Ode6H.ode	@ltx/en_us_dedes/miscellanea:misc.Ode6
ltx/en_us_dedes/me.m01.d26:meMA.Ode6H.text	@ltx/en_us_dedes/he.h.m2:heHE.EnAvyssoPtaismaton.text
ltx/en_us_dedes/me.m01.d26:meMA.Ode7C11.greekmelody	@ltx/en_us_dedes/he.h.m2:heHE.AntitheonProstagma.greekname
ltx/en_us_dedes/me.m01.d26:meMA.Ode7C11.incipit	…
ltx/en_us_dedes/me.m01.d26:meMA.Ode7C11.melody	@ltx/en_us_dedes/he.h.m2:heHE.AntitheonProstagma.name
ltx/en_us_dedes/me.m01.d26:meMA.Ode7C11.mode	@ltx/en_us_dedes/miscellanea:misc.Mode2
ltx/en_us_dedes/me.m01.d26:meMA.Ode7C11.ode	@ltx/en_us_dedes/miscellanea:misc.Ode7
ltx/en_us_dedes/me.m01.d26:meMA.Ode7C11.text	
ltx/en_us_dedes/me.m01.d26:meMA.Ode7C12.incipit	…
ltx/en_us_dedes/me.m01.d26:meMA.Ode7C12.melody	@ltx/en_us_dedes/he.h.m2:heHE.AntitheonProstagma.name
ltx/en_us_dedes/me.m01.d26:meMA.Ode7C12.mode	@ltx/en_us_dedes/miscellanea:misc.Mode2
ltx/en_us_dedes/me.m01.d26:meMA.Ode7C12.ode	@ltx/en_us_dedes/miscellanea:misc.Ode7
ltx/en_us_dedes/me.m01.d26:meMA.Ode7C12.text	
ltx/en_us_dedes/me.m01.d26:meMA.Ode7C1T.incipit	…
ltx/en_us_dedes/me.m01.d26:meMA.Ode7C1T.melody	@ltx/en_us_dedes/he.h.m2:heHE.AntitheonProstagma.name
ltx/en_us_dedes/me.m01.d26:meMA.Ode7C1T.mode	@ltx/en_us_dedes/miscellanea:misc.Mode2
ltx/en_us_dedes/me.m01.d26:meMA.Ode7C1T.ode	@ltx/en_us_dedes/miscellanea:misc.Ode7
ltx/en_us_dedes/me.m01.d26:meMA.Ode7C1T.text	
ltx/en_us_dedes/me.m01.d26:meMA.Ode8C11.greekmelody	@ltx/en_us_dedes/he.h.m2:heHE.KaminosPote.greekname
ltx/en_us_dedes/me.m01.d26:meMA.Ode8C11.incipit	…
ltx/en_us_dedes/me.m01.d26:meMA.Ode8C11.melody	@ltx/en_us_dedes/he.h.m2:heHE.KaminosPote.name
ltx/en_us_dedes/me.m01.d26:meMA.Ode8C11.mode	@ltx/en_us_dedes/miscellanea:misc.Mode2
ltx/en_us_dedes/me.m01.d26:meMA.Ode8C11.ode	@ltx/en_us_dedes/miscellanea:misc.Ode8
ltx/en_us_dedes/me.m01.d26:meMA.Ode8C11.text	
ltx/en_us_dedes/me.m01.d26:meMA.Ode8C12.incipit	…
ltx/en_us_dedes/me.m01.d26:meMA.Ode8C12.melody	@ltx/en_us_dedes/he.h.m2:heHE.KaminosPote.name
ltx/en_us_dedes/me.m01.d26:meMA.Ode8C12.mode	@ltx/en_us_dedes/miscellanea:misc.Mode2
ltx/en_us_dedes/me.m01.d26:meMA.Ode8C12.ode	@ltx/en_us_dedes/miscellanea:misc.Ode8
ltx/en_us_dedes/me.m01.d26:meMA.Ode8C12.text	
ltx/en_us_dedes/me.m01.d26:meMA.Ode8C13.incipit	…
ltx/en_us_dedes/me.m01.d26:meMA.Ode8C13.melody	@ltx/en_us_dedes/he.h.m2:heHE.KaminosPote.name
ltx/en_us_dedes/me.m01.d26:meMA.Ode8C13.mode	@ltx/en_us_dedes/miscellanea:misc.Mode2
ltx/en_us_dedes/me.m01.d26:meMA.Ode8C13.ode	@ltx/en_us_dedes/miscellanea:misc.Ode8
ltx/en_us_dedes/me.m01.d26:meMA.Ode8C13.text	
ltx/en_us_dedes/me.m01.d26:meMA.Ode8C1T.incipit	…
ltx/en_us_dedes/me.m01.d26:meMA.Ode8C1T.melody	@ltx/en_us_dedes/he.h.m2:heHE.KaminosPote.name
ltx/en_us_dedes/me.m01.d26:meMA.Ode8C1T.mode	@ltx/en_us_dedes/miscellanea:misc.Mode2
ltx/en_us_dedes/me.m01.d26:meMA.Ode8C1T.ode	@ltx/en_us_dedes/miscellanea:misc.Ode8
ltx/en_us_dedes/me.m01.d26:meMA.Ode8C1T.text	
ltx/en_us_dedes/me.m01.d26:meMA.Ode8H.greekmelody	@ltx/en_us_dedes/he.h.m2:heHE.KaminosPote.greekname
ltx/en_us_dedes/me.m01.d26:meMA.Ode8H.incipit	@ltx/en_us_dedes/he.h.m2:heHE.KaminosPote.incipit
ltx/en_us_dedes/me.m01.d26:meMA.Ode8H.melody	@ltx/en_us_dedes/he.h.m2:heHE.KaminosPote.melody
ltx/en_us_dedes/me.m01.d26:meMA.Ode8H.mode	@ltx/en_us_dedes/miscellanea:misc.Mode2
ltx/en_us_dedes/me.m01.d26:meMA.Ode8H.ode	@ltx/en_us_dedes/miscellanea:misc.Ode8
ltx/en_us_dedes/me.m01.d26:meMA.Ode8H.text	@ltx/en_us_dedes/he.h.m2:heHE.KaminosPote.text
ltx/en_us_dedes/me.m01.d26:meMA.Ode9C11.greekmelody	@ltx/en_us_dedes/he.h.m2:heHE.AnarchouGennitoros.greekname
ltx/en_us_dedes/me.m01.d26:meMA.Ode9C11.incipit	…
ltx/en_us_dedes/me.m01.d26:meMA.Ode9C11.melody	@ltx/en_us_dedes/he.h.m2:heHE.AnarchouGennitoros.name
ltx/en_us_dedes/me.m01.d26:meMA.Ode9C11.mode	@ltx/en_us_dedes/miscellanea:misc.Mode2
ltx/en_us_dedes/me.m01.d26:meMA.Ode9C11.ode	@ltx/en_us_dedes/miscellanea:misc.Ode9
ltx/en_us_dedes/me.m01.d26:meMA.Ode9C11.text	
ltx/en_us_dedes/me.m01.d26:meMA.Ode9C12.incipit	…
ltx/en_us_dedes/me.m01.d26:meMA.Ode9C12.melody	@ltx/en_us_dedes/he.h.m2:heHE.AnarchouGennitoros.name
ltx/en_us_dedes/me.m01.d26:meMA.Ode9C12.mode	@ltx/en_us_dedes/miscellanea:misc.Mode2
ltx/en_us_dedes/me.m01.d26:meMA.Ode9C12.ode	@ltx/en_us_dedes/miscellanea:misc.Ode9
ltx/en_us_dedes/me.m01.d26:meMA.Ode9C12.text	
ltx/en_us_dedes/me.m01.d26:meMA.Ode9C13.incipit	…
ltx/en_us_dedes/me.m01.d26:meMA.Ode9C13.melody	@ltx/en_us_dedes/he.h.m2:heHE.AnarchouGennitoros.name
ltx/en_us_dedes/me.m01.d26:meMA.Ode9C13.mode	@ltx/en_us_dedes/miscellanea:misc.Mode2
ltx/en_us_dedes/me.m01.d26:meMA.Ode9C13.ode	@ltx/en_us_dedes/miscellanea:misc.Ode9
ltx/en_us_dedes/me.m01.d26:meMA.Ode9C13.text	
ltx/en_us_dedes/me.m01.d26:meMA.Ode9C1T.incipit	…
ltx/en_us_dedes/me.m01.d26:meMA.Ode9C1T.melody	@ltx/en_us_dedes/he.h.m2:heHE.AnarchouGennitoros.name
ltx/en_us_dedes/me.m01.d26:meMA.Ode9C1T.mode	@ltx/en_us_dedes/miscellanea:misc.Mode2
ltx/en_us_dedes/me.m01.d26:meMA.Ode9C1T.ode	@ltx/en_us_dedes/miscellanea:misc.Ode9
ltx/en_us_dedes/me.m01.d26:meMA.Ode9C1T.text	
ltx/en_us_dedes/me.m01.d26:meMA.Ode9H.greekmelody	@ltx/en_us_dedes/he.h.m2:heHE.AnarchouGennitoros.greekname
ltx/en_us_dedes/me.m01.d26:meMA.Ode9H.incipit	@ltx/en_us_dedes/he.h.m2:heHE.AnarchouGennitoros.incipit
ltx/en_us_dedes/me.m01.d26:meMA.Ode9H.melody	@ltx/en_us_dedes/he.h.m2:heHE.AnarchouGennitoros.melody
ltx/en_us_dedes/me.m01.d26:meMA.Ode9H.mode	@ltx/en_us_dedes/miscellanea:misc.Mode2
ltx/en_us_dedes/me.m01.d26:meMA.Ode9H.ode	@ltx/en_us_dedes/miscellanea:misc.Ode9
ltx/en_us_dedes/me.m01.d26:meMA.Ode9H.text	@ltx/en_us_dedes/he.h.m2:heHE.AnarchouGennitoros.text
ltx/en_us_dedes/me.m01.d26:meMA.Oikos1.text	O Xenophon, with your wife you traversed a strange way in a manner worthy of God, and you eluded nature, and thus manifest on earth as though bodiless. Hence the gates of heaven were opened to you, and you join chorus with the Angels, since you had become laborers of the Lord’s vineyard along with your sons. Therefore entreat Christ who awards the crowns, that the splendor of illumination be given to our darkened hearts, as we observe your luminous memorial. For Christ you have magnified.
ltx/en_us_dedes/me.m01.d26:meVE.Apolytikion1.incipit	@ltx/en_us_dedes/he.ga:heGA.OTheosTonPateronImon.incipit
ltx/en_us_dedes/me.m01.d26:meVE.Apolytikion1.melody	
ltx/en_us_dedes/me.m01.d26:meVE.Apolytikion1.mode	@ltx/en_us_dedes/miscellanea:misc.Mode4
ltx/en_us_dedes/me.m01.d26:meVE.Apolytikion1.text	@ltx/en_us_dedes/he.ga:heGA.OTheosTonPateronImon.text
ltx/en_us_dedes/me.m01.d26:meVE.SticStavrotheotokion.greekmelody	@ltx/en_us_dedes/he.a.m2:heAU.OteEkTouXylou.greekname
ltx/en_us_dedes/me.m01.d26:meVE.SticStavrotheotokion.incipit	@ltx/en_us_dedes/oc.m2.d4:ocVE.SticTheotokion.incipit
ltx/en_us_dedes/me.m01.d26:meVE.SticStavrotheotokion.melody	@ltx/en_us_dedes/he.a.m2:heAU.OteEkTouXylou.name
ltx/en_us_dedes/me.m01.d26:meVE.SticStavrotheotokion.mode	@ltx/en_us_dedes/miscellanea:misc.Mode2
ltx/en_us_dedes/me.m01.d26:meVE.SticStavrotheotokion.text	@ltx/en_us_dedes/oc.m2.d4:ocVE.SticTheotokion.text
ltx/en_us_dedes/me.m01.d26:meVE.SticTheotokion.greekmelody	@ltx/en_us_dedes/he.a.m2:heAU.OteEkTouXylou.greekname
ltx/en_us_dedes/me.m01.d26:meVE.SticTheotokion.incipit	@ltx/en_us_dedes/me.m01.d22:meVE.AposTheotokion.incipit
ltx/en_us_dedes/me.m01.d26:meVE.SticTheotokion.melody	@ltx/en_us_dedes/he.a.m2:heAU.OteEkTouXylou.name
ltx/en_us_dedes/me.m01.d26:meVE.SticTheotokion.mode	@ltx/en_us_dedes/miscellanea:misc.Mode2
ltx/en_us_dedes/me.m01.d26:meVE.SticTheotokion.text	@ltx/en_us_dedes/me.m01.d22:meVE.AposTheotokion.text
ltx/en_us_dedes/me.m01.d26:meVE.Stichera01.greekmelody	@ltx/en_us_dedes/he.a.m2:heAU.OteEkTouXylou.greekname
ltx/en_us_dedes/me.m01.d26:meVE.Stichera01.incipit	…
ltx/en_us_dedes/me.m01.d26:meVE.Stichera01.melody	@ltx/en_us_dedes/he.a.m2:heAU.OteEkTouXylou.name
ltx/en_us_dedes/me.m01.d26:meVE.Stichera01.mode	@ltx/en_us_dedes/miscellanea:misc.Mode2
ltx/en_us_dedes/me.m01.d26:meVE.Stichera01.text	
ltx/en_us_dedes/me.m01.d26:meVE.Stichera02.incipit	…
ltx/en_us_dedes/me.m01.d26:meVE.Stichera02.melody	@ltx/en_us_dedes/he.a.m2:heAU.OteEkTouXylou.name
ltx/en_us_dedes/me.m01.d26:meVE.Stichera02.mode	@ltx/en_us_dedes/miscellanea:misc.Mode2
ltx/en_us_dedes/me.m01.d26:meVE.Stichera02.text	
ltx/en_us_dedes/me.m01.d26:meVE.Stichera03.incipit	…
ltx/en_us_dedes/me.m01.d26:meVE.Stichera03.melody	@ltx/en_us_dedes/he.a.m2:heAU.OteEkTouXylou.name
ltx/en_us_dedes/me.m01.d26:meVE.Stichera03.mode	@ltx/en_us_dedes/miscellanea:misc.Mode2
ltx/en_us_dedes/me.m01.d26:meVE.Stichera03.text	
