ltx/en_us_dedes/sy.m04.d14:cl.syMA.commemoration01.text	[saint/com 1]
ltx/en_us_dedes/sy.m04.d14:cl.syMA.commemoration02.text	[saint/com 2]
ltx/en_us_dedes/sy.m04.d14:cl.syMA.commemoration03.text	[saint/com 3]
ltx/en_us_dedes/sy.m04.d14:cl.syMA.commemoration04.text	[saint/com 4]
ltx/en_us_dedes/sy.m04.d14:cl.syMA.commemoration05.text	[saint/com 5]
ltx/en_us_dedes/sy.m04.d14:cl.syMA.commemoration06.text	[saint/com list]
ltx/en_us_dedes/sy.m04.d14:syMA.commemoration01.couplet1.title	
ltx/en_us_dedes/sy.m04.d14:syMA.commemoration01.couplet1.verse1	
ltx/en_us_dedes/sy.m04.d14:syMA.commemoration01.couplet1.verse2	
ltx/en_us_dedes/sy.m04.d14:syMA.commemoration01.couplet2.title	
ltx/en_us_dedes/sy.m04.d14:syMA.commemoration01.couplet2.verse1	
ltx/en_us_dedes/sy.m04.d14:syMA.commemoration01.couplet2.verse2	
ltx/en_us_dedes/sy.m04.d14:syMA.commemoration01.couplet3.title	
ltx/en_us_dedes/sy.m04.d14:syMA.commemoration01.couplet3.verse1	
ltx/en_us_dedes/sy.m04.d14:syMA.commemoration01.couplet3.verse2	
ltx/en_us_dedes/sy.m04.d14:syMA.commemoration01.narration.p01	
ltx/en_us_dedes/sy.m04.d14:syMA.commemoration01.single1	
ltx/en_us_dedes/sy.m04.d14:syMA.commemoration01.text	On April 14 we commemorate the holy Apostles of the Seventy, Aristarchos, Pudens, and Trophimos.
ltx/en_us_dedes/sy.m04.d14:syMA.commemoration02.couplet1.title	@ltx/en_us_dedes/titles:ti.Verses
ltx/en_us_dedes/sy.m04.d14:syMA.commemoration02.couplet1.verse1	
ltx/en_us_dedes/sy.m04.d14:syMA.commemoration02.couplet1.verse2	
ltx/en_us_dedes/sy.m04.d14:syMA.commemoration02.narration.p01	
ltx/en_us_dedes/sy.m04.d14:syMA.commemoration02.text	On this day we also commemorate the holy Martyr Ardalion the Mime.
ltx/en_us_dedes/sy.m04.d14:syMA.commemoration03.couplet1.title	@ltx/en_us_dedes/titles:ti.Verses
ltx/en_us_dedes/sy.m04.d14:syMA.commemoration03.couplet1.verse1	
ltx/en_us_dedes/sy.m04.d14:syMA.commemoration03.couplet1.verse2	
ltx/en_us_dedes/sy.m04.d14:syMA.commemoration03.narration.p01	
ltx/en_us_dedes/sy.m04.d14:syMA.commemoration03.narration.p02	
ltx/en_us_dedes/sy.m04.d14:syMA.commemoration03.narration.p03	
ltx/en_us_dedes/sy.m04.d14:syMA.commemoration03.narration.p04	
ltx/en_us_dedes/sy.m04.d14:syMA.commemoration03.text	On this day we also commemorate the holy woman Martyr Thomais.
ltx/en_us_dedes/sy.m04.d14:syMA.commemoration04.couplet1.title	@ltx/en_us_dedes/titles:ti.Verses
ltx/en_us_dedes/sy.m04.d14:syMA.commemoration04.couplet1.verse1	
ltx/en_us_dedes/sy.m04.d14:syMA.commemoration04.couplet1.verse2	
ltx/en_us_dedes/sy.m04.d14:syMA.commemoration04.text	On this day was the contest and martyrdom of the holy Neo-martyr Demetrius of Peloponnesos, who was from Ligudista, Tryphilia, and who died by the sword in Tripoli in the year 1803.
ltx/en_us_dedes/sy.m04.d14:syMA.lastline	By the intercessions of Your Saints, O God, have mercy on us. Amen.
ltx/en_us_dedes/sy.m04.d14:syMA.note1	
ltx/en_us_dedes/sy.m04.d14:syMA.note2	
ltx/en_us_dedes/sy.m04.d14:syMA.note3	
ltx/en_us_dedes/sy.m04.d14:syMA.note4	
ltx/en_us_dedes/sy.m04.d14:syMA.note5	
ltx/en_us_dedes/sy.m04.d14:syMA.note6	
