ltx/en_us_dedes/sy.m05.d03:cl.syMA.commemoration01.text	[saint/com 1]
ltx/en_us_dedes/sy.m05.d03:cl.syMA.commemoration02.text	[saint/com 2]
ltx/en_us_dedes/sy.m05.d03:cl.syMA.commemoration03.text	[saint/com 3]
ltx/en_us_dedes/sy.m05.d03:cl.syMA.commemoration04.text	[saint/com 4]
ltx/en_us_dedes/sy.m05.d03:cl.syMA.commemoration05.text	[saint/com 5]
ltx/en_us_dedes/sy.m05.d03:cl.syMA.commemoration06.text	[saint/com list]
ltx/en_us_dedes/sy.m05.d03:syMA.commemoration01.couplet1.title	@ltx/en_us_dedes/titles:ti.Verses
ltx/en_us_dedes/sy.m05.d03:syMA.commemoration01.couplet1.verse1	
ltx/en_us_dedes/sy.m05.d03:syMA.commemoration01.couplet1.verse2	
ltx/en_us_dedes/sy.m05.d03:syMA.commemoration01.narration.p01	
ltx/en_us_dedes/sy.m05.d03:syMA.commemoration01.narration.p02	
ltx/en_us_dedes/sy.m05.d03:syMA.commemoration01.narration.p03	
ltx/en_us_dedes/sy.m05.d03:syMA.commemoration01.single1	
ltx/en_us_dedes/sy.m05.d03:syMA.commemoration01.text	On May 3 we commemorate the holy Martyrs Timothy and Maura.
ltx/en_us_dedes/sy.m05.d03:syMA.commemoration02.couplet1.title	@ltx/en_us_dedes/titles:ti.Verses
ltx/en_us_dedes/sy.m05.d03:syMA.commemoration02.couplet1.verse1	
ltx/en_us_dedes/sy.m05.d03:syMA.commemoration02.couplet1.verse2	
ltx/en_us_dedes/sy.m05.d03:syMA.commemoration02.narration.p01	
ltx/en_us_dedes/sy.m05.d03:syMA.commemoration02.text	On this day we commemorate the holy martyrs Diodorus and Rhodopian the deacon.
ltx/en_us_dedes/sy.m05.d03:syMA.commemoration03.couplet1.title	@ltx/en_us_dedes/titles:ti.Verses
ltx/en_us_dedes/sy.m05.d03:syMA.commemoration03.couplet1.verse1	
ltx/en_us_dedes/sy.m05.d03:syMA.commemoration03.couplet1.verse2	
ltx/en_us_dedes/sy.m05.d03:syMA.commemoration03.text	On this day we commemorate our righteous Father Peter the Wonderworker, Bishop of Argos.
ltx/en_us_dedes/sy.m05.d03:syMA.commemoration04.couplet1.title	@ltx/en_us_dedes/titles:ti.Verses
ltx/en_us_dedes/sy.m05.d03:syMA.commemoration04.couplet1.verse1	
ltx/en_us_dedes/sy.m05.d03:syMA.commemoration04.couplet1.verse2	
ltx/en_us_dedes/sy.m05.d03:syMA.commemoration04.text	The twenty-seven holy Martyrs died by fire.
ltx/en_us_dedes/sy.m05.d03:syMA.commemoration05.couplet1.title	@ltx/en_us_dedes/titles:ti.Verses
ltx/en_us_dedes/sy.m05.d03:syMA.commemoration05.couplet1.verse1	
ltx/en_us_dedes/sy.m05.d03:syMA.commemoration05.couplet1.verse2	
ltx/en_us_dedes/sy.m05.d03:syMA.commemoration05.narration.p01	
ltx/en_us_dedes/sy.m05.d03:syMA.commemoration05.narration.p02	
ltx/en_us_dedes/sy.m05.d03:syMA.commemoration05.single1	
ltx/en_us_dedes/sy.m05.d03:syMA.commemoration05.text	We also commemorate the holy glorious Great-martyr Xenia the Wonderworker.
ltx/en_us_dedes/sy.m05.d03:syMA.lastline	By their holy intercessions, O God, have mercy on us. Amen.
