ltx/en_us_dedes/sy.m08.d30:syMA.commemoration01.couplet1.title	@ltx/en_us_dedes/titles:ti.Verses
ltx/en_us_dedes/sy.m08.d30:syMA.commemoration01.couplet1.verse1	
ltx/en_us_dedes/sy.m08.d30:syMA.commemoration01.couplet1.verse2	
ltx/en_us_dedes/sy.m08.d30:syMA.commemoration01.couplet2.verse1	
ltx/en_us_dedes/sy.m08.d30:syMA.commemoration01.couplet2.verse2	
ltx/en_us_dedes/sy.m08.d30:syMA.commemoration01.couplet3.verse1	
ltx/en_us_dedes/sy.m08.d30:syMA.commemoration01.couplet3.verse2	
ltx/en_us_dedes/sy.m08.d30:syMA.commemoration01.single1	
ltx/en_us_dedes/sy.m08.d30:syMA.commemoration01.text	On August 30, we commemorate the holy Patriarchs of Constantinople Alexander, John and Paul the New.
ltx/en_us_dedes/sy.m08.d30:syMA.commemoration02.couplet1.title	@ltx/en_us_dedes/titles:ti.Verses
ltx/en_us_dedes/sy.m08.d30:syMA.commemoration02.couplet1.verse1	
ltx/en_us_dedes/sy.m08.d30:syMA.commemoration02.couplet1.verse2	
ltx/en_us_dedes/sy.m08.d30:syMA.commemoration02.narration.p01	
ltx/en_us_dedes/sy.m08.d30:syMA.commemoration02.single1	
ltx/en_us_dedes/sy.m08.d30:syMA.commemoration02.text	Today, we also commemorate devout Fantinus the miracle-worker.
ltx/en_us_dedes/sy.m08.d30:syMA.commemoration03.couplet1.title	@ltx/en_us_dedes/titles:ti.Verses
ltx/en_us_dedes/sy.m08.d30:syMA.commemoration03.couplet1.verse1	
ltx/en_us_dedes/sy.m08.d30:syMA.commemoration03.couplet1.verse2	
ltx/en_us_dedes/sy.m08.d30:syMA.commemoration03.text	Today, we also commemorate the holy sixteen Martyrs of Thebes.
ltx/en_us_dedes/sy.m08.d30:syMA.commemoration04.couplet1.title	@ltx/en_us_dedes/titles:ti.Verses
ltx/en_us_dedes/sy.m08.d30:syMA.commemoration04.couplet1.verse1	
ltx/en_us_dedes/sy.m08.d30:syMA.commemoration04.couplet1.verse2	
ltx/en_us_dedes/sy.m08.d30:syMA.commemoration04.text	Today, the six martyrs in Melitini died when they were thrown into the ocean.
ltx/en_us_dedes/sy.m08.d30:syMA.lastline	By the intercessions of Your saints, O God, have mercy on us. Amen.
