ltx/en_us_dedes/tr.d070:trCO.header	
ltx/en_us_dedes/tr.d070:trDA.commemoration.full	
ltx/en_us_dedes/tr.d070:trDA.commemoration.short	Holy Saturday
ltx/en_us_dedes/tr.d070:trDA.dismissal	@ltx/en_us_dedes/dismissals:dis00.holyfriday
ltx/en_us_dedes/tr.d070:trDA.insert1	
ltx/en_us_dedes/tr.d070:trDA.insert2	
ltx/en_us_dedes/tr.d070:trDA.note	
ltx/en_us_dedes/tr.d070:trDA.title	
ltx/en_us_dedes/tr.d070:trEM.header	The Graveside Lamentation on Friday Evening
ltx/en_us_dedes/tr.d070:trHO.commemorations	
ltx/en_us_dedes/tr.d070:trHO.daytitle	
ltx/en_us_dedes/tr.d070:trHO.description1	
ltx/en_us_dedes/tr.d070:trHO.description2	
ltx/en_us_dedes/tr.d070:trHO.note1	
ltx/en_us_dedes/tr.d070:trHO.note2	
ltx/en_us_dedes/tr.d070:trMA.C1.acrostic.notice1	
ltx/en_us_dedes/tr.d070:trMA.C1.acrostic.text	
ltx/en_us_dedes/tr.d070:trMA.C1.acrostic.title	The Canon.
ltx/en_us_dedes/tr.d070:trMA.C1.poet	Odes 1, 3, 4, and 5 are by Monk Mark, Bishop of Hydrus; Odes 6, 7, 8, and 9 are by Cosmas Hagiopolites. The Heirmoi are by a woman named Kassia.
ltx/en_us_dedes/tr.d070:trMA.C1.verse	@ltx/en_us_dedes/prayers:pr.verse_God.text
ltx/en_us_dedes/tr.d070:trMA.Encomia.title	The Lamentations.
ltx/en_us_dedes/tr.d070:trMA.Encomia100.mode	@ltx/en_us_dedes/miscellanea:misc.Mode5
ltx/en_us_dedes/tr.d070:trMA.Encomia100.title	First Stanza.
ltx/en_us_dedes/tr.d070:trMA.Encomia200.mode	@ltx/en_us_dedes/miscellanea:misc.Mode5
ltx/en_us_dedes/tr.d070:trMA.Encomia200.title	Second Stanza.
ltx/en_us_dedes/tr.d070:trMA.Encomia300.mode	@ltx/en_us_dedes/miscellanea:misc.Mode3
ltx/en_us_dedes/tr.d070:trMA.Encomia300.title	Third Stanza.
ltx/en_us_dedes/tr.d070:trMA.Exaposteilarion1.melody	
ltx/en_us_dedes/tr.d070:trMA.Exaposteilarion1.mode	@ltx/en_us_dedes/miscellanea:misc.Mode2
ltx/en_us_dedes/tr.d070:trMA.Exaposteilarion1.text	@ltx/en_us_dedes/ho.ho03:hoMA.SunExapVerse1.text
ltx/en_us_dedes/tr.d070:trMA.Kathisma11.greekmelody	@ltx/en_us_dedes/he.a.m1:heAU.TonTafonSouSotir.greekname
ltx/en_us_dedes/tr.d070:trMA.Kathisma11.incipit	From Pilate Joseph asked for…
ltx/en_us_dedes/tr.d070:trMA.Kathisma11.melody	@ltx/en_us_dedes/he.a.m1:heAU.TonTafonSouSotir.name
ltx/en_us_dedes/tr.d070:trMA.Kathisma11.mode	@ltx/en_us_dedes/miscellanea:misc.Mode1
ltx/en_us_dedes/tr.d070:trMA.Kathisma11.text	From Pilate Joseph asked for Your worshipful Body. * He wraps it in a clean linen shroud and with spices * anoints it for burial and he lays it in his new tomb. * Then at early dawn the women came with their ointments, * and they cried, “Show us the Resurrection, O Savior, * as You had foretold, O Christ.”
ltx/en_us_dedes/tr.d070:trMA.Kathisma12.greekmelody	@ltx/en_us_dedes/he.a.m1:heAU.TonTafonSouSotir.greekname
ltx/en_us_dedes/tr.d070:trMA.Kathisma12.incipit	And they cried, “Show us…
ltx/en_us_dedes/tr.d070:trMA.Kathisma12.melody	@ltx/en_us_dedes/he.a.m1:heAU.TonTafonSouSotir.name
ltx/en_us_dedes/tr.d070:trMA.Kathisma12.mode	@ltx/en_us_dedes/miscellanea:misc.Mode1
ltx/en_us_dedes/tr.d070:trMA.Kathisma12.text	And they cried, “Show us the Resurrection, O Savior, * as You had foretold, O Christ.”
ltx/en_us_dedes/tr.d070:trMA.Kathisma13.greekmelody	@ltx/en_us_dedes/he.a.m1:heAU.TonTafonSouSotir.greekname
ltx/en_us_dedes/tr.d070:trMA.Kathisma13.incipit	Astounded were the hosts of…
ltx/en_us_dedes/tr.d070:trMA.Kathisma13.melody	@ltx/en_us_dedes/he.a.m1:heAU.TonTafonSouSotir.name
ltx/en_us_dedes/tr.d070:trMA.Kathisma13.mode	@ltx/en_us_dedes/miscellanea:misc.Mode1
ltx/en_us_dedes/tr.d070:trMA.Kathisma13.text	Astounded were the hosts of the Angels, beholding * how He, who sits above in the bosom of the Father, * is laid in a sepulcher, the Immortal One, as a corpse. * He is surrounded by angelic armies, who praise Him * and, together with the dead in Hades, give glory * to Him, their Creator and Lord.
ltx/en_us_dedes/tr.d070:trMA.Kontakion1.incipit	…
ltx/en_us_dedes/tr.d070:trMA.Kontakion1.melody	
ltx/en_us_dedes/tr.d070:trMA.Kontakion1.mode	@ltx/en_us_dedes/miscellanea:misc.Mode2
ltx/en_us_dedes/tr.d070:trMA.Kontakion1.text	
ltx/en_us_dedes/tr.d070:trMA.Lauds1.incipit	Today, the sepulcher holds Him…
ltx/en_us_dedes/tr.d070:trMA.Lauds1.melody	@ltx/en_us_dedes/miscellanea:misc.Idiomelon
ltx/en_us_dedes/tr.d070:trMA.Lauds1.mode	@ltx/en_us_dedes/miscellanea:misc.Mode2
ltx/en_us_dedes/tr.d070:trMA.Lauds1.text	Today, the sepulcher holds Him who holds creation in the palm of His hand, and a stone covers Him who covers the heavens with virtue. Life sleeps, and Hades trembles, and Adam is released from his bonds. Glory to Your dispensation, through which, when You had accomplished all, You gave us the eternal Sabbath rest, Your all-holy Resurrection from the dead.
ltx/en_us_dedes/tr.d070:trMA.Lauds2.incipit	What is this wonder we…
ltx/en_us_dedes/tr.d070:trMA.Lauds2.melody	@ltx/en_us_dedes/miscellanea:misc.Idiomelon
ltx/en_us_dedes/tr.d070:trMA.Lauds2.mode	@ltx/en_us_dedes/miscellanea:misc.Mode2
ltx/en_us_dedes/tr.d070:trMA.Lauds2.text	What is this wonder we see now? What is the present rest? The King of the ages has completed the dispensation with His Passion, and now He takes His Sabbath rest in the tomb, granting us a new Sabbath. Let us cry out to Him, “Arise, O God; judge the earth, for You reign forever, You who have immeasurable great mercy.”
ltx/en_us_dedes/tr.d070:trMA.Lauds3.incipit	Come, let us see our…
ltx/en_us_dedes/tr.d070:trMA.Lauds3.melody	@ltx/en_us_dedes/miscellanea:misc.Idiomelon
ltx/en_us_dedes/tr.d070:trMA.Lauds3.mode	@ltx/en_us_dedes/miscellanea:misc.Mode2
ltx/en_us_dedes/tr.d070:trMA.Lauds3.text	Come, let us see our Life, lying in the tomb. He is there so that He may give life to those who lie in the graves. Come, as we see Him, from the seed of Judah, sleeping today, and let us say to Him the words of the Prophet, “You bowed down, and slept as a lion; and who shall rouse You, O King? So, arise by Your own power, You who willingly gave yourself for us! Glory to You, O Lord!”
ltx/en_us_dedes/tr.d070:trMA.Lauds4.incipit	Joseph asked for the Body…
ltx/en_us_dedes/tr.d070:trMA.Lauds4.melody	@ltx/en_us_dedes/miscellanea:misc.Idiomelon
ltx/en_us_dedes/tr.d070:trMA.Lauds4.mode	@ltx/en_us_dedes/miscellanea:misc.Mode6
ltx/en_us_dedes/tr.d070:trMA.Lauds4.text	Joseph asked for the Body of Jesus and he laid it in his own new tomb; for Jesus had to emerge from the grave as from His bridal chamber. “You who shattered the dominion of death and opened the gates of Paradise for all mankind, glory to You!”
ltx/en_us_dedes/tr.d070:trMA.LaudsGlory.incipit	Moses, the great Prophet, mystically…
ltx/en_us_dedes/tr.d070:trMA.LaudsGlory.melody	@ltx/en_us_dedes/miscellanea:misc.Idiomelon
ltx/en_us_dedes/tr.d070:trMA.LaudsGlory.mode	@ltx/en_us_dedes/miscellanea:misc.Mode6
ltx/en_us_dedes/tr.d070:trMA.LaudsGlory.text	Moses, the great Prophet, mystically prefigured this day saying, “Then God blessed the seventh day.” For this is the blessed Sabbath; this is the day of rest, on which the only-begotten Son of God rested from all His works, observing the Sabbath rest in the flesh, through the dispensation involving death. And returning once again to what He was, through the Resurrection, He granted to us eternal life, for He alone is good and benevolent.
ltx/en_us_dedes/tr.d070:trMA.LaudsTheotokion.incipit	@ltx/en_us_dedes/oc.m2.d1:ocMA.Kathisma23.incipit
ltx/en_us_dedes/tr.d070:trMA.LaudsTheotokion.melody	
ltx/en_us_dedes/tr.d070:trMA.LaudsTheotokion.mode	@ltx/en_us_dedes/miscellanea:misc.Mode2
ltx/en_us_dedes/tr.d070:trMA.LaudsTheotokion.text	@ltx/en_us_dedes/oc.m2.d1:ocMA.Kathisma23.text
ltx/en_us_dedes/tr.d070:trMA.MM.Evlogetaria1.text	@ltx/en_us_dedes/properties:media.key
ltx/en_us_dedes/tr.d070:trMA.MM.Evlogetaria2.text	@ltx/en_us_dedes/properties:media.key
ltx/en_us_dedes/tr.d070:trMA.MM.Evlogetaria3.text	@ltx/en_us_dedes/properties:media.key
ltx/en_us_dedes/tr.d070:trMA.MM.Evlogetaria4.text	@ltx/en_us_dedes/properties:media.key
ltx/en_us_dedes/tr.d070:trMA.MM.Evlogetaria5.text	@ltx/en_us_dedes/properties:media.key
ltx/en_us_dedes/tr.d070:trMA.MM.Evlogetaria6.text	@ltx/en_us_dedes/properties:media.key
ltx/en_us_dedes/tr.d070:trMA.MM.Evlogetaria7.text	@ltx/en_us_dedes/properties:media.key
ltx/en_us_dedes/tr.d070:trMA.Ode1C11.greekmelody	@ltx/en_us_dedes/he.h.m6:heHE.KymatiThalassis.greekname
ltx/en_us_dedes/tr.d070:trMA.Ode1C11.incipit	I will sing an anthem…
ltx/en_us_dedes/tr.d070:trMA.Ode1C11.melody	@ltx/en_us_dedes/he.h.m6:heHE.KymatiThalassis.name
ltx/en_us_dedes/tr.d070:trMA.Ode1C11.mode	@ltx/en_us_dedes/miscellanea:misc.Mode6
ltx/en_us_dedes/tr.d070:trMA.Ode1C11.ode	@ltx/en_us_dedes/miscellanea:misc.Ode1
ltx/en_us_dedes/tr.d070:trMA.Ode1C11.text	I will sing an anthem of exodus and a funeral hymn to You, O Lord my God, who by Your burial opened the entrances of life to me. By Your death You put Hades and death to death.
ltx/en_us_dedes/tr.d070:trMA.Ode1C12.incipit	Those who are above earth…
ltx/en_us_dedes/tr.d070:trMA.Ode1C12.melody	@ltx/en_us_dedes/he.h.m6:heHE.KymatiThalassis.name
ltx/en_us_dedes/tr.d070:trMA.Ode1C12.mode	@ltx/en_us_dedes/miscellanea:misc.Mode6
ltx/en_us_dedes/tr.d070:trMA.Ode1C12.ode	@ltx/en_us_dedes/miscellanea:misc.Ode1
ltx/en_us_dedes/tr.d070:trMA.Ode1C12.text	Those who are above earth and those in the netherworld saw You on the throne on high and down below within the grave, O my Savior. They were agitated by Your death, for they saw You dead, incomprehensibly, O Source of Life.
ltx/en_us_dedes/tr.d070:trMA.Ode1C13.incipit	Savior, You descended…
ltx/en_us_dedes/tr.d070:trMA.Ode1C13.melody	@ltx/en_us_dedes/he.h.m6:heHE.KymatiThalassis.name
ltx/en_us_dedes/tr.d070:trMA.Ode1C13.mode	@ltx/en_us_dedes/miscellanea:misc.Mode6
ltx/en_us_dedes/tr.d070:trMA.Ode1C13.ode	@ltx/en_us_dedes/miscellanea:misc.Ode1
ltx/en_us_dedes/tr.d070:trMA.Ode1C13.text	Savior, You descended into the nethermost regions of the earth, to fill all things with Your glory, benevolent Master. In Adam my substance was not hidden from You. You are buried, and You renew me who had been destroyed.
ltx/en_us_dedes/tr.d070:trMA.Ode1C1H.greekmelody	@ltx/en_us_dedes/he.h.m6:heHE.KymatiThalassis.greekname
ltx/en_us_dedes/tr.d070:trMA.Ode1C1H.incipit	@ltx/en_us_dedes/he.h.m6:heHE.KymatiThalassis.incipit
ltx/en_us_dedes/tr.d070:trMA.Ode1C1H.melody	@ltx/en_us_dedes/he.h.m6:heHE.KymatiThalassis.melody
ltx/en_us_dedes/tr.d070:trMA.Ode1C1H.mode	@ltx/en_us_dedes/miscellanea:misc.Mode6
ltx/en_us_dedes/tr.d070:trMA.Ode1C1H.ode	@ltx/en_us_dedes/miscellanea:misc.Ode1
ltx/en_us_dedes/tr.d070:trMA.Ode1C1H.text	@ltx/en_us_dedes/he.h.m6:heHE.KymatiThalassis.text
ltx/en_us_dedes/tr.d070:trMA.Ode1K.incipit	@ltx/en_us_dedes/he.h.m6:heHE.KymatiThalassis.incipit
ltx/en_us_dedes/tr.d070:trMA.Ode1K.melody	@ltx/en_us_dedes/he.h.m6:heHE.KymatiThalassis.melody
ltx/en_us_dedes/tr.d070:trMA.Ode1K.mode	@ltx/en_us_dedes/miscellanea:misc.Mode6
ltx/en_us_dedes/tr.d070:trMA.Ode1K.ode	@ltx/en_us_dedes/miscellanea:misc.Ode1
ltx/en_us_dedes/tr.d070:trMA.Ode1K.text	@ltx/en_us_dedes/he.h.m6:heHE.KymatiThalassis.text
ltx/en_us_dedes/tr.d070:trMA.Ode3C11.greekmelody	@ltx/en_us_dedes/he.h.m6:heHE.SeTonEpiYdaton.greekname
ltx/en_us_dedes/tr.d070:trMA.Ode3C11.incipit	Of old by many visions…
ltx/en_us_dedes/tr.d070:trMA.Ode3C11.melody	@ltx/en_us_dedes/he.h.m6:heHE.SeTonEpiYdaton.name
ltx/en_us_dedes/tr.d070:trMA.Ode3C11.mode	@ltx/en_us_dedes/miscellanea:misc.Mode6
ltx/en_us_dedes/tr.d070:trMA.Ode3C11.ode	@ltx/en_us_dedes/miscellanea:misc.Ode3
ltx/en_us_dedes/tr.d070:trMA.Ode3C11.text	Of old by many visions, You revealed the symbols of Your burial. But what You once kept secret, O Master, now, as God and man, You clearly showed to those in Hades, who cried aloud, “No one is holy, but You, O Lord.”
ltx/en_us_dedes/tr.d070:trMA.Ode3C12.incipit	Savior, when You extended Your…
ltx/en_us_dedes/tr.d070:trMA.Ode3C12.melody	@ltx/en_us_dedes/he.h.m6:heHE.SeTonEpiYdaton.name
ltx/en_us_dedes/tr.d070:trMA.Ode3C12.mode	@ltx/en_us_dedes/miscellanea:misc.Mode6
ltx/en_us_dedes/tr.d070:trMA.Ode3C12.ode	@ltx/en_us_dedes/miscellanea:misc.Ode3
ltx/en_us_dedes/tr.d070:trMA.Ode3C12.text	Savior, when You extended Your hands, You united things that had been divided. By Your confinement in the shroud and the sepulcher, You set free those who were fettered. To You they cry aloud, “No one is holy, but You, O Lord.”
ltx/en_us_dedes/tr.d070:trMA.Ode3C13.incipit	You, uncontainable Master, were confined…
ltx/en_us_dedes/tr.d070:trMA.Ode3C13.melody	@ltx/en_us_dedes/he.h.m6:heHE.SeTonEpiYdaton.name
ltx/en_us_dedes/tr.d070:trMA.Ode3C13.mode	@ltx/en_us_dedes/miscellanea:misc.Mode6
ltx/en_us_dedes/tr.d070:trMA.Ode3C13.ode	@ltx/en_us_dedes/miscellanea:misc.Ode3
ltx/en_us_dedes/tr.d070:trMA.Ode3C13.text	You, uncontainable Master, were confined by the tomb and seals, of Your own will. By Your actions as benevolent God of all, You made Your power known to all, who cry aloud, “No one is holy, but You, O Lord.”
ltx/en_us_dedes/tr.d070:trMA.Ode3C1H.greekmelody	@ltx/en_us_dedes/he.h.m6:heHE.SeTonEpiYdaton.greekname
ltx/en_us_dedes/tr.d070:trMA.Ode3C1H.incipit	@ltx/en_us_dedes/he.h.m6:heHE.SeTonEpiYdaton.incipit
ltx/en_us_dedes/tr.d070:trMA.Ode3C1H.melody	@ltx/en_us_dedes/he.h.m6:heHE.SeTonEpiYdaton.melody
ltx/en_us_dedes/tr.d070:trMA.Ode3C1H.mode	@ltx/en_us_dedes/miscellanea:misc.Mode6
ltx/en_us_dedes/tr.d070:trMA.Ode3C1H.ode	@ltx/en_us_dedes/miscellanea:misc.Ode3
ltx/en_us_dedes/tr.d070:trMA.Ode3C1H.text	@ltx/en_us_dedes/he.h.m6:heHE.SeTonEpiYdaton.text
ltx/en_us_dedes/tr.d070:trMA.Ode3K.incipit	@ltx/en_us_dedes/he.h.m6:heHE.SeTonEpiYdaton.incipit
ltx/en_us_dedes/tr.d070:trMA.Ode3K.melody	@ltx/en_us_dedes/he.h.m6:heHE.SeTonEpiYdaton.melody
ltx/en_us_dedes/tr.d070:trMA.Ode3K.mode	@ltx/en_us_dedes/miscellanea:misc.Mode6
ltx/en_us_dedes/tr.d070:trMA.Ode3K.ode	@ltx/en_us_dedes/miscellanea:misc.Ode3
ltx/en_us_dedes/tr.d070:trMA.Ode3K.text	@ltx/en_us_dedes/he.h.m6:heHE.SeTonEpiYdaton.text
ltx/en_us_dedes/tr.d070:trMA.Ode3Kathisma1.greekmelody	@ltx/en_us_dedes/he.a.m1:heAU.TonTafonSouSotir.greekname
ltx/en_us_dedes/tr.d070:trMA.Ode3Kathisma1.incipit	@ltx/en_us_dedes/he.a.m1:heAU.TonTafonSouSotir.incipit
ltx/en_us_dedes/tr.d070:trMA.Ode3Kathisma1.melody	@ltx/en_us_dedes/he.a.m1:heAU.TonTafonSouSotir.melody
ltx/en_us_dedes/tr.d070:trMA.Ode3Kathisma1.mode	@ltx/en_us_dedes/miscellanea:misc.Mode1
ltx/en_us_dedes/tr.d070:trMA.Ode3Kathisma1.text	@ltx/en_us_dedes/he.a.m1:heAU.TonTafonSouSotir.text
ltx/en_us_dedes/tr.d070:trMA.Ode4C11.greekmelody	@ltx/en_us_dedes/he.h.m6:heHE.TinEnStavroSou.greekname
ltx/en_us_dedes/tr.d070:trMA.Ode4C11.incipit	Today, You sanctified the seventh…
ltx/en_us_dedes/tr.d070:trMA.Ode4C11.melody	@ltx/en_us_dedes/he.h.m6:heHE.TinEnStavroSou.name
ltx/en_us_dedes/tr.d070:trMA.Ode4C11.mode	@ltx/en_us_dedes/miscellanea:misc.Mode6
ltx/en_us_dedes/tr.d070:trMA.Ode4C11.ode	@ltx/en_us_dedes/miscellanea:misc.Ode4
ltx/en_us_dedes/tr.d070:trMA.Ode4C11.text	Today, You sanctified the seventh day, which You had blessed of old, when You rested from Your works. For You, O Savior, generate and renew all things; and, while keeping the Sabbath, You are reclaiming them.
ltx/en_us_dedes/tr.d070:trMA.Ode4C12.incipit	When You, O Logos, were…
ltx/en_us_dedes/tr.d070:trMA.Ode4C12.melody	@ltx/en_us_dedes/he.h.m6:heHE.TinEnStavroSou.name
ltx/en_us_dedes/tr.d070:trMA.Ode4C12.mode	@ltx/en_us_dedes/miscellanea:misc.Mode6
ltx/en_us_dedes/tr.d070:trMA.Ode4C12.ode	@ltx/en_us_dedes/miscellanea:misc.Ode4
ltx/en_us_dedes/tr.d070:trMA.Ode4C12.text	When You, O Logos, were victorious through superior strength, Your soul was separated from Your body; and it shattered the bonds of both Death and Hades by the power of Your divinity.
ltx/en_us_dedes/tr.d070:trMA.Ode4C13.incipit	Hades was embittered in meeting…
ltx/en_us_dedes/tr.d070:trMA.Ode4C13.melody	@ltx/en_us_dedes/he.h.m6:heHE.TinEnStavroSou.name
ltx/en_us_dedes/tr.d070:trMA.Ode4C13.mode	@ltx/en_us_dedes/miscellanea:misc.Mode6
ltx/en_us_dedes/tr.d070:trMA.Ode4C13.ode	@ltx/en_us_dedes/miscellanea:misc.Ode4
ltx/en_us_dedes/tr.d070:trMA.Ode4C13.text	Hades was embittered in meeting You, O Logos, seeing a deified mortal, who bore the marks of bruises and yet was all-powerful. At the fearful sight, it was speechless and horrified.
ltx/en_us_dedes/tr.d070:trMA.Ode4C1H.greekmelody	@ltx/en_us_dedes/he.h.m6:heHE.TinEnStavroSou.greekname
ltx/en_us_dedes/tr.d070:trMA.Ode4C1H.incipit	@ltx/en_us_dedes/he.h.m6:heHE.TinEnStavroSou.incipit
ltx/en_us_dedes/tr.d070:trMA.Ode4C1H.melody	@ltx/en_us_dedes/he.h.m6:heHE.TinEnStavroSou.melody
ltx/en_us_dedes/tr.d070:trMA.Ode4C1H.mode	@ltx/en_us_dedes/miscellanea:misc.Mode6
ltx/en_us_dedes/tr.d070:trMA.Ode4C1H.ode	@ltx/en_us_dedes/miscellanea:misc.Ode4
ltx/en_us_dedes/tr.d070:trMA.Ode4C1H.text	@ltx/en_us_dedes/he.h.m6:heHE.TinEnStavroSou.text
ltx/en_us_dedes/tr.d070:trMA.Ode4K.incipit	@ltx/en_us_dedes/he.h.m6:heHE.TinEnStavroSou.incipit
ltx/en_us_dedes/tr.d070:trMA.Ode4K.melody	@ltx/en_us_dedes/he.h.m6:heHE.TinEnStavroSou.melody
ltx/en_us_dedes/tr.d070:trMA.Ode4K.mode	@ltx/en_us_dedes/miscellanea:misc.Mode6
ltx/en_us_dedes/tr.d070:trMA.Ode4K.ode	@ltx/en_us_dedes/miscellanea:misc.Ode4
ltx/en_us_dedes/tr.d070:trMA.Ode4K.text	@ltx/en_us_dedes/he.h.m6:heHE.TinEnStavroSou.text
ltx/en_us_dedes/tr.d070:trMA.Ode5C11.greekmelody	@ltx/en_us_dedes/he.h.m6:heHE.TheofaneiasSouChriste.greekname
ltx/en_us_dedes/tr.d070:trMA.Ode5C11.incipit	Since You, the Fashioner, became…
ltx/en_us_dedes/tr.d070:trMA.Ode5C11.melody	@ltx/en_us_dedes/he.h.m6:heHE.TheofaneiasSouChriste.name
ltx/en_us_dedes/tr.d070:trMA.Ode5C11.mode	@ltx/en_us_dedes/miscellanea:misc.Mode6
ltx/en_us_dedes/tr.d070:trMA.Ode5C11.ode	@ltx/en_us_dedes/miscellanea:misc.Ode5
ltx/en_us_dedes/tr.d070:trMA.Ode5C11.text	Since You, the Fashioner, became a human being, You remake the earthborn; and the shroud and sepulcher, O Word of God, indicate the mystery borne in You. For Joseph, the respected member of the council, now performs the counsel of Your Father, who magnificently in You makes me new again.
ltx/en_us_dedes/tr.d070:trMA.Ode5C12.incipit	You change mortality through death…
ltx/en_us_dedes/tr.d070:trMA.Ode5C12.melody	@ltx/en_us_dedes/he.h.m6:heHE.TheofaneiasSouChriste.name
ltx/en_us_dedes/tr.d070:trMA.Ode5C12.mode	@ltx/en_us_dedes/miscellanea:misc.Mode6
ltx/en_us_dedes/tr.d070:trMA.Ode5C12.ode	@ltx/en_us_dedes/miscellanea:misc.Ode5
ltx/en_us_dedes/tr.d070:trMA.Ode5C12.text	You change mortality through death; by means of burial You change corruption; for properly, as God, You make incorruptible and immortal that which You had assumed. For Your body saw no corruption; likewise, Your soul was not abandoned in Hades, O Master, extraordinarily.
ltx/en_us_dedes/tr.d070:trMA.Ode5C13.incipit	Born of a woman spared…
ltx/en_us_dedes/tr.d070:trMA.Ode5C13.melody	@ltx/en_us_dedes/he.h.m6:heHE.TheofaneiasSouChriste.name
ltx/en_us_dedes/tr.d070:trMA.Ode5C13.mode	@ltx/en_us_dedes/miscellanea:misc.Mode6
ltx/en_us_dedes/tr.d070:trMA.Ode5C13.ode	@ltx/en_us_dedes/miscellanea:misc.Ode5
ltx/en_us_dedes/tr.d070:trMA.Ode5C13.text	Born of a woman spared travail, You were yet speared in the side, O my Maker. From this side You wrought Eve’s refashioning; for becoming Adam, You fell asleep supernaturally in a life-producing sleep, and then You raised up Life herself from slumber and from corruption, as almighty God.
ltx/en_us_dedes/tr.d070:trMA.Ode5C1H.greekmelody	@ltx/en_us_dedes/he.h.m6:heHE.TheofaneiasSouChriste.greekname
ltx/en_us_dedes/tr.d070:trMA.Ode5C1H.incipit	@ltx/en_us_dedes/he.h.m6:heHE.TheofaneiasSouChriste.incipit
ltx/en_us_dedes/tr.d070:trMA.Ode5C1H.melody	@ltx/en_us_dedes/he.h.m6:heHE.TheofaneiasSouChriste.melody
ltx/en_us_dedes/tr.d070:trMA.Ode5C1H.mode	@ltx/en_us_dedes/miscellanea:misc.Mode6
ltx/en_us_dedes/tr.d070:trMA.Ode5C1H.ode	@ltx/en_us_dedes/miscellanea:misc.Ode5
ltx/en_us_dedes/tr.d070:trMA.Ode5C1H.text	@ltx/en_us_dedes/he.h.m6:heHE.TheofaneiasSouChriste.text
ltx/en_us_dedes/tr.d070:trMA.Ode5K.incipit	@ltx/en_us_dedes/he.h.m6:heHE.TheofaneiasSouChriste.incipit
ltx/en_us_dedes/tr.d070:trMA.Ode5K.melody	@ltx/en_us_dedes/he.h.m6:heHE.TheofaneiasSouChriste.melody
ltx/en_us_dedes/tr.d070:trMA.Ode5K.mode	@ltx/en_us_dedes/miscellanea:misc.Mode6
ltx/en_us_dedes/tr.d070:trMA.Ode5K.ode	@ltx/en_us_dedes/miscellanea:misc.Ode5
ltx/en_us_dedes/tr.d070:trMA.Ode5K.text	@ltx/en_us_dedes/he.h.m6:heHE.TheofaneiasSouChriste.text
ltx/en_us_dedes/tr.d070:trMA.Ode6C11.greekmelody	@ltx/en_us_dedes/he.h.m6:heHE.SyneschethiAllOuKateschethi.greekname
ltx/en_us_dedes/tr.d070:trMA.Ode6C11.incipit	You were murdered, O Word…
ltx/en_us_dedes/tr.d070:trMA.Ode6C11.melody	@ltx/en_us_dedes/he.h.m6:heHE.SyneschethiAllOuKateschethi.name
ltx/en_us_dedes/tr.d070:trMA.Ode6C11.mode	@ltx/en_us_dedes/miscellanea:misc.Mode6
ltx/en_us_dedes/tr.d070:trMA.Ode6C11.ode	@ltx/en_us_dedes/miscellanea:misc.Ode6
ltx/en_us_dedes/tr.d070:trMA.Ode6C11.text	You were murdered, O Word, but not sundered from the flesh in which You shared. For even if Your temple was destroyed at the time of Your Passion, nevertheless, one was the hypostasis of Your human flesh and of Your Godhead. For in both natures, You are one Son, the Word of God, as You are truly God and man.
ltx/en_us_dedes/tr.d070:trMA.Ode6C12.incipit	Adam’s failure resulted in death…
ltx/en_us_dedes/tr.d070:trMA.Ode6C12.melody	@ltx/en_us_dedes/he.h.m6:heHE.SyneschethiAllOuKateschethi.name
ltx/en_us_dedes/tr.d070:trMA.Ode6C12.mode	@ltx/en_us_dedes/miscellanea:misc.Mode6
ltx/en_us_dedes/tr.d070:trMA.Ode6C12.ode	@ltx/en_us_dedes/miscellanea:misc.Ode6
ltx/en_us_dedes/tr.d070:trMA.Ode6C12.text	Adam’s failure resulted in death for humanity but not for God. For though the human nature of Your flesh had suffered at the Passion, yet Your divinity remained impassible. By Your resurrection, You transformed Your corruptible body to incorruption, and made it a source of life incorruptible.
ltx/en_us_dedes/tr.d070:trMA.Ode6C13.incipit	Hades reigned over the human…
ltx/en_us_dedes/tr.d070:trMA.Ode6C13.melody	@ltx/en_us_dedes/he.h.m6:heHE.SyneschethiAllOuKateschethi.name
ltx/en_us_dedes/tr.d070:trMA.Ode6C13.mode	@ltx/en_us_dedes/miscellanea:misc.Mode6
ltx/en_us_dedes/tr.d070:trMA.Ode6C13.ode	@ltx/en_us_dedes/miscellanea:misc.Ode6
ltx/en_us_dedes/tr.d070:trMA.Ode6C13.text	Hades reigned over the human race, but would not do so forever. For after You were buried, You broke the bolts and bars of death asunder, O mighty Master, with Your hand that causes life. You proclaimed the sure and true redemption to those who lay asleep there from all ages, O Savior, and You became the firstborn of the dead.
ltx/en_us_dedes/tr.d070:trMA.Ode6C1H.greekmelody	@ltx/en_us_dedes/he.h.m6:heHE.SyneschethiAllOuKateschethi.greekname
ltx/en_us_dedes/tr.d070:trMA.Ode6C1H.incipit	@ltx/en_us_dedes/he.h.m6:heHE.SyneschethiAllOuKateschethi.incipit
ltx/en_us_dedes/tr.d070:trMA.Ode6C1H.melody	@ltx/en_us_dedes/he.h.m6:heHE.SyneschethiAllOuKateschethi.melody
ltx/en_us_dedes/tr.d070:trMA.Ode6C1H.mode	@ltx/en_us_dedes/miscellanea:misc.Mode6
ltx/en_us_dedes/tr.d070:trMA.Ode6C1H.ode	@ltx/en_us_dedes/miscellanea:misc.Ode6
ltx/en_us_dedes/tr.d070:trMA.Ode6C1H.text	@ltx/en_us_dedes/he.h.m6:heHE.SyneschethiAllOuKateschethi.text
ltx/en_us_dedes/tr.d070:trMA.Ode6K.incipit	@ltx/en_us_dedes/he.h.m6:heHE.SyneschethiAllOuKateschethi.incipit
ltx/en_us_dedes/tr.d070:trMA.Ode6K.melody	@ltx/en_us_dedes/he.h.m6:heHE.SyneschethiAllOuKateschethi.melody
ltx/en_us_dedes/tr.d070:trMA.Ode6K.mode	@ltx/en_us_dedes/miscellanea:misc.Mode6
ltx/en_us_dedes/tr.d070:trMA.Ode6K.ode	@ltx/en_us_dedes/miscellanea:misc.Ode6
ltx/en_us_dedes/tr.d070:trMA.Ode6K.text	@ltx/en_us_dedes/he.h.m6:heHE.SyneschethiAllOuKateschethi.text
ltx/en_us_dedes/tr.d070:trMA.Ode7C11.greekmelody	@ltx/en_us_dedes/he.h.m6:heHE.AfrastonThavma.greekname
ltx/en_us_dedes/tr.d070:trMA.Ode7C11.incipit	Hades is wounded at its…
ltx/en_us_dedes/tr.d070:trMA.Ode7C11.melody	@ltx/en_us_dedes/he.h.m6:heHE.AfrastonThavma.name
ltx/en_us_dedes/tr.d070:trMA.Ode7C11.mode	@ltx/en_us_dedes/miscellanea:misc.Mode6
ltx/en_us_dedes/tr.d070:trMA.Ode7C11.ode	@ltx/en_us_dedes/miscellanea:misc.Ode7
ltx/en_us_dedes/tr.d070:trMA.Ode7C11.text	Hades is wounded at its heart by receiving Him, whom a lance had wounded in the side. And it groans, consumed by the fire of divinity, for the salvation of us who sing, “O our God and Redeemer, You are blessed.”
ltx/en_us_dedes/tr.d070:trMA.Ode7C12.incipit	The sepulcher is precious. When…
ltx/en_us_dedes/tr.d070:trMA.Ode7C12.melody	@ltx/en_us_dedes/he.h.m6:heHE.AfrastonThavma.name
ltx/en_us_dedes/tr.d070:trMA.Ode7C12.mode	@ltx/en_us_dedes/miscellanea:misc.Mode6
ltx/en_us_dedes/tr.d070:trMA.Ode7C12.ode	@ltx/en_us_dedes/miscellanea:misc.Ode7
ltx/en_us_dedes/tr.d070:trMA.Ode7C12.text	The sepulcher is precious. When it received within itself the Creator as though He were asleep, it became a divine treasure house of Life, for the salvation of us who sing, “O our God and Redeemer, You are blessed.”
ltx/en_us_dedes/tr.d070:trMA.Ode7C13.incipit	The Life of all things…
ltx/en_us_dedes/tr.d070:trMA.Ode7C13.melody	@ltx/en_us_dedes/he.h.m6:heHE.AfrastonThavma.name
ltx/en_us_dedes/tr.d070:trMA.Ode7C13.mode	@ltx/en_us_dedes/miscellanea:misc.Mode6
ltx/en_us_dedes/tr.d070:trMA.Ode7C13.ode	@ltx/en_us_dedes/miscellanea:misc.Ode7
ltx/en_us_dedes/tr.d070:trMA.Ode7C13.text	The Life of all things accepts interment and burial, which is the law for those who have died. His tomb thus becomes the source of resurrection for the salvation of us who sing, “O our God and Redeemer, You are blessed.”
ltx/en_us_dedes/tr.d070:trMA.Ode7C14.incipit	One was the Godhead of…
ltx/en_us_dedes/tr.d070:trMA.Ode7C14.melody	@ltx/en_us_dedes/he.h.m6:heHE.AfrastonThavma.name
ltx/en_us_dedes/tr.d070:trMA.Ode7C14.mode	@ltx/en_us_dedes/miscellanea:misc.Mode6
ltx/en_us_dedes/tr.d070:trMA.Ode7C14.ode	@ltx/en_us_dedes/miscellanea:misc.Ode7
ltx/en_us_dedes/tr.d070:trMA.Ode7C14.text	One was the Godhead of Christ with the Father and the Spirit, and there was no separation in Hades, in the tomb, and in Paradise, for the salvation of us who sing, “O our God and Redeemer, You are blessed.”
ltx/en_us_dedes/tr.d070:trMA.Ode7C1H.greekmelody	@ltx/en_us_dedes/he.h.m6:heHE.AfrastonThavma.greekname
ltx/en_us_dedes/tr.d070:trMA.Ode7C1H.incipit	@ltx/en_us_dedes/he.h.m6:heHE.AfrastonThavma.incipit
ltx/en_us_dedes/tr.d070:trMA.Ode7C1H.melody	@ltx/en_us_dedes/he.h.m6:heHE.AfrastonThavma.melody
ltx/en_us_dedes/tr.d070:trMA.Ode7C1H.mode	@ltx/en_us_dedes/miscellanea:misc.Mode6
ltx/en_us_dedes/tr.d070:trMA.Ode7C1H.ode	@ltx/en_us_dedes/miscellanea:misc.Ode7
ltx/en_us_dedes/tr.d070:trMA.Ode7C1H.text	@ltx/en_us_dedes/he.h.m6:heHE.AfrastonThavma.text
ltx/en_us_dedes/tr.d070:trMA.Ode7K.incipit	@ltx/en_us_dedes/he.h.m6:heHE.AfrastonThavma.incipit
ltx/en_us_dedes/tr.d070:trMA.Ode7K.melody	@ltx/en_us_dedes/he.h.m6:heHE.AfrastonThavma.melody
ltx/en_us_dedes/tr.d070:trMA.Ode7K.mode	@ltx/en_us_dedes/miscellanea:misc.Mode6
ltx/en_us_dedes/tr.d070:trMA.Ode7K.ode	@ltx/en_us_dedes/miscellanea:misc.Ode7
ltx/en_us_dedes/tr.d070:trMA.Ode7K.text	@ltx/en_us_dedes/he.h.m6:heHE.AfrastonThavma.text
ltx/en_us_dedes/tr.d070:trMA.Ode8C11.greekmelody	@ltx/en_us_dedes/he.h.m6:heHE.EkstithiFrittonOurane.greekname
ltx/en_us_dedes/tr.d070:trMA.Ode8C11.incipit	The undefiled temple was destroyed…
ltx/en_us_dedes/tr.d070:trMA.Ode8C11.melody	@ltx/en_us_dedes/he.h.m6:heHE.EkstithiFrittonOurane.name
ltx/en_us_dedes/tr.d070:trMA.Ode8C11.mode	@ltx/en_us_dedes/miscellanea:misc.Mode6
ltx/en_us_dedes/tr.d070:trMA.Ode8C11.ode	@ltx/en_us_dedes/miscellanea:misc.Ode8
ltx/en_us_dedes/tr.d070:trMA.Ode8C11.text	The undefiled temple was destroyed; then, with itself it raised up the fallen tabernacle. The second Adam, who dwells in the heights, went down to the chambers of Hades, in order to save the first one. Bless the Lord, O you Servants; sing a hymn, Priests; and People, exalt Him beyond measure unto all the ages.
ltx/en_us_dedes/tr.d070:trMA.Ode8C12.incipit	Though the Disciples’ courage failed…
ltx/en_us_dedes/tr.d070:trMA.Ode8C12.melody	@ltx/en_us_dedes/he.h.m6:heHE.EkstithiFrittonOurane.name
ltx/en_us_dedes/tr.d070:trMA.Ode8C12.mode	@ltx/en_us_dedes/miscellanea:misc.Mode6
ltx/en_us_dedes/tr.d070:trMA.Ode8C12.ode	@ltx/en_us_dedes/miscellanea:misc.Ode8
ltx/en_us_dedes/tr.d070:trMA.Ode8C12.text	Though the Disciples’ courage failed, yet that of Joseph of Arimathea has excelled. For when he sees that the God over all is hanging dead and naked, he asks for Him and buries Him, crying, “Bless the Lord, O you Servants; sing a hymn, Priests; and People, exalt Him beyond measure unto all the ages.”
ltx/en_us_dedes/tr.d070:trMA.Ode8C13.incipit	Oh, novel marvels that were…
ltx/en_us_dedes/tr.d070:trMA.Ode8C13.melody	@ltx/en_us_dedes/he.h.m6:heHE.EkstithiFrittonOurane.name
ltx/en_us_dedes/tr.d070:trMA.Ode8C13.mode	@ltx/en_us_dedes/miscellanea:misc.Mode6
ltx/en_us_dedes/tr.d070:trMA.Ode8C13.ode	@ltx/en_us_dedes/miscellanea:misc.Ode8
ltx/en_us_dedes/tr.d070:trMA.Ode8C13.text	Oh, novel marvels that were wrought! Oh, the benevolence! Oh, the patience passing speech! For, of His own will, He who dwells in the heights is sealed beneath the earth, and God is defamed as a deceiver. Bless the Lord, O you Servants; sing a hymn, Priests; and People, exalt Him beyond measure unto all the ages.
ltx/en_us_dedes/tr.d070:trMA.Ode8C1H.greekmelody	@ltx/en_us_dedes/he.h.m6:heHE.EkstithiFrittonOurane.greekname
ltx/en_us_dedes/tr.d070:trMA.Ode8C1H.incipit	@ltx/en_us_dedes/he.h.m6:heHE.EkstithiFrittonOurane.incipit
ltx/en_us_dedes/tr.d070:trMA.Ode8C1H.melody	@ltx/en_us_dedes/he.h.m6:heHE.EkstithiFrittonOurane.melody
ltx/en_us_dedes/tr.d070:trMA.Ode8C1H.mode	@ltx/en_us_dedes/miscellanea:misc.Mode6
ltx/en_us_dedes/tr.d070:trMA.Ode8C1H.ode	@ltx/en_us_dedes/miscellanea:misc.Ode8
ltx/en_us_dedes/tr.d070:trMA.Ode8C1H.text	@ltx/en_us_dedes/he.h.m6:heHE.EkstithiFrittonOurane.text
ltx/en_us_dedes/tr.d070:trMA.Ode8K.incipit	@ltx/en_us_dedes/he.h.m6:heHE.EkstithiFrittonOurane.incipit
ltx/en_us_dedes/tr.d070:trMA.Ode8K.melody	@ltx/en_us_dedes/he.h.m6:heHE.EkstithiFrittonOurane.melody
ltx/en_us_dedes/tr.d070:trMA.Ode8K.mode	@ltx/en_us_dedes/miscellanea:misc.Mode6
ltx/en_us_dedes/tr.d070:trMA.Ode8K.ode	@ltx/en_us_dedes/miscellanea:misc.Ode8
ltx/en_us_dedes/tr.d070:trMA.Ode8K.text	@ltx/en_us_dedes/he.h.m6:heHE.EkstithiFrittonOurane.text
ltx/en_us_dedes/tr.d070:trMA.Ode9C11.greekmelody	@ltx/en_us_dedes/he.h.m6:heHE.MiEpodyrouMouMiter.greekname
ltx/en_us_dedes/tr.d070:trMA.Ode9C11.incipit	I was blest in escaping…
ltx/en_us_dedes/tr.d070:trMA.Ode9C11.melody	@ltx/en_us_dedes/he.h.m6:heHE.MiEpodyrouMouMiter.name
ltx/en_us_dedes/tr.d070:trMA.Ode9C11.mode	@ltx/en_us_dedes/miscellanea:misc.Mode6
ltx/en_us_dedes/tr.d070:trMA.Ode9C11.ode	@ltx/en_us_dedes/miscellanea:misc.Ode9
ltx/en_us_dedes/tr.d070:trMA.Ode9C11.text	I was blest in escaping labor, in a manner past nature, at Your unusual birth, O unoriginate Son. But now as I see You, my God, not breathing and dead, I am painfully torn by the sword of my sorrow. So arise, so that I may be magnified.
ltx/en_us_dedes/tr.d070:trMA.Ode9C12.incipit	Earth covers Me by My…
ltx/en_us_dedes/tr.d070:trMA.Ode9C12.melody	@ltx/en_us_dedes/he.h.m6:heHE.MiEpodyrouMouMiter.name
ltx/en_us_dedes/tr.d070:trMA.Ode9C12.mode	@ltx/en_us_dedes/miscellanea:misc.Mode6
ltx/en_us_dedes/tr.d070:trMA.Ode9C12.ode	@ltx/en_us_dedes/miscellanea:misc.Ode9
ltx/en_us_dedes/tr.d070:trMA.Ode9C12.text	Earth covers Me by My own will. But the doorkeepers of Hades shudder and quake, as they behold that I am clothed in the bloodstained garment of vengeance. After I smite My enemies with the Cross, as God, O Mother, I will rise again and magnify you.
ltx/en_us_dedes/tr.d070:trMA.Ode9C13.incipit	Greatly rejoice, O creation! And…
ltx/en_us_dedes/tr.d070:trMA.Ode9C13.melody	@ltx/en_us_dedes/he.h.m6:heHE.MiEpodyrouMouMiter.name
ltx/en_us_dedes/tr.d070:trMA.Ode9C13.mode	@ltx/en_us_dedes/miscellanea:misc.Mode6
ltx/en_us_dedes/tr.d070:trMA.Ode9C13.ode	@ltx/en_us_dedes/miscellanea:misc.Ode9
ltx/en_us_dedes/tr.d070:trMA.Ode9C13.text	Greatly rejoice, O creation! And everyone who was born on earth, be glad! Hades, the enemy, has been despoiled. Let the women with their ointments come to meet Me. I am rescuing Adam and Eve and all mankind. And on the third day I will rise again.
ltx/en_us_dedes/tr.d070:trMA.Ode9C1H.greekmelody	@ltx/en_us_dedes/he.h.m6:heHE.MiEpodyrouMouMiter.greekname
ltx/en_us_dedes/tr.d070:trMA.Ode9C1H.incipit	@ltx/en_us_dedes/he.h.m6:heHE.MiEpodyrouMouMiter.incipit
ltx/en_us_dedes/tr.d070:trMA.Ode9C1H.melody	@ltx/en_us_dedes/he.h.m6:heHE.MiEpodyrouMouMiter.melody
ltx/en_us_dedes/tr.d070:trMA.Ode9C1H.mode	@ltx/en_us_dedes/miscellanea:misc.Mode6
ltx/en_us_dedes/tr.d070:trMA.Ode9C1H.ode	@ltx/en_us_dedes/miscellanea:misc.Ode9
ltx/en_us_dedes/tr.d070:trMA.Ode9C1H.text	@ltx/en_us_dedes/he.h.m6:heHE.MiEpodyrouMouMiter.text
ltx/en_us_dedes/tr.d070:trMA.Ode9K.incipit	@ltx/en_us_dedes/he.h.m6:heHE.MiEpodyrouMouMiter.incipit
ltx/en_us_dedes/tr.d070:trMA.Ode9K.melody	@ltx/en_us_dedes/he.h.m6:heHE.MiEpodyrouMouMiter.melody
ltx/en_us_dedes/tr.d070:trMA.Ode9K.mode	@ltx/en_us_dedes/miscellanea:misc.Mode6
ltx/en_us_dedes/tr.d070:trMA.Ode9K.ode	@ltx/en_us_dedes/miscellanea:misc.Ode9
ltx/en_us_dedes/tr.d070:trMA.Ode9K.text	@ltx/en_us_dedes/he.h.m6:heHE.MiEpodyrouMouMiter.text
ltx/en_us_dedes/tr.d070:trMA.Oikos1.text	
ltx/en_us_dedes/tr.d070:trSY.commemoration.couplet1.title	@ltx/en_us_dedes/titles:ti.Verses
ltx/en_us_dedes/tr.d070:trSY.commemoration.couplet1.verse1	In vain you guard the grave, O guards.
ltx/en_us_dedes/tr.d070:trSY.commemoration.couplet1.verse2	No tomb can hold Him who is life itself.
ltx/en_us_dedes/tr.d070:trSY.commemoration.narration.p01	[paragraph 01]
ltx/en_us_dedes/tr.d070:trSY.commemoration.narration.p02	[paragraph 02]
ltx/en_us_dedes/tr.d070:trSY.commemoration.narration.p03	[paragraph 03]
ltx/en_us_dedes/tr.d070:trSY.commemoration.narration.p04	[paragraph 04]
ltx/en_us_dedes/tr.d070:trSY.commemoration.narration.p05	[paragraph 05]
ltx/en_us_dedes/tr.d070:trSY.commemoration.narration.p06	[paragraph 06]
ltx/en_us_dedes/tr.d070:trSY.commemoration.narration.p07	[paragraph 07]
ltx/en_us_dedes/tr.d070:trSY.commemoration.text	On great and holy Saturday, we celebrate the burial of the divine Body and the descent into Hades of our Lord and Savior Jesus Christ, through which He recalled our human race from corruption and passed it over into life eternal.
ltx/en_us_dedes/tr.d070:trSY.lastline	By Your ineffable condescension, O Christ our God, have mercy on us. Amen.
ltx/en_us_dedes/tr.d070:trTE.Troparion.incipit	O Christ, who hold the…
ltx/en_us_dedes/tr.d070:trTE.Troparion.melody	
ltx/en_us_dedes/tr.d070:trTE.Troparion.mode	@ltx/en_us_dedes/miscellanea:misc.Mode2
ltx/en_us_dedes/tr.d070:trTE.Troparion.text	O Christ, who hold the whole world in Your hand, You accepted to be held in the sepulcher, so that You might rescue humanity, which was swallowed by Hades, and, as immortal God, give us life and immortality.
ltx/en_us_dedes/tr.d070:trVE.Apolytikion1.incipit	When he took down Your…
ltx/en_us_dedes/tr.d070:trVE.Apolytikion1.melody	
ltx/en_us_dedes/tr.d070:trVE.Apolytikion1.mode	@ltx/en_us_dedes/miscellanea:misc.Mode2
ltx/en_us_dedes/tr.d070:trVE.Apolytikion1.text	When he took down Your immaculate Body from the Cross, the honorable Joseph wrapped it in a clean linen shroud with spices and laid it for burial in a new tomb.
ltx/en_us_dedes/tr.d070:trVE.Apolytikion2.incipit	@ltx/en_us_dedes/oc.m2.d1:ocVE.Apolytikion.incipit
ltx/en_us_dedes/tr.d070:trVE.Apolytikion2.melody	
ltx/en_us_dedes/tr.d070:trVE.Apolytikion2.mode	@ltx/en_us_dedes/miscellanea:misc.Mode2
ltx/en_us_dedes/tr.d070:trVE.Apolytikion2.text	@ltx/en_us_dedes/oc.m2.d1:ocVE.Apolytikion.text
ltx/en_us_dedes/tr.d070:trVE.Apolytikion3.incipit	The Angel standing at the…
ltx/en_us_dedes/tr.d070:trVE.Apolytikion3.melody	
ltx/en_us_dedes/tr.d070:trVE.Apolytikion3.mode	@ltx/en_us_dedes/miscellanea:misc.Mode2
ltx/en_us_dedes/tr.d070:trVE.Apolytikion3.text	The Angel standing at the sepulcher cried out and said to the ointment-bearing women: The ointments are appropriate for mortal men, but Christ has been shown to be a stranger to decay.
ltx/en_us_dedes/tr.d070:trVE.AposGlory.incipit	You, who cover Yourself with…
ltx/en_us_dedes/tr.d070:trVE.AposGlory.melody	
ltx/en_us_dedes/tr.d070:trVE.AposGlory.mode	@ltx/en_us_dedes/miscellanea:misc.Mode5
ltx/en_us_dedes/tr.d070:trVE.AposGlory.text	You, who cover Yourself with light as with a garment, were taken down from the Cross by Joseph, with the help of Nicodemus. When he saw You dead, naked, and unburied, he took up a moving lamentation; and stricken with grief he said, “Alas, O sweetest Jesus! When the sun saw You hanging on the Cross just a little while ago, it wrapped itself in darkness; and out of fear the earth was quaking; and the curtain of the Temple was torn in two. And now I see You voluntarily undergoing death for me. How am I to bury You, my God? Or how can I wrap You in a shroud? With what hands shall I touch Your immaculate body, or what songs should I be singing at Your departure, tender-loving Lord? I magnify Your Passion, and I extol Your burial and Your resurrection, as I cry out: O Lord, glory to You!”
ltx/en_us_dedes/tr.d070:trVE.Aposticha1.greekmelody	@ltx/en_us_dedes/he.a.m2:heAU.OteEkTouXylou.greekname
ltx/en_us_dedes/tr.d070:trVE.Aposticha1.incipit	@ltx/en_us_dedes/he.a.m2:heAU.OteEkTouXylou.incipit
ltx/en_us_dedes/tr.d070:trVE.Aposticha1.melody	@ltx/en_us_dedes/he.a.m2:heAU.OteEkTouXylou.melody
ltx/en_us_dedes/tr.d070:trVE.Aposticha1.mode	@ltx/en_us_dedes/miscellanea:misc.Mode2
ltx/en_us_dedes/tr.d070:trVE.Aposticha1.text	@ltx/en_us_dedes/he.a.m2:heAU.OteEkTouXylou.text
ltx/en_us_dedes/tr.d070:trVE.Aposticha2.incipit	When You, the Redeemer of…
ltx/en_us_dedes/tr.d070:trVE.Aposticha2.melody	@ltx/en_us_dedes/he.a.m2:heAU.OteEkTouXylou.name
ltx/en_us_dedes/tr.d070:trVE.Aposticha2.mode	@ltx/en_us_dedes/miscellanea:misc.Mode2
ltx/en_us_dedes/tr.d070:trVE.Aposticha2.text	When You, the Redeemer of the world, * lay inside a new rock-hewn sepulcher, for the sake of all, * Hades, now humiliated, cowered seeing You. * Then its bars and the prison gates * were shattered and broken; * tombs were opened, and the bodies of the dead arose. * Then with joy and gratitude, Adam * cried aloud, “Benevolent Savior, * glory be to You for coming down to us!”
ltx/en_us_dedes/tr.d070:trVE.Aposticha3.incipit	When You had been physically…
ltx/en_us_dedes/tr.d070:trVE.Aposticha3.melody	@ltx/en_us_dedes/he.a.m2:heAU.OteEkTouXylou.name
ltx/en_us_dedes/tr.d070:trVE.Aposticha3.mode	@ltx/en_us_dedes/miscellanea:misc.Mode2
ltx/en_us_dedes/tr.d070:trVE.Aposticha3.text	When You had been physically enclosed * in the tomb of Your own volition, remaining undefined * in the nature of Your Godhead and uncircumscribed, * then You closed down the prison-house of death, and You emptied * all the royal treasuries of Hades, O my Christ. * Thus did You bestow on this Sabbath * the divine blessing and glory, * and You honored it with Your own radiance.
ltx/en_us_dedes/tr.d070:trVE.Aposticha4.incipit	When the hosts of angels…
ltx/en_us_dedes/tr.d070:trVE.Aposticha4.melody	@ltx/en_us_dedes/he.a.m2:heAU.OteEkTouXylou.name
ltx/en_us_dedes/tr.d070:trVE.Aposticha4.mode	@ltx/en_us_dedes/miscellanea:misc.Mode2
ltx/en_us_dedes/tr.d070:trVE.Aposticha4.text	When the hosts of angels had beheld * You being maligned by the lawless as a deceiver, O Christ, * and the tombstone being sealed by the hands that had pierced * Your immaculate side, O Lord, * they shuddered and marveled * at Your great and indescribable longsuffering. * Yet, for our salvation rejoicing, * they cried out, “Benevolent Master, * glory be to You for going down to earth!”
ltx/en_us_dedes/tr.d070:trVE.SticBoth.incipit	Awesome and paradoxical is the…
ltx/en_us_dedes/tr.d070:trVE.SticBoth.melody	@ltx/en_us_dedes/miscellanea:misc.Idiomelon
ltx/en_us_dedes/tr.d070:trVE.SticBoth.mode	@ltx/en_us_dedes/miscellanea:misc.Mode6
ltx/en_us_dedes/tr.d070:trVE.SticBoth.text	Awesome and paradoxical is the mystery that we see unfolding today. He who is untouchable is now arrested. He who releases Adam from the curse is taken prisoner. He who searches and tries the hearts and minds is unjustly put on trial, and He who shut the Abyss is locked up in a prison. Before Pilate now stands He, before whom the hosts of heaven stand and tremble. The Fashioner is struck by the hand of one He fashioned. Condemned to a cross is He who judges the living and the dead. Enclosed in a tomb is the Destroyer of Hades. O Lord, You endure it all sympathetically, and You saved us all from the curse. O longsuffering Lord, glory to You!
ltx/en_us_dedes/tr.d070:trVE.SticGlory.incipit	Oh! How could that unlawful…
ltx/en_us_dedes/tr.d070:trVE.SticGlory.melody	@ltx/en_us_dedes/miscellanea:misc.Idiomelon
ltx/en_us_dedes/tr.d070:trVE.SticGlory.mode	@ltx/en_us_dedes/miscellanea:misc.Mode6
ltx/en_us_dedes/tr.d070:trVE.SticGlory.text	Oh! How could that unlawful synagogue condemn to death the King of all creation, with no regard for the good things that He had done for them! In His own defense, He reminded them of all these, and said to them, “My people, what did I do for you? Did I not fill Judea with miracles? Did I not raise the dead with but a word? Did I not cure every sickness and disease? And what do you give Me in return? Why do you not remember Me? Instead of healings, you inflict wounds on Me; instead of life, you kill Me. You hang your Benefactor on the Cross as a malefactor, the Lawgiver as an outlaw, the King of all as a criminal.” O longsuffering Lord, glory to You!
ltx/en_us_dedes/tr.d070:trVE.Stichera01.incipit	@ltx/en_us_dedes/tr.d069:trMA.Aposticha1.incipit
ltx/en_us_dedes/tr.d070:trVE.Stichera01.melody	@ltx/en_us_dedes/miscellanea:misc.Idiomelon
ltx/en_us_dedes/tr.d070:trVE.Stichera01.mode	@ltx/en_us_dedes/miscellanea:misc.Mode1
ltx/en_us_dedes/tr.d070:trVE.Stichera01.text	@ltx/en_us_dedes/tr.d069:trMA.Aposticha1.text
ltx/en_us_dedes/tr.d070:trVE.Stichera02.incipit	@ltx/en_us_dedes/tr.d069:trMA.Aposticha2.incipit
ltx/en_us_dedes/tr.d070:trVE.Stichera02.melody	@ltx/en_us_dedes/miscellanea:misc.Idiomelon
ltx/en_us_dedes/tr.d070:trVE.Stichera02.mode	@ltx/en_us_dedes/miscellanea:misc.Mode2
ltx/en_us_dedes/tr.d070:trVE.Stichera02.text	@ltx/en_us_dedes/tr.d069:trMA.Aposticha2.text
ltx/en_us_dedes/tr.d070:trVE.Stichera03.incipit	@ltx/en_us_dedes/tr.d069:trMA.Aposticha3.incipit
ltx/en_us_dedes/tr.d070:trVE.Stichera03.melody	@ltx/en_us_dedes/miscellanea:misc.Idiomelon
ltx/en_us_dedes/tr.d070:trVE.Stichera03.mode	@ltx/en_us_dedes/miscellanea:misc.Mode2
ltx/en_us_dedes/tr.d070:trVE.Stichera03.text	@ltx/en_us_dedes/tr.d069:trMA.Aposticha3.text
ltx/en_us_dedes/tr.d070:trVE.Stichera04.incipit	@ltx/en_us_dedes/tr.d069:trMA.Aposticha4.incipit
ltx/en_us_dedes/tr.d070:trVE.Stichera04.melody	@ltx/en_us_dedes/miscellanea:misc.Idiomelon
ltx/en_us_dedes/tr.d070:trVE.Stichera04.mode	@ltx/en_us_dedes/miscellanea:misc.Mode2
ltx/en_us_dedes/tr.d070:trVE.Stichera04.text	@ltx/en_us_dedes/tr.d069:trMA.Aposticha4.text
ltx/en_us_dedes/tr.d070:trVE.Stichera05.incipit	Today the Master of creation…
ltx/en_us_dedes/tr.d070:trVE.Stichera05.melody	@ltx/en_us_dedes/miscellanea:misc.Idiomelon
ltx/en_us_dedes/tr.d070:trVE.Stichera05.mode	@ltx/en_us_dedes/miscellanea:misc.Mode6
ltx/en_us_dedes/tr.d070:trVE.Stichera05.text	Today the Master of creation stands before Pilate; the Creator of all is delivered to be crucified; like a lamb, He is brought of His own will to the Cross. He is fixed with the nails, He is pierced in the side, and He sips from the sponge, He who caused the manna to rain down of old. The Redeemer of the world is smitten on the cheek. The Maker of all is mocked by His own servants. Such is the Master’s benevolence! He prayed to His Father for those who crucified Him, and He said, “Forgive them this sin, for the lawless do not know what they are unjustly doing.”
ltx/en_us_dedes/tr.d070:trVE.header	Removal from the Cross on Friday Afternoon
