ltx/en_us_dedes/tr.d047:trCO.header	(Great)
ltx/en_us_dedes/tr.d047:trDA.commemoration.full	
ltx/en_us_dedes/tr.d047:trDA.commemoration.short	Thursday of the Fourth Week
ltx/en_us_dedes/tr.d047:trDA.insert1	
ltx/en_us_dedes/tr.d047:trDA.insert2	
ltx/en_us_dedes/tr.d047:trDA.note	
ltx/en_us_dedes/tr.d047:trDA.title	
ltx/en_us_dedes/tr.d047:trHO.commemorations	
ltx/en_us_dedes/tr.d047:trHO.daytitle	
ltx/en_us_dedes/tr.d047:trHO.description1	
ltx/en_us_dedes/tr.d047:trHO.description2	
ltx/en_us_dedes/tr.d047:trHO.note1	
ltx/en_us_dedes/tr.d047:trHO.note2	
ltx/en_us_dedes/tr.d047:trMA.AposIdiomelon1.incipit	…
ltx/en_us_dedes/tr.d047:trMA.AposIdiomelon1.melody	@ltx/en_us_dedes/miscellanea:misc.Idiomelon
ltx/en_us_dedes/tr.d047:trMA.AposIdiomelon1.mode	@ltx/en_us_dedes/miscellanea:misc.Mode7
ltx/en_us_dedes/tr.d047:trMA.AposIdiomelon1.text	
ltx/en_us_dedes/tr.d047:trMA.AposMartyric.incipit	…
ltx/en_us_dedes/tr.d047:trMA.AposMartyric.melody	
ltx/en_us_dedes/tr.d047:trMA.AposMartyric.mode	@ltx/en_us_dedes/miscellanea:misc.Mode7
ltx/en_us_dedes/tr.d047:trMA.AposMartyric.text	
ltx/en_us_dedes/tr.d047:trMA.AposTheotokion.incipit	…
ltx/en_us_dedes/tr.d047:trMA.AposTheotokion.melody	
ltx/en_us_dedes/tr.d047:trMA.AposTheotokion.mode	@ltx/en_us_dedes/miscellanea:misc.Mode7
ltx/en_us_dedes/tr.d047:trMA.AposTheotokion.text	
ltx/en_us_dedes/tr.d047:trMA.C1.poet	
ltx/en_us_dedes/tr.d047:trMA.C2.poet	
ltx/en_us_dedes/tr.d047:trMA.Kathisma21.greekmelody	@ltx/en_us_dedes/he.a.m1:heAU.ChorosAngelikos.greekname
ltx/en_us_dedes/tr.d047:trMA.Kathisma21.incipit	…
ltx/en_us_dedes/tr.d047:trMA.Kathisma21.melody	@ltx/en_us_dedes/he.a.m1:heAU.ChorosAngelikos.name
ltx/en_us_dedes/tr.d047:trMA.Kathisma21.mode	@ltx/en_us_dedes/miscellanea:misc.Mode1
ltx/en_us_dedes/tr.d047:trMA.Kathisma21.text	
ltx/en_us_dedes/tr.d047:trMA.Kathisma22.greekmelody	@ltx/en_us_dedes/he.a.m1:heAU.ChorosAngelikos.greekname
ltx/en_us_dedes/tr.d047:trMA.Kathisma22.incipit	…
ltx/en_us_dedes/tr.d047:trMA.Kathisma22.melody	@ltx/en_us_dedes/he.a.m1:heAU.ChorosAngelikos.name
ltx/en_us_dedes/tr.d047:trMA.Kathisma22.mode	@ltx/en_us_dedes/miscellanea:misc.Mode1
ltx/en_us_dedes/tr.d047:trMA.Kathisma22.text	
ltx/en_us_dedes/tr.d047:trMA.Kathisma31.incipit	…
ltx/en_us_dedes/tr.d047:trMA.Kathisma31.melody	
ltx/en_us_dedes/tr.d047:trMA.Kathisma31.mode	@ltx/en_us_dedes/miscellanea:misc.Mode7
ltx/en_us_dedes/tr.d047:trMA.Kathisma31.text	
ltx/en_us_dedes/tr.d047:trMA.Kathisma32.incipit	…
ltx/en_us_dedes/tr.d047:trMA.Kathisma32.melody	@ltx/en_us_dedes/miscellanea:misc.Automelon
ltx/en_us_dedes/tr.d047:trMA.Kathisma32.mode	@ltx/en_us_dedes/miscellanea:misc.Mode7
ltx/en_us_dedes/tr.d047:trMA.Kathisma32.text	
ltx/en_us_dedes/tr.d047:trMA.Ode4C11.greekmelody	@ltx/en_us_dedes/he.h.m1:heHE.EpiTisTheiasFylakis.greekname
ltx/en_us_dedes/tr.d047:trMA.Ode4C11.incipit	…
ltx/en_us_dedes/tr.d047:trMA.Ode4C11.melody	@ltx/en_us_dedes/he.h.m1:heHE.EpiTisTheiasFylakis.name
ltx/en_us_dedes/tr.d047:trMA.Ode4C11.mode	@ltx/en_us_dedes/miscellanea:misc.Mode1
ltx/en_us_dedes/tr.d047:trMA.Ode4C11.ode	@ltx/en_us_dedes/miscellanea:misc.Ode4
ltx/en_us_dedes/tr.d047:trMA.Ode4C11.text	
ltx/en_us_dedes/tr.d047:trMA.Ode4C12.incipit	…
ltx/en_us_dedes/tr.d047:trMA.Ode4C12.melody	@ltx/en_us_dedes/he.h.m1:heHE.EpiTisTheiasFylakis.name
ltx/en_us_dedes/tr.d047:trMA.Ode4C12.mode	@ltx/en_us_dedes/miscellanea:misc.Mode1
ltx/en_us_dedes/tr.d047:trMA.Ode4C12.ode	@ltx/en_us_dedes/miscellanea:misc.Ode4
ltx/en_us_dedes/tr.d047:trMA.Ode4C12.text	
ltx/en_us_dedes/tr.d047:trMA.Ode4C13.incipit	…
ltx/en_us_dedes/tr.d047:trMA.Ode4C13.melody	@ltx/en_us_dedes/he.h.m1:heHE.EpiTisTheiasFylakis.name
ltx/en_us_dedes/tr.d047:trMA.Ode4C13.mode	@ltx/en_us_dedes/miscellanea:misc.Mode1
ltx/en_us_dedes/tr.d047:trMA.Ode4C13.ode	@ltx/en_us_dedes/miscellanea:misc.Ode4
ltx/en_us_dedes/tr.d047:trMA.Ode4C13.text	
ltx/en_us_dedes/tr.d047:trMA.Ode4C1T.incipit	…
ltx/en_us_dedes/tr.d047:trMA.Ode4C1T.melody	@ltx/en_us_dedes/he.h.m1:heHE.EpiTisTheiasFylakis.name
ltx/en_us_dedes/tr.d047:trMA.Ode4C1T.mode	@ltx/en_us_dedes/miscellanea:misc.Mode1
ltx/en_us_dedes/tr.d047:trMA.Ode4C1T.ode	@ltx/en_us_dedes/miscellanea:misc.Ode4
ltx/en_us_dedes/tr.d047:trMA.Ode4C1T.text	
ltx/en_us_dedes/tr.d047:trMA.Ode4C21.greekmelody	@ltx/en_us_dedes/he.h.m7:heHE.TinEnsarkonParousianSou.greekname
ltx/en_us_dedes/tr.d047:trMA.Ode4C21.incipit	…
ltx/en_us_dedes/tr.d047:trMA.Ode4C21.melody	@ltx/en_us_dedes/he.h.m7:heHE.TinEnsarkonParousianSou.name
ltx/en_us_dedes/tr.d047:trMA.Ode4C21.mode	@ltx/en_us_dedes/miscellanea:misc.Mode7
ltx/en_us_dedes/tr.d047:trMA.Ode4C21.ode	@ltx/en_us_dedes/miscellanea:misc.Ode4
ltx/en_us_dedes/tr.d047:trMA.Ode4C21.text	
ltx/en_us_dedes/tr.d047:trMA.Ode4C22.incipit	…
ltx/en_us_dedes/tr.d047:trMA.Ode4C22.melody	@ltx/en_us_dedes/he.h.m7:heHE.TinEnsarkonParousianSou.name
ltx/en_us_dedes/tr.d047:trMA.Ode4C22.mode	@ltx/en_us_dedes/miscellanea:misc.Mode7
ltx/en_us_dedes/tr.d047:trMA.Ode4C22.ode	@ltx/en_us_dedes/miscellanea:misc.Ode4
ltx/en_us_dedes/tr.d047:trMA.Ode4C22.text	
ltx/en_us_dedes/tr.d047:trMA.Ode4C2A1.incipit	…
ltx/en_us_dedes/tr.d047:trMA.Ode4C2A1.melody	@ltx/en_us_dedes/he.h.m7:heHE.TinEnsarkonParousianSou.name
ltx/en_us_dedes/tr.d047:trMA.Ode4C2A1.mode	@ltx/en_us_dedes/miscellanea:misc.Mode7
ltx/en_us_dedes/tr.d047:trMA.Ode4C2A1.ode	@ltx/en_us_dedes/miscellanea:misc.Ode4
ltx/en_us_dedes/tr.d047:trMA.Ode4C2A1.text	
ltx/en_us_dedes/tr.d047:trMA.Ode4C2H.greekmelody	@ltx/en_us_dedes/he.h.m7:heHE.TinEnsarkonParousianSou.greekname
ltx/en_us_dedes/tr.d047:trMA.Ode4C2H.incipit	@ltx/en_us_dedes/he.h.m7:heHE.TinEnsarkonParousianSou.incipit
ltx/en_us_dedes/tr.d047:trMA.Ode4C2H.melody	@ltx/en_us_dedes/he.h.m7:heHE.TinEnsarkonParousianSou.melody
ltx/en_us_dedes/tr.d047:trMA.Ode4C2H.mode	@ltx/en_us_dedes/miscellanea:misc.Mode7
ltx/en_us_dedes/tr.d047:trMA.Ode4C2H.ode	@ltx/en_us_dedes/miscellanea:misc.Ode4
ltx/en_us_dedes/tr.d047:trMA.Ode4C2H.text	@ltx/en_us_dedes/he.h.m7:heHE.TinEnsarkonParousianSou.text
ltx/en_us_dedes/tr.d047:trMA.Ode4C2T.incipit	…
ltx/en_us_dedes/tr.d047:trMA.Ode4C2T.melody	@ltx/en_us_dedes/he.h.m7:heHE.TinEnsarkonParousianSou.name
ltx/en_us_dedes/tr.d047:trMA.Ode4C2T.mode	@ltx/en_us_dedes/miscellanea:misc.Mode7
ltx/en_us_dedes/tr.d047:trMA.Ode4C2T.ode	@ltx/en_us_dedes/miscellanea:misc.Ode4
ltx/en_us_dedes/tr.d047:trMA.Ode4C2T.text	
ltx/en_us_dedes/tr.d047:trMA.Ode4C2Tr.incipit	…
ltx/en_us_dedes/tr.d047:trMA.Ode4C2Tr.melody	@ltx/en_us_dedes/he.h.m7:heHE.TinEnsarkonParousianSou.name
ltx/en_us_dedes/tr.d047:trMA.Ode4C2Tr.mode	@ltx/en_us_dedes/miscellanea:misc.Mode7
ltx/en_us_dedes/tr.d047:trMA.Ode4C2Tr.ode	@ltx/en_us_dedes/miscellanea:misc.Ode4
ltx/en_us_dedes/tr.d047:trMA.Ode4C2Tr.text	
ltx/en_us_dedes/tr.d047:trMA.Ode8C11.greekmelody	@ltx/en_us_dedes/he.h.m1:heHE.AftiIKliti.greekname
ltx/en_us_dedes/tr.d047:trMA.Ode8C11.incipit	…
ltx/en_us_dedes/tr.d047:trMA.Ode8C11.melody	@ltx/en_us_dedes/he.h.m1:heHE.AftiIKliti.name
ltx/en_us_dedes/tr.d047:trMA.Ode8C11.mode	@ltx/en_us_dedes/miscellanea:misc.Mode7
ltx/en_us_dedes/tr.d047:trMA.Ode8C11.ode	@ltx/en_us_dedes/miscellanea:misc.Ode8
ltx/en_us_dedes/tr.d047:trMA.Ode8C11.text	
ltx/en_us_dedes/tr.d047:trMA.Ode8C12.incipit	…
ltx/en_us_dedes/tr.d047:trMA.Ode8C12.melody	@ltx/en_us_dedes/he.h.m1:heHE.AftiIKliti.name
ltx/en_us_dedes/tr.d047:trMA.Ode8C12.mode	@ltx/en_us_dedes/miscellanea:misc.Mode7
ltx/en_us_dedes/tr.d047:trMA.Ode8C12.ode	@ltx/en_us_dedes/miscellanea:misc.Ode8
ltx/en_us_dedes/tr.d047:trMA.Ode8C12.text	
ltx/en_us_dedes/tr.d047:trMA.Ode8C13.incipit	…
ltx/en_us_dedes/tr.d047:trMA.Ode8C13.melody	@ltx/en_us_dedes/he.h.m1:heHE.AftiIKliti.name
ltx/en_us_dedes/tr.d047:trMA.Ode8C13.mode	@ltx/en_us_dedes/miscellanea:misc.Mode7
ltx/en_us_dedes/tr.d047:trMA.Ode8C13.ode	@ltx/en_us_dedes/miscellanea:misc.Ode8
ltx/en_us_dedes/tr.d047:trMA.Ode8C13.text	
ltx/en_us_dedes/tr.d047:trMA.Ode8C1T.incipit	…
ltx/en_us_dedes/tr.d047:trMA.Ode8C1T.melody	@ltx/en_us_dedes/he.h.m1:heHE.AftiIKliti.name
ltx/en_us_dedes/tr.d047:trMA.Ode8C1T.mode	@ltx/en_us_dedes/miscellanea:misc.Mode7
ltx/en_us_dedes/tr.d047:trMA.Ode8C1T.ode	@ltx/en_us_dedes/miscellanea:misc.Ode8
ltx/en_us_dedes/tr.d047:trMA.Ode8C1T.text	
ltx/en_us_dedes/tr.d047:trMA.Ode8C21.greekmelody	@ltx/en_us_dedes/he.h.m7:heHE.TonMononAnarchon.greekname
ltx/en_us_dedes/tr.d047:trMA.Ode8C21.incipit	…
ltx/en_us_dedes/tr.d047:trMA.Ode8C21.melody	@ltx/en_us_dedes/he.h.m7:heHE.TonMononAnarchon.name
ltx/en_us_dedes/tr.d047:trMA.Ode8C21.mode	@ltx/en_us_dedes/miscellanea:misc.Mode7
ltx/en_us_dedes/tr.d047:trMA.Ode8C21.ode	@ltx/en_us_dedes/miscellanea:misc.Ode8
ltx/en_us_dedes/tr.d047:trMA.Ode8C21.text	
ltx/en_us_dedes/tr.d047:trMA.Ode8C22.incipit	…
ltx/en_us_dedes/tr.d047:trMA.Ode8C22.melody	@ltx/en_us_dedes/he.h.m7:heHE.TonMononAnarchon.name
ltx/en_us_dedes/tr.d047:trMA.Ode8C22.mode	@ltx/en_us_dedes/miscellanea:misc.Mode7
ltx/en_us_dedes/tr.d047:trMA.Ode8C22.ode	@ltx/en_us_dedes/miscellanea:misc.Ode8
ltx/en_us_dedes/tr.d047:trMA.Ode8C22.text	
ltx/en_us_dedes/tr.d047:trMA.Ode8C2A1.incipit	…
ltx/en_us_dedes/tr.d047:trMA.Ode8C2A1.melody	@ltx/en_us_dedes/he.h.m7:heHE.TonMononAnarchon.name
ltx/en_us_dedes/tr.d047:trMA.Ode8C2A1.mode	@ltx/en_us_dedes/miscellanea:misc.Mode7
ltx/en_us_dedes/tr.d047:trMA.Ode8C2A1.ode	@ltx/en_us_dedes/miscellanea:misc.Ode8
ltx/en_us_dedes/tr.d047:trMA.Ode8C2A1.text	
ltx/en_us_dedes/tr.d047:trMA.Ode8C2H.greekmelody	@ltx/en_us_dedes/he.h.m7:heHE.TonMononAnarchon.greekname
ltx/en_us_dedes/tr.d047:trMA.Ode8C2H.incipit	@ltx/en_us_dedes/he.h.m7:heHE.TonMononAnarchon.incipit
ltx/en_us_dedes/tr.d047:trMA.Ode8C2H.melody	@ltx/en_us_dedes/he.h.m7:heHE.TonMononAnarchon.melody
ltx/en_us_dedes/tr.d047:trMA.Ode8C2H.mode	@ltx/en_us_dedes/miscellanea:misc.Mode7
ltx/en_us_dedes/tr.d047:trMA.Ode8C2H.ode	@ltx/en_us_dedes/miscellanea:misc.Ode8
ltx/en_us_dedes/tr.d047:trMA.Ode8C2H.text	@ltx/en_us_dedes/he.h.m7:heHE.TonMononAnarchon.text
ltx/en_us_dedes/tr.d047:trMA.Ode8C2T.incipit	…
ltx/en_us_dedes/tr.d047:trMA.Ode8C2T.melody	@ltx/en_us_dedes/he.h.m7:heHE.TonMononAnarchon.name
ltx/en_us_dedes/tr.d047:trMA.Ode8C2T.mode	@ltx/en_us_dedes/miscellanea:misc.Mode7
ltx/en_us_dedes/tr.d047:trMA.Ode8C2T.ode	@ltx/en_us_dedes/miscellanea:misc.Ode8
ltx/en_us_dedes/tr.d047:trMA.Ode8C2T.text	
ltx/en_us_dedes/tr.d047:trMA.Ode8C2Tr.incipit	…
ltx/en_us_dedes/tr.d047:trMA.Ode8C2Tr.melody	@ltx/en_us_dedes/he.h.m7:heHE.TonMononAnarchon.name
ltx/en_us_dedes/tr.d047:trMA.Ode8C2Tr.mode	@ltx/en_us_dedes/miscellanea:misc.Mode7
ltx/en_us_dedes/tr.d047:trMA.Ode8C2Tr.ode	@ltx/en_us_dedes/miscellanea:misc.Ode8
ltx/en_us_dedes/tr.d047:trMA.Ode8C2Tr.text	
ltx/en_us_dedes/tr.d047:trMA.Ode9C11.greekmelody	@ltx/en_us_dedes/he.h.m1:heHE.FotizouFotizou.greekname
ltx/en_us_dedes/tr.d047:trMA.Ode9C11.incipit	…
ltx/en_us_dedes/tr.d047:trMA.Ode9C11.melody	@ltx/en_us_dedes/he.h.m1:heHE.FotizouFotizou.name
ltx/en_us_dedes/tr.d047:trMA.Ode9C11.mode	@ltx/en_us_dedes/miscellanea:misc.Mode7
ltx/en_us_dedes/tr.d047:trMA.Ode9C11.ode	@ltx/en_us_dedes/miscellanea:misc.Ode9
ltx/en_us_dedes/tr.d047:trMA.Ode9C11.text	
ltx/en_us_dedes/tr.d047:trMA.Ode9C12.incipit	…
ltx/en_us_dedes/tr.d047:trMA.Ode9C12.melody	@ltx/en_us_dedes/he.h.m1:heHE.FotizouFotizou.name
ltx/en_us_dedes/tr.d047:trMA.Ode9C12.mode	@ltx/en_us_dedes/miscellanea:misc.Mode7
ltx/en_us_dedes/tr.d047:trMA.Ode9C12.ode	@ltx/en_us_dedes/miscellanea:misc.Ode9
ltx/en_us_dedes/tr.d047:trMA.Ode9C12.text	
ltx/en_us_dedes/tr.d047:trMA.Ode9C13.incipit	…
ltx/en_us_dedes/tr.d047:trMA.Ode9C13.melody	@ltx/en_us_dedes/he.h.m1:heHE.FotizouFotizou.name
ltx/en_us_dedes/tr.d047:trMA.Ode9C13.mode	@ltx/en_us_dedes/miscellanea:misc.Mode7
ltx/en_us_dedes/tr.d047:trMA.Ode9C13.ode	@ltx/en_us_dedes/miscellanea:misc.Ode9
ltx/en_us_dedes/tr.d047:trMA.Ode9C13.text	
ltx/en_us_dedes/tr.d047:trMA.Ode9C1T.incipit	…
ltx/en_us_dedes/tr.d047:trMA.Ode9C1T.melody	@ltx/en_us_dedes/he.h.m1:heHE.FotizouFotizou.name
ltx/en_us_dedes/tr.d047:trMA.Ode9C1T.mode	@ltx/en_us_dedes/miscellanea:misc.Mode7
ltx/en_us_dedes/tr.d047:trMA.Ode9C1T.ode	@ltx/en_us_dedes/miscellanea:misc.Ode9
ltx/en_us_dedes/tr.d047:trMA.Ode9C1T.text	
ltx/en_us_dedes/tr.d047:trMA.Ode9C21.greekmelody	@ltx/en_us_dedes/he.h.m7:heHE.SeTinAchranton.greekname
ltx/en_us_dedes/tr.d047:trMA.Ode9C21.incipit	…
ltx/en_us_dedes/tr.d047:trMA.Ode9C21.melody	@ltx/en_us_dedes/he.h.m7:heHE.SeTinAchranton.name
ltx/en_us_dedes/tr.d047:trMA.Ode9C21.mode	@ltx/en_us_dedes/miscellanea:misc.Mode7
ltx/en_us_dedes/tr.d047:trMA.Ode9C21.ode	@ltx/en_us_dedes/miscellanea:misc.Ode9
ltx/en_us_dedes/tr.d047:trMA.Ode9C21.text	
ltx/en_us_dedes/tr.d047:trMA.Ode9C22.incipit	…
ltx/en_us_dedes/tr.d047:trMA.Ode9C22.melody	@ltx/en_us_dedes/he.h.m7:heHE.SeTinAchranton.name
ltx/en_us_dedes/tr.d047:trMA.Ode9C22.mode	@ltx/en_us_dedes/miscellanea:misc.Mode7
ltx/en_us_dedes/tr.d047:trMA.Ode9C22.ode	@ltx/en_us_dedes/miscellanea:misc.Ode9
ltx/en_us_dedes/tr.d047:trMA.Ode9C22.text	
ltx/en_us_dedes/tr.d047:trMA.Ode9C2A1.incipit	…
ltx/en_us_dedes/tr.d047:trMA.Ode9C2A1.melody	@ltx/en_us_dedes/he.h.m7:heHE.SeTinAchranton.name
ltx/en_us_dedes/tr.d047:trMA.Ode9C2A1.mode	@ltx/en_us_dedes/miscellanea:misc.Mode7
ltx/en_us_dedes/tr.d047:trMA.Ode9C2A1.ode	@ltx/en_us_dedes/miscellanea:misc.Ode9
ltx/en_us_dedes/tr.d047:trMA.Ode9C2A1.text	
ltx/en_us_dedes/tr.d047:trMA.Ode9C2H.greekmelody	@ltx/en_us_dedes/he.h.m7:heHE.SeTinAchranton.greekname
ltx/en_us_dedes/tr.d047:trMA.Ode9C2H.incipit	@ltx/en_us_dedes/he.h.m7:heHE.SeTinAchranton.incipit
ltx/en_us_dedes/tr.d047:trMA.Ode9C2H.melody	@ltx/en_us_dedes/he.h.m7:heHE.SeTinAchranton.melody
ltx/en_us_dedes/tr.d047:trMA.Ode9C2H.mode	@ltx/en_us_dedes/miscellanea:misc.Mode7
ltx/en_us_dedes/tr.d047:trMA.Ode9C2H.ode	@ltx/en_us_dedes/miscellanea:misc.Ode9
ltx/en_us_dedes/tr.d047:trMA.Ode9C2H.text	@ltx/en_us_dedes/he.h.m7:heHE.SeTinAchranton.text
ltx/en_us_dedes/tr.d047:trMA.Ode9C2T.incipit	…
ltx/en_us_dedes/tr.d047:trMA.Ode9C2T.melody	@ltx/en_us_dedes/he.h.m7:heHE.SeTinAchranton.name
ltx/en_us_dedes/tr.d047:trMA.Ode9C2T.mode	@ltx/en_us_dedes/miscellanea:misc.Mode7
ltx/en_us_dedes/tr.d047:trMA.Ode9C2T.ode	@ltx/en_us_dedes/miscellanea:misc.Ode9
ltx/en_us_dedes/tr.d047:trMA.Ode9C2T.text	
ltx/en_us_dedes/tr.d047:trMA.Ode9C2Tr.incipit	…
ltx/en_us_dedes/tr.d047:trMA.Ode9C2Tr.melody	@ltx/en_us_dedes/he.h.m7:heHE.SeTinAchranton.name
ltx/en_us_dedes/tr.d047:trMA.Ode9C2Tr.mode	@ltx/en_us_dedes/miscellanea:misc.Mode7
ltx/en_us_dedes/tr.d047:trMA.Ode9C2Tr.ode	@ltx/en_us_dedes/miscellanea:misc.Ode9
ltx/en_us_dedes/tr.d047:trMA.Ode9C2Tr.text	
ltx/en_us_dedes/tr.d047:trTE.Troparion.incipit	…
ltx/en_us_dedes/tr.d047:trTE.Troparion.melody	
ltx/en_us_dedes/tr.d047:trTE.Troparion.mode	@ltx/en_us_dedes/miscellanea:misc.Mode6
ltx/en_us_dedes/tr.d047:trTE.Troparion.text	
ltx/en_us_dedes/tr.d047:trVE.AposIdiomelon1.incipit	Lent, that procurer of blessings…
ltx/en_us_dedes/tr.d047:trVE.AposIdiomelon1.melody	
ltx/en_us_dedes/tr.d047:trVE.AposIdiomelon1.mode	@ltx/en_us_dedes/miscellanea:misc.Mode4
ltx/en_us_dedes/tr.d047:trVE.AposIdiomelon1.text	Lent, that procurer of blessings, has now reached its midpoint; it has been pleasing to God in the preceding days, and it promises benefits in the days to come. Indeed the longer we do good deeds, the greater the benefits will be. So, as we continue pleasing Christ, the Giver of all that is good, let us cry out to Him, “We pray You, who for our sake fasted and endured the Cross, grant that we may live peacefully, and without condemnation participate in Your divine Pascha, worthily glorifying You and the Father and the Spirit.”
ltx/en_us_dedes/tr.d047:trVE.AposIdiomelon2.incipit	Those who do virtuous deeds…
ltx/en_us_dedes/tr.d047:trVE.AposIdiomelon2.melody	
ltx/en_us_dedes/tr.d047:trVE.AposIdiomelon2.mode	@ltx/en_us_dedes/miscellanea:misc.Mode5
ltx/en_us_dedes/tr.d047:trVE.AposIdiomelon2.text	Those who do virtuous deeds in secret, and anticipate spiritual rewards for them, do not advertise them publicly. On the contrary, they store them within their hearts; and He who sees what is done in secret gives us our wages for our self-control. So let us fast, but not with downcast faces; rather, praying in the inner rooms of our souls, let us unceasingly cry aloud, “Our Father, who art in heaven, we pray You, lead us not into temptation, but deliver us from evil.”
ltx/en_us_dedes/tr.d047:trVE.AposMartyric.incipit	@ltx/en_us_dedes/oc.m5.d5:ocVE.Aposticha3.incipit
ltx/en_us_dedes/tr.d047:trVE.AposMartyric.melody	
ltx/en_us_dedes/tr.d047:trVE.AposMartyric.mode	@ltx/en_us_dedes/miscellanea:misc.Mode5
ltx/en_us_dedes/tr.d047:trVE.AposMartyric.text	@ltx/en_us_dedes/oc.m5.d5:ocVE.Aposticha3.text
ltx/en_us_dedes/tr.d047:trVE.SticGlory.incipit	@ltx/en_us_dedes/tr.d043:trMA.AdditionalIdiomelonGlory.incipit
ltx/en_us_dedes/tr.d047:trVE.SticGlory.melody	@ltx/en_us_dedes/miscellanea:misc.Idiomelon
ltx/en_us_dedes/tr.d047:trVE.SticGlory.mode	@ltx/en_us_dedes/miscellanea:misc.Mode8
ltx/en_us_dedes/tr.d047:trVE.SticGlory.text	@ltx/en_us_dedes/tr.d043:trMA.AdditionalIdiomelonGlory.text
ltx/en_us_dedes/tr.d047:trVE.Stichera01.greekmelody	@ltx/en_us_dedes/he.a.m1:heAU.PaneffimoiMartyres.greekname
ltx/en_us_dedes/tr.d047:trVE.Stichera01.incipit	With fasting like water, let…
ltx/en_us_dedes/tr.d047:trVE.Stichera01.melody	@ltx/en_us_dedes/he.a.m1:heAU.PaneffimoiMartyres.name
ltx/en_us_dedes/tr.d047:trVE.Stichera01.mode	@ltx/en_us_dedes/miscellanea:misc.Mode1
ltx/en_us_dedes/tr.d047:trVE.Stichera01.text	With fasting like water, let us all * wash our souls and make them clean, and let us come to the church today and venerate with faith * the august and precious * Cross of Christ our Lord and God, * and draw illumination divine from it, and also reap the fruits * of salvation for eternity, * and divine peace, * as well as the great mercy.
ltx/en_us_dedes/tr.d047:trVE.Stichera02.greekmelody	@ltx/en_us_dedes/he.a.m1:heAU.PaneffimoiMartyres.greekname
ltx/en_us_dedes/tr.d047:trVE.Stichera02.incipit	O Cross, the Apostles’ pride…
ltx/en_us_dedes/tr.d047:trVE.Stichera02.melody	@ltx/en_us_dedes/he.a.m1:heAU.PaneffimoiMartyres.name
ltx/en_us_dedes/tr.d047:trVE.Stichera02.mode	@ltx/en_us_dedes/miscellanea:misc.Mode1
ltx/en_us_dedes/tr.d047:trVE.Stichera02.text	O Cross, the Apostles’ pride and joy, * you are constantly surrounded by the Powers and Archangels and Principalities. * We who venerate you * pray that you will keep us safe from injury, and grant us to keep the holy season of the fast, * so that we may reach the saving day, * holy Pascha, * by which we are being saved.
ltx/en_us_dedes/tr.d047:trVE.Stichera03.greekmelody	@ltx/en_us_dedes/he.a.m7:heAU.SimeronGrigoreiOIoudas.greekname
ltx/en_us_dedes/tr.d047:trVE.Stichera03.incipit	Venerating the Cross of the…
ltx/en_us_dedes/tr.d047:trVE.Stichera03.melody	@ltx/en_us_dedes/he.a.m7:heAU.SimeronGrigoreiOIoudas.name
ltx/en_us_dedes/tr.d047:trVE.Stichera03.mode	@ltx/en_us_dedes/miscellanea:misc.Mode7
ltx/en_us_dedes/tr.d047:trVE.Stichera03.text	Venerating the Cross of the Master today, let us cry aloud: * Tree of life, and destroyer of Hades, we salute you. * Rejoice, universal joy, remover of corruption. * Rejoice, for you drive away the demons by your power. * The believers’ firm support, the shield that is shatter-proof: * we entreat you, keep us safe * and sanctify us venerating you today.
ltx/en_us_dedes/tr.d047:trVL.header	Presanctified Liturgy on Wednesday of the Fourth Week
