ltx/en_us_dedes/ty.m01.d23:tyCommemoration.text	
ltx/en_us_dedes/ty.m01.d23:tyDate.text	
ltx/en_us_dedes/ty.m01.d23:tyLI.AfterCommunion.text	
ltx/en_us_dedes/ty.m01.d23:tyLI.AmboPrayer.text	
ltx/en_us_dedes/ty.m01.d23:tyLI.Antiphons.text	
ltx/en_us_dedes/ty.m01.d23:tyLI.Apolytikia.text	
ltx/en_us_dedes/ty.m01.d23:tyLI.CommunionHymn.text	
ltx/en_us_dedes/ty.m01.d23:tyLI.Dismissal.text	
ltx/en_us_dedes/ty.m01.d23:tyLI.EntranceHymn.text	
ltx/en_us_dedes/ty.m01.d23:tyLI.Epistle.text	
ltx/en_us_dedes/ty.m01.d23:tyLI.Gospel.text	
ltx/en_us_dedes/ty.m01.d23:tyLI.Kontakion.text	
ltx/en_us_dedes/ty.m01.d23:tyLI.Megalynarion.text	
ltx/en_us_dedes/ty.m01.d23:tyLI.TheotokosHymn.text	
ltx/en_us_dedes/ty.m01.d23:tyMA.Anavathmoi.text	
ltx/en_us_dedes/ty.m01.d23:tyMA.Apolytikia.text	
ltx/en_us_dedes/ty.m01.d23:tyMA.Canons.text	
ltx/en_us_dedes/ty.m01.d23:tyMA.Doxology.text	
ltx/en_us_dedes/ty.m01.d23:tyMA.EndApolytikion.text	
ltx/en_us_dedes/ty.m01.d23:tyMA.Exaposteilaria.text	
ltx/en_us_dedes/ty.m01.d23:tyMA.Katavasias.text	
ltx/en_us_dedes/ty.m01.d23:tyMA.Kathismata.text	
ltx/en_us_dedes/ty.m01.d23:tyMA.KontakionOikos.text	
ltx/en_us_dedes/ty.m01.d23:tyMA.Lauds.text	
ltx/en_us_dedes/ty.m01.d23:tyMA.LaudsBoth.text	
ltx/en_us_dedes/ty.m01.d23:tyMA.LaudsGlory.text	
ltx/en_us_dedes/ty.m01.d23:tyMA.LaudsVerses.text	
ltx/en_us_dedes/ty.m01.d23:tyMA.Magnificat.text	
ltx/en_us_dedes/ty.m01.d23:tyMA.MatinsGospel.text	
ltx/en_us_dedes/ty.m01.d23:tyMA.MidodeKath.text	
ltx/en_us_dedes/ty.m01.d23:tyMA.MidodeKontakion.text	
ltx/en_us_dedes/ty.m01.d23:tyMA.Ode9_1.text	
ltx/en_us_dedes/ty.m01.d23:tyMA.Ode9_2.text	
ltx/en_us_dedes/ty.m01.d23:tyMA.Ode9_3.text	
ltx/en_us_dedes/ty.m01.d23:tyMA.Ode9_4.text	
ltx/en_us_dedes/ty.m01.d23:tyMA.Ode9_5.text	
ltx/en_us_dedes/ty.m01.d23:tyMA.Ode9_6.text	
ltx/en_us_dedes/ty.m01.d23:tyMA.Ode9_7.text	
ltx/en_us_dedes/ty.m01.d23:tyMA.Ode9_8.text	
ltx/en_us_dedes/ty.m01.d23:tyMA.Ode9_Katavasia1.text	
ltx/en_us_dedes/ty.m01.d23:tyMA.Ode9_Katavasia2.text	
ltx/en_us_dedes/ty.m01.d23:tyMA.ProkVerse.text	
ltx/en_us_dedes/ty.m01.d23:tyMA.Prokeimenon.text	
ltx/en_us_dedes/ty.m01.d23:tyMA.Psalm50.text	
ltx/en_us_dedes/ty.m01.d23:tyMA.Synaxarion.text	
ltx/en_us_dedes/ty.m01.d23:tyMO.Rubric1.text	
ltx/en_us_dedes/ty.m01.d23:tyNote1.text	
ltx/en_us_dedes/ty.m01.d23:tyVE.Apolytikia.text	
ltx/en_us_dedes/ty.m01.d23:tyVE.AposBoth.text	
ltx/en_us_dedes/ty.m01.d23:tyVE.AposGlory.text	
ltx/en_us_dedes/ty.m01.d23:tyVE.AposGloryBoth.text	
ltx/en_us_dedes/ty.m01.d23:tyVE.Aposticha.text	
ltx/en_us_dedes/ty.m01.d23:tyVE.Dismissal.text	
ltx/en_us_dedes/ty.m01.d23:tyVE.Entrance.text	
ltx/en_us_dedes/ty.m01.d23:tyVE.Intro.text	
ltx/en_us_dedes/ty.m01.d23:tyVE.LIHC.text	
ltx/en_us_dedes/ty.m01.d23:tyVE.Note1.text	
ltx/en_us_dedes/ty.m01.d23:tyVE.Note2.text	
ltx/en_us_dedes/ty.m01.d23:tyVE.SticBoth.text	
ltx/en_us_dedes/ty.m01.d23:tyVE.SticGlory.text	
ltx/en_us_dedes/ty.m01.d23:tyVE.SticGloryBoth.text	
ltx/en_us_dedes/ty.m01.d23:tyVE.Stichera.text	
