ltx/en_us_dedes/sy.m02.d12:cl.syMA.commemoration01.text	[saint/com 1]
ltx/en_us_dedes/sy.m02.d12:cl.syMA.commemoration02.text	[saint/com 2]
ltx/en_us_dedes/sy.m02.d12:cl.syMA.commemoration03.text	[saint/com 3]
ltx/en_us_dedes/sy.m02.d12:cl.syMA.commemoration04.text	[saint/com 4]
ltx/en_us_dedes/sy.m02.d12:cl.syMA.commemoration05.text	[saint/com 5]
ltx/en_us_dedes/sy.m02.d12:cl.syMA.commemoration06.text	[saint/com list]
ltx/en_us_dedes/sy.m02.d12:syMA.commemoration01.couplet1.title	@ltx/en_us_dedes/titles:ti.Verses
ltx/en_us_dedes/sy.m02.d12:syMA.commemoration01.couplet1.verse1	
ltx/en_us_dedes/sy.m02.d12:syMA.commemoration01.couplet1.verse2	
ltx/en_us_dedes/sy.m02.d12:syMA.commemoration01.narration.p01	
ltx/en_us_dedes/sy.m02.d12:syMA.commemoration01.narration.p02	
ltx/en_us_dedes/sy.m02.d12:syMA.commemoration01.single1	
ltx/en_us_dedes/sy.m02.d12:syMA.commemoration01.text	On February 12 we commemorate our father among the Saints Meletios, Archbishop of Antioch the Great.
ltx/en_us_dedes/sy.m02.d12:syMA.commemoration02.couplet1.title	@ltx/en_us_dedes/titles:ti.Verses
ltx/en_us_dedes/sy.m02.d12:syMA.commemoration02.couplet1.verse1	
ltx/en_us_dedes/sy.m02.d12:syMA.commemoration02.couplet1.verse2	
ltx/en_us_dedes/sy.m02.d12:syMA.commemoration02.narration.p01	
ltx/en_us_dedes/sy.m02.d12:syMA.commemoration02.text	On this day we also commemorate the devout Maria, who was renamed Marinos.
ltx/en_us_dedes/sy.m02.d12:syMA.commemoration03.couplet1.title	@ltx/en_us_dedes/titles:ti.Verses
ltx/en_us_dedes/sy.m02.d12:syMA.commemoration03.couplet1.verse1	
ltx/en_us_dedes/sy.m02.d12:syMA.commemoration03.couplet1.verse2	
ltx/en_us_dedes/sy.m02.d12:syMA.commemoration03.narration.p01	
ltx/en_us_dedes/sy.m02.d12:syMA.commemoration03.narration.p02	
ltx/en_us_dedes/sy.m02.d12:syMA.commemoration03.narration.p03	
ltx/en_us_dedes/sy.m02.d12:syMA.commemoration03.text	On this day we also commemorate our devout father Anthony, Archbishop of Constantinople.
ltx/en_us_dedes/sy.m02.d12:syMA.commemoration04.couplet1.title	@ltx/en_us_dedes/titles:ti.Verses
ltx/en_us_dedes/sy.m02.d12:syMA.commemoration04.couplet1.verse1	
ltx/en_us_dedes/sy.m02.d12:syMA.commemoration04.couplet1.verse2	
ltx/en_us_dedes/sy.m02.d12:syMA.commemoration04.text	On this day Sts. Saturninus and Plotinus died by the sword.
ltx/en_us_dedes/sy.m02.d12:syMA.commemoration05.couplet1.title	@ltx/en_us_dedes/titles:ti.Verses
ltx/en_us_dedes/sy.m02.d12:syMA.commemoration05.couplet1.verse1	
ltx/en_us_dedes/sy.m02.d12:syMA.commemoration05.couplet1.verse2	
ltx/en_us_dedes/sy.m02.d12:syMA.commemoration05.text	The holy new martyr Chrestos the gardener, who witnessed in Constantinople in the year 1748, died by the sword.
ltx/en_us_dedes/sy.m02.d12:syMA.lastline	By the intercessions of Your Saints, O God, have mercy on us. Amen.
