ltx/en_us_dedes/me.m05.d06:meDA.commemoration.first	Memory of Righteous Job
ltx/en_us_dedes/me.m05.d06:meDA.commemoration.first_name	
ltx/en_us_dedes/me.m05.d06:meDA.commemoration.first_short	Memory of Righteous Job
ltx/en_us_dedes/me.m05.d06:meDA.commemoration.first_title	@ltx/en_us_dedes/titles:ti.SaintM
ltx/en_us_dedes/me.m05.d06:meDA.commemoration.full	Memory of Righteous Job and our Devout Father Seraphim of Mt. Dombos
ltx/en_us_dedes/me.m05.d06:meDA.commemoration.second_name	
ltx/en_us_dedes/me.m05.d06:meDA.commemoration.second_title	
ltx/en_us_dedes/me.m05.d06:meDA.date	May 6
ltx/en_us_dedes/me.m05.d06:meDA.fordate	for May 6
ltx/en_us_dedes/me.m05.d06:meDA.insert1	
ltx/en_us_dedes/me.m05.d06:meDA.insert2	
ltx/en_us_dedes/me.m05.d06:meDA.note	
ltx/en_us_dedes/me.m05.d06:meDA.pdfcoverdate	May 6,
ltx/en_us_dedes/me.m05.d06:meDA.pdfheaderdate	May 6
ltx/en_us_dedes/me.m05.d06:meHO.commemorations	
ltx/en_us_dedes/me.m05.d06:meHO.note1	
ltx/en_us_dedes/me.m05.d06:meHO.note2	
ltx/en_us_dedes/me.m05.d06:meHO.number	
ltx/en_us_dedes/me.m05.d06:meHO.rank	
ltx/en_us_dedes/me.m05.d06:meLE.commemoration1	
ltx/en_us_dedes/me.m05.d06:meLE.commemoration2	
ltx/en_us_dedes/me.m05.d06:meLI.Kontakion1.greekmelody	@ltx/en_us_dedes/me.m05.d06:meMA.Kontakion1.greekmelody
ltx/en_us_dedes/me.m05.d06:meLI.Kontakion1.incipit	@ltx/en_us_dedes/me.m05.d06:meMA.Kontakion1.incipit
ltx/en_us_dedes/me.m05.d06:meLI.Kontakion1.melody	@ltx/en_us_dedes/me.m05.d06:meMA.Kontakion1.melody
ltx/en_us_dedes/me.m05.d06:meLI.Kontakion1.mode	@ltx/en_us_dedes/me.m05.d06:meMA.Kontakion1.mode
ltx/en_us_dedes/me.m05.d06:meLI.Kontakion1.text	@ltx/en_us_dedes/me.m05.d06:meMA.Kontakion1.text
ltx/en_us_dedes/me.m05.d06:meLI.Megalynarion.text	
ltx/en_us_dedes/me.m05.d06:meLI.Megalynarion2.text	
ltx/en_us_dedes/me.m05.d06:meMA.C1.acrostic.notice1	
ltx/en_us_dedes/me.m05.d06:meMA.C1.acrostic.text	
ltx/en_us_dedes/me.m05.d06:meMA.C1.acrostic.title	
ltx/en_us_dedes/me.m05.d06:meMA.C1.poet	@ltx/en_us_dedes/poets:po.AgiouKosmaOiDeIoannouMonachou
ltx/en_us_dedes/me.m05.d06:meMA.C1.title	@ltx/en_us_dedes/titles:ti.CanonSaintM
ltx/en_us_dedes/me.m05.d06:meMA.C1.verse	@ltx/en_us_dedes/prayers:pr.verse_SaintM.text
ltx/en_us_dedes/me.m05.d06:meMA.Kontakion1.greekmelody	@ltx/en_us_dedes/he.a.m8:heAU.OsAparchas.greekname
ltx/en_us_dedes/me.m05.d06:meMA.Kontakion1.incipit	…
ltx/en_us_dedes/me.m05.d06:meMA.Kontakion1.melody	@ltx/en_us_dedes/he.a.m8:heAU.OsAparchas.name
ltx/en_us_dedes/me.m05.d06:meMA.Kontakion1.mode	@ltx/en_us_dedes/miscellanea:misc.Mode8
ltx/en_us_dedes/me.m05.d06:meMA.Kontakion1.text	
ltx/en_us_dedes/me.m05.d06:meMA.Ode1C11.greekmelody	@ltx/en_us_dedes/he.h.m4:heHE.ChoroiIsrail.greekname
ltx/en_us_dedes/me.m05.d06:meMA.Ode1C11.incipit	…
ltx/en_us_dedes/me.m05.d06:meMA.Ode1C11.melody	@ltx/en_us_dedes/he.h.m4:heHE.ChoroiIsrail.name
ltx/en_us_dedes/me.m05.d06:meMA.Ode1C11.mode	@ltx/en_us_dedes/miscellanea:misc.Mode4
ltx/en_us_dedes/me.m05.d06:meMA.Ode1C11.ode	@ltx/en_us_dedes/miscellanea:misc.Ode1
ltx/en_us_dedes/me.m05.d06:meMA.Ode1C11.text	
ltx/en_us_dedes/me.m05.d06:meMA.Ode1C12.incipit	…
ltx/en_us_dedes/me.m05.d06:meMA.Ode1C12.melody	@ltx/en_us_dedes/he.h.m4:heHE.ChoroiIsrail.name
ltx/en_us_dedes/me.m05.d06:meMA.Ode1C12.mode	@ltx/en_us_dedes/miscellanea:misc.Mode4
ltx/en_us_dedes/me.m05.d06:meMA.Ode1C12.ode	@ltx/en_us_dedes/miscellanea:misc.Ode1
ltx/en_us_dedes/me.m05.d06:meMA.Ode1C12.text	
ltx/en_us_dedes/me.m05.d06:meMA.Ode1C13.incipit	…
ltx/en_us_dedes/me.m05.d06:meMA.Ode1C13.melody	@ltx/en_us_dedes/he.h.m4:heHE.ChoroiIsrail.name
ltx/en_us_dedes/me.m05.d06:meMA.Ode1C13.mode	@ltx/en_us_dedes/miscellanea:misc.Mode4
ltx/en_us_dedes/me.m05.d06:meMA.Ode1C13.ode	@ltx/en_us_dedes/miscellanea:misc.Ode1
ltx/en_us_dedes/me.m05.d06:meMA.Ode1C13.text	
ltx/en_us_dedes/me.m05.d06:meMA.Ode1C1T.incipit	…
ltx/en_us_dedes/me.m05.d06:meMA.Ode1C1T.melody	@ltx/en_us_dedes/he.h.m4:heHE.ChoroiIsrail.name
ltx/en_us_dedes/me.m05.d06:meMA.Ode1C1T.mode	@ltx/en_us_dedes/miscellanea:misc.Mode4
ltx/en_us_dedes/me.m05.d06:meMA.Ode1C1T.ode	@ltx/en_us_dedes/miscellanea:misc.Ode1
ltx/en_us_dedes/me.m05.d06:meMA.Ode1C1T.text	
ltx/en_us_dedes/me.m05.d06:meMA.Ode3C11.greekmelody	@ltx/en_us_dedes/he.h.m4:heHE.ToxonDynatonIsthenise.greekname
ltx/en_us_dedes/me.m05.d06:meMA.Ode3C11.incipit	…
ltx/en_us_dedes/me.m05.d06:meMA.Ode3C11.melody	@ltx/en_us_dedes/he.h.m4:heHE.ToxonDynatonIsthenise.name
ltx/en_us_dedes/me.m05.d06:meMA.Ode3C11.mode	@ltx/en_us_dedes/miscellanea:misc.Mode4
ltx/en_us_dedes/me.m05.d06:meMA.Ode3C11.ode	@ltx/en_us_dedes/miscellanea:misc.Ode3
ltx/en_us_dedes/me.m05.d06:meMA.Ode3C11.text	
ltx/en_us_dedes/me.m05.d06:meMA.Ode3C12.incipit	…
ltx/en_us_dedes/me.m05.d06:meMA.Ode3C12.melody	@ltx/en_us_dedes/he.h.m4:heHE.ToxonDynatonIsthenise.name
ltx/en_us_dedes/me.m05.d06:meMA.Ode3C12.mode	@ltx/en_us_dedes/miscellanea:misc.Mode4
ltx/en_us_dedes/me.m05.d06:meMA.Ode3C12.ode	@ltx/en_us_dedes/miscellanea:misc.Ode3
ltx/en_us_dedes/me.m05.d06:meMA.Ode3C12.text	
ltx/en_us_dedes/me.m05.d06:meMA.Ode3C13.incipit	…
ltx/en_us_dedes/me.m05.d06:meMA.Ode3C13.melody	@ltx/en_us_dedes/he.h.m4:heHE.ToxonDynatonIsthenise.name
ltx/en_us_dedes/me.m05.d06:meMA.Ode3C13.mode	@ltx/en_us_dedes/miscellanea:misc.Mode4
ltx/en_us_dedes/me.m05.d06:meMA.Ode3C13.ode	@ltx/en_us_dedes/miscellanea:misc.Ode3
ltx/en_us_dedes/me.m05.d06:meMA.Ode3C13.text	
ltx/en_us_dedes/me.m05.d06:meMA.Ode3C1T.incipit	…
ltx/en_us_dedes/me.m05.d06:meMA.Ode3C1T.melody	@ltx/en_us_dedes/he.h.m4:heHE.ToxonDynatonIsthenise.name
ltx/en_us_dedes/me.m05.d06:meMA.Ode3C1T.mode	@ltx/en_us_dedes/miscellanea:misc.Mode4
ltx/en_us_dedes/me.m05.d06:meMA.Ode3C1T.ode	@ltx/en_us_dedes/miscellanea:misc.Ode3
ltx/en_us_dedes/me.m05.d06:meMA.Ode3C1T.text	
ltx/en_us_dedes/me.m05.d06:meMA.Ode3H.greekmelody	@ltx/en_us_dedes/he.h.m4:heHE.ToxonDynatonIsthenise.greekname
ltx/en_us_dedes/me.m05.d06:meMA.Ode3H.incipit	@ltx/en_us_dedes/he.h.m4:heHE.ToxonDynatonIsthenise.incipit
ltx/en_us_dedes/me.m05.d06:meMA.Ode3H.melody	@ltx/en_us_dedes/he.h.m4:heHE.ToxonDynatonIsthenise.melody
ltx/en_us_dedes/me.m05.d06:meMA.Ode3H.mode	@ltx/en_us_dedes/miscellanea:misc.Mode4
ltx/en_us_dedes/me.m05.d06:meMA.Ode3H.ode	@ltx/en_us_dedes/miscellanea:misc.Ode3
ltx/en_us_dedes/me.m05.d06:meMA.Ode3H.text	@ltx/en_us_dedes/he.h.m4:heHE.ToxonDynatonIsthenise.text
ltx/en_us_dedes/me.m05.d06:meMA.Ode3Kathisma1.greekmelody	@ltx/en_us_dedes/he.a.m3:heAU.TinOraiotita.greekname
ltx/en_us_dedes/me.m05.d06:meMA.Ode3Kathisma1.incipit	…
ltx/en_us_dedes/me.m05.d06:meMA.Ode3Kathisma1.melody	@ltx/en_us_dedes/he.a.m3:heAU.TinOraiotita.name
ltx/en_us_dedes/me.m05.d06:meMA.Ode3Kathisma1.mode	@ltx/en_us_dedes/miscellanea:misc.Mode3
ltx/en_us_dedes/me.m05.d06:meMA.Ode3Kathisma1.text	
ltx/en_us_dedes/me.m05.d06:meMA.Ode4C11.greekmelody	@ltx/en_us_dedes/he.h.m4:heHE.EisakikoaTinEndoxon.greekname
ltx/en_us_dedes/me.m05.d06:meMA.Ode4C11.incipit	…
ltx/en_us_dedes/me.m05.d06:meMA.Ode4C11.melody	@ltx/en_us_dedes/he.h.m4:heHE.EisakikoaTinEndoxon.name
ltx/en_us_dedes/me.m05.d06:meMA.Ode4C11.mode	@ltx/en_us_dedes/miscellanea:misc.Mode4
ltx/en_us_dedes/me.m05.d06:meMA.Ode4C11.ode	@ltx/en_us_dedes/miscellanea:misc.Ode4
ltx/en_us_dedes/me.m05.d06:meMA.Ode4C11.text	
ltx/en_us_dedes/me.m05.d06:meMA.Ode4C12.incipit	…
ltx/en_us_dedes/me.m05.d06:meMA.Ode4C12.melody	@ltx/en_us_dedes/he.h.m4:heHE.EisakikoaTinEndoxon.name
ltx/en_us_dedes/me.m05.d06:meMA.Ode4C12.mode	@ltx/en_us_dedes/miscellanea:misc.Mode4
ltx/en_us_dedes/me.m05.d06:meMA.Ode4C12.ode	@ltx/en_us_dedes/miscellanea:misc.Ode4
ltx/en_us_dedes/me.m05.d06:meMA.Ode4C12.text	
ltx/en_us_dedes/me.m05.d06:meMA.Ode4C13.incipit	…
ltx/en_us_dedes/me.m05.d06:meMA.Ode4C13.melody	@ltx/en_us_dedes/he.h.m4:heHE.EisakikoaTinEndoxon.name
ltx/en_us_dedes/me.m05.d06:meMA.Ode4C13.mode	@ltx/en_us_dedes/miscellanea:misc.Mode4
ltx/en_us_dedes/me.m05.d06:meMA.Ode4C13.ode	@ltx/en_us_dedes/miscellanea:misc.Ode4
ltx/en_us_dedes/me.m05.d06:meMA.Ode4C13.text	
ltx/en_us_dedes/me.m05.d06:meMA.Ode4C14.incipit	…
ltx/en_us_dedes/me.m05.d06:meMA.Ode4C14.melody	@ltx/en_us_dedes/he.h.m4:heHE.EisakikoaTinEndoxon.name
ltx/en_us_dedes/me.m05.d06:meMA.Ode4C14.mode	@ltx/en_us_dedes/miscellanea:misc.Mode4
ltx/en_us_dedes/me.m05.d06:meMA.Ode4C14.ode	@ltx/en_us_dedes/miscellanea:misc.Ode4
ltx/en_us_dedes/me.m05.d06:meMA.Ode4C14.text	
ltx/en_us_dedes/me.m05.d06:meMA.Ode4C1T.incipit	…
ltx/en_us_dedes/me.m05.d06:meMA.Ode4C1T.melody	@ltx/en_us_dedes/he.h.m4:heHE.EisakikoaTinEndoxon.name
ltx/en_us_dedes/me.m05.d06:meMA.Ode4C1T.mode	@ltx/en_us_dedes/miscellanea:misc.Mode4
ltx/en_us_dedes/me.m05.d06:meMA.Ode4C1T.ode	@ltx/en_us_dedes/miscellanea:misc.Ode4
ltx/en_us_dedes/me.m05.d06:meMA.Ode4C1T.text	
ltx/en_us_dedes/me.m05.d06:meMA.Ode5C11.greekmelody	@ltx/en_us_dedes/he.h.m4:heHE.OAnateilasToFos.greekname
ltx/en_us_dedes/me.m05.d06:meMA.Ode5C11.incipit	…
ltx/en_us_dedes/me.m05.d06:meMA.Ode5C11.melody	@ltx/en_us_dedes/he.h.m4:heHE.OAnateilasToFos.name
ltx/en_us_dedes/me.m05.d06:meMA.Ode5C11.mode	@ltx/en_us_dedes/miscellanea:misc.Mode4
ltx/en_us_dedes/me.m05.d06:meMA.Ode5C11.ode	@ltx/en_us_dedes/miscellanea:misc.Ode5
ltx/en_us_dedes/me.m05.d06:meMA.Ode5C11.text	
ltx/en_us_dedes/me.m05.d06:meMA.Ode5C12.incipit	…
ltx/en_us_dedes/me.m05.d06:meMA.Ode5C12.melody	@ltx/en_us_dedes/he.h.m4:heHE.OAnateilasToFos.name
ltx/en_us_dedes/me.m05.d06:meMA.Ode5C12.mode	@ltx/en_us_dedes/miscellanea:misc.Mode4
ltx/en_us_dedes/me.m05.d06:meMA.Ode5C12.ode	@ltx/en_us_dedes/miscellanea:misc.Ode5
ltx/en_us_dedes/me.m05.d06:meMA.Ode5C12.text	
ltx/en_us_dedes/me.m05.d06:meMA.Ode5C13.incipit	…
ltx/en_us_dedes/me.m05.d06:meMA.Ode5C13.melody	@ltx/en_us_dedes/he.h.m4:heHE.OAnateilasToFos.name
ltx/en_us_dedes/me.m05.d06:meMA.Ode5C13.mode	@ltx/en_us_dedes/miscellanea:misc.Mode4
ltx/en_us_dedes/me.m05.d06:meMA.Ode5C13.ode	@ltx/en_us_dedes/miscellanea:misc.Ode5
ltx/en_us_dedes/me.m05.d06:meMA.Ode5C13.text	
ltx/en_us_dedes/me.m05.d06:meMA.Ode5C1T.incipit	…
ltx/en_us_dedes/me.m05.d06:meMA.Ode5C1T.melody	@ltx/en_us_dedes/he.h.m4:heHE.OAnateilasToFos.name
ltx/en_us_dedes/me.m05.d06:meMA.Ode5C1T.mode	@ltx/en_us_dedes/miscellanea:misc.Mode4
ltx/en_us_dedes/me.m05.d06:meMA.Ode5C1T.ode	@ltx/en_us_dedes/miscellanea:misc.Ode5
ltx/en_us_dedes/me.m05.d06:meMA.Ode5C1T.text	
ltx/en_us_dedes/me.m05.d06:meMA.Ode6C11.greekmelody	@ltx/en_us_dedes/he.h.m4:heHE.EvoiseProtypon.greekname
ltx/en_us_dedes/me.m05.d06:meMA.Ode6C11.incipit	…
ltx/en_us_dedes/me.m05.d06:meMA.Ode6C11.melody	@ltx/en_us_dedes/he.h.m4:heHE.EvoiseProtypon.name
ltx/en_us_dedes/me.m05.d06:meMA.Ode6C11.mode	@ltx/en_us_dedes/miscellanea:misc.Mode4
ltx/en_us_dedes/me.m05.d06:meMA.Ode6C11.ode	@ltx/en_us_dedes/miscellanea:misc.Ode6
ltx/en_us_dedes/me.m05.d06:meMA.Ode6C11.text	
ltx/en_us_dedes/me.m05.d06:meMA.Ode6C12.incipit	…
ltx/en_us_dedes/me.m05.d06:meMA.Ode6C12.melody	@ltx/en_us_dedes/he.h.m4:heHE.EvoiseProtypon.name
ltx/en_us_dedes/me.m05.d06:meMA.Ode6C12.mode	@ltx/en_us_dedes/miscellanea:misc.Mode4
ltx/en_us_dedes/me.m05.d06:meMA.Ode6C12.ode	@ltx/en_us_dedes/miscellanea:misc.Ode6
ltx/en_us_dedes/me.m05.d06:meMA.Ode6C12.text	
ltx/en_us_dedes/me.m05.d06:meMA.Ode6C13.incipit	…
ltx/en_us_dedes/me.m05.d06:meMA.Ode6C13.melody	@ltx/en_us_dedes/he.h.m4:heHE.EvoiseProtypon.name
ltx/en_us_dedes/me.m05.d06:meMA.Ode6C13.mode	@ltx/en_us_dedes/miscellanea:misc.Mode4
ltx/en_us_dedes/me.m05.d06:meMA.Ode6C13.ode	@ltx/en_us_dedes/miscellanea:misc.Ode6
ltx/en_us_dedes/me.m05.d06:meMA.Ode6C13.text	
ltx/en_us_dedes/me.m05.d06:meMA.Ode6C1T.incipit	…
ltx/en_us_dedes/me.m05.d06:meMA.Ode6C1T.melody	@ltx/en_us_dedes/he.h.m4:heHE.EvoiseProtypon.name
ltx/en_us_dedes/me.m05.d06:meMA.Ode6C1T.mode	@ltx/en_us_dedes/miscellanea:misc.Mode4
ltx/en_us_dedes/me.m05.d06:meMA.Ode6C1T.ode	@ltx/en_us_dedes/miscellanea:misc.Ode6
ltx/en_us_dedes/me.m05.d06:meMA.Ode6C1T.text	
ltx/en_us_dedes/me.m05.d06:meMA.Ode6H.greekmelody	@ltx/en_us_dedes/he.h.m4:heHE.EvoiseProtypon.greekname
ltx/en_us_dedes/me.m05.d06:meMA.Ode6H.incipit	@ltx/en_us_dedes/he.h.m4:heHE.EvoiseProtypon.incipit
ltx/en_us_dedes/me.m05.d06:meMA.Ode6H.melody	@ltx/en_us_dedes/he.h.m4:heHE.EvoiseProtypon.melody
ltx/en_us_dedes/me.m05.d06:meMA.Ode6H.mode	@ltx/en_us_dedes/miscellanea:misc.Mode4
ltx/en_us_dedes/me.m05.d06:meMA.Ode6H.ode	@ltx/en_us_dedes/miscellanea:misc.Ode6
ltx/en_us_dedes/me.m05.d06:meMA.Ode6H.text	@ltx/en_us_dedes/he.h.m4:heHE.EvoiseProtypon.text
ltx/en_us_dedes/me.m05.d06:meMA.Ode7C11.greekmelody	@ltx/en_us_dedes/he.h.m4:heHE.ODiasosasEnPyri.greekname
ltx/en_us_dedes/me.m05.d06:meMA.Ode7C11.incipit	…
ltx/en_us_dedes/me.m05.d06:meMA.Ode7C11.melody	@ltx/en_us_dedes/he.h.m4:heHE.ODiasosasEnPyri.name
ltx/en_us_dedes/me.m05.d06:meMA.Ode7C11.mode	@ltx/en_us_dedes/miscellanea:misc.Mode4
ltx/en_us_dedes/me.m05.d06:meMA.Ode7C11.ode	@ltx/en_us_dedes/miscellanea:misc.Ode7
ltx/en_us_dedes/me.m05.d06:meMA.Ode7C11.text	
ltx/en_us_dedes/me.m05.d06:meMA.Ode7C12.incipit	…
ltx/en_us_dedes/me.m05.d06:meMA.Ode7C12.melody	@ltx/en_us_dedes/he.h.m4:heHE.ODiasosasEnPyri.name
ltx/en_us_dedes/me.m05.d06:meMA.Ode7C12.mode	@ltx/en_us_dedes/miscellanea:misc.Mode4
ltx/en_us_dedes/me.m05.d06:meMA.Ode7C12.ode	@ltx/en_us_dedes/miscellanea:misc.Ode7
ltx/en_us_dedes/me.m05.d06:meMA.Ode7C12.text	
ltx/en_us_dedes/me.m05.d06:meMA.Ode7C13.incipit	…
ltx/en_us_dedes/me.m05.d06:meMA.Ode7C13.melody	@ltx/en_us_dedes/he.h.m4:heHE.ODiasosasEnPyri.name
ltx/en_us_dedes/me.m05.d06:meMA.Ode7C13.mode	@ltx/en_us_dedes/miscellanea:misc.Mode4
ltx/en_us_dedes/me.m05.d06:meMA.Ode7C13.ode	@ltx/en_us_dedes/miscellanea:misc.Ode7
ltx/en_us_dedes/me.m05.d06:meMA.Ode7C13.text	
ltx/en_us_dedes/me.m05.d06:meMA.Ode7C1T.incipit	…
ltx/en_us_dedes/me.m05.d06:meMA.Ode7C1T.melody	@ltx/en_us_dedes/he.h.m4:heHE.ODiasosasEnPyri.name
ltx/en_us_dedes/me.m05.d06:meMA.Ode7C1T.mode	@ltx/en_us_dedes/miscellanea:misc.Mode4
ltx/en_us_dedes/me.m05.d06:meMA.Ode7C1T.ode	@ltx/en_us_dedes/miscellanea:misc.Ode7
ltx/en_us_dedes/me.m05.d06:meMA.Ode7C1T.text	
ltx/en_us_dedes/me.m05.d06:meMA.Ode7C1Tr.incipit	…
ltx/en_us_dedes/me.m05.d06:meMA.Ode7C1Tr.melody	@ltx/en_us_dedes/he.h.m4:heHE.ODiasosasEnPyri.name
ltx/en_us_dedes/me.m05.d06:meMA.Ode7C1Tr.mode	@ltx/en_us_dedes/miscellanea:misc.Mode4
ltx/en_us_dedes/me.m05.d06:meMA.Ode7C1Tr.ode	@ltx/en_us_dedes/miscellanea:misc.Ode7
ltx/en_us_dedes/me.m05.d06:meMA.Ode7C1Tr.text	
ltx/en_us_dedes/me.m05.d06:meMA.Ode8C11.greekmelody	@ltx/en_us_dedes/he.h.m4:heHE.TonEnMorfiAngelou.greekname
ltx/en_us_dedes/me.m05.d06:meMA.Ode8C11.incipit	…
ltx/en_us_dedes/me.m05.d06:meMA.Ode8C11.melody	@ltx/en_us_dedes/he.h.m4:heHE.TonEnMorfiAngelou.name
ltx/en_us_dedes/me.m05.d06:meMA.Ode8C11.mode	@ltx/en_us_dedes/miscellanea:misc.Mode4
ltx/en_us_dedes/me.m05.d06:meMA.Ode8C11.ode	@ltx/en_us_dedes/miscellanea:misc.Ode8
ltx/en_us_dedes/me.m05.d06:meMA.Ode8C11.text	
ltx/en_us_dedes/me.m05.d06:meMA.Ode8C12.incipit	…
ltx/en_us_dedes/me.m05.d06:meMA.Ode8C12.melody	@ltx/en_us_dedes/he.h.m4:heHE.TonEnMorfiAngelou.name
ltx/en_us_dedes/me.m05.d06:meMA.Ode8C12.mode	@ltx/en_us_dedes/miscellanea:misc.Mode4
ltx/en_us_dedes/me.m05.d06:meMA.Ode8C12.ode	@ltx/en_us_dedes/miscellanea:misc.Ode8
ltx/en_us_dedes/me.m05.d06:meMA.Ode8C12.text	
ltx/en_us_dedes/me.m05.d06:meMA.Ode8C13.incipit	…
ltx/en_us_dedes/me.m05.d06:meMA.Ode8C13.melody	@ltx/en_us_dedes/he.h.m4:heHE.TonEnMorfiAngelou.name
ltx/en_us_dedes/me.m05.d06:meMA.Ode8C13.mode	@ltx/en_us_dedes/miscellanea:misc.Mode4
ltx/en_us_dedes/me.m05.d06:meMA.Ode8C13.ode	@ltx/en_us_dedes/miscellanea:misc.Ode8
ltx/en_us_dedes/me.m05.d06:meMA.Ode8C13.text	
ltx/en_us_dedes/me.m05.d06:meMA.Ode8C14.incipit	…
ltx/en_us_dedes/me.m05.d06:meMA.Ode8C14.melody	@ltx/en_us_dedes/he.h.m4:heHE.TonEnMorfiAngelou.name
ltx/en_us_dedes/me.m05.d06:meMA.Ode8C14.mode	@ltx/en_us_dedes/miscellanea:misc.Mode4
ltx/en_us_dedes/me.m05.d06:meMA.Ode8C14.ode	@ltx/en_us_dedes/miscellanea:misc.Ode8
ltx/en_us_dedes/me.m05.d06:meMA.Ode8C14.text	
ltx/en_us_dedes/me.m05.d06:meMA.Ode8C1T.incipit	…
ltx/en_us_dedes/me.m05.d06:meMA.Ode8C1T.melody	@ltx/en_us_dedes/he.h.m4:heHE.TonEnMorfiAngelou.name
ltx/en_us_dedes/me.m05.d06:meMA.Ode8C1T.mode	@ltx/en_us_dedes/miscellanea:misc.Mode4
ltx/en_us_dedes/me.m05.d06:meMA.Ode8C1T.ode	@ltx/en_us_dedes/miscellanea:misc.Ode8
ltx/en_us_dedes/me.m05.d06:meMA.Ode8C1T.text	
ltx/en_us_dedes/me.m05.d06:meMA.Ode8H.greekmelody	@ltx/en_us_dedes/he.h.m4:heHE.TonEnMorfiAngelou.greekname
ltx/en_us_dedes/me.m05.d06:meMA.Ode8H.incipit	@ltx/en_us_dedes/he.h.m4:heHE.TonEnMorfiAngelou.incipit
ltx/en_us_dedes/me.m05.d06:meMA.Ode8H.melody	@ltx/en_us_dedes/he.h.m4:heHE.TonEnMorfiAngelou.melody
ltx/en_us_dedes/me.m05.d06:meMA.Ode8H.mode	@ltx/en_us_dedes/miscellanea:misc.Mode4
ltx/en_us_dedes/me.m05.d06:meMA.Ode8H.ode	@ltx/en_us_dedes/miscellanea:misc.Ode8
ltx/en_us_dedes/me.m05.d06:meMA.Ode8H.text	@ltx/en_us_dedes/he.h.m4:heHE.TonEnMorfiAngelou.text
ltx/en_us_dedes/me.m05.d06:meMA.Ode9C11.greekmelody	@ltx/en_us_dedes/he.h.m4:heHE.EvaMenToTisParakois.greekname
ltx/en_us_dedes/me.m05.d06:meMA.Ode9C11.incipit	…
ltx/en_us_dedes/me.m05.d06:meMA.Ode9C11.melody	@ltx/en_us_dedes/he.h.m4:heHE.EvaMenToTisParakois.name
ltx/en_us_dedes/me.m05.d06:meMA.Ode9C11.mode	@ltx/en_us_dedes/miscellanea:misc.Mode4
ltx/en_us_dedes/me.m05.d06:meMA.Ode9C11.ode	@ltx/en_us_dedes/miscellanea:misc.Ode9
ltx/en_us_dedes/me.m05.d06:meMA.Ode9C11.text	
ltx/en_us_dedes/me.m05.d06:meMA.Ode9C12.incipit	…
ltx/en_us_dedes/me.m05.d06:meMA.Ode9C12.melody	@ltx/en_us_dedes/he.h.m4:heHE.EvaMenToTisParakois.name
ltx/en_us_dedes/me.m05.d06:meMA.Ode9C12.mode	@ltx/en_us_dedes/miscellanea:misc.Mode4
ltx/en_us_dedes/me.m05.d06:meMA.Ode9C12.ode	@ltx/en_us_dedes/miscellanea:misc.Ode9
ltx/en_us_dedes/me.m05.d06:meMA.Ode9C12.text	
ltx/en_us_dedes/me.m05.d06:meMA.Ode9C13.incipit	…
ltx/en_us_dedes/me.m05.d06:meMA.Ode9C13.melody	@ltx/en_us_dedes/he.h.m4:heHE.EvaMenToTisParakois.name
ltx/en_us_dedes/me.m05.d06:meMA.Ode9C13.mode	@ltx/en_us_dedes/miscellanea:misc.Mode4
ltx/en_us_dedes/me.m05.d06:meMA.Ode9C13.ode	@ltx/en_us_dedes/miscellanea:misc.Ode9
ltx/en_us_dedes/me.m05.d06:meMA.Ode9C13.text	
ltx/en_us_dedes/me.m05.d06:meMA.Ode9C1T.incipit	…
ltx/en_us_dedes/me.m05.d06:meMA.Ode9C1T.melody	@ltx/en_us_dedes/he.h.m4:heHE.EvaMenToTisParakois.name
ltx/en_us_dedes/me.m05.d06:meMA.Ode9C1T.mode	@ltx/en_us_dedes/miscellanea:misc.Mode4
ltx/en_us_dedes/me.m05.d06:meMA.Ode9C1T.ode	@ltx/en_us_dedes/miscellanea:misc.Ode9
ltx/en_us_dedes/me.m05.d06:meMA.Ode9C1T.text	
ltx/en_us_dedes/me.m05.d06:meMA.Ode9H.greekmelody	@ltx/en_us_dedes/he.h.m4:heHE.EvaMenToTisParakois.greekname
ltx/en_us_dedes/me.m05.d06:meMA.Ode9H.incipit	@ltx/en_us_dedes/he.h.m4:heHE.EvaMenToTisParakois.incipit
ltx/en_us_dedes/me.m05.d06:meMA.Ode9H.melody	@ltx/en_us_dedes/he.h.m4:heHE.EvaMenToTisParakois.melody
ltx/en_us_dedes/me.m05.d06:meMA.Ode9H.mode	@ltx/en_us_dedes/miscellanea:misc.Mode4
ltx/en_us_dedes/me.m05.d06:meMA.Ode9H.ode	@ltx/en_us_dedes/miscellanea:misc.Ode9
ltx/en_us_dedes/me.m05.d06:meMA.Ode9H.text	@ltx/en_us_dedes/he.h.m4:heHE.EvaMenToTisParakois.text
ltx/en_us_dedes/me.m05.d06:meMA.Oikos1.text	God and Lord of all, ruling with the Son and the Holy Spirit, shined in one Godhead, and has made believers to be godly. He, the innocent Tongue, testified of Job, that he was an innocent, true, blameless, and God-fearing man, and one who abstains from every evil thing. Therefore, O righteous Job, we sing a hymn of praise to your memory and honor you.
ltx/en_us_dedes/me.m05.d06:meVE.Apolytikion1.incipit	As we celebrate the memory…
ltx/en_us_dedes/me.m05.d06:meVE.Apolytikion1.melody	@ltx/en_us_dedes/he.ga:heGA.TouProfitouSou.name
ltx/en_us_dedes/me.m05.d06:meVE.Apolytikion1.mode	@ltx/en_us_dedes/miscellanea:misc.Mode2
ltx/en_us_dedes/me.m05.d06:meVE.Apolytikion1.text	As we celebrate the memory of Your righteous Saint Job, through him we importune You, O Lord, that You save our souls.
ltx/en_us_dedes/me.m05.d06:meVE.Apolytikion2ger.greekmelody	@ltx/en_us_dedes/he.a.m3:heAU.TheiasPisteos.greekname
ltx/en_us_dedes/me.m05.d06:meVE.Apolytikion2ger.incipit	…
ltx/en_us_dedes/me.m05.d06:meVE.Apolytikion2ger.melody	@ltx/en_us_dedes/he.a.m3:heAU.TheiasPisteos.name
ltx/en_us_dedes/me.m05.d06:meVE.Apolytikion2ger.mode	@ltx/en_us_dedes/miscellanea:misc.Mode3
ltx/en_us_dedes/me.m05.d06:meVE.Apolytikion2ger.poet	@ltx/en_us_dedes/poets:po.Gerasimou
ltx/en_us_dedes/me.m05.d06:meVE.Apolytikion2ger.text	
ltx/en_us_dedes/me.m05.d06:meVE.Apolytikion3.greekmelody	@ltx/en_us_dedes/he.a.m4:heAU.KateplagiIosif.greekname
ltx/en_us_dedes/me.m05.d06:meVE.Apolytikion3.incipit	…
ltx/en_us_dedes/me.m05.d06:meVE.Apolytikion3.melody	@ltx/en_us_dedes/he.a.m4:heAU.KateplagiIosif.name
ltx/en_us_dedes/me.m05.d06:meVE.Apolytikion3.mode	@ltx/en_us_dedes/miscellanea:misc.Mode4
ltx/en_us_dedes/me.m05.d06:meVE.Apolytikion3.text	
ltx/en_us_dedes/me.m05.d06:meVE.SticGlory.incipit	You led your life with…
ltx/en_us_dedes/me.m05.d06:meVE.SticGlory.melody	
ltx/en_us_dedes/me.m05.d06:meVE.SticGlory.mode	@ltx/en_us_dedes/miscellanea:misc.Mode6
ltx/en_us_dedes/me.m05.d06:meVE.SticGlory.text	You led your life with precision, and you did not fail to do what the Law required. You had God’s praise of you as an ally, when, like a very strong soldier, you disrobed for the exercise of virtue. By enduring the unbearable ulcerating sores, you wrestled and defeated the adversary who boasted much. Now that you have been awarded the medal of victory from Christ, entreat Him on behalf of our souls.
ltx/en_us_dedes/me.m05.d06:meVE.Stichera01.greekmelody	@ltx/en_us_dedes/he.a.m4:heAU.EdokasSimeiosin.greekname
ltx/en_us_dedes/me.m05.d06:meVE.Stichera01.incipit	Lord, You gave us righteous…
ltx/en_us_dedes/me.m05.d06:meVE.Stichera01.melody	@ltx/en_us_dedes/he.a.m4:heAU.EdokasSimeiosin.name
ltx/en_us_dedes/me.m05.d06:meVE.Stichera01.mode	@ltx/en_us_dedes/miscellanea:misc.Mode4
ltx/en_us_dedes/me.m05.d06:meVE.Stichera01.text	Lord, You gave us righteous Job as an example of moral strength * and of patience and fortitude, * his virtues and pious words * and his godly actions, * even though he suffered; * and thus, O good One, You instruct * all those who waver when faced with tragedy. * O Jesus, the almighty Savior of our souls, we all glorify * Your benevolent plan, by which * You have saved the entire world.
ltx/en_us_dedes/me.m05.d06:meVE.Stichera02.incipit	…
ltx/en_us_dedes/me.m05.d06:meVE.Stichera02.melody	@ltx/en_us_dedes/he.a.m4:heAU.EdokasSimeiosin.name
ltx/en_us_dedes/me.m05.d06:meVE.Stichera02.mode	@ltx/en_us_dedes/miscellanea:misc.Mode4
ltx/en_us_dedes/me.m05.d06:meVE.Stichera02.text	
ltx/en_us_dedes/me.m05.d06:meVE.Stichera03.incipit	…
ltx/en_us_dedes/me.m05.d06:meVE.Stichera03.melody	@ltx/en_us_dedes/he.a.m4:heAU.EdokasSimeiosin.name
ltx/en_us_dedes/me.m05.d06:meVE.Stichera03.mode	@ltx/en_us_dedes/miscellanea:misc.Mode4
ltx/en_us_dedes/me.m05.d06:meVE.Stichera03.text	
