ltx/en_us_dedes/me.m09.d16:meDA.commemoration.first	Memory of the Holy Great-martyr Euphemia
ltx/en_us_dedes/me.m09.d16:meDA.commemoration.first_name	
ltx/en_us_dedes/me.m09.d16:meDA.commemoration.first_short	Memory of the Holy Great-martyr Euphemia
ltx/en_us_dedes/me.m09.d16:meDA.commemoration.first_title	@ltx/en_us_dedes/titles:ti.SaintW
ltx/en_us_dedes/me.m09.d16:meDA.commemoration.full	Memory of the Holy Great-martyr and All-famed Euphemia
ltx/en_us_dedes/me.m09.d16:meDA.commemoration.second_name	
ltx/en_us_dedes/me.m09.d16:meDA.commemoration.second_title	
ltx/en_us_dedes/me.m09.d16:meDA.date	September 16
ltx/en_us_dedes/me.m09.d16:meDA.fordate	for September 16
ltx/en_us_dedes/me.m09.d16:meDA.insert1	the holy Great-martyr and all-famed Euphemia,
ltx/en_us_dedes/me.m09.d16:meDA.insert2	whose memory we observe,
ltx/en_us_dedes/me.m09.d16:meDA.note	
ltx/en_us_dedes/me.m09.d16:meDA.pdfcoverdate	September 16,
ltx/en_us_dedes/me.m09.d16:meDA.pdfheaderdate	September 16
ltx/en_us_dedes/me.m09.d16:meHO.commemorations	
ltx/en_us_dedes/me.m09.d16:meHO.note1	
ltx/en_us_dedes/me.m09.d16:meHO.note2	
ltx/en_us_dedes/me.m09.d16:meHO.number	
ltx/en_us_dedes/me.m09.d16:meHO.rank	
ltx/en_us_dedes/me.m09.d16:meLE.commemoration1	The Holy Renowned Martyr Euphemia the Great.
ltx/en_us_dedes/me.m09.d16:meLE.commemoration2	
ltx/en_us_dedes/me.m09.d16:meLI.Kontakion1.greekmelody	@ltx/en_us_dedes/me.m09.d16:meMA.Kontakion1.greekmelody
ltx/en_us_dedes/me.m09.d16:meLI.Kontakion1.incipit	@ltx/en_us_dedes/me.m09.d16:meMA.Kontakion1.incipit
ltx/en_us_dedes/me.m09.d16:meLI.Kontakion1.melody	@ltx/en_us_dedes/me.m09.d16:meMA.Kontakion1.melody
ltx/en_us_dedes/me.m09.d16:meLI.Kontakion1.mode	@ltx/en_us_dedes/me.m09.d16:meMA.Kontakion1.mode
ltx/en_us_dedes/me.m09.d16:meLI.Kontakion1.text	@ltx/en_us_dedes/me.m09.d16:meMA.Kontakion1.text
ltx/en_us_dedes/me.m09.d16:meLI.MM.CommunionHymn.text	@ltx/en_us_dedes/properties:media.key
ltx/en_us_dedes/me.m09.d16:meLI.Megalynarion.text	
ltx/en_us_dedes/me.m09.d16:meMA.AposBoth.incipit	@ltx/en_us_dedes/me.m09.d14:meVE.Lity1.incipit
ltx/en_us_dedes/me.m09.d16:meMA.AposBoth.melody	
ltx/en_us_dedes/me.m09.d16:meMA.AposBoth.mode	@ltx/en_us_dedes/miscellanea:misc.Mode1
ltx/en_us_dedes/me.m09.d16:meMA.AposBoth.poet	@ltx/en_us_dedes/poets:po.AndreouIerosolymitou
ltx/en_us_dedes/me.m09.d16:meMA.AposBoth.text	@ltx/en_us_dedes/me.m09.d14:meVE.Lity1.text
ltx/en_us_dedes/me.m09.d16:meMA.AposGlory.incipit	The choirs of the Fathers…
ltx/en_us_dedes/me.m09.d16:meMA.AposGlory.melody	
ltx/en_us_dedes/me.m09.d16:meMA.AposGlory.mode	@ltx/en_us_dedes/miscellanea:misc.Mode1
ltx/en_us_dedes/me.m09.d16:meMA.AposGlory.poet	@ltx/en_us_dedes/poets:po.Vyzantiou
ltx/en_us_dedes/me.m09.d16:meMA.AposGlory.text	The choirs of the Fathers have assembled today, for the sake of Christ; and they bring you the Tome of the Orthodox Faith, O all-famed Euphemia. You have taken it into your honorable hands, and you preserve it till the end. We also, the choirs of mortals, have come together, to honor your contest, and piously we sing to you: Rejoice, O all-famed one, for you kept the Orthodox Faith, which was delivered to us by the Fathers, free of harm. Rejoice, O Martyr, who intercede on behalf of our souls.
ltx/en_us_dedes/me.m09.d16:meMA.Aposticha1.greekmelody	@ltx/en_us_dedes/he.a.m6:heAU.TriimerosAnestis.greekname
ltx/en_us_dedes/me.m09.d16:meMA.Aposticha1.incipit	…
ltx/en_us_dedes/me.m09.d16:meMA.Aposticha1.melody	@ltx/en_us_dedes/he.a.m6:heAU.TriimerosAnestis.name
ltx/en_us_dedes/me.m09.d16:meMA.Aposticha1.mode	@ltx/en_us_dedes/miscellanea:misc.Mode6
ltx/en_us_dedes/me.m09.d16:meMA.Aposticha1.text	
ltx/en_us_dedes/me.m09.d16:meMA.Aposticha2.incipit	…
ltx/en_us_dedes/me.m09.d16:meMA.Aposticha2.melody	@ltx/en_us_dedes/he.a.m6:heAU.TriimerosAnestis.name
ltx/en_us_dedes/me.m09.d16:meMA.Aposticha2.mode	@ltx/en_us_dedes/miscellanea:misc.Mode6
ltx/en_us_dedes/me.m09.d16:meMA.Aposticha2.text	
ltx/en_us_dedes/me.m09.d16:meMA.Aposticha3.incipit	…
ltx/en_us_dedes/me.m09.d16:meMA.Aposticha3.melody	@ltx/en_us_dedes/he.a.m6:heAU.TriimerosAnestis.name
ltx/en_us_dedes/me.m09.d16:meMA.Aposticha3.mode	@ltx/en_us_dedes/miscellanea:misc.Mode6
ltx/en_us_dedes/me.m09.d16:meMA.Aposticha3.text	
ltx/en_us_dedes/me.m09.d16:meMA.C1.acrostic.notice1	
ltx/en_us_dedes/me.m09.d16:meMA.C1.acrostic.notice2	
ltx/en_us_dedes/me.m09.d16:meMA.C1.acrostic.text	
ltx/en_us_dedes/me.m09.d16:meMA.C1.acrostic.title	
ltx/en_us_dedes/me.m09.d16:meMA.C1.poet	@ltx/en_us_dedes/poets:po.IoannouMonachou
ltx/en_us_dedes/me.m09.d16:meMA.C1.title	@ltx/en_us_dedes/titles:ti.CanonSaintW
ltx/en_us_dedes/me.m09.d16:meMA.C1.verse	@ltx/en_us_dedes/prayers:pr.verse_SaintW.text
ltx/en_us_dedes/me.m09.d16:meMA.Exaposteilarion1.greekmelody	@ltx/en_us_dedes/he.a.m2:heAU.TonMathitonOrontonSe.greekname
ltx/en_us_dedes/me.m09.d16:meMA.Exaposteilarion1.incipit	Today we have assembled to…
ltx/en_us_dedes/me.m09.d16:meMA.Exaposteilarion1.melody	@ltx/en_us_dedes/he.a.m2:heAU.TonMathitonOrontonSe.name
ltx/en_us_dedes/me.m09.d16:meMA.Exaposteilarion1.mode	@ltx/en_us_dedes/miscellanea:misc.Mode2
ltx/en_us_dedes/me.m09.d16:meMA.Exaposteilarion1.text	Today we have assembled to praise and honor * the mem’ry of illustrious Euphemia. * For, since she held on to the definition * of true and Orthodox belief, * which she received from the Fathers, * she made the Orthodox famous.
ltx/en_us_dedes/me.m09.d16:meMA.Exaposteilarion2.greekmelody	@ltx/en_us_dedes/he.a.m2:heAU.TonMathitonOrontonSe.greekname
ltx/en_us_dedes/me.m09.d16:meMA.Exaposteilarion2.incipit	The Cross, which we exalt…
ltx/en_us_dedes/me.m09.d16:meMA.Exaposteilarion2.melody	@ltx/en_us_dedes/he.a.m2:heAU.TonMathitonOrontonSe.name
ltx/en_us_dedes/me.m09.d16:meMA.Exaposteilarion2.mode	@ltx/en_us_dedes/miscellanea:misc.Mode2
ltx/en_us_dedes/me.m09.d16:meMA.Exaposteilarion2.text	The Cross, which we exalt, is the world’s salvation. * The Cross, which we revere, is the staff of all Saints. * The Cross, the mighty fortress of believers all. * The Cross, the strength of Emperors. * The Cross, upbuilding of mankind. * The Cross, the downfall of demons.
ltx/en_us_dedes/me.m09.d16:meMA.Kathisma11.greekmelody	@ltx/en_us_dedes/he.a.m4:heAU.OYpsotheisEnToStavro.greekname
ltx/en_us_dedes/me.m09.d16:meMA.Kathisma11.incipit	@ltx/en_us_dedes/me.m07.d11:meMA.Ode3Kathisma1.incipit
ltx/en_us_dedes/me.m09.d16:meMA.Kathisma11.melody	@ltx/en_us_dedes/he.a.m4:heAU.OYpsotheisEnToStavro.name
ltx/en_us_dedes/me.m09.d16:meMA.Kathisma11.mode	@ltx/en_us_dedes/miscellanea:misc.Mode4
ltx/en_us_dedes/me.m09.d16:meMA.Kathisma11.text	@ltx/en_us_dedes/me.m07.d11:meMA.Ode3Kathisma1.text
ltx/en_us_dedes/me.m09.d16:meMA.Kathisma12.greekmelody	@ltx/en_us_dedes/he.a.m4:heAU.OYpsotheisEnToStavro.greekname
ltx/en_us_dedes/me.m09.d16:meMA.Kathisma12.incipit	@ltx/en_us_dedes/he.a.m4:heAU.OYpsotheisEnToStavro.incipit
ltx/en_us_dedes/me.m09.d16:meMA.Kathisma12.melody	@ltx/en_us_dedes/he.a.m4:heAU.OYpsotheisEnToStavro.melody
ltx/en_us_dedes/me.m09.d16:meMA.Kathisma12.mode	@ltx/en_us_dedes/miscellanea:misc.Mode4
ltx/en_us_dedes/me.m09.d16:meMA.Kathisma12.text	@ltx/en_us_dedes/he.a.m4:heAU.OYpsotheisEnToStavro.text
ltx/en_us_dedes/me.m09.d16:meMA.Kathisma21.greekmelody	@ltx/en_us_dedes/he.a.m4:heAU.OYpsotheisEnToStavro.greekname
ltx/en_us_dedes/me.m09.d16:meMA.Kathisma21.incipit	…
ltx/en_us_dedes/me.m09.d16:meMA.Kathisma21.melody	@ltx/en_us_dedes/he.a.m4:heAU.OYpsotheisEnToStavro.name
ltx/en_us_dedes/me.m09.d16:meMA.Kathisma21.mode	@ltx/en_us_dedes/miscellanea:misc.Mode4
ltx/en_us_dedes/me.m09.d16:meMA.Kathisma21.text	
ltx/en_us_dedes/me.m09.d16:meMA.Kathisma22.greekmelody	@ltx/en_us_dedes/he.a.m4:heAU.OYpsotheisEnToStavro.greekname
ltx/en_us_dedes/me.m09.d16:meMA.Kathisma22.incipit	@ltx/en_us_dedes/oc.m4.d4:ocMA.Kathisma31.incipit
ltx/en_us_dedes/me.m09.d16:meMA.Kathisma22.melody	@ltx/en_us_dedes/he.a.m4:heAU.OYpsotheisEnToStavro.name
ltx/en_us_dedes/me.m09.d16:meMA.Kathisma22.mode	@ltx/en_us_dedes/miscellanea:misc.Mode4
ltx/en_us_dedes/me.m09.d16:meMA.Kathisma22.text	@ltx/en_us_dedes/oc.m4.d4:ocMA.Kathisma31.text
ltx/en_us_dedes/me.m09.d16:meMA.Kontakion1.greekmelody	@ltx/en_us_dedes/he.a.m4:heAU.OYpsotheisEnToStavro.greekname
ltx/en_us_dedes/me.m09.d16:meMA.Kontakion1.incipit	…
ltx/en_us_dedes/me.m09.d16:meMA.Kontakion1.melody	@ltx/en_us_dedes/he.a.m4:heAU.OYpsotheisEnToStavro.name
ltx/en_us_dedes/me.m09.d16:meMA.Kontakion1.mode	@ltx/en_us_dedes/miscellanea:misc.Mode4
ltx/en_us_dedes/me.m09.d16:meMA.Kontakion1.text	
ltx/en_us_dedes/me.m09.d16:meMA.Lauds1.incipit	As we observe an athletic…
ltx/en_us_dedes/me.m09.d16:meMA.Lauds1.melody	
ltx/en_us_dedes/me.m09.d16:meMA.Lauds1.mode	@ltx/en_us_dedes/miscellanea:misc.Mode3
ltx/en_us_dedes/me.m09.d16:meMA.Lauds1.text	As we observe an athletic festival being celebrated with God in mind, O believers, let us sing a hymn of gratitude to our God, who is wondrous in His counsels. For He defeated the unseen power of the hostile force, by means of the feminine; He made His own power perfect in the weakness of the excellent Martyr Euphemia. At her intercession, save our souls.
ltx/en_us_dedes/me.m09.d16:meMA.Lauds2.incipit	The illustrious Martyr of Christ…
ltx/en_us_dedes/me.m09.d16:meMA.Lauds2.melody	
ltx/en_us_dedes/me.m09.d16:meMA.Lauds2.mode	@ltx/en_us_dedes/miscellanea:misc.Mode3
ltx/en_us_dedes/me.m09.d16:meMA.Lauds2.text	The illustrious Martyr of Christ Euphemia, has mixed the wine-bowl of truth with the blood of her contest, and set it out, ever-flowing, before the Church. Now she invites those reared in piety therein, saying with the voice of Wisdom: “Draw for yourselves this drink: the witness to the resurrection, the purging of passions, the safeguard of pious souls; and cry out to the Lord: ‘You gave us drink from the river of the Spirit’s delights; save our souls.’”
ltx/en_us_dedes/me.m09.d16:meMA.Lauds3.incipit	We whose souls are sealed…
ltx/en_us_dedes/me.m09.d16:meMA.Lauds3.melody	
ltx/en_us_dedes/me.m09.d16:meMA.Lauds3.mode	@ltx/en_us_dedes/miscellanea:misc.Mode3
ltx/en_us_dedes/me.m09.d16:meMA.Lauds3.text	We whose souls are sealed with the blood of Christ for the day of redemption, let us, as the Prophet Isaiah says, with spiritual joy draw the holy blood, which gushes from the well of the martyrs for us, and which depicts the Savior’s vivifying Passion and eternal glory. Therefore let us say to Him: “O Lord, who are glorified in Your saints, at the intercession of Your illustrious and victorious Martyr, save our souls.”
ltx/en_us_dedes/me.m09.d16:meMA.LaudsBoth.incipit	@ltx/en_us_dedes/me.m09.d14:meMA.AdditionalIdiomelon4.incipit
ltx/en_us_dedes/me.m09.d16:meMA.LaudsBoth.melody	
ltx/en_us_dedes/me.m09.d16:meMA.LaudsBoth.mode	@ltx/en_us_dedes/miscellanea:misc.Mode3
ltx/en_us_dedes/me.m09.d16:meMA.LaudsBoth.text	@ltx/en_us_dedes/me.m09.d14:meMA.AdditionalIdiomelon4.text
ltx/en_us_dedes/me.m09.d16:meMA.LaudsGlory.incipit	@ltx/en_us_dedes/me.m07.d07:meVE.SticGlory.incipit
ltx/en_us_dedes/me.m09.d16:meMA.LaudsGlory.melody	
ltx/en_us_dedes/me.m09.d16:meMA.LaudsGlory.mode	@ltx/en_us_dedes/miscellanea:misc.Mode6
ltx/en_us_dedes/me.m09.d16:meMA.LaudsGlory.poet	@ltx/en_us_dedes/poets:po.IoannouMonachou
ltx/en_us_dedes/me.m09.d16:meMA.LaudsGlory.text	@ltx/en_us_dedes/me.m07.d07:meVE.SticGlory.text
ltx/en_us_dedes/me.m09.d16:meMA.Ode1C11.greekmelody	@ltx/en_us_dedes/he.h.m8:heHE.AsomenToKyrio.greekname
ltx/en_us_dedes/me.m09.d16:meMA.Ode1C11.incipit	…
ltx/en_us_dedes/me.m09.d16:meMA.Ode1C11.melody	@ltx/en_us_dedes/he.h.m8:heHE.AsomenToKyrio.name
ltx/en_us_dedes/me.m09.d16:meMA.Ode1C11.mode	@ltx/en_us_dedes/miscellanea:misc.Mode8
ltx/en_us_dedes/me.m09.d16:meMA.Ode1C11.ode	@ltx/en_us_dedes/miscellanea:misc.Ode1
ltx/en_us_dedes/me.m09.d16:meMA.Ode1C11.text	
ltx/en_us_dedes/me.m09.d16:meMA.Ode1C12.incipit	…
ltx/en_us_dedes/me.m09.d16:meMA.Ode1C12.melody	@ltx/en_us_dedes/he.h.m8:heHE.AsomenToKyrio.name
ltx/en_us_dedes/me.m09.d16:meMA.Ode1C12.mode	@ltx/en_us_dedes/miscellanea:misc.Mode8
ltx/en_us_dedes/me.m09.d16:meMA.Ode1C12.ode	@ltx/en_us_dedes/miscellanea:misc.Ode1
ltx/en_us_dedes/me.m09.d16:meMA.Ode1C12.text	
ltx/en_us_dedes/me.m09.d16:meMA.Ode1C13.incipit	…
ltx/en_us_dedes/me.m09.d16:meMA.Ode1C13.melody	@ltx/en_us_dedes/he.h.m8:heHE.AsomenToKyrio.name
ltx/en_us_dedes/me.m09.d16:meMA.Ode1C13.mode	@ltx/en_us_dedes/miscellanea:misc.Mode8
ltx/en_us_dedes/me.m09.d16:meMA.Ode1C13.ode	@ltx/en_us_dedes/miscellanea:misc.Ode1
ltx/en_us_dedes/me.m09.d16:meMA.Ode1C13.text	
ltx/en_us_dedes/me.m09.d16:meMA.Ode1C1T.incipit	…
ltx/en_us_dedes/me.m09.d16:meMA.Ode1C1T.melody	@ltx/en_us_dedes/he.h.m8:heHE.AsomenToKyrio.name
ltx/en_us_dedes/me.m09.d16:meMA.Ode1C1T.mode	@ltx/en_us_dedes/miscellanea:misc.Mode8
ltx/en_us_dedes/me.m09.d16:meMA.Ode1C1T.ode	@ltx/en_us_dedes/miscellanea:misc.Ode1
ltx/en_us_dedes/me.m09.d16:meMA.Ode1C1T.text	
ltx/en_us_dedes/me.m09.d16:meMA.Ode3C11.greekmelody	@ltx/en_us_dedes/he.h.m8:heHE.SyEiToStereoma.greekname
ltx/en_us_dedes/me.m09.d16:meMA.Ode3C11.incipit	…
ltx/en_us_dedes/me.m09.d16:meMA.Ode3C11.melody	@ltx/en_us_dedes/he.h.m8:heHE.SyEiToStereoma.name
ltx/en_us_dedes/me.m09.d16:meMA.Ode3C11.mode	@ltx/en_us_dedes/miscellanea:misc.Mode8
ltx/en_us_dedes/me.m09.d16:meMA.Ode3C11.ode	@ltx/en_us_dedes/miscellanea:misc.Ode3
ltx/en_us_dedes/me.m09.d16:meMA.Ode3C11.text	
ltx/en_us_dedes/me.m09.d16:meMA.Ode3C12.incipit	…
ltx/en_us_dedes/me.m09.d16:meMA.Ode3C12.melody	@ltx/en_us_dedes/he.h.m8:heHE.SyEiToStereoma.name
ltx/en_us_dedes/me.m09.d16:meMA.Ode3C12.mode	@ltx/en_us_dedes/miscellanea:misc.Mode8
ltx/en_us_dedes/me.m09.d16:meMA.Ode3C12.ode	@ltx/en_us_dedes/miscellanea:misc.Ode3
ltx/en_us_dedes/me.m09.d16:meMA.Ode3C12.text	
ltx/en_us_dedes/me.m09.d16:meMA.Ode3C13.incipit	…
ltx/en_us_dedes/me.m09.d16:meMA.Ode3C13.melody	@ltx/en_us_dedes/he.h.m8:heHE.SyEiToStereoma.name
ltx/en_us_dedes/me.m09.d16:meMA.Ode3C13.mode	@ltx/en_us_dedes/miscellanea:misc.Mode8
ltx/en_us_dedes/me.m09.d16:meMA.Ode3C13.ode	@ltx/en_us_dedes/miscellanea:misc.Ode3
ltx/en_us_dedes/me.m09.d16:meMA.Ode3C13.text	
ltx/en_us_dedes/me.m09.d16:meMA.Ode3C1T.incipit	…
ltx/en_us_dedes/me.m09.d16:meMA.Ode3C1T.melody	@ltx/en_us_dedes/he.h.m8:heHE.SyEiToStereoma.name
ltx/en_us_dedes/me.m09.d16:meMA.Ode3C1T.mode	@ltx/en_us_dedes/miscellanea:misc.Mode8
ltx/en_us_dedes/me.m09.d16:meMA.Ode3C1T.ode	@ltx/en_us_dedes/miscellanea:misc.Ode3
ltx/en_us_dedes/me.m09.d16:meMA.Ode3C1T.text	
ltx/en_us_dedes/me.m09.d16:meMA.Ode3H.greekmelody	@ltx/en_us_dedes/he.h.m8:heHE.SyEiToStereoma.greekname
ltx/en_us_dedes/me.m09.d16:meMA.Ode3H.incipit	@ltx/en_us_dedes/he.h.m8:heHE.SyEiToStereoma.incipit
ltx/en_us_dedes/me.m09.d16:meMA.Ode3H.melody	@ltx/en_us_dedes/he.h.m8:heHE.SyEiToStereoma.melody
ltx/en_us_dedes/me.m09.d16:meMA.Ode3H.mode	@ltx/en_us_dedes/miscellanea:misc.Mode8
ltx/en_us_dedes/me.m09.d16:meMA.Ode3H.ode	@ltx/en_us_dedes/miscellanea:misc.Ode3
ltx/en_us_dedes/me.m09.d16:meMA.Ode3H.text	@ltx/en_us_dedes/he.h.m8:heHE.SyEiToStereoma.text
ltx/en_us_dedes/me.m09.d16:meMA.Ode3Kathisma1.greekmelody	@ltx/en_us_dedes/he.a.m8:heAU.TinSofianKaiLogon.greekname
ltx/en_us_dedes/me.m09.d16:meMA.Ode3Kathisma1.incipit	…
ltx/en_us_dedes/me.m09.d16:meMA.Ode3Kathisma1.melody	@ltx/en_us_dedes/he.a.m8:heAU.TinSofianKaiLogon.name
ltx/en_us_dedes/me.m09.d16:meMA.Ode3Kathisma1.mode	@ltx/en_us_dedes/miscellanea:misc.Mode8
ltx/en_us_dedes/me.m09.d16:meMA.Ode3Kathisma1.text	
ltx/en_us_dedes/me.m09.d16:meMA.Ode3Kathisma2.greekmelody	@ltx/en_us_dedes/he.a.m8:heAU.TinSofianKaiLogon.greekname
ltx/en_us_dedes/me.m09.d16:meMA.Ode3Kathisma2.incipit	…
ltx/en_us_dedes/me.m09.d16:meMA.Ode3Kathisma2.melody	@ltx/en_us_dedes/he.a.m8:heAU.TinSofianKaiLogon.name
ltx/en_us_dedes/me.m09.d16:meMA.Ode3Kathisma2.mode	@ltx/en_us_dedes/miscellanea:misc.Mode8
ltx/en_us_dedes/me.m09.d16:meMA.Ode3Kathisma2.text	
ltx/en_us_dedes/me.m09.d16:meMA.Ode4C11.greekmelody	@ltx/en_us_dedes/he.h.m8:heHE.EisakikoaKyrie.greekname
ltx/en_us_dedes/me.m09.d16:meMA.Ode4C11.incipit	…
ltx/en_us_dedes/me.m09.d16:meMA.Ode4C11.melody	@ltx/en_us_dedes/he.h.m8:heHE.EisakikoaKyrie.name
ltx/en_us_dedes/me.m09.d16:meMA.Ode4C11.mode	@ltx/en_us_dedes/miscellanea:misc.Mode8
ltx/en_us_dedes/me.m09.d16:meMA.Ode4C11.ode	@ltx/en_us_dedes/miscellanea:misc.Ode4
ltx/en_us_dedes/me.m09.d16:meMA.Ode4C11.text	
ltx/en_us_dedes/me.m09.d16:meMA.Ode4C12.incipit	…
ltx/en_us_dedes/me.m09.d16:meMA.Ode4C12.melody	@ltx/en_us_dedes/he.h.m8:heHE.EisakikoaKyrie.name
ltx/en_us_dedes/me.m09.d16:meMA.Ode4C12.mode	@ltx/en_us_dedes/miscellanea:misc.Mode8
ltx/en_us_dedes/me.m09.d16:meMA.Ode4C12.ode	@ltx/en_us_dedes/miscellanea:misc.Ode4
ltx/en_us_dedes/me.m09.d16:meMA.Ode4C12.text	
ltx/en_us_dedes/me.m09.d16:meMA.Ode4C13.incipit	…
ltx/en_us_dedes/me.m09.d16:meMA.Ode4C13.melody	@ltx/en_us_dedes/he.h.m8:heHE.EisakikoaKyrie.name
ltx/en_us_dedes/me.m09.d16:meMA.Ode4C13.mode	@ltx/en_us_dedes/miscellanea:misc.Mode8
ltx/en_us_dedes/me.m09.d16:meMA.Ode4C13.ode	@ltx/en_us_dedes/miscellanea:misc.Ode4
ltx/en_us_dedes/me.m09.d16:meMA.Ode4C13.text	
ltx/en_us_dedes/me.m09.d16:meMA.Ode4C14.incipit	…
ltx/en_us_dedes/me.m09.d16:meMA.Ode4C14.melody	@ltx/en_us_dedes/he.h.m8:heHE.EisakikoaKyrie.name
ltx/en_us_dedes/me.m09.d16:meMA.Ode4C14.mode	@ltx/en_us_dedes/miscellanea:misc.Mode8
ltx/en_us_dedes/me.m09.d16:meMA.Ode4C14.ode	@ltx/en_us_dedes/miscellanea:misc.Ode4
ltx/en_us_dedes/me.m09.d16:meMA.Ode4C14.text	
ltx/en_us_dedes/me.m09.d16:meMA.Ode4C1T.incipit	…
ltx/en_us_dedes/me.m09.d16:meMA.Ode4C1T.melody	@ltx/en_us_dedes/he.h.m8:heHE.EisakikoaKyrie.name
ltx/en_us_dedes/me.m09.d16:meMA.Ode4C1T.mode	@ltx/en_us_dedes/miscellanea:misc.Mode8
ltx/en_us_dedes/me.m09.d16:meMA.Ode4C1T.ode	@ltx/en_us_dedes/miscellanea:misc.Ode4
ltx/en_us_dedes/me.m09.d16:meMA.Ode4C1T.text	
ltx/en_us_dedes/me.m09.d16:meMA.Ode5C11.greekmelody	@ltx/en_us_dedes/he.h.m8:heHE.OrthrizontesVoomenSoi.greekname
ltx/en_us_dedes/me.m09.d16:meMA.Ode5C11.incipit	…
ltx/en_us_dedes/me.m09.d16:meMA.Ode5C11.melody	@ltx/en_us_dedes/he.h.m8:heHE.OrthrizontesVoomenSoi.name
ltx/en_us_dedes/me.m09.d16:meMA.Ode5C11.mode	@ltx/en_us_dedes/miscellanea:misc.Mode8
ltx/en_us_dedes/me.m09.d16:meMA.Ode5C11.ode	@ltx/en_us_dedes/miscellanea:misc.Ode5
ltx/en_us_dedes/me.m09.d16:meMA.Ode5C11.text	
ltx/en_us_dedes/me.m09.d16:meMA.Ode5C12.incipit	…
ltx/en_us_dedes/me.m09.d16:meMA.Ode5C12.melody	@ltx/en_us_dedes/he.h.m8:heHE.OrthrizontesVoomenSoi.name
ltx/en_us_dedes/me.m09.d16:meMA.Ode5C12.mode	@ltx/en_us_dedes/miscellanea:misc.Mode8
ltx/en_us_dedes/me.m09.d16:meMA.Ode5C12.ode	@ltx/en_us_dedes/miscellanea:misc.Ode5
ltx/en_us_dedes/me.m09.d16:meMA.Ode5C12.text	
ltx/en_us_dedes/me.m09.d16:meMA.Ode5C13.incipit	…
ltx/en_us_dedes/me.m09.d16:meMA.Ode5C13.melody	@ltx/en_us_dedes/he.h.m8:heHE.OrthrizontesVoomenSoi.name
ltx/en_us_dedes/me.m09.d16:meMA.Ode5C13.mode	@ltx/en_us_dedes/miscellanea:misc.Mode8
ltx/en_us_dedes/me.m09.d16:meMA.Ode5C13.ode	@ltx/en_us_dedes/miscellanea:misc.Ode5
ltx/en_us_dedes/me.m09.d16:meMA.Ode5C13.text	
ltx/en_us_dedes/me.m09.d16:meMA.Ode5C1T.incipit	…
ltx/en_us_dedes/me.m09.d16:meMA.Ode5C1T.melody	@ltx/en_us_dedes/he.h.m8:heHE.OrthrizontesVoomenSoi.name
ltx/en_us_dedes/me.m09.d16:meMA.Ode5C1T.mode	@ltx/en_us_dedes/miscellanea:misc.Mode8
ltx/en_us_dedes/me.m09.d16:meMA.Ode5C1T.ode	@ltx/en_us_dedes/miscellanea:misc.Ode5
ltx/en_us_dedes/me.m09.d16:meMA.Ode5C1T.text	
ltx/en_us_dedes/me.m09.d16:meMA.Ode6C11.greekmelody	@ltx/en_us_dedes/he.h.m8:heHE.ChitonaMoiParaschou.greekname
ltx/en_us_dedes/me.m09.d16:meMA.Ode6C11.incipit	…
ltx/en_us_dedes/me.m09.d16:meMA.Ode6C11.melody	@ltx/en_us_dedes/he.h.m8:heHE.ChitonaMoiParaschou.name
ltx/en_us_dedes/me.m09.d16:meMA.Ode6C11.mode	@ltx/en_us_dedes/miscellanea:misc.Mode8
ltx/en_us_dedes/me.m09.d16:meMA.Ode6C11.ode	@ltx/en_us_dedes/miscellanea:misc.Ode6
ltx/en_us_dedes/me.m09.d16:meMA.Ode6C11.text	
ltx/en_us_dedes/me.m09.d16:meMA.Ode6C12.incipit	…
ltx/en_us_dedes/me.m09.d16:meMA.Ode6C12.melody	@ltx/en_us_dedes/he.h.m8:heHE.ChitonaMoiParaschou.name
ltx/en_us_dedes/me.m09.d16:meMA.Ode6C12.mode	@ltx/en_us_dedes/miscellanea:misc.Mode8
ltx/en_us_dedes/me.m09.d16:meMA.Ode6C12.ode	@ltx/en_us_dedes/miscellanea:misc.Ode6
ltx/en_us_dedes/me.m09.d16:meMA.Ode6C12.text	
ltx/en_us_dedes/me.m09.d16:meMA.Ode6C13.incipit	…
ltx/en_us_dedes/me.m09.d16:meMA.Ode6C13.melody	@ltx/en_us_dedes/he.h.m8:heHE.ChitonaMoiParaschou.name
ltx/en_us_dedes/me.m09.d16:meMA.Ode6C13.mode	@ltx/en_us_dedes/miscellanea:misc.Mode8
ltx/en_us_dedes/me.m09.d16:meMA.Ode6C13.ode	@ltx/en_us_dedes/miscellanea:misc.Ode6
ltx/en_us_dedes/me.m09.d16:meMA.Ode6C13.text	
ltx/en_us_dedes/me.m09.d16:meMA.Ode6C1T.incipit	…
ltx/en_us_dedes/me.m09.d16:meMA.Ode6C1T.melody	@ltx/en_us_dedes/he.h.m8:heHE.ChitonaMoiParaschou.name
ltx/en_us_dedes/me.m09.d16:meMA.Ode6C1T.mode	@ltx/en_us_dedes/miscellanea:misc.Mode8
ltx/en_us_dedes/me.m09.d16:meMA.Ode6C1T.ode	@ltx/en_us_dedes/miscellanea:misc.Ode6
ltx/en_us_dedes/me.m09.d16:meMA.Ode6C1T.text	
ltx/en_us_dedes/me.m09.d16:meMA.Ode6H.greekmelody	@ltx/en_us_dedes/he.h.m8:heHE.ChitonaMoiParaschou.greekname
ltx/en_us_dedes/me.m09.d16:meMA.Ode6H.incipit	@ltx/en_us_dedes/he.h.m8:heHE.ChitonaMoiParaschou.incipit
ltx/en_us_dedes/me.m09.d16:meMA.Ode6H.melody	@ltx/en_us_dedes/he.h.m8:heHE.ChitonaMoiParaschou.melody
ltx/en_us_dedes/me.m09.d16:meMA.Ode6H.mode	@ltx/en_us_dedes/miscellanea:misc.Mode8
ltx/en_us_dedes/me.m09.d16:meMA.Ode6H.ode	@ltx/en_us_dedes/miscellanea:misc.Ode6
ltx/en_us_dedes/me.m09.d16:meMA.Ode6H.text	@ltx/en_us_dedes/he.h.m8:heHE.ChitonaMoiParaschou.text
ltx/en_us_dedes/me.m09.d16:meMA.Ode7C11.greekmelody	@ltx/en_us_dedes/he.h.m8:heHE.OiEkTisIoudaias.greekname
ltx/en_us_dedes/me.m09.d16:meMA.Ode7C11.incipit	…
ltx/en_us_dedes/me.m09.d16:meMA.Ode7C11.melody	@ltx/en_us_dedes/he.h.m8:heHE.OiEkTisIoudaias.name
ltx/en_us_dedes/me.m09.d16:meMA.Ode7C11.mode	@ltx/en_us_dedes/miscellanea:misc.Mode8
ltx/en_us_dedes/me.m09.d16:meMA.Ode7C11.ode	@ltx/en_us_dedes/miscellanea:misc.Ode7
ltx/en_us_dedes/me.m09.d16:meMA.Ode7C11.text	
ltx/en_us_dedes/me.m09.d16:meMA.Ode7C12.incipit	…
ltx/en_us_dedes/me.m09.d16:meMA.Ode7C12.melody	@ltx/en_us_dedes/he.h.m8:heHE.OiEkTisIoudaias.name
ltx/en_us_dedes/me.m09.d16:meMA.Ode7C12.mode	@ltx/en_us_dedes/miscellanea:misc.Mode8
ltx/en_us_dedes/me.m09.d16:meMA.Ode7C12.ode	@ltx/en_us_dedes/miscellanea:misc.Ode7
ltx/en_us_dedes/me.m09.d16:meMA.Ode7C12.text	
ltx/en_us_dedes/me.m09.d16:meMA.Ode7C13.incipit	…
ltx/en_us_dedes/me.m09.d16:meMA.Ode7C13.melody	@ltx/en_us_dedes/he.h.m8:heHE.OiEkTisIoudaias.name
ltx/en_us_dedes/me.m09.d16:meMA.Ode7C13.mode	@ltx/en_us_dedes/miscellanea:misc.Mode8
ltx/en_us_dedes/me.m09.d16:meMA.Ode7C13.ode	@ltx/en_us_dedes/miscellanea:misc.Ode7
ltx/en_us_dedes/me.m09.d16:meMA.Ode7C13.text	
ltx/en_us_dedes/me.m09.d16:meMA.Ode7C14.incipit	…
ltx/en_us_dedes/me.m09.d16:meMA.Ode7C14.melody	@ltx/en_us_dedes/he.h.m8:heHE.OiEkTisIoudaias.name
ltx/en_us_dedes/me.m09.d16:meMA.Ode7C14.mode	@ltx/en_us_dedes/miscellanea:misc.Mode8
ltx/en_us_dedes/me.m09.d16:meMA.Ode7C14.ode	@ltx/en_us_dedes/miscellanea:misc.Ode7
ltx/en_us_dedes/me.m09.d16:meMA.Ode7C14.text	
ltx/en_us_dedes/me.m09.d16:meMA.Ode7C1T.incipit	…
ltx/en_us_dedes/me.m09.d16:meMA.Ode7C1T.melody	@ltx/en_us_dedes/he.h.m8:heHE.OiEkTisIoudaias.name
ltx/en_us_dedes/me.m09.d16:meMA.Ode7C1T.mode	@ltx/en_us_dedes/miscellanea:misc.Mode8
ltx/en_us_dedes/me.m09.d16:meMA.Ode7C1T.ode	@ltx/en_us_dedes/miscellanea:misc.Ode7
ltx/en_us_dedes/me.m09.d16:meMA.Ode7C1T.text	
ltx/en_us_dedes/me.m09.d16:meMA.Ode8C11.greekmelody	@ltx/en_us_dedes/he.h.m8:heHE.TonVasileaTonOuranon.greekname
ltx/en_us_dedes/me.m09.d16:meMA.Ode8C11.incipit	…
ltx/en_us_dedes/me.m09.d16:meMA.Ode8C11.melody	@ltx/en_us_dedes/he.h.m8:heHE.TonVasileaTonOuranon.name
ltx/en_us_dedes/me.m09.d16:meMA.Ode8C11.mode	@ltx/en_us_dedes/miscellanea:misc.Mode8
ltx/en_us_dedes/me.m09.d16:meMA.Ode8C11.ode	@ltx/en_us_dedes/miscellanea:misc.Ode8
ltx/en_us_dedes/me.m09.d16:meMA.Ode8C11.text	
ltx/en_us_dedes/me.m09.d16:meMA.Ode8C12.incipit	…
ltx/en_us_dedes/me.m09.d16:meMA.Ode8C12.melody	@ltx/en_us_dedes/he.h.m8:heHE.TonVasileaTonOuranon.name
ltx/en_us_dedes/me.m09.d16:meMA.Ode8C12.mode	@ltx/en_us_dedes/miscellanea:misc.Mode8
ltx/en_us_dedes/me.m09.d16:meMA.Ode8C12.ode	@ltx/en_us_dedes/miscellanea:misc.Ode8
ltx/en_us_dedes/me.m09.d16:meMA.Ode8C12.text	
ltx/en_us_dedes/me.m09.d16:meMA.Ode8C13.incipit	…
ltx/en_us_dedes/me.m09.d16:meMA.Ode8C13.melody	@ltx/en_us_dedes/he.h.m8:heHE.TonVasileaTonOuranon.name
ltx/en_us_dedes/me.m09.d16:meMA.Ode8C13.mode	@ltx/en_us_dedes/miscellanea:misc.Mode8
ltx/en_us_dedes/me.m09.d16:meMA.Ode8C13.ode	@ltx/en_us_dedes/miscellanea:misc.Ode8
ltx/en_us_dedes/me.m09.d16:meMA.Ode8C13.text	
ltx/en_us_dedes/me.m09.d16:meMA.Ode8C14.incipit	…
ltx/en_us_dedes/me.m09.d16:meMA.Ode8C14.melody	@ltx/en_us_dedes/he.h.m8:heHE.TonVasileaTonOuranon.name
ltx/en_us_dedes/me.m09.d16:meMA.Ode8C14.mode	@ltx/en_us_dedes/miscellanea:misc.Mode8
ltx/en_us_dedes/me.m09.d16:meMA.Ode8C14.ode	@ltx/en_us_dedes/miscellanea:misc.Ode8
ltx/en_us_dedes/me.m09.d16:meMA.Ode8C14.text	
ltx/en_us_dedes/me.m09.d16:meMA.Ode8C1T.incipit	…
ltx/en_us_dedes/me.m09.d16:meMA.Ode8C1T.melody	@ltx/en_us_dedes/he.h.m8:heHE.TonVasileaTonOuranon.name
ltx/en_us_dedes/me.m09.d16:meMA.Ode8C1T.mode	@ltx/en_us_dedes/miscellanea:misc.Mode8
ltx/en_us_dedes/me.m09.d16:meMA.Ode8C1T.ode	@ltx/en_us_dedes/miscellanea:misc.Ode8
ltx/en_us_dedes/me.m09.d16:meMA.Ode8C1T.text	
ltx/en_us_dedes/me.m09.d16:meMA.Ode8H.greekmelody	@ltx/en_us_dedes/he.h.m8:heHE.TonVasileaTonOuranon.greekname
ltx/en_us_dedes/me.m09.d16:meMA.Ode8H.incipit	@ltx/en_us_dedes/he.h.m8:heHE.TonVasileaTonOuranon.incipit
ltx/en_us_dedes/me.m09.d16:meMA.Ode8H.melody	@ltx/en_us_dedes/he.h.m8:heHE.TonVasileaTonOuranon.melody
ltx/en_us_dedes/me.m09.d16:meMA.Ode8H.mode	@ltx/en_us_dedes/miscellanea:misc.Mode8
ltx/en_us_dedes/me.m09.d16:meMA.Ode8H.ode	@ltx/en_us_dedes/miscellanea:misc.Ode8
ltx/en_us_dedes/me.m09.d16:meMA.Ode8H.text	@ltx/en_us_dedes/he.h.m8:heHE.TonVasileaTonOuranon.text
ltx/en_us_dedes/me.m09.d16:meMA.Ode9C11.greekmelody	@ltx/en_us_dedes/he.h.m8:heHE.SeTinApeirogamon.greekname
ltx/en_us_dedes/me.m09.d16:meMA.Ode9C11.incipit	…
ltx/en_us_dedes/me.m09.d16:meMA.Ode9C11.melody	@ltx/en_us_dedes/he.h.m8:heHE.SeTinApeirogamon.name
ltx/en_us_dedes/me.m09.d16:meMA.Ode9C11.mode	@ltx/en_us_dedes/miscellanea:misc.Mode8
ltx/en_us_dedes/me.m09.d16:meMA.Ode9C11.ode	@ltx/en_us_dedes/miscellanea:misc.Ode9
ltx/en_us_dedes/me.m09.d16:meMA.Ode9C11.text	
ltx/en_us_dedes/me.m09.d16:meMA.Ode9C12.incipit	…
ltx/en_us_dedes/me.m09.d16:meMA.Ode9C12.melody	@ltx/en_us_dedes/he.h.m8:heHE.SeTinApeirogamon.name
ltx/en_us_dedes/me.m09.d16:meMA.Ode9C12.mode	@ltx/en_us_dedes/miscellanea:misc.Mode8
ltx/en_us_dedes/me.m09.d16:meMA.Ode9C12.ode	@ltx/en_us_dedes/miscellanea:misc.Ode9
ltx/en_us_dedes/me.m09.d16:meMA.Ode9C12.text	
ltx/en_us_dedes/me.m09.d16:meMA.Ode9C13.incipit	…
ltx/en_us_dedes/me.m09.d16:meMA.Ode9C13.melody	@ltx/en_us_dedes/he.h.m8:heHE.SeTinApeirogamon.name
ltx/en_us_dedes/me.m09.d16:meMA.Ode9C13.mode	@ltx/en_us_dedes/miscellanea:misc.Mode8
ltx/en_us_dedes/me.m09.d16:meMA.Ode9C13.ode	@ltx/en_us_dedes/miscellanea:misc.Ode9
ltx/en_us_dedes/me.m09.d16:meMA.Ode9C13.text	
ltx/en_us_dedes/me.m09.d16:meMA.Ode9C1T.incipit	…
ltx/en_us_dedes/me.m09.d16:meMA.Ode9C1T.melody	@ltx/en_us_dedes/he.h.m8:heHE.SeTinApeirogamon.name
ltx/en_us_dedes/me.m09.d16:meMA.Ode9C1T.mode	@ltx/en_us_dedes/miscellanea:misc.Mode8
ltx/en_us_dedes/me.m09.d16:meMA.Ode9C1T.ode	@ltx/en_us_dedes/miscellanea:misc.Ode9
ltx/en_us_dedes/me.m09.d16:meMA.Ode9C1T.text	
ltx/en_us_dedes/me.m09.d16:meMA.Ode9H.greekmelody	@ltx/en_us_dedes/he.h.m8:heHE.SeTinApeirogamon.greekname
ltx/en_us_dedes/me.m09.d16:meMA.Ode9H.incipit	@ltx/en_us_dedes/he.h.m8:heHE.SeTinApeirogamon.incipit
ltx/en_us_dedes/me.m09.d16:meMA.Ode9H.melody	@ltx/en_us_dedes/he.h.m8:heHE.SeTinApeirogamon.melody
ltx/en_us_dedes/me.m09.d16:meMA.Ode9H.mode	@ltx/en_us_dedes/miscellanea:misc.Mode8
ltx/en_us_dedes/me.m09.d16:meMA.Ode9H.ode	@ltx/en_us_dedes/miscellanea:misc.Ode9
ltx/en_us_dedes/me.m09.d16:meMA.Ode9H.text	@ltx/en_us_dedes/he.h.m8:heHE.SeTinApeirogamon.text
ltx/en_us_dedes/me.m09.d16:meMA.Oikos1.text	The church of the all-famed Euphemia has become a Garden of Paradise, for it has in its midst a tree of immortality, namely her holy body. Whoever enjoys its luscious fruit is quickly sanctified. They marvel when they see that a dead body pours out blood, as if alive, spreading a fragrance on all. So, everyone, eagerly come with me, the lowly one, and let us be cleansed of every stain, and let us embrace it, and profit by the grace of her miracles.
ltx/en_us_dedes/me.m09.d16:meMA.PostGospelIdiomelon.incipit	…
ltx/en_us_dedes/me.m09.d16:meMA.PostGospelIdiomelon.melody	
ltx/en_us_dedes/me.m09.d16:meMA.PostGospelIdiomelon.mode	@ltx/en_us_dedes/miscellanea:misc.Mode4
ltx/en_us_dedes/me.m09.d16:meMA.PostGospelIdiomelon.text	
ltx/en_us_dedes/me.m09.d16:meVE.Apolytikion1.greekmelody	@ltx/en_us_dedes/he.a.m3:heAU.TinOraiotita.greekname
ltx/en_us_dedes/me.m09.d16:meVE.Apolytikion1.incipit	Competing brilliantly out of your…
ltx/en_us_dedes/me.m09.d16:meVE.Apolytikion1.melody	@ltx/en_us_dedes/he.a.m3:heAU.TinOraiotita.name
ltx/en_us_dedes/me.m09.d16:meVE.Apolytikion1.mode	@ltx/en_us_dedes/miscellanea:misc.Mode3
ltx/en_us_dedes/me.m09.d16:meVE.Apolytikion1.text	Competing brilliantly out of your love for God, * you ran and thus attained the fragrant scent of Christ, * as a most beautiful young lady and Martyr, adorned and renowned. * You entered the heavenly * bridal chamber most worthily, * and from there you give the world * cures and healing by grace divine. * You rescue those who sing and salute you: * Rejoice! Godly-minded Euphemia!
ltx/en_us_dedes/me.m09.d16:meVE.AposBoth.incipit	@ltx/en_us_dedes/me.m09.d14:meVE.AposGlory.incipit
ltx/en_us_dedes/me.m09.d16:meVE.AposBoth.melody	
ltx/en_us_dedes/me.m09.d16:meVE.AposBoth.mode	@ltx/en_us_dedes/miscellanea:misc.Mode8
ltx/en_us_dedes/me.m09.d16:meVE.AposBoth.text	@ltx/en_us_dedes/me.m09.d14:meVE.AposGlory.text
ltx/en_us_dedes/me.m09.d16:meVE.AposGlory.incipit	@ltx/en_us_dedes/me.m07.d11:meMA.LaudsGlory.incipit
ltx/en_us_dedes/me.m09.d16:meVE.AposGlory.melody	
ltx/en_us_dedes/me.m09.d16:meVE.AposGlory.mode	@ltx/en_us_dedes/miscellanea:misc.Mode8
ltx/en_us_dedes/me.m09.d16:meVE.AposGlory.poet	@ltx/en_us_dedes/poets:po.Vyzantiou
ltx/en_us_dedes/me.m09.d16:meVE.AposGlory.text	@ltx/en_us_dedes/me.m07.d11:meMA.LaudsGlory.text
ltx/en_us_dedes/me.m09.d16:meVE.Aposticha1.greekmelody	@ltx/en_us_dedes/he.a.m6:heAU.TriimerosAnestis.greekname
ltx/en_us_dedes/me.m09.d16:meVE.Aposticha1.incipit	…
ltx/en_us_dedes/me.m09.d16:meVE.Aposticha1.melody	@ltx/en_us_dedes/he.a.m6:heAU.TriimerosAnestis.name
ltx/en_us_dedes/me.m09.d16:meVE.Aposticha1.mode	@ltx/en_us_dedes/miscellanea:misc.Mode6
ltx/en_us_dedes/me.m09.d16:meVE.Aposticha1.text	
ltx/en_us_dedes/me.m09.d16:meVE.Aposticha2.incipit	…
ltx/en_us_dedes/me.m09.d16:meVE.Aposticha2.melody	@ltx/en_us_dedes/he.a.m6:heAU.TriimerosAnestis.name
ltx/en_us_dedes/me.m09.d16:meVE.Aposticha2.mode	@ltx/en_us_dedes/miscellanea:misc.Mode6
ltx/en_us_dedes/me.m09.d16:meVE.Aposticha2.text	
ltx/en_us_dedes/me.m09.d16:meVE.Aposticha3.incipit	…
ltx/en_us_dedes/me.m09.d16:meVE.Aposticha3.melody	@ltx/en_us_dedes/he.a.m6:heAU.TriimerosAnestis.name
ltx/en_us_dedes/me.m09.d16:meVE.Aposticha3.mode	@ltx/en_us_dedes/miscellanea:misc.Mode6
ltx/en_us_dedes/me.m09.d16:meVE.Aposticha3.text	
ltx/en_us_dedes/me.m09.d16:meVE.SticBoth.incipit	@ltx/en_us_dedes/me.m09.d14:meMA.AdditionalIdiomelon5.incipit
ltx/en_us_dedes/me.m09.d16:meVE.SticBoth.melody	
ltx/en_us_dedes/me.m09.d16:meVE.SticBoth.mode	@ltx/en_us_dedes/miscellanea:misc.Mode6
ltx/en_us_dedes/me.m09.d16:meVE.SticBoth.text	@ltx/en_us_dedes/me.m09.d14:meMA.AdditionalIdiomelon5.text
ltx/en_us_dedes/me.m09.d16:meVE.SticGlory.incipit	@ltx/en_us_dedes/me.m07.d11:meVE.AposGlory.incipit
ltx/en_us_dedes/me.m09.d16:meVE.SticGlory.melody	
ltx/en_us_dedes/me.m09.d16:meVE.SticGlory.mode	@ltx/en_us_dedes/miscellanea:misc.Mode6
ltx/en_us_dedes/me.m09.d16:meVE.SticGlory.poet	@ltx/en_us_dedes/poets:po.Anatoliou
ltx/en_us_dedes/me.m09.d16:meVE.SticGlory.text	@ltx/en_us_dedes/me.m07.d11:meVE.AposGlory.text
ltx/en_us_dedes/me.m09.d16:meVE.Stichera01.greekmelody	@ltx/en_us_dedes/he.a.m2:heAU.OteEkTouXylou.greekname
ltx/en_us_dedes/me.m09.d16:meVE.Stichera01.incipit	…
ltx/en_us_dedes/me.m09.d16:meVE.Stichera01.melody	@ltx/en_us_dedes/he.a.m2:heAU.OteEkTouXylou.name
ltx/en_us_dedes/me.m09.d16:meVE.Stichera01.mode	@ltx/en_us_dedes/miscellanea:misc.Mode2
ltx/en_us_dedes/me.m09.d16:meVE.Stichera01.text	
ltx/en_us_dedes/me.m09.d16:meVE.Stichera02.incipit	…
ltx/en_us_dedes/me.m09.d16:meVE.Stichera02.melody	@ltx/en_us_dedes/he.a.m2:heAU.OteEkTouXylou.name
ltx/en_us_dedes/me.m09.d16:meVE.Stichera02.mode	@ltx/en_us_dedes/miscellanea:misc.Mode2
ltx/en_us_dedes/me.m09.d16:meVE.Stichera02.text	
ltx/en_us_dedes/me.m09.d16:meVE.Stichera03.incipit	…
ltx/en_us_dedes/me.m09.d16:meVE.Stichera03.melody	@ltx/en_us_dedes/he.a.m2:heAU.OteEkTouXylou.name
ltx/en_us_dedes/me.m09.d16:meVE.Stichera03.mode	@ltx/en_us_dedes/miscellanea:misc.Mode2
ltx/en_us_dedes/me.m09.d16:meVE.Stichera03.text	
ltx/en_us_dedes/me.m09.d16:meVE.Stichera04.greekmelody	@ltx/en_us_dedes/he.a.m4:heAU.OsGennaionEnMartysi.greekname
ltx/en_us_dedes/me.m09.d16:meVE.Stichera04.incipit	…
ltx/en_us_dedes/me.m09.d16:meVE.Stichera04.melody	@ltx/en_us_dedes/he.a.m4:heAU.OsGennaionEnMartysi.name
ltx/en_us_dedes/me.m09.d16:meVE.Stichera04.mode	@ltx/en_us_dedes/miscellanea:misc.Mode4
ltx/en_us_dedes/me.m09.d16:meVE.Stichera04.text	
ltx/en_us_dedes/me.m09.d16:meVE.Stichera05.incipit	…
ltx/en_us_dedes/me.m09.d16:meVE.Stichera05.melody	@ltx/en_us_dedes/he.a.m4:heAU.OsGennaionEnMartysi.name
ltx/en_us_dedes/me.m09.d16:meVE.Stichera05.mode	@ltx/en_us_dedes/miscellanea:misc.Mode4
ltx/en_us_dedes/me.m09.d16:meVE.Stichera05.text	
ltx/en_us_dedes/me.m09.d16:meVE.Stichera06.incipit	…
ltx/en_us_dedes/me.m09.d16:meVE.Stichera06.melody	@ltx/en_us_dedes/he.a.m4:heAU.OsGennaionEnMartysi.name
ltx/en_us_dedes/me.m09.d16:meVE.Stichera06.mode	@ltx/en_us_dedes/miscellanea:misc.Mode4
ltx/en_us_dedes/me.m09.d16:meVE.Stichera06.text	
