ltx/en_us_dedes/me.m12.d01:meDA.commemoration.first	Memory of the Holy Prophet Nahum
ltx/en_us_dedes/me.m12.d01:meDA.commemoration.first_name	
ltx/en_us_dedes/me.m12.d01:meDA.commemoration.first_short	Memory of the Holy Prophet Nahum
ltx/en_us_dedes/me.m12.d01:meDA.commemoration.first_title	@ltx/en_us_dedes/titles:ti.Prophet
ltx/en_us_dedes/me.m12.d01:meDA.commemoration.full	Memory of the Holy Prophet Nahum
ltx/en_us_dedes/me.m12.d01:meDA.commemoration.second_name	
ltx/en_us_dedes/me.m12.d01:meDA.commemoration.second_title	
ltx/en_us_dedes/me.m12.d01:meDA.date	December 1
ltx/en_us_dedes/me.m12.d01:meDA.fordate	for December 1
ltx/en_us_dedes/me.m12.d01:meDA.insert1	
ltx/en_us_dedes/me.m12.d01:meDA.insert2	
ltx/en_us_dedes/me.m12.d01:meDA.note	
ltx/en_us_dedes/me.m12.d01:meDA.pdfcoverdate	December 1,
ltx/en_us_dedes/me.m12.d01:meDA.pdfheaderdate	December 1
ltx/en_us_dedes/me.m12.d01:meHO.commemorations	
ltx/en_us_dedes/me.m12.d01:meHO.note1	
ltx/en_us_dedes/me.m12.d01:meHO.note2	
ltx/en_us_dedes/me.m12.d01:meHO.number	
ltx/en_us_dedes/me.m12.d01:meHO.rank	
ltx/en_us_dedes/me.m12.d01:meLE.commemoration1	The Holy Prophet Nahum.
ltx/en_us_dedes/me.m12.d01:meLE.commemoration2	
ltx/en_us_dedes/me.m12.d01:meLI.Kontakion1.incipit	…
ltx/en_us_dedes/me.m12.d01:meLI.Kontakion1.melody	
ltx/en_us_dedes/me.m12.d01:meLI.Kontakion1.mode	
ltx/en_us_dedes/me.m12.d01:meLI.Kontakion1.text	
ltx/en_us_dedes/me.m12.d01:meLI.Megalynarion.text	
ltx/en_us_dedes/me.m12.d01:meMA.C1.acrostic.notice1	
ltx/en_us_dedes/me.m12.d01:meMA.C1.acrostic.text	
ltx/en_us_dedes/me.m12.d01:meMA.C1.acrostic.title	
ltx/en_us_dedes/me.m12.d01:meMA.C1.title	@ltx/en_us_dedes/titles:ti.CanonProphet
ltx/en_us_dedes/me.m12.d01:meMA.C1.verse	@ltx/en_us_dedes/prayers:pr.verse_Prophet.text
ltx/en_us_dedes/me.m12.d01:meMA.Ode1C11.greekmelody	@ltx/en_us_dedes/he.h.m5:heHE.IpponKaiAnavatin.greekname
ltx/en_us_dedes/me.m12.d01:meMA.Ode1C11.incipit	…
ltx/en_us_dedes/me.m12.d01:meMA.Ode1C11.melody	@ltx/en_us_dedes/he.h.m5:heHE.IpponKaiAnavatin.name
ltx/en_us_dedes/me.m12.d01:meMA.Ode1C11.mode	@ltx/en_us_dedes/miscellanea:misc.Mode5
ltx/en_us_dedes/me.m12.d01:meMA.Ode1C11.ode	@ltx/en_us_dedes/miscellanea:misc.Ode1
ltx/en_us_dedes/me.m12.d01:meMA.Ode1C11.text	
ltx/en_us_dedes/me.m12.d01:meMA.Ode1C12.incipit	…
ltx/en_us_dedes/me.m12.d01:meMA.Ode1C12.melody	@ltx/en_us_dedes/he.h.m5:heHE.IpponKaiAnavatin.name
ltx/en_us_dedes/me.m12.d01:meMA.Ode1C12.mode	@ltx/en_us_dedes/miscellanea:misc.Mode5
ltx/en_us_dedes/me.m12.d01:meMA.Ode1C12.ode	@ltx/en_us_dedes/miscellanea:misc.Ode1
ltx/en_us_dedes/me.m12.d01:meMA.Ode1C12.text	
ltx/en_us_dedes/me.m12.d01:meMA.Ode1C13.incipit	…
ltx/en_us_dedes/me.m12.d01:meMA.Ode1C13.melody	@ltx/en_us_dedes/he.h.m5:heHE.IpponKaiAnavatin.name
ltx/en_us_dedes/me.m12.d01:meMA.Ode1C13.mode	@ltx/en_us_dedes/miscellanea:misc.Mode5
ltx/en_us_dedes/me.m12.d01:meMA.Ode1C13.ode	@ltx/en_us_dedes/miscellanea:misc.Ode1
ltx/en_us_dedes/me.m12.d01:meMA.Ode1C13.text	
ltx/en_us_dedes/me.m12.d01:meMA.Ode1C1T.incipit	…
ltx/en_us_dedes/me.m12.d01:meMA.Ode1C1T.melody	@ltx/en_us_dedes/he.h.m5:heHE.IpponKaiAnavatin.name
ltx/en_us_dedes/me.m12.d01:meMA.Ode1C1T.mode	@ltx/en_us_dedes/miscellanea:misc.Mode5
ltx/en_us_dedes/me.m12.d01:meMA.Ode1C1T.ode	@ltx/en_us_dedes/miscellanea:misc.Ode1
ltx/en_us_dedes/me.m12.d01:meMA.Ode1C1T.text	
ltx/en_us_dedes/me.m12.d01:meMA.Ode3C11.greekmelody	@ltx/en_us_dedes/he.h.m5:heHE.OPixasEpOudenos.greekname
ltx/en_us_dedes/me.m12.d01:meMA.Ode3C11.incipit	…
ltx/en_us_dedes/me.m12.d01:meMA.Ode3C11.melody	@ltx/en_us_dedes/he.h.m5:heHE.OPixasEpOudenos.name
ltx/en_us_dedes/me.m12.d01:meMA.Ode3C11.mode	@ltx/en_us_dedes/miscellanea:misc.Mode5
ltx/en_us_dedes/me.m12.d01:meMA.Ode3C11.ode	@ltx/en_us_dedes/miscellanea:misc.Ode3
ltx/en_us_dedes/me.m12.d01:meMA.Ode3C11.text	
ltx/en_us_dedes/me.m12.d01:meMA.Ode3C12.incipit	…
ltx/en_us_dedes/me.m12.d01:meMA.Ode3C12.melody	@ltx/en_us_dedes/he.h.m5:heHE.OPixasEpOudenos.name
ltx/en_us_dedes/me.m12.d01:meMA.Ode3C12.mode	@ltx/en_us_dedes/miscellanea:misc.Mode5
ltx/en_us_dedes/me.m12.d01:meMA.Ode3C12.ode	@ltx/en_us_dedes/miscellanea:misc.Ode3
ltx/en_us_dedes/me.m12.d01:meMA.Ode3C12.text	
ltx/en_us_dedes/me.m12.d01:meMA.Ode3C1T.incipit	…
ltx/en_us_dedes/me.m12.d01:meMA.Ode3C1T.melody	@ltx/en_us_dedes/he.h.m5:heHE.OPixasEpOudenos.name
ltx/en_us_dedes/me.m12.d01:meMA.Ode3C1T.mode	@ltx/en_us_dedes/miscellanea:misc.Mode5
ltx/en_us_dedes/me.m12.d01:meMA.Ode3C1T.ode	@ltx/en_us_dedes/miscellanea:misc.Ode3
ltx/en_us_dedes/me.m12.d01:meMA.Ode3C1T.text	
ltx/en_us_dedes/me.m12.d01:meMA.Ode3H.greekmelody	@ltx/en_us_dedes/he.h.m5:heHE.OPixasEpOudenos.greekname
ltx/en_us_dedes/me.m12.d01:meMA.Ode3H.incipit	@ltx/en_us_dedes/he.h.m5:heHE.OPixasEpOudenos.incipit
ltx/en_us_dedes/me.m12.d01:meMA.Ode3H.melody	@ltx/en_us_dedes/he.h.m5:heHE.OPixasEpOudenos.melody
ltx/en_us_dedes/me.m12.d01:meMA.Ode3H.mode	@ltx/en_us_dedes/miscellanea:misc.Mode5
ltx/en_us_dedes/me.m12.d01:meMA.Ode3H.ode	@ltx/en_us_dedes/miscellanea:misc.Ode3
ltx/en_us_dedes/me.m12.d01:meMA.Ode3H.text	@ltx/en_us_dedes/he.h.m5:heHE.OPixasEpOudenos.text
ltx/en_us_dedes/me.m12.d01:meMA.Ode3Kathisma1.greekmelody	@ltx/en_us_dedes/he.a.m5:heAU.TonSynanarchonLogon.greekname
ltx/en_us_dedes/me.m12.d01:meMA.Ode3Kathisma1.incipit	…
ltx/en_us_dedes/me.m12.d01:meMA.Ode3Kathisma1.melody	@ltx/en_us_dedes/he.a.m5:heAU.TonSynanarchonLogon.name
ltx/en_us_dedes/me.m12.d01:meMA.Ode3Kathisma1.mode	@ltx/en_us_dedes/miscellanea:misc.Mode5
ltx/en_us_dedes/me.m12.d01:meMA.Ode3Kathisma1.text	
ltx/en_us_dedes/me.m12.d01:meMA.Ode3KathismaSt.incipit	@ltx/en_us_dedes/oc.m5.d4:ocMA.Kathisma23.incipit
ltx/en_us_dedes/me.m12.d01:meMA.Ode3KathismaSt.melody	@ltx/en_us_dedes/he.a.m5:heAU.TonSynanarchonLogon.name
ltx/en_us_dedes/me.m12.d01:meMA.Ode3KathismaSt.mode	@ltx/en_us_dedes/miscellanea:misc.Mode5
ltx/en_us_dedes/me.m12.d01:meMA.Ode3KathismaSt.text	@ltx/en_us_dedes/oc.m5.d4:ocMA.Kathisma23.text
ltx/en_us_dedes/me.m12.d01:meMA.Ode3KathismaT.incipit	…
ltx/en_us_dedes/me.m12.d01:meMA.Ode3KathismaT.melody	@ltx/en_us_dedes/he.a.m5:heAU.TonSynanarchonLogon.name
ltx/en_us_dedes/me.m12.d01:meMA.Ode3KathismaT.mode	@ltx/en_us_dedes/miscellanea:misc.Mode5
ltx/en_us_dedes/me.m12.d01:meMA.Ode3KathismaT.text	
ltx/en_us_dedes/me.m12.d01:meMA.Ode4C11.greekmelody	@ltx/en_us_dedes/he.h.m5:heHE.TinTheianEnnoisas.greekname
ltx/en_us_dedes/me.m12.d01:meMA.Ode4C11.incipit	…
ltx/en_us_dedes/me.m12.d01:meMA.Ode4C11.melody	@ltx/en_us_dedes/he.h.m5:heHE.TinTheianEnnoisas.name
ltx/en_us_dedes/me.m12.d01:meMA.Ode4C11.mode	@ltx/en_us_dedes/miscellanea:misc.Mode5
ltx/en_us_dedes/me.m12.d01:meMA.Ode4C11.ode	@ltx/en_us_dedes/miscellanea:misc.Ode4
ltx/en_us_dedes/me.m12.d01:meMA.Ode4C11.text	
ltx/en_us_dedes/me.m12.d01:meMA.Ode4C12.incipit	…
ltx/en_us_dedes/me.m12.d01:meMA.Ode4C12.melody	@ltx/en_us_dedes/he.h.m5:heHE.TinTheianEnnoisas.name
ltx/en_us_dedes/me.m12.d01:meMA.Ode4C12.mode	@ltx/en_us_dedes/miscellanea:misc.Mode5
ltx/en_us_dedes/me.m12.d01:meMA.Ode4C12.ode	@ltx/en_us_dedes/miscellanea:misc.Ode4
ltx/en_us_dedes/me.m12.d01:meMA.Ode4C12.text	
ltx/en_us_dedes/me.m12.d01:meMA.Ode4C13.incipit	…
ltx/en_us_dedes/me.m12.d01:meMA.Ode4C13.melody	@ltx/en_us_dedes/he.h.m5:heHE.TinTheianEnnoisas.name
ltx/en_us_dedes/me.m12.d01:meMA.Ode4C13.mode	@ltx/en_us_dedes/miscellanea:misc.Mode5
ltx/en_us_dedes/me.m12.d01:meMA.Ode4C13.ode	@ltx/en_us_dedes/miscellanea:misc.Ode4
ltx/en_us_dedes/me.m12.d01:meMA.Ode4C13.text	
ltx/en_us_dedes/me.m12.d01:meMA.Ode4C1T.incipit	…
ltx/en_us_dedes/me.m12.d01:meMA.Ode4C1T.melody	@ltx/en_us_dedes/he.h.m5:heHE.TinTheianEnnoisas.name
ltx/en_us_dedes/me.m12.d01:meMA.Ode4C1T.mode	@ltx/en_us_dedes/miscellanea:misc.Mode5
ltx/en_us_dedes/me.m12.d01:meMA.Ode4C1T.ode	@ltx/en_us_dedes/miscellanea:misc.Ode4
ltx/en_us_dedes/me.m12.d01:meMA.Ode4C1T.text	
ltx/en_us_dedes/me.m12.d01:meMA.Ode5C11.greekmelody	@ltx/en_us_dedes/he.h.m5:heHE.OAnavallomenos.greekname
ltx/en_us_dedes/me.m12.d01:meMA.Ode5C11.incipit	…
ltx/en_us_dedes/me.m12.d01:meMA.Ode5C11.melody	@ltx/en_us_dedes/he.h.m5:heHE.OAnavallomenos.name
ltx/en_us_dedes/me.m12.d01:meMA.Ode5C11.mode	@ltx/en_us_dedes/miscellanea:misc.Mode5
ltx/en_us_dedes/me.m12.d01:meMA.Ode5C11.ode	@ltx/en_us_dedes/miscellanea:misc.Ode5
ltx/en_us_dedes/me.m12.d01:meMA.Ode5C11.text	
ltx/en_us_dedes/me.m12.d01:meMA.Ode5C12.incipit	…
ltx/en_us_dedes/me.m12.d01:meMA.Ode5C12.melody	@ltx/en_us_dedes/he.h.m5:heHE.OAnavallomenos.name
ltx/en_us_dedes/me.m12.d01:meMA.Ode5C12.mode	@ltx/en_us_dedes/miscellanea:misc.Mode5
ltx/en_us_dedes/me.m12.d01:meMA.Ode5C12.ode	@ltx/en_us_dedes/miscellanea:misc.Ode5
ltx/en_us_dedes/me.m12.d01:meMA.Ode5C12.text	
ltx/en_us_dedes/me.m12.d01:meMA.Ode5C13.incipit	…
ltx/en_us_dedes/me.m12.d01:meMA.Ode5C13.melody	@ltx/en_us_dedes/he.h.m5:heHE.OAnavallomenos.name
ltx/en_us_dedes/me.m12.d01:meMA.Ode5C13.mode	@ltx/en_us_dedes/miscellanea:misc.Mode5
ltx/en_us_dedes/me.m12.d01:meMA.Ode5C13.ode	@ltx/en_us_dedes/miscellanea:misc.Ode5
ltx/en_us_dedes/me.m12.d01:meMA.Ode5C13.text	
ltx/en_us_dedes/me.m12.d01:meMA.Ode5C1T.incipit	…
ltx/en_us_dedes/me.m12.d01:meMA.Ode5C1T.melody	@ltx/en_us_dedes/he.h.m5:heHE.OAnavallomenos.name
ltx/en_us_dedes/me.m12.d01:meMA.Ode5C1T.mode	@ltx/en_us_dedes/miscellanea:misc.Mode5
ltx/en_us_dedes/me.m12.d01:meMA.Ode5C1T.ode	@ltx/en_us_dedes/miscellanea:misc.Ode5
ltx/en_us_dedes/me.m12.d01:meMA.Ode5C1T.text	
ltx/en_us_dedes/me.m12.d01:meMA.Ode6C11.greekmelody	@ltx/en_us_dedes/he.h.m5:heHE.MainomeninKlydoni.greekname
ltx/en_us_dedes/me.m12.d01:meMA.Ode6C11.incipit	…
ltx/en_us_dedes/me.m12.d01:meMA.Ode6C11.melody	@ltx/en_us_dedes/he.h.m5:heHE.MainomeninKlydoni.name
ltx/en_us_dedes/me.m12.d01:meMA.Ode6C11.mode	@ltx/en_us_dedes/miscellanea:misc.Mode5
ltx/en_us_dedes/me.m12.d01:meMA.Ode6C11.ode	@ltx/en_us_dedes/miscellanea:misc.Ode6
ltx/en_us_dedes/me.m12.d01:meMA.Ode6C11.text	
ltx/en_us_dedes/me.m12.d01:meMA.Ode6C12.incipit	…
ltx/en_us_dedes/me.m12.d01:meMA.Ode6C12.melody	@ltx/en_us_dedes/he.h.m5:heHE.MainomeninKlydoni.name
ltx/en_us_dedes/me.m12.d01:meMA.Ode6C12.mode	@ltx/en_us_dedes/miscellanea:misc.Mode5
ltx/en_us_dedes/me.m12.d01:meMA.Ode6C12.ode	@ltx/en_us_dedes/miscellanea:misc.Ode6
ltx/en_us_dedes/me.m12.d01:meMA.Ode6C12.text	
ltx/en_us_dedes/me.m12.d01:meMA.Ode6C1T.incipit	…
ltx/en_us_dedes/me.m12.d01:meMA.Ode6C1T.melody	@ltx/en_us_dedes/he.h.m5:heHE.MainomeninKlydoni.name
ltx/en_us_dedes/me.m12.d01:meMA.Ode6C1T.mode	@ltx/en_us_dedes/miscellanea:misc.Mode5
ltx/en_us_dedes/me.m12.d01:meMA.Ode6C1T.ode	@ltx/en_us_dedes/miscellanea:misc.Ode6
ltx/en_us_dedes/me.m12.d01:meMA.Ode6C1T.text	
ltx/en_us_dedes/me.m12.d01:meMA.Ode6H.greekmelody	@ltx/en_us_dedes/he.h.m5:heHE.MainomeninKlydoni.greekname
ltx/en_us_dedes/me.m12.d01:meMA.Ode6H.incipit	@ltx/en_us_dedes/he.h.m5:heHE.MainomeninKlydoni.incipit
ltx/en_us_dedes/me.m12.d01:meMA.Ode6H.melody	@ltx/en_us_dedes/he.h.m5:heHE.MainomeninKlydoni.melody
ltx/en_us_dedes/me.m12.d01:meMA.Ode6H.mode	@ltx/en_us_dedes/miscellanea:misc.Mode5
ltx/en_us_dedes/me.m12.d01:meMA.Ode6H.ode	@ltx/en_us_dedes/miscellanea:misc.Ode6
ltx/en_us_dedes/me.m12.d01:meMA.Ode6H.text	@ltx/en_us_dedes/he.h.m5:heHE.MainomeninKlydoni.text
ltx/en_us_dedes/me.m12.d01:meMA.Ode7C11.greekmelody	@ltx/en_us_dedes/he.h.m5:heHE.OYperypsoumenos.greekname
ltx/en_us_dedes/me.m12.d01:meMA.Ode7C11.incipit	…
ltx/en_us_dedes/me.m12.d01:meMA.Ode7C11.melody	@ltx/en_us_dedes/he.h.m5:heHE.OYperypsoumenos.name
ltx/en_us_dedes/me.m12.d01:meMA.Ode7C11.mode	@ltx/en_us_dedes/miscellanea:misc.Mode5
ltx/en_us_dedes/me.m12.d01:meMA.Ode7C11.ode	@ltx/en_us_dedes/miscellanea:misc.Ode7
ltx/en_us_dedes/me.m12.d01:meMA.Ode7C11.text	
ltx/en_us_dedes/me.m12.d01:meMA.Ode7C12.incipit	…
ltx/en_us_dedes/me.m12.d01:meMA.Ode7C12.melody	@ltx/en_us_dedes/he.h.m5:heHE.OYperypsoumenos.name
ltx/en_us_dedes/me.m12.d01:meMA.Ode7C12.mode	@ltx/en_us_dedes/miscellanea:misc.Mode5
ltx/en_us_dedes/me.m12.d01:meMA.Ode7C12.ode	@ltx/en_us_dedes/miscellanea:misc.Ode7
ltx/en_us_dedes/me.m12.d01:meMA.Ode7C12.text	
ltx/en_us_dedes/me.m12.d01:meMA.Ode7C13.incipit	…
ltx/en_us_dedes/me.m12.d01:meMA.Ode7C13.melody	@ltx/en_us_dedes/he.h.m5:heHE.OYperypsoumenos.name
ltx/en_us_dedes/me.m12.d01:meMA.Ode7C13.mode	@ltx/en_us_dedes/miscellanea:misc.Mode5
ltx/en_us_dedes/me.m12.d01:meMA.Ode7C13.ode	@ltx/en_us_dedes/miscellanea:misc.Ode7
ltx/en_us_dedes/me.m12.d01:meMA.Ode7C13.text	
ltx/en_us_dedes/me.m12.d01:meMA.Ode7C1T.incipit	…
ltx/en_us_dedes/me.m12.d01:meMA.Ode7C1T.melody	@ltx/en_us_dedes/he.h.m5:heHE.OYperypsoumenos.name
ltx/en_us_dedes/me.m12.d01:meMA.Ode7C1T.mode	@ltx/en_us_dedes/miscellanea:misc.Mode5
ltx/en_us_dedes/me.m12.d01:meMA.Ode7C1T.ode	@ltx/en_us_dedes/miscellanea:misc.Ode7
ltx/en_us_dedes/me.m12.d01:meMA.Ode7C1T.text	
ltx/en_us_dedes/me.m12.d01:meMA.Ode8C11.greekmelody	@ltx/en_us_dedes/he.h.m5:heHE.SoiToPantourgo.greekname
ltx/en_us_dedes/me.m12.d01:meMA.Ode8C11.incipit	…
ltx/en_us_dedes/me.m12.d01:meMA.Ode8C11.melody	@ltx/en_us_dedes/he.h.m5:heHE.SoiToPantourgo.name
ltx/en_us_dedes/me.m12.d01:meMA.Ode8C11.mode	@ltx/en_us_dedes/miscellanea:misc.Mode5
ltx/en_us_dedes/me.m12.d01:meMA.Ode8C11.ode	@ltx/en_us_dedes/miscellanea:misc.Ode8
ltx/en_us_dedes/me.m12.d01:meMA.Ode8C11.text	
ltx/en_us_dedes/me.m12.d01:meMA.Ode8C12.incipit	…
ltx/en_us_dedes/me.m12.d01:meMA.Ode8C12.melody	@ltx/en_us_dedes/he.h.m5:heHE.SoiToPantourgo.name
ltx/en_us_dedes/me.m12.d01:meMA.Ode8C12.mode	@ltx/en_us_dedes/miscellanea:misc.Mode5
ltx/en_us_dedes/me.m12.d01:meMA.Ode8C12.ode	@ltx/en_us_dedes/miscellanea:misc.Ode8
ltx/en_us_dedes/me.m12.d01:meMA.Ode8C12.text	
ltx/en_us_dedes/me.m12.d01:meMA.Ode8C1T.incipit	…
ltx/en_us_dedes/me.m12.d01:meMA.Ode8C1T.melody	@ltx/en_us_dedes/he.h.m5:heHE.SoiToPantourgo.name
ltx/en_us_dedes/me.m12.d01:meMA.Ode8C1T.mode	@ltx/en_us_dedes/miscellanea:misc.Mode5
ltx/en_us_dedes/me.m12.d01:meMA.Ode8C1T.ode	@ltx/en_us_dedes/miscellanea:misc.Ode8
ltx/en_us_dedes/me.m12.d01:meMA.Ode8C1T.text	
ltx/en_us_dedes/me.m12.d01:meMA.Ode8H.greekmelody	@ltx/en_us_dedes/he.h.m5:heHE.SoiToPantourgo.greekname
ltx/en_us_dedes/me.m12.d01:meMA.Ode8H.incipit	@ltx/en_us_dedes/he.h.m5:heHE.SoiToPantourgo.incipit
ltx/en_us_dedes/me.m12.d01:meMA.Ode8H.melody	@ltx/en_us_dedes/he.h.m5:heHE.SoiToPantourgo.melody
ltx/en_us_dedes/me.m12.d01:meMA.Ode8H.mode	@ltx/en_us_dedes/miscellanea:misc.Mode5
ltx/en_us_dedes/me.m12.d01:meMA.Ode8H.ode	@ltx/en_us_dedes/miscellanea:misc.Ode8
ltx/en_us_dedes/me.m12.d01:meMA.Ode8H.text	@ltx/en_us_dedes/he.h.m5:heHE.SoiToPantourgo.text
ltx/en_us_dedes/me.m12.d01:meMA.Ode9C11.greekmelody	@ltx/en_us_dedes/he.h.m5:heHE.IsaiaChoreve.greekname
ltx/en_us_dedes/me.m12.d01:meMA.Ode9C11.incipit	…
ltx/en_us_dedes/me.m12.d01:meMA.Ode9C11.melody	@ltx/en_us_dedes/he.h.m5:heHE.IsaiaChoreve.name
ltx/en_us_dedes/me.m12.d01:meMA.Ode9C11.mode	@ltx/en_us_dedes/miscellanea:misc.Mode5
ltx/en_us_dedes/me.m12.d01:meMA.Ode9C11.ode	@ltx/en_us_dedes/miscellanea:misc.Ode9
ltx/en_us_dedes/me.m12.d01:meMA.Ode9C11.text	
ltx/en_us_dedes/me.m12.d01:meMA.Ode9C12.incipit	…
ltx/en_us_dedes/me.m12.d01:meMA.Ode9C12.melody	@ltx/en_us_dedes/he.h.m5:heHE.IsaiaChoreve.name
ltx/en_us_dedes/me.m12.d01:meMA.Ode9C12.mode	@ltx/en_us_dedes/miscellanea:misc.Mode5
ltx/en_us_dedes/me.m12.d01:meMA.Ode9C12.ode	@ltx/en_us_dedes/miscellanea:misc.Ode9
ltx/en_us_dedes/me.m12.d01:meMA.Ode9C12.text	
ltx/en_us_dedes/me.m12.d01:meMA.Ode9C1T.incipit	…
ltx/en_us_dedes/me.m12.d01:meMA.Ode9C1T.melody	@ltx/en_us_dedes/he.h.m5:heHE.IsaiaChoreve.name
ltx/en_us_dedes/me.m12.d01:meMA.Ode9C1T.mode	@ltx/en_us_dedes/miscellanea:misc.Mode5
ltx/en_us_dedes/me.m12.d01:meMA.Ode9C1T.ode	@ltx/en_us_dedes/miscellanea:misc.Ode9
ltx/en_us_dedes/me.m12.d01:meMA.Ode9C1T.text	
ltx/en_us_dedes/me.m12.d01:meMA.Ode9H.greekmelody	@ltx/en_us_dedes/he.h.m5:heHE.IsaiaChoreve.greekname
ltx/en_us_dedes/me.m12.d01:meMA.Ode9H.incipit	@ltx/en_us_dedes/he.h.m5:heHE.IsaiaChoreve.incipit
ltx/en_us_dedes/me.m12.d01:meMA.Ode9H.melody	@ltx/en_us_dedes/he.h.m5:heHE.IsaiaChoreve.melody
ltx/en_us_dedes/me.m12.d01:meMA.Ode9H.mode	@ltx/en_us_dedes/miscellanea:misc.Mode5
ltx/en_us_dedes/me.m12.d01:meMA.Ode9H.ode	@ltx/en_us_dedes/miscellanea:misc.Ode9
ltx/en_us_dedes/me.m12.d01:meMA.Ode9H.text	@ltx/en_us_dedes/he.h.m5:heHE.IsaiaChoreve.text
ltx/en_us_dedes/me.m12.d01:meVE.Apolytikion1.melody	@ltx/en_us_dedes/he.ga:heGA.TouProfitouSou.name
ltx/en_us_dedes/me.m12.d01:meVE.Apolytikion1.mode	@ltx/en_us_dedes/miscellanea:misc.Mode2
ltx/en_us_dedes/me.m12.d01:meVE.Apolytikion2ger.greekmelody	@ltx/en_us_dedes/he.a.m3:heAU.TheiasPisteos.greekname
ltx/en_us_dedes/me.m12.d01:meVE.Apolytikion2ger.incipit	…
ltx/en_us_dedes/me.m12.d01:meVE.Apolytikion2ger.melody	@ltx/en_us_dedes/he.a.m3:heAU.TheiasPisteos.name
ltx/en_us_dedes/me.m12.d01:meVE.Apolytikion2ger.mode	@ltx/en_us_dedes/miscellanea:misc.Mode3
ltx/en_us_dedes/me.m12.d01:meVE.Apolytikion2ger.poet	@ltx/en_us_dedes/poets:po.Gerasimou
ltx/en_us_dedes/me.m12.d01:meVE.Apolytikion2ger.text	
ltx/en_us_dedes/me.m12.d01:meVE.Apolytikion3ger.greekmelody	@ltx/en_us_dedes/he.a.m3:heAU.TheiasPisteos.greekname
ltx/en_us_dedes/me.m12.d01:meVE.Apolytikion3ger.incipit	…
ltx/en_us_dedes/me.m12.d01:meVE.Apolytikion3ger.melody	@ltx/en_us_dedes/he.a.m3:heAU.TheiasPisteos.name
ltx/en_us_dedes/me.m12.d01:meVE.Apolytikion3ger.mode	@ltx/en_us_dedes/miscellanea:misc.Mode3
ltx/en_us_dedes/me.m12.d01:meVE.Apolytikion3ger.poet	@ltx/en_us_dedes/poets:po.Gerasimou
ltx/en_us_dedes/me.m12.d01:meVE.Apolytikion3ger.text	
ltx/en_us_dedes/me.m12.d01:meVE.GeneralApolytikion1.name	Nahum,
ltx/en_us_dedes/me.m12.d01:meVE.SticStavrotheotokion.greekmelody	@ltx/en_us_dedes/he.a.m3:heAU.MegaliTouStavrouSou.greekname
ltx/en_us_dedes/me.m12.d01:meVE.SticStavrotheotokion.incipit	All-blameless Lady, when you saw…
ltx/en_us_dedes/me.m12.d01:meVE.SticStavrotheotokion.melody	@ltx/en_us_dedes/he.a.m3:heAU.MegaliTouStavrouSou.name
ltx/en_us_dedes/me.m12.d01:meVE.SticStavrotheotokion.mode	@ltx/en_us_dedes/miscellanea:misc.Mode3
ltx/en_us_dedes/me.m12.d01:meVE.SticStavrotheotokion.text	All-blameless Lady, when you saw the Son whom you had borne * crucified and not breathing, * with bitter grief you cried out, * “Most beloved Child, tell me, how could Your handsome beauty * set like the sun, voluntarily * hiding behind the cloud of death?”
ltx/en_us_dedes/me.m12.d01:meVE.SticTheotokion.greekmelody	@ltx/en_us_dedes/he.a.m3:heAU.MegaliTouStavrouSou.greekname
ltx/en_us_dedes/me.m12.d01:meVE.SticTheotokion.incipit	Through you, O all-pure Virgin…
ltx/en_us_dedes/me.m12.d01:meVE.SticTheotokion.melody	@ltx/en_us_dedes/he.a.m3:heAU.MegaliTouStavrouSou.name
ltx/en_us_dedes/me.m12.d01:meVE.SticTheotokion.mode	@ltx/en_us_dedes/miscellanea:misc.Mode3
ltx/en_us_dedes/me.m12.d01:meVE.SticTheotokion.text	Through you, O all-pure Virgin, we received great benefit. * And now we join the Prophets * in honoring your childbirth. * Your Son and God accepted to be carried in your body, * in His supreme compassion, * and to regenerate the human race, O Lady.
ltx/en_us_dedes/me.m12.d01:meVE.Stichera01.greekmelody	@ltx/en_us_dedes/he.a.m3:heAU.MegaliTouStavrouSou.greekname
ltx/en_us_dedes/me.m12.d01:meVE.Stichera01.incipit	…
ltx/en_us_dedes/me.m12.d01:meVE.Stichera01.melody	@ltx/en_us_dedes/he.a.m3:heAU.MegaliTouStavrouSou.name
ltx/en_us_dedes/me.m12.d01:meVE.Stichera01.mode	@ltx/en_us_dedes/miscellanea:misc.Mode3
ltx/en_us_dedes/me.m12.d01:meVE.Stichera01.text	
ltx/en_us_dedes/me.m12.d01:meVE.Stichera02.incipit	…
ltx/en_us_dedes/me.m12.d01:meVE.Stichera02.melody	@ltx/en_us_dedes/he.a.m3:heAU.MegaliTouStavrouSou.name
ltx/en_us_dedes/me.m12.d01:meVE.Stichera02.mode	@ltx/en_us_dedes/miscellanea:misc.Mode3
ltx/en_us_dedes/me.m12.d01:meVE.Stichera02.text	
ltx/en_us_dedes/me.m12.d01:meVE.Stichera03.incipit	…
ltx/en_us_dedes/me.m12.d01:meVE.Stichera03.melody	@ltx/en_us_dedes/he.a.m3:heAU.MegaliTouStavrouSou.name
ltx/en_us_dedes/me.m12.d01:meVE.Stichera03.mode	@ltx/en_us_dedes/miscellanea:misc.Mode3
ltx/en_us_dedes/me.m12.d01:meVE.Stichera03.text	
