ltx/en_us_dedes/me.m05.d31:meDA.commemoration.first	Memory of the Holy Martyr Hermias
ltx/en_us_dedes/me.m05.d31:meDA.commemoration.first_name	
ltx/en_us_dedes/me.m05.d31:meDA.commemoration.first_short	Memory of the Holy Martyr Hermias
ltx/en_us_dedes/me.m05.d31:meDA.commemoration.first_title	@ltx/en_us_dedes/titles:ti.SaintM
ltx/en_us_dedes/me.m05.d31:meDA.commemoration.full	Memory of the Holy Martyr Hermias
ltx/en_us_dedes/me.m05.d31:meDA.commemoration.second_name	
ltx/en_us_dedes/me.m05.d31:meDA.commemoration.second_title	
ltx/en_us_dedes/me.m05.d31:meDA.date	May 31
ltx/en_us_dedes/me.m05.d31:meDA.fordate	for May 31
ltx/en_us_dedes/me.m05.d31:meDA.insert1	
ltx/en_us_dedes/me.m05.d31:meDA.insert2	
ltx/en_us_dedes/me.m05.d31:meDA.note	
ltx/en_us_dedes/me.m05.d31:meDA.pdfcoverdate	May 31,
ltx/en_us_dedes/me.m05.d31:meDA.pdfheaderdate	May 31
ltx/en_us_dedes/me.m05.d31:meHO.commemorations	
ltx/en_us_dedes/me.m05.d31:meHO.note1	
ltx/en_us_dedes/me.m05.d31:meHO.note2	
ltx/en_us_dedes/me.m05.d31:meHO.number	
ltx/en_us_dedes/me.m05.d31:meHO.rank	
ltx/en_us_dedes/me.m05.d31:meLE.commemoration1	
ltx/en_us_dedes/me.m05.d31:meLE.commemoration2	
ltx/en_us_dedes/me.m05.d31:meLI.Kontakion1.incipit	@ltx/en_us_dedes/me.m05.d31:meMA.Kontakion1ger.incipit
ltx/en_us_dedes/me.m05.d31:meLI.Kontakion1.melody	@ltx/en_us_dedes/me.m05.d31:meMA.Kontakion1ger.melody
ltx/en_us_dedes/me.m05.d31:meLI.Kontakion1.mode	@ltx/en_us_dedes/me.m05.d31:meMA.Kontakion1ger.mode
ltx/en_us_dedes/me.m05.d31:meLI.Kontakion1.text	@ltx/en_us_dedes/me.m05.d31:meMA.Kontakion1ger.text
ltx/en_us_dedes/me.m05.d31:meLI.MM.CommunionHymn.text	@ltx/en_us_dedes/properties:media.key
ltx/en_us_dedes/me.m05.d31:meLI.Megalynarion.text	
ltx/en_us_dedes/me.m05.d31:meMA.C1.acrostic.notice1	
ltx/en_us_dedes/me.m05.d31:meMA.C1.acrostic.text	
ltx/en_us_dedes/me.m05.d31:meMA.C1.acrostic.title	
ltx/en_us_dedes/me.m05.d31:meMA.C1.title	@ltx/en_us_dedes/titles:ti.CanonSaintM
ltx/en_us_dedes/me.m05.d31:meMA.C1.verse	@ltx/en_us_dedes/prayers:pr.verse_SaintM.text
ltx/en_us_dedes/me.m05.d31:meMA.Kontakion1ger.incipit	…
ltx/en_us_dedes/me.m05.d31:meMA.Kontakion1ger.melody	@ltx/en_us_dedes/he.a.m3:heAU.IParthenosSimeron.name
ltx/en_us_dedes/me.m05.d31:meMA.Kontakion1ger.mode	@ltx/en_us_dedes/miscellanea:misc.Mode3
ltx/en_us_dedes/me.m05.d31:meMA.Kontakion1ger.poet	@ltx/en_us_dedes/poets:po.Gerasimou
ltx/en_us_dedes/me.m05.d31:meMA.Kontakion1ger.text	
ltx/en_us_dedes/me.m05.d31:meMA.Ode1C11.greekmelody	@ltx/en_us_dedes/he.h.m8:heHE.YgranDiodefsas.greekname
ltx/en_us_dedes/me.m05.d31:meMA.Ode1C11.incipit	…
ltx/en_us_dedes/me.m05.d31:meMA.Ode1C11.melody	@ltx/en_us_dedes/he.h.m8:heHE.YgranDiodefsas.name
ltx/en_us_dedes/me.m05.d31:meMA.Ode1C11.mode	@ltx/en_us_dedes/miscellanea:misc.Mode8
ltx/en_us_dedes/me.m05.d31:meMA.Ode1C11.ode	@ltx/en_us_dedes/miscellanea:misc.Ode1
ltx/en_us_dedes/me.m05.d31:meMA.Ode1C11.text	
ltx/en_us_dedes/me.m05.d31:meMA.Ode1C12.incipit	…
ltx/en_us_dedes/me.m05.d31:meMA.Ode1C12.melody	@ltx/en_us_dedes/he.h.m8:heHE.YgranDiodefsas.name
ltx/en_us_dedes/me.m05.d31:meMA.Ode1C12.mode	@ltx/en_us_dedes/miscellanea:misc.Mode8
ltx/en_us_dedes/me.m05.d31:meMA.Ode1C12.ode	@ltx/en_us_dedes/miscellanea:misc.Ode1
ltx/en_us_dedes/me.m05.d31:meMA.Ode1C12.text	
ltx/en_us_dedes/me.m05.d31:meMA.Ode1C13.incipit	…
ltx/en_us_dedes/me.m05.d31:meMA.Ode1C13.melody	@ltx/en_us_dedes/he.h.m8:heHE.YgranDiodefsas.name
ltx/en_us_dedes/me.m05.d31:meMA.Ode1C13.mode	@ltx/en_us_dedes/miscellanea:misc.Mode8
ltx/en_us_dedes/me.m05.d31:meMA.Ode1C13.ode	@ltx/en_us_dedes/miscellanea:misc.Ode1
ltx/en_us_dedes/me.m05.d31:meMA.Ode1C13.text	
ltx/en_us_dedes/me.m05.d31:meMA.Ode1C14.incipit	…
ltx/en_us_dedes/me.m05.d31:meMA.Ode1C14.melody	@ltx/en_us_dedes/he.h.m8:heHE.YgranDiodefsas.name
ltx/en_us_dedes/me.m05.d31:meMA.Ode1C14.mode	@ltx/en_us_dedes/miscellanea:misc.Mode8
ltx/en_us_dedes/me.m05.d31:meMA.Ode1C14.ode	@ltx/en_us_dedes/miscellanea:misc.Ode1
ltx/en_us_dedes/me.m05.d31:meMA.Ode1C14.text	
ltx/en_us_dedes/me.m05.d31:meMA.Ode1C1T.incipit	…
ltx/en_us_dedes/me.m05.d31:meMA.Ode1C1T.melody	@ltx/en_us_dedes/he.h.m8:heHE.YgranDiodefsas.name
ltx/en_us_dedes/me.m05.d31:meMA.Ode1C1T.mode	@ltx/en_us_dedes/miscellanea:misc.Mode8
ltx/en_us_dedes/me.m05.d31:meMA.Ode1C1T.ode	@ltx/en_us_dedes/miscellanea:misc.Ode1
ltx/en_us_dedes/me.m05.d31:meMA.Ode1C1T.text	
ltx/en_us_dedes/me.m05.d31:meMA.Ode3C11.greekmelody	@ltx/en_us_dedes/he.h.m8:heHE.SyEiToStereoma.greekname
ltx/en_us_dedes/me.m05.d31:meMA.Ode3C11.incipit	…
ltx/en_us_dedes/me.m05.d31:meMA.Ode3C11.melody	@ltx/en_us_dedes/he.h.m8:heHE.SyEiToStereoma.name
ltx/en_us_dedes/me.m05.d31:meMA.Ode3C11.mode	@ltx/en_us_dedes/miscellanea:misc.Mode8
ltx/en_us_dedes/me.m05.d31:meMA.Ode3C11.ode	@ltx/en_us_dedes/miscellanea:misc.Ode3
ltx/en_us_dedes/me.m05.d31:meMA.Ode3C11.text	
ltx/en_us_dedes/me.m05.d31:meMA.Ode3C12.incipit	…
ltx/en_us_dedes/me.m05.d31:meMA.Ode3C12.melody	@ltx/en_us_dedes/he.h.m8:heHE.SyEiToStereoma.name
ltx/en_us_dedes/me.m05.d31:meMA.Ode3C12.mode	@ltx/en_us_dedes/miscellanea:misc.Mode8
ltx/en_us_dedes/me.m05.d31:meMA.Ode3C12.ode	@ltx/en_us_dedes/miscellanea:misc.Ode3
ltx/en_us_dedes/me.m05.d31:meMA.Ode3C12.text	
ltx/en_us_dedes/me.m05.d31:meMA.Ode3C13.incipit	…
ltx/en_us_dedes/me.m05.d31:meMA.Ode3C13.melody	@ltx/en_us_dedes/he.h.m8:heHE.SyEiToStereoma.name
ltx/en_us_dedes/me.m05.d31:meMA.Ode3C13.mode	@ltx/en_us_dedes/miscellanea:misc.Mode8
ltx/en_us_dedes/me.m05.d31:meMA.Ode3C13.ode	@ltx/en_us_dedes/miscellanea:misc.Ode3
ltx/en_us_dedes/me.m05.d31:meMA.Ode3C13.text	
ltx/en_us_dedes/me.m05.d31:meMA.Ode3C1T.incipit	…
ltx/en_us_dedes/me.m05.d31:meMA.Ode3C1T.melody	@ltx/en_us_dedes/he.h.m8:heHE.SyEiToStereoma.name
ltx/en_us_dedes/me.m05.d31:meMA.Ode3C1T.mode	@ltx/en_us_dedes/miscellanea:misc.Mode8
ltx/en_us_dedes/me.m05.d31:meMA.Ode3C1T.ode	@ltx/en_us_dedes/miscellanea:misc.Ode3
ltx/en_us_dedes/me.m05.d31:meMA.Ode3C1T.text	
ltx/en_us_dedes/me.m05.d31:meMA.Ode3H.greekmelody	@ltx/en_us_dedes/he.h.m8:heHE.SyEiToStereoma.greekname
ltx/en_us_dedes/me.m05.d31:meMA.Ode3H.incipit	@ltx/en_us_dedes/he.h.m8:heHE.SyEiToStereoma.incipit
ltx/en_us_dedes/me.m05.d31:meMA.Ode3H.melody	@ltx/en_us_dedes/he.h.m8:heHE.SyEiToStereoma.melody
ltx/en_us_dedes/me.m05.d31:meMA.Ode3H.mode	@ltx/en_us_dedes/miscellanea:misc.Mode8
ltx/en_us_dedes/me.m05.d31:meMA.Ode3H.ode	@ltx/en_us_dedes/miscellanea:misc.Ode3
ltx/en_us_dedes/me.m05.d31:meMA.Ode3H.text	@ltx/en_us_dedes/he.h.m8:heHE.SyEiToStereoma.text
ltx/en_us_dedes/me.m05.d31:meMA.Ode3Kathisma1.greekmelody	@ltx/en_us_dedes/he.a.m4:heAU.EpefanisSimeron.greekname
ltx/en_us_dedes/me.m05.d31:meMA.Ode3Kathisma1.incipit	…
ltx/en_us_dedes/me.m05.d31:meMA.Ode3Kathisma1.melody	@ltx/en_us_dedes/he.a.m4:heAU.EpefanisSimeron.name
ltx/en_us_dedes/me.m05.d31:meMA.Ode3Kathisma1.mode	@ltx/en_us_dedes/miscellanea:misc.Mode4
ltx/en_us_dedes/me.m05.d31:meMA.Ode3Kathisma1.text	
ltx/en_us_dedes/me.m05.d31:meMA.Ode3KathismaSt.incipit	@ltx/en_us_dedes/me.m05.d30:meMA.Ode3KathismaSt.incipit
ltx/en_us_dedes/me.m05.d31:meMA.Ode3KathismaSt.melody	@ltx/en_us_dedes/he.a.m4:heAU.EpefanisSimeron.name
ltx/en_us_dedes/me.m05.d31:meMA.Ode3KathismaSt.mode	@ltx/en_us_dedes/miscellanea:misc.Mode4
ltx/en_us_dedes/me.m05.d31:meMA.Ode3KathismaSt.text	@ltx/en_us_dedes/me.m05.d30:meMA.Ode3KathismaSt.text
ltx/en_us_dedes/me.m05.d31:meMA.Ode3KathismaT.incipit	@ltx/en_us_dedes/me.m05.d30:meMA.Ode3KathismaT.incipit
ltx/en_us_dedes/me.m05.d31:meMA.Ode3KathismaT.melody	@ltx/en_us_dedes/he.a.m4:heAU.EpefanisSimeron.name
ltx/en_us_dedes/me.m05.d31:meMA.Ode3KathismaT.mode	@ltx/en_us_dedes/miscellanea:misc.Mode4
ltx/en_us_dedes/me.m05.d31:meMA.Ode3KathismaT.text	@ltx/en_us_dedes/me.m05.d30:meMA.Ode3KathismaT.text
ltx/en_us_dedes/me.m05.d31:meMA.Ode4C11.greekmelody	@ltx/en_us_dedes/he.h.m8:heHE.EisakikoaKyrie.greekname
ltx/en_us_dedes/me.m05.d31:meMA.Ode4C11.incipit	…
ltx/en_us_dedes/me.m05.d31:meMA.Ode4C11.melody	@ltx/en_us_dedes/he.h.m8:heHE.EisakikoaKyrie.name
ltx/en_us_dedes/me.m05.d31:meMA.Ode4C11.mode	@ltx/en_us_dedes/miscellanea:misc.Mode8
ltx/en_us_dedes/me.m05.d31:meMA.Ode4C11.ode	@ltx/en_us_dedes/miscellanea:misc.Ode4
ltx/en_us_dedes/me.m05.d31:meMA.Ode4C11.text	
ltx/en_us_dedes/me.m05.d31:meMA.Ode4C12.incipit	…
ltx/en_us_dedes/me.m05.d31:meMA.Ode4C12.melody	@ltx/en_us_dedes/he.h.m8:heHE.EisakikoaKyrie.name
ltx/en_us_dedes/me.m05.d31:meMA.Ode4C12.mode	@ltx/en_us_dedes/miscellanea:misc.Mode8
ltx/en_us_dedes/me.m05.d31:meMA.Ode4C12.ode	@ltx/en_us_dedes/miscellanea:misc.Ode4
ltx/en_us_dedes/me.m05.d31:meMA.Ode4C12.text	
ltx/en_us_dedes/me.m05.d31:meMA.Ode4C13.incipit	…
ltx/en_us_dedes/me.m05.d31:meMA.Ode4C13.melody	@ltx/en_us_dedes/he.h.m8:heHE.EisakikoaKyrie.name
ltx/en_us_dedes/me.m05.d31:meMA.Ode4C13.mode	@ltx/en_us_dedes/miscellanea:misc.Mode8
ltx/en_us_dedes/me.m05.d31:meMA.Ode4C13.ode	@ltx/en_us_dedes/miscellanea:misc.Ode4
ltx/en_us_dedes/me.m05.d31:meMA.Ode4C13.text	
ltx/en_us_dedes/me.m05.d31:meMA.Ode4C14.incipit	…
ltx/en_us_dedes/me.m05.d31:meMA.Ode4C14.melody	@ltx/en_us_dedes/he.h.m8:heHE.EisakikoaKyrie.name
ltx/en_us_dedes/me.m05.d31:meMA.Ode4C14.mode	@ltx/en_us_dedes/miscellanea:misc.Mode8
ltx/en_us_dedes/me.m05.d31:meMA.Ode4C14.ode	@ltx/en_us_dedes/miscellanea:misc.Ode4
ltx/en_us_dedes/me.m05.d31:meMA.Ode4C14.text	
ltx/en_us_dedes/me.m05.d31:meMA.Ode4C1T.incipit	…
ltx/en_us_dedes/me.m05.d31:meMA.Ode4C1T.melody	@ltx/en_us_dedes/he.h.m8:heHE.EisakikoaKyrie.name
ltx/en_us_dedes/me.m05.d31:meMA.Ode4C1T.mode	@ltx/en_us_dedes/miscellanea:misc.Mode8
ltx/en_us_dedes/me.m05.d31:meMA.Ode4C1T.ode	@ltx/en_us_dedes/miscellanea:misc.Ode4
ltx/en_us_dedes/me.m05.d31:meMA.Ode4C1T.text	
ltx/en_us_dedes/me.m05.d31:meMA.Ode5C11.greekmelody	@ltx/en_us_dedes/he.h.m8:heHE.InaTiMeAposo.greekname
ltx/en_us_dedes/me.m05.d31:meMA.Ode5C11.incipit	…
ltx/en_us_dedes/me.m05.d31:meMA.Ode5C11.melody	@ltx/en_us_dedes/he.h.m8:heHE.InaTiMeAposo.name
ltx/en_us_dedes/me.m05.d31:meMA.Ode5C11.mode	@ltx/en_us_dedes/miscellanea:misc.Mode8
ltx/en_us_dedes/me.m05.d31:meMA.Ode5C11.ode	@ltx/en_us_dedes/miscellanea:misc.Ode5
ltx/en_us_dedes/me.m05.d31:meMA.Ode5C11.text	
ltx/en_us_dedes/me.m05.d31:meMA.Ode5C12.incipit	…
ltx/en_us_dedes/me.m05.d31:meMA.Ode5C12.melody	@ltx/en_us_dedes/he.h.m8:heHE.InaTiMeAposo.name
ltx/en_us_dedes/me.m05.d31:meMA.Ode5C12.mode	@ltx/en_us_dedes/miscellanea:misc.Mode8
ltx/en_us_dedes/me.m05.d31:meMA.Ode5C12.ode	@ltx/en_us_dedes/miscellanea:misc.Ode5
ltx/en_us_dedes/me.m05.d31:meMA.Ode5C12.text	
ltx/en_us_dedes/me.m05.d31:meMA.Ode5C13.incipit	…
ltx/en_us_dedes/me.m05.d31:meMA.Ode5C13.melody	@ltx/en_us_dedes/he.h.m8:heHE.InaTiMeAposo.name
ltx/en_us_dedes/me.m05.d31:meMA.Ode5C13.mode	@ltx/en_us_dedes/miscellanea:misc.Mode8
ltx/en_us_dedes/me.m05.d31:meMA.Ode5C13.ode	@ltx/en_us_dedes/miscellanea:misc.Ode5
ltx/en_us_dedes/me.m05.d31:meMA.Ode5C13.text	
ltx/en_us_dedes/me.m05.d31:meMA.Ode5C1T.incipit	…
ltx/en_us_dedes/me.m05.d31:meMA.Ode5C1T.melody	@ltx/en_us_dedes/he.h.m8:heHE.InaTiMeAposo.name
ltx/en_us_dedes/me.m05.d31:meMA.Ode5C1T.mode	@ltx/en_us_dedes/miscellanea:misc.Mode8
ltx/en_us_dedes/me.m05.d31:meMA.Ode5C1T.ode	@ltx/en_us_dedes/miscellanea:misc.Ode5
ltx/en_us_dedes/me.m05.d31:meMA.Ode5C1T.text	
ltx/en_us_dedes/me.m05.d31:meMA.Ode6C11.greekmelody	@ltx/en_us_dedes/he.h.m8:heHE.IlasthitiMoiSotir.greekname
ltx/en_us_dedes/me.m05.d31:meMA.Ode6C11.incipit	…
ltx/en_us_dedes/me.m05.d31:meMA.Ode6C11.melody	@ltx/en_us_dedes/he.h.m8:heHE.IlasthitiMoiSotir.name
ltx/en_us_dedes/me.m05.d31:meMA.Ode6C11.mode	@ltx/en_us_dedes/miscellanea:misc.Mode8
ltx/en_us_dedes/me.m05.d31:meMA.Ode6C11.ode	@ltx/en_us_dedes/miscellanea:misc.Ode6
ltx/en_us_dedes/me.m05.d31:meMA.Ode6C11.text	
ltx/en_us_dedes/me.m05.d31:meMA.Ode6C12.incipit	…
ltx/en_us_dedes/me.m05.d31:meMA.Ode6C12.melody	@ltx/en_us_dedes/he.h.m8:heHE.IlasthitiMoiSotir.name
ltx/en_us_dedes/me.m05.d31:meMA.Ode6C12.mode	@ltx/en_us_dedes/miscellanea:misc.Mode8
ltx/en_us_dedes/me.m05.d31:meMA.Ode6C12.ode	@ltx/en_us_dedes/miscellanea:misc.Ode6
ltx/en_us_dedes/me.m05.d31:meMA.Ode6C12.text	
ltx/en_us_dedes/me.m05.d31:meMA.Ode6C13.incipit	…
ltx/en_us_dedes/me.m05.d31:meMA.Ode6C13.melody	@ltx/en_us_dedes/he.h.m8:heHE.IlasthitiMoiSotir.name
ltx/en_us_dedes/me.m05.d31:meMA.Ode6C13.mode	@ltx/en_us_dedes/miscellanea:misc.Mode8
ltx/en_us_dedes/me.m05.d31:meMA.Ode6C13.ode	@ltx/en_us_dedes/miscellanea:misc.Ode6
ltx/en_us_dedes/me.m05.d31:meMA.Ode6C13.text	
ltx/en_us_dedes/me.m05.d31:meMA.Ode6C1T.incipit	…
ltx/en_us_dedes/me.m05.d31:meMA.Ode6C1T.melody	@ltx/en_us_dedes/he.h.m8:heHE.IlasthitiMoiSotir.name
ltx/en_us_dedes/me.m05.d31:meMA.Ode6C1T.mode	@ltx/en_us_dedes/miscellanea:misc.Mode8
ltx/en_us_dedes/me.m05.d31:meMA.Ode6C1T.ode	@ltx/en_us_dedes/miscellanea:misc.Ode6
ltx/en_us_dedes/me.m05.d31:meMA.Ode6C1T.text	
ltx/en_us_dedes/me.m05.d31:meMA.Ode6H.greekmelody	@ltx/en_us_dedes/he.h.m8:heHE.IlasthitiMoiSotir.greekname
ltx/en_us_dedes/me.m05.d31:meMA.Ode6H.incipit	@ltx/en_us_dedes/he.h.m8:heHE.IlasthitiMoiSotir.incipit
ltx/en_us_dedes/me.m05.d31:meMA.Ode6H.melody	@ltx/en_us_dedes/he.h.m8:heHE.IlasthitiMoiSotir.melody
ltx/en_us_dedes/me.m05.d31:meMA.Ode6H.mode	@ltx/en_us_dedes/miscellanea:misc.Mode8
ltx/en_us_dedes/me.m05.d31:meMA.Ode6H.ode	@ltx/en_us_dedes/miscellanea:misc.Ode6
ltx/en_us_dedes/me.m05.d31:meMA.Ode6H.text	@ltx/en_us_dedes/he.h.m8:heHE.IlasthitiMoiSotir.text
ltx/en_us_dedes/me.m05.d31:meMA.Ode7C11.greekmelody	@ltx/en_us_dedes/he.h.m8:heHE.OiEkTisIoudaias.greekname
ltx/en_us_dedes/me.m05.d31:meMA.Ode7C11.incipit	…
ltx/en_us_dedes/me.m05.d31:meMA.Ode7C11.melody	@ltx/en_us_dedes/he.h.m8:heHE.OiEkTisIoudaias.name
ltx/en_us_dedes/me.m05.d31:meMA.Ode7C11.mode	@ltx/en_us_dedes/miscellanea:misc.Mode8
ltx/en_us_dedes/me.m05.d31:meMA.Ode7C11.ode	@ltx/en_us_dedes/miscellanea:misc.Ode7
ltx/en_us_dedes/me.m05.d31:meMA.Ode7C11.text	
ltx/en_us_dedes/me.m05.d31:meMA.Ode7C12.incipit	…
ltx/en_us_dedes/me.m05.d31:meMA.Ode7C12.melody	@ltx/en_us_dedes/he.h.m8:heHE.OiEkTisIoudaias.name
ltx/en_us_dedes/me.m05.d31:meMA.Ode7C12.mode	@ltx/en_us_dedes/miscellanea:misc.Mode8
ltx/en_us_dedes/me.m05.d31:meMA.Ode7C12.ode	@ltx/en_us_dedes/miscellanea:misc.Ode7
ltx/en_us_dedes/me.m05.d31:meMA.Ode7C12.text	
ltx/en_us_dedes/me.m05.d31:meMA.Ode7C13.incipit	…
ltx/en_us_dedes/me.m05.d31:meMA.Ode7C13.melody	@ltx/en_us_dedes/he.h.m8:heHE.OiEkTisIoudaias.name
ltx/en_us_dedes/me.m05.d31:meMA.Ode7C13.mode	@ltx/en_us_dedes/miscellanea:misc.Mode8
ltx/en_us_dedes/me.m05.d31:meMA.Ode7C13.ode	@ltx/en_us_dedes/miscellanea:misc.Ode7
ltx/en_us_dedes/me.m05.d31:meMA.Ode7C13.text	
ltx/en_us_dedes/me.m05.d31:meMA.Ode7C1T.incipit	…
ltx/en_us_dedes/me.m05.d31:meMA.Ode7C1T.melody	@ltx/en_us_dedes/he.h.m8:heHE.OiEkTisIoudaias.name
ltx/en_us_dedes/me.m05.d31:meMA.Ode7C1T.mode	@ltx/en_us_dedes/miscellanea:misc.Mode8
ltx/en_us_dedes/me.m05.d31:meMA.Ode7C1T.ode	@ltx/en_us_dedes/miscellanea:misc.Ode7
ltx/en_us_dedes/me.m05.d31:meMA.Ode7C1T.text	
ltx/en_us_dedes/me.m05.d31:meMA.Ode8C11.greekmelody	@ltx/en_us_dedes/he.h.m8:heHE.NikitaiTyrannou.greekname
ltx/en_us_dedes/me.m05.d31:meMA.Ode8C11.incipit	…
ltx/en_us_dedes/me.m05.d31:meMA.Ode8C11.melody	@ltx/en_us_dedes/he.h.m8:heHE.NikitaiTyrannou.name
ltx/en_us_dedes/me.m05.d31:meMA.Ode8C11.mode	@ltx/en_us_dedes/miscellanea:misc.Mode8
ltx/en_us_dedes/me.m05.d31:meMA.Ode8C11.ode	@ltx/en_us_dedes/miscellanea:misc.Ode8
ltx/en_us_dedes/me.m05.d31:meMA.Ode8C11.text	
ltx/en_us_dedes/me.m05.d31:meMA.Ode8C12.incipit	…
ltx/en_us_dedes/me.m05.d31:meMA.Ode8C12.melody	@ltx/en_us_dedes/he.h.m8:heHE.NikitaiTyrannou.name
ltx/en_us_dedes/me.m05.d31:meMA.Ode8C12.mode	@ltx/en_us_dedes/miscellanea:misc.Mode8
ltx/en_us_dedes/me.m05.d31:meMA.Ode8C12.ode	@ltx/en_us_dedes/miscellanea:misc.Ode8
ltx/en_us_dedes/me.m05.d31:meMA.Ode8C12.text	
ltx/en_us_dedes/me.m05.d31:meMA.Ode8C13.incipit	…
ltx/en_us_dedes/me.m05.d31:meMA.Ode8C13.melody	@ltx/en_us_dedes/he.h.m8:heHE.NikitaiTyrannou.name
ltx/en_us_dedes/me.m05.d31:meMA.Ode8C13.mode	@ltx/en_us_dedes/miscellanea:misc.Mode8
ltx/en_us_dedes/me.m05.d31:meMA.Ode8C13.ode	@ltx/en_us_dedes/miscellanea:misc.Ode8
ltx/en_us_dedes/me.m05.d31:meMA.Ode8C13.text	
ltx/en_us_dedes/me.m05.d31:meMA.Ode8C1T.incipit	…
ltx/en_us_dedes/me.m05.d31:meMA.Ode8C1T.melody	@ltx/en_us_dedes/he.h.m8:heHE.NikitaiTyrannou.name
ltx/en_us_dedes/me.m05.d31:meMA.Ode8C1T.mode	@ltx/en_us_dedes/miscellanea:misc.Mode8
ltx/en_us_dedes/me.m05.d31:meMA.Ode8C1T.ode	@ltx/en_us_dedes/miscellanea:misc.Ode8
ltx/en_us_dedes/me.m05.d31:meMA.Ode8C1T.text	
ltx/en_us_dedes/me.m05.d31:meMA.Ode8H.greekmelody	@ltx/en_us_dedes/he.h.m8:heHE.NikitaiTyrannou.greekname
ltx/en_us_dedes/me.m05.d31:meMA.Ode8H.incipit	@ltx/en_us_dedes/he.h.m8:heHE.NikitaiTyrannou.incipit
ltx/en_us_dedes/me.m05.d31:meMA.Ode8H.melody	@ltx/en_us_dedes/he.h.m8:heHE.NikitaiTyrannou.melody
ltx/en_us_dedes/me.m05.d31:meMA.Ode8H.mode	@ltx/en_us_dedes/miscellanea:misc.Mode8
ltx/en_us_dedes/me.m05.d31:meMA.Ode8H.ode	@ltx/en_us_dedes/miscellanea:misc.Ode8
ltx/en_us_dedes/me.m05.d31:meMA.Ode8H.text	@ltx/en_us_dedes/he.h.m8:heHE.NikitaiTyrannou.text
ltx/en_us_dedes/me.m05.d31:meMA.Ode9C11.greekmelody	@ltx/en_us_dedes/he.h.m8:heHE.ExestiEpiTouto.greekname
ltx/en_us_dedes/me.m05.d31:meMA.Ode9C11.incipit	…
ltx/en_us_dedes/me.m05.d31:meMA.Ode9C11.melody	@ltx/en_us_dedes/he.h.m8:heHE.ExestiEpiTouto.name
ltx/en_us_dedes/me.m05.d31:meMA.Ode9C11.mode	@ltx/en_us_dedes/miscellanea:misc.Mode8
ltx/en_us_dedes/me.m05.d31:meMA.Ode9C11.ode	@ltx/en_us_dedes/miscellanea:misc.Ode9
ltx/en_us_dedes/me.m05.d31:meMA.Ode9C11.text	
ltx/en_us_dedes/me.m05.d31:meMA.Ode9C12.incipit	…
ltx/en_us_dedes/me.m05.d31:meMA.Ode9C12.melody	@ltx/en_us_dedes/he.h.m8:heHE.ExestiEpiTouto.name
ltx/en_us_dedes/me.m05.d31:meMA.Ode9C12.mode	@ltx/en_us_dedes/miscellanea:misc.Mode8
ltx/en_us_dedes/me.m05.d31:meMA.Ode9C12.ode	@ltx/en_us_dedes/miscellanea:misc.Ode9
ltx/en_us_dedes/me.m05.d31:meMA.Ode9C12.text	
ltx/en_us_dedes/me.m05.d31:meMA.Ode9C13.incipit	…
ltx/en_us_dedes/me.m05.d31:meMA.Ode9C13.melody	@ltx/en_us_dedes/he.h.m8:heHE.ExestiEpiTouto.name
ltx/en_us_dedes/me.m05.d31:meMA.Ode9C13.mode	@ltx/en_us_dedes/miscellanea:misc.Mode8
ltx/en_us_dedes/me.m05.d31:meMA.Ode9C13.ode	@ltx/en_us_dedes/miscellanea:misc.Ode9
ltx/en_us_dedes/me.m05.d31:meMA.Ode9C13.text	
ltx/en_us_dedes/me.m05.d31:meMA.Ode9C14.incipit	…
ltx/en_us_dedes/me.m05.d31:meMA.Ode9C14.melody	@ltx/en_us_dedes/he.h.m8:heHE.ExestiEpiTouto.name
ltx/en_us_dedes/me.m05.d31:meMA.Ode9C14.mode	@ltx/en_us_dedes/miscellanea:misc.Mode8
ltx/en_us_dedes/me.m05.d31:meMA.Ode9C14.ode	@ltx/en_us_dedes/miscellanea:misc.Ode9
ltx/en_us_dedes/me.m05.d31:meMA.Ode9C14.text	
ltx/en_us_dedes/me.m05.d31:meMA.Ode9C1T.incipit	…
ltx/en_us_dedes/me.m05.d31:meMA.Ode9C1T.melody	@ltx/en_us_dedes/he.h.m8:heHE.ExestiEpiTouto.name
ltx/en_us_dedes/me.m05.d31:meMA.Ode9C1T.mode	@ltx/en_us_dedes/miscellanea:misc.Mode8
ltx/en_us_dedes/me.m05.d31:meMA.Ode9C1T.ode	@ltx/en_us_dedes/miscellanea:misc.Ode9
ltx/en_us_dedes/me.m05.d31:meMA.Ode9C1T.text	
ltx/en_us_dedes/me.m05.d31:meMA.Ode9H.greekmelody	@ltx/en_us_dedes/he.h.m8:heHE.ExestiEpiTouto.greekname
ltx/en_us_dedes/me.m05.d31:meMA.Ode9H.incipit	@ltx/en_us_dedes/he.h.m8:heHE.ExestiEpiTouto.incipit
ltx/en_us_dedes/me.m05.d31:meMA.Ode9H.melody	@ltx/en_us_dedes/he.h.m8:heHE.ExestiEpiTouto.melody
ltx/en_us_dedes/me.m05.d31:meMA.Ode9H.mode	@ltx/en_us_dedes/miscellanea:misc.Mode8
ltx/en_us_dedes/me.m05.d31:meMA.Ode9H.ode	@ltx/en_us_dedes/miscellanea:misc.Ode9
ltx/en_us_dedes/me.m05.d31:meMA.Ode9H.text	@ltx/en_us_dedes/he.h.m8:heHE.ExestiEpiTouto.text
ltx/en_us_dedes/me.m05.d31:meVE.Apolytikion1ger.greekmelody	@ltx/en_us_dedes/he.a.m4:heAU.TachyProkatalave.greekname
ltx/en_us_dedes/me.m05.d31:meVE.Apolytikion1ger.incipit	…
ltx/en_us_dedes/me.m05.d31:meVE.Apolytikion1ger.melody	@ltx/en_us_dedes/he.a.m4:heAU.TachyProkatalave.name
ltx/en_us_dedes/me.m05.d31:meVE.Apolytikion1ger.mode	@ltx/en_us_dedes/miscellanea:misc.Mode4
ltx/en_us_dedes/me.m05.d31:meVE.Apolytikion1ger.poet	@ltx/en_us_dedes/poets:po.Gerasimou
ltx/en_us_dedes/me.m05.d31:meVE.Apolytikion1ger.text	
ltx/en_us_dedes/me.m05.d31:meVE.SticStavrotheotokion.greekmelody	@ltx/en_us_dedes/he.a.m1:heAU.TonOuranionTagmaton.greekname
ltx/en_us_dedes/me.m05.d31:meVE.SticStavrotheotokion.incipit	@ltx/en_us_dedes/me.m01.d23:meVE.AposStavrotheotokion.incipit
ltx/en_us_dedes/me.m05.d31:meVE.SticStavrotheotokion.melody	@ltx/en_us_dedes/he.a.m1:heAU.TonOuranionTagmaton.name
ltx/en_us_dedes/me.m05.d31:meVE.SticStavrotheotokion.mode	@ltx/en_us_dedes/miscellanea:misc.Mode1
ltx/en_us_dedes/me.m05.d31:meVE.SticStavrotheotokion.text	@ltx/en_us_dedes/me.m01.d23:meVE.AposStavrotheotokion.text
ltx/en_us_dedes/me.m05.d31:meVE.SticTheotokion.greekmelody	@ltx/en_us_dedes/he.a.m1:heAU.TonOuranionTagmaton.greekname
ltx/en_us_dedes/me.m05.d31:meVE.SticTheotokion.incipit	…
ltx/en_us_dedes/me.m05.d31:meVE.SticTheotokion.melody	@ltx/en_us_dedes/he.a.m1:heAU.TonOuranionTagmaton.name
ltx/en_us_dedes/me.m05.d31:meVE.SticTheotokion.mode	@ltx/en_us_dedes/miscellanea:misc.Mode1
ltx/en_us_dedes/me.m05.d31:meVE.SticTheotokion.text	
ltx/en_us_dedes/me.m05.d31:meVE.Stichera01.greekmelody	@ltx/en_us_dedes/he.a.m1:heAU.TonOuranionTagmaton.greekname
ltx/en_us_dedes/me.m05.d31:meVE.Stichera01.incipit	…
ltx/en_us_dedes/me.m05.d31:meVE.Stichera01.melody	@ltx/en_us_dedes/he.a.m1:heAU.TonOuranionTagmaton.name
ltx/en_us_dedes/me.m05.d31:meVE.Stichera01.mode	@ltx/en_us_dedes/miscellanea:misc.Mode1
ltx/en_us_dedes/me.m05.d31:meVE.Stichera01.text	
ltx/en_us_dedes/me.m05.d31:meVE.Stichera02.incipit	…
ltx/en_us_dedes/me.m05.d31:meVE.Stichera02.melody	@ltx/en_us_dedes/he.a.m1:heAU.TonOuranionTagmaton.name
ltx/en_us_dedes/me.m05.d31:meVE.Stichera02.mode	@ltx/en_us_dedes/miscellanea:misc.Mode1
ltx/en_us_dedes/me.m05.d31:meVE.Stichera02.text	
ltx/en_us_dedes/me.m05.d31:meVE.Stichera03.incipit	…
ltx/en_us_dedes/me.m05.d31:meVE.Stichera03.melody	@ltx/en_us_dedes/he.a.m1:heAU.TonOuranionTagmaton.name
ltx/en_us_dedes/me.m05.d31:meVE.Stichera03.mode	@ltx/en_us_dedes/miscellanea:misc.Mode1
ltx/en_us_dedes/me.m05.d31:meVE.Stichera03.text	
