ltx/en_us_dedes/pe.d078:peDA.commemoration.full	Sunday After Pascha - Thomas’ Touching of the Lord
ltx/en_us_dedes/pe.d078:peDA.commemoration.short	Sunday After Pascha (Thomas Sunday)
ltx/en_us_dedes/pe.d078:peDA.dismissal	@ltx/en_us_dedes/dismissals:dis00.resurrection
ltx/en_us_dedes/pe.d078:peDA.insert1	the holy Apostle Thomas,
ltx/en_us_dedes/pe.d078:peDA.insert2	whose touching of the Lord we celebrate,
ltx/en_us_dedes/pe.d078:peDA.note	
ltx/en_us_dedes/pe.d078:peHO.commemorations	
ltx/en_us_dedes/pe.d078:peHO.daytitle	
ltx/en_us_dedes/pe.d078:peHO.description1	
ltx/en_us_dedes/pe.d078:peHO.description2	
ltx/en_us_dedes/pe.d078:peHO.note1	
ltx/en_us_dedes/pe.d078:peHO.note2	
ltx/en_us_dedes/pe.d078:peLI.Kontakion1.incipit	@ltx/en_us_dedes/pe.d078:peMA.Kontakion1.incipit
ltx/en_us_dedes/pe.d078:peLI.Kontakion1.melody	@ltx/en_us_dedes/pe.d078:peMA.Kontakion1.melody
ltx/en_us_dedes/pe.d078:peLI.Kontakion1.mode	@ltx/en_us_dedes/pe.d078:peMA.Kontakion1.mode
ltx/en_us_dedes/pe.d078:peLI.Kontakion1.text	@ltx/en_us_dedes/pe.d078:peMA.Kontakion1.text
ltx/en_us_dedes/pe.d078:peLI.MM.CommunionHymn.text	@ltx/en_us_dedes/properties:media.key
ltx/en_us_dedes/pe.d078:peLI.Megalynarion.text	
ltx/en_us_dedes/pe.d078:peLI.TheotokosHymn.incipit	@ltx/en_us_dedes/pe.d078:peMA.Ode9C1H.incipit
ltx/en_us_dedes/pe.d078:peLI.TheotokosHymn.mode	@ltx/en_us_dedes/miscellanea:misc.Mode1
ltx/en_us_dedes/pe.d078:peLI.TheotokosHymn.text	@ltx/en_us_dedes/pe.d078:peMA.Ode9C1H.text
ltx/en_us_dedes/pe.d078:peMA.C1.poet	@ltx/en_us_dedes/poets:po.IoannouMonachou
ltx/en_us_dedes/pe.d078:peMA.C1.title	@ltx/en_us_dedes/titles:ti.CanonFeast
ltx/en_us_dedes/pe.d078:peMA.C1.verse	@ltx/en_us_dedes/prayers:pr.verse_Resurrection.text
ltx/en_us_dedes/pe.d078:peMA.Exaposteilarion1.greekmelody	@ltx/en_us_dedes/he.a.m3:heAU.OOuranonToisAstrois.greekname
ltx/en_us_dedes/pe.d078:peMA.Exaposteilarion1.incipit	When you examine…
ltx/en_us_dedes/pe.d078:peMA.Exaposteilarion1.melody	@ltx/en_us_dedes/he.a.m3:heAU.OOuranonToisAstrois.name
ltx/en_us_dedes/pe.d078:peMA.Exaposteilarion1.mode	@ltx/en_us_dedes/miscellanea:misc.Mode3
ltx/en_us_dedes/pe.d078:peMA.Exaposteilarion1.text	When you examine fully * My body’s wounds with your own hand, * Thomas, be not disbelieving * in Me who suffered wounds for you. * With the Disciple have one mind * and proclaim Me the living God.
ltx/en_us_dedes/pe.d078:peMA.Exaposteilarion2.greekmelody	@ltx/en_us_dedes/he.a.m3:heAU.OOuranonToisAstrois.greekname
ltx/en_us_dedes/pe.d078:peMA.Exaposteilarion2.incipit	Today it smells like springtime…
ltx/en_us_dedes/pe.d078:peMA.Exaposteilarion2.melody	@ltx/en_us_dedes/he.a.m3:heAU.OOuranonToisAstrois.name
ltx/en_us_dedes/pe.d078:peMA.Exaposteilarion2.mode	@ltx/en_us_dedes/miscellanea:misc.Mode3
ltx/en_us_dedes/pe.d078:peMA.Exaposteilarion2.text	Today it smells like springtime, * and new creation is dancing. * Today the locks are removed * from the doors and the disbelief * of Thomas the friend who cries out, * “You are my Lord and my God.”
ltx/en_us_dedes/pe.d078:peMA.Hypakoe.incipit	@ltx/en_us_dedes/oc.m6.d5:ocMA.Kathisma11.incipit
ltx/en_us_dedes/pe.d078:peMA.Hypakoe.melody	
ltx/en_us_dedes/pe.d078:peMA.Hypakoe.mode	@ltx/en_us_dedes/miscellanea:misc.Mode6
ltx/en_us_dedes/pe.d078:peMA.Hypakoe.text	@ltx/en_us_dedes/oc.m6.d5:ocMA.Kathisma11.text
ltx/en_us_dedes/pe.d078:peMA.Kathisma11.greekmelody	@ltx/en_us_dedes/he.a.m1:heAU.TouLithouSfragisthentos.greekname
ltx/en_us_dedes/pe.d078:peMA.Kathisma11.incipit	For fear of the Jews…
ltx/en_us_dedes/pe.d078:peMA.Kathisma11.melody	@ltx/en_us_dedes/he.a.m1:heAU.TouLithouSfragisthentos.name
ltx/en_us_dedes/pe.d078:peMA.Kathisma11.mode	@ltx/en_us_dedes/miscellanea:misc.Mode1
ltx/en_us_dedes/pe.d078:peMA.Kathisma11.text	For fear of the Jews, the Disciples were in hiding,* having congregated in Zion. You came to them, O Good One,* the doors being shut, and You stood * among them, and You caused them to rejoice.* And You showed them the wounds on Your hands* and immaculate side, saying* unto the disbelieving Disciple,* “Put out your hand and examine Me,* for it is I, who for you became passible.”
ltx/en_us_dedes/pe.d078:peMA.Kathisma21.greekmelody	@ltx/en_us_dedes/he.a.m1:heAU.TonTafonSouSotir.greekname
ltx/en_us_dedes/pe.d078:peMA.Kathisma21.incipit	The doors were shut…
ltx/en_us_dedes/pe.d078:peMA.Kathisma21.melody	@ltx/en_us_dedes/he.a.m1:heAU.TonTafonSouSotir.name
ltx/en_us_dedes/pe.d078:peMA.Kathisma21.mode	@ltx/en_us_dedes/miscellanea:misc.Mode1
ltx/en_us_dedes/pe.d078:peMA.Kathisma21.text	The doors were shut and locked. You appeared to Your hiding * Disciples, as the Life, O my Christ, and You showed them * Your wounded side and hands and feet, * thus confirming Your resurrection* from the sepulcher. However Thomas was absent; * hence he said to them, “If I myself do not see Him, * I will not believe your words.”
ltx/en_us_dedes/pe.d078:peMA.Kathisma31.greekmelody	@ltx/en_us_dedes/he.a.m1:heAU.TonTafonSouSotir.greekname
ltx/en_us_dedes/pe.d078:peMA.Kathisma31.incipit	“Since You have seen…
ltx/en_us_dedes/pe.d078:peMA.Kathisma31.melody	@ltx/en_us_dedes/he.a.m1:heAU.TonTafonSouSotir.name
ltx/en_us_dedes/pe.d078:peMA.Kathisma31.mode	@ltx/en_us_dedes/miscellanea:misc.Mode1
ltx/en_us_dedes/pe.d078:peMA.Kathisma31.text	“Since You have seen my side and the punctures the nails made, * no longer disbelieve in My rising, O Thomas,” * the Lord said when He appeared to His Disciples ineffably, * after He had risen from the tomb on the third day. * Then the Twin believed and cried aloud to the Creator, * “My Lord and my God are You.”
ltx/en_us_dedes/pe.d078:peMA.Kontakion1.incipit	With his scrutinizing right hand…
ltx/en_us_dedes/pe.d078:peMA.Kontakion1.melody	
ltx/en_us_dedes/pe.d078:peMA.Kontakion1.mode	@ltx/en_us_dedes/miscellanea:misc.Mode8
ltx/en_us_dedes/pe.d078:peMA.Kontakion1.text	With his scrutinizing right hand, Thomas examined Your life-bestowing side, O Christ God. When You entered while the doors were shut, he cried out to You with the rest of the Apostles, “You are my Lord and my God.”
ltx/en_us_dedes/pe.d078:peMA.Lauds1.greekmelody	@ltx/en_us_dedes/he.a.m1:heAU.PaneffimoiMartyres.greekname
ltx/en_us_dedes/pe.d078:peMA.Lauds1.incipit	O Giver-of-Life…
ltx/en_us_dedes/pe.d078:peMA.Lauds1.melody	@ltx/en_us_dedes/he.a.m1:heAU.PaneffimoiMartyres.name
ltx/en_us_dedes/pe.d078:peMA.Lauds1.mode	@ltx/en_us_dedes/miscellanea:misc.Mode1
ltx/en_us_dedes/pe.d078:peMA.Lauds1.text	O Giver-of-Life, You did not break * the seals that secured Your tomb. * And likewise after Your awesome rising from the sepulcher, * You unhindered entered * the room where Your glorious * Apostles were, the doors being shut, O Christ, and caused them to rejoice. * And You granted them Your governing* Holy Spirit,* for mercy immeasurable.
ltx/en_us_dedes/pe.d078:peMA.Lauds2.greekmelody	@ltx/en_us_dedes/he.a.m1:heAU.PaneffimoiMartyres.greekname
ltx/en_us_dedes/pe.d078:peMA.Lauds2.incipit	Thomas, who was also called…
ltx/en_us_dedes/pe.d078:peMA.Lauds2.melody	@ltx/en_us_dedes/he.a.m1:heAU.PaneffimoiMartyres.name
ltx/en_us_dedes/pe.d078:peMA.Lauds2.mode	@ltx/en_us_dedes/miscellanea:misc.Mode1
ltx/en_us_dedes/pe.d078:peMA.Lauds2.text	Thomas, who was also called the Twin, * was not there when You appeared * to the Disciples, O Lord, and therefore he did not believe * that You resurrected. * Thus emphatically he cried* aloud to those who saw You, “Unless I put my finger in His side * and the wounds created by the nails, * I will not believe that He indeed arose.”
ltx/en_us_dedes/pe.d078:peMA.Lauds3.greekmelody	@ltx/en_us_dedes/he.a.m1:heAU.PaneffimoiMartyres.greekname
ltx/en_us_dedes/pe.d078:peMA.Lauds3.incipit	“O Thomas, according…
ltx/en_us_dedes/pe.d078:peMA.Lauds3.melody	@ltx/en_us_dedes/he.a.m1:heAU.PaneffimoiMartyres.name
ltx/en_us_dedes/pe.d078:peMA.Lauds3.mode	@ltx/en_us_dedes/miscellanea:misc.Mode1
ltx/en_us_dedes/pe.d078:peMA.Lauds3.text	“O Thomas, according to your wish, * handle Me,” said Christ to him. * “Put out your hand, and be cognizant that I have flesh and bones, * and an earthen body. * Be not one who disbelieves. * But rather with the others be confident.” And he in turn cried out, * “You, O Jesus, are my Lord and God, * and my Savior. * Glory to Your resurrection.”
ltx/en_us_dedes/pe.d078:peMA.LaudsGlory.incipit	Eight days after Your Resurrection…
ltx/en_us_dedes/pe.d078:peMA.LaudsGlory.melody	@ltx/en_us_dedes/miscellanea:misc.Idiomelon
ltx/en_us_dedes/pe.d078:peMA.LaudsGlory.mode	@ltx/en_us_dedes/miscellanea:misc.Mode6
ltx/en_us_dedes/pe.d078:peMA.LaudsGlory.text	Eight days after Your Resurrection, O King Jesus, only-begotten Logos of the Father, You came and stood among Your Disciples, the doors being shut, and You gave them Your peace. Then, to the disbelieving Disciple, You showed the marks of the nails, and You said to him, “Come, touch my hands, take a look at my feet, place your hand in my uncontaminated side.” Then he believed it and cried out to You, “My Lord and my God, glory to You!”
ltx/en_us_dedes/pe.d078:peMA.MM.Lauds123as123.text	@ltx/en_us_dedes/properties:media.key
ltx/en_us_dedes/pe.d078:peMA.MM.Lauds123as345.text	@ltx/en_us_dedes/properties:media.key
ltx/en_us_dedes/pe.d078:peMA.MM.Lauds123as456.text	@ltx/en_us_dedes/properties:media.key
ltx/en_us_dedes/pe.d078:peMA.MM.Prokeimenon.text	@ltx/en_us_dedes/properties:media.key
ltx/en_us_dedes/pe.d078:peMA.Ode1C11.greekmelody	@ltx/en_us_dedes/he.h.m1:heHE.AsomenPantesLaoi.greekname
ltx/en_us_dedes/pe.d078:peMA.Ode1C11.incipit	…
ltx/en_us_dedes/pe.d078:peMA.Ode1C11.melody	@ltx/en_us_dedes/he.h.m1:heHE.AsomenPantesLaoi.name
ltx/en_us_dedes/pe.d078:peMA.Ode1C11.mode	@ltx/en_us_dedes/miscellanea:misc.Mode1
ltx/en_us_dedes/pe.d078:peMA.Ode1C11.ode	@ltx/en_us_dedes/miscellanea:misc.Ode1
ltx/en_us_dedes/pe.d078:peMA.Ode1C11.text	
ltx/en_us_dedes/pe.d078:peMA.Ode1C12.incipit	…
ltx/en_us_dedes/pe.d078:peMA.Ode1C12.melody	@ltx/en_us_dedes/he.h.m1:heHE.AsomenPantesLaoi.name
ltx/en_us_dedes/pe.d078:peMA.Ode1C12.mode	@ltx/en_us_dedes/miscellanea:misc.Mode1
ltx/en_us_dedes/pe.d078:peMA.Ode1C12.ode	@ltx/en_us_dedes/miscellanea:misc.Ode1
ltx/en_us_dedes/pe.d078:peMA.Ode1C12.text	
ltx/en_us_dedes/pe.d078:peMA.Ode1C13.incipit	…
ltx/en_us_dedes/pe.d078:peMA.Ode1C13.melody	@ltx/en_us_dedes/he.h.m1:heHE.AsomenPantesLaoi.name
ltx/en_us_dedes/pe.d078:peMA.Ode1C13.mode	@ltx/en_us_dedes/miscellanea:misc.Mode1
ltx/en_us_dedes/pe.d078:peMA.Ode1C13.ode	@ltx/en_us_dedes/miscellanea:misc.Ode1
ltx/en_us_dedes/pe.d078:peMA.Ode1C13.text	
ltx/en_us_dedes/pe.d078:peMA.Ode1C1H.greekmelody	@ltx/en_us_dedes/he.h.m1:heHE.AsomenPantesLaoi.greekname
ltx/en_us_dedes/pe.d078:peMA.Ode1C1H.incipit	@ltx/en_us_dedes/he.h.m1:heHE.AsomenPantesLaoi.incipit
ltx/en_us_dedes/pe.d078:peMA.Ode1C1H.melody	@ltx/en_us_dedes/he.h.m1:heHE.AsomenPantesLaoi.melody
ltx/en_us_dedes/pe.d078:peMA.Ode1C1H.mode	@ltx/en_us_dedes/miscellanea:misc.Mode1
ltx/en_us_dedes/pe.d078:peMA.Ode1C1H.ode	@ltx/en_us_dedes/miscellanea:misc.Ode1
ltx/en_us_dedes/pe.d078:peMA.Ode1C1H.text	@ltx/en_us_dedes/he.h.m1:heHE.AsomenPantesLaoi.text
ltx/en_us_dedes/pe.d078:peMA.Ode3C11.greekmelody	@ltx/en_us_dedes/he.h.m1:heHE.StereosonMeChriste.greekname
ltx/en_us_dedes/pe.d078:peMA.Ode3C11.incipit	…
ltx/en_us_dedes/pe.d078:peMA.Ode3C11.melody	@ltx/en_us_dedes/he.h.m1:heHE.StereosonMeChriste.name
ltx/en_us_dedes/pe.d078:peMA.Ode3C11.mode	@ltx/en_us_dedes/miscellanea:misc.Mode1
ltx/en_us_dedes/pe.d078:peMA.Ode3C11.ode	@ltx/en_us_dedes/miscellanea:misc.Ode3
ltx/en_us_dedes/pe.d078:peMA.Ode3C11.text	
ltx/en_us_dedes/pe.d078:peMA.Ode3C12.incipit	…
ltx/en_us_dedes/pe.d078:peMA.Ode3C12.melody	@ltx/en_us_dedes/he.h.m1:heHE.StereosonMeChriste.name
ltx/en_us_dedes/pe.d078:peMA.Ode3C12.mode	@ltx/en_us_dedes/miscellanea:misc.Mode1
ltx/en_us_dedes/pe.d078:peMA.Ode3C12.ode	@ltx/en_us_dedes/miscellanea:misc.Ode3
ltx/en_us_dedes/pe.d078:peMA.Ode3C12.text	
ltx/en_us_dedes/pe.d078:peMA.Ode3C13.incipit	…
ltx/en_us_dedes/pe.d078:peMA.Ode3C13.melody	@ltx/en_us_dedes/he.h.m1:heHE.StereosonMeChriste.name
ltx/en_us_dedes/pe.d078:peMA.Ode3C13.mode	@ltx/en_us_dedes/miscellanea:misc.Mode1
ltx/en_us_dedes/pe.d078:peMA.Ode3C13.ode	@ltx/en_us_dedes/miscellanea:misc.Ode3
ltx/en_us_dedes/pe.d078:peMA.Ode3C13.text	
ltx/en_us_dedes/pe.d078:peMA.Ode3C1H.greekmelody	@ltx/en_us_dedes/he.h.m1:heHE.StereosonMeChriste.greekname
ltx/en_us_dedes/pe.d078:peMA.Ode3C1H.incipit	@ltx/en_us_dedes/he.h.m1:heHE.StereosonMeChriste.incipit
ltx/en_us_dedes/pe.d078:peMA.Ode3C1H.melody	@ltx/en_us_dedes/he.h.m1:heHE.StereosonMeChriste.melody
ltx/en_us_dedes/pe.d078:peMA.Ode3C1H.mode	@ltx/en_us_dedes/miscellanea:misc.Mode1
ltx/en_us_dedes/pe.d078:peMA.Ode3C1H.ode	@ltx/en_us_dedes/miscellanea:misc.Ode3
ltx/en_us_dedes/pe.d078:peMA.Ode3C1H.text	@ltx/en_us_dedes/he.h.m1:heHE.StereosonMeChriste.text
ltx/en_us_dedes/pe.d078:peMA.Ode4C11.greekmelody	@ltx/en_us_dedes/he.h.m1:heHE.MegaToMystirion.greekname
ltx/en_us_dedes/pe.d078:peMA.Ode4C11.incipit	…
ltx/en_us_dedes/pe.d078:peMA.Ode4C11.melody	@ltx/en_us_dedes/he.h.m1:heHE.MegaToMystirion.name
ltx/en_us_dedes/pe.d078:peMA.Ode4C11.mode	@ltx/en_us_dedes/miscellanea:misc.Mode1
ltx/en_us_dedes/pe.d078:peMA.Ode4C11.ode	@ltx/en_us_dedes/miscellanea:misc.Ode4
ltx/en_us_dedes/pe.d078:peMA.Ode4C11.text	
ltx/en_us_dedes/pe.d078:peMA.Ode4C12.incipit	…
ltx/en_us_dedes/pe.d078:peMA.Ode4C12.melody	@ltx/en_us_dedes/he.h.m1:heHE.MegaToMystirion.name
ltx/en_us_dedes/pe.d078:peMA.Ode4C12.mode	@ltx/en_us_dedes/miscellanea:misc.Mode1
ltx/en_us_dedes/pe.d078:peMA.Ode4C12.ode	@ltx/en_us_dedes/miscellanea:misc.Ode4
ltx/en_us_dedes/pe.d078:peMA.Ode4C12.text	
ltx/en_us_dedes/pe.d078:peMA.Ode4C13.incipit	…
ltx/en_us_dedes/pe.d078:peMA.Ode4C13.melody	@ltx/en_us_dedes/he.h.m1:heHE.MegaToMystirion.name
ltx/en_us_dedes/pe.d078:peMA.Ode4C13.mode	@ltx/en_us_dedes/miscellanea:misc.Mode1
ltx/en_us_dedes/pe.d078:peMA.Ode4C13.ode	@ltx/en_us_dedes/miscellanea:misc.Ode4
ltx/en_us_dedes/pe.d078:peMA.Ode4C13.text	
ltx/en_us_dedes/pe.d078:peMA.Ode4C14.incipit	…
ltx/en_us_dedes/pe.d078:peMA.Ode4C14.melody	@ltx/en_us_dedes/he.h.m1:heHE.MegaToMystirion.name
ltx/en_us_dedes/pe.d078:peMA.Ode4C14.mode	@ltx/en_us_dedes/miscellanea:misc.Mode1
ltx/en_us_dedes/pe.d078:peMA.Ode4C14.ode	@ltx/en_us_dedes/miscellanea:misc.Ode4
ltx/en_us_dedes/pe.d078:peMA.Ode4C14.text	
ltx/en_us_dedes/pe.d078:peMA.Ode4C1H.greekmelody	@ltx/en_us_dedes/he.h.m1:heHE.MegaToMystirion.greekname
ltx/en_us_dedes/pe.d078:peMA.Ode4C1H.incipit	@ltx/en_us_dedes/he.h.m1:heHE.MegaToMystirion.incipit
ltx/en_us_dedes/pe.d078:peMA.Ode4C1H.melody	@ltx/en_us_dedes/he.h.m1:heHE.MegaToMystirion.melody
ltx/en_us_dedes/pe.d078:peMA.Ode4C1H.mode	@ltx/en_us_dedes/miscellanea:misc.Mode1
ltx/en_us_dedes/pe.d078:peMA.Ode4C1H.ode	@ltx/en_us_dedes/miscellanea:misc.Ode4
ltx/en_us_dedes/pe.d078:peMA.Ode4C1H.text	@ltx/en_us_dedes/he.h.m1:heHE.MegaToMystirion.text
ltx/en_us_dedes/pe.d078:peMA.Ode5C11.greekmelody	@ltx/en_us_dedes/he.h.m1:heHE.EkNyktosOrthrizontesYmnoumenSe.greekname
ltx/en_us_dedes/pe.d078:peMA.Ode5C11.incipit	…
ltx/en_us_dedes/pe.d078:peMA.Ode5C11.melody	@ltx/en_us_dedes/he.h.m1:heHE.EkNyktosOrthrizontesYmnoumenSe.name
ltx/en_us_dedes/pe.d078:peMA.Ode5C11.mode	@ltx/en_us_dedes/miscellanea:misc.Mode1
ltx/en_us_dedes/pe.d078:peMA.Ode5C11.ode	@ltx/en_us_dedes/miscellanea:misc.Ode5
ltx/en_us_dedes/pe.d078:peMA.Ode5C11.text	
ltx/en_us_dedes/pe.d078:peMA.Ode5C12.incipit	…
ltx/en_us_dedes/pe.d078:peMA.Ode5C12.melody	@ltx/en_us_dedes/he.h.m1:heHE.EkNyktosOrthrizontesYmnoumenSe.name
ltx/en_us_dedes/pe.d078:peMA.Ode5C12.mode	@ltx/en_us_dedes/miscellanea:misc.Mode1
ltx/en_us_dedes/pe.d078:peMA.Ode5C12.ode	@ltx/en_us_dedes/miscellanea:misc.Ode5
ltx/en_us_dedes/pe.d078:peMA.Ode5C12.text	
ltx/en_us_dedes/pe.d078:peMA.Ode5C13.incipit	…
ltx/en_us_dedes/pe.d078:peMA.Ode5C13.melody	@ltx/en_us_dedes/he.h.m1:heHE.EkNyktosOrthrizontesYmnoumenSe.name
ltx/en_us_dedes/pe.d078:peMA.Ode5C13.mode	@ltx/en_us_dedes/miscellanea:misc.Mode1
ltx/en_us_dedes/pe.d078:peMA.Ode5C13.ode	@ltx/en_us_dedes/miscellanea:misc.Ode5
ltx/en_us_dedes/pe.d078:peMA.Ode5C13.text	
ltx/en_us_dedes/pe.d078:peMA.Ode5C1H.greekmelody	@ltx/en_us_dedes/he.h.m1:heHE.EkNyktosOrthrizontesYmnoumenSe.greekname
ltx/en_us_dedes/pe.d078:peMA.Ode5C1H.incipit	@ltx/en_us_dedes/he.h.m1:heHE.EkNyktosOrthrizontesYmnoumenSe.incipit
ltx/en_us_dedes/pe.d078:peMA.Ode5C1H.melody	@ltx/en_us_dedes/he.h.m1:heHE.EkNyktosOrthrizontesYmnoumenSe.melody
ltx/en_us_dedes/pe.d078:peMA.Ode5C1H.mode	@ltx/en_us_dedes/miscellanea:misc.Mode1
ltx/en_us_dedes/pe.d078:peMA.Ode5C1H.ode	@ltx/en_us_dedes/miscellanea:misc.Ode5
ltx/en_us_dedes/pe.d078:peMA.Ode5C1H.text	@ltx/en_us_dedes/he.h.m1:heHE.EkNyktosOrthrizontesYmnoumenSe.text
ltx/en_us_dedes/pe.d078:peMA.Ode6C11.greekmelody	@ltx/en_us_dedes/he.h.m1:heHE.TonProfitinDiesosas.greekname
ltx/en_us_dedes/pe.d078:peMA.Ode6C11.incipit	…
ltx/en_us_dedes/pe.d078:peMA.Ode6C11.melody	@ltx/en_us_dedes/he.h.m1:heHE.TonProfitinDiesosas.name
ltx/en_us_dedes/pe.d078:peMA.Ode6C11.mode	@ltx/en_us_dedes/miscellanea:misc.Mode1
ltx/en_us_dedes/pe.d078:peMA.Ode6C11.ode	@ltx/en_us_dedes/miscellanea:misc.Ode6
ltx/en_us_dedes/pe.d078:peMA.Ode6C11.text	
ltx/en_us_dedes/pe.d078:peMA.Ode6C12.incipit	…
ltx/en_us_dedes/pe.d078:peMA.Ode6C12.melody	@ltx/en_us_dedes/he.h.m1:heHE.TonProfitinDiesosas.name
ltx/en_us_dedes/pe.d078:peMA.Ode6C12.mode	@ltx/en_us_dedes/miscellanea:misc.Mode1
ltx/en_us_dedes/pe.d078:peMA.Ode6C12.ode	@ltx/en_us_dedes/miscellanea:misc.Ode6
ltx/en_us_dedes/pe.d078:peMA.Ode6C12.text	
ltx/en_us_dedes/pe.d078:peMA.Ode6C13.incipit	…
ltx/en_us_dedes/pe.d078:peMA.Ode6C13.melody	@ltx/en_us_dedes/he.h.m1:heHE.TonProfitinDiesosas.name
ltx/en_us_dedes/pe.d078:peMA.Ode6C13.mode	@ltx/en_us_dedes/miscellanea:misc.Mode1
ltx/en_us_dedes/pe.d078:peMA.Ode6C13.ode	@ltx/en_us_dedes/miscellanea:misc.Ode6
ltx/en_us_dedes/pe.d078:peMA.Ode6C13.text	
ltx/en_us_dedes/pe.d078:peMA.Ode6C1H.greekmelody	@ltx/en_us_dedes/he.h.m1:heHE.TonProfitinDiesosas.greekname
ltx/en_us_dedes/pe.d078:peMA.Ode6C1H.incipit	@ltx/en_us_dedes/he.h.m1:heHE.TonProfitinDiesosas.incipit
ltx/en_us_dedes/pe.d078:peMA.Ode6C1H.melody	@ltx/en_us_dedes/he.h.m1:heHE.TonProfitinDiesosas.melody
ltx/en_us_dedes/pe.d078:peMA.Ode6C1H.mode	@ltx/en_us_dedes/miscellanea:misc.Mode1
ltx/en_us_dedes/pe.d078:peMA.Ode6C1H.ode	@ltx/en_us_dedes/miscellanea:misc.Ode6
ltx/en_us_dedes/pe.d078:peMA.Ode6C1H.text	@ltx/en_us_dedes/he.h.m1:heHE.TonProfitinDiesosas.text
ltx/en_us_dedes/pe.d078:peMA.Ode7C11.greekmelody	@ltx/en_us_dedes/he.h.m1:heHE.EikoniLatrevein.greekname
ltx/en_us_dedes/pe.d078:peMA.Ode7C11.incipit	…
ltx/en_us_dedes/pe.d078:peMA.Ode7C11.melody	@ltx/en_us_dedes/he.h.m1:heHE.EikoniLatrevein.name
ltx/en_us_dedes/pe.d078:peMA.Ode7C11.mode	@ltx/en_us_dedes/miscellanea:misc.Mode1
ltx/en_us_dedes/pe.d078:peMA.Ode7C11.ode	@ltx/en_us_dedes/miscellanea:misc.Ode7
ltx/en_us_dedes/pe.d078:peMA.Ode7C11.text	
ltx/en_us_dedes/pe.d078:peMA.Ode7C12.incipit	…
ltx/en_us_dedes/pe.d078:peMA.Ode7C12.melody	@ltx/en_us_dedes/he.h.m1:heHE.EikoniLatrevein.name
ltx/en_us_dedes/pe.d078:peMA.Ode7C12.mode	@ltx/en_us_dedes/miscellanea:misc.Mode1
ltx/en_us_dedes/pe.d078:peMA.Ode7C12.ode	@ltx/en_us_dedes/miscellanea:misc.Ode7
ltx/en_us_dedes/pe.d078:peMA.Ode7C12.text	
ltx/en_us_dedes/pe.d078:peMA.Ode7C13.incipit	…
ltx/en_us_dedes/pe.d078:peMA.Ode7C13.melody	@ltx/en_us_dedes/he.h.m1:heHE.EikoniLatrevein.name
ltx/en_us_dedes/pe.d078:peMA.Ode7C13.mode	@ltx/en_us_dedes/miscellanea:misc.Mode1
ltx/en_us_dedes/pe.d078:peMA.Ode7C13.ode	@ltx/en_us_dedes/miscellanea:misc.Ode7
ltx/en_us_dedes/pe.d078:peMA.Ode7C13.text	
ltx/en_us_dedes/pe.d078:peMA.Ode7C14.incipit	…
ltx/en_us_dedes/pe.d078:peMA.Ode7C14.melody	@ltx/en_us_dedes/he.h.m1:heHE.EikoniLatrevein.name
ltx/en_us_dedes/pe.d078:peMA.Ode7C14.mode	@ltx/en_us_dedes/miscellanea:misc.Mode1
ltx/en_us_dedes/pe.d078:peMA.Ode7C14.ode	@ltx/en_us_dedes/miscellanea:misc.Ode7
ltx/en_us_dedes/pe.d078:peMA.Ode7C14.text	
ltx/en_us_dedes/pe.d078:peMA.Ode7C1H.greekmelody	@ltx/en_us_dedes/he.h.m1:heHE.EikoniLatrevein.greekname
ltx/en_us_dedes/pe.d078:peMA.Ode7C1H.incipit	@ltx/en_us_dedes/he.h.m1:heHE.EikoniLatrevein.incipit
ltx/en_us_dedes/pe.d078:peMA.Ode7C1H.melody	@ltx/en_us_dedes/he.h.m1:heHE.EikoniLatrevein.melody
ltx/en_us_dedes/pe.d078:peMA.Ode7C1H.mode	@ltx/en_us_dedes/miscellanea:misc.Mode1
ltx/en_us_dedes/pe.d078:peMA.Ode7C1H.ode	@ltx/en_us_dedes/miscellanea:misc.Ode7
ltx/en_us_dedes/pe.d078:peMA.Ode7C1H.text	@ltx/en_us_dedes/he.h.m1:heHE.EikoniLatrevein.text
ltx/en_us_dedes/pe.d078:peMA.Ode8C11.greekmelody	@ltx/en_us_dedes/he.h.m1:heHE.TonEnFlogiPyros.greekname
ltx/en_us_dedes/pe.d078:peMA.Ode8C11.incipit	…
ltx/en_us_dedes/pe.d078:peMA.Ode8C11.melody	@ltx/en_us_dedes/he.h.m1:heHE.TonEnFlogiPyros.name
ltx/en_us_dedes/pe.d078:peMA.Ode8C11.mode	@ltx/en_us_dedes/miscellanea:misc.Mode1
ltx/en_us_dedes/pe.d078:peMA.Ode8C11.ode	@ltx/en_us_dedes/miscellanea:misc.Ode8
ltx/en_us_dedes/pe.d078:peMA.Ode8C11.text	
ltx/en_us_dedes/pe.d078:peMA.Ode8C12.incipit	…
ltx/en_us_dedes/pe.d078:peMA.Ode8C12.melody	@ltx/en_us_dedes/he.h.m1:heHE.TonEnFlogiPyros.name
ltx/en_us_dedes/pe.d078:peMA.Ode8C12.mode	@ltx/en_us_dedes/miscellanea:misc.Mode1
ltx/en_us_dedes/pe.d078:peMA.Ode8C12.ode	@ltx/en_us_dedes/miscellanea:misc.Ode8
ltx/en_us_dedes/pe.d078:peMA.Ode8C12.text	
ltx/en_us_dedes/pe.d078:peMA.Ode8C13.incipit	…
ltx/en_us_dedes/pe.d078:peMA.Ode8C13.melody	@ltx/en_us_dedes/he.h.m1:heHE.TonEnFlogiPyros.name
ltx/en_us_dedes/pe.d078:peMA.Ode8C13.mode	@ltx/en_us_dedes/miscellanea:misc.Mode1
ltx/en_us_dedes/pe.d078:peMA.Ode8C13.ode	@ltx/en_us_dedes/miscellanea:misc.Ode8
ltx/en_us_dedes/pe.d078:peMA.Ode8C13.text	
ltx/en_us_dedes/pe.d078:peMA.Ode8C1H.greekmelody	@ltx/en_us_dedes/he.h.m1:heHE.TonEnFlogiPyros.greekname
ltx/en_us_dedes/pe.d078:peMA.Ode8C1H.incipit	@ltx/en_us_dedes/he.h.m1:heHE.TonEnFlogiPyros.incipit
ltx/en_us_dedes/pe.d078:peMA.Ode8C1H.melody	@ltx/en_us_dedes/he.h.m1:heHE.TonEnFlogiPyros.melody
ltx/en_us_dedes/pe.d078:peMA.Ode8C1H.mode	@ltx/en_us_dedes/miscellanea:misc.Mode1
ltx/en_us_dedes/pe.d078:peMA.Ode8C1H.ode	@ltx/en_us_dedes/miscellanea:misc.Ode8
ltx/en_us_dedes/pe.d078:peMA.Ode8C1H.text	@ltx/en_us_dedes/he.h.m1:heHE.TonEnFlogiPyros.text
ltx/en_us_dedes/pe.d078:peMA.Ode9C11.greekmelody	@ltx/en_us_dedes/he.h.m1:heHE.SeTinFaeinin.greekname
ltx/en_us_dedes/pe.d078:peMA.Ode9C11.incipit	This is now Your brightly…
ltx/en_us_dedes/pe.d078:peMA.Ode9C11.melody	@ltx/en_us_dedes/he.h.m1:heHE.SeTinFaeinin.name
ltx/en_us_dedes/pe.d078:peMA.Ode9C11.mode	@ltx/en_us_dedes/miscellanea:misc.Mode1
ltx/en_us_dedes/pe.d078:peMA.Ode9C11.ode	@ltx/en_us_dedes/miscellanea:misc.Ode9
ltx/en_us_dedes/pe.d078:peMA.Ode9C11.text	This is now Your brightly shining and most splendid day, O Christ, * the grace that is full of light; * on this day You appeared to Your Disciples * very handsome, and we magnify it.
ltx/en_us_dedes/pe.d078:peMA.Ode9C12.incipit	You allowed a hand…
ltx/en_us_dedes/pe.d078:peMA.Ode9C12.melody	@ltx/en_us_dedes/he.h.m1:heHE.SeTinFaeinin.name
ltx/en_us_dedes/pe.d078:peMA.Ode9C12.mode	@ltx/en_us_dedes/miscellanea:misc.Mode1
ltx/en_us_dedes/pe.d078:peMA.Ode9C12.ode	@ltx/en_us_dedes/miscellanea:misc.Ode9
ltx/en_us_dedes/pe.d078:peMA.Ode9C12.text	You allowed a hand of flesh to touch Your side, and scorched it not * with the fire immaterial of divine essence. * We sing Your praise and magnify You.
ltx/en_us_dedes/pe.d078:peMA.Ode9C13.incipit	You arose from the grave…
ltx/en_us_dedes/pe.d078:peMA.Ode9C13.melody	@ltx/en_us_dedes/he.h.m1:heHE.SeTinFaeinin.name
ltx/en_us_dedes/pe.d078:peMA.Ode9C13.mode	@ltx/en_us_dedes/miscellanea:misc.Mode1
ltx/en_us_dedes/pe.d078:peMA.Ode9C13.ode	@ltx/en_us_dedes/miscellanea:misc.Ode9
ltx/en_us_dedes/pe.d078:peMA.Ode9C13.text	You arose from the grave as God, O Christ.* We have not seen it with our eyes, but we believe it in our hearts with love and longing.* We sing Your praise and magnify You.
ltx/en_us_dedes/pe.d078:peMA.Ode9C1H.greekmelody	@ltx/en_us_dedes/he.h.m1:heHE.SeTinFaeinin.greekname
ltx/en_us_dedes/pe.d078:peMA.Ode9C1H.incipit	@ltx/en_us_dedes/he.h.m1:heHE.SeTinFaeinin.incipit
ltx/en_us_dedes/pe.d078:peMA.Ode9C1H.melody	@ltx/en_us_dedes/he.h.m1:heHE.SeTinFaeinin.melody
ltx/en_us_dedes/pe.d078:peMA.Ode9C1H.mode	@ltx/en_us_dedes/miscellanea:misc.Mode1
ltx/en_us_dedes/pe.d078:peMA.Ode9C1H.ode	@ltx/en_us_dedes/miscellanea:misc.Ode9
ltx/en_us_dedes/pe.d078:peMA.Ode9C1H.text	@ltx/en_us_dedes/he.h.m1:heHE.SeTinFaeinin.text
ltx/en_us_dedes/pe.d078:peMA.Oikos1.text	Who kept the Disciple’s hand from being burnt up, when it approached the fiery side of the Lord? Who gave it the daring, and it was able to touch the flaming bone? By all means, it was the very side that was touched. For had not the side empowered the right hand of clay, how could it have touched the wounds that shook the world above and below? This grace was given to Thomas, to be able to touch it and to cry out to Christ, “You are my Lord and my God.”
ltx/en_us_dedes/pe.d078:peMA.PostGospelBoth.incipit	@ltx/en_us_dedes/ho.ho03:hoMA.PostGospelTheotokos.incipit
ltx/en_us_dedes/pe.d078:peMA.PostGospelBoth.melody	
ltx/en_us_dedes/pe.d078:peMA.PostGospelBoth.mode	@ltx/en_us_dedes/miscellanea:misc.Mode2
ltx/en_us_dedes/pe.d078:peMA.PostGospelBoth.text	@ltx/en_us_dedes/ho.ho03:hoMA.PostGospelTheotokos.text
ltx/en_us_dedes/pe.d078:peMA.PostGospelGlory.incipit	@ltx/en_us_dedes/ho.ho03:hoMA.PostGospelApostles.incipit
ltx/en_us_dedes/pe.d078:peMA.PostGospelGlory.melody	
ltx/en_us_dedes/pe.d078:peMA.PostGospelGlory.mode	@ltx/en_us_dedes/miscellanea:misc.Mode2
ltx/en_us_dedes/pe.d078:peMA.PostGospelGlory.text	@ltx/en_us_dedes/ho.ho03:hoMA.PostGospelApostles.text
ltx/en_us_dedes/pe.d078:peMA.PostGospelIdiomelon.incipit	@ltx/en_us_dedes/ho.ho03:hoMA.SunPostGospelIdiomelon.incipit
ltx/en_us_dedes/pe.d078:peMA.PostGospelIdiomelon.melody	@ltx/en_us_dedes/miscellanea:misc.Idiomelon
ltx/en_us_dedes/pe.d078:peMA.PostGospelIdiomelon.mode	@ltx/en_us_dedes/miscellanea:misc.Mode2
ltx/en_us_dedes/pe.d078:peMA.PostGospelIdiomelon.text	@ltx/en_us_dedes/ho.ho03:hoMA.SunPostGospelIdiomelon.text
ltx/en_us_dedes/pe.d078:peSV.AposGlory.incipit	…
ltx/en_us_dedes/pe.d078:peSV.AposGlory.melody	@ltx/en_us_dedes/he.a.m2:heAU.OikosTouEfratha.name
ltx/en_us_dedes/pe.d078:peSV.AposGlory.mode	@ltx/en_us_dedes/miscellanea:misc.Mode2
ltx/en_us_dedes/pe.d078:peSV.AposGlory.text	
ltx/en_us_dedes/pe.d078:peSV.Aposticha1.incipit	Joining the Angels…
ltx/en_us_dedes/pe.d078:peSV.Aposticha1.melody	@ltx/en_us_dedes/he.a.m2:heAU.OikosTouEfratha.name
ltx/en_us_dedes/pe.d078:peSV.Aposticha1.mode	@ltx/en_us_dedes/miscellanea:misc.Mode2
ltx/en_us_dedes/pe.d078:peSV.Aposticha1.text	Joining the Angels, come, * O human beings, with pure lips * extol Him who has risen * from the tomb on the third day * and with himself has raised the world.
ltx/en_us_dedes/pe.d078:peSV.Aposticha2.incipit	Though the doors were locked…
ltx/en_us_dedes/pe.d078:peSV.Aposticha2.melody	@ltx/en_us_dedes/he.a.m2:heAU.OikosTouEfratha.name
ltx/en_us_dedes/pe.d078:peSV.Aposticha2.mode	@ltx/en_us_dedes/miscellanea:misc.Mode2
ltx/en_us_dedes/pe.d078:peSV.Aposticha2.text	Though the doors were locked shut, * You appeared to Your sacred * Apostles, O our Savior, * renewing Your divine Holy Spirit in us through them.
ltx/en_us_dedes/pe.d078:peSV.Aposticha3.incipit	Seeing You, not with eyes…
ltx/en_us_dedes/pe.d078:peSV.Aposticha3.melody	@ltx/en_us_dedes/he.a.m2:heAU.OikosTouEfratha.name
ltx/en_us_dedes/pe.d078:peSV.Aposticha3.mode	@ltx/en_us_dedes/miscellanea:misc.Mode2
ltx/en_us_dedes/pe.d078:peSV.Aposticha3.text	Seeing You, not with eyes * but with our heart’s deep longing, * and verily believing * that You are God, we praise You * and magnify You, King of all.
ltx/en_us_dedes/pe.d078:peSV.SticGlory.incipit	…
ltx/en_us_dedes/pe.d078:peSV.SticGlory.melody	@ltx/en_us_dedes/miscellanea:misc.Idiomelon
ltx/en_us_dedes/pe.d078:peSV.SticGlory.mode	@ltx/en_us_dedes/miscellanea:misc.Mode2
ltx/en_us_dedes/pe.d078:peSV.SticGlory.text	
ltx/en_us_dedes/pe.d078:peSV.Stichera1.incipit	…
ltx/en_us_dedes/pe.d078:peSV.Stichera1.melody	@ltx/en_us_dedes/he.a.m1:heAU.TonOuranionTagmaton.name
ltx/en_us_dedes/pe.d078:peSV.Stichera1.mode	@ltx/en_us_dedes/miscellanea:misc.Mode1
ltx/en_us_dedes/pe.d078:peSV.Stichera1.text	
ltx/en_us_dedes/pe.d078:peSV.Stichera2.incipit	The disbelief of St. Thomas…
ltx/en_us_dedes/pe.d078:peSV.Stichera2.melody	@ltx/en_us_dedes/he.a.m1:heAU.TonOuranionTagmaton.name
ltx/en_us_dedes/pe.d078:peSV.Stichera2.mode	@ltx/en_us_dedes/miscellanea:misc.Mode1
ltx/en_us_dedes/pe.d078:peSV.Stichera2.text	The disbelief of St. Thomas in fact confirms the truth * that Christ is truly risen * from the caverns of Hades * as God and man and Logos. More daring than this, * with his hand Thomas scrutinized * the Savior’s wounds and the marks on His hands and feet, * and by this he has assured the world.
ltx/en_us_dedes/pe.d078:peSV.Stichera3.incipit	…
ltx/en_us_dedes/pe.d078:peSV.Stichera3.melody	@ltx/en_us_dedes/he.a.m1:heAU.TonOuranionTagmaton.name
ltx/en_us_dedes/pe.d078:peSV.Stichera3.mode	@ltx/en_us_dedes/miscellanea:misc.Mode1
ltx/en_us_dedes/pe.d078:peSV.Stichera3.text	
ltx/en_us_dedes/pe.d078:peSY.commemoration.couplet1.title	@ltx/en_us_dedes/titles:ti.Verses
ltx/en_us_dedes/pe.d078:peSY.commemoration.couplet1.verse1	Locks of neither womb nor tomb impede You.
ltx/en_us_dedes/pe.d078:peSY.commemoration.couplet1.verse2	So how should door locks impede Your entry, O Savior?
ltx/en_us_dedes/pe.d078:peSY.commemoration.narration.p01	[paragraph 01]
ltx/en_us_dedes/pe.d078:peSY.commemoration.narration.p02	[paragraph 02]
ltx/en_us_dedes/pe.d078:peSY.commemoration.narration.p03	[paragraph 03]
ltx/en_us_dedes/pe.d078:peSY.commemoration.narration.p04	[paragraph 04]
ltx/en_us_dedes/pe.d078:peSY.commemoration.narration.p05	[paragraph 05]
ltx/en_us_dedes/pe.d078:peSY.commemoration.narration.p06	[paragraph 06]
ltx/en_us_dedes/pe.d078:peSY.commemoration.narration.p07	[paragraph 07]
ltx/en_us_dedes/pe.d078:peSY.commemoration.text	On this day, the second Sunday of Pascha, we celebrate the dedication of Christ’s Resurrection, and St. Thomas’ handling of the Lord’s body.
ltx/en_us_dedes/pe.d078:peSY.lastline	By the intercessions of Thomas Your Apostle, O Christ our God, have mercy on us. Amen.
ltx/en_us_dedes/pe.d078:peVE.Apolytikion1.incipit	@ltx/en_us_dedes/oc.m7.d1:ocMA.Kathisma21.incipit
ltx/en_us_dedes/pe.d078:peVE.Apolytikion1.melody	
ltx/en_us_dedes/pe.d078:peVE.Apolytikion1.mode	@ltx/en_us_dedes/miscellanea:misc.Mode7
ltx/en_us_dedes/pe.d078:peVE.Apolytikion1.text	@ltx/en_us_dedes/oc.m7.d1:ocMA.Kathisma21.text
ltx/en_us_dedes/pe.d078:peVE.AposGlory.incipit	O Lord who loves humanity…
ltx/en_us_dedes/pe.d078:peVE.AposGlory.melody	@ltx/en_us_dedes/miscellanea:misc.Idiomelon
ltx/en_us_dedes/pe.d078:peVE.AposGlory.mode	@ltx/en_us_dedes/miscellanea:misc.Mode5
ltx/en_us_dedes/pe.d078:peVE.AposGlory.text	O Lord who loves humanity, great and incomparable is the abundance of Your compassion. You endured with such forbearance, as You were struck by Jews, as You were touched by Your Apostle, and as those who rejected You were obsessed with You. How did You become incarnate? How could You, the sinless One, be crucified? But we pray You give us the sense to join Thomas in saying to You, “My Lord and my God, glory to You!”
ltx/en_us_dedes/pe.d078:peVE.Aposticha1.incipit	Marvel at this miraculous paradox:…
ltx/en_us_dedes/pe.d078:peVE.Aposticha1.melody	@ltx/en_us_dedes/miscellanea:misc.Idiomelon
ltx/en_us_dedes/pe.d078:peVE.Aposticha1.mode	@ltx/en_us_dedes/miscellanea:misc.Mode4
ltx/en_us_dedes/pe.d078:peVE.Aposticha1.text	Marvel at this miraculous paradox: disbelief engendered firm belief. Thomas had said, “Unless I see, I will not believe.” Then, when he touched the Lord’s side, he acknowledged His divinity, as the incarnate Son of God; he recognized Him as the one who had suffered in the flesh; and he proclaimed Him to be God, risen from the dead. And with a ringing voice he cried aloud, “My Lord and my God, glory to You!”
ltx/en_us_dedes/pe.d078:peVE.Aposticha2.incipit	Marvel at this… grass touched…
ltx/en_us_dedes/pe.d078:peVE.Aposticha2.melody	@ltx/en_us_dedes/miscellanea:misc.Idiomelon
ltx/en_us_dedes/pe.d078:peVE.Aposticha2.mode	@ltx/en_us_dedes/miscellanea:misc.Mode4
ltx/en_us_dedes/pe.d078:peVE.Aposticha2.text	Marvel at this miraculous paradox: grass touched fire and survived. Thomas put his hand in the fiery side of Jesus Christ our God, and touching it did not burn him up. He ardently changed his soul’s disbelief into firm conviction; and out of the depths of his soul he cried to Him, “You are my Lord and God, who rose from the dead! Glory to You!”
ltx/en_us_dedes/pe.d078:peVE.Aposticha3.incipit	Marvel at this… John rested…
ltx/en_us_dedes/pe.d078:peVE.Aposticha3.melody	@ltx/en_us_dedes/miscellanea:misc.Idiomelon
ltx/en_us_dedes/pe.d078:peVE.Aposticha3.mode	@ltx/en_us_dedes/miscellanea:misc.Mode4
ltx/en_us_dedes/pe.d078:peVE.Aposticha3.text	Marvel at this miraculous paradox: John rested his head on the chest of the Logos, and Thomas was allowed to touch His side. But while the one imbibes God’s eternal plan from that ocean of theology mystically, the other is compelled to disclose the mystery to us openly, as he exposes the proofs of the Lord’s resurrection, and he cries aloud, “My Lord and my God, glory to You!”
ltx/en_us_dedes/pe.d078:peVE.Lity1.incipit	…
ltx/en_us_dedes/pe.d078:peVE.Lity1.melody	@ltx/en_us_dedes/miscellanea:misc.Idiomelon
ltx/en_us_dedes/pe.d078:peVE.Lity1.mode	@ltx/en_us_dedes/miscellanea:misc.Mode4
ltx/en_us_dedes/pe.d078:peVE.Lity1.text	
ltx/en_us_dedes/pe.d078:peVE.Lity2.incipit	…
ltx/en_us_dedes/pe.d078:peVE.Lity2.melody	@ltx/en_us_dedes/miscellanea:misc.Idiomelon
ltx/en_us_dedes/pe.d078:peVE.Lity2.mode	@ltx/en_us_dedes/miscellanea:misc.Mode8
ltx/en_us_dedes/pe.d078:peVE.Lity2.text	
ltx/en_us_dedes/pe.d078:peVE.LityGlory.incipit	The Disciples were together…
ltx/en_us_dedes/pe.d078:peVE.LityGlory.melody	@ltx/en_us_dedes/miscellanea:misc.Idiomelon
ltx/en_us_dedes/pe.d078:peVE.LityGlory.mode	@ltx/en_us_dedes/miscellanea:misc.Mode8
ltx/en_us_dedes/pe.d078:peVE.LityGlory.poet	@ltx/en_us_dedes/poets:po.Anatoliou
ltx/en_us_dedes/pe.d078:peVE.LityGlory.text	The Disciples were together, the doors were shut, the Savior came to where they had gathered. He stood among them, and said to Thomas, “Come and handle me, and see the marks of the nails. Stretch out your hand and touch my side. Do not disbelieve, but rather with faith proclaim my resurrection from the dead.”
ltx/en_us_dedes/pe.d078:peVE.MM.Stichera1234as3456.text	@ltx/en_us_dedes/properties:media.key
ltx/en_us_dedes/pe.d078:peVE.SticGlory.incipit	The doors were shut…
ltx/en_us_dedes/pe.d078:peVE.SticGlory.melody	@ltx/en_us_dedes/miscellanea:misc.Idiomelon
ltx/en_us_dedes/pe.d078:peVE.SticGlory.mode	@ltx/en_us_dedes/miscellanea:misc.Mode6
ltx/en_us_dedes/pe.d078:peVE.SticGlory.text	The doors were shut. Even so, You came and stood among Your Disciples, O Christ. By divine plan, Thomas was not with them then. Later he would say, “I will not believe, unless I see the Master for myself; unless I see the side, from which came out the blood and the water, namely baptism; unless I see the wound, from which came the healing of humanity and its tremendous trauma; unless I see that He is not a ghost, but flesh and bones.” O Lord, who trampled death and gave assurance to Thomas, glory to You!
ltx/en_us_dedes/pe.d078:peVE.Stichera01.incipit	The doors were shut…
ltx/en_us_dedes/pe.d078:peVE.Stichera01.melody	@ltx/en_us_dedes/miscellanea:misc.Idiomelon
ltx/en_us_dedes/pe.d078:peVE.Stichera01.mode	@ltx/en_us_dedes/miscellanea:misc.Mode1
ltx/en_us_dedes/pe.d078:peVE.Stichera01.poet	@ltx/en_us_dedes/poets:po.IoannouMonachou
ltx/en_us_dedes/pe.d078:peVE.Stichera01.text	The doors were shut where the Disciples were, when You entered unawares, O almighty Jesus our God. You stood among them and gave them peace, and You filled them with the Holy Spirit. You charged them not to depart from Jerusalem, but to wait there until they be clothed with power from on high. Therefore we cry out to You, “Our illumination and our resurrection and our peace, glory to You!”
ltx/en_us_dedes/pe.d078:peVE.Stichera02.incipit	Eight days after…
ltx/en_us_dedes/pe.d078:peVE.Stichera02.melody	@ltx/en_us_dedes/miscellanea:misc.Idiomelon
ltx/en_us_dedes/pe.d078:peVE.Stichera02.mode	@ltx/en_us_dedes/miscellanea:misc.Mode1
ltx/en_us_dedes/pe.d078:peVE.Stichera02.text	Eight days after Your resurrection, O Lord, You appeared to Your disciples in the room where they were gathered. When You said to them, “Peace be with you,” You showed Your hands and Your immaculate side to the unbelieving disciple. And he was convinced and cried to You, “My Lord and my God, glory to You!”
ltx/en_us_dedes/pe.d078:peVE.Stichera03.incipit	Thomas, called the Twin…
ltx/en_us_dedes/pe.d078:peVE.Stichera03.melody	@ltx/en_us_dedes/miscellanea:misc.Idiomelon
ltx/en_us_dedes/pe.d078:peVE.Stichera03.mode	@ltx/en_us_dedes/miscellanea:misc.Mode1
ltx/en_us_dedes/pe.d078:peVE.Stichera03.text	Thomas, called the Twin, was not with them when You, O Christ, came and the doors were shut. Therefore he did not believe what he was told. But to confirm him in belief from disbelief, You, O Good One, did not refuse to show him Your immaculate side, and the wounds on Your hands and Your feet. When he saw You and touched You, he confessed that You are not simply God and not merely man, and he cried, “My Lord and my God, glory to You!”
ltx/en_us_dedes/pe.d078:peVE.Stichera04.incipit	The Disciples still doubted…
ltx/en_us_dedes/pe.d078:peVE.Stichera04.melody	@ltx/en_us_dedes/miscellanea:misc.Idiomelon
ltx/en_us_dedes/pe.d078:peVE.Stichera04.mode	@ltx/en_us_dedes/miscellanea:misc.Mode1
ltx/en_us_dedes/pe.d078:peVE.Stichera04.text	The Disciples still doubted. Then, on the eighth day, the Savior came to where they were, and He gave them His peace; and to Thomas He said, “Come, O Apostle, touch my hands, through which they drove the nails.” Thomas’s disbelief was good indeed! For it has led believers’ hearts to knowledge. Then he, with fear, cried aloud, “My Lord and my God, glory to You!”
ltx/en_us_dedes/pe.d078:peVE.Stichera05.incipit	After Your resurrection…
ltx/en_us_dedes/pe.d078:peVE.Stichera05.melody	@ltx/en_us_dedes/miscellanea:misc.Idiomelon
ltx/en_us_dedes/pe.d078:peVE.Stichera05.mode	@ltx/en_us_dedes/miscellanea:misc.Mode2
ltx/en_us_dedes/pe.d078:peVE.Stichera05.text	After Your resurrection, O Lord, Your Disciples were again behind locked doors, and You came and stood among them and gave them peace. Thomas, too, saw Your hands and side and thus became convinced; and he confessed You to be Lord and God, who saves those who hope in You, the One who loves humanity.
ltx/en_us_dedes/pe.d078:peVE.Stichera06.incipit	The doors being shut…
ltx/en_us_dedes/pe.d078:peVE.Stichera06.melody	@ltx/en_us_dedes/miscellanea:misc.Idiomelon
ltx/en_us_dedes/pe.d078:peVE.Stichera06.mode	@ltx/en_us_dedes/miscellanea:misc.Mode2
ltx/en_us_dedes/pe.d078:peVE.Stichera06.text	The doors being shut, Jesus came and stood among the Disciples. He took away their fear and gave them peace instead. Then He said to Thomas, “Why the disbelief that I rose from the dead? Bring your hand here and put it on my side, and see for yourself. Now, because of your disbelief, everyone has come to know my Passion and my Resurrection, and they cry aloud with you, ‘My Lord and my God, glory to You!’”
