ltx/en_us_dedes/tr.d037:trCO.header	
ltx/en_us_dedes/tr.d037:trDA.commemoration.full	
ltx/en_us_dedes/tr.d037:trDA.commemoration.short	Monday of the Third Week
ltx/en_us_dedes/tr.d037:trDA.insert1	
ltx/en_us_dedes/tr.d037:trDA.insert2	
ltx/en_us_dedes/tr.d037:trDA.note	
ltx/en_us_dedes/tr.d037:trDA.title	
ltx/en_us_dedes/tr.d037:trHO.commemorations	
ltx/en_us_dedes/tr.d037:trHO.daytitle	
ltx/en_us_dedes/tr.d037:trHO.description1	
ltx/en_us_dedes/tr.d037:trHO.description2	
ltx/en_us_dedes/tr.d037:trHO.note1	
ltx/en_us_dedes/tr.d037:trHO.note2	
ltx/en_us_dedes/tr.d037:trMA.AposIdiomelon1.incipit	…
ltx/en_us_dedes/tr.d037:trMA.AposIdiomelon1.melody	@ltx/en_us_dedes/miscellanea:misc.Idiomelon
ltx/en_us_dedes/tr.d037:trMA.AposIdiomelon1.mode	@ltx/en_us_dedes/miscellanea:misc.Mode4
ltx/en_us_dedes/tr.d037:trMA.AposIdiomelon1.text	
ltx/en_us_dedes/tr.d037:trMA.AposMartyric.incipit	…
ltx/en_us_dedes/tr.d037:trMA.AposMartyric.melody	
ltx/en_us_dedes/tr.d037:trMA.AposMartyric.mode	@ltx/en_us_dedes/miscellanea:misc.Mode4
ltx/en_us_dedes/tr.d037:trMA.AposMartyric.text	
ltx/en_us_dedes/tr.d037:trMA.AposTheotokion.incipit	…
ltx/en_us_dedes/tr.d037:trMA.AposTheotokion.melody	
ltx/en_us_dedes/tr.d037:trMA.AposTheotokion.mode	@ltx/en_us_dedes/miscellanea:misc.Mode4
ltx/en_us_dedes/tr.d037:trMA.AposTheotokion.text	
ltx/en_us_dedes/tr.d037:trMA.C1.poet	@ltx/en_us_dedes/poets:po.Iosif
ltx/en_us_dedes/tr.d037:trMA.C1.title	
ltx/en_us_dedes/tr.d037:trMA.C1.verse	
ltx/en_us_dedes/tr.d037:trMA.C2.poet	@ltx/en_us_dedes/poets:po.Theodorou
ltx/en_us_dedes/tr.d037:trMA.C2.title	
ltx/en_us_dedes/tr.d037:trMA.C2.verse	
ltx/en_us_dedes/tr.d037:trMA.Kathisma21.greekmelody	@ltx/en_us_dedes/he.a.m8:heAU.ToProstachthen.greekname
ltx/en_us_dedes/tr.d037:trMA.Kathisma21.incipit	…
ltx/en_us_dedes/tr.d037:trMA.Kathisma21.melody	@ltx/en_us_dedes/he.a.m8:heAU.ToProstachthen.name
ltx/en_us_dedes/tr.d037:trMA.Kathisma21.mode	@ltx/en_us_dedes/miscellanea:misc.Mode8
ltx/en_us_dedes/tr.d037:trMA.Kathisma21.text	
ltx/en_us_dedes/tr.d037:trMA.Kathisma22.greekmelody	@ltx/en_us_dedes/he.a.m8:heAU.ToProstachthen.greekname
ltx/en_us_dedes/tr.d037:trMA.Kathisma22.incipit	@ltx/en_us_dedes/me.m11.d08:meMA.Kathisma3T.incipit
ltx/en_us_dedes/tr.d037:trMA.Kathisma22.melody	@ltx/en_us_dedes/he.a.m8:heAU.ToProstachthen.name
ltx/en_us_dedes/tr.d037:trMA.Kathisma22.mode	@ltx/en_us_dedes/miscellanea:misc.Mode8
ltx/en_us_dedes/tr.d037:trMA.Kathisma22.text	@ltx/en_us_dedes/me.m11.d08:meMA.Kathisma3T.text
ltx/en_us_dedes/tr.d037:trMA.Kathisma31.greekmelody	@ltx/en_us_dedes/he.a.m8:heAU.ToProstachthen.greekname
ltx/en_us_dedes/tr.d037:trMA.Kathisma31.incipit	…
ltx/en_us_dedes/tr.d037:trMA.Kathisma31.melody	@ltx/en_us_dedes/he.a.m8:heAU.ToProstachthen.name
ltx/en_us_dedes/tr.d037:trMA.Kathisma31.mode	@ltx/en_us_dedes/miscellanea:misc.Mode8
ltx/en_us_dedes/tr.d037:trMA.Kathisma31.text	
ltx/en_us_dedes/tr.d037:trMA.Kathisma32.greekmelody	@ltx/en_us_dedes/he.a.m8:heAU.ToProstachthen.greekname
ltx/en_us_dedes/tr.d037:trMA.Kathisma32.incipit	…
ltx/en_us_dedes/tr.d037:trMA.Kathisma32.melody	@ltx/en_us_dedes/he.a.m8:heAU.ToProstachthen.name
ltx/en_us_dedes/tr.d037:trMA.Kathisma32.mode	@ltx/en_us_dedes/miscellanea:misc.Mode8
ltx/en_us_dedes/tr.d037:trMA.Kathisma32.text	
ltx/en_us_dedes/tr.d037:trMA.Ode1C11.greekmelody	@ltx/en_us_dedes/he.h.m8:heHE.AsmaAnapempsomen.greekname
ltx/en_us_dedes/tr.d037:trMA.Ode1C11.incipit	…
ltx/en_us_dedes/tr.d037:trMA.Ode1C11.melody	@ltx/en_us_dedes/he.h.m8:heHE.AsmaAnapempsomen.name
ltx/en_us_dedes/tr.d037:trMA.Ode1C11.mode	@ltx/en_us_dedes/miscellanea:misc.Mode8
ltx/en_us_dedes/tr.d037:trMA.Ode1C11.ode	@ltx/en_us_dedes/miscellanea:misc.Ode1
ltx/en_us_dedes/tr.d037:trMA.Ode1C11.text	
ltx/en_us_dedes/tr.d037:trMA.Ode1C12.incipit	…
ltx/en_us_dedes/tr.d037:trMA.Ode1C12.melody	@ltx/en_us_dedes/he.h.m8:heHE.AsmaAnapempsomen.name
ltx/en_us_dedes/tr.d037:trMA.Ode1C12.mode	@ltx/en_us_dedes/miscellanea:misc.Mode8
ltx/en_us_dedes/tr.d037:trMA.Ode1C12.ode	@ltx/en_us_dedes/miscellanea:misc.Ode1
ltx/en_us_dedes/tr.d037:trMA.Ode1C12.text	
ltx/en_us_dedes/tr.d037:trMA.Ode1C13.incipit	…
ltx/en_us_dedes/tr.d037:trMA.Ode1C13.melody	@ltx/en_us_dedes/he.h.m8:heHE.AsmaAnapempsomen.name
ltx/en_us_dedes/tr.d037:trMA.Ode1C13.mode	@ltx/en_us_dedes/miscellanea:misc.Mode8
ltx/en_us_dedes/tr.d037:trMA.Ode1C13.ode	@ltx/en_us_dedes/miscellanea:misc.Ode1
ltx/en_us_dedes/tr.d037:trMA.Ode1C13.text	
ltx/en_us_dedes/tr.d037:trMA.Ode1C1T.incipit	…
ltx/en_us_dedes/tr.d037:trMA.Ode1C1T.melody	@ltx/en_us_dedes/he.h.m8:heHE.AsmaAnapempsomen.name
ltx/en_us_dedes/tr.d037:trMA.Ode1C1T.mode	@ltx/en_us_dedes/miscellanea:misc.Mode8
ltx/en_us_dedes/tr.d037:trMA.Ode1C1T.ode	@ltx/en_us_dedes/miscellanea:misc.Ode1
ltx/en_us_dedes/tr.d037:trMA.Ode1C1T.text	
ltx/en_us_dedes/tr.d037:trMA.Ode1C21.greekmelody	@ltx/en_us_dedes/he.h.m8:heHE.AsomenOdinToTheo.greekname
ltx/en_us_dedes/tr.d037:trMA.Ode1C21.incipit	…
ltx/en_us_dedes/tr.d037:trMA.Ode1C21.melody	@ltx/en_us_dedes/he.h.m8:heHE.AsomenOdinToTheo.name
ltx/en_us_dedes/tr.d037:trMA.Ode1C21.mode	@ltx/en_us_dedes/miscellanea:misc.Mode8
ltx/en_us_dedes/tr.d037:trMA.Ode1C21.ode	@ltx/en_us_dedes/miscellanea:misc.Ode1
ltx/en_us_dedes/tr.d037:trMA.Ode1C21.text	
ltx/en_us_dedes/tr.d037:trMA.Ode1C22.incipit	…
ltx/en_us_dedes/tr.d037:trMA.Ode1C22.melody	@ltx/en_us_dedes/he.h.m8:heHE.AsomenOdinToTheo.name
ltx/en_us_dedes/tr.d037:trMA.Ode1C22.mode	@ltx/en_us_dedes/miscellanea:misc.Mode8
ltx/en_us_dedes/tr.d037:trMA.Ode1C22.ode	@ltx/en_us_dedes/miscellanea:misc.Ode1
ltx/en_us_dedes/tr.d037:trMA.Ode1C22.text	
ltx/en_us_dedes/tr.d037:trMA.Ode1C2A1.incipit	…
ltx/en_us_dedes/tr.d037:trMA.Ode1C2A1.melody	@ltx/en_us_dedes/he.h.m8:heHE.AsomenOdinToTheo.name
ltx/en_us_dedes/tr.d037:trMA.Ode1C2A1.mode	@ltx/en_us_dedes/miscellanea:misc.Mode8
ltx/en_us_dedes/tr.d037:trMA.Ode1C2A1.ode	@ltx/en_us_dedes/miscellanea:misc.Ode1
ltx/en_us_dedes/tr.d037:trMA.Ode1C2A1.text	
ltx/en_us_dedes/tr.d037:trMA.Ode1C2H.greekmelody	@ltx/en_us_dedes/he.h.m8:heHE.AsomenOdinToTheo.greekname
ltx/en_us_dedes/tr.d037:trMA.Ode1C2H.incipit	@ltx/en_us_dedes/he.h.m8:heHE.AsomenOdinToTheo.incipit
ltx/en_us_dedes/tr.d037:trMA.Ode1C2H.melody	@ltx/en_us_dedes/he.h.m8:heHE.AsomenOdinToTheo.melody
ltx/en_us_dedes/tr.d037:trMA.Ode1C2H.mode	@ltx/en_us_dedes/miscellanea:misc.Mode8
ltx/en_us_dedes/tr.d037:trMA.Ode1C2H.ode	@ltx/en_us_dedes/miscellanea:misc.Ode1
ltx/en_us_dedes/tr.d037:trMA.Ode1C2H.text	@ltx/en_us_dedes/he.h.m8:heHE.AsomenOdinToTheo.text
ltx/en_us_dedes/tr.d037:trMA.Ode1C2T.incipit	…
ltx/en_us_dedes/tr.d037:trMA.Ode1C2T.melody	@ltx/en_us_dedes/he.h.m8:heHE.AsomenOdinToTheo.name
ltx/en_us_dedes/tr.d037:trMA.Ode1C2T.mode	@ltx/en_us_dedes/miscellanea:misc.Mode8
ltx/en_us_dedes/tr.d037:trMA.Ode1C2T.ode	@ltx/en_us_dedes/miscellanea:misc.Ode1
ltx/en_us_dedes/tr.d037:trMA.Ode1C2T.text	
ltx/en_us_dedes/tr.d037:trMA.Ode1C2Tr.incipit	…
ltx/en_us_dedes/tr.d037:trMA.Ode1C2Tr.melody	@ltx/en_us_dedes/he.h.m8:heHE.AsomenOdinToTheo.name
ltx/en_us_dedes/tr.d037:trMA.Ode1C2Tr.mode	@ltx/en_us_dedes/miscellanea:misc.Mode8
ltx/en_us_dedes/tr.d037:trMA.Ode1C2Tr.ode	@ltx/en_us_dedes/miscellanea:misc.Ode1
ltx/en_us_dedes/tr.d037:trMA.Ode1C2Tr.text	
ltx/en_us_dedes/tr.d037:trMA.Ode8C11.greekmelody	@ltx/en_us_dedes/he.h.m8:heHE.OiTheorrimonesPaides.greekname
ltx/en_us_dedes/tr.d037:trMA.Ode8C11.incipit	…
ltx/en_us_dedes/tr.d037:trMA.Ode8C11.melody	@ltx/en_us_dedes/he.h.m8:heHE.OiTheorrimonesPaides.name
ltx/en_us_dedes/tr.d037:trMA.Ode8C11.mode	@ltx/en_us_dedes/miscellanea:misc.Mode8
ltx/en_us_dedes/tr.d037:trMA.Ode8C11.ode	@ltx/en_us_dedes/miscellanea:misc.Ode8
ltx/en_us_dedes/tr.d037:trMA.Ode8C11.text	
ltx/en_us_dedes/tr.d037:trMA.Ode8C12.incipit	…
ltx/en_us_dedes/tr.d037:trMA.Ode8C12.melody	@ltx/en_us_dedes/he.h.m8:heHE.OiTheorrimonesPaides.name
ltx/en_us_dedes/tr.d037:trMA.Ode8C12.mode	@ltx/en_us_dedes/miscellanea:misc.Mode8
ltx/en_us_dedes/tr.d037:trMA.Ode8C12.ode	@ltx/en_us_dedes/miscellanea:misc.Ode8
ltx/en_us_dedes/tr.d037:trMA.Ode8C12.text	
ltx/en_us_dedes/tr.d037:trMA.Ode8C13.incipit	…
ltx/en_us_dedes/tr.d037:trMA.Ode8C13.melody	@ltx/en_us_dedes/he.h.m8:heHE.OiTheorrimonesPaides.name
ltx/en_us_dedes/tr.d037:trMA.Ode8C13.mode	@ltx/en_us_dedes/miscellanea:misc.Mode8
ltx/en_us_dedes/tr.d037:trMA.Ode8C13.ode	@ltx/en_us_dedes/miscellanea:misc.Ode8
ltx/en_us_dedes/tr.d037:trMA.Ode8C13.text	
ltx/en_us_dedes/tr.d037:trMA.Ode8C1T.incipit	…
ltx/en_us_dedes/tr.d037:trMA.Ode8C1T.melody	@ltx/en_us_dedes/he.h.m8:heHE.OiTheorrimonesPaides.name
ltx/en_us_dedes/tr.d037:trMA.Ode8C1T.mode	@ltx/en_us_dedes/miscellanea:misc.Mode8
ltx/en_us_dedes/tr.d037:trMA.Ode8C1T.ode	@ltx/en_us_dedes/miscellanea:misc.Ode8
ltx/en_us_dedes/tr.d037:trMA.Ode8C1T.text	
ltx/en_us_dedes/tr.d037:trMA.Ode8C21.greekmelody	@ltx/en_us_dedes/he.h.m8:heHE.OStegazonEnYdasi.greekname
ltx/en_us_dedes/tr.d037:trMA.Ode8C21.incipit	…
ltx/en_us_dedes/tr.d037:trMA.Ode8C21.melody	@ltx/en_us_dedes/he.h.m8:heHE.OStegazonEnYdasi.name
ltx/en_us_dedes/tr.d037:trMA.Ode8C21.mode	@ltx/en_us_dedes/miscellanea:misc.Mode8
ltx/en_us_dedes/tr.d037:trMA.Ode8C21.ode	@ltx/en_us_dedes/miscellanea:misc.Ode8
ltx/en_us_dedes/tr.d037:trMA.Ode8C21.text	
ltx/en_us_dedes/tr.d037:trMA.Ode8C22.incipit	…
ltx/en_us_dedes/tr.d037:trMA.Ode8C22.melody	@ltx/en_us_dedes/he.h.m8:heHE.OStegazonEnYdasi.name
ltx/en_us_dedes/tr.d037:trMA.Ode8C22.mode	@ltx/en_us_dedes/miscellanea:misc.Mode8
ltx/en_us_dedes/tr.d037:trMA.Ode8C22.ode	@ltx/en_us_dedes/miscellanea:misc.Ode8
ltx/en_us_dedes/tr.d037:trMA.Ode8C22.text	
ltx/en_us_dedes/tr.d037:trMA.Ode8C2A1.incipit	…
ltx/en_us_dedes/tr.d037:trMA.Ode8C2A1.melody	@ltx/en_us_dedes/he.h.m8:heHE.OStegazonEnYdasi.name
ltx/en_us_dedes/tr.d037:trMA.Ode8C2A1.mode	@ltx/en_us_dedes/miscellanea:misc.Mode8
ltx/en_us_dedes/tr.d037:trMA.Ode8C2A1.ode	@ltx/en_us_dedes/miscellanea:misc.Ode8
ltx/en_us_dedes/tr.d037:trMA.Ode8C2A1.text	
ltx/en_us_dedes/tr.d037:trMA.Ode8C2H.greekmelody	@ltx/en_us_dedes/he.h.m8:heHE.OStegazonEnYdasi.greekname
ltx/en_us_dedes/tr.d037:trMA.Ode8C2H.incipit	@ltx/en_us_dedes/he.h.m8:heHE.OStegazonEnYdasi.incipit
ltx/en_us_dedes/tr.d037:trMA.Ode8C2H.melody	@ltx/en_us_dedes/he.h.m8:heHE.OStegazonEnYdasi.melody
ltx/en_us_dedes/tr.d037:trMA.Ode8C2H.mode	@ltx/en_us_dedes/miscellanea:misc.Mode8
ltx/en_us_dedes/tr.d037:trMA.Ode8C2H.ode	@ltx/en_us_dedes/miscellanea:misc.Ode8
ltx/en_us_dedes/tr.d037:trMA.Ode8C2H.text	@ltx/en_us_dedes/he.h.m8:heHE.OStegazonEnYdasi.text
ltx/en_us_dedes/tr.d037:trMA.Ode8C2T.incipit	…
ltx/en_us_dedes/tr.d037:trMA.Ode8C2T.melody	@ltx/en_us_dedes/he.h.m8:heHE.OStegazonEnYdasi.name
ltx/en_us_dedes/tr.d037:trMA.Ode8C2T.mode	@ltx/en_us_dedes/miscellanea:misc.Mode8
ltx/en_us_dedes/tr.d037:trMA.Ode8C2T.ode	@ltx/en_us_dedes/miscellanea:misc.Ode8
ltx/en_us_dedes/tr.d037:trMA.Ode8C2T.text	
ltx/en_us_dedes/tr.d037:trMA.Ode8C2Tr.incipit	…
ltx/en_us_dedes/tr.d037:trMA.Ode8C2Tr.melody	@ltx/en_us_dedes/he.h.m8:heHE.OStegazonEnYdasi.name
ltx/en_us_dedes/tr.d037:trMA.Ode8C2Tr.mode	@ltx/en_us_dedes/miscellanea:misc.Mode8
ltx/en_us_dedes/tr.d037:trMA.Ode8C2Tr.ode	@ltx/en_us_dedes/miscellanea:misc.Ode8
ltx/en_us_dedes/tr.d037:trMA.Ode8C2Tr.text	
ltx/en_us_dedes/tr.d037:trMA.Ode9C11.greekmelody	@ltx/en_us_dedes/he.h.m8:heHE.TonProdilothenta.greekname
ltx/en_us_dedes/tr.d037:trMA.Ode9C11.incipit	…
ltx/en_us_dedes/tr.d037:trMA.Ode9C11.melody	@ltx/en_us_dedes/he.h.m8:heHE.TonProdilothenta.name
ltx/en_us_dedes/tr.d037:trMA.Ode9C11.mode	@ltx/en_us_dedes/miscellanea:misc.Mode8
ltx/en_us_dedes/tr.d037:trMA.Ode9C11.ode	@ltx/en_us_dedes/miscellanea:misc.Ode9
ltx/en_us_dedes/tr.d037:trMA.Ode9C11.text	
ltx/en_us_dedes/tr.d037:trMA.Ode9C12.incipit	…
ltx/en_us_dedes/tr.d037:trMA.Ode9C12.melody	@ltx/en_us_dedes/he.h.m8:heHE.TonProdilothenta.name
ltx/en_us_dedes/tr.d037:trMA.Ode9C12.mode	@ltx/en_us_dedes/miscellanea:misc.Mode8
ltx/en_us_dedes/tr.d037:trMA.Ode9C12.ode	@ltx/en_us_dedes/miscellanea:misc.Ode9
ltx/en_us_dedes/tr.d037:trMA.Ode9C12.text	
ltx/en_us_dedes/tr.d037:trMA.Ode9C13.incipit	…
ltx/en_us_dedes/tr.d037:trMA.Ode9C13.melody	@ltx/en_us_dedes/he.h.m8:heHE.TonProdilothenta.name
ltx/en_us_dedes/tr.d037:trMA.Ode9C13.mode	@ltx/en_us_dedes/miscellanea:misc.Mode8
ltx/en_us_dedes/tr.d037:trMA.Ode9C13.ode	@ltx/en_us_dedes/miscellanea:misc.Ode9
ltx/en_us_dedes/tr.d037:trMA.Ode9C13.text	
ltx/en_us_dedes/tr.d037:trMA.Ode9C1T.incipit	…
ltx/en_us_dedes/tr.d037:trMA.Ode9C1T.melody	@ltx/en_us_dedes/he.h.m8:heHE.TonProdilothenta.name
ltx/en_us_dedes/tr.d037:trMA.Ode9C1T.mode	@ltx/en_us_dedes/miscellanea:misc.Mode8
ltx/en_us_dedes/tr.d037:trMA.Ode9C1T.ode	@ltx/en_us_dedes/miscellanea:misc.Ode9
ltx/en_us_dedes/tr.d037:trMA.Ode9C1T.text	
ltx/en_us_dedes/tr.d037:trMA.Ode9C21.greekmelody	@ltx/en_us_dedes/he.h.m8:heHE.MegalynomenSeTinPanamomon.greekname
ltx/en_us_dedes/tr.d037:trMA.Ode9C21.incipit	…
ltx/en_us_dedes/tr.d037:trMA.Ode9C21.melody	@ltx/en_us_dedes/he.h.m8:heHE.MegalynomenSeTinPanamomon.name
ltx/en_us_dedes/tr.d037:trMA.Ode9C21.mode	@ltx/en_us_dedes/miscellanea:misc.Mode8
ltx/en_us_dedes/tr.d037:trMA.Ode9C21.ode	@ltx/en_us_dedes/miscellanea:misc.Ode9
ltx/en_us_dedes/tr.d037:trMA.Ode9C21.text	
ltx/en_us_dedes/tr.d037:trMA.Ode9C22.incipit	…
ltx/en_us_dedes/tr.d037:trMA.Ode9C22.melody	@ltx/en_us_dedes/he.h.m8:heHE.MegalynomenSeTinPanamomon.name
ltx/en_us_dedes/tr.d037:trMA.Ode9C22.mode	@ltx/en_us_dedes/miscellanea:misc.Mode8
ltx/en_us_dedes/tr.d037:trMA.Ode9C22.ode	@ltx/en_us_dedes/miscellanea:misc.Ode9
ltx/en_us_dedes/tr.d037:trMA.Ode9C22.text	
ltx/en_us_dedes/tr.d037:trMA.Ode9C2A1.incipit	…
ltx/en_us_dedes/tr.d037:trMA.Ode9C2A1.melody	@ltx/en_us_dedes/he.h.m8:heHE.MegalynomenSeTinPanamomon.name
ltx/en_us_dedes/tr.d037:trMA.Ode9C2A1.mode	@ltx/en_us_dedes/miscellanea:misc.Mode8
ltx/en_us_dedes/tr.d037:trMA.Ode9C2A1.ode	@ltx/en_us_dedes/miscellanea:misc.Ode9
ltx/en_us_dedes/tr.d037:trMA.Ode9C2A1.text	
ltx/en_us_dedes/tr.d037:trMA.Ode9C2H.greekmelody	@ltx/en_us_dedes/he.h.m8:heHE.MegalynomenSeTinPanamomon.greekname
ltx/en_us_dedes/tr.d037:trMA.Ode9C2H.incipit	@ltx/en_us_dedes/he.h.m8:heHE.MegalynomenSeTinPanamomon.incipit
ltx/en_us_dedes/tr.d037:trMA.Ode9C2H.melody	@ltx/en_us_dedes/he.h.m8:heHE.MegalynomenSeTinPanamomon.melody
ltx/en_us_dedes/tr.d037:trMA.Ode9C2H.mode	@ltx/en_us_dedes/miscellanea:misc.Mode8
ltx/en_us_dedes/tr.d037:trMA.Ode9C2H.ode	@ltx/en_us_dedes/miscellanea:misc.Ode9
ltx/en_us_dedes/tr.d037:trMA.Ode9C2H.text	@ltx/en_us_dedes/he.h.m8:heHE.MegalynomenSeTinPanamomon.text
ltx/en_us_dedes/tr.d037:trMA.Ode9C2T.incipit	…
ltx/en_us_dedes/tr.d037:trMA.Ode9C2T.melody	@ltx/en_us_dedes/he.h.m8:heHE.MegalynomenSeTinPanamomon.name
ltx/en_us_dedes/tr.d037:trMA.Ode9C2T.mode	@ltx/en_us_dedes/miscellanea:misc.Mode8
ltx/en_us_dedes/tr.d037:trMA.Ode9C2T.ode	@ltx/en_us_dedes/miscellanea:misc.Ode9
ltx/en_us_dedes/tr.d037:trMA.Ode9C2T.text	
ltx/en_us_dedes/tr.d037:trMA.Ode9C2Tr.incipit	…
ltx/en_us_dedes/tr.d037:trMA.Ode9C2Tr.melody	@ltx/en_us_dedes/he.h.m8:heHE.MegalynomenSeTinPanamomon.name
ltx/en_us_dedes/tr.d037:trMA.Ode9C2Tr.mode	@ltx/en_us_dedes/miscellanea:misc.Mode8
ltx/en_us_dedes/tr.d037:trMA.Ode9C2Tr.ode	@ltx/en_us_dedes/miscellanea:misc.Ode9
ltx/en_us_dedes/tr.d037:trMA.Ode9C2Tr.text	
ltx/en_us_dedes/tr.d037:trTE.Troparion.incipit	…
ltx/en_us_dedes/tr.d037:trTE.Troparion.melody	
ltx/en_us_dedes/tr.d037:trTE.Troparion.mode	@ltx/en_us_dedes/miscellanea:misc.Mode4
ltx/en_us_dedes/tr.d037:trTE.Troparion.text	
ltx/en_us_dedes/tr.d037:trVE.AposIdiomelon1.incipit	…
ltx/en_us_dedes/tr.d037:trVE.AposIdiomelon1.melody	@ltx/en_us_dedes/miscellanea:misc.Idiomelon
ltx/en_us_dedes/tr.d037:trVE.AposIdiomelon1.mode	@ltx/en_us_dedes/miscellanea:misc.Mode8
ltx/en_us_dedes/tr.d037:trVE.AposIdiomelon1.text	
ltx/en_us_dedes/tr.d037:trVE.AposMartyric.incipit	@ltx/en_us_dedes/oc.m8.d2:ocVE.Aposticha3.incipit
ltx/en_us_dedes/tr.d037:trVE.AposMartyric.melody	
ltx/en_us_dedes/tr.d037:trVE.AposMartyric.mode	@ltx/en_us_dedes/miscellanea:misc.Mode8
ltx/en_us_dedes/tr.d037:trVE.AposMartyric.text	@ltx/en_us_dedes/oc.m8.d2:ocVE.Aposticha3.text
ltx/en_us_dedes/tr.d037:trVE.AposTheotokion.incipit	@ltx/en_us_dedes/oc.m8.d2:ocMA.AposTheotokion.incipit
ltx/en_us_dedes/tr.d037:trVE.AposTheotokion.melody	
ltx/en_us_dedes/tr.d037:trVE.AposTheotokion.mode	@ltx/en_us_dedes/miscellanea:misc.Mode8
ltx/en_us_dedes/tr.d037:trVE.AposTheotokion.text	@ltx/en_us_dedes/oc.m8.d2:ocMA.AposTheotokion.text
ltx/en_us_dedes/tr.d037:trVE.Stichera01.incipit	…
ltx/en_us_dedes/tr.d037:trVE.Stichera01.melody	
ltx/en_us_dedes/tr.d037:trVE.Stichera01.mode	@ltx/en_us_dedes/miscellanea:misc.Mode8
ltx/en_us_dedes/tr.d037:trVE.Stichera01.poet	@ltx/en_us_dedes/poets:po.Iosif
ltx/en_us_dedes/tr.d037:trVE.Stichera01.text	
ltx/en_us_dedes/tr.d037:trVE.Stichera02.incipit	…
ltx/en_us_dedes/tr.d037:trVE.Stichera02.melody	
ltx/en_us_dedes/tr.d037:trVE.Stichera02.mode	@ltx/en_us_dedes/miscellanea:misc.Mode8
ltx/en_us_dedes/tr.d037:trVE.Stichera02.text	
ltx/en_us_dedes/tr.d037:trVE.Stichera03.incipit	…
ltx/en_us_dedes/tr.d037:trVE.Stichera03.melody	
ltx/en_us_dedes/tr.d037:trVE.Stichera03.mode	@ltx/en_us_dedes/miscellanea:misc.Mode8
ltx/en_us_dedes/tr.d037:trVE.Stichera03.poet	@ltx/en_us_dedes/poets:po.Theodorou
ltx/en_us_dedes/tr.d037:trVE.Stichera03.text	
