ltx/en_us_dedes/me.m06.d24:meDA.commemoration.first	The Birth of the Holy Forerunner
ltx/en_us_dedes/me.m06.d24:meDA.commemoration.first_name	
ltx/en_us_dedes/me.m06.d24:meDA.commemoration.first_short	The Birth of the Holy Forerunner
ltx/en_us_dedes/me.m06.d24:meDA.commemoration.first_title	@ltx/en_us_dedes/titles:ti.Forerunner
ltx/en_us_dedes/me.m06.d24:meDA.commemoration.full	The Birth of the Honorable and Glorious Prophet, Forerunner and Baptist John.
ltx/en_us_dedes/me.m06.d24:meDA.commemoration.second_name	
ltx/en_us_dedes/me.m06.d24:meDA.commemoration.second_title	
ltx/en_us_dedes/me.m06.d24:meDA.date	June 24
ltx/en_us_dedes/me.m06.d24:meDA.dismissal	
ltx/en_us_dedes/me.m06.d24:meDA.fordate	for June 24
ltx/en_us_dedes/me.m06.d24:meDA.insert1	
ltx/en_us_dedes/me.m06.d24:meDA.insert2	whose Birth we celebrate;
ltx/en_us_dedes/me.m06.d24:meDA.note	
ltx/en_us_dedes/me.m06.d24:meDA.pdfcoverdate	June 24,
ltx/en_us_dedes/me.m06.d24:meDA.pdfheaderdate	June 24
ltx/en_us_dedes/me.m06.d24:meHO.commemorations	
ltx/en_us_dedes/me.m06.d24:meHO.note1	
ltx/en_us_dedes/me.m06.d24:meHO.note2	
ltx/en_us_dedes/me.m06.d24:meHO.number	
ltx/en_us_dedes/me.m06.d24:meHO.rank	
ltx/en_us_dedes/me.m06.d24:meLE.commemoration1	The Nativity of the Venerable and Glorious Prophet, the Forerunner John the Baptist.
ltx/en_us_dedes/me.m06.d24:meLE.commemoration2	
ltx/en_us_dedes/me.m06.d24:meLI.Kontakion1.greekmelody	@ltx/en_us_dedes/me.m06.d24:meMA.Kontakion1.greekmelody
ltx/en_us_dedes/me.m06.d24:meLI.Kontakion1.incipit	@ltx/en_us_dedes/me.m06.d24:meMA.Kontakion1.incipit
ltx/en_us_dedes/me.m06.d24:meLI.Kontakion1.melody	@ltx/en_us_dedes/me.m06.d24:meMA.Kontakion1.melody
ltx/en_us_dedes/me.m06.d24:meLI.Kontakion1.mode	@ltx/en_us_dedes/me.m06.d24:meMA.Kontakion1.mode
ltx/en_us_dedes/me.m06.d24:meLI.Kontakion1.text	@ltx/en_us_dedes/me.m06.d24:meMA.Kontakion1.text
ltx/en_us_dedes/me.m06.d24:meLI.MM.CommunionHymn.text	@ltx/en_us_dedes/properties:media.key
ltx/en_us_dedes/me.m06.d24:meLI.Megalynarion.text	
ltx/en_us_dedes/me.m06.d24:meMA.C1.acrostic.notice1	
ltx/en_us_dedes/me.m06.d24:meMA.C1.acrostic.text	
ltx/en_us_dedes/me.m06.d24:meMA.C1.acrostic.title	
ltx/en_us_dedes/me.m06.d24:meMA.C1.poet	@ltx/en_us_dedes/poets:po.IoannouTouDamaskinou
ltx/en_us_dedes/me.m06.d24:meMA.C1.title	@ltx/en_us_dedes/titles:ti.Canon1Forerunner
ltx/en_us_dedes/me.m06.d24:meMA.C1.verse	@ltx/en_us_dedes/prayers:pr.verse_Baptist.text
ltx/en_us_dedes/me.m06.d24:meMA.C2.acrostic.notice1	
ltx/en_us_dedes/me.m06.d24:meMA.C2.acrostic.text	
ltx/en_us_dedes/me.m06.d24:meMA.C2.acrostic.title	
ltx/en_us_dedes/me.m06.d24:meMA.C2.poet	@ltx/en_us_dedes/poets:po.Georgiou
ltx/en_us_dedes/me.m06.d24:meMA.C2.title	@ltx/en_us_dedes/titles:ti.Canon2Forerunner
ltx/en_us_dedes/me.m06.d24:meMA.C2.verse	@ltx/en_us_dedes/prayers:pr.verse_Baptist.text
ltx/en_us_dedes/me.m06.d24:meMA.ExapTheotokion.incipit	The Prophets did proclaim of…
ltx/en_us_dedes/me.m06.d24:meMA.ExapTheotokion.melody	@ltx/en_us_dedes/he.a.m2:heAU.GynaikesAkoutisthite.name
ltx/en_us_dedes/me.m06.d24:meMA.ExapTheotokion.mode	@ltx/en_us_dedes/miscellanea:misc.Mode2
ltx/en_us_dedes/me.m06.d24:meMA.ExapTheotokion.text	The Prophets did proclaim of old, * and later the Apostles taught, * and godly-minded Martyrs * confessed distinctly, O Pure one, * your Son to be the God of all, * O Theotokos. And with them * we magnify you, for through you * O Virgin, we were redeemed from * the former condemnation.
ltx/en_us_dedes/me.m06.d24:meMA.Exaposteilarion1.greekmelody	@ltx/en_us_dedes/he.a.m2:heAU.GynaikesAkoutisthite.greekname
ltx/en_us_dedes/me.m06.d24:meMA.Exaposteilarion1.incipit	The gladdening nativity * today…
ltx/en_us_dedes/me.m06.d24:meMA.Exaposteilarion1.melody	@ltx/en_us_dedes/he.a.m2:heAU.GynaikesAkoutisthite.name
ltx/en_us_dedes/me.m06.d24:meMA.Exaposteilarion1.mode	@ltx/en_us_dedes/miscellanea:misc.Mode2
ltx/en_us_dedes/me.m06.d24:meMA.Exaposteilarion1.text	The gladdening nativity * today of John the Forerunner * dispels the sadness attached to * the voicelessness of his father * and to his mother’s childlessness. * Moreover it proclaims the joy * and exultation still to come. * Therefore is all creation * celebrating it gaily.
ltx/en_us_dedes/me.m06.d24:meMA.Kathisma11.greekmelody	@ltx/en_us_dedes/he.a.m4:heAU.KateplagiIosif.greekname
ltx/en_us_dedes/me.m06.d24:meMA.Kathisma11.incipit	Unto us now has the…
ltx/en_us_dedes/me.m06.d24:meMA.Kathisma11.melody	@ltx/en_us_dedes/he.a.m4:heAU.KateplagiIosif.name
ltx/en_us_dedes/me.m06.d24:meMA.Kathisma11.mode	@ltx/en_us_dedes/miscellanea:misc.Mode4
ltx/en_us_dedes/me.m06.d24:meMA.Kathisma11.text	Unto us now has the son * of Zacharias been born, * and he mystically gives joy * to the believers’ minds. * He is the desert’s ornament, and the pedestal of the Prophets. * And thus did he become * the Forerunner * who testifies the truth * of the coming of Christ. * So let us cry aloud unto the Baptist * singing in unison spiritual songs: * O intercede for our salvation, * Prophet and Herald of the truth.
ltx/en_us_dedes/me.m06.d24:meMA.Kathisma1T.incipit	@ltx/en_us_dedes/he.a.m4:heAU.KateplagiIosif.incipit
ltx/en_us_dedes/me.m06.d24:meMA.Kathisma1T.melody	@ltx/en_us_dedes/he.a.m4:heAU.KateplagiIosif.melody
ltx/en_us_dedes/me.m06.d24:meMA.Kathisma1T.mode	@ltx/en_us_dedes/miscellanea:misc.Mode4
ltx/en_us_dedes/me.m06.d24:meMA.Kathisma1T.text	@ltx/en_us_dedes/he.a.m4:heAU.KateplagiIosif.text
ltx/en_us_dedes/me.m06.d24:meMA.Kathisma21.greekmelody	@ltx/en_us_dedes/he.a.m8:heAU.TinSofianKaiLogon.greekname
ltx/en_us_dedes/me.m06.d24:meMA.Kathisma21.incipit	You were born in a…
ltx/en_us_dedes/me.m06.d24:meMA.Kathisma21.melody	@ltx/en_us_dedes/he.a.m8:heAU.TinSofianKaiLogon.name
ltx/en_us_dedes/me.m06.d24:meMA.Kathisma21.mode	@ltx/en_us_dedes/miscellanea:misc.Mode8
ltx/en_us_dedes/me.m06.d24:meMA.Kathisma21.text	You were born in a truly uncommon way * as the first-fruits of the appearance of Christ, * O John, praised in all the world, * and the paramount of Prophets. * And as you were the voice of the Logos you cried aloud: * Repent, for the Kingdom of heaven is nigh at hand. * Hence did you prepare the way of the Master, * becoming the Forerunner * of divine grace to all the world, * O Apostle and Baptist John. * Intercede with Christ our God * that He grant forgiveness of offenses * to those who with longing observe your holy memory.
ltx/en_us_dedes/me.m06.d24:meMA.Kathisma2T.incipit	Holy Virgin and Mother of…
ltx/en_us_dedes/me.m06.d24:meMA.Kathisma2T.melody	@ltx/en_us_dedes/he.a.m8:heAU.TinSofianKaiLogon.name
ltx/en_us_dedes/me.m06.d24:meMA.Kathisma2T.mode	@ltx/en_us_dedes/miscellanea:misc.Mode8
ltx/en_us_dedes/me.m06.d24:meMA.Kathisma2T.text	Holy Virgin and Mother of Christ our God, * I entreat you most earnestly now to cure * the passions that grieve my soul, * and to grant me forgiveness * for the sins and offenses * that I committed mindlessly, * thus polluting my body, * wretched one that I am. * Oh! and how I shudder * at the thought of that hour * when Angels will separate * my soul from my body. * Then, alas! what shall become of me? * O Lady, hence I pray you will come* to my aid as an ardent patron then. * For I your unworthy servant * have you as my only hope.
ltx/en_us_dedes/me.m06.d24:meMA.Kathisma31.greekmelody	@ltx/en_us_dedes/he.a.m8:heAU.ToProstachthen.greekname
ltx/en_us_dedes/me.m06.d24:meMA.Kathisma31.incipit	Exult, O father; and mother…
ltx/en_us_dedes/me.m06.d24:meMA.Kathisma31.melody	@ltx/en_us_dedes/he.a.m8:heAU.ToProstachthen.name
ltx/en_us_dedes/me.m06.d24:meMA.Kathisma31.mode	@ltx/en_us_dedes/miscellanea:misc.Mode8
ltx/en_us_dedes/me.m06.d24:meMA.Kathisma31.text	Exult, O father; and mother, now be joyous. * For you gave birth today on earth unto the Prophet * who by God is called Forerunner, even as was promised. * The barren one now is nursing her newborn babe * the Baptist; while Zacharias is overjoyed * by the childbirth, and says: “My tongue * has by your childbirth been loosed, * O Lamp of the great Light. This indeed * is a marvelous miracle.”
ltx/en_us_dedes/me.m06.d24:meMA.Kathisma3T.incipit	@ltx/en_us_dedes/he.a.m8:heAU.ToProstachthen.incipit
ltx/en_us_dedes/me.m06.d24:meMA.Kathisma3T.melody	@ltx/en_us_dedes/he.a.m8:heAU.ToProstachthen.melody
ltx/en_us_dedes/me.m06.d24:meMA.Kathisma3T.mode	@ltx/en_us_dedes/miscellanea:misc.Mode8
ltx/en_us_dedes/me.m06.d24:meMA.Kathisma3T.text	@ltx/en_us_dedes/he.a.m8:heAU.ToProstachthen.text
ltx/en_us_dedes/me.m06.d24:meMA.Kontakion1.greekmelody	@ltx/en_us_dedes/he.a.m3:heAU.IParthenosSimeron.greekname
ltx/en_us_dedes/me.m06.d24:meMA.Kontakion1.incipit	On this day Christ’s Forerunner…
ltx/en_us_dedes/me.m06.d24:meMA.Kontakion1.melody	@ltx/en_us_dedes/he.a.m3:heAU.IParthenosSimeron.name
ltx/en_us_dedes/me.m06.d24:meMA.Kontakion1.mode	@ltx/en_us_dedes/miscellanea:misc.Mode3
ltx/en_us_dedes/me.m06.d24:meMA.Kontakion1.text	On this day Christ’s Forerunner is born from her who was barren; and of all the prophesy he is himself the fulfillment. On the head of God the Word, who was by the Prophets heralded, he laid his hand at the Jordan River. Thus he showed himself to be His Prophet and Herald and likewise Forerunner.
ltx/en_us_dedes/me.m06.d24:meMA.Lauds1.greekmelody	@ltx/en_us_dedes/he.a.m8:heAU.OTouParadoxou.greekname
ltx/en_us_dedes/me.m06.d24:meMA.Lauds1.incipit	What a paradoxal miracle! *…
ltx/en_us_dedes/me.m06.d24:meMA.Lauds1.melody	@ltx/en_us_dedes/he.a.m8:heAU.OTouParadoxou.name
ltx/en_us_dedes/me.m06.d24:meMA.Lauds1.mode	@ltx/en_us_dedes/miscellanea:misc.Mode8
ltx/en_us_dedes/me.m06.d24:meMA.Lauds1.text	What a paradoxal miracle! * The holy Forerunner John, * as the herald of God the Word, * hastens to come forth today * from his elderly mother’s womb. * And by his birth he renders his father’s tongue, * that had been fettered, distinctly eloquent. * Truly ineffable, * Master, is Your providence! By which, O Christ, * save our souls, as You alone * are One compassionate.
ltx/en_us_dedes/me.m06.d24:meMA.Lauds2.incipit	What a paradoxal miracle! *…
ltx/en_us_dedes/me.m06.d24:meMA.Lauds2.melody	@ltx/en_us_dedes/he.a.m8:heAU.OTouParadoxou.name
ltx/en_us_dedes/me.m06.d24:meMA.Lauds2.mode	@ltx/en_us_dedes/miscellanea:misc.Mode8
ltx/en_us_dedes/me.m06.d24:meMA.Lauds2.text	What a paradoxal miracle! * He who is greater than those * born of women and Prophets all * for his mother now dispels * the indictment of barrenness, * as in the spirit and pow’r of Elias he comes, * going before the Lord to prepare His ways. * Truly unutterable, * Master, is Your tender love. By which, O Christ, * save our souls, as You alone * are One compassionate.
ltx/en_us_dedes/me.m06.d24:meMA.Lauds3.incipit	What a paradoxal miracle! *…
ltx/en_us_dedes/me.m06.d24:meMA.Lauds3.melody	@ltx/en_us_dedes/he.a.m8:heAU.OTouParadoxou.name
ltx/en_us_dedes/me.m06.d24:meMA.Lauds3.mode	@ltx/en_us_dedes/miscellanea:misc.Mode8
ltx/en_us_dedes/me.m06.d24:meMA.Lauds3.text	What a paradoxal miracle! * He who announced unto all * the kenósis of Christ the Lord * by the Master’s voice is shown * to be greater than everyone. * And he releases Elizabeth’s barrenness * by divine power, and Zachariah’s voice. * Truly magnificent, * Master, are Your miracles. By which, O Christ, * save us who honor Your great * Baptist and Forerunner.
ltx/en_us_dedes/me.m06.d24:meMA.Lauds4.greekmelody	@ltx/en_us_dedes/he.a.m8:heAU.OTouParadoxou.greekname
ltx/en_us_dedes/me.m06.d24:meMA.Lauds4.incipit	What a paradoxal miracle! *…
ltx/en_us_dedes/me.m06.d24:meMA.Lauds4.melody	@ltx/en_us_dedes/he.a.m8:heAU.OTouParadoxou.name
ltx/en_us_dedes/me.m06.d24:meMA.Lauds4.mode	@ltx/en_us_dedes/miscellanea:misc.Mode8
ltx/en_us_dedes/me.m06.d24:meMA.Lauds4.text	What a paradoxal miracle! * He who had leapt in the womb * as the Prophet and Forerunner * now is shown to be the one * who is greatest among those born * of women, higher yet than the Prophets all, * and of the coming of Christ the messenger. * Great and magnificent, * loving Master, are Your gifts! By which, O Christ, * save our souls, as You alone * are the Almighty One.
ltx/en_us_dedes/me.m06.d24:meMA.LaudsGlory.incipit	Star of stars, the Forerunner…
ltx/en_us_dedes/me.m06.d24:meMA.LaudsGlory.melody	@ltx/en_us_dedes/miscellanea:misc.Idiomelon
ltx/en_us_dedes/me.m06.d24:meMA.LaudsGlory.mode	@ltx/en_us_dedes/miscellanea:misc.Mode6
ltx/en_us_dedes/me.m06.d24:meMA.LaudsGlory.poet	@ltx/en_us_dedes/poets:po.Anatoliou
ltx/en_us_dedes/me.m06.d24:meMA.LaudsGlory.text	Star of stars, the Forerunner, from a barren womb is born on earth today: John, yes, John loved by God. And he manifests the resplendent dawning of Christ, the Orient from on high, for the straight passage of the faithful.
ltx/en_us_dedes/me.m06.d24:meMA.LaudsTheotokion.incipit	@ltx/en_us_dedes/he.o:heOT.TheotokeSyEi.incipit
ltx/en_us_dedes/me.m06.d24:meMA.LaudsTheotokion.melody	@ltx/en_us_dedes/he.o:heOT.TheotokeSyEi.name
ltx/en_us_dedes/me.m06.d24:meMA.LaudsTheotokion.mode	@ltx/en_us_dedes/miscellanea:misc.Mode6
ltx/en_us_dedes/me.m06.d24:meMA.LaudsTheotokion.text	@ltx/en_us_dedes/he.o:heOT.TheotokeSyEiProdromou.text
ltx/en_us_dedes/me.m06.d24:meMA.MM.Lauds1234as5678.text	@ltx/en_us_dedes/properties:media.key
ltx/en_us_dedes/me.m06.d24:meMA.Ode1C11.greekmelody	@ltx/en_us_dedes/he.h.m4:heHE.TristatasKrataious.greekname
ltx/en_us_dedes/me.m06.d24:meMA.Ode1C11.incipit	…
ltx/en_us_dedes/me.m06.d24:meMA.Ode1C11.melody	@ltx/en_us_dedes/he.h.m4:heHE.TristatasKrataious.name
ltx/en_us_dedes/me.m06.d24:meMA.Ode1C11.mode	@ltx/en_us_dedes/miscellanea:misc.Mode4
ltx/en_us_dedes/me.m06.d24:meMA.Ode1C11.ode	@ltx/en_us_dedes/miscellanea:misc.Ode1
ltx/en_us_dedes/me.m06.d24:meMA.Ode1C11.text	
ltx/en_us_dedes/me.m06.d24:meMA.Ode1C12.incipit	…
ltx/en_us_dedes/me.m06.d24:meMA.Ode1C12.melody	@ltx/en_us_dedes/he.h.m4:heHE.TristatasKrataious.name
ltx/en_us_dedes/me.m06.d24:meMA.Ode1C12.mode	@ltx/en_us_dedes/miscellanea:misc.Mode4
ltx/en_us_dedes/me.m06.d24:meMA.Ode1C12.ode	@ltx/en_us_dedes/miscellanea:misc.Ode1
ltx/en_us_dedes/me.m06.d24:meMA.Ode1C12.text	
ltx/en_us_dedes/me.m06.d24:meMA.Ode1C13.incipit	…
ltx/en_us_dedes/me.m06.d24:meMA.Ode1C13.melody	@ltx/en_us_dedes/he.h.m4:heHE.TristatasKrataious.name
ltx/en_us_dedes/me.m06.d24:meMA.Ode1C13.mode	@ltx/en_us_dedes/miscellanea:misc.Mode4
ltx/en_us_dedes/me.m06.d24:meMA.Ode1C13.ode	@ltx/en_us_dedes/miscellanea:misc.Ode1
ltx/en_us_dedes/me.m06.d24:meMA.Ode1C13.text	
ltx/en_us_dedes/me.m06.d24:meMA.Ode1C1H.greekmelody	@ltx/en_us_dedes/he.h.m4:heHE.TristatasKrataious.greekname
ltx/en_us_dedes/me.m06.d24:meMA.Ode1C1H.incipit	@ltx/en_us_dedes/he.h.m4:heHE.TristatasKrataious.incipit
ltx/en_us_dedes/me.m06.d24:meMA.Ode1C1H.melody	@ltx/en_us_dedes/he.h.m4:heHE.TristatasKrataious.melody
ltx/en_us_dedes/me.m06.d24:meMA.Ode1C1H.mode	@ltx/en_us_dedes/miscellanea:misc.Mode4
ltx/en_us_dedes/me.m06.d24:meMA.Ode1C1H.ode	@ltx/en_us_dedes/miscellanea:misc.Ode1
ltx/en_us_dedes/me.m06.d24:meMA.Ode1C1H.text	@ltx/en_us_dedes/he.h.m4:heHE.TristatasKrataious.text
ltx/en_us_dedes/me.m06.d24:meMA.Ode1C1T.incipit	…
ltx/en_us_dedes/me.m06.d24:meMA.Ode1C1T.melody	@ltx/en_us_dedes/he.h.m4:heHE.TristatasKrataious.name
ltx/en_us_dedes/me.m06.d24:meMA.Ode1C1T.mode	@ltx/en_us_dedes/miscellanea:misc.Mode4
ltx/en_us_dedes/me.m06.d24:meMA.Ode1C1T.ode	@ltx/en_us_dedes/miscellanea:misc.Ode1
ltx/en_us_dedes/me.m06.d24:meMA.Ode1C1T.text	
ltx/en_us_dedes/me.m06.d24:meMA.Ode1C21.greekmelody	@ltx/en_us_dedes/he.h.m4:heHE.AnoixoToStomaMou.greekname
ltx/en_us_dedes/me.m06.d24:meMA.Ode1C21.incipit	Enhanced by the Spirit’s grace…
ltx/en_us_dedes/me.m06.d24:meMA.Ode1C21.melody	@ltx/en_us_dedes/he.h.m4:heHE.AnoixoToStomaMou.name
ltx/en_us_dedes/me.m06.d24:meMA.Ode1C21.mode	@ltx/en_us_dedes/miscellanea:misc.Mode4
ltx/en_us_dedes/me.m06.d24:meMA.Ode1C21.ode	@ltx/en_us_dedes/miscellanea:misc.Ode1
ltx/en_us_dedes/me.m06.d24:meMA.Ode1C21.text	Enhanced by the Spirit’s grace, * the Church is gaily adorned today. * And beaming with utter joy, * she beautifies herself, * as she celebrates * the feast of John the Baptist’s * Nativity cheerfully, * singing resoundingly.
ltx/en_us_dedes/me.m06.d24:meMA.Ode1C22.incipit	The Herald of grace who…
ltx/en_us_dedes/me.m06.d24:meMA.Ode1C22.melody	@ltx/en_us_dedes/he.h.m4:heHE.AnoixoToStomaMou.name
ltx/en_us_dedes/me.m06.d24:meMA.Ode1C22.mode	@ltx/en_us_dedes/miscellanea:misc.Mode4
ltx/en_us_dedes/me.m06.d24:meMA.Ode1C22.ode	@ltx/en_us_dedes/miscellanea:misc.Ode1
ltx/en_us_dedes/me.m06.d24:meMA.Ode1C22.text	The Herald of grace who is * brighter himself than the morning star * discloses the Sun of glory by his birth today. * And he now proclaims * the Sun’s illumination * that will brightly shine upon * the ends of all the earth.
ltx/en_us_dedes/me.m06.d24:meMA.Ode1C23.incipit	The dark night of godlessness…
ltx/en_us_dedes/me.m06.d24:meMA.Ode1C23.melody	@ltx/en_us_dedes/he.h.m4:heHE.AnoixoToStomaMou.name
ltx/en_us_dedes/me.m06.d24:meMA.Ode1C23.mode	@ltx/en_us_dedes/miscellanea:misc.Mode4
ltx/en_us_dedes/me.m06.d24:meMA.Ode1C23.ode	@ltx/en_us_dedes/miscellanea:misc.Ode1
ltx/en_us_dedes/me.m06.d24:meMA.Ode1C23.text	The dark night of godlessness * is by your birth, holy Forerunner, * dispelled and expelled from earth. * And now the rays of grace * over all the world * are spreading. For, O Prophet, * you proclaim the rising of * the never-setting Sun.
ltx/en_us_dedes/me.m06.d24:meMA.Ode1C2T.incipit	The barren one’s pregnancy, *…
ltx/en_us_dedes/me.m06.d24:meMA.Ode1C2T.melody	@ltx/en_us_dedes/he.h.m4:heHE.AnoixoToStomaMou.name
ltx/en_us_dedes/me.m06.d24:meMA.Ode1C2T.mode	@ltx/en_us_dedes/miscellanea:misc.Mode4
ltx/en_us_dedes/me.m06.d24:meMA.Ode1C2T.ode	@ltx/en_us_dedes/miscellanea:misc.Ode1
ltx/en_us_dedes/me.m06.d24:meMA.Ode1C2T.text	The barren one’s pregnancy, * O Virgin pure and immaculate, * betokens the knowledge of * your own conceiving as well. * And it signifies * and presages your childbirth * without seed. For it produced * fruit from a fruitless womb.
ltx/en_us_dedes/me.m06.d24:meMA.Ode3C11.greekmelody	@ltx/en_us_dedes/he.h.m4:heHE.OukEnSofia.greekname
ltx/en_us_dedes/me.m06.d24:meMA.Ode3C11.incipit	…
ltx/en_us_dedes/me.m06.d24:meMA.Ode3C11.melody	@ltx/en_us_dedes/he.h.m4:heHE.OukEnSofia.name
ltx/en_us_dedes/me.m06.d24:meMA.Ode3C11.mode	@ltx/en_us_dedes/miscellanea:misc.Mode4
ltx/en_us_dedes/me.m06.d24:meMA.Ode3C11.ode	@ltx/en_us_dedes/miscellanea:misc.Ode3
ltx/en_us_dedes/me.m06.d24:meMA.Ode3C11.text	
ltx/en_us_dedes/me.m06.d24:meMA.Ode3C12.incipit	…
ltx/en_us_dedes/me.m06.d24:meMA.Ode3C12.melody	@ltx/en_us_dedes/he.h.m4:heHE.OukEnSofia.name
ltx/en_us_dedes/me.m06.d24:meMA.Ode3C12.mode	@ltx/en_us_dedes/miscellanea:misc.Mode4
ltx/en_us_dedes/me.m06.d24:meMA.Ode3C12.ode	@ltx/en_us_dedes/miscellanea:misc.Ode3
ltx/en_us_dedes/me.m06.d24:meMA.Ode3C12.text	
ltx/en_us_dedes/me.m06.d24:meMA.Ode3C1H.greekmelody	@ltx/en_us_dedes/he.h.m4:heHE.OukEnSofia.greekname
ltx/en_us_dedes/me.m06.d24:meMA.Ode3C1H.incipit	@ltx/en_us_dedes/he.h.m4:heHE.OukEnSofia.incipit
ltx/en_us_dedes/me.m06.d24:meMA.Ode3C1H.melody	@ltx/en_us_dedes/he.h.m4:heHE.OukEnSofia.melody
ltx/en_us_dedes/me.m06.d24:meMA.Ode3C1H.mode	@ltx/en_us_dedes/miscellanea:misc.Mode4
ltx/en_us_dedes/me.m06.d24:meMA.Ode3C1H.ode	@ltx/en_us_dedes/miscellanea:misc.Ode3
ltx/en_us_dedes/me.m06.d24:meMA.Ode3C1H.text	@ltx/en_us_dedes/he.h.m4:heHE.OukEnSofia.text
ltx/en_us_dedes/me.m06.d24:meMA.Ode3C1T.incipit	…
ltx/en_us_dedes/me.m06.d24:meMA.Ode3C1T.melody	@ltx/en_us_dedes/he.h.m4:heHE.OukEnSofia.name
ltx/en_us_dedes/me.m06.d24:meMA.Ode3C1T.mode	@ltx/en_us_dedes/miscellanea:misc.Mode4
ltx/en_us_dedes/me.m06.d24:meMA.Ode3C1T.ode	@ltx/en_us_dedes/miscellanea:misc.Ode3
ltx/en_us_dedes/me.m06.d24:meMA.Ode3C1T.text	
ltx/en_us_dedes/me.m06.d24:meMA.Ode3C21.greekmelody	@ltx/en_us_dedes/he.h.m4:heHE.TousSousYmnologous.greekname
ltx/en_us_dedes/me.m06.d24:meMA.Ode3C21.incipit	Word of your delivery, O…
ltx/en_us_dedes/me.m06.d24:meMA.Ode3C21.melody	@ltx/en_us_dedes/he.h.m4:heHE.TousSousYmnologous.name
ltx/en_us_dedes/me.m06.d24:meMA.Ode3C21.mode	@ltx/en_us_dedes/miscellanea:misc.Mode4
ltx/en_us_dedes/me.m06.d24:meMA.Ode3C21.ode	@ltx/en_us_dedes/miscellanea:misc.Ode3
ltx/en_us_dedes/me.m06.d24:meMA.Ode3C21.text	Word of your delivery, O Baptist, * from the barren woman loosed the bonds * of silence from your father’s voice. * And hence the condescension of Christ, * which is incomprehensible, * is now foretokened with signs from God.
ltx/en_us_dedes/me.m06.d24:meMA.Ode3C22.incipit	The offspring that sprouted from…
ltx/en_us_dedes/me.m06.d24:meMA.Ode3C22.melody	@ltx/en_us_dedes/he.h.m4:heHE.TousSousYmnologous.name
ltx/en_us_dedes/me.m06.d24:meMA.Ode3C22.mode	@ltx/en_us_dedes/miscellanea:misc.Mode4
ltx/en_us_dedes/me.m06.d24:meMA.Ode3C22.ode	@ltx/en_us_dedes/miscellanea:misc.Ode3
ltx/en_us_dedes/me.m06.d24:meMA.Ode3C22.text	The offspring that sprouted from the fruitless * barren woman, who himself declares * the fruitfulness attained in Christ, * cut down the unproductive and * unfruitful folly of the Jews, * using the axe of the words he preached.
ltx/en_us_dedes/me.m06.d24:meMA.Ode3C23.incipit	Rays of the new grace…
ltx/en_us_dedes/me.m06.d24:meMA.Ode3C23.melody	@ltx/en_us_dedes/he.h.m4:heHE.TousSousYmnologous.name
ltx/en_us_dedes/me.m06.d24:meMA.Ode3C23.mode	@ltx/en_us_dedes/miscellanea:misc.Mode4
ltx/en_us_dedes/me.m06.d24:meMA.Ode3C23.ode	@ltx/en_us_dedes/miscellanea:misc.Ode3
ltx/en_us_dedes/me.m06.d24:meMA.Ode3C23.text	Rays of the new grace have brightly shone forth, * O Forerunner, by your birth today. * And now the old enigmas and types * according to the letter of * the Scriptures, like a shadow have * begun withdrawing before the light.
ltx/en_us_dedes/me.m06.d24:meMA.Ode3C2T.incipit	The Son whom you bore…
ltx/en_us_dedes/me.m06.d24:meMA.Ode3C2T.melody	@ltx/en_us_dedes/he.h.m4:heHE.TousSousYmnologous.name
ltx/en_us_dedes/me.m06.d24:meMA.Ode3C2T.mode	@ltx/en_us_dedes/miscellanea:misc.Mode4
ltx/en_us_dedes/me.m06.d24:meMA.Ode3C2T.ode	@ltx/en_us_dedes/miscellanea:misc.Ode3
ltx/en_us_dedes/me.m06.d24:meMA.Ode3C2T.text	The Son whom you bore, all-holy Virgin, * released human nature from the bonds * of condemnation; and instead * He bonded us, by grace, to himself, * bestowing blessings onto all, * O Theotokos, who honor you.
ltx/en_us_dedes/me.m06.d24:meMA.Ode3Kathisma1.greekmelody	@ltx/en_us_dedes/he.a.m4:heAU.KateplagiIosif.greekname
ltx/en_us_dedes/me.m06.d24:meMA.Ode3Kathisma1.incipit	As a radiating sun *…
ltx/en_us_dedes/me.m06.d24:meMA.Ode3Kathisma1.melody	@ltx/en_us_dedes/he.a.m4:heAU.KateplagiIosif.name
ltx/en_us_dedes/me.m06.d24:meMA.Ode3Kathisma1.mode	@ltx/en_us_dedes/miscellanea:misc.Mode4
ltx/en_us_dedes/me.m06.d24:meMA.Ode3Kathisma1.text	As a radiating sun * did Zacharias’s son * rise upon us on the earth * out of Elizabeth’s womb. * He puts an end to his father’s voicelessness. * And boldly he cries out * and very openly says * to the peoples of the world: * “Make straight the ways of the Lord. * For He is surely coming and will save those * who in repentance return to Him.” * O John the Baptist, since you announced Him, * also entreat Him to save our souls.
ltx/en_us_dedes/me.m06.d24:meMA.Ode3KathismaT.incipit	O most pure and spotless…
ltx/en_us_dedes/me.m06.d24:meMA.Ode3KathismaT.melody	@ltx/en_us_dedes/he.a.m4:heAU.KateplagiIosif.name
ltx/en_us_dedes/me.m06.d24:meMA.Ode3KathismaT.mode	@ltx/en_us_dedes/miscellanea:misc.Mode4
ltx/en_us_dedes/me.m06.d24:meMA.Ode3KathismaT.text	O most pure and spotless Maid, * the awesome mystery * of your childbirth amazed * the hosts of Angels all: * how He who holds all things together by will alone * is held in your embrace * as a human being; * how the Pre-eternal Lord * accepts an origin; * how He who nourishes all breathing creatures * out of His goodness is nursed by you! * Hence they extol you and glorify you * for being truly the Mother of God.
ltx/en_us_dedes/me.m06.d24:meMA.Ode4C11.greekmelody	@ltx/en_us_dedes/he.h.m4:heHE.OKathimenosEnDoxi.greekname
ltx/en_us_dedes/me.m06.d24:meMA.Ode4C11.incipit	…
ltx/en_us_dedes/me.m06.d24:meMA.Ode4C11.melody	@ltx/en_us_dedes/he.h.m4:heHE.OKathimenosEnDoxi.name
ltx/en_us_dedes/me.m06.d24:meMA.Ode4C11.mode	@ltx/en_us_dedes/miscellanea:misc.Mode4
ltx/en_us_dedes/me.m06.d24:meMA.Ode4C11.ode	@ltx/en_us_dedes/miscellanea:misc.Ode4
ltx/en_us_dedes/me.m06.d24:meMA.Ode4C11.text	
ltx/en_us_dedes/me.m06.d24:meMA.Ode4C12.incipit	…
ltx/en_us_dedes/me.m06.d24:meMA.Ode4C12.melody	@ltx/en_us_dedes/he.h.m4:heHE.OKathimenosEnDoxi.name
ltx/en_us_dedes/me.m06.d24:meMA.Ode4C12.mode	@ltx/en_us_dedes/miscellanea:misc.Mode4
ltx/en_us_dedes/me.m06.d24:meMA.Ode4C12.ode	@ltx/en_us_dedes/miscellanea:misc.Ode4
ltx/en_us_dedes/me.m06.d24:meMA.Ode4C12.text	
ltx/en_us_dedes/me.m06.d24:meMA.Ode4C13.incipit	…
ltx/en_us_dedes/me.m06.d24:meMA.Ode4C13.melody	@ltx/en_us_dedes/he.h.m4:heHE.OKathimenosEnDoxi.name
ltx/en_us_dedes/me.m06.d24:meMA.Ode4C13.mode	@ltx/en_us_dedes/miscellanea:misc.Mode4
ltx/en_us_dedes/me.m06.d24:meMA.Ode4C13.ode	@ltx/en_us_dedes/miscellanea:misc.Ode4
ltx/en_us_dedes/me.m06.d24:meMA.Ode4C13.text	
ltx/en_us_dedes/me.m06.d24:meMA.Ode4C1H.greekmelody	@ltx/en_us_dedes/he.h.m4:heHE.OKathimenosEnDoxi.greekname
ltx/en_us_dedes/me.m06.d24:meMA.Ode4C1H.incipit	@ltx/en_us_dedes/he.h.m4:heHE.OKathimenosEnDoxi.incipit
ltx/en_us_dedes/me.m06.d24:meMA.Ode4C1H.melody	@ltx/en_us_dedes/he.h.m4:heHE.OKathimenosEnDoxi.melody
ltx/en_us_dedes/me.m06.d24:meMA.Ode4C1H.mode	@ltx/en_us_dedes/miscellanea:misc.Mode4
ltx/en_us_dedes/me.m06.d24:meMA.Ode4C1H.ode	@ltx/en_us_dedes/miscellanea:misc.Ode4
ltx/en_us_dedes/me.m06.d24:meMA.Ode4C1H.text	@ltx/en_us_dedes/he.h.m4:heHE.OKathimenosEnDoxi.text
ltx/en_us_dedes/me.m06.d24:meMA.Ode4C1T.incipit	…
ltx/en_us_dedes/me.m06.d24:meMA.Ode4C1T.melody	@ltx/en_us_dedes/he.h.m4:heHE.OKathimenosEnDoxi.name
ltx/en_us_dedes/me.m06.d24:meMA.Ode4C1T.mode	@ltx/en_us_dedes/miscellanea:misc.Mode4
ltx/en_us_dedes/me.m06.d24:meMA.Ode4C1T.ode	@ltx/en_us_dedes/miscellanea:misc.Ode4
ltx/en_us_dedes/me.m06.d24:meMA.Ode4C1T.text	
ltx/en_us_dedes/me.m06.d24:meMA.Ode4C21.greekmelody	@ltx/en_us_dedes/he.h.m4:heHE.TinAnexichniaston.greekname
ltx/en_us_dedes/me.m06.d24:meMA.Ode4C21.incipit	…
ltx/en_us_dedes/me.m06.d24:meMA.Ode4C21.melody	@ltx/en_us_dedes/he.h.m4:heHE.TinAnexichniaston.name
ltx/en_us_dedes/me.m06.d24:meMA.Ode4C21.mode	@ltx/en_us_dedes/miscellanea:misc.Mode4
ltx/en_us_dedes/me.m06.d24:meMA.Ode4C21.ode	@ltx/en_us_dedes/miscellanea:misc.Ode4
ltx/en_us_dedes/me.m06.d24:meMA.Ode4C21.text	
ltx/en_us_dedes/me.m06.d24:meMA.Ode4C22.incipit	…
ltx/en_us_dedes/me.m06.d24:meMA.Ode4C22.melody	@ltx/en_us_dedes/he.h.m4:heHE.TinAnexichniaston.name
ltx/en_us_dedes/me.m06.d24:meMA.Ode4C22.mode	@ltx/en_us_dedes/miscellanea:misc.Mode4
ltx/en_us_dedes/me.m06.d24:meMA.Ode4C22.ode	@ltx/en_us_dedes/miscellanea:misc.Ode4
ltx/en_us_dedes/me.m06.d24:meMA.Ode4C22.text	
ltx/en_us_dedes/me.m06.d24:meMA.Ode4C23.incipit	…
ltx/en_us_dedes/me.m06.d24:meMA.Ode4C23.melody	@ltx/en_us_dedes/he.h.m4:heHE.TinAnexichniaston.name
ltx/en_us_dedes/me.m06.d24:meMA.Ode4C23.mode	@ltx/en_us_dedes/miscellanea:misc.Mode4
ltx/en_us_dedes/me.m06.d24:meMA.Ode4C23.ode	@ltx/en_us_dedes/miscellanea:misc.Ode4
ltx/en_us_dedes/me.m06.d24:meMA.Ode4C23.text	
ltx/en_us_dedes/me.m06.d24:meMA.Ode4C2T.incipit	…
ltx/en_us_dedes/me.m06.d24:meMA.Ode4C2T.melody	@ltx/en_us_dedes/he.h.m4:heHE.TinAnexichniaston.name
ltx/en_us_dedes/me.m06.d24:meMA.Ode4C2T.mode	@ltx/en_us_dedes/miscellanea:misc.Mode4
ltx/en_us_dedes/me.m06.d24:meMA.Ode4C2T.ode	@ltx/en_us_dedes/miscellanea:misc.Ode4
ltx/en_us_dedes/me.m06.d24:meMA.Ode4C2T.text	
ltx/en_us_dedes/me.m06.d24:meMA.Ode5C11.greekmelody	@ltx/en_us_dedes/he.h.m4:heHE.NynAnastisomai.greekname
ltx/en_us_dedes/me.m06.d24:meMA.Ode5C11.incipit	…
ltx/en_us_dedes/me.m06.d24:meMA.Ode5C11.melody	@ltx/en_us_dedes/he.h.m4:heHE.NynAnastisomai.name
ltx/en_us_dedes/me.m06.d24:meMA.Ode5C11.mode	@ltx/en_us_dedes/miscellanea:misc.Mode4
ltx/en_us_dedes/me.m06.d24:meMA.Ode5C11.ode	@ltx/en_us_dedes/miscellanea:misc.Ode5
ltx/en_us_dedes/me.m06.d24:meMA.Ode5C11.text	
ltx/en_us_dedes/me.m06.d24:meMA.Ode5C12.incipit	…
ltx/en_us_dedes/me.m06.d24:meMA.Ode5C12.melody	@ltx/en_us_dedes/he.h.m4:heHE.NynAnastisomai.name
ltx/en_us_dedes/me.m06.d24:meMA.Ode5C12.mode	@ltx/en_us_dedes/miscellanea:misc.Mode4
ltx/en_us_dedes/me.m06.d24:meMA.Ode5C12.ode	@ltx/en_us_dedes/miscellanea:misc.Ode5
ltx/en_us_dedes/me.m06.d24:meMA.Ode5C12.text	
ltx/en_us_dedes/me.m06.d24:meMA.Ode5C13.incipit	…
ltx/en_us_dedes/me.m06.d24:meMA.Ode5C13.melody	@ltx/en_us_dedes/he.h.m4:heHE.NynAnastisomai.name
ltx/en_us_dedes/me.m06.d24:meMA.Ode5C13.mode	@ltx/en_us_dedes/miscellanea:misc.Mode4
ltx/en_us_dedes/me.m06.d24:meMA.Ode5C13.ode	@ltx/en_us_dedes/miscellanea:misc.Ode5
ltx/en_us_dedes/me.m06.d24:meMA.Ode5C13.text	
ltx/en_us_dedes/me.m06.d24:meMA.Ode5C1H.greekmelody	@ltx/en_us_dedes/he.h.m4:heHE.NynAnastisomai.greekname
ltx/en_us_dedes/me.m06.d24:meMA.Ode5C1H.incipit	@ltx/en_us_dedes/he.h.m4:heHE.NynAnastisomai.incipit
ltx/en_us_dedes/me.m06.d24:meMA.Ode5C1H.melody	@ltx/en_us_dedes/he.h.m4:heHE.NynAnastisomai.melody
ltx/en_us_dedes/me.m06.d24:meMA.Ode5C1H.mode	@ltx/en_us_dedes/miscellanea:misc.Mode4
ltx/en_us_dedes/me.m06.d24:meMA.Ode5C1H.ode	@ltx/en_us_dedes/miscellanea:misc.Ode5
ltx/en_us_dedes/me.m06.d24:meMA.Ode5C1H.text	@ltx/en_us_dedes/he.h.m4:heHE.NynAnastisomai.text
ltx/en_us_dedes/me.m06.d24:meMA.Ode5C1T.incipit	…
ltx/en_us_dedes/me.m06.d24:meMA.Ode5C1T.melody	@ltx/en_us_dedes/he.h.m4:heHE.NynAnastisomai.name
ltx/en_us_dedes/me.m06.d24:meMA.Ode5C1T.mode	@ltx/en_us_dedes/miscellanea:misc.Mode4
ltx/en_us_dedes/me.m06.d24:meMA.Ode5C1T.ode	@ltx/en_us_dedes/miscellanea:misc.Ode5
ltx/en_us_dedes/me.m06.d24:meMA.Ode5C1T.text	
ltx/en_us_dedes/me.m06.d24:meMA.Ode5C21.greekmelody	@ltx/en_us_dedes/he.h.m4:heHE.ExestiTaSympanta.greekname
ltx/en_us_dedes/me.m06.d24:meMA.Ode5C21.incipit	…
ltx/en_us_dedes/me.m06.d24:meMA.Ode5C21.melody	@ltx/en_us_dedes/he.h.m4:heHE.ExestiTaSympanta.name
ltx/en_us_dedes/me.m06.d24:meMA.Ode5C21.mode	@ltx/en_us_dedes/miscellanea:misc.Mode4
ltx/en_us_dedes/me.m06.d24:meMA.Ode5C21.ode	@ltx/en_us_dedes/miscellanea:misc.Ode5
ltx/en_us_dedes/me.m06.d24:meMA.Ode5C21.text	
ltx/en_us_dedes/me.m06.d24:meMA.Ode5C22.incipit	…
ltx/en_us_dedes/me.m06.d24:meMA.Ode5C22.melody	@ltx/en_us_dedes/he.h.m4:heHE.ExestiTaSympanta.name
ltx/en_us_dedes/me.m06.d24:meMA.Ode5C22.mode	@ltx/en_us_dedes/miscellanea:misc.Mode4
ltx/en_us_dedes/me.m06.d24:meMA.Ode5C22.ode	@ltx/en_us_dedes/miscellanea:misc.Ode5
ltx/en_us_dedes/me.m06.d24:meMA.Ode5C22.text	
ltx/en_us_dedes/me.m06.d24:meMA.Ode5C23.incipit	…
ltx/en_us_dedes/me.m06.d24:meMA.Ode5C23.melody	@ltx/en_us_dedes/he.h.m4:heHE.ExestiTaSympanta.name
ltx/en_us_dedes/me.m06.d24:meMA.Ode5C23.mode	@ltx/en_us_dedes/miscellanea:misc.Mode4
ltx/en_us_dedes/me.m06.d24:meMA.Ode5C23.ode	@ltx/en_us_dedes/miscellanea:misc.Ode5
ltx/en_us_dedes/me.m06.d24:meMA.Ode5C23.text	
ltx/en_us_dedes/me.m06.d24:meMA.Ode5C2T.incipit	…
ltx/en_us_dedes/me.m06.d24:meMA.Ode5C2T.melody	@ltx/en_us_dedes/he.h.m4:heHE.ExestiTaSympanta.name
ltx/en_us_dedes/me.m06.d24:meMA.Ode5C2T.mode	@ltx/en_us_dedes/miscellanea:misc.Mode4
ltx/en_us_dedes/me.m06.d24:meMA.Ode5C2T.ode	@ltx/en_us_dedes/miscellanea:misc.Ode5
ltx/en_us_dedes/me.m06.d24:meMA.Ode5C2T.text	
ltx/en_us_dedes/me.m06.d24:meMA.Ode6C11.greekmelody	@ltx/en_us_dedes/he.h.m4:heHE.IlthonEisTaVathi.greekname
ltx/en_us_dedes/me.m06.d24:meMA.Ode6C11.incipit	…
ltx/en_us_dedes/me.m06.d24:meMA.Ode6C11.melody	@ltx/en_us_dedes/he.h.m4:heHE.IlthonEisTaVathi.name
ltx/en_us_dedes/me.m06.d24:meMA.Ode6C11.mode	@ltx/en_us_dedes/miscellanea:misc.Mode4
ltx/en_us_dedes/me.m06.d24:meMA.Ode6C11.ode	@ltx/en_us_dedes/miscellanea:misc.Ode6
ltx/en_us_dedes/me.m06.d24:meMA.Ode6C11.text	
ltx/en_us_dedes/me.m06.d24:meMA.Ode6C12.incipit	…
ltx/en_us_dedes/me.m06.d24:meMA.Ode6C12.melody	@ltx/en_us_dedes/he.h.m4:heHE.IlthonEisTaVathi.name
ltx/en_us_dedes/me.m06.d24:meMA.Ode6C12.mode	@ltx/en_us_dedes/miscellanea:misc.Mode4
ltx/en_us_dedes/me.m06.d24:meMA.Ode6C12.ode	@ltx/en_us_dedes/miscellanea:misc.Ode6
ltx/en_us_dedes/me.m06.d24:meMA.Ode6C12.text	
ltx/en_us_dedes/me.m06.d24:meMA.Ode6C1H.greekmelody	@ltx/en_us_dedes/he.h.m4:heHE.IlthonEisTaVathi.greekname
ltx/en_us_dedes/me.m06.d24:meMA.Ode6C1H.incipit	@ltx/en_us_dedes/he.h.m4:heHE.IlthonEisTaVathi.incipit
ltx/en_us_dedes/me.m06.d24:meMA.Ode6C1H.melody	@ltx/en_us_dedes/he.h.m4:heHE.IlthonEisTaVathi.melody
ltx/en_us_dedes/me.m06.d24:meMA.Ode6C1H.mode	@ltx/en_us_dedes/miscellanea:misc.Mode4
ltx/en_us_dedes/me.m06.d24:meMA.Ode6C1H.ode	@ltx/en_us_dedes/miscellanea:misc.Ode6
ltx/en_us_dedes/me.m06.d24:meMA.Ode6C1H.text	@ltx/en_us_dedes/he.h.m4:heHE.IlthonEisTaVathi.text
ltx/en_us_dedes/me.m06.d24:meMA.Ode6C1T.incipit	…
ltx/en_us_dedes/me.m06.d24:meMA.Ode6C1T.melody	@ltx/en_us_dedes/he.h.m4:heHE.IlthonEisTaVathi.name
ltx/en_us_dedes/me.m06.d24:meMA.Ode6C1T.mode	@ltx/en_us_dedes/miscellanea:misc.Mode4
ltx/en_us_dedes/me.m06.d24:meMA.Ode6C1T.ode	@ltx/en_us_dedes/miscellanea:misc.Ode6
ltx/en_us_dedes/me.m06.d24:meMA.Ode6C1T.text	
ltx/en_us_dedes/me.m06.d24:meMA.Ode6C21.greekmelody	@ltx/en_us_dedes/he.h.m4:heHE.TinTheianTaftin.greekname
ltx/en_us_dedes/me.m06.d24:meMA.Ode6C21.incipit	…
ltx/en_us_dedes/me.m06.d24:meMA.Ode6C21.melody	@ltx/en_us_dedes/he.h.m4:heHE.TinTheianTaftin.name
ltx/en_us_dedes/me.m06.d24:meMA.Ode6C21.mode	@ltx/en_us_dedes/miscellanea:misc.Mode4
ltx/en_us_dedes/me.m06.d24:meMA.Ode6C21.ode	@ltx/en_us_dedes/miscellanea:misc.Ode6
ltx/en_us_dedes/me.m06.d24:meMA.Ode6C21.text	
ltx/en_us_dedes/me.m06.d24:meMA.Ode6C22.incipit	…
ltx/en_us_dedes/me.m06.d24:meMA.Ode6C22.melody	@ltx/en_us_dedes/he.h.m4:heHE.TinTheianTaftin.name
ltx/en_us_dedes/me.m06.d24:meMA.Ode6C22.mode	@ltx/en_us_dedes/miscellanea:misc.Mode4
ltx/en_us_dedes/me.m06.d24:meMA.Ode6C22.ode	@ltx/en_us_dedes/miscellanea:misc.Ode6
ltx/en_us_dedes/me.m06.d24:meMA.Ode6C22.text	
ltx/en_us_dedes/me.m06.d24:meMA.Ode6C23.incipit	…
ltx/en_us_dedes/me.m06.d24:meMA.Ode6C23.melody	@ltx/en_us_dedes/he.h.m4:heHE.TinTheianTaftin.name
ltx/en_us_dedes/me.m06.d24:meMA.Ode6C23.mode	@ltx/en_us_dedes/miscellanea:misc.Mode4
ltx/en_us_dedes/me.m06.d24:meMA.Ode6C23.ode	@ltx/en_us_dedes/miscellanea:misc.Ode6
ltx/en_us_dedes/me.m06.d24:meMA.Ode6C23.text	
ltx/en_us_dedes/me.m06.d24:meMA.Ode6C2T.incipit	…
ltx/en_us_dedes/me.m06.d24:meMA.Ode6C2T.melody	@ltx/en_us_dedes/he.h.m4:heHE.TinTheianTaftin.name
ltx/en_us_dedes/me.m06.d24:meMA.Ode6C2T.mode	@ltx/en_us_dedes/miscellanea:misc.Mode4
ltx/en_us_dedes/me.m06.d24:meMA.Ode6C2T.ode	@ltx/en_us_dedes/miscellanea:misc.Ode6
ltx/en_us_dedes/me.m06.d24:meMA.Ode6C2T.text	
ltx/en_us_dedes/me.m06.d24:meMA.Ode7C11.greekmelody	@ltx/en_us_dedes/he.h.m4:heHE.NeoiTreisEnVavyloni.greekname
ltx/en_us_dedes/me.m06.d24:meMA.Ode7C11.incipit	…
ltx/en_us_dedes/me.m06.d24:meMA.Ode7C11.melody	@ltx/en_us_dedes/he.h.m4:heHE.NeoiTreisEnVavyloni.name
ltx/en_us_dedes/me.m06.d24:meMA.Ode7C11.mode	@ltx/en_us_dedes/miscellanea:misc.Mode4
ltx/en_us_dedes/me.m06.d24:meMA.Ode7C11.ode	@ltx/en_us_dedes/miscellanea:misc.Ode7
ltx/en_us_dedes/me.m06.d24:meMA.Ode7C11.text	
ltx/en_us_dedes/me.m06.d24:meMA.Ode7C12.incipit	…
ltx/en_us_dedes/me.m06.d24:meMA.Ode7C12.melody	@ltx/en_us_dedes/he.h.m4:heHE.NeoiTreisEnVavyloni.name
ltx/en_us_dedes/me.m06.d24:meMA.Ode7C12.mode	@ltx/en_us_dedes/miscellanea:misc.Mode4
ltx/en_us_dedes/me.m06.d24:meMA.Ode7C12.ode	@ltx/en_us_dedes/miscellanea:misc.Ode7
ltx/en_us_dedes/me.m06.d24:meMA.Ode7C12.text	
ltx/en_us_dedes/me.m06.d24:meMA.Ode7C13.incipit	…
ltx/en_us_dedes/me.m06.d24:meMA.Ode7C13.melody	@ltx/en_us_dedes/he.h.m4:heHE.NeoiTreisEnVavyloni.name
ltx/en_us_dedes/me.m06.d24:meMA.Ode7C13.mode	@ltx/en_us_dedes/miscellanea:misc.Mode4
ltx/en_us_dedes/me.m06.d24:meMA.Ode7C13.ode	@ltx/en_us_dedes/miscellanea:misc.Ode7
ltx/en_us_dedes/me.m06.d24:meMA.Ode7C13.text	
ltx/en_us_dedes/me.m06.d24:meMA.Ode7C1H.greekmelody	@ltx/en_us_dedes/he.h.m4:heHE.NeoiTreisEnVavyloni.greekname
ltx/en_us_dedes/me.m06.d24:meMA.Ode7C1H.incipit	@ltx/en_us_dedes/he.h.m4:heHE.NeoiTreisEnVavyloni.incipit
ltx/en_us_dedes/me.m06.d24:meMA.Ode7C1H.melody	@ltx/en_us_dedes/he.h.m4:heHE.NeoiTreisEnVavyloni.melody
ltx/en_us_dedes/me.m06.d24:meMA.Ode7C1H.mode	@ltx/en_us_dedes/miscellanea:misc.Mode4
ltx/en_us_dedes/me.m06.d24:meMA.Ode7C1H.ode	@ltx/en_us_dedes/miscellanea:misc.Ode7
ltx/en_us_dedes/me.m06.d24:meMA.Ode7C1H.text	@ltx/en_us_dedes/he.h.m4:heHE.NeoiTreisEnVavyloni.text
ltx/en_us_dedes/me.m06.d24:meMA.Ode7C1T.incipit	…
ltx/en_us_dedes/me.m06.d24:meMA.Ode7C1T.melody	@ltx/en_us_dedes/he.h.m4:heHE.NeoiTreisEnVavyloni.name
ltx/en_us_dedes/me.m06.d24:meMA.Ode7C1T.mode	@ltx/en_us_dedes/miscellanea:misc.Mode4
ltx/en_us_dedes/me.m06.d24:meMA.Ode7C1T.ode	@ltx/en_us_dedes/miscellanea:misc.Ode7
ltx/en_us_dedes/me.m06.d24:meMA.Ode7C1T.text	
ltx/en_us_dedes/me.m06.d24:meMA.Ode7C21.greekmelody	@ltx/en_us_dedes/he.h.m4:heHE.OukElatrefsan.greekname
ltx/en_us_dedes/me.m06.d24:meMA.Ode7C21.incipit	…
ltx/en_us_dedes/me.m06.d24:meMA.Ode7C21.melody	@ltx/en_us_dedes/he.h.m4:heHE.OukElatrefsan.name
ltx/en_us_dedes/me.m06.d24:meMA.Ode7C21.mode	@ltx/en_us_dedes/miscellanea:misc.Mode4
ltx/en_us_dedes/me.m06.d24:meMA.Ode7C21.ode	@ltx/en_us_dedes/miscellanea:misc.Ode7
ltx/en_us_dedes/me.m06.d24:meMA.Ode7C21.text	
ltx/en_us_dedes/me.m06.d24:meMA.Ode7C22.incipit	…
ltx/en_us_dedes/me.m06.d24:meMA.Ode7C22.melody	@ltx/en_us_dedes/he.h.m4:heHE.OukElatrefsan.name
ltx/en_us_dedes/me.m06.d24:meMA.Ode7C22.mode	@ltx/en_us_dedes/miscellanea:misc.Mode4
ltx/en_us_dedes/me.m06.d24:meMA.Ode7C22.ode	@ltx/en_us_dedes/miscellanea:misc.Ode7
ltx/en_us_dedes/me.m06.d24:meMA.Ode7C22.text	
ltx/en_us_dedes/me.m06.d24:meMA.Ode7C23.incipit	…
ltx/en_us_dedes/me.m06.d24:meMA.Ode7C23.melody	@ltx/en_us_dedes/he.h.m4:heHE.OukElatrefsan.name
ltx/en_us_dedes/me.m06.d24:meMA.Ode7C23.mode	@ltx/en_us_dedes/miscellanea:misc.Mode4
ltx/en_us_dedes/me.m06.d24:meMA.Ode7C23.ode	@ltx/en_us_dedes/miscellanea:misc.Ode7
ltx/en_us_dedes/me.m06.d24:meMA.Ode7C23.text	
ltx/en_us_dedes/me.m06.d24:meMA.Ode7C2T.incipit	…
ltx/en_us_dedes/me.m06.d24:meMA.Ode7C2T.melody	@ltx/en_us_dedes/he.h.m4:heHE.OukElatrefsan.name
ltx/en_us_dedes/me.m06.d24:meMA.Ode7C2T.mode	@ltx/en_us_dedes/miscellanea:misc.Mode4
ltx/en_us_dedes/me.m06.d24:meMA.Ode7C2T.ode	@ltx/en_us_dedes/miscellanea:misc.Ode7
ltx/en_us_dedes/me.m06.d24:meMA.Ode7C2T.text	
ltx/en_us_dedes/me.m06.d24:meMA.Ode8C11.greekmelody	@ltx/en_us_dedes/he.h.m4:heHE.EvergetaChristePantodyname.greekname
ltx/en_us_dedes/me.m06.d24:meMA.Ode8C11.incipit	…
ltx/en_us_dedes/me.m06.d24:meMA.Ode8C11.melody	@ltx/en_us_dedes/he.h.m4:heHE.EvergetaChristePantodyname.name
ltx/en_us_dedes/me.m06.d24:meMA.Ode8C11.mode	@ltx/en_us_dedes/miscellanea:misc.Mode4
ltx/en_us_dedes/me.m06.d24:meMA.Ode8C11.ode	@ltx/en_us_dedes/miscellanea:misc.Ode8
ltx/en_us_dedes/me.m06.d24:meMA.Ode8C11.text	
ltx/en_us_dedes/me.m06.d24:meMA.Ode8C12.incipit	…
ltx/en_us_dedes/me.m06.d24:meMA.Ode8C12.melody	@ltx/en_us_dedes/he.h.m4:heHE.EvergetaChristePantodyname.name
ltx/en_us_dedes/me.m06.d24:meMA.Ode8C12.mode	@ltx/en_us_dedes/miscellanea:misc.Mode4
ltx/en_us_dedes/me.m06.d24:meMA.Ode8C12.ode	@ltx/en_us_dedes/miscellanea:misc.Ode8
ltx/en_us_dedes/me.m06.d24:meMA.Ode8C12.text	
ltx/en_us_dedes/me.m06.d24:meMA.Ode8C13.incipit	…
ltx/en_us_dedes/me.m06.d24:meMA.Ode8C13.melody	@ltx/en_us_dedes/he.h.m4:heHE.EvergetaChristePantodyname.name
ltx/en_us_dedes/me.m06.d24:meMA.Ode8C13.mode	@ltx/en_us_dedes/miscellanea:misc.Mode4
ltx/en_us_dedes/me.m06.d24:meMA.Ode8C13.ode	@ltx/en_us_dedes/miscellanea:misc.Ode8
ltx/en_us_dedes/me.m06.d24:meMA.Ode8C13.text	
ltx/en_us_dedes/me.m06.d24:meMA.Ode8C1H.greekmelody	@ltx/en_us_dedes/he.h.m4:heHE.EvergetaChristePantodyname.greekname
ltx/en_us_dedes/me.m06.d24:meMA.Ode8C1H.incipit	@ltx/en_us_dedes/he.h.m4:heHE.EvergetaChristePantodyname.incipit
ltx/en_us_dedes/me.m06.d24:meMA.Ode8C1H.melody	@ltx/en_us_dedes/he.h.m4:heHE.EvergetaChristePantodyname.melody
ltx/en_us_dedes/me.m06.d24:meMA.Ode8C1H.mode	@ltx/en_us_dedes/miscellanea:misc.Mode4
ltx/en_us_dedes/me.m06.d24:meMA.Ode8C1H.ode	@ltx/en_us_dedes/miscellanea:misc.Ode8
ltx/en_us_dedes/me.m06.d24:meMA.Ode8C1H.text	@ltx/en_us_dedes/he.h.m4:heHE.EvergetaChristePantodyname.text
ltx/en_us_dedes/me.m06.d24:meMA.Ode8C1T.incipit	…
ltx/en_us_dedes/me.m06.d24:meMA.Ode8C1T.melody	@ltx/en_us_dedes/he.h.m4:heHE.EvergetaChristePantodyname.name
ltx/en_us_dedes/me.m06.d24:meMA.Ode8C1T.mode	@ltx/en_us_dedes/miscellanea:misc.Mode4
ltx/en_us_dedes/me.m06.d24:meMA.Ode8C1T.ode	@ltx/en_us_dedes/miscellanea:misc.Ode8
ltx/en_us_dedes/me.m06.d24:meMA.Ode8C1T.text	
ltx/en_us_dedes/me.m06.d24:meMA.Ode8C21.greekmelody	@ltx/en_us_dedes/he.h.m4:heHE.PaidasEvageis.greekname
ltx/en_us_dedes/me.m06.d24:meMA.Ode8C21.incipit	…
ltx/en_us_dedes/me.m06.d24:meMA.Ode8C21.melody	@ltx/en_us_dedes/he.h.m4:heHE.PaidasEvageis.name
ltx/en_us_dedes/me.m06.d24:meMA.Ode8C21.mode	@ltx/en_us_dedes/miscellanea:misc.Mode4
ltx/en_us_dedes/me.m06.d24:meMA.Ode8C21.ode	@ltx/en_us_dedes/miscellanea:misc.Ode8
ltx/en_us_dedes/me.m06.d24:meMA.Ode8C21.text	
ltx/en_us_dedes/me.m06.d24:meMA.Ode8C22.incipit	…
ltx/en_us_dedes/me.m06.d24:meMA.Ode8C22.melody	@ltx/en_us_dedes/he.h.m4:heHE.PaidasEvageis.name
ltx/en_us_dedes/me.m06.d24:meMA.Ode8C22.mode	@ltx/en_us_dedes/miscellanea:misc.Mode4
ltx/en_us_dedes/me.m06.d24:meMA.Ode8C22.ode	@ltx/en_us_dedes/miscellanea:misc.Ode8
ltx/en_us_dedes/me.m06.d24:meMA.Ode8C22.text	
ltx/en_us_dedes/me.m06.d24:meMA.Ode8C23.incipit	…
ltx/en_us_dedes/me.m06.d24:meMA.Ode8C23.melody	@ltx/en_us_dedes/he.h.m4:heHE.PaidasEvageis.name
ltx/en_us_dedes/me.m06.d24:meMA.Ode8C23.mode	@ltx/en_us_dedes/miscellanea:misc.Mode4
ltx/en_us_dedes/me.m06.d24:meMA.Ode8C23.ode	@ltx/en_us_dedes/miscellanea:misc.Ode8
ltx/en_us_dedes/me.m06.d24:meMA.Ode8C23.text	
ltx/en_us_dedes/me.m06.d24:meMA.Ode8C2T.incipit	…
ltx/en_us_dedes/me.m06.d24:meMA.Ode8C2T.melody	@ltx/en_us_dedes/he.h.m4:heHE.PaidasEvageis.name
ltx/en_us_dedes/me.m06.d24:meMA.Ode8C2T.mode	@ltx/en_us_dedes/miscellanea:misc.Mode4
ltx/en_us_dedes/me.m06.d24:meMA.Ode8C2T.ode	@ltx/en_us_dedes/miscellanea:misc.Ode8
ltx/en_us_dedes/me.m06.d24:meMA.Ode8C2T.text	
ltx/en_us_dedes/me.m06.d24:meMA.Ode9C11.greekmelody	@ltx/en_us_dedes/he.h.m4:heHE.LogouTheouAfraston.greekname
ltx/en_us_dedes/me.m06.d24:meMA.Ode9C11.incipit	…
ltx/en_us_dedes/me.m06.d24:meMA.Ode9C11.melody	@ltx/en_us_dedes/he.h.m4:heHE.LogouTheouAfraston.name
ltx/en_us_dedes/me.m06.d24:meMA.Ode9C11.mode	@ltx/en_us_dedes/miscellanea:misc.Mode4
ltx/en_us_dedes/me.m06.d24:meMA.Ode9C11.ode	@ltx/en_us_dedes/miscellanea:misc.Ode9
ltx/en_us_dedes/me.m06.d24:meMA.Ode9C11.text	
ltx/en_us_dedes/me.m06.d24:meMA.Ode9C12.incipit	…
ltx/en_us_dedes/me.m06.d24:meMA.Ode9C12.melody	@ltx/en_us_dedes/he.h.m4:heHE.LogouTheouAfraston.name
ltx/en_us_dedes/me.m06.d24:meMA.Ode9C12.mode	@ltx/en_us_dedes/miscellanea:misc.Mode4
ltx/en_us_dedes/me.m06.d24:meMA.Ode9C12.ode	@ltx/en_us_dedes/miscellanea:misc.Ode9
ltx/en_us_dedes/me.m06.d24:meMA.Ode9C12.text	
ltx/en_us_dedes/me.m06.d24:meMA.Ode9C1H.greekmelody	@ltx/en_us_dedes/he.h.m4:heHE.LogouTheouAfraston.greekname
ltx/en_us_dedes/me.m06.d24:meMA.Ode9C1H.incipit	@ltx/en_us_dedes/he.h.m4:heHE.LogouTheouAfraston.incipit
ltx/en_us_dedes/me.m06.d24:meMA.Ode9C1H.melody	@ltx/en_us_dedes/he.h.m4:heHE.LogouTheouAfraston.melody
ltx/en_us_dedes/me.m06.d24:meMA.Ode9C1H.mode	@ltx/en_us_dedes/miscellanea:misc.Mode4
ltx/en_us_dedes/me.m06.d24:meMA.Ode9C1H.ode	@ltx/en_us_dedes/miscellanea:misc.Ode9
ltx/en_us_dedes/me.m06.d24:meMA.Ode9C1H.text	@ltx/en_us_dedes/he.h.m4:heHE.LogouTheouAfraston.text
ltx/en_us_dedes/me.m06.d24:meMA.Ode9C1T.incipit	…
ltx/en_us_dedes/me.m06.d24:meMA.Ode9C1T.melody	@ltx/en_us_dedes/he.h.m4:heHE.LogouTheouAfraston.name
ltx/en_us_dedes/me.m06.d24:meMA.Ode9C1T.mode	@ltx/en_us_dedes/miscellanea:misc.Mode4
ltx/en_us_dedes/me.m06.d24:meMA.Ode9C1T.ode	@ltx/en_us_dedes/miscellanea:misc.Ode9
ltx/en_us_dedes/me.m06.d24:meMA.Ode9C1T.text	
ltx/en_us_dedes/me.m06.d24:meMA.Ode9C21.greekmelody	@ltx/en_us_dedes/he.h.m4:heHE.ApasGigenis.greekname
ltx/en_us_dedes/me.m06.d24:meMA.Ode9C21.incipit	By the birth today *…
ltx/en_us_dedes/me.m06.d24:meMA.Ode9C21.melody	@ltx/en_us_dedes/he.h.m4:heHE.ApasGigenis.name
ltx/en_us_dedes/me.m06.d24:meMA.Ode9C21.mode	@ltx/en_us_dedes/miscellanea:misc.Mode4
ltx/en_us_dedes/me.m06.d24:meMA.Ode9C21.ode	@ltx/en_us_dedes/miscellanea:misc.Ode9
ltx/en_us_dedes/me.m06.d24:meMA.Ode9C21.text	By the birth today * of St. John the Baptist do the gates of the divine * light begin to open now; * it is announced that the halls of darkness shall * be shut at last. For as the Forerunner and Prophet of Christ * comes into the * light of life he heralds this * and confirms it by means of his father’s voice.
ltx/en_us_dedes/me.m06.d24:meMA.Ode9C22.incipit	John the Forerunner * burst…
ltx/en_us_dedes/me.m06.d24:meMA.Ode9C22.melody	@ltx/en_us_dedes/he.h.m4:heHE.ApasGigenis.name
ltx/en_us_dedes/me.m06.d24:meMA.Ode9C22.mode	@ltx/en_us_dedes/miscellanea:misc.Mode4
ltx/en_us_dedes/me.m06.d24:meMA.Ode9C22.ode	@ltx/en_us_dedes/miscellanea:misc.Ode9
ltx/en_us_dedes/me.m06.d24:meMA.Ode9C22.text	John the Forerunner * burst forth as a shower of intelligible rain * from a dry and waterless cloud. * And as a Prophet, to all he then announced * the coming of the heavenly stream of the river of peace * for renewal * in the Spirit of our own * human nature increasing the fruits of grace.
ltx/en_us_dedes/me.m06.d24:meMA.Ode9C23.incipit	Like another sky * adorned…
ltx/en_us_dedes/me.m06.d24:meMA.Ode9C23.melody	@ltx/en_us_dedes/he.h.m4:heHE.ApasGigenis.name
ltx/en_us_dedes/me.m06.d24:meMA.Ode9C23.mode	@ltx/en_us_dedes/miscellanea:misc.Mode4
ltx/en_us_dedes/me.m06.d24:meMA.Ode9C23.ode	@ltx/en_us_dedes/miscellanea:misc.Ode9
ltx/en_us_dedes/me.m06.d24:meMA.Ode9C23.text	Like another sky * adorned with the shining stars, * so is the Church today * by the divine graces of * the holy Baptist brightly illumined now * and beautified. And thus she praises his nativity, * glorifying * and lauding the Lord of all * who bestows the superior gifts of grace.
ltx/en_us_dedes/me.m06.d24:meMA.Ode9C2T.incipit	Gushing forth from you *…
ltx/en_us_dedes/me.m06.d24:meMA.Ode9C2T.melody	@ltx/en_us_dedes/he.h.m4:heHE.ApasGigenis.name
ltx/en_us_dedes/me.m06.d24:meMA.Ode9C2T.mode	@ltx/en_us_dedes/miscellanea:misc.Mode4
ltx/en_us_dedes/me.m06.d24:meMA.Ode9C2T.ode	@ltx/en_us_dedes/miscellanea:misc.Ode9
ltx/en_us_dedes/me.m06.d24:meMA.Ode9C2T.text	Gushing forth from you * as water of life, all-holy Virgin Bride of God, * the Lord washed and hallowed us * who have received Him into ourselves with faith, * and made us heirs of His divine and uncreated Rule. * We extol His * goodness and benevolence, * and we ardently magnify you with love.
ltx/en_us_dedes/me.m06.d24:meMA.Oikos1.text	Let us now extol the Lord’s Forerunner, whom Elizabeth bore to the priest, from a womb that was fruitless, but not without seed. Only Christ traversed the field that no one else traversed, that was truly without seed. John was borne of a barren woman, who bore him not without the agency of a man. Whereas Jesus was borne of a chaste Virgin, by the overshadowing of the Father and the divine Spirit. Yet the son of the barren one showed himself to be for the Son of the Virgin, Prophet and Herald, and likewise Forerunner.
ltx/en_us_dedes/me.m06.d24:meMA.PostGospelBoth.incipit	@ltx/en_us_dedes/ho.ho03:hoMA.PostGospelTheotokos.incipit
ltx/en_us_dedes/me.m06.d24:meMA.PostGospelBoth.melody	
ltx/en_us_dedes/me.m06.d24:meMA.PostGospelBoth.mode	@ltx/en_us_dedes/miscellanea:misc.Mode2
ltx/en_us_dedes/me.m06.d24:meMA.PostGospelBoth.text	@ltx/en_us_dedes/ho.ho03:hoMA.PostGospelTheotokos.text
ltx/en_us_dedes/me.m06.d24:meMA.PostGospelGlory.incipit	@ltx/en_us_dedes/ho.ho03:hoMA.PostGospelForerunner.incipit
ltx/en_us_dedes/me.m06.d24:meMA.PostGospelGlory.melody	
ltx/en_us_dedes/me.m06.d24:meMA.PostGospelGlory.mode	@ltx/en_us_dedes/miscellanea:misc.Mode2
ltx/en_us_dedes/me.m06.d24:meMA.PostGospelGlory.text	@ltx/en_us_dedes/ho.ho03:hoMA.PostGospelForerunner.text
ltx/en_us_dedes/me.m06.d24:meMA.PostGospelIdiomelon.incipit	He who was sanctified from…
ltx/en_us_dedes/me.m06.d24:meMA.PostGospelIdiomelon.melody	@ltx/en_us_dedes/miscellanea:misc.Idiomelon
ltx/en_us_dedes/me.m06.d24:meMA.PostGospelIdiomelon.mode	@ltx/en_us_dedes/miscellanea:misc.Mode2
ltx/en_us_dedes/me.m06.d24:meMA.PostGospelIdiomelon.text	He who was sanctified from his mother’s womb, and who received the fullness of prophecy, was born today from a barren woman. He is distinctly proclaiming the coming of the Lord, “Repent, for the kingdom of heaven is at hand.”
ltx/en_us_dedes/me.m06.d24:meSV.AposGlory.incipit	…
ltx/en_us_dedes/me.m06.d24:meSV.AposGlory.melody	@ltx/en_us_dedes/he.a.m2:heAU.OikosTouEfratha.name
ltx/en_us_dedes/me.m06.d24:meSV.AposGlory.mode	@ltx/en_us_dedes/miscellanea:misc.Mode2
ltx/en_us_dedes/me.m06.d24:meSV.AposGlory.text	
ltx/en_us_dedes/me.m06.d24:meSV.Aposticha1.incipit	…
ltx/en_us_dedes/me.m06.d24:meSV.Aposticha1.melody	@ltx/en_us_dedes/he.a.m2:heAU.OikosTouEfratha.name
ltx/en_us_dedes/me.m06.d24:meSV.Aposticha1.mode	@ltx/en_us_dedes/miscellanea:misc.Mode2
ltx/en_us_dedes/me.m06.d24:meSV.Aposticha1.text	
ltx/en_us_dedes/me.m06.d24:meSV.Aposticha2.incipit	…
ltx/en_us_dedes/me.m06.d24:meSV.Aposticha2.melody	@ltx/en_us_dedes/he.a.m2:heAU.OikosTouEfratha.name
ltx/en_us_dedes/me.m06.d24:meSV.Aposticha2.mode	@ltx/en_us_dedes/miscellanea:misc.Mode2
ltx/en_us_dedes/me.m06.d24:meSV.Aposticha2.text	
ltx/en_us_dedes/me.m06.d24:meSV.Aposticha3.incipit	…
ltx/en_us_dedes/me.m06.d24:meSV.Aposticha3.melody	@ltx/en_us_dedes/he.a.m2:heAU.OikosTouEfratha.name
ltx/en_us_dedes/me.m06.d24:meSV.Aposticha3.mode	@ltx/en_us_dedes/miscellanea:misc.Mode2
ltx/en_us_dedes/me.m06.d24:meSV.Aposticha3.text	
ltx/en_us_dedes/me.m06.d24:meSV.MM.Stichera1123as78910.text	@ltx/en_us_dedes/properties:media.key
ltx/en_us_dedes/me.m06.d24:meSV.SticBoth.incipit	@ltx/en_us_dedes/oc.m8.d5:ocMA.AposTheotokion.incipit
ltx/en_us_dedes/me.m06.d24:meSV.SticBoth.melody	
ltx/en_us_dedes/me.m06.d24:meSV.SticBoth.mode	@ltx/en_us_dedes/miscellanea:misc.Mode8
ltx/en_us_dedes/me.m06.d24:meSV.SticBoth.text	@ltx/en_us_dedes/oc.m8.d5:ocMA.AposTheotokion.text
ltx/en_us_dedes/me.m06.d24:meSV.SticGlory.incipit	To John is due fragrant…
ltx/en_us_dedes/me.m06.d24:meSV.SticGlory.melody	
ltx/en_us_dedes/me.m06.d24:meSV.SticGlory.mode	@ltx/en_us_dedes/miscellanea:misc.Mode8
ltx/en_us_dedes/me.m06.d24:meSV.SticGlory.text	To John is due fragrant incense; to the Baptist is due delightful song. He it is who proclaimed the beginning of our salvation, he who leapt in the womb, he who cried in the wilderness: Repent! He is the King’s soldier, the Forerunner of grace, the one who foretold of the Lamb and Savior, and he intercedes on behalf of our souls.
ltx/en_us_dedes/me.m06.d24:meSV.Stichera1.incipit	…
ltx/en_us_dedes/me.m06.d24:meSV.Stichera1.melody	@ltx/en_us_dedes/he.a.m4:heAU.OExYpsistouKlitheis.name
ltx/en_us_dedes/me.m06.d24:meSV.Stichera1.mode	@ltx/en_us_dedes/miscellanea:misc.Mode4
ltx/en_us_dedes/me.m06.d24:meSV.Stichera1.text	
ltx/en_us_dedes/me.m06.d24:meSV.Stichera2.incipit	…
ltx/en_us_dedes/me.m06.d24:meSV.Stichera2.melody	@ltx/en_us_dedes/he.a.m4:heAU.OExYpsistouKlitheis.name
ltx/en_us_dedes/me.m06.d24:meSV.Stichera2.mode	@ltx/en_us_dedes/miscellanea:misc.Mode4
ltx/en_us_dedes/me.m06.d24:meSV.Stichera2.text	
ltx/en_us_dedes/me.m06.d24:meSV.Stichera3.incipit	…
ltx/en_us_dedes/me.m06.d24:meSV.Stichera3.melody	@ltx/en_us_dedes/he.a.m4:heAU.OExYpsistouKlitheis.name
ltx/en_us_dedes/me.m06.d24:meSV.Stichera3.mode	@ltx/en_us_dedes/miscellanea:misc.Mode4
ltx/en_us_dedes/me.m06.d24:meSV.Stichera3.text	
ltx/en_us_dedes/me.m06.d24:meVE.Apolytikion1.greekmelody	@ltx/en_us_dedes/he.a.m4:heAU.TachyProkatalave.greekname
ltx/en_us_dedes/me.m06.d24:meVE.Apolytikion1.incipit	O Prophet and Forerunner of…
ltx/en_us_dedes/me.m06.d24:meVE.Apolytikion1.melody	@ltx/en_us_dedes/he.a.m4:heAU.TachyProkatalave.name
ltx/en_us_dedes/me.m06.d24:meVE.Apolytikion1.mode	@ltx/en_us_dedes/miscellanea:misc.Mode4
ltx/en_us_dedes/me.m06.d24:meVE.Apolytikion1.text	O Prophet and Forerunner of the appearance of Christ, * with longing we honor you, although we have not the means * of extolling you worthily. * Your birth, which was exalted * and most glorious, ended * the barrenness of your mother and the muteness of your father; * and unto the world it announced * the Incarnation of God the Word.
ltx/en_us_dedes/me.m06.d24:meVE.AposBoth.incipit	Watch as Elizabeth speaks with…
ltx/en_us_dedes/me.m06.d24:meVE.AposBoth.melody	@ltx/en_us_dedes/miscellanea:misc.Idiomelon
ltx/en_us_dedes/me.m06.d24:meVE.AposBoth.mode	@ltx/en_us_dedes/miscellanea:misc.Mode8
ltx/en_us_dedes/me.m06.d24:meVE.AposBoth.text	Watch as Elizabeth speaks with the Virgin Mary: “Why have you come to me, O Mother of my Lord? You are carrying the King; I carry His soldier. You, the One who gave the Law; I the one who lays down the Law. You the Word; I His voice, which proclaims the kingdom of heaven.”
ltx/en_us_dedes/me.m06.d24:meVE.AposGlory.incipit	The words of the Prophet…
ltx/en_us_dedes/me.m06.d24:meVE.AposGlory.melody	@ltx/en_us_dedes/miscellanea:misc.Idiomelon
ltx/en_us_dedes/me.m06.d24:meVE.AposGlory.mode	@ltx/en_us_dedes/miscellanea:misc.Mode8
ltx/en_us_dedes/me.m06.d24:meVE.AposGlory.poet	@ltx/en_us_dedes/poets:po.KassiasMonachis
ltx/en_us_dedes/me.m06.d24:meVE.AposGlory.text	The words of the Prophet Isaiah are fulfilled today with the birth of John who was greater than the prophets. For he said, “Behold, I will send my Messenger before you, who will prepare your way.” He who was the soldier of the heavenly King went ahead and truly made straight the highways of our God. He was a man by nature and an Angel in his way of life; for embracing complete chastity and self-restraint, he was in a state according to nature, and he rejected what was contrary to nature, and he strove to transcend nature. Come, all the faithful, let us emulate his virtues, and entreat him to intercede on our behalf, for the salvation of our souls.
ltx/en_us_dedes/me.m06.d24:meVE.Aposticha1.incipit	…
ltx/en_us_dedes/me.m06.d24:meVE.Aposticha1.melody	@ltx/en_us_dedes/miscellanea:misc.Idiomelon
ltx/en_us_dedes/me.m06.d24:meVE.Aposticha1.mode	@ltx/en_us_dedes/miscellanea:misc.Mode2
ltx/en_us_dedes/me.m06.d24:meVE.Aposticha1.text	
ltx/en_us_dedes/me.m06.d24:meVE.Aposticha2.incipit	…
ltx/en_us_dedes/me.m06.d24:meVE.Aposticha2.melody	@ltx/en_us_dedes/miscellanea:misc.Idiomelon
ltx/en_us_dedes/me.m06.d24:meVE.Aposticha2.mode	@ltx/en_us_dedes/miscellanea:misc.Mode2
ltx/en_us_dedes/me.m06.d24:meVE.Aposticha2.text	
ltx/en_us_dedes/me.m06.d24:meVE.Aposticha3.incipit	…
ltx/en_us_dedes/me.m06.d24:meVE.Aposticha3.melody	@ltx/en_us_dedes/miscellanea:misc.Idiomelon
ltx/en_us_dedes/me.m06.d24:meVE.Aposticha3.mode	@ltx/en_us_dedes/miscellanea:misc.Mode2
ltx/en_us_dedes/me.m06.d24:meVE.Aposticha3.text	
ltx/en_us_dedes/me.m06.d24:meVE.Lity1.incipit	…
ltx/en_us_dedes/me.m06.d24:meVE.Lity1.melody	@ltx/en_us_dedes/miscellanea:misc.Idiomelon
ltx/en_us_dedes/me.m06.d24:meVE.Lity1.mode	@ltx/en_us_dedes/miscellanea:misc.Mode1
ltx/en_us_dedes/me.m06.d24:meVE.Lity1.text	
ltx/en_us_dedes/me.m06.d24:meVE.Lity2.incipit	…
ltx/en_us_dedes/me.m06.d24:meVE.Lity2.melody	@ltx/en_us_dedes/miscellanea:misc.Idiomelon
ltx/en_us_dedes/me.m06.d24:meVE.Lity2.mode	@ltx/en_us_dedes/miscellanea:misc.Mode1
ltx/en_us_dedes/me.m06.d24:meVE.Lity2.text	
ltx/en_us_dedes/me.m06.d24:meVE.Lity3.incipit	…
ltx/en_us_dedes/me.m06.d24:meVE.Lity3.melody	@ltx/en_us_dedes/miscellanea:misc.Idiomelon
ltx/en_us_dedes/me.m06.d24:meVE.Lity3.mode	@ltx/en_us_dedes/miscellanea:misc.Mode1
ltx/en_us_dedes/me.m06.d24:meVE.Lity3.text	
ltx/en_us_dedes/me.m06.d24:meVE.LityBoth.incipit	@ltx/en_us_dedes/oc.m5.d3:ocVE.AposTheotokion.incipit
ltx/en_us_dedes/me.m06.d24:meVE.LityBoth.melody	
ltx/en_us_dedes/me.m06.d24:meVE.LityBoth.mode	@ltx/en_us_dedes/miscellanea:misc.Mode5
ltx/en_us_dedes/me.m06.d24:meVE.LityBoth.text	@ltx/en_us_dedes/oc.m5.d3:ocVE.AposTheotokion.text
ltx/en_us_dedes/me.m06.d24:meVE.LityGlory.incipit	…
ltx/en_us_dedes/me.m06.d24:meVE.LityGlory.melody	@ltx/en_us_dedes/miscellanea:misc.Idiomelon
ltx/en_us_dedes/me.m06.d24:meVE.LityGlory.mode	@ltx/en_us_dedes/miscellanea:misc.Mode5
ltx/en_us_dedes/me.m06.d24:meVE.LityGlory.poet	@ltx/en_us_dedes/poets:po.AndreouKritis
ltx/en_us_dedes/me.m06.d24:meVE.LityGlory.text	
ltx/en_us_dedes/me.m06.d24:meVE.MM.Stichera12345as678910.text	@ltx/en_us_dedes/properties:media.key
ltx/en_us_dedes/me.m06.d24:meVE.MM.Stichera123as8910.text	@ltx/en_us_dedes/properties:media.key
ltx/en_us_dedes/me.m06.d24:meVE.SticBoth.incipit	Elizabeth had conceived the Forerunner…
ltx/en_us_dedes/me.m06.d24:meVE.SticBoth.melody	@ltx/en_us_dedes/miscellanea:misc.Idiomelon
ltx/en_us_dedes/me.m06.d24:meVE.SticBoth.mode	@ltx/en_us_dedes/miscellanea:misc.Mode6
ltx/en_us_dedes/me.m06.d24:meVE.SticBoth.text	Elizabeth had conceived the Forerunner of grace; the Virgin conceived the Lord of glory. The mothers greeted each other, and the babe leaped for joy; for even in the womb, the servant extolled the Master. The mother of the Forerunner marveled, and she exclaimed with a loud cry, “Why is this granted me, that the mother of my Lord should come to me?” That He might save a people in despair. O Lord, who have the great mercy, glory to You!
ltx/en_us_dedes/me.m06.d24:meVE.SticGlory.incipit	Today, like a shining star…
ltx/en_us_dedes/me.m06.d24:meVE.SticGlory.melody	@ltx/en_us_dedes/miscellanea:misc.Idiomelon
ltx/en_us_dedes/me.m06.d24:meVE.SticGlory.mode	@ltx/en_us_dedes/miscellanea:misc.Mode6
ltx/en_us_dedes/me.m06.d24:meVE.SticGlory.poet	@ltx/en_us_dedes/poets:po.Vyzantiou
ltx/en_us_dedes/me.m06.d24:meVE.SticGlory.text	Today, like a shining star, the lamp of the Light prepares the way for the coming of God the Logos. Today, Zacharias found his tongue, after exercising silence at the Angel’s command. For it was fitting that the father of the voice no longer keep silent, once the voice came forth from the once barren womb, that voice which would proclaim the good news of the deliverance of the whole world, with great outspokenness.
ltx/en_us_dedes/me.m06.d24:meVE.Stichera01.incipit	When John was born, he…
ltx/en_us_dedes/me.m06.d24:meVE.Stichera01.melody	@ltx/en_us_dedes/miscellanea:misc.Idiomelon
ltx/en_us_dedes/me.m06.d24:meVE.Stichera01.mode	@ltx/en_us_dedes/miscellanea:misc.Mode4
ltx/en_us_dedes/me.m06.d24:meVE.Stichera01.poet	@ltx/en_us_dedes/poets:po.IoannouMonachou
ltx/en_us_dedes/me.m06.d24:meVE.Stichera01.text	When John was born, he broke the silence of Zacharias. For it was no longer fitting that the father be unable to speak, once he, the voice, had come forth. When at first it was doubted, it tied the tongue; now that it has shouted, it became him to release his father. He announced to him the good news, and he became the voice of the Word, the Forerunner of the Light. And he intercedes for our souls.
ltx/en_us_dedes/me.m06.d24:meVE.Stichera02.incipit	Today, the Voice of the…
ltx/en_us_dedes/me.m06.d24:meVE.Stichera02.melody	@ltx/en_us_dedes/miscellanea:misc.Idiomelon
ltx/en_us_dedes/me.m06.d24:meVE.Stichera02.mode	@ltx/en_us_dedes/miscellanea:misc.Mode4
ltx/en_us_dedes/me.m06.d24:meVE.Stichera02.text	Today, the Voice of the Logos releases his father’s voice, which had been restrained because of disbelief. And he breaks his mother’s bonds of barrenness, and thus indicates that the Church will have many children. The lamp of the Light comes forth, the dawn announces the coming of the Sun of righteousness, for the re-formation of all and the salvation of our souls.
ltx/en_us_dedes/me.m06.d24:meVE.Stichera03.incipit	When the Logos of God…
ltx/en_us_dedes/me.m06.d24:meVE.Stichera03.melody	@ltx/en_us_dedes/miscellanea:misc.Idiomelon
ltx/en_us_dedes/me.m06.d24:meVE.Stichera03.mode	@ltx/en_us_dedes/miscellanea:misc.Mode4
ltx/en_us_dedes/me.m06.d24:meVE.Stichera03.poet	@ltx/en_us_dedes/poets:po.Anatoliou
ltx/en_us_dedes/me.m06.d24:meVE.Stichera03.text	When the Logos of God was going to be born of a Virgin, a Messenger came forth from a barren womb, yes, that great one of those born of women and more than a prophet. It was right that the beginnings of things divine be extraordinary: pregnancy past childbearing age ushers in conception without seed. O God who does wonders for our salvation, glory to You!
ltx/en_us_dedes/me.m06.d24:meVE.Stichera04.incipit	…
ltx/en_us_dedes/me.m06.d24:meVE.Stichera04.melody	@ltx/en_us_dedes/miscellanea:misc.Idiomelon
ltx/en_us_dedes/me.m06.d24:meVE.Stichera04.mode	@ltx/en_us_dedes/miscellanea:misc.Mode4
ltx/en_us_dedes/me.m06.d24:meVE.Stichera04.poet	@ltx/en_us_dedes/poets:po.AndreouKritis
ltx/en_us_dedes/me.m06.d24:meVE.Stichera04.text	
ltx/en_us_dedes/me.m06.d24:meVE.Stichera05.incipit	…
ltx/en_us_dedes/me.m06.d24:meVE.Stichera05.melody	@ltx/en_us_dedes/miscellanea:misc.Idiomelon
ltx/en_us_dedes/me.m06.d24:meVE.Stichera05.mode	@ltx/en_us_dedes/miscellanea:misc.Mode4
ltx/en_us_dedes/me.m06.d24:meVE.Stichera05.text	
ltx/en_us_dedes/me.m06.d24:meVE.Stichera06.incipit	…
ltx/en_us_dedes/me.m06.d24:meVE.Stichera06.melody	@ltx/en_us_dedes/miscellanea:misc.Idiomelon
ltx/en_us_dedes/me.m06.d24:meVE.Stichera06.mode	@ltx/en_us_dedes/miscellanea:misc.Mode4
ltx/en_us_dedes/me.m06.d24:meVE.Stichera06.text	
ltx/en_us_dedes/me.m06.d24:meVE.Stichera07.incipit	…
ltx/en_us_dedes/me.m06.d24:meVE.Stichera07.melody	@ltx/en_us_dedes/miscellanea:misc.Idiomelon
ltx/en_us_dedes/me.m06.d24:meVE.Stichera07.mode	@ltx/en_us_dedes/miscellanea:misc.Mode4
ltx/en_us_dedes/me.m06.d24:meVE.Stichera07.text	
