ltx/en_us_dedes/sy.m07.d23:cl.syMA.commemoration01.text	[saint/com 1]
ltx/en_us_dedes/sy.m07.d23:cl.syMA.commemoration02.text	[saint/com 2]
ltx/en_us_dedes/sy.m07.d23:cl.syMA.commemoration03.text	[saint/com 3]
ltx/en_us_dedes/sy.m07.d23:cl.syMA.commemoration04.text	[saint/com 4]
ltx/en_us_dedes/sy.m07.d23:cl.syMA.commemoration05.text	[saint/com 5]
ltx/en_us_dedes/sy.m07.d23:cl.syMA.commemoration06.text	[saint/com list]
ltx/en_us_dedes/sy.m07.d23:syMA.commemoration01.couplet1.title	@ltx/en_us_dedes/titles:ti.Verses
ltx/en_us_dedes/sy.m07.d23:syMA.commemoration01.couplet1.verse1	
ltx/en_us_dedes/sy.m07.d23:syMA.commemoration01.couplet1.verse2	
ltx/en_us_dedes/sy.m07.d23:syMA.commemoration01.narration.p01	
ltx/en_us_dedes/sy.m07.d23:syMA.commemoration01.single1	
ltx/en_us_dedes/sy.m07.d23:syMA.commemoration01.text	On July 23, we commemorate the holy Hieromartyr Phocas.
ltx/en_us_dedes/sy.m07.d23:syMA.commemoration02.couplet1.title	@ltx/en_us_dedes/titles:ti.Verses
ltx/en_us_dedes/sy.m07.d23:syMA.commemoration02.couplet1.verse1	
ltx/en_us_dedes/sy.m07.d23:syMA.commemoration02.couplet1.verse2	
ltx/en_us_dedes/sy.m07.d23:syMA.commemoration02.text	On this day we also commemorate the holy Prophet Ezekiel.
ltx/en_us_dedes/sy.m07.d23:syMA.commemoration03.couplet1.title	@ltx/en_us_dedes/titles:ti.Verses
ltx/en_us_dedes/sy.m07.d23:syMA.commemoration03.couplet1.verse1	
ltx/en_us_dedes/sy.m07.d23:syMA.commemoration03.couplet1.verse2	
ltx/en_us_dedes/sy.m07.d23:syMA.commemoration03.couplet2.verse1	
ltx/en_us_dedes/sy.m07.d23:syMA.commemoration03.couplet2.verse2	
ltx/en_us_dedes/sy.m07.d23:syMA.commemoration03.couplet3.verse1	
ltx/en_us_dedes/sy.m07.d23:syMA.commemoration03.couplet3.verse2	
ltx/en_us_dedes/sy.m07.d23:syMA.commemoration03.couplet4.verse1	
ltx/en_us_dedes/sy.m07.d23:syMA.commemoration03.couplet4.verse2	
ltx/en_us_dedes/sy.m07.d23:syMA.commemoration03.text	On this day we also commemorate the holy Hieromartyrs Apollinaris and Vitalis, Bishops of Ravenna; and Apollonius of Rome; and the seven Martyrs in Carthage. We also remember the Christians who were executed in Bulgaria during the reign of Emperor Nicephorus.
ltx/en_us_dedes/sy.m07.d23:syMA.commemoration04.text	We commemorate devout Anne of Leucadius.
ltx/en_us_dedes/sy.m07.d23:syMA.commemoration05.text	On this day we also commemorate our devout Mother Pelagia of Tinos
ltx/en_us_dedes/sy.m07.d23:syMA.lastline	By their holy intercessions, O God, have mercy on us. Amen.
