ltx/en_us_dedes/me.m06.d12:meDA.commemoration.first	Memory of our Devout Father Onoufrios
ltx/en_us_dedes/me.m06.d12:meDA.commemoration.first_name	
ltx/en_us_dedes/me.m06.d12:meDA.commemoration.first_short	Memory of our Devout Father Onoufrios
ltx/en_us_dedes/me.m06.d12:meDA.commemoration.first_title	@ltx/en_us_dedes/titles:ti.DevoutSaintM
ltx/en_us_dedes/me.m06.d12:meDA.commemoration.full	Memory of our Devout Father Onoufrios
ltx/en_us_dedes/me.m06.d12:meDA.commemoration.second_name	
ltx/en_us_dedes/me.m06.d12:meDA.commemoration.second_title	
ltx/en_us_dedes/me.m06.d12:meDA.date	June 12
ltx/en_us_dedes/me.m06.d12:meDA.dismissal	
ltx/en_us_dedes/me.m06.d12:meDA.fordate	for June 12
ltx/en_us_dedes/me.m06.d12:meDA.insert1	our devout and God-bearing father Onoufrios,
ltx/en_us_dedes/me.m06.d12:meDA.insert2	whose memory we observe,
ltx/en_us_dedes/me.m06.d12:meDA.note	
ltx/en_us_dedes/me.m06.d12:meDA.pdfcoverdate	June 12,
ltx/en_us_dedes/me.m06.d12:meDA.pdfheaderdate	June 12
ltx/en_us_dedes/me.m06.d12:meHO.commemorations	
ltx/en_us_dedes/me.m06.d12:meHO.note1	
ltx/en_us_dedes/me.m06.d12:meHO.note2	
ltx/en_us_dedes/me.m06.d12:meHO.number	
ltx/en_us_dedes/me.m06.d12:meHO.rank	
ltx/en_us_dedes/me.m06.d12:meLE.commemoration1	Our Venerable Fathers Onouphrios and Peter of Mount Athos.
ltx/en_us_dedes/me.m06.d12:meLE.commemoration2	
ltx/en_us_dedes/me.m06.d12:meLI.Kontakion1.incipit	@ltx/en_us_dedes/me.m06.d12:meMA.Kontakion1.incipit
ltx/en_us_dedes/me.m06.d12:meLI.Kontakion1.melody	@ltx/en_us_dedes/me.m06.d12:meMA.Kontakion1.melody
ltx/en_us_dedes/me.m06.d12:meLI.Kontakion1.mode	@ltx/en_us_dedes/me.m06.d12:meMA.Kontakion1.mode
ltx/en_us_dedes/me.m06.d12:meLI.Kontakion1.text	@ltx/en_us_dedes/me.m06.d12:meMA.Kontakion1.text
ltx/en_us_dedes/me.m06.d12:meLI.MM.CommunionHymn.text	@ltx/en_us_dedes/properties:media.key
ltx/en_us_dedes/me.m06.d12:meLI.Megalynarion.text	
ltx/en_us_dedes/me.m06.d12:meMA.C1.acrostic.notice1	
ltx/en_us_dedes/me.m06.d12:meMA.C1.acrostic.text	
ltx/en_us_dedes/me.m06.d12:meMA.C1.acrostic.title	
ltx/en_us_dedes/me.m06.d12:meMA.C1.title	@ltx/en_us_dedes/titles:ti.CanonSaintM
ltx/en_us_dedes/me.m06.d12:meMA.C1.verse	@ltx/en_us_dedes/prayers:pr.verse_DevoutMan.text
ltx/en_us_dedes/me.m06.d12:meMA.ExapTheotokion.incipit	@ltx/en_us_dedes/da.d7:daMA.ExapTheotokion2.incipit
ltx/en_us_dedes/me.m06.d12:meMA.ExapTheotokion.melody	@ltx/en_us_dedes/he.a.m2:heAU.TonMathitonOrontonSe.name
ltx/en_us_dedes/me.m06.d12:meMA.ExapTheotokion.mode	@ltx/en_us_dedes/miscellanea:misc.Mode2
ltx/en_us_dedes/me.m06.d12:meMA.ExapTheotokion.text	@ltx/en_us_dedes/da.d7:daMA.ExapTheotokion2.text
ltx/en_us_dedes/me.m06.d12:meMA.Exaposteilarion1.greekmelody	@ltx/en_us_dedes/he.a.m2:heAU.TonMathitonOrontonSe.greekname
ltx/en_us_dedes/me.m06.d12:meMA.Exaposteilarion1.incipit	Your exalted lifestyle is for…
ltx/en_us_dedes/me.m06.d12:meMA.Exaposteilarion1.melody	@ltx/en_us_dedes/he.a.m2:heAU.TonMathitonOrontonSe.name
ltx/en_us_dedes/me.m06.d12:meMA.Exaposteilarion1.mode	@ltx/en_us_dedes/miscellanea:misc.Mode2
ltx/en_us_dedes/me.m06.d12:meMA.Exaposteilarion1.text	Your exalted lifestyle is for monastics * a rule and measure of most perfect religion. * For with a mature power of reason, * yoked with spiritual discernment, * Onoufrios, you make it easy * for them to follow your footsteps.
ltx/en_us_dedes/me.m06.d12:meMA.Kontakion1.incipit	When you received the noetic…
ltx/en_us_dedes/me.m06.d12:meMA.Kontakion1.melody	
ltx/en_us_dedes/me.m06.d12:meMA.Kontakion1.mode	@ltx/en_us_dedes/miscellanea:misc.Mode8
ltx/en_us_dedes/me.m06.d12:meMA.Kontakion1.text	When you received the noetic and heavenly light within your heart, you became a vessel of the undefiled Trinity, O Onoufrios. And now you are numbered with the Angels, crying out: Alleluia.
ltx/en_us_dedes/me.m06.d12:meMA.Lauds1.greekmelody	@ltx/en_us_dedes/he.a.m8:heAU.OTouParadoxou.greekname
ltx/en_us_dedes/me.m06.d12:meMA.Lauds1.incipit	God-bearing Father Onoufrios, you imitated…
ltx/en_us_dedes/me.m06.d12:meMA.Lauds1.melody	@ltx/en_us_dedes/he.a.m8:heAU.OTouParadoxou.name
ltx/en_us_dedes/me.m06.d12:meMA.Lauds1.mode	@ltx/en_us_dedes/miscellanea:misc.Mode8
ltx/en_us_dedes/me.m06.d12:meMA.Lauds1.text	God-bearing Father Onoufrios, you imitated the life * of Elias spiritually. * You went far away from all * the confusion and noise of the world, * and you renounced the desires of the flesh * and dwelt on mountains in the wilderness, * joyfully, blessed Saint, * as your soul was lifted up into the heights, * where, like the Apostle Paul, you had your citizenship.
ltx/en_us_dedes/me.m06.d12:meMA.Lauds2.incipit	O devout Father Onoufrios, having…
ltx/en_us_dedes/me.m06.d12:meMA.Lauds2.melody	@ltx/en_us_dedes/he.a.m8:heAU.OTouParadoxou.name
ltx/en_us_dedes/me.m06.d12:meMA.Lauds2.mode	@ltx/en_us_dedes/miscellanea:misc.Mode8
ltx/en_us_dedes/me.m06.d12:meMA.Lauds2.text	O devout Father Onoufrios, having your mind set on God * you obtained a more sacred soul. * Faith in God enabled you * to endure when temptations came. * And now you dwell in the land of the meek, * being united to God through ardent love, * beautified as you are * with the splendor of the virtues. Therefore we * celebrate your memory, rejoicing festively.
ltx/en_us_dedes/me.m06.d12:meMA.Lauds3.incipit	All-blessed Father Onoufrios, when from…
ltx/en_us_dedes/me.m06.d12:meMA.Lauds3.melody	@ltx/en_us_dedes/he.a.m8:heAU.OTouParadoxou.name
ltx/en_us_dedes/me.m06.d12:meMA.Lauds3.mode	@ltx/en_us_dedes/miscellanea:misc.Mode8
ltx/en_us_dedes/me.m06.d12:meMA.Lauds3.text	All-blessed Father Onoufrios, when from on high you received * the inscrutable gifts of grace, * piously you shared them with * those who longed to resemble you, * thrice-blessed Saint, in ascetic discipline. * And when you heard from the Lord the blessed voice, * O wonder-worthy man, * you entered His bridal hall, where you are now * standing near the glorious throne of the King of all.
ltx/en_us_dedes/me.m06.d12:meMA.LaudsGlory.incipit	O God-bearing Father, you sought…
ltx/en_us_dedes/me.m06.d12:meMA.LaudsGlory.melody	
ltx/en_us_dedes/me.m06.d12:meMA.LaudsGlory.mode	@ltx/en_us_dedes/miscellanea:misc.Mode2
ltx/en_us_dedes/me.m06.d12:meMA.LaudsGlory.text	O God-bearing Father, you sought to behold the splendor of the Lord, and you longed to speak with Him one on one. So you renounced the world and went far away, and you dwelt in desert places and on mountains. Once you had put on Christ, you were no longer concerned about clothing, for you had traded it for the garment of incorruption. Wearing that, you entered the heavenly wedding hall, O devout St. Onoufrios, and you rejoice forever.
ltx/en_us_dedes/me.m06.d12:meMA.LaudsTheotokion.incipit	@ltx/en_us_dedes/ho.ho23:hoCA.Troparion7.incipit
ltx/en_us_dedes/me.m06.d12:meMA.LaudsTheotokion.melody	
ltx/en_us_dedes/me.m06.d12:meMA.LaudsTheotokion.mode	@ltx/en_us_dedes/miscellanea:misc.Mode2
ltx/en_us_dedes/me.m06.d12:meMA.LaudsTheotokion.text	@ltx/en_us_dedes/ho.ho23:hoCA.Troparion7.text
ltx/en_us_dedes/me.m06.d12:meMA.Ode1C11.greekmelody	@ltx/en_us_dedes/he.h.m2:heHE.DefteLaoi.greekname
ltx/en_us_dedes/me.m06.d12:meMA.Ode1C11.incipit	…
ltx/en_us_dedes/me.m06.d12:meMA.Ode1C11.melody	@ltx/en_us_dedes/he.h.m2:heHE.DefteLaoi.name
ltx/en_us_dedes/me.m06.d12:meMA.Ode1C11.mode	@ltx/en_us_dedes/miscellanea:misc.Mode2
ltx/en_us_dedes/me.m06.d12:meMA.Ode1C11.ode	@ltx/en_us_dedes/miscellanea:misc.Ode1
ltx/en_us_dedes/me.m06.d12:meMA.Ode1C11.text	
ltx/en_us_dedes/me.m06.d12:meMA.Ode1C12.incipit	…
ltx/en_us_dedes/me.m06.d12:meMA.Ode1C12.melody	@ltx/en_us_dedes/he.h.m2:heHE.DefteLaoi.name
ltx/en_us_dedes/me.m06.d12:meMA.Ode1C12.mode	@ltx/en_us_dedes/miscellanea:misc.Mode2
ltx/en_us_dedes/me.m06.d12:meMA.Ode1C12.ode	@ltx/en_us_dedes/miscellanea:misc.Ode1
ltx/en_us_dedes/me.m06.d12:meMA.Ode1C12.text	
ltx/en_us_dedes/me.m06.d12:meMA.Ode1C1T.incipit	…
ltx/en_us_dedes/me.m06.d12:meMA.Ode1C1T.melody	@ltx/en_us_dedes/he.h.m2:heHE.DefteLaoi.name
ltx/en_us_dedes/me.m06.d12:meMA.Ode1C1T.mode	@ltx/en_us_dedes/miscellanea:misc.Mode2
ltx/en_us_dedes/me.m06.d12:meMA.Ode1C1T.ode	@ltx/en_us_dedes/miscellanea:misc.Ode1
ltx/en_us_dedes/me.m06.d12:meMA.Ode1C1T.text	
ltx/en_us_dedes/me.m06.d12:meMA.Ode3C11.greekmelody	@ltx/en_us_dedes/he.h.m2:heHE.StereosonImasEnSoiKyrie.greekname
ltx/en_us_dedes/me.m06.d12:meMA.Ode3C11.incipit	…
ltx/en_us_dedes/me.m06.d12:meMA.Ode3C11.melody	@ltx/en_us_dedes/he.h.m2:heHE.StereosonImasEnSoiKyrie.name
ltx/en_us_dedes/me.m06.d12:meMA.Ode3C11.mode	@ltx/en_us_dedes/miscellanea:misc.Mode2
ltx/en_us_dedes/me.m06.d12:meMA.Ode3C11.ode	@ltx/en_us_dedes/miscellanea:misc.Ode3
ltx/en_us_dedes/me.m06.d12:meMA.Ode3C11.text	
ltx/en_us_dedes/me.m06.d12:meMA.Ode3C12.incipit	…
ltx/en_us_dedes/me.m06.d12:meMA.Ode3C12.melody	@ltx/en_us_dedes/he.h.m2:heHE.StereosonImasEnSoiKyrie.name
ltx/en_us_dedes/me.m06.d12:meMA.Ode3C12.mode	@ltx/en_us_dedes/miscellanea:misc.Mode2
ltx/en_us_dedes/me.m06.d12:meMA.Ode3C12.ode	@ltx/en_us_dedes/miscellanea:misc.Ode3
ltx/en_us_dedes/me.m06.d12:meMA.Ode3C12.text	
ltx/en_us_dedes/me.m06.d12:meMA.Ode3C1T.incipit	…
ltx/en_us_dedes/me.m06.d12:meMA.Ode3C1T.melody	@ltx/en_us_dedes/he.h.m2:heHE.StereosonImasEnSoiKyrie.name
ltx/en_us_dedes/me.m06.d12:meMA.Ode3C1T.mode	@ltx/en_us_dedes/miscellanea:misc.Mode2
ltx/en_us_dedes/me.m06.d12:meMA.Ode3C1T.ode	@ltx/en_us_dedes/miscellanea:misc.Ode3
ltx/en_us_dedes/me.m06.d12:meMA.Ode3C1T.text	
ltx/en_us_dedes/me.m06.d12:meMA.Ode3H.greekmelody	@ltx/en_us_dedes/he.h.m2:heHE.StereosonImasEnSoiKyrie.greekname
ltx/en_us_dedes/me.m06.d12:meMA.Ode3H.incipit	@ltx/en_us_dedes/he.h.m2:heHE.StereosonImasEnSoiKyrie.incipit
ltx/en_us_dedes/me.m06.d12:meMA.Ode3H.melody	@ltx/en_us_dedes/he.h.m2:heHE.StereosonImasEnSoiKyrie.melody
ltx/en_us_dedes/me.m06.d12:meMA.Ode3H.mode	@ltx/en_us_dedes/miscellanea:misc.Mode2
ltx/en_us_dedes/me.m06.d12:meMA.Ode3H.ode	@ltx/en_us_dedes/miscellanea:misc.Ode3
ltx/en_us_dedes/me.m06.d12:meMA.Ode3H.text	@ltx/en_us_dedes/he.h.m2:heHE.StereosonImasEnSoiKyrie.text
ltx/en_us_dedes/me.m06.d12:meMA.Ode3Kathisma1.greekmelody	@ltx/en_us_dedes/he.a.m4:heAU.TachyProkatalave.greekname
ltx/en_us_dedes/me.m06.d12:meMA.Ode3Kathisma1.incipit	…
ltx/en_us_dedes/me.m06.d12:meMA.Ode3Kathisma1.melody	@ltx/en_us_dedes/he.a.m4:heAU.TachyProkatalave.name
ltx/en_us_dedes/me.m06.d12:meMA.Ode3Kathisma1.mode	@ltx/en_us_dedes/miscellanea:misc.Mode4
ltx/en_us_dedes/me.m06.d12:meMA.Ode3Kathisma1.text	
ltx/en_us_dedes/me.m06.d12:meMA.Ode3KathismaSt.incipit	…
ltx/en_us_dedes/me.m06.d12:meMA.Ode3KathismaSt.melody	@ltx/en_us_dedes/he.a.m4:heAU.TachyProkatalave.name
ltx/en_us_dedes/me.m06.d12:meMA.Ode3KathismaSt.mode	@ltx/en_us_dedes/miscellanea:misc.Mode4
ltx/en_us_dedes/me.m06.d12:meMA.Ode3KathismaSt.text	
ltx/en_us_dedes/me.m06.d12:meMA.Ode3KathismaT.incipit	…
ltx/en_us_dedes/me.m06.d12:meMA.Ode3KathismaT.melody	@ltx/en_us_dedes/he.a.m4:heAU.TachyProkatalave.name
ltx/en_us_dedes/me.m06.d12:meMA.Ode3KathismaT.mode	@ltx/en_us_dedes/miscellanea:misc.Mode4
ltx/en_us_dedes/me.m06.d12:meMA.Ode3KathismaT.text	
ltx/en_us_dedes/me.m06.d12:meMA.Ode4C11.greekmelody	@ltx/en_us_dedes/he.h.m2:heHE.EisakikoaKyrieTinAkoin.greekname
ltx/en_us_dedes/me.m06.d12:meMA.Ode4C11.incipit	…
ltx/en_us_dedes/me.m06.d12:meMA.Ode4C11.melody	@ltx/en_us_dedes/he.h.m2:heHE.EisakikoaKyrieTinAkoin.name
ltx/en_us_dedes/me.m06.d12:meMA.Ode4C11.mode	@ltx/en_us_dedes/miscellanea:misc.Mode2
ltx/en_us_dedes/me.m06.d12:meMA.Ode4C11.ode	@ltx/en_us_dedes/miscellanea:misc.Ode4
ltx/en_us_dedes/me.m06.d12:meMA.Ode4C11.text	
ltx/en_us_dedes/me.m06.d12:meMA.Ode4C12.incipit	…
ltx/en_us_dedes/me.m06.d12:meMA.Ode4C12.melody	@ltx/en_us_dedes/he.h.m2:heHE.EisakikoaKyrieTinAkoin.name
ltx/en_us_dedes/me.m06.d12:meMA.Ode4C12.mode	@ltx/en_us_dedes/miscellanea:misc.Mode2
ltx/en_us_dedes/me.m06.d12:meMA.Ode4C12.ode	@ltx/en_us_dedes/miscellanea:misc.Ode4
ltx/en_us_dedes/me.m06.d12:meMA.Ode4C12.text	
ltx/en_us_dedes/me.m06.d12:meMA.Ode4C1T.incipit	…
ltx/en_us_dedes/me.m06.d12:meMA.Ode4C1T.melody	@ltx/en_us_dedes/he.h.m2:heHE.EisakikoaKyrieTinAkoin.name
ltx/en_us_dedes/me.m06.d12:meMA.Ode4C1T.mode	@ltx/en_us_dedes/miscellanea:misc.Mode2
ltx/en_us_dedes/me.m06.d12:meMA.Ode4C1T.ode	@ltx/en_us_dedes/miscellanea:misc.Ode4
ltx/en_us_dedes/me.m06.d12:meMA.Ode4C1T.text	
ltx/en_us_dedes/me.m06.d12:meMA.Ode5C11.greekmelody	@ltx/en_us_dedes/he.h.m2:heHE.OTouFotosChorigos.greekname
ltx/en_us_dedes/me.m06.d12:meMA.Ode5C11.incipit	…
ltx/en_us_dedes/me.m06.d12:meMA.Ode5C11.melody	@ltx/en_us_dedes/he.h.m2:heHE.OTouFotosChorigos.name
ltx/en_us_dedes/me.m06.d12:meMA.Ode5C11.mode	@ltx/en_us_dedes/miscellanea:misc.Mode2
ltx/en_us_dedes/me.m06.d12:meMA.Ode5C11.ode	@ltx/en_us_dedes/miscellanea:misc.Ode5
ltx/en_us_dedes/me.m06.d12:meMA.Ode5C11.text	
ltx/en_us_dedes/me.m06.d12:meMA.Ode5C12.incipit	…
ltx/en_us_dedes/me.m06.d12:meMA.Ode5C12.melody	@ltx/en_us_dedes/he.h.m2:heHE.OTouFotosChorigos.name
ltx/en_us_dedes/me.m06.d12:meMA.Ode5C12.mode	@ltx/en_us_dedes/miscellanea:misc.Mode2
ltx/en_us_dedes/me.m06.d12:meMA.Ode5C12.ode	@ltx/en_us_dedes/miscellanea:misc.Ode5
ltx/en_us_dedes/me.m06.d12:meMA.Ode5C12.text	
ltx/en_us_dedes/me.m06.d12:meMA.Ode5C1T.incipit	…
ltx/en_us_dedes/me.m06.d12:meMA.Ode5C1T.melody	@ltx/en_us_dedes/he.h.m2:heHE.OTouFotosChorigos.name
ltx/en_us_dedes/me.m06.d12:meMA.Ode5C1T.mode	@ltx/en_us_dedes/miscellanea:misc.Mode2
ltx/en_us_dedes/me.m06.d12:meMA.Ode5C1T.ode	@ltx/en_us_dedes/miscellanea:misc.Ode5
ltx/en_us_dedes/me.m06.d12:meMA.Ode5C1T.text	
ltx/en_us_dedes/me.m06.d12:meMA.Ode6C11.greekmelody	@ltx/en_us_dedes/he.h.m2:heHE.EnAvyssoPtaismaton.greekname
ltx/en_us_dedes/me.m06.d12:meMA.Ode6C11.incipit	…
ltx/en_us_dedes/me.m06.d12:meMA.Ode6C11.melody	@ltx/en_us_dedes/he.h.m2:heHE.EnAvyssoPtaismaton.name
ltx/en_us_dedes/me.m06.d12:meMA.Ode6C11.mode	@ltx/en_us_dedes/miscellanea:misc.Mode2
ltx/en_us_dedes/me.m06.d12:meMA.Ode6C11.ode	@ltx/en_us_dedes/miscellanea:misc.Ode6
ltx/en_us_dedes/me.m06.d12:meMA.Ode6C11.text	
ltx/en_us_dedes/me.m06.d12:meMA.Ode6C12.incipit	…
ltx/en_us_dedes/me.m06.d12:meMA.Ode6C12.melody	@ltx/en_us_dedes/he.h.m2:heHE.EnAvyssoPtaismaton.name
ltx/en_us_dedes/me.m06.d12:meMA.Ode6C12.mode	@ltx/en_us_dedes/miscellanea:misc.Mode2
ltx/en_us_dedes/me.m06.d12:meMA.Ode6C12.ode	@ltx/en_us_dedes/miscellanea:misc.Ode6
ltx/en_us_dedes/me.m06.d12:meMA.Ode6C12.text	
ltx/en_us_dedes/me.m06.d12:meMA.Ode6C1T.incipit	…
ltx/en_us_dedes/me.m06.d12:meMA.Ode6C1T.melody	@ltx/en_us_dedes/he.h.m2:heHE.EnAvyssoPtaismaton.name
ltx/en_us_dedes/me.m06.d12:meMA.Ode6C1T.mode	@ltx/en_us_dedes/miscellanea:misc.Mode2
ltx/en_us_dedes/me.m06.d12:meMA.Ode6C1T.ode	@ltx/en_us_dedes/miscellanea:misc.Ode6
ltx/en_us_dedes/me.m06.d12:meMA.Ode6C1T.text	
ltx/en_us_dedes/me.m06.d12:meMA.Ode6H.greekmelody	@ltx/en_us_dedes/he.h.m2:heHE.EnAvyssoPtaismaton.greekname
ltx/en_us_dedes/me.m06.d12:meMA.Ode6H.incipit	@ltx/en_us_dedes/he.h.m2:heHE.EnAvyssoPtaismaton.incipit
ltx/en_us_dedes/me.m06.d12:meMA.Ode6H.melody	@ltx/en_us_dedes/he.h.m2:heHE.EnAvyssoPtaismaton.melody
ltx/en_us_dedes/me.m06.d12:meMA.Ode6H.mode	@ltx/en_us_dedes/miscellanea:misc.Mode2
ltx/en_us_dedes/me.m06.d12:meMA.Ode6H.ode	@ltx/en_us_dedes/miscellanea:misc.Ode6
ltx/en_us_dedes/me.m06.d12:meMA.Ode6H.text	@ltx/en_us_dedes/he.h.m2:heHE.EnAvyssoPtaismaton.text
ltx/en_us_dedes/me.m06.d12:meMA.Ode7C11.greekmelody	@ltx/en_us_dedes/he.h.m2:heHE.EikonosChrysis.greekname
ltx/en_us_dedes/me.m06.d12:meMA.Ode7C11.incipit	…
ltx/en_us_dedes/me.m06.d12:meMA.Ode7C11.melody	@ltx/en_us_dedes/he.h.m2:heHE.EikonosChrysis.name
ltx/en_us_dedes/me.m06.d12:meMA.Ode7C11.mode	@ltx/en_us_dedes/miscellanea:misc.Mode2
ltx/en_us_dedes/me.m06.d12:meMA.Ode7C11.ode	@ltx/en_us_dedes/miscellanea:misc.Ode7
ltx/en_us_dedes/me.m06.d12:meMA.Ode7C11.text	
ltx/en_us_dedes/me.m06.d12:meMA.Ode7C12.incipit	…
ltx/en_us_dedes/me.m06.d12:meMA.Ode7C12.melody	@ltx/en_us_dedes/he.h.m2:heHE.EikonosChrysis.name
ltx/en_us_dedes/me.m06.d12:meMA.Ode7C12.mode	@ltx/en_us_dedes/miscellanea:misc.Mode2
ltx/en_us_dedes/me.m06.d12:meMA.Ode7C12.ode	@ltx/en_us_dedes/miscellanea:misc.Ode7
ltx/en_us_dedes/me.m06.d12:meMA.Ode7C12.text	
ltx/en_us_dedes/me.m06.d12:meMA.Ode7C1T.incipit	…
ltx/en_us_dedes/me.m06.d12:meMA.Ode7C1T.melody	@ltx/en_us_dedes/he.h.m2:heHE.EikonosChrysis.name
ltx/en_us_dedes/me.m06.d12:meMA.Ode7C1T.mode	@ltx/en_us_dedes/miscellanea:misc.Mode2
ltx/en_us_dedes/me.m06.d12:meMA.Ode7C1T.ode	@ltx/en_us_dedes/miscellanea:misc.Ode7
ltx/en_us_dedes/me.m06.d12:meMA.Ode7C1T.text	
ltx/en_us_dedes/me.m06.d12:meMA.Ode8C11.greekmelody	@ltx/en_us_dedes/he.h.m2:heHE.TonEnKaminoTouPyros.greekname
ltx/en_us_dedes/me.m06.d12:meMA.Ode8C11.incipit	…
ltx/en_us_dedes/me.m06.d12:meMA.Ode8C11.melody	@ltx/en_us_dedes/he.h.m2:heHE.TonEnKaminoTouPyros.name
ltx/en_us_dedes/me.m06.d12:meMA.Ode8C11.mode	@ltx/en_us_dedes/miscellanea:misc.Mode2
ltx/en_us_dedes/me.m06.d12:meMA.Ode8C11.ode	@ltx/en_us_dedes/miscellanea:misc.Ode8
ltx/en_us_dedes/me.m06.d12:meMA.Ode8C11.text	
ltx/en_us_dedes/me.m06.d12:meMA.Ode8C12.incipit	…
ltx/en_us_dedes/me.m06.d12:meMA.Ode8C12.melody	@ltx/en_us_dedes/he.h.m2:heHE.TonEnKaminoTouPyros.name
ltx/en_us_dedes/me.m06.d12:meMA.Ode8C12.mode	@ltx/en_us_dedes/miscellanea:misc.Mode2
ltx/en_us_dedes/me.m06.d12:meMA.Ode8C12.ode	@ltx/en_us_dedes/miscellanea:misc.Ode8
ltx/en_us_dedes/me.m06.d12:meMA.Ode8C12.text	
ltx/en_us_dedes/me.m06.d12:meMA.Ode8C1T.incipit	…
ltx/en_us_dedes/me.m06.d12:meMA.Ode8C1T.melody	@ltx/en_us_dedes/he.h.m2:heHE.TonEnKaminoTouPyros.name
ltx/en_us_dedes/me.m06.d12:meMA.Ode8C1T.mode	@ltx/en_us_dedes/miscellanea:misc.Mode2
ltx/en_us_dedes/me.m06.d12:meMA.Ode8C1T.ode	@ltx/en_us_dedes/miscellanea:misc.Ode8
ltx/en_us_dedes/me.m06.d12:meMA.Ode8C1T.text	
ltx/en_us_dedes/me.m06.d12:meMA.Ode8H.greekmelody	@ltx/en_us_dedes/he.h.m2:heHE.TonEnKaminoTouPyros.greekname
ltx/en_us_dedes/me.m06.d12:meMA.Ode8H.incipit	@ltx/en_us_dedes/he.h.m2:heHE.TonEnKaminoTouPyros.incipit
ltx/en_us_dedes/me.m06.d12:meMA.Ode8H.melody	@ltx/en_us_dedes/he.h.m2:heHE.TonEnKaminoTouPyros.melody
ltx/en_us_dedes/me.m06.d12:meMA.Ode8H.mode	@ltx/en_us_dedes/miscellanea:misc.Mode2
ltx/en_us_dedes/me.m06.d12:meMA.Ode8H.ode	@ltx/en_us_dedes/miscellanea:misc.Ode8
ltx/en_us_dedes/me.m06.d12:meMA.Ode8H.text	@ltx/en_us_dedes/he.h.m2:heHE.TonEnKaminoTouPyros.text
ltx/en_us_dedes/me.m06.d12:meMA.Ode9C11.greekmelody	@ltx/en_us_dedes/he.h.m2:heHE.TonEkTheouTheonLogon.greekname
ltx/en_us_dedes/me.m06.d12:meMA.Ode9C11.incipit	…
ltx/en_us_dedes/me.m06.d12:meMA.Ode9C11.melody	@ltx/en_us_dedes/he.h.m2:heHE.TonEkTheouTheonLogon.name
ltx/en_us_dedes/me.m06.d12:meMA.Ode9C11.mode	@ltx/en_us_dedes/miscellanea:misc.Mode2
ltx/en_us_dedes/me.m06.d12:meMA.Ode9C11.ode	@ltx/en_us_dedes/miscellanea:misc.Ode9
ltx/en_us_dedes/me.m06.d12:meMA.Ode9C11.text	
ltx/en_us_dedes/me.m06.d12:meMA.Ode9C12.incipit	…
ltx/en_us_dedes/me.m06.d12:meMA.Ode9C12.melody	@ltx/en_us_dedes/he.h.m2:heHE.TonEkTheouTheonLogon.name
ltx/en_us_dedes/me.m06.d12:meMA.Ode9C12.mode	@ltx/en_us_dedes/miscellanea:misc.Mode2
ltx/en_us_dedes/me.m06.d12:meMA.Ode9C12.ode	@ltx/en_us_dedes/miscellanea:misc.Ode9
ltx/en_us_dedes/me.m06.d12:meMA.Ode9C12.text	
ltx/en_us_dedes/me.m06.d12:meMA.Ode9C13.incipit	…
ltx/en_us_dedes/me.m06.d12:meMA.Ode9C13.melody	@ltx/en_us_dedes/he.h.m2:heHE.TonEkTheouTheonLogon.name
ltx/en_us_dedes/me.m06.d12:meMA.Ode9C13.mode	@ltx/en_us_dedes/miscellanea:misc.Mode2
ltx/en_us_dedes/me.m06.d12:meMA.Ode9C13.ode	@ltx/en_us_dedes/miscellanea:misc.Ode9
ltx/en_us_dedes/me.m06.d12:meMA.Ode9C13.text	
ltx/en_us_dedes/me.m06.d12:meMA.Ode9C1T.incipit	…
ltx/en_us_dedes/me.m06.d12:meMA.Ode9C1T.melody	@ltx/en_us_dedes/he.h.m2:heHE.TonEkTheouTheonLogon.name
ltx/en_us_dedes/me.m06.d12:meMA.Ode9C1T.mode	@ltx/en_us_dedes/miscellanea:misc.Mode2
ltx/en_us_dedes/me.m06.d12:meMA.Ode9C1T.ode	@ltx/en_us_dedes/miscellanea:misc.Ode9
ltx/en_us_dedes/me.m06.d12:meMA.Ode9C1T.text	
ltx/en_us_dedes/me.m06.d12:meMA.Ode9H.greekmelody	@ltx/en_us_dedes/he.h.m2:heHE.TonEkTheouTheonLogon.greekname
ltx/en_us_dedes/me.m06.d12:meMA.Ode9H.incipit	@ltx/en_us_dedes/he.h.m2:heHE.TonEkTheouTheonLogon.incipit
ltx/en_us_dedes/me.m06.d12:meMA.Ode9H.melody	@ltx/en_us_dedes/he.h.m2:heHE.TonEkTheouTheonLogon.melody
ltx/en_us_dedes/me.m06.d12:meMA.Ode9H.mode	@ltx/en_us_dedes/miscellanea:misc.Mode2
ltx/en_us_dedes/me.m06.d12:meMA.Ode9H.ode	@ltx/en_us_dedes/miscellanea:misc.Ode9
ltx/en_us_dedes/me.m06.d12:meMA.Ode9H.text	@ltx/en_us_dedes/he.h.m2:heHE.TonEkTheouTheonLogon.text
ltx/en_us_dedes/me.m06.d12:meMA.Oikos1.text	O Love, the resplendent light! O Love, the sum of all the virtues! You ever fill the celestial hosts with gladness and with grace. You dwelt in all the Saints, the Patriarchs, Prophets, and Apostles. By their prayers dwell in us as well, so that we may join them in singing to God: Alleluia.
ltx/en_us_dedes/me.m06.d12:meVE.AposGlory.incipit	We the multitudes of monastics…
ltx/en_us_dedes/me.m06.d12:meVE.AposGlory.melody	
ltx/en_us_dedes/me.m06.d12:meVE.AposGlory.mode	@ltx/en_us_dedes/miscellanea:misc.Mode8
ltx/en_us_dedes/me.m06.d12:meVE.AposGlory.text	We the multitudes of monastics honor you, Onoufrios, as our teacher and guide. For through you we have learned to walk the truly straight and narrow path. Blessed are you, who served Christ and triumphed over the power of the enemy. As you consort now with the Angels and dwell with the Devout and Righteous, pray with them to the Lord, that He have mercy on our souls.
ltx/en_us_dedes/me.m06.d12:meVE.AposStavrotheotokion.greekmelody	@ltx/en_us_dedes/he.a.m8:heAU.OiMartyresSouKyrie.greekname
ltx/en_us_dedes/me.m06.d12:meVE.AposStavrotheotokion.incipit	@ltx/en_us_dedes/me.m02.d19:meVE.SticStavrotheotokion.incipit
ltx/en_us_dedes/me.m06.d12:meVE.AposStavrotheotokion.melody	@ltx/en_us_dedes/he.a.m8:heAU.OiMartyresSouKyrie.name
ltx/en_us_dedes/me.m06.d12:meVE.AposStavrotheotokion.mode	@ltx/en_us_dedes/miscellanea:misc.Mode8
ltx/en_us_dedes/me.m06.d12:meVE.AposStavrotheotokion.text	@ltx/en_us_dedes/me.m02.d19:meVE.SticStavrotheotokion.text
ltx/en_us_dedes/me.m06.d12:meVE.AposTheotokion.incipit	@ltx/en_us_dedes/oc.m8.d5:ocMA.AposTheotokion.incipit
ltx/en_us_dedes/me.m06.d12:meVE.AposTheotokion.melody	
ltx/en_us_dedes/me.m06.d12:meVE.AposTheotokion.mode	@ltx/en_us_dedes/miscellanea:misc.Mode8
ltx/en_us_dedes/me.m06.d12:meVE.AposTheotokion.text	@ltx/en_us_dedes/oc.m8.d5:ocMA.AposTheotokion.text
ltx/en_us_dedes/me.m06.d12:meVE.Aposticha1.greekmelody	@ltx/en_us_dedes/he.a.m4:heAU.EdokasSimeiosin.greekname
ltx/en_us_dedes/me.m06.d12:meVE.Aposticha1.incipit	God-inspired Saint, desiring the supernal…
ltx/en_us_dedes/me.m06.d12:meVE.Aposticha1.melody	@ltx/en_us_dedes/he.a.m4:heAU.EdokasSimeiosin.name
ltx/en_us_dedes/me.m06.d12:meVE.Aposticha1.mode	@ltx/en_us_dedes/miscellanea:misc.Mode4
ltx/en_us_dedes/me.m06.d12:meVE.Aposticha1.text	God-inspired Saint, desiring the supernal beatitude, * you considered most prudently * self-control as luxury, poverty as riches, * lack of all possessions as having property and wealth, * and humble modesty as renown and fame. * And therefore you attained the aim for which you longed and for which you strove, * O Onoufrios, living now * in the dwellings prepared for Saints.
ltx/en_us_dedes/me.m06.d12:meVE.Aposticha2.incipit	You finished the race of…
ltx/en_us_dedes/me.m06.d12:meVE.Aposticha2.melody	@ltx/en_us_dedes/he.a.m4:heAU.EdokasSimeiosin.name
ltx/en_us_dedes/me.m06.d12:meVE.Aposticha2.mode	@ltx/en_us_dedes/miscellanea:misc.Mode4
ltx/en_us_dedes/me.m06.d12:meVE.Aposticha2.text	You finished the race of the ascetic life without turning back, * and like Paul, you had kept the faith. * Then the crown of righteousness was to you awarded * by Christ who prepared it for you, being the righteous Judge, * who gives the prizes to those deserving them, * bestowing on them honors and rewards for laboring for His sake. * Now entreat Him to rescue us * from distress and calamity.
ltx/en_us_dedes/me.m06.d12:meVE.Aposticha3.incipit	Pommeling your body, like St…
ltx/en_us_dedes/me.m06.d12:meVE.Aposticha3.melody	@ltx/en_us_dedes/he.a.m4:heAU.EdokasSimeiosin.name
ltx/en_us_dedes/me.m06.d12:meVE.Aposticha3.mode	@ltx/en_us_dedes/miscellanea:misc.Mode4
ltx/en_us_dedes/me.m06.d12:meVE.Aposticha3.text	Pommeling your body, like St. Paul, and thereby subduing it, * you renounced every luxury. * With labors of self-control * and physical hardships, * patience in temptation, endurance in critical times, * you vexed your senses, O Father wise in God. * For this you have received, as a reward, unending enjoyment of * the eternal delights on high * and ineffable joy of Christ.
ltx/en_us_dedes/me.m06.d12:meVE.GeneralApolytikion1.greekmelody	@ltx/en_us_dedes/he.ga:heGA.TisErimouPolitis.greekmelody
ltx/en_us_dedes/me.m06.d12:meVE.GeneralApolytikion1.melody	@ltx/en_us_dedes/he.ga:heGA.TisErimouPolitis.name
ltx/en_us_dedes/me.m06.d12:meVE.GeneralApolytikion1.mode	@ltx/en_us_dedes/miscellanea:misc.Mode1
ltx/en_us_dedes/me.m06.d12:meVE.GeneralApolytikion1.name	Onoufrios,
ltx/en_us_dedes/me.m06.d12:meVE.SticGlory.incipit	@ltx/en_us_dedes/me.m01.d15:meVE.AposGlory.incipit
ltx/en_us_dedes/me.m06.d12:meVE.SticGlory.melody	
ltx/en_us_dedes/me.m06.d12:meVE.SticGlory.mode	@ltx/en_us_dedes/miscellanea:misc.Mode6
ltx/en_us_dedes/me.m06.d12:meVE.SticGlory.text	@ltx/en_us_dedes/me.m01.d15:meVE.AposGlory.text
ltx/en_us_dedes/me.m06.d12:meVE.SticStavrotheotokion.greekmelody	@ltx/en_us_dedes/he.a.m6:heAU.TriimerosAnestis.greekname
ltx/en_us_dedes/me.m06.d12:meVE.SticStavrotheotokion.incipit	@ltx/en_us_dedes/oc.m6.d4:ocMA.AposTheotokion.incipit
ltx/en_us_dedes/me.m06.d12:meVE.SticStavrotheotokion.melody	@ltx/en_us_dedes/he.a.m6:heAU.TriimerosAnestis.name
ltx/en_us_dedes/me.m06.d12:meVE.SticStavrotheotokion.mode	@ltx/en_us_dedes/miscellanea:misc.Mode6
ltx/en_us_dedes/me.m06.d12:meVE.SticStavrotheotokion.text	@ltx/en_us_dedes/oc.m6.d4:ocMA.AposTheotokion.text
ltx/en_us_dedes/me.m06.d12:meVE.SticTheotokion.greekmelody	@ltx/en_us_dedes/he.a.m6:heAU.TriimerosAnestis.greekname
ltx/en_us_dedes/me.m06.d12:meVE.SticTheotokion.incipit	…
ltx/en_us_dedes/me.m06.d12:meVE.SticTheotokion.melody	@ltx/en_us_dedes/he.a.m6:heAU.TriimerosAnestis.name
ltx/en_us_dedes/me.m06.d12:meVE.SticTheotokion.mode	@ltx/en_us_dedes/miscellanea:misc.Mode6
ltx/en_us_dedes/me.m06.d12:meVE.SticTheotokion.text	
ltx/en_us_dedes/me.m06.d12:meVE.Stichera01.greekmelody	@ltx/en_us_dedes/he.a.m8:heAU.OTouParadoxou.greekname
ltx/en_us_dedes/me.m06.d12:meVE.Stichera01.incipit	…
ltx/en_us_dedes/me.m06.d12:meVE.Stichera01.melody	@ltx/en_us_dedes/he.a.m8:heAU.OTouParadoxou.name
ltx/en_us_dedes/me.m06.d12:meVE.Stichera01.mode	@ltx/en_us_dedes/miscellanea:misc.Mode8
ltx/en_us_dedes/me.m06.d12:meVE.Stichera01.text	
ltx/en_us_dedes/me.m06.d12:meVE.Stichera02.incipit	…
ltx/en_us_dedes/me.m06.d12:meVE.Stichera02.melody	@ltx/en_us_dedes/he.a.m8:heAU.OTouParadoxou.name
ltx/en_us_dedes/me.m06.d12:meVE.Stichera02.mode	@ltx/en_us_dedes/miscellanea:misc.Mode8
ltx/en_us_dedes/me.m06.d12:meVE.Stichera02.text	
ltx/en_us_dedes/me.m06.d12:meVE.Stichera03.incipit	…
ltx/en_us_dedes/me.m06.d12:meVE.Stichera03.melody	@ltx/en_us_dedes/he.a.m8:heAU.OTouParadoxou.name
ltx/en_us_dedes/me.m06.d12:meVE.Stichera03.mode	@ltx/en_us_dedes/miscellanea:misc.Mode8
ltx/en_us_dedes/me.m06.d12:meVE.Stichera03.text	
