ltx/en_us_dedes/me.m12.d05:meDA.commemoration.first	Memory of St. Savas the Sanctified
ltx/en_us_dedes/me.m12.d05:meDA.commemoration.first_name	
ltx/en_us_dedes/me.m12.d05:meDA.commemoration.first_short	Memory of St. Savas the Sanctified
ltx/en_us_dedes/me.m12.d05:meDA.commemoration.first_title	@ltx/en_us_dedes/titles:ti.SaintM
ltx/en_us_dedes/me.m12.d05:meDA.commemoration.full	Memory of our Devout and God-bearing Father Savas the Sanctified
ltx/en_us_dedes/me.m12.d05:meDA.commemoration.second_name	
ltx/en_us_dedes/me.m12.d05:meDA.commemoration.second_title	
ltx/en_us_dedes/me.m12.d05:meDA.date	December 5
ltx/en_us_dedes/me.m12.d05:meDA.fordate	for December 5
ltx/en_us_dedes/me.m12.d05:meDA.insert1	our devout and God-bearing father Savas the Sanctified,
ltx/en_us_dedes/me.m12.d05:meDA.insert2	whose memory we celebrate,
ltx/en_us_dedes/me.m12.d05:meDA.note	
ltx/en_us_dedes/me.m12.d05:meDA.pdfcoverdate	December 5,
ltx/en_us_dedes/me.m12.d05:meDA.pdfheaderdate	December 5
ltx/en_us_dedes/me.m12.d05:meHO.commemorations	
ltx/en_us_dedes/me.m12.d05:meHO.note1	
ltx/en_us_dedes/me.m12.d05:meHO.note2	
ltx/en_us_dedes/me.m12.d05:meHO.number	
ltx/en_us_dedes/me.m12.d05:meHO.rank	
ltx/en_us_dedes/me.m12.d05:meLE.commemoration1	Our Venerable Father Savas the Blessed.
ltx/en_us_dedes/me.m12.d05:meLE.commemoration2	
ltx/en_us_dedes/me.m12.d05:meLI.Kontakion1.greekmelody	@ltx/en_us_dedes/me.m12.d05:meMA.Kontakion1.greekmelody
ltx/en_us_dedes/me.m12.d05:meLI.Kontakion1.incipit	@ltx/en_us_dedes/me.m12.d05:meMA.Kontakion1.incipit
ltx/en_us_dedes/me.m12.d05:meLI.Kontakion1.melody	@ltx/en_us_dedes/me.m12.d05:meMA.Kontakion1.melody
ltx/en_us_dedes/me.m12.d05:meLI.Kontakion1.mode	@ltx/en_us_dedes/me.m12.d05:meMA.Kontakion1.mode
ltx/en_us_dedes/me.m12.d05:meLI.Kontakion1.text	@ltx/en_us_dedes/me.m12.d05:meMA.Kontakion1.text
ltx/en_us_dedes/me.m12.d05:meLI.MM.CommunionHymn.text	@ltx/en_us_dedes/properties:media.key
ltx/en_us_dedes/me.m12.d05:meLI.Megalynarion.text	
ltx/en_us_dedes/me.m12.d05:meMA.C1.acrostic.notice1	
ltx/en_us_dedes/me.m12.d05:meMA.C1.acrostic.notice2	
ltx/en_us_dedes/me.m12.d05:meMA.C1.acrostic.text	
ltx/en_us_dedes/me.m12.d05:meMA.C1.acrostic.title	
ltx/en_us_dedes/me.m12.d05:meMA.C1.poet	@ltx/en_us_dedes/poets:po.Theofanous
ltx/en_us_dedes/me.m12.d05:meMA.C1.title	@ltx/en_us_dedes/titles:ti.CanonDevoutM
ltx/en_us_dedes/me.m12.d05:meMA.C1.verse	@ltx/en_us_dedes/prayers:pr.verse_DevoutMan.text
ltx/en_us_dedes/me.m12.d05:meMA.ExapTheotokion.incipit	@ltx/en_us_dedes/ho.ho23:hoCA.Exaposteilarion4.incipit
ltx/en_us_dedes/me.m12.d05:meMA.ExapTheotokion.melody	@ltx/en_us_dedes/he.a.m3:heAU.FosAnalloioton.name
ltx/en_us_dedes/me.m12.d05:meMA.ExapTheotokion.mode	@ltx/en_us_dedes/miscellanea:misc.Mode3
ltx/en_us_dedes/me.m12.d05:meMA.ExapTheotokion.text	@ltx/en_us_dedes/ho.ho23:hoCA.Exaposteilarion4.text
ltx/en_us_dedes/me.m12.d05:meMA.Exaposteilarion1.greekmelody	@ltx/en_us_dedes/he.a.m3:heAU.EnPnevmatiToIero.greekname
ltx/en_us_dedes/me.m12.d05:meMA.Exaposteilarion1.incipit	…
ltx/en_us_dedes/me.m12.d05:meMA.Exaposteilarion1.melody	@ltx/en_us_dedes/he.a.m3:heAU.EnPnevmatiToIero.name
ltx/en_us_dedes/me.m12.d05:meMA.Exaposteilarion1.mode	@ltx/en_us_dedes/miscellanea:misc.Mode3
ltx/en_us_dedes/me.m12.d05:meMA.Exaposteilarion1.text	
ltx/en_us_dedes/me.m12.d05:meMA.Exaposteilarion2.greekmelody	@ltx/en_us_dedes/he.a.m3:heAU.FosAnalloioton.greekname
ltx/en_us_dedes/me.m12.d05:meMA.Exaposteilarion2.incipit	Let the wilderness rejoice *…
ltx/en_us_dedes/me.m12.d05:meMA.Exaposteilarion2.melody	@ltx/en_us_dedes/he.a.m3:heAU.FosAnalloioton.name
ltx/en_us_dedes/me.m12.d05:meMA.Exaposteilarion2.mode	@ltx/en_us_dedes/miscellanea:misc.Mode3
ltx/en_us_dedes/me.m12.d05:meMA.Exaposteilarion2.text	Let the wilderness rejoice * and blossom forth like a lily; * for you have increased her children, * O Godly-minded Savas.* And let the region of Jordan * today be joyfully exultant * at your divine memorial.
ltx/en_us_dedes/me.m12.d05:meMA.Kathisma11.greekmelody	@ltx/en_us_dedes/he.a.m1:heAU.TonTafonSouSotir.greekname
ltx/en_us_dedes/me.m12.d05:meMA.Kathisma11.incipit	…
ltx/en_us_dedes/me.m12.d05:meMA.Kathisma11.melody	@ltx/en_us_dedes/he.a.m1:heAU.TonTafonSouSotir.name
ltx/en_us_dedes/me.m12.d05:meMA.Kathisma11.mode	@ltx/en_us_dedes/miscellanea:misc.Mode1
ltx/en_us_dedes/me.m12.d05:meMA.Kathisma11.text	
ltx/en_us_dedes/me.m12.d05:meMA.Kathisma1T.incipit	@ltx/en_us_dedes/oc.m1.d1:ocMA.Kathisma13.incipit
ltx/en_us_dedes/me.m12.d05:meMA.Kathisma1T.melody	@ltx/en_us_dedes/he.a.m1:heAU.TonTafonSouSotir.name
ltx/en_us_dedes/me.m12.d05:meMA.Kathisma1T.mode	@ltx/en_us_dedes/miscellanea:misc.Mode1
ltx/en_us_dedes/me.m12.d05:meMA.Kathisma1T.text	@ltx/en_us_dedes/oc.m1.d1:ocMA.Kathisma13.text
ltx/en_us_dedes/me.m12.d05:meMA.Kathisma21.greekmelody	@ltx/en_us_dedes/he.a.m8:heAU.TinSofianKaiLogon.greekname
ltx/en_us_dedes/me.m12.d05:meMA.Kathisma21.incipit	…
ltx/en_us_dedes/me.m12.d05:meMA.Kathisma21.melody	@ltx/en_us_dedes/he.a.m8:heAU.TinSofianKaiLogon.name
ltx/en_us_dedes/me.m12.d05:meMA.Kathisma21.mode	@ltx/en_us_dedes/miscellanea:misc.Mode8
ltx/en_us_dedes/me.m12.d05:meMA.Kathisma21.text	
ltx/en_us_dedes/me.m12.d05:meMA.Kathisma2T.incipit	@ltx/en_us_dedes/he.a.m8:heAU.TinSofianKaiLogon.incipit
ltx/en_us_dedes/me.m12.d05:meMA.Kathisma2T.melody	@ltx/en_us_dedes/he.a.m8:heAU.TinSofianKaiLogon.melody
ltx/en_us_dedes/me.m12.d05:meMA.Kathisma2T.mode	@ltx/en_us_dedes/miscellanea:misc.Mode8
ltx/en_us_dedes/me.m12.d05:meMA.Kathisma2T.text	@ltx/en_us_dedes/he.a.m8:heAU.TinSofianKaiLogon.text
ltx/en_us_dedes/me.m12.d05:meMA.Kathisma31.greekmelody	@ltx/en_us_dedes/he.a.m8:heAU.TinSofianKaiLogon.greekname
ltx/en_us_dedes/me.m12.d05:meMA.Kathisma31.incipit	Even though you abandoned all…
ltx/en_us_dedes/me.m12.d05:meMA.Kathisma31.melody	@ltx/en_us_dedes/he.a.m8:heAU.TinSofianKaiLogon.name
ltx/en_us_dedes/me.m12.d05:meMA.Kathisma31.mode	@ltx/en_us_dedes/miscellanea:misc.Mode8
ltx/en_us_dedes/me.m12.d05:meMA.Kathisma31.text	Even though you abandoned all things mundane, * you were physically living within the world, * but in spirit you became a partner of the Angels. * For you killed the passions of the body, O blessed one, * and thus became a servant of the all-holy Trinity. * Now you cure the passions and the ills of the ailing. * By God’s grace you drive away evil spirits by word alone, * holy God-bearing Father. * Intercede with Christ our God * that He grant forgiveness of offenses * to those who keep your all-holy memory with faith and love.
ltx/en_us_dedes/me.m12.d05:meMA.Kathisma3T.incipit	@ltx/en_us_dedes/me.m11.d16:meMA.Ode3KathismaT.incipit
ltx/en_us_dedes/me.m12.d05:meMA.Kathisma3T.melody	@ltx/en_us_dedes/he.a.m8:heAU.TinSofianKaiLogon.name
ltx/en_us_dedes/me.m12.d05:meMA.Kathisma3T.mode	@ltx/en_us_dedes/miscellanea:misc.Mode8
ltx/en_us_dedes/me.m12.d05:meMA.Kathisma3T.text	@ltx/en_us_dedes/me.m11.d16:meMA.Ode3KathismaT.text
ltx/en_us_dedes/me.m12.d05:meMA.Kontakion1.greekmelody	@ltx/en_us_dedes/he.a.m8:heAU.TiYpermacho.greekname
ltx/en_us_dedes/me.m12.d05:meMA.Kontakion1.incipit	Since to God, who knew…
ltx/en_us_dedes/me.m12.d05:meMA.Kontakion1.melody	@ltx/en_us_dedes/he.a.m8:heAU.TiYpermacho.name
ltx/en_us_dedes/me.m12.d05:meMA.Kontakion1.mode	@ltx/en_us_dedes/miscellanea:misc.Mode8
ltx/en_us_dedes/me.m12.d05:meMA.Kontakion1.text	Since to God, who knew about you before you were born, you were through virtue offered as a blameless sacrifice from the time you were an infant, O blessed Savas, you became the pride and joy of the ascetic saints, the praiseworthy populater of the wilderness. Hence I cry to you, Rejoice, O Father extolled by all.
ltx/en_us_dedes/me.m12.d05:meMA.Lauds1.greekmelody	@ltx/en_us_dedes/he.a.m1:heAU.TonOuranionTagmaton.greekname
ltx/en_us_dedes/me.m12.d05:meMA.Lauds1.incipit	The Godly-minded Saint Savas, being…
ltx/en_us_dedes/me.m12.d05:meMA.Lauds1.melody	@ltx/en_us_dedes/he.a.m1:heAU.TonOuranionTagmaton.name
ltx/en_us_dedes/me.m12.d05:meMA.Lauds1.mode	@ltx/en_us_dedes/miscellanea:misc.Mode1
ltx/en_us_dedes/me.m12.d05:meMA.Lauds1.text	The Godly-minded Saint Savas, being a sojourner, * disdaining earthly matters * and in love with the heavens, * and a desert-dweller, invites us all * to observe the time-honored day * of his departure to God and to celebrate * his memorial with faith and love.
ltx/en_us_dedes/me.m12.d05:meMA.Lauds2.incipit	Since you became by your…
ltx/en_us_dedes/me.m12.d05:meMA.Lauds2.melody	@ltx/en_us_dedes/he.a.m1:heAU.TonOuranionTagmaton.name
ltx/en_us_dedes/me.m12.d05:meMA.Lauds2.mode	@ltx/en_us_dedes/miscellanea:misc.Mode1
ltx/en_us_dedes/me.m12.d05:meMA.Lauds2.text	Since you became by your virtues outside the flesh and the world * and did throughout your lifetime * glorify through those virtues * the Lord of glory, worthily He in turn * glorified you and showed you forth * as a divine spring of healings for us on earth, * Father Savas, wise and God-inspired.
ltx/en_us_dedes/me.m12.d05:meMA.Lauds3.incipit	Modest and innocent, gentle, simple…
ltx/en_us_dedes/me.m12.d05:meMA.Lauds3.melody	@ltx/en_us_dedes/he.a.m1:heAU.TonOuranionTagmaton.name
ltx/en_us_dedes/me.m12.d05:meMA.Lauds3.mode	@ltx/en_us_dedes/miscellanea:misc.Mode1
ltx/en_us_dedes/me.m12.d05:meMA.Lauds3.text	Modest and innocent, gentle, simple and quiet too, * in superhuman measure, were you truly, O Father. * You were known as worthy in every way, * as a spiritual house of God, * while yet material. And sympathetically * you transmit to us the gifts He gave you.
ltx/en_us_dedes/me.m12.d05:meMA.LaudsGlory.incipit	@ltx/en_us_dedes/me.m01.d15:meVE.AposGlory.incipit
ltx/en_us_dedes/me.m12.d05:meMA.LaudsGlory.melody	
ltx/en_us_dedes/me.m12.d05:meMA.LaudsGlory.mode	@ltx/en_us_dedes/miscellanea:misc.Mode6
ltx/en_us_dedes/me.m12.d05:meMA.LaudsGlory.text	@ltx/en_us_dedes/me.m01.d15:meVE.AposGlory.text
ltx/en_us_dedes/me.m12.d05:meMA.LaudsTheotokion.incipit	@ltx/en_us_dedes/he.o:heOT.TheotokeSyEi.incipit
ltx/en_us_dedes/me.m12.d05:meMA.LaudsTheotokion.melody	@ltx/en_us_dedes/he.o:heOT.TheotokeSyEi.name
ltx/en_us_dedes/me.m12.d05:meMA.LaudsTheotokion.mode	@ltx/en_us_dedes/miscellanea:misc.Mode6
ltx/en_us_dedes/me.m12.d05:meMA.LaudsTheotokion.text	@ltx/en_us_dedes/he.o:heOT.TheotokeSyEiOsiou.text
ltx/en_us_dedes/me.m12.d05:meMA.MM.Lauds1123as5678.text	@ltx/en_us_dedes/properties:media.key
ltx/en_us_dedes/me.m12.d05:meMA.Ode1C11.greekmelody	@ltx/en_us_dedes/he.h.m8:heHE.ArmatilatinFarao.greekname
ltx/en_us_dedes/me.m12.d05:meMA.Ode1C11.incipit	…
ltx/en_us_dedes/me.m12.d05:meMA.Ode1C11.melody	@ltx/en_us_dedes/he.h.m8:heHE.ArmatilatinFarao.name
ltx/en_us_dedes/me.m12.d05:meMA.Ode1C11.mode	@ltx/en_us_dedes/miscellanea:misc.Mode8
ltx/en_us_dedes/me.m12.d05:meMA.Ode1C11.ode	@ltx/en_us_dedes/miscellanea:misc.Ode1
ltx/en_us_dedes/me.m12.d05:meMA.Ode1C11.text	
ltx/en_us_dedes/me.m12.d05:meMA.Ode1C12.incipit	…
ltx/en_us_dedes/me.m12.d05:meMA.Ode1C12.melody	@ltx/en_us_dedes/he.h.m8:heHE.ArmatilatinFarao.name
ltx/en_us_dedes/me.m12.d05:meMA.Ode1C12.mode	@ltx/en_us_dedes/miscellanea:misc.Mode8
ltx/en_us_dedes/me.m12.d05:meMA.Ode1C12.ode	@ltx/en_us_dedes/miscellanea:misc.Ode1
ltx/en_us_dedes/me.m12.d05:meMA.Ode1C12.text	
ltx/en_us_dedes/me.m12.d05:meMA.Ode1C13.incipit	…
ltx/en_us_dedes/me.m12.d05:meMA.Ode1C13.melody	@ltx/en_us_dedes/he.h.m8:heHE.ArmatilatinFarao.name
ltx/en_us_dedes/me.m12.d05:meMA.Ode1C13.mode	@ltx/en_us_dedes/miscellanea:misc.Mode8
ltx/en_us_dedes/me.m12.d05:meMA.Ode1C13.ode	@ltx/en_us_dedes/miscellanea:misc.Ode1
ltx/en_us_dedes/me.m12.d05:meMA.Ode1C13.text	
ltx/en_us_dedes/me.m12.d05:meMA.Ode1C14.incipit	…
ltx/en_us_dedes/me.m12.d05:meMA.Ode1C14.melody	@ltx/en_us_dedes/he.h.m8:heHE.ArmatilatinFarao.name
ltx/en_us_dedes/me.m12.d05:meMA.Ode1C14.mode	@ltx/en_us_dedes/miscellanea:misc.Mode8
ltx/en_us_dedes/me.m12.d05:meMA.Ode1C14.ode	@ltx/en_us_dedes/miscellanea:misc.Ode1
ltx/en_us_dedes/me.m12.d05:meMA.Ode1C14.text	
ltx/en_us_dedes/me.m12.d05:meMA.Ode1C1T.incipit	…
ltx/en_us_dedes/me.m12.d05:meMA.Ode1C1T.melody	@ltx/en_us_dedes/he.h.m8:heHE.ArmatilatinFarao.name
ltx/en_us_dedes/me.m12.d05:meMA.Ode1C1T.mode	@ltx/en_us_dedes/miscellanea:misc.Mode8
ltx/en_us_dedes/me.m12.d05:meMA.Ode1C1T.ode	@ltx/en_us_dedes/miscellanea:misc.Ode1
ltx/en_us_dedes/me.m12.d05:meMA.Ode1C1T.text	
ltx/en_us_dedes/me.m12.d05:meMA.Ode3C11.greekmelody	@ltx/en_us_dedes/he.h.m8:heHE.OStereosasKatArchas.greekname
ltx/en_us_dedes/me.m12.d05:meMA.Ode3C11.incipit	…
ltx/en_us_dedes/me.m12.d05:meMA.Ode3C11.melody	@ltx/en_us_dedes/he.h.m8:heHE.OStereosasKatArchas.name
ltx/en_us_dedes/me.m12.d05:meMA.Ode3C11.mode	@ltx/en_us_dedes/miscellanea:misc.Mode8
ltx/en_us_dedes/me.m12.d05:meMA.Ode3C11.ode	@ltx/en_us_dedes/miscellanea:misc.Ode3
ltx/en_us_dedes/me.m12.d05:meMA.Ode3C11.text	
ltx/en_us_dedes/me.m12.d05:meMA.Ode3C12.incipit	…
ltx/en_us_dedes/me.m12.d05:meMA.Ode3C12.melody	@ltx/en_us_dedes/he.h.m8:heHE.OStereosasKatArchas.name
ltx/en_us_dedes/me.m12.d05:meMA.Ode3C12.mode	@ltx/en_us_dedes/miscellanea:misc.Mode8
ltx/en_us_dedes/me.m12.d05:meMA.Ode3C12.ode	@ltx/en_us_dedes/miscellanea:misc.Ode3
ltx/en_us_dedes/me.m12.d05:meMA.Ode3C12.text	
ltx/en_us_dedes/me.m12.d05:meMA.Ode3C13.incipit	…
ltx/en_us_dedes/me.m12.d05:meMA.Ode3C13.melody	@ltx/en_us_dedes/he.h.m8:heHE.OStereosasKatArchas.name
ltx/en_us_dedes/me.m12.d05:meMA.Ode3C13.mode	@ltx/en_us_dedes/miscellanea:misc.Mode8
ltx/en_us_dedes/me.m12.d05:meMA.Ode3C13.ode	@ltx/en_us_dedes/miscellanea:misc.Ode3
ltx/en_us_dedes/me.m12.d05:meMA.Ode3C13.text	
ltx/en_us_dedes/me.m12.d05:meMA.Ode3C14.incipit	…
ltx/en_us_dedes/me.m12.d05:meMA.Ode3C14.melody	@ltx/en_us_dedes/he.h.m8:heHE.OStereosasKatArchas.name
ltx/en_us_dedes/me.m12.d05:meMA.Ode3C14.mode	@ltx/en_us_dedes/miscellanea:misc.Mode8
ltx/en_us_dedes/me.m12.d05:meMA.Ode3C14.ode	@ltx/en_us_dedes/miscellanea:misc.Ode3
ltx/en_us_dedes/me.m12.d05:meMA.Ode3C14.text	
ltx/en_us_dedes/me.m12.d05:meMA.Ode3C1T.incipit	…
ltx/en_us_dedes/me.m12.d05:meMA.Ode3C1T.melody	@ltx/en_us_dedes/he.h.m8:heHE.OStereosasKatArchas.name
ltx/en_us_dedes/me.m12.d05:meMA.Ode3C1T.mode	@ltx/en_us_dedes/miscellanea:misc.Mode8
ltx/en_us_dedes/me.m12.d05:meMA.Ode3C1T.ode	@ltx/en_us_dedes/miscellanea:misc.Ode3
ltx/en_us_dedes/me.m12.d05:meMA.Ode3C1T.text	
ltx/en_us_dedes/me.m12.d05:meMA.Ode3Kathisma1.greekmelody	@ltx/en_us_dedes/he.a.m8:heAU.TinSofianKaiLogon.greekname
ltx/en_us_dedes/me.m12.d05:meMA.Ode3Kathisma1.incipit	…
ltx/en_us_dedes/me.m12.d05:meMA.Ode3Kathisma1.melody	@ltx/en_us_dedes/he.a.m8:heAU.TinSofianKaiLogon.name
ltx/en_us_dedes/me.m12.d05:meMA.Ode3Kathisma1.mode	@ltx/en_us_dedes/miscellanea:misc.Mode8
ltx/en_us_dedes/me.m12.d05:meMA.Ode3Kathisma1.text	
ltx/en_us_dedes/me.m12.d05:meMA.Ode3KathismaT.incipit	…
ltx/en_us_dedes/me.m12.d05:meMA.Ode3KathismaT.melody	@ltx/en_us_dedes/he.a.m8:heAU.TinSofianKaiLogon.name
ltx/en_us_dedes/me.m12.d05:meMA.Ode3KathismaT.mode	@ltx/en_us_dedes/miscellanea:misc.Mode8
ltx/en_us_dedes/me.m12.d05:meMA.Ode3KathismaT.text	
ltx/en_us_dedes/me.m12.d05:meMA.Ode4C11.greekmelody	@ltx/en_us_dedes/he.h.m8:heHE.SyMouIschys.greekname
ltx/en_us_dedes/me.m12.d05:meMA.Ode4C11.incipit	…
ltx/en_us_dedes/me.m12.d05:meMA.Ode4C11.melody	@ltx/en_us_dedes/he.h.m8:heHE.SyMouIschys.name
ltx/en_us_dedes/me.m12.d05:meMA.Ode4C11.mode	@ltx/en_us_dedes/miscellanea:misc.Mode8
ltx/en_us_dedes/me.m12.d05:meMA.Ode4C11.ode	@ltx/en_us_dedes/miscellanea:misc.Ode4
ltx/en_us_dedes/me.m12.d05:meMA.Ode4C11.text	
ltx/en_us_dedes/me.m12.d05:meMA.Ode4C12.incipit	…
ltx/en_us_dedes/me.m12.d05:meMA.Ode4C12.melody	@ltx/en_us_dedes/he.h.m8:heHE.SyMouIschys.name
ltx/en_us_dedes/me.m12.d05:meMA.Ode4C12.mode	@ltx/en_us_dedes/miscellanea:misc.Mode8
ltx/en_us_dedes/me.m12.d05:meMA.Ode4C12.ode	@ltx/en_us_dedes/miscellanea:misc.Ode4
ltx/en_us_dedes/me.m12.d05:meMA.Ode4C12.text	
ltx/en_us_dedes/me.m12.d05:meMA.Ode4C13.incipit	…
ltx/en_us_dedes/me.m12.d05:meMA.Ode4C13.melody	@ltx/en_us_dedes/he.h.m8:heHE.SyMouIschys.name
ltx/en_us_dedes/me.m12.d05:meMA.Ode4C13.mode	@ltx/en_us_dedes/miscellanea:misc.Mode8
ltx/en_us_dedes/me.m12.d05:meMA.Ode4C13.ode	@ltx/en_us_dedes/miscellanea:misc.Ode4
ltx/en_us_dedes/me.m12.d05:meMA.Ode4C13.text	
ltx/en_us_dedes/me.m12.d05:meMA.Ode4C14.incipit	…
ltx/en_us_dedes/me.m12.d05:meMA.Ode4C14.melody	@ltx/en_us_dedes/he.h.m8:heHE.SyMouIschys.name
ltx/en_us_dedes/me.m12.d05:meMA.Ode4C14.mode	@ltx/en_us_dedes/miscellanea:misc.Mode8
ltx/en_us_dedes/me.m12.d05:meMA.Ode4C14.ode	@ltx/en_us_dedes/miscellanea:misc.Ode4
ltx/en_us_dedes/me.m12.d05:meMA.Ode4C14.text	
ltx/en_us_dedes/me.m12.d05:meMA.Ode4C1T.incipit	…
ltx/en_us_dedes/me.m12.d05:meMA.Ode4C1T.melody	@ltx/en_us_dedes/he.h.m8:heHE.SyMouIschys.name
ltx/en_us_dedes/me.m12.d05:meMA.Ode4C1T.mode	@ltx/en_us_dedes/miscellanea:misc.Mode8
ltx/en_us_dedes/me.m12.d05:meMA.Ode4C1T.ode	@ltx/en_us_dedes/miscellanea:misc.Ode4
ltx/en_us_dedes/me.m12.d05:meMA.Ode4C1T.text	
ltx/en_us_dedes/me.m12.d05:meMA.Ode5C11.greekmelody	@ltx/en_us_dedes/he.h.m8:heHE.InaTiMeAposo.greekname
ltx/en_us_dedes/me.m12.d05:meMA.Ode5C11.incipit	…
ltx/en_us_dedes/me.m12.d05:meMA.Ode5C11.melody	@ltx/en_us_dedes/he.h.m8:heHE.InaTiMeAposo.name
ltx/en_us_dedes/me.m12.d05:meMA.Ode5C11.mode	@ltx/en_us_dedes/miscellanea:misc.Mode8
ltx/en_us_dedes/me.m12.d05:meMA.Ode5C11.ode	@ltx/en_us_dedes/miscellanea:misc.Ode5
ltx/en_us_dedes/me.m12.d05:meMA.Ode5C11.text	
ltx/en_us_dedes/me.m12.d05:meMA.Ode5C12.incipit	…
ltx/en_us_dedes/me.m12.d05:meMA.Ode5C12.melody	@ltx/en_us_dedes/he.h.m8:heHE.InaTiMeAposo.name
ltx/en_us_dedes/me.m12.d05:meMA.Ode5C12.mode	@ltx/en_us_dedes/miscellanea:misc.Mode8
ltx/en_us_dedes/me.m12.d05:meMA.Ode5C12.ode	@ltx/en_us_dedes/miscellanea:misc.Ode5
ltx/en_us_dedes/me.m12.d05:meMA.Ode5C12.text	
ltx/en_us_dedes/me.m12.d05:meMA.Ode5C13.incipit	…
ltx/en_us_dedes/me.m12.d05:meMA.Ode5C13.melody	@ltx/en_us_dedes/he.h.m8:heHE.InaTiMeAposo.name
ltx/en_us_dedes/me.m12.d05:meMA.Ode5C13.mode	@ltx/en_us_dedes/miscellanea:misc.Mode8
ltx/en_us_dedes/me.m12.d05:meMA.Ode5C13.ode	@ltx/en_us_dedes/miscellanea:misc.Ode5
ltx/en_us_dedes/me.m12.d05:meMA.Ode5C13.text	
ltx/en_us_dedes/me.m12.d05:meMA.Ode5C14.incipit	…
ltx/en_us_dedes/me.m12.d05:meMA.Ode5C14.melody	@ltx/en_us_dedes/he.h.m8:heHE.InaTiMeAposo.name
ltx/en_us_dedes/me.m12.d05:meMA.Ode5C14.mode	@ltx/en_us_dedes/miscellanea:misc.Mode8
ltx/en_us_dedes/me.m12.d05:meMA.Ode5C14.ode	@ltx/en_us_dedes/miscellanea:misc.Ode5
ltx/en_us_dedes/me.m12.d05:meMA.Ode5C14.text	
ltx/en_us_dedes/me.m12.d05:meMA.Ode5C1T.incipit	…
ltx/en_us_dedes/me.m12.d05:meMA.Ode5C1T.melody	@ltx/en_us_dedes/he.h.m8:heHE.InaTiMeAposo.name
ltx/en_us_dedes/me.m12.d05:meMA.Ode5C1T.mode	@ltx/en_us_dedes/miscellanea:misc.Mode8
ltx/en_us_dedes/me.m12.d05:meMA.Ode5C1T.ode	@ltx/en_us_dedes/miscellanea:misc.Ode5
ltx/en_us_dedes/me.m12.d05:meMA.Ode5C1T.text	
ltx/en_us_dedes/me.m12.d05:meMA.Ode6C11.greekmelody	@ltx/en_us_dedes/he.h.m8:heHE.IlasthitiMoiSotir.greekname
ltx/en_us_dedes/me.m12.d05:meMA.Ode6C11.incipit	…
ltx/en_us_dedes/me.m12.d05:meMA.Ode6C11.melody	@ltx/en_us_dedes/he.h.m8:heHE.IlasthitiMoiSotir.name
ltx/en_us_dedes/me.m12.d05:meMA.Ode6C11.mode	@ltx/en_us_dedes/miscellanea:misc.Mode8
ltx/en_us_dedes/me.m12.d05:meMA.Ode6C11.ode	@ltx/en_us_dedes/miscellanea:misc.Ode6
ltx/en_us_dedes/me.m12.d05:meMA.Ode6C11.text	
ltx/en_us_dedes/me.m12.d05:meMA.Ode6C12.incipit	…
ltx/en_us_dedes/me.m12.d05:meMA.Ode6C12.melody	@ltx/en_us_dedes/he.h.m8:heHE.IlasthitiMoiSotir.name
ltx/en_us_dedes/me.m12.d05:meMA.Ode6C12.mode	@ltx/en_us_dedes/miscellanea:misc.Mode8
ltx/en_us_dedes/me.m12.d05:meMA.Ode6C12.ode	@ltx/en_us_dedes/miscellanea:misc.Ode6
ltx/en_us_dedes/me.m12.d05:meMA.Ode6C12.text	
ltx/en_us_dedes/me.m12.d05:meMA.Ode6C13.incipit	…
ltx/en_us_dedes/me.m12.d05:meMA.Ode6C13.melody	@ltx/en_us_dedes/he.h.m8:heHE.IlasthitiMoiSotir.name
ltx/en_us_dedes/me.m12.d05:meMA.Ode6C13.mode	@ltx/en_us_dedes/miscellanea:misc.Mode8
ltx/en_us_dedes/me.m12.d05:meMA.Ode6C13.ode	@ltx/en_us_dedes/miscellanea:misc.Ode6
ltx/en_us_dedes/me.m12.d05:meMA.Ode6C13.text	
ltx/en_us_dedes/me.m12.d05:meMA.Ode6C1T.incipit	…
ltx/en_us_dedes/me.m12.d05:meMA.Ode6C1T.melody	@ltx/en_us_dedes/he.h.m8:heHE.IlasthitiMoiSotir.name
ltx/en_us_dedes/me.m12.d05:meMA.Ode6C1T.mode	@ltx/en_us_dedes/miscellanea:misc.Mode8
ltx/en_us_dedes/me.m12.d05:meMA.Ode6C1T.ode	@ltx/en_us_dedes/miscellanea:misc.Ode6
ltx/en_us_dedes/me.m12.d05:meMA.Ode6C1T.text	
ltx/en_us_dedes/me.m12.d05:meMA.Ode7C11.greekmelody	@ltx/en_us_dedes/he.h.m8:heHE.TheouSynkatavasin.greekname
ltx/en_us_dedes/me.m12.d05:meMA.Ode7C11.incipit	…
ltx/en_us_dedes/me.m12.d05:meMA.Ode7C11.melody	@ltx/en_us_dedes/he.h.m8:heHE.TheouSynkatavasin.name
ltx/en_us_dedes/me.m12.d05:meMA.Ode7C11.mode	@ltx/en_us_dedes/miscellanea:misc.Mode8
ltx/en_us_dedes/me.m12.d05:meMA.Ode7C11.ode	@ltx/en_us_dedes/miscellanea:misc.Ode7
ltx/en_us_dedes/me.m12.d05:meMA.Ode7C11.text	
ltx/en_us_dedes/me.m12.d05:meMA.Ode7C12.incipit	…
ltx/en_us_dedes/me.m12.d05:meMA.Ode7C12.melody	@ltx/en_us_dedes/he.h.m8:heHE.TheouSynkatavasin.name
ltx/en_us_dedes/me.m12.d05:meMA.Ode7C12.mode	@ltx/en_us_dedes/miscellanea:misc.Mode8
ltx/en_us_dedes/me.m12.d05:meMA.Ode7C12.ode	@ltx/en_us_dedes/miscellanea:misc.Ode7
ltx/en_us_dedes/me.m12.d05:meMA.Ode7C12.text	
ltx/en_us_dedes/me.m12.d05:meMA.Ode7C13.incipit	…
ltx/en_us_dedes/me.m12.d05:meMA.Ode7C13.melody	@ltx/en_us_dedes/he.h.m8:heHE.TheouSynkatavasin.name
ltx/en_us_dedes/me.m12.d05:meMA.Ode7C13.mode	@ltx/en_us_dedes/miscellanea:misc.Mode8
ltx/en_us_dedes/me.m12.d05:meMA.Ode7C13.ode	@ltx/en_us_dedes/miscellanea:misc.Ode7
ltx/en_us_dedes/me.m12.d05:meMA.Ode7C13.text	
ltx/en_us_dedes/me.m12.d05:meMA.Ode7C1T.incipit	…
ltx/en_us_dedes/me.m12.d05:meMA.Ode7C1T.melody	@ltx/en_us_dedes/he.h.m8:heHE.TheouSynkatavasin.name
ltx/en_us_dedes/me.m12.d05:meMA.Ode7C1T.mode	@ltx/en_us_dedes/miscellanea:misc.Mode8
ltx/en_us_dedes/me.m12.d05:meMA.Ode7C1T.ode	@ltx/en_us_dedes/miscellanea:misc.Ode7
ltx/en_us_dedes/me.m12.d05:meMA.Ode7C1T.text	
ltx/en_us_dedes/me.m12.d05:meMA.Ode8C11.greekmelody	@ltx/en_us_dedes/he.h.m8:heHE.EptaplasiosKaminon.greekname
ltx/en_us_dedes/me.m12.d05:meMA.Ode8C11.incipit	…
ltx/en_us_dedes/me.m12.d05:meMA.Ode8C11.melody	@ltx/en_us_dedes/he.h.m8:heHE.EptaplasiosKaminon.name
ltx/en_us_dedes/me.m12.d05:meMA.Ode8C11.mode	@ltx/en_us_dedes/miscellanea:misc.Mode8
ltx/en_us_dedes/me.m12.d05:meMA.Ode8C11.ode	@ltx/en_us_dedes/miscellanea:misc.Ode8
ltx/en_us_dedes/me.m12.d05:meMA.Ode8C11.text	
ltx/en_us_dedes/me.m12.d05:meMA.Ode8C12.incipit	…
ltx/en_us_dedes/me.m12.d05:meMA.Ode8C12.melody	@ltx/en_us_dedes/he.h.m8:heHE.EptaplasiosKaminon.name
ltx/en_us_dedes/me.m12.d05:meMA.Ode8C12.mode	@ltx/en_us_dedes/miscellanea:misc.Mode8
ltx/en_us_dedes/me.m12.d05:meMA.Ode8C12.ode	@ltx/en_us_dedes/miscellanea:misc.Ode8
ltx/en_us_dedes/me.m12.d05:meMA.Ode8C12.text	
ltx/en_us_dedes/me.m12.d05:meMA.Ode8C13.incipit	…
ltx/en_us_dedes/me.m12.d05:meMA.Ode8C13.melody	@ltx/en_us_dedes/he.h.m8:heHE.EptaplasiosKaminon.name
ltx/en_us_dedes/me.m12.d05:meMA.Ode8C13.mode	@ltx/en_us_dedes/miscellanea:misc.Mode8
ltx/en_us_dedes/me.m12.d05:meMA.Ode8C13.ode	@ltx/en_us_dedes/miscellanea:misc.Ode8
ltx/en_us_dedes/me.m12.d05:meMA.Ode8C13.text	
ltx/en_us_dedes/me.m12.d05:meMA.Ode8C14.incipit	…
ltx/en_us_dedes/me.m12.d05:meMA.Ode8C14.melody	@ltx/en_us_dedes/he.h.m8:heHE.EptaplasiosKaminon.name
ltx/en_us_dedes/me.m12.d05:meMA.Ode8C14.mode	@ltx/en_us_dedes/miscellanea:misc.Mode8
ltx/en_us_dedes/me.m12.d05:meMA.Ode8C14.ode	@ltx/en_us_dedes/miscellanea:misc.Ode8
ltx/en_us_dedes/me.m12.d05:meMA.Ode8C14.text	
ltx/en_us_dedes/me.m12.d05:meMA.Ode8C1T.incipit	…
ltx/en_us_dedes/me.m12.d05:meMA.Ode8C1T.melody	@ltx/en_us_dedes/he.h.m8:heHE.EptaplasiosKaminon.name
ltx/en_us_dedes/me.m12.d05:meMA.Ode8C1T.mode	@ltx/en_us_dedes/miscellanea:misc.Mode8
ltx/en_us_dedes/me.m12.d05:meMA.Ode8C1T.ode	@ltx/en_us_dedes/miscellanea:misc.Ode8
ltx/en_us_dedes/me.m12.d05:meMA.Ode8C1T.text	
ltx/en_us_dedes/me.m12.d05:meMA.Ode9C11.greekmelody	@ltx/en_us_dedes/he.h.m8:heHE.ExestiEpiTouto.greekname
ltx/en_us_dedes/me.m12.d05:meMA.Ode9C11.incipit	…
ltx/en_us_dedes/me.m12.d05:meMA.Ode9C11.melody	@ltx/en_us_dedes/he.h.m8:heHE.ExestiEpiTouto.name
ltx/en_us_dedes/me.m12.d05:meMA.Ode9C11.mode	@ltx/en_us_dedes/miscellanea:misc.Mode8
ltx/en_us_dedes/me.m12.d05:meMA.Ode9C11.ode	@ltx/en_us_dedes/miscellanea:misc.Ode9
ltx/en_us_dedes/me.m12.d05:meMA.Ode9C11.text	
ltx/en_us_dedes/me.m12.d05:meMA.Ode9C12.incipit	…
ltx/en_us_dedes/me.m12.d05:meMA.Ode9C12.melody	@ltx/en_us_dedes/he.h.m8:heHE.ExestiEpiTouto.name
ltx/en_us_dedes/me.m12.d05:meMA.Ode9C12.mode	@ltx/en_us_dedes/miscellanea:misc.Mode8
ltx/en_us_dedes/me.m12.d05:meMA.Ode9C12.ode	@ltx/en_us_dedes/miscellanea:misc.Ode9
ltx/en_us_dedes/me.m12.d05:meMA.Ode9C12.text	
ltx/en_us_dedes/me.m12.d05:meMA.Ode9C13.incipit	…
ltx/en_us_dedes/me.m12.d05:meMA.Ode9C13.melody	@ltx/en_us_dedes/he.h.m8:heHE.ExestiEpiTouto.name
ltx/en_us_dedes/me.m12.d05:meMA.Ode9C13.mode	@ltx/en_us_dedes/miscellanea:misc.Mode8
ltx/en_us_dedes/me.m12.d05:meMA.Ode9C13.ode	@ltx/en_us_dedes/miscellanea:misc.Ode9
ltx/en_us_dedes/me.m12.d05:meMA.Ode9C13.text	
ltx/en_us_dedes/me.m12.d05:meMA.Ode9C14.incipit	…
ltx/en_us_dedes/me.m12.d05:meMA.Ode9C14.melody	@ltx/en_us_dedes/he.h.m8:heHE.ExestiEpiTouto.name
ltx/en_us_dedes/me.m12.d05:meMA.Ode9C14.mode	@ltx/en_us_dedes/miscellanea:misc.Mode8
ltx/en_us_dedes/me.m12.d05:meMA.Ode9C14.ode	@ltx/en_us_dedes/miscellanea:misc.Ode9
ltx/en_us_dedes/me.m12.d05:meMA.Ode9C14.text	
ltx/en_us_dedes/me.m12.d05:meMA.Ode9C1T.incipit	…
ltx/en_us_dedes/me.m12.d05:meMA.Ode9C1T.melody	@ltx/en_us_dedes/he.h.m8:heHE.ExestiEpiTouto.name
ltx/en_us_dedes/me.m12.d05:meMA.Ode9C1T.mode	@ltx/en_us_dedes/miscellanea:misc.Mode8
ltx/en_us_dedes/me.m12.d05:meMA.Ode9C1T.ode	@ltx/en_us_dedes/miscellanea:misc.Ode9
ltx/en_us_dedes/me.m12.d05:meMA.Ode9C1T.text	
ltx/en_us_dedes/me.m12.d05:meMA.Oikos1.text	As the offshoot of wisdom, O devout Savas, from childhood you longed for the hypostatic Wisdom. When it dwelt with you, it separated you from the earth and led you up on high, and weaved for you a garland of immaterial flowers and laid it on your hallowed head, O Godly-minded man. Being thus decorated, propitiate God, that I might worthily be given wisdom of speech, so that I may extol your holy Dormition which Christ our God glorified. Therefore we cry to you, Rejoice, O Father extolled by all.
ltx/en_us_dedes/me.m12.d05:meMA.PostGospelBoth.incipit	@ltx/en_us_dedes/ho.ho03:hoMA.PostGospelTheotokos.incipit
ltx/en_us_dedes/me.m12.d05:meMA.PostGospelBoth.melody	
ltx/en_us_dedes/me.m12.d05:meMA.PostGospelBoth.mode	@ltx/en_us_dedes/miscellanea:misc.Mode2
ltx/en_us_dedes/me.m12.d05:meMA.PostGospelBoth.text	@ltx/en_us_dedes/ho.ho03:hoMA.PostGospelTheotokos.text
ltx/en_us_dedes/me.m12.d05:meMA.PostGospelGlory.incipit	@ltx/en_us_dedes/ho.ho03:hoMA.PostGospelMonastic.incipit
ltx/en_us_dedes/me.m12.d05:meMA.PostGospelGlory.melody	
ltx/en_us_dedes/me.m12.d05:meMA.PostGospelGlory.mode	@ltx/en_us_dedes/miscellanea:misc.Mode2
ltx/en_us_dedes/me.m12.d05:meMA.PostGospelGlory.text	@ltx/en_us_dedes/ho.ho03:hoMA.PostGospelMonastic.text
ltx/en_us_dedes/me.m12.d05:meMA.PostGospelIdiomelon.incipit	@ltx/en_us_dedes/me.m01.d15:meVE.AposGlory.incipit
ltx/en_us_dedes/me.m12.d05:meMA.PostGospelIdiomelon.melody	
ltx/en_us_dedes/me.m12.d05:meMA.PostGospelIdiomelon.mode	@ltx/en_us_dedes/miscellanea:misc.Mode6
ltx/en_us_dedes/me.m12.d05:meMA.PostGospelIdiomelon.text	@ltx/en_us_dedes/me.m01.d15:meVE.AposGlory.text
ltx/en_us_dedes/me.m12.d05:meSV.AposGlory.incipit	…
ltx/en_us_dedes/me.m12.d05:meSV.AposGlory.melody	@ltx/en_us_dedes/he.a.m2:heAU.OikosTouEfratha.name
ltx/en_us_dedes/me.m12.d05:meSV.AposGlory.mode	@ltx/en_us_dedes/miscellanea:misc.Mode2
ltx/en_us_dedes/me.m12.d05:meSV.AposGlory.text	
ltx/en_us_dedes/me.m12.d05:meSV.Aposticha1.incipit	…
ltx/en_us_dedes/me.m12.d05:meSV.Aposticha1.melody	@ltx/en_us_dedes/he.a.m2:heAU.OikosTouEfratha.name
ltx/en_us_dedes/me.m12.d05:meSV.Aposticha1.mode	@ltx/en_us_dedes/miscellanea:misc.Mode2
ltx/en_us_dedes/me.m12.d05:meSV.Aposticha1.text	
ltx/en_us_dedes/me.m12.d05:meSV.Aposticha2.incipit	…
ltx/en_us_dedes/me.m12.d05:meSV.Aposticha2.melody	@ltx/en_us_dedes/he.a.m2:heAU.OikosTouEfratha.name
ltx/en_us_dedes/me.m12.d05:meSV.Aposticha2.mode	@ltx/en_us_dedes/miscellanea:misc.Mode2
ltx/en_us_dedes/me.m12.d05:meSV.Aposticha2.text	
ltx/en_us_dedes/me.m12.d05:meSV.Aposticha3.incipit	…
ltx/en_us_dedes/me.m12.d05:meSV.Aposticha3.melody	@ltx/en_us_dedes/he.a.m2:heAU.OikosTouEfratha.name
ltx/en_us_dedes/me.m12.d05:meSV.Aposticha3.mode	@ltx/en_us_dedes/miscellanea:misc.Mode2
ltx/en_us_dedes/me.m12.d05:meSV.Aposticha3.text	
ltx/en_us_dedes/me.m12.d05:meSV.SticBoth.incipit	@ltx/en_us_dedes/ho.ho23:hoCA.Troparion7.incipit
ltx/en_us_dedes/me.m12.d05:meSV.SticBoth.melody	
ltx/en_us_dedes/me.m12.d05:meSV.SticBoth.mode	@ltx/en_us_dedes/miscellanea:misc.Mode2
ltx/en_us_dedes/me.m12.d05:meSV.SticBoth.text	@ltx/en_us_dedes/ho.ho23:hoCA.Troparion7.text
ltx/en_us_dedes/me.m12.d05:meSV.SticGlory.incipit	@ltx/en_us_dedes/me.m12.d05:meVE.Lity3.incipit
ltx/en_us_dedes/me.m12.d05:meSV.SticGlory.melody	
ltx/en_us_dedes/me.m12.d05:meSV.SticGlory.mode	@ltx/en_us_dedes/miscellanea:misc.Mode2
ltx/en_us_dedes/me.m12.d05:meSV.SticGlory.text	@ltx/en_us_dedes/me.m12.d05:meVE.Lity3.text
ltx/en_us_dedes/me.m12.d05:meSV.Stichera1.incipit	…
ltx/en_us_dedes/me.m12.d05:meSV.Stichera1.melody	@ltx/en_us_dedes/he.a.m1:heAU.PaneffimoiMartyres.name
ltx/en_us_dedes/me.m12.d05:meSV.Stichera1.mode	@ltx/en_us_dedes/miscellanea:misc.Mode1
ltx/en_us_dedes/me.m12.d05:meSV.Stichera1.text	
ltx/en_us_dedes/me.m12.d05:meSV.Stichera2.incipit	…
ltx/en_us_dedes/me.m12.d05:meSV.Stichera2.melody	@ltx/en_us_dedes/he.a.m1:heAU.PaneffimoiMartyres.name
ltx/en_us_dedes/me.m12.d05:meSV.Stichera2.mode	@ltx/en_us_dedes/miscellanea:misc.Mode1
ltx/en_us_dedes/me.m12.d05:meSV.Stichera2.text	
ltx/en_us_dedes/me.m12.d05:meSV.Stichera3.incipit	…
ltx/en_us_dedes/me.m12.d05:meSV.Stichera3.melody	@ltx/en_us_dedes/he.a.m1:heAU.PaneffimoiMartyres.name
ltx/en_us_dedes/me.m12.d05:meSV.Stichera3.mode	@ltx/en_us_dedes/miscellanea:misc.Mode1
ltx/en_us_dedes/me.m12.d05:meSV.Stichera3.text	
ltx/en_us_dedes/me.m12.d05:meVE.Apolytikion1ger.greekmelody	@ltx/en_us_dedes/he.a.m1:heAU.TisErimouPolitis.greekname
ltx/en_us_dedes/me.m12.d05:meVE.Apolytikion1ger.incipit	…
ltx/en_us_dedes/me.m12.d05:meVE.Apolytikion1ger.melody	@ltx/en_us_dedes/he.a.m1:heAU.TisErimouPolitis.name
ltx/en_us_dedes/me.m12.d05:meVE.Apolytikion1ger.mode	@ltx/en_us_dedes/miscellanea:misc.Mode1
ltx/en_us_dedes/me.m12.d05:meVE.Apolytikion1ger.poet	@ltx/en_us_dedes/poets:po.Gerasimou
ltx/en_us_dedes/me.m12.d05:meVE.Apolytikion1ger.text	
ltx/en_us_dedes/me.m12.d05:meVE.AposGlory.incipit	We the multitudes of monastics…
ltx/en_us_dedes/me.m12.d05:meVE.AposGlory.melody	
ltx/en_us_dedes/me.m12.d05:meVE.AposGlory.mode	@ltx/en_us_dedes/miscellanea:misc.Mode8
ltx/en_us_dedes/me.m12.d05:meVE.AposGlory.text	We the multitudes of monastics honor you, O Savas, as our teacher and guide. For through you we have learned to walk the truly straight and narrow path. Blessed are you, who served Christ and triumphed over the power of the enemy. As you consort now with the Angels and dwell with the Devout and Righteous, pray with them to the Lord, that He have mercy on our souls.
ltx/en_us_dedes/me.m12.d05:meVE.AposTheotokion.incipit	@ltx/en_us_dedes/oc.m8.d1:ocVE.AposTheotokion.incipit
ltx/en_us_dedes/me.m12.d05:meVE.AposTheotokion.melody	
ltx/en_us_dedes/me.m12.d05:meVE.AposTheotokion.mode	@ltx/en_us_dedes/miscellanea:misc.Mode8
ltx/en_us_dedes/me.m12.d05:meVE.AposTheotokion.text	@ltx/en_us_dedes/oc.m8.d1:ocVE.AposTheotokion.text
ltx/en_us_dedes/me.m12.d05:meVE.Aposticha1.greekmelody	@ltx/en_us_dedes/he.a.m5:heAU.ChairoisAskitikon.greekname
ltx/en_us_dedes/me.m12.d05:meVE.Aposticha1.incipit	@ltx/en_us_dedes/he.a.m5:heAU.ChairoisAskitikon.incipit
ltx/en_us_dedes/me.m12.d05:meVE.Aposticha1.melody	@ltx/en_us_dedes/he.a.m5:heAU.ChairoisAskitikon.melody
ltx/en_us_dedes/me.m12.d05:meVE.Aposticha1.mode	@ltx/en_us_dedes/miscellanea:misc.Mode5
ltx/en_us_dedes/me.m12.d05:meVE.Aposticha1.text	@ltx/en_us_dedes/he.a.m5:heAU.ChairoisAskitikon.text
ltx/en_us_dedes/me.m12.d05:meVE.Aposticha2.incipit	…
ltx/en_us_dedes/me.m12.d05:meVE.Aposticha2.melody	@ltx/en_us_dedes/he.a.m5:heAU.ChairoisAskitikon.name
ltx/en_us_dedes/me.m12.d05:meVE.Aposticha2.mode	@ltx/en_us_dedes/miscellanea:misc.Mode5
ltx/en_us_dedes/me.m12.d05:meVE.Aposticha2.text	
ltx/en_us_dedes/me.m12.d05:meVE.Aposticha3.incipit	…
ltx/en_us_dedes/me.m12.d05:meVE.Aposticha3.melody	@ltx/en_us_dedes/he.a.m5:heAU.ChairoisAskitikon.name
ltx/en_us_dedes/me.m12.d05:meVE.Aposticha3.mode	@ltx/en_us_dedes/miscellanea:misc.Mode5
ltx/en_us_dedes/me.m12.d05:meVE.Aposticha3.text	
ltx/en_us_dedes/me.m12.d05:meVE.GeneralApolytikion1.name	Savas,
ltx/en_us_dedes/me.m12.d05:meVE.Lity1.incipit	…
ltx/en_us_dedes/me.m12.d05:meVE.Lity1.melody	
ltx/en_us_dedes/me.m12.d05:meVE.Lity1.mode	@ltx/en_us_dedes/miscellanea:misc.Mode2
ltx/en_us_dedes/me.m12.d05:meVE.Lity1.text	
ltx/en_us_dedes/me.m12.d05:meVE.Lity2.incipit	…
ltx/en_us_dedes/me.m12.d05:meVE.Lity2.melody	
ltx/en_us_dedes/me.m12.d05:meVE.Lity2.mode	@ltx/en_us_dedes/miscellanea:misc.Mode2
ltx/en_us_dedes/me.m12.d05:meVE.Lity2.text	
ltx/en_us_dedes/me.m12.d05:meVE.Lity3.incipit	…
ltx/en_us_dedes/me.m12.d05:meVE.Lity3.melody	
ltx/en_us_dedes/me.m12.d05:meVE.Lity3.mode	@ltx/en_us_dedes/miscellanea:misc.Mode2
ltx/en_us_dedes/me.m12.d05:meVE.Lity3.text	
ltx/en_us_dedes/me.m12.d05:meVE.LityBoth.incipit	@ltx/en_us_dedes/ho.ho23:hoCA.Troparion7.incipit
ltx/en_us_dedes/me.m12.d05:meVE.LityBoth.melody	
ltx/en_us_dedes/me.m12.d05:meVE.LityBoth.mode	@ltx/en_us_dedes/miscellanea:misc.Mode2
ltx/en_us_dedes/me.m12.d05:meVE.LityBoth.text	@ltx/en_us_dedes/ho.ho23:hoCA.Troparion7.text
ltx/en_us_dedes/me.m12.d05:meVE.LityGlory.incipit	…
ltx/en_us_dedes/me.m12.d05:meVE.LityGlory.melody	
ltx/en_us_dedes/me.m12.d05:meVE.LityGlory.mode	@ltx/en_us_dedes/miscellanea:misc.Mode2
ltx/en_us_dedes/me.m12.d05:meVE.LityGlory.poet	@ltx/en_us_dedes/poets:po.Theofanous
ltx/en_us_dedes/me.m12.d05:meVE.LityGlory.text	
ltx/en_us_dedes/me.m12.d05:meVE.MM.GeneralApolytikion1.text	@ltx/en_us_dedes/properties:media.key
ltx/en_us_dedes/me.m12.d05:meVE.SticGlory.incipit	You preserved the dignity of…
ltx/en_us_dedes/me.m12.d05:meVE.SticGlory.melody	
ltx/en_us_dedes/me.m12.d05:meVE.SticGlory.mode	@ltx/en_us_dedes/miscellanea:misc.Mode6
ltx/en_us_dedes/me.m12.d05:meVE.SticGlory.text	You preserved the dignity of God’s image in you, and through asceticism you set your mind to rule over the destructive passions; and thus you ascended to the likeness of God as far as possible. For you had manfully exerted force on your nature, and hastened to subordinate the inferior to the superior, and to make the flesh subservient to the spirit. Therefore you became the ultimate monastic, the founder of the desert, teacher of those who live with integrity, the most exact rule of virtue. Now in heaven, O blessed Savas, you gaze no longer at reflections in a mirror, but clearly at the Holy Trinity, interceding directly for those who with faith and love honor you.
ltx/en_us_dedes/me.m12.d05:meVE.SticTheotokion.incipit	@ltx/en_us_dedes/oc.m6.d1:ocVE.SticTheotokion.incipit
ltx/en_us_dedes/me.m12.d05:meVE.SticTheotokion.melody	
ltx/en_us_dedes/me.m12.d05:meVE.SticTheotokion.mode	@ltx/en_us_dedes/miscellanea:misc.Mode6
ltx/en_us_dedes/me.m12.d05:meVE.SticTheotokion.text	@ltx/en_us_dedes/oc.m6.d1:ocVE.SticTheotokion.text
ltx/en_us_dedes/me.m12.d05:meVE.Stichera01.greekmelody	@ltx/en_us_dedes/he.a.m5:heAU.OsiePater.greekname
ltx/en_us_dedes/me.m12.d05:meVE.Stichera01.incipit	…
ltx/en_us_dedes/me.m12.d05:meVE.Stichera01.melody	@ltx/en_us_dedes/he.a.m5:heAU.OsiePater.name
ltx/en_us_dedes/me.m12.d05:meVE.Stichera01.mode	@ltx/en_us_dedes/miscellanea:misc.Mode5
ltx/en_us_dedes/me.m12.d05:meVE.Stichera01.text	
ltx/en_us_dedes/me.m12.d05:meVE.Stichera02.incipit	…
ltx/en_us_dedes/me.m12.d05:meVE.Stichera02.melody	@ltx/en_us_dedes/he.a.m5:heAU.OsiePater.name
ltx/en_us_dedes/me.m12.d05:meVE.Stichera02.mode	@ltx/en_us_dedes/miscellanea:misc.Mode5
ltx/en_us_dedes/me.m12.d05:meVE.Stichera02.text	
ltx/en_us_dedes/me.m12.d05:meVE.Stichera03.incipit	…
ltx/en_us_dedes/me.m12.d05:meVE.Stichera03.melody	@ltx/en_us_dedes/he.a.m5:heAU.OsiePater.name
ltx/en_us_dedes/me.m12.d05:meVE.Stichera03.mode	@ltx/en_us_dedes/miscellanea:misc.Mode5
ltx/en_us_dedes/me.m12.d05:meVE.Stichera03.text	
