ltx/en_us_dedes/sy.m07.d03:cl.syMA.commemoration01.text	[saint/com 1]
ltx/en_us_dedes/sy.m07.d03:cl.syMA.commemoration02.text	[saint/com 2]
ltx/en_us_dedes/sy.m07.d03:cl.syMA.commemoration03.text	[saint/com 3]
ltx/en_us_dedes/sy.m07.d03:cl.syMA.commemoration04.text	[saint/com 4]
ltx/en_us_dedes/sy.m07.d03:cl.syMA.commemoration05.text	[saint/com 5]
ltx/en_us_dedes/sy.m07.d03:cl.syMA.commemoration06.text	[saint/com list]
ltx/en_us_dedes/sy.m07.d03:syMA.commemoration01.couplet1.title	@ltx/en_us_dedes/titles:ti.Verses
ltx/en_us_dedes/sy.m07.d03:syMA.commemoration01.couplet1.verse1	Ἐξ ἀρετῆς μὲν Ὑάκινθος ὡς λίθος,
ltx/en_us_dedes/sy.m07.d03:syMA.commemoration01.couplet1.verse2	Λαμπρὸς πλέον δὲ ἐκ ῥοῆς τῶν αἱμάτων.
ltx/en_us_dedes/sy.m07.d03:syMA.commemoration01.narration.p01	
ltx/en_us_dedes/sy.m07.d03:syMA.commemoration01.single1	Οὐλομένῳ τριτάτῃ Ὑάκινθος κάτθανε λιμῷ.
ltx/en_us_dedes/sy.m07.d03:syMA.commemoration01.text	On July 3, we commemorate the holy Martyr Hyacinth, the Chamberlain.
ltx/en_us_dedes/sy.m07.d03:syMA.commemoration02.couplet1.title	@ltx/en_us_dedes/titles:ti.Verses
ltx/en_us_dedes/sy.m07.d03:syMA.commemoration02.couplet1.verse1	Δύνας, Ἀνατόλιε τοῦ βίου τέλει.
ltx/en_us_dedes/sy.m07.d03:syMA.commemoration02.couplet1.verse2	Τῷ μὴ δύνοντι προσπελάζεις ἡλίῳ.
ltx/en_us_dedes/sy.m07.d03:syMA.commemoration02.narration.p01	
ltx/en_us_dedes/sy.m07.d03:syMA.commemoration02.text	On this day we also commemorate our Father among the Saints Anatolius, Archbishop of Constantinople.
ltx/en_us_dedes/sy.m07.d03:syMA.commemoration03.couplet1.title	@ltx/en_us_dedes/titles:ti.Verses
ltx/en_us_dedes/sy.m07.d03:syMA.commemoration03.couplet1.verse1	
ltx/en_us_dedes/sy.m07.d03:syMA.commemoration03.couplet1.verse2	
ltx/en_us_dedes/sy.m07.d03:syMA.commemoration03.couplet2.verse1	
ltx/en_us_dedes/sy.m07.d03:syMA.commemoration03.couplet2.verse2	
ltx/en_us_dedes/sy.m07.d03:syMA.commemoration03.couplet3.verse1	
ltx/en_us_dedes/sy.m07.d03:syMA.commemoration03.couplet3.verse2	
ltx/en_us_dedes/sy.m07.d03:syMA.commemoration03.couplet4.verse1	
ltx/en_us_dedes/sy.m07.d03:syMA.commemoration03.couplet4.verse2	
ltx/en_us_dedes/sy.m07.d03:syMA.commemoration03.couplet5.verse1	
ltx/en_us_dedes/sy.m07.d03:syMA.commemoration03.couplet5.verse2	
ltx/en_us_dedes/sy.m07.d03:syMA.commemoration03.text	On this day we also commemorate the holy Martyrs Theodotus, Theodota, Diomedes, Eulampius, Asclepiades, and Golinduc.
ltx/en_us_dedes/sy.m07.d03:syMA.commemoration04.couplet1.title	@ltx/en_us_dedes/titles:ti.Verses
ltx/en_us_dedes/sy.m07.d03:syMA.commemoration04.couplet1.verse1	
ltx/en_us_dedes/sy.m07.d03:syMA.commemoration04.couplet1.verse2	
ltx/en_us_dedes/sy.m07.d03:syMA.commemoration04.text	On this day we also commemorate the holy Martyrs Mark and Mokian.
ltx/en_us_dedes/sy.m07.d03:syMA.commemoration05.couplet1.title	@ltx/en_us_dedes/titles:ti.Verses
ltx/en_us_dedes/sy.m07.d03:syMA.commemoration05.couplet1.verse1	
ltx/en_us_dedes/sy.m07.d03:syMA.commemoration05.couplet1.verse2	
ltx/en_us_dedes/sy.m07.d03:syMA.commemoration05.text	Saint Gerasimos the New, the devout monastic Martyr from Mega Chorion, Evrytania, witnessed in Constantinople in the year 1812 and died by the sword.
ltx/en_us_dedes/sy.m07.d03:syMA.lastline	By their holy intercessions, O God, have mercy on us. Amen.
