ltx/en_us_dedes/ho.ho07:R01	
ltx/en_us_dedes/ho.ho07:hoLI.Antiphon1.text	
ltx/en_us_dedes/ho.ho07:hoLI.Antiphon21.text	Save us, O Son of God,
ltx/en_us_dedes/ho.ho07:hoLI.Antiphon22.text	We sing to You, Alleluia.
ltx/en_us_dedes/ho.ho07:hoLI.Antiphon2s.incipit	@ltx/en_us_dedes/properties:deprecated.key
ltx/en_us_dedes/ho.ho07:hoLI.Antiphon2s.text	@ltx/en_us_dedes/properties:deprecated.key
ltx/en_us_dedes/ho.ho07:hoLI.Antiphon2w.incipit	@ltx/en_us_dedes/properties:deprecated.key
ltx/en_us_dedes/ho.ho07:hoLI.Antiphon2w.text	@ltx/en_us_dedes/properties:deprecated.key
ltx/en_us_dedes/ho.ho07:hoLI.EntranceHymn.incipit	Come let us worship…
ltx/en_us_dedes/ho.ho07:hoLI.EntranceHymn.text	Come let us worship and bow down before Christ.
ltx/en_us_dedes/ho.ho07:hoLI.EntranceHymn2s.incipit	@ltx/en_us_dedes/properties:deprecated.key
ltx/en_us_dedes/ho.ho07:hoLI.EntranceHymn2s.text	@ltx/en_us_dedes/properties:deprecated.key
ltx/en_us_dedes/ho.ho07:hoLI.EntranceHymn2w.incipit	@ltx/en_us_dedes/properties:deprecated.key
ltx/en_us_dedes/ho.ho07:hoLI.EntranceHymn2w.text	@ltx/en_us_dedes/properties:deprecated.key
ltx/en_us_dedes/ho.ho07:hoLI.MM.Antiphon2s.text	@ltx/en_us_dedes/properties:media.key
ltx/en_us_dedes/ho.ho07:hoLI.MM.Antiphon2w.text	@ltx/en_us_dedes/properties:media.key
ltx/en_us_dedes/ho.ho07:hoLI.MM.EntranceHymn2s.text	@ltx/en_us_dedes/properties:media.key
ltx/en_us_dedes/ho.ho07:hoLI.MM.EntranceHymn2w.text	@ltx/en_us_dedes/properties:media.key
ltx/en_us_dedes/ho.ho07:hoLI.MM.GospelAlleluia.text	@ltx/en_us_dedes/properties:media.key
ltx/en_us_dedes/ho.ho07:hoLI.MM.GospelAlleluiaMode1.text	@ltx/en_us_dedes/properties:media.key
ltx/en_us_dedes/ho.ho07:hoLI.MM.GospelAlleluiaMode2.text	@ltx/en_us_dedes/properties:media.key
ltx/en_us_dedes/ho.ho07:hoLI.MM.GospelAlleluiaMode3.text	@ltx/en_us_dedes/properties:media.key
ltx/en_us_dedes/ho.ho07:hoLI.MM.GospelAlleluiaMode4.text	@ltx/en_us_dedes/properties:media.key
ltx/en_us_dedes/ho.ho07:hoLI.MM.GospelAlleluiaMode5.text	@ltx/en_us_dedes/properties:media.key
ltx/en_us_dedes/ho.ho07:hoLI.MM.GospelAlleluiaMode6.text	@ltx/en_us_dedes/properties:media.key
ltx/en_us_dedes/ho.ho07:hoLI.MM.GospelAlleluiaMode7.text	@ltx/en_us_dedes/properties:media.key
ltx/en_us_dedes/ho.ho07:hoLI.MM.GospelAlleluiaMode8.text	@ltx/en_us_dedes/properties:media.key
ltx/en_us_dedes/ho.ho07:hoLI.MM.OsoiEisChriston.text	@ltx/en_us_dedes/properties:media.key
ltx/en_us_dedes/ho.ho07:hoLI.MM.OsoiEisChristonBimatos.text	@ltx/en_us_dedes/properties:media.key
ltx/en_us_dedes/ho.ho07:hoLI.MM.Psalm102.text	@ltx/en_us_dedes/properties:media.key
ltx/en_us_dedes/ho.ho07:hoLI.MM.Psalm145.text	@ltx/en_us_dedes/properties:media.key
ltx/en_us_dedes/ho.ho07:hoLI.MM.TonStavronSouBimatos.text	@ltx/en_us_dedes/properties:media.key
ltx/en_us_dedes/ho.ho07:hoLI.MM.TrisagiosHymnBimatos.text	@ltx/en_us_dedes/properties:media.key
ltx/en_us_dedes/ho.ho07:hoLI.OnlyBegotten.incipit	Only-begotten Son…
ltx/en_us_dedes/ho.ho07:hoLI.OnlyBegotten.text	Only-begotten Son and Word of God, who are immortal, and for our salvation condescended to become incarnate of the holy Theotokos and ever-virgin Mary, and, without change became man, and were crucified, O Christ our God, and trampled on death by death, being one of the Holy Trinity, glorified together with the Father and the Holy Spirit: save us.
ltx/en_us_dedes/ho.ho07:hoLI.OnlyBegotten.title	Only-begotten.
ltx/en_us_dedes/ho.ho07:hoLI.OsoiEisChriston.title	Instead of Holy God
ltx/en_us_dedes/ho.ho07:hoLI.TonStavronSou.incipit	Before Your Cross…
ltx/en_us_dedes/ho.ho07:hoLI.TonStavronSou.text	Before Your Cross, we bow down, O Master, and Your holy resurrection we glorify.
ltx/en_us_dedes/ho.ho07:hoLI.TonStavronSou.title	Instead of Holy God
ltx/en_us_dedes/ho.ho07:hoLI.TonStavronSou1.text	Before Your Cross, we bow down,
ltx/en_us_dedes/ho.ho07:hoLI.TonStavronSou2.text	O Master,
ltx/en_us_dedes/ho.ho07:hoLI.TonStavronSou3.text	And Your holy resurrection.
ltx/en_us_dedes/ho.ho07:hoLI.TonStavronSou4.text	We glorify.
ltx/en_us_dedes/ho.ho07:hoLI.TonStavronSouDynamis.text	Before Your Cross, we bow down, O Master, and Your holy resurrection we glorify.
ltx/en_us_dedes/ho.ho07:hoLI.TrisagiosHymn.incipit	Holy God…
ltx/en_us_dedes/ho.ho07:hoLI.TrisagiosHymn.text	Holy God, Holy Mighty, Holy Immortal, have mercy on us.
ltx/en_us_dedes/ho.ho07:hoLI.TrisagiosHymn.title	Trisagios Hymn
ltx/en_us_dedes/ho.ho07:hoLI.TrisagiosHymn1.text	Holy God.
ltx/en_us_dedes/ho.ho07:hoLI.TrisagiosHymn2.text	Holy Mighty.
ltx/en_us_dedes/ho.ho07:hoLI.TrisagiosHymn3.text	Holy Immortal.
ltx/en_us_dedes/ho.ho07:hoLI.TrisagiosHymn34.text	Holy Immortal, have mercy on us.
ltx/en_us_dedes/ho.ho07:hoLI.TrisagiosHymn4.text	Have mercy on us.
ltx/en_us_dedes/ho.ho07:hoLI.TrisagiosHymnDynamis.text	Holy God, Holy Mighty, Holy Immortal, have mercy on us.
ltx/en_us_dedes/ho.ho07:hoLI.TrisagiosHymnJames3.text	Holy Trinity.
ltx/en_us_dedes/ho.ho07:hoLI.TrisagiosHymnJames34.text	Holy Trinity, have mercy on us.
ltx/en_us_dedes/ho.ho07:hoTY.Key0200.text	
ltx/en_us_dedes/ho.ho07:hoTY.Key0212.text	Remember us, O Lord, when You come in Your kingdom.
ltx/en_us_dedes/ho.ho07:hoTY.Key0213.text	Remember us, O Master, when You come in Your kingdom.
ltx/en_us_dedes/ho.ho07:hoTY.Key0214.text	Remember us, O Holy One, when You come in Your kingdom.
ltx/en_us_dedes/ho.ho07:hoTY.Key0215.text	The heavenly choir extols you and says: Holy, Holy, Holy, Lord Sabaoth; heaven and earth are full of Your glory.
ltx/en_us_dedes/ho.ho07:hoTY.Key0216.text	The choir of holy Angels and Archangels, with all the heavenly Powers, extols you and says: Holy, Holy, Holy, Lord Sabaoth; heaven and earth are full of Your glory.
ltx/en_us_dedes/ho.ho07:hoTY.Key0217.text	Pardon, remit, forgive, O God, our offenses, both voluntary and involuntary, in deed and word, in knowledge and ignorance, by night and by day, in mind and thought; forgive us all things, since You are good and love mankind.
ltx/en_us_dedes/ho.ho07:hoTY.Key0408.incipit	O Protection of Christians…
ltx/en_us_dedes/ho.ho07:hoTY.Key0408.mode	@ltx/en_us_dedes/miscellanea:misc.Mode2
ltx/en_us_dedes/ho.ho07:hoTY.Key0408.text	O Protection of Christians that never falls, intercession with the Creator that never fails, we sinners beg you, do not ignore the voices of our prayers. O good Lady, we implore you, quickly come unto our aid, when we cry out to you with faith. Hurry to intercession, and hasten to supplication, O Theotokos who protect now and ever those who honor you.
ltx/en_us_dedes/ho.ho07:hoTY.Key0501.incipit	All-Holy Trinity, the consubstantial dominion…
ltx/en_us_dedes/ho.ho07:hoTY.Key0501.text	All-Holy Trinity, the consubstantial dominion, the indivisible rule, and cause of every good: be well pleased, even with regard to me a sinner. Strengthen my heart and grant it understanding, and take away all my defilement. Illumine my mind, so that I may ever glorify, praise, worship, and say: One is Holy, One is Lord, Jesus Christ, to the Glory of God the Father.
ltx/en_us_dedes/ho.ho07:hoTY.title	The Service of the Typika
