ltx/en_us_dedes/oc.m1.d2:ocBK.ModeNaked	@ltx/en_us_dedes/miscellanea:misc.Mode1.naked
ltx/en_us_dedes/oc.m1.d2:ocLI.Beatitudes1.incipit	@ltx/en_us_dedes/oc.m1.d1:ocLI.Beatitudes1.incipit
ltx/en_us_dedes/oc.m1.d2:ocLI.Beatitudes1.melody	
ltx/en_us_dedes/oc.m1.d2:ocLI.Beatitudes1.mode	@ltx/en_us_dedes/miscellanea:misc.Mode1
ltx/en_us_dedes/oc.m1.d2:ocLI.Beatitudes1.text	@ltx/en_us_dedes/oc.m1.d1:ocLI.Beatitudes1.text
ltx/en_us_dedes/oc.m1.d2:ocLI.Beatitudes2.incipit	In You mercy, give me…
ltx/en_us_dedes/oc.m1.d2:ocLI.Beatitudes2.melody	
ltx/en_us_dedes/oc.m1.d2:ocLI.Beatitudes2.mode	@ltx/en_us_dedes/miscellanea:misc.Mode1
ltx/en_us_dedes/oc.m1.d2:ocLI.Beatitudes2.text	In You mercy, give me springs of tears * and of compunction, O Christ my God, * to wash away all the filth * of the countless sins and vices in me; * and let me participate * in Your kingdom, O great Benefactor and Lord.
ltx/en_us_dedes/oc.m1.d2:ocLI.Beatitudes3.incipit	We invoke the Angels’ regiments…
ltx/en_us_dedes/oc.m1.d2:ocLI.Beatitudes3.melody	
ltx/en_us_dedes/oc.m1.d2:ocLI.Beatitudes3.mode	@ltx/en_us_dedes/miscellanea:misc.Mode1
ltx/en_us_dedes/oc.m1.d2:ocLI.Beatitudes3.text	We invoke the Angels’ regiments * to supplicate You on our behalf. * At their entreaties, save us all, * O exceeding gracious Christ our God, * overlooking all the sins * we committed in knowledge and in ignorance.
ltx/en_us_dedes/oc.m1.d2:ocLI.Beatitudes4.incipit	In the puddles of your…
ltx/en_us_dedes/oc.m1.d2:ocLI.Beatitudes4.melody	
ltx/en_us_dedes/oc.m1.d2:ocLI.Beatitudes4.mode	@ltx/en_us_dedes/miscellanea:misc.Mode1
ltx/en_us_dedes/oc.m1.d2:ocLI.Beatitudes4.text	In the puddles of your blood, O Saints, * you drowned the devil as if Pharaoh of old, * O blessed Martyrs of the Lord. * Now you pour out your miracles * like a spring that dries the sea * of diseases; hence you are beatified.
ltx/en_us_dedes/oc.m1.d2:ocLI.BeatitudesT.incipit	As the one who bore…
ltx/en_us_dedes/oc.m1.d2:ocLI.BeatitudesT.melody	
ltx/en_us_dedes/oc.m1.d2:ocLI.BeatitudesT.mode	@ltx/en_us_dedes/miscellanea:misc.Mode1
ltx/en_us_dedes/oc.m1.d2:ocLI.BeatitudesT.text	As the one who bore the timeless Light, * ever illuminate and guide my soul * which is bedarkened through assaults * from the demons, O all-blameless Maid. * And by means of your divine * mediations free me from the future fire.
ltx/en_us_dedes/oc.m1.d2:ocLI.BeatitudesTr.incipit	@ltx/en_us_dedes/oc.m1.d1:ocLI.BeatitudesTr.incipit
ltx/en_us_dedes/oc.m1.d2:ocLI.BeatitudesTr.melody	
ltx/en_us_dedes/oc.m1.d2:ocLI.BeatitudesTr.mode	@ltx/en_us_dedes/miscellanea:misc.Mode1
ltx/en_us_dedes/oc.m1.d2:ocLI.BeatitudesTr.text	@ltx/en_us_dedes/oc.m1.d1:ocLI.BeatitudesTr.text
ltx/en_us_dedes/oc.m1.d2:ocLI.MM.Beatitudes1234TrTas78910GB.text	@ltx/en_us_dedes/properties:media.key
ltx/en_us_dedes/oc.m1.d2:ocMA.ApolTheotokion.incipit	@ltx/en_us_dedes/oc.m1.d2:ocMA.Kathisma13.incipit
ltx/en_us_dedes/oc.m1.d2:ocMA.ApolTheotokion.melody	
ltx/en_us_dedes/oc.m1.d2:ocMA.ApolTheotokion.mode	@ltx/en_us_dedes/miscellanea:misc.Mode1
ltx/en_us_dedes/oc.m1.d2:ocMA.ApolTheotokion.text	@ltx/en_us_dedes/oc.m1.d2:ocMA.Kathisma13.text
ltx/en_us_dedes/oc.m1.d2:ocMA.AposTheotokion.greekmelody	@ltx/en_us_dedes/he.a.m1:heAU.TonOuranionTagmaton.greekname
ltx/en_us_dedes/oc.m1.d2:ocMA.AposTheotokion.incipit	O Maiden holier than all…
ltx/en_us_dedes/oc.m1.d2:ocMA.AposTheotokion.melody	@ltx/en_us_dedes/he.a.m1:heAU.TonOuranionTagmaton.name
ltx/en_us_dedes/oc.m1.d2:ocMA.AposTheotokion.mode	@ltx/en_us_dedes/miscellanea:misc.Mode1
ltx/en_us_dedes/oc.m1.d2:ocMA.AposTheotokion.text	O Maiden holier than all the holy Powers on high, * O Theotokos passing all creation in honor, * benevolent Lady of all the world * who gave birth to the Savior Christ, * from countless sins and from perils save us, we pray, * through your fervent intercessory prayers.
ltx/en_us_dedes/oc.m1.d2:ocMA.Aposticha1.incipit	Another world awaits you, O…
ltx/en_us_dedes/oc.m1.d2:ocMA.Aposticha1.melody	
ltx/en_us_dedes/oc.m1.d2:ocMA.Aposticha1.mode	@ltx/en_us_dedes/miscellanea:misc.Mode1
ltx/en_us_dedes/oc.m1.d2:ocMA.Aposticha1.text	Another world awaits you, O my soul, and a Judge who will make public your awful secrets. So, no longer persist as you are, but anticipate the Judge and call to Him, “O God, be merciful to me and save me.
ltx/en_us_dedes/oc.m1.d2:ocMA.Aposticha2.incipit	Reject me not, O my…
ltx/en_us_dedes/oc.m1.d2:ocMA.Aposticha2.melody	
ltx/en_us_dedes/oc.m1.d2:ocMA.Aposticha2.mode	@ltx/en_us_dedes/miscellanea:misc.Mode1
ltx/en_us_dedes/oc.m1.d2:ocMA.Aposticha2.text	Reject me not, O my Savior, overtaken as I am by the laziness of sin. Rouse my thinking to repentance: and make me an approved laborer of Your vineyard, and grant to me the wages of the eleventh hour, and the great mercy.
ltx/en_us_dedes/oc.m1.d2:ocMA.Aposticha3.incipit	Come, all you peoples, with…
ltx/en_us_dedes/oc.m1.d2:ocMA.Aposticha3.melody	
ltx/en_us_dedes/oc.m1.d2:ocMA.Aposticha3.mode	@ltx/en_us_dedes/miscellanea:misc.Mode1
ltx/en_us_dedes/oc.m1.d2:ocMA.Aposticha3.text	Come, all you peoples, with spiritual songs and hymns, let us honor the prize-winning Martyrs of Christ. For they are the luminaries of the world and the preachers of the Faith, the ever-welling fountain from which the healings pour out to the believers. Through their supplications, O Christ our God, bestow peace upon Your world and great mercy upon our souls.
ltx/en_us_dedes/oc.m1.d2:ocMA.C1.acrostic.notice1	
ltx/en_us_dedes/oc.m1.d2:ocMA.C1.acrostic.text	
ltx/en_us_dedes/oc.m1.d2:ocMA.C1.acrostic.title	Canon of Compunction.
ltx/en_us_dedes/oc.m1.d2:ocMA.C1.poet	@ltx/en_us_dedes/poets:po.Iosif
ltx/en_us_dedes/oc.m1.d2:ocMA.C2.acrostic.notice1	
ltx/en_us_dedes/oc.m1.d2:ocMA.C2.acrostic.text	
ltx/en_us_dedes/oc.m1.d2:ocMA.C2.acrostic.title	Canon for the Bodiless Hosts.
ltx/en_us_dedes/oc.m1.d2:ocMA.C2.poet	@ltx/en_us_dedes/poets:po.Theofanous
ltx/en_us_dedes/oc.m1.d2:ocMA.Kathisma11.incipit	Conceived as I was in…
ltx/en_us_dedes/oc.m1.d2:ocMA.Kathisma11.melody	
ltx/en_us_dedes/oc.m1.d2:ocMA.Kathisma11.mode	@ltx/en_us_dedes/miscellanea:misc.Mode1
ltx/en_us_dedes/oc.m1.d2:ocMA.Kathisma11.text	Conceived as I was in iniquities, I the prodigal dare not look up into heaven. But with confidence in Your benevolence, I cry out: O God be gracious unto me and save me.
ltx/en_us_dedes/oc.m1.d2:ocMA.Kathisma12.incipit	If the righteous man is…
ltx/en_us_dedes/oc.m1.d2:ocMA.Kathisma12.melody	
ltx/en_us_dedes/oc.m1.d2:ocMA.Kathisma12.mode	@ltx/en_us_dedes/miscellanea:misc.Mode1
ltx/en_us_dedes/oc.m1.d2:ocMA.Kathisma12.text	If the righteous man is only scarcely saved, what shall become of me who am a sinner? I did not bear the burden and the heat of the day. Number me with those who came at the eleventh hour, O God, and save me.
ltx/en_us_dedes/oc.m1.d2:ocMA.Kathisma13.incipit	Immaculate Theotokos, who are blest…
ltx/en_us_dedes/oc.m1.d2:ocMA.Kathisma13.melody	
ltx/en_us_dedes/oc.m1.d2:ocMA.Kathisma13.mode	@ltx/en_us_dedes/miscellanea:misc.Mode1
ltx/en_us_dedes/oc.m1.d2:ocMA.Kathisma13.text	Immaculate Theotokos, who are blest in the heavens, and glorified on earth, rejoice, O unwedded Bride.
ltx/en_us_dedes/oc.m1.d2:ocMA.Kathisma21.greekmelody	@ltx/en_us_dedes/he.a.m1:heAU.TonTafonSouSotir.greekname
ltx/en_us_dedes/oc.m1.d2:ocMA.Kathisma21.incipit	Make haste, open to me…
ltx/en_us_dedes/oc.m1.d2:ocMA.Kathisma21.melody	@ltx/en_us_dedes/he.a.m1:heAU.TonTafonSouSotir.name
ltx/en_us_dedes/oc.m1.d2:ocMA.Kathisma21.mode	@ltx/en_us_dedes/miscellanea:misc.Mode1
ltx/en_us_dedes/oc.m1.d2:ocMA.Kathisma21.text	Make haste, open to me Your paternal embraces. * I prodigally spent all my means of subsistence. * O Savior, I look hopefully * to Your tender mercy’s inexhaustible wealth. * Do not overlook a heart that now is impoverished. * For to You, O Lord, do I cry out with compunction: * I have sinned against You, save me.
ltx/en_us_dedes/oc.m1.d2:ocMA.Kathisma22.greekmelody	@ltx/en_us_dedes/he.a.m1:heAU.TonTafonSouSotir.greekname
ltx/en_us_dedes/oc.m1.d2:ocMA.Kathisma22.incipit	Your judgment seat is dreadful…
ltx/en_us_dedes/oc.m1.d2:ocMA.Kathisma22.melody	@ltx/en_us_dedes/he.a.m1:heAU.TonTafonSouSotir.name
ltx/en_us_dedes/oc.m1.d2:ocMA.Kathisma22.mode	@ltx/en_us_dedes/miscellanea:misc.Mode1
ltx/en_us_dedes/oc.m1.d2:ocMA.Kathisma22.text	Your judgment seat is dreadful and just is the judgment. * Appalling are my deeds. But, O merciful Savior, * come quickly and rescue me. * From perdition deliver me. * From the portion of the goats redeem me, O Master. * O most righteous Judge, account me worthy, I beg You, * to stand at Your right hand.
ltx/en_us_dedes/oc.m1.d2:ocMA.Kathisma23.greekmelody	@ltx/en_us_dedes/he.a.m1:heAU.TonTafonSouSotir.greekname
ltx/en_us_dedes/oc.m1.d2:ocMA.Kathisma23.incipit	Take pity on my soul…
ltx/en_us_dedes/oc.m1.d2:ocMA.Kathisma23.melody	@ltx/en_us_dedes/he.a.m1:heAU.TonTafonSouSotir.name
ltx/en_us_dedes/oc.m1.d2:ocMA.Kathisma23.mode	@ltx/en_us_dedes/miscellanea:misc.Mode1
ltx/en_us_dedes/oc.m1.d2:ocMA.Kathisma23.text	Take pity on my soul, which is wretched, and steer it, * O Pure one, for I slipped beneath my many offenses * and into the deep abyss of perdition, O blameless one. * I implore you, save me from a dreadful conviction * in that frightful hour of my death, as the demons * are hotly accusing me.
ltx/en_us_dedes/oc.m1.d2:ocMA.Kathisma31.greekmelody	@ltx/en_us_dedes/he.a.m1:heAU.TonTafonSouSotir.greekname
ltx/en_us_dedes/oc.m1.d2:ocMA.Kathisma31.incipit	Unwisely having strayed far from…
ltx/en_us_dedes/oc.m1.d2:ocMA.Kathisma31.melody	@ltx/en_us_dedes/he.a.m1:heAU.TonTafonSouSotir.name
ltx/en_us_dedes/oc.m1.d2:ocMA.Kathisma31.mode	@ltx/en_us_dedes/miscellanea:misc.Mode1
ltx/en_us_dedes/oc.m1.d2:ocMA.Kathisma31.text	Unwisely having strayed far from You, loving Master, * I squandered all I had through my riotous living, * and my serving slavishly the brutish passions incessantly. * Take me back, I pray, O compassionate Father, * as the Prodigal, through the prayers of the Angels, * and save me, I supplicate.
ltx/en_us_dedes/oc.m1.d2:ocMA.Kathisma32.incipit	O Lord, You are the…
ltx/en_us_dedes/oc.m1.d2:ocMA.Kathisma32.melody	
ltx/en_us_dedes/oc.m1.d2:ocMA.Kathisma32.mode	@ltx/en_us_dedes/miscellanea:misc.Mode1
ltx/en_us_dedes/oc.m1.d2:ocMA.Kathisma32.text	O Lord, You are the pride of the contest, the very dignity of the laurel crowns, which the glorious prize-winning Martyrs have put on as a garment. For by their endurance under torture they put the lawless men to flight. And by divine power from heaven they received the victory. Through their supplications set me free from the invisible enemies, O Savior, and save me.
ltx/en_us_dedes/oc.m1.d2:ocMA.Kathisma33.greekmelody	@ltx/en_us_dedes/he.a.m1:heAU.TonTafonSouSotir.greekname
ltx/en_us_dedes/oc.m1.d2:ocMA.Kathisma33.incipit	O Damsel, you surpass immaterial…
ltx/en_us_dedes/oc.m1.d2:ocMA.Kathisma33.melody	@ltx/en_us_dedes/he.a.m1:heAU.TonTafonSouSotir.name
ltx/en_us_dedes/oc.m1.d2:ocMA.Kathisma33.mode	@ltx/en_us_dedes/miscellanea:misc.Mode1
ltx/en_us_dedes/oc.m1.d2:ocMA.Kathisma33.text	O Damsel, you surpass immaterial Armies, * and only you exceed the celestial Orders, * from whom you receive the praise * that is worthy, O purest Maid. * With the Angels pray unto your Son, interceding * that I the only one that is condemned be delivered * from the passions’ tyranny.
ltx/en_us_dedes/oc.m1.d2:ocMA.OdeW1C11.incipit	According to the multitude, O…
ltx/en_us_dedes/oc.m1.d2:ocMA.OdeW1C11.melody	@ltx/en_us_dedes/he.h.m1:heHE.SouITropaiouchos.name
ltx/en_us_dedes/oc.m1.d2:ocMA.OdeW1C11.mode	@ltx/en_us_dedes/miscellanea:misc.Mode1
ltx/en_us_dedes/oc.m1.d2:ocMA.OdeW1C11.ode	@ltx/en_us_dedes/miscellanea:misc.Ode1
ltx/en_us_dedes/oc.m1.d2:ocMA.OdeW1C11.text	According to the multitude, O Christ, * of Your tender mercies blot out the multitude * of my sins, I pray to You. * And grant me thoughts that rouse me to return [to You], * that I might extol Your * incomprehensible benevolence.
ltx/en_us_dedes/oc.m1.d2:ocMA.OdeW1C12.incipit	Moved by tender mercy You…
ltx/en_us_dedes/oc.m1.d2:ocMA.OdeW1C12.melody	@ltx/en_us_dedes/he.h.m1:heHE.SouITropaiouchos.name
ltx/en_us_dedes/oc.m1.d2:ocMA.OdeW1C12.mode	@ltx/en_us_dedes/miscellanea:misc.Mode1
ltx/en_us_dedes/oc.m1.d2:ocMA.OdeW1C12.ode	@ltx/en_us_dedes/miscellanea:misc.Ode1
ltx/en_us_dedes/oc.m1.d2:ocMA.OdeW1C12.text	Moved by tender mercy You appeared * on earth in bodily form as a man, O Lord. * Hence accept me coming in repentance, having sinned more than all other men, * as to Your compassion, * O Word of God, I run beseeching You.
ltx/en_us_dedes/oc.m1.d2:ocMA.OdeW1C13.incipit	The demise and death of…
ltx/en_us_dedes/oc.m1.d2:ocMA.OdeW1C13.melody	@ltx/en_us_dedes/he.h.m1:heHE.SouITropaiouchos.name
ltx/en_us_dedes/oc.m1.d2:ocMA.OdeW1C13.mode	@ltx/en_us_dedes/miscellanea:misc.Mode1
ltx/en_us_dedes/oc.m1.d2:ocMA.OdeW1C13.ode	@ltx/en_us_dedes/miscellanea:misc.Ode1
ltx/en_us_dedes/oc.m1.d2:ocMA.OdeW1C13.text	The demise and death of Jesus Christ * who voluntarily suffered were you yourselves * emulating when you were enduring sufferings of many kinds and death, * celebrated Martyrs. * Hence you attained the immortal life.
ltx/en_us_dedes/oc.m1.d2:ocMA.OdeW1C14.incipit	Carrying within yourselves the fire…
ltx/en_us_dedes/oc.m1.d2:ocMA.OdeW1C14.melody	@ltx/en_us_dedes/he.h.m1:heHE.SouITropaiouchos.name
ltx/en_us_dedes/oc.m1.d2:ocMA.OdeW1C14.mode	@ltx/en_us_dedes/miscellanea:misc.Mode1
ltx/en_us_dedes/oc.m1.d2:ocMA.OdeW1C14.ode	@ltx/en_us_dedes/miscellanea:misc.Ode1
ltx/en_us_dedes/oc.m1.d2:ocMA.OdeW1C14.text	Carrying within yourselves the fire * of divine love as you markedly were, O Saints, * you were not dismayed by fire. But rather offering your labors ardently, * you consumed the substance * of the religion of many gods.
ltx/en_us_dedes/oc.m1.d2:ocMA.OdeW1C1H.greekmelody	@ltx/en_us_dedes/he.h.m1:heHE.SouITropaiouchos.greekname
ltx/en_us_dedes/oc.m1.d2:ocMA.OdeW1C1H.incipit	@ltx/en_us_dedes/he.h.m1:heHE.SouITropaiouchos.incipit
ltx/en_us_dedes/oc.m1.d2:ocMA.OdeW1C1H.melody	@ltx/en_us_dedes/he.h.m1:heHE.SouITropaiouchos.melody
ltx/en_us_dedes/oc.m1.d2:ocMA.OdeW1C1H.mode	@ltx/en_us_dedes/miscellanea:misc.Mode1
ltx/en_us_dedes/oc.m1.d2:ocMA.OdeW1C1H.ode	@ltx/en_us_dedes/miscellanea:misc.Ode1
ltx/en_us_dedes/oc.m1.d2:ocMA.OdeW1C1H.text	@ltx/en_us_dedes/he.h.m1:heHE.SouITropaiouchos.text
ltx/en_us_dedes/oc.m1.d2:ocMA.OdeW1C1T.incipit	Orders of the Bodiless with…
ltx/en_us_dedes/oc.m1.d2:ocMA.OdeW1C1T.melody	@ltx/en_us_dedes/he.h.m1:heHE.SouITropaiouchos.name
ltx/en_us_dedes/oc.m1.d2:ocMA.OdeW1C1T.mode	@ltx/en_us_dedes/miscellanea:misc.Mode1
ltx/en_us_dedes/oc.m1.d2:ocMA.OdeW1C1T.ode	@ltx/en_us_dedes/miscellanea:misc.Ode1
ltx/en_us_dedes/oc.m1.d2:ocMA.OdeW1C1T.text	Orders of the Bodiless with us * together praise you, O Virgin extolled by all. * For to the Uncircumscribed, who in your womb became incarnate, you gave birth * while remaining virgin, * O Bride of God, as you were before.
ltx/en_us_dedes/oc.m1.d2:ocMA.OdeW1C21.greekmelody	@ltx/en_us_dedes/he.h.m1:heHE.SouITropaiouchos.greekname
ltx/en_us_dedes/oc.m1.d2:ocMA.OdeW1C21.incipit	O all-holy Angels, as you…
ltx/en_us_dedes/oc.m1.d2:ocMA.OdeW1C21.melody	@ltx/en_us_dedes/he.h.m1:heHE.SouITropaiouchos.name
ltx/en_us_dedes/oc.m1.d2:ocMA.OdeW1C21.mode	@ltx/en_us_dedes/miscellanea:misc.Mode1
ltx/en_us_dedes/oc.m1.d2:ocMA.OdeW1C21.ode	@ltx/en_us_dedes/miscellanea:misc.Ode1
ltx/en_us_dedes/oc.m1.d2:ocMA.OdeW1C21.text	O all-holy Angels, as you stand * before the throne of the Master aglow with joy, * to the Father’s Angel of great counsel, who with Him is unoriginate, * pray that He inspire me, * who now extol you, with utterance.
ltx/en_us_dedes/oc.m1.d2:ocMA.OdeW1C22.incipit	When the Divine Intellect at…
ltx/en_us_dedes/oc.m1.d2:ocMA.OdeW1C22.melody	@ltx/en_us_dedes/he.h.m1:heHE.SouITropaiouchos.name
ltx/en_us_dedes/oc.m1.d2:ocMA.OdeW1C22.mode	@ltx/en_us_dedes/miscellanea:misc.Mode1
ltx/en_us_dedes/oc.m1.d2:ocMA.OdeW1C22.ode	@ltx/en_us_dedes/miscellanea:misc.Ode1
ltx/en_us_dedes/oc.m1.d2:ocMA.OdeW1C22.text	When the Divine Intellect at first * cognized the orders of Angels, He stablished them * mirrors of the Godhead’s light, as far as possible receptive unto all * the illumination * cast by the torch of the threefold Sun.
ltx/en_us_dedes/oc.m1.d2:ocMA.OdeW1C2T.incipit	He who set in order…
ltx/en_us_dedes/oc.m1.d2:ocMA.OdeW1C2T.melody	@ltx/en_us_dedes/he.h.m1:heHE.SouITropaiouchos.name
ltx/en_us_dedes/oc.m1.d2:ocMA.OdeW1C2T.mode	@ltx/en_us_dedes/miscellanea:misc.Mode1
ltx/en_us_dedes/oc.m1.d2:ocMA.OdeW1C2T.ode	@ltx/en_us_dedes/miscellanea:misc.Ode1
ltx/en_us_dedes/oc.m1.d2:ocMA.OdeW1C2T.text	He who set in order all the ranks * of the angelical powers on high as God * dwelt within your virgin womb which is exalted higher than the Seraphim, * and therein became flesh, * O Theotokos, immutably.
ltx/en_us_dedes/oc.m1.d2:ocMA.OdeW3C11.incipit	Return to sobriety and come…
ltx/en_us_dedes/oc.m1.d2:ocMA.OdeW3C11.melody	@ltx/en_us_dedes/he.h.m1:heHE.OMonosEidos.name
ltx/en_us_dedes/oc.m1.d2:ocMA.OdeW3C11.mode	@ltx/en_us_dedes/miscellanea:misc.Mode1
ltx/en_us_dedes/oc.m1.d2:ocMA.OdeW3C11.ode	@ltx/en_us_dedes/miscellanea:misc.Ode3
ltx/en_us_dedes/oc.m1.d2:ocMA.OdeW3C11.text	Return to sobriety and come, * O my soul, and cry aloud to your Creator who knows your secrets all. * Produce the fruits of repentance, so that He, * as a tender-loving Lord, show His mercy unto you * and redeem you from the everlasting fire.
ltx/en_us_dedes/oc.m1.d2:ocMA.OdeW3C12.incipit	Be merciful, only gracious God…
ltx/en_us_dedes/oc.m1.d2:ocMA.OdeW3C12.melody	@ltx/en_us_dedes/he.h.m1:heHE.OMonosEidos.name
ltx/en_us_dedes/oc.m1.d2:ocMA.OdeW3C12.mode	@ltx/en_us_dedes/miscellanea:misc.Mode1
ltx/en_us_dedes/oc.m1.d2:ocMA.OdeW3C12.ode	@ltx/en_us_dedes/miscellanea:misc.Ode3
ltx/en_us_dedes/oc.m1.d2:ocMA.OdeW3C12.text	Be merciful, only gracious God, * be merciful and save me, Lord, I cry to You with fear as the Publican, * towing a load of transgressions as I do, * and bent down beneath the weight of my many trespasses, * being filled with a sense of immeasurable shame.
ltx/en_us_dedes/oc.m1.d2:ocMA.OdeW3C13.incipit	With wisdom and knowledge that…
ltx/en_us_dedes/oc.m1.d2:ocMA.OdeW3C13.melody	@ltx/en_us_dedes/he.h.m1:heHE.OMonosEidos.name
ltx/en_us_dedes/oc.m1.d2:ocMA.OdeW3C13.mode	@ltx/en_us_dedes/miscellanea:misc.Mode1
ltx/en_us_dedes/oc.m1.d2:ocMA.OdeW3C13.ode	@ltx/en_us_dedes/miscellanea:misc.Ode3
ltx/en_us_dedes/oc.m1.d2:ocMA.OdeW3C13.text	With wisdom and knowledge that is true * were Christ’s all-holy Martyrs filled. They showed that pagan wisdom is foolishness. * They put an end to the sophist and his vice. * They contested mightily, and rejoicing worthily * they received laurel crowns for their victory.
ltx/en_us_dedes/oc.m1.d2:ocMA.OdeW3C14.incipit	Confessing the Godhead to be…
ltx/en_us_dedes/oc.m1.d2:ocMA.OdeW3C14.melody	@ltx/en_us_dedes/he.h.m1:heHE.OMonosEidos.name
ltx/en_us_dedes/oc.m1.d2:ocMA.OdeW3C14.mode	@ltx/en_us_dedes/miscellanea:misc.Mode1
ltx/en_us_dedes/oc.m1.d2:ocMA.OdeW3C14.ode	@ltx/en_us_dedes/miscellanea:misc.Ode3
ltx/en_us_dedes/oc.m1.d2:ocMA.OdeW3C14.text	Confessing the Godhead to be one * in nature while in persons three, O holy athletes, by your belief in God * you made the pagan delusion disappear. * You were seen to be as lights, brightly shining with the rays * of the grace of the Lord in the hearts of all.
ltx/en_us_dedes/oc.m1.d2:ocMA.OdeW3C1H.greekmelody	@ltx/en_us_dedes/he.h.m1:heHE.OMonosEidos.greekname
ltx/en_us_dedes/oc.m1.d2:ocMA.OdeW3C1H.incipit	@ltx/en_us_dedes/he.h.m1:heHE.OMonosEidos.incipit
ltx/en_us_dedes/oc.m1.d2:ocMA.OdeW3C1H.melody	@ltx/en_us_dedes/he.h.m1:heHE.OMonosEidos.melody
ltx/en_us_dedes/oc.m1.d2:ocMA.OdeW3C1H.mode	@ltx/en_us_dedes/miscellanea:misc.Mode1
ltx/en_us_dedes/oc.m1.d2:ocMA.OdeW3C1H.ode	@ltx/en_us_dedes/miscellanea:misc.Ode3
ltx/en_us_dedes/oc.m1.d2:ocMA.OdeW3C1H.text	@ltx/en_us_dedes/he.h.m1:heHE.OMonosEidos.text
ltx/en_us_dedes/oc.m1.d2:ocMA.OdeW3C1T.incipit	O pure and all-holy Bride…
ltx/en_us_dedes/oc.m1.d2:ocMA.OdeW3C1T.melody	@ltx/en_us_dedes/he.h.m1:heHE.OMonosEidos.name
ltx/en_us_dedes/oc.m1.d2:ocMA.OdeW3C1T.mode	@ltx/en_us_dedes/miscellanea:misc.Mode1
ltx/en_us_dedes/oc.m1.d2:ocMA.OdeW3C1T.ode	@ltx/en_us_dedes/miscellanea:misc.Ode3
ltx/en_us_dedes/oc.m1.d2:ocMA.OdeW3C1T.text	O pure and all-holy Bride of God, * in holiness did you give birth unto the Son and Word, unoriginate * with God the Father. He is the One who rests * in the holy, hallowing by the Holy Spirit all * who as Orthodox hallow and worship Him.
ltx/en_us_dedes/oc.m1.d2:ocMA.OdeW3C21.greekmelody	@ltx/en_us_dedes/he.h.m1:heHE.OMonosEidos.greekname
ltx/en_us_dedes/oc.m1.d2:ocMA.OdeW3C21.incipit	At all times immediately near…
ltx/en_us_dedes/oc.m1.d2:ocMA.OdeW3C21.melody	@ltx/en_us_dedes/he.h.m1:heHE.OMonosEidos.name
ltx/en_us_dedes/oc.m1.d2:ocMA.OdeW3C21.mode	@ltx/en_us_dedes/miscellanea:misc.Mode1
ltx/en_us_dedes/oc.m1.d2:ocMA.OdeW3C21.ode	@ltx/en_us_dedes/miscellanea:misc.Ode3
ltx/en_us_dedes/oc.m1.d2:ocMA.OdeW3C21.text	At all times immediately near * the Light of divine energy, the Seraphim diversely are filled therewith. * They are the first plainly to be brightened by * the illumination from the Prime Giver and are called * second lights, being rendered divine by grace.
ltx/en_us_dedes/oc.m1.d2:ocMA.OdeW3C22.incipit	We faithful who earnestly desire…
ltx/en_us_dedes/oc.m1.d2:ocMA.OdeW3C22.melody	@ltx/en_us_dedes/he.h.m1:heHE.OMonosEidos.name
ltx/en_us_dedes/oc.m1.d2:ocMA.OdeW3C22.mode	@ltx/en_us_dedes/miscellanea:misc.Mode1
ltx/en_us_dedes/oc.m1.d2:ocMA.OdeW3C22.ode	@ltx/en_us_dedes/miscellanea:misc.Ode3
ltx/en_us_dedes/oc.m1.d2:ocMA.OdeW3C22.text	We faithful who earnestly desire * to hymn the Angels’ excellence, let us request with pureness of intellect * and with a mouth undefiled for the help * which comes down from God and is given unto us through them, * and we thus shall obtain illumination from them.
ltx/en_us_dedes/oc.m1.d2:ocMA.OdeW3C2T.incipit	Gabriel, entitled as he is…
ltx/en_us_dedes/oc.m1.d2:ocMA.OdeW3C2T.melody	@ltx/en_us_dedes/he.h.m1:heHE.OMonosEidos.name
ltx/en_us_dedes/oc.m1.d2:ocMA.OdeW3C2T.mode	@ltx/en_us_dedes/miscellanea:misc.Mode1
ltx/en_us_dedes/oc.m1.d2:ocMA.OdeW3C2T.ode	@ltx/en_us_dedes/miscellanea:misc.Ode3
ltx/en_us_dedes/oc.m1.d2:ocMA.OdeW3C2T.text	Gabriel, entitled as he is * to see the all-transcending Mind as far as is permissable, brought to you, * all-blameless Virgin, the joyful utterance, * clearly making known to you the conception of the Word, * and announced your ineffable childbirth.
ltx/en_us_dedes/oc.m1.d2:ocMA.OdeW4C11.incipit	…
ltx/en_us_dedes/oc.m1.d2:ocMA.OdeW4C11.melody	@ltx/en_us_dedes/he.h.m1:heHE.OrosSeTiChariti.name
ltx/en_us_dedes/oc.m1.d2:ocMA.OdeW4C11.mode	@ltx/en_us_dedes/miscellanea:misc.Mode1
ltx/en_us_dedes/oc.m1.d2:ocMA.OdeW4C11.ode	@ltx/en_us_dedes/miscellanea:misc.Ode4
ltx/en_us_dedes/oc.m1.d2:ocMA.OdeW4C11.text	
ltx/en_us_dedes/oc.m1.d2:ocMA.OdeW4C12.incipit	…
ltx/en_us_dedes/oc.m1.d2:ocMA.OdeW4C12.melody	@ltx/en_us_dedes/he.h.m1:heHE.OrosSeTiChariti.name
ltx/en_us_dedes/oc.m1.d2:ocMA.OdeW4C12.mode	@ltx/en_us_dedes/miscellanea:misc.Mode1
ltx/en_us_dedes/oc.m1.d2:ocMA.OdeW4C12.ode	@ltx/en_us_dedes/miscellanea:misc.Ode4
ltx/en_us_dedes/oc.m1.d2:ocMA.OdeW4C12.text	
ltx/en_us_dedes/oc.m1.d2:ocMA.OdeW4C13.incipit	…
ltx/en_us_dedes/oc.m1.d2:ocMA.OdeW4C13.melody	@ltx/en_us_dedes/he.h.m1:heHE.OrosSeTiChariti.name
ltx/en_us_dedes/oc.m1.d2:ocMA.OdeW4C13.mode	@ltx/en_us_dedes/miscellanea:misc.Mode1
ltx/en_us_dedes/oc.m1.d2:ocMA.OdeW4C13.ode	@ltx/en_us_dedes/miscellanea:misc.Ode4
ltx/en_us_dedes/oc.m1.d2:ocMA.OdeW4C13.text	
ltx/en_us_dedes/oc.m1.d2:ocMA.OdeW4C14.incipit	…
ltx/en_us_dedes/oc.m1.d2:ocMA.OdeW4C14.melody	@ltx/en_us_dedes/he.h.m1:heHE.OrosSeTiChariti.name
ltx/en_us_dedes/oc.m1.d2:ocMA.OdeW4C14.mode	@ltx/en_us_dedes/miscellanea:misc.Mode1
ltx/en_us_dedes/oc.m1.d2:ocMA.OdeW4C14.ode	@ltx/en_us_dedes/miscellanea:misc.Ode4
ltx/en_us_dedes/oc.m1.d2:ocMA.OdeW4C14.text	
ltx/en_us_dedes/oc.m1.d2:ocMA.OdeW4C1H.greekmelody	@ltx/en_us_dedes/he.h.m1:heHE.OrosSeTiChariti.greekname
ltx/en_us_dedes/oc.m1.d2:ocMA.OdeW4C1H.incipit	@ltx/en_us_dedes/he.h.m1:heHE.OrosSeTiChariti.incipit
ltx/en_us_dedes/oc.m1.d2:ocMA.OdeW4C1H.melody	@ltx/en_us_dedes/he.h.m1:heHE.OrosSeTiChariti.melody
ltx/en_us_dedes/oc.m1.d2:ocMA.OdeW4C1H.mode	@ltx/en_us_dedes/miscellanea:misc.Mode1
ltx/en_us_dedes/oc.m1.d2:ocMA.OdeW4C1H.ode	@ltx/en_us_dedes/miscellanea:misc.Ode4
ltx/en_us_dedes/oc.m1.d2:ocMA.OdeW4C1H.text	@ltx/en_us_dedes/he.h.m1:heHE.OrosSeTiChariti.text
ltx/en_us_dedes/oc.m1.d2:ocMA.OdeW4C1T.incipit	…
ltx/en_us_dedes/oc.m1.d2:ocMA.OdeW4C1T.melody	@ltx/en_us_dedes/he.h.m1:heHE.OrosSeTiChariti.name
ltx/en_us_dedes/oc.m1.d2:ocMA.OdeW4C1T.mode	@ltx/en_us_dedes/miscellanea:misc.Mode1
ltx/en_us_dedes/oc.m1.d2:ocMA.OdeW4C1T.ode	@ltx/en_us_dedes/miscellanea:misc.Ode4
ltx/en_us_dedes/oc.m1.d2:ocMA.OdeW4C1T.text	
ltx/en_us_dedes/oc.m1.d2:ocMA.OdeW4C21.greekmelody	@ltx/en_us_dedes/he.h.m1:heHE.OrosSeTiChariti.greekname
ltx/en_us_dedes/oc.m1.d2:ocMA.OdeW4C21.incipit	…
ltx/en_us_dedes/oc.m1.d2:ocMA.OdeW4C21.melody	@ltx/en_us_dedes/he.h.m1:heHE.OrosSeTiChariti.name
ltx/en_us_dedes/oc.m1.d2:ocMA.OdeW4C21.mode	@ltx/en_us_dedes/miscellanea:misc.Mode1
ltx/en_us_dedes/oc.m1.d2:ocMA.OdeW4C21.ode	@ltx/en_us_dedes/miscellanea:misc.Ode4
ltx/en_us_dedes/oc.m1.d2:ocMA.OdeW4C21.text	
ltx/en_us_dedes/oc.m1.d2:ocMA.OdeW4C22.incipit	…
ltx/en_us_dedes/oc.m1.d2:ocMA.OdeW4C22.melody	@ltx/en_us_dedes/he.h.m1:heHE.OrosSeTiChariti.name
ltx/en_us_dedes/oc.m1.d2:ocMA.OdeW4C22.mode	@ltx/en_us_dedes/miscellanea:misc.Mode1
ltx/en_us_dedes/oc.m1.d2:ocMA.OdeW4C22.ode	@ltx/en_us_dedes/miscellanea:misc.Ode4
ltx/en_us_dedes/oc.m1.d2:ocMA.OdeW4C22.text	
ltx/en_us_dedes/oc.m1.d2:ocMA.OdeW4C23.incipit	…
ltx/en_us_dedes/oc.m1.d2:ocMA.OdeW4C23.melody	@ltx/en_us_dedes/he.h.m1:heHE.OrosSeTiChariti.name
ltx/en_us_dedes/oc.m1.d2:ocMA.OdeW4C23.mode	@ltx/en_us_dedes/miscellanea:misc.Mode1
ltx/en_us_dedes/oc.m1.d2:ocMA.OdeW4C23.ode	@ltx/en_us_dedes/miscellanea:misc.Ode4
ltx/en_us_dedes/oc.m1.d2:ocMA.OdeW4C23.text	
ltx/en_us_dedes/oc.m1.d2:ocMA.OdeW4C2T.incipit	…
ltx/en_us_dedes/oc.m1.d2:ocMA.OdeW4C2T.melody	@ltx/en_us_dedes/he.h.m1:heHE.OrosSeTiChariti.name
ltx/en_us_dedes/oc.m1.d2:ocMA.OdeW4C2T.mode	@ltx/en_us_dedes/miscellanea:misc.Mode1
ltx/en_us_dedes/oc.m1.d2:ocMA.OdeW4C2T.ode	@ltx/en_us_dedes/miscellanea:misc.Ode4
ltx/en_us_dedes/oc.m1.d2:ocMA.OdeW4C2T.text	
ltx/en_us_dedes/oc.m1.d2:ocMA.OdeW5C11.incipit	…
ltx/en_us_dedes/oc.m1.d2:ocMA.OdeW5C11.melody	@ltx/en_us_dedes/he.h.m1:heHE.OFotisasTiEllampsei.name
ltx/en_us_dedes/oc.m1.d2:ocMA.OdeW5C11.mode	@ltx/en_us_dedes/miscellanea:misc.Mode1
ltx/en_us_dedes/oc.m1.d2:ocMA.OdeW5C11.ode	@ltx/en_us_dedes/miscellanea:misc.Ode5
ltx/en_us_dedes/oc.m1.d2:ocMA.OdeW5C11.text	
ltx/en_us_dedes/oc.m1.d2:ocMA.OdeW5C12.incipit	…
ltx/en_us_dedes/oc.m1.d2:ocMA.OdeW5C12.melody	@ltx/en_us_dedes/he.h.m1:heHE.OFotisasTiEllampsei.name
ltx/en_us_dedes/oc.m1.d2:ocMA.OdeW5C12.mode	@ltx/en_us_dedes/miscellanea:misc.Mode1
ltx/en_us_dedes/oc.m1.d2:ocMA.OdeW5C12.ode	@ltx/en_us_dedes/miscellanea:misc.Ode5
ltx/en_us_dedes/oc.m1.d2:ocMA.OdeW5C12.text	
ltx/en_us_dedes/oc.m1.d2:ocMA.OdeW5C13.incipit	…
ltx/en_us_dedes/oc.m1.d2:ocMA.OdeW5C13.melody	@ltx/en_us_dedes/he.h.m1:heHE.OFotisasTiEllampsei.name
ltx/en_us_dedes/oc.m1.d2:ocMA.OdeW5C13.mode	@ltx/en_us_dedes/miscellanea:misc.Mode1
ltx/en_us_dedes/oc.m1.d2:ocMA.OdeW5C13.ode	@ltx/en_us_dedes/miscellanea:misc.Ode5
ltx/en_us_dedes/oc.m1.d2:ocMA.OdeW5C13.text	
ltx/en_us_dedes/oc.m1.d2:ocMA.OdeW5C14.incipit	…
ltx/en_us_dedes/oc.m1.d2:ocMA.OdeW5C14.melody	@ltx/en_us_dedes/he.h.m1:heHE.OFotisasTiEllampsei.name
ltx/en_us_dedes/oc.m1.d2:ocMA.OdeW5C14.mode	@ltx/en_us_dedes/miscellanea:misc.Mode1
ltx/en_us_dedes/oc.m1.d2:ocMA.OdeW5C14.ode	@ltx/en_us_dedes/miscellanea:misc.Ode5
ltx/en_us_dedes/oc.m1.d2:ocMA.OdeW5C14.text	
ltx/en_us_dedes/oc.m1.d2:ocMA.OdeW5C1H.greekmelody	@ltx/en_us_dedes/he.h.m1:heHE.OFotisasTiEllampsei.greekname
ltx/en_us_dedes/oc.m1.d2:ocMA.OdeW5C1H.incipit	@ltx/en_us_dedes/he.h.m1:heHE.OFotisasTiEllampsei.incipit
ltx/en_us_dedes/oc.m1.d2:ocMA.OdeW5C1H.melody	@ltx/en_us_dedes/he.h.m1:heHE.OFotisasTiEllampsei.melody
ltx/en_us_dedes/oc.m1.d2:ocMA.OdeW5C1H.mode	@ltx/en_us_dedes/miscellanea:misc.Mode1
ltx/en_us_dedes/oc.m1.d2:ocMA.OdeW5C1H.ode	@ltx/en_us_dedes/miscellanea:misc.Ode5
ltx/en_us_dedes/oc.m1.d2:ocMA.OdeW5C1H.text	@ltx/en_us_dedes/he.h.m1:heHE.OFotisasTiEllampsei.text
ltx/en_us_dedes/oc.m1.d2:ocMA.OdeW5C1T.incipit	…
ltx/en_us_dedes/oc.m1.d2:ocMA.OdeW5C1T.melody	@ltx/en_us_dedes/he.h.m1:heHE.OFotisasTiEllampsei.name
ltx/en_us_dedes/oc.m1.d2:ocMA.OdeW5C1T.mode	@ltx/en_us_dedes/miscellanea:misc.Mode1
ltx/en_us_dedes/oc.m1.d2:ocMA.OdeW5C1T.ode	@ltx/en_us_dedes/miscellanea:misc.Ode5
ltx/en_us_dedes/oc.m1.d2:ocMA.OdeW5C1T.text	
ltx/en_us_dedes/oc.m1.d2:ocMA.OdeW5C21.greekmelody	@ltx/en_us_dedes/he.h.m1:heHE.OFotisasTiEllampsei.greekname
ltx/en_us_dedes/oc.m1.d2:ocMA.OdeW5C21.incipit	…
ltx/en_us_dedes/oc.m1.d2:ocMA.OdeW5C21.melody	@ltx/en_us_dedes/he.h.m1:heHE.OFotisasTiEllampsei.name
ltx/en_us_dedes/oc.m1.d2:ocMA.OdeW5C21.mode	@ltx/en_us_dedes/miscellanea:misc.Mode1
ltx/en_us_dedes/oc.m1.d2:ocMA.OdeW5C21.ode	@ltx/en_us_dedes/miscellanea:misc.Ode5
ltx/en_us_dedes/oc.m1.d2:ocMA.OdeW5C21.text	
ltx/en_us_dedes/oc.m1.d2:ocMA.OdeW5C22.incipit	…
ltx/en_us_dedes/oc.m1.d2:ocMA.OdeW5C22.melody	@ltx/en_us_dedes/he.h.m1:heHE.OFotisasTiEllampsei.name
ltx/en_us_dedes/oc.m1.d2:ocMA.OdeW5C22.mode	@ltx/en_us_dedes/miscellanea:misc.Mode1
ltx/en_us_dedes/oc.m1.d2:ocMA.OdeW5C22.ode	@ltx/en_us_dedes/miscellanea:misc.Ode5
ltx/en_us_dedes/oc.m1.d2:ocMA.OdeW5C22.text	
ltx/en_us_dedes/oc.m1.d2:ocMA.OdeW5C2T.incipit	…
ltx/en_us_dedes/oc.m1.d2:ocMA.OdeW5C2T.melody	@ltx/en_us_dedes/he.h.m1:heHE.OFotisasTiEllampsei.name
ltx/en_us_dedes/oc.m1.d2:ocMA.OdeW5C2T.mode	@ltx/en_us_dedes/miscellanea:misc.Mode1
ltx/en_us_dedes/oc.m1.d2:ocMA.OdeW5C2T.ode	@ltx/en_us_dedes/miscellanea:misc.Ode5
ltx/en_us_dedes/oc.m1.d2:ocMA.OdeW5C2T.text	
ltx/en_us_dedes/oc.m1.d2:ocMA.OdeW6C11.incipit	…
ltx/en_us_dedes/oc.m1.d2:ocMA.OdeW6C11.melody	@ltx/en_us_dedes/he.h.m1:heHE.EkyklosenImas.name
ltx/en_us_dedes/oc.m1.d2:ocMA.OdeW6C11.mode	@ltx/en_us_dedes/miscellanea:misc.Mode1
ltx/en_us_dedes/oc.m1.d2:ocMA.OdeW6C11.ode	@ltx/en_us_dedes/miscellanea:misc.Ode6
ltx/en_us_dedes/oc.m1.d2:ocMA.OdeW6C11.text	
ltx/en_us_dedes/oc.m1.d2:ocMA.OdeW6C12.incipit	…
ltx/en_us_dedes/oc.m1.d2:ocMA.OdeW6C12.melody	@ltx/en_us_dedes/he.h.m1:heHE.EkyklosenImas.name
ltx/en_us_dedes/oc.m1.d2:ocMA.OdeW6C12.mode	@ltx/en_us_dedes/miscellanea:misc.Mode1
ltx/en_us_dedes/oc.m1.d2:ocMA.OdeW6C12.ode	@ltx/en_us_dedes/miscellanea:misc.Ode6
ltx/en_us_dedes/oc.m1.d2:ocMA.OdeW6C12.text	
ltx/en_us_dedes/oc.m1.d2:ocMA.OdeW6C13.incipit	…
ltx/en_us_dedes/oc.m1.d2:ocMA.OdeW6C13.melody	@ltx/en_us_dedes/he.h.m1:heHE.EkyklosenImas.name
ltx/en_us_dedes/oc.m1.d2:ocMA.OdeW6C13.mode	@ltx/en_us_dedes/miscellanea:misc.Mode1
ltx/en_us_dedes/oc.m1.d2:ocMA.OdeW6C13.ode	@ltx/en_us_dedes/miscellanea:misc.Ode6
ltx/en_us_dedes/oc.m1.d2:ocMA.OdeW6C13.text	
ltx/en_us_dedes/oc.m1.d2:ocMA.OdeW6C14.incipit	…
ltx/en_us_dedes/oc.m1.d2:ocMA.OdeW6C14.melody	@ltx/en_us_dedes/he.h.m1:heHE.EkyklosenImas.name
ltx/en_us_dedes/oc.m1.d2:ocMA.OdeW6C14.mode	@ltx/en_us_dedes/miscellanea:misc.Mode1
ltx/en_us_dedes/oc.m1.d2:ocMA.OdeW6C14.ode	@ltx/en_us_dedes/miscellanea:misc.Ode6
ltx/en_us_dedes/oc.m1.d2:ocMA.OdeW6C14.text	
ltx/en_us_dedes/oc.m1.d2:ocMA.OdeW6C1H.greekmelody	@ltx/en_us_dedes/he.h.m1:heHE.EkyklosenImas.greekname
ltx/en_us_dedes/oc.m1.d2:ocMA.OdeW6C1H.incipit	@ltx/en_us_dedes/he.h.m1:heHE.EkyklosenImas.incipit
ltx/en_us_dedes/oc.m1.d2:ocMA.OdeW6C1H.melody	@ltx/en_us_dedes/he.h.m1:heHE.EkyklosenImas.melody
ltx/en_us_dedes/oc.m1.d2:ocMA.OdeW6C1H.mode	@ltx/en_us_dedes/miscellanea:misc.Mode1
ltx/en_us_dedes/oc.m1.d2:ocMA.OdeW6C1H.ode	@ltx/en_us_dedes/miscellanea:misc.Ode6
ltx/en_us_dedes/oc.m1.d2:ocMA.OdeW6C1H.text	@ltx/en_us_dedes/he.h.m1:heHE.EkyklosenImas.text
ltx/en_us_dedes/oc.m1.d2:ocMA.OdeW6C1T.incipit	…
ltx/en_us_dedes/oc.m1.d2:ocMA.OdeW6C1T.melody	@ltx/en_us_dedes/he.h.m1:heHE.EkyklosenImas.name
ltx/en_us_dedes/oc.m1.d2:ocMA.OdeW6C1T.mode	@ltx/en_us_dedes/miscellanea:misc.Mode1
ltx/en_us_dedes/oc.m1.d2:ocMA.OdeW6C1T.ode	@ltx/en_us_dedes/miscellanea:misc.Ode6
ltx/en_us_dedes/oc.m1.d2:ocMA.OdeW6C1T.text	
ltx/en_us_dedes/oc.m1.d2:ocMA.OdeW6C21.greekmelody	@ltx/en_us_dedes/he.h.m1:heHE.EkyklosenImas.greekname
ltx/en_us_dedes/oc.m1.d2:ocMA.OdeW6C21.incipit	…
ltx/en_us_dedes/oc.m1.d2:ocMA.OdeW6C21.melody	@ltx/en_us_dedes/he.h.m1:heHE.EkyklosenImas.name
ltx/en_us_dedes/oc.m1.d2:ocMA.OdeW6C21.mode	@ltx/en_us_dedes/miscellanea:misc.Mode1
ltx/en_us_dedes/oc.m1.d2:ocMA.OdeW6C21.ode	@ltx/en_us_dedes/miscellanea:misc.Ode6
ltx/en_us_dedes/oc.m1.d2:ocMA.OdeW6C21.text	
ltx/en_us_dedes/oc.m1.d2:ocMA.OdeW6C22.incipit	…
ltx/en_us_dedes/oc.m1.d2:ocMA.OdeW6C22.melody	@ltx/en_us_dedes/he.h.m1:heHE.EkyklosenImas.name
ltx/en_us_dedes/oc.m1.d2:ocMA.OdeW6C22.mode	@ltx/en_us_dedes/miscellanea:misc.Mode1
ltx/en_us_dedes/oc.m1.d2:ocMA.OdeW6C22.ode	@ltx/en_us_dedes/miscellanea:misc.Ode6
ltx/en_us_dedes/oc.m1.d2:ocMA.OdeW6C22.text	
ltx/en_us_dedes/oc.m1.d2:ocMA.OdeW6C2T.incipit	…
ltx/en_us_dedes/oc.m1.d2:ocMA.OdeW6C2T.melody	@ltx/en_us_dedes/he.h.m1:heHE.EkyklosenImas.name
ltx/en_us_dedes/oc.m1.d2:ocMA.OdeW6C2T.mode	@ltx/en_us_dedes/miscellanea:misc.Mode1
ltx/en_us_dedes/oc.m1.d2:ocMA.OdeW6C2T.ode	@ltx/en_us_dedes/miscellanea:misc.Ode6
ltx/en_us_dedes/oc.m1.d2:ocMA.OdeW6C2T.text	
ltx/en_us_dedes/oc.m1.d2:ocMA.OdeW7C11.incipit	…
ltx/en_us_dedes/oc.m1.d2:ocMA.OdeW7C11.melody	@ltx/en_us_dedes/he.h.m1:heHE.SeNoitin.name
ltx/en_us_dedes/oc.m1.d2:ocMA.OdeW7C11.mode	@ltx/en_us_dedes/miscellanea:misc.Mode1
ltx/en_us_dedes/oc.m1.d2:ocMA.OdeW7C11.ode	@ltx/en_us_dedes/miscellanea:misc.Ode7
ltx/en_us_dedes/oc.m1.d2:ocMA.OdeW7C11.text	
ltx/en_us_dedes/oc.m1.d2:ocMA.OdeW7C12.incipit	…
ltx/en_us_dedes/oc.m1.d2:ocMA.OdeW7C12.melody	@ltx/en_us_dedes/he.h.m1:heHE.SeNoitin.name
ltx/en_us_dedes/oc.m1.d2:ocMA.OdeW7C12.mode	@ltx/en_us_dedes/miscellanea:misc.Mode1
ltx/en_us_dedes/oc.m1.d2:ocMA.OdeW7C12.ode	@ltx/en_us_dedes/miscellanea:misc.Ode7
ltx/en_us_dedes/oc.m1.d2:ocMA.OdeW7C12.text	
ltx/en_us_dedes/oc.m1.d2:ocMA.OdeW7C13.incipit	…
ltx/en_us_dedes/oc.m1.d2:ocMA.OdeW7C13.melody	@ltx/en_us_dedes/he.h.m1:heHE.SeNoitin.name
ltx/en_us_dedes/oc.m1.d2:ocMA.OdeW7C13.mode	@ltx/en_us_dedes/miscellanea:misc.Mode1
ltx/en_us_dedes/oc.m1.d2:ocMA.OdeW7C13.ode	@ltx/en_us_dedes/miscellanea:misc.Ode7
ltx/en_us_dedes/oc.m1.d2:ocMA.OdeW7C13.text	
ltx/en_us_dedes/oc.m1.d2:ocMA.OdeW7C14.incipit	…
ltx/en_us_dedes/oc.m1.d2:ocMA.OdeW7C14.melody	@ltx/en_us_dedes/he.h.m1:heHE.SeNoitin.name
ltx/en_us_dedes/oc.m1.d2:ocMA.OdeW7C14.mode	@ltx/en_us_dedes/miscellanea:misc.Mode1
ltx/en_us_dedes/oc.m1.d2:ocMA.OdeW7C14.ode	@ltx/en_us_dedes/miscellanea:misc.Ode7
ltx/en_us_dedes/oc.m1.d2:ocMA.OdeW7C14.text	
ltx/en_us_dedes/oc.m1.d2:ocMA.OdeW7C1H.greekmelody	@ltx/en_us_dedes/he.h.m1:heHE.SeNoitin.greekname
ltx/en_us_dedes/oc.m1.d2:ocMA.OdeW7C1H.incipit	@ltx/en_us_dedes/he.h.m1:heHE.SeNoitin.incipit
ltx/en_us_dedes/oc.m1.d2:ocMA.OdeW7C1H.melody	@ltx/en_us_dedes/he.h.m1:heHE.SeNoitin.melody
ltx/en_us_dedes/oc.m1.d2:ocMA.OdeW7C1H.mode	@ltx/en_us_dedes/miscellanea:misc.Mode1
ltx/en_us_dedes/oc.m1.d2:ocMA.OdeW7C1H.ode	@ltx/en_us_dedes/miscellanea:misc.Ode7
ltx/en_us_dedes/oc.m1.d2:ocMA.OdeW7C1H.text	@ltx/en_us_dedes/he.h.m1:heHE.SeNoitin.text
ltx/en_us_dedes/oc.m1.d2:ocMA.OdeW7C1T.incipit	…
ltx/en_us_dedes/oc.m1.d2:ocMA.OdeW7C1T.melody	@ltx/en_us_dedes/he.h.m1:heHE.SeNoitin.name
ltx/en_us_dedes/oc.m1.d2:ocMA.OdeW7C1T.mode	@ltx/en_us_dedes/miscellanea:misc.Mode1
ltx/en_us_dedes/oc.m1.d2:ocMA.OdeW7C1T.ode	@ltx/en_us_dedes/miscellanea:misc.Ode7
ltx/en_us_dedes/oc.m1.d2:ocMA.OdeW7C1T.text	
ltx/en_us_dedes/oc.m1.d2:ocMA.OdeW7C21.greekmelody	@ltx/en_us_dedes/he.h.m1:heHE.SeNoitin.greekname
ltx/en_us_dedes/oc.m1.d2:ocMA.OdeW7C21.incipit	…
ltx/en_us_dedes/oc.m1.d2:ocMA.OdeW7C21.melody	@ltx/en_us_dedes/he.h.m1:heHE.SeNoitin.name
ltx/en_us_dedes/oc.m1.d2:ocMA.OdeW7C21.mode	@ltx/en_us_dedes/miscellanea:misc.Mode1
ltx/en_us_dedes/oc.m1.d2:ocMA.OdeW7C21.ode	@ltx/en_us_dedes/miscellanea:misc.Ode7
ltx/en_us_dedes/oc.m1.d2:ocMA.OdeW7C21.text	
ltx/en_us_dedes/oc.m1.d2:ocMA.OdeW7C22.incipit	…
ltx/en_us_dedes/oc.m1.d2:ocMA.OdeW7C22.melody	@ltx/en_us_dedes/he.h.m1:heHE.SeNoitin.name
ltx/en_us_dedes/oc.m1.d2:ocMA.OdeW7C22.mode	@ltx/en_us_dedes/miscellanea:misc.Mode1
ltx/en_us_dedes/oc.m1.d2:ocMA.OdeW7C22.ode	@ltx/en_us_dedes/miscellanea:misc.Ode7
ltx/en_us_dedes/oc.m1.d2:ocMA.OdeW7C22.text	
ltx/en_us_dedes/oc.m1.d2:ocMA.OdeW7C23.incipit	…
ltx/en_us_dedes/oc.m1.d2:ocMA.OdeW7C23.melody	@ltx/en_us_dedes/he.h.m1:heHE.SeNoitin.name
ltx/en_us_dedes/oc.m1.d2:ocMA.OdeW7C23.mode	@ltx/en_us_dedes/miscellanea:misc.Mode1
ltx/en_us_dedes/oc.m1.d2:ocMA.OdeW7C23.ode	@ltx/en_us_dedes/miscellanea:misc.Ode7
ltx/en_us_dedes/oc.m1.d2:ocMA.OdeW7C23.text	
ltx/en_us_dedes/oc.m1.d2:ocMA.OdeW7C2T.incipit	…
ltx/en_us_dedes/oc.m1.d2:ocMA.OdeW7C2T.melody	@ltx/en_us_dedes/he.h.m1:heHE.SeNoitin.name
ltx/en_us_dedes/oc.m1.d2:ocMA.OdeW7C2T.mode	@ltx/en_us_dedes/miscellanea:misc.Mode1
ltx/en_us_dedes/oc.m1.d2:ocMA.OdeW7C2T.ode	@ltx/en_us_dedes/miscellanea:misc.Ode7
ltx/en_us_dedes/oc.m1.d2:ocMA.OdeW7C2T.text	
ltx/en_us_dedes/oc.m1.d2:ocMA.OdeW8C11.incipit	…
ltx/en_us_dedes/oc.m1.d2:ocMA.OdeW8C11.melody	@ltx/en_us_dedes/he.h.m1:heHE.EnKaminoPaides.name
ltx/en_us_dedes/oc.m1.d2:ocMA.OdeW8C11.mode	@ltx/en_us_dedes/miscellanea:misc.Mode1
ltx/en_us_dedes/oc.m1.d2:ocMA.OdeW8C11.ode	@ltx/en_us_dedes/miscellanea:misc.Ode8
ltx/en_us_dedes/oc.m1.d2:ocMA.OdeW8C11.text	
ltx/en_us_dedes/oc.m1.d2:ocMA.OdeW8C12.incipit	…
ltx/en_us_dedes/oc.m1.d2:ocMA.OdeW8C12.melody	@ltx/en_us_dedes/he.h.m1:heHE.EnKaminoPaides.name
ltx/en_us_dedes/oc.m1.d2:ocMA.OdeW8C12.mode	@ltx/en_us_dedes/miscellanea:misc.Mode1
ltx/en_us_dedes/oc.m1.d2:ocMA.OdeW8C12.ode	@ltx/en_us_dedes/miscellanea:misc.Ode8
ltx/en_us_dedes/oc.m1.d2:ocMA.OdeW8C12.text	
ltx/en_us_dedes/oc.m1.d2:ocMA.OdeW8C13.incipit	…
ltx/en_us_dedes/oc.m1.d2:ocMA.OdeW8C13.melody	@ltx/en_us_dedes/he.h.m1:heHE.EnKaminoPaides.name
ltx/en_us_dedes/oc.m1.d2:ocMA.OdeW8C13.mode	@ltx/en_us_dedes/miscellanea:misc.Mode1
ltx/en_us_dedes/oc.m1.d2:ocMA.OdeW8C13.ode	@ltx/en_us_dedes/miscellanea:misc.Ode8
ltx/en_us_dedes/oc.m1.d2:ocMA.OdeW8C13.text	
ltx/en_us_dedes/oc.m1.d2:ocMA.OdeW8C14.incipit	…
ltx/en_us_dedes/oc.m1.d2:ocMA.OdeW8C14.melody	@ltx/en_us_dedes/he.h.m1:heHE.EnKaminoPaides.name
ltx/en_us_dedes/oc.m1.d2:ocMA.OdeW8C14.mode	@ltx/en_us_dedes/miscellanea:misc.Mode1
ltx/en_us_dedes/oc.m1.d2:ocMA.OdeW8C14.ode	@ltx/en_us_dedes/miscellanea:misc.Ode8
ltx/en_us_dedes/oc.m1.d2:ocMA.OdeW8C14.text	
ltx/en_us_dedes/oc.m1.d2:ocMA.OdeW8C1H.greekmelody	@ltx/en_us_dedes/he.h.m1:heHE.EnKaminoPaides.greekname
ltx/en_us_dedes/oc.m1.d2:ocMA.OdeW8C1H.incipit	@ltx/en_us_dedes/he.h.m1:heHE.EnKaminoPaides.incipit
ltx/en_us_dedes/oc.m1.d2:ocMA.OdeW8C1H.melody	@ltx/en_us_dedes/he.h.m1:heHE.EnKaminoPaides.melody
ltx/en_us_dedes/oc.m1.d2:ocMA.OdeW8C1H.mode	@ltx/en_us_dedes/miscellanea:misc.Mode1
ltx/en_us_dedes/oc.m1.d2:ocMA.OdeW8C1H.ode	@ltx/en_us_dedes/miscellanea:misc.Ode8
ltx/en_us_dedes/oc.m1.d2:ocMA.OdeW8C1H.text	@ltx/en_us_dedes/he.h.m1:heHE.EnKaminoPaides.text
ltx/en_us_dedes/oc.m1.d2:ocMA.OdeW8C1T.incipit	…
ltx/en_us_dedes/oc.m1.d2:ocMA.OdeW8C1T.melody	@ltx/en_us_dedes/he.h.m1:heHE.EnKaminoPaides.name
ltx/en_us_dedes/oc.m1.d2:ocMA.OdeW8C1T.mode	@ltx/en_us_dedes/miscellanea:misc.Mode1
ltx/en_us_dedes/oc.m1.d2:ocMA.OdeW8C1T.ode	@ltx/en_us_dedes/miscellanea:misc.Ode8
ltx/en_us_dedes/oc.m1.d2:ocMA.OdeW8C1T.text	
ltx/en_us_dedes/oc.m1.d2:ocMA.OdeW8C21.greekmelody	@ltx/en_us_dedes/he.h.m1:heHE.EnKaminoPaides.greekname
ltx/en_us_dedes/oc.m1.d2:ocMA.OdeW8C21.incipit	…
ltx/en_us_dedes/oc.m1.d2:ocMA.OdeW8C21.melody	@ltx/en_us_dedes/he.h.m1:heHE.EnKaminoPaides.name
ltx/en_us_dedes/oc.m1.d2:ocMA.OdeW8C21.mode	@ltx/en_us_dedes/miscellanea:misc.Mode1
ltx/en_us_dedes/oc.m1.d2:ocMA.OdeW8C21.ode	@ltx/en_us_dedes/miscellanea:misc.Ode8
ltx/en_us_dedes/oc.m1.d2:ocMA.OdeW8C21.text	
ltx/en_us_dedes/oc.m1.d2:ocMA.OdeW8C22.incipit	…
ltx/en_us_dedes/oc.m1.d2:ocMA.OdeW8C22.melody	@ltx/en_us_dedes/he.h.m1:heHE.EnKaminoPaides.name
ltx/en_us_dedes/oc.m1.d2:ocMA.OdeW8C22.mode	@ltx/en_us_dedes/miscellanea:misc.Mode1
ltx/en_us_dedes/oc.m1.d2:ocMA.OdeW8C22.ode	@ltx/en_us_dedes/miscellanea:misc.Ode8
ltx/en_us_dedes/oc.m1.d2:ocMA.OdeW8C22.text	
ltx/en_us_dedes/oc.m1.d2:ocMA.OdeW8C23.incipit	…
ltx/en_us_dedes/oc.m1.d2:ocMA.OdeW8C23.melody	@ltx/en_us_dedes/he.h.m1:heHE.EnKaminoPaides.name
ltx/en_us_dedes/oc.m1.d2:ocMA.OdeW8C23.mode	@ltx/en_us_dedes/miscellanea:misc.Mode1
ltx/en_us_dedes/oc.m1.d2:ocMA.OdeW8C23.ode	@ltx/en_us_dedes/miscellanea:misc.Ode8
ltx/en_us_dedes/oc.m1.d2:ocMA.OdeW8C23.text	
ltx/en_us_dedes/oc.m1.d2:ocMA.OdeW8C2T.incipit	…
ltx/en_us_dedes/oc.m1.d2:ocMA.OdeW8C2T.melody	@ltx/en_us_dedes/he.h.m1:heHE.EnKaminoPaides.name
ltx/en_us_dedes/oc.m1.d2:ocMA.OdeW8C2T.mode	@ltx/en_us_dedes/miscellanea:misc.Mode1
ltx/en_us_dedes/oc.m1.d2:ocMA.OdeW8C2T.ode	@ltx/en_us_dedes/miscellanea:misc.Ode8
ltx/en_us_dedes/oc.m1.d2:ocMA.OdeW8C2T.text	
ltx/en_us_dedes/oc.m1.d2:ocMA.OdeW9C11.incipit	Lord have mercy, I cry…
ltx/en_us_dedes/oc.m1.d2:ocMA.OdeW9C11.melody	@ltx/en_us_dedes/he.h.m1:heHE.TyponTisAgnis.name
ltx/en_us_dedes/oc.m1.d2:ocMA.OdeW9C11.mode	@ltx/en_us_dedes/miscellanea:misc.Mode1
ltx/en_us_dedes/oc.m1.d2:ocMA.OdeW9C11.ode	@ltx/en_us_dedes/miscellanea:misc.Ode9
ltx/en_us_dedes/oc.m1.d2:ocMA.OdeW9C11.text	Lord have mercy, I cry out to You, * O Word, as once the Canaanite woman did of old. * For I have a soul which to demonic assaults is prone, * and which mindlessly does what is not allowed, * and senses no divine fear * of You, O God who are longsuffering.
ltx/en_us_dedes/oc.m1.d2:ocMA.OdeW9C12.incipit	Firmly set the footings of…
ltx/en_us_dedes/oc.m1.d2:ocMA.OdeW9C12.melody	@ltx/en_us_dedes/he.h.m1:heHE.TyponTisAgnis.name
ltx/en_us_dedes/oc.m1.d2:ocMA.OdeW9C12.mode	@ltx/en_us_dedes/miscellanea:misc.Mode1
ltx/en_us_dedes/oc.m1.d2:ocMA.OdeW9C12.ode	@ltx/en_us_dedes/miscellanea:misc.Ode9
ltx/en_us_dedes/oc.m1.d2:ocMA.OdeW9C12.text	Firmly set the footings of my soul * upon the rock, O Master, of Your divine commands. * Also overthrow the snake that shamelessly wishes to * overthrow me, O Lord; and deliver me * from his pernicious dealings, * since You are good and very merciful.
ltx/en_us_dedes/oc.m1.d2:ocMA.OdeW9C13.incipit	Through the raging waters of…
ltx/en_us_dedes/oc.m1.d2:ocMA.OdeW9C13.melody	@ltx/en_us_dedes/he.h.m1:heHE.TyponTisAgnis.name
ltx/en_us_dedes/oc.m1.d2:ocMA.OdeW9C13.mode	@ltx/en_us_dedes/miscellanea:misc.Mode1
ltx/en_us_dedes/oc.m1.d2:ocMA.OdeW9C13.ode	@ltx/en_us_dedes/miscellanea:misc.Ode9
ltx/en_us_dedes/oc.m1.d2:ocMA.OdeW9C13.text	Through the raging waters of the trials * have you already passed, holy Martyrs of the Lord, * and the surging wave of painful torments and martyrdom. * Thus you now have arrived at the anchorage * of the heavenly Kingdom * where you enjoy divine tranquility.
ltx/en_us_dedes/oc.m1.d2:ocMA.OdeW9C14.incipit	Martyrs, you have been deemed…
ltx/en_us_dedes/oc.m1.d2:ocMA.OdeW9C14.melody	@ltx/en_us_dedes/he.h.m1:heHE.TyponTisAgnis.name
ltx/en_us_dedes/oc.m1.d2:ocMA.OdeW9C14.mode	@ltx/en_us_dedes/miscellanea:misc.Mode1
ltx/en_us_dedes/oc.m1.d2:ocMA.OdeW9C14.ode	@ltx/en_us_dedes/miscellanea:misc.Ode9
ltx/en_us_dedes/oc.m1.d2:ocMA.OdeW9C14.text	Martyrs, you have been deemed worthy of * the never-waning luster, yourselves become like light. * And you are rejoicing in the Church of the first-born saints, * and with choirs of Angels you celebrate. * Do pray now all together * on our behalf unto the Giver of life.
ltx/en_us_dedes/oc.m1.d2:ocMA.OdeW9C1H.greekmelody	@ltx/en_us_dedes/he.h.m1:heHE.TyponTisAgnis.greekname
ltx/en_us_dedes/oc.m1.d2:ocMA.OdeW9C1H.incipit	@ltx/en_us_dedes/he.h.m1:heHE.TyponTisAgnis.incipit
ltx/en_us_dedes/oc.m1.d2:ocMA.OdeW9C1H.melody	@ltx/en_us_dedes/he.h.m1:heHE.TyponTisAgnis.melody
ltx/en_us_dedes/oc.m1.d2:ocMA.OdeW9C1H.mode	@ltx/en_us_dedes/miscellanea:misc.Mode1
ltx/en_us_dedes/oc.m1.d2:ocMA.OdeW9C1H.ode	@ltx/en_us_dedes/miscellanea:misc.Ode9
ltx/en_us_dedes/oc.m1.d2:ocMA.OdeW9C1H.text	@ltx/en_us_dedes/he.h.m1:heHE.TyponTisAgnis.text
ltx/en_us_dedes/oc.m1.d2:ocMA.OdeW9C1T.incipit	You carry Him who upholds…
ltx/en_us_dedes/oc.m1.d2:ocMA.OdeW9C1T.melody	@ltx/en_us_dedes/he.h.m1:heHE.TyponTisAgnis.name
ltx/en_us_dedes/oc.m1.d2:ocMA.OdeW9C1T.mode	@ltx/en_us_dedes/miscellanea:misc.Mode1
ltx/en_us_dedes/oc.m1.d2:ocMA.OdeW9C1T.ode	@ltx/en_us_dedes/miscellanea:misc.Ode9
ltx/en_us_dedes/oc.m1.d2:ocMA.OdeW9C1T.text	You carry Him who upholds all things. * With milk you nourish Him who provides the world with food. * Tremendous is your incomprehensible mystery, * as the Ark of the glorious holiness, * O Virgin Theotokos; * thereforewe magnify you faithfully.
ltx/en_us_dedes/oc.m1.d2:ocMA.OdeW9C21.greekmelody	@ltx/en_us_dedes/he.h.m1:heHE.TyponTisAgnis.greekname
ltx/en_us_dedes/oc.m1.d2:ocMA.OdeW9C21.incipit	Savior, You appointed bodiless *…
ltx/en_us_dedes/oc.m1.d2:ocMA.OdeW9C21.melody	@ltx/en_us_dedes/he.h.m1:heHE.TyponTisAgnis.name
ltx/en_us_dedes/oc.m1.d2:ocMA.OdeW9C21.mode	@ltx/en_us_dedes/miscellanea:misc.Mode1
ltx/en_us_dedes/oc.m1.d2:ocMA.OdeW9C21.ode	@ltx/en_us_dedes/miscellanea:misc.Ode9
ltx/en_us_dedes/oc.m1.d2:ocMA.OdeW9C21.text	Savior, You appointed bodiless * intelligences mystics of Your ineffable * glory. Now through them guard and protect us Your commonwealth * that with faith and with longing for refuge run * to You our only Master, * that we may magnify You endlessly.
ltx/en_us_dedes/oc.m1.d2:ocMA.OdeW9C22.incipit	As You are the cause…
ltx/en_us_dedes/oc.m1.d2:ocMA.OdeW9C22.melody	@ltx/en_us_dedes/he.h.m1:heHE.TyponTisAgnis.name
ltx/en_us_dedes/oc.m1.d2:ocMA.OdeW9C22.mode	@ltx/en_us_dedes/miscellanea:misc.Mode1
ltx/en_us_dedes/oc.m1.d2:ocMA.OdeW9C22.ode	@ltx/en_us_dedes/miscellanea:misc.Ode9
ltx/en_us_dedes/oc.m1.d2:ocMA.OdeW9C22.text	As You are the cause of peace and love, * so You assign an Angel of peace, O Lord of all, * who protects Your flock on every side as a guardian, * and who safeguards the sensible Faith from harm, * destroying by Your power * every deceptive cult and heresy.
ltx/en_us_dedes/oc.m1.d2:ocMA.OdeW9C23.incipit	You are utter sweetness unto…
ltx/en_us_dedes/oc.m1.d2:ocMA.OdeW9C23.melody	@ltx/en_us_dedes/he.h.m1:heHE.TyponTisAgnis.name
ltx/en_us_dedes/oc.m1.d2:ocMA.OdeW9C23.mode	@ltx/en_us_dedes/miscellanea:misc.Mode1
ltx/en_us_dedes/oc.m1.d2:ocMA.OdeW9C23.ode	@ltx/en_us_dedes/miscellanea:misc.Ode9
ltx/en_us_dedes/oc.m1.d2:ocMA.OdeW9C23.text	You are utter sweetness unto those * who chant Your praises. Therefore plant in Your holy Church * the sweet radiance of the celestial hierarchies, * and a state of good order bestow on her, * O Master and Redeemer, * that we may magnify You endlessly.
ltx/en_us_dedes/oc.m1.d2:ocMA.OdeW9C2T.incipit	Multitudes of Angels honor now…
ltx/en_us_dedes/oc.m1.d2:ocMA.OdeW9C2T.melody	@ltx/en_us_dedes/he.h.m1:heHE.TyponTisAgnis.name
ltx/en_us_dedes/oc.m1.d2:ocMA.OdeW9C2T.mode	@ltx/en_us_dedes/miscellanea:misc.Mode1
ltx/en_us_dedes/oc.m1.d2:ocMA.OdeW9C2T.ode	@ltx/en_us_dedes/miscellanea:misc.Ode9
ltx/en_us_dedes/oc.m1.d2:ocMA.OdeW9C2T.text	Multitudes of Angels honor now * your Offspring, O all-pure one, with never silent hymns. * For as they perceive Him overseeing their regiments, * they are filled with the joy that is properly * their own, O Theotokos; * and you they magnify unceasingly.
ltx/en_us_dedes/oc.m1.d2:ocVE.ApolTheotokionVM.incipit	Creation rejoices in you, O…
ltx/en_us_dedes/oc.m1.d2:ocVE.ApolTheotokionVM.melody	
ltx/en_us_dedes/oc.m1.d2:ocVE.ApolTheotokionVM.mode	@ltx/en_us_dedes/miscellanea:misc.Mode1
ltx/en_us_dedes/oc.m1.d2:ocVE.ApolTheotokionVM.text	Creation rejoices in you, O Lady full of grace, beholding the miracle of miracles. For you conceived without seed, and ineffably gave birth to the One whom the orders of the angels cannot see. Entreat Him earnestly on behalf of our souls.
ltx/en_us_dedes/oc.m1.d2:ocVE.AposTheotokion.greekmelody	@ltx/en_us_dedes/he.a.m1:heAU.TonOuranionTagmaton.greekname
ltx/en_us_dedes/oc.m1.d2:ocVE.AposTheotokion.incipit	@ltx/en_us_dedes/he.a.m1:heAU.TonOuranionTagmaton.incipit
ltx/en_us_dedes/oc.m1.d2:ocVE.AposTheotokion.melody	@ltx/en_us_dedes/he.a.m1:heAU.TonOuranionTagmaton.melody
ltx/en_us_dedes/oc.m1.d2:ocVE.AposTheotokion.mode	@ltx/en_us_dedes/miscellanea:misc.Mode1
ltx/en_us_dedes/oc.m1.d2:ocVE.AposTheotokion.text	@ltx/en_us_dedes/he.a.m1:heAU.TonOuranionTagmaton.text
ltx/en_us_dedes/oc.m1.d2:ocVE.Aposticha1.incipit	The sea of my transgressions…
ltx/en_us_dedes/oc.m1.d2:ocVE.Aposticha1.melody	
ltx/en_us_dedes/oc.m1.d2:ocVE.Aposticha1.mode	@ltx/en_us_dedes/miscellanea:misc.Mode1
ltx/en_us_dedes/oc.m1.d2:ocVE.Aposticha1.text	The sea of my transgressions, O Savior, is immense, and I am drowning grievously in my iniquities. Save me; give Your hand to me, O God, as to Peter, and have mercy on me.
ltx/en_us_dedes/oc.m1.d2:ocVE.Aposticha2.incipit	I am condemned, O Savior…
ltx/en_us_dedes/oc.m1.d2:ocVE.Aposticha2.melody	
ltx/en_us_dedes/oc.m1.d2:ocVE.Aposticha2.mode	@ltx/en_us_dedes/miscellanea:misc.Mode1
ltx/en_us_dedes/oc.m1.d2:ocVE.Aposticha2.text	I am condemned, O Savior, for wicked thoughts and deeds. Therefore, O God, implant in me the thought of turning back, that I may cry to You, my good Benefactor: Save me and have mercy on me.
ltx/en_us_dedes/oc.m1.d2:ocVE.Aposticha3.incipit	By the intercessions of all…
ltx/en_us_dedes/oc.m1.d2:ocVE.Aposticha3.melody	
ltx/en_us_dedes/oc.m1.d2:ocVE.Aposticha3.mode	@ltx/en_us_dedes/miscellanea:misc.Mode1
ltx/en_us_dedes/oc.m1.d2:ocVE.Aposticha3.text	By the intercessions of all Your Saints and the Theotokos, grant us Your peace and have mercy on us, O only compassionate Lord.
ltx/en_us_dedes/oc.m1.d2:ocVE.SticTheotokion.greekmelody	@ltx/en_us_dedes/he.a.m1:heAU.PaneffimoiMartyres.greekname
ltx/en_us_dedes/oc.m1.d2:ocVE.SticTheotokion.incipit	…
ltx/en_us_dedes/oc.m1.d2:ocVE.SticTheotokion.melody	@ltx/en_us_dedes/he.a.m1:heAU.PaneffimoiMartyres.name
ltx/en_us_dedes/oc.m1.d2:ocVE.SticTheotokion.mode	@ltx/en_us_dedes/miscellanea:misc.Mode1
ltx/en_us_dedes/oc.m1.d2:ocVE.SticTheotokion.text	
ltx/en_us_dedes/oc.m1.d2:ocVE.Stichera1.greekmelody	@ltx/en_us_dedes/he.a.m1:heAU.PaneffimoiMartyres.greekname
ltx/en_us_dedes/oc.m1.d2:ocVE.Stichera1.incipit	O Lord, in Your goodness…
ltx/en_us_dedes/oc.m1.d2:ocVE.Stichera1.melody	@ltx/en_us_dedes/he.a.m1:heAU.PaneffimoiMartyres.name
ltx/en_us_dedes/oc.m1.d2:ocVE.Stichera1.mode	@ltx/en_us_dedes/miscellanea:misc.Mode1
ltx/en_us_dedes/oc.m1.d2:ocVE.Stichera1.text	O Lord, in Your goodness by Your Word * and Your Spirit You brought forth all things, and then You created me the living being whom * You endowed with reason * so that I should glorify * Your holy name, O Master all-powerful. And yet instead, alas! * I dishonor You continually * with my foul deeds. * O spare me, I supplicate.
ltx/en_us_dedes/oc.m1.d2:ocVE.Stichera2.incipit	Come to know, O miserable…
ltx/en_us_dedes/oc.m1.d2:ocVE.Stichera2.melody	@ltx/en_us_dedes/he.a.m1:heAU.PaneffimoiMartyres.name
ltx/en_us_dedes/oc.m1.d2:ocVE.Stichera2.mode	@ltx/en_us_dedes/miscellanea:misc.Mode1
ltx/en_us_dedes/oc.m1.d2:ocVE.Stichera2.text	Come to know, O miserable soul, * your divine nobility and incorruptible fatherland, and hasten constantly, * through good deeds and virtues, * to possess it once again. * Become attached to nothing corruptible. Your lot is there on high, * but your body, being earth, decays. * Let the worse not * prevail over the better part.
ltx/en_us_dedes/oc.m1.d2:ocVE.Stichera3.incipit	…
ltx/en_us_dedes/oc.m1.d2:ocVE.Stichera3.melody	@ltx/en_us_dedes/he.a.m1:heAU.PaneffimoiMartyres.name
ltx/en_us_dedes/oc.m1.d2:ocVE.Stichera3.mode	@ltx/en_us_dedes/miscellanea:misc.Mode1
ltx/en_us_dedes/oc.m1.d2:ocVE.Stichera3.text	
ltx/en_us_dedes/oc.m1.d2:ocVE.Stichera4.greekmelody	@ltx/en_us_dedes/he.a.m1:heAU.PaneffimoiMartyres.greekname
ltx/en_us_dedes/oc.m1.d2:ocVE.Stichera4.incipit	O bodiless Messengers of God…
ltx/en_us_dedes/oc.m1.d2:ocVE.Stichera4.melody	@ltx/en_us_dedes/he.a.m1:heAU.PaneffimoiMartyres.name
ltx/en_us_dedes/oc.m1.d2:ocVE.Stichera4.mode	@ltx/en_us_dedes/miscellanea:misc.Mode1
ltx/en_us_dedes/oc.m1.d2:ocVE.Stichera4.text	O bodiless Messengers of God, * you stand near His throne on high, * from there receiving the flashes of divine and brilliant light, * eternally glowing * with with the uncreated light, * and thus you have become secondary lights. * Please intercede with Christ * and beseech Him that He grant our souls * His surpassing * peace and His great mercy.
ltx/en_us_dedes/oc.m1.d2:ocVE.Stichera5.incipit	O Angels, immortal as you…
ltx/en_us_dedes/oc.m1.d2:ocVE.Stichera5.melody	@ltx/en_us_dedes/he.a.m1:heAU.PaneffimoiMartyres.name
ltx/en_us_dedes/oc.m1.d2:ocVE.Stichera5.mode	@ltx/en_us_dedes/miscellanea:misc.Mode1
ltx/en_us_dedes/oc.m1.d2:ocVE.Stichera5.text	O Angels, immortal as you are, * having now indeed received * the life of glory eternal that is indestructible * from God who is first life, * you are seers who behold * the Wisdom that abides to eternity; * and being filled with light * you are properly described to be * blazing torches, * united with hosts on high.
ltx/en_us_dedes/oc.m1.d2:ocVE.Stichera6.incipit	O Angels, Archangels and the…
ltx/en_us_dedes/oc.m1.d2:ocVE.Stichera6.melody	@ltx/en_us_dedes/he.a.m1:heAU.PaneffimoiMartyres.name
ltx/en_us_dedes/oc.m1.d2:ocVE.Stichera6.mode	@ltx/en_us_dedes/miscellanea:misc.Mode1
ltx/en_us_dedes/oc.m1.d2:ocVE.Stichera6.text	O Angels, Archangels and the Thrones, * Powers and Authorities, and you, O six-winged Seraphim, and many-eyed divine * instruments of wisdom * Cherubim, and most divine Dominions, and sublime Principalities: Please intercede with Christ * and beseech Him that He grant our souls * His surpassing * peace and His great mercy.
ltx/en_us_dedes/oc.m1.d2:octrMA.Kathisma11.incipit	@ltx/en_us_dedes/oc.m1.d2:ocMA.Kathisma11.incipit
ltx/en_us_dedes/oc.m1.d2:octrMA.Kathisma11.melody	
ltx/en_us_dedes/oc.m1.d2:octrMA.Kathisma11.mode	@ltx/en_us_dedes/miscellanea:misc.Mode1
ltx/en_us_dedes/oc.m1.d2:octrMA.Kathisma11.text	@ltx/en_us_dedes/oc.m1.d2:ocMA.Kathisma11.text
ltx/en_us_dedes/oc.m1.d2:octrMA.Kathisma12.incipit	@ltx/en_us_dedes/oc.m1.d2:ocMA.Kathisma12.incipit
ltx/en_us_dedes/oc.m1.d2:octrMA.Kathisma12.melody	
ltx/en_us_dedes/oc.m1.d2:octrMA.Kathisma12.mode	@ltx/en_us_dedes/miscellanea:misc.Mode1
ltx/en_us_dedes/oc.m1.d2:octrMA.Kathisma12.text	@ltx/en_us_dedes/oc.m1.d2:ocMA.Kathisma12.text
ltx/en_us_dedes/oc.m1.d2:octrMA.Kathisma1T.incipit	@ltx/en_us_dedes/oc.m1.d7:ocMA.Kathisma24.incipit
ltx/en_us_dedes/oc.m1.d2:octrMA.Kathisma1T.melody	
ltx/en_us_dedes/oc.m1.d2:octrMA.Kathisma1T.mode	@ltx/en_us_dedes/miscellanea:misc.Mode1
ltx/en_us_dedes/oc.m1.d2:octrMA.Kathisma1T.text	@ltx/en_us_dedes/oc.m1.d7:ocMA.Kathisma24.text
ltx/en_us_dedes/oc.m1.d2:octrMA.Ode7Martyricon.incipit	@ltx/en_us_dedes/oc.m1.d2:ocMA.Kathisma32.incipit
ltx/en_us_dedes/oc.m1.d2:octrMA.Ode7Martyricon.melody	
ltx/en_us_dedes/oc.m1.d2:octrMA.Ode7Martyricon.mode	@ltx/en_us_dedes/miscellanea:misc.Mode1
ltx/en_us_dedes/oc.m1.d2:octrMA.Ode7Martyricon.text	@ltx/en_us_dedes/oc.m1.d2:ocMA.Kathisma32.text
ltx/en_us_dedes/oc.m1.d2:octrMA.Photagogic.incipit	O Christ, who make the…
ltx/en_us_dedes/oc.m1.d2:octrMA.Photagogic.mode	@ltx/en_us_dedes/miscellanea:misc.Mode1
ltx/en_us_dedes/oc.m1.d2:octrMA.Photagogic.text	O Christ, who make the light to rise, purify my soul of every sin,
ltx/en_us_dedes/oc.m1.d2:octrMA.Triadic1.incipit	As we are led up…
ltx/en_us_dedes/oc.m1.d2:octrMA.Triadic1.mode	@ltx/en_us_dedes/miscellanea:misc.Mode1
ltx/en_us_dedes/oc.m1.d2:octrMA.Triadic1.text	As we are led up to a noetic and immaterial perception of the bodiless hosts, by means of physical depictions, and as we wait for the illumination, that comes from the Godhead in three Hypostases, let us imitate the cherubim, and sing aloud the Thrice-Holy Hymn to the only God: Holy, holy, holy are You, our God.
ltx/en_us_dedes/oc.m1.d2:octrMA.Triadic2.incipit	Let us join…
ltx/en_us_dedes/oc.m1.d2:octrMA.Triadic2.mode	@ltx/en_us_dedes/miscellanea:misc.Mode1
ltx/en_us_dedes/oc.m1.d2:octrMA.Triadic2.text	Let us join all the heavenly hosts, and send up our Thrice-holy praise, and like the cherubim shout to Him who is in the highest: Holy, holy, holy are You, our God.
ltx/en_us_dedes/oc.m1.d2:octrMA.Triadic3.incipit	Having risen from sleep…
ltx/en_us_dedes/oc.m1.d2:octrMA.Triadic3.mode	@ltx/en_us_dedes/miscellanea:misc.Mode1
ltx/en_us_dedes/oc.m1.d2:octrMA.Triadic3.text	Having risen from sleep, we fall before You, O good One, and to You we sing the Angels’ hymn, O almighty One: Holy, holy, holy are You, our God.
ltx/en_us_dedes/oc.m1.d2:octrVE.Stichera1.incipit	@ltx/en_us_dedes/oc.m1.d2:ocVE.Aposticha1.incipit
ltx/en_us_dedes/oc.m1.d2:octrVE.Stichera1.melody	
ltx/en_us_dedes/oc.m1.d2:octrVE.Stichera1.mode	@ltx/en_us_dedes/miscellanea:misc.Mode1
ltx/en_us_dedes/oc.m1.d2:octrVE.Stichera1.text	@ltx/en_us_dedes/oc.m1.d2:ocVE.Aposticha1.text
ltx/en_us_dedes/oc.m1.d2:octrVE.Stichera2.incipit	@ltx/en_us_dedes/oc.m1.d2:ocVE.Aposticha2.incipit
ltx/en_us_dedes/oc.m1.d2:octrVE.Stichera2.melody	
ltx/en_us_dedes/oc.m1.d2:octrVE.Stichera2.mode	@ltx/en_us_dedes/miscellanea:misc.Mode1
ltx/en_us_dedes/oc.m1.d2:octrVE.Stichera2.text	@ltx/en_us_dedes/oc.m1.d2:ocVE.Aposticha2.text
ltx/en_us_dedes/oc.m1.d2:octrVE.Stichera3.incipit	@ltx/en_us_dedes/oc.m1.d2:ocMA.Aposticha1.incipit
ltx/en_us_dedes/oc.m1.d2:octrVE.Stichera3.melody	
ltx/en_us_dedes/oc.m1.d2:octrVE.Stichera3.mode	@ltx/en_us_dedes/miscellanea:misc.Mode1
ltx/en_us_dedes/oc.m1.d2:octrVE.Stichera3.text	@ltx/en_us_dedes/oc.m1.d2:ocMA.Aposticha1.text
ltx/en_us_dedes/oc.m1.d2:octrVE.Stichera4.incipit	@ltx/en_us_dedes/oc.m1.d2:ocMA.Aposticha2.incipit
ltx/en_us_dedes/oc.m1.d2:octrVE.Stichera4.melody	
ltx/en_us_dedes/oc.m1.d2:octrVE.Stichera4.mode	@ltx/en_us_dedes/miscellanea:misc.Mode1
ltx/en_us_dedes/oc.m1.d2:octrVE.Stichera4.text	@ltx/en_us_dedes/oc.m1.d2:ocMA.Aposticha2.text
