ltx/en_us_dedes/ty.m01.d09:tyCommemoration.text	
ltx/en_us_dedes/ty.m01.d09:tyDate.text	
ltx/en_us_dedes/ty.m01.d09:tyLI.AfterCommunion.text	
ltx/en_us_dedes/ty.m01.d09:tyLI.AmboPrayer.text	
ltx/en_us_dedes/ty.m01.d09:tyLI.Antiphons.text	
ltx/en_us_dedes/ty.m01.d09:tyLI.Apolytikia.text	
ltx/en_us_dedes/ty.m01.d09:tyLI.CommunionHymn.text	
ltx/en_us_dedes/ty.m01.d09:tyLI.Dismissal.text	
ltx/en_us_dedes/ty.m01.d09:tyLI.EntranceHymn.text	
ltx/en_us_dedes/ty.m01.d09:tyLI.Epistle.text	
ltx/en_us_dedes/ty.m01.d09:tyLI.Gospel.text	
ltx/en_us_dedes/ty.m01.d09:tyLI.Kontakion.text	
ltx/en_us_dedes/ty.m01.d09:tyLI.Megalynarion.text	
ltx/en_us_dedes/ty.m01.d09:tyLI.TheotokosHymn.text	
ltx/en_us_dedes/ty.m01.d09:tyMA.Anavathmoi.text	
ltx/en_us_dedes/ty.m01.d09:tyMA.Apolytikia.text	
ltx/en_us_dedes/ty.m01.d09:tyMA.Canons.text	
ltx/en_us_dedes/ty.m01.d09:tyMA.Doxology.text	
ltx/en_us_dedes/ty.m01.d09:tyMA.EndApolytikion.text	
ltx/en_us_dedes/ty.m01.d09:tyMA.Exaposteilaria.text	
ltx/en_us_dedes/ty.m01.d09:tyMA.Katavasias.text	
ltx/en_us_dedes/ty.m01.d09:tyMA.Kathismata.text	
ltx/en_us_dedes/ty.m01.d09:tyMA.KontakionOikos.text	
ltx/en_us_dedes/ty.m01.d09:tyMA.Lauds.text	
ltx/en_us_dedes/ty.m01.d09:tyMA.LaudsBoth.text	
ltx/en_us_dedes/ty.m01.d09:tyMA.LaudsGlory.text	
ltx/en_us_dedes/ty.m01.d09:tyMA.LaudsVerses.text	
ltx/en_us_dedes/ty.m01.d09:tyMA.Magnificat.text	
ltx/en_us_dedes/ty.m01.d09:tyMA.MatinsGospel.text	
ltx/en_us_dedes/ty.m01.d09:tyMA.MidodeKath.text	
ltx/en_us_dedes/ty.m01.d09:tyMA.MidodeKontakion.text	
ltx/en_us_dedes/ty.m01.d09:tyMA.Ode9_1.text	
ltx/en_us_dedes/ty.m01.d09:tyMA.Ode9_2.text	
ltx/en_us_dedes/ty.m01.d09:tyMA.Ode9_3.text	
ltx/en_us_dedes/ty.m01.d09:tyMA.Ode9_4.text	
ltx/en_us_dedes/ty.m01.d09:tyMA.Ode9_5.text	
ltx/en_us_dedes/ty.m01.d09:tyMA.Ode9_6.text	
ltx/en_us_dedes/ty.m01.d09:tyMA.Ode9_7.text	
ltx/en_us_dedes/ty.m01.d09:tyMA.Ode9_8.text	
ltx/en_us_dedes/ty.m01.d09:tyMA.Ode9_Katavasia1.text	
ltx/en_us_dedes/ty.m01.d09:tyMA.Ode9_Katavasia2.text	
ltx/en_us_dedes/ty.m01.d09:tyMA.ProkVerse.text	
ltx/en_us_dedes/ty.m01.d09:tyMA.Prokeimenon.text	
ltx/en_us_dedes/ty.m01.d09:tyMA.Psalm50.text	
ltx/en_us_dedes/ty.m01.d09:tyMA.Synaxarion.text	
ltx/en_us_dedes/ty.m01.d09:tyMO.Rubric1.text	
ltx/en_us_dedes/ty.m01.d09:tyNote1.text	
ltx/en_us_dedes/ty.m01.d09:tyVE.Apolytikia.text	
ltx/en_us_dedes/ty.m01.d09:tyVE.AposBoth.text	
ltx/en_us_dedes/ty.m01.d09:tyVE.AposGlory.text	
ltx/en_us_dedes/ty.m01.d09:tyVE.AposGloryBoth.text	
ltx/en_us_dedes/ty.m01.d09:tyVE.Aposticha.text	
ltx/en_us_dedes/ty.m01.d09:tyVE.Dismissal.text	
ltx/en_us_dedes/ty.m01.d09:tyVE.Entrance.text	
ltx/en_us_dedes/ty.m01.d09:tyVE.Intro.text	
ltx/en_us_dedes/ty.m01.d09:tyVE.LIHC.text	
ltx/en_us_dedes/ty.m01.d09:tyVE.Note1.text	
ltx/en_us_dedes/ty.m01.d09:tyVE.Note2.text	
ltx/en_us_dedes/ty.m01.d09:tyVE.SticBoth.text	
ltx/en_us_dedes/ty.m01.d09:tyVE.SticGlory.text	
ltx/en_us_dedes/ty.m01.d09:tyVE.SticGloryBoth.text	
ltx/en_us_dedes/ty.m01.d09:tyVE.Stichera.text	
