ltx/en_us_carroll/he.h.m6:heHE.AfrastonThavma.greekname	
ltx/en_us_carroll/he.h.m6:heHE.AfrastonThavma.incipit	Ineffable wonder!…
ltx/en_us_carroll/he.h.m6:heHE.AfrastonThavma.melody	@ltx/en_us_carroll/miscellanea:misc.Heirmos
ltx/en_us_carroll/he.h.m6:heHE.AfrastonThavma.mode	@ltx/en_us_carroll/miscellanea:misc.Mode6
ltx/en_us_carroll/he.h.m6:heHE.AfrastonThavma.name	N/M (Ineffable wonder!)
ltx/en_us_carroll/he.h.m6:heHE.AfrastonThavma.notmetered	N/M (Ineffable wonder!)
ltx/en_us_carroll/he.h.m6:heHE.AfrastonThavma.ode	@ltx/en_us_carroll/miscellanea:misc.Ode7
ltx/en_us_carroll/he.h.m6:heHE.AfrastonThavma.text	
ltx/en_us_carroll/he.h.m6:heHE.AfrastonThavmaEpiphany.greekname	
ltx/en_us_carroll/he.h.m6:heHE.AfrastonThavmaEpiphany.incipit	…
ltx/en_us_carroll/he.h.m6:heHE.AfrastonThavmaEpiphany.melody	@ltx/en_us_carroll/miscellanea:misc.Heirmos
ltx/en_us_carroll/he.h.m6:heHE.AfrastonThavmaEpiphany.mode	@ltx/en_us_carroll/miscellanea:misc.Mode6
ltx/en_us_carroll/he.h.m6:heHE.AfrastonThavmaEpiphany.name	
ltx/en_us_carroll/he.h.m6:heHE.AfrastonThavmaEpiphany.notmetered	N/M ()
ltx/en_us_carroll/he.h.m6:heHE.AfrastonThavmaEpiphany.ode	@ltx/en_us_carroll/miscellanea:misc.Ode7
ltx/en_us_carroll/he.h.m6:heHE.AfrastonThavmaEpiphany.text	
ltx/en_us_carroll/he.h.m6:heHE.AfrastonThavma_Epiphany.greekname	@ltx/en_us_carroll/properties:deprecated.key
ltx/en_us_carroll/he.h.m6:heHE.AfrastonThavma_Epiphany.incipit	@ltx/en_us_carroll/properties:deprecated.key
ltx/en_us_carroll/he.h.m6:heHE.AfrastonThavma_Epiphany.melody	@ltx/en_us_carroll/properties:deprecated.key
ltx/en_us_carroll/he.h.m6:heHE.AfrastonThavma_Epiphany.mode	@ltx/en_us_carroll/properties:deprecated.key
ltx/en_us_carroll/he.h.m6:heHE.AfrastonThavma_Epiphany.name	@ltx/en_us_carroll/properties:deprecated.key
ltx/en_us_carroll/he.h.m6:heHE.AfrastonThavma_Epiphany.ode	@ltx/en_us_carroll/properties:deprecated.key
ltx/en_us_carroll/he.h.m6:heHE.AfrastonThavma_Epiphany.text	@ltx/en_us_carroll/properties:deprecated.key
ltx/en_us_carroll/he.h.m6:heHE.AkikoaKyrieTinAkoin.greekname	
ltx/en_us_carroll/he.h.m6:heHE.AkikoaKyrieTinAkoin.incipit	…
ltx/en_us_carroll/he.h.m6:heHE.AkikoaKyrieTinAkoin.melody	@ltx/en_us_carroll/miscellanea:misc.Heirmos
ltx/en_us_carroll/he.h.m6:heHE.AkikoaKyrieTinAkoin.mode	@ltx/en_us_carroll/miscellanea:misc.Mode6
ltx/en_us_carroll/he.h.m6:heHE.AkikoaKyrieTinAkoin.name	
ltx/en_us_carroll/he.h.m6:heHE.AkikoaKyrieTinAkoin.notmetered	N/M ()
ltx/en_us_carroll/he.h.m6:heHE.AkikoaKyrieTinAkoin.ode	@ltx/en_us_carroll/miscellanea:misc.Ode4
ltx/en_us_carroll/he.h.m6:heHE.AkikoaKyrieTinAkoin.text	
ltx/en_us_carroll/he.h.m6:heHE.AkikoenOProfitis.greekname	
ltx/en_us_carroll/he.h.m6:heHE.AkikoenOProfitis.incipit	On hearing about Your advent…
ltx/en_us_carroll/he.h.m6:heHE.AkikoenOProfitis.melody	@ltx/en_us_carroll/miscellanea:misc.Heirmos
ltx/en_us_carroll/he.h.m6:heHE.AkikoenOProfitis.mode	@ltx/en_us_carroll/miscellanea:misc.Mode6
ltx/en_us_carroll/he.h.m6:heHE.AkikoenOProfitis.name	On hearing about Your advent.
ltx/en_us_carroll/he.h.m6:heHE.AkikoenOProfitis.notmetered	N/M (On hearing about Your advent.)
ltx/en_us_carroll/he.h.m6:heHE.AkikoenOProfitis.ode	@ltx/en_us_carroll/miscellanea:misc.Ode4
ltx/en_us_carroll/he.h.m6:heHE.AkikoenOProfitis.text	
ltx/en_us_carroll/he.h.m6:heHE.AporeiPasaGlossa.greekname	
ltx/en_us_carroll/he.h.m6:heHE.AporeiPasaGlossa.incipit	Every tongue…
ltx/en_us_carroll/he.h.m6:heHE.AporeiPasaGlossa.melody	@ltx/en_us_carroll/miscellanea:misc.Heirmos
ltx/en_us_carroll/he.h.m6:heHE.AporeiPasaGlossa.mode	@ltx/en_us_carroll/miscellanea:misc.Mode6
ltx/en_us_carroll/he.h.m6:heHE.AporeiPasaGlossa.name	Every tongue.
ltx/en_us_carroll/he.h.m6:heHE.AporeiPasaGlossa.notmetered	N/M (Every tongue.)
ltx/en_us_carroll/he.h.m6:heHE.AporeiPasaGlossa.ode	@ltx/en_us_carroll/miscellanea:misc.Ode9
ltx/en_us_carroll/he.h.m6:heHE.AporeiPasaGlossa.text	
ltx/en_us_carroll/he.h.m6:heHE.AsporouSyllipseos.greekname	
ltx/en_us_carroll/he.h.m6:heHE.AsporouSyllipseos.incipit	The birth is ineffable…
ltx/en_us_carroll/he.h.m6:heHE.AsporouSyllipseos.melody	@ltx/en_us_carroll/miscellanea:misc.Heirmos
ltx/en_us_carroll/he.h.m6:heHE.AsporouSyllipseos.mode	@ltx/en_us_carroll/miscellanea:misc.Mode6
ltx/en_us_carroll/he.h.m6:heHE.AsporouSyllipseos.name	The birth is ineffable.
ltx/en_us_carroll/he.h.m6:heHE.AsporouSyllipseos.notmetered	N/M (The birth is ineffable.)
ltx/en_us_carroll/he.h.m6:heHE.AsporouSyllipseos.ode	@ltx/en_us_carroll/miscellanea:misc.Ode9
ltx/en_us_carroll/he.h.m6:heHE.AsporouSyllipseos.text	
ltx/en_us_carroll/he.h.m6:heHE.AvyssosEschati.greekname	
ltx/en_us_carroll/he.h.m6:heHE.AvyssosEschati.incipit	The lowest depth…
ltx/en_us_carroll/he.h.m6:heHE.AvyssosEschati.melody	@ltx/en_us_carroll/miscellanea:misc.Heirmos
ltx/en_us_carroll/he.h.m6:heHE.AvyssosEschati.mode	@ltx/en_us_carroll/miscellanea:misc.Mode6
ltx/en_us_carroll/he.h.m6:heHE.AvyssosEschati.name	The lowest depth.
ltx/en_us_carroll/he.h.m6:heHE.AvyssosEschati.notmetered	N/M (The lowest depth.)
ltx/en_us_carroll/he.h.m6:heHE.AvyssosEschati.ode	@ltx/en_us_carroll/miscellanea:misc.Ode6
ltx/en_us_carroll/he.h.m6:heHE.AvyssosEschati.text	
ltx/en_us_carroll/he.h.m6:heHE.ChristosMouDynamis.greekname	
ltx/en_us_carroll/he.h.m6:heHE.ChristosMouDynamis.incipit	The holy Church of God…
ltx/en_us_carroll/he.h.m6:heHE.ChristosMouDynamis.melody	@ltx/en_us_carroll/miscellanea:misc.Heirmos
ltx/en_us_carroll/he.h.m6:heHE.ChristosMouDynamis.mode	@ltx/en_us_carroll/miscellanea:misc.Mode6
ltx/en_us_carroll/he.h.m6:heHE.ChristosMouDynamis.name	The holy Church of God.
ltx/en_us_carroll/he.h.m6:heHE.ChristosMouDynamis.notmetered	N/M (The holy Church of God.)
ltx/en_us_carroll/he.h.m6:heHE.ChristosMouDynamis.ode	@ltx/en_us_carroll/miscellanea:misc.Ode4
ltx/en_us_carroll/he.h.m6:heHE.ChristosMouDynamis.text	
ltx/en_us_carroll/he.h.m6:heHE.DrosovolonMenTinKaminon.greekname	
ltx/en_us_carroll/he.h.m6:heHE.DrosovolonMenTinKaminon.incipit	In the furnace the Lord’s Angel…
ltx/en_us_carroll/he.h.m6:heHE.DrosovolonMenTinKaminon.melody	@ltx/en_us_carroll/miscellanea:misc.Heirmos
ltx/en_us_carroll/he.h.m6:heHE.DrosovolonMenTinKaminon.mode	@ltx/en_us_carroll/miscellanea:misc.Mode6
ltx/en_us_carroll/he.h.m6:heHE.DrosovolonMenTinKaminon.name	In the furnace the Lord’s Angel.
ltx/en_us_carroll/he.h.m6:heHE.DrosovolonMenTinKaminon.notmetered	N/M (In the furnace the Lord’s Angel.)
ltx/en_us_carroll/he.h.m6:heHE.DrosovolonMenTinKaminon.ode	@ltx/en_us_carroll/miscellanea:misc.Ode7
ltx/en_us_carroll/he.h.m6:heHE.DrosovolonMenTinKaminon.text	
ltx/en_us_carroll/he.h.m6:heHE.EkFlogosToisOsiois.greekname	
ltx/en_us_carroll/he.h.m6:heHE.EkFlogosToisOsiois.incipit	From the flame…
ltx/en_us_carroll/he.h.m6:heHE.EkFlogosToisOsiois.melody	@ltx/en_us_carroll/miscellanea:misc.Heirmos
ltx/en_us_carroll/he.h.m6:heHE.EkFlogosToisOsiois.mode	@ltx/en_us_carroll/miscellanea:misc.Mode6
ltx/en_us_carroll/he.h.m6:heHE.EkFlogosToisOsiois.name	From the flame.
ltx/en_us_carroll/he.h.m6:heHE.EkFlogosToisOsiois.notmetered	N/M (From the flame.)
ltx/en_us_carroll/he.h.m6:heHE.EkFlogosToisOsiois.ode	@ltx/en_us_carroll/miscellanea:misc.Ode8
ltx/en_us_carroll/he.h.m6:heHE.EkFlogosToisOsiois.text	
ltx/en_us_carroll/he.h.m6:heHE.EkNyktosOrthrizonta.greekname	
ltx/en_us_carroll/he.h.m6:heHE.EkNyktosOrthrizonta.incipit	Early in the morning…
ltx/en_us_carroll/he.h.m6:heHE.EkNyktosOrthrizonta.melody	@ltx/en_us_carroll/miscellanea:misc.Heirmos
ltx/en_us_carroll/he.h.m6:heHE.EkNyktosOrthrizonta.mode	@ltx/en_us_carroll/miscellanea:misc.Mode6
ltx/en_us_carroll/he.h.m6:heHE.EkNyktosOrthrizonta.name	Early in the morning.
ltx/en_us_carroll/he.h.m6:heHE.EkNyktosOrthrizonta.notmetered	N/M (Early in the morning.)
ltx/en_us_carroll/he.h.m6:heHE.EkNyktosOrthrizonta.ode	@ltx/en_us_carroll/miscellanea:misc.Ode5
ltx/en_us_carroll/he.h.m6:heHE.EkNyktosOrthrizonta.text	
ltx/en_us_carroll/he.h.m6:heHE.EkalypsenOuranous.greekname	
ltx/en_us_carroll/he.h.m6:heHE.EkalypsenOuranous.incipit	…
ltx/en_us_carroll/he.h.m6:heHE.EkalypsenOuranous.melody	@ltx/en_us_carroll/miscellanea:misc.Heirmos
ltx/en_us_carroll/he.h.m6:heHE.EkalypsenOuranous.mode	@ltx/en_us_carroll/miscellanea:misc.Mode6
ltx/en_us_carroll/he.h.m6:heHE.EkalypsenOuranous.name	
ltx/en_us_carroll/he.h.m6:heHE.EkalypsenOuranous.notmetered	N/M ()
ltx/en_us_carroll/he.h.m6:heHE.EkalypsenOuranous.ode	@ltx/en_us_carroll/miscellanea:misc.Ode4
ltx/en_us_carroll/he.h.m6:heHE.EkalypsenOuranous.text	
ltx/en_us_carroll/he.h.m6:heHE.EkstithiFrittonOurane.greekname	
ltx/en_us_carroll/he.h.m6:heHE.EkstithiFrittonOurane.incipit	Heaven, be astonished…
ltx/en_us_carroll/he.h.m6:heHE.EkstithiFrittonOurane.melody	@ltx/en_us_carroll/miscellanea:misc.Heirmos
ltx/en_us_carroll/he.h.m6:heHE.EkstithiFrittonOurane.mode	@ltx/en_us_carroll/miscellanea:misc.Mode6
ltx/en_us_carroll/he.h.m6:heHE.EkstithiFrittonOurane.name	Heaven, be astonished.
ltx/en_us_carroll/he.h.m6:heHE.EkstithiFrittonOurane.notmetered	N/M (Heaven, be astonished.)
ltx/en_us_carroll/he.h.m6:heHE.EkstithiFrittonOurane.ode	@ltx/en_us_carroll/miscellanea:misc.Ode8
ltx/en_us_carroll/he.h.m6:heHE.EkstithiFrittonOurane.text	
ltx/en_us_carroll/he.h.m6:heHE.EkstithiFrittonOuraneEpiphany.greekname	
ltx/en_us_carroll/he.h.m6:heHE.EkstithiFrittonOuraneEpiphany.incipit	…
ltx/en_us_carroll/he.h.m6:heHE.EkstithiFrittonOuraneEpiphany.melody	@ltx/en_us_carroll/miscellanea:misc.Heirmos
ltx/en_us_carroll/he.h.m6:heHE.EkstithiFrittonOuraneEpiphany.mode	@ltx/en_us_carroll/miscellanea:misc.Mode6
ltx/en_us_carroll/he.h.m6:heHE.EkstithiFrittonOuraneEpiphany.name	
ltx/en_us_carroll/he.h.m6:heHE.EkstithiFrittonOuraneEpiphany.notmetered	N/M ()
ltx/en_us_carroll/he.h.m6:heHE.EkstithiFrittonOuraneEpiphany.ode	@ltx/en_us_carroll/miscellanea:misc.Ode8
ltx/en_us_carroll/he.h.m6:heHE.EkstithiFrittonOuraneEpiphany.text	
ltx/en_us_carroll/he.h.m6:heHE.EkstithiFrittonOurane_Epiphany.greekname	@ltx/en_us_carroll/properties:deprecated.key
ltx/en_us_carroll/he.h.m6:heHE.EkstithiFrittonOurane_Epiphany.incipit	@ltx/en_us_carroll/properties:deprecated.key
ltx/en_us_carroll/he.h.m6:heHE.EkstithiFrittonOurane_Epiphany.melody	@ltx/en_us_carroll/properties:deprecated.key
ltx/en_us_carroll/he.h.m6:heHE.EkstithiFrittonOurane_Epiphany.mode	@ltx/en_us_carroll/properties:deprecated.key
ltx/en_us_carroll/he.h.m6:heHE.EkstithiFrittonOurane_Epiphany.name	@ltx/en_us_carroll/properties:deprecated.key
ltx/en_us_carroll/he.h.m6:heHE.EkstithiFrittonOurane_Epiphany.ode	@ltx/en_us_carroll/properties:deprecated.key
ltx/en_us_carroll/he.h.m6:heHE.EkstithiFrittonOurane_Epiphany.text	@ltx/en_us_carroll/properties:deprecated.key
ltx/en_us_carroll/he.h.m6:heHE.EnTiSterraTisPisteos.greekname	
ltx/en_us_carroll/he.h.m6:heHE.EnTiSterraTisPisteos.incipit	…
ltx/en_us_carroll/he.h.m6:heHE.EnTiSterraTisPisteos.melody	@ltx/en_us_carroll/miscellanea:misc.Heirmos
ltx/en_us_carroll/he.h.m6:heHE.EnTiSterraTisPisteos.mode	@ltx/en_us_carroll/miscellanea:misc.Mode6
ltx/en_us_carroll/he.h.m6:heHE.EnTiSterraTisPisteos.name	
ltx/en_us_carroll/he.h.m6:heHE.EnTiSterraTisPisteos.notmetered	N/M ()
ltx/en_us_carroll/he.h.m6:heHE.EnTiSterraTisPisteos.ode	@ltx/en_us_carroll/miscellanea:misc.Ode3
ltx/en_us_carroll/he.h.m6:heHE.EnTiSterraTisPisteos.text	
ltx/en_us_carroll/he.h.m6:heHE.EpiTinAsaleftonChriste.greekname	
ltx/en_us_carroll/he.h.m6:heHE.EpiTinAsaleftonChriste.incipit	…
ltx/en_us_carroll/he.h.m6:heHE.EpiTinAsaleftonChriste.melody	@ltx/en_us_carroll/miscellanea:misc.Heirmos
ltx/en_us_carroll/he.h.m6:heHE.EpiTinAsaleftonChriste.mode	@ltx/en_us_carroll/miscellanea:misc.Mode6
ltx/en_us_carroll/he.h.m6:heHE.EpiTinAsaleftonChriste.name	
ltx/en_us_carroll/he.h.m6:heHE.EpiTinAsaleftonChriste.notmetered	N/M ()
ltx/en_us_carroll/he.h.m6:heHE.EpiTinAsaleftonChriste.ode	@ltx/en_us_carroll/miscellanea:misc.Ode3
ltx/en_us_carroll/he.h.m6:heHE.EpiTinAsaleftonChriste.text	
ltx/en_us_carroll/he.h.m6:heHE.EvoisaEnOliKardiaMou.greekname	
ltx/en_us_carroll/he.h.m6:heHE.EvoisaEnOliKardiaMou.incipit	I cried aloud and shouted…
ltx/en_us_carroll/he.h.m6:heHE.EvoisaEnOliKardiaMou.melody	@ltx/en_us_carroll/miscellanea:misc.Heirmos
ltx/en_us_carroll/he.h.m6:heHE.EvoisaEnOliKardiaMou.mode	@ltx/en_us_carroll/miscellanea:misc.Mode6
ltx/en_us_carroll/he.h.m6:heHE.EvoisaEnOliKardiaMou.name	I cried aloud and shouted.
ltx/en_us_carroll/he.h.m6:heHE.EvoisaEnOliKardiaMou.notmetered	N/M (I cried aloud and shouted.)
ltx/en_us_carroll/he.h.m6:heHE.EvoisaEnOliKardiaMou.ode	@ltx/en_us_carroll/miscellanea:misc.Ode6
ltx/en_us_carroll/he.h.m6:heHE.EvoisaEnOliKardiaMou.text	
ltx/en_us_carroll/he.h.m6:heHE.IToChaireDiAngelou.greekname	
ltx/en_us_carroll/he.h.m6:heHE.IToChaireDiAngelou.incipit	You received the joyful message…
ltx/en_us_carroll/he.h.m6:heHE.IToChaireDiAngelou.melody	@ltx/en_us_carroll/miscellanea:misc.Heirmos
ltx/en_us_carroll/he.h.m6:heHE.IToChaireDiAngelou.mode	@ltx/en_us_carroll/miscellanea:misc.Mode6
ltx/en_us_carroll/he.h.m6:heHE.IToChaireDiAngelou.name	You received the joyful message.
ltx/en_us_carroll/he.h.m6:heHE.IToChaireDiAngelou.notmetered	N/M (You received the joyful message.)
ltx/en_us_carroll/he.h.m6:heHE.IToChaireDiAngelou.ode	@ltx/en_us_carroll/miscellanea:misc.Ode9
ltx/en_us_carroll/he.h.m6:heHE.IToChaireDiAngelou.text	
ltx/en_us_carroll/he.h.m6:heHE.IdeteIdete.greekname	
ltx/en_us_carroll/he.h.m6:heHE.IdeteIdete.incipit	…
ltx/en_us_carroll/he.h.m6:heHE.IdeteIdete.melody	@ltx/en_us_carroll/miscellanea:misc.Heirmos
ltx/en_us_carroll/he.h.m6:heHE.IdeteIdete.mode	@ltx/en_us_carroll/miscellanea:misc.Mode6
ltx/en_us_carroll/he.h.m6:heHE.IdeteIdete.name	
ltx/en_us_carroll/he.h.m6:heHE.IdeteIdete.notmetered	N/M ()
ltx/en_us_carroll/he.h.m6:heHE.IdeteIdete.ode	@ltx/en_us_carroll/miscellanea:misc.Ode2
ltx/en_us_carroll/he.h.m6:heHE.IdeteIdete.text	
ltx/en_us_carroll/he.h.m6:heHE.ImartomenInomisamen.greekname	
ltx/en_us_carroll/he.h.m6:heHE.ImartomenInomisamen.incipit	We sinned, O Lord…
ltx/en_us_carroll/he.h.m6:heHE.ImartomenInomisamen.melody	@ltx/en_us_carroll/miscellanea:misc.Heirmos
ltx/en_us_carroll/he.h.m6:heHE.ImartomenInomisamen.mode	@ltx/en_us_carroll/miscellanea:misc.Mode6
ltx/en_us_carroll/he.h.m6:heHE.ImartomenInomisamen.name	We sinned, O Lord.
ltx/en_us_carroll/he.h.m6:heHE.ImartomenInomisamen.notmetered	N/M (We sinned, O Lord.)
ltx/en_us_carroll/he.h.m6:heHE.ImartomenInomisamen.ode	@ltx/en_us_carroll/miscellanea:misc.Ode7
ltx/en_us_carroll/he.h.m6:heHE.ImartomenInomisamen.text	
ltx/en_us_carroll/he.h.m6:heHE.KymatiThalassis.greekname	
ltx/en_us_carroll/he.h.m6:heHE.KymatiThalassis.incipit	He, who with a sea-wave…
ltx/en_us_carroll/he.h.m6:heHE.KymatiThalassis.melody	@ltx/en_us_carroll/miscellanea:misc.Heirmos
ltx/en_us_carroll/he.h.m6:heHE.KymatiThalassis.mode	@ltx/en_us_carroll/miscellanea:misc.Mode6
ltx/en_us_carroll/he.h.m6:heHE.KymatiThalassis.name	He, who with a sea-wave.
ltx/en_us_carroll/he.h.m6:heHE.KymatiThalassis.notmetered	N/M (He, who with a sea-wave.)
ltx/en_us_carroll/he.h.m6:heHE.KymatiThalassis.ode	@ltx/en_us_carroll/miscellanea:misc.Ode1
ltx/en_us_carroll/he.h.m6:heHE.KymatiThalassis.text	
ltx/en_us_carroll/he.h.m6:heHE.KymatiThalassisEpiphany.greekname	
ltx/en_us_carroll/he.h.m6:heHE.KymatiThalassisEpiphany.incipit	…
ltx/en_us_carroll/he.h.m6:heHE.KymatiThalassisEpiphany.melody	@ltx/en_us_carroll/miscellanea:misc.Heirmos
ltx/en_us_carroll/he.h.m6:heHE.KymatiThalassisEpiphany.mode	@ltx/en_us_carroll/miscellanea:misc.Mode6
ltx/en_us_carroll/he.h.m6:heHE.KymatiThalassisEpiphany.name	
ltx/en_us_carroll/he.h.m6:heHE.KymatiThalassisEpiphany.notmetered	N/M ()
ltx/en_us_carroll/he.h.m6:heHE.KymatiThalassisEpiphany.ode	@ltx/en_us_carroll/miscellanea:misc.Ode1
ltx/en_us_carroll/he.h.m6:heHE.KymatiThalassisEpiphany.text	
ltx/en_us_carroll/he.h.m6:heHE.KymatiThalassis_Epiphany.greekname	@ltx/en_us_carroll/properties:deprecated.key
ltx/en_us_carroll/he.h.m6:heHE.KymatiThalassis_Epiphany.incipit	@ltx/en_us_carroll/properties:deprecated.key
ltx/en_us_carroll/he.h.m6:heHE.KymatiThalassis_Epiphany.melody	@ltx/en_us_carroll/properties:deprecated.key
ltx/en_us_carroll/he.h.m6:heHE.KymatiThalassis_Epiphany.mode	@ltx/en_us_carroll/properties:deprecated.key
ltx/en_us_carroll/he.h.m6:heHE.KymatiThalassis_Epiphany.name	@ltx/en_us_carroll/properties:deprecated.key
ltx/en_us_carroll/he.h.m6:heHE.KymatiThalassis_Epiphany.ode	@ltx/en_us_carroll/properties:deprecated.key
ltx/en_us_carroll/he.h.m6:heHE.KymatiThalassis_Epiphany.text	@ltx/en_us_carroll/properties:deprecated.key
ltx/en_us_carroll/he.h.m6:heHE.KyriosOnPanton.greekname	
ltx/en_us_carroll/he.h.m6:heHE.KyriosOnPanton.incipit	Lord of all and Creator…
ltx/en_us_carroll/he.h.m6:heHE.KyriosOnPanton.melody	@ltx/en_us_carroll/miscellanea:misc.Heirmos
ltx/en_us_carroll/he.h.m6:heHE.KyriosOnPanton.mode	@ltx/en_us_carroll/miscellanea:misc.Mode6
ltx/en_us_carroll/he.h.m6:heHE.KyriosOnPanton.name	Lord of all and Creator.
ltx/en_us_carroll/he.h.m6:heHE.KyriosOnPanton.notmetered	N/M (Lord of all and Creator.)
ltx/en_us_carroll/he.h.m6:heHE.KyriosOnPanton.ode	@ltx/en_us_carroll/miscellanea:misc.Ode3
ltx/en_us_carroll/he.h.m6:heHE.KyriosOnPanton.text	
ltx/en_us_carroll/he.h.m6:heHE.KyriosOnPantonEpiphany.greekname	
ltx/en_us_carroll/he.h.m6:heHE.KyriosOnPantonEpiphany.incipit	…
ltx/en_us_carroll/he.h.m6:heHE.KyriosOnPantonEpiphany.melody	@ltx/en_us_carroll/miscellanea:misc.Heirmos
ltx/en_us_carroll/he.h.m6:heHE.KyriosOnPantonEpiphany.mode	@ltx/en_us_carroll/miscellanea:misc.Mode6
ltx/en_us_carroll/he.h.m6:heHE.KyriosOnPantonEpiphany.name	
ltx/en_us_carroll/he.h.m6:heHE.KyriosOnPantonEpiphany.notmetered	N/M ()
ltx/en_us_carroll/he.h.m6:heHE.KyriosOnPantonEpiphany.ode	@ltx/en_us_carroll/miscellanea:misc.Ode3
ltx/en_us_carroll/he.h.m6:heHE.KyriosOnPantonEpiphany.text	
ltx/en_us_carroll/he.h.m6:heHE.KyriosOnPanton_Epiphany.greekname	@ltx/en_us_carroll/properties:deprecated.key
ltx/en_us_carroll/he.h.m6:heHE.KyriosOnPanton_Epiphany.incipit	@ltx/en_us_carroll/properties:deprecated.key
ltx/en_us_carroll/he.h.m6:heHE.KyriosOnPanton_Epiphany.melody	@ltx/en_us_carroll/properties:deprecated.key
ltx/en_us_carroll/he.h.m6:heHE.KyriosOnPanton_Epiphany.mode	@ltx/en_us_carroll/properties:deprecated.key
ltx/en_us_carroll/he.h.m6:heHE.KyriosOnPanton_Epiphany.name	@ltx/en_us_carroll/properties:deprecated.key
ltx/en_us_carroll/he.h.m6:heHE.KyriosOnPanton_Epiphany.ode	@ltx/en_us_carroll/properties:deprecated.key
ltx/en_us_carroll/he.h.m6:heHE.KyriosOnPanton_Epiphany.text	@ltx/en_us_carroll/properties:deprecated.key
ltx/en_us_carroll/he.h.m6:heHE.MiEpodyrestheMatin.greekname	
ltx/en_us_carroll/he.h.m6:heHE.MiEpodyrestheMatin.incipit	…
ltx/en_us_carroll/he.h.m6:heHE.MiEpodyrestheMatin.melody	@ltx/en_us_carroll/miscellanea:misc.Heirmos
ltx/en_us_carroll/he.h.m6:heHE.MiEpodyrestheMatin.mode	@ltx/en_us_carroll/miscellanea:misc.Mode6
ltx/en_us_carroll/he.h.m6:heHE.MiEpodyrestheMatin.name	
ltx/en_us_carroll/he.h.m6:heHE.MiEpodyrestheMatin.notmetered	N/M ()
ltx/en_us_carroll/he.h.m6:heHE.MiEpodyrestheMatin.ode	@ltx/en_us_carroll/miscellanea:misc.Ode9
ltx/en_us_carroll/he.h.m6:heHE.MiEpodyrestheMatin.text	
ltx/en_us_carroll/he.h.m6:heHE.MiEpodyrouMouMiter.greekname	
ltx/en_us_carroll/he.h.m6:heHE.MiEpodyrouMouMiter.incipit	Weep not for Me, O Mother…
ltx/en_us_carroll/he.h.m6:heHE.MiEpodyrouMouMiter.melody	@ltx/en_us_carroll/miscellanea:misc.Heirmos
ltx/en_us_carroll/he.h.m6:heHE.MiEpodyrouMouMiter.mode	@ltx/en_us_carroll/miscellanea:misc.Mode6
ltx/en_us_carroll/he.h.m6:heHE.MiEpodyrouMouMiter.name	Weep not for Me, O Mother.
ltx/en_us_carroll/he.h.m6:heHE.MiEpodyrouMouMiter.notmetered	N/M (Weep not for Me, O Mother.)
ltx/en_us_carroll/he.h.m6:heHE.MiEpodyrouMouMiter.ode	@ltx/en_us_carroll/miscellanea:misc.Ode9
ltx/en_us_carroll/he.h.m6:heHE.MiEpodyrouMouMiter.text	
ltx/en_us_carroll/he.h.m6:heHE.NomonPatroon.greekname	
ltx/en_us_carroll/he.h.m6:heHE.NomonPatroon.incipit	Braving all danger…
ltx/en_us_carroll/he.h.m6:heHE.NomonPatroon.melody	@ltx/en_us_carroll/miscellanea:misc.Heirmos
ltx/en_us_carroll/he.h.m6:heHE.NomonPatroon.mode	@ltx/en_us_carroll/miscellanea:misc.Mode6
ltx/en_us_carroll/he.h.m6:heHE.NomonPatroon.name	Braving all danger.
ltx/en_us_carroll/he.h.m6:heHE.NomonPatroon.notmetered	N/M (Braving all danger.)
ltx/en_us_carroll/he.h.m6:heHE.NomonPatroon.ode	@ltx/en_us_carroll/miscellanea:misc.Ode8
ltx/en_us_carroll/he.h.m6:heHE.NomonPatroon.text	
ltx/en_us_carroll/he.h.m6:heHE.OAisthitosFarao.greekname	
ltx/en_us_carroll/he.h.m6:heHE.OAisthitosFarao.incipit	…
ltx/en_us_carroll/he.h.m6:heHE.OAisthitosFarao.melody	@ltx/en_us_carroll/miscellanea:misc.Heirmos
ltx/en_us_carroll/he.h.m6:heHE.OAisthitosFarao.mode	@ltx/en_us_carroll/miscellanea:misc.Mode6
ltx/en_us_carroll/he.h.m6:heHE.OAisthitosFarao.name	
ltx/en_us_carroll/he.h.m6:heHE.OAisthitosFarao.notmetered	N/M ()
ltx/en_us_carroll/he.h.m6:heHE.OAisthitosFarao.ode	@ltx/en_us_carroll/miscellanea:misc.Ode1
ltx/en_us_carroll/he.h.m6:heHE.OAisthitosFarao.text	
ltx/en_us_carroll/he.h.m6:heHE.OToFosAnatellon.greekname	
ltx/en_us_carroll/he.h.m6:heHE.OToFosAnatellon.incipit	…
ltx/en_us_carroll/he.h.m6:heHE.OToFosAnatellon.melody	@ltx/en_us_carroll/miscellanea:misc.Heirmos
ltx/en_us_carroll/he.h.m6:heHE.OToFosAnatellon.mode	@ltx/en_us_carroll/miscellanea:misc.Mode6
ltx/en_us_carroll/he.h.m6:heHE.OToFosAnatellon.name	
ltx/en_us_carroll/he.h.m6:heHE.OToFosAnatellon.notmetered	N/M ()
ltx/en_us_carroll/he.h.m6:heHE.OToFosAnatellon.ode	@ltx/en_us_carroll/miscellanea:misc.Ode5
ltx/en_us_carroll/he.h.m6:heHE.OToFosAnatellon.text	
ltx/en_us_carroll/he.h.m6:heHE.OTonOsionSouPaidon.greekname	
ltx/en_us_carroll/he.h.m6:heHE.OTonOsionSouPaidon.incipit	…
ltx/en_us_carroll/he.h.m6:heHE.OTonOsionSouPaidon.melody	@ltx/en_us_carroll/miscellanea:misc.Heirmos
ltx/en_us_carroll/he.h.m6:heHE.OTonOsionSouPaidon.mode	@ltx/en_us_carroll/miscellanea:misc.Mode6
ltx/en_us_carroll/he.h.m6:heHE.OTonOsionSouPaidon.name	
ltx/en_us_carroll/he.h.m6:heHE.OTonOsionSouPaidon.notmetered	N/M ()
ltx/en_us_carroll/he.h.m6:heHE.OTonOsionSouPaidon.ode	@ltx/en_us_carroll/miscellanea:misc.Ode7
ltx/en_us_carroll/he.h.m6:heHE.OTonOsionSouPaidon.text	
ltx/en_us_carroll/he.h.m6:heHE.OiOsioiSouPaides.greekname	
ltx/en_us_carroll/he.h.m6:heHE.OiOsioiSouPaides.incipit	…
ltx/en_us_carroll/he.h.m6:heHE.OiOsioiSouPaides.melody	@ltx/en_us_carroll/miscellanea:misc.Heirmos
ltx/en_us_carroll/he.h.m6:heHE.OiOsioiSouPaides.mode	@ltx/en_us_carroll/miscellanea:misc.Mode6
ltx/en_us_carroll/he.h.m6:heHE.OiOsioiSouPaides.name	
ltx/en_us_carroll/he.h.m6:heHE.OiOsioiSouPaides.notmetered	N/M ()
ltx/en_us_carroll/he.h.m6:heHE.OiOsioiSouPaides.ode	@ltx/en_us_carroll/miscellanea:misc.Ode8
ltx/en_us_carroll/he.h.m6:heHE.OiOsioiSouPaides.text	
ltx/en_us_carroll/he.h.m6:heHE.OiPaidesEnVavyloni.greekname	
ltx/en_us_carroll/he.h.m6:heHE.OiPaidesEnVavyloni.incipit	In Babylon those Servants…
ltx/en_us_carroll/he.h.m6:heHE.OiPaidesEnVavyloni.melody	@ltx/en_us_carroll/miscellanea:misc.Heirmos
ltx/en_us_carroll/he.h.m6:heHE.OiPaidesEnVavyloni.mode	@ltx/en_us_carroll/miscellanea:misc.Mode6
ltx/en_us_carroll/he.h.m6:heHE.OiPaidesEnVavyloni.name	In Babylon those Servants.
ltx/en_us_carroll/he.h.m6:heHE.OiPaidesEnVavyloni.notmetered	N/M (In Babylon those Servants.)
ltx/en_us_carroll/he.h.m6:heHE.OiPaidesEnVavyloni.ode	@ltx/en_us_carroll/miscellanea:misc.Ode7
ltx/en_us_carroll/he.h.m6:heHE.OiPaidesEnVavyloni.text	
ltx/en_us_carroll/he.h.m6:heHE.OnStratiaiOuranon.greekname	
ltx/en_us_carroll/he.h.m6:heHE.OnStratiaiOuranon.incipit	Him whom the hosts…
ltx/en_us_carroll/he.h.m6:heHE.OnStratiaiOuranon.melody	@ltx/en_us_carroll/miscellanea:misc.Heirmos
ltx/en_us_carroll/he.h.m6:heHE.OnStratiaiOuranon.mode	@ltx/en_us_carroll/miscellanea:misc.Mode6
ltx/en_us_carroll/he.h.m6:heHE.OnStratiaiOuranon.name	Him whom the hosts.
ltx/en_us_carroll/he.h.m6:heHE.OnStratiaiOuranon.notmetered	N/M (Him whom the hosts.)
ltx/en_us_carroll/he.h.m6:heHE.OnStratiaiOuranon.ode	@ltx/en_us_carroll/miscellanea:misc.Ode8
ltx/en_us_carroll/he.h.m6:heHE.OnStratiaiOuranon.text	
ltx/en_us_carroll/he.h.m6:heHE.OsEnIpeiroPezefsas.greekname	
ltx/en_us_carroll/he.h.m6:heHE.OsEnIpeiroPezefsas.incipit	When they had walked…
ltx/en_us_carroll/he.h.m6:heHE.OsEnIpeiroPezefsas.melody	@ltx/en_us_carroll/miscellanea:misc.Heirmos
ltx/en_us_carroll/he.h.m6:heHE.OsEnIpeiroPezefsas.mode	@ltx/en_us_carroll/miscellanea:misc.Mode6
ltx/en_us_carroll/he.h.m6:heHE.OsEnIpeiroPezefsas.name	When they had walked.
ltx/en_us_carroll/he.h.m6:heHE.OsEnIpeiroPezefsas.notmetered	N/M (When they had walked.)
ltx/en_us_carroll/he.h.m6:heHE.OsEnIpeiroPezefsas.ode	@ltx/en_us_carroll/miscellanea:misc.Ode1
ltx/en_us_carroll/he.h.m6:heHE.OsEnIpeiroPezefsas.text	
ltx/en_us_carroll/he.h.m6:heHE.OukEstinAgios.greekname	
ltx/en_us_carroll/he.h.m6:heHE.OukEstinAgios.incipit	No one is holy like the Lord…
ltx/en_us_carroll/he.h.m6:heHE.OukEstinAgios.melody	@ltx/en_us_carroll/miscellanea:misc.Heirmos
ltx/en_us_carroll/he.h.m6:heHE.OukEstinAgios.mode	@ltx/en_us_carroll/miscellanea:misc.Mode6
ltx/en_us_carroll/he.h.m6:heHE.OukEstinAgios.name	No one is holy.
ltx/en_us_carroll/he.h.m6:heHE.OukEstinAgios.notmetered	N/M (No one is holy.)
ltx/en_us_carroll/he.h.m6:heHE.OukEstinAgios.ode	@ltx/en_us_carroll/miscellanea:misc.Ode3
ltx/en_us_carroll/he.h.m6:heHE.OukEstinAgios.text	
ltx/en_us_carroll/he.h.m6:heHE.ProkatidonOProfitis.greekname	
ltx/en_us_carroll/he.h.m6:heHE.ProkatidonOProfitis.incipit	When Habakkuk the Prophet…
ltx/en_us_carroll/he.h.m6:heHE.ProkatidonOProfitis.melody	@ltx/en_us_carroll/miscellanea:misc.Heirmos
ltx/en_us_carroll/he.h.m6:heHE.ProkatidonOProfitis.mode	@ltx/en_us_carroll/miscellanea:misc.Mode6
ltx/en_us_carroll/he.h.m6:heHE.ProkatidonOProfitis.name	When Habakkuk the Prophet.
ltx/en_us_carroll/he.h.m6:heHE.ProkatidonOProfitis.notmetered	N/M (When Habakkuk the Prophet.)
ltx/en_us_carroll/he.h.m6:heHE.ProkatidonOProfitis.ode	@ltx/en_us_carroll/miscellanea:misc.Ode4
ltx/en_us_carroll/he.h.m6:heHE.ProkatidonOProfitis.text	
ltx/en_us_carroll/he.h.m6:heHE.ProkatidonOProfitisEpiphany.greekname	
ltx/en_us_carroll/he.h.m6:heHE.ProkatidonOProfitisEpiphany.incipit	…
ltx/en_us_carroll/he.h.m6:heHE.ProkatidonOProfitisEpiphany.melody	@ltx/en_us_carroll/miscellanea:misc.Heirmos
ltx/en_us_carroll/he.h.m6:heHE.ProkatidonOProfitisEpiphany.mode	@ltx/en_us_carroll/miscellanea:misc.Mode6
ltx/en_us_carroll/he.h.m6:heHE.ProkatidonOProfitisEpiphany.name	
ltx/en_us_carroll/he.h.m6:heHE.ProkatidonOProfitisEpiphany.notmetered	N/M ()
ltx/en_us_carroll/he.h.m6:heHE.ProkatidonOProfitisEpiphany.ode	@ltx/en_us_carroll/miscellanea:misc.Ode4
ltx/en_us_carroll/he.h.m6:heHE.ProkatidonOProfitisEpiphany.text	
ltx/en_us_carroll/he.h.m6:heHE.ProkatidonOProfitis_Epiphany.greekname	@ltx/en_us_carroll/properties:deprecated.key
ltx/en_us_carroll/he.h.m6:heHE.ProkatidonOProfitis_Epiphany.incipit	@ltx/en_us_carroll/properties:deprecated.key
ltx/en_us_carroll/he.h.m6:heHE.ProkatidonOProfitis_Epiphany.melody	@ltx/en_us_carroll/properties:deprecated.key
ltx/en_us_carroll/he.h.m6:heHE.ProkatidonOProfitis_Epiphany.mode	@ltx/en_us_carroll/properties:deprecated.key
ltx/en_us_carroll/he.h.m6:heHE.ProkatidonOProfitis_Epiphany.name	@ltx/en_us_carroll/properties:deprecated.key
ltx/en_us_carroll/he.h.m6:heHE.ProkatidonOProfitis_Epiphany.ode	@ltx/en_us_carroll/properties:deprecated.key
ltx/en_us_carroll/he.h.m6:heHE.ProkatidonOProfitis_Epiphany.text	@ltx/en_us_carroll/properties:deprecated.key
ltx/en_us_carroll/he.h.m6:heHE.ProsSeOrthrizo.greekname	
ltx/en_us_carroll/he.h.m6:heHE.ProsSeOrthrizo.incipit	Early in the morning…
ltx/en_us_carroll/he.h.m6:heHE.ProsSeOrthrizo.melody	@ltx/en_us_carroll/miscellanea:misc.Heirmos
ltx/en_us_carroll/he.h.m6:heHE.ProsSeOrthrizo.mode	@ltx/en_us_carroll/miscellanea:misc.Mode6
ltx/en_us_carroll/he.h.m6:heHE.ProsSeOrthrizo.name	Early in the morning.
ltx/en_us_carroll/he.h.m6:heHE.ProsSeOrthrizo.notmetered	N/M (Early in the morning.)
ltx/en_us_carroll/he.h.m6:heHE.ProsSeOrthrizo.ode	@ltx/en_us_carroll/miscellanea:misc.Ode5
ltx/en_us_carroll/he.h.m6:heHE.ProsSeOrthrizo.text	
ltx/en_us_carroll/he.h.m6:heHE.ProsSeOrthrizoEpiphany.greekname	
ltx/en_us_carroll/he.h.m6:heHE.ProsSeOrthrizoEpiphany.incipit	…
ltx/en_us_carroll/he.h.m6:heHE.ProsSeOrthrizoEpiphany.melody	@ltx/en_us_carroll/miscellanea:misc.Heirmos
ltx/en_us_carroll/he.h.m6:heHE.ProsSeOrthrizoEpiphany.mode	@ltx/en_us_carroll/miscellanea:misc.Mode6
ltx/en_us_carroll/he.h.m6:heHE.ProsSeOrthrizoEpiphany.name	
ltx/en_us_carroll/he.h.m6:heHE.ProsSeOrthrizoEpiphany.notmetered	N/M ()
ltx/en_us_carroll/he.h.m6:heHE.ProsSeOrthrizoEpiphany.ode	@ltx/en_us_carroll/miscellanea:misc.Ode5
ltx/en_us_carroll/he.h.m6:heHE.ProsSeOrthrizoEpiphany.text	
ltx/en_us_carroll/he.h.m6:heHE.ProsSeOrthrizo_Epiphany.greekname	@ltx/en_us_carroll/properties:deprecated.key
ltx/en_us_carroll/he.h.m6:heHE.ProsSeOrthrizo_Epiphany.incipit	@ltx/en_us_carroll/properties:deprecated.key
ltx/en_us_carroll/he.h.m6:heHE.ProsSeOrthrizo_Epiphany.melody	@ltx/en_us_carroll/properties:deprecated.key
ltx/en_us_carroll/he.h.m6:heHE.ProsSeOrthrizo_Epiphany.mode	@ltx/en_us_carroll/properties:deprecated.key
ltx/en_us_carroll/he.h.m6:heHE.ProsSeOrthrizo_Epiphany.name	@ltx/en_us_carroll/properties:deprecated.key
ltx/en_us_carroll/he.h.m6:heHE.ProsSeOrthrizo_Epiphany.ode	@ltx/en_us_carroll/properties:deprecated.key
ltx/en_us_carroll/he.h.m6:heHE.ProsSeOrthrizo_Epiphany.text	@ltx/en_us_carroll/properties:deprecated.key
ltx/en_us_carroll/he.h.m6:heHE.ProsecheOurane.greekname	
ltx/en_us_carroll/he.h.m6:heHE.ProsecheOurane.incipit	…
ltx/en_us_carroll/he.h.m6:heHE.ProsecheOurane.melody	@ltx/en_us_carroll/miscellanea:misc.Heirmos
ltx/en_us_carroll/he.h.m6:heHE.ProsecheOurane.mode	@ltx/en_us_carroll/miscellanea:misc.Mode6
ltx/en_us_carroll/he.h.m6:heHE.ProsecheOurane.name	
ltx/en_us_carroll/he.h.m6:heHE.ProsecheOurane.notmetered	N/M ()
ltx/en_us_carroll/he.h.m6:heHE.ProsecheOurane.ode	@ltx/en_us_carroll/miscellanea:misc.Ode2
ltx/en_us_carroll/he.h.m6:heHE.ProsecheOurane.text	
ltx/en_us_carroll/he.h.m6:heHE.SeTonEpiYdaton.greekname	
ltx/en_us_carroll/he.h.m6:heHE.SeTonEpiYdaton.incipit	When creation beheld You…
ltx/en_us_carroll/he.h.m6:heHE.SeTonEpiYdaton.melody	@ltx/en_us_carroll/miscellanea:misc.Heirmos
ltx/en_us_carroll/he.h.m6:heHE.SeTonEpiYdaton.mode	@ltx/en_us_carroll/miscellanea:misc.Mode6
ltx/en_us_carroll/he.h.m6:heHE.SeTonEpiYdaton.name	When creation beheld You.
ltx/en_us_carroll/he.h.m6:heHE.SeTonEpiYdaton.notmetered	N/M (When creation beheld You.)
ltx/en_us_carroll/he.h.m6:heHE.SeTonEpiYdaton.ode	@ltx/en_us_carroll/miscellanea:misc.Ode3
ltx/en_us_carroll/he.h.m6:heHE.SeTonEpiYdaton.text	
ltx/en_us_carroll/he.h.m6:heHE.SeTonEpiYdatonEpiphany.greekname	
ltx/en_us_carroll/he.h.m6:heHE.SeTonEpiYdatonEpiphany.incipit	…
ltx/en_us_carroll/he.h.m6:heHE.SeTonEpiYdatonEpiphany.melody	@ltx/en_us_carroll/miscellanea:misc.Heirmos
ltx/en_us_carroll/he.h.m6:heHE.SeTonEpiYdatonEpiphany.mode	@ltx/en_us_carroll/miscellanea:misc.Mode6
ltx/en_us_carroll/he.h.m6:heHE.SeTonEpiYdatonEpiphany.name	
ltx/en_us_carroll/he.h.m6:heHE.SeTonEpiYdatonEpiphany.notmetered	N/M ()
ltx/en_us_carroll/he.h.m6:heHE.SeTonEpiYdatonEpiphany.ode	@ltx/en_us_carroll/miscellanea:misc.Ode3
ltx/en_us_carroll/he.h.m6:heHE.SeTonEpiYdatonEpiphany.text	
ltx/en_us_carroll/he.h.m6:heHE.SeTonEpiYdaton_Epiphany.greekname	@ltx/en_us_carroll/properties:deprecated.key
ltx/en_us_carroll/he.h.m6:heHE.SeTonEpiYdaton_Epiphany.incipit	@ltx/en_us_carroll/properties:deprecated.key
ltx/en_us_carroll/he.h.m6:heHE.SeTonEpiYdaton_Epiphany.melody	@ltx/en_us_carroll/properties:deprecated.key
ltx/en_us_carroll/he.h.m6:heHE.SeTonEpiYdaton_Epiphany.mode	@ltx/en_us_carroll/properties:deprecated.key
ltx/en_us_carroll/he.h.m6:heHE.SeTonEpiYdaton_Epiphany.name	@ltx/en_us_carroll/properties:deprecated.key
ltx/en_us_carroll/he.h.m6:heHE.SeTonEpiYdaton_Epiphany.ode	@ltx/en_us_carroll/properties:deprecated.key
ltx/en_us_carroll/he.h.m6:heHE.SeTonEpiYdaton_Epiphany.text	@ltx/en_us_carroll/properties:deprecated.key
ltx/en_us_carroll/he.h.m6:heHE.StereosonKyrie.greekname	
ltx/en_us_carroll/he.h.m6:heHE.StereosonKyrie.incipit	Establish upon the rock…
ltx/en_us_carroll/he.h.m6:heHE.StereosonKyrie.melody	@ltx/en_us_carroll/miscellanea:misc.Heirmos
ltx/en_us_carroll/he.h.m6:heHE.StereosonKyrie.mode	@ltx/en_us_carroll/miscellanea:misc.Mode6
ltx/en_us_carroll/he.h.m6:heHE.StereosonKyrie.name	Establish upon the rock.
ltx/en_us_carroll/he.h.m6:heHE.StereosonKyrie.notmetered	N/M (Establish upon the rock.)
ltx/en_us_carroll/he.h.m6:heHE.StereosonKyrie.ode	@ltx/en_us_carroll/miscellanea:misc.Ode3
ltx/en_us_carroll/he.h.m6:heHE.StereosonKyrie.text	
ltx/en_us_carroll/he.h.m6:heHE.StilinKakiasAntitheou.greekname	
ltx/en_us_carroll/he.h.m6:heHE.StilinKakiasAntitheou.incipit	…
ltx/en_us_carroll/he.h.m6:heHE.StilinKakiasAntitheou.melody	@ltx/en_us_carroll/miscellanea:misc.Heirmos
ltx/en_us_carroll/he.h.m6:heHE.StilinKakiasAntitheou.mode	@ltx/en_us_carroll/miscellanea:misc.Mode6
ltx/en_us_carroll/he.h.m6:heHE.StilinKakiasAntitheou.name	
ltx/en_us_carroll/he.h.m6:heHE.StilinKakiasAntitheou.notmetered	N/M ()
ltx/en_us_carroll/he.h.m6:heHE.StilinKakiasAntitheou.ode	@ltx/en_us_carroll/miscellanea:misc.Ode8
ltx/en_us_carroll/he.h.m6:heHE.StilinKakiasAntitheou.text	
ltx/en_us_carroll/he.h.m6:heHE.StilinKakiasTouDeinou.greekname	
ltx/en_us_carroll/he.h.m6:heHE.StilinKakiasTouDeinou.incipit	…
ltx/en_us_carroll/he.h.m6:heHE.StilinKakiasTouDeinou.melody	@ltx/en_us_carroll/miscellanea:misc.Heirmos
ltx/en_us_carroll/he.h.m6:heHE.StilinKakiasTouDeinou.mode	@ltx/en_us_carroll/miscellanea:misc.Mode6
ltx/en_us_carroll/he.h.m6:heHE.StilinKakiasTouDeinou.name	
ltx/en_us_carroll/he.h.m6:heHE.StilinKakiasTouDeinou.notmetered	N/M ()
ltx/en_us_carroll/he.h.m6:heHE.StilinKakiasTouDeinou.ode	@ltx/en_us_carroll/miscellanea:misc.Ode8
ltx/en_us_carroll/he.h.m6:heHE.StilinKakiasTouDeinou.text	
ltx/en_us_carroll/he.h.m6:heHE.SyneschethiAllOuKateschethi.greekname	
ltx/en_us_carroll/he.h.m6:heHE.SyneschethiAllOuKateschethi.incipit	Prophet Jonah was in…
ltx/en_us_carroll/he.h.m6:heHE.SyneschethiAllOuKateschethi.melody	@ltx/en_us_carroll/miscellanea:misc.Heirmos
ltx/en_us_carroll/he.h.m6:heHE.SyneschethiAllOuKateschethi.mode	@ltx/en_us_carroll/miscellanea:misc.Mode6
ltx/en_us_carroll/he.h.m6:heHE.SyneschethiAllOuKateschethi.name	Prophet Jonah was in.
ltx/en_us_carroll/he.h.m6:heHE.SyneschethiAllOuKateschethi.notmetered	N/M (Prophet Jonah was in.)
ltx/en_us_carroll/he.h.m6:heHE.SyneschethiAllOuKateschethi.ode	@ltx/en_us_carroll/miscellanea:misc.Ode6
ltx/en_us_carroll/he.h.m6:heHE.SyneschethiAllOuKateschethi.text	
ltx/en_us_carroll/he.h.m6:heHE.SyneschethiAllOuKateschethiEpiphany.greekname	
ltx/en_us_carroll/he.h.m6:heHE.SyneschethiAllOuKateschethiEpiphany.incipit	…
ltx/en_us_carroll/he.h.m6:heHE.SyneschethiAllOuKateschethiEpiphany.melody	@ltx/en_us_carroll/miscellanea:misc.Heirmos
ltx/en_us_carroll/he.h.m6:heHE.SyneschethiAllOuKateschethiEpiphany.mode	@ltx/en_us_carroll/miscellanea:misc.Mode6
ltx/en_us_carroll/he.h.m6:heHE.SyneschethiAllOuKateschethiEpiphany.name	
ltx/en_us_carroll/he.h.m6:heHE.SyneschethiAllOuKateschethiEpiphany.notmetered	N/M (.)
ltx/en_us_carroll/he.h.m6:heHE.SyneschethiAllOuKateschethiEpiphany.ode	@ltx/en_us_carroll/miscellanea:misc.Ode6
ltx/en_us_carroll/he.h.m6:heHE.SyneschethiAllOuKateschethiEpiphany.text	
ltx/en_us_carroll/he.h.m6:heHE.SyneschethiAllOuKateschethi_Epiphany.greekname	@ltx/en_us_carroll/properties:deprecated.key
ltx/en_us_carroll/he.h.m6:heHE.SyneschethiAllOuKateschethi_Epiphany.incipit	@ltx/en_us_carroll/properties:deprecated.key
ltx/en_us_carroll/he.h.m6:heHE.SyneschethiAllOuKateschethi_Epiphany.melody	@ltx/en_us_carroll/properties:deprecated.key
ltx/en_us_carroll/he.h.m6:heHE.SyneschethiAllOuKateschethi_Epiphany.mode	@ltx/en_us_carroll/properties:deprecated.key
ltx/en_us_carroll/he.h.m6:heHE.SyneschethiAllOuKateschethi_Epiphany.name	@ltx/en_us_carroll/properties:deprecated.key
ltx/en_us_carroll/he.h.m6:heHE.SyneschethiAllOuKateschethi_Epiphany.ode	@ltx/en_us_carroll/properties:deprecated.key
ltx/en_us_carroll/he.h.m6:heHE.SyneschethiAllOuKateschethi_Epiphany.text	@ltx/en_us_carroll/properties:deprecated.key
ltx/en_us_carroll/he.h.m6:heHE.TheofaneiasSouChriste.greekname	
ltx/en_us_carroll/he.h.m6:heHE.TheofaneiasSouChriste.incipit	Prophet Isaiah once beheld…
ltx/en_us_carroll/he.h.m6:heHE.TheofaneiasSouChriste.melody	@ltx/en_us_carroll/miscellanea:misc.Heirmos
ltx/en_us_carroll/he.h.m6:heHE.TheofaneiasSouChriste.mode	@ltx/en_us_carroll/miscellanea:misc.Mode6
ltx/en_us_carroll/he.h.m6:heHE.TheofaneiasSouChriste.name	Prophet Isaiah once beheld.
ltx/en_us_carroll/he.h.m6:heHE.TheofaneiasSouChriste.notmetered	N/M (Prophet Isaiah once beheld.)
ltx/en_us_carroll/he.h.m6:heHE.TheofaneiasSouChriste.ode	@ltx/en_us_carroll/miscellanea:misc.Ode5
ltx/en_us_carroll/he.h.m6:heHE.TheofaneiasSouChriste.text	
ltx/en_us_carroll/he.h.m6:heHE.TheofaneiasSouChristeEpiphany.greekname	
ltx/en_us_carroll/he.h.m6:heHE.TheofaneiasSouChristeEpiphany.incipit	…
ltx/en_us_carroll/he.h.m6:heHE.TheofaneiasSouChristeEpiphany.melody	@ltx/en_us_carroll/miscellanea:misc.Heirmos
ltx/en_us_carroll/he.h.m6:heHE.TheofaneiasSouChristeEpiphany.mode	@ltx/en_us_carroll/miscellanea:misc.Mode6
ltx/en_us_carroll/he.h.m6:heHE.TheofaneiasSouChristeEpiphany.name	
ltx/en_us_carroll/he.h.m6:heHE.TheofaneiasSouChristeEpiphany.notmetered	N/M ()
ltx/en_us_carroll/he.h.m6:heHE.TheofaneiasSouChristeEpiphany.ode	@ltx/en_us_carroll/miscellanea:misc.Ode5
ltx/en_us_carroll/he.h.m6:heHE.TheofaneiasSouChristeEpiphany.text	
ltx/en_us_carroll/he.h.m6:heHE.TheofaneiasSouChriste_Epiphany.greekname	@ltx/en_us_carroll/properties:deprecated.key
ltx/en_us_carroll/he.h.m6:heHE.TheofaneiasSouChriste_Epiphany.incipit	@ltx/en_us_carroll/properties:deprecated.key
ltx/en_us_carroll/he.h.m6:heHE.TheofaneiasSouChriste_Epiphany.melody	@ltx/en_us_carroll/properties:deprecated.key
ltx/en_us_carroll/he.h.m6:heHE.TheofaneiasSouChriste_Epiphany.mode	@ltx/en_us_carroll/properties:deprecated.key
ltx/en_us_carroll/he.h.m6:heHE.TheofaneiasSouChriste_Epiphany.name	@ltx/en_us_carroll/properties:deprecated.key
ltx/en_us_carroll/he.h.m6:heHE.TheofaneiasSouChriste_Epiphany.ode	@ltx/en_us_carroll/properties:deprecated.key
ltx/en_us_carroll/he.h.m6:heHE.TheofaneiasSouChriste_Epiphany.text	@ltx/en_us_carroll/properties:deprecated.key
ltx/en_us_carroll/he.h.m6:heHE.TheonAnthropois.greekname	
ltx/en_us_carroll/he.h.m6:heHE.TheonAnthropois.incipit	It is impossible…
ltx/en_us_carroll/he.h.m6:heHE.TheonAnthropois.melody	@ltx/en_us_carroll/miscellanea:misc.Heirmos
ltx/en_us_carroll/he.h.m6:heHE.TheonAnthropois.mode	@ltx/en_us_carroll/miscellanea:misc.Mode6
ltx/en_us_carroll/he.h.m6:heHE.TheonAnthropois.name	It is impossible.
ltx/en_us_carroll/he.h.m6:heHE.TheonAnthropois.notmetered	N/M (It is impossible.)
ltx/en_us_carroll/he.h.m6:heHE.TheonAnthropois.ode	@ltx/en_us_carroll/miscellanea:misc.Ode9
ltx/en_us_carroll/he.h.m6:heHE.TheonAnthropois.text	
ltx/en_us_carroll/he.h.m6:heHE.TheonPateraDimiourgon.greekname	
ltx/en_us_carroll/he.h.m6:heHE.TheonPateraDimiourgon.incipit	…
ltx/en_us_carroll/he.h.m6:heHE.TheonPateraDimiourgon.melody	@ltx/en_us_carroll/miscellanea:misc.Heirmos
ltx/en_us_carroll/he.h.m6:heHE.TheonPateraDimiourgon.mode	@ltx/en_us_carroll/miscellanea:misc.Mode6
ltx/en_us_carroll/he.h.m6:heHE.TheonPateraDimiourgon.name	The three young men.
ltx/en_us_carroll/he.h.m6:heHE.TheonPateraDimiourgon.notmetered	N/M (The three young men.)
ltx/en_us_carroll/he.h.m6:heHE.TheonPateraDimiourgon.ode	@ltx/en_us_carroll/miscellanea:misc.Ode8
ltx/en_us_carroll/he.h.m6:heHE.TheonPateraDimiourgon.text	
ltx/en_us_carroll/he.h.m6:heHE.TinEnStavroSou.greekname	
ltx/en_us_carroll/he.h.m6:heHE.TinEnStavroSou.incipit	When he foresaw…
ltx/en_us_carroll/he.h.m6:heHE.TinEnStavroSou.melody	@ltx/en_us_carroll/miscellanea:misc.Heirmos
ltx/en_us_carroll/he.h.m6:heHE.TinEnStavroSou.mode	@ltx/en_us_carroll/miscellanea:misc.Mode6
ltx/en_us_carroll/he.h.m6:heHE.TinEnStavroSou.name	When he foresaw.
ltx/en_us_carroll/he.h.m6:heHE.TinEnStavroSou.notmetered	N/M (When he foresaw.)
ltx/en_us_carroll/he.h.m6:heHE.TinEnStavroSou.ode	@ltx/en_us_carroll/miscellanea:misc.Ode4
ltx/en_us_carroll/he.h.m6:heHE.TinEnStavroSou.text	
ltx/en_us_carroll/he.h.m6:heHE.TinProsToBaptismaSou.greekname	
ltx/en_us_carroll/he.h.m6:heHE.TinProsToBaptismaSou.incipit	…
ltx/en_us_carroll/he.h.m6:heHE.TinProsToBaptismaSou.melody	@ltx/en_us_carroll/miscellanea:misc.Heirmos
ltx/en_us_carroll/he.h.m6:heHE.TinProsToBaptismaSou.mode	@ltx/en_us_carroll/miscellanea:misc.Mode6
ltx/en_us_carroll/he.h.m6:heHE.TinProsToBaptismaSou.name	
ltx/en_us_carroll/he.h.m6:heHE.TinProsToBaptismaSou.notmetered	N/M ()
ltx/en_us_carroll/he.h.m6:heHE.TinProsToBaptismaSou.ode	@ltx/en_us_carroll/miscellanea:misc.Ode4
ltx/en_us_carroll/he.h.m6:heHE.TinProsToBaptismaSou.text	
ltx/en_us_carroll/he.h.m6:heHE.TinTimioteran.greekname	
ltx/en_us_carroll/he.h.m6:heHE.TinTimioteran.incipit	Greater in honor…
ltx/en_us_carroll/he.h.m6:heHE.TinTimioteran.melody	@ltx/en_us_carroll/miscellanea:misc.Heirmos
ltx/en_us_carroll/he.h.m6:heHE.TinTimioteran.mode	@ltx/en_us_carroll/miscellanea:misc.Mode6
ltx/en_us_carroll/he.h.m6:heHE.TinTimioteran.name	Greater in honor.
ltx/en_us_carroll/he.h.m6:heHE.TinTimioteran.notmetered	N/M (Greater in honor.)
ltx/en_us_carroll/he.h.m6:heHE.TinTimioteran.ode	@ltx/en_us_carroll/miscellanea:misc.Ode9
ltx/en_us_carroll/he.h.m6:heHE.TinTimioteran.text	
ltx/en_us_carroll/he.h.m6:heHE.TmitheisiTmatai.greekname	
ltx/en_us_carroll/he.h.m6:heHE.TmitheisiTmatai.incipit	The Red Sea was cut…
ltx/en_us_carroll/he.h.m6:heHE.TmitheisiTmatai.melody	@ltx/en_us_carroll/miscellanea:misc.Heirmos
ltx/en_us_carroll/he.h.m6:heHE.TmitheisiTmatai.mode	@ltx/en_us_carroll/miscellanea:misc.Mode6
ltx/en_us_carroll/he.h.m6:heHE.TmitheisiTmatai.name	The Red Sea was cut.
ltx/en_us_carroll/he.h.m6:heHE.TmitheisiTmatai.notmetered	N/M (The Red Sea was cut.)
ltx/en_us_carroll/he.h.m6:heHE.TmitheisiTmatai.ode	@ltx/en_us_carroll/miscellanea:misc.Ode1
ltx/en_us_carroll/he.h.m6:heHE.TmitheisiTmatai.text	
ltx/en_us_carroll/he.h.m6:heHE.ToKiteiKatapotheis.greekname	
ltx/en_us_carroll/he.h.m6:heHE.ToKiteiKatapotheis.incipit	…
ltx/en_us_carroll/he.h.m6:heHE.ToKiteiKatapotheis.melody	@ltx/en_us_carroll/miscellanea:misc.Heirmos
ltx/en_us_carroll/he.h.m6:heHE.ToKiteiKatapotheis.mode	@ltx/en_us_carroll/miscellanea:misc.Mode6
ltx/en_us_carroll/he.h.m6:heHE.ToKiteiKatapotheis.name	
ltx/en_us_carroll/he.h.m6:heHE.ToKiteiKatapotheis.notmetered	N/M ()
ltx/en_us_carroll/he.h.m6:heHE.ToKiteiKatapotheis.ode	@ltx/en_us_carroll/miscellanea:misc.Ode6
ltx/en_us_carroll/he.h.m6:heHE.ToKiteiKatapotheis.text	
ltx/en_us_carroll/he.h.m6:heHE.ToSyndesmoTisAgapis.greekname	
ltx/en_us_carroll/he.h.m6:heHE.ToSyndesmoTisAgapis.incipit	Once the Apostles…
ltx/en_us_carroll/he.h.m6:heHE.ToSyndesmoTisAgapis.melody	@ltx/en_us_carroll/miscellanea:misc.Heirmos
ltx/en_us_carroll/he.h.m6:heHE.ToSyndesmoTisAgapis.mode	@ltx/en_us_carroll/miscellanea:misc.Mode6
ltx/en_us_carroll/he.h.m6:heHE.ToSyndesmoTisAgapis.name	Once the Apostles.
ltx/en_us_carroll/he.h.m6:heHE.ToSyndesmoTisAgapis.notmetered	N/M (Once the Apostles.)
ltx/en_us_carroll/he.h.m6:heHE.ToSyndesmoTisAgapis.ode	@ltx/en_us_carroll/miscellanea:misc.Ode5
ltx/en_us_carroll/he.h.m6:heHE.ToSyndesmoTisAgapis.text	
ltx/en_us_carroll/he.h.m6:heHE.ToSyndesmoTisDeilias.greekname	
ltx/en_us_carroll/he.h.m6:heHE.ToSyndesmoTisDeilias.incipit	…
ltx/en_us_carroll/he.h.m6:heHE.ToSyndesmoTisDeilias.melody	@ltx/en_us_carroll/miscellanea:misc.Heirmos
ltx/en_us_carroll/he.h.m6:heHE.ToSyndesmoTisDeilias.mode	@ltx/en_us_carroll/miscellanea:misc.Mode6
ltx/en_us_carroll/he.h.m6:heHE.ToSyndesmoTisDeilias.name	
ltx/en_us_carroll/he.h.m6:heHE.ToSyndesmoTisDeilias.notmetered	N/M ()
ltx/en_us_carroll/he.h.m6:heHE.ToSyndesmoTisDeilias.ode	@ltx/en_us_carroll/miscellanea:misc.Ode5
ltx/en_us_carroll/he.h.m6:heHE.ToSyndesmoTisDeilias.text	
ltx/en_us_carroll/he.h.m6:heHE.ToTheioFengeiSou.greekname	
ltx/en_us_carroll/he.h.m6:heHE.ToTheioFengeiSou.incipit	With Your divine light…
ltx/en_us_carroll/he.h.m6:heHE.ToTheioFengeiSou.melody	@ltx/en_us_carroll/miscellanea:misc.Heirmos
ltx/en_us_carroll/he.h.m6:heHE.ToTheioFengeiSou.mode	@ltx/en_us_carroll/miscellanea:misc.Mode6
ltx/en_us_carroll/he.h.m6:heHE.ToTheioFengeiSou.name	With Your divine light.
ltx/en_us_carroll/he.h.m6:heHE.ToTheioFengeiSou.notmetered	N/M (With Your divine light.)
ltx/en_us_carroll/he.h.m6:heHE.ToTheioFengeiSou.ode	@ltx/en_us_carroll/miscellanea:misc.Ode5
ltx/en_us_carroll/he.h.m6:heHE.ToTheioFengeiSou.text	
ltx/en_us_carroll/he.h.m6:heHE.TonPaidonTinOdin.greekname	
ltx/en_us_carroll/he.h.m6:heHE.TonPaidonTinOdin.incipit	…
ltx/en_us_carroll/he.h.m6:heHE.TonPaidonTinOdin.melody	@ltx/en_us_carroll/miscellanea:misc.Heirmos
ltx/en_us_carroll/he.h.m6:heHE.TonPaidonTinOdin.mode	@ltx/en_us_carroll/miscellanea:misc.Mode6
ltx/en_us_carroll/he.h.m6:heHE.TonPaidonTinOdin.name	
ltx/en_us_carroll/he.h.m6:heHE.TonPaidonTinOdin.notmetered	N/M ()
ltx/en_us_carroll/he.h.m6:heHE.TonPaidonTinOdin.ode	@ltx/en_us_carroll/miscellanea:misc.Ode8
ltx/en_us_carroll/he.h.m6:heHE.TonPaidonTinOdin.text	
ltx/en_us_carroll/he.h.m6:heHE.TouViouTinThalassan.greekname	
ltx/en_us_carroll/he.h.m6:heHE.TouViouTinThalassan.incipit	I see when my life…
ltx/en_us_carroll/he.h.m6:heHE.TouViouTinThalassan.melody	@ltx/en_us_carroll/miscellanea:misc.Heirmos
ltx/en_us_carroll/he.h.m6:heHE.TouViouTinThalassan.mode	@ltx/en_us_carroll/miscellanea:misc.Mode6
ltx/en_us_carroll/he.h.m6:heHE.TouViouTinThalassan.name	I see when my life.
ltx/en_us_carroll/he.h.m6:heHE.TouViouTinThalassan.notmetered	N/M (I see when my life.)
ltx/en_us_carroll/he.h.m6:heHE.TouViouTinThalassan.ode	@ltx/en_us_carroll/miscellanea:misc.Ode6
ltx/en_us_carroll/he.h.m6:heHE.TouViouTinThalassan.text	
ltx/en_us_carroll/he.h.m6:heHE.VoithosKaiSkepastis.greekname	
ltx/en_us_carroll/he.h.m6:heHE.VoithosKaiSkepastis.incipit	He became for me a helper…
ltx/en_us_carroll/he.h.m6:heHE.VoithosKaiSkepastis.melody	@ltx/en_us_carroll/miscellanea:misc.Heirmos
ltx/en_us_carroll/he.h.m6:heHE.VoithosKaiSkepastis.mode	@ltx/en_us_carroll/miscellanea:misc.Mode6
ltx/en_us_carroll/he.h.m6:heHE.VoithosKaiSkepastis.name	He became for me a helper.
ltx/en_us_carroll/he.h.m6:heHE.VoithosKaiSkepastis.notmetered	N/M (He became for me a helper.)
ltx/en_us_carroll/he.h.m6:heHE.VoithosKaiSkepastis.ode	@ltx/en_us_carroll/miscellanea:misc.Ode1
ltx/en_us_carroll/he.h.m6:heHE.VoithosKaiSkepastis.text	
ltx/en_us_carroll/he.h.m6:heHE.XeniasDespotikis.greekname	
ltx/en_us_carroll/he.h.m6:heHE.XeniasDespotikis.incipit	Come, believers, let us enjoy…
ltx/en_us_carroll/he.h.m6:heHE.XeniasDespotikis.melody	@ltx/en_us_carroll/miscellanea:misc.Heirmos
ltx/en_us_carroll/he.h.m6:heHE.XeniasDespotikis.mode	@ltx/en_us_carroll/miscellanea:misc.Mode6
ltx/en_us_carroll/he.h.m6:heHE.XeniasDespotikis.name	Come, believers, let us enjoy.
ltx/en_us_carroll/he.h.m6:heHE.XeniasDespotikis.notmetered	N/M (Come, believers, let us enjoy.)
ltx/en_us_carroll/he.h.m6:heHE.XeniasDespotikis.ode	@ltx/en_us_carroll/miscellanea:misc.Ode9
ltx/en_us_carroll/he.h.m6:heHE.XeniasDespotikis.text	
ltx/en_us_carroll/he.h.m6:heHE.XeniasDespotikisEpiphany.greekname	
ltx/en_us_carroll/he.h.m6:heHE.XeniasDespotikisEpiphany.incipit	…
ltx/en_us_carroll/he.h.m6:heHE.XeniasDespotikisEpiphany.melody	@ltx/en_us_carroll/miscellanea:misc.Heirmos
ltx/en_us_carroll/he.h.m6:heHE.XeniasDespotikisEpiphany.mode	@ltx/en_us_carroll/miscellanea:misc.Mode6
ltx/en_us_carroll/he.h.m6:heHE.XeniasDespotikisEpiphany.name	
ltx/en_us_carroll/he.h.m6:heHE.XeniasDespotikisEpiphany.notmetered	N/M ()
ltx/en_us_carroll/he.h.m6:heHE.XeniasDespotikisEpiphany.ode	@ltx/en_us_carroll/miscellanea:misc.Ode9
ltx/en_us_carroll/he.h.m6:heHE.XeniasDespotikisEpiphany.text	
ltx/en_us_carroll/he.h.m6:heHE.XeniasDespotikis_Epiphany.greekname	@ltx/en_us_carroll/properties:deprecated.key
ltx/en_us_carroll/he.h.m6:heHE.XeniasDespotikis_Epiphany.incipit	@ltx/en_us_carroll/properties:deprecated.key
ltx/en_us_carroll/he.h.m6:heHE.XeniasDespotikis_Epiphany.melody	@ltx/en_us_carroll/properties:deprecated.key
ltx/en_us_carroll/he.h.m6:heHE.XeniasDespotikis_Epiphany.mode	@ltx/en_us_carroll/properties:deprecated.key
ltx/en_us_carroll/he.h.m6:heHE.XeniasDespotikis_Epiphany.name	@ltx/en_us_carroll/properties:deprecated.key
ltx/en_us_carroll/he.h.m6:heHE.XeniasDespotikis_Epiphany.ode	@ltx/en_us_carroll/properties:deprecated.key
ltx/en_us_carroll/he.h.m6:heHE.XeniasDespotikis_Epiphany.text	@ltx/en_us_carroll/properties:deprecated.key
