ltx/en_us_carroll/me.m08.d01:meVE.Stichera01.greekmelody	@ltx/en_us_carroll/he.a.m4:heAU.OsGennaionEnMartysi.greekname
ltx/en_us_carroll/me.m08.d01:meVE.Stichera01.incipit	Our defense and immunity
ltx/en_us_carroll/me.m08.d01:meVE.Stichera01.melody	@ltx/en_us_carroll/he.a.m4:heAU.OsGennaionEnMartysi.name
ltx/en_us_carroll/me.m08.d01:meVE.Stichera01.mode	@ltx/en_us_carroll/miscellanea:misc.Mode4
ltx/en_us_carroll/me.m08.d01:meVE.Stichera01.text	Our defense and immunity, * purifying and hallowing -- * brethren, let us hail and embrace the precious Cross: * for it relieves pain and suffering * and cures noisome malady; * it releases ailing souls * from all manner of agony, * flooding forth a sea * of miraculous healings over those who bow and venerate its image * with faith and reverence and piety.
ltx/en_us_carroll/me.m08.d01:meVE.Stichera02.incipit	Men adrift on the waves
ltx/en_us_carroll/me.m08.d01:meVE.Stichera02.melody	@ltx/en_us_carroll/he.a.m4:heAU.OsGennaionEnMartysi.name
ltx/en_us_carroll/me.m08.d01:meVE.Stichera02.mode	@ltx/en_us_carroll/miscellanea:misc.Mode4
ltx/en_us_carroll/me.m08.d01:meVE.Stichera02.text	Men adrift on the waves of life, * tossed and buffeted helplessly * by a squall of suffering, pain, and misery, * let us take refuge inside the wood * most precious, the Holy Cross, * as a ship come to our aid; * then the billows and tempest-blast * will be quieted, * and our passions be shipwrecked; we ourselves shall make safe passage to the harbor * safe from the surge of the swelling sea.
ltx/en_us_carroll/me.m08.d01:meVE.Stichera03.incipit	Far more radiant
ltx/en_us_carroll/me.m08.d01:meVE.Stichera03.melody	@ltx/en_us_carroll/he.a.m4:heAU.OsGennaionEnMartysi.name
ltx/en_us_carroll/me.m08.d01:meVE.Stichera03.mode	@ltx/en_us_carroll/miscellanea:misc.Mode4
ltx/en_us_carroll/me.m08.d01:meVE.Stichera03.text	Far more radiant than the sun * shines the Cross, the all-holy wood, * radiating miracles as though rays of light, * emitting healings like thunderbolts; * so let us draw nigh to it, * who are ever ringed about * by the darkness of awful things, * for we shall receive * from it luminous grace of cures and healings, as we magnify the God-man, * Who hung upon it in flesh like ours.
