ltx/en_us_carroll/he.a.m5:heAU.ChairoisAskitikon.greekname	
ltx/en_us_carroll/he.a.m5:heAU.ChairoisAskitikon.incipit	Rejoice…
ltx/en_us_carroll/he.a.m5:heAU.ChairoisAskitikon.melody	@ltx/en_us_carroll/miscellanea:misc.Automelon
ltx/en_us_carroll/he.a.m5:heAU.ChairoisAskitikon.mode	@ltx/en_us_carroll/miscellanea:misc.Mode5
ltx/en_us_carroll/he.a.m5:heAU.ChairoisAskitikon.name	Rejoice.
ltx/en_us_carroll/he.a.m5:heAU.ChairoisAskitikon.notmetered	N/M (Rejoice.)
ltx/en_us_carroll/he.a.m5:heAU.ChairoisAskitikontext	
ltx/en_us_carroll/he.a.m5:heAU.LampeiSimeron.greekname	
ltx/en_us_carroll/he.a.m5:heAU.LampeiSimeron.incipit	…
ltx/en_us_carroll/he.a.m5:heAU.LampeiSimeron.melody	@ltx/en_us_carroll/miscellanea:misc.Automelon
ltx/en_us_carroll/he.a.m5:heAU.LampeiSimeron.mode	@ltx/en_us_carroll/miscellanea:misc.Mode5
ltx/en_us_carroll/he.a.m5:heAU.LampeiSimeron.name	
ltx/en_us_carroll/he.a.m5:heAU.LampeiSimeron.notmetered	N/M ()
ltx/en_us_carroll/he.a.m5:heAU.LampeiSimerontext	
ltx/en_us_carroll/he.a.m5:heAU.OsiePater.greekname	
ltx/en_us_carroll/he.a.m5:heAU.OsiePater.incipit	Devout and God-bearing father…
ltx/en_us_carroll/he.a.m5:heAU.OsiePater.melody	@ltx/en_us_carroll/miscellanea:misc.Automelon
ltx/en_us_carroll/he.a.m5:heAU.OsiePater.mode	@ltx/en_us_carroll/miscellanea:misc.Mode5
ltx/en_us_carroll/he.a.m5:heAU.OsiePater.name	Devout and God-bearing father.
ltx/en_us_carroll/he.a.m5:heAU.OsiePater.notmetered	N/M (Devout and God-bearing father.)
ltx/en_us_carroll/he.a.m5:heAU.OsiePatertext	
ltx/en_us_carroll/he.a.m5:heAU.TonSynanarchonLogon.greekname	
ltx/en_us_carroll/he.a.m5:heAU.TonSynanarchonLogon.incipit	Let us worship the Word…
ltx/en_us_carroll/he.a.m5:heAU.TonSynanarchonLogon.melody	@ltx/en_us_carroll/miscellanea:misc.Automelon
ltx/en_us_carroll/he.a.m5:heAU.TonSynanarchonLogon.mode	@ltx/en_us_carroll/miscellanea:misc.Mode5
ltx/en_us_carroll/he.a.m5:heAU.TonSynanarchonLogon.name	Let us worship the Word.
ltx/en_us_carroll/he.a.m5:heAU.TonSynanarchonLogon.notmetered	N/M (Let us worship the Word.)
ltx/en_us_carroll/he.a.m5:heAU.TonSynanarchonLogontext	
ltx/en_us_carroll/he.a.m5:heAU.title	Automela of Mode pl. 1
