ltx/en_us_barrett/me.m02.d21:meVE.SticTheotokion.greekmelody	@ltx/en_us_barrett/he.a.m8:heAU.OTouParadoxou.greekname
ltx/en_us_barrett/me.m02.d21:meVE.SticTheotokion.incipit	My entire life has been…
ltx/en_us_barrett/me.m02.d21:meVE.SticTheotokion.melody	@ltx/en_us_barrett/he.a.m8:heAU.OTouParadoxou.name
ltx/en_us_barrett/me.m02.d21:meVE.SticTheotokion.mode	@ltx/en_us_barrett/miscellanea:misc.Mode8
ltx/en_us_barrett/me.m02.d21:meVE.SticTheotokion.text	My entire life has been depraved, my soul wholly wanton, my own body a shrine of sin, mind and spirit both impure, all defiled are all my works, I know that I deserve a reckoning of judgment and wrathful condemnation. Where ought I now to go and to where am I to flee if not to you? Lady, show compassion now and come to save me, I pray.
ltx/en_us_barrett/me.m02.d21:meVE.Stichera01.greekmelody	@ltx/en_us_barrett/he.a.m8:heAU.OTouParadoxou.greekname
ltx/en_us_barrett/me.m02.d21:meVE.Stichera01.incipit	Father Timothy of godly mind…
ltx/en_us_barrett/me.m02.d21:meVE.Stichera01.melody	@ltx/en_us_barrett/he.a.m8:heAU.OTouParadoxou.name
ltx/en_us_barrett/me.m02.d21:meVE.Stichera01.mode	@ltx/en_us_barrett/miscellanea:misc.Mode8
ltx/en_us_barrett/me.m02.d21:meVE.Stichera01.text	Father Timothy of godly mind, through your vast store of self-control, and a practice of constant prayer, utterly you did destroy untrained passions’ unruliness, and you obtained the grace of dispassion, the divine spirit’s vessel you thus became, ever did you expel all the evil spirits that did afflict us while you lived and after death, O blessed man of God.
ltx/en_us_barrett/me.m02.d21:meVE.Stichera02.incipit	Father Timothy of godly mind…
ltx/en_us_barrett/me.m02.d21:meVE.Stichera02.melody	@ltx/en_us_barrett/he.a.m8:heAU.OTouParadoxou.name
ltx/en_us_barrett/me.m02.d21:meVE.Stichera02.mode	@ltx/en_us_barrett/miscellanea:misc.Mode8
ltx/en_us_barrett/me.m02.d21:meVE.Stichera02.text	Father Timothy of godly mind, Abraham’s imitator and truthful instructor, and a constant healer of all those fleeing unto you, you held Job’s constancy through your godly pains, and David’s meekness you ever strove to keep, on earth you made your life equal to the angels’, and you did obtain holiness’ pinnacle while interceding for us.
ltx/en_us_barrett/me.m02.d21:meVE.Stichera03.incipit	Father Timothy, the godly priest…
ltx/en_us_barrett/me.m02.d21:meVE.Stichera03.melody	@ltx/en_us_barrett/he.a.m8:heAU.OTouParadoxou.name
ltx/en_us_barrett/me.m02.d21:meVE.Stichera03.mode	@ltx/en_us_barrett/miscellanea:misc.Mode8
ltx/en_us_barrett/me.m02.d21:meVE.Stichera03.text	Father Timothy, the godly priest, icon of discretion, illustration of self-control, paragon of piety, spring abundant of conscience, unshaken pillar of Orthodoxy, stream ever-flowing of healing medicines, sun that never sets, child of grace divine, you were seen thus to be monasticism’s pride and joy, O most pious saint.
