ltx/en_us_barrett/properties:contact.address_1	
ltx/en_us_barrett/properties:contact.address_2	
ltx/en_us_barrett/properties:contact.address_3	
ltx/en_us_barrett/properties:contact.email	richardtenor@gmail.com
ltx/en_us_barrett/properties:contact.phone	
ltx/en_us_barrett/properties:deprecated.key	This key is no longer used.
ltx/en_us_barrett/properties:media.key	For media only.
ltx/en_us_barrett/properties:version.copyright1	Copyright © 2019 by Richard Barrett
ltx/en_us_barrett/properties:version.copyright2	Used by permission.
ltx/en_us_barrett/properties:version.copyright3	
ltx/en_us_barrett/properties:version.designation	RB
ltx/en_us_barrett/properties:version.name	Richard Barrett.
ltx/en_us_barrett/properties:version.notice1	
ltx/en_us_barrett/properties:version.translator	Translated by Richard Barrett
