ltx/en_us_andronache/me.m07.d30:meMA.C1.acrostic.notice1	
ltx/en_us_andronache/me.m07.d30:meMA.C1.acrostic.text	
ltx/en_us_andronache/me.m07.d30:meMA.C1.acrostic.title	Canon for the Apostles.
ltx/en_us_andronache/me.m07.d30:meMA.Ode1C11.greekmelody	@ltx/en_us_andronache/he.h.m2:heHE.ToTinAvaton.greekname
ltx/en_us_andronache/me.m07.d30:meMA.Ode1C11.incipit	Always standing by the divine…
ltx/en_us_andronache/me.m07.d30:meMA.Ode1C11.melody	@ltx/en_us_andronache/he.h.m2:heHE.ToTinAvaton.notmetered
ltx/en_us_andronache/me.m07.d30:meMA.Ode1C11.mode	@ltx/en_us_andronache/miscellanea:misc.Mode2
ltx/en_us_andronache/me.m07.d30:meMA.Ode1C11.ode	@ltx/en_us_andronache/miscellanea:misc.Ode1
ltx/en_us_andronache/me.m07.d30:meMA.Ode1C11.text	Always standing by the divine throne and illumined by the unsetting light, O saints, intercede that spiritual light be sent from the Father of lights to all of us who faithfully honor you.
ltx/en_us_andronache/me.m07.d30:meMA.Ode1C12.incipit	Glorious ones, beholding the sun…
ltx/en_us_andronache/me.m07.d30:meMA.Ode1C12.melody	@ltx/en_us_andronache/he.h.m2:heHE.ToTinAvaton.notmetered
ltx/en_us_andronache/me.m07.d30:meMA.Ode1C12.mode	@ltx/en_us_andronache/miscellanea:misc.Mode2
ltx/en_us_andronache/me.m07.d30:meMA.Ode1C12.ode	@ltx/en_us_andronache/miscellanea:misc.Ode1
ltx/en_us_andronache/me.m07.d30:meMA.Ode1C12.text	Glorious ones, beholding the sun of righteousness who had shone forth from the the divine child and maiden, you were united with Him, changed to be light by divine participation, and drove away all the darkness of deceit.
ltx/en_us_andronache/me.m07.d30:meMA.Ode1C13.incipit	Bearing the divine law on…
ltx/en_us_andronache/me.m07.d30:meMA.Ode1C13.melody	@ltx/en_us_andronache/he.h.m2:heHE.ToTinAvaton.notmetered
ltx/en_us_andronache/me.m07.d30:meMA.Ode1C13.mode	@ltx/en_us_andronache/miscellanea:misc.Mode2
ltx/en_us_andronache/me.m07.d30:meMA.Ode1C13.ode	@ltx/en_us_andronache/miscellanea:misc.Ode1
ltx/en_us_andronache/me.m07.d30:meMA.Ode1C13.text	Bearing the divine law on your lips, you went through all the earth destroying its lawlessness, wise ones, Crescos, Andronicos, Silas, and Silouan, and sowing the knowledge of salvation.
ltx/en_us_andronache/me.m07.d30:meMA.Ode1C14.incipit	Let us send up praises…
ltx/en_us_andronache/me.m07.d30:meMA.Ode1C14.melody	@ltx/en_us_andronache/he.h.m2:heHE.ToTinAvaton.notmetered
ltx/en_us_andronache/me.m07.d30:meMA.Ode1C14.mode	@ltx/en_us_andronache/miscellanea:misc.Mode2
ltx/en_us_andronache/me.m07.d30:meMA.Ode1C14.ode	@ltx/en_us_andronache/miscellanea:misc.Ode1
ltx/en_us_andronache/me.m07.d30:meMA.Ode1C14.text	Let us send up praises to Epenetus the glorious, who has become the divine adornment of the Carthaginians, the disciple of the Logos, fountain of healings and great preacher of things beyond thought and the support of the faith.
ltx/en_us_andronache/me.m07.d30:meMA.Ode1C1T.incipit	Exceedingly extolled pure one, you…
ltx/en_us_andronache/me.m07.d30:meMA.Ode1C1T.melody	@ltx/en_us_andronache/he.h.m2:heHE.ToTinAvaton.notmetered
ltx/en_us_andronache/me.m07.d30:meMA.Ode1C1T.mode	@ltx/en_us_andronache/miscellanea:misc.Mode2
ltx/en_us_andronache/me.m07.d30:meMA.Ode1C1T.ode	@ltx/en_us_andronache/miscellanea:misc.Ode1
ltx/en_us_andronache/me.m07.d30:meMA.Ode1C1T.text	Exceedingly extolled pure one, you gave birth to the exceedingly-extolled God in an inexpressible manner, Who, because of His goodness, is wearing flesh from you. Therefore we sing to you with our voices in thanksgiving and we bless you as you had foretold of old.
ltx/en_us_andronache/me.m07.d30:meMA.Ode3C11.greekmelody	@ltx/en_us_andronache/he.h.m2:heHE.EnPetraMeTisPisteos.greekname
ltx/en_us_andronache/me.m07.d30:meMA.Ode3C11.incipit	Wise ones and great preachers…
ltx/en_us_andronache/me.m07.d30:meMA.Ode3C11.melody	@ltx/en_us_andronache/he.h.m2:heHE.EnPetraMeTisPisteos.notmetered
ltx/en_us_andronache/me.m07.d30:meMA.Ode3C11.mode	@ltx/en_us_andronache/miscellanea:misc.Mode2
ltx/en_us_andronache/me.m07.d30:meMA.Ode3C11.ode	@ltx/en_us_andronache/miscellanea:misc.Ode3
ltx/en_us_andronache/me.m07.d30:meMA.Ode3C11.text	Wise ones and great preachers, by preaching the enfleshment of the Master and loosing the bonds of evil you loosed those who were bound of old through unbelief and turned them to God through faith.
ltx/en_us_andronache/me.m07.d30:meMA.Ode3C12.incipit	Having become lanterns of the…
ltx/en_us_andronache/me.m07.d30:meMA.Ode3C12.melody	@ltx/en_us_andronache/he.h.m2:heHE.EnPetraMeTisPisteos.notmetered
ltx/en_us_andronache/me.m07.d30:meMA.Ode3C12.mode	@ltx/en_us_andronache/miscellanea:misc.Mode2
ltx/en_us_andronache/me.m07.d30:meMA.Ode3C12.ode	@ltx/en_us_andronache/miscellanea:misc.Ode3
ltx/en_us_andronache/me.m07.d30:meMA.Ode3C12.text	Having become lanterns of the unsetting lamp, you drove away the darkness of ungodliness, showing to the people the light of knowledge, all honored ones. Therefore you are always blessed.
ltx/en_us_andronache/me.m07.d30:meMA.Ode3C13.incipit	The divine voice of the…
ltx/en_us_andronache/me.m07.d30:meMA.Ode3C13.melody	@ltx/en_us_andronache/he.h.m2:heHE.EnPetraMeTisPisteos.notmetered
ltx/en_us_andronache/me.m07.d30:meMA.Ode3C13.mode	@ltx/en_us_andronache/miscellanea:misc.Mode2
ltx/en_us_andronache/me.m07.d30:meMA.Ode3C13.ode	@ltx/en_us_andronache/miscellanea:misc.Ode3
ltx/en_us_andronache/me.m07.d30:meMA.Ode3C13.text	The divine voice of the apostles went into all the earth as David sings, teaching the Passion of the Savior and the Resurrection through which we were all raised up from the graves of vanity.
ltx/en_us_andronache/me.m07.d30:meMA.Ode3C1T.incipit	When He found you purer…
ltx/en_us_andronache/me.m07.d30:meMA.Ode3C1T.melody	@ltx/en_us_andronache/he.h.m2:heHE.EnPetraMeTisPisteos.notmetered
ltx/en_us_andronache/me.m07.d30:meMA.Ode3C1T.mode	@ltx/en_us_andronache/miscellanea:misc.Mode2
ltx/en_us_andronache/me.m07.d30:meMA.Ode3C1T.ode	@ltx/en_us_andronache/miscellanea:misc.Ode3
ltx/en_us_andronache/me.m07.d30:meMA.Ode3C1T.text	When He found you purer than the angels, the one who abides in unapproachable light entered your holy womb, P Theotokos, and He was seen as human, taking flesh from you, and being known in two natures.
ltx/en_us_andronache/me.m07.d30:meMA.Ode3Kathisma1.greekmelody	@ltx/en_us_andronache/he.a.m4:heAU.EpefanisSimeron.greekname
ltx/en_us_andronache/me.m07.d30:meMA.Ode3Kathisma1.incipit	As great lights illuminating the…
ltx/en_us_andronache/me.m07.d30:meMA.Ode3Kathisma1.melody	@ltx/en_us_andronache/he.a.m4:heAU.EpefanisSimeron.notmetered
ltx/en_us_andronache/me.m07.d30:meMA.Ode3Kathisma1.mode	@ltx/en_us_andronache/miscellanea:misc.Mode4
ltx/en_us_andronache/me.m07.d30:meMA.Ode3Kathisma1.text	As great lights illuminating the world with the light of piety, you are forever glorified, wonderworking apostles of the Lord.
ltx/en_us_andronache/me.m07.d30:meMA.Ode4C11.greekmelody	@ltx/en_us_andronache/he.h.m2:heHE.YmnoSeAkoi.greekname
ltx/en_us_andronache/me.m07.d30:meMA.Ode4C11.incipit	By the might of the…
ltx/en_us_andronache/me.m07.d30:meMA.Ode4C11.melody	@ltx/en_us_andronache/he.h.m2:heHE.YmnoSeAkoi.notmetered
ltx/en_us_andronache/me.m07.d30:meMA.Ode4C11.mode	@ltx/en_us_andronache/miscellanea:misc.Mode2
ltx/en_us_andronache/me.m07.d30:meMA.Ode4C11.ode	@ltx/en_us_andronache/miscellanea:misc.Ode4
ltx/en_us_andronache/me.m07.d30:meMA.Ode4C11.text	By the might of the Creator of all, having gone through all the world as if carried on wings, you saved those in terrible danger at sea, God-bearers, and you guided them to a calm haven.
ltx/en_us_andronache/me.m07.d30:meMA.Ode4C12.incipit	Making minds steadfast by your…
ltx/en_us_andronache/me.m07.d30:meMA.Ode4C12.melody	@ltx/en_us_andronache/he.h.m2:heHE.YmnoSeAkoi.notmetered
ltx/en_us_andronache/me.m07.d30:meMA.Ode4C12.mode	@ltx/en_us_andronache/miscellanea:misc.Mode2
ltx/en_us_andronache/me.m07.d30:meMA.Ode4C12.ode	@ltx/en_us_andronache/miscellanea:misc.Ode4
ltx/en_us_andronache/me.m07.d30:meMA.Ode4C12.text	Making minds steadfast by your word, glorious Silas, you went with Paul the herald into all the world, being submerged in many trials, and clearly proclaiming the Savior to all.
ltx/en_us_andronache/me.m07.d30:meMA.Ode4C13.incipit	Being adorned with the greatest…
ltx/en_us_andronache/me.m07.d30:meMA.Ode4C13.melody	@ltx/en_us_andronache/he.h.m2:heHE.YmnoSeAkoi.notmetered
ltx/en_us_andronache/me.m07.d30:meMA.Ode4C13.mode	@ltx/en_us_andronache/miscellanea:misc.Mode2
ltx/en_us_andronache/me.m07.d30:meMA.Ode4C13.ode	@ltx/en_us_andronache/miscellanea:misc.Ode4
ltx/en_us_andronache/me.m07.d30:meMA.Ode4C13.text	Being adorned with the greatest goods, having journeyed together with Paul from East to West as a ray shining bright from the sun, wise Silas, you illumined the hearts of the nations.
ltx/en_us_andronache/me.m07.d30:meMA.Ode4C14.incipit	Let Crescens and Andronicos be…
ltx/en_us_andronache/me.m07.d30:meMA.Ode4C14.melody	@ltx/en_us_andronache/he.h.m2:heHE.YmnoSeAkoi.notmetered
ltx/en_us_andronache/me.m07.d30:meMA.Ode4C14.mode	@ltx/en_us_andronache/miscellanea:misc.Mode2
ltx/en_us_andronache/me.m07.d30:meMA.Ode4C14.ode	@ltx/en_us_andronache/miscellanea:misc.Ode4
ltx/en_us_andronache/me.m07.d30:meMA.Ode4C14.text	Let Crescens and Andronicos be praised and with Silas let Silouan be magnified today, and let Epenetos be commended for having become clusters of grapes of the vineyard of Christ, dripping the sweet new wine of salvation.
ltx/en_us_andronache/me.m07.d30:meMA.Ode4C1T.incipit	The miracle that took place…
ltx/en_us_andronache/me.m07.d30:meMA.Ode4C1T.melody	@ltx/en_us_andronache/he.h.m2:heHE.YmnoSeAkoi.notmetered
ltx/en_us_andronache/me.m07.d30:meMA.Ode4C1T.mode	@ltx/en_us_andronache/miscellanea:misc.Mode2
ltx/en_us_andronache/me.m07.d30:meMA.Ode4C1T.ode	@ltx/en_us_andronache/miscellanea:misc.Ode4
ltx/en_us_andronache/me.m07.d30:meMA.Ode4C1T.text	The miracle that took place in you was by nature greater than all miracles, for without that which is usual to nature, you gave birth to Christ, the giver of the law, who undoes the transgression of the forefathers, all blameless one.
ltx/en_us_andronache/me.m07.d30:meMA.Ode5C11.greekmelody	@ltx/en_us_andronache/he.h.m2:heHE.OFotismos.greekname
ltx/en_us_andronache/me.m07.d30:meMA.Ode5C11.incipit	The brilliance of your disciples…
ltx/en_us_andronache/me.m07.d30:meMA.Ode5C11.melody	@ltx/en_us_andronache/he.h.m2:heHE.OFotismos.notmetered
ltx/en_us_andronache/me.m07.d30:meMA.Ode5C11.mode	@ltx/en_us_andronache/miscellanea:misc.Mode2
ltx/en_us_andronache/me.m07.d30:meMA.Ode5C11.ode	@ltx/en_us_andronache/miscellanea:misc.Ode5
ltx/en_us_andronache/me.m07.d30:meMA.Ode5C11.text	The brilliance of your disciples went above the heavens, as they preached to those on earth your pure coming and passion and resurrection, O Logos of God, transcendently-good Jesus.
ltx/en_us_andronache/me.m07.d30:meMA.Ode5C12.incipit	We praise the wise Silouan…
ltx/en_us_andronache/me.m07.d30:meMA.Ode5C12.melody	@ltx/en_us_andronache/he.h.m2:heHE.OFotismos.notmetered
ltx/en_us_andronache/me.m07.d30:meMA.Ode5C12.mode	@ltx/en_us_andronache/miscellanea:misc.Mode2
ltx/en_us_andronache/me.m07.d30:meMA.Ode5C12.ode	@ltx/en_us_andronache/miscellanea:misc.Ode5
ltx/en_us_andronache/me.m07.d30:meMA.Ode5C12.text	We praise the wise Silouan, the translucent and most luminous vessel of the Spirit, the guide of those deceived, the glorious boast of Thessalonica, the ornament of the apostles.
ltx/en_us_andronache/me.m07.d30:meMA.Ode5C13.incipit	You were made bold, according…
ltx/en_us_andronache/me.m07.d30:meMA.Ode5C13.melody	@ltx/en_us_andronache/he.h.m2:heHE.OFotismos.notmetered
ltx/en_us_andronache/me.m07.d30:meMA.Ode5C13.mode	@ltx/en_us_andronache/miscellanea:misc.Mode2
ltx/en_us_andronache/me.m07.d30:meMA.Ode5C13.ode	@ltx/en_us_andronache/miscellanea:misc.Ode5
ltx/en_us_andronache/me.m07.d30:meMA.Ode5C13.text	You were made bold, according to your the name by the alliance of the Logos; all wise Andronicos you look into the hearts weakened by assaults of the adversary, strengthening them and guiding them with light to the understanding of God.
ltx/en_us_andronache/me.m07.d30:meMA.Ode5C1T.incipit	David wrote of you, a…
ltx/en_us_andronache/me.m07.d30:meMA.Ode5C1T.melody	@ltx/en_us_andronache/he.h.m2:heHE.OFotismos.notmetered
ltx/en_us_andronache/me.m07.d30:meMA.Ode5C1T.mode	@ltx/en_us_andronache/miscellanea:misc.Mode2
ltx/en_us_andronache/me.m07.d30:meMA.Ode5C1T.ode	@ltx/en_us_andronache/miscellanea:misc.Ode5
ltx/en_us_andronache/me.m07.d30:meMA.Ode5C1T.text	David wrote of you, a curdled mountain, mountain of our God, mountain of butter for in you, maiden, His visitation was made known, in which he was impoverished in the flesh and by which He restored us to the first state.
ltx/en_us_andronache/me.m07.d30:meMA.Ode6C11.greekmelody	@ltx/en_us_andronache/he.h.m2:heHE.ProsKyrionEkKitous.greekname
ltx/en_us_andronache/me.m07.d30:meMA.Ode6C11.incipit	Wise ones, being lifted up…
ltx/en_us_andronache/me.m07.d30:meMA.Ode6C11.melody	@ltx/en_us_andronache/he.h.m2:heHE.ProsKyrionEkKitous.notmetered
ltx/en_us_andronache/me.m07.d30:meMA.Ode6C11.mode	@ltx/en_us_andronache/miscellanea:misc.Mode2
ltx/en_us_andronache/me.m07.d30:meMA.Ode6C11.ode	@ltx/en_us_andronache/miscellanea:misc.Ode6
ltx/en_us_andronache/me.m07.d30:meMA.Ode6C11.text	Wise ones, being lifted up towards the Lord by pure union, you dragged those bowed down in the pits of destruction towards the heavenly height of lofty contemplation and practice.
ltx/en_us_andronache/me.m07.d30:meMA.Ode6C12.incipit	Blessed ones of God, you…
ltx/en_us_andronache/me.m07.d30:meMA.Ode6C12.melody	@ltx/en_us_andronache/he.h.m2:heHE.ProsKyrionEkKitous.notmetered
ltx/en_us_andronache/me.m07.d30:meMA.Ode6C12.mode	@ltx/en_us_andronache/miscellanea:misc.Mode2
ltx/en_us_andronache/me.m07.d30:meMA.Ode6C12.ode	@ltx/en_us_andronache/miscellanea:misc.Ode6
ltx/en_us_andronache/me.m07.d30:meMA.Ode6C12.text	Blessed ones of God, you preached to the ends of the world a Unity in essence but Trinity in persons, loosening completely the darkness of polytheism and being shown to be lamps unto souls.
ltx/en_us_andronache/me.m07.d30:meMA.Ode6C13.incipit	With Christ inspiring your reasoning…
ltx/en_us_andronache/me.m07.d30:meMA.Ode6C13.melody	@ltx/en_us_andronache/he.h.m2:heHE.ProsKyrionEkKitous.notmetered
ltx/en_us_andronache/me.m07.d30:meMA.Ode6C13.mode	@ltx/en_us_andronache/miscellanea:misc.Mode2
ltx/en_us_andronache/me.m07.d30:meMA.Ode6C13.ode	@ltx/en_us_andronache/miscellanea:misc.Ode6
ltx/en_us_andronache/me.m07.d30:meMA.Ode6C13.text	With Christ inspiring your reasoning, all wise Crescens, He sent you in piety as the arch-pastor of Karthage in Gaul as His disciple, to show the path to those deceived.
ltx/en_us_andronache/me.m07.d30:meMA.Ode6C1T.incipit	Having found you fair in…
ltx/en_us_andronache/me.m07.d30:meMA.Ode6C1T.melody	@ltx/en_us_andronache/he.h.m2:heHE.ProsKyrionEkKitous.notmetered
ltx/en_us_andronache/me.m07.d30:meMA.Ode6C1T.mode	@ltx/en_us_andronache/miscellanea:misc.Mode2
ltx/en_us_andronache/me.m07.d30:meMA.Ode6C1T.ode	@ltx/en_us_andronache/miscellanea:misc.Ode6
ltx/en_us_andronache/me.m07.d30:meMA.Ode6C1T.text	Having found you fair in beauty, the Creator dwelt in you and He was seen with a body, beautiful above all the sons born on earth, all hymned and all holy Virgin.
ltx/en_us_andronache/me.m07.d30:meMA.Ode7C11.greekmelody	@ltx/en_us_andronache/he.h.m2:heHE.RitoresAnedeichthisanPaides.greekname
ltx/en_us_andronache/me.m07.d30:meMA.Ode7C11.incipit	Inspired by God we hymn…
ltx/en_us_andronache/me.m07.d30:meMA.Ode7C11.melody	@ltx/en_us_andronache/he.h.m2:heHE.RitoresAnedeichthisanPaides.notmetered
ltx/en_us_andronache/me.m07.d30:meMA.Ode7C11.mode	@ltx/en_us_andronache/miscellanea:misc.Mode2
ltx/en_us_andronache/me.m07.d30:meMA.Ode7C11.ode	@ltx/en_us_andronache/miscellanea:misc.Ode7
ltx/en_us_andronache/me.m07.d30:meMA.Ode7C11.text	Inspired by God we hymn Silas and Silouan, the vessels which contained all the grace of the Paraclete and brought those who had became the vessels of deceit to be acceptable to God.
ltx/en_us_andronache/me.m07.d30:meMA.Ode7C12.incipit	There is no befitting praise…
ltx/en_us_andronache/me.m07.d30:meMA.Ode7C12.melody	@ltx/en_us_andronache/he.h.m2:heHE.RitoresAnedeichthisanPaides.notmetered
ltx/en_us_andronache/me.m07.d30:meMA.Ode7C12.mode	@ltx/en_us_andronache/miscellanea:misc.Mode2
ltx/en_us_andronache/me.m07.d30:meMA.Ode7C12.ode	@ltx/en_us_andronache/miscellanea:misc.Ode7
ltx/en_us_andronache/me.m07.d30:meMA.Ode7C12.text	There is no befitting praise for Epenetus the wonderworker. He was made to be in the image of Christ through withstanding the sufferings for His sake, and became a co-dweller of His kingdom, having contested well.
ltx/en_us_andronache/me.m07.d30:meMA.Ode7C13.incipit	Let Crescens be hymned with…
ltx/en_us_andronache/me.m07.d30:meMA.Ode7C13.melody	@ltx/en_us_andronache/he.h.m2:heHE.RitoresAnedeichthisanPaides.notmetered
ltx/en_us_andronache/me.m07.d30:meMA.Ode7C13.mode	@ltx/en_us_andronache/miscellanea:misc.Mode2
ltx/en_us_andronache/me.m07.d30:meMA.Ode7C13.ode	@ltx/en_us_andronache/miscellanea:misc.Ode7
ltx/en_us_andronache/me.m07.d30:meMA.Ode7C13.text	Let Crescens be hymned with divine songs, who taught the hidden the ways which taught of Christ, and condemned in his flesh the condemnable sin and showed many to be uncondemned.
ltx/en_us_andronache/me.m07.d30:meMA.Ode7C1T.incipit	Loose the cords of error…
ltx/en_us_andronache/me.m07.d30:meMA.Ode7C1T.melody	@ltx/en_us_andronache/he.h.m2:heHE.RitoresAnedeichthisanPaides.notmetered
ltx/en_us_andronache/me.m07.d30:meMA.Ode7C1T.mode	@ltx/en_us_andronache/miscellanea:misc.Mode2
ltx/en_us_andronache/me.m07.d30:meMA.Ode7C1T.ode	@ltx/en_us_andronache/miscellanea:misc.Ode7
ltx/en_us_andronache/me.m07.d30:meMA.Ode7C1T.text	Loose the cords of error by your mediation, Pure one, and bind me perfectly to the love of your good Son, though I am keeping far from Him by foul pleasures
ltx/en_us_andronache/me.m07.d30:meMA.Ode8C11.greekmelody	@ltx/en_us_andronache/he.h.m2:heHE.ToDogmatiToTyranniko.greekname
ltx/en_us_andronache/me.m07.d30:meMA.Ode8C11.incipit	The vigilant servants of the…
ltx/en_us_andronache/me.m07.d30:meMA.Ode8C11.melody	@ltx/en_us_andronache/he.h.m2:heHE.ToDogmatiToTyranniko.notmetered
ltx/en_us_andronache/me.m07.d30:meMA.Ode8C11.mode	@ltx/en_us_andronache/miscellanea:misc.Mode2
ltx/en_us_andronache/me.m07.d30:meMA.Ode8C11.ode	@ltx/en_us_andronache/miscellanea:misc.Ode8
ltx/en_us_andronache/me.m07.d30:meMA.Ode8C11.text	The vigilant servants of the Logos did not give sleep to their eyes, until they freed the faithful from the weight of the sleep of error and showed them to be sons of the light and of the day.
ltx/en_us_andronache/me.m07.d30:meMA.Ode8C12.incipit	You, having become a chariot…
ltx/en_us_andronache/me.m07.d30:meMA.Ode8C12.melody	@ltx/en_us_andronache/he.h.m2:heHE.ToDogmatiToTyranniko.notmetered
ltx/en_us_andronache/me.m07.d30:meMA.Ode8C12.mode	@ltx/en_us_andronache/miscellanea:misc.Mode2
ltx/en_us_andronache/me.m07.d30:meMA.Ode8C12.ode	@ltx/en_us_andronache/miscellanea:misc.Ode8
ltx/en_us_andronache/me.m07.d30:meMA.Ode8C12.text	You, having become a chariot of God, you had him guiding us to the heavenly winning post and shattering the chariots of deceit, glorious apostles.
ltx/en_us_andronache/me.m07.d30:meMA.Ode8C13.incipit	The all wise Silas is…
ltx/en_us_andronache/me.m07.d30:meMA.Ode8C13.melody	@ltx/en_us_andronache/he.h.m2:heHE.ToDogmatiToTyranniko.notmetered
ltx/en_us_andronache/me.m07.d30:meMA.Ode8C13.mode	@ltx/en_us_andronache/miscellanea:misc.Mode2
ltx/en_us_andronache/me.m07.d30:meMA.Ode8C13.ode	@ltx/en_us_andronache/miscellanea:misc.Ode8
ltx/en_us_andronache/me.m07.d30:meMA.Ode8C13.text	The all wise Silas is worthily praised as a servant of Christ and with him Crescens and Andronikos, the bright lamps who illumined all the nations, are faithfully glorified.
ltx/en_us_andronache/me.m07.d30:meMA.Ode8C1Tr.incipit	Let us hymn the life-originating…
ltx/en_us_andronache/me.m07.d30:meMA.Ode8C1Tr.melody	@ltx/en_us_andronache/he.h.m2:heHE.ToDogmatiToTyranniko.notmetered
ltx/en_us_andronache/me.m07.d30:meMA.Ode8C1Tr.mode	@ltx/en_us_andronache/miscellanea:misc.Mode2
ltx/en_us_andronache/me.m07.d30:meMA.Ode8C1Tr.ode	@ltx/en_us_andronache/miscellanea:misc.Ode8
ltx/en_us_andronache/me.m07.d30:meMA.Ode8C1Tr.text	Let us hymn the life-originating Trinity being in three persons but known as one essence, and let us say, chanting: all the works of the Lord, bless the Lord.
ltx/en_us_andronache/me.m07.d30:meMA.Ode9C11.greekmelody	@ltx/en_us_andronache/he.h.m2:heHE.ITonProIliouFostira.greekname
ltx/en_us_andronache/me.m07.d30:meMA.Ode9C11.incipit	You became doctors of souls…
ltx/en_us_andronache/me.m07.d30:meMA.Ode9C11.melody	@ltx/en_us_andronache/he.h.m2:heHE.ITonProIliouFostira.notmetered
ltx/en_us_andronache/me.m07.d30:meMA.Ode9C11.mode	@ltx/en_us_andronache/miscellanea:misc.Mode2
ltx/en_us_andronache/me.m07.d30:meMA.Ode9C11.ode	@ltx/en_us_andronache/miscellanea:misc.Ode9
ltx/en_us_andronache/me.m07.d30:meMA.Ode9C11.text	You became doctors of souls and saviors of bodies, curing the afflicted by spiritual medicines and showing them healthy in both, God-illumined apostles. Therefore you are worthily called blessed.
ltx/en_us_andronache/me.m07.d30:meMA.Ode9C12.incipit	You were seen being lit…
ltx/en_us_andronache/me.m07.d30:meMA.Ode9C12.melody	@ltx/en_us_andronache/he.h.m2:heHE.ITonProIliouFostira.notmetered
ltx/en_us_andronache/me.m07.d30:meMA.Ode9C12.mode	@ltx/en_us_andronache/miscellanea:misc.Mode2
ltx/en_us_andronache/me.m07.d30:meMA.Ode9C12.ode	@ltx/en_us_andronache/miscellanea:misc.Ode9
ltx/en_us_andronache/me.m07.d30:meMA.Ode9C12.text	You were seen being lit as fires by the warmth of the Spirit and you loosed the frost of deceit and by faith you defrosted frozen hearts and led them to the to the spring of salvation, all wise ones.
ltx/en_us_andronache/me.m07.d30:meMA.Ode9C13.incipit	Let us stand in choir…
ltx/en_us_andronache/me.m07.d30:meMA.Ode9C13.melody	@ltx/en_us_andronache/he.h.m2:heHE.ITonProIliouFostira.notmetered
ltx/en_us_andronache/me.m07.d30:meMA.Ode9C13.mode	@ltx/en_us_andronache/miscellanea:misc.Mode2
ltx/en_us_andronache/me.m07.d30:meMA.Ode9C13.ode	@ltx/en_us_andronache/miscellanea:misc.Ode9
ltx/en_us_andronache/me.m07.d30:meMA.Ode9C13.text	Let us stand in choir in the house of our God, glorifying Silouan and Silas and Andronikos and the great Epenetos and Crescens the all wise as preachers of truth and intercessors for us.
ltx/en_us_andronache/me.m07.d30:meMA.Ode9C14.incipit	Your memorial is kept most…
ltx/en_us_andronache/me.m07.d30:meMA.Ode9C14.melody	@ltx/en_us_andronache/he.h.m2:heHE.ITonProIliouFostira.notmetered
ltx/en_us_andronache/me.m07.d30:meMA.Ode9C14.mode	@ltx/en_us_andronache/miscellanea:misc.Mode2
ltx/en_us_andronache/me.m07.d30:meMA.Ode9C14.ode	@ltx/en_us_andronache/miscellanea:misc.Ode9
ltx/en_us_andronache/me.m07.d30:meMA.Ode9C14.text	Your memorial is kept most holy and full of the gifts of the Holy Spirit and hallowed and truly praiseworthy, as it illumines the fullness of the faithful by divine rays and we are compelled to hymn you, wise ones.
ltx/en_us_andronache/me.m07.d30:meMA.Ode9C1T.incipit	Almighty one who will again…
ltx/en_us_andronache/me.m07.d30:meMA.Ode9C1T.melody	@ltx/en_us_andronache/he.h.m2:heHE.ITonProIliouFostira.notmetered
ltx/en_us_andronache/me.m07.d30:meMA.Ode9C1T.mode	@ltx/en_us_andronache/miscellanea:misc.Mode2
ltx/en_us_andronache/me.m07.d30:meMA.Ode9C1T.ode	@ltx/en_us_andronache/miscellanea:misc.Ode9
ltx/en_us_andronache/me.m07.d30:meMA.Ode9C1T.text	Almighty one who will again come in glory in Your divinity to judge the world, spare me by the intercessions of the one why gave birth to You, Master, without the help of man, and do not send me out into the fire, even though I am self-convicted by sins.
