ltx/en_us_andronache/me.m09.d07:alt1.meDA.commemoration.first_name	
ltx/en_us_andronache/me.m09.d07:alt1.meDA.commemoration.first_short	Devout St. Kassiane the Hymnographer
ltx/en_us_andronache/me.m09.d07:alt1.meDA.commemoration.first_title	
ltx/en_us_andronache/me.m09.d07:alt1.meDA.commemoration.full	Memory of our Devout Mother Kassiane the Hymnographer
ltx/en_us_andronache/me.m09.d07:alt1.meDA.commemoration.second_name	
ltx/en_us_andronache/me.m09.d07:alt1.meDA.commemoration.second_title	
ltx/en_us_andronache/me.m09.d07:alt1.meDA.date	September 7
ltx/en_us_andronache/me.m09.d07:alt1.meDA.insert1	our devout mother Kassiane the hymnographer,
ltx/en_us_andronache/me.m09.d07:alt1.meDA.insert2	whose memory we observe,
ltx/en_us_andronache/me.m09.d07:alt1.meLI.Kontakion1.incipit	@ltx/en_us_andronache/me.m09.d07:alt1.meMA.Kontakion1.incipit
ltx/en_us_andronache/me.m09.d07:alt1.meLI.Kontakion1.melody	@ltx/en_us_andronache/me.m09.d07:alt1.meMA.Kontakion1.melody
ltx/en_us_andronache/me.m09.d07:alt1.meLI.Kontakion1.mode	@ltx/en_us_andronache/me.m09.d07:alt1.meMA.Kontakion1.mode
ltx/en_us_andronache/me.m09.d07:alt1.meLI.Kontakion1.text	@ltx/en_us_andronache/me.m09.d07:alt1.meMA.Kontakion1.text
ltx/en_us_andronache/me.m09.d07:alt1.meMA.ExapTheotokion.incipit	With joy we celebrate today…
ltx/en_us_andronache/me.m09.d07:alt1.meMA.ExapTheotokion.melody	@ltx/en_us_andronache/he.a.m2:heAU.GynaikesAkoutisthite.name
ltx/en_us_andronache/me.m09.d07:alt1.meMA.ExapTheotokion.mode	@ltx/en_us_andronache/miscellanea:misc.Mode2
ltx/en_us_andronache/me.m09.d07:alt1.meMA.ExapTheotokion.text	With joy we celebrate today * the birth of Mary, bride of God, * daughter of holy Joachim, * and of the righteous Anna, * for she is our protection * and healer from diseases * and so with faith we cry to her * send down from heaven unto us * the joy of your Son and our God.
ltx/en_us_andronache/me.m09.d07:alt1.meMA.Exaposteilarion1.greekmelody	@ltx/en_us_andronache/he.a.m2:heAU.GynaikesAkoutisthite.greekname
ltx/en_us_andronache/me.m09.d07:alt1.meMA.Exaposteilarion1.incipit	When king Theophilos chose you…
ltx/en_us_andronache/me.m09.d07:alt1.meMA.Exaposteilarion1.melody	@ltx/en_us_andronache/he.a.m2:heAU.GynaikesAkoutisthite.name
ltx/en_us_andronache/me.m09.d07:alt1.meMA.Exaposteilarion1.mode	@ltx/en_us_andronache/miscellanea:misc.Mode2
ltx/en_us_andronache/me.m09.d07:alt1.meMA.Exaposteilarion1.text	When king Theophilos chose you * to be his queen and consort * you answered no and gave yourself * to your Lord God and Bridegroom; * in labor and repentance * you climbed the ladder rung by rung * unto the height of heaven * and rejoice in the presence * of the saints and the angels.
ltx/en_us_andronache/me.m09.d07:alt1.meMA.Kathisma11.greekmelody	@ltx/en_us_andronache/he.a.m1:heAU.TonTafonSouSotir.greekname
ltx/en_us_andronache/me.m09.d07:alt1.meMA.Kathisma11.incipit	As never-setting star…
ltx/en_us_andronache/me.m09.d07:alt1.meMA.Kathisma11.melody	@ltx/en_us_andronache/he.a.m1:heAU.TonTafonSouSotir.name
ltx/en_us_andronache/me.m09.d07:alt1.meMA.Kathisma11.mode	@ltx/en_us_andronache/miscellanea:misc.Mode1
ltx/en_us_andronache/me.m09.d07:alt1.meMA.Kathisma11.text	As never-setting star * of salvific repentance, * bright light of grace divine * and companion of angels * bring light to our hearts we pray* with the light of the Spirit * and unbind the chains * of the passions which keep us * enslaved and torment us * for we honor your memory.* truly happy Kassiane.
ltx/en_us_andronache/me.m09.d07:alt1.meMA.Kathisma12.greekmelody	@ltx/en_us_andronache/he.a.m1:heAU.TonTafonSouSotir.greekname
ltx/en_us_andronache/me.m09.d07:alt1.meMA.Kathisma12.incipit	You are the shining fruit…
ltx/en_us_andronache/me.m09.d07:alt1.meMA.Kathisma12.melody	@ltx/en_us_andronache/he.a.m1:heAU.TonTafonSouSotir.name
ltx/en_us_andronache/me.m09.d07:alt1.meMA.Kathisma12.mode	@ltx/en_us_andronache/miscellanea:misc.Mode1
ltx/en_us_andronache/me.m09.d07:alt1.meMA.Kathisma12.text	You are the shining fruit * of the godly-minded Anna * and holy Joachim * O Virgin Theotokos. * Fill with joy by your radiant birth * those who honor you faithfully * for you are the one * from whom arose for the faithful * the hope of salvation * for those who slumber in darkness * in the bitter land of death.
ltx/en_us_andronache/me.m09.d07:alt1.meMA.Kathisma21.greekmelody	@ltx/en_us_andronache/he.a.m4:heAU.TachyProkatalave.greekname
ltx/en_us_andronache/me.m09.d07:alt1.meMA.Kathisma21.incipit	With the oil of vigilance…
ltx/en_us_andronache/me.m09.d07:alt1.meMA.Kathisma21.melody	@ltx/en_us_andronache/he.a.m4:heAU.TachyProkatalave.name
ltx/en_us_andronache/me.m09.d07:alt1.meMA.Kathisma21.mode	@ltx/en_us_andronache/miscellanea:misc.Mode4
ltx/en_us_andronache/me.m09.d07:alt1.meMA.Kathisma21.text	With the oil of vigilance, dispassion, and chastity, * O holy one you made bright the precious lamp of your soul * and now you rejoice on high * in the heavenly chambers * with the wise holy virgins. * And you exalt your Bridegroom * and beloved Lord and Master, * O holy Kassiane, our venerable mother.
ltx/en_us_andronache/me.m09.d07:alt1.meMA.Kathisma22.greekmelody	@ltx/en_us_andronache/he.a.m4:heAU.TachyProkatalave.greekname
ltx/en_us_andronache/me.m09.d07:alt1.meMA.Kathisma22.incipit	By your divine birth you…
ltx/en_us_andronache/me.m09.d07:alt1.meMA.Kathisma22.melody	@ltx/en_us_andronache/he.a.m4:heAU.TachyProkatalave.name
ltx/en_us_andronache/me.m09.d07:alt1.meMA.Kathisma22.mode	@ltx/en_us_andronache/miscellanea:misc.Mode4
ltx/en_us_andronache/me.m09.d07:alt1.meMA.Kathisma22.text	By your divine birth you brought, O Theotokos most pure, * joy unto the company of those who sing hymns to you, * all-praised Mary, virgin pure; * for in your womb you carried * the divine Son of the Father * and we cry out with fervor: * Rejoice, divine prelude * of the salvation of the world and our deliverance from death.
ltx/en_us_andronache/me.m09.d07:alt1.meMA.Kathisma31.greekmelody	@ltx/en_us_andronache/he.a.m3:heAU.TinOraiotita.greekname
ltx/en_us_andronache/me.m09.d07:alt1.meMA.Kathisma31.incipit	Blessed Kassiane, * beauty…
ltx/en_us_andronache/me.m09.d07:alt1.meMA.Kathisma31.melody	@ltx/en_us_andronache/he.a.m3:heAU.TinOraiotita.name
ltx/en_us_andronache/me.m09.d07:alt1.meMA.Kathisma31.mode	@ltx/en_us_andronache/miscellanea:misc.Mode3
ltx/en_us_andronache/me.m09.d07:alt1.meMA.Kathisma31.text	Blessed Kassiane, * beauty of women saints, * in faith and piety * you cried unto the Lord * “Accept the streams of my tears * O Lover of mankind * and turn away the pain * that now afflicts my heart * and make me worthy to embrace * your all holy and spotless feet * You who inclined the roof of heaven, * and condescended to become man.
ltx/en_us_andronache/me.m09.d07:alt1.meMA.Kathisma3T.greekmelody	@ltx/en_us_andronache/he.a.m3:heAU.TinOraiotita.greekname
ltx/en_us_andronache/me.m09.d07:alt1.meMA.Kathisma3T.incipit	O virgin Mary pure, *…
ltx/en_us_andronache/me.m09.d07:alt1.meMA.Kathisma3T.melody	@ltx/en_us_andronache/he.a.m3:heAU.TinOraiotita.name
ltx/en_us_andronache/me.m09.d07:alt1.meMA.Kathisma3T.mode	@ltx/en_us_andronache/miscellanea:misc.Mode3
ltx/en_us_andronache/me.m09.d07:alt1.meMA.Kathisma3T.text	O virgin Mary pure, * my soul is dim and gray; * bring light to it, I pray * by sending down the grace * of your own Son and our God, * O hope of the hopeless. * And drive away the mist * of my countless iniquities * so that when the judgment comes * I may be given mercy * and fervently cry out to you forever: * Rejoice, O woman full of grace .
ltx/en_us_andronache/me.m09.d07:alt1.meMA.Kontakion1.greekmelody	@ltx/en_us_andronache/he.a.m8:heAU.TiYpermacho.greekname
ltx/en_us_andronache/me.m09.d07:alt1.meMA.Kontakion1.incipit	Let us honor Kassiane who…
ltx/en_us_andronache/me.m09.d07:alt1.meMA.Kontakion1.melody	@ltx/en_us_andronache/he.a.m8:heAU.TiYpermacho.notmetered
ltx/en_us_andronache/me.m09.d07:alt1.meMA.Kontakion1.mode	@ltx/en_us_andronache/miscellanea:misc.Mode8
ltx/en_us_andronache/me.m09.d07:alt1.meMA.Kontakion1.text	Let us honor Kassiane who glorified God, as a lamp of compunction, for she has been adorned with all goodness and virtue; she was made holy through ceaseless vigil and was well-pleasing to Christ the King. Thus, let us cry to her with fervor: Rejoice, mother most luminous.
ltx/en_us_andronache/me.m09.d07:alt1.meMA.Lauds1.greekmelody	@ltx/en_us_andronache/he.a.m8:heAU.OTouParadoxou.greekname
ltx/en_us_andronache/me.m09.d07:alt1.meMA.Lauds1.incipit	You loved * Christ your…
ltx/en_us_andronache/me.m09.d07:alt1.meMA.Lauds1.melody	@ltx/en_us_andronache/he.a.m8:heAU.OTouParadoxou.name
ltx/en_us_andronache/me.m09.d07:alt1.meMA.Lauds1.mode	@ltx/en_us_andronache/miscellanea:misc.Mode8
ltx/en_us_andronache/me.m09.d07:alt1.meMA.Lauds1.text	You loved * Christ your God with all your heart * Kassiane, blessed saint, * and you bravely refused the king * when he asked you to become * the queen of an earthly realm. * Instead you lived the angelic life on earth * and were made worthy to become in truth * partaker of the heavenly * kingdom ruled by the eternal King * and received the gift of joy * beyond all earthly ken.
ltx/en_us_andronache/me.m09.d07:alt1.meMA.Lauds2.incipit	You cleansed * the abysses…
ltx/en_us_andronache/me.m09.d07:alt1.meMA.Lauds2.melody	@ltx/en_us_andronache/he.a.m8:heAU.OTouParadoxou.name
ltx/en_us_andronache/me.m09.d07:alt1.meMA.Lauds2.mode	@ltx/en_us_andronache/miscellanea:misc.Mode8
ltx/en_us_andronache/me.m09.d07:alt1.meMA.Lauds2.text	You cleansed * the abysses of your heart * Kassiane, precious maid, * and washed out the dark blemish of * murky passions with the streams * of the divine Spirit’s grace. * And you were shown a pure vessel of His gifts * and a most fragrant garden full of song * to your beloved Lord * Bridegroom, Savior, and Redeemer, Christ our God, * the only benevolent * and Almighty One.
ltx/en_us_andronache/me.m09.d07:alt1.meMA.Lauds3.incipit	Mother, * pillar of humility…
ltx/en_us_andronache/me.m09.d07:alt1.meMA.Lauds3.melody	@ltx/en_us_andronache/he.a.m8:heAU.OTouParadoxou.name
ltx/en_us_andronache/me.m09.d07:alt1.meMA.Lauds3.mode	@ltx/en_us_andronache/miscellanea:misc.Mode8
ltx/en_us_andronache/me.m09.d07:alt1.meMA.Lauds3.text	Mother, * pillar of humility, * Kassiane, pure saint, * you built up in your precious soul * a great house of virtues * by the love that you had for Christ. * You longed to kiss, as the harlot did of old * His holy feet and to dry them with your hair * in the dwellings of the Lord, * where the light that never wanes makes all things bright * O most honored and beloved * and blessed servant of God.
ltx/en_us_andronache/me.m09.d07:alt1.meMA.Lauds4.incipit	Mother, * bright adornment of…
ltx/en_us_andronache/me.m09.d07:alt1.meMA.Lauds4.melody	@ltx/en_us_andronache/he.a.m8:heAU.OTouParadoxou.name
ltx/en_us_andronache/me.m09.d07:alt1.meMA.Lauds4.mode	@ltx/en_us_andronache/miscellanea:misc.Mode8
ltx/en_us_andronache/me.m09.d07:alt1.meMA.Lauds4.text	Mother, * bright adornment of the Church, * Kassiane, blessed saint, * you toiled arduously in caves, * like a desert-loving bird * and praised Christ in magnificent songs. * For Kassos you are a rampart and a shield * having completed your life in holiness. * You ran to Christ, your Lord * and He happily received you into His * dwellings with the saints on high * to live eternally.
ltx/en_us_andronache/me.m09.d07:alt1.meMA.LaudsGlory.incipit	You are worthy of God-pleasing…
ltx/en_us_andronache/me.m09.d07:alt1.meMA.LaudsGlory.melody	
ltx/en_us_andronache/me.m09.d07:alt1.meMA.LaudsGlory.mode	@ltx/en_us_andronache/miscellanea:misc.Mode5
ltx/en_us_andronache/me.m09.d07:alt1.meMA.LaudsGlory.text	You are worthy of God-pleasing and all-harmonious hymnody, Venerable and all-glorious Mother Kassiane, for, having disregarded the earthly kingdom, you were made worthy to reign with Christ in paradise. Entreat Him, therefore, to make us also worthy of the eternal good things in the day of Judgment.
ltx/en_us_andronache/me.m09.d07:alt1.meMA.Oikos1.text	Angels and men, beholding the heavenly ways of your repentance, the rivers of your tears, and pure character, august Kassiane, were greatly amazed and were crying out to you, shield of dignity, things such as these:
ltx/en_us_andronache/me.m09.d07:alt1.meMA.Oikos12.text	Rejoice, the fullness of divine love; rejoice, height of self-restraint.
ltx/en_us_andronache/me.m09.d07:alt1.meMA.Oikos13.text	Rejoice, the prefiguration of wisdom through works; rejoice, the manifestation of great intelligence.
ltx/en_us_andronache/me.m09.d07:alt1.meMA.Oikos14.text	Rejoice, most pleasant song of angelic living; rejoice, all-radiant fiery word of saving repentance.
ltx/en_us_andronache/me.m09.d07:alt1.meMA.Oikos15.text	Rejoice, who disregarded the earthly kingdom; rejoice, who sought out the kingdom of heaven.
ltx/en_us_andronache/me.m09.d07:alt1.meMA.Oikos16.text	Rejoice, ray of greatest participation; rejoice, container of divine wisdom.
ltx/en_us_andronache/me.m09.d07:alt1.meMA.Oikos17.text	Rejoice, ewe-lamb chosen of God; rejoice, raindrop of the Comforter’s gifts.
ltx/en_us_andronache/me.m09.d07:alt1.meMA.Oikos18.text	Rejoice, mother most luminous
ltx/en_us_andronache/me.m09.d07:alt1.meMA.PostGospelIdiomelon.incipit	You disregarded the earthly kingdom…
ltx/en_us_andronache/me.m09.d07:alt1.meMA.PostGospelIdiomelon.melody	
ltx/en_us_andronache/me.m09.d07:alt1.meMA.PostGospelIdiomelon.mode	@ltx/en_us_andronache/miscellanea:misc.Mode6
ltx/en_us_andronache/me.m09.d07:alt1.meMA.PostGospelIdiomelon.text	You disregarded the earthly kingdom and set off on ascetical struggles with an inspired soul, glorious Kassiane. You toiled well in Byzantium and Kassos for Christ the Lord of all and were well-pleasing to your beautiful heavenly Bridegroom. Now, having made your abode in the dwellings of the Heavenly Kingdom, do not cease interceding for those who hymn your memory.
ltx/en_us_andronache/me.m09.d07:alt1.meVE.Apolytikion1.greekmelody	@ltx/en_us_andronache/he.a.m5:heAU.TonSynanarchonLogon.greekname
ltx/en_us_andronache/me.m09.d07:alt1.meVE.Apolytikion1.incipit	You were wise to refuse…
ltx/en_us_andronache/me.m09.d07:alt1.meVE.Apolytikion1.melody	@ltx/en_us_andronache/he.a.m5:heAU.TonSynanarchonLogon.name
ltx/en_us_andronache/me.m09.d07:alt1.meVE.Apolytikion1.mode	@ltx/en_us_andronache/miscellanea:misc.Mode5
ltx/en_us_andronache/me.m09.d07:alt1.meVE.Apolytikion1.text	You were wise to refuse the proposal of the king, * for your heart was aflame with the love of the Lord * And we, the faithful, now in song * extol your virtue and your skill, * for God inspired you to write * sacred poems for the Church, * Kassiane, most exalted. * And we ask you to petition that we * be made worthy of the kingdom of God.
ltx/en_us_andronache/me.m09.d07:alt1.meVE.AposBoth.incipit	@ltx/en_us_andronache/me.m09.d08:meVE.LityGlory.incipit
ltx/en_us_andronache/me.m09.d07:alt1.meVE.AposBoth.melody	
ltx/en_us_andronache/me.m09.d07:alt1.meVE.AposBoth.mode	@ltx/en_us_andronache/miscellanea:misc.Mode8
ltx/en_us_andronache/me.m09.d07:alt1.meVE.AposBoth.text	@ltx/en_us_andronache/me.m09.d08:meVE.LityGlory.text
ltx/en_us_andronache/me.m09.d07:alt1.meVE.AposGlory.incipit	You consumed the thorns of…
ltx/en_us_andronache/me.m09.d07:alt1.meVE.AposGlory.melody	
ltx/en_us_andronache/me.m09.d07:alt1.meVE.AposGlory.mode	@ltx/en_us_andronache/miscellanea:misc.Mode8
ltx/en_us_andronache/me.m09.d07:alt1.meVE.AposGlory.text	You consumed the thorns of the passions by the fire of the unceasing ascetic labors and put on a garment of dispassion. You appeared like light, O mother who love the virtues. Having led your fleeting bodily vessel to servitude by vigils and the greatest of labors, you received the light of God as lightning, and you purified your reasoning. And now, God-bearer Kassiane, being together with the choirs of angels and beholding the beauty of Christ, we ask you to intercede for our souls.
ltx/en_us_andronache/me.m09.d07:alt1.meVE.Aposticha1.greekmelody	@ltx/en_us_andronache/he.a.m5:heAU.ChairoisAskitikon.greekname
ltx/en_us_andronache/me.m09.d07:alt1.meVE.Aposticha1.incipit	Rejoice, Kassiane praised in song…
ltx/en_us_andronache/me.m09.d07:alt1.meVE.Aposticha1.melody	@ltx/en_us_andronache/he.a.m5:heAU.ChairoisAskitikon.name
ltx/en_us_andronache/me.m09.d07:alt1.meVE.Aposticha1.mode	@ltx/en_us_andronache/miscellanea:misc.Mode5
ltx/en_us_andronache/me.m09.d07:alt1.meVE.Aposticha1.text	Rejoice, * Kassiane praised in song, * support of women * who travail in the ascetic life; * you pondered the pleasures * and fleeting honors of life * and you then appraised them to be counterfeit * Instead you took up the yoke * of the all-holy Lord, our God * and with devotion * followed Him like the heavenly * hosts who sing His praise * in unending, thrice-holy hymns. * As we, the faithful, come today * to honor your memory, * we now sing anthems acclaiming * you the beloved vessel of grace * and ask that you mediate * and intercede for us eternally * with Christ, our loving God.
ltx/en_us_andronache/me.m09.d07:alt1.meVE.Aposticha2.incipit	You cried unto to the Lord…
ltx/en_us_andronache/me.m09.d07:alt1.meVE.Aposticha2.melody	@ltx/en_us_andronache/he.a.m5:heAU.ChairoisAskitikon.name
ltx/en_us_andronache/me.m09.d07:alt1.meVE.Aposticha2.mode	@ltx/en_us_andronache/miscellanea:misc.Mode5
ltx/en_us_andronache/me.m09.d07:alt1.meVE.Aposticha2.text	You cried * unto to the Lord, chosen one,* beautiful diadem * in the cluster of women saints,* “Do not disdain me, your servant, * although you know, being God, * all the darkness dwelling in my soul and mind * and all of my many sins; * but, O Savior of all the world,* instead receive now * of my tears the bitter streams * and the multitude * of the sighs springing from my heart. * For You move the water of * the sea up to form the clouds * and you offer the water * of life eternal to all of those * who faithfully draw near * to your spring of divine favor, infinite and rich.
ltx/en_us_andronache/me.m09.d07:alt1.meVE.Aposticha3.incipit	Rejoice * Kassiani, the defense…
ltx/en_us_andronache/me.m09.d07:alt1.meVE.Aposticha3.melody	@ltx/en_us_andronache/he.a.m5:heAU.ChairoisAskitikon.name
ltx/en_us_andronache/me.m09.d07:alt1.meVE.Aposticha3.mode	@ltx/en_us_andronache/miscellanea:misc.Mode5
ltx/en_us_andronache/me.m09.d07:alt1.meVE.Aposticha3.text	Rejoice * Kassiani, the defense * helper and guardian, * of the people of Kassos, * the image of stillness and pure, virginal ewe, * the abode of virtues and beauty of soul. * You took your abode in caves * and you fasted with steadfastness. * The ground was your bed * as you grew in humility. * So we ask you now, * having boldness before our God, * fervently implore the Lord * and your longing Bridegroom * that he send to us all who * exalt your honorable memory * the powerful and holy medicine * to destroy all the devices of the enemy.
ltx/en_us_andronache/me.m09.d07:alt1.meVE.SticBoth.incipit	@ltx/en_us_andronache/me.m09.d08:meVE.Stichera01.incipit
ltx/en_us_andronache/me.m09.d07:alt1.meVE.SticBoth.melody	
ltx/en_us_andronache/me.m09.d07:alt1.meVE.SticBoth.mode	@ltx/en_us_andronache/miscellanea:misc.Mode6
ltx/en_us_andronache/me.m09.d07:alt1.meVE.SticBoth.text	@ltx/en_us_andronache/me.m09.d08:meVE.Stichera01.text
ltx/en_us_andronache/me.m09.d07:alt1.meVE.SticGlory.incipit	Let us honor Kassiane, for…
ltx/en_us_andronache/me.m09.d07:alt1.meVE.SticGlory.melody	
ltx/en_us_andronache/me.m09.d07:alt1.meVE.SticGlory.mode	@ltx/en_us_andronache/miscellanea:misc.Mode6
ltx/en_us_andronache/me.m09.d07:alt1.meVE.SticGlory.text	Let us honor Kassiane, for great humility prevented her from falling into many sins and she sought the Lord’s mercy. She refused the golden apple which would have led to an earthly kingdom, and she attained to the heavenly kingdom through her great toils and a life full of love for God and wisdom. And now she rejoices with Him who inclined the heavens because of His ineffable condescension, and she intercedes unceasingly that He send His rich and immeasurable mercy unto us.
ltx/en_us_andronache/me.m09.d07:alt1.meVE.Stichera01.greekmelody	@ltx/en_us_andronache/he.a.m1:heAU.TonOuranionTagmaton.greekname
ltx/en_us_andronache/me.m09.d07:alt1.meVE.Stichera01.incipit	Kassiane, the devout saint, was…
ltx/en_us_andronache/me.m09.d07:alt1.meVE.Stichera01.melody	@ltx/en_us_andronache/he.a.m1:heAU.TonOuranionTagmaton.name
ltx/en_us_andronache/me.m09.d07:alt1.meVE.Stichera01.mode	@ltx/en_us_andronache/miscellanea:misc.Mode1
ltx/en_us_andronache/me.m09.d07:alt1.meVE.Stichera01.text	Kassiane, the devout saint, was reared and trained in divine * learning and admonition, * then through her own incessant * labors of ascetical discipline was purified, and richly received * the Holy Spirit’s enlightenment in her soul. * O believers, let us sing her praise.
ltx/en_us_andronache/me.m09.d07:alt1.meVE.Stichera02.incipit	Kassiane, the devout saint, noble…
ltx/en_us_andronache/me.m09.d07:alt1.meVE.Stichera02.melody	@ltx/en_us_andronache/he.a.m1:heAU.TonOuranionTagmaton.name
ltx/en_us_andronache/me.m09.d07:alt1.meVE.Stichera02.mode	@ltx/en_us_andronache/miscellanea:misc.Mode1
ltx/en_us_andronache/me.m09.d07:alt1.meVE.Stichera02.text	Kassiane, the devout saint, noble and beautiful, * was born with mighty blessings * of the all-holy Virgin. * God-inspired poet and most favored was she * and a daughter of the Queen City. * She has enlightened the world by her life and toils. * O believers, let us honor her.
ltx/en_us_andronache/me.m09.d07:alt1.meVE.Stichera03.incipit	Kassiane, full of virtues, refused…
ltx/en_us_andronache/me.m09.d07:alt1.meVE.Stichera03.melody	@ltx/en_us_andronache/he.a.m1:heAU.TonOuranionTagmaton.name
ltx/en_us_andronache/me.m09.d07:alt1.meVE.Stichera03.mode	@ltx/en_us_andronache/miscellanea:misc.Mode1
ltx/en_us_andronache/me.m09.d07:alt1.meVE.Stichera03.text	Kassiane, full of virtues, refused the love of the king, * for her heart was afire * with insatiable yearning * for the King of all and so she became * the sweet lyre of the divine * Holy Spirit and lived a life pleasing God. * O believers, let us honor her.
ltx/en_us_andronache/me.m09.d07:alt1.meVE.Stichera04.greekmelody	@ltx/en_us_andronache/he.a.m1:heAU.TonOuranionTagmaton.greekname
ltx/en_us_andronache/me.m09.d07:alt1.meVE.Stichera04.incipit	Kassiane, the devout saint, vessel…
ltx/en_us_andronache/me.m09.d07:alt1.meVE.Stichera04.melody	@ltx/en_us_andronache/he.a.m1:heAU.TonOuranionTagmaton.name
ltx/en_us_andronache/me.m09.d07:alt1.meVE.Stichera04.mode	@ltx/en_us_andronache/miscellanea:misc.Mode1
ltx/en_us_andronache/me.m09.d07:alt1.meVE.Stichera04.text	Kassiane, the devout saint, vessel of self restraint * struggled in the caves of * the island of Kassos. * To women monastics she became a lamp * and was shown as a spotless dove. * She was noetically filled with the light of God. * O believers, let us honor her.
ltx/en_us_andronache/me.m09.d07:alt1.meVE.Stichera05.greekmelody	@ltx/en_us_andronache/he.a.m1:heAU.TonOuranionTagmaton.greekname
ltx/en_us_andronache/me.m09.d07:alt1.meVE.Stichera05.incipit	Kassiane, the devout saint, forsook…
ltx/en_us_andronache/me.m09.d07:alt1.meVE.Stichera05.melody	@ltx/en_us_andronache/he.a.m1:heAU.TonOuranionTagmaton.name
ltx/en_us_andronache/me.m09.d07:alt1.meVE.Stichera05.mode	@ltx/en_us_andronache/miscellanea:misc.Mode1
ltx/en_us_andronache/me.m09.d07:alt1.meVE.Stichera05.text	Kassiane, the devout saint, forsook the cares of the flesh* with its corrupted beauty; * instead she was enraptured * by the uncreated comeliness of Christ * which remains ever incorrupt. * We ask, O Mother, always intercede for us * who run to you and sing your praise.
ltx/en_us_andronache/me.m09.d07:alt1.meVE.Stichera06.incipit	Kassiane, the most blessed, heard…
ltx/en_us_andronache/me.m09.d07:alt1.meVE.Stichera06.melody	@ltx/en_us_andronache/he.a.m1:heAU.TonOuranionTagmaton.name
ltx/en_us_andronache/me.m09.d07:alt1.meVE.Stichera06.mode	@ltx/en_us_andronache/miscellanea:misc.Mode1
ltx/en_us_andronache/me.m09.d07:alt1.meVE.Stichera06.text	Kassiane, the most blessed, heard coming to her cell * the footsteps of the sovereign * and she went away and hid * as Eve had done in paradise of old * at the sound of the Lord of all * but unlike Eve who was hiding because of fear * Kassiane was hiding out of dignity.
