ltx/en_us_andronache/me.m01.d22:meMA.C1.acrostic.notice1	
ltx/en_us_andronache/me.m01.d22:meMA.C1.acrostic.text	
ltx/en_us_andronache/me.m01.d22:meMA.C1.acrostic.title	
ltx/en_us_andronache/me.m01.d22:meMA.Ode1C11.greekmelody	@ltx/en_us_andronache/he.h.m1:heHE.SouITropaiouchos.greekname
ltx/en_us_andronache/me.m01.d22:meMA.Ode1C11.incipit	Blessed one, through your intercessions…
ltx/en_us_andronache/me.m01.d22:meMA.Ode1C11.melody	@ltx/en_us_andronache/he.h.m1:heHE.SouITropaiouchos.notmetered
ltx/en_us_andronache/me.m01.d22:meMA.Ode1C11.mode	@ltx/en_us_andronache/miscellanea:misc.Mode1
ltx/en_us_andronache/me.m01.d22:meMA.Ode1C11.ode	@ltx/en_us_andronache/miscellanea:misc.Ode1
ltx/en_us_andronache/me.m01.d22:meMA.Ode1C11.text	Blessed one, through your intercessions disperse the rebellions of the passions and the gloom of ignorance by the luminous grace of dispassion, so that I may now worthily hymn you as a revealer of God.
ltx/en_us_andronache/me.m01.d22:meMA.Ode1C12.incipit	Seeing your beautiful mind, O…
ltx/en_us_andronache/me.m01.d22:meMA.Ode1C12.melody	@ltx/en_us_andronache/he.h.m1:heHE.SouITropaiouchos.notmetered
ltx/en_us_andronache/me.m01.d22:meMA.Ode1C12.mode	@ltx/en_us_andronache/miscellanea:misc.Mode1
ltx/en_us_andronache/me.m01.d22:meMA.Ode1C12.ode	@ltx/en_us_andronache/miscellanea:misc.Ode1
ltx/en_us_andronache/me.m01.d22:meMA.Ode1C12.text	Seeing your beautiful mind, O Timothy, God the fore-knower who takes care of us in His wise providence made you worthy to concelebrate with the divine apostles, O glorious one.
ltx/en_us_andronache/me.m01.d22:meMA.Ode1C13.incipit	We know one sovereignty beyond…
ltx/en_us_andronache/me.m01.d22:meMA.Ode1C13.melody	@ltx/en_us_andronache/he.h.m1:heHE.SouITropaiouchos.notmetered
ltx/en_us_andronache/me.m01.d22:meMA.Ode1C13.mode	@ltx/en_us_andronache/miscellanea:misc.Mode1
ltx/en_us_andronache/me.m01.d22:meMA.Ode1C13.ode	@ltx/en_us_andronache/miscellanea:misc.Ode1
ltx/en_us_andronache/me.m01.d22:meMA.Ode1C13.text	We know one sovereignty beyond essence which provides for all; for Timothy, Greek apostle, has been illumined by Christ’s grace and is thus counted with the divine Paul.
ltx/en_us_andronache/me.m01.d22:meMA.Ode1C21.greekmelody	@ltx/en_us_andronache/he.h.m1:heHE.SouITropaiouchos.greekname
ltx/en_us_andronache/me.m01.d22:meMA.Ode1C21.incipit	O Christ, illumined all around…
ltx/en_us_andronache/me.m01.d22:meMA.Ode1C21.melody	@ltx/en_us_andronache/he.h.m1:heHE.SouITropaiouchos.notmetered
ltx/en_us_andronache/me.m01.d22:meMA.Ode1C21.mode	@ltx/en_us_andronache/miscellanea:misc.Mode1
ltx/en_us_andronache/me.m01.d22:meMA.Ode1C21.ode	@ltx/en_us_andronache/miscellanea:misc.Ode1
ltx/en_us_andronache/me.m01.d22:meMA.Ode1C21.text	O Christ, illumined all around by the most brilliant dawn of your resurrection, bearing its name and having been sent out of the East as the sun, the martyr now illumines the church all around with miracles.
ltx/en_us_andronache/me.m01.d22:meMA.Ode1C22.incipit	Having been filled with divine…
ltx/en_us_andronache/me.m01.d22:meMA.Ode1C22.melody	@ltx/en_us_andronache/he.h.m1:heHE.SouITropaiouchos.notmetered
ltx/en_us_andronache/me.m01.d22:meMA.Ode1C22.mode	@ltx/en_us_andronache/miscellanea:misc.Mode1
ltx/en_us_andronache/me.m01.d22:meMA.Ode1C22.ode	@ltx/en_us_andronache/miscellanea:misc.Ode1
ltx/en_us_andronache/me.m01.d22:meMA.Ode1C22.text	Having been filled with divine love, O martyr Anastasios, you patiently endured the trials and having been adorned by ascetical beauty, rejoicing you were offered to Christ a fragrant sacrifice, O most excellent one.
ltx/en_us_andronache/me.m01.d22:meMA.Ode1C2T.incipit	O Mother of God, entreat…
ltx/en_us_andronache/me.m01.d22:meMA.Ode1C2T.melody	@ltx/en_us_andronache/he.h.m1:heHE.SouITropaiouchos.notmetered
ltx/en_us_andronache/me.m01.d22:meMA.Ode1C2T.mode	@ltx/en_us_andronache/miscellanea:misc.Mode1
ltx/en_us_andronache/me.m01.d22:meMA.Ode1C2T.ode	@ltx/en_us_andronache/miscellanea:misc.Ode1
ltx/en_us_andronache/me.m01.d22:meMA.Ode1C2T.text	O Mother of God, entreat the Word whom you bore and who resided bodily with us, to be gracious and well-disposed towards the faithful, for we have acquired you as our protection and salvation.
ltx/en_us_andronache/me.m01.d22:meMA.Ode3C11.greekmelody	@ltx/en_us_andronache/he.h.m1:heHE.OMonosEidos.greekname
ltx/en_us_andronache/me.m01.d22:meMA.Ode3C11.incipit	Grace was poured out plentifully…
ltx/en_us_andronache/me.m01.d22:meMA.Ode3C11.melody	@ltx/en_us_andronache/he.h.m1:heHE.OMonosEidos.notmetered
ltx/en_us_andronache/me.m01.d22:meMA.Ode3C11.mode	@ltx/en_us_andronache/miscellanea:misc.Mode1
ltx/en_us_andronache/me.m01.d22:meMA.Ode3C11.ode	@ltx/en_us_andronache/miscellanea:misc.Ode3
ltx/en_us_andronache/me.m01.d22:meMA.Ode3C11.text	Grace was poured out plentifully on your lips, all blessed one, and it gushed forth rivers of dogmas watering the Church of Christ and bringing to many tilled soils the fruit, O Timothy preacher of Christ and godly-minded apostle.
ltx/en_us_andronache/me.m01.d22:meMA.Ode3C12.incipit	Your feet were made beautiful…
ltx/en_us_andronache/me.m01.d22:meMA.Ode3C12.melody	@ltx/en_us_andronache/he.h.m1:heHE.OMonosEidos.notmetered
ltx/en_us_andronache/me.m01.d22:meMA.Ode3C12.mode	@ltx/en_us_andronache/miscellanea:misc.Mode1
ltx/en_us_andronache/me.m01.d22:meMA.Ode3C12.ode	@ltx/en_us_andronache/miscellanea:misc.Ode3
ltx/en_us_andronache/me.m01.d22:meMA.Ode3C12.text	Your feet were made beautiful according to the prophet, All-blessed one, for, all wise one, you preached the good news of peace which clearly passes all understanding, the Lord and Savior of all who loosed the bonds of the ancient war against humans.
ltx/en_us_andronache/me.m01.d22:meMA.Ode3C13.incipit	Blessed Timothy, mortifying the members…
ltx/en_us_andronache/me.m01.d22:meMA.Ode3C13.melody	@ltx/en_us_andronache/he.h.m1:heHE.OMonosEidos.notmetered
ltx/en_us_andronache/me.m01.d22:meMA.Ode3C13.mode	@ltx/en_us_andronache/miscellanea:misc.Mode1
ltx/en_us_andronache/me.m01.d22:meMA.Ode3C13.ode	@ltx/en_us_andronache/miscellanea:misc.Ode3
ltx/en_us_andronache/me.m01.d22:meMA.Ode3C13.text	Blessed Timothy, mortifying the members of your flesh, you made them subject to reason, gave authority to the superior over the inferior; and you mastered the passions and illuminated your soul having been trained by the teachings of Paul.
ltx/en_us_andronache/me.m01.d22:meMA.Ode3C21.greekmelody	@ltx/en_us_andronache/he.h.m1:heHE.OMonosEidos.greekname
ltx/en_us_andronache/me.m01.d22:meMA.Ode3C21.incipit	You travelled the narrow path…
ltx/en_us_andronache/me.m01.d22:meMA.Ode3C21.melody	@ltx/en_us_andronache/he.h.m1:heHE.OMonosEidos.notmetered
ltx/en_us_andronache/me.m01.d22:meMA.Ode3C21.mode	@ltx/en_us_andronache/miscellanea:misc.Mode1
ltx/en_us_andronache/me.m01.d22:meMA.Ode3C21.ode	@ltx/en_us_andronache/miscellanea:misc.Ode3
ltx/en_us_andronache/me.m01.d22:meMA.Ode3C21.text	You travelled the narrow path in the beginning through asceticism. Then you went forth to the glory of martyrdom having found luxury through trials; gaining possession of the divine delight through pains, glorious martyr Anastasios.
ltx/en_us_andronache/me.m01.d22:meMA.Ode3C22.incipit	The sound of your contests…
ltx/en_us_andronache/me.m01.d22:meMA.Ode3C22.melody	@ltx/en_us_andronache/he.h.m1:heHE.OMonosEidos.notmetered
ltx/en_us_andronache/me.m01.d22:meMA.Ode3C22.mode	@ltx/en_us_andronache/miscellanea:misc.Mode1
ltx/en_us_andronache/me.m01.d22:meMA.Ode3C22.ode	@ltx/en_us_andronache/miscellanea:misc.Ode3
ltx/en_us_andronache/me.m01.d22:meMA.Ode3C22.text	The sound of your contests went out into all the world, invincible martyr; for struggling against sin unto blood, you were victorious and were adorned with the crown of victory.
ltx/en_us_andronache/me.m01.d22:meMA.Ode3C2T.incipit	From you the unfading flower…
ltx/en_us_andronache/me.m01.d22:meMA.Ode3C2T.melody	@ltx/en_us_andronache/he.h.m1:heHE.OMonosEidos.notmetered
ltx/en_us_andronache/me.m01.d22:meMA.Ode3C2T.mode	@ltx/en_us_andronache/miscellanea:misc.Mode1
ltx/en_us_andronache/me.m01.d22:meMA.Ode3C2T.ode	@ltx/en_us_andronache/miscellanea:misc.Ode3
ltx/en_us_andronache/me.m01.d22:meMA.Ode3C2T.text	From you the unfading flower sprouted up for us, filling with sweet fragrance all of humanity by the divine perfume of its nature: the One who is co-beginningless with the Father and born from you in time, O all-spotless Virgin.
ltx/en_us_andronache/me.m01.d22:meMA.Ode3H.melody	@ltx/en_us_andronache/miscellanea:misc.HeirmosNotMetered
ltx/en_us_andronache/me.m01.d22:meMA.Ode3H.mode	@ltx/en_us_andronache/miscellanea:misc.Mode1
ltx/en_us_andronache/me.m01.d22:meMA.Ode3H.ode	@ltx/en_us_andronache/miscellanea:misc.Ode3
ltx/en_us_andronache/me.m01.d22:meMA.Ode3H.text	
ltx/en_us_andronache/me.m01.d22:meMA.Ode3Kathisma1.greekmelody	@ltx/en_us_andronache/he.a.m4:heAU.TachyProkatalave.greekname
ltx/en_us_andronache/me.m01.d22:meMA.Ode3Kathisma1.incipit	O glorious one, illumined by…
ltx/en_us_andronache/me.m01.d22:meMA.Ode3Kathisma1.melody	@ltx/en_us_andronache/he.a.m4:heAU.TachyProkatalave.notmetered
ltx/en_us_andronache/me.m01.d22:meMA.Ode3Kathisma1.mode	@ltx/en_us_andronache/miscellanea:misc.Mode4
ltx/en_us_andronache/me.m01.d22:meMA.Ode3Kathisma1.text	O glorious one, illumined by divine gifts, you adorned the illustrious metropolis of the Ephesians; for you, together with the divine Paul, were shown to be a preacher bringing the word of salvation to all. Therefore we faithfully celebrate your memory.
ltx/en_us_andronache/me.m01.d22:meMA.Ode3Kathisma2.greekmelody	@ltx/en_us_andronache/he.a.m4:heAU.TachyProkatalave.greekname
ltx/en_us_andronache/me.m01.d22:meMA.Ode3Kathisma2.incipit	Being perfected in glory, you…
ltx/en_us_andronache/me.m01.d22:meMA.Ode3Kathisma2.melody	@ltx/en_us_andronache/he.a.m4:heAU.TachyProkatalave.notmetered
ltx/en_us_andronache/me.m01.d22:meMA.Ode3Kathisma2.mode	@ltx/en_us_andronache/miscellanea:misc.Mode4
ltx/en_us_andronache/me.m01.d22:meMA.Ode3Kathisma2.text	Being perfected in glory, you were shown to be most honorable, as having your mind made bright by divine illumination and knowing the power of the Cross. You became godly-minded, martyr Anastasios, being righteous in asceticism and a martyr through blood. Therefore Christ gushes forth the grace of miracles in you.
ltx/en_us_andronache/me.m01.d22:meMA.Ode3KathismaSt.incipit	All-blameless Virgin, Mother of Christ…
ltx/en_us_andronache/me.m01.d22:meMA.Ode3KathismaSt.melody	@ltx/en_us_andronache/he.a.m4:heAU.TachyProkatalave.notmetered
ltx/en_us_andronache/me.m01.d22:meMA.Ode3KathismaSt.mode	@ltx/en_us_andronache/miscellanea:misc.Mode4
ltx/en_us_andronache/me.m01.d22:meMA.Ode3KathismaSt.text	All-blameless Virgin, Mother of Christ God, a sword pierced through your most holy soul, when you saw your son and God crucified of His own will. Do not cease supplicating Him, O blessed one, that we be granted forgiveness of transgressions.
ltx/en_us_andronache/me.m01.d22:meMA.Ode3KathismaT.incipit	Spotless one, by your divine…
ltx/en_us_andronache/me.m01.d22:meMA.Ode3KathismaT.melody	@ltx/en_us_andronache/he.a.m4:heAU.TachyProkatalave.notmetered
ltx/en_us_andronache/me.m01.d22:meMA.Ode3KathismaT.mode	@ltx/en_us_andronache/miscellanea:misc.Mode4
ltx/en_us_andronache/me.m01.d22:meMA.Ode3KathismaT.text	Spotless one, by your divine giving birth you renewed the nature, corrupted by the passions, of earthborn mortals and you raised all from death to the life of incorruption. Therefore, as is proper, we all bless you, glorified Virgin, as you prophesied.
ltx/en_us_andronache/me.m01.d22:meMA.Ode4C11.greekmelody	@ltx/en_us_andronache/he.h.m1:heHE.OrosSeTiChariti.greekname
ltx/en_us_andronache/me.m01.d22:meMA.Ode4C11.incipit	You struggled lawfully through complete…
ltx/en_us_andronache/me.m01.d22:meMA.Ode4C11.melody	@ltx/en_us_andronache/he.h.m1:heHE.OrosSeTiChariti.notmetered
ltx/en_us_andronache/me.m01.d22:meMA.Ode4C11.mode	@ltx/en_us_andronache/miscellanea:misc.Mode1
ltx/en_us_andronache/me.m01.d22:meMA.Ode4C11.ode	@ltx/en_us_andronache/miscellanea:misc.Ode4
ltx/en_us_andronache/me.m01.d22:meMA.Ode4C11.text	You struggled lawfully through complete self-control; Blessed One, and subjected all the waves of the passions to your mind, attaining the greatness of the virtues, great preacher and godly-minded Timothy.
ltx/en_us_andronache/me.m01.d22:meMA.Ode4C12.incipit	Shining like the sun, Paul…
ltx/en_us_andronache/me.m01.d22:meMA.Ode4C12.melody	@ltx/en_us_andronache/he.h.m1:heHE.OrosSeTiChariti.notmetered
ltx/en_us_andronache/me.m01.d22:meMA.Ode4C12.mode	@ltx/en_us_andronache/miscellanea:misc.Mode1
ltx/en_us_andronache/me.m01.d22:meMA.Ode4C12.ode	@ltx/en_us_andronache/miscellanea:misc.Ode4
ltx/en_us_andronache/me.m01.d22:meMA.Ode4C12.text	Shining like the sun, Paul sent you out, as a shining ray, flooding the whole wide world with light and appearing as a flame, God-revealer Timothy, as a guide and confirmation for us.
ltx/en_us_andronache/me.m01.d22:meMA.Ode4C13.incipit	You fervently yearned for the…
ltx/en_us_andronache/me.m01.d22:meMA.Ode4C13.melody	@ltx/en_us_andronache/he.h.m1:heHE.OrosSeTiChariti.notmetered
ltx/en_us_andronache/me.m01.d22:meMA.Ode4C13.mode	@ltx/en_us_andronache/miscellanea:misc.Mode1
ltx/en_us_andronache/me.m01.d22:meMA.Ode4C13.ode	@ltx/en_us_andronache/miscellanea:misc.Ode4
ltx/en_us_andronache/me.m01.d22:meMA.Ode4C13.text	You fervently yearned for the greatest of things desired and through love you became commingled; you sought with fervor the well-ordered life, O God-inspired one, continually observing closely your beloved one, and being filled with His divine vision.
ltx/en_us_andronache/me.m01.d22:meMA.Ode4C21.greekmelody	@ltx/en_us_andronache/he.h.m1:heHE.OrosSeTiChariti.greekname
ltx/en_us_andronache/me.m01.d22:meMA.Ode4C21.incipit	Nothing separated you from the…
ltx/en_us_andronache/me.m01.d22:meMA.Ode4C21.melody	@ltx/en_us_andronache/he.h.m1:heHE.OrosSeTiChariti.notmetered
ltx/en_us_andronache/me.m01.d22:meMA.Ode4C21.mode	@ltx/en_us_andronache/miscellanea:misc.Mode1
ltx/en_us_andronache/me.m01.d22:meMA.Ode4C21.ode	@ltx/en_us_andronache/miscellanea:misc.Ode4
ltx/en_us_andronache/me.m01.d22:meMA.Ode4C21.text	Nothing separated you from the love of Christ; not the cutting of your members, nor the threat of trials, nor the sword, nor death, not even fire, nor famine, O Anastasios, co-dweller with the heavenly choir.
ltx/en_us_andronache/me.m01.d22:meMA.Ode4C22.incipit	You quickly lifted up your…
ltx/en_us_andronache/me.m01.d22:meMA.Ode4C22.melody	@ltx/en_us_andronache/he.h.m1:heHE.OrosSeTiChariti.notmetered
ltx/en_us_andronache/me.m01.d22:meMA.Ode4C22.mode	@ltx/en_us_andronache/miscellanea:misc.Mode1
ltx/en_us_andronache/me.m01.d22:meMA.Ode4C22.ode	@ltx/en_us_andronache/miscellanea:misc.Ode4
ltx/en_us_andronache/me.m01.d22:meMA.Ode4C22.text	You quickly lifted up your cross upon your shoulders and you followed Christ’s saving commands. Becoming His imitator unto death, O most excellent one, now you now enjoy His brightness.
ltx/en_us_andronache/me.m01.d22:meMA.Ode4C2T.incipit	Coming from heaven, the chief…
ltx/en_us_andronache/me.m01.d22:meMA.Ode4C2T.melody	@ltx/en_us_andronache/he.h.m1:heHE.OrosSeTiChariti.notmetered
ltx/en_us_andronache/me.m01.d22:meMA.Ode4C2T.mode	@ltx/en_us_andronache/miscellanea:misc.Mode1
ltx/en_us_andronache/me.m01.d22:meMA.Ode4C2T.ode	@ltx/en_us_andronache/miscellanea:misc.Ode4
ltx/en_us_andronache/me.m01.d22:meMA.Ode4C2T.text	Coming from heaven, the chief commander brought good news of joy to you, Pure one, clearly saying: God will come out from you in the flesh, all pure Virgin, for the salvation of those who fervently hymn you.
ltx/en_us_andronache/me.m01.d22:meMA.Ode5C11.greekmelody	@ltx/en_us_andronache/he.h.m1:heHE.TheosOnEirinis.greekname
ltx/en_us_andronache/me.m01.d22:meMA.Ode5C11.incipit	Being set aflame by the…
ltx/en_us_andronache/me.m01.d22:meMA.Ode5C11.melody	@ltx/en_us_andronache/he.h.m1:heHE.TheosOnEirinis.notmetered
ltx/en_us_andronache/me.m01.d22:meMA.Ode5C11.mode	@ltx/en_us_andronache/miscellanea:misc.Mode1
ltx/en_us_andronache/me.m01.d22:meMA.Ode5C11.ode	@ltx/en_us_andronache/miscellanea:misc.Ode5
ltx/en_us_andronache/me.m01.d22:meMA.Ode5C11.text	Being set aflame by the immaterial lights of the first Light and cause of all, you enlightened the world by your pure preaching, O light of piety. You were clearly shown forth holding fast to the word of life, holy mystic most blessed.
ltx/en_us_andronache/me.m01.d22:meMA.Ode5C12.incipit	The divine Paul’s firm student…
ltx/en_us_andronache/me.m01.d22:meMA.Ode5C12.melody	@ltx/en_us_andronache/he.h.m1:heHE.TheosOnEirinis.notmetered
ltx/en_us_andronache/me.m01.d22:meMA.Ode5C12.mode	@ltx/en_us_andronache/miscellanea:misc.Mode1
ltx/en_us_andronache/me.m01.d22:meMA.Ode5C12.ode	@ltx/en_us_andronache/miscellanea:misc.Ode5
ltx/en_us_andronache/me.m01.d22:meMA.Ode5C12.text	The divine Paul’s firm student, he followed in the footsteps of his teacher, sowing his teachings to all the faithful, through which we are led towards the light of piety and, rising up from night, we glorify you, O Lover of mankind.
ltx/en_us_andronache/me.m01.d22:meMA.Ode5C13.incipit	Paul, having been made a…
ltx/en_us_andronache/me.m01.d22:meMA.Ode5C13.melody	@ltx/en_us_andronache/he.h.m1:heHE.TheosOnEirinis.notmetered
ltx/en_us_andronache/me.m01.d22:meMA.Ode5C13.mode	@ltx/en_us_andronache/miscellanea:misc.Mode1
ltx/en_us_andronache/me.m01.d22:meMA.Ode5C13.ode	@ltx/en_us_andronache/miscellanea:misc.Ode5
ltx/en_us_andronache/me.m01.d22:meMA.Ode5C13.text	Paul, having been made a second light ministering to the first light, illumined us by the knowledge of this light; Timothy was shown to be a fellow soldier with him being victoriously shielded by his full armor.
ltx/en_us_andronache/me.m01.d22:meMA.Ode5C21.greekmelody	@ltx/en_us_andronache/he.h.m1:heHE.TheosOnEirinis.greekname
ltx/en_us_andronache/me.m01.d22:meMA.Ode5C21.incipit	The enemy of God who…
ltx/en_us_andronache/me.m01.d22:meMA.Ode5C21.melody	@ltx/en_us_andronache/he.h.m1:heHE.TheosOnEirinis.notmetered
ltx/en_us_andronache/me.m01.d22:meMA.Ode5C21.mode	@ltx/en_us_andronache/miscellanea:misc.Mode1
ltx/en_us_andronache/me.m01.d22:meMA.Ode5C21.ode	@ltx/en_us_andronache/miscellanea:misc.Ode5
ltx/en_us_andronache/me.m01.d22:meMA.Ode5C21.text	The enemy of God who once boasted about great and measureless things, who threatened the earth and who insolently said in vain that he would obliterate the sea, is trampled down, O wise one, by your manly virtue.
ltx/en_us_andronache/me.m01.d22:meMA.Ode5C22.incipit	You struggled lawfully, martyr of…
ltx/en_us_andronache/me.m01.d22:meMA.Ode5C22.melody	@ltx/en_us_andronache/he.h.m1:heHE.TheosOnEirinis.notmetered
ltx/en_us_andronache/me.m01.d22:meMA.Ode5C22.mode	@ltx/en_us_andronache/miscellanea:misc.Mode1
ltx/en_us_andronache/me.m01.d22:meMA.Ode5C22.ode	@ltx/en_us_andronache/miscellanea:misc.Ode5
ltx/en_us_andronache/me.m01.d22:meMA.Ode5C22.text	You struggled lawfully, martyr of Christ, and you clearly gained as the prize of your contests the power to work miracles. The wonderworking Anastasios heals illnesses and chases away demons by the power of Christ.
ltx/en_us_andronache/me.m01.d22:meMA.Ode5C2T.incipit	By your birth, o Virgin…
ltx/en_us_andronache/me.m01.d22:meMA.Ode5C2T.melody	@ltx/en_us_andronache/he.h.m1:heHE.TheosOnEirinis.notmetered
ltx/en_us_andronache/me.m01.d22:meMA.Ode5C2T.mode	@ltx/en_us_andronache/miscellanea:misc.Mode1
ltx/en_us_andronache/me.m01.d22:meMA.Ode5C2T.ode	@ltx/en_us_andronache/miscellanea:misc.Ode5
ltx/en_us_andronache/me.m01.d22:meMA.Ode5C2T.text	By your birth, o Virgin, you abolished the curse on Eve, the mother of all, and raised up Christ, the blessing for the world. Therefore, having rejoiced, we bless you while confessing you by both mouth and tongue, as is proper, to be the Theotokos.
ltx/en_us_andronache/me.m01.d22:meMA.Ode6C11.greekmelody	@ltx/en_us_andronache/he.h.m1:heHE.SplanchnonIonan.greekname
ltx/en_us_andronache/me.m01.d22:meMA.Ode6C11.incipit	You were shown to be…
ltx/en_us_andronache/me.m01.d22:meMA.Ode6C11.melody	@ltx/en_us_andronache/he.h.m1:heHE.SplanchnonIonan.notmetered
ltx/en_us_andronache/me.m01.d22:meMA.Ode6C11.mode	@ltx/en_us_andronache/miscellanea:misc.Mode1
ltx/en_us_andronache/me.m01.d22:meMA.Ode6C11.ode	@ltx/en_us_andronache/miscellanea:misc.Ode6
ltx/en_us_andronache/me.m01.d22:meMA.Ode6C11.text	You were shown to be a chariot of God, O Timothy, bearing his divine name before the godless tyrants, O God-inspired one, not being afraid of their cruelty, for you were vested with the Savior’s invincible might.
ltx/en_us_andronache/me.m01.d22:meMA.Ode6C12.incipit	 O Timothy, truly happy…
ltx/en_us_andronache/me.m01.d22:meMA.Ode6C12.melody	@ltx/en_us_andronache/he.h.m1:heHE.SplanchnonIonan.notmetered
ltx/en_us_andronache/me.m01.d22:meMA.Ode6C12.mode	@ltx/en_us_andronache/miscellanea:misc.Mode1
ltx/en_us_andronache/me.m01.d22:meMA.Ode6C12.ode	@ltx/en_us_andronache/miscellanea:misc.Ode6
ltx/en_us_andronache/me.m01.d22:meMA.Ode6C12.text	 O Timothy, truly happy godly-minded apostle, you accepted a fair Crown and you worthily wear the diadem of the Kingdom and were brought to the throne of your Master, rejoicing together with Paul in the heavenly dwellings, blessed one.
ltx/en_us_andronache/me.m01.d22:meMA.Ode6C13.incipit	All honored Timothy, catching the…
ltx/en_us_andronache/me.m01.d22:meMA.Ode6C13.melody	@ltx/en_us_andronache/he.h.m1:heHE.SplanchnonIonan.notmetered
ltx/en_us_andronache/me.m01.d22:meMA.Ode6C13.mode	@ltx/en_us_andronache/miscellanea:misc.Mode1
ltx/en_us_andronache/me.m01.d22:meMA.Ode6C13.ode	@ltx/en_us_andronache/miscellanea:misc.Ode6
ltx/en_us_andronache/me.m01.d22:meMA.Ode6C13.text	All honored Timothy, catching the scent of the spiritual myrrh of the one who condescended to be incarnate for us, you partook of this fragrance and you transmitted it to those who run with faith to you, holy mystic of the His unspeakable noetical dispensation.
ltx/en_us_andronache/me.m01.d22:meMA.Ode6C21.greekmelody	@ltx/en_us_andronache/he.h.m1:heHE.SplanchnonIonan.greekname
ltx/en_us_andronache/me.m01.d22:meMA.Ode6C21.incipit	Being wisely illumined by the…
ltx/en_us_andronache/me.m01.d22:meMA.Ode6C21.melody	@ltx/en_us_andronache/he.h.m1:heHE.SplanchnonIonan.notmetered
ltx/en_us_andronache/me.m01.d22:meMA.Ode6C21.mode	@ltx/en_us_andronache/miscellanea:misc.Mode1
ltx/en_us_andronache/me.m01.d22:meMA.Ode6C21.ode	@ltx/en_us_andronache/miscellanea:misc.Ode6
ltx/en_us_andronache/me.m01.d22:meMA.Ode6C21.text	Being wisely illumined by the light of the Cross, you escaped the murkiness of error and were victorious when you struggled with the tyrant, all glorious one. Rejoicing you gained your trophies, wise martyr of Christ Anastasios, dancing together with the armies of martyrs.
ltx/en_us_andronache/me.m01.d22:meMA.Ode6C2T.incipit	Portraying the will of God…
ltx/en_us_andronache/me.m01.d22:meMA.Ode6C2T.melody	@ltx/en_us_andronache/he.h.m1:heHE.SplanchnonIonan.notmetered
ltx/en_us_andronache/me.m01.d22:meMA.Ode6C2T.mode	@ltx/en_us_andronache/miscellanea:misc.Mode1
ltx/en_us_andronache/me.m01.d22:meMA.Ode6C2T.ode	@ltx/en_us_andronache/miscellanea:misc.Ode6
ltx/en_us_andronache/me.m01.d22:meMA.Ode6C2T.text	Portraying the will of God, the entire choir of the prophets foretold the mystery of your unutterable and divine conception of the Word of God from you, O virgin-mother; for you showed forth the most true and ancient counsel.
ltx/en_us_andronache/me.m01.d22:meMA.Ode6H.greekmelody	@ltx/en_us_andronache/he.h.m1:heHE.SplanchnonIonan.greekname
ltx/en_us_andronache/me.m01.d22:meMA.Ode6H.incipit	@ltx/en_us_andronache/he.h.m1:heHE.SplanchnonIonan.incipit
ltx/en_us_andronache/me.m01.d22:meMA.Ode6H.melody	@ltx/en_us_andronache/he.h.m1:heHE.SplanchnonIonan.melody
ltx/en_us_andronache/me.m01.d22:meMA.Ode6H.mode	@ltx/en_us_andronache/miscellanea:misc.Mode1
ltx/en_us_andronache/me.m01.d22:meMA.Ode6H.ode	@ltx/en_us_andronache/miscellanea:misc.Ode6
ltx/en_us_andronache/me.m01.d22:meMA.Ode6H.text	
ltx/en_us_andronache/me.m01.d22:meMA.Ode7C11.greekmelody	@ltx/en_us_andronache/he.h.m1:heHE.SeNoitin.greekname
ltx/en_us_andronache/me.m01.d22:meMA.Ode7C11.incipit	You worthily became a companion…
ltx/en_us_andronache/me.m01.d22:meMA.Ode7C11.melody	@ltx/en_us_andronache/he.h.m1:heHE.SeNoitin.notmetered
ltx/en_us_andronache/me.m01.d22:meMA.Ode7C11.mode	@ltx/en_us_andronache/miscellanea:misc.Mode1
ltx/en_us_andronache/me.m01.d22:meMA.Ode7C11.ode	@ltx/en_us_andronache/miscellanea:misc.Ode7
ltx/en_us_andronache/me.m01.d22:meMA.Ode7C11.text	You worthily became a companion in the dance of the heavenly orders, being filled with a light-giving light, blessed priestly-mystic Timothy, so that you rejoice together in harmony, proclaiming the praiseworthy and supremely glorified God.
ltx/en_us_andronache/me.m01.d22:meMA.Ode7C12.incipit	Being a priestly minister of…
ltx/en_us_andronache/me.m01.d22:meMA.Ode7C12.melody	@ltx/en_us_andronache/he.h.m1:heHE.SeNoitin.notmetered
ltx/en_us_andronache/me.m01.d22:meMA.Ode7C12.mode	@ltx/en_us_andronache/miscellanea:misc.Mode1
ltx/en_us_andronache/me.m01.d22:meMA.Ode7C12.ode	@ltx/en_us_andronache/miscellanea:misc.Ode7
ltx/en_us_andronache/me.m01.d22:meMA.Ode7C12.text	Being a priestly minister of Christ’s Gospel, the most divine Paul, rejoicing, sent the god-written letters to you from the summit of virtues, O Timothy, as to a disciple proclaiming the praiseworthy and supremely glorified God.
ltx/en_us_andronache/me.m01.d22:meMA.Ode7C13.incipit	The vigor of your soul…
ltx/en_us_andronache/me.m01.d22:meMA.Ode7C13.melody	@ltx/en_us_andronache/he.h.m1:heHE.SeNoitin.notmetered
ltx/en_us_andronache/me.m01.d22:meMA.Ode7C13.mode	@ltx/en_us_andronache/miscellanea:misc.Mode1
ltx/en_us_andronache/me.m01.d22:meMA.Ode7C13.ode	@ltx/en_us_andronache/miscellanea:misc.Ode7
ltx/en_us_andronache/me.m01.d22:meMA.Ode7C13.text	The vigor of your soul strengthened the weakness of the flesh; for you dwelt on earth as if bodiless, O Martyr. You gained your reward when you head was crushed, most-blessed priestly minister of God’s mysteries.
ltx/en_us_andronache/me.m01.d22:meMA.Ode7C21.greekmelody	@ltx/en_us_andronache/he.h.m1:heHE.SeNoitin.greekname
ltx/en_us_andronache/me.m01.d22:meMA.Ode7C21.incipit	By showing his brave deeds…
ltx/en_us_andronache/me.m01.d22:meMA.Ode7C21.melody	@ltx/en_us_andronache/he.h.m1:heHE.SeNoitin.notmetered
ltx/en_us_andronache/me.m01.d22:meMA.Ode7C21.mode	@ltx/en_us_andronache/miscellanea:misc.Mode1
ltx/en_us_andronache/me.m01.d22:meMA.Ode7C21.ode	@ltx/en_us_andronache/miscellanea:misc.Ode7
ltx/en_us_andronache/me.m01.d22:meMA.Ode7C21.text	By showing his brave deeds as a clear sign, the athlete urges the faithful now to imitate the divine, voluntary passion, which the praiseworthy and supremely glorified God of the Fathers endured for us.
ltx/en_us_andronache/me.m01.d22:meMA.Ode7C22.incipit	The Trinity is believed to…
ltx/en_us_andronache/me.m01.d22:meMA.Ode7C22.melody	@ltx/en_us_andronache/he.h.m1:heHE.SeNoitin.notmetered
ltx/en_us_andronache/me.m01.d22:meMA.Ode7C22.mode	@ltx/en_us_andronache/miscellanea:misc.Mode1
ltx/en_us_andronache/me.m01.d22:meMA.Ode7C22.ode	@ltx/en_us_andronache/miscellanea:misc.Ode7
ltx/en_us_andronache/me.m01.d22:meMA.Ode7C22.text	The Trinity is believed to be equal in power by the lovers of piety. Thus the brave athletes contested for this, shedding their blood, while struggling in martyrdom, both clearly giving up their souls and being lifted up.
ltx/en_us_andronache/me.m01.d22:meMA.Ode7C2T.incipit	Rejoice, pure one, Adam’s fleece…
ltx/en_us_andronache/me.m01.d22:meMA.Ode7C2T.melody	@ltx/en_us_andronache/he.h.m1:heHE.SeNoitin.notmetered
ltx/en_us_andronache/me.m01.d22:meMA.Ode7C2T.mode	@ltx/en_us_andronache/miscellanea:misc.Mode1
ltx/en_us_andronache/me.m01.d22:meMA.Ode7C2T.ode	@ltx/en_us_andronache/miscellanea:misc.Ode7
ltx/en_us_andronache/me.m01.d22:meMA.Ode7C2T.text	Rejoice, pure one, Adam’s fleece. From you came forth the most exalted Shepherd, truly robed in my entire humanity through the indescribable mercy of the praiseworthy and supremely glorified God of the Fathers.
ltx/en_us_andronache/me.m01.d22:meMA.Ode8C11.greekmelody	@ltx/en_us_andronache/he.h.m1:heHE.ThavmatosYperfyous.greekname
ltx/en_us_andronache/me.m01.d22:meMA.Ode8C11.incipit	Blessed Timothy, you were shown…
ltx/en_us_andronache/me.m01.d22:meMA.Ode8C11.melody	@ltx/en_us_andronache/he.h.m1:heHE.ThavmatosYperfyous.notmetered
ltx/en_us_andronache/me.m01.d22:meMA.Ode8C11.mode	@ltx/en_us_andronache/miscellanea:misc.Mode1
ltx/en_us_andronache/me.m01.d22:meMA.Ode8C11.ode	@ltx/en_us_andronache/miscellanea:misc.Ode8
ltx/en_us_andronache/me.m01.d22:meMA.Ode8C11.text	Blessed Timothy, you were shown having been made worthy of the angelic ranks. Thus being initiated into the mysteries of the heavenly orders, you imitated their brightness, o wise one. Rejoicing, you send up a melody with them: Let all creation bless the Lord and exalt Him beyond measure unto all the ages.
ltx/en_us_andronache/me.m01.d22:meMA.Ode8C12.incipit	Being clothed with that power…
ltx/en_us_andronache/me.m01.d22:meMA.Ode8C12.melody	@ltx/en_us_andronache/he.h.m1:heHE.ThavmatosYperfyous.notmetered
ltx/en_us_andronache/me.m01.d22:meMA.Ode8C12.mode	@ltx/en_us_andronache/miscellanea:misc.Mode1
ltx/en_us_andronache/me.m01.d22:meMA.Ode8C12.ode	@ltx/en_us_andronache/miscellanea:misc.Ode8
ltx/en_us_andronache/me.m01.d22:meMA.Ode8C12.text	Being clothed with that power which came from heaven in a strange manner to the disciples and eyewitnesses of the Word, you were seen as an apostle, O godly-minded Timothy. Rejoicing, you send up a melody with them: Let all creation bless the Lord and exalt Him beyond measure unto all the ages.
ltx/en_us_andronache/me.m01.d22:meMA.Ode8C13.incipit	Most blessed one, you manifestly…
ltx/en_us_andronache/me.m01.d22:meMA.Ode8C13.melody	@ltx/en_us_andronache/he.h.m1:heHE.ThavmatosYperfyous.notmetered
ltx/en_us_andronache/me.m01.d22:meMA.Ode8C13.mode	@ltx/en_us_andronache/miscellanea:misc.Mode1
ltx/en_us_andronache/me.m01.d22:meMA.Ode8C13.ode	@ltx/en_us_andronache/miscellanea:misc.Ode8
ltx/en_us_andronache/me.m01.d22:meMA.Ode8C13.text	Most blessed one, you manifestly rose to the greatest good and reached that which you desired, O Timothy, preacher of God. Ever clearly enlightened by the light of the Trinity, and now rejoicing you send up a melody: Let all creation bless the Lord and exalt Him beyond measure unto all the ages.
ltx/en_us_andronache/me.m01.d22:meMA.Ode8C21.greekmelody	@ltx/en_us_andronache/he.h.m1:heHE.ThavmatosYperfyous.greekname
ltx/en_us_andronache/me.m01.d22:meMA.Ode8C21.incipit	From earth towards heaven you…
ltx/en_us_andronache/me.m01.d22:meMA.Ode8C21.melody	@ltx/en_us_andronache/he.h.m1:heHE.ThavmatosYperfyous.notmetered
ltx/en_us_andronache/me.m01.d22:meMA.Ode8C21.mode	@ltx/en_us_andronache/miscellanea:misc.Mode1
ltx/en_us_andronache/me.m01.d22:meMA.Ode8C21.ode	@ltx/en_us_andronache/miscellanea:misc.Ode8
ltx/en_us_andronache/me.m01.d22:meMA.Ode8C21.text	From earth towards heaven you flew up wearing a crown, martyr Anastasios, having fled all the treachery of the demons and trampled the worship of the idols. Therefore you now cry towards the earth: Let all creation bless the Lord and exalt Him beyond measure unto all the ages.
ltx/en_us_andronache/me.m01.d22:meMA.Ode8C22.incipit	You dyed your cloak martyrically…
ltx/en_us_andronache/me.m01.d22:meMA.Ode8C22.melody	@ltx/en_us_andronache/he.h.m1:heHE.ThavmatosYperfyous.notmetered
ltx/en_us_andronache/me.m01.d22:meMA.Ode8C22.mode	@ltx/en_us_andronache/miscellanea:misc.Mode1
ltx/en_us_andronache/me.m01.d22:meMA.Ode8C22.ode	@ltx/en_us_andronache/miscellanea:misc.Ode8
ltx/en_us_andronache/me.m01.d22:meMA.Ode8C22.text	You dyed your cloak martyrically with your blood, truly happy martyr, bearing the symbol of the cross as a scepter, in Christ you reign unto the ages, O Anastasios. And now, rejoicing you send up a melody: Let all creation bless the Lord and exalt Him beyond measure unto all the ages.
ltx/en_us_andronache/me.m01.d22:meMA.Ode8C2T.incipit	The rich Logos, glorified by…
ltx/en_us_andronache/me.m01.d22:meMA.Ode8C2T.melody	@ltx/en_us_andronache/he.h.m1:heHE.ThavmatosYperfyous.notmetered
ltx/en_us_andronache/me.m01.d22:meMA.Ode8C2T.mode	@ltx/en_us_andronache/miscellanea:misc.Mode1
ltx/en_us_andronache/me.m01.d22:meMA.Ode8C2T.ode	@ltx/en_us_andronache/miscellanea:misc.Ode8
ltx/en_us_andronache/me.m01.d22:meMA.Ode8C2T.text	The rich Logos, glorified by the archangels in hymns, became poor for us, having chosen you, the beauty of Jacob, as blessed Mother. Therefore, raising up hymns to you we cry: Let all creation bless the Lord and exalt Him beyond measure unto all the ages.
ltx/en_us_andronache/me.m01.d22:meMA.Ode8H.melody	@ltx/en_us_andronache/miscellanea:misc.HeirmosNotMetered
ltx/en_us_andronache/me.m01.d22:meMA.Ode8H.mode	@ltx/en_us_andronache/miscellanea:misc.Mode1
ltx/en_us_andronache/me.m01.d22:meMA.Ode8H.ode	@ltx/en_us_andronache/miscellanea:misc.Ode8
ltx/en_us_andronache/me.m01.d22:meMA.Ode8H.text	
ltx/en_us_andronache/me.m01.d22:meMA.Ode9C11.greekmelody	@ltx/en_us_andronache/he.h.m1:heHE.TyponTisAgnis.greekname
ltx/en_us_andronache/me.m01.d22:meMA.Ode9C11.incipit	The saying of David is…
ltx/en_us_andronache/me.m01.d22:meMA.Ode9C11.melody	@ltx/en_us_andronache/he.h.m1:heHE.TyponTisAgnis.notmetered
ltx/en_us_andronache/me.m01.d22:meMA.Ode9C11.mode	@ltx/en_us_andronache/miscellanea:misc.Mode1
ltx/en_us_andronache/me.m01.d22:meMA.Ode9C11.ode	@ltx/en_us_andronache/miscellanea:misc.Ode9
ltx/en_us_andronache/me.m01.d22:meMA.Ode9C11.text	The saying of David is fulfilled; for you appeared to the world as lightning by your preaching illuminating the ends of the world, all-hymned and blessed Timothy. Therefore, God-revealer, we unceasingly magnify you.
ltx/en_us_andronache/me.m01.d22:meMA.Ode9C12.incipit	Most wise one, being filled…
ltx/en_us_andronache/me.m01.d22:meMA.Ode9C12.melody	@ltx/en_us_andronache/he.h.m1:heHE.TyponTisAgnis.notmetered
ltx/en_us_andronache/me.m01.d22:meMA.Ode9C12.mode	@ltx/en_us_andronache/miscellanea:misc.Mode1
ltx/en_us_andronache/me.m01.d22:meMA.Ode9C12.ode	@ltx/en_us_andronache/miscellanea:misc.Ode9
ltx/en_us_andronache/me.m01.d22:meMA.Ode9C12.text	Most wise one, being filled with the light of the chief tri-luminous light of the godhead and being purely borne about in it, guard those who hymn you, blessed one, from the darkness of error, priestly mystic all venerable.
ltx/en_us_andronache/me.m01.d22:meMA.Ode9C13.incipit	We glorify You, only-begotten one…
ltx/en_us_andronache/me.m01.d22:meMA.Ode9C13.melody	@ltx/en_us_andronache/he.h.m1:heHE.TyponTisAgnis.notmetered
ltx/en_us_andronache/me.m01.d22:meMA.Ode9C13.mode	@ltx/en_us_andronache/miscellanea:misc.Mode1
ltx/en_us_andronache/me.m01.d22:meMA.Ode9C13.ode	@ltx/en_us_andronache/miscellanea:misc.Ode9
ltx/en_us_andronache/me.m01.d22:meMA.Ode9C13.text	We glorify You, only-begotten one, with right understanding as equal to the Father and the Spirit, being made firm in the teachings of your apostles, Master, by Paul the preacher of your economy and Timothy the godly-minded.
ltx/en_us_andronache/me.m01.d22:meMA.Ode9C21.greekmelody	@ltx/en_us_andronache/he.h.m1:heHE.TyponTisAgnis.greekname
ltx/en_us_andronache/me.m01.d22:meMA.Ode9C21.incipit	By the rivers of your…
ltx/en_us_andronache/me.m01.d22:meMA.Ode9C21.melody	@ltx/en_us_andronache/he.h.m1:heHE.TyponTisAgnis.notmetered
ltx/en_us_andronache/me.m01.d22:meMA.Ode9C21.mode	@ltx/en_us_andronache/miscellanea:misc.Mode1
ltx/en_us_andronache/me.m01.d22:meMA.Ode9C21.ode	@ltx/en_us_andronache/miscellanea:misc.Ode9
ltx/en_us_andronache/me.m01.d22:meMA.Ode9C21.text	By the rivers of your blood, glorious one, you put out the deception of the idols; thus you illumined the fullness of the Church, for which do not cease interceding, O most excellent one, so that we all may bless you.
ltx/en_us_andronache/me.m01.d22:meMA.Ode9C22.incipit	O Anastasios, your glory beyond…
ltx/en_us_andronache/me.m01.d22:meMA.Ode9C22.melody	@ltx/en_us_andronache/he.h.m1:heHE.TyponTisAgnis.notmetered
ltx/en_us_andronache/me.m01.d22:meMA.Ode9C22.mode	@ltx/en_us_andronache/miscellanea:misc.Mode1
ltx/en_us_andronache/me.m01.d22:meMA.Ode9C22.ode	@ltx/en_us_andronache/miscellanea:misc.Ode9
ltx/en_us_andronache/me.m01.d22:meMA.Ode9C22.text	O Anastasios, your glory beyond measure and your inexpressible divine illumination, of which you partook of as a victorious one, having a place with Christ the Master, whom entreat even now for us who raise up hymns to you.
ltx/en_us_andronache/me.m01.d22:meMA.Ode9C2T.incipit	O, your fearful miracle! For…
ltx/en_us_andronache/me.m01.d22:meMA.Ode9C2T.melody	@ltx/en_us_andronache/he.h.m1:heHE.TyponTisAgnis.notmetered
ltx/en_us_andronache/me.m01.d22:meMA.Ode9C2T.mode	@ltx/en_us_andronache/miscellanea:misc.Mode1
ltx/en_us_andronache/me.m01.d22:meMA.Ode9C2T.ode	@ltx/en_us_andronache/miscellanea:misc.Ode9
ltx/en_us_andronache/me.m01.d22:meMA.Ode9C2T.text	O, your fearful miracle! For you, O Virgin Theotokos by giving birth to God the Logos, made the unexplainable manifest: the mystery from before generations and concealed before the ages in God the Creator of all things.
ltx/en_us_andronache/me.m01.d22:meMA.Ode9H.melody	@ltx/en_us_andronache/miscellanea:misc.HeirmosNotMetered
ltx/en_us_andronache/me.m01.d22:meMA.Ode9H.mode	@ltx/en_us_andronache/miscellanea:misc.Mode1
ltx/en_us_andronache/me.m01.d22:meMA.Ode9H.ode	@ltx/en_us_andronache/miscellanea:misc.Ode9
ltx/en_us_andronache/me.m01.d22:meMA.Ode9H.text	
ltx/en_us_andronache/me.m01.d22:meMA.Oikos1.text	
