ltx/en_us_andronache/me.m10.d29:meMA.C1.acrostic.notice1	
ltx/en_us_andronache/me.m10.d29:meMA.C1.acrostic.text	
ltx/en_us_andronache/me.m10.d29:meMA.C1.acrostic.title	
ltx/en_us_andronache/me.m10.d29:meMA.C2.acrostic.notice1	
ltx/en_us_andronache/me.m10.d29:meMA.C2.acrostic.text	
ltx/en_us_andronache/me.m10.d29:meMA.C2.acrostic.title	
ltx/en_us_andronache/me.m10.d29:meMA.Kontakion1.greekmelody	@ltx/en_us_andronache/he.a.m3:heAU.IParthenosSimeron.greekname
ltx/en_us_andronache/me.m10.d29:meMA.Kontakion1.incipit	Having been cleaned in the…
ltx/en_us_andronache/me.m10.d29:meMA.Kontakion1.melody	@ltx/en_us_andronache/he.a.m3:heAU.IParthenosSimeron.notmetered
ltx/en_us_andronache/me.m10.d29:meMA.Kontakion1.mode	@ltx/en_us_andronache/miscellanea:misc.Mode3
ltx/en_us_andronache/me.m10.d29:meMA.Kontakion1.text	Having been cleaned in the waters of virginity and washed in the blood of martyrdom, venerable Anastasia, you grant healing to those constrained by illness, salvation to who come from the heart, for Christ, who is full of ever-flowing grace, dispenses strength.
ltx/en_us_andronache/me.m10.d29:meMA.Ode1C11.greekmelody	@ltx/en_us_andronache/he.h.m8:heHE.AsomenToKyrio.greekname
ltx/en_us_andronache/me.m10.d29:meMA.Ode1C11.incipit	Honoring your light-bearing memory, bride…
ltx/en_us_andronache/me.m10.d29:meMA.Ode1C11.melody	@ltx/en_us_andronache/he.h.m8:heHE.AsomenToKyrio.notmetered
ltx/en_us_andronache/me.m10.d29:meMA.Ode1C11.mode	@ltx/en_us_andronache/miscellanea:misc.Mode8
ltx/en_us_andronache/me.m10.d29:meMA.Ode1C11.ode	@ltx/en_us_andronache/miscellanea:misc.Ode1
ltx/en_us_andronache/me.m10.d29:meMA.Ode1C11.text	Honoring your light-bearing memory, bride of God, grant me illumination of soul scattering away the darkness.
ltx/en_us_andronache/me.m10.d29:meMA.Ode1C12.incipit	Having dedicated yourself entirely to…
ltx/en_us_andronache/me.m10.d29:meMA.Ode1C12.melody	@ltx/en_us_andronache/he.h.m8:heHE.AsomenToKyrio.notmetered
ltx/en_us_andronache/me.m10.d29:meMA.Ode1C12.mode	@ltx/en_us_andronache/miscellanea:misc.Mode8
ltx/en_us_andronache/me.m10.d29:meMA.Ode1C12.ode	@ltx/en_us_andronache/miscellanea:misc.Ode1
ltx/en_us_andronache/me.m10.d29:meMA.Ode1C12.text	Having dedicated yourself entirely to your Creator from when you were in swaddling clothes you burned away the passions of the body by the fire of self-control.
ltx/en_us_andronache/me.m10.d29:meMA.Ode1C13.incipit	You were brought to the…
ltx/en_us_andronache/me.m10.d29:meMA.Ode1C13.melody	@ltx/en_us_andronache/he.h.m8:heHE.AsomenToKyrio.notmetered
ltx/en_us_andronache/me.m10.d29:meMA.Ode1C13.mode	@ltx/en_us_andronache/miscellanea:misc.Mode8
ltx/en_us_andronache/me.m10.d29:meMA.Ode1C13.ode	@ltx/en_us_andronache/miscellanea:misc.Ode1
ltx/en_us_andronache/me.m10.d29:meMA.Ode1C13.text	You were brought to the height of martyrdom, O Martyr, having taken no care for the flesh and were made worthy of the spiritual inner rooms as a virgin.
ltx/en_us_andronache/me.m10.d29:meMA.Ode1C1T.incipit	We honor you, O Maiden…
ltx/en_us_andronache/me.m10.d29:meMA.Ode1C1T.melody	@ltx/en_us_andronache/he.h.m8:heHE.AsomenToKyrio.notmetered
ltx/en_us_andronache/me.m10.d29:meMA.Ode1C1T.mode	@ltx/en_us_andronache/miscellanea:misc.Mode8
ltx/en_us_andronache/me.m10.d29:meMA.Ode1C1T.ode	@ltx/en_us_andronache/miscellanea:misc.Ode1
ltx/en_us_andronache/me.m10.d29:meMA.Ode1C1T.text	We honor you, O Maiden, the heaven-ward ladder in whom God has made mortals heavenly
ltx/en_us_andronache/me.m10.d29:meMA.Ode3C11.greekmelody	@ltx/en_us_andronache/he.h.m8:heHE.SyEiToStereoma.greekname
ltx/en_us_andronache/me.m10.d29:meMA.Ode3C11.incipit	Glorious one, you were standing…
ltx/en_us_andronache/me.m10.d29:meMA.Ode3C11.melody	@ltx/en_us_andronache/he.h.m8:heHE.SyEiToStereoma.notmetered
ltx/en_us_andronache/me.m10.d29:meMA.Ode3C11.mode	@ltx/en_us_andronache/miscellanea:misc.Mode8
ltx/en_us_andronache/me.m10.d29:meMA.Ode3C11.ode	@ltx/en_us_andronache/miscellanea:misc.Ode3
ltx/en_us_andronache/me.m10.d29:meMA.Ode3C11.text	Glorious one, you were standing before the royal judgment seat preaching Christ God - the creator, Logos, and Lord of all.
ltx/en_us_andronache/me.m10.d29:meMA.Ode3C12.incipit	A beautiful inner heart having…
ltx/en_us_andronache/me.m10.d29:meMA.Ode3C12.melody	@ltx/en_us_andronache/he.h.m8:heHE.SyEiToStereoma.notmetered
ltx/en_us_andronache/me.m10.d29:meMA.Ode3C12.mode	@ltx/en_us_andronache/miscellanea:misc.Mode8
ltx/en_us_andronache/me.m10.d29:meMA.Ode3C12.ode	@ltx/en_us_andronache/miscellanea:misc.Ode3
ltx/en_us_andronache/me.m10.d29:meMA.Ode3C12.text	A beautiful inner heart having been added to your visible appearance, Glorious one, it showed you as most beautiful to those who saw you.
ltx/en_us_andronache/me.m10.d29:meMA.Ode3C13.incipit	Christ, whose poverty you loved…
ltx/en_us_andronache/me.m10.d29:meMA.Ode3C13.melody	@ltx/en_us_andronache/he.h.m8:heHE.SyEiToStereoma.notmetered
ltx/en_us_andronache/me.m10.d29:meMA.Ode3C13.mode	@ltx/en_us_andronache/miscellanea:misc.Mode8
ltx/en_us_andronache/me.m10.d29:meMA.Ode3C13.ode	@ltx/en_us_andronache/miscellanea:misc.Ode3
ltx/en_us_andronache/me.m10.d29:meMA.Ode3C13.text	Christ, whose poverty you loved, gives you the joy of healings which is not to be taken away, O Maiden.
ltx/en_us_andronache/me.m10.d29:meMA.Ode3C1T.incipit	Burn up the wood of…
ltx/en_us_andronache/me.m10.d29:meMA.Ode3C1T.melody	@ltx/en_us_andronache/he.h.m8:heHE.SyEiToStereoma.notmetered
ltx/en_us_andronache/me.m10.d29:meMA.Ode3C1T.mode	@ltx/en_us_andronache/miscellanea:misc.Mode8
ltx/en_us_andronache/me.m10.d29:meMA.Ode3C1T.ode	@ltx/en_us_andronache/miscellanea:misc.Ode3
ltx/en_us_andronache/me.m10.d29:meMA.Ode3C1T.text	Burn up the wood of my offenses by the fire of your intercessions, Mother of God, and bring me the divine dew of their remission.
ltx/en_us_andronache/me.m10.d29:meMA.Ode3H.greekmelody	@ltx/en_us_andronache/he.h.m8:heHE.OuraniasApsidos.greekname
ltx/en_us_andronache/me.m10.d29:meMA.Ode3H.incipit	@ltx/en_us_andronache/he.h.m8:heHE.OuraniasApsidos.incipit
ltx/en_us_andronache/me.m10.d29:meMA.Ode3H.melody	@ltx/en_us_andronache/he.h.m8:heHE.OuraniasApsidos.melody
ltx/en_us_andronache/me.m10.d29:meMA.Ode3H.mode	@ltx/en_us_andronache/miscellanea:misc.Mode8
ltx/en_us_andronache/me.m10.d29:meMA.Ode3H.ode	@ltx/en_us_andronache/miscellanea:misc.Ode3
ltx/en_us_andronache/me.m10.d29:meMA.Ode3H.text	@ltx/en_us_andronache/he.h.m8:heHE.OuraniasApsidos.text
ltx/en_us_andronache/me.m10.d29:meMA.Ode3Kathisma1.greekmelody	@ltx/en_us_andronache/he.a.m1:heAU.TonTafonSouSotir.greekname
ltx/en_us_andronache/me.m10.d29:meMA.Ode3Kathisma1.incipit	From childhood you were dedicated…
ltx/en_us_andronache/me.m10.d29:meMA.Ode3Kathisma1.melody	@ltx/en_us_andronache/he.a.m1:heAU.TonTafonSouSotir.notmetered
ltx/en_us_andronache/me.m10.d29:meMA.Ode3Kathisma1.mode	@ltx/en_us_andronache/miscellanea:misc.Mode1
ltx/en_us_andronache/me.m10.d29:meMA.Ode3Kathisma1.text	From childhood you were dedicated to God, Venerable one, mortifying the passions of the flesh by self-control and you ran up unto the heights of martyrdom surrounded by glory, O Anastasia, having contested lawfully and overthrown the dragon into the abyss by the power of the Spirit.
ltx/en_us_andronache/me.m10.d29:meMA.Ode3Kathisma2.greekmelody	@ltx/en_us_andronache/he.a.m1:heAU.TonTafonSouSotir.greekname
ltx/en_us_andronache/me.m10.d29:meMA.Ode3Kathisma2.incipit	Having imitated Abraham of old…
ltx/en_us_andronache/me.m10.d29:meMA.Ode3Kathisma2.melody	@ltx/en_us_andronache/he.a.m1:heAU.TonTafonSouSotir.notmetered
ltx/en_us_andronache/me.m10.d29:meMA.Ode3Kathisma2.mode	@ltx/en_us_andronache/miscellanea:misc.Mode1
ltx/en_us_andronache/me.m10.d29:meMA.Ode3Kathisma2.text	Having imitated Abraham of old, O Father, you departed from your family according to the flesh, being obeying our God who was calling you. Therefore you struggled and showed your soul as more luminous than the rays of the sun, godly-minded and truly happy Avramios.
ltx/en_us_andronache/me.m10.d29:meMA.Ode3KathismaT.incipit	We hymn you, O Virgin…
ltx/en_us_andronache/me.m10.d29:meMA.Ode3KathismaT.melody	@ltx/en_us_andronache/he.a.m1:heAU.TonTafonSouSotir.notmetered
ltx/en_us_andronache/me.m10.d29:meMA.Ode3KathismaT.mode	@ltx/en_us_andronache/miscellanea:misc.Mode1
ltx/en_us_andronache/me.m10.d29:meMA.Ode3KathismaT.text	We hymn you, O Virgin, who are the bush which Moses saw unburned, the mountain of God, the holy cloud, the undefiled tabernacle, the God-receiving table, the palace of the King on high, and the all-luminous and impassable gate.
ltx/en_us_andronache/me.m10.d29:meMA.Ode4C11.greekmelody	@ltx/en_us_andronache/he.h.m8:heHE.EisakikoaKyrie.greekname
ltx/en_us_andronache/me.m10.d29:meMA.Ode4C11.incipit	Having taken up the light…
ltx/en_us_andronache/me.m10.d29:meMA.Ode4C11.melody	@ltx/en_us_andronache/he.h.m8:heHE.EisakikoaKyrie.notmetered
ltx/en_us_andronache/me.m10.d29:meMA.Ode4C11.mode	@ltx/en_us_andronache/miscellanea:misc.Mode8
ltx/en_us_andronache/me.m10.d29:meMA.Ode4C11.ode	@ltx/en_us_andronache/miscellanea:misc.Ode4
ltx/en_us_andronache/me.m10.d29:meMA.Ode4C11.text	Having taken up the light yoke from your youth, the lawless ones condemned you to be held in an iron collar, O Martyr.
ltx/en_us_andronache/me.m10.d29:meMA.Ode4C12.incipit	The drops of your blood…
ltx/en_us_andronache/me.m10.d29:meMA.Ode4C12.melody	@ltx/en_us_andronache/he.h.m8:heHE.EisakikoaKyrie.notmetered
ltx/en_us_andronache/me.m10.d29:meMA.Ode4C12.mode	@ltx/en_us_andronache/miscellanea:misc.Mode8
ltx/en_us_andronache/me.m10.d29:meMA.Ode4C12.ode	@ltx/en_us_andronache/miscellanea:misc.Ode4
ltx/en_us_andronache/me.m10.d29:meMA.Ode4C12.text	The drops of your blood put out the flames of polytheism, and the fire of your miracles burned the wood of the passions.
ltx/en_us_andronache/me.m10.d29:meMA.Ode4C13.incipit	The most wicked one, having…
ltx/en_us_andronache/me.m10.d29:meMA.Ode4C13.melody	@ltx/en_us_andronache/he.h.m8:heHE.EisakikoaKyrie.notmetered
ltx/en_us_andronache/me.m10.d29:meMA.Ode4C13.mode	@ltx/en_us_andronache/miscellanea:misc.Mode8
ltx/en_us_andronache/me.m10.d29:meMA.Ode4C13.ode	@ltx/en_us_andronache/miscellanea:misc.Ode4
ltx/en_us_andronache/me.m10.d29:meMA.Ode4C13.text	The most wicked one, having stripped off your body, did not strip you of grace, but rather obtained for you an unbreakable garment woven from above.
ltx/en_us_andronache/me.m10.d29:meMA.Ode4C14.incipit	When you had been lifted…
ltx/en_us_andronache/me.m10.d29:meMA.Ode4C14.melody	@ltx/en_us_andronache/he.h.m8:heHE.EisakikoaKyrie.notmetered
ltx/en_us_andronache/me.m10.d29:meMA.Ode4C14.mode	@ltx/en_us_andronache/miscellanea:misc.Mode8
ltx/en_us_andronache/me.m10.d29:meMA.Ode4C14.ode	@ltx/en_us_andronache/miscellanea:misc.Ode4
ltx/en_us_andronache/me.m10.d29:meMA.Ode4C14.text	When you had been lifted above the ground, fire was placed upon your chest, O Martyr, kindling your love for the Master, beautiful virgin.
ltx/en_us_andronache/me.m10.d29:meMA.Ode4C1T.incipit	After childbirth you remained incorrupt…
ltx/en_us_andronache/me.m10.d29:meMA.Ode4C1T.melody	@ltx/en_us_andronache/he.h.m8:heHE.EisakikoaKyrie.notmetered
ltx/en_us_andronache/me.m10.d29:meMA.Ode4C1T.mode	@ltx/en_us_andronache/miscellanea:misc.Mode8
ltx/en_us_andronache/me.m10.d29:meMA.Ode4C1T.ode	@ltx/en_us_andronache/miscellanea:misc.Ode4
ltx/en_us_andronache/me.m10.d29:meMA.Ode4C1T.text	After childbirth you remained incorrupt, O Virgin, as you had been before, for you gave birth to a new child known to have existed before the ages.
ltx/en_us_andronache/me.m10.d29:meMA.Ode5C11.greekmelody	@ltx/en_us_andronache/he.h.m8:heHE.OrthrizontesVoomenSoi.greekname
ltx/en_us_andronache/me.m10.d29:meMA.Ode5C11.incipit	You were seen to be…
ltx/en_us_andronache/me.m10.d29:meMA.Ode5C11.melody	@ltx/en_us_andronache/he.h.m8:heHE.OrthrizontesVoomenSoi.notmetered
ltx/en_us_andronache/me.m10.d29:meMA.Ode5C11.mode	@ltx/en_us_andronache/miscellanea:misc.Mode8
ltx/en_us_andronache/me.m10.d29:meMA.Ode5C11.ode	@ltx/en_us_andronache/miscellanea:misc.Ode5
ltx/en_us_andronache/me.m10.d29:meMA.Ode5C11.text	You were seen to be unassailable by the wooden fire, O Martyr, for the fire of divine love in your inner heart fell like dew upon you.
ltx/en_us_andronache/me.m10.d29:meMA.Ode5C12.incipit	Your face was made beautiful…
ltx/en_us_andronache/me.m10.d29:meMA.Ode5C12.melody	@ltx/en_us_andronache/he.h.m8:heHE.OrthrizontesVoomenSoi.notmetered
ltx/en_us_andronache/me.m10.d29:meMA.Ode5C12.mode	@ltx/en_us_andronache/miscellanea:misc.Mode8
ltx/en_us_andronache/me.m10.d29:meMA.Ode5C12.ode	@ltx/en_us_andronache/miscellanea:misc.Ode5
ltx/en_us_andronache/me.m10.d29:meMA.Ode5C12.text	Your face was made beautiful by strokes, O Martyr, and you cleansed the ugly faces of the enemies.
ltx/en_us_andronache/me.m10.d29:meMA.Ode5C13.incipit	Having been stretched upon wood…
ltx/en_us_andronache/me.m10.d29:meMA.Ode5C13.melody	@ltx/en_us_andronache/he.h.m8:heHE.OrthrizontesVoomenSoi.notmetered
ltx/en_us_andronache/me.m10.d29:meMA.Ode5C13.mode	@ltx/en_us_andronache/miscellanea:misc.Mode8
ltx/en_us_andronache/me.m10.d29:meMA.Ode5C13.ode	@ltx/en_us_andronache/miscellanea:misc.Ode5
ltx/en_us_andronache/me.m10.d29:meMA.Ode5C13.text	Having been stretched upon wood because of your yearning for your bridegroom, godly-minded Anastasia, you were the image of the divine passion.
ltx/en_us_andronache/me.m10.d29:meMA.Ode5C1T.incipit	We hymn you, all hymned…
ltx/en_us_andronache/me.m10.d29:meMA.Ode5C1T.melody	@ltx/en_us_andronache/he.h.m8:heHE.OrthrizontesVoomenSoi.notmetered
ltx/en_us_andronache/me.m10.d29:meMA.Ode5C1T.mode	@ltx/en_us_andronache/miscellanea:misc.Mode8
ltx/en_us_andronache/me.m10.d29:meMA.Ode5C1T.ode	@ltx/en_us_andronache/miscellanea:misc.Ode5
ltx/en_us_andronache/me.m10.d29:meMA.Ode5C1T.text	We hymn you, all hymned Lady Theotokos, for you seedlessly bore in your womb the supremely hymned God in the flesh.
ltx/en_us_andronache/me.m10.d29:meMA.Ode6C11.greekmelody	@ltx/en_us_andronache/he.h.m8:heHE.ChitonaMoiParaschou.greekname
ltx/en_us_andronache/me.m10.d29:meMA.Ode6C11.incipit	Having your body twisted to…
ltx/en_us_andronache/me.m10.d29:meMA.Ode6C11.melody	@ltx/en_us_andronache/he.h.m8:heHE.ChitonaMoiParaschou.notmetered
ltx/en_us_andronache/me.m10.d29:meMA.Ode6C11.mode	@ltx/en_us_andronache/miscellanea:misc.Mode8
ltx/en_us_andronache/me.m10.d29:meMA.Ode6C11.ode	@ltx/en_us_andronache/miscellanea:misc.Ode6
ltx/en_us_andronache/me.m10.d29:meMA.Ode6C11.text	Having your body twisted to discomfort, you showed the right path of your choosing God, all honored Anastasia.
ltx/en_us_andronache/me.m10.d29:meMA.Ode6C12.incipit	You were hung in mid…
ltx/en_us_andronache/me.m10.d29:meMA.Ode6C12.melody	@ltx/en_us_andronache/he.h.m8:heHE.ChitonaMoiParaschou.notmetered
ltx/en_us_andronache/me.m10.d29:meMA.Ode6C12.mode	@ltx/en_us_andronache/miscellanea:misc.Mode8
ltx/en_us_andronache/me.m10.d29:meMA.Ode6C12.ode	@ltx/en_us_andronache/miscellanea:misc.Ode6
ltx/en_us_andronache/me.m10.d29:meMA.Ode6C12.text	You were hung in mid air bearing blows all over, O Martyr, yet saving the nobility of the soul unharmed, admirable one.
ltx/en_us_andronache/me.m10.d29:meMA.Ode6C13.incipit	You bore the cutting-off of…
ltx/en_us_andronache/me.m10.d29:meMA.Ode6C13.melody	@ltx/en_us_andronache/he.h.m8:heHE.ChitonaMoiParaschou.notmetered
ltx/en_us_andronache/me.m10.d29:meMA.Ode6C13.mode	@ltx/en_us_andronache/miscellanea:misc.Mode8
ltx/en_us_andronache/me.m10.d29:meMA.Ode6C13.ode	@ltx/en_us_andronache/miscellanea:misc.Ode6
ltx/en_us_andronache/me.m10.d29:meMA.Ode6C13.text	You bore the cutting-off of your breasts, nourishing the faithful with the milk of your example.
ltx/en_us_andronache/me.m10.d29:meMA.Ode6C1T.incipit	You bore the God who…
ltx/en_us_andronache/me.m10.d29:meMA.Ode6C1T.melody	@ltx/en_us_andronache/he.h.m8:heHE.ChitonaMoiParaschou.notmetered
ltx/en_us_andronache/me.m10.d29:meMA.Ode6C1T.mode	@ltx/en_us_andronache/miscellanea:misc.Mode8
ltx/en_us_andronache/me.m10.d29:meMA.Ode6C1T.ode	@ltx/en_us_andronache/miscellanea:misc.Ode6
ltx/en_us_andronache/me.m10.d29:meMA.Ode6C1T.text	You bore the God who loves humanity, good and loving Lady, intercede with Him to free me from the fire of Gehenna.
ltx/en_us_andronache/me.m10.d29:meMA.Ode6H.greekmelody	@ltx/en_us_andronache/he.h.m8:heHE.TinDeisinEkcheo.greekname
ltx/en_us_andronache/me.m10.d29:meMA.Ode6H.incipit	@ltx/en_us_andronache/he.h.m8:heHE.TinDeisinEkcheo.incipit
ltx/en_us_andronache/me.m10.d29:meMA.Ode6H.melody	@ltx/en_us_andronache/he.h.m8:heHE.TinDeisinEkcheo.melody
ltx/en_us_andronache/me.m10.d29:meMA.Ode6H.mode	@ltx/en_us_andronache/miscellanea:misc.Mode8
ltx/en_us_andronache/me.m10.d29:meMA.Ode6H.ode	@ltx/en_us_andronache/miscellanea:misc.Ode6
ltx/en_us_andronache/me.m10.d29:meMA.Ode6H.text	@ltx/en_us_andronache/he.h.m8:heHE.TinDeisinEkcheo.text
ltx/en_us_andronache/me.m10.d29:meMA.Ode7C11.greekmelody	@ltx/en_us_andronache/he.h.m8:heHE.PaidesEvraion.greekname
ltx/en_us_andronache/me.m10.d29:meMA.Ode7C11.incipit	Where the sound of the…
ltx/en_us_andronache/me.m10.d29:meMA.Ode7C11.melody	@ltx/en_us_andronache/he.h.m8:heHE.PaidesEvraion.notmetered
ltx/en_us_andronache/me.m10.d29:meMA.Ode7C11.mode	@ltx/en_us_andronache/miscellanea:misc.Mode8
ltx/en_us_andronache/me.m10.d29:meMA.Ode7C11.ode	@ltx/en_us_andronache/miscellanea:misc.Ode7
ltx/en_us_andronache/me.m10.d29:meMA.Ode7C11.text	Where the sound of the voice of those who celebrate has sprung forth, there you dance, O athlete, with the choirs of virgins singing to the Creator: Lord God you are blessed unto the ages
ltx/en_us_andronache/me.m10.d29:meMA.Ode7C12.incipit	Seeing your limbs crushed together…
ltx/en_us_andronache/me.m10.d29:meMA.Ode7C12.melody	@ltx/en_us_andronache/he.h.m8:heHE.PaidesEvraion.notmetered
ltx/en_us_andronache/me.m10.d29:meMA.Ode7C12.mode	@ltx/en_us_andronache/miscellanea:misc.Mode8
ltx/en_us_andronache/me.m10.d29:meMA.Ode7C12.ode	@ltx/en_us_andronache/miscellanea:misc.Ode7
ltx/en_us_andronache/me.m10.d29:meMA.Ode7C12.text	Seeing your limbs crushed together and enduring the tearing off of the nails, you offering yourself as an sacrifice to Christ, as you sang: Lord God, you are blessed unto the ages.
ltx/en_us_andronache/me.m10.d29:meMA.Ode7C13.incipit	You were seen as a…
ltx/en_us_andronache/me.m10.d29:meMA.Ode7C13.melody	@ltx/en_us_andronache/he.h.m8:heHE.PaidesEvraion.notmetered
ltx/en_us_andronache/me.m10.d29:meMA.Ode7C13.mode	@ltx/en_us_andronache/miscellanea:misc.Mode8
ltx/en_us_andronache/me.m10.d29:meMA.Ode7C13.ode	@ltx/en_us_andronache/miscellanea:misc.Ode7
ltx/en_us_andronache/me.m10.d29:meMA.Ode7C13.text	You were seen as a godly-minded vine, your hands and feet pruned as branches, and noetically cultivating for us the wine which gladdens hearts and drives away the drunkenness of the passions.
ltx/en_us_andronache/me.m10.d29:meMA.Ode7C14.incipit	You were not terrified by…
ltx/en_us_andronache/me.m10.d29:meMA.Ode7C14.melody	@ltx/en_us_andronache/he.h.m8:heHE.PaidesEvraion.notmetered
ltx/en_us_andronache/me.m10.d29:meMA.Ode7C14.mode	@ltx/en_us_andronache/miscellanea:misc.Mode8
ltx/en_us_andronache/me.m10.d29:meMA.Ode7C14.ode	@ltx/en_us_andronache/miscellanea:misc.Ode7
ltx/en_us_andronache/me.m10.d29:meMA.Ode7C14.text	You were not terrified by the fire you could feel, imitating the three youths of old, for you received a divine dew while singing: Lord God, you are blessed unto the ages.
ltx/en_us_andronache/me.m10.d29:meMA.Ode7C1T.incipit	He who is above divine…
ltx/en_us_andronache/me.m10.d29:meMA.Ode7C1T.melody	@ltx/en_us_andronache/he.h.m8:heHE.PaidesEvraion.notmetered
ltx/en_us_andronache/me.m10.d29:meMA.Ode7C1T.mode	@ltx/en_us_andronache/miscellanea:misc.Mode8
ltx/en_us_andronache/me.m10.d29:meMA.Ode7C1T.ode	@ltx/en_us_andronache/miscellanea:misc.Ode7
ltx/en_us_andronache/me.m10.d29:meMA.Ode7C1T.text	He who is above divine, put on the whole of man without sin, and came forth from your womb bearing flesh, pure one; implore him to save those who honor you with faith.
ltx/en_us_andronache/me.m10.d29:meMA.Ode8C11.greekmelody	@ltx/en_us_andronache/he.h.m8:heHE.EptaplasiosKaminon.greekname
ltx/en_us_andronache/me.m10.d29:meMA.Ode8C11.incipit	You were brave as a…
ltx/en_us_andronache/me.m10.d29:meMA.Ode8C11.melody	@ltx/en_us_andronache/he.h.m8:heHE.EptaplasiosKaminon.notmetered
ltx/en_us_andronache/me.m10.d29:meMA.Ode8C11.mode	@ltx/en_us_andronache/miscellanea:misc.Mode8
ltx/en_us_andronache/me.m10.d29:meMA.Ode8C11.ode	@ltx/en_us_andronache/miscellanea:misc.Ode8
ltx/en_us_andronache/me.m10.d29:meMA.Ode8C11.text	You were brave as a youth, all honored athlete, and you raised up trophies against deceit, for being made firm you bore the cutting of your hands, feet, and breasts, and the pulling out of your teeth, singing in joy: Exalt Christ, all people, beyond measure unto the ages.
ltx/en_us_andronache/me.m10.d29:meMA.Ode8C12.incipit	Wholly bright, as the sun…
ltx/en_us_andronache/me.m10.d29:meMA.Ode8C12.melody	@ltx/en_us_andronache/he.h.m8:heHE.EptaplasiosKaminon.notmetered
ltx/en_us_andronache/me.m10.d29:meMA.Ode8C12.mode	@ltx/en_us_andronache/miscellanea:misc.Mode8
ltx/en_us_andronache/me.m10.d29:meMA.Ode8C12.ode	@ltx/en_us_andronache/miscellanea:misc.Ode8
ltx/en_us_andronache/me.m10.d29:meMA.Ode8C12.text	Wholly bright, as the sun, with the brightness of virginity, you flashed like lightning with the beauty of martyrdom and illumined the world with the bright shining rays of your great endurance, Anastasia, eagerly crying: O you priests bless Him and you people exalt Christ beyond measure unto all ages.
ltx/en_us_andronache/me.m10.d29:meMA.Ode8C13.incipit	My soul is overrun by…
ltx/en_us_andronache/me.m10.d29:meMA.Ode8C13.melody	@ltx/en_us_andronache/he.h.m8:heHE.EptaplasiosKaminon.notmetered
ltx/en_us_andronache/me.m10.d29:meMA.Ode8C13.mode	@ltx/en_us_andronache/miscellanea:misc.Mode8
ltx/en_us_andronache/me.m10.d29:meMA.Ode8C13.ode	@ltx/en_us_andronache/miscellanea:misc.Ode8
ltx/en_us_andronache/me.m10.d29:meMA.Ode8C13.text	My soul is overrun by passions and darkened by the attacks of the serpent; cleanse it and keep it from dangers by your intercessions and by your luminous overshadowing, martyr, illumine me who am shouting: O you priests bless Him and you people exalt Christ beyond measure unto all ages.
ltx/en_us_andronache/me.m10.d29:meMA.Ode8C1T.incipit	The virgin thirsted for you…
ltx/en_us_andronache/me.m10.d29:meMA.Ode8C1T.melody	@ltx/en_us_andronache/he.h.m8:heHE.EptaplasiosKaminon.notmetered
ltx/en_us_andronache/me.m10.d29:meMA.Ode8C1T.mode	@ltx/en_us_andronache/miscellanea:misc.Mode8
ltx/en_us_andronache/me.m10.d29:meMA.Ode8C1T.ode	@ltx/en_us_andronache/miscellanea:misc.Ode8
ltx/en_us_andronache/me.m10.d29:meMA.Ode8C1T.text	The virgin thirsted for you, the pure and spotless one, and kept her body and soul spotless burning the tinder of the passions through patience and bearing the trials of many tortures, and now in heaven, in the inner rooms she dances rejoicing with you unto all the ages.
ltx/en_us_andronache/me.m10.d29:meMA.Ode8H.greekmelody	@ltx/en_us_andronache/he.h.m8:heHE.NikitaiTyrannou.greekname
ltx/en_us_andronache/me.m10.d29:meMA.Ode8H.incipit	@ltx/en_us_andronache/he.h.m8:heHE.NikitaiTyrannou.incipit
ltx/en_us_andronache/me.m10.d29:meMA.Ode8H.melody	@ltx/en_us_andronache/he.h.m8:heHE.NikitaiTyrannou.melody
ltx/en_us_andronache/me.m10.d29:meMA.Ode8H.mode	@ltx/en_us_andronache/miscellanea:misc.Mode8
ltx/en_us_andronache/me.m10.d29:meMA.Ode8H.ode	@ltx/en_us_andronache/miscellanea:misc.Ode8
ltx/en_us_andronache/me.m10.d29:meMA.Ode8H.text	@ltx/en_us_andronache/he.h.m8:heHE.NikitaiTyrannou.text
ltx/en_us_andronache/me.m10.d29:meMA.Ode9C11.greekmelody	@ltx/en_us_andronache/he.h.m8:heHE.ExestiEpiTouto.greekname
ltx/en_us_andronache/me.m10.d29:meMA.Ode9C11.incipit	You were hung upon a…
ltx/en_us_andronache/me.m10.d29:meMA.Ode9C11.melody	@ltx/en_us_andronache/he.h.m8:heHE.ExestiEpiTouto.notmetered
ltx/en_us_andronache/me.m10.d29:meMA.Ode9C11.mode	@ltx/en_us_andronache/miscellanea:misc.Mode8
ltx/en_us_andronache/me.m10.d29:meMA.Ode9C11.ode	@ltx/en_us_andronache/miscellanea:misc.Ode9
ltx/en_us_andronache/me.m10.d29:meMA.Ode9C11.text	You were hung upon a scaffold, being an icon of the saving passion and you bore the cutting of your hands and feet and the pulling out of your teeth, the removal of your tongue and breasts, pure Anastasia, the boast of monastics and the ornament of martyrs.
ltx/en_us_andronache/me.m10.d29:meMA.Ode9C12.incipit	You made yourself beautiful as…
ltx/en_us_andronache/me.m10.d29:meMA.Ode9C12.melody	@ltx/en_us_andronache/he.h.m8:heHE.ExestiEpiTouto.notmetered
ltx/en_us_andronache/me.m10.d29:meMA.Ode9C12.mode	@ltx/en_us_andronache/miscellanea:misc.Mode8
ltx/en_us_andronache/me.m10.d29:meMA.Ode9C12.ode	@ltx/en_us_andronache/miscellanea:misc.Ode9
ltx/en_us_andronache/me.m10.d29:meMA.Ode9C12.text	You made yourself beautiful as a bride through your joining in the beautifying passion of your bridegroom, the creator of beauty, and you dwelt within the bright inner rooms as a chosen one, bringing a virginal lamp and now you reign, shining, with the one who lives unto the ages.
ltx/en_us_andronache/me.m10.d29:meMA.Ode9C13.incipit	Your pains drip sweetness driving…
ltx/en_us_andronache/me.m10.d29:meMA.Ode9C13.melody	@ltx/en_us_andronache/he.h.m8:heHE.ExestiEpiTouto.notmetered
ltx/en_us_andronache/me.m10.d29:meMA.Ode9C13.mode	@ltx/en_us_andronache/miscellanea:misc.Mode8
ltx/en_us_andronache/me.m10.d29:meMA.Ode9C13.ode	@ltx/en_us_andronache/miscellanea:misc.Ode9
ltx/en_us_andronache/me.m10.d29:meMA.Ode9C13.text	Your pains drip sweetness driving out the bitterness of sin, and the urn pours rivers of cures and always washes away the passions and difficult diseases unto the glory of the Savior who worthily glorified you, august Anastasia,
ltx/en_us_andronache/me.m10.d29:meMA.Ode9C14.incipit	Women were made made brave…
ltx/en_us_andronache/me.m10.d29:meMA.Ode9C14.melody	@ltx/en_us_andronache/he.h.m8:heHE.ExestiEpiTouto.notmetered
ltx/en_us_andronache/me.m10.d29:meMA.Ode9C14.mode	@ltx/en_us_andronache/miscellanea:misc.Mode8
ltx/en_us_andronache/me.m10.d29:meMA.Ode9C14.ode	@ltx/en_us_andronache/miscellanea:misc.Ode9
ltx/en_us_andronache/me.m10.d29:meMA.Ode9C14.text	Women were made made brave being strengthened by your Cross, all-powerful Christ, and they manly crushed the much-scheming head of the enemy, obtaining the dwelling place of paradise in harmony, partaking of deification, and hymning you as is fitting.
ltx/en_us_andronache/me.m10.d29:meMA.Ode9C1T.incipit	As she knew you that…
ltx/en_us_andronache/me.m10.d29:meMA.Ode9C1T.melody	@ltx/en_us_andronache/he.h.m8:heHE.ExestiEpiTouto.notmetered
ltx/en_us_andronache/me.m10.d29:meMA.Ode9C1T.mode	@ltx/en_us_andronache/miscellanea:misc.Mode8
ltx/en_us_andronache/me.m10.d29:meMA.Ode9C1T.ode	@ltx/en_us_andronache/miscellanea:misc.Ode9
ltx/en_us_andronache/me.m10.d29:meMA.Ode9C1T.text	As she knew you that put on flesh from a woman, your martyr, O Lord, having been made bright with the pearl of virginity and having been decked with the blood of martyrdom as with flowers, she was gloriously brought behind your mother to you, the Christ, as to the one who reigns over creation.
ltx/en_us_andronache/me.m10.d29:meMA.Ode9H.greekmelody	@ltx/en_us_andronache/he.h.m8:heHE.KyriosTheotokon.greekname
ltx/en_us_andronache/me.m10.d29:meMA.Ode9H.incipit	@ltx/en_us_andronache/he.h.m8:heHE.KyriosTheotokon.incipit
ltx/en_us_andronache/me.m10.d29:meMA.Ode9H.melody	@ltx/en_us_andronache/he.h.m8:heHE.KyriosTheotokon.melody
ltx/en_us_andronache/me.m10.d29:meMA.Ode9H.mode	@ltx/en_us_andronache/miscellanea:misc.Mode8
ltx/en_us_andronache/me.m10.d29:meMA.Ode9H.ode	@ltx/en_us_andronache/miscellanea:misc.Ode9
ltx/en_us_andronache/me.m10.d29:meMA.Ode9H.text	@ltx/en_us_andronache/he.h.m8:heHE.KyriosTheotokon.text
