ltx/en_us_andronache/me.m02.d23:meMA.C1.acrostic.notice1	
ltx/en_us_andronache/me.m02.d23:meMA.C1.acrostic.text	
ltx/en_us_andronache/me.m02.d23:meMA.C1.acrostic.title	Canon for the Saint.
ltx/en_us_andronache/me.m02.d23:meMA.Kontakion1.greekmelody	@ltx/en_us_andronache/he.a.m1:heAU.ChorosAngelikos.greekname
ltx/en_us_andronache/me.m02.d23:meMA.Kontakion1.incipit	Offering rational fruits to the…
ltx/en_us_andronache/me.m02.d23:meMA.Kontakion1.melody	@ltx/en_us_andronache/he.a.m1:heAU.ChorosAngelikos.notmetered
ltx/en_us_andronache/me.m02.d23:meMA.Kontakion1.mode	@ltx/en_us_andronache/miscellanea:misc.Mode1
ltx/en_us_andronache/me.m02.d23:meMA.Kontakion1.text	Offering rational fruits to the Lord, wise Polycarp, through god-inspired virtues, you were shown to be worthy of God, blessed hierarch; therefore, today, we who have been illumined by your words hymn your memory, which is most worthy of praise, while glorifying the Lord.
ltx/en_us_andronache/me.m02.d23:meMA.Ode1C11.greekmelody	@ltx/en_us_andronache/he.h.m2:heHE.DefteLaoi.greekname
ltx/en_us_andronache/me.m02.d23:meMA.Ode1C11.incipit	Illumined by Christ’s shining light…
ltx/en_us_andronache/me.m02.d23:meMA.Ode1C11.melody	@ltx/en_us_andronache/he.h.m2:heHE.DefteLaoi.notmetered
ltx/en_us_andronache/me.m02.d23:meMA.Ode1C11.mode	@ltx/en_us_andronache/miscellanea:misc.Mode2
ltx/en_us_andronache/me.m02.d23:meMA.Ode1C11.ode	@ltx/en_us_andronache/miscellanea:misc.Ode1
ltx/en_us_andronache/me.m02.d23:meMA.Ode1C11.text	Illumined by Christ’s shining light and filed by his brightness, Father, wholly illumine my darkened soul, godly-minded one, by your entreaties.
ltx/en_us_andronache/me.m02.d23:meMA.Ode1C12.incipit	The light of the preaching…
ltx/en_us_andronache/me.m02.d23:meMA.Ode1C12.melody	@ltx/en_us_andronache/he.h.m2:heHE.DefteLaoi.notmetered
ltx/en_us_andronache/me.m02.d23:meMA.Ode1C12.mode	@ltx/en_us_andronache/miscellanea:misc.Mode2
ltx/en_us_andronache/me.m02.d23:meMA.Ode1C12.ode	@ltx/en_us_andronache/miscellanea:misc.Ode1
ltx/en_us_andronache/me.m02.d23:meMA.Ode1C12.text	The light of the preaching of salvation having flashed like lightning with its rays in your pure heart like a spotless mirror, illumined all.
ltx/en_us_andronache/me.m02.d23:meMA.Ode1C13.incipit	You became an inscribed tablet…
ltx/en_us_andronache/me.m02.d23:meMA.Ode1C13.melody	@ltx/en_us_andronache/he.h.m2:heHE.DefteLaoi.notmetered
ltx/en_us_andronache/me.m02.d23:meMA.Ode1C13.mode	@ltx/en_us_andronache/miscellanea:misc.Mode2
ltx/en_us_andronache/me.m02.d23:meMA.Ode1C13.ode	@ltx/en_us_andronache/miscellanea:misc.Ode1
ltx/en_us_andronache/me.m02.d23:meMA.Ode1C13.text	You became an inscribed tablet of the new law, Father, having the Gospel of divine grace written not by black ink but by the Divine Spirit.
ltx/en_us_andronache/me.m02.d23:meMA.Ode1C1H.greekmelody	@ltx/en_us_andronache/he.h.m2:heHE.DefteLaoi.greekname
ltx/en_us_andronache/me.m02.d23:meMA.Ode1C1H.incipit	@ltx/en_us_andronache/he.h.m2:heHE.DefteLaoi.incipit
ltx/en_us_andronache/me.m02.d23:meMA.Ode1C1H.melody	@ltx/en_us_andronache/he.h.m2:heHE.DefteLaoi.melody
ltx/en_us_andronache/me.m02.d23:meMA.Ode1C1H.mode	@ltx/en_us_andronache/miscellanea:misc.Mode2
ltx/en_us_andronache/me.m02.d23:meMA.Ode1C1H.ode	@ltx/en_us_andronache/miscellanea:misc.Ode1
ltx/en_us_andronache/me.m02.d23:meMA.Ode1C1H.text	@ltx/en_us_andronache/he.h.m2:heHE.DefteLaoi.text
ltx/en_us_andronache/me.m02.d23:meMA.Ode1C1T.incipit	Knowing that God who was…
ltx/en_us_andronache/me.m02.d23:meMA.Ode1C1T.melody	@ltx/en_us_andronache/he.h.m2:heHE.DefteLaoi.notmetered
ltx/en_us_andronache/me.m02.d23:meMA.Ode1C1T.mode	@ltx/en_us_andronache/miscellanea:misc.Mode2
ltx/en_us_andronache/me.m02.d23:meMA.Ode1C1T.ode	@ltx/en_us_andronache/miscellanea:misc.Ode1
ltx/en_us_andronache/me.m02.d23:meMA.Ode1C1T.text	Knowing that God who was before creation and before all ages took a body from you, without the will of the flesh, we confess you to be Theotokos.
ltx/en_us_andronache/me.m02.d23:meMA.Ode3C11.greekmelody	@ltx/en_us_andronache/he.h.m2:heHE.StereosonImasEnSoiKyrie.greekname
ltx/en_us_andronache/me.m02.d23:meMA.Ode3C11.incipit	God-seeing Polycarp, you became the…
ltx/en_us_andronache/me.m02.d23:meMA.Ode3C11.melody	@ltx/en_us_andronache/he.h.m2:heHE.StereosonImasEnSoiKyrie.notmetered
ltx/en_us_andronache/me.m02.d23:meMA.Ode3C11.mode	@ltx/en_us_andronache/miscellanea:misc.Mode2
ltx/en_us_andronache/me.m02.d23:meMA.Ode3C11.ode	@ltx/en_us_andronache/miscellanea:misc.Ode3
ltx/en_us_andronache/me.m02.d23:meMA.Ode3C11.text	God-seeing Polycarp, you became the fruitful olive in the house of your Lord, as the Psalm says, bringing joy by your preaching.
ltx/en_us_andronache/me.m02.d23:meMA.Ode3C12.incipit	Having harmoniously directed your mind…
ltx/en_us_andronache/me.m02.d23:meMA.Ode3C12.melody	@ltx/en_us_andronache/he.h.m2:heHE.StereosonImasEnSoiKyrie.notmetered
ltx/en_us_andronache/me.m02.d23:meMA.Ode3C12.mode	@ltx/en_us_andronache/miscellanea:misc.Mode2
ltx/en_us_andronache/me.m02.d23:meMA.Ode3C12.ode	@ltx/en_us_andronache/miscellanea:misc.Ode3
ltx/en_us_andronache/me.m02.d23:meMA.Ode3C12.text	Having harmoniously directed your mind towards the commandments of the Savior, God-blessed one, you worthily became a great shepherd of His Church.
ltx/en_us_andronache/me.m02.d23:meMA.Ode3C13.incipit	You directed yourself entirely towards…
ltx/en_us_andronache/me.m02.d23:meMA.Ode3C13.melody	@ltx/en_us_andronache/he.h.m2:heHE.StereosonImasEnSoiKyrie.notmetered
ltx/en_us_andronache/me.m02.d23:meMA.Ode3C13.mode	@ltx/en_us_andronache/miscellanea:misc.Mode2
ltx/en_us_andronache/me.m02.d23:meMA.Ode3C13.ode	@ltx/en_us_andronache/miscellanea:misc.Ode3
ltx/en_us_andronache/me.m02.d23:meMA.Ode3C13.text	You directed yourself entirely towards Christ as a living sacrifice through martyrdom; having contested before in the martyrdom of the conscience in ascetic labors.
ltx/en_us_andronache/me.m02.d23:meMA.Ode3C1H.greekmelody	@ltx/en_us_andronache/he.h.m2:heHE.StereosonImasEnSoiKyrie.greekname
ltx/en_us_andronache/me.m02.d23:meMA.Ode3C1H.incipit	@ltx/en_us_andronache/he.h.m2:heHE.StereosonImasEnSoiKyrie.incipit
ltx/en_us_andronache/me.m02.d23:meMA.Ode3C1H.melody	@ltx/en_us_andronache/he.h.m2:heHE.StereosonImasEnSoiKyrie.melody
ltx/en_us_andronache/me.m02.d23:meMA.Ode3C1H.mode	@ltx/en_us_andronache/miscellanea:misc.Mode2
ltx/en_us_andronache/me.m02.d23:meMA.Ode3C1H.ode	@ltx/en_us_andronache/miscellanea:misc.Ode3
ltx/en_us_andronache/me.m02.d23:meMA.Ode3C1H.text	@ltx/en_us_andronache/he.h.m2:heHE.StereosonImasEnSoiKyrie.text
ltx/en_us_andronache/me.m02.d23:meMA.Ode3C1T.incipit	You shook off the dust…
ltx/en_us_andronache/me.m02.d23:meMA.Ode3C1T.melody	@ltx/en_us_andronache/he.h.m2:heHE.StereosonImasEnSoiKyrie.notmetered
ltx/en_us_andronache/me.m02.d23:meMA.Ode3C1T.mode	@ltx/en_us_andronache/miscellanea:misc.Mode2
ltx/en_us_andronache/me.m02.d23:meMA.Ode3C1T.ode	@ltx/en_us_andronache/miscellanea:misc.Ode3
ltx/en_us_andronache/me.m02.d23:meMA.Ode3C1T.text	You shook off the dust of our mortality having truly given birth to immortality and you weaved for us robes of incorruption, O Virgin, by your giving birth.
ltx/en_us_andronache/me.m02.d23:meMA.Ode3Kathisma1.greekmelody	@ltx/en_us_andronache/he.a.m8:heAU.TinSofianKaiLogon.greekname
ltx/en_us_andronache/me.m02.d23:meMA.Ode3Kathisma1.incipit	You truly cultivated the grapes…
ltx/en_us_andronache/me.m02.d23:meMA.Ode3Kathisma1.melody	@ltx/en_us_andronache/he.a.m8:heAU.TinSofianKaiLogon.notmetered
ltx/en_us_andronache/me.m02.d23:meMA.Ode3Kathisma1.mode	@ltx/en_us_andronache/miscellanea:misc.Mode8
ltx/en_us_andronache/me.m02.d23:meMA.Ode3Kathisma1.text	You truly cultivated the grapes of grace in your soul, wise father, and you gushed forth like wine the word of faith which makes glad the mind of all the faithful; and you were seen as a boundless sea of miracles. Therefore you were shown to be the beauty of martyrs, having been perfected by fire and having been made worthy of the eternal light, O Polycarp. Ever intercede with Christ God that remission of transgressions be granted to those who fervently celebrate your holy memory.
ltx/en_us_andronache/me.m02.d23:meMA.Ode3KathismaT.incipit	Cloud of the noetic Sun…
ltx/en_us_andronache/me.m02.d23:meMA.Ode3KathismaT.melody	@ltx/en_us_andronache/he.a.m8:heAU.TinSofianKaiLogon.notmetered
ltx/en_us_andronache/me.m02.d23:meMA.Ode3KathismaT.mode	@ltx/en_us_andronache/miscellanea:misc.Mode8
ltx/en_us_andronache/me.m02.d23:meMA.Ode3KathismaT.text	Cloud of the noetic Sun, stand of divine lamps shining with gold, spotless, undefiled, most blameless Lady, I beseech you: illumine my darkened soul blinded by passions with the light of dispassion and wash my stained heart with rivers of tears of compunction that I may fervently cry out to you: ever intercede with your Son and God that remission of transgressions be granted to me, for I, your unworthy servant, have you as my hope.
ltx/en_us_andronache/me.m02.d23:meMA.Ode4C11.greekmelody	@ltx/en_us_andronache/he.h.m2:heHE.EisakikoaKyrieTinAkoin.greekname
ltx/en_us_andronache/me.m02.d23:meMA.Ode4C11.incipit	You were seen to have…
ltx/en_us_andronache/me.m02.d23:meMA.Ode4C11.melody	@ltx/en_us_andronache/he.h.m2:heHE.EisakikoaKyrieTinAkoin.notmetered
ltx/en_us_andronache/me.m02.d23:meMA.Ode4C11.mode	@ltx/en_us_andronache/miscellanea:misc.Mode2
ltx/en_us_andronache/me.m02.d23:meMA.Ode4C11.ode	@ltx/en_us_andronache/miscellanea:misc.Ode4
ltx/en_us_andronache/me.m02.d23:meMA.Ode4C11.text	You were seen to have brought the many-fruited, bountiful harvest of the virtues to the Master, Father Polycarp.
ltx/en_us_andronache/me.m02.d23:meMA.Ode4C12.incipit	You were brought as a…
ltx/en_us_andronache/me.m02.d23:meMA.Ode4C12.melody	@ltx/en_us_andronache/he.h.m2:heHE.EisakikoaKyrieTinAkoin.notmetered
ltx/en_us_andronache/me.m02.d23:meMA.Ode4C12.mode	@ltx/en_us_andronache/miscellanea:misc.Mode2
ltx/en_us_andronache/me.m02.d23:meMA.Ode4C12.ode	@ltx/en_us_andronache/miscellanea:misc.Ode4
ltx/en_us_andronache/me.m02.d23:meMA.Ode4C12.text	You were brought as a perfect burnt-offering and a pure sacrifice to the Savior of all, Father, Polycarp.
ltx/en_us_andronache/me.m02.d23:meMA.Ode4C13.incipit	Piously leading the people to…
ltx/en_us_andronache/me.m02.d23:meMA.Ode4C13.melody	@ltx/en_us_andronache/he.h.m2:heHE.EisakikoaKyrieTinAkoin.notmetered
ltx/en_us_andronache/me.m02.d23:meMA.Ode4C13.mode	@ltx/en_us_andronache/miscellanea:misc.Mode2
ltx/en_us_andronache/me.m02.d23:meMA.Ode4C13.ode	@ltx/en_us_andronache/miscellanea:misc.Ode4
ltx/en_us_andronache/me.m02.d23:meMA.Ode4C13.text	Piously leading the people to the light of the knowledge of God, Venerable one, you dispelled the darkness of godlessness.
ltx/en_us_andronache/me.m02.d23:meMA.Ode4C14.incipit	Glorious one, we hymn the…
ltx/en_us_andronache/me.m02.d23:meMA.Ode4C14.melody	@ltx/en_us_andronache/he.h.m2:heHE.EisakikoaKyrieTinAkoin.notmetered
ltx/en_us_andronache/me.m02.d23:meMA.Ode4C14.mode	@ltx/en_us_andronache/miscellanea:misc.Mode2
ltx/en_us_andronache/me.m02.d23:meMA.Ode4C14.ode	@ltx/en_us_andronache/miscellanea:misc.Ode4
ltx/en_us_andronache/me.m02.d23:meMA.Ode4C14.text	Glorious one, we hymn the steadfast perseverance of your soul and the invincibility of your struggles.
ltx/en_us_andronache/me.m02.d23:meMA.Ode4C1H.greekmelody	@ltx/en_us_andronache/he.h.m2:heHE.EisakikoaKyrieTinAkoin.greekname
ltx/en_us_andronache/me.m02.d23:meMA.Ode4C1H.incipit	@ltx/en_us_andronache/he.h.m2:heHE.EisakikoaKyrieTinAkoin.incipit
ltx/en_us_andronache/me.m02.d23:meMA.Ode4C1H.melody	@ltx/en_us_andronache/he.h.m2:heHE.EisakikoaKyrieTinAkoin.melody
ltx/en_us_andronache/me.m02.d23:meMA.Ode4C1H.mode	@ltx/en_us_andronache/miscellanea:misc.Mode2
ltx/en_us_andronache/me.m02.d23:meMA.Ode4C1H.ode	@ltx/en_us_andronache/miscellanea:misc.Ode4
ltx/en_us_andronache/me.m02.d23:meMA.Ode4C1H.text	@ltx/en_us_andronache/he.h.m2:heHE.EisakikoaKyrieTinAkoin.text
ltx/en_us_andronache/me.m02.d23:meMA.Ode4C1T.incipit	Pure one who gave birth…
ltx/en_us_andronache/me.m02.d23:meMA.Ode4C1T.melody	@ltx/en_us_andronache/he.h.m2:heHE.EisakikoaKyrieTinAkoin.notmetered
ltx/en_us_andronache/me.m02.d23:meMA.Ode4C1T.mode	@ltx/en_us_andronache/miscellanea:misc.Mode2
ltx/en_us_andronache/me.m02.d23:meMA.Ode4C1T.ode	@ltx/en_us_andronache/miscellanea:misc.Ode4
ltx/en_us_andronache/me.m02.d23:meMA.Ode4C1T.text	Pure one who gave birth to the hypostatic light, wholly illumine my darkened soul by your light.
ltx/en_us_andronache/me.m02.d23:meMA.Ode5C11.greekmelody	@ltx/en_us_andronache/he.h.m2:heHE.OTouFotosChorigos.greekname
ltx/en_us_andronache/me.m02.d23:meMA.Ode5C11.incipit	Wholly illumined in mind by…
ltx/en_us_andronache/me.m02.d23:meMA.Ode5C11.melody	@ltx/en_us_andronache/he.h.m2:heHE.OTouFotosChorigos.notmetered
ltx/en_us_andronache/me.m02.d23:meMA.Ode5C11.mode	@ltx/en_us_andronache/miscellanea:misc.Mode2
ltx/en_us_andronache/me.m02.d23:meMA.Ode5C11.ode	@ltx/en_us_andronache/miscellanea:misc.Ode5
ltx/en_us_andronache/me.m02.d23:meMA.Ode5C11.text	Wholly illumined in mind by the ray of the Spirit, Venerable one, and through the symbol of a flaming fire you clearly were instructed about your perfection through fire, godly-minded one.
ltx/en_us_andronache/me.m02.d23:meMA.Ode5C12.incipit	You received a river of…
ltx/en_us_andronache/me.m02.d23:meMA.Ode5C12.melody	@ltx/en_us_andronache/he.h.m2:heHE.OTouFotosChorigos.notmetered
ltx/en_us_andronache/me.m02.d23:meMA.Ode5C12.mode	@ltx/en_us_andronache/miscellanea:misc.Mode2
ltx/en_us_andronache/me.m02.d23:meMA.Ode5C12.ode	@ltx/en_us_andronache/miscellanea:misc.Ode5
ltx/en_us_andronache/me.m02.d23:meMA.Ode5C12.text	You received a river of life, having been taught as from a flood of delicacies by the beloved disciple, who had drawn water from the depth of wisdom.
ltx/en_us_andronache/me.m02.d23:meMA.Ode5C13.incipit	Riches and glory, brightness and…
ltx/en_us_andronache/me.m02.d23:meMA.Ode5C13.melody	@ltx/en_us_andronache/he.h.m2:heHE.OTouFotosChorigos.notmetered
ltx/en_us_andronache/me.m02.d23:meMA.Ode5C13.mode	@ltx/en_us_andronache/miscellanea:misc.Mode2
ltx/en_us_andronache/me.m02.d23:meMA.Ode5C13.ode	@ltx/en_us_andronache/miscellanea:misc.Ode5
ltx/en_us_andronache/me.m02.d23:meMA.Ode5C13.text	Riches and glory, brightness and length of life and an incorrupt life, were given to you, Father, from Christ the true wisdom, because you were preeminent in your love for Him.
ltx/en_us_andronache/me.m02.d23:meMA.Ode5C1H.greekmelody	@ltx/en_us_andronache/he.h.m2:heHE.OTouFotosChorigos.greekname
ltx/en_us_andronache/me.m02.d23:meMA.Ode5C1H.incipit	@ltx/en_us_andronache/he.h.m2:heHE.OTouFotosChorigos.incipit
ltx/en_us_andronache/me.m02.d23:meMA.Ode5C1H.melody	@ltx/en_us_andronache/he.h.m2:heHE.OTouFotosChorigos.melody
ltx/en_us_andronache/me.m02.d23:meMA.Ode5C1H.mode	@ltx/en_us_andronache/miscellanea:misc.Mode2
ltx/en_us_andronache/me.m02.d23:meMA.Ode5C1H.ode	@ltx/en_us_andronache/miscellanea:misc.Ode5
ltx/en_us_andronache/me.m02.d23:meMA.Ode5C1H.text	@ltx/en_us_andronache/he.h.m2:heHE.OTouFotosChorigos.text
ltx/en_us_andronache/me.m02.d23:meMA.Ode5C1T.incipit	The ancient of days, as…
ltx/en_us_andronache/me.m02.d23:meMA.Ode5C1T.melody	@ltx/en_us_andronache/he.h.m2:heHE.OTouFotosChorigos.notmetered
ltx/en_us_andronache/me.m02.d23:meMA.Ode5C1T.mode	@ltx/en_us_andronache/miscellanea:misc.Mode2
ltx/en_us_andronache/me.m02.d23:meMA.Ode5C1T.ode	@ltx/en_us_andronache/miscellanea:misc.Ode5
ltx/en_us_andronache/me.m02.d23:meMA.Ode5C1T.text	The ancient of days, as rain on fleece, all pure one, came down upon your sanctified womb and He, the lover of humanity, was seen as a new Adam.
ltx/en_us_andronache/me.m02.d23:meMA.Ode6C11.greekmelody	@ltx/en_us_andronache/he.h.m2:heHE.EnAvyssoPtaismaton.greekname
ltx/en_us_andronache/me.m02.d23:meMA.Ode6C11.incipit	God-seer, you were dead to…
ltx/en_us_andronache/me.m02.d23:meMA.Ode6C11.melody	@ltx/en_us_andronache/he.h.m2:heHE.EnAvyssoPtaismaton.notmetered
ltx/en_us_andronache/me.m02.d23:meMA.Ode6C11.mode	@ltx/en_us_andronache/miscellanea:misc.Mode2
ltx/en_us_andronache/me.m02.d23:meMA.Ode6C11.ode	@ltx/en_us_andronache/miscellanea:misc.Ode6
ltx/en_us_andronache/me.m02.d23:meMA.Ode6C11.text	God-seer, you were dead to the entire world, living only to Christ and conversing with Him, you were translated to Christ, bearing the fruit of living incorruption.
ltx/en_us_andronache/me.m02.d23:meMA.Ode6C12.incipit	Walking honorably, blessed one, and…
ltx/en_us_andronache/me.m02.d23:meMA.Ode6C12.melody	@ltx/en_us_andronache/he.h.m2:heHE.EnAvyssoPtaismaton.notmetered
ltx/en_us_andronache/me.m02.d23:meMA.Ode6C12.mode	@ltx/en_us_andronache/miscellanea:misc.Mode2
ltx/en_us_andronache/me.m02.d23:meMA.Ode6C12.ode	@ltx/en_us_andronache/miscellanea:misc.Ode6
ltx/en_us_andronache/me.m02.d23:meMA.Ode6C12.text	Walking honorably, blessed one, and being shown to be a child of light and peace, you recognized Marcion as an adversary and the first-born of darkness.
ltx/en_us_andronache/me.m02.d23:meMA.Ode6C13.incipit	Having been admonished by your…
ltx/en_us_andronache/me.m02.d23:meMA.Ode6C13.melody	@ltx/en_us_andronache/he.h.m2:heHE.EnAvyssoPtaismaton.notmetered
ltx/en_us_andronache/me.m02.d23:meMA.Ode6C13.mode	@ltx/en_us_andronache/miscellanea:misc.Mode2
ltx/en_us_andronache/me.m02.d23:meMA.Ode6C13.ode	@ltx/en_us_andronache/miscellanea:misc.Ode6
ltx/en_us_andronache/me.m02.d23:meMA.Ode6C13.text	Having been admonished by your words, Father, we turn away from every profane heresy and evil council of those who impiously advocate two principles in God.
ltx/en_us_andronache/me.m02.d23:meMA.Ode6C1H.greekmelody	@ltx/en_us_andronache/he.h.m2:heHE.EnAvyssoPtaismaton.greekname
ltx/en_us_andronache/me.m02.d23:meMA.Ode6C1H.incipit	@ltx/en_us_andronache/he.h.m2:heHE.EnAvyssoPtaismaton.incipit
ltx/en_us_andronache/me.m02.d23:meMA.Ode6C1H.melody	@ltx/en_us_andronache/he.h.m2:heHE.EnAvyssoPtaismaton.melody
ltx/en_us_andronache/me.m02.d23:meMA.Ode6C1H.mode	@ltx/en_us_andronache/miscellanea:misc.Mode2
ltx/en_us_andronache/me.m02.d23:meMA.Ode6C1H.ode	@ltx/en_us_andronache/miscellanea:misc.Ode6
ltx/en_us_andronache/me.m02.d23:meMA.Ode6C1H.text	@ltx/en_us_andronache/he.h.m2:heHE.EnAvyssoPtaismaton.text
ltx/en_us_andronache/me.m02.d23:meMA.Ode6C1T.incipit	All-blameless one, having conceived as…
ltx/en_us_andronache/me.m02.d23:meMA.Ode6C1T.melody	@ltx/en_us_andronache/he.h.m2:heHE.EnAvyssoPtaismaton.notmetered
ltx/en_us_andronache/me.m02.d23:meMA.Ode6C1T.mode	@ltx/en_us_andronache/miscellanea:misc.Mode2
ltx/en_us_andronache/me.m02.d23:meMA.Ode6C1T.ode	@ltx/en_us_andronache/miscellanea:misc.Ode6
ltx/en_us_andronache/me.m02.d23:meMA.Ode6C1T.text	All-blameless one, having conceived as a pure lamb the one who takes away the sin of the world, entreat that forgiveness of sins be granted to your servants.
ltx/en_us_andronache/me.m02.d23:meMA.Ode7C11.greekmelody	@ltx/en_us_andronache/he.h.m2:heHE.EikonosChrysis.greekname
ltx/en_us_andronache/me.m02.d23:meMA.Ode7C11.incipit	With firm thought you went…
ltx/en_us_andronache/me.m02.d23:meMA.Ode7C11.melody	@ltx/en_us_andronache/he.h.m2:heHE.EikonosChrysis.notmetered
ltx/en_us_andronache/me.m02.d23:meMA.Ode7C11.mode	@ltx/en_us_andronache/miscellanea:misc.Mode2
ltx/en_us_andronache/me.m02.d23:meMA.Ode7C11.ode	@ltx/en_us_andronache/miscellanea:misc.Ode7
ltx/en_us_andronache/me.m02.d23:meMA.Ode7C11.text	With firm thought you went upon the kindling of the flame, glorious one, like the three youths who sprinkled dew with immaterial fire in the furnace, crying out in the middle of the fire and remaining unburnt: Blessed are you, the God of our Fathers.
ltx/en_us_andronache/me.m02.d23:meMA.Ode7C12.incipit	You are blessed and it…
ltx/en_us_andronache/me.m02.d23:meMA.Ode7C12.melody	@ltx/en_us_andronache/he.h.m2:heHE.EikonosChrysis.notmetered
ltx/en_us_andronache/me.m02.d23:meMA.Ode7C12.mode	@ltx/en_us_andronache/miscellanea:misc.Mode2
ltx/en_us_andronache/me.m02.d23:meMA.Ode7C12.ode	@ltx/en_us_andronache/miscellanea:misc.Ode7
ltx/en_us_andronache/me.m02.d23:meMA.Ode7C12.text	You are blessed and it is well with you now as you dwell in the dwellings of the righteous, where are the ranks of the martyrs and where the choirs of the wise apostles cry out: Blessed are you, the God of our Fathers.
ltx/en_us_andronache/me.m02.d23:meMA.Ode7C13.incipit	By the tilling of the…
ltx/en_us_andronache/me.m02.d23:meMA.Ode7C13.melody	@ltx/en_us_andronache/he.h.m2:heHE.EikonosChrysis.notmetered
ltx/en_us_andronache/me.m02.d23:meMA.Ode7C13.mode	@ltx/en_us_andronache/miscellanea:misc.Mode2
ltx/en_us_andronache/me.m02.d23:meMA.Ode7C13.ode	@ltx/en_us_andronache/miscellanea:misc.Ode7
ltx/en_us_andronache/me.m02.d23:meMA.Ode7C13.text	By the tilling of the Spirit you led to Christ as richly fruitful souls that had been fruitless; you made them smooth having put in them a fruitful seed, and you taught them to cry out: Blessed are you, the God of our Fathers.
ltx/en_us_andronache/me.m02.d23:meMA.Ode7C1H.greekmelody	@ltx/en_us_andronache/he.h.m2:heHE.EikonosChrysis.greekname
ltx/en_us_andronache/me.m02.d23:meMA.Ode7C1H.incipit	@ltx/en_us_andronache/he.h.m2:heHE.EikonosChrysis.incipit
ltx/en_us_andronache/me.m02.d23:meMA.Ode7C1H.melody	@ltx/en_us_andronache/he.h.m2:heHE.EikonosChrysis.melody
ltx/en_us_andronache/me.m02.d23:meMA.Ode7C1H.mode	@ltx/en_us_andronache/miscellanea:misc.Mode2
ltx/en_us_andronache/me.m02.d23:meMA.Ode7C1H.ode	@ltx/en_us_andronache/miscellanea:misc.Ode7
ltx/en_us_andronache/me.m02.d23:meMA.Ode7C1H.text	@ltx/en_us_andronache/he.h.m2:heHE.EikonosChrysis.text
ltx/en_us_andronache/me.m02.d23:meMA.Ode7C1T.incipit	You alone were shown to…
ltx/en_us_andronache/me.m02.d23:meMA.Ode7C1T.melody	@ltx/en_us_andronache/he.h.m2:heHE.EikonosChrysis.notmetered
ltx/en_us_andronache/me.m02.d23:meMA.Ode7C1T.mode	@ltx/en_us_andronache/miscellanea:misc.Mode2
ltx/en_us_andronache/me.m02.d23:meMA.Ode7C1T.ode	@ltx/en_us_andronache/miscellanea:misc.Ode7
ltx/en_us_andronache/me.m02.d23:meMA.Ode7C1T.text	You alone were shown to be the unwedded mother of the God who created everything in wisdom, Virgin mother all pure. Therefore we piously cry out to you, Virgin, saying: Blessed are you who bore God in the flesh.
ltx/en_us_andronache/me.m02.d23:meMA.Ode8C11.greekmelody	@ltx/en_us_andronache/he.h.m2:heHE.TonEnKaminoTouPyros.greekname
ltx/en_us_andronache/me.m02.d23:meMA.Ode8C11.incipit	Having served piously as a…
ltx/en_us_andronache/me.m02.d23:meMA.Ode8C11.melody	@ltx/en_us_andronache/he.h.m2:heHE.TonEnKaminoTouPyros.notmetered
ltx/en_us_andronache/me.m02.d23:meMA.Ode8C11.mode	@ltx/en_us_andronache/miscellanea:misc.Mode2
ltx/en_us_andronache/me.m02.d23:meMA.Ode8C11.ode	@ltx/en_us_andronache/miscellanea:misc.Ode8
ltx/en_us_andronache/me.m02.d23:meMA.Ode8C11.text	Having served piously as a priest the mystical sacrifice of Christ, a rational sacrifice, you brought yourself to God as an acceptable and pleasing sacrifice full of fruit, thrice-blessed Polycarp.
ltx/en_us_andronache/me.m02.d23:meMA.Ode8C12.incipit	In the deepest old age…
ltx/en_us_andronache/me.m02.d23:meMA.Ode8C12.melody	@ltx/en_us_andronache/he.h.m2:heHE.TonEnKaminoTouPyros.notmetered
ltx/en_us_andronache/me.m02.d23:meMA.Ode8C12.mode	@ltx/en_us_andronache/miscellanea:misc.Mode2
ltx/en_us_andronache/me.m02.d23:meMA.Ode8C12.ode	@ltx/en_us_andronache/miscellanea:misc.Ode8
ltx/en_us_andronache/me.m02.d23:meMA.Ode8C12.text	In the deepest old age you showed youthful manliness; by the power of the Cross you set your mind towards divine struggles, godly-minded glory of the martyrs of Christ.
ltx/en_us_andronache/me.m02.d23:meMA.Ode8C13.incipit	Having leaned on the Cross…
ltx/en_us_andronache/me.m02.d23:meMA.Ode8C13.melody	@ltx/en_us_andronache/he.h.m2:heHE.TonEnKaminoTouPyros.notmetered
ltx/en_us_andronache/me.m02.d23:meMA.Ode8C13.mode	@ltx/en_us_andronache/miscellanea:misc.Mode2
ltx/en_us_andronache/me.m02.d23:meMA.Ode8C13.ode	@ltx/en_us_andronache/miscellanea:misc.Ode8
ltx/en_us_andronache/me.m02.d23:meMA.Ode8C13.text	Having leaned on the Cross and being worthily vested with hierarchical beauty, Father, you went into the temple of God by your own blood, to appear before Christ the arch-shepherd.
ltx/en_us_andronache/me.m02.d23:meMA.Ode8C14.incipit	You were slaughtered for Christ…
ltx/en_us_andronache/me.m02.d23:meMA.Ode8C14.melody	@ltx/en_us_andronache/he.h.m2:heHE.TonEnKaminoTouPyros.notmetered
ltx/en_us_andronache/me.m02.d23:meMA.Ode8C14.mode	@ltx/en_us_andronache/miscellanea:misc.Mode2
ltx/en_us_andronache/me.m02.d23:meMA.Ode8C14.ode	@ltx/en_us_andronache/miscellanea:misc.Ode8
ltx/en_us_andronache/me.m02.d23:meMA.Ode8C14.text	You were slaughtered for Christ as a marked lamb, O revealer of sacred things; you were shown an imitator of His passion and you became a partaker of glory and a co-inheritor of His kingdom.
ltx/en_us_andronache/me.m02.d23:meMA.Ode8C1H.greekmelody	@ltx/en_us_andronache/he.h.m2:heHE.TonEnKaminoTouPyros.greekname
ltx/en_us_andronache/me.m02.d23:meMA.Ode8C1H.incipit	@ltx/en_us_andronache/he.h.m2:heHE.TonEnKaminoTouPyros.incipit
ltx/en_us_andronache/me.m02.d23:meMA.Ode8C1H.melody	@ltx/en_us_andronache/he.h.m2:heHE.TonEnKaminoTouPyros.melody
ltx/en_us_andronache/me.m02.d23:meMA.Ode8C1H.mode	@ltx/en_us_andronache/miscellanea:misc.Mode2
ltx/en_us_andronache/me.m02.d23:meMA.Ode8C1H.ode	@ltx/en_us_andronache/miscellanea:misc.Ode8
ltx/en_us_andronache/me.m02.d23:meMA.Ode8C1H.text	@ltx/en_us_andronache/he.h.m2:heHE.TonEnKaminoTouPyros.text
ltx/en_us_andronache/me.m02.d23:meMA.Ode8C1T.incipit	A light-emitting pillar of flame…
ltx/en_us_andronache/me.m02.d23:meMA.Ode8C1T.melody	@ltx/en_us_andronache/he.h.m2:heHE.TonEnKaminoTouPyros.notmetered
ltx/en_us_andronache/me.m02.d23:meMA.Ode8C1T.mode	@ltx/en_us_andronache/miscellanea:misc.Mode2
ltx/en_us_andronache/me.m02.d23:meMA.Ode8C1T.ode	@ltx/en_us_andronache/miscellanea:misc.Ode8
ltx/en_us_andronache/me.m02.d23:meMA.Ode8C1T.text	A light-emitting pillar of flame and a luminous cloud leading to the land of heaven, pure God-bearer, become for me, all-blameless virgin, who am wondering in the desert of life.
ltx/en_us_andronache/me.m02.d23:meMA.Ode9C11.greekmelody	@ltx/en_us_andronache/he.h.m2:heHE.TonEkTheouTheonLogon.greekname
ltx/en_us_andronache/me.m02.d23:meMA.Ode9C11.incipit	Your light-bearing memory has risen…
ltx/en_us_andronache/me.m02.d23:meMA.Ode9C11.melody	@ltx/en_us_andronache/he.h.m2:heHE.TonEkTheouTheonLogon.notmetered
ltx/en_us_andronache/me.m02.d23:meMA.Ode9C11.mode	@ltx/en_us_andronache/miscellanea:misc.Mode2
ltx/en_us_andronache/me.m02.d23:meMA.Ode9C11.ode	@ltx/en_us_andronache/miscellanea:misc.Ode9
ltx/en_us_andronache/me.m02.d23:meMA.Ode9C11.text	Your light-bearing memory has risen, Father, and it illumines the souls of those who piously keep it, divinely-sweet one, and it makes all partakers of the divine illumination. We worthily magnify it in hymns, godly-minded one.
ltx/en_us_andronache/me.m02.d23:meMA.Ode9C12.incipit	With the choirs of the…
ltx/en_us_andronache/me.m02.d23:meMA.Ode9C12.melody	@ltx/en_us_andronache/he.h.m2:heHE.TonEkTheouTheonLogon.notmetered
ltx/en_us_andronache/me.m02.d23:meMA.Ode9C12.mode	@ltx/en_us_andronache/miscellanea:misc.Mode2
ltx/en_us_andronache/me.m02.d23:meMA.Ode9C12.ode	@ltx/en_us_andronache/miscellanea:misc.Ode9
ltx/en_us_andronache/me.m02.d23:meMA.Ode9C12.text	With the choirs of the holy angels above, standing by the throne of the Master, entreat Him that we reach the saving passion and His resurrection with brightness, having completed many kinds of virtuous deeds.
ltx/en_us_andronache/me.m02.d23:meMA.Ode9C13.incipit	Your perception of the holy…
ltx/en_us_andronache/me.m02.d23:meMA.Ode9C13.melody	@ltx/en_us_andronache/he.h.m2:heHE.TonEkTheouTheonLogon.notmetered
ltx/en_us_andronache/me.m02.d23:meMA.Ode9C13.mode	@ltx/en_us_andronache/miscellanea:misc.Mode2
ltx/en_us_andronache/me.m02.d23:meMA.Ode9C13.ode	@ltx/en_us_andronache/miscellanea:misc.Ode9
ltx/en_us_andronache/me.m02.d23:meMA.Ode9C13.text	Your perception of the holy Trinity, Father, is seen clearly not in riddles as before, by your pure heart, which had kept away from the material and been loosed from the bonds of corruption, blessed and truly happy Polycarp.
ltx/en_us_andronache/me.m02.d23:meMA.Ode9C14.incipit	Believing that you are wearing…
ltx/en_us_andronache/me.m02.d23:meMA.Ode9C14.melody	@ltx/en_us_andronache/he.h.m2:heHE.TonEkTheouTheonLogon.notmetered
ltx/en_us_andronache/me.m02.d23:meMA.Ode9C14.mode	@ltx/en_us_andronache/miscellanea:misc.Mode2
ltx/en_us_andronache/me.m02.d23:meMA.Ode9C14.ode	@ltx/en_us_andronache/miscellanea:misc.Ode9
ltx/en_us_andronache/me.m02.d23:meMA.Ode9C14.text	Believing that you are wearing a crown and the trophy of victory, Father, which you received from the divine right hand have completed your contests, and are filled with light, we have acquired you as an eager intercessor with Christ, wise Polycarp.
ltx/en_us_andronache/me.m02.d23:meMA.Ode9C1H.greekmelody	@ltx/en_us_andronache/he.h.m2:heHE.TonEkTheouTheonLogon.greekname
ltx/en_us_andronache/me.m02.d23:meMA.Ode9C1H.incipit	@ltx/en_us_andronache/he.h.m2:heHE.TonEkTheouTheonLogon.incipit
ltx/en_us_andronache/me.m02.d23:meMA.Ode9C1H.melody	@ltx/en_us_andronache/he.h.m2:heHE.TonEkTheouTheonLogon.melody
ltx/en_us_andronache/me.m02.d23:meMA.Ode9C1H.mode	@ltx/en_us_andronache/miscellanea:misc.Mode2
ltx/en_us_andronache/me.m02.d23:meMA.Ode9C1H.ode	@ltx/en_us_andronache/miscellanea:misc.Ode9
ltx/en_us_andronache/me.m02.d23:meMA.Ode9C1H.text	@ltx/en_us_andronache/he.h.m2:heHE.TonEkTheouTheonLogon.text
ltx/en_us_andronache/me.m02.d23:meMA.Ode9C1T.incipit	Having you, Maiden, as Theotokos…
ltx/en_us_andronache/me.m02.d23:meMA.Ode9C1T.melody	@ltx/en_us_andronache/he.h.m2:heHE.TonEkTheouTheonLogon.notmetered
ltx/en_us_andronache/me.m02.d23:meMA.Ode9C1T.mode	@ltx/en_us_andronache/miscellanea:misc.Mode2
ltx/en_us_andronache/me.m02.d23:meMA.Ode9C1T.ode	@ltx/en_us_andronache/miscellanea:misc.Ode9
ltx/en_us_andronache/me.m02.d23:meMA.Ode9C1T.text	Having you, Maiden, as Theotokos and Mother of the Logos and an ambassador of the eternal and divine life, as you illumined us with the sun of righteousness, we, the faithful with one mind magnify you in hymns.
ltx/en_us_andronache/me.m02.d23:meMA.Oikos1.text	Having been drawn to the goodness of wisdom, you filled your flock with knowledge of God from it and you illumined as with lightning the triple sun of the all holy and unutterable divinity, having clearly taught the un-begottenness of the Father, the begottenness of the Son and the procession of the Spirit, one divinity and one glory. You trampled the godlessness of idols, offering the souls of the faithful as ripe fruits to God in whom we have been baptized and in whom we believe, as we glorify the Lord.
ltx/en_us_andronache/me.m02.d23:meR001	
