ltx/en_us_andronache/me.m12.d10:meMA.C1.acrostic.notice1	
ltx/en_us_andronache/me.m12.d10:meMA.C1.acrostic.text	
ltx/en_us_andronache/me.m12.d10:meMA.C1.acrostic.title	Canon for the Saints.
ltx/en_us_andronache/me.m12.d10:meMA.Kontakion1.greekmelody	@ltx/en_us_andronache/he.a.m4:heAU.EpefanisSimeron.greekname
ltx/en_us_andronache/me.m12.d10:meMA.Kontakion1.incipit	The Lord who grants you…
ltx/en_us_andronache/me.m12.d10:meMA.Kontakion1.melody	@ltx/en_us_andronache/he.a.m4:heAU.EpefanisSimeron.notmetered
ltx/en_us_andronache/me.m12.d10:meMA.Kontakion1.mode	@ltx/en_us_andronache/miscellanea:misc.Mode4
ltx/en_us_andronache/me.m12.d10:meMA.Kontakion1.text	The Lord who grants you the crown of incorruption carried you off from this temporary expedition and showed you a co-inheritor of incorruptible things, O Menas, with your co-contestants.
ltx/en_us_andronache/me.m12.d10:meMA.Ode1C11.greekmelody	@ltx/en_us_andronache/he.h.m1:heHE.ChristosGennatai.greekname
ltx/en_us_andronache/me.m12.d10:meMA.Ode1C11.incipit	Adorned with crowns of glory…
ltx/en_us_andronache/me.m12.d10:meMA.Ode1C11.melody	@ltx/en_us_andronache/he.h.m1:heHE.ChristosGennatai.notmetered
ltx/en_us_andronache/me.m12.d10:meMA.Ode1C11.mode	@ltx/en_us_andronache/miscellanea:misc.Mode1
ltx/en_us_andronache/me.m12.d10:meMA.Ode1C11.ode	@ltx/en_us_andronache/miscellanea:misc.Ode1
ltx/en_us_andronache/me.m12.d10:meMA.Ode1C11.text	Adorned with crowns of glory and standing by the throne of God and filled by the light of God, loose the darkness of the passions for us who fervently celebrate your light-bearing memory, O Martyrs.
ltx/en_us_andronache/me.m12.d10:meMA.Ode1C12.incipit	Loving the divine glory, and…
ltx/en_us_andronache/me.m12.d10:meMA.Ode1C12.melody	@ltx/en_us_andronache/he.h.m1:heHE.ChristosGennatai.notmetered
ltx/en_us_andronache/me.m12.d10:meMA.Ode1C12.mode	@ltx/en_us_andronache/miscellanea:misc.Mode1
ltx/en_us_andronache/me.m12.d10:meMA.Ode1C12.ode	@ltx/en_us_andronache/miscellanea:misc.Ode1
ltx/en_us_andronache/me.m12.d10:meMA.Ode1C12.text	Loving the divine glory, and longing for the beauty of God, you rejected the pleasures of life and all conspicuous power and, through death, you found life without end, O Martyrs.
ltx/en_us_andronache/me.m12.d10:meMA.Ode1C13.incipit	Being aflame with divine zeal…
ltx/en_us_andronache/me.m12.d10:meMA.Ode1C13.melody	@ltx/en_us_andronache/he.h.m1:heHE.ChristosGennatai.notmetered
ltx/en_us_andronache/me.m12.d10:meMA.Ode1C13.mode	@ltx/en_us_andronache/miscellanea:misc.Mode1
ltx/en_us_andronache/me.m12.d10:meMA.Ode1C13.ode	@ltx/en_us_andronache/miscellanea:misc.Ode1
ltx/en_us_andronache/me.m12.d10:meMA.Ode1C13.text	Being aflame with divine zeal, you put out the fire of godlessness and you were clearly seen as lamps bringing the light of piety to all in faith, high-minded Hermogenes and Menas.
ltx/en_us_andronache/me.m12.d10:meMA.Ode1C1T.incipit	All pure and blameless maiden…
ltx/en_us_andronache/me.m12.d10:meMA.Ode1C1T.melody	@ltx/en_us_andronache/he.h.m1:heHE.ChristosGennatai.notmetered
ltx/en_us_andronache/me.m12.d10:meMA.Ode1C1T.mode	@ltx/en_us_andronache/miscellanea:misc.Mode1
ltx/en_us_andronache/me.m12.d10:meMA.Ode1C1T.ode	@ltx/en_us_andronache/miscellanea:misc.Ode1
ltx/en_us_andronache/me.m12.d10:meMA.Ode1C1T.text	All pure and blameless maiden, Intercede fervently with your Lord and Master who took a body from your blood and lived with us, that your servants be freed from the rule of the passions.
ltx/en_us_andronache/me.m12.d10:meMA.Ode3C11.greekmelody	@ltx/en_us_andronache/he.h.m1:heHE.ToProTonAionon.greekname
ltx/en_us_andronache/me.m12.d10:meMA.Ode3C11.incipit	The holy martyrs being illumined…
ltx/en_us_andronache/me.m12.d10:meMA.Ode3C11.melody	@ltx/en_us_andronache/he.h.m1:heHE.ToProTonAionon.notmetered
ltx/en_us_andronache/me.m12.d10:meMA.Ode3C11.mode	@ltx/en_us_andronache/miscellanea:misc.Mode1
ltx/en_us_andronache/me.m12.d10:meMA.Ode3C11.ode	@ltx/en_us_andronache/miscellanea:misc.Ode3
ltx/en_us_andronache/me.m12.d10:meMA.Ode3C11.text	The holy martyrs being illumined by a heavenly ray, scattered the darkness of the deceit of the idols and shone the light of healings upon us who sing to the God of all: Holy are You, O Lord.
ltx/en_us_andronache/me.m12.d10:meMA.Ode3C12.incipit	Following the death of the…
ltx/en_us_andronache/me.m12.d10:meMA.Ode3C12.melody	@ltx/en_us_andronache/he.h.m1:heHE.ToProTonAionon.notmetered
ltx/en_us_andronache/me.m12.d10:meMA.Ode3C12.mode	@ltx/en_us_andronache/miscellanea:misc.Mode1
ltx/en_us_andronache/me.m12.d10:meMA.Ode3C12.ode	@ltx/en_us_andronache/miscellanea:misc.Ode3
ltx/en_us_andronache/me.m12.d10:meMA.Ode3C12.text	Following the death of the living Master, wondrous Menas, you suffered the flaying of the soles of your feet and you shattered the head of the tyrant enemy, planting your feed for support on the most sure way of martyrdom, O Martyr.
ltx/en_us_andronache/me.m12.d10:meMA.Ode3C13.incipit	Having had his hands cut…
ltx/en_us_andronache/me.m12.d10:meMA.Ode3C13.melody	@ltx/en_us_andronache/he.h.m1:heHE.ToProTonAionon.notmetered
ltx/en_us_andronache/me.m12.d10:meMA.Ode3C13.mode	@ltx/en_us_andronache/miscellanea:misc.Mode1
ltx/en_us_andronache/me.m12.d10:meMA.Ode3C13.ode	@ltx/en_us_andronache/miscellanea:misc.Ode3
ltx/en_us_andronache/me.m12.d10:meMA.Ode3C13.text	Having had his hands cut off, Hermogenes hymns the Savior, clearly making the robe of the priesthood brighter by dipping it in blood, and being shown as an imitator by grace of the one who suffered in the flesh.
ltx/en_us_andronache/me.m12.d10:meMA.Ode3C1T.incipit	Having found you alone among…
ltx/en_us_andronache/me.m12.d10:meMA.Ode3C1T.melody	@ltx/en_us_andronache/he.h.m1:heHE.ToProTonAionon.notmetered
ltx/en_us_andronache/me.m12.d10:meMA.Ode3C1T.mode	@ltx/en_us_andronache/miscellanea:misc.Mode1
ltx/en_us_andronache/me.m12.d10:meMA.Ode3C1T.ode	@ltx/en_us_andronache/miscellanea:misc.Ode3
ltx/en_us_andronache/me.m12.d10:meMA.Ode3C1T.text	Having found you alone among women, beautiful in comeliness, Christ came forth, maiden, bearing a body from your womb, wholly illuminating with divine beauties our race. Therefore we honor you.
ltx/en_us_andronache/me.m12.d10:meMA.Ode3H.greekmelody	@ltx/en_us_andronache/he.h.m1:heHE.ToProTonAionon.greekname
ltx/en_us_andronache/me.m12.d10:meMA.Ode3H.incipit	@ltx/en_us_andronache/he.h.m1:heHE.ToProTonAionon.incipit
ltx/en_us_andronache/me.m12.d10:meMA.Ode3H.melody	@ltx/en_us_andronache/he.h.m1:heHE.ToProTonAionon.melody
ltx/en_us_andronache/me.m12.d10:meMA.Ode3H.mode	@ltx/en_us_andronache/miscellanea:misc.Mode1
ltx/en_us_andronache/me.m12.d10:meMA.Ode3H.ode	@ltx/en_us_andronache/miscellanea:misc.Ode3
ltx/en_us_andronache/me.m12.d10:meMA.Ode3H.text	@ltx/en_us_andronache/he.h.m1:heHE.ToProTonAionon.text
ltx/en_us_andronache/me.m12.d10:meMA.Ode3Kathisma1.greekmelody	@ltx/en_us_andronache/he.a.m8:heAU.TinSofianKaiLogon.greekname
ltx/en_us_andronache/me.m12.d10:meMA.Ode3Kathisma1.incipit	Having rejected worldly glory, Menas…
ltx/en_us_andronache/me.m12.d10:meMA.Ode3Kathisma1.melody	@ltx/en_us_andronache/he.a.m8:heAU.TinSofianKaiLogon.notmetered
ltx/en_us_andronache/me.m12.d10:meMA.Ode3Kathisma1.mode	@ltx/en_us_andronache/miscellanea:misc.Mode8
ltx/en_us_andronache/me.m12.d10:meMA.Ode3Kathisma1.text	Having rejected worldly glory, Menas, Hermogenes, and the glorious Evgrafos were flown on the wings of divine glory and withstood the weight of the terrible torments by their willing choice, not sparing the flesh. Therefore, after their end, having been thrown in the depths of the sea, they were guided straight towards the heavenly shore. Let us cry out to them in faith: Intercede with Christ God that remission of offenses be granted to those who celebrate your holy memory with faith.
ltx/en_us_andronache/me.m12.d10:meMA.Ode3Kathisma2.greekmelody	@ltx/en_us_andronache/he.a.m1:heAU.TonTafonSouSotir.greekname
ltx/en_us_andronache/me.m12.d10:meMA.Ode3Kathisma2.incipit	The wondrous Menas and the…
ltx/en_us_andronache/me.m12.d10:meMA.Ode3Kathisma2.melody	@ltx/en_us_andronache/he.a.m1:heAU.TonTafonSouSotir.notmetered
ltx/en_us_andronache/me.m12.d10:meMA.Ode3Kathisma2.mode	@ltx/en_us_andronache/miscellanea:misc.Mode1
ltx/en_us_andronache/me.m12.d10:meMA.Ode3Kathisma2.text	The wondrous Menas and the renowned Hermogenes, the all-sacred pair of the holy Trinity, trampled down the insolence of poly-theism and, having completed their most holy journey by the power of the Spirit, they received crowns of victory from heaven.
ltx/en_us_andronache/me.m12.d10:meMA.Ode3KathismaT.incipit	You held in your womb…
ltx/en_us_andronache/me.m12.d10:meMA.Ode3KathismaT.melody	@ltx/en_us_andronache/he.a.m1:heAU.TonTafonSouSotir.notmetered
ltx/en_us_andronache/me.m12.d10:meMA.Ode3KathismaT.mode	@ltx/en_us_andronache/miscellanea:misc.Mode1
ltx/en_us_andronache/me.m12.d10:meMA.Ode3KathismaT.text	You held in your womb the Maker, God, and Creator of all, all blameless pure one and you gave birth without corruption through the divine Spirit. Glorifying Him, we hymn you, Virgin, as the palace of the King of glory and the ransom of the world.
ltx/en_us_andronache/me.m12.d10:meMA.Ode4C11.greekmelody	@ltx/en_us_andronache/he.h.m1:heHE.RavdosEkTisRizis.greekname
ltx/en_us_andronache/me.m12.d10:meMA.Ode4C11.incipit	Proclaiming the law with bright…
ltx/en_us_andronache/me.m12.d10:meMA.Ode4C11.melody	@ltx/en_us_andronache/he.h.m1:heHE.RavdosEkTisRizis.notmetered
ltx/en_us_andronache/me.m12.d10:meMA.Ode4C11.mode	@ltx/en_us_andronache/miscellanea:misc.Mode1
ltx/en_us_andronache/me.m12.d10:meMA.Ode4C11.ode	@ltx/en_us_andronache/miscellanea:misc.Ode4
ltx/en_us_andronache/me.m12.d10:meMA.Ode4C11.text	Proclaiming the law with bright rays, your bore having your eyes unlawfully pulled out, Menas, while steadily having the eyes of the heart towards the unapproachable light, and singing harmoniously: Glory to Your strength, O Lord.
ltx/en_us_andronache/me.m12.d10:meMA.Ode4C12.incipit	When your tongue was cut…
ltx/en_us_andronache/me.m12.d10:meMA.Ode4C12.melody	@ltx/en_us_andronache/he.h.m1:heHE.RavdosEkTisRizis.notmetered
ltx/en_us_andronache/me.m12.d10:meMA.Ode4C12.mode	@ltx/en_us_andronache/miscellanea:misc.Mode1
ltx/en_us_andronache/me.m12.d10:meMA.Ode4C12.ode	@ltx/en_us_andronache/miscellanea:misc.Ode4
ltx/en_us_andronache/me.m12.d10:meMA.Ode4C12.text	When your tongue was cut out, it was seen to have been made sharp by the fire of the Spirit, most wise one, for you speak of the miracles of God clearly changing the madness of the judge to the pious glorification of the creator.
ltx/en_us_andronache/me.m12.d10:meMA.Ode4C13.incipit	Being greatly patient in suffering…
ltx/en_us_andronache/me.m12.d10:meMA.Ode4C13.melody	@ltx/en_us_andronache/he.h.m1:heHE.RavdosEkTisRizis.notmetered
ltx/en_us_andronache/me.m12.d10:meMA.Ode4C13.mode	@ltx/en_us_andronache/miscellanea:misc.Mode1
ltx/en_us_andronache/me.m12.d10:meMA.Ode4C13.ode	@ltx/en_us_andronache/miscellanea:misc.Ode4
ltx/en_us_andronache/me.m12.d10:meMA.Ode4C13.text	Being greatly patient in suffering the cutting of the feet, Hermogenes, trampled the head of the serpent and set off on the way of martyrdom with unswerving disposition, he entered into the life of heavenly brightness.
ltx/en_us_andronache/me.m12.d10:meMA.Ode4C14.incipit	By keeping your soul unstricken…
ltx/en_us_andronache/me.m12.d10:meMA.Ode4C14.melody	@ltx/en_us_andronache/he.h.m1:heHE.RavdosEkTisRizis.notmetered
ltx/en_us_andronache/me.m12.d10:meMA.Ode4C14.mode	@ltx/en_us_andronache/miscellanea:misc.Mode1
ltx/en_us_andronache/me.m12.d10:meMA.Ode4C14.ode	@ltx/en_us_andronache/miscellanea:misc.Ode4
ltx/en_us_andronache/me.m12.d10:meMA.Ode4C14.text	By keeping your soul unstricken by disease, Christ appeared to you, healing your wounds, Menas, urging you on to suffer manfully, so that, through you, the one who desires mercy, might accomplish the salvation of all the saints.
ltx/en_us_andronache/me.m12.d10:meMA.Ode4C1T.incipit	You sprang forth as the…
ltx/en_us_andronache/me.m12.d10:meMA.Ode4C1T.melody	@ltx/en_us_andronache/he.h.m1:heHE.RavdosEkTisRizis.notmetered
ltx/en_us_andronache/me.m12.d10:meMA.Ode4C1T.mode	@ltx/en_us_andronache/miscellanea:misc.Mode1
ltx/en_us_andronache/me.m12.d10:meMA.Ode4C1T.ode	@ltx/en_us_andronache/miscellanea:misc.Ode4
ltx/en_us_andronache/me.m12.d10:meMA.Ode4C1T.text	You sprang forth as the rod from the root of Jesse, and bloomed the planter of all creation, withering the plants of fruitless knowledge, but piously planting the most true faith for us, spotless all-hymned Virgin.
ltx/en_us_andronache/me.m12.d10:meMA.Ode5C11.greekmelody	@ltx/en_us_andronache/he.h.m1:heHE.TheosOnEirinis.greekname
ltx/en_us_andronache/me.m12.d10:meMA.Ode5C11.incipit	The martyrs were crying out…
ltx/en_us_andronache/me.m12.d10:meMA.Ode5C11.melody	@ltx/en_us_andronache/he.h.m1:heHE.TheosOnEirinis.notmetered
ltx/en_us_andronache/me.m12.d10:meMA.Ode5C11.mode	@ltx/en_us_andronache/miscellanea:misc.Mode1
ltx/en_us_andronache/me.m12.d10:meMA.Ode5C11.ode	@ltx/en_us_andronache/miscellanea:misc.Ode5
ltx/en_us_andronache/me.m12.d10:meMA.Ode5C11.text	The martyrs were crying out together “Why are you vainly troubled,” to the unlawful judge. The only one who is invincible in power stands by us having given us power; for him we endure ill-treatments most firmly.
ltx/en_us_andronache/me.m12.d10:meMA.Ode5C12.incipit	The change of Hermogenes towards…
ltx/en_us_andronache/me.m12.d10:meMA.Ode5C12.melody	@ltx/en_us_andronache/he.h.m1:heHE.TheosOnEirinis.notmetered
ltx/en_us_andronache/me.m12.d10:meMA.Ode5C12.mode	@ltx/en_us_andronache/miscellanea:misc.Mode1
ltx/en_us_andronache/me.m12.d10:meMA.Ode5C12.ode	@ltx/en_us_andronache/miscellanea:misc.Ode5
ltx/en_us_andronache/me.m12.d10:meMA.Ode5C12.text	The change of Hermogenes towards the Lord was truly sudden, for by bathing he is cleansed and by divine judgment receives the light of the high priesthood, illumining with teaching those who are in the night of adversities.
ltx/en_us_andronache/me.m12.d10:meMA.Ode5C13.incipit	Leaving the unconvincing mind of…
ltx/en_us_andronache/me.m12.d10:meMA.Ode5C13.melody	@ltx/en_us_andronache/he.h.m1:heHE.TheosOnEirinis.notmetered
ltx/en_us_andronache/me.m12.d10:meMA.Ode5C13.mode	@ltx/en_us_andronache/miscellanea:misc.Mode1
ltx/en_us_andronache/me.m12.d10:meMA.Ode5C13.ode	@ltx/en_us_andronache/miscellanea:misc.Ode5
ltx/en_us_andronache/me.m12.d10:meMA.Ode5C13.text	Leaving the unconvincing mind of the rhetors, you fished with the nets of the unlettered, with the Spirit having made you wise as true martyrs and, through faith, mighty in power against the gusts of the torments.
ltx/en_us_andronache/me.m12.d10:meMA.Ode5C1T.incipit	You were seen to be…
ltx/en_us_andronache/me.m12.d10:meMA.Ode5C1T.melody	@ltx/en_us_andronache/he.h.m1:heHE.TheosOnEirinis.notmetered
ltx/en_us_andronache/me.m12.d10:meMA.Ode5C1T.mode	@ltx/en_us_andronache/miscellanea:misc.Mode1
ltx/en_us_andronache/me.m12.d10:meMA.Ode5C1T.ode	@ltx/en_us_andronache/miscellanea:misc.Ode5
ltx/en_us_andronache/me.m12.d10:meMA.Ode5C1T.text	You were seen to be beyond the holy angels, pure virgin, having given birth to the angel of great counsel, God Emmanuel, making mortals heavenly by His condescension for His unutterable compassion, maiden.
ltx/en_us_andronache/me.m12.d10:meMA.Ode6C11.greekmelody	@ltx/en_us_andronache/he.h.m1:heHE.SplanchnonIonan.greekname
ltx/en_us_andronache/me.m12.d10:meMA.Ode6C11.incipit	You save Jonah from the…
ltx/en_us_andronache/me.m12.d10:meMA.Ode6C11.melody	@ltx/en_us_andronache/he.h.m1:heHE.SplanchnonIonan.notmetered
ltx/en_us_andronache/me.m12.d10:meMA.Ode6C11.mode	@ltx/en_us_andronache/miscellanea:misc.Mode1
ltx/en_us_andronache/me.m12.d10:meMA.Ode6C11.ode	@ltx/en_us_andronache/miscellanea:misc.Ode6
ltx/en_us_andronache/me.m12.d10:meMA.Ode6C11.text	You save Jonah from the beast, typifying your three-day burial, Almighty one, but the bodies of the martyrs thrown in the sea you direct to the most peaceful harbor of the grave, where you keep them for the safekeeping of us, the faithful, by your divine will.
ltx/en_us_andronache/me.m12.d10:meMA.Ode6C12.incipit	The depths gave your bodies…
ltx/en_us_andronache/me.m12.d10:meMA.Ode6C12.melody	@ltx/en_us_andronache/he.h.m1:heHE.SplanchnonIonan.notmetered
ltx/en_us_andronache/me.m12.d10:meMA.Ode6C12.mode	@ltx/en_us_andronache/miscellanea:misc.Mode1
ltx/en_us_andronache/me.m12.d10:meMA.Ode6C12.ode	@ltx/en_us_andronache/miscellanea:misc.Ode6
ltx/en_us_andronache/me.m12.d10:meMA.Ode6C12.text	The depths gave your bodies unharmed to dry land, unconquerable martyrs, preceded by heavenly angels, blessed ones, who made known to all the place of your laying down, which became a spring of healings and release from passions of the soul.
ltx/en_us_andronache/me.m12.d10:meMA.Ode6C13.incipit	The heavenly armies were amazed…
ltx/en_us_andronache/me.m12.d10:meMA.Ode6C13.melody	@ltx/en_us_andronache/he.h.m1:heHE.SplanchnonIonan.notmetered
ltx/en_us_andronache/me.m12.d10:meMA.Ode6C13.mode	@ltx/en_us_andronache/miscellanea:misc.Mode1
ltx/en_us_andronache/me.m12.d10:meMA.Ode6C13.ode	@ltx/en_us_andronache/miscellanea:misc.Ode6
ltx/en_us_andronache/me.m12.d10:meMA.Ode6C13.text	The heavenly armies were amazed by your patience, that while still with a body you put the bodiless dragon to flight and received the crowns of victory, standing by the throne of God and being illumined by the divine rays.
ltx/en_us_andronache/me.m12.d10:meMA.Ode6C1T.incipit	Death stood until you, virgin…
ltx/en_us_andronache/me.m12.d10:meMA.Ode6C1T.melody	@ltx/en_us_andronache/he.h.m1:heHE.SplanchnonIonan.notmetered
ltx/en_us_andronache/me.m12.d10:meMA.Ode6C1T.mode	@ltx/en_us_andronache/miscellanea:misc.Mode1
ltx/en_us_andronache/me.m12.d10:meMA.Ode6C1T.ode	@ltx/en_us_andronache/miscellanea:misc.Ode6
ltx/en_us_andronache/me.m12.d10:meMA.Ode6C1T.text	Death stood until you, virgin, for you bore Christ, the life, who gives the immortal and divine redemption unto those who believe in Him with purity; beseech Him, all-pure one, that release from transgressions be given to your servants.
ltx/en_us_andronache/me.m12.d10:meMA.Ode6H.greekmelody	@ltx/en_us_andronache/he.h.m1:heHE.SplanchnonIonan.greekname
ltx/en_us_andronache/me.m12.d10:meMA.Ode6H.incipit	@ltx/en_us_andronache/he.h.m1:heHE.SplanchnonIonan.incipit
ltx/en_us_andronache/me.m12.d10:meMA.Ode6H.melody	@ltx/en_us_andronache/he.h.m1:heHE.SplanchnonIonan.melody
ltx/en_us_andronache/me.m12.d10:meMA.Ode6H.mode	@ltx/en_us_andronache/miscellanea:misc.Mode1
ltx/en_us_andronache/me.m12.d10:meMA.Ode6H.ode	@ltx/en_us_andronache/miscellanea:misc.Ode6
ltx/en_us_andronache/me.m12.d10:meMA.Ode6H.text	@ltx/en_us_andronache/he.h.m1:heHE.SplanchnonIonan.text
ltx/en_us_andronache/me.m12.d10:meMA.Ode7C11.greekmelody	@ltx/en_us_andronache/he.h.m1:heHE.OiPaidesEfseveia.greekname
ltx/en_us_andronache/me.m12.d10:meMA.Ode7C11.incipit	Where the sound of the…
ltx/en_us_andronache/me.m12.d10:meMA.Ode7C11.melody	@ltx/en_us_andronache/he.h.m1:heHE.OiPaidesEfseveia.notmetered
ltx/en_us_andronache/me.m12.d10:meMA.Ode7C11.mode	@ltx/en_us_andronache/miscellanea:misc.Mode1
ltx/en_us_andronache/me.m12.d10:meMA.Ode7C11.ode	@ltx/en_us_andronache/miscellanea:misc.Ode7
ltx/en_us_andronache/me.m12.d10:meMA.Ode7C11.text	Where the sound of the voice of those celebrating with purity and with souls made glad is, O athletes, there you dwelt having been filled with gladness and chanting: O God of the Fathers, you are blessed.
ltx/en_us_andronache/me.m12.d10:meMA.Ode7C12.incipit	Hermogenes cried out: It is…
ltx/en_us_andronache/me.m12.d10:meMA.Ode7C12.melody	@ltx/en_us_andronache/he.h.m1:heHE.OiPaidesEfseveia.notmetered
ltx/en_us_andronache/me.m12.d10:meMA.Ode7C12.mode	@ltx/en_us_andronache/miscellanea:misc.Mode1
ltx/en_us_andronache/me.m12.d10:meMA.Ode7C12.ode	@ltx/en_us_andronache/miscellanea:misc.Ode7
ltx/en_us_andronache/me.m12.d10:meMA.Ode7C12.text	Hermogenes cried out: It is pleasing to me to die for to me Christ is life, but to die is a boundless gain; Let my members be cut off, as I chant with fervor: O God of the Fathers, you are blessed.
ltx/en_us_andronache/me.m12.d10:meMA.Ode7C13.incipit	You wrote your name in…
ltx/en_us_andronache/me.m12.d10:meMA.Ode7C13.melody	@ltx/en_us_andronache/he.h.m1:heHE.OiPaidesEfseveia.notmetered
ltx/en_us_andronache/me.m12.d10:meMA.Ode7C13.mode	@ltx/en_us_andronache/miscellanea:misc.Mode1
ltx/en_us_andronache/me.m12.d10:meMA.Ode7C13.ode	@ltx/en_us_andronache/miscellanea:misc.Ode7
ltx/en_us_andronache/me.m12.d10:meMA.Ode7C13.text	You wrote your name in the book of the living by the most steadfast spirit, wise Evgraphos; for having had your head cut off, you went on your blood as in a chariot and were translated to the light without evening.
ltx/en_us_andronache/me.m12.d10:meMA.Ode7C1T.incipit	Without burning your womb and…
ltx/en_us_andronache/me.m12.d10:meMA.Ode7C1T.melody	@ltx/en_us_andronache/he.h.m1:heHE.OiPaidesEfseveia.notmetered
ltx/en_us_andronache/me.m12.d10:meMA.Ode7C1T.mode	@ltx/en_us_andronache/miscellanea:misc.Mode1
ltx/en_us_andronache/me.m12.d10:meMA.Ode7C1T.ode	@ltx/en_us_andronache/miscellanea:misc.Ode7
ltx/en_us_andronache/me.m12.d10:meMA.Ode7C1T.text	Without burning your womb and without breaking the seals of virginity, the Logos took flesh from you and granted incorruptibility and life, maiden, to us who sing: O God of the Fathers, you are blessed.
ltx/en_us_andronache/me.m12.d10:meMA.Ode8C11.greekmelody	@ltx/en_us_andronache/he.h.m1:heHE.ThavmatosYperfyous.greekname
ltx/en_us_andronache/me.m12.d10:meMA.Ode8C11.incipit	The vain-thinking one was shattered…
ltx/en_us_andronache/me.m12.d10:meMA.Ode8C11.melody	@ltx/en_us_andronache/he.h.m1:heHE.ThavmatosYperfyous.notmetered
ltx/en_us_andronache/me.m12.d10:meMA.Ode8C11.mode	@ltx/en_us_andronache/miscellanea:misc.Mode1
ltx/en_us_andronache/me.m12.d10:meMA.Ode8C11.ode	@ltx/en_us_andronache/miscellanea:misc.Ode8
ltx/en_us_andronache/me.m12.d10:meMA.Ode8C11.text	The vain-thinking one was shattered before your feet and trampled under, godly-minded Menas. Having lost your eyes and tongue, your mind was not shaken from being set on that which is better. Therefore you cried out joyfully: Let all creation bless the Lord and exalt Him beyond measure unto all the ages.
ltx/en_us_andronache/me.m12.d10:meMA.Ode8C12.incipit	When by the most cruel…
ltx/en_us_andronache/me.m12.d10:meMA.Ode8C12.melody	@ltx/en_us_andronache/he.h.m1:heHE.ThavmatosYperfyous.notmetered
ltx/en_us_andronache/me.m12.d10:meMA.Ode8C12.mode	@ltx/en_us_andronache/miscellanea:misc.Mode1
ltx/en_us_andronache/me.m12.d10:meMA.Ode8C12.ode	@ltx/en_us_andronache/miscellanea:misc.Ode8
ltx/en_us_andronache/me.m12.d10:meMA.Ode8C12.text	When by the most cruel command the wrongly-minded judge took away both your hands and feet, then, wise Hermogenes, having longed for the prizes, you sang unto Christ rejoicing: Let all creation bless the Lord and exalt Him beyond measure unto all the ages.
ltx/en_us_andronache/me.m12.d10:meMA.Ode8C13.incipit	I hymn your divine contests…
ltx/en_us_andronache/me.m12.d10:meMA.Ode8C13.melody	@ltx/en_us_andronache/he.h.m1:heHE.ThavmatosYperfyous.notmetered
ltx/en_us_andronache/me.m12.d10:meMA.Ode8C13.mode	@ltx/en_us_andronache/miscellanea:misc.Mode1
ltx/en_us_andronache/me.m12.d10:meMA.Ode8C13.ode	@ltx/en_us_andronache/miscellanea:misc.Ode8
ltx/en_us_andronache/me.m12.d10:meMA.Ode8C13.text	I hymn your divine contests, Menas, I honor the struggles of Hermogenes, I venerate the relics, I send up a melody for the pains, and the bonds, persecutions and the scourgings through which you went to life crying out: Let all creation bless the Lord and exalt Him beyond measure unto all the ages.
ltx/en_us_andronache/me.m12.d10:meMA.Ode8C1T.incipit	We know you, the jar…
ltx/en_us_andronache/me.m12.d10:meMA.Ode8C1T.melody	@ltx/en_us_andronache/he.h.m1:heHE.ThavmatosYperfyous.notmetered
ltx/en_us_andronache/me.m12.d10:meMA.Ode8C1T.mode	@ltx/en_us_andronache/miscellanea:misc.Mode1
ltx/en_us_andronache/me.m12.d10:meMA.Ode8C1T.ode	@ltx/en_us_andronache/miscellanea:misc.Ode8
ltx/en_us_andronache/me.m12.d10:meMA.Ode8C1T.text	We know you, the jar holding the manna of the godhead, maiden, the ark and the table and lampstand, the throne and palace of God, and the bridge passing to the divine life those who send up the song: Let all creation bless the Lord and exalt Him beyond measure unto all the ages.
ltx/en_us_andronache/me.m12.d10:meMA.Ode8H.greekmelody	@ltx/en_us_andronache/he.h.m1:heHE.ThavmatosYperfyous.greekname
ltx/en_us_andronache/me.m12.d10:meMA.Ode8H.incipit	@ltx/en_us_andronache/he.h.m1:heHE.ThavmatosYperfyous.incipit
ltx/en_us_andronache/me.m12.d10:meMA.Ode8H.melody	@ltx/en_us_andronache/he.h.m1:heHE.ThavmatosYperfyous.melody
ltx/en_us_andronache/me.m12.d10:meMA.Ode8H.mode	@ltx/en_us_andronache/miscellanea:misc.Mode1
ltx/en_us_andronache/me.m12.d10:meMA.Ode8H.ode	@ltx/en_us_andronache/miscellanea:misc.Ode8
ltx/en_us_andronache/me.m12.d10:meMA.Ode8H.text	@ltx/en_us_andronache/he.h.m1:heHE.ThavmatosYperfyous.text
ltx/en_us_andronache/me.m12.d10:meMA.Ode9C11.greekmelody	@ltx/en_us_andronache/he.h.m1:heHE.TyponTisAgnis.greekname
ltx/en_us_andronache/me.m12.d10:meMA.Ode9C11.incipit	See the radiant festival of…
ltx/en_us_andronache/me.m12.d10:meMA.Ode9C11.melody	@ltx/en_us_andronache/he.h.m1:heHE.TyponTisAgnis.notmetered
ltx/en_us_andronache/me.m12.d10:meMA.Ode9C11.mode	@ltx/en_us_andronache/miscellanea:misc.Mode1
ltx/en_us_andronache/me.m12.d10:meMA.Ode9C11.ode	@ltx/en_us_andronache/miscellanea:misc.Ode9
ltx/en_us_andronache/me.m12.d10:meMA.Ode9C11.text	See the radiant festival of the luminous martyrs has shone forth, illuminating the ends of the world and taking away the sightlessness of souls; let us go eagerly to receive sanctification.
ltx/en_us_andronache/me.m12.d10:meMA.Ode9C12.incipit	Great martyrs, we beseech you…
ltx/en_us_andronache/me.m12.d10:meMA.Ode9C12.melody	@ltx/en_us_andronache/he.h.m1:heHE.TyponTisAgnis.notmetered
ltx/en_us_andronache/me.m12.d10:meMA.Ode9C12.mode	@ltx/en_us_andronache/miscellanea:misc.Mode1
ltx/en_us_andronache/me.m12.d10:meMA.Ode9C12.ode	@ltx/en_us_andronache/miscellanea:misc.Ode9
ltx/en_us_andronache/me.m12.d10:meMA.Ode9C12.text	Great martyrs, we beseech you, as ones always standing in the presence of God, to importune Him that those who honor your bright memory with faith find the good things of heaven which you reached and the glory of which you were made worthy.
ltx/en_us_andronache/me.m12.d10:meMA.Ode9C13.incipit	You brought to the Creator…
ltx/en_us_andronache/me.m12.d10:meMA.Ode9C13.melody	@ltx/en_us_andronache/he.h.m1:heHE.TyponTisAgnis.notmetered
ltx/en_us_andronache/me.m12.d10:meMA.Ode9C13.mode	@ltx/en_us_andronache/miscellanea:misc.Mode1
ltx/en_us_andronache/me.m12.d10:meMA.Ode9C13.ode	@ltx/en_us_andronache/miscellanea:misc.Ode9
ltx/en_us_andronache/me.m12.d10:meMA.Ode9C13.text	You brought to the Creator of all body and soul as a blameless sacrifice, being wholly burnt by the fire of torments and were counted with the choirs of the martyrs, wholly illumined by pure light, godly-minded ones.
ltx/en_us_andronache/me.m12.d10:meMA.Ode9C14.incipit	The divine and luminous choir…
ltx/en_us_andronache/me.m12.d10:meMA.Ode9C14.melody	@ltx/en_us_andronache/he.h.m1:heHE.TyponTisAgnis.notmetered
ltx/en_us_andronache/me.m12.d10:meMA.Ode9C14.mode	@ltx/en_us_andronache/miscellanea:misc.Mode1
ltx/en_us_andronache/me.m12.d10:meMA.Ode9C14.ode	@ltx/en_us_andronache/miscellanea:misc.Ode9
ltx/en_us_andronache/me.m12.d10:meMA.Ode9C14.text	The divine and luminous choir of the martyrs, the godly-minded Menas, Hermogenes and Evgraphos, was lifted up to dwell on high and stands beside the Father, Son and Spirit, clearly rejoicing in deification.
ltx/en_us_andronache/me.m12.d10:meMA.Ode9C1T.incipit	Our nature, which had fallen…
ltx/en_us_andronache/me.m12.d10:meMA.Ode9C1T.melody	@ltx/en_us_andronache/he.h.m1:heHE.TyponTisAgnis.notmetered
ltx/en_us_andronache/me.m12.d10:meMA.Ode9C1T.mode	@ltx/en_us_andronache/miscellanea:misc.Mode1
ltx/en_us_andronache/me.m12.d10:meMA.Ode9C1T.ode	@ltx/en_us_andronache/miscellanea:misc.Ode9
ltx/en_us_andronache/me.m12.d10:meMA.Ode9C1T.text	Our nature, which had fallen away, saw the lightning flash of your childbirth and was released from the night of ignorance and of the dark confusion of the passions. Therefore, we honor you as the cause of our salvation.
ltx/en_us_andronache/me.m12.d10:meMA.Ode9H.greekmelody	@ltx/en_us_andronache/he.h.m1:heHE.TyponTisAgnis.greekname
ltx/en_us_andronache/me.m12.d10:meMA.Ode9H.incipit	@ltx/en_us_andronache/he.h.m1:heHE.TyponTisAgnis.incipit
ltx/en_us_andronache/me.m12.d10:meMA.Ode9H.melody	@ltx/en_us_andronache/he.h.m1:heHE.TyponTisAgnis.melody
ltx/en_us_andronache/me.m12.d10:meMA.Ode9H.mode	@ltx/en_us_andronache/miscellanea:misc.Mode1
ltx/en_us_andronache/me.m12.d10:meMA.Ode9H.ode	@ltx/en_us_andronache/miscellanea:misc.Ode9
ltx/en_us_andronache/me.m12.d10:meMA.Ode9H.text	@ltx/en_us_andronache/he.h.m1:heHE.TyponTisAgnis.text
ltx/en_us_andronache/me.m12.d10:meMA.Oikos1.text	Crowning your feast with hymns, Athlete of the Lord, I sing of your battles and I hymns your struggles, because you were considered as gold in the furnace for the only Creator of all, but your firm thought was not shaken by the multitude of the lawless ones, for Christ, who grants to you the incorruptible crown, fortified it from on high for the struggles.
