ltx/en_us_andronache/he.a.m8:heAU.AnestisEkNekron.greekname	
ltx/en_us_andronache/he.a.m8:heAU.AnestisEkNekron.incipit	…
ltx/en_us_andronache/he.a.m8:heAU.AnestisEkNekron.melody	@ltx/en_us_andronache/miscellanea:misc.Automelon
ltx/en_us_andronache/he.a.m8:heAU.AnestisEkNekron.mode	@ltx/en_us_andronache/miscellanea:misc.Mode8
ltx/en_us_andronache/he.a.m8:heAU.AnestisEkNekron.name	O Life of all, You rose.
ltx/en_us_andronache/he.a.m8:heAU.AnestisEkNekron.notmetered	N/M (O Life of all, You rose.)
ltx/en_us_andronache/he.a.m8:heAU.AnestisEkNekron.text	
ltx/en_us_andronache/he.a.m8:heAU.AvlonPoimenikon.greekname	
ltx/en_us_andronache/he.a.m8:heAU.AvlonPoimenikon.incipit	…
ltx/en_us_andronache/he.a.m8:heAU.AvlonPoimenikon.melody	@ltx/en_us_andronache/miscellanea:misc.Automelon
ltx/en_us_andronache/he.a.m8:heAU.AvlonPoimenikon.mode	@ltx/en_us_andronache/miscellanea:misc.Mode8
ltx/en_us_andronache/he.a.m8:heAU.AvlonPoimenikon.name	The army of the Angels.
ltx/en_us_andronache/he.a.m8:heAU.AvlonPoimenikon.notmetered	N/M (The army of the Angels.)
ltx/en_us_andronache/he.a.m8:heAU.AvlonPoimenikon.text	
ltx/en_us_andronache/he.a.m8:heAU.DefteApantesPistoi.greekname	
ltx/en_us_andronache/he.a.m8:heAU.DefteApantesPistoi.incipit	…
ltx/en_us_andronache/he.a.m8:heAU.DefteApantesPistoi.melody	@ltx/en_us_andronache/miscellanea:misc.Automelon
ltx/en_us_andronache/he.a.m8:heAU.DefteApantesPistoi.mode	@ltx/en_us_andronache/miscellanea:misc.Mode8
ltx/en_us_andronache/he.a.m8:heAU.DefteApantesPistoi.name	O believers one and all.
ltx/en_us_andronache/he.a.m8:heAU.DefteApantesPistoi.notmetered	N/M (O believers one and all.)
ltx/en_us_andronache/he.a.m8:heAU.DefteApantesPistoi.text	
ltx/en_us_andronache/he.a.m8:heAU.KyrieEiKaiKritirio.greekname	
ltx/en_us_andronache/he.a.m8:heAU.KyrieEiKaiKritirio.incipit	…
ltx/en_us_andronache/he.a.m8:heAU.KyrieEiKaiKritirio.melody	@ltx/en_us_andronache/miscellanea:misc.Automelon
ltx/en_us_andronache/he.a.m8:heAU.KyrieEiKaiKritirio.mode	@ltx/en_us_andronache/miscellanea:misc.Mode8
ltx/en_us_andronache/he.a.m8:heAU.KyrieEiKaiKritirio.name	Lord, even though.
ltx/en_us_andronache/he.a.m8:heAU.KyrieEiKaiKritirio.notmetered	N/M (Lord, even though.)
ltx/en_us_andronache/he.a.m8:heAU.KyrieEiKaiKritirio.text	
ltx/en_us_andronache/he.a.m8:heAU.OAngelosSouKyrie.greekname	
ltx/en_us_andronache/he.a.m8:heAU.OAngelosSouKyrie.incipit	…
ltx/en_us_andronache/he.a.m8:heAU.OAngelosSouKyrie.melody	@ltx/en_us_andronache/miscellanea:misc.Automelon
ltx/en_us_andronache/he.a.m8:heAU.OAngelosSouKyrie.mode	@ltx/en_us_andronache/miscellanea:misc.Mode8
ltx/en_us_andronache/he.a.m8:heAU.OAngelosSouKyrie.name	O Lord, Your angel.
ltx/en_us_andronache/he.a.m8:heAU.OAngelosSouKyrie.notmetered	N/M (O Lord, Your angel.)
ltx/en_us_andronache/he.a.m8:heAU.OAngelosSouKyrie.text	
ltx/en_us_andronache/he.a.m8:heAU.OEnEdemParadeisos.greekname	
ltx/en_us_andronache/he.a.m8:heAU.OEnEdemParadeisos.incipit	…
ltx/en_us_andronache/he.a.m8:heAU.OEnEdemParadeisos.melody	@ltx/en_us_andronache/miscellanea:misc.Automelon
ltx/en_us_andronache/he.a.m8:heAU.OEnEdemParadeisos.mode	@ltx/en_us_andronache/miscellanea:misc.Mode8
ltx/en_us_andronache/he.a.m8:heAU.OEnEdemParadeisos.name	The paradise of Eden.
ltx/en_us_andronache/he.a.m8:heAU.OEnEdemParadeisos.notmetered	N/M (The paradise of Eden.)
ltx/en_us_andronache/he.a.m8:heAU.OEnEdemParadeisos.text	
ltx/en_us_andronache/he.a.m8:heAU.OTouParadoxou.greekname	
ltx/en_us_andronache/he.a.m8:heAU.OTouParadoxou.incipit	…
ltx/en_us_andronache/he.a.m8:heAU.OTouParadoxou.melody	@ltx/en_us_andronache/miscellanea:misc.Automelon
ltx/en_us_andronache/he.a.m8:heAU.OTouParadoxou.mode	@ltx/en_us_andronache/miscellanea:misc.Mode8
ltx/en_us_andronache/he.a.m8:heAU.OTouParadoxou.name	What a paradoxal.
ltx/en_us_andronache/he.a.m8:heAU.OTouParadoxou.notmetered	N/M (What a paradoxal.)
ltx/en_us_andronache/he.a.m8:heAU.OTouParadoxou.text	
ltx/en_us_andronache/he.a.m8:heAU.OiMartyresSouKyrie.greekname	
ltx/en_us_andronache/he.a.m8:heAU.OiMartyresSouKyrie.incipit	…
ltx/en_us_andronache/he.a.m8:heAU.OiMartyresSouKyrie.melody	@ltx/en_us_andronache/miscellanea:misc.Automelon
ltx/en_us_andronache/he.a.m8:heAU.OiMartyresSouKyrie.mode	@ltx/en_us_andronache/miscellanea:misc.Mode8
ltx/en_us_andronache/he.a.m8:heAU.OiMartyresSouKyrie.name	Your martyr Saints.
ltx/en_us_andronache/he.a.m8:heAU.OiMartyresSouKyrie.notmetered	N/M (Your martyr Saints.)
ltx/en_us_andronache/he.a.m8:heAU.OiMartyresSouKyrie.text	
ltx/en_us_andronache/he.a.m8:heAU.OsAparchas.greekname	
ltx/en_us_andronache/he.a.m8:heAU.OsAparchas.incipit	…
ltx/en_us_andronache/he.a.m8:heAU.OsAparchas.melody	@ltx/en_us_andronache/miscellanea:misc.Automelon
ltx/en_us_andronache/he.a.m8:heAU.OsAparchas.mode	@ltx/en_us_andronache/miscellanea:misc.Mode8
ltx/en_us_andronache/he.a.m8:heAU.OsAparchas.name	O Planter of creation.
ltx/en_us_andronache/he.a.m8:heAU.OsAparchas.notmetered	N/M (O Planter.)
ltx/en_us_andronache/he.a.m8:heAU.OsAparchas.text	
ltx/en_us_andronache/he.a.m8:heAU.TiYmasKalesomen.greekname	
ltx/en_us_andronache/he.a.m8:heAU.TiYmasKalesomen.incipit	…
ltx/en_us_andronache/he.a.m8:heAU.TiYmasKalesomen.melody	@ltx/en_us_andronache/miscellanea:misc.Automelon
ltx/en_us_andronache/he.a.m8:heAU.TiYmasKalesomen.mode	@ltx/en_us_andronache/miscellanea:misc.Mode8
ltx/en_us_andronache/he.a.m8:heAU.TiYmasKalesomen.name	What are we to call you.
ltx/en_us_andronache/he.a.m8:heAU.TiYmasKalesomen.notmetered	N/M (What…to call you.)
ltx/en_us_andronache/he.a.m8:heAU.TiYmasKalesomen.text	
ltx/en_us_andronache/he.a.m8:heAU.TiYpermacho.greekname	
ltx/en_us_andronache/he.a.m8:heAU.TiYpermacho.incipit	…
ltx/en_us_andronache/he.a.m8:heAU.TiYpermacho.melody	@ltx/en_us_andronache/miscellanea:misc.Automelon
ltx/en_us_andronache/he.a.m8:heAU.TiYpermacho.mode	@ltx/en_us_andronache/miscellanea:misc.Mode8
ltx/en_us_andronache/he.a.m8:heAU.TiYpermacho.name	O Champion General.
ltx/en_us_andronache/he.a.m8:heAU.TiYpermacho.notmetered	N/M (O Champion General.)
ltx/en_us_andronache/he.a.m8:heAU.TiYpermacho.text	
ltx/en_us_andronache/he.a.m8:heAU.TinSofianKaiLogon.greekname	
ltx/en_us_andronache/he.a.m8:heAU.TinSofianKaiLogon.incipit	…
ltx/en_us_andronache/he.a.m8:heAU.TinSofianKaiLogon.melody	@ltx/en_us_andronache/miscellanea:misc.Automelon
ltx/en_us_andronache/he.a.m8:heAU.TinSofianKaiLogon.mode	@ltx/en_us_andronache/miscellanea:misc.Mode8
ltx/en_us_andronache/he.a.m8:heAU.TinSofianKaiLogon.name	By conceiving the wisdom.
ltx/en_us_andronache/he.a.m8:heAU.TinSofianKaiLogon.notmetered	N/M (By conceiving the wisdom.)
ltx/en_us_andronache/he.a.m8:heAU.TinSofianKaiLogon.text	
ltx/en_us_andronache/he.a.m8:heAU.ToProstachthen.greekname	
ltx/en_us_andronache/he.a.m8:heAU.ToProstachthen.incipit	…
ltx/en_us_andronache/he.a.m8:heAU.ToProstachthen.melody	@ltx/en_us_andronache/miscellanea:misc.Automelon
ltx/en_us_andronache/he.a.m8:heAU.ToProstachthen.mode	@ltx/en_us_andronache/miscellanea:misc.Mode8
ltx/en_us_andronache/he.a.m8:heAU.ToProstachthen.name	When he perceived.
ltx/en_us_andronache/he.a.m8:heAU.ToProstachthen.notmetered	N/M (When he perceived.)
ltx/en_us_andronache/he.a.m8:heAU.ToProstachthen.text	
ltx/en_us_andronache/he.a.m8:heAU.title	
