ltx/en_us_acook/he.a.m7:heAU.KatafronisantesPanton.greekname	
ltx/en_us_acook/he.a.m7:heAU.KatafronisantesPanton.incipit	When you had wisely…
ltx/en_us_acook/he.a.m7:heAU.KatafronisantesPanton.melody	@ltx/en_us_acook/miscellanea:misc.Automelon
ltx/en_us_acook/he.a.m7:heAU.KatafronisantesPanton.mode	@ltx/en_us_acook/miscellanea:misc.Mode7
ltx/en_us_acook/he.a.m7:heAU.KatafronisantesPanton.name	When you had wisely.
ltx/en_us_acook/he.a.m7:heAU.KatafronisantesPanton.notmetered	N/M (When you had wisely.)
ltx/en_us_acook/he.a.m7:heAU.KatafronisantesPantontext	
ltx/en_us_acook/he.a.m7:heAU.ODiEmeAnaschomenos.greekname	
ltx/en_us_acook/he.a.m7:heAU.ODiEmeAnaschomenos.incipit	…
ltx/en_us_acook/he.a.m7:heAU.ODiEmeAnaschomenos.melody	@ltx/en_us_acook/miscellanea:misc.Automelon
ltx/en_us_acook/he.a.m7:heAU.ODiEmeAnaschomenos.mode	@ltx/en_us_acook/miscellanea:misc.Mode7
ltx/en_us_acook/he.a.m7:heAU.ODiEmeAnaschomenos.name	
ltx/en_us_acook/he.a.m7:heAU.ODiEmeAnaschomenos.notmetered	N/M (O Christ God.)
ltx/en_us_acook/he.a.m7:heAU.ODiEmeAnaschomenostext	
ltx/en_us_acook/he.a.m7:heAU.OsEchousaToSympathes.greekname	
ltx/en_us_acook/he.a.m7:heAU.OsEchousaToSympathes.incipit	…
ltx/en_us_acook/he.a.m7:heAU.OsEchousaToSympathes.melody	@ltx/en_us_acook/miscellanea:misc.Automelon
ltx/en_us_acook/he.a.m7:heAU.OsEchousaToSympathes.mode	@ltx/en_us_acook/miscellanea:misc.Mode7
ltx/en_us_acook/he.a.m7:heAU.OsEchousaToSympathes.name	
ltx/en_us_acook/he.a.m7:heAU.OsEchousaToSympathes.notmetered	N/M ()
ltx/en_us_acook/he.a.m7:heAU.OsEchousaToSympathestext	
ltx/en_us_acook/he.a.m7:heAU.OukEtiKolyometha.greekname	
ltx/en_us_acook/he.a.m7:heAU.OukEtiKolyometha.incipit	No longer are we barred…
ltx/en_us_acook/he.a.m7:heAU.OukEtiKolyometha.melody	@ltx/en_us_acook/miscellanea:misc.Automelon
ltx/en_us_acook/he.a.m7:heAU.OukEtiKolyometha.mode	@ltx/en_us_acook/miscellanea:misc.Mode7
ltx/en_us_acook/he.a.m7:heAU.OukEtiKolyometha.name	No longer are we barred.
ltx/en_us_acook/he.a.m7:heAU.OukEtiKolyometha.notmetered	N/M (No longer are we barred.)
ltx/en_us_acook/he.a.m7:heAU.OukEtiKolyomethatext	
ltx/en_us_acook/he.a.m7:heAU.OuketiFloginiRomfaia.greekname	
ltx/en_us_acook/he.a.m7:heAU.OuketiFloginiRomfaia.incipit	The fiery sword…
ltx/en_us_acook/he.a.m7:heAU.OuketiFloginiRomfaia.melody	@ltx/en_us_acook/miscellanea:misc.Automelon
ltx/en_us_acook/he.a.m7:heAU.OuketiFloginiRomfaia.mode	@ltx/en_us_acook/miscellanea:misc.Mode7
ltx/en_us_acook/he.a.m7:heAU.OuketiFloginiRomfaia.name	The fiery sword.
ltx/en_us_acook/he.a.m7:heAU.OuketiFloginiRomfaia.notmetered	N/M (The fiery sword.)
ltx/en_us_acook/he.a.m7:heAU.OuketiFloginiRomfaiatext	
ltx/en_us_acook/he.a.m7:heAU.PyrosFoteinoteron.greekname	
ltx/en_us_acook/he.a.m7:heAU.PyrosFoteinoteron.incipit	…
ltx/en_us_acook/he.a.m7:heAU.PyrosFoteinoteron.melody	@ltx/en_us_acook/miscellanea:misc.Automelon
ltx/en_us_acook/he.a.m7:heAU.PyrosFoteinoteron.mode	@ltx/en_us_acook/miscellanea:misc.Mode7
ltx/en_us_acook/he.a.m7:heAU.PyrosFoteinoteron.name	More dazzling than flame.
ltx/en_us_acook/he.a.m7:heAU.PyrosFoteinoteron.notmetered	N/M (More dazzling than flame.)
ltx/en_us_acook/he.a.m7:heAU.PyrosFoteinoterontext	
ltx/en_us_acook/he.a.m7:heAU.SimeronGrigoreiOIoudas.greekname	
ltx/en_us_acook/he.a.m7:heAU.SimeronGrigoreiOIoudas.incipit	Judas today is vigilant…
ltx/en_us_acook/he.a.m7:heAU.SimeronGrigoreiOIoudas.melody	@ltx/en_us_acook/miscellanea:misc.Automelon
ltx/en_us_acook/he.a.m7:heAU.SimeronGrigoreiOIoudas.mode	@ltx/en_us_acook/miscellanea:misc.Mode7
ltx/en_us_acook/he.a.m7:heAU.SimeronGrigoreiOIoudas.name	Judas today is vigilant.
ltx/en_us_acook/he.a.m7:heAU.SimeronGrigoreiOIoudas.notmetered	N/M (Judas today is vigilant.)
ltx/en_us_acook/he.a.m7:heAU.SimeronGrigoreiOIoudastext	
ltx/en_us_acook/he.a.m7:heAU.XylonZois.greekname	
ltx/en_us_acook/he.a.m7:heAU.XylonZois.incipit	The tree of life…
ltx/en_us_acook/he.a.m7:heAU.XylonZois.melody	@ltx/en_us_acook/miscellanea:misc.Automelon
ltx/en_us_acook/he.a.m7:heAU.XylonZois.mode	@ltx/en_us_acook/miscellanea:misc.Mode7
ltx/en_us_acook/he.a.m7:heAU.XylonZois.name	The tree of life.
ltx/en_us_acook/he.a.m7:heAU.XylonZois.notmetered	N/M (The tree of life.)
ltx/en_us_acook/he.a.m7:heAU.XylonZoistext	
ltx/en_us_acook/he.a.m7:heAU.title	Automela of Grave Mode
