ltx/en_us_aana/me.m11.d07:alt1.meDA.commemoration.first_name	
ltx/en_us_aana/me.m11.d07:alt1.meDA.commemoration.first_short	Memory of our Holy Father Raphael, Bishop of Brooklyn
ltx/en_us_aana/me.m11.d07:alt1.meDA.commemoration.first_title	
ltx/en_us_aana/me.m11.d07:alt1.meDA.commemoration.full	Memory of our Holy Father Raphael, Bishop of Brooklyn
ltx/en_us_aana/me.m11.d07:alt1.meDA.commemoration.second_name	
ltx/en_us_aana/me.m11.d07:alt1.meDA.commemoration.second_title	whose memory we celebrate;
ltx/en_us_aana/me.m11.d07:alt1.meDA.date	On the first Saturday of November
ltx/en_us_aana/me.m11.d07:alt1.meDA.insert1	our holy father Raphael, Bishop of Brooklyn,
ltx/en_us_aana/me.m11.d07:alt1.meDA.insert2	whose memory we celebrate;
ltx/en_us_aana/me.m11.d07:alt1.meDA.note	Text taken from “Our Father among the Saints Raphael, Bishop of Brooklyn.” Antakya Press, Antiochian Orthodox Christian Archdiocese of North America © 2000. Revised in 2020 by the Department of Liturgics. All rights reserved. Used by permission.
ltx/en_us_aana/me.m11.d07:alt1.meHO.commemorations	
ltx/en_us_aana/me.m11.d07:alt1.meHO.note1	
ltx/en_us_aana/me.m11.d07:alt1.meHO.note2	
ltx/en_us_aana/me.m11.d07:alt1.meHO.number	
ltx/en_us_aana/me.m11.d07:alt1.meHO.rank	
ltx/en_us_aana/me.m11.d07:alt1.meLE.commemoration1	
ltx/en_us_aana/me.m11.d07:alt1.meLE.commemoration2	
ltx/en_us_aana/me.m11.d07:alt1.meLI.Kontakion1.incipit	@ltx/en_us_aana/me.m11.d07:alt1.meMA.Kontakion1.incipit
ltx/en_us_aana/me.m11.d07:alt1.meLI.Kontakion1.melody	@ltx/en_us_aana/me.m11.d07:alt1.meMA.Kontakion1.melody
ltx/en_us_aana/me.m11.d07:alt1.meLI.Kontakion1.mode	@ltx/en_us_aana/me.m11.d07:alt1.meMA.Kontakion1.mode
ltx/en_us_aana/me.m11.d07:alt1.meLI.Kontakion1.text	@ltx/en_us_aana/me.m11.d07:alt1.meMA.Kontakion1.text
ltx/en_us_aana/me.m11.d07:alt1.meLI.MM.CommunionHymn.text	@ltx/en_us_aana/properties:media.key
ltx/en_us_aana/me.m11.d07:alt1.meLI.Megalynarion.text	
ltx/en_us_aana/me.m11.d07:alt1.meMA.C1.title	
ltx/en_us_aana/me.m11.d07:alt1.meMA.C1.verse	
ltx/en_us_aana/me.m11.d07:alt1.meMA.ExapTheotokion.incipit	Thou art the sweetness of…
ltx/en_us_aana/me.m11.d07:alt1.meMA.ExapTheotokion.melody	@ltx/en_us_aana/he.a.m3:heAU.TonNymfonaSouVlepo.name
ltx/en_us_aana/me.m11.d07:alt1.meMA.ExapTheotokion.mode	@ltx/en_us_aana/miscellanea:misc.Mode3
ltx/en_us_aana/me.m11.d07:alt1.meMA.ExapTheotokion.text	Thou art the sweetness of angels,* the gladness of afflicted ones,* and the protectress of Christians,* O Virgin Mother of our Lord God; * be thou my helper and save me * from out of eternal torments.
ltx/en_us_aana/me.m11.d07:alt1.meMA.Exaposteilarion1.greekmelody	@ltx/en_us_aana/he.a.m3:heAU.TonNymfonaSouVlepo.greekname
ltx/en_us_aana/me.m11.d07:alt1.meMA.Exaposteilarion1.incipit	Today is truly illumined *…
ltx/en_us_aana/me.m11.d07:alt1.meMA.Exaposteilarion1.melody	@ltx/en_us_aana/he.a.m3:heAU.TonNymfonaSouVlepo.name
ltx/en_us_aana/me.m11.d07:alt1.meMA.Exaposteilarion1.mode	@ltx/en_us_aana/miscellanea:misc.Mode3
ltx/en_us_aana/me.m11.d07:alt1.meMA.Exaposteilarion1.text	Today is truly illumined * by the great brilliance of this feast. * For, holy hierarch Raphael, * at God’s august throne standeth, * and intercedeth for us who cry: * Good shepherd, remember us thy flock.
ltx/en_us_aana/me.m11.d07:alt1.meMA.Kathisma11.greekmelody	@ltx/en_us_aana/he.a.m1:heAU.TonTafonSouSotir.greekname
ltx/en_us_aana/me.m11.d07:alt1.meMA.Kathisma11.incipit	In word, in deed and…
ltx/en_us_aana/me.m11.d07:alt1.meMA.Kathisma11.melody	@ltx/en_us_aana/he.a.m1:heAU.TonTafonSouSotir.name
ltx/en_us_aana/me.m11.d07:alt1.meMA.Kathisma11.mode	@ltx/en_us_aana/miscellanea:misc.Mode1
ltx/en_us_aana/me.m11.d07:alt1.meMA.Kathisma11.text	In word, in deed and thought, thou didst follow the Savior. * Thou didst obey His call to live like the apostles. * Then, leaving thine own homeland, thou didst gift thy flock with baptism, * teaching them to profess the One true God in Three Persons. * Hence, we call thee now a faithful preacher of true faith,* O holy hierarch Raphael.
ltx/en_us_aana/me.m11.d07:alt1.meMA.Kathisma1T.greekmelody	@ltx/en_us_aana/he.a.m1:heAU.TonTafonSouSotir.greekname
ltx/en_us_aana/me.m11.d07:alt1.meMA.Kathisma1T.incipit	Unwedded mother Virgin, the pure…
ltx/en_us_aana/me.m11.d07:alt1.meMA.Kathisma1T.melody	@ltx/en_us_aana/he.a.m1:heAU.TonTafonSouSotir.name
ltx/en_us_aana/me.m11.d07:alt1.meMA.Kathisma1T.mode	@ltx/en_us_aana/miscellanea:misc.Mode1
ltx/en_us_aana/me.m11.d07:alt1.meMA.Kathisma1T.text	Unwedded mother Virgin, the pure Theotokos, * in life save from calamities and various afflictions, * the faithful who hide beneath the Redeemer’s life-giving Cross, * who doth bear with patience and with faith their pure contest. * Mother of Christ our God, thou art the sure intercessor; * pray for us and save our souls.
ltx/en_us_aana/me.m11.d07:alt1.meMA.Kathisma21.greekmelody	@ltx/en_us_aana/he.a.m3:heAU.TinOraiotita.greekname
ltx/en_us_aana/me.m11.d07:alt1.meMA.Kathisma21.incipit	Bearing thy cross from youth…
ltx/en_us_aana/me.m11.d07:alt1.meMA.Kathisma21.melody	@ltx/en_us_aana/he.a.m3:heAU.TinOraiotita.name
ltx/en_us_aana/me.m11.d07:alt1.meMA.Kathisma21.mode	@ltx/en_us_aana/miscellanea:misc.Mode3
ltx/en_us_aana/me.m11.d07:alt1.meMA.Kathisma21.text	Bearing thy cross from youth, thou didst deny thyself. * Forgoing earthly things, thou soughtest the heavenly. * Consumed by heartfelt love for Christ, thou foundest thy precious life in Him. * When Christ our life manifests, to judge the living and the dead, * thou shalt also stand before him, * shining brightly and glorified. * Then, on that fearful, solemn day of Judgment, * pray to Christ for us who honor thee.
ltx/en_us_aana/me.m11.d07:alt1.meMA.Kathisma2T.greekmelody	@ltx/en_us_aana/he.a.m3:heAU.TinOraiotita.greekname
ltx/en_us_aana/me.m11.d07:alt1.meMA.Kathisma2T.incipit	@ltx/en_us_aana/he.a.m3:heAU.TinOraiotita.incipit
ltx/en_us_aana/me.m11.d07:alt1.meMA.Kathisma2T.melody	@ltx/en_us_aana/he.a.m3:heAU.TinOraiotita.melody
ltx/en_us_aana/me.m11.d07:alt1.meMA.Kathisma2T.mode	@ltx/en_us_aana/miscellanea:misc.Mode3
ltx/en_us_aana/me.m11.d07:alt1.meMA.Kathisma2T.text	@ltx/en_us_aana/he.a.m3:heAU.TinOraiotita.text
ltx/en_us_aana/me.m11.d07:alt1.meMA.Kathisma31.greekmelody	@ltx/en_us_aana/he.a.m4:heAU.KateplagiIosif.greekname
ltx/en_us_aana/me.m11.d07:alt1.meMA.Kathisma31.incipit	As a model of vigilance…
ltx/en_us_aana/me.m11.d07:alt1.meMA.Kathisma31.melody	@ltx/en_us_aana/he.a.m4:heAU.KateplagiIosif.name
ltx/en_us_aana/me.m11.d07:alt1.meMA.Kathisma31.mode	@ltx/en_us_aana/miscellanea:misc.Mode4
ltx/en_us_aana/me.m11.d07:alt1.meMA.Kathisma31.text	As a model of vigilance, * over the passions thou didst rule, * cultivating in thy soul * the Holy Spirit’s precious gifts. * A soothing balm and a man of peace who united all thy flock, * thou didst keep it safe * from the fierce wolf of souls. * As a faithful shepherd, thou didst gather those * who were before dispersed as weak lambs lost in the hills * through the grace abiding in thy soul. * O Father Raphael, lead thou to safe pasture * those who pray to thee with fervor.
ltx/en_us_aana/me.m11.d07:alt1.meMA.Kathisma3T.greekmelody	@ltx/en_us_aana/he.a.m4:heAU.KateplagiIosif.greekname
ltx/en_us_aana/me.m11.d07:alt1.meMA.Kathisma3T.incipit	O all-pure and full of…
ltx/en_us_aana/me.m11.d07:alt1.meMA.Kathisma3T.melody	@ltx/en_us_aana/he.a.m4:heAU.KateplagiIosif.name
ltx/en_us_aana/me.m11.d07:alt1.meMA.Kathisma3T.mode	@ltx/en_us_aana/miscellanea:misc.Mode4
ltx/en_us_aana/me.m11.d07:alt1.meMA.Kathisma3T.text	O all-pure and full of grace, * the Virgin Mother of the Lord, * who gave birth to Him who is * the One Eternal God of all, * beseech and supplicate Him with the hierarch Raphael * to grant unto us * the forgiveness of our sins, * and before the end reformation of life; * for thee, O Lady, we exalt and magnify, * and with faith and love we honor thee. * O Virgin Mary, thou art worthy * of all reverence and glory.
ltx/en_us_aana/me.m11.d07:alt1.meMA.Kontakion1.incipit	Today the memory of blessed…
ltx/en_us_aana/me.m11.d07:alt1.meMA.Kontakion1.melody	
ltx/en_us_aana/me.m11.d07:alt1.meMA.Kontakion1.mode	@ltx/en_us_aana/miscellanea:misc.Mode8
ltx/en_us_aana/me.m11.d07:alt1.meMA.Kontakion1.text	Today the memory of blessed Raphael has shone on us; for having received Christ’s call he faithfully took up his cross and followed him, becoming a fisher of men. Let us cry aloud to him, saying: Rejoice, O Father Raphael!
ltx/en_us_aana/me.m11.d07:alt1.meMA.Lauds1.greekmelody	@ltx/en_us_aana/he.a.m4:heAU.EdokasSimeiosin.greekname
ltx/en_us_aana/me.m11.d07:alt1.meMA.Lauds1.incipit	Under thy pastoral care, the…
ltx/en_us_aana/me.m11.d07:alt1.meMA.Lauds1.melody	@ltx/en_us_aana/he.a.m4:heAU.EdokasSimeiosin.name
ltx/en_us_aana/me.m11.d07:alt1.meMA.Lauds1.mode	@ltx/en_us_aana/miscellanea:misc.Mode4
ltx/en_us_aana/me.m11.d07:alt1.meMA.Lauds1.text	Under thy pastoral care, the Church took root in America. * Thou established the Mother Church, * the ven’rable holy temple * of the Wonderworker, * irrigating it with toils and fervent holy prayers, * and planting thy precious body at thine end. * Thy children then, throughout the land, fulfilled thy words and held fast the Faith. * As thou standest at God’s high throne, * now beseech Him to save our souls.
ltx/en_us_aana/me.m11.d07:alt1.meMA.Lauds2.incipit	Fervent and devoted celebrant of…
ltx/en_us_aana/me.m11.d07:alt1.meMA.Lauds2.melody	@ltx/en_us_aana/he.a.m4:heAU.EdokasSimeiosin.name
ltx/en_us_aana/me.m11.d07:alt1.meMA.Lauds2.mode	@ltx/en_us_aana/miscellanea:misc.Mode4
ltx/en_us_aana/me.m11.d07:alt1.meMA.Lauds2.text	Fervent and devoted celebrant of off’rings and mysteries, * who can tell of the countless hours * thou spentest translating them * for the sake of thy flock? * Thou didst gather pearls from the Greek and from Slavonic tongues, * and fashioned them into pearls of Arabic. * Thou also taught us to worship in the tongue of America. * As thou standest at God’s high throne, * now beseech Him to save our souls.
ltx/en_us_aana/me.m11.d07:alt1.meMA.Lauds3.incipit	As a worthy hierarch, thou…
ltx/en_us_aana/me.m11.d07:alt1.meMA.Lauds3.melody	@ltx/en_us_aana/he.a.m4:heAU.EdokasSimeiosin.name
ltx/en_us_aana/me.m11.d07:alt1.meMA.Lauds3.mode	@ltx/en_us_aana/miscellanea:misc.Mode4
ltx/en_us_aana/me.m11.d07:alt1.meMA.Lauds3.text	As a worthy hierarch, thou didst take upon thyself the needs * and concerns of thy holy flock; * in towns, villages and farms, * to thyself didst draw them. * Thou didst keep thy sheep from going astray into strange fields; * thy hand kept them safe from devouring, evil wolves. * Thy deeds of love grew brighter as the churches grew in number. * As thou standest at God’s high throne, * now beseech Him to save our souls.
ltx/en_us_aana/me.m11.d07:alt1.meMA.LaudsGlory.incipit	Today is the day we…
ltx/en_us_aana/me.m11.d07:alt1.meMA.LaudsGlory.melody	
ltx/en_us_aana/me.m11.d07:alt1.meMA.LaudsGlory.mode	@ltx/en_us_aana/miscellanea:misc.Mode5
ltx/en_us_aana/me.m11.d07:alt1.meMA.LaudsGlory.text	Today is the day we honor the holy hierarch Raphael! Who can describe his many sorrows and his many labors? Who can describe his many pains? He journeyed on land and on the sea, searching for his lost sheep, in weariness and in poverty, in sleeplessness, thirst and hunger. He became the good shepherd of the lost sheep in America, so let us cry out unto to him: O our Father, intercede for the salvation of our souls!
ltx/en_us_aana/me.m11.d07:alt1.meMA.LaudsTheotokion.incipit	Beneath thy compassion we take…
ltx/en_us_aana/me.m11.d07:alt1.meMA.LaudsTheotokion.melody	
ltx/en_us_aana/me.m11.d07:alt1.meMA.LaudsTheotokion.mode	@ltx/en_us_aana/miscellanea:misc.Mode5
ltx/en_us_aana/me.m11.d07:alt1.meMA.LaudsTheotokion.text	Beneath thy compassion we take refuge, O Theotokos. Despise not our prayers in our necessity, but deliver us from harm, O only pure, only blessed one.
ltx/en_us_aana/me.m11.d07:alt1.meMA.Ode1C11.greekmelody	@ltx/en_us_aana/he.h.m6:heHE.OsEnIpeiroPezefsas.greekname
ltx/en_us_aana/me.m11.d07:alt1.meMA.Ode1C11.incipit	…
ltx/en_us_aana/me.m11.d07:alt1.meMA.Ode1C11.melody	@ltx/en_us_aana/he.h.m6:heHE.OsEnIpeiroPezefsas.name
ltx/en_us_aana/me.m11.d07:alt1.meMA.Ode1C11.mode	@ltx/en_us_aana/miscellanea:misc.Mode6
ltx/en_us_aana/me.m11.d07:alt1.meMA.Ode1C11.ode	@ltx/en_us_aana/miscellanea:misc.Ode1
ltx/en_us_aana/me.m11.d07:alt1.meMA.Ode1C11.text	
ltx/en_us_aana/me.m11.d07:alt1.meMA.Ode1C12.incipit	…
ltx/en_us_aana/me.m11.d07:alt1.meMA.Ode1C12.melody	@ltx/en_us_aana/he.h.m6:heHE.OsEnIpeiroPezefsas.name
ltx/en_us_aana/me.m11.d07:alt1.meMA.Ode1C12.mode	@ltx/en_us_aana/miscellanea:misc.Mode6
ltx/en_us_aana/me.m11.d07:alt1.meMA.Ode1C12.ode	@ltx/en_us_aana/miscellanea:misc.Ode1
ltx/en_us_aana/me.m11.d07:alt1.meMA.Ode1C12.text	
ltx/en_us_aana/me.m11.d07:alt1.meMA.Ode1C13.incipit	…
ltx/en_us_aana/me.m11.d07:alt1.meMA.Ode1C13.melody	@ltx/en_us_aana/he.h.m6:heHE.OsEnIpeiroPezefsas.name
ltx/en_us_aana/me.m11.d07:alt1.meMA.Ode1C13.mode	@ltx/en_us_aana/miscellanea:misc.Mode6
ltx/en_us_aana/me.m11.d07:alt1.meMA.Ode1C13.ode	@ltx/en_us_aana/miscellanea:misc.Ode1
ltx/en_us_aana/me.m11.d07:alt1.meMA.Ode1C13.text	
ltx/en_us_aana/me.m11.d07:alt1.meMA.Ode1C14.incipit	…
ltx/en_us_aana/me.m11.d07:alt1.meMA.Ode1C14.melody	@ltx/en_us_aana/he.h.m6:heHE.OsEnIpeiroPezefsas.name
ltx/en_us_aana/me.m11.d07:alt1.meMA.Ode1C14.mode	@ltx/en_us_aana/miscellanea:misc.Mode6
ltx/en_us_aana/me.m11.d07:alt1.meMA.Ode1C14.ode	@ltx/en_us_aana/miscellanea:misc.Ode1
ltx/en_us_aana/me.m11.d07:alt1.meMA.Ode1C14.text	
ltx/en_us_aana/me.m11.d07:alt1.meMA.Ode1C1T.incipit	…
ltx/en_us_aana/me.m11.d07:alt1.meMA.Ode1C1T.melody	@ltx/en_us_aana/he.h.m6:heHE.OsEnIpeiroPezefsas.name
ltx/en_us_aana/me.m11.d07:alt1.meMA.Ode1C1T.mode	@ltx/en_us_aana/miscellanea:misc.Mode6
ltx/en_us_aana/me.m11.d07:alt1.meMA.Ode1C1T.ode	@ltx/en_us_aana/miscellanea:misc.Ode1
ltx/en_us_aana/me.m11.d07:alt1.meMA.Ode1C1T.text	
ltx/en_us_aana/me.m11.d07:alt1.meMA.Ode3C11.greekmelody	@ltx/en_us_aana/he.h.m6:heHE.OukEstinAgios.greekname
ltx/en_us_aana/me.m11.d07:alt1.meMA.Ode3C11.incipit	…
ltx/en_us_aana/me.m11.d07:alt1.meMA.Ode3C11.melody	@ltx/en_us_aana/he.h.m6:heHE.OukEstinAgios.name
ltx/en_us_aana/me.m11.d07:alt1.meMA.Ode3C11.mode	@ltx/en_us_aana/miscellanea:misc.Mode6
ltx/en_us_aana/me.m11.d07:alt1.meMA.Ode3C11.ode	@ltx/en_us_aana/miscellanea:misc.Ode3
ltx/en_us_aana/me.m11.d07:alt1.meMA.Ode3C11.text	
ltx/en_us_aana/me.m11.d07:alt1.meMA.Ode3C12.incipit	…
ltx/en_us_aana/me.m11.d07:alt1.meMA.Ode3C12.melody	@ltx/en_us_aana/he.h.m6:heHE.OukEstinAgios.name
ltx/en_us_aana/me.m11.d07:alt1.meMA.Ode3C12.mode	@ltx/en_us_aana/miscellanea:misc.Mode6
ltx/en_us_aana/me.m11.d07:alt1.meMA.Ode3C12.ode	@ltx/en_us_aana/miscellanea:misc.Ode3
ltx/en_us_aana/me.m11.d07:alt1.meMA.Ode3C12.text	
ltx/en_us_aana/me.m11.d07:alt1.meMA.Ode3C13.incipit	…
ltx/en_us_aana/me.m11.d07:alt1.meMA.Ode3C13.melody	@ltx/en_us_aana/he.h.m6:heHE.OukEstinAgios.name
ltx/en_us_aana/me.m11.d07:alt1.meMA.Ode3C13.mode	@ltx/en_us_aana/miscellanea:misc.Mode6
ltx/en_us_aana/me.m11.d07:alt1.meMA.Ode3C13.ode	@ltx/en_us_aana/miscellanea:misc.Ode3
ltx/en_us_aana/me.m11.d07:alt1.meMA.Ode3C13.text	
ltx/en_us_aana/me.m11.d07:alt1.meMA.Ode3C14.incipit	…
ltx/en_us_aana/me.m11.d07:alt1.meMA.Ode3C14.melody	@ltx/en_us_aana/he.h.m6:heHE.OukEstinAgios.name
ltx/en_us_aana/me.m11.d07:alt1.meMA.Ode3C14.mode	@ltx/en_us_aana/miscellanea:misc.Mode6
ltx/en_us_aana/me.m11.d07:alt1.meMA.Ode3C14.ode	@ltx/en_us_aana/miscellanea:misc.Ode3
ltx/en_us_aana/me.m11.d07:alt1.meMA.Ode3C14.text	
ltx/en_us_aana/me.m11.d07:alt1.meMA.Ode3C1T.incipit	…
ltx/en_us_aana/me.m11.d07:alt1.meMA.Ode3C1T.melody	@ltx/en_us_aana/he.h.m6:heHE.OukEstinAgios.name
ltx/en_us_aana/me.m11.d07:alt1.meMA.Ode3C1T.mode	@ltx/en_us_aana/miscellanea:misc.Mode6
ltx/en_us_aana/me.m11.d07:alt1.meMA.Ode3C1T.ode	@ltx/en_us_aana/miscellanea:misc.Ode3
ltx/en_us_aana/me.m11.d07:alt1.meMA.Ode3C1T.text	
ltx/en_us_aana/me.m11.d07:alt1.meMA.Ode3Kathisma1.greekmelody	@ltx/en_us_aana/he.a.m4:heAU.KateplagiIosif.greekname
ltx/en_us_aana/me.m11.d07:alt1.meMA.Ode3Kathisma1.incipit	…
ltx/en_us_aana/me.m11.d07:alt1.meMA.Ode3Kathisma1.melody	@ltx/en_us_aana/he.a.m4:heAU.KateplagiIosif.name
ltx/en_us_aana/me.m11.d07:alt1.meMA.Ode3Kathisma1.mode	@ltx/en_us_aana/miscellanea:misc.Mode4
ltx/en_us_aana/me.m11.d07:alt1.meMA.Ode3Kathisma1.text	
ltx/en_us_aana/me.m11.d07:alt1.meMA.Ode3KathismaT.incipit	…
ltx/en_us_aana/me.m11.d07:alt1.meMA.Ode3KathismaT.melody	
ltx/en_us_aana/me.m11.d07:alt1.meMA.Ode3KathismaT.mode	@ltx/en_us_aana/miscellanea:misc.Mode4
ltx/en_us_aana/me.m11.d07:alt1.meMA.Ode3KathismaT.text	
ltx/en_us_aana/me.m11.d07:alt1.meMA.Ode4C11.greekmelody	@ltx/en_us_aana/he.h.m6:heHE.ChristosMouDynamis.greekname
ltx/en_us_aana/me.m11.d07:alt1.meMA.Ode4C11.incipit	…
ltx/en_us_aana/me.m11.d07:alt1.meMA.Ode4C11.melody	@ltx/en_us_aana/he.h.m6:heHE.ChristosMouDynamis.name
ltx/en_us_aana/me.m11.d07:alt1.meMA.Ode4C11.mode	@ltx/en_us_aana/miscellanea:misc.Mode6
ltx/en_us_aana/me.m11.d07:alt1.meMA.Ode4C11.ode	@ltx/en_us_aana/miscellanea:misc.Ode4
ltx/en_us_aana/me.m11.d07:alt1.meMA.Ode4C11.text	
ltx/en_us_aana/me.m11.d07:alt1.meMA.Ode4C12.incipit	…
ltx/en_us_aana/me.m11.d07:alt1.meMA.Ode4C12.melody	@ltx/en_us_aana/he.h.m6:heHE.ChristosMouDynamis.name
ltx/en_us_aana/me.m11.d07:alt1.meMA.Ode4C12.mode	@ltx/en_us_aana/miscellanea:misc.Mode6
ltx/en_us_aana/me.m11.d07:alt1.meMA.Ode4C12.ode	@ltx/en_us_aana/miscellanea:misc.Ode4
ltx/en_us_aana/me.m11.d07:alt1.meMA.Ode4C12.text	
ltx/en_us_aana/me.m11.d07:alt1.meMA.Ode4C13.incipit	…
ltx/en_us_aana/me.m11.d07:alt1.meMA.Ode4C13.melody	@ltx/en_us_aana/he.h.m6:heHE.ChristosMouDynamis.name
ltx/en_us_aana/me.m11.d07:alt1.meMA.Ode4C13.mode	@ltx/en_us_aana/miscellanea:misc.Mode6
ltx/en_us_aana/me.m11.d07:alt1.meMA.Ode4C13.ode	@ltx/en_us_aana/miscellanea:misc.Ode4
ltx/en_us_aana/me.m11.d07:alt1.meMA.Ode4C13.text	
ltx/en_us_aana/me.m11.d07:alt1.meMA.Ode4C14.incipit	…
ltx/en_us_aana/me.m11.d07:alt1.meMA.Ode4C14.melody	@ltx/en_us_aana/he.h.m6:heHE.ChristosMouDynamis.name
ltx/en_us_aana/me.m11.d07:alt1.meMA.Ode4C14.mode	@ltx/en_us_aana/miscellanea:misc.Mode6
ltx/en_us_aana/me.m11.d07:alt1.meMA.Ode4C14.ode	@ltx/en_us_aana/miscellanea:misc.Ode4
ltx/en_us_aana/me.m11.d07:alt1.meMA.Ode4C14.text	
ltx/en_us_aana/me.m11.d07:alt1.meMA.Ode4C1T.incipit	…
ltx/en_us_aana/me.m11.d07:alt1.meMA.Ode4C1T.melody	@ltx/en_us_aana/he.h.m6:heHE.ChristosMouDynamis.name
ltx/en_us_aana/me.m11.d07:alt1.meMA.Ode4C1T.mode	@ltx/en_us_aana/miscellanea:misc.Mode6
ltx/en_us_aana/me.m11.d07:alt1.meMA.Ode4C1T.ode	@ltx/en_us_aana/miscellanea:misc.Ode4
ltx/en_us_aana/me.m11.d07:alt1.meMA.Ode4C1T.text	
ltx/en_us_aana/me.m11.d07:alt1.meMA.Ode5C11.greekmelody	@ltx/en_us_aana/he.h.m6:heHE.ToTheioFengeiSou.greekname
ltx/en_us_aana/me.m11.d07:alt1.meMA.Ode5C11.incipit	…
ltx/en_us_aana/me.m11.d07:alt1.meMA.Ode5C11.melody	@ltx/en_us_aana/he.h.m6:heHE.ToTheioFengeiSou.name
ltx/en_us_aana/me.m11.d07:alt1.meMA.Ode5C11.mode	@ltx/en_us_aana/miscellanea:misc.Mode6
ltx/en_us_aana/me.m11.d07:alt1.meMA.Ode5C11.ode	@ltx/en_us_aana/miscellanea:misc.Ode5
ltx/en_us_aana/me.m11.d07:alt1.meMA.Ode5C11.text	
ltx/en_us_aana/me.m11.d07:alt1.meMA.Ode5C12.incipit	…
ltx/en_us_aana/me.m11.d07:alt1.meMA.Ode5C12.melody	@ltx/en_us_aana/he.h.m6:heHE.ToTheioFengeiSou.name
ltx/en_us_aana/me.m11.d07:alt1.meMA.Ode5C12.mode	@ltx/en_us_aana/miscellanea:misc.Mode6
ltx/en_us_aana/me.m11.d07:alt1.meMA.Ode5C12.ode	@ltx/en_us_aana/miscellanea:misc.Ode5
ltx/en_us_aana/me.m11.d07:alt1.meMA.Ode5C12.text	
ltx/en_us_aana/me.m11.d07:alt1.meMA.Ode5C13.incipit	…
ltx/en_us_aana/me.m11.d07:alt1.meMA.Ode5C13.melody	@ltx/en_us_aana/he.h.m6:heHE.ToTheioFengeiSou.name
ltx/en_us_aana/me.m11.d07:alt1.meMA.Ode5C13.mode	@ltx/en_us_aana/miscellanea:misc.Mode6
ltx/en_us_aana/me.m11.d07:alt1.meMA.Ode5C13.ode	@ltx/en_us_aana/miscellanea:misc.Ode5
ltx/en_us_aana/me.m11.d07:alt1.meMA.Ode5C13.text	
ltx/en_us_aana/me.m11.d07:alt1.meMA.Ode5C14.incipit	…
ltx/en_us_aana/me.m11.d07:alt1.meMA.Ode5C14.melody	@ltx/en_us_aana/he.h.m6:heHE.ToTheioFengeiSou.name
ltx/en_us_aana/me.m11.d07:alt1.meMA.Ode5C14.mode	@ltx/en_us_aana/miscellanea:misc.Mode6
ltx/en_us_aana/me.m11.d07:alt1.meMA.Ode5C14.ode	@ltx/en_us_aana/miscellanea:misc.Ode5
ltx/en_us_aana/me.m11.d07:alt1.meMA.Ode5C14.text	
ltx/en_us_aana/me.m11.d07:alt1.meMA.Ode5C1T.incipit	…
ltx/en_us_aana/me.m11.d07:alt1.meMA.Ode5C1T.melody	@ltx/en_us_aana/he.h.m6:heHE.ToTheioFengeiSou.name
ltx/en_us_aana/me.m11.d07:alt1.meMA.Ode5C1T.mode	@ltx/en_us_aana/miscellanea:misc.Mode6
ltx/en_us_aana/me.m11.d07:alt1.meMA.Ode5C1T.ode	@ltx/en_us_aana/miscellanea:misc.Ode5
ltx/en_us_aana/me.m11.d07:alt1.meMA.Ode5C1T.text	
ltx/en_us_aana/me.m11.d07:alt1.meMA.Ode6C11.greekmelody	@ltx/en_us_aana/he.h.m6:heHE.TouViouTinThalassan.greekname
ltx/en_us_aana/me.m11.d07:alt1.meMA.Ode6C11.incipit	…
ltx/en_us_aana/me.m11.d07:alt1.meMA.Ode6C11.melody	@ltx/en_us_aana/he.h.m6:heHE.TouViouTinThalassan.name
ltx/en_us_aana/me.m11.d07:alt1.meMA.Ode6C11.mode	@ltx/en_us_aana/miscellanea:misc.Mode6
ltx/en_us_aana/me.m11.d07:alt1.meMA.Ode6C11.ode	@ltx/en_us_aana/miscellanea:misc.Ode6
ltx/en_us_aana/me.m11.d07:alt1.meMA.Ode6C11.text	
ltx/en_us_aana/me.m11.d07:alt1.meMA.Ode6C12.incipit	…
ltx/en_us_aana/me.m11.d07:alt1.meMA.Ode6C12.melody	@ltx/en_us_aana/he.h.m6:heHE.TouViouTinThalassan.name
ltx/en_us_aana/me.m11.d07:alt1.meMA.Ode6C12.mode	@ltx/en_us_aana/miscellanea:misc.Mode6
ltx/en_us_aana/me.m11.d07:alt1.meMA.Ode6C12.ode	@ltx/en_us_aana/miscellanea:misc.Ode6
ltx/en_us_aana/me.m11.d07:alt1.meMA.Ode6C12.text	
ltx/en_us_aana/me.m11.d07:alt1.meMA.Ode6C13.incipit	…
ltx/en_us_aana/me.m11.d07:alt1.meMA.Ode6C13.melody	@ltx/en_us_aana/he.h.m6:heHE.TouViouTinThalassan.name
ltx/en_us_aana/me.m11.d07:alt1.meMA.Ode6C13.mode	@ltx/en_us_aana/miscellanea:misc.Mode6
ltx/en_us_aana/me.m11.d07:alt1.meMA.Ode6C13.ode	@ltx/en_us_aana/miscellanea:misc.Ode6
ltx/en_us_aana/me.m11.d07:alt1.meMA.Ode6C13.text	
ltx/en_us_aana/me.m11.d07:alt1.meMA.Ode6C14.incipit	…
ltx/en_us_aana/me.m11.d07:alt1.meMA.Ode6C14.melody	@ltx/en_us_aana/he.h.m6:heHE.TouViouTinThalassan.name
ltx/en_us_aana/me.m11.d07:alt1.meMA.Ode6C14.mode	@ltx/en_us_aana/miscellanea:misc.Mode6
ltx/en_us_aana/me.m11.d07:alt1.meMA.Ode6C14.ode	@ltx/en_us_aana/miscellanea:misc.Ode6
ltx/en_us_aana/me.m11.d07:alt1.meMA.Ode6C14.text	
ltx/en_us_aana/me.m11.d07:alt1.meMA.Ode6C1T.incipit	…
ltx/en_us_aana/me.m11.d07:alt1.meMA.Ode6C1T.melody	@ltx/en_us_aana/he.h.m6:heHE.TouViouTinThalassan.name
ltx/en_us_aana/me.m11.d07:alt1.meMA.Ode6C1T.mode	@ltx/en_us_aana/miscellanea:misc.Mode6
ltx/en_us_aana/me.m11.d07:alt1.meMA.Ode6C1T.ode	@ltx/en_us_aana/miscellanea:misc.Ode6
ltx/en_us_aana/me.m11.d07:alt1.meMA.Ode6C1T.text	
ltx/en_us_aana/me.m11.d07:alt1.meMA.Ode7C11.greekmelody	@ltx/en_us_aana/he.h.m6:heHE.DrosovolonMenTinKaminon.greekname
ltx/en_us_aana/me.m11.d07:alt1.meMA.Ode7C11.incipit	…
ltx/en_us_aana/me.m11.d07:alt1.meMA.Ode7C11.melody	@ltx/en_us_aana/he.h.m6:heHE.DrosovolonMenTinKaminon.name
ltx/en_us_aana/me.m11.d07:alt1.meMA.Ode7C11.mode	@ltx/en_us_aana/miscellanea:misc.Mode6
ltx/en_us_aana/me.m11.d07:alt1.meMA.Ode7C11.ode	@ltx/en_us_aana/miscellanea:misc.Ode7
ltx/en_us_aana/me.m11.d07:alt1.meMA.Ode7C11.text	
ltx/en_us_aana/me.m11.d07:alt1.meMA.Ode7C12.incipit	…
ltx/en_us_aana/me.m11.d07:alt1.meMA.Ode7C12.melody	@ltx/en_us_aana/he.h.m6:heHE.DrosovolonMenTinKaminon.name
ltx/en_us_aana/me.m11.d07:alt1.meMA.Ode7C12.mode	@ltx/en_us_aana/miscellanea:misc.Mode6
ltx/en_us_aana/me.m11.d07:alt1.meMA.Ode7C12.ode	@ltx/en_us_aana/miscellanea:misc.Ode7
ltx/en_us_aana/me.m11.d07:alt1.meMA.Ode7C12.text	
ltx/en_us_aana/me.m11.d07:alt1.meMA.Ode7C13.incipit	…
ltx/en_us_aana/me.m11.d07:alt1.meMA.Ode7C13.melody	@ltx/en_us_aana/he.h.m6:heHE.DrosovolonMenTinKaminon.name
ltx/en_us_aana/me.m11.d07:alt1.meMA.Ode7C13.mode	@ltx/en_us_aana/miscellanea:misc.Mode6
ltx/en_us_aana/me.m11.d07:alt1.meMA.Ode7C13.ode	@ltx/en_us_aana/miscellanea:misc.Ode7
ltx/en_us_aana/me.m11.d07:alt1.meMA.Ode7C13.text	
ltx/en_us_aana/me.m11.d07:alt1.meMA.Ode7C14.incipit	…
ltx/en_us_aana/me.m11.d07:alt1.meMA.Ode7C14.melody	@ltx/en_us_aana/he.h.m6:heHE.DrosovolonMenTinKaminon.name
ltx/en_us_aana/me.m11.d07:alt1.meMA.Ode7C14.mode	@ltx/en_us_aana/miscellanea:misc.Mode6
ltx/en_us_aana/me.m11.d07:alt1.meMA.Ode7C14.ode	@ltx/en_us_aana/miscellanea:misc.Ode7
ltx/en_us_aana/me.m11.d07:alt1.meMA.Ode7C14.text	
ltx/en_us_aana/me.m11.d07:alt1.meMA.Ode7C1T.incipit	…
ltx/en_us_aana/me.m11.d07:alt1.meMA.Ode7C1T.melody	@ltx/en_us_aana/he.h.m6:heHE.DrosovolonMenTinKaminon.name
ltx/en_us_aana/me.m11.d07:alt1.meMA.Ode7C1T.mode	@ltx/en_us_aana/miscellanea:misc.Mode6
ltx/en_us_aana/me.m11.d07:alt1.meMA.Ode7C1T.ode	@ltx/en_us_aana/miscellanea:misc.Ode7
ltx/en_us_aana/me.m11.d07:alt1.meMA.Ode7C1T.text	
ltx/en_us_aana/me.m11.d07:alt1.meMA.Ode8C11.greekmelody	@ltx/en_us_aana/he.h.m6:heHE.EkFlogosToisOsiois.greekname
ltx/en_us_aana/me.m11.d07:alt1.meMA.Ode8C11.incipit	…
ltx/en_us_aana/me.m11.d07:alt1.meMA.Ode8C11.melody	@ltx/en_us_aana/he.h.m6:heHE.EkFlogosToisOsiois.name
ltx/en_us_aana/me.m11.d07:alt1.meMA.Ode8C11.mode	@ltx/en_us_aana/miscellanea:misc.Mode6
ltx/en_us_aana/me.m11.d07:alt1.meMA.Ode8C11.ode	@ltx/en_us_aana/miscellanea:misc.Ode8
ltx/en_us_aana/me.m11.d07:alt1.meMA.Ode8C11.text	
ltx/en_us_aana/me.m11.d07:alt1.meMA.Ode8C12.incipit	…
ltx/en_us_aana/me.m11.d07:alt1.meMA.Ode8C12.melody	@ltx/en_us_aana/he.h.m6:heHE.EkFlogosToisOsiois.name
ltx/en_us_aana/me.m11.d07:alt1.meMA.Ode8C12.mode	@ltx/en_us_aana/miscellanea:misc.Mode6
ltx/en_us_aana/me.m11.d07:alt1.meMA.Ode8C12.ode	@ltx/en_us_aana/miscellanea:misc.Ode8
ltx/en_us_aana/me.m11.d07:alt1.meMA.Ode8C12.text	
ltx/en_us_aana/me.m11.d07:alt1.meMA.Ode8C13.incipit	…
ltx/en_us_aana/me.m11.d07:alt1.meMA.Ode8C13.melody	@ltx/en_us_aana/he.h.m6:heHE.EkFlogosToisOsiois.name
ltx/en_us_aana/me.m11.d07:alt1.meMA.Ode8C13.mode	@ltx/en_us_aana/miscellanea:misc.Mode6
ltx/en_us_aana/me.m11.d07:alt1.meMA.Ode8C13.ode	@ltx/en_us_aana/miscellanea:misc.Ode8
ltx/en_us_aana/me.m11.d07:alt1.meMA.Ode8C13.text	
ltx/en_us_aana/me.m11.d07:alt1.meMA.Ode8C14.incipit	…
ltx/en_us_aana/me.m11.d07:alt1.meMA.Ode8C14.melody	@ltx/en_us_aana/he.h.m6:heHE.EkFlogosToisOsiois.name
ltx/en_us_aana/me.m11.d07:alt1.meMA.Ode8C14.mode	@ltx/en_us_aana/miscellanea:misc.Mode6
ltx/en_us_aana/me.m11.d07:alt1.meMA.Ode8C14.ode	@ltx/en_us_aana/miscellanea:misc.Ode8
ltx/en_us_aana/me.m11.d07:alt1.meMA.Ode8C14.text	
ltx/en_us_aana/me.m11.d07:alt1.meMA.Ode8C1T.incipit	…
ltx/en_us_aana/me.m11.d07:alt1.meMA.Ode8C1T.melody	@ltx/en_us_aana/he.h.m6:heHE.EkFlogosToisOsiois.name
ltx/en_us_aana/me.m11.d07:alt1.meMA.Ode8C1T.mode	@ltx/en_us_aana/miscellanea:misc.Mode6
ltx/en_us_aana/me.m11.d07:alt1.meMA.Ode8C1T.ode	@ltx/en_us_aana/miscellanea:misc.Ode8
ltx/en_us_aana/me.m11.d07:alt1.meMA.Ode8C1T.text	
ltx/en_us_aana/me.m11.d07:alt1.meMA.Ode9C11.greekmelody	@ltx/en_us_aana/he.h.m6:heHE.TheonAnthropois.greekname
ltx/en_us_aana/me.m11.d07:alt1.meMA.Ode9C11.incipit	…
ltx/en_us_aana/me.m11.d07:alt1.meMA.Ode9C11.melody	@ltx/en_us_aana/he.h.m6:heHE.TheonAnthropois.name
ltx/en_us_aana/me.m11.d07:alt1.meMA.Ode9C11.mode	@ltx/en_us_aana/miscellanea:misc.Mode6
ltx/en_us_aana/me.m11.d07:alt1.meMA.Ode9C11.ode	@ltx/en_us_aana/miscellanea:misc.Ode9
ltx/en_us_aana/me.m11.d07:alt1.meMA.Ode9C11.text	
ltx/en_us_aana/me.m11.d07:alt1.meMA.Ode9C12.incipit	…
ltx/en_us_aana/me.m11.d07:alt1.meMA.Ode9C12.melody	@ltx/en_us_aana/he.h.m6:heHE.TheonAnthropois.name
ltx/en_us_aana/me.m11.d07:alt1.meMA.Ode9C12.mode	@ltx/en_us_aana/miscellanea:misc.Mode6
ltx/en_us_aana/me.m11.d07:alt1.meMA.Ode9C12.ode	@ltx/en_us_aana/miscellanea:misc.Ode9
ltx/en_us_aana/me.m11.d07:alt1.meMA.Ode9C12.text	
ltx/en_us_aana/me.m11.d07:alt1.meMA.Ode9C13.incipit	…
ltx/en_us_aana/me.m11.d07:alt1.meMA.Ode9C13.melody	@ltx/en_us_aana/he.h.m6:heHE.TheonAnthropois.name
ltx/en_us_aana/me.m11.d07:alt1.meMA.Ode9C13.mode	@ltx/en_us_aana/miscellanea:misc.Mode6
ltx/en_us_aana/me.m11.d07:alt1.meMA.Ode9C13.ode	@ltx/en_us_aana/miscellanea:misc.Ode9
ltx/en_us_aana/me.m11.d07:alt1.meMA.Ode9C13.text	
ltx/en_us_aana/me.m11.d07:alt1.meMA.Ode9C14.incipit	…
ltx/en_us_aana/me.m11.d07:alt1.meMA.Ode9C14.melody	@ltx/en_us_aana/he.h.m6:heHE.TheonAnthropois.name
ltx/en_us_aana/me.m11.d07:alt1.meMA.Ode9C14.mode	@ltx/en_us_aana/miscellanea:misc.Mode6
ltx/en_us_aana/me.m11.d07:alt1.meMA.Ode9C14.ode	@ltx/en_us_aana/miscellanea:misc.Ode9
ltx/en_us_aana/me.m11.d07:alt1.meMA.Ode9C14.text	
ltx/en_us_aana/me.m11.d07:alt1.meMA.Ode9C1T.incipit	…
ltx/en_us_aana/me.m11.d07:alt1.meMA.Ode9C1T.melody	@ltx/en_us_aana/he.h.m6:heHE.TheonAnthropois.name
ltx/en_us_aana/me.m11.d07:alt1.meMA.Ode9C1T.mode	@ltx/en_us_aana/miscellanea:misc.Mode6
ltx/en_us_aana/me.m11.d07:alt1.meMA.Ode9C1T.ode	@ltx/en_us_aana/miscellanea:misc.Ode9
ltx/en_us_aana/me.m11.d07:alt1.meMA.Ode9C1T.text	
ltx/en_us_aana/me.m11.d07:alt1.meMA.Oikos1.text	Through laziness I have fallen away and I sleep unto death, but good shepherd, raise me up and calm the passions that wickedly torment me, O blessed one, that I may rise and hymn thy bright festival; for the Master of the universe has glorified this festival of his faithful servant and wise teacher, the friend and preserver and servant of his traditions which thou didst maintain. O pure unction, ceaselessly intercede for us who cry aloud to thee, saying: Rejoice, O Father Raphael!
ltx/en_us_aana/me.m11.d07:alt1.meMA.PostGospelBoth.incipit	…
ltx/en_us_aana/me.m11.d07:alt1.meMA.PostGospelBoth.melody	
ltx/en_us_aana/me.m11.d07:alt1.meMA.PostGospelBoth.mode	@ltx/en_us_aana/miscellanea:misc.Mode2
ltx/en_us_aana/me.m11.d07:alt1.meMA.PostGospelBoth.text	
ltx/en_us_aana/me.m11.d07:alt1.meMA.PostGospelGlory.incipit	…
ltx/en_us_aana/me.m11.d07:alt1.meMA.PostGospelGlory.melody	
ltx/en_us_aana/me.m11.d07:alt1.meMA.PostGospelGlory.mode	@ltx/en_us_aana/miscellanea:misc.Mode2
ltx/en_us_aana/me.m11.d07:alt1.meMA.PostGospelGlory.text	
ltx/en_us_aana/me.m11.d07:alt1.meMA.PostGospelIdiomelon.incipit	Rising in distant Syria, ascending…
ltx/en_us_aana/me.m11.d07:alt1.meMA.PostGospelIdiomelon.melody	
ltx/en_us_aana/me.m11.d07:alt1.meMA.PostGospelIdiomelon.mode	@ltx/en_us_aana/miscellanea:misc.Mode5
ltx/en_us_aana/me.m11.d07:alt1.meMA.PostGospelIdiomelon.text	Rising in distant Syria, ascending through the land of Russia, a bright star hath appeared over the New World. Shining with divine knowledge and radiating the love of Christ, the luminous Raphael overcometh every deception of the enemy. Now crowned among the saints, he intercedeth for us before the throne of God.
ltx/en_us_aana/me.m11.d07:alt1.meMA.Synaxarion.commemoration.text	On the first Saturday in November, we commemorate our father among the Saints, Raphael Hawaweeny, Bishop of Brooklyn, “good shepherd of the lost sheep in America.”
ltx/en_us_aana/me.m11.d07:alt1.meVE.Apolytikion1.greekmelody	@ltx/en_us_aana/he.a.m3:heAU.TheiasPisteos.greekname
ltx/en_us_aana/me.m11.d07:alt1.meVE.Apolytikion1.incipit	Thou art champion of the…
ltx/en_us_aana/me.m11.d07:alt1.meVE.Apolytikion1.melody	@ltx/en_us_aana/he.a.m3:heAU.TheiasPisteos.name
ltx/en_us_aana/me.m11.d07:alt1.meVE.Apolytikion1.mode	@ltx/en_us_aana/miscellanea:misc.Mode3
ltx/en_us_aana/me.m11.d07:alt1.meVE.Apolytikion1.text	Thou art champion of the one true faith, * consolation of the persecuted, * father of the orphans, friend of the destitute, * peacemaker and good shepherd, and seeker of the lost, * O Father Raphael, the joy of the Orthodox. * Son of Antioch and boast of America, beseech * Christ God for us and for all those who honor thee.
ltx/en_us_aana/me.m11.d07:alt1.meVE.AposGlory.incipit	Today a splendid festival dawns…
ltx/en_us_aana/me.m11.d07:alt1.meVE.AposGlory.melody	
ltx/en_us_aana/me.m11.d07:alt1.meVE.AposGlory.mode	@ltx/en_us_aana/miscellanea:misc.Mode4
ltx/en_us_aana/me.m11.d07:alt1.meVE.AposGlory.text	Today a splendid festival dawns upon the whole world. Today the lands of Russia and ancient Syria celebrate the memory of their righteous son Raphael, apostle to America, good shepherd of the lost sheep. Wherefore, let us celebrate this festive day and cry out unto him, saying: Rejoice, O new Moses, who didst lead thy people out of the wilderness into the Promised Land! Rejoice, O new Elias, who hast placed within the holy Church a double portion of thy spirit! Rejoice, O new Ezra, thou builder of the Temple of God! Rejoice, O new Apostle of Christ our God, the fisher of men! As thou hast boldness with the Angels before the throne of God, never cease to intercede with Christ God for thy holy flock.
ltx/en_us_aana/me.m11.d07:alt1.meVE.Aposticha1.greekmelody	@ltx/en_us_aana/he.a.m2:heAU.OikosTouEfratha.greekname
ltx/en_us_aana/me.m11.d07:alt1.meVE.Aposticha1.incipit	O Father Raphael, * of…
ltx/en_us_aana/me.m11.d07:alt1.meVE.Aposticha1.melody	@ltx/en_us_aana/he.a.m2:heAU.OikosTouEfratha.name
ltx/en_us_aana/me.m11.d07:alt1.meVE.Aposticha1.mode	@ltx/en_us_aana/miscellanea:misc.Mode2
ltx/en_us_aana/me.m11.d07:alt1.meVE.Aposticha1.text	O Father Raphael, * of thy travail who can tell? * Thy hardships who can number? * O father to all orphans, pray that the Church be kept in peace.
ltx/en_us_aana/me.m11.d07:alt1.meVE.Aposticha2.incipit	O holy Raphael, * of…
ltx/en_us_aana/me.m11.d07:alt1.meVE.Aposticha2.melody	@ltx/en_us_aana/he.a.m2:heAU.OikosTouEfratha.name
ltx/en_us_aana/me.m11.d07:alt1.meVE.Aposticha2.mode	@ltx/en_us_aana/miscellanea:misc.Mode2
ltx/en_us_aana/me.m11.d07:alt1.meVE.Aposticha2.text	O holy Raphael, * of thy distress who can tell? * Thy noble deeds who can recount? * Friend of the poor and needy, for our salvation intercede.
ltx/en_us_aana/me.m11.d07:alt1.meVE.Aposticha3.incipit	O glorious Raphael, * good…
ltx/en_us_aana/me.m11.d07:alt1.meVE.Aposticha3.melody	@ltx/en_us_aana/he.a.m2:heAU.OikosTouEfratha.name
ltx/en_us_aana/me.m11.d07:alt1.meVE.Aposticha3.mode	@ltx/en_us_aana/miscellanea:misc.Mode2
ltx/en_us_aana/me.m11.d07:alt1.meVE.Aposticha3.text	O glorious Raphael, * good shepherd to the lost sheep, * great light that shone from Antioch, * America’s boast, pray Christ, that He be greatly merciful.
ltx/en_us_aana/me.m11.d07:alt1.meVE.LityGlory.incipit	Enlightened by the memory of…
ltx/en_us_aana/me.m11.d07:alt1.meVE.LityGlory.melody	
ltx/en_us_aana/me.m11.d07:alt1.meVE.LityGlory.mode	@ltx/en_us_aana/miscellanea:misc.Mode5
ltx/en_us_aana/me.m11.d07:alt1.meVE.LityGlory.text	Enlightened by the memory of holy Raphael, we celebrate his sacred feast. For, having been made divinely wise, he draweth us all into Christ’s net, as he entreats Great Mercy for our souls.
ltx/en_us_aana/me.m11.d07:alt1.meVE.SticGlory.incipit	Thy children praise thee, O…
ltx/en_us_aana/me.m11.d07:alt1.meVE.SticGlory.melody	
ltx/en_us_aana/me.m11.d07:alt1.meVE.SticGlory.mode	@ltx/en_us_aana/miscellanea:misc.Mode6
ltx/en_us_aana/me.m11.d07:alt1.meVE.SticGlory.text	Thy children praise thee, O equal-to-the-Apostles, wise hierarch of the Church of God in America, uniter of the Orthodox world, proclaimer of the Truth, defender of the oppressed, and the guardian of the Faith, O our father and hierarch Raphael. Among the highborn thou didst behave with dignity, and among the lowly thou didst show thyself lowly, having in thyself the gentleness of Christ. Thou wast a refuge from both darkness and anguish, offering direction and never overlooking a call for help, and never showing respect of persons. Thou didst exhaust thyself on behalf of thy flock, giving to thyself no repose and caring not for the flesh, thinking only of thy people’s needs. As thou now dost stand with the Angels and Archangels, O holy Raphael, never cease to intercede with Christ God for the welfare of the Church and the salvation of our souls.
ltx/en_us_aana/me.m11.d07:alt1.meVE.Stichera01.greekmelody	@ltx/en_us_aana/he.a.m1:heAU.OTouParadoxouThavmatos.greekname
ltx/en_us_aana/me.m11.d07:alt1.meVE.Stichera01.incipit	Blessed, holy Father Raphael, *…
ltx/en_us_aana/me.m11.d07:alt1.meVE.Stichera01.melody	@ltx/en_us_aana/he.a.m1:heAU.OTouParadoxouThavmatos.name
ltx/en_us_aana/me.m11.d07:alt1.meVE.Stichera01.mode	@ltx/en_us_aana/miscellanea:misc.Mode1
ltx/en_us_aana/me.m11.d07:alt1.meVE.Stichera01.text	Blessed, holy Father Raphael, * thou made incarnate the love * of Christ Jesus from thy youth, * O son of the Church of Antioch sent to America. * Concerned not with thine own ease, * thou wast Apostle to the lost sheep of Syria. * From Russia thou didst arrive, * trav’ling from east to the west and from north to south, * and didst give thyself no respite, * but didst labor day and night. * As thou hast boldness with Christ God, * intercede with Him to save our souls.
ltx/en_us_aana/me.m11.d07:alt1.meVE.Stichera02.incipit	Thine affairs thou truly didst…
ltx/en_us_aana/me.m11.d07:alt1.meVE.Stichera02.melody	@ltx/en_us_aana/he.a.m1:heAU.OTouParadoxouThavmatos.name
ltx/en_us_aana/me.m11.d07:alt1.meVE.Stichera02.mode	@ltx/en_us_aana/miscellanea:misc.Mode1
ltx/en_us_aana/me.m11.d07:alt1.meVE.Stichera02.text	Thine affairs thou truly didst conduct * like a good shepherd, O Saint, * traveling by land and sea, * traversing mountains and plains, thou roaming near and far * seeking the Lord’s lost sheep. * To bind their wounds with thy fatherly, Christ-like love, * and carry them in thine arms, * and to the holy flock of Christ reunite them all, * thou didst bear the heat and toil of day, * and the chill and length of night. * As thou hast boldness with Christ God, * intercede with Him to save our souls.
ltx/en_us_aana/me.m11.d07:alt1.meVE.Stichera03.incipit	Orthodox believers found in thee…
ltx/en_us_aana/me.m11.d07:alt1.meVE.Stichera03.melody	@ltx/en_us_aana/he.a.m1:heAU.OTouParadoxouThavmatos.name
ltx/en_us_aana/me.m11.d07:alt1.meVE.Stichera03.mode	@ltx/en_us_aana/miscellanea:misc.Mode1
ltx/en_us_aana/me.m11.d07:alt1.meVE.Stichera03.text	Orthodox believers found in thee, * O good shepherd Raphael, * a defense against their foes, * a sustenance for their souls, the lost’s own guiding star. * No hardships kept thou in sight, * fixing thine eyes on the prize and high call of God. * Thou counted all things as naught, * and suffered all loss that thou might win Christ our God. * Laying down thy life for Christ’s sheep, * thou art surely glorified. * As thou hast boldness with Christ God, * intercede with Him to save our souls.
