ltx/en_uk_ware/tr.d032:trCO.header	
ltx/en_uk_ware/tr.d032:trDA.commemoration.full	
ltx/en_uk_ware/tr.d032:trDA.commemoration.short	
ltx/en_uk_ware/tr.d032:trDA.insert1	
ltx/en_uk_ware/tr.d032:trDA.insert2	
ltx/en_uk_ware/tr.d032:trDA.note	
ltx/en_uk_ware/tr.d032:trDA.title	
ltx/en_uk_ware/tr.d032:trHO.commemorations	
ltx/en_uk_ware/tr.d032:trHO.daytitle	
ltx/en_uk_ware/tr.d032:trHO.description1	
ltx/en_uk_ware/tr.d032:trHO.description2	
ltx/en_uk_ware/tr.d032:trHO.note1	
ltx/en_uk_ware/tr.d032:trHO.note2	
ltx/en_uk_ware/tr.d032:trMA.AposIdiomelon1.incipit	Through Thy Cross, O Lord…
ltx/en_uk_ware/tr.d032:trMA.AposIdiomelon1.melody	@ltx/en_uk_ware/miscellanea:misc.Idiomelon
ltx/en_uk_ware/tr.d032:trMA.AposIdiomelon1.mode	@ltx/en_uk_ware/miscellanea:misc.Mode7
ltx/en_uk_ware/tr.d032:trMA.AposIdiomelon1.text	Through Thy Cross, O Lord, Thou hast destroyed the death that came into the world when Adam ate from the forbidden tree in Paradise. Through this present Fast do thou deliver us from every pleasure that corrupts the soul; and, we entreat Thee, count us worthy to labour for the Food which endures unto eternal life, that we may obtain crowns of everlasting joy, which Thou hast prepared for those who truly fast.
ltx/en_uk_ware/tr.d032:trMA.AposMartyric.greekmelody	@ltx/en_uk_ware/he.a.m7:heAU.OukEtiKolyometha.greekname
ltx/en_uk_ware/tr.d032:trMA.AposMartyric.incipit	O victorious martyrs worthy of…
ltx/en_uk_ware/tr.d032:trMA.AposMartyric.melody	@ltx/en_uk_ware/he.a.m7:heAU.OukEtiKolyometha.name
ltx/en_uk_ware/tr.d032:trMA.AposMartyric.mode	@ltx/en_uk_ware/miscellanea:misc.Mode7
ltx/en_uk_ware/tr.d032:trMA.AposMartyric.text	O victorious martyrs worthy of all praise, shining as the lights of heaven upon the inhabited earth, ye cry aloud to Christ: O Lord, glory to Thee.
ltx/en_uk_ware/tr.d032:trMA.AposTheotokion.greekmelody	@ltx/en_uk_ware/he.a.m7:heAU.OukEtiKolyometha.greekname
ltx/en_uk_ware/tr.d032:trMA.AposTheotokion.incipit	When she saw Thee nailed…
ltx/en_uk_ware/tr.d032:trMA.AposTheotokion.melody	@ltx/en_uk_ware/he.a.m7:heAU.OukEtiKolyometha.name
ltx/en_uk_ware/tr.d032:trMA.AposTheotokion.mode	@ltx/en_uk_ware/miscellanea:misc.Mode7
ltx/en_uk_ware/tr.d032:trMA.AposTheotokion.text	When she saw Thee nailed of Thine own will upon the Cross, the all­ pure Virgin lamented and sang the praises of Thy power.
ltx/en_uk_ware/tr.d032:trMA.C1.poet	@ltx/en_uk_ware/poets:po.Iosif
ltx/en_uk_ware/tr.d032:trMA.C2.poet	@ltx/en_uk_ware/poets:po.Theodorou
ltx/en_uk_ware/tr.d032:trMA.Kathisma21.greekmelody	@ltx/en_uk_ware/he.a.m1:heAU.TonTafonSouSotir.greekname
ltx/en_uk_ware/tr.d032:trMA.Kathisma21.incipit	Stretched and slain upon the…
ltx/en_uk_ware/tr.d032:trMA.Kathisma21.melody	@ltx/en_uk_ware/he.a.m1:heAU.TonTafonSouSotir.name
ltx/en_uk_ware/tr.d032:trMA.Kathisma21.mode	@ltx/en_uk_ware/miscellanea:misc.Mode1
ltx/en_uk_ware/tr.d032:trMA.Kathisma21.text	Stretched and slain upon the Cross, O Christ, Thou hast slain the serpent our enemy, the source of evil, and those killed by his sting Thou hast restored to life. Therefore I entreat Thee, Saviour: Give life to my deadened soul, for to Thee I turn in prayer and fasting.
ltx/en_uk_ware/tr.d032:trMA.Kathisma22.greekmelody	@ltx/en_uk_ware/he.a.m1:heAU.TonTafonSouSotir.greekname
ltx/en_uk_ware/tr.d032:trMA.Kathisma22.incipit	When the Ewe saw Thee…
ltx/en_uk_ware/tr.d032:trMA.Kathisma22.melody	@ltx/en_uk_ware/he.a.m1:heAU.TonTafonSouSotir.name
ltx/en_uk_ware/tr.d032:trMA.Kathisma22.mode	@ltx/en_uk_ware/miscellanea:misc.Mode1
ltx/en_uk_ware/tr.d032:trMA.Kathisma22.text	When the Ewe saw Thee her Lamb, O Christ, hanging upon the Cross between two malefactors, she cried aloud weeping and lamenting bitterly: ‘O dearest Child, what is this wonder that I see?’ ‘O most pure Mother,’ so Thou hast replied, ‘this same wonder shall bring life to all the world.’
ltx/en_uk_ware/tr.d032:trMA.Kathisma31.greekmelody	@ltx/en_uk_ware/he.a.m3:heAU.TinOraiotita.greekname
ltx/en_uk_ware/tr.d032:trMA.Kathisma31.incipit	As we pass through the…
ltx/en_uk_ware/tr.d032:trMA.Kathisma31.melody	@ltx/en_uk_ware/he.a.m3:heAU.TinOraiotita.name
ltx/en_uk_ware/tr.d032:trMA.Kathisma31.mode	@ltx/en_uk_ware/miscellanea:misc.Mode3
ltx/en_uk_ware/tr.d032:trMA.Kathisma31.text	As we pass through the solemn time of abstinence, let us blow the trumpet and loudly cry: Through the Fast life has blossomed in the world, and the death that comes from self-indulgence is destroyed. By the power of Thy Cross, O Christ the Word, guard Thy servants in the Fast.
ltx/en_uk_ware/tr.d032:trMA.Kathisma32.greekmelody	@ltx/en_uk_ware/he.a.m3:heAU.TinOraiotita.greekname
ltx/en_uk_ware/tr.d032:trMA.Kathisma32.incipit	@ltx/en_uk_ware/me.m06.d16:meMA.Ode3KathismaSt.incipit
ltx/en_uk_ware/tr.d032:trMA.Kathisma32.melody	@ltx/en_uk_ware/he.a.m3:heAU.TinOraiotita.name
ltx/en_uk_ware/tr.d032:trMA.Kathisma32.mode	@ltx/en_uk_ware/miscellanea:misc.Mode3
ltx/en_uk_ware/tr.d032:trMA.Kathisma32.text	@ltx/en_uk_ware/me.m06.d16:meMA.Ode3KathismaSt.text
ltx/en_uk_ware/tr.d032:trMA.Ode3C11.greekmelody	@ltx/en_uk_ware/he.h.m1:heHE.StereothitoIKardiaMou.greekname
ltx/en_uk_ware/tr.d032:trMA.Ode3C11.incipit	O Word of God, supreme…
ltx/en_uk_ware/tr.d032:trMA.Ode3C11.melody	@ltx/en_uk_ware/he.h.m1:heHE.StereothitoIKardiaMou.name
ltx/en_uk_ware/tr.d032:trMA.Ode3C11.mode	@ltx/en_uk_ware/miscellanea:misc.Mode1
ltx/en_uk_ware/tr.d032:trMA.Ode3C11.ode	@ltx/en_uk_ware/miscellanea:misc.Ode3
ltx/en_uk_ware/tr.d032:trMA.Ode3C11.text	O Word of God, supreme in love, Thou hast stretched out Thine hands upon the Cross, and in Thy mercy and compassion Thou hast slain the sin of Adam, who of old stretched out his hand to the tree of knowledge.
ltx/en_uk_ware/tr.d032:trMA.Ode3C12.incipit	Firmly establish my understanding, for…
ltx/en_uk_ware/tr.d032:trMA.Ode3C12.melody	@ltx/en_uk_ware/he.h.m1:heHE.StereothitoIKardiaMou.name
ltx/en_uk_ware/tr.d032:trMA.Ode3C12.mode	@ltx/en_uk_ware/miscellanea:misc.Mode1
ltx/en_uk_ware/tr.d032:trMA.Ode3C12.ode	@ltx/en_uk_ware/miscellanea:misc.Ode3
ltx/en_uk_ware/tr.d032:trMA.Ode3C12.text	Firmly establish my understanding, for it has been shaken through the envy of the serpent. By Thy Passion subdue the assaults of the passions, for through Thy sufferings Thou hast granted to the faithful freedom from the passions.
ltx/en_uk_ware/tr.d032:trMA.Ode3C13.incipit	The grace of the Fast…
ltx/en_uk_ware/tr.d032:trMA.Ode3C13.melody	@ltx/en_uk_ware/he.h.m1:heHE.StereothitoIKardiaMou.name
ltx/en_uk_ware/tr.d032:trMA.Ode3C13.mode	@ltx/en_uk_ware/miscellanea:misc.Mode1
ltx/en_uk_ware/tr.d032:trMA.Ode3C13.ode	@ltx/en_uk_ware/miscellanea:misc.Ode3
ltx/en_uk_ware/tr.d032:trMA.Ode3C13.text	The grace of the Fast shines upon us, driving out the darkness of sinful self-indulgence. Behold, now is the accepted time and the day of salvation. Let us bring forth fruits of repentance and we shall live.
ltx/en_uk_ware/tr.d032:trMA.Ode3C1T.incipit	I have fallen from the…
ltx/en_uk_ware/tr.d032:trMA.Ode3C1T.melody	@ltx/en_uk_ware/he.h.m1:heHE.StereothitoIKardiaMou.name
ltx/en_uk_ware/tr.d032:trMA.Ode3C1T.mode	@ltx/en_uk_ware/miscellanea:misc.Mode1
ltx/en_uk_ware/tr.d032:trMA.Ode3C1T.ode	@ltx/en_uk_ware/miscellanea:misc.Ode3
ltx/en_uk_ware/tr.d032:trMA.Ode3C1T.text	I have fallen from the cliff of lust, and through my grievous sins I have plunged into the abyss. O pure Virgin, restoration of the fallen, raise me up and lead me back to life.
ltx/en_uk_ware/tr.d032:trMA.Ode3C21.greekmelody	@ltx/en_uk_ware/he.h.m3:heHE.StereosonKyrie.greekname
ltx/en_uk_ware/tr.d032:trMA.Ode3C21.incipit	By Thy Cross, O Lord…
ltx/en_uk_ware/tr.d032:trMA.Ode3C21.melody	@ltx/en_uk_ware/he.h.m3:heHE.StereosonKyrie.name
ltx/en_uk_ware/tr.d032:trMA.Ode3C21.mode	@ltx/en_uk_ware/miscellanea:misc.Mode3
ltx/en_uk_ware/tr.d032:trMA.Ode3C21.ode	@ltx/en_uk_ware/miscellanea:misc.Ode3
ltx/en_uk_ware/tr.d032:trMA.Ode3C21.text	By Thy Cross, O Lord, firmly establish our hearts, that we may not turn away from Thee to evil thoughts or wicked acts.
ltx/en_uk_ware/tr.d032:trMA.Ode3C22.incipit	When they beheld Thy Passion…
ltx/en_uk_ware/tr.d032:trMA.Ode3C22.melody	@ltx/en_uk_ware/he.h.m3:heHE.StereosonKyrie.name
ltx/en_uk_ware/tr.d032:trMA.Ode3C22.mode	@ltx/en_uk_ware/miscellanea:misc.Mode3
ltx/en_uk_ware/tr.d032:trMA.Ode3C22.ode	@ltx/en_uk_ware/miscellanea:misc.Ode3
ltx/en_uk_ware/tr.d032:trMA.Ode3C22.text	When they beheld Thy Passion, O Master, heaven and earth were altered visibly, and bore witness that Thou art in truth the King of all.
ltx/en_uk_ware/tr.d032:trMA.Ode3C2A1.incipit	I venerate and praise Thy…
ltx/en_uk_ware/tr.d032:trMA.Ode3C2A1.melody	@ltx/en_uk_ware/he.h.m3:heHE.StereosonKyrie.name
ltx/en_uk_ware/tr.d032:trMA.Ode3C2A1.mode	@ltx/en_uk_ware/miscellanea:misc.Mode3
ltx/en_uk_ware/tr.d032:trMA.Ode3C2A1.ode	@ltx/en_uk_ware/miscellanea:misc.Ode3
ltx/en_uk_ware/tr.d032:trMA.Ode3C2A1.text	I venerate and praise Thy scarlet robe, O Jesus, the nails and the Cross, the sponge and the lance, that have given life to all the world.
ltx/en_uk_ware/tr.d032:trMA.Ode3C2H.greekmelody	@ltx/en_uk_ware/he.h.m3:heHE.StereosonKyrie.greekname
ltx/en_uk_ware/tr.d032:trMA.Ode3C2H.incipit	@ltx/en_uk_ware/he.h.m3:heHE.StereosonKyrie.incipit
ltx/en_uk_ware/tr.d032:trMA.Ode3C2H.melody	@ltx/en_uk_ware/he.h.m3:heHE.StereosonKyrie.melody
ltx/en_uk_ware/tr.d032:trMA.Ode3C2H.mode	@ltx/en_uk_ware/miscellanea:misc.Mode3
ltx/en_uk_ware/tr.d032:trMA.Ode3C2H.ode	@ltx/en_uk_ware/miscellanea:misc.Ode3
ltx/en_uk_ware/tr.d032:trMA.Ode3C2H.text	@ltx/en_uk_ware/he.h.m3:heHE.StereosonKyrie.text
ltx/en_uk_ware/tr.d032:trMA.Ode3C2T.incipit	O Mother of God who…
ltx/en_uk_ware/tr.d032:trMA.Ode3C2T.melody	@ltx/en_uk_ware/he.h.m3:heHE.StereosonKyrie.name
ltx/en_uk_ware/tr.d032:trMA.Ode3C2T.mode	@ltx/en_uk_ware/miscellanea:misc.Mode3
ltx/en_uk_ware/tr.d032:trMA.Ode3C2T.ode	@ltx/en_uk_ware/miscellanea:misc.Ode3
ltx/en_uk_ware/tr.d032:trMA.Ode3C2T.text	O Mother of God who hast not known man, thou alone hast borne God, yet hast not lost the incorruption of thy pure virginity; but thou hast remained inviolate, as thou wast before childbirth.
ltx/en_uk_ware/tr.d032:trMA.Ode3C2Tr.incipit	O Most Holy Trinity, equal…
ltx/en_uk_ware/tr.d032:trMA.Ode3C2Tr.melody	@ltx/en_uk_ware/he.h.m3:heHE.StereosonKyrie.name
ltx/en_uk_ware/tr.d032:trMA.Ode3C2Tr.mode	@ltx/en_uk_ware/miscellanea:misc.Mode3
ltx/en_uk_ware/tr.d032:trMA.Ode3C2Tr.ode	@ltx/en_uk_ware/miscellanea:misc.Ode3
ltx/en_uk_ware/tr.d032:trMA.Ode3C2Tr.text	O Most Holy Trinity, equal in honour and without beginning;O Unity, Creator of life and Source of light, Father, Son and Spirit, save me.
ltx/en_uk_ware/tr.d032:trMA.Ode8C11.greekmelody	@ltx/en_uk_ware/he.h.m1:heHE.TonTousYmnologousEnKamino.greekname
ltx/en_uk_ware/tr.d032:trMA.Ode8C11.incipit	In the abundance of Thy…
ltx/en_uk_ware/tr.d032:trMA.Ode8C11.melody	@ltx/en_uk_ware/he.h.m1:heHE.TonTousYmnologousEnKamino.name
ltx/en_uk_ware/tr.d032:trMA.Ode8C11.mode	@ltx/en_uk_ware/miscellanea:misc.Mode1
ltx/en_uk_ware/tr.d032:trMA.Ode8C11.ode	@ltx/en_uk_ware/miscellanea:misc.Ode8
ltx/en_uk_ware/tr.d032:trMA.Ode8C11.text	In the abundance of Thy mercy Thou hast accepted to be numbered with the transgressors: blot out my sins, that in faith I may glorify Thee for ever.
ltx/en_uk_ware/tr.d032:trMA.Ode8C12.incipit	O Lord, and heal the…
ltx/en_uk_ware/tr.d032:trMA.Ode8C12.melody	@ltx/en_uk_ware/he.h.m1:heHE.TonTousYmnologousEnKamino.name
ltx/en_uk_ware/tr.d032:trMA.Ode8C12.mode	@ltx/en_uk_ware/miscellanea:misc.Mode1
ltx/en_uk_ware/tr.d032:trMA.Ode8C12.ode	@ltx/en_uk_ware/miscellanea:misc.Ode8
ltx/en_uk_ware/tr.d032:trMA.Ode8C12.text	O Lord, and heal the agony of my heart that is pierced by evil demons with the arrow of wickedness.
ltx/en_uk_ware/tr.d032:trMA.Ode8C13.incipit	With the blood that flowed…
ltx/en_uk_ware/tr.d032:trMA.Ode8C13.melody	@ltx/en_uk_ware/he.h.m1:heHE.TonTousYmnologousEnKamino.name
ltx/en_uk_ware/tr.d032:trMA.Ode8C13.mode	@ltx/en_uk_ware/miscellanea:misc.Mode1
ltx/en_uk_ware/tr.d032:trMA.Ode8C13.ode	@ltx/en_uk_ware/miscellanea:misc.Ode8
ltx/en_uk_ware/tr.d032:trMA.Ode8C13.text	With the blood that flowed from Thy side, wash clean my heart, blackened by the defilement of sin, that I may glorify Thee for ever.
ltx/en_uk_ware/tr.d032:trMA.Ode8C1T.incipit	O Virgin, unhusbanded thou hast…
ltx/en_uk_ware/tr.d032:trMA.Ode8C1T.melody	@ltx/en_uk_ware/he.h.m1:heHE.TonTousYmnologousEnKamino.name
ltx/en_uk_ware/tr.d032:trMA.Ode8C1T.mode	@ltx/en_uk_ware/miscellanea:misc.Mode1
ltx/en_uk_ware/tr.d032:trMA.Ode8C1T.ode	@ltx/en_uk_ware/miscellanea:misc.Ode8
ltx/en_uk_ware/tr.d032:trMA.Ode8C1T.text	O Virgin, unhusbanded thou hast borne the heavenly Ear of wheat who feeds all things by His divine power: fill my hungry and humiliated soul.
ltx/en_uk_ware/tr.d032:trMA.Ode8C21.greekmelody	@ltx/en_uk_ware/he.h.m3:heHE.TonEnFlogi.greekname
ltx/en_uk_ware/tr.d032:trMA.Ode8C21.incipit	Rejoice, O Cross, for by…
ltx/en_uk_ware/tr.d032:trMA.Ode8C21.melody	@ltx/en_uk_ware/he.h.m3:heHE.TonEnFlogi.name
ltx/en_uk_ware/tr.d032:trMA.Ode8C21.mode	@ltx/en_uk_ware/miscellanea:misc.Mode3
ltx/en_uk_ware/tr.d032:trMA.Ode8C21.ode	@ltx/en_uk_ware/miscellanea:misc.Ode8
ltx/en_uk_ware/tr.d032:trMA.Ode8C21.text	Rejoice, O Cross, for by thy power the thief in a single moment acknowledged Christ’s divinity, crying: ‘Lord, remember me in Thy Kingdom.’ Make us also sharers in that Kingdom.
ltx/en_uk_ware/tr.d032:trMA.Ode8C22.incipit	Pierced with a spear, O…
ltx/en_uk_ware/tr.d032:trMA.Ode8C22.melody	@ltx/en_uk_ware/he.h.m3:heHE.TonEnFlogi.name
ltx/en_uk_ware/tr.d032:trMA.Ode8C22.mode	@ltx/en_uk_ware/miscellanea:misc.Mode3
ltx/en_uk_ware/tr.d032:trMA.Ode8C22.ode	@ltx/en_uk_ware/miscellanea:misc.Ode8
ltx/en_uk_ware/tr.d032:trMA.Ode8C22.text	Pierced with a spear, O Christ, Thou hast turned back the sword of fire and opened Paradise again to mortal men. Let us enter there and rejoice for ever in the immortal life that comes from Thee.
ltx/en_uk_ware/tr.d032:trMA.Ode8C2A1.incipit	O Cross of Christ, the…
ltx/en_uk_ware/tr.d032:trMA.Ode8C2A1.melody	@ltx/en_uk_ware/he.h.m3:heHE.TonEnFlogi.name
ltx/en_uk_ware/tr.d032:trMA.Ode8C2A1.mode	@ltx/en_uk_ware/miscellanea:misc.Mode3
ltx/en_uk_ware/tr.d032:trMA.Ode8C2A1.ode	@ltx/en_uk_ware/miscellanea:misc.Ode8
ltx/en_uk_ware/tr.d032:trMA.Ode8C2A1.text	O Cross of Christ, the hope of the ends of the earth, grant that through thy piloting we may pass calmly over the sea of the holy Fast, and save us from the tempest of sin.
ltx/en_uk_ware/tr.d032:trMA.Ode8C2H.greekmelody	@ltx/en_uk_ware/he.h.m3:heHE.TonEnFlogi.greekname
ltx/en_uk_ware/tr.d032:trMA.Ode8C2H.incipit	@ltx/en_uk_ware/he.h.m3:heHE.TonEnFlogi.incipit
ltx/en_uk_ware/tr.d032:trMA.Ode8C2H.melody	@ltx/en_uk_ware/he.h.m3:heHE.TonEnFlogi.melody
ltx/en_uk_ware/tr.d032:trMA.Ode8C2H.mode	@ltx/en_uk_ware/miscellanea:misc.Mode3
ltx/en_uk_ware/tr.d032:trMA.Ode8C2H.ode	@ltx/en_uk_ware/miscellanea:misc.Ode8
ltx/en_uk_ware/tr.d032:trMA.Ode8C2H.text	@ltx/en_uk_ware/he.h.m3:heHE.TonEnFlogi.text
ltx/en_uk_ware/tr.d032:trMA.Ode8C2T.incipit	Thou alone, O full of…
ltx/en_uk_ware/tr.d032:trMA.Ode8C2T.melody	@ltx/en_uk_ware/he.h.m3:heHE.TonEnFlogi.name
ltx/en_uk_ware/tr.d032:trMA.Ode8C2T.mode	@ltx/en_uk_ware/miscellanea:misc.Mode3
ltx/en_uk_ware/tr.d032:trMA.Ode8C2T.ode	@ltx/en_uk_ware/miscellanea:misc.Ode8
ltx/en_uk_ware/tr.d032:trMA.Ode8C2T.text	Thou alone, O full of divine grace, hast given birth while still remaining virgin. O great mystery, dread and marvellous! For thou hast borne God made flesh, the Saviour of the world.
ltx/en_uk_ware/tr.d032:trMA.Ode8C2Tr.incipit	With the Father we worship…
ltx/en_uk_ware/tr.d032:trMA.Ode8C2Tr.melody	@ltx/en_uk_ware/he.h.m3:heHE.TonEnFlogi.name
ltx/en_uk_ware/tr.d032:trMA.Ode8C2Tr.mode	@ltx/en_uk_ware/miscellanea:misc.Mode3
ltx/en_uk_ware/tr.d032:trMA.Ode8C2Tr.ode	@ltx/en_uk_ware/miscellanea:misc.Ode8
ltx/en_uk_ware/tr.d032:trMA.Ode8C2Tr.text	With the Father we worship the Son and the Holy Spirit in unity of essence, and from our mouths of clay we cry without ceasing: Glory in the highest to God in Trinity.
ltx/en_uk_ware/tr.d032:trMA.Ode9C11.greekmelody	@ltx/en_uk_ware/he.h.m1:heHE.TinZoodochonPigin.greekname
ltx/en_uk_ware/tr.d032:trMA.Ode9C11.incipit	Elisha, so it is written…
ltx/en_uk_ware/tr.d032:trMA.Ode9C11.melody	@ltx/en_uk_ware/he.h.m1:heHE.TinZoodochonPigin.name
ltx/en_uk_ware/tr.d032:trMA.Ode9C11.mode	@ltx/en_uk_ware/miscellanea:misc.Mode1
ltx/en_uk_ware/tr.d032:trMA.Ode9C11.ode	@ltx/en_uk_ware/miscellanea:misc.Ode9
ltx/en_uk_ware/tr.d032:trMA.Ode9C11.text	Elisha, so it is written, after fasting brought the dead child back to life: let us also fast, killing all our carnal thoughts, that in the Age to come we may receive eternal life.
ltx/en_uk_ware/tr.d032:trMA.Ode9C12.incipit	Woe to thee, my soul!…
ltx/en_uk_ware/tr.d032:trMA.Ode9C12.melody	@ltx/en_uk_ware/he.h.m1:heHE.TinZoodochonPigin.name
ltx/en_uk_ware/tr.d032:trMA.Ode9C12.mode	@ltx/en_uk_ware/miscellanea:misc.Mode1
ltx/en_uk_ware/tr.d032:trMA.Ode9C12.ode	@ltx/en_uk_ware/miscellanea:misc.Ode9
ltx/en_uk_ware/tr.d032:trMA.Ode9C12.text	Woe to thee, my soul! Fearful is the court of judgement, and terrible the sentence of the Judge. Make haste, repent, be reconciled to Christ, who was nailed for thy sake on the Cross and has delivered the faithful from condemnation.
ltx/en_uk_ware/tr.d032:trMA.Ode9C13.incipit	O Christ who at Thy…
ltx/en_uk_ware/tr.d032:trMA.Ode9C13.melody	@ltx/en_uk_ware/he.h.m1:heHE.TinZoodochonPigin.name
ltx/en_uk_ware/tr.d032:trMA.Ode9C13.mode	@ltx/en_uk_ware/miscellanea:misc.Mode1
ltx/en_uk_ware/tr.d032:trMA.Ode9C13.ode	@ltx/en_uk_ware/miscellanea:misc.Ode9
ltx/en_uk_ware/tr.d032:trMA.Ode9C13.text	O Christ who at Thy Crucifixion hast granted the thief a swift and easy entry into Paradise, open unto me the gates of repentance and close within me the doors through which the passions enter, that I may glorify Thy love.
ltx/en_uk_ware/tr.d032:trMA.Ode9C1T.incipit	I am cast into the…
ltx/en_uk_ware/tr.d032:trMA.Ode9C1T.melody	@ltx/en_uk_ware/he.h.m1:heHE.TinZoodochonPigin.name
ltx/en_uk_ware/tr.d032:trMA.Ode9C1T.mode	@ltx/en_uk_ware/miscellanea:misc.Mode1
ltx/en_uk_ware/tr.d032:trMA.Ode9C1T.ode	@ltx/en_uk_ware/miscellanea:misc.Ode9
ltx/en_uk_ware/tr.d032:trMA.Ode9C1T.text	I am cast into the deep waters of sin; I am tossed to and fro by adverse thoughts; I have become obedient to demons and the slave of pleasure. Help me, O pure Virgin Mother, and guide me to the path of salvation.
ltx/en_uk_ware/tr.d032:trMA.Ode9C21.greekmelody	@ltx/en_uk_ware/he.h.m3:heHE.EnSinaioToOrei.greekname
ltx/en_uk_ware/tr.d032:trMA.Ode9C21.incipit	O Thine own will wast…
ltx/en_uk_ware/tr.d032:trMA.Ode9C21.melody	@ltx/en_uk_ware/he.h.m3:heHE.EnSinaioToOrei.name
ltx/en_uk_ware/tr.d032:trMA.Ode9C21.mode	@ltx/en_uk_ware/miscellanea:misc.Mode3
ltx/en_uk_ware/tr.d032:trMA.Ode9C21.ode	@ltx/en_uk_ware/miscellanea:misc.Ode9
ltx/en_uk_ware/tr.d032:trMA.Ode9C21.text	O Thine own will wast Thou given up, and Thou hast surrendered Thyself to Thy murderers; standing before the judgement seat, Thou wast struck by the hands which Thou hast made. Thou wast crucified and mocked, and pierced by the lance, O Lord; Thou hast suffered in the body, enduring all things in Thy tender love, so as to save us.
ltx/en_uk_ware/tr.d032:trMA.Ode9C22.incipit	The hosts of angels trembled…
ltx/en_uk_ware/tr.d032:trMA.Ode9C22.melody	@ltx/en_uk_ware/he.h.m3:heHE.EnSinaioToOrei.name
ltx/en_uk_ware/tr.d032:trMA.Ode9C22.mode	@ltx/en_uk_ware/miscellanea:misc.Mode3
ltx/en_uk_ware/tr.d032:trMA.Ode9C22.ode	@ltx/en_uk_ware/miscellanea:misc.Ode9
ltx/en_uk_ware/tr.d032:trMA.Ode9C22.text	The hosts of angels trembled when they saw Thee on the Cross. The lights of heaven hid their brightness, the earth quaked, and all things were shaken at the outrage done to Thee, Lord. By Thy divine sufferings, O God, Thou hast accomplished our salvation.
ltx/en_uk_ware/tr.d032:trMA.Ode9C2A1.incipit	By Thy wounds have we…
ltx/en_uk_ware/tr.d032:trMA.Ode9C2A1.melody	@ltx/en_uk_ware/he.h.m3:heHE.EnSinaioToOrei.name
ltx/en_uk_ware/tr.d032:trMA.Ode9C2A1.mode	@ltx/en_uk_ware/miscellanea:misc.Mode3
ltx/en_uk_ware/tr.d032:trMA.Ode9C2A1.ode	@ltx/en_uk_ware/miscellanea:misc.Ode9
ltx/en_uk_ware/tr.d032:trMA.Ode9C2A1.text	By Thy wounds have we all been healed from the passions of sin: for, raised upon the Cross, Thou hast struck down the enemy, the source of evil. Count us worthy to pass through the time of the Fast without condemnation, and so to reach the Resurrection.
ltx/en_uk_ware/tr.d032:trMA.Ode9C2H.greekmelody	@ltx/en_uk_ware/he.h.m3:heHE.EnSinaioToOrei.greekname
ltx/en_uk_ware/tr.d032:trMA.Ode9C2H.incipit	@ltx/en_uk_ware/he.h.m3:heHE.EnSinaioToOrei.incipit
ltx/en_uk_ware/tr.d032:trMA.Ode9C2H.melody	@ltx/en_uk_ware/he.h.m3:heHE.EnSinaioToOrei.melody
ltx/en_uk_ware/tr.d032:trMA.Ode9C2H.mode	@ltx/en_uk_ware/miscellanea:misc.Mode3
ltx/en_uk_ware/tr.d032:trMA.Ode9C2H.ode	@ltx/en_uk_ware/miscellanea:misc.Ode9
ltx/en_uk_ware/tr.d032:trMA.Ode9C2H.text	@ltx/en_uk_ware/he.h.m3:heHE.EnSinaioToOrei.text
ltx/en_uk_ware/tr.d032:trMA.Ode9C2T.incipit	Who has ever heard of…
ltx/en_uk_ware/tr.d032:trMA.Ode9C2T.melody	@ltx/en_uk_ware/he.h.m3:heHE.EnSinaioToOrei.name
ltx/en_uk_ware/tr.d032:trMA.Ode9C2T.mode	@ltx/en_uk_ware/miscellanea:misc.Mode3
ltx/en_uk_ware/tr.d032:trMA.Ode9C2T.ode	@ltx/en_uk_ware/miscellanea:misc.Ode9
ltx/en_uk_ware/tr.d032:trMA.Ode9C2T.text	Who has ever heard of a virgin that bore child and a mother that knew not man? O Mary, this miracle hast thou accomplished, but tell me how? ‘Do not enquire into the mystery of my childbearing: it is altogether true, yet beyond man’s understanding.’
ltx/en_uk_ware/tr.d032:trMA.Ode9C2Tr.incipit	The Trinity supreme in Godhead…
ltx/en_uk_ware/tr.d032:trMA.Ode9C2Tr.melody	@ltx/en_uk_ware/he.h.m3:heHE.EnSinaioToOrei.name
ltx/en_uk_ware/tr.d032:trMA.Ode9C2Tr.mode	@ltx/en_uk_ware/miscellanea:misc.Mode3
ltx/en_uk_ware/tr.d032:trMA.Ode9C2Tr.ode	@ltx/en_uk_ware/miscellanea:misc.Ode9
ltx/en_uk_ware/tr.d032:trMA.Ode9C2Tr.text	The Trinity supreme in Godhead is by Essence an undivided Unity. Though single in Nature, it is distinguished in Persons; though indivisible, it is divided; though one, it is three: Father, Son and Spirit of Life, together guarding all things.
ltx/en_uk_ware/tr.d032:trTE.Troparion.incipit	O God Most High who…
ltx/en_uk_ware/tr.d032:trTE.Troparion.melody	
ltx/en_uk_ware/tr.d032:trTE.Troparion.mode	@ltx/en_uk_ware/miscellanea:misc.Mode6
ltx/en_uk_ware/tr.d032:trTE.Troparion.text	O God Most High who dwellest in the heavens, who hast created everything that has breath, save us, for we have put our hope in Thee, our Saviour.
ltx/en_uk_ware/tr.d032:trTE.Troparion2.incipit	…
ltx/en_uk_ware/tr.d032:trTE.Troparion2.text	
ltx/en_uk_ware/tr.d032:trVE.AposIdiomelon1.incipit	When Thou wast crucified in…
ltx/en_uk_ware/tr.d032:trVE.AposIdiomelon1.melody	@ltx/en_uk_ware/miscellanea:misc.Idiomelon
ltx/en_uk_ware/tr.d032:trVE.AposIdiomelon1.mode	@ltx/en_uk_ware/miscellanea:misc.Mode3
ltx/en_uk_ware/tr.d032:trVE.AposIdiomelon1.text	When Thou wast crucified in the flesh, O Lord, Thou hast crucified our fallen nature with Thyself; when Thy side was pierced by the spear, Thou hast pierced the serpent that destroyed mankind. Nail my flesh with the fear of Thee and wound my soul with Thy love, that, gazing on Thy Passion, in abstinence I may pass through the appointed time of the Fast, governing not my stomach only, but all the other entrances of sin. Repenting over my past sins, may I offer Thee in sacrifice a humble spirit and a contrite heart. O deliver me from my offences in Thy love for mankind.
ltx/en_uk_ware/tr.d032:trVE.AposMartyric.incipit	The prophets, the apostles of…
ltx/en_uk_ware/tr.d032:trVE.AposMartyric.melody	
ltx/en_uk_ware/tr.d032:trVE.AposMartyric.mode	@ltx/en_uk_ware/miscellanea:misc.Mode3
ltx/en_uk_ware/tr.d032:trVE.AposMartyric.text	The prophets, the apostles of Christ and the martyrs have taught mankind to sing the praises of the consubstantial Trinity; they have given light to the nations that were gone astray, and they have made the sons of men companions of the angels.
ltx/en_uk_ware/tr.d032:trVE.AposTheotokion.greekmelody	@ltx/en_uk_ware/he.a.m3:heAU.MegaliTouStavrouSou.greekname
ltx/en_uk_ware/tr.d032:trVE.AposTheotokion.incipit	Seeing thy Son hanging upon…
ltx/en_uk_ware/tr.d032:trVE.AposTheotokion.melody	@ltx/en_uk_ware/he.a.m3:heAU.MegaliTouStavrouSou.name
ltx/en_uk_ware/tr.d032:trVE.AposTheotokion.mode	@ltx/en_uk_ware/miscellanea:misc.Mode3
ltx/en_uk_ware/tr.d032:trVE.AposTheotokion.text	Seeing thy Son hanging upon the Tree, O undefiled Virgin, lamenting thou hast cried aloud: ‘Where is Thy light-giving beauty gone, with which Thou hast adorned man’s nature, O my beloved Child?’
ltx/en_uk_ware/tr.d032:trVE.Stichera01.greekmelody	@ltx/en_uk_ware/he.a.m1:heAU.PaneffimoiMartyres.greekname
ltx/en_uk_ware/tr.d032:trVE.Stichera01.incipit	O Christ, Thou hast stretched…
ltx/en_uk_ware/tr.d032:trVE.Stichera01.melody	@ltx/en_uk_ware/he.a.m1:heAU.PaneffimoiMartyres.name
ltx/en_uk_ware/tr.d032:trVE.Stichera01.mode	@ltx/en_uk_ware/miscellanea:misc.Mode1
ltx/en_uk_ware/tr.d032:trVE.Stichera01.poet	@ltx/en_uk_ware/poets:po.Iosif
ltx/en_uk_ware/tr.d032:trVE.Stichera01.text	O Christ, Thou hast stretched out Thy sinless hands upon the Cross, gathering together the ends of the earth. Therefore I cry unto Thee: Gather together my scattered mind, taken captive by the passions; cleanse me in every part through abstinence, and make me a sharer in Thy sufferings.
ltx/en_uk_ware/tr.d032:trVE.Stichera02.greekmelody	@ltx/en_uk_ware/he.a.m1:heAU.PaneffimoiMartyres.greekname
ltx/en_uk_ware/tr.d032:trVE.Stichera02.incipit	Fasting gave strength to the…
ltx/en_uk_ware/tr.d032:trVE.Stichera02.melody	@ltx/en_uk_ware/he.a.m1:heAU.PaneffimoiMartyres.name
ltx/en_uk_ware/tr.d032:trVE.Stichera02.mode	@ltx/en_uk_ware/miscellanea:misc.Mode1
ltx/en_uk_ware/tr.d032:trVE.Stichera02.text	Fasting gave strength to the Children in Babylon of old and made them, as it is written, mightier than the flames of fire. Fast, then, my humble soul, kindling within thyself love for the Master, and thou shalt escape from the Gehenna to come and burn up the destroying passions.
ltx/en_uk_ware/tr.d032:trVE.Stichera03.incipit	The season of the Fast…
ltx/en_uk_ware/tr.d032:trVE.Stichera03.melody	
ltx/en_uk_ware/tr.d032:trVE.Stichera03.mode	@ltx/en_uk_ware/miscellanea:misc.Mode3
ltx/en_uk_ware/tr.d032:trVE.Stichera03.poet	@ltx/en_uk_ware/poets:po.Theodorou
ltx/en_uk_ware/tr.d032:trVE.Stichera03.text	The season of the Fast is one of gladness. In shining purity and unfeigned love, filled with the light of prayer and every virtue, with rejoicing let us cry aloud: Most Holy Cross of Christ, that hast brought us life and joy, count us all worthy to venerate thee with pure hearts, and grant us forgiveness and great mercy.
