ltx/en_uk_ware/he.h.m3:heHE.AnagageEkFthoras.greekname	
ltx/en_uk_ware/he.h.m3:heHE.AnagageEkFthoras.incipit	…
ltx/en_uk_ware/he.h.m3:heHE.AnagageEkFthoras.melody	@ltx/en_uk_ware/miscellanea:misc.HeirmosNotMetered
ltx/en_uk_ware/he.h.m3:heHE.AnagageEkFthoras.mode	@ltx/en_uk_ware/miscellanea:misc.Mode3
ltx/en_uk_ware/he.h.m3:heHE.AnagageEkFthoras.name	(NM)
ltx/en_uk_ware/he.h.m3:heHE.AnagageEkFthoras.ode	@ltx/en_uk_ware/miscellanea:misc.Ode6
ltx/en_uk_ware/he.h.m3:heHE.AnagageEkFthoras.text	
ltx/en_uk_ware/he.h.m3:heHE.AsmaKainon.greekname	
ltx/en_uk_ware/he.h.m3:heHE.AsmaKainon.incipit	…
ltx/en_uk_ware/he.h.m3:heHE.AsmaKainon.melody	@ltx/en_uk_ware/miscellanea:misc.HeirmosNotMetered
ltx/en_uk_ware/he.h.m3:heHE.AsmaKainon.mode	@ltx/en_uk_ware/miscellanea:misc.Mode3
ltx/en_uk_ware/he.h.m3:heHE.AsmaKainon.name	(NM)
ltx/en_uk_ware/he.h.m3:heHE.AsmaKainon.ode	@ltx/en_uk_ware/miscellanea:misc.Ode1
ltx/en_uk_ware/he.h.m3:heHE.AsmaKainon.text	
ltx/en_uk_ware/he.h.m3:heHE.AsomenToKyrio.greekname	
ltx/en_uk_ware/he.h.m3:heHE.AsomenToKyrio.incipit	Let us sing to the Lord…
ltx/en_uk_ware/he.h.m3:heHE.AsomenToKyrio.melody	@ltx/en_uk_ware/miscellanea:misc.HeirmosNotMetered
ltx/en_uk_ware/he.h.m3:heHE.AsomenToKyrio.mode	@ltx/en_uk_ware/miscellanea:misc.Mode3
ltx/en_uk_ware/he.h.m3:heHE.AsomenToKyrio.name	(NM) Let us sing to the Lord.
ltx/en_uk_ware/he.h.m3:heHE.AsomenToKyrio.ode	@ltx/en_uk_ware/miscellanea:misc.Ode1
ltx/en_uk_ware/he.h.m3:heHE.AsomenToKyrio.text	Let us sing to the Lord, who has worked marvellous wonders in the Red Sea: for in the deep waters He has drowned our enemies and has saved Israel. To Him alone let us sing, for He is glorified.
ltx/en_uk_ware/he.h.m3:heHE.AstektoPyri.greekname	
ltx/en_uk_ware/he.h.m3:heHE.AstektoPyri.incipit	…
ltx/en_uk_ware/he.h.m3:heHE.AstektoPyri.melody	@ltx/en_uk_ware/miscellanea:misc.HeirmosNotMetered
ltx/en_uk_ware/he.h.m3:heHE.AstektoPyri.mode	@ltx/en_uk_ware/miscellanea:misc.Mode3
ltx/en_uk_ware/he.h.m3:heHE.AstektoPyri.name	(NM)
ltx/en_uk_ware/he.h.m3:heHE.AstektoPyri.ode	@ltx/en_uk_ware/miscellanea:misc.Ode8
ltx/en_uk_ware/he.h.m3:heHE.AstektoPyri.text	
ltx/en_uk_ware/he.h.m3:heHE.AvyssosEschati.greekname	
ltx/en_uk_ware/he.h.m3:heHE.AvyssosEschati.incipit	…
ltx/en_uk_ware/he.h.m3:heHE.AvyssosEschati.melody	@ltx/en_uk_ware/miscellanea:misc.HeirmosNotMetered
ltx/en_uk_ware/he.h.m3:heHE.AvyssosEschati.mode	@ltx/en_uk_ware/miscellanea:misc.Mode3
ltx/en_uk_ware/he.h.m3:heHE.AvyssosEschati.name	(NM)
ltx/en_uk_ware/he.h.m3:heHE.AvyssosEschati.ode	@ltx/en_uk_ware/miscellanea:misc.Ode6
ltx/en_uk_ware/he.h.m3:heHE.AvyssosEschati.text	
ltx/en_uk_ware/he.h.m3:heHE.ChersonAvyssotokon.greekname	
ltx/en_uk_ware/he.h.m3:heHE.ChersonAvyssotokon.incipit	…
ltx/en_uk_ware/he.h.m3:heHE.ChersonAvyssotokon.melody	@ltx/en_uk_ware/miscellanea:misc.HeirmosNotMetered
ltx/en_uk_ware/he.h.m3:heHE.ChersonAvyssotokon.mode	@ltx/en_uk_ware/miscellanea:misc.Mode3
ltx/en_uk_ware/he.h.m3:heHE.ChersonAvyssotokon.name	(NM)
ltx/en_uk_ware/he.h.m3:heHE.ChersonAvyssotokon.ode	@ltx/en_uk_ware/miscellanea:misc.Ode1
ltx/en_uk_ware/he.h.m3:heHE.ChersonAvyssotokon.text	
ltx/en_uk_ware/he.h.m3:heHE.EisakikoaTinAkoin.greekname	
ltx/en_uk_ware/he.h.m3:heHE.EisakikoaTinAkoin.incipit	…
ltx/en_uk_ware/he.h.m3:heHE.EisakikoaTinAkoin.melody	@ltx/en_uk_ware/miscellanea:misc.HeirmosNotMetered
ltx/en_uk_ware/he.h.m3:heHE.EisakikoaTinAkoin.mode	@ltx/en_uk_ware/miscellanea:misc.Mode3
ltx/en_uk_ware/he.h.m3:heHE.EisakikoaTinAkoin.name	(NM)
ltx/en_uk_ware/he.h.m3:heHE.EisakikoaTinAkoin.ode	@ltx/en_uk_ware/miscellanea:misc.Ode4
ltx/en_uk_ware/he.h.m3:heHE.EisakikoaTinAkoin.text	
ltx/en_uk_ware/he.h.m3:heHE.EkalypsenOuranous.greekname	
ltx/en_uk_ware/he.h.m3:heHE.EkalypsenOuranous.incipit	…
ltx/en_uk_ware/he.h.m3:heHE.EkalypsenOuranous.melody	@ltx/en_uk_ware/miscellanea:misc.HeirmosNotMetered
ltx/en_uk_ware/he.h.m3:heHE.EkalypsenOuranous.mode	@ltx/en_uk_ware/miscellanea:misc.Mode3
ltx/en_uk_ware/he.h.m3:heHE.EkalypsenOuranous.name	(NM)
ltx/en_uk_ware/he.h.m3:heHE.EkalypsenOuranous.ode	@ltx/en_uk_ware/miscellanea:misc.Ode4
ltx/en_uk_ware/he.h.m3:heHE.EkalypsenOuranous.text	
ltx/en_uk_ware/he.h.m3:heHE.EnNomoSkia.greekname	
ltx/en_uk_ware/he.h.m3:heHE.EnNomoSkia.incipit	…
ltx/en_uk_ware/he.h.m3:heHE.EnNomoSkia.melody	@ltx/en_uk_ware/miscellanea:misc.HeirmosNotMetered
ltx/en_uk_ware/he.h.m3:heHE.EnNomoSkia.mode	@ltx/en_uk_ware/miscellanea:misc.Mode3
ltx/en_uk_ware/he.h.m3:heHE.EnNomoSkia.name	(NM)
ltx/en_uk_ware/he.h.m3:heHE.EnNomoSkia.ode	@ltx/en_uk_ware/miscellanea:misc.Ode9
ltx/en_uk_ware/he.h.m3:heHE.EnNomoSkia.text	
ltx/en_uk_ware/he.h.m3:heHE.EnSinaioToOrei.greekname	Ἐν Σιναίῳ τῷ ὅρει.
ltx/en_uk_ware/he.h.m3:heHE.EnSinaioToOrei.incipit	In the bush upon Mount Sinai…
ltx/en_uk_ware/he.h.m3:heHE.EnSinaioToOrei.melody	@ltx/en_uk_ware/miscellanea:misc.HeirmosNotMetered
ltx/en_uk_ware/he.h.m3:heHE.EnSinaioToOrei.mode	@ltx/en_uk_ware/miscellanea:misc.Mode3
ltx/en_uk_ware/he.h.m3:heHE.EnSinaioToOrei.name	(NM) In the bush upon Mount Sinai.
ltx/en_uk_ware/he.h.m3:heHE.EnSinaioToOrei.ode	@ltx/en_uk_ware/miscellanea:misc.Ode9
ltx/en_uk_ware/he.h.m3:heHE.EnSinaioToOrei.text	In the bush upon Mount Sinai Moses saw thee, who hast conceived within thy womb the fire of the Godhead, and yet wast not consumed. Daniel saw thee as a mountain not cut by hand of man, and Isaiah proclaimed thee as the Rod that blossomed from the root of David.
ltx/en_uk_ware/he.h.m3:heHE.EnylouFlogaPyros.greekname	
ltx/en_uk_ware/he.h.m3:heHE.EnylouFlogaPyros.incipit	…
ltx/en_uk_ware/he.h.m3:heHE.EnylouFlogaPyros.melody	@ltx/en_uk_ware/miscellanea:misc.HeirmosNotMetered
ltx/en_uk_ware/he.h.m3:heHE.EnylouFlogaPyros.mode	@ltx/en_uk_ware/miscellanea:misc.Mode3
ltx/en_uk_ware/he.h.m3:heHE.EnylouFlogaPyros.name	(NM)
ltx/en_uk_ware/he.h.m3:heHE.EnylouFlogaPyros.ode	@ltx/en_uk_ware/miscellanea:misc.Ode8
ltx/en_uk_ware/he.h.m3:heHE.EnylouFlogaPyros.text	
ltx/en_uk_ware/he.h.m3:heHE.EpiTisGis.greekname	
ltx/en_uk_ware/he.h.m3:heHE.EpiTisGis.incipit	…
ltx/en_uk_ware/he.h.m3:heHE.EpiTisGis.melody	@ltx/en_uk_ware/miscellanea:misc.HeirmosNotMetered
ltx/en_uk_ware/he.h.m3:heHE.EpiTisGis.mode	@ltx/en_uk_ware/miscellanea:misc.Mode3
ltx/en_uk_ware/he.h.m3:heHE.EpiTisGis.name	(NM)
ltx/en_uk_ware/he.h.m3:heHE.EpiTisGis.ode	@ltx/en_uk_ware/miscellanea:misc.Ode5
ltx/en_uk_ware/he.h.m3:heHE.EpiTisGis.text	
ltx/en_uk_ware/he.h.m3:heHE.EstereothiIKardiaMou.greekname	
ltx/en_uk_ware/he.h.m3:heHE.EstereothiIKardiaMou.incipit	…
ltx/en_uk_ware/he.h.m3:heHE.EstereothiIKardiaMou.melody	@ltx/en_uk_ware/miscellanea:misc.HeirmosNotMetered
ltx/en_uk_ware/he.h.m3:heHE.EstereothiIKardiaMou.mode	@ltx/en_uk_ware/miscellanea:misc.Mode3
ltx/en_uk_ware/he.h.m3:heHE.EstereothiIKardiaMou.name	(NM)
ltx/en_uk_ware/he.h.m3:heHE.EstereothiIKardiaMou.ode	@ltx/en_uk_ware/miscellanea:misc.Ode3
ltx/en_uk_ware/he.h.m3:heHE.EstereothiIKardiaMou.text	
ltx/en_uk_ware/he.h.m3:heHE.EthouProsImas.greekname	
ltx/en_uk_ware/he.h.m3:heHE.EthouProsImas.incipit	…
ltx/en_uk_ware/he.h.m3:heHE.EthouProsImas.melody	@ltx/en_uk_ware/miscellanea:misc.HeirmosNotMetered
ltx/en_uk_ware/he.h.m3:heHE.EthouProsImas.mode	@ltx/en_uk_ware/miscellanea:misc.Mode3
ltx/en_uk_ware/he.h.m3:heHE.EthouProsImas.name	(NM)
ltx/en_uk_ware/he.h.m3:heHE.EthouProsImas.ode	@ltx/en_uk_ware/miscellanea:misc.Ode4
ltx/en_uk_ware/he.h.m3:heHE.EthouProsImas.text	
ltx/en_uk_ware/he.h.m3:heHE.EvlogitosKyrios.greekname	
ltx/en_uk_ware/he.h.m3:heHE.EvlogitosKyrios.incipit	…
ltx/en_uk_ware/he.h.m3:heHE.EvlogitosKyrios.melody	@ltx/en_uk_ware/miscellanea:misc.HeirmosNotMetered
ltx/en_uk_ware/he.h.m3:heHE.EvlogitosKyrios.mode	@ltx/en_uk_ware/miscellanea:misc.Mode3
ltx/en_uk_ware/he.h.m3:heHE.EvlogitosKyrios.name	(NM)
ltx/en_uk_ware/he.h.m3:heHE.EvlogitosKyrios.ode	@ltx/en_uk_ware/miscellanea:misc.Ode9
ltx/en_uk_ware/he.h.m3:heHE.EvlogitosKyrios.text	
ltx/en_uk_ware/he.h.m3:heHE.EvoisaEnStenagmois.greekname	
ltx/en_uk_ware/he.h.m3:heHE.EvoisaEnStenagmois.incipit	…
ltx/en_uk_ware/he.h.m3:heHE.EvoisaEnStenagmois.melody	@ltx/en_uk_ware/miscellanea:misc.HeirmosNotMetered
ltx/en_uk_ware/he.h.m3:heHE.EvoisaEnStenagmois.mode	@ltx/en_uk_ware/miscellanea:misc.Mode3
ltx/en_uk_ware/he.h.m3:heHE.EvoisaEnStenagmois.name	(NM)
ltx/en_uk_ware/he.h.m3:heHE.EvoisaEnStenagmois.ode	@ltx/en_uk_ware/miscellanea:misc.Ode6
ltx/en_uk_ware/he.h.m3:heHE.EvoisaEnStenagmois.text	
ltx/en_uk_ware/he.h.m3:heHE.EvoiseSoi.greekname	
ltx/en_uk_ware/he.h.m3:heHE.EvoiseSoi.incipit	…
ltx/en_uk_ware/he.h.m3:heHE.EvoiseSoi.melody	@ltx/en_uk_ware/miscellanea:misc.HeirmosNotMetered
ltx/en_uk_ware/he.h.m3:heHE.EvoiseSoi.mode	@ltx/en_uk_ware/miscellanea:misc.Mode3
ltx/en_uk_ware/he.h.m3:heHE.EvoiseSoi.name	(NM)
ltx/en_uk_ware/he.h.m3:heHE.EvoiseSoi.ode	@ltx/en_uk_ware/miscellanea:misc.Ode6
ltx/en_uk_ware/he.h.m3:heHE.EvoiseSoi.text	
ltx/en_uk_ware/he.h.m3:heHE.FaraoTaArmata.greekname	
ltx/en_uk_ware/he.h.m3:heHE.FaraoTaArmata.incipit	…
ltx/en_uk_ware/he.h.m3:heHE.FaraoTaArmata.melody	@ltx/en_uk_ware/miscellanea:misc.HeirmosNotMetered
ltx/en_uk_ware/he.h.m3:heHE.FaraoTaArmata.mode	@ltx/en_uk_ware/miscellanea:misc.Mode3
ltx/en_uk_ware/he.h.m3:heHE.FaraoTaArmata.name	(NM)
ltx/en_uk_ware/he.h.m3:heHE.FaraoTaArmata.ode	@ltx/en_uk_ware/miscellanea:misc.Ode1
ltx/en_uk_ware/he.h.m3:heHE.FaraoTaArmata.text	
ltx/en_uk_ware/he.h.m3:heHE.FotiToAnespero.greekname	Φωτὶ τῷ ἀνεσπέρῳ.
ltx/en_uk_ware/he.h.m3:heHE.FotiToAnespero.incipit	…
ltx/en_uk_ware/he.h.m3:heHE.FotiToAnespero.melody	@ltx/en_uk_ware/miscellanea:misc.HeirmosNotMetered
ltx/en_uk_ware/he.h.m3:heHE.FotiToAnespero.mode	@ltx/en_uk_ware/miscellanea:misc.Mode3
ltx/en_uk_ware/he.h.m3:heHE.FotiToAnespero.name	(NM)
ltx/en_uk_ware/he.h.m3:heHE.FotiToAnespero.ode	@ltx/en_uk_ware/miscellanea:misc.Ode5
ltx/en_uk_ware/he.h.m3:heHE.FotiToAnespero.text	
ltx/en_uk_ware/he.h.m3:heHE.IdeteIdete.greekname	
ltx/en_uk_ware/he.h.m3:heHE.IdeteIdete.incipit	See now, see…
ltx/en_uk_ware/he.h.m3:heHE.IdeteIdete.melody	@ltx/en_uk_ware/miscellanea:misc.HeirmosNotMetered
ltx/en_uk_ware/he.h.m3:heHE.IdeteIdete.mode	@ltx/en_uk_ware/miscellanea:misc.Mode3
ltx/en_uk_ware/he.h.m3:heHE.IdeteIdete.name	(NM) See now, see.
ltx/en_uk_ware/he.h.m3:heHE.IdeteIdete.ode	@ltx/en_uk_ware/miscellanea:misc.Ode2
ltx/en_uk_ware/he.h.m3:heHE.IdeteIdete.text	See now, see, that I am the Saviour of the world, the true Light, the Fountain of life, the Son of God.
ltx/en_uk_ware/he.h.m3:heHE.KainonToThavma.greekname	
ltx/en_uk_ware/he.h.m3:heHE.KainonToThavma.incipit	…
ltx/en_uk_ware/he.h.m3:heHE.KainonToThavma.melody	@ltx/en_uk_ware/miscellanea:misc.HeirmosNotMetered
ltx/en_uk_ware/he.h.m3:heHE.KainonToThavma.mode	@ltx/en_uk_ware/miscellanea:misc.Mode3
ltx/en_uk_ware/he.h.m3:heHE.KainonToThavma.name	(NM)
ltx/en_uk_ware/he.h.m3:heHE.KainonToThavma.ode	@ltx/en_uk_ware/miscellanea:misc.Ode9
ltx/en_uk_ware/he.h.m3:heHE.KainonToThavma.text	
ltx/en_uk_ware/he.h.m3:heHE.LatreveinZontiTheo.greekname	
ltx/en_uk_ware/he.h.m3:heHE.LatreveinZontiTheo.incipit	…
ltx/en_uk_ware/he.h.m3:heHE.LatreveinZontiTheo.melody	@ltx/en_uk_ware/miscellanea:misc.HeirmosNotMetered
ltx/en_uk_ware/he.h.m3:heHE.LatreveinZontiTheo.mode	@ltx/en_uk_ware/miscellanea:misc.Mode3
ltx/en_uk_ware/he.h.m3:heHE.LatreveinZontiTheo.name	(NM)
ltx/en_uk_ware/he.h.m3:heHE.LatreveinZontiTheo.ode	@ltx/en_uk_ware/miscellanea:misc.Ode8
ltx/en_uk_ware/he.h.m3:heHE.LatreveinZontiTheo.text	
ltx/en_uk_ware/he.h.m3:heHE.MiEnPotamois.greekname	
ltx/en_uk_ware/he.h.m3:heHE.MiEnPotamois.incipit	(ΝΜ) Wast Thou angry with the rivers…
ltx/en_uk_ware/he.h.m3:heHE.MiEnPotamois.melody	@ltx/en_uk_ware/miscellanea:misc.HeirmosNotMetered
ltx/en_uk_ware/he.h.m3:heHE.MiEnPotamois.mode	@ltx/en_uk_ware/miscellanea:misc.Mode3
ltx/en_uk_ware/he.h.m3:heHE.MiEnPotamois.name	(ΝΜ) Wast Thou angry with the rivers.
ltx/en_uk_ware/he.h.m3:heHE.MiEnPotamois.ode	@ltx/en_uk_ware/miscellanea:misc.Ode4
ltx/en_uk_ware/he.h.m3:heHE.MiEnPotamois.text	
ltx/en_uk_ware/he.h.m3:heHE.OEkMiOnton.greekname	
ltx/en_uk_ware/he.h.m3:heHE.OEkMiOnton.incipit	…
ltx/en_uk_ware/he.h.m3:heHE.OEkMiOnton.melody	@ltx/en_uk_ware/miscellanea:misc.HeirmosNotMetered
ltx/en_uk_ware/he.h.m3:heHE.OEkMiOnton.mode	@ltx/en_uk_ware/miscellanea:misc.Mode3
ltx/en_uk_ware/he.h.m3:heHE.OEkMiOnton.name	(NM)
ltx/en_uk_ware/he.h.m3:heHE.OEkMiOnton.ode	@ltx/en_uk_ware/miscellanea:misc.Ode3
ltx/en_uk_ware/he.h.m3:heHE.OEkMiOnton.text	
ltx/en_uk_ware/he.h.m3:heHE.OTaYdata.greekname	
ltx/en_uk_ware/he.h.m3:heHE.OTaYdata.incipit	…
ltx/en_uk_ware/he.h.m3:heHE.OTaYdata.melody	@ltx/en_uk_ware/miscellanea:misc.HeirmosNotMetered
ltx/en_uk_ware/he.h.m3:heHE.OTaYdata.mode	@ltx/en_uk_ware/miscellanea:misc.Mode3
ltx/en_uk_ware/he.h.m3:heHE.OTaYdata.name	(NM)
ltx/en_uk_ware/he.h.m3:heHE.OTaYdata.ode	@ltx/en_uk_ware/miscellanea:misc.Ode1
ltx/en_uk_ware/he.h.m3:heHE.OTaYdata.text	
ltx/en_uk_ware/he.h.m3:heHE.OTinFloga.greekname	Ὁ τὴν φλόγα.
ltx/en_uk_ware/he.h.m3:heHE.OTinFloga.incipit	Thou hast shed dew…
ltx/en_uk_ware/he.h.m3:heHE.OTinFloga.melody	@ltx/en_uk_ware/miscellanea:misc.HeirmosNotMetered
ltx/en_uk_ware/he.h.m3:heHE.OTinFloga.mode	@ltx/en_uk_ware/miscellanea:misc.Mode3
ltx/en_uk_ware/he.h.m3:heHE.OTinFloga.name	(NM) Thou hast shed dew.
ltx/en_uk_ware/he.h.m3:heHE.OTinFloga.ode	@ltx/en_uk_ware/miscellanea:misc.Ode7
ltx/en_uk_ware/he.h.m3:heHE.OTinFloga.text	Thou hast shed dew upon the furnace and saved the Children from its flames: blessed art Thou for ever, O Lord God of our fathers.
ltx/en_uk_ware/he.h.m3:heHE.OiToGlykei.greekname	
ltx/en_uk_ware/he.h.m3:heHE.OiToGlykei.incipit	…
ltx/en_uk_ware/he.h.m3:heHE.OiToGlykei.melody	@ltx/en_uk_ware/miscellanea:misc.HeirmosNotMetered
ltx/en_uk_ware/he.h.m3:heHE.OiToGlykei.mode	@ltx/en_uk_ware/miscellanea:misc.Mode3
ltx/en_uk_ware/he.h.m3:heHE.OiToGlykei.name	(NM)
ltx/en_uk_ware/he.h.m3:heHE.OiToGlykei.ode	@ltx/en_uk_ware/miscellanea:misc.Ode9
ltx/en_uk_ware/he.h.m3:heHE.OiToGlykei.text	
ltx/en_uk_ware/he.h.m3:heHE.OrthrizontesAnymnoumen.greekname	
ltx/en_uk_ware/he.h.m3:heHE.OrthrizontesAnymnoumen.incipit	…
ltx/en_uk_ware/he.h.m3:heHE.OrthrizontesAnymnoumen.melody	@ltx/en_uk_ware/miscellanea:misc.HeirmosNotMetered
ltx/en_uk_ware/he.h.m3:heHE.OrthrizontesAnymnoumen.mode	@ltx/en_uk_ware/miscellanea:misc.Mode3
ltx/en_uk_ware/he.h.m3:heHE.OrthrizontesAnymnoumen.name	(NM)
ltx/en_uk_ware/he.h.m3:heHE.OrthrizontesAnymnoumen.ode	@ltx/en_uk_ware/miscellanea:misc.Ode5
ltx/en_uk_ware/he.h.m3:heHE.OrthrizontesAnymnoumen.text	
ltx/en_uk_ware/he.h.m3:heHE.OsEidenIsaias.greekname	
ltx/en_uk_ware/he.h.m3:heHE.OsEidenIsaias.incipit	…
ltx/en_uk_ware/he.h.m3:heHE.OsEidenIsaias.melody	@ltx/en_uk_ware/miscellanea:misc.HeirmosNotMetered
ltx/en_uk_ware/he.h.m3:heHE.OsEidenIsaias.mode	@ltx/en_uk_ware/miscellanea:misc.Mode3
ltx/en_uk_ware/he.h.m3:heHE.OsEidenIsaias.name	(NM)
ltx/en_uk_ware/he.h.m3:heHE.OsEidenIsaias.ode	@ltx/en_uk_ware/miscellanea:misc.Ode5
ltx/en_uk_ware/he.h.m3:heHE.OsEidenIsaias.text	
ltx/en_uk_ware/he.h.m3:heHE.OsOmvrosEpAgrostin.greekname	
ltx/en_uk_ware/he.h.m3:heHE.OsOmvrosEpAgrostin.incipit	As rain upon the meadow…
ltx/en_uk_ware/he.h.m3:heHE.OsOmvrosEpAgrostin.melody	@ltx/en_uk_ware/miscellanea:misc.HeirmosNotMetered
ltx/en_uk_ware/he.h.m3:heHE.OsOmvrosEpAgrostin.mode	@ltx/en_uk_ware/miscellanea:misc.Mode3
ltx/en_uk_ware/he.h.m3:heHE.OsOmvrosEpAgrostin.name	(NM) As rain upon the meadow.
ltx/en_uk_ware/he.h.m3:heHE.OsOmvrosEpAgrostin.ode	@ltx/en_uk_ware/miscellanea:misc.Ode2
ltx/en_uk_ware/he.h.m3:heHE.OsOmvrosEpAgrostin.text	As rain upon the meadow and snow upon the grass, let my words fall upon the earth.
ltx/en_uk_ware/he.h.m3:heHE.OsPalaiTousEfseveis.greekname	
ltx/en_uk_ware/he.h.m3:heHE.OsPalaiTousEfseveis.incipit	…
ltx/en_uk_ware/he.h.m3:heHE.OsPalaiTousEfseveis.melody	@ltx/en_uk_ware/miscellanea:misc.HeirmosNotMetered
ltx/en_uk_ware/he.h.m3:heHE.OsPalaiTousEfseveis.mode	@ltx/en_uk_ware/miscellanea:misc.Mode3
ltx/en_uk_ware/he.h.m3:heHE.OsPalaiTousEfseveis.name	(NM)
ltx/en_uk_ware/he.h.m3:heHE.OsPalaiTousEfseveis.ode	@ltx/en_uk_ware/miscellanea:misc.Ode7
ltx/en_uk_ware/he.h.m3:heHE.OsPalaiTousEfseveis.text	
ltx/en_uk_ware/he.h.m3:heHE.ProsSeOrthrizo.greekname	
ltx/en_uk_ware/he.h.m3:heHE.ProsSeOrthrizo.incipit	…
ltx/en_uk_ware/he.h.m3:heHE.ProsSeOrthrizo.melody	@ltx/en_uk_ware/miscellanea:misc.HeirmosNotMetered
ltx/en_uk_ware/he.h.m3:heHE.ProsSeOrthrizo.mode	@ltx/en_uk_ware/miscellanea:misc.Mode3
ltx/en_uk_ware/he.h.m3:heHE.ProsSeOrthrizo.name	(NM)
ltx/en_uk_ware/he.h.m3:heHE.ProsSeOrthrizo.ode	@ltx/en_uk_ware/miscellanea:misc.Ode5
ltx/en_uk_ware/he.h.m3:heHE.ProsSeOrthrizo.text	
ltx/en_uk_ware/he.h.m3:heHE.ProsecheGiKaiOurane.greekname	
ltx/en_uk_ware/he.h.m3:heHE.ProsecheGiKaiOurane.incipit	Hearken, O earth…
ltx/en_uk_ware/he.h.m3:heHE.ProsecheGiKaiOurane.melody	@ltx/en_uk_ware/miscellanea:misc.HeirmosNotMetered
ltx/en_uk_ware/he.h.m3:heHE.ProsecheGiKaiOurane.mode	@ltx/en_uk_ware/miscellanea:misc.Mode3
ltx/en_uk_ware/he.h.m3:heHE.ProsecheGiKaiOurane.name	(NM) Hearken, O earth.
ltx/en_uk_ware/he.h.m3:heHE.ProsecheGiKaiOurane.ode	@ltx/en_uk_ware/miscellanea:misc.Ode2
ltx/en_uk_ware/he.h.m3:heHE.ProsecheGiKaiOurane.text	Hearken, O earth, and give ear to my words, O heaven: for I shall tell to those on earth the wonders of God.
ltx/en_uk_ware/he.h.m3:heHE.SeTinAkataflekton.greekname	
ltx/en_uk_ware/he.h.m3:heHE.SeTinAkataflekton.incipit	O Holy Virgin, Bush that burned…
ltx/en_uk_ware/he.h.m3:heHE.SeTinAkataflekton.melody	@ltx/en_uk_ware/miscellanea:misc.HeirmosNotMetered
ltx/en_uk_ware/he.h.m3:heHE.SeTinAkataflekton.mode	@ltx/en_uk_ware/miscellanea:misc.Mode3
ltx/en_uk_ware/he.h.m3:heHE.SeTinAkataflekton.name	(NM) O Holy Virgin, Bush that burned.
ltx/en_uk_ware/he.h.m3:heHE.SeTinAkataflekton.ode	@ltx/en_uk_ware/miscellanea:misc.Ode9
ltx/en_uk_ware/he.h.m3:heHE.SeTinAkataflekton.text	
ltx/en_uk_ware/he.h.m3:heHE.SeTinAthanaton.greekname	
ltx/en_uk_ware/he.h.m3:heHE.SeTinAthanaton.incipit	Thou art the immortal fountain…
ltx/en_uk_ware/he.h.m3:heHE.SeTinAthanaton.melody	@ltx/en_uk_ware/miscellanea:misc.HeirmosNotMetered
ltx/en_uk_ware/he.h.m3:heHE.SeTinAthanaton.mode	@ltx/en_uk_ware/miscellanea:misc.Mode3
ltx/en_uk_ware/he.h.m3:heHE.SeTinAthanaton.name	(NM) Thou art the immortal fountain.
ltx/en_uk_ware/he.h.m3:heHE.SeTinAthanaton.ode	@ltx/en_uk_ware/miscellanea:misc.Ode9
ltx/en_uk_ware/he.h.m3:heHE.SeTinAthanaton.text	Thou art the immortal fountain, who through the saints givest healing unto all mankind: we magnify thee, O pure Virgin, for thou dost save our souls.
ltx/en_uk_ware/he.h.m3:heHE.SeTonEnPyri.greekname	
ltx/en_uk_ware/he.h.m3:heHE.SeTonEnPyri.incipit	…
ltx/en_uk_ware/he.h.m3:heHE.SeTonEnPyri.melody	@ltx/en_uk_ware/miscellanea:misc.HeirmosNotMetered
ltx/en_uk_ware/he.h.m3:heHE.SeTonEnPyri.mode	@ltx/en_uk_ware/miscellanea:misc.Mode3
ltx/en_uk_ware/he.h.m3:heHE.SeTonEnPyri.name	(NM)
ltx/en_uk_ware/he.h.m3:heHE.SeTonEnPyri.ode	@ltx/en_uk_ware/miscellanea:misc.Ode7
ltx/en_uk_ware/he.h.m3:heHE.SeTonEnPyri.text	
ltx/en_uk_ware/he.h.m3:heHE.SkinoseosIonas.greekname	
ltx/en_uk_ware/he.h.m3:heHE.SkinoseosIonas.incipit	…
ltx/en_uk_ware/he.h.m3:heHE.SkinoseosIonas.melody	@ltx/en_uk_ware/miscellanea:misc.HeirmosNotMetered
ltx/en_uk_ware/he.h.m3:heHE.SkinoseosIonas.mode	@ltx/en_uk_ware/miscellanea:misc.Mode3
ltx/en_uk_ware/he.h.m3:heHE.SkinoseosIonas.name	(NM)
ltx/en_uk_ware/he.h.m3:heHE.SkinoseosIonas.ode	@ltx/en_uk_ware/miscellanea:misc.Ode6
ltx/en_uk_ware/he.h.m3:heHE.SkinoseosIonas.text	
ltx/en_uk_ware/he.h.m3:heHE.SovarosOTyrannos.greekname	
ltx/en_uk_ware/he.h.m3:heHE.SovarosOTyrannos.incipit	…
ltx/en_uk_ware/he.h.m3:heHE.SovarosOTyrannos.melody	@ltx/en_uk_ware/miscellanea:misc.HeirmosNotMetered
ltx/en_uk_ware/he.h.m3:heHE.SovarosOTyrannos.mode	@ltx/en_uk_ware/miscellanea:misc.Mode3
ltx/en_uk_ware/he.h.m3:heHE.SovarosOTyrannos.name	(NM)
ltx/en_uk_ware/he.h.m3:heHE.SovarosOTyrannos.ode	@ltx/en_uk_ware/miscellanea:misc.Ode7
ltx/en_uk_ware/he.h.m3:heHE.SovarosOTyrannos.text	
ltx/en_uk_ware/he.h.m3:heHE.SteiraPsychi.greekname	Στεῖρα ψυχή.
ltx/en_uk_ware/he.h.m3:heHE.SteiraPsychi.incipit	O barren and infertile soul…
ltx/en_uk_ware/he.h.m3:heHE.SteiraPsychi.melody	@ltx/en_uk_ware/miscellanea:misc.HeirmosNotMetered
ltx/en_uk_ware/he.h.m3:heHE.SteiraPsychi.mode	@ltx/en_uk_ware/miscellanea:misc.Mode3
ltx/en_uk_ware/he.h.m3:heHE.SteiraPsychi.name	(NM) O barren and infertile soul.
ltx/en_uk_ware/he.h.m3:heHE.SteiraPsychi.ode	@ltx/en_uk_ware/miscellanea:misc.Ode3
ltx/en_uk_ware/he.h.m3:heHE.SteiraPsychi.text	O barren and infertile soul, bear a crop of glorious fruit and cry with joy: Thou hast firmly established me, O God; there is none holy and none righteous save Thee, O Lord.
ltx/en_uk_ware/he.h.m3:heHE.StereosonKyrie.greekname	
ltx/en_uk_ware/he.h.m3:heHE.StereosonKyrie.incipit	Firmly establish our hearts…
ltx/en_uk_ware/he.h.m3:heHE.StereosonKyrie.melody	@ltx/en_uk_ware/miscellanea:misc.HeirmosNotMetered
ltx/en_uk_ware/he.h.m3:heHE.StereosonKyrie.mode	@ltx/en_uk_ware/miscellanea:misc.Mode3
ltx/en_uk_ware/he.h.m3:heHE.StereosonKyrie.name	(NM) Firmly establish our hearts.
ltx/en_uk_ware/he.h.m3:heHE.StereosonKyrie.ode	@ltx/en_uk_ware/miscellanea:misc.Ode3
ltx/en_uk_ware/he.h.m3:heHE.StereosonKyrie.text	Firmly establish our hearts, O Lord, and give us light that we may sing Thy praise and glorify Thee for ever, O Saviour.
ltx/en_uk_ware/he.h.m3:heHE.TemnomeninThalassan.greekname	
ltx/en_uk_ware/he.h.m3:heHE.TemnomeninThalassan.incipit	…
ltx/en_uk_ware/he.h.m3:heHE.TemnomeninThalassan.melody	@ltx/en_uk_ware/miscellanea:misc.HeirmosNotMetered
ltx/en_uk_ware/he.h.m3:heHE.TemnomeninThalassan.mode	@ltx/en_uk_ware/miscellanea:misc.Mode3
ltx/en_uk_ware/he.h.m3:heHE.TemnomeninThalassan.name	(NM)
ltx/en_uk_ware/he.h.m3:heHE.TemnomeninThalassan.ode	@ltx/en_uk_ware/miscellanea:misc.Ode1
ltx/en_uk_ware/he.h.m3:heHE.TemnomeninThalassan.text	
ltx/en_uk_ware/he.h.m3:heHE.ThavmastosEndoxos.greekname	Θαυμαστὸς ἐνδόξως.
ltx/en_uk_ware/he.h.m3:heHE.ThavmastosEndoxos.incipit	…
ltx/en_uk_ware/he.h.m3:heHE.ThavmastosEndoxos.melody	@ltx/en_uk_ware/miscellanea:misc.HeirmosNotMetered
ltx/en_uk_ware/he.h.m3:heHE.ThavmastosEndoxos.mode	@ltx/en_uk_ware/miscellanea:misc.Mode3
ltx/en_uk_ware/he.h.m3:heHE.ThavmastosEndoxos.name	(NM)
ltx/en_uk_ware/he.h.m3:heHE.ThavmastosEndoxos.ode	@ltx/en_uk_ware/miscellanea:misc.Ode1
ltx/en_uk_ware/he.h.m3:heHE.ThavmastosEndoxos.text	
ltx/en_uk_ware/he.h.m3:heHE.TinEnVatoKaiPyri.greekname	
ltx/en_uk_ware/he.h.m3:heHE.TinEnVatoKaiPyri.incipit	…
ltx/en_uk_ware/he.h.m3:heHE.TinEnVatoKaiPyri.melody	@ltx/en_uk_ware/miscellanea:misc.HeirmosNotMetered
ltx/en_uk_ware/he.h.m3:heHE.TinEnVatoKaiPyri.mode	@ltx/en_uk_ware/miscellanea:misc.Mode3
ltx/en_uk_ware/he.h.m3:heHE.TinEnVatoKaiPyri.name	(NM)
ltx/en_uk_ware/he.h.m3:heHE.TinEnVatoKaiPyri.ode	@ltx/en_uk_ware/miscellanea:misc.Ode9
ltx/en_uk_ware/he.h.m3:heHE.TinEnVatoKaiPyri.text	
ltx/en_uk_ware/he.h.m3:heHE.TinSinEirinin.greekname	
ltx/en_uk_ware/he.h.m3:heHE.TinSinEirinin.incipit	…
ltx/en_uk_ware/he.h.m3:heHE.TinSinEirinin.melody	@ltx/en_uk_ware/miscellanea:misc.HeirmosNotMetered
ltx/en_uk_ware/he.h.m3:heHE.TinSinEirinin.mode	@ltx/en_uk_ware/miscellanea:misc.Mode3
ltx/en_uk_ware/he.h.m3:heHE.TinSinEirinin.name	(NM)
ltx/en_uk_ware/he.h.m3:heHE.TinSinEirinin.ode	@ltx/en_uk_ware/miscellanea:misc.Ode5
ltx/en_uk_ware/he.h.m3:heHE.TinSinEirinin.text	
ltx/en_uk_ware/he.h.m3:heHE.ToFosSouToAnesperon.greekname	
ltx/en_uk_ware/he.h.m3:heHE.ToFosSouToAnesperon.incipit	…
ltx/en_uk_ware/he.h.m3:heHE.ToFosSouToAnesperon.melody	@ltx/en_uk_ware/miscellanea:misc.HeirmosNotMetered
ltx/en_uk_ware/he.h.m3:heHE.ToFosSouToAnesperon.mode	@ltx/en_uk_ware/miscellanea:misc.Mode3
ltx/en_uk_ware/he.h.m3:heHE.ToFosSouToAnesperon.name	(NM)
ltx/en_uk_ware/he.h.m3:heHE.ToFosSouToAnesperon.ode	@ltx/en_uk_ware/miscellanea:misc.Ode5
ltx/en_uk_ware/he.h.m3:heHE.ToFosSouToAnesperon.text	
ltx/en_uk_ware/he.h.m3:heHE.ToKataskionOros.greekname	Τὸ κατάσκιον ὄρος.
ltx/en_uk_ware/he.h.m3:heHE.ToKataskionOros.incipit	…
ltx/en_uk_ware/he.h.m3:heHE.ToKataskionOros.melody	@ltx/en_uk_ware/miscellanea:misc.HeirmosNotMetered
ltx/en_uk_ware/he.h.m3:heHE.ToKataskionOros.mode	@ltx/en_uk_ware/miscellanea:misc.Mode3
ltx/en_uk_ware/he.h.m3:heHE.ToKataskionOros.name	(NM)
ltx/en_uk_ware/he.h.m3:heHE.ToKataskionOros.ode	@ltx/en_uk_ware/miscellanea:misc.Ode4
ltx/en_uk_ware/he.h.m3:heHE.ToKataskionOros.text	
ltx/en_uk_ware/he.h.m3:heHE.ToPrinEikoni.greekname	
ltx/en_uk_ware/he.h.m3:heHE.ToPrinEikoni.incipit	…
ltx/en_uk_ware/he.h.m3:heHE.ToPrinEikoni.melody	@ltx/en_uk_ware/miscellanea:misc.HeirmosNotMetered
ltx/en_uk_ware/he.h.m3:heHE.ToPrinEikoni.mode	@ltx/en_uk_ware/miscellanea:misc.Mode3
ltx/en_uk_ware/he.h.m3:heHE.ToPrinEikoni.name	(NM)
ltx/en_uk_ware/he.h.m3:heHE.ToPrinEikoni.ode	@ltx/en_uk_ware/miscellanea:misc.Ode7
ltx/en_uk_ware/he.h.m3:heHE.ToPrinEikoni.text	
ltx/en_uk_ware/he.h.m3:heHE.ToStereoma.greekname	
ltx/en_uk_ware/he.h.m3:heHE.ToStereoma.incipit	…
ltx/en_uk_ware/he.h.m3:heHE.ToStereoma.melody	@ltx/en_uk_ware/miscellanea:misc.HeirmosNotMetered
ltx/en_uk_ware/he.h.m3:heHE.ToStereoma.mode	@ltx/en_uk_ware/miscellanea:misc.Mode3
ltx/en_uk_ware/he.h.m3:heHE.ToStereoma.name	(NM)
ltx/en_uk_ware/he.h.m3:heHE.ToStereoma.ode	@ltx/en_uk_ware/miscellanea:misc.Ode3
ltx/en_uk_ware/he.h.m3:heHE.ToStereoma.text	
ltx/en_uk_ware/he.h.m3:heHE.ToXenonKaiAporriton.greekname	
ltx/en_uk_ware/he.h.m3:heHE.ToXenonKaiAporriton.incipit	…
ltx/en_uk_ware/he.h.m3:heHE.ToXenonKaiAporriton.melody	@ltx/en_uk_ware/miscellanea:misc.HeirmosNotMetered
ltx/en_uk_ware/he.h.m3:heHE.ToXenonKaiAporriton.mode	@ltx/en_uk_ware/miscellanea:misc.Mode3
ltx/en_uk_ware/he.h.m3:heHE.ToXenonKaiAporriton.name	(NM)
ltx/en_uk_ware/he.h.m3:heHE.ToXenonKaiAporriton.ode	@ltx/en_uk_ware/miscellanea:misc.Ode4
ltx/en_uk_ware/he.h.m3:heHE.ToXenonKaiAporriton.text	
ltx/en_uk_ware/he.h.m3:heHE.TonEnFlogi.greekname	
ltx/en_uk_ware/he.h.m3:heHE.TonEnFlogi.incipit	In His divine power…
ltx/en_uk_ware/he.h.m3:heHE.TonEnFlogi.melody	@ltx/en_uk_ware/miscellanea:misc.HeirmosNotMetered
ltx/en_uk_ware/he.h.m3:heHE.TonEnFlogi.mode	@ltx/en_uk_ware/miscellanea:misc.Mode3
ltx/en_uk_ware/he.h.m3:heHE.TonEnFlogi.name	(NM) In His divine power.
ltx/en_uk_ware/he.h.m3:heHE.TonEnFlogi.ode	@ltx/en_uk_ware/miscellanea:misc.Ode8
ltx/en_uk_ware/he.h.m3:heHE.TonEnFlogi.text	In His divine power the Lord descended into the flames and was seen walking with the Children of the Hebrews: O ye priests, bless and exalt Him above all for ever.
ltx/en_uk_ware/he.h.m3:heHE.TonExAnarchou.greekname	
ltx/en_uk_ware/he.h.m3:heHE.TonExAnarchou.incipit	Begotten as God…
ltx/en_uk_ware/he.h.m3:heHE.TonExAnarchou.melody	@ltx/en_uk_ware/miscellanea:misc.HeirmosNotMetered
ltx/en_uk_ware/he.h.m3:heHE.TonExAnarchou.mode	@ltx/en_uk_ware/miscellanea:misc.Mode3
ltx/en_uk_ware/he.h.m3:heHE.TonExAnarchou.name	(NM) Begotten as God.
ltx/en_uk_ware/he.h.m3:heHE.TonExAnarchou.ode	@ltx/en_uk_ware/miscellanea:misc.Ode8
ltx/en_uk_ware/he.h.m3:heHE.TonExAnarchou.text	Begotten as God before all ages from the Father without beginning, He has in the last times clothed Himself in flesh taken from the Theotokos: O sing His praises as true man and perfect God, and bless and exalt Him above all for ever.
ltx/en_uk_ware/he.h.m3:heHE.TonYpAngelon.greekname	Τὸν ὑπʼ Ἀγγέλων.
ltx/en_uk_ware/he.h.m3:heHE.TonYpAngelon.incipit	God is glorified…
ltx/en_uk_ware/he.h.m3:heHE.TonYpAngelon.melody	@ltx/en_uk_ware/miscellanea:misc.HeirmosNotMetered
ltx/en_uk_ware/he.h.m3:heHE.TonYpAngelon.mode	@ltx/en_uk_ware/miscellanea:misc.Mode3
ltx/en_uk_ware/he.h.m3:heHE.TonYpAngelon.name	(NM) God is glorified.
ltx/en_uk_ware/he.h.m3:heHE.TonYpAngelon.ode	@ltx/en_uk_ware/miscellanea:misc.Ode8
ltx/en_uk_ware/he.h.m3:heHE.TonYpAngelon.text	God is glorified on high by the angels with never-silent voices; let the heaven of heavens, the earth and the mountains, the hills and the deep and all mankind sing to Him, their Maker and Creator, bless, praise and exalt Him above all for ever.
ltx/en_uk_ware/he.h.m3:heHE.TousEisTaTeli.greekname	
ltx/en_uk_ware/he.h.m3:heHE.TousEisTaTeli.incipit	…
ltx/en_uk_ware/he.h.m3:heHE.TousEisTaTeli.melody	@ltx/en_uk_ware/miscellanea:misc.HeirmosNotMetered
ltx/en_uk_ware/he.h.m3:heHE.TousEisTaTeli.mode	@ltx/en_uk_ware/miscellanea:misc.Mode3
ltx/en_uk_ware/he.h.m3:heHE.TousEisTaTeli.name	(NM)
ltx/en_uk_ware/he.h.m3:heHE.TousEisTaTeli.ode	@ltx/en_uk_ware/miscellanea:misc.Ode6
ltx/en_uk_ware/he.h.m3:heHE.TousEisTaTeli.text	
ltx/en_uk_ware/he.h.m3:heHE.ToxonEthrafsasEchthron.greekname	
ltx/en_uk_ware/he.h.m3:heHE.ToxonEthrafsasEchthron.incipit	…
ltx/en_uk_ware/he.h.m3:heHE.ToxonEthrafsasEchthron.melody	@ltx/en_uk_ware/miscellanea:misc.HeirmosNotMetered
ltx/en_uk_ware/he.h.m3:heHE.ToxonEthrafsasEchthron.mode	@ltx/en_uk_ware/miscellanea:misc.Mode3
ltx/en_uk_ware/he.h.m3:heHE.ToxonEthrafsasEchthron.name	(NM)
ltx/en_uk_ware/he.h.m3:heHE.ToxonEthrafsasEchthron.ode	@ltx/en_uk_ware/miscellanea:misc.Ode3
ltx/en_uk_ware/he.h.m3:heHE.ToxonEthrafsasEchthron.text	
ltx/en_uk_ware/he.h.m3:heHE.TreisPaidesEnKamino.greekname	
ltx/en_uk_ware/he.h.m3:heHE.TreisPaidesEnKamino.incipit	…
ltx/en_uk_ware/he.h.m3:heHE.TreisPaidesEnKamino.melody	@ltx/en_uk_ware/miscellanea:misc.HeirmosNotMetered
ltx/en_uk_ware/he.h.m3:heHE.TreisPaidesEnKamino.mode	@ltx/en_uk_ware/miscellanea:misc.Mode3
ltx/en_uk_ware/he.h.m3:heHE.TreisPaidesEnKamino.name	(NM)
ltx/en_uk_ware/he.h.m3:heHE.TreisPaidesEnKamino.ode	@ltx/en_uk_ware/miscellanea:misc.Ode7
ltx/en_uk_ware/he.h.m3:heHE.TreisPaidesEnKamino.text	
ltx/en_uk_ware/he.h.m3:heHE.VavyloniaKaminos.greekname	
ltx/en_uk_ware/he.h.m3:heHE.VavyloniaKaminos.incipit	…
ltx/en_uk_ware/he.h.m3:heHE.VavyloniaKaminos.melody	@ltx/en_uk_ware/miscellanea:misc.HeirmosNotMetered
ltx/en_uk_ware/he.h.m3:heHE.VavyloniaKaminos.mode	@ltx/en_uk_ware/miscellanea:misc.Mode3
ltx/en_uk_ware/he.h.m3:heHE.VavyloniaKaminos.name	(NM)
ltx/en_uk_ware/he.h.m3:heHE.VavyloniaKaminos.ode	@ltx/en_uk_ware/miscellanea:misc.Ode8
ltx/en_uk_ware/he.h.m3:heHE.VavyloniaKaminos.text	
ltx/en_uk_ware/he.h.m3:heHE.VythosMoiTonPathon.greekname	Βυθός μοι τῶν παθῶν.
ltx/en_uk_ware/he.h.m3:heHE.VythosMoiTonPathon.incipit	The deep waters of the passions…
ltx/en_uk_ware/he.h.m3:heHE.VythosMoiTonPathon.melody	@ltx/en_uk_ware/miscellanea:misc.HeirmosNotMetered
ltx/en_uk_ware/he.h.m3:heHE.VythosMoiTonPathon.mode	@ltx/en_uk_ware/miscellanea:misc.Mode3
ltx/en_uk_ware/he.h.m3:heHE.VythosMoiTonPathon.name	(NM) The deep waters of the passions.
ltx/en_uk_ware/he.h.m3:heHE.VythosMoiTonPathon.ode	@ltx/en_uk_ware/miscellanea:misc.Ode6
ltx/en_uk_ware/he.h.m3:heHE.VythosMoiTonPathon.text	The deep waters of the passions and a storm of adverse winds have risen up against me. Make haste, O Saviour, to save me, and to deliver me from corruption, as Thou hast delivered the Prophet from the whale.
