ltx/en_uk_ware/tr.d049:trCO.header	
ltx/en_uk_ware/tr.d049:trDA.commemoration.full	
ltx/en_uk_ware/tr.d049:trDA.commemoration.short	
ltx/en_uk_ware/tr.d049:trDA.dismissal	
ltx/en_uk_ware/tr.d049:trDA.insert1	
ltx/en_uk_ware/tr.d049:trDA.insert2	
ltx/en_uk_ware/tr.d049:trDA.note	
ltx/en_uk_ware/tr.d049:trDA.title	
ltx/en_uk_ware/tr.d049:trHO.commemorations	
ltx/en_uk_ware/tr.d049:trHO.daytitle	
ltx/en_uk_ware/tr.d049:trHO.description1	
ltx/en_uk_ware/tr.d049:trHO.description2	
ltx/en_uk_ware/tr.d049:trHO.note1	
ltx/en_uk_ware/tr.d049:trHO.note2	
ltx/en_uk_ware/tr.d049:trLI.MM.CommunionHymn.text	@ltx/en_uk_ware/properties:media.key
ltx/en_uk_ware/tr.d049:trMA.C1.acrostic.notice1	
ltx/en_uk_ware/tr.d049:trMA.C1.acrostic.text	
ltx/en_uk_ware/tr.d049:trMA.C1.acrostic.title	
ltx/en_uk_ware/tr.d049:trMA.C1.poet	@ltx/en_uk_ware/poets:po.KyriouIosif
ltx/en_uk_ware/tr.d049:trMA.C1.title	
ltx/en_uk_ware/tr.d049:trMA.C1.verse	
ltx/en_uk_ware/tr.d049:trMA.C2.poet	@ltx/en_uk_ware/poets:po.KyriouTheodorou
ltx/en_uk_ware/tr.d049:trMA.C2.title	
ltx/en_uk_ware/tr.d049:trMA.C2.verse	
ltx/en_uk_ware/tr.d049:trMA.Exaposteilarion1.greekmelody	@ltx/en_uk_ware/he.a.m3:heAU.OOuranonToisAstrois.greekname
ltx/en_uk_ware/tr.d049:trMA.Exaposteilarion1.incipit	@ltx/en_uk_ware/tr.d014:trMA.Exaposteilarion1.incipit
ltx/en_uk_ware/tr.d049:trMA.Exaposteilarion1.melody	@ltx/en_uk_ware/he.a.m3:heAU.OOuranonToisAstrois.name
ltx/en_uk_ware/tr.d049:trMA.Exaposteilarion1.mode	@ltx/en_uk_ware/miscellanea:misc.Mode3
ltx/en_uk_ware/tr.d049:trMA.Exaposteilarion1.text	@ltx/en_uk_ware/tr.d014:trMA.Exaposteilarion1.text
ltx/en_uk_ware/tr.d049:trMA.Kathisma21.incipit	@ltx/en_uk_ware/tr.d014:trMA.Kathisma21.incipit
ltx/en_uk_ware/tr.d049:trMA.Kathisma21.melody	
ltx/en_uk_ware/tr.d049:trMA.Kathisma21.mode	@ltx/en_uk_ware/miscellanea:misc.Mode5
ltx/en_uk_ware/tr.d049:trMA.Kathisma21.text	@ltx/en_uk_ware/tr.d014:trMA.Kathisma21.text
ltx/en_uk_ware/tr.d049:trMA.Kathisma21b.incipit	@ltx/en_uk_ware/tr.d014:trMA.Kathisma21b.incipit
ltx/en_uk_ware/tr.d049:trMA.Kathisma21b.melody	
ltx/en_uk_ware/tr.d049:trMA.Kathisma21b.mode	@ltx/en_uk_ware/miscellanea:misc.Mode5
ltx/en_uk_ware/tr.d049:trMA.Kathisma21b.text	@ltx/en_uk_ware/tr.d014:trMA.Kathisma21b.text
ltx/en_uk_ware/tr.d049:trMA.Kathisma22.incipit	…
ltx/en_uk_ware/tr.d049:trMA.Kathisma22.melody	@ltx/en_uk_ware/tr.d014:trMA.Kathisma22.melody
ltx/en_uk_ware/tr.d049:trMA.Kathisma22.mode	@ltx/en_uk_ware/miscellanea:misc.Mode5
ltx/en_uk_ware/tr.d049:trMA.Kathisma22.text	
ltx/en_uk_ware/tr.d049:trMA.Ode6C11.incipit	 O suffering martyrs, ye…
ltx/en_uk_ware/tr.d049:trMA.Ode6C11.melody	(NM) Crossing the sea of life.
ltx/en_uk_ware/tr.d049:trMA.Ode6C11.mode	@ltx/en_uk_ware/miscellanea:misc.Mode4
ltx/en_uk_ware/tr.d049:trMA.Ode6C11.ode	@ltx/en_uk_ware/miscellanea:misc.Ode6
ltx/en_uk_ware/tr.d049:trMA.Ode6C11.text	 O suffering martyrs, ye have surpassed the limits of the flesh, enduring the pains of torment with great patience, and so ye make easy all pain and affliction for those who sing your praises.
ltx/en_uk_ware/tr.d049:trMA.Ode6C12.incipit	The army of the holy…
ltx/en_uk_ware/tr.d049:trMA.Ode6C12.melody	(NM) Crossing the sea of life.
ltx/en_uk_ware/tr.d049:trMA.Ode6C12.mode	@ltx/en_uk_ware/miscellanea:misc.Mode4
ltx/en_uk_ware/tr.d049:trMA.Ode6C12.ode	@ltx/en_uk_ware/miscellanea:misc.Ode6
ltx/en_uk_ware/tr.d049:trMA.Ode6C12.text	The army of the holy martyrs, the faithful servants of Christ, prays to the all-holy God in union with the countless hosts of angels, that we may be delivered from our countless sins.
ltx/en_uk_ware/tr.d049:trMA.Ode6C13.incipit	Thou wast put to death…
ltx/en_uk_ware/tr.d049:trMA.Ode6C13.melody	(NM) Crossing the sea of life.
ltx/en_uk_ware/tr.d049:trMA.Ode6C13.mode	@ltx/en_uk_ware/miscellanea:misc.Mode4
ltx/en_uk_ware/tr.d049:trMA.Ode6C13.ode	@ltx/en_uk_ware/miscellanea:misc.Ode6
ltx/en_uk_ware/tr.d049:trMA.Ode6C13.text	Thou wast put to death, O Christ, and after sleeping in the tomb, Thou hast raised the dead; and in Thy great love Thou givest rest with all the saints to those who died in faith.
ltx/en_uk_ware/tr.d049:trMA.Ode6C1T.incipit	God, the Word of God…
ltx/en_uk_ware/tr.d049:trMA.Ode6C1T.melody	(NM) Crossing the sea of life.
ltx/en_uk_ware/tr.d049:trMA.Ode6C1T.mode	@ltx/en_uk_ware/miscellanea:misc.Mode4
ltx/en_uk_ware/tr.d049:trMA.Ode6C1T.ode	@ltx/en_uk_ware/miscellanea:misc.Ode6
ltx/en_uk_ware/tr.d049:trMA.Ode6C1T.text	God, the Word of God, seeking to make man godlike, took flesh from thee, pure Virgin, and became a mortal man. Entreat Him -without ceasing that we may find mercy in the hour of our examination before His judgement seat.
ltx/en_uk_ware/tr.d049:trMA.Ode6C21.greekmelody	@ltx/en_uk_ware/he.h.m4:heHE.TonPtaismatonTiZali.greekname
ltx/en_uk_ware/tr.d049:trMA.Ode6C21.incipit	Not sparing your flesh and…
ltx/en_uk_ware/tr.d049:trMA.Ode6C21.melody	@ltx/en_uk_ware/he.h.m4:heHE.TonPtaismatonTiZali.name
ltx/en_uk_ware/tr.d049:trMA.Ode6C21.mode	@ltx/en_uk_ware/miscellanea:misc.Mode4
ltx/en_uk_ware/tr.d049:trMA.Ode6C21.ode	@ltx/en_uk_ware/miscellanea:misc.Ode6
ltx/en_uk_ware/tr.d049:trMA.Ode6C21.text	Not sparing your flesh and your blood, O saints, ye stood undaunted in the face of every torture, never denying Christ; and so He has given you crowns from heaven.
ltx/en_uk_ware/tr.d049:trMA.Ode6C22.incipit	Clothed in robes of light…
ltx/en_uk_ware/tr.d049:trMA.Ode6C22.melody	@ltx/en_uk_ware/he.h.m4:heHE.TonPtaismatonTiZali.name
ltx/en_uk_ware/tr.d049:trMA.Ode6C22.mode	@ltx/en_uk_ware/miscellanea:misc.Mode4
ltx/en_uk_ware/tr.d049:trMA.Ode6C22.ode	@ltx/en_uk_ware/miscellanea:misc.Ode6
ltx/en_uk_ware/tr.d049:trMA.Ode6C22.text	Clothed in robes of light through our actions, let us go to meet the triumphant assembly of the martyrs, and let us cry aloud with songs inspired by God: O martyrs of Christ, ye shine on earth as the morning stars that herald the dawn.
ltx/en_uk_ware/tr.d049:trMA.Ode6C2A1.incipit	When your limbs were severed…
ltx/en_uk_ware/tr.d049:trMA.Ode6C2A1.melody	@ltx/en_uk_ware/he.h.m4:heHE.TonPtaismatonTiZali.name
ltx/en_uk_ware/tr.d049:trMA.Ode6C2A1.mode	@ltx/en_uk_ware/miscellanea:misc.Mode4
ltx/en_uk_ware/tr.d049:trMA.Ode6C2A1.ode	@ltx/en_uk_ware/miscellanea:misc.Ode6
ltx/en_uk_ware/tr.d049:trMA.Ode6C2A1.text	When your limbs were severed, ye rejoiced in the shedding of your blood. O ever-honoured martyrs, pray to the Lord fervently on our behalf.
ltx/en_uk_ware/tr.d049:trMA.Ode6C2A2.incipit	Thou hast formed me from…
ltx/en_uk_ware/tr.d049:trMA.Ode6C2A2.melody	@ltx/en_uk_ware/he.h.m4:heHE.TonPtaismatonTiZali.name
ltx/en_uk_ware/tr.d049:trMA.Ode6C2A2.mode	@ltx/en_uk_ware/miscellanea:misc.Mode4
ltx/en_uk_ware/tr.d049:trMA.Ode6C2A2.ode	@ltx/en_uk_ware/miscellanea:misc.Ode6
ltx/en_uk_ware/tr.d049:trMA.Ode6C2A2.text	Thou hast formed me from the earth and given me life, and hast bidden me return to the earth once more. Give rest, O Lord, to Thy servants whom Thou hast taken to Thyself, and bring them up from corruption.
ltx/en_uk_ware/tr.d049:trMA.Ode6C2H.greekmelody	@ltx/en_uk_ware/he.h.m4:heHE.TonPtaismatonTiZali.greekname
ltx/en_uk_ware/tr.d049:trMA.Ode6C2H.incipit	@ltx/en_uk_ware/he.h.m4:heHE.TonPtaismatonTiZali.incipit
ltx/en_uk_ware/tr.d049:trMA.Ode6C2H.melody	@ltx/en_uk_ware/he.h.m4:heHE.TonPtaismatonTiZali.melody
ltx/en_uk_ware/tr.d049:trMA.Ode6C2H.mode	@ltx/en_uk_ware/miscellanea:misc.Mode4
ltx/en_uk_ware/tr.d049:trMA.Ode6C2H.ode	@ltx/en_uk_ware/miscellanea:misc.Ode6
ltx/en_uk_ware/tr.d049:trMA.Ode6C2H.text	@ltx/en_uk_ware/he.h.m4:heHE.TonPtaismatonTiZali.text
ltx/en_uk_ware/tr.d049:trMA.Ode6C2T.incipit	 O blessed Bride of…
ltx/en_uk_ware/tr.d049:trMA.Ode6C2T.melody	@ltx/en_uk_ware/he.h.m4:heHE.TonPtaismatonTiZali.name
ltx/en_uk_ware/tr.d049:trMA.Ode6C2T.mode	@ltx/en_uk_ware/miscellanea:misc.Mode4
ltx/en_uk_ware/tr.d049:trMA.Ode6C2T.ode	@ltx/en_uk_ware/miscellanea:misc.Ode6
ltx/en_uk_ware/tr.d049:trMA.Ode6C2T.text	 O blessed Bride of God, how hast thou given birth without knowing a man and remained a virgin as before? For thou hast borne the dread and marvellous God. Pray for the salvation of those who sing thy praises.
ltx/en_uk_ware/tr.d049:trMA.Ode6C2Tr.incipit	Holy Trinity, I glorify Thee…
ltx/en_uk_ware/tr.d049:trMA.Ode6C2Tr.melody	@ltx/en_uk_ware/he.h.m4:heHE.TonPtaismatonTiZali.name
ltx/en_uk_ware/tr.d049:trMA.Ode6C2Tr.mode	@ltx/en_uk_ware/miscellanea:misc.Mode4
ltx/en_uk_ware/tr.d049:trMA.Ode6C2Tr.ode	@ltx/en_uk_ware/miscellanea:misc.Ode6
ltx/en_uk_ware/tr.d049:trMA.Ode6C2Tr.text	Holy Trinity, I glorify Thee, sourceless Nature, one God, one Lord, three Persons: Father, Son and Spirit, unbegotten, begotten and proceeding, self-same and everlasting.
ltx/en_uk_ware/tr.d049:trMA.Ode7C11.greekmelody	@ltx/en_uk_ware/he.h.m4:heHE.TiEikoniTiChrysi.greekname
ltx/en_uk_ware/tr.d049:trMA.Ode7C11.incipit	Putting off the corruptible flesh…
ltx/en_uk_ware/tr.d049:trMA.Ode7C11.melody	@ltx/en_uk_ware/he.h.m4:heHE.TiEikoniTiChrysi.name
ltx/en_uk_ware/tr.d049:trMA.Ode7C11.mode	@ltx/en_uk_ware/miscellanea:misc.Mode4
ltx/en_uk_ware/tr.d049:trMA.Ode7C11.ode	@ltx/en_uk_ware/miscellanea:misc.Ode7
ltx/en_uk_ware/tr.d049:trMA.Ode7C11.text	Putting off the corruptible flesh, O martyrs, ye were clothed by God with incorruption; and now ye stand in light and joy before Him who for our sake took flesh from an uncorrupted Virgin. Sin has stripped me naked: clothe me in a robe of holiness.
ltx/en_uk_ware/tr.d049:trMA.Ode7C12.incipit	The company of the victorious…
ltx/en_uk_ware/tr.d049:trMA.Ode7C12.melody	@ltx/en_uk_ware/he.h.m4:heHE.TiEikoniTiChrysi.name
ltx/en_uk_ware/tr.d049:trMA.Ode7C12.mode	@ltx/en_uk_ware/miscellanea:misc.Mode4
ltx/en_uk_ware/tr.d049:trMA.Ode7C12.ode	@ltx/en_uk_ware/miscellanea:misc.Ode7
ltx/en_uk_ware/tr.d049:trMA.Ode7C12.text	The company of the victorious martyrs, who lived in abstinence, gives us strength to run unhindered in the race of the Fast. For bravely they preached Christ in the arena, and now they stand in spiritual joy before the throne of God, crowned with the angels.
ltx/en_uk_ware/tr.d049:trMA.Ode7C13.incipit	At the prayers of Thy…
ltx/en_uk_ware/tr.d049:trMA.Ode7C13.melody	@ltx/en_uk_ware/he.h.m4:heHE.TiEikoniTiChrysi.name
ltx/en_uk_ware/tr.d049:trMA.Ode7C13.mode	@ltx/en_uk_ware/miscellanea:misc.Mode4
ltx/en_uk_ware/tr.d049:trMA.Ode7C13.ode	@ltx/en_uk_ware/miscellanea:misc.Ode7
ltx/en_uk_ware/tr.d049:trMA.Ode7C13.text	At the prayers of Thy holy martyrs, O God, make Thy servants who have fallen asleep in faith to be citizens of Paradise, and count them worthy of the spiritual light, as they cry aloud to Thee without ceasing: Blessed is the God of our fathers.
ltx/en_uk_ware/tr.d049:trMA.Ode7C1T.incipit	We entreat thee, Virgin who…
ltx/en_uk_ware/tr.d049:trMA.Ode7C1T.melody	@ltx/en_uk_ware/he.h.m4:heHE.TiEikoniTiChrysi.name
ltx/en_uk_ware/tr.d049:trMA.Ode7C1T.mode	@ltx/en_uk_ware/miscellanea:misc.Mode4
ltx/en_uk_ware/tr.d049:trMA.Ode7C1T.ode	@ltx/en_uk_ware/miscellanea:misc.Ode7
ltx/en_uk_ware/tr.d049:trMA.Ode7C1T.text	We entreat thee, Virgin who alone art full of love, cleanse us from our sinfulness; and pray fervently to Christ, for by nature He is love, that we who sing His praises may complete the time of abstinence performing acts of love.
ltx/en_uk_ware/tr.d049:trMA.Ode7C21.greekmelody	@ltx/en_uk_ware/he.h.m4:heHE.OEnToOreiToMosei.greekname
ltx/en_uk_ware/tr.d049:trMA.Ode7C21.incipit	Thou hast magnified all Thy…
ltx/en_uk_ware/tr.d049:trMA.Ode7C21.melody	@ltx/en_uk_ware/he.h.m4:heHE.OEnToOreiToMosei.name
ltx/en_uk_ware/tr.d049:trMA.Ode7C21.mode	@ltx/en_uk_ware/miscellanea:misc.Mode4
ltx/en_uk_ware/tr.d049:trMA.Ode7C21.ode	@ltx/en_uk_ware/miscellanea:misc.Ode7
ltx/en_uk_ware/tr.d049:trMA.Ode7C21.text	Thou hast magnified all Thy saints, and through signs and miracles hast made them to be honoured in all the world. O Lord God of our fathers, blessed art Thou for ever.
ltx/en_uk_ware/tr.d049:trMA.Ode7C22.incipit	Enduring every form of torture…
ltx/en_uk_ware/tr.d049:trMA.Ode7C22.melody	@ltx/en_uk_ware/he.h.m4:heHE.OEnToOreiToMosei.name
ltx/en_uk_ware/tr.d049:trMA.Ode7C22.mode	@ltx/en_uk_ware/miscellanea:misc.Mode4
ltx/en_uk_ware/tr.d049:trMA.Ode7C22.ode	@ltx/en_uk_ware/miscellanea:misc.Ode7
ltx/en_uk_ware/tr.d049:trMA.Ode7C22.text	Enduring every form of torture, O martyrs of Christ, ye refused to bend the knee to Baal; and ye have received crowns of glory from God.
ltx/en_uk_ware/tr.d049:trMA.Ode7C2A1.incipit	As soldiers of the immortal…
ltx/en_uk_ware/tr.d049:trMA.Ode7C2A1.melody	@ltx/en_uk_ware/he.h.m4:heHE.OEnToOreiToMosei.name
ltx/en_uk_ware/tr.d049:trMA.Ode7C2A1.mode	@ltx/en_uk_ware/miscellanea:misc.Mode4
ltx/en_uk_ware/tr.d049:trMA.Ode7C2A1.ode	@ltx/en_uk_ware/miscellanea:misc.Ode7
ltx/en_uk_ware/tr.d049:trMA.Ode7C2A1.text	As soldiers of the immortal King, O martyrs, showing perfect faith in Him, ye shed your blood for His sake.
ltx/en_uk_ware/tr.d049:trMA.Ode7C2A2.incipit	Where Thy living light shines…
ltx/en_uk_ware/tr.d049:trMA.Ode7C2A2.melody	@ltx/en_uk_ware/he.h.m4:heHE.OEnToOreiToMosei.name
ltx/en_uk_ware/tr.d049:trMA.Ode7C2A2.mode	@ltx/en_uk_ware/miscellanea:misc.Mode4
ltx/en_uk_ware/tr.d049:trMA.Ode7C2A2.ode	@ltx/en_uk_ware/miscellanea:misc.Ode7
ltx/en_uk_ware/tr.d049:trMA.Ode7C2A2.text	Where Thy living light shines upon them, make Thy faithful servants to dwell, whom Thou hast translated from things temporal, O Lord God of our fathers.
ltx/en_uk_ware/tr.d049:trMA.Ode7C2H.greekmelody	@ltx/en_uk_ware/he.h.m4:heHE.OEnToOreiToMosei.greekname
ltx/en_uk_ware/tr.d049:trMA.Ode7C2H.incipit	@ltx/en_uk_ware/he.h.m4:heHE.OEnToOreiToMosei.incipit
ltx/en_uk_ware/tr.d049:trMA.Ode7C2H.melody	@ltx/en_uk_ware/he.h.m4:heHE.OEnToOreiToMosei.melody
ltx/en_uk_ware/tr.d049:trMA.Ode7C2H.mode	@ltx/en_uk_ware/miscellanea:misc.Mode4
ltx/en_uk_ware/tr.d049:trMA.Ode7C2H.ode	@ltx/en_uk_ware/miscellanea:misc.Ode7
ltx/en_uk_ware/tr.d049:trMA.Ode7C2H.text	@ltx/en_uk_ware/he.h.m4:heHE.OEnToOreiToMosei.text
ltx/en_uk_ware/tr.d049:trMA.Ode7C2T.incipit	Virgin Mother, Maiden full of…
ltx/en_uk_ware/tr.d049:trMA.Ode7C2T.melody	@ltx/en_uk_ware/he.h.m4:heHE.OEnToOreiToMosei.name
ltx/en_uk_ware/tr.d049:trMA.Ode7C2T.mode	@ltx/en_uk_ware/miscellanea:misc.Mode4
ltx/en_uk_ware/tr.d049:trMA.Ode7C2T.ode	@ltx/en_uk_ware/miscellanea:misc.Ode7
ltx/en_uk_ware/tr.d049:trMA.Ode7C2T.text	Virgin Mother, Maiden full of light, our only mediator before God: never cease, O Lady, to pray for our salvation.
ltx/en_uk_ware/tr.d049:trMA.Ode7C2Tr.incipit	Essence worshipped as Trinity in…
ltx/en_uk_ware/tr.d049:trMA.Ode7C2Tr.melody	@ltx/en_uk_ware/he.h.m4:heHE.OEnToOreiToMosei.name
ltx/en_uk_ware/tr.d049:trMA.Ode7C2Tr.mode	@ltx/en_uk_ware/miscellanea:misc.Mode4
ltx/en_uk_ware/tr.d049:trMA.Ode7C2Tr.ode	@ltx/en_uk_ware/miscellanea:misc.Ode7
ltx/en_uk_ware/tr.d049:trMA.Ode7C2Tr.text	Essence worshipped as Trinity in Unity, Father, Son and Spirit, O God of our fathers, watch over those who sing Thy praises.
ltx/en_uk_ware/tr.d049:trMA.Ode8C11.incipit	O glorious martyrs of Christ…
ltx/en_uk_ware/tr.d049:trMA.Ode8C11.melody	(NM) Standing before Thee.
ltx/en_uk_ware/tr.d049:trMA.Ode8C11.mode	@ltx/en_uk_ware/miscellanea:misc.Mode4
ltx/en_uk_ware/tr.d049:trMA.Ode8C11.ode	@ltx/en_uk_ware/miscellanea:misc.Ode8
ltx/en_uk_ware/tr.d049:trMA.Ode8C11.text	O glorious martyrs of Christ, honoured by God, through your mighty prayers deliver all of us who praise your memory; release us from our heavy guilt and from torment in the life to come.
ltx/en_uk_ware/tr.d049:trMA.Ode8C12.incipit	Steadfast army of martyrs, elect…
ltx/en_uk_ware/tr.d049:trMA.Ode8C12.melody	(NM) Standing before Thee.
ltx/en_uk_ware/tr.d049:trMA.Ode8C12.mode	@ltx/en_uk_ware/miscellanea:misc.Mode4
ltx/en_uk_ware/tr.d049:trMA.Ode8C12.ode	@ltx/en_uk_ware/miscellanea:misc.Ode8
ltx/en_uk_ware/tr.d049:trMA.Ode8C12.text	Steadfast army of martyrs, elect in sanctity, through your holy prayers in these holy days of the Fast sanctify our mind and heart.
ltx/en_uk_ware/tr.d049:trMA.Ode8C13.incipit	From the worm that torments…
ltx/en_uk_ware/tr.d049:trMA.Ode8C13.melody	(NM) Standing before Thee.
ltx/en_uk_ware/tr.d049:trMA.Ode8C13.mode	@ltx/en_uk_ware/miscellanea:misc.Mode4
ltx/en_uk_ware/tr.d049:trMA.Ode8C13.ode	@ltx/en_uk_ware/miscellanea:misc.Ode8
ltx/en_uk_ware/tr.d049:trMA.Ode8C13.text	From the worm that torments, from the gnashing of teeth and the outer darkness where there is no light, O Christ our Lord, deliver the faithful whom Thou hast taken; and make them dwell where the light of Thy countenance shines for ever.
ltx/en_uk_ware/tr.d049:trMA.Ode8C1T.incipit	O pure Theotokos, we have…
ltx/en_uk_ware/tr.d049:trMA.Ode8C1T.melody	(NM) Standing before Thee.
ltx/en_uk_ware/tr.d049:trMA.Ode8C1T.mode	@ltx/en_uk_ware/miscellanea:misc.Mode4
ltx/en_uk_ware/tr.d049:trMA.Ode8C1T.ode	@ltx/en_uk_ware/miscellanea:misc.Ode8
ltx/en_uk_ware/tr.d049:trMA.Ode8C1T.text	O pure Theotokos, we have looked upon the Cross of Christ and venerated it with all our heart: through thy prayers to the Master, may we be cleansed from the passions and counted worthy to see the Holy Passion.
ltx/en_uk_ware/tr.d049:trMA.Ode8C21.greekmelody	@ltx/en_uk_ware/he.h.m4:heHE.GiKaiPantaTaEnAfti.greekname
ltx/en_uk_ware/tr.d049:trMA.Ode8C21.incipit	O happy exchange! Through your…
ltx/en_uk_ware/tr.d049:trMA.Ode8C21.melody	@ltx/en_uk_ware/he.h.m4:heHE.GiKaiPantaTaEnAfti.name
ltx/en_uk_ware/tr.d049:trMA.Ode8C21.mode	@ltx/en_uk_ware/miscellanea:misc.Mode4
ltx/en_uk_ware/tr.d049:trMA.Ode8C21.ode	@ltx/en_uk_ware/miscellanea:misc.Ode8
ltx/en_uk_ware/tr.d049:trMA.Ode8C21.text	O happy exchange! Through your death ye have gained life, O holy martyrs of Christ; ye were not afraid of fire and sword, of the cold and the wild beasts, but ye cried aloud: Praise ye the Lord and exalt Him above all for ever.
ltx/en_uk_ware/tr.d049:trMA.Ode8C22.incipit	The choir of angels on…
ltx/en_uk_ware/tr.d049:trMA.Ode8C22.melody	@ltx/en_uk_ware/he.h.m4:heHE.GiKaiPantaTaEnAfti.name
ltx/en_uk_ware/tr.d049:trMA.Ode8C22.mode	@ltx/en_uk_ware/miscellanea:misc.Mode4
ltx/en_uk_ware/tr.d049:trMA.Ode8C22.ode	@ltx/en_uk_ware/miscellanea:misc.Ode8
ltx/en_uk_ware/tr.d049:trMA.Ode8C22.text	The choir of angels on high and we men here on earth below glorify your strange sufferings and your courage, O martyrs of Christ; and we bless and praise the Lord, and exalt Him above all for ever.
ltx/en_uk_ware/tr.d049:trMA.Ode8C2A1.incipit	 O martyrs, we glorify…
ltx/en_uk_ware/tr.d049:trMA.Ode8C2A1.melody	@ltx/en_uk_ware/he.h.m4:heHE.GiKaiPantaTaEnAfti.name
ltx/en_uk_ware/tr.d049:trMA.Ode8C2A1.mode	@ltx/en_uk_ware/miscellanea:misc.Mode4
ltx/en_uk_ware/tr.d049:trMA.Ode8C2A1.ode	@ltx/en_uk_ware/miscellanea:misc.Ode8
ltx/en_uk_ware/tr.d049:trMA.Ode8C2A1.text	 O martyrs, we glorify your struggles and your sufferings; we bless and worship God the Benefactor, who gave you strength in the arena; and we exalt Him above all for ever.
ltx/en_uk_ware/tr.d049:trMA.Ode8C2A2.incipit	Thou art the Lord and…
ltx/en_uk_ware/tr.d049:trMA.Ode8C2A2.melody	@ltx/en_uk_ware/he.h.m4:heHE.GiKaiPantaTaEnAfti.name
ltx/en_uk_ware/tr.d049:trMA.Ode8C2A2.mode	@ltx/en_uk_ware/miscellanea:misc.Mode4
ltx/en_uk_ware/tr.d049:trMA.Ode8C2A2.ode	@ltx/en_uk_ware/miscellanea:misc.Ode8
ltx/en_uk_ware/tr.d049:trMA.Ode8C2A2.text	Thou art the Lord and God of death and life, who dost raise up those who died in sanctity. Make them to dwell in the tabernacles of the righteous, as they bless and praise Thee, O Lord, and exalt Thee above all for ever.
ltx/en_uk_ware/tr.d049:trMA.Ode8C2H.greekmelody	@ltx/en_uk_ware/he.h.m4:heHE.GiKaiPantaTaEnAfti.greekname
ltx/en_uk_ware/tr.d049:trMA.Ode8C2H.incipit	@ltx/en_uk_ware/he.h.m4:heHE.GiKaiPantaTaEnAfti.incipit
ltx/en_uk_ware/tr.d049:trMA.Ode8C2H.melody	@ltx/en_uk_ware/he.h.m4:heHE.GiKaiPantaTaEnAfti.melody
ltx/en_uk_ware/tr.d049:trMA.Ode8C2H.mode	@ltx/en_uk_ware/miscellanea:misc.Mode4
ltx/en_uk_ware/tr.d049:trMA.Ode8C2H.ode	@ltx/en_uk_ware/miscellanea:misc.Ode8
ltx/en_uk_ware/tr.d049:trMA.Ode8C2H.text	@ltx/en_uk_ware/he.h.m4:heHE.GiKaiPantaTaEnAfti.text
ltx/en_uk_ware/tr.d049:trMA.Ode8C2T.incipit	What man born on earth…
ltx/en_uk_ware/tr.d049:trMA.Ode8C2T.melody	@ltx/en_uk_ware/he.h.m4:heHE.GiKaiPantaTaEnAfti.name
ltx/en_uk_ware/tr.d049:trMA.Ode8C2T.mode	@ltx/en_uk_ware/miscellanea:misc.Mode4
ltx/en_uk_ware/tr.d049:trMA.Ode8C2T.ode	@ltx/en_uk_ware/miscellanea:misc.Ode8
ltx/en_uk_ware/tr.d049:trMA.Ode8C2T.text	What man born on earth will not praise thee, Dove pure and undefiled? For thou hast conceived the great Light, the riches of life, Jesus the Saviour. We sing His praises as Lord and exalt Him above all for ever.
ltx/en_uk_ware/tr.d049:trMA.Ode8C2Tr.incipit	Light and Life, one Life…
ltx/en_uk_ware/tr.d049:trMA.Ode8C2Tr.melody	@ltx/en_uk_ware/he.h.m4:heHE.GiKaiPantaTaEnAfti.name
ltx/en_uk_ware/tr.d049:trMA.Ode8C2Tr.mode	@ltx/en_uk_ware/miscellanea:misc.Mode4
ltx/en_uk_ware/tr.d049:trMA.Ode8C2Tr.ode	@ltx/en_uk_ware/miscellanea:misc.Ode8
ltx/en_uk_ware/tr.d049:trMA.Ode8C2Tr.text	Light and Life, one Life and three, Father, Son and Spirit that proceeds from the Father, I honour Thee, one God and Essence in three Persons, and I sing: I bless Thee and I praise Thee, O Lord, and exalt Thee above all for ever.
ltx/en_uk_ware/tr.d049:trMA.Ode9C11.greekmelody	@ltx/en_uk_ware/he.h.m4:heHE.OtiEpoiiseMoiMegaleia.greekname
ltx/en_uk_ware/tr.d049:trMA.Ode9C11.incipit	O suffering martyrs of Christ…
ltx/en_uk_ware/tr.d049:trMA.Ode9C11.melody	@ltx/en_uk_ware/he.h.m4:heHE.OtiEpoiiseMoiMegaleia.name
ltx/en_uk_ware/tr.d049:trMA.Ode9C11.mode	@ltx/en_uk_ware/miscellanea:misc.Mode4
ltx/en_uk_ware/tr.d049:trMA.Ode9C11.ode	@ltx/en_uk_ware/miscellanea:misc.Ode9
ltx/en_uk_ware/tr.d049:trMA.Ode9C11.text	O suffering martyrs of Christ, ye are as the fixed stars in the firmament; illumine our thoughts and give us strength to do the pure and radiant will of God.
ltx/en_uk_ware/tr.d049:trMA.Ode9C12.incipit	O noble martyrs of the…
ltx/en_uk_ware/tr.d049:trMA.Ode9C12.melody	@ltx/en_uk_ware/he.h.m4:heHE.OtiEpoiiseMoiMegaleia.name
ltx/en_uk_ware/tr.d049:trMA.Ode9C12.mode	@ltx/en_uk_ware/miscellanea:misc.Mode4
ltx/en_uk_ware/tr.d049:trMA.Ode9C12.ode	@ltx/en_uk_ware/miscellanea:misc.Ode9
ltx/en_uk_ware/tr.d049:trMA.Ode9C12.text	O noble martyrs of the Lord, ye are as swords that kill the enemy: through your protection deliver us from the arrows of the evil one.
ltx/en_uk_ware/tr.d049:trMA.Ode9C13.incipit	O compassionate Lord, supreme in…
ltx/en_uk_ware/tr.d049:trMA.Ode9C13.melody	@ltx/en_uk_ware/he.h.m4:heHE.OtiEpoiiseMoiMegaleia.name
ltx/en_uk_ware/tr.d049:trMA.Ode9C13.mode	@ltx/en_uk_ware/miscellanea:misc.Mode4
ltx/en_uk_ware/tr.d049:trMA.Ode9C13.ode	@ltx/en_uk_ware/miscellanea:misc.Ode9
ltx/en_uk_ware/tr.d049:trMA.Ode9C13.text	O compassionate Lord, supreme in love, Creator of all, give rest in the bosom of Abraham to Thy servants who have departed from us and gone to Thee in faith.
ltx/en_uk_ware/tr.d049:trMA.Ode9C1T.incipit	O pure Virgin, who in…
ltx/en_uk_ware/tr.d049:trMA.Ode9C1T.melody	@ltx/en_uk_ware/he.h.m4:heHE.OtiEpoiiseMoiMegaleia.name
ltx/en_uk_ware/tr.d049:trMA.Ode9C1T.mode	@ltx/en_uk_ware/miscellanea:misc.Mode4
ltx/en_uk_ware/tr.d049:trMA.Ode9C1T.ode	@ltx/en_uk_ware/miscellanea:misc.Ode9
ltx/en_uk_ware/tr.d049:trMA.Ode9C1T.text	O pure Virgin, who in ways past understanding hast borne God in the flesh, put to death the movements of my flesh and give light to my understanding, for thou art the cloud of Light.
ltx/en_uk_ware/tr.d049:trMA.Ode9C21.greekmelody	@ltx/en_uk_ware/he.h.m4:heHE.MegalynomenPantes.greekname
ltx/en_uk_ware/tr.d049:trMA.Ode9C21.incipit	All of us sing in…
ltx/en_uk_ware/tr.d049:trMA.Ode9C21.melody	@ltx/en_uk_ware/he.h.m4:heHE.MegalynomenPantes.name
ltx/en_uk_ware/tr.d049:trMA.Ode9C21.mode	@ltx/en_uk_ware/miscellanea:misc.Mode4
ltx/en_uk_ware/tr.d049:trMA.Ode9C21.ode	@ltx/en_uk_ware/miscellanea:misc.Ode9
ltx/en_uk_ware/tr.d049:trMA.Ode9C21.text	All of us sing in honour of your memory, all-blessed martyrs, and looking with amazement at the arena where ye suffered, we magnify Christ.
ltx/en_uk_ware/tr.d049:trMA.Ode9C22.incipit	In the midst of their…
ltx/en_uk_ware/tr.d049:trMA.Ode9C22.melody	@ltx/en_uk_ware/he.h.m4:heHE.MegalynomenPantes.name
ltx/en_uk_ware/tr.d049:trMA.Ode9C22.mode	@ltx/en_uk_ware/miscellanea:misc.Mode4
ltx/en_uk_ware/tr.d049:trMA.Ode9C22.ode	@ltx/en_uk_ware/miscellanea:misc.Ode9
ltx/en_uk_ware/tr.d049:trMA.Ode9C22.text	In the midst of their sufferings the victorious martyrs said to one another: ‘Let us not spare the flesh, but come, let us die for Christ that we maylive in joy for ever.’
ltx/en_uk_ware/tr.d049:trMA.Ode9C2A1.incipit	O choir of saints, receive…
ltx/en_uk_ware/tr.d049:trMA.Ode9C2A1.melody	@ltx/en_uk_ware/he.h.m4:heHE.MegalynomenPantes.name
ltx/en_uk_ware/tr.d049:trMA.Ode9C2A1.mode	@ltx/en_uk_ware/miscellanea:misc.Mode4
ltx/en_uk_ware/tr.d049:trMA.Ode9C2A1.ode	@ltx/en_uk_ware/miscellanea:misc.Ode9
ltx/en_uk_ware/tr.d049:trMA.Ode9C2A1.text	O choir of saints, receive my prayer; and as I have been counted worthy to venerate the Cross, pray to Christ that I may also worship at His holy Passion.
ltx/en_uk_ware/tr.d049:trMA.Ode9C2A2.incipit	In Thy compassion and love…
ltx/en_uk_ware/tr.d049:trMA.Ode9C2A2.melody	@ltx/en_uk_ware/he.h.m4:heHE.MegalynomenPantes.name
ltx/en_uk_ware/tr.d049:trMA.Ode9C2A2.mode	@ltx/en_uk_ware/miscellanea:misc.Mode4
ltx/en_uk_ware/tr.d049:trMA.Ode9C2A2.ode	@ltx/en_uk_ware/miscellanea:misc.Ode9
ltx/en_uk_ware/tr.d049:trMA.Ode9C2A2.text	In Thy compassion and love for mankind, forgive and pardon those who have gone to dwell with Thee, and grant them rest in the tabernacles of the elect; for Thou art Life and Resurrection.
ltx/en_uk_ware/tr.d049:trMA.Ode9C2H.greekmelody	@ltx/en_uk_ware/he.h.m4:heHE.MegalynomenPantes.greekname
ltx/en_uk_ware/tr.d049:trMA.Ode9C2H.incipit	@ltx/en_uk_ware/he.h.m4:heHE.MegalynomenPantes.incipit
ltx/en_uk_ware/tr.d049:trMA.Ode9C2H.melody	@ltx/en_uk_ware/he.h.m4:heHE.MegalynomenPantes.melody
ltx/en_uk_ware/tr.d049:trMA.Ode9C2H.mode	@ltx/en_uk_ware/miscellanea:misc.Mode4
ltx/en_uk_ware/tr.d049:trMA.Ode9C2H.ode	@ltx/en_uk_ware/miscellanea:misc.Ode9
ltx/en_uk_ware/tr.d049:trMA.Ode9C2H.text	@ltx/en_uk_ware/he.h.m4:heHE.MegalynomenPantes.text
ltx/en_uk_ware/tr.d049:trMA.Ode9C2T.incipit	Hail, Mary pure and worthy…
ltx/en_uk_ware/tr.d049:trMA.Ode9C2T.melody	@ltx/en_uk_ware/he.h.m4:heHE.MegalynomenPantes.name
ltx/en_uk_ware/tr.d049:trMA.Ode9C2T.mode	@ltx/en_uk_ware/miscellanea:misc.Mode4
ltx/en_uk_ware/tr.d049:trMA.Ode9C2T.ode	@ltx/en_uk_ware/miscellanea:misc.Ode9
ltx/en_uk_ware/tr.d049:trMA.Ode9C2T.text	Hail, Mary pure and worthy of all veneration, glory of virginity, strength of mothers, helper of mankind, joy of the world, Mother and Handmaiden of our God.
ltx/en_uk_ware/tr.d049:trMA.Ode9C2Tr.incipit	O Trinity one in Essence…
ltx/en_uk_ware/tr.d049:trMA.Ode9C2Tr.melody	@ltx/en_uk_ware/he.h.m4:heHE.MegalynomenPantes.name
ltx/en_uk_ware/tr.d049:trMA.Ode9C2Tr.mode	@ltx/en_uk_ware/miscellanea:misc.Mode4
ltx/en_uk_ware/tr.d049:trMA.Ode9C2Tr.ode	@ltx/en_uk_ware/miscellanea:misc.Ode9
ltx/en_uk_ware/tr.d049:trMA.Ode9C2Tr.text	O Trinity one in Essence, Father unbegotten, Son begotten and Spirit that proceeds: in Thy mercy keep from harm those who sing Thy praises.
ltx/en_uk_ware/tr.d049:trVE.ApolTheotokion.incipit	…
ltx/en_uk_ware/tr.d049:trVE.ApolTheotokion.melody	
ltx/en_uk_ware/tr.d049:trVE.ApolTheotokion.mode	@ltx/en_uk_ware/miscellanea:misc.Mode2
ltx/en_uk_ware/tr.d049:trVE.ApolTheotokion.text	
ltx/en_uk_ware/tr.d049:trVE.Apolytikion1.incipit	…
ltx/en_uk_ware/tr.d049:trVE.Apolytikion1.melody	
ltx/en_uk_ware/tr.d049:trVE.Apolytikion1.mode	@ltx/en_uk_ware/miscellanea:misc.Mode2
ltx/en_uk_ware/tr.d049:trVE.Apolytikion1.text	
ltx/en_uk_ware/tr.d049:trVE.Apolytikion2.incipit	…
ltx/en_uk_ware/tr.d049:trVE.Apolytikion2.melody	
ltx/en_uk_ware/tr.d049:trVE.Apolytikion2.mode	@ltx/en_uk_ware/miscellanea:misc.Mode2
ltx/en_uk_ware/tr.d049:trVE.Apolytikion2.text	
ltx/en_uk_ware/tr.d049:trVE.AposIdiomelon1.incipit	My soul’s dignity I have…
ltx/en_uk_ware/tr.d049:trVE.AposIdiomelon1.melody	@ltx/en_uk_ware/miscellanea:misc.Idiomelon
ltx/en_uk_ware/tr.d049:trVE.AposIdiomelon1.mode	@ltx/en_uk_ware/miscellanea:misc.Mode7
ltx/en_uk_ware/tr.d049:trVE.AposIdiomelon1.text	My soul’s dignity I have enslaved to the passions; I am become like the beasts, and have no power to lift mine eyes to Thee, Most High. But with my head bowed like the Publican, I pray to Thee, O Christ, and cry aloud: God be merciful to me and save me.
ltx/en_uk_ware/tr.d049:trVL.header	
