ltx/en_uk_ware/tr.d022:trCO.header	
ltx/en_uk_ware/tr.d022:trDA.commemoration.full	
ltx/en_uk_ware/tr.d022:trDA.commemoration.short	
ltx/en_uk_ware/tr.d022:trDA.dismissal	@ltx/en_uk_ware/dismissals:dis00.resurrection
ltx/en_uk_ware/tr.d022:trDA.insert1	
ltx/en_uk_ware/tr.d022:trDA.insert2	
ltx/en_uk_ware/tr.d022:trDA.note	
ltx/en_uk_ware/tr.d022:trDA.title	
ltx/en_uk_ware/tr.d022:trHO.commemorations	
ltx/en_uk_ware/tr.d022:trHO.daytitle	
ltx/en_uk_ware/tr.d022:trHO.description1	
ltx/en_uk_ware/tr.d022:trHO.description2	
ltx/en_uk_ware/tr.d022:trHO.note1	
ltx/en_uk_ware/tr.d022:trHO.note2	
ltx/en_uk_ware/tr.d022:trLI.Kontakion1.incipit	@ltx/en_uk_ware/tr.d022:trMA.Kontakion1.incipit
ltx/en_uk_ware/tr.d022:trLI.Kontakion1.melody	@ltx/en_uk_ware/tr.d022:trMA.Kontakion1.melody
ltx/en_uk_ware/tr.d022:trLI.Kontakion1.mode	@ltx/en_uk_ware/tr.d022:trMA.Kontakion1.mode
ltx/en_uk_ware/tr.d022:trLI.Kontakion1.text	@ltx/en_uk_ware/tr.d022:trMA.Kontakion1.text
ltx/en_uk_ware/tr.d022:trLI.Megalynarion.text	
ltx/en_uk_ware/tr.d022:trMA.C1.poet	@ltx/en_uk_ware/poets:po.ChristoforouTouProtasikritou
ltx/en_uk_ware/tr.d022:trMA.C1.title	
ltx/en_uk_ware/tr.d022:trMA.C1.verse	
ltx/en_uk_ware/tr.d022:trMA.Exaposteilarion1.greekmelody	@ltx/en_uk_ware/he.a.m2:heAU.GynaikesAkoutisthite.greekname
ltx/en_uk_ware/tr.d022:trMA.Exaposteilarion1.incipit	…
ltx/en_uk_ware/tr.d022:trMA.Exaposteilarion1.melody	@ltx/en_uk_ware/he.a.m2:heAU.GynaikesAkoutisthite.name
ltx/en_uk_ware/tr.d022:trMA.Exaposteilarion1.mode	@ltx/en_uk_ware/miscellanea:misc.Mode2
ltx/en_uk_ware/tr.d022:trMA.Exaposteilarion1.text	
ltx/en_uk_ware/tr.d022:trMA.Exaposteilarion2.greekmelody	@ltx/en_uk_ware/he.a.m2:heAU.ToisMathitaisSynelthomen.greekname
ltx/en_uk_ware/tr.d022:trMA.Exaposteilarion2.incipit	…
ltx/en_uk_ware/tr.d022:trMA.Exaposteilarion2.melody	@ltx/en_uk_ware/he.a.m2:heAU.ToisMathitaisSynelthomen.name
ltx/en_uk_ware/tr.d022:trMA.Exaposteilarion2.mode	@ltx/en_uk_ware/miscellanea:misc.Mode2
ltx/en_uk_ware/tr.d022:trMA.Exaposteilarion2.text	
ltx/en_uk_ware/tr.d022:trMA.Kontakion1.incipit	O Master, Guide to wisdom…
ltx/en_uk_ware/tr.d022:trMA.Kontakion1.melody	@ltx/en_uk_ware/miscellanea:misc.AutomelonNotMetered
ltx/en_uk_ware/tr.d022:trMA.Kontakion1.mode	@ltx/en_uk_ware/miscellanea:misc.Mode6
ltx/en_uk_ware/tr.d022:trMA.Kontakion1.text	O Master, Guide to wisdom, Giver of prudent counsel, Instructor of the foolish and Champion of the poor, make firm my heart and grant it understanding. O Word of the Father, give me words, for see, I shall not stop my lips from crying out to Thee: I am fallen, in Thy compassion have mercy on me.
ltx/en_uk_ware/tr.d022:trMA.Lauds1.incipit	…
ltx/en_uk_ware/tr.d022:trMA.Lauds1.melody	@ltx/en_uk_ware/miscellanea:misc.Idiomelon
ltx/en_uk_ware/tr.d022:trMA.Lauds1.mode	@ltx/en_uk_ware/miscellanea:misc.Mode5
ltx/en_uk_ware/tr.d022:trMA.Lauds1.text	
ltx/en_uk_ware/tr.d022:trMA.Lauds2.incipit	…
ltx/en_uk_ware/tr.d022:trMA.Lauds2.melody	@ltx/en_uk_ware/miscellanea:misc.Idiomelon
ltx/en_uk_ware/tr.d022:trMA.Lauds2.mode	@ltx/en_uk_ware/miscellanea:misc.Mode5
ltx/en_uk_ware/tr.d022:trMA.Lauds2.text	
ltx/en_uk_ware/tr.d022:trMA.Lauds3.incipit	…
ltx/en_uk_ware/tr.d022:trMA.Lauds3.melody	@ltx/en_uk_ware/miscellanea:misc.Idiomelon
ltx/en_uk_ware/tr.d022:trMA.Lauds3.mode	@ltx/en_uk_ware/miscellanea:misc.Mode6
ltx/en_uk_ware/tr.d022:trMA.Lauds3.text	
ltx/en_uk_ware/tr.d022:trMA.LaudsGlory.incipit	…
ltx/en_uk_ware/tr.d022:trMA.LaudsGlory.melody	@ltx/en_uk_ware/miscellanea:misc.Idiomelon
ltx/en_uk_ware/tr.d022:trMA.LaudsGlory.mode	@ltx/en_uk_ware/miscellanea:misc.Mode6
ltx/en_uk_ware/tr.d022:trMA.LaudsGlory.text	
ltx/en_uk_ware/tr.d022:trMA.LaudsTheotokion.incipit	…
ltx/en_uk_ware/tr.d022:trMA.LaudsTheotokion.melody	
ltx/en_uk_ware/tr.d022:trMA.LaudsTheotokion.mode	
ltx/en_uk_ware/tr.d022:trMA.LaudsTheotokion.text	
ltx/en_uk_ware/tr.d022:trMA.Ode1C11.greekmelody	@ltx/en_uk_ware/he.h.m6:heHE.OsEnIpeiroPezefsas.greekname
ltx/en_uk_ware/tr.d022:trMA.Ode1C11.incipit	…
ltx/en_uk_ware/tr.d022:trMA.Ode1C11.melody	@ltx/en_uk_ware/he.h.m6:heHE.OsEnIpeiroPezefsas.name
ltx/en_uk_ware/tr.d022:trMA.Ode1C11.mode	@ltx/en_uk_ware/miscellanea:misc.Mode6
ltx/en_uk_ware/tr.d022:trMA.Ode1C11.ode	@ltx/en_uk_ware/miscellanea:misc.Ode1
ltx/en_uk_ware/tr.d022:trMA.Ode1C11.text	
ltx/en_uk_ware/tr.d022:trMA.Ode1C12.incipit	…
ltx/en_uk_ware/tr.d022:trMA.Ode1C12.melody	@ltx/en_uk_ware/he.h.m6:heHE.OsEnIpeiroPezefsas.name
ltx/en_uk_ware/tr.d022:trMA.Ode1C12.mode	@ltx/en_uk_ware/miscellanea:misc.Mode6
ltx/en_uk_ware/tr.d022:trMA.Ode1C12.ode	@ltx/en_uk_ware/miscellanea:misc.Ode1
ltx/en_uk_ware/tr.d022:trMA.Ode1C12.text	
ltx/en_uk_ware/tr.d022:trMA.Ode1C13.incipit	…
ltx/en_uk_ware/tr.d022:trMA.Ode1C13.melody	@ltx/en_uk_ware/he.h.m6:heHE.OsEnIpeiroPezefsas.name
ltx/en_uk_ware/tr.d022:trMA.Ode1C13.mode	@ltx/en_uk_ware/miscellanea:misc.Mode6
ltx/en_uk_ware/tr.d022:trMA.Ode1C13.ode	@ltx/en_uk_ware/miscellanea:misc.Ode1
ltx/en_uk_ware/tr.d022:trMA.Ode1C13.text	
ltx/en_uk_ware/tr.d022:trMA.Ode1C14.incipit	…
ltx/en_uk_ware/tr.d022:trMA.Ode1C14.melody	@ltx/en_uk_ware/he.h.m6:heHE.OsEnIpeiroPezefsas.name
ltx/en_uk_ware/tr.d022:trMA.Ode1C14.mode	@ltx/en_uk_ware/miscellanea:misc.Mode6
ltx/en_uk_ware/tr.d022:trMA.Ode1C14.ode	@ltx/en_uk_ware/miscellanea:misc.Ode1
ltx/en_uk_ware/tr.d022:trMA.Ode1C14.text	
ltx/en_uk_ware/tr.d022:trMA.Ode1C1T.incipit	…
ltx/en_uk_ware/tr.d022:trMA.Ode1C1T.melody	@ltx/en_uk_ware/he.h.m6:heHE.OsEnIpeiroPezefsas.name
ltx/en_uk_ware/tr.d022:trMA.Ode1C1T.mode	@ltx/en_uk_ware/miscellanea:misc.Mode6
ltx/en_uk_ware/tr.d022:trMA.Ode1C1T.ode	@ltx/en_uk_ware/miscellanea:misc.Ode1
ltx/en_uk_ware/tr.d022:trMA.Ode1C1T.text	
ltx/en_uk_ware/tr.d022:trMA.Ode3C11.greekmelody	@ltx/en_uk_ware/he.h.m6:heHE.OukEstinAgios.greekname
ltx/en_uk_ware/tr.d022:trMA.Ode3C11.incipit	…
ltx/en_uk_ware/tr.d022:trMA.Ode3C11.melody	@ltx/en_uk_ware/he.h.m6:heHE.OukEstinAgios.name
ltx/en_uk_ware/tr.d022:trMA.Ode3C11.mode	@ltx/en_uk_ware/miscellanea:misc.Mode6
ltx/en_uk_ware/tr.d022:trMA.Ode3C11.ode	@ltx/en_uk_ware/miscellanea:misc.Ode3
ltx/en_uk_ware/tr.d022:trMA.Ode3C11.text	
ltx/en_uk_ware/tr.d022:trMA.Ode3C12.incipit	…
ltx/en_uk_ware/tr.d022:trMA.Ode3C12.melody	@ltx/en_uk_ware/he.h.m6:heHE.OukEstinAgios.name
ltx/en_uk_ware/tr.d022:trMA.Ode3C12.mode	@ltx/en_uk_ware/miscellanea:misc.Mode6
ltx/en_uk_ware/tr.d022:trMA.Ode3C12.ode	@ltx/en_uk_ware/miscellanea:misc.Ode3
ltx/en_uk_ware/tr.d022:trMA.Ode3C12.text	
ltx/en_uk_ware/tr.d022:trMA.Ode3C13.incipit	…
ltx/en_uk_ware/tr.d022:trMA.Ode3C13.melody	@ltx/en_uk_ware/he.h.m6:heHE.OukEstinAgios.name
ltx/en_uk_ware/tr.d022:trMA.Ode3C13.mode	@ltx/en_uk_ware/miscellanea:misc.Mode6
ltx/en_uk_ware/tr.d022:trMA.Ode3C13.ode	@ltx/en_uk_ware/miscellanea:misc.Ode3
ltx/en_uk_ware/tr.d022:trMA.Ode3C13.text	
ltx/en_uk_ware/tr.d022:trMA.Ode3C1T.incipit	…
ltx/en_uk_ware/tr.d022:trMA.Ode3C1T.melody	@ltx/en_uk_ware/he.h.m6:heHE.OukEstinAgios.name
ltx/en_uk_ware/tr.d022:trMA.Ode3C1T.mode	@ltx/en_uk_ware/miscellanea:misc.Mode6
ltx/en_uk_ware/tr.d022:trMA.Ode3C1T.ode	@ltx/en_uk_ware/miscellanea:misc.Ode3
ltx/en_uk_ware/tr.d022:trMA.Ode3C1T.text	
ltx/en_uk_ware/tr.d022:trMA.Ode3Kathisma1.greekmelody	@ltx/en_uk_ware/he.a.m4:heAU.KateplagiIosif.greekname
ltx/en_uk_ware/tr.d022:trMA.Ode3Kathisma1.incipit	…
ltx/en_uk_ware/tr.d022:trMA.Ode3Kathisma1.melody	@ltx/en_uk_ware/he.a.m4:heAU.KateplagiIosif.name
ltx/en_uk_ware/tr.d022:trMA.Ode3Kathisma1.mode	@ltx/en_uk_ware/miscellanea:misc.Mode4
ltx/en_uk_ware/tr.d022:trMA.Ode3Kathisma1.text	
ltx/en_uk_ware/tr.d022:trMA.Ode3Kathisma2.greekmelody	@ltx/en_uk_ware/he.a.m4:heAU.OYpsotheisEnToStavro.greekname
ltx/en_uk_ware/tr.d022:trMA.Ode3Kathisma2.incipit	…
ltx/en_uk_ware/tr.d022:trMA.Ode3Kathisma2.melody	@ltx/en_uk_ware/he.a.m4:heAU.OYpsotheisEnToStavro.name
ltx/en_uk_ware/tr.d022:trMA.Ode3Kathisma2.mode	@ltx/en_uk_ware/miscellanea:misc.Mode4
ltx/en_uk_ware/tr.d022:trMA.Ode3Kathisma2.text	
ltx/en_uk_ware/tr.d022:trMA.Ode3Kathisma3.greekmelody	@ltx/en_uk_ware/he.a.m4:heAU.OYpsotheisEnToStavro.greekname
ltx/en_uk_ware/tr.d022:trMA.Ode3Kathisma3.incipit	…
ltx/en_uk_ware/tr.d022:trMA.Ode3Kathisma3.melody	@ltx/en_uk_ware/he.a.m4:heAU.OYpsotheisEnToStavro.name
ltx/en_uk_ware/tr.d022:trMA.Ode3Kathisma3.mode	@ltx/en_uk_ware/miscellanea:misc.Mode4
ltx/en_uk_ware/tr.d022:trMA.Ode3Kathisma3.text	
ltx/en_uk_ware/tr.d022:trMA.Ode4C11.greekmelody	@ltx/en_uk_ware/he.h.m6:heHE.ChristosMouDynamis.greekname
ltx/en_uk_ware/tr.d022:trMA.Ode4C11.incipit	…
ltx/en_uk_ware/tr.d022:trMA.Ode4C11.melody	@ltx/en_uk_ware/he.h.m6:heHE.ChristosMouDynamis.name
ltx/en_uk_ware/tr.d022:trMA.Ode4C11.mode	@ltx/en_uk_ware/miscellanea:misc.Mode6
ltx/en_uk_ware/tr.d022:trMA.Ode4C11.ode	@ltx/en_uk_ware/miscellanea:misc.Ode4
ltx/en_uk_ware/tr.d022:trMA.Ode4C11.text	
ltx/en_uk_ware/tr.d022:trMA.Ode4C12.incipit	…
ltx/en_uk_ware/tr.d022:trMA.Ode4C12.melody	@ltx/en_uk_ware/he.h.m6:heHE.ChristosMouDynamis.name
ltx/en_uk_ware/tr.d022:trMA.Ode4C12.mode	@ltx/en_uk_ware/miscellanea:misc.Mode6
ltx/en_uk_ware/tr.d022:trMA.Ode4C12.ode	@ltx/en_uk_ware/miscellanea:misc.Ode4
ltx/en_uk_ware/tr.d022:trMA.Ode4C12.text	
ltx/en_uk_ware/tr.d022:trMA.Ode4C13.incipit	…
ltx/en_uk_ware/tr.d022:trMA.Ode4C13.melody	@ltx/en_uk_ware/he.h.m6:heHE.ChristosMouDynamis.name
ltx/en_uk_ware/tr.d022:trMA.Ode4C13.mode	@ltx/en_uk_ware/miscellanea:misc.Mode6
ltx/en_uk_ware/tr.d022:trMA.Ode4C13.ode	@ltx/en_uk_ware/miscellanea:misc.Ode4
ltx/en_uk_ware/tr.d022:trMA.Ode4C13.text	
ltx/en_uk_ware/tr.d022:trMA.Ode4C14.incipit	…
ltx/en_uk_ware/tr.d022:trMA.Ode4C14.melody	@ltx/en_uk_ware/he.h.m6:heHE.ChristosMouDynamis.name
ltx/en_uk_ware/tr.d022:trMA.Ode4C14.mode	@ltx/en_uk_ware/miscellanea:misc.Mode6
ltx/en_uk_ware/tr.d022:trMA.Ode4C14.ode	@ltx/en_uk_ware/miscellanea:misc.Ode4
ltx/en_uk_ware/tr.d022:trMA.Ode4C14.text	
ltx/en_uk_ware/tr.d022:trMA.Ode4C1T.incipit	…
ltx/en_uk_ware/tr.d022:trMA.Ode4C1T.melody	@ltx/en_uk_ware/he.h.m6:heHE.ChristosMouDynamis.name
ltx/en_uk_ware/tr.d022:trMA.Ode4C1T.mode	@ltx/en_uk_ware/miscellanea:misc.Mode6
ltx/en_uk_ware/tr.d022:trMA.Ode4C1T.ode	@ltx/en_uk_ware/miscellanea:misc.Ode4
ltx/en_uk_ware/tr.d022:trMA.Ode4C1T.text	
ltx/en_uk_ware/tr.d022:trMA.Ode5C11.greekmelody	@ltx/en_uk_ware/he.h.m6:heHE.ToTheioFengeiSou.greekname
ltx/en_uk_ware/tr.d022:trMA.Ode5C11.incipit	…
ltx/en_uk_ware/tr.d022:trMA.Ode5C11.melody	@ltx/en_uk_ware/he.h.m6:heHE.ToTheioFengeiSou.name
ltx/en_uk_ware/tr.d022:trMA.Ode5C11.mode	@ltx/en_uk_ware/miscellanea:misc.Mode6
ltx/en_uk_ware/tr.d022:trMA.Ode5C11.ode	@ltx/en_uk_ware/miscellanea:misc.Ode5
ltx/en_uk_ware/tr.d022:trMA.Ode5C11.text	
ltx/en_uk_ware/tr.d022:trMA.Ode5C12.incipit	…
ltx/en_uk_ware/tr.d022:trMA.Ode5C12.melody	@ltx/en_uk_ware/he.h.m6:heHE.ToTheioFengeiSou.name
ltx/en_uk_ware/tr.d022:trMA.Ode5C12.mode	@ltx/en_uk_ware/miscellanea:misc.Mode6
ltx/en_uk_ware/tr.d022:trMA.Ode5C12.ode	@ltx/en_uk_ware/miscellanea:misc.Ode5
ltx/en_uk_ware/tr.d022:trMA.Ode5C12.text	
ltx/en_uk_ware/tr.d022:trMA.Ode5C13.incipit	…
ltx/en_uk_ware/tr.d022:trMA.Ode5C13.melody	@ltx/en_uk_ware/he.h.m6:heHE.ToTheioFengeiSou.name
ltx/en_uk_ware/tr.d022:trMA.Ode5C13.mode	@ltx/en_uk_ware/miscellanea:misc.Mode6
ltx/en_uk_ware/tr.d022:trMA.Ode5C13.ode	@ltx/en_uk_ware/miscellanea:misc.Ode5
ltx/en_uk_ware/tr.d022:trMA.Ode5C13.text	
ltx/en_uk_ware/tr.d022:trMA.Ode5C1T.incipit	…
ltx/en_uk_ware/tr.d022:trMA.Ode5C1T.melody	@ltx/en_uk_ware/he.h.m6:heHE.ToTheioFengeiSou.name
ltx/en_uk_ware/tr.d022:trMA.Ode5C1T.mode	@ltx/en_uk_ware/miscellanea:misc.Mode6
ltx/en_uk_ware/tr.d022:trMA.Ode5C1T.ode	@ltx/en_uk_ware/miscellanea:misc.Ode5
ltx/en_uk_ware/tr.d022:trMA.Ode5C1T.text	
ltx/en_uk_ware/tr.d022:trMA.Ode6C11.greekmelody	@ltx/en_uk_ware/he.h.m6:heHE.TouViouTinThalassan.greekname
ltx/en_uk_ware/tr.d022:trMA.Ode6C11.incipit	…
ltx/en_uk_ware/tr.d022:trMA.Ode6C11.melody	@ltx/en_uk_ware/he.h.m6:heHE.TouViouTinThalassan.name
ltx/en_uk_ware/tr.d022:trMA.Ode6C11.mode	@ltx/en_uk_ware/miscellanea:misc.Mode6
ltx/en_uk_ware/tr.d022:trMA.Ode6C11.ode	@ltx/en_uk_ware/miscellanea:misc.Ode6
ltx/en_uk_ware/tr.d022:trMA.Ode6C11.text	
ltx/en_uk_ware/tr.d022:trMA.Ode6C12.incipit	…
ltx/en_uk_ware/tr.d022:trMA.Ode6C12.melody	@ltx/en_uk_ware/he.h.m6:heHE.TouViouTinThalassan.name
ltx/en_uk_ware/tr.d022:trMA.Ode6C12.mode	@ltx/en_uk_ware/miscellanea:misc.Mode6
ltx/en_uk_ware/tr.d022:trMA.Ode6C12.ode	@ltx/en_uk_ware/miscellanea:misc.Ode6
ltx/en_uk_ware/tr.d022:trMA.Ode6C12.text	
ltx/en_uk_ware/tr.d022:trMA.Ode6C13.incipit	…
ltx/en_uk_ware/tr.d022:trMA.Ode6C13.melody	@ltx/en_uk_ware/he.h.m6:heHE.TouViouTinThalassan.name
ltx/en_uk_ware/tr.d022:trMA.Ode6C13.mode	@ltx/en_uk_ware/miscellanea:misc.Mode6
ltx/en_uk_ware/tr.d022:trMA.Ode6C13.ode	@ltx/en_uk_ware/miscellanea:misc.Ode6
ltx/en_uk_ware/tr.d022:trMA.Ode6C13.text	
ltx/en_uk_ware/tr.d022:trMA.Ode6C1T.incipit	…
ltx/en_uk_ware/tr.d022:trMA.Ode6C1T.melody	@ltx/en_uk_ware/he.h.m6:heHE.TouViouTinThalassan.name
ltx/en_uk_ware/tr.d022:trMA.Ode6C1T.mode	@ltx/en_uk_ware/miscellanea:misc.Mode6
ltx/en_uk_ware/tr.d022:trMA.Ode6C1T.ode	@ltx/en_uk_ware/miscellanea:misc.Ode6
ltx/en_uk_ware/tr.d022:trMA.Ode6C1T.text	
ltx/en_uk_ware/tr.d022:trMA.Ode7C11.greekmelody	@ltx/en_uk_ware/he.h.m6:heHE.DrosovolonMenTinKaminon.greekname
ltx/en_uk_ware/tr.d022:trMA.Ode7C11.incipit	…
ltx/en_uk_ware/tr.d022:trMA.Ode7C11.melody	@ltx/en_uk_ware/he.h.m6:heHE.DrosovolonMenTinKaminon.name
ltx/en_uk_ware/tr.d022:trMA.Ode7C11.mode	@ltx/en_uk_ware/miscellanea:misc.Mode6
ltx/en_uk_ware/tr.d022:trMA.Ode7C11.ode	@ltx/en_uk_ware/miscellanea:misc.Ode7
ltx/en_uk_ware/tr.d022:trMA.Ode7C11.text	
ltx/en_uk_ware/tr.d022:trMA.Ode7C12.incipit	…
ltx/en_uk_ware/tr.d022:trMA.Ode7C12.melody	@ltx/en_uk_ware/he.h.m6:heHE.DrosovolonMenTinKaminon.name
ltx/en_uk_ware/tr.d022:trMA.Ode7C12.mode	@ltx/en_uk_ware/miscellanea:misc.Mode6
ltx/en_uk_ware/tr.d022:trMA.Ode7C12.ode	@ltx/en_uk_ware/miscellanea:misc.Ode7
ltx/en_uk_ware/tr.d022:trMA.Ode7C12.text	
ltx/en_uk_ware/tr.d022:trMA.Ode7C13.incipit	…
ltx/en_uk_ware/tr.d022:trMA.Ode7C13.melody	@ltx/en_uk_ware/he.h.m6:heHE.DrosovolonMenTinKaminon.name
ltx/en_uk_ware/tr.d022:trMA.Ode7C13.mode	@ltx/en_uk_ware/miscellanea:misc.Mode6
ltx/en_uk_ware/tr.d022:trMA.Ode7C13.ode	@ltx/en_uk_ware/miscellanea:misc.Ode7
ltx/en_uk_ware/tr.d022:trMA.Ode7C13.text	
ltx/en_uk_ware/tr.d022:trMA.Ode7C1T.incipit	…
ltx/en_uk_ware/tr.d022:trMA.Ode7C1T.melody	@ltx/en_uk_ware/he.h.m6:heHE.DrosovolonMenTinKaminon.name
ltx/en_uk_ware/tr.d022:trMA.Ode7C1T.mode	@ltx/en_uk_ware/miscellanea:misc.Mode6
ltx/en_uk_ware/tr.d022:trMA.Ode7C1T.ode	@ltx/en_uk_ware/miscellanea:misc.Ode7
ltx/en_uk_ware/tr.d022:trMA.Ode7C1T.text	
ltx/en_uk_ware/tr.d022:trMA.Ode8C11.greekmelody	@ltx/en_uk_ware/he.h.m6:heHE.EkFlogosToisOsiois.greekname
ltx/en_uk_ware/tr.d022:trMA.Ode8C11.incipit	…
ltx/en_uk_ware/tr.d022:trMA.Ode8C11.melody	@ltx/en_uk_ware/he.h.m6:heHE.EkFlogosToisOsiois.name
ltx/en_uk_ware/tr.d022:trMA.Ode8C11.mode	@ltx/en_uk_ware/miscellanea:misc.Mode6
ltx/en_uk_ware/tr.d022:trMA.Ode8C11.ode	@ltx/en_uk_ware/miscellanea:misc.Ode8
ltx/en_uk_ware/tr.d022:trMA.Ode8C11.text	
ltx/en_uk_ware/tr.d022:trMA.Ode8C12.incipit	…
ltx/en_uk_ware/tr.d022:trMA.Ode8C12.melody	@ltx/en_uk_ware/he.h.m6:heHE.EkFlogosToisOsiois.name
ltx/en_uk_ware/tr.d022:trMA.Ode8C12.mode	@ltx/en_uk_ware/miscellanea:misc.Mode6
ltx/en_uk_ware/tr.d022:trMA.Ode8C12.ode	@ltx/en_uk_ware/miscellanea:misc.Ode8
ltx/en_uk_ware/tr.d022:trMA.Ode8C12.text	
ltx/en_uk_ware/tr.d022:trMA.Ode8C13.incipit	…
ltx/en_uk_ware/tr.d022:trMA.Ode8C13.melody	@ltx/en_uk_ware/he.h.m6:heHE.EkFlogosToisOsiois.name
ltx/en_uk_ware/tr.d022:trMA.Ode8C13.mode	@ltx/en_uk_ware/miscellanea:misc.Mode6
ltx/en_uk_ware/tr.d022:trMA.Ode8C13.ode	@ltx/en_uk_ware/miscellanea:misc.Ode8
ltx/en_uk_ware/tr.d022:trMA.Ode8C13.text	
ltx/en_uk_ware/tr.d022:trMA.Ode8C1T.incipit	…
ltx/en_uk_ware/tr.d022:trMA.Ode8C1T.melody	@ltx/en_uk_ware/he.h.m6:heHE.EkFlogosToisOsiois.name
ltx/en_uk_ware/tr.d022:trMA.Ode8C1T.mode	@ltx/en_uk_ware/miscellanea:misc.Mode6
ltx/en_uk_ware/tr.d022:trMA.Ode8C1T.ode	@ltx/en_uk_ware/miscellanea:misc.Ode8
ltx/en_uk_ware/tr.d022:trMA.Ode8C1T.text	
ltx/en_uk_ware/tr.d022:trMA.Ode9C11.greekmelody	@ltx/en_uk_ware/he.h.m6:heHE.TheonAnthropois.greekname
ltx/en_uk_ware/tr.d022:trMA.Ode9C11.incipit	…
ltx/en_uk_ware/tr.d022:trMA.Ode9C11.melody	@ltx/en_uk_ware/he.h.m6:heHE.TheonAnthropois.name
ltx/en_uk_ware/tr.d022:trMA.Ode9C11.mode	@ltx/en_uk_ware/miscellanea:misc.Mode6
ltx/en_uk_ware/tr.d022:trMA.Ode9C11.ode	@ltx/en_uk_ware/miscellanea:misc.Ode9
ltx/en_uk_ware/tr.d022:trMA.Ode9C11.text	
ltx/en_uk_ware/tr.d022:trMA.Ode9C12.incipit	…
ltx/en_uk_ware/tr.d022:trMA.Ode9C12.melody	@ltx/en_uk_ware/he.h.m6:heHE.TheonAnthropois.name
ltx/en_uk_ware/tr.d022:trMA.Ode9C12.mode	@ltx/en_uk_ware/miscellanea:misc.Mode6
ltx/en_uk_ware/tr.d022:trMA.Ode9C12.ode	@ltx/en_uk_ware/miscellanea:misc.Ode9
ltx/en_uk_ware/tr.d022:trMA.Ode9C12.text	
ltx/en_uk_ware/tr.d022:trMA.Ode9C13.incipit	…
ltx/en_uk_ware/tr.d022:trMA.Ode9C13.melody	@ltx/en_uk_ware/he.h.m6:heHE.TheonAnthropois.name
ltx/en_uk_ware/tr.d022:trMA.Ode9C13.mode	@ltx/en_uk_ware/miscellanea:misc.Mode6
ltx/en_uk_ware/tr.d022:trMA.Ode9C13.ode	@ltx/en_uk_ware/miscellanea:misc.Ode9
ltx/en_uk_ware/tr.d022:trMA.Ode9C13.text	
ltx/en_uk_ware/tr.d022:trMA.Ode9C14.incipit	…
ltx/en_uk_ware/tr.d022:trMA.Ode9C14.melody	@ltx/en_uk_ware/he.h.m6:heHE.TheonAnthropois.name
ltx/en_uk_ware/tr.d022:trMA.Ode9C14.mode	@ltx/en_uk_ware/miscellanea:misc.Mode6
ltx/en_uk_ware/tr.d022:trMA.Ode9C14.ode	@ltx/en_uk_ware/miscellanea:misc.Ode9
ltx/en_uk_ware/tr.d022:trMA.Ode9C14.text	
ltx/en_uk_ware/tr.d022:trMA.Ode9C1T.incipit	…
ltx/en_uk_ware/tr.d022:trMA.Ode9C1T.melody	@ltx/en_uk_ware/he.h.m6:heHE.TheonAnthropois.name
ltx/en_uk_ware/tr.d022:trMA.Ode9C1T.mode	@ltx/en_uk_ware/miscellanea:misc.Mode6
ltx/en_uk_ware/tr.d022:trMA.Ode9C1T.ode	@ltx/en_uk_ware/miscellanea:misc.Ode9
ltx/en_uk_ware/tr.d022:trMA.Ode9C1T.text	
ltx/en_uk_ware/tr.d022:trMA.Oikos1.text	
ltx/en_uk_ware/tr.d022:trMA.Oikos12.text	
ltx/en_uk_ware/tr.d022:trMA.Oikos13.text	
ltx/en_uk_ware/tr.d022:trMA.Oikos14.text	
ltx/en_uk_ware/tr.d022:trMA.PostGospelBoth.incipit	@ltx/en_uk_ware/tr.d001:trMA.PostGospelBoth.incipit
ltx/en_uk_ware/tr.d022:trMA.PostGospelBoth.melody	
ltx/en_uk_ware/tr.d022:trMA.PostGospelBoth.mode	@ltx/en_uk_ware/miscellanea:misc.Mode8
ltx/en_uk_ware/tr.d022:trMA.PostGospelBoth.text	@ltx/en_uk_ware/tr.d001:trMA.PostGospelBoth.text
ltx/en_uk_ware/tr.d022:trMA.PostGospelGlory.incipit	@ltx/en_uk_ware/tr.d001:trMA.PostGospelGlory.incipit
ltx/en_uk_ware/tr.d022:trMA.PostGospelGlory.melody	
ltx/en_uk_ware/tr.d022:trMA.PostGospelGlory.mode	@ltx/en_uk_ware/miscellanea:misc.Mode8
ltx/en_uk_ware/tr.d022:trMA.PostGospelGlory.text	@ltx/en_uk_ware/tr.d001:trMA.PostGospelGlory.text
ltx/en_uk_ware/tr.d022:trMA.PostGospelIdiomelon.incipit	@ltx/en_uk_ware/tr.d001:trMA.PostGospelIdiomelon.incipit
ltx/en_uk_ware/tr.d022:trMA.PostGospelIdiomelon.melody	
ltx/en_uk_ware/tr.d022:trMA.PostGospelIdiomelon.mode	@ltx/en_uk_ware/miscellanea:misc.Mode6
ltx/en_uk_ware/tr.d022:trMA.PostGospelIdiomelon.text	@ltx/en_uk_ware/tr.d001:trMA.PostGospelIdiomelon.text
ltx/en_uk_ware/tr.d022:trSY.commemoration.couplet1.title	
ltx/en_uk_ware/tr.d022:trSY.commemoration.couplet1.verse1	
ltx/en_uk_ware/tr.d022:trSY.commemoration.couplet1.verse2	
ltx/en_uk_ware/tr.d022:trSY.commemoration.narration.p01	
ltx/en_uk_ware/tr.d022:trSY.commemoration.narration.p02	
ltx/en_uk_ware/tr.d022:trSY.commemoration.narration.p03	
ltx/en_uk_ware/tr.d022:trSY.commemoration.narration.p04	
ltx/en_uk_ware/tr.d022:trSY.commemoration.narration.p05	
ltx/en_uk_ware/tr.d022:trSY.commemoration.narration.p06	
ltx/en_uk_ware/tr.d022:trSY.commemoration.narration.p07	
ltx/en_uk_ware/tr.d022:trSY.commemoration.text	
ltx/en_uk_ware/tr.d022:trSY.lastline	
ltx/en_uk_ware/tr.d022:trVE.AposGlory.incipit	…
ltx/en_uk_ware/tr.d022:trVE.AposGlory.melody	@ltx/en_uk_ware/miscellanea:misc.Idiomelon
ltx/en_uk_ware/tr.d022:trVE.AposGlory.mode	@ltx/en_uk_ware/miscellanea:misc.Mode6
ltx/en_uk_ware/tr.d022:trVE.AposGlory.text	
ltx/en_uk_ware/tr.d022:trVE.AposTheotokion.incipit	…
ltx/en_uk_ware/tr.d022:trVE.AposTheotokion.melody	
ltx/en_uk_ware/tr.d022:trVE.AposTheotokion.mode	@ltx/en_uk_ware/miscellanea:misc.Mode6
ltx/en_uk_ware/tr.d022:trVE.AposTheotokion.text	
ltx/en_uk_ware/tr.d022:trVE.LityBoth.incipit	…
ltx/en_uk_ware/tr.d022:trVE.LityBoth.melody	
ltx/en_uk_ware/tr.d022:trVE.LityBoth.mode	@ltx/en_uk_ware/miscellanea:misc.Mode6
ltx/en_uk_ware/tr.d022:trVE.LityBoth.text	
ltx/en_uk_ware/tr.d022:trVE.LityGlory.incipit	…
ltx/en_uk_ware/tr.d022:trVE.LityGlory.melody	@ltx/en_uk_ware/miscellanea:misc.Idiomelon
ltx/en_uk_ware/tr.d022:trVE.LityGlory.mode	@ltx/en_uk_ware/miscellanea:misc.Mode6
ltx/en_uk_ware/tr.d022:trVE.LityGlory.text	
ltx/en_uk_ware/tr.d022:trVE.MM.Stichera123as567.text	@ltx/en_uk_ware/properties:media.key
ltx/en_uk_ware/tr.d022:trVE.SticGlory.incipit	…
ltx/en_uk_ware/tr.d022:trVE.SticGlory.melody	@ltx/en_uk_ware/miscellanea:misc.Idiomelon
ltx/en_uk_ware/tr.d022:trVE.SticGlory.mode	@ltx/en_uk_ware/miscellanea:misc.Mode6
ltx/en_uk_ware/tr.d022:trVE.SticGlory.text	
ltx/en_uk_ware/tr.d022:trVE.Stichera01.greekmelody	@ltx/en_uk_ware/he.a.m6:heAU.OlinApothemenoi.greekname
ltx/en_uk_ware/tr.d022:trVE.Stichera01.incipit	…
ltx/en_uk_ware/tr.d022:trVE.Stichera01.melody	@ltx/en_uk_ware/he.a.m6:heAU.OlinApothemenoi.name
ltx/en_uk_ware/tr.d022:trVE.Stichera01.mode	@ltx/en_uk_ware/miscellanea:misc.Mode6
ltx/en_uk_ware/tr.d022:trVE.Stichera01.text	
ltx/en_uk_ware/tr.d022:trVE.Stichera02.greekmelody	@ltx/en_uk_ware/he.a.m6:heAU.OlinApothemenoi.greekname
ltx/en_uk_ware/tr.d022:trVE.Stichera02.incipit	…
ltx/en_uk_ware/tr.d022:trVE.Stichera02.melody	@ltx/en_uk_ware/he.a.m6:heAU.OlinApothemenoi.name
ltx/en_uk_ware/tr.d022:trVE.Stichera02.mode	@ltx/en_uk_ware/miscellanea:misc.Mode6
ltx/en_uk_ware/tr.d022:trVE.Stichera02.text	
ltx/en_uk_ware/tr.d022:trVE.Stichera03.greekmelody	@ltx/en_uk_ware/he.a.m6:heAU.OlinApothemenoi.greekname
ltx/en_uk_ware/tr.d022:trVE.Stichera03.incipit	…
ltx/en_uk_ware/tr.d022:trVE.Stichera03.melody	@ltx/en_uk_ware/he.a.m6:heAU.OlinApothemenoi.name
ltx/en_uk_ware/tr.d022:trVE.Stichera03.mode	@ltx/en_uk_ware/miscellanea:misc.Mode6
ltx/en_uk_ware/tr.d022:trVE.Stichera03.text	
ltx/en_uk_ware/tr.d022:trVE.Stichera04.greekmelody	@ltx/en_uk_ware/he.a.m6:heAU.OlinApothemenoi.greekname
ltx/en_uk_ware/tr.d022:trVE.Stichera04.incipit	…
ltx/en_uk_ware/tr.d022:trVE.Stichera04.melody	@ltx/en_uk_ware/he.a.m6:heAU.OlinApothemenoi.name
ltx/en_uk_ware/tr.d022:trVE.Stichera04.mode	@ltx/en_uk_ware/miscellanea:misc.Mode6
ltx/en_uk_ware/tr.d022:trVE.Stichera04.text	
