ltx/en_uk_ware/he.h.m8:heHE.AkikoaKyrieTinAkoin.greekname	
ltx/en_uk_ware/he.h.m8:heHE.AkikoaKyrieTinAkoin.incipit	…
ltx/en_uk_ware/he.h.m8:heHE.AkikoaKyrieTinAkoin.melody	@ltx/en_uk_ware/miscellanea:misc.HeirmosNotMetered
ltx/en_uk_ware/he.h.m8:heHE.AkikoaKyrieTinAkoin.mode	@ltx/en_uk_ware/miscellanea:misc.Mode8
ltx/en_uk_ware/he.h.m8:heHE.AkikoaKyrieTinAkoin.name	(NM)
ltx/en_uk_ware/he.h.m8:heHE.AkikoaKyrieTinAkoin.ode	@ltx/en_uk_ware/miscellanea:misc.Ode4
ltx/en_uk_ware/he.h.m8:heHE.AkikoaKyrieTinAkoin.text	
ltx/en_uk_ware/he.h.m8:heHE.AllotrionTonMiteron.greekname	
ltx/en_uk_ware/he.h.m8:heHE.AllotrionTonMiteron.incipit	Virginity is alien…
ltx/en_uk_ware/he.h.m8:heHE.AllotrionTonMiteron.melody	@ltx/en_uk_ware/miscellanea:misc.HeirmosNotMetered
ltx/en_uk_ware/he.h.m8:heHE.AllotrionTonMiteron.mode	@ltx/en_uk_ware/miscellanea:misc.Mode8
ltx/en_uk_ware/he.h.m8:heHE.AllotrionTonMiteron.name	(NM) Virginity is alien
ltx/en_uk_ware/he.h.m8:heHE.AllotrionTonMiteron.ode	@ltx/en_uk_ware/miscellanea:misc.Ode9
ltx/en_uk_ware/he.h.m8:heHE.AllotrionTonMiteron.text	Virginity is alien to motherhood, and childbearing is a thing strange to virgins: yet in thee, O Theotokos, both are to be found. Therefore we and all the nations of the earth without ceasing call thee blessed.
ltx/en_uk_ware/he.h.m8:heHE.AngeloiKaiOuranoi.greekname	
ltx/en_uk_ware/he.h.m8:heHE.AngeloiKaiOuranoi.incipit	O ye angels…
ltx/en_uk_ware/he.h.m8:heHE.AngeloiKaiOuranoi.melody	@ltx/en_uk_ware/miscellanea:misc.HeirmosNotMetered
ltx/en_uk_ware/he.h.m8:heHE.AngeloiKaiOuranoi.mode	@ltx/en_uk_ware/miscellanea:misc.Mode8
ltx/en_uk_ware/he.h.m8:heHE.AngeloiKaiOuranoi.name	(NM) O ye angels
ltx/en_uk_ware/he.h.m8:heHE.AngeloiKaiOuranoi.ode	@ltx/en_uk_ware/miscellanea:misc.Ode8
ltx/en_uk_ware/he.h.m8:heHE.AngeloiKaiOuranoi.text	O ye angels and ye powers of heaven, sing to Him who sits upon the throne of majesty, and is glorified unceasingly as God: bless, praise and exalt Him above all for ever.
ltx/en_uk_ware/he.h.m8:heHE.ArmatilatinFarao.greekname	
ltx/en_uk_ware/he.h.m8:heHE.ArmatilatinFarao.incipit	…
ltx/en_uk_ware/he.h.m8:heHE.ArmatilatinFarao.melody	@ltx/en_uk_ware/miscellanea:misc.HeirmosNotMetered
ltx/en_uk_ware/he.h.m8:heHE.ArmatilatinFarao.mode	@ltx/en_uk_ware/miscellanea:misc.Mode8
ltx/en_uk_ware/he.h.m8:heHE.ArmatilatinFarao.name	(NM)
ltx/en_uk_ware/he.h.m8:heHE.ArmatilatinFarao.ode	@ltx/en_uk_ware/miscellanea:misc.Ode1
ltx/en_uk_ware/he.h.m8:heHE.ArmatilatinFarao.text	
ltx/en_uk_ware/he.h.m8:heHE.AseveiasOrgana.greekname	
ltx/en_uk_ware/he.h.m8:heHE.AseveiasOrgana.incipit	…
ltx/en_uk_ware/he.h.m8:heHE.AseveiasOrgana.melody	@ltx/en_uk_ware/miscellanea:misc.HeirmosNotMetered
ltx/en_uk_ware/he.h.m8:heHE.AseveiasOrgana.mode	@ltx/en_uk_ware/miscellanea:misc.Mode8
ltx/en_uk_ware/he.h.m8:heHE.AseveiasOrgana.name	(NM)
ltx/en_uk_ware/he.h.m8:heHE.AseveiasOrgana.ode	@ltx/en_uk_ware/miscellanea:misc.Ode8
ltx/en_uk_ware/he.h.m8:heHE.AseveiasOrgana.text	
ltx/en_uk_ware/he.h.m8:heHE.AsmaAnapempsomen.greekname	
ltx/en_uk_ware/he.h.m8:heHE.AsmaAnapempsomen.incipit	O ye people, let us raise a song…
ltx/en_uk_ware/he.h.m8:heHE.AsmaAnapempsomen.melody	@ltx/en_uk_ware/miscellanea:misc.HeirmosNotMetered
ltx/en_uk_ware/he.h.m8:heHE.AsmaAnapempsomen.mode	@ltx/en_uk_ware/miscellanea:misc.Mode8
ltx/en_uk_ware/he.h.m8:heHE.AsmaAnapempsomen.name	All you people.
ltx/en_uk_ware/he.h.m8:heHE.AsmaAnapempsomen.ode	@ltx/en_uk_ware/miscellanea:misc.Ode1
ltx/en_uk_ware/he.h.m8:heHE.AsmaAnapempsomen.text	O ye people, let us raise a song to our God who works wonders, for He set Israel free from bondage; and with a hymn of victory let us cry aloud: ‘Let us sing to Thee, our only Master.’
ltx/en_uk_ware/he.h.m8:heHE.AsmaAsmaton.greekname	
ltx/en_uk_ware/he.h.m8:heHE.AsmaAsmaton.incipit	…
ltx/en_uk_ware/he.h.m8:heHE.AsmaAsmaton.melody	@ltx/en_uk_ware/miscellanea:misc.HeirmosNotMetered
ltx/en_uk_ware/he.h.m8:heHE.AsmaAsmaton.mode	@ltx/en_uk_ware/miscellanea:misc.Mode8
ltx/en_uk_ware/he.h.m8:heHE.AsmaAsmaton.name	(NM)
ltx/en_uk_ware/he.h.m8:heHE.AsmaAsmaton.ode	@ltx/en_uk_ware/miscellanea:misc.Ode1
ltx/en_uk_ware/he.h.m8:heHE.AsmaAsmaton.text	
ltx/en_uk_ware/he.h.m8:heHE.AsomenOdinToTheo.greekname	
ltx/en_uk_ware/he.h.m8:heHE.AsomenOdinToTheo.incipit	Let us sing a song to God…
ltx/en_uk_ware/he.h.m8:heHE.AsomenOdinToTheo.melody	@ltx/en_uk_ware/miscellanea:misc.HeirmosNotMetered
ltx/en_uk_ware/he.h.m8:heHE.AsomenOdinToTheo.mode	@ltx/en_uk_ware/miscellanea:misc.Mode8
ltx/en_uk_ware/he.h.m8:heHE.AsomenOdinToTheo.name	(NM) Let us sing a song to God
ltx/en_uk_ware/he.h.m8:heHE.AsomenOdinToTheo.ode	@ltx/en_uk_ware/miscellanea:misc.Ode1
ltx/en_uk_ware/he.h.m8:heHE.AsomenOdinToTheo.text	Let us sing a song to God, who delivered Israel from the bitter bondage of Pharaoh, and guided them with a pillar of fire and a cloud of light, for He has been glorified.
ltx/en_uk_ware/he.h.m8:heHE.AsomenToKyrio.greekname	
ltx/en_uk_ware/he.h.m8:heHE.AsomenToKyrio.incipit	…
ltx/en_uk_ware/he.h.m8:heHE.AsomenToKyrio.melody	@ltx/en_uk_ware/miscellanea:misc.HeirmosNotMetered
ltx/en_uk_ware/he.h.m8:heHE.AsomenToKyrio.mode	@ltx/en_uk_ware/miscellanea:misc.Mode8
ltx/en_uk_ware/he.h.m8:heHE.AsomenToKyrio.name	(NM)
ltx/en_uk_ware/he.h.m8:heHE.AsomenToKyrio.ode	@ltx/en_uk_ware/miscellanea:misc.Ode1
ltx/en_uk_ware/he.h.m8:heHE.AsomenToKyrio.text	
ltx/en_uk_ware/he.h.m8:heHE.AsomenToKyrioPantesLaoi.greekname	
ltx/en_uk_ware/he.h.m8:heHE.AsomenToKyrioPantesLaoi.incipit	…
ltx/en_uk_ware/he.h.m8:heHE.AsomenToKyrioPantesLaoi.melody	@ltx/en_uk_ware/miscellanea:misc.HeirmosNotMetered
ltx/en_uk_ware/he.h.m8:heHE.AsomenToKyrioPantesLaoi.mode	@ltx/en_uk_ware/miscellanea:misc.Mode8
ltx/en_uk_ware/he.h.m8:heHE.AsomenToKyrioPantesLaoi.name	(NM)
ltx/en_uk_ware/he.h.m8:heHE.AsomenToKyrioPantesLaoi.ode	@ltx/en_uk_ware/miscellanea:misc.Ode1
ltx/en_uk_ware/he.h.m8:heHE.AsomenToKyrioPantesLaoi.text	
ltx/en_uk_ware/he.h.m8:heHE.AvyssosAmartion.greekname	
ltx/en_uk_ware/he.h.m8:heHE.AvyssosAmartion.incipit	…
ltx/en_uk_ware/he.h.m8:heHE.AvyssosAmartion.melody	@ltx/en_uk_ware/miscellanea:misc.HeirmosNotMetered
ltx/en_uk_ware/he.h.m8:heHE.AvyssosAmartion.mode	@ltx/en_uk_ware/miscellanea:misc.Mode8
ltx/en_uk_ware/he.h.m8:heHE.AvyssosAmartion.name	(NM)
ltx/en_uk_ware/he.h.m8:heHE.AvyssosAmartion.ode	@ltx/en_uk_ware/miscellanea:misc.Ode6
ltx/en_uk_ware/he.h.m8:heHE.AvyssosAmartion.text	
ltx/en_uk_ware/he.h.m8:heHE.ChitonaMoiParaschou.greekname	
ltx/en_uk_ware/he.h.m8:heHE.ChitonaMoiParaschou.incipit	…
ltx/en_uk_ware/he.h.m8:heHE.ChitonaMoiParaschou.melody	@ltx/en_uk_ware/miscellanea:misc.HeirmosNotMetered
ltx/en_uk_ware/he.h.m8:heHE.ChitonaMoiParaschou.mode	@ltx/en_uk_ware/miscellanea:misc.Mode8
ltx/en_uk_ware/he.h.m8:heHE.ChitonaMoiParaschou.name	(NM)
ltx/en_uk_ware/he.h.m8:heHE.ChitonaMoiParaschou.ode	@ltx/en_uk_ware/miscellanea:misc.Ode6
ltx/en_uk_ware/he.h.m8:heHE.ChitonaMoiParaschou.text	
ltx/en_uk_ware/he.h.m8:heHE.EfrixePasaAkoi.greekname	
ltx/en_uk_ware/he.h.m8:heHE.EfrixePasaAkoi.incipit	…
ltx/en_uk_ware/he.h.m8:heHE.EfrixePasaAkoi.melody	@ltx/en_uk_ware/miscellanea:misc.HeirmosNotMetered
ltx/en_uk_ware/he.h.m8:heHE.EfrixePasaAkoi.mode	@ltx/en_uk_ware/miscellanea:misc.Mode8
ltx/en_uk_ware/he.h.m8:heHE.EfrixePasaAkoi.name	(NM)
ltx/en_uk_ware/he.h.m8:heHE.EfrixePasaAkoi.ode	@ltx/en_uk_ware/miscellanea:misc.Ode9
ltx/en_uk_ware/he.h.m8:heHE.EfrixePasaAkoi.text	
ltx/en_uk_ware/he.h.m8:heHE.EisakikoaKyrie.greekname	
ltx/en_uk_ware/he.h.m8:heHE.EisakikoaKyrie.incipit	O Lord, I have heard the mystery…
ltx/en_uk_ware/he.h.m8:heHE.EisakikoaKyrie.melody	@ltx/en_uk_ware/miscellanea:misc.HeirmosNotMetered
ltx/en_uk_ware/he.h.m8:heHE.EisakikoaKyrie.mode	@ltx/en_uk_ware/miscellanea:misc.Mode8
ltx/en_uk_ware/he.h.m8:heHE.EisakikoaKyrie.name	(NM) O Lord, I have heard the mystery
ltx/en_uk_ware/he.h.m8:heHE.EisakikoaKyrie.ode	@ltx/en_uk_ware/miscellanea:misc.Ode4
ltx/en_uk_ware/he.h.m8:heHE.EisakikoaKyrie.text	O Lord, I have heard the mystery of Thy dispensation: I have considered Thy works, and I have glorified Thy God­ head.
ltx/en_uk_ware/he.h.m8:heHE.EisakikoaKyrieTinAkoinSou.greekname	
ltx/en_uk_ware/he.h.m8:heHE.EisakikoaKyrieTinAkoinSou.incipit	O Lord, I have heard…
ltx/en_uk_ware/he.h.m8:heHE.EisakikoaKyrieTinAkoinSou.melody	@ltx/en_uk_ware/miscellanea:misc.HeirmosNotMetered
ltx/en_uk_ware/he.h.m8:heHE.EisakikoaKyrieTinAkoinSou.mode	@ltx/en_uk_ware/miscellanea:misc.Mode8
ltx/en_uk_ware/he.h.m8:heHE.EisakikoaKyrieTinAkoinSou.name	(NM) O Lord, I have heard
ltx/en_uk_ware/he.h.m8:heHE.EisakikoaKyrieTinAkoinSou.ode	@ltx/en_uk_ware/miscellanea:misc.Ode4
ltx/en_uk_ware/he.h.m8:heHE.EisakikoaKyrieTinAkoinSou.text	
ltx/en_uk_ware/he.h.m8:heHE.EkSarkosSouVolides.greekname	
ltx/en_uk_ware/he.h.m8:heHE.EkSarkosSouVolides.incipit	…
ltx/en_uk_ware/he.h.m8:heHE.EkSarkosSouVolides.melody	@ltx/en_uk_ware/miscellanea:misc.HeirmosNotMetered
ltx/en_uk_ware/he.h.m8:heHE.EkSarkosSouVolides.mode	@ltx/en_uk_ware/miscellanea:misc.Mode8
ltx/en_uk_ware/he.h.m8:heHE.EkSarkosSouVolides.name	(NM)
ltx/en_uk_ware/he.h.m8:heHE.EkSarkosSouVolides.ode	@ltx/en_uk_ware/miscellanea:misc.Ode4
ltx/en_uk_ware/he.h.m8:heHE.EkSarkosSouVolides.text	
ltx/en_uk_ware/he.h.m8:heHE.EknoonProstagma.greekname	
ltx/en_uk_ware/he.h.m8:heHE.EknoonProstagma.incipit	…
ltx/en_uk_ware/he.h.m8:heHE.EknoonProstagma.melody	@ltx/en_uk_ware/miscellanea:misc.HeirmosNotMetered
ltx/en_uk_ware/he.h.m8:heHE.EknoonProstagma.mode	@ltx/en_uk_ware/miscellanea:misc.Mode8
ltx/en_uk_ware/he.h.m8:heHE.EknoonProstagma.name	(NM)
ltx/en_uk_ware/he.h.m8:heHE.EknoonProstagma.ode	@ltx/en_uk_ware/miscellanea:misc.Ode7
ltx/en_uk_ware/he.h.m8:heHE.EknoonProstagma.text	
ltx/en_uk_ware/he.h.m8:heHE.EnPedioDeeira.greekname	
ltx/en_uk_ware/he.h.m8:heHE.EnPedioDeeira.incipit	…
ltx/en_uk_ware/he.h.m8:heHE.EnPedioDeeira.melody	@ltx/en_uk_ware/miscellanea:misc.HeirmosNotMetered
ltx/en_uk_ware/he.h.m8:heHE.EnPedioDeeira.mode	@ltx/en_uk_ware/miscellanea:misc.Mode8
ltx/en_uk_ware/he.h.m8:heHE.EnPedioDeeira.name	(NM)
ltx/en_uk_ware/he.h.m8:heHE.EnPedioDeeira.ode	@ltx/en_uk_ware/miscellanea:misc.Ode7
ltx/en_uk_ware/he.h.m8:heHE.EnPedioDeeira.text	
ltx/en_uk_ware/he.h.m8:heHE.EpevisEfIppous.greekname	
ltx/en_uk_ware/he.h.m8:heHE.EpevisEfIppous.incipit	…
ltx/en_uk_ware/he.h.m8:heHE.EpevisEfIppous.melody	@ltx/en_uk_ware/miscellanea:misc.HeirmosNotMetered
ltx/en_uk_ware/he.h.m8:heHE.EpevisEfIppous.mode	@ltx/en_uk_ware/miscellanea:misc.Mode8
ltx/en_uk_ware/he.h.m8:heHE.EpevisEfIppous.name	(NM)
ltx/en_uk_ware/he.h.m8:heHE.EpevisEfIppous.ode	@ltx/en_uk_ware/miscellanea:misc.Ode4
ltx/en_uk_ware/he.h.m8:heHE.EpevisEfIppous.text	
ltx/en_uk_ware/he.h.m8:heHE.EptaplasiosKaminon.greekname	
ltx/en_uk_ware/he.h.m8:heHE.EptaplasiosKaminon.incipit	The Chaldaean tyrant…
ltx/en_uk_ware/he.h.m8:heHE.EptaplasiosKaminon.melody	@ltx/en_uk_ware/miscellanea:misc.HeirmosNotMetered
ltx/en_uk_ware/he.h.m8:heHE.EptaplasiosKaminon.mode	@ltx/en_uk_ware/miscellanea:misc.Mode8
ltx/en_uk_ware/he.h.m8:heHE.EptaplasiosKaminon.name	(NM) The Chaldaean tyrant
ltx/en_uk_ware/he.h.m8:heHE.EptaplasiosKaminon.ode	@ltx/en_uk_ware/miscellanea:misc.Ode8
ltx/en_uk_ware/he.h.m8:heHE.EptaplasiosKaminon.text	The Chaldaean tyrant in his madness ordered the furnace to be heated seven times more for the holy Children; but seeing them saved by a greater power, he cried aloud: ‘O ye Children, bless the Creator and Deliverer; O ye priests, sing His praises; O ye people, exalt Him above all for ever.’
ltx/en_uk_ware/he.h.m8:heHE.EstereothiIKardiaMouEnKyrio.greekname	
ltx/en_uk_ware/he.h.m8:heHE.EstereothiIKardiaMouEnKyrio.incipit	…
ltx/en_uk_ware/he.h.m8:heHE.EstereothiIKardiaMouEnKyrio.melody	@ltx/en_uk_ware/miscellanea:misc.HeirmosNotMetered
ltx/en_uk_ware/he.h.m8:heHE.EstereothiIKardiaMouEnKyrio.mode	@ltx/en_uk_ware/miscellanea:misc.Mode8
ltx/en_uk_ware/he.h.m8:heHE.EstereothiIKardiaMouEnKyrio.name	(NM)
ltx/en_uk_ware/he.h.m8:heHE.EstereothiIKardiaMouEnKyrio.ode	@ltx/en_uk_ware/miscellanea:misc.Ode3
ltx/en_uk_ware/he.h.m8:heHE.EstereothiIKardiaMouEnKyrio.text	
ltx/en_uk_ware/he.h.m8:heHE.EvlogeitePaides.greekname	
ltx/en_uk_ware/he.h.m8:heHE.EvlogeitePaides.incipit	…
ltx/en_uk_ware/he.h.m8:heHE.EvlogeitePaides.melody	@ltx/en_uk_ware/miscellanea:misc.HeirmosNotMetered
ltx/en_uk_ware/he.h.m8:heHE.EvlogeitePaides.mode	@ltx/en_uk_ware/miscellanea:misc.Mode8
ltx/en_uk_ware/he.h.m8:heHE.EvlogeitePaides.name	(NM)
ltx/en_uk_ware/he.h.m8:heHE.EvlogeitePaides.ode	@ltx/en_uk_ware/miscellanea:misc.Ode8
ltx/en_uk_ware/he.h.m8:heHE.EvlogeitePaides.text	
ltx/en_uk_ware/he.h.m8:heHE.EvlogitosOKyrios.greekname	
ltx/en_uk_ware/he.h.m8:heHE.EvlogitosOKyrios.incipit	Blessed be the Lord God…
ltx/en_uk_ware/he.h.m8:heHE.EvlogitosOKyrios.melody	@ltx/en_uk_ware/miscellanea:misc.HeirmosNotMetered
ltx/en_uk_ware/he.h.m8:heHE.EvlogitosOKyrios.mode	@ltx/en_uk_ware/miscellanea:misc.Mode8
ltx/en_uk_ware/he.h.m8:heHE.EvlogitosOKyrios.name	(NM) Blessed be the Lord God
ltx/en_uk_ware/he.h.m8:heHE.EvlogitosOKyrios.ode	@ltx/en_uk_ware/miscellanea:misc.Ode9
ltx/en_uk_ware/he.h.m8:heHE.EvlogitosOKyrios.text	Blessed be the Lord God of Israel, for He has raised up a horn of salvation for us in the house of His servant David; whereby the Dayspring from on high has visited us, and guided us into the way of peace.
ltx/en_uk_ware/he.h.m8:heHE.ExOrousKataskiou.greekname	
ltx/en_uk_ware/he.h.m8:heHE.ExOrousKataskiou.incipit	From the overshadowed mountain…
ltx/en_uk_ware/he.h.m8:heHE.ExOrousKataskiou.melody	@ltx/en_uk_ware/miscellanea:misc.HeirmosNotMetered
ltx/en_uk_ware/he.h.m8:heHE.ExOrousKataskiou.mode	@ltx/en_uk_ware/miscellanea:misc.Mode8
ltx/en_uk_ware/he.h.m8:heHE.ExOrousKataskiou.name	(NM) From the overshadowed mountain
ltx/en_uk_ware/he.h.m8:heHE.ExOrousKataskiou.ode	@ltx/en_uk_ware/miscellanea:misc.Ode4
ltx/en_uk_ware/he.h.m8:heHE.ExOrousKataskiou.text	From the overshadowed mountain, from the one Theotokos, the Prophet in divine vision foresaw Thy coming in the flesh, O Word, and he glorified Thy power with fear.
ltx/en_uk_ware/he.h.m8:heHE.ExestiEpiTouto.greekname	
ltx/en_uk_ware/he.h.m8:heHE.ExestiEpiTouto.incipit	Heaven was amazed…
ltx/en_uk_ware/he.h.m8:heHE.ExestiEpiTouto.melody	@ltx/en_uk_ware/miscellanea:misc.HeirmosNotMetered
ltx/en_uk_ware/he.h.m8:heHE.ExestiEpiTouto.mode	@ltx/en_uk_ware/miscellanea:misc.Mode8
ltx/en_uk_ware/he.h.m8:heHE.ExestiEpiTouto.name	(NM) Heaven was amazed
ltx/en_uk_ware/he.h.m8:heHE.ExestiEpiTouto.ode	@ltx/en_uk_ware/miscellanea:misc.Ode9
ltx/en_uk_ware/he.h.m8:heHE.ExestiEpiTouto.text	Heaven was amazed at this, the ends of the earth were struck with wonder, that God should be revealed incarnate unto men. Thy womb became more spacious that the heavens: therefore, O Theotokos, the chief leaders of the angels and mankind magnify thee.
ltx/en_uk_ware/he.h.m8:heHE.FotisonImas.greekname	
ltx/en_uk_ware/he.h.m8:heHE.FotisonImas.incipit	…
ltx/en_uk_ware/he.h.m8:heHE.FotisonImas.melody	@ltx/en_uk_ware/miscellanea:misc.HeirmosNotMetered
ltx/en_uk_ware/he.h.m8:heHE.FotisonImas.mode	@ltx/en_uk_ware/miscellanea:misc.Mode8
ltx/en_uk_ware/he.h.m8:heHE.FotisonImas.name	(NM)
ltx/en_uk_ware/he.h.m8:heHE.FotisonImas.ode	@ltx/en_uk_ware/miscellanea:misc.Ode5
ltx/en_uk_ware/he.h.m8:heHE.FotisonImas.text	
ltx/en_uk_ware/he.h.m8:heHE.IKekommeni.greekname	
ltx/en_uk_ware/he.h.m8:heHE.IKekommeni.incipit	…
ltx/en_uk_ware/he.h.m8:heHE.IKekommeni.melody	@ltx/en_uk_ware/miscellanea:misc.HeirmosNotMetered
ltx/en_uk_ware/he.h.m8:heHE.IKekommeni.mode	@ltx/en_uk_ware/miscellanea:misc.Mode8
ltx/en_uk_ware/he.h.m8:heHE.IKekommeni.name	(NM)
ltx/en_uk_ware/he.h.m8:heHE.IKekommeni.ode	@ltx/en_uk_ware/miscellanea:misc.Ode1
ltx/en_uk_ware/he.h.m8:heHE.IKekommeni.text	
ltx/en_uk_ware/he.h.m8:heHE.IdeteIdeteOKathierosas.greekname	
ltx/en_uk_ware/he.h.m8:heHE.IdeteIdeteOKathierosas.incipit	See now, see that I am your God…
ltx/en_uk_ware/he.h.m8:heHE.IdeteIdeteOKathierosas.melody	@ltx/en_uk_ware/miscellanea:misc.HeirmosNotMetered
ltx/en_uk_ware/he.h.m8:heHE.IdeteIdeteOKathierosas.mode	@ltx/en_uk_ware/miscellanea:misc.Mode8
ltx/en_uk_ware/he.h.m8:heHE.IdeteIdeteOKathierosas.name	(NM) See now, see that I am your God
ltx/en_uk_ware/he.h.m8:heHE.IdeteIdeteOKathierosas.ode	@ltx/en_uk_ware/miscellanea:misc.Ode2
ltx/en_uk_ware/he.h.m8:heHE.IdeteIdeteOKathierosas.text	See now, see that I am your God, who have sanctified for you the tenth part of the days of every year as acceptable first­ fruits: and this commandment have I given to My people for their deliverance from the passions and as a beginning of salvation.
ltx/en_uk_ware/he.h.m8:heHE.IdeteIdeteOPalaiTonIsrail.greekname	
ltx/en_uk_ware/he.h.m8:heHE.IdeteIdeteOPalaiTonIsrail.incipit	See now, see…
ltx/en_uk_ware/he.h.m8:heHE.IdeteIdeteOPalaiTonIsrail.melody	@ltx/en_uk_ware/miscellanea:misc.HeirmosNotMetered
ltx/en_uk_ware/he.h.m8:heHE.IdeteIdeteOPalaiTonIsrail.mode	@ltx/en_uk_ware/miscellanea:misc.Mode8
ltx/en_uk_ware/he.h.m8:heHE.IdeteIdeteOPalaiTonIsrail.name	(NM) See now, see
ltx/en_uk_ware/he.h.m8:heHE.IdeteIdeteOPalaiTonIsrail.ode	@ltx/en_uk_ware/miscellanea:misc.Ode2
ltx/en_uk_ware/he.h.m8:heHE.IdeteIdeteOPalaiTonIsrail.text	See now, see that I am God, who led the people of Israel in times of old through the Red Sea, and saved them and fed them, setting them free from the bitter bondage of Pharaoh.
ltx/en_uk_ware/he.h.m8:heHE.IdeteIdeteOPrinGenesthai.greekname	
ltx/en_uk_ware/he.h.m8:heHE.IdeteIdeteOPrinGenesthai.incipit	See now, that I am God…
ltx/en_uk_ware/he.h.m8:heHE.IdeteIdeteOPrinGenesthai.melody	@ltx/en_uk_ware/miscellanea:misc.HeirmosNotMetered
ltx/en_uk_ware/he.h.m8:heHE.IdeteIdeteOPrinGenesthai.mode	@ltx/en_uk_ware/miscellanea:misc.Mode8
ltx/en_uk_ware/he.h.m8:heHE.IdeteIdeteOPrinGenesthai.name	(NM) See now, that I am God
ltx/en_uk_ware/he.h.m8:heHE.IdeteIdeteOPrinGenesthai.ode	@ltx/en_uk_ware/miscellanea:misc.Ode2
ltx/en_uk_ware/he.h.m8:heHE.IdeteIdeteOPrinGenesthai.text	See now, see that I am God: before the world was n1ade, before earth and heaven were established, I knew all things, for I dwell wholly in the Father and bear the whole Father in Myself.
ltx/en_uk_ware/he.h.m8:heHE.IdeteIdeteOProTonAionon.greekname	
ltx/en_uk_ware/he.h.m8:heHE.IdeteIdeteOProTonAionon.incipit	See now, see that I am your God…
ltx/en_uk_ware/he.h.m8:heHE.IdeteIdeteOProTonAionon.melody	@ltx/en_uk_ware/miscellanea:misc.HeirmosNotMetered
ltx/en_uk_ware/he.h.m8:heHE.IdeteIdeteOProTonAionon.mode	@ltx/en_uk_ware/miscellanea:misc.Mode8
ltx/en_uk_ware/he.h.m8:heHE.IdeteIdeteOProTonAionon.name	(NM) See now, see that I am your God
ltx/en_uk_ware/he.h.m8:heHE.IdeteIdeteOProTonAionon.ode	@ltx/en_uk_ware/miscellanea:misc.Ode2
ltx/en_uk_ware/he.h.m8:heHE.IdeteIdeteOProTonAionon.text	See now, see that I am your God, before all ages begotten from the Father, and in the last times conceived without man by the Virgin: and I have destroyed the sin of Adam the forefather in My love for mankind.
ltx/en_uk_ware/he.h.m8:heHE.IlasthitiMoiSotir.greekname	
ltx/en_uk_ware/he.h.m8:heHE.IlasthitiMoiSotir.incipit	Be merciful to me…
ltx/en_uk_ware/he.h.m8:heHE.IlasthitiMoiSotir.melody	@ltx/en_uk_ware/miscellanea:misc.HeirmosNotMetered
ltx/en_uk_ware/he.h.m8:heHE.IlasthitiMoiSotir.mode	@ltx/en_uk_ware/miscellanea:misc.Mode8
ltx/en_uk_ware/he.h.m8:heHE.IlasthitiMoiSotir.name	(NM) Be merciful to me
ltx/en_uk_ware/he.h.m8:heHE.IlasthitiMoiSotir.ode	@ltx/en_uk_ware/miscellanea:misc.Ode6
ltx/en_uk_ware/he.h.m8:heHE.IlasthitiMoiSotir.text	Be merciful to me, O Saviour, for many are my transgressions, and lead me up, I beseech Thee, from the abyss of evil: for unto Thee have I cried; hearken unto me, O God of my salvation.
ltx/en_uk_ware/he.h.m8:heHE.InaTiMeAposo.greekname	
ltx/en_uk_ware/he.h.m8:heHE.InaTiMeAposo.incipit	O Light that never sets…
ltx/en_uk_ware/he.h.m8:heHE.InaTiMeAposo.melody	@ltx/en_uk_ware/miscellanea:misc.HeirmosNotMetered
ltx/en_uk_ware/he.h.m8:heHE.InaTiMeAposo.mode	@ltx/en_uk_ware/miscellanea:misc.Mode8
ltx/en_uk_ware/he.h.m8:heHE.InaTiMeAposo.name	(NM) O Light that never sets
ltx/en_uk_ware/he.h.m8:heHE.InaTiMeAposo.ode	@ltx/en_uk_ware/miscellanea:misc.Ode5
ltx/en_uk_ware/he.h.m8:heHE.InaTiMeAposo.text	O Light that never sets, why hast Thou cast me from Thy face? And why has the alien darkness covered me in my wretchedness? But I entreat Thee, cause me to return, and direct my paths to the light of Thy commandments.
ltx/en_uk_ware/he.h.m8:heHE.KyrieOTheosImon.greekname	
ltx/en_uk_ware/he.h.m8:heHE.KyrieOTheosImon.incipit	…
ltx/en_uk_ware/he.h.m8:heHE.KyrieOTheosImon.melody	@ltx/en_uk_ware/miscellanea:misc.HeirmosNotMetered
ltx/en_uk_ware/he.h.m8:heHE.KyrieOTheosImon.mode	@ltx/en_uk_ware/miscellanea:misc.Mode8
ltx/en_uk_ware/he.h.m8:heHE.KyrieOTheosImon.name	(NM)
ltx/en_uk_ware/he.h.m8:heHE.KyrieOTheosImon.ode	@ltx/en_uk_ware/miscellanea:misc.Ode5
ltx/en_uk_ware/he.h.m8:heHE.KyrieOTheosImon.text	
ltx/en_uk_ware/he.h.m8:heHE.KyriosTheotokon.greekname	
ltx/en_uk_ware/he.h.m8:heHE.KyriosTheotokon.incipit	Saved through thee, pure Virgin…
ltx/en_uk_ware/he.h.m8:heHE.KyriosTheotokon.melody	@ltx/en_uk_ware/miscellanea:misc.HeirmosNotMetered
ltx/en_uk_ware/he.h.m8:heHE.KyriosTheotokon.mode	@ltx/en_uk_ware/miscellanea:misc.Mode8
ltx/en_uk_ware/he.h.m8:heHE.KyriosTheotokon.name	(NM) Saved through thee, pure Virgin
ltx/en_uk_ware/he.h.m8:heHE.KyriosTheotokon.ode	@ltx/en_uk_ware/miscellanea:misc.Ode9
ltx/en_uk_ware/he.h.m8:heHE.KyriosTheotokon.text	
ltx/en_uk_ware/he.h.m8:heHE.MegalynomenSeTinMiteraTouFotos.greekname	
ltx/en_uk_ware/he.h.m8:heHE.MegalynomenSeTinMiteraTouFotos.incipit	We magnify thee…
ltx/en_uk_ware/he.h.m8:heHE.MegalynomenSeTinMiteraTouFotos.melody	@ltx/en_uk_ware/miscellanea:misc.HeirmosNotMetered
ltx/en_uk_ware/he.h.m8:heHE.MegalynomenSeTinMiteraTouFotos.mode	@ltx/en_uk_ware/miscellanea:misc.Mode8
ltx/en_uk_ware/he.h.m8:heHE.MegalynomenSeTinMiteraTouFotos.name	(NM) We magnify thee
ltx/en_uk_ware/he.h.m8:heHE.MegalynomenSeTinMiteraTouFotos.ode	@ltx/en_uk_ware/miscellanea:misc.Ode9
ltx/en_uk_ware/he.h.m8:heHE.MegalynomenSeTinMiteraTouFotos.text	We magnify thee, the Mother of the Light, and we glorify thee, O Virgin Theotokos, for thou hast borne Christ the Saviour of our souls.
ltx/en_uk_ware/he.h.m8:heHE.MegalynomenSeTinMiteraTouTheou.greekname	
ltx/en_uk_ware/he.h.m8:heHE.MegalynomenSeTinMiteraTouTheou.incipit	…
ltx/en_uk_ware/he.h.m8:heHE.MegalynomenSeTinMiteraTouTheou.melody	@ltx/en_uk_ware/miscellanea:misc.HeirmosNotMetered
ltx/en_uk_ware/he.h.m8:heHE.MegalynomenSeTinMiteraTouTheou.mode	@ltx/en_uk_ware/miscellanea:misc.Mode8
ltx/en_uk_ware/he.h.m8:heHE.MegalynomenSeTinMiteraTouTheou.name	(NM)
ltx/en_uk_ware/he.h.m8:heHE.MegalynomenSeTinMiteraTouTheou.ode	@ltx/en_uk_ware/miscellanea:misc.Ode9
ltx/en_uk_ware/he.h.m8:heHE.MegalynomenSeTinMiteraTouTheou.text	
ltx/en_uk_ware/he.h.m8:heHE.MegalynomenSeTinPanamomon.greekname	
ltx/en_uk_ware/he.h.m8:heHE.MegalynomenSeTinPanamomon.incipit	We magnify thee…
ltx/en_uk_ware/he.h.m8:heHE.MegalynomenSeTinPanamomon.melody	@ltx/en_uk_ware/miscellanea:misc.HeirmosNotMetered
ltx/en_uk_ware/he.h.m8:heHE.MegalynomenSeTinPanamomon.mode	@ltx/en_uk_ware/miscellanea:misc.Mode8
ltx/en_uk_ware/he.h.m8:heHE.MegalynomenSeTinPanamomon.name	(NM) We magnify thee
ltx/en_uk_ware/he.h.m8:heHE.MegalynomenSeTinPanamomon.ode	@ltx/en_uk_ware/miscellanea:misc.Ode9
ltx/en_uk_ware/he.h.m8:heHE.MegalynomenSeTinPanamomon.text	We magnify thee, most pure Mother of Christ our God, for thou wast overshadowed by the Holy Spirit.
ltx/en_uk_ware/he.h.m8:heHE.MousikonOrganon.greekname	
ltx/en_uk_ware/he.h.m8:heHE.MousikonOrganon.incipit	…
ltx/en_uk_ware/he.h.m8:heHE.MousikonOrganon.melody	@ltx/en_uk_ware/miscellanea:misc.HeirmosNotMetered
ltx/en_uk_ware/he.h.m8:heHE.MousikonOrganon.mode	@ltx/en_uk_ware/miscellanea:misc.Mode8
ltx/en_uk_ware/he.h.m8:heHE.MousikonOrganon.name	(NM)
ltx/en_uk_ware/he.h.m8:heHE.MousikonOrganon.ode	@ltx/en_uk_ware/miscellanea:misc.Ode8
ltx/en_uk_ware/he.h.m8:heHE.MousikonOrganon.text	When the instruments of music sounded, countless multitudes worshipped the image in Dura but the three Children, refusing to bow down, praised and glorified the Lord for ever.
ltx/en_uk_ware/he.h.m8:heHE.MystikosEiTheotoke.greekname	
ltx/en_uk_ware/he.h.m8:heHE.MystikosEiTheotoke.incipit	…
ltx/en_uk_ware/he.h.m8:heHE.MystikosEiTheotoke.melody	@ltx/en_uk_ware/miscellanea:misc.HeirmosNotMetered
ltx/en_uk_ware/he.h.m8:heHE.MystikosEiTheotoke.mode	@ltx/en_uk_ware/miscellanea:misc.Mode8
ltx/en_uk_ware/he.h.m8:heHE.MystikosEiTheotoke.name	(NM)
ltx/en_uk_ware/he.h.m8:heHE.MystikosEiTheotoke.ode	@ltx/en_uk_ware/miscellanea:misc.Ode9
ltx/en_uk_ware/he.h.m8:heHE.MystikosEiTheotoke.text	
ltx/en_uk_ware/he.h.m8:heHE.MystikosOProfitis.greekname	
ltx/en_uk_ware/he.h.m8:heHE.MystikosOProfitis.incipit	…
ltx/en_uk_ware/he.h.m8:heHE.MystikosOProfitis.melody	@ltx/en_uk_ware/miscellanea:misc.HeirmosNotMetered
ltx/en_uk_ware/he.h.m8:heHE.MystikosOProfitis.mode	@ltx/en_uk_ware/miscellanea:misc.Mode8
ltx/en_uk_ware/he.h.m8:heHE.MystikosOProfitis.name	(NM)
ltx/en_uk_ware/he.h.m8:heHE.MystikosOProfitis.ode	@ltx/en_uk_ware/miscellanea:misc.Ode4
ltx/en_uk_ware/he.h.m8:heHE.MystikosOProfitis.text	
ltx/en_uk_ware/he.h.m8:heHE.NikitaiTyrannou.greekname	
ltx/en_uk_ware/he.h.m8:heHE.NikitaiTyrannou.incipit	Victors over fire…
ltx/en_uk_ware/he.h.m8:heHE.NikitaiTyrannou.melody	@ltx/en_uk_ware/miscellanea:misc.HeirmosNotMetered
ltx/en_uk_ware/he.h.m8:heHE.NikitaiTyrannou.mode	@ltx/en_uk_ware/miscellanea:misc.Mode8
ltx/en_uk_ware/he.h.m8:heHE.NikitaiTyrannou.name	(NM) Victors over fire
ltx/en_uk_ware/he.h.m8:heHE.NikitaiTyrannou.ode	@ltx/en_uk_ware/miscellanea:misc.Ode8
ltx/en_uk_ware/he.h.m8:heHE.NikitaiTyrannou.text	
ltx/en_uk_ware/he.h.m8:heHE.NotiouThiros.greekname	
ltx/en_uk_ware/he.h.m8:heHE.NotiouThiros.incipit	…
ltx/en_uk_ware/he.h.m8:heHE.NotiouThiros.melody	@ltx/en_uk_ware/miscellanea:misc.HeirmosNotMetered
ltx/en_uk_ware/he.h.m8:heHE.NotiouThiros.mode	@ltx/en_uk_ware/miscellanea:misc.Mode8
ltx/en_uk_ware/he.h.m8:heHE.NotiouThiros.name	(NM)
ltx/en_uk_ware/he.h.m8:heHE.NotiouThiros.ode	@ltx/en_uk_ware/miscellanea:misc.Ode6
ltx/en_uk_ware/he.h.m8:heHE.NotiouThiros.text	
ltx/en_uk_ware/he.h.m8:heHE.ODiAngelouPaidas.greekname	
ltx/en_uk_ware/he.h.m8:heHE.ODiAngelouPaidas.incipit	Thou hast refreshed the Children…
ltx/en_uk_ware/he.h.m8:heHE.ODiAngelouPaidas.melody	@ltx/en_uk_ware/miscellanea:misc.HeirmosNotMetered
ltx/en_uk_ware/he.h.m8:heHE.ODiAngelouPaidas.mode	@ltx/en_uk_ware/miscellanea:misc.Mode8
ltx/en_uk_ware/he.h.m8:heHE.ODiAngelouPaidas.name	(NM) Thou hast refreshed the Children
ltx/en_uk_ware/he.h.m8:heHE.ODiAngelouPaidas.ode	@ltx/en_uk_ware/miscellanea:misc.Ode7
ltx/en_uk_ware/he.h.m8:heHE.ODiAngelouPaidas.text	Thou hast refreshed the Children in the furnace through an angel and changed the roaring flames to dew. O God of our fathers, blessed art Thou.
ltx/en_uk_ware/he.h.m8:heHE.ODiaVroseos.greekname	
ltx/en_uk_ware/he.h.m8:heHE.ODiaVroseos.incipit	…
ltx/en_uk_ware/he.h.m8:heHE.ODiaVroseos.melody	@ltx/en_uk_ware/miscellanea:misc.HeirmosNotMetered
ltx/en_uk_ware/he.h.m8:heHE.ODiaVroseos.mode	@ltx/en_uk_ware/miscellanea:misc.Mode8
ltx/en_uk_ware/he.h.m8:heHE.ODiaVroseos.name	(NM)
ltx/en_uk_ware/he.h.m8:heHE.ODiaVroseos.ode	@ltx/en_uk_ware/miscellanea:misc.Ode9
ltx/en_uk_ware/he.h.m8:heHE.ODiaVroseos.text	
ltx/en_uk_ware/he.h.m8:heHE.OEkNyktosAgnoias.greekname	
ltx/en_uk_ware/he.h.m8:heHE.OEkNyktosAgnoias.incipit	…
ltx/en_uk_ware/he.h.m8:heHE.OEkNyktosAgnoias.melody	@ltx/en_uk_ware/miscellanea:misc.HeirmosNotMetered
ltx/en_uk_ware/he.h.m8:heHE.OEkNyktosAgnoias.mode	@ltx/en_uk_ware/miscellanea:misc.Mode8
ltx/en_uk_ware/he.h.m8:heHE.OEkNyktosAgnoias.name	(NM)
ltx/en_uk_ware/he.h.m8:heHE.OEkNyktosAgnoias.ode	@ltx/en_uk_ware/miscellanea:misc.Ode5
ltx/en_uk_ware/he.h.m8:heHE.OEkNyktosAgnoias.text	
ltx/en_uk_ware/he.h.m8:heHE.OEnArchiTinGin.greekname	
ltx/en_uk_ware/he.h.m8:heHE.OEnArchiTinGin.incipit	O Thou who in the beginning…
ltx/en_uk_ware/he.h.m8:heHE.OEnArchiTinGin.melody	@ltx/en_uk_ware/miscellanea:misc.HeirmosNotMetered
ltx/en_uk_ware/he.h.m8:heHE.OEnArchiTinGin.mode	@ltx/en_uk_ware/miscellanea:misc.Mode8
ltx/en_uk_ware/he.h.m8:heHE.OEnArchiTinGin.name	(NM) O Thou who in the beginning
ltx/en_uk_ware/he.h.m8:heHE.OEnArchiTinGin.ode	@ltx/en_uk_ware/miscellanea:misc.Ode7
ltx/en_uk_ware/he.h.m8:heHE.OEnArchiTinGin.text	O Thou who in the beginning hast laid the foundations of the earth and established the heavens by Thy word, blessed art Thou unto all ages, O Lord God of our fathers.
ltx/en_uk_ware/he.h.m8:heHE.OProfitisAvvakoum.greekname	
ltx/en_uk_ware/he.h.m8:heHE.OProfitisAvvakoum.incipit	…
ltx/en_uk_ware/he.h.m8:heHE.OProfitisAvvakoum.melody	@ltx/en_uk_ware/miscellanea:misc.HeirmosNotMetered
ltx/en_uk_ware/he.h.m8:heHE.OProfitisAvvakoum.mode	@ltx/en_uk_ware/miscellanea:misc.Mode8
ltx/en_uk_ware/he.h.m8:heHE.OProfitisAvvakoum.name	(NM)
ltx/en_uk_ware/he.h.m8:heHE.OProfitisAvvakoum.ode	@ltx/en_uk_ware/miscellanea:misc.Ode4
ltx/en_uk_ware/he.h.m8:heHE.OProfitisAvvakoum.text	
ltx/en_uk_ware/he.h.m8:heHE.OStegazonEnYdasi.greekname	
ltx/en_uk_ware/he.h.m8:heHE.OStegazonEnYdasi.incipit	O Thou who coverest…
ltx/en_uk_ware/he.h.m8:heHE.OStegazonEnYdasi.melody	@ltx/en_uk_ware/miscellanea:misc.HeirmosNotMetered
ltx/en_uk_ware/he.h.m8:heHE.OStegazonEnYdasi.mode	@ltx/en_uk_ware/miscellanea:misc.Mode8
ltx/en_uk_ware/he.h.m8:heHE.OStegazonEnYdasi.name	(NM) O Thou who coverest
ltx/en_uk_ware/he.h.m8:heHE.OStegazonEnYdasi.ode	@ltx/en_uk_ware/miscellanea:misc.Ode8
ltx/en_uk_ware/he.h.m8:heHE.OStegazonEnYdasi.text	O Thou who coverest Thy high places with the waters, who settest the sand as a bound to the sea and upholdest all things: the sun sings Thy praises, the moon gives Thee glory, every creature offers a hymn to Thee, his Author and Creator, for ever.
ltx/en_uk_ware/he.h.m8:heHE.OStereosasEnTiCheiriSou.greekname	
ltx/en_uk_ware/he.h.m8:heHE.OStereosasEnTiCheiriSou.incipit	O Word of God who hast made firm…
ltx/en_uk_ware/he.h.m8:heHE.OStereosasEnTiCheiriSou.melody	@ltx/en_uk_ware/miscellanea:misc.HeirmosNotMetered
ltx/en_uk_ware/he.h.m8:heHE.OStereosasEnTiCheiriSou.mode	@ltx/en_uk_ware/miscellanea:misc.Mode8
ltx/en_uk_ware/he.h.m8:heHE.OStereosasEnTiCheiriSou.name	(NM) O Word of God who hast made firm
ltx/en_uk_ware/he.h.m8:heHE.OStereosasEnTiCheiriSou.ode	@ltx/en_uk_ware/miscellanea:misc.Ode3
ltx/en_uk_ware/he.h.m8:heHE.OStereosasEnTiCheiriSou.text	O Word of God who hast made firm the heavens with Thine hand, through the enlightenment of Thy true knowledge make firm our hearts, for we have put our trust in Thee.
ltx/en_uk_ware/he.h.m8:heHE.OStereosasKatArchas.greekname	
ltx/en_uk_ware/he.h.m8:heHE.OStereosasKatArchas.incipit	…
ltx/en_uk_ware/he.h.m8:heHE.OStereosasKatArchas.melody	@ltx/en_uk_ware/miscellanea:misc.HeirmosNotMetered
ltx/en_uk_ware/he.h.m8:heHE.OStereosasKatArchas.mode	@ltx/en_uk_ware/miscellanea:misc.Mode8
ltx/en_uk_ware/he.h.m8:heHE.OStereosasKatArchas.name	(NM)
ltx/en_uk_ware/he.h.m8:heHE.OStereosasKatArchas.ode	@ltx/en_uk_ware/miscellanea:misc.Ode3
ltx/en_uk_ware/he.h.m8:heHE.OStereosasKatArchas.text	
ltx/en_uk_ware/he.h.m8:heHE.OStereosasLogo.greekname	
ltx/en_uk_ware/he.h.m8:heHE.OStereosasLogo.incipit	…
ltx/en_uk_ware/he.h.m8:heHE.OStereosasLogo.melody	@ltx/en_uk_ware/miscellanea:misc.HeirmosNotMetered
ltx/en_uk_ware/he.h.m8:heHE.OStereosasLogo.mode	@ltx/en_uk_ware/miscellanea:misc.Mode8
ltx/en_uk_ware/he.h.m8:heHE.OStereosasLogo.name	(NM)
ltx/en_uk_ware/he.h.m8:heHE.OStereosasLogo.ode	@ltx/en_uk_ware/miscellanea:misc.Ode3
ltx/en_uk_ware/he.h.m8:heHE.OStereosasLogo.text	
ltx/en_uk_ware/he.h.m8:heHE.OTousPaidasDrosisas.greekname	
ltx/en_uk_ware/he.h.m8:heHE.OTousPaidasDrosisas.incipit	Thou hast refreshed the Children…
ltx/en_uk_ware/he.h.m8:heHE.OTousPaidasDrosisas.melody	@ltx/en_uk_ware/miscellanea:misc.HeirmosNotMetered
ltx/en_uk_ware/he.h.m8:heHE.OTousPaidasDrosisas.mode	@ltx/en_uk_ware/miscellanea:misc.Mode8
ltx/en_uk_ware/he.h.m8:heHE.OTousPaidasDrosisas.name	(NM) Thou hast refreshed the Children
ltx/en_uk_ware/he.h.m8:heHE.OTousPaidasDrosisas.ode	@ltx/en_uk_ware/miscellanea:misc.Ode7
ltx/en_uk_ware/he.h.m8:heHE.OTousPaidasDrosisas.text	Thou hast refreshed the Children with dew in the furnace, and Thou hast preserved Thy Mother as a Virgin after childbirth: Blessed art Thou, O Lord God of our fathers.
ltx/en_uk_ware/he.h.m8:heHE.OTrismakaristonXylon.greekname	
ltx/en_uk_ware/he.h.m8:heHE.OTrismakaristonXylon.incipit	…
ltx/en_uk_ware/he.h.m8:heHE.OTrismakaristonXylon.melody	@ltx/en_uk_ware/miscellanea:misc.HeirmosNotMetered
ltx/en_uk_ware/he.h.m8:heHE.OTrismakaristonXylon.mode	@ltx/en_uk_ware/miscellanea:misc.Mode8
ltx/en_uk_ware/he.h.m8:heHE.OTrismakaristonXylon.name	(NM)
ltx/en_uk_ware/he.h.m8:heHE.OTrismakaristonXylon.ode	@ltx/en_uk_ware/miscellanea:misc.Ode5
ltx/en_uk_ware/he.h.m8:heHE.OTrismakaristonXylon.text	
ltx/en_uk_ware/he.h.m8:heHE.OiEkTisIoudaias.greekname	
ltx/en_uk_ware/he.h.m8:heHE.OiEkTisIoudaias.incipit	…
ltx/en_uk_ware/he.h.m8:heHE.OiEkTisIoudaias.melody	@ltx/en_uk_ware/miscellanea:misc.HeirmosNotMetered
ltx/en_uk_ware/he.h.m8:heHE.OiEkTisIoudaias.mode	@ltx/en_uk_ware/miscellanea:misc.Mode8
ltx/en_uk_ware/he.h.m8:heHE.OiEkTisIoudaias.name	(NM)
ltx/en_uk_ware/he.h.m8:heHE.OiEkTisIoudaias.ode	@ltx/en_uk_ware/miscellanea:misc.Ode7
ltx/en_uk_ware/he.h.m8:heHE.OiEkTisIoudaias.text	
ltx/en_uk_ware/he.h.m8:heHE.OiTheorrimonesPaides.greekname	
ltx/en_uk_ware/he.h.m8:heHE.OiTheorrimonesPaides.incipit	Inspired by God…
ltx/en_uk_ware/he.h.m8:heHE.OiTheorrimonesPaides.melody	@ltx/en_uk_ware/miscellanea:misc.HeirmosNotMetered
ltx/en_uk_ware/he.h.m8:heHE.OiTheorrimonesPaides.mode	@ltx/en_uk_ware/miscellanea:misc.Mode8
ltx/en_uk_ware/he.h.m8:heHE.OiTheorrimonesPaides.name	(NM) Inspired by God
ltx/en_uk_ware/he.h.m8:heHE.OiTheorrimonesPaides.ode	@ltx/en_uk_ware/miscellanea:misc.Ode8
ltx/en_uk_ware/he.h.m8:heHE.OiTheorrimonesPaides.text	Inspired by God, the Children in the furnace trampled underfoot the flames of fire, and sang aloud: O ye works of the Lord, bless ye the Lord.
ltx/en_uk_ware/he.h.m8:heHE.OiTisChaldaiasKaminou.greekname	
ltx/en_uk_ware/he.h.m8:heHE.OiTisChaldaiasKaminou.incipit	…
ltx/en_uk_ware/he.h.m8:heHE.OiTisChaldaiasKaminou.melody	@ltx/en_uk_ware/miscellanea:misc.HeirmosNotMetered
ltx/en_uk_ware/he.h.m8:heHE.OiTisChaldaiasKaminou.mode	@ltx/en_uk_ware/miscellanea:misc.Mode8
ltx/en_uk_ware/he.h.m8:heHE.OiTisChaldaiasKaminou.name	(NM)
ltx/en_uk_ware/he.h.m8:heHE.OiTisChaldaiasKaminou.ode	@ltx/en_uk_ware/miscellanea:misc.Ode7
ltx/en_uk_ware/he.h.m8:heHE.OiTisChaldaiasKaminou.text	
ltx/en_uk_ware/he.h.m8:heHE.OrousParilthes.greekname	
ltx/en_uk_ware/he.h.m8:heHE.OrousParilthes.incipit	Thou hast surpassed the bounds…
ltx/en_uk_ware/he.h.m8:heHE.OrousParilthes.melody	@ltx/en_uk_ware/miscellanea:misc.HeirmosNotMetered
ltx/en_uk_ware/he.h.m8:heHE.OrousParilthes.mode	@ltx/en_uk_ware/miscellanea:misc.Mode8
ltx/en_uk_ware/he.h.m8:heHE.OrousParilthes.name	(NM) Thou hast surpassed the bounds
ltx/en_uk_ware/he.h.m8:heHE.OrousParilthes.ode	@ltx/en_uk_ware/miscellanea:misc.Ode9
ltx/en_uk_ware/he.h.m8:heHE.OrousParilthes.text	
ltx/en_uk_ware/he.h.m8:heHE.OrthrizeiToPnevmaMou.greekname	
ltx/en_uk_ware/he.h.m8:heHE.OrthrizeiToPnevmaMou.incipit	My spirit seeks Thee early…
ltx/en_uk_ware/he.h.m8:heHE.OrthrizeiToPnevmaMou.melody	@ltx/en_uk_ware/miscellanea:misc.HeirmosNotMetered
ltx/en_uk_ware/he.h.m8:heHE.OrthrizeiToPnevmaMou.mode	@ltx/en_uk_ware/miscellanea:misc.Mode8
ltx/en_uk_ware/he.h.m8:heHE.OrthrizeiToPnevmaMou.name	(NM) My spirit seeks Thee early
ltx/en_uk_ware/he.h.m8:heHE.OrthrizeiToPnevmaMou.ode	@ltx/en_uk_ware/miscellanea:misc.Ode5
ltx/en_uk_ware/he.h.m8:heHE.OrthrizeiToPnevmaMou.text	My spirit seeks Thee early in the morning, O God, for Thy commandments bring us light before Thy coming: shine with them upon our minds, O Master, and guide us in the path of life.
ltx/en_uk_ware/he.h.m8:heHE.OrthrizontesVoomenSoi.greekname	
ltx/en_uk_ware/he.h.m8:heHE.OrthrizontesVoomenSoi.incipit	…
ltx/en_uk_ware/he.h.m8:heHE.OrthrizontesVoomenSoi.melody	@ltx/en_uk_ware/miscellanea:misc.HeirmosNotMetered
ltx/en_uk_ware/he.h.m8:heHE.OrthrizontesVoomenSoi.mode	@ltx/en_uk_ware/miscellanea:misc.Mode8
ltx/en_uk_ware/he.h.m8:heHE.OrthrizontesVoomenSoi.name	(NM)
ltx/en_uk_ware/he.h.m8:heHE.OrthrizontesVoomenSoi.ode	@ltx/en_uk_ware/miscellanea:misc.Ode5
ltx/en_uk_ware/he.h.m8:heHE.OrthrizontesVoomenSoi.text	
ltx/en_uk_ware/he.h.m8:heHE.OsTonProfitinErryso.greekname	
ltx/en_uk_ware/he.h.m8:heHE.OsTonProfitinErryso.incipit	…
ltx/en_uk_ware/he.h.m8:heHE.OsTonProfitinErryso.melody	@ltx/en_uk_ware/miscellanea:misc.HeirmosNotMetered
ltx/en_uk_ware/he.h.m8:heHE.OsTonProfitinErryso.mode	@ltx/en_uk_ware/miscellanea:misc.Mode8
ltx/en_uk_ware/he.h.m8:heHE.OsTonProfitinErryso.name	(NM)
ltx/en_uk_ware/he.h.m8:heHE.OsTonProfitinErryso.ode	@ltx/en_uk_ware/miscellanea:misc.Ode6
ltx/en_uk_ware/he.h.m8:heHE.OsTonProfitinErryso.text	
ltx/en_uk_ware/he.h.m8:heHE.OsYdataThalassis.greekname	
ltx/en_uk_ware/he.h.m8:heHE.OsYdataThalassis.incipit	…
ltx/en_uk_ware/he.h.m8:heHE.OsYdataThalassis.melody	@ltx/en_uk_ware/miscellanea:misc.HeirmosNotMetered
ltx/en_uk_ware/he.h.m8:heHE.OsYdataThalassis.mode	@ltx/en_uk_ware/miscellanea:misc.Mode8
ltx/en_uk_ware/he.h.m8:heHE.OsYdataThalassis.name	(NM)
ltx/en_uk_ware/he.h.m8:heHE.OsYdataThalassis.ode	@ltx/en_uk_ware/miscellanea:misc.Ode6
ltx/en_uk_ware/he.h.m8:heHE.OsYdataThalassis.text	
ltx/en_uk_ware/he.h.m8:heHE.OukEstinAgios.greekname	
ltx/en_uk_ware/he.h.m8:heHE.OukEstinAgios.incipit	None is holy as the Lord…
ltx/en_uk_ware/he.h.m8:heHE.OukEstinAgios.melody	@ltx/en_uk_ware/miscellanea:misc.HeirmosNotMetered
ltx/en_uk_ware/he.h.m8:heHE.OukEstinAgios.mode	@ltx/en_uk_ware/miscellanea:misc.Mode8
ltx/en_uk_ware/he.h.m8:heHE.OukEstinAgios.name	(NM) None is holy as the Lord
ltx/en_uk_ware/he.h.m8:heHE.OukEstinAgios.ode	@ltx/en_uk_ware/miscellanea:misc.Ode3
ltx/en_uk_ware/he.h.m8:heHE.OukEstinAgios.text	None is holy as the Lord, and none is righteous as our God, whom all creation praises: none is holy save Thee, O Lord who lovest mankind.
ltx/en_uk_ware/he.h.m8:heHE.OukEstinAgiosOsOTheos.greekname	
ltx/en_uk_ware/he.h.m8:heHE.OukEstinAgiosOsOTheos.name	
ltx/en_uk_ware/he.h.m8:heHE.OuraniasApsidos.greekname	
ltx/en_uk_ware/he.h.m8:heHE.OuraniasApsidos.incipit	O Lord, Thou Builder…
ltx/en_uk_ware/he.h.m8:heHE.OuraniasApsidos.melody	@ltx/en_uk_ware/miscellanea:misc.HeirmosNotMetered
ltx/en_uk_ware/he.h.m8:heHE.OuraniasApsidos.mode	@ltx/en_uk_ware/miscellanea:misc.Mode8
ltx/en_uk_ware/he.h.m8:heHE.OuraniasApsidos.name	(NM) O Lord, Thou Builder
ltx/en_uk_ware/he.h.m8:heHE.OuraniasApsidos.ode	@ltx/en_uk_ware/miscellanea:misc.Ode3
ltx/en_uk_ware/he.h.m8:heHE.OuraniasApsidos.text	O Lord, Thou Builder of the vault of heaven and Founder of the Church, do Thou confirm me in Thy love: for Thou art our supreme desire and the support of the faithful, O Thou who alone lovest mankind.
ltx/en_uk_ware/he.h.m8:heHE.PaidesEvraion.greekname	
ltx/en_uk_ware/he.h.m8:heHE.PaidesEvraion.incipit	The Hebrew Children in the furnace…
ltx/en_uk_ware/he.h.m8:heHE.PaidesEvraion.melody	@ltx/en_uk_ware/miscellanea:misc.HeirmosNotMetered
ltx/en_uk_ware/he.h.m8:heHE.PaidesEvraion.mode	@ltx/en_uk_ware/miscellanea:misc.Mode8
ltx/en_uk_ware/he.h.m8:heHE.PaidesEvraion.name	(NM) The Hebrew Children in the furnace
ltx/en_uk_ware/he.h.m8:heHE.PaidesEvraion.ode	@ltx/en_uk_ware/miscellanea:misc.Ode7
ltx/en_uk_ware/he.h.m8:heHE.PaidesEvraion.text	
ltx/en_uk_ware/he.h.m8:heHE.PaidesTheoseveis.greekname	
ltx/en_uk_ware/he.h.m8:heHE.PaidesTheoseveis.incipit	…
ltx/en_uk_ware/he.h.m8:heHE.PaidesTheoseveis.melody	@ltx/en_uk_ware/miscellanea:misc.HeirmosNotMetered
ltx/en_uk_ware/he.h.m8:heHE.PaidesTheoseveis.mode	@ltx/en_uk_ware/miscellanea:misc.Mode8
ltx/en_uk_ware/he.h.m8:heHE.PaidesTheoseveis.name	(NM)
ltx/en_uk_ware/he.h.m8:heHE.PaidesTheoseveis.ode	@ltx/en_uk_ware/miscellanea:misc.Ode7
ltx/en_uk_ware/he.h.m8:heHE.PaidesTheoseveis.text	
ltx/en_uk_ware/he.h.m8:heHE.ProsTonDynamenonSozein.greekname	
ltx/en_uk_ware/he.h.m8:heHE.ProsTonDynamenonSozein.incipit	…
ltx/en_uk_ware/he.h.m8:heHE.ProsTonDynamenonSozein.melody	@ltx/en_uk_ware/miscellanea:misc.HeirmosNotMetered
ltx/en_uk_ware/he.h.m8:heHE.ProsTonDynamenonSozein.mode	@ltx/en_uk_ware/miscellanea:misc.Mode8
ltx/en_uk_ware/he.h.m8:heHE.ProsTonDynamenonSozein.name	(NM)
ltx/en_uk_ware/he.h.m8:heHE.ProsTonDynamenonSozein.ode	@ltx/en_uk_ware/miscellanea:misc.Ode6
ltx/en_uk_ware/he.h.m8:heHE.ProsTonDynamenonSozein.text	
ltx/en_uk_ware/he.h.m8:heHE.ProsecheOurane.greekname	
ltx/en_uk_ware/he.h.m8:heHE.ProsecheOurane.incipit	Attend, O heaven…
ltx/en_uk_ware/he.h.m8:heHE.ProsecheOurane.melody	@ltx/en_uk_ware/miscellanea:misc.HeirmosNotMetered
ltx/en_uk_ware/he.h.m8:heHE.ProsecheOurane.mode	@ltx/en_uk_ware/miscellanea:misc.Mode8
ltx/en_uk_ware/he.h.m8:heHE.ProsecheOurane.name	(NM) Attend, O heaven
ltx/en_uk_ware/he.h.m8:heHE.ProsecheOurane.ode	@ltx/en_uk_ware/miscellanea:misc.Ode2
ltx/en_uk_ware/he.h.m8:heHE.ProsecheOurane.text	Attend, O heaven, and I shall speak, and sing in praise of Christ, who took flesh from a Virgin and came to dwell among us.
ltx/en_uk_ware/he.h.m8:heHE.RavdosEisTypon.greekname	
ltx/en_uk_ware/he.h.m8:heHE.RavdosEisTypon.incipit	…
ltx/en_uk_ware/he.h.m8:heHE.RavdosEisTypon.melody	@ltx/en_uk_ware/miscellanea:misc.HeirmosNotMetered
ltx/en_uk_ware/he.h.m8:heHE.RavdosEisTypon.mode	@ltx/en_uk_ware/miscellanea:misc.Mode8
ltx/en_uk_ware/he.h.m8:heHE.RavdosEisTypon.name	(NM)
ltx/en_uk_ware/he.h.m8:heHE.RavdosEisTypon.ode	@ltx/en_uk_ware/miscellanea:misc.Ode3
ltx/en_uk_ware/he.h.m8:heHE.RavdosEisTypon.text	
ltx/en_uk_ware/he.h.m8:heHE.SeTinApeirogamon.greekname	
ltx/en_uk_ware/he.h.m8:heHE.SeTinApeirogamon.incipit	…
ltx/en_uk_ware/he.h.m8:heHE.SeTinApeirogamon.melody	@ltx/en_uk_ware/miscellanea:misc.HeirmosNotMetered
ltx/en_uk_ware/he.h.m8:heHE.SeTinApeirogamon.mode	@ltx/en_uk_ware/miscellanea:misc.Mode8
ltx/en_uk_ware/he.h.m8:heHE.SeTinApeirogamon.name	(NM)
ltx/en_uk_ware/he.h.m8:heHE.SeTinApeirogamon.ode	@ltx/en_uk_ware/miscellanea:misc.Ode9
ltx/en_uk_ware/he.h.m8:heHE.SeTinApeirogamon.text	
ltx/en_uk_ware/he.h.m8:heHE.SeTinOuranou.greekname	
ltx/en_uk_ware/he.h.m8:heHE.SeTinOuranou.incipit	With all generations we magnify thee…
ltx/en_uk_ware/he.h.m8:heHE.SeTinOuranou.melody	@ltx/en_uk_ware/miscellanea:misc.HeirmosNotMetered
ltx/en_uk_ware/he.h.m8:heHE.SeTinOuranou.mode	@ltx/en_uk_ware/miscellanea:misc.Mode8
ltx/en_uk_ware/he.h.m8:heHE.SeTinOuranou.name	(NM) With all generations we magnify thee
ltx/en_uk_ware/he.h.m8:heHE.SeTinOuranou.ode	@ltx/en_uk_ware/miscellanea:misc.Ode9
ltx/en_uk_ware/he.h.m8:heHE.SeTinOuranou.text	
ltx/en_uk_ware/he.h.m8:heHE.StavronCharaxasMosis.greekname	
ltx/en_uk_ware/he.h.m8:heHE.StavronCharaxasMosis.incipit	…
ltx/en_uk_ware/he.h.m8:heHE.StavronCharaxasMosis.melody	@ltx/en_uk_ware/miscellanea:misc.HeirmosNotMetered
ltx/en_uk_ware/he.h.m8:heHE.StavronCharaxasMosis.mode	@ltx/en_uk_ware/miscellanea:misc.Mode8
ltx/en_uk_ware/he.h.m8:heHE.StavronCharaxasMosis.name	(NM)
ltx/en_uk_ware/he.h.m8:heHE.StavronCharaxasMosis.ode	@ltx/en_uk_ware/miscellanea:misc.Ode1
ltx/en_uk_ware/he.h.m8:heHE.StavronCharaxasMosis.text	
ltx/en_uk_ware/he.h.m8:heHE.StereomaMouSotir.greekname	
ltx/en_uk_ware/he.h.m8:heHE.StereomaMouSotir.incipit	…
ltx/en_uk_ware/he.h.m8:heHE.StereomaMouSotir.melody	@ltx/en_uk_ware/miscellanea:misc.HeirmosNotMetered
ltx/en_uk_ware/he.h.m8:heHE.StereomaMouSotir.mode	@ltx/en_uk_ware/miscellanea:misc.Mode8
ltx/en_uk_ware/he.h.m8:heHE.StereomaMouSotir.name	(NM)
ltx/en_uk_ware/he.h.m8:heHE.StereomaMouSotir.ode	@ltx/en_uk_ware/miscellanea:misc.Ode3
ltx/en_uk_ware/he.h.m8:heHE.StereomaMouSotir.text	
ltx/en_uk_ware/he.h.m8:heHE.StereosonImonTonNoun.greekname	
ltx/en_uk_ware/he.h.m8:heHE.StereosonImonTonNoun.incipit	…
ltx/en_uk_ware/he.h.m8:heHE.StereosonImonTonNoun.melody	@ltx/en_uk_ware/miscellanea:misc.HeirmosNotMetered
ltx/en_uk_ware/he.h.m8:heHE.StereosonImonTonNoun.mode	@ltx/en_uk_ware/miscellanea:misc.Mode8
ltx/en_uk_ware/he.h.m8:heHE.StereosonImonTonNoun.name	(NM)
ltx/en_uk_ware/he.h.m8:heHE.StereosonImonTonNoun.ode	@ltx/en_uk_ware/miscellanea:misc.Ode3
ltx/en_uk_ware/he.h.m8:heHE.StereosonImonTonNoun.text	
ltx/en_uk_ware/he.h.m8:heHE.SyEiToStereoma.greekname	
ltx/en_uk_ware/he.h.m8:heHE.SyEiToStereoma.incipit	…
ltx/en_uk_ware/he.h.m8:heHE.SyEiToStereoma.melody	@ltx/en_uk_ware/miscellanea:misc.HeirmosNotMetered
ltx/en_uk_ware/he.h.m8:heHE.SyEiToStereoma.mode	@ltx/en_uk_ware/miscellanea:misc.Mode8
ltx/en_uk_ware/he.h.m8:heHE.SyEiToStereoma.name	(NM)
ltx/en_uk_ware/he.h.m8:heHE.SyEiToStereoma.ode	@ltx/en_uk_ware/miscellanea:misc.Ode3
ltx/en_uk_ware/he.h.m8:heHE.SyEiToStereoma.text	
ltx/en_uk_ware/he.h.m8:heHE.SyMouIschys.greekname	
ltx/en_uk_ware/he.h.m8:heHE.SyMouIschys.incipit	…
ltx/en_uk_ware/he.h.m8:heHE.SyMouIschys.melody	@ltx/en_uk_ware/miscellanea:misc.HeirmosNotMetered
ltx/en_uk_ware/he.h.m8:heHE.SyMouIschys.mode	@ltx/en_uk_ware/miscellanea:misc.Mode8
ltx/en_uk_ware/he.h.m8:heHE.SyMouIschys.name	(NM)
ltx/en_uk_ware/he.h.m8:heHE.SyMouIschys.ode	@ltx/en_uk_ware/miscellanea:misc.Ode4
ltx/en_uk_ware/he.h.m8:heHE.SyMouIschys.text	
ltx/en_uk_ware/he.h.m8:heHE.SynechomenonDexaiMe.greekname	
ltx/en_uk_ware/he.h.m8:heHE.SynechomenonDexaiMe.incipit	Held fast by many sins…
ltx/en_uk_ware/he.h.m8:heHE.SynechomenonDexaiMe.melody	@ltx/en_uk_ware/miscellanea:misc.HeirmosNotMetered
ltx/en_uk_ware/he.h.m8:heHE.SynechomenonDexaiMe.mode	@ltx/en_uk_ware/miscellanea:misc.Mode8
ltx/en_uk_ware/he.h.m8:heHE.SynechomenonDexaiMe.name	(NM) Held fast by many sins
ltx/en_uk_ware/he.h.m8:heHE.SynechomenonDexaiMe.ode	@ltx/en_uk_ware/miscellanea:misc.Ode6
ltx/en_uk_ware/he.h.m8:heHE.SynechomenonDexaiMe.text	Held fast by many sins, I fall down like the Prophet before Thy tender mercies. Accept me also in Thy love for mankind, O Lord, and save me.
ltx/en_uk_ware/he.h.m8:heHE.ThalassanEpixas.greekname	
ltx/en_uk_ware/he.h.m8:heHE.ThalassanEpixas.incipit	…
ltx/en_uk_ware/he.h.m8:heHE.ThalassanEpixas.melody	@ltx/en_uk_ware/miscellanea:misc.HeirmosNotMetered
ltx/en_uk_ware/he.h.m8:heHE.ThalassanEpixas.mode	@ltx/en_uk_ware/miscellanea:misc.Mode8
ltx/en_uk_ware/he.h.m8:heHE.ThalassanEpixas.name	(NM)
ltx/en_uk_ware/he.h.m8:heHE.ThalassanEpixas.ode	@ltx/en_uk_ware/miscellanea:misc.Ode1
ltx/en_uk_ware/he.h.m8:heHE.ThalassanEpixas.text	
ltx/en_uk_ware/he.h.m8:heHE.TheouSynkatavasin.greekname	
ltx/en_uk_ware/he.h.m8:heHE.TheouSynkatavasin.incipit	…
ltx/en_uk_ware/he.h.m8:heHE.TheouSynkatavasin.melody	@ltx/en_uk_ware/miscellanea:misc.HeirmosNotMetered
ltx/en_uk_ware/he.h.m8:heHE.TheouSynkatavasin.mode	@ltx/en_uk_ware/miscellanea:misc.Mode8
ltx/en_uk_ware/he.h.m8:heHE.TheouSynkatavasin.name	(NM)
ltx/en_uk_ware/he.h.m8:heHE.TheouSynkatavasin.ode	@ltx/en_uk_ware/miscellanea:misc.Ode7
ltx/en_uk_ware/he.h.m8:heHE.TheouSynkatavasin.text	
ltx/en_uk_ware/he.h.m8:heHE.TinAgninEndoxos.greekname	
ltx/en_uk_ware/he.h.m8:heHE.TinAgninEndoxos.incipit	…
ltx/en_uk_ware/he.h.m8:heHE.TinAgninEndoxos.melody	@ltx/en_uk_ware/miscellanea:misc.HeirmosNotMetered
ltx/en_uk_ware/he.h.m8:heHE.TinAgninEndoxos.mode	@ltx/en_uk_ware/miscellanea:misc.Mode8
ltx/en_uk_ware/he.h.m8:heHE.TinAgninEndoxos.name	(NM)
ltx/en_uk_ware/he.h.m8:heHE.TinAgninEndoxos.ode	@ltx/en_uk_ware/miscellanea:misc.Ode9
ltx/en_uk_ware/he.h.m8:heHE.TinAgninEndoxos.text	
ltx/en_uk_ware/he.h.m8:heHE.TinDeisinEkcheo.greekname	
ltx/en_uk_ware/he.h.m8:heHE.TinDeisinEkcheo.incipit	I pour out my prayer…
ltx/en_uk_ware/he.h.m8:heHE.TinDeisinEkcheo.melody	@ltx/en_uk_ware/miscellanea:misc.HeirmosNotMetered
ltx/en_uk_ware/he.h.m8:heHE.TinDeisinEkcheo.mode	@ltx/en_uk_ware/miscellanea:misc.Mode8
ltx/en_uk_ware/he.h.m8:heHE.TinDeisinEkcheo.name	(NM) I pour out my prayer
ltx/en_uk_ware/he.h.m8:heHE.TinDeisinEkcheo.ode	@ltx/en_uk_ware/miscellanea:misc.Ode6
ltx/en_uk_ware/he.h.m8:heHE.TinDeisinEkcheo.text	
ltx/en_uk_ware/he.h.m8:heHE.TisTonPathonMeAchlyos.greekname	
ltx/en_uk_ware/he.h.m8:heHE.TisTonPathonMeAchlyos.incipit	Deliver me, I pray…
ltx/en_uk_ware/he.h.m8:heHE.TisTonPathonMeAchlyos.melody	@ltx/en_uk_ware/miscellanea:misc.HeirmosNotMetered
ltx/en_uk_ware/he.h.m8:heHE.TisTonPathonMeAchlyos.mode	@ltx/en_uk_ware/miscellanea:misc.Mode8
ltx/en_uk_ware/he.h.m8:heHE.TisTonPathonMeAchlyos.name	(NM) Deliver me, I pray
ltx/en_uk_ware/he.h.m8:heHE.TisTonPathonMeAchlyos.ode	@ltx/en_uk_ware/miscellanea:misc.Ode5
ltx/en_uk_ware/he.h.m8:heHE.TisTonPathonMeAchlyos.text	Deliver me, I pray, from the dark night of the passions, and enable my spirit, O Christ, to seek Thee early in the morning, guided by the light of Thy commandments.
ltx/en_uk_ware/he.h.m8:heHE.ToEktinaxanti.greekname	
ltx/en_uk_ware/he.h.m8:heHE.ToEktinaxanti.incipit	…
ltx/en_uk_ware/he.h.m8:heHE.ToEktinaxanti.melody	@ltx/en_uk_ware/miscellanea:misc.HeirmosNotMetered
ltx/en_uk_ware/he.h.m8:heHE.ToEktinaxanti.mode	@ltx/en_uk_ware/miscellanea:misc.Mode8
ltx/en_uk_ware/he.h.m8:heHE.ToEktinaxanti.name	(NM)
ltx/en_uk_ware/he.h.m8:heHE.ToEktinaxanti.ode	@ltx/en_uk_ware/miscellanea:misc.Ode1
ltx/en_uk_ware/he.h.m8:heHE.ToEktinaxanti.text	
ltx/en_uk_ware/he.h.m8:heHE.ToSyntripsantiPolemous.greekname	
ltx/en_uk_ware/he.h.m8:heHE.ToSyntripsantiPolemous.incipit	To Him who crushed…
ltx/en_uk_ware/he.h.m8:heHE.ToSyntripsantiPolemous.melody	@ltx/en_uk_ware/miscellanea:misc.HeirmosNotMetered
ltx/en_uk_ware/he.h.m8:heHE.ToSyntripsantiPolemous.mode	@ltx/en_uk_ware/miscellanea:misc.Mode8
ltx/en_uk_ware/he.h.m8:heHE.ToSyntripsantiPolemous.name	(NM) To Him who crushed
ltx/en_uk_ware/he.h.m8:heHE.ToSyntripsantiPolemous.ode	@ltx/en_uk_ware/miscellanea:misc.Ode1
ltx/en_uk_ware/he.h.m8:heHE.ToSyntripsantiPolemous.text	To Him who crushed the enemy with His arm and led Israel through the Red Sea, to our Deliverer and our God let us sing, for He has been glorified.
ltx/en_uk_ware/he.h.m8:heHE.TonAnarchonVasilea.greekname	
ltx/en_uk_ware/he.h.m8:heHE.TonAnarchonVasilea.incipit	The eternal King of glory…
ltx/en_uk_ware/he.h.m8:heHE.TonAnarchonVasilea.melody	@ltx/en_uk_ware/miscellanea:misc.HeirmosNotMetered
ltx/en_uk_ware/he.h.m8:heHE.TonAnarchonVasilea.mode	@ltx/en_uk_ware/miscellanea:misc.Mode8
ltx/en_uk_ware/he.h.m8:heHE.TonAnarchonVasilea.name	(NM) The eternal King of glory
ltx/en_uk_ware/he.h.m8:heHE.TonAnarchonVasilea.ode	@ltx/en_uk_ware/miscellanea:misc.Ode8
ltx/en_uk_ware/he.h.m8:heHE.TonAnarchonVasilea.text	The eternal King of glory, before whom the powers of heaven tremble and the ranks of angels stand in fear, O ye priests praise and ye people exalt above all for ever.
ltx/en_uk_ware/he.h.m8:heHE.TonAoratonMorfi.greekname	
ltx/en_uk_ware/he.h.m8:heHE.TonAoratonMorfi.incipit	…
ltx/en_uk_ware/he.h.m8:heHE.TonAoratonMorfi.melody	@ltx/en_uk_ware/miscellanea:misc.HeirmosNotMetered
ltx/en_uk_ware/he.h.m8:heHE.TonAoratonMorfi.mode	@ltx/en_uk_ware/miscellanea:misc.Mode8
ltx/en_uk_ware/he.h.m8:heHE.TonAoratonMorfi.name	(NM)
ltx/en_uk_ware/he.h.m8:heHE.TonAoratonMorfi.ode	@ltx/en_uk_ware/miscellanea:misc.Ode9
ltx/en_uk_ware/he.h.m8:heHE.TonAoratonMorfi.text	
ltx/en_uk_ware/he.h.m8:heHE.TonChaldaionIKaminos.greekname	
ltx/en_uk_ware/he.h.m8:heHE.TonChaldaionIKaminos.incipit	…
ltx/en_uk_ware/he.h.m8:heHE.TonChaldaionIKaminos.melody	@ltx/en_uk_ware/miscellanea:misc.HeirmosNotMetered
ltx/en_uk_ware/he.h.m8:heHE.TonChaldaionIKaminos.mode	@ltx/en_uk_ware/miscellanea:misc.Mode8
ltx/en_uk_ware/he.h.m8:heHE.TonChaldaionIKaminos.name	(NM)
ltx/en_uk_ware/he.h.m8:heHE.TonChaldaionIKaminos.ode	@ltx/en_uk_ware/miscellanea:misc.Ode7
ltx/en_uk_ware/he.h.m8:heHE.TonChaldaionIKaminos.text	
ltx/en_uk_ware/he.h.m8:heHE.TonEkNyktosAgnosias.greekname	
ltx/en_uk_ware/he.h.m8:heHE.TonEkNyktosAgnosias.incipit	…
ltx/en_uk_ware/he.h.m8:heHE.TonEkNyktosAgnosias.melody	@ltx/en_uk_ware/miscellanea:misc.HeirmosNotMetered
ltx/en_uk_ware/he.h.m8:heHE.TonEkNyktosAgnosias.mode	@ltx/en_uk_ware/miscellanea:misc.Mode8
ltx/en_uk_ware/he.h.m8:heHE.TonEkNyktosAgnosias.name	(NM)
ltx/en_uk_ware/he.h.m8:heHE.TonEkNyktosAgnosias.ode	@ltx/en_uk_ware/miscellanea:misc.Ode5
ltx/en_uk_ware/he.h.m8:heHE.TonEkNyktosAgnosias.text	
ltx/en_uk_ware/he.h.m8:heHE.TonEkPatrosProAionon.greekname	
ltx/en_uk_ware/he.h.m8:heHE.TonEkPatrosProAionon.incipit	…
ltx/en_uk_ware/he.h.m8:heHE.TonEkPatrosProAionon.melody	@ltx/en_uk_ware/miscellanea:misc.HeirmosNotMetered
ltx/en_uk_ware/he.h.m8:heHE.TonEkPatrosProAionon.mode	@ltx/en_uk_ware/miscellanea:misc.Mode8
ltx/en_uk_ware/he.h.m8:heHE.TonEkPatrosProAionon.name	(NM)
ltx/en_uk_ware/he.h.m8:heHE.TonEkPatrosProAionon.ode	@ltx/en_uk_ware/miscellanea:misc.Ode8
ltx/en_uk_ware/he.h.m8:heHE.TonEkPatrosProAionon.text	
ltx/en_uk_ware/he.h.m8:heHE.TonEnOreiAgio.greekname	
ltx/en_uk_ware/he.h.m8:heHE.TonEnOreiAgio.incipit	Glorified in the holy mountain…
ltx/en_uk_ware/he.h.m8:heHE.TonEnOreiAgio.melody	@ltx/en_uk_ware/miscellanea:misc.HeirmosNotMetered
ltx/en_uk_ware/he.h.m8:heHE.TonEnOreiAgio.mode	@ltx/en_uk_ware/miscellanea:misc.Mode8
ltx/en_uk_ware/he.h.m8:heHE.TonEnOreiAgio.name	(NM) Glorified in the holy mountain
ltx/en_uk_ware/he.h.m8:heHE.TonEnOreiAgio.ode	@ltx/en_uk_ware/miscellanea:misc.Ode8
ltx/en_uk_ware/he.h.m8:heHE.TonEnOreiAgio.text	Glorified in the holy mountain, the Lord revealed the mystery of the Ever-Virgin to Moses in the burning bush: praise and exalt Him above all for ever.
ltx/en_uk_ware/he.h.m8:heHE.TonFovonSouKyrie.greekname	
ltx/en_uk_ware/he.h.m8:heHE.TonFovonSouKyrie.incipit	…
ltx/en_uk_ware/he.h.m8:heHE.TonFovonSouKyrie.melody	@ltx/en_uk_ware/miscellanea:misc.HeirmosNotMetered
ltx/en_uk_ware/he.h.m8:heHE.TonFovonSouKyrie.mode	@ltx/en_uk_ware/miscellanea:misc.Mode8
ltx/en_uk_ware/he.h.m8:heHE.TonFovonSouKyrie.name	(NM)
ltx/en_uk_ware/he.h.m8:heHE.TonFovonSouKyrie.ode	@ltx/en_uk_ware/miscellanea:misc.Ode3
ltx/en_uk_ware/he.h.m8:heHE.TonFovonSouKyrie.text	
ltx/en_uk_ware/he.h.m8:heHE.TonIonanEnToKitei.greekname	
ltx/en_uk_ware/he.h.m8:heHE.TonIonanEnToKitei.incipit	…
ltx/en_uk_ware/he.h.m8:heHE.TonIonanEnToKitei.melody	@ltx/en_uk_ware/miscellanea:misc.HeirmosNotMetered
ltx/en_uk_ware/he.h.m8:heHE.TonIonanEnToKitei.mode	@ltx/en_uk_ware/miscellanea:misc.Mode8
ltx/en_uk_ware/he.h.m8:heHE.TonIonanEnToKitei.name	(NM)
ltx/en_uk_ware/he.h.m8:heHE.TonIonanEnToKitei.ode	@ltx/en_uk_ware/miscellanea:misc.Ode6
ltx/en_uk_ware/he.h.m8:heHE.TonIonanEnToKitei.text	
ltx/en_uk_ware/he.h.m8:heHE.TonIsrailEkDouleias.greekname	
ltx/en_uk_ware/he.h.m8:heHE.TonIsrailEkDouleias.incipit	…
ltx/en_uk_ware/he.h.m8:heHE.TonIsrailEkDouleias.melody	@ltx/en_uk_ware/miscellanea:misc.HeirmosNotMetered
ltx/en_uk_ware/he.h.m8:heHE.TonIsrailEkDouleias.mode	@ltx/en_uk_ware/miscellanea:misc.Mode8
ltx/en_uk_ware/he.h.m8:heHE.TonIsrailEkDouleias.name	(NM)
ltx/en_uk_ware/he.h.m8:heHE.TonIsrailEkDouleias.ode	@ltx/en_uk_ware/miscellanea:misc.Ode1
ltx/en_uk_ware/he.h.m8:heHE.TonIsrailEkDouleias.text	
ltx/en_uk_ware/he.h.m8:heHE.TonProdilothenta.greekname	
ltx/en_uk_ware/he.h.m8:heHE.TonProdilothenta.incipit	The burning bush…
ltx/en_uk_ware/he.h.m8:heHE.TonProdilothenta.melody	@ltx/en_uk_ware/miscellanea:misc.HeirmosNotMetered
ltx/en_uk_ware/he.h.m8:heHE.TonProdilothenta.mode	@ltx/en_uk_ware/miscellanea:misc.Mode8
ltx/en_uk_ware/he.h.m8:heHE.TonProdilothenta.name	(NM) The burning bush
ltx/en_uk_ware/he.h.m8:heHE.TonProdilothenta.ode	@ltx/en_uk_ware/miscellanea:misc.Ode9
ltx/en_uk_ware/he.h.m8:heHE.TonProdilothenta.text	The burning bush upon the mountain revealed in prophecy to the Giver of the Law Christ’s birth from the Ever-Virgin for our salvation: and with never-silent songs of praise we magnify Him.
ltx/en_uk_ware/he.h.m8:heHE.TonVasileaTonOuranon.greekname	
ltx/en_uk_ware/he.h.m8:heHE.TonVasileaTonOuranon.incipit	…
ltx/en_uk_ware/he.h.m8:heHE.TonVasileaTonOuranon.melody	@ltx/en_uk_ware/miscellanea:misc.HeirmosNotMetered
ltx/en_uk_ware/he.h.m8:heHE.TonVasileaTonOuranon.mode	@ltx/en_uk_ware/miscellanea:misc.Mode8
ltx/en_uk_ware/he.h.m8:heHE.TonVasileaTonOuranon.name	(NM)
ltx/en_uk_ware/he.h.m8:heHE.TonVasileaTonOuranon.ode	@ltx/en_uk_ware/miscellanea:misc.Ode8
ltx/en_uk_ware/he.h.m8:heHE.TonVasileaTonOuranon.text	
ltx/en_uk_ware/he.h.m8:heHE.TonZofonTisPsychisMou.greekname	
ltx/en_uk_ware/he.h.m8:heHE.TonZofonTisPsychisMou.incipit	O Christ my God…
ltx/en_uk_ware/he.h.m8:heHE.TonZofonTisPsychisMou.melody	@ltx/en_uk_ware/miscellanea:misc.HeirmosNotMetered
ltx/en_uk_ware/he.h.m8:heHE.TonZofonTisPsychisMou.mode	@ltx/en_uk_ware/miscellanea:misc.Mode8
ltx/en_uk_ware/he.h.m8:heHE.TonZofonTisPsychisMou.name	(NM) O Christ my God
ltx/en_uk_ware/he.h.m8:heHE.TonZofonTisPsychisMou.ode	@ltx/en_uk_ware/miscellanea:misc.Ode5
ltx/en_uk_ware/he.h.m8:heHE.TonZofonTisPsychisMou.text	O Christ my God, Giver of Light, who hast driven out the primeval darkness of the abyss, disperse, O Word, the darkness from my soul, and give me the light of Thy commandments, that early in the morning I may glorify-Thee.
ltx/en_uk_ware/he.h.m8:heHE.YgranDiodefsas.greekname	
ltx/en_uk_ware/he.h.m8:heHE.YgranDiodefsas.incipit	Having crossed the water…
ltx/en_uk_ware/he.h.m8:heHE.YgranDiodefsas.melody	@ltx/en_uk_ware/miscellanea:misc.HeirmosNotMetered
ltx/en_uk_ware/he.h.m8:heHE.YgranDiodefsas.mode	@ltx/en_uk_ware/miscellanea:misc.Mode8
ltx/en_uk_ware/he.h.m8:heHE.YgranDiodefsas.name	(NM) Having crossed the water
ltx/en_uk_ware/he.h.m8:heHE.YgranDiodefsas.ode	@ltx/en_uk_ware/miscellanea:misc.Ode1
ltx/en_uk_ware/he.h.m8:heHE.YgranDiodefsas.text	Having crossed the water as though it were dry land, and escaped from the wickedness of Egypt, the children of Israel shouted aloud: ‘Let us sing to our Deliverer and our God.’
