ltx/en_uk_ware/he.a.m5:heAU.ChairoisAskitikon.greekname	Χαίροις ἀσκητικῶν.
ltx/en_uk_ware/he.a.m5:heAU.ChairoisAskitikon.incipit	…
ltx/en_uk_ware/he.a.m5:heAU.ChairoisAskitikon.melody	@ltx/en_uk_ware/miscellanea:misc.Automelon
ltx/en_uk_ware/he.a.m5:heAU.ChairoisAskitikon.mode	@ltx/en_uk_ware/miscellanea:misc.Mode5
ltx/en_uk_ware/he.a.m5:heAU.ChairoisAskitikon.name	(NM)
ltx/en_uk_ware/he.a.m5:heAU.ChairoisAskitikon.text	
ltx/en_uk_ware/he.a.m5:heAU.LampeiSimeron.greekname	Λάμπει σήμερον.
ltx/en_uk_ware/he.a.m5:heAU.LampeiSimeron.incipit	…
ltx/en_uk_ware/he.a.m5:heAU.LampeiSimeron.melody	@ltx/en_uk_ware/miscellanea:misc.Automelon
ltx/en_uk_ware/he.a.m5:heAU.LampeiSimeron.mode	@ltx/en_uk_ware/miscellanea:misc.Mode5
ltx/en_uk_ware/he.a.m5:heAU.LampeiSimeron.name	(NM).
ltx/en_uk_ware/he.a.m5:heAU.LampeiSimeron.text	
ltx/en_uk_ware/he.a.m5:heAU.OsiePater.greekname	Ὅσιε Πάτερ.
ltx/en_uk_ware/he.a.m5:heAU.OsiePater.incipit	…
ltx/en_uk_ware/he.a.m5:heAU.OsiePater.melody	@ltx/en_uk_ware/miscellanea:misc.Automelon
ltx/en_uk_ware/he.a.m5:heAU.OsiePater.mode	@ltx/en_uk_ware/miscellanea:misc.Mode5
ltx/en_uk_ware/he.a.m5:heAU.OsiePater.name	(NM)
ltx/en_uk_ware/he.a.m5:heAU.OsiePater.text	
ltx/en_uk_ware/he.a.m5:heAU.TonSynanarchonLogon.greekname	Τὸν συνάναρχον Λόγον.
ltx/en_uk_ware/he.a.m5:heAU.TonSynanarchonLogon.incipit	…
ltx/en_uk_ware/he.a.m5:heAU.TonSynanarchonLogon.melody	@ltx/en_uk_ware/miscellanea:misc.Automelon
ltx/en_uk_ware/he.a.m5:heAU.TonSynanarchonLogon.mode	@ltx/en_uk_ware/miscellanea:misc.Mode5
ltx/en_uk_ware/he.a.m5:heAU.TonSynanarchonLogon.name	(NM)
ltx/en_uk_ware/he.a.m5:heAU.TonSynanarchonLogon.text	
ltx/en_uk_ware/he.a.m5:heAU.title	
