ltx/en_uk_ware/tr.d036:trCO.header	
ltx/en_uk_ware/tr.d036:trDA.commemoration.full	
ltx/en_uk_ware/tr.d036:trDA.commemoration.short	
ltx/en_uk_ware/tr.d036:trDA.dismissal	@ltx/en_uk_ware/dismissals:dis00.resurrection
ltx/en_uk_ware/tr.d036:trDA.insert1	
ltx/en_uk_ware/tr.d036:trDA.insert2	
ltx/en_uk_ware/tr.d036:trDA.note	
ltx/en_uk_ware/tr.d036:trDA.title	
ltx/en_uk_ware/tr.d036:trHO.commemorations	
ltx/en_uk_ware/tr.d036:trHO.daytitle	
ltx/en_uk_ware/tr.d036:trHO.description1	
ltx/en_uk_ware/tr.d036:trHO.description2	
ltx/en_uk_ware/tr.d036:trHO.note1	
ltx/en_uk_ware/tr.d036:trHO.note2	
ltx/en_uk_ware/tr.d036:trLI.Kontakion1.incipit	@ltx/en_uk_ware/tr.d036:trMA.Kontakion1.incipit
ltx/en_uk_ware/tr.d036:trLI.Kontakion1.melody	@ltx/en_uk_ware/tr.d036:trMA.Kontakion1.melody
ltx/en_uk_ware/tr.d036:trLI.Kontakion1.mode	@ltx/en_uk_ware/tr.d036:trMA.Kontakion1.mode
ltx/en_uk_ware/tr.d036:trLI.Kontakion1.text	@ltx/en_uk_ware/tr.d036:trMA.Kontakion1.text
ltx/en_uk_ware/tr.d036:trLI.MM.CommunionHymn.text	@ltx/en_uk_ware/properties:media.key
ltx/en_uk_ware/tr.d036:trLI.Megalynarion.text	
ltx/en_uk_ware/tr.d036:trLI.TheotokosHymn.incipit	…
ltx/en_uk_ware/tr.d036:trLI.TheotokosHymn.mode	@ltx/en_uk_ware/miscellanea:misc.Mode8
ltx/en_uk_ware/tr.d036:trLI.TheotokosHymn.text	
ltx/en_uk_ware/tr.d036:trMA.C1.title	
ltx/en_uk_ware/tr.d036:trMA.C1.verse	
ltx/en_uk_ware/tr.d036:trMA.ExapTheotokion.greekmelody	@ltx/en_uk_ware/he.a.m2:heAU.ToisMathitaisSynelthomen.greekname
ltx/en_uk_ware/tr.d036:trMA.ExapTheotokion.incipit	…
ltx/en_uk_ware/tr.d036:trMA.ExapTheotokion.melody	@ltx/en_uk_ware/he.a.m2:heAU.ToisMathitaisSynelthomen.name
ltx/en_uk_ware/tr.d036:trMA.ExapTheotokion.mode	@ltx/en_uk_ware/miscellanea:misc.Mode2
ltx/en_uk_ware/tr.d036:trMA.ExapTheotokion.text	
ltx/en_uk_ware/tr.d036:trMA.Exaposteilarion1.greekmelody	@ltx/en_uk_ware/he.a.m2:heAU.ToisMathitaisSynelthomen.greekname
ltx/en_uk_ware/tr.d036:trMA.Exaposteilarion1.incipit	…
ltx/en_uk_ware/tr.d036:trMA.Exaposteilarion1.melody	@ltx/en_uk_ware/he.a.m2:heAU.ToisMathitaisSynelthomen.name
ltx/en_uk_ware/tr.d036:trMA.Exaposteilarion1.mode	@ltx/en_uk_ware/miscellanea:misc.Mode2
ltx/en_uk_ware/tr.d036:trMA.Exaposteilarion1.text	
ltx/en_uk_ware/tr.d036:trMA.Kontakion1.incipit	…
ltx/en_uk_ware/tr.d036:trMA.Kontakion1.melody	@ltx/en_uk_ware/he.a.m8:heAU.TiYpermacho.name
ltx/en_uk_ware/tr.d036:trMA.Kontakion1.mode	@ltx/en_uk_ware/miscellanea:misc.Mode8
ltx/en_uk_ware/tr.d036:trMA.Kontakion1.text	
ltx/en_uk_ware/tr.d036:trMA.Lauds1.greekmelody	@ltx/en_uk_ware/he.a.m1:heAU.TonOuranionTagmaton.greekname
ltx/en_uk_ware/tr.d036:trMA.Lauds1.incipit	…
ltx/en_uk_ware/tr.d036:trMA.Lauds1.melody	@ltx/en_uk_ware/he.a.m1:heAU.TonOuranionTagmaton.name
ltx/en_uk_ware/tr.d036:trMA.Lauds1.mode	@ltx/en_uk_ware/miscellanea:misc.Mode1
ltx/en_uk_ware/tr.d036:trMA.Lauds1.text	
ltx/en_uk_ware/tr.d036:trMA.Lauds2.incipit	…
ltx/en_uk_ware/tr.d036:trMA.Lauds2.melody	@ltx/en_uk_ware/he.a.m1:heAU.TonOuranionTagmaton.name
ltx/en_uk_ware/tr.d036:trMA.Lauds2.mode	@ltx/en_uk_ware/miscellanea:misc.Mode1
ltx/en_uk_ware/tr.d036:trMA.Lauds2.text	
ltx/en_uk_ware/tr.d036:trMA.Lauds3.incipit	…
ltx/en_uk_ware/tr.d036:trMA.Lauds3.melody	@ltx/en_uk_ware/he.a.m1:heAU.TonOuranionTagmaton.name
ltx/en_uk_ware/tr.d036:trMA.Lauds3.mode	@ltx/en_uk_ware/miscellanea:misc.Mode1
ltx/en_uk_ware/tr.d036:trMA.Lauds3.text	
ltx/en_uk_ware/tr.d036:trMA.LaudsGlory.incipit	…
ltx/en_uk_ware/tr.d036:trMA.LaudsGlory.melody	@ltx/en_uk_ware/miscellanea:misc.Idiomelon
ltx/en_uk_ware/tr.d036:trMA.LaudsGlory.mode	@ltx/en_uk_ware/miscellanea:misc.Mode6
ltx/en_uk_ware/tr.d036:trMA.LaudsGlory.text	
ltx/en_uk_ware/tr.d036:trMA.LaudsTheotokion.incipit	…
ltx/en_uk_ware/tr.d036:trMA.LaudsTheotokion.melody	
ltx/en_uk_ware/tr.d036:trMA.LaudsTheotokion.mode	
ltx/en_uk_ware/tr.d036:trMA.LaudsTheotokion.text	
ltx/en_uk_ware/tr.d036:trMA.Ode1C11.greekmelody	@ltx/en_uk_ware/he.h.m4:heHE.AnoixoToStomaMou.greekname
ltx/en_uk_ware/tr.d036:trMA.Ode1C11.incipit	…
ltx/en_uk_ware/tr.d036:trMA.Ode1C11.melody	@ltx/en_uk_ware/he.h.m4:heHE.AnoixoToStomaMou.name
ltx/en_uk_ware/tr.d036:trMA.Ode1C11.mode	@ltx/en_uk_ware/miscellanea:misc.Mode4
ltx/en_uk_ware/tr.d036:trMA.Ode1C11.ode	@ltx/en_uk_ware/miscellanea:misc.Ode1
ltx/en_uk_ware/tr.d036:trMA.Ode1C11.text	
ltx/en_uk_ware/tr.d036:trMA.Ode1C12.incipit	…
ltx/en_uk_ware/tr.d036:trMA.Ode1C12.melody	@ltx/en_uk_ware/he.h.m4:heHE.AnoixoToStomaMou.name
ltx/en_uk_ware/tr.d036:trMA.Ode1C12.mode	@ltx/en_uk_ware/miscellanea:misc.Mode4
ltx/en_uk_ware/tr.d036:trMA.Ode1C12.ode	@ltx/en_uk_ware/miscellanea:misc.Ode1
ltx/en_uk_ware/tr.d036:trMA.Ode1C12.text	
ltx/en_uk_ware/tr.d036:trMA.Ode1C13.incipit	…
ltx/en_uk_ware/tr.d036:trMA.Ode1C13.melody	@ltx/en_uk_ware/he.h.m4:heHE.AnoixoToStomaMou.name
ltx/en_uk_ware/tr.d036:trMA.Ode1C13.mode	@ltx/en_uk_ware/miscellanea:misc.Mode4
ltx/en_uk_ware/tr.d036:trMA.Ode1C13.ode	@ltx/en_uk_ware/miscellanea:misc.Ode1
ltx/en_uk_ware/tr.d036:trMA.Ode1C13.text	
ltx/en_uk_ware/tr.d036:trMA.Ode1C1T.incipit	…
ltx/en_uk_ware/tr.d036:trMA.Ode1C1T.melody	@ltx/en_uk_ware/he.h.m4:heHE.AnoixoToStomaMou.name
ltx/en_uk_ware/tr.d036:trMA.Ode1C1T.mode	@ltx/en_uk_ware/miscellanea:misc.Mode4
ltx/en_uk_ware/tr.d036:trMA.Ode1C1T.ode	@ltx/en_uk_ware/miscellanea:misc.Ode1
ltx/en_uk_ware/tr.d036:trMA.Ode1C1T.text	
ltx/en_uk_ware/tr.d036:trMA.Ode3C11.greekmelody	@ltx/en_uk_ware/he.h.m4:heHE.TousSousYmnologous.greekname
ltx/en_uk_ware/tr.d036:trMA.Ode3C11.incipit	…
ltx/en_uk_ware/tr.d036:trMA.Ode3C11.melody	@ltx/en_uk_ware/he.h.m4:heHE.TousSousYmnologous.name
ltx/en_uk_ware/tr.d036:trMA.Ode3C11.mode	@ltx/en_uk_ware/miscellanea:misc.Mode4
ltx/en_uk_ware/tr.d036:trMA.Ode3C11.ode	@ltx/en_uk_ware/miscellanea:misc.Ode3
ltx/en_uk_ware/tr.d036:trMA.Ode3C11.text	
ltx/en_uk_ware/tr.d036:trMA.Ode3C12.incipit	…
ltx/en_uk_ware/tr.d036:trMA.Ode3C12.melody	@ltx/en_uk_ware/he.h.m4:heHE.TousSousYmnologous.name
ltx/en_uk_ware/tr.d036:trMA.Ode3C12.mode	@ltx/en_uk_ware/miscellanea:misc.Mode4
ltx/en_uk_ware/tr.d036:trMA.Ode3C12.ode	@ltx/en_uk_ware/miscellanea:misc.Ode3
ltx/en_uk_ware/tr.d036:trMA.Ode3C12.text	
ltx/en_uk_ware/tr.d036:trMA.Ode3C13.incipit	…
ltx/en_uk_ware/tr.d036:trMA.Ode3C13.melody	@ltx/en_uk_ware/he.h.m4:heHE.TousSousYmnologous.name
ltx/en_uk_ware/tr.d036:trMA.Ode3C13.mode	@ltx/en_uk_ware/miscellanea:misc.Mode4
ltx/en_uk_ware/tr.d036:trMA.Ode3C13.ode	@ltx/en_uk_ware/miscellanea:misc.Ode3
ltx/en_uk_ware/tr.d036:trMA.Ode3C13.text	
ltx/en_uk_ware/tr.d036:trMA.Ode3C1T.incipit	…
ltx/en_uk_ware/tr.d036:trMA.Ode3C1T.melody	@ltx/en_uk_ware/he.h.m4:heHE.TousSousYmnologous.name
ltx/en_uk_ware/tr.d036:trMA.Ode3C1T.mode	@ltx/en_uk_ware/miscellanea:misc.Mode4
ltx/en_uk_ware/tr.d036:trMA.Ode3C1T.ode	@ltx/en_uk_ware/miscellanea:misc.Ode3
ltx/en_uk_ware/tr.d036:trMA.Ode3C1T.text	
ltx/en_uk_ware/tr.d036:trMA.Ode3Kathisma1.greekmelody	@ltx/en_uk_ware/he.a.m4:heAU.TachyProkatalave.greekname
ltx/en_uk_ware/tr.d036:trMA.Ode3Kathisma1.incipit	…
ltx/en_uk_ware/tr.d036:trMA.Ode3Kathisma1.melody	@ltx/en_uk_ware/he.a.m4:heAU.TachyProkatalave.name
ltx/en_uk_ware/tr.d036:trMA.Ode3Kathisma1.mode	@ltx/en_uk_ware/miscellanea:misc.Mode4
ltx/en_uk_ware/tr.d036:trMA.Ode3Kathisma1.text	
ltx/en_uk_ware/tr.d036:trMA.Ode3Kathisma2.greekmelody	@ltx/en_uk_ware/he.a.m4:heAU.TachyProkatalave.greekname
ltx/en_uk_ware/tr.d036:trMA.Ode3Kathisma2.incipit	…
ltx/en_uk_ware/tr.d036:trMA.Ode3Kathisma2.melody	@ltx/en_uk_ware/he.a.m4:heAU.TachyProkatalave.name
ltx/en_uk_ware/tr.d036:trMA.Ode3Kathisma2.mode	@ltx/en_uk_ware/miscellanea:misc.Mode4
ltx/en_uk_ware/tr.d036:trMA.Ode3Kathisma2.text	
ltx/en_uk_ware/tr.d036:trMA.Ode4C11.greekmelody	@ltx/en_uk_ware/he.h.m4:heHE.TinAnexichniaston.greekname
ltx/en_uk_ware/tr.d036:trMA.Ode4C11.incipit	…
ltx/en_uk_ware/tr.d036:trMA.Ode4C11.melody	@ltx/en_uk_ware/he.h.m4:heHE.TinAnexichniaston.name
ltx/en_uk_ware/tr.d036:trMA.Ode4C11.mode	@ltx/en_uk_ware/miscellanea:misc.Mode4
ltx/en_uk_ware/tr.d036:trMA.Ode4C11.ode	@ltx/en_uk_ware/miscellanea:misc.Ode4
ltx/en_uk_ware/tr.d036:trMA.Ode4C11.text	
ltx/en_uk_ware/tr.d036:trMA.Ode4C12.incipit	…
ltx/en_uk_ware/tr.d036:trMA.Ode4C12.melody	@ltx/en_uk_ware/he.h.m4:heHE.TinAnexichniaston.name
ltx/en_uk_ware/tr.d036:trMA.Ode4C12.mode	@ltx/en_uk_ware/miscellanea:misc.Mode4
ltx/en_uk_ware/tr.d036:trMA.Ode4C12.ode	@ltx/en_uk_ware/miscellanea:misc.Ode4
ltx/en_uk_ware/tr.d036:trMA.Ode4C12.text	
ltx/en_uk_ware/tr.d036:trMA.Ode4C13.incipit	…
ltx/en_uk_ware/tr.d036:trMA.Ode4C13.melody	@ltx/en_uk_ware/he.h.m4:heHE.TinAnexichniaston.name
ltx/en_uk_ware/tr.d036:trMA.Ode4C13.mode	@ltx/en_uk_ware/miscellanea:misc.Mode4
ltx/en_uk_ware/tr.d036:trMA.Ode4C13.ode	@ltx/en_uk_ware/miscellanea:misc.Ode4
ltx/en_uk_ware/tr.d036:trMA.Ode4C13.text	
ltx/en_uk_ware/tr.d036:trMA.Ode4C1T.incipit	…
ltx/en_uk_ware/tr.d036:trMA.Ode4C1T.melody	@ltx/en_uk_ware/he.h.m4:heHE.TinAnexichniaston.name
ltx/en_uk_ware/tr.d036:trMA.Ode4C1T.mode	@ltx/en_uk_ware/miscellanea:misc.Mode4
ltx/en_uk_ware/tr.d036:trMA.Ode4C1T.ode	@ltx/en_uk_ware/miscellanea:misc.Ode4
ltx/en_uk_ware/tr.d036:trMA.Ode4C1T.text	
ltx/en_uk_ware/tr.d036:trMA.Ode5C11.greekmelody	@ltx/en_uk_ware/he.h.m4:heHE.ExestiTaSympanta.greekname
ltx/en_uk_ware/tr.d036:trMA.Ode5C11.incipit	…
ltx/en_uk_ware/tr.d036:trMA.Ode5C11.melody	@ltx/en_uk_ware/he.h.m4:heHE.ExestiTaSympanta.name
ltx/en_uk_ware/tr.d036:trMA.Ode5C11.mode	@ltx/en_uk_ware/miscellanea:misc.Mode4
ltx/en_uk_ware/tr.d036:trMA.Ode5C11.ode	@ltx/en_uk_ware/miscellanea:misc.Ode5
ltx/en_uk_ware/tr.d036:trMA.Ode5C11.text	
ltx/en_uk_ware/tr.d036:trMA.Ode5C12.incipit	…
ltx/en_uk_ware/tr.d036:trMA.Ode5C12.melody	@ltx/en_uk_ware/he.h.m4:heHE.ExestiTaSympanta.name
ltx/en_uk_ware/tr.d036:trMA.Ode5C12.mode	@ltx/en_uk_ware/miscellanea:misc.Mode4
ltx/en_uk_ware/tr.d036:trMA.Ode5C12.ode	@ltx/en_uk_ware/miscellanea:misc.Ode5
ltx/en_uk_ware/tr.d036:trMA.Ode5C12.text	
ltx/en_uk_ware/tr.d036:trMA.Ode5C13.incipit	…
ltx/en_uk_ware/tr.d036:trMA.Ode5C13.melody	@ltx/en_uk_ware/he.h.m4:heHE.ExestiTaSympanta.name
ltx/en_uk_ware/tr.d036:trMA.Ode5C13.mode	@ltx/en_uk_ware/miscellanea:misc.Mode4
ltx/en_uk_ware/tr.d036:trMA.Ode5C13.ode	@ltx/en_uk_ware/miscellanea:misc.Ode5
ltx/en_uk_ware/tr.d036:trMA.Ode5C13.text	
ltx/en_uk_ware/tr.d036:trMA.Ode5C1T.incipit	…
ltx/en_uk_ware/tr.d036:trMA.Ode5C1T.melody	@ltx/en_uk_ware/he.h.m4:heHE.ExestiTaSympanta.name
ltx/en_uk_ware/tr.d036:trMA.Ode5C1T.mode	@ltx/en_uk_ware/miscellanea:misc.Mode4
ltx/en_uk_ware/tr.d036:trMA.Ode5C1T.ode	@ltx/en_uk_ware/miscellanea:misc.Ode5
ltx/en_uk_ware/tr.d036:trMA.Ode5C1T.text	
ltx/en_uk_ware/tr.d036:trMA.Ode6C11.greekmelody	@ltx/en_uk_ware/he.h.m4:heHE.TinTheianTaftin.greekname
ltx/en_uk_ware/tr.d036:trMA.Ode6C11.incipit	…
ltx/en_uk_ware/tr.d036:trMA.Ode6C11.melody	@ltx/en_uk_ware/he.h.m4:heHE.TinTheianTaftin.name
ltx/en_uk_ware/tr.d036:trMA.Ode6C11.mode	@ltx/en_uk_ware/miscellanea:misc.Mode4
ltx/en_uk_ware/tr.d036:trMA.Ode6C11.ode	@ltx/en_uk_ware/miscellanea:misc.Ode6
ltx/en_uk_ware/tr.d036:trMA.Ode6C11.text	
ltx/en_uk_ware/tr.d036:trMA.Ode6C12.incipit	…
ltx/en_uk_ware/tr.d036:trMA.Ode6C12.melody	@ltx/en_uk_ware/he.h.m4:heHE.TinTheianTaftin.name
ltx/en_uk_ware/tr.d036:trMA.Ode6C12.mode	@ltx/en_uk_ware/miscellanea:misc.Mode4
ltx/en_uk_ware/tr.d036:trMA.Ode6C12.ode	@ltx/en_uk_ware/miscellanea:misc.Ode6
ltx/en_uk_ware/tr.d036:trMA.Ode6C12.text	
ltx/en_uk_ware/tr.d036:trMA.Ode6C13.incipit	…
ltx/en_uk_ware/tr.d036:trMA.Ode6C13.melody	@ltx/en_uk_ware/he.h.m4:heHE.TinTheianTaftin.name
ltx/en_uk_ware/tr.d036:trMA.Ode6C13.mode	@ltx/en_uk_ware/miscellanea:misc.Mode4
ltx/en_uk_ware/tr.d036:trMA.Ode6C13.ode	@ltx/en_uk_ware/miscellanea:misc.Ode6
ltx/en_uk_ware/tr.d036:trMA.Ode6C13.text	
ltx/en_uk_ware/tr.d036:trMA.Ode6C1T.incipit	…
ltx/en_uk_ware/tr.d036:trMA.Ode6C1T.melody	@ltx/en_uk_ware/he.h.m4:heHE.TinTheianTaftin.name
ltx/en_uk_ware/tr.d036:trMA.Ode6C1T.mode	@ltx/en_uk_ware/miscellanea:misc.Mode4
ltx/en_uk_ware/tr.d036:trMA.Ode6C1T.ode	@ltx/en_uk_ware/miscellanea:misc.Ode6
ltx/en_uk_ware/tr.d036:trMA.Ode6C1T.text	
ltx/en_uk_ware/tr.d036:trMA.Ode7C11.greekmelody	@ltx/en_uk_ware/he.h.m4:heHE.OukElatrefsan.greekname
ltx/en_uk_ware/tr.d036:trMA.Ode7C11.incipit	…
ltx/en_uk_ware/tr.d036:trMA.Ode7C11.melody	@ltx/en_uk_ware/he.h.m4:heHE.OukElatrefsan.name
ltx/en_uk_ware/tr.d036:trMA.Ode7C11.mode	@ltx/en_uk_ware/miscellanea:misc.Mode4
ltx/en_uk_ware/tr.d036:trMA.Ode7C11.ode	@ltx/en_uk_ware/miscellanea:misc.Ode7
ltx/en_uk_ware/tr.d036:trMA.Ode7C11.text	
ltx/en_uk_ware/tr.d036:trMA.Ode7C12.incipit	…
ltx/en_uk_ware/tr.d036:trMA.Ode7C12.melody	@ltx/en_uk_ware/he.h.m4:heHE.OukElatrefsan.name
ltx/en_uk_ware/tr.d036:trMA.Ode7C12.mode	@ltx/en_uk_ware/miscellanea:misc.Mode4
ltx/en_uk_ware/tr.d036:trMA.Ode7C12.ode	@ltx/en_uk_ware/miscellanea:misc.Ode7
ltx/en_uk_ware/tr.d036:trMA.Ode7C12.text	
ltx/en_uk_ware/tr.d036:trMA.Ode7C13.incipit	…
ltx/en_uk_ware/tr.d036:trMA.Ode7C13.melody	@ltx/en_uk_ware/he.h.m4:heHE.OukElatrefsan.name
ltx/en_uk_ware/tr.d036:trMA.Ode7C13.mode	@ltx/en_uk_ware/miscellanea:misc.Mode4
ltx/en_uk_ware/tr.d036:trMA.Ode7C13.ode	@ltx/en_uk_ware/miscellanea:misc.Ode7
ltx/en_uk_ware/tr.d036:trMA.Ode7C13.text	
ltx/en_uk_ware/tr.d036:trMA.Ode7C1T.incipit	…
ltx/en_uk_ware/tr.d036:trMA.Ode7C1T.melody	@ltx/en_uk_ware/he.h.m4:heHE.OukElatrefsan.name
ltx/en_uk_ware/tr.d036:trMA.Ode7C1T.mode	@ltx/en_uk_ware/miscellanea:misc.Mode4
ltx/en_uk_ware/tr.d036:trMA.Ode7C1T.ode	@ltx/en_uk_ware/miscellanea:misc.Ode7
ltx/en_uk_ware/tr.d036:trMA.Ode7C1T.text	
ltx/en_uk_ware/tr.d036:trMA.Ode8C11.greekmelody	@ltx/en_uk_ware/he.h.m4:heHE.PaidasEvageis.greekname
ltx/en_uk_ware/tr.d036:trMA.Ode8C11.incipit	…
ltx/en_uk_ware/tr.d036:trMA.Ode8C11.melody	@ltx/en_uk_ware/he.h.m4:heHE.PaidasEvageis.name
ltx/en_uk_ware/tr.d036:trMA.Ode8C11.mode	@ltx/en_uk_ware/miscellanea:misc.Mode4
ltx/en_uk_ware/tr.d036:trMA.Ode8C11.ode	@ltx/en_uk_ware/miscellanea:misc.Ode8
ltx/en_uk_ware/tr.d036:trMA.Ode8C11.text	
ltx/en_uk_ware/tr.d036:trMA.Ode8C12.incipit	…
ltx/en_uk_ware/tr.d036:trMA.Ode8C12.melody	@ltx/en_uk_ware/he.h.m4:heHE.PaidasEvageis.name
ltx/en_uk_ware/tr.d036:trMA.Ode8C12.mode	@ltx/en_uk_ware/miscellanea:misc.Mode4
ltx/en_uk_ware/tr.d036:trMA.Ode8C12.ode	@ltx/en_uk_ware/miscellanea:misc.Ode8
ltx/en_uk_ware/tr.d036:trMA.Ode8C12.text	
ltx/en_uk_ware/tr.d036:trMA.Ode8C13.incipit	…
ltx/en_uk_ware/tr.d036:trMA.Ode8C13.melody	@ltx/en_uk_ware/he.h.m4:heHE.PaidasEvageis.name
ltx/en_uk_ware/tr.d036:trMA.Ode8C13.mode	@ltx/en_uk_ware/miscellanea:misc.Mode4
ltx/en_uk_ware/tr.d036:trMA.Ode8C13.ode	@ltx/en_uk_ware/miscellanea:misc.Ode8
ltx/en_uk_ware/tr.d036:trMA.Ode8C13.text	
ltx/en_uk_ware/tr.d036:trMA.Ode8C1T.incipit	…
ltx/en_uk_ware/tr.d036:trMA.Ode8C1T.melody	@ltx/en_uk_ware/he.h.m4:heHE.PaidasEvageis.name
ltx/en_uk_ware/tr.d036:trMA.Ode8C1T.mode	@ltx/en_uk_ware/miscellanea:misc.Mode4
ltx/en_uk_ware/tr.d036:trMA.Ode8C1T.ode	@ltx/en_uk_ware/miscellanea:misc.Ode8
ltx/en_uk_ware/tr.d036:trMA.Ode8C1T.text	
ltx/en_uk_ware/tr.d036:trMA.Ode9C11.greekmelody	@ltx/en_uk_ware/he.h.m4:heHE.ApasGigenis.greekname
ltx/en_uk_ware/tr.d036:trMA.Ode9C11.incipit	…
ltx/en_uk_ware/tr.d036:trMA.Ode9C11.melody	@ltx/en_uk_ware/he.h.m4:heHE.ApasGigenis.name
ltx/en_uk_ware/tr.d036:trMA.Ode9C11.mode	@ltx/en_uk_ware/miscellanea:misc.Mode4
ltx/en_uk_ware/tr.d036:trMA.Ode9C11.ode	@ltx/en_uk_ware/miscellanea:misc.Ode9
ltx/en_uk_ware/tr.d036:trMA.Ode9C11.text	
ltx/en_uk_ware/tr.d036:trMA.Ode9C12.incipit	…
ltx/en_uk_ware/tr.d036:trMA.Ode9C12.melody	@ltx/en_uk_ware/he.h.m4:heHE.ApasGigenis.name
ltx/en_uk_ware/tr.d036:trMA.Ode9C12.mode	@ltx/en_uk_ware/miscellanea:misc.Mode4
ltx/en_uk_ware/tr.d036:trMA.Ode9C12.ode	@ltx/en_uk_ware/miscellanea:misc.Ode9
ltx/en_uk_ware/tr.d036:trMA.Ode9C12.text	
ltx/en_uk_ware/tr.d036:trMA.Ode9C13.incipit	…
ltx/en_uk_ware/tr.d036:trMA.Ode9C13.melody	@ltx/en_uk_ware/he.h.m4:heHE.ApasGigenis.name
ltx/en_uk_ware/tr.d036:trMA.Ode9C13.mode	@ltx/en_uk_ware/miscellanea:misc.Mode4
ltx/en_uk_ware/tr.d036:trMA.Ode9C13.ode	@ltx/en_uk_ware/miscellanea:misc.Ode9
ltx/en_uk_ware/tr.d036:trMA.Ode9C13.text	
ltx/en_uk_ware/tr.d036:trMA.Ode9C1T.incipit	…
ltx/en_uk_ware/tr.d036:trMA.Ode9C1T.melody	@ltx/en_uk_ware/he.h.m4:heHE.ApasGigenis.name
ltx/en_uk_ware/tr.d036:trMA.Ode9C1T.mode	@ltx/en_uk_ware/miscellanea:misc.Mode4
ltx/en_uk_ware/tr.d036:trMA.Ode9C1T.ode	@ltx/en_uk_ware/miscellanea:misc.Ode9
ltx/en_uk_ware/tr.d036:trMA.Ode9C1T.text	
ltx/en_uk_ware/tr.d036:trMA.Oikos1.text	
ltx/en_uk_ware/tr.d036:trMA.Oikos12.text	
ltx/en_uk_ware/tr.d036:trMA.Oikos13.text	
ltx/en_uk_ware/tr.d036:trMA.Oikos14.text	
ltx/en_uk_ware/tr.d036:trMA.Oikos15.text	
ltx/en_uk_ware/tr.d036:trMA.Oikos16.text	
ltx/en_uk_ware/tr.d036:trMA.Oikos17.text	
ltx/en_uk_ware/tr.d036:trMA.Oikos18.text	
ltx/en_uk_ware/tr.d036:trMA.PostGospelBoth.incipit	@ltx/en_uk_ware/tr.d001:trMA.PostGospelBoth.incipit
ltx/en_uk_ware/tr.d036:trMA.PostGospelBoth.melody	
ltx/en_uk_ware/tr.d036:trMA.PostGospelBoth.mode	@ltx/en_uk_ware/miscellanea:misc.Mode8
ltx/en_uk_ware/tr.d036:trMA.PostGospelBoth.text	@ltx/en_uk_ware/tr.d001:trMA.PostGospelBoth.text
ltx/en_uk_ware/tr.d036:trMA.PostGospelGlory.incipit	@ltx/en_uk_ware/tr.d001:trMA.PostGospelGlory.incipit
ltx/en_uk_ware/tr.d036:trMA.PostGospelGlory.melody	
ltx/en_uk_ware/tr.d036:trMA.PostGospelGlory.mode	@ltx/en_uk_ware/miscellanea:misc.Mode8
ltx/en_uk_ware/tr.d036:trMA.PostGospelGlory.text	@ltx/en_uk_ware/tr.d001:trMA.PostGospelGlory.text
ltx/en_uk_ware/tr.d036:trMA.PostGospelIdiomelon.incipit	@ltx/en_uk_ware/tr.d001:trMA.PostGospelIdiomelon.incipit
ltx/en_uk_ware/tr.d036:trMA.PostGospelIdiomelon.melody	
ltx/en_uk_ware/tr.d036:trMA.PostGospelIdiomelon.mode	@ltx/en_uk_ware/miscellanea:misc.Mode6
ltx/en_uk_ware/tr.d036:trMA.PostGospelIdiomelon.text	@ltx/en_uk_ware/tr.d001:trMA.PostGospelIdiomelon.text
ltx/en_uk_ware/tr.d036:trSY.commemoration.couplet1.title	
ltx/en_uk_ware/tr.d036:trSY.commemoration.couplet1.verse1	
ltx/en_uk_ware/tr.d036:trSY.commemoration.couplet1.verse2	
ltx/en_uk_ware/tr.d036:trSY.commemoration.narration.p01	
ltx/en_uk_ware/tr.d036:trSY.commemoration.narration.p02	
ltx/en_uk_ware/tr.d036:trSY.commemoration.narration.p03	
ltx/en_uk_ware/tr.d036:trSY.commemoration.narration.p04	
ltx/en_uk_ware/tr.d036:trSY.commemoration.narration.p05	
ltx/en_uk_ware/tr.d036:trSY.commemoration.narration.p06	
ltx/en_uk_ware/tr.d036:trSY.commemoration.narration.p07	
ltx/en_uk_ware/tr.d036:trSY.commemoration.onotherday.text	
ltx/en_uk_ware/tr.d036:trSY.commemoration.text	
ltx/en_uk_ware/tr.d036:trSY.lastline	
ltx/en_uk_ware/tr.d036:trVE.ApolTheotokion.incipit	…
ltx/en_uk_ware/tr.d036:trVE.ApolTheotokion.melody	
ltx/en_uk_ware/tr.d036:trVE.ApolTheotokion.mode	@ltx/en_uk_ware/miscellanea:misc.Mode8
ltx/en_uk_ware/tr.d036:trVE.ApolTheotokion.text	
ltx/en_uk_ware/tr.d036:trVE.Apolytikion1.incipit	…
ltx/en_uk_ware/tr.d036:trVE.Apolytikion1.melody	
ltx/en_uk_ware/tr.d036:trVE.Apolytikion1.mode	@ltx/en_uk_ware/miscellanea:misc.Mode8
ltx/en_uk_ware/tr.d036:trVE.Apolytikion1.text	
ltx/en_uk_ware/tr.d036:trVE.AposGlory.incipit	…
ltx/en_uk_ware/tr.d036:trVE.AposGlory.melody	@ltx/en_uk_ware/miscellanea:misc.Idiomelon
ltx/en_uk_ware/tr.d036:trVE.AposGlory.mode	@ltx/en_uk_ware/miscellanea:misc.Mode8
ltx/en_uk_ware/tr.d036:trVE.AposGlory.text	
ltx/en_uk_ware/tr.d036:trVE.AposTheotokion.incipit	…
ltx/en_uk_ware/tr.d036:trVE.AposTheotokion.melody	
ltx/en_uk_ware/tr.d036:trVE.AposTheotokion.mode	@ltx/en_uk_ware/miscellanea:misc.Mode8
ltx/en_uk_ware/tr.d036:trVE.AposTheotokion.text	
ltx/en_uk_ware/tr.d036:trVE.SticGlory.incipit	…
ltx/en_uk_ware/tr.d036:trVE.SticGlory.melody	@ltx/en_uk_ware/miscellanea:misc.Idiomelon
ltx/en_uk_ware/tr.d036:trVE.SticGlory.mode	@ltx/en_uk_ware/miscellanea:misc.Mode6
ltx/en_uk_ware/tr.d036:trVE.SticGlory.text	
ltx/en_uk_ware/tr.d036:trVE.Stichera01.greekmelody	@ltx/en_uk_ware/he.a.m2:heAU.PoioisEffimionStemmasin.greekname
ltx/en_uk_ware/tr.d036:trVE.Stichera01.incipit	…
ltx/en_uk_ware/tr.d036:trVE.Stichera01.melody	@ltx/en_uk_ware/he.a.m2:heAU.PoioisEffimionStemmasin.name
ltx/en_uk_ware/tr.d036:trVE.Stichera01.mode	@ltx/en_uk_ware/miscellanea:misc.Mode2
ltx/en_uk_ware/tr.d036:trVE.Stichera01.text	
ltx/en_uk_ware/tr.d036:trVE.Stichera02.greekmelody	@ltx/en_uk_ware/he.a.m2:heAU.PoioisEffimionStemmasin.greekname
ltx/en_uk_ware/tr.d036:trVE.Stichera02.incipit	…
ltx/en_uk_ware/tr.d036:trVE.Stichera02.melody	@ltx/en_uk_ware/he.a.m2:heAU.PoioisEffimionStemmasin.name
ltx/en_uk_ware/tr.d036:trVE.Stichera02.mode	@ltx/en_uk_ware/miscellanea:misc.Mode2
ltx/en_uk_ware/tr.d036:trVE.Stichera02.text	
ltx/en_uk_ware/tr.d036:trVE.Stichera03.greekmelody	@ltx/en_uk_ware/he.a.m2:heAU.PoioisEffimionStemmasin.greekname
ltx/en_uk_ware/tr.d036:trVE.Stichera03.incipit	…
ltx/en_uk_ware/tr.d036:trVE.Stichera03.melody	@ltx/en_uk_ware/he.a.m2:heAU.PoioisEffimionStemmasin.name
ltx/en_uk_ware/tr.d036:trVE.Stichera03.mode	@ltx/en_uk_ware/miscellanea:misc.Mode2
ltx/en_uk_ware/tr.d036:trVE.Stichera03.text	
