ltx/en_uk_ware/tr.d071:trCO.header	
ltx/en_uk_ware/tr.d071:trDA.commemoration.full	
ltx/en_uk_ware/tr.d071:trDA.commemoration.short	
ltx/en_uk_ware/tr.d071:trDA.insert1	
ltx/en_uk_ware/tr.d071:trDA.insert2	
ltx/en_uk_ware/tr.d071:trDA.note	
ltx/en_uk_ware/tr.d071:trDA.title	
ltx/en_uk_ware/tr.d071:trHO.commemorations	
ltx/en_uk_ware/tr.d071:trHO.daytitle	
ltx/en_uk_ware/tr.d071:trHO.description1	
ltx/en_uk_ware/tr.d071:trHO.description2	
ltx/en_uk_ware/tr.d071:trHO.note1	
ltx/en_uk_ware/tr.d071:trHO.note2	
ltx/en_uk_ware/tr.d071:trLI.AfterCommunion.incipit	…
ltx/en_uk_ware/tr.d071:trLI.AfterCommunion.mode	@ltx/en_uk_ware/miscellanea:misc.Mode2
ltx/en_uk_ware/tr.d071:trLI.AfterCommunion.text	
ltx/en_uk_ware/tr.d071:trLI.CherubicHymn.mode	@ltx/en_uk_ware/miscellanea:misc.Mode5
ltx/en_uk_ware/tr.d071:trLI.CherubicHymn.title	
ltx/en_uk_ware/tr.d071:trLI.CherubicHymnPart1.incipit	…
ltx/en_uk_ware/tr.d071:trLI.CherubicHymnPart1.text	
ltx/en_uk_ware/tr.d071:trLI.CherubicHymnPart2.incipit	…
ltx/en_uk_ware/tr.d071:trLI.CherubicHymnPart2.text	
ltx/en_uk_ware/tr.d071:trLI.CommunionHymn.text	@ltx/en_uk_ware/properties:media.key
ltx/en_uk_ware/tr.d071:trLI.SaturdayArise.text	@ltx/en_uk_ware/properties:media.key
ltx/en_uk_ware/tr.d071:trLI.SaturdayHymn.mode	@ltx/en_uk_ware/miscellanea:misc.Mode1
ltx/en_uk_ware/tr.d071:trLI.SaturdayHymn.text	@ltx/en_uk_ware/properties:media.key
ltx/en_uk_ware/tr.d071:trLI.SaturdayHymn.title	
ltx/en_uk_ware/tr.d071:trLI.TheotokosHymn.incipit	…
ltx/en_uk_ware/tr.d071:trLI.TheotokosHymn.mode	@ltx/en_uk_ware/miscellanea:misc.Mode8
ltx/en_uk_ware/tr.d071:trLI.TheotokosHymn.text	
ltx/en_uk_ware/tr.d071:trVE.SticGlory.incipit	@ltx/en_uk_ware/tr.d070:trMA.LaudsGlory.incipit
ltx/en_uk_ware/tr.d071:trVE.SticGlory.melody	@ltx/en_uk_ware/miscellanea:misc.Idiomelon
ltx/en_uk_ware/tr.d071:trVE.SticGlory.mode	@ltx/en_uk_ware/miscellanea:misc.Mode6
ltx/en_uk_ware/tr.d071:trVE.SticGlory.text	@ltx/en_uk_ware/tr.d070:trMA.LaudsGlory.text
ltx/en_uk_ware/tr.d071:trVE.SticTheotokion.incipit	…
ltx/en_uk_ware/tr.d071:trVE.SticTheotokion.melody	
ltx/en_uk_ware/tr.d071:trVE.SticTheotokion.mode	@ltx/en_uk_ware/miscellanea:misc.Mode1
ltx/en_uk_ware/tr.d071:trVE.SticTheotokion.text	
ltx/en_uk_ware/tr.d071:trVE.Stichera01.incipit	…
ltx/en_uk_ware/tr.d071:trVE.Stichera01.melody	
ltx/en_uk_ware/tr.d071:trVE.Stichera01.mode	@ltx/en_uk_ware/miscellanea:misc.Mode1
ltx/en_uk_ware/tr.d071:trVE.Stichera01.text	
ltx/en_uk_ware/tr.d071:trVE.Stichera02.incipit	…
ltx/en_uk_ware/tr.d071:trVE.Stichera02.melody	
ltx/en_uk_ware/tr.d071:trVE.Stichera02.mode	@ltx/en_uk_ware/miscellanea:misc.Mode1
ltx/en_uk_ware/tr.d071:trVE.Stichera02.text	
ltx/en_uk_ware/tr.d071:trVE.Stichera03.incipit	…
ltx/en_uk_ware/tr.d071:trVE.Stichera03.melody	
ltx/en_uk_ware/tr.d071:trVE.Stichera03.mode	@ltx/en_uk_ware/miscellanea:misc.Mode1
ltx/en_uk_ware/tr.d071:trVE.Stichera03.text	
ltx/en_uk_ware/tr.d071:trVE.Stichera04.incipit	…
ltx/en_uk_ware/tr.d071:trVE.Stichera04.melody	
ltx/en_uk_ware/tr.d071:trVE.Stichera04.mode	@ltx/en_uk_ware/miscellanea:misc.Mode1
ltx/en_uk_ware/tr.d071:trVE.Stichera04.text	
ltx/en_uk_ware/tr.d071:trVE.Stichera05.incipit	…
ltx/en_uk_ware/tr.d071:trVE.Stichera05.melody	@ltx/en_uk_ware/miscellanea:misc.Idiomelon
ltx/en_uk_ware/tr.d071:trVE.Stichera05.mode	@ltx/en_uk_ware/miscellanea:misc.Mode8
ltx/en_uk_ware/tr.d071:trVE.Stichera05.text	
ltx/en_uk_ware/tr.d071:trVE.Stichera06.incipit	…
ltx/en_uk_ware/tr.d071:trVE.Stichera06.melody	@ltx/en_uk_ware/miscellanea:misc.Idiomelon
ltx/en_uk_ware/tr.d071:trVE.Stichera06.mode	@ltx/en_uk_ware/miscellanea:misc.Mode8
ltx/en_uk_ware/tr.d071:trVE.Stichera06.text	
ltx/en_uk_ware/tr.d071:trVE.Stichera07.incipit	…
ltx/en_uk_ware/tr.d071:trVE.Stichera07.melody	@ltx/en_uk_ware/miscellanea:misc.Idiomelon
ltx/en_uk_ware/tr.d071:trVE.Stichera07.mode	@ltx/en_uk_ware/miscellanea:misc.Mode8
ltx/en_uk_ware/tr.d071:trVE.Stichera07.text	
ltx/en_uk_ware/tr.d071:trVL.header	
