ltx/en_uk_ware/tr.d053:trCO.header	
ltx/en_uk_ware/tr.d053:trDA.commemoration.full	
ltx/en_uk_ware/tr.d053:trDA.commemoration.short	
ltx/en_uk_ware/tr.d053:trDA.insert1	
ltx/en_uk_ware/tr.d053:trDA.insert2	
ltx/en_uk_ware/tr.d053:trDA.note	
ltx/en_uk_ware/tr.d053:trDA.title	
ltx/en_uk_ware/tr.d053:trHO.commemorations	
ltx/en_uk_ware/tr.d053:trHO.daytitle	
ltx/en_uk_ware/tr.d053:trHO.description1	
ltx/en_uk_ware/tr.d053:trHO.description2	
ltx/en_uk_ware/tr.d053:trHO.note1	
ltx/en_uk_ware/tr.d053:trHO.note2	
ltx/en_uk_ware/tr.d053:trMA.AposIdiomelon1.incipit	Forsaking the height of the…
ltx/en_uk_ware/tr.d053:trMA.AposIdiomelon1.melody	@ltx/en_uk_ware/miscellanea:misc.Idiomelon
ltx/en_uk_ware/tr.d053:trMA.AposIdiomelon1.mode	@ltx/en_uk_ware/miscellanea:misc.Mode3
ltx/en_uk_ware/tr.d053:trMA.AposIdiomelon1.text	Forsaking the height of the virtues, O my soul, thou hast descended to the depths of sin, and fallen among evil thieves upon the road; and now thou dost lie covered with rotting sores, prostrate and helpless. But cry aloud to Christ thy God, who was crucified and wounded of His own will for thy sake: ‘Take care of me, O Lord, and save me.’
ltx/en_uk_ware/tr.d053:trMA.AposIdiomelon2.incipit	In my misery I have…
ltx/en_uk_ware/tr.d053:trMA.AposIdiomelon2.melody	@ltx/en_uk_ware/miscellanea:misc.Idiomelon
ltx/en_uk_ware/tr.d053:trMA.AposIdiomelon2.mode	@ltx/en_uk_ware/miscellanea:misc.Mode8
ltx/en_uk_ware/tr.d053:trMA.AposIdiomelon2.text	In my misery I have been wounded by thieving thoughts and left half dead, O Lord. The company of the prophets passed me by, seeing me at the point of death, incurable by human skills. Therefore, in my cruel suffering, with humbleness of heart I cry to Thee:O Christ my God, in Thy compassion pour upon me Thy great mercy.
ltx/en_uk_ware/tr.d053:trMA.AposMartyric.incipit	Invincible martyrs of Christ, ye…
ltx/en_uk_ware/tr.d053:trMA.AposMartyric.melody	
ltx/en_uk_ware/tr.d053:trMA.AposMartyric.mode	@ltx/en_uk_ware/miscellanea:misc.Mode8
ltx/en_uk_ware/tr.d053:trMA.AposMartyric.text	Invincible martyrs of Christ, ye triumphed over falsehood by the power of the Cross, and gained as your reward the grace of life eternal. Ye felt no terror at the threats of tyrants, and when ye suffered torment ye rejoiced; and now your blood has become the healing of our souls. Intercede for our salvation.
ltx/en_uk_ware/tr.d053:trMA.AposTheotokion.incipit	When the all-pure Virgin saw…
ltx/en_uk_ware/tr.d053:trMA.AposTheotokion.melody	
ltx/en_uk_ware/tr.d053:trMA.AposTheotokion.mode	@ltx/en_uk_ware/miscellanea:misc.Mode8
ltx/en_uk_ware/tr.d053:trMA.AposTheotokion.text	When the all-pure Virgin saw Thee hanging in the flesh upon the Cross, her heart was wounded and she cried with tears: ‘O Word, where hast Thou gone, O most beloved Jesus, my Son and my Lord? I am Thy Mother: leave me not alone, O Christ.’
ltx/en_uk_ware/tr.d053:trMA.C1.poet	@ltx/en_uk_ware/poets:po.Iosif
ltx/en_uk_ware/tr.d053:trMA.C2.poet	@ltx/en_uk_ware/poets:po.Theodorou
ltx/en_uk_ware/tr.d053:trMA.Kathisma21.greekmelody	@ltx/en_uk_ware/he.a.m8:heAU.ToProstachthen.greekname
ltx/en_uk_ware/tr.d053:trMA.Kathisma21.incipit	Sinfully Adam ate from the…
ltx/en_uk_ware/tr.d053:trMA.Kathisma21.melody	@ltx/en_uk_ware/he.a.m8:heAU.ToProstachthen.name
ltx/en_uk_ware/tr.d053:trMA.Kathisma21.mode	@ltx/en_uk_ware/miscellanea:misc.Mode8
ltx/en_uk_ware/tr.d053:trMA.Kathisma21.text	Sinfully Adam ate from the tree, and reaped in bitterness the fruits of his greed; but Thou wast lifted on the Tree, O merciful Lord, and hast delivered him from his grievous condemnation. Therefore we raise our cry to Thee: Grant us, Master, to abstain from the fruit that brings corruption, and to do Thy will, that we may receive Thy mercy.
ltx/en_uk_ware/tr.d053:trMA.Kathisma22.greekmelody	@ltx/en_uk_ware/he.a.m8:heAU.ToProstachthen.greekname
ltx/en_uk_ware/tr.d053:trMA.Kathisma22.incipit	O holy Virgin, Christ took…
ltx/en_uk_ware/tr.d053:trMA.Kathisma22.melody	@ltx/en_uk_ware/he.a.m8:heAU.ToProstachthen.name
ltx/en_uk_ware/tr.d053:trMA.Kathisma22.mode	@ltx/en_uk_ware/miscellanea:misc.Mode8
ltx/en_uk_ware/tr.d053:trMA.Kathisma22.text	O holy Virgin, Christ took flesh from thy pure womb and was born from thee in ways beyond our understanding; seeing Him hang between two evildoers on the Cross, thy heart was filled with anguish, and with a mother’s grief thou hast cried out: ‘Woe is me, my Child! What is this divine and ineffable act of Thy loving providence, whereby Thou hast restored to life Thy creature? I sing the praises of Thy deep compassion.’
ltx/en_uk_ware/tr.d053:trMA.Kathisma31.incipit	Singing the praises of the…
ltx/en_uk_ware/tr.d053:trMA.Kathisma31.melody	
ltx/en_uk_ware/tr.d053:trMA.Kathisma31.mode	@ltx/en_uk_ware/miscellanea:misc.Mode2
ltx/en_uk_ware/tr.d053:trMA.Kathisma31.text	Singing the praises of the most holy Wood of the Cross, we ever venerate Thy boundless love, O Christ our God. For through the Cross Thou hast put to shame the hosts of the enemy, and hast given a sign to those that set their trust in Thee. Therefore in thanksgiving we cry aloud to Thee: Grant that with good courage and in peace we may all complete the time of the Fast.
ltx/en_uk_ware/tr.d053:trMA.Kathisma32.incipit	When the Ewe-Lamb saw the…
ltx/en_uk_ware/tr.d053:trMA.Kathisma32.melody	
ltx/en_uk_ware/tr.d053:trMA.Kathisma32.mode	@ltx/en_uk_ware/miscellanea:misc.Mode2
ltx/en_uk_ware/tr.d053:trMA.Kathisma32.text	When the Ewe-Lamb saw the innocent Shepherd hanging on the Wood, with a mother’s grief she cried aloud: ‘O my Son, Thou hast spread out a cloud for Thy people as they journeyed through the wilderness, but with ingratitude they have condemned Thee to death. Woe is me! I have no husband, and now I have no Child. But, arise, O Sun, and let Thy light shine forth; and I shall be glorified among the children of mortal men.’
ltx/en_uk_ware/tr.d053:trMA.Ode3C11.greekmelody	@ltx/en_uk_ware/he.h.m8:heHE.OuraniasApsidos.greekname
ltx/en_uk_ware/tr.d053:trMA.Ode3C11.incipit	Stretching out Thine hands upon…
ltx/en_uk_ware/tr.d053:trMA.Ode3C11.melody	@ltx/en_uk_ware/he.h.m8:heHE.OuraniasApsidos.name
ltx/en_uk_ware/tr.d053:trMA.Ode3C11.mode	@ltx/en_uk_ware/miscellanea:misc.Mode8
ltx/en_uk_ware/tr.d053:trMA.Ode3C11.ode	@ltx/en_uk_ware/miscellanea:misc.Ode3
ltx/en_uk_ware/tr.d053:trMA.Ode3C11.text	Stretching out Thine hands upon the Cross, O just Judge, Thou hast condemned the enmity that separated man from God; and now save me the prodigal condemned by my sins, for I have provoked Thee, O longsuffering Saviour.
ltx/en_uk_ware/tr.d053:trMA.Ode3C12.incipit	As the beasts I have…
ltx/en_uk_ware/tr.d053:trMA.Ode3C12.melody	@ltx/en_uk_ware/he.h.m8:heHE.OuraniasApsidos.name
ltx/en_uk_ware/tr.d053:trMA.Ode3C12.mode	@ltx/en_uk_ware/miscellanea:misc.Mode8
ltx/en_uk_ware/tr.d053:trMA.Ode3C12.ode	@ltx/en_uk_ware/miscellanea:misc.Ode3
ltx/en_uk_ware/tr.d053:trMA.Ode3C12.text	As the beasts I have desired a way of life that inflames the passions; I have departed far from Thy commandments, loving Saviour, and have become the servant of alien and unclean citizens. But now I turn back to Thee: accept me and save me.
ltx/en_uk_ware/tr.d053:trMA.Ode3C13.incipit	As once Thou hast opened…
ltx/en_uk_ware/tr.d053:trMA.Ode3C13.melody	@ltx/en_uk_ware/he.h.m8:heHE.OuraniasApsidos.name
ltx/en_uk_ware/tr.d053:trMA.Ode3C13.mode	@ltx/en_uk_ware/miscellanea:misc.Mode8
ltx/en_uk_ware/tr.d053:trMA.Ode3C13.ode	@ltx/en_uk_ware/miscellanea:misc.Ode3
ltx/en_uk_ware/tr.d053:trMA.Ode3C13.text	As once Thou hast opened the ears and loosed the tongue of the man with an impediment in his speech, open now the ears of my soul that is grown deaf in its understanding, and count it worthy to hear Thy saving word, O Jesus who alone lovest mankind.
ltx/en_uk_ware/tr.d053:trMA.Ode3C1T.incipit	All-holy Lady, Gate of salvation…
ltx/en_uk_ware/tr.d053:trMA.Ode3C1T.melody	@ltx/en_uk_ware/he.h.m8:heHE.OuraniasApsidos.name
ltx/en_uk_ware/tr.d053:trMA.Ode3C1T.mode	@ltx/en_uk_ware/miscellanea:misc.Mode8
ltx/en_uk_ware/tr.d053:trMA.Ode3C1T.ode	@ltx/en_uk_ware/miscellanea:misc.Ode3
ltx/en_uk_ware/tr.d053:trMA.Ode3C1T.text	All-holy Lady, Gate of salvation, Bridge to God, Protector of Christians, pilot me on my way, O Virgin, for I am beset by the troubles of this life and tossed to and fro.
ltx/en_uk_ware/tr.d053:trMA.Ode3C21.greekmelody	@ltx/en_uk_ware/he.h.m2:heHE.SteirothentaMouTonNoun.greekname
ltx/en_uk_ware/tr.d053:trMA.Ode3C21.incipit	In Thy tender love Thou…
ltx/en_uk_ware/tr.d053:trMA.Ode3C21.melody	@ltx/en_uk_ware/he.h.m2:heHE.SteirothentaMouTonNoun.name
ltx/en_uk_ware/tr.d053:trMA.Ode3C21.mode	@ltx/en_uk_ware/miscellanea:misc.Mode2
ltx/en_uk_ware/tr.d053:trMA.Ode3C21.ode	@ltx/en_uk_ware/miscellanea:misc.Ode3
ltx/en_uk_ware/tr.d053:trMA.Ode3C21.text	In Thy tender love Thou hast mounted on the Cross, O Christ, and drawn me up from the pit of the passions, raising me to heaven.
ltx/en_uk_ware/tr.d053:trMA.Ode3C22.incipit	Stretching out Thy hands upon…
ltx/en_uk_ware/tr.d053:trMA.Ode3C22.melody	@ltx/en_uk_ware/he.h.m2:heHE.SteirothentaMouTonNoun.name
ltx/en_uk_ware/tr.d053:trMA.Ode3C22.mode	@ltx/en_uk_ware/miscellanea:misc.Mode2
ltx/en_uk_ware/tr.d053:trMA.Ode3C22.ode	@ltx/en_uk_ware/miscellanea:misc.Ode3
ltx/en_uk_ware/tr.d053:trMA.Ode3C22.text	Stretching out Thy hands upon the Cross, O Christ, Thou hast embraced all the nations that were far from Thee, and hast brought them close to Thy dominion.
ltx/en_uk_ware/tr.d053:trMA.Ode3C2A1.incipit	For my sake, who have…
ltx/en_uk_ware/tr.d053:trMA.Ode3C2A1.melody	@ltx/en_uk_ware/he.h.m2:heHE.SteirothentaMouTonNoun.name
ltx/en_uk_ware/tr.d053:trMA.Ode3C2A1.mode	@ltx/en_uk_ware/miscellanea:misc.Mode2
ltx/en_uk_ware/tr.d053:trMA.Ode3C2A1.ode	@ltx/en_uk_ware/miscellanea:misc.Ode3
ltx/en_uk_ware/tr.d053:trMA.Ode3C2A1.text	For my sake, who have provoked Thee by my disobedience, Thou wast lifted up on the Cross, O Jesus, and Thy side was pierced and Thou hast tasted gall.
ltx/en_uk_ware/tr.d053:trMA.Ode3C2H.greekmelody	@ltx/en_uk_ware/he.h.m2:heHE.SteirothentaMouTonNoun.greekname
ltx/en_uk_ware/tr.d053:trMA.Ode3C2H.incipit	@ltx/en_uk_ware/he.h.m2:heHE.SteirothentaMouTonNoun.incipit
ltx/en_uk_ware/tr.d053:trMA.Ode3C2H.melody	@ltx/en_uk_ware/he.h.m2:heHE.SteirothentaMouTonNoun.melody
ltx/en_uk_ware/tr.d053:trMA.Ode3C2H.mode	@ltx/en_uk_ware/miscellanea:misc.Mode2
ltx/en_uk_ware/tr.d053:trMA.Ode3C2H.ode	@ltx/en_uk_ware/miscellanea:misc.Ode3
ltx/en_uk_ware/tr.d053:trMA.Ode3C2H.text	@ltx/en_uk_ware/he.h.m2:heHE.SteirothentaMouTonNoun.text
ltx/en_uk_ware/tr.d053:trMA.Ode3C2T.incipit	Who among those born on…
ltx/en_uk_ware/tr.d053:trMA.Ode3C2T.melody	@ltx/en_uk_ware/he.h.m2:heHE.SteirothentaMouTonNoun.name
ltx/en_uk_ware/tr.d053:trMA.Ode3C2T.mode	@ltx/en_uk_ware/miscellanea:misc.Mode2
ltx/en_uk_ware/tr.d053:trMA.Ode3C2T.ode	@ltx/en_uk_ware/miscellanea:misc.Ode3
ltx/en_uk_ware/tr.d053:trMA.Ode3C2T.text	Who among those born on earth can praise thee as is right, O Virgin Mother? For thou alone wast chosen among women, and art blessed by all.
ltx/en_uk_ware/tr.d053:trMA.Ode3C2Tr.incipit	Unity in three Persons, Trinity…
ltx/en_uk_ware/tr.d053:trMA.Ode3C2Tr.melody	@ltx/en_uk_ware/he.h.m2:heHE.SteirothentaMouTonNoun.name
ltx/en_uk_ware/tr.d053:trMA.Ode3C2Tr.mode	@ltx/en_uk_ware/miscellanea:misc.Mode2
ltx/en_uk_ware/tr.d053:trMA.Ode3C2Tr.ode	@ltx/en_uk_ware/miscellanea:misc.Ode3
ltx/en_uk_ware/tr.d053:trMA.Ode3C2Tr.text	Unity in three Persons, Trinity supreme in Essence, one Godhead, Father, Son and Spirit of righteousness, save those who honour Thee.
ltx/en_uk_ware/tr.d053:trMA.Ode8C11.greekmelody	@ltx/en_uk_ware/he.h.m8:heHE.EptaplasiosKaminon.greekname
ltx/en_uk_ware/tr.d053:trMA.Ode8C11.incipit	With Thine unsleeping eye look…
ltx/en_uk_ware/tr.d053:trMA.Ode8C11.melody	@ltx/en_uk_ware/he.h.m8:heHE.EptaplasiosKaminon.name
ltx/en_uk_ware/tr.d053:trMA.Ode8C11.mode	@ltx/en_uk_ware/miscellanea:misc.Mode8
ltx/en_uk_ware/tr.d053:trMA.Ode8C11.ode	@ltx/en_uk_ware/miscellanea:misc.Ode8
ltx/en_uk_ware/tr.d053:trMA.Ode8C11.text	With Thine unsleeping eye look upon me and take pity on me: for I am held fast by the drowsiness of sloth and lie upon the bed of the passions, a slave to the sleep of sensual pleasure. Thou hast bowed Thine head upon the Cross, O Christ, and of Thine own will Thou hast awaked from sleep; and Thou hast driven away the night of sin, for Thou art the Light of righteousness.
ltx/en_uk_ware/tr.d053:trMA.Ode8C12.incipit	I was adorned at Baptism…
ltx/en_uk_ware/tr.d053:trMA.Ode8C12.melody	@ltx/en_uk_ware/he.h.m8:heHE.EptaplasiosKaminon.name
ltx/en_uk_ware/tr.d053:trMA.Ode8C12.mode	@ltx/en_uk_ware/miscellanea:misc.Mode8
ltx/en_uk_ware/tr.d053:trMA.Ode8C12.ode	@ltx/en_uk_ware/miscellanea:misc.Ode8
ltx/en_uk_ware/tr.d053:trMA.Ode8C12.text	I was adorned at Baptism with Thy rich gifts of grace; but instead I have loved the poverty of evil, and in my misery I have become a stranger to the virtues. I have wandered into a far country of sin: but make me turn back, O Saviour, and embrace me, fencing me round with Thy Cross unto eternity.
ltx/en_uk_ware/tr.d053:trMA.Ode8C13.incipit	Cast aside, my soul, the…
ltx/en_uk_ware/tr.d053:trMA.Ode8C13.melody	@ltx/en_uk_ware/he.h.m8:heHE.EptaplasiosKaminon.name
ltx/en_uk_ware/tr.d053:trMA.Ode8C13.mode	@ltx/en_uk_ware/miscellanea:misc.Mode8
ltx/en_uk_ware/tr.d053:trMA.Ode8C13.ode	@ltx/en_uk_ware/miscellanea:misc.Ode8
ltx/en_uk_ware/tr.d053:trMA.Ode8C13.text	Cast aside, my soul, the drunkenness of the passions, and by fasting seek the cleansing wine of tears that makes glad the heart of man, withering lust and putting out the furnace of the flesh. Make haste to be crucified with Christ, who for thy sake was nailed upon the Wood, and to live with Him unto eternity.
ltx/en_uk_ware/tr.d053:trMA.Ode8C1T.incipit	Most pure Mother of God…
ltx/en_uk_ware/tr.d053:trMA.Ode8C1T.melody	@ltx/en_uk_ware/he.h.m8:heHE.EptaplasiosKaminon.name
ltx/en_uk_ware/tr.d053:trMA.Ode8C1T.mode	@ltx/en_uk_ware/miscellanea:misc.Mode8
ltx/en_uk_ware/tr.d053:trMA.Ode8C1T.ode	@ltx/en_uk_ware/miscellanea:misc.Ode8
ltx/en_uk_ware/tr.d053:trMA.Ode8C1T.text	Most pure Mother of God, cleanse the wounds of my soul and the scars of my sins, bathing them in the fountain that flows from thy Son’s side. To thee I cry, O full of grace, to thee I flee for refuge, and I call upon thee.
ltx/en_uk_ware/tr.d053:trMA.Ode8C21.greekmelody	@ltx/en_uk_ware/he.h.m2:heHE.TonEnFonaisAngelikais.greekname
ltx/en_uk_ware/tr.d053:trMA.Ode8C21.incipit	The angels and we men…
ltx/en_uk_ware/tr.d053:trMA.Ode8C21.melody	@ltx/en_uk_ware/he.h.m2:heHE.TonEnFonaisAngelikais.name
ltx/en_uk_ware/tr.d053:trMA.Ode8C21.mode	@ltx/en_uk_ware/miscellanea:misc.Mode2
ltx/en_uk_ware/tr.d053:trMA.Ode8C21.ode	@ltx/en_uk_ware/miscellanea:misc.Ode8
ltx/en_uk_ware/tr.d053:trMA.Ode8C21.text	The angels and we men born on earth sing for ever the praises of Jesus, who was crucified in the flesh, yet did not suffer in His divine nature.
ltx/en_uk_ware/tr.d053:trMA.Ode8C22.incipit	At Thy Crucifixion, O Christ…
ltx/en_uk_ware/tr.d053:trMA.Ode8C22.melody	@ltx/en_uk_ware/he.h.m2:heHE.TonEnFonaisAngelikais.name
ltx/en_uk_ware/tr.d053:trMA.Ode8C22.mode	@ltx/en_uk_ware/miscellanea:misc.Mode2
ltx/en_uk_ware/tr.d053:trMA.Ode8C22.ode	@ltx/en_uk_ware/miscellanea:misc.Ode8
ltx/en_uk_ware/tr.d053:trMA.Ode8C22.text	At Thy Crucifixion, O Christ, choosing an accursed and shameful death, Thou hast delivered us from corruption and saved us.
ltx/en_uk_ware/tr.d053:trMA.Ode8C2A1.incipit	Solely for the sake of…
ltx/en_uk_ware/tr.d053:trMA.Ode8C2A1.melody	@ltx/en_uk_ware/he.h.m2:heHE.TonEnFonaisAngelikais.name
ltx/en_uk_ware/tr.d053:trMA.Ode8C2A1.mode	@ltx/en_uk_ware/miscellanea:misc.Mode2
ltx/en_uk_ware/tr.d053:trMA.Ode8C2A1.ode	@ltx/en_uk_ware/miscellanea:misc.Ode8
ltx/en_uk_ware/tr.d053:trMA.Ode8C2A1.text	Solely for the sake of my salvation, O Christ, Thou hast consented to suffer all things. I sing the praises of Thy Crucifixion, nails and death unto all eternity.
ltx/en_uk_ware/tr.d053:trMA.Ode8C2H.greekmelody	@ltx/en_uk_ware/he.h.m2:heHE.TonEnFonaisAngelikais.greekname
ltx/en_uk_ware/tr.d053:trMA.Ode8C2H.incipit	@ltx/en_uk_ware/he.h.m2:heHE.TonEnFonaisAngelikais.incipit
ltx/en_uk_ware/tr.d053:trMA.Ode8C2H.melody	@ltx/en_uk_ware/he.h.m2:heHE.TonEnFonaisAngelikais.melody
ltx/en_uk_ware/tr.d053:trMA.Ode8C2H.mode	@ltx/en_uk_ware/miscellanea:misc.Mode2
ltx/en_uk_ware/tr.d053:trMA.Ode8C2H.ode	@ltx/en_uk_ware/miscellanea:misc.Ode8
ltx/en_uk_ware/tr.d053:trMA.Ode8C2H.text	@ltx/en_uk_ware/he.h.m2:heHE.TonEnFonaisAngelikais.text
ltx/en_uk_ware/tr.d053:trMA.Ode8C2T.incipit	In songs of praise, pure…
ltx/en_uk_ware/tr.d053:trMA.Ode8C2T.melody	@ltx/en_uk_ware/he.h.m2:heHE.TonEnFonaisAngelikais.name
ltx/en_uk_ware/tr.d053:trMA.Ode8C2T.mode	@ltx/en_uk_ware/miscellanea:misc.Mode2
ltx/en_uk_ware/tr.d053:trMA.Ode8C2T.ode	@ltx/en_uk_ware/miscellanea:misc.Ode8
ltx/en_uk_ware/tr.d053:trMA.Ode8C2T.text	In songs of praise, pure Virgin, all generations honour thee with gladness, for thou hast borne the Maker. O dread wonder and all-blessed work!
ltx/en_uk_ware/tr.d053:trMA.Ode8C2Tr.incipit	With the chembim, O Trinity…
ltx/en_uk_ware/tr.d053:trMA.Ode8C2Tr.melody	@ltx/en_uk_ware/he.h.m2:heHE.TonEnFonaisAngelikais.name
ltx/en_uk_ware/tr.d053:trMA.Ode8C2Tr.mode	@ltx/en_uk_ware/miscellanea:misc.Mode2
ltx/en_uk_ware/tr.d053:trMA.Ode8C2Tr.ode	@ltx/en_uk_ware/miscellanea:misc.Ode8
ltx/en_uk_ware/tr.d053:trMA.Ode8C2Tr.text	With the chembim, O Trinity, I praise Thee, singing: Holy, Holy, Holy, one Godhead, simple, without beginning, beyond the understanding of all.
ltx/en_uk_ware/tr.d053:trMA.Ode9C11.greekmelody	@ltx/en_uk_ware/he.h.m8:heHE.ExestiEpiTouto.greekname
ltx/en_uk_ware/tr.d053:trMA.Ode9C11.incipit	Seeing Thee nailed upon the…
ltx/en_uk_ware/tr.d053:trMA.Ode9C11.melody	@ltx/en_uk_ware/he.h.m8:heHE.ExestiEpiTouto.name
ltx/en_uk_ware/tr.d053:trMA.Ode9C11.mode	@ltx/en_uk_ware/miscellanea:misc.Mode8
ltx/en_uk_ware/tr.d053:trMA.Ode9C11.ode	@ltx/en_uk_ware/miscellanea:misc.Ode9
ltx/en_uk_ware/tr.d053:trMA.Ode9C11.text	Seeing Thee nailed upon the Cross, O King of all, the sun hid its rays; and the whole earth was seized with trembling, looking on Thee suffering of Thine own will, though Thou art by nature impassible. And so I pray to Thee, O Christ the physician: Heal the passions of my soul.
ltx/en_uk_ware/tr.d053:trMA.Ode9C12.incipit	Forsaking the ways of salvation…
ltx/en_uk_ware/tr.d053:trMA.Ode9C12.melody	@ltx/en_uk_ware/he.h.m8:heHE.ExestiEpiTouto.name
ltx/en_uk_ware/tr.d053:trMA.Ode9C12.mode	@ltx/en_uk_ware/miscellanea:misc.Mode8
ltx/en_uk_ware/tr.d053:trMA.Ode9C12.ode	@ltx/en_uk_ware/miscellanea:misc.Ode9
ltx/en_uk_ware/tr.d053:trMA.Ode9C12.text	Forsaking the ways of salvation, I have gone along the path that leads to hell; round me is the deep darkness of lust, the slippery places of the passions, and the tempest of temptation. Therefore I entreat Thee: Save me by Thy Cross, O Christ, for Thou alone art rich in mercy.
ltx/en_uk_ware/tr.d053:trMA.Ode9C13.incipit	Beset by the storm of…
ltx/en_uk_ware/tr.d053:trMA.Ode9C13.melody	@ltx/en_uk_ware/he.h.m8:heHE.ExestiEpiTouto.name
ltx/en_uk_ware/tr.d053:trMA.Ode9C13.mode	@ltx/en_uk_ware/miscellanea:misc.Mode8
ltx/en_uk_ware/tr.d053:trMA.Ode9C13.ode	@ltx/en_uk_ware/miscellanea:misc.Ode9
ltx/en_uk_ware/tr.d053:trMA.Ode9C13.text	Beset by the storm of temptations, drowning in the waves of passion, and assailed by the tempest of lust, I have now reached the sea of the Fast that is mild and calm. Pilot me across it by Thy Cross, O compassionate Lord, and bring me to the harbour of salvation.
ltx/en_uk_ware/tr.d053:trMA.Ode9C1T.incipit	Without seed, O Virgin, and…
ltx/en_uk_ware/tr.d053:trMA.Ode9C1T.melody	@ltx/en_uk_ware/he.h.m8:heHE.ExestiEpiTouto.name
ltx/en_uk_ware/tr.d053:trMA.Ode9C1T.mode	@ltx/en_uk_ware/miscellanea:misc.Mode8
ltx/en_uk_ware/tr.d053:trMA.Ode9C1T.ode	@ltx/en_uk_ware/miscellanea:misc.Ode9
ltx/en_uk_ware/tr.d053:trMA.Ode9C1T.text	Without seed, O Virgin, and without the desires of the flesh thou hast conceived the Word of God who created all things; and without corruption and the pangs of travail thou hast given birth to Him. Therefore with both tongue and heart we confess thee to be Theotokos and we magnify thee.
ltx/en_uk_ware/tr.d053:trMA.Ode9C21.greekmelody	@ltx/en_uk_ware/he.h.m2:heHE.TinParthenianSou.greekname
ltx/en_uk_ware/tr.d053:trMA.Ode9C21.incipit	Of Thine own will, O…
ltx/en_uk_ware/tr.d053:trMA.Ode9C21.melody	@ltx/en_uk_ware/he.h.m2:heHE.TinParthenianSou.name
ltx/en_uk_ware/tr.d053:trMA.Ode9C21.mode	@ltx/en_uk_ware/miscellanea:misc.Mode2
ltx/en_uk_ware/tr.d053:trMA.Ode9C21.ode	@ltx/en_uk_ware/miscellanea:misc.Ode9
ltx/en_uk_ware/tr.d053:trMA.Ode9C21.text	Of Thine own will, O our Saviour, Thou hast endured Crucifixion, to deliver us all from death and to give us life.
ltx/en_uk_ware/tr.d053:trMA.Ode9C22.incipit	By a tree was I…
ltx/en_uk_ware/tr.d053:trMA.Ode9C22.melody	@ltx/en_uk_ware/he.h.m2:heHE.TinParthenianSou.name
ltx/en_uk_ware/tr.d053:trMA.Ode9C22.mode	@ltx/en_uk_ware/miscellanea:misc.Mode2
ltx/en_uk_ware/tr.d053:trMA.Ode9C22.ode	@ltx/en_uk_ware/miscellanea:misc.Ode9
ltx/en_uk_ware/tr.d053:trMA.Ode9C22.text	By a tree was I killed, and by the Tree of the Cross have I returned to life: for my Christ was nailed upon it and has slain the enemy.
ltx/en_uk_ware/tr.d053:trMA.Ode9C2A1.incipit	I sing of Thy lance…
ltx/en_uk_ware/tr.d053:trMA.Ode9C2A1.melody	@ltx/en_uk_ware/he.h.m2:heHE.TinParthenianSou.name
ltx/en_uk_ware/tr.d053:trMA.Ode9C2A1.mode	@ltx/en_uk_ware/miscellanea:misc.Mode2
ltx/en_uk_ware/tr.d053:trMA.Ode9C2A1.ode	@ltx/en_uk_ware/miscellanea:misc.Ode9
ltx/en_uk_ware/tr.d053:trMA.Ode9C2A1.text	I sing of Thy lance, I praise Thy nails, the sponge, the reed and the Cross: for through them I have been saved, O Jesus my God.
ltx/en_uk_ware/tr.d053:trMA.Ode9C2H.greekmelody	@ltx/en_uk_ware/he.h.m2:heHE.TinParthenianSou.greekname
ltx/en_uk_ware/tr.d053:trMA.Ode9C2H.incipit	@ltx/en_uk_ware/he.h.m2:heHE.TinParthenianSou.incipit
ltx/en_uk_ware/tr.d053:trMA.Ode9C2H.melody	@ltx/en_uk_ware/he.h.m2:heHE.TinParthenianSou.melody
ltx/en_uk_ware/tr.d053:trMA.Ode9C2H.mode	@ltx/en_uk_ware/miscellanea:misc.Mode2
ltx/en_uk_ware/tr.d053:trMA.Ode9C2H.ode	@ltx/en_uk_ware/miscellanea:misc.Ode9
ltx/en_uk_ware/tr.d053:trMA.Ode9C2H.text	@ltx/en_uk_ware/he.h.m2:heHE.TinParthenianSou.text
ltx/en_uk_ware/tr.d053:trMA.Ode9C2T.incipit	O marvellous wonder!O strange tidings!…
ltx/en_uk_ware/tr.d053:trMA.Ode9C2T.melody	@ltx/en_uk_ware/he.h.m2:heHE.TinParthenianSou.name
ltx/en_uk_ware/tr.d053:trMA.Ode9C2T.mode	@ltx/en_uk_ware/miscellanea:misc.Mode2
ltx/en_uk_ware/tr.d053:trMA.Ode9C2T.ode	@ltx/en_uk_ware/miscellanea:misc.Ode9
ltx/en_uk_ware/tr.d053:trMA.Ode9C2T.text	O marvellous wonder!O strange tidings! How dost thou give birth as a mother, O pure Lady, while still remaining inviolate as a virgin?
ltx/en_uk_ware/tr.d053:trMA.Ode9C2Tr.incipit	Let us with one mind…
ltx/en_uk_ware/tr.d053:trMA.Ode9C2Tr.melody	@ltx/en_uk_ware/he.h.m2:heHE.TinParthenianSou.name
ltx/en_uk_ware/tr.d053:trMA.Ode9C2Tr.mode	@ltx/en_uk_ware/miscellanea:misc.Mode2
ltx/en_uk_ware/tr.d053:trMA.Ode9C2Tr.ode	@ltx/en_uk_ware/miscellanea:misc.Ode9
ltx/en_uk_ware/tr.d053:trMA.Ode9C2Tr.text	Let us with one mind worship the Son who coexists with the Father, and the Holy Spirit who is ever present with them.
ltx/en_uk_ware/tr.d053:trTE.Troparion.incipit	Accept, O Lord, as prayers…
ltx/en_uk_ware/tr.d053:trTE.Troparion.melody	
ltx/en_uk_ware/tr.d053:trTE.Troparion.mode	@ltx/en_uk_ware/miscellanea:misc.Mode1
ltx/en_uk_ware/tr.d053:trTE.Troparion.text	Accept, O Lord, as prayers of intercession, the sufferings of the saints which they endured for Thy sake: and, we pray Thee, heal all our anguish in Thy love for mankind.
ltx/en_uk_ware/tr.d053:trTE.Troparion2.incipit	…
ltx/en_uk_ware/tr.d053:trTE.Troparion2.text	
ltx/en_uk_ware/tr.d053:trVE.AposIdiomelon1.incipit	Banished from Thy straight path…
ltx/en_uk_ware/tr.d053:trVE.AposIdiomelon1.melody	@ltx/en_uk_ware/miscellanea:misc.Idiomelon
ltx/en_uk_ware/tr.d053:trVE.AposIdiomelon1.mode	@ltx/en_uk_ware/miscellanea:misc.Mode5
ltx/en_uk_ware/tr.d053:trVE.AposIdiomelon1.text	Banished from Thy straight path through the passions, in my wretchedness I have fallen headlong down into the pit. The Levite and the Priest, passing by together, turned from me with disdain; but Thou, O Christ, hast taken pity on me. Tearing up the record of my sins with the weapon of the Cross, Thou hast freed me from the passions and glorified me, enthroning me beside the Father. And so I cry aloud: O Lord beyond my understanding, glory to Thee.
ltx/en_uk_ware/tr.d053:trVE.AposIdiomelon2.incipit	I went down from Jerusalem…
ltx/en_uk_ware/tr.d053:trVE.AposIdiomelon2.melody	@ltx/en_uk_ware/miscellanea:misc.Idiomelon
ltx/en_uk_ware/tr.d053:trVE.AposIdiomelon2.mode	@ltx/en_uk_ware/miscellanea:misc.Mode8
ltx/en_uk_ware/tr.d053:trVE.AposIdiomelon2.text	I went down from Jerusalem, slipping away from the commandments which Thou hast written there for all the nations; and I journeyed to Jericho, yielding to my lusts like the dwellers there of old, whom Thou gavest to be slaughtered by Thy people because of their sins. Through my disobedience I fell into soul-destroying passions as though into the hands of thieves; beating me, they left me almost dead. O Lord, who for the sins of men willingly wast wounded in Thy body by the nails and the spear, who hast brought to pass the salvation of us all through the Cross in Jerusalem, heal me and save me.
ltx/en_uk_ware/tr.d053:trVE.AposMartyric.incipit	The martyrs, O Lord, forgetting…
ltx/en_uk_ware/tr.d053:trVE.AposMartyric.melody	
ltx/en_uk_ware/tr.d053:trVE.AposMartyric.mode	@ltx/en_uk_ware/miscellanea:misc.Mode8
ltx/en_uk_ware/tr.d053:trVE.AposMartyric.text	The martyrs, O Lord, forgetting the things of the present life, and despising torture in their longing for the life to come, were granted this eternal life as their inheritance, and now they rejoice with the angels. At their supplications bestow upon Thy people Thy great mercy.
ltx/en_uk_ware/tr.d053:trVE.AposTheotokion.greekmelody	@ltx/en_uk_ware/he.a.m8:heAU.KyrieEiKaiKritirio.greekname
ltx/en_uk_ware/tr.d053:trVE.AposTheotokion.incipit	O Lord, the Sun of…
ltx/en_uk_ware/tr.d053:trVE.AposTheotokion.melody	@ltx/en_uk_ware/he.a.m8:heAU.KyrieEiKaiKritirio.name
ltx/en_uk_ware/tr.d053:trVE.AposTheotokion.mode	@ltx/en_uk_ware/miscellanea:misc.Mode8
ltx/en_uk_ware/tr.d053:trVE.AposTheotokion.text	O Lord, the Sun of righteousness, when the sun beheld Thee hanging on the Wood, it hid its rays, and the light of the moon was changed to darkness; and Thine all-blameless Mother was pierced to the very heart.
ltx/en_uk_ware/tr.d053:trVE.Stichera01.greekmelody	@ltx/en_uk_ware/he.a.m8:heAU.TiYmasKalesomen.greekname
ltx/en_uk_ware/tr.d053:trVE.Stichera01.incipit	 O ye faithful, taking…
ltx/en_uk_ware/tr.d053:trVE.Stichera01.melody	@ltx/en_uk_ware/he.a.m8:heAU.TiYmasKalesomen.name
ltx/en_uk_ware/tr.d053:trVE.Stichera01.mode	@ltx/en_uk_ware/miscellanea:misc.Mode8
ltx/en_uk_ware/tr.d053:trVE.Stichera01.text	 O ye faithful, taking love as our food, through abstinence let us gain control over our passions; and let us strive to live a life acceptable to God, who for our sakes was raised upon the Cross, and His side was pierced by a spear. So shall we enjoy eternal blessedness, and glorify the Saviour of our souls.
ltx/en_uk_ware/tr.d053:trVE.Stichera02.greekmelody	@ltx/en_uk_ware/he.a.m8:heAU.TiYmasKalesomen.greekname
ltx/en_uk_ware/tr.d053:trVE.Stichera02.incipit	Through a tree we once…
ltx/en_uk_ware/tr.d053:trVE.Stichera02.melody	@ltx/en_uk_ware/he.a.m8:heAU.TiYmasKalesomen.name
ltx/en_uk_ware/tr.d053:trVE.Stichera02.mode	@ltx/en_uk_ware/miscellanea:misc.Mode8
ltx/en_uk_ware/tr.d053:trVE.Stichera02.text	Through a tree we once found death, but now we find life again through the Tree of the Cross. Let us then put to death the impulses of the passions; and with all the faithful let us pray to the Benefactor of all: that, shining with the radiance of divine actions and made beautiful by the virtues, we may attain the holy Resurrection and glorify the Saviour of our souls.
ltx/en_uk_ware/tr.d053:trVE.Stichera03.incipit	We praise Thy lifegiving Cross…
ltx/en_uk_ware/tr.d053:trVE.Stichera03.melody	
ltx/en_uk_ware/tr.d053:trVE.Stichera03.mode	@ltx/en_uk_ware/miscellanea:misc.Mode2
ltx/en_uk_ware/tr.d053:trVE.Stichera03.text	We praise Thy lifegiving Cross, O Lord, and the holy sufferings of Thy flesh for our sake: the spear, the death, the derision and the spitting, blows and buffetings, the purple robe and crown of thorns, by which Thou hast redeemed us all and saved us from the curse. Therefore we entreat Thee: Grant us to complete in peace the time of the Fast.
