ltx/en_uk_ware/he.h.m4:heHE.AfYpsousKatilthes.greekname	
ltx/en_uk_ware/he.h.m4:heHE.AfYpsousKatilthes.incipit	…
ltx/en_uk_ware/he.h.m4:heHE.AfYpsousKatilthes.melody	@ltx/en_uk_ware/miscellanea:misc.HeirmosNotMetered
ltx/en_uk_ware/he.h.m4:heHE.AfYpsousKatilthes.mode	@ltx/en_uk_ware/miscellanea:misc.Mode4
ltx/en_uk_ware/he.h.m4:heHE.AfYpsousKatilthes.name	(NM)
ltx/en_uk_ware/he.h.m4:heHE.AfYpsousKatilthes.ode	@ltx/en_uk_ware/miscellanea:misc.Ode3
ltx/en_uk_ware/he.h.m4:heHE.AfYpsousKatilthes.text	
ltx/en_uk_ware/he.h.m4:heHE.AkikoenOProfitis.greekname	
ltx/en_uk_ware/he.h.m4:heHE.AkikoenOProfitis.incipit	The prophet heard of Thy coming…
ltx/en_uk_ware/he.h.m4:heHE.AkikoenOProfitis.melody	@ltx/en_uk_ware/miscellanea:misc.HeirmosNotMetered
ltx/en_uk_ware/he.h.m4:heHE.AkikoenOProfitis.mode	@ltx/en_uk_ware/miscellanea:misc.Mode4
ltx/en_uk_ware/he.h.m4:heHE.AkikoenOProfitis.name	(NM) The prophet heard of Thy coming.
ltx/en_uk_ware/he.h.m4:heHE.AkikoenOProfitis.ode	@ltx/en_uk_ware/miscellanea:misc.Ode4
ltx/en_uk_ware/he.h.m4:heHE.AkikoenOProfitis.text	
ltx/en_uk_ware/he.h.m4:heHE.AkoueKori.greekname	
ltx/en_uk_ware/he.h.m4:heHE.AkoueKori.incipit	…
ltx/en_uk_ware/he.h.m4:heHE.AkoueKori.melody	@ltx/en_uk_ware/miscellanea:misc.HeirmosNotMetered
ltx/en_uk_ware/he.h.m4:heHE.AkoueKori.mode	@ltx/en_uk_ware/miscellanea:misc.Mode4
ltx/en_uk_ware/he.h.m4:heHE.AkoueKori.name	(NM)
ltx/en_uk_ware/he.h.m4:heHE.AkoueKori.ode	@ltx/en_uk_ware/miscellanea:misc.Ode8
ltx/en_uk_ware/he.h.m4:heHE.AkoueKori.text	
ltx/en_uk_ware/he.h.m4:heHE.AnateilonMoiKyrie.greekname	
ltx/en_uk_ware/he.h.m4:heHE.AnateilonMoiKyrie.incipit	…
ltx/en_uk_ware/he.h.m4:heHE.AnateilonMoiKyrie.melody	@ltx/en_uk_ware/miscellanea:misc.HeirmosNotMetered
ltx/en_uk_ware/he.h.m4:heHE.AnateilonMoiKyrie.mode	@ltx/en_uk_ware/miscellanea:misc.Mode4
ltx/en_uk_ware/he.h.m4:heHE.AnateilonMoiKyrie.name	(NM)
ltx/en_uk_ware/he.h.m4:heHE.AnateilonMoiKyrie.ode	@ltx/en_uk_ware/miscellanea:misc.Ode5
ltx/en_uk_ware/he.h.m4:heHE.AnateilonMoiKyrie.text	
ltx/en_uk_ware/he.h.m4:heHE.AnaxAnakton.greekname	
ltx/en_uk_ware/he.h.m4:heHE.AnaxAnakton.incipit	…
ltx/en_uk_ware/he.h.m4:heHE.AnaxAnakton.melody	@ltx/en_uk_ware/miscellanea:misc.HeirmosNotMetered
ltx/en_uk_ware/he.h.m4:heHE.AnaxAnakton.mode	@ltx/en_uk_ware/miscellanea:misc.Mode4
ltx/en_uk_ware/he.h.m4:heHE.AnaxAnakton.name	(NM)
ltx/en_uk_ware/he.h.m4:heHE.AnaxAnakton.ode	@ltx/en_uk_ware/miscellanea:misc.Ode4
ltx/en_uk_ware/he.h.m4:heHE.AnaxAnakton.text	
ltx/en_uk_ware/he.h.m4:heHE.AnaxAnakton1.text	
ltx/en_uk_ware/he.h.m4:heHE.AnaxAnakton2.text	
ltx/en_uk_ware/he.h.m4:heHE.AnaxAnakton3.text	
ltx/en_uk_ware/he.h.m4:heHE.AnaxAnakton4.text	
ltx/en_uk_ware/he.h.m4:heHE.AnaxAnakton5.text	
ltx/en_uk_ware/he.h.m4:heHE.AnoixoToStomaMou.greekname	
ltx/en_uk_ware/he.h.m4:heHE.AnoixoToStomaMou.incipit	…
ltx/en_uk_ware/he.h.m4:heHE.AnoixoToStomaMou.melody	@ltx/en_uk_ware/miscellanea:misc.HeirmosNotMetered
ltx/en_uk_ware/he.h.m4:heHE.AnoixoToStomaMou.mode	@ltx/en_uk_ware/miscellanea:misc.Mode4
ltx/en_uk_ware/he.h.m4:heHE.AnoixoToStomaMou.name	(NM)
ltx/en_uk_ware/he.h.m4:heHE.AnoixoToStomaMou.ode	@ltx/en_uk_ware/miscellanea:misc.Ode1
ltx/en_uk_ware/he.h.m4:heHE.AnoixoToStomaMou.text	
ltx/en_uk_ware/he.h.m4:heHE.AnoixoToStomaMouEisodia.greekname	
ltx/en_uk_ware/he.h.m4:heHE.AnoixoToStomaMouEisodia.incipit	…
ltx/en_uk_ware/he.h.m4:heHE.AnoixoToStomaMouEisodia.melody	@ltx/en_uk_ware/miscellanea:misc.HeirmosNotMetered
ltx/en_uk_ware/he.h.m4:heHE.AnoixoToStomaMouEisodia.mode	@ltx/en_uk_ware/miscellanea:misc.Mode4
ltx/en_uk_ware/he.h.m4:heHE.AnoixoToStomaMouEisodia.name	(NM)
ltx/en_uk_ware/he.h.m4:heHE.AnoixoToStomaMouEisodia.ode	@ltx/en_uk_ware/miscellanea:misc.Ode1
ltx/en_uk_ware/he.h.m4:heHE.AnoixoToStomaMouEisodia.text	
ltx/en_uk_ware/he.h.m4:heHE.AnoixoToStomaMouKoimisis.greekname	
ltx/en_uk_ware/he.h.m4:heHE.AnoixoToStomaMouKoimisis.incipit	…
ltx/en_uk_ware/he.h.m4:heHE.AnoixoToStomaMouKoimisis.melody	@ltx/en_uk_ware/miscellanea:misc.HeirmosNotMetered
ltx/en_uk_ware/he.h.m4:heHE.AnoixoToStomaMouKoimisis.mode	@ltx/en_uk_ware/miscellanea:misc.Mode4
ltx/en_uk_ware/he.h.m4:heHE.AnoixoToStomaMouKoimisis.name	(NM)
ltx/en_uk_ware/he.h.m4:heHE.AnoixoToStomaMouKoimisis.ode	@ltx/en_uk_ware/miscellanea:misc.Ode1
ltx/en_uk_ware/he.h.m4:heHE.AnoixoToStomaMouKoimisis.text	
ltx/en_uk_ware/he.h.m4:heHE.AnoixoToStomaMouSyllipsis.greekname	
ltx/en_uk_ware/he.h.m4:heHE.AnoixoToStomaMouSyllipsis.incipit	…
ltx/en_uk_ware/he.h.m4:heHE.AnoixoToStomaMouSyllipsis.melody	@ltx/en_uk_ware/miscellanea:misc.HeirmosNotMetered
ltx/en_uk_ware/he.h.m4:heHE.AnoixoToStomaMouSyllipsis.mode	@ltx/en_uk_ware/miscellanea:misc.Mode4
ltx/en_uk_ware/he.h.m4:heHE.AnoixoToStomaMouSyllipsis.name	(NM)
ltx/en_uk_ware/he.h.m4:heHE.AnoixoToStomaMouSyllipsis.ode	@ltx/en_uk_ware/miscellanea:misc.Ode1
ltx/en_uk_ware/he.h.m4:heHE.AnoixoToStomaMouSyllipsis.text	
ltx/en_uk_ware/he.h.m4:heHE.AnoixoToStomaMou_Eisodia.greekname	@ltx/en_uk_ware/properties:deprecated.key
ltx/en_uk_ware/he.h.m4:heHE.AnoixoToStomaMou_Eisodia.incipit	@ltx/en_uk_ware/properties:deprecated.key
ltx/en_uk_ware/he.h.m4:heHE.AnoixoToStomaMou_Eisodia.melody	@ltx/en_uk_ware/properties:deprecated.key
ltx/en_uk_ware/he.h.m4:heHE.AnoixoToStomaMou_Eisodia.mode	@ltx/en_uk_ware/properties:deprecated.key
ltx/en_uk_ware/he.h.m4:heHE.AnoixoToStomaMou_Eisodia.name	@ltx/en_uk_ware/properties:deprecated.key
ltx/en_uk_ware/he.h.m4:heHE.AnoixoToStomaMou_Eisodia.ode	@ltx/en_uk_ware/properties:deprecated.key
ltx/en_uk_ware/he.h.m4:heHE.AnoixoToStomaMou_Eisodia.text	@ltx/en_uk_ware/properties:deprecated.key
ltx/en_uk_ware/he.h.m4:heHE.AnoixoToStomaMou_Koimisis.greekname	@ltx/en_uk_ware/properties:deprecated.key
ltx/en_uk_ware/he.h.m4:heHE.AnoixoToStomaMou_Koimisis.incipit	@ltx/en_uk_ware/properties:deprecated.key
ltx/en_uk_ware/he.h.m4:heHE.AnoixoToStomaMou_Koimisis.melody	@ltx/en_uk_ware/properties:deprecated.key
ltx/en_uk_ware/he.h.m4:heHE.AnoixoToStomaMou_Koimisis.mode	@ltx/en_uk_ware/properties:deprecated.key
ltx/en_uk_ware/he.h.m4:heHE.AnoixoToStomaMou_Koimisis.name	@ltx/en_uk_ware/properties:deprecated.key
ltx/en_uk_ware/he.h.m4:heHE.AnoixoToStomaMou_Koimisis.ode	@ltx/en_uk_ware/properties:deprecated.key
ltx/en_uk_ware/he.h.m4:heHE.AnoixoToStomaMou_Koimisis.text	@ltx/en_uk_ware/properties:deprecated.key
ltx/en_uk_ware/he.h.m4:heHE.AnoixoToStomaMou_Syllipsis.greekname	@ltx/en_uk_ware/properties:deprecated.key
ltx/en_uk_ware/he.h.m4:heHE.AnoixoToStomaMou_Syllipsis.incipit	@ltx/en_uk_ware/properties:deprecated.key
ltx/en_uk_ware/he.h.m4:heHE.AnoixoToStomaMou_Syllipsis.melody	@ltx/en_uk_ware/properties:deprecated.key
ltx/en_uk_ware/he.h.m4:heHE.AnoixoToStomaMou_Syllipsis.mode	@ltx/en_uk_ware/properties:deprecated.key
ltx/en_uk_ware/he.h.m4:heHE.AnoixoToStomaMou_Syllipsis.name	@ltx/en_uk_ware/properties:deprecated.key
ltx/en_uk_ware/he.h.m4:heHE.AnoixoToStomaMou_Syllipsis.ode	@ltx/en_uk_ware/properties:deprecated.key
ltx/en_uk_ware/he.h.m4:heHE.AnoixoToStomaMou_Syllipsis.text	@ltx/en_uk_ware/properties:deprecated.key
ltx/en_uk_ware/he.h.m4:heHE.ApasGigenis.greekname	
ltx/en_uk_ware/he.h.m4:heHE.ApasGigenis.incipit	…
ltx/en_uk_ware/he.h.m4:heHE.ApasGigenis.melody	@ltx/en_uk_ware/miscellanea:misc.HeirmosNotMetered
ltx/en_uk_ware/he.h.m4:heHE.ApasGigenis.mode	@ltx/en_uk_ware/miscellanea:misc.Mode4
ltx/en_uk_ware/he.h.m4:heHE.ApasGigenis.name	(NM)
ltx/en_uk_ware/he.h.m4:heHE.ApasGigenis.ode	@ltx/en_uk_ware/miscellanea:misc.Ode9
ltx/en_uk_ware/he.h.m4:heHE.ApasGigenis.text	
ltx/en_uk_ware/he.h.m4:heHE.ApasGigenisAkathist.greekname	
ltx/en_uk_ware/he.h.m4:heHE.ApasGigenisAkathist.incipit	…
ltx/en_uk_ware/he.h.m4:heHE.ApasGigenisAkathist.melody	@ltx/en_uk_ware/miscellanea:misc.HeirmosNotMetered
ltx/en_uk_ware/he.h.m4:heHE.ApasGigenisAkathist.mode	@ltx/en_uk_ware/miscellanea:misc.Mode4
ltx/en_uk_ware/he.h.m4:heHE.ApasGigenisAkathist.name	(NM)
ltx/en_uk_ware/he.h.m4:heHE.ApasGigenisAkathist.ode	@ltx/en_uk_ware/miscellanea:misc.Ode9
ltx/en_uk_ware/he.h.m4:heHE.ApasGigenisAkathist.text	
ltx/en_uk_ware/he.h.m4:heHE.ApasGigenisEisodia.greekname	
ltx/en_uk_ware/he.h.m4:heHE.ApasGigenisEisodia.incipit	…
ltx/en_uk_ware/he.h.m4:heHE.ApasGigenisEisodia.melody	@ltx/en_uk_ware/miscellanea:misc.HeirmosNotMetered
ltx/en_uk_ware/he.h.m4:heHE.ApasGigenisEisodia.mode	@ltx/en_uk_ware/miscellanea:misc.Mode4
ltx/en_uk_ware/he.h.m4:heHE.ApasGigenisEisodia.name	(NM)
ltx/en_uk_ware/he.h.m4:heHE.ApasGigenisEisodia.ode	@ltx/en_uk_ware/miscellanea:misc.Ode9
ltx/en_uk_ware/he.h.m4:heHE.ApasGigenisEisodia.text	
ltx/en_uk_ware/he.h.m4:heHE.ApasGigenisKoimisis.greekname	
ltx/en_uk_ware/he.h.m4:heHE.ApasGigenisKoimisis.incipit	…
ltx/en_uk_ware/he.h.m4:heHE.ApasGigenisKoimisis.melody	@ltx/en_uk_ware/miscellanea:misc.HeirmosNotMetered
ltx/en_uk_ware/he.h.m4:heHE.ApasGigenisKoimisis.mode	@ltx/en_uk_ware/miscellanea:misc.Mode4
ltx/en_uk_ware/he.h.m4:heHE.ApasGigenisKoimisis.name	(NM)
ltx/en_uk_ware/he.h.m4:heHE.ApasGigenisKoimisis.ode	@ltx/en_uk_ware/miscellanea:misc.Ode9
ltx/en_uk_ware/he.h.m4:heHE.ApasGigenisKoimisis.text	
ltx/en_uk_ware/he.h.m4:heHE.ApasGigenis_Akathist.greekname	@ltx/en_uk_ware/properties:deprecated.key
ltx/en_uk_ware/he.h.m4:heHE.ApasGigenis_Akathist.incipit	@ltx/en_uk_ware/properties:deprecated.key
ltx/en_uk_ware/he.h.m4:heHE.ApasGigenis_Akathist.melody	@ltx/en_uk_ware/properties:deprecated.key
ltx/en_uk_ware/he.h.m4:heHE.ApasGigenis_Akathist.mode	@ltx/en_uk_ware/properties:deprecated.key
ltx/en_uk_ware/he.h.m4:heHE.ApasGigenis_Akathist.name	@ltx/en_uk_ware/properties:deprecated.key
ltx/en_uk_ware/he.h.m4:heHE.ApasGigenis_Akathist.ode	@ltx/en_uk_ware/properties:deprecated.key
ltx/en_uk_ware/he.h.m4:heHE.ApasGigenis_Akathist.text	@ltx/en_uk_ware/properties:deprecated.key
ltx/en_uk_ware/he.h.m4:heHE.ApasGigenis_Eisodia.greekname	@ltx/en_uk_ware/properties:deprecated.key
ltx/en_uk_ware/he.h.m4:heHE.ApasGigenis_Eisodia.incipit	@ltx/en_uk_ware/properties:deprecated.key
ltx/en_uk_ware/he.h.m4:heHE.ApasGigenis_Eisodia.melody	@ltx/en_uk_ware/properties:deprecated.key
ltx/en_uk_ware/he.h.m4:heHE.ApasGigenis_Eisodia.mode	@ltx/en_uk_ware/properties:deprecated.key
ltx/en_uk_ware/he.h.m4:heHE.ApasGigenis_Eisodia.name	@ltx/en_uk_ware/properties:deprecated.key
ltx/en_uk_ware/he.h.m4:heHE.ApasGigenis_Eisodia.ode	@ltx/en_uk_ware/properties:deprecated.key
ltx/en_uk_ware/he.h.m4:heHE.ApasGigenis_Eisodia.text	@ltx/en_uk_ware/properties:deprecated.key
ltx/en_uk_ware/he.h.m4:heHE.ApasGigenis_Koimisis.greekname	@ltx/en_uk_ware/properties:deprecated.key
ltx/en_uk_ware/he.h.m4:heHE.ApasGigenis_Koimisis.incipit	@ltx/en_uk_ware/properties:deprecated.key
ltx/en_uk_ware/he.h.m4:heHE.ApasGigenis_Koimisis.melody	@ltx/en_uk_ware/properties:deprecated.key
ltx/en_uk_ware/he.h.m4:heHE.ApasGigenis_Koimisis.mode	@ltx/en_uk_ware/properties:deprecated.key
ltx/en_uk_ware/he.h.m4:heHE.ApasGigenis_Koimisis.name	@ltx/en_uk_ware/properties:deprecated.key
ltx/en_uk_ware/he.h.m4:heHE.ApasGigenis_Koimisis.ode	@ltx/en_uk_ware/properties:deprecated.key
ltx/en_uk_ware/he.h.m4:heHE.ApasGigenis_Koimisis.text	@ltx/en_uk_ware/properties:deprecated.key
ltx/en_uk_ware/he.h.m4:heHE.ArmataFarao.greekname	
ltx/en_uk_ware/he.h.m4:heHE.ArmataFarao.incipit	…
ltx/en_uk_ware/he.h.m4:heHE.ArmataFarao.melody	@ltx/en_uk_ware/miscellanea:misc.HeirmosNotMetered
ltx/en_uk_ware/he.h.m4:heHE.ArmataFarao.mode	@ltx/en_uk_ware/miscellanea:misc.Mode4
ltx/en_uk_ware/he.h.m4:heHE.ArmataFarao.name	(NM)
ltx/en_uk_ware/he.h.m4:heHE.ArmataFarao.ode	@ltx/en_uk_ware/miscellanea:misc.Ode1
ltx/en_uk_ware/he.h.m4:heHE.ArmataFarao.text	
ltx/en_uk_ware/he.h.m4:heHE.AseveisOukOpsontai.greekname	
ltx/en_uk_ware/he.h.m4:heHE.AseveisOukOpsontai.incipit	The godless shall not see…
ltx/en_uk_ware/he.h.m4:heHE.AseveisOukOpsontai.melody	@ltx/en_uk_ware/miscellanea:misc.HeirmosNotMetered
ltx/en_uk_ware/he.h.m4:heHE.AseveisOukOpsontai.mode	@ltx/en_uk_ware/miscellanea:misc.Mode4
ltx/en_uk_ware/he.h.m4:heHE.AseveisOukOpsontai.name	(NM) The godless shall not see.
ltx/en_uk_ware/he.h.m4:heHE.AseveisOukOpsontai.ode	@ltx/en_uk_ware/miscellanea:misc.Ode5
ltx/en_uk_ware/he.h.m4:heHE.AseveisOukOpsontai.text	
ltx/en_uk_ware/he.h.m4:heHE.AsomaiSoiKyrie.greekname	
ltx/en_uk_ware/he.h.m4:heHE.AsomaiSoiKyrie.incipit	…
ltx/en_uk_ware/he.h.m4:heHE.AsomaiSoiKyrie.melody	@ltx/en_uk_ware/miscellanea:misc.HeirmosNotMetered
ltx/en_uk_ware/he.h.m4:heHE.AsomaiSoiKyrie.mode	@ltx/en_uk_ware/miscellanea:misc.Mode4
ltx/en_uk_ware/he.h.m4:heHE.AsomaiSoiKyrie.name	(NM)
ltx/en_uk_ware/he.h.m4:heHE.AsomaiSoiKyrie.ode	@ltx/en_uk_ware/miscellanea:misc.Ode1
ltx/en_uk_ware/he.h.m4:heHE.AsomaiSoiKyrie.text	
ltx/en_uk_ware/he.h.m4:heHE.AvramiaioiPote.greekname	
ltx/en_uk_ware/he.h.m4:heHE.AvramiaioiPote.incipit	I will sing to Thee…
ltx/en_uk_ware/he.h.m4:heHE.AvramiaioiPote.melody	@ltx/en_uk_ware/miscellanea:misc.HeirmosNotMetered
ltx/en_uk_ware/he.h.m4:heHE.AvramiaioiPote.mode	@ltx/en_uk_ware/miscellanea:misc.Mode4
ltx/en_uk_ware/he.h.m4:heHE.AvramiaioiPote.name	(NM) I will sing to Thee.
ltx/en_uk_ware/he.h.m4:heHE.AvramiaioiPote.ode	@ltx/en_uk_ware/miscellanea:misc.Ode7
ltx/en_uk_ware/he.h.m4:heHE.AvramiaioiPote.text	I will sing to Thee, O Lord my God, for Thou hast led Thy people out of the bondage of Egypt, and hast drowned in the waters the chariots and the might of Pharaoh.
ltx/en_uk_ware/he.h.m4:heHE.ChairoisAnassa.greekname	
ltx/en_uk_ware/he.h.m4:heHE.ChairoisAnassa.incipit	…
ltx/en_uk_ware/he.h.m4:heHE.ChairoisAnassa.melody	@ltx/en_uk_ware/miscellanea:misc.HeirmosNotMetered
ltx/en_uk_ware/he.h.m4:heHE.ChairoisAnassa.mode	@ltx/en_uk_ware/miscellanea:misc.Mode4
ltx/en_uk_ware/he.h.m4:heHE.ChairoisAnassa.name	(NM)
ltx/en_uk_ware/he.h.m4:heHE.ChairoisAnassa.ode	@ltx/en_uk_ware/miscellanea:misc.Ode9
ltx/en_uk_ware/he.h.m4:heHE.ChairoisAnassa.text	
ltx/en_uk_ware/he.h.m4:heHE.ChairoisAnassa1.text	
ltx/en_uk_ware/he.h.m4:heHE.ChairoisAnassa2.text	
ltx/en_uk_ware/he.h.m4:heHE.ChairoisAnassa3.text	
ltx/en_uk_ware/he.h.m4:heHE.ChairoisAnassa4.text	
ltx/en_uk_ware/he.h.m4:heHE.ChairoisAnassa5.text	
ltx/en_uk_ware/he.h.m4:heHE.CheirasEkpetasasDaniil.greekname	
ltx/en_uk_ware/he.h.m4:heHE.CheirasEkpetasasDaniil.incipit	…
ltx/en_uk_ware/he.h.m4:heHE.CheirasEkpetasasDaniil.melody	@ltx/en_uk_ware/miscellanea:misc.HeirmosNotMetered
ltx/en_uk_ware/he.h.m4:heHE.CheirasEkpetasasDaniil.mode	@ltx/en_uk_ware/miscellanea:misc.Mode4
ltx/en_uk_ware/he.h.m4:heHE.CheirasEkpetasasDaniil.name	(NM)
ltx/en_uk_ware/he.h.m4:heHE.CheirasEkpetasasDaniil.ode	@ltx/en_uk_ware/miscellanea:misc.Ode8
ltx/en_uk_ware/he.h.m4:heHE.CheirasEkpetasasDaniil.text	
ltx/en_uk_ware/he.h.m4:heHE.ChoroiIsrail.greekname	
ltx/en_uk_ware/he.h.m4:heHE.ChoroiIsrail.incipit	…
ltx/en_uk_ware/he.h.m4:heHE.ChoroiIsrail.melody	@ltx/en_uk_ware/miscellanea:misc.HeirmosNotMetered
ltx/en_uk_ware/he.h.m4:heHE.ChoroiIsrail.mode	@ltx/en_uk_ware/miscellanea:misc.Mode4
ltx/en_uk_ware/he.h.m4:heHE.ChoroiIsrail.name	(NM)
ltx/en_uk_ware/he.h.m4:heHE.ChoroiIsrail.ode	@ltx/en_uk_ware/miscellanea:misc.Ode1
ltx/en_uk_ware/he.h.m4:heHE.ChoroiIsrail.text	
ltx/en_uk_ware/he.h.m4:heHE.ChristosOErchomenos.greekname	
ltx/en_uk_ware/he.h.m4:heHE.ChristosOErchomenos.incipit	…
ltx/en_uk_ware/he.h.m4:heHE.ChristosOErchomenos.melody	@ltx/en_uk_ware/miscellanea:misc.HeirmosNotMetered
ltx/en_uk_ware/he.h.m4:heHE.ChristosOErchomenos.mode	@ltx/en_uk_ware/miscellanea:misc.Mode4
ltx/en_uk_ware/he.h.m4:heHE.ChristosOErchomenos.name	(NM)
ltx/en_uk_ware/he.h.m4:heHE.ChristosOErchomenos.ode	@ltx/en_uk_ware/miscellanea:misc.Ode4
ltx/en_uk_ware/he.h.m4:heHE.ChristosOErchomenos.text	
ltx/en_uk_ware/he.h.m4:heHE.DiAgapisinOiktirmon.greekname	
ltx/en_uk_ware/he.h.m4:heHE.DiAgapisinOiktirmon.incipit	…
ltx/en_uk_ware/he.h.m4:heHE.DiAgapisinOiktirmon.melody	@ltx/en_uk_ware/miscellanea:misc.HeirmosNotMetered
ltx/en_uk_ware/he.h.m4:heHE.DiAgapisinOiktirmon.mode	@ltx/en_uk_ware/miscellanea:misc.Mode4
ltx/en_uk_ware/he.h.m4:heHE.DiAgapisinOiktirmon.name	(NM)
ltx/en_uk_ware/he.h.m4:heHE.DiAgapisinOiktirmon.ode	@ltx/en_uk_ware/miscellanea:misc.Ode4
ltx/en_uk_ware/he.h.m4:heHE.DiAgapisinOiktirmon.text	
ltx/en_uk_ware/he.h.m4:heHE.EffrainetaiEpiSoi.greekname	
ltx/en_uk_ware/he.h.m4:heHE.EffrainetaiEpiSoi.incipit	…
ltx/en_uk_ware/he.h.m4:heHE.EffrainetaiEpiSoi.melody	@ltx/en_uk_ware/miscellanea:misc.HeirmosNotMetered
ltx/en_uk_ware/he.h.m4:heHE.EffrainetaiEpiSoi.mode	@ltx/en_uk_ware/miscellanea:misc.Mode4
ltx/en_uk_ware/he.h.m4:heHE.EffrainetaiEpiSoi.name	(NM)
ltx/en_uk_ware/he.h.m4:heHE.EffrainetaiEpiSoi.ode	@ltx/en_uk_ware/miscellanea:misc.Ode3
ltx/en_uk_ware/he.h.m4:heHE.EffrainetaiEpiSoi.text	
ltx/en_uk_ware/he.h.m4:heHE.EffranthitiIerousalim.greekname	
ltx/en_uk_ware/he.h.m4:heHE.EffranthitiIerousalim.incipit	…
ltx/en_uk_ware/he.h.m4:heHE.EffranthitiIerousalim.melody	@ltx/en_uk_ware/miscellanea:misc.HeirmosNotMetered
ltx/en_uk_ware/he.h.m4:heHE.EffranthitiIerousalim.mode	@ltx/en_uk_ware/miscellanea:misc.Mode4
ltx/en_uk_ware/he.h.m4:heHE.EffranthitiIerousalim.name	(NM)
ltx/en_uk_ware/he.h.m4:heHE.EffranthitiIerousalim.ode	@ltx/en_uk_ware/miscellanea:misc.Ode8
ltx/en_uk_ware/he.h.m4:heHE.EffranthitiIerousalim.text	
ltx/en_uk_ware/he.h.m4:heHE.EisakikoaKyrie.greekname	
ltx/en_uk_ware/he.h.m4:heHE.EisakikoaKyrie.incipit	…
ltx/en_uk_ware/he.h.m4:heHE.EisakikoaKyrie.melody	@ltx/en_uk_ware/miscellanea:misc.HeirmosNotMetered
ltx/en_uk_ware/he.h.m4:heHE.EisakikoaKyrie.mode	@ltx/en_uk_ware/miscellanea:misc.Mode4
ltx/en_uk_ware/he.h.m4:heHE.EisakikoaKyrie.name	(NM)
ltx/en_uk_ware/he.h.m4:heHE.EisakikoaKyrie.ode	@ltx/en_uk_ware/miscellanea:misc.Ode4
ltx/en_uk_ware/he.h.m4:heHE.EisakikoaKyrie.text	
ltx/en_uk_ware/he.h.m4:heHE.EisakikoaOTheos.greekname	
ltx/en_uk_ware/he.h.m4:heHE.EisakikoaOTheos.incipit	…
ltx/en_uk_ware/he.h.m4:heHE.EisakikoaOTheos.melody	@ltx/en_uk_ware/miscellanea:misc.HeirmosNotMetered
ltx/en_uk_ware/he.h.m4:heHE.EisakikoaOTheos.mode	@ltx/en_uk_ware/miscellanea:misc.Mode4
ltx/en_uk_ware/he.h.m4:heHE.EisakikoaOTheos.name	(NM)
ltx/en_uk_ware/he.h.m4:heHE.EisakikoaOTheos.ode	@ltx/en_uk_ware/miscellanea:misc.Ode4
ltx/en_uk_ware/he.h.m4:heHE.EisakikoaOTheos.text	
ltx/en_uk_ware/he.h.m4:heHE.EisakikoaTinAkoinSou.greekname	
ltx/en_uk_ware/he.h.m4:heHE.EisakikoaTinAkoinSou.incipit	I have heard of the report…
ltx/en_uk_ware/he.h.m4:heHE.EisakikoaTinAkoinSou.melody	@ltx/en_uk_ware/miscellanea:misc.HeirmosNotMetered
ltx/en_uk_ware/he.h.m4:heHE.EisakikoaTinAkoinSou.mode	@ltx/en_uk_ware/miscellanea:misc.Mode4
ltx/en_uk_ware/he.h.m4:heHE.EisakikoaTinAkoinSou.name	(NM) I have heard of the report.
ltx/en_uk_ware/he.h.m4:heHE.EisakikoaTinAkoinSou.ode	@ltx/en_uk_ware/miscellanea:misc.Ode4
ltx/en_uk_ware/he.h.m4:heHE.EisakikoaTinAkoinSou.text	I have heard of the report of Thee, O Lord, that Thou hast appeared upon the earth, and I have glorified Thy power.
ltx/en_uk_ware/he.h.m4:heHE.EisakikoaTinEndoxon.greekname	
ltx/en_uk_ware/he.h.m4:heHE.EisakikoaTinEndoxon.incipit	…
ltx/en_uk_ware/he.h.m4:heHE.EisakikoaTinEndoxon.melody	@ltx/en_uk_ware/miscellanea:misc.HeirmosNotMetered
ltx/en_uk_ware/he.h.m4:heHE.EisakikoaTinEndoxon.mode	@ltx/en_uk_ware/miscellanea:misc.Mode4
ltx/en_uk_ware/he.h.m4:heHE.EisakikoaTinEndoxon.name	(NM)
ltx/en_uk_ware/he.h.m4:heHE.EisakikoaTinEndoxon.ode	@ltx/en_uk_ware/miscellanea:misc.Ode4
ltx/en_uk_ware/he.h.m4:heHE.EisakikoaTinEndoxon.text	
ltx/en_uk_ware/he.h.m4:heHE.EkNyktosOrthrizonta.greekname	
ltx/en_uk_ware/he.h.m4:heHE.EkNyktosOrthrizonta.incipit	O lifegiving Cross…
ltx/en_uk_ware/he.h.m4:heHE.EkNyktosOrthrizonta.melody	@ltx/en_uk_ware/miscellanea:misc.HeirmosNotMetered
ltx/en_uk_ware/he.h.m4:heHE.EkNyktosOrthrizonta.mode	@ltx/en_uk_ware/miscellanea:misc.Mode4
ltx/en_uk_ware/he.h.m4:heHE.EkNyktosOrthrizonta.name	(NM) O lifegiving Cross.
ltx/en_uk_ware/he.h.m4:heHE.EkNyktosOrthrizonta.ode	@ltx/en_uk_ware/miscellanea:misc.Ode5
ltx/en_uk_ware/he.h.m4:heHE.EkNyktosOrthrizonta.text	O lifegiving Cross of Christ, from the night I seek thee early, and with fear I venerate thee. Give me light, and ever shine upon me with the day of salvation.
ltx/en_uk_ware/he.h.m4:heHE.EklinasChriste.greekname	
ltx/en_uk_ware/he.h.m4:heHE.EklinasChriste.incipit	…
ltx/en_uk_ware/he.h.m4:heHE.EklinasChriste.melody	@ltx/en_uk_ware/miscellanea:misc.HeirmosNotMetered
ltx/en_uk_ware/he.h.m4:heHE.EklinasChriste.mode	@ltx/en_uk_ware/miscellanea:misc.Mode4
ltx/en_uk_ware/he.h.m4:heHE.EklinasChriste.name	(NM)
ltx/en_uk_ware/he.h.m4:heHE.EklinasChriste.ode	@ltx/en_uk_ware/miscellanea:misc.Ode4
ltx/en_uk_ware/he.h.m4:heHE.EklinasChriste.text	
ltx/en_uk_ware/he.h.m4:heHE.EnFlogiPyros.greekname	
ltx/en_uk_ware/he.h.m4:heHE.EnFlogiPyros.incipit	…
ltx/en_uk_ware/he.h.m4:heHE.EnFlogiPyros.melody	@ltx/en_uk_ware/miscellanea:misc.HeirmosNotMetered
ltx/en_uk_ware/he.h.m4:heHE.EnFlogiPyros.mode	@ltx/en_uk_ware/miscellanea:misc.Mode4
ltx/en_uk_ware/he.h.m4:heHE.EnFlogiPyros.name	(NM)
ltx/en_uk_ware/he.h.m4:heHE.EnFlogiPyros.ode	@ltx/en_uk_ware/miscellanea:misc.Ode8
ltx/en_uk_ware/he.h.m4:heHE.EnFlogiPyros.text	
ltx/en_uk_ware/he.h.m4:heHE.EnKiteiChriste.greekname	
ltx/en_uk_ware/he.h.m4:heHE.EnKiteiChriste.incipit	…
ltx/en_uk_ware/he.h.m4:heHE.EnKiteiChriste.melody	@ltx/en_uk_ware/miscellanea:misc.HeirmosNotMetered
ltx/en_uk_ware/he.h.m4:heHE.EnKiteiChriste.mode	@ltx/en_uk_ware/miscellanea:misc.Mode4
ltx/en_uk_ware/he.h.m4:heHE.EnKiteiChriste.name	(NM)
ltx/en_uk_ware/he.h.m4:heHE.EnKiteiChriste.ode	@ltx/en_uk_ware/miscellanea:misc.Ode6
ltx/en_uk_ware/he.h.m4:heHE.EnKiteiChriste.text	
ltx/en_uk_ware/he.h.m4:heHE.EnKyrioTheoMou.greekname	
ltx/en_uk_ware/he.h.m4:heHE.EnKyrioTheoMou.incipit	My heart is firmly established…
ltx/en_uk_ware/he.h.m4:heHE.EnKyrioTheoMou.melody	@ltx/en_uk_ware/miscellanea:misc.HeirmosNotMetered
ltx/en_uk_ware/he.h.m4:heHE.EnKyrioTheoMou.mode	@ltx/en_uk_ware/miscellanea:misc.Mode4
ltx/en_uk_ware/he.h.m4:heHE.EnKyrioTheoMou.name	(NM) My heart is firmly established.
ltx/en_uk_ware/he.h.m4:heHE.EnKyrioTheoMou.ode	@ltx/en_uk_ware/miscellanea:misc.Ode3
ltx/en_uk_ware/he.h.m4:heHE.EnKyrioTheoMou.text	My heart is firmly established in the Lord my God: for the weak have been girded with strength.
ltx/en_uk_ware/he.h.m4:heHE.EnPelageiTouViou.greekname	
ltx/en_uk_ware/he.h.m4:heHE.EnPelageiTouViou.incipit	…
ltx/en_uk_ware/he.h.m4:heHE.EnPelageiTouViou.melody	@ltx/en_uk_ware/miscellanea:misc.HeirmosNotMetered
ltx/en_uk_ware/he.h.m4:heHE.EnPelageiTouViou.mode	@ltx/en_uk_ware/miscellanea:misc.Mode4
ltx/en_uk_ware/he.h.m4:heHE.EnPelageiTouViou.name	(NM)
ltx/en_uk_ware/he.h.m4:heHE.EnPelageiTouViou.ode	@ltx/en_uk_ware/miscellanea:misc.Ode6
ltx/en_uk_ware/he.h.m4:heHE.EnPelageiTouViou.text	
ltx/en_uk_ware/he.h.m4:heHE.EnTiKaminoAvramiaioi.greekname	
ltx/en_uk_ware/he.h.m4:heHE.EnTiKaminoAvramiaioi.incipit	…
ltx/en_uk_ware/he.h.m4:heHE.EnTiKaminoAvramiaioi.melody	@ltx/en_uk_ware/miscellanea:misc.HeirmosNotMetered
ltx/en_uk_ware/he.h.m4:heHE.EnTiKaminoAvramiaioi.mode	@ltx/en_uk_ware/miscellanea:misc.Mode4
ltx/en_uk_ware/he.h.m4:heHE.EnTiKaminoAvramiaioi.name	(NM)
ltx/en_uk_ware/he.h.m4:heHE.EnTiKaminoAvramiaioi.ode	@ltx/en_uk_ware/miscellanea:misc.Ode7
ltx/en_uk_ware/he.h.m4:heHE.EnTiKaminoAvramiaioi.text	
ltx/en_uk_ware/he.h.m4:heHE.EnToThlivesthaiMe.greekname	
ltx/en_uk_ware/he.h.m4:heHE.EnToThlivesthaiMe.incipit	…
ltx/en_uk_ware/he.h.m4:heHE.EnToThlivesthaiMe.melody	@ltx/en_uk_ware/miscellanea:misc.HeirmosNotMetered
ltx/en_uk_ware/he.h.m4:heHE.EnToThlivesthaiMe.mode	@ltx/en_uk_ware/miscellanea:misc.Mode4
ltx/en_uk_ware/he.h.m4:heHE.EnToThlivesthaiMe.name	(NM)
ltx/en_uk_ware/he.h.m4:heHE.EnToThlivesthaiMe.ode	@ltx/en_uk_ware/miscellanea:misc.Ode6
ltx/en_uk_ware/he.h.m4:heHE.EnToThlivesthaiMe.text	
ltx/en_uk_ware/he.h.m4:heHE.EparthentaSeIdousa.greekname	
ltx/en_uk_ware/he.h.m4:heHE.EparthentaSeIdousa.incipit	…
ltx/en_uk_ware/he.h.m4:heHE.EparthentaSeIdousa.melody	@ltx/en_uk_ware/miscellanea:misc.HeirmosNotMetered
ltx/en_uk_ware/he.h.m4:heHE.EparthentaSeIdousa.mode	@ltx/en_uk_ware/miscellanea:misc.Mode4
ltx/en_uk_ware/he.h.m4:heHE.EparthentaSeIdousa.name	(NM)
ltx/en_uk_ware/he.h.m4:heHE.EparthentaSeIdousa.ode	@ltx/en_uk_ware/miscellanea:misc.Ode4
ltx/en_uk_ware/he.h.m4:heHE.EparthentaSeIdousa.text	
ltx/en_uk_ware/he.h.m4:heHE.EpoiiseKratos.greekname	
ltx/en_uk_ware/he.h.m4:heHE.EpoiiseKratos.incipit	…
ltx/en_uk_ware/he.h.m4:heHE.EpoiiseKratos.melody	@ltx/en_uk_ware/miscellanea:misc.HeirmosNotMetered
ltx/en_uk_ware/he.h.m4:heHE.EpoiiseKratos.mode	@ltx/en_uk_ware/miscellanea:misc.Mode4
ltx/en_uk_ware/he.h.m4:heHE.EpoiiseKratos.name	(NM)
ltx/en_uk_ware/he.h.m4:heHE.EpoiiseKratos.ode	@ltx/en_uk_ware/miscellanea:misc.Ode9
ltx/en_uk_ware/he.h.m4:heHE.EpoiiseKratos.text	
ltx/en_uk_ware/he.h.m4:heHE.ErrixeGastros.greekname	
ltx/en_uk_ware/he.h.m4:heHE.ErrixeGastros.incipit	…
ltx/en_uk_ware/he.h.m4:heHE.ErrixeGastros.melody	@ltx/en_uk_ware/miscellanea:misc.HeirmosNotMetered
ltx/en_uk_ware/he.h.m4:heHE.ErrixeGastros.mode	@ltx/en_uk_ware/miscellanea:misc.Mode4
ltx/en_uk_ware/he.h.m4:heHE.ErrixeGastros.name	(NM)
ltx/en_uk_ware/he.h.m4:heHE.ErrixeGastros.ode	@ltx/en_uk_ware/miscellanea:misc.Ode3
ltx/en_uk_ware/he.h.m4:heHE.ErrixeGastros.text	
ltx/en_uk_ware/he.h.m4:heHE.ErrixeGastros1.text	
ltx/en_uk_ware/he.h.m4:heHE.ErrixeGastros2.text	
ltx/en_uk_ware/he.h.m4:heHE.ErrixeGastros3.text	
ltx/en_uk_ware/he.h.m4:heHE.ErrixeGastros4.text	
ltx/en_uk_ware/he.h.m4:heHE.ErrixeGastros5.text	
ltx/en_uk_ware/he.h.m4:heHE.EstereothiIKardiaMou.greekname	
ltx/en_uk_ware/he.h.m4:heHE.EstereothiIKardiaMou.incipit	…
ltx/en_uk_ware/he.h.m4:heHE.EstereothiIKardiaMou.melody	@ltx/en_uk_ware/miscellanea:misc.HeirmosNotMetered
ltx/en_uk_ware/he.h.m4:heHE.EstereothiIKardiaMou.mode	@ltx/en_uk_ware/miscellanea:misc.Mode4
ltx/en_uk_ware/he.h.m4:heHE.EstereothiIKardiaMou.name	(NM)
ltx/en_uk_ware/he.h.m4:heHE.EstereothiIKardiaMou.ode	@ltx/en_uk_ware/miscellanea:misc.Ode3
ltx/en_uk_ware/he.h.m4:heHE.EstereothiIKardiaMou.text	
ltx/en_uk_ware/he.h.m4:heHE.EstereothiIKardiaMouEnKyrio.greekname	
ltx/en_uk_ware/he.h.m4:heHE.EstereothiIKardiaMouEnKyrio.incipit	…
ltx/en_uk_ware/he.h.m4:heHE.EstereothiIKardiaMouEnKyrio.melody	@ltx/en_uk_ware/miscellanea:misc.HeirmosNotMetered
ltx/en_uk_ware/he.h.m4:heHE.EstereothiIKardiaMouEnKyrio.mode	@ltx/en_uk_ware/miscellanea:misc.Mode4
ltx/en_uk_ware/he.h.m4:heHE.EstereothiIKardiaMouEnKyrio.name	(NM)
ltx/en_uk_ware/he.h.m4:heHE.EstereothiIKardiaMouEnKyrio.ode	@ltx/en_uk_ware/miscellanea:misc.Ode3
ltx/en_uk_ware/he.h.m4:heHE.EstereothiIKardiaMouEnKyrio.text	
ltx/en_uk_ware/he.h.m4:heHE.EvaMenToTisParakois.greekname	
ltx/en_uk_ware/he.h.m4:heHE.EvaMenToTisParakois.incipit	Eve through the sickness…
ltx/en_uk_ware/he.h.m4:heHE.EvaMenToTisParakois.melody	@ltx/en_uk_ware/miscellanea:misc.HeirmosNotMetered
ltx/en_uk_ware/he.h.m4:heHE.EvaMenToTisParakois.mode	@ltx/en_uk_ware/miscellanea:misc.Mode4
ltx/en_uk_ware/he.h.m4:heHE.EvaMenToTisParakois.name	(NM) Eve through the sickness.
ltx/en_uk_ware/he.h.m4:heHE.EvaMenToTisParakois.ode	@ltx/en_uk_ware/miscellanea:misc.Ode9
ltx/en_uk_ware/he.h.m4:heHE.EvaMenToTisParakois.text	
ltx/en_uk_ware/he.h.m4:heHE.EvergetaChristePantodyname.greekname	
ltx/en_uk_ware/he.h.m4:heHE.EvergetaChristePantodyname.incipit	…
ltx/en_uk_ware/he.h.m4:heHE.EvergetaChristePantodyname.melody	@ltx/en_uk_ware/miscellanea:misc.HeirmosNotMetered
ltx/en_uk_ware/he.h.m4:heHE.EvergetaChristePantodyname.mode	@ltx/en_uk_ware/miscellanea:misc.Mode4
ltx/en_uk_ware/he.h.m4:heHE.EvergetaChristePantodyname.name	(NM)
ltx/en_uk_ware/he.h.m4:heHE.EvergetaChristePantodyname.ode	@ltx/en_uk_ware/miscellanea:misc.Ode8
ltx/en_uk_ware/he.h.m4:heHE.EvergetaChristePantodyname.text	
ltx/en_uk_ware/he.h.m4:heHE.EvlogitosEiOTheos.greekname	
ltx/en_uk_ware/he.h.m4:heHE.EvlogitosEiOTheos.incipit	…
ltx/en_uk_ware/he.h.m4:heHE.EvlogitosEiOTheos.melody	@ltx/en_uk_ware/miscellanea:misc.HeirmosNotMetered
ltx/en_uk_ware/he.h.m4:heHE.EvlogitosEiOTheos.mode	@ltx/en_uk_ware/miscellanea:misc.Mode4
ltx/en_uk_ware/he.h.m4:heHE.EvlogitosEiOTheos.name	(NM)
ltx/en_uk_ware/he.h.m4:heHE.EvlogitosEiOTheos.ode	@ltx/en_uk_ware/miscellanea:misc.Ode7
ltx/en_uk_ware/he.h.m4:heHE.EvlogitosEiOTheos.text	
ltx/en_uk_ware/he.h.m4:heHE.EvoisanEnEffrosyni.greekname	
ltx/en_uk_ware/he.h.m4:heHE.EvoisanEnEffrosyni.incipit	…
ltx/en_uk_ware/he.h.m4:heHE.EvoisanEnEffrosyni.melody	@ltx/en_uk_ware/miscellanea:misc.HeirmosNotMetered
ltx/en_uk_ware/he.h.m4:heHE.EvoisanEnEffrosyni.mode	@ltx/en_uk_ware/miscellanea:misc.Mode4
ltx/en_uk_ware/he.h.m4:heHE.EvoisanEnEffrosyni.name	(NM)
ltx/en_uk_ware/he.h.m4:heHE.EvoisanEnEffrosyni.ode	@ltx/en_uk_ware/miscellanea:misc.Ode6
ltx/en_uk_ware/he.h.m4:heHE.EvoisanEnEffrosyni.text	
ltx/en_uk_ware/he.h.m4:heHE.EvoiseProtypon.greekname	
ltx/en_uk_ware/he.h.m4:heHE.EvoiseProtypon.incipit	Prefiguring Thy three-day burial…
ltx/en_uk_ware/he.h.m4:heHE.EvoiseProtypon.melody	@ltx/en_uk_ware/miscellanea:misc.HeirmosNotMetered
ltx/en_uk_ware/he.h.m4:heHE.EvoiseProtypon.mode	@ltx/en_uk_ware/miscellanea:misc.Mode4
ltx/en_uk_ware/he.h.m4:heHE.EvoiseProtypon.name	(NM) Prefiguring Thy three-day burial.
ltx/en_uk_ware/he.h.m4:heHE.EvoiseProtypon.ode	@ltx/en_uk_ware/miscellanea:misc.Ode6
ltx/en_uk_ware/he.h.m4:heHE.EvoiseProtypon.text	Prefiguring Thy three-day burial, the prophet Jonah cried out in the belly of the whale: ‘Deliver me from corruption, O Jesus, King and Lord of hosts.’
ltx/en_uk_ware/he.h.m4:heHE.ExestiTaSympanta.greekname	
ltx/en_uk_ware/he.h.m4:heHE.ExestiTaSympanta.incipit	…
ltx/en_uk_ware/he.h.m4:heHE.ExestiTaSympanta.melody	@ltx/en_uk_ware/miscellanea:misc.HeirmosNotMetered
ltx/en_uk_ware/he.h.m4:heHE.ExestiTaSympanta.mode	@ltx/en_uk_ware/miscellanea:misc.Mode4
ltx/en_uk_ware/he.h.m4:heHE.ExestiTaSympanta.name	(NM)
ltx/en_uk_ware/he.h.m4:heHE.ExestiTaSympanta.ode	@ltx/en_uk_ware/miscellanea:misc.Ode5
ltx/en_uk_ware/he.h.m4:heHE.ExestiTaSympanta.text	
ltx/en_uk_ware/he.h.m4:heHE.ExestiTaSympantaEisodia.greekname	
ltx/en_uk_ware/he.h.m4:heHE.ExestiTaSympantaEisodia.incipit	…
ltx/en_uk_ware/he.h.m4:heHE.ExestiTaSympantaEisodia.melody	@ltx/en_uk_ware/miscellanea:misc.HeirmosNotMetered
ltx/en_uk_ware/he.h.m4:heHE.ExestiTaSympantaEisodia.mode	@ltx/en_uk_ware/miscellanea:misc.Mode4
ltx/en_uk_ware/he.h.m4:heHE.ExestiTaSympantaEisodia.name	(NM)
ltx/en_uk_ware/he.h.m4:heHE.ExestiTaSympantaEisodia.ode	@ltx/en_uk_ware/miscellanea:misc.Ode5
ltx/en_uk_ware/he.h.m4:heHE.ExestiTaSympantaEisodia.text	
ltx/en_uk_ware/he.h.m4:heHE.ExestiTaSympantaKoimisis.greekname	
ltx/en_uk_ware/he.h.m4:heHE.ExestiTaSympantaKoimisis.incipit	…
ltx/en_uk_ware/he.h.m4:heHE.ExestiTaSympantaKoimisis.melody	@ltx/en_uk_ware/miscellanea:misc.HeirmosNotMetered
ltx/en_uk_ware/he.h.m4:heHE.ExestiTaSympantaKoimisis.mode	@ltx/en_uk_ware/miscellanea:misc.Mode4
ltx/en_uk_ware/he.h.m4:heHE.ExestiTaSympantaKoimisis.name	(NM)
ltx/en_uk_ware/he.h.m4:heHE.ExestiTaSympantaKoimisis.ode	@ltx/en_uk_ware/miscellanea:misc.Ode5
ltx/en_uk_ware/he.h.m4:heHE.ExestiTaSympantaKoimisis.text	
ltx/en_uk_ware/he.h.m4:heHE.ExestiTaSympanta_Eisodia.greekname	@ltx/en_uk_ware/properties:deprecated.key
ltx/en_uk_ware/he.h.m4:heHE.ExestiTaSympanta_Eisodia.incipit	@ltx/en_uk_ware/properties:deprecated.key
ltx/en_uk_ware/he.h.m4:heHE.ExestiTaSympanta_Eisodia.melody	@ltx/en_uk_ware/properties:deprecated.key
ltx/en_uk_ware/he.h.m4:heHE.ExestiTaSympanta_Eisodia.mode	@ltx/en_uk_ware/properties:deprecated.key
ltx/en_uk_ware/he.h.m4:heHE.ExestiTaSympanta_Eisodia.name	@ltx/en_uk_ware/properties:deprecated.key
ltx/en_uk_ware/he.h.m4:heHE.ExestiTaSympanta_Eisodia.ode	@ltx/en_uk_ware/properties:deprecated.key
ltx/en_uk_ware/he.h.m4:heHE.ExestiTaSympanta_Eisodia.text	@ltx/en_uk_ware/properties:deprecated.key
ltx/en_uk_ware/he.h.m4:heHE.ExestiTaSympanta_Koimisis.greekname	@ltx/en_uk_ware/properties:deprecated.key
ltx/en_uk_ware/he.h.m4:heHE.ExestiTaSympanta_Koimisis.incipit	@ltx/en_uk_ware/properties:deprecated.key
ltx/en_uk_ware/he.h.m4:heHE.ExestiTaSympanta_Koimisis.melody	@ltx/en_uk_ware/properties:deprecated.key
ltx/en_uk_ware/he.h.m4:heHE.ExestiTaSympanta_Koimisis.mode	@ltx/en_uk_ware/properties:deprecated.key
ltx/en_uk_ware/he.h.m4:heHE.ExestiTaSympanta_Koimisis.name	@ltx/en_uk_ware/properties:deprecated.key
ltx/en_uk_ware/he.h.m4:heHE.ExestiTaSympanta_Koimisis.ode	@ltx/en_uk_ware/properties:deprecated.key
ltx/en_uk_ware/he.h.m4:heHE.ExestiTaSympanta_Koimisis.text	@ltx/en_uk_ware/properties:deprecated.key
ltx/en_uk_ware/he.h.m4:heHE.GiKaiPantaTaEnAfti.greekname	
ltx/en_uk_ware/he.h.m4:heHE.GiKaiPantaTaEnAfti.incipit	Earth and all that is therein…
ltx/en_uk_ware/he.h.m4:heHE.GiKaiPantaTaEnAfti.melody	@ltx/en_uk_ware/miscellanea:misc.HeirmosNotMetered
ltx/en_uk_ware/he.h.m4:heHE.GiKaiPantaTaEnAfti.mode	@ltx/en_uk_ware/miscellanea:misc.Mode4
ltx/en_uk_ware/he.h.m4:heHE.GiKaiPantaTaEnAfti.name	(NM) Earth and all that is therein.
ltx/en_uk_ware/he.h.m4:heHE.GiKaiPantaTaEnAfti.ode	@ltx/en_uk_ware/miscellanea:misc.Ode8
ltx/en_uk_ware/he.h.m4:heHE.GiKaiPantaTaEnAfti.text	Earth and all that is therein, seas and all fountains, the heaven of heavens, light and darkness, cold and heat, sons of men and priests, bless ye the Lord and exalt Him above all for ever.
ltx/en_uk_ware/he.h.m4:heHE.IlasmosIminChriste.greekname	
ltx/en_uk_ware/he.h.m4:heHE.IlasmosIminChriste.incipit	…
ltx/en_uk_ware/he.h.m4:heHE.IlasmosIminChriste.melody	@ltx/en_uk_ware/miscellanea:misc.HeirmosNotMetered
ltx/en_uk_ware/he.h.m4:heHE.IlasmosIminChriste.mode	@ltx/en_uk_ware/miscellanea:misc.Mode4
ltx/en_uk_ware/he.h.m4:heHE.IlasmosIminChriste.name	(NM)
ltx/en_uk_ware/he.h.m4:heHE.IlasmosIminChriste.ode	@ltx/en_uk_ware/miscellanea:misc.Ode6
ltx/en_uk_ware/he.h.m4:heHE.IlasmosIminChriste.text	
ltx/en_uk_ware/he.h.m4:heHE.IlasmosIminChriste1.text	
ltx/en_uk_ware/he.h.m4:heHE.IlasmosIminChriste2.text	
ltx/en_uk_ware/he.h.m4:heHE.IlasmosIminChriste3.text	
ltx/en_uk_ware/he.h.m4:heHE.IlasmosIminChriste4.text	
ltx/en_uk_ware/he.h.m4:heHE.IlasmosIminChriste5.text	
ltx/en_uk_ware/he.h.m4:heHE.IlthonEisTaVathi.greekname	
ltx/en_uk_ware/he.h.m4:heHE.IlthonEisTaVathi.incipit	…
ltx/en_uk_ware/he.h.m4:heHE.IlthonEisTaVathi.melody	@ltx/en_uk_ware/miscellanea:misc.HeirmosNotMetered
ltx/en_uk_ware/he.h.m4:heHE.IlthonEisTaVathi.mode	@ltx/en_uk_ware/miscellanea:misc.Mode4
ltx/en_uk_ware/he.h.m4:heHE.IlthonEisTaVathi.name	(NM)
ltx/en_uk_ware/he.h.m4:heHE.IlthonEisTaVathi.ode	@ltx/en_uk_ware/miscellanea:misc.Ode6
ltx/en_uk_ware/he.h.m4:heHE.IlthonEisTaVathi.text	
ltx/en_uk_ware/he.h.m4:heHE.KryptonTheionAchranton.greekname	
ltx/en_uk_ware/he.h.m4:heHE.KryptonTheionAchranton.incipit	…
ltx/en_uk_ware/he.h.m4:heHE.KryptonTheionAchranton.melody	@ltx/en_uk_ware/miscellanea:misc.HeirmosNotMetered
ltx/en_uk_ware/he.h.m4:heHE.KryptonTheionAchranton.mode	@ltx/en_uk_ware/miscellanea:misc.Mode4
ltx/en_uk_ware/he.h.m4:heHE.KryptonTheionAchranton.name	(NM)
ltx/en_uk_ware/he.h.m4:heHE.KryptonTheionAchranton.ode	@ltx/en_uk_ware/miscellanea:misc.Ode9
ltx/en_uk_ware/he.h.m4:heHE.KryptonTheionAchranton.text	
ltx/en_uk_ware/he.h.m4:heHE.LithosAcheirotmitos.greekname	
ltx/en_uk_ware/he.h.m4:heHE.LithosAcheirotmitos.incipit	Christ, the corner-stone…
ltx/en_uk_ware/he.h.m4:heHE.LithosAcheirotmitos.melody	@ltx/en_uk_ware/miscellanea:misc.HeirmosNotMetered
ltx/en_uk_ware/he.h.m4:heHE.LithosAcheirotmitos.mode	@ltx/en_uk_ware/miscellanea:misc.Mode4
ltx/en_uk_ware/he.h.m4:heHE.LithosAcheirotmitos.name	(NM) Christ, the corner-stone.
ltx/en_uk_ware/he.h.m4:heHE.LithosAcheirotmitos.ode	@ltx/en_uk_ware/miscellanea:misc.Ode9
ltx/en_uk_ware/he.h.m4:heHE.LithosAcheirotmitos.text	
ltx/en_uk_ware/he.h.m4:heHE.LogouTheouAfraston.greekname	
ltx/en_uk_ware/he.h.m4:heHE.LogouTheouAfraston.incipit	…
ltx/en_uk_ware/he.h.m4:heHE.LogouTheouAfraston.melody	@ltx/en_uk_ware/miscellanea:misc.HeirmosNotMetered
ltx/en_uk_ware/he.h.m4:heHE.LogouTheouAfraston.mode	@ltx/en_uk_ware/miscellanea:misc.Mode4
ltx/en_uk_ware/he.h.m4:heHE.LogouTheouAfraston.name	(NM)
ltx/en_uk_ware/he.h.m4:heHE.LogouTheouAfraston.ode	@ltx/en_uk_ware/miscellanea:misc.Ode9
ltx/en_uk_ware/he.h.m4:heHE.LogouTheouAfraston.text	
ltx/en_uk_ware/he.h.m4:heHE.LyeiTaDesma.greekname	
ltx/en_uk_ware/he.h.m4:heHE.LyeiTaDesma.incipit	…
ltx/en_uk_ware/he.h.m4:heHE.LyeiTaDesma.melody	@ltx/en_uk_ware/miscellanea:misc.HeirmosNotMetered
ltx/en_uk_ware/he.h.m4:heHE.LyeiTaDesma.mode	@ltx/en_uk_ware/miscellanea:misc.Mode4
ltx/en_uk_ware/he.h.m4:heHE.LyeiTaDesma.name	(NM)
ltx/en_uk_ware/he.h.m4:heHE.LyeiTaDesma.ode	@ltx/en_uk_ware/miscellanea:misc.Ode8
ltx/en_uk_ware/he.h.m4:heHE.LyeiTaDesma.text	
ltx/en_uk_ware/he.h.m4:heHE.LyeiTaDesma1.text	
ltx/en_uk_ware/he.h.m4:heHE.LyeiTaDesma2.text	
ltx/en_uk_ware/he.h.m4:heHE.LyeiTaDesma3.text	
ltx/en_uk_ware/he.h.m4:heHE.LyeiTaDesma4.text	
ltx/en_uk_ware/he.h.m4:heHE.LyeiTaDesma5.text	
ltx/en_uk_ware/he.h.m4:heHE.LytirionKatharsin.greekname	
ltx/en_uk_ware/he.h.m4:heHE.LytirionKatharsin.incipit	…
ltx/en_uk_ware/he.h.m4:heHE.LytirionKatharsin.melody	@ltx/en_uk_ware/miscellanea:misc.HeirmosNotMetered
ltx/en_uk_ware/he.h.m4:heHE.LytirionKatharsin.mode	@ltx/en_uk_ware/miscellanea:misc.Mode4
ltx/en_uk_ware/he.h.m4:heHE.LytirionKatharsin.name	(NM)
ltx/en_uk_ware/he.h.m4:heHE.LytirionKatharsin.ode	@ltx/en_uk_ware/miscellanea:misc.Ode5
ltx/en_uk_ware/he.h.m4:heHE.LytirionKatharsin.text	
ltx/en_uk_ware/he.h.m4:heHE.LytirionKatharsin1.text	
ltx/en_uk_ware/he.h.m4:heHE.LytirionKatharsin2.text	
ltx/en_uk_ware/he.h.m4:heHE.LytirionKatharsin3.text	
ltx/en_uk_ware/he.h.m4:heHE.LytirionKatharsin4.text	
ltx/en_uk_ware/he.h.m4:heHE.LytirionKatharsin5.text	
ltx/en_uk_ware/he.h.m4:heHE.LytrotaTouPantos.greekname	
ltx/en_uk_ware/he.h.m4:heHE.LytrotaTouPantos.incipit	O all-powerful Deliverer of all…
ltx/en_uk_ware/he.h.m4:heHE.LytrotaTouPantos.melody	@ltx/en_uk_ware/miscellanea:misc.HeirmosNotMetered
ltx/en_uk_ware/he.h.m4:heHE.LytrotaTouPantos.mode	@ltx/en_uk_ware/miscellanea:misc.Mode4
ltx/en_uk_ware/he.h.m4:heHE.LytrotaTouPantos.name	(NM) O all-powerful Deliverer of all.
ltx/en_uk_ware/he.h.m4:heHE.LytrotaTouPantos.ode	@ltx/en_uk_ware/miscellanea:misc.Ode8
ltx/en_uk_ware/he.h.m4:heHE.LytrotaTouPantos.text	
ltx/en_uk_ware/he.h.m4:heHE.MegalynomenPantes.greekname	
ltx/en_uk_ware/he.h.m4:heHE.MegalynomenPantes.incipit	We all magnify Thy love…
ltx/en_uk_ware/he.h.m4:heHE.MegalynomenPantes.melody	@ltx/en_uk_ware/miscellanea:misc.HeirmosNotMetered
ltx/en_uk_ware/he.h.m4:heHE.MegalynomenPantes.mode	@ltx/en_uk_ware/miscellanea:misc.Mode4
ltx/en_uk_ware/he.h.m4:heHE.MegalynomenPantes.name	(NM) We all magnify Thy love.
ltx/en_uk_ware/he.h.m4:heHE.MegalynomenPantes.ode	@ltx/en_uk_ware/miscellanea:misc.Ode9
ltx/en_uk_ware/he.h.m4:heHE.MegalynomenPantes.text	We all magnify Thy love for mankind, O Christ our Saviour. Thou art the glory of Thy servants and the crown of the faithful, who hast magnified the memory of her that bore Thee.
ltx/en_uk_ware/he.h.m4:heHE.MetaTokonSeAgni.greekname	
ltx/en_uk_ware/he.h.m4:heHE.MetaTokonSeAgni.incipit	…
ltx/en_uk_ware/he.h.m4:heHE.MetaTokonSeAgni.melody	@ltx/en_uk_ware/miscellanea:misc.HeirmosNotMetered
ltx/en_uk_ware/he.h.m4:heHE.MetaTokonSeAgni.mode	@ltx/en_uk_ware/miscellanea:misc.Mode4
ltx/en_uk_ware/he.h.m4:heHE.MetaTokonSeAgni.name	(NM)
ltx/en_uk_ware/he.h.m4:heHE.MetaTokonSeAgni.ode	@ltx/en_uk_ware/miscellanea:misc.Ode9
ltx/en_uk_ware/he.h.m4:heHE.MetaTokonSeAgni.text	
ltx/en_uk_ware/he.h.m4:heHE.MiKatapontisato.greekname	
ltx/en_uk_ware/he.h.m4:heHE.MiKatapontisato.incipit	…
ltx/en_uk_ware/he.h.m4:heHE.MiKatapontisato.melody	@ltx/en_uk_ware/miscellanea:misc.HeirmosNotMetered
ltx/en_uk_ware/he.h.m4:heHE.MiKatapontisato.mode	@ltx/en_uk_ware/miscellanea:misc.Mode4
ltx/en_uk_ware/he.h.m4:heHE.MiKatapontisato.name	(NM)
ltx/en_uk_ware/he.h.m4:heHE.MiKatapontisato.ode	@ltx/en_uk_ware/miscellanea:misc.Ode6
ltx/en_uk_ware/he.h.m4:heHE.MiKatapontisato.text	
ltx/en_uk_ware/he.h.m4:heHE.MiParadoisImas.greekname	
ltx/en_uk_ware/he.h.m4:heHE.MiParadoisImas.incipit	…
ltx/en_uk_ware/he.h.m4:heHE.MiParadoisImas.melody	@ltx/en_uk_ware/miscellanea:misc.HeirmosNotMetered
ltx/en_uk_ware/he.h.m4:heHE.MiParadoisImas.mode	@ltx/en_uk_ware/miscellanea:misc.Mode4
ltx/en_uk_ware/he.h.m4:heHE.MiParadoisImas.name	(NM)
ltx/en_uk_ware/he.h.m4:heHE.MiParadoisImas.ode	@ltx/en_uk_ware/miscellanea:misc.Ode7
ltx/en_uk_ware/he.h.m4:heHE.MiParadoisImas.text	
ltx/en_uk_ware/he.h.m4:heHE.MoysisEnToOrei.greekname	
ltx/en_uk_ware/he.h.m4:heHE.MoysisEnToOrei.incipit	…
ltx/en_uk_ware/he.h.m4:heHE.MoysisEnToOrei.melody	@ltx/en_uk_ware/miscellanea:misc.HeirmosNotMetered
ltx/en_uk_ware/he.h.m4:heHE.MoysisEnToOrei.mode	@ltx/en_uk_ware/miscellanea:misc.Mode4
ltx/en_uk_ware/he.h.m4:heHE.MoysisEnToOrei.name	(NM)
ltx/en_uk_ware/he.h.m4:heHE.MoysisEnToOrei.ode	@ltx/en_uk_ware/miscellanea:misc.Ode9
ltx/en_uk_ware/he.h.m4:heHE.MoysisEnToOrei.text	
ltx/en_uk_ware/he.h.m4:heHE.NaousanAkrotomon.greekname	
ltx/en_uk_ware/he.h.m4:heHE.NaousanAkrotomon.incipit	…
ltx/en_uk_ware/he.h.m4:heHE.NaousanAkrotomon.melody	@ltx/en_uk_ware/miscellanea:misc.HeirmosNotMetered
ltx/en_uk_ware/he.h.m4:heHE.NaousanAkrotomon.mode	@ltx/en_uk_ware/miscellanea:misc.Mode4
ltx/en_uk_ware/he.h.m4:heHE.NaousanAkrotomon.name	(NM)
ltx/en_uk_ware/he.h.m4:heHE.NaousanAkrotomon.ode	@ltx/en_uk_ware/miscellanea:misc.Ode3
ltx/en_uk_ware/he.h.m4:heHE.NaousanAkrotomon.text	
ltx/en_uk_ware/he.h.m4:heHE.NeoiTreisEnVavyloni.greekname	
ltx/en_uk_ware/he.h.m4:heHE.NeoiTreisEnVavyloni.incipit	…
ltx/en_uk_ware/he.h.m4:heHE.NeoiTreisEnVavyloni.melody	@ltx/en_uk_ware/miscellanea:misc.HeirmosNotMetered
ltx/en_uk_ware/he.h.m4:heHE.NeoiTreisEnVavyloni.mode	@ltx/en_uk_ware/miscellanea:misc.Mode4
ltx/en_uk_ware/he.h.m4:heHE.NeoiTreisEnVavyloni.name	(NM)
ltx/en_uk_ware/he.h.m4:heHE.NeoiTreisEnVavyloni.ode	@ltx/en_uk_ware/miscellanea:misc.Ode7
ltx/en_uk_ware/he.h.m4:heHE.NeoiTreisEnVavyloni.text	
ltx/en_uk_ware/he.h.m4:heHE.NynAnastisomai.greekname	
ltx/en_uk_ware/he.h.m4:heHE.NynAnastisomai.incipit	…
ltx/en_uk_ware/he.h.m4:heHE.NynAnastisomai.melody	@ltx/en_uk_ware/miscellanea:misc.HeirmosNotMetered
ltx/en_uk_ware/he.h.m4:heHE.NynAnastisomai.mode	@ltx/en_uk_ware/miscellanea:misc.Mode4
ltx/en_uk_ware/he.h.m4:heHE.NynAnastisomai.name	(NM)
ltx/en_uk_ware/he.h.m4:heHE.NynAnastisomai.ode	@ltx/en_uk_ware/miscellanea:misc.Ode5
ltx/en_uk_ware/he.h.m4:heHE.NynAnastisomai.text	
ltx/en_uk_ware/he.h.m4:heHE.OAnateilasToFos.greekname	
ltx/en_uk_ware/he.h.m4:heHE.OAnateilasToFos.incipit	O Thou who hast caused the light…
ltx/en_uk_ware/he.h.m4:heHE.OAnateilasToFos.melody	@ltx/en_uk_ware/miscellanea:misc.HeirmosNotMetered
ltx/en_uk_ware/he.h.m4:heHE.OAnateilasToFos.mode	@ltx/en_uk_ware/miscellanea:misc.Mode4
ltx/en_uk_ware/he.h.m4:heHE.OAnateilasToFos.name	(NM) O Thou who hast caused the light.
ltx/en_uk_ware/he.h.m4:heHE.OAnateilasToFos.ode	@ltx/en_uk_ware/miscellanea:misc.Ode5
ltx/en_uk_ware/he.h.m4:heHE.OAnateilasToFos.text	O Thou who hast caused the light to shine, who hast made bright the dawn and revealed the day; glory to Thee, glory to Thee, O Jesus Son of God.
ltx/en_uk_ware/he.h.m4:heHE.ODiasosasEnPyri.greekname	
ltx/en_uk_ware/he.h.m4:heHE.ODiasosasEnPyri.incipit	…
ltx/en_uk_ware/he.h.m4:heHE.ODiasosasEnPyri.melody	@ltx/en_uk_ware/miscellanea:misc.HeirmosNotMetered
ltx/en_uk_ware/he.h.m4:heHE.ODiasosasEnPyri.mode	@ltx/en_uk_ware/miscellanea:misc.Mode4
ltx/en_uk_ware/he.h.m4:heHE.ODiasosasEnPyri.name	(NM)
ltx/en_uk_ware/he.h.m4:heHE.ODiasosasEnPyri.ode	@ltx/en_uk_ware/miscellanea:misc.Ode7
ltx/en_uk_ware/he.h.m4:heHE.ODiasosasEnPyri.text	
ltx/en_uk_ware/he.h.m4:heHE.OEnArchiAnarchos.greekname	
ltx/en_uk_ware/he.h.m4:heHE.OEnArchiAnarchos.incipit	…
ltx/en_uk_ware/he.h.m4:heHE.OEnArchiAnarchos.melody	@ltx/en_uk_ware/miscellanea:misc.HeirmosNotMetered
ltx/en_uk_ware/he.h.m4:heHE.OEnArchiAnarchos.mode	@ltx/en_uk_ware/miscellanea:misc.Mode4
ltx/en_uk_ware/he.h.m4:heHE.OEnArchiAnarchos.name	(NM)
ltx/en_uk_ware/he.h.m4:heHE.OEnArchiAnarchos.ode	@ltx/en_uk_ware/miscellanea:misc.Ode7
ltx/en_uk_ware/he.h.m4:heHE.OEnArchiAnarchos.text	
ltx/en_uk_ware/he.h.m4:heHE.OEnToOreiToMosei.greekname	
ltx/en_uk_ware/he.h.m4:heHE.OEnToOreiToMosei.incipit	Thou hast spoken with Moses…
ltx/en_uk_ware/he.h.m4:heHE.OEnToOreiToMosei.melody	@ltx/en_uk_ware/miscellanea:misc.HeirmosNotMetered
ltx/en_uk_ware/he.h.m4:heHE.OEnToOreiToMosei.mode	@ltx/en_uk_ware/miscellanea:misc.Mode4
ltx/en_uk_ware/he.h.m4:heHE.OEnToOreiToMosei.name	(NM) Thou hast spoken with Moses.
ltx/en_uk_ware/he.h.m4:heHE.OEnToOreiToMosei.ode	@ltx/en_uk_ware/miscellanea:misc.Ode7
ltx/en_uk_ware/he.h.m4:heHE.OEnToOreiToMosei.text	Thou hast spoken with Moses on the mountain and made the bush a figure of the Virgin: O Lord God of our fathers, blessed art Thou.
ltx/en_uk_ware/he.h.m4:heHE.OKathimenosEnDoxi.greekname	
ltx/en_uk_ware/he.h.m4:heHE.OKathimenosEnDoxi.incipit	He who sits in glory…
ltx/en_uk_ware/he.h.m4:heHE.OKathimenosEnDoxi.melody	@ltx/en_uk_ware/miscellanea:misc.HeirmosNotMetered
ltx/en_uk_ware/he.h.m4:heHE.OKathimenosEnDoxi.mode	@ltx/en_uk_ware/miscellanea:misc.Mode4
ltx/en_uk_ware/he.h.m4:heHE.OKathimenosEnDoxi.name	(NM) He who sits in glory.
ltx/en_uk_ware/he.h.m4:heHE.OKathimenosEnDoxi.ode	@ltx/en_uk_ware/miscellanea:misc.Ode4
ltx/en_uk_ware/he.h.m4:heHE.OKathimenosEnDoxi.text	He who sits in glory upon the throne of the Godhead…
ltx/en_uk_ware/he.h.m4:heHE.OKtisamenosImas.greekname	
ltx/en_uk_ware/he.h.m4:heHE.OKtisamenosImas.incipit	…
ltx/en_uk_ware/he.h.m4:heHE.OKtisamenosImas.melody	@ltx/en_uk_ware/miscellanea:misc.HeirmosNotMetered
ltx/en_uk_ware/he.h.m4:heHE.OKtisamenosImas.mode	@ltx/en_uk_ware/miscellanea:misc.Mode4
ltx/en_uk_ware/he.h.m4:heHE.OKtisamenosImas.name	(NM)
ltx/en_uk_ware/he.h.m4:heHE.OKtisamenosImas.ode	@ltx/en_uk_ware/miscellanea:misc.Ode5
ltx/en_uk_ware/he.h.m4:heHE.OKtisamenosImas.text	
ltx/en_uk_ware/he.h.m4:heHE.OPataxasAigypton.greekname	
ltx/en_uk_ware/he.h.m4:heHE.OPataxasAigypton.incipit	…
ltx/en_uk_ware/he.h.m4:heHE.OPataxasAigypton.melody	@ltx/en_uk_ware/miscellanea:misc.HeirmosNotMetered
ltx/en_uk_ware/he.h.m4:heHE.OPataxasAigypton.mode	@ltx/en_uk_ware/miscellanea:misc.Mode4
ltx/en_uk_ware/he.h.m4:heHE.OPataxasAigypton.name	(NM)
ltx/en_uk_ware/he.h.m4:heHE.OPataxasAigypton.ode	@ltx/en_uk_ware/miscellanea:misc.Ode1
ltx/en_uk_ware/he.h.m4:heHE.OPataxasAigypton.text	
ltx/en_uk_ware/he.h.m4:heHE.OStereonVrontin.greekname	
ltx/en_uk_ware/he.h.m4:heHE.OStereonVrontin.incipit	…
ltx/en_uk_ware/he.h.m4:heHE.OStereonVrontin.melody	@ltx/en_uk_ware/miscellanea:misc.HeirmosNotMetered
ltx/en_uk_ware/he.h.m4:heHE.OStereonVrontin.mode	@ltx/en_uk_ware/miscellanea:misc.Mode4
ltx/en_uk_ware/he.h.m4:heHE.OStereonVrontin.name	(NM)
ltx/en_uk_ware/he.h.m4:heHE.OStereonVrontin.ode	@ltx/en_uk_ware/miscellanea:misc.Ode3
ltx/en_uk_ware/he.h.m4:heHE.OStereonVrontin.text	
ltx/en_uk_ware/he.h.m4:heHE.OTaSympantaFeron.greekname	
ltx/en_uk_ware/he.h.m4:heHE.OTaSympantaFeron.incipit	…
ltx/en_uk_ware/he.h.m4:heHE.OTaSympantaFeron.melody	@ltx/en_uk_ware/miscellanea:misc.HeirmosNotMetered
ltx/en_uk_ware/he.h.m4:heHE.OTaSympantaFeron.mode	@ltx/en_uk_ware/miscellanea:misc.Mode4
ltx/en_uk_ware/he.h.m4:heHE.OTaSympantaFeron.name	(NM)
ltx/en_uk_ware/he.h.m4:heHE.OTaSympantaFeron.ode	@ltx/en_uk_ware/miscellanea:misc.Ode8
ltx/en_uk_ware/he.h.m4:heHE.OTaSympantaFeron.text	
ltx/en_uk_ware/he.h.m4:heHE.OTokosSouAfthoros.greekname	
ltx/en_uk_ware/he.h.m4:heHE.OTokosSouAfthoros.incipit	…
ltx/en_uk_ware/he.h.m4:heHE.OTokosSouAfthoros.melody	@ltx/en_uk_ware/miscellanea:misc.HeirmosNotMetered
ltx/en_uk_ware/he.h.m4:heHE.OTokosSouAfthoros.mode	@ltx/en_uk_ware/miscellanea:misc.Mode4
ltx/en_uk_ware/he.h.m4:heHE.OTokosSouAfthoros.name	(NM)
ltx/en_uk_ware/he.h.m4:heHE.OTokosSouAfthoros.ode	@ltx/en_uk_ware/miscellanea:misc.Ode9
ltx/en_uk_ware/he.h.m4:heHE.OTokosSouAfthoros.text	
ltx/en_uk_ware/he.h.m4:heHE.OTonPateronTheos.greekname	
ltx/en_uk_ware/he.h.m4:heHE.OTonPateronTheos.incipit	O God of our fathers…
ltx/en_uk_ware/he.h.m4:heHE.OTonPateronTheos.melody	@ltx/en_uk_ware/miscellanea:misc.HeirmosNotMetered
ltx/en_uk_ware/he.h.m4:heHE.OTonPateronTheos.mode	@ltx/en_uk_ware/miscellanea:misc.Mode4
ltx/en_uk_ware/he.h.m4:heHE.OTonPateronTheos.name	(NM) O God of our fathers.
ltx/en_uk_ware/he.h.m4:heHE.OTonPateronTheos.ode	@ltx/en_uk_ware/miscellanea:misc.Ode7
ltx/en_uk_ware/he.h.m4:heHE.OTonPateronTheos.text	O God of our fathers, put us not to shame, but enable us to sing with boldness unto Thee: O God, blessed art Thou.
ltx/en_uk_ware/he.h.m4:heHE.OTouFotosDiatmixas.greekname	
ltx/en_uk_ware/he.h.m4:heHE.OTouFotosDiatmixas.incipit	…
ltx/en_uk_ware/he.h.m4:heHE.OTouFotosDiatmixas.melody	@ltx/en_uk_ware/miscellanea:misc.HeirmosNotMetered
ltx/en_uk_ware/he.h.m4:heHE.OTouFotosDiatmixas.mode	@ltx/en_uk_ware/miscellanea:misc.Mode4
ltx/en_uk_ware/he.h.m4:heHE.OTouFotosDiatmixas.name	(NM)
ltx/en_uk_ware/he.h.m4:heHE.OTouFotosDiatmixas.ode	@ltx/en_uk_ware/miscellanea:misc.Ode5
ltx/en_uk_ware/he.h.m4:heHE.OTouFotosDiatmixas.text	
ltx/en_uk_ware/he.h.m4:heHE.OfthisanAiPigai.greekname	
ltx/en_uk_ware/he.h.m4:heHE.OfthisanAiPigai.incipit	…
ltx/en_uk_ware/he.h.m4:heHE.OfthisanAiPigai.melody	@ltx/en_uk_ware/miscellanea:misc.HeirmosNotMetered
ltx/en_uk_ware/he.h.m4:heHE.OfthisanAiPigai.mode	@ltx/en_uk_ware/miscellanea:misc.Mode4
ltx/en_uk_ware/he.h.m4:heHE.OfthisanAiPigai.name	(NM)
ltx/en_uk_ware/he.h.m4:heHE.OfthisanAiPigai.ode	@ltx/en_uk_ware/miscellanea:misc.Ode1
ltx/en_uk_ware/he.h.m4:heHE.OfthisanAiPigai.text	
ltx/en_uk_ware/he.h.m4:heHE.OiEnVavyloniPaides.greekname	
ltx/en_uk_ware/he.h.m4:heHE.OiEnVavyloniPaides.incipit	…
ltx/en_uk_ware/he.h.m4:heHE.OiEnVavyloniPaides.melody	@ltx/en_uk_ware/miscellanea:misc.HeirmosNotMetered
ltx/en_uk_ware/he.h.m4:heHE.OiEnVavyloniPaides.mode	@ltx/en_uk_ware/miscellanea:misc.Mode4
ltx/en_uk_ware/he.h.m4:heHE.OiEnVavyloniPaides.name	(NM)
ltx/en_uk_ware/he.h.m4:heHE.OiEnVavyloniPaides.ode	@ltx/en_uk_ware/miscellanea:misc.Ode8
ltx/en_uk_ware/he.h.m4:heHE.OiEnVavyloniPaides.text	
ltx/en_uk_ware/he.h.m4:heHE.OrthronFaeinon.greekname	
ltx/en_uk_ware/he.h.m4:heHE.OrthronFaeinon.incipit	…
ltx/en_uk_ware/he.h.m4:heHE.OrthronFaeinon.melody	@ltx/en_uk_ware/miscellanea:misc.HeirmosNotMetered
ltx/en_uk_ware/he.h.m4:heHE.OrthronFaeinon.mode	@ltx/en_uk_ware/miscellanea:misc.Mode4
ltx/en_uk_ware/he.h.m4:heHE.OrthronFaeinon.name	(NM)
ltx/en_uk_ware/he.h.m4:heHE.OrthronFaeinon.ode	@ltx/en_uk_ware/miscellanea:misc.Ode5
ltx/en_uk_ware/he.h.m4:heHE.OrthronFaeinon.text	
ltx/en_uk_ware/he.h.m4:heHE.OsEmpsychoTheouKivoto.greekname	
ltx/en_uk_ware/he.h.m4:heHE.OsEmpsychoTheouKivoto.incipit	…
ltx/en_uk_ware/he.h.m4:heHE.OsEmpsychoTheouKivoto.melody	@ltx/en_uk_ware/miscellanea:misc.HeirmosNotMetered
ltx/en_uk_ware/he.h.m4:heHE.OsEmpsychoTheouKivoto.mode	@ltx/en_uk_ware/miscellanea:misc.Mode4
ltx/en_uk_ware/he.h.m4:heHE.OsEmpsychoTheouKivoto.name	(NM)
ltx/en_uk_ware/he.h.m4:heHE.OsEmpsychoTheouKivoto.ode	@ltx/en_uk_ware/miscellanea:misc.Ode9
ltx/en_uk_ware/he.h.m4:heHE.OsEmpsychoTheouKivoto.text	
ltx/en_uk_ware/he.h.m4:heHE.OsEmpsychoTheouKivotoAnnunciation.greekname	
ltx/en_uk_ware/he.h.m4:heHE.OsEmpsychoTheouKivotoAnnunciation.incipit	…
ltx/en_uk_ware/he.h.m4:heHE.OsEmpsychoTheouKivotoAnnunciation.melody	@ltx/en_uk_ware/miscellanea:misc.HeirmosNotMetered
ltx/en_uk_ware/he.h.m4:heHE.OsEmpsychoTheouKivotoAnnunciation.mode	@ltx/en_uk_ware/miscellanea:misc.Mode4
ltx/en_uk_ware/he.h.m4:heHE.OsEmpsychoTheouKivotoAnnunciation.name	(NM)
ltx/en_uk_ware/he.h.m4:heHE.OsEmpsychoTheouKivotoAnnunciation.ode	@ltx/en_uk_ware/miscellanea:misc.Ode9
ltx/en_uk_ware/he.h.m4:heHE.OsEmpsychoTheouKivotoAnnunciation.text	
ltx/en_uk_ware/he.h.m4:heHE.OsEmpsychoTheouKivoto_Annunciation.greekname	@ltx/en_uk_ware/properties:deprecated.key
ltx/en_uk_ware/he.h.m4:heHE.OsEmpsychoTheouKivoto_Annunciation.incipit	@ltx/en_uk_ware/properties:deprecated.key
ltx/en_uk_ware/he.h.m4:heHE.OsEmpsychoTheouKivoto_Annunciation.melody	@ltx/en_uk_ware/properties:deprecated.key
ltx/en_uk_ware/he.h.m4:heHE.OsEmpsychoTheouKivoto_Annunciation.mode	@ltx/en_uk_ware/properties:deprecated.key
ltx/en_uk_ware/he.h.m4:heHE.OsEmpsychoTheouKivoto_Annunciation.name	@ltx/en_uk_ware/properties:deprecated.key
ltx/en_uk_ware/he.h.m4:heHE.OsEmpsychoTheouKivoto_Annunciation.ode	@ltx/en_uk_ware/properties:deprecated.key
ltx/en_uk_ware/he.h.m4:heHE.OsEmpsychoTheouKivoto_Annunciation.text	@ltx/en_uk_ware/properties:deprecated.key
ltx/en_uk_ware/he.h.m4:heHE.OsIonanTonProfitin.greekname	
ltx/en_uk_ware/he.h.m4:heHE.OsIonanTonProfitin.incipit	O Christ my God…
ltx/en_uk_ware/he.h.m4:heHE.OsIonanTonProfitin.melody	@ltx/en_uk_ware/miscellanea:misc.HeirmosNotMetered
ltx/en_uk_ware/he.h.m4:heHE.OsIonanTonProfitin.mode	@ltx/en_uk_ware/miscellanea:misc.Mode4
ltx/en_uk_ware/he.h.m4:heHE.OsIonanTonProfitin.name	(NM) O Christ my God.
ltx/en_uk_ware/he.h.m4:heHE.OsIonanTonProfitin.ode	@ltx/en_uk_ware/miscellanea:misc.Ode6
ltx/en_uk_ware/he.h.m4:heHE.OsIonanTonProfitin.text	O Christ my God, Thou hast delivered Jonah the prophet from the whale: bring me out also from the depth of my offences and save me, for Thou alone lovest mankind.
ltx/en_uk_ware/he.h.m4:heHE.OtiEpoiiseMoiMegaleia.greekname	
ltx/en_uk_ware/he.h.m4:heHE.OtiEpoiiseMoiMegaleia.incipit	For He that is mighty…
ltx/en_uk_ware/he.h.m4:heHE.OtiEpoiiseMoiMegaleia.melody	@ltx/en_uk_ware/miscellanea:misc.HeirmosNotMetered
ltx/en_uk_ware/he.h.m4:heHE.OtiEpoiiseMoiMegaleia.mode	@ltx/en_uk_ware/miscellanea:misc.Mode4
ltx/en_uk_ware/he.h.m4:heHE.OtiEpoiiseMoiMegaleia.name	(NM) For He that is mighty.
ltx/en_uk_ware/he.h.m4:heHE.OtiEpoiiseMoiMegaleia.ode	@ltx/en_uk_ware/miscellanea:misc.Ode9
ltx/en_uk_ware/he.h.m4:heHE.OtiEpoiiseMoiMegaleia.text	
ltx/en_uk_ware/he.h.m4:heHE.OtiSteiraEteken.greekname	
ltx/en_uk_ware/he.h.m4:heHE.OtiSteiraEteken.incipit	…
ltx/en_uk_ware/he.h.m4:heHE.OtiSteiraEteken.melody	@ltx/en_uk_ware/miscellanea:misc.HeirmosNotMetered
ltx/en_uk_ware/he.h.m4:heHE.OtiSteiraEteken.mode	@ltx/en_uk_ware/miscellanea:misc.Mode4
ltx/en_uk_ware/he.h.m4:heHE.OtiSteiraEteken.name	(NM)
ltx/en_uk_ware/he.h.m4:heHE.OtiSteiraEteken.ode	@ltx/en_uk_ware/miscellanea:misc.Ode3
ltx/en_uk_ware/he.h.m4:heHE.OtiSteiraEteken.text	
ltx/en_uk_ware/he.h.m4:heHE.OukElatrefsan.greekname	
ltx/en_uk_ware/he.h.m4:heHE.OukElatrefsan.incipit	…
ltx/en_uk_ware/he.h.m4:heHE.OukElatrefsan.melody	@ltx/en_uk_ware/miscellanea:misc.HeirmosNotMetered
ltx/en_uk_ware/he.h.m4:heHE.OukElatrefsan.mode	@ltx/en_uk_ware/miscellanea:misc.Mode4
ltx/en_uk_ware/he.h.m4:heHE.OukElatrefsan.name	(NM)
ltx/en_uk_ware/he.h.m4:heHE.OukElatrefsan.ode	@ltx/en_uk_ware/miscellanea:misc.Ode7
ltx/en_uk_ware/he.h.m4:heHE.OukElatrefsan.text	
ltx/en_uk_ware/he.h.m4:heHE.OukEnSofia.greekname	
ltx/en_uk_ware/he.h.m4:heHE.OukEnSofia.incipit	…
ltx/en_uk_ware/he.h.m4:heHE.OukEnSofia.melody	@ltx/en_uk_ware/miscellanea:misc.HeirmosNotMetered
ltx/en_uk_ware/he.h.m4:heHE.OukEnSofia.mode	@ltx/en_uk_ware/miscellanea:misc.Mode4
ltx/en_uk_ware/he.h.m4:heHE.OukEnSofia.name	(NM)
ltx/en_uk_ware/he.h.m4:heHE.OukEnSofia.ode	@ltx/en_uk_ware/miscellanea:misc.Ode3
ltx/en_uk_ware/he.h.m4:heHE.OukEnSofia.text	
ltx/en_uk_ware/he.h.m4:heHE.OukEstiSoiOmoios.greekname	
ltx/en_uk_ware/he.h.m4:heHE.OukEstiSoiOmoios.incipit	…
ltx/en_uk_ware/he.h.m4:heHE.OukEstiSoiOmoios.melody	@ltx/en_uk_ware/miscellanea:misc.HeirmosNotMetered
ltx/en_uk_ware/he.h.m4:heHE.OukEstiSoiOmoios.mode	@ltx/en_uk_ware/miscellanea:misc.Mode4
ltx/en_uk_ware/he.h.m4:heHE.OukEstiSoiOmoios.name	(NM)
ltx/en_uk_ware/he.h.m4:heHE.OukEstiSoiOmoios.ode	@ltx/en_uk_ware/miscellanea:misc.Ode1
ltx/en_uk_ware/he.h.m4:heHE.OukEstiSoiOmoios.text	
ltx/en_uk_ware/he.h.m4:heHE.OutosOTheosImon.greekname	
ltx/en_uk_ware/he.h.m4:heHE.OutosOTheosImon.incipit	…
ltx/en_uk_ware/he.h.m4:heHE.OutosOTheosImon.melody	@ltx/en_uk_ware/miscellanea:misc.HeirmosNotMetered
ltx/en_uk_ware/he.h.m4:heHE.OutosOTheosImon.mode	@ltx/en_uk_ware/miscellanea:misc.Mode4
ltx/en_uk_ware/he.h.m4:heHE.OutosOTheosImon.name	(NM)
ltx/en_uk_ware/he.h.m4:heHE.OutosOTheosImon.ode	@ltx/en_uk_ware/miscellanea:misc.Ode4
ltx/en_uk_ware/he.h.m4:heHE.OutosOTheosImon.text	
ltx/en_uk_ware/he.h.m4:heHE.PaidasEvageis.greekname	
ltx/en_uk_ware/he.h.m4:heHE.PaidasEvageis.incipit	The Offspring of the Theotokos…
ltx/en_uk_ware/he.h.m4:heHE.PaidasEvageis.melody	@ltx/en_uk_ware/miscellanea:misc.HeirmosNotMetered
ltx/en_uk_ware/he.h.m4:heHE.PaidasEvageis.mode	@ltx/en_uk_ware/miscellanea:misc.Mode4
ltx/en_uk_ware/he.h.m4:heHE.PaidasEvageis.name	(NM) The Offspring of the Theotokos.
ltx/en_uk_ware/he.h.m4:heHE.PaidasEvageis.ode	@ltx/en_uk_ware/miscellanea:misc.Ode8
ltx/en_uk_ware/he.h.m4:heHE.PaidasEvageis.text	
ltx/en_uk_ware/he.h.m4:heHE.PantaTaErgaTouTheou.greekname	
ltx/en_uk_ware/he.h.m4:heHE.PantaTaErgaTouTheou.incipit	O all ye works of God…
ltx/en_uk_ware/he.h.m4:heHE.PantaTaErgaTouTheou.melody	@ltx/en_uk_ware/miscellanea:misc.HeirmosNotMetered
ltx/en_uk_ware/he.h.m4:heHE.PantaTaErgaTouTheou.mode	@ltx/en_uk_ware/miscellanea:misc.Mode4
ltx/en_uk_ware/he.h.m4:heHE.PantaTaErgaTouTheou.name	(NM) O all ye works of God.
ltx/en_uk_ware/he.h.m4:heHE.PantaTaErgaTouTheou.ode	@ltx/en_uk_ware/miscellanea:misc.Ode8
ltx/en_uk_ware/he.h.m4:heHE.PantaTaErgaTouTheou.text	O all ye works of God and all creation, O ye holy and humble men of heart, bless ye the Lord: O ye peoples praise Him and exalt Him above all for ever.
ltx/en_uk_ware/he.h.m4:heHE.ParthenosMartysPolyathlos.greekname	
ltx/en_uk_ware/he.h.m4:heHE.ParthenosMartysPolyathlos.incipit	…
ltx/en_uk_ware/he.h.m4:heHE.ParthenosMartysPolyathlos.melody	@ltx/en_uk_ware/miscellanea:misc.HeirmosNotMetered
ltx/en_uk_ware/he.h.m4:heHE.ParthenosMartysPolyathlos.mode	@ltx/en_uk_ware/miscellanea:misc.Mode4
ltx/en_uk_ware/he.h.m4:heHE.ParthenosMartysPolyathlos.name	(NM)
ltx/en_uk_ware/he.h.m4:heHE.ParthenosMartysPolyathlos.ode	@ltx/en_uk_ware/miscellanea:misc.Ode9
ltx/en_uk_ware/he.h.m4:heHE.ParthenosMartysPolyathlos.text	
ltx/en_uk_ware/he.h.m4:heHE.PyrFlegonEnKamino.greekname	
ltx/en_uk_ware/he.h.m4:heHE.PyrFlegonEnKamino.incipit	…
ltx/en_uk_ware/he.h.m4:heHE.PyrFlegonEnKamino.melody	@ltx/en_uk_ware/miscellanea:misc.HeirmosNotMetered
ltx/en_uk_ware/he.h.m4:heHE.PyrFlegonEnKamino.mode	@ltx/en_uk_ware/miscellanea:misc.Mode4
ltx/en_uk_ware/he.h.m4:heHE.PyrFlegonEnKamino.name	(NM)
ltx/en_uk_ware/he.h.m4:heHE.PyrFlegonEnKamino.ode	@ltx/en_uk_ware/miscellanea:misc.Ode7
ltx/en_uk_ware/he.h.m4:heHE.PyrFlegonEnKamino.text	
ltx/en_uk_ware/he.h.m4:heHE.SeTinApeirogamon.greekname	
ltx/en_uk_ware/he.h.m4:heHE.SeTinApeirogamon.incipit	…
ltx/en_uk_ware/he.h.m4:heHE.SeTinApeirogamon.melody	@ltx/en_uk_ware/miscellanea:misc.HeirmosNotMetered
ltx/en_uk_ware/he.h.m4:heHE.SeTinApeirogamon.mode	@ltx/en_uk_ware/miscellanea:misc.Mode4
ltx/en_uk_ware/he.h.m4:heHE.SeTinApeirogamon.name	(NM)
ltx/en_uk_ware/he.h.m4:heHE.SeTinApeirogamon.ode	@ltx/en_uk_ware/miscellanea:misc.Ode9
ltx/en_uk_ware/he.h.m4:heHE.SeTinApeirogamon.text	
ltx/en_uk_ware/he.h.m4:heHE.SeTinYperendoxonNymfin.greekname	
ltx/en_uk_ware/he.h.m4:heHE.SeTinYperendoxonNymfin.incipit	…
ltx/en_uk_ware/he.h.m4:heHE.SeTinYperendoxonNymfin.melody	@ltx/en_uk_ware/miscellanea:misc.HeirmosNotMetered
ltx/en_uk_ware/he.h.m4:heHE.SeTinYperendoxonNymfin.mode	@ltx/en_uk_ware/miscellanea:misc.Mode4
ltx/en_uk_ware/he.h.m4:heHE.SeTinYperendoxonNymfin.name	(NM)
ltx/en_uk_ware/he.h.m4:heHE.SeTinYperendoxonNymfin.ode	@ltx/en_uk_ware/miscellanea:misc.Ode9
ltx/en_uk_ware/he.h.m4:heHE.SeTinYperendoxonNymfin.text	
ltx/en_uk_ware/he.h.m4:heHE.SyKyrieMouFos.greekname	
ltx/en_uk_ware/he.h.m4:heHE.SyKyrieMouFos.incipit	…
ltx/en_uk_ware/he.h.m4:heHE.SyKyrieMouFos.melody	@ltx/en_uk_ware/miscellanea:misc.HeirmosNotMetered
ltx/en_uk_ware/he.h.m4:heHE.SyKyrieMouFos.mode	@ltx/en_uk_ware/miscellanea:misc.Mode4
ltx/en_uk_ware/he.h.m4:heHE.SyKyrieMouFos.name	(NM)
ltx/en_uk_ware/he.h.m4:heHE.SyKyrieMouFos.ode	@ltx/en_uk_ware/miscellanea:misc.Ode5
ltx/en_uk_ware/he.h.m4:heHE.SyKyrieMouFos.text	
ltx/en_uk_ware/he.h.m4:heHE.SymfononEthroisen.greekname	
ltx/en_uk_ware/he.h.m4:heHE.SymfononEthroisen.incipit	…
ltx/en_uk_ware/he.h.m4:heHE.SymfononEthroisen.melody	@ltx/en_uk_ware/miscellanea:misc.HeirmosNotMetered
ltx/en_uk_ware/he.h.m4:heHE.SymfononEthroisen.mode	@ltx/en_uk_ware/miscellanea:misc.Mode4
ltx/en_uk_ware/he.h.m4:heHE.SymfononEthroisen.name	(NM)
ltx/en_uk_ware/he.h.m4:heHE.SymfononEthroisen.ode	@ltx/en_uk_ware/miscellanea:misc.Ode7
ltx/en_uk_ware/he.h.m4:heHE.SymfononEthroisen.text	
ltx/en_uk_ware/he.h.m4:heHE.SymfononEthroisen1.text	
ltx/en_uk_ware/he.h.m4:heHE.SymfononEthroisen2.text	
ltx/en_uk_ware/he.h.m4:heHE.SymfononEthroisen3.text	
ltx/en_uk_ware/he.h.m4:heHE.SymfononEthroisen4.text	
ltx/en_uk_ware/he.h.m4:heHE.SymfononEthroisen5.text	
ltx/en_uk_ware/he.h.m4:heHE.TaSympantaDespota.greekname	
ltx/en_uk_ware/he.h.m4:heHE.TaSympantaDespota.incipit	In Thy wisdom, O Master…
ltx/en_uk_ware/he.h.m4:heHE.TaSympantaDespota.melody	@ltx/en_uk_ware/miscellanea:misc.HeirmosNotMetered
ltx/en_uk_ware/he.h.m4:heHE.TaSympantaDespota.mode	@ltx/en_uk_ware/miscellanea:misc.Mode4
ltx/en_uk_ware/he.h.m4:heHE.TaSympantaDespota.name	(NM) In Thy wisdom, O Master.
ltx/en_uk_ware/he.h.m4:heHE.TaSympantaDespota.ode	@ltx/en_uk_ware/miscellanea:misc.Ode8
ltx/en_uk_ware/he.h.m4:heHE.TaSympantaDespota.text	
ltx/en_uk_ware/he.h.m4:heHE.ThalassisToErythraion.greekname	
ltx/en_uk_ware/he.h.m4:heHE.ThalassisToErythraion.incipit	…
ltx/en_uk_ware/he.h.m4:heHE.ThalassisToErythraion.melody	@ltx/en_uk_ware/miscellanea:misc.HeirmosNotMetered
ltx/en_uk_ware/he.h.m4:heHE.ThalassisToErythraion.mode	@ltx/en_uk_ware/miscellanea:misc.Mode4
ltx/en_uk_ware/he.h.m4:heHE.ThalassisToErythraion.name	(NM)
ltx/en_uk_ware/he.h.m4:heHE.ThalassisToErythraion.ode	@ltx/en_uk_ware/miscellanea:misc.Ode1
ltx/en_uk_ware/he.h.m4:heHE.ThalassisToErythraion.text	
ltx/en_uk_ware/he.h.m4:heHE.TheioKalyftheis.greekname	
ltx/en_uk_ware/he.h.m4:heHE.TheioKalyftheis.incipit	…
ltx/en_uk_ware/he.h.m4:heHE.TheioKalyftheis.melody	@ltx/en_uk_ware/miscellanea:misc.HeirmosNotMetered
ltx/en_uk_ware/he.h.m4:heHE.TheioKalyftheis.mode	@ltx/en_uk_ware/miscellanea:misc.Mode4
ltx/en_uk_ware/he.h.m4:heHE.TheioKalyftheis.name	(NM)
ltx/en_uk_ware/he.h.m4:heHE.TheioKalyftheis.ode	@ltx/en_uk_ware/miscellanea:misc.Ode1
ltx/en_uk_ware/he.h.m4:heHE.TheioKalyftheis.text	
ltx/en_uk_ware/he.h.m4:heHE.TheioKalyftheis1.text	
ltx/en_uk_ware/he.h.m4:heHE.TheioKalyftheis2.text	
ltx/en_uk_ware/he.h.m4:heHE.TheioKalyftheis3.text	
ltx/en_uk_ware/he.h.m4:heHE.TheioKalyftheis4.text	
ltx/en_uk_ware/he.h.m4:heHE.TheioKalyftheis5.text	
ltx/en_uk_ware/he.h.m4:heHE.TheosKyriosKaiEpefanenImin.greekname	
ltx/en_uk_ware/he.h.m4:heHE.TheosKyriosKaiEpefanenImin.incipit	…
ltx/en_uk_ware/he.h.m4:heHE.TheosKyriosKaiEpefanenImin.melody	@ltx/en_uk_ware/miscellanea:misc.HeirmosNotMetered
ltx/en_uk_ware/he.h.m4:heHE.TheosKyriosKaiEpefanenImin.mode	@ltx/en_uk_ware/miscellanea:misc.Mode4
ltx/en_uk_ware/he.h.m4:heHE.TheosKyriosKaiEpefanenImin.name	(NM)
ltx/en_uk_ware/he.h.m4:heHE.TheosKyriosKaiEpefanenImin.ode	@ltx/en_uk_ware/miscellanea:misc.Ode9
ltx/en_uk_ware/he.h.m4:heHE.TheosKyriosKaiEpefanenImin.text	
ltx/en_uk_ware/he.h.m4:heHE.ThysoSoiMetaFonis.greekname	
ltx/en_uk_ware/he.h.m4:heHE.ThysoSoiMetaFonis.incipit	…
ltx/en_uk_ware/he.h.m4:heHE.ThysoSoiMetaFonis.melody	@ltx/en_uk_ware/miscellanea:misc.HeirmosNotMetered
ltx/en_uk_ware/he.h.m4:heHE.ThysoSoiMetaFonis.mode	@ltx/en_uk_ware/miscellanea:misc.Mode4
ltx/en_uk_ware/he.h.m4:heHE.ThysoSoiMetaFonis.name	(NM)
ltx/en_uk_ware/he.h.m4:heHE.ThysoSoiMetaFonis.ode	@ltx/en_uk_ware/miscellanea:misc.Ode6
ltx/en_uk_ware/he.h.m4:heHE.ThysoSoiMetaFonis.text	
ltx/en_uk_ware/he.h.m4:heHE.TiEikoniTiChrysi.greekname	
ltx/en_uk_ware/he.h.m4:heHE.TiEikoniTiChrysi.incipit	…
ltx/en_uk_ware/he.h.m4:heHE.TiEikoniTiChrysi.melody	@ltx/en_uk_ware/miscellanea:misc.HeirmosNotMetered
ltx/en_uk_ware/he.h.m4:heHE.TiEikoniTiChrysi.mode	@ltx/en_uk_ware/miscellanea:misc.Mode4
ltx/en_uk_ware/he.h.m4:heHE.TiEikoniTiChrysi.name	(NM)
ltx/en_uk_ware/he.h.m4:heHE.TiEikoniTiChrysi.ode	@ltx/en_uk_ware/miscellanea:misc.Ode7
ltx/en_uk_ware/he.h.m4:heHE.TiEikoniTiChrysi.text	
ltx/en_uk_ware/he.h.m4:heHE.TinAnexichniaston.greekname	
ltx/en_uk_ware/he.h.m4:heHE.TinAnexichniaston.incipit	…
ltx/en_uk_ware/he.h.m4:heHE.TinAnexichniaston.melody	@ltx/en_uk_ware/miscellanea:misc.HeirmosNotMetered
ltx/en_uk_ware/he.h.m4:heHE.TinAnexichniaston.mode	@ltx/en_uk_ware/miscellanea:misc.Mode4
ltx/en_uk_ware/he.h.m4:heHE.TinAnexichniaston.name	(NM)
ltx/en_uk_ware/he.h.m4:heHE.TinAnexichniaston.ode	@ltx/en_uk_ware/miscellanea:misc.Ode4
ltx/en_uk_ware/he.h.m4:heHE.TinAnexichniaston.text	
ltx/en_uk_ware/he.h.m4:heHE.TinSionEpOrous.greekname	
ltx/en_uk_ware/he.h.m4:heHE.TinSionEpOrous.incipit	…
ltx/en_uk_ware/he.h.m4:heHE.TinSionEpOrous.melody	@ltx/en_uk_ware/miscellanea:misc.HeirmosNotMetered
ltx/en_uk_ware/he.h.m4:heHE.TinSionEpOrous.mode	@ltx/en_uk_ware/miscellanea:misc.Mode4
ltx/en_uk_ware/he.h.m4:heHE.TinSionEpOrous.name	(NM)
ltx/en_uk_ware/he.h.m4:heHE.TinSionEpOrous.ode	@ltx/en_uk_ware/miscellanea:misc.Ode5
ltx/en_uk_ware/he.h.m4:heHE.TinSionEpOrous.text	
ltx/en_uk_ware/he.h.m4:heHE.TinTheianTaftin.greekname	
ltx/en_uk_ware/he.h.m4:heHE.TinTheianTaftin.incipit	…
ltx/en_uk_ware/he.h.m4:heHE.TinTheianTaftin.melody	@ltx/en_uk_ware/miscellanea:misc.HeirmosNotMetered
ltx/en_uk_ware/he.h.m4:heHE.TinTheianTaftin.mode	@ltx/en_uk_ware/miscellanea:misc.Mode4
ltx/en_uk_ware/he.h.m4:heHE.TinTheianTaftin.name	(NM)
ltx/en_uk_ware/he.h.m4:heHE.TinTheianTaftin.ode	@ltx/en_uk_ware/miscellanea:misc.Ode6
ltx/en_uk_ware/he.h.m4:heHE.TinTheianTaftin.text	
ltx/en_uk_ware/he.h.m4:heHE.TisSisEpiGis.greekname	
ltx/en_uk_ware/he.h.m4:heHE.TisSisEpiGis.incipit	…
ltx/en_uk_ware/he.h.m4:heHE.TisSisEpiGis.melody	@ltx/en_uk_ware/miscellanea:misc.HeirmosNotMetered
ltx/en_uk_ware/he.h.m4:heHE.TisSisEpiGis.mode	@ltx/en_uk_ware/miscellanea:misc.Mode4
ltx/en_uk_ware/he.h.m4:heHE.TisSisEpiGis.name	(NM)
ltx/en_uk_ware/he.h.m4:heHE.TisSisEpiGis.ode	@ltx/en_uk_ware/miscellanea:misc.Ode4
ltx/en_uk_ware/he.h.m4:heHE.TisSisEpiGis.text	
ltx/en_uk_ware/he.h.m4:heHE.ToOdigisantiPalai.greekname	
ltx/en_uk_ware/he.h.m4:heHE.ToOdigisantiPalai.incipit	…
ltx/en_uk_ware/he.h.m4:heHE.ToOdigisantiPalai.melody	@ltx/en_uk_ware/miscellanea:misc.HeirmosNotMetered
ltx/en_uk_ware/he.h.m4:heHE.ToOdigisantiPalai.mode	@ltx/en_uk_ware/miscellanea:misc.Mode4
ltx/en_uk_ware/he.h.m4:heHE.ToOdigisantiPalai.name	(NM)
ltx/en_uk_ware/he.h.m4:heHE.ToOdigisantiPalai.ode	@ltx/en_uk_ware/miscellanea:misc.Ode1
ltx/en_uk_ware/he.h.m4:heHE.ToOdigisantiPalai.text	
ltx/en_uk_ware/he.h.m4:heHE.ToStereoma.greekname	
ltx/en_uk_ware/he.h.m4:heHE.ToStereoma.incipit	…
ltx/en_uk_ware/he.h.m4:heHE.ToStereoma.melody	@ltx/en_uk_ware/miscellanea:misc.HeirmosNotMetered
ltx/en_uk_ware/he.h.m4:heHE.ToStereoma.mode	@ltx/en_uk_ware/miscellanea:misc.Mode4
ltx/en_uk_ware/he.h.m4:heHE.ToStereoma.name	(NM)
ltx/en_uk_ware/he.h.m4:heHE.ToStereoma.ode	@ltx/en_uk_ware/miscellanea:misc.Ode3
ltx/en_uk_ware/he.h.m4:heHE.ToStereoma.text	
ltx/en_uk_ware/he.h.m4:heHE.TonAsporonTokonSou.greekname	
ltx/en_uk_ware/he.h.m4:heHE.TonAsporonTokonSou.incipit	O Theotokos undefiled…
ltx/en_uk_ware/he.h.m4:heHE.TonAsporonTokonSou.melody	@ltx/en_uk_ware/miscellanea:misc.HeirmosNotMetered
ltx/en_uk_ware/he.h.m4:heHE.TonAsporonTokonSou.mode	@ltx/en_uk_ware/miscellanea:misc.Mode4
ltx/en_uk_ware/he.h.m4:heHE.TonAsporonTokonSou.name	(NM) O Theotokos undefiled.
ltx/en_uk_ware/he.h.m4:heHE.TonAsporonTokonSou.ode	@ltx/en_uk_ware/miscellanea:misc.Ode9
ltx/en_uk_ware/he.h.m4:heHE.TonAsporonTokonSou.text	O Theotokos undefiled, with never-silent hymns we magnify thine Offspring born without seed, Christ our God.
ltx/en_uk_ware/he.h.m4:heHE.TonEnKaminoTouPyros.greekname	
ltx/en_uk_ware/he.h.m4:heHE.TonEnKaminoTouPyros.incipit	…
ltx/en_uk_ware/he.h.m4:heHE.TonEnKaminoTouPyros.melody	@ltx/en_uk_ware/miscellanea:misc.HeirmosNotMetered
ltx/en_uk_ware/he.h.m4:heHE.TonEnKaminoTouPyros.mode	@ltx/en_uk_ware/miscellanea:misc.Mode4
ltx/en_uk_ware/he.h.m4:heHE.TonEnKaminoTouPyros.name	(NM)
ltx/en_uk_ware/he.h.m4:heHE.TonEnKaminoTouPyros.ode	@ltx/en_uk_ware/miscellanea:misc.Ode8
ltx/en_uk_ware/he.h.m4:heHE.TonEnKaminoTouPyros.text	
ltx/en_uk_ware/he.h.m4:heHE.TonEnKaminoTousPaidas.greekname	
ltx/en_uk_ware/he.h.m4:heHE.TonEnKaminoTousPaidas.incipit	…
ltx/en_uk_ware/he.h.m4:heHE.TonEnKaminoTousPaidas.melody	@ltx/en_uk_ware/miscellanea:misc.HeirmosNotMetered
ltx/en_uk_ware/he.h.m4:heHE.TonEnKaminoTousPaidas.mode	@ltx/en_uk_ware/miscellanea:misc.Mode4
ltx/en_uk_ware/he.h.m4:heHE.TonEnKaminoTousPaidas.name	(NM)
ltx/en_uk_ware/he.h.m4:heHE.TonEnKaminoTousPaidas.ode	@ltx/en_uk_ware/miscellanea:misc.Ode7
ltx/en_uk_ware/he.h.m4:heHE.TonEnKaminoTousPaidas.text	
ltx/en_uk_ware/he.h.m4:heHE.TonEnMorfiAngelou.greekname	
ltx/en_uk_ware/he.h.m4:heHE.TonEnMorfiAngelou.incipit	…
ltx/en_uk_ware/he.h.m4:heHE.TonEnMorfiAngelou.melody	@ltx/en_uk_ware/miscellanea:misc.HeirmosNotMetered
ltx/en_uk_ware/he.h.m4:heHE.TonEnMorfiAngelou.mode	@ltx/en_uk_ware/miscellanea:misc.Mode4
ltx/en_uk_ware/he.h.m4:heHE.TonEnMorfiAngelou.name	(NM)
ltx/en_uk_ware/he.h.m4:heHE.TonEnMorfiAngelou.ode	@ltx/en_uk_ware/miscellanea:misc.Ode8
ltx/en_uk_ware/he.h.m4:heHE.TonEnMorfiAngelou.text	
ltx/en_uk_ware/he.h.m4:heHE.TonEnToStavro.greekname	
ltx/en_uk_ware/he.h.m4:heHE.TonEnToStavro.incipit	…
ltx/en_uk_ware/he.h.m4:heHE.TonEnToStavro.melody	@ltx/en_uk_ware/miscellanea:misc.HeirmosNotMetered
ltx/en_uk_ware/he.h.m4:heHE.TonEnToStavro.mode	@ltx/en_uk_ware/miscellanea:misc.Mode4
ltx/en_uk_ware/he.h.m4:heHE.TonEnToStavro.name	(NM)
ltx/en_uk_ware/he.h.m4:heHE.TonEnToStavro.ode	@ltx/en_uk_ware/miscellanea:misc.Ode8
ltx/en_uk_ware/he.h.m4:heHE.TonEnToStavro.text	
ltx/en_uk_ware/he.h.m4:heHE.TonEnToStavroSarki.greekname	
ltx/en_uk_ware/he.h.m4:heHE.TonEnToStavroSarki.incipit	…
ltx/en_uk_ware/he.h.m4:heHE.TonEnToStavroSarki.melody	@ltx/en_uk_ware/miscellanea:misc.HeirmosNotMetered
ltx/en_uk_ware/he.h.m4:heHE.TonEnToStavroSarki.mode	@ltx/en_uk_ware/miscellanea:misc.Mode4
ltx/en_uk_ware/he.h.m4:heHE.TonEnToStavroSarki.name	(NM)
ltx/en_uk_ware/he.h.m4:heHE.TonEnToStavroSarki.ode	@ltx/en_uk_ware/miscellanea:misc.Ode8
ltx/en_uk_ware/he.h.m4:heHE.TonEnToStavroSarki.text	
ltx/en_uk_ware/he.h.m4:heHE.TonFotismonSouKyrie.greekname	
ltx/en_uk_ware/he.h.m4:heHE.TonFotismonSouKyrie.incipit	…
ltx/en_uk_ware/he.h.m4:heHE.TonFotismonSouKyrie.melody	@ltx/en_uk_ware/miscellanea:misc.HeirmosNotMetered
ltx/en_uk_ware/he.h.m4:heHE.TonFotismonSouKyrie.mode	@ltx/en_uk_ware/miscellanea:misc.Mode4
ltx/en_uk_ware/he.h.m4:heHE.TonFotismonSouKyrie.name	(NM)
ltx/en_uk_ware/he.h.m4:heHE.TonFotismonSouKyrie.ode	@ltx/en_uk_ware/miscellanea:misc.Ode5
ltx/en_uk_ware/he.h.m4:heHE.TonFotismonSouKyrie.text	
ltx/en_uk_ware/he.h.m4:heHE.TonPtaismatonTiZali.greekname	
ltx/en_uk_ware/he.h.m4:heHE.TonPtaismatonTiZali.incipit	Drowning in the tempest…
ltx/en_uk_ware/he.h.m4:heHE.TonPtaismatonTiZali.melody	@ltx/en_uk_ware/miscellanea:misc.HeirmosNotMetered
ltx/en_uk_ware/he.h.m4:heHE.TonPtaismatonTiZali.mode	@ltx/en_uk_ware/miscellanea:misc.Mode4
ltx/en_uk_ware/he.h.m4:heHE.TonPtaismatonTiZali.name	(NM) Drowning in the tempest.
ltx/en_uk_ware/he.h.m4:heHE.TonPtaismatonTiZali.ode	@ltx/en_uk_ware/miscellanea:misc.Ode6
ltx/en_uk_ware/he.h.m4:heHE.TonPtaismatonTiZali.text	Drowning in the tempest of my sins, and as though imprison­ ed in the belly of the whale, with the Prophet I cry our to Thee: Bring up my life from corruption, O Lord, and save me.
ltx/en_uk_ware/he.h.m4:heHE.TonVasileaChriston.greekname	
ltx/en_uk_ware/he.h.m4:heHE.TonVasileaChriston.incipit	The Children, prisoners…
ltx/en_uk_ware/he.h.m4:heHE.TonVasileaChriston.melody	@ltx/en_uk_ware/miscellanea:misc.HeirmosNotMetered
ltx/en_uk_ware/he.h.m4:heHE.TonVasileaChriston.mode	@ltx/en_uk_ware/miscellanea:misc.Mode4
ltx/en_uk_ware/he.h.m4:heHE.TonVasileaChriston.name	(NM) The Children, prisoners.
ltx/en_uk_ware/he.h.m4:heHE.TonVasileaChriston.ode	@ltx/en_uk_ware/miscellanea:misc.Ode8
ltx/en_uk_ware/he.h.m4:heHE.TonVasileaChriston.text	The Children, prisoners in the furnace, confessed Christ the King, crying with a loud voice: O all ye works of the Lord, praise ye the Lord.
ltx/en_uk_ware/he.h.m4:heHE.TousOuranousIAretiSou.greekname	
ltx/en_uk_ware/he.h.m4:heHE.TousOuranousIAretiSou.incipit	…
ltx/en_uk_ware/he.h.m4:heHE.TousOuranousIAretiSou.melody	@ltx/en_uk_ware/miscellanea:misc.HeirmosNotMetered
ltx/en_uk_ware/he.h.m4:heHE.TousOuranousIAretiSou.mode	@ltx/en_uk_ware/miscellanea:misc.Mode4
ltx/en_uk_ware/he.h.m4:heHE.TousOuranousIAretiSou.name	(NM)
ltx/en_uk_ware/he.h.m4:heHE.TousOuranousIAretiSou.ode	@ltx/en_uk_ware/miscellanea:misc.Ode4
ltx/en_uk_ware/he.h.m4:heHE.TousOuranousIAretiSou.text	
ltx/en_uk_ware/he.h.m4:heHE.TousSousYmnologous.greekname	
ltx/en_uk_ware/he.h.m4:heHE.TousSousYmnologous.incipit	O Mother of God. (N/M)…
ltx/en_uk_ware/he.h.m4:heHE.TousSousYmnologous.melody	@ltx/en_uk_ware/miscellanea:misc.HeirmosNotMetered
ltx/en_uk_ware/he.h.m4:heHE.TousSousYmnologous.mode	@ltx/en_uk_ware/miscellanea:misc.Mode4
ltx/en_uk_ware/he.h.m4:heHE.TousSousYmnologous.name	O Mother of God. (N/M)
ltx/en_uk_ware/he.h.m4:heHE.TousSousYmnologous.ode	@ltx/en_uk_ware/miscellanea:misc.Ode3
ltx/en_uk_ware/he.h.m4:heHE.TousSousYmnologous.text	
ltx/en_uk_ware/he.h.m4:heHE.TousSousYmnologousEisodia.greekname	
ltx/en_uk_ware/he.h.m4:heHE.TousSousYmnologousEisodia.incipit	…
ltx/en_uk_ware/he.h.m4:heHE.TousSousYmnologousEisodia.melody	@ltx/en_uk_ware/miscellanea:misc.HeirmosNotMetered
ltx/en_uk_ware/he.h.m4:heHE.TousSousYmnologousEisodia.mode	@ltx/en_uk_ware/miscellanea:misc.Mode4
ltx/en_uk_ware/he.h.m4:heHE.TousSousYmnologousEisodia.name	(NM)
ltx/en_uk_ware/he.h.m4:heHE.TousSousYmnologousEisodia.ode	@ltx/en_uk_ware/miscellanea:misc.Ode3
ltx/en_uk_ware/he.h.m4:heHE.TousSousYmnologousEisodia.text	
ltx/en_uk_ware/he.h.m4:heHE.TousSousYmnologousKoimisis.greekname	
ltx/en_uk_ware/he.h.m4:heHE.TousSousYmnologousKoimisis.incipit	…
ltx/en_uk_ware/he.h.m4:heHE.TousSousYmnologousKoimisis.melody	@ltx/en_uk_ware/miscellanea:misc.HeirmosNotMetered
ltx/en_uk_ware/he.h.m4:heHE.TousSousYmnologousKoimisis.mode	@ltx/en_uk_ware/miscellanea:misc.Mode4
ltx/en_uk_ware/he.h.m4:heHE.TousSousYmnologousKoimisis.name	(NM)
ltx/en_uk_ware/he.h.m4:heHE.TousSousYmnologousKoimisis.ode	@ltx/en_uk_ware/miscellanea:misc.Ode3
ltx/en_uk_ware/he.h.m4:heHE.TousSousYmnologousKoimisis.text	
ltx/en_uk_ware/he.h.m4:heHE.TousSousYmnologousSyllipsis.greekname	
ltx/en_uk_ware/he.h.m4:heHE.TousSousYmnologousSyllipsis.incipit	…
ltx/en_uk_ware/he.h.m4:heHE.TousSousYmnologousSyllipsis.melody	@ltx/en_uk_ware/miscellanea:misc.HeirmosNotMetered
ltx/en_uk_ware/he.h.m4:heHE.TousSousYmnologousSyllipsis.mode	@ltx/en_uk_ware/miscellanea:misc.Mode4
ltx/en_uk_ware/he.h.m4:heHE.TousSousYmnologousSyllipsis.name	(NM)
ltx/en_uk_ware/he.h.m4:heHE.TousSousYmnologousSyllipsis.ode	@ltx/en_uk_ware/miscellanea:misc.Ode3
ltx/en_uk_ware/he.h.m4:heHE.TousSousYmnologousSyllipsis.text	
ltx/en_uk_ware/he.h.m4:heHE.TousSousYmnologous_Eisodia.greekname	@ltx/en_uk_ware/properties:deprecated.key
ltx/en_uk_ware/he.h.m4:heHE.TousSousYmnologous_Eisodia.incipit	@ltx/en_uk_ware/properties:deprecated.key
ltx/en_uk_ware/he.h.m4:heHE.TousSousYmnologous_Eisodia.melody	@ltx/en_uk_ware/properties:deprecated.key
ltx/en_uk_ware/he.h.m4:heHE.TousSousYmnologous_Eisodia.mode	@ltx/en_uk_ware/properties:deprecated.key
ltx/en_uk_ware/he.h.m4:heHE.TousSousYmnologous_Eisodia.name	@ltx/en_uk_ware/properties:deprecated.key
ltx/en_uk_ware/he.h.m4:heHE.TousSousYmnologous_Eisodia.ode	@ltx/en_uk_ware/properties:deprecated.key
ltx/en_uk_ware/he.h.m4:heHE.TousSousYmnologous_Eisodia.text	@ltx/en_uk_ware/properties:deprecated.key
ltx/en_uk_ware/he.h.m4:heHE.TousSousYmnologous_Koimisis.greekname	@ltx/en_uk_ware/properties:deprecated.key
ltx/en_uk_ware/he.h.m4:heHE.TousSousYmnologous_Koimisis.incipit	@ltx/en_uk_ware/properties:deprecated.key
ltx/en_uk_ware/he.h.m4:heHE.TousSousYmnologous_Koimisis.melody	@ltx/en_uk_ware/properties:deprecated.key
ltx/en_uk_ware/he.h.m4:heHE.TousSousYmnologous_Koimisis.mode	@ltx/en_uk_ware/properties:deprecated.key
ltx/en_uk_ware/he.h.m4:heHE.TousSousYmnologous_Koimisis.name	@ltx/en_uk_ware/properties:deprecated.key
ltx/en_uk_ware/he.h.m4:heHE.TousSousYmnologous_Koimisis.ode	@ltx/en_uk_ware/properties:deprecated.key
ltx/en_uk_ware/he.h.m4:heHE.TousSousYmnologous_Koimisis.text	@ltx/en_uk_ware/properties:deprecated.key
ltx/en_uk_ware/he.h.m4:heHE.TousSousYmnologous_Syllipsis.greekname	@ltx/en_uk_ware/properties:deprecated.key
ltx/en_uk_ware/he.h.m4:heHE.TousSousYmnologous_Syllipsis.incipit	@ltx/en_uk_ware/properties:deprecated.key
ltx/en_uk_ware/he.h.m4:heHE.TousSousYmnologous_Syllipsis.melody	@ltx/en_uk_ware/properties:deprecated.key
ltx/en_uk_ware/he.h.m4:heHE.TousSousYmnologous_Syllipsis.mode	@ltx/en_uk_ware/properties:deprecated.key
ltx/en_uk_ware/he.h.m4:heHE.TousSousYmnologous_Syllipsis.name	@ltx/en_uk_ware/properties:deprecated.key
ltx/en_uk_ware/he.h.m4:heHE.TousSousYmnologous_Syllipsis.ode	@ltx/en_uk_ware/properties:deprecated.key
ltx/en_uk_ware/he.h.m4:heHE.TousSousYmnologous_Syllipsis.text	@ltx/en_uk_ware/properties:deprecated.key
ltx/en_uk_ware/he.h.m4:heHE.ToxonDynatonIsthenise.greekname	
ltx/en_uk_ware/he.h.m4:heHE.ToxonDynatonIsthenise.incipit	…
ltx/en_uk_ware/he.h.m4:heHE.ToxonDynatonIsthenise.melody	@ltx/en_uk_ware/miscellanea:misc.HeirmosNotMetered
ltx/en_uk_ware/he.h.m4:heHE.ToxonDynatonIsthenise.mode	@ltx/en_uk_ware/miscellanea:misc.Mode4
ltx/en_uk_ware/he.h.m4:heHE.ToxonDynatonIsthenise.name	(NM)
ltx/en_uk_ware/he.h.m4:heHE.ToxonDynatonIsthenise.ode	@ltx/en_uk_ware/miscellanea:misc.Ode3
ltx/en_uk_ware/he.h.m4:heHE.ToxonDynatonIsthenise.text	
ltx/en_uk_ware/he.h.m4:heHE.TristatasKrataious.greekname	Τριστάτας κραταιούς.
ltx/en_uk_ware/he.h.m4:heHE.TristatasKrataious.incipit	Drown the three chief commanders…
ltx/en_uk_ware/he.h.m4:heHE.TristatasKrataious.melody	@ltx/en_uk_ware/miscellanea:misc.HeirmosNotMetered
ltx/en_uk_ware/he.h.m4:heHE.TristatasKrataious.mode	@ltx/en_uk_ware/miscellanea:misc.Mode4
ltx/en_uk_ware/he.h.m4:heHE.TristatasKrataious.name	(NM) Drown the three chief commanders.
ltx/en_uk_ware/he.h.m4:heHE.TristatasKrataious.ode	@ltx/en_uk_ware/miscellanea:misc.Ode1
ltx/en_uk_ware/he.h.m4:heHE.TristatasKrataious.text	
ltx/en_uk_ware/he.h.m4:heHE.ZaliMeLogismon.greekname	
ltx/en_uk_ware/he.h.m4:heHE.ZaliMeLogismon.incipit	…
ltx/en_uk_ware/he.h.m4:heHE.ZaliMeLogismon.melody	@ltx/en_uk_ware/miscellanea:misc.HeirmosNotMetered
ltx/en_uk_ware/he.h.m4:heHE.ZaliMeLogismon.mode	@ltx/en_uk_ware/miscellanea:misc.Mode4
ltx/en_uk_ware/he.h.m4:heHE.ZaliMeLogismon.name	(NM)
ltx/en_uk_ware/he.h.m4:heHE.ZaliMeLogismon.ode	@ltx/en_uk_ware/miscellanea:misc.Ode6
ltx/en_uk_ware/he.h.m4:heHE.ZaliMeLogismon.text	
