ltx/en_uk_ware/oc.m6.d4:ocMA.AposTheotokion.greekmelody	@ltx/en_uk_ware/he.a.m6:heAU.TriimerosAnestis.greekname
ltx/en_uk_ware/oc.m6.d4:ocMA.AposTheotokion.incipit	When the all-pure Virgin saw…
ltx/en_uk_ware/oc.m6.d4:ocMA.AposTheotokion.melody	@ltx/en_uk_ware/he.a.m6:heAU.TriimerosAnestis.name
ltx/en_uk_ware/oc.m6.d4:ocMA.AposTheotokion.mode	@ltx/en_uk_ware/miscellanea:misc.Mode6
ltx/en_uk_ware/oc.m6.d4:ocMA.AposTheotokion.text	When the all-pure Virgin saw Thee hanging on the Cross, with a mother’s grief she cried aloud: ‘O my Son and my God! O my beloved Child! How dost Thou endure this shameful suffering?’
