ltx/en_uk_ware/tr.d027:trCO.header	
ltx/en_uk_ware/tr.d027:trDA.commemoration.full	
ltx/en_uk_ware/tr.d027:trDA.commemoration.short	
ltx/en_uk_ware/tr.d027:trDA.insert1	
ltx/en_uk_ware/tr.d027:trDA.insert2	
ltx/en_uk_ware/tr.d027:trDA.note	
ltx/en_uk_ware/tr.d027:trDA.title	
ltx/en_uk_ware/tr.d027:trHO.commemorations	
ltx/en_uk_ware/tr.d027:trHO.daytitle	
ltx/en_uk_ware/tr.d027:trHO.description1	
ltx/en_uk_ware/tr.d027:trHO.description2	
ltx/en_uk_ware/tr.d027:trHO.note1	
ltx/en_uk_ware/tr.d027:trHO.note2	
ltx/en_uk_ware/tr.d027:trMA.AposIdiomelon1.incipit	…
ltx/en_uk_ware/tr.d027:trMA.AposIdiomelon1.melody	@ltx/en_uk_ware/miscellanea:misc.Idiomelon
ltx/en_uk_ware/tr.d027:trMA.AposIdiomelon1.mode	@ltx/en_uk_ware/miscellanea:misc.Mode8
ltx/en_uk_ware/tr.d027:trMA.AposIdiomelon1.text	
ltx/en_uk_ware/tr.d027:trMA.AposMartyric.greekmelody	@ltx/en_uk_ware/he.a.m8:heAU.TiYmasKalesomen.greekname
ltx/en_uk_ware/tr.d027:trMA.AposMartyric.incipit	@ltx/en_uk_ware/he.a.m8:heAU.TiYmasKalesomen.incipit
ltx/en_uk_ware/tr.d027:trMA.AposMartyric.melody	@ltx/en_uk_ware/he.a.m8:heAU.TiYmasKalesomen.melody
ltx/en_uk_ware/tr.d027:trMA.AposMartyric.mode	@ltx/en_uk_ware/miscellanea:misc.Mode8
ltx/en_uk_ware/tr.d027:trMA.AposMartyric.text	@ltx/en_uk_ware/he.a.m8:heAU.TiYmasKalesomen.text
ltx/en_uk_ware/tr.d027:trMA.AposTheotokion.greekmelody	@ltx/en_uk_ware/he.a.m8:heAU.OTouParadoxou.greekname
ltx/en_uk_ware/tr.d027:trMA.AposTheotokion.incipit	…
ltx/en_uk_ware/tr.d027:trMA.AposTheotokion.melody	@ltx/en_uk_ware/he.a.m8:heAU.OTouParadoxou.name
ltx/en_uk_ware/tr.d027:trMA.AposTheotokion.mode	@ltx/en_uk_ware/miscellanea:misc.Mode8
ltx/en_uk_ware/tr.d027:trMA.AposTheotokion.text	
ltx/en_uk_ware/tr.d027:trMA.Kathisma21.incipit	…
ltx/en_uk_ware/tr.d027:trMA.Kathisma21.melody	
ltx/en_uk_ware/tr.d027:trMA.Kathisma21.mode	@ltx/en_uk_ware/miscellanea:misc.Mode2
ltx/en_uk_ware/tr.d027:trMA.Kathisma21.text	
ltx/en_uk_ware/tr.d027:trMA.Kathisma22.incipit	…
ltx/en_uk_ware/tr.d027:trMA.Kathisma22.melody	
ltx/en_uk_ware/tr.d027:trMA.Kathisma22.mode	@ltx/en_uk_ware/miscellanea:misc.Mode2
ltx/en_uk_ware/tr.d027:trMA.Kathisma22.text	
ltx/en_uk_ware/tr.d027:trMA.Kathisma31.incipit	…
ltx/en_uk_ware/tr.d027:trMA.Kathisma31.melody	
ltx/en_uk_ware/tr.d027:trMA.Kathisma31.mode	@ltx/en_uk_ware/miscellanea:misc.Mode2
ltx/en_uk_ware/tr.d027:trMA.Kathisma31.text	
ltx/en_uk_ware/tr.d027:trMA.Kathisma32.incipit	…
ltx/en_uk_ware/tr.d027:trMA.Kathisma32.melody	
ltx/en_uk_ware/tr.d027:trMA.Kathisma32.mode	@ltx/en_uk_ware/miscellanea:misc.Mode2
ltx/en_uk_ware/tr.d027:trMA.Kathisma32.text	
ltx/en_uk_ware/tr.d027:trMA.Ode5C11.greekmelody	@ltx/en_uk_ware/he.h.m2:heHE.OFotismos.greekname
ltx/en_uk_ware/tr.d027:trMA.Ode5C11.incipit	…
ltx/en_uk_ware/tr.d027:trMA.Ode5C11.melody	@ltx/en_uk_ware/he.h.m2:heHE.OFotismos.name
ltx/en_uk_ware/tr.d027:trMA.Ode5C11.mode	@ltx/en_uk_ware/miscellanea:misc.Mode2
ltx/en_uk_ware/tr.d027:trMA.Ode5C11.ode	@ltx/en_uk_ware/miscellanea:misc.Ode5
ltx/en_uk_ware/tr.d027:trMA.Ode5C11.text	
ltx/en_uk_ware/tr.d027:trMA.Ode5C12.incipit	…
ltx/en_uk_ware/tr.d027:trMA.Ode5C12.melody	@ltx/en_uk_ware/he.h.m2:heHE.OFotismos.name
ltx/en_uk_ware/tr.d027:trMA.Ode5C12.mode	@ltx/en_uk_ware/miscellanea:misc.Mode2
ltx/en_uk_ware/tr.d027:trMA.Ode5C12.ode	@ltx/en_uk_ware/miscellanea:misc.Ode5
ltx/en_uk_ware/tr.d027:trMA.Ode5C12.text	
ltx/en_uk_ware/tr.d027:trMA.Ode5C13.incipit	…
ltx/en_uk_ware/tr.d027:trMA.Ode5C13.melody	@ltx/en_uk_ware/he.h.m2:heHE.OFotismos.name
ltx/en_uk_ware/tr.d027:trMA.Ode5C13.mode	@ltx/en_uk_ware/miscellanea:misc.Mode2
ltx/en_uk_ware/tr.d027:trMA.Ode5C13.ode	@ltx/en_uk_ware/miscellanea:misc.Ode5
ltx/en_uk_ware/tr.d027:trMA.Ode5C13.text	
ltx/en_uk_ware/tr.d027:trMA.Ode5C1T.incipit	…
ltx/en_uk_ware/tr.d027:trMA.Ode5C1T.melody	@ltx/en_uk_ware/he.h.m2:heHE.OFotismos.name
ltx/en_uk_ware/tr.d027:trMA.Ode5C1T.mode	@ltx/en_uk_ware/miscellanea:misc.Mode2
ltx/en_uk_ware/tr.d027:trMA.Ode5C1T.ode	@ltx/en_uk_ware/miscellanea:misc.Ode5
ltx/en_uk_ware/tr.d027:trMA.Ode5C1T.text	
ltx/en_uk_ware/tr.d027:trMA.Ode5C21.greekmelody	@ltx/en_uk_ware/he.h.m2:heHE.TisNyktosDielthousis.greekname
ltx/en_uk_ware/tr.d027:trMA.Ode5C21.incipit	…
ltx/en_uk_ware/tr.d027:trMA.Ode5C21.melody	@ltx/en_uk_ware/he.h.m2:heHE.TisNyktosDielthousis.name
ltx/en_uk_ware/tr.d027:trMA.Ode5C21.mode	@ltx/en_uk_ware/miscellanea:misc.Mode2
ltx/en_uk_ware/tr.d027:trMA.Ode5C21.ode	@ltx/en_uk_ware/miscellanea:misc.Ode5
ltx/en_uk_ware/tr.d027:trMA.Ode5C21.text	
ltx/en_uk_ware/tr.d027:trMA.Ode5C22.incipit	…
ltx/en_uk_ware/tr.d027:trMA.Ode5C22.melody	@ltx/en_uk_ware/he.h.m2:heHE.TisNyktosDielthousis.name
ltx/en_uk_ware/tr.d027:trMA.Ode5C22.mode	@ltx/en_uk_ware/miscellanea:misc.Mode2
ltx/en_uk_ware/tr.d027:trMA.Ode5C22.ode	@ltx/en_uk_ware/miscellanea:misc.Ode5
ltx/en_uk_ware/tr.d027:trMA.Ode5C22.text	
ltx/en_uk_ware/tr.d027:trMA.Ode5C2A1.incipit	…
ltx/en_uk_ware/tr.d027:trMA.Ode5C2A1.melody	@ltx/en_uk_ware/he.h.m2:heHE.TisNyktosDielthousis.name
ltx/en_uk_ware/tr.d027:trMA.Ode5C2A1.mode	@ltx/en_uk_ware/miscellanea:misc.Mode2
ltx/en_uk_ware/tr.d027:trMA.Ode5C2A1.ode	@ltx/en_uk_ware/miscellanea:misc.Ode5
ltx/en_uk_ware/tr.d027:trMA.Ode5C2A1.text	
ltx/en_uk_ware/tr.d027:trMA.Ode5C2H.greekmelody	@ltx/en_uk_ware/he.h.m2:heHE.TisNyktosDielthousis.greekname
ltx/en_uk_ware/tr.d027:trMA.Ode5C2H.incipit	@ltx/en_uk_ware/he.h.m2:heHE.TisNyktosDielthousis.incipit
ltx/en_uk_ware/tr.d027:trMA.Ode5C2H.melody	@ltx/en_uk_ware/he.h.m2:heHE.TisNyktosDielthousis.melody
ltx/en_uk_ware/tr.d027:trMA.Ode5C2H.mode	@ltx/en_uk_ware/miscellanea:misc.Mode2
ltx/en_uk_ware/tr.d027:trMA.Ode5C2H.ode	@ltx/en_uk_ware/miscellanea:misc.Ode5
ltx/en_uk_ware/tr.d027:trMA.Ode5C2H.text	@ltx/en_uk_ware/he.h.m2:heHE.TisNyktosDielthousis.text
ltx/en_uk_ware/tr.d027:trMA.Ode5C2T.incipit	…
ltx/en_uk_ware/tr.d027:trMA.Ode5C2T.melody	@ltx/en_uk_ware/he.h.m2:heHE.TisNyktosDielthousis.name
ltx/en_uk_ware/tr.d027:trMA.Ode5C2T.mode	@ltx/en_uk_ware/miscellanea:misc.Mode2
ltx/en_uk_ware/tr.d027:trMA.Ode5C2T.ode	@ltx/en_uk_ware/miscellanea:misc.Ode5
ltx/en_uk_ware/tr.d027:trMA.Ode5C2T.text	
ltx/en_uk_ware/tr.d027:trMA.Ode5C2Tr.incipit	…
ltx/en_uk_ware/tr.d027:trMA.Ode5C2Tr.melody	@ltx/en_uk_ware/he.h.m2:heHE.TisNyktosDielthousis.name
ltx/en_uk_ware/tr.d027:trMA.Ode5C2Tr.mode	@ltx/en_uk_ware/miscellanea:misc.Mode2
ltx/en_uk_ware/tr.d027:trMA.Ode5C2Tr.ode	@ltx/en_uk_ware/miscellanea:misc.Ode5
ltx/en_uk_ware/tr.d027:trMA.Ode5C2Tr.text	
ltx/en_uk_ware/tr.d027:trMA.Ode8C11.greekmelody	@ltx/en_uk_ware/he.h.m2:heHE.TonEnKaminoTouPyros.greekname
ltx/en_uk_ware/tr.d027:trMA.Ode8C11.incipit	…
ltx/en_uk_ware/tr.d027:trMA.Ode8C11.melody	@ltx/en_uk_ware/he.h.m2:heHE.TonEnKaminoTouPyros.name
ltx/en_uk_ware/tr.d027:trMA.Ode8C11.mode	@ltx/en_uk_ware/miscellanea:misc.Mode2
ltx/en_uk_ware/tr.d027:trMA.Ode8C11.ode	@ltx/en_uk_ware/miscellanea:misc.Ode8
ltx/en_uk_ware/tr.d027:trMA.Ode8C11.text	
ltx/en_uk_ware/tr.d027:trMA.Ode8C12.incipit	…
ltx/en_uk_ware/tr.d027:trMA.Ode8C12.melody	@ltx/en_uk_ware/he.h.m2:heHE.TonEnKaminoTouPyros.name
ltx/en_uk_ware/tr.d027:trMA.Ode8C12.mode	@ltx/en_uk_ware/miscellanea:misc.Mode2
ltx/en_uk_ware/tr.d027:trMA.Ode8C12.ode	@ltx/en_uk_ware/miscellanea:misc.Ode8
ltx/en_uk_ware/tr.d027:trMA.Ode8C12.text	
ltx/en_uk_ware/tr.d027:trMA.Ode8C13.incipit	…
ltx/en_uk_ware/tr.d027:trMA.Ode8C13.melody	@ltx/en_uk_ware/he.h.m2:heHE.TonEnKaminoTouPyros.name
ltx/en_uk_ware/tr.d027:trMA.Ode8C13.mode	@ltx/en_uk_ware/miscellanea:misc.Mode2
ltx/en_uk_ware/tr.d027:trMA.Ode8C13.ode	@ltx/en_uk_ware/miscellanea:misc.Ode8
ltx/en_uk_ware/tr.d027:trMA.Ode8C13.text	
ltx/en_uk_ware/tr.d027:trMA.Ode8C1T.incipit	…
ltx/en_uk_ware/tr.d027:trMA.Ode8C1T.melody	@ltx/en_uk_ware/he.h.m2:heHE.TonEnKaminoTouPyros.name
ltx/en_uk_ware/tr.d027:trMA.Ode8C1T.mode	@ltx/en_uk_ware/miscellanea:misc.Mode2
ltx/en_uk_ware/tr.d027:trMA.Ode8C1T.ode	@ltx/en_uk_ware/miscellanea:misc.Ode8
ltx/en_uk_ware/tr.d027:trMA.Ode8C1T.text	
ltx/en_uk_ware/tr.d027:trMA.Ode8C21.greekmelody	@ltx/en_uk_ware/he.h.m2:heHE.TonEnTiVatoMosi.greekname
ltx/en_uk_ware/tr.d027:trMA.Ode8C21.incipit	…
ltx/en_uk_ware/tr.d027:trMA.Ode8C21.melody	@ltx/en_uk_ware/he.h.m2:heHE.TonEnTiVatoMosi.name
ltx/en_uk_ware/tr.d027:trMA.Ode8C21.mode	@ltx/en_uk_ware/miscellanea:misc.Mode2
ltx/en_uk_ware/tr.d027:trMA.Ode8C21.ode	@ltx/en_uk_ware/miscellanea:misc.Ode8
ltx/en_uk_ware/tr.d027:trMA.Ode8C21.text	
ltx/en_uk_ware/tr.d027:trMA.Ode8C22.incipit	…
ltx/en_uk_ware/tr.d027:trMA.Ode8C22.melody	@ltx/en_uk_ware/he.h.m2:heHE.TonEnTiVatoMosi.name
ltx/en_uk_ware/tr.d027:trMA.Ode8C22.mode	@ltx/en_uk_ware/miscellanea:misc.Mode2
ltx/en_uk_ware/tr.d027:trMA.Ode8C22.ode	@ltx/en_uk_ware/miscellanea:misc.Ode8
ltx/en_uk_ware/tr.d027:trMA.Ode8C22.text	
ltx/en_uk_ware/tr.d027:trMA.Ode8C2A1.incipit	…
ltx/en_uk_ware/tr.d027:trMA.Ode8C2A1.melody	@ltx/en_uk_ware/he.h.m2:heHE.TonEnTiVatoMosi.name
ltx/en_uk_ware/tr.d027:trMA.Ode8C2A1.mode	@ltx/en_uk_ware/miscellanea:misc.Mode2
ltx/en_uk_ware/tr.d027:trMA.Ode8C2A1.ode	@ltx/en_uk_ware/miscellanea:misc.Ode8
ltx/en_uk_ware/tr.d027:trMA.Ode8C2A1.text	
ltx/en_uk_ware/tr.d027:trMA.Ode8C2H.greekmelody	@ltx/en_uk_ware/he.h.m2:heHE.TonEnTiVatoMosi.greekname
ltx/en_uk_ware/tr.d027:trMA.Ode8C2H.incipit	@ltx/en_uk_ware/he.h.m2:heHE.TonEnTiVatoMosi.incipit
ltx/en_uk_ware/tr.d027:trMA.Ode8C2H.melody	@ltx/en_uk_ware/he.h.m2:heHE.TonEnTiVatoMosi.melody
ltx/en_uk_ware/tr.d027:trMA.Ode8C2H.mode	@ltx/en_uk_ware/miscellanea:misc.Mode2
ltx/en_uk_ware/tr.d027:trMA.Ode8C2H.ode	@ltx/en_uk_ware/miscellanea:misc.Ode8
ltx/en_uk_ware/tr.d027:trMA.Ode8C2H.text	@ltx/en_uk_ware/he.h.m2:heHE.TonEnTiVatoMosi.text
ltx/en_uk_ware/tr.d027:trMA.Ode8C2T.incipit	…
ltx/en_uk_ware/tr.d027:trMA.Ode8C2T.melody	@ltx/en_uk_ware/he.h.m2:heHE.TonEnTiVatoMosi.name
ltx/en_uk_ware/tr.d027:trMA.Ode8C2T.mode	@ltx/en_uk_ware/miscellanea:misc.Mode2
ltx/en_uk_ware/tr.d027:trMA.Ode8C2T.ode	@ltx/en_uk_ware/miscellanea:misc.Ode8
ltx/en_uk_ware/tr.d027:trMA.Ode8C2T.text	
ltx/en_uk_ware/tr.d027:trMA.Ode8C2Tr.incipit	…
ltx/en_uk_ware/tr.d027:trMA.Ode8C2Tr.melody	@ltx/en_uk_ware/he.h.m2:heHE.TonEnTiVatoMosi.name
ltx/en_uk_ware/tr.d027:trMA.Ode8C2Tr.mode	@ltx/en_uk_ware/miscellanea:misc.Mode2
ltx/en_uk_ware/tr.d027:trMA.Ode8C2Tr.ode	@ltx/en_uk_ware/miscellanea:misc.Ode8
ltx/en_uk_ware/tr.d027:trMA.Ode8C2Tr.text	
ltx/en_uk_ware/tr.d027:trMA.Ode9C11.greekmelody	@ltx/en_uk_ware/he.h.m2:heHE.ITonProIliouFostira.greekname
ltx/en_uk_ware/tr.d027:trMA.Ode9C11.incipit	…
ltx/en_uk_ware/tr.d027:trMA.Ode9C11.melody	@ltx/en_uk_ware/he.h.m2:heHE.ITonProIliouFostira.name
ltx/en_uk_ware/tr.d027:trMA.Ode9C11.mode	@ltx/en_uk_ware/miscellanea:misc.Mode2
ltx/en_uk_ware/tr.d027:trMA.Ode9C11.ode	@ltx/en_uk_ware/miscellanea:misc.Ode9
ltx/en_uk_ware/tr.d027:trMA.Ode9C11.text	
ltx/en_uk_ware/tr.d027:trMA.Ode9C12.incipit	…
ltx/en_uk_ware/tr.d027:trMA.Ode9C12.melody	@ltx/en_uk_ware/he.h.m2:heHE.ITonProIliouFostira.name
ltx/en_uk_ware/tr.d027:trMA.Ode9C12.mode	@ltx/en_uk_ware/miscellanea:misc.Mode2
ltx/en_uk_ware/tr.d027:trMA.Ode9C12.ode	@ltx/en_uk_ware/miscellanea:misc.Ode9
ltx/en_uk_ware/tr.d027:trMA.Ode9C12.text	
ltx/en_uk_ware/tr.d027:trMA.Ode9C13.incipit	…
ltx/en_uk_ware/tr.d027:trMA.Ode9C13.melody	@ltx/en_uk_ware/he.h.m2:heHE.ITonProIliouFostira.name
ltx/en_uk_ware/tr.d027:trMA.Ode9C13.mode	@ltx/en_uk_ware/miscellanea:misc.Mode2
ltx/en_uk_ware/tr.d027:trMA.Ode9C13.ode	@ltx/en_uk_ware/miscellanea:misc.Ode9
ltx/en_uk_ware/tr.d027:trMA.Ode9C13.text	
ltx/en_uk_ware/tr.d027:trMA.Ode9C1T.incipit	…
ltx/en_uk_ware/tr.d027:trMA.Ode9C1T.melody	@ltx/en_uk_ware/he.h.m2:heHE.ITonProIliouFostira.name
ltx/en_uk_ware/tr.d027:trMA.Ode9C1T.mode	@ltx/en_uk_ware/miscellanea:misc.Mode2
ltx/en_uk_ware/tr.d027:trMA.Ode9C1T.ode	@ltx/en_uk_ware/miscellanea:misc.Ode9
ltx/en_uk_ware/tr.d027:trMA.Ode9C1T.text	
ltx/en_uk_ware/tr.d027:trMA.Ode9C21.greekmelody	@ltx/en_uk_ware/he.h.m2:heHE.ITonProIliouFostira.greekname
ltx/en_uk_ware/tr.d027:trMA.Ode9C21.incipit	…
ltx/en_uk_ware/tr.d027:trMA.Ode9C21.melody	@ltx/en_uk_ware/he.h.m2:heHE.ITonProIliouFostira.name
ltx/en_uk_ware/tr.d027:trMA.Ode9C21.mode	@ltx/en_uk_ware/miscellanea:misc.Mode2
ltx/en_uk_ware/tr.d027:trMA.Ode9C21.ode	@ltx/en_uk_ware/miscellanea:misc.Ode9
ltx/en_uk_ware/tr.d027:trMA.Ode9C21.text	
ltx/en_uk_ware/tr.d027:trMA.Ode9C22.incipit	…
ltx/en_uk_ware/tr.d027:trMA.Ode9C22.melody	@ltx/en_uk_ware/he.h.m2:heHE.TinAgninKaiAchranton.name
ltx/en_uk_ware/tr.d027:trMA.Ode9C22.mode	@ltx/en_uk_ware/miscellanea:misc.Mode2
ltx/en_uk_ware/tr.d027:trMA.Ode9C22.ode	@ltx/en_uk_ware/miscellanea:misc.Ode9
ltx/en_uk_ware/tr.d027:trMA.Ode9C22.text	
ltx/en_uk_ware/tr.d027:trMA.Ode9C2A1.incipit	…
ltx/en_uk_ware/tr.d027:trMA.Ode9C2A1.melody	@ltx/en_uk_ware/he.h.m2:heHE.TinAgninKaiAchranton.name
ltx/en_uk_ware/tr.d027:trMA.Ode9C2A1.mode	@ltx/en_uk_ware/miscellanea:misc.Mode2
ltx/en_uk_ware/tr.d027:trMA.Ode9C2A1.ode	@ltx/en_uk_ware/miscellanea:misc.Ode9
ltx/en_uk_ware/tr.d027:trMA.Ode9C2A1.text	
ltx/en_uk_ware/tr.d027:trMA.Ode9C2H.greekmelody	@ltx/en_uk_ware/he.h.m2:heHE.TinAgninKaiAchranton.greekname
ltx/en_uk_ware/tr.d027:trMA.Ode9C2H.incipit	@ltx/en_uk_ware/he.h.m2:heHE.TinAgninKaiAchranton.incipit
ltx/en_uk_ware/tr.d027:trMA.Ode9C2H.melody	@ltx/en_uk_ware/he.h.m2:heHE.TinAgninKaiAchranton.melody
ltx/en_uk_ware/tr.d027:trMA.Ode9C2H.mode	@ltx/en_uk_ware/miscellanea:misc.Mode2
ltx/en_uk_ware/tr.d027:trMA.Ode9C2H.ode	@ltx/en_uk_ware/miscellanea:misc.Ode9
ltx/en_uk_ware/tr.d027:trMA.Ode9C2H.text	@ltx/en_uk_ware/he.h.m2:heHE.TinAgninKaiAchranton.text
ltx/en_uk_ware/tr.d027:trMA.Ode9C2T.incipit	…
ltx/en_uk_ware/tr.d027:trMA.Ode9C2T.melody	@ltx/en_uk_ware/he.h.m2:heHE.TinAgninKaiAchranton.name
ltx/en_uk_ware/tr.d027:trMA.Ode9C2T.mode	@ltx/en_uk_ware/miscellanea:misc.Mode2
ltx/en_uk_ware/tr.d027:trMA.Ode9C2T.ode	@ltx/en_uk_ware/miscellanea:misc.Ode9
ltx/en_uk_ware/tr.d027:trMA.Ode9C2T.text	
ltx/en_uk_ware/tr.d027:trMA.Ode9C2Tr.incipit	…
ltx/en_uk_ware/tr.d027:trMA.Ode9C2Tr.melody	@ltx/en_uk_ware/he.h.m2:heHE.TinAgninKaiAchranton.name
ltx/en_uk_ware/tr.d027:trMA.Ode9C2Tr.mode	@ltx/en_uk_ware/miscellanea:misc.Mode2
ltx/en_uk_ware/tr.d027:trMA.Ode9C2Tr.ode	@ltx/en_uk_ware/miscellanea:misc.Ode9
ltx/en_uk_ware/tr.d027:trMA.Ode9C2Tr.text	
ltx/en_uk_ware/tr.d027:trR001	
ltx/en_uk_ware/tr.d027:trTE.Troparion.incipit	…
ltx/en_uk_ware/tr.d027:trTE.Troparion.melody	
ltx/en_uk_ware/tr.d027:trTE.Troparion.mode	@ltx/en_uk_ware/miscellanea:misc.Mode8
ltx/en_uk_ware/tr.d027:trTE.Troparion.text	
ltx/en_uk_ware/tr.d027:trTE.Troparion2.incipit	…
ltx/en_uk_ware/tr.d027:trTE.Troparion2.text	
ltx/en_uk_ware/tr.d027:trVE.AposIdiomelon1.incipit	…
ltx/en_uk_ware/tr.d027:trVE.AposIdiomelon1.melody	@ltx/en_uk_ware/miscellanea:misc.Idiomelon
ltx/en_uk_ware/tr.d027:trVE.AposIdiomelon1.mode	@ltx/en_uk_ware/miscellanea:misc.Mode4
ltx/en_uk_ware/tr.d027:trVE.AposIdiomelon1.text	
ltx/en_uk_ware/tr.d027:trVE.AposMartyric.incipit	…
ltx/en_uk_ware/tr.d027:trVE.AposMartyric.melody	
ltx/en_uk_ware/tr.d027:trVE.AposMartyric.mode	@ltx/en_uk_ware/miscellanea:misc.Mode4
ltx/en_uk_ware/tr.d027:trVE.AposMartyric.text	
ltx/en_uk_ware/tr.d027:trVE.AposTheotokion.greekmelody	@ltx/en_uk_ware/he.a.m4:heAU.OsGennaionEnMartysi.greekname
ltx/en_uk_ware/tr.d027:trVE.AposTheotokion.melody	@ltx/en_uk_ware/he.a.m4:heAU.OsGennaionEnMartysi.name
ltx/en_uk_ware/tr.d027:trVE.AposTheotokion.mode	@ltx/en_uk_ware/miscellanea:misc.Mode4
ltx/en_uk_ware/tr.d027:trVE.AposTheotokion.text	
ltx/en_uk_ware/tr.d027:trVE.Stichera01.incipit	…
ltx/en_uk_ware/tr.d027:trVE.Stichera01.melody	
ltx/en_uk_ware/tr.d027:trVE.Stichera01.mode	@ltx/en_uk_ware/miscellanea:misc.Mode2
ltx/en_uk_ware/tr.d027:trVE.Stichera01.text	
ltx/en_uk_ware/tr.d027:trVE.Stichera02.incipit	…
ltx/en_uk_ware/tr.d027:trVE.Stichera02.melody	
ltx/en_uk_ware/tr.d027:trVE.Stichera02.mode	@ltx/en_uk_ware/miscellanea:misc.Mode2
ltx/en_uk_ware/tr.d027:trVE.Stichera02.text	
ltx/en_uk_ware/tr.d027:trVE.Stichera03.incipit	…
ltx/en_uk_ware/tr.d027:trVE.Stichera03.melody	
ltx/en_uk_ware/tr.d027:trVE.Stichera03.mode	@ltx/en_uk_ware/miscellanea:misc.Mode2
ltx/en_uk_ware/tr.d027:trVE.Stichera03.text	
