ltx/en_uk_ware/tr.d030:trCO.header	
ltx/en_uk_ware/tr.d030:trDA.commemoration.full	
ltx/en_uk_ware/tr.d030:trDA.commemoration.short	
ltx/en_uk_ware/tr.d030:trDA.insert1	
ltx/en_uk_ware/tr.d030:trDA.insert2	
ltx/en_uk_ware/tr.d030:trDA.note	
ltx/en_uk_ware/tr.d030:trDA.title	
ltx/en_uk_ware/tr.d030:trHO.commemorations	
ltx/en_uk_ware/tr.d030:trHO.daytitle	
ltx/en_uk_ware/tr.d030:trHO.description1	
ltx/en_uk_ware/tr.d030:trHO.description2	
ltx/en_uk_ware/tr.d030:trHO.note1	
ltx/en_uk_ware/tr.d030:trHO.note2	
ltx/en_uk_ware/tr.d030:trMA.AposIdiomelon1.incipit	Prayer and fasting are a…
ltx/en_uk_ware/tr.d030:trMA.AposIdiomelon1.melody	@ltx/en_uk_ware/miscellanea:misc.Idiomelon
ltx/en_uk_ware/tr.d030:trMA.AposIdiomelon1.mode	@ltx/en_uk_ware/miscellanea:misc.Mode5
ltx/en_uk_ware/tr.d030:trMA.AposIdiomelon1.text	Prayer and fasting are a marvellous weapon. Through them Moses became writer of the Law and Elijah a fiery enemy of false sacrifice. Let us persevere in them, ye faithful, and cry unto the Saviour: Against Thee only have we sinned; have mercy on us.
ltx/en_uk_ware/tr.d030:trMA.AposMartyric.incipit	Blessed is the army of…
ltx/en_uk_ware/tr.d030:trMA.AposMartyric.melody	
ltx/en_uk_ware/tr.d030:trMA.AposMartyric.mode	@ltx/en_uk_ware/miscellanea:misc.Mode5
ltx/en_uk_ware/tr.d030:trMA.AposMartyric.text	Blessed is the army of the heavenly King: for though the victorious martyrs were born of this earth, yet despising their bodies they made haste to attain to the angelic estate; and through their sufferings they were counted worthy of the honour of the bodiless angels. At their prayers, O Lord, save our souls.
ltx/en_uk_ware/tr.d030:trMA.AposTheotokion.incipit	O blessed among women, we…
ltx/en_uk_ware/tr.d030:trMA.AposTheotokion.melody	
ltx/en_uk_ware/tr.d030:trMA.AposTheotokion.mode	@ltx/en_uk_ware/miscellanea:misc.Mode5
ltx/en_uk_ware/tr.d030:trMA.AposTheotokion.text	O blessed among women, we entreat thee as the Mother of God: pray for the salvation of our souls.
ltx/en_uk_ware/tr.d030:trMA.C1.poet	@ltx/en_uk_ware/poets:po.Iosif
ltx/en_uk_ware/tr.d030:trMA.C1.title	
ltx/en_uk_ware/tr.d030:trMA.C1.verse	
ltx/en_uk_ware/tr.d030:trMA.C2.poet	@ltx/en_uk_ware/poets:po.Theodorou
ltx/en_uk_ware/tr.d030:trMA.C2.title	
ltx/en_uk_ware/tr.d030:trMA.C2.verse	
ltx/en_uk_ware/tr.d030:trMA.Kathisma21.greekmelody	@ltx/en_uk_ware/he.a.m4:heAU.KateplagiIosif.greekname
ltx/en_uk_ware/tr.d030:trMA.Kathisma21.incipit	…
ltx/en_uk_ware/tr.d030:trMA.Kathisma21.melody	@ltx/en_uk_ware/he.a.m4:heAU.KateplagiIosif.name
ltx/en_uk_ware/tr.d030:trMA.Kathisma21.mode	@ltx/en_uk_ware/miscellanea:misc.Mode4
ltx/en_uk_ware/tr.d030:trMA.Kathisma21.text	
ltx/en_uk_ware/tr.d030:trMA.Kathisma22.greekmelody	@ltx/en_uk_ware/he.a.m4:heAU.KateplagiIosif.greekname
ltx/en_uk_ware/tr.d030:trMA.Kathisma22.incipit	…
ltx/en_uk_ware/tr.d030:trMA.Kathisma22.melody	@ltx/en_uk_ware/he.a.m4:heAU.KateplagiIosif.name
ltx/en_uk_ware/tr.d030:trMA.Kathisma22.mode	@ltx/en_uk_ware/miscellanea:misc.Mode4
ltx/en_uk_ware/tr.d030:trMA.Kathisma22.text	
ltx/en_uk_ware/tr.d030:trMA.Kathisma31.incipit	…
ltx/en_uk_ware/tr.d030:trMA.Kathisma31.melody	
ltx/en_uk_ware/tr.d030:trMA.Kathisma31.mode	@ltx/en_uk_ware/miscellanea:misc.Mode6
ltx/en_uk_ware/tr.d030:trMA.Kathisma31.text	
ltx/en_uk_ware/tr.d030:trMA.Kathisma32.incipit	…
ltx/en_uk_ware/tr.d030:trMA.Kathisma32.melody	
ltx/en_uk_ware/tr.d030:trMA.Kathisma32.mode	@ltx/en_uk_ware/miscellanea:misc.Mode6
ltx/en_uk_ware/tr.d030:trMA.Kathisma32.text	
ltx/en_uk_ware/tr.d030:trMA.Ode1C11.greekmelody	@ltx/en_uk_ware/he.h.m4:heHE.TristatasKrataious.greekname
ltx/en_uk_ware/tr.d030:trMA.Ode1C11.incipit	O Thou who alone art…
ltx/en_uk_ware/tr.d030:trMA.Ode1C11.melody	@ltx/en_uk_ware/he.h.m4:heHE.TristatasKrataious.name
ltx/en_uk_ware/tr.d030:trMA.Ode1C11.mode	@ltx/en_uk_ware/miscellanea:misc.Mode4
ltx/en_uk_ware/tr.d030:trMA.Ode1C11.ode	@ltx/en_uk_ware/miscellanea:misc.Ode1
ltx/en_uk_ware/tr.d030:trMA.Ode1C11.text	O Thou who alone art full of love, fountain of mercy, Lamb of God, who in Thy divine power takest away the transgressions of the world, save me, for I am sinking in the waves of sin, and guide me to the haven of repentance.
ltx/en_uk_ware/tr.d030:trMA.Ode1C12.incipit	As Christ has taught us…
ltx/en_uk_ware/tr.d030:trMA.Ode1C12.melody	@ltx/en_uk_ware/he.h.m4:heHE.TristatasKrataious.name
ltx/en_uk_ware/tr.d030:trMA.Ode1C12.mode	@ltx/en_uk_ware/miscellanea:misc.Mode4
ltx/en_uk_ware/tr.d030:trMA.Ode1C12.ode	@ltx/en_uk_ware/miscellanea:misc.Ode1
ltx/en_uk_ware/tr.d030:trMA.Ode1C12.text	As Christ has taught us in the Scriptures, a pure fast means the putting away of sin, the rejection of the passions, love for God, attentiveness in prayer, tears of compunction, and acts of mercy to the poor.
ltx/en_uk_ware/tr.d030:trMA.Ode1C13.incipit	My soul has been wounded…
ltx/en_uk_ware/tr.d030:trMA.Ode1C13.melody	@ltx/en_uk_ware/he.h.m4:heHE.TristatasKrataious.name
ltx/en_uk_ware/tr.d030:trMA.Ode1C13.mode	@ltx/en_uk_ware/miscellanea:misc.Mode4
ltx/en_uk_ware/tr.d030:trMA.Ode1C13.ode	@ltx/en_uk_ware/miscellanea:misc.Ode1
ltx/en_uk_ware/tr.d030:trMA.Ode1C13.text	My soul has been wounded by the sword of sin and disfigured by the stain of many evils. O Physician of our souls, heal it in Thy mercy and apply the remedy of Thy wise commandments, for Thou lovest mankind.
ltx/en_uk_ware/tr.d030:trMA.Ode1C1T.incipit	O most holy Virgin, Tabernacle…
ltx/en_uk_ware/tr.d030:trMA.Ode1C1T.melody	@ltx/en_uk_ware/he.h.m4:heHE.TristatasKrataious.name
ltx/en_uk_ware/tr.d030:trMA.Ode1C1T.mode	@ltx/en_uk_ware/miscellanea:misc.Mode4
ltx/en_uk_ware/tr.d030:trMA.Ode1C1T.ode	@ltx/en_uk_ware/miscellanea:misc.Ode1
ltx/en_uk_ware/tr.d030:trMA.Ode1C1T.text	O most holy Virgin, Tabernacle undefiled, with the fountain of thy mercy wash me clean from the defilement of evil passions: destroy the sin that lies deep within me, O Lady, and grant me many tears of compunction.
ltx/en_uk_ware/tr.d030:trMA.Ode1C21.greekmelody	@ltx/en_uk_ware/he.h.m6:heHE.VoithosKaiSkepastis.greekname
ltx/en_uk_ware/tr.d030:trMA.Ode1C21.incipit	Brethren, let us enter with…
ltx/en_uk_ware/tr.d030:trMA.Ode1C21.melody	@ltx/en_uk_ware/he.h.m6:heHE.VoithosKaiSkepastis.name
ltx/en_uk_ware/tr.d030:trMA.Ode1C21.mode	@ltx/en_uk_ware/miscellanea:misc.Mode6
ltx/en_uk_ware/tr.d030:trMA.Ode1C21.ode	@ltx/en_uk_ware/miscellanea:misc.Ode1
ltx/en_uk_ware/tr.d030:trMA.Ode1C21.text	Brethren, let us enter with eagerness upon the second week of the light-giving Fast; and rejoicing in the feast which we kept yesterday, with holy gladness let us sing in praise of Christ.
ltx/en_uk_ware/tr.d030:trMA.Ode1C22.incipit	Having come to the season…
ltx/en_uk_ware/tr.d030:trMA.Ode1C22.melody	@ltx/en_uk_ware/he.h.m6:heHE.VoithosKaiSkepastis.name
ltx/en_uk_ware/tr.d030:trMA.Ode1C22.mode	@ltx/en_uk_ware/miscellanea:misc.Mode6
ltx/en_uk_ware/tr.d030:trMA.Ode1C22.ode	@ltx/en_uk_ware/miscellanea:misc.Ode1
ltx/en_uk_ware/tr.d030:trMA.Ode1C22.text	Having come to the season of fasting and compunction, let us weep bitterly and groan aloud. Let us stretch out our hands to the only Redeemer, that He may save our souls.
ltx/en_uk_ware/tr.d030:trMA.Ode1C2A1.incipit	O my Christ, how shall…
ltx/en_uk_ware/tr.d030:trMA.Ode1C2A1.melody	@ltx/en_uk_ware/he.h.m6:heHE.VoithosKaiSkepastis.name
ltx/en_uk_ware/tr.d030:trMA.Ode1C2A1.mode	@ltx/en_uk_ware/miscellanea:misc.Mode6
ltx/en_uk_ware/tr.d030:trMA.Ode1C2A1.ode	@ltx/en_uk_ware/miscellanea:misc.Ode1
ltx/en_uk_ware/tr.d030:trMA.Ode1C2A1.text	O my Christ, how shall I bear Thine anger when Thou comest as Judge? And what shall I say then, for I have not obeyed Thy will, O Christ? But before the end forgive me.
ltx/en_uk_ware/tr.d030:trMA.Ode1C2H.greekmelody	@ltx/en_uk_ware/he.h.m6:heHE.VoithosKaiSkepastis.greekname
ltx/en_uk_ware/tr.d030:trMA.Ode1C2H.incipit	@ltx/en_uk_ware/he.h.m6:heHE.VoithosKaiSkepastis.incipit
ltx/en_uk_ware/tr.d030:trMA.Ode1C2H.melody	@ltx/en_uk_ware/he.h.m6:heHE.VoithosKaiSkepastis.melody
ltx/en_uk_ware/tr.d030:trMA.Ode1C2H.mode	@ltx/en_uk_ware/miscellanea:misc.Mode6
ltx/en_uk_ware/tr.d030:trMA.Ode1C2H.ode	@ltx/en_uk_ware/miscellanea:misc.Ode1
ltx/en_uk_ware/tr.d030:trMA.Ode1C2H.text	@ltx/en_uk_ware/he.h.m6:heHE.VoithosKaiSkepastis.text
ltx/en_uk_ware/tr.d030:trMA.Ode1C2T.incipit	Who has ever begotten a…
ltx/en_uk_ware/tr.d030:trMA.Ode1C2T.melody	@ltx/en_uk_ware/he.h.m6:heHE.VoithosKaiSkepastis.name
ltx/en_uk_ware/tr.d030:trMA.Ode1C2T.mode	@ltx/en_uk_ware/miscellanea:misc.Mode6
ltx/en_uk_ware/tr.d030:trMA.Ode1C2T.ode	@ltx/en_uk_ware/miscellanea:misc.Ode1
ltx/en_uk_ware/tr.d030:trMA.Ode1C2T.text	Who has ever begotten a son not sown by a father according to the law of nature? Yet such a Son the Father begets without a mother. Most strange and marvellous wonder! For thou, pure Virgin, hast at the same time borne both God and man.
ltx/en_uk_ware/tr.d030:trMA.Ode1C2Tr.incipit	Unity in three Persons, sovereign…
ltx/en_uk_ware/tr.d030:trMA.Ode1C2Tr.melody	@ltx/en_uk_ware/he.h.m6:heHE.VoithosKaiSkepastis.name
ltx/en_uk_ware/tr.d030:trMA.Ode1C2Tr.mode	@ltx/en_uk_ware/miscellanea:misc.Mode6
ltx/en_uk_ware/tr.d030:trMA.Ode1C2Tr.ode	@ltx/en_uk_ware/miscellanea:misc.Ode1
ltx/en_uk_ware/tr.d030:trMA.Ode1C2Tr.text	Unity in three Persons, sovereign Lord of all, Source of perfection, God without beginning, Father, Son and All-Holy Spirit, do Thou Thyself save us.
ltx/en_uk_ware/tr.d030:trMA.Ode8C11.greekmelody	@ltx/en_uk_ware/he.h.m4:heHE.LytrotaTouPantos.greekname
ltx/en_uk_ware/tr.d030:trMA.Ode8C11.incipit	Journeying upon the uncertain path…
ltx/en_uk_ware/tr.d030:trMA.Ode8C11.melody	@ltx/en_uk_ware/he.h.m4:heHE.LytrotaTouPantos.name
ltx/en_uk_ware/tr.d030:trMA.Ode8C11.mode	@ltx/en_uk_ware/miscellanea:misc.Mode6
ltx/en_uk_ware/tr.d030:trMA.Ode8C11.ode	@ltx/en_uk_ware/miscellanea:misc.Ode8
ltx/en_uk_ware/tr.d030:trMA.Ode8C11.text	Journeying upon the uncertain path of life, I have fallen among thieves, and am despoiled by my own thoughts; my wounds stink and are corrupt. O Physician of the sick, at the prayers of all Thy saints give me Thine hand.
ltx/en_uk_ware/tr.d030:trMA.Ode8C12.incipit	The waves of grievous sin…
ltx/en_uk_ware/tr.d030:trMA.Ode8C12.melody	@ltx/en_uk_ware/he.h.m4:heHE.LytrotaTouPantos.name
ltx/en_uk_ware/tr.d030:trMA.Ode8C12.mode	@ltx/en_uk_ware/miscellanea:misc.Mode6
ltx/en_uk_ware/tr.d030:trMA.Ode8C12.ode	@ltx/en_uk_ware/miscellanea:misc.Ode8
ltx/en_uk_ware/tr.d030:trMA.Ode8C12.text	The waves of grievous sin confuse my understanding; save me, O Jesus, as once Thou hast saved Peter, for I sing to Thee: O all ye works, bless ye and praise ye the Lord.
ltx/en_uk_ware/tr.d030:trMA.Ode8C13.incipit	Let us kill the passions…
ltx/en_uk_ware/tr.d030:trMA.Ode8C13.melody	@ltx/en_uk_ware/he.h.m4:heHE.LytrotaTouPantos.name
ltx/en_uk_ware/tr.d030:trMA.Ode8C13.mode	@ltx/en_uk_ware/miscellanea:misc.Mode6
ltx/en_uk_ware/tr.d030:trMA.Ode8C13.ode	@ltx/en_uk_ware/miscellanea:misc.Ode8
ltx/en_uk_ware/tr.d030:trMA.Ode8C13.text	Let us kill the passions by abstinence, and through fasting let us make our spirit mount on wings to heaven; and let us cry with contrite hearts: We have sinned against Thee, O God; in Thy compassion forgive us.
ltx/en_uk_ware/tr.d030:trMA.Ode8C1T.incipit	Coming to dwell within thy…
ltx/en_uk_ware/tr.d030:trMA.Ode8C1T.melody	@ltx/en_uk_ware/he.h.m4:heHE.LytrotaTouPantos.name
ltx/en_uk_ware/tr.d030:trMA.Ode8C1T.mode	@ltx/en_uk_ware/miscellanea:misc.Mode6
ltx/en_uk_ware/tr.d030:trMA.Ode8C1T.ode	@ltx/en_uk_ware/miscellanea:misc.Ode8
ltx/en_uk_ware/tr.d030:trMA.Ode8C1T.text	Coming to dwell within thy womb, the Most High made thee more spacious than the heavens. He has appointed thee, O Virgin, as an invincible protection unto those that cry: O all ye works, bless ye and praise ye the Lord.
ltx/en_uk_ware/tr.d030:trMA.Ode8C21.greekmelody	@ltx/en_uk_ware/he.h.m6:heHE.OnStratiaiOuranon.greekname
ltx/en_uk_ware/tr.d030:trMA.Ode8C21.incipit	Deliver my soul from enslavement…
ltx/en_uk_ware/tr.d030:trMA.Ode8C21.melody	@ltx/en_uk_ware/he.h.m6:heHE.OnStratiaiOuranon.name
ltx/en_uk_ware/tr.d030:trMA.Ode8C21.mode	@ltx/en_uk_ware/miscellanea:misc.Mode6
ltx/en_uk_ware/tr.d030:trMA.Ode8C21.ode	@ltx/en_uk_ware/miscellanea:misc.Ode8
ltx/en_uk_ware/tr.d030:trMA.Ode8C21.text	Deliver my soul from enslavement to the tyranny of the passions, O Lord, that I may freely do Thy will and with rejoicing glorify Thy power for ever.
ltx/en_uk_ware/tr.d030:trMA.Ode8C22.incipit	O my soul, hate the…
ltx/en_uk_ware/tr.d030:trMA.Ode8C22.melody	@ltx/en_uk_ware/he.h.m6:heHE.OnStratiaiOuranon.name
ltx/en_uk_ware/tr.d030:trMA.Ode8C22.mode	@ltx/en_uk_ware/miscellanea:misc.Mode6
ltx/en_uk_ware/tr.d030:trMA.Ode8C22.ode	@ltx/en_uk_ware/miscellanea:misc.Ode8
ltx/en_uk_ware/tr.d030:trMA.Ode8C22.text	O my soul, hate the incontinence of Esau and emulate the virtues of Jacob; catch Beelzebub by the heel and throw him down; through abstinence grow rich in things divine and sing praises unto God for ever.
ltx/en_uk_ware/tr.d030:trMA.Ode8C2A1.incipit	No man became foolish through…
ltx/en_uk_ware/tr.d030:trMA.Ode8C2A1.melody	@ltx/en_uk_ware/he.h.m6:heHE.OnStratiaiOuranon.name
ltx/en_uk_ware/tr.d030:trMA.Ode8C2A1.mode	@ltx/en_uk_ware/miscellanea:misc.Mode6
ltx/en_uk_ware/tr.d030:trMA.Ode8C2A1.ode	@ltx/en_uk_ware/miscellanea:misc.Ode8
ltx/en_uk_ware/tr.d030:trMA.Ode8C2A1.text	No man became foolish through drinking water, but thou, O Noah, hast exposed thy nakedness after tasting wine; and because of drunkenness Lot sowed seeds of evil. Flee, O my soul, from their example and sing in praise of Christ.
ltx/en_uk_ware/tr.d030:trMA.Ode8C2H.greekmelody	@ltx/en_uk_ware/he.h.m6:heHE.OnStratiaiOuranon.greekname
ltx/en_uk_ware/tr.d030:trMA.Ode8C2H.incipit	@ltx/en_uk_ware/he.h.m6:heHE.OnStratiaiOuranon.incipit
ltx/en_uk_ware/tr.d030:trMA.Ode8C2H.melody	@ltx/en_uk_ware/he.h.m6:heHE.OnStratiaiOuranon.melody
ltx/en_uk_ware/tr.d030:trMA.Ode8C2H.mode	@ltx/en_uk_ware/miscellanea:misc.Mode6
ltx/en_uk_ware/tr.d030:trMA.Ode8C2H.ode	@ltx/en_uk_ware/miscellanea:misc.Ode8
ltx/en_uk_ware/tr.d030:trMA.Ode8C2H.text	@ltx/en_uk_ware/he.h.m6:heHE.OnStratiaiOuranon.text
ltx/en_uk_ware/tr.d030:trMA.Ode8C2T.incipit	From thy womb filled with…
ltx/en_uk_ware/tr.d030:trMA.Ode8C2T.melody	@ltx/en_uk_ware/he.h.m6:heHE.OnStratiaiOuranon.name
ltx/en_uk_ware/tr.d030:trMA.Ode8C2T.mode	@ltx/en_uk_ware/miscellanea:misc.Mode6
ltx/en_uk_ware/tr.d030:trMA.Ode8C2T.ode	@ltx/en_uk_ware/miscellanea:misc.Ode8
ltx/en_uk_ware/tr.d030:trMA.Ode8C2T.text	From thy womb filled with radiance, Christ has come forth as a bridegroom from his chamber, and as a great light He has illumined those in darkness. As lightning has the Sun of righteousness shone out, O pure Virgin, and given light to the world.
ltx/en_uk_ware/tr.d030:trMA.Ode8C2Tr.incipit	I honour God one in…
ltx/en_uk_ware/tr.d030:trMA.Ode8C2Tr.melody	@ltx/en_uk_ware/he.h.m6:heHE.OnStratiaiOuranon.name
ltx/en_uk_ware/tr.d030:trMA.Ode8C2Tr.mode	@ltx/en_uk_ware/miscellanea:misc.Mode6
ltx/en_uk_ware/tr.d030:trMA.Ode8C2Tr.ode	@ltx/en_uk_ware/miscellanea:misc.Ode8
ltx/en_uk_ware/tr.d030:trMA.Ode8C2Tr.text	I honour God one in Essence; I sing the praises of the three Persons, distinct from one another yet not differing in Nature, for there is one Godhead and one Power in the three, Father, Son and Spirit.
ltx/en_uk_ware/tr.d030:trMA.Ode9C11.greekmelody	@ltx/en_uk_ware/he.h.m4:heHE.EvaMenToTisParakois.greekname
ltx/en_uk_ware/tr.d030:trMA.Ode9C11.incipit	Let us fast from the…
ltx/en_uk_ware/tr.d030:trMA.Ode9C11.melody	@ltx/en_uk_ware/he.h.m4:heHE.EvaMenToTisParakois.name
ltx/en_uk_ware/tr.d030:trMA.Ode9C11.mode	@ltx/en_uk_ware/miscellanea:misc.Mode4
ltx/en_uk_ware/tr.d030:trMA.Ode9C11.ode	@ltx/en_uk_ware/miscellanea:misc.Ode9
ltx/en_uk_ware/tr.d030:trMA.Ode9C11.text	Let us fast from the rage of the passions, let us delight in unfeigned love, let us feed the poor with bread; and, nourished by the grace of God, with weeping let us quench the tears of future punishment.
ltx/en_uk_ware/tr.d030:trMA.Ode9C12.incipit	O miserable soul, groan aloud…
ltx/en_uk_ware/tr.d030:trMA.Ode9C12.melody	@ltx/en_uk_ware/he.h.m4:heHE.EvaMenToTisParakois.name
ltx/en_uk_ware/tr.d030:trMA.Ode9C12.mode	@ltx/en_uk_ware/miscellanea:misc.Mode4
ltx/en_uk_ware/tr.d030:trMA.Ode9C12.ode	@ltx/en_uk_ware/miscellanea:misc.Ode9
ltx/en_uk_ware/tr.d030:trMA.Ode9C12.text	O miserable soul, groan aloud, be of sad countenance, and give proof of thy repentance, for the day is now at hand. With all severity the Judge will sit upon His throne and assign to each the due reward of all his actions, as it is written.
ltx/en_uk_ware/tr.d030:trMA.Ode9C13.incipit	I have acquired no good…
ltx/en_uk_ware/tr.d030:trMA.Ode9C13.melody	@ltx/en_uk_ware/he.h.m4:heHE.EvaMenToTisParakois.name
ltx/en_uk_ware/tr.d030:trMA.Ode9C13.mode	@ltx/en_uk_ware/miscellanea:misc.Mode4
ltx/en_uk_ware/tr.d030:trMA.Ode9C13.ode	@ltx/en_uk_ware/miscellanea:misc.Ode9
ltx/en_uk_ware/tr.d030:trMA.Ode9C13.text	I have acquired no good deeds, but have stained the robe with which I was clothed in Holy Baptism. I walk in the darkness of ignorance: raise me up from my despair, O Lord, and guide me on my way by the light of Thy countenance.
ltx/en_uk_ware/tr.d030:trMA.Ode9C1T.incipit	O Virgin Mary, Queen of…
ltx/en_uk_ware/tr.d030:trMA.Ode9C1T.melody	@ltx/en_uk_ware/he.h.m4:heHE.EvaMenToTisParakois.name
ltx/en_uk_ware/tr.d030:trMA.Ode9C1T.mode	@ltx/en_uk_ware/miscellanea:misc.Mode4
ltx/en_uk_ware/tr.d030:trMA.Ode9C1T.ode	@ltx/en_uk_ware/miscellanea:misc.Ode9
ltx/en_uk_ware/tr.d030:trMA.Ode9C1T.text	O Virgin Mary, Queen of all, I am enslaved by every kind of sin: set me free, for in ways beyond our understanding thou hast given birth to the Lord who saves our souls, the true and living Goodness.
ltx/en_uk_ware/tr.d030:trMA.Ode9C21.greekmelody	@ltx/en_uk_ware/he.h.m6:heHE.AsporouSyllipseos.greekname
ltx/en_uk_ware/tr.d030:trMA.Ode9C21.incipit	As soldiers of Christ let…
ltx/en_uk_ware/tr.d030:trMA.Ode9C21.melody	@ltx/en_uk_ware/he.h.m6:heHE.AsporouSyllipseos.name
ltx/en_uk_ware/tr.d030:trMA.Ode9C21.mode	@ltx/en_uk_ware/miscellanea:misc.Mode6
ltx/en_uk_ware/tr.d030:trMA.Ode9C21.ode	@ltx/en_uk_ware/miscellanea:misc.Ode9
ltx/en_uk_ware/tr.d030:trMA.Ode9C21.text	As soldiers of Christ let us now suffer hardship: for quickly will the time pass by, and on those who have fought bravely Christ will bestow crowns of victory, when He comes in glory upon the earth to judge all the world.
ltx/en_uk_ware/tr.d030:trMA.Ode9C22.incipit	I am all wounded, O…
ltx/en_uk_ware/tr.d030:trMA.Ode9C22.melody	@ltx/en_uk_ware/he.h.m6:heHE.AsporouSyllipseos.name
ltx/en_uk_ware/tr.d030:trMA.Ode9C22.mode	@ltx/en_uk_ware/miscellanea:misc.Mode6
ltx/en_uk_ware/tr.d030:trMA.Ode9C22.ode	@ltx/en_uk_ware/miscellanea:misc.Ode9
ltx/en_uk_ware/tr.d030:trMA.Ode9C22.text	I am all wounded, O my Christ, I am all covered with sores: heal the wounds inflicted on me by the passions, heal the sores and gangrene of my sins, and like the leper may I hear Thee say: ‘I will do so, be thou clean.’
ltx/en_uk_ware/tr.d030:trMA.Ode9C2A1.incipit	O my soul, because of…
ltx/en_uk_ware/tr.d030:trMA.Ode9C2A1.melody	@ltx/en_uk_ware/he.h.m6:heHE.AsporouSyllipseos.name
ltx/en_uk_ware/tr.d030:trMA.Ode9C2A1.mode	@ltx/en_uk_ware/miscellanea:misc.Mode6
ltx/en_uk_ware/tr.d030:trMA.Ode9C2A1.ode	@ltx/en_uk_ware/miscellanea:misc.Ode9
ltx/en_uk_ware/tr.d030:trMA.Ode9C2A1.text	O my soul, because of fasting Moses beheld God; because of fasting Elijah rode in the chariot of fire, and Paul was taken up to heaven. Therefore let us fast from evil and we also shall be taken up on high, gaining freedom from the passions.
ltx/en_uk_ware/tr.d030:trMA.Ode9C2H.greekmelody	@ltx/en_uk_ware/he.h.m6:heHE.AsporouSyllipseos.greekname
ltx/en_uk_ware/tr.d030:trMA.Ode9C2H.incipit	@ltx/en_uk_ware/he.h.m6:heHE.AsporouSyllipseos.incipit
ltx/en_uk_ware/tr.d030:trMA.Ode9C2H.melody	@ltx/en_uk_ware/he.h.m6:heHE.AsporouSyllipseos.melody
ltx/en_uk_ware/tr.d030:trMA.Ode9C2H.mode	@ltx/en_uk_ware/miscellanea:misc.Mode6
ltx/en_uk_ware/tr.d030:trMA.Ode9C2H.ode	@ltx/en_uk_ware/miscellanea:misc.Ode9
ltx/en_uk_ware/tr.d030:trMA.Ode9C2H.text	@ltx/en_uk_ware/he.h.m6:heHE.AsporouSyllipseos.text
ltx/en_uk_ware/tr.d030:trMA.Ode9C2T.incipit	The marvel of thy childbearing…
ltx/en_uk_ware/tr.d030:trMA.Ode9C2T.melody	@ltx/en_uk_ware/he.h.m6:heHE.AsporouSyllipseos.name
ltx/en_uk_ware/tr.d030:trMA.Ode9C2T.mode	@ltx/en_uk_ware/miscellanea:misc.Mode6
ltx/en_uk_ware/tr.d030:trMA.Ode9C2T.ode	@ltx/en_uk_ware/miscellanea:misc.Ode9
ltx/en_uk_ware/tr.d030:trMA.Ode9C2T.text	The marvel of thy childbearing fills me with wonder, O all-blameless Lady. How hast thou conceived without seed Him whom none can comprehend? How hast thou remained a Virgin and yet become a Mother? ‘Accept the miracle with faith, and worship the Child that is born: for all that He wills, He has the power to do.’
ltx/en_uk_ware/tr.d030:trMA.Ode9C2Tr.incipit	O Father, single only-Begetter of…
ltx/en_uk_ware/tr.d030:trMA.Ode9C2Tr.melody	@ltx/en_uk_ware/he.h.m6:heHE.AsporouSyllipseos.name
ltx/en_uk_ware/tr.d030:trMA.Ode9C2Tr.mode	@ltx/en_uk_ware/miscellanea:misc.Mode6
ltx/en_uk_ware/tr.d030:trMA.Ode9C2Tr.ode	@ltx/en_uk_ware/miscellanea:misc.Ode9
ltx/en_uk_ware/tr.d030:trMA.Ode9C2Tr.text	O Father, single only-Begetter of the only-Begotten Son;O only Light and Brightness from the one and only Light; and Thou, one and only Holy Spirit from the one God, true Lord from the Lord: O holy Three in One, save me as I tell of Thy divinity.
ltx/en_uk_ware/tr.d030:trTE.Troparion.incipit	…
ltx/en_uk_ware/tr.d030:trTE.Troparion.melody	
ltx/en_uk_ware/tr.d030:trTE.Troparion.mode	@ltx/en_uk_ware/miscellanea:misc.Mode1
ltx/en_uk_ware/tr.d030:trTE.Troparion.text	
ltx/en_uk_ware/tr.d030:trTE.Troparion2.text	
ltx/en_uk_ware/tr.d030:trVE.AposIdiomelon1.incipit	…
ltx/en_uk_ware/tr.d030:trVE.AposIdiomelon1.melody	@ltx/en_uk_ware/miscellanea:misc.Idiomelon
ltx/en_uk_ware/tr.d030:trVE.AposIdiomelon1.mode	@ltx/en_uk_ware/miscellanea:misc.Mode8
ltx/en_uk_ware/tr.d030:trVE.AposIdiomelon1.text	
ltx/en_uk_ware/tr.d030:trVE.AposMartyric.incipit	…
ltx/en_uk_ware/tr.d030:trVE.AposMartyric.melody	
ltx/en_uk_ware/tr.d030:trVE.AposMartyric.mode	@ltx/en_uk_ware/miscellanea:misc.Mode8
ltx/en_uk_ware/tr.d030:trVE.AposMartyric.text	
ltx/en_uk_ware/tr.d030:trVE.AposTheotokion.incipit	The heavenly powers praise thee…
ltx/en_uk_ware/tr.d030:trVE.AposTheotokion.melody	
ltx/en_uk_ware/tr.d030:trVE.AposTheotokion.mode	@ltx/en_uk_ware/miscellanea:misc.Mode8
ltx/en_uk_ware/tr.d030:trVE.AposTheotokion.text	The heavenly powers praise thee, O Virgin Mother full of grace, and we also glorify thy childbearing that none can understand. O Theotokos, pray for the salvation of our souls.
ltx/en_uk_ware/tr.d030:trVE.Stichera01.greekmelody	@ltx/en_uk_ware/he.a.m4:heAU.EdokasSimeiosin.greekname
ltx/en_uk_ware/tr.d030:trVE.Stichera01.incipit	…
ltx/en_uk_ware/tr.d030:trVE.Stichera01.melody	@ltx/en_uk_ware/he.a.m4:heAU.EdokasSimeiosin.name
ltx/en_uk_ware/tr.d030:trVE.Stichera01.mode	@ltx/en_uk_ware/miscellanea:misc.Mode4
ltx/en_uk_ware/tr.d030:trVE.Stichera01.poet	@ltx/en_uk_ware/poets:po.Iosif
ltx/en_uk_ware/tr.d030:trVE.Stichera01.text	
ltx/en_uk_ware/tr.d030:trVE.Stichera02.greekmelody	@ltx/en_uk_ware/he.a.m4:heAU.EdokasSimeiosin.greekname
ltx/en_uk_ware/tr.d030:trVE.Stichera02.incipit	…
ltx/en_uk_ware/tr.d030:trVE.Stichera02.melody	@ltx/en_uk_ware/he.a.m4:heAU.EdokasSimeiosin.name
ltx/en_uk_ware/tr.d030:trVE.Stichera02.mode	@ltx/en_uk_ware/miscellanea:misc.Mode4
ltx/en_uk_ware/tr.d030:trVE.Stichera02.text	
ltx/en_uk_ware/tr.d030:trVE.Stichera03.incipit	…
ltx/en_uk_ware/tr.d030:trVE.Stichera03.melody	
ltx/en_uk_ware/tr.d030:trVE.Stichera03.mode	@ltx/en_uk_ware/miscellanea:misc.Mode6
ltx/en_uk_ware/tr.d030:trVE.Stichera03.poet	@ltx/en_uk_ware/poets:po.KyriouTheodorou
ltx/en_uk_ware/tr.d030:trVE.Stichera03.text	
