ltx/en_uk_ware/poets:po.AgiouKosma	
ltx/en_uk_ware/poets:po.AgiouKosmaOiDeIoannouMonachou	
ltx/en_uk_ware/poets:po.Anatoliou	
ltx/en_uk_ware/poets:po.AnatoliouOiDeAndreouIerosolymitou	
ltx/en_uk_ware/poets:po.AndreouIerosolymitou	
ltx/en_uk_ware/poets:po.AndreouIerosolymitouOiDeAnatoliou	
ltx/en_uk_ware/poets:po.AndreouKritis	
ltx/en_uk_ware/poets:po.AndreouPyrou	
ltx/en_uk_ware/poets:po.AndreouTyflou	
ltx/en_uk_ware/poets:po.Antoniou	
ltx/en_uk_ware/poets:po.Arseniou	
ltx/en_uk_ware/poets:po.AthanasiouSimonopetritou	
ltx/en_uk_ware/poets:po.CharalambousBousia	
ltx/en_uk_ware/poets:po.ChristoforouTouProtasikritou	
ltx/en_uk_ware/poets:po.EfraimKarias	
ltx/en_uk_ware/poets:po.FotiouPatriarchou	
ltx/en_uk_ware/poets:po.Georgiou	
ltx/en_uk_ware/poets:po.GeorgiouNikomideias	
ltx/en_uk_ware/poets:po.GeorgiouSikeliotou	
ltx/en_uk_ware/poets:po.Gerasimou	
ltx/en_uk_ware/poets:po.GerasimouAlexandreias	
ltx/en_uk_ware/poets:po.GerasimouMonachouMikragiannanitou	
ltx/en_uk_ware/poets:po.Germanou	
ltx/en_uk_ware/poets:po.GermanouOiDeAnatoliou	
ltx/en_uk_ware/poets:po.GermanouOiDeIoannouMonachou	
ltx/en_uk_ware/poets:po.GermanouOiDeVyzantiou	
ltx/en_uk_ware/poets:po.GermanouPatriarchou	
ltx/en_uk_ware/poets:po.IakovouProtopsaltou	
ltx/en_uk_ware/poets:po.Ignatiou	
ltx/en_uk_ware/poets:po.IgnatiouNikaias	
ltx/en_uk_ware/poets:po.IkasiasMonachis	
ltx/en_uk_ware/poets:po.Ioannou	
ltx/en_uk_ware/poets:po.IoannouEfchaiton	
ltx/en_uk_ware/poets:po.IoannouMonachou	
ltx/en_uk_ware/poets:po.IoannouTouDamaskinou	
ltx/en_uk_ware/poets:po.IoilEdessis	
ltx/en_uk_ware/poets:po.Iosif	by Joseph
ltx/en_uk_ware/poets:po.IosifThessalonikis	
ltx/en_uk_ware/poets:po.IosifTouYmnografou	
ltx/en_uk_ware/poets:po.Kasias	
ltx/en_uk_ware/poets:po.KassiasMonachis	
ltx/en_uk_ware/poets:po.Klimentos	
ltx/en_uk_ware/poets:po.Kosma	
ltx/en_uk_ware/poets:po.KosmaAgiopolitou	
ltx/en_uk_ware/poets:po.KosmaMonachou	
ltx/en_uk_ware/poets:po.Koumoula	
ltx/en_uk_ware/poets:po.Kyprianou	
ltx/en_uk_ware/poets:po.KyprianouMonachou	
ltx/en_uk_ware/poets:po.KyrillouAlexandreias	
ltx/en_uk_ware/poets:po.KyrillouPatriarchou	
ltx/en_uk_ware/poets:po.KyriouAndreou	
ltx/en_uk_ware/poets:po.KyriouGeorgiou	
ltx/en_uk_ware/poets:po.KyriouIoannou	
ltx/en_uk_ware/poets:po.KyriouIoannouArkla	
ltx/en_uk_ware/poets:po.KyriouIosif	
ltx/en_uk_ware/poets:po.KyriouKosma	
ltx/en_uk_ware/poets:po.KyriouTheodorou	
ltx/en_uk_ware/poets:po.KyriouTheofanous	
ltx/en_uk_ware/poets:po.KyriouVasileiou	
ltx/en_uk_ware/poets:po.KyrouGeorgiou	
ltx/en_uk_ware/poets:po.LeontosDespotou	
ltx/en_uk_ware/poets:po.LeontosMaistoros	
ltx/en_uk_ware/poets:po.LeontosTouVasileos	
ltx/en_uk_ware/poets:po.Malaxou	
ltx/en_uk_ware/poets:po.Mavroleontos	
ltx/en_uk_ware/poets:po.MeletiouIeromartyrosVlastou	
ltx/en_uk_ware/poets:po.Methodiou	
ltx/en_uk_ware/poets:po.MethodiouPatriarchou	
ltx/en_uk_ware/poets:po.MitrofanousSmirnis	
ltx/en_uk_ware/poets:po.MitropolitouArtisSerafim	
ltx/en_uk_ware/poets:po.NeilouTouXanthopoulou	
ltx/en_uk_ware/poets:po.NikiforouChiou	
ltx/en_uk_ware/poets:po.NikodimouAgioreitou	
ltx/en_uk_ware/poets:po.Nikolaou	
ltx/en_uk_ware/poets:po.PatriarchouAnthimou	
ltx/en_uk_ware/poets:po.PatriarchouKyrillou	
ltx/en_uk_ware/poets:po.PavlouIeromonachou	
ltx/en_uk_ware/poets:po.ProkopiouChartofylakos	
ltx/en_uk_ware/poets:po.RomanouTouMelodou	by Romanos the Melodist
ltx/en_uk_ware/poets:po.Sergiou	
ltx/en_uk_ware/poets:po.SergiouAgiopolitou	
ltx/en_uk_ware/poets:po.SofroniouPatriarchouIerosolymon	Composed by Sophronios, Patriarch of Jerusalem.
ltx/en_uk_ware/poets:po.Stefanou	
ltx/en_uk_ware/poets:po.StefanouAgiopolitou	
ltx/en_uk_ware/poets:po.StefanouTouSavaitou	
ltx/en_uk_ware/poets:po.Stouditou	
ltx/en_uk_ware/poets:po.Sykeotou	
ltx/en_uk_ware/poets:po.SymeonThessalonikis	
ltx/en_uk_ware/poets:po.SymeonTouLogothetou	
ltx/en_uk_ware/poets:po.SymeonTouMetafrastou	
ltx/en_uk_ware/poets:po.Tarasiou	
ltx/en_uk_ware/poets:po.Theodorou	by Theodore
ltx/en_uk_ware/poets:po.TheodorouTouStouditou	
ltx/en_uk_ware/poets:po.Theofanous	
ltx/en_uk_ware/poets:po.TheofanousOiDeIoannouMonachou	
ltx/en_uk_ware/poets:po.TheostiriktouMonachouOiDeThefanous	
ltx/en_uk_ware/poets:po.Vasileiou	
ltx/en_uk_ware/poets:po.VasileiouMonachou	
ltx/en_uk_ware/poets:po.Vavyla	
ltx/en_uk_ware/poets:po.Vyzantiou	
ltx/en_uk_ware/poets:po.Vyzantos	
