ltx/en_uk_ware/he.a.m1:heAU.ChorosAngelikos.greekname	Χορὸς ἀγγελικός.
ltx/en_uk_ware/he.a.m1:heAU.ChorosAngelikos.incipit	…
ltx/en_uk_ware/he.a.m1:heAU.ChorosAngelikos.melody	@ltx/en_uk_ware/miscellanea:misc.Automelon
ltx/en_uk_ware/he.a.m1:heAU.ChorosAngelikos.mode	@ltx/en_uk_ware/miscellanea:misc.Mode1
ltx/en_uk_ware/he.a.m1:heAU.ChorosAngelikos.name	(N/M)
ltx/en_uk_ware/he.a.m1:heAU.ChorosAngelikos.text	
ltx/en_uk_ware/he.a.m1:heAU.NefelinSeFotos.greekname	Νεφέλην σε φωτός.
ltx/en_uk_ware/he.a.m1:heAU.NefelinSeFotos.incipit	…
ltx/en_uk_ware/he.a.m1:heAU.NefelinSeFotos.melody	@ltx/en_uk_ware/miscellanea:misc.Automelon
ltx/en_uk_ware/he.a.m1:heAU.NefelinSeFotos.mode	@ltx/en_uk_ware/miscellanea:misc.Mode1
ltx/en_uk_ware/he.a.m1:heAU.NefelinSeFotos.name	(N/M)
ltx/en_uk_ware/he.a.m1:heAU.NefelinSeFotos.text	
ltx/en_uk_ware/he.a.m1:heAU.OTouParadoxouThavmatos.greekname	Ὢ τοῦ παραδόξου θαύματος.
ltx/en_uk_ware/he.a.m1:heAU.OTouParadoxouThavmatos.incipit	…
ltx/en_uk_ware/he.a.m1:heAU.OTouParadoxouThavmatos.melody	@ltx/en_uk_ware/miscellanea:misc.Automelon
ltx/en_uk_ware/he.a.m1:heAU.OTouParadoxouThavmatos.mode	@ltx/en_uk_ware/miscellanea:misc.Mode1
ltx/en_uk_ware/he.a.m1:heAU.OTouParadoxouThavmatos.name	(N/M)
ltx/en_uk_ware/he.a.m1:heAU.OTouParadoxouThavmatos.text	
ltx/en_uk_ware/he.a.m1:heAU.OtanElthisOTheos.greekname	Ὅταν ἔλθῃς ὁ Θεός.
ltx/en_uk_ware/he.a.m1:heAU.OtanElthisOTheos.incipit	…
ltx/en_uk_ware/he.a.m1:heAU.OtanElthisOTheos.melody	@ltx/en_uk_ware/miscellanea:misc.Automelon
ltx/en_uk_ware/he.a.m1:heAU.OtanElthisOTheos.mode	@ltx/en_uk_ware/miscellanea:misc.Mode1
ltx/en_uk_ware/he.a.m1:heAU.OtanElthisOTheos.name	(N/M)
ltx/en_uk_ware/he.a.m1:heAU.OtanElthisOTheos.text	
ltx/en_uk_ware/he.a.m1:heAU.PaneffimoiMartyres.greekname	Πανεύφημοι μάρτυρες.
ltx/en_uk_ware/he.a.m1:heAU.PaneffimoiMartyres.incipit	O martyrs worthy of all praise…
ltx/en_uk_ware/he.a.m1:heAU.PaneffimoiMartyres.melody	@ltx/en_uk_ware/miscellanea:misc.Automelon
ltx/en_uk_ware/he.a.m1:heAU.PaneffimoiMartyres.mode	@ltx/en_uk_ware/miscellanea:misc.Mode1
ltx/en_uk_ware/he.a.m1:heAU.PaneffimoiMartyres.name	(NM)
ltx/en_uk_ware/he.a.m1:heAU.PaneffimoiMartyres.text	O martyrs worthy of all praise, your bodies were not buried in the earth, yet heaven has received you; the gates of Paradise were opened to you, and entering within ye have eaten from the Tree of Life. Pray to Christ that He may grant peace and mercy to our souls.
ltx/en_uk_ware/he.a.m1:heAU.TisErimouPolitis.greekname	Τῆς ἐρήμου πολίτης.
ltx/en_uk_ware/he.a.m1:heAU.TisErimouPolitis.incipit	…
ltx/en_uk_ware/he.a.m1:heAU.TisErimouPolitis.melody	@ltx/en_uk_ware/miscellanea:misc.Automelon
ltx/en_uk_ware/he.a.m1:heAU.TisErimouPolitis.mode	@ltx/en_uk_ware/miscellanea:misc.Mode1
ltx/en_uk_ware/he.a.m1:heAU.TisErimouPolitis.name	(N/M)
ltx/en_uk_ware/he.a.m1:heAU.TisErimouPolitis.text	
ltx/en_uk_ware/he.a.m1:heAU.TonOuranionTagmaton.greekname	Τῶν οὐρανίων ταγμάτων.
ltx/en_uk_ware/he.a.m1:heAU.TonOuranionTagmaton.incipit	…
ltx/en_uk_ware/he.a.m1:heAU.TonOuranionTagmaton.melody	@ltx/en_uk_ware/miscellanea:misc.Automelon
ltx/en_uk_ware/he.a.m1:heAU.TonOuranionTagmaton.mode	@ltx/en_uk_ware/miscellanea:misc.Mode1
ltx/en_uk_ware/he.a.m1:heAU.TonOuranionTagmaton.name	(N/M)
ltx/en_uk_ware/he.a.m1:heAU.TonOuranionTagmaton.text	
ltx/en_uk_ware/he.a.m1:heAU.TonTafonSouSotir.greekname	Τὸν τάφον σου Σωτήρ.
ltx/en_uk_ware/he.a.m1:heAU.TonTafonSouSotir.incipit	…
ltx/en_uk_ware/he.a.m1:heAU.TonTafonSouSotir.melody	@ltx/en_uk_ware/miscellanea:misc.Automelon
ltx/en_uk_ware/he.a.m1:heAU.TonTafonSouSotir.mode	@ltx/en_uk_ware/miscellanea:misc.Mode1
ltx/en_uk_ware/he.a.m1:heAU.TonTafonSouSotir.name	(N/M)
ltx/en_uk_ware/he.a.m1:heAU.TonTafonSouSotir.text	
ltx/en_uk_ware/he.a.m1:heAU.TouLithouSfragisthentos.greekname	Τοῦ λίθου σφραγισθέντος.
ltx/en_uk_ware/he.a.m1:heAU.TouLithouSfragisthentos.incipit	…
ltx/en_uk_ware/he.a.m1:heAU.TouLithouSfragisthentos.melody	@ltx/en_uk_ware/miscellanea:misc.Automelon
ltx/en_uk_ware/he.a.m1:heAU.TouLithouSfragisthentos.mode	@ltx/en_uk_ware/miscellanea:misc.Mode1
ltx/en_uk_ware/he.a.m1:heAU.TouLithouSfragisthentos.name	(NM)
ltx/en_uk_ware/he.a.m1:heAU.TouLithouSfragisthentos.text	
ltx/en_uk_ware/he.a.m1:heAU.title	
