ltx/en_uk_ware/tr.d062:trCO.header	
ltx/en_uk_ware/tr.d062:trDA.commemoration.full	
ltx/en_uk_ware/tr.d062:trDA.commemoration.short	
ltx/en_uk_ware/tr.d062:trDA.insert1	
ltx/en_uk_ware/tr.d062:trDA.insert2	
ltx/en_uk_ware/tr.d062:trDA.note	
ltx/en_uk_ware/tr.d062:trDA.title	
ltx/en_uk_ware/tr.d062:trHO.commemorations	
ltx/en_uk_ware/tr.d062:trHO.daytitle	
ltx/en_uk_ware/tr.d062:trHO.description1	
ltx/en_uk_ware/tr.d062:trHO.description2	
ltx/en_uk_ware/tr.d062:trHO.note1	
ltx/en_uk_ware/tr.d062:trHO.note2	
ltx/en_uk_ware/tr.d062:trMA.AposGlory.incipit	Having completed the forty days…
ltx/en_uk_ware/tr.d062:trMA.AposGlory.melody	@ltx/en_uk_ware/miscellanea:misc.Idiomelon
ltx/en_uk_ware/tr.d062:trMA.AposGlory.mode	@ltx/en_uk_ware/miscellanea:misc.Mode8
ltx/en_uk_ware/tr.d062:trMA.AposGlory.text	Having completed the forty days that bring profit to our soul, we beseech Thee in Thy love for man: Grant us also to behold the Holy Week of Thy Passion, that in it we may glorify Thy mighty acts and Thine ineffable dispensation for our sakes, singing with one mind: O Lord, glory to Thee.
ltx/en_uk_ware/tr.d062:trMA.AposIdiomelon1.incipit	Despising the divine commands, my…
ltx/en_uk_ware/tr.d062:trMA.AposIdiomelon1.melody	@ltx/en_uk_ware/miscellanea:misc.Idiomelon
ltx/en_uk_ware/tr.d062:trMA.AposIdiomelon1.mode	@ltx/en_uk_ware/miscellanea:misc.Mode4
ltx/en_uk_ware/tr.d062:trMA.AposIdiomelon1.poet	@ltx/en_uk_ware/poets:po.LeontosTouVasileos
ltx/en_uk_ware/tr.d062:trMA.AposIdiomelon1.text	Despising the divine commands, my soul, thou hast become an easy prey to the snares of the enemy; and by thine own choice thou hast surrendered thyself to corruption. Sunk in slumber through thy many trespasses, thou hast covered with filth the garment that God wove for thee, and made thyself unfit for the wedding of the King; and thou shalt be dragged away because of thy sin. For if thou sittest at the wedding feast clad in the raiment of the passions, He will ask thee how thou earnest in, and thou shalt be cast out from the bridal chamber. But cry to the Saviour: O dread eye of God, Thou hast become what I am, without ceasing to be who Thou wast. Before Thy Crucifixion, for my sake Thou hast worn a robe of mockery: tear in pieces my sackcloth and clothe me with gladness; deliver me from the outer darkness and eternal weeping, and have mercy upon me.
ltx/en_uk_ware/tr.d062:trMA.AposMartyric.incipit	Come, all ye peoples, and…
ltx/en_uk_ware/tr.d062:trMA.AposMartyric.melody	
ltx/en_uk_ware/tr.d062:trMA.AposMartyric.mode	@ltx/en_uk_ware/miscellanea:misc.Mode4
ltx/en_uk_ware/tr.d062:trMA.AposMartyric.text	Come, all ye peoples, and with hymns and spiritual songs let us honour the victorious martyrs of Christ. They are lights to the world and preachers of the faith, and an everlasting fountain that flows with healing for the faithful. At their prayers grant peace to Thy world, O Christ our God, and to our souls great mercy.
ltx/en_uk_ware/tr.d062:trMA.C1.poet	@ltx/en_uk_ware/poets:po.Iosif
ltx/en_uk_ware/tr.d062:trMA.C2.poet	@ltx/en_uk_ware/poets:po.Theodorou
ltx/en_uk_ware/tr.d062:trMA.Kathisma21.greekmelody	@ltx/en_uk_ware/he.a.m4:heAU.TachyProkatalave.greekname
ltx/en_uk_ware/tr.d062:trMA.Kathisma21.incipit	Two of the disciples are…
ltx/en_uk_ware/tr.d062:trMA.Kathisma21.melody	@ltx/en_uk_ware/he.a.m4:heAU.TachyProkatalave.notmetered
ltx/en_uk_ware/tr.d062:trMA.Kathisma21.mode	@ltx/en_uk_ware/miscellanea:misc.Mode4
ltx/en_uk_ware/tr.d062:trMA.Kathisma21.text	Two of the disciples are sent to bring the foal of an ass, in accordance with the prophecy; and, mounting upon it, Christ comes in His beauty, accepting the divine praise offered by the children. So let us eagerly hasten to meet Him, bearing as palms our acts of righteousness.
ltx/en_uk_ware/tr.d062:trMA.Kathisma22.greekmelody	@ltx/en_uk_ware/he.a.m4:heAU.TachyProkatalave.greekname
ltx/en_uk_ware/tr.d062:trMA.Kathisma22.incipit	O Virgin undefiled, Mother of…
ltx/en_uk_ware/tr.d062:trMA.Kathisma22.melody	@ltx/en_uk_ware/he.a.m4:heAU.TachyProkatalave.notmetered
ltx/en_uk_ware/tr.d062:trMA.Kathisma22.mode	@ltx/en_uk_ware/miscellanea:misc.Mode4
ltx/en_uk_ware/tr.d062:trMA.Kathisma22.text	O Virgin undefiled, Mother of Christ our God, a sword pierced thine all-holy soul, when thou hast seen thy Son and God crucified of His own will. O blessed among women, never cease to intercede that in this season of the Fast He may grant us pardon of our sins.
ltx/en_uk_ware/tr.d062:trMA.Kathisma31.greekmelody	@ltx/en_uk_ware/he.a.m8:heAU.AnestisEkNekron.greekname
ltx/en_uk_ware/tr.d062:trMA.Kathisma31.incipit	Two of the disciples are…
ltx/en_uk_ware/tr.d062:trMA.Kathisma31.melody	@ltx/en_uk_ware/he.a.m8:heAU.AnestisEkNekron.notmetered
ltx/en_uk_ware/tr.d062:trMA.Kathisma31.mode	@ltx/en_uk_ware/miscellanea:misc.Mode8
ltx/en_uk_ware/tr.d062:trMA.Kathisma31.text	Two of the disciples are sent today to bring the foal of an ass to the Master of all. He who is borne on high by the hosts of the seraphim comes riding on a colt, and all-devouring death, the ruler of this world, begins to be afraid; for, through Lazarus first of all, he is despoiled of mankind.
ltx/en_uk_ware/tr.d062:trMA.Kathisma32.greekmelody	@ltx/en_uk_ware/he.a.m8:heAU.AnestisEkNekron.greekname
ltx/en_uk_ware/tr.d062:trMA.Kathisma32.incipit	Standing at the Passion of…
ltx/en_uk_ware/tr.d062:trMA.Kathisma32.melody	@ltx/en_uk_ware/he.a.m8:heAU.AnestisEkNekron.notmetered
ltx/en_uk_ware/tr.d062:trMA.Kathisma32.mode	@ltx/en_uk_ware/miscellanea:misc.Mode8
ltx/en_uk_ware/tr.d062:trMA.Kathisma32.text	Standing at the Passion of her Son, the pure Virgin lamented bitterly and cried in sorrow: ‘Woe is me, my Child! Thou art glorified by the angels with never-silent hymns; how have the Hebrew children brought Thee before the judgement seat of Pilate? O Word, I sing the praises of Thy great and ineffable compassion.’
ltx/en_uk_ware/tr.d062:trMA.Ode5C11.greekmelody	@ltx/en_uk_ware/he.h.m4:heHE.AnateilonMoiKyrie.greekname
ltx/en_uk_ware/tr.d062:trMA.Ode5C11.incipit	Falling asleep upon the Cross…
ltx/en_uk_ware/tr.d062:trMA.Ode5C11.melody	@ltx/en_uk_ware/he.h.m4:heHE.AnateilonMoiKyrie.name
ltx/en_uk_ware/tr.d062:trMA.Ode5C11.mode	@ltx/en_uk_ware/miscellanea:misc.Mode4
ltx/en_uk_ware/tr.d062:trMA.Ode5C11.ode	@ltx/en_uk_ware/miscellanea:misc.Ode5
ltx/en_uk_ware/tr.d062:trMA.Ode5C11.text	Falling asleep upon the Cross, O Lord and Master, Thou hast put death to sleep. For Thou hast cried: ‘My friend Lazarus is sleeping, but I shall go now to awake him.’
ltx/en_uk_ware/tr.d062:trMA.Ode5C12.incipit	Fulfilling the sayings of the…
ltx/en_uk_ware/tr.d062:trMA.Ode5C12.melody	@ltx/en_uk_ware/he.h.m4:heHE.AnateilonMoiKyrie.name
ltx/en_uk_ware/tr.d062:trMA.Ode5C12.mode	@ltx/en_uk_ware/miscellanea:misc.Mode4
ltx/en_uk_ware/tr.d062:trMA.Ode5C12.ode	@ltx/en_uk_ware/miscellanea:misc.Ode5
ltx/en_uk_ware/tr.d062:trMA.Ode5C12.text	Fulfilling the sayings of the prophets, in Thy compassion Thou hast come, O Christ, to the city that killed the prophets; and there of Thine own will Thou shalt be slain, saving from corruption me who am dead.
ltx/en_uk_ware/tr.d062:trMA.Ode5C13.incipit	All ye who through abstinence…
ltx/en_uk_ware/tr.d062:trMA.Ode5C13.melody	@ltx/en_uk_ware/he.h.m4:heHE.AnateilonMoiKyrie.name
ltx/en_uk_ware/tr.d062:trMA.Ode5C13.mode	@ltx/en_uk_ware/miscellanea:misc.Mode4
ltx/en_uk_ware/tr.d062:trMA.Ode5C13.ode	@ltx/en_uk_ware/miscellanea:misc.Ode5
ltx/en_uk_ware/tr.d062:trMA.Ode5C13.text	All ye who through abstinence and prayer have made your rebellious body submissive to the Word, both monks and laity, go out and meet Christ who rides upon a foal and comes to His Passion.
ltx/en_uk_ware/tr.d062:trMA.Ode5C1T.incipit	O all-pure Virgin, with the…
ltx/en_uk_ware/tr.d062:trMA.Ode5C1T.melody	@ltx/en_uk_ware/he.h.m4:heHE.AnateilonMoiKyrie.name
ltx/en_uk_ware/tr.d062:trMA.Ode5C1T.mode	@ltx/en_uk_ware/miscellanea:misc.Mode4
ltx/en_uk_ware/tr.d062:trMA.Ode5C1T.ode	@ltx/en_uk_ware/miscellanea:misc.Ode5
ltx/en_uk_ware/tr.d062:trMA.Ode5C1T.text	O all-pure Virgin, with the drops of thy mercy water my heart that is tormented in the flame of sin. O Gate of the Light, kindle my lamp that has gone out.
ltx/en_uk_ware/tr.d062:trMA.Ode5C21.greekmelody	@ltx/en_uk_ware/he.h.m8:heHE.TonZofonTisPsychisMou.greekname
ltx/en_uk_ware/tr.d062:trMA.Ode5C21.incipit	Approaching Bethany, O Christ, Thou…
ltx/en_uk_ware/tr.d062:trMA.Ode5C21.melody	@ltx/en_uk_ware/he.h.m8:heHE.TonZofonTisPsychisMou.name
ltx/en_uk_ware/tr.d062:trMA.Ode5C21.mode	@ltx/en_uk_ware/miscellanea:misc.Mode8
ltx/en_uk_ware/tr.d062:trMA.Ode5C21.ode	@ltx/en_uk_ware/miscellanea:misc.Ode5
ltx/en_uk_ware/tr.d062:trMA.Ode5C21.text	Approaching Bethany, O Christ, Thou sendest two of Thy disciples to fetch Thee a foal on which no man had sat. For none but Thyself, O Saviour, has brought into subjection the peoples who were without reason.
ltx/en_uk_ware/tr.d062:trMA.Ode5C22.incipit	A great number of Jews…
ltx/en_uk_ware/tr.d062:trMA.Ode5C22.melody	@ltx/en_uk_ware/he.h.m8:heHE.TonZofonTisPsychisMou.name
ltx/en_uk_ware/tr.d062:trMA.Ode5C22.mode	@ltx/en_uk_ware/miscellanea:misc.Mode8
ltx/en_uk_ware/tr.d062:trMA.Ode5C22.ode	@ltx/en_uk_ware/miscellanea:misc.Ode5
ltx/en_uk_ware/tr.d062:trMA.Ode5C22.text	A great number of Jews came today from Jerusalem to Bethany and shared the sorrow of the sisters of Lazarus; but when they learned on the next day that Lazarus had come out from the tomb, they sought to kill Christ.
ltx/en_uk_ware/tr.d062:trMA.Ode5C2A1.incipit	Behold, Christ makes ready to…
ltx/en_uk_ware/tr.d062:trMA.Ode5C2A1.melody	@ltx/en_uk_ware/he.h.m8:heHE.TonZofonTisPsychisMou.name
ltx/en_uk_ware/tr.d062:trMA.Ode5C2A1.mode	@ltx/en_uk_ware/miscellanea:misc.Mode8
ltx/en_uk_ware/tr.d062:trMA.Ode5C2A1.ode	@ltx/en_uk_ware/miscellanea:misc.Ode5
ltx/en_uk_ware/tr.d062:trMA.Ode5C2A1.text	Behold, Christ makes ready to enter Jerusalem. Let all who dwell as solitaries in the mountains and the desert assemble together and come to meet Him, sharing in the joy of the whole world.
ltx/en_uk_ware/tr.d062:trMA.Ode5C2H.greekmelody	@ltx/en_uk_ware/he.h.m8:heHE.TonZofonTisPsychisMou.greekname
ltx/en_uk_ware/tr.d062:trMA.Ode5C2H.incipit	@ltx/en_uk_ware/he.h.m8:heHE.TonZofonTisPsychisMou.incipit
ltx/en_uk_ware/tr.d062:trMA.Ode5C2H.melody	@ltx/en_uk_ware/he.h.m8:heHE.TonZofonTisPsychisMou.melody
ltx/en_uk_ware/tr.d062:trMA.Ode5C2H.mode	@ltx/en_uk_ware/miscellanea:misc.Mode8
ltx/en_uk_ware/tr.d062:trMA.Ode5C2H.ode	@ltx/en_uk_ware/miscellanea:misc.Ode5
ltx/en_uk_ware/tr.d062:trMA.Ode5C2H.text	@ltx/en_uk_ware/he.h.m8:heHE.TonZofonTisPsychisMou.text
ltx/en_uk_ware/tr.d062:trMA.Ode5C2T.incipit	When she beheld Thee nailed…
ltx/en_uk_ware/tr.d062:trMA.Ode5C2T.melody	@ltx/en_uk_ware/he.h.m8:heHE.TonZofonTisPsychisMou.name
ltx/en_uk_ware/tr.d062:trMA.Ode5C2T.mode	@ltx/en_uk_ware/miscellanea:misc.Mode8
ltx/en_uk_ware/tr.d062:trMA.Ode5C2T.ode	@ltx/en_uk_ware/miscellanea:misc.Ode5
ltx/en_uk_ware/tr.d062:trMA.Ode5C2T.text	When she beheld Thee nailed upon the Cross, O Christ, with blood and water flowing from Thy lifegiving side, in her love Thy Mother suffered with Thee as none but a mother can, for she knew Thee as her Son.
ltx/en_uk_ware/tr.d062:trMA.Ode5C2Tr.incipit	Most Holy Trinity, Father, Son…
ltx/en_uk_ware/tr.d062:trMA.Ode5C2Tr.melody	@ltx/en_uk_ware/he.h.m8:heHE.TonZofonTisPsychisMou.name
ltx/en_uk_ware/tr.d062:trMA.Ode5C2Tr.mode	@ltx/en_uk_ware/miscellanea:misc.Mode8
ltx/en_uk_ware/tr.d062:trMA.Ode5C2Tr.ode	@ltx/en_uk_ware/miscellanea:misc.Ode5
ltx/en_uk_ware/tr.d062:trMA.Ode5C2Tr.text	Most Holy Trinity, Father, Son and all-creative Spirit, blessed Godhead, Essence without beginning, threefold Light, all-seeing Power, guard Thy servants.
ltx/en_uk_ware/tr.d062:trMA.Ode8C11.greekmelody	@ltx/en_uk_ware/he.h.m4:heHE.GiKaiPantaTaEnAfti.greekname
ltx/en_uk_ware/tr.d062:trMA.Ode8C11.incipit	Why, O women, do ye…
ltx/en_uk_ware/tr.d062:trMA.Ode8C11.melody	@ltx/en_uk_ware/he.h.m4:heHE.GiKaiPantaTaEnAfti.name
ltx/en_uk_ware/tr.d062:trMA.Ode8C11.mode	@ltx/en_uk_ware/miscellanea:misc.Mode4
ltx/en_uk_ware/tr.d062:trMA.Ode8C11.ode	@ltx/en_uk_ware/miscellanea:misc.Ode8
ltx/en_uk_ware/tr.d062:trMA.Ode8C11.text	Why, O women, do ye weep bitterly for your beloved brother, when ye have with you the Resurrection and the Life? He who brings gifts to all has come and will restore to life His true friend, through Lazarus’ resurrection foretelling the resurrection of all.
ltx/en_uk_ware/tr.d062:trMA.Ode8C12.incipit	Monks from your hermitages, sheep…
ltx/en_uk_ware/tr.d062:trMA.Ode8C12.melody	@ltx/en_uk_ware/he.h.m4:heHE.GiKaiPantaTaEnAfti.name
ltx/en_uk_ware/tr.d062:trMA.Ode8C12.mode	@ltx/en_uk_ware/miscellanea:misc.Mode4
ltx/en_uk_ware/tr.d062:trMA.Ode8C12.ode	@ltx/en_uk_ware/miscellanea:misc.Ode8
ltx/en_uk_ware/tr.d062:trMA.Ode8C12.text	Monks from your hermitages, sheep in the flock of the Word, assemble now with branches in your hands to meet Christ the Chief Shepherd. The Lord comes willingly as a lamb to the slaughter, that He may destroy the tyranny of the wolf.
ltx/en_uk_ware/tr.d062:trMA.Ode8C13.incipit	As Thou wast approaching Bethphage…
ltx/en_uk_ware/tr.d062:trMA.Ode8C13.melody	@ltx/en_uk_ware/he.h.m4:heHE.GiKaiPantaTaEnAfti.name
ltx/en_uk_ware/tr.d062:trMA.Ode8C13.mode	@ltx/en_uk_ware/miscellanea:misc.Mode4
ltx/en_uk_ware/tr.d062:trMA.Ode8C13.ode	@ltx/en_uk_ware/miscellanea:misc.Ode8
ltx/en_uk_ware/tr.d062:trMA.Ode8C13.text	As Thou wast approaching Bethphage, hell our adversary heard the sound of Thy feet, and he touched the feet of Lazarus, saying: ‘If the Life calls thee, delay not, but go out: for I know that my destruction will come swiftly.’
ltx/en_uk_ware/tr.d062:trMA.Ode8C1T.incipit	The holy voices of the…
ltx/en_uk_ware/tr.d062:trMA.Ode8C1T.melody	@ltx/en_uk_ware/he.h.m4:heHE.GiKaiPantaTaEnAfti.name
ltx/en_uk_ware/tr.d062:trMA.Ode8C1T.mode	@ltx/en_uk_ware/miscellanea:misc.Mode4
ltx/en_uk_ware/tr.d062:trMA.Ode8C1T.ode	@ltx/en_uk_ware/miscellanea:misc.Ode8
ltx/en_uk_ware/tr.d062:trMA.Ode8C1T.text	The holy voices of the prophets proclaim thee symbolically, O Virgin, as Gate and Mountain, sacred Ark and Cloud of light, from whom the Sun, the only Giver of Light, has shone forth on those in darkness and shadow.
ltx/en_uk_ware/tr.d062:trMA.Ode8C21.greekmelody	@ltx/en_uk_ware/he.h.m8:heHE.AngeloiKaiOuranoi.greekname
ltx/en_uk_ware/tr.d062:trMA.Ode8C21.incipit	Two of the disciples were…
ltx/en_uk_ware/tr.d062:trMA.Ode8C21.melody	@ltx/en_uk_ware/he.h.m8:heHE.AngeloiKaiOuranoi.name
ltx/en_uk_ware/tr.d062:trMA.Ode8C21.mode	@ltx/en_uk_ware/miscellanea:misc.Mode8
ltx/en_uk_ware/tr.d062:trMA.Ode8C21.ode	@ltx/en_uk_ware/miscellanea:misc.Ode8
ltx/en_uk_ware/tr.d062:trMA.Ode8C21.text	Two of the disciples were sent to fetch an ass for Him who rides upon the clouds, whom all things praise and exalt above all for ever.
ltx/en_uk_ware/tr.d062:trMA.Ode8C22.incipit	Christ is at the door:…
ltx/en_uk_ware/tr.d062:trMA.Ode8C22.melody	@ltx/en_uk_ware/he.h.m8:heHE.AngeloiKaiOuranoi.name
ltx/en_uk_ware/tr.d062:trMA.Ode8C22.mode	@ltx/en_uk_ware/miscellanea:misc.Mode8
ltx/en_uk_ware/tr.d062:trMA.Ode8C22.ode	@ltx/en_uk_ware/miscellanea:misc.Ode8
ltx/en_uk_ware/tr.d062:trMA.Ode8C22.text	Christ is at the door: so be not sad, O Bethany. For He will change thy sorrow into joy by raising from the tomb Lazarus thine offspring, who sings His praises.
ltx/en_uk_ware/tr.d062:trMA.Ode8C2A1.incipit	Invisibly with the branches of…
ltx/en_uk_ware/tr.d062:trMA.Ode8C2A1.melody	@ltx/en_uk_ware/he.h.m8:heHE.AngeloiKaiOuranoi.name
ltx/en_uk_ware/tr.d062:trMA.Ode8C2A1.mode	@ltx/en_uk_ware/miscellanea:misc.Mode8
ltx/en_uk_ware/tr.d062:trMA.Ode8C2A1.ode	@ltx/en_uk_ware/miscellanea:misc.Ode8
ltx/en_uk_ware/tr.d062:trMA.Ode8C2A1.text	Invisibly with the branches of our virtues, and visibly with branches from the trees, let us prepare to receive Christ who is twofold in nature. He comes riding on a colt, and we exalt Him above all for ever.
ltx/en_uk_ware/tr.d062:trMA.Ode8C2H.greekmelody	@ltx/en_uk_ware/he.h.m8:heHE.AngeloiKaiOuranoi.greekname
ltx/en_uk_ware/tr.d062:trMA.Ode8C2H.incipit	@ltx/en_uk_ware/he.h.m8:heHE.AngeloiKaiOuranoi.incipit
ltx/en_uk_ware/tr.d062:trMA.Ode8C2H.melody	@ltx/en_uk_ware/he.h.m8:heHE.AngeloiKaiOuranoi.melody
ltx/en_uk_ware/tr.d062:trMA.Ode8C2H.mode	@ltx/en_uk_ware/miscellanea:misc.Mode8
ltx/en_uk_ware/tr.d062:trMA.Ode8C2H.ode	@ltx/en_uk_ware/miscellanea:misc.Ode8
ltx/en_uk_ware/tr.d062:trMA.Ode8C2H.text	@ltx/en_uk_ware/he.h.m8:heHE.AngeloiKaiOuranoi.text
ltx/en_uk_ware/tr.d062:trMA.Ode8C2T.incipit	Thou alone hast conceived and…
ltx/en_uk_ware/tr.d062:trMA.Ode8C2T.melody	@ltx/en_uk_ware/he.h.m8:heHE.AngeloiKaiOuranoi.name
ltx/en_uk_ware/tr.d062:trMA.Ode8C2T.mode	@ltx/en_uk_ware/miscellanea:misc.Mode8
ltx/en_uk_ware/tr.d062:trMA.Ode8C2T.ode	@ltx/en_uk_ware/miscellanea:misc.Ode8
ltx/en_uk_ware/tr.d062:trMA.Ode8C2T.text	Thou alone hast conceived and yet remained inviolate; thou alone hast given suck to thy child, yet hast not known the pains of travail; thou alone hast borne thy Maker and Master, and thou art both His handmaid and His mother. We sing thy praises, O Virgin Mother, for ever.
ltx/en_uk_ware/tr.d062:trMA.Ode8C2Tr.incipit	The Trinity is one God:…
ltx/en_uk_ware/tr.d062:trMA.Ode8C2Tr.melody	@ltx/en_uk_ware/he.h.m8:heHE.AngeloiKaiOuranoi.name
ltx/en_uk_ware/tr.d062:trMA.Ode8C2Tr.mode	@ltx/en_uk_ware/miscellanea:misc.Mode8
ltx/en_uk_ware/tr.d062:trMA.Ode8C2Tr.ode	@ltx/en_uk_ware/miscellanea:misc.Ode8
ltx/en_uk_ware/tr.d062:trMA.Ode8C2Tr.text	The Trinity is one God: the Father is not begotten like the Son, nor does the Son proceed like the Spirit, but each keeps His distinctive properties; and I glorify the Three as Light and God for ever.
ltx/en_uk_ware/tr.d062:trMA.Ode9C11.greekmelody	@ltx/en_uk_ware/he.h.m4:heHE.OtiEpoiiseMoiMegaleia.greekname
ltx/en_uk_ware/tr.d062:trMA.Ode9C11.incipit	‘Behold, we go up to…
ltx/en_uk_ware/tr.d062:trMA.Ode9C11.melody	@ltx/en_uk_ware/he.h.m4:heHE.OtiEpoiiseMoiMegaleia.name
ltx/en_uk_ware/tr.d062:trMA.Ode9C11.mode	@ltx/en_uk_ware/miscellanea:misc.Mode4
ltx/en_uk_ware/tr.d062:trMA.Ode9C11.ode	@ltx/en_uk_ware/miscellanea:misc.Ode9
ltx/en_uk_ware/tr.d062:trMA.Ode9C11.text	‘Behold, we go up to the Holy City,’ Thou hast foretold to Thy disciples, O Jesus; ‘and by the hands of murderers I shall be delivered to Crucifixion, and I shall be truly slain according to the flesh.’
ltx/en_uk_ware/tr.d062:trMA.Ode9C12.incipit	Wishing to deliver Thy friend…
ltx/en_uk_ware/tr.d062:trMA.Ode9C12.melody	@ltx/en_uk_ware/he.h.m4:heHE.OtiEpoiiseMoiMegaleia.name
ltx/en_uk_ware/tr.d062:trMA.Ode9C12.mode	@ltx/en_uk_ware/miscellanea:misc.Mode4
ltx/en_uk_ware/tr.d062:trMA.Ode9C12.ode	@ltx/en_uk_ware/miscellanea:misc.Ode9
ltx/en_uk_ware/tr.d062:trMA.Ode9C12.text	Wishing to deliver Thy friend from death, Thou dost make haste to suffer death for our sake in the flesh, granting immortality to mortal men who believe in Thee, O Word who alone art immortal.
ltx/en_uk_ware/tr.d062:trMA.Ode9C13.incipit	Let us offer the palm…
ltx/en_uk_ware/tr.d062:trMA.Ode9C13.melody	@ltx/en_uk_ware/he.h.m4:heHE.OtiEpoiiseMoiMegaleia.name
ltx/en_uk_ware/tr.d062:trMA.Ode9C13.mode	@ltx/en_uk_ware/miscellanea:misc.Mode4
ltx/en_uk_ware/tr.d062:trMA.Ode9C13.ode	@ltx/en_uk_ware/miscellanea:misc.Ode9
ltx/en_uk_ware/tr.d062:trMA.Ode9C13.text	Let us offer the palm branches of our self-control to Christ, who draws near humbly in the flesh upon a foal, and let us say to Him: O Saviour who comest to Thy Passion, blessed art Thou.
ltx/en_uk_ware/tr.d062:trMA.Ode9C1T.incipit	Dread is thy childbearing, Theotokos…
ltx/en_uk_ware/tr.d062:trMA.Ode9C1T.melody	@ltx/en_uk_ware/he.h.m4:heHE.OtiEpoiiseMoiMegaleia.name
ltx/en_uk_ware/tr.d062:trMA.Ode9C1T.mode	@ltx/en_uk_ware/miscellanea:misc.Mode4
ltx/en_uk_ware/tr.d062:trMA.Ode9C1T.ode	@ltx/en_uk_ware/miscellanea:misc.Ode9
ltx/en_uk_ware/tr.d062:trMA.Ode9C1T.text	Dread is thy childbearing, Theotokos and Mother of Christ; therefore in faith we and all generations call thee blessed, and in reverence we glorify thee to all ages.
ltx/en_uk_ware/tr.d062:trMA.Ode9C21.greekmelody	@ltx/en_uk_ware/he.h.m8:heHE.TonProdilothenta.greekname
ltx/en_uk_ware/tr.d062:trMA.Ode9C21.incipit	Sending out His disciples now…
ltx/en_uk_ware/tr.d062:trMA.Ode9C21.melody	@ltx/en_uk_ware/he.h.m8:heHE.TonProdilothenta.name
ltx/en_uk_ware/tr.d062:trMA.Ode9C21.mode	@ltx/en_uk_ware/miscellanea:misc.Mode8
ltx/en_uk_ware/tr.d062:trMA.Ode9C21.ode	@ltx/en_uk_ware/miscellanea:misc.Ode9
ltx/en_uk_ware/tr.d062:trMA.Ode9C21.text	Sending out His disciples now, Christ said to them: ‘Loose the colt and bring it to me, and I will ride upon it, that I may loose the nations from their lack of reason, and as Son bring them into subjection to the Father.’
ltx/en_uk_ware/tr.d062:trMA.Ode9C22.incipit	The Lord draws near: open…
ltx/en_uk_ware/tr.d062:trMA.Ode9C22.melody	@ltx/en_uk_ware/he.h.m8:heHE.TonProdilothenta.name
ltx/en_uk_ware/tr.d062:trMA.Ode9C22.mode	@ltx/en_uk_ware/miscellanea:misc.Mode8
ltx/en_uk_ware/tr.d062:trMA.Ode9C22.ode	@ltx/en_uk_ware/miscellanea:misc.Ode9
ltx/en_uk_ware/tr.d062:trMA.Ode9C22.text	The Lord draws near: open thy gates, Bethany, and receive the Master with faith. He is come to raise Lazarus from the tomb, for He alone is all-powerful.
ltx/en_uk_ware/tr.d062:trMA.Ode9C2A1.incipit	All who dwell in deserts…
ltx/en_uk_ware/tr.d062:trMA.Ode9C2A1.melody	@ltx/en_uk_ware/he.h.m8:heHE.TonProdilothenta.name
ltx/en_uk_ware/tr.d062:trMA.Ode9C2A1.mode	@ltx/en_uk_ware/miscellanea:misc.Mode8
ltx/en_uk_ware/tr.d062:trMA.Ode9C2A1.ode	@ltx/en_uk_ware/miscellanea:misc.Ode9
ltx/en_uk_ware/tr.d062:trMA.Ode9C2A1.text	All who dwell in deserts, in mountains and in caves, draw near and assemble with us, to meet the King and Master with palms in your hands; for He comes to save our souls.
ltx/en_uk_ware/tr.d062:trMA.Ode9C2H.greekmelody	@ltx/en_uk_ware/he.h.m8:heHE.TonProdilothenta.greekname
ltx/en_uk_ware/tr.d062:trMA.Ode9C2H.incipit	@ltx/en_uk_ware/he.h.m8:heHE.TonProdilothenta.incipit
ltx/en_uk_ware/tr.d062:trMA.Ode9C2H.melody	@ltx/en_uk_ware/he.h.m8:heHE.TonProdilothenta.melody
ltx/en_uk_ware/tr.d062:trMA.Ode9C2H.mode	@ltx/en_uk_ware/miscellanea:misc.Mode8
ltx/en_uk_ware/tr.d062:trMA.Ode9C2H.ode	@ltx/en_uk_ware/miscellanea:misc.Ode9
ltx/en_uk_ware/tr.d062:trMA.Ode9C2H.text	@ltx/en_uk_ware/he.h.m8:heHE.TonProdilothenta.text
ltx/en_uk_ware/tr.d062:trMA.Ode9C2T.incipit	Rejoice, Palace of the King…
ltx/en_uk_ware/tr.d062:trMA.Ode9C2T.melody	@ltx/en_uk_ware/he.h.m8:heHE.TonProdilothenta.name
ltx/en_uk_ware/tr.d062:trMA.Ode9C2T.mode	@ltx/en_uk_ware/miscellanea:misc.Mode8
ltx/en_uk_ware/tr.d062:trMA.Ode9C2T.ode	@ltx/en_uk_ware/miscellanea:misc.Ode9
ltx/en_uk_ware/tr.d062:trMA.Ode9C2T.text	Rejoice, Palace of the King of all. Through thee, O Virgin Theotokos, the Kingdom of Heaven has been opened to us on earth and we dwell with the angels.
ltx/en_uk_ware/tr.d062:trMA.Ode9C2Tr.incipit	O Lord, the threefold Brightness…
ltx/en_uk_ware/tr.d062:trMA.Ode9C2Tr.melody	@ltx/en_uk_ware/he.h.m8:heHE.TonProdilothenta.name
ltx/en_uk_ware/tr.d062:trMA.Ode9C2Tr.mode	@ltx/en_uk_ware/miscellanea:misc.Mode8
ltx/en_uk_ware/tr.d062:trMA.Ode9C2Tr.ode	@ltx/en_uk_ware/miscellanea:misc.Ode9
ltx/en_uk_ware/tr.d062:trMA.Ode9C2Tr.text	O Lord, the threefold Brightness of Thy single Power shines on our mind with the light of revelation; it turns us from the error that divides, and brings us to the divine life that unites.
ltx/en_uk_ware/tr.d062:trTE.Troparion.incipit	O Lord, Thy wrath that…
ltx/en_uk_ware/tr.d062:trTE.Troparion.melody	
ltx/en_uk_ware/tr.d062:trTE.Troparion.mode	@ltx/en_uk_ware/miscellanea:misc.Mode3
ltx/en_uk_ware/tr.d062:trTE.Troparion.text	O Lord, Thy wrath that threatens sinners cannot be endured; we are not worthy to lift up our eyes and ask for mercy from Thee. Destroy us not in Thine anger, for with Thine own hand Thou hast formed us from the earth.
ltx/en_uk_ware/tr.d062:trTE.Troparion2.incipit	…
ltx/en_uk_ware/tr.d062:trTE.Troparion2.text	
ltx/en_uk_ware/tr.d062:trVE.AposIdiomelon1.incipit	Deliver me from the rich…
ltx/en_uk_ware/tr.d062:trVE.AposIdiomelon1.melody	@ltx/en_uk_ware/miscellanea:misc.Idiomelon
ltx/en_uk_ware/tr.d062:trVE.AposIdiomelon1.mode	@ltx/en_uk_ware/miscellanea:misc.Mode8
ltx/en_uk_ware/tr.d062:trVE.AposIdiomelon1.text	Deliver me from the rich man’s lack of love and from his selfishness, O Christ my God, who through Thy Cross hast cleansed us from our sins. Make me follow Lazarus the poor man in his thankful patience, and in Thy great mercy deprive me not of a place with Abraham the Patriarch.
ltx/en_uk_ware/tr.d062:trVE.AposMartyric.incipit	O martyrs of the Lord…
ltx/en_uk_ware/tr.d062:trVE.AposMartyric.melody	
ltx/en_uk_ware/tr.d062:trVE.AposMartyric.mode	@ltx/en_uk_ware/miscellanea:misc.Mode8
ltx/en_uk_ware/tr.d062:trVE.AposMartyric.text	O martyrs of the Lord, ye hallow every place and heal every ill: and now we entreat you to pray that our souls may be delivered from the snares of the enemy.
ltx/en_uk_ware/tr.d062:trVE.AposTheotokion.greekmelody	@ltx/en_uk_ware/he.a.m8:heAU.OTouParadoxou.greekname
ltx/en_uk_ware/tr.d062:trVE.AposTheotokion.incipit	@ltx/en_uk_ware/me.m11.d05:meVE.SticStavrotheotokion.incipit
ltx/en_uk_ware/tr.d062:trVE.AposTheotokion.melody	@ltx/en_uk_ware/he.a.m8:heAU.OTouParadoxou.notmetered
ltx/en_uk_ware/tr.d062:trVE.AposTheotokion.mode	@ltx/en_uk_ware/miscellanea:misc.Mode8
ltx/en_uk_ware/tr.d062:trVE.AposTheotokion.text	@ltx/en_uk_ware/me.m11.d05:meVE.SticStavrotheotokion.text
ltx/en_uk_ware/tr.d062:trVE.Stichera01.greekmelody	@ltx/en_uk_ware/he.a.m4:heAU.OExYpsistouKlitheis.greekname
ltx/en_uk_ware/tr.d062:trVE.Stichera01.incipit	Two of the holy apostles…
ltx/en_uk_ware/tr.d062:trVE.Stichera01.melody	@ltx/en_uk_ware/he.a.m4:heAU.OExYpsistouKlitheis.notmetered
ltx/en_uk_ware/tr.d062:trVE.Stichera01.mode	@ltx/en_uk_ware/miscellanea:misc.Mode4
ltx/en_uk_ware/tr.d062:trVE.Stichera01.text	Two of the holy apostles, knowing that Thou, O Christ, art one of the Trinity, now are sent by Thee to bring the colt of an ass in fulfillment of the prophecy. And humbling Thyself, O compassionate Lord, Thou shalt sit upon it, who dost make ready by Thy will a seat in the highest for all that love Thee. And those who in their folly have submitted to unreasoning passions, Thou hast made, O Word, to cry aloud to Thee: Hosanna!
ltx/en_uk_ware/tr.d062:trVE.Stichera02.greekmelody	@ltx/en_uk_ware/he.a.m4:heAU.OExYpsistouKlitheis.greekname
ltx/en_uk_ware/tr.d062:trVE.Stichera02.incipit	Receive thy King, O Zion…
ltx/en_uk_ware/tr.d062:trVE.Stichera02.melody	@ltx/en_uk_ware/he.a.m4:heAU.OExYpsistouKlitheis.notmetered
ltx/en_uk_ware/tr.d062:trVE.Stichera02.mode	@ltx/en_uk_ware/miscellanea:misc.Mode4
ltx/en_uk_ware/tr.d062:trVE.Stichera02.text	Receive thy King, O Zion. For see, He comes to thee now in meekness, to raise up Lazarus and to destroy the bitter kingdom of death. Summoned by God, let all the multitude of holy monks and lay­ people assemble, to welcome Christ with palms and cry: Blessed is He who comes to save mortal men through the Passion of the Cross, and to grant in His love freedom from the passions unto all.
ltx/en_uk_ware/tr.d062:trVE.Stichera03.greekmelody	@ltx/en_uk_ware/he.a.m8:heAU.OEnEdemParadeisos.greekname
ltx/en_uk_ware/tr.d062:trVE.Stichera03.incipit	O Christ, who art borne…
ltx/en_uk_ware/tr.d062:trVE.Stichera03.melody	@ltx/en_uk_ware/he.a.m8:heAU.OEnEdemParadeisos.notmetered
ltx/en_uk_ware/tr.d062:trVE.Stichera03.mode	@ltx/en_uk_ware/miscellanea:misc.Mode8
ltx/en_uk_ware/tr.d062:trVE.Stichera03.text	O Christ, who art borne on high by the dread seraphim, as God and Creator of all, Thou dost make haste to ride on earth upon a colt, as a man like us. Bethany rejoices greatly to receive Thee, O Saviour, and Jerusalem is glad as it awaits expectantly to welcome Thee. Death has been slain, and as a foretaste of the coming Resurrection it sees Lazarus return from the dead. In joy we go to meet Thee with palms, praising the power of Thy love, O Lord.
