ltx/en_uk_ware/tr.d059:trCO.header	
ltx/en_uk_ware/tr.d059:trDA.commemoration.full	
ltx/en_uk_ware/tr.d059:trDA.commemoration.short	
ltx/en_uk_ware/tr.d059:trDA.insert1	
ltx/en_uk_ware/tr.d059:trDA.insert2	
ltx/en_uk_ware/tr.d059:trDA.note	
ltx/en_uk_ware/tr.d059:trDA.title	
ltx/en_uk_ware/tr.d059:trHO.commemorations	
ltx/en_uk_ware/tr.d059:trHO.daytitle	
ltx/en_uk_ware/tr.d059:trHO.description1	
ltx/en_uk_ware/tr.d059:trHO.description2	
ltx/en_uk_ware/tr.d059:trHO.note1	
ltx/en_uk_ware/tr.d059:trHO.note2	
ltx/en_uk_ware/tr.d059:trMA.AposIdiomelon1.incipit	Fallen into transgressions and bound…
ltx/en_uk_ware/tr.d059:trMA.AposIdiomelon1.melody	@ltx/en_uk_ware/miscellanea:misc.Idiomelon
ltx/en_uk_ware/tr.d059:trMA.AposIdiomelon1.mode	@ltx/en_uk_ware/miscellanea:misc.Mode5
ltx/en_uk_ware/tr.d059:trMA.AposIdiomelon1.text	Fallen into transgressions and bound fast by the cords of sin, why art thou slothful, O my soul? Why art thou careless? Flee at all times from the burning of lasciviousness, as Lot fled from Sodom and Gomorrah; turn not back, lest thou become as a pillar of salt. Take refuge in the mountain of the virtues; run always from the flames that burnt the rich man because he was merciless and cruel. With the steps of humility advance like Lazarus, and go to dwell with Abraham, crying: My hope and refuge, O Lord, glory to Thee.
ltx/en_uk_ware/tr.d059:trMA.AposMartyric.incipit	Thy victorious martyrs, O Lord…
ltx/en_uk_ware/tr.d059:trMA.AposMartyric.melody	
ltx/en_uk_ware/tr.d059:trMA.AposMartyric.mode	@ltx/en_uk_ware/miscellanea:misc.Mode5
ltx/en_uk_ware/tr.d059:trMA.AposMartyric.text	Thy victorious martyrs, O Lord, imitated the life of the angelic hosts: with patience they endured the tortures, as though they had no body, setting all their hope in the blessings Thou hast promised. At their prayers, O Christ our God, grant peace to Thy world, and to our souls great mercy.
ltx/en_uk_ware/tr.d059:trMA.AposTheotokion.incipit	O blessed among women, we…
ltx/en_uk_ware/tr.d059:trMA.AposTheotokion.melody	
ltx/en_uk_ware/tr.d059:trMA.AposTheotokion.mode	@ltx/en_uk_ware/miscellanea:misc.Mode5
ltx/en_uk_ware/tr.d059:trMA.AposTheotokion.text	O blessed among women, we entreat thee as the Mother of God: pray for the salvation of our souls.
ltx/en_uk_ware/tr.d059:trMA.C1.poet	@ltx/en_uk_ware/poets:po.Iosif
ltx/en_uk_ware/tr.d059:trMA.C2.poet	@ltx/en_uk_ware/poets:po.Theodorou
ltx/en_uk_ware/tr.d059:trMA.Kathisma21.greekmelody	@ltx/en_uk_ware/he.a.m6:heAU.AngelikaiDynameis.greekname
ltx/en_uk_ware/tr.d059:trMA.Kathisma21.incipit	Wasted by the disease of…
ltx/en_uk_ware/tr.d059:trMA.Kathisma21.melody	@ltx/en_uk_ware/he.a.m6:heAU.AngelikaiDynameis.name
ltx/en_uk_ware/tr.d059:trMA.Kathisma21.mode	@ltx/en_uk_ware/miscellanea:misc.Mode6
ltx/en_uk_ware/tr.d059:trMA.Kathisma21.text	Wasted by the disease of sin, I lie on the bed of despair. O Physician of the sick, visit me in Thy love for mankind; and, most merciful, let me not sleep shamefully in death, but enable me to cry with all my heart to Thee: Bestower of mercy, O Lord, glory to Thee.
ltx/en_uk_ware/tr.d059:trMA.Kathisma22.incipit	Gabriel’s message to the Virgin…
ltx/en_uk_ware/tr.d059:trMA.Kathisma22.melody	
ltx/en_uk_ware/tr.d059:trMA.Kathisma22.mode	@ltx/en_uk_ware/miscellanea:misc.Mode6
ltx/en_uk_ware/tr.d059:trMA.Kathisma22.text	Gabriel’s message to the Virgin was the beginning of salvation; for she heard his greeting ‘Hail!’ and did not reject his salutation. She did not doubt like Sarah in the tent, but she replied: ‘Behold the handmaid of the Lord; be it unto me according to thy word.
ltx/en_uk_ware/tr.d059:trMA.Kathisma31.incipit	Yesterday and today Lazarus is…
ltx/en_uk_ware/tr.d059:trMA.Kathisma31.melody	
ltx/en_uk_ware/tr.d059:trMA.Kathisma31.mode	@ltx/en_uk_ware/miscellanea:misc.Mode5
ltx/en_uk_ware/tr.d059:trMA.Kathisma31.text	Yesterday and today Lazarus is sick, and his sisters make it known to Christ. Prepare thyself with joy, O Bethany, to welcome as thy guest the Lord and King, and to cry aloud with us: O Lord, glory to Thee.
ltx/en_uk_ware/tr.d059:trMA.Kathisma32.incipit	
ltx/en_uk_ware/tr.d059:trMA.Kathisma32.melody	
ltx/en_uk_ware/tr.d059:trMA.Kathisma32.mode	@ltx/en_uk_ware/miscellanea:misc.Mode5
ltx/en_uk_ware/tr.d059:trMA.Kathisma32.text	
ltx/en_uk_ware/tr.d059:trMA.Ode2C11.greekmelody	@ltx/en_uk_ware/he.h.m6:heHE.IdeteIdete.greekname
ltx/en_uk_ware/tr.d059:trMA.Ode2C11.incipit	Rich by nature, O Christ…
ltx/en_uk_ware/tr.d059:trMA.Ode2C11.melody	@ltx/en_uk_ware/he.h.m6:heHE.IdeteIdete.name
ltx/en_uk_ware/tr.d059:trMA.Ode2C11.mode	@ltx/en_uk_ware/miscellanea:misc.Mode6
ltx/en_uk_ware/tr.d059:trMA.Ode2C11.ode	@ltx/en_uk_ware/miscellanea:misc.Ode2
ltx/en_uk_ware/tr.d059:trMA.Ode2C11.text	Rich by nature, O Christ, Thou hast by Thine own choice become poor; and Thou who fillest every living thing with plenteousness hast willingly gone hungry. I hunger for Thy grace, O Word of God: satisfy me and make me a partaker at Thy table in the Age to come.
ltx/en_uk_ware/tr.d059:trMA.Ode2C12.incipit	Make me, O Christ, poor…
ltx/en_uk_ware/tr.d059:trMA.Ode2C12.melody	@ltx/en_uk_ware/he.h.m6:heHE.IdeteIdete.name
ltx/en_uk_ware/tr.d059:trMA.Ode2C12.mode	@ltx/en_uk_ware/miscellanea:misc.Mode6
ltx/en_uk_ware/tr.d059:trMA.Ode2C12.ode	@ltx/en_uk_ware/miscellanea:misc.Ode2
ltx/en_uk_ware/tr.d059:trMA.Ode2C12.text	Make me, O Christ, poor as Lazarus in sin, and scatter the wealth that I have gathered in wickedness; fill me with Thy perfect love, O merciful Lord, and deliver me from the fearful punishment that is to come.
ltx/en_uk_ware/tr.d059:trMA.Ode2C13.incipit	Once in Babylon fasting made…
ltx/en_uk_ware/tr.d059:trMA.Ode2C13.melody	@ltx/en_uk_ware/he.h.m6:heHE.IdeteIdete.name
ltx/en_uk_ware/tr.d059:trMA.Ode2C13.mode	@ltx/en_uk_ware/miscellanea:misc.Mode6
ltx/en_uk_ware/tr.d059:trMA.Ode2C13.ode	@ltx/en_uk_ware/miscellanea:misc.Ode2
ltx/en_uk_ware/tr.d059:trMA.Ode2C13.text	Once in Babylon fasting made the Children stronger than the fire. Be not fainthearted, O my soul, but follow their example, and thou shalt quench the fire of sensual pleasure with the dew of the Spirit.
ltx/en_uk_ware/tr.d059:trMA.Ode2C1H.greekmelody	@ltx/en_uk_ware/he.h.m6:heHE.IdeteIdete.greekname
ltx/en_uk_ware/tr.d059:trMA.Ode2C1H.incipit	@ltx/en_uk_ware/he.h.m6:heHE.IdeteIdete.incipit
ltx/en_uk_ware/tr.d059:trMA.Ode2C1H.melody	@ltx/en_uk_ware/he.h.m6:heHE.IdeteIdete.melody
ltx/en_uk_ware/tr.d059:trMA.Ode2C1H.mode	@ltx/en_uk_ware/miscellanea:misc.Mode6
ltx/en_uk_ware/tr.d059:trMA.Ode2C1H.ode	@ltx/en_uk_ware/miscellanea:misc.Ode2
ltx/en_uk_ware/tr.d059:trMA.Ode2C1H.text	@ltx/en_uk_ware/he.h.m6:heHE.IdeteIdete.text
ltx/en_uk_ware/tr.d059:trMA.Ode2C1T.incipit	We cry to thee ‘Hail!’…
ltx/en_uk_ware/tr.d059:trMA.Ode2C1T.melody	@ltx/en_uk_ware/he.h.m6:heHE.IdeteIdete.name
ltx/en_uk_ware/tr.d059:trMA.Ode2C1T.mode	@ltx/en_uk_ware/miscellanea:misc.Mode6
ltx/en_uk_ware/tr.d059:trMA.Ode2C1T.ode	@ltx/en_uk_ware/miscellanea:misc.Ode2
ltx/en_uk_ware/tr.d059:trMA.Ode2C1T.text	We cry to thee ‘Hail!’, O Theotokos Virgin full of grace, who hast conceived our Joy. Pray to God whom thou hast borne, that we who at all times sing thy praises may be delivered from danger and corruption.
ltx/en_uk_ware/tr.d059:trMA.Ode2C21.greekmelody	@ltx/en_uk_ware/he.h.m5:heHE.IdeteIdete.greekname
ltx/en_uk_ware/tr.d059:trMA.Ode2C21.incipit	See now, see that I…
ltx/en_uk_ware/tr.d059:trMA.Ode2C21.melody	@ltx/en_uk_ware/he.h.m5:heHE.IdeteIdete.name
ltx/en_uk_ware/tr.d059:trMA.Ode2C21.mode	@ltx/en_uk_ware/miscellanea:misc.Mode5
ltx/en_uk_ware/tr.d059:trMA.Ode2C21.ode	@ltx/en_uk_ware/miscellanea:misc.Ode2
ltx/en_uk_ware/tr.d059:trMA.Ode2C21.text	See now, see that I am God, who when I was dwelling on the far side of the Jordan heard that Lazarus was sick, and I said: ‘He will not die, but this is for My glory.’
ltx/en_uk_ware/tr.d059:trMA.Ode2C22.incipit	The sisters of Lazarus lament…
ltx/en_uk_ware/tr.d059:trMA.Ode2C22.melody	@ltx/en_uk_ware/he.h.m5:heHE.IdeteIdete.name
ltx/en_uk_ware/tr.d059:trMA.Ode2C22.mode	@ltx/en_uk_ware/miscellanea:misc.Mode5
ltx/en_uk_ware/tr.d059:trMA.Ode2C22.ode	@ltx/en_uk_ware/miscellanea:misc.Ode2
ltx/en_uk_ware/tr.d059:trMA.Ode2C22.text	The sisters of Lazarus lament and disclose their anguish to Thee who knowest all things. But Thou delayest a little, in order to perform the miracle and show to Thy disciples Thy dread power.
ltx/en_uk_ware/tr.d059:trMA.Ode2C2A1.incipit	Prepare thyself now, O Bethany…
ltx/en_uk_ware/tr.d059:trMA.Ode2C2A1.melody	@ltx/en_uk_ware/he.h.m5:heHE.IdeteIdete.name
ltx/en_uk_ware/tr.d059:trMA.Ode2C2A1.mode	@ltx/en_uk_ware/miscellanea:misc.Mode5
ltx/en_uk_ware/tr.d059:trMA.Ode2C2A1.ode	@ltx/en_uk_ware/miscellanea:misc.Ode2
ltx/en_uk_ware/tr.d059:trMA.Ode2C2A1.text	Prepare thyself now, O Bethany, and with joy make ready to receive the King of all: for He shall come to thee, to bring back Lazarus from corruption to life.
ltx/en_uk_ware/tr.d059:trMA.Ode2C2H.greekmelody	@ltx/en_uk_ware/he.h.m5:heHE.IdeteIdete.greekname
ltx/en_uk_ware/tr.d059:trMA.Ode2C2H.incipit	@ltx/en_uk_ware/he.h.m5:heHE.IdeteIdete.incipit
ltx/en_uk_ware/tr.d059:trMA.Ode2C2H.melody	@ltx/en_uk_ware/he.h.m5:heHE.IdeteIdete.melody
ltx/en_uk_ware/tr.d059:trMA.Ode2C2H.mode	@ltx/en_uk_ware/miscellanea:misc.Mode5
ltx/en_uk_ware/tr.d059:trMA.Ode2C2H.ode	@ltx/en_uk_ware/miscellanea:misc.Ode2
ltx/en_uk_ware/tr.d059:trMA.Ode2C2H.text	@ltx/en_uk_ware/he.h.m5:heHE.IdeteIdete.text
ltx/en_uk_ware/tr.d059:trMA.Ode2C2T.incipit	Who is not filled with…
ltx/en_uk_ware/tr.d059:trMA.Ode2C2T.melody	@ltx/en_uk_ware/he.h.m5:heHE.IdeteIdete.name
ltx/en_uk_ware/tr.d059:trMA.Ode2C2T.mode	@ltx/en_uk_ware/miscellanea:misc.Mode5
ltx/en_uk_ware/tr.d059:trMA.Ode2C2T.ode	@ltx/en_uk_ware/miscellanea:misc.Ode2
ltx/en_uk_ware/tr.d059:trMA.Ode2C2T.text	Who is not filled with wonder, O Virgin, beholding the Creator refashioning fallen Adam within thee, and born from thee in the flesh for our salvation, without undergoing change, through an ineffable union?
ltx/en_uk_ware/tr.d059:trMA.Ode2C2Tr.incipit	Unity in three Persons, single…
ltx/en_uk_ware/tr.d059:trMA.Ode2C2Tr.melody	@ltx/en_uk_ware/he.h.m5:heHE.IdeteIdete.name
ltx/en_uk_ware/tr.d059:trMA.Ode2C2Tr.mode	@ltx/en_uk_ware/miscellanea:misc.Mode5
ltx/en_uk_ware/tr.d059:trMA.Ode2C2Tr.ode	@ltx/en_uk_ware/miscellanea:misc.Ode2
ltx/en_uk_ware/tr.d059:trMA.Ode2C2Tr.text	Unity in three Persons, single sovereignty, kingdom ruling over the ages, Father, Son and Holy Spirit: the multitude of angels and all mankind glorify Thee.
ltx/en_uk_ware/tr.d059:trMA.Ode8C11.greekmelody	@ltx/en_uk_ware/he.h.m6:heHE.EkFlogosToisOsiois.greekname
ltx/en_uk_ware/tr.d059:trMA.Ode8C11.incipit	I think upon the multitude…
ltx/en_uk_ware/tr.d059:trMA.Ode8C11.melody	@ltx/en_uk_ware/he.h.m6:heHE.EkFlogosToisOsiois.name
ltx/en_uk_ware/tr.d059:trMA.Ode8C11.mode	@ltx/en_uk_ware/miscellanea:misc.Mode6
ltx/en_uk_ware/tr.d059:trMA.Ode8C11.ode	@ltx/en_uk_ware/miscellanea:misc.Ode8
ltx/en_uk_ware/tr.d059:trMA.Ode8C11.text	I think upon the multitude of my offences, and I am pierced by the sting of conscience; and in my misery I lament as though already in the flames of hell. Take pity on me, Word of God, in Thy mercy.
ltx/en_uk_ware/tr.d059:trMA.Ode8C12.incipit	I have neglected the virtuous…
ltx/en_uk_ware/tr.d059:trMA.Ode8C12.melody	@ltx/en_uk_ware/he.h.m6:heHE.EkFlogosToisOsiois.name
ltx/en_uk_ware/tr.d059:trMA.Ode8C12.mode	@ltx/en_uk_ware/miscellanea:misc.Mode6
ltx/en_uk_ware/tr.d059:trMA.Ode8C12.ode	@ltx/en_uk_ware/miscellanea:misc.Ode8
ltx/en_uk_ware/tr.d059:trMA.Ode8C12.text	I have neglected the virtuous actions of Lazarus and emulated the ways of the rich man who showed no love for others. O compassionate God, turn me back and take pity on me, that I may glorify Thee for ever.
ltx/en_uk_ware/tr.d059:trMA.Ode8C13.incipit	My soul is sick, and…
ltx/en_uk_ware/tr.d059:trMA.Ode8C13.melody	@ltx/en_uk_ware/he.h.m6:heHE.EkFlogosToisOsiois.name
ltx/en_uk_ware/tr.d059:trMA.Ode8C13.mode	@ltx/en_uk_ware/miscellanea:misc.Mode6
ltx/en_uk_ware/tr.d059:trMA.Ode8C13.ode	@ltx/en_uk_ware/miscellanea:misc.Ode8
ltx/en_uk_ware/tr.d059:trMA.Ode8C13.text	My soul is sick, and despair has brought me near to death. Come to me, O Jesus, I implore Thee, for Thy visitation gives life to those that call upon Thee.
ltx/en_uk_ware/tr.d059:trMA.Ode8C1T.incipit	Save me and come to…
ltx/en_uk_ware/tr.d059:trMA.Ode8C1T.melody	@ltx/en_uk_ware/he.h.m6:heHE.EkFlogosToisOsiois.name
ltx/en_uk_ware/tr.d059:trMA.Ode8C1T.mode	@ltx/en_uk_ware/miscellanea:misc.Mode6
ltx/en_uk_ware/tr.d059:trMA.Ode8C1T.ode	@ltx/en_uk_ware/miscellanea:misc.Ode8
ltx/en_uk_ware/tr.d059:trMA.Ode8C1T.text	Save me and come to the aid of my weakness, all-holy Virgin, for thou hast borne Him whose will it is to have mercy, and we exalt Him above all for ever.
ltx/en_uk_ware/tr.d059:trMA.Ode8C21.greekmelody	@ltx/en_uk_ware/he.h.m5:heHE.OiOsioiSouPaides.greekname
ltx/en_uk_ware/tr.d059:trMA.Ode8C21.incipit	O Bethany, home of Lazarus…
ltx/en_uk_ware/tr.d059:trMA.Ode8C21.melody	@ltx/en_uk_ware/he.h.m5:heHE.OiOsioiSouPaides.name
ltx/en_uk_ware/tr.d059:trMA.Ode8C21.mode	@ltx/en_uk_ware/miscellanea:misc.Mode5
ltx/en_uk_ware/tr.d059:trMA.Ode8C21.ode	@ltx/en_uk_ware/miscellanea:misc.Ode8
ltx/en_uk_ware/tr.d059:trMA.Ode8C21.text	O Bethany, home of Lazarus, rejoice. For Christ comes to thee and shall perform a mighty work, bringing Lazarus to life.
ltx/en_uk_ware/tr.d059:trMA.Ode8C22.incipit	Lazarus falls sick that Thou…
ltx/en_uk_ware/tr.d059:trMA.Ode8C22.melody	@ltx/en_uk_ware/he.h.m5:heHE.OiOsioiSouPaides.name
ltx/en_uk_ware/tr.d059:trMA.Ode8C22.mode	@ltx/en_uk_ware/miscellanea:misc.Mode5
ltx/en_uk_ware/tr.d059:trMA.Ode8C22.ode	@ltx/en_uk_ware/miscellanea:misc.Ode8
ltx/en_uk_ware/tr.d059:trMA.Ode8C22.text	Lazarus falls sick that Thou, Son of God, mayest be glorified through him; and Thy works praise Thee, Lord, without ceasing.
ltx/en_uk_ware/tr.d059:trMA.Ode8C2A1.incipit	Preparing branches of virtue with…
ltx/en_uk_ware/tr.d059:trMA.Ode8C2A1.melody	@ltx/en_uk_ware/he.h.m5:heHE.OiOsioiSouPaides.name
ltx/en_uk_ware/tr.d059:trMA.Ode8C2A1.mode	@ltx/en_uk_ware/miscellanea:misc.Mode5
ltx/en_uk_ware/tr.d059:trMA.Ode8C2A1.ode	@ltx/en_uk_ware/miscellanea:misc.Ode8
ltx/en_uk_ware/tr.d059:trMA.Ode8C2A1.text	Preparing branches of virtue with which to welcome Christ, we cry: O ye works of the Lord, bless ye the Lord.
ltx/en_uk_ware/tr.d059:trMA.Ode8C2H.greekmelody	@ltx/en_uk_ware/he.h.m5:heHE.OiOsioiSouPaides.greekname
ltx/en_uk_ware/tr.d059:trMA.Ode8C2H.incipit	@ltx/en_uk_ware/he.h.m5:heHE.OiOsioiSouPaides.incipit
ltx/en_uk_ware/tr.d059:trMA.Ode8C2H.melody	@ltx/en_uk_ware/he.h.m5:heHE.OiOsioiSouPaides.melody
ltx/en_uk_ware/tr.d059:trMA.Ode8C2H.mode	@ltx/en_uk_ware/miscellanea:misc.Mode5
ltx/en_uk_ware/tr.d059:trMA.Ode8C2H.ode	@ltx/en_uk_ware/miscellanea:misc.Ode8
ltx/en_uk_ware/tr.d059:trMA.Ode8C2H.text	@ltx/en_uk_ware/he.h.m5:heHE.OiOsioiSouPaides.text
ltx/en_uk_ware/tr.d059:trMA.Ode8C2T.incipit	With all mankind we sing…
ltx/en_uk_ware/tr.d059:trMA.Ode8C2T.melody	@ltx/en_uk_ware/he.h.m5:heHE.OiOsioiSouPaides.name
ltx/en_uk_ware/tr.d059:trMA.Ode8C2T.mode	@ltx/en_uk_ware/miscellanea:misc.Mode5
ltx/en_uk_ware/tr.d059:trMA.Ode8C2T.ode	@ltx/en_uk_ware/miscellanea:misc.Ode8
ltx/en_uk_ware/tr.d059:trMA.Ode8C2T.text	With all mankind we sing the praises of thine ineffable childbearing, O pure Virgin; and honouring thy Son as God, we bless and praise Him without ceasing.
ltx/en_uk_ware/tr.d059:trMA.Ode8C2Tr.incipit	We praise the all-holy Trinity…
ltx/en_uk_ware/tr.d059:trMA.Ode8C2Tr.melody	@ltx/en_uk_ware/he.h.m5:heHE.OiOsioiSouPaides.name
ltx/en_uk_ware/tr.d059:trMA.Ode8C2Tr.mode	@ltx/en_uk_ware/miscellanea:misc.Mode5
ltx/en_uk_ware/tr.d059:trMA.Ode8C2Tr.ode	@ltx/en_uk_ware/miscellanea:misc.Ode8
ltx/en_uk_ware/tr.d059:trMA.Ode8C2Tr.text	We praise the all-holy Trinity, Father, Son and Spirit, and we sing: O ye works of the Lord, bless ye the Lord.
ltx/en_uk_ware/tr.d059:trMA.Ode9C11.greekmelody	@ltx/en_uk_ware/he.h.m6:heHE.TheonAnthropois.greekname
ltx/en_uk_ware/tr.d059:trMA.Ode9C11.incipit	Tasting once from the bitter…
ltx/en_uk_ware/tr.d059:trMA.Ode9C11.melody	@ltx/en_uk_ware/he.h.m6:heHE.TheonAnthropois.name
ltx/en_uk_ware/tr.d059:trMA.Ode9C11.mode	@ltx/en_uk_ware/miscellanea:misc.Mode6
ltx/en_uk_ware/tr.d059:trMA.Ode9C11.ode	@ltx/en_uk_ware/miscellanea:misc.Ode9
ltx/en_uk_ware/tr.d059:trMA.Ode9C11.text	Tasting once from the bitter fruit, the first-formed man was banished in grief from Paradise, and harnessed to the yoke of death. Fast, O my soul; flee from his example; flee from the pleasures of eating, for they are full of sorrow.
ltx/en_uk_ware/tr.d059:trMA.Ode9C12.incipit	I call to mind Thy…
ltx/en_uk_ware/tr.d059:trMA.Ode9C12.melody	@ltx/en_uk_ware/he.h.m6:heHE.TheonAnthropois.name
ltx/en_uk_ware/tr.d059:trMA.Ode9C12.mode	@ltx/en_uk_ware/miscellanea:misc.Mode6
ltx/en_uk_ware/tr.d059:trMA.Ode9C12.ode	@ltx/en_uk_ware/miscellanea:misc.Ode9
ltx/en_uk_ware/tr.d059:trMA.Ode9C12.text	I call to mind Thy judgement seat, and the fire that never shall be quenched; and before the judgement comes, I condemn myself, O righteous Judge. I fear and tremble, for I have sinned against Thee without measure, more that any other man on earth: therefore take pity on me.
ltx/en_uk_ware/tr.d059:trMA.Ode9C13.incipit	Let us wash away the…
ltx/en_uk_ware/tr.d059:trMA.Ode9C13.melody	@ltx/en_uk_ware/he.h.m6:heHE.TheonAnthropois.name
ltx/en_uk_ware/tr.d059:trMA.Ode9C13.mode	@ltx/en_uk_ware/miscellanea:misc.Mode6
ltx/en_uk_ware/tr.d059:trMA.Ode9C13.ode	@ltx/en_uk_ware/miscellanea:misc.Ode9
ltx/en_uk_ware/tr.d059:trMA.Ode9C13.text	Let us wash away the darkness of the passions with prayers of light, and bearing branches of virtue let us hasten to welcome Christ, who soon will come riding upon a foal; and He makes ready to suffer for our salvation.
ltx/en_uk_ware/tr.d059:trMA.Ode9C1T.incipit	Coming forth from thee, O…
ltx/en_uk_ware/tr.d059:trMA.Ode9C1T.melody	@ltx/en_uk_ware/he.h.m6:heHE.TheonAnthropois.name
ltx/en_uk_ware/tr.d059:trMA.Ode9C1T.mode	@ltx/en_uk_ware/miscellanea:misc.Mode6
ltx/en_uk_ware/tr.d059:trMA.Ode9C1T.ode	@ltx/en_uk_ware/miscellanea:misc.Ode9
ltx/en_uk_ware/tr.d059:trMA.Ode9C1T.text	Coming forth from thee, O Virgin full of God’s grace, Christ the Giver of light and peace has shone upon us, who are held fast by the night of the passions. He has set us free from the transgression that came through heedlessness, and He bestows redemption on us.
ltx/en_uk_ware/tr.d059:trMA.Ode9C21.greekmelody	@ltx/en_uk_ware/he.h.m5:heHE.IsaiaChoreve.greekname
ltx/en_uk_ware/tr.d059:trMA.Ode9C21.incipit	O wise Lazarus, prepare now…
ltx/en_uk_ware/tr.d059:trMA.Ode9C21.melody	@ltx/en_uk_ware/he.h.m5:heHE.IsaiaChoreve.name
ltx/en_uk_ware/tr.d059:trMA.Ode9C21.mode	@ltx/en_uk_ware/miscellanea:misc.Mode5
ltx/en_uk_ware/tr.d059:trMA.Ode9C21.ode	@ltx/en_uk_ware/miscellanea:misc.Ode9
ltx/en_uk_ware/tr.d059:trMA.Ode9C21.text	O wise Lazarus, prepare now for thy burial; for tomorrow thou shalt die and leave this life. Look at the tomb in which thou shalt dwell. But Christ will bring thee back to life again, raising thee on the fourth day.
ltx/en_uk_ware/tr.d059:trMA.Ode9C22.incipit	Be glad, O Bethany: for…
ltx/en_uk_ware/tr.d059:trMA.Ode9C22.melody	@ltx/en_uk_ware/he.h.m5:heHE.IsaiaChoreve.name
ltx/en_uk_ware/tr.d059:trMA.Ode9C22.mode	@ltx/en_uk_ware/miscellanea:misc.Mode5
ltx/en_uk_ware/tr.d059:trMA.Ode9C22.ode	@ltx/en_uk_ware/miscellanea:misc.Ode9
ltx/en_uk_ware/tr.d059:trMA.Ode9C22.text	Be glad, O Bethany: for Christ shall come to thee, performing in thee a great and fearful miracle. Binding death with fetters, as God of all He -will raise up Lazarus, who was dead and now magnifies the Creator.
ltx/en_uk_ware/tr.d059:trMA.Ode9C2A1.incipit	Come, let us make ready…
ltx/en_uk_ware/tr.d059:trMA.Ode9C2A1.melody	@ltx/en_uk_ware/he.h.m5:heHE.IsaiaChoreve.name
ltx/en_uk_ware/tr.d059:trMA.Ode9C2A1.mode	@ltx/en_uk_ware/miscellanea:misc.Mode5
ltx/en_uk_ware/tr.d059:trMA.Ode9C2A1.ode	@ltx/en_uk_ware/miscellanea:misc.Ode9
ltx/en_uk_ware/tr.d059:trMA.Ode9C2A1.text	Come, let us make ready to meet the Lord, bringing to Him palms of virtue. So shall we receive Him in our souls as in the city of Jerusalem, worshipping Him and singing his praises.
ltx/en_uk_ware/tr.d059:trMA.Ode9C2H.greekmelody	@ltx/en_uk_ware/he.h.m5:heHE.IsaiaChoreve.greekname
ltx/en_uk_ware/tr.d059:trMA.Ode9C2H.incipit	@ltx/en_uk_ware/he.h.m5:heHE.IsaiaChoreve.incipit
ltx/en_uk_ware/tr.d059:trMA.Ode9C2H.melody	@ltx/en_uk_ware/he.h.m5:heHE.IsaiaChoreve.melody
ltx/en_uk_ware/tr.d059:trMA.Ode9C2H.mode	@ltx/en_uk_ware/miscellanea:misc.Mode5
ltx/en_uk_ware/tr.d059:trMA.Ode9C2H.ode	@ltx/en_uk_ware/miscellanea:misc.Ode9
ltx/en_uk_ware/tr.d059:trMA.Ode9C2H.text	@ltx/en_uk_ware/he.h.m5:heHE.IsaiaChoreve.text
ltx/en_uk_ware/tr.d059:trMA.Ode9C2T.incipit	Beyond our understanding is thy…
ltx/en_uk_ware/tr.d059:trMA.Ode9C2T.melody	@ltx/en_uk_ware/he.h.m5:heHE.IsaiaChoreve.name
ltx/en_uk_ware/tr.d059:trMA.Ode9C2T.mode	@ltx/en_uk_ware/miscellanea:misc.Mode5
ltx/en_uk_ware/tr.d059:trMA.Ode9C2T.ode	@ltx/en_uk_ware/miscellanea:misc.Ode9
ltx/en_uk_ware/tr.d059:trMA.Ode9C2T.text	Beyond our understanding is thy childbearing, O Mother of God. For without man thou hast conceived, and in virginity thou hast given birth; and the Child that thou hast borne is God. We magnify Him, O Virgin, and we call thee blessed.
ltx/en_uk_ware/tr.d059:trMA.Ode9C2Tr.incipit	O honoured Trinity, consubstantial, without…
ltx/en_uk_ware/tr.d059:trMA.Ode9C2Tr.melody	@ltx/en_uk_ware/he.h.m5:heHE.IsaiaChoreve.name
ltx/en_uk_ware/tr.d059:trMA.Ode9C2Tr.mode	@ltx/en_uk_ware/miscellanea:misc.Mode5
ltx/en_uk_ware/tr.d059:trMA.Ode9C2Tr.ode	@ltx/en_uk_ware/miscellanea:misc.Ode9
ltx/en_uk_ware/tr.d059:trMA.Ode9C2Tr.text	O honoured Trinity, consubstantial, without beginning, source of life, O undivided Unity, I sing Thy praises: Father unbegotten, Word and Son begotten, and Holy Spirit, save us all who glorify Thee.
ltx/en_uk_ware/tr.d059:trTE.Troparion.incipit	Thou hast given to our…
ltx/en_uk_ware/tr.d059:trTE.Troparion.melody	
ltx/en_uk_ware/tr.d059:trTE.Troparion.mode	@ltx/en_uk_ware/miscellanea:misc.Mode5
ltx/en_uk_ware/tr.d059:trTE.Troparion.text	Thou hast given to our city an invincible rampart, even the Virgin who bore Thee. Through her we pray to Thee, Saviour: deliver our souls from the evils that assail us on every side.
ltx/en_uk_ware/tr.d059:trTE.Troparion2.incipit	…
ltx/en_uk_ware/tr.d059:trTE.Troparion2.text	
ltx/en_uk_ware/tr.d059:trVE.AposIdiomelon1.incipit	Deliver us, O Saviour, from…
ltx/en_uk_ware/tr.d059:trVE.AposIdiomelon1.melody	@ltx/en_uk_ware/miscellanea:misc.Idiomelon
ltx/en_uk_ware/tr.d059:trVE.AposIdiomelon1.mode	@ltx/en_uk_ware/miscellanea:misc.Mode4
ltx/en_uk_ware/tr.d059:trVE.AposIdiomelon1.text	Deliver us, O Saviour, from soul-destroying greed, and give us a place with Lazarus the poor man in the bosom of Abraham. For Thou who art rich in mercy hast for our sakes willingly become poor, and Thou hast led us from corruption into incorruption, because Thou art a God of tender compassion and love for mankind.
ltx/en_uk_ware/tr.d059:trVE.AposMartyric.incipit	Thou hast accepted the patient…
ltx/en_uk_ware/tr.d059:trVE.AposMartyric.melody	
ltx/en_uk_ware/tr.d059:trVE.AposMartyric.mode	@ltx/en_uk_ware/miscellanea:misc.Mode4
ltx/en_uk_ware/tr.d059:trVE.AposMartyric.text	Thou hast accepted the patient sufferings of the holy martyrs: in Thy love accept our hymns of praise, and at their intercessions grant us Thy great mercy.
ltx/en_uk_ware/tr.d059:trVE.AposTheotokion.incipit	Deliver us from our distress…
ltx/en_uk_ware/tr.d059:trVE.AposTheotokion.melody	
ltx/en_uk_ware/tr.d059:trVE.AposTheotokion.mode	@ltx/en_uk_ware/miscellanea:misc.Mode4
ltx/en_uk_ware/tr.d059:trVE.AposTheotokion.text	Deliver us from our distress, O Mother of Christ our God, who gavest birth to the Creator of all, that we may ever cry to thee: Hail, protection of our souls!
ltx/en_uk_ware/tr.d059:trVE.Stichera01.greekmelody	@ltx/en_uk_ware/he.a.m6:heAU.OlinApothemenoi.greekname
ltx/en_uk_ware/tr.d059:trVE.Stichera01.incipit	My strength is weakened by…
ltx/en_uk_ware/tr.d059:trVE.Stichera01.melody	@ltx/en_uk_ware/he.a.m6:heAU.OlinApothemenoi.name
ltx/en_uk_ware/tr.d059:trVE.Stichera01.mode	@ltx/en_uk_ware/miscellanea:misc.Mode6
ltx/en_uk_ware/tr.d059:trVE.Stichera01.text	My strength is weakened by my many sins and by the pleasures of this life, and in my misery, O Master, I lie always on the bed of slothfulness; but I cry to Thee: With loving compassion come and visit me, granting me health and mercy. Forsake me not, lest I sleep in death and the enemy rejoices over my destruction: for he seeks to drag me down, O Saviour, into the fearful depths of hell.
ltx/en_uk_ware/tr.d059:trVE.Stichera02.greekmelody	@ltx/en_uk_ware/he.a.m6:heAU.OlinApothemenoi.greekname
ltx/en_uk_ware/tr.d059:trVE.Stichera02.incipit	I have rivalled in foolishness…
ltx/en_uk_ware/tr.d059:trVE.Stichera02.melody	@ltx/en_uk_ware/he.a.m6:heAU.OlinApothemenoi.name
ltx/en_uk_ware/tr.d059:trVE.Stichera02.mode	@ltx/en_uk_ware/miscellanea:misc.Mode6
ltx/en_uk_ware/tr.d059:trVE.Stichera02.text	I have rivalled in foolishness the rich man who showed no love for others; overwhelmed by sensual pleasures and the passions, I live in luxury and self-indulgence. I see my mind, O Lord, lying always like Lazarus before the gates of repentance, but with indifference I pass it by, and leave it hungry, sick and wounded by the passions. Therefore I deserve to be condemned to the flames of Gehenna: but deliver me from them, O Master, for Thou alone art rich in mercy.
ltx/en_uk_ware/tr.d059:trVE.Stichera03.incipit	O Lord, while dwelling in…
ltx/en_uk_ware/tr.d059:trVE.Stichera03.melody	
ltx/en_uk_ware/tr.d059:trVE.Stichera03.mode	@ltx/en_uk_ware/miscellanea:misc.Mode5
ltx/en_uk_ware/tr.d059:trVE.Stichera03.text	O Lord, while dwelling in the flesh on the other side of Jordan, Thou hast foretold that the sickness of Lazarus would not end in death, but that it had come to pass for Thy glory, O our God. Glory to Thy mighty acts and Thine all-sovereign power, for Thou hast destroyed death in Thy great mercy and Thy love for mankind.
