ltx/en_uk_ware/tr.d052:trCO.header	
ltx/en_uk_ware/tr.d052:trDA.commemoration.full	
ltx/en_uk_ware/tr.d052:trDA.commemoration.short	
ltx/en_uk_ware/tr.d052:trDA.insert1	
ltx/en_uk_ware/tr.d052:trDA.insert2	
ltx/en_uk_ware/tr.d052:trDA.note	
ltx/en_uk_ware/tr.d052:trDA.title	
ltx/en_uk_ware/tr.d052:trHO.commemorations	
ltx/en_uk_ware/tr.d052:trHO.daytitle	
ltx/en_uk_ware/tr.d052:trHO.description1	
ltx/en_uk_ware/tr.d052:trHO.description2	
ltx/en_uk_ware/tr.d052:trHO.note1	
ltx/en_uk_ware/tr.d052:trHO.note2	
ltx/en_uk_ware/tr.d052:trMA.AposIdiomelon1.incipit	Visit, Lord, my wounded and…
ltx/en_uk_ware/tr.d052:trMA.AposIdiomelon1.melody	@ltx/en_uk_ware/miscellanea:misc.Idiomelon
ltx/en_uk_ware/tr.d052:trMA.AposIdiomelon1.mode	@ltx/en_uk_ware/miscellanea:misc.Mode7
ltx/en_uk_ware/tr.d052:trMA.AposIdiomelon1.text	Visit, Lord, my wounded and humiliated soul, O Physician of the sick, storm-free haven of the hopeless. For Thou art the Deliverer of the world, and hast come to raise the fallen from corruption. In Thy great mercy raise me also, for I kneel before Thee.
ltx/en_uk_ware/tr.d052:trMA.AposMartyric.incipit	In the midst of the…
ltx/en_uk_ware/tr.d052:trMA.AposMartyric.melody	
ltx/en_uk_ware/tr.d052:trMA.AposMartyric.mode	@ltx/en_uk_ware/miscellanea:misc.Mode7
ltx/en_uk_ware/tr.d052:trMA.AposMartyric.text	In the midst of the arena, before the lawless pagans, the victorious martyrs cried aloud rejoicing: ‘O Lord, glory to Thee.’
ltx/en_uk_ware/tr.d052:trMA.AposTheotokion.incipit	We sing thy praises, most…
ltx/en_uk_ware/tr.d052:trMA.AposTheotokion.melody	
ltx/en_uk_ware/tr.d052:trMA.AposTheotokion.mode	@ltx/en_uk_ware/miscellanea:misc.Mode7
ltx/en_uk_ware/tr.d052:trMA.AposTheotokion.text	We sing thy praises, most pure Theotokos; we glorify God the Word whom thou hast borne, and we cry: ‘Glory to thee.’
ltx/en_uk_ware/tr.d052:trMA.C1.poet	@ltx/en_uk_ware/poets:po.Iosif
ltx/en_uk_ware/tr.d052:trMA.C2.poet	@ltx/en_uk_ware/poets:po.Theodorou
ltx/en_uk_ware/tr.d052:trMA.Kathisma21.greekmelody	@ltx/en_uk_ware/he.a.m3:heAU.TheiasPisteos.greekname
ltx/en_uk_ware/tr.d052:trMA.Kathisma21.incipit	In fervent faith let us…
ltx/en_uk_ware/tr.d052:trMA.Kathisma21.melody	@ltx/en_uk_ware/he.a.m3:heAU.TheiasPisteos.name
ltx/en_uk_ware/tr.d052:trMA.Kathisma21.mode	@ltx/en_uk_ware/miscellanea:misc.Mode3
ltx/en_uk_ware/tr.d052:trMA.Kathisma21.text	In fervent faith let us burn up with abstinence the lustful passions, and flee from the icy cold of sin; with the streams of our tears let us quench the everlasting flame, crying aloud: We have sinned against Thee, O most loving Lord; forgive us and grant us Thy great mercy.
ltx/en_uk_ware/tr.d052:trMA.Kathisma22.greekmelody	@ltx/en_uk_ware/he.a.m3:heAU.TheiasPisteos.greekname
ltx/en_uk_ware/tr.d052:trMA.Kathisma22.incipit	Thou hast become the divine…
ltx/en_uk_ware/tr.d052:trMA.Kathisma22.melody	@ltx/en_uk_ware/he.a.m3:heAU.TheiasPisteos.name
ltx/en_uk_ware/tr.d052:trMA.Kathisma22.mode	@ltx/en_uk_ware/miscellanea:misc.Mode3
ltx/en_uk_ware/tr.d052:trMA.Kathisma22.text	Thou hast become the divine dwelling of the Word, O Virgin Mother alone all-holy, exalted high above the angels in thy purity. I am become more filthy than all men, defiled by the sins of the flesh: through thine intercessions cleanse me in divine waters, granting me great mercy.
ltx/en_uk_ware/tr.d052:trMA.Kathisma31.incipit	Most glorious is the grace…
ltx/en_uk_ware/tr.d052:trMA.Kathisma31.melody	
ltx/en_uk_ware/tr.d052:trMA.Kathisma31.mode	@ltx/en_uk_ware/miscellanea:misc.Mode2
ltx/en_uk_ware/tr.d052:trMA.Kathisma31.text	Most glorious is the grace of the holy Fast. Through it the Prophet Elijah found the chariot of fire, and Moses received the Tables of the Law; Daniel was magnified, and Elisha raised the dead; the Children quenched the fire, and all men are reconciled to God. Rejoicing in the Fast, let us cry aloud: Blessed art Thou, O Christ our God, whose good pleasure this has been; glory to Thee.
ltx/en_uk_ware/tr.d052:trMA.Kathisma32.incipit	Having obtained in my distress…
ltx/en_uk_ware/tr.d052:trMA.Kathisma32.melody	
ltx/en_uk_ware/tr.d052:trMA.Kathisma32.mode	@ltx/en_uk_ware/miscellanea:misc.Mode2
ltx/en_uk_ware/tr.d052:trMA.Kathisma32.text	Having obtained in my distress thine unconquerable intercession, O Mother of our God, I am set free miraculously and past all hope from everything that troubles me. For thou art always swift to help those who ask of thee in faith, and dost deliver them when oppressed by the temptations of the enemy. Therefore with thanksgiving we cry unto thee: Accept, O Lady, this small offering of grateful praise, and be my help in all things.
ltx/en_uk_ware/tr.d052:trMA.Ode2C11.greekmelody	@ltx/en_uk_ware/he.h.m3:heHE.ProsecheGiKaiOurane.greekname
ltx/en_uk_ware/tr.d052:trMA.Ode2C11.incipit	Through unceasing prayer and abstinence…
ltx/en_uk_ware/tr.d052:trMA.Ode2C11.melody	@ltx/en_uk_ware/he.h.m3:heHE.ProsecheGiKaiOurane.name
ltx/en_uk_ware/tr.d052:trMA.Ode2C11.mode	@ltx/en_uk_ware/miscellanea:misc.Mode3
ltx/en_uk_ware/tr.d052:trMA.Ode2C11.ode	@ltx/en_uk_ware/miscellanea:misc.Ode2
ltx/en_uk_ware/tr.d052:trMA.Ode2C11.text	Through unceasing prayer and abstinence and contemplation, let us give wings to our souls and raise them to the love of God.
ltx/en_uk_ware/tr.d052:trMA.Ode2C12.incipit	Fleeing from the icy cold…
ltx/en_uk_ware/tr.d052:trMA.Ode2C12.melody	@ltx/en_uk_ware/he.h.m3:heHE.ProsecheGiKaiOurane.name
ltx/en_uk_ware/tr.d052:trMA.Ode2C12.mode	@ltx/en_uk_ware/miscellanea:misc.Mode3
ltx/en_uk_ware/tr.d052:trMA.Ode2C12.ode	@ltx/en_uk_ware/miscellanea:misc.Ode2
ltx/en_uk_ware/tr.d052:trMA.Ode2C12.text	Fleeing from the icy cold of self-indulgence, let us all warm ourselves with the light of abstinence and the Holy Spirit.
ltx/en_uk_ware/tr.d052:trMA.Ode2C13.incipit	O my soul, drive away…
ltx/en_uk_ware/tr.d052:trMA.Ode2C13.melody	@ltx/en_uk_ware/he.h.m3:heHE.ProsecheGiKaiOurane.name
ltx/en_uk_ware/tr.d052:trMA.Ode2C13.mode	@ltx/en_uk_ware/miscellanea:misc.Mode3
ltx/en_uk_ware/tr.d052:trMA.Ode2C13.ode	@ltx/en_uk_ware/miscellanea:misc.Ode2
ltx/en_uk_ware/tr.d052:trMA.Ode2C13.text	O my soul, drive away the putrefaction of sin with the salt of the divine virtues, and cleave to God.
ltx/en_uk_ware/tr.d052:trMA.Ode2C1H.greekmelody	@ltx/en_uk_ware/he.h.m3:heHE.ProsecheGiKaiOurane.greekname
ltx/en_uk_ware/tr.d052:trMA.Ode2C1H.incipit	@ltx/en_uk_ware/he.h.m3:heHE.ProsecheGiKaiOurane.incipit
ltx/en_uk_ware/tr.d052:trMA.Ode2C1H.melody	@ltx/en_uk_ware/he.h.m3:heHE.ProsecheGiKaiOurane.melody
ltx/en_uk_ware/tr.d052:trMA.Ode2C1H.mode	@ltx/en_uk_ware/miscellanea:misc.Mode3
ltx/en_uk_ware/tr.d052:trMA.Ode2C1H.ode	@ltx/en_uk_ware/miscellanea:misc.Ode2
ltx/en_uk_ware/tr.d052:trMA.Ode2C1H.text	@ltx/en_uk_ware/he.h.m3:heHE.ProsecheGiKaiOurane.text
ltx/en_uk_ware/tr.d052:trMA.Ode2C1T.incipit	Christ came to dwell in…
ltx/en_uk_ware/tr.d052:trMA.Ode2C1T.melody	@ltx/en_uk_ware/he.h.m3:heHE.ProsecheGiKaiOurane.name
ltx/en_uk_ware/tr.d052:trMA.Ode2C1T.mode	@ltx/en_uk_ware/miscellanea:misc.Mode3
ltx/en_uk_ware/tr.d052:trMA.Ode2C1T.ode	@ltx/en_uk_ware/miscellanea:misc.Ode2
ltx/en_uk_ware/tr.d052:trMA.Ode2C1T.text	Christ came to dwell in thee who alone art blessed, and He took from thee the flesh He made His own.
ltx/en_uk_ware/tr.d052:trMA.Ode2C21.greekmelody	@ltx/en_uk_ware/he.h.m2:heHE.ProsecheteLaoi.greekname
ltx/en_uk_ware/tr.d052:trMA.Ode2C21.incipit	Let us make our own…
ltx/en_uk_ware/tr.d052:trMA.Ode2C21.melody	@ltx/en_uk_ware/he.h.m2:heHE.ProsecheteLaoi.name
ltx/en_uk_ware/tr.d052:trMA.Ode2C21.mode	@ltx/en_uk_ware/miscellanea:misc.Mode2
ltx/en_uk_ware/tr.d052:trMA.Ode2C21.ode	@ltx/en_uk_ware/miscellanea:misc.Ode2
ltx/en_uk_ware/tr.d052:trMA.Ode2C21.text	Let us make our own pure fasting, prayer, tears, meditation on holy things, and every other virtue; and let us bring them now as an offering to God our Master.
ltx/en_uk_ware/tr.d052:trMA.Ode2C22.incipit	Eve was taken captive by…
ltx/en_uk_ware/tr.d052:trMA.Ode2C22.melody	@ltx/en_uk_ware/he.h.m2:heHE.ProsecheteLaoi.name
ltx/en_uk_ware/tr.d052:trMA.Ode2C22.mode	@ltx/en_uk_ware/miscellanea:misc.Mode2
ltx/en_uk_ware/tr.d052:trMA.Ode2C22.ode	@ltx/en_uk_ware/miscellanea:misc.Ode2
ltx/en_uk_ware/tr.d052:trMA.Ode2C22.text	Eve was taken captive by the fruit. O my soul, consider this and be not deceived if ever the serpent tempts thee, urging thee to eat the fruits of lust.
ltx/en_uk_ware/tr.d052:trMA.Ode2C2A1.incipit	O my Christ, Thou hast…
ltx/en_uk_ware/tr.d052:trMA.Ode2C2A1.melody	@ltx/en_uk_ware/he.h.m2:heHE.ProsecheteLaoi.name
ltx/en_uk_ware/tr.d052:trMA.Ode2C2A1.mode	@ltx/en_uk_ware/miscellanea:misc.Mode2
ltx/en_uk_ware/tr.d052:trMA.Ode2C2A1.ode	@ltx/en_uk_ware/miscellanea:misc.Ode2
ltx/en_uk_ware/tr.d052:trMA.Ode2C2A1.text	O my Christ, Thou hast healed the woman with an issue of blood when she touched the hem of Thy garment. Trusting in Thy mercy, I too stretch out my hand to touch Thee: heal me from the passions.
ltx/en_uk_ware/tr.d052:trMA.Ode2C2H.greekmelody	@ltx/en_uk_ware/he.h.m2:heHE.ProsecheteLaoi.greekname
ltx/en_uk_ware/tr.d052:trMA.Ode2C2H.incipit	@ltx/en_uk_ware/he.h.m2:heHE.ProsecheteLaoi.incipit
ltx/en_uk_ware/tr.d052:trMA.Ode2C2H.melody	@ltx/en_uk_ware/he.h.m2:heHE.ProsecheteLaoi.melody
ltx/en_uk_ware/tr.d052:trMA.Ode2C2H.mode	@ltx/en_uk_ware/miscellanea:misc.Mode2
ltx/en_uk_ware/tr.d052:trMA.Ode2C2H.ode	@ltx/en_uk_ware/miscellanea:misc.Ode2
ltx/en_uk_ware/tr.d052:trMA.Ode2C2H.text	@ltx/en_uk_ware/he.h.m2:heHE.ProsecheteLaoi.text
ltx/en_uk_ware/tr.d052:trMA.Ode2C2T.incipit	Thy childbearing, O pure Lady…
ltx/en_uk_ware/tr.d052:trMA.Ode2C2T.melody	@ltx/en_uk_ware/he.h.m2:heHE.ProsecheteLaoi.name
ltx/en_uk_ware/tr.d052:trMA.Ode2C2T.mode	@ltx/en_uk_ware/miscellanea:misc.Mode2
ltx/en_uk_ware/tr.d052:trMA.Ode2C2T.ode	@ltx/en_uk_ware/miscellanea:misc.Ode2
ltx/en_uk_ware/tr.d052:trMA.Ode2C2T.text	Thy childbearing, O pure Lady, fills our hearts with fear. For it is God who has become man, begotten outside time from the Father and in the last days brought forth by thee through a virgin birth.
ltx/en_uk_ware/tr.d052:trMA.Ode2C2Tr.incipit	I glorify three Persons in…
ltx/en_uk_ware/tr.d052:trMA.Ode2C2Tr.melody	@ltx/en_uk_ware/he.h.m2:heHE.ProsecheteLaoi.name
ltx/en_uk_ware/tr.d052:trMA.Ode2C2Tr.mode	@ltx/en_uk_ware/miscellanea:misc.Mode2
ltx/en_uk_ware/tr.d052:trMA.Ode2C2Tr.ode	@ltx/en_uk_ware/miscellanea:misc.Ode2
ltx/en_uk_ware/tr.d052:trMA.Ode2C2Tr.text	I glorify three Persons in one Nature, Father, Son and Spirit, the one Power of the Godhead, one Kingdom over all and one Brightness.
ltx/en_uk_ware/tr.d052:trMA.Ode8C11.greekmelody	@ltx/en_uk_ware/he.h.m3:heHE.TonYpAngelon.greekname
ltx/en_uk_ware/tr.d052:trMA.Ode8C11.incipit	The evil one secretly lies…
ltx/en_uk_ware/tr.d052:trMA.Ode8C11.melody	@ltx/en_uk_ware/he.h.m3:heHE.TonYpAngelon.name
ltx/en_uk_ware/tr.d052:trMA.Ode8C11.mode	@ltx/en_uk_ware/miscellanea:misc.Mode3
ltx/en_uk_ware/tr.d052:trMA.Ode8C11.ode	@ltx/en_uk_ware/miscellanea:misc.Ode8
ltx/en_uk_ware/tr.d052:trMA.Ode8C11.text	The evil one secretly lies in wait for me each day, seeking to catch me and devour me. Deliver me, O Saviour, from his malice, as Thou hast saved Jonah from the whale.
ltx/en_uk_ware/tr.d052:trMA.Ode8C12.incipit	Cleansed through fasting, let us…
ltx/en_uk_ware/tr.d052:trMA.Ode8C12.melody	@ltx/en_uk_ware/he.h.m3:heHE.TonYpAngelon.name
ltx/en_uk_ware/tr.d052:trMA.Ode8C12.mode	@ltx/en_uk_ware/miscellanea:misc.Mode3
ltx/en_uk_ware/tr.d052:trMA.Ode8C12.ode	@ltx/en_uk_ware/miscellanea:misc.Ode8
ltx/en_uk_ware/tr.d052:trMA.Ode8C12.text	Cleansed through fasting, let us draw near to the mountain of the virtues and let us clearly hear what God will say within us; for He will speak to us of peace and illumination and the healing of our broken souls.
ltx/en_uk_ware/tr.d052:trMA.Ode8C13.incipit	Blinded each day by the…
ltx/en_uk_ware/tr.d052:trMA.Ode8C13.melody	@ltx/en_uk_ware/he.h.m3:heHE.TonYpAngelon.name
ltx/en_uk_ware/tr.d052:trMA.Ode8C13.mode	@ltx/en_uk_ware/miscellanea:misc.Mode3
ltx/en_uk_ware/tr.d052:trMA.Ode8C13.ode	@ltx/en_uk_ware/miscellanea:misc.Ode8
ltx/en_uk_ware/tr.d052:trMA.Ode8C13.text	Blinded each day by the darkness of my sins, I cannot perceive Thy wonders, O Lord: but do Thou open the eyes of my heart, O Jesus Giver of Light.
ltx/en_uk_ware/tr.d052:trMA.Ode8C1T.incipit	O Ever-Virgin undefiled, with the…
ltx/en_uk_ware/tr.d052:trMA.Ode8C1T.melody	@ltx/en_uk_ware/he.h.m3:heHE.TonYpAngelon.name
ltx/en_uk_ware/tr.d052:trMA.Ode8C1T.mode	@ltx/en_uk_ware/miscellanea:misc.Mode3
ltx/en_uk_ware/tr.d052:trMA.Ode8C1T.ode	@ltx/en_uk_ware/miscellanea:misc.Ode8
ltx/en_uk_ware/tr.d052:trMA.Ode8C1T.text	O Ever-Virgin undefiled, with the waters of thy mercy wash from my heart the defilement of the passions, and give me streams of tears to cleanse my soul.
ltx/en_uk_ware/tr.d052:trMA.Ode8C21.greekmelody	@ltx/en_uk_ware/he.h.m2:heHE.TonPalaiDrosisanta.greekname
ltx/en_uk_ware/tr.d052:trMA.Ode8C21.incipit	The fire shall not be…
ltx/en_uk_ware/tr.d052:trMA.Ode8C21.melody	@ltx/en_uk_ware/he.h.m2:heHE.TonPalaiDrosisanta.name
ltx/en_uk_ware/tr.d052:trMA.Ode8C21.mode	@ltx/en_uk_ware/miscellanea:misc.Mode2
ltx/en_uk_ware/tr.d052:trMA.Ode8C21.ode	@ltx/en_uk_ware/miscellanea:misc.Ode8
ltx/en_uk_ware/tr.d052:trMA.Ode8C21.text	The fire shall not be quenched, so it is written, and the worm shall not die. Fear the threat, my soul, and serve Christ, that thou mayest find joy in the dwelling-place of all those who rejoice.
ltx/en_uk_ware/tr.d052:trMA.Ode8C22.incipit	My soul burns with the…
ltx/en_uk_ware/tr.d052:trMA.Ode8C22.melody	@ltx/en_uk_ware/he.h.m2:heHE.TonPalaiDrosisanta.name
ltx/en_uk_ware/tr.d052:trMA.Ode8C22.mode	@ltx/en_uk_ware/miscellanea:misc.Mode2
ltx/en_uk_ware/tr.d052:trMA.Ode8C22.ode	@ltx/en_uk_ware/miscellanea:misc.Ode8
ltx/en_uk_ware/tr.d052:trMA.Ode8C22.text	My soul burns with the fever of lust: by Thy touch, I pray Thee, raise it up, as Thou hast raised the mother-in-law of Peter; so shall I be enabled to serve Thee acceptably, returning thanks to Thee for ever.
ltx/en_uk_ware/tr.d052:trMA.Ode8C2A1.incipit	Open the deaf ears of…
ltx/en_uk_ware/tr.d052:trMA.Ode8C2A1.melody	@ltx/en_uk_ware/he.h.m2:heHE.TonPalaiDrosisanta.name
ltx/en_uk_ware/tr.d052:trMA.Ode8C2A1.mode	@ltx/en_uk_ware/miscellanea:misc.Mode2
ltx/en_uk_ware/tr.d052:trMA.Ode8C2A1.ode	@ltx/en_uk_ware/miscellanea:misc.Ode8
ltx/en_uk_ware/tr.d052:trMA.Ode8C2A1.text	Open the deaf ears of my soul, O Christ, and make my tongue to speak clearly, as once Thou hast done to the deaf man who had an impediment in his speech: so shall I listen to Thy voice and sing to Thee with my tongue, praising Thee for ever.
ltx/en_uk_ware/tr.d052:trMA.Ode8C2H.greekmelody	@ltx/en_uk_ware/he.h.m2:heHE.TonPalaiDrosisanta.greekname
ltx/en_uk_ware/tr.d052:trMA.Ode8C2H.incipit	@ltx/en_uk_ware/he.h.m2:heHE.TonPalaiDrosisanta.incipit
ltx/en_uk_ware/tr.d052:trMA.Ode8C2H.melody	@ltx/en_uk_ware/he.h.m2:heHE.TonPalaiDrosisanta.melody
ltx/en_uk_ware/tr.d052:trMA.Ode8C2H.mode	@ltx/en_uk_ware/miscellanea:misc.Mode2
ltx/en_uk_ware/tr.d052:trMA.Ode8C2H.ode	@ltx/en_uk_ware/miscellanea:misc.Ode8
ltx/en_uk_ware/tr.d052:trMA.Ode8C2H.text	@ltx/en_uk_ware/he.h.m2:heHE.TonPalaiDrosisanta.text
ltx/en_uk_ware/tr.d052:trMA.Ode8C2T.incipit	O Mary, called by God…
ltx/en_uk_ware/tr.d052:trMA.Ode8C2T.melody	@ltx/en_uk_ware/he.h.m2:heHE.TonPalaiDrosisanta.name
ltx/en_uk_ware/tr.d052:trMA.Ode8C2T.mode	@ltx/en_uk_ware/miscellanea:misc.Mode2
ltx/en_uk_ware/tr.d052:trMA.Ode8C2T.ode	@ltx/en_uk_ware/miscellanea:misc.Ode8
ltx/en_uk_ware/tr.d052:trMA.Ode8C2T.text	O Mary, called by God, truly thou art the mercy-seat of the faithful: for through thee forgiveness is freely bestowed upon all. Cease not to intercede before thy Son and Lord, gaining His gracious favour for us who sing thy praises.
ltx/en_uk_ware/tr.d052:trMA.Ode8C2Tr.incipit	 O ye faithful, let…
ltx/en_uk_ware/tr.d052:trMA.Ode8C2Tr.melody	@ltx/en_uk_ware/he.h.m2:heHE.TonPalaiDrosisanta.name
ltx/en_uk_ware/tr.d052:trMA.Ode8C2Tr.mode	@ltx/en_uk_ware/miscellanea:misc.Mode2
ltx/en_uk_ware/tr.d052:trMA.Ode8C2Tr.ode	@ltx/en_uk_ware/miscellanea:misc.Ode8
ltx/en_uk_ware/tr.d052:trMA.Ode8C2Tr.text	 O ye faithful, let us sing in praise to the Father, eternal and without beginning, and to His coeternal Son, and to the Spirit that shines forth from the Father, three consubstantial Persons but one in sovereign power and rule.
ltx/en_uk_ware/tr.d052:trMA.Ode9C11.greekmelody	@ltx/en_uk_ware/he.h.m3:heHE.SeTinAkataflekton.greekname
ltx/en_uk_ware/tr.d052:trMA.Ode9C11.incipit	Calling to mind the flames…
ltx/en_uk_ware/tr.d052:trMA.Ode9C11.melody	@ltx/en_uk_ware/he.h.m3:heHE.SeTinAkataflekton.name
ltx/en_uk_ware/tr.d052:trMA.Ode9C11.mode	@ltx/en_uk_ware/miscellanea:misc.Mode3
ltx/en_uk_ware/tr.d052:trMA.Ode9C11.ode	@ltx/en_uk_ware/miscellanea:misc.Ode9
ltx/en_uk_ware/tr.d052:trMA.Ode9C11.text	Calling to mind the flames of the fire that never shall be quenched, with fervent hearts let us draw near to the fire of repentance and burn up the passions.
ltx/en_uk_ware/tr.d052:trMA.Ode9C12.incipit	Words of fire came forth…
ltx/en_uk_ware/tr.d052:trMA.Ode9C12.melody	@ltx/en_uk_ware/he.h.m3:heHE.SeTinAkataflekton.name
ltx/en_uk_ware/tr.d052:trMA.Ode9C12.mode	@ltx/en_uk_ware/miscellanea:misc.Mode3
ltx/en_uk_ware/tr.d052:trMA.Ode9C12.ode	@ltx/en_uk_ware/miscellanea:misc.Ode9
ltx/en_uk_ware/tr.d052:trMA.Ode9C12.text	Words of fire came forth of old from the mouth of him who fasted, and overwhelmed the elements. Emulate his zeal, my soul, and live rightly.
ltx/en_uk_ware/tr.d052:trMA.Ode9C13.incipit	Keeping in mind the fearful…
ltx/en_uk_ware/tr.d052:trMA.Ode9C13.melody	@ltx/en_uk_ware/he.h.m3:heHE.SeTinAkataflekton.name
ltx/en_uk_ware/tr.d052:trMA.Ode9C13.mode	@ltx/en_uk_ware/miscellanea:misc.Mode3
ltx/en_uk_ware/tr.d052:trMA.Ode9C13.ode	@ltx/en_uk_ware/miscellanea:misc.Ode9
ltx/en_uk_ware/tr.d052:trMA.Ode9C13.text	Keeping in mind the fearful judgement seat, my wretched soul, always guide thy steps to the accomplishment of the Redeemer’s will.
ltx/en_uk_ware/tr.d052:trMA.Ode9C1T.incipit	My soul is darkened by…
ltx/en_uk_ware/tr.d052:trMA.Ode9C1T.melody	@ltx/en_uk_ware/he.h.m3:heHE.SeTinAkataflekton.name
ltx/en_uk_ware/tr.d052:trMA.Ode9C1T.mode	@ltx/en_uk_ware/miscellanea:misc.Mode3
ltx/en_uk_ware/tr.d052:trMA.Ode9C1T.ode	@ltx/en_uk_ware/miscellanea:misc.Ode9
ltx/en_uk_ware/tr.d052:trMA.Ode9C1T.text	My soul is darkened by the pleasures; give light to it, pure Virgin, who hast borne the Light, that with fear and faith I may for ever magnify thee.
ltx/en_uk_ware/tr.d052:trMA.Ode9C21.greekmelody	@ltx/en_uk_ware/he.h.m2:heHE.TinYperfyosSarki.greekname
ltx/en_uk_ware/tr.d052:trMA.Ode9C21.incipit	Let us offer to Christ…
ltx/en_uk_ware/tr.d052:trMA.Ode9C21.melody	@ltx/en_uk_ware/he.h.m2:heHE.TinYperfyosSarki.name
ltx/en_uk_ware/tr.d052:trMA.Ode9C21.mode	@ltx/en_uk_ware/miscellanea:misc.Mode2
ltx/en_uk_ware/tr.d052:trMA.Ode9C21.ode	@ltx/en_uk_ware/miscellanea:misc.Ode9
ltx/en_uk_ware/tr.d052:trMA.Ode9C21.text	Let us offer to Christ all the members of our body as weapons of righteousness, ‘lifting up’, as it is written, ‘holy hands, without wrath and doubting’.
ltx/en_uk_ware/tr.d052:trMA.Ode9C22.incipit	Coming once to the disciples…
ltx/en_uk_ware/tr.d052:trMA.Ode9C22.melody	@ltx/en_uk_ware/he.h.m2:heHE.TinYperfyosSarki.name
ltx/en_uk_ware/tr.d052:trMA.Ode9C22.mode	@ltx/en_uk_ware/miscellanea:misc.Mode2
ltx/en_uk_ware/tr.d052:trMA.Ode9C22.ode	@ltx/en_uk_ware/miscellanea:misc.Ode9
ltx/en_uk_ware/tr.d052:trMA.Ode9C22.text	Coming once to the disciples in the boat, my Christ, Thou hast stilled the raging sea: do Thou also still the tempest of my thoughts.
ltx/en_uk_ware/tr.d052:trMA.Ode9C2A1.incipit	The passions have defiled my…
ltx/en_uk_ware/tr.d052:trMA.Ode9C2A1.melody	@ltx/en_uk_ware/he.h.m2:heHE.TinYperfyosSarki.name
ltx/en_uk_ware/tr.d052:trMA.Ode9C2A1.mode	@ltx/en_uk_ware/miscellanea:misc.Mode2
ltx/en_uk_ware/tr.d052:trMA.Ode9C2A1.ode	@ltx/en_uk_ware/miscellanea:misc.Ode9
ltx/en_uk_ware/tr.d052:trMA.Ode9C2A1.text	The passions have defiled my soul, and I have been robbed like the man who fell among thieves. But heal me, O my Christ, and pour Thy mercy upon me.
ltx/en_uk_ware/tr.d052:trMA.Ode9C2H.greekmelody	@ltx/en_uk_ware/he.h.m2:heHE.TinYperfyosSarki.greekname
ltx/en_uk_ware/tr.d052:trMA.Ode9C2H.incipit	@ltx/en_uk_ware/he.h.m2:heHE.TinYperfyosSarki.incipit
ltx/en_uk_ware/tr.d052:trMA.Ode9C2H.melody	@ltx/en_uk_ware/he.h.m2:heHE.TinYperfyosSarki.melody
ltx/en_uk_ware/tr.d052:trMA.Ode9C2H.mode	@ltx/en_uk_ware/miscellanea:misc.Mode2
ltx/en_uk_ware/tr.d052:trMA.Ode9C2H.ode	@ltx/en_uk_ware/miscellanea:misc.Ode9
ltx/en_uk_ware/tr.d052:trMA.Ode9C2H.text	@ltx/en_uk_ware/he.h.m2:heHE.TinYperfyosSarki.text
ltx/en_uk_ware/tr.d052:trMA.Ode9C2T.incipit	Though a pure maiden thou…
ltx/en_uk_ware/tr.d052:trMA.Ode9C2T.melody	@ltx/en_uk_ware/he.h.m2:heHE.TinYperfyosSarki.name
ltx/en_uk_ware/tr.d052:trMA.Ode9C2T.mode	@ltx/en_uk_ware/miscellanea:misc.Mode2
ltx/en_uk_ware/tr.d052:trMA.Ode9C2T.ode	@ltx/en_uk_ware/miscellanea:misc.Ode9
ltx/en_uk_ware/tr.d052:trMA.Ode9C2T.text	Though a pure maiden thou hearest child, and though a virgin thou givest suck. How can these things be found together? How dost thou give birth and yet remain virgin? ‘It is God who has brought this to pass; ask me not how.’
ltx/en_uk_ware/tr.d052:trMA.Ode9C2Tr.incipit	I worship one Nature, I…
ltx/en_uk_ware/tr.d052:trMA.Ode9C2Tr.melody	@ltx/en_uk_ware/he.h.m2:heHE.TinYperfyosSarki.name
ltx/en_uk_ware/tr.d052:trMA.Ode9C2Tr.mode	@ltx/en_uk_ware/miscellanea:misc.Mode2
ltx/en_uk_ware/tr.d052:trMA.Ode9C2Tr.ode	@ltx/en_uk_ware/miscellanea:misc.Ode9
ltx/en_uk_ware/tr.d052:trMA.Ode9C2Tr.text	I worship one Nature, I sing the praises of three Persons, one God of all, Father, Son and Holy Spirit, sovereignty eternal.
ltx/en_uk_ware/tr.d052:trTE.Troparion.incipit	Our protector is the God…
ltx/en_uk_ware/tr.d052:trTE.Troparion.melody	
ltx/en_uk_ware/tr.d052:trTE.Troparion.mode	@ltx/en_uk_ware/miscellanea:misc.Mode3
ltx/en_uk_ware/tr.d052:trTE.Troparion.text	Our protector is the God of Jacob: He is our defender in the day of trouble.
ltx/en_uk_ware/tr.d052:trTE.Troparion2.incipit	…
ltx/en_uk_ware/tr.d052:trTE.Troparion2.text	
ltx/en_uk_ware/tr.d052:trVE.AposIdiomelon1.incipit	Like the man who fell…
ltx/en_uk_ware/tr.d052:trVE.AposIdiomelon1.melody	@ltx/en_uk_ware/miscellanea:misc.Idiomelon
ltx/en_uk_ware/tr.d052:trVE.AposIdiomelon1.mode	@ltx/en_uk_ware/miscellanea:misc.Mode7
ltx/en_uk_ware/tr.d052:trVE.AposIdiomelon1.text	Like the man who fell among thieves and was wounded, I have also fallen because of my sins, and my soul has been wounded. To whom shall I fly for healing, but to Thee, Physician of souls and bodies? Pour out upon me Thy great mercy, O God.
ltx/en_uk_ware/tr.d052:trVE.AposIdiomelon2.incipit	Through the sin of long…
ltx/en_uk_ware/tr.d052:trVE.AposIdiomelon2.melody	@ltx/en_uk_ware/miscellanea:misc.Idiomelon
ltx/en_uk_ware/tr.d052:trVE.AposIdiomelon2.mode	@ltx/en_uk_ware/miscellanea:misc.Mode4
ltx/en_uk_ware/tr.d052:trVE.AposIdiomelon2.text	Through the sin of long ago, we have lost the joys of Paradise and are brought down to a life of shame. Stripped of holiness and virtue, sunk in sin, we have fallen among thieves; straying from Thy saving teachings, we have become half dead. Yet we entreat Thee, Master born of Mary, who with dispassion hast shared in our passions: bind up our wounds that come from sin, and pour upon us in Thy love Thy boundless mercy and Thy healing care.
ltx/en_uk_ware/tr.d052:trVE.AposMartyric.incipit	Thou hast accepted the patient…
ltx/en_uk_ware/tr.d052:trVE.AposMartyric.melody	
ltx/en_uk_ware/tr.d052:trVE.AposMartyric.mode	@ltx/en_uk_ware/miscellanea:misc.Mode4
ltx/en_uk_ware/tr.d052:trVE.AposMartyric.text	Thou hast accepted the patient suffering of the holy martyrs: in Thy love accept our hymns of praise, and at their intercessions grant us Thy great mercy.
ltx/en_uk_ware/tr.d052:trVE.AposTheotokion.incipit	O blessed Theotokos, protect thy…
ltx/en_uk_ware/tr.d052:trVE.AposTheotokion.melody	
ltx/en_uk_ware/tr.d052:trVE.AposTheotokion.mode	@ltx/en_uk_ware/miscellanea:misc.Mode4
ltx/en_uk_ware/tr.d052:trVE.AposTheotokion.text	O blessed Theotokos, protect thy servants from every kind of peril, that we may glorify thee, the hope of our souls.
ltx/en_uk_ware/tr.d052:trVE.Stichera01.greekmelody	@ltx/en_uk_ware/he.a.m3:heAU.StavrofanosMoysis.greekname
ltx/en_uk_ware/tr.d052:trVE.Stichera01.incipit	 O Word of God…
ltx/en_uk_ware/tr.d052:trVE.Stichera01.melody	@ltx/en_uk_ware/he.a.m3:heAU.StavrofanosMoysis.name
ltx/en_uk_ware/tr.d052:trVE.Stichera01.mode	@ltx/en_uk_ware/miscellanea:misc.Mode3
ltx/en_uk_ware/tr.d052:trVE.Stichera01.text	 O Word of God, Thou hast given us the time of the Fast, that we may turn again and live, and in no way perish. Grant that all of us may please Thee, O Christ, and serve Thee with fervent compunction, like the wise and holy harlot: for, because of the sweet-smelling ointment and the warm tears which she shed, she received forgiveness of her sins.
ltx/en_uk_ware/tr.d052:trVE.Stichera02.greekmelody	@ltx/en_uk_ware/he.a.m3:heAU.StavrofanosMoysis.greekname
ltx/en_uk_ware/tr.d052:trVE.Stichera02.incipit	Like the blind man, from…
ltx/en_uk_ware/tr.d052:trVE.Stichera02.melody	@ltx/en_uk_ware/he.a.m3:heAU.StavrofanosMoysis.name
ltx/en_uk_ware/tr.d052:trVE.Stichera02.mode	@ltx/en_uk_ware/miscellanea:misc.Mode3
ltx/en_uk_ware/tr.d052:trVE.Stichera02.text	Like the blind man, from my heart I call upon Thee: Son of God, give light to the eyes of my heart. Like the faithful woman of Canaan, I cry to Thee: Have mercy on me, compassionate Saviour, for my soul is vexed by the devil of pleasure. But do Thou free it from the darkness of tbe passions and make me live the remainder of my life in purity, that I may glorify Thy great love.
ltx/en_uk_ware/tr.d052:trVE.Stichera03.incipit	The grace of abstinence, radiant…
ltx/en_uk_ware/tr.d052:trVE.Stichera03.melody	
ltx/en_uk_ware/tr.d052:trVE.Stichera03.mode	@ltx/en_uk_ware/miscellanea:misc.Mode2
ltx/en_uk_ware/tr.d052:trVE.Stichera03.text	The grace of abstinence, radiant with the light of God, shines this day upon us more brightly than the sun; illumining our souls, it drives away the clouds of sinful passions. Embracing it with joy, let us all run with good courage, and finish its course rejoicing; and filled with gladness let us cry to Christ: Sanctify those who complete the Fast with faith, O loving Lord.
