{
 "Language": "kor",
 "Country": "kr",
 "Realm": "mok",
 "Description": " () translation of the Orthodox Christian liturgical texts, Michael Colburn, Republic of Korea",
 "Copyright": "Michael Colburn",
 "License": "Creative Commons Attribution-NonCommercial-ShareAlike  4.0 International (BY-NC-SA 4.0)",
 "Format": "doxa key = value text files with .dkv extension"
}