{
 "Language": "en",
 "Country": "us",
 "Realm": "commentary",
 "Description": "English translation of the Orthodox Christian liturgical texts, Michael Colburn, United States",
 "Copyright": "Michael Colburn",
 "License": "Creative Commons Attribution-NonCommercial-ShareAlike  4.0 International (BY-NC-SA 4.0)",
 "Format": "doxa key = value text files with .dkv extension"
}