{
 "Language": "gr",
 "Country": "gr",
 "Realm": "cog",
 "Description": "doxa media map files by Common Orthodox Liturgical Greek",
 "Copyright": "Common Orthodox Liturgical Greek",
 "License": "Creative Commons Attribution-NonCommercial-ShareAlike  4.0 International (BY-NC-SA 4.0)",
 "Format": "doxa key = value text files with .dkv extension"
}