{
 "Language": "en",
 "Country": "us",
 "Realm": "public",
 "Description": "doxa media map files by various copyright holders, used by permission",
 "Copyright": "various copyright holders, used by permission",
 "License": "Creative Commons Attribution-NonCommercial-ShareAlike  4.0 International (BY-NC-SA 4.0)",
 "Format": "doxa key = value text files with .dkv extension"
}