ltx/swh_redirects_oak/sy.m11.d22:alt1.syMA.commemoration01.couplet1.title	@ltx/swh_ke_oak/sy.m11.d22:alt1.syMA.commemoration01.couplet1.title
ltx/swh_redirects_oak/sy.m11.d22:alt1.syMA.commemoration01.couplet1.verse1	@ltx/swh_ke_oak/sy.m11.d22:alt1.syMA.commemoration01.couplet1.verse1
ltx/swh_redirects_oak/sy.m11.d22:alt1.syMA.commemoration01.couplet1.verse2	@ltx/swh_ke_oak/sy.m11.d22:alt1.syMA.commemoration01.couplet1.verse2
ltx/swh_redirects_oak/sy.m11.d22:alt1.syMA.commemoration01.narration.p01	@ltx/swh_ke_oak/sy.m11.d22:alt1.syMA.commemoration01.narration.p01
ltx/swh_redirects_oak/sy.m11.d22:alt1.syMA.commemoration01.single1	@ltx/swh_ke_oak/sy.m11.d22:alt1.syMA.commemoration01.single1
ltx/swh_redirects_oak/sy.m11.d22:alt1.syMA.commemoration01.text	@ltx/swh_ke_oak/sy.m11.d22:alt1.syMA.commemoration01.text
ltx/swh_redirects_oak/sy.m11.d22:syMA.commemoration01.couplet1.title	@ltx/swh_ke_oak/sy.m11.d22:syMA.commemoration01.couplet1.title
ltx/swh_redirects_oak/sy.m11.d22:syMA.commemoration01.couplet1.verse1	@ltx/swh_ke_oak/sy.m11.d22:syMA.commemoration01.couplet1.verse1
ltx/swh_redirects_oak/sy.m11.d22:syMA.commemoration01.couplet1.verse2	@ltx/swh_ke_oak/sy.m11.d22:syMA.commemoration01.couplet1.verse2
ltx/swh_redirects_oak/sy.m11.d22:syMA.commemoration01.narration.p01	@ltx/swh_ke_oak/sy.m11.d22:syMA.commemoration01.narration.p01
ltx/swh_redirects_oak/sy.m11.d22:syMA.commemoration01.single1	@ltx/swh_ke_oak/sy.m11.d22:syMA.commemoration01.single1
ltx/swh_redirects_oak/sy.m11.d22:syMA.commemoration01.text	@ltx/swh_ke_oak/sy.m11.d22:syMA.commemoration01.text
ltx/swh_redirects_oak/sy.m11.d22:syMA.commemoration01as02.text	@ltx/swh_ke_oak/sy.m11.d22:syMA.commemoration01as02.text
ltx/swh_redirects_oak/sy.m11.d22:syMA.commemoration02.couplet1.title	@ltx/swh_ke_oak/sy.m11.d22:syMA.commemoration02.couplet1.title
ltx/swh_redirects_oak/sy.m11.d22:syMA.commemoration02.couplet1.verse1	@ltx/swh_ke_oak/sy.m11.d22:syMA.commemoration02.couplet1.verse1
ltx/swh_redirects_oak/sy.m11.d22:syMA.commemoration02.couplet1.verse2	@ltx/swh_ke_oak/sy.m11.d22:syMA.commemoration02.couplet1.verse2
ltx/swh_redirects_oak/sy.m11.d22:syMA.commemoration02.couplet2.verse1	@ltx/swh_ke_oak/sy.m11.d22:syMA.commemoration02.couplet2.verse1
ltx/swh_redirects_oak/sy.m11.d22:syMA.commemoration02.couplet2.verse2	@ltx/swh_ke_oak/sy.m11.d22:syMA.commemoration02.couplet2.verse2
ltx/swh_redirects_oak/sy.m11.d22:syMA.commemoration02.narration.p01	@ltx/swh_ke_oak/sy.m11.d22:syMA.commemoration02.narration.p01
ltx/swh_redirects_oak/sy.m11.d22:syMA.commemoration02.text	@ltx/swh_ke_oak/sy.m11.d22:syMA.commemoration02.text
ltx/swh_redirects_oak/sy.m11.d22:syMA.commemoration03.couplet1.title	@ltx/swh_ke_oak/sy.m11.d22:syMA.commemoration03.couplet1.title
ltx/swh_redirects_oak/sy.m11.d22:syMA.commemoration03.couplet1.verse1	@ltx/swh_ke_oak/sy.m11.d22:syMA.commemoration03.couplet1.verse1
ltx/swh_redirects_oak/sy.m11.d22:syMA.commemoration03.couplet1.verse2	@ltx/swh_ke_oak/sy.m11.d22:syMA.commemoration03.couplet1.verse2
ltx/swh_redirects_oak/sy.m11.d22:syMA.commemoration03.narration.p01	@ltx/swh_ke_oak/sy.m11.d22:syMA.commemoration03.narration.p01
ltx/swh_redirects_oak/sy.m11.d22:syMA.commemoration03.text	@ltx/swh_ke_oak/sy.m11.d22:syMA.commemoration03.text
ltx/swh_redirects_oak/sy.m11.d22:syMA.commemoration04.couplet1.title	@ltx/swh_ke_oak/sy.m11.d22:syMA.commemoration04.couplet1.title
ltx/swh_redirects_oak/sy.m11.d22:syMA.commemoration04.couplet1.verse1	@ltx/swh_ke_oak/sy.m11.d22:syMA.commemoration04.couplet1.verse1
ltx/swh_redirects_oak/sy.m11.d22:syMA.commemoration04.couplet1.verse2	@ltx/swh_ke_oak/sy.m11.d22:syMA.commemoration04.couplet1.verse2
ltx/swh_redirects_oak/sy.m11.d22:syMA.commemoration04.text	@ltx/swh_ke_oak/sy.m11.d22:syMA.commemoration04.text
ltx/swh_redirects_oak/sy.m11.d22:syMA.commemoration05.couplet1.title	@ltx/swh_ke_oak/sy.m11.d22:syMA.commemoration05.couplet1.title
ltx/swh_redirects_oak/sy.m11.d22:syMA.commemoration05.couplet1.verse1	@ltx/swh_ke_oak/sy.m11.d22:syMA.commemoration05.couplet1.verse1
ltx/swh_redirects_oak/sy.m11.d22:syMA.commemoration05.couplet1.verse2	@ltx/swh_ke_oak/sy.m11.d22:syMA.commemoration05.couplet1.verse2
ltx/swh_redirects_oak/sy.m11.d22:syMA.commemoration05.narration.p01	@ltx/swh_ke_oak/sy.m11.d22:syMA.commemoration05.narration.p01
ltx/swh_redirects_oak/sy.m11.d22:syMA.commemoration05.text	@ltx/swh_ke_oak/sy.m11.d22:syMA.commemoration05.text
ltx/swh_redirects_oak/sy.m11.d22:syMA.commemoration06.couplet1.title	@ltx/swh_ke_oak/sy.m11.d22:syMA.commemoration06.couplet1.title
ltx/swh_redirects_oak/sy.m11.d22:syMA.commemoration06.couplet1.verse1	@ltx/swh_ke_oak/sy.m11.d22:syMA.commemoration06.couplet1.verse1
ltx/swh_redirects_oak/sy.m11.d22:syMA.commemoration06.couplet1.verse2	@ltx/swh_ke_oak/sy.m11.d22:syMA.commemoration06.couplet1.verse2
ltx/swh_redirects_oak/sy.m11.d22:syMA.commemoration06.narration.p01	@ltx/swh_ke_oak/sy.m11.d22:syMA.commemoration06.narration.p01
ltx/swh_redirects_oak/sy.m11.d22:syMA.commemoration06.text	@ltx/swh_ke_oak/sy.m11.d22:syMA.commemoration06.text
ltx/swh_redirects_oak/sy.m11.d22:syMA.commemoration07.couplet1.title	@ltx/swh_ke_oak/sy.m11.d22:syMA.commemoration07.couplet1.title
ltx/swh_redirects_oak/sy.m11.d22:syMA.commemoration07.couplet1.verse1	@ltx/swh_ke_oak/sy.m11.d22:syMA.commemoration07.couplet1.verse1
ltx/swh_redirects_oak/sy.m11.d22:syMA.commemoration07.couplet1.verse2	@ltx/swh_ke_oak/sy.m11.d22:syMA.commemoration07.couplet1.verse2
ltx/swh_redirects_oak/sy.m11.d22:syMA.commemoration07.text	@ltx/swh_ke_oak/sy.m11.d22:syMA.commemoration07.text
ltx/swh_redirects_oak/sy.m11.d22:syMA.commemoration08.couplet1.title	@ltx/swh_ke_oak/sy.m11.d22:syMA.commemoration08.couplet1.title
ltx/swh_redirects_oak/sy.m11.d22:syMA.commemoration08.couplet1.verse1	@ltx/swh_ke_oak/sy.m11.d22:syMA.commemoration08.couplet1.verse1
ltx/swh_redirects_oak/sy.m11.d22:syMA.commemoration08.couplet1.verse2	@ltx/swh_ke_oak/sy.m11.d22:syMA.commemoration08.couplet1.verse2
ltx/swh_redirects_oak/sy.m11.d22:syMA.commemoration08.text	@ltx/swh_ke_oak/sy.m11.d22:syMA.commemoration08.text
ltx/swh_redirects_oak/sy.m11.d22:syMA.commemoration09.couplet1.title	@ltx/swh_ke_oak/sy.m11.d22:syMA.commemoration09.couplet1.title
ltx/swh_redirects_oak/sy.m11.d22:syMA.commemoration09.couplet1.verse1	@ltx/swh_ke_oak/sy.m11.d22:syMA.commemoration09.couplet1.verse1
ltx/swh_redirects_oak/sy.m11.d22:syMA.commemoration09.couplet1.verse2	@ltx/swh_ke_oak/sy.m11.d22:syMA.commemoration09.couplet1.verse2
ltx/swh_redirects_oak/sy.m11.d22:syMA.commemoration09.text	@ltx/swh_ke_oak/sy.m11.d22:syMA.commemoration09.text
ltx/swh_redirects_oak/sy.m11.d22:syMA.commemoration10.couplet1.title	@ltx/swh_ke_oak/sy.m11.d22:syMA.commemoration10.couplet1.title
ltx/swh_redirects_oak/sy.m11.d22:syMA.commemoration10.couplet1.verse1	@ltx/swh_ke_oak/sy.m11.d22:syMA.commemoration10.couplet1.verse1
ltx/swh_redirects_oak/sy.m11.d22:syMA.commemoration10.couplet1.verse2	@ltx/swh_ke_oak/sy.m11.d22:syMA.commemoration10.couplet1.verse2
ltx/swh_redirects_oak/sy.m11.d22:syMA.commemoration10.text	@ltx/swh_ke_oak/sy.m11.d22:syMA.commemoration10.text
ltx/swh_redirects_oak/sy.m11.d22:syMA.commemoration11.couplet1.title	@ltx/swh_ke_oak/sy.m11.d22:syMA.commemoration11.couplet1.title
ltx/swh_redirects_oak/sy.m11.d22:syMA.commemoration11.couplet1.verse1	@ltx/swh_ke_oak/sy.m11.d22:syMA.commemoration11.couplet1.verse1
ltx/swh_redirects_oak/sy.m11.d22:syMA.commemoration11.couplet1.verse2	@ltx/swh_ke_oak/sy.m11.d22:syMA.commemoration11.couplet1.verse2
ltx/swh_redirects_oak/sy.m11.d22:syMA.commemoration11.couplet2.verse1	@ltx/swh_ke_oak/sy.m11.d22:syMA.commemoration11.couplet2.verse1
ltx/swh_redirects_oak/sy.m11.d22:syMA.commemoration11.couplet2.verse2	@ltx/swh_ke_oak/sy.m11.d22:syMA.commemoration11.couplet2.verse2
ltx/swh_redirects_oak/sy.m11.d22:syMA.commemoration11.couplet3.verse1	@ltx/swh_ke_oak/sy.m11.d22:syMA.commemoration11.couplet3.verse1
ltx/swh_redirects_oak/sy.m11.d22:syMA.commemoration11.couplet3.verse2	@ltx/swh_ke_oak/sy.m11.d22:syMA.commemoration11.couplet3.verse2
ltx/swh_redirects_oak/sy.m11.d22:syMA.commemoration11.text	@ltx/swh_ke_oak/sy.m11.d22:syMA.commemoration11.text
ltx/swh_redirects_oak/sy.m11.d22:syMA.commemoration12.couplet1.title	@ltx/swh_ke_oak/sy.m11.d22:syMA.commemoration12.couplet1.title
ltx/swh_redirects_oak/sy.m11.d22:syMA.commemoration12.couplet1.verse1	@ltx/swh_ke_oak/sy.m11.d22:syMA.commemoration12.couplet1.verse1
ltx/swh_redirects_oak/sy.m11.d22:syMA.commemoration12.couplet1.verse2	@ltx/swh_ke_oak/sy.m11.d22:syMA.commemoration12.couplet1.verse2
ltx/swh_redirects_oak/sy.m11.d22:syMA.commemoration12.narration.p01	@ltx/swh_ke_oak/sy.m11.d22:syMA.commemoration12.narration.p01
ltx/swh_redirects_oak/sy.m11.d22:syMA.commemoration12.single1	@ltx/swh_ke_oak/sy.m11.d22:syMA.commemoration12.single1
ltx/swh_redirects_oak/sy.m11.d22:syMA.commemoration12.text	@ltx/swh_ke_oak/sy.m11.d22:syMA.commemoration12.text
ltx/swh_redirects_oak/sy.m11.d22:syMA.lastline	@ltx/swh_ke_oak/sy.m11.d22:syMA.lastline
