ltx/swh_redirects_oak/pe.d127:peDA.commemoration.full	@ltx/swh_ke_oak/pe.d127:peDA.commemoration.full
ltx/swh_redirects_oak/pe.d127:peDA.commemoration.name	@ltx/swh_ke_oak/pe.d127:peDA.commemoration.name
ltx/swh_redirects_oak/pe.d127:peDA.commemoration.short	@ltx/swh_ke_oak/pe.d127:peDA.commemoration.short
ltx/swh_redirects_oak/pe.d127:peDA.dismissal	@ltx/swh_ke_oak/pe.d127:peDA.dismissal
ltx/swh_redirects_oak/pe.d127:peDA.insert1	@ltx/swh_ke_oak/pe.d127:peDA.insert1
ltx/swh_redirects_oak/pe.d127:peDA.insert2	@ltx/swh_ke_oak/pe.d127:peDA.insert2
ltx/swh_redirects_oak/pe.d127:peDA.note	@ltx/swh_ke_oak/pe.d127:peDA.note
ltx/swh_redirects_oak/pe.d127:peHO.commemorations	@ltx/swh_ke_oak/pe.d127:peHO.commemorations
ltx/swh_redirects_oak/pe.d127:peHO.daytitle	@ltx/swh_ke_oak/pe.d127:peHO.daytitle
ltx/swh_redirects_oak/pe.d127:peHO.description1	@ltx/swh_ke_oak/pe.d127:peHO.description1
ltx/swh_redirects_oak/pe.d127:peHO.description2	@ltx/swh_ke_oak/pe.d127:peHO.description2
ltx/swh_redirects_oak/pe.d127:peHO.note1	@ltx/swh_ke_oak/pe.d127:peHO.note1
ltx/swh_redirects_oak/pe.d127:peHO.note2	@ltx/swh_ke_oak/pe.d127:peHO.note2
ltx/swh_redirects_oak/pe.d127:peLI.Kontakion1.greekmelody	@ltx/swh_ke_oak/pe.d127:peLI.Kontakion1.greekmelody
ltx/swh_redirects_oak/pe.d127:peLI.Kontakion1.incipit	@ltx/swh_ke_oak/pe.d127:peLI.Kontakion1.incipit
ltx/swh_redirects_oak/pe.d127:peLI.Kontakion1.melody	@ltx/swh_ke_oak/pe.d127:peLI.Kontakion1.melody
ltx/swh_redirects_oak/pe.d127:peLI.Kontakion1.mode	@ltx/swh_ke_oak/pe.d127:peLI.Kontakion1.mode
ltx/swh_redirects_oak/pe.d127:peLI.Kontakion1.text	@ltx/swh_ke_oak/pe.d127:peLI.Kontakion1.text
ltx/swh_redirects_oak/pe.d127:peLI.MM.CommunionHymn.text	@ltx/swh_ke_oak/properties:media.key
ltx/swh_redirects_oak/pe.d127:peLI.Megalynarion.text	@ltx/swh_ke_oak/pe.d127:peLI.Megalynarion.text
ltx/swh_redirects_oak/pe.d127:peLI.Megalynarion2.text	@ltx/swh_ke_oak/pe.d127:peLI.Megalynarion2.text
ltx/swh_redirects_oak/pe.d127:peMA.C1.acrostic.notice1	@ltx/swh_ke_oak/pe.d127:peMA.C1.acrostic.notice1
ltx/swh_redirects_oak/pe.d127:peMA.C1.acrostic.notice2	@ltx/swh_ke_oak/pe.d127:peMA.C1.acrostic.notice2
ltx/swh_redirects_oak/pe.d127:peMA.C1.acrostic.text	@ltx/swh_ke_oak/pe.d127:peMA.C1.acrostic.text
ltx/swh_redirects_oak/pe.d127:peMA.C1.acrostic.title	@ltx/swh_ke_oak/pe.d127:peMA.C1.acrostic.title
ltx/swh_redirects_oak/pe.d127:peMA.C1.poet	@ltx/swh_ke_oak/pe.d127:peMA.C1.poet
ltx/swh_redirects_oak/pe.d127:peMA.C1.title	@ltx/swh_ke_oak/pe.d127:peMA.C1.title
ltx/swh_redirects_oak/pe.d127:peMA.C1.verse	@ltx/swh_ke_oak/pe.d127:peMA.C1.verse
ltx/swh_redirects_oak/pe.d127:peMA.ExapTheotokion.incipit	@ltx/swh_ke_oak/pe.d127:peMA.ExapTheotokion.incipit
ltx/swh_redirects_oak/pe.d127:peMA.ExapTheotokion.melody	@ltx/swh_ke_oak/pe.d127:peMA.ExapTheotokion.melody
ltx/swh_redirects_oak/pe.d127:peMA.ExapTheotokion.mode	@ltx/swh_ke_oak/pe.d127:peMA.ExapTheotokion.mode
ltx/swh_redirects_oak/pe.d127:peMA.ExapTheotokion.text	@ltx/swh_ke_oak/pe.d127:peMA.ExapTheotokion.text
ltx/swh_redirects_oak/pe.d127:peMA.Exaposteilarion1.incipit	@ltx/swh_ke_oak/pe.d127:peMA.Exaposteilarion1.incipit
ltx/swh_redirects_oak/pe.d127:peMA.Exaposteilarion1.melody	@ltx/swh_ke_oak/pe.d127:peMA.Exaposteilarion1.melody
ltx/swh_redirects_oak/pe.d127:peMA.Exaposteilarion1.mode	@ltx/swh_ke_oak/pe.d127:peMA.Exaposteilarion1.mode
ltx/swh_redirects_oak/pe.d127:peMA.Exaposteilarion1.text	@ltx/swh_ke_oak/pe.d127:peMA.Exaposteilarion1.text
ltx/swh_redirects_oak/pe.d127:peMA.Kathisma11.greekmelody	@ltx/swh_ke_oak/pe.d127:peMA.Kathisma11.greekmelody
ltx/swh_redirects_oak/pe.d127:peMA.Kathisma11.incipit	@ltx/swh_ke_oak/pe.d127:peMA.Kathisma11.incipit
ltx/swh_redirects_oak/pe.d127:peMA.Kathisma11.melody	@ltx/swh_ke_oak/pe.d127:peMA.Kathisma11.melody
ltx/swh_redirects_oak/pe.d127:peMA.Kathisma11.mode	@ltx/swh_ke_oak/pe.d127:peMA.Kathisma11.mode
ltx/swh_redirects_oak/pe.d127:peMA.Kathisma11.text	@ltx/swh_ke_oak/pe.d127:peMA.Kathisma11.text
ltx/swh_redirects_oak/pe.d127:peMA.Kathisma12.incipit	@ltx/swh_ke_oak/pe.d127:peMA.Kathisma12.incipit
ltx/swh_redirects_oak/pe.d127:peMA.Kathisma12.melody	@ltx/swh_ke_oak/pe.d127:peMA.Kathisma12.melody
ltx/swh_redirects_oak/pe.d127:peMA.Kathisma12.mode	@ltx/swh_ke_oak/pe.d127:peMA.Kathisma12.mode
ltx/swh_redirects_oak/pe.d127:peMA.Kathisma12.text	@ltx/swh_ke_oak/pe.d127:peMA.Kathisma12.text
ltx/swh_redirects_oak/pe.d127:peMA.Kathisma13.incipit	@ltx/swh_ke_oak/pe.d127:peMA.Kathisma13.incipit
ltx/swh_redirects_oak/pe.d127:peMA.Kathisma13.melody	@ltx/swh_ke_oak/pe.d127:peMA.Kathisma13.melody
ltx/swh_redirects_oak/pe.d127:peMA.Kathisma13.mode	@ltx/swh_ke_oak/pe.d127:peMA.Kathisma13.mode
ltx/swh_redirects_oak/pe.d127:peMA.Kathisma13.text	@ltx/swh_ke_oak/pe.d127:peMA.Kathisma13.text
ltx/swh_redirects_oak/pe.d127:peMA.Kathisma21.greekmelody	@ltx/swh_ke_oak/pe.d127:peMA.Kathisma21.greekmelody
ltx/swh_redirects_oak/pe.d127:peMA.Kathisma21.incipit	@ltx/swh_ke_oak/pe.d127:peMA.Kathisma21.incipit
ltx/swh_redirects_oak/pe.d127:peMA.Kathisma21.melody	@ltx/swh_ke_oak/pe.d127:peMA.Kathisma21.melody
ltx/swh_redirects_oak/pe.d127:peMA.Kathisma21.mode	@ltx/swh_ke_oak/pe.d127:peMA.Kathisma21.mode
ltx/swh_redirects_oak/pe.d127:peMA.Kathisma21.text	@ltx/swh_ke_oak/pe.d127:peMA.Kathisma21.text
ltx/swh_redirects_oak/pe.d127:peMA.Kathisma22.greekmelody	@ltx/swh_ke_oak/pe.d127:peMA.Kathisma22.greekmelody
ltx/swh_redirects_oak/pe.d127:peMA.Kathisma22.incipit	@ltx/swh_ke_oak/pe.d127:peMA.Kathisma22.incipit
ltx/swh_redirects_oak/pe.d127:peMA.Kathisma22.melody	@ltx/swh_ke_oak/pe.d127:peMA.Kathisma22.melody
ltx/swh_redirects_oak/pe.d127:peMA.Kathisma22.mode	@ltx/swh_ke_oak/pe.d127:peMA.Kathisma22.mode
ltx/swh_redirects_oak/pe.d127:peMA.Kathisma22.text	@ltx/swh_ke_oak/pe.d127:peMA.Kathisma22.text
ltx/swh_redirects_oak/pe.d127:peMA.Kathisma23.incipit	@ltx/swh_ke_oak/pe.d127:peMA.Kathisma23.incipit
ltx/swh_redirects_oak/pe.d127:peMA.Kathisma23.melody	@ltx/swh_ke_oak/pe.d127:peMA.Kathisma23.melody
ltx/swh_redirects_oak/pe.d127:peMA.Kathisma23.mode	@ltx/swh_ke_oak/pe.d127:peMA.Kathisma23.mode
ltx/swh_redirects_oak/pe.d127:peMA.Kathisma23.text	@ltx/swh_ke_oak/pe.d127:peMA.Kathisma23.text
ltx/swh_redirects_oak/pe.d127:peMA.Kontakion1.greekmelody	@ltx/swh_ke_oak/pe.d127:peMA.Kontakion1.greekmelody
ltx/swh_redirects_oak/pe.d127:peMA.Kontakion1.incipit	@ltx/swh_ke_oak/pe.d127:peMA.Kontakion1.incipit
ltx/swh_redirects_oak/pe.d127:peMA.Kontakion1.melody	@ltx/swh_ke_oak/pe.d127:peMA.Kontakion1.melody
ltx/swh_redirects_oak/pe.d127:peMA.Kontakion1.mode	@ltx/swh_ke_oak/pe.d127:peMA.Kontakion1.mode
ltx/swh_redirects_oak/pe.d127:peMA.Kontakion1.text	@ltx/swh_ke_oak/pe.d127:peMA.Kontakion1.text
ltx/swh_redirects_oak/pe.d127:peMA.Lauds345	@ltx/swh_ke_oak/pe.d127:peMA.Lauds345
ltx/swh_redirects_oak/pe.d127:peMA.Lauds6.incipit	@ltx/swh_ke_oak/pe.d127:peMA.Lauds6.incipit
ltx/swh_redirects_oak/pe.d127:peMA.Lauds6.melody	@ltx/swh_ke_oak/pe.d127:peMA.Lauds6.melody
ltx/swh_redirects_oak/pe.d127:peMA.Lauds6.mode	@ltx/swh_ke_oak/pe.d127:peMA.Lauds6.mode
ltx/swh_redirects_oak/pe.d127:peMA.Lauds6.text	@ltx/swh_ke_oak/pe.d127:peMA.Lauds6.text
ltx/swh_redirects_oak/pe.d127:peMA.Lauds7.incipit	@ltx/swh_ke_oak/pe.d127:peMA.Lauds7.incipit
ltx/swh_redirects_oak/pe.d127:peMA.Lauds7.melody	@ltx/swh_ke_oak/pe.d127:peMA.Lauds7.melody
ltx/swh_redirects_oak/pe.d127:peMA.Lauds7.mode	@ltx/swh_ke_oak/pe.d127:peMA.Lauds7.mode
ltx/swh_redirects_oak/pe.d127:peMA.Lauds7.text	@ltx/swh_ke_oak/pe.d127:peMA.Lauds7.text
ltx/swh_redirects_oak/pe.d127:peMA.Lauds8.incipit	@ltx/swh_ke_oak/pe.d127:peMA.Lauds8.incipit
ltx/swh_redirects_oak/pe.d127:peMA.Lauds8.melody	@ltx/swh_ke_oak/pe.d127:peMA.Lauds8.melody
ltx/swh_redirects_oak/pe.d127:peMA.Lauds8.mode	@ltx/swh_ke_oak/pe.d127:peMA.Lauds8.mode
ltx/swh_redirects_oak/pe.d127:peMA.Lauds8.text	@ltx/swh_ke_oak/pe.d127:peMA.Lauds8.text
ltx/swh_redirects_oak/pe.d127:peMA.Ode1C11.greekmelody	@ltx/swh_ke_oak/pe.d127:peMA.Ode1C11.greekmelody
ltx/swh_redirects_oak/pe.d127:peMA.Ode1C11.incipit	@ltx/swh_ke_oak/pe.d127:peMA.Ode1C11.incipit
ltx/swh_redirects_oak/pe.d127:peMA.Ode1C11.melody	@ltx/swh_ke_oak/pe.d127:peMA.Ode1C11.melody
ltx/swh_redirects_oak/pe.d127:peMA.Ode1C11.mode	@ltx/swh_ke_oak/pe.d127:peMA.Ode1C11.mode
ltx/swh_redirects_oak/pe.d127:peMA.Ode1C11.ode	@ltx/swh_ke_oak/pe.d127:peMA.Ode1C11.ode
ltx/swh_redirects_oak/pe.d127:peMA.Ode1C11.text	@ltx/swh_ke_oak/pe.d127:peMA.Ode1C11.text
ltx/swh_redirects_oak/pe.d127:peMA.Ode1C12.incipit	@ltx/swh_ke_oak/pe.d127:peMA.Ode1C12.incipit
ltx/swh_redirects_oak/pe.d127:peMA.Ode1C12.melody	@ltx/swh_ke_oak/pe.d127:peMA.Ode1C12.melody
ltx/swh_redirects_oak/pe.d127:peMA.Ode1C12.mode	@ltx/swh_ke_oak/pe.d127:peMA.Ode1C12.mode
ltx/swh_redirects_oak/pe.d127:peMA.Ode1C12.ode	@ltx/swh_ke_oak/pe.d127:peMA.Ode1C12.ode
ltx/swh_redirects_oak/pe.d127:peMA.Ode1C12.text	@ltx/swh_ke_oak/pe.d127:peMA.Ode1C12.text
ltx/swh_redirects_oak/pe.d127:peMA.Ode1C13.incipit	@ltx/swh_ke_oak/pe.d127:peMA.Ode1C13.incipit
ltx/swh_redirects_oak/pe.d127:peMA.Ode1C13.melody	@ltx/swh_ke_oak/pe.d127:peMA.Ode1C13.melody
ltx/swh_redirects_oak/pe.d127:peMA.Ode1C13.mode	@ltx/swh_ke_oak/pe.d127:peMA.Ode1C13.mode
ltx/swh_redirects_oak/pe.d127:peMA.Ode1C13.ode	@ltx/swh_ke_oak/pe.d127:peMA.Ode1C13.ode
ltx/swh_redirects_oak/pe.d127:peMA.Ode1C13.text	@ltx/swh_ke_oak/pe.d127:peMA.Ode1C13.text
ltx/swh_redirects_oak/pe.d127:peMA.Ode1C14.incipit	@ltx/swh_ke_oak/pe.d127:peMA.Ode1C14.incipit
ltx/swh_redirects_oak/pe.d127:peMA.Ode1C14.melody	@ltx/swh_ke_oak/pe.d127:peMA.Ode1C14.melody
ltx/swh_redirects_oak/pe.d127:peMA.Ode1C14.mode	@ltx/swh_ke_oak/pe.d127:peMA.Ode1C14.mode
ltx/swh_redirects_oak/pe.d127:peMA.Ode1C14.ode	@ltx/swh_ke_oak/pe.d127:peMA.Ode1C14.ode
ltx/swh_redirects_oak/pe.d127:peMA.Ode1C14.text	@ltx/swh_ke_oak/pe.d127:peMA.Ode1C14.text
ltx/swh_redirects_oak/pe.d127:peMA.Ode1C1T.incipit	@ltx/swh_ke_oak/pe.d127:peMA.Ode1C1T.incipit
ltx/swh_redirects_oak/pe.d127:peMA.Ode1C1T.melody	@ltx/swh_ke_oak/pe.d127:peMA.Ode1C1T.melody
ltx/swh_redirects_oak/pe.d127:peMA.Ode1C1T.mode	@ltx/swh_ke_oak/pe.d127:peMA.Ode1C1T.mode
ltx/swh_redirects_oak/pe.d127:peMA.Ode1C1T.ode	@ltx/swh_ke_oak/pe.d127:peMA.Ode1C1T.ode
ltx/swh_redirects_oak/pe.d127:peMA.Ode1C1T.text	@ltx/swh_ke_oak/pe.d127:peMA.Ode1C1T.text
ltx/swh_redirects_oak/pe.d127:peMA.Ode3C11.greekmelody	@ltx/swh_ke_oak/pe.d127:peMA.Ode3C11.greekmelody
ltx/swh_redirects_oak/pe.d127:peMA.Ode3C11.incipit	@ltx/swh_ke_oak/pe.d127:peMA.Ode3C11.incipit
ltx/swh_redirects_oak/pe.d127:peMA.Ode3C11.melody	@ltx/swh_ke_oak/pe.d127:peMA.Ode3C11.melody
ltx/swh_redirects_oak/pe.d127:peMA.Ode3C11.mode	@ltx/swh_ke_oak/pe.d127:peMA.Ode3C11.mode
ltx/swh_redirects_oak/pe.d127:peMA.Ode3C11.ode	@ltx/swh_ke_oak/pe.d127:peMA.Ode3C11.ode
ltx/swh_redirects_oak/pe.d127:peMA.Ode3C11.text	@ltx/swh_ke_oak/pe.d127:peMA.Ode3C11.text
ltx/swh_redirects_oak/pe.d127:peMA.Ode3C12.incipit	@ltx/swh_ke_oak/pe.d127:peMA.Ode3C12.incipit
ltx/swh_redirects_oak/pe.d127:peMA.Ode3C12.melody	@ltx/swh_ke_oak/pe.d127:peMA.Ode3C12.melody
ltx/swh_redirects_oak/pe.d127:peMA.Ode3C12.mode	@ltx/swh_ke_oak/pe.d127:peMA.Ode3C12.mode
ltx/swh_redirects_oak/pe.d127:peMA.Ode3C12.ode	@ltx/swh_ke_oak/pe.d127:peMA.Ode3C12.ode
ltx/swh_redirects_oak/pe.d127:peMA.Ode3C12.text	@ltx/swh_ke_oak/pe.d127:peMA.Ode3C12.text
ltx/swh_redirects_oak/pe.d127:peMA.Ode3C13.incipit	@ltx/swh_ke_oak/pe.d127:peMA.Ode3C13.incipit
ltx/swh_redirects_oak/pe.d127:peMA.Ode3C13.melody	@ltx/swh_ke_oak/pe.d127:peMA.Ode3C13.melody
ltx/swh_redirects_oak/pe.d127:peMA.Ode3C13.mode	@ltx/swh_ke_oak/pe.d127:peMA.Ode3C13.mode
ltx/swh_redirects_oak/pe.d127:peMA.Ode3C13.ode	@ltx/swh_ke_oak/pe.d127:peMA.Ode3C13.ode
ltx/swh_redirects_oak/pe.d127:peMA.Ode3C13.text	@ltx/swh_ke_oak/pe.d127:peMA.Ode3C13.text
ltx/swh_redirects_oak/pe.d127:peMA.Ode3C1T.incipit	@ltx/swh_ke_oak/pe.d127:peMA.Ode3C1T.incipit
ltx/swh_redirects_oak/pe.d127:peMA.Ode3C1T.melody	@ltx/swh_ke_oak/pe.d127:peMA.Ode3C1T.melody
ltx/swh_redirects_oak/pe.d127:peMA.Ode3C1T.mode	@ltx/swh_ke_oak/pe.d127:peMA.Ode3C1T.mode
ltx/swh_redirects_oak/pe.d127:peMA.Ode3C1T.ode	@ltx/swh_ke_oak/pe.d127:peMA.Ode3C1T.ode
ltx/swh_redirects_oak/pe.d127:peMA.Ode3C1T.text	@ltx/swh_ke_oak/pe.d127:peMA.Ode3C1T.text
ltx/swh_redirects_oak/pe.d127:peMA.Ode3Kathisma1.greekmelody	@ltx/swh_ke_oak/pe.d127:peMA.Ode3Kathisma1.greekmelody
ltx/swh_redirects_oak/pe.d127:peMA.Ode3Kathisma1.incipit	@ltx/swh_ke_oak/pe.d127:peMA.Ode3Kathisma1.incipit
ltx/swh_redirects_oak/pe.d127:peMA.Ode3Kathisma1.melody	@ltx/swh_ke_oak/pe.d127:peMA.Ode3Kathisma1.melody
ltx/swh_redirects_oak/pe.d127:peMA.Ode3Kathisma1.mode	@ltx/swh_ke_oak/pe.d127:peMA.Ode3Kathisma1.mode
ltx/swh_redirects_oak/pe.d127:peMA.Ode3Kathisma1.text	@ltx/swh_ke_oak/pe.d127:peMA.Ode3Kathisma1.text
ltx/swh_redirects_oak/pe.d127:peMA.Ode3Kathisma2.greekmelody	@ltx/swh_ke_oak/pe.d127:peMA.Ode3Kathisma2.greekmelody
ltx/swh_redirects_oak/pe.d127:peMA.Ode3Kathisma2.incipit	@ltx/swh_ke_oak/pe.d127:peMA.Ode3Kathisma2.incipit
ltx/swh_redirects_oak/pe.d127:peMA.Ode3Kathisma2.melody	@ltx/swh_ke_oak/pe.d127:peMA.Ode3Kathisma2.melody
ltx/swh_redirects_oak/pe.d127:peMA.Ode3Kathisma2.mode	@ltx/swh_ke_oak/pe.d127:peMA.Ode3Kathisma2.mode
ltx/swh_redirects_oak/pe.d127:peMA.Ode3Kathisma2.text	@ltx/swh_ke_oak/pe.d127:peMA.Ode3Kathisma2.text
ltx/swh_redirects_oak/pe.d127:peMA.Ode4C11.greekmelody	@ltx/swh_ke_oak/pe.d127:peMA.Ode4C11.greekmelody
ltx/swh_redirects_oak/pe.d127:peMA.Ode4C11.incipit	@ltx/swh_ke_oak/pe.d127:peMA.Ode4C11.incipit
ltx/swh_redirects_oak/pe.d127:peMA.Ode4C11.melody	@ltx/swh_ke_oak/pe.d127:peMA.Ode4C11.melody
ltx/swh_redirects_oak/pe.d127:peMA.Ode4C11.mode	@ltx/swh_ke_oak/pe.d127:peMA.Ode4C11.mode
ltx/swh_redirects_oak/pe.d127:peMA.Ode4C11.ode	@ltx/swh_ke_oak/pe.d127:peMA.Ode4C11.ode
ltx/swh_redirects_oak/pe.d127:peMA.Ode4C11.text	@ltx/swh_ke_oak/pe.d127:peMA.Ode4C11.text
ltx/swh_redirects_oak/pe.d127:peMA.Ode4C12.incipit	@ltx/swh_ke_oak/pe.d127:peMA.Ode4C12.incipit
ltx/swh_redirects_oak/pe.d127:peMA.Ode4C12.melody	@ltx/swh_ke_oak/pe.d127:peMA.Ode4C12.melody
ltx/swh_redirects_oak/pe.d127:peMA.Ode4C12.mode	@ltx/swh_ke_oak/pe.d127:peMA.Ode4C12.mode
ltx/swh_redirects_oak/pe.d127:peMA.Ode4C12.ode	@ltx/swh_ke_oak/pe.d127:peMA.Ode4C12.ode
ltx/swh_redirects_oak/pe.d127:peMA.Ode4C12.text	@ltx/swh_ke_oak/pe.d127:peMA.Ode4C12.text
ltx/swh_redirects_oak/pe.d127:peMA.Ode4C13.incipit	@ltx/swh_ke_oak/pe.d127:peMA.Ode4C13.incipit
ltx/swh_redirects_oak/pe.d127:peMA.Ode4C13.melody	@ltx/swh_ke_oak/pe.d127:peMA.Ode4C13.melody
ltx/swh_redirects_oak/pe.d127:peMA.Ode4C13.mode	@ltx/swh_ke_oak/pe.d127:peMA.Ode4C13.mode
ltx/swh_redirects_oak/pe.d127:peMA.Ode4C13.ode	@ltx/swh_ke_oak/pe.d127:peMA.Ode4C13.ode
ltx/swh_redirects_oak/pe.d127:peMA.Ode4C13.text	@ltx/swh_ke_oak/pe.d127:peMA.Ode4C13.text
ltx/swh_redirects_oak/pe.d127:peMA.Ode4C14.incipit	@ltx/swh_ke_oak/pe.d127:peMA.Ode4C14.incipit
ltx/swh_redirects_oak/pe.d127:peMA.Ode4C14.melody	@ltx/swh_ke_oak/pe.d127:peMA.Ode4C14.melody
ltx/swh_redirects_oak/pe.d127:peMA.Ode4C14.mode	@ltx/swh_ke_oak/pe.d127:peMA.Ode4C14.mode
ltx/swh_redirects_oak/pe.d127:peMA.Ode4C14.ode	@ltx/swh_ke_oak/pe.d127:peMA.Ode4C14.ode
ltx/swh_redirects_oak/pe.d127:peMA.Ode4C14.text	@ltx/swh_ke_oak/pe.d127:peMA.Ode4C14.text
ltx/swh_redirects_oak/pe.d127:peMA.Ode4C1T.incipit	@ltx/swh_ke_oak/pe.d127:peMA.Ode4C1T.incipit
ltx/swh_redirects_oak/pe.d127:peMA.Ode4C1T.melody	@ltx/swh_ke_oak/pe.d127:peMA.Ode4C1T.melody
ltx/swh_redirects_oak/pe.d127:peMA.Ode4C1T.mode	@ltx/swh_ke_oak/pe.d127:peMA.Ode4C1T.mode
ltx/swh_redirects_oak/pe.d127:peMA.Ode4C1T.ode	@ltx/swh_ke_oak/pe.d127:peMA.Ode4C1T.ode
ltx/swh_redirects_oak/pe.d127:peMA.Ode4C1T.text	@ltx/swh_ke_oak/pe.d127:peMA.Ode4C1T.text
ltx/swh_redirects_oak/pe.d127:peMA.Ode5C11.greekmelody	@ltx/swh_ke_oak/pe.d127:peMA.Ode5C11.greekmelody
ltx/swh_redirects_oak/pe.d127:peMA.Ode5C11.incipit	@ltx/swh_ke_oak/pe.d127:peMA.Ode5C11.incipit
ltx/swh_redirects_oak/pe.d127:peMA.Ode5C11.melody	@ltx/swh_ke_oak/pe.d127:peMA.Ode5C11.melody
ltx/swh_redirects_oak/pe.d127:peMA.Ode5C11.mode	@ltx/swh_ke_oak/pe.d127:peMA.Ode5C11.mode
ltx/swh_redirects_oak/pe.d127:peMA.Ode5C11.ode	@ltx/swh_ke_oak/pe.d127:peMA.Ode5C11.ode
ltx/swh_redirects_oak/pe.d127:peMA.Ode5C11.text	@ltx/swh_ke_oak/pe.d127:peMA.Ode5C11.text
ltx/swh_redirects_oak/pe.d127:peMA.Ode5C12.incipit	@ltx/swh_ke_oak/pe.d127:peMA.Ode5C12.incipit
ltx/swh_redirects_oak/pe.d127:peMA.Ode5C12.melody	@ltx/swh_ke_oak/pe.d127:peMA.Ode5C12.melody
ltx/swh_redirects_oak/pe.d127:peMA.Ode5C12.mode	@ltx/swh_ke_oak/pe.d127:peMA.Ode5C12.mode
ltx/swh_redirects_oak/pe.d127:peMA.Ode5C12.ode	@ltx/swh_ke_oak/pe.d127:peMA.Ode5C12.ode
ltx/swh_redirects_oak/pe.d127:peMA.Ode5C12.text	@ltx/swh_ke_oak/pe.d127:peMA.Ode5C12.text
ltx/swh_redirects_oak/pe.d127:peMA.Ode5C13.incipit	@ltx/swh_ke_oak/pe.d127:peMA.Ode5C13.incipit
ltx/swh_redirects_oak/pe.d127:peMA.Ode5C13.melody	@ltx/swh_ke_oak/pe.d127:peMA.Ode5C13.melody
ltx/swh_redirects_oak/pe.d127:peMA.Ode5C13.mode	@ltx/swh_ke_oak/pe.d127:peMA.Ode5C13.mode
ltx/swh_redirects_oak/pe.d127:peMA.Ode5C13.ode	@ltx/swh_ke_oak/pe.d127:peMA.Ode5C13.ode
ltx/swh_redirects_oak/pe.d127:peMA.Ode5C13.text	@ltx/swh_ke_oak/pe.d127:peMA.Ode5C13.text
ltx/swh_redirects_oak/pe.d127:peMA.Ode5C1T.incipit	@ltx/swh_ke_oak/pe.d127:peMA.Ode5C1T.incipit
ltx/swh_redirects_oak/pe.d127:peMA.Ode5C1T.melody	@ltx/swh_ke_oak/pe.d127:peMA.Ode5C1T.melody
ltx/swh_redirects_oak/pe.d127:peMA.Ode5C1T.mode	@ltx/swh_ke_oak/pe.d127:peMA.Ode5C1T.mode
ltx/swh_redirects_oak/pe.d127:peMA.Ode5C1T.ode	@ltx/swh_ke_oak/pe.d127:peMA.Ode5C1T.ode
ltx/swh_redirects_oak/pe.d127:peMA.Ode5C1T.text	@ltx/swh_ke_oak/pe.d127:peMA.Ode5C1T.text
ltx/swh_redirects_oak/pe.d127:peMA.Ode6C11.greekmelody	@ltx/swh_ke_oak/pe.d127:peMA.Ode6C11.greekmelody
ltx/swh_redirects_oak/pe.d127:peMA.Ode6C11.incipit	@ltx/swh_ke_oak/pe.d127:peMA.Ode6C11.incipit
ltx/swh_redirects_oak/pe.d127:peMA.Ode6C11.melody	@ltx/swh_ke_oak/pe.d127:peMA.Ode6C11.melody
ltx/swh_redirects_oak/pe.d127:peMA.Ode6C11.mode	@ltx/swh_ke_oak/pe.d127:peMA.Ode6C11.mode
ltx/swh_redirects_oak/pe.d127:peMA.Ode6C11.ode	@ltx/swh_ke_oak/pe.d127:peMA.Ode6C11.ode
ltx/swh_redirects_oak/pe.d127:peMA.Ode6C11.text	@ltx/swh_ke_oak/pe.d127:peMA.Ode6C11.text
ltx/swh_redirects_oak/pe.d127:peMA.Ode6C12.incipit	@ltx/swh_ke_oak/pe.d127:peMA.Ode6C12.incipit
ltx/swh_redirects_oak/pe.d127:peMA.Ode6C12.melody	@ltx/swh_ke_oak/pe.d127:peMA.Ode6C12.melody
ltx/swh_redirects_oak/pe.d127:peMA.Ode6C12.mode	@ltx/swh_ke_oak/pe.d127:peMA.Ode6C12.mode
ltx/swh_redirects_oak/pe.d127:peMA.Ode6C12.ode	@ltx/swh_ke_oak/pe.d127:peMA.Ode6C12.ode
ltx/swh_redirects_oak/pe.d127:peMA.Ode6C12.text	@ltx/swh_ke_oak/pe.d127:peMA.Ode6C12.text
ltx/swh_redirects_oak/pe.d127:peMA.Ode6C13.incipit	@ltx/swh_ke_oak/pe.d127:peMA.Ode6C13.incipit
ltx/swh_redirects_oak/pe.d127:peMA.Ode6C13.melody	@ltx/swh_ke_oak/pe.d127:peMA.Ode6C13.melody
ltx/swh_redirects_oak/pe.d127:peMA.Ode6C13.mode	@ltx/swh_ke_oak/pe.d127:peMA.Ode6C13.mode
ltx/swh_redirects_oak/pe.d127:peMA.Ode6C13.ode	@ltx/swh_ke_oak/pe.d127:peMA.Ode6C13.ode
ltx/swh_redirects_oak/pe.d127:peMA.Ode6C13.text	@ltx/swh_ke_oak/pe.d127:peMA.Ode6C13.text
ltx/swh_redirects_oak/pe.d127:peMA.Ode6C1T.incipit	@ltx/swh_ke_oak/pe.d127:peMA.Ode6C1T.incipit
ltx/swh_redirects_oak/pe.d127:peMA.Ode6C1T.melody	@ltx/swh_ke_oak/pe.d127:peMA.Ode6C1T.melody
ltx/swh_redirects_oak/pe.d127:peMA.Ode6C1T.mode	@ltx/swh_ke_oak/pe.d127:peMA.Ode6C1T.mode
ltx/swh_redirects_oak/pe.d127:peMA.Ode6C1T.ode	@ltx/swh_ke_oak/pe.d127:peMA.Ode6C1T.ode
ltx/swh_redirects_oak/pe.d127:peMA.Ode6C1T.text	@ltx/swh_ke_oak/pe.d127:peMA.Ode6C1T.text
ltx/swh_redirects_oak/pe.d127:peMA.Ode7C11.greekmelody	@ltx/swh_ke_oak/pe.d127:peMA.Ode7C11.greekmelody
ltx/swh_redirects_oak/pe.d127:peMA.Ode7C11.incipit	@ltx/swh_ke_oak/pe.d127:peMA.Ode7C11.incipit
ltx/swh_redirects_oak/pe.d127:peMA.Ode7C11.melody	@ltx/swh_ke_oak/pe.d127:peMA.Ode7C11.melody
ltx/swh_redirects_oak/pe.d127:peMA.Ode7C11.mode	@ltx/swh_ke_oak/pe.d127:peMA.Ode7C11.mode
ltx/swh_redirects_oak/pe.d127:peMA.Ode7C11.ode	@ltx/swh_ke_oak/pe.d127:peMA.Ode7C11.ode
ltx/swh_redirects_oak/pe.d127:peMA.Ode7C11.text	@ltx/swh_ke_oak/pe.d127:peMA.Ode7C11.text
ltx/swh_redirects_oak/pe.d127:peMA.Ode7C12.incipit	@ltx/swh_ke_oak/pe.d127:peMA.Ode7C12.incipit
ltx/swh_redirects_oak/pe.d127:peMA.Ode7C12.melody	@ltx/swh_ke_oak/pe.d127:peMA.Ode7C12.melody
ltx/swh_redirects_oak/pe.d127:peMA.Ode7C12.mode	@ltx/swh_ke_oak/pe.d127:peMA.Ode7C12.mode
ltx/swh_redirects_oak/pe.d127:peMA.Ode7C12.ode	@ltx/swh_ke_oak/pe.d127:peMA.Ode7C12.ode
ltx/swh_redirects_oak/pe.d127:peMA.Ode7C12.text	@ltx/swh_ke_oak/pe.d127:peMA.Ode7C12.text
ltx/swh_redirects_oak/pe.d127:peMA.Ode7C13.incipit	@ltx/swh_ke_oak/pe.d127:peMA.Ode7C13.incipit
ltx/swh_redirects_oak/pe.d127:peMA.Ode7C13.melody	@ltx/swh_ke_oak/pe.d127:peMA.Ode7C13.melody
ltx/swh_redirects_oak/pe.d127:peMA.Ode7C13.mode	@ltx/swh_ke_oak/pe.d127:peMA.Ode7C13.mode
ltx/swh_redirects_oak/pe.d127:peMA.Ode7C13.ode	@ltx/swh_ke_oak/pe.d127:peMA.Ode7C13.ode
ltx/swh_redirects_oak/pe.d127:peMA.Ode7C13.text	@ltx/swh_ke_oak/pe.d127:peMA.Ode7C13.text
ltx/swh_redirects_oak/pe.d127:peMA.Ode7C14.incipit	@ltx/swh_ke_oak/pe.d127:peMA.Ode7C14.incipit
ltx/swh_redirects_oak/pe.d127:peMA.Ode7C14.melody	@ltx/swh_ke_oak/pe.d127:peMA.Ode7C14.melody
ltx/swh_redirects_oak/pe.d127:peMA.Ode7C14.mode	@ltx/swh_ke_oak/pe.d127:peMA.Ode7C14.mode
ltx/swh_redirects_oak/pe.d127:peMA.Ode7C14.ode	@ltx/swh_ke_oak/pe.d127:peMA.Ode7C14.ode
ltx/swh_redirects_oak/pe.d127:peMA.Ode7C14.text	@ltx/swh_ke_oak/pe.d127:peMA.Ode7C14.text
ltx/swh_redirects_oak/pe.d127:peMA.Ode7C1T.incipit	@ltx/swh_ke_oak/pe.d127:peMA.Ode7C1T.incipit
ltx/swh_redirects_oak/pe.d127:peMA.Ode7C1T.melody	@ltx/swh_ke_oak/pe.d127:peMA.Ode7C1T.melody
ltx/swh_redirects_oak/pe.d127:peMA.Ode7C1T.mode	@ltx/swh_ke_oak/pe.d127:peMA.Ode7C1T.mode
ltx/swh_redirects_oak/pe.d127:peMA.Ode7C1T.ode	@ltx/swh_ke_oak/pe.d127:peMA.Ode7C1T.ode
ltx/swh_redirects_oak/pe.d127:peMA.Ode7C1T.text	@ltx/swh_ke_oak/pe.d127:peMA.Ode7C1T.text
ltx/swh_redirects_oak/pe.d127:peMA.Ode8C11.greekmelody	@ltx/swh_ke_oak/pe.d127:peMA.Ode8C11.greekmelody
ltx/swh_redirects_oak/pe.d127:peMA.Ode8C11.incipit	@ltx/swh_ke_oak/pe.d127:peMA.Ode8C11.incipit
ltx/swh_redirects_oak/pe.d127:peMA.Ode8C11.melody	@ltx/swh_ke_oak/pe.d127:peMA.Ode8C11.melody
ltx/swh_redirects_oak/pe.d127:peMA.Ode8C11.mode	@ltx/swh_ke_oak/pe.d127:peMA.Ode8C11.mode
ltx/swh_redirects_oak/pe.d127:peMA.Ode8C11.ode	@ltx/swh_ke_oak/pe.d127:peMA.Ode8C11.ode
ltx/swh_redirects_oak/pe.d127:peMA.Ode8C11.text	@ltx/swh_ke_oak/pe.d127:peMA.Ode8C11.text
ltx/swh_redirects_oak/pe.d127:peMA.Ode8C12.incipit	@ltx/swh_ke_oak/pe.d127:peMA.Ode8C12.incipit
ltx/swh_redirects_oak/pe.d127:peMA.Ode8C12.melody	@ltx/swh_ke_oak/pe.d127:peMA.Ode8C12.melody
ltx/swh_redirects_oak/pe.d127:peMA.Ode8C12.mode	@ltx/swh_ke_oak/pe.d127:peMA.Ode8C12.mode
ltx/swh_redirects_oak/pe.d127:peMA.Ode8C12.ode	@ltx/swh_ke_oak/pe.d127:peMA.Ode8C12.ode
ltx/swh_redirects_oak/pe.d127:peMA.Ode8C12.text	@ltx/swh_ke_oak/pe.d127:peMA.Ode8C12.text
ltx/swh_redirects_oak/pe.d127:peMA.Ode8C13.incipit	@ltx/swh_ke_oak/pe.d127:peMA.Ode8C13.incipit
ltx/swh_redirects_oak/pe.d127:peMA.Ode8C13.melody	@ltx/swh_ke_oak/pe.d127:peMA.Ode8C13.melody
ltx/swh_redirects_oak/pe.d127:peMA.Ode8C13.mode	@ltx/swh_ke_oak/pe.d127:peMA.Ode8C13.mode
ltx/swh_redirects_oak/pe.d127:peMA.Ode8C13.ode	@ltx/swh_ke_oak/pe.d127:peMA.Ode8C13.ode
ltx/swh_redirects_oak/pe.d127:peMA.Ode8C13.text	@ltx/swh_ke_oak/pe.d127:peMA.Ode8C13.text
ltx/swh_redirects_oak/pe.d127:peMA.Ode8C1T.incipit	@ltx/swh_ke_oak/pe.d127:peMA.Ode8C1T.incipit
ltx/swh_redirects_oak/pe.d127:peMA.Ode8C1T.melody	@ltx/swh_ke_oak/pe.d127:peMA.Ode8C1T.melody
ltx/swh_redirects_oak/pe.d127:peMA.Ode8C1T.mode	@ltx/swh_ke_oak/pe.d127:peMA.Ode8C1T.mode
ltx/swh_redirects_oak/pe.d127:peMA.Ode8C1T.ode	@ltx/swh_ke_oak/pe.d127:peMA.Ode8C1T.ode
ltx/swh_redirects_oak/pe.d127:peMA.Ode8C1T.text	@ltx/swh_ke_oak/pe.d127:peMA.Ode8C1T.text
ltx/swh_redirects_oak/pe.d127:peMA.Ode9C11.greekmelody	@ltx/swh_ke_oak/pe.d127:peMA.Ode9C11.greekmelody
ltx/swh_redirects_oak/pe.d127:peMA.Ode9C11.incipit	@ltx/swh_ke_oak/pe.d127:peMA.Ode9C11.incipit
ltx/swh_redirects_oak/pe.d127:peMA.Ode9C11.melody	@ltx/swh_ke_oak/pe.d127:peMA.Ode9C11.melody
ltx/swh_redirects_oak/pe.d127:peMA.Ode9C11.mode	@ltx/swh_ke_oak/pe.d127:peMA.Ode9C11.mode
ltx/swh_redirects_oak/pe.d127:peMA.Ode9C11.ode	@ltx/swh_ke_oak/pe.d127:peMA.Ode9C11.ode
ltx/swh_redirects_oak/pe.d127:peMA.Ode9C11.text	@ltx/swh_ke_oak/pe.d127:peMA.Ode9C11.text
ltx/swh_redirects_oak/pe.d127:peMA.Ode9C12.incipit	@ltx/swh_ke_oak/pe.d127:peMA.Ode9C12.incipit
ltx/swh_redirects_oak/pe.d127:peMA.Ode9C12.melody	@ltx/swh_ke_oak/pe.d127:peMA.Ode9C12.melody
ltx/swh_redirects_oak/pe.d127:peMA.Ode9C12.mode	@ltx/swh_ke_oak/pe.d127:peMA.Ode9C12.mode
ltx/swh_redirects_oak/pe.d127:peMA.Ode9C12.ode	@ltx/swh_ke_oak/pe.d127:peMA.Ode9C12.ode
ltx/swh_redirects_oak/pe.d127:peMA.Ode9C12.text	@ltx/swh_ke_oak/pe.d127:peMA.Ode9C12.text
ltx/swh_redirects_oak/pe.d127:peMA.Ode9C13.incipit	@ltx/swh_ke_oak/pe.d127:peMA.Ode9C13.incipit
ltx/swh_redirects_oak/pe.d127:peMA.Ode9C13.melody	@ltx/swh_ke_oak/pe.d127:peMA.Ode9C13.melody
ltx/swh_redirects_oak/pe.d127:peMA.Ode9C13.mode	@ltx/swh_ke_oak/pe.d127:peMA.Ode9C13.mode
ltx/swh_redirects_oak/pe.d127:peMA.Ode9C13.ode	@ltx/swh_ke_oak/pe.d127:peMA.Ode9C13.ode
ltx/swh_redirects_oak/pe.d127:peMA.Ode9C13.text	@ltx/swh_ke_oak/pe.d127:peMA.Ode9C13.text
ltx/swh_redirects_oak/pe.d127:peMA.Ode9C1T.incipit	@ltx/swh_ke_oak/pe.d127:peMA.Ode9C1T.incipit
ltx/swh_redirects_oak/pe.d127:peMA.Ode9C1T.melody	@ltx/swh_ke_oak/pe.d127:peMA.Ode9C1T.melody
ltx/swh_redirects_oak/pe.d127:peMA.Ode9C1T.mode	@ltx/swh_ke_oak/pe.d127:peMA.Ode9C1T.mode
ltx/swh_redirects_oak/pe.d127:peMA.Ode9C1T.ode	@ltx/swh_ke_oak/pe.d127:peMA.Ode9C1T.ode
ltx/swh_redirects_oak/pe.d127:peMA.Ode9C1T.text	@ltx/swh_ke_oak/pe.d127:peMA.Ode9C1T.text
ltx/swh_redirects_oak/pe.d127:peMA.Oikos1.text	@ltx/swh_ke_oak/pe.d127:peMA.Oikos1.text
ltx/swh_redirects_oak/pe.d127:peSY.commemoration.couplet1.title	@ltx/swh_ke_oak/pe.d127:peSY.commemoration.couplet1.title
ltx/swh_redirects_oak/pe.d127:peSY.commemoration.couplet1.verse1	@ltx/swh_ke_oak/pe.d127:peSY.commemoration.couplet1.verse1
ltx/swh_redirects_oak/pe.d127:peSY.commemoration.couplet1.verse2	@ltx/swh_ke_oak/pe.d127:peSY.commemoration.couplet1.verse2
ltx/swh_redirects_oak/pe.d127:peSY.commemoration.narration.p01	@ltx/swh_ke_oak/pe.d127:peSY.commemoration.narration.p01
ltx/swh_redirects_oak/pe.d127:peSY.commemoration.narration.p02	@ltx/swh_ke_oak/pe.d127:peSY.commemoration.narration.p02
ltx/swh_redirects_oak/pe.d127:peSY.commemoration.narration.p03	@ltx/swh_ke_oak/pe.d127:peSY.commemoration.narration.p03
ltx/swh_redirects_oak/pe.d127:peSY.commemoration.narration.p04	@ltx/swh_ke_oak/pe.d127:peSY.commemoration.narration.p04
ltx/swh_redirects_oak/pe.d127:peSY.commemoration.narration.p05	@ltx/swh_ke_oak/pe.d127:peSY.commemoration.narration.p05
ltx/swh_redirects_oak/pe.d127:peSY.commemoration.narration.p06	@ltx/swh_ke_oak/pe.d127:peSY.commemoration.narration.p06
ltx/swh_redirects_oak/pe.d127:peSY.commemoration.narration.p07	@ltx/swh_ke_oak/pe.d127:peSY.commemoration.narration.p07
ltx/swh_redirects_oak/pe.d127:peSY.commemoration.text	@ltx/swh_ke_oak/pe.d127:peSY.commemoration.text
ltx/swh_redirects_oak/pe.d127:peSY.lastline	@ltx/swh_ke_oak/pe.d127:peSY.lastline
ltx/swh_redirects_oak/pe.d127:peVE.Apolytikion1.incipit	@ltx/swh_ke_oak/pe.d127:peVE.Apolytikion1.incipit
ltx/swh_redirects_oak/pe.d127:peVE.Apolytikion1.melody	@ltx/swh_ke_oak/pe.d127:peVE.Apolytikion1.melody
ltx/swh_redirects_oak/pe.d127:peVE.Apolytikion1.mode	@ltx/swh_ke_oak/pe.d127:peVE.Apolytikion1.mode
ltx/swh_redirects_oak/pe.d127:peVE.Apolytikion1.text	@ltx/swh_ke_oak/pe.d127:peVE.Apolytikion1.text
ltx/swh_redirects_oak/pe.d127:peVE.Apolytikion2.incipit	@ltx/swh_ke_oak/pe.d127:peVE.Apolytikion2.incipit
ltx/swh_redirects_oak/pe.d127:peVE.Apolytikion2.melody	@ltx/swh_ke_oak/pe.d127:peVE.Apolytikion2.melody
ltx/swh_redirects_oak/pe.d127:peVE.Apolytikion2.mode	@ltx/swh_ke_oak/pe.d127:peVE.Apolytikion2.mode
ltx/swh_redirects_oak/pe.d127:peVE.Apolytikion2.text	@ltx/swh_ke_oak/pe.d127:peVE.Apolytikion2.text
ltx/swh_redirects_oak/pe.d127:peVE.Apolytikion3.incipit	@ltx/swh_ke_oak/pe.d127:peVE.Apolytikion3.incipit
ltx/swh_redirects_oak/pe.d127:peVE.Apolytikion3.melody	@ltx/swh_ke_oak/pe.d127:peVE.Apolytikion3.melody
ltx/swh_redirects_oak/pe.d127:peVE.Apolytikion3.mode	@ltx/swh_ke_oak/pe.d127:peVE.Apolytikion3.mode
ltx/swh_redirects_oak/pe.d127:peVE.Apolytikion3.text	@ltx/swh_ke_oak/pe.d127:peVE.Apolytikion3.text
ltx/swh_redirects_oak/pe.d127:peVE.AposBoth.incipit	@ltx/swh_ke_oak/pe.d127:peVE.AposBoth.incipit
ltx/swh_redirects_oak/pe.d127:peVE.AposBoth.melody	@ltx/swh_ke_oak/pe.d127:peVE.AposBoth.melody
ltx/swh_redirects_oak/pe.d127:peVE.AposBoth.mode	@ltx/swh_ke_oak/pe.d127:peVE.AposBoth.mode
ltx/swh_redirects_oak/pe.d127:peVE.AposBoth.text	@ltx/swh_ke_oak/pe.d127:peVE.AposBoth.text
ltx/swh_redirects_oak/pe.d127:peVE.AposGlory.incipit	@ltx/swh_ke_oak/pe.d127:peVE.AposGlory.incipit
ltx/swh_redirects_oak/pe.d127:peVE.AposGlory.melody	@ltx/swh_ke_oak/pe.d127:peVE.AposGlory.melody
ltx/swh_redirects_oak/pe.d127:peVE.AposGlory.mode	@ltx/swh_ke_oak/pe.d127:peVE.AposGlory.mode
ltx/swh_redirects_oak/pe.d127:peVE.AposGlory.text	@ltx/swh_ke_oak/pe.d127:peVE.AposGlory.text
ltx/swh_redirects_oak/pe.d127:peVE.Lity1.incipit	@ltx/swh_ke_oak/pe.d127:peVE.Lity1.incipit
ltx/swh_redirects_oak/pe.d127:peVE.Lity1.melody	@ltx/swh_ke_oak/pe.d127:peVE.Lity1.melody
ltx/swh_redirects_oak/pe.d127:peVE.Lity1.mode	@ltx/swh_ke_oak/pe.d127:peVE.Lity1.mode
ltx/swh_redirects_oak/pe.d127:peVE.Lity1.text	@ltx/swh_ke_oak/pe.d127:peVE.Lity1.text
ltx/swh_redirects_oak/pe.d127:peVE.Lity2.incipit	@ltx/swh_ke_oak/pe.d127:peVE.Lity2.incipit
ltx/swh_redirects_oak/pe.d127:peVE.Lity2.melody	@ltx/swh_ke_oak/pe.d127:peVE.Lity2.melody
ltx/swh_redirects_oak/pe.d127:peVE.Lity2.mode	@ltx/swh_ke_oak/pe.d127:peVE.Lity2.mode
ltx/swh_redirects_oak/pe.d127:peVE.Lity2.text	@ltx/swh_ke_oak/pe.d127:peVE.Lity2.text
ltx/swh_redirects_oak/pe.d127:peVE.Lity3.incipit	@ltx/swh_ke_oak/pe.d127:peVE.Lity3.incipit
ltx/swh_redirects_oak/pe.d127:peVE.Lity3.melody	@ltx/swh_ke_oak/pe.d127:peVE.Lity3.melody
ltx/swh_redirects_oak/pe.d127:peVE.Lity3.mode	@ltx/swh_ke_oak/pe.d127:peVE.Lity3.mode
ltx/swh_redirects_oak/pe.d127:peVE.Lity3.text	@ltx/swh_ke_oak/pe.d127:peVE.Lity3.text
ltx/swh_redirects_oak/pe.d127:peVE.LityBoth.incipit	@ltx/swh_ke_oak/pe.d127:peVE.LityBoth.incipit
ltx/swh_redirects_oak/pe.d127:peVE.LityBoth.melody	@ltx/swh_ke_oak/pe.d127:peVE.LityBoth.melody
ltx/swh_redirects_oak/pe.d127:peVE.LityBoth.mode	@ltx/swh_ke_oak/pe.d127:peVE.LityBoth.mode
ltx/swh_redirects_oak/pe.d127:peVE.LityBoth.text	@ltx/swh_ke_oak/pe.d127:peVE.LityBoth.text
ltx/swh_redirects_oak/pe.d127:peVE.LityGlory.incipit	@ltx/swh_ke_oak/pe.d127:peVE.LityGlory.incipit
ltx/swh_redirects_oak/pe.d127:peVE.LityGlory.melody	@ltx/swh_ke_oak/pe.d127:peVE.LityGlory.melody
ltx/swh_redirects_oak/pe.d127:peVE.LityGlory.mode	@ltx/swh_ke_oak/pe.d127:peVE.LityGlory.mode
ltx/swh_redirects_oak/pe.d127:peVE.LityGlory.text	@ltx/swh_ke_oak/pe.d127:peVE.LityGlory.text
ltx/swh_redirects_oak/pe.d127:peVE.MM.Stichera789as567.text	@ltx/swh_ke_oak/pe.d127:peVE.MM.Stichera789as567.text
ltx/swh_redirects_oak/pe.d127:peVE.SticGlory.incipit	@ltx/swh_ke_oak/pe.d127:peVE.SticGlory.incipit
ltx/swh_redirects_oak/pe.d127:peVE.SticGlory.melody	@ltx/swh_ke_oak/pe.d127:peVE.SticGlory.melody
ltx/swh_redirects_oak/pe.d127:peVE.SticGlory.mode	@ltx/swh_ke_oak/pe.d127:peVE.SticGlory.mode
ltx/swh_redirects_oak/pe.d127:peVE.SticGlory.text	@ltx/swh_ke_oak/pe.d127:peVE.SticGlory.text
ltx/swh_redirects_oak/pe.d127:peVE.Stichera07.greekmelody	@ltx/swh_ke_oak/pe.d127:peVE.Stichera07.greekmelody
ltx/swh_redirects_oak/pe.d127:peVE.Stichera07.incipit	@ltx/swh_ke_oak/pe.d127:peVE.Stichera07.incipit
ltx/swh_redirects_oak/pe.d127:peVE.Stichera07.melody	@ltx/swh_ke_oak/pe.d127:peVE.Stichera07.melody
ltx/swh_redirects_oak/pe.d127:peVE.Stichera07.mode	@ltx/swh_ke_oak/pe.d127:peVE.Stichera07.mode
ltx/swh_redirects_oak/pe.d127:peVE.Stichera07.text	@ltx/swh_ke_oak/pe.d127:peVE.Stichera07.text
ltx/swh_redirects_oak/pe.d127:peVE.Stichera08.greekmelody	@ltx/swh_ke_oak/pe.d127:peVE.Stichera08.greekmelody
ltx/swh_redirects_oak/pe.d127:peVE.Stichera08.incipit	@ltx/swh_ke_oak/pe.d127:peVE.Stichera08.incipit
ltx/swh_redirects_oak/pe.d127:peVE.Stichera08.melody	@ltx/swh_ke_oak/pe.d127:peVE.Stichera08.melody
ltx/swh_redirects_oak/pe.d127:peVE.Stichera08.mode	@ltx/swh_ke_oak/pe.d127:peVE.Stichera08.mode
ltx/swh_redirects_oak/pe.d127:peVE.Stichera08.text	@ltx/swh_ke_oak/pe.d127:peVE.Stichera08.text
ltx/swh_redirects_oak/pe.d127:peVE.Stichera09.incipit	@ltx/swh_ke_oak/pe.d127:peVE.Stichera09.incipit
ltx/swh_redirects_oak/pe.d127:peVE.Stichera09.melody	@ltx/swh_ke_oak/pe.d127:peVE.Stichera09.melody
ltx/swh_redirects_oak/pe.d127:peVE.Stichera09.mode	@ltx/swh_ke_oak/pe.d127:peVE.Stichera09.mode
ltx/swh_redirects_oak/pe.d127:peVE.Stichera09.text	@ltx/swh_ke_oak/pe.d127:peVE.Stichera09.text
ltx/swh_redirects_oak/pe.d127:peVE.Stichera10.incipit	@ltx/swh_ke_oak/pe.d127:peVE.Stichera10.incipit
ltx/swh_redirects_oak/pe.d127:peVE.Stichera10.melody	@ltx/swh_ke_oak/pe.d127:peVE.Stichera10.melody
ltx/swh_redirects_oak/pe.d127:peVE.Stichera10.mode	@ltx/swh_ke_oak/pe.d127:peVE.Stichera10.mode
ltx/swh_redirects_oak/pe.d127:peVE.Stichera10.text	@ltx/swh_ke_oak/pe.d127:peVE.Stichera10.text
