ltx/swh_redirects_oak/eo.e04:eo.Doxasticon.incipit	@ltx/swh_ke_oak/eo.e04:eo.Doxasticon.incipit
ltx/swh_redirects_oak/eo.e04:eo.Doxasticon.mode	@ltx/swh_ke_oak/eo.e04:eo.Doxasticon.mode
ltx/swh_redirects_oak/eo.e04:eo.Doxasticon.text	@ltx/swh_ke_oak/eo.e04:eo.Doxasticon.text
ltx/swh_redirects_oak/eo.e04:eo.Exaposteilarion.greekmelody	@ltx/swh_ke_oak/eo.e04:eo.Exaposteilarion.greekmelody
ltx/swh_redirects_oak/eo.e04:eo.Exaposteilarion.incipit	@ltx/swh_ke_oak/eo.e04:eo.Exaposteilarion.incipit
ltx/swh_redirects_oak/eo.e04:eo.Exaposteilarion.melody	@ltx/swh_ke_oak/eo.e04:eo.Exaposteilarion.melody
ltx/swh_redirects_oak/eo.e04:eo.Exaposteilarion.mode	@ltx/swh_ke_oak/eo.e04:eo.Exaposteilarion.mode
ltx/swh_redirects_oak/eo.e04:eo.Exaposteilarion.text	@ltx/swh_ke_oak/eo.e04:eo.Exaposteilarion.text
ltx/swh_redirects_oak/eo.e04:eo.Theotokion.incipit	@ltx/swh_ke_oak/eo.e04:eo.Theotokion.incipit
ltx/swh_redirects_oak/eo.e04:eo.Theotokion.melody	@ltx/swh_ke_oak/eo.e04:eo.Theotokion.melody
ltx/swh_redirects_oak/eo.e04:eo.Theotokion.mode	@ltx/swh_ke_oak/eo.e04:eo.Theotokion.mode
ltx/swh_redirects_oak/eo.e04:eo.Theotokion.text	@ltx/swh_ke_oak/eo.e04:eo.Theotokion.text
ltx/swh_redirects_oak/eo.e04:eo.title	@ltx/swh_ke_oak/eo.e04:eo.title
