ltx/swh_redirects_oak/me.m09.d21:meDA.commemoration.first	@ltx/swh_ke_oak/me.m09.d21:meDA.commemoration.first
ltx/swh_redirects_oak/me.m09.d21:meDA.commemoration.first_name	@ltx/swh_ke_oak/me.m09.d21:meDA.commemoration.first_name
ltx/swh_redirects_oak/me.m09.d21:meDA.commemoration.first_short	@ltx/swh_ke_oak/me.m09.d21:meDA.commemoration.first_short
ltx/swh_redirects_oak/me.m09.d21:meDA.commemoration.first_title	@ltx/swh_ke_oak/me.m09.d21:meDA.commemoration.first_title
ltx/swh_redirects_oak/me.m09.d21:meDA.commemoration.full	@ltx/swh_ke_oak/me.m09.d21:meDA.commemoration.full
ltx/swh_redirects_oak/me.m09.d21:meDA.commemoration.second_name	@ltx/swh_ke_oak/me.m09.d21:meDA.commemoration.second_name
ltx/swh_redirects_oak/me.m09.d21:meDA.commemoration.second_title	@ltx/swh_ke_oak/me.m09.d21:meDA.commemoration.second_title
ltx/swh_redirects_oak/me.m09.d21:meDA.date	@ltx/swh_ke_oak/me.m09.d21:meDA.date
ltx/swh_redirects_oak/me.m09.d21:meDA.insert1	@ltx/swh_ke_oak/me.m09.d21:meDA.insert1
ltx/swh_redirects_oak/me.m09.d21:meDA.insert2	@ltx/swh_ke_oak/me.m09.d21:meDA.insert2
ltx/swh_redirects_oak/me.m09.d21:meDA.note	@ltx/swh_ke_oak/me.m09.d21:meDA.note
ltx/swh_redirects_oak/me.m09.d21:meHO.commemorations	@ltx/swh_ke_oak/me.m09.d21:meHO.commemorations
ltx/swh_redirects_oak/me.m09.d21:meHO.note1	@ltx/swh_ke_oak/me.m09.d21:meHO.note1
ltx/swh_redirects_oak/me.m09.d21:meHO.note2	@ltx/swh_ke_oak/me.m09.d21:meHO.note2
ltx/swh_redirects_oak/me.m09.d21:meHO.number	@ltx/swh_ke_oak/me.m09.d21:meHO.number
ltx/swh_redirects_oak/me.m09.d21:meHO.rank	@ltx/swh_ke_oak/me.m09.d21:meHO.rank
ltx/swh_redirects_oak/me.m09.d21:meLE.commemoration1	@ltx/swh_ke_oak/me.m09.d21:meLE.commemoration1
ltx/swh_redirects_oak/me.m09.d21:meLE.commemoration2	@ltx/swh_ke_oak/me.m09.d21:meLE.commemoration2
ltx/swh_redirects_oak/me.m09.d21:meLI.Kontakion1.incipit	…
ltx/swh_redirects_oak/me.m09.d21:meLI.Kontakion1.melody	
ltx/swh_redirects_oak/me.m09.d21:meLI.Kontakion1.mode	
ltx/swh_redirects_oak/me.m09.d21:meLI.Kontakion1.text	
ltx/swh_redirects_oak/me.m09.d21:meLI.TheotokosHymn.incipit	@ltx/swh_ke_oak/me.m09.d21:meLI.TheotokosHymn.incipit
ltx/swh_redirects_oak/me.m09.d21:meLI.TheotokosHymn.mode	@ltx/swh_ke_oak/me.m09.d21:meLI.TheotokosHymn.mode
ltx/swh_redirects_oak/me.m09.d21:meLI.TheotokosHymn.text	@ltx/swh_ke_oak/me.m09.d21:meLI.TheotokosHymn.text
