ltx/swh_redirects_oak/pe.d126:peDA.commemoration.full	@ltx/swh_ke_oak/pe.d126:peDA.commemoration.full
ltx/swh_redirects_oak/pe.d126:peDA.commemoration.short	@ltx/swh_ke_oak/pe.d126:peDA.commemoration.short
ltx/swh_redirects_oak/pe.d126:peDA.dismissal	@ltx/swh_ke_oak/pe.d126:peDA.dismissal
ltx/swh_redirects_oak/pe.d126:peDA.insert1	@ltx/swh_ke_oak/pe.d126:peDA.insert1
ltx/swh_redirects_oak/pe.d126:peDA.insert2	@ltx/swh_ke_oak/pe.d126:peDA.insert2
ltx/swh_redirects_oak/pe.d126:peDA.note	@ltx/swh_ke_oak/pe.d126:peDA.note
ltx/swh_redirects_oak/pe.d126:peHO.commemorations	@ltx/swh_ke_oak/pe.d126:peHO.commemorations
ltx/swh_redirects_oak/pe.d126:peHO.daytitle	@ltx/swh_ke_oak/pe.d126:peHO.daytitle
ltx/swh_redirects_oak/pe.d126:peHO.description1	@ltx/swh_ke_oak/pe.d126:peHO.description1
ltx/swh_redirects_oak/pe.d126:peHO.description2	@ltx/swh_ke_oak/pe.d126:peHO.description2
ltx/swh_redirects_oak/pe.d126:peHO.note1	@ltx/swh_ke_oak/pe.d126:peHO.note1
ltx/swh_redirects_oak/pe.d126:peHO.note2	@ltx/swh_ke_oak/pe.d126:peHO.note2
ltx/swh_redirects_oak/pe.d126:peMA.MM.Lauds123as123.text	@ltx/swh_ke_oak/pe.d126:peMA.MM.Lauds123as123.text
ltx/swh_redirects_oak/pe.d126:peVE.MM.Stichera123456as123456.text	@ltx/swh_ke_oak/pe.d126:peVE.MM.Stichera123456as123456.text
