ltx/swh_redirects_oak/pe.d096:peDA.commemoration.full	@ltx/swh_ke_oak/pe.d096:peDA.commemoration.full
ltx/swh_redirects_oak/pe.d096:peDA.commemoration.short	@ltx/swh_ke_oak/pe.d096:peDA.commemoration.short
ltx/swh_redirects_oak/pe.d096:peDA.dismissal	@ltx/swh_ke_oak/pe.d096:peDA.dismissal
ltx/swh_redirects_oak/pe.d096:peDA.insert1	@ltx/swh_ke_oak/pe.d096:peDA.insert1
ltx/swh_redirects_oak/pe.d096:peDA.insert2	@ltx/swh_ke_oak/pe.d096:peDA.insert2
ltx/swh_redirects_oak/pe.d096:peDA.note	@ltx/swh_ke_oak/pe.d096:peDA.note
ltx/swh_redirects_oak/pe.d096:peHO.commemorations	@ltx/swh_ke_oak/pe.d096:peHO.commemorations
ltx/swh_redirects_oak/pe.d096:peHO.daytitle	@ltx/swh_ke_oak/pe.d096:peHO.daytitle
ltx/swh_redirects_oak/pe.d096:peHO.description1	@ltx/swh_ke_oak/pe.d096:peHO.description1
ltx/swh_redirects_oak/pe.d096:peHO.description2	@ltx/swh_ke_oak/pe.d096:peHO.description2
ltx/swh_redirects_oak/pe.d096:peHO.note1	@ltx/swh_ke_oak/pe.d096:peHO.note1
ltx/swh_redirects_oak/pe.d096:peHO.note2	@ltx/swh_ke_oak/pe.d096:peHO.note2
ltx/swh_redirects_oak/pe.d096:peMA.AposGlory.incipit	@ltx/swh_ke_oak/pe.d096:peMA.AposGlory.incipit
ltx/swh_redirects_oak/pe.d096:peMA.AposGlory.melody	@ltx/swh_ke_oak/pe.d096:peMA.AposGlory.melody
ltx/swh_redirects_oak/pe.d096:peMA.AposGlory.mode	@ltx/swh_ke_oak/pe.d096:peMA.AposGlory.mode
ltx/swh_redirects_oak/pe.d096:peMA.AposGlory.poet	@ltx/swh_ke_oak/pe.d096:peMA.AposGlory.poet
ltx/swh_redirects_oak/pe.d096:peMA.AposGlory.text	@ltx/swh_ke_oak/pe.d096:peMA.AposGlory.text
ltx/swh_redirects_oak/pe.d096:peMA.Aposticha1.incipit	@ltx/swh_ke_oak/pe.d096:peMA.Aposticha1.incipit
ltx/swh_redirects_oak/pe.d096:peMA.Aposticha1.melody	@ltx/swh_ke_oak/pe.d096:peMA.Aposticha1.melody
ltx/swh_redirects_oak/pe.d096:peMA.Aposticha1.mode	@ltx/swh_ke_oak/pe.d096:peMA.Aposticha1.mode
ltx/swh_redirects_oak/pe.d096:peMA.Aposticha1.text	@ltx/swh_ke_oak/pe.d096:peMA.Aposticha1.text
ltx/swh_redirects_oak/pe.d096:peMA.Aposticha2.incipit	@ltx/swh_ke_oak/pe.d096:peMA.Aposticha2.incipit
ltx/swh_redirects_oak/pe.d096:peMA.Aposticha2.melody	@ltx/swh_ke_oak/pe.d096:peMA.Aposticha2.melody
ltx/swh_redirects_oak/pe.d096:peMA.Aposticha2.mode	@ltx/swh_ke_oak/pe.d096:peMA.Aposticha2.mode
ltx/swh_redirects_oak/pe.d096:peMA.Aposticha2.text	@ltx/swh_ke_oak/pe.d096:peMA.Aposticha2.text
ltx/swh_redirects_oak/pe.d096:peMA.Aposticha3.incipit	@ltx/swh_ke_oak/pe.d096:peMA.Aposticha3.incipit
ltx/swh_redirects_oak/pe.d096:peMA.Aposticha3.melody	@ltx/swh_ke_oak/pe.d096:peMA.Aposticha3.melody
ltx/swh_redirects_oak/pe.d096:peMA.Aposticha3.mode	@ltx/swh_ke_oak/pe.d096:peMA.Aposticha3.mode
ltx/swh_redirects_oak/pe.d096:peMA.Aposticha3.text	@ltx/swh_ke_oak/pe.d096:peMA.Aposticha3.text
ltx/swh_redirects_oak/pe.d096:peMA.Kathisma11.greekmelody	@ltx/swh_ke_oak/pe.d096:peMA.Kathisma11.greekmelody
ltx/swh_redirects_oak/pe.d096:peMA.Kathisma11.incipit	@ltx/swh_ke_oak/pe.d096:peMA.Kathisma11.incipit
ltx/swh_redirects_oak/pe.d096:peMA.Kathisma11.melody	@ltx/swh_ke_oak/pe.d096:peMA.Kathisma11.melody
ltx/swh_redirects_oak/pe.d096:peMA.Kathisma11.mode	@ltx/swh_ke_oak/pe.d096:peMA.Kathisma11.mode
ltx/swh_redirects_oak/pe.d096:peMA.Kathisma11.text	@ltx/swh_ke_oak/pe.d096:peMA.Kathisma11.text
ltx/swh_redirects_oak/pe.d096:peMA.Kathisma12.greekmelody	@ltx/swh_ke_oak/pe.d096:peMA.Kathisma12.greekmelody
ltx/swh_redirects_oak/pe.d096:peMA.Kathisma12.incipit	@ltx/swh_ke_oak/pe.d096:peMA.Kathisma12.incipit
ltx/swh_redirects_oak/pe.d096:peMA.Kathisma12.melody	@ltx/swh_ke_oak/pe.d096:peMA.Kathisma12.melody
ltx/swh_redirects_oak/pe.d096:peMA.Kathisma12.mode	@ltx/swh_ke_oak/pe.d096:peMA.Kathisma12.mode
ltx/swh_redirects_oak/pe.d096:peMA.Kathisma12.text	@ltx/swh_ke_oak/pe.d096:peMA.Kathisma12.text
ltx/swh_redirects_oak/pe.d096:peMA.Kathisma13.greekmelody	@ltx/swh_ke_oak/pe.d096:peMA.Kathisma13.greekmelody
ltx/swh_redirects_oak/pe.d096:peMA.Kathisma13.incipit	@ltx/swh_ke_oak/pe.d096:peMA.Kathisma13.incipit
ltx/swh_redirects_oak/pe.d096:peMA.Kathisma13.melody	@ltx/swh_ke_oak/pe.d096:peMA.Kathisma13.melody
ltx/swh_redirects_oak/pe.d096:peMA.Kathisma13.mode	@ltx/swh_ke_oak/pe.d096:peMA.Kathisma13.mode
ltx/swh_redirects_oak/pe.d096:peMA.Kathisma13.text	@ltx/swh_ke_oak/pe.d096:peMA.Kathisma13.text
ltx/swh_redirects_oak/pe.d096:peMA.Kathisma1T.incipit	@ltx/swh_ke_oak/pe.d096:peMA.Kathisma1T.incipit
ltx/swh_redirects_oak/pe.d096:peMA.Kathisma1T.melody	@ltx/swh_ke_oak/pe.d096:peMA.Kathisma1T.melody
ltx/swh_redirects_oak/pe.d096:peMA.Kathisma1T.mode	@ltx/swh_ke_oak/pe.d096:peMA.Kathisma1T.mode
ltx/swh_redirects_oak/pe.d096:peMA.Kathisma1T.text	@ltx/swh_ke_oak/pe.d096:peMA.Kathisma1T.text
ltx/swh_redirects_oak/pe.d096:peMA.Kathisma21.greekmelody	@ltx/swh_ke_oak/pe.d096:peMA.Kathisma21.greekmelody
ltx/swh_redirects_oak/pe.d096:peMA.Kathisma21.incipit	@ltx/swh_ke_oak/pe.d096:peMA.Kathisma21.incipit
ltx/swh_redirects_oak/pe.d096:peMA.Kathisma21.melody	@ltx/swh_ke_oak/pe.d096:peMA.Kathisma21.melody
ltx/swh_redirects_oak/pe.d096:peMA.Kathisma21.mode	@ltx/swh_ke_oak/pe.d096:peMA.Kathisma21.mode
ltx/swh_redirects_oak/pe.d096:peMA.Kathisma21.text	@ltx/swh_ke_oak/pe.d096:peMA.Kathisma21.text
ltx/swh_redirects_oak/pe.d096:peMA.Lauds1.incipit	@ltx/swh_ke_oak/pe.d096:peMA.Lauds1.incipit
ltx/swh_redirects_oak/pe.d096:peMA.Lauds1.melody	@ltx/swh_ke_oak/pe.d096:peMA.Lauds1.melody
ltx/swh_redirects_oak/pe.d096:peMA.Lauds1.mode	@ltx/swh_ke_oak/pe.d096:peMA.Lauds1.mode
ltx/swh_redirects_oak/pe.d096:peMA.Lauds1.text	@ltx/swh_ke_oak/pe.d096:peMA.Lauds1.text
ltx/swh_redirects_oak/pe.d096:peMA.Lauds2.incipit	@ltx/swh_ke_oak/pe.d096:peMA.Lauds2.incipit
ltx/swh_redirects_oak/pe.d096:peMA.Lauds2.melody	@ltx/swh_ke_oak/pe.d096:peMA.Lauds2.melody
ltx/swh_redirects_oak/pe.d096:peMA.Lauds2.mode	@ltx/swh_ke_oak/pe.d096:peMA.Lauds2.mode
ltx/swh_redirects_oak/pe.d096:peMA.Lauds2.text	@ltx/swh_ke_oak/pe.d096:peMA.Lauds2.text
ltx/swh_redirects_oak/pe.d096:peMA.Lauds3.incipit	@ltx/swh_ke_oak/pe.d096:peMA.Lauds3.incipit
ltx/swh_redirects_oak/pe.d096:peMA.Lauds3.melody	@ltx/swh_ke_oak/pe.d096:peMA.Lauds3.melody
ltx/swh_redirects_oak/pe.d096:peMA.Lauds3.mode	@ltx/swh_ke_oak/pe.d096:peMA.Lauds3.mode
ltx/swh_redirects_oak/pe.d096:peMA.Lauds3.text	@ltx/swh_ke_oak/pe.d096:peMA.Lauds3.text
ltx/swh_redirects_oak/pe.d096:peMA.LaudsGlory.incipit	@ltx/swh_ke_oak/pe.d096:peMA.LaudsGlory.incipit
ltx/swh_redirects_oak/pe.d096:peMA.LaudsGlory.melody	@ltx/swh_ke_oak/pe.d096:peMA.LaudsGlory.melody
ltx/swh_redirects_oak/pe.d096:peMA.LaudsGlory.mode	@ltx/swh_ke_oak/pe.d096:peMA.LaudsGlory.mode
ltx/swh_redirects_oak/pe.d096:peMA.LaudsGlory.text	@ltx/swh_ke_oak/pe.d096:peMA.LaudsGlory.text
ltx/swh_redirects_oak/pe.d096:peVE.AposGlory.incipit	@ltx/swh_ke_oak/pe.d096:peVE.AposGlory.incipit
ltx/swh_redirects_oak/pe.d096:peVE.AposGlory.melody	@ltx/swh_ke_oak/pe.d096:peVE.AposGlory.melody
ltx/swh_redirects_oak/pe.d096:peVE.AposGlory.mode	@ltx/swh_ke_oak/pe.d096:peVE.AposGlory.mode
ltx/swh_redirects_oak/pe.d096:peVE.AposGlory.poet	@ltx/swh_ke_oak/pe.d096:peVE.AposGlory.poet
ltx/swh_redirects_oak/pe.d096:peVE.AposGlory.text	@ltx/swh_ke_oak/pe.d096:peVE.AposGlory.text
ltx/swh_redirects_oak/pe.d096:peVE.Aposticha1.incipit	@ltx/swh_ke_oak/pe.d096:peVE.Aposticha1.incipit
ltx/swh_redirects_oak/pe.d096:peVE.Aposticha1.melody	@ltx/swh_ke_oak/pe.d096:peVE.Aposticha1.melody
ltx/swh_redirects_oak/pe.d096:peVE.Aposticha1.mode	@ltx/swh_ke_oak/pe.d096:peVE.Aposticha1.mode
ltx/swh_redirects_oak/pe.d096:peVE.Aposticha1.text	@ltx/swh_ke_oak/pe.d096:peVE.Aposticha1.text
ltx/swh_redirects_oak/pe.d096:peVE.Aposticha2.incipit	@ltx/swh_ke_oak/pe.d096:peVE.Aposticha2.incipit
ltx/swh_redirects_oak/pe.d096:peVE.Aposticha2.melody	@ltx/swh_ke_oak/pe.d096:peVE.Aposticha2.melody
ltx/swh_redirects_oak/pe.d096:peVE.Aposticha2.mode	@ltx/swh_ke_oak/pe.d096:peVE.Aposticha2.mode
ltx/swh_redirects_oak/pe.d096:peVE.Aposticha2.text	@ltx/swh_ke_oak/pe.d096:peVE.Aposticha2.text
ltx/swh_redirects_oak/pe.d096:peVE.Aposticha3.incipit	@ltx/swh_ke_oak/pe.d096:peVE.Aposticha3.incipit
ltx/swh_redirects_oak/pe.d096:peVE.Aposticha3.melody	@ltx/swh_ke_oak/pe.d096:peVE.Aposticha3.melody
ltx/swh_redirects_oak/pe.d096:peVE.Aposticha3.mode	@ltx/swh_ke_oak/pe.d096:peVE.Aposticha3.mode
ltx/swh_redirects_oak/pe.d096:peVE.Aposticha3.text	@ltx/swh_ke_oak/pe.d096:peVE.Aposticha3.text
ltx/swh_redirects_oak/pe.d096:peVE.SticGlory.incipit	@ltx/swh_ke_oak/pe.d096:peVE.SticGlory.incipit
ltx/swh_redirects_oak/pe.d096:peVE.SticGlory.melody	@ltx/swh_ke_oak/pe.d096:peVE.SticGlory.melody
ltx/swh_redirects_oak/pe.d096:peVE.SticGlory.mode	@ltx/swh_ke_oak/pe.d096:peVE.SticGlory.mode
ltx/swh_redirects_oak/pe.d096:peVE.SticGlory.text	@ltx/swh_ke_oak/pe.d096:peVE.SticGlory.text
ltx/swh_redirects_oak/pe.d096:peVE.Stichera01.greekmelody	@ltx/swh_ke_oak/pe.d096:peVE.Stichera01.greekmelody
ltx/swh_redirects_oak/pe.d096:peVE.Stichera01.incipit	@ltx/swh_ke_oak/pe.d096:peVE.Stichera01.incipit
ltx/swh_redirects_oak/pe.d096:peVE.Stichera01.melody	@ltx/swh_ke_oak/pe.d096:peVE.Stichera01.melody
ltx/swh_redirects_oak/pe.d096:peVE.Stichera01.mode	@ltx/swh_ke_oak/pe.d096:peVE.Stichera01.mode
ltx/swh_redirects_oak/pe.d096:peVE.Stichera01.text	@ltx/swh_ke_oak/pe.d096:peVE.Stichera01.text
ltx/swh_redirects_oak/pe.d096:peVE.Stichera02.incipit	@ltx/swh_ke_oak/pe.d096:peVE.Stichera02.incipit
ltx/swh_redirects_oak/pe.d096:peVE.Stichera02.melody	@ltx/swh_ke_oak/pe.d096:peVE.Stichera02.melody
ltx/swh_redirects_oak/pe.d096:peVE.Stichera02.mode	@ltx/swh_ke_oak/pe.d096:peVE.Stichera02.mode
ltx/swh_redirects_oak/pe.d096:peVE.Stichera02.text	@ltx/swh_ke_oak/pe.d096:peVE.Stichera02.text
ltx/swh_redirects_oak/pe.d096:peVE.Stichera03.incipit	@ltx/swh_ke_oak/pe.d096:peVE.Stichera03.incipit
ltx/swh_redirects_oak/pe.d096:peVE.Stichera03.melody	@ltx/swh_ke_oak/pe.d096:peVE.Stichera03.melody
ltx/swh_redirects_oak/pe.d096:peVE.Stichera03.mode	@ltx/swh_ke_oak/pe.d096:peVE.Stichera03.mode
ltx/swh_redirects_oak/pe.d096:peVE.Stichera03.text	@ltx/swh_ke_oak/pe.d096:peVE.Stichera03.text
