ltx/swh_redirects_oak/ty.typikon.pe:tyPE.PaschalEnarxis1	@ltx/swh_ke_oak/ty.typikon.pe:tyPE.PaschalEnarxis1
ltx/swh_redirects_oak/ty.typikon.pe:tyPE.PaschalEnarxis2	@ltx/swh_ke_oak/ty.typikon.pe:tyPE.PaschalEnarxis2
ltx/swh_redirects_oak/ty.typikon.pe:tyPE.PaschalEnarxis3	@ltx/swh_ke_oak/ty.typikon.pe:tyPE.PaschalEnarxis3
ltx/swh_redirects_oak/ty.typikon.pe:tyPE.PaschalEnarxis4	@ltx/swh_ke_oak/ty.typikon.pe:tyPE.PaschalEnarxis4
ltx/swh_redirects_oak/ty.typikon.pe:tyPE.PaschalEnarxis5	@ltx/swh_ke_oak/ty.typikon.pe:tyPE.PaschalEnarxis5
ltx/swh_redirects_oak/ty.typikon.pe:tyPE.PaschalEnarxis6	@ltx/swh_ke_oak/ty.typikon.pe:tyPE.PaschalEnarxis6
ltx/swh_redirects_oak/ty.typikon.pe:tyPE.PaschalEnarxis7	@ltx/swh_ke_oak/ty.typikon.pe:tyPE.PaschalEnarxis7
