ltx/swh_redirects_oak/le.ep.mc.d069:lemcH1.Epistle.book_abbr	@ltx/swh_ke_oak/le.ep.mc.d069:lemcH1.Epistle.book_abbr
ltx/swh_redirects_oak/le.ep.mc.d069:lemcH1.Epistle.book_string	@ltx/swh_ke_oak/le.ep.mc.d069:lemcH1.Epistle.book_string
ltx/swh_redirects_oak/le.ep.mc.d069:lemcH1.Epistle.chapverse	@ltx/swh_ke_oak/le.ep.mc.d069:lemcH1.Epistle.chapverse
ltx/swh_redirects_oak/le.ep.mc.d069:lemcH1.Epistle.incipit	@ltx/swh_ke_oak/le.ep.mc.d069:lemcH1.Epistle.incipit
ltx/swh_redirects_oak/le.ep.mc.d069:lemcH1.Epistle.text	@ltx/swh_ke_oak/le.ep.mc.d069:lemcH1.Epistle.text
ltx/swh_redirects_oak/le.ep.mc.d069:lemcH1.Epistle.title	@ltx/swh_ke_oak/le.ep.mc.d069:lemcH1.Epistle.title
ltx/swh_redirects_oak/le.ep.mc.d069:lemcH1.Epistle.title_abbr	@ltx/swh_ke_oak/le.ep.mc.d069:lemcH1.Epistle.title_abbr
ltx/swh_redirects_oak/le.ep.mc.d069:lemcH1.Epistle.version	@ltx/swh_ke_oak/le.ep.mc.d069:lemcH1.Epistle.version
ltx/swh_redirects_oak/le.ep.mc.d069:lemcH3.Epistle.book_abbr	@ltx/swh_ke_oak/le.ep.mc.d069:lemcH3.Epistle.book_abbr
ltx/swh_redirects_oak/le.ep.mc.d069:lemcH3.Epistle.book_string	@ltx/swh_ke_oak/le.ep.mc.d069:lemcH3.Epistle.book_string
ltx/swh_redirects_oak/le.ep.mc.d069:lemcH3.Epistle.chapverse	@ltx/swh_ke_oak/le.ep.mc.d069:lemcH3.Epistle.chapverse
ltx/swh_redirects_oak/le.ep.mc.d069:lemcH3.Epistle.incipit	@ltx/swh_ke_oak/le.ep.mc.d069:lemcH3.Epistle.incipit
ltx/swh_redirects_oak/le.ep.mc.d069:lemcH3.Epistle.text	@ltx/swh_ke_oak/le.ep.mc.d069:lemcH3.Epistle.text
ltx/swh_redirects_oak/le.ep.mc.d069:lemcH3.Epistle.title	@ltx/swh_ke_oak/le.ep.mc.d069:lemcH3.Epistle.title
ltx/swh_redirects_oak/le.ep.mc.d069:lemcH3.Epistle.title_abbr	@ltx/swh_ke_oak/le.ep.mc.d069:lemcH3.Epistle.title_abbr
ltx/swh_redirects_oak/le.ep.mc.d069:lemcH3.Epistle.version	@ltx/swh_ke_oak/le.ep.mc.d069:lemcH3.Epistle.version
ltx/swh_redirects_oak/le.ep.mc.d069:lemcH6.Epistle.book_abbr	@ltx/swh_ke_oak/le.ep.mc.d069:lemcH6.Epistle.book_abbr
ltx/swh_redirects_oak/le.ep.mc.d069:lemcH6.Epistle.book_string	@ltx/swh_ke_oak/le.ep.mc.d069:lemcH6.Epistle.book_string
ltx/swh_redirects_oak/le.ep.mc.d069:lemcH6.Epistle.chapverse	@ltx/swh_ke_oak/le.ep.mc.d069:lemcH6.Epistle.chapverse
ltx/swh_redirects_oak/le.ep.mc.d069:lemcH6.Epistle.incipit	@ltx/swh_ke_oak/le.ep.mc.d069:lemcH6.Epistle.incipit
ltx/swh_redirects_oak/le.ep.mc.d069:lemcH6.Epistle.text	@ltx/swh_ke_oak/le.ep.mc.d069:lemcH6.Epistle.text
ltx/swh_redirects_oak/le.ep.mc.d069:lemcH6.Epistle.title	@ltx/swh_ke_oak/le.ep.mc.d069:lemcH6.Epistle.title
ltx/swh_redirects_oak/le.ep.mc.d069:lemcH6.Epistle.title_abbr	@ltx/swh_ke_oak/le.ep.mc.d069:lemcH6.Epistle.title_abbr
ltx/swh_redirects_oak/le.ep.mc.d069:lemcH6.Epistle.version	@ltx/swh_ke_oak/le.ep.mc.d069:lemcH6.Epistle.version
ltx/swh_redirects_oak/le.ep.mc.d069:lemcH9.Epistle.book_abbr	@ltx/swh_ke_oak/le.ep.mc.d069:lemcH9.Epistle.book_abbr
ltx/swh_redirects_oak/le.ep.mc.d069:lemcH9.Epistle.book_string	@ltx/swh_ke_oak/le.ep.mc.d069:lemcH9.Epistle.book_string
ltx/swh_redirects_oak/le.ep.mc.d069:lemcH9.Epistle.chapverse	@ltx/swh_ke_oak/le.ep.mc.d069:lemcH9.Epistle.chapverse
ltx/swh_redirects_oak/le.ep.mc.d069:lemcH9.Epistle.incipit	@ltx/swh_ke_oak/le.ep.mc.d069:lemcH9.Epistle.incipit
ltx/swh_redirects_oak/le.ep.mc.d069:lemcH9.Epistle.text	@ltx/swh_ke_oak/le.ep.mc.d069:lemcH9.Epistle.text
ltx/swh_redirects_oak/le.ep.mc.d069:lemcH9.Epistle.title	@ltx/swh_ke_oak/le.ep.mc.d069:lemcH9.Epistle.title
ltx/swh_redirects_oak/le.ep.mc.d069:lemcH9.Epistle.title_abbr	@ltx/swh_ke_oak/le.ep.mc.d069:lemcH9.Epistle.title_abbr
ltx/swh_redirects_oak/le.ep.mc.d069:lemcH9.Epistle.version	@ltx/swh_ke_oak/le.ep.mc.d069:lemcH9.Epistle.version
ltx/swh_redirects_oak/le.ep.mc.d069:lemcVE.Epistle.book_abbr	@ltx/swh_ke_oak/le.ep.mc.d069:lemcVE.Epistle.book_abbr
ltx/swh_redirects_oak/le.ep.mc.d069:lemcVE.Epistle.book_string	@ltx/swh_ke_oak/le.ep.mc.d069:lemcVE.Epistle.book_string
ltx/swh_redirects_oak/le.ep.mc.d069:lemcVE.Epistle.chapverse	@ltx/swh_ke_oak/le.ep.mc.d069:lemcVE.Epistle.chapverse
ltx/swh_redirects_oak/le.ep.mc.d069:lemcVE.Epistle.incipit	@ltx/swh_ke_oak/le.ep.mc.d069:lemcVE.Epistle.incipit
ltx/swh_redirects_oak/le.ep.mc.d069:lemcVE.Epistle.pagenumber	@ltx/swh_ke_oak/le.ep.mc.d069:lemcVE.Epistle.pagenumber
ltx/swh_redirects_oak/le.ep.mc.d069:lemcVE.Epistle.text	@ltx/swh_ke_oak/le.ep.mc.d069:lemcVE.Epistle.text
ltx/swh_redirects_oak/le.ep.mc.d069:lemcVE.Epistle.title	@ltx/swh_ke_oak/le.ep.mc.d069:lemcVE.Epistle.title
ltx/swh_redirects_oak/le.ep.mc.d069:lemcVE.Epistle.title_abbr	@ltx/swh_ke_oak/le.ep.mc.d069:lemcVE.Epistle.title_abbr
ltx/swh_redirects_oak/le.ep.mc.d069:lemcVE.Epistle.version	@ltx/swh_ke_oak/le.ep.mc.d069:lemcVE.Epistle.version
