ltx/swh_redirects_oak/me.m11.d25:meDA.commemoration.first	@ltx/swh_ke_oak/me.m11.d25:meDA.commemoration.first
ltx/swh_redirects_oak/me.m11.d25:meDA.commemoration.first_name	@ltx/swh_ke_oak/me.m11.d25:meDA.commemoration.first_name
ltx/swh_redirects_oak/me.m11.d25:meDA.commemoration.first_short	@ltx/swh_ke_oak/me.m11.d25:meDA.commemoration.first_short
ltx/swh_redirects_oak/me.m11.d25:meDA.commemoration.first_title	@ltx/swh_ke_oak/me.m11.d25:meDA.commemoration.first_title
ltx/swh_redirects_oak/me.m11.d25:meDA.commemoration.full	@ltx/swh_ke_oak/me.m11.d25:meDA.commemoration.full
ltx/swh_redirects_oak/me.m11.d25:meDA.commemoration.second_name	@ltx/swh_ke_oak/me.m11.d25:meDA.commemoration.second_name
ltx/swh_redirects_oak/me.m11.d25:meDA.commemoration.second_title	@ltx/swh_ke_oak/me.m11.d25:meDA.commemoration.second_title
ltx/swh_redirects_oak/me.m11.d25:meDA.date	@ltx/swh_ke_oak/me.m11.d25:meDA.date
ltx/swh_redirects_oak/me.m11.d25:meDA.insert1	@ltx/swh_ke_oak/me.m11.d25:meDA.insert1
ltx/swh_redirects_oak/me.m11.d25:meDA.insert2	@ltx/swh_ke_oak/me.m11.d25:meDA.insert2
ltx/swh_redirects_oak/me.m11.d25:meDA.note	@ltx/swh_ke_oak/me.m11.d25:meDA.note
ltx/swh_redirects_oak/me.m11.d25:meHO.commemorations	@ltx/swh_ke_oak/me.m11.d25:meHO.commemorations
ltx/swh_redirects_oak/me.m11.d25:meHO.note1	@ltx/swh_ke_oak/me.m11.d25:meHO.note1
ltx/swh_redirects_oak/me.m11.d25:meHO.note2	@ltx/swh_ke_oak/me.m11.d25:meHO.note2
ltx/swh_redirects_oak/me.m11.d25:meHO.number	@ltx/swh_ke_oak/me.m11.d25:meHO.number
ltx/swh_redirects_oak/me.m11.d25:meHO.rank	@ltx/swh_ke_oak/me.m11.d25:meHO.rank
ltx/swh_redirects_oak/me.m11.d25:meLE.commemoration1	@ltx/swh_ke_oak/me.m11.d25:meLE.commemoration1
ltx/swh_redirects_oak/me.m11.d25:meLE.commemoration2	@ltx/swh_ke_oak/me.m11.d25:meLE.commemoration2
ltx/swh_redirects_oak/me.m11.d25:meLI.Kontakion1.greekmelody	@ltx/swh_ke_oak/me.m11.d25:meMA.Kontakion1.greekmelody
ltx/swh_redirects_oak/me.m11.d25:meLI.Kontakion1.incipit	@ltx/swh_ke_oak/me.m11.d25:meMA.Kontakion1.incipit
ltx/swh_redirects_oak/me.m11.d25:meLI.Kontakion1.melody	@ltx/swh_ke_oak/me.m11.d25:meMA.Kontakion1.melody
ltx/swh_redirects_oak/me.m11.d25:meLI.Kontakion1.mode	@ltx/swh_ke_oak/me.m11.d25:meMA.Kontakion1.mode
ltx/swh_redirects_oak/me.m11.d25:meLI.Kontakion1.text	@ltx/swh_ke_oak/me.m11.d25:meMA.Kontakion1.text
ltx/swh_redirects_oak/me.m11.d25:meLI.MM.CommunionHymn.text	@ltx/swh_ke_oak/properties:media.key
ltx/swh_redirects_oak/me.m11.d25:meLI.Megalynarion.text	@ltx/swh_ke_oak/me.m11.d25:meLI.Megalynarion.text
ltx/swh_redirects_oak/me.m11.d25:meLI.Megalynarion2.text	@ltx/swh_ke_oak/me.m11.d25:meLI.Megalynarion2.text
ltx/swh_redirects_oak/me.m11.d25:meLI.TheotokosHymn.incipit	@ltx/swh_ke_oak/me.m11.d25:meLI.TheotokosHymn.incipit
ltx/swh_redirects_oak/me.m11.d25:meLI.TheotokosHymn.mode	@ltx/swh_ke_oak/me.m11.d25:meLI.TheotokosHymn.mode
ltx/swh_redirects_oak/me.m11.d25:meLI.TheotokosHymn.text	@ltx/swh_ke_oak/me.m11.d25:meLI.TheotokosHymn.text
ltx/swh_redirects_oak/me.m11.d25:meLI.TheotokosHymnVerse.incipit	@ltx/swh_ke_oak/me.m11.d25:meLI.TheotokosHymnVerse.incipit
ltx/swh_redirects_oak/me.m11.d25:meLI.TheotokosHymnVerse.text	@ltx/swh_ke_oak/me.m11.d25:meLI.TheotokosHymnVerse.text
ltx/swh_redirects_oak/me.m11.d25:meMA.C1.acrostic.notice1	@ltx/swh_ke_oak/me.m11.d25:meMA.C1.acrostic.notice1
ltx/swh_redirects_oak/me.m11.d25:meMA.C1.acrostic.text	@ltx/swh_ke_oak/me.m11.d25:meMA.C1.acrostic.text
ltx/swh_redirects_oak/me.m11.d25:meMA.C1.acrostic.title	@ltx/swh_ke_oak/me.m11.d25:meMA.C1.acrostic.title
ltx/swh_redirects_oak/me.m11.d25:meMA.C1.poet	@ltx/swh_ke_oak/me.m11.d25:meMA.C1.poet
ltx/swh_redirects_oak/me.m11.d25:meMA.C1.title	@ltx/swh_ke_oak/me.m11.d25:meMA.C1.title
ltx/swh_redirects_oak/me.m11.d25:meMA.C1.verse	@ltx/swh_ke_oak/me.m11.d25:meMA.C1.verse
ltx/swh_redirects_oak/me.m11.d25:meMA.C2.acrostic.notice1	@ltx/swh_ke_oak/me.m11.d25:meMA.C2.acrostic.notice1
ltx/swh_redirects_oak/me.m11.d25:meMA.C2.acrostic.text	@ltx/swh_ke_oak/me.m11.d25:meMA.C2.acrostic.text
ltx/swh_redirects_oak/me.m11.d25:meMA.C2.acrostic.title	@ltx/swh_ke_oak/me.m11.d25:meMA.C2.acrostic.title
ltx/swh_redirects_oak/me.m11.d25:meMA.C2.title	@ltx/swh_ke_oak/me.m11.d25:meMA.C2.title
ltx/swh_redirects_oak/me.m11.d25:meMA.C2.verse	@ltx/swh_ke_oak/me.m11.d25:meMA.C2.verse
ltx/swh_redirects_oak/me.m11.d25:meMA.Exaposteilarion1.greekmelody	@ltx/swh_ke_oak/me.m11.d25:meMA.Exaposteilarion1.greekmelody
ltx/swh_redirects_oak/me.m11.d25:meMA.Exaposteilarion1.incipit	@ltx/swh_ke_oak/me.m11.d25:meMA.Exaposteilarion1.incipit
ltx/swh_redirects_oak/me.m11.d25:meMA.Exaposteilarion1.melody	@ltx/swh_ke_oak/me.m11.d25:meMA.Exaposteilarion1.melody
ltx/swh_redirects_oak/me.m11.d25:meMA.Exaposteilarion1.mode	@ltx/swh_ke_oak/me.m11.d25:meMA.Exaposteilarion1.mode
ltx/swh_redirects_oak/me.m11.d25:meMA.Exaposteilarion1.text	@ltx/swh_ke_oak/me.m11.d25:meMA.Exaposteilarion1.text
ltx/swh_redirects_oak/me.m11.d25:meMA.Exaposteilarion2.greekmelody	@ltx/swh_ke_oak/me.m11.d25:meMA.Exaposteilarion2.greekmelody
ltx/swh_redirects_oak/me.m11.d25:meMA.Exaposteilarion2.incipit	@ltx/swh_ke_oak/me.m11.d25:meMA.Exaposteilarion2.incipit
ltx/swh_redirects_oak/me.m11.d25:meMA.Exaposteilarion2.melody	@ltx/swh_ke_oak/me.m11.d25:meMA.Exaposteilarion2.melody
ltx/swh_redirects_oak/me.m11.d25:meMA.Exaposteilarion2.mode	@ltx/swh_ke_oak/me.m11.d25:meMA.Exaposteilarion2.mode
ltx/swh_redirects_oak/me.m11.d25:meMA.Exaposteilarion2.text	@ltx/swh_ke_oak/me.m11.d25:meMA.Exaposteilarion2.text
ltx/swh_redirects_oak/me.m11.d25:meMA.Exaposteilarion3.greekmelody	@ltx/swh_ke_oak/me.m11.d25:meMA.Exaposteilarion3.greekmelody
ltx/swh_redirects_oak/me.m11.d25:meMA.Exaposteilarion3.incipit	@ltx/swh_ke_oak/me.m11.d25:meMA.Exaposteilarion3.incipit
ltx/swh_redirects_oak/me.m11.d25:meMA.Exaposteilarion3.melody	@ltx/swh_ke_oak/me.m11.d25:meMA.Exaposteilarion3.melody
ltx/swh_redirects_oak/me.m11.d25:meMA.Exaposteilarion3.mode	@ltx/swh_ke_oak/me.m11.d25:meMA.Exaposteilarion3.mode
ltx/swh_redirects_oak/me.m11.d25:meMA.Exaposteilarion3.text	@ltx/swh_ke_oak/me.m11.d25:meMA.Exaposteilarion3.text
ltx/swh_redirects_oak/me.m11.d25:meMA.Kathisma11.greekmelody	@ltx/swh_ke_oak/me.m11.d25:meMA.Kathisma11.greekmelody
ltx/swh_redirects_oak/me.m11.d25:meMA.Kathisma11.incipit	@ltx/swh_ke_oak/me.m11.d25:meMA.Kathisma11.incipit
ltx/swh_redirects_oak/me.m11.d25:meMA.Kathisma11.melody	@ltx/swh_ke_oak/me.m11.d25:meMA.Kathisma11.melody
ltx/swh_redirects_oak/me.m11.d25:meMA.Kathisma11.mode	@ltx/swh_ke_oak/me.m11.d25:meMA.Kathisma11.mode
ltx/swh_redirects_oak/me.m11.d25:meMA.Kathisma11.text	@ltx/swh_ke_oak/me.m11.d25:meMA.Kathisma11.text
ltx/swh_redirects_oak/me.m11.d25:meMA.Kathisma12.greekmelody	@ltx/swh_ke_oak/me.m11.d25:meMA.Kathisma12.greekmelody
ltx/swh_redirects_oak/me.m11.d25:meMA.Kathisma12.incipit	@ltx/swh_ke_oak/me.m11.d25:meMA.Kathisma12.incipit
ltx/swh_redirects_oak/me.m11.d25:meMA.Kathisma12.melody	@ltx/swh_ke_oak/me.m11.d25:meMA.Kathisma12.melody
ltx/swh_redirects_oak/me.m11.d25:meMA.Kathisma12.mode	@ltx/swh_ke_oak/me.m11.d25:meMA.Kathisma12.mode
ltx/swh_redirects_oak/me.m11.d25:meMA.Kathisma12.text	@ltx/swh_ke_oak/me.m11.d25:meMA.Kathisma12.text
ltx/swh_redirects_oak/me.m11.d25:meMA.Kathisma21.greekmelody	@ltx/swh_ke_oak/me.m11.d25:meMA.Kathisma21.greekmelody
ltx/swh_redirects_oak/me.m11.d25:meMA.Kathisma21.incipit	@ltx/swh_ke_oak/me.m11.d25:meMA.Kathisma21.incipit
ltx/swh_redirects_oak/me.m11.d25:meMA.Kathisma21.melody	@ltx/swh_ke_oak/me.m11.d25:meMA.Kathisma21.melody
ltx/swh_redirects_oak/me.m11.d25:meMA.Kathisma21.mode	@ltx/swh_ke_oak/me.m11.d25:meMA.Kathisma21.mode
ltx/swh_redirects_oak/me.m11.d25:meMA.Kathisma21.text	@ltx/swh_ke_oak/me.m11.d25:meMA.Kathisma21.text
ltx/swh_redirects_oak/me.m11.d25:meMA.Kathisma22.greekmelody	@ltx/swh_ke_oak/me.m11.d25:meMA.Kathisma22.greekmelody
ltx/swh_redirects_oak/me.m11.d25:meMA.Kathisma22.incipit	@ltx/swh_ke_oak/me.m11.d25:meMA.Kathisma22.incipit
ltx/swh_redirects_oak/me.m11.d25:meMA.Kathisma22.melody	@ltx/swh_ke_oak/me.m11.d25:meMA.Kathisma22.melody
ltx/swh_redirects_oak/me.m11.d25:meMA.Kathisma22.mode	@ltx/swh_ke_oak/me.m11.d25:meMA.Kathisma22.mode
ltx/swh_redirects_oak/me.m11.d25:meMA.Kathisma22.text	@ltx/swh_ke_oak/me.m11.d25:meMA.Kathisma22.text
ltx/swh_redirects_oak/me.m11.d25:meMA.Kathisma31.greekmelody	@ltx/swh_ke_oak/me.m11.d25:meMA.Kathisma31.greekmelody
ltx/swh_redirects_oak/me.m11.d25:meMA.Kathisma31.incipit	@ltx/swh_ke_oak/me.m11.d25:meMA.Kathisma31.incipit
ltx/swh_redirects_oak/me.m11.d25:meMA.Kathisma31.melody	@ltx/swh_ke_oak/me.m11.d25:meMA.Kathisma31.melody
ltx/swh_redirects_oak/me.m11.d25:meMA.Kathisma31.mode	@ltx/swh_ke_oak/me.m11.d25:meMA.Kathisma31.mode
ltx/swh_redirects_oak/me.m11.d25:meMA.Kathisma31.text	@ltx/swh_ke_oak/me.m11.d25:meMA.Kathisma31.text
ltx/swh_redirects_oak/me.m11.d25:meMA.Kathisma32.greekmelody	@ltx/swh_ke_oak/me.m11.d25:meMA.Kathisma32.greekmelody
ltx/swh_redirects_oak/me.m11.d25:meMA.Kathisma32.incipit	@ltx/swh_ke_oak/me.m11.d25:meMA.Kathisma32.incipit
ltx/swh_redirects_oak/me.m11.d25:meMA.Kathisma32.melody	@ltx/swh_ke_oak/me.m11.d25:meMA.Kathisma32.melody
ltx/swh_redirects_oak/me.m11.d25:meMA.Kathisma32.mode	@ltx/swh_ke_oak/me.m11.d25:meMA.Kathisma32.mode
ltx/swh_redirects_oak/me.m11.d25:meMA.Kathisma32.text	@ltx/swh_ke_oak/me.m11.d25:meMA.Kathisma32.text
ltx/swh_redirects_oak/me.m11.d25:meMA.Kontakion1.greekmelody	@ltx/swh_ke_oak/me.m11.d25:meMA.Kontakion1.greekmelody
ltx/swh_redirects_oak/me.m11.d25:meMA.Kontakion1.incipit	@ltx/swh_ke_oak/me.m11.d25:meMA.Kontakion1.incipit
ltx/swh_redirects_oak/me.m11.d25:meMA.Kontakion1.melody	@ltx/swh_ke_oak/me.m11.d25:meMA.Kontakion1.melody
ltx/swh_redirects_oak/me.m11.d25:meMA.Kontakion1.mode	@ltx/swh_ke_oak/me.m11.d25:meMA.Kontakion1.mode
ltx/swh_redirects_oak/me.m11.d25:meMA.Kontakion1.text	@ltx/swh_ke_oak/me.m11.d25:meMA.Kontakion1.text
ltx/swh_redirects_oak/me.m11.d25:meMA.Lauds1.greekmelody	@ltx/swh_ke_oak/me.m11.d25:meMA.Lauds1.greekmelody
ltx/swh_redirects_oak/me.m11.d25:meMA.Lauds1.incipit	@ltx/swh_ke_oak/me.m11.d25:meMA.Lauds1.incipit
ltx/swh_redirects_oak/me.m11.d25:meMA.Lauds1.melody	@ltx/swh_ke_oak/me.m11.d25:meMA.Lauds1.melody
ltx/swh_redirects_oak/me.m11.d25:meMA.Lauds1.mode	@ltx/swh_ke_oak/me.m11.d25:meMA.Lauds1.mode
ltx/swh_redirects_oak/me.m11.d25:meMA.Lauds1.text	@ltx/swh_ke_oak/me.m11.d25:meMA.Lauds1.text
ltx/swh_redirects_oak/me.m11.d25:meMA.Lauds2.incipit	@ltx/swh_ke_oak/me.m11.d25:meMA.Lauds2.incipit
ltx/swh_redirects_oak/me.m11.d25:meMA.Lauds2.melody	@ltx/swh_ke_oak/me.m11.d25:meMA.Lauds2.melody
ltx/swh_redirects_oak/me.m11.d25:meMA.Lauds2.mode	@ltx/swh_ke_oak/me.m11.d25:meMA.Lauds2.mode
ltx/swh_redirects_oak/me.m11.d25:meMA.Lauds2.text	@ltx/swh_ke_oak/me.m11.d25:meMA.Lauds2.text
ltx/swh_redirects_oak/me.m11.d25:meMA.Lauds3.incipit	@ltx/swh_ke_oak/me.m11.d25:meMA.Lauds3.incipit
ltx/swh_redirects_oak/me.m11.d25:meMA.Lauds3.melody	@ltx/swh_ke_oak/me.m11.d25:meMA.Lauds3.melody
ltx/swh_redirects_oak/me.m11.d25:meMA.Lauds3.mode	@ltx/swh_ke_oak/me.m11.d25:meMA.Lauds3.mode
ltx/swh_redirects_oak/me.m11.d25:meMA.Lauds3.text	@ltx/swh_ke_oak/me.m11.d25:meMA.Lauds3.text
ltx/swh_redirects_oak/me.m11.d25:meMA.Lauds4.greekmelody	@ltx/swh_ke_oak/me.m11.d25:meMA.Lauds4.greekmelody
ltx/swh_redirects_oak/me.m11.d25:meMA.Lauds4.incipit	@ltx/swh_ke_oak/me.m11.d25:meMA.Lauds4.incipit
ltx/swh_redirects_oak/me.m11.d25:meMA.Lauds4.melody	@ltx/swh_ke_oak/me.m11.d25:meMA.Lauds4.melody
ltx/swh_redirects_oak/me.m11.d25:meMA.Lauds4.mode	@ltx/swh_ke_oak/me.m11.d25:meMA.Lauds4.mode
ltx/swh_redirects_oak/me.m11.d25:meMA.Lauds4.text	@ltx/swh_ke_oak/me.m11.d25:meMA.Lauds4.text
ltx/swh_redirects_oak/me.m11.d25:meMA.Lauds5.incipit	@ltx/swh_ke_oak/me.m11.d25:meMA.Lauds5.incipit
ltx/swh_redirects_oak/me.m11.d25:meMA.Lauds5.melody	@ltx/swh_ke_oak/me.m11.d25:meMA.Lauds5.melody
ltx/swh_redirects_oak/me.m11.d25:meMA.Lauds5.mode	@ltx/swh_ke_oak/me.m11.d25:meMA.Lauds5.mode
ltx/swh_redirects_oak/me.m11.d25:meMA.Lauds5.text	@ltx/swh_ke_oak/me.m11.d25:meMA.Lauds5.text
ltx/swh_redirects_oak/me.m11.d25:meMA.Lauds6.incipit	@ltx/swh_ke_oak/me.m11.d25:meMA.Lauds6.incipit
ltx/swh_redirects_oak/me.m11.d25:meMA.Lauds6.melody	@ltx/swh_ke_oak/me.m11.d25:meMA.Lauds6.melody
ltx/swh_redirects_oak/me.m11.d25:meMA.Lauds6.mode	@ltx/swh_ke_oak/me.m11.d25:meMA.Lauds6.mode
ltx/swh_redirects_oak/me.m11.d25:meMA.Lauds6.text	@ltx/swh_ke_oak/me.m11.d25:meMA.Lauds6.text
ltx/swh_redirects_oak/me.m11.d25:meMA.LaudsBoth.incipit	@ltx/swh_ke_oak/me.m11.d25:meMA.LaudsBoth.incipit
ltx/swh_redirects_oak/me.m11.d25:meMA.LaudsBoth.melody	@ltx/swh_ke_oak/me.m11.d25:meMA.LaudsBoth.melody
ltx/swh_redirects_oak/me.m11.d25:meMA.LaudsBoth.mode	@ltx/swh_ke_oak/me.m11.d25:meMA.LaudsBoth.mode
ltx/swh_redirects_oak/me.m11.d25:meMA.LaudsBoth.text	@ltx/swh_ke_oak/me.m11.d25:meMA.LaudsBoth.text
ltx/swh_redirects_oak/me.m11.d25:meMA.LaudsGlory.incipit	@ltx/swh_ke_oak/me.m11.d25:meMA.LaudsGlory.incipit
ltx/swh_redirects_oak/me.m11.d25:meMA.LaudsGlory.melody	@ltx/swh_ke_oak/me.m11.d25:meMA.LaudsGlory.melody
ltx/swh_redirects_oak/me.m11.d25:meMA.LaudsGlory.mode	@ltx/swh_ke_oak/me.m11.d25:meMA.LaudsGlory.mode
ltx/swh_redirects_oak/me.m11.d25:meMA.LaudsGlory.text	@ltx/swh_ke_oak/me.m11.d25:meMA.LaudsGlory.text
ltx/swh_redirects_oak/me.m11.d25:meMA.MM.Lauds123as123.text	@ltx/swh_ke_oak/me.m11.d25:meMA.MM.Lauds123as123.text
ltx/swh_redirects_oak/me.m11.d25:meMA.MM.Lauds12as45.text	@ltx/swh_ke_oak/me.m11.d25:meMA.MM.Lauds12as45.text
ltx/swh_redirects_oak/me.m11.d25:meMA.MM.Lauds456as678.text	@ltx/swh_ke_oak/me.m11.d25:meMA.MM.Lauds456as678.text
ltx/swh_redirects_oak/me.m11.d25:meMA.Ode1C11.greekmelody	@ltx/swh_ke_oak/me.m11.d25:meMA.Ode1C11.greekmelody
ltx/swh_redirects_oak/me.m11.d25:meMA.Ode1C11.incipit	@ltx/swh_ke_oak/me.m11.d25:meMA.Ode1C11.incipit
ltx/swh_redirects_oak/me.m11.d25:meMA.Ode1C11.melody	@ltx/swh_ke_oak/me.m11.d25:meMA.Ode1C11.melody
ltx/swh_redirects_oak/me.m11.d25:meMA.Ode1C11.mode	@ltx/swh_ke_oak/me.m11.d25:meMA.Ode1C11.mode
ltx/swh_redirects_oak/me.m11.d25:meMA.Ode1C11.ode	@ltx/swh_ke_oak/me.m11.d25:meMA.Ode1C11.ode
ltx/swh_redirects_oak/me.m11.d25:meMA.Ode1C11.text	@ltx/swh_ke_oak/me.m11.d25:meMA.Ode1C11.text
ltx/swh_redirects_oak/me.m11.d25:meMA.Ode1C12.incipit	@ltx/swh_ke_oak/me.m11.d25:meMA.Ode1C12.incipit
ltx/swh_redirects_oak/me.m11.d25:meMA.Ode1C12.melody	@ltx/swh_ke_oak/me.m11.d25:meMA.Ode1C12.melody
ltx/swh_redirects_oak/me.m11.d25:meMA.Ode1C12.mode	@ltx/swh_ke_oak/me.m11.d25:meMA.Ode1C12.mode
ltx/swh_redirects_oak/me.m11.d25:meMA.Ode1C12.ode	@ltx/swh_ke_oak/me.m11.d25:meMA.Ode1C12.ode
ltx/swh_redirects_oak/me.m11.d25:meMA.Ode1C12.text	@ltx/swh_ke_oak/me.m11.d25:meMA.Ode1C12.text
ltx/swh_redirects_oak/me.m11.d25:meMA.Ode1C13.incipit	@ltx/swh_ke_oak/me.m11.d25:meMA.Ode1C13.incipit
ltx/swh_redirects_oak/me.m11.d25:meMA.Ode1C13.melody	@ltx/swh_ke_oak/me.m11.d25:meMA.Ode1C13.melody
ltx/swh_redirects_oak/me.m11.d25:meMA.Ode1C13.mode	@ltx/swh_ke_oak/me.m11.d25:meMA.Ode1C13.mode
ltx/swh_redirects_oak/me.m11.d25:meMA.Ode1C13.ode	@ltx/swh_ke_oak/me.m11.d25:meMA.Ode1C13.ode
ltx/swh_redirects_oak/me.m11.d25:meMA.Ode1C13.text	@ltx/swh_ke_oak/me.m11.d25:meMA.Ode1C13.text
ltx/swh_redirects_oak/me.m11.d25:meMA.Ode1C14.incipit	@ltx/swh_ke_oak/me.m11.d25:meMA.Ode1C14.incipit
ltx/swh_redirects_oak/me.m11.d25:meMA.Ode1C14.melody	@ltx/swh_ke_oak/me.m11.d25:meMA.Ode1C14.melody
ltx/swh_redirects_oak/me.m11.d25:meMA.Ode1C14.mode	@ltx/swh_ke_oak/me.m11.d25:meMA.Ode1C14.mode
ltx/swh_redirects_oak/me.m11.d25:meMA.Ode1C14.ode	@ltx/swh_ke_oak/me.m11.d25:meMA.Ode1C14.ode
ltx/swh_redirects_oak/me.m11.d25:meMA.Ode1C14.text	@ltx/swh_ke_oak/me.m11.d25:meMA.Ode1C14.text
ltx/swh_redirects_oak/me.m11.d25:meMA.Ode1C1T.incipit	@ltx/swh_ke_oak/me.m11.d25:meMA.Ode1C1T.incipit
ltx/swh_redirects_oak/me.m11.d25:meMA.Ode1C1T.melody	@ltx/swh_ke_oak/me.m11.d25:meMA.Ode1C1T.melody
ltx/swh_redirects_oak/me.m11.d25:meMA.Ode1C1T.mode	@ltx/swh_ke_oak/me.m11.d25:meMA.Ode1C1T.mode
ltx/swh_redirects_oak/me.m11.d25:meMA.Ode1C1T.ode	@ltx/swh_ke_oak/me.m11.d25:meMA.Ode1C1T.ode
ltx/swh_redirects_oak/me.m11.d25:meMA.Ode1C1T.text	@ltx/swh_ke_oak/me.m11.d25:meMA.Ode1C1T.text
ltx/swh_redirects_oak/me.m11.d25:meMA.Ode1C21.greekmelody	@ltx/swh_ke_oak/me.m11.d25:meMA.Ode1C21.greekmelody
ltx/swh_redirects_oak/me.m11.d25:meMA.Ode1C21.incipit	@ltx/swh_ke_oak/me.m11.d25:meMA.Ode1C21.incipit
ltx/swh_redirects_oak/me.m11.d25:meMA.Ode1C21.melody	@ltx/swh_ke_oak/me.m11.d25:meMA.Ode1C21.melody
ltx/swh_redirects_oak/me.m11.d25:meMA.Ode1C21.mode	@ltx/swh_ke_oak/me.m11.d25:meMA.Ode1C21.mode
ltx/swh_redirects_oak/me.m11.d25:meMA.Ode1C21.ode	@ltx/swh_ke_oak/me.m11.d25:meMA.Ode1C21.ode
ltx/swh_redirects_oak/me.m11.d25:meMA.Ode1C21.text	@ltx/swh_ke_oak/me.m11.d25:meMA.Ode1C21.text
ltx/swh_redirects_oak/me.m11.d25:meMA.Ode1C22.incipit	@ltx/swh_ke_oak/me.m11.d25:meMA.Ode1C22.incipit
ltx/swh_redirects_oak/me.m11.d25:meMA.Ode1C22.melody	@ltx/swh_ke_oak/me.m11.d25:meMA.Ode1C22.melody
ltx/swh_redirects_oak/me.m11.d25:meMA.Ode1C22.mode	@ltx/swh_ke_oak/me.m11.d25:meMA.Ode1C22.mode
ltx/swh_redirects_oak/me.m11.d25:meMA.Ode1C22.ode	@ltx/swh_ke_oak/me.m11.d25:meMA.Ode1C22.ode
ltx/swh_redirects_oak/me.m11.d25:meMA.Ode1C22.text	@ltx/swh_ke_oak/me.m11.d25:meMA.Ode1C22.text
ltx/swh_redirects_oak/me.m11.d25:meMA.Ode1C23.incipit	@ltx/swh_ke_oak/me.m11.d25:meMA.Ode1C23.incipit
ltx/swh_redirects_oak/me.m11.d25:meMA.Ode1C23.melody	@ltx/swh_ke_oak/me.m11.d25:meMA.Ode1C23.melody
ltx/swh_redirects_oak/me.m11.d25:meMA.Ode1C23.mode	@ltx/swh_ke_oak/me.m11.d25:meMA.Ode1C23.mode
ltx/swh_redirects_oak/me.m11.d25:meMA.Ode1C23.ode	@ltx/swh_ke_oak/me.m11.d25:meMA.Ode1C23.ode
ltx/swh_redirects_oak/me.m11.d25:meMA.Ode1C23.text	@ltx/swh_ke_oak/me.m11.d25:meMA.Ode1C23.text
ltx/swh_redirects_oak/me.m11.d25:meMA.Ode1C2T.incipit	@ltx/swh_ke_oak/me.m11.d25:meMA.Ode1C2T.incipit
ltx/swh_redirects_oak/me.m11.d25:meMA.Ode1C2T.melody	@ltx/swh_ke_oak/me.m11.d25:meMA.Ode1C2T.melody
ltx/swh_redirects_oak/me.m11.d25:meMA.Ode1C2T.mode	@ltx/swh_ke_oak/me.m11.d25:meMA.Ode1C2T.mode
ltx/swh_redirects_oak/me.m11.d25:meMA.Ode1C2T.ode	@ltx/swh_ke_oak/me.m11.d25:meMA.Ode1C2T.ode
ltx/swh_redirects_oak/me.m11.d25:meMA.Ode1C2T.text	@ltx/swh_ke_oak/me.m11.d25:meMA.Ode1C2T.text
ltx/swh_redirects_oak/me.m11.d25:meMA.Ode3C11.greekmelody	@ltx/swh_ke_oak/me.m11.d25:meMA.Ode3C11.greekmelody
ltx/swh_redirects_oak/me.m11.d25:meMA.Ode3C11.incipit	@ltx/swh_ke_oak/me.m11.d25:meMA.Ode3C11.incipit
ltx/swh_redirects_oak/me.m11.d25:meMA.Ode3C11.melody	@ltx/swh_ke_oak/me.m11.d25:meMA.Ode3C11.melody
ltx/swh_redirects_oak/me.m11.d25:meMA.Ode3C11.mode	@ltx/swh_ke_oak/me.m11.d25:meMA.Ode3C11.mode
ltx/swh_redirects_oak/me.m11.d25:meMA.Ode3C11.ode	@ltx/swh_ke_oak/me.m11.d25:meMA.Ode3C11.ode
ltx/swh_redirects_oak/me.m11.d25:meMA.Ode3C11.text	@ltx/swh_ke_oak/me.m11.d25:meMA.Ode3C11.text
ltx/swh_redirects_oak/me.m11.d25:meMA.Ode3C12.incipit	@ltx/swh_ke_oak/me.m11.d25:meMA.Ode3C12.incipit
ltx/swh_redirects_oak/me.m11.d25:meMA.Ode3C12.melody	@ltx/swh_ke_oak/me.m11.d25:meMA.Ode3C12.melody
ltx/swh_redirects_oak/me.m11.d25:meMA.Ode3C12.mode	@ltx/swh_ke_oak/me.m11.d25:meMA.Ode3C12.mode
ltx/swh_redirects_oak/me.m11.d25:meMA.Ode3C12.ode	@ltx/swh_ke_oak/me.m11.d25:meMA.Ode3C12.ode
ltx/swh_redirects_oak/me.m11.d25:meMA.Ode3C12.text	@ltx/swh_ke_oak/me.m11.d25:meMA.Ode3C12.text
ltx/swh_redirects_oak/me.m11.d25:meMA.Ode3C13.incipit	@ltx/swh_ke_oak/me.m11.d25:meMA.Ode3C13.incipit
ltx/swh_redirects_oak/me.m11.d25:meMA.Ode3C13.melody	@ltx/swh_ke_oak/me.m11.d25:meMA.Ode3C13.melody
ltx/swh_redirects_oak/me.m11.d25:meMA.Ode3C13.mode	@ltx/swh_ke_oak/me.m11.d25:meMA.Ode3C13.mode
ltx/swh_redirects_oak/me.m11.d25:meMA.Ode3C13.ode	@ltx/swh_ke_oak/me.m11.d25:meMA.Ode3C13.ode
ltx/swh_redirects_oak/me.m11.d25:meMA.Ode3C13.text	@ltx/swh_ke_oak/me.m11.d25:meMA.Ode3C13.text
ltx/swh_redirects_oak/me.m11.d25:meMA.Ode3C1T.incipit	@ltx/swh_ke_oak/me.m11.d25:meMA.Ode3C1T.incipit
ltx/swh_redirects_oak/me.m11.d25:meMA.Ode3C1T.melody	@ltx/swh_ke_oak/me.m11.d25:meMA.Ode3C1T.melody
ltx/swh_redirects_oak/me.m11.d25:meMA.Ode3C1T.mode	@ltx/swh_ke_oak/me.m11.d25:meMA.Ode3C1T.mode
ltx/swh_redirects_oak/me.m11.d25:meMA.Ode3C1T.ode	@ltx/swh_ke_oak/me.m11.d25:meMA.Ode3C1T.ode
ltx/swh_redirects_oak/me.m11.d25:meMA.Ode3C1T.text	@ltx/swh_ke_oak/me.m11.d25:meMA.Ode3C1T.text
ltx/swh_redirects_oak/me.m11.d25:meMA.Ode3C21.greekmelody	@ltx/swh_ke_oak/me.m11.d25:meMA.Ode3C21.greekmelody
ltx/swh_redirects_oak/me.m11.d25:meMA.Ode3C21.incipit	@ltx/swh_ke_oak/me.m11.d25:meMA.Ode3C21.incipit
ltx/swh_redirects_oak/me.m11.d25:meMA.Ode3C21.melody	@ltx/swh_ke_oak/me.m11.d25:meMA.Ode3C21.melody
ltx/swh_redirects_oak/me.m11.d25:meMA.Ode3C21.mode	@ltx/swh_ke_oak/me.m11.d25:meMA.Ode3C21.mode
ltx/swh_redirects_oak/me.m11.d25:meMA.Ode3C21.ode	@ltx/swh_ke_oak/me.m11.d25:meMA.Ode3C21.ode
ltx/swh_redirects_oak/me.m11.d25:meMA.Ode3C21.text	@ltx/swh_ke_oak/me.m11.d25:meMA.Ode3C21.text
ltx/swh_redirects_oak/me.m11.d25:meMA.Ode3C22.incipit	@ltx/swh_ke_oak/me.m11.d25:meMA.Ode3C22.incipit
ltx/swh_redirects_oak/me.m11.d25:meMA.Ode3C22.melody	@ltx/swh_ke_oak/me.m11.d25:meMA.Ode3C22.melody
ltx/swh_redirects_oak/me.m11.d25:meMA.Ode3C22.mode	@ltx/swh_ke_oak/me.m11.d25:meMA.Ode3C22.mode
ltx/swh_redirects_oak/me.m11.d25:meMA.Ode3C22.ode	@ltx/swh_ke_oak/me.m11.d25:meMA.Ode3C22.ode
ltx/swh_redirects_oak/me.m11.d25:meMA.Ode3C22.text	@ltx/swh_ke_oak/me.m11.d25:meMA.Ode3C22.text
ltx/swh_redirects_oak/me.m11.d25:meMA.Ode3C23.incipit	@ltx/swh_ke_oak/me.m11.d25:meMA.Ode3C23.incipit
ltx/swh_redirects_oak/me.m11.d25:meMA.Ode3C23.melody	@ltx/swh_ke_oak/me.m11.d25:meMA.Ode3C23.melody
ltx/swh_redirects_oak/me.m11.d25:meMA.Ode3C23.mode	@ltx/swh_ke_oak/me.m11.d25:meMA.Ode3C23.mode
ltx/swh_redirects_oak/me.m11.d25:meMA.Ode3C23.ode	@ltx/swh_ke_oak/me.m11.d25:meMA.Ode3C23.ode
ltx/swh_redirects_oak/me.m11.d25:meMA.Ode3C23.text	@ltx/swh_ke_oak/me.m11.d25:meMA.Ode3C23.text
ltx/swh_redirects_oak/me.m11.d25:meMA.Ode3C2T.incipit	@ltx/swh_ke_oak/me.m11.d25:meMA.Ode3C2T.incipit
ltx/swh_redirects_oak/me.m11.d25:meMA.Ode3C2T.melody	@ltx/swh_ke_oak/me.m11.d25:meMA.Ode3C2T.melody
ltx/swh_redirects_oak/me.m11.d25:meMA.Ode3C2T.mode	@ltx/swh_ke_oak/me.m11.d25:meMA.Ode3C2T.mode
ltx/swh_redirects_oak/me.m11.d25:meMA.Ode3C2T.ode	@ltx/swh_ke_oak/me.m11.d25:meMA.Ode3C2T.ode
ltx/swh_redirects_oak/me.m11.d25:meMA.Ode3C2T.text	@ltx/swh_ke_oak/me.m11.d25:meMA.Ode3C2T.text
ltx/swh_redirects_oak/me.m11.d25:meMA.Ode3Kathisma1.greekmelody	@ltx/swh_ke_oak/me.m11.d25:meMA.Ode3Kathisma1.greekmelody
ltx/swh_redirects_oak/me.m11.d25:meMA.Ode3Kathisma1.incipit	@ltx/swh_ke_oak/me.m11.d25:meMA.Ode3Kathisma1.incipit
ltx/swh_redirects_oak/me.m11.d25:meMA.Ode3Kathisma1.melody	@ltx/swh_ke_oak/me.m11.d25:meMA.Ode3Kathisma1.melody
ltx/swh_redirects_oak/me.m11.d25:meMA.Ode3Kathisma1.mode	@ltx/swh_ke_oak/me.m11.d25:meMA.Ode3Kathisma1.mode
ltx/swh_redirects_oak/me.m11.d25:meMA.Ode3Kathisma1.text	@ltx/swh_ke_oak/me.m11.d25:meMA.Ode3Kathisma1.text
ltx/swh_redirects_oak/me.m11.d25:meMA.Ode3Kathisma2.greekmelody	@ltx/swh_ke_oak/me.m11.d25:meMA.Ode3Kathisma2.greekmelody
ltx/swh_redirects_oak/me.m11.d25:meMA.Ode3Kathisma2.incipit	@ltx/swh_ke_oak/me.m11.d25:meMA.Ode3Kathisma2.incipit
ltx/swh_redirects_oak/me.m11.d25:meMA.Ode3Kathisma2.melody	@ltx/swh_ke_oak/me.m11.d25:meMA.Ode3Kathisma2.melody
ltx/swh_redirects_oak/me.m11.d25:meMA.Ode3Kathisma2.mode	@ltx/swh_ke_oak/me.m11.d25:meMA.Ode3Kathisma2.mode
ltx/swh_redirects_oak/me.m11.d25:meMA.Ode3Kathisma2.text	@ltx/swh_ke_oak/me.m11.d25:meMA.Ode3Kathisma2.text
ltx/swh_redirects_oak/me.m11.d25:meMA.Ode3Kathisma3.greekmelody	@ltx/swh_ke_oak/me.m11.d25:meMA.Ode3Kathisma3.greekmelody
ltx/swh_redirects_oak/me.m11.d25:meMA.Ode3Kathisma3.incipit	@ltx/swh_ke_oak/me.m11.d25:meMA.Ode3Kathisma3.incipit
ltx/swh_redirects_oak/me.m11.d25:meMA.Ode3Kathisma3.melody	@ltx/swh_ke_oak/me.m11.d25:meMA.Ode3Kathisma3.melody
ltx/swh_redirects_oak/me.m11.d25:meMA.Ode3Kathisma3.mode	@ltx/swh_ke_oak/me.m11.d25:meMA.Ode3Kathisma3.mode
ltx/swh_redirects_oak/me.m11.d25:meMA.Ode3Kathisma3.text	@ltx/swh_ke_oak/me.m11.d25:meMA.Ode3Kathisma3.text
ltx/swh_redirects_oak/me.m11.d25:meMA.Ode4C11.greekmelody	@ltx/swh_ke_oak/me.m11.d25:meMA.Ode4C11.greekmelody
ltx/swh_redirects_oak/me.m11.d25:meMA.Ode4C11.incipit	@ltx/swh_ke_oak/me.m11.d25:meMA.Ode4C11.incipit
ltx/swh_redirects_oak/me.m11.d25:meMA.Ode4C11.melody	@ltx/swh_ke_oak/me.m11.d25:meMA.Ode4C11.melody
ltx/swh_redirects_oak/me.m11.d25:meMA.Ode4C11.mode	@ltx/swh_ke_oak/me.m11.d25:meMA.Ode4C11.mode
ltx/swh_redirects_oak/me.m11.d25:meMA.Ode4C11.ode	@ltx/swh_ke_oak/me.m11.d25:meMA.Ode4C11.ode
ltx/swh_redirects_oak/me.m11.d25:meMA.Ode4C11.text	@ltx/swh_ke_oak/me.m11.d25:meMA.Ode4C11.text
ltx/swh_redirects_oak/me.m11.d25:meMA.Ode4C12.incipit	@ltx/swh_ke_oak/me.m11.d25:meMA.Ode4C12.incipit
ltx/swh_redirects_oak/me.m11.d25:meMA.Ode4C12.melody	@ltx/swh_ke_oak/me.m11.d25:meMA.Ode4C12.melody
ltx/swh_redirects_oak/me.m11.d25:meMA.Ode4C12.mode	@ltx/swh_ke_oak/me.m11.d25:meMA.Ode4C12.mode
ltx/swh_redirects_oak/me.m11.d25:meMA.Ode4C12.ode	@ltx/swh_ke_oak/me.m11.d25:meMA.Ode4C12.ode
ltx/swh_redirects_oak/me.m11.d25:meMA.Ode4C12.text	@ltx/swh_ke_oak/me.m11.d25:meMA.Ode4C12.text
ltx/swh_redirects_oak/me.m11.d25:meMA.Ode4C13.incipit	@ltx/swh_ke_oak/me.m11.d25:meMA.Ode4C13.incipit
ltx/swh_redirects_oak/me.m11.d25:meMA.Ode4C13.melody	@ltx/swh_ke_oak/me.m11.d25:meMA.Ode4C13.melody
ltx/swh_redirects_oak/me.m11.d25:meMA.Ode4C13.mode	@ltx/swh_ke_oak/me.m11.d25:meMA.Ode4C13.mode
ltx/swh_redirects_oak/me.m11.d25:meMA.Ode4C13.ode	@ltx/swh_ke_oak/me.m11.d25:meMA.Ode4C13.ode
ltx/swh_redirects_oak/me.m11.d25:meMA.Ode4C13.text	@ltx/swh_ke_oak/me.m11.d25:meMA.Ode4C13.text
ltx/swh_redirects_oak/me.m11.d25:meMA.Ode4C14.incipit	@ltx/swh_ke_oak/me.m11.d25:meMA.Ode4C14.incipit
ltx/swh_redirects_oak/me.m11.d25:meMA.Ode4C14.melody	@ltx/swh_ke_oak/me.m11.d25:meMA.Ode4C14.melody
ltx/swh_redirects_oak/me.m11.d25:meMA.Ode4C14.mode	@ltx/swh_ke_oak/me.m11.d25:meMA.Ode4C14.mode
ltx/swh_redirects_oak/me.m11.d25:meMA.Ode4C14.ode	@ltx/swh_ke_oak/me.m11.d25:meMA.Ode4C14.ode
ltx/swh_redirects_oak/me.m11.d25:meMA.Ode4C14.text	@ltx/swh_ke_oak/me.m11.d25:meMA.Ode4C14.text
ltx/swh_redirects_oak/me.m11.d25:meMA.Ode4C1T.incipit	@ltx/swh_ke_oak/me.m11.d25:meMA.Ode4C1T.incipit
ltx/swh_redirects_oak/me.m11.d25:meMA.Ode4C1T.melody	@ltx/swh_ke_oak/me.m11.d25:meMA.Ode4C1T.melody
ltx/swh_redirects_oak/me.m11.d25:meMA.Ode4C1T.mode	@ltx/swh_ke_oak/me.m11.d25:meMA.Ode4C1T.mode
ltx/swh_redirects_oak/me.m11.d25:meMA.Ode4C1T.ode	@ltx/swh_ke_oak/me.m11.d25:meMA.Ode4C1T.ode
ltx/swh_redirects_oak/me.m11.d25:meMA.Ode4C1T.text	@ltx/swh_ke_oak/me.m11.d25:meMA.Ode4C1T.text
ltx/swh_redirects_oak/me.m11.d25:meMA.Ode4C21.greekmelody	@ltx/swh_ke_oak/me.m11.d25:meMA.Ode4C21.greekmelody
ltx/swh_redirects_oak/me.m11.d25:meMA.Ode4C21.incipit	@ltx/swh_ke_oak/me.m11.d25:meMA.Ode4C21.incipit
ltx/swh_redirects_oak/me.m11.d25:meMA.Ode4C21.melody	@ltx/swh_ke_oak/me.m11.d25:meMA.Ode4C21.melody
ltx/swh_redirects_oak/me.m11.d25:meMA.Ode4C21.mode	@ltx/swh_ke_oak/me.m11.d25:meMA.Ode4C21.mode
ltx/swh_redirects_oak/me.m11.d25:meMA.Ode4C21.ode	@ltx/swh_ke_oak/me.m11.d25:meMA.Ode4C21.ode
ltx/swh_redirects_oak/me.m11.d25:meMA.Ode4C21.text	@ltx/swh_ke_oak/me.m11.d25:meMA.Ode4C21.text
ltx/swh_redirects_oak/me.m11.d25:meMA.Ode4C22.incipit	@ltx/swh_ke_oak/me.m11.d25:meMA.Ode4C22.incipit
ltx/swh_redirects_oak/me.m11.d25:meMA.Ode4C22.melody	@ltx/swh_ke_oak/me.m11.d25:meMA.Ode4C22.melody
ltx/swh_redirects_oak/me.m11.d25:meMA.Ode4C22.mode	@ltx/swh_ke_oak/me.m11.d25:meMA.Ode4C22.mode
ltx/swh_redirects_oak/me.m11.d25:meMA.Ode4C22.ode	@ltx/swh_ke_oak/me.m11.d25:meMA.Ode4C22.ode
ltx/swh_redirects_oak/me.m11.d25:meMA.Ode4C22.text	@ltx/swh_ke_oak/me.m11.d25:meMA.Ode4C22.text
ltx/swh_redirects_oak/me.m11.d25:meMA.Ode4C23.incipit	@ltx/swh_ke_oak/me.m11.d25:meMA.Ode4C23.incipit
ltx/swh_redirects_oak/me.m11.d25:meMA.Ode4C23.melody	@ltx/swh_ke_oak/me.m11.d25:meMA.Ode4C23.melody
ltx/swh_redirects_oak/me.m11.d25:meMA.Ode4C23.mode	@ltx/swh_ke_oak/me.m11.d25:meMA.Ode4C23.mode
ltx/swh_redirects_oak/me.m11.d25:meMA.Ode4C23.ode	@ltx/swh_ke_oak/me.m11.d25:meMA.Ode4C23.ode
ltx/swh_redirects_oak/me.m11.d25:meMA.Ode4C23.text	@ltx/swh_ke_oak/me.m11.d25:meMA.Ode4C23.text
ltx/swh_redirects_oak/me.m11.d25:meMA.Ode4C2T.incipit	@ltx/swh_ke_oak/me.m11.d25:meMA.Ode4C2T.incipit
ltx/swh_redirects_oak/me.m11.d25:meMA.Ode4C2T.melody	@ltx/swh_ke_oak/me.m11.d25:meMA.Ode4C2T.melody
ltx/swh_redirects_oak/me.m11.d25:meMA.Ode4C2T.mode	@ltx/swh_ke_oak/me.m11.d25:meMA.Ode4C2T.mode
ltx/swh_redirects_oak/me.m11.d25:meMA.Ode4C2T.ode	@ltx/swh_ke_oak/me.m11.d25:meMA.Ode4C2T.ode
ltx/swh_redirects_oak/me.m11.d25:meMA.Ode4C2T.text	@ltx/swh_ke_oak/me.m11.d25:meMA.Ode4C2T.text
ltx/swh_redirects_oak/me.m11.d25:meMA.Ode5C11.greekmelody	@ltx/swh_ke_oak/me.m11.d25:meMA.Ode5C11.greekmelody
ltx/swh_redirects_oak/me.m11.d25:meMA.Ode5C11.incipit	@ltx/swh_ke_oak/me.m11.d25:meMA.Ode5C11.incipit
ltx/swh_redirects_oak/me.m11.d25:meMA.Ode5C11.melody	@ltx/swh_ke_oak/me.m11.d25:meMA.Ode5C11.melody
ltx/swh_redirects_oak/me.m11.d25:meMA.Ode5C11.mode	@ltx/swh_ke_oak/me.m11.d25:meMA.Ode5C11.mode
ltx/swh_redirects_oak/me.m11.d25:meMA.Ode5C11.ode	@ltx/swh_ke_oak/me.m11.d25:meMA.Ode5C11.ode
ltx/swh_redirects_oak/me.m11.d25:meMA.Ode5C11.text	@ltx/swh_ke_oak/me.m11.d25:meMA.Ode5C11.text
ltx/swh_redirects_oak/me.m11.d25:meMA.Ode5C12.incipit	@ltx/swh_ke_oak/me.m11.d25:meMA.Ode5C12.incipit
ltx/swh_redirects_oak/me.m11.d25:meMA.Ode5C12.melody	@ltx/swh_ke_oak/me.m11.d25:meMA.Ode5C12.melody
ltx/swh_redirects_oak/me.m11.d25:meMA.Ode5C12.mode	@ltx/swh_ke_oak/me.m11.d25:meMA.Ode5C12.mode
ltx/swh_redirects_oak/me.m11.d25:meMA.Ode5C12.ode	@ltx/swh_ke_oak/me.m11.d25:meMA.Ode5C12.ode
ltx/swh_redirects_oak/me.m11.d25:meMA.Ode5C12.text	@ltx/swh_ke_oak/me.m11.d25:meMA.Ode5C12.text
ltx/swh_redirects_oak/me.m11.d25:meMA.Ode5C13.incipit	@ltx/swh_ke_oak/me.m11.d25:meMA.Ode5C13.incipit
ltx/swh_redirects_oak/me.m11.d25:meMA.Ode5C13.melody	@ltx/swh_ke_oak/me.m11.d25:meMA.Ode5C13.melody
ltx/swh_redirects_oak/me.m11.d25:meMA.Ode5C13.mode	@ltx/swh_ke_oak/me.m11.d25:meMA.Ode5C13.mode
ltx/swh_redirects_oak/me.m11.d25:meMA.Ode5C13.ode	@ltx/swh_ke_oak/me.m11.d25:meMA.Ode5C13.ode
ltx/swh_redirects_oak/me.m11.d25:meMA.Ode5C13.text	@ltx/swh_ke_oak/me.m11.d25:meMA.Ode5C13.text
ltx/swh_redirects_oak/me.m11.d25:meMA.Ode5C1T.incipit	@ltx/swh_ke_oak/me.m11.d25:meMA.Ode5C1T.incipit
ltx/swh_redirects_oak/me.m11.d25:meMA.Ode5C1T.melody	@ltx/swh_ke_oak/me.m11.d25:meMA.Ode5C1T.melody
ltx/swh_redirects_oak/me.m11.d25:meMA.Ode5C1T.mode	@ltx/swh_ke_oak/me.m11.d25:meMA.Ode5C1T.mode
ltx/swh_redirects_oak/me.m11.d25:meMA.Ode5C1T.ode	@ltx/swh_ke_oak/me.m11.d25:meMA.Ode5C1T.ode
ltx/swh_redirects_oak/me.m11.d25:meMA.Ode5C1T.text	@ltx/swh_ke_oak/me.m11.d25:meMA.Ode5C1T.text
ltx/swh_redirects_oak/me.m11.d25:meMA.Ode5C21.greekmelody	@ltx/swh_ke_oak/me.m11.d25:meMA.Ode5C21.greekmelody
ltx/swh_redirects_oak/me.m11.d25:meMA.Ode5C21.incipit	@ltx/swh_ke_oak/me.m11.d25:meMA.Ode5C21.incipit
ltx/swh_redirects_oak/me.m11.d25:meMA.Ode5C21.melody	@ltx/swh_ke_oak/me.m11.d25:meMA.Ode5C21.melody
ltx/swh_redirects_oak/me.m11.d25:meMA.Ode5C21.mode	@ltx/swh_ke_oak/me.m11.d25:meMA.Ode5C21.mode
ltx/swh_redirects_oak/me.m11.d25:meMA.Ode5C21.ode	@ltx/swh_ke_oak/me.m11.d25:meMA.Ode5C21.ode
ltx/swh_redirects_oak/me.m11.d25:meMA.Ode5C21.text	@ltx/swh_ke_oak/me.m11.d25:meMA.Ode5C21.text
ltx/swh_redirects_oak/me.m11.d25:meMA.Ode5C22.incipit	@ltx/swh_ke_oak/me.m11.d25:meMA.Ode5C22.incipit
ltx/swh_redirects_oak/me.m11.d25:meMA.Ode5C22.melody	@ltx/swh_ke_oak/me.m11.d25:meMA.Ode5C22.melody
ltx/swh_redirects_oak/me.m11.d25:meMA.Ode5C22.mode	@ltx/swh_ke_oak/me.m11.d25:meMA.Ode5C22.mode
ltx/swh_redirects_oak/me.m11.d25:meMA.Ode5C22.ode	@ltx/swh_ke_oak/me.m11.d25:meMA.Ode5C22.ode
ltx/swh_redirects_oak/me.m11.d25:meMA.Ode5C22.text	@ltx/swh_ke_oak/me.m11.d25:meMA.Ode5C22.text
ltx/swh_redirects_oak/me.m11.d25:meMA.Ode5C23.incipit	@ltx/swh_ke_oak/me.m11.d25:meMA.Ode5C23.incipit
ltx/swh_redirects_oak/me.m11.d25:meMA.Ode5C23.melody	@ltx/swh_ke_oak/me.m11.d25:meMA.Ode5C23.melody
ltx/swh_redirects_oak/me.m11.d25:meMA.Ode5C23.mode	@ltx/swh_ke_oak/me.m11.d25:meMA.Ode5C23.mode
ltx/swh_redirects_oak/me.m11.d25:meMA.Ode5C23.ode	@ltx/swh_ke_oak/me.m11.d25:meMA.Ode5C23.ode
ltx/swh_redirects_oak/me.m11.d25:meMA.Ode5C23.text	@ltx/swh_ke_oak/me.m11.d25:meMA.Ode5C23.text
ltx/swh_redirects_oak/me.m11.d25:meMA.Ode5C2T.incipit	@ltx/swh_ke_oak/me.m11.d25:meMA.Ode5C2T.incipit
ltx/swh_redirects_oak/me.m11.d25:meMA.Ode5C2T.melody	@ltx/swh_ke_oak/me.m11.d25:meMA.Ode5C2T.melody
ltx/swh_redirects_oak/me.m11.d25:meMA.Ode5C2T.mode	@ltx/swh_ke_oak/me.m11.d25:meMA.Ode5C2T.mode
ltx/swh_redirects_oak/me.m11.d25:meMA.Ode5C2T.ode	@ltx/swh_ke_oak/me.m11.d25:meMA.Ode5C2T.ode
ltx/swh_redirects_oak/me.m11.d25:meMA.Ode5C2T.text	@ltx/swh_ke_oak/me.m11.d25:meMA.Ode5C2T.text
ltx/swh_redirects_oak/me.m11.d25:meMA.Ode6C11.greekmelody	@ltx/swh_ke_oak/me.m11.d25:meMA.Ode6C11.greekmelody
ltx/swh_redirects_oak/me.m11.d25:meMA.Ode6C11.incipit	@ltx/swh_ke_oak/me.m11.d25:meMA.Ode6C11.incipit
ltx/swh_redirects_oak/me.m11.d25:meMA.Ode6C11.melody	@ltx/swh_ke_oak/me.m11.d25:meMA.Ode6C11.melody
ltx/swh_redirects_oak/me.m11.d25:meMA.Ode6C11.mode	@ltx/swh_ke_oak/me.m11.d25:meMA.Ode6C11.mode
ltx/swh_redirects_oak/me.m11.d25:meMA.Ode6C11.ode	@ltx/swh_ke_oak/me.m11.d25:meMA.Ode6C11.ode
ltx/swh_redirects_oak/me.m11.d25:meMA.Ode6C11.text	@ltx/swh_ke_oak/me.m11.d25:meMA.Ode6C11.text
ltx/swh_redirects_oak/me.m11.d25:meMA.Ode6C12.incipit	@ltx/swh_ke_oak/me.m11.d25:meMA.Ode6C12.incipit
ltx/swh_redirects_oak/me.m11.d25:meMA.Ode6C12.melody	@ltx/swh_ke_oak/me.m11.d25:meMA.Ode6C12.melody
ltx/swh_redirects_oak/me.m11.d25:meMA.Ode6C12.mode	@ltx/swh_ke_oak/me.m11.d25:meMA.Ode6C12.mode
ltx/swh_redirects_oak/me.m11.d25:meMA.Ode6C12.ode	@ltx/swh_ke_oak/me.m11.d25:meMA.Ode6C12.ode
ltx/swh_redirects_oak/me.m11.d25:meMA.Ode6C12.text	@ltx/swh_ke_oak/me.m11.d25:meMA.Ode6C12.text
ltx/swh_redirects_oak/me.m11.d25:meMA.Ode6C13.incipit	@ltx/swh_ke_oak/me.m11.d25:meMA.Ode6C13.incipit
ltx/swh_redirects_oak/me.m11.d25:meMA.Ode6C13.melody	@ltx/swh_ke_oak/me.m11.d25:meMA.Ode6C13.melody
ltx/swh_redirects_oak/me.m11.d25:meMA.Ode6C13.mode	@ltx/swh_ke_oak/me.m11.d25:meMA.Ode6C13.mode
ltx/swh_redirects_oak/me.m11.d25:meMA.Ode6C13.ode	@ltx/swh_ke_oak/me.m11.d25:meMA.Ode6C13.ode
ltx/swh_redirects_oak/me.m11.d25:meMA.Ode6C13.text	@ltx/swh_ke_oak/me.m11.d25:meMA.Ode6C13.text
ltx/swh_redirects_oak/me.m11.d25:meMA.Ode6C1T.incipit	@ltx/swh_ke_oak/me.m11.d25:meMA.Ode6C1T.incipit
ltx/swh_redirects_oak/me.m11.d25:meMA.Ode6C1T.melody	@ltx/swh_ke_oak/me.m11.d25:meMA.Ode6C1T.melody
ltx/swh_redirects_oak/me.m11.d25:meMA.Ode6C1T.mode	@ltx/swh_ke_oak/me.m11.d25:meMA.Ode6C1T.mode
ltx/swh_redirects_oak/me.m11.d25:meMA.Ode6C1T.ode	@ltx/swh_ke_oak/me.m11.d25:meMA.Ode6C1T.ode
ltx/swh_redirects_oak/me.m11.d25:meMA.Ode6C1T.text	@ltx/swh_ke_oak/me.m11.d25:meMA.Ode6C1T.text
ltx/swh_redirects_oak/me.m11.d25:meMA.Ode6C21.greekmelody	@ltx/swh_ke_oak/me.m11.d25:meMA.Ode6C21.greekmelody
ltx/swh_redirects_oak/me.m11.d25:meMA.Ode6C21.incipit	@ltx/swh_ke_oak/me.m11.d25:meMA.Ode6C21.incipit
ltx/swh_redirects_oak/me.m11.d25:meMA.Ode6C21.melody	@ltx/swh_ke_oak/me.m11.d25:meMA.Ode6C21.melody
ltx/swh_redirects_oak/me.m11.d25:meMA.Ode6C21.mode	@ltx/swh_ke_oak/me.m11.d25:meMA.Ode6C21.mode
ltx/swh_redirects_oak/me.m11.d25:meMA.Ode6C21.ode	@ltx/swh_ke_oak/me.m11.d25:meMA.Ode6C21.ode
ltx/swh_redirects_oak/me.m11.d25:meMA.Ode6C21.text	@ltx/swh_ke_oak/me.m11.d25:meMA.Ode6C21.text
ltx/swh_redirects_oak/me.m11.d25:meMA.Ode6C22.incipit	@ltx/swh_ke_oak/me.m11.d25:meMA.Ode6C22.incipit
ltx/swh_redirects_oak/me.m11.d25:meMA.Ode6C22.melody	@ltx/swh_ke_oak/me.m11.d25:meMA.Ode6C22.melody
ltx/swh_redirects_oak/me.m11.d25:meMA.Ode6C22.mode	@ltx/swh_ke_oak/me.m11.d25:meMA.Ode6C22.mode
ltx/swh_redirects_oak/me.m11.d25:meMA.Ode6C22.ode	@ltx/swh_ke_oak/me.m11.d25:meMA.Ode6C22.ode
ltx/swh_redirects_oak/me.m11.d25:meMA.Ode6C22.text	@ltx/swh_ke_oak/me.m11.d25:meMA.Ode6C22.text
ltx/swh_redirects_oak/me.m11.d25:meMA.Ode6C23.incipit	@ltx/swh_ke_oak/me.m11.d25:meMA.Ode6C23.incipit
ltx/swh_redirects_oak/me.m11.d25:meMA.Ode6C23.melody	@ltx/swh_ke_oak/me.m11.d25:meMA.Ode6C23.melody
ltx/swh_redirects_oak/me.m11.d25:meMA.Ode6C23.mode	@ltx/swh_ke_oak/me.m11.d25:meMA.Ode6C23.mode
ltx/swh_redirects_oak/me.m11.d25:meMA.Ode6C23.ode	@ltx/swh_ke_oak/me.m11.d25:meMA.Ode6C23.ode
ltx/swh_redirects_oak/me.m11.d25:meMA.Ode6C23.text	@ltx/swh_ke_oak/me.m11.d25:meMA.Ode6C23.text
ltx/swh_redirects_oak/me.m11.d25:meMA.Ode6C2T.incipit	@ltx/swh_ke_oak/me.m11.d25:meMA.Ode6C2T.incipit
ltx/swh_redirects_oak/me.m11.d25:meMA.Ode6C2T.melody	@ltx/swh_ke_oak/me.m11.d25:meMA.Ode6C2T.melody
ltx/swh_redirects_oak/me.m11.d25:meMA.Ode6C2T.mode	@ltx/swh_ke_oak/me.m11.d25:meMA.Ode6C2T.mode
ltx/swh_redirects_oak/me.m11.d25:meMA.Ode6C2T.ode	@ltx/swh_ke_oak/me.m11.d25:meMA.Ode6C2T.ode
ltx/swh_redirects_oak/me.m11.d25:meMA.Ode6C2T.text	@ltx/swh_ke_oak/me.m11.d25:meMA.Ode6C2T.text
ltx/swh_redirects_oak/me.m11.d25:meMA.Ode7C11.greekmelody	@ltx/swh_ke_oak/me.m11.d25:meMA.Ode7C11.greekmelody
ltx/swh_redirects_oak/me.m11.d25:meMA.Ode7C11.incipit	@ltx/swh_ke_oak/me.m11.d25:meMA.Ode7C11.incipit
ltx/swh_redirects_oak/me.m11.d25:meMA.Ode7C11.melody	@ltx/swh_ke_oak/me.m11.d25:meMA.Ode7C11.melody
ltx/swh_redirects_oak/me.m11.d25:meMA.Ode7C11.mode	@ltx/swh_ke_oak/me.m11.d25:meMA.Ode7C11.mode
ltx/swh_redirects_oak/me.m11.d25:meMA.Ode7C11.ode	@ltx/swh_ke_oak/me.m11.d25:meMA.Ode7C11.ode
ltx/swh_redirects_oak/me.m11.d25:meMA.Ode7C11.text	@ltx/swh_ke_oak/me.m11.d25:meMA.Ode7C11.text
ltx/swh_redirects_oak/me.m11.d25:meMA.Ode7C12.incipit	@ltx/swh_ke_oak/me.m11.d25:meMA.Ode7C12.incipit
ltx/swh_redirects_oak/me.m11.d25:meMA.Ode7C12.melody	@ltx/swh_ke_oak/me.m11.d25:meMA.Ode7C12.melody
ltx/swh_redirects_oak/me.m11.d25:meMA.Ode7C12.mode	@ltx/swh_ke_oak/me.m11.d25:meMA.Ode7C12.mode
ltx/swh_redirects_oak/me.m11.d25:meMA.Ode7C12.ode	@ltx/swh_ke_oak/me.m11.d25:meMA.Ode7C12.ode
ltx/swh_redirects_oak/me.m11.d25:meMA.Ode7C12.text	@ltx/swh_ke_oak/me.m11.d25:meMA.Ode7C12.text
ltx/swh_redirects_oak/me.m11.d25:meMA.Ode7C13.incipit	@ltx/swh_ke_oak/me.m11.d25:meMA.Ode7C13.incipit
ltx/swh_redirects_oak/me.m11.d25:meMA.Ode7C13.melody	@ltx/swh_ke_oak/me.m11.d25:meMA.Ode7C13.melody
ltx/swh_redirects_oak/me.m11.d25:meMA.Ode7C13.mode	@ltx/swh_ke_oak/me.m11.d25:meMA.Ode7C13.mode
ltx/swh_redirects_oak/me.m11.d25:meMA.Ode7C13.ode	@ltx/swh_ke_oak/me.m11.d25:meMA.Ode7C13.ode
ltx/swh_redirects_oak/me.m11.d25:meMA.Ode7C13.text	@ltx/swh_ke_oak/me.m11.d25:meMA.Ode7C13.text
ltx/swh_redirects_oak/me.m11.d25:meMA.Ode7C1T.incipit	@ltx/swh_ke_oak/me.m11.d25:meMA.Ode7C1T.incipit
ltx/swh_redirects_oak/me.m11.d25:meMA.Ode7C1T.melody	@ltx/swh_ke_oak/me.m11.d25:meMA.Ode7C1T.melody
ltx/swh_redirects_oak/me.m11.d25:meMA.Ode7C1T.mode	@ltx/swh_ke_oak/me.m11.d25:meMA.Ode7C1T.mode
ltx/swh_redirects_oak/me.m11.d25:meMA.Ode7C1T.ode	@ltx/swh_ke_oak/me.m11.d25:meMA.Ode7C1T.ode
ltx/swh_redirects_oak/me.m11.d25:meMA.Ode7C1T.text	@ltx/swh_ke_oak/me.m11.d25:meMA.Ode7C1T.text
ltx/swh_redirects_oak/me.m11.d25:meMA.Ode7C21.greekmelody	@ltx/swh_ke_oak/me.m11.d25:meMA.Ode7C21.greekmelody
ltx/swh_redirects_oak/me.m11.d25:meMA.Ode7C21.incipit	@ltx/swh_ke_oak/me.m11.d25:meMA.Ode7C21.incipit
ltx/swh_redirects_oak/me.m11.d25:meMA.Ode7C21.melody	@ltx/swh_ke_oak/me.m11.d25:meMA.Ode7C21.melody
ltx/swh_redirects_oak/me.m11.d25:meMA.Ode7C21.mode	@ltx/swh_ke_oak/me.m11.d25:meMA.Ode7C21.mode
ltx/swh_redirects_oak/me.m11.d25:meMA.Ode7C21.ode	@ltx/swh_ke_oak/me.m11.d25:meMA.Ode7C21.ode
ltx/swh_redirects_oak/me.m11.d25:meMA.Ode7C21.text	@ltx/swh_ke_oak/me.m11.d25:meMA.Ode7C21.text
ltx/swh_redirects_oak/me.m11.d25:meMA.Ode7C22.incipit	@ltx/swh_ke_oak/me.m11.d25:meMA.Ode7C22.incipit
ltx/swh_redirects_oak/me.m11.d25:meMA.Ode7C22.melody	@ltx/swh_ke_oak/me.m11.d25:meMA.Ode7C22.melody
ltx/swh_redirects_oak/me.m11.d25:meMA.Ode7C22.mode	@ltx/swh_ke_oak/me.m11.d25:meMA.Ode7C22.mode
ltx/swh_redirects_oak/me.m11.d25:meMA.Ode7C22.ode	@ltx/swh_ke_oak/me.m11.d25:meMA.Ode7C22.ode
ltx/swh_redirects_oak/me.m11.d25:meMA.Ode7C22.text	@ltx/swh_ke_oak/me.m11.d25:meMA.Ode7C22.text
ltx/swh_redirects_oak/me.m11.d25:meMA.Ode7C23.incipit	@ltx/swh_ke_oak/me.m11.d25:meMA.Ode7C23.incipit
ltx/swh_redirects_oak/me.m11.d25:meMA.Ode7C23.melody	@ltx/swh_ke_oak/me.m11.d25:meMA.Ode7C23.melody
ltx/swh_redirects_oak/me.m11.d25:meMA.Ode7C23.mode	@ltx/swh_ke_oak/me.m11.d25:meMA.Ode7C23.mode
ltx/swh_redirects_oak/me.m11.d25:meMA.Ode7C23.ode	@ltx/swh_ke_oak/me.m11.d25:meMA.Ode7C23.ode
ltx/swh_redirects_oak/me.m11.d25:meMA.Ode7C23.text	@ltx/swh_ke_oak/me.m11.d25:meMA.Ode7C23.text
ltx/swh_redirects_oak/me.m11.d25:meMA.Ode7C24.incipit	@ltx/swh_ke_oak/me.m11.d25:meMA.Ode7C24.incipit
ltx/swh_redirects_oak/me.m11.d25:meMA.Ode7C24.melody	@ltx/swh_ke_oak/me.m11.d25:meMA.Ode7C24.melody
ltx/swh_redirects_oak/me.m11.d25:meMA.Ode7C24.mode	@ltx/swh_ke_oak/me.m11.d25:meMA.Ode7C24.mode
ltx/swh_redirects_oak/me.m11.d25:meMA.Ode7C24.ode	@ltx/swh_ke_oak/me.m11.d25:meMA.Ode7C24.ode
ltx/swh_redirects_oak/me.m11.d25:meMA.Ode7C24.text	@ltx/swh_ke_oak/me.m11.d25:meMA.Ode7C24.text
ltx/swh_redirects_oak/me.m11.d25:meMA.Ode7C2T.incipit	@ltx/swh_ke_oak/me.m11.d25:meMA.Ode7C2T.incipit
ltx/swh_redirects_oak/me.m11.d25:meMA.Ode7C2T.melody	@ltx/swh_ke_oak/me.m11.d25:meMA.Ode7C2T.melody
ltx/swh_redirects_oak/me.m11.d25:meMA.Ode7C2T.mode	@ltx/swh_ke_oak/me.m11.d25:meMA.Ode7C2T.mode
ltx/swh_redirects_oak/me.m11.d25:meMA.Ode7C2T.ode	@ltx/swh_ke_oak/me.m11.d25:meMA.Ode7C2T.ode
ltx/swh_redirects_oak/me.m11.d25:meMA.Ode7C2T.text	@ltx/swh_ke_oak/me.m11.d25:meMA.Ode7C2T.text
ltx/swh_redirects_oak/me.m11.d25:meMA.Ode8C11.greekmelody	@ltx/swh_ke_oak/me.m11.d25:meMA.Ode8C11.greekmelody
ltx/swh_redirects_oak/me.m11.d25:meMA.Ode8C11.incipit	@ltx/swh_ke_oak/me.m11.d25:meMA.Ode8C11.incipit
ltx/swh_redirects_oak/me.m11.d25:meMA.Ode8C11.melody	@ltx/swh_ke_oak/me.m11.d25:meMA.Ode8C11.melody
ltx/swh_redirects_oak/me.m11.d25:meMA.Ode8C11.mode	@ltx/swh_ke_oak/me.m11.d25:meMA.Ode8C11.mode
ltx/swh_redirects_oak/me.m11.d25:meMA.Ode8C11.ode	@ltx/swh_ke_oak/me.m11.d25:meMA.Ode8C11.ode
ltx/swh_redirects_oak/me.m11.d25:meMA.Ode8C11.text	@ltx/swh_ke_oak/me.m11.d25:meMA.Ode8C11.text
ltx/swh_redirects_oak/me.m11.d25:meMA.Ode8C12.incipit	@ltx/swh_ke_oak/me.m11.d25:meMA.Ode8C12.incipit
ltx/swh_redirects_oak/me.m11.d25:meMA.Ode8C12.melody	@ltx/swh_ke_oak/me.m11.d25:meMA.Ode8C12.melody
ltx/swh_redirects_oak/me.m11.d25:meMA.Ode8C12.mode	@ltx/swh_ke_oak/me.m11.d25:meMA.Ode8C12.mode
ltx/swh_redirects_oak/me.m11.d25:meMA.Ode8C12.ode	@ltx/swh_ke_oak/me.m11.d25:meMA.Ode8C12.ode
ltx/swh_redirects_oak/me.m11.d25:meMA.Ode8C12.text	@ltx/swh_ke_oak/me.m11.d25:meMA.Ode8C12.text
ltx/swh_redirects_oak/me.m11.d25:meMA.Ode8C13.incipit	@ltx/swh_ke_oak/me.m11.d25:meMA.Ode8C13.incipit
ltx/swh_redirects_oak/me.m11.d25:meMA.Ode8C13.melody	@ltx/swh_ke_oak/me.m11.d25:meMA.Ode8C13.melody
ltx/swh_redirects_oak/me.m11.d25:meMA.Ode8C13.mode	@ltx/swh_ke_oak/me.m11.d25:meMA.Ode8C13.mode
ltx/swh_redirects_oak/me.m11.d25:meMA.Ode8C13.ode	@ltx/swh_ke_oak/me.m11.d25:meMA.Ode8C13.ode
ltx/swh_redirects_oak/me.m11.d25:meMA.Ode8C13.text	@ltx/swh_ke_oak/me.m11.d25:meMA.Ode8C13.text
ltx/swh_redirects_oak/me.m11.d25:meMA.Ode8C14.incipit	@ltx/swh_ke_oak/me.m11.d25:meMA.Ode8C14.incipit
ltx/swh_redirects_oak/me.m11.d25:meMA.Ode8C14.melody	@ltx/swh_ke_oak/me.m11.d25:meMA.Ode8C14.melody
ltx/swh_redirects_oak/me.m11.d25:meMA.Ode8C14.mode	@ltx/swh_ke_oak/me.m11.d25:meMA.Ode8C14.mode
ltx/swh_redirects_oak/me.m11.d25:meMA.Ode8C14.ode	@ltx/swh_ke_oak/me.m11.d25:meMA.Ode8C14.ode
ltx/swh_redirects_oak/me.m11.d25:meMA.Ode8C14.text	@ltx/swh_ke_oak/me.m11.d25:meMA.Ode8C14.text
ltx/swh_redirects_oak/me.m11.d25:meMA.Ode8C1T.incipit	@ltx/swh_ke_oak/me.m11.d25:meMA.Ode8C1T.incipit
ltx/swh_redirects_oak/me.m11.d25:meMA.Ode8C1T.melody	@ltx/swh_ke_oak/me.m11.d25:meMA.Ode8C1T.melody
ltx/swh_redirects_oak/me.m11.d25:meMA.Ode8C1T.mode	@ltx/swh_ke_oak/me.m11.d25:meMA.Ode8C1T.mode
ltx/swh_redirects_oak/me.m11.d25:meMA.Ode8C1T.ode	@ltx/swh_ke_oak/me.m11.d25:meMA.Ode8C1T.ode
ltx/swh_redirects_oak/me.m11.d25:meMA.Ode8C1T.text	@ltx/swh_ke_oak/me.m11.d25:meMA.Ode8C1T.text
ltx/swh_redirects_oak/me.m11.d25:meMA.Ode8C21.greekmelody	@ltx/swh_ke_oak/me.m11.d25:meMA.Ode8C21.greekmelody
ltx/swh_redirects_oak/me.m11.d25:meMA.Ode8C21.incipit	@ltx/swh_ke_oak/me.m11.d25:meMA.Ode8C21.incipit
ltx/swh_redirects_oak/me.m11.d25:meMA.Ode8C21.melody	@ltx/swh_ke_oak/me.m11.d25:meMA.Ode8C21.melody
ltx/swh_redirects_oak/me.m11.d25:meMA.Ode8C21.mode	@ltx/swh_ke_oak/me.m11.d25:meMA.Ode8C21.mode
ltx/swh_redirects_oak/me.m11.d25:meMA.Ode8C21.ode	@ltx/swh_ke_oak/me.m11.d25:meMA.Ode8C21.ode
ltx/swh_redirects_oak/me.m11.d25:meMA.Ode8C21.text	@ltx/swh_ke_oak/me.m11.d25:meMA.Ode8C21.text
ltx/swh_redirects_oak/me.m11.d25:meMA.Ode8C22.incipit	@ltx/swh_ke_oak/me.m11.d25:meMA.Ode8C22.incipit
ltx/swh_redirects_oak/me.m11.d25:meMA.Ode8C22.melody	@ltx/swh_ke_oak/me.m11.d25:meMA.Ode8C22.melody
ltx/swh_redirects_oak/me.m11.d25:meMA.Ode8C22.mode	@ltx/swh_ke_oak/me.m11.d25:meMA.Ode8C22.mode
ltx/swh_redirects_oak/me.m11.d25:meMA.Ode8C22.ode	@ltx/swh_ke_oak/me.m11.d25:meMA.Ode8C22.ode
ltx/swh_redirects_oak/me.m11.d25:meMA.Ode8C22.text	@ltx/swh_ke_oak/me.m11.d25:meMA.Ode8C22.text
ltx/swh_redirects_oak/me.m11.d25:meMA.Ode8C23.incipit	@ltx/swh_ke_oak/me.m11.d25:meMA.Ode8C23.incipit
ltx/swh_redirects_oak/me.m11.d25:meMA.Ode8C23.melody	@ltx/swh_ke_oak/me.m11.d25:meMA.Ode8C23.melody
ltx/swh_redirects_oak/me.m11.d25:meMA.Ode8C23.mode	@ltx/swh_ke_oak/me.m11.d25:meMA.Ode8C23.mode
ltx/swh_redirects_oak/me.m11.d25:meMA.Ode8C23.ode	@ltx/swh_ke_oak/me.m11.d25:meMA.Ode8C23.ode
ltx/swh_redirects_oak/me.m11.d25:meMA.Ode8C23.text	@ltx/swh_ke_oak/me.m11.d25:meMA.Ode8C23.text
ltx/swh_redirects_oak/me.m11.d25:meMA.Ode8C24.incipit	@ltx/swh_ke_oak/me.m11.d25:meMA.Ode8C24.incipit
ltx/swh_redirects_oak/me.m11.d25:meMA.Ode8C24.melody	@ltx/swh_ke_oak/me.m11.d25:meMA.Ode8C24.melody
ltx/swh_redirects_oak/me.m11.d25:meMA.Ode8C24.mode	@ltx/swh_ke_oak/me.m11.d25:meMA.Ode8C24.mode
ltx/swh_redirects_oak/me.m11.d25:meMA.Ode8C24.ode	@ltx/swh_ke_oak/me.m11.d25:meMA.Ode8C24.ode
ltx/swh_redirects_oak/me.m11.d25:meMA.Ode8C24.text	@ltx/swh_ke_oak/me.m11.d25:meMA.Ode8C24.text
ltx/swh_redirects_oak/me.m11.d25:meMA.Ode8C2T.incipit	@ltx/swh_ke_oak/me.m11.d25:meMA.Ode8C2T.incipit
ltx/swh_redirects_oak/me.m11.d25:meMA.Ode8C2T.melody	@ltx/swh_ke_oak/me.m11.d25:meMA.Ode8C2T.melody
ltx/swh_redirects_oak/me.m11.d25:meMA.Ode8C2T.mode	@ltx/swh_ke_oak/me.m11.d25:meMA.Ode8C2T.mode
ltx/swh_redirects_oak/me.m11.d25:meMA.Ode8C2T.ode	@ltx/swh_ke_oak/me.m11.d25:meMA.Ode8C2T.ode
ltx/swh_redirects_oak/me.m11.d25:meMA.Ode8C2T.text	@ltx/swh_ke_oak/me.m11.d25:meMA.Ode8C2T.text
ltx/swh_redirects_oak/me.m11.d25:meMA.Ode8H.greekmelody	@ltx/swh_ke_oak/me.m11.d25:meMA.Ode8H.greekmelody
ltx/swh_redirects_oak/me.m11.d25:meMA.Ode8H.incipit	@ltx/swh_ke_oak/me.m11.d25:meMA.Ode8H.incipit
ltx/swh_redirects_oak/me.m11.d25:meMA.Ode8H.melody	@ltx/swh_ke_oak/me.m11.d25:meMA.Ode8H.melody
ltx/swh_redirects_oak/me.m11.d25:meMA.Ode8H.mode	@ltx/swh_ke_oak/me.m11.d25:meMA.Ode8H.mode
ltx/swh_redirects_oak/me.m11.d25:meMA.Ode8H.ode	@ltx/swh_ke_oak/me.m11.d25:meMA.Ode8H.ode
ltx/swh_redirects_oak/me.m11.d25:meMA.Ode8H.text	@ltx/swh_ke_oak/me.m11.d25:meMA.Ode8H.text
ltx/swh_redirects_oak/me.m11.d25:meMA.Ode9C11.greekmelody	@ltx/swh_ke_oak/me.m11.d25:meMA.Ode9C11.greekmelody
ltx/swh_redirects_oak/me.m11.d25:meMA.Ode9C11.incipit	@ltx/swh_ke_oak/me.m11.d25:meMA.Ode9C11.incipit
ltx/swh_redirects_oak/me.m11.d25:meMA.Ode9C11.melody	@ltx/swh_ke_oak/me.m11.d25:meMA.Ode9C11.melody
ltx/swh_redirects_oak/me.m11.d25:meMA.Ode9C11.mode	@ltx/swh_ke_oak/me.m11.d25:meMA.Ode9C11.mode
ltx/swh_redirects_oak/me.m11.d25:meMA.Ode9C11.ode	@ltx/swh_ke_oak/me.m11.d25:meMA.Ode9C11.ode
ltx/swh_redirects_oak/me.m11.d25:meMA.Ode9C11.text	@ltx/swh_ke_oak/me.m11.d25:meMA.Ode9C11.text
ltx/swh_redirects_oak/me.m11.d25:meMA.Ode9C12.incipit	@ltx/swh_ke_oak/me.m11.d25:meMA.Ode9C12.incipit
ltx/swh_redirects_oak/me.m11.d25:meMA.Ode9C12.melody	@ltx/swh_ke_oak/me.m11.d25:meMA.Ode9C12.melody
ltx/swh_redirects_oak/me.m11.d25:meMA.Ode9C12.mode	@ltx/swh_ke_oak/me.m11.d25:meMA.Ode9C12.mode
ltx/swh_redirects_oak/me.m11.d25:meMA.Ode9C12.ode	@ltx/swh_ke_oak/me.m11.d25:meMA.Ode9C12.ode
ltx/swh_redirects_oak/me.m11.d25:meMA.Ode9C12.text	@ltx/swh_ke_oak/me.m11.d25:meMA.Ode9C12.text
ltx/swh_redirects_oak/me.m11.d25:meMA.Ode9C13.incipit	@ltx/swh_ke_oak/me.m11.d25:meMA.Ode9C13.incipit
ltx/swh_redirects_oak/me.m11.d25:meMA.Ode9C13.melody	@ltx/swh_ke_oak/me.m11.d25:meMA.Ode9C13.melody
ltx/swh_redirects_oak/me.m11.d25:meMA.Ode9C13.mode	@ltx/swh_ke_oak/me.m11.d25:meMA.Ode9C13.mode
ltx/swh_redirects_oak/me.m11.d25:meMA.Ode9C13.ode	@ltx/swh_ke_oak/me.m11.d25:meMA.Ode9C13.ode
ltx/swh_redirects_oak/me.m11.d25:meMA.Ode9C13.text	@ltx/swh_ke_oak/me.m11.d25:meMA.Ode9C13.text
ltx/swh_redirects_oak/me.m11.d25:meMA.Ode9C14.incipit	@ltx/swh_ke_oak/me.m11.d25:meMA.Ode9C14.incipit
ltx/swh_redirects_oak/me.m11.d25:meMA.Ode9C14.melody	@ltx/swh_ke_oak/me.m11.d25:meMA.Ode9C14.melody
ltx/swh_redirects_oak/me.m11.d25:meMA.Ode9C14.mode	@ltx/swh_ke_oak/me.m11.d25:meMA.Ode9C14.mode
ltx/swh_redirects_oak/me.m11.d25:meMA.Ode9C14.ode	@ltx/swh_ke_oak/me.m11.d25:meMA.Ode9C14.ode
ltx/swh_redirects_oak/me.m11.d25:meMA.Ode9C14.text	@ltx/swh_ke_oak/me.m11.d25:meMA.Ode9C14.text
ltx/swh_redirects_oak/me.m11.d25:meMA.Ode9C1T.incipit	@ltx/swh_ke_oak/me.m11.d25:meMA.Ode9C1T.incipit
ltx/swh_redirects_oak/me.m11.d25:meMA.Ode9C1T.melody	@ltx/swh_ke_oak/me.m11.d25:meMA.Ode9C1T.melody
ltx/swh_redirects_oak/me.m11.d25:meMA.Ode9C1T.mode	@ltx/swh_ke_oak/me.m11.d25:meMA.Ode9C1T.mode
ltx/swh_redirects_oak/me.m11.d25:meMA.Ode9C1T.ode	@ltx/swh_ke_oak/me.m11.d25:meMA.Ode9C1T.ode
ltx/swh_redirects_oak/me.m11.d25:meMA.Ode9C1T.text	@ltx/swh_ke_oak/me.m11.d25:meMA.Ode9C1T.text
ltx/swh_redirects_oak/me.m11.d25:meMA.Ode9C21.greekmelody	@ltx/swh_ke_oak/me.m11.d25:meMA.Ode9C21.greekmelody
ltx/swh_redirects_oak/me.m11.d25:meMA.Ode9C21.incipit	@ltx/swh_ke_oak/me.m11.d25:meMA.Ode9C21.incipit
ltx/swh_redirects_oak/me.m11.d25:meMA.Ode9C21.melody	@ltx/swh_ke_oak/me.m11.d25:meMA.Ode9C21.melody
ltx/swh_redirects_oak/me.m11.d25:meMA.Ode9C21.mode	@ltx/swh_ke_oak/me.m11.d25:meMA.Ode9C21.mode
ltx/swh_redirects_oak/me.m11.d25:meMA.Ode9C21.ode	@ltx/swh_ke_oak/me.m11.d25:meMA.Ode9C21.ode
ltx/swh_redirects_oak/me.m11.d25:meMA.Ode9C21.text	@ltx/swh_ke_oak/me.m11.d25:meMA.Ode9C21.text
ltx/swh_redirects_oak/me.m11.d25:meMA.Ode9C22.incipit	@ltx/swh_ke_oak/me.m11.d25:meMA.Ode9C22.incipit
ltx/swh_redirects_oak/me.m11.d25:meMA.Ode9C22.melody	@ltx/swh_ke_oak/me.m11.d25:meMA.Ode9C22.melody
ltx/swh_redirects_oak/me.m11.d25:meMA.Ode9C22.mode	@ltx/swh_ke_oak/me.m11.d25:meMA.Ode9C22.mode
ltx/swh_redirects_oak/me.m11.d25:meMA.Ode9C22.ode	@ltx/swh_ke_oak/me.m11.d25:meMA.Ode9C22.ode
ltx/swh_redirects_oak/me.m11.d25:meMA.Ode9C22.text	@ltx/swh_ke_oak/me.m11.d25:meMA.Ode9C22.text
ltx/swh_redirects_oak/me.m11.d25:meMA.Ode9C23.incipit	@ltx/swh_ke_oak/me.m11.d25:meMA.Ode9C23.incipit
ltx/swh_redirects_oak/me.m11.d25:meMA.Ode9C23.melody	@ltx/swh_ke_oak/me.m11.d25:meMA.Ode9C23.melody
ltx/swh_redirects_oak/me.m11.d25:meMA.Ode9C23.mode	@ltx/swh_ke_oak/me.m11.d25:meMA.Ode9C23.mode
ltx/swh_redirects_oak/me.m11.d25:meMA.Ode9C23.ode	@ltx/swh_ke_oak/me.m11.d25:meMA.Ode9C23.ode
ltx/swh_redirects_oak/me.m11.d25:meMA.Ode9C23.text	@ltx/swh_ke_oak/me.m11.d25:meMA.Ode9C23.text
ltx/swh_redirects_oak/me.m11.d25:meMA.Ode9C24.incipit	@ltx/swh_ke_oak/me.m11.d25:meMA.Ode9C24.incipit
ltx/swh_redirects_oak/me.m11.d25:meMA.Ode9C24.melody	@ltx/swh_ke_oak/me.m11.d25:meMA.Ode9C24.melody
ltx/swh_redirects_oak/me.m11.d25:meMA.Ode9C24.mode	@ltx/swh_ke_oak/me.m11.d25:meMA.Ode9C24.mode
ltx/swh_redirects_oak/me.m11.d25:meMA.Ode9C24.ode	@ltx/swh_ke_oak/me.m11.d25:meMA.Ode9C24.ode
ltx/swh_redirects_oak/me.m11.d25:meMA.Ode9C24.text	@ltx/swh_ke_oak/me.m11.d25:meMA.Ode9C24.text
ltx/swh_redirects_oak/me.m11.d25:meMA.Ode9C2T.incipit	@ltx/swh_ke_oak/me.m11.d25:meMA.Ode9C2T.incipit
ltx/swh_redirects_oak/me.m11.d25:meMA.Ode9C2T.melody	@ltx/swh_ke_oak/me.m11.d25:meMA.Ode9C2T.melody
ltx/swh_redirects_oak/me.m11.d25:meMA.Ode9C2T.mode	@ltx/swh_ke_oak/me.m11.d25:meMA.Ode9C2T.mode
ltx/swh_redirects_oak/me.m11.d25:meMA.Ode9C2T.ode	@ltx/swh_ke_oak/me.m11.d25:meMA.Ode9C2T.ode
ltx/swh_redirects_oak/me.m11.d25:meMA.Ode9C2T.text	@ltx/swh_ke_oak/me.m11.d25:meMA.Ode9C2T.text
ltx/swh_redirects_oak/me.m11.d25:meMA.Oikos1.text	@ltx/swh_ke_oak/me.m11.d25:meMA.Oikos1.text
ltx/swh_redirects_oak/me.m11.d25:meMA.PostGospelBoth.incipit	@ltx/swh_ke_oak/me.m11.d25:meMA.PostGospelBoth.incipit
ltx/swh_redirects_oak/me.m11.d25:meMA.PostGospelBoth.melody	@ltx/swh_ke_oak/me.m11.d25:meMA.PostGospelBoth.melody
ltx/swh_redirects_oak/me.m11.d25:meMA.PostGospelBoth.mode	@ltx/swh_ke_oak/me.m11.d25:meMA.PostGospelBoth.mode
ltx/swh_redirects_oak/me.m11.d25:meMA.PostGospelBoth.text	@ltx/swh_ke_oak/me.m11.d25:meMA.PostGospelBoth.text
ltx/swh_redirects_oak/me.m11.d25:meMA.PostGospelGlory.incipit	@ltx/swh_ke_oak/me.m11.d25:meMA.PostGospelGlory.incipit
ltx/swh_redirects_oak/me.m11.d25:meMA.PostGospelGlory.melody	@ltx/swh_ke_oak/me.m11.d25:meMA.PostGospelGlory.melody
ltx/swh_redirects_oak/me.m11.d25:meMA.PostGospelGlory.mode	@ltx/swh_ke_oak/me.m11.d25:meMA.PostGospelGlory.mode
ltx/swh_redirects_oak/me.m11.d25:meMA.PostGospelGlory.text	@ltx/swh_ke_oak/me.m11.d25:meMA.PostGospelGlory.text
ltx/swh_redirects_oak/me.m11.d25:meMA.PostGospelIdiomelon.incipit	@ltx/swh_ke_oak/me.m11.d25:meMA.PostGospelIdiomelon.incipit
ltx/swh_redirects_oak/me.m11.d25:meMA.PostGospelIdiomelon.melody	@ltx/swh_ke_oak/me.m11.d25:meMA.PostGospelIdiomelon.melody
ltx/swh_redirects_oak/me.m11.d25:meMA.PostGospelIdiomelon.mode	@ltx/swh_ke_oak/me.m11.d25:meMA.PostGospelIdiomelon.mode
ltx/swh_redirects_oak/me.m11.d25:meMA.PostGospelIdiomelon.text	@ltx/swh_ke_oak/me.m11.d25:meMA.PostGospelIdiomelon.text
ltx/swh_redirects_oak/me.m11.d25:meVE.Apolytikion1.greekmelody	@ltx/swh_ke_oak/me.m11.d25:meVE.Apolytikion1.greekmelody
ltx/swh_redirects_oak/me.m11.d25:meVE.Apolytikion1.incipit	@ltx/swh_ke_oak/me.m11.d25:meVE.Apolytikion1.incipit
ltx/swh_redirects_oak/me.m11.d25:meVE.Apolytikion1.melody	@ltx/swh_ke_oak/me.m11.d25:meVE.Apolytikion1.melody
ltx/swh_redirects_oak/me.m11.d25:meVE.Apolytikion1.mode	@ltx/swh_ke_oak/me.m11.d25:meVE.Apolytikion1.mode
ltx/swh_redirects_oak/me.m11.d25:meVE.Apolytikion1.text	@ltx/swh_ke_oak/me.m11.d25:meVE.Apolytikion1.text
ltx/swh_redirects_oak/me.m11.d25:meVE.Apolytikion2ger.greekmelody	@ltx/swh_ke_oak/me.m11.d25:meVE.Apolytikion2ger.greekmelody
ltx/swh_redirects_oak/me.m11.d25:meVE.Apolytikion2ger.incipit	@ltx/swh_ke_oak/me.m11.d25:meVE.Apolytikion2ger.incipit
ltx/swh_redirects_oak/me.m11.d25:meVE.Apolytikion2ger.melody	@ltx/swh_ke_oak/me.m11.d25:meVE.Apolytikion2ger.melody
ltx/swh_redirects_oak/me.m11.d25:meVE.Apolytikion2ger.mode	@ltx/swh_ke_oak/me.m11.d25:meVE.Apolytikion2ger.mode
ltx/swh_redirects_oak/me.m11.d25:meVE.Apolytikion2ger.poet	@ltx/swh_ke_oak/me.m11.d25:meVE.Apolytikion2ger.poet
ltx/swh_redirects_oak/me.m11.d25:meVE.Apolytikion2ger.text	@ltx/swh_ke_oak/me.m11.d25:meVE.Apolytikion2ger.text
ltx/swh_redirects_oak/me.m11.d25:meVE.AposBoth.incipit	@ltx/swh_ke_oak/me.m11.d25:meVE.AposBoth.incipit
ltx/swh_redirects_oak/me.m11.d25:meVE.AposBoth.melody	@ltx/swh_ke_oak/me.m11.d25:meVE.AposBoth.melody
ltx/swh_redirects_oak/me.m11.d25:meVE.AposBoth.mode	@ltx/swh_ke_oak/me.m11.d25:meVE.AposBoth.mode
ltx/swh_redirects_oak/me.m11.d25:meVE.AposBoth.text	@ltx/swh_ke_oak/me.m11.d25:meVE.AposBoth.text
ltx/swh_redirects_oak/me.m11.d25:meVE.AposGlory.incipit	@ltx/swh_ke_oak/me.m11.d25:meVE.AposGlory.incipit
ltx/swh_redirects_oak/me.m11.d25:meVE.AposGlory.melody	@ltx/swh_ke_oak/me.m11.d25:meVE.AposGlory.melody
ltx/swh_redirects_oak/me.m11.d25:meVE.AposGlory.mode	@ltx/swh_ke_oak/me.m11.d25:meVE.AposGlory.mode
ltx/swh_redirects_oak/me.m11.d25:meVE.AposGlory.poet	@ltx/swh_ke_oak/me.m11.d25:meVE.AposGlory.poet
ltx/swh_redirects_oak/me.m11.d25:meVE.AposGlory.text	@ltx/swh_ke_oak/me.m11.d25:meVE.AposGlory.text
ltx/swh_redirects_oak/me.m11.d25:meVE.Aposticha1.greekmelody	@ltx/swh_ke_oak/me.m11.d25:meVE.Aposticha1.greekmelody
ltx/swh_redirects_oak/me.m11.d25:meVE.Aposticha1.incipit	@ltx/swh_ke_oak/me.m11.d25:meVE.Aposticha1.incipit
ltx/swh_redirects_oak/me.m11.d25:meVE.Aposticha1.melody	@ltx/swh_ke_oak/me.m11.d25:meVE.Aposticha1.melody
ltx/swh_redirects_oak/me.m11.d25:meVE.Aposticha1.mode	@ltx/swh_ke_oak/me.m11.d25:meVE.Aposticha1.mode
ltx/swh_redirects_oak/me.m11.d25:meVE.Aposticha1.text	@ltx/swh_ke_oak/me.m11.d25:meVE.Aposticha1.text
ltx/swh_redirects_oak/me.m11.d25:meVE.Aposticha2.incipit	@ltx/swh_ke_oak/me.m11.d25:meVE.Aposticha2.incipit
ltx/swh_redirects_oak/me.m11.d25:meVE.Aposticha2.melody	@ltx/swh_ke_oak/me.m11.d25:meVE.Aposticha2.melody
ltx/swh_redirects_oak/me.m11.d25:meVE.Aposticha2.mode	@ltx/swh_ke_oak/me.m11.d25:meVE.Aposticha2.mode
ltx/swh_redirects_oak/me.m11.d25:meVE.Aposticha2.text	@ltx/swh_ke_oak/me.m11.d25:meVE.Aposticha2.text
ltx/swh_redirects_oak/me.m11.d25:meVE.Aposticha3.incipit	@ltx/swh_ke_oak/me.m11.d25:meVE.Aposticha3.incipit
ltx/swh_redirects_oak/me.m11.d25:meVE.Aposticha3.melody	@ltx/swh_ke_oak/me.m11.d25:meVE.Aposticha3.melody
ltx/swh_redirects_oak/me.m11.d25:meVE.Aposticha3.mode	@ltx/swh_ke_oak/me.m11.d25:meVE.Aposticha3.mode
ltx/swh_redirects_oak/me.m11.d25:meVE.Aposticha3.text	@ltx/swh_ke_oak/me.m11.d25:meVE.Aposticha3.text
ltx/swh_redirects_oak/me.m11.d25:meVE.LityBoth.incipit	@ltx/swh_ke_oak/me.m11.d25:meVE.LityBoth.incipit
ltx/swh_redirects_oak/me.m11.d25:meVE.LityBoth.melody	@ltx/swh_ke_oak/me.m11.d25:meVE.LityBoth.melody
ltx/swh_redirects_oak/me.m11.d25:meVE.LityBoth.mode	@ltx/swh_ke_oak/me.m11.d25:meVE.LityBoth.mode
ltx/swh_redirects_oak/me.m11.d25:meVE.LityBoth.text	@ltx/swh_ke_oak/me.m11.d25:meVE.LityBoth.text
ltx/swh_redirects_oak/me.m11.d25:meVE.LityGlory.incipit	@ltx/swh_ke_oak/me.m11.d25:meVE.LityGlory.incipit
ltx/swh_redirects_oak/me.m11.d25:meVE.LityGlory.melody	@ltx/swh_ke_oak/me.m11.d25:meVE.LityGlory.melody
ltx/swh_redirects_oak/me.m11.d25:meVE.LityGlory.mode	@ltx/swh_ke_oak/me.m11.d25:meVE.LityGlory.mode
ltx/swh_redirects_oak/me.m11.d25:meVE.LityGlory.text	@ltx/swh_ke_oak/me.m11.d25:meVE.LityGlory.text
ltx/swh_redirects_oak/me.m11.d25:meVE.SticBoth.incipit	@ltx/swh_ke_oak/me.m11.d25:meVE.SticBoth.incipit
ltx/swh_redirects_oak/me.m11.d25:meVE.SticBoth.melody	@ltx/swh_ke_oak/me.m11.d25:meVE.SticBoth.melody
ltx/swh_redirects_oak/me.m11.d25:meVE.SticBoth.mode	@ltx/swh_ke_oak/me.m11.d25:meVE.SticBoth.mode
ltx/swh_redirects_oak/me.m11.d25:meVE.SticBoth.text	@ltx/swh_ke_oak/me.m11.d25:meVE.SticBoth.text
ltx/swh_redirects_oak/me.m11.d25:meVE.SticGlory.incipit	@ltx/swh_ke_oak/me.m11.d25:meVE.SticGlory.incipit
ltx/swh_redirects_oak/me.m11.d25:meVE.SticGlory.melody	@ltx/swh_ke_oak/me.m11.d25:meVE.SticGlory.melody
ltx/swh_redirects_oak/me.m11.d25:meVE.SticGlory.mode	@ltx/swh_ke_oak/me.m11.d25:meVE.SticGlory.mode
ltx/swh_redirects_oak/me.m11.d25:meVE.SticGlory.text	@ltx/swh_ke_oak/me.m11.d25:meVE.SticGlory.text
ltx/swh_redirects_oak/me.m11.d25:meVE.Stichera01.greekmelody	@ltx/swh_ke_oak/me.m11.d25:meVE.Stichera01.greekmelody
ltx/swh_redirects_oak/me.m11.d25:meVE.Stichera01.incipit	@ltx/swh_ke_oak/me.m11.d25:meVE.Stichera01.incipit
ltx/swh_redirects_oak/me.m11.d25:meVE.Stichera01.melody	@ltx/swh_ke_oak/me.m11.d25:meVE.Stichera01.melody
ltx/swh_redirects_oak/me.m11.d25:meVE.Stichera01.mode	@ltx/swh_ke_oak/me.m11.d25:meVE.Stichera01.mode
ltx/swh_redirects_oak/me.m11.d25:meVE.Stichera01.text	@ltx/swh_ke_oak/me.m11.d25:meVE.Stichera01.text
ltx/swh_redirects_oak/me.m11.d25:meVE.Stichera02.incipit	@ltx/swh_ke_oak/me.m11.d25:meVE.Stichera02.incipit
ltx/swh_redirects_oak/me.m11.d25:meVE.Stichera02.melody	@ltx/swh_ke_oak/me.m11.d25:meVE.Stichera02.melody
ltx/swh_redirects_oak/me.m11.d25:meVE.Stichera02.mode	@ltx/swh_ke_oak/me.m11.d25:meVE.Stichera02.mode
ltx/swh_redirects_oak/me.m11.d25:meVE.Stichera02.text	@ltx/swh_ke_oak/me.m11.d25:meVE.Stichera02.text
ltx/swh_redirects_oak/me.m11.d25:meVE.Stichera03.incipit	@ltx/swh_ke_oak/me.m11.d25:meVE.Stichera03.incipit
ltx/swh_redirects_oak/me.m11.d25:meVE.Stichera03.melody	@ltx/swh_ke_oak/me.m11.d25:meVE.Stichera03.melody
ltx/swh_redirects_oak/me.m11.d25:meVE.Stichera03.mode	@ltx/swh_ke_oak/me.m11.d25:meVE.Stichera03.mode
ltx/swh_redirects_oak/me.m11.d25:meVE.Stichera03.text	@ltx/swh_ke_oak/me.m11.d25:meVE.Stichera03.text
ltx/swh_redirects_oak/me.m11.d25:meVE.Stichera04.greekmelody	@ltx/swh_ke_oak/me.m11.d25:meVE.Stichera04.greekmelody
ltx/swh_redirects_oak/me.m11.d25:meVE.Stichera04.incipit	@ltx/swh_ke_oak/me.m11.d25:meVE.Stichera04.incipit
ltx/swh_redirects_oak/me.m11.d25:meVE.Stichera04.melody	@ltx/swh_ke_oak/me.m11.d25:meVE.Stichera04.melody
ltx/swh_redirects_oak/me.m11.d25:meVE.Stichera04.mode	@ltx/swh_ke_oak/me.m11.d25:meVE.Stichera04.mode
ltx/swh_redirects_oak/me.m11.d25:meVE.Stichera04.text	@ltx/swh_ke_oak/me.m11.d25:meVE.Stichera04.text
ltx/swh_redirects_oak/me.m11.d25:meVE.Stichera05.incipit	@ltx/swh_ke_oak/me.m11.d25:meVE.Stichera05.incipit
ltx/swh_redirects_oak/me.m11.d25:meVE.Stichera05.melody	@ltx/swh_ke_oak/me.m11.d25:meVE.Stichera05.melody
ltx/swh_redirects_oak/me.m11.d25:meVE.Stichera05.mode	@ltx/swh_ke_oak/me.m11.d25:meVE.Stichera05.mode
ltx/swh_redirects_oak/me.m11.d25:meVE.Stichera05.text	@ltx/swh_ke_oak/me.m11.d25:meVE.Stichera05.text
ltx/swh_redirects_oak/me.m11.d25:meVE.Stichera06.incipit	@ltx/swh_ke_oak/me.m11.d25:meVE.Stichera06.incipit
ltx/swh_redirects_oak/me.m11.d25:meVE.Stichera06.melody	@ltx/swh_ke_oak/me.m11.d25:meVE.Stichera06.melody
ltx/swh_redirects_oak/me.m11.d25:meVE.Stichera06.mode	@ltx/swh_ke_oak/me.m11.d25:meVE.Stichera06.mode
ltx/swh_redirects_oak/me.m11.d25:meVE.Stichera06.text	@ltx/swh_ke_oak/me.m11.d25:meVE.Stichera06.text
