ltx/swh_redirects_oak/le.go.me.m10.d03:lemeLI.Gospel.book_abbr	@ltx/swh_ke_oak/le.go.me.m10.d03:lemeLI.Gospel.book_abbr
ltx/swh_redirects_oak/le.go.me.m10.d03:lemeLI.Gospel.book_string	@ltx/swh_ke_oak/le.go.me.m10.d03:lemeLI.Gospel.book_string
ltx/swh_redirects_oak/le.go.me.m10.d03:lemeLI.Gospel.chapverse	@ltx/swh_ke_oak/le.go.me.m10.d03:lemeLI.Gospel.chapverse
ltx/swh_redirects_oak/le.go.me.m10.d03:lemeLI.Gospel.incipit	@ltx/swh_ke_oak/le.go.me.m10.d03:lemeLI.Gospel.incipit
ltx/swh_redirects_oak/le.go.me.m10.d03:lemeLI.Gospel.pagenumber	@ltx/swh_ke_oak/le.go.me.m10.d03:lemeLI.Gospel.pagenumber
ltx/swh_redirects_oak/le.go.me.m10.d03:lemeLI.Gospel.text	@ltx/swh_ke_oak/le.go.me.m10.d03:lemeLI.Gospel.text
ltx/swh_redirects_oak/le.go.me.m10.d03:lemeLI.Gospel.title	@ltx/swh_ke_oak/le.go.me.m10.d03:lemeLI.Gospel.title
ltx/swh_redirects_oak/le.go.me.m10.d03:lemeLI.Gospel.title_abbr	@ltx/swh_ke_oak/le.go.me.m10.d03:lemeLI.Gospel.title_abbr
ltx/swh_redirects_oak/le.go.me.m10.d03:lemeLI.Gospel.version	@ltx/swh_ke_oak/le.go.me.m10.d03:lemeLI.Gospel.version
