ltx/swh_redirects_oak/sy.m12.dBC:syMA.commemoration01.text	@ltx/swh_ke_oak/sy.m12.dBC:syMA.commemoration01.text
ltx/swh_redirects_oak/sy.m12.dBC:syMA.commemoration02.couplet1.title	@ltx/swh_ke_oak/sy.m12.dBC:syMA.commemoration02.couplet1.title
ltx/swh_redirects_oak/sy.m12.dBC:syMA.commemoration02.couplet1.verse1	@ltx/swh_ke_oak/sy.m12.dBC:syMA.commemoration02.couplet1.verse1
ltx/swh_redirects_oak/sy.m12.dBC:syMA.commemoration02.couplet1.verse2	@ltx/swh_ke_oak/sy.m12.dBC:syMA.commemoration02.couplet1.verse2
ltx/swh_redirects_oak/sy.m12.dBC:syMA.commemoration02.text	@ltx/swh_ke_oak/sy.m12.dBC:syMA.commemoration02.text
ltx/swh_redirects_oak/sy.m12.dBC:syMA.commemoration03.couplet1.title	@ltx/swh_ke_oak/sy.m12.dBC:syMA.commemoration03.couplet1.title
ltx/swh_redirects_oak/sy.m12.dBC:syMA.commemoration03.couplet1.verse1	@ltx/swh_ke_oak/sy.m12.dBC:syMA.commemoration03.couplet1.verse1
ltx/swh_redirects_oak/sy.m12.dBC:syMA.commemoration03.couplet1.verse2	@ltx/swh_ke_oak/sy.m12.dBC:syMA.commemoration03.couplet1.verse2
ltx/swh_redirects_oak/sy.m12.dBC:syMA.commemoration03.text	@ltx/swh_ke_oak/sy.m12.dBC:syMA.commemoration03.text
ltx/swh_redirects_oak/sy.m12.dBC:syMA.commemoration04.couplet1.title	@ltx/swh_ke_oak/sy.m12.dBC:syMA.commemoration04.couplet1.title
ltx/swh_redirects_oak/sy.m12.dBC:syMA.commemoration04.couplet1.verse1	@ltx/swh_ke_oak/sy.m12.dBC:syMA.commemoration04.couplet1.verse1
ltx/swh_redirects_oak/sy.m12.dBC:syMA.commemoration04.couplet1.verse2	@ltx/swh_ke_oak/sy.m12.dBC:syMA.commemoration04.couplet1.verse2
ltx/swh_redirects_oak/sy.m12.dBC:syMA.commemoration04.text	@ltx/swh_ke_oak/sy.m12.dBC:syMA.commemoration04.text
ltx/swh_redirects_oak/sy.m12.dBC:syMA.commemoration05.couplet1.title	@ltx/swh_ke_oak/sy.m12.dBC:syMA.commemoration05.couplet1.title
ltx/swh_redirects_oak/sy.m12.dBC:syMA.commemoration05.couplet1.verse1	@ltx/swh_ke_oak/sy.m12.dBC:syMA.commemoration05.couplet1.verse1
ltx/swh_redirects_oak/sy.m12.dBC:syMA.commemoration05.couplet1.verse2	@ltx/swh_ke_oak/sy.m12.dBC:syMA.commemoration05.couplet1.verse2
ltx/swh_redirects_oak/sy.m12.dBC:syMA.commemoration05.text	@ltx/swh_ke_oak/sy.m12.dBC:syMA.commemoration05.text
ltx/swh_redirects_oak/sy.m12.dBC:syMA.commemoration06.couplet1.title	@ltx/swh_ke_oak/sy.m12.dBC:syMA.commemoration06.couplet1.title
ltx/swh_redirects_oak/sy.m12.dBC:syMA.commemoration06.couplet1.verse1	@ltx/swh_ke_oak/sy.m12.dBC:syMA.commemoration06.couplet1.verse1
ltx/swh_redirects_oak/sy.m12.dBC:syMA.commemoration06.couplet1.verse2	@ltx/swh_ke_oak/sy.m12.dBC:syMA.commemoration06.couplet1.verse2
ltx/swh_redirects_oak/sy.m12.dBC:syMA.commemoration06.text	@ltx/swh_ke_oak/sy.m12.dBC:syMA.commemoration06.text
ltx/swh_redirects_oak/sy.m12.dBC:syMA.commemoration07.couplet1.title	@ltx/swh_ke_oak/sy.m12.dBC:syMA.commemoration07.couplet1.title
ltx/swh_redirects_oak/sy.m12.dBC:syMA.commemoration07.couplet1.verse1	@ltx/swh_ke_oak/sy.m12.dBC:syMA.commemoration07.couplet1.verse1
ltx/swh_redirects_oak/sy.m12.dBC:syMA.commemoration07.couplet1.verse2	@ltx/swh_ke_oak/sy.m12.dBC:syMA.commemoration07.couplet1.verse2
ltx/swh_redirects_oak/sy.m12.dBC:syMA.commemoration07.text	@ltx/swh_ke_oak/sy.m12.dBC:syMA.commemoration07.text
ltx/swh_redirects_oak/sy.m12.dBC:syMA.commemoration08.couplet1.title	@ltx/swh_ke_oak/sy.m12.dBC:syMA.commemoration08.couplet1.title
ltx/swh_redirects_oak/sy.m12.dBC:syMA.commemoration08.couplet1.verse1	@ltx/swh_ke_oak/sy.m12.dBC:syMA.commemoration08.couplet1.verse1
ltx/swh_redirects_oak/sy.m12.dBC:syMA.commemoration08.couplet1.verse2	@ltx/swh_ke_oak/sy.m12.dBC:syMA.commemoration08.couplet1.verse2
ltx/swh_redirects_oak/sy.m12.dBC:syMA.commemoration08.text	@ltx/swh_ke_oak/sy.m12.dBC:syMA.commemoration08.text
ltx/swh_redirects_oak/sy.m12.dBC:syMA.commemoration09.couplet1.title	@ltx/swh_ke_oak/sy.m12.dBC:syMA.commemoration09.couplet1.title
ltx/swh_redirects_oak/sy.m12.dBC:syMA.commemoration09.couplet1.verse1	@ltx/swh_ke_oak/sy.m12.dBC:syMA.commemoration09.couplet1.verse1
ltx/swh_redirects_oak/sy.m12.dBC:syMA.commemoration09.couplet1.verse2	@ltx/swh_ke_oak/sy.m12.dBC:syMA.commemoration09.couplet1.verse2
ltx/swh_redirects_oak/sy.m12.dBC:syMA.commemoration09.text	@ltx/swh_ke_oak/sy.m12.dBC:syMA.commemoration09.text
ltx/swh_redirects_oak/sy.m12.dBC:syMA.commemoration10.couplet1.title	@ltx/swh_ke_oak/sy.m12.dBC:syMA.commemoration10.couplet1.title
ltx/swh_redirects_oak/sy.m12.dBC:syMA.commemoration10.couplet1.verse1	@ltx/swh_ke_oak/sy.m12.dBC:syMA.commemoration10.couplet1.verse1
ltx/swh_redirects_oak/sy.m12.dBC:syMA.commemoration10.couplet1.verse2	@ltx/swh_ke_oak/sy.m12.dBC:syMA.commemoration10.couplet1.verse2
ltx/swh_redirects_oak/sy.m12.dBC:syMA.commemoration10.text	@ltx/swh_ke_oak/sy.m12.dBC:syMA.commemoration10.text
ltx/swh_redirects_oak/sy.m12.dBC:syMA.commemoration11.couplet1.title	@ltx/swh_ke_oak/sy.m12.dBC:syMA.commemoration11.couplet1.title
ltx/swh_redirects_oak/sy.m12.dBC:syMA.commemoration11.couplet1.verse1	@ltx/swh_ke_oak/sy.m12.dBC:syMA.commemoration11.couplet1.verse1
ltx/swh_redirects_oak/sy.m12.dBC:syMA.commemoration11.couplet1.verse2	@ltx/swh_ke_oak/sy.m12.dBC:syMA.commemoration11.couplet1.verse2
ltx/swh_redirects_oak/sy.m12.dBC:syMA.commemoration11.text	@ltx/swh_ke_oak/sy.m12.dBC:syMA.commemoration11.text
ltx/swh_redirects_oak/sy.m12.dBC:syMA.commemoration12.couplet1.title	@ltx/swh_ke_oak/sy.m12.dBC:syMA.commemoration12.couplet1.title
ltx/swh_redirects_oak/sy.m12.dBC:syMA.commemoration12.couplet1.verse1	@ltx/swh_ke_oak/sy.m12.dBC:syMA.commemoration12.couplet1.verse1
ltx/swh_redirects_oak/sy.m12.dBC:syMA.commemoration12.couplet1.verse2	@ltx/swh_ke_oak/sy.m12.dBC:syMA.commemoration12.couplet1.verse2
ltx/swh_redirects_oak/sy.m12.dBC:syMA.commemoration12.text	@ltx/swh_ke_oak/sy.m12.dBC:syMA.commemoration12.text
ltx/swh_redirects_oak/sy.m12.dBC:syMA.commemoration13.couplet1.title	@ltx/swh_ke_oak/sy.m12.dBC:syMA.commemoration13.couplet1.title
ltx/swh_redirects_oak/sy.m12.dBC:syMA.commemoration13.couplet1.verse1	@ltx/swh_ke_oak/sy.m12.dBC:syMA.commemoration13.couplet1.verse1
ltx/swh_redirects_oak/sy.m12.dBC:syMA.commemoration13.couplet1.verse2	@ltx/swh_ke_oak/sy.m12.dBC:syMA.commemoration13.couplet1.verse2
ltx/swh_redirects_oak/sy.m12.dBC:syMA.commemoration13.text	@ltx/swh_ke_oak/sy.m12.dBC:syMA.commemoration13.text
ltx/swh_redirects_oak/sy.m12.dBC:syMA.commemoration14.couplet1.title	@ltx/swh_ke_oak/sy.m12.dBC:syMA.commemoration14.couplet1.title
ltx/swh_redirects_oak/sy.m12.dBC:syMA.commemoration14.couplet1.verse1	@ltx/swh_ke_oak/sy.m12.dBC:syMA.commemoration14.couplet1.verse1
ltx/swh_redirects_oak/sy.m12.dBC:syMA.commemoration14.couplet1.verse2	@ltx/swh_ke_oak/sy.m12.dBC:syMA.commemoration14.couplet1.verse2
ltx/swh_redirects_oak/sy.m12.dBC:syMA.commemoration14.text	@ltx/swh_ke_oak/sy.m12.dBC:syMA.commemoration14.text
ltx/swh_redirects_oak/sy.m12.dBC:syMA.commemoration15.couplet1.title	@ltx/swh_ke_oak/sy.m12.dBC:syMA.commemoration15.couplet1.title
ltx/swh_redirects_oak/sy.m12.dBC:syMA.commemoration15.couplet1.verse1	@ltx/swh_ke_oak/sy.m12.dBC:syMA.commemoration15.couplet1.verse1
ltx/swh_redirects_oak/sy.m12.dBC:syMA.commemoration15.couplet1.verse2	@ltx/swh_ke_oak/sy.m12.dBC:syMA.commemoration15.couplet1.verse2
ltx/swh_redirects_oak/sy.m12.dBC:syMA.commemoration15.text	@ltx/swh_ke_oak/sy.m12.dBC:syMA.commemoration15.text
ltx/swh_redirects_oak/sy.m12.dBC:syMA.commemoration16.couplet1.title	@ltx/swh_ke_oak/sy.m12.dBC:syMA.commemoration16.couplet1.title
ltx/swh_redirects_oak/sy.m12.dBC:syMA.commemoration16.couplet1.verse1	@ltx/swh_ke_oak/sy.m12.dBC:syMA.commemoration16.couplet1.verse1
ltx/swh_redirects_oak/sy.m12.dBC:syMA.commemoration16.couplet1.verse2	@ltx/swh_ke_oak/sy.m12.dBC:syMA.commemoration16.couplet1.verse2
ltx/swh_redirects_oak/sy.m12.dBC:syMA.commemoration16.text	@ltx/swh_ke_oak/sy.m12.dBC:syMA.commemoration16.text
ltx/swh_redirects_oak/sy.m12.dBC:syMA.commemoration17.couplet1.title	@ltx/swh_ke_oak/sy.m12.dBC:syMA.commemoration17.couplet1.title
ltx/swh_redirects_oak/sy.m12.dBC:syMA.commemoration17.couplet1.verse1	@ltx/swh_ke_oak/sy.m12.dBC:syMA.commemoration17.couplet1.verse1
ltx/swh_redirects_oak/sy.m12.dBC:syMA.commemoration17.couplet1.verse2	@ltx/swh_ke_oak/sy.m12.dBC:syMA.commemoration17.couplet1.verse2
ltx/swh_redirects_oak/sy.m12.dBC:syMA.commemoration17.text	@ltx/swh_ke_oak/sy.m12.dBC:syMA.commemoration17.text
ltx/swh_redirects_oak/sy.m12.dBC:syMA.commemoration18.couplet1.title	@ltx/swh_ke_oak/sy.m12.dBC:syMA.commemoration18.couplet1.title
ltx/swh_redirects_oak/sy.m12.dBC:syMA.commemoration18.couplet1.verse1	@ltx/swh_ke_oak/sy.m12.dBC:syMA.commemoration18.couplet1.verse1
ltx/swh_redirects_oak/sy.m12.dBC:syMA.commemoration18.couplet1.verse2	@ltx/swh_ke_oak/sy.m12.dBC:syMA.commemoration18.couplet1.verse2
ltx/swh_redirects_oak/sy.m12.dBC:syMA.commemoration18.text	@ltx/swh_ke_oak/sy.m12.dBC:syMA.commemoration18.text
ltx/swh_redirects_oak/sy.m12.dBC:syMA.commemoration19.couplet1.title	@ltx/swh_ke_oak/sy.m12.dBC:syMA.commemoration19.couplet1.title
ltx/swh_redirects_oak/sy.m12.dBC:syMA.commemoration19.couplet1.verse1	@ltx/swh_ke_oak/sy.m12.dBC:syMA.commemoration19.couplet1.verse1
ltx/swh_redirects_oak/sy.m12.dBC:syMA.commemoration19.couplet1.verse2	@ltx/swh_ke_oak/sy.m12.dBC:syMA.commemoration19.couplet1.verse2
ltx/swh_redirects_oak/sy.m12.dBC:syMA.commemoration19.text	@ltx/swh_ke_oak/sy.m12.dBC:syMA.commemoration19.text
ltx/swh_redirects_oak/sy.m12.dBC:syMA.commemoration20.couplet1.title	@ltx/swh_ke_oak/sy.m12.dBC:syMA.commemoration20.couplet1.title
ltx/swh_redirects_oak/sy.m12.dBC:syMA.commemoration20.couplet1.verse1	@ltx/swh_ke_oak/sy.m12.dBC:syMA.commemoration20.couplet1.verse1
ltx/swh_redirects_oak/sy.m12.dBC:syMA.commemoration20.couplet1.verse2	@ltx/swh_ke_oak/sy.m12.dBC:syMA.commemoration20.couplet1.verse2
ltx/swh_redirects_oak/sy.m12.dBC:syMA.commemoration20.text	@ltx/swh_ke_oak/sy.m12.dBC:syMA.commemoration20.text
ltx/swh_redirects_oak/sy.m12.dBC:syMA.commemoration21.couplet1.title	@ltx/swh_ke_oak/sy.m12.dBC:syMA.commemoration21.couplet1.title
ltx/swh_redirects_oak/sy.m12.dBC:syMA.commemoration21.couplet1.verse1	@ltx/swh_ke_oak/sy.m12.dBC:syMA.commemoration21.couplet1.verse1
ltx/swh_redirects_oak/sy.m12.dBC:syMA.commemoration21.couplet1.verse2	@ltx/swh_ke_oak/sy.m12.dBC:syMA.commemoration21.couplet1.verse2
ltx/swh_redirects_oak/sy.m12.dBC:syMA.commemoration21.text	@ltx/swh_ke_oak/sy.m12.dBC:syMA.commemoration21.text
ltx/swh_redirects_oak/sy.m12.dBC:syMA.commemoration22.couplet1.title	@ltx/swh_ke_oak/sy.m12.dBC:syMA.commemoration22.couplet1.title
ltx/swh_redirects_oak/sy.m12.dBC:syMA.commemoration22.couplet1.verse1	@ltx/swh_ke_oak/sy.m12.dBC:syMA.commemoration22.couplet1.verse1
ltx/swh_redirects_oak/sy.m12.dBC:syMA.commemoration22.couplet1.verse2	@ltx/swh_ke_oak/sy.m12.dBC:syMA.commemoration22.couplet1.verse2
ltx/swh_redirects_oak/sy.m12.dBC:syMA.commemoration22.text	@ltx/swh_ke_oak/sy.m12.dBC:syMA.commemoration22.text
ltx/swh_redirects_oak/sy.m12.dBC:syMA.commemoration23.couplet1.title	@ltx/swh_ke_oak/sy.m12.dBC:syMA.commemoration23.couplet1.title
ltx/swh_redirects_oak/sy.m12.dBC:syMA.commemoration23.couplet1.verse1	@ltx/swh_ke_oak/sy.m12.dBC:syMA.commemoration23.couplet1.verse1
ltx/swh_redirects_oak/sy.m12.dBC:syMA.commemoration23.couplet1.verse2	@ltx/swh_ke_oak/sy.m12.dBC:syMA.commemoration23.couplet1.verse2
ltx/swh_redirects_oak/sy.m12.dBC:syMA.commemoration23.text	@ltx/swh_ke_oak/sy.m12.dBC:syMA.commemoration23.text
ltx/swh_redirects_oak/sy.m12.dBC:syMA.commemoration24.couplet1.title	@ltx/swh_ke_oak/sy.m12.dBC:syMA.commemoration24.couplet1.title
ltx/swh_redirects_oak/sy.m12.dBC:syMA.commemoration24.couplet1.verse1	@ltx/swh_ke_oak/sy.m12.dBC:syMA.commemoration24.couplet1.verse1
ltx/swh_redirects_oak/sy.m12.dBC:syMA.commemoration24.couplet1.verse2	@ltx/swh_ke_oak/sy.m12.dBC:syMA.commemoration24.couplet1.verse2
ltx/swh_redirects_oak/sy.m12.dBC:syMA.commemoration24.text	@ltx/swh_ke_oak/sy.m12.dBC:syMA.commemoration24.text
ltx/swh_redirects_oak/sy.m12.dBC:syMA.commemoration25.couplet1.title	@ltx/swh_ke_oak/sy.m12.dBC:syMA.commemoration25.couplet1.title
ltx/swh_redirects_oak/sy.m12.dBC:syMA.commemoration25.couplet1.verse1	@ltx/swh_ke_oak/sy.m12.dBC:syMA.commemoration25.couplet1.verse1
ltx/swh_redirects_oak/sy.m12.dBC:syMA.commemoration25.couplet1.verse2	@ltx/swh_ke_oak/sy.m12.dBC:syMA.commemoration25.couplet1.verse2
ltx/swh_redirects_oak/sy.m12.dBC:syMA.commemoration25.text	@ltx/swh_ke_oak/sy.m12.dBC:syMA.commemoration25.text
ltx/swh_redirects_oak/sy.m12.dBC:syMA.commemoration26.couplet1.title	@ltx/swh_ke_oak/sy.m12.dBC:syMA.commemoration26.couplet1.title
ltx/swh_redirects_oak/sy.m12.dBC:syMA.commemoration26.couplet1.verse1	@ltx/swh_ke_oak/sy.m12.dBC:syMA.commemoration26.couplet1.verse1
ltx/swh_redirects_oak/sy.m12.dBC:syMA.commemoration26.couplet1.verse2	@ltx/swh_ke_oak/sy.m12.dBC:syMA.commemoration26.couplet1.verse2
ltx/swh_redirects_oak/sy.m12.dBC:syMA.commemoration26.text	@ltx/swh_ke_oak/sy.m12.dBC:syMA.commemoration26.text
ltx/swh_redirects_oak/sy.m12.dBC:syMA.commemoration27.couplet1.title	@ltx/swh_ke_oak/sy.m12.dBC:syMA.commemoration27.couplet1.title
ltx/swh_redirects_oak/sy.m12.dBC:syMA.commemoration27.couplet1.verse1	@ltx/swh_ke_oak/sy.m12.dBC:syMA.commemoration27.couplet1.verse1
ltx/swh_redirects_oak/sy.m12.dBC:syMA.commemoration27.couplet1.verse2	@ltx/swh_ke_oak/sy.m12.dBC:syMA.commemoration27.couplet1.verse2
ltx/swh_redirects_oak/sy.m12.dBC:syMA.commemoration27.text	@ltx/swh_ke_oak/sy.m12.dBC:syMA.commemoration27.text
ltx/swh_redirects_oak/sy.m12.dBC:syMA.commemoration28.couplet1.title	@ltx/swh_ke_oak/sy.m12.dBC:syMA.commemoration28.couplet1.title
ltx/swh_redirects_oak/sy.m12.dBC:syMA.commemoration28.couplet1.verse1	@ltx/swh_ke_oak/sy.m12.dBC:syMA.commemoration28.couplet1.verse1
ltx/swh_redirects_oak/sy.m12.dBC:syMA.commemoration28.couplet1.verse2	@ltx/swh_ke_oak/sy.m12.dBC:syMA.commemoration28.couplet1.verse2
ltx/swh_redirects_oak/sy.m12.dBC:syMA.commemoration28.text	@ltx/swh_ke_oak/sy.m12.dBC:syMA.commemoration28.text
ltx/swh_redirects_oak/sy.m12.dBC:syMA.commemoration29.couplet1.title	@ltx/swh_ke_oak/sy.m12.dBC:syMA.commemoration29.couplet1.title
ltx/swh_redirects_oak/sy.m12.dBC:syMA.commemoration29.couplet1.verse1	@ltx/swh_ke_oak/sy.m12.dBC:syMA.commemoration29.couplet1.verse1
ltx/swh_redirects_oak/sy.m12.dBC:syMA.commemoration29.couplet1.verse2	@ltx/swh_ke_oak/sy.m12.dBC:syMA.commemoration29.couplet1.verse2
ltx/swh_redirects_oak/sy.m12.dBC:syMA.commemoration29.text	@ltx/swh_ke_oak/sy.m12.dBC:syMA.commemoration29.text
ltx/swh_redirects_oak/sy.m12.dBC:syMA.commemoration30.couplet1.title	@ltx/swh_ke_oak/sy.m12.dBC:syMA.commemoration30.couplet1.title
ltx/swh_redirects_oak/sy.m12.dBC:syMA.commemoration30.couplet1.verse1	@ltx/swh_ke_oak/sy.m12.dBC:syMA.commemoration30.couplet1.verse1
ltx/swh_redirects_oak/sy.m12.dBC:syMA.commemoration30.couplet1.verse2	@ltx/swh_ke_oak/sy.m12.dBC:syMA.commemoration30.couplet1.verse2
ltx/swh_redirects_oak/sy.m12.dBC:syMA.commemoration30.text	@ltx/swh_ke_oak/sy.m12.dBC:syMA.commemoration30.text
ltx/swh_redirects_oak/sy.m12.dBC:syMA.commemoration31.couplet1.title	@ltx/swh_ke_oak/sy.m12.dBC:syMA.commemoration31.couplet1.title
ltx/swh_redirects_oak/sy.m12.dBC:syMA.commemoration31.couplet1.verse1	@ltx/swh_ke_oak/sy.m12.dBC:syMA.commemoration31.couplet1.verse1
ltx/swh_redirects_oak/sy.m12.dBC:syMA.commemoration31.couplet1.verse2	@ltx/swh_ke_oak/sy.m12.dBC:syMA.commemoration31.couplet1.verse2
ltx/swh_redirects_oak/sy.m12.dBC:syMA.commemoration31.text	@ltx/swh_ke_oak/sy.m12.dBC:syMA.commemoration31.text
ltx/swh_redirects_oak/sy.m12.dBC:syMA.commemoration32.couplet1.title	@ltx/swh_ke_oak/sy.m12.dBC:syMA.commemoration32.couplet1.title
ltx/swh_redirects_oak/sy.m12.dBC:syMA.commemoration32.couplet1.verse1	@ltx/swh_ke_oak/sy.m12.dBC:syMA.commemoration32.couplet1.verse1
ltx/swh_redirects_oak/sy.m12.dBC:syMA.commemoration32.couplet1.verse2	@ltx/swh_ke_oak/sy.m12.dBC:syMA.commemoration32.couplet1.verse2
ltx/swh_redirects_oak/sy.m12.dBC:syMA.commemoration32.text	@ltx/swh_ke_oak/sy.m12.dBC:syMA.commemoration32.text
ltx/swh_redirects_oak/sy.m12.dBC:syMA.commemoration33.couplet1.title	@ltx/swh_ke_oak/sy.m12.dBC:syMA.commemoration33.couplet1.title
ltx/swh_redirects_oak/sy.m12.dBC:syMA.commemoration33.couplet1.verse1	@ltx/swh_ke_oak/sy.m12.dBC:syMA.commemoration33.couplet1.verse1
ltx/swh_redirects_oak/sy.m12.dBC:syMA.commemoration33.couplet1.verse2	@ltx/swh_ke_oak/sy.m12.dBC:syMA.commemoration33.couplet1.verse2
ltx/swh_redirects_oak/sy.m12.dBC:syMA.commemoration33.text	@ltx/swh_ke_oak/sy.m12.dBC:syMA.commemoration33.text
ltx/swh_redirects_oak/sy.m12.dBC:syMA.commemoration34.couplet1.title	@ltx/swh_ke_oak/sy.m12.dBC:syMA.commemoration34.couplet1.title
ltx/swh_redirects_oak/sy.m12.dBC:syMA.commemoration34.couplet1.verse1	@ltx/swh_ke_oak/sy.m12.dBC:syMA.commemoration34.couplet1.verse1
ltx/swh_redirects_oak/sy.m12.dBC:syMA.commemoration34.couplet1.verse2	@ltx/swh_ke_oak/sy.m12.dBC:syMA.commemoration34.couplet1.verse2
ltx/swh_redirects_oak/sy.m12.dBC:syMA.commemoration34.text	@ltx/swh_ke_oak/sy.m12.dBC:syMA.commemoration34.text
ltx/swh_redirects_oak/sy.m12.dBC:syMA.commemoration35.couplet1.title	@ltx/swh_ke_oak/sy.m12.dBC:syMA.commemoration35.couplet1.title
ltx/swh_redirects_oak/sy.m12.dBC:syMA.commemoration35.couplet1.verse1	@ltx/swh_ke_oak/sy.m12.dBC:syMA.commemoration35.couplet1.verse1
ltx/swh_redirects_oak/sy.m12.dBC:syMA.commemoration35.couplet1.verse2	@ltx/swh_ke_oak/sy.m12.dBC:syMA.commemoration35.couplet1.verse2
ltx/swh_redirects_oak/sy.m12.dBC:syMA.commemoration35.text	@ltx/swh_ke_oak/sy.m12.dBC:syMA.commemoration35.text
ltx/swh_redirects_oak/sy.m12.dBC:syMA.commemoration36.couplet1.title	@ltx/swh_ke_oak/sy.m12.dBC:syMA.commemoration36.couplet1.title
ltx/swh_redirects_oak/sy.m12.dBC:syMA.commemoration36.couplet1.verse1	@ltx/swh_ke_oak/sy.m12.dBC:syMA.commemoration36.couplet1.verse1
ltx/swh_redirects_oak/sy.m12.dBC:syMA.commemoration36.couplet1.verse2	@ltx/swh_ke_oak/sy.m12.dBC:syMA.commemoration36.couplet1.verse2
ltx/swh_redirects_oak/sy.m12.dBC:syMA.commemoration36.text	@ltx/swh_ke_oak/sy.m12.dBC:syMA.commemoration36.text
ltx/swh_redirects_oak/sy.m12.dBC:syMA.commemoration37.couplet1.title	@ltx/swh_ke_oak/sy.m12.dBC:syMA.commemoration37.couplet1.title
ltx/swh_redirects_oak/sy.m12.dBC:syMA.commemoration37.couplet1.verse1	@ltx/swh_ke_oak/sy.m12.dBC:syMA.commemoration37.couplet1.verse1
ltx/swh_redirects_oak/sy.m12.dBC:syMA.commemoration37.couplet1.verse2	@ltx/swh_ke_oak/sy.m12.dBC:syMA.commemoration37.couplet1.verse2
ltx/swh_redirects_oak/sy.m12.dBC:syMA.commemoration37.text	@ltx/swh_ke_oak/sy.m12.dBC:syMA.commemoration37.text
ltx/swh_redirects_oak/sy.m12.dBC:syMA.commemoration38.couplet1.title	@ltx/swh_ke_oak/sy.m12.dBC:syMA.commemoration38.couplet1.title
ltx/swh_redirects_oak/sy.m12.dBC:syMA.commemoration38.couplet1.verse1	@ltx/swh_ke_oak/sy.m12.dBC:syMA.commemoration38.couplet1.verse1
ltx/swh_redirects_oak/sy.m12.dBC:syMA.commemoration38.couplet1.verse2	@ltx/swh_ke_oak/sy.m12.dBC:syMA.commemoration38.couplet1.verse2
ltx/swh_redirects_oak/sy.m12.dBC:syMA.commemoration38.text	@ltx/swh_ke_oak/sy.m12.dBC:syMA.commemoration38.text
ltx/swh_redirects_oak/sy.m12.dBC:syMA.commemoration39.couplet1.title	@ltx/swh_ke_oak/sy.m12.dBC:syMA.commemoration39.couplet1.title
ltx/swh_redirects_oak/sy.m12.dBC:syMA.commemoration39.couplet1.verse1	@ltx/swh_ke_oak/sy.m12.dBC:syMA.commemoration39.couplet1.verse1
ltx/swh_redirects_oak/sy.m12.dBC:syMA.commemoration39.couplet1.verse2	@ltx/swh_ke_oak/sy.m12.dBC:syMA.commemoration39.couplet1.verse2
ltx/swh_redirects_oak/sy.m12.dBC:syMA.commemoration39.text	@ltx/swh_ke_oak/sy.m12.dBC:syMA.commemoration39.text
ltx/swh_redirects_oak/sy.m12.dBC:syMA.commemoration40.couplet1.title	@ltx/swh_ke_oak/sy.m12.dBC:syMA.commemoration40.couplet1.title
ltx/swh_redirects_oak/sy.m12.dBC:syMA.commemoration40.couplet1.verse1	@ltx/swh_ke_oak/sy.m12.dBC:syMA.commemoration40.couplet1.verse1
ltx/swh_redirects_oak/sy.m12.dBC:syMA.commemoration40.couplet1.verse2	@ltx/swh_ke_oak/sy.m12.dBC:syMA.commemoration40.couplet1.verse2
ltx/swh_redirects_oak/sy.m12.dBC:syMA.commemoration40.text	@ltx/swh_ke_oak/sy.m12.dBC:syMA.commemoration40.text
ltx/swh_redirects_oak/sy.m12.dBC:syMA.commemoration41.couplet1.title	@ltx/swh_ke_oak/sy.m12.dBC:syMA.commemoration41.couplet1.title
ltx/swh_redirects_oak/sy.m12.dBC:syMA.commemoration41.couplet1.verse1	@ltx/swh_ke_oak/sy.m12.dBC:syMA.commemoration41.couplet1.verse1
ltx/swh_redirects_oak/sy.m12.dBC:syMA.commemoration41.couplet1.verse2	@ltx/swh_ke_oak/sy.m12.dBC:syMA.commemoration41.couplet1.verse2
ltx/swh_redirects_oak/sy.m12.dBC:syMA.commemoration41.text	@ltx/swh_ke_oak/sy.m12.dBC:syMA.commemoration41.text
ltx/swh_redirects_oak/sy.m12.dBC:syMA.commemoration42.couplet1.title	@ltx/swh_ke_oak/sy.m12.dBC:syMA.commemoration42.couplet1.title
ltx/swh_redirects_oak/sy.m12.dBC:syMA.commemoration42.couplet1.verse1	@ltx/swh_ke_oak/sy.m12.dBC:syMA.commemoration42.couplet1.verse1
ltx/swh_redirects_oak/sy.m12.dBC:syMA.commemoration42.couplet1.verse2	@ltx/swh_ke_oak/sy.m12.dBC:syMA.commemoration42.couplet1.verse2
ltx/swh_redirects_oak/sy.m12.dBC:syMA.commemoration42.text	@ltx/swh_ke_oak/sy.m12.dBC:syMA.commemoration42.text
ltx/swh_redirects_oak/sy.m12.dBC:syMA.commemoration43.couplet1.title	@ltx/swh_ke_oak/sy.m12.dBC:syMA.commemoration43.couplet1.title
ltx/swh_redirects_oak/sy.m12.dBC:syMA.commemoration43.couplet1.verse1	@ltx/swh_ke_oak/sy.m12.dBC:syMA.commemoration43.couplet1.verse1
ltx/swh_redirects_oak/sy.m12.dBC:syMA.commemoration43.couplet1.verse2	@ltx/swh_ke_oak/sy.m12.dBC:syMA.commemoration43.couplet1.verse2
ltx/swh_redirects_oak/sy.m12.dBC:syMA.commemoration43.text	@ltx/swh_ke_oak/sy.m12.dBC:syMA.commemoration43.text
ltx/swh_redirects_oak/sy.m12.dBC:syMA.commemoration44.couplet1.title	@ltx/swh_ke_oak/sy.m12.dBC:syMA.commemoration44.couplet1.title
ltx/swh_redirects_oak/sy.m12.dBC:syMA.commemoration44.couplet1.verse1	@ltx/swh_ke_oak/sy.m12.dBC:syMA.commemoration44.couplet1.verse1
ltx/swh_redirects_oak/sy.m12.dBC:syMA.commemoration44.couplet1.verse2	@ltx/swh_ke_oak/sy.m12.dBC:syMA.commemoration44.couplet1.verse2
ltx/swh_redirects_oak/sy.m12.dBC:syMA.commemoration44.text	@ltx/swh_ke_oak/sy.m12.dBC:syMA.commemoration44.text
ltx/swh_redirects_oak/sy.m12.dBC:syMA.commemoration45.couplet1.title	@ltx/swh_ke_oak/sy.m12.dBC:syMA.commemoration45.couplet1.title
ltx/swh_redirects_oak/sy.m12.dBC:syMA.commemoration45.couplet1.verse1	@ltx/swh_ke_oak/sy.m12.dBC:syMA.commemoration45.couplet1.verse1
ltx/swh_redirects_oak/sy.m12.dBC:syMA.commemoration45.couplet1.verse2	@ltx/swh_ke_oak/sy.m12.dBC:syMA.commemoration45.couplet1.verse2
ltx/swh_redirects_oak/sy.m12.dBC:syMA.commemoration45.text	@ltx/swh_ke_oak/sy.m12.dBC:syMA.commemoration45.text
ltx/swh_redirects_oak/sy.m12.dBC:syMA.commemoration46.couplet1.title	@ltx/swh_ke_oak/sy.m12.dBC:syMA.commemoration46.couplet1.title
ltx/swh_redirects_oak/sy.m12.dBC:syMA.commemoration46.couplet1.verse1	@ltx/swh_ke_oak/sy.m12.dBC:syMA.commemoration46.couplet1.verse1
ltx/swh_redirects_oak/sy.m12.dBC:syMA.commemoration46.couplet1.verse2	@ltx/swh_ke_oak/sy.m12.dBC:syMA.commemoration46.couplet1.verse2
ltx/swh_redirects_oak/sy.m12.dBC:syMA.commemoration46.text	@ltx/swh_ke_oak/sy.m12.dBC:syMA.commemoration46.text
ltx/swh_redirects_oak/sy.m12.dBC:syMA.commemoration47.couplet1.title	@ltx/swh_ke_oak/sy.m12.dBC:syMA.commemoration47.couplet1.title
ltx/swh_redirects_oak/sy.m12.dBC:syMA.commemoration47.couplet1.verse1	@ltx/swh_ke_oak/sy.m12.dBC:syMA.commemoration47.couplet1.verse1
ltx/swh_redirects_oak/sy.m12.dBC:syMA.commemoration47.couplet1.verse2	@ltx/swh_ke_oak/sy.m12.dBC:syMA.commemoration47.couplet1.verse2
ltx/swh_redirects_oak/sy.m12.dBC:syMA.commemoration47.text	@ltx/swh_ke_oak/sy.m12.dBC:syMA.commemoration47.text
ltx/swh_redirects_oak/sy.m12.dBC:syMA.commemoration48.couplet1.title	@ltx/swh_ke_oak/sy.m12.dBC:syMA.commemoration48.couplet1.title
ltx/swh_redirects_oak/sy.m12.dBC:syMA.commemoration48.couplet1.verse1	@ltx/swh_ke_oak/sy.m12.dBC:syMA.commemoration48.couplet1.verse1
ltx/swh_redirects_oak/sy.m12.dBC:syMA.commemoration48.couplet1.verse2	@ltx/swh_ke_oak/sy.m12.dBC:syMA.commemoration48.couplet1.verse2
ltx/swh_redirects_oak/sy.m12.dBC:syMA.commemoration48.text	@ltx/swh_ke_oak/sy.m12.dBC:syMA.commemoration48.text
ltx/swh_redirects_oak/sy.m12.dBC:syMA.commemoration49.couplet1.title	@ltx/swh_ke_oak/sy.m12.dBC:syMA.commemoration49.couplet1.title
ltx/swh_redirects_oak/sy.m12.dBC:syMA.commemoration49.couplet1.verse1	@ltx/swh_ke_oak/sy.m12.dBC:syMA.commemoration49.couplet1.verse1
ltx/swh_redirects_oak/sy.m12.dBC:syMA.commemoration49.couplet1.verse2	@ltx/swh_ke_oak/sy.m12.dBC:syMA.commemoration49.couplet1.verse2
ltx/swh_redirects_oak/sy.m12.dBC:syMA.commemoration49.text	@ltx/swh_ke_oak/sy.m12.dBC:syMA.commemoration49.text
ltx/swh_redirects_oak/sy.m12.dBC:syMA.commemoration50.couplet1.title	@ltx/swh_ke_oak/sy.m12.dBC:syMA.commemoration50.couplet1.title
ltx/swh_redirects_oak/sy.m12.dBC:syMA.commemoration50.couplet1.verse1	@ltx/swh_ke_oak/sy.m12.dBC:syMA.commemoration50.couplet1.verse1
ltx/swh_redirects_oak/sy.m12.dBC:syMA.commemoration50.couplet1.verse2	@ltx/swh_ke_oak/sy.m12.dBC:syMA.commemoration50.couplet1.verse2
ltx/swh_redirects_oak/sy.m12.dBC:syMA.commemoration50.text	@ltx/swh_ke_oak/sy.m12.dBC:syMA.commemoration50.text
ltx/swh_redirects_oak/sy.m12.dBC:syMA.commemoration51.couplet1.title	@ltx/swh_ke_oak/sy.m12.dBC:syMA.commemoration51.couplet1.title
ltx/swh_redirects_oak/sy.m12.dBC:syMA.commemoration51.couplet1.verse1	@ltx/swh_ke_oak/sy.m12.dBC:syMA.commemoration51.couplet1.verse1
ltx/swh_redirects_oak/sy.m12.dBC:syMA.commemoration51.couplet1.verse2	@ltx/swh_ke_oak/sy.m12.dBC:syMA.commemoration51.couplet1.verse2
ltx/swh_redirects_oak/sy.m12.dBC:syMA.commemoration51.text	@ltx/swh_ke_oak/sy.m12.dBC:syMA.commemoration51.text
ltx/swh_redirects_oak/sy.m12.dBC:syMA.commemoration52.couplet1.title	@ltx/swh_ke_oak/sy.m12.dBC:syMA.commemoration52.couplet1.title
ltx/swh_redirects_oak/sy.m12.dBC:syMA.commemoration52.couplet1.verse1	@ltx/swh_ke_oak/sy.m12.dBC:syMA.commemoration52.couplet1.verse1
ltx/swh_redirects_oak/sy.m12.dBC:syMA.commemoration52.couplet1.verse2	@ltx/swh_ke_oak/sy.m12.dBC:syMA.commemoration52.couplet1.verse2
ltx/swh_redirects_oak/sy.m12.dBC:syMA.commemoration52.text	@ltx/swh_ke_oak/sy.m12.dBC:syMA.commemoration52.text
ltx/swh_redirects_oak/sy.m12.dBC:syMA.commemoration53.couplet1.title	@ltx/swh_ke_oak/sy.m12.dBC:syMA.commemoration53.couplet1.title
ltx/swh_redirects_oak/sy.m12.dBC:syMA.commemoration53.couplet1.verse1	@ltx/swh_ke_oak/sy.m12.dBC:syMA.commemoration53.couplet1.verse1
ltx/swh_redirects_oak/sy.m12.dBC:syMA.commemoration53.couplet1.verse2	@ltx/swh_ke_oak/sy.m12.dBC:syMA.commemoration53.couplet1.verse2
ltx/swh_redirects_oak/sy.m12.dBC:syMA.commemoration53.text	@ltx/swh_ke_oak/sy.m12.dBC:syMA.commemoration53.text
ltx/swh_redirects_oak/sy.m12.dBC:syMA.commemoration54.couplet1.title	@ltx/swh_ke_oak/sy.m12.dBC:syMA.commemoration54.couplet1.title
ltx/swh_redirects_oak/sy.m12.dBC:syMA.commemoration54.couplet1.verse1	@ltx/swh_ke_oak/sy.m12.dBC:syMA.commemoration54.couplet1.verse1
ltx/swh_redirects_oak/sy.m12.dBC:syMA.commemoration54.couplet1.verse2	@ltx/swh_ke_oak/sy.m12.dBC:syMA.commemoration54.couplet1.verse2
ltx/swh_redirects_oak/sy.m12.dBC:syMA.commemoration54.text	@ltx/swh_ke_oak/sy.m12.dBC:syMA.commemoration54.text
ltx/swh_redirects_oak/sy.m12.dBC:syMA.commemoration55.couplet1.title	@ltx/swh_ke_oak/sy.m12.dBC:syMA.commemoration55.couplet1.title
ltx/swh_redirects_oak/sy.m12.dBC:syMA.commemoration55.couplet1.verse1	@ltx/swh_ke_oak/sy.m12.dBC:syMA.commemoration55.couplet1.verse1
ltx/swh_redirects_oak/sy.m12.dBC:syMA.commemoration55.couplet1.verse2	@ltx/swh_ke_oak/sy.m12.dBC:syMA.commemoration55.couplet1.verse2
ltx/swh_redirects_oak/sy.m12.dBC:syMA.commemoration55.text	@ltx/swh_ke_oak/sy.m12.dBC:syMA.commemoration55.text
ltx/swh_redirects_oak/sy.m12.dBC:syMA.commemoration56.couplet1.title	@ltx/swh_ke_oak/sy.m12.dBC:syMA.commemoration56.couplet1.title
ltx/swh_redirects_oak/sy.m12.dBC:syMA.commemoration56.couplet1.verse1	@ltx/swh_ke_oak/sy.m12.dBC:syMA.commemoration56.couplet1.verse1
ltx/swh_redirects_oak/sy.m12.dBC:syMA.commemoration56.couplet1.verse2	@ltx/swh_ke_oak/sy.m12.dBC:syMA.commemoration56.couplet1.verse2
ltx/swh_redirects_oak/sy.m12.dBC:syMA.commemoration56.text	@ltx/swh_ke_oak/sy.m12.dBC:syMA.commemoration56.text
ltx/swh_redirects_oak/sy.m12.dBC:syMA.commemoration57.couplet1.title	@ltx/swh_ke_oak/sy.m12.dBC:syMA.commemoration57.couplet1.title
ltx/swh_redirects_oak/sy.m12.dBC:syMA.commemoration57.couplet1.verse1	@ltx/swh_ke_oak/sy.m12.dBC:syMA.commemoration57.couplet1.verse1
ltx/swh_redirects_oak/sy.m12.dBC:syMA.commemoration57.couplet1.verse2	@ltx/swh_ke_oak/sy.m12.dBC:syMA.commemoration57.couplet1.verse2
ltx/swh_redirects_oak/sy.m12.dBC:syMA.commemoration57.text	@ltx/swh_ke_oak/sy.m12.dBC:syMA.commemoration57.text
ltx/swh_redirects_oak/sy.m12.dBC:syMA.commemoration58.couplet1.title	@ltx/swh_ke_oak/sy.m12.dBC:syMA.commemoration58.couplet1.title
ltx/swh_redirects_oak/sy.m12.dBC:syMA.commemoration58.couplet1.verse1	@ltx/swh_ke_oak/sy.m12.dBC:syMA.commemoration58.couplet1.verse1
ltx/swh_redirects_oak/sy.m12.dBC:syMA.commemoration58.couplet1.verse2	@ltx/swh_ke_oak/sy.m12.dBC:syMA.commemoration58.couplet1.verse2
ltx/swh_redirects_oak/sy.m12.dBC:syMA.commemoration58.text	@ltx/swh_ke_oak/sy.m12.dBC:syMA.commemoration58.text
ltx/swh_redirects_oak/sy.m12.dBC:syMA.commemoration59.couplet1.title	@ltx/swh_ke_oak/sy.m12.dBC:syMA.commemoration59.couplet1.title
ltx/swh_redirects_oak/sy.m12.dBC:syMA.commemoration59.couplet1.verse1	@ltx/swh_ke_oak/sy.m12.dBC:syMA.commemoration59.couplet1.verse1
ltx/swh_redirects_oak/sy.m12.dBC:syMA.commemoration59.couplet1.verse2	@ltx/swh_ke_oak/sy.m12.dBC:syMA.commemoration59.couplet1.verse2
ltx/swh_redirects_oak/sy.m12.dBC:syMA.commemoration59.text	@ltx/swh_ke_oak/sy.m12.dBC:syMA.commemoration59.text
ltx/swh_redirects_oak/sy.m12.dBC:syMA.commemoration60.couplet1.title	@ltx/swh_ke_oak/sy.m12.dBC:syMA.commemoration60.couplet1.title
ltx/swh_redirects_oak/sy.m12.dBC:syMA.commemoration60.couplet1.verse1	@ltx/swh_ke_oak/sy.m12.dBC:syMA.commemoration60.couplet1.verse1
ltx/swh_redirects_oak/sy.m12.dBC:syMA.commemoration60.couplet1.verse2	@ltx/swh_ke_oak/sy.m12.dBC:syMA.commemoration60.couplet1.verse2
ltx/swh_redirects_oak/sy.m12.dBC:syMA.commemoration60.text	@ltx/swh_ke_oak/sy.m12.dBC:syMA.commemoration60.text
ltx/swh_redirects_oak/sy.m12.dBC:syMA.commemoration61.couplet1.title	@ltx/swh_ke_oak/sy.m12.dBC:syMA.commemoration61.couplet1.title
ltx/swh_redirects_oak/sy.m12.dBC:syMA.commemoration61.couplet1.verse1	@ltx/swh_ke_oak/sy.m12.dBC:syMA.commemoration61.couplet1.verse1
ltx/swh_redirects_oak/sy.m12.dBC:syMA.commemoration61.couplet1.verse2	@ltx/swh_ke_oak/sy.m12.dBC:syMA.commemoration61.couplet1.verse2
ltx/swh_redirects_oak/sy.m12.dBC:syMA.commemoration61.text	@ltx/swh_ke_oak/sy.m12.dBC:syMA.commemoration61.text
ltx/swh_redirects_oak/sy.m12.dBC:syMA.commemoration62.couplet1.title	@ltx/swh_ke_oak/sy.m12.dBC:syMA.commemoration62.couplet1.title
ltx/swh_redirects_oak/sy.m12.dBC:syMA.commemoration62.couplet1.verse1	@ltx/swh_ke_oak/sy.m12.dBC:syMA.commemoration62.couplet1.verse1
ltx/swh_redirects_oak/sy.m12.dBC:syMA.commemoration62.couplet1.verse2	@ltx/swh_ke_oak/sy.m12.dBC:syMA.commemoration62.couplet1.verse2
ltx/swh_redirects_oak/sy.m12.dBC:syMA.commemoration62.text	@ltx/swh_ke_oak/sy.m12.dBC:syMA.commemoration62.text
ltx/swh_redirects_oak/sy.m12.dBC:syMA.commemoration63.couplet1.title	@ltx/swh_ke_oak/sy.m12.dBC:syMA.commemoration63.couplet1.title
ltx/swh_redirects_oak/sy.m12.dBC:syMA.commemoration63.couplet1.verse1	@ltx/swh_ke_oak/sy.m12.dBC:syMA.commemoration63.couplet1.verse1
ltx/swh_redirects_oak/sy.m12.dBC:syMA.commemoration63.couplet1.verse2	@ltx/swh_ke_oak/sy.m12.dBC:syMA.commemoration63.couplet1.verse2
ltx/swh_redirects_oak/sy.m12.dBC:syMA.commemoration63.text	@ltx/swh_ke_oak/sy.m12.dBC:syMA.commemoration63.text
ltx/swh_redirects_oak/sy.m12.dBC:syMA.commemoration64.couplet1.title	@ltx/swh_ke_oak/sy.m12.dBC:syMA.commemoration64.couplet1.title
ltx/swh_redirects_oak/sy.m12.dBC:syMA.commemoration64.couplet1.verse1	@ltx/swh_ke_oak/sy.m12.dBC:syMA.commemoration64.couplet1.verse1
ltx/swh_redirects_oak/sy.m12.dBC:syMA.commemoration64.couplet1.verse2	@ltx/swh_ke_oak/sy.m12.dBC:syMA.commemoration64.couplet1.verse2
ltx/swh_redirects_oak/sy.m12.dBC:syMA.commemoration64.text	@ltx/swh_ke_oak/sy.m12.dBC:syMA.commemoration64.text
ltx/swh_redirects_oak/sy.m12.dBC:syMA.commemoration65.couplet1.title	@ltx/swh_ke_oak/sy.m12.dBC:syMA.commemoration65.couplet1.title
ltx/swh_redirects_oak/sy.m12.dBC:syMA.commemoration65.couplet1.verse1	@ltx/swh_ke_oak/sy.m12.dBC:syMA.commemoration65.couplet1.verse1
ltx/swh_redirects_oak/sy.m12.dBC:syMA.commemoration65.couplet1.verse2	@ltx/swh_ke_oak/sy.m12.dBC:syMA.commemoration65.couplet1.verse2
ltx/swh_redirects_oak/sy.m12.dBC:syMA.commemoration65.text	@ltx/swh_ke_oak/sy.m12.dBC:syMA.commemoration65.text
ltx/swh_redirects_oak/sy.m12.dBC:syMA.commemoration66.couplet1.title	@ltx/swh_ke_oak/sy.m12.dBC:syMA.commemoration66.couplet1.title
ltx/swh_redirects_oak/sy.m12.dBC:syMA.commemoration66.couplet1.verse1	@ltx/swh_ke_oak/sy.m12.dBC:syMA.commemoration66.couplet1.verse1
ltx/swh_redirects_oak/sy.m12.dBC:syMA.commemoration66.couplet1.verse2	@ltx/swh_ke_oak/sy.m12.dBC:syMA.commemoration66.couplet1.verse2
ltx/swh_redirects_oak/sy.m12.dBC:syMA.commemoration66.text	@ltx/swh_ke_oak/sy.m12.dBC:syMA.commemoration66.text
ltx/swh_redirects_oak/sy.m12.dBC:syMA.commemoration67.couplet1.title	@ltx/swh_ke_oak/sy.m12.dBC:syMA.commemoration67.couplet1.title
ltx/swh_redirects_oak/sy.m12.dBC:syMA.commemoration67.couplet1.verse1	@ltx/swh_ke_oak/sy.m12.dBC:syMA.commemoration67.couplet1.verse1
ltx/swh_redirects_oak/sy.m12.dBC:syMA.commemoration67.couplet1.verse2	@ltx/swh_ke_oak/sy.m12.dBC:syMA.commemoration67.couplet1.verse2
ltx/swh_redirects_oak/sy.m12.dBC:syMA.commemoration67.text	@ltx/swh_ke_oak/sy.m12.dBC:syMA.commemoration67.text
ltx/swh_redirects_oak/sy.m12.dBC:syMA.commemoration68.couplet1.title	@ltx/swh_ke_oak/sy.m12.dBC:syMA.commemoration68.couplet1.title
ltx/swh_redirects_oak/sy.m12.dBC:syMA.commemoration68.couplet1.verse1	@ltx/swh_ke_oak/sy.m12.dBC:syMA.commemoration68.couplet1.verse1
ltx/swh_redirects_oak/sy.m12.dBC:syMA.commemoration68.couplet1.verse2	@ltx/swh_ke_oak/sy.m12.dBC:syMA.commemoration68.couplet1.verse2
ltx/swh_redirects_oak/sy.m12.dBC:syMA.commemoration68.text	@ltx/swh_ke_oak/sy.m12.dBC:syMA.commemoration68.text
ltx/swh_redirects_oak/sy.m12.dBC:syMA.commemoration69.couplet1.title	@ltx/swh_ke_oak/sy.m12.dBC:syMA.commemoration69.couplet1.title
ltx/swh_redirects_oak/sy.m12.dBC:syMA.commemoration69.couplet1.verse1	@ltx/swh_ke_oak/sy.m12.dBC:syMA.commemoration69.couplet1.verse1
ltx/swh_redirects_oak/sy.m12.dBC:syMA.commemoration69.couplet1.verse2	@ltx/swh_ke_oak/sy.m12.dBC:syMA.commemoration69.couplet1.verse2
ltx/swh_redirects_oak/sy.m12.dBC:syMA.commemoration69.text	@ltx/swh_ke_oak/sy.m12.dBC:syMA.commemoration69.text
ltx/swh_redirects_oak/sy.m12.dBC:syMA.commemoration70.couplet1.title	@ltx/swh_ke_oak/sy.m12.dBC:syMA.commemoration70.couplet1.title
ltx/swh_redirects_oak/sy.m12.dBC:syMA.commemoration70.couplet1.verse1	@ltx/swh_ke_oak/sy.m12.dBC:syMA.commemoration70.couplet1.verse1
ltx/swh_redirects_oak/sy.m12.dBC:syMA.commemoration70.couplet1.verse2	@ltx/swh_ke_oak/sy.m12.dBC:syMA.commemoration70.couplet1.verse2
ltx/swh_redirects_oak/sy.m12.dBC:syMA.commemoration70.text	@ltx/swh_ke_oak/sy.m12.dBC:syMA.commemoration70.text
ltx/swh_redirects_oak/sy.m12.dBC:syMA.commemoration71.couplet1.title	@ltx/swh_ke_oak/sy.m12.dBC:syMA.commemoration71.couplet1.title
ltx/swh_redirects_oak/sy.m12.dBC:syMA.commemoration71.couplet1.verse1	@ltx/swh_ke_oak/sy.m12.dBC:syMA.commemoration71.couplet1.verse1
ltx/swh_redirects_oak/sy.m12.dBC:syMA.commemoration71.couplet1.verse2	@ltx/swh_ke_oak/sy.m12.dBC:syMA.commemoration71.couplet1.verse2
ltx/swh_redirects_oak/sy.m12.dBC:syMA.commemoration71.text	@ltx/swh_ke_oak/sy.m12.dBC:syMA.commemoration71.text
ltx/swh_redirects_oak/sy.m12.dBC:syMA.commemoration72.couplet1.title	@ltx/swh_ke_oak/sy.m12.dBC:syMA.commemoration72.couplet1.title
ltx/swh_redirects_oak/sy.m12.dBC:syMA.commemoration72.couplet1.verse1	@ltx/swh_ke_oak/sy.m12.dBC:syMA.commemoration72.couplet1.verse1
ltx/swh_redirects_oak/sy.m12.dBC:syMA.commemoration72.couplet1.verse2	@ltx/swh_ke_oak/sy.m12.dBC:syMA.commemoration72.couplet1.verse2
ltx/swh_redirects_oak/sy.m12.dBC:syMA.commemoration72.text	@ltx/swh_ke_oak/sy.m12.dBC:syMA.commemoration72.text
ltx/swh_redirects_oak/sy.m12.dBC:syMA.commemoration73.couplet1.title	@ltx/swh_ke_oak/sy.m12.dBC:syMA.commemoration73.couplet1.title
ltx/swh_redirects_oak/sy.m12.dBC:syMA.commemoration73.couplet1.verse1	@ltx/swh_ke_oak/sy.m12.dBC:syMA.commemoration73.couplet1.verse1
ltx/swh_redirects_oak/sy.m12.dBC:syMA.commemoration73.couplet1.verse2	@ltx/swh_ke_oak/sy.m12.dBC:syMA.commemoration73.couplet1.verse2
ltx/swh_redirects_oak/sy.m12.dBC:syMA.commemoration73.text	@ltx/swh_ke_oak/sy.m12.dBC:syMA.commemoration73.text
ltx/swh_redirects_oak/sy.m12.dBC:syMA.commemoration74.couplet1.title	@ltx/swh_ke_oak/sy.m12.dBC:syMA.commemoration74.couplet1.title
ltx/swh_redirects_oak/sy.m12.dBC:syMA.commemoration74.couplet1.verse1	@ltx/swh_ke_oak/sy.m12.dBC:syMA.commemoration74.couplet1.verse1
ltx/swh_redirects_oak/sy.m12.dBC:syMA.commemoration74.couplet1.verse2	@ltx/swh_ke_oak/sy.m12.dBC:syMA.commemoration74.couplet1.verse2
ltx/swh_redirects_oak/sy.m12.dBC:syMA.commemoration74.text	@ltx/swh_ke_oak/sy.m12.dBC:syMA.commemoration74.text
ltx/swh_redirects_oak/sy.m12.dBC:syMA.commemoration75.couplet1.title	@ltx/swh_ke_oak/sy.m12.dBC:syMA.commemoration75.couplet1.title
ltx/swh_redirects_oak/sy.m12.dBC:syMA.commemoration75.couplet1.verse1	@ltx/swh_ke_oak/sy.m12.dBC:syMA.commemoration75.couplet1.verse1
ltx/swh_redirects_oak/sy.m12.dBC:syMA.commemoration75.couplet1.verse2	@ltx/swh_ke_oak/sy.m12.dBC:syMA.commemoration75.couplet1.verse2
ltx/swh_redirects_oak/sy.m12.dBC:syMA.commemoration75.text	@ltx/swh_ke_oak/sy.m12.dBC:syMA.commemoration75.text
ltx/swh_redirects_oak/sy.m12.dBC:syMA.commemoration76.couplet1.title	@ltx/swh_ke_oak/sy.m12.dBC:syMA.commemoration76.couplet1.title
ltx/swh_redirects_oak/sy.m12.dBC:syMA.commemoration76.couplet1.verse1	@ltx/swh_ke_oak/sy.m12.dBC:syMA.commemoration76.couplet1.verse1
ltx/swh_redirects_oak/sy.m12.dBC:syMA.commemoration76.couplet1.verse2	@ltx/swh_ke_oak/sy.m12.dBC:syMA.commemoration76.couplet1.verse2
ltx/swh_redirects_oak/sy.m12.dBC:syMA.commemoration76.text	@ltx/swh_ke_oak/sy.m12.dBC:syMA.commemoration76.text
ltx/swh_redirects_oak/sy.m12.dBC:syMA.commemoration77.couplet1.title	@ltx/swh_ke_oak/sy.m12.dBC:syMA.commemoration77.couplet1.title
ltx/swh_redirects_oak/sy.m12.dBC:syMA.commemoration77.couplet1.verse1	@ltx/swh_ke_oak/sy.m12.dBC:syMA.commemoration77.couplet1.verse1
ltx/swh_redirects_oak/sy.m12.dBC:syMA.commemoration77.couplet1.verse2	@ltx/swh_ke_oak/sy.m12.dBC:syMA.commemoration77.couplet1.verse2
ltx/swh_redirects_oak/sy.m12.dBC:syMA.commemoration77.text	@ltx/swh_ke_oak/sy.m12.dBC:syMA.commemoration77.text
ltx/swh_redirects_oak/sy.m12.dBC:syMA.commemoration78.couplet1.title	@ltx/swh_ke_oak/sy.m12.dBC:syMA.commemoration78.couplet1.title
ltx/swh_redirects_oak/sy.m12.dBC:syMA.commemoration78.couplet1.verse1	@ltx/swh_ke_oak/sy.m12.dBC:syMA.commemoration78.couplet1.verse1
ltx/swh_redirects_oak/sy.m12.dBC:syMA.commemoration78.couplet1.verse2	@ltx/swh_ke_oak/sy.m12.dBC:syMA.commemoration78.couplet1.verse2
ltx/swh_redirects_oak/sy.m12.dBC:syMA.commemoration78.text	@ltx/swh_ke_oak/sy.m12.dBC:syMA.commemoration78.text
ltx/swh_redirects_oak/sy.m12.dBC:syMA.commemoration79.couplet1.title	@ltx/swh_ke_oak/sy.m12.dBC:syMA.commemoration79.couplet1.title
ltx/swh_redirects_oak/sy.m12.dBC:syMA.commemoration79.couplet1.verse1	@ltx/swh_ke_oak/sy.m12.dBC:syMA.commemoration79.couplet1.verse1
ltx/swh_redirects_oak/sy.m12.dBC:syMA.commemoration79.couplet1.verse2	@ltx/swh_ke_oak/sy.m12.dBC:syMA.commemoration79.couplet1.verse2
ltx/swh_redirects_oak/sy.m12.dBC:syMA.commemoration79.text	@ltx/swh_ke_oak/sy.m12.dBC:syMA.commemoration79.text
ltx/swh_redirects_oak/sy.m12.dBC:syMA.commemoration80.couplet1.title	@ltx/swh_ke_oak/sy.m12.dBC:syMA.commemoration80.couplet1.title
ltx/swh_redirects_oak/sy.m12.dBC:syMA.commemoration80.couplet1.verse1	@ltx/swh_ke_oak/sy.m12.dBC:syMA.commemoration80.couplet1.verse1
ltx/swh_redirects_oak/sy.m12.dBC:syMA.commemoration80.couplet1.verse2	@ltx/swh_ke_oak/sy.m12.dBC:syMA.commemoration80.couplet1.verse2
ltx/swh_redirects_oak/sy.m12.dBC:syMA.commemoration80.text	@ltx/swh_ke_oak/sy.m12.dBC:syMA.commemoration80.text
ltx/swh_redirects_oak/sy.m12.dBC:syMA.commemoration81.couplet1.title	@ltx/swh_ke_oak/sy.m12.dBC:syMA.commemoration81.couplet1.title
ltx/swh_redirects_oak/sy.m12.dBC:syMA.commemoration81.couplet1.verse1	@ltx/swh_ke_oak/sy.m12.dBC:syMA.commemoration81.couplet1.verse1
ltx/swh_redirects_oak/sy.m12.dBC:syMA.commemoration81.couplet1.verse2	@ltx/swh_ke_oak/sy.m12.dBC:syMA.commemoration81.couplet1.verse2
ltx/swh_redirects_oak/sy.m12.dBC:syMA.commemoration81.text	@ltx/swh_ke_oak/sy.m12.dBC:syMA.commemoration81.text
ltx/swh_redirects_oak/sy.m12.dBC:syMA.commemoration82.couplet1.title	@ltx/swh_ke_oak/sy.m12.dBC:syMA.commemoration82.couplet1.title
ltx/swh_redirects_oak/sy.m12.dBC:syMA.commemoration82.couplet1.verse1	@ltx/swh_ke_oak/sy.m12.dBC:syMA.commemoration82.couplet1.verse1
ltx/swh_redirects_oak/sy.m12.dBC:syMA.commemoration82.couplet1.verse2	@ltx/swh_ke_oak/sy.m12.dBC:syMA.commemoration82.couplet1.verse2
ltx/swh_redirects_oak/sy.m12.dBC:syMA.commemoration82.text	@ltx/swh_ke_oak/sy.m12.dBC:syMA.commemoration82.text
ltx/swh_redirects_oak/sy.m12.dBC:syMA.commemoration83.couplet1.title	@ltx/swh_ke_oak/sy.m12.dBC:syMA.commemoration83.couplet1.title
ltx/swh_redirects_oak/sy.m12.dBC:syMA.commemoration83.couplet1.verse1	@ltx/swh_ke_oak/sy.m12.dBC:syMA.commemoration83.couplet1.verse1
ltx/swh_redirects_oak/sy.m12.dBC:syMA.commemoration83.couplet1.verse2	@ltx/swh_ke_oak/sy.m12.dBC:syMA.commemoration83.couplet1.verse2
ltx/swh_redirects_oak/sy.m12.dBC:syMA.commemoration83.text	@ltx/swh_ke_oak/sy.m12.dBC:syMA.commemoration83.text
ltx/swh_redirects_oak/sy.m12.dBC:syMA.commemoration84.couplet1.title	@ltx/swh_ke_oak/sy.m12.dBC:syMA.commemoration84.couplet1.title
ltx/swh_redirects_oak/sy.m12.dBC:syMA.commemoration84.couplet1.verse1	@ltx/swh_ke_oak/sy.m12.dBC:syMA.commemoration84.couplet1.verse1
ltx/swh_redirects_oak/sy.m12.dBC:syMA.commemoration84.couplet1.verse2	@ltx/swh_ke_oak/sy.m12.dBC:syMA.commemoration84.couplet1.verse2
ltx/swh_redirects_oak/sy.m12.dBC:syMA.commemoration84.text	@ltx/swh_ke_oak/sy.m12.dBC:syMA.commemoration84.text
ltx/swh_redirects_oak/sy.m12.dBC:syMA.commemoration85.couplet1.title	@ltx/swh_ke_oak/sy.m12.dBC:syMA.commemoration85.couplet1.title
ltx/swh_redirects_oak/sy.m12.dBC:syMA.commemoration85.couplet1.verse1	@ltx/swh_ke_oak/sy.m12.dBC:syMA.commemoration85.couplet1.verse1
ltx/swh_redirects_oak/sy.m12.dBC:syMA.commemoration85.couplet1.verse2	@ltx/swh_ke_oak/sy.m12.dBC:syMA.commemoration85.couplet1.verse2
ltx/swh_redirects_oak/sy.m12.dBC:syMA.commemoration85.text	@ltx/swh_ke_oak/sy.m12.dBC:syMA.commemoration85.text
ltx/swh_redirects_oak/sy.m12.dBC:syMA.commemoration86.couplet1.title	@ltx/swh_ke_oak/sy.m12.dBC:syMA.commemoration86.couplet1.title
ltx/swh_redirects_oak/sy.m12.dBC:syMA.commemoration86.couplet1.verse1	@ltx/swh_ke_oak/sy.m12.dBC:syMA.commemoration86.couplet1.verse1
ltx/swh_redirects_oak/sy.m12.dBC:syMA.commemoration86.couplet1.verse2	@ltx/swh_ke_oak/sy.m12.dBC:syMA.commemoration86.couplet1.verse2
ltx/swh_redirects_oak/sy.m12.dBC:syMA.commemoration86.text	@ltx/swh_ke_oak/sy.m12.dBC:syMA.commemoration86.text
ltx/swh_redirects_oak/sy.m12.dBC:syMA.commemoration87.couplet1.title	@ltx/swh_ke_oak/sy.m12.dBC:syMA.commemoration87.couplet1.title
ltx/swh_redirects_oak/sy.m12.dBC:syMA.commemoration87.couplet1.verse1	@ltx/swh_ke_oak/sy.m12.dBC:syMA.commemoration87.couplet1.verse1
ltx/swh_redirects_oak/sy.m12.dBC:syMA.commemoration87.couplet1.verse2	@ltx/swh_ke_oak/sy.m12.dBC:syMA.commemoration87.couplet1.verse2
ltx/swh_redirects_oak/sy.m12.dBC:syMA.commemoration87.text	@ltx/swh_ke_oak/sy.m12.dBC:syMA.commemoration87.text
ltx/swh_redirects_oak/sy.m12.dBC:syMA.commemoration88.couplet1.title	@ltx/swh_ke_oak/sy.m12.dBC:syMA.commemoration88.couplet1.title
ltx/swh_redirects_oak/sy.m12.dBC:syMA.commemoration88.couplet1.verse1	@ltx/swh_ke_oak/sy.m12.dBC:syMA.commemoration88.couplet1.verse1
ltx/swh_redirects_oak/sy.m12.dBC:syMA.commemoration88.couplet1.verse2	@ltx/swh_ke_oak/sy.m12.dBC:syMA.commemoration88.couplet1.verse2
ltx/swh_redirects_oak/sy.m12.dBC:syMA.commemoration88.text	@ltx/swh_ke_oak/sy.m12.dBC:syMA.commemoration88.text
ltx/swh_redirects_oak/sy.m12.dBC:syMA.commemoration89.couplet1.title	@ltx/swh_ke_oak/sy.m12.dBC:syMA.commemoration89.couplet1.title
ltx/swh_redirects_oak/sy.m12.dBC:syMA.commemoration89.couplet1.verse1	@ltx/swh_ke_oak/sy.m12.dBC:syMA.commemoration89.couplet1.verse1
ltx/swh_redirects_oak/sy.m12.dBC:syMA.commemoration89.couplet1.verse2	@ltx/swh_ke_oak/sy.m12.dBC:syMA.commemoration89.couplet1.verse2
ltx/swh_redirects_oak/sy.m12.dBC:syMA.commemoration89.text	@ltx/swh_ke_oak/sy.m12.dBC:syMA.commemoration89.text
ltx/swh_redirects_oak/sy.m12.dBC:syMA.commemoration90.couplet1.title	@ltx/swh_ke_oak/sy.m12.dBC:syMA.commemoration90.couplet1.title
ltx/swh_redirects_oak/sy.m12.dBC:syMA.commemoration90.couplet1.verse1	@ltx/swh_ke_oak/sy.m12.dBC:syMA.commemoration90.couplet1.verse1
ltx/swh_redirects_oak/sy.m12.dBC:syMA.commemoration90.couplet1.verse2	@ltx/swh_ke_oak/sy.m12.dBC:syMA.commemoration90.couplet1.verse2
ltx/swh_redirects_oak/sy.m12.dBC:syMA.commemoration90.text	@ltx/swh_ke_oak/sy.m12.dBC:syMA.commemoration90.text
ltx/swh_redirects_oak/sy.m12.dBC:syMA.commemoration91.couplet1.title	@ltx/swh_ke_oak/sy.m12.dBC:syMA.commemoration91.couplet1.title
ltx/swh_redirects_oak/sy.m12.dBC:syMA.commemoration91.couplet1.verse1	@ltx/swh_ke_oak/sy.m12.dBC:syMA.commemoration91.couplet1.verse1
ltx/swh_redirects_oak/sy.m12.dBC:syMA.commemoration91.couplet1.verse2	@ltx/swh_ke_oak/sy.m12.dBC:syMA.commemoration91.couplet1.verse2
ltx/swh_redirects_oak/sy.m12.dBC:syMA.commemoration91.text	@ltx/swh_ke_oak/sy.m12.dBC:syMA.commemoration91.text
ltx/swh_redirects_oak/sy.m12.dBC:syMA.commemoration92.couplet1.title	@ltx/swh_ke_oak/sy.m12.dBC:syMA.commemoration92.couplet1.title
ltx/swh_redirects_oak/sy.m12.dBC:syMA.commemoration92.couplet1.verse1	@ltx/swh_ke_oak/sy.m12.dBC:syMA.commemoration92.couplet1.verse1
ltx/swh_redirects_oak/sy.m12.dBC:syMA.commemoration92.couplet1.verse2	@ltx/swh_ke_oak/sy.m12.dBC:syMA.commemoration92.couplet1.verse2
ltx/swh_redirects_oak/sy.m12.dBC:syMA.commemoration92.text	@ltx/swh_ke_oak/sy.m12.dBC:syMA.commemoration92.text
ltx/swh_redirects_oak/sy.m12.dBC:syMA.commemoration93.couplet1.title	@ltx/swh_ke_oak/sy.m12.dBC:syMA.commemoration93.couplet1.title
ltx/swh_redirects_oak/sy.m12.dBC:syMA.commemoration93.couplet1.verse1	@ltx/swh_ke_oak/sy.m12.dBC:syMA.commemoration93.couplet1.verse1
ltx/swh_redirects_oak/sy.m12.dBC:syMA.commemoration93.couplet1.verse2	@ltx/swh_ke_oak/sy.m12.dBC:syMA.commemoration93.couplet1.verse2
ltx/swh_redirects_oak/sy.m12.dBC:syMA.commemoration93.text	@ltx/swh_ke_oak/sy.m12.dBC:syMA.commemoration93.text
ltx/swh_redirects_oak/sy.m12.dBC:syMA.commemoration94.couplet1.title	@ltx/swh_ke_oak/sy.m12.dBC:syMA.commemoration94.couplet1.title
ltx/swh_redirects_oak/sy.m12.dBC:syMA.commemoration94.couplet1.verse1	@ltx/swh_ke_oak/sy.m12.dBC:syMA.commemoration94.couplet1.verse1
ltx/swh_redirects_oak/sy.m12.dBC:syMA.commemoration94.couplet1.verse2	@ltx/swh_ke_oak/sy.m12.dBC:syMA.commemoration94.couplet1.verse2
ltx/swh_redirects_oak/sy.m12.dBC:syMA.commemoration94.text	@ltx/swh_ke_oak/sy.m12.dBC:syMA.commemoration94.text
ltx/swh_redirects_oak/sy.m12.dBC:syMA.commemoration95.couplet1.title	@ltx/swh_ke_oak/sy.m12.dBC:syMA.commemoration95.couplet1.title
ltx/swh_redirects_oak/sy.m12.dBC:syMA.commemoration95.couplet1.verse1	@ltx/swh_ke_oak/sy.m12.dBC:syMA.commemoration95.couplet1.verse1
ltx/swh_redirects_oak/sy.m12.dBC:syMA.commemoration95.couplet1.verse2	@ltx/swh_ke_oak/sy.m12.dBC:syMA.commemoration95.couplet1.verse2
ltx/swh_redirects_oak/sy.m12.dBC:syMA.commemoration95.text	@ltx/swh_ke_oak/sy.m12.dBC:syMA.commemoration95.text
ltx/swh_redirects_oak/sy.m12.dBC:syMA.commemoration96.couplet1.title	@ltx/swh_ke_oak/sy.m12.dBC:syMA.commemoration96.couplet1.title
ltx/swh_redirects_oak/sy.m12.dBC:syMA.commemoration96.couplet1.verse1	@ltx/swh_ke_oak/sy.m12.dBC:syMA.commemoration96.couplet1.verse1
ltx/swh_redirects_oak/sy.m12.dBC:syMA.commemoration96.couplet1.verse2	@ltx/swh_ke_oak/sy.m12.dBC:syMA.commemoration96.couplet1.verse2
ltx/swh_redirects_oak/sy.m12.dBC:syMA.commemoration96.text	@ltx/swh_ke_oak/sy.m12.dBC:syMA.commemoration96.text
ltx/swh_redirects_oak/sy.m12.dBC:syMA.lastline	@ltx/swh_ke_oak/sy.m12.dBC:syMA.lastline
ltx/swh_redirects_oak/sy.m12.dBC:syMA.note1	@ltx/swh_ke_oak/sy.m12.dBC:syMA.note1
ltx/swh_redirects_oak/sy.m12.dBC:syMA.note2	@ltx/swh_ke_oak/sy.m12.dBC:syMA.note2
ltx/swh_redirects_oak/sy.m12.dBC:syMA.note3	@ltx/swh_ke_oak/sy.m12.dBC:syMA.note3
ltx/swh_redirects_oak/sy.m12.dBC:syMA.note4	@ltx/swh_ke_oak/sy.m12.dBC:syMA.note4
