ltx/swh_redirects_oak/sy.m03.d26:syMA.commemoration01.couplet1.title	@ltx/swh_ke_oak/sy.m03.d26:syMA.commemoration01.couplet1.title
ltx/swh_redirects_oak/sy.m03.d26:syMA.commemoration01.couplet1.verse1	@ltx/swh_ke_oak/sy.m03.d26:syMA.commemoration01.couplet1.verse1
ltx/swh_redirects_oak/sy.m03.d26:syMA.commemoration01.couplet1.verse2	@ltx/swh_ke_oak/sy.m03.d26:syMA.commemoration01.couplet1.verse2
ltx/swh_redirects_oak/sy.m03.d26:syMA.commemoration01.single1	@ltx/swh_ke_oak/sy.m03.d26:syMA.commemoration01.single1
ltx/swh_redirects_oak/sy.m03.d26:syMA.commemoration01.text	@ltx/swh_ke_oak/sy.m03.d26:syMA.commemoration01.text
ltx/swh_redirects_oak/sy.m03.d26:syMA.commemoration02.couplet1.title	@ltx/swh_ke_oak/sy.m03.d26:syMA.commemoration02.couplet1.title
ltx/swh_redirects_oak/sy.m03.d26:syMA.commemoration02.couplet1.verse1	@ltx/swh_ke_oak/sy.m03.d26:syMA.commemoration02.couplet1.verse1
ltx/swh_redirects_oak/sy.m03.d26:syMA.commemoration02.couplet1.verse2	@ltx/swh_ke_oak/sy.m03.d26:syMA.commemoration02.couplet1.verse2
ltx/swh_redirects_oak/sy.m03.d26:syMA.commemoration02.narration.p01	@ltx/swh_ke_oak/sy.m03.d26:syMA.commemoration02.narration.p01
ltx/swh_redirects_oak/sy.m03.d26:syMA.commemoration02.text	@ltx/swh_ke_oak/sy.m03.d26:syMA.commemoration02.text
ltx/swh_redirects_oak/sy.m03.d26:syMA.commemoration03.couplet1.title	@ltx/swh_ke_oak/sy.m03.d26:syMA.commemoration03.couplet1.title
ltx/swh_redirects_oak/sy.m03.d26:syMA.commemoration03.couplet1.verse1	@ltx/swh_ke_oak/sy.m03.d26:syMA.commemoration03.couplet1.verse1
ltx/swh_redirects_oak/sy.m03.d26:syMA.commemoration03.couplet1.verse2	@ltx/swh_ke_oak/sy.m03.d26:syMA.commemoration03.couplet1.verse2
ltx/swh_redirects_oak/sy.m03.d26:syMA.commemoration03.couplet2.verse1	@ltx/swh_ke_oak/sy.m03.d26:syMA.commemoration03.couplet2.verse1
ltx/swh_redirects_oak/sy.m03.d26:syMA.commemoration03.couplet2.verse2	@ltx/swh_ke_oak/sy.m03.d26:syMA.commemoration03.couplet2.verse2
ltx/swh_redirects_oak/sy.m03.d26:syMA.commemoration03.couplet3.verse1	@ltx/swh_ke_oak/sy.m03.d26:syMA.commemoration03.couplet3.verse1
ltx/swh_redirects_oak/sy.m03.d26:syMA.commemoration03.couplet3.verse2	@ltx/swh_ke_oak/sy.m03.d26:syMA.commemoration03.couplet3.verse2
ltx/swh_redirects_oak/sy.m03.d26:syMA.commemoration03.couplet4.verse1	@ltx/swh_ke_oak/sy.m03.d26:syMA.commemoration03.couplet4.verse1
ltx/swh_redirects_oak/sy.m03.d26:syMA.commemoration03.couplet4.verse2	@ltx/swh_ke_oak/sy.m03.d26:syMA.commemoration03.couplet4.verse2
ltx/swh_redirects_oak/sy.m03.d26:syMA.commemoration03.narration.p01	@ltx/swh_ke_oak/sy.m03.d26:syMA.commemoration03.narration.p01
ltx/swh_redirects_oak/sy.m03.d26:syMA.commemoration03.text	@ltx/swh_ke_oak/sy.m03.d26:syMA.commemoration03.text
ltx/swh_redirects_oak/sy.m03.d26:syMA.commemoration04.couplet1.title	@ltx/swh_ke_oak/sy.m03.d26:syMA.commemoration04.couplet1.title
ltx/swh_redirects_oak/sy.m03.d26:syMA.commemoration04.couplet1.verse1	@ltx/swh_ke_oak/sy.m03.d26:syMA.commemoration04.couplet1.verse1
ltx/swh_redirects_oak/sy.m03.d26:syMA.commemoration04.couplet1.verse2	@ltx/swh_ke_oak/sy.m03.d26:syMA.commemoration04.couplet1.verse2
ltx/swh_redirects_oak/sy.m03.d26:syMA.commemoration04.narration.p01	@ltx/swh_ke_oak/sy.m03.d26:syMA.commemoration04.narration.p01
ltx/swh_redirects_oak/sy.m03.d26:syMA.commemoration04.text	@ltx/swh_ke_oak/sy.m03.d26:syMA.commemoration04.text
ltx/swh_redirects_oak/sy.m03.d26:syMA.commemoration05.couplet1.title	@ltx/swh_ke_oak/sy.m03.d26:syMA.commemoration05.couplet1.title
ltx/swh_redirects_oak/sy.m03.d26:syMA.commemoration05.couplet1.verse1	@ltx/swh_ke_oak/sy.m03.d26:syMA.commemoration05.couplet1.verse1
ltx/swh_redirects_oak/sy.m03.d26:syMA.commemoration05.couplet1.verse2	@ltx/swh_ke_oak/sy.m03.d26:syMA.commemoration05.couplet1.verse2
ltx/swh_redirects_oak/sy.m03.d26:syMA.commemoration05.text	@ltx/swh_ke_oak/sy.m03.d26:syMA.commemoration05.text
ltx/swh_redirects_oak/sy.m03.d26:syMA.lastline	@ltx/swh_ke_oak/sy.m03.d26:syMA.lastline
ltx/swh_redirects_oak/sy.m03.d26:syMA.note1	@ltx/swh_ke_oak/sy.m03.d26:syMA.note1
