ltx/swh_redirects_oak/theotokarion.m1.d1:thCA.Kathisma11.incipit	@ltx/swh_ke_oak/theotokarion.m1.d1:thCA.Kathisma11.incipit
ltx/swh_redirects_oak/theotokarion.m1.d1:thCA.Kathisma11.melody	@ltx/swh_ke_oak/theotokarion.m1.d1:thCA.Kathisma11.melody
ltx/swh_redirects_oak/theotokarion.m1.d1:thCA.Kathisma11.mode	@ltx/swh_ke_oak/theotokarion.m1.d1:thCA.Kathisma11.mode
ltx/swh_redirects_oak/theotokarion.m1.d1:thCA.Kathisma11.text	@ltx/swh_ke_oak/theotokarion.m1.d1:thCA.Kathisma11.text
ltx/swh_redirects_oak/theotokarion.m1.d1:thCA.Ode11.incipit	@ltx/swh_ke_oak/theotokarion.m1.d1:thCA.Ode11.incipit
ltx/swh_redirects_oak/theotokarion.m1.d1:thCA.Ode11.melody	@ltx/swh_ke_oak/theotokarion.m1.d1:thCA.Ode11.melody
ltx/swh_redirects_oak/theotokarion.m1.d1:thCA.Ode11.mode	@ltx/swh_ke_oak/theotokarion.m1.d1:thCA.Ode11.mode
ltx/swh_redirects_oak/theotokarion.m1.d1:thCA.Ode11.ode	@ltx/swh_ke_oak/theotokarion.m1.d1:thCA.Ode11.ode
ltx/swh_redirects_oak/theotokarion.m1.d1:thCA.Ode11.text	@ltx/swh_ke_oak/theotokarion.m1.d1:thCA.Ode11.text
ltx/swh_redirects_oak/theotokarion.m1.d1:thCA.Ode12.incipit	@ltx/swh_ke_oak/theotokarion.m1.d1:thCA.Ode12.incipit
ltx/swh_redirects_oak/theotokarion.m1.d1:thCA.Ode12.melody	@ltx/swh_ke_oak/theotokarion.m1.d1:thCA.Ode12.melody
ltx/swh_redirects_oak/theotokarion.m1.d1:thCA.Ode12.mode	@ltx/swh_ke_oak/theotokarion.m1.d1:thCA.Ode12.mode
ltx/swh_redirects_oak/theotokarion.m1.d1:thCA.Ode12.ode	@ltx/swh_ke_oak/theotokarion.m1.d1:thCA.Ode12.ode
ltx/swh_redirects_oak/theotokarion.m1.d1:thCA.Ode12.text	@ltx/swh_ke_oak/theotokarion.m1.d1:thCA.Ode12.text
ltx/swh_redirects_oak/theotokarion.m1.d1:thCA.Ode13.incipit	@ltx/swh_ke_oak/theotokarion.m1.d1:thCA.Ode13.incipit
ltx/swh_redirects_oak/theotokarion.m1.d1:thCA.Ode13.melody	@ltx/swh_ke_oak/theotokarion.m1.d1:thCA.Ode13.melody
ltx/swh_redirects_oak/theotokarion.m1.d1:thCA.Ode13.mode	@ltx/swh_ke_oak/theotokarion.m1.d1:thCA.Ode13.mode
ltx/swh_redirects_oak/theotokarion.m1.d1:thCA.Ode13.ode	@ltx/swh_ke_oak/theotokarion.m1.d1:thCA.Ode13.ode
ltx/swh_redirects_oak/theotokarion.m1.d1:thCA.Ode13.text	@ltx/swh_ke_oak/theotokarion.m1.d1:thCA.Ode13.text
ltx/swh_redirects_oak/theotokarion.m1.d1:thCA.Ode14.incipit	@ltx/swh_ke_oak/theotokarion.m1.d1:thCA.Ode14.incipit
ltx/swh_redirects_oak/theotokarion.m1.d1:thCA.Ode14.melody	@ltx/swh_ke_oak/theotokarion.m1.d1:thCA.Ode14.melody
ltx/swh_redirects_oak/theotokarion.m1.d1:thCA.Ode14.mode	@ltx/swh_ke_oak/theotokarion.m1.d1:thCA.Ode14.mode
ltx/swh_redirects_oak/theotokarion.m1.d1:thCA.Ode14.ode	@ltx/swh_ke_oak/theotokarion.m1.d1:thCA.Ode14.ode
ltx/swh_redirects_oak/theotokarion.m1.d1:thCA.Ode14.text	@ltx/swh_ke_oak/theotokarion.m1.d1:thCA.Ode14.text
ltx/swh_redirects_oak/theotokarion.m1.d1:thCA.Ode31.incipit	@ltx/swh_ke_oak/theotokarion.m1.d1:thCA.Ode31.incipit
ltx/swh_redirects_oak/theotokarion.m1.d1:thCA.Ode31.melody	@ltx/swh_ke_oak/theotokarion.m1.d1:thCA.Ode31.melody
ltx/swh_redirects_oak/theotokarion.m1.d1:thCA.Ode31.mode	@ltx/swh_ke_oak/theotokarion.m1.d1:thCA.Ode31.mode
ltx/swh_redirects_oak/theotokarion.m1.d1:thCA.Ode31.ode	@ltx/swh_ke_oak/theotokarion.m1.d1:thCA.Ode31.ode
ltx/swh_redirects_oak/theotokarion.m1.d1:thCA.Ode31.text	@ltx/swh_ke_oak/theotokarion.m1.d1:thCA.Ode31.text
ltx/swh_redirects_oak/theotokarion.m1.d1:thCA.Ode32.incipit	@ltx/swh_ke_oak/theotokarion.m1.d1:thCA.Ode32.incipit
ltx/swh_redirects_oak/theotokarion.m1.d1:thCA.Ode32.melody	@ltx/swh_ke_oak/theotokarion.m1.d1:thCA.Ode32.melody
ltx/swh_redirects_oak/theotokarion.m1.d1:thCA.Ode32.mode	@ltx/swh_ke_oak/theotokarion.m1.d1:thCA.Ode32.mode
ltx/swh_redirects_oak/theotokarion.m1.d1:thCA.Ode32.ode	@ltx/swh_ke_oak/theotokarion.m1.d1:thCA.Ode32.ode
ltx/swh_redirects_oak/theotokarion.m1.d1:thCA.Ode32.text	@ltx/swh_ke_oak/theotokarion.m1.d1:thCA.Ode32.text
ltx/swh_redirects_oak/theotokarion.m1.d1:thCA.Ode33.incipit	@ltx/swh_ke_oak/theotokarion.m1.d1:thCA.Ode33.incipit
ltx/swh_redirects_oak/theotokarion.m1.d1:thCA.Ode33.melody	@ltx/swh_ke_oak/theotokarion.m1.d1:thCA.Ode33.melody
ltx/swh_redirects_oak/theotokarion.m1.d1:thCA.Ode33.mode	@ltx/swh_ke_oak/theotokarion.m1.d1:thCA.Ode33.mode
ltx/swh_redirects_oak/theotokarion.m1.d1:thCA.Ode33.ode	@ltx/swh_ke_oak/theotokarion.m1.d1:thCA.Ode33.ode
ltx/swh_redirects_oak/theotokarion.m1.d1:thCA.Ode33.text	@ltx/swh_ke_oak/theotokarion.m1.d1:thCA.Ode33.text
ltx/swh_redirects_oak/theotokarion.m1.d1:thCA.Ode34.incipit	@ltx/swh_ke_oak/theotokarion.m1.d1:thCA.Ode34.incipit
ltx/swh_redirects_oak/theotokarion.m1.d1:thCA.Ode34.melody	@ltx/swh_ke_oak/theotokarion.m1.d1:thCA.Ode34.melody
ltx/swh_redirects_oak/theotokarion.m1.d1:thCA.Ode34.mode	@ltx/swh_ke_oak/theotokarion.m1.d1:thCA.Ode34.mode
ltx/swh_redirects_oak/theotokarion.m1.d1:thCA.Ode34.ode	@ltx/swh_ke_oak/theotokarion.m1.d1:thCA.Ode34.ode
ltx/swh_redirects_oak/theotokarion.m1.d1:thCA.Ode34.text	@ltx/swh_ke_oak/theotokarion.m1.d1:thCA.Ode34.text
ltx/swh_redirects_oak/theotokarion.m1.d1:thCA.Ode41.incipit	@ltx/swh_ke_oak/theotokarion.m1.d1:thCA.Ode41.incipit
ltx/swh_redirects_oak/theotokarion.m1.d1:thCA.Ode41.melody	@ltx/swh_ke_oak/theotokarion.m1.d1:thCA.Ode41.melody
ltx/swh_redirects_oak/theotokarion.m1.d1:thCA.Ode41.mode	@ltx/swh_ke_oak/theotokarion.m1.d1:thCA.Ode41.mode
ltx/swh_redirects_oak/theotokarion.m1.d1:thCA.Ode41.ode	@ltx/swh_ke_oak/theotokarion.m1.d1:thCA.Ode41.ode
ltx/swh_redirects_oak/theotokarion.m1.d1:thCA.Ode41.text	@ltx/swh_ke_oak/theotokarion.m1.d1:thCA.Ode41.text
ltx/swh_redirects_oak/theotokarion.m1.d1:thCA.Ode42.incipit	@ltx/swh_ke_oak/theotokarion.m1.d1:thCA.Ode42.incipit
ltx/swh_redirects_oak/theotokarion.m1.d1:thCA.Ode42.melody	@ltx/swh_ke_oak/theotokarion.m1.d1:thCA.Ode42.melody
ltx/swh_redirects_oak/theotokarion.m1.d1:thCA.Ode42.mode	@ltx/swh_ke_oak/theotokarion.m1.d1:thCA.Ode42.mode
ltx/swh_redirects_oak/theotokarion.m1.d1:thCA.Ode42.ode	@ltx/swh_ke_oak/theotokarion.m1.d1:thCA.Ode42.ode
ltx/swh_redirects_oak/theotokarion.m1.d1:thCA.Ode42.text	@ltx/swh_ke_oak/theotokarion.m1.d1:thCA.Ode42.text
ltx/swh_redirects_oak/theotokarion.m1.d1:thCA.Ode43.incipit	@ltx/swh_ke_oak/theotokarion.m1.d1:thCA.Ode43.incipit
ltx/swh_redirects_oak/theotokarion.m1.d1:thCA.Ode43.melody	@ltx/swh_ke_oak/theotokarion.m1.d1:thCA.Ode43.melody
ltx/swh_redirects_oak/theotokarion.m1.d1:thCA.Ode43.mode	@ltx/swh_ke_oak/theotokarion.m1.d1:thCA.Ode43.mode
ltx/swh_redirects_oak/theotokarion.m1.d1:thCA.Ode43.ode	@ltx/swh_ke_oak/theotokarion.m1.d1:thCA.Ode43.ode
ltx/swh_redirects_oak/theotokarion.m1.d1:thCA.Ode43.text	@ltx/swh_ke_oak/theotokarion.m1.d1:thCA.Ode43.text
ltx/swh_redirects_oak/theotokarion.m1.d1:thCA.Ode44.incipit	@ltx/swh_ke_oak/theotokarion.m1.d1:thCA.Ode44.incipit
ltx/swh_redirects_oak/theotokarion.m1.d1:thCA.Ode44.melody	@ltx/swh_ke_oak/theotokarion.m1.d1:thCA.Ode44.melody
ltx/swh_redirects_oak/theotokarion.m1.d1:thCA.Ode44.mode	@ltx/swh_ke_oak/theotokarion.m1.d1:thCA.Ode44.mode
ltx/swh_redirects_oak/theotokarion.m1.d1:thCA.Ode44.ode	@ltx/swh_ke_oak/theotokarion.m1.d1:thCA.Ode44.ode
ltx/swh_redirects_oak/theotokarion.m1.d1:thCA.Ode44.text	@ltx/swh_ke_oak/theotokarion.m1.d1:thCA.Ode44.text
ltx/swh_redirects_oak/theotokarion.m1.d1:thCA.Ode51.incipit	@ltx/swh_ke_oak/theotokarion.m1.d1:thCA.Ode51.incipit
ltx/swh_redirects_oak/theotokarion.m1.d1:thCA.Ode51.melody	@ltx/swh_ke_oak/theotokarion.m1.d1:thCA.Ode51.melody
ltx/swh_redirects_oak/theotokarion.m1.d1:thCA.Ode51.mode	@ltx/swh_ke_oak/theotokarion.m1.d1:thCA.Ode51.mode
ltx/swh_redirects_oak/theotokarion.m1.d1:thCA.Ode51.ode	@ltx/swh_ke_oak/theotokarion.m1.d1:thCA.Ode51.ode
ltx/swh_redirects_oak/theotokarion.m1.d1:thCA.Ode51.text	@ltx/swh_ke_oak/theotokarion.m1.d1:thCA.Ode51.text
ltx/swh_redirects_oak/theotokarion.m1.d1:thCA.Ode52.incipit	@ltx/swh_ke_oak/theotokarion.m1.d1:thCA.Ode52.incipit
ltx/swh_redirects_oak/theotokarion.m1.d1:thCA.Ode52.melody	@ltx/swh_ke_oak/theotokarion.m1.d1:thCA.Ode52.melody
ltx/swh_redirects_oak/theotokarion.m1.d1:thCA.Ode52.mode	@ltx/swh_ke_oak/theotokarion.m1.d1:thCA.Ode52.mode
ltx/swh_redirects_oak/theotokarion.m1.d1:thCA.Ode52.ode	@ltx/swh_ke_oak/theotokarion.m1.d1:thCA.Ode52.ode
ltx/swh_redirects_oak/theotokarion.m1.d1:thCA.Ode52.text	@ltx/swh_ke_oak/theotokarion.m1.d1:thCA.Ode52.text
ltx/swh_redirects_oak/theotokarion.m1.d1:thCA.Ode53.incipit	@ltx/swh_ke_oak/theotokarion.m1.d1:thCA.Ode53.incipit
ltx/swh_redirects_oak/theotokarion.m1.d1:thCA.Ode53.melody	@ltx/swh_ke_oak/theotokarion.m1.d1:thCA.Ode53.melody
ltx/swh_redirects_oak/theotokarion.m1.d1:thCA.Ode53.mode	@ltx/swh_ke_oak/theotokarion.m1.d1:thCA.Ode53.mode
ltx/swh_redirects_oak/theotokarion.m1.d1:thCA.Ode53.ode	@ltx/swh_ke_oak/theotokarion.m1.d1:thCA.Ode53.ode
ltx/swh_redirects_oak/theotokarion.m1.d1:thCA.Ode53.text	@ltx/swh_ke_oak/theotokarion.m1.d1:thCA.Ode53.text
ltx/swh_redirects_oak/theotokarion.m1.d1:thCA.Ode54.incipit	@ltx/swh_ke_oak/theotokarion.m1.d1:thCA.Ode54.incipit
ltx/swh_redirects_oak/theotokarion.m1.d1:thCA.Ode54.melody	@ltx/swh_ke_oak/theotokarion.m1.d1:thCA.Ode54.melody
ltx/swh_redirects_oak/theotokarion.m1.d1:thCA.Ode54.mode	@ltx/swh_ke_oak/theotokarion.m1.d1:thCA.Ode54.mode
ltx/swh_redirects_oak/theotokarion.m1.d1:thCA.Ode54.ode	@ltx/swh_ke_oak/theotokarion.m1.d1:thCA.Ode54.ode
ltx/swh_redirects_oak/theotokarion.m1.d1:thCA.Ode54.text	@ltx/swh_ke_oak/theotokarion.m1.d1:thCA.Ode54.text
ltx/swh_redirects_oak/theotokarion.m1.d1:thCA.Ode61.incipit	@ltx/swh_ke_oak/theotokarion.m1.d1:thCA.Ode61.incipit
ltx/swh_redirects_oak/theotokarion.m1.d1:thCA.Ode61.melody	@ltx/swh_ke_oak/theotokarion.m1.d1:thCA.Ode61.melody
ltx/swh_redirects_oak/theotokarion.m1.d1:thCA.Ode61.mode	@ltx/swh_ke_oak/theotokarion.m1.d1:thCA.Ode61.mode
ltx/swh_redirects_oak/theotokarion.m1.d1:thCA.Ode61.ode	@ltx/swh_ke_oak/theotokarion.m1.d1:thCA.Ode61.ode
ltx/swh_redirects_oak/theotokarion.m1.d1:thCA.Ode61.text	@ltx/swh_ke_oak/theotokarion.m1.d1:thCA.Ode61.text
ltx/swh_redirects_oak/theotokarion.m1.d1:thCA.Ode62.incipit	@ltx/swh_ke_oak/theotokarion.m1.d1:thCA.Ode62.incipit
ltx/swh_redirects_oak/theotokarion.m1.d1:thCA.Ode62.melody	@ltx/swh_ke_oak/theotokarion.m1.d1:thCA.Ode62.melody
ltx/swh_redirects_oak/theotokarion.m1.d1:thCA.Ode62.mode	@ltx/swh_ke_oak/theotokarion.m1.d1:thCA.Ode62.mode
ltx/swh_redirects_oak/theotokarion.m1.d1:thCA.Ode62.ode	@ltx/swh_ke_oak/theotokarion.m1.d1:thCA.Ode62.ode
ltx/swh_redirects_oak/theotokarion.m1.d1:thCA.Ode62.text	@ltx/swh_ke_oak/theotokarion.m1.d1:thCA.Ode62.text
ltx/swh_redirects_oak/theotokarion.m1.d1:thCA.Ode63.incipit	@ltx/swh_ke_oak/theotokarion.m1.d1:thCA.Ode63.incipit
ltx/swh_redirects_oak/theotokarion.m1.d1:thCA.Ode63.melody	@ltx/swh_ke_oak/theotokarion.m1.d1:thCA.Ode63.melody
ltx/swh_redirects_oak/theotokarion.m1.d1:thCA.Ode63.mode	@ltx/swh_ke_oak/theotokarion.m1.d1:thCA.Ode63.mode
ltx/swh_redirects_oak/theotokarion.m1.d1:thCA.Ode63.ode	@ltx/swh_ke_oak/theotokarion.m1.d1:thCA.Ode63.ode
ltx/swh_redirects_oak/theotokarion.m1.d1:thCA.Ode63.text	@ltx/swh_ke_oak/theotokarion.m1.d1:thCA.Ode63.text
ltx/swh_redirects_oak/theotokarion.m1.d1:thCA.Ode64.incipit	@ltx/swh_ke_oak/theotokarion.m1.d1:thCA.Ode64.incipit
ltx/swh_redirects_oak/theotokarion.m1.d1:thCA.Ode64.melody	@ltx/swh_ke_oak/theotokarion.m1.d1:thCA.Ode64.melody
ltx/swh_redirects_oak/theotokarion.m1.d1:thCA.Ode64.mode	@ltx/swh_ke_oak/theotokarion.m1.d1:thCA.Ode64.mode
ltx/swh_redirects_oak/theotokarion.m1.d1:thCA.Ode64.ode	@ltx/swh_ke_oak/theotokarion.m1.d1:thCA.Ode64.ode
ltx/swh_redirects_oak/theotokarion.m1.d1:thCA.Ode64.text	@ltx/swh_ke_oak/theotokarion.m1.d1:thCA.Ode64.text
ltx/swh_redirects_oak/theotokarion.m1.d1:thCA.Ode71.incipit	@ltx/swh_ke_oak/theotokarion.m1.d1:thCA.Ode71.incipit
ltx/swh_redirects_oak/theotokarion.m1.d1:thCA.Ode71.melody	@ltx/swh_ke_oak/theotokarion.m1.d1:thCA.Ode71.melody
ltx/swh_redirects_oak/theotokarion.m1.d1:thCA.Ode71.mode	@ltx/swh_ke_oak/theotokarion.m1.d1:thCA.Ode71.mode
ltx/swh_redirects_oak/theotokarion.m1.d1:thCA.Ode71.ode	@ltx/swh_ke_oak/theotokarion.m1.d1:thCA.Ode71.ode
ltx/swh_redirects_oak/theotokarion.m1.d1:thCA.Ode71.text	@ltx/swh_ke_oak/theotokarion.m1.d1:thCA.Ode71.text
ltx/swh_redirects_oak/theotokarion.m1.d1:thCA.Ode72.incipit	@ltx/swh_ke_oak/theotokarion.m1.d1:thCA.Ode72.incipit
ltx/swh_redirects_oak/theotokarion.m1.d1:thCA.Ode72.melody	@ltx/swh_ke_oak/theotokarion.m1.d1:thCA.Ode72.melody
ltx/swh_redirects_oak/theotokarion.m1.d1:thCA.Ode72.mode	@ltx/swh_ke_oak/theotokarion.m1.d1:thCA.Ode72.mode
ltx/swh_redirects_oak/theotokarion.m1.d1:thCA.Ode72.ode	@ltx/swh_ke_oak/theotokarion.m1.d1:thCA.Ode72.ode
ltx/swh_redirects_oak/theotokarion.m1.d1:thCA.Ode72.text	@ltx/swh_ke_oak/theotokarion.m1.d1:thCA.Ode72.text
ltx/swh_redirects_oak/theotokarion.m1.d1:thCA.Ode73.incipit	@ltx/swh_ke_oak/theotokarion.m1.d1:thCA.Ode73.incipit
ltx/swh_redirects_oak/theotokarion.m1.d1:thCA.Ode73.melody	@ltx/swh_ke_oak/theotokarion.m1.d1:thCA.Ode73.melody
ltx/swh_redirects_oak/theotokarion.m1.d1:thCA.Ode73.mode	@ltx/swh_ke_oak/theotokarion.m1.d1:thCA.Ode73.mode
ltx/swh_redirects_oak/theotokarion.m1.d1:thCA.Ode73.ode	@ltx/swh_ke_oak/theotokarion.m1.d1:thCA.Ode73.ode
ltx/swh_redirects_oak/theotokarion.m1.d1:thCA.Ode73.text	@ltx/swh_ke_oak/theotokarion.m1.d1:thCA.Ode73.text
ltx/swh_redirects_oak/theotokarion.m1.d1:thCA.Ode74.incipit	@ltx/swh_ke_oak/theotokarion.m1.d1:thCA.Ode74.incipit
ltx/swh_redirects_oak/theotokarion.m1.d1:thCA.Ode74.melody	@ltx/swh_ke_oak/theotokarion.m1.d1:thCA.Ode74.melody
ltx/swh_redirects_oak/theotokarion.m1.d1:thCA.Ode74.mode	@ltx/swh_ke_oak/theotokarion.m1.d1:thCA.Ode74.mode
ltx/swh_redirects_oak/theotokarion.m1.d1:thCA.Ode74.ode	@ltx/swh_ke_oak/theotokarion.m1.d1:thCA.Ode74.ode
ltx/swh_redirects_oak/theotokarion.m1.d1:thCA.Ode74.text	@ltx/swh_ke_oak/theotokarion.m1.d1:thCA.Ode74.text
ltx/swh_redirects_oak/theotokarion.m1.d1:thCA.Ode81.incipit	@ltx/swh_ke_oak/theotokarion.m1.d1:thCA.Ode81.incipit
ltx/swh_redirects_oak/theotokarion.m1.d1:thCA.Ode81.melody	@ltx/swh_ke_oak/theotokarion.m1.d1:thCA.Ode81.melody
ltx/swh_redirects_oak/theotokarion.m1.d1:thCA.Ode81.mode	@ltx/swh_ke_oak/theotokarion.m1.d1:thCA.Ode81.mode
ltx/swh_redirects_oak/theotokarion.m1.d1:thCA.Ode81.ode	@ltx/swh_ke_oak/theotokarion.m1.d1:thCA.Ode81.ode
ltx/swh_redirects_oak/theotokarion.m1.d1:thCA.Ode81.text	@ltx/swh_ke_oak/theotokarion.m1.d1:thCA.Ode81.text
ltx/swh_redirects_oak/theotokarion.m1.d1:thCA.Ode82.incipit	@ltx/swh_ke_oak/theotokarion.m1.d1:thCA.Ode82.incipit
ltx/swh_redirects_oak/theotokarion.m1.d1:thCA.Ode82.melody	@ltx/swh_ke_oak/theotokarion.m1.d1:thCA.Ode82.melody
ltx/swh_redirects_oak/theotokarion.m1.d1:thCA.Ode82.mode	@ltx/swh_ke_oak/theotokarion.m1.d1:thCA.Ode82.mode
ltx/swh_redirects_oak/theotokarion.m1.d1:thCA.Ode82.ode	@ltx/swh_ke_oak/theotokarion.m1.d1:thCA.Ode82.ode
ltx/swh_redirects_oak/theotokarion.m1.d1:thCA.Ode82.text	@ltx/swh_ke_oak/theotokarion.m1.d1:thCA.Ode82.text
ltx/swh_redirects_oak/theotokarion.m1.d1:thCA.Ode83.incipit	@ltx/swh_ke_oak/theotokarion.m1.d1:thCA.Ode83.incipit
ltx/swh_redirects_oak/theotokarion.m1.d1:thCA.Ode83.melody	@ltx/swh_ke_oak/theotokarion.m1.d1:thCA.Ode83.melody
ltx/swh_redirects_oak/theotokarion.m1.d1:thCA.Ode83.mode	@ltx/swh_ke_oak/theotokarion.m1.d1:thCA.Ode83.mode
ltx/swh_redirects_oak/theotokarion.m1.d1:thCA.Ode83.ode	@ltx/swh_ke_oak/theotokarion.m1.d1:thCA.Ode83.ode
ltx/swh_redirects_oak/theotokarion.m1.d1:thCA.Ode83.text	@ltx/swh_ke_oak/theotokarion.m1.d1:thCA.Ode83.text
ltx/swh_redirects_oak/theotokarion.m1.d1:thCA.Ode84.incipit	@ltx/swh_ke_oak/theotokarion.m1.d1:thCA.Ode84.incipit
ltx/swh_redirects_oak/theotokarion.m1.d1:thCA.Ode84.melody	@ltx/swh_ke_oak/theotokarion.m1.d1:thCA.Ode84.melody
ltx/swh_redirects_oak/theotokarion.m1.d1:thCA.Ode84.mode	@ltx/swh_ke_oak/theotokarion.m1.d1:thCA.Ode84.mode
ltx/swh_redirects_oak/theotokarion.m1.d1:thCA.Ode84.ode	@ltx/swh_ke_oak/theotokarion.m1.d1:thCA.Ode84.ode
ltx/swh_redirects_oak/theotokarion.m1.d1:thCA.Ode84.text	@ltx/swh_ke_oak/theotokarion.m1.d1:thCA.Ode84.text
ltx/swh_redirects_oak/theotokarion.m1.d1:thCA.Ode8H.incipit	@ltx/swh_ke_oak/theotokarion.m1.d1:thCA.Ode8H.incipit
ltx/swh_redirects_oak/theotokarion.m1.d1:thCA.Ode8H.melody	@ltx/swh_ke_oak/theotokarion.m1.d1:thCA.Ode8H.melody
ltx/swh_redirects_oak/theotokarion.m1.d1:thCA.Ode8H.mode	@ltx/swh_ke_oak/theotokarion.m1.d1:thCA.Ode8H.mode
ltx/swh_redirects_oak/theotokarion.m1.d1:thCA.Ode8H.ode	@ltx/swh_ke_oak/theotokarion.m1.d1:thCA.Ode8H.ode
ltx/swh_redirects_oak/theotokarion.m1.d1:thCA.Ode8H.text	@ltx/swh_ke_oak/theotokarion.m1.d1:thCA.Ode8H.text
ltx/swh_redirects_oak/theotokarion.m1.d1:thCA.Ode91.incipit	@ltx/swh_ke_oak/theotokarion.m1.d1:thCA.Ode91.incipit
ltx/swh_redirects_oak/theotokarion.m1.d1:thCA.Ode91.melody	@ltx/swh_ke_oak/theotokarion.m1.d1:thCA.Ode91.melody
ltx/swh_redirects_oak/theotokarion.m1.d1:thCA.Ode91.mode	@ltx/swh_ke_oak/theotokarion.m1.d1:thCA.Ode91.mode
ltx/swh_redirects_oak/theotokarion.m1.d1:thCA.Ode91.ode	@ltx/swh_ke_oak/theotokarion.m1.d1:thCA.Ode91.ode
ltx/swh_redirects_oak/theotokarion.m1.d1:thCA.Ode91.text	@ltx/swh_ke_oak/theotokarion.m1.d1:thCA.Ode91.text
ltx/swh_redirects_oak/theotokarion.m1.d1:thCA.Ode92.incipit	@ltx/swh_ke_oak/theotokarion.m1.d1:thCA.Ode92.incipit
ltx/swh_redirects_oak/theotokarion.m1.d1:thCA.Ode92.melody	@ltx/swh_ke_oak/theotokarion.m1.d1:thCA.Ode92.melody
ltx/swh_redirects_oak/theotokarion.m1.d1:thCA.Ode92.mode	@ltx/swh_ke_oak/theotokarion.m1.d1:thCA.Ode92.mode
ltx/swh_redirects_oak/theotokarion.m1.d1:thCA.Ode92.ode	@ltx/swh_ke_oak/theotokarion.m1.d1:thCA.Ode92.ode
ltx/swh_redirects_oak/theotokarion.m1.d1:thCA.Ode92.text	@ltx/swh_ke_oak/theotokarion.m1.d1:thCA.Ode92.text
ltx/swh_redirects_oak/theotokarion.m1.d1:thCA.Ode93.incipit	@ltx/swh_ke_oak/theotokarion.m1.d1:thCA.Ode93.incipit
ltx/swh_redirects_oak/theotokarion.m1.d1:thCA.Ode93.melody	@ltx/swh_ke_oak/theotokarion.m1.d1:thCA.Ode93.melody
ltx/swh_redirects_oak/theotokarion.m1.d1:thCA.Ode93.mode	@ltx/swh_ke_oak/theotokarion.m1.d1:thCA.Ode93.mode
ltx/swh_redirects_oak/theotokarion.m1.d1:thCA.Ode93.ode	@ltx/swh_ke_oak/theotokarion.m1.d1:thCA.Ode93.ode
ltx/swh_redirects_oak/theotokarion.m1.d1:thCA.Ode93.text	@ltx/swh_ke_oak/theotokarion.m1.d1:thCA.Ode93.text
ltx/swh_redirects_oak/theotokarion.m1.d1:thCA.Ode94.incipit	@ltx/swh_ke_oak/theotokarion.m1.d1:thCA.Ode94.incipit
ltx/swh_redirects_oak/theotokarion.m1.d1:thCA.Ode94.melody	@ltx/swh_ke_oak/theotokarion.m1.d1:thCA.Ode94.melody
ltx/swh_redirects_oak/theotokarion.m1.d1:thCA.Ode94.mode	@ltx/swh_ke_oak/theotokarion.m1.d1:thCA.Ode94.mode
ltx/swh_redirects_oak/theotokarion.m1.d1:thCA.Ode94.ode	@ltx/swh_ke_oak/theotokarion.m1.d1:thCA.Ode94.ode
ltx/swh_redirects_oak/theotokarion.m1.d1:thCA.Ode94.text	@ltx/swh_ke_oak/theotokarion.m1.d1:thCA.Ode94.text
ltx/swh_redirects_oak/theotokarion.m1.d1:thCA.Stichera01.incipit	@ltx/swh_ke_oak/theotokarion.m1.d1:thCA.Stichera01.incipit
ltx/swh_redirects_oak/theotokarion.m1.d1:thCA.Stichera01.melody	@ltx/swh_ke_oak/theotokarion.m1.d1:thCA.Stichera01.melody
ltx/swh_redirects_oak/theotokarion.m1.d1:thCA.Stichera01.mode	@ltx/swh_ke_oak/theotokarion.m1.d1:thCA.Stichera01.mode
ltx/swh_redirects_oak/theotokarion.m1.d1:thCA.Stichera01.text	@ltx/swh_ke_oak/theotokarion.m1.d1:thCA.Stichera01.text
ltx/swh_redirects_oak/theotokarion.m1.d1:thCA.Stichera02.incipit	@ltx/swh_ke_oak/theotokarion.m1.d1:thCA.Stichera02.incipit
ltx/swh_redirects_oak/theotokarion.m1.d1:thCA.Stichera02.melody	@ltx/swh_ke_oak/theotokarion.m1.d1:thCA.Stichera02.melody
ltx/swh_redirects_oak/theotokarion.m1.d1:thCA.Stichera02.mode	@ltx/swh_ke_oak/theotokarion.m1.d1:thCA.Stichera02.mode
ltx/swh_redirects_oak/theotokarion.m1.d1:thCA.Stichera02.text	@ltx/swh_ke_oak/theotokarion.m1.d1:thCA.Stichera02.text
ltx/swh_redirects_oak/theotokarion.m1.d1:thCA.Stichera03.incipit	@ltx/swh_ke_oak/theotokarion.m1.d1:thCA.Stichera03.incipit
ltx/swh_redirects_oak/theotokarion.m1.d1:thCA.Stichera03.melody	@ltx/swh_ke_oak/theotokarion.m1.d1:thCA.Stichera03.melody
ltx/swh_redirects_oak/theotokarion.m1.d1:thCA.Stichera03.mode	@ltx/swh_ke_oak/theotokarion.m1.d1:thCA.Stichera03.mode
ltx/swh_redirects_oak/theotokarion.m1.d1:thCA.Stichera03.text	@ltx/swh_ke_oak/theotokarion.m1.d1:thCA.Stichera03.text
ltx/swh_redirects_oak/theotokarion.m1.d1:thCA.Stichera04.incipit	@ltx/swh_ke_oak/theotokarion.m1.d1:thCA.Stichera04.incipit
ltx/swh_redirects_oak/theotokarion.m1.d1:thCA.Stichera04.melody	@ltx/swh_ke_oak/theotokarion.m1.d1:thCA.Stichera04.melody
ltx/swh_redirects_oak/theotokarion.m1.d1:thCA.Stichera04.mode	@ltx/swh_ke_oak/theotokarion.m1.d1:thCA.Stichera04.mode
ltx/swh_redirects_oak/theotokarion.m1.d1:thCA.Stichera04.text	@ltx/swh_ke_oak/theotokarion.m1.d1:thCA.Stichera04.text
ltx/swh_redirects_oak/theotokarion.m1.d1:thCA.acrostic.notice1	@ltx/swh_ke_oak/theotokarion.m1.d1:thCA.acrostic.notice1
ltx/swh_redirects_oak/theotokarion.m1.d1:thCA.acrostic.text	@ltx/swh_ke_oak/theotokarion.m1.d1:thCA.acrostic.text
ltx/swh_redirects_oak/theotokarion.m1.d1:thCA.acrostic.title	@ltx/swh_ke_oak/theotokarion.m1.d1:thCA.acrostic.title
ltx/swh_redirects_oak/theotokarion.m1.d1:thCA.media.text	@ltx/swh_ke_oak/theotokarion.m1.d1:thCA.media.text
ltx/swh_redirects_oak/theotokarion.m1.d1:thCA.note1	@ltx/swh_ke_oak/theotokarion.m1.d1:thCA.note1
ltx/swh_redirects_oak/theotokarion.m1.d1:thCA.note2	@ltx/swh_ke_oak/theotokarion.m1.d1:thCA.note2
ltx/swh_redirects_oak/theotokarion.m1.d1:thCA.note3	@ltx/swh_ke_oak/theotokarion.m1.d1:thCA.note3
ltx/swh_redirects_oak/theotokarion.m1.d1:thCA.note4	@ltx/swh_ke_oak/theotokarion.m1.d1:thCA.note4
ltx/swh_redirects_oak/theotokarion.m1.d1:thCA.note5	@ltx/swh_ke_oak/theotokarion.m1.d1:thCA.note5
ltx/swh_redirects_oak/theotokarion.m1.d1:thCA.note6	@ltx/swh_ke_oak/theotokarion.m1.d1:thCA.note6
ltx/swh_redirects_oak/theotokarion.m1.d1:thCA.note7	@ltx/swh_ke_oak/theotokarion.m1.d1:thCA.note7
ltx/swh_redirects_oak/theotokarion.m1.d1:thCA.note8	@ltx/swh_ke_oak/theotokarion.m1.d1:thCA.note8
ltx/swh_redirects_oak/theotokarion.m1.d1:thCA.note9	@ltx/swh_ke_oak/theotokarion.m1.d1:thCA.note9
ltx/swh_redirects_oak/theotokarion.m1.d1:thCA.poet	@ltx/swh_ke_oak/theotokarion.m1.d1:thCA.poet
ltx/swh_redirects_oak/theotokarion.m1.d1:thCA.title1	@ltx/swh_ke_oak/theotokarion.m1.d1:thCA.title1
ltx/swh_redirects_oak/theotokarion.m1.d1:thCA.title2	@ltx/swh_ke_oak/theotokarion.m1.d1:thCA.title2
ltx/swh_redirects_oak/theotokarion.m1.d1:thCA.translator1	@ltx/swh_ke_oak/theotokarion.m1.d1:thCA.translator1
ltx/swh_redirects_oak/theotokarion.m1.d1:thCA.translator2	@ltx/swh_ke_oak/theotokarion.m1.d1:thCA.translator2
ltx/swh_redirects_oak/theotokarion.m1.d1:thCA.verse	@ltx/swh_ke_oak/theotokarion.m1.d1:thCA.verse
