ltx/swh_redirects_oak/hi.hi04:hiMA.Key01.title	@ltx/swh_ke_oak/hi.hi04:hiMA.Key01.title
ltx/swh_redirects_oak/hi.hi04:hiMA.Key0101.exclamation	@ltx/swh_ke_oak/hi.hi04:hiMA.Key0101.exclamation
ltx/swh_redirects_oak/hi.hi04:hiMA.Key0101.text	@ltx/swh_ke_oak/hi.hi04:hiMA.Key0101.text
ltx/swh_redirects_oak/hi.hi04:hiMA.Key0101.title	@ltx/swh_ke_oak/hi.hi04:hiMA.Key0101.title
ltx/swh_redirects_oak/hi.hi04:hiMA.Key0102.exclamation	@ltx/swh_ke_oak/hi.hi04:hiMA.Key0102.exclamation
ltx/swh_redirects_oak/hi.hi04:hiMA.Key0102.text	@ltx/swh_ke_oak/hi.hi04:hiMA.Key0102.text
ltx/swh_redirects_oak/hi.hi04:hiMA.Key0102.title	@ltx/swh_ke_oak/hi.hi04:hiMA.Key0102.title
ltx/swh_redirects_oak/hi.hi04:hiMA.Key0103.exclamation	@ltx/swh_ke_oak/hi.hi04:hiMA.Key0103.exclamation
ltx/swh_redirects_oak/hi.hi04:hiMA.Key0103.text	@ltx/swh_ke_oak/hi.hi04:hiMA.Key0103.text
ltx/swh_redirects_oak/hi.hi04:hiMA.Key0103.title	@ltx/swh_ke_oak/hi.hi04:hiMA.Key0103.title
ltx/swh_redirects_oak/hi.hi04:hiMA.Key0104.exclamation	@ltx/swh_ke_oak/hi.hi04:hiMA.Key0104.exclamation
ltx/swh_redirects_oak/hi.hi04:hiMA.Key0104.text	@ltx/swh_ke_oak/hi.hi04:hiMA.Key0104.text
ltx/swh_redirects_oak/hi.hi04:hiMA.Key0104.title	@ltx/swh_ke_oak/hi.hi04:hiMA.Key0104.title
ltx/swh_redirects_oak/hi.hi04:hiMA.Key0105.exclamation	@ltx/swh_ke_oak/hi.hi04:hiMA.Key0105.exclamation
ltx/swh_redirects_oak/hi.hi04:hiMA.Key0105.text	@ltx/swh_ke_oak/hi.hi04:hiMA.Key0105.text
ltx/swh_redirects_oak/hi.hi04:hiMA.Key0105.title	@ltx/swh_ke_oak/hi.hi04:hiMA.Key0105.title
ltx/swh_redirects_oak/hi.hi04:hiMA.Key0106.exclamation	@ltx/swh_ke_oak/hi.hi04:hiMA.Key0106.exclamation
ltx/swh_redirects_oak/hi.hi04:hiMA.Key0106.text	@ltx/swh_ke_oak/hi.hi04:hiMA.Key0106.text
ltx/swh_redirects_oak/hi.hi04:hiMA.Key0106.title	@ltx/swh_ke_oak/hi.hi04:hiMA.Key0106.title
ltx/swh_redirects_oak/hi.hi04:hiMA.Key0107.exclamation	@ltx/swh_ke_oak/hi.hi04:hiMA.Key0107.exclamation
ltx/swh_redirects_oak/hi.hi04:hiMA.Key0107.text	@ltx/swh_ke_oak/hi.hi04:hiMA.Key0107.text
ltx/swh_redirects_oak/hi.hi04:hiMA.Key0107.title	@ltx/swh_ke_oak/hi.hi04:hiMA.Key0107.title
ltx/swh_redirects_oak/hi.hi04:hiMA.Key0108.exclamation	@ltx/swh_ke_oak/hi.hi04:hiMA.Key0108.exclamation
ltx/swh_redirects_oak/hi.hi04:hiMA.Key0108.text	@ltx/swh_ke_oak/hi.hi04:hiMA.Key0108.text
ltx/swh_redirects_oak/hi.hi04:hiMA.Key0108.title	@ltx/swh_ke_oak/hi.hi04:hiMA.Key0108.title
ltx/swh_redirects_oak/hi.hi04:hiMA.Key0109.exclamation	@ltx/swh_ke_oak/hi.hi04:hiMA.Key0109.exclamation
ltx/swh_redirects_oak/hi.hi04:hiMA.Key0109.text	@ltx/swh_ke_oak/hi.hi04:hiMA.Key0109.text
ltx/swh_redirects_oak/hi.hi04:hiMA.Key0109.title	@ltx/swh_ke_oak/hi.hi04:hiMA.Key0109.title
ltx/swh_redirects_oak/hi.hi04:hiMA.Key0110.exclamation	@ltx/swh_ke_oak/hi.hi04:hiMA.Key0110.exclamation
ltx/swh_redirects_oak/hi.hi04:hiMA.Key0110.text	@ltx/swh_ke_oak/hi.hi04:hiMA.Key0110.text
ltx/swh_redirects_oak/hi.hi04:hiMA.Key0110.title	@ltx/swh_ke_oak/hi.hi04:hiMA.Key0110.title
ltx/swh_redirects_oak/hi.hi04:hiMA.Key0111.exclamation	@ltx/swh_ke_oak/hi.hi04:hiMA.Key0111.exclamation
ltx/swh_redirects_oak/hi.hi04:hiMA.Key0111.text	@ltx/swh_ke_oak/hi.hi04:hiMA.Key0111.text
ltx/swh_redirects_oak/hi.hi04:hiMA.Key0111.title	@ltx/swh_ke_oak/hi.hi04:hiMA.Key0111.title
ltx/swh_redirects_oak/hi.hi04:hiMA.Key0112.exclamation	@ltx/swh_ke_oak/hi.hi04:hiMA.Key0112.exclamation
ltx/swh_redirects_oak/hi.hi04:hiMA.Key0112.text	@ltx/swh_ke_oak/hi.hi04:hiMA.Key0112.text
ltx/swh_redirects_oak/hi.hi04:hiMA.Key0112.title	@ltx/swh_ke_oak/hi.hi04:hiMA.Key0112.title
ltx/swh_redirects_oak/hi.hi04:hiMA.Key0113.exclamation	@ltx/swh_ke_oak/hi.hi04:hiMA.Key0113.exclamation
ltx/swh_redirects_oak/hi.hi04:hiMA.Key0113.text	@ltx/swh_ke_oak/hi.hi04:hiMA.Key0113.text
ltx/swh_redirects_oak/hi.hi04:hiMA.Key0113.title	@ltx/swh_ke_oak/hi.hi04:hiMA.Key0113.title
ltx/swh_redirects_oak/hi.hi04:hiMA.R001	@ltx/swh_ke_oak/hi.hi04:hiMA.R001
ltx/swh_redirects_oak/hi.hi04:hiMA.R002	@ltx/swh_ke_oak/hi.hi04:hiMA.R002
ltx/swh_redirects_oak/hi.hi04:hiMA.R003	@ltx/swh_ke_oak/hi.hi04:hiMA.R003
ltx/swh_redirects_oak/hi.hi04:hiMA.R004	@ltx/swh_ke_oak/hi.hi04:hiMA.R004
ltx/swh_redirects_oak/hi.hi04:hiMA.R005	@ltx/swh_ke_oak/hi.hi04:hiMA.R005
ltx/swh_redirects_oak/hi.hi04:hiMA.R006	@ltx/swh_ke_oak/hi.hi04:hiMA.R006
ltx/swh_redirects_oak/hi.hi04:hiMA.R101	@ltx/swh_ke_oak/hi.hi04:hiMA.R101
ltx/swh_redirects_oak/hi.hi04:hiMA.R102	@ltx/swh_ke_oak/hi.hi04:hiMA.R102
ltx/swh_redirects_oak/hi.hi04:hiMA.R103	@ltx/swh_ke_oak/hi.hi04:hiMA.R103
ltx/swh_redirects_oak/hi.hi04:hiMA.R104	@ltx/swh_ke_oak/hi.hi04:hiMA.R104
ltx/swh_redirects_oak/hi.hi04:hiMA.R201	@ltx/swh_ke_oak/hi.hi04:hiMA.R201
ltx/swh_redirects_oak/hi.hi04:hiMA.R202	@ltx/swh_ke_oak/hi.hi04:hiMA.R202
ltx/swh_redirects_oak/hi.hi04:hiMA.R203	@ltx/swh_ke_oak/hi.hi04:hiMA.R203
ltx/swh_redirects_oak/hi.hi04:hiMA.R301	@ltx/swh_ke_oak/hi.hi04:hiMA.R301
ltx/swh_redirects_oak/hi.hi04:hiMA.R302	@ltx/swh_ke_oak/hi.hi04:hiMA.R302
ltx/swh_redirects_oak/hi.hi04:hiMA.R303	@ltx/swh_ke_oak/hi.hi04:hiMA.R303
ltx/swh_redirects_oak/hi.hi04:hiMA.R304	@ltx/swh_ke_oak/hi.hi04:hiMA.R304
ltx/swh_redirects_oak/hi.hi04:hiMA.R305	@ltx/swh_ke_oak/hi.hi04:hiMA.R305
ltx/swh_redirects_oak/hi.hi04:hiMA.R401	@ltx/swh_ke_oak/hi.hi04:hiMA.R401
ltx/swh_redirects_oak/hi.hi04:hiMA.R402	@ltx/swh_ke_oak/hi.hi04:hiMA.R402
ltx/swh_redirects_oak/hi.hi04:hiMA.R403	@ltx/swh_ke_oak/hi.hi04:hiMA.R403
ltx/swh_redirects_oak/hi.hi04:hiMA.R404	@ltx/swh_ke_oak/hi.hi04:hiMA.R404
ltx/swh_redirects_oak/hi.hi04:hiMA.R405	@ltx/swh_ke_oak/hi.hi04:hiMA.R405
ltx/swh_redirects_oak/hi.hi04:hiMA.R406	@ltx/swh_ke_oak/hi.hi04:hiMA.R406
ltx/swh_redirects_oak/hi.hi04:hiMA.R407	@ltx/swh_ke_oak/hi.hi04:hiMA.R407
ltx/swh_redirects_oak/hi.hi04:hiMA.R408	@ltx/swh_ke_oak/hi.hi04:hiMA.R408
ltx/swh_redirects_oak/hi.hi04:hiMA.R501	@ltx/swh_ke_oak/hi.hi04:hiMA.R501
ltx/swh_redirects_oak/hi.hi04:hiMA.R502	@ltx/swh_ke_oak/hi.hi04:hiMA.R502
ltx/swh_redirects_oak/hi.hi04:hiMA.R503	@ltx/swh_ke_oak/hi.hi04:hiMA.R503
ltx/swh_redirects_oak/hi.hi04:hiMA.R504	@ltx/swh_ke_oak/hi.hi04:hiMA.R504
ltx/swh_redirects_oak/hi.hi04:hiMA.R601	@ltx/swh_ke_oak/hi.hi04:hiMA.R601
ltx/swh_redirects_oak/hi.hi04:hiMA.R602	@ltx/swh_ke_oak/hi.hi04:hiMA.R602
ltx/swh_redirects_oak/hi.hi04:hiMA.R603	@ltx/swh_ke_oak/hi.hi04:hiMA.R603
ltx/swh_redirects_oak/hi.hi04:hiMA.R604	@ltx/swh_ke_oak/hi.hi04:hiMA.R604
ltx/swh_redirects_oak/hi.hi04:hiMA.R605	@ltx/swh_ke_oak/hi.hi04:hiMA.R605
ltx/swh_redirects_oak/hi.hi04:hiMA.R606	@ltx/swh_ke_oak/hi.hi04:hiMA.R606
ltx/swh_redirects_oak/hi.hi04:hiMA.R607	@ltx/swh_ke_oak/hi.hi04:hiMA.R607
ltx/swh_redirects_oak/hi.hi04:hiMA.R608	@ltx/swh_ke_oak/hi.hi04:hiMA.R608
ltx/swh_redirects_oak/hi.hi04:hiMA.R701	@ltx/swh_ke_oak/hi.hi04:hiMA.R701
ltx/swh_redirects_oak/hi.hi04:hiMA.R702	@ltx/swh_ke_oak/hi.hi04:hiMA.R702
ltx/swh_redirects_oak/hi.hi04:hiMA.R703	@ltx/swh_ke_oak/hi.hi04:hiMA.R703
ltx/swh_redirects_oak/hi.hi04:hiMA.R704	@ltx/swh_ke_oak/hi.hi04:hiMA.R704
ltx/swh_redirects_oak/hi.hi04:hiMA.title	@ltx/swh_ke_oak/hi.hi04:hiMA.title
