ltx/swh_redirects_oak/me.m03.d25:meDA.commemoration.first	@ltx/swh_ke_oak/me.m03.d25:meDA.commemoration.first
ltx/swh_redirects_oak/me.m03.d25:meDA.commemoration.first_name	@ltx/swh_ke_oak/me.m03.d25:meDA.commemoration.first_name
ltx/swh_redirects_oak/me.m03.d25:meDA.commemoration.first_short	@ltx/swh_ke_oak/me.m03.d25:meDA.commemoration.first_short
ltx/swh_redirects_oak/me.m03.d25:meDA.commemoration.first_title	@ltx/swh_ke_oak/me.m03.d25:meDA.commemoration.first_title
ltx/swh_redirects_oak/me.m03.d25:meDA.commemoration.full	@ltx/swh_ke_oak/me.m03.d25:meDA.commemoration.full
ltx/swh_redirects_oak/me.m03.d25:meDA.commemoration.second_name	@ltx/swh_ke_oak/me.m03.d25:meDA.commemoration.second_name
ltx/swh_redirects_oak/me.m03.d25:meDA.commemoration.second_title	@ltx/swh_ke_oak/me.m03.d25:meDA.commemoration.second_title
ltx/swh_redirects_oak/me.m03.d25:meDA.date	@ltx/swh_ke_oak/me.m03.d25:meDA.date
ltx/swh_redirects_oak/me.m03.d25:meDA.dismissal	@ltx/swh_ke_oak/me.m03.d25:meDA.dismissal
ltx/swh_redirects_oak/me.m03.d25:meDA.insert1	@ltx/swh_ke_oak/me.m03.d25:meDA.insert1
ltx/swh_redirects_oak/me.m03.d25:meDA.insert2	@ltx/swh_ke_oak/me.m03.d25:meDA.insert2
ltx/swh_redirects_oak/me.m03.d25:meDA.note	@ltx/swh_ke_oak/me.m03.d25:meDA.note
ltx/swh_redirects_oak/me.m03.d25:meHO.commemorations	@ltx/swh_ke_oak/me.m03.d25:meHO.commemorations
ltx/swh_redirects_oak/me.m03.d25:meHO.note1	@ltx/swh_ke_oak/me.m03.d25:meHO.note1
ltx/swh_redirects_oak/me.m03.d25:meHO.note2	@ltx/swh_ke_oak/me.m03.d25:meHO.note2
ltx/swh_redirects_oak/me.m03.d25:meHO.number	@ltx/swh_ke_oak/me.m03.d25:meHO.number
ltx/swh_redirects_oak/me.m03.d25:meHO.rank	@ltx/swh_ke_oak/me.m03.d25:meHO.rank
ltx/swh_redirects_oak/me.m03.d25:meLE.commemoration1	@ltx/swh_ke_oak/me.m03.d25:meLE.commemoration1
ltx/swh_redirects_oak/me.m03.d25:meLE.commemoration2	@ltx/swh_ke_oak/me.m03.d25:meLE.commemoration2
ltx/swh_redirects_oak/me.m03.d25:meLI.Kontakion1.greekmelody	@ltx/swh_ke_oak/me.m03.d25:meLI.Kontakion1.greekmelody
ltx/swh_redirects_oak/me.m03.d25:meLI.Kontakion1.incipit	@ltx/swh_ke_oak/me.m03.d25:meLI.Kontakion1.incipit
ltx/swh_redirects_oak/me.m03.d25:meLI.Kontakion1.melody	@ltx/swh_ke_oak/me.m03.d25:meLI.Kontakion1.melody
ltx/swh_redirects_oak/me.m03.d25:meLI.Kontakion1.mode	@ltx/swh_ke_oak/me.m03.d25:meLI.Kontakion1.mode
ltx/swh_redirects_oak/me.m03.d25:meLI.Kontakion1.text	@ltx/swh_ke_oak/me.m03.d25:meLI.Kontakion1.text
ltx/swh_redirects_oak/me.m03.d25:meLI.MM.Antiphon2.text	@ltx/swh_ke_oak/properties:media.key
ltx/swh_redirects_oak/me.m03.d25:meLI.MM.CommunionHymn.text	@ltx/swh_ke_oak/properties:media.key
ltx/swh_redirects_oak/me.m03.d25:meLI.MM.EntranceHymn.text	@ltx/swh_ke_oak/properties:media.key
ltx/swh_redirects_oak/me.m03.d25:meLI.Megalynarion.text	@ltx/swh_ke_oak/me.m03.d25:meLI.Megalynarion.text
ltx/swh_redirects_oak/me.m03.d25:meLI.TheotokosHymn.incipit	@ltx/swh_ke_oak/me.m03.d25:meLI.TheotokosHymn.incipit
ltx/swh_redirects_oak/me.m03.d25:meLI.TheotokosHymn.mode	@ltx/swh_ke_oak/me.m03.d25:meLI.TheotokosHymn.mode
ltx/swh_redirects_oak/me.m03.d25:meLI.TheotokosHymn.text	@ltx/swh_ke_oak/me.m03.d25:meLI.TheotokosHymn.text
ltx/swh_redirects_oak/me.m03.d25:meLI.TheotokosHymnVerse.incipit	@ltx/swh_ke_oak/me.m03.d25:meLI.TheotokosHymnVerse.incipit
ltx/swh_redirects_oak/me.m03.d25:meLI.TheotokosHymnVerse.text	@ltx/swh_ke_oak/me.m03.d25:meLI.TheotokosHymnVerse.text
ltx/swh_redirects_oak/me.m03.d25:meMA.AdditionalIdiomelon1.incipit	@ltx/swh_ke_oak/me.m03.d25:meMA.AdditionalIdiomelon1.incipit
ltx/swh_redirects_oak/me.m03.d25:meMA.AdditionalIdiomelon1.melody	@ltx/swh_ke_oak/me.m03.d25:meMA.AdditionalIdiomelon1.melody
ltx/swh_redirects_oak/me.m03.d25:meMA.AdditionalIdiomelon1.mode	@ltx/swh_ke_oak/me.m03.d25:meMA.AdditionalIdiomelon1.mode
ltx/swh_redirects_oak/me.m03.d25:meMA.AdditionalIdiomelon1.poet	@ltx/swh_ke_oak/me.m03.d25:meMA.AdditionalIdiomelon1.poet
ltx/swh_redirects_oak/me.m03.d25:meMA.AdditionalIdiomelon1.text	@ltx/swh_ke_oak/me.m03.d25:meMA.AdditionalIdiomelon1.text
ltx/swh_redirects_oak/me.m03.d25:meMA.C1.acrostic.notice1	@ltx/swh_ke_oak/me.m03.d25:meMA.C1.acrostic.notice1
ltx/swh_redirects_oak/me.m03.d25:meMA.C1.acrostic.title	@ltx/swh_ke_oak/me.m03.d25:meMA.C1.acrostic.title
ltx/swh_redirects_oak/me.m03.d25:meMA.C1.poet	@ltx/swh_ke_oak/me.m03.d25:meMA.C1.poet
ltx/swh_redirects_oak/me.m03.d25:meMA.C1.title	@ltx/swh_ke_oak/me.m03.d25:meMA.C1.title
ltx/swh_redirects_oak/me.m03.d25:meMA.C1.verse	@ltx/swh_ke_oak/me.m03.d25:meMA.C1.verse
ltx/swh_redirects_oak/me.m03.d25:meMA.C2.title	@ltx/swh_ke_oak/me.m03.d25:meMA.C2.title
ltx/swh_redirects_oak/me.m03.d25:meMA.C2.verse	@ltx/swh_ke_oak/me.m03.d25:meMA.C2.verse
ltx/swh_redirects_oak/me.m03.d25:meMA.Exaposteilarion1.greekmelody	@ltx/swh_ke_oak/me.m03.d25:meMA.Exaposteilarion1.greekmelody
ltx/swh_redirects_oak/me.m03.d25:meMA.Exaposteilarion1.incipit	@ltx/swh_ke_oak/me.m03.d25:meMA.Exaposteilarion1.incipit
ltx/swh_redirects_oak/me.m03.d25:meMA.Exaposteilarion1.melody	@ltx/swh_ke_oak/me.m03.d25:meMA.Exaposteilarion1.melody
ltx/swh_redirects_oak/me.m03.d25:meMA.Exaposteilarion1.mode	@ltx/swh_ke_oak/me.m03.d25:meMA.Exaposteilarion1.mode
ltx/swh_redirects_oak/me.m03.d25:meMA.Exaposteilarion1.text	@ltx/swh_ke_oak/me.m03.d25:meMA.Exaposteilarion1.text
ltx/swh_redirects_oak/me.m03.d25:meMA.Exaposteilarion2.greekmelody	@ltx/swh_ke_oak/me.m03.d25:meMA.Exaposteilarion2.greekmelody
ltx/swh_redirects_oak/me.m03.d25:meMA.Exaposteilarion2.incipit	@ltx/swh_ke_oak/me.m03.d25:meMA.Exaposteilarion2.incipit
ltx/swh_redirects_oak/me.m03.d25:meMA.Exaposteilarion2.melody	@ltx/swh_ke_oak/me.m03.d25:meMA.Exaposteilarion2.melody
ltx/swh_redirects_oak/me.m03.d25:meMA.Exaposteilarion2.mode	@ltx/swh_ke_oak/me.m03.d25:meMA.Exaposteilarion2.mode
ltx/swh_redirects_oak/me.m03.d25:meMA.Exaposteilarion2.text	@ltx/swh_ke_oak/me.m03.d25:meMA.Exaposteilarion2.text
ltx/swh_redirects_oak/me.m03.d25:meMA.Kathisma11.greekmelody	@ltx/swh_ke_oak/me.m03.d25:meMA.Kathisma11.greekmelody
ltx/swh_redirects_oak/me.m03.d25:meMA.Kathisma11.incipit	@ltx/swh_ke_oak/me.m03.d25:meMA.Kathisma11.incipit
ltx/swh_redirects_oak/me.m03.d25:meMA.Kathisma11.melody	@ltx/swh_ke_oak/me.m03.d25:meMA.Kathisma11.melody
ltx/swh_redirects_oak/me.m03.d25:meMA.Kathisma11.mode	@ltx/swh_ke_oak/me.m03.d25:meMA.Kathisma11.mode
ltx/swh_redirects_oak/me.m03.d25:meMA.Kathisma11.text	@ltx/swh_ke_oak/me.m03.d25:meMA.Kathisma11.text
ltx/swh_redirects_oak/me.m03.d25:meMA.Kathisma21.greekmelody	@ltx/swh_ke_oak/me.m03.d25:meMA.Kathisma21.greekmelody
ltx/swh_redirects_oak/me.m03.d25:meMA.Kathisma21.incipit	@ltx/swh_ke_oak/me.m03.d25:meMA.Kathisma21.incipit
ltx/swh_redirects_oak/me.m03.d25:meMA.Kathisma21.melody	@ltx/swh_ke_oak/me.m03.d25:meMA.Kathisma21.melody
ltx/swh_redirects_oak/me.m03.d25:meMA.Kathisma21.mode	@ltx/swh_ke_oak/me.m03.d25:meMA.Kathisma21.mode
ltx/swh_redirects_oak/me.m03.d25:meMA.Kathisma21.text	@ltx/swh_ke_oak/me.m03.d25:meMA.Kathisma21.text
ltx/swh_redirects_oak/me.m03.d25:meMA.Kathisma31.greekmelody	@ltx/swh_ke_oak/me.m03.d25:meMA.Kathisma31.greekmelody
ltx/swh_redirects_oak/me.m03.d25:meMA.Kathisma31.incipit	@ltx/swh_ke_oak/me.m03.d25:meMA.Kathisma31.incipit
ltx/swh_redirects_oak/me.m03.d25:meMA.Kathisma31.melody	@ltx/swh_ke_oak/me.m03.d25:meMA.Kathisma31.melody
ltx/swh_redirects_oak/me.m03.d25:meMA.Kathisma31.mode	@ltx/swh_ke_oak/me.m03.d25:meMA.Kathisma31.mode
ltx/swh_redirects_oak/me.m03.d25:meMA.Kathisma31.text	@ltx/swh_ke_oak/me.m03.d25:meMA.Kathisma31.text
ltx/swh_redirects_oak/me.m03.d25:meMA.Kathisma32.greekmelody	@ltx/swh_ke_oak/me.m03.d25:meMA.Kathisma32.greekmelody
ltx/swh_redirects_oak/me.m03.d25:meMA.Kathisma32.incipit	@ltx/swh_ke_oak/me.m03.d25:meMA.Kathisma32.incipit
ltx/swh_redirects_oak/me.m03.d25:meMA.Kathisma32.melody	@ltx/swh_ke_oak/me.m03.d25:meMA.Kathisma32.melody
ltx/swh_redirects_oak/me.m03.d25:meMA.Kathisma32.mode	@ltx/swh_ke_oak/me.m03.d25:meMA.Kathisma32.mode
ltx/swh_redirects_oak/me.m03.d25:meMA.Kathisma32.text	@ltx/swh_ke_oak/me.m03.d25:meMA.Kathisma32.text
ltx/swh_redirects_oak/me.m03.d25:meMA.Kontakion1.greekmelody	@ltx/swh_ke_oak/me.m03.d25:meMA.Kontakion1.greekmelody
ltx/swh_redirects_oak/me.m03.d25:meMA.Kontakion1.incipit	@ltx/swh_ke_oak/me.m03.d25:meMA.Kontakion1.incipit
ltx/swh_redirects_oak/me.m03.d25:meMA.Kontakion1.melody	@ltx/swh_ke_oak/me.m03.d25:meMA.Kontakion1.melody
ltx/swh_redirects_oak/me.m03.d25:meMA.Kontakion1.mode	@ltx/swh_ke_oak/me.m03.d25:meMA.Kontakion1.mode
ltx/swh_redirects_oak/me.m03.d25:meMA.Kontakion1.rubric	@ltx/swh_ke_oak/me.m03.d25:meMA.Kontakion1.rubric
ltx/swh_redirects_oak/me.m03.d25:meMA.Kontakion1.text	@ltx/swh_ke_oak/me.m03.d25:meMA.Kontakion1.text
ltx/swh_redirects_oak/me.m03.d25:meMA.Kontakion2.incipit	@ltx/swh_ke_oak/me.m03.d25:meMA.Kontakion2.incipit
ltx/swh_redirects_oak/me.m03.d25:meMA.Kontakion2.melody	@ltx/swh_ke_oak/me.m03.d25:meMA.Kontakion2.melody
ltx/swh_redirects_oak/me.m03.d25:meMA.Kontakion2.mode	@ltx/swh_ke_oak/me.m03.d25:meMA.Kontakion2.mode
ltx/swh_redirects_oak/me.m03.d25:meMA.Kontakion2.text	@ltx/swh_ke_oak/me.m03.d25:meMA.Kontakion2.text
ltx/swh_redirects_oak/me.m03.d25:meMA.Lauds1.greekmelody	@ltx/swh_ke_oak/me.m03.d25:meMA.Lauds1.greekmelody
ltx/swh_redirects_oak/me.m03.d25:meMA.Lauds1.incipit	@ltx/swh_ke_oak/me.m03.d25:meMA.Lauds1.incipit
ltx/swh_redirects_oak/me.m03.d25:meMA.Lauds1.melody	@ltx/swh_ke_oak/me.m03.d25:meMA.Lauds1.melody
ltx/swh_redirects_oak/me.m03.d25:meMA.Lauds1.mode	@ltx/swh_ke_oak/me.m03.d25:meMA.Lauds1.mode
ltx/swh_redirects_oak/me.m03.d25:meMA.Lauds1.text	@ltx/swh_ke_oak/me.m03.d25:meMA.Lauds1.text
ltx/swh_redirects_oak/me.m03.d25:meMA.Lauds2.incipit	@ltx/swh_ke_oak/me.m03.d25:meMA.Lauds2.incipit
ltx/swh_redirects_oak/me.m03.d25:meMA.Lauds2.melody	@ltx/swh_ke_oak/me.m03.d25:meMA.Lauds2.melody
ltx/swh_redirects_oak/me.m03.d25:meMA.Lauds2.mode	@ltx/swh_ke_oak/me.m03.d25:meMA.Lauds2.mode
ltx/swh_redirects_oak/me.m03.d25:meMA.Lauds2.text	@ltx/swh_ke_oak/me.m03.d25:meMA.Lauds2.text
ltx/swh_redirects_oak/me.m03.d25:meMA.Lauds3.incipit	@ltx/swh_ke_oak/me.m03.d25:meMA.Lauds3.incipit
ltx/swh_redirects_oak/me.m03.d25:meMA.Lauds3.melody	@ltx/swh_ke_oak/me.m03.d25:meMA.Lauds3.melody
ltx/swh_redirects_oak/me.m03.d25:meMA.Lauds3.mode	@ltx/swh_ke_oak/me.m03.d25:meMA.Lauds3.mode
ltx/swh_redirects_oak/me.m03.d25:meMA.Lauds3.text	@ltx/swh_ke_oak/me.m03.d25:meMA.Lauds3.text
ltx/swh_redirects_oak/me.m03.d25:meMA.Lauds4.greekmelody	@ltx/swh_ke_oak/me.m03.d25:meMA.Lauds4.greekmelody
ltx/swh_redirects_oak/me.m03.d25:meMA.Lauds4.incipit	@ltx/swh_ke_oak/me.m03.d25:meMA.Lauds4.incipit
ltx/swh_redirects_oak/me.m03.d25:meMA.Lauds4.melody	@ltx/swh_ke_oak/me.m03.d25:meMA.Lauds4.melody
ltx/swh_redirects_oak/me.m03.d25:meMA.Lauds4.mode	@ltx/swh_ke_oak/me.m03.d25:meMA.Lauds4.mode
ltx/swh_redirects_oak/me.m03.d25:meMA.Lauds4.note	@ltx/swh_ke_oak/me.m03.d25:meMA.Lauds4.note
ltx/swh_redirects_oak/me.m03.d25:meMA.Lauds4.text	@ltx/swh_ke_oak/me.m03.d25:meMA.Lauds4.text
ltx/swh_redirects_oak/me.m03.d25:meMA.LaudsGlory.incipit	@ltx/swh_ke_oak/me.m03.d25:meMA.LaudsGlory.incipit
ltx/swh_redirects_oak/me.m03.d25:meMA.LaudsGlory.melody	@ltx/swh_ke_oak/me.m03.d25:meMA.LaudsGlory.melody
ltx/swh_redirects_oak/me.m03.d25:meMA.LaudsGlory.mode	@ltx/swh_ke_oak/me.m03.d25:meMA.LaudsGlory.mode
ltx/swh_redirects_oak/me.m03.d25:meMA.LaudsGlory.poet	@ltx/swh_ke_oak/me.m03.d25:meMA.LaudsGlory.poet
ltx/swh_redirects_oak/me.m03.d25:meMA.LaudsGlory.text	@ltx/swh_ke_oak/me.m03.d25:meMA.LaudsGlory.text
ltx/swh_redirects_oak/me.m03.d25:meMA.MM.Lauds1123as5678.text	@ltx/swh_ke_oak/properties:media.key
ltx/swh_redirects_oak/me.m03.d25:meMA.Ode1C11.greekmelody	@ltx/swh_ke_oak/me.m03.d25:meMA.Ode1C11.greekmelody
ltx/swh_redirects_oak/me.m03.d25:meMA.Ode1C11.incipit	@ltx/swh_ke_oak/me.m03.d25:meMA.Ode1C11.incipit
ltx/swh_redirects_oak/me.m03.d25:meMA.Ode1C11.melody	@ltx/swh_ke_oak/me.m03.d25:meMA.Ode1C11.melody
ltx/swh_redirects_oak/me.m03.d25:meMA.Ode1C11.mode	@ltx/swh_ke_oak/me.m03.d25:meMA.Ode1C11.mode
ltx/swh_redirects_oak/me.m03.d25:meMA.Ode1C11.ode	@ltx/swh_ke_oak/me.m03.d25:meMA.Ode1C11.ode
ltx/swh_redirects_oak/me.m03.d25:meMA.Ode1C11.text	@ltx/swh_ke_oak/me.m03.d25:meMA.Ode1C11.text
ltx/swh_redirects_oak/me.m03.d25:meMA.Ode1C12.incipit	@ltx/swh_ke_oak/me.m03.d25:meMA.Ode1C12.incipit
ltx/swh_redirects_oak/me.m03.d25:meMA.Ode1C12.melody	@ltx/swh_ke_oak/me.m03.d25:meMA.Ode1C12.melody
ltx/swh_redirects_oak/me.m03.d25:meMA.Ode1C12.mode	@ltx/swh_ke_oak/me.m03.d25:meMA.Ode1C12.mode
ltx/swh_redirects_oak/me.m03.d25:meMA.Ode1C12.ode	@ltx/swh_ke_oak/me.m03.d25:meMA.Ode1C12.ode
ltx/swh_redirects_oak/me.m03.d25:meMA.Ode1C12.text	@ltx/swh_ke_oak/me.m03.d25:meMA.Ode1C12.text
ltx/swh_redirects_oak/me.m03.d25:meMA.Ode1C13.incipit	@ltx/swh_ke_oak/me.m03.d25:meMA.Ode1C13.incipit
ltx/swh_redirects_oak/me.m03.d25:meMA.Ode1C13.melody	@ltx/swh_ke_oak/me.m03.d25:meMA.Ode1C13.melody
ltx/swh_redirects_oak/me.m03.d25:meMA.Ode1C13.mode	@ltx/swh_ke_oak/me.m03.d25:meMA.Ode1C13.mode
ltx/swh_redirects_oak/me.m03.d25:meMA.Ode1C13.ode	@ltx/swh_ke_oak/me.m03.d25:meMA.Ode1C13.ode
ltx/swh_redirects_oak/me.m03.d25:meMA.Ode1C13.text	@ltx/swh_ke_oak/me.m03.d25:meMA.Ode1C13.text
ltx/swh_redirects_oak/me.m03.d25:meMA.Ode1C14.incipit	@ltx/swh_ke_oak/me.m03.d25:meMA.Ode1C14.incipit
ltx/swh_redirects_oak/me.m03.d25:meMA.Ode1C14.melody	@ltx/swh_ke_oak/me.m03.d25:meMA.Ode1C14.melody
ltx/swh_redirects_oak/me.m03.d25:meMA.Ode1C14.mode	@ltx/swh_ke_oak/me.m03.d25:meMA.Ode1C14.mode
ltx/swh_redirects_oak/me.m03.d25:meMA.Ode1C14.ode	@ltx/swh_ke_oak/me.m03.d25:meMA.Ode1C14.ode
ltx/swh_redirects_oak/me.m03.d25:meMA.Ode1C14.text	@ltx/swh_ke_oak/me.m03.d25:meMA.Ode1C14.text
ltx/swh_redirects_oak/me.m03.d25:meMA.Ode1C1H.greekmelody	@ltx/swh_ke_oak/me.m03.d25:meMA.Ode1C1H.greekmelody
ltx/swh_redirects_oak/me.m03.d25:meMA.Ode1C1H.incipit	@ltx/swh_ke_oak/me.m03.d25:meMA.Ode1C1H.incipit
ltx/swh_redirects_oak/me.m03.d25:meMA.Ode1C1H.melody	@ltx/swh_ke_oak/me.m03.d25:meMA.Ode1C1H.melody
ltx/swh_redirects_oak/me.m03.d25:meMA.Ode1C1H.mode	@ltx/swh_ke_oak/me.m03.d25:meMA.Ode1C1H.mode
ltx/swh_redirects_oak/me.m03.d25:meMA.Ode1C1H.ode	@ltx/swh_ke_oak/me.m03.d25:meMA.Ode1C1H.ode
ltx/swh_redirects_oak/me.m03.d25:meMA.Ode1C1H.text	@ltx/swh_ke_oak/me.m03.d25:meMA.Ode1C1H.text
ltx/swh_redirects_oak/me.m03.d25:meMA.Ode1C21.greekmelody	@ltx/swh_ke_oak/me.m03.d25:meMA.Ode1C21.greekmelody
ltx/swh_redirects_oak/me.m03.d25:meMA.Ode1C21.incipit	@ltx/swh_ke_oak/me.m03.d25:meMA.Ode1C21.incipit
ltx/swh_redirects_oak/me.m03.d25:meMA.Ode1C21.melody	@ltx/swh_ke_oak/me.m03.d25:meMA.Ode1C21.melody
ltx/swh_redirects_oak/me.m03.d25:meMA.Ode1C21.mode	@ltx/swh_ke_oak/me.m03.d25:meMA.Ode1C21.mode
ltx/swh_redirects_oak/me.m03.d25:meMA.Ode1C21.ode	@ltx/swh_ke_oak/me.m03.d25:meMA.Ode1C21.ode
ltx/swh_redirects_oak/me.m03.d25:meMA.Ode1C21.text	@ltx/swh_ke_oak/me.m03.d25:meMA.Ode1C21.text
ltx/swh_redirects_oak/me.m03.d25:meMA.Ode1C211.text	@ltx/swh_ke_oak/me.m03.d25:meMA.Ode1C211.text
ltx/swh_redirects_oak/me.m03.d25:meMA.Ode1C212.text	@ltx/swh_ke_oak/me.m03.d25:meMA.Ode1C212.text
ltx/swh_redirects_oak/me.m03.d25:meMA.Ode1C213.text	@ltx/swh_ke_oak/me.m03.d25:meMA.Ode1C213.text
ltx/swh_redirects_oak/me.m03.d25:meMA.Ode1C214.text	@ltx/swh_ke_oak/me.m03.d25:meMA.Ode1C214.text
ltx/swh_redirects_oak/me.m03.d25:meMA.Ode1C215.text	@ltx/swh_ke_oak/me.m03.d25:meMA.Ode1C215.text
ltx/swh_redirects_oak/me.m03.d25:meMA.Ode1C22.incipit	@ltx/swh_ke_oak/me.m03.d25:meMA.Ode1C22.incipit
ltx/swh_redirects_oak/me.m03.d25:meMA.Ode1C22.melody	@ltx/swh_ke_oak/me.m03.d25:meMA.Ode1C22.melody
ltx/swh_redirects_oak/me.m03.d25:meMA.Ode1C22.mode	@ltx/swh_ke_oak/me.m03.d25:meMA.Ode1C22.mode
ltx/swh_redirects_oak/me.m03.d25:meMA.Ode1C22.ode	@ltx/swh_ke_oak/me.m03.d25:meMA.Ode1C22.ode
ltx/swh_redirects_oak/me.m03.d25:meMA.Ode1C22.text	@ltx/swh_ke_oak/me.m03.d25:meMA.Ode1C22.text
ltx/swh_redirects_oak/me.m03.d25:meMA.Ode1C221.text	@ltx/swh_ke_oak/me.m03.d25:meMA.Ode1C221.text
ltx/swh_redirects_oak/me.m03.d25:meMA.Ode1C222.text	@ltx/swh_ke_oak/me.m03.d25:meMA.Ode1C222.text
ltx/swh_redirects_oak/me.m03.d25:meMA.Ode1C223.text	@ltx/swh_ke_oak/me.m03.d25:meMA.Ode1C223.text
ltx/swh_redirects_oak/me.m03.d25:meMA.Ode1C224.text	@ltx/swh_ke_oak/me.m03.d25:meMA.Ode1C224.text
ltx/swh_redirects_oak/me.m03.d25:meMA.Ode1C225.text	@ltx/swh_ke_oak/me.m03.d25:meMA.Ode1C225.text
ltx/swh_redirects_oak/me.m03.d25:meMA.Ode1C23.incipit	@ltx/swh_ke_oak/me.m03.d25:meMA.Ode1C23.incipit
ltx/swh_redirects_oak/me.m03.d25:meMA.Ode1C23.melody	@ltx/swh_ke_oak/me.m03.d25:meMA.Ode1C23.melody
ltx/swh_redirects_oak/me.m03.d25:meMA.Ode1C23.mode	@ltx/swh_ke_oak/me.m03.d25:meMA.Ode1C23.mode
ltx/swh_redirects_oak/me.m03.d25:meMA.Ode1C23.ode	@ltx/swh_ke_oak/me.m03.d25:meMA.Ode1C23.ode
ltx/swh_redirects_oak/me.m03.d25:meMA.Ode1C23.text	@ltx/swh_ke_oak/me.m03.d25:meMA.Ode1C23.text
ltx/swh_redirects_oak/me.m03.d25:meMA.Ode1C231.text	@ltx/swh_ke_oak/me.m03.d25:meMA.Ode1C231.text
ltx/swh_redirects_oak/me.m03.d25:meMA.Ode1C232.text	@ltx/swh_ke_oak/me.m03.d25:meMA.Ode1C232.text
ltx/swh_redirects_oak/me.m03.d25:meMA.Ode1C233.text	@ltx/swh_ke_oak/me.m03.d25:meMA.Ode1C233.text
ltx/swh_redirects_oak/me.m03.d25:meMA.Ode1C234.text	@ltx/swh_ke_oak/me.m03.d25:meMA.Ode1C234.text
ltx/swh_redirects_oak/me.m03.d25:meMA.Ode1C235.text	@ltx/swh_ke_oak/me.m03.d25:meMA.Ode1C235.text
ltx/swh_redirects_oak/me.m03.d25:meMA.Ode1C24.incipit	@ltx/swh_ke_oak/me.m03.d25:meMA.Ode1C24.incipit
ltx/swh_redirects_oak/me.m03.d25:meMA.Ode1C24.melody	@ltx/swh_ke_oak/me.m03.d25:meMA.Ode1C24.melody
ltx/swh_redirects_oak/me.m03.d25:meMA.Ode1C24.mode	@ltx/swh_ke_oak/me.m03.d25:meMA.Ode1C24.mode
ltx/swh_redirects_oak/me.m03.d25:meMA.Ode1C24.ode	@ltx/swh_ke_oak/me.m03.d25:meMA.Ode1C24.ode
ltx/swh_redirects_oak/me.m03.d25:meMA.Ode1C24.text	@ltx/swh_ke_oak/me.m03.d25:meMA.Ode1C24.text
ltx/swh_redirects_oak/me.m03.d25:meMA.Ode1C241.text	@ltx/swh_ke_oak/me.m03.d25:meMA.Ode1C241.text
ltx/swh_redirects_oak/me.m03.d25:meMA.Ode1C242.text	@ltx/swh_ke_oak/me.m03.d25:meMA.Ode1C242.text
ltx/swh_redirects_oak/me.m03.d25:meMA.Ode1C243.text	@ltx/swh_ke_oak/me.m03.d25:meMA.Ode1C243.text
ltx/swh_redirects_oak/me.m03.d25:meMA.Ode1C244.text	@ltx/swh_ke_oak/me.m03.d25:meMA.Ode1C244.text
ltx/swh_redirects_oak/me.m03.d25:meMA.Ode1C245.text	@ltx/swh_ke_oak/me.m03.d25:meMA.Ode1C245.text
ltx/swh_redirects_oak/me.m03.d25:meMA.Ode1C25.incipit	@ltx/swh_ke_oak/me.m03.d25:meMA.Ode1C25.incipit
ltx/swh_redirects_oak/me.m03.d25:meMA.Ode1C25.melody	@ltx/swh_ke_oak/me.m03.d25:meMA.Ode1C25.melody
ltx/swh_redirects_oak/me.m03.d25:meMA.Ode1C25.mode	@ltx/swh_ke_oak/me.m03.d25:meMA.Ode1C25.mode
ltx/swh_redirects_oak/me.m03.d25:meMA.Ode1C25.ode	@ltx/swh_ke_oak/me.m03.d25:meMA.Ode1C25.ode
ltx/swh_redirects_oak/me.m03.d25:meMA.Ode1C25.text	@ltx/swh_ke_oak/me.m03.d25:meMA.Ode1C25.text
ltx/swh_redirects_oak/me.m03.d25:meMA.Ode1C251.text	@ltx/swh_ke_oak/me.m03.d25:meMA.Ode1C251.text
ltx/swh_redirects_oak/me.m03.d25:meMA.Ode1C252.text	@ltx/swh_ke_oak/me.m03.d25:meMA.Ode1C252.text
ltx/swh_redirects_oak/me.m03.d25:meMA.Ode1C253.text	@ltx/swh_ke_oak/me.m03.d25:meMA.Ode1C253.text
ltx/swh_redirects_oak/me.m03.d25:meMA.Ode1C254.text	@ltx/swh_ke_oak/me.m03.d25:meMA.Ode1C254.text
ltx/swh_redirects_oak/me.m03.d25:meMA.Ode1C255.text	@ltx/swh_ke_oak/me.m03.d25:meMA.Ode1C255.text
ltx/swh_redirects_oak/me.m03.d25:meMA.Ode1C26.incipit	@ltx/swh_ke_oak/me.m03.d25:meMA.Ode1C26.incipit
ltx/swh_redirects_oak/me.m03.d25:meMA.Ode1C26.melody	@ltx/swh_ke_oak/me.m03.d25:meMA.Ode1C26.melody
ltx/swh_redirects_oak/me.m03.d25:meMA.Ode1C26.mode	@ltx/swh_ke_oak/me.m03.d25:meMA.Ode1C26.mode
ltx/swh_redirects_oak/me.m03.d25:meMA.Ode1C26.ode	@ltx/swh_ke_oak/me.m03.d25:meMA.Ode1C26.ode
ltx/swh_redirects_oak/me.m03.d25:meMA.Ode1C26.text	@ltx/swh_ke_oak/me.m03.d25:meMA.Ode1C26.text
ltx/swh_redirects_oak/me.m03.d25:meMA.Ode1C261.text	@ltx/swh_ke_oak/me.m03.d25:meMA.Ode1C261.text
ltx/swh_redirects_oak/me.m03.d25:meMA.Ode1C262.text	@ltx/swh_ke_oak/me.m03.d25:meMA.Ode1C262.text
ltx/swh_redirects_oak/me.m03.d25:meMA.Ode1C263.text	@ltx/swh_ke_oak/me.m03.d25:meMA.Ode1C263.text
ltx/swh_redirects_oak/me.m03.d25:meMA.Ode1C264.text	@ltx/swh_ke_oak/me.m03.d25:meMA.Ode1C264.text
ltx/swh_redirects_oak/me.m03.d25:meMA.Ode1C265.text	@ltx/swh_ke_oak/me.m03.d25:meMA.Ode1C265.text
ltx/swh_redirects_oak/me.m03.d25:meMA.Ode3C11.greekmelody	@ltx/swh_ke_oak/me.m03.d25:meMA.Ode3C11.greekmelody
ltx/swh_redirects_oak/me.m03.d25:meMA.Ode3C11.incipit	@ltx/swh_ke_oak/me.m03.d25:meMA.Ode3C11.incipit
ltx/swh_redirects_oak/me.m03.d25:meMA.Ode3C11.melody	@ltx/swh_ke_oak/me.m03.d25:meMA.Ode3C11.melody
ltx/swh_redirects_oak/me.m03.d25:meMA.Ode3C11.mode	@ltx/swh_ke_oak/me.m03.d25:meMA.Ode3C11.mode
ltx/swh_redirects_oak/me.m03.d25:meMA.Ode3C11.ode	@ltx/swh_ke_oak/me.m03.d25:meMA.Ode3C11.ode
ltx/swh_redirects_oak/me.m03.d25:meMA.Ode3C11.text	@ltx/swh_ke_oak/me.m03.d25:meMA.Ode3C11.text
ltx/swh_redirects_oak/me.m03.d25:meMA.Ode3C12.incipit	@ltx/swh_ke_oak/me.m03.d25:meMA.Ode3C12.incipit
ltx/swh_redirects_oak/me.m03.d25:meMA.Ode3C12.melody	@ltx/swh_ke_oak/me.m03.d25:meMA.Ode3C12.melody
ltx/swh_redirects_oak/me.m03.d25:meMA.Ode3C12.mode	@ltx/swh_ke_oak/me.m03.d25:meMA.Ode3C12.mode
ltx/swh_redirects_oak/me.m03.d25:meMA.Ode3C12.ode	@ltx/swh_ke_oak/me.m03.d25:meMA.Ode3C12.ode
ltx/swh_redirects_oak/me.m03.d25:meMA.Ode3C12.text	@ltx/swh_ke_oak/me.m03.d25:meMA.Ode3C12.text
ltx/swh_redirects_oak/me.m03.d25:meMA.Ode3C13.incipit	@ltx/swh_ke_oak/me.m03.d25:meMA.Ode3C13.incipit
ltx/swh_redirects_oak/me.m03.d25:meMA.Ode3C13.melody	@ltx/swh_ke_oak/me.m03.d25:meMA.Ode3C13.melody
ltx/swh_redirects_oak/me.m03.d25:meMA.Ode3C13.mode	@ltx/swh_ke_oak/me.m03.d25:meMA.Ode3C13.mode
ltx/swh_redirects_oak/me.m03.d25:meMA.Ode3C13.ode	@ltx/swh_ke_oak/me.m03.d25:meMA.Ode3C13.ode
ltx/swh_redirects_oak/me.m03.d25:meMA.Ode3C13.text	@ltx/swh_ke_oak/me.m03.d25:meMA.Ode3C13.text
ltx/swh_redirects_oak/me.m03.d25:meMA.Ode3C14.incipit	@ltx/swh_ke_oak/me.m03.d25:meMA.Ode3C14.incipit
ltx/swh_redirects_oak/me.m03.d25:meMA.Ode3C14.melody	@ltx/swh_ke_oak/me.m03.d25:meMA.Ode3C14.melody
ltx/swh_redirects_oak/me.m03.d25:meMA.Ode3C14.mode	@ltx/swh_ke_oak/me.m03.d25:meMA.Ode3C14.mode
ltx/swh_redirects_oak/me.m03.d25:meMA.Ode3C14.ode	@ltx/swh_ke_oak/me.m03.d25:meMA.Ode3C14.ode
ltx/swh_redirects_oak/me.m03.d25:meMA.Ode3C14.text	@ltx/swh_ke_oak/me.m03.d25:meMA.Ode3C14.text
ltx/swh_redirects_oak/me.m03.d25:meMA.Ode3C1H.greekmelody	@ltx/swh_ke_oak/me.m03.d25:meMA.Ode3C1H.greekmelody
ltx/swh_redirects_oak/me.m03.d25:meMA.Ode3C1H.incipit	@ltx/swh_ke_oak/me.m03.d25:meMA.Ode3C1H.incipit
ltx/swh_redirects_oak/me.m03.d25:meMA.Ode3C1H.melody	@ltx/swh_ke_oak/me.m03.d25:meMA.Ode3C1H.melody
ltx/swh_redirects_oak/me.m03.d25:meMA.Ode3C1H.mode	@ltx/swh_ke_oak/me.m03.d25:meMA.Ode3C1H.mode
ltx/swh_redirects_oak/me.m03.d25:meMA.Ode3C1H.ode	@ltx/swh_ke_oak/me.m03.d25:meMA.Ode3C1H.ode
ltx/swh_redirects_oak/me.m03.d25:meMA.Ode3C1H.text	@ltx/swh_ke_oak/me.m03.d25:meMA.Ode3C1H.text
ltx/swh_redirects_oak/me.m03.d25:meMA.Ode3C21.greekmelody	@ltx/swh_ke_oak/me.m03.d25:meMA.Ode3C21.greekmelody
ltx/swh_redirects_oak/me.m03.d25:meMA.Ode3C21.incipit	@ltx/swh_ke_oak/me.m03.d25:meMA.Ode3C21.incipit
ltx/swh_redirects_oak/me.m03.d25:meMA.Ode3C21.melody	@ltx/swh_ke_oak/me.m03.d25:meMA.Ode3C21.melody
ltx/swh_redirects_oak/me.m03.d25:meMA.Ode3C21.mode	@ltx/swh_ke_oak/me.m03.d25:meMA.Ode3C21.mode
ltx/swh_redirects_oak/me.m03.d25:meMA.Ode3C21.ode	@ltx/swh_ke_oak/me.m03.d25:meMA.Ode3C21.ode
ltx/swh_redirects_oak/me.m03.d25:meMA.Ode3C21.text	@ltx/swh_ke_oak/me.m03.d25:meMA.Ode3C21.text
ltx/swh_redirects_oak/me.m03.d25:meMA.Ode3C211.text	@ltx/swh_ke_oak/me.m03.d25:meMA.Ode3C211.text
ltx/swh_redirects_oak/me.m03.d25:meMA.Ode3C212.text	@ltx/swh_ke_oak/me.m03.d25:meMA.Ode3C212.text
ltx/swh_redirects_oak/me.m03.d25:meMA.Ode3C213.text	@ltx/swh_ke_oak/me.m03.d25:meMA.Ode3C213.text
ltx/swh_redirects_oak/me.m03.d25:meMA.Ode3C214.text	@ltx/swh_ke_oak/me.m03.d25:meMA.Ode3C214.text
ltx/swh_redirects_oak/me.m03.d25:meMA.Ode3C215.text	@ltx/swh_ke_oak/me.m03.d25:meMA.Ode3C215.text
ltx/swh_redirects_oak/me.m03.d25:meMA.Ode3C22.incipit	@ltx/swh_ke_oak/me.m03.d25:meMA.Ode3C22.incipit
ltx/swh_redirects_oak/me.m03.d25:meMA.Ode3C22.melody	@ltx/swh_ke_oak/me.m03.d25:meMA.Ode3C22.melody
ltx/swh_redirects_oak/me.m03.d25:meMA.Ode3C22.mode	@ltx/swh_ke_oak/me.m03.d25:meMA.Ode3C22.mode
ltx/swh_redirects_oak/me.m03.d25:meMA.Ode3C22.ode	@ltx/swh_ke_oak/me.m03.d25:meMA.Ode3C22.ode
ltx/swh_redirects_oak/me.m03.d25:meMA.Ode3C22.text	@ltx/swh_ke_oak/me.m03.d25:meMA.Ode3C22.text
ltx/swh_redirects_oak/me.m03.d25:meMA.Ode3C221.text	@ltx/swh_ke_oak/me.m03.d25:meMA.Ode3C221.text
ltx/swh_redirects_oak/me.m03.d25:meMA.Ode3C222.text	@ltx/swh_ke_oak/me.m03.d25:meMA.Ode3C222.text
ltx/swh_redirects_oak/me.m03.d25:meMA.Ode3C223.text	@ltx/swh_ke_oak/me.m03.d25:meMA.Ode3C223.text
ltx/swh_redirects_oak/me.m03.d25:meMA.Ode3C224.text	@ltx/swh_ke_oak/me.m03.d25:meMA.Ode3C224.text
ltx/swh_redirects_oak/me.m03.d25:meMA.Ode3C225.text	@ltx/swh_ke_oak/me.m03.d25:meMA.Ode3C225.text
ltx/swh_redirects_oak/me.m03.d25:meMA.Ode3C23.incipit	@ltx/swh_ke_oak/me.m03.d25:meMA.Ode3C23.incipit
ltx/swh_redirects_oak/me.m03.d25:meMA.Ode3C23.melody	@ltx/swh_ke_oak/me.m03.d25:meMA.Ode3C23.melody
ltx/swh_redirects_oak/me.m03.d25:meMA.Ode3C23.mode	@ltx/swh_ke_oak/me.m03.d25:meMA.Ode3C23.mode
ltx/swh_redirects_oak/me.m03.d25:meMA.Ode3C23.ode	@ltx/swh_ke_oak/me.m03.d25:meMA.Ode3C23.ode
ltx/swh_redirects_oak/me.m03.d25:meMA.Ode3C23.text	@ltx/swh_ke_oak/me.m03.d25:meMA.Ode3C23.text
ltx/swh_redirects_oak/me.m03.d25:meMA.Ode3C231.text	@ltx/swh_ke_oak/me.m03.d25:meMA.Ode3C231.text
ltx/swh_redirects_oak/me.m03.d25:meMA.Ode3C232.text	@ltx/swh_ke_oak/me.m03.d25:meMA.Ode3C232.text
ltx/swh_redirects_oak/me.m03.d25:meMA.Ode3C233.text	@ltx/swh_ke_oak/me.m03.d25:meMA.Ode3C233.text
ltx/swh_redirects_oak/me.m03.d25:meMA.Ode3C234.text	@ltx/swh_ke_oak/me.m03.d25:meMA.Ode3C234.text
ltx/swh_redirects_oak/me.m03.d25:meMA.Ode3C235.text	@ltx/swh_ke_oak/me.m03.d25:meMA.Ode3C235.text
ltx/swh_redirects_oak/me.m03.d25:meMA.Ode3C24.incipit	@ltx/swh_ke_oak/me.m03.d25:meMA.Ode3C24.incipit
ltx/swh_redirects_oak/me.m03.d25:meMA.Ode3C24.melody	@ltx/swh_ke_oak/me.m03.d25:meMA.Ode3C24.melody
ltx/swh_redirects_oak/me.m03.d25:meMA.Ode3C24.mode	@ltx/swh_ke_oak/me.m03.d25:meMA.Ode3C24.mode
ltx/swh_redirects_oak/me.m03.d25:meMA.Ode3C24.ode	@ltx/swh_ke_oak/me.m03.d25:meMA.Ode3C24.ode
ltx/swh_redirects_oak/me.m03.d25:meMA.Ode3C24.text	@ltx/swh_ke_oak/me.m03.d25:meMA.Ode3C24.text
ltx/swh_redirects_oak/me.m03.d25:meMA.Ode3C241.text	@ltx/swh_ke_oak/me.m03.d25:meMA.Ode3C241.text
ltx/swh_redirects_oak/me.m03.d25:meMA.Ode3C242.text	@ltx/swh_ke_oak/me.m03.d25:meMA.Ode3C242.text
ltx/swh_redirects_oak/me.m03.d25:meMA.Ode3C243.text	@ltx/swh_ke_oak/me.m03.d25:meMA.Ode3C243.text
ltx/swh_redirects_oak/me.m03.d25:meMA.Ode3C244.text	@ltx/swh_ke_oak/me.m03.d25:meMA.Ode3C244.text
ltx/swh_redirects_oak/me.m03.d25:meMA.Ode3C245.text	@ltx/swh_ke_oak/me.m03.d25:meMA.Ode3C245.text
ltx/swh_redirects_oak/me.m03.d25:meMA.Ode3C25.incipit	@ltx/swh_ke_oak/me.m03.d25:meMA.Ode3C25.incipit
ltx/swh_redirects_oak/me.m03.d25:meMA.Ode3C25.melody	@ltx/swh_ke_oak/me.m03.d25:meMA.Ode3C25.melody
ltx/swh_redirects_oak/me.m03.d25:meMA.Ode3C25.mode	@ltx/swh_ke_oak/me.m03.d25:meMA.Ode3C25.mode
ltx/swh_redirects_oak/me.m03.d25:meMA.Ode3C25.ode	@ltx/swh_ke_oak/me.m03.d25:meMA.Ode3C25.ode
ltx/swh_redirects_oak/me.m03.d25:meMA.Ode3C25.text	@ltx/swh_ke_oak/me.m03.d25:meMA.Ode3C25.text
ltx/swh_redirects_oak/me.m03.d25:meMA.Ode3C251.text	@ltx/swh_ke_oak/me.m03.d25:meMA.Ode3C251.text
ltx/swh_redirects_oak/me.m03.d25:meMA.Ode3C252.text	@ltx/swh_ke_oak/me.m03.d25:meMA.Ode3C252.text
ltx/swh_redirects_oak/me.m03.d25:meMA.Ode3C253.text	@ltx/swh_ke_oak/me.m03.d25:meMA.Ode3C253.text
ltx/swh_redirects_oak/me.m03.d25:meMA.Ode3C254.text	@ltx/swh_ke_oak/me.m03.d25:meMA.Ode3C254.text
ltx/swh_redirects_oak/me.m03.d25:meMA.Ode3C255.text	@ltx/swh_ke_oak/me.m03.d25:meMA.Ode3C255.text
ltx/swh_redirects_oak/me.m03.d25:meMA.Ode3C26.incipit	@ltx/swh_ke_oak/me.m03.d25:meMA.Ode3C26.incipit
ltx/swh_redirects_oak/me.m03.d25:meMA.Ode3C26.melody	@ltx/swh_ke_oak/me.m03.d25:meMA.Ode3C26.melody
ltx/swh_redirects_oak/me.m03.d25:meMA.Ode3C26.mode	@ltx/swh_ke_oak/me.m03.d25:meMA.Ode3C26.mode
ltx/swh_redirects_oak/me.m03.d25:meMA.Ode3C26.ode	@ltx/swh_ke_oak/me.m03.d25:meMA.Ode3C26.ode
ltx/swh_redirects_oak/me.m03.d25:meMA.Ode3C26.text	@ltx/swh_ke_oak/me.m03.d25:meMA.Ode3C26.text
ltx/swh_redirects_oak/me.m03.d25:meMA.Ode3C261.text	@ltx/swh_ke_oak/me.m03.d25:meMA.Ode3C261.text
ltx/swh_redirects_oak/me.m03.d25:meMA.Ode3C262.text	@ltx/swh_ke_oak/me.m03.d25:meMA.Ode3C262.text
ltx/swh_redirects_oak/me.m03.d25:meMA.Ode3C263.text	@ltx/swh_ke_oak/me.m03.d25:meMA.Ode3C263.text
ltx/swh_redirects_oak/me.m03.d25:meMA.Ode3C264.text	@ltx/swh_ke_oak/me.m03.d25:meMA.Ode3C264.text
ltx/swh_redirects_oak/me.m03.d25:meMA.Ode3C265.text	@ltx/swh_ke_oak/me.m03.d25:meMA.Ode3C265.text
ltx/swh_redirects_oak/me.m03.d25:meMA.Ode3Kathisma1.greekmelody	@ltx/swh_ke_oak/me.m03.d25:meMA.Ode3Kathisma1.greekmelody
ltx/swh_redirects_oak/me.m03.d25:meMA.Ode3Kathisma1.incipit	@ltx/swh_ke_oak/me.m03.d25:meMA.Ode3Kathisma1.incipit
ltx/swh_redirects_oak/me.m03.d25:meMA.Ode3Kathisma1.melody	@ltx/swh_ke_oak/me.m03.d25:meMA.Ode3Kathisma1.melody
ltx/swh_redirects_oak/me.m03.d25:meMA.Ode3Kathisma1.mode	@ltx/swh_ke_oak/me.m03.d25:meMA.Ode3Kathisma1.mode
ltx/swh_redirects_oak/me.m03.d25:meMA.Ode3Kathisma1.text	@ltx/swh_ke_oak/me.m03.d25:meMA.Ode3Kathisma1.text
ltx/swh_redirects_oak/me.m03.d25:meMA.Ode4C11.greekmelody	@ltx/swh_ke_oak/me.m03.d25:meMA.Ode4C11.greekmelody
ltx/swh_redirects_oak/me.m03.d25:meMA.Ode4C11.incipit	@ltx/swh_ke_oak/me.m03.d25:meMA.Ode4C11.incipit
ltx/swh_redirects_oak/me.m03.d25:meMA.Ode4C11.melody	@ltx/swh_ke_oak/me.m03.d25:meMA.Ode4C11.melody
ltx/swh_redirects_oak/me.m03.d25:meMA.Ode4C11.mode	@ltx/swh_ke_oak/me.m03.d25:meMA.Ode4C11.mode
ltx/swh_redirects_oak/me.m03.d25:meMA.Ode4C11.ode	@ltx/swh_ke_oak/me.m03.d25:meMA.Ode4C11.ode
ltx/swh_redirects_oak/me.m03.d25:meMA.Ode4C11.text	@ltx/swh_ke_oak/me.m03.d25:meMA.Ode4C11.text
ltx/swh_redirects_oak/me.m03.d25:meMA.Ode4C12.incipit	@ltx/swh_ke_oak/me.m03.d25:meMA.Ode4C12.incipit
ltx/swh_redirects_oak/me.m03.d25:meMA.Ode4C12.melody	@ltx/swh_ke_oak/me.m03.d25:meMA.Ode4C12.melody
ltx/swh_redirects_oak/me.m03.d25:meMA.Ode4C12.mode	@ltx/swh_ke_oak/me.m03.d25:meMA.Ode4C12.mode
ltx/swh_redirects_oak/me.m03.d25:meMA.Ode4C12.ode	@ltx/swh_ke_oak/me.m03.d25:meMA.Ode4C12.ode
ltx/swh_redirects_oak/me.m03.d25:meMA.Ode4C12.text	@ltx/swh_ke_oak/me.m03.d25:meMA.Ode4C12.text
ltx/swh_redirects_oak/me.m03.d25:meMA.Ode4C13.incipit	@ltx/swh_ke_oak/me.m03.d25:meMA.Ode4C13.incipit
ltx/swh_redirects_oak/me.m03.d25:meMA.Ode4C13.melody	@ltx/swh_ke_oak/me.m03.d25:meMA.Ode4C13.melody
ltx/swh_redirects_oak/me.m03.d25:meMA.Ode4C13.mode	@ltx/swh_ke_oak/me.m03.d25:meMA.Ode4C13.mode
ltx/swh_redirects_oak/me.m03.d25:meMA.Ode4C13.ode	@ltx/swh_ke_oak/me.m03.d25:meMA.Ode4C13.ode
ltx/swh_redirects_oak/me.m03.d25:meMA.Ode4C13.text	@ltx/swh_ke_oak/me.m03.d25:meMA.Ode4C13.text
ltx/swh_redirects_oak/me.m03.d25:meMA.Ode4C14.incipit	@ltx/swh_ke_oak/me.m03.d25:meMA.Ode4C14.incipit
ltx/swh_redirects_oak/me.m03.d25:meMA.Ode4C14.melody	@ltx/swh_ke_oak/me.m03.d25:meMA.Ode4C14.melody
ltx/swh_redirects_oak/me.m03.d25:meMA.Ode4C14.mode	@ltx/swh_ke_oak/me.m03.d25:meMA.Ode4C14.mode
ltx/swh_redirects_oak/me.m03.d25:meMA.Ode4C14.ode	@ltx/swh_ke_oak/me.m03.d25:meMA.Ode4C14.ode
ltx/swh_redirects_oak/me.m03.d25:meMA.Ode4C14.text	@ltx/swh_ke_oak/me.m03.d25:meMA.Ode4C14.text
ltx/swh_redirects_oak/me.m03.d25:meMA.Ode4C1H.greekmelody	@ltx/swh_ke_oak/me.m03.d25:meMA.Ode4C1H.greekmelody
ltx/swh_redirects_oak/me.m03.d25:meMA.Ode4C1H.incipit	@ltx/swh_ke_oak/me.m03.d25:meMA.Ode4C1H.incipit
ltx/swh_redirects_oak/me.m03.d25:meMA.Ode4C1H.melody	@ltx/swh_ke_oak/me.m03.d25:meMA.Ode4C1H.melody
ltx/swh_redirects_oak/me.m03.d25:meMA.Ode4C1H.mode	@ltx/swh_ke_oak/me.m03.d25:meMA.Ode4C1H.mode
ltx/swh_redirects_oak/me.m03.d25:meMA.Ode4C1H.ode	@ltx/swh_ke_oak/me.m03.d25:meMA.Ode4C1H.ode
ltx/swh_redirects_oak/me.m03.d25:meMA.Ode4C1H.text	@ltx/swh_ke_oak/me.m03.d25:meMA.Ode4C1H.text
ltx/swh_redirects_oak/me.m03.d25:meMA.Ode4C21.greekmelody	@ltx/swh_ke_oak/me.m03.d25:meMA.Ode4C21.greekmelody
ltx/swh_redirects_oak/me.m03.d25:meMA.Ode4C21.incipit	@ltx/swh_ke_oak/me.m03.d25:meMA.Ode4C21.incipit
ltx/swh_redirects_oak/me.m03.d25:meMA.Ode4C21.melody	@ltx/swh_ke_oak/me.m03.d25:meMA.Ode4C21.melody
ltx/swh_redirects_oak/me.m03.d25:meMA.Ode4C21.mode	@ltx/swh_ke_oak/me.m03.d25:meMA.Ode4C21.mode
ltx/swh_redirects_oak/me.m03.d25:meMA.Ode4C21.ode	@ltx/swh_ke_oak/me.m03.d25:meMA.Ode4C21.ode
ltx/swh_redirects_oak/me.m03.d25:meMA.Ode4C21.text	@ltx/swh_ke_oak/me.m03.d25:meMA.Ode4C21.text
ltx/swh_redirects_oak/me.m03.d25:meMA.Ode4C211.text	@ltx/swh_ke_oak/me.m03.d25:meMA.Ode4C211.text
ltx/swh_redirects_oak/me.m03.d25:meMA.Ode4C212.text	@ltx/swh_ke_oak/me.m03.d25:meMA.Ode4C212.text
ltx/swh_redirects_oak/me.m03.d25:meMA.Ode4C213.text	@ltx/swh_ke_oak/me.m03.d25:meMA.Ode4C213.text
ltx/swh_redirects_oak/me.m03.d25:meMA.Ode4C214.text	@ltx/swh_ke_oak/me.m03.d25:meMA.Ode4C214.text
ltx/swh_redirects_oak/me.m03.d25:meMA.Ode4C215.text	@ltx/swh_ke_oak/me.m03.d25:meMA.Ode4C215.text
ltx/swh_redirects_oak/me.m03.d25:meMA.Ode4C22.incipit	@ltx/swh_ke_oak/me.m03.d25:meMA.Ode4C22.incipit
ltx/swh_redirects_oak/me.m03.d25:meMA.Ode4C22.melody	@ltx/swh_ke_oak/me.m03.d25:meMA.Ode4C22.melody
ltx/swh_redirects_oak/me.m03.d25:meMA.Ode4C22.mode	@ltx/swh_ke_oak/me.m03.d25:meMA.Ode4C22.mode
ltx/swh_redirects_oak/me.m03.d25:meMA.Ode4C22.ode	@ltx/swh_ke_oak/me.m03.d25:meMA.Ode4C22.ode
ltx/swh_redirects_oak/me.m03.d25:meMA.Ode4C22.text	@ltx/swh_ke_oak/me.m03.d25:meMA.Ode4C22.text
ltx/swh_redirects_oak/me.m03.d25:meMA.Ode4C221.text	@ltx/swh_ke_oak/me.m03.d25:meMA.Ode4C221.text
ltx/swh_redirects_oak/me.m03.d25:meMA.Ode4C222.text	@ltx/swh_ke_oak/me.m03.d25:meMA.Ode4C222.text
ltx/swh_redirects_oak/me.m03.d25:meMA.Ode4C223.text	@ltx/swh_ke_oak/me.m03.d25:meMA.Ode4C223.text
ltx/swh_redirects_oak/me.m03.d25:meMA.Ode4C224.text	@ltx/swh_ke_oak/me.m03.d25:meMA.Ode4C224.text
ltx/swh_redirects_oak/me.m03.d25:meMA.Ode4C225.text	@ltx/swh_ke_oak/me.m03.d25:meMA.Ode4C225.text
ltx/swh_redirects_oak/me.m03.d25:meMA.Ode4C23.incipit	@ltx/swh_ke_oak/me.m03.d25:meMA.Ode4C23.incipit
ltx/swh_redirects_oak/me.m03.d25:meMA.Ode4C23.melody	@ltx/swh_ke_oak/me.m03.d25:meMA.Ode4C23.melody
ltx/swh_redirects_oak/me.m03.d25:meMA.Ode4C23.mode	@ltx/swh_ke_oak/me.m03.d25:meMA.Ode4C23.mode
ltx/swh_redirects_oak/me.m03.d25:meMA.Ode4C23.ode	@ltx/swh_ke_oak/me.m03.d25:meMA.Ode4C23.ode
ltx/swh_redirects_oak/me.m03.d25:meMA.Ode4C23.text	@ltx/swh_ke_oak/me.m03.d25:meMA.Ode4C23.text
ltx/swh_redirects_oak/me.m03.d25:meMA.Ode4C231.text	@ltx/swh_ke_oak/me.m03.d25:meMA.Ode4C231.text
ltx/swh_redirects_oak/me.m03.d25:meMA.Ode4C232.text	@ltx/swh_ke_oak/me.m03.d25:meMA.Ode4C232.text
ltx/swh_redirects_oak/me.m03.d25:meMA.Ode4C233.text	@ltx/swh_ke_oak/me.m03.d25:meMA.Ode4C233.text
ltx/swh_redirects_oak/me.m03.d25:meMA.Ode4C234.text	@ltx/swh_ke_oak/me.m03.d25:meMA.Ode4C234.text
ltx/swh_redirects_oak/me.m03.d25:meMA.Ode4C235.text	@ltx/swh_ke_oak/me.m03.d25:meMA.Ode4C235.text
ltx/swh_redirects_oak/me.m03.d25:meMA.Ode4C24.incipit	@ltx/swh_ke_oak/me.m03.d25:meMA.Ode4C24.incipit
ltx/swh_redirects_oak/me.m03.d25:meMA.Ode4C24.melody	@ltx/swh_ke_oak/me.m03.d25:meMA.Ode4C24.melody
ltx/swh_redirects_oak/me.m03.d25:meMA.Ode4C24.mode	@ltx/swh_ke_oak/me.m03.d25:meMA.Ode4C24.mode
ltx/swh_redirects_oak/me.m03.d25:meMA.Ode4C24.ode	@ltx/swh_ke_oak/me.m03.d25:meMA.Ode4C24.ode
ltx/swh_redirects_oak/me.m03.d25:meMA.Ode4C24.text	@ltx/swh_ke_oak/me.m03.d25:meMA.Ode4C24.text
ltx/swh_redirects_oak/me.m03.d25:meMA.Ode4C241.text	@ltx/swh_ke_oak/me.m03.d25:meMA.Ode4C241.text
ltx/swh_redirects_oak/me.m03.d25:meMA.Ode4C242.text	@ltx/swh_ke_oak/me.m03.d25:meMA.Ode4C242.text
ltx/swh_redirects_oak/me.m03.d25:meMA.Ode4C243.text	@ltx/swh_ke_oak/me.m03.d25:meMA.Ode4C243.text
ltx/swh_redirects_oak/me.m03.d25:meMA.Ode4C244.text	@ltx/swh_ke_oak/me.m03.d25:meMA.Ode4C244.text
ltx/swh_redirects_oak/me.m03.d25:meMA.Ode4C245.text	@ltx/swh_ke_oak/me.m03.d25:meMA.Ode4C245.text
ltx/swh_redirects_oak/me.m03.d25:meMA.Ode4C25.incipit	@ltx/swh_ke_oak/me.m03.d25:meMA.Ode4C25.incipit
ltx/swh_redirects_oak/me.m03.d25:meMA.Ode4C25.melody	@ltx/swh_ke_oak/me.m03.d25:meMA.Ode4C25.melody
ltx/swh_redirects_oak/me.m03.d25:meMA.Ode4C25.mode	@ltx/swh_ke_oak/me.m03.d25:meMA.Ode4C25.mode
ltx/swh_redirects_oak/me.m03.d25:meMA.Ode4C25.ode	@ltx/swh_ke_oak/me.m03.d25:meMA.Ode4C25.ode
ltx/swh_redirects_oak/me.m03.d25:meMA.Ode4C25.text	@ltx/swh_ke_oak/me.m03.d25:meMA.Ode4C25.text
ltx/swh_redirects_oak/me.m03.d25:meMA.Ode4C251.text	@ltx/swh_ke_oak/me.m03.d25:meMA.Ode4C251.text
ltx/swh_redirects_oak/me.m03.d25:meMA.Ode4C252.text	@ltx/swh_ke_oak/me.m03.d25:meMA.Ode4C252.text
ltx/swh_redirects_oak/me.m03.d25:meMA.Ode4C253.text	@ltx/swh_ke_oak/me.m03.d25:meMA.Ode4C253.text
ltx/swh_redirects_oak/me.m03.d25:meMA.Ode4C254.text	@ltx/swh_ke_oak/me.m03.d25:meMA.Ode4C254.text
ltx/swh_redirects_oak/me.m03.d25:meMA.Ode4C255.text	@ltx/swh_ke_oak/me.m03.d25:meMA.Ode4C255.text
ltx/swh_redirects_oak/me.m03.d25:meMA.Ode4C26.incipit	@ltx/swh_ke_oak/me.m03.d25:meMA.Ode4C26.incipit
ltx/swh_redirects_oak/me.m03.d25:meMA.Ode4C26.melody	@ltx/swh_ke_oak/me.m03.d25:meMA.Ode4C26.melody
ltx/swh_redirects_oak/me.m03.d25:meMA.Ode4C26.mode	@ltx/swh_ke_oak/me.m03.d25:meMA.Ode4C26.mode
ltx/swh_redirects_oak/me.m03.d25:meMA.Ode4C26.ode	@ltx/swh_ke_oak/me.m03.d25:meMA.Ode4C26.ode
ltx/swh_redirects_oak/me.m03.d25:meMA.Ode4C26.text	@ltx/swh_ke_oak/me.m03.d25:meMA.Ode4C26.text
ltx/swh_redirects_oak/me.m03.d25:meMA.Ode4C261.text	@ltx/swh_ke_oak/me.m03.d25:meMA.Ode4C261.text
ltx/swh_redirects_oak/me.m03.d25:meMA.Ode4C262.text	@ltx/swh_ke_oak/me.m03.d25:meMA.Ode4C262.text
ltx/swh_redirects_oak/me.m03.d25:meMA.Ode4C263.text	@ltx/swh_ke_oak/me.m03.d25:meMA.Ode4C263.text
ltx/swh_redirects_oak/me.m03.d25:meMA.Ode4C264.text	@ltx/swh_ke_oak/me.m03.d25:meMA.Ode4C264.text
ltx/swh_redirects_oak/me.m03.d25:meMA.Ode4C265.text	@ltx/swh_ke_oak/me.m03.d25:meMA.Ode4C265.text
ltx/swh_redirects_oak/me.m03.d25:meMA.Ode5C11.greekmelody	@ltx/swh_ke_oak/me.m03.d25:meMA.Ode5C11.greekmelody
ltx/swh_redirects_oak/me.m03.d25:meMA.Ode5C11.incipit	@ltx/swh_ke_oak/me.m03.d25:meMA.Ode5C11.incipit
ltx/swh_redirects_oak/me.m03.d25:meMA.Ode5C11.melody	@ltx/swh_ke_oak/me.m03.d25:meMA.Ode5C11.melody
ltx/swh_redirects_oak/me.m03.d25:meMA.Ode5C11.mode	@ltx/swh_ke_oak/me.m03.d25:meMA.Ode5C11.mode
ltx/swh_redirects_oak/me.m03.d25:meMA.Ode5C11.ode	@ltx/swh_ke_oak/me.m03.d25:meMA.Ode5C11.ode
ltx/swh_redirects_oak/me.m03.d25:meMA.Ode5C11.text	@ltx/swh_ke_oak/me.m03.d25:meMA.Ode5C11.text
ltx/swh_redirects_oak/me.m03.d25:meMA.Ode5C12.incipit	@ltx/swh_ke_oak/me.m03.d25:meMA.Ode5C12.incipit
ltx/swh_redirects_oak/me.m03.d25:meMA.Ode5C12.melody	@ltx/swh_ke_oak/me.m03.d25:meMA.Ode5C12.melody
ltx/swh_redirects_oak/me.m03.d25:meMA.Ode5C12.mode	@ltx/swh_ke_oak/me.m03.d25:meMA.Ode5C12.mode
ltx/swh_redirects_oak/me.m03.d25:meMA.Ode5C12.ode	@ltx/swh_ke_oak/me.m03.d25:meMA.Ode5C12.ode
ltx/swh_redirects_oak/me.m03.d25:meMA.Ode5C12.text	@ltx/swh_ke_oak/me.m03.d25:meMA.Ode5C12.text
ltx/swh_redirects_oak/me.m03.d25:meMA.Ode5C13.incipit	@ltx/swh_ke_oak/me.m03.d25:meMA.Ode5C13.incipit
ltx/swh_redirects_oak/me.m03.d25:meMA.Ode5C13.melody	@ltx/swh_ke_oak/me.m03.d25:meMA.Ode5C13.melody
ltx/swh_redirects_oak/me.m03.d25:meMA.Ode5C13.mode	@ltx/swh_ke_oak/me.m03.d25:meMA.Ode5C13.mode
ltx/swh_redirects_oak/me.m03.d25:meMA.Ode5C13.ode	@ltx/swh_ke_oak/me.m03.d25:meMA.Ode5C13.ode
ltx/swh_redirects_oak/me.m03.d25:meMA.Ode5C13.text	@ltx/swh_ke_oak/me.m03.d25:meMA.Ode5C13.text
ltx/swh_redirects_oak/me.m03.d25:meMA.Ode5C14.incipit	@ltx/swh_ke_oak/me.m03.d25:meMA.Ode5C14.incipit
ltx/swh_redirects_oak/me.m03.d25:meMA.Ode5C14.melody	@ltx/swh_ke_oak/me.m03.d25:meMA.Ode5C14.melody
ltx/swh_redirects_oak/me.m03.d25:meMA.Ode5C14.mode	@ltx/swh_ke_oak/me.m03.d25:meMA.Ode5C14.mode
ltx/swh_redirects_oak/me.m03.d25:meMA.Ode5C14.ode	@ltx/swh_ke_oak/me.m03.d25:meMA.Ode5C14.ode
ltx/swh_redirects_oak/me.m03.d25:meMA.Ode5C14.text	@ltx/swh_ke_oak/me.m03.d25:meMA.Ode5C14.text
ltx/swh_redirects_oak/me.m03.d25:meMA.Ode5C1H.greekmelody	@ltx/swh_ke_oak/me.m03.d25:meMA.Ode5C1H.greekmelody
ltx/swh_redirects_oak/me.m03.d25:meMA.Ode5C1H.incipit	@ltx/swh_ke_oak/me.m03.d25:meMA.Ode5C1H.incipit
ltx/swh_redirects_oak/me.m03.d25:meMA.Ode5C1H.melody	@ltx/swh_ke_oak/me.m03.d25:meMA.Ode5C1H.melody
ltx/swh_redirects_oak/me.m03.d25:meMA.Ode5C1H.mode	@ltx/swh_ke_oak/me.m03.d25:meMA.Ode5C1H.mode
ltx/swh_redirects_oak/me.m03.d25:meMA.Ode5C1H.ode	@ltx/swh_ke_oak/me.m03.d25:meMA.Ode5C1H.ode
ltx/swh_redirects_oak/me.m03.d25:meMA.Ode5C1H.text	@ltx/swh_ke_oak/me.m03.d25:meMA.Ode5C1H.text
ltx/swh_redirects_oak/me.m03.d25:meMA.Ode5C21.greekmelody	@ltx/swh_ke_oak/me.m03.d25:meMA.Ode5C21.greekmelody
ltx/swh_redirects_oak/me.m03.d25:meMA.Ode5C21.incipit	@ltx/swh_ke_oak/me.m03.d25:meMA.Ode5C21.incipit
ltx/swh_redirects_oak/me.m03.d25:meMA.Ode5C21.melody	@ltx/swh_ke_oak/me.m03.d25:meMA.Ode5C21.melody
ltx/swh_redirects_oak/me.m03.d25:meMA.Ode5C21.mode	@ltx/swh_ke_oak/me.m03.d25:meMA.Ode5C21.mode
ltx/swh_redirects_oak/me.m03.d25:meMA.Ode5C21.ode	@ltx/swh_ke_oak/me.m03.d25:meMA.Ode5C21.ode
ltx/swh_redirects_oak/me.m03.d25:meMA.Ode5C21.text	@ltx/swh_ke_oak/me.m03.d25:meMA.Ode5C21.text
ltx/swh_redirects_oak/me.m03.d25:meMA.Ode5C211.text	@ltx/swh_ke_oak/me.m03.d25:meMA.Ode5C211.text
ltx/swh_redirects_oak/me.m03.d25:meMA.Ode5C212.text	@ltx/swh_ke_oak/me.m03.d25:meMA.Ode5C212.text
ltx/swh_redirects_oak/me.m03.d25:meMA.Ode5C213.text	@ltx/swh_ke_oak/me.m03.d25:meMA.Ode5C213.text
ltx/swh_redirects_oak/me.m03.d25:meMA.Ode5C214.text	@ltx/swh_ke_oak/me.m03.d25:meMA.Ode5C214.text
ltx/swh_redirects_oak/me.m03.d25:meMA.Ode5C215.text	@ltx/swh_ke_oak/me.m03.d25:meMA.Ode5C215.text
ltx/swh_redirects_oak/me.m03.d25:meMA.Ode5C22.incipit	@ltx/swh_ke_oak/me.m03.d25:meMA.Ode5C22.incipit
ltx/swh_redirects_oak/me.m03.d25:meMA.Ode5C22.melody	@ltx/swh_ke_oak/me.m03.d25:meMA.Ode5C22.melody
ltx/swh_redirects_oak/me.m03.d25:meMA.Ode5C22.mode	@ltx/swh_ke_oak/me.m03.d25:meMA.Ode5C22.mode
ltx/swh_redirects_oak/me.m03.d25:meMA.Ode5C22.ode	@ltx/swh_ke_oak/me.m03.d25:meMA.Ode5C22.ode
ltx/swh_redirects_oak/me.m03.d25:meMA.Ode5C22.text	@ltx/swh_ke_oak/me.m03.d25:meMA.Ode5C22.text
ltx/swh_redirects_oak/me.m03.d25:meMA.Ode5C221.text	@ltx/swh_ke_oak/me.m03.d25:meMA.Ode5C221.text
ltx/swh_redirects_oak/me.m03.d25:meMA.Ode5C222.text	@ltx/swh_ke_oak/me.m03.d25:meMA.Ode5C222.text
ltx/swh_redirects_oak/me.m03.d25:meMA.Ode5C223.text	@ltx/swh_ke_oak/me.m03.d25:meMA.Ode5C223.text
ltx/swh_redirects_oak/me.m03.d25:meMA.Ode5C224.text	@ltx/swh_ke_oak/me.m03.d25:meMA.Ode5C224.text
ltx/swh_redirects_oak/me.m03.d25:meMA.Ode5C225.text	@ltx/swh_ke_oak/me.m03.d25:meMA.Ode5C225.text
ltx/swh_redirects_oak/me.m03.d25:meMA.Ode5C23.incipit	@ltx/swh_ke_oak/me.m03.d25:meMA.Ode5C23.incipit
ltx/swh_redirects_oak/me.m03.d25:meMA.Ode5C23.melody	@ltx/swh_ke_oak/me.m03.d25:meMA.Ode5C23.melody
ltx/swh_redirects_oak/me.m03.d25:meMA.Ode5C23.mode	@ltx/swh_ke_oak/me.m03.d25:meMA.Ode5C23.mode
ltx/swh_redirects_oak/me.m03.d25:meMA.Ode5C23.ode	@ltx/swh_ke_oak/me.m03.d25:meMA.Ode5C23.ode
ltx/swh_redirects_oak/me.m03.d25:meMA.Ode5C23.text	@ltx/swh_ke_oak/me.m03.d25:meMA.Ode5C23.text
ltx/swh_redirects_oak/me.m03.d25:meMA.Ode5C231.text	@ltx/swh_ke_oak/me.m03.d25:meMA.Ode5C231.text
ltx/swh_redirects_oak/me.m03.d25:meMA.Ode5C232.text	@ltx/swh_ke_oak/me.m03.d25:meMA.Ode5C232.text
ltx/swh_redirects_oak/me.m03.d25:meMA.Ode5C233.text	@ltx/swh_ke_oak/me.m03.d25:meMA.Ode5C233.text
ltx/swh_redirects_oak/me.m03.d25:meMA.Ode5C234.text	@ltx/swh_ke_oak/me.m03.d25:meMA.Ode5C234.text
ltx/swh_redirects_oak/me.m03.d25:meMA.Ode5C235.text	@ltx/swh_ke_oak/me.m03.d25:meMA.Ode5C235.text
ltx/swh_redirects_oak/me.m03.d25:meMA.Ode5C24.incipit	@ltx/swh_ke_oak/me.m03.d25:meMA.Ode5C24.incipit
ltx/swh_redirects_oak/me.m03.d25:meMA.Ode5C24.melody	@ltx/swh_ke_oak/me.m03.d25:meMA.Ode5C24.melody
ltx/swh_redirects_oak/me.m03.d25:meMA.Ode5C24.mode	@ltx/swh_ke_oak/me.m03.d25:meMA.Ode5C24.mode
ltx/swh_redirects_oak/me.m03.d25:meMA.Ode5C24.ode	@ltx/swh_ke_oak/me.m03.d25:meMA.Ode5C24.ode
ltx/swh_redirects_oak/me.m03.d25:meMA.Ode5C24.text	@ltx/swh_ke_oak/me.m03.d25:meMA.Ode5C24.text
ltx/swh_redirects_oak/me.m03.d25:meMA.Ode5C241.text	@ltx/swh_ke_oak/me.m03.d25:meMA.Ode5C241.text
ltx/swh_redirects_oak/me.m03.d25:meMA.Ode5C242.text	@ltx/swh_ke_oak/me.m03.d25:meMA.Ode5C242.text
ltx/swh_redirects_oak/me.m03.d25:meMA.Ode5C243.text	@ltx/swh_ke_oak/me.m03.d25:meMA.Ode5C243.text
ltx/swh_redirects_oak/me.m03.d25:meMA.Ode5C244.text	@ltx/swh_ke_oak/me.m03.d25:meMA.Ode5C244.text
ltx/swh_redirects_oak/me.m03.d25:meMA.Ode5C245.text	@ltx/swh_ke_oak/me.m03.d25:meMA.Ode5C245.text
ltx/swh_redirects_oak/me.m03.d25:meMA.Ode5C25.incipit	@ltx/swh_ke_oak/me.m03.d25:meMA.Ode5C25.incipit
ltx/swh_redirects_oak/me.m03.d25:meMA.Ode5C25.melody	@ltx/swh_ke_oak/me.m03.d25:meMA.Ode5C25.melody
ltx/swh_redirects_oak/me.m03.d25:meMA.Ode5C25.mode	@ltx/swh_ke_oak/me.m03.d25:meMA.Ode5C25.mode
ltx/swh_redirects_oak/me.m03.d25:meMA.Ode5C25.ode	@ltx/swh_ke_oak/me.m03.d25:meMA.Ode5C25.ode
ltx/swh_redirects_oak/me.m03.d25:meMA.Ode5C25.text	@ltx/swh_ke_oak/me.m03.d25:meMA.Ode5C25.text
ltx/swh_redirects_oak/me.m03.d25:meMA.Ode5C251.text	@ltx/swh_ke_oak/me.m03.d25:meMA.Ode5C251.text
ltx/swh_redirects_oak/me.m03.d25:meMA.Ode5C252.text	@ltx/swh_ke_oak/me.m03.d25:meMA.Ode5C252.text
ltx/swh_redirects_oak/me.m03.d25:meMA.Ode5C253.text	@ltx/swh_ke_oak/me.m03.d25:meMA.Ode5C253.text
ltx/swh_redirects_oak/me.m03.d25:meMA.Ode5C254.text	@ltx/swh_ke_oak/me.m03.d25:meMA.Ode5C254.text
ltx/swh_redirects_oak/me.m03.d25:meMA.Ode5C255.text	@ltx/swh_ke_oak/me.m03.d25:meMA.Ode5C255.text
ltx/swh_redirects_oak/me.m03.d25:meMA.Ode5C26.incipit	@ltx/swh_ke_oak/me.m03.d25:meMA.Ode5C26.incipit
ltx/swh_redirects_oak/me.m03.d25:meMA.Ode5C26.melody	@ltx/swh_ke_oak/me.m03.d25:meMA.Ode5C26.melody
ltx/swh_redirects_oak/me.m03.d25:meMA.Ode5C26.mode	@ltx/swh_ke_oak/me.m03.d25:meMA.Ode5C26.mode
ltx/swh_redirects_oak/me.m03.d25:meMA.Ode5C26.ode	@ltx/swh_ke_oak/me.m03.d25:meMA.Ode5C26.ode
ltx/swh_redirects_oak/me.m03.d25:meMA.Ode5C26.text	@ltx/swh_ke_oak/me.m03.d25:meMA.Ode5C26.text
ltx/swh_redirects_oak/me.m03.d25:meMA.Ode5C261.text	@ltx/swh_ke_oak/me.m03.d25:meMA.Ode5C261.text
ltx/swh_redirects_oak/me.m03.d25:meMA.Ode5C262.text	@ltx/swh_ke_oak/me.m03.d25:meMA.Ode5C262.text
ltx/swh_redirects_oak/me.m03.d25:meMA.Ode5C263.text	@ltx/swh_ke_oak/me.m03.d25:meMA.Ode5C263.text
ltx/swh_redirects_oak/me.m03.d25:meMA.Ode5C264.text	@ltx/swh_ke_oak/me.m03.d25:meMA.Ode5C264.text
ltx/swh_redirects_oak/me.m03.d25:meMA.Ode5C265.text	@ltx/swh_ke_oak/me.m03.d25:meMA.Ode5C265.text
ltx/swh_redirects_oak/me.m03.d25:meMA.Ode6C11.greekmelody	@ltx/swh_ke_oak/me.m03.d25:meMA.Ode6C11.greekmelody
ltx/swh_redirects_oak/me.m03.d25:meMA.Ode6C11.incipit	@ltx/swh_ke_oak/me.m03.d25:meMA.Ode6C11.incipit
ltx/swh_redirects_oak/me.m03.d25:meMA.Ode6C11.melody	@ltx/swh_ke_oak/me.m03.d25:meMA.Ode6C11.melody
ltx/swh_redirects_oak/me.m03.d25:meMA.Ode6C11.mode	@ltx/swh_ke_oak/me.m03.d25:meMA.Ode6C11.mode
ltx/swh_redirects_oak/me.m03.d25:meMA.Ode6C11.ode	@ltx/swh_ke_oak/me.m03.d25:meMA.Ode6C11.ode
ltx/swh_redirects_oak/me.m03.d25:meMA.Ode6C11.text	@ltx/swh_ke_oak/me.m03.d25:meMA.Ode6C11.text
ltx/swh_redirects_oak/me.m03.d25:meMA.Ode6C12.incipit	@ltx/swh_ke_oak/me.m03.d25:meMA.Ode6C12.incipit
ltx/swh_redirects_oak/me.m03.d25:meMA.Ode6C12.melody	@ltx/swh_ke_oak/me.m03.d25:meMA.Ode6C12.melody
ltx/swh_redirects_oak/me.m03.d25:meMA.Ode6C12.mode	@ltx/swh_ke_oak/me.m03.d25:meMA.Ode6C12.mode
ltx/swh_redirects_oak/me.m03.d25:meMA.Ode6C12.ode	@ltx/swh_ke_oak/me.m03.d25:meMA.Ode6C12.ode
ltx/swh_redirects_oak/me.m03.d25:meMA.Ode6C12.text	@ltx/swh_ke_oak/me.m03.d25:meMA.Ode6C12.text
ltx/swh_redirects_oak/me.m03.d25:meMA.Ode6C13.incipit	@ltx/swh_ke_oak/me.m03.d25:meMA.Ode6C13.incipit
ltx/swh_redirects_oak/me.m03.d25:meMA.Ode6C13.melody	@ltx/swh_ke_oak/me.m03.d25:meMA.Ode6C13.melody
ltx/swh_redirects_oak/me.m03.d25:meMA.Ode6C13.mode	@ltx/swh_ke_oak/me.m03.d25:meMA.Ode6C13.mode
ltx/swh_redirects_oak/me.m03.d25:meMA.Ode6C13.ode	@ltx/swh_ke_oak/me.m03.d25:meMA.Ode6C13.ode
ltx/swh_redirects_oak/me.m03.d25:meMA.Ode6C13.text	@ltx/swh_ke_oak/me.m03.d25:meMA.Ode6C13.text
ltx/swh_redirects_oak/me.m03.d25:meMA.Ode6C14.incipit	@ltx/swh_ke_oak/me.m03.d25:meMA.Ode6C14.incipit
ltx/swh_redirects_oak/me.m03.d25:meMA.Ode6C14.melody	@ltx/swh_ke_oak/me.m03.d25:meMA.Ode6C14.melody
ltx/swh_redirects_oak/me.m03.d25:meMA.Ode6C14.mode	@ltx/swh_ke_oak/me.m03.d25:meMA.Ode6C14.mode
ltx/swh_redirects_oak/me.m03.d25:meMA.Ode6C14.ode	@ltx/swh_ke_oak/me.m03.d25:meMA.Ode6C14.ode
ltx/swh_redirects_oak/me.m03.d25:meMA.Ode6C14.text	@ltx/swh_ke_oak/me.m03.d25:meMA.Ode6C14.text
ltx/swh_redirects_oak/me.m03.d25:meMA.Ode6C1H.greekmelody	@ltx/swh_ke_oak/me.m03.d25:meMA.Ode6C1H.greekmelody
ltx/swh_redirects_oak/me.m03.d25:meMA.Ode6C1H.incipit	@ltx/swh_ke_oak/me.m03.d25:meMA.Ode6C1H.incipit
ltx/swh_redirects_oak/me.m03.d25:meMA.Ode6C1H.melody	@ltx/swh_ke_oak/me.m03.d25:meMA.Ode6C1H.melody
ltx/swh_redirects_oak/me.m03.d25:meMA.Ode6C1H.mode	@ltx/swh_ke_oak/me.m03.d25:meMA.Ode6C1H.mode
ltx/swh_redirects_oak/me.m03.d25:meMA.Ode6C1H.ode	@ltx/swh_ke_oak/me.m03.d25:meMA.Ode6C1H.ode
ltx/swh_redirects_oak/me.m03.d25:meMA.Ode6C1H.text	@ltx/swh_ke_oak/me.m03.d25:meMA.Ode6C1H.text
ltx/swh_redirects_oak/me.m03.d25:meMA.Ode6C21.greekmelody	@ltx/swh_ke_oak/me.m03.d25:meMA.Ode6C21.greekmelody
ltx/swh_redirects_oak/me.m03.d25:meMA.Ode6C21.incipit	@ltx/swh_ke_oak/me.m03.d25:meMA.Ode6C21.incipit
ltx/swh_redirects_oak/me.m03.d25:meMA.Ode6C21.melody	@ltx/swh_ke_oak/me.m03.d25:meMA.Ode6C21.melody
ltx/swh_redirects_oak/me.m03.d25:meMA.Ode6C21.mode	@ltx/swh_ke_oak/me.m03.d25:meMA.Ode6C21.mode
ltx/swh_redirects_oak/me.m03.d25:meMA.Ode6C21.ode	@ltx/swh_ke_oak/me.m03.d25:meMA.Ode6C21.ode
ltx/swh_redirects_oak/me.m03.d25:meMA.Ode6C21.text	@ltx/swh_ke_oak/me.m03.d25:meMA.Ode6C21.text
ltx/swh_redirects_oak/me.m03.d25:meMA.Ode6C211.text	@ltx/swh_ke_oak/me.m03.d25:meMA.Ode6C211.text
ltx/swh_redirects_oak/me.m03.d25:meMA.Ode6C212.text	@ltx/swh_ke_oak/me.m03.d25:meMA.Ode6C212.text
ltx/swh_redirects_oak/me.m03.d25:meMA.Ode6C213.text	@ltx/swh_ke_oak/me.m03.d25:meMA.Ode6C213.text
ltx/swh_redirects_oak/me.m03.d25:meMA.Ode6C214.text	@ltx/swh_ke_oak/me.m03.d25:meMA.Ode6C214.text
ltx/swh_redirects_oak/me.m03.d25:meMA.Ode6C215.text	@ltx/swh_ke_oak/me.m03.d25:meMA.Ode6C215.text
ltx/swh_redirects_oak/me.m03.d25:meMA.Ode6C22.incipit	@ltx/swh_ke_oak/me.m03.d25:meMA.Ode6C22.incipit
ltx/swh_redirects_oak/me.m03.d25:meMA.Ode6C22.melody	@ltx/swh_ke_oak/me.m03.d25:meMA.Ode6C22.melody
ltx/swh_redirects_oak/me.m03.d25:meMA.Ode6C22.mode	@ltx/swh_ke_oak/me.m03.d25:meMA.Ode6C22.mode
ltx/swh_redirects_oak/me.m03.d25:meMA.Ode6C22.ode	@ltx/swh_ke_oak/me.m03.d25:meMA.Ode6C22.ode
ltx/swh_redirects_oak/me.m03.d25:meMA.Ode6C22.text	@ltx/swh_ke_oak/me.m03.d25:meMA.Ode6C22.text
ltx/swh_redirects_oak/me.m03.d25:meMA.Ode6C221.text	@ltx/swh_ke_oak/me.m03.d25:meMA.Ode6C221.text
ltx/swh_redirects_oak/me.m03.d25:meMA.Ode6C222.text	@ltx/swh_ke_oak/me.m03.d25:meMA.Ode6C222.text
ltx/swh_redirects_oak/me.m03.d25:meMA.Ode6C223.text	@ltx/swh_ke_oak/me.m03.d25:meMA.Ode6C223.text
ltx/swh_redirects_oak/me.m03.d25:meMA.Ode6C224.text	@ltx/swh_ke_oak/me.m03.d25:meMA.Ode6C224.text
ltx/swh_redirects_oak/me.m03.d25:meMA.Ode6C225.text	@ltx/swh_ke_oak/me.m03.d25:meMA.Ode6C225.text
ltx/swh_redirects_oak/me.m03.d25:meMA.Ode6C23.incipit	@ltx/swh_ke_oak/me.m03.d25:meMA.Ode6C23.incipit
ltx/swh_redirects_oak/me.m03.d25:meMA.Ode6C23.melody	@ltx/swh_ke_oak/me.m03.d25:meMA.Ode6C23.melody
ltx/swh_redirects_oak/me.m03.d25:meMA.Ode6C23.mode	@ltx/swh_ke_oak/me.m03.d25:meMA.Ode6C23.mode
ltx/swh_redirects_oak/me.m03.d25:meMA.Ode6C23.ode	@ltx/swh_ke_oak/me.m03.d25:meMA.Ode6C23.ode
ltx/swh_redirects_oak/me.m03.d25:meMA.Ode6C23.text	@ltx/swh_ke_oak/me.m03.d25:meMA.Ode6C23.text
ltx/swh_redirects_oak/me.m03.d25:meMA.Ode6C231.text	@ltx/swh_ke_oak/me.m03.d25:meMA.Ode6C231.text
ltx/swh_redirects_oak/me.m03.d25:meMA.Ode6C232.text	@ltx/swh_ke_oak/me.m03.d25:meMA.Ode6C232.text
ltx/swh_redirects_oak/me.m03.d25:meMA.Ode6C233.text	@ltx/swh_ke_oak/me.m03.d25:meMA.Ode6C233.text
ltx/swh_redirects_oak/me.m03.d25:meMA.Ode6C234.text	@ltx/swh_ke_oak/me.m03.d25:meMA.Ode6C234.text
ltx/swh_redirects_oak/me.m03.d25:meMA.Ode6C235.text	@ltx/swh_ke_oak/me.m03.d25:meMA.Ode6C235.text
ltx/swh_redirects_oak/me.m03.d25:meMA.Ode6C24.incipit	@ltx/swh_ke_oak/me.m03.d25:meMA.Ode6C24.incipit
ltx/swh_redirects_oak/me.m03.d25:meMA.Ode6C24.melody	@ltx/swh_ke_oak/me.m03.d25:meMA.Ode6C24.melody
ltx/swh_redirects_oak/me.m03.d25:meMA.Ode6C24.mode	@ltx/swh_ke_oak/me.m03.d25:meMA.Ode6C24.mode
ltx/swh_redirects_oak/me.m03.d25:meMA.Ode6C24.ode	@ltx/swh_ke_oak/me.m03.d25:meMA.Ode6C24.ode
ltx/swh_redirects_oak/me.m03.d25:meMA.Ode6C24.text	@ltx/swh_ke_oak/me.m03.d25:meMA.Ode6C24.text
ltx/swh_redirects_oak/me.m03.d25:meMA.Ode6C241.text	@ltx/swh_ke_oak/me.m03.d25:meMA.Ode6C241.text
ltx/swh_redirects_oak/me.m03.d25:meMA.Ode6C242.text	@ltx/swh_ke_oak/me.m03.d25:meMA.Ode6C242.text
ltx/swh_redirects_oak/me.m03.d25:meMA.Ode6C243.text	@ltx/swh_ke_oak/me.m03.d25:meMA.Ode6C243.text
ltx/swh_redirects_oak/me.m03.d25:meMA.Ode6C244.text	@ltx/swh_ke_oak/me.m03.d25:meMA.Ode6C244.text
ltx/swh_redirects_oak/me.m03.d25:meMA.Ode6C245.text	@ltx/swh_ke_oak/me.m03.d25:meMA.Ode6C245.text
ltx/swh_redirects_oak/me.m03.d25:meMA.Ode6C25.incipit	@ltx/swh_ke_oak/me.m03.d25:meMA.Ode6C25.incipit
ltx/swh_redirects_oak/me.m03.d25:meMA.Ode6C25.melody	@ltx/swh_ke_oak/me.m03.d25:meMA.Ode6C25.melody
ltx/swh_redirects_oak/me.m03.d25:meMA.Ode6C25.mode	@ltx/swh_ke_oak/me.m03.d25:meMA.Ode6C25.mode
ltx/swh_redirects_oak/me.m03.d25:meMA.Ode6C25.ode	@ltx/swh_ke_oak/me.m03.d25:meMA.Ode6C25.ode
ltx/swh_redirects_oak/me.m03.d25:meMA.Ode6C25.text	@ltx/swh_ke_oak/me.m03.d25:meMA.Ode6C25.text
ltx/swh_redirects_oak/me.m03.d25:meMA.Ode6C251.text	@ltx/swh_ke_oak/me.m03.d25:meMA.Ode6C251.text
ltx/swh_redirects_oak/me.m03.d25:meMA.Ode6C252.text	@ltx/swh_ke_oak/me.m03.d25:meMA.Ode6C252.text
ltx/swh_redirects_oak/me.m03.d25:meMA.Ode6C253.text	@ltx/swh_ke_oak/me.m03.d25:meMA.Ode6C253.text
ltx/swh_redirects_oak/me.m03.d25:meMA.Ode6C254.text	@ltx/swh_ke_oak/me.m03.d25:meMA.Ode6C254.text
ltx/swh_redirects_oak/me.m03.d25:meMA.Ode6C255.text	@ltx/swh_ke_oak/me.m03.d25:meMA.Ode6C255.text
ltx/swh_redirects_oak/me.m03.d25:meMA.Ode6C26.incipit	@ltx/swh_ke_oak/me.m03.d25:meMA.Ode6C26.incipit
ltx/swh_redirects_oak/me.m03.d25:meMA.Ode6C26.melody	@ltx/swh_ke_oak/me.m03.d25:meMA.Ode6C26.melody
ltx/swh_redirects_oak/me.m03.d25:meMA.Ode6C26.mode	@ltx/swh_ke_oak/me.m03.d25:meMA.Ode6C26.mode
ltx/swh_redirects_oak/me.m03.d25:meMA.Ode6C26.ode	@ltx/swh_ke_oak/me.m03.d25:meMA.Ode6C26.ode
ltx/swh_redirects_oak/me.m03.d25:meMA.Ode6C26.text	@ltx/swh_ke_oak/me.m03.d25:meMA.Ode6C26.text
ltx/swh_redirects_oak/me.m03.d25:meMA.Ode6C261.text	@ltx/swh_ke_oak/me.m03.d25:meMA.Ode6C261.text
ltx/swh_redirects_oak/me.m03.d25:meMA.Ode6C262.text	@ltx/swh_ke_oak/me.m03.d25:meMA.Ode6C262.text
ltx/swh_redirects_oak/me.m03.d25:meMA.Ode6C263.text	@ltx/swh_ke_oak/me.m03.d25:meMA.Ode6C263.text
ltx/swh_redirects_oak/me.m03.d25:meMA.Ode6C264.text	@ltx/swh_ke_oak/me.m03.d25:meMA.Ode6C264.text
ltx/swh_redirects_oak/me.m03.d25:meMA.Ode6C265.text	@ltx/swh_ke_oak/me.m03.d25:meMA.Ode6C265.text
ltx/swh_redirects_oak/me.m03.d25:meMA.Ode7C11.greekmelody	@ltx/swh_ke_oak/me.m03.d25:meMA.Ode7C11.greekmelody
ltx/swh_redirects_oak/me.m03.d25:meMA.Ode7C11.incipit	@ltx/swh_ke_oak/me.m03.d25:meMA.Ode7C11.incipit
ltx/swh_redirects_oak/me.m03.d25:meMA.Ode7C11.melody	@ltx/swh_ke_oak/me.m03.d25:meMA.Ode7C11.melody
ltx/swh_redirects_oak/me.m03.d25:meMA.Ode7C11.mode	@ltx/swh_ke_oak/me.m03.d25:meMA.Ode7C11.mode
ltx/swh_redirects_oak/me.m03.d25:meMA.Ode7C11.ode	@ltx/swh_ke_oak/me.m03.d25:meMA.Ode7C11.ode
ltx/swh_redirects_oak/me.m03.d25:meMA.Ode7C11.text	@ltx/swh_ke_oak/me.m03.d25:meMA.Ode7C11.text
ltx/swh_redirects_oak/me.m03.d25:meMA.Ode7C12.incipit	@ltx/swh_ke_oak/me.m03.d25:meMA.Ode7C12.incipit
ltx/swh_redirects_oak/me.m03.d25:meMA.Ode7C12.melody	@ltx/swh_ke_oak/me.m03.d25:meMA.Ode7C12.melody
ltx/swh_redirects_oak/me.m03.d25:meMA.Ode7C12.mode	@ltx/swh_ke_oak/me.m03.d25:meMA.Ode7C12.mode
ltx/swh_redirects_oak/me.m03.d25:meMA.Ode7C12.ode	@ltx/swh_ke_oak/me.m03.d25:meMA.Ode7C12.ode
ltx/swh_redirects_oak/me.m03.d25:meMA.Ode7C12.text	@ltx/swh_ke_oak/me.m03.d25:meMA.Ode7C12.text
ltx/swh_redirects_oak/me.m03.d25:meMA.Ode7C13.incipit	@ltx/swh_ke_oak/me.m03.d25:meMA.Ode7C13.incipit
ltx/swh_redirects_oak/me.m03.d25:meMA.Ode7C13.melody	@ltx/swh_ke_oak/me.m03.d25:meMA.Ode7C13.melody
ltx/swh_redirects_oak/me.m03.d25:meMA.Ode7C13.mode	@ltx/swh_ke_oak/me.m03.d25:meMA.Ode7C13.mode
ltx/swh_redirects_oak/me.m03.d25:meMA.Ode7C13.ode	@ltx/swh_ke_oak/me.m03.d25:meMA.Ode7C13.ode
ltx/swh_redirects_oak/me.m03.d25:meMA.Ode7C13.text	@ltx/swh_ke_oak/me.m03.d25:meMA.Ode7C13.text
ltx/swh_redirects_oak/me.m03.d25:meMA.Ode7C14.incipit	@ltx/swh_ke_oak/me.m03.d25:meMA.Ode7C14.incipit
ltx/swh_redirects_oak/me.m03.d25:meMA.Ode7C14.melody	@ltx/swh_ke_oak/me.m03.d25:meMA.Ode7C14.melody
ltx/swh_redirects_oak/me.m03.d25:meMA.Ode7C14.mode	@ltx/swh_ke_oak/me.m03.d25:meMA.Ode7C14.mode
ltx/swh_redirects_oak/me.m03.d25:meMA.Ode7C14.ode	@ltx/swh_ke_oak/me.m03.d25:meMA.Ode7C14.ode
ltx/swh_redirects_oak/me.m03.d25:meMA.Ode7C14.text	@ltx/swh_ke_oak/me.m03.d25:meMA.Ode7C14.text
ltx/swh_redirects_oak/me.m03.d25:meMA.Ode7C1H.greekmelody	@ltx/swh_ke_oak/me.m03.d25:meMA.Ode7C1H.greekmelody
ltx/swh_redirects_oak/me.m03.d25:meMA.Ode7C1H.incipit	@ltx/swh_ke_oak/me.m03.d25:meMA.Ode7C1H.incipit
ltx/swh_redirects_oak/me.m03.d25:meMA.Ode7C1H.melody	@ltx/swh_ke_oak/me.m03.d25:meMA.Ode7C1H.melody
ltx/swh_redirects_oak/me.m03.d25:meMA.Ode7C1H.mode	@ltx/swh_ke_oak/me.m03.d25:meMA.Ode7C1H.mode
ltx/swh_redirects_oak/me.m03.d25:meMA.Ode7C1H.ode	@ltx/swh_ke_oak/me.m03.d25:meMA.Ode7C1H.ode
ltx/swh_redirects_oak/me.m03.d25:meMA.Ode7C1H.text	@ltx/swh_ke_oak/me.m03.d25:meMA.Ode7C1H.text
ltx/swh_redirects_oak/me.m03.d25:meMA.Ode7C21.greekmelody	@ltx/swh_ke_oak/me.m03.d25:meMA.Ode7C21.greekmelody
ltx/swh_redirects_oak/me.m03.d25:meMA.Ode7C21.incipit	@ltx/swh_ke_oak/me.m03.d25:meMA.Ode7C21.incipit
ltx/swh_redirects_oak/me.m03.d25:meMA.Ode7C21.melody	@ltx/swh_ke_oak/me.m03.d25:meMA.Ode7C21.melody
ltx/swh_redirects_oak/me.m03.d25:meMA.Ode7C21.mode	@ltx/swh_ke_oak/me.m03.d25:meMA.Ode7C21.mode
ltx/swh_redirects_oak/me.m03.d25:meMA.Ode7C21.ode	@ltx/swh_ke_oak/me.m03.d25:meMA.Ode7C21.ode
ltx/swh_redirects_oak/me.m03.d25:meMA.Ode7C21.text	@ltx/swh_ke_oak/me.m03.d25:meMA.Ode7C21.text
ltx/swh_redirects_oak/me.m03.d25:meMA.Ode7C211.text	@ltx/swh_ke_oak/me.m03.d25:meMA.Ode7C211.text
ltx/swh_redirects_oak/me.m03.d25:meMA.Ode7C212.text	@ltx/swh_ke_oak/me.m03.d25:meMA.Ode7C212.text
ltx/swh_redirects_oak/me.m03.d25:meMA.Ode7C213.text	@ltx/swh_ke_oak/me.m03.d25:meMA.Ode7C213.text
ltx/swh_redirects_oak/me.m03.d25:meMA.Ode7C214.text	@ltx/swh_ke_oak/me.m03.d25:meMA.Ode7C214.text
ltx/swh_redirects_oak/me.m03.d25:meMA.Ode7C215.text	@ltx/swh_ke_oak/me.m03.d25:meMA.Ode7C215.text
ltx/swh_redirects_oak/me.m03.d25:meMA.Ode7C22.incipit	@ltx/swh_ke_oak/me.m03.d25:meMA.Ode7C22.incipit
ltx/swh_redirects_oak/me.m03.d25:meMA.Ode7C22.melody	@ltx/swh_ke_oak/me.m03.d25:meMA.Ode7C22.melody
ltx/swh_redirects_oak/me.m03.d25:meMA.Ode7C22.mode	@ltx/swh_ke_oak/me.m03.d25:meMA.Ode7C22.mode
ltx/swh_redirects_oak/me.m03.d25:meMA.Ode7C22.ode	@ltx/swh_ke_oak/me.m03.d25:meMA.Ode7C22.ode
ltx/swh_redirects_oak/me.m03.d25:meMA.Ode7C22.text	@ltx/swh_ke_oak/me.m03.d25:meMA.Ode7C22.text
ltx/swh_redirects_oak/me.m03.d25:meMA.Ode7C221.text	@ltx/swh_ke_oak/me.m03.d25:meMA.Ode7C221.text
ltx/swh_redirects_oak/me.m03.d25:meMA.Ode7C222.text	@ltx/swh_ke_oak/me.m03.d25:meMA.Ode7C222.text
ltx/swh_redirects_oak/me.m03.d25:meMA.Ode7C223.text	@ltx/swh_ke_oak/me.m03.d25:meMA.Ode7C223.text
ltx/swh_redirects_oak/me.m03.d25:meMA.Ode7C224.text	@ltx/swh_ke_oak/me.m03.d25:meMA.Ode7C224.text
ltx/swh_redirects_oak/me.m03.d25:meMA.Ode7C225.text	@ltx/swh_ke_oak/me.m03.d25:meMA.Ode7C225.text
ltx/swh_redirects_oak/me.m03.d25:meMA.Ode7C23.incipit	@ltx/swh_ke_oak/me.m03.d25:meMA.Ode7C23.incipit
ltx/swh_redirects_oak/me.m03.d25:meMA.Ode7C23.melody	@ltx/swh_ke_oak/me.m03.d25:meMA.Ode7C23.melody
ltx/swh_redirects_oak/me.m03.d25:meMA.Ode7C23.mode	@ltx/swh_ke_oak/me.m03.d25:meMA.Ode7C23.mode
ltx/swh_redirects_oak/me.m03.d25:meMA.Ode7C23.ode	@ltx/swh_ke_oak/me.m03.d25:meMA.Ode7C23.ode
ltx/swh_redirects_oak/me.m03.d25:meMA.Ode7C23.text	@ltx/swh_ke_oak/me.m03.d25:meMA.Ode7C23.text
ltx/swh_redirects_oak/me.m03.d25:meMA.Ode7C231.text	@ltx/swh_ke_oak/me.m03.d25:meMA.Ode7C231.text
ltx/swh_redirects_oak/me.m03.d25:meMA.Ode7C232.text	@ltx/swh_ke_oak/me.m03.d25:meMA.Ode7C232.text
ltx/swh_redirects_oak/me.m03.d25:meMA.Ode7C233.text	@ltx/swh_ke_oak/me.m03.d25:meMA.Ode7C233.text
ltx/swh_redirects_oak/me.m03.d25:meMA.Ode7C234.text	@ltx/swh_ke_oak/me.m03.d25:meMA.Ode7C234.text
ltx/swh_redirects_oak/me.m03.d25:meMA.Ode7C235.text	@ltx/swh_ke_oak/me.m03.d25:meMA.Ode7C235.text
ltx/swh_redirects_oak/me.m03.d25:meMA.Ode7C24.incipit	@ltx/swh_ke_oak/me.m03.d25:meMA.Ode7C24.incipit
ltx/swh_redirects_oak/me.m03.d25:meMA.Ode7C24.melody	@ltx/swh_ke_oak/me.m03.d25:meMA.Ode7C24.melody
ltx/swh_redirects_oak/me.m03.d25:meMA.Ode7C24.mode	@ltx/swh_ke_oak/me.m03.d25:meMA.Ode7C24.mode
ltx/swh_redirects_oak/me.m03.d25:meMA.Ode7C24.ode	@ltx/swh_ke_oak/me.m03.d25:meMA.Ode7C24.ode
ltx/swh_redirects_oak/me.m03.d25:meMA.Ode7C24.text	@ltx/swh_ke_oak/me.m03.d25:meMA.Ode7C24.text
ltx/swh_redirects_oak/me.m03.d25:meMA.Ode7C241.text	@ltx/swh_ke_oak/me.m03.d25:meMA.Ode7C241.text
ltx/swh_redirects_oak/me.m03.d25:meMA.Ode7C242.text	@ltx/swh_ke_oak/me.m03.d25:meMA.Ode7C242.text
ltx/swh_redirects_oak/me.m03.d25:meMA.Ode7C243.text	@ltx/swh_ke_oak/me.m03.d25:meMA.Ode7C243.text
ltx/swh_redirects_oak/me.m03.d25:meMA.Ode7C244.text	@ltx/swh_ke_oak/me.m03.d25:meMA.Ode7C244.text
ltx/swh_redirects_oak/me.m03.d25:meMA.Ode7C245.text	@ltx/swh_ke_oak/me.m03.d25:meMA.Ode7C245.text
ltx/swh_redirects_oak/me.m03.d25:meMA.Ode7C25.incipit	@ltx/swh_ke_oak/me.m03.d25:meMA.Ode7C25.incipit
ltx/swh_redirects_oak/me.m03.d25:meMA.Ode7C25.melody	@ltx/swh_ke_oak/me.m03.d25:meMA.Ode7C25.melody
ltx/swh_redirects_oak/me.m03.d25:meMA.Ode7C25.mode	@ltx/swh_ke_oak/me.m03.d25:meMA.Ode7C25.mode
ltx/swh_redirects_oak/me.m03.d25:meMA.Ode7C25.ode	@ltx/swh_ke_oak/me.m03.d25:meMA.Ode7C25.ode
ltx/swh_redirects_oak/me.m03.d25:meMA.Ode7C25.text	@ltx/swh_ke_oak/me.m03.d25:meMA.Ode7C25.text
ltx/swh_redirects_oak/me.m03.d25:meMA.Ode7C251.text	@ltx/swh_ke_oak/me.m03.d25:meMA.Ode7C251.text
ltx/swh_redirects_oak/me.m03.d25:meMA.Ode7C252.text	@ltx/swh_ke_oak/me.m03.d25:meMA.Ode7C252.text
ltx/swh_redirects_oak/me.m03.d25:meMA.Ode7C253.text	@ltx/swh_ke_oak/me.m03.d25:meMA.Ode7C253.text
ltx/swh_redirects_oak/me.m03.d25:meMA.Ode7C254.text	@ltx/swh_ke_oak/me.m03.d25:meMA.Ode7C254.text
ltx/swh_redirects_oak/me.m03.d25:meMA.Ode7C255.text	@ltx/swh_ke_oak/me.m03.d25:meMA.Ode7C255.text
ltx/swh_redirects_oak/me.m03.d25:meMA.Ode7C26.incipit	@ltx/swh_ke_oak/me.m03.d25:meMA.Ode7C26.incipit
ltx/swh_redirects_oak/me.m03.d25:meMA.Ode7C26.melody	@ltx/swh_ke_oak/me.m03.d25:meMA.Ode7C26.melody
ltx/swh_redirects_oak/me.m03.d25:meMA.Ode7C26.mode	@ltx/swh_ke_oak/me.m03.d25:meMA.Ode7C26.mode
ltx/swh_redirects_oak/me.m03.d25:meMA.Ode7C26.ode	@ltx/swh_ke_oak/me.m03.d25:meMA.Ode7C26.ode
ltx/swh_redirects_oak/me.m03.d25:meMA.Ode7C26.text	@ltx/swh_ke_oak/me.m03.d25:meMA.Ode7C26.text
ltx/swh_redirects_oak/me.m03.d25:meMA.Ode7C261.text	@ltx/swh_ke_oak/me.m03.d25:meMA.Ode7C261.text
ltx/swh_redirects_oak/me.m03.d25:meMA.Ode7C262.text	@ltx/swh_ke_oak/me.m03.d25:meMA.Ode7C262.text
ltx/swh_redirects_oak/me.m03.d25:meMA.Ode7C263.text	@ltx/swh_ke_oak/me.m03.d25:meMA.Ode7C263.text
ltx/swh_redirects_oak/me.m03.d25:meMA.Ode7C264.text	@ltx/swh_ke_oak/me.m03.d25:meMA.Ode7C264.text
ltx/swh_redirects_oak/me.m03.d25:meMA.Ode7C265.text	@ltx/swh_ke_oak/me.m03.d25:meMA.Ode7C265.text
ltx/swh_redirects_oak/me.m03.d25:meMA.Ode8C11.greekmelody	@ltx/swh_ke_oak/me.m03.d25:meMA.Ode8C11.greekmelody
ltx/swh_redirects_oak/me.m03.d25:meMA.Ode8C11.incipit	@ltx/swh_ke_oak/me.m03.d25:meMA.Ode8C11.incipit
ltx/swh_redirects_oak/me.m03.d25:meMA.Ode8C11.melody	@ltx/swh_ke_oak/me.m03.d25:meMA.Ode8C11.melody
ltx/swh_redirects_oak/me.m03.d25:meMA.Ode8C11.mode	@ltx/swh_ke_oak/me.m03.d25:meMA.Ode8C11.mode
ltx/swh_redirects_oak/me.m03.d25:meMA.Ode8C11.ode	@ltx/swh_ke_oak/me.m03.d25:meMA.Ode8C11.ode
ltx/swh_redirects_oak/me.m03.d25:meMA.Ode8C11.text	@ltx/swh_ke_oak/me.m03.d25:meMA.Ode8C11.text
ltx/swh_redirects_oak/me.m03.d25:meMA.Ode8C12.incipit	@ltx/swh_ke_oak/me.m03.d25:meMA.Ode8C12.incipit
ltx/swh_redirects_oak/me.m03.d25:meMA.Ode8C12.melody	@ltx/swh_ke_oak/me.m03.d25:meMA.Ode8C12.melody
ltx/swh_redirects_oak/me.m03.d25:meMA.Ode8C12.mode	@ltx/swh_ke_oak/me.m03.d25:meMA.Ode8C12.mode
ltx/swh_redirects_oak/me.m03.d25:meMA.Ode8C12.ode	@ltx/swh_ke_oak/me.m03.d25:meMA.Ode8C12.ode
ltx/swh_redirects_oak/me.m03.d25:meMA.Ode8C12.text	@ltx/swh_ke_oak/me.m03.d25:meMA.Ode8C12.text
ltx/swh_redirects_oak/me.m03.d25:meMA.Ode8C13.incipit	@ltx/swh_ke_oak/me.m03.d25:meMA.Ode8C13.incipit
ltx/swh_redirects_oak/me.m03.d25:meMA.Ode8C13.melody	@ltx/swh_ke_oak/me.m03.d25:meMA.Ode8C13.melody
ltx/swh_redirects_oak/me.m03.d25:meMA.Ode8C13.mode	@ltx/swh_ke_oak/me.m03.d25:meMA.Ode8C13.mode
ltx/swh_redirects_oak/me.m03.d25:meMA.Ode8C13.ode	@ltx/swh_ke_oak/me.m03.d25:meMA.Ode8C13.ode
ltx/swh_redirects_oak/me.m03.d25:meMA.Ode8C13.text	@ltx/swh_ke_oak/me.m03.d25:meMA.Ode8C13.text
ltx/swh_redirects_oak/me.m03.d25:meMA.Ode8C14.incipit	@ltx/swh_ke_oak/me.m03.d25:meMA.Ode8C14.incipit
ltx/swh_redirects_oak/me.m03.d25:meMA.Ode8C14.melody	@ltx/swh_ke_oak/me.m03.d25:meMA.Ode8C14.melody
ltx/swh_redirects_oak/me.m03.d25:meMA.Ode8C14.mode	@ltx/swh_ke_oak/me.m03.d25:meMA.Ode8C14.mode
ltx/swh_redirects_oak/me.m03.d25:meMA.Ode8C14.ode	@ltx/swh_ke_oak/me.m03.d25:meMA.Ode8C14.ode
ltx/swh_redirects_oak/me.m03.d25:meMA.Ode8C14.text	@ltx/swh_ke_oak/me.m03.d25:meMA.Ode8C14.text
ltx/swh_redirects_oak/me.m03.d25:meMA.Ode8C15.incipit	@ltx/swh_ke_oak/me.m03.d25:meMA.Ode8C15.incipit
ltx/swh_redirects_oak/me.m03.d25:meMA.Ode8C15.melody	@ltx/swh_ke_oak/me.m03.d25:meMA.Ode8C15.melody
ltx/swh_redirects_oak/me.m03.d25:meMA.Ode8C15.mode	@ltx/swh_ke_oak/me.m03.d25:meMA.Ode8C15.mode
ltx/swh_redirects_oak/me.m03.d25:meMA.Ode8C15.ode	@ltx/swh_ke_oak/me.m03.d25:meMA.Ode8C15.ode
ltx/swh_redirects_oak/me.m03.d25:meMA.Ode8C15.text	@ltx/swh_ke_oak/me.m03.d25:meMA.Ode8C15.text
ltx/swh_redirects_oak/me.m03.d25:meMA.Ode8C1H.greekmelody	@ltx/swh_ke_oak/me.m03.d25:meMA.Ode8C1H.greekmelody
ltx/swh_redirects_oak/me.m03.d25:meMA.Ode8C1H.incipit	@ltx/swh_ke_oak/me.m03.d25:meMA.Ode8C1H.incipit
ltx/swh_redirects_oak/me.m03.d25:meMA.Ode8C1H.melody	@ltx/swh_ke_oak/me.m03.d25:meMA.Ode8C1H.melody
ltx/swh_redirects_oak/me.m03.d25:meMA.Ode8C1H.mode	@ltx/swh_ke_oak/me.m03.d25:meMA.Ode8C1H.mode
ltx/swh_redirects_oak/me.m03.d25:meMA.Ode8C1H.ode	@ltx/swh_ke_oak/me.m03.d25:meMA.Ode8C1H.ode
ltx/swh_redirects_oak/me.m03.d25:meMA.Ode8C1H.text	@ltx/swh_ke_oak/me.m03.d25:meMA.Ode8C1H.text
ltx/swh_redirects_oak/me.m03.d25:meMA.Ode8C21.greekmelody	@ltx/swh_ke_oak/me.m03.d25:meMA.Ode8C21.greekmelody
ltx/swh_redirects_oak/me.m03.d25:meMA.Ode8C21.incipit	@ltx/swh_ke_oak/me.m03.d25:meMA.Ode8C21.incipit
ltx/swh_redirects_oak/me.m03.d25:meMA.Ode8C21.melody	@ltx/swh_ke_oak/me.m03.d25:meMA.Ode8C21.melody
ltx/swh_redirects_oak/me.m03.d25:meMA.Ode8C21.mode	@ltx/swh_ke_oak/me.m03.d25:meMA.Ode8C21.mode
ltx/swh_redirects_oak/me.m03.d25:meMA.Ode8C21.ode	@ltx/swh_ke_oak/me.m03.d25:meMA.Ode8C21.ode
ltx/swh_redirects_oak/me.m03.d25:meMA.Ode8C21.text	@ltx/swh_ke_oak/me.m03.d25:meMA.Ode8C21.text
ltx/swh_redirects_oak/me.m03.d25:meMA.Ode8C211.text	@ltx/swh_ke_oak/me.m03.d25:meMA.Ode8C211.text
ltx/swh_redirects_oak/me.m03.d25:meMA.Ode8C212.text	@ltx/swh_ke_oak/me.m03.d25:meMA.Ode8C212.text
ltx/swh_redirects_oak/me.m03.d25:meMA.Ode8C213.text	@ltx/swh_ke_oak/me.m03.d25:meMA.Ode8C213.text
ltx/swh_redirects_oak/me.m03.d25:meMA.Ode8C214.text	@ltx/swh_ke_oak/me.m03.d25:meMA.Ode8C214.text
ltx/swh_redirects_oak/me.m03.d25:meMA.Ode8C215.text	@ltx/swh_ke_oak/me.m03.d25:meMA.Ode8C215.text
ltx/swh_redirects_oak/me.m03.d25:meMA.Ode8C22.incipit	@ltx/swh_ke_oak/me.m03.d25:meMA.Ode8C22.incipit
ltx/swh_redirects_oak/me.m03.d25:meMA.Ode8C22.melody	@ltx/swh_ke_oak/me.m03.d25:meMA.Ode8C22.melody
ltx/swh_redirects_oak/me.m03.d25:meMA.Ode8C22.mode	@ltx/swh_ke_oak/me.m03.d25:meMA.Ode8C22.mode
ltx/swh_redirects_oak/me.m03.d25:meMA.Ode8C22.ode	@ltx/swh_ke_oak/me.m03.d25:meMA.Ode8C22.ode
ltx/swh_redirects_oak/me.m03.d25:meMA.Ode8C22.text	@ltx/swh_ke_oak/me.m03.d25:meMA.Ode8C22.text
ltx/swh_redirects_oak/me.m03.d25:meMA.Ode8C221.text	@ltx/swh_ke_oak/me.m03.d25:meMA.Ode8C221.text
ltx/swh_redirects_oak/me.m03.d25:meMA.Ode8C222.text	@ltx/swh_ke_oak/me.m03.d25:meMA.Ode8C222.text
ltx/swh_redirects_oak/me.m03.d25:meMA.Ode8C223.text	@ltx/swh_ke_oak/me.m03.d25:meMA.Ode8C223.text
ltx/swh_redirects_oak/me.m03.d25:meMA.Ode8C224.text	@ltx/swh_ke_oak/me.m03.d25:meMA.Ode8C224.text
ltx/swh_redirects_oak/me.m03.d25:meMA.Ode8C225.text	@ltx/swh_ke_oak/me.m03.d25:meMA.Ode8C225.text
ltx/swh_redirects_oak/me.m03.d25:meMA.Ode8C23.incipit	@ltx/swh_ke_oak/me.m03.d25:meMA.Ode8C23.incipit
ltx/swh_redirects_oak/me.m03.d25:meMA.Ode8C23.melody	@ltx/swh_ke_oak/me.m03.d25:meMA.Ode8C23.melody
ltx/swh_redirects_oak/me.m03.d25:meMA.Ode8C23.mode	@ltx/swh_ke_oak/me.m03.d25:meMA.Ode8C23.mode
ltx/swh_redirects_oak/me.m03.d25:meMA.Ode8C23.ode	@ltx/swh_ke_oak/me.m03.d25:meMA.Ode8C23.ode
ltx/swh_redirects_oak/me.m03.d25:meMA.Ode8C23.text	@ltx/swh_ke_oak/me.m03.d25:meMA.Ode8C23.text
ltx/swh_redirects_oak/me.m03.d25:meMA.Ode8C231.text	@ltx/swh_ke_oak/me.m03.d25:meMA.Ode8C231.text
ltx/swh_redirects_oak/me.m03.d25:meMA.Ode8C232.text	@ltx/swh_ke_oak/me.m03.d25:meMA.Ode8C232.text
ltx/swh_redirects_oak/me.m03.d25:meMA.Ode8C233.text	@ltx/swh_ke_oak/me.m03.d25:meMA.Ode8C233.text
ltx/swh_redirects_oak/me.m03.d25:meMA.Ode8C234.text	@ltx/swh_ke_oak/me.m03.d25:meMA.Ode8C234.text
ltx/swh_redirects_oak/me.m03.d25:meMA.Ode8C235.text	@ltx/swh_ke_oak/me.m03.d25:meMA.Ode8C235.text
ltx/swh_redirects_oak/me.m03.d25:meMA.Ode8C24.incipit	@ltx/swh_ke_oak/me.m03.d25:meMA.Ode8C24.incipit
ltx/swh_redirects_oak/me.m03.d25:meMA.Ode8C24.melody	@ltx/swh_ke_oak/me.m03.d25:meMA.Ode8C24.melody
ltx/swh_redirects_oak/me.m03.d25:meMA.Ode8C24.mode	@ltx/swh_ke_oak/me.m03.d25:meMA.Ode8C24.mode
ltx/swh_redirects_oak/me.m03.d25:meMA.Ode8C24.ode	@ltx/swh_ke_oak/me.m03.d25:meMA.Ode8C24.ode
ltx/swh_redirects_oak/me.m03.d25:meMA.Ode8C24.text	@ltx/swh_ke_oak/me.m03.d25:meMA.Ode8C24.text
ltx/swh_redirects_oak/me.m03.d25:meMA.Ode8C241.text	@ltx/swh_ke_oak/me.m03.d25:meMA.Ode8C241.text
ltx/swh_redirects_oak/me.m03.d25:meMA.Ode8C242.text	@ltx/swh_ke_oak/me.m03.d25:meMA.Ode8C242.text
ltx/swh_redirects_oak/me.m03.d25:meMA.Ode8C243.text	@ltx/swh_ke_oak/me.m03.d25:meMA.Ode8C243.text
ltx/swh_redirects_oak/me.m03.d25:meMA.Ode8C244.text	@ltx/swh_ke_oak/me.m03.d25:meMA.Ode8C244.text
ltx/swh_redirects_oak/me.m03.d25:meMA.Ode8C245.text	@ltx/swh_ke_oak/me.m03.d25:meMA.Ode8C245.text
ltx/swh_redirects_oak/me.m03.d25:meMA.Ode8C25.incipit	@ltx/swh_ke_oak/me.m03.d25:meMA.Ode8C25.incipit
ltx/swh_redirects_oak/me.m03.d25:meMA.Ode8C25.melody	@ltx/swh_ke_oak/me.m03.d25:meMA.Ode8C25.melody
ltx/swh_redirects_oak/me.m03.d25:meMA.Ode8C25.mode	@ltx/swh_ke_oak/me.m03.d25:meMA.Ode8C25.mode
ltx/swh_redirects_oak/me.m03.d25:meMA.Ode8C25.ode	@ltx/swh_ke_oak/me.m03.d25:meMA.Ode8C25.ode
ltx/swh_redirects_oak/me.m03.d25:meMA.Ode8C25.text	@ltx/swh_ke_oak/me.m03.d25:meMA.Ode8C25.text
ltx/swh_redirects_oak/me.m03.d25:meMA.Ode8C251.text	@ltx/swh_ke_oak/me.m03.d25:meMA.Ode8C251.text
ltx/swh_redirects_oak/me.m03.d25:meMA.Ode8C252.text	@ltx/swh_ke_oak/me.m03.d25:meMA.Ode8C252.text
ltx/swh_redirects_oak/me.m03.d25:meMA.Ode8C253.text	@ltx/swh_ke_oak/me.m03.d25:meMA.Ode8C253.text
ltx/swh_redirects_oak/me.m03.d25:meMA.Ode8C254.text	@ltx/swh_ke_oak/me.m03.d25:meMA.Ode8C254.text
ltx/swh_redirects_oak/me.m03.d25:meMA.Ode8C255.text	@ltx/swh_ke_oak/me.m03.d25:meMA.Ode8C255.text
ltx/swh_redirects_oak/me.m03.d25:meMA.Ode8C26.incipit	@ltx/swh_ke_oak/me.m03.d25:meMA.Ode8C26.incipit
ltx/swh_redirects_oak/me.m03.d25:meMA.Ode8C26.melody	@ltx/swh_ke_oak/me.m03.d25:meMA.Ode8C26.melody
ltx/swh_redirects_oak/me.m03.d25:meMA.Ode8C26.mode	@ltx/swh_ke_oak/me.m03.d25:meMA.Ode8C26.mode
ltx/swh_redirects_oak/me.m03.d25:meMA.Ode8C26.ode	@ltx/swh_ke_oak/me.m03.d25:meMA.Ode8C26.ode
ltx/swh_redirects_oak/me.m03.d25:meMA.Ode8C26.text	@ltx/swh_ke_oak/me.m03.d25:meMA.Ode8C26.text
ltx/swh_redirects_oak/me.m03.d25:meMA.Ode8C261.text	@ltx/swh_ke_oak/me.m03.d25:meMA.Ode8C261.text
ltx/swh_redirects_oak/me.m03.d25:meMA.Ode8C262.text	@ltx/swh_ke_oak/me.m03.d25:meMA.Ode8C262.text
ltx/swh_redirects_oak/me.m03.d25:meMA.Ode8C263.text	@ltx/swh_ke_oak/me.m03.d25:meMA.Ode8C263.text
ltx/swh_redirects_oak/me.m03.d25:meMA.Ode8C264.text	@ltx/swh_ke_oak/me.m03.d25:meMA.Ode8C264.text
ltx/swh_redirects_oak/me.m03.d25:meMA.Ode8C265.text	@ltx/swh_ke_oak/me.m03.d25:meMA.Ode8C265.text
ltx/swh_redirects_oak/me.m03.d25:meMA.Ode9C11.greekmelody	@ltx/swh_ke_oak/me.m03.d25:meMA.Ode9C11.greekmelody
ltx/swh_redirects_oak/me.m03.d25:meMA.Ode9C11.incipit	@ltx/swh_ke_oak/me.m03.d25:meMA.Ode9C11.incipit
ltx/swh_redirects_oak/me.m03.d25:meMA.Ode9C11.melody	@ltx/swh_ke_oak/me.m03.d25:meMA.Ode9C11.melody
ltx/swh_redirects_oak/me.m03.d25:meMA.Ode9C11.mode	@ltx/swh_ke_oak/me.m03.d25:meMA.Ode9C11.mode
ltx/swh_redirects_oak/me.m03.d25:meMA.Ode9C11.ode	@ltx/swh_ke_oak/me.m03.d25:meMA.Ode9C11.ode
ltx/swh_redirects_oak/me.m03.d25:meMA.Ode9C11.text	@ltx/swh_ke_oak/me.m03.d25:meMA.Ode9C11.text
ltx/swh_redirects_oak/me.m03.d25:meMA.Ode9C12.incipit	@ltx/swh_ke_oak/me.m03.d25:meMA.Ode9C12.incipit
ltx/swh_redirects_oak/me.m03.d25:meMA.Ode9C12.melody	@ltx/swh_ke_oak/me.m03.d25:meMA.Ode9C12.melody
ltx/swh_redirects_oak/me.m03.d25:meMA.Ode9C12.mode	@ltx/swh_ke_oak/me.m03.d25:meMA.Ode9C12.mode
ltx/swh_redirects_oak/me.m03.d25:meMA.Ode9C12.ode	@ltx/swh_ke_oak/me.m03.d25:meMA.Ode9C12.ode
ltx/swh_redirects_oak/me.m03.d25:meMA.Ode9C12.text	@ltx/swh_ke_oak/me.m03.d25:meMA.Ode9C12.text
ltx/swh_redirects_oak/me.m03.d25:meMA.Ode9C13.incipit	@ltx/swh_ke_oak/me.m03.d25:meMA.Ode9C13.incipit
ltx/swh_redirects_oak/me.m03.d25:meMA.Ode9C13.melody	@ltx/swh_ke_oak/me.m03.d25:meMA.Ode9C13.melody
ltx/swh_redirects_oak/me.m03.d25:meMA.Ode9C13.mode	@ltx/swh_ke_oak/me.m03.d25:meMA.Ode9C13.mode
ltx/swh_redirects_oak/me.m03.d25:meMA.Ode9C13.ode	@ltx/swh_ke_oak/me.m03.d25:meMA.Ode9C13.ode
ltx/swh_redirects_oak/me.m03.d25:meMA.Ode9C13.text	@ltx/swh_ke_oak/me.m03.d25:meMA.Ode9C13.text
ltx/swh_redirects_oak/me.m03.d25:meMA.Ode9C14.incipit	@ltx/swh_ke_oak/me.m03.d25:meMA.Ode9C14.incipit
ltx/swh_redirects_oak/me.m03.d25:meMA.Ode9C14.melody	@ltx/swh_ke_oak/me.m03.d25:meMA.Ode9C14.melody
ltx/swh_redirects_oak/me.m03.d25:meMA.Ode9C14.mode	@ltx/swh_ke_oak/me.m03.d25:meMA.Ode9C14.mode
ltx/swh_redirects_oak/me.m03.d25:meMA.Ode9C14.ode	@ltx/swh_ke_oak/me.m03.d25:meMA.Ode9C14.ode
ltx/swh_redirects_oak/me.m03.d25:meMA.Ode9C14.text	@ltx/swh_ke_oak/me.m03.d25:meMA.Ode9C14.text
ltx/swh_redirects_oak/me.m03.d25:meMA.Ode9C15.incipit	@ltx/swh_ke_oak/me.m03.d25:meMA.Ode9C15.incipit
ltx/swh_redirects_oak/me.m03.d25:meMA.Ode9C15.melody	@ltx/swh_ke_oak/me.m03.d25:meMA.Ode9C15.melody
ltx/swh_redirects_oak/me.m03.d25:meMA.Ode9C15.mode	@ltx/swh_ke_oak/me.m03.d25:meMA.Ode9C15.mode
ltx/swh_redirects_oak/me.m03.d25:meMA.Ode9C15.ode	@ltx/swh_ke_oak/me.m03.d25:meMA.Ode9C15.ode
ltx/swh_redirects_oak/me.m03.d25:meMA.Ode9C15.text	@ltx/swh_ke_oak/me.m03.d25:meMA.Ode9C15.text
ltx/swh_redirects_oak/me.m03.d25:meMA.Ode9C1H.greekmelody	@ltx/swh_ke_oak/me.m03.d25:meMA.Ode9C1H.greekmelody
ltx/swh_redirects_oak/me.m03.d25:meMA.Ode9C1H.incipit	@ltx/swh_ke_oak/me.m03.d25:meMA.Ode9C1H.incipit
ltx/swh_redirects_oak/me.m03.d25:meMA.Ode9C1H.melody	@ltx/swh_ke_oak/me.m03.d25:meMA.Ode9C1H.melody
ltx/swh_redirects_oak/me.m03.d25:meMA.Ode9C1H.mode	@ltx/swh_ke_oak/me.m03.d25:meMA.Ode9C1H.mode
ltx/swh_redirects_oak/me.m03.d25:meMA.Ode9C1H.ode	@ltx/swh_ke_oak/me.m03.d25:meMA.Ode9C1H.ode
ltx/swh_redirects_oak/me.m03.d25:meMA.Ode9C1H.text	@ltx/swh_ke_oak/me.m03.d25:meMA.Ode9C1H.text
ltx/swh_redirects_oak/me.m03.d25:meMA.Ode9C1M01.incipit	@ltx/swh_ke_oak/me.m03.d25:meMA.Ode9C1M01.incipit
ltx/swh_redirects_oak/me.m03.d25:meMA.Ode9C1M01.text	@ltx/swh_ke_oak/me.m03.d25:meMA.Ode9C1M01.text
ltx/swh_redirects_oak/me.m03.d25:meMA.Ode9C1M02.incipit	@ltx/swh_ke_oak/me.m03.d25:meMA.Ode9C1M02.incipit
ltx/swh_redirects_oak/me.m03.d25:meMA.Ode9C1M02.text	@ltx/swh_ke_oak/me.m03.d25:meMA.Ode9C1M02.text
ltx/swh_redirects_oak/me.m03.d25:meMA.Ode9C1M03.incipit	@ltx/swh_ke_oak/me.m03.d25:meMA.Ode9C1M03.incipit
ltx/swh_redirects_oak/me.m03.d25:meMA.Ode9C1M03.text	@ltx/swh_ke_oak/me.m03.d25:meMA.Ode9C1M03.text
ltx/swh_redirects_oak/me.m03.d25:meMA.Ode9C21.greekmelody	@ltx/swh_ke_oak/me.m03.d25:meMA.Ode9C21.greekmelody
ltx/swh_redirects_oak/me.m03.d25:meMA.Ode9C21.incipit	@ltx/swh_ke_oak/me.m03.d25:meMA.Ode9C21.incipit
ltx/swh_redirects_oak/me.m03.d25:meMA.Ode9C21.melody	@ltx/swh_ke_oak/me.m03.d25:meMA.Ode9C21.melody
ltx/swh_redirects_oak/me.m03.d25:meMA.Ode9C21.mode	@ltx/swh_ke_oak/me.m03.d25:meMA.Ode9C21.mode
ltx/swh_redirects_oak/me.m03.d25:meMA.Ode9C21.ode	@ltx/swh_ke_oak/me.m03.d25:meMA.Ode9C21.ode
ltx/swh_redirects_oak/me.m03.d25:meMA.Ode9C21.text	@ltx/swh_ke_oak/me.m03.d25:meMA.Ode9C21.text
ltx/swh_redirects_oak/me.m03.d25:meMA.Ode9C211.text	@ltx/swh_ke_oak/me.m03.d25:meMA.Ode9C211.text
ltx/swh_redirects_oak/me.m03.d25:meMA.Ode9C212.text	@ltx/swh_ke_oak/me.m03.d25:meMA.Ode9C212.text
ltx/swh_redirects_oak/me.m03.d25:meMA.Ode9C213.text	@ltx/swh_ke_oak/me.m03.d25:meMA.Ode9C213.text
ltx/swh_redirects_oak/me.m03.d25:meMA.Ode9C214.text	@ltx/swh_ke_oak/me.m03.d25:meMA.Ode9C214.text
ltx/swh_redirects_oak/me.m03.d25:meMA.Ode9C215.text	@ltx/swh_ke_oak/me.m03.d25:meMA.Ode9C215.text
ltx/swh_redirects_oak/me.m03.d25:meMA.Ode9C22.incipit	@ltx/swh_ke_oak/me.m03.d25:meMA.Ode9C22.incipit
ltx/swh_redirects_oak/me.m03.d25:meMA.Ode9C22.melody	@ltx/swh_ke_oak/me.m03.d25:meMA.Ode9C22.melody
ltx/swh_redirects_oak/me.m03.d25:meMA.Ode9C22.mode	@ltx/swh_ke_oak/me.m03.d25:meMA.Ode9C22.mode
ltx/swh_redirects_oak/me.m03.d25:meMA.Ode9C22.ode	@ltx/swh_ke_oak/me.m03.d25:meMA.Ode9C22.ode
ltx/swh_redirects_oak/me.m03.d25:meMA.Ode9C22.text	@ltx/swh_ke_oak/me.m03.d25:meMA.Ode9C22.text
ltx/swh_redirects_oak/me.m03.d25:meMA.Ode9C221.text	@ltx/swh_ke_oak/me.m03.d25:meMA.Ode9C221.text
ltx/swh_redirects_oak/me.m03.d25:meMA.Ode9C222.text	@ltx/swh_ke_oak/me.m03.d25:meMA.Ode9C222.text
ltx/swh_redirects_oak/me.m03.d25:meMA.Ode9C223.text	@ltx/swh_ke_oak/me.m03.d25:meMA.Ode9C223.text
ltx/swh_redirects_oak/me.m03.d25:meMA.Ode9C224.text	@ltx/swh_ke_oak/me.m03.d25:meMA.Ode9C224.text
ltx/swh_redirects_oak/me.m03.d25:meMA.Ode9C225.text	@ltx/swh_ke_oak/me.m03.d25:meMA.Ode9C225.text
ltx/swh_redirects_oak/me.m03.d25:meMA.Ode9C23.incipit	@ltx/swh_ke_oak/me.m03.d25:meMA.Ode9C23.incipit
ltx/swh_redirects_oak/me.m03.d25:meMA.Ode9C23.melody	@ltx/swh_ke_oak/me.m03.d25:meMA.Ode9C23.melody
ltx/swh_redirects_oak/me.m03.d25:meMA.Ode9C23.mode	@ltx/swh_ke_oak/me.m03.d25:meMA.Ode9C23.mode
ltx/swh_redirects_oak/me.m03.d25:meMA.Ode9C23.ode	@ltx/swh_ke_oak/me.m03.d25:meMA.Ode9C23.ode
ltx/swh_redirects_oak/me.m03.d25:meMA.Ode9C23.text	@ltx/swh_ke_oak/me.m03.d25:meMA.Ode9C23.text
ltx/swh_redirects_oak/me.m03.d25:meMA.Ode9C231.text	@ltx/swh_ke_oak/me.m03.d25:meMA.Ode9C231.text
ltx/swh_redirects_oak/me.m03.d25:meMA.Ode9C232.text	@ltx/swh_ke_oak/me.m03.d25:meMA.Ode9C232.text
ltx/swh_redirects_oak/me.m03.d25:meMA.Ode9C233.text	@ltx/swh_ke_oak/me.m03.d25:meMA.Ode9C233.text
ltx/swh_redirects_oak/me.m03.d25:meMA.Ode9C234.text	@ltx/swh_ke_oak/me.m03.d25:meMA.Ode9C234.text
ltx/swh_redirects_oak/me.m03.d25:meMA.Ode9C235.text	@ltx/swh_ke_oak/me.m03.d25:meMA.Ode9C235.text
ltx/swh_redirects_oak/me.m03.d25:meMA.Ode9C24.incipit	@ltx/swh_ke_oak/me.m03.d25:meMA.Ode9C24.incipit
ltx/swh_redirects_oak/me.m03.d25:meMA.Ode9C24.melody	@ltx/swh_ke_oak/me.m03.d25:meMA.Ode9C24.melody
ltx/swh_redirects_oak/me.m03.d25:meMA.Ode9C24.mode	@ltx/swh_ke_oak/me.m03.d25:meMA.Ode9C24.mode
ltx/swh_redirects_oak/me.m03.d25:meMA.Ode9C24.ode	@ltx/swh_ke_oak/me.m03.d25:meMA.Ode9C24.ode
ltx/swh_redirects_oak/me.m03.d25:meMA.Ode9C24.text	@ltx/swh_ke_oak/me.m03.d25:meMA.Ode9C24.text
ltx/swh_redirects_oak/me.m03.d25:meMA.Ode9C241.text	@ltx/swh_ke_oak/me.m03.d25:meMA.Ode9C241.text
ltx/swh_redirects_oak/me.m03.d25:meMA.Ode9C242.text	@ltx/swh_ke_oak/me.m03.d25:meMA.Ode9C242.text
ltx/swh_redirects_oak/me.m03.d25:meMA.Ode9C243.text	@ltx/swh_ke_oak/me.m03.d25:meMA.Ode9C243.text
ltx/swh_redirects_oak/me.m03.d25:meMA.Ode9C244.text	@ltx/swh_ke_oak/me.m03.d25:meMA.Ode9C244.text
ltx/swh_redirects_oak/me.m03.d25:meMA.Ode9C245.text	@ltx/swh_ke_oak/me.m03.d25:meMA.Ode9C245.text
ltx/swh_redirects_oak/me.m03.d25:meMA.Ode9C25.incipit	@ltx/swh_ke_oak/me.m03.d25:meMA.Ode9C25.incipit
ltx/swh_redirects_oak/me.m03.d25:meMA.Ode9C25.melody	@ltx/swh_ke_oak/me.m03.d25:meMA.Ode9C25.melody
ltx/swh_redirects_oak/me.m03.d25:meMA.Ode9C25.mode	@ltx/swh_ke_oak/me.m03.d25:meMA.Ode9C25.mode
ltx/swh_redirects_oak/me.m03.d25:meMA.Ode9C25.ode	@ltx/swh_ke_oak/me.m03.d25:meMA.Ode9C25.ode
ltx/swh_redirects_oak/me.m03.d25:meMA.Ode9C25.text	@ltx/swh_ke_oak/me.m03.d25:meMA.Ode9C25.text
ltx/swh_redirects_oak/me.m03.d25:meMA.Ode9C251.text	@ltx/swh_ke_oak/me.m03.d25:meMA.Ode9C251.text
ltx/swh_redirects_oak/me.m03.d25:meMA.Ode9C252.text	@ltx/swh_ke_oak/me.m03.d25:meMA.Ode9C252.text
ltx/swh_redirects_oak/me.m03.d25:meMA.Ode9C253.text	@ltx/swh_ke_oak/me.m03.d25:meMA.Ode9C253.text
ltx/swh_redirects_oak/me.m03.d25:meMA.Ode9C254.text	@ltx/swh_ke_oak/me.m03.d25:meMA.Ode9C254.text
ltx/swh_redirects_oak/me.m03.d25:meMA.Ode9C255.text	@ltx/swh_ke_oak/me.m03.d25:meMA.Ode9C255.text
ltx/swh_redirects_oak/me.m03.d25:meMA.Ode9C26.incipit	@ltx/swh_ke_oak/me.m03.d25:meMA.Ode9C26.incipit
ltx/swh_redirects_oak/me.m03.d25:meMA.Ode9C26.melody	@ltx/swh_ke_oak/me.m03.d25:meMA.Ode9C26.melody
ltx/swh_redirects_oak/me.m03.d25:meMA.Ode9C26.mode	@ltx/swh_ke_oak/me.m03.d25:meMA.Ode9C26.mode
ltx/swh_redirects_oak/me.m03.d25:meMA.Ode9C26.ode	@ltx/swh_ke_oak/me.m03.d25:meMA.Ode9C26.ode
ltx/swh_redirects_oak/me.m03.d25:meMA.Ode9C26.text	@ltx/swh_ke_oak/me.m03.d25:meMA.Ode9C26.text
ltx/swh_redirects_oak/me.m03.d25:meMA.Ode9C261.text	@ltx/swh_ke_oak/me.m03.d25:meMA.Ode9C261.text
ltx/swh_redirects_oak/me.m03.d25:meMA.Ode9C262.text	@ltx/swh_ke_oak/me.m03.d25:meMA.Ode9C262.text
ltx/swh_redirects_oak/me.m03.d25:meMA.Ode9C263.text	@ltx/swh_ke_oak/me.m03.d25:meMA.Ode9C263.text
ltx/swh_redirects_oak/me.m03.d25:meMA.Ode9C264.text	@ltx/swh_ke_oak/me.m03.d25:meMA.Ode9C264.text
ltx/swh_redirects_oak/me.m03.d25:meMA.Ode9C265.text	@ltx/swh_ke_oak/me.m03.d25:meMA.Ode9C265.text
ltx/swh_redirects_oak/me.m03.d25:meMA.Ode9C2M01.incipit	@ltx/swh_ke_oak/me.m03.d25:meMA.Ode9C2M01.incipit
ltx/swh_redirects_oak/me.m03.d25:meMA.Ode9C2M01.text	@ltx/swh_ke_oak/me.m03.d25:meMA.Ode9C2M01.text
ltx/swh_redirects_oak/me.m03.d25:meMA.Ode9C2M02.incipit	@ltx/swh_ke_oak/me.m03.d25:meMA.Ode9C2M02.incipit
ltx/swh_redirects_oak/me.m03.d25:meMA.Ode9C2M02.text	@ltx/swh_ke_oak/me.m03.d25:meMA.Ode9C2M02.text
ltx/swh_redirects_oak/me.m03.d25:meMA.Ode9C2M03.incipit	@ltx/swh_ke_oak/me.m03.d25:meMA.Ode9C2M03.incipit
ltx/swh_redirects_oak/me.m03.d25:meMA.Ode9C2M03.text	@ltx/swh_ke_oak/me.m03.d25:meMA.Ode9C2M03.text
ltx/swh_redirects_oak/me.m03.d25:meMA.Ode9C2M04.incipit	@ltx/swh_ke_oak/me.m03.d25:meMA.Ode9C2M04.incipit
ltx/swh_redirects_oak/me.m03.d25:meMA.Ode9C2M04.text	@ltx/swh_ke_oak/me.m03.d25:meMA.Ode9C2M04.text
ltx/swh_redirects_oak/me.m03.d25:meMA.Ode9C2MTh.incipit	@ltx/swh_ke_oak/me.m03.d25:meMA.Ode9C2MTh.incipit
ltx/swh_redirects_oak/me.m03.d25:meMA.Ode9C2MTh.text	@ltx/swh_ke_oak/me.m03.d25:meMA.Ode9C2MTh.text
ltx/swh_redirects_oak/me.m03.d25:meMA.Ode9C2MTr.incipit	@ltx/swh_ke_oak/me.m03.d25:meMA.Ode9C2MTr.incipit
ltx/swh_redirects_oak/me.m03.d25:meMA.Ode9C2MTr.text	@ltx/swh_ke_oak/me.m03.d25:meMA.Ode9C2MTr.text
ltx/swh_redirects_oak/me.m03.d25:meMA.Oikos1.text	@ltx/swh_ke_oak/me.m03.d25:meMA.Oikos1.text
ltx/swh_redirects_oak/me.m03.d25:meMA.Oikos12.text	@ltx/swh_ke_oak/me.m03.d25:meMA.Oikos12.text
ltx/swh_redirects_oak/me.m03.d25:meMA.Oikos13.text	@ltx/swh_ke_oak/me.m03.d25:meMA.Oikos13.text
ltx/swh_redirects_oak/me.m03.d25:meMA.Oikos14.text	@ltx/swh_ke_oak/me.m03.d25:meMA.Oikos14.text
ltx/swh_redirects_oak/me.m03.d25:meMA.Oikos15.text	@ltx/swh_ke_oak/me.m03.d25:meMA.Oikos15.text
ltx/swh_redirects_oak/me.m03.d25:meMA.Oikos16.text	@ltx/swh_ke_oak/me.m03.d25:meMA.Oikos16.text
ltx/swh_redirects_oak/me.m03.d25:meMA.Oikos17.text	@ltx/swh_ke_oak/me.m03.d25:meMA.Oikos17.text
ltx/swh_redirects_oak/me.m03.d25:meMA.Oikos18.text	@ltx/swh_ke_oak/me.m03.d25:meMA.Oikos18.text
ltx/swh_redirects_oak/me.m03.d25:meMA.PostGospelBoth.incipit	@ltx/swh_ke_oak/me.m03.d25:meMA.PostGospelBoth.incipit
ltx/swh_redirects_oak/me.m03.d25:meMA.PostGospelBoth.melody	@ltx/swh_ke_oak/me.m03.d25:meMA.PostGospelBoth.melody
ltx/swh_redirects_oak/me.m03.d25:meMA.PostGospelBoth.mode	@ltx/swh_ke_oak/me.m03.d25:meMA.PostGospelBoth.mode
ltx/swh_redirects_oak/me.m03.d25:meMA.PostGospelBoth.text	@ltx/swh_ke_oak/me.m03.d25:meMA.PostGospelBoth.text
ltx/swh_redirects_oak/me.m03.d25:meMA.PostGospelGlory.incipit	@ltx/swh_ke_oak/me.m03.d25:meMA.PostGospelGlory.incipit
ltx/swh_redirects_oak/me.m03.d25:meMA.PostGospelGlory.melody	@ltx/swh_ke_oak/me.m03.d25:meMA.PostGospelGlory.melody
ltx/swh_redirects_oak/me.m03.d25:meMA.PostGospelGlory.mode	@ltx/swh_ke_oak/me.m03.d25:meMA.PostGospelGlory.mode
ltx/swh_redirects_oak/me.m03.d25:meMA.PostGospelGlory.text	@ltx/swh_ke_oak/me.m03.d25:meMA.PostGospelGlory.text
ltx/swh_redirects_oak/me.m03.d25:meMA.PostGospelIdiomelon.incipit	@ltx/swh_ke_oak/me.m03.d25:meMA.PostGospelIdiomelon.incipit
ltx/swh_redirects_oak/me.m03.d25:meMA.PostGospelIdiomelon.melody	@ltx/swh_ke_oak/me.m03.d25:meMA.PostGospelIdiomelon.melody
ltx/swh_redirects_oak/me.m03.d25:meMA.PostGospelIdiomelon.mode	@ltx/swh_ke_oak/me.m03.d25:meMA.PostGospelIdiomelon.mode
ltx/swh_redirects_oak/me.m03.d25:meMA.PostGospelIdiomelon.poet	@ltx/swh_ke_oak/me.m03.d25:meMA.PostGospelIdiomelon.poet
ltx/swh_redirects_oak/me.m03.d25:meMA.PostGospelIdiomelon.text	@ltx/swh_ke_oak/me.m03.d25:meMA.PostGospelIdiomelon.text
ltx/swh_redirects_oak/me.m03.d25:meSV.AposGlory.incipit	@ltx/swh_ke_oak/me.m03.d25:meSV.AposGlory.incipit
ltx/swh_redirects_oak/me.m03.d25:meSV.AposGlory.melody	@ltx/swh_ke_oak/me.m03.d25:meSV.AposGlory.melody
ltx/swh_redirects_oak/me.m03.d25:meSV.AposGlory.mode	@ltx/swh_ke_oak/me.m03.d25:meSV.AposGlory.mode
ltx/swh_redirects_oak/me.m03.d25:meSV.AposGlory.text	@ltx/swh_ke_oak/me.m03.d25:meSV.AposGlory.text
ltx/swh_redirects_oak/me.m03.d25:meSV.Aposticha1.incipit	@ltx/swh_ke_oak/me.m03.d25:meSV.Aposticha1.incipit
ltx/swh_redirects_oak/me.m03.d25:meSV.Aposticha1.melody	@ltx/swh_ke_oak/me.m03.d25:meSV.Aposticha1.melody
ltx/swh_redirects_oak/me.m03.d25:meSV.Aposticha1.mode	@ltx/swh_ke_oak/me.m03.d25:meSV.Aposticha1.mode
ltx/swh_redirects_oak/me.m03.d25:meSV.Aposticha1.text	@ltx/swh_ke_oak/me.m03.d25:meSV.Aposticha1.text
ltx/swh_redirects_oak/me.m03.d25:meSV.Aposticha2.incipit	@ltx/swh_ke_oak/me.m03.d25:meSV.Aposticha2.incipit
ltx/swh_redirects_oak/me.m03.d25:meSV.Aposticha2.melody	@ltx/swh_ke_oak/me.m03.d25:meSV.Aposticha2.melody
ltx/swh_redirects_oak/me.m03.d25:meSV.Aposticha2.mode	@ltx/swh_ke_oak/me.m03.d25:meSV.Aposticha2.mode
ltx/swh_redirects_oak/me.m03.d25:meSV.Aposticha2.text	@ltx/swh_ke_oak/me.m03.d25:meSV.Aposticha2.text
ltx/swh_redirects_oak/me.m03.d25:meSV.Aposticha3.incipit	@ltx/swh_ke_oak/me.m03.d25:meSV.Aposticha3.incipit
ltx/swh_redirects_oak/me.m03.d25:meSV.Aposticha3.melody	@ltx/swh_ke_oak/me.m03.d25:meSV.Aposticha3.melody
ltx/swh_redirects_oak/me.m03.d25:meSV.Aposticha3.mode	@ltx/swh_ke_oak/me.m03.d25:meSV.Aposticha3.mode
ltx/swh_redirects_oak/me.m03.d25:meSV.Aposticha3.text	@ltx/swh_ke_oak/me.m03.d25:meSV.Aposticha3.text
ltx/swh_redirects_oak/me.m03.d25:meSV.MM.Stichera123as8910.text	@ltx/swh_ke_oak/me.m03.d25:meSV.MM.Stichera123as8910.text
ltx/swh_redirects_oak/me.m03.d25:meSV.SticGlory.incipit	@ltx/swh_ke_oak/me.m03.d25:meSV.SticGlory.incipit
ltx/swh_redirects_oak/me.m03.d25:meSV.SticGlory.melody	@ltx/swh_ke_oak/me.m03.d25:meSV.SticGlory.melody
ltx/swh_redirects_oak/me.m03.d25:meSV.SticGlory.mode	@ltx/swh_ke_oak/me.m03.d25:meSV.SticGlory.mode
ltx/swh_redirects_oak/me.m03.d25:meSV.SticGlory.text	@ltx/swh_ke_oak/me.m03.d25:meSV.SticGlory.text
ltx/swh_redirects_oak/me.m03.d25:meSV.Stichera1.incipit	@ltx/swh_ke_oak/me.m03.d25:meSV.Stichera1.incipit
ltx/swh_redirects_oak/me.m03.d25:meSV.Stichera1.melody	@ltx/swh_ke_oak/me.m03.d25:meSV.Stichera1.melody
ltx/swh_redirects_oak/me.m03.d25:meSV.Stichera1.mode	@ltx/swh_ke_oak/me.m03.d25:meSV.Stichera1.mode
ltx/swh_redirects_oak/me.m03.d25:meSV.Stichera1.text	@ltx/swh_ke_oak/me.m03.d25:meSV.Stichera1.text
ltx/swh_redirects_oak/me.m03.d25:meSV.Stichera2.incipit	@ltx/swh_ke_oak/me.m03.d25:meSV.Stichera2.incipit
ltx/swh_redirects_oak/me.m03.d25:meSV.Stichera2.melody	@ltx/swh_ke_oak/me.m03.d25:meSV.Stichera2.melody
ltx/swh_redirects_oak/me.m03.d25:meSV.Stichera2.mode	@ltx/swh_ke_oak/me.m03.d25:meSV.Stichera2.mode
ltx/swh_redirects_oak/me.m03.d25:meSV.Stichera2.text	@ltx/swh_ke_oak/me.m03.d25:meSV.Stichera2.text
ltx/swh_redirects_oak/me.m03.d25:meSV.Stichera3.incipit	@ltx/swh_ke_oak/me.m03.d25:meSV.Stichera3.incipit
ltx/swh_redirects_oak/me.m03.d25:meSV.Stichera3.melody	@ltx/swh_ke_oak/me.m03.d25:meSV.Stichera3.melody
ltx/swh_redirects_oak/me.m03.d25:meSV.Stichera3.mode	@ltx/swh_ke_oak/me.m03.d25:meSV.Stichera3.mode
ltx/swh_redirects_oak/me.m03.d25:meSV.Stichera3.text	@ltx/swh_ke_oak/me.m03.d25:meSV.Stichera3.text
ltx/swh_redirects_oak/me.m03.d25:meVE.Apolytikion1.incipit	@ltx/swh_ke_oak/me.m03.d25:meVE.Apolytikion1.incipit
ltx/swh_redirects_oak/me.m03.d25:meVE.Apolytikion1.melody	@ltx/swh_ke_oak/me.m03.d25:meVE.Apolytikion1.melody
ltx/swh_redirects_oak/me.m03.d25:meVE.Apolytikion1.mode	@ltx/swh_ke_oak/me.m03.d25:meVE.Apolytikion1.mode
ltx/swh_redirects_oak/me.m03.d25:meVE.Apolytikion1.text	@ltx/swh_ke_oak/me.m03.d25:meVE.Apolytikion1.text
ltx/swh_redirects_oak/me.m03.d25:meVE.AposGlory.incipit	@ltx/swh_ke_oak/me.m03.d25:meVE.AposGlory.incipit
ltx/swh_redirects_oak/me.m03.d25:meVE.AposGlory.melody	@ltx/swh_ke_oak/me.m03.d25:meVE.AposGlory.melody
ltx/swh_redirects_oak/me.m03.d25:meVE.AposGlory.mode	@ltx/swh_ke_oak/me.m03.d25:meVE.AposGlory.mode
ltx/swh_redirects_oak/me.m03.d25:meVE.AposGlory.poet	@ltx/swh_ke_oak/me.m03.d25:meVE.AposGlory.poet
ltx/swh_redirects_oak/me.m03.d25:meVE.AposGlory.text	@ltx/swh_ke_oak/me.m03.d25:meVE.AposGlory.text
ltx/swh_redirects_oak/me.m03.d25:meVE.Aposticha1.incipit	@ltx/swh_ke_oak/me.m03.d25:meVE.Aposticha1.incipit
ltx/swh_redirects_oak/me.m03.d25:meVE.Aposticha1.melody	@ltx/swh_ke_oak/me.m03.d25:meVE.Aposticha1.melody
ltx/swh_redirects_oak/me.m03.d25:meVE.Aposticha1.mode	@ltx/swh_ke_oak/me.m03.d25:meVE.Aposticha1.mode
ltx/swh_redirects_oak/me.m03.d25:meVE.Aposticha1.text	@ltx/swh_ke_oak/me.m03.d25:meVE.Aposticha1.text
ltx/swh_redirects_oak/me.m03.d25:meVE.Aposticha2.incipit	@ltx/swh_ke_oak/me.m03.d25:meVE.Aposticha2.incipit
ltx/swh_redirects_oak/me.m03.d25:meVE.Aposticha2.melody	@ltx/swh_ke_oak/me.m03.d25:meVE.Aposticha2.melody
ltx/swh_redirects_oak/me.m03.d25:meVE.Aposticha2.mode	@ltx/swh_ke_oak/me.m03.d25:meVE.Aposticha2.mode
ltx/swh_redirects_oak/me.m03.d25:meVE.Aposticha2.text	@ltx/swh_ke_oak/me.m03.d25:meVE.Aposticha2.text
ltx/swh_redirects_oak/me.m03.d25:meVE.Aposticha3.incipit	@ltx/swh_ke_oak/me.m03.d25:meVE.Aposticha3.incipit
ltx/swh_redirects_oak/me.m03.d25:meVE.Aposticha3.melody	@ltx/swh_ke_oak/me.m03.d25:meVE.Aposticha3.melody
ltx/swh_redirects_oak/me.m03.d25:meVE.Aposticha3.mode	@ltx/swh_ke_oak/me.m03.d25:meVE.Aposticha3.mode
ltx/swh_redirects_oak/me.m03.d25:meVE.Aposticha3.text	@ltx/swh_ke_oak/me.m03.d25:meVE.Aposticha3.text
ltx/swh_redirects_oak/me.m03.d25:meVE.Lity1.incipit	@ltx/swh_ke_oak/me.m03.d25:meVE.Lity1.incipit
ltx/swh_redirects_oak/me.m03.d25:meVE.Lity1.melody	@ltx/swh_ke_oak/me.m03.d25:meVE.Lity1.melody
ltx/swh_redirects_oak/me.m03.d25:meVE.Lity1.mode	@ltx/swh_ke_oak/me.m03.d25:meVE.Lity1.mode
ltx/swh_redirects_oak/me.m03.d25:meVE.Lity1.poet	@ltx/swh_ke_oak/me.m03.d25:meVE.Lity1.poet
ltx/swh_redirects_oak/me.m03.d25:meVE.Lity1.text	@ltx/swh_ke_oak/me.m03.d25:meVE.Lity1.text
ltx/swh_redirects_oak/me.m03.d25:meVE.Lity2.incipit	@ltx/swh_ke_oak/me.m03.d25:meVE.Lity2.incipit
ltx/swh_redirects_oak/me.m03.d25:meVE.Lity2.melody	@ltx/swh_ke_oak/me.m03.d25:meVE.Lity2.melody
ltx/swh_redirects_oak/me.m03.d25:meVE.Lity2.mode	@ltx/swh_ke_oak/me.m03.d25:meVE.Lity2.mode
ltx/swh_redirects_oak/me.m03.d25:meVE.Lity2.poet	@ltx/swh_ke_oak/me.m03.d25:meVE.Lity2.poet
ltx/swh_redirects_oak/me.m03.d25:meVE.Lity2.text	@ltx/swh_ke_oak/me.m03.d25:meVE.Lity2.text
ltx/swh_redirects_oak/me.m03.d25:meVE.Lity3.incipit	@ltx/swh_ke_oak/me.m03.d25:meVE.Lity3.incipit
ltx/swh_redirects_oak/me.m03.d25:meVE.Lity3.melody	@ltx/swh_ke_oak/me.m03.d25:meVE.Lity3.melody
ltx/swh_redirects_oak/me.m03.d25:meVE.Lity3.mode	@ltx/swh_ke_oak/me.m03.d25:meVE.Lity3.mode
ltx/swh_redirects_oak/me.m03.d25:meVE.Lity3.text	@ltx/swh_ke_oak/me.m03.d25:meVE.Lity3.text
ltx/swh_redirects_oak/me.m03.d25:meVE.LityGlory.incipit	@ltx/swh_ke_oak/me.m03.d25:meVE.LityGlory.incipit
ltx/swh_redirects_oak/me.m03.d25:meVE.LityGlory.melody	@ltx/swh_ke_oak/me.m03.d25:meVE.LityGlory.melody
ltx/swh_redirects_oak/me.m03.d25:meVE.LityGlory.mode	@ltx/swh_ke_oak/me.m03.d25:meVE.LityGlory.mode
ltx/swh_redirects_oak/me.m03.d25:meVE.LityGlory.poet	@ltx/swh_ke_oak/me.m03.d25:meVE.LityGlory.poet
ltx/swh_redirects_oak/me.m03.d25:meVE.LityGlory.text	@ltx/swh_ke_oak/me.m03.d25:meVE.LityGlory.text
ltx/swh_redirects_oak/me.m03.d25:meVE.MM.Stichera1123as4567.text	@ltx/swh_ke_oak/me.m03.d25:meVE.MM.Stichera1123as4567.text
ltx/swh_redirects_oak/me.m03.d25:meVE.MM.Stichera123as567.text	@ltx/swh_ke_oak/me.m03.d25:meVE.MM.Stichera123as567.text
ltx/swh_redirects_oak/me.m03.d25:meVE.SticGlory.incipit	@ltx/swh_ke_oak/me.m03.d25:meVE.SticGlory.incipit
ltx/swh_redirects_oak/me.m03.d25:meVE.SticGlory.melody	@ltx/swh_ke_oak/me.m03.d25:meVE.SticGlory.melody
ltx/swh_redirects_oak/me.m03.d25:meVE.SticGlory.mode	@ltx/swh_ke_oak/me.m03.d25:meVE.SticGlory.mode
ltx/swh_redirects_oak/me.m03.d25:meVE.SticGlory.poet	@ltx/swh_ke_oak/me.m03.d25:meVE.SticGlory.poet
ltx/swh_redirects_oak/me.m03.d25:meVE.SticGlory.text	@ltx/swh_ke_oak/me.m03.d25:meVE.SticGlory.text
ltx/swh_redirects_oak/me.m03.d25:meVE.Stichera01.greekmelody	@ltx/swh_ke_oak/me.m03.d25:meVE.Stichera01.greekmelody
ltx/swh_redirects_oak/me.m03.d25:meVE.Stichera01.incipit	@ltx/swh_ke_oak/me.m03.d25:meVE.Stichera01.incipit
ltx/swh_redirects_oak/me.m03.d25:meVE.Stichera01.melody	@ltx/swh_ke_oak/me.m03.d25:meVE.Stichera01.melody
ltx/swh_redirects_oak/me.m03.d25:meVE.Stichera01.mode	@ltx/swh_ke_oak/me.m03.d25:meVE.Stichera01.mode
ltx/swh_redirects_oak/me.m03.d25:meVE.Stichera01.text	@ltx/swh_ke_oak/me.m03.d25:meVE.Stichera01.text
ltx/swh_redirects_oak/me.m03.d25:meVE.Stichera02.incipit	@ltx/swh_ke_oak/me.m03.d25:meVE.Stichera02.incipit
ltx/swh_redirects_oak/me.m03.d25:meVE.Stichera02.melody	@ltx/swh_ke_oak/me.m03.d25:meVE.Stichera02.melody
ltx/swh_redirects_oak/me.m03.d25:meVE.Stichera02.mode	@ltx/swh_ke_oak/me.m03.d25:meVE.Stichera02.mode
ltx/swh_redirects_oak/me.m03.d25:meVE.Stichera02.text	@ltx/swh_ke_oak/me.m03.d25:meVE.Stichera02.text
ltx/swh_redirects_oak/me.m03.d25:meVE.Stichera03.incipit	@ltx/swh_ke_oak/me.m03.d25:meVE.Stichera03.incipit
ltx/swh_redirects_oak/me.m03.d25:meVE.Stichera03.melody	@ltx/swh_ke_oak/me.m03.d25:meVE.Stichera03.melody
ltx/swh_redirects_oak/me.m03.d25:meVE.Stichera03.mode	@ltx/swh_ke_oak/me.m03.d25:meVE.Stichera03.mode
ltx/swh_redirects_oak/me.m03.d25:meVE.Stichera03.text	@ltx/swh_ke_oak/me.m03.d25:meVE.Stichera03.text
