ltx/swh_redirects_oak/eu.childbirth:euCHI.Key0100.title	@ltx/swh_ke_oak/eu.childbirth:euCHI.Key0100.title
ltx/swh_redirects_oak/eu.childbirth:euCHI.Key0101.text	@ltx/swh_ke_oak/eu.childbirth:euCHI.Key0101.text
ltx/swh_redirects_oak/eu.childbirth:euCHI.Key0102.text	@ltx/swh_ke_oak/eu.childbirth:euCHI.Key0102.text
ltx/swh_redirects_oak/eu.childbirth:euCHI.Key0103.text	@ltx/swh_ke_oak/eu.childbirth:euCHI.Key0103.text
ltx/swh_redirects_oak/eu.childbirth:euCHI.Key0200.title	@ltx/swh_ke_oak/eu.childbirth:euCHI.Key0200.title
ltx/swh_redirects_oak/eu.childbirth:euCHI.Key0201.text	@ltx/swh_ke_oak/eu.childbirth:euCHI.Key0201.text
ltx/swh_redirects_oak/eu.childbirth:euCHI.Key0300.title	@ltx/swh_ke_oak/eu.childbirth:euCHI.Key0300.title
ltx/swh_redirects_oak/eu.childbirth:euCHI.Key0301.text	@ltx/swh_ke_oak/eu.childbirth:euCHI.Key0301.text
ltx/swh_redirects_oak/eu.childbirth:euCHI.Key0302.text	@ltx/swh_ke_oak/eu.childbirth:euCHI.Key0302.text
ltx/swh_redirects_oak/eu.childbirth:euCHI.Key0303.text	@ltx/swh_ke_oak/eu.childbirth:euCHI.Key0303.text
ltx/swh_redirects_oak/eu.childbirth:euCHI.Key0303.title	@ltx/swh_ke_oak/eu.childbirth:euCHI.Key0303.title
ltx/swh_redirects_oak/eu.childbirth:euCHI.Key0304.text	@ltx/swh_ke_oak/eu.childbirth:euCHI.Key0304.text
ltx/swh_redirects_oak/eu.childbirth:euCHI.Key0304.title	@ltx/swh_ke_oak/eu.childbirth:euCHI.Key0304.title
ltx/swh_redirects_oak/eu.childbirth:euCHI.Key0305.text	@ltx/swh_ke_oak/eu.childbirth:euCHI.Key0305.text
ltx/swh_redirects_oak/eu.childbirth:euCHI.Key0306.text	@ltx/swh_ke_oak/eu.childbirth:euCHI.Key0306.text
ltx/swh_redirects_oak/eu.childbirth:euCHI.Key0308.text	@ltx/swh_ke_oak/eu.childbirth:euCHI.Key0308.text
ltx/swh_redirects_oak/eu.childbirth:euCHI.Key0310.text	@ltx/swh_ke_oak/eu.childbirth:euCHI.Key0310.text
ltx/swh_redirects_oak/eu.childbirth:euCHI.Key0400.title	@ltx/swh_ke_oak/eu.childbirth:euCHI.Key0400.title
ltx/swh_redirects_oak/eu.childbirth:euCHI.Key0401.text	@ltx/swh_ke_oak/eu.childbirth:euCHI.Key0401.text
ltx/swh_redirects_oak/eu.childbirth:euCHI.Note21.text	@ltx/swh_ke_oak/eu.childbirth:euCHI.Note21.text
ltx/swh_redirects_oak/eu.childbirth:euCHI.Note31.text	@ltx/swh_ke_oak/eu.childbirth:euCHI.Note31.text
ltx/swh_redirects_oak/eu.childbirth:euCHI.Note32.text	@ltx/swh_ke_oak/eu.childbirth:euCHI.Note32.text
ltx/swh_redirects_oak/eu.childbirth:euCHI.R101	@ltx/swh_ke_oak/eu.childbirth:euCHI.R101
ltx/swh_redirects_oak/eu.childbirth:euCHI.R102	@ltx/swh_ke_oak/eu.childbirth:euCHI.R102
ltx/swh_redirects_oak/eu.childbirth:euCHI.R103	@ltx/swh_ke_oak/eu.childbirth:euCHI.R103
ltx/swh_redirects_oak/eu.childbirth:euCHI.R104	@ltx/swh_ke_oak/eu.childbirth:euCHI.R104
ltx/swh_redirects_oak/eu.childbirth:euCHI.R201	@ltx/swh_ke_oak/eu.childbirth:euCHI.R201
ltx/swh_redirects_oak/eu.childbirth:euCHI.R202	@ltx/swh_ke_oak/eu.childbirth:euCHI.R202
ltx/swh_redirects_oak/eu.childbirth:euCHI.R203	@ltx/swh_ke_oak/eu.childbirth:euCHI.R203
ltx/swh_redirects_oak/eu.childbirth:euCHI.R204	@ltx/swh_ke_oak/eu.childbirth:euCHI.R204
ltx/swh_redirects_oak/eu.childbirth:euCHI.R205	@ltx/swh_ke_oak/eu.childbirth:euCHI.R205
ltx/swh_redirects_oak/eu.childbirth:euCHI.R301	@ltx/swh_ke_oak/eu.childbirth:euCHI.R301
ltx/swh_redirects_oak/eu.childbirth:euCHI.R302	@ltx/swh_ke_oak/eu.childbirth:euCHI.R302
ltx/swh_redirects_oak/eu.childbirth:euCHI.R303	@ltx/swh_ke_oak/eu.childbirth:euCHI.R303
ltx/swh_redirects_oak/eu.childbirth:euCHI.R304	@ltx/swh_ke_oak/eu.childbirth:euCHI.R304
ltx/swh_redirects_oak/eu.childbirth:euCHI.R305	@ltx/swh_ke_oak/eu.childbirth:euCHI.R305
ltx/swh_redirects_oak/eu.childbirth:euCHI.R306	@ltx/swh_ke_oak/eu.childbirth:euCHI.R306
ltx/swh_redirects_oak/eu.childbirth:euCHI.R306alt	@ltx/swh_ke_oak/eu.childbirth:euCHI.R306alt
ltx/swh_redirects_oak/eu.childbirth:euCHI.R307	@ltx/swh_ke_oak/eu.childbirth:euCHI.R307
ltx/swh_redirects_oak/eu.childbirth:euCHI.R308	@ltx/swh_ke_oak/eu.childbirth:euCHI.R308
ltx/swh_redirects_oak/eu.childbirth:euCHI.R309	@ltx/swh_ke_oak/eu.childbirth:euCHI.R309
ltx/swh_redirects_oak/eu.childbirth:euCHI.R310	@ltx/swh_ke_oak/eu.childbirth:euCHI.R310
ltx/swh_redirects_oak/eu.childbirth:euCHI.R311	@ltx/swh_ke_oak/eu.childbirth:euCHI.R311
ltx/swh_redirects_oak/eu.childbirth:euCHI.R312	@ltx/swh_ke_oak/eu.childbirth:euCHI.R312
ltx/swh_redirects_oak/eu.childbirth:euCHI.R313	@ltx/swh_ke_oak/eu.childbirth:euCHI.R313
ltx/swh_redirects_oak/eu.childbirth:euCHI.R314	@ltx/swh_ke_oak/eu.childbirth:euCHI.R314
ltx/swh_redirects_oak/eu.childbirth:euCHI.R315	@ltx/swh_ke_oak/eu.childbirth:euCHI.R315
ltx/swh_redirects_oak/eu.childbirth:euCHI.R316	@ltx/swh_ke_oak/eu.childbirth:euCHI.R316
ltx/swh_redirects_oak/eu.childbirth:euCHI.R317	@ltx/swh_ke_oak/eu.childbirth:euCHI.R317
ltx/swh_redirects_oak/eu.childbirth:euCHI.R318	@ltx/swh_ke_oak/eu.childbirth:euCHI.R318
ltx/swh_redirects_oak/eu.childbirth:euCHI.R401	@ltx/swh_ke_oak/eu.childbirth:euCHI.R401
ltx/swh_redirects_oak/eu.childbirth:euCHI.R402	@ltx/swh_ke_oak/eu.childbirth:euCHI.R402
ltx/swh_redirects_oak/eu.childbirth:euCHI.R403	@ltx/swh_ke_oak/eu.childbirth:euCHI.R403
ltx/swh_redirects_oak/eu.childbirth:euCHI.title	@ltx/swh_ke_oak/eu.childbirth:euCHI.title
ltx/swh_redirects_oak/eu.childbirth:euCHI.translator	@ltx/swh_ke_oak/eu.childbirth:euCHI.translator
