ltx/swh_redirects_oak/ho.ho15.m03:ho.Days	@ltx/swh_ke_oak/ho.ho15.m03:ho.Days
ltx/swh_redirects_oak/ho.ho15.m03:ho.Hours	@ltx/swh_ke_oak/ho.ho15.m03:ho.Hours
ltx/swh_redirects_oak/ho.ho15.m03:ho.Month	@ltx/swh_ke_oak/ho.ho15.m03:ho.Month
ltx/swh_redirects_oak/ho.ho15.m03:hoD01.GeneralApolytikion1.name	@ltx/swh_ke_oak/ho.ho15.m03:hoD01.GeneralApolytikion1.name
ltx/swh_redirects_oak/ho.ho15.m03:hoD04.GeneralApolytikion1.name	@ltx/swh_ke_oak/ho.ho15.m03:hoD04.GeneralApolytikion1.name
ltx/swh_redirects_oak/ho.ho15.m03:hoD09.Apolytikion2.greekmelody	@ltx/swh_ke_oak/ho.ho15.m03:hoD09.Apolytikion2.greekmelody
ltx/swh_redirects_oak/ho.ho15.m03:hoD09.Apolytikion2.incipit	@ltx/swh_ke_oak/ho.ho15.m03:hoD09.Apolytikion2.incipit
ltx/swh_redirects_oak/ho.ho15.m03:hoD09.Apolytikion2.melody	@ltx/swh_ke_oak/ho.ho15.m03:hoD09.Apolytikion2.melody
ltx/swh_redirects_oak/ho.ho15.m03:hoD09.Apolytikion2.mode	@ltx/swh_ke_oak/ho.ho15.m03:hoD09.Apolytikion2.mode
ltx/swh_redirects_oak/ho.ho15.m03:hoD09.Apolytikion2.poet	@ltx/swh_ke_oak/ho.ho15.m03:hoD09.Apolytikion2.poet
ltx/swh_redirects_oak/ho.ho15.m03:hoD09.Apolytikion2.text	@ltx/swh_ke_oak/ho.ho15.m03:hoD09.Apolytikion2.text
ltx/swh_redirects_oak/ho.ho15.m03:hoD09.Apolytikion2.title	@ltx/swh_ke_oak/ho.ho15.m03:hoD09.Apolytikion2.title
ltx/swh_redirects_oak/ho.ho15.m03:hoD12.Apolytikion1.greekmelody	@ltx/swh_ke_oak/ho.ho15.m03:hoD12.Apolytikion1.greekmelody
ltx/swh_redirects_oak/ho.ho15.m03:hoD12.Apolytikion1.incipit	@ltx/swh_ke_oak/ho.ho15.m03:hoD12.Apolytikion1.incipit
ltx/swh_redirects_oak/ho.ho15.m03:hoD12.Apolytikion1.melody	@ltx/swh_ke_oak/ho.ho15.m03:hoD12.Apolytikion1.melody
ltx/swh_redirects_oak/ho.ho15.m03:hoD12.Apolytikion1.mode	@ltx/swh_ke_oak/ho.ho15.m03:hoD12.Apolytikion1.mode
ltx/swh_redirects_oak/ho.ho15.m03:hoD12.Apolytikion1.poet	@ltx/swh_ke_oak/ho.ho15.m03:hoD12.Apolytikion1.poet
ltx/swh_redirects_oak/ho.ho15.m03:hoD12.Apolytikion1.text	@ltx/swh_ke_oak/ho.ho15.m03:hoD12.Apolytikion1.text
ltx/swh_redirects_oak/ho.ho15.m03:hoD12.Apolytikion1.title	@ltx/swh_ke_oak/ho.ho15.m03:hoD12.Apolytikion1.title
ltx/swh_redirects_oak/ho.ho15.m03:hoD12.Kontakion1.greekmelody	@ltx/swh_ke_oak/ho.ho15.m03:hoD12.Kontakion1.greekmelody
ltx/swh_redirects_oak/ho.ho15.m03:hoD12.Kontakion1.incipit	@ltx/swh_ke_oak/ho.ho15.m03:hoD12.Kontakion1.incipit
ltx/swh_redirects_oak/ho.ho15.m03:hoD12.Kontakion1.melody	@ltx/swh_ke_oak/ho.ho15.m03:hoD12.Kontakion1.melody
ltx/swh_redirects_oak/ho.ho15.m03:hoD12.Kontakion1.mode	@ltx/swh_ke_oak/ho.ho15.m03:hoD12.Kontakion1.mode
ltx/swh_redirects_oak/ho.ho15.m03:hoD12.Kontakion1.poet	@ltx/swh_ke_oak/ho.ho15.m03:hoD12.Kontakion1.poet
ltx/swh_redirects_oak/ho.ho15.m03:hoD12.Kontakion1.text	@ltx/swh_ke_oak/ho.ho15.m03:hoD12.Kontakion1.text
ltx/swh_redirects_oak/ho.ho15.m03:hoD12.Kontakion1.title	@ltx/swh_ke_oak/ho.ho15.m03:hoD12.Kontakion1.title
ltx/swh_redirects_oak/ho.ho15.m03:hoD30.GeneralApolytikion1.name	@ltx/swh_ke_oak/ho.ho15.m03:hoD30.GeneralApolytikion1.name
ltx/swh_redirects_oak/ho.ho15.m03:hoD31.GeneralApolytikion1.name	@ltx/swh_ke_oak/ho.ho15.m03:hoD31.GeneralApolytikion1.name
