ltx/swh_redirects_oak/le.ep.me.m09.d15:lemeLI.Epistle.book_abbr	@ltx/swh_ke_oak/le.ep.me.m09.d15:lemeLI.Epistle.book_abbr
ltx/swh_redirects_oak/le.ep.me.m09.d15:lemeLI.Epistle.book_string	@ltx/swh_ke_oak/le.ep.me.m09.d15:lemeLI.Epistle.book_string
ltx/swh_redirects_oak/le.ep.me.m09.d15:lemeLI.Epistle.chapverse	@ltx/swh_ke_oak/le.ep.me.m09.d15:lemeLI.Epistle.chapverse
ltx/swh_redirects_oak/le.ep.me.m09.d15:lemeLI.Epistle.incipit	@ltx/swh_ke_oak/le.ep.me.m09.d15:lemeLI.Epistle.incipit
ltx/swh_redirects_oak/le.ep.me.m09.d15:lemeLI.Epistle.pagenumber	@ltx/swh_ke_oak/le.ep.me.m09.d15:lemeLI.Epistle.pagenumber
ltx/swh_redirects_oak/le.ep.me.m09.d15:lemeLI.Epistle.text	@ltx/swh_ke_oak/le.ep.me.m09.d15:lemeLI.Epistle.text
ltx/swh_redirects_oak/le.ep.me.m09.d15:lemeLI.Epistle.title	@ltx/swh_ke_oak/le.ep.me.m09.d15:lemeLI.Epistle.title
ltx/swh_redirects_oak/le.ep.me.m09.d15:lemeLI.Epistle.title_abbr	@ltx/swh_ke_oak/le.ep.me.m09.d15:lemeLI.Epistle.title_abbr
ltx/swh_redirects_oak/le.ep.me.m09.d15:lemeLI.Epistle.version	@ltx/swh_ke_oak/le.ep.me.m09.d15:lemeLI.Epistle.version
