ltx/swh_redirects_oak/sy.m04.d13:syMA.commemoration01.couplet1.title	@ltx/swh_ke_oak/sy.m04.d13:syMA.commemoration01.couplet1.title
ltx/swh_redirects_oak/sy.m04.d13:syMA.commemoration01.couplet1.verse1	@ltx/swh_ke_oak/sy.m04.d13:syMA.commemoration01.couplet1.verse1
ltx/swh_redirects_oak/sy.m04.d13:syMA.commemoration01.couplet1.verse2	@ltx/swh_ke_oak/sy.m04.d13:syMA.commemoration01.couplet1.verse2
ltx/swh_redirects_oak/sy.m04.d13:syMA.commemoration01.narration.p01	@ltx/swh_ke_oak/sy.m04.d13:syMA.commemoration01.narration.p01
ltx/swh_redirects_oak/sy.m04.d13:syMA.commemoration01.single1	@ltx/swh_ke_oak/sy.m04.d13:syMA.commemoration01.single1
ltx/swh_redirects_oak/sy.m04.d13:syMA.commemoration01.text	@ltx/swh_ke_oak/sy.m04.d13:syMA.commemoration01.text
ltx/swh_redirects_oak/sy.m04.d13:syMA.commemoration02.couplet1.title	@ltx/swh_ke_oak/sy.m04.d13:syMA.commemoration02.couplet1.title
ltx/swh_redirects_oak/sy.m04.d13:syMA.commemoration02.couplet1.verse1	@ltx/swh_ke_oak/sy.m04.d13:syMA.commemoration02.couplet1.verse1
ltx/swh_redirects_oak/sy.m04.d13:syMA.commemoration02.couplet1.verse2	@ltx/swh_ke_oak/sy.m04.d13:syMA.commemoration02.couplet1.verse2
ltx/swh_redirects_oak/sy.m04.d13:syMA.commemoration02.narration.p01	@ltx/swh_ke_oak/sy.m04.d13:syMA.commemoration02.narration.p01
ltx/swh_redirects_oak/sy.m04.d13:syMA.commemoration02.text	@ltx/swh_ke_oak/sy.m04.d13:syMA.commemoration02.text
ltx/swh_redirects_oak/sy.m04.d13:syMA.commemoration03.couplet1.title	@ltx/swh_ke_oak/sy.m04.d13:syMA.commemoration03.couplet1.title
ltx/swh_redirects_oak/sy.m04.d13:syMA.commemoration03.couplet1.verse1	@ltx/swh_ke_oak/sy.m04.d13:syMA.commemoration03.couplet1.verse1
ltx/swh_redirects_oak/sy.m04.d13:syMA.commemoration03.couplet1.verse2	@ltx/swh_ke_oak/sy.m04.d13:syMA.commemoration03.couplet1.verse2
ltx/swh_redirects_oak/sy.m04.d13:syMA.commemoration03.text	@ltx/swh_ke_oak/sy.m04.d13:syMA.commemoration03.text
ltx/swh_redirects_oak/sy.m04.d13:syMA.commemoration04.couplet1.title	@ltx/swh_ke_oak/sy.m04.d13:syMA.commemoration04.couplet1.title
ltx/swh_redirects_oak/sy.m04.d13:syMA.commemoration04.couplet1.verse1	@ltx/swh_ke_oak/sy.m04.d13:syMA.commemoration04.couplet1.verse1
ltx/swh_redirects_oak/sy.m04.d13:syMA.commemoration04.couplet1.verse2	@ltx/swh_ke_oak/sy.m04.d13:syMA.commemoration04.couplet1.verse2
ltx/swh_redirects_oak/sy.m04.d13:syMA.commemoration04.text	@ltx/swh_ke_oak/sy.m04.d13:syMA.commemoration04.text
ltx/swh_redirects_oak/sy.m04.d13:syMA.commemoration05.couplet1.title	@ltx/swh_ke_oak/sy.m04.d13:syMA.commemoration05.couplet1.title
ltx/swh_redirects_oak/sy.m04.d13:syMA.commemoration05.couplet1.verse1	@ltx/swh_ke_oak/sy.m04.d13:syMA.commemoration05.couplet1.verse1
ltx/swh_redirects_oak/sy.m04.d13:syMA.commemoration05.couplet1.verse2	@ltx/swh_ke_oak/sy.m04.d13:syMA.commemoration05.couplet1.verse2
ltx/swh_redirects_oak/sy.m04.d13:syMA.commemoration05.text	@ltx/swh_ke_oak/sy.m04.d13:syMA.commemoration05.text
ltx/swh_redirects_oak/sy.m04.d13:syMA.lastline	@ltx/swh_ke_oak/sy.m04.d13:syMA.lastline
