ltx/swh_redirects_oak/ty.m01.d15:tyCommemoration.text	@ltx/swh_ke_oak/ty.m01.d15:tyCommemoration.text
ltx/swh_redirects_oak/ty.m01.d15:tyDate.text	@ltx/swh_ke_oak/ty.m01.d15:tyDate.text
ltx/swh_redirects_oak/ty.m01.d15:tyLI.AfterCommunion.text	@ltx/swh_ke_oak/ty.m01.d15:tyLI.AfterCommunion.text
ltx/swh_redirects_oak/ty.m01.d15:tyLI.AmboPrayer.text	@ltx/swh_ke_oak/ty.m01.d15:tyLI.AmboPrayer.text
ltx/swh_redirects_oak/ty.m01.d15:tyLI.Antiphons.text	@ltx/swh_ke_oak/ty.m01.d15:tyLI.Antiphons.text
ltx/swh_redirects_oak/ty.m01.d15:tyLI.Apolytikia.text	@ltx/swh_ke_oak/ty.m01.d15:tyLI.Apolytikia.text
ltx/swh_redirects_oak/ty.m01.d15:tyLI.CommunionHymn.text	@ltx/swh_ke_oak/ty.m01.d15:tyLI.CommunionHymn.text
ltx/swh_redirects_oak/ty.m01.d15:tyLI.Dismissal.text	@ltx/swh_ke_oak/ty.m01.d15:tyLI.Dismissal.text
ltx/swh_redirects_oak/ty.m01.d15:tyLI.EntranceHymn.text	@ltx/swh_ke_oak/ty.m01.d15:tyLI.EntranceHymn.text
ltx/swh_redirects_oak/ty.m01.d15:tyLI.Epistle.text	@ltx/swh_ke_oak/ty.m01.d15:tyLI.Epistle.text
ltx/swh_redirects_oak/ty.m01.d15:tyLI.Gospel.text	@ltx/swh_ke_oak/ty.m01.d15:tyLI.Gospel.text
ltx/swh_redirects_oak/ty.m01.d15:tyLI.Kontakion.text	@ltx/swh_ke_oak/ty.m01.d15:tyLI.Kontakion.text
ltx/swh_redirects_oak/ty.m01.d15:tyLI.Megalynarion.text	@ltx/swh_ke_oak/ty.m01.d15:tyLI.Megalynarion.text
ltx/swh_redirects_oak/ty.m01.d15:tyLI.TheotokosHymn.text	@ltx/swh_ke_oak/ty.m01.d15:tyLI.TheotokosHymn.text
ltx/swh_redirects_oak/ty.m01.d15:tyMA.Anavathmoi.text	@ltx/swh_ke_oak/ty.m01.d15:tyMA.Anavathmoi.text
ltx/swh_redirects_oak/ty.m01.d15:tyMA.Apolytikia.text	@ltx/swh_ke_oak/ty.m01.d15:tyMA.Apolytikia.text
ltx/swh_redirects_oak/ty.m01.d15:tyMA.Canons.text	@ltx/swh_ke_oak/ty.m01.d15:tyMA.Canons.text
ltx/swh_redirects_oak/ty.m01.d15:tyMA.Doxology.text	@ltx/swh_ke_oak/ty.m01.d15:tyMA.Doxology.text
ltx/swh_redirects_oak/ty.m01.d15:tyMA.EndApolytikion.text	@ltx/swh_ke_oak/ty.m01.d15:tyMA.EndApolytikion.text
ltx/swh_redirects_oak/ty.m01.d15:tyMA.Exaposteilaria.text	@ltx/swh_ke_oak/ty.m01.d15:tyMA.Exaposteilaria.text
ltx/swh_redirects_oak/ty.m01.d15:tyMA.Katavasias.text	@ltx/swh_ke_oak/ty.m01.d15:tyMA.Katavasias.text
ltx/swh_redirects_oak/ty.m01.d15:tyMA.Kathismata.text	@ltx/swh_ke_oak/ty.m01.d15:tyMA.Kathismata.text
ltx/swh_redirects_oak/ty.m01.d15:tyMA.KontakionOikos.text	@ltx/swh_ke_oak/ty.m01.d15:tyMA.KontakionOikos.text
ltx/swh_redirects_oak/ty.m01.d15:tyMA.Lauds.text	@ltx/swh_ke_oak/ty.m01.d15:tyMA.Lauds.text
ltx/swh_redirects_oak/ty.m01.d15:tyMA.LaudsBoth.text	@ltx/swh_ke_oak/ty.m01.d15:tyMA.LaudsBoth.text
ltx/swh_redirects_oak/ty.m01.d15:tyMA.LaudsGlory.text	@ltx/swh_ke_oak/ty.m01.d15:tyMA.LaudsGlory.text
ltx/swh_redirects_oak/ty.m01.d15:tyMA.LaudsVerses.text	@ltx/swh_ke_oak/ty.m01.d15:tyMA.LaudsVerses.text
ltx/swh_redirects_oak/ty.m01.d15:tyMA.Magnificat.text	@ltx/swh_ke_oak/ty.m01.d15:tyMA.Magnificat.text
ltx/swh_redirects_oak/ty.m01.d15:tyMA.MatinsGospel.text	@ltx/swh_ke_oak/ty.m01.d15:tyMA.MatinsGospel.text
ltx/swh_redirects_oak/ty.m01.d15:tyMA.MidodeKath.text	
ltx/swh_redirects_oak/ty.m01.d15:tyMA.MidodeKontakion.text	
ltx/swh_redirects_oak/ty.m01.d15:tyMA.Ode9_1.text	@ltx/swh_ke_oak/ty.m01.d15:tyMA.Ode9_1.text
ltx/swh_redirects_oak/ty.m01.d15:tyMA.Ode9_2.text	@ltx/swh_ke_oak/ty.m01.d15:tyMA.Ode9_2.text
ltx/swh_redirects_oak/ty.m01.d15:tyMA.Ode9_3.text	@ltx/swh_ke_oak/ty.m01.d15:tyMA.Ode9_3.text
ltx/swh_redirects_oak/ty.m01.d15:tyMA.Ode9_4.text	@ltx/swh_ke_oak/ty.m01.d15:tyMA.Ode9_4.text
ltx/swh_redirects_oak/ty.m01.d15:tyMA.Ode9_5.text	@ltx/swh_ke_oak/ty.m01.d15:tyMA.Ode9_5.text
ltx/swh_redirects_oak/ty.m01.d15:tyMA.Ode9_6.text	@ltx/swh_ke_oak/ty.m01.d15:tyMA.Ode9_6.text
ltx/swh_redirects_oak/ty.m01.d15:tyMA.Ode9_7.text	@ltx/swh_ke_oak/ty.m01.d15:tyMA.Ode9_7.text
ltx/swh_redirects_oak/ty.m01.d15:tyMA.Ode9_8.text	@ltx/swh_ke_oak/ty.m01.d15:tyMA.Ode9_8.text
ltx/swh_redirects_oak/ty.m01.d15:tyMA.Ode9_Katavasia1.text	@ltx/swh_ke_oak/ty.m01.d15:tyMA.Ode9_Katavasia1.text
ltx/swh_redirects_oak/ty.m01.d15:tyMA.Ode9_Katavasia2.text	@ltx/swh_ke_oak/ty.m01.d15:tyMA.Ode9_Katavasia2.text
ltx/swh_redirects_oak/ty.m01.d15:tyMA.ProkVerse.text	@ltx/swh_ke_oak/ty.m01.d15:tyMA.ProkVerse.text
ltx/swh_redirects_oak/ty.m01.d15:tyMA.Prokeimenon.text	@ltx/swh_ke_oak/ty.m01.d15:tyMA.Prokeimenon.text
ltx/swh_redirects_oak/ty.m01.d15:tyMA.Psalm50.text	@ltx/swh_ke_oak/ty.m01.d15:tyMA.Psalm50.text
ltx/swh_redirects_oak/ty.m01.d15:tyMA.Synaxarion.text	@ltx/swh_ke_oak/ty.m01.d15:tyMA.Synaxarion.text
ltx/swh_redirects_oak/ty.m01.d15:tyMO.Rubric1.text	@ltx/swh_ke_oak/ty.m01.d15:tyMO.Rubric1.text
ltx/swh_redirects_oak/ty.m01.d15:tyNote1.text	@ltx/swh_ke_oak/ty.m01.d15:tyNote1.text
ltx/swh_redirects_oak/ty.m01.d15:tyVE.Apolytikia.text	@ltx/swh_ke_oak/ty.m01.d15:tyVE.Apolytikia.text
ltx/swh_redirects_oak/ty.m01.d15:tyVE.AposBoth.text	@ltx/swh_ke_oak/ty.m01.d15:tyVE.AposBoth.text
ltx/swh_redirects_oak/ty.m01.d15:tyVE.AposGlory.text	@ltx/swh_ke_oak/ty.m01.d15:tyVE.AposGlory.text
ltx/swh_redirects_oak/ty.m01.d15:tyVE.AposGloryBoth.text	
ltx/swh_redirects_oak/ty.m01.d15:tyVE.Aposticha.text	@ltx/swh_ke_oak/ty.m01.d15:tyVE.Aposticha.text
ltx/swh_redirects_oak/ty.m01.d15:tyVE.Dismissal.text	@ltx/swh_ke_oak/ty.m01.d15:tyVE.Dismissal.text
ltx/swh_redirects_oak/ty.m01.d15:tyVE.Entrance.text	@ltx/swh_ke_oak/ty.m01.d15:tyVE.Entrance.text
ltx/swh_redirects_oak/ty.m01.d15:tyVE.Intro.text	@ltx/swh_ke_oak/ty.m01.d15:tyVE.Intro.text
ltx/swh_redirects_oak/ty.m01.d15:tyVE.LIHC.text	@ltx/swh_ke_oak/ty.m01.d15:tyVE.LIHC.text
ltx/swh_redirects_oak/ty.m01.d15:tyVE.Note1.text	@ltx/swh_ke_oak/ty.m01.d15:tyVE.Note1.text
ltx/swh_redirects_oak/ty.m01.d15:tyVE.Note2.text	@ltx/swh_ke_oak/ty.m01.d15:tyVE.Note2.text
ltx/swh_redirects_oak/ty.m01.d15:tyVE.SticBoth.text	@ltx/swh_ke_oak/ty.m01.d15:tyVE.SticBoth.text
ltx/swh_redirects_oak/ty.m01.d15:tyVE.SticGlory.text	@ltx/swh_ke_oak/ty.m01.d15:tyVE.SticGlory.text
ltx/swh_redirects_oak/ty.m01.d15:tyVE.SticGloryBoth.text	
ltx/swh_redirects_oak/ty.m01.d15:tyVE.Stichera.text	@ltx/swh_ke_oak/ty.m01.d15:tyVE.Stichera.text
