ltx/swh_redirects_oak/me.m08.d05:meDA.commemoration.first	@ltx/swh_ke_oak/me.m08.d05:meDA.commemoration.first
ltx/swh_redirects_oak/me.m08.d05:meDA.commemoration.first_name	@ltx/swh_ke_oak/me.m08.d05:meDA.commemoration.first_name
ltx/swh_redirects_oak/me.m08.d05:meDA.commemoration.first_short	@ltx/swh_ke_oak/me.m08.d05:meDA.commemoration.first_short
ltx/swh_redirects_oak/me.m08.d05:meDA.commemoration.first_title	@ltx/swh_ke_oak/me.m08.d05:meDA.commemoration.first_title
ltx/swh_redirects_oak/me.m08.d05:meDA.commemoration.full	@ltx/swh_ke_oak/me.m08.d05:meDA.commemoration.full
ltx/swh_redirects_oak/me.m08.d05:meDA.commemoration.second_name	@ltx/swh_ke_oak/me.m08.d05:meDA.commemoration.second_name
ltx/swh_redirects_oak/me.m08.d05:meDA.commemoration.second_title	@ltx/swh_ke_oak/me.m08.d05:meDA.commemoration.second_title
ltx/swh_redirects_oak/me.m08.d05:meDA.date	@ltx/swh_ke_oak/me.m08.d05:meDA.date
ltx/swh_redirects_oak/me.m08.d05:meDA.insert1	@ltx/swh_ke_oak/me.m08.d05:meDA.insert1
ltx/swh_redirects_oak/me.m08.d05:meDA.insert2	@ltx/swh_ke_oak/me.m08.d05:meDA.insert2
ltx/swh_redirects_oak/me.m08.d05:meDA.note	@ltx/swh_ke_oak/me.m08.d05:meDA.note
ltx/swh_redirects_oak/me.m08.d05:meHO.commemorations	@ltx/swh_ke_oak/me.m08.d05:meHO.commemorations
ltx/swh_redirects_oak/me.m08.d05:meHO.note1	@ltx/swh_ke_oak/me.m08.d05:meHO.note1
ltx/swh_redirects_oak/me.m08.d05:meHO.note2	@ltx/swh_ke_oak/me.m08.d05:meHO.note2
ltx/swh_redirects_oak/me.m08.d05:meHO.number	@ltx/swh_ke_oak/me.m08.d05:meHO.number
ltx/swh_redirects_oak/me.m08.d05:meHO.rank	@ltx/swh_ke_oak/me.m08.d05:meHO.rank
ltx/swh_redirects_oak/me.m08.d05:meLE.commemoration1	@ltx/swh_ke_oak/me.m08.d05:meLE.commemoration1
ltx/swh_redirects_oak/me.m08.d05:meLE.commemoration2	@ltx/swh_ke_oak/me.m08.d05:meLE.commemoration2
ltx/swh_redirects_oak/me.m08.d05:meLI.Kontakion1.greekmelody	@ltx/swh_ke_oak/me.m08.d05:meLI.Kontakion1.greekmelody
ltx/swh_redirects_oak/me.m08.d05:meLI.Kontakion1.incipit	@ltx/swh_ke_oak/me.m08.d05:meLI.Kontakion1.incipit
ltx/swh_redirects_oak/me.m08.d05:meLI.Kontakion1.melody	@ltx/swh_ke_oak/me.m08.d05:meLI.Kontakion1.melody
ltx/swh_redirects_oak/me.m08.d05:meLI.Kontakion1.mode	@ltx/swh_ke_oak/me.m08.d05:meLI.Kontakion1.mode
ltx/swh_redirects_oak/me.m08.d05:meLI.Kontakion1.text	@ltx/swh_ke_oak/me.m08.d05:meLI.Kontakion1.text
ltx/swh_redirects_oak/me.m08.d05:meLI.Megalynarion.text	@ltx/swh_ke_oak/me.m08.d05:meLI.Megalynarion.text
ltx/swh_redirects_oak/me.m08.d05:meMA.AposGlory.incipit	@ltx/swh_ke_oak/me.m08.d05:meMA.AposGlory.incipit
ltx/swh_redirects_oak/me.m08.d05:meMA.AposGlory.melody	@ltx/swh_ke_oak/me.m08.d05:meMA.AposGlory.melody
ltx/swh_redirects_oak/me.m08.d05:meMA.AposGlory.mode	@ltx/swh_ke_oak/me.m08.d05:meMA.AposGlory.mode
ltx/swh_redirects_oak/me.m08.d05:meMA.AposGlory.text	@ltx/swh_ke_oak/me.m08.d05:meMA.AposGlory.text
ltx/swh_redirects_oak/me.m08.d05:meMA.Aposticha1.greekmelody	@ltx/swh_ke_oak/me.m08.d05:meMA.Aposticha1.greekmelody
ltx/swh_redirects_oak/me.m08.d05:meMA.Aposticha1.incipit	@ltx/swh_ke_oak/me.m08.d05:meMA.Aposticha1.incipit
ltx/swh_redirects_oak/me.m08.d05:meMA.Aposticha1.melody	@ltx/swh_ke_oak/me.m08.d05:meMA.Aposticha1.melody
ltx/swh_redirects_oak/me.m08.d05:meMA.Aposticha1.mode	@ltx/swh_ke_oak/me.m08.d05:meMA.Aposticha1.mode
ltx/swh_redirects_oak/me.m08.d05:meMA.Aposticha1.text	@ltx/swh_ke_oak/me.m08.d05:meMA.Aposticha1.text
ltx/swh_redirects_oak/me.m08.d05:meMA.Aposticha2.incipit	@ltx/swh_ke_oak/me.m08.d05:meMA.Aposticha2.incipit
ltx/swh_redirects_oak/me.m08.d05:meMA.Aposticha2.melody	@ltx/swh_ke_oak/me.m08.d05:meMA.Aposticha2.melody
ltx/swh_redirects_oak/me.m08.d05:meMA.Aposticha2.mode	@ltx/swh_ke_oak/me.m08.d05:meMA.Aposticha2.mode
ltx/swh_redirects_oak/me.m08.d05:meMA.Aposticha2.text	@ltx/swh_ke_oak/me.m08.d05:meMA.Aposticha2.text
ltx/swh_redirects_oak/me.m08.d05:meMA.Aposticha3.incipit	@ltx/swh_ke_oak/me.m08.d05:meMA.Aposticha3.incipit
ltx/swh_redirects_oak/me.m08.d05:meMA.Aposticha3.melody	@ltx/swh_ke_oak/me.m08.d05:meMA.Aposticha3.melody
ltx/swh_redirects_oak/me.m08.d05:meMA.Aposticha3.mode	@ltx/swh_ke_oak/me.m08.d05:meMA.Aposticha3.mode
ltx/swh_redirects_oak/me.m08.d05:meMA.Aposticha3.text	@ltx/swh_ke_oak/me.m08.d05:meMA.Aposticha3.text
ltx/swh_redirects_oak/me.m08.d05:meMA.C1.acrostic.notice1	@ltx/swh_ke_oak/me.m08.d05:meMA.C1.acrostic.notice1
ltx/swh_redirects_oak/me.m08.d05:meMA.C1.acrostic.title	@ltx/swh_ke_oak/me.m08.d05:meMA.C1.acrostic.title
ltx/swh_redirects_oak/me.m08.d05:meMA.C1.title	@ltx/swh_ke_oak/me.m08.d05:meMA.C1.title
ltx/swh_redirects_oak/me.m08.d05:meMA.C1.verse	@ltx/swh_ke_oak/me.m08.d05:meMA.C1.verse
ltx/swh_redirects_oak/me.m08.d05:meMA.C2.acrostic.notice1	@ltx/swh_ke_oak/me.m08.d05:meMA.C2.acrostic.notice1
ltx/swh_redirects_oak/me.m08.d05:meMA.C2.acrostic.text	@ltx/swh_ke_oak/me.m08.d05:meMA.C2.acrostic.text
ltx/swh_redirects_oak/me.m08.d05:meMA.C2.acrostic.title	@ltx/swh_ke_oak/me.m08.d05:meMA.C2.acrostic.title
ltx/swh_redirects_oak/me.m08.d05:meMA.C2.title	@ltx/swh_ke_oak/me.m08.d05:meMA.C2.title
ltx/swh_redirects_oak/me.m08.d05:meMA.C2.verse	@ltx/swh_ke_oak/me.m08.d05:meMA.C2.verse
ltx/swh_redirects_oak/me.m08.d05:meMA.C3.title	@ltx/swh_ke_oak/me.m08.d05:meMA.C3.title
ltx/swh_redirects_oak/me.m08.d05:meMA.C3.verse	@ltx/swh_ke_oak/me.m08.d05:meMA.C3.verse
ltx/swh_redirects_oak/me.m08.d05:meMA.Exaposteilarion1.greekmelody	@ltx/swh_ke_oak/me.m08.d05:meMA.Exaposteilarion1.greekmelody
ltx/swh_redirects_oak/me.m08.d05:meMA.Exaposteilarion1.incipit	@ltx/swh_ke_oak/me.m08.d05:meMA.Exaposteilarion1.incipit
ltx/swh_redirects_oak/me.m08.d05:meMA.Exaposteilarion1.melody	@ltx/swh_ke_oak/me.m08.d05:meMA.Exaposteilarion1.melody
ltx/swh_redirects_oak/me.m08.d05:meMA.Exaposteilarion1.mode	@ltx/swh_ke_oak/me.m08.d05:meMA.Exaposteilarion1.mode
ltx/swh_redirects_oak/me.m08.d05:meMA.Exaposteilarion1.text	@ltx/swh_ke_oak/me.m08.d05:meMA.Exaposteilarion1.text
ltx/swh_redirects_oak/me.m08.d05:meMA.Exaposteilarion2.greekmelody	@ltx/swh_ke_oak/me.m08.d05:meMA.Exaposteilarion2.greekmelody
ltx/swh_redirects_oak/me.m08.d05:meMA.Exaposteilarion2.incipit	@ltx/swh_ke_oak/me.m08.d05:meMA.Exaposteilarion2.incipit
ltx/swh_redirects_oak/me.m08.d05:meMA.Exaposteilarion2.melody	@ltx/swh_ke_oak/me.m08.d05:meMA.Exaposteilarion2.melody
ltx/swh_redirects_oak/me.m08.d05:meMA.Exaposteilarion2.mode	@ltx/swh_ke_oak/me.m08.d05:meMA.Exaposteilarion2.mode
ltx/swh_redirects_oak/me.m08.d05:meMA.Exaposteilarion2.text	@ltx/swh_ke_oak/me.m08.d05:meMA.Exaposteilarion2.text
ltx/swh_redirects_oak/me.m08.d05:meMA.Kathisma11.greekmelody	@ltx/swh_ke_oak/me.m08.d05:meMA.Kathisma11.greekmelody
ltx/swh_redirects_oak/me.m08.d05:meMA.Kathisma11.incipit	@ltx/swh_ke_oak/me.m08.d05:meMA.Kathisma11.incipit
ltx/swh_redirects_oak/me.m08.d05:meMA.Kathisma11.melody	@ltx/swh_ke_oak/me.m08.d05:meMA.Kathisma11.melody
ltx/swh_redirects_oak/me.m08.d05:meMA.Kathisma11.mode	@ltx/swh_ke_oak/me.m08.d05:meMA.Kathisma11.mode
ltx/swh_redirects_oak/me.m08.d05:meMA.Kathisma11.text	@ltx/swh_ke_oak/me.m08.d05:meMA.Kathisma11.text
ltx/swh_redirects_oak/me.m08.d05:meMA.Kathisma21.greekmelody	@ltx/swh_ke_oak/me.m08.d05:meMA.Kathisma21.greekmelody
ltx/swh_redirects_oak/me.m08.d05:meMA.Kathisma21.incipit	@ltx/swh_ke_oak/me.m08.d05:meMA.Kathisma21.incipit
ltx/swh_redirects_oak/me.m08.d05:meMA.Kathisma21.melody	@ltx/swh_ke_oak/me.m08.d05:meMA.Kathisma21.melody
ltx/swh_redirects_oak/me.m08.d05:meMA.Kathisma21.mode	@ltx/swh_ke_oak/me.m08.d05:meMA.Kathisma21.mode
ltx/swh_redirects_oak/me.m08.d05:meMA.Kathisma21.text	@ltx/swh_ke_oak/me.m08.d05:meMA.Kathisma21.text
ltx/swh_redirects_oak/me.m08.d05:meMA.Kontakion1.greekmelody	@ltx/swh_ke_oak/me.m08.d05:meMA.Kontakion1.greekmelody
ltx/swh_redirects_oak/me.m08.d05:meMA.Kontakion1.incipit	@ltx/swh_ke_oak/me.m08.d05:meMA.Kontakion1.incipit
ltx/swh_redirects_oak/me.m08.d05:meMA.Kontakion1.melody	@ltx/swh_ke_oak/me.m08.d05:meMA.Kontakion1.melody
ltx/swh_redirects_oak/me.m08.d05:meMA.Kontakion1.mode	@ltx/swh_ke_oak/me.m08.d05:meMA.Kontakion1.mode
ltx/swh_redirects_oak/me.m08.d05:meMA.Kontakion1.text	@ltx/swh_ke_oak/me.m08.d05:meMA.Kontakion1.text
ltx/swh_redirects_oak/me.m08.d05:meMA.Kontakion2.incipit	@ltx/swh_ke_oak/me.m08.d05:meMA.Kontakion2.incipit
ltx/swh_redirects_oak/me.m08.d05:meMA.Kontakion2.melody	@ltx/swh_ke_oak/me.m08.d05:meMA.Kontakion2.melody
ltx/swh_redirects_oak/me.m08.d05:meMA.Kontakion2.mode	@ltx/swh_ke_oak/me.m08.d05:meMA.Kontakion2.mode
ltx/swh_redirects_oak/me.m08.d05:meMA.Kontakion2.text	@ltx/swh_ke_oak/me.m08.d05:meMA.Kontakion2.text
ltx/swh_redirects_oak/me.m08.d05:meMA.MM.Apos1123as5678	@ltx/swh_ke_oak/me.m08.d05:meMA.MM.Apos1123as5678
ltx/swh_redirects_oak/me.m08.d05:meMA.Ode1C11.greekmelody	@ltx/swh_ke_oak/me.m08.d05:meMA.Ode1C11.greekmelody
ltx/swh_redirects_oak/me.m08.d05:meMA.Ode1C11.incipit	@ltx/swh_ke_oak/me.m08.d05:meMA.Ode1C11.incipit
ltx/swh_redirects_oak/me.m08.d05:meMA.Ode1C11.melody	@ltx/swh_ke_oak/me.m08.d05:meMA.Ode1C11.melody
ltx/swh_redirects_oak/me.m08.d05:meMA.Ode1C11.mode	@ltx/swh_ke_oak/me.m08.d05:meMA.Ode1C11.mode
ltx/swh_redirects_oak/me.m08.d05:meMA.Ode1C11.ode	@ltx/swh_ke_oak/me.m08.d05:meMA.Ode1C11.ode
ltx/swh_redirects_oak/me.m08.d05:meMA.Ode1C11.text	@ltx/swh_ke_oak/me.m08.d05:meMA.Ode1C11.text
ltx/swh_redirects_oak/me.m08.d05:meMA.Ode1C12.incipit	@ltx/swh_ke_oak/me.m08.d05:meMA.Ode1C12.incipit
ltx/swh_redirects_oak/me.m08.d05:meMA.Ode1C12.melody	@ltx/swh_ke_oak/me.m08.d05:meMA.Ode1C12.melody
ltx/swh_redirects_oak/me.m08.d05:meMA.Ode1C12.mode	@ltx/swh_ke_oak/me.m08.d05:meMA.Ode1C12.mode
ltx/swh_redirects_oak/me.m08.d05:meMA.Ode1C12.ode	@ltx/swh_ke_oak/me.m08.d05:meMA.Ode1C12.ode
ltx/swh_redirects_oak/me.m08.d05:meMA.Ode1C12.text	@ltx/swh_ke_oak/me.m08.d05:meMA.Ode1C12.text
ltx/swh_redirects_oak/me.m08.d05:meMA.Ode1C13.incipit	@ltx/swh_ke_oak/me.m08.d05:meMA.Ode1C13.incipit
ltx/swh_redirects_oak/me.m08.d05:meMA.Ode1C13.melody	@ltx/swh_ke_oak/me.m08.d05:meMA.Ode1C13.melody
ltx/swh_redirects_oak/me.m08.d05:meMA.Ode1C13.mode	@ltx/swh_ke_oak/me.m08.d05:meMA.Ode1C13.mode
ltx/swh_redirects_oak/me.m08.d05:meMA.Ode1C13.ode	@ltx/swh_ke_oak/me.m08.d05:meMA.Ode1C13.ode
ltx/swh_redirects_oak/me.m08.d05:meMA.Ode1C13.text	@ltx/swh_ke_oak/me.m08.d05:meMA.Ode1C13.text
ltx/swh_redirects_oak/me.m08.d05:meMA.Ode1C1H.greekmelody	@ltx/swh_ke_oak/me.m08.d05:meMA.Ode1C1H.greekmelody
ltx/swh_redirects_oak/me.m08.d05:meMA.Ode1C1H.incipit	@ltx/swh_ke_oak/me.m08.d05:meMA.Ode1C1H.incipit
ltx/swh_redirects_oak/me.m08.d05:meMA.Ode1C1H.melody	@ltx/swh_ke_oak/me.m08.d05:meMA.Ode1C1H.melody
ltx/swh_redirects_oak/me.m08.d05:meMA.Ode1C1H.mode	@ltx/swh_ke_oak/me.m08.d05:meMA.Ode1C1H.mode
ltx/swh_redirects_oak/me.m08.d05:meMA.Ode1C1H.ode	@ltx/swh_ke_oak/me.m08.d05:meMA.Ode1C1H.ode
ltx/swh_redirects_oak/me.m08.d05:meMA.Ode1C1H.text	@ltx/swh_ke_oak/me.m08.d05:meMA.Ode1C1H.text
ltx/swh_redirects_oak/me.m08.d05:meMA.Ode1C21.greekmelody	@ltx/swh_ke_oak/me.m08.d05:meMA.Ode1C21.greekmelody
ltx/swh_redirects_oak/me.m08.d05:meMA.Ode1C21.incipit	@ltx/swh_ke_oak/me.m08.d05:meMA.Ode1C21.incipit
ltx/swh_redirects_oak/me.m08.d05:meMA.Ode1C21.melody	@ltx/swh_ke_oak/me.m08.d05:meMA.Ode1C21.melody
ltx/swh_redirects_oak/me.m08.d05:meMA.Ode1C21.mode	@ltx/swh_ke_oak/me.m08.d05:meMA.Ode1C21.mode
ltx/swh_redirects_oak/me.m08.d05:meMA.Ode1C21.ode	@ltx/swh_ke_oak/me.m08.d05:meMA.Ode1C21.ode
ltx/swh_redirects_oak/me.m08.d05:meMA.Ode1C21.text	@ltx/swh_ke_oak/me.m08.d05:meMA.Ode1C21.text
ltx/swh_redirects_oak/me.m08.d05:meMA.Ode1C22.incipit	@ltx/swh_ke_oak/me.m08.d05:meMA.Ode1C22.incipit
ltx/swh_redirects_oak/me.m08.d05:meMA.Ode1C22.melody	@ltx/swh_ke_oak/me.m08.d05:meMA.Ode1C22.melody
ltx/swh_redirects_oak/me.m08.d05:meMA.Ode1C22.mode	@ltx/swh_ke_oak/me.m08.d05:meMA.Ode1C22.mode
ltx/swh_redirects_oak/me.m08.d05:meMA.Ode1C22.ode	@ltx/swh_ke_oak/me.m08.d05:meMA.Ode1C22.ode
ltx/swh_redirects_oak/me.m08.d05:meMA.Ode1C22.text	@ltx/swh_ke_oak/me.m08.d05:meMA.Ode1C22.text
ltx/swh_redirects_oak/me.m08.d05:meMA.Ode1C23.incipit	@ltx/swh_ke_oak/me.m08.d05:meMA.Ode1C23.incipit
ltx/swh_redirects_oak/me.m08.d05:meMA.Ode1C23.melody	@ltx/swh_ke_oak/me.m08.d05:meMA.Ode1C23.melody
ltx/swh_redirects_oak/me.m08.d05:meMA.Ode1C23.mode	@ltx/swh_ke_oak/me.m08.d05:meMA.Ode1C23.mode
ltx/swh_redirects_oak/me.m08.d05:meMA.Ode1C23.ode	@ltx/swh_ke_oak/me.m08.d05:meMA.Ode1C23.ode
ltx/swh_redirects_oak/me.m08.d05:meMA.Ode1C23.text	@ltx/swh_ke_oak/me.m08.d05:meMA.Ode1C23.text
ltx/swh_redirects_oak/me.m08.d05:meMA.Ode1C24.incipit	@ltx/swh_ke_oak/me.m08.d05:meMA.Ode1C24.incipit
ltx/swh_redirects_oak/me.m08.d05:meMA.Ode1C24.melody	@ltx/swh_ke_oak/me.m08.d05:meMA.Ode1C24.melody
ltx/swh_redirects_oak/me.m08.d05:meMA.Ode1C24.mode	@ltx/swh_ke_oak/me.m08.d05:meMA.Ode1C24.mode
ltx/swh_redirects_oak/me.m08.d05:meMA.Ode1C24.ode	@ltx/swh_ke_oak/me.m08.d05:meMA.Ode1C24.ode
ltx/swh_redirects_oak/me.m08.d05:meMA.Ode1C24.text	@ltx/swh_ke_oak/me.m08.d05:meMA.Ode1C24.text
ltx/swh_redirects_oak/me.m08.d05:meMA.Ode1C2T.incipit	@ltx/swh_ke_oak/me.m08.d05:meMA.Ode1C2T.incipit
ltx/swh_redirects_oak/me.m08.d05:meMA.Ode1C2T.melody	@ltx/swh_ke_oak/me.m08.d05:meMA.Ode1C2T.melody
ltx/swh_redirects_oak/me.m08.d05:meMA.Ode1C2T.mode	@ltx/swh_ke_oak/me.m08.d05:meMA.Ode1C2T.mode
ltx/swh_redirects_oak/me.m08.d05:meMA.Ode1C2T.ode	@ltx/swh_ke_oak/me.m08.d05:meMA.Ode1C2T.ode
ltx/swh_redirects_oak/me.m08.d05:meMA.Ode1C2T.text	@ltx/swh_ke_oak/me.m08.d05:meMA.Ode1C2T.text
ltx/swh_redirects_oak/me.m08.d05:meMA.Ode1C31.greekmelody	@ltx/swh_ke_oak/me.m08.d05:meMA.Ode1C31.greekmelody
ltx/swh_redirects_oak/me.m08.d05:meMA.Ode1C31.incipit	@ltx/swh_ke_oak/me.m08.d05:meMA.Ode1C31.incipit
ltx/swh_redirects_oak/me.m08.d05:meMA.Ode1C31.melody	@ltx/swh_ke_oak/me.m08.d05:meMA.Ode1C31.melody
ltx/swh_redirects_oak/me.m08.d05:meMA.Ode1C31.mode	@ltx/swh_ke_oak/me.m08.d05:meMA.Ode1C31.mode
ltx/swh_redirects_oak/me.m08.d05:meMA.Ode1C31.ode	@ltx/swh_ke_oak/me.m08.d05:meMA.Ode1C31.ode
ltx/swh_redirects_oak/me.m08.d05:meMA.Ode1C31.text	@ltx/swh_ke_oak/me.m08.d05:meMA.Ode1C31.text
ltx/swh_redirects_oak/me.m08.d05:meMA.Ode1C32.incipit	@ltx/swh_ke_oak/me.m08.d05:meMA.Ode1C32.incipit
ltx/swh_redirects_oak/me.m08.d05:meMA.Ode1C32.melody	@ltx/swh_ke_oak/me.m08.d05:meMA.Ode1C32.melody
ltx/swh_redirects_oak/me.m08.d05:meMA.Ode1C32.mode	@ltx/swh_ke_oak/me.m08.d05:meMA.Ode1C32.mode
ltx/swh_redirects_oak/me.m08.d05:meMA.Ode1C32.ode	@ltx/swh_ke_oak/me.m08.d05:meMA.Ode1C32.ode
ltx/swh_redirects_oak/me.m08.d05:meMA.Ode1C32.text	@ltx/swh_ke_oak/me.m08.d05:meMA.Ode1C32.text
ltx/swh_redirects_oak/me.m08.d05:meMA.Ode1C33.incipit	@ltx/swh_ke_oak/me.m08.d05:meMA.Ode1C33.incipit
ltx/swh_redirects_oak/me.m08.d05:meMA.Ode1C33.melody	@ltx/swh_ke_oak/me.m08.d05:meMA.Ode1C33.melody
ltx/swh_redirects_oak/me.m08.d05:meMA.Ode1C33.mode	@ltx/swh_ke_oak/me.m08.d05:meMA.Ode1C33.mode
ltx/swh_redirects_oak/me.m08.d05:meMA.Ode1C33.ode	@ltx/swh_ke_oak/me.m08.d05:meMA.Ode1C33.ode
ltx/swh_redirects_oak/me.m08.d05:meMA.Ode1C33.text	@ltx/swh_ke_oak/me.m08.d05:meMA.Ode1C33.text
ltx/swh_redirects_oak/me.m08.d05:meMA.Ode1C3T.incipit	@ltx/swh_ke_oak/me.m08.d05:meMA.Ode1C3T.incipit
ltx/swh_redirects_oak/me.m08.d05:meMA.Ode1C3T.melody	@ltx/swh_ke_oak/me.m08.d05:meMA.Ode1C3T.melody
ltx/swh_redirects_oak/me.m08.d05:meMA.Ode1C3T.mode	@ltx/swh_ke_oak/me.m08.d05:meMA.Ode1C3T.mode
ltx/swh_redirects_oak/me.m08.d05:meMA.Ode1C3T.ode	@ltx/swh_ke_oak/me.m08.d05:meMA.Ode1C3T.ode
ltx/swh_redirects_oak/me.m08.d05:meMA.Ode1C3T.text	@ltx/swh_ke_oak/me.m08.d05:meMA.Ode1C3T.text
ltx/swh_redirects_oak/me.m08.d05:meMA.Ode1C3Tr.incipit	@ltx/swh_ke_oak/me.m08.d05:meMA.Ode1C3Tr.incipit
ltx/swh_redirects_oak/me.m08.d05:meMA.Ode1C3Tr.melody	@ltx/swh_ke_oak/me.m08.d05:meMA.Ode1C3Tr.melody
ltx/swh_redirects_oak/me.m08.d05:meMA.Ode1C3Tr.mode	@ltx/swh_ke_oak/me.m08.d05:meMA.Ode1C3Tr.mode
ltx/swh_redirects_oak/me.m08.d05:meMA.Ode1C3Tr.ode	@ltx/swh_ke_oak/me.m08.d05:meMA.Ode1C3Tr.ode
ltx/swh_redirects_oak/me.m08.d05:meMA.Ode1C3Tr.text	@ltx/swh_ke_oak/me.m08.d05:meMA.Ode1C3Tr.text
ltx/swh_redirects_oak/me.m08.d05:meMA.Ode3C11.greekmelody	@ltx/swh_ke_oak/me.m08.d05:meMA.Ode3C11.greekmelody
ltx/swh_redirects_oak/me.m08.d05:meMA.Ode3C11.incipit	@ltx/swh_ke_oak/me.m08.d05:meMA.Ode3C11.incipit
ltx/swh_redirects_oak/me.m08.d05:meMA.Ode3C11.melody	@ltx/swh_ke_oak/me.m08.d05:meMA.Ode3C11.melody
ltx/swh_redirects_oak/me.m08.d05:meMA.Ode3C11.mode	@ltx/swh_ke_oak/me.m08.d05:meMA.Ode3C11.mode
ltx/swh_redirects_oak/me.m08.d05:meMA.Ode3C11.ode	@ltx/swh_ke_oak/me.m08.d05:meMA.Ode3C11.ode
ltx/swh_redirects_oak/me.m08.d05:meMA.Ode3C11.text	@ltx/swh_ke_oak/me.m08.d05:meMA.Ode3C11.text
ltx/swh_redirects_oak/me.m08.d05:meMA.Ode3C12.incipit	@ltx/swh_ke_oak/me.m08.d05:meMA.Ode3C12.incipit
ltx/swh_redirects_oak/me.m08.d05:meMA.Ode3C12.melody	@ltx/swh_ke_oak/me.m08.d05:meMA.Ode3C12.melody
ltx/swh_redirects_oak/me.m08.d05:meMA.Ode3C12.mode	@ltx/swh_ke_oak/me.m08.d05:meMA.Ode3C12.mode
ltx/swh_redirects_oak/me.m08.d05:meMA.Ode3C12.ode	@ltx/swh_ke_oak/me.m08.d05:meMA.Ode3C12.ode
ltx/swh_redirects_oak/me.m08.d05:meMA.Ode3C12.text	@ltx/swh_ke_oak/me.m08.d05:meMA.Ode3C12.text
ltx/swh_redirects_oak/me.m08.d05:meMA.Ode3C13.incipit	@ltx/swh_ke_oak/me.m08.d05:meMA.Ode3C13.incipit
ltx/swh_redirects_oak/me.m08.d05:meMA.Ode3C13.melody	@ltx/swh_ke_oak/me.m08.d05:meMA.Ode3C13.melody
ltx/swh_redirects_oak/me.m08.d05:meMA.Ode3C13.mode	@ltx/swh_ke_oak/me.m08.d05:meMA.Ode3C13.mode
ltx/swh_redirects_oak/me.m08.d05:meMA.Ode3C13.ode	@ltx/swh_ke_oak/me.m08.d05:meMA.Ode3C13.ode
ltx/swh_redirects_oak/me.m08.d05:meMA.Ode3C13.text	@ltx/swh_ke_oak/me.m08.d05:meMA.Ode3C13.text
ltx/swh_redirects_oak/me.m08.d05:meMA.Ode3C1H.greekmelody	@ltx/swh_ke_oak/me.m08.d05:meMA.Ode3C1H.greekmelody
ltx/swh_redirects_oak/me.m08.d05:meMA.Ode3C1H.incipit	@ltx/swh_ke_oak/me.m08.d05:meMA.Ode3C1H.incipit
ltx/swh_redirects_oak/me.m08.d05:meMA.Ode3C1H.melody	@ltx/swh_ke_oak/me.m08.d05:meMA.Ode3C1H.melody
ltx/swh_redirects_oak/me.m08.d05:meMA.Ode3C1H.mode	@ltx/swh_ke_oak/me.m08.d05:meMA.Ode3C1H.mode
ltx/swh_redirects_oak/me.m08.d05:meMA.Ode3C1H.ode	@ltx/swh_ke_oak/me.m08.d05:meMA.Ode3C1H.ode
ltx/swh_redirects_oak/me.m08.d05:meMA.Ode3C1H.text	@ltx/swh_ke_oak/me.m08.d05:meMA.Ode3C1H.text
ltx/swh_redirects_oak/me.m08.d05:meMA.Ode3C21.greekmelody	@ltx/swh_ke_oak/me.m08.d05:meMA.Ode3C21.greekmelody
ltx/swh_redirects_oak/me.m08.d05:meMA.Ode3C21.incipit	@ltx/swh_ke_oak/me.m08.d05:meMA.Ode3C21.incipit
ltx/swh_redirects_oak/me.m08.d05:meMA.Ode3C21.melody	@ltx/swh_ke_oak/me.m08.d05:meMA.Ode3C21.melody
ltx/swh_redirects_oak/me.m08.d05:meMA.Ode3C21.mode	@ltx/swh_ke_oak/me.m08.d05:meMA.Ode3C21.mode
ltx/swh_redirects_oak/me.m08.d05:meMA.Ode3C21.ode	@ltx/swh_ke_oak/me.m08.d05:meMA.Ode3C21.ode
ltx/swh_redirects_oak/me.m08.d05:meMA.Ode3C21.text	@ltx/swh_ke_oak/me.m08.d05:meMA.Ode3C21.text
ltx/swh_redirects_oak/me.m08.d05:meMA.Ode3C22.incipit	@ltx/swh_ke_oak/me.m08.d05:meMA.Ode3C22.incipit
ltx/swh_redirects_oak/me.m08.d05:meMA.Ode3C22.melody	@ltx/swh_ke_oak/me.m08.d05:meMA.Ode3C22.melody
ltx/swh_redirects_oak/me.m08.d05:meMA.Ode3C22.mode	@ltx/swh_ke_oak/me.m08.d05:meMA.Ode3C22.mode
ltx/swh_redirects_oak/me.m08.d05:meMA.Ode3C22.ode	@ltx/swh_ke_oak/me.m08.d05:meMA.Ode3C22.ode
ltx/swh_redirects_oak/me.m08.d05:meMA.Ode3C22.text	@ltx/swh_ke_oak/me.m08.d05:meMA.Ode3C22.text
ltx/swh_redirects_oak/me.m08.d05:meMA.Ode3C23.incipit	@ltx/swh_ke_oak/me.m08.d05:meMA.Ode3C23.incipit
ltx/swh_redirects_oak/me.m08.d05:meMA.Ode3C23.melody	@ltx/swh_ke_oak/me.m08.d05:meMA.Ode3C23.melody
ltx/swh_redirects_oak/me.m08.d05:meMA.Ode3C23.mode	@ltx/swh_ke_oak/me.m08.d05:meMA.Ode3C23.mode
ltx/swh_redirects_oak/me.m08.d05:meMA.Ode3C23.ode	@ltx/swh_ke_oak/me.m08.d05:meMA.Ode3C23.ode
ltx/swh_redirects_oak/me.m08.d05:meMA.Ode3C23.text	@ltx/swh_ke_oak/me.m08.d05:meMA.Ode3C23.text
ltx/swh_redirects_oak/me.m08.d05:meMA.Ode3C2T.incipit	@ltx/swh_ke_oak/me.m08.d05:meMA.Ode3C2T.incipit
ltx/swh_redirects_oak/me.m08.d05:meMA.Ode3C2T.melody	@ltx/swh_ke_oak/me.m08.d05:meMA.Ode3C2T.melody
ltx/swh_redirects_oak/me.m08.d05:meMA.Ode3C2T.mode	@ltx/swh_ke_oak/me.m08.d05:meMA.Ode3C2T.mode
ltx/swh_redirects_oak/me.m08.d05:meMA.Ode3C2T.ode	@ltx/swh_ke_oak/me.m08.d05:meMA.Ode3C2T.ode
ltx/swh_redirects_oak/me.m08.d05:meMA.Ode3C2T.text	@ltx/swh_ke_oak/me.m08.d05:meMA.Ode3C2T.text
ltx/swh_redirects_oak/me.m08.d05:meMA.Ode3H.greekmelody	@ltx/swh_ke_oak/me.m08.d05:meMA.Ode3H.greekmelody
ltx/swh_redirects_oak/me.m08.d05:meMA.Ode3H.incipit	@ltx/swh_ke_oak/me.m08.d05:meMA.Ode3H.incipit
ltx/swh_redirects_oak/me.m08.d05:meMA.Ode3H.melody	@ltx/swh_ke_oak/me.m08.d05:meMA.Ode3H.melody
ltx/swh_redirects_oak/me.m08.d05:meMA.Ode3H.mode	@ltx/swh_ke_oak/me.m08.d05:meMA.Ode3H.mode
ltx/swh_redirects_oak/me.m08.d05:meMA.Ode3H.ode	@ltx/swh_ke_oak/me.m08.d05:meMA.Ode3H.ode
ltx/swh_redirects_oak/me.m08.d05:meMA.Ode3H.text	@ltx/swh_ke_oak/me.m08.d05:meMA.Ode3H.text
ltx/swh_redirects_oak/me.m08.d05:meMA.Ode3Kathisma1.greekmelody	@ltx/swh_ke_oak/me.m08.d05:meMA.Ode3Kathisma1.greekmelody
ltx/swh_redirects_oak/me.m08.d05:meMA.Ode3Kathisma1.incipit	@ltx/swh_ke_oak/me.m08.d05:meMA.Ode3Kathisma1.incipit
ltx/swh_redirects_oak/me.m08.d05:meMA.Ode3Kathisma1.melody	@ltx/swh_ke_oak/me.m08.d05:meMA.Ode3Kathisma1.melody
ltx/swh_redirects_oak/me.m08.d05:meMA.Ode3Kathisma1.mode	@ltx/swh_ke_oak/me.m08.d05:meMA.Ode3Kathisma1.mode
ltx/swh_redirects_oak/me.m08.d05:meMA.Ode3Kathisma1.text	@ltx/swh_ke_oak/me.m08.d05:meMA.Ode3Kathisma1.text
ltx/swh_redirects_oak/me.m08.d05:meMA.Ode3Kathisma2.greekmelody	@ltx/swh_ke_oak/me.m08.d05:meMA.Ode3Kathisma2.greekmelody
ltx/swh_redirects_oak/me.m08.d05:meMA.Ode3Kathisma2.incipit	@ltx/swh_ke_oak/me.m08.d05:meMA.Ode3Kathisma2.incipit
ltx/swh_redirects_oak/me.m08.d05:meMA.Ode3Kathisma2.melody	@ltx/swh_ke_oak/me.m08.d05:meMA.Ode3Kathisma2.melody
ltx/swh_redirects_oak/me.m08.d05:meMA.Ode3Kathisma2.mode	@ltx/swh_ke_oak/me.m08.d05:meMA.Ode3Kathisma2.mode
ltx/swh_redirects_oak/me.m08.d05:meMA.Ode3Kathisma2.text	@ltx/swh_ke_oak/me.m08.d05:meMA.Ode3Kathisma2.text
ltx/swh_redirects_oak/me.m08.d05:meMA.Ode4C11.greekmelody	@ltx/swh_ke_oak/me.m08.d05:meMA.Ode4C11.greekmelody
ltx/swh_redirects_oak/me.m08.d05:meMA.Ode4C11.incipit	@ltx/swh_ke_oak/me.m08.d05:meMA.Ode4C11.incipit
ltx/swh_redirects_oak/me.m08.d05:meMA.Ode4C11.melody	@ltx/swh_ke_oak/me.m08.d05:meMA.Ode4C11.melody
ltx/swh_redirects_oak/me.m08.d05:meMA.Ode4C11.mode	@ltx/swh_ke_oak/me.m08.d05:meMA.Ode4C11.mode
ltx/swh_redirects_oak/me.m08.d05:meMA.Ode4C11.ode	@ltx/swh_ke_oak/me.m08.d05:meMA.Ode4C11.ode
ltx/swh_redirects_oak/me.m08.d05:meMA.Ode4C11.text	@ltx/swh_ke_oak/me.m08.d05:meMA.Ode4C11.text
ltx/swh_redirects_oak/me.m08.d05:meMA.Ode4C12.incipit	@ltx/swh_ke_oak/me.m08.d05:meMA.Ode4C12.incipit
ltx/swh_redirects_oak/me.m08.d05:meMA.Ode4C12.melody	@ltx/swh_ke_oak/me.m08.d05:meMA.Ode4C12.melody
ltx/swh_redirects_oak/me.m08.d05:meMA.Ode4C12.mode	@ltx/swh_ke_oak/me.m08.d05:meMA.Ode4C12.mode
ltx/swh_redirects_oak/me.m08.d05:meMA.Ode4C12.ode	@ltx/swh_ke_oak/me.m08.d05:meMA.Ode4C12.ode
ltx/swh_redirects_oak/me.m08.d05:meMA.Ode4C12.text	@ltx/swh_ke_oak/me.m08.d05:meMA.Ode4C12.text
ltx/swh_redirects_oak/me.m08.d05:meMA.Ode4C13.incipit	@ltx/swh_ke_oak/me.m08.d05:meMA.Ode4C13.incipit
ltx/swh_redirects_oak/me.m08.d05:meMA.Ode4C13.melody	@ltx/swh_ke_oak/me.m08.d05:meMA.Ode4C13.melody
ltx/swh_redirects_oak/me.m08.d05:meMA.Ode4C13.mode	@ltx/swh_ke_oak/me.m08.d05:meMA.Ode4C13.mode
ltx/swh_redirects_oak/me.m08.d05:meMA.Ode4C13.ode	@ltx/swh_ke_oak/me.m08.d05:meMA.Ode4C13.ode
ltx/swh_redirects_oak/me.m08.d05:meMA.Ode4C13.text	@ltx/swh_ke_oak/me.m08.d05:meMA.Ode4C13.text
ltx/swh_redirects_oak/me.m08.d05:meMA.Ode4C1H.greekmelody	@ltx/swh_ke_oak/me.m08.d05:meMA.Ode4C1H.greekmelody
ltx/swh_redirects_oak/me.m08.d05:meMA.Ode4C1H.incipit	@ltx/swh_ke_oak/me.m08.d05:meMA.Ode4C1H.incipit
ltx/swh_redirects_oak/me.m08.d05:meMA.Ode4C1H.melody	@ltx/swh_ke_oak/me.m08.d05:meMA.Ode4C1H.melody
ltx/swh_redirects_oak/me.m08.d05:meMA.Ode4C1H.mode	@ltx/swh_ke_oak/me.m08.d05:meMA.Ode4C1H.mode
ltx/swh_redirects_oak/me.m08.d05:meMA.Ode4C1H.ode	@ltx/swh_ke_oak/me.m08.d05:meMA.Ode4C1H.ode
ltx/swh_redirects_oak/me.m08.d05:meMA.Ode4C1H.text	@ltx/swh_ke_oak/me.m08.d05:meMA.Ode4C1H.text
ltx/swh_redirects_oak/me.m08.d05:meMA.Ode4C21.greekmelody	@ltx/swh_ke_oak/me.m08.d05:meMA.Ode4C21.greekmelody
ltx/swh_redirects_oak/me.m08.d05:meMA.Ode4C21.incipit	@ltx/swh_ke_oak/me.m08.d05:meMA.Ode4C21.incipit
ltx/swh_redirects_oak/me.m08.d05:meMA.Ode4C21.melody	@ltx/swh_ke_oak/me.m08.d05:meMA.Ode4C21.melody
ltx/swh_redirects_oak/me.m08.d05:meMA.Ode4C21.mode	@ltx/swh_ke_oak/me.m08.d05:meMA.Ode4C21.mode
ltx/swh_redirects_oak/me.m08.d05:meMA.Ode4C21.ode	@ltx/swh_ke_oak/me.m08.d05:meMA.Ode4C21.ode
ltx/swh_redirects_oak/me.m08.d05:meMA.Ode4C21.text	@ltx/swh_ke_oak/me.m08.d05:meMA.Ode4C21.text
ltx/swh_redirects_oak/me.m08.d05:meMA.Ode4C22.incipit	@ltx/swh_ke_oak/me.m08.d05:meMA.Ode4C22.incipit
ltx/swh_redirects_oak/me.m08.d05:meMA.Ode4C22.melody	@ltx/swh_ke_oak/me.m08.d05:meMA.Ode4C22.melody
ltx/swh_redirects_oak/me.m08.d05:meMA.Ode4C22.mode	@ltx/swh_ke_oak/me.m08.d05:meMA.Ode4C22.mode
ltx/swh_redirects_oak/me.m08.d05:meMA.Ode4C22.ode	@ltx/swh_ke_oak/me.m08.d05:meMA.Ode4C22.ode
ltx/swh_redirects_oak/me.m08.d05:meMA.Ode4C22.text	@ltx/swh_ke_oak/me.m08.d05:meMA.Ode4C22.text
ltx/swh_redirects_oak/me.m08.d05:meMA.Ode4C23.incipit	@ltx/swh_ke_oak/me.m08.d05:meMA.Ode4C23.incipit
ltx/swh_redirects_oak/me.m08.d05:meMA.Ode4C23.melody	@ltx/swh_ke_oak/me.m08.d05:meMA.Ode4C23.melody
ltx/swh_redirects_oak/me.m08.d05:meMA.Ode4C23.mode	@ltx/swh_ke_oak/me.m08.d05:meMA.Ode4C23.mode
ltx/swh_redirects_oak/me.m08.d05:meMA.Ode4C23.ode	@ltx/swh_ke_oak/me.m08.d05:meMA.Ode4C23.ode
ltx/swh_redirects_oak/me.m08.d05:meMA.Ode4C23.text	@ltx/swh_ke_oak/me.m08.d05:meMA.Ode4C23.text
ltx/swh_redirects_oak/me.m08.d05:meMA.Ode4C24.incipit	@ltx/swh_ke_oak/me.m08.d05:meMA.Ode4C24.incipit
ltx/swh_redirects_oak/me.m08.d05:meMA.Ode4C24.melody	@ltx/swh_ke_oak/me.m08.d05:meMA.Ode4C24.melody
ltx/swh_redirects_oak/me.m08.d05:meMA.Ode4C24.mode	@ltx/swh_ke_oak/me.m08.d05:meMA.Ode4C24.mode
ltx/swh_redirects_oak/me.m08.d05:meMA.Ode4C24.ode	@ltx/swh_ke_oak/me.m08.d05:meMA.Ode4C24.ode
ltx/swh_redirects_oak/me.m08.d05:meMA.Ode4C24.text	@ltx/swh_ke_oak/me.m08.d05:meMA.Ode4C24.text
ltx/swh_redirects_oak/me.m08.d05:meMA.Ode4C2T.incipit	@ltx/swh_ke_oak/me.m08.d05:meMA.Ode4C2T.incipit
ltx/swh_redirects_oak/me.m08.d05:meMA.Ode4C2T.melody	@ltx/swh_ke_oak/me.m08.d05:meMA.Ode4C2T.melody
ltx/swh_redirects_oak/me.m08.d05:meMA.Ode4C2T.mode	@ltx/swh_ke_oak/me.m08.d05:meMA.Ode4C2T.mode
ltx/swh_redirects_oak/me.m08.d05:meMA.Ode4C2T.ode	@ltx/swh_ke_oak/me.m08.d05:meMA.Ode4C2T.ode
ltx/swh_redirects_oak/me.m08.d05:meMA.Ode4C2T.text	@ltx/swh_ke_oak/me.m08.d05:meMA.Ode4C2T.text
ltx/swh_redirects_oak/me.m08.d05:meMA.Ode5C11.greekmelody	@ltx/swh_ke_oak/me.m08.d05:meMA.Ode5C11.greekmelody
ltx/swh_redirects_oak/me.m08.d05:meMA.Ode5C11.incipit	@ltx/swh_ke_oak/me.m08.d05:meMA.Ode5C11.incipit
ltx/swh_redirects_oak/me.m08.d05:meMA.Ode5C11.melody	@ltx/swh_ke_oak/me.m08.d05:meMA.Ode5C11.melody
ltx/swh_redirects_oak/me.m08.d05:meMA.Ode5C11.mode	@ltx/swh_ke_oak/me.m08.d05:meMA.Ode5C11.mode
ltx/swh_redirects_oak/me.m08.d05:meMA.Ode5C11.ode	@ltx/swh_ke_oak/me.m08.d05:meMA.Ode5C11.ode
ltx/swh_redirects_oak/me.m08.d05:meMA.Ode5C11.text	@ltx/swh_ke_oak/me.m08.d05:meMA.Ode5C11.text
ltx/swh_redirects_oak/me.m08.d05:meMA.Ode5C12.incipit	@ltx/swh_ke_oak/me.m08.d05:meMA.Ode5C12.incipit
ltx/swh_redirects_oak/me.m08.d05:meMA.Ode5C12.melody	@ltx/swh_ke_oak/me.m08.d05:meMA.Ode5C12.melody
ltx/swh_redirects_oak/me.m08.d05:meMA.Ode5C12.mode	@ltx/swh_ke_oak/me.m08.d05:meMA.Ode5C12.mode
ltx/swh_redirects_oak/me.m08.d05:meMA.Ode5C12.ode	@ltx/swh_ke_oak/me.m08.d05:meMA.Ode5C12.ode
ltx/swh_redirects_oak/me.m08.d05:meMA.Ode5C12.text	@ltx/swh_ke_oak/me.m08.d05:meMA.Ode5C12.text
ltx/swh_redirects_oak/me.m08.d05:meMA.Ode5C13.incipit	@ltx/swh_ke_oak/me.m08.d05:meMA.Ode5C13.incipit
ltx/swh_redirects_oak/me.m08.d05:meMA.Ode5C13.melody	@ltx/swh_ke_oak/me.m08.d05:meMA.Ode5C13.melody
ltx/swh_redirects_oak/me.m08.d05:meMA.Ode5C13.mode	@ltx/swh_ke_oak/me.m08.d05:meMA.Ode5C13.mode
ltx/swh_redirects_oak/me.m08.d05:meMA.Ode5C13.ode	@ltx/swh_ke_oak/me.m08.d05:meMA.Ode5C13.ode
ltx/swh_redirects_oak/me.m08.d05:meMA.Ode5C13.text	@ltx/swh_ke_oak/me.m08.d05:meMA.Ode5C13.text
ltx/swh_redirects_oak/me.m08.d05:meMA.Ode5C1H.greekmelody	@ltx/swh_ke_oak/me.m08.d05:meMA.Ode5C1H.greekmelody
ltx/swh_redirects_oak/me.m08.d05:meMA.Ode5C1H.incipit	@ltx/swh_ke_oak/me.m08.d05:meMA.Ode5C1H.incipit
ltx/swh_redirects_oak/me.m08.d05:meMA.Ode5C1H.melody	@ltx/swh_ke_oak/me.m08.d05:meMA.Ode5C1H.melody
ltx/swh_redirects_oak/me.m08.d05:meMA.Ode5C1H.mode	@ltx/swh_ke_oak/me.m08.d05:meMA.Ode5C1H.mode
ltx/swh_redirects_oak/me.m08.d05:meMA.Ode5C1H.ode	@ltx/swh_ke_oak/me.m08.d05:meMA.Ode5C1H.ode
ltx/swh_redirects_oak/me.m08.d05:meMA.Ode5C1H.text	@ltx/swh_ke_oak/me.m08.d05:meMA.Ode5C1H.text
ltx/swh_redirects_oak/me.m08.d05:meMA.Ode5C21.greekmelody	@ltx/swh_ke_oak/me.m08.d05:meMA.Ode5C21.greekmelody
ltx/swh_redirects_oak/me.m08.d05:meMA.Ode5C21.incipit	@ltx/swh_ke_oak/me.m08.d05:meMA.Ode5C21.incipit
ltx/swh_redirects_oak/me.m08.d05:meMA.Ode5C21.melody	@ltx/swh_ke_oak/me.m08.d05:meMA.Ode5C21.melody
ltx/swh_redirects_oak/me.m08.d05:meMA.Ode5C21.mode	@ltx/swh_ke_oak/me.m08.d05:meMA.Ode5C21.mode
ltx/swh_redirects_oak/me.m08.d05:meMA.Ode5C21.ode	@ltx/swh_ke_oak/me.m08.d05:meMA.Ode5C21.ode
ltx/swh_redirects_oak/me.m08.d05:meMA.Ode5C21.text	@ltx/swh_ke_oak/me.m08.d05:meMA.Ode5C21.text
ltx/swh_redirects_oak/me.m08.d05:meMA.Ode5C22.incipit	@ltx/swh_ke_oak/me.m08.d05:meMA.Ode5C22.incipit
ltx/swh_redirects_oak/me.m08.d05:meMA.Ode5C22.melody	@ltx/swh_ke_oak/me.m08.d05:meMA.Ode5C22.melody
ltx/swh_redirects_oak/me.m08.d05:meMA.Ode5C22.mode	@ltx/swh_ke_oak/me.m08.d05:meMA.Ode5C22.mode
ltx/swh_redirects_oak/me.m08.d05:meMA.Ode5C22.ode	@ltx/swh_ke_oak/me.m08.d05:meMA.Ode5C22.ode
ltx/swh_redirects_oak/me.m08.d05:meMA.Ode5C22.text	@ltx/swh_ke_oak/me.m08.d05:meMA.Ode5C22.text
ltx/swh_redirects_oak/me.m08.d05:meMA.Ode5C23.incipit	@ltx/swh_ke_oak/me.m08.d05:meMA.Ode5C23.incipit
ltx/swh_redirects_oak/me.m08.d05:meMA.Ode5C23.melody	@ltx/swh_ke_oak/me.m08.d05:meMA.Ode5C23.melody
ltx/swh_redirects_oak/me.m08.d05:meMA.Ode5C23.mode	@ltx/swh_ke_oak/me.m08.d05:meMA.Ode5C23.mode
ltx/swh_redirects_oak/me.m08.d05:meMA.Ode5C23.ode	@ltx/swh_ke_oak/me.m08.d05:meMA.Ode5C23.ode
ltx/swh_redirects_oak/me.m08.d05:meMA.Ode5C23.text	@ltx/swh_ke_oak/me.m08.d05:meMA.Ode5C23.text
ltx/swh_redirects_oak/me.m08.d05:meMA.Ode5C2T.incipit	@ltx/swh_ke_oak/me.m08.d05:meMA.Ode5C2T.incipit
ltx/swh_redirects_oak/me.m08.d05:meMA.Ode5C2T.melody	@ltx/swh_ke_oak/me.m08.d05:meMA.Ode5C2T.melody
ltx/swh_redirects_oak/me.m08.d05:meMA.Ode5C2T.mode	@ltx/swh_ke_oak/me.m08.d05:meMA.Ode5C2T.mode
ltx/swh_redirects_oak/me.m08.d05:meMA.Ode5C2T.ode	@ltx/swh_ke_oak/me.m08.d05:meMA.Ode5C2T.ode
ltx/swh_redirects_oak/me.m08.d05:meMA.Ode5C2T.text	@ltx/swh_ke_oak/me.m08.d05:meMA.Ode5C2T.text
ltx/swh_redirects_oak/me.m08.d05:meMA.Ode6C11.greekmelody	@ltx/swh_ke_oak/me.m08.d05:meMA.Ode6C11.greekmelody
ltx/swh_redirects_oak/me.m08.d05:meMA.Ode6C11.incipit	@ltx/swh_ke_oak/me.m08.d05:meMA.Ode6C11.incipit
ltx/swh_redirects_oak/me.m08.d05:meMA.Ode6C11.melody	@ltx/swh_ke_oak/me.m08.d05:meMA.Ode6C11.melody
ltx/swh_redirects_oak/me.m08.d05:meMA.Ode6C11.mode	@ltx/swh_ke_oak/me.m08.d05:meMA.Ode6C11.mode
ltx/swh_redirects_oak/me.m08.d05:meMA.Ode6C11.ode	@ltx/swh_ke_oak/me.m08.d05:meMA.Ode6C11.ode
ltx/swh_redirects_oak/me.m08.d05:meMA.Ode6C11.text	@ltx/swh_ke_oak/me.m08.d05:meMA.Ode6C11.text
ltx/swh_redirects_oak/me.m08.d05:meMA.Ode6C12.incipit	@ltx/swh_ke_oak/me.m08.d05:meMA.Ode6C12.incipit
ltx/swh_redirects_oak/me.m08.d05:meMA.Ode6C12.melody	@ltx/swh_ke_oak/me.m08.d05:meMA.Ode6C12.melody
ltx/swh_redirects_oak/me.m08.d05:meMA.Ode6C12.mode	@ltx/swh_ke_oak/me.m08.d05:meMA.Ode6C12.mode
ltx/swh_redirects_oak/me.m08.d05:meMA.Ode6C12.ode	@ltx/swh_ke_oak/me.m08.d05:meMA.Ode6C12.ode
ltx/swh_redirects_oak/me.m08.d05:meMA.Ode6C12.text	@ltx/swh_ke_oak/me.m08.d05:meMA.Ode6C12.text
ltx/swh_redirects_oak/me.m08.d05:meMA.Ode6C13.incipit	@ltx/swh_ke_oak/me.m08.d05:meMA.Ode6C13.incipit
ltx/swh_redirects_oak/me.m08.d05:meMA.Ode6C13.melody	@ltx/swh_ke_oak/me.m08.d05:meMA.Ode6C13.melody
ltx/swh_redirects_oak/me.m08.d05:meMA.Ode6C13.mode	@ltx/swh_ke_oak/me.m08.d05:meMA.Ode6C13.mode
ltx/swh_redirects_oak/me.m08.d05:meMA.Ode6C13.ode	@ltx/swh_ke_oak/me.m08.d05:meMA.Ode6C13.ode
ltx/swh_redirects_oak/me.m08.d05:meMA.Ode6C13.text	@ltx/swh_ke_oak/me.m08.d05:meMA.Ode6C13.text
ltx/swh_redirects_oak/me.m08.d05:meMA.Ode6C1H.greekmelody	@ltx/swh_ke_oak/me.m08.d05:meMA.Ode6C1H.greekmelody
ltx/swh_redirects_oak/me.m08.d05:meMA.Ode6C1H.incipit	@ltx/swh_ke_oak/me.m08.d05:meMA.Ode6C1H.incipit
ltx/swh_redirects_oak/me.m08.d05:meMA.Ode6C1H.melody	@ltx/swh_ke_oak/me.m08.d05:meMA.Ode6C1H.melody
ltx/swh_redirects_oak/me.m08.d05:meMA.Ode6C1H.mode	@ltx/swh_ke_oak/me.m08.d05:meMA.Ode6C1H.mode
ltx/swh_redirects_oak/me.m08.d05:meMA.Ode6C1H.ode	@ltx/swh_ke_oak/me.m08.d05:meMA.Ode6C1H.ode
ltx/swh_redirects_oak/me.m08.d05:meMA.Ode6C1H.text	@ltx/swh_ke_oak/me.m08.d05:meMA.Ode6C1H.text
ltx/swh_redirects_oak/me.m08.d05:meMA.Ode6C21.greekmelody	@ltx/swh_ke_oak/me.m08.d05:meMA.Ode6C21.greekmelody
ltx/swh_redirects_oak/me.m08.d05:meMA.Ode6C21.incipit	@ltx/swh_ke_oak/me.m08.d05:meMA.Ode6C21.incipit
ltx/swh_redirects_oak/me.m08.d05:meMA.Ode6C21.melody	@ltx/swh_ke_oak/me.m08.d05:meMA.Ode6C21.melody
ltx/swh_redirects_oak/me.m08.d05:meMA.Ode6C21.mode	@ltx/swh_ke_oak/me.m08.d05:meMA.Ode6C21.mode
ltx/swh_redirects_oak/me.m08.d05:meMA.Ode6C21.ode	@ltx/swh_ke_oak/me.m08.d05:meMA.Ode6C21.ode
ltx/swh_redirects_oak/me.m08.d05:meMA.Ode6C21.text	@ltx/swh_ke_oak/me.m08.d05:meMA.Ode6C21.text
ltx/swh_redirects_oak/me.m08.d05:meMA.Ode6C22.incipit	@ltx/swh_ke_oak/me.m08.d05:meMA.Ode6C22.incipit
ltx/swh_redirects_oak/me.m08.d05:meMA.Ode6C22.melody	@ltx/swh_ke_oak/me.m08.d05:meMA.Ode6C22.melody
ltx/swh_redirects_oak/me.m08.d05:meMA.Ode6C22.mode	@ltx/swh_ke_oak/me.m08.d05:meMA.Ode6C22.mode
ltx/swh_redirects_oak/me.m08.d05:meMA.Ode6C22.ode	@ltx/swh_ke_oak/me.m08.d05:meMA.Ode6C22.ode
ltx/swh_redirects_oak/me.m08.d05:meMA.Ode6C22.text	@ltx/swh_ke_oak/me.m08.d05:meMA.Ode6C22.text
ltx/swh_redirects_oak/me.m08.d05:meMA.Ode6C23.incipit	@ltx/swh_ke_oak/me.m08.d05:meMA.Ode6C23.incipit
ltx/swh_redirects_oak/me.m08.d05:meMA.Ode6C23.melody	@ltx/swh_ke_oak/me.m08.d05:meMA.Ode6C23.melody
ltx/swh_redirects_oak/me.m08.d05:meMA.Ode6C23.mode	@ltx/swh_ke_oak/me.m08.d05:meMA.Ode6C23.mode
ltx/swh_redirects_oak/me.m08.d05:meMA.Ode6C23.ode	@ltx/swh_ke_oak/me.m08.d05:meMA.Ode6C23.ode
ltx/swh_redirects_oak/me.m08.d05:meMA.Ode6C23.text	@ltx/swh_ke_oak/me.m08.d05:meMA.Ode6C23.text
ltx/swh_redirects_oak/me.m08.d05:meMA.Ode6C2T.incipit	@ltx/swh_ke_oak/me.m08.d05:meMA.Ode6C2T.incipit
ltx/swh_redirects_oak/me.m08.d05:meMA.Ode6C2T.melody	@ltx/swh_ke_oak/me.m08.d05:meMA.Ode6C2T.melody
ltx/swh_redirects_oak/me.m08.d05:meMA.Ode6C2T.mode	@ltx/swh_ke_oak/me.m08.d05:meMA.Ode6C2T.mode
ltx/swh_redirects_oak/me.m08.d05:meMA.Ode6C2T.ode	@ltx/swh_ke_oak/me.m08.d05:meMA.Ode6C2T.ode
ltx/swh_redirects_oak/me.m08.d05:meMA.Ode6C2T.text	@ltx/swh_ke_oak/me.m08.d05:meMA.Ode6C2T.text
ltx/swh_redirects_oak/me.m08.d05:meMA.Ode6H.greekmelody	@ltx/swh_ke_oak/me.m08.d05:meMA.Ode6H.greekmelody
ltx/swh_redirects_oak/me.m08.d05:meMA.Ode6H.incipit	@ltx/swh_ke_oak/me.m08.d05:meMA.Ode6H.incipit
ltx/swh_redirects_oak/me.m08.d05:meMA.Ode6H.melody	@ltx/swh_ke_oak/me.m08.d05:meMA.Ode6H.melody
ltx/swh_redirects_oak/me.m08.d05:meMA.Ode6H.mode	@ltx/swh_ke_oak/me.m08.d05:meMA.Ode6H.mode
ltx/swh_redirects_oak/me.m08.d05:meMA.Ode6H.ode	@ltx/swh_ke_oak/me.m08.d05:meMA.Ode6H.ode
ltx/swh_redirects_oak/me.m08.d05:meMA.Ode6H.text	@ltx/swh_ke_oak/me.m08.d05:meMA.Ode6H.text
ltx/swh_redirects_oak/me.m08.d05:meMA.Ode7C11.greekmelody	@ltx/swh_ke_oak/me.m08.d05:meMA.Ode7C11.greekmelody
ltx/swh_redirects_oak/me.m08.d05:meMA.Ode7C11.incipit	@ltx/swh_ke_oak/me.m08.d05:meMA.Ode7C11.incipit
ltx/swh_redirects_oak/me.m08.d05:meMA.Ode7C11.melody	@ltx/swh_ke_oak/me.m08.d05:meMA.Ode7C11.melody
ltx/swh_redirects_oak/me.m08.d05:meMA.Ode7C11.mode	@ltx/swh_ke_oak/me.m08.d05:meMA.Ode7C11.mode
ltx/swh_redirects_oak/me.m08.d05:meMA.Ode7C11.ode	@ltx/swh_ke_oak/me.m08.d05:meMA.Ode7C11.ode
ltx/swh_redirects_oak/me.m08.d05:meMA.Ode7C11.text	@ltx/swh_ke_oak/me.m08.d05:meMA.Ode7C11.text
ltx/swh_redirects_oak/me.m08.d05:meMA.Ode7C12.incipit	@ltx/swh_ke_oak/me.m08.d05:meMA.Ode7C12.incipit
ltx/swh_redirects_oak/me.m08.d05:meMA.Ode7C12.melody	@ltx/swh_ke_oak/me.m08.d05:meMA.Ode7C12.melody
ltx/swh_redirects_oak/me.m08.d05:meMA.Ode7C12.mode	@ltx/swh_ke_oak/me.m08.d05:meMA.Ode7C12.mode
ltx/swh_redirects_oak/me.m08.d05:meMA.Ode7C12.ode	@ltx/swh_ke_oak/me.m08.d05:meMA.Ode7C12.ode
ltx/swh_redirects_oak/me.m08.d05:meMA.Ode7C12.text	@ltx/swh_ke_oak/me.m08.d05:meMA.Ode7C12.text
ltx/swh_redirects_oak/me.m08.d05:meMA.Ode7C13.incipit	@ltx/swh_ke_oak/me.m08.d05:meMA.Ode7C13.incipit
ltx/swh_redirects_oak/me.m08.d05:meMA.Ode7C13.melody	@ltx/swh_ke_oak/me.m08.d05:meMA.Ode7C13.melody
ltx/swh_redirects_oak/me.m08.d05:meMA.Ode7C13.mode	@ltx/swh_ke_oak/me.m08.d05:meMA.Ode7C13.mode
ltx/swh_redirects_oak/me.m08.d05:meMA.Ode7C13.ode	@ltx/swh_ke_oak/me.m08.d05:meMA.Ode7C13.ode
ltx/swh_redirects_oak/me.m08.d05:meMA.Ode7C13.text	@ltx/swh_ke_oak/me.m08.d05:meMA.Ode7C13.text
ltx/swh_redirects_oak/me.m08.d05:meMA.Ode7C1H.greekmelody	@ltx/swh_ke_oak/me.m08.d05:meMA.Ode7C1H.greekmelody
ltx/swh_redirects_oak/me.m08.d05:meMA.Ode7C1H.incipit	@ltx/swh_ke_oak/me.m08.d05:meMA.Ode7C1H.incipit
ltx/swh_redirects_oak/me.m08.d05:meMA.Ode7C1H.melody	@ltx/swh_ke_oak/me.m08.d05:meMA.Ode7C1H.melody
ltx/swh_redirects_oak/me.m08.d05:meMA.Ode7C1H.mode	@ltx/swh_ke_oak/me.m08.d05:meMA.Ode7C1H.mode
ltx/swh_redirects_oak/me.m08.d05:meMA.Ode7C1H.ode	@ltx/swh_ke_oak/me.m08.d05:meMA.Ode7C1H.ode
ltx/swh_redirects_oak/me.m08.d05:meMA.Ode7C1H.text	@ltx/swh_ke_oak/me.m08.d05:meMA.Ode7C1H.text
ltx/swh_redirects_oak/me.m08.d05:meMA.Ode7C21.greekmelody	@ltx/swh_ke_oak/me.m08.d05:meMA.Ode7C21.greekmelody
ltx/swh_redirects_oak/me.m08.d05:meMA.Ode7C21.incipit	@ltx/swh_ke_oak/me.m08.d05:meMA.Ode7C21.incipit
ltx/swh_redirects_oak/me.m08.d05:meMA.Ode7C21.melody	@ltx/swh_ke_oak/me.m08.d05:meMA.Ode7C21.melody
ltx/swh_redirects_oak/me.m08.d05:meMA.Ode7C21.mode	@ltx/swh_ke_oak/me.m08.d05:meMA.Ode7C21.mode
ltx/swh_redirects_oak/me.m08.d05:meMA.Ode7C21.ode	@ltx/swh_ke_oak/me.m08.d05:meMA.Ode7C21.ode
ltx/swh_redirects_oak/me.m08.d05:meMA.Ode7C21.text	@ltx/swh_ke_oak/me.m08.d05:meMA.Ode7C21.text
ltx/swh_redirects_oak/me.m08.d05:meMA.Ode7C22.incipit	@ltx/swh_ke_oak/me.m08.d05:meMA.Ode7C22.incipit
ltx/swh_redirects_oak/me.m08.d05:meMA.Ode7C22.melody	@ltx/swh_ke_oak/me.m08.d05:meMA.Ode7C22.melody
ltx/swh_redirects_oak/me.m08.d05:meMA.Ode7C22.mode	@ltx/swh_ke_oak/me.m08.d05:meMA.Ode7C22.mode
ltx/swh_redirects_oak/me.m08.d05:meMA.Ode7C22.ode	@ltx/swh_ke_oak/me.m08.d05:meMA.Ode7C22.ode
ltx/swh_redirects_oak/me.m08.d05:meMA.Ode7C22.text	@ltx/swh_ke_oak/me.m08.d05:meMA.Ode7C22.text
ltx/swh_redirects_oak/me.m08.d05:meMA.Ode7C23.incipit	@ltx/swh_ke_oak/me.m08.d05:meMA.Ode7C23.incipit
ltx/swh_redirects_oak/me.m08.d05:meMA.Ode7C23.melody	@ltx/swh_ke_oak/me.m08.d05:meMA.Ode7C23.melody
ltx/swh_redirects_oak/me.m08.d05:meMA.Ode7C23.mode	@ltx/swh_ke_oak/me.m08.d05:meMA.Ode7C23.mode
ltx/swh_redirects_oak/me.m08.d05:meMA.Ode7C23.ode	@ltx/swh_ke_oak/me.m08.d05:meMA.Ode7C23.ode
ltx/swh_redirects_oak/me.m08.d05:meMA.Ode7C23.text	@ltx/swh_ke_oak/me.m08.d05:meMA.Ode7C23.text
ltx/swh_redirects_oak/me.m08.d05:meMA.Ode7C24.incipit	@ltx/swh_ke_oak/me.m08.d05:meMA.Ode7C24.incipit
ltx/swh_redirects_oak/me.m08.d05:meMA.Ode7C24.melody	@ltx/swh_ke_oak/me.m08.d05:meMA.Ode7C24.melody
ltx/swh_redirects_oak/me.m08.d05:meMA.Ode7C24.mode	@ltx/swh_ke_oak/me.m08.d05:meMA.Ode7C24.mode
ltx/swh_redirects_oak/me.m08.d05:meMA.Ode7C24.ode	@ltx/swh_ke_oak/me.m08.d05:meMA.Ode7C24.ode
ltx/swh_redirects_oak/me.m08.d05:meMA.Ode7C24.text	@ltx/swh_ke_oak/me.m08.d05:meMA.Ode7C24.text
ltx/swh_redirects_oak/me.m08.d05:meMA.Ode7C2T.incipit	@ltx/swh_ke_oak/me.m08.d05:meMA.Ode7C2T.incipit
ltx/swh_redirects_oak/me.m08.d05:meMA.Ode7C2T.melody	@ltx/swh_ke_oak/me.m08.d05:meMA.Ode7C2T.melody
ltx/swh_redirects_oak/me.m08.d05:meMA.Ode7C2T.mode	@ltx/swh_ke_oak/me.m08.d05:meMA.Ode7C2T.mode
ltx/swh_redirects_oak/me.m08.d05:meMA.Ode7C2T.ode	@ltx/swh_ke_oak/me.m08.d05:meMA.Ode7C2T.ode
ltx/swh_redirects_oak/me.m08.d05:meMA.Ode7C2T.text	@ltx/swh_ke_oak/me.m08.d05:meMA.Ode7C2T.text
ltx/swh_redirects_oak/me.m08.d05:meMA.Ode8C11.greekmelody	@ltx/swh_ke_oak/me.m08.d05:meMA.Ode8C11.greekmelody
ltx/swh_redirects_oak/me.m08.d05:meMA.Ode8C11.incipit	@ltx/swh_ke_oak/me.m08.d05:meMA.Ode8C11.incipit
ltx/swh_redirects_oak/me.m08.d05:meMA.Ode8C11.melody	@ltx/swh_ke_oak/me.m08.d05:meMA.Ode8C11.melody
ltx/swh_redirects_oak/me.m08.d05:meMA.Ode8C11.mode	@ltx/swh_ke_oak/me.m08.d05:meMA.Ode8C11.mode
ltx/swh_redirects_oak/me.m08.d05:meMA.Ode8C11.ode	@ltx/swh_ke_oak/me.m08.d05:meMA.Ode8C11.ode
ltx/swh_redirects_oak/me.m08.d05:meMA.Ode8C11.text	@ltx/swh_ke_oak/me.m08.d05:meMA.Ode8C11.text
ltx/swh_redirects_oak/me.m08.d05:meMA.Ode8C12.incipit	@ltx/swh_ke_oak/me.m08.d05:meMA.Ode8C12.incipit
ltx/swh_redirects_oak/me.m08.d05:meMA.Ode8C12.melody	@ltx/swh_ke_oak/me.m08.d05:meMA.Ode8C12.melody
ltx/swh_redirects_oak/me.m08.d05:meMA.Ode8C12.mode	@ltx/swh_ke_oak/me.m08.d05:meMA.Ode8C12.mode
ltx/swh_redirects_oak/me.m08.d05:meMA.Ode8C12.ode	@ltx/swh_ke_oak/me.m08.d05:meMA.Ode8C12.ode
ltx/swh_redirects_oak/me.m08.d05:meMA.Ode8C12.text	@ltx/swh_ke_oak/me.m08.d05:meMA.Ode8C12.text
ltx/swh_redirects_oak/me.m08.d05:meMA.Ode8C13.incipit	@ltx/swh_ke_oak/me.m08.d05:meMA.Ode8C13.incipit
ltx/swh_redirects_oak/me.m08.d05:meMA.Ode8C13.melody	@ltx/swh_ke_oak/me.m08.d05:meMA.Ode8C13.melody
ltx/swh_redirects_oak/me.m08.d05:meMA.Ode8C13.mode	@ltx/swh_ke_oak/me.m08.d05:meMA.Ode8C13.mode
ltx/swh_redirects_oak/me.m08.d05:meMA.Ode8C13.ode	@ltx/swh_ke_oak/me.m08.d05:meMA.Ode8C13.ode
ltx/swh_redirects_oak/me.m08.d05:meMA.Ode8C13.text	@ltx/swh_ke_oak/me.m08.d05:meMA.Ode8C13.text
ltx/swh_redirects_oak/me.m08.d05:meMA.Ode8C1H.greekmelody	@ltx/swh_ke_oak/me.m08.d05:meMA.Ode8C1H.greekmelody
ltx/swh_redirects_oak/me.m08.d05:meMA.Ode8C1H.incipit	@ltx/swh_ke_oak/me.m08.d05:meMA.Ode8C1H.incipit
ltx/swh_redirects_oak/me.m08.d05:meMA.Ode8C1H.melody	@ltx/swh_ke_oak/me.m08.d05:meMA.Ode8C1H.melody
ltx/swh_redirects_oak/me.m08.d05:meMA.Ode8C1H.mode	@ltx/swh_ke_oak/me.m08.d05:meMA.Ode8C1H.mode
ltx/swh_redirects_oak/me.m08.d05:meMA.Ode8C1H.ode	@ltx/swh_ke_oak/me.m08.d05:meMA.Ode8C1H.ode
ltx/swh_redirects_oak/me.m08.d05:meMA.Ode8C1H.text	@ltx/swh_ke_oak/me.m08.d05:meMA.Ode8C1H.text
ltx/swh_redirects_oak/me.m08.d05:meMA.Ode8C21.greekmelody	@ltx/swh_ke_oak/me.m08.d05:meMA.Ode8C21.greekmelody
ltx/swh_redirects_oak/me.m08.d05:meMA.Ode8C21.incipit	@ltx/swh_ke_oak/me.m08.d05:meMA.Ode8C21.incipit
ltx/swh_redirects_oak/me.m08.d05:meMA.Ode8C21.melody	@ltx/swh_ke_oak/me.m08.d05:meMA.Ode8C21.melody
ltx/swh_redirects_oak/me.m08.d05:meMA.Ode8C21.mode	@ltx/swh_ke_oak/me.m08.d05:meMA.Ode8C21.mode
ltx/swh_redirects_oak/me.m08.d05:meMA.Ode8C21.ode	@ltx/swh_ke_oak/me.m08.d05:meMA.Ode8C21.ode
ltx/swh_redirects_oak/me.m08.d05:meMA.Ode8C21.text	@ltx/swh_ke_oak/me.m08.d05:meMA.Ode8C21.text
ltx/swh_redirects_oak/me.m08.d05:meMA.Ode8C22.incipit	@ltx/swh_ke_oak/me.m08.d05:meMA.Ode8C22.incipit
ltx/swh_redirects_oak/me.m08.d05:meMA.Ode8C22.melody	@ltx/swh_ke_oak/me.m08.d05:meMA.Ode8C22.melody
ltx/swh_redirects_oak/me.m08.d05:meMA.Ode8C22.mode	@ltx/swh_ke_oak/me.m08.d05:meMA.Ode8C22.mode
ltx/swh_redirects_oak/me.m08.d05:meMA.Ode8C22.ode	@ltx/swh_ke_oak/me.m08.d05:meMA.Ode8C22.ode
ltx/swh_redirects_oak/me.m08.d05:meMA.Ode8C22.text	@ltx/swh_ke_oak/me.m08.d05:meMA.Ode8C22.text
ltx/swh_redirects_oak/me.m08.d05:meMA.Ode8C23.incipit	@ltx/swh_ke_oak/me.m08.d05:meMA.Ode8C23.incipit
ltx/swh_redirects_oak/me.m08.d05:meMA.Ode8C23.melody	@ltx/swh_ke_oak/me.m08.d05:meMA.Ode8C23.melody
ltx/swh_redirects_oak/me.m08.d05:meMA.Ode8C23.mode	@ltx/swh_ke_oak/me.m08.d05:meMA.Ode8C23.mode
ltx/swh_redirects_oak/me.m08.d05:meMA.Ode8C23.ode	@ltx/swh_ke_oak/me.m08.d05:meMA.Ode8C23.ode
ltx/swh_redirects_oak/me.m08.d05:meMA.Ode8C23.text	@ltx/swh_ke_oak/me.m08.d05:meMA.Ode8C23.text
ltx/swh_redirects_oak/me.m08.d05:meMA.Ode8C24.incipit	@ltx/swh_ke_oak/me.m08.d05:meMA.Ode8C24.incipit
ltx/swh_redirects_oak/me.m08.d05:meMA.Ode8C24.melody	@ltx/swh_ke_oak/me.m08.d05:meMA.Ode8C24.melody
ltx/swh_redirects_oak/me.m08.d05:meMA.Ode8C24.mode	@ltx/swh_ke_oak/me.m08.d05:meMA.Ode8C24.mode
ltx/swh_redirects_oak/me.m08.d05:meMA.Ode8C24.ode	@ltx/swh_ke_oak/me.m08.d05:meMA.Ode8C24.ode
ltx/swh_redirects_oak/me.m08.d05:meMA.Ode8C24.text	@ltx/swh_ke_oak/me.m08.d05:meMA.Ode8C24.text
ltx/swh_redirects_oak/me.m08.d05:meMA.Ode8C2T.incipit	@ltx/swh_ke_oak/me.m08.d05:meMA.Ode8C2T.incipit
ltx/swh_redirects_oak/me.m08.d05:meMA.Ode8C2T.melody	@ltx/swh_ke_oak/me.m08.d05:meMA.Ode8C2T.melody
ltx/swh_redirects_oak/me.m08.d05:meMA.Ode8C2T.mode	@ltx/swh_ke_oak/me.m08.d05:meMA.Ode8C2T.mode
ltx/swh_redirects_oak/me.m08.d05:meMA.Ode8C2T.ode	@ltx/swh_ke_oak/me.m08.d05:meMA.Ode8C2T.ode
ltx/swh_redirects_oak/me.m08.d05:meMA.Ode8C2T.text	@ltx/swh_ke_oak/me.m08.d05:meMA.Ode8C2T.text
ltx/swh_redirects_oak/me.m08.d05:meMA.Ode8C31.greekmelody	@ltx/swh_ke_oak/me.m08.d05:meMA.Ode8C31.greekmelody
ltx/swh_redirects_oak/me.m08.d05:meMA.Ode8C31.incipit	@ltx/swh_ke_oak/me.m08.d05:meMA.Ode8C31.incipit
ltx/swh_redirects_oak/me.m08.d05:meMA.Ode8C31.melody	@ltx/swh_ke_oak/me.m08.d05:meMA.Ode8C31.melody
ltx/swh_redirects_oak/me.m08.d05:meMA.Ode8C31.mode	@ltx/swh_ke_oak/me.m08.d05:meMA.Ode8C31.mode
ltx/swh_redirects_oak/me.m08.d05:meMA.Ode8C31.ode	@ltx/swh_ke_oak/me.m08.d05:meMA.Ode8C31.ode
ltx/swh_redirects_oak/me.m08.d05:meMA.Ode8C31.text	@ltx/swh_ke_oak/me.m08.d05:meMA.Ode8C31.text
ltx/swh_redirects_oak/me.m08.d05:meMA.Ode8C32.incipit	@ltx/swh_ke_oak/me.m08.d05:meMA.Ode8C32.incipit
ltx/swh_redirects_oak/me.m08.d05:meMA.Ode8C32.melody	@ltx/swh_ke_oak/me.m08.d05:meMA.Ode8C32.melody
ltx/swh_redirects_oak/me.m08.d05:meMA.Ode8C32.mode	@ltx/swh_ke_oak/me.m08.d05:meMA.Ode8C32.mode
ltx/swh_redirects_oak/me.m08.d05:meMA.Ode8C32.ode	@ltx/swh_ke_oak/me.m08.d05:meMA.Ode8C32.ode
ltx/swh_redirects_oak/me.m08.d05:meMA.Ode8C32.text	@ltx/swh_ke_oak/me.m08.d05:meMA.Ode8C32.text
ltx/swh_redirects_oak/me.m08.d05:meMA.Ode8C33.incipit	@ltx/swh_ke_oak/me.m08.d05:meMA.Ode8C33.incipit
ltx/swh_redirects_oak/me.m08.d05:meMA.Ode8C33.melody	@ltx/swh_ke_oak/me.m08.d05:meMA.Ode8C33.melody
ltx/swh_redirects_oak/me.m08.d05:meMA.Ode8C33.mode	@ltx/swh_ke_oak/me.m08.d05:meMA.Ode8C33.mode
ltx/swh_redirects_oak/me.m08.d05:meMA.Ode8C33.ode	@ltx/swh_ke_oak/me.m08.d05:meMA.Ode8C33.ode
ltx/swh_redirects_oak/me.m08.d05:meMA.Ode8C33.text	@ltx/swh_ke_oak/me.m08.d05:meMA.Ode8C33.text
ltx/swh_redirects_oak/me.m08.d05:meMA.Ode8C3T.incipit	@ltx/swh_ke_oak/me.m08.d05:meMA.Ode8C3T.incipit
ltx/swh_redirects_oak/me.m08.d05:meMA.Ode8C3T.melody	@ltx/swh_ke_oak/me.m08.d05:meMA.Ode8C3T.melody
ltx/swh_redirects_oak/me.m08.d05:meMA.Ode8C3T.mode	@ltx/swh_ke_oak/me.m08.d05:meMA.Ode8C3T.mode
ltx/swh_redirects_oak/me.m08.d05:meMA.Ode8C3T.ode	@ltx/swh_ke_oak/me.m08.d05:meMA.Ode8C3T.ode
ltx/swh_redirects_oak/me.m08.d05:meMA.Ode8C3T.text	@ltx/swh_ke_oak/me.m08.d05:meMA.Ode8C3T.text
ltx/swh_redirects_oak/me.m08.d05:meMA.Ode8C3Tr.incipit	@ltx/swh_ke_oak/me.m08.d05:meMA.Ode8C3Tr.incipit
ltx/swh_redirects_oak/me.m08.d05:meMA.Ode8C3Tr.melody	@ltx/swh_ke_oak/me.m08.d05:meMA.Ode8C3Tr.melody
ltx/swh_redirects_oak/me.m08.d05:meMA.Ode8C3Tr.mode	@ltx/swh_ke_oak/me.m08.d05:meMA.Ode8C3Tr.mode
ltx/swh_redirects_oak/me.m08.d05:meMA.Ode8C3Tr.ode	@ltx/swh_ke_oak/me.m08.d05:meMA.Ode8C3Tr.ode
ltx/swh_redirects_oak/me.m08.d05:meMA.Ode8C3Tr.text	@ltx/swh_ke_oak/me.m08.d05:meMA.Ode8C3Tr.text
ltx/swh_redirects_oak/me.m08.d05:meMA.Ode8H.greekmelody	@ltx/swh_ke_oak/me.m08.d05:meMA.Ode8H.greekmelody
ltx/swh_redirects_oak/me.m08.d05:meMA.Ode8H.incipit	@ltx/swh_ke_oak/me.m08.d05:meMA.Ode8H.incipit
ltx/swh_redirects_oak/me.m08.d05:meMA.Ode8H.melody	@ltx/swh_ke_oak/me.m08.d05:meMA.Ode8H.melody
ltx/swh_redirects_oak/me.m08.d05:meMA.Ode8H.mode	@ltx/swh_ke_oak/me.m08.d05:meMA.Ode8H.mode
ltx/swh_redirects_oak/me.m08.d05:meMA.Ode8H.ode	@ltx/swh_ke_oak/me.m08.d05:meMA.Ode8H.ode
ltx/swh_redirects_oak/me.m08.d05:meMA.Ode8H.text	@ltx/swh_ke_oak/me.m08.d05:meMA.Ode8H.text
ltx/swh_redirects_oak/me.m08.d05:meMA.Ode9C11.greekmelody	@ltx/swh_ke_oak/me.m08.d05:meMA.Ode9C11.greekmelody
ltx/swh_redirects_oak/me.m08.d05:meMA.Ode9C11.incipit	@ltx/swh_ke_oak/me.m08.d05:meMA.Ode9C11.incipit
ltx/swh_redirects_oak/me.m08.d05:meMA.Ode9C11.melody	@ltx/swh_ke_oak/me.m08.d05:meMA.Ode9C11.melody
ltx/swh_redirects_oak/me.m08.d05:meMA.Ode9C11.mode	@ltx/swh_ke_oak/me.m08.d05:meMA.Ode9C11.mode
ltx/swh_redirects_oak/me.m08.d05:meMA.Ode9C11.ode	@ltx/swh_ke_oak/me.m08.d05:meMA.Ode9C11.ode
ltx/swh_redirects_oak/me.m08.d05:meMA.Ode9C11.text	@ltx/swh_ke_oak/me.m08.d05:meMA.Ode9C11.text
ltx/swh_redirects_oak/me.m08.d05:meMA.Ode9C12.incipit	@ltx/swh_ke_oak/me.m08.d05:meMA.Ode9C12.incipit
ltx/swh_redirects_oak/me.m08.d05:meMA.Ode9C12.melody	@ltx/swh_ke_oak/me.m08.d05:meMA.Ode9C12.melody
ltx/swh_redirects_oak/me.m08.d05:meMA.Ode9C12.mode	@ltx/swh_ke_oak/me.m08.d05:meMA.Ode9C12.mode
ltx/swh_redirects_oak/me.m08.d05:meMA.Ode9C12.ode	@ltx/swh_ke_oak/me.m08.d05:meMA.Ode9C12.ode
ltx/swh_redirects_oak/me.m08.d05:meMA.Ode9C12.text	@ltx/swh_ke_oak/me.m08.d05:meMA.Ode9C12.text
ltx/swh_redirects_oak/me.m08.d05:meMA.Ode9C13.incipit	@ltx/swh_ke_oak/me.m08.d05:meMA.Ode9C13.incipit
ltx/swh_redirects_oak/me.m08.d05:meMA.Ode9C13.melody	@ltx/swh_ke_oak/me.m08.d05:meMA.Ode9C13.melody
ltx/swh_redirects_oak/me.m08.d05:meMA.Ode9C13.mode	@ltx/swh_ke_oak/me.m08.d05:meMA.Ode9C13.mode
ltx/swh_redirects_oak/me.m08.d05:meMA.Ode9C13.ode	@ltx/swh_ke_oak/me.m08.d05:meMA.Ode9C13.ode
ltx/swh_redirects_oak/me.m08.d05:meMA.Ode9C13.text	@ltx/swh_ke_oak/me.m08.d05:meMA.Ode9C13.text
ltx/swh_redirects_oak/me.m08.d05:meMA.Ode9C1H.greekmelody	@ltx/swh_ke_oak/me.m08.d05:meMA.Ode9C1H.greekmelody
ltx/swh_redirects_oak/me.m08.d05:meMA.Ode9C1H.incipit	@ltx/swh_ke_oak/me.m08.d05:meMA.Ode9C1H.incipit
ltx/swh_redirects_oak/me.m08.d05:meMA.Ode9C1H.melody	@ltx/swh_ke_oak/me.m08.d05:meMA.Ode9C1H.melody
ltx/swh_redirects_oak/me.m08.d05:meMA.Ode9C1H.mode	@ltx/swh_ke_oak/me.m08.d05:meMA.Ode9C1H.mode
ltx/swh_redirects_oak/me.m08.d05:meMA.Ode9C1H.ode	@ltx/swh_ke_oak/me.m08.d05:meMA.Ode9C1H.ode
ltx/swh_redirects_oak/me.m08.d05:meMA.Ode9C1H.text	@ltx/swh_ke_oak/me.m08.d05:meMA.Ode9C1H.text
ltx/swh_redirects_oak/me.m08.d05:meMA.Ode9C21.greekmelody	@ltx/swh_ke_oak/me.m08.d05:meMA.Ode9C21.greekmelody
ltx/swh_redirects_oak/me.m08.d05:meMA.Ode9C21.incipit	@ltx/swh_ke_oak/me.m08.d05:meMA.Ode9C21.incipit
ltx/swh_redirects_oak/me.m08.d05:meMA.Ode9C21.melody	@ltx/swh_ke_oak/me.m08.d05:meMA.Ode9C21.melody
ltx/swh_redirects_oak/me.m08.d05:meMA.Ode9C21.mode	@ltx/swh_ke_oak/me.m08.d05:meMA.Ode9C21.mode
ltx/swh_redirects_oak/me.m08.d05:meMA.Ode9C21.ode	@ltx/swh_ke_oak/me.m08.d05:meMA.Ode9C21.ode
ltx/swh_redirects_oak/me.m08.d05:meMA.Ode9C21.text	@ltx/swh_ke_oak/me.m08.d05:meMA.Ode9C21.text
ltx/swh_redirects_oak/me.m08.d05:meMA.Ode9C22.incipit	@ltx/swh_ke_oak/me.m08.d05:meMA.Ode9C22.incipit
ltx/swh_redirects_oak/me.m08.d05:meMA.Ode9C22.melody	@ltx/swh_ke_oak/me.m08.d05:meMA.Ode9C22.melody
ltx/swh_redirects_oak/me.m08.d05:meMA.Ode9C22.mode	@ltx/swh_ke_oak/me.m08.d05:meMA.Ode9C22.mode
ltx/swh_redirects_oak/me.m08.d05:meMA.Ode9C22.ode	@ltx/swh_ke_oak/me.m08.d05:meMA.Ode9C22.ode
ltx/swh_redirects_oak/me.m08.d05:meMA.Ode9C22.text	@ltx/swh_ke_oak/me.m08.d05:meMA.Ode9C22.text
ltx/swh_redirects_oak/me.m08.d05:meMA.Ode9C23.incipit	@ltx/swh_ke_oak/me.m08.d05:meMA.Ode9C23.incipit
ltx/swh_redirects_oak/me.m08.d05:meMA.Ode9C23.melody	@ltx/swh_ke_oak/me.m08.d05:meMA.Ode9C23.melody
ltx/swh_redirects_oak/me.m08.d05:meMA.Ode9C23.mode	@ltx/swh_ke_oak/me.m08.d05:meMA.Ode9C23.mode
ltx/swh_redirects_oak/me.m08.d05:meMA.Ode9C23.ode	@ltx/swh_ke_oak/me.m08.d05:meMA.Ode9C23.ode
ltx/swh_redirects_oak/me.m08.d05:meMA.Ode9C23.text	@ltx/swh_ke_oak/me.m08.d05:meMA.Ode9C23.text
ltx/swh_redirects_oak/me.m08.d05:meMA.Ode9C24.incipit	@ltx/swh_ke_oak/me.m08.d05:meMA.Ode9C24.incipit
ltx/swh_redirects_oak/me.m08.d05:meMA.Ode9C24.melody	@ltx/swh_ke_oak/me.m08.d05:meMA.Ode9C24.melody
ltx/swh_redirects_oak/me.m08.d05:meMA.Ode9C24.mode	@ltx/swh_ke_oak/me.m08.d05:meMA.Ode9C24.mode
ltx/swh_redirects_oak/me.m08.d05:meMA.Ode9C24.ode	@ltx/swh_ke_oak/me.m08.d05:meMA.Ode9C24.ode
ltx/swh_redirects_oak/me.m08.d05:meMA.Ode9C24.text	@ltx/swh_ke_oak/me.m08.d05:meMA.Ode9C24.text
ltx/swh_redirects_oak/me.m08.d05:meMA.Ode9C2T.incipit	@ltx/swh_ke_oak/me.m08.d05:meMA.Ode9C2T.incipit
ltx/swh_redirects_oak/me.m08.d05:meMA.Ode9C2T.melody	@ltx/swh_ke_oak/me.m08.d05:meMA.Ode9C2T.melody
ltx/swh_redirects_oak/me.m08.d05:meMA.Ode9C2T.mode	@ltx/swh_ke_oak/me.m08.d05:meMA.Ode9C2T.mode
ltx/swh_redirects_oak/me.m08.d05:meMA.Ode9C2T.ode	@ltx/swh_ke_oak/me.m08.d05:meMA.Ode9C2T.ode
ltx/swh_redirects_oak/me.m08.d05:meMA.Ode9C2T.text	@ltx/swh_ke_oak/me.m08.d05:meMA.Ode9C2T.text
ltx/swh_redirects_oak/me.m08.d05:meMA.Ode9C31.greekmelody	@ltx/swh_ke_oak/me.m08.d05:meMA.Ode9C31.greekmelody
ltx/swh_redirects_oak/me.m08.d05:meMA.Ode9C31.incipit	@ltx/swh_ke_oak/me.m08.d05:meMA.Ode9C31.incipit
ltx/swh_redirects_oak/me.m08.d05:meMA.Ode9C31.melody	@ltx/swh_ke_oak/me.m08.d05:meMA.Ode9C31.melody
ltx/swh_redirects_oak/me.m08.d05:meMA.Ode9C31.mode	@ltx/swh_ke_oak/me.m08.d05:meMA.Ode9C31.mode
ltx/swh_redirects_oak/me.m08.d05:meMA.Ode9C31.ode	@ltx/swh_ke_oak/me.m08.d05:meMA.Ode9C31.ode
ltx/swh_redirects_oak/me.m08.d05:meMA.Ode9C31.text	@ltx/swh_ke_oak/me.m08.d05:meMA.Ode9C31.text
ltx/swh_redirects_oak/me.m08.d05:meMA.Ode9C32.incipit	@ltx/swh_ke_oak/me.m08.d05:meMA.Ode9C32.incipit
ltx/swh_redirects_oak/me.m08.d05:meMA.Ode9C32.melody	@ltx/swh_ke_oak/me.m08.d05:meMA.Ode9C32.melody
ltx/swh_redirects_oak/me.m08.d05:meMA.Ode9C32.mode	@ltx/swh_ke_oak/me.m08.d05:meMA.Ode9C32.mode
ltx/swh_redirects_oak/me.m08.d05:meMA.Ode9C32.ode	@ltx/swh_ke_oak/me.m08.d05:meMA.Ode9C32.ode
ltx/swh_redirects_oak/me.m08.d05:meMA.Ode9C32.text	@ltx/swh_ke_oak/me.m08.d05:meMA.Ode9C32.text
ltx/swh_redirects_oak/me.m08.d05:meMA.Ode9C33.incipit	@ltx/swh_ke_oak/me.m08.d05:meMA.Ode9C33.incipit
ltx/swh_redirects_oak/me.m08.d05:meMA.Ode9C33.melody	@ltx/swh_ke_oak/me.m08.d05:meMA.Ode9C33.melody
ltx/swh_redirects_oak/me.m08.d05:meMA.Ode9C33.mode	@ltx/swh_ke_oak/me.m08.d05:meMA.Ode9C33.mode
ltx/swh_redirects_oak/me.m08.d05:meMA.Ode9C33.ode	@ltx/swh_ke_oak/me.m08.d05:meMA.Ode9C33.ode
ltx/swh_redirects_oak/me.m08.d05:meMA.Ode9C33.text	@ltx/swh_ke_oak/me.m08.d05:meMA.Ode9C33.text
ltx/swh_redirects_oak/me.m08.d05:meMA.Ode9C3T.incipit	@ltx/swh_ke_oak/me.m08.d05:meMA.Ode9C3T.incipit
ltx/swh_redirects_oak/me.m08.d05:meMA.Ode9C3T.melody	@ltx/swh_ke_oak/me.m08.d05:meMA.Ode9C3T.melody
ltx/swh_redirects_oak/me.m08.d05:meMA.Ode9C3T.mode	@ltx/swh_ke_oak/me.m08.d05:meMA.Ode9C3T.mode
ltx/swh_redirects_oak/me.m08.d05:meMA.Ode9C3T.ode	@ltx/swh_ke_oak/me.m08.d05:meMA.Ode9C3T.ode
ltx/swh_redirects_oak/me.m08.d05:meMA.Ode9C3T.text	@ltx/swh_ke_oak/me.m08.d05:meMA.Ode9C3T.text
ltx/swh_redirects_oak/me.m08.d05:meMA.Ode9C3Tr.incipit	@ltx/swh_ke_oak/me.m08.d05:meMA.Ode9C3Tr.incipit
ltx/swh_redirects_oak/me.m08.d05:meMA.Ode9C3Tr.melody	@ltx/swh_ke_oak/me.m08.d05:meMA.Ode9C3Tr.melody
ltx/swh_redirects_oak/me.m08.d05:meMA.Ode9C3Tr.mode	@ltx/swh_ke_oak/me.m08.d05:meMA.Ode9C3Tr.mode
ltx/swh_redirects_oak/me.m08.d05:meMA.Ode9C3Tr.ode	@ltx/swh_ke_oak/me.m08.d05:meMA.Ode9C3Tr.ode
ltx/swh_redirects_oak/me.m08.d05:meMA.Ode9C3Tr.text	@ltx/swh_ke_oak/me.m08.d05:meMA.Ode9C3Tr.text
ltx/swh_redirects_oak/me.m08.d05:meMA.Ode9H.greekmelody	@ltx/swh_ke_oak/me.m08.d05:meMA.Ode9H.greekmelody
ltx/swh_redirects_oak/me.m08.d05:meMA.Ode9H.incipit	@ltx/swh_ke_oak/me.m08.d05:meMA.Ode9H.incipit
ltx/swh_redirects_oak/me.m08.d05:meMA.Ode9H.melody	@ltx/swh_ke_oak/me.m08.d05:meMA.Ode9H.melody
ltx/swh_redirects_oak/me.m08.d05:meMA.Ode9H.mode	@ltx/swh_ke_oak/me.m08.d05:meMA.Ode9H.mode
ltx/swh_redirects_oak/me.m08.d05:meMA.Ode9H.ode	@ltx/swh_ke_oak/me.m08.d05:meMA.Ode9H.ode
ltx/swh_redirects_oak/me.m08.d05:meMA.Ode9H.text	@ltx/swh_ke_oak/me.m08.d05:meMA.Ode9H.text
ltx/swh_redirects_oak/me.m08.d05:meMA.Oikos2.text	@ltx/swh_ke_oak/me.m08.d05:meMA.Oikos2.text
ltx/swh_redirects_oak/me.m08.d05:meVE.Apolytikion1.greekmelody	@ltx/swh_ke_oak/me.m08.d05:meVE.Apolytikion1.greekmelody
ltx/swh_redirects_oak/me.m08.d05:meVE.Apolytikion1.incipit	@ltx/swh_ke_oak/me.m08.d05:meVE.Apolytikion1.incipit
ltx/swh_redirects_oak/me.m08.d05:meVE.Apolytikion1.melody	@ltx/swh_ke_oak/me.m08.d05:meVE.Apolytikion1.melody
ltx/swh_redirects_oak/me.m08.d05:meVE.Apolytikion1.mode	@ltx/swh_ke_oak/me.m08.d05:meVE.Apolytikion1.mode
ltx/swh_redirects_oak/me.m08.d05:meVE.Apolytikion1.text	@ltx/swh_ke_oak/me.m08.d05:meVE.Apolytikion1.text
ltx/swh_redirects_oak/me.m08.d05:meVE.Apolytikion2ger.greekmelody	@ltx/swh_ke_oak/me.m08.d05:meVE.Apolytikion2ger.greekmelody
ltx/swh_redirects_oak/me.m08.d05:meVE.Apolytikion2ger.incipit	@ltx/swh_ke_oak/me.m08.d05:meVE.Apolytikion2ger.incipit
ltx/swh_redirects_oak/me.m08.d05:meVE.Apolytikion2ger.melody	@ltx/swh_ke_oak/me.m08.d05:meVE.Apolytikion2ger.melody
ltx/swh_redirects_oak/me.m08.d05:meVE.Apolytikion2ger.mode	@ltx/swh_ke_oak/me.m08.d05:meVE.Apolytikion2ger.mode
ltx/swh_redirects_oak/me.m08.d05:meVE.Apolytikion2ger.poet	@ltx/swh_ke_oak/me.m08.d05:meVE.Apolytikion2ger.poet
ltx/swh_redirects_oak/me.m08.d05:meVE.Apolytikion2ger.text	@ltx/swh_ke_oak/me.m08.d05:meVE.Apolytikion2ger.text
ltx/swh_redirects_oak/me.m08.d05:meVE.AposGlory.incipit	@ltx/swh_ke_oak/me.m08.d05:meVE.AposGlory.incipit
ltx/swh_redirects_oak/me.m08.d05:meVE.AposGlory.melody	@ltx/swh_ke_oak/me.m08.d05:meVE.AposGlory.melody
ltx/swh_redirects_oak/me.m08.d05:meVE.AposGlory.mode	@ltx/swh_ke_oak/me.m08.d05:meVE.AposGlory.mode
ltx/swh_redirects_oak/me.m08.d05:meVE.AposGlory.text	@ltx/swh_ke_oak/me.m08.d05:meVE.AposGlory.text
ltx/swh_redirects_oak/me.m08.d05:meVE.Aposticha1.greekmelody	@ltx/swh_ke_oak/me.m08.d05:meVE.Aposticha1.greekmelody
ltx/swh_redirects_oak/me.m08.d05:meVE.Aposticha1.incipit	@ltx/swh_ke_oak/me.m08.d05:meVE.Aposticha1.incipit
ltx/swh_redirects_oak/me.m08.d05:meVE.Aposticha1.melody	@ltx/swh_ke_oak/me.m08.d05:meVE.Aposticha1.melody
ltx/swh_redirects_oak/me.m08.d05:meVE.Aposticha1.mode	@ltx/swh_ke_oak/me.m08.d05:meVE.Aposticha1.mode
ltx/swh_redirects_oak/me.m08.d05:meVE.Aposticha1.text	@ltx/swh_ke_oak/me.m08.d05:meVE.Aposticha1.text
ltx/swh_redirects_oak/me.m08.d05:meVE.Aposticha2.incipit	@ltx/swh_ke_oak/me.m08.d05:meVE.Aposticha2.incipit
ltx/swh_redirects_oak/me.m08.d05:meVE.Aposticha2.melody	@ltx/swh_ke_oak/me.m08.d05:meVE.Aposticha2.melody
ltx/swh_redirects_oak/me.m08.d05:meVE.Aposticha2.mode	@ltx/swh_ke_oak/me.m08.d05:meVE.Aposticha2.mode
ltx/swh_redirects_oak/me.m08.d05:meVE.Aposticha2.text	@ltx/swh_ke_oak/me.m08.d05:meVE.Aposticha2.text
ltx/swh_redirects_oak/me.m08.d05:meVE.Aposticha3.incipit	@ltx/swh_ke_oak/me.m08.d05:meVE.Aposticha3.incipit
ltx/swh_redirects_oak/me.m08.d05:meVE.Aposticha3.melody	@ltx/swh_ke_oak/me.m08.d05:meVE.Aposticha3.melody
ltx/swh_redirects_oak/me.m08.d05:meVE.Aposticha3.mode	@ltx/swh_ke_oak/me.m08.d05:meVE.Aposticha3.mode
ltx/swh_redirects_oak/me.m08.d05:meVE.Aposticha3.text	@ltx/swh_ke_oak/me.m08.d05:meVE.Aposticha3.text
ltx/swh_redirects_oak/me.m08.d05:meVE.SticGlory.incipit	@ltx/swh_ke_oak/me.m08.d05:meVE.SticGlory.incipit
ltx/swh_redirects_oak/me.m08.d05:meVE.SticGlory.melody	@ltx/swh_ke_oak/me.m08.d05:meVE.SticGlory.melody
ltx/swh_redirects_oak/me.m08.d05:meVE.SticGlory.mode	@ltx/swh_ke_oak/me.m08.d05:meVE.SticGlory.mode
ltx/swh_redirects_oak/me.m08.d05:meVE.SticGlory.text	@ltx/swh_ke_oak/me.m08.d05:meVE.SticGlory.text
ltx/swh_redirects_oak/me.m08.d05:meVE.Stichera01.greekmelody	@ltx/swh_ke_oak/me.m08.d05:meVE.Stichera01.greekmelody
ltx/swh_redirects_oak/me.m08.d05:meVE.Stichera01.incipit	@ltx/swh_ke_oak/me.m08.d05:meVE.Stichera01.incipit
ltx/swh_redirects_oak/me.m08.d05:meVE.Stichera01.melody	@ltx/swh_ke_oak/me.m08.d05:meVE.Stichera01.melody
ltx/swh_redirects_oak/me.m08.d05:meVE.Stichera01.mode	@ltx/swh_ke_oak/me.m08.d05:meVE.Stichera01.mode
ltx/swh_redirects_oak/me.m08.d05:meVE.Stichera01.text	@ltx/swh_ke_oak/me.m08.d05:meVE.Stichera01.text
ltx/swh_redirects_oak/me.m08.d05:meVE.Stichera02.incipit	@ltx/swh_ke_oak/me.m08.d05:meVE.Stichera02.incipit
ltx/swh_redirects_oak/me.m08.d05:meVE.Stichera02.melody	@ltx/swh_ke_oak/me.m08.d05:meVE.Stichera02.melody
ltx/swh_redirects_oak/me.m08.d05:meVE.Stichera02.mode	@ltx/swh_ke_oak/me.m08.d05:meVE.Stichera02.mode
ltx/swh_redirects_oak/me.m08.d05:meVE.Stichera02.text	@ltx/swh_ke_oak/me.m08.d05:meVE.Stichera02.text
ltx/swh_redirects_oak/me.m08.d05:meVE.Stichera03.incipit	@ltx/swh_ke_oak/me.m08.d05:meVE.Stichera03.incipit
ltx/swh_redirects_oak/me.m08.d05:meVE.Stichera03.melody	@ltx/swh_ke_oak/me.m08.d05:meVE.Stichera03.melody
ltx/swh_redirects_oak/me.m08.d05:meVE.Stichera03.mode	@ltx/swh_ke_oak/me.m08.d05:meVE.Stichera03.mode
ltx/swh_redirects_oak/me.m08.d05:meVE.Stichera03.text	@ltx/swh_ke_oak/me.m08.d05:meVE.Stichera03.text
ltx/swh_redirects_oak/me.m08.d05:meVE.Stichera04.greekmelody	@ltx/swh_ke_oak/me.m08.d05:meVE.Stichera04.greekmelody
ltx/swh_redirects_oak/me.m08.d05:meVE.Stichera04.incipit	@ltx/swh_ke_oak/me.m08.d05:meVE.Stichera04.incipit
ltx/swh_redirects_oak/me.m08.d05:meVE.Stichera04.melody	@ltx/swh_ke_oak/me.m08.d05:meVE.Stichera04.melody
ltx/swh_redirects_oak/me.m08.d05:meVE.Stichera04.mode	@ltx/swh_ke_oak/me.m08.d05:meVE.Stichera04.mode
ltx/swh_redirects_oak/me.m08.d05:meVE.Stichera04.text	@ltx/swh_ke_oak/me.m08.d05:meVE.Stichera04.text
ltx/swh_redirects_oak/me.m08.d05:meVE.Stichera05.incipit	@ltx/swh_ke_oak/me.m08.d05:meVE.Stichera05.incipit
ltx/swh_redirects_oak/me.m08.d05:meVE.Stichera05.melody	@ltx/swh_ke_oak/me.m08.d05:meVE.Stichera05.melody
ltx/swh_redirects_oak/me.m08.d05:meVE.Stichera05.mode	@ltx/swh_ke_oak/me.m08.d05:meVE.Stichera05.mode
ltx/swh_redirects_oak/me.m08.d05:meVE.Stichera05.text	@ltx/swh_ke_oak/me.m08.d05:meVE.Stichera05.text
ltx/swh_redirects_oak/me.m08.d05:meVE.Stichera06.incipit	@ltx/swh_ke_oak/me.m08.d05:meVE.Stichera06.incipit
ltx/swh_redirects_oak/me.m08.d05:meVE.Stichera06.melody	@ltx/swh_ke_oak/me.m08.d05:meVE.Stichera06.melody
ltx/swh_redirects_oak/me.m08.d05:meVE.Stichera06.mode	@ltx/swh_ke_oak/me.m08.d05:meVE.Stichera06.mode
ltx/swh_redirects_oak/me.m08.d05:meVE.Stichera06.text	@ltx/swh_ke_oak/me.m08.d05:meVE.Stichera06.text
