ltx/swh_redirects_oak/prayers:pr.AllHolyTrinity.incipit	@ltx/swh_ke_oak/prayers:pr.AllHolyTrinity.incipit
ltx/swh_redirects_oak/prayers:pr.AllHolyTrinity.text	@ltx/swh_ke_oak/prayers:pr.AllHolyTrinity.text
ltx/swh_redirects_oak/prayers:pr.Alleluia1.text	@ltx/swh_ke_oak/prayers:pr.Alleluia1.text
ltx/swh_redirects_oak/prayers:pr.Alleluia3.text	@ltx/swh_ke_oak/prayers:pr.Alleluia3.text
ltx/swh_redirects_oak/prayers:pr.Alleluia3Glory.text	@ltx/swh_ke_oak/prayers:pr.Alleluia3Glory.text
ltx/swh_redirects_oak/prayers:pr.AlwaysNow.incipit	@ltx/swh_ke_oak/prayers:pr.AlwaysNow.incipit
ltx/swh_redirects_oak/prayers:pr.AlwaysNow.text	@ltx/swh_ke_oak/prayers:pr.AlwaysNow.text
ltx/swh_redirects_oak/prayers:pr.Axios.text	@ltx/swh_ke_oak/prayers:pr.Axios.text
ltx/swh_redirects_oak/prayers:pr.BlessIncense_bishop.text	@ltx/swh_ke_oak/prayers:pr.BlessIncense_bishop.text
ltx/swh_redirects_oak/prayers:pr.Bless_father.text	@ltx/swh_ke_oak/prayers:pr.Bless_father.text
ltx/swh_redirects_oak/prayers:pr.BlessedIsOurGod.text	@ltx/swh_ke_oak/prayers:pr.BlessedIsOurGod.text
ltx/swh_redirects_oak/prayers:pr.BothNowAndEver.incipit	@ltx/swh_ke_oak/prayers:pr.BothNowAndEver.incipit
ltx/swh_redirects_oak/prayers:pr.BothNowAndEver.text	@ltx/swh_ke_oak/prayers:pr.BothNowAndEver.text
ltx/swh_redirects_oak/prayers:pr.ComeLetUsWorship1.incipit	@ltx/swh_ke_oak/prayers:pr.ComeLetUsWorship1.incipit
ltx/swh_redirects_oak/prayers:pr.ComeLetUsWorship1.text	@ltx/swh_ke_oak/prayers:pr.ComeLetUsWorship1.text
ltx/swh_redirects_oak/prayers:pr.ComeLetUsWorship2.text	@ltx/swh_ke_oak/prayers:pr.ComeLetUsWorship2.text
ltx/swh_redirects_oak/prayers:pr.ComeLetUsWorship3.text	@ltx/swh_ke_oak/prayers:pr.ComeLetUsWorship3.text
ltx/swh_redirects_oak/prayers:pr.Command.text	@ltx/swh_ke_oak/prayers:pr.Command.text
ltx/swh_redirects_oak/prayers:pr.Command_bishop.text	@ltx/swh_ke_oak/prayers:pr.Command_bishop.text
ltx/swh_redirects_oak/prayers:pr.Command_holybishop.text	@ltx/swh_ke_oak/prayers:pr.Command_holybishop.text
ltx/swh_redirects_oak/prayers:pr.Creed.incipit	@ltx/swh_ke_oak/prayers:pr.Creed.incipit
ltx/swh_redirects_oak/prayers:pr.Creed.text	@ltx/swh_ke_oak/prayers:pr.Creed.text
ltx/swh_redirects_oak/prayers:pr.DismissalPrayer1.incipit	@ltx/swh_ke_oak/prayers:pr.DismissalPrayer1.incipit
ltx/swh_redirects_oak/prayers:pr.DismissalPrayer1.text	@ltx/swh_ke_oak/prayers:pr.DismissalPrayer1.text
ltx/swh_redirects_oak/prayers:pr.DismissalPrayer2.incipit	@ltx/swh_ke_oak/prayers:pr.DismissalPrayer2.incipit
ltx/swh_redirects_oak/prayers:pr.DismissalPrayer2.text	@ltx/swh_ke_oak/prayers:pr.DismissalPrayer2.text
ltx/swh_redirects_oak/prayers:pr.DismissalPrayer2_lent.incipit	@ltx/swh_ke_oak/prayers:pr.DismissalPrayer2_lent.incipit
ltx/swh_redirects_oak/prayers:pr.DismissalPrayer2_lent.text	@ltx/swh_ke_oak/prayers:pr.DismissalPrayer2_lent.text
ltx/swh_redirects_oak/prayers:pr.GloryToTheFather.incipit	@ltx/swh_ke_oak/prayers:pr.GloryToTheFather.incipit
ltx/swh_redirects_oak/prayers:pr.GloryToTheFather.text	@ltx/swh_ke_oak/prayers:pr.GloryToTheFather.text
ltx/swh_redirects_oak/prayers:pr.GloryToTheFather2.incipit	@ltx/swh_ke_oak/prayers:pr.GloryToTheFather2.incipit
ltx/swh_redirects_oak/prayers:pr.GloryToTheFather2.text	@ltx/swh_ke_oak/prayers:pr.GloryToTheFather2.text
ltx/swh_redirects_oak/prayers:pr.GloryToYouChrist.incipit	@ltx/swh_ke_oak/prayers:pr.GloryToYouChrist.incipit
ltx/swh_redirects_oak/prayers:pr.GloryToYouChrist.text	@ltx/swh_ke_oak/prayers:pr.GloryToYouChrist.text
ltx/swh_redirects_oak/prayers:pr.GloryToYouChristHope.incipit	@ltx/swh_ke_oak/prayers:pr.GloryToYouChristHope.incipit
ltx/swh_redirects_oak/prayers:pr.GloryToYouChristHope.text	@ltx/swh_ke_oak/prayers:pr.GloryToYouChristHope.text
ltx/swh_redirects_oak/prayers:pr.GloryToYouGod.text	@ltx/swh_ke_oak/prayers:pr.GloryToYouGod.text
ltx/swh_redirects_oak/prayers:pr.GloryToYouGodHope.incipit	@ltx/swh_ke_oak/prayers:pr.GloryToYouGodHope.incipit
ltx/swh_redirects_oak/prayers:pr.GloryToYouGodHope.text	@ltx/swh_ke_oak/prayers:pr.GloryToYouGodHope.text
ltx/swh_redirects_oak/prayers:pr.GloryToYouLord.MM.aftergospel.text	@ltx/swh_ke_oak/prayers:pr.GloryToYouLord.MM.aftergospel.text
ltx/swh_redirects_oak/prayers:pr.GloryToYouLord.text	@ltx/swh_ke_oak/prayers:pr.GloryToYouLord.text
ltx/swh_redirects_oak/prayers:pr.GloryToYouOurGod.incipit	@ltx/swh_ke_oak/prayers:pr.GloryToYouOurGod.incipit
ltx/swh_redirects_oak/prayers:pr.GloryToYouOurGod.text	@ltx/swh_ke_oak/prayers:pr.GloryToYouOurGod.text
ltx/swh_redirects_oak/prayers:pr.GloryToYourForbearance.incipit	@ltx/swh_ke_oak/prayers:pr.GloryToYourForbearance.incipit
ltx/swh_redirects_oak/prayers:pr.GloryToYourForbearance.text	@ltx/swh_ke_oak/prayers:pr.GloryToYourForbearance.text
ltx/swh_redirects_oak/prayers:pr.GreaterInHonor.incipit	@ltx/swh_ke_oak/prayers:pr.GreaterInHonor.incipit
ltx/swh_redirects_oak/prayers:pr.GreaterInHonor.text	@ltx/swh_ke_oak/prayers:pr.GreaterInHonor.text
ltx/swh_redirects_oak/prayers:pr.HeavenlyKing.incipit	@ltx/swh_ke_oak/prayers:pr.HeavenlyKing.incipit
ltx/swh_redirects_oak/prayers:pr.HeavenlyKing.text	@ltx/swh_ke_oak/prayers:pr.HeavenlyKing.text
ltx/swh_redirects_oak/prayers:pr.HolyGod.incipit	@ltx/swh_ke_oak/prayers:pr.HolyGod.incipit
ltx/swh_redirects_oak/prayers:pr.HolyGod.text	@ltx/swh_ke_oak/prayers:pr.HolyGod.text
ltx/swh_redirects_oak/prayers:pr.InTheNameOfFather.incipit	@ltx/swh_ke_oak/prayers:pr.InTheNameOfFather.incipit
ltx/swh_redirects_oak/prayers:pr.InTheNameOfFather.text	@ltx/swh_ke_oak/prayers:pr.InTheNameOfFather.text
ltx/swh_redirects_oak/prayers:pr.InTheNameOfLordBless_father.incipit	@ltx/swh_ke_oak/prayers:pr.InTheNameOfLordBless_father.incipit
ltx/swh_redirects_oak/prayers:pr.InTheNameOfLordBless_father.text	@ltx/swh_ke_oak/prayers:pr.InTheNameOfLordBless_father.text
ltx/swh_redirects_oak/prayers:pr.ItIsTrulyRight_complete.incipit	@ltx/swh_ke_oak/prayers:pr.ItIsTrulyRight_complete.incipit
ltx/swh_redirects_oak/prayers:pr.ItIsTrulyRight_complete.text	@ltx/swh_ke_oak/prayers:pr.ItIsTrulyRight_complete.text
ltx/swh_redirects_oak/prayers:pr.ItIsTrulyRight_part1.incipit	@ltx/swh_ke_oak/prayers:pr.ItIsTrulyRight_part1.incipit
ltx/swh_redirects_oak/prayers:pr.ItIsTrulyRight_part1.text	@ltx/swh_ke_oak/prayers:pr.ItIsTrulyRight_part1.text
ltx/swh_redirects_oak/prayers:pr.MayGodHaveCompassion.incipit	@ltx/swh_ke_oak/prayers:pr.MayGodHaveCompassion.incipit
ltx/swh_redirects_oak/prayers:pr.MayGodHaveCompassion.text	@ltx/swh_ke_oak/prayers:pr.MayGodHaveCompassion.text
ltx/swh_redirects_oak/prayers:pr.OurFather.incipit	@ltx/swh_ke_oak/prayers:pr.OurFather.incipit
ltx/swh_redirects_oak/prayers:pr.OurFather.text	@ltx/swh_ke_oak/prayers:pr.OurFather.text
ltx/swh_redirects_oak/prayers:pr.OurHopeLord.text	@ltx/swh_ke_oak/prayers:pr.OurHopeLord.text
ltx/swh_redirects_oak/prayers:pr.PaschaDialog1.incipit	@ltx/swh_ke_oak/prayers:pr.PaschaDialog1.incipit
ltx/swh_redirects_oak/prayers:pr.PaschaDialog1.text	@ltx/swh_ke_oak/prayers:pr.PaschaDialog1.text
ltx/swh_redirects_oak/prayers:pr.PaschaDialog2.text	@ltx/swh_ke_oak/prayers:pr.PaschaDialog2.text
ltx/swh_redirects_oak/prayers:pr.PaschaDialog3.text	@ltx/swh_ke_oak/prayers:pr.PaschaDialog3.text
ltx/swh_redirects_oak/prayers:pr.PaschaDialog4.text	@ltx/swh_ke_oak/prayers:pr.PaschaDialog4.text
ltx/swh_redirects_oak/prayers:pr.PaschaDialog5.text	@ltx/swh_ke_oak/prayers:pr.PaschaDialog5.text
ltx/swh_redirects_oak/prayers:pr.PaschaDialog6.text	@ltx/swh_ke_oak/prayers:pr.PaschaDialog6.text
ltx/swh_redirects_oak/prayers:pr.PrayerForDeceased.incipit	@ltx/swh_ke_oak/prayers:pr.PrayerForDeceased.incipit
ltx/swh_redirects_oak/prayers:pr.PrayerForDeceased.text	@ltx/swh_ke_oak/prayers:pr.PrayerForDeceased.text
ltx/swh_redirects_oak/prayers:pr.PrayerOfHours.incipit	@ltx/swh_ke_oak/prayers:pr.PrayerOfHours.incipit
ltx/swh_redirects_oak/prayers:pr.PrayerOfHours.text	@ltx/swh_ke_oak/prayers:pr.PrayerOfHours.text
ltx/swh_redirects_oak/prayers:pr.PrayerOfIncense.incipit	@ltx/swh_ke_oak/prayers:pr.PrayerOfIncense.incipit
ltx/swh_redirects_oak/prayers:pr.PrayerOfIncense.text	@ltx/swh_ke_oak/prayers:pr.PrayerOfIncense.text
ltx/swh_redirects_oak/prayers:pr.PrayerOfStEphrem1.incipit	@ltx/swh_ke_oak/prayers:pr.PrayerOfStEphrem1.incipit
ltx/swh_redirects_oak/prayers:pr.PrayerOfStEphrem1.text	@ltx/swh_ke_oak/prayers:pr.PrayerOfStEphrem1.text
ltx/swh_redirects_oak/prayers:pr.PrayerOfStEphrem2.incipit	@ltx/swh_ke_oak/prayers:pr.PrayerOfStEphrem2.incipit
ltx/swh_redirects_oak/prayers:pr.PrayerOfStEphrem2.text	@ltx/swh_ke_oak/prayers:pr.PrayerOfStEphrem2.text
ltx/swh_redirects_oak/prayers:pr.PrayerOfStEphrem3.incipit	@ltx/swh_ke_oak/prayers:pr.PrayerOfStEphrem3.incipit
ltx/swh_redirects_oak/prayers:pr.PrayerOfStEphrem3.text	@ltx/swh_ke_oak/prayers:pr.PrayerOfStEphrem3.text
ltx/swh_redirects_oak/prayers:pr.PrayerOfStEphrem4.incipit	@ltx/swh_ke_oak/prayers:pr.PrayerOfStEphrem4.incipit
ltx/swh_redirects_oak/prayers:pr.PrayerOfStEphrem4.text	@ltx/swh_ke_oak/prayers:pr.PrayerOfStEphrem4.text
ltx/swh_redirects_oak/prayers:pr.ThroughThePrayers_bishop.incipit	@ltx/swh_ke_oak/prayers:pr.ThroughThePrayers_bishop.incipit
ltx/swh_redirects_oak/prayers:pr.ThroughThePrayers_bishop.text	@ltx/swh_ke_oak/prayers:pr.ThroughThePrayers_bishop.text
ltx/swh_redirects_oak/prayers:pr.ThroughThePrayers_fathers.incipit	@ltx/swh_ke_oak/prayers:pr.ThroughThePrayers_fathers.incipit
ltx/swh_redirects_oak/prayers:pr.ThroughThePrayers_fathers.text	@ltx/swh_ke_oak/prayers:pr.ThroughThePrayers_fathers.text
ltx/swh_redirects_oak/prayers:pr.WeBlessFather.incipit	@ltx/swh_ke_oak/prayers:pr.WeBlessFather.incipit
ltx/swh_redirects_oak/prayers:pr.WeBlessFather.text	@ltx/swh_ke_oak/prayers:pr.WeBlessFather.text
ltx/swh_redirects_oak/prayers:pr.antiphon2.annunciation.incipit	@ltx/swh_ke_oak/prayers:pr.antiphon2.annunciation.incipit
ltx/swh_redirects_oak/prayers:pr.antiphon2.annunciation.text	@ltx/swh_ke_oak/prayers:pr.antiphon2.annunciation.text
ltx/swh_redirects_oak/prayers:pr.antiphon2.ascension.incipit	@ltx/swh_ke_oak/prayers:pr.antiphon2.ascension.incipit
ltx/swh_redirects_oak/prayers:pr.antiphon2.ascension.text	@ltx/swh_ke_oak/prayers:pr.antiphon2.ascension.text
ltx/swh_redirects_oak/prayers:pr.antiphon2.christmas.incipit	@ltx/swh_ke_oak/prayers:pr.antiphon2.christmas.incipit
ltx/swh_redirects_oak/prayers:pr.antiphon2.christmas.text	@ltx/swh_ke_oak/prayers:pr.antiphon2.christmas.text
ltx/swh_redirects_oak/prayers:pr.antiphon2.circumcision.incipit	@ltx/swh_ke_oak/prayers:pr.antiphon2.circumcision.incipit
ltx/swh_redirects_oak/prayers:pr.antiphon2.circumcision.text	@ltx/swh_ke_oak/prayers:pr.antiphon2.circumcision.text
ltx/swh_redirects_oak/prayers:pr.antiphon2.cross.incipit	@ltx/swh_ke_oak/prayers:pr.antiphon2.cross.incipit
ltx/swh_redirects_oak/prayers:pr.antiphon2.cross.text	@ltx/swh_ke_oak/prayers:pr.antiphon2.cross.text
ltx/swh_redirects_oak/prayers:pr.antiphon2.epiphany.incipit	@ltx/swh_ke_oak/prayers:pr.antiphon2.epiphany.incipit
ltx/swh_redirects_oak/prayers:pr.antiphon2.epiphany.text	@ltx/swh_ke_oak/prayers:pr.antiphon2.epiphany.text
ltx/swh_redirects_oak/prayers:pr.antiphon2.meeting.incipit	@ltx/swh_ke_oak/prayers:pr.antiphon2.meeting.incipit
ltx/swh_redirects_oak/prayers:pr.antiphon2.meeting.text	@ltx/swh_ke_oak/prayers:pr.antiphon2.meeting.text
ltx/swh_redirects_oak/prayers:pr.antiphon2.palm.incipit	@ltx/swh_ke_oak/prayers:pr.antiphon2.palm.incipit
ltx/swh_redirects_oak/prayers:pr.antiphon2.palm.text	@ltx/swh_ke_oak/prayers:pr.antiphon2.palm.text
ltx/swh_redirects_oak/prayers:pr.antiphon2.pentecost.incipit	@ltx/swh_ke_oak/prayers:pr.antiphon2.pentecost.incipit
ltx/swh_redirects_oak/prayers:pr.antiphon2.pentecost.text	@ltx/swh_ke_oak/prayers:pr.antiphon2.pentecost.text
ltx/swh_redirects_oak/prayers:pr.antiphon2.resurrection.incipit	@ltx/swh_ke_oak/prayers:pr.antiphon2.resurrection.incipit
ltx/swh_redirects_oak/prayers:pr.antiphon2.resurrection.text	@ltx/swh_ke_oak/prayers:pr.antiphon2.resurrection.text
ltx/swh_redirects_oak/prayers:pr.antiphon2.saints.incipit	@ltx/swh_ke_oak/prayers:pr.antiphon2.saints.incipit
ltx/swh_redirects_oak/prayers:pr.antiphon2.saints.text	@ltx/swh_ke_oak/prayers:pr.antiphon2.saints.text
ltx/swh_redirects_oak/prayers:pr.antiphon2.transfiguration.incipit	@ltx/swh_ke_oak/prayers:pr.antiphon2.transfiguration.incipit
ltx/swh_redirects_oak/prayers:pr.antiphon2.transfiguration.text	@ltx/swh_ke_oak/prayers:pr.antiphon2.transfiguration.text
ltx/swh_redirects_oak/prayers:pr.enarxis01.incipit	@ltx/swh_ke_oak/prayers:pr.enarxis01.incipit
ltx/swh_redirects_oak/prayers:pr.enarxis01.text	@ltx/swh_ke_oak/prayers:pr.enarxis01.text
ltx/swh_redirects_oak/prayers:pr.enarxis02.incipit	@ltx/swh_ke_oak/prayers:pr.enarxis02.incipit
ltx/swh_redirects_oak/prayers:pr.enarxis02.text	@ltx/swh_ke_oak/prayers:pr.enarxis02.text
ltx/swh_redirects_oak/prayers:pr.enarxis03.incipit	@ltx/swh_ke_oak/prayers:pr.enarxis03.incipit
ltx/swh_redirects_oak/prayers:pr.enarxis03.text	@ltx/swh_ke_oak/prayers:pr.enarxis03.text
ltx/swh_redirects_oak/prayers:pr.epi01a.text	@ltx/swh_ke_oak/prayers:pr.epi01a.text
ltx/swh_redirects_oak/prayers:pr.epi01b.text	@ltx/swh_ke_oak/prayers:pr.epi01b.text
ltx/swh_redirects_oak/prayers:pr.epi02.text	@ltx/swh_ke_oak/prayers:pr.epi02.text
ltx/swh_redirects_oak/prayers:pr.epi03.text	@ltx/swh_ke_oak/prayers:pr.epi03.text
ltx/swh_redirects_oak/prayers:pr.exc01.incipit	@ltx/swh_ke_oak/prayers:pr.exc01.incipit
ltx/swh_redirects_oak/prayers:pr.exc01.text	@ltx/swh_ke_oak/prayers:pr.exc01.text
ltx/swh_redirects_oak/prayers:pr.exc01a.incipit	@ltx/swh_ke_oak/prayers:pr.exc01a.incipit
ltx/swh_redirects_oak/prayers:pr.exc01a.text	@ltx/swh_ke_oak/prayers:pr.exc01a.text
ltx/swh_redirects_oak/prayers:pr.exc02.incipit	@ltx/swh_ke_oak/prayers:pr.exc02.incipit
ltx/swh_redirects_oak/prayers:pr.exc02.text	@ltx/swh_ke_oak/prayers:pr.exc02.text
ltx/swh_redirects_oak/prayers:pr.exc03.incipit	@ltx/swh_ke_oak/prayers:pr.exc03.incipit
ltx/swh_redirects_oak/prayers:pr.exc03.text	@ltx/swh_ke_oak/prayers:pr.exc03.text
ltx/swh_redirects_oak/prayers:pr.exc04.incipit	@ltx/swh_ke_oak/prayers:pr.exc04.incipit
ltx/swh_redirects_oak/prayers:pr.exc04.text	@ltx/swh_ke_oak/prayers:pr.exc04.text
ltx/swh_redirects_oak/prayers:pr.exc04a.incipit	@ltx/swh_ke_oak/prayers:pr.exc04a.incipit
ltx/swh_redirects_oak/prayers:pr.exc04a.text	@ltx/swh_ke_oak/prayers:pr.exc04a.text
ltx/swh_redirects_oak/prayers:pr.exc05.incipit	@ltx/swh_ke_oak/prayers:pr.exc05.incipit
ltx/swh_redirects_oak/prayers:pr.exc05.text	@ltx/swh_ke_oak/prayers:pr.exc05.text
ltx/swh_redirects_oak/prayers:pr.exc05a.text	@ltx/swh_ke_oak/prayers:pr.exc05a.text
ltx/swh_redirects_oak/prayers:pr.exc05b.text	@ltx/swh_ke_oak/prayers:pr.exc05b.text
ltx/swh_redirects_oak/prayers:pr.exc06.incipit	@ltx/swh_ke_oak/prayers:pr.exc06.incipit
ltx/swh_redirects_oak/prayers:pr.exc06.text	@ltx/swh_ke_oak/prayers:pr.exc06.text
ltx/swh_redirects_oak/prayers:pr.exc07.incipit	@ltx/swh_ke_oak/prayers:pr.exc07.incipit
ltx/swh_redirects_oak/prayers:pr.exc07.text	@ltx/swh_ke_oak/prayers:pr.exc07.text
ltx/swh_redirects_oak/prayers:pr.exc07a.incipit	@ltx/swh_ke_oak/prayers:pr.exc07a.incipit
ltx/swh_redirects_oak/prayers:pr.exc07a.text	@ltx/swh_ke_oak/prayers:pr.exc07a.text
ltx/swh_redirects_oak/prayers:pr.exc07b.incipit	@ltx/swh_ke_oak/prayers:pr.exc07b.incipit
ltx/swh_redirects_oak/prayers:pr.exc07b.text	@ltx/swh_ke_oak/prayers:pr.exc07b.text
ltx/swh_redirects_oak/prayers:pr.exc07c.incipit	@ltx/swh_ke_oak/prayers:pr.exc07c.incipit
ltx/swh_redirects_oak/prayers:pr.exc07c.text	@ltx/swh_ke_oak/prayers:pr.exc07c.text
ltx/swh_redirects_oak/prayers:pr.exc08.incipit	@ltx/swh_ke_oak/prayers:pr.exc08.incipit
ltx/swh_redirects_oak/prayers:pr.exc08.text	@ltx/swh_ke_oak/prayers:pr.exc08.text
ltx/swh_redirects_oak/prayers:pr.exc09.incipit	@ltx/swh_ke_oak/prayers:pr.exc09.incipit
ltx/swh_redirects_oak/prayers:pr.exc09.text	@ltx/swh_ke_oak/prayers:pr.exc09.text
ltx/swh_redirects_oak/prayers:pr.exc10.incipit	@ltx/swh_ke_oak/prayers:pr.exc10.incipit
ltx/swh_redirects_oak/prayers:pr.exc10.text	@ltx/swh_ke_oak/prayers:pr.exc10.text
ltx/swh_redirects_oak/prayers:pr.exc11.incipit	@ltx/swh_ke_oak/prayers:pr.exc11.incipit
ltx/swh_redirects_oak/prayers:pr.exc11.text	@ltx/swh_ke_oak/prayers:pr.exc11.text
ltx/swh_redirects_oak/prayers:pr.exc11a.incipit	@ltx/swh_ke_oak/prayers:pr.exc11a.incipit
ltx/swh_redirects_oak/prayers:pr.exc11a.text	@ltx/swh_ke_oak/prayers:pr.exc11a.text
ltx/swh_redirects_oak/prayers:pr.exc12.incipit	@ltx/swh_ke_oak/prayers:pr.exc12.incipit
ltx/swh_redirects_oak/prayers:pr.exc12.text	@ltx/swh_ke_oak/prayers:pr.exc12.text
ltx/swh_redirects_oak/prayers:pr.exc13.incipit	@ltx/swh_ke_oak/prayers:pr.exc13.incipit
ltx/swh_redirects_oak/prayers:pr.exc13.text	@ltx/swh_ke_oak/prayers:pr.exc13.text
ltx/swh_redirects_oak/prayers:pr.exc14.incipit	@ltx/swh_ke_oak/prayers:pr.exc14.incipit
ltx/swh_redirects_oak/prayers:pr.exc14.text	@ltx/swh_ke_oak/prayers:pr.exc14.text
ltx/swh_redirects_oak/prayers:pr.exc15.incipit	@ltx/swh_ke_oak/prayers:pr.exc15.incipit
ltx/swh_redirects_oak/prayers:pr.exc15.text	@ltx/swh_ke_oak/prayers:pr.exc15.text
ltx/swh_redirects_oak/prayers:pr.exc16.incipit	@ltx/swh_ke_oak/prayers:pr.exc16.incipit
ltx/swh_redirects_oak/prayers:pr.exc16.text	@ltx/swh_ke_oak/prayers:pr.exc16.text
ltx/swh_redirects_oak/prayers:pr.exc16a.incipit	@ltx/swh_ke_oak/prayers:pr.exc16a.incipit
ltx/swh_redirects_oak/prayers:pr.exc16a.text	@ltx/swh_ke_oak/prayers:pr.exc16a.text
ltx/swh_redirects_oak/prayers:pr.exc17.text	@ltx/swh_ke_oak/prayers:pr.exc17.text
ltx/swh_redirects_oak/prayers:pr.exc18.text	@ltx/swh_ke_oak/prayers:pr.exc18.text
ltx/swh_redirects_oak/prayers:pr.exc19.text	@ltx/swh_ke_oak/prayers:pr.exc19.text
ltx/swh_redirects_oak/prayers:pr.exc20.incipit	@ltx/swh_ke_oak/prayers:pr.exc20.incipit
ltx/swh_redirects_oak/prayers:pr.exc20.text	@ltx/swh_ke_oak/prayers:pr.exc20.text
ltx/swh_redirects_oak/prayers:pr.exc22.incipit	@ltx/swh_ke_oak/prayers:pr.exc22.incipit
ltx/swh_redirects_oak/prayers:pr.exc22.text	@ltx/swh_ke_oak/prayers:pr.exc22.text
ltx/swh_redirects_oak/prayers:pr.exc23.incipit	@ltx/swh_ke_oak/prayers:pr.exc23.incipit
ltx/swh_redirects_oak/prayers:pr.exc23.text	@ltx/swh_ke_oak/prayers:pr.exc23.text
ltx/swh_redirects_oak/prayers:pr.exc24.incipit	@ltx/swh_ke_oak/prayers:pr.exc24.incipit
ltx/swh_redirects_oak/prayers:pr.exc24.text	@ltx/swh_ke_oak/prayers:pr.exc24.text
ltx/swh_redirects_oak/prayers:pr.exc25.incipit	@ltx/swh_ke_oak/prayers:pr.exc25.incipit
ltx/swh_redirects_oak/prayers:pr.exc25.text	@ltx/swh_ke_oak/prayers:pr.exc25.text
ltx/swh_redirects_oak/prayers:pr.exc26.incipit	@ltx/swh_ke_oak/prayers:pr.exc26.incipit
ltx/swh_redirects_oak/prayers:pr.exc26.text	@ltx/swh_ke_oak/prayers:pr.exc26.text
ltx/swh_redirects_oak/prayers:pr.exc27.incipit	@ltx/swh_ke_oak/prayers:pr.exc27.incipit
ltx/swh_redirects_oak/prayers:pr.exc27.text	@ltx/swh_ke_oak/prayers:pr.exc27.text
ltx/swh_redirects_oak/prayers:pr.exc28.incipit	@ltx/swh_ke_oak/prayers:pr.exc28.incipit
ltx/swh_redirects_oak/prayers:pr.exc28.text	@ltx/swh_ke_oak/prayers:pr.exc28.text
ltx/swh_redirects_oak/prayers:pr.exc28a.incipit	@ltx/swh_ke_oak/prayers:pr.exc28a.incipit
ltx/swh_redirects_oak/prayers:pr.exc28a.text	@ltx/swh_ke_oak/prayers:pr.exc28a.text
ltx/swh_redirects_oak/prayers:pr.exc29.incipit	@ltx/swh_ke_oak/prayers:pr.exc29.incipit
ltx/swh_redirects_oak/prayers:pr.exc29.text	@ltx/swh_ke_oak/prayers:pr.exc29.text
ltx/swh_redirects_oak/prayers:pr.gos01.text	@ltx/swh_ke_oak/prayers:pr.gos01.text
ltx/swh_redirects_oak/prayers:pr.gos02.text	@ltx/swh_ke_oak/prayers:pr.gos02.text
ltx/swh_redirects_oak/prayers:pr.gos03a.text	@ltx/swh_ke_oak/prayers:pr.gos03a.text
ltx/swh_redirects_oak/prayers:pr.gos03b.text	@ltx/swh_ke_oak/prayers:pr.gos03b.text
ltx/swh_redirects_oak/prayers:pr.gos04.text	@ltx/swh_ke_oak/prayers:pr.gos04.text
ltx/swh_redirects_oak/prayers:pr.gos05.text	@ltx/swh_ke_oak/prayers:pr.gos05.text
ltx/swh_redirects_oak/prayers:pr.gos06.text	@ltx/swh_ke_oak/prayers:pr.gos06.text
ltx/swh_redirects_oak/prayers:pr.gos07.text	@ltx/swh_ke_oak/prayers:pr.GloryToYouLord.text
ltx/swh_redirects_oak/prayers:pr.otr01a.text	@ltx/swh_ke_oak/prayers:pr.otr01a.text
ltx/swh_redirects_oak/prayers:pr.otr01b.text	@ltx/swh_ke_oak/prayers:pr.otr01b.text
ltx/swh_redirects_oak/prayers:pr.pet00.text	@ltx/swh_ke_oak/prayers:pr.pet00.text
ltx/swh_redirects_oak/prayers:pr.pet01.text	@ltx/swh_ke_oak/prayers:pr.pet01.text
ltx/swh_redirects_oak/prayers:pr.pet02.incipit	@ltx/swh_ke_oak/prayers:pr.pet02.incipit
ltx/swh_redirects_oak/prayers:pr.pet02.text	@ltx/swh_ke_oak/prayers:pr.pet02.text
ltx/swh_redirects_oak/prayers:pr.pet03.incipit	@ltx/swh_ke_oak/prayers:pr.pet03.incipit
ltx/swh_redirects_oak/prayers:pr.pet03.text	@ltx/swh_ke_oak/prayers:pr.pet03.text
ltx/swh_redirects_oak/prayers:pr.pet04.incipit	@ltx/swh_ke_oak/prayers:pr.pet04.incipit
ltx/swh_redirects_oak/prayers:pr.pet04.text	@ltx/swh_ke_oak/prayers:pr.pet04.text
ltx/swh_redirects_oak/prayers:pr.pet04alt1.incipit	@ltx/swh_ke_oak/prayers:pr.pet04alt1.incipit
ltx/swh_redirects_oak/prayers:pr.pet04alt1.text	@ltx/swh_ke_oak/prayers:pr.pet04alt1.text
ltx/swh_redirects_oak/prayers:pr.pet04alt1.title	@ltx/swh_ke_oak/prayers:pr.pet04alt1.title
ltx/swh_redirects_oak/prayers:pr.pet04alt2.incipit	@ltx/swh_ke_oak/prayers:pr.pet04alt2.incipit
ltx/swh_redirects_oak/prayers:pr.pet04alt2.text	@ltx/swh_ke_oak/prayers:pr.pet04alt2.text
ltx/swh_redirects_oak/prayers:pr.pet04alt2.title	@ltx/swh_ke_oak/prayers:pr.pet04alt2.title
ltx/swh_redirects_oak/prayers:pr.pet05.incipit	@ltx/swh_ke_oak/prayers:pr.pet05.incipit
ltx/swh_redirects_oak/prayers:pr.pet05.text	@ltx/swh_ke_oak/prayers:pr.pet05.text
ltx/swh_redirects_oak/prayers:pr.pet06.incipit	@ltx/swh_ke_oak/prayers:pr.pet06.incipit
ltx/swh_redirects_oak/prayers:pr.pet06.text	@ltx/swh_ke_oak/prayers:pr.pet06.text
ltx/swh_redirects_oak/prayers:pr.pet06a.text	@ltx/swh_ke_oak/prayers:pr.pet06a.text
ltx/swh_redirects_oak/prayers:pr.pet06b.incipit	@ltx/swh_ke_oak/prayers:pr.pet06b.incipit
ltx/swh_redirects_oak/prayers:pr.pet06b.text	@ltx/swh_ke_oak/prayers:pr.pet06b.text
ltx/swh_redirects_oak/prayers:pr.pet07L.incipit	@ltx/swh_ke_oak/prayers:pr.pet07L.incipit
ltx/swh_redirects_oak/prayers:pr.pet07L.text	@ltx/swh_ke_oak/prayers:pr.pet07L.text
ltx/swh_redirects_oak/prayers:pr.pet07S.incipit	@ltx/swh_ke_oak/prayers:pr.pet07S.incipit
ltx/swh_redirects_oak/prayers:pr.pet07S.text	@ltx/swh_ke_oak/prayers:pr.pet07S.text
ltx/swh_redirects_oak/prayers:pr.pet07Sa.incipit	@ltx/swh_ke_oak/prayers:pr.pet07Sa.incipit
ltx/swh_redirects_oak/prayers:pr.pet07Sa.text	@ltx/swh_ke_oak/prayers:pr.pet07Sa.text
ltx/swh_redirects_oak/prayers:pr.pet08.incipit	@ltx/swh_ke_oak/prayers:pr.pet08.incipit
ltx/swh_redirects_oak/prayers:pr.pet08.text	@ltx/swh_ke_oak/prayers:pr.pet08.text
ltx/swh_redirects_oak/prayers:pr.pet09.incipit	@ltx/swh_ke_oak/prayers:pr.pet09.incipit
ltx/swh_redirects_oak/prayers:pr.pet09.text	@ltx/swh_ke_oak/prayers:pr.pet09.text
ltx/swh_redirects_oak/prayers:pr.pet10.incipit	@ltx/swh_ke_oak/prayers:pr.pet10.incipit
ltx/swh_redirects_oak/prayers:pr.pet10.text	@ltx/swh_ke_oak/prayers:pr.pet10.text
ltx/swh_redirects_oak/prayers:pr.pet11.text	@ltx/swh_ke_oak/prayers:pr.pet11.text
ltx/swh_redirects_oak/prayers:pr.pet11_coronavirus1.text	@ltx/swh_ke_oak/prayers:pr.pet11_coronavirus1.text
ltx/swh_redirects_oak/prayers:pr.pet11_coronavirus2.text	@ltx/swh_ke_oak/prayers:pr.pet11_coronavirus2.text
ltx/swh_redirects_oak/prayers:pr.pet12.incipit	@ltx/swh_ke_oak/prayers:pr.pet12.incipit
ltx/swh_redirects_oak/prayers:pr.pet12.text	@ltx/swh_ke_oak/prayers:pr.pet12.text
ltx/swh_redirects_oak/prayers:pr.pet13.incipit	@ltx/swh_ke_oak/prayers:pr.pet13.incipit
ltx/swh_redirects_oak/prayers:pr.pet13.text	@ltx/swh_ke_oak/prayers:pr.pet13.text
ltx/swh_redirects_oak/prayers:pr.pet14.incipit	@ltx/swh_ke_oak/prayers:pr.pet14.incipit
ltx/swh_redirects_oak/prayers:pr.pet14.text	@ltx/swh_ke_oak/prayers:pr.pet14.text
ltx/swh_redirects_oak/prayers:pr.pet15.incipit	@ltx/swh_ke_oak/prayers:pr.pet15.incipit
ltx/swh_redirects_oak/prayers:pr.pet15.text	@ltx/swh_ke_oak/prayers:pr.pet15.text
ltx/swh_redirects_oak/prayers:pr.pet16.incipit	@ltx/swh_ke_oak/prayers:pr.pet16.incipit
ltx/swh_redirects_oak/prayers:pr.pet16.text	@ltx/swh_ke_oak/prayers:pr.pet16.text
ltx/swh_redirects_oak/prayers:pr.pet17.incipit	@ltx/swh_ke_oak/prayers:pr.pet17.incipit
ltx/swh_redirects_oak/prayers:pr.pet17.text	@ltx/swh_ke_oak/prayers:pr.pet17.text
ltx/swh_redirects_oak/prayers:pr.pet18.incipit	@ltx/swh_ke_oak/prayers:pr.pet18.incipit
ltx/swh_redirects_oak/prayers:pr.pet18.text	@ltx/swh_ke_oak/prayers:pr.pet18.text
ltx/swh_redirects_oak/prayers:pr.pet19S.text	@ltx/swh_ke_oak/prayers:pr.pet19S.text
ltx/swh_redirects_oak/prayers:pr.pet19Sa.text	@ltx/swh_ke_oak/prayers:pr.pet19Sa.text
ltx/swh_redirects_oak/prayers:pr.pet19a.text	@ltx/swh_ke_oak/prayers:pr.pet19a.text
ltx/swh_redirects_oak/prayers:pr.pet19b.text	@ltx/swh_ke_oak/prayers:pr.pet19b.text
ltx/swh_redirects_oak/prayers:pr.pet19m.text	@ltx/swh_ke_oak/prayers:pr.pet19m.text
ltx/swh_redirects_oak/prayers:pr.pet20.incipit	@ltx/swh_ke_oak/prayers:pr.pet20.incipit
ltx/swh_redirects_oak/prayers:pr.pet20.text	@ltx/swh_ke_oak/prayers:pr.pet20.text
ltx/swh_redirects_oak/prayers:pr.pet21.incipit	@ltx/swh_ke_oak/prayers:pr.pet21.incipit
ltx/swh_redirects_oak/prayers:pr.pet21.text	@ltx/swh_ke_oak/prayers:pr.pet21.text
ltx/swh_redirects_oak/prayers:pr.pet21a.incipit	@ltx/swh_ke_oak/prayers:pr.pet21a.incipit
ltx/swh_redirects_oak/prayers:pr.pet21a.text	@ltx/swh_ke_oak/prayers:pr.pet21a.text
ltx/swh_redirects_oak/prayers:pr.pet21b.incipit	@ltx/swh_ke_oak/prayers:pr.pet21b.incipit
ltx/swh_redirects_oak/prayers:pr.pet21b.text	@ltx/swh_ke_oak/prayers:pr.pet21b.text
ltx/swh_redirects_oak/prayers:pr.pet21c.incipit	@ltx/swh_ke_oak/prayers:pr.pet21c.incipit
ltx/swh_redirects_oak/prayers:pr.pet21c.text	@ltx/swh_ke_oak/prayers:pr.pet21c.text
ltx/swh_redirects_oak/prayers:pr.pet21d.incipit	@ltx/swh_ke_oak/prayers:pr.pet21d.incipit
ltx/swh_redirects_oak/prayers:pr.pet21d.text	@ltx/swh_ke_oak/prayers:pr.pet21d.text
ltx/swh_redirects_oak/prayers:pr.pet21p.incipit	@ltx/swh_ke_oak/prayers:pr.pet21p.incipit
ltx/swh_redirects_oak/prayers:pr.pet21p.text	@ltx/swh_ke_oak/prayers:pr.pet21p.text
ltx/swh_redirects_oak/prayers:pr.pet22.incipit	@ltx/swh_ke_oak/prayers:pr.pet22.incipit
ltx/swh_redirects_oak/prayers:pr.pet22.text	@ltx/swh_ke_oak/prayers:pr.pet22.text
ltx/swh_redirects_oak/prayers:pr.pet23.incipit	@ltx/swh_ke_oak/prayers:pr.pet23.incipit
ltx/swh_redirects_oak/prayers:pr.pet23.text	@ltx/swh_ke_oak/prayers:pr.pet23.text
ltx/swh_redirects_oak/prayers:pr.pet24.incipit	@ltx/swh_ke_oak/prayers:pr.pet24.incipit
ltx/swh_redirects_oak/prayers:pr.pet24.text	@ltx/swh_ke_oak/prayers:pr.pet24.text
ltx/swh_redirects_oak/prayers:pr.pet24m.incipit	@ltx/swh_ke_oak/prayers:pr.pet24m.incipit
ltx/swh_redirects_oak/prayers:pr.pet24m.text	@ltx/swh_ke_oak/prayers:pr.pet24m.text
ltx/swh_redirects_oak/prayers:pr.pet24v.incipit	@ltx/swh_ke_oak/prayers:pr.pet24v.incipit
ltx/swh_redirects_oak/prayers:pr.pet24v.text	@ltx/swh_ke_oak/prayers:pr.pet24v.text
ltx/swh_redirects_oak/prayers:pr.pet25m.incipit	@ltx/swh_ke_oak/prayers:pr.pet25m.incipit
ltx/swh_redirects_oak/prayers:pr.pet25m.text	@ltx/swh_ke_oak/prayers:pr.pet25m.text
ltx/swh_redirects_oak/prayers:pr.pet25v.incipit	@ltx/swh_ke_oak/prayers:pr.pet25v.incipit
ltx/swh_redirects_oak/prayers:pr.pet25v.text	@ltx/swh_ke_oak/prayers:pr.pet25v.text
ltx/swh_redirects_oak/prayers:pr.pet26.incipit	@ltx/swh_ke_oak/prayers:pr.pet26.incipit
ltx/swh_redirects_oak/prayers:pr.pet26.text	@ltx/swh_ke_oak/prayers:pr.pet26.text
ltx/swh_redirects_oak/prayers:pr.pet27.incipit	@ltx/swh_ke_oak/prayers:pr.pet27.incipit
ltx/swh_redirects_oak/prayers:pr.pet27.text	@ltx/swh_ke_oak/prayers:pr.pet27.text
ltx/swh_redirects_oak/prayers:pr.pet28.incipit	@ltx/swh_ke_oak/prayers:pr.pet28.incipit
ltx/swh_redirects_oak/prayers:pr.pet28.text	@ltx/swh_ke_oak/prayers:pr.pet28.text
ltx/swh_redirects_oak/prayers:pr.pet29.incipit	@ltx/swh_ke_oak/prayers:pr.pet29.incipit
ltx/swh_redirects_oak/prayers:pr.pet29.text	@ltx/swh_ke_oak/prayers:pr.pet29.text
ltx/swh_redirects_oak/prayers:pr.pet30.incipit	@ltx/swh_ke_oak/prayers:pr.pet30.incipit
ltx/swh_redirects_oak/prayers:pr.pet30.text	@ltx/swh_ke_oak/prayers:pr.pet30.text
ltx/swh_redirects_oak/prayers:pr.pet31.text	@ltx/swh_ke_oak/prayers:pr.pet31.text
ltx/swh_redirects_oak/prayers:pr.pet32.incipit	@ltx/swh_ke_oak/prayers:pr.pet32.incipit
ltx/swh_redirects_oak/prayers:pr.pet32.text	@ltx/swh_ke_oak/prayers:pr.pet32.text
ltx/swh_redirects_oak/prayers:pr.pet33.incipit	@ltx/swh_ke_oak/prayers:pr.pet33.incipit
ltx/swh_redirects_oak/prayers:pr.pet33.text	@ltx/swh_ke_oak/prayers:pr.pet33.text
ltx/swh_redirects_oak/prayers:pr.pet34.incipit	@ltx/swh_ke_oak/prayers:pr.pet34.incipit
ltx/swh_redirects_oak/prayers:pr.pet34.text	@ltx/swh_ke_oak/prayers:pr.pet34.text
ltx/swh_redirects_oak/prayers:pr.pet35.incipit	@ltx/swh_ke_oak/prayers:pr.pet35.incipit
ltx/swh_redirects_oak/prayers:pr.pet35.text	@ltx/swh_ke_oak/prayers:pr.pet35.text
ltx/swh_redirects_oak/prayers:pr.pet36.incipit	@ltx/swh_ke_oak/prayers:pr.pet36.incipit
ltx/swh_redirects_oak/prayers:pr.pet36.text	@ltx/swh_ke_oak/prayers:pr.pet36.text
ltx/swh_redirects_oak/prayers:pr.pet37.incipit	@ltx/swh_ke_oak/prayers:pr.pet37.incipit
ltx/swh_redirects_oak/prayers:pr.pet37.text	@ltx/swh_ke_oak/prayers:pr.pet37.text
ltx/swh_redirects_oak/prayers:pr.pet37a.incipit	@ltx/swh_ke_oak/prayers:pr.pet37a.incipit
ltx/swh_redirects_oak/prayers:pr.pet37a.text	@ltx/swh_ke_oak/prayers:pr.pet37a.text
ltx/swh_redirects_oak/prayers:pr.pet37b.incipit	@ltx/swh_ke_oak/prayers:pr.pet37b.incipit
ltx/swh_redirects_oak/prayers:pr.pet37b.text	@ltx/swh_ke_oak/prayers:pr.pet37b.text
ltx/swh_redirects_oak/prayers:pr.petBap01.incipit	@ltx/swh_ke_oak/prayers:pr.petBap01.incipit
ltx/swh_redirects_oak/prayers:pr.petBap01.text	@ltx/swh_ke_oak/prayers:pr.petBap01.text
ltx/swh_redirects_oak/prayers:pr.petBap02.incipit	@ltx/swh_ke_oak/prayers:pr.petBap02.incipit
ltx/swh_redirects_oak/prayers:pr.petBap02.text	@ltx/swh_ke_oak/prayers:pr.petBap02.text
ltx/swh_redirects_oak/prayers:pr.petBap03.incipit	@ltx/swh_ke_oak/prayers:pr.petBap03.incipit
ltx/swh_redirects_oak/prayers:pr.petBap03.text	@ltx/swh_ke_oak/prayers:pr.petBap03.text
ltx/swh_redirects_oak/prayers:pr.petBap04.incipit	@ltx/swh_ke_oak/prayers:pr.petBap04.incipit
ltx/swh_redirects_oak/prayers:pr.petBap04.text	@ltx/swh_ke_oak/prayers:pr.petBap04.text
ltx/swh_redirects_oak/prayers:pr.petBap05.incipit	@ltx/swh_ke_oak/prayers:pr.petBap05.incipit
ltx/swh_redirects_oak/prayers:pr.petBap05.text	@ltx/swh_ke_oak/prayers:pr.petBap05.text
ltx/swh_redirects_oak/prayers:pr.petBap06.incipit	@ltx/swh_ke_oak/prayers:pr.petBap06.incipit
ltx/swh_redirects_oak/prayers:pr.petBap06.text	@ltx/swh_ke_oak/prayers:pr.petBap06.text
ltx/swh_redirects_oak/prayers:pr.petBap07.incipit	@ltx/swh_ke_oak/prayers:pr.petBap07.incipit
ltx/swh_redirects_oak/prayers:pr.petBap07.text	@ltx/swh_ke_oak/prayers:pr.petBap07.text
ltx/swh_redirects_oak/prayers:pr.petCatechumens01.text	@ltx/swh_ke_oak/prayers:pr.petCatechumens01.text
ltx/swh_redirects_oak/prayers:pr.petCatechumens02.text	@ltx/swh_ke_oak/prayers:pr.petCatechumens02.text
ltx/swh_redirects_oak/prayers:pr.petCatechumens03.text	@ltx/swh_ke_oak/prayers:pr.petCatechumens03.text
ltx/swh_redirects_oak/prayers:pr.petCatechumens04.text	@ltx/swh_ke_oak/prayers:pr.petCatechumens04.text
ltx/swh_redirects_oak/prayers:pr.petCatechumens05.text	@ltx/swh_ke_oak/prayers:pr.petCatechumens05.text
ltx/swh_redirects_oak/prayers:pr.petCatechumens06.text	@ltx/swh_ke_oak/prayers:pr.petCatechumens06.text
ltx/swh_redirects_oak/prayers:pr.petCatechumens07.text	@ltx/swh_ke_oak/prayers:pr.petCatechumens07.text
ltx/swh_redirects_oak/prayers:pr.petCatechumens08.text	@ltx/swh_ke_oak/prayers:pr.petCatechumens08.text
ltx/swh_redirects_oak/prayers:pr.petCatechumens09.text	@ltx/swh_ke_oak/prayers:pr.petCatechumens09.text
ltx/swh_redirects_oak/prayers:pr.petCatechumens10.text	@ltx/swh_ke_oak/prayers:pr.petCatechumens10.text
ltx/swh_redirects_oak/prayers:pr.petCatechumens11.text	@ltx/swh_ke_oak/prayers:pr.petCatechumens11.text
ltx/swh_redirects_oak/prayers:pr.petCatechumens12.text	@ltx/swh_ke_oak/prayers:pr.petCatechumens12.text
ltx/swh_redirects_oak/prayers:pr.petCatechumens13.text	@ltx/swh_ke_oak/prayers:pr.petCatechumens13.text
ltx/swh_redirects_oak/prayers:pr.petCatechumens14.text	@ltx/swh_ke_oak/prayers:pr.petCatechumens14.text
ltx/swh_redirects_oak/prayers:pr.petCatechumens15.text	@ltx/swh_ke_oak/prayers:pr.petCatechumens15.text
ltx/swh_redirects_oak/prayers:pr.petCatechumens16.text	@ltx/swh_ke_oak/prayers:pr.petCatechumens16.text
ltx/swh_redirects_oak/prayers:pr.petCatechumens17.text	@ltx/swh_ke_oak/prayers:pr.petCatechumens17.text
ltx/swh_redirects_oak/prayers:pr.petCatechumens18.text	@ltx/swh_ke_oak/prayers:pr.petCatechumens18.text
ltx/swh_redirects_oak/prayers:pr.petCatechumens19.text	@ltx/swh_ke_oak/prayers:pr.petCatechumens19.text
ltx/swh_redirects_oak/prayers:pr.petCatechumens20.text	@ltx/swh_ke_oak/prayers:pr.petCatechumens20.text
ltx/swh_redirects_oak/prayers:pr.petCatechumens21.text	@ltx/swh_ke_oak/prayers:pr.petCatechumens21.text
ltx/swh_redirects_oak/prayers:pr.petCatechumens22.text	@ltx/swh_ke_oak/prayers:pr.petCatechumens22.text
ltx/swh_redirects_oak/prayers:pr.petCatechumens23.text	@ltx/swh_ke_oak/prayers:pr.petCatechumens23.text
ltx/swh_redirects_oak/prayers:pr.petCatechumens24.text	@ltx/swh_ke_oak/prayers:pr.petCatechumens24.text
ltx/swh_redirects_oak/prayers:pr.petCompline01.text	@ltx/swh_ke_oak/prayers:pr.petCompline01.text
ltx/swh_redirects_oak/prayers:pr.petCompline02.text	@ltx/swh_ke_oak/prayers:pr.petCompline02.text
ltx/swh_redirects_oak/prayers:pr.petCompline03.text	@ltx/swh_ke_oak/prayers:pr.petCompline03.text
ltx/swh_redirects_oak/prayers:pr.petCompline04.text	@ltx/swh_ke_oak/prayers:pr.petCompline04.text
ltx/swh_redirects_oak/prayers:pr.petCompline05.text	@ltx/swh_ke_oak/prayers:pr.petCompline05.text
ltx/swh_redirects_oak/prayers:pr.petCompline06.text	@ltx/swh_ke_oak/prayers:pr.petCompline06.text
ltx/swh_redirects_oak/prayers:pr.petCompline07.text	@ltx/swh_ke_oak/prayers:pr.petCompline07.text
ltx/swh_redirects_oak/prayers:pr.petCompline08.text	@ltx/swh_ke_oak/prayers:pr.petCompline08.text
ltx/swh_redirects_oak/prayers:pr.petCompline09.text	@ltx/swh_ke_oak/prayers:pr.petCompline09.text
ltx/swh_redirects_oak/prayers:pr.petCompline10.text	@ltx/swh_ke_oak/prayers:pr.petCompline10.text
ltx/swh_redirects_oak/prayers:pr.petCompline11.text	@ltx/swh_ke_oak/prayers:pr.petCompline11.text
ltx/swh_redirects_oak/prayers:pr.petCompline12.text	@ltx/swh_ke_oak/prayers:pr.petCompline12.text
ltx/swh_redirects_oak/prayers:pr.petCompline13.text	@ltx/swh_ke_oak/prayers:pr.petCompline13.text
ltx/swh_redirects_oak/prayers:pr.petCompline14.text	@ltx/swh_ke_oak/prayers:pr.petCompline14.text
ltx/swh_redirects_oak/prayers:pr.petCompline15.text	@ltx/swh_ke_oak/prayers:pr.petCompline15.text
ltx/swh_redirects_oak/prayers:pr.petConsecration01.incipit	@ltx/swh_ke_oak/prayers:pr.petConsecration01.incipit
ltx/swh_redirects_oak/prayers:pr.petConsecration01.text	@ltx/swh_ke_oak/prayers:pr.petConsecration01.text
ltx/swh_redirects_oak/prayers:pr.petConsecration02.incipit	@ltx/swh_ke_oak/prayers:pr.petConsecration02.incipit
ltx/swh_redirects_oak/prayers:pr.petConsecration02.text	@ltx/swh_ke_oak/prayers:pr.petConsecration02.text
ltx/swh_redirects_oak/prayers:pr.petConsecration13a.text	@ltx/swh_ke_oak/prayers:pr.petConsecration13a.text
ltx/swh_redirects_oak/prayers:pr.petConsecration13b.text	@ltx/swh_ke_oak/prayers:pr.petConsecration13b.text
ltx/swh_redirects_oak/prayers:pr.petCross05.incipit	@ltx/swh_ke_oak/prayers:pr.petCross05.incipit
ltx/swh_redirects_oak/prayers:pr.petCross05.text	@ltx/swh_ke_oak/prayers:pr.petCross05.text
ltx/swh_redirects_oak/prayers:pr.petFuneral01.incipit	@ltx/swh_ke_oak/prayers:pr.petFuneral01.incipit
ltx/swh_redirects_oak/prayers:pr.petFuneral01.text	@ltx/swh_ke_oak/prayers:pr.petFuneral01.text
ltx/swh_redirects_oak/prayers:pr.petFuneral02.incipit	@ltx/swh_ke_oak/prayers:pr.petFuneral02.incipit
ltx/swh_redirects_oak/prayers:pr.petFuneral02.text	@ltx/swh_ke_oak/prayers:pr.petFuneral02.text
ltx/swh_redirects_oak/prayers:pr.petKneel01.incipit	@ltx/swh_ke_oak/prayers:pr.petKneel01.incipit
ltx/swh_redirects_oak/prayers:pr.petKneel01.text	@ltx/swh_ke_oak/prayers:pr.petKneel01.text
ltx/swh_redirects_oak/prayers:pr.petKneel02.incipit	@ltx/swh_ke_oak/prayers:pr.petKneel02.incipit
ltx/swh_redirects_oak/prayers:pr.petKneel02.text	@ltx/swh_ke_oak/prayers:pr.petKneel02.text
ltx/swh_redirects_oak/prayers:pr.petKneel03.incipit	@ltx/swh_ke_oak/prayers:pr.petKneel03.incipit
ltx/swh_redirects_oak/prayers:pr.petKneel03.text	@ltx/swh_ke_oak/prayers:pr.petKneel03.text
ltx/swh_redirects_oak/prayers:pr.petKneel04.incipit	@ltx/swh_ke_oak/prayers:pr.petKneel04.incipit
ltx/swh_redirects_oak/prayers:pr.petKneel04.text	@ltx/swh_ke_oak/prayers:pr.petKneel04.text
ltx/swh_redirects_oak/prayers:pr.petKneel05.incipit	@ltx/swh_ke_oak/prayers:pr.petKneel05.incipit
ltx/swh_redirects_oak/prayers:pr.petKneel05.text	@ltx/swh_ke_oak/prayers:pr.petKneel05.text
ltx/swh_redirects_oak/prayers:pr.petKneel06.incipit	@ltx/swh_ke_oak/prayers:pr.petKneel06.incipit
ltx/swh_redirects_oak/prayers:pr.petKneel06.text	@ltx/swh_ke_oak/prayers:pr.petKneel06.text
ltx/swh_redirects_oak/prayers:pr.petKneel07.incipit	@ltx/swh_ke_oak/prayers:pr.petKneel07.incipit
ltx/swh_redirects_oak/prayers:pr.petKneel07.text	@ltx/swh_ke_oak/prayers:pr.petKneel07.text
ltx/swh_redirects_oak/prayers:pr.petKneel08.incipit	@ltx/swh_ke_oak/prayers:pr.petKneel08.incipit
ltx/swh_redirects_oak/prayers:pr.petKneel08.text	@ltx/swh_ke_oak/prayers:pr.petKneel08.text
ltx/swh_redirects_oak/prayers:pr.petMonastery01a.text	@ltx/swh_ke_oak/prayers:pr.petMonastery01a.text
ltx/swh_redirects_oak/prayers:pr.petMonastery01b.text	@ltx/swh_ke_oak/prayers:pr.petMonastery01b.text
ltx/swh_redirects_oak/prayers:pr.petMonastery02a.text	@ltx/swh_ke_oak/prayers:pr.petMonastery02a.text
ltx/swh_redirects_oak/prayers:pr.petMonastery02b.text	@ltx/swh_ke_oak/prayers:pr.petMonastery02b.text
ltx/swh_redirects_oak/prayers:pr.petMonastery22.text	@ltx/swh_ke_oak/prayers:pr.petMonastery22.text
ltx/swh_redirects_oak/prayers:pr.petMonastery23.text	@ltx/swh_ke_oak/prayers:pr.petMonastery23.text
ltx/swh_redirects_oak/prayers:pr.petMonasteryLity01.text	@ltx/swh_ke_oak/prayers:pr.petMonasteryLity01.text
ltx/swh_redirects_oak/prayers:pr.petMonasteryLity02.text	@ltx/swh_ke_oak/prayers:pr.petMonasteryLity02.text
ltx/swh_redirects_oak/prayers:pr.petMonasteryLity03.text	@ltx/swh_ke_oak/prayers:pr.petMonasteryLity03.text
ltx/swh_redirects_oak/prayers:pr.petOrdination01a.text	@ltx/swh_ke_oak/prayers:pr.petOrdination01a.text
ltx/swh_redirects_oak/prayers:pr.petOrdination01b.text	@ltx/swh_ke_oak/prayers:pr.petOrdination01b.text
ltx/swh_redirects_oak/prayers:pr.petOrdination02_bishop.text	@ltx/swh_ke_oak/prayers:pr.petOrdination02_bishop.text
ltx/swh_redirects_oak/prayers:pr.petOrdination02_deacon.text	@ltx/swh_ke_oak/prayers:pr.petOrdination02_deacon.text
ltx/swh_redirects_oak/prayers:pr.petOrdination02_priest.text	@ltx/swh_ke_oak/prayers:pr.petOrdination02_priest.text
ltx/swh_redirects_oak/prayers:pr.petOrdination03_bishop.text	@ltx/swh_ke_oak/prayers:pr.petOrdination03_bishop.text
ltx/swh_redirects_oak/prayers:pr.petOrdination03_deacon.text	@ltx/swh_ke_oak/prayers:pr.petOrdination03_deacon.text
ltx/swh_redirects_oak/prayers:pr.petOrdination03_priest.text	@ltx/swh_ke_oak/prayers:pr.petOrdination03_priest.text
ltx/swh_redirects_oak/prayers:pr.petOrdination04.text	@ltx/swh_ke_oak/prayers:pr.petOrdination04.text
ltx/swh_redirects_oak/prayers:pr.petSouls01.incipit	@ltx/swh_ke_oak/prayers:pr.petSouls01.incipit
ltx/swh_redirects_oak/prayers:pr.petSouls01.text	@ltx/swh_ke_oak/prayers:pr.petSouls01.text
ltx/swh_redirects_oak/prayers:pr.petSouls02.incipit	@ltx/swh_ke_oak/prayers:pr.petSouls02.incipit
ltx/swh_redirects_oak/prayers:pr.petSouls02.text	@ltx/swh_ke_oak/prayers:pr.petSouls02.text
ltx/swh_redirects_oak/prayers:pr.petUnction01.incipit	@ltx/swh_ke_oak/prayers:pr.petUnction01.incipit
ltx/swh_redirects_oak/prayers:pr.petUnction01.text	@ltx/swh_ke_oak/prayers:pr.petUnction01.text
ltx/swh_redirects_oak/prayers:pr.petUnction02.incipit	@ltx/swh_ke_oak/prayers:pr.petUnction02.incipit
ltx/swh_redirects_oak/prayers:pr.petUnction02.text	@ltx/swh_ke_oak/prayers:pr.petUnction02.text
ltx/swh_redirects_oak/prayers:pr.petUnction03.incipit	@ltx/swh_ke_oak/prayers:pr.petUnction03.incipit
ltx/swh_redirects_oak/prayers:pr.petUnction03.text	@ltx/swh_ke_oak/prayers:pr.petUnction03.text
ltx/swh_redirects_oak/prayers:pr.petWater01.incipit	@ltx/swh_ke_oak/prayers:pr.petWater01.incipit
ltx/swh_redirects_oak/prayers:pr.petWater01.text	@ltx/swh_ke_oak/prayers:pr.petWater01.text
ltx/swh_redirects_oak/prayers:pr.petWater02.incipit	@ltx/swh_ke_oak/prayers:pr.petWater02.incipit
ltx/swh_redirects_oak/prayers:pr.petWater02.text	@ltx/swh_ke_oak/prayers:pr.petWater02.text
ltx/swh_redirects_oak/prayers:pr.petWater03.incipit	@ltx/swh_ke_oak/prayers:pr.petWater03.incipit
ltx/swh_redirects_oak/prayers:pr.petWater03.text	@ltx/swh_ke_oak/prayers:pr.petWater03.text
ltx/swh_redirects_oak/prayers:pr.petWater03alt.incipit	@ltx/swh_ke_oak/prayers:pr.petWater03alt.incipit
ltx/swh_redirects_oak/prayers:pr.petWater03alt.text	@ltx/swh_ke_oak/prayers:pr.petWater03alt.text
ltx/swh_redirects_oak/prayers:pr.petWater04.incipit	@ltx/swh_ke_oak/prayers:pr.petWater04.incipit
ltx/swh_redirects_oak/prayers:pr.petWater04.text	@ltx/swh_ke_oak/prayers:pr.petWater04.text
ltx/swh_redirects_oak/prayers:pr.petWater05.incipit	@ltx/swh_ke_oak/prayers:pr.petWater05.incipit
ltx/swh_redirects_oak/prayers:pr.petWater05.text	@ltx/swh_ke_oak/prayers:pr.petWater05.text
ltx/swh_redirects_oak/prayers:pr.petWater06.incipit	@ltx/swh_ke_oak/prayers:pr.petWater06.incipit
ltx/swh_redirects_oak/prayers:pr.petWater06.text	@ltx/swh_ke_oak/prayers:pr.petWater06.text
ltx/swh_redirects_oak/prayers:pr.petWater07.incipit	@ltx/swh_ke_oak/prayers:pr.petWater07.incipit
ltx/swh_redirects_oak/prayers:pr.petWater07.text	@ltx/swh_ke_oak/prayers:pr.petWater07.text
ltx/swh_redirects_oak/prayers:pr.petWater07alt.incipit	@ltx/swh_ke_oak/prayers:pr.petWater07alt.incipit
ltx/swh_redirects_oak/prayers:pr.petWater07alt.text	@ltx/swh_ke_oak/prayers:pr.petWater07alt.text
ltx/swh_redirects_oak/prayers:pr.petWater08.incipit	@ltx/swh_ke_oak/prayers:pr.petWater08.incipit
ltx/swh_redirects_oak/prayers:pr.petWater08.text	@ltx/swh_ke_oak/prayers:pr.petWater08.text
ltx/swh_redirects_oak/prayers:pr.petWater09.incipit	@ltx/swh_ke_oak/prayers:pr.petWater09.incipit
ltx/swh_redirects_oak/prayers:pr.petWater09.text	@ltx/swh_ke_oak/prayers:pr.petWater09.text
ltx/swh_redirects_oak/prayers:pr.petWater10.incipit	@ltx/swh_ke_oak/prayers:pr.petWater10.incipit
ltx/swh_redirects_oak/prayers:pr.petWater10.text	@ltx/swh_ke_oak/prayers:pr.petWater10.text
ltx/swh_redirects_oak/prayers:pr.petWater11.incipit	@ltx/swh_ke_oak/prayers:pr.petWater11.incipit
ltx/swh_redirects_oak/prayers:pr.petWater11.text	@ltx/swh_ke_oak/prayers:pr.petWater11.text
ltx/swh_redirects_oak/prayers:pr.petWater12.incipit	@ltx/swh_ke_oak/prayers:pr.petWater12.incipit
ltx/swh_redirects_oak/prayers:pr.petWater12.text	@ltx/swh_ke_oak/prayers:pr.petWater12.text
ltx/swh_redirects_oak/prayers:pr.petWater13.incipit	@ltx/swh_ke_oak/prayers:pr.petWater13.incipit
ltx/swh_redirects_oak/prayers:pr.petWater13.text	@ltx/swh_ke_oak/prayers:pr.petWater13.text
ltx/swh_redirects_oak/prayers:pr.petWater14.incipit	@ltx/swh_ke_oak/prayers:pr.petWater14.incipit
ltx/swh_redirects_oak/prayers:pr.petWater14.text	@ltx/swh_ke_oak/prayers:pr.petWater14.text
ltx/swh_redirects_oak/prayers:pr.petWater15.incipit	@ltx/swh_ke_oak/prayers:pr.petWater15.incipit
ltx/swh_redirects_oak/prayers:pr.petWater15.text	@ltx/swh_ke_oak/prayers:pr.petWater15.text
ltx/swh_redirects_oak/prayers:pr.petWater16.incipit	@ltx/swh_ke_oak/prayers:pr.petWater16.incipit
ltx/swh_redirects_oak/prayers:pr.petWater16.text	@ltx/swh_ke_oak/prayers:pr.petWater16.text
ltx/swh_redirects_oak/prayers:pr.petWed01.incipit	@ltx/swh_ke_oak/prayers:pr.petWed01.incipit
ltx/swh_redirects_oak/prayers:pr.petWed01.text	@ltx/swh_ke_oak/prayers:pr.petWed01.text
ltx/swh_redirects_oak/prayers:pr.petWed02.incipit	@ltx/swh_ke_oak/prayers:pr.petWed02.incipit
ltx/swh_redirects_oak/prayers:pr.petWed02.text	@ltx/swh_ke_oak/prayers:pr.petWed02.text
ltx/swh_redirects_oak/prayers:pr.petWed03.incipit	@ltx/swh_ke_oak/prayers:pr.petWed03.incipit
ltx/swh_redirects_oak/prayers:pr.petWed03.text	@ltx/swh_ke_oak/prayers:pr.petWed03.text
ltx/swh_redirects_oak/prayers:pr.petWed04.incipit	@ltx/swh_ke_oak/prayers:pr.petWed04.incipit
ltx/swh_redirects_oak/prayers:pr.petWed04.text	@ltx/swh_ke_oak/prayers:pr.petWed04.text
ltx/swh_redirects_oak/prayers:pr.petWed05.incipit	@ltx/swh_ke_oak/prayers:pr.petWed05.incipit
ltx/swh_redirects_oak/prayers:pr.petWed05.text	@ltx/swh_ke_oak/prayers:pr.petWed05.text
ltx/swh_redirects_oak/prayers:pr.petWed06.incipit	@ltx/swh_ke_oak/prayers:pr.petWed06.incipit
ltx/swh_redirects_oak/prayers:pr.petWed06.text	@ltx/swh_ke_oak/prayers:pr.petWed06.text
ltx/swh_redirects_oak/prayers:pr.petWed07.incipit	@ltx/swh_ke_oak/prayers:pr.petWed07.incipit
ltx/swh_redirects_oak/prayers:pr.petWed07.text	@ltx/swh_ke_oak/prayers:pr.petWed07.text
ltx/swh_redirects_oak/prayers:pr.petWed08.incipit	@ltx/swh_ke_oak/prayers:pr.petWed08.incipit
ltx/swh_redirects_oak/prayers:pr.petWed08.text	@ltx/swh_ke_oak/prayers:pr.petWed08.text
ltx/swh_redirects_oak/prayers:pr.petWed09.incipit	@ltx/swh_ke_oak/prayers:pr.petWed09.incipit
ltx/swh_redirects_oak/prayers:pr.petWed09.text	@ltx/swh_ke_oak/prayers:pr.petWed09.text
ltx/swh_redirects_oak/prayers:pr.petWed10.incipit	@ltx/swh_ke_oak/prayers:pr.petWed10.incipit
ltx/swh_redirects_oak/prayers:pr.petWed10.text	@ltx/swh_ke_oak/prayers:pr.petWed10.text
ltx/swh_redirects_oak/prayers:pr.petWed11.incipit	@ltx/swh_ke_oak/prayers:pr.petWed11.incipit
ltx/swh_redirects_oak/prayers:pr.petWed11.text	@ltx/swh_ke_oak/prayers:pr.petWed11.text
ltx/swh_redirects_oak/prayers:pr.petWed12.incipit	@ltx/swh_ke_oak/prayers:pr.petWed12.incipit
ltx/swh_redirects_oak/prayers:pr.petWed12.text	@ltx/swh_ke_oak/prayers:pr.petWed12.text
ltx/swh_redirects_oak/prayers:pr.petWed13.incipit	@ltx/swh_ke_oak/prayers:pr.petWed13.incipit
ltx/swh_redirects_oak/prayers:pr.petWed13.text	@ltx/swh_ke_oak/prayers:pr.petWed13.text
ltx/swh_redirects_oak/prayers:pr.petWed14.incipit	@ltx/swh_ke_oak/prayers:pr.petWed14.incipit
ltx/swh_redirects_oak/prayers:pr.petWed14.text	@ltx/swh_ke_oak/prayers:pr.petWed14.text
ltx/swh_redirects_oak/prayers:pr.photagogic_begin_Saints.incipit	@ltx/swh_ke_oak/prayers:pr.photagogic_begin_Saints.incipit
ltx/swh_redirects_oak/prayers:pr.photagogic_begin_Saints.text	@ltx/swh_ke_oak/prayers:pr.photagogic_begin_Saints.text
ltx/swh_redirects_oak/prayers:pr.photagogic_begin_Theotokos.incipit	@ltx/swh_ke_oak/prayers:pr.photagogic_begin_Theotokos.incipit
ltx/swh_redirects_oak/prayers:pr.photagogic_begin_Theotokos.text	@ltx/swh_ke_oak/prayers:pr.photagogic_begin_Theotokos.text
ltx/swh_redirects_oak/prayers:pr.photagogic_end_Saints.incipit	@ltx/swh_ke_oak/prayers:pr.photagogic_end_Saints.incipit
ltx/swh_redirects_oak/prayers:pr.photagogic_end_Saints.text	@ltx/swh_ke_oak/prayers:pr.photagogic_end_Saints.text
ltx/swh_redirects_oak/prayers:pr.photagogic_end_Theotokos.incipit	@ltx/swh_ke_oak/prayers:pr.photagogic_end_Theotokos.incipit
ltx/swh_redirects_oak/prayers:pr.photagogic_end_Theotokos.text	@ltx/swh_ke_oak/prayers:pr.photagogic_end_Theotokos.text
ltx/swh_redirects_oak/prayers:pr.res01.text	@ltx/swh_ke_oak/prayers:pr.res01.text
ltx/swh_redirects_oak/prayers:pr.res02.text	@ltx/swh_ke_oak/prayers:pr.res02.text
ltx/swh_redirects_oak/prayers:pr.res03.text	@ltx/swh_ke_oak/prayers:pr.res03.text
ltx/swh_redirects_oak/prayers:pr.res04.text	@ltx/swh_ke_oak/prayers:pr.res04.text
ltx/swh_redirects_oak/prayers:pr.res05.text	@ltx/swh_ke_oak/prayers:pr.res05.text
ltx/swh_redirects_oak/prayers:pr.res06.MM.long.sos.text	@ltx/swh_ke_oak/prayers:pr.res06.MM.long.sos.text
ltx/swh_redirects_oak/prayers:pr.res06.text	@ltx/swh_ke_oak/prayers:pr.res06.text
ltx/swh_redirects_oak/prayers:pr.res07.MM.long.text	@ltx/swh_ke_oak/prayers:pr.res07.MM.long.text
ltx/swh_redirects_oak/prayers:pr.res07.text	@ltx/swh_ke_oak/prayers:pr.res07.text
ltx/swh_redirects_oak/prayers:pr.res08.text	@ltx/swh_ke_oak/prayers:pr.res08.text
ltx/swh_redirects_oak/prayers:pr.res09.text	@ltx/swh_ke_oak/prayers:pr.res09.text
ltx/swh_redirects_oak/prayers:pr.res10.text	@ltx/swh_ke_oak/prayers:pr.res10.text
ltx/swh_redirects_oak/prayers:pr.res11.text	@ltx/swh_ke_oak/prayers:pr.res11.text
ltx/swh_redirects_oak/prayers:pr.res12.text	@ltx/swh_ke_oak/prayers:pr.res12.text
ltx/swh_redirects_oak/prayers:pr.res13.text	@ltx/swh_ke_oak/prayers:pr.res13.text
ltx/swh_redirects_oak/prayers:pr.res14.incipit	@ltx/swh_ke_oak/prayers:pr.res14.incipit
ltx/swh_redirects_oak/prayers:pr.res14.text	@ltx/swh_ke_oak/prayers:pr.res14.text
ltx/swh_redirects_oak/prayers:pr.res15.incipit	@ltx/swh_ke_oak/prayers:pr.res15.incipit
ltx/swh_redirects_oak/prayers:pr.res15.text	@ltx/swh_ke_oak/prayers:pr.res15.text
ltx/swh_redirects_oak/prayers:pr.res16.incipit	@ltx/swh_ke_oak/prayers:pr.res16.incipit
ltx/swh_redirects_oak/prayers:pr.res16.text	@ltx/swh_ke_oak/prayers:pr.res16.text
ltx/swh_redirects_oak/prayers:pr.sup00.incipit	@ltx/swh_ke_oak/prayers:pr.sup00.incipit
ltx/swh_redirects_oak/prayers:pr.sup00.text	@ltx/swh_ke_oak/prayers:pr.sup00.text
ltx/swh_redirects_oak/prayers:pr.sup00a.incipit	@ltx/swh_ke_oak/prayers:pr.sup00a.incipit
ltx/swh_redirects_oak/prayers:pr.sup00a.text	@ltx/swh_ke_oak/prayers:pr.sup00a.text
ltx/swh_redirects_oak/prayers:pr.sup01.text	@ltx/swh_ke_oak/prayers:pr.sup01.text
ltx/swh_redirects_oak/prayers:pr.sup02.text	@ltx/swh_ke_oak/prayers:pr.sup02.text
ltx/swh_redirects_oak/prayers:pr.sup03.text	@ltx/swh_ke_oak/prayers:pr.sup03.text
ltx/swh_redirects_oak/prayers:pr.sup04.text	@ltx/swh_ke_oak/prayers:pr.sup04.text
ltx/swh_redirects_oak/prayers:pr.sup05.text	@ltx/swh_ke_oak/prayers:pr.sup05.text
ltx/swh_redirects_oak/prayers:pr.sup06.text	@ltx/swh_ke_oak/prayers:pr.sup06.text
ltx/swh_redirects_oak/prayers:pr.sup06_basil.text	@ltx/swh_ke_oak/prayers:pr.sup06_basil.text
ltx/swh_redirects_oak/prayers:pr.sup06_gregory.text	@ltx/swh_ke_oak/prayers:pr.sup06_gregory.text
ltx/swh_redirects_oak/prayers:pr.sup06_john.text	@ltx/swh_ke_oak/prayers:pr.sup06_john.text
ltx/swh_redirects_oak/prayers:pr.sup06a.text	@ltx/swh_ke_oak/prayers:pr.sup06a.text
ltx/swh_redirects_oak/prayers:pr.sup06b.text	@ltx/swh_ke_oak/prayers:pr.sup06b.text
ltx/swh_redirects_oak/prayers:pr.sup07.text	@ltx/swh_ke_oak/prayers:pr.sup07.text
ltx/swh_redirects_oak/prayers:pr.sup07_athanasios.text	@ltx/swh_ke_oak/prayers:pr.sup07_athanasios.text
ltx/swh_redirects_oak/prayers:pr.sup07_athanasios_cyril.text	@ltx/swh_ke_oak/prayers:pr.sup07_athanasios_cyril.text
ltx/swh_redirects_oak/prayers:pr.sup07_cyril.text	@ltx/swh_ke_oak/prayers:pr.sup07_cyril.text
ltx/swh_redirects_oak/prayers:pr.sup07_john.text	@ltx/swh_ke_oak/prayers:pr.sup07_john.text
ltx/swh_redirects_oak/prayers:pr.sup08.text	@ltx/swh_ke_oak/prayers:pr.sup08.text
ltx/swh_redirects_oak/prayers:pr.sup08_nektarios.text	@ltx/swh_ke_oak/prayers:pr.sup08_nektarios.text
ltx/swh_redirects_oak/prayers:pr.sup08_nicholas.text	@ltx/swh_ke_oak/prayers:pr.sup08_nicholas.text
ltx/swh_redirects_oak/prayers:pr.sup08_spyridon.text	@ltx/swh_ke_oak/prayers:pr.sup08_spyridon.text
ltx/swh_redirects_oak/prayers:pr.sup09.text	@ltx/swh_ke_oak/prayers:pr.sup09.text
ltx/swh_redirects_oak/prayers:pr.sup09_demetrios.text	@ltx/swh_ke_oak/prayers:pr.sup09_demetrios.text
ltx/swh_redirects_oak/prayers:pr.sup09_general.text	@ltx/swh_ke_oak/prayers:pr.sup09_general.text
ltx/swh_redirects_oak/prayers:pr.sup09_george.text	@ltx/swh_ke_oak/prayers:pr.sup09_george.text
ltx/swh_redirects_oak/prayers:pr.sup09_minas.text	@ltx/swh_ke_oak/prayers:pr.sup09_minas.text
ltx/swh_redirects_oak/prayers:pr.sup09_tyro.text	@ltx/swh_ke_oak/prayers:pr.sup09_tyro.text
ltx/swh_redirects_oak/prayers:pr.sup10.text	@ltx/swh_ke_oak/prayers:pr.sup10.text
ltx/swh_redirects_oak/prayers:pr.sup10_eleutherios.text	@ltx/swh_ke_oak/prayers:pr.sup10_eleutherios.text
ltx/swh_redirects_oak/prayers:pr.sup10_haralambos.text	@ltx/swh_ke_oak/prayers:pr.sup10_haralambos.text
ltx/swh_redirects_oak/prayers:pr.sup11.text	@ltx/swh_ke_oak/prayers:pr.sup11.text
ltx/swh_redirects_oak/prayers:pr.sup11_anastasia.text	@ltx/swh_ke_oak/prayers:pr.sup11_anastasia.text
ltx/swh_redirects_oak/prayers:pr.sup11_barbara.text	@ltx/swh_ke_oak/prayers:pr.sup11_barbara.text
ltx/swh_redirects_oak/prayers:pr.sup11_catherine.text	@ltx/swh_ke_oak/prayers:pr.sup11_catherine.text
ltx/swh_redirects_oak/prayers:pr.sup11_eufimia.text	@ltx/swh_ke_oak/prayers:pr.sup11_eufimia.text
ltx/swh_redirects_oak/prayers:pr.sup11_irene.text	@ltx/swh_ke_oak/prayers:pr.sup11_irene.text
ltx/swh_redirects_oak/prayers:pr.sup11_kyriaki.text	@ltx/swh_ke_oak/prayers:pr.sup11_kyriaki.text
ltx/swh_redirects_oak/prayers:pr.sup11_marina.text	@ltx/swh_ke_oak/prayers:pr.sup11_marina.text
ltx/swh_redirects_oak/prayers:pr.sup11_paraskevi.text	@ltx/swh_ke_oak/prayers:pr.sup11_paraskevi.text
ltx/swh_redirects_oak/prayers:pr.sup11_photeini.text	@ltx/swh_ke_oak/prayers:pr.sup11_photeini.text
ltx/swh_redirects_oak/prayers:pr.sup11_thekla.text	@ltx/swh_ke_oak/prayers:pr.sup11_thekla.text
ltx/swh_redirects_oak/prayers:pr.sup12.text	@ltx/swh_ke_oak/prayers:pr.sup12.text
ltx/swh_redirects_oak/prayers:pr.sup13.text	@ltx/swh_ke_oak/prayers:pr.sup13.text
ltx/swh_redirects_oak/prayers:pr.sup14.text	@ltx/swh_ke_oak/prayers:pr.sup14.text
ltx/swh_redirects_oak/prayers:pr.sup15.text	@ltx/swh_ke_oak/prayers:pr.sup15.text
ltx/swh_redirects_oak/prayers:pr.sup16a.text	@ltx/swh_ke_oak/prayers:pr.sup16a.text
ltx/swh_redirects_oak/prayers:pr.sup16b.text	@ltx/swh_ke_oak/prayers:pr.sup16b.text
ltx/swh_redirects_oak/prayers:pr.sup99.incipit	@ltx/swh_ke_oak/prayers:pr.sup99.incipit
ltx/swh_redirects_oak/prayers:pr.sup99.text	@ltx/swh_ke_oak/prayers:pr.sup99.text
ltx/swh_redirects_oak/prayers:pr.triadic_end_Saints.incipit	@ltx/swh_ke_oak/prayers:pr.triadic_end_Saints.incipit
ltx/swh_redirects_oak/prayers:pr.triadic_end_Saints.text	@ltx/swh_ke_oak/prayers:pr.triadic_end_Saints.text
ltx/swh_redirects_oak/prayers:pr.triadic_end_Theotokos.incipit	@ltx/swh_ke_oak/prayers:pr.triadic_end_Theotokos.incipit
ltx/swh_redirects_oak/prayers:pr.triadic_end_Theotokos.text	@ltx/swh_ke_oak/prayers:pr.triadic_end_Theotokos.text
ltx/swh_redirects_oak/prayers:pr.verse_Angels.incipit	@ltx/swh_ke_oak/prayers:pr.verse_Angels.incipit
ltx/swh_redirects_oak/prayers:pr.verse_Angels.text	@ltx/swh_ke_oak/prayers:pr.verse_Angels.text
ltx/swh_redirects_oak/prayers:pr.verse_Apostle.incipit	@ltx/swh_ke_oak/prayers:pr.verse_Apostle.incipit
ltx/swh_redirects_oak/prayers:pr.verse_Apostle.text	@ltx/swh_ke_oak/prayers:pr.verse_Apostle.text
ltx/swh_redirects_oak/prayers:pr.verse_Apostles.incipit	@ltx/swh_ke_oak/prayers:pr.verse_Apostles.incipit
ltx/swh_redirects_oak/prayers:pr.verse_Apostles.text	@ltx/swh_ke_oak/prayers:pr.verse_Apostles.text
ltx/swh_redirects_oak/prayers:pr.verse_ApostlesMartyrs.incipit	@ltx/swh_ke_oak/prayers:pr.verse_ApostlesMartyrs.incipit
ltx/swh_redirects_oak/prayers:pr.verse_ApostlesMartyrs.text	@ltx/swh_ke_oak/prayers:pr.verse_ApostlesMartyrs.text
ltx/swh_redirects_oak/prayers:pr.verse_Archangel.incipit	@ltx/swh_ke_oak/prayers:pr.verse_Archangel.incipit
ltx/swh_redirects_oak/prayers:pr.verse_Archangel.text	@ltx/swh_ke_oak/prayers:pr.verse_Archangel.text
ltx/swh_redirects_oak/prayers:pr.verse_Archangels.incipit	@ltx/swh_ke_oak/prayers:pr.verse_Archangels.incipit
ltx/swh_redirects_oak/prayers:pr.verse_Archangels.text	@ltx/swh_ke_oak/prayers:pr.verse_Archangels.text
ltx/swh_redirects_oak/prayers:pr.verse_Baptist.incipit	@ltx/swh_ke_oak/prayers:pr.verse_Baptist.incipit
ltx/swh_redirects_oak/prayers:pr.verse_Baptist.text	@ltx/swh_ke_oak/prayers:pr.verse_Baptist.text
ltx/swh_redirects_oak/prayers:pr.verse_Cross.incipit	@ltx/swh_ke_oak/prayers:pr.verse_Cross.incipit
ltx/swh_redirects_oak/prayers:pr.verse_Cross.text	@ltx/swh_ke_oak/prayers:pr.verse_Cross.text
ltx/swh_redirects_oak/prayers:pr.verse_Crucifixion.incipit	@ltx/swh_ke_oak/prayers:pr.verse_Crucifixion.incipit
ltx/swh_redirects_oak/prayers:pr.verse_Crucifixion.text	@ltx/swh_ke_oak/prayers:pr.verse_Crucifixion.text
ltx/swh_redirects_oak/prayers:pr.verse_DevoutMan.incipit	@ltx/swh_ke_oak/prayers:pr.verse_DevoutMan.incipit
ltx/swh_redirects_oak/prayers:pr.verse_DevoutMan.text	@ltx/swh_ke_oak/prayers:pr.verse_DevoutMan.text
ltx/swh_redirects_oak/prayers:pr.verse_DevoutMen.incipit	@ltx/swh_ke_oak/prayers:pr.verse_DevoutMen.incipit
ltx/swh_redirects_oak/prayers:pr.verse_DevoutMen.text	@ltx/swh_ke_oak/prayers:pr.verse_DevoutMen.text
ltx/swh_redirects_oak/prayers:pr.verse_DevoutWoman.incipit	@ltx/swh_ke_oak/prayers:pr.verse_DevoutWoman.incipit
ltx/swh_redirects_oak/prayers:pr.verse_DevoutWoman.text	@ltx/swh_ke_oak/prayers:pr.verse_DevoutWoman.text
ltx/swh_redirects_oak/prayers:pr.verse_God.incipit	@ltx/swh_ke_oak/prayers:pr.verse_God.incipit
ltx/swh_redirects_oak/prayers:pr.verse_God.text	@ltx/swh_ke_oak/prayers:pr.verse_God.text
ltx/swh_redirects_oak/prayers:pr.verse_GreatMartyrs.incipit	@ltx/swh_ke_oak/prayers:pr.verse_GreatMartyrs.incipit
ltx/swh_redirects_oak/prayers:pr.verse_GreatMartyrs.text	@ltx/swh_ke_oak/prayers:pr.verse_GreatMartyrs.text
ltx/swh_redirects_oak/prayers:pr.verse_Hierarchs.incipit	@ltx/swh_ke_oak/prayers:pr.verse_Hierarchs.incipit
ltx/swh_redirects_oak/prayers:pr.verse_Hierarchs.text	@ltx/swh_ke_oak/prayers:pr.verse_Hierarchs.text
ltx/swh_redirects_oak/prayers:pr.verse_Mercy.incipit	@ltx/swh_ke_oak/prayers:pr.verse_Mercy.incipit
ltx/swh_redirects_oak/prayers:pr.verse_Mercy.text	@ltx/swh_ke_oak/prayers:pr.verse_Mercy.text
ltx/swh_redirects_oak/prayers:pr.verse_Nicholas.incipit	@ltx/swh_ke_oak/prayers:pr.verse_Nicholas.incipit
ltx/swh_redirects_oak/prayers:pr.verse_Nicholas.text	@ltx/swh_ke_oak/prayers:pr.verse_Nicholas.text
ltx/swh_redirects_oak/prayers:pr.verse_Panteleimon.incipit	@ltx/swh_ke_oak/prayers:pr.verse_Panteleimon.incipit
ltx/swh_redirects_oak/prayers:pr.verse_Panteleimon.text	@ltx/swh_ke_oak/prayers:pr.verse_Panteleimon.text
ltx/swh_redirects_oak/prayers:pr.verse_Prophet.incipit	@ltx/swh_ke_oak/prayers:pr.verse_Prophet.incipit
ltx/swh_redirects_oak/prayers:pr.verse_Prophet.text	@ltx/swh_ke_oak/prayers:pr.verse_Prophet.text
ltx/swh_redirects_oak/prayers:pr.verse_Resurrection.incipit	@ltx/swh_ke_oak/prayers:pr.verse_Resurrection.incipit
ltx/swh_redirects_oak/prayers:pr.verse_Resurrection.text	@ltx/swh_ke_oak/prayers:pr.verse_Resurrection.text
ltx/swh_redirects_oak/prayers:pr.verse_Righteous.incipit	@ltx/swh_ke_oak/prayers:pr.verse_Righteous.incipit
ltx/swh_redirects_oak/prayers:pr.verse_Righteous.text	@ltx/swh_ke_oak/prayers:pr.verse_Righteous.text
ltx/swh_redirects_oak/prayers:pr.verse_SaintM.incipit	@ltx/swh_ke_oak/prayers:pr.verse_SaintM.incipit
ltx/swh_redirects_oak/prayers:pr.verse_SaintM.text	@ltx/swh_ke_oak/prayers:pr.verse_SaintM.text
ltx/swh_redirects_oak/prayers:pr.verse_SaintW.incipit	@ltx/swh_ke_oak/prayers:pr.verse_SaintW.incipit
ltx/swh_redirects_oak/prayers:pr.verse_SaintW.text	@ltx/swh_ke_oak/prayers:pr.verse_SaintW.text
ltx/swh_redirects_oak/prayers:pr.verse_SaintsM.incipit	@ltx/swh_ke_oak/prayers:pr.verse_SaintsM.incipit
ltx/swh_redirects_oak/prayers:pr.verse_SaintsM.text	@ltx/swh_ke_oak/prayers:pr.verse_SaintsM.text
ltx/swh_redirects_oak/prayers:pr.verse_SaintsW.incipit	@ltx/swh_ke_oak/prayers:pr.verse_SaintsW.incipit
ltx/swh_redirects_oak/prayers:pr.verse_SaintsW.text	@ltx/swh_ke_oak/prayers:pr.verse_SaintsW.text
ltx/swh_redirects_oak/prayers:pr.verse_SoulSaturday.incipit	@ltx/swh_ke_oak/prayers:pr.verse_SoulSaturday.incipit
ltx/swh_redirects_oak/prayers:pr.verse_SoulSaturday.text	@ltx/swh_ke_oak/prayers:pr.verse_SoulSaturday.text
ltx/swh_redirects_oak/prayers:pr.verse_Theotokos.incipit	@ltx/swh_ke_oak/prayers:pr.verse_Theotokos.incipit
ltx/swh_redirects_oak/prayers:pr.verse_Theotokos.text	@ltx/swh_ke_oak/prayers:pr.verse_Theotokos.text
ltx/swh_redirects_oak/prayers:pr.verse_Trinity.incipit	@ltx/swh_ke_oak/prayers:pr.verse_Trinity.incipit
ltx/swh_redirects_oak/prayers:pr.verse_Trinity.text	@ltx/swh_ke_oak/prayers:pr.verse_Trinity.text
ltx/swh_redirects_oak/prayers:pr.verse_Unmercenaries.incipit	@ltx/swh_ke_oak/prayers:pr.verse_Unmercenaries.incipit
ltx/swh_redirects_oak/prayers:pr.verse_Unmercenaries.text	@ltx/swh_ke_oak/prayers:pr.verse_Unmercenaries.text
