ltx/swh_redirects_oak/sy.m12.dFF:syMA.commemoration01.couplet1.title	@ltx/swh_ke_oak/sy.m12.dFF:syMA.commemoration01.couplet1.title
ltx/swh_redirects_oak/sy.m12.dFF:syMA.commemoration01.couplet1.verse1	@ltx/swh_ke_oak/sy.m12.dFF:syMA.commemoration01.couplet1.verse1
ltx/swh_redirects_oak/sy.m12.dFF:syMA.commemoration01.couplet1.verse2	@ltx/swh_ke_oak/sy.m12.dFF:syMA.commemoration01.couplet1.verse2
ltx/swh_redirects_oak/sy.m12.dFF:syMA.commemoration01.narration.p01	@ltx/swh_ke_oak/sy.m12.dFF:syMA.commemoration01.narration.p01
ltx/swh_redirects_oak/sy.m12.dFF:syMA.commemoration01.narration.p02	@ltx/swh_ke_oak/sy.m12.dFF:syMA.commemoration01.narration.p02
ltx/swh_redirects_oak/sy.m12.dFF:syMA.commemoration01.narration.p03	@ltx/swh_ke_oak/sy.m12.dFF:syMA.commemoration01.narration.p03
ltx/swh_redirects_oak/sy.m12.dFF:syMA.commemoration01.single1	@ltx/swh_ke_oak/sy.m12.dFF:syMA.commemoration01.single1
ltx/swh_redirects_oak/sy.m12.dFF:syMA.commemoration01.text	@ltx/swh_ke_oak/sy.m12.dFF:syMA.commemoration01.text
ltx/swh_redirects_oak/sy.m12.dFF:syMA.lastline	@ltx/swh_ke_oak/sy.m12.dFF:syMA.lastline
ltx/swh_redirects_oak/sy.m12.dFF:syMA.note1	@ltx/swh_ke_oak/sy.m12.dFF:syMA.note1
