ltx/swh_redirects_oak/ocwd.exaposteilaria:ocwdMA.ExapFri1.greekmelody	@ltx/swh_ke_oak/ocwd.exaposteilaria:ocwdMA.ExapFri1.greekmelody
ltx/swh_redirects_oak/ocwd.exaposteilaria:ocwdMA.ExapFri1.incipit	@ltx/swh_ke_oak/ocwd.exaposteilaria:ocwdMA.ExapFri1.incipit
ltx/swh_redirects_oak/ocwd.exaposteilaria:ocwdMA.ExapFri1.melody	@ltx/swh_ke_oak/ocwd.exaposteilaria:ocwdMA.ExapFri1.melody
ltx/swh_redirects_oak/ocwd.exaposteilaria:ocwdMA.ExapFri1.mode	@ltx/swh_ke_oak/ocwd.exaposteilaria:ocwdMA.ExapFri1.mode
ltx/swh_redirects_oak/ocwd.exaposteilaria:ocwdMA.ExapFri1.text	@ltx/swh_ke_oak/ocwd.exaposteilaria:ocwdMA.ExapFri1.text
ltx/swh_redirects_oak/ocwd.exaposteilaria:ocwdMA.ExapFriTh.greekmelody	@ltx/swh_ke_oak/ocwd.exaposteilaria:ocwdMA.ExapFriTh.greekmelody
ltx/swh_redirects_oak/ocwd.exaposteilaria:ocwdMA.ExapFriTh.incipit	@ltx/swh_ke_oak/ocwd.exaposteilaria:ocwdMA.ExapFriTh.incipit
ltx/swh_redirects_oak/ocwd.exaposteilaria:ocwdMA.ExapFriTh.melody	@ltx/swh_ke_oak/ocwd.exaposteilaria:ocwdMA.ExapFriTh.melody
ltx/swh_redirects_oak/ocwd.exaposteilaria:ocwdMA.ExapFriTh.mode	@ltx/swh_ke_oak/ocwd.exaposteilaria:ocwdMA.ExapFriTh.mode
ltx/swh_redirects_oak/ocwd.exaposteilaria:ocwdMA.ExapFriTh.text	@ltx/swh_ke_oak/ocwd.exaposteilaria:ocwdMA.ExapFriTh.text
ltx/swh_redirects_oak/ocwd.exaposteilaria:ocwdMA.ExapFriTitle	@ltx/swh_ke_oak/ocwd.exaposteilaria:ocwdMA.ExapFriTitle
ltx/swh_redirects_oak/ocwd.exaposteilaria:ocwdMA.ExapMon1.greekmelody	@ltx/swh_ke_oak/ocwd.exaposteilaria:ocwdMA.ExapMon1.greekmelody
ltx/swh_redirects_oak/ocwd.exaposteilaria:ocwdMA.ExapMon1.incipit	@ltx/swh_ke_oak/ocwd.exaposteilaria:ocwdMA.ExapMon1.incipit
ltx/swh_redirects_oak/ocwd.exaposteilaria:ocwdMA.ExapMon1.melody	@ltx/swh_ke_oak/ocwd.exaposteilaria:ocwdMA.ExapMon1.melody
ltx/swh_redirects_oak/ocwd.exaposteilaria:ocwdMA.ExapMon1.mode	@ltx/swh_ke_oak/ocwd.exaposteilaria:ocwdMA.ExapMon1.mode
ltx/swh_redirects_oak/ocwd.exaposteilaria:ocwdMA.ExapMon1.text	@ltx/swh_ke_oak/ocwd.exaposteilaria:ocwdMA.ExapMon1.text
ltx/swh_redirects_oak/ocwd.exaposteilaria:ocwdMA.ExapMonTh.greekmelody	@ltx/swh_ke_oak/ocwd.exaposteilaria:ocwdMA.ExapMonTh.greekmelody
ltx/swh_redirects_oak/ocwd.exaposteilaria:ocwdMA.ExapMonTh.incipit	@ltx/swh_ke_oak/ocwd.exaposteilaria:ocwdMA.ExapMonTh.incipit
ltx/swh_redirects_oak/ocwd.exaposteilaria:ocwdMA.ExapMonTh.melody	@ltx/swh_ke_oak/ocwd.exaposteilaria:ocwdMA.ExapMonTh.melody
ltx/swh_redirects_oak/ocwd.exaposteilaria:ocwdMA.ExapMonTh.mode	@ltx/swh_ke_oak/ocwd.exaposteilaria:ocwdMA.ExapMonTh.mode
ltx/swh_redirects_oak/ocwd.exaposteilaria:ocwdMA.ExapMonTh.text	@ltx/swh_ke_oak/ocwd.exaposteilaria:ocwdMA.ExapMonTh.text
ltx/swh_redirects_oak/ocwd.exaposteilaria:ocwdMA.ExapMonTitle	@ltx/swh_ke_oak/ocwd.exaposteilaria:ocwdMA.ExapMonTitle
ltx/swh_redirects_oak/ocwd.exaposteilaria:ocwdMA.ExapSat1.greekmelody	@ltx/swh_ke_oak/ocwd.exaposteilaria:ocwdMA.ExapSat1.greekmelody
ltx/swh_redirects_oak/ocwd.exaposteilaria:ocwdMA.ExapSat1.incipit	@ltx/swh_ke_oak/ocwd.exaposteilaria:ocwdMA.ExapSat1.incipit
ltx/swh_redirects_oak/ocwd.exaposteilaria:ocwdMA.ExapSat1.melody	@ltx/swh_ke_oak/ocwd.exaposteilaria:ocwdMA.ExapSat1.melody
ltx/swh_redirects_oak/ocwd.exaposteilaria:ocwdMA.ExapSat1.mode	@ltx/swh_ke_oak/ocwd.exaposteilaria:ocwdMA.ExapSat1.mode
ltx/swh_redirects_oak/ocwd.exaposteilaria:ocwdMA.ExapSat1.text	@ltx/swh_ke_oak/ocwd.exaposteilaria:ocwdMA.ExapSat1.text
ltx/swh_redirects_oak/ocwd.exaposteilaria:ocwdMA.ExapSat2.greekmelody	@ltx/swh_ke_oak/ocwd.exaposteilaria:ocwdMA.ExapSat2.greekmelody
ltx/swh_redirects_oak/ocwd.exaposteilaria:ocwdMA.ExapSat2.incipit	@ltx/swh_ke_oak/ocwd.exaposteilaria:ocwdMA.ExapSat2.incipit
ltx/swh_redirects_oak/ocwd.exaposteilaria:ocwdMA.ExapSat2.melody	@ltx/swh_ke_oak/ocwd.exaposteilaria:ocwdMA.ExapSat2.melody
ltx/swh_redirects_oak/ocwd.exaposteilaria:ocwdMA.ExapSat2.mode	@ltx/swh_ke_oak/ocwd.exaposteilaria:ocwdMA.ExapSat2.mode
ltx/swh_redirects_oak/ocwd.exaposteilaria:ocwdMA.ExapSat2.text	@ltx/swh_ke_oak/ocwd.exaposteilaria:ocwdMA.ExapSat2.text
ltx/swh_redirects_oak/ocwd.exaposteilaria:ocwdMA.ExapSatTh.greekmelody	@ltx/swh_ke_oak/ocwd.exaposteilaria:ocwdMA.ExapSatTh.greekmelody
ltx/swh_redirects_oak/ocwd.exaposteilaria:ocwdMA.ExapSatTh.incipit	@ltx/swh_ke_oak/ocwd.exaposteilaria:ocwdMA.ExapSatTh.incipit
ltx/swh_redirects_oak/ocwd.exaposteilaria:ocwdMA.ExapSatTh.melody	@ltx/swh_ke_oak/ocwd.exaposteilaria:ocwdMA.ExapSatTh.melody
ltx/swh_redirects_oak/ocwd.exaposteilaria:ocwdMA.ExapSatTh.mode	@ltx/swh_ke_oak/ocwd.exaposteilaria:ocwdMA.ExapSatTh.mode
ltx/swh_redirects_oak/ocwd.exaposteilaria:ocwdMA.ExapSatTh.text	@ltx/swh_ke_oak/ocwd.exaposteilaria:ocwdMA.ExapSatTh.text
ltx/swh_redirects_oak/ocwd.exaposteilaria:ocwdMA.ExapSatTitle	@ltx/swh_ke_oak/ocwd.exaposteilaria:ocwdMA.ExapSatTitle
ltx/swh_redirects_oak/ocwd.exaposteilaria:ocwdMA.ExapThu1.greekmelody	@ltx/swh_ke_oak/ocwd.exaposteilaria:ocwdMA.ExapThu1.greekmelody
ltx/swh_redirects_oak/ocwd.exaposteilaria:ocwdMA.ExapThu1.incipit	@ltx/swh_ke_oak/ocwd.exaposteilaria:ocwdMA.ExapThu1.incipit
ltx/swh_redirects_oak/ocwd.exaposteilaria:ocwdMA.ExapThu1.melody	@ltx/swh_ke_oak/ocwd.exaposteilaria:ocwdMA.ExapThu1.melody
ltx/swh_redirects_oak/ocwd.exaposteilaria:ocwdMA.ExapThu1.mode	@ltx/swh_ke_oak/ocwd.exaposteilaria:ocwdMA.ExapThu1.mode
ltx/swh_redirects_oak/ocwd.exaposteilaria:ocwdMA.ExapThu1.text	@ltx/swh_ke_oak/ocwd.exaposteilaria:ocwdMA.ExapThu1.text
ltx/swh_redirects_oak/ocwd.exaposteilaria:ocwdMA.ExapThuTh.greekmelody	@ltx/swh_ke_oak/ocwd.exaposteilaria:ocwdMA.ExapThuTh.greekmelody
ltx/swh_redirects_oak/ocwd.exaposteilaria:ocwdMA.ExapThuTh.incipit	@ltx/swh_ke_oak/ocwd.exaposteilaria:ocwdMA.ExapThuTh.incipit
ltx/swh_redirects_oak/ocwd.exaposteilaria:ocwdMA.ExapThuTh.melody	@ltx/swh_ke_oak/ocwd.exaposteilaria:ocwdMA.ExapThuTh.melody
ltx/swh_redirects_oak/ocwd.exaposteilaria:ocwdMA.ExapThuTh.mode	@ltx/swh_ke_oak/ocwd.exaposteilaria:ocwdMA.ExapThuTh.mode
ltx/swh_redirects_oak/ocwd.exaposteilaria:ocwdMA.ExapThuTh.text	@ltx/swh_ke_oak/ocwd.exaposteilaria:ocwdMA.ExapThuTh.text
ltx/swh_redirects_oak/ocwd.exaposteilaria:ocwdMA.ExapThuTitle	@ltx/swh_ke_oak/ocwd.exaposteilaria:ocwdMA.ExapThuTitle
ltx/swh_redirects_oak/ocwd.exaposteilaria:ocwdMA.ExapTue1.greekmelody	@ltx/swh_ke_oak/ocwd.exaposteilaria:ocwdMA.ExapTue1.greekmelody
ltx/swh_redirects_oak/ocwd.exaposteilaria:ocwdMA.ExapTue1.incipit	@ltx/swh_ke_oak/ocwd.exaposteilaria:ocwdMA.ExapTue1.incipit
ltx/swh_redirects_oak/ocwd.exaposteilaria:ocwdMA.ExapTue1.melody	@ltx/swh_ke_oak/ocwd.exaposteilaria:ocwdMA.ExapTue1.melody
ltx/swh_redirects_oak/ocwd.exaposteilaria:ocwdMA.ExapTue1.mode	@ltx/swh_ke_oak/ocwd.exaposteilaria:ocwdMA.ExapTue1.mode
ltx/swh_redirects_oak/ocwd.exaposteilaria:ocwdMA.ExapTue1.text	@ltx/swh_ke_oak/ocwd.exaposteilaria:ocwdMA.ExapTue1.text
ltx/swh_redirects_oak/ocwd.exaposteilaria:ocwdMA.ExapTueTh.greekmelody	@ltx/swh_ke_oak/ocwd.exaposteilaria:ocwdMA.ExapTueTh.greekmelody
ltx/swh_redirects_oak/ocwd.exaposteilaria:ocwdMA.ExapTueTh.incipit	@ltx/swh_ke_oak/ocwd.exaposteilaria:ocwdMA.ExapTueTh.incipit
ltx/swh_redirects_oak/ocwd.exaposteilaria:ocwdMA.ExapTueTh.melody	@ltx/swh_ke_oak/ocwd.exaposteilaria:ocwdMA.ExapTueTh.melody
ltx/swh_redirects_oak/ocwd.exaposteilaria:ocwdMA.ExapTueTh.mode	@ltx/swh_ke_oak/ocwd.exaposteilaria:ocwdMA.ExapTueTh.mode
ltx/swh_redirects_oak/ocwd.exaposteilaria:ocwdMA.ExapTueTh.text	@ltx/swh_ke_oak/ocwd.exaposteilaria:ocwdMA.ExapTueTh.text
ltx/swh_redirects_oak/ocwd.exaposteilaria:ocwdMA.ExapTueTitle	@ltx/swh_ke_oak/ocwd.exaposteilaria:ocwdMA.ExapTueTitle
ltx/swh_redirects_oak/ocwd.exaposteilaria:ocwdMA.ExapWed1.greekmelody	@ltx/swh_ke_oak/ocwd.exaposteilaria:ocwdMA.ExapWed1.greekmelody
ltx/swh_redirects_oak/ocwd.exaposteilaria:ocwdMA.ExapWed1.incipit	@ltx/swh_ke_oak/ocwd.exaposteilaria:ocwdMA.ExapWed1.incipit
ltx/swh_redirects_oak/ocwd.exaposteilaria:ocwdMA.ExapWed1.melody	@ltx/swh_ke_oak/ocwd.exaposteilaria:ocwdMA.ExapWed1.melody
ltx/swh_redirects_oak/ocwd.exaposteilaria:ocwdMA.ExapWed1.mode	@ltx/swh_ke_oak/ocwd.exaposteilaria:ocwdMA.ExapWed1.mode
ltx/swh_redirects_oak/ocwd.exaposteilaria:ocwdMA.ExapWed1.text	@ltx/swh_ke_oak/ocwd.exaposteilaria:ocwdMA.ExapWed1.text
ltx/swh_redirects_oak/ocwd.exaposteilaria:ocwdMA.ExapWedTh.greekmelody	@ltx/swh_ke_oak/ocwd.exaposteilaria:ocwdMA.ExapWedTh.greekmelody
ltx/swh_redirects_oak/ocwd.exaposteilaria:ocwdMA.ExapWedTh.incipit	@ltx/swh_ke_oak/ocwd.exaposteilaria:ocwdMA.ExapWedTh.incipit
ltx/swh_redirects_oak/ocwd.exaposteilaria:ocwdMA.ExapWedTh.melody	@ltx/swh_ke_oak/ocwd.exaposteilaria:ocwdMA.ExapWedTh.melody
ltx/swh_redirects_oak/ocwd.exaposteilaria:ocwdMA.ExapWedTh.mode	@ltx/swh_ke_oak/ocwd.exaposteilaria:ocwdMA.ExapWedTh.mode
ltx/swh_redirects_oak/ocwd.exaposteilaria:ocwdMA.ExapWedTh.text	@ltx/swh_ke_oak/ocwd.exaposteilaria:ocwdMA.ExapWedTh.text
ltx/swh_redirects_oak/ocwd.exaposteilaria:ocwdMA.ExapWedTitle	@ltx/swh_ke_oak/ocwd.exaposteilaria:ocwdMA.ExapWedTitle
ltx/swh_redirects_oak/ocwd.exaposteilaria:ocwdMA.Exaposteilaria.title	@ltx/swh_ke_oak/ocwd.exaposteilaria:ocwdMA.Exaposteilaria.title
ltx/swh_redirects_oak/ocwd.exaposteilaria:ocwdMA.Exaposteilaria.title2	@ltx/swh_ke_oak/ocwd.exaposteilaria:ocwdMA.Exaposteilaria.title2
