ltx/swh_redirects_oak/he.k:ka.MM.Annunciation.title	@ltx/swh_ke_oak/he.k:ka.MM.Annunciation.title
ltx/swh_redirects_oak/he.k:ka.MM.AnnunciationOde1.text	@ltx/swh_ke_oak/he.k:ka.MM.AnnunciationOde1.text
ltx/swh_redirects_oak/he.k:ka.MM.AnnunciationOde1345678.text	@ltx/swh_ke_oak/he.k:ka.MM.AnnunciationOde1345678.text
ltx/swh_redirects_oak/he.k:ka.MM.AnnunciationOde3.text	@ltx/swh_ke_oak/he.k:ka.MM.AnnunciationOde3.text
ltx/swh_redirects_oak/he.k:ka.MM.AnnunciationOde4.text	@ltx/swh_ke_oak/he.k:ka.MM.AnnunciationOde4.text
ltx/swh_redirects_oak/he.k:ka.MM.AnnunciationOde5.text	@ltx/swh_ke_oak/he.k:ka.MM.AnnunciationOde5.text
ltx/swh_redirects_oak/he.k:ka.MM.AnnunciationOde6.text	@ltx/swh_ke_oak/he.k:ka.MM.AnnunciationOde6.text
ltx/swh_redirects_oak/he.k:ka.MM.AnnunciationOde7.text	@ltx/swh_ke_oak/he.k:ka.MM.AnnunciationOde7.text
ltx/swh_redirects_oak/he.k:ka.MM.AnnunciationOde8.text	@ltx/swh_ke_oak/he.k:ka.MM.AnnunciationOde8.text
ltx/swh_redirects_oak/he.k:ka.MM.AnnunciationOde9.text	@ltx/swh_ke_oak/he.k:ka.MM.AnnunciationOde9.text
ltx/swh_redirects_oak/he.k:ka.MM.Blindman.title	@ltx/swh_ke_oak/he.k:ka.MM.Blindman.title
ltx/swh_redirects_oak/he.k:ka.MM.BlindmanOde1.text	@ltx/swh_ke_oak/he.k:ka.MM.BlindmanOde1.text
ltx/swh_redirects_oak/he.k:ka.MM.BlindmanOde1345678.text	@ltx/swh_ke_oak/he.k:ka.MM.BlindmanOde1345678.text
ltx/swh_redirects_oak/he.k:ka.MM.BlindmanOde3.text	@ltx/swh_ke_oak/he.k:ka.MM.BlindmanOde3.text
ltx/swh_redirects_oak/he.k:ka.MM.BlindmanOde4.text	@ltx/swh_ke_oak/he.k:ka.MM.BlindmanOde4.text
ltx/swh_redirects_oak/he.k:ka.MM.BlindmanOde5.text	@ltx/swh_ke_oak/he.k:ka.MM.BlindmanOde5.text
ltx/swh_redirects_oak/he.k:ka.MM.BlindmanOde6.text	@ltx/swh_ke_oak/he.k:ka.MM.BlindmanOde6.text
ltx/swh_redirects_oak/he.k:ka.MM.BlindmanOde7.text	@ltx/swh_ke_oak/he.k:ka.MM.BlindmanOde7.text
ltx/swh_redirects_oak/he.k:ka.MM.BlindmanOde8.text	@ltx/swh_ke_oak/he.k:ka.MM.BlindmanOde8.text
ltx/swh_redirects_oak/he.k:ka.MM.BlindmanOde9.text	@ltx/swh_ke_oak/he.k:ka.MM.BlindmanOde9.text
ltx/swh_redirects_oak/he.k:ka.MM.Christmas1.title	@ltx/swh_ke_oak/he.k:ka.MM.Christmas1.title
ltx/swh_redirects_oak/he.k:ka.MM.Christmas12.title	@ltx/swh_ke_oak/he.k:ka.MM.Christmas12.title
ltx/swh_redirects_oak/he.k:ka.MM.Christmas12Ode1.text	@ltx/swh_ke_oak/he.k:ka.MM.Christmas12Ode1.text
ltx/swh_redirects_oak/he.k:ka.MM.Christmas12Ode1345678.text	@ltx/swh_ke_oak/he.k:ka.MM.Christmas12Ode1345678.text
ltx/swh_redirects_oak/he.k:ka.MM.Christmas12Ode3.text	@ltx/swh_ke_oak/he.k:ka.MM.Christmas12Ode3.text
ltx/swh_redirects_oak/he.k:ka.MM.Christmas12Ode4.text	@ltx/swh_ke_oak/he.k:ka.MM.Christmas12Ode4.text
ltx/swh_redirects_oak/he.k:ka.MM.Christmas12Ode5.text	@ltx/swh_ke_oak/he.k:ka.MM.Christmas12Ode5.text
ltx/swh_redirects_oak/he.k:ka.MM.Christmas12Ode6.text	@ltx/swh_ke_oak/he.k:ka.MM.Christmas12Ode6.text
ltx/swh_redirects_oak/he.k:ka.MM.Christmas12Ode7.text	@ltx/swh_ke_oak/he.k:ka.MM.Christmas12Ode7.text
ltx/swh_redirects_oak/he.k:ka.MM.Christmas12Ode8.text	@ltx/swh_ke_oak/he.k:ka.MM.Christmas12Ode8.text
ltx/swh_redirects_oak/he.k:ka.MM.Christmas12Ode9.text	@ltx/swh_ke_oak/he.k:ka.MM.Christmas12Ode9.text
ltx/swh_redirects_oak/he.k:ka.MM.Christmas1Ode1.text	@ltx/swh_ke_oak/he.k:ka.MM.Christmas1Ode1.text
ltx/swh_redirects_oak/he.k:ka.MM.Christmas1Ode1345678.text	@ltx/swh_ke_oak/he.k:ka.MM.Christmas1Ode1345678.text
ltx/swh_redirects_oak/he.k:ka.MM.Christmas1Ode3.text	@ltx/swh_ke_oak/he.k:ka.MM.Christmas1Ode3.text
ltx/swh_redirects_oak/he.k:ka.MM.Christmas1Ode4.text	@ltx/swh_ke_oak/he.k:ka.MM.Christmas1Ode4.text
ltx/swh_redirects_oak/he.k:ka.MM.Christmas1Ode5.text	@ltx/swh_ke_oak/he.k:ka.MM.Christmas1Ode5.text
ltx/swh_redirects_oak/he.k:ka.MM.Christmas1Ode6.text	@ltx/swh_ke_oak/he.k:ka.MM.Christmas1Ode6.text
ltx/swh_redirects_oak/he.k:ka.MM.Christmas1Ode7.text	@ltx/swh_ke_oak/he.k:ka.MM.Christmas1Ode7.text
ltx/swh_redirects_oak/he.k:ka.MM.Christmas1Ode8.text	@ltx/swh_ke_oak/he.k:ka.MM.Christmas1Ode8.text
ltx/swh_redirects_oak/he.k:ka.MM.Christmas1Ode9.text	@ltx/swh_ke_oak/he.k:ka.MM.Christmas1Ode9.text
ltx/swh_redirects_oak/he.k:ka.MM.Christmas2.title	@ltx/swh_ke_oak/he.k:ka.MM.Christmas2.title
ltx/swh_redirects_oak/he.k:ka.MM.Christmas2Ode1.text	@ltx/swh_ke_oak/he.k:ka.MM.Christmas2Ode1.text
ltx/swh_redirects_oak/he.k:ka.MM.Christmas2Ode1345678.text	@ltx/swh_ke_oak/he.k:ka.MM.Christmas2Ode1345678.text
ltx/swh_redirects_oak/he.k:ka.MM.Christmas2Ode3.text	@ltx/swh_ke_oak/he.k:ka.MM.Christmas2Ode3.text
ltx/swh_redirects_oak/he.k:ka.MM.Christmas2Ode4.text	@ltx/swh_ke_oak/he.k:ka.MM.Christmas2Ode4.text
ltx/swh_redirects_oak/he.k:ka.MM.Christmas2Ode5.text	@ltx/swh_ke_oak/he.k:ka.MM.Christmas2Ode5.text
ltx/swh_redirects_oak/he.k:ka.MM.Christmas2Ode6.text	@ltx/swh_ke_oak/he.k:ka.MM.Christmas2Ode6.text
ltx/swh_redirects_oak/he.k:ka.MM.Christmas2Ode7.text	@ltx/swh_ke_oak/he.k:ka.MM.Christmas2Ode7.text
ltx/swh_redirects_oak/he.k:ka.MM.Christmas2Ode8.text	@ltx/swh_ke_oak/he.k:ka.MM.Christmas2Ode8.text
ltx/swh_redirects_oak/he.k:ka.MM.Christmas2Ode9.text	@ltx/swh_ke_oak/he.k:ka.MM.Christmas2Ode9.text
ltx/swh_redirects_oak/he.k:ka.MM.Cross.title	@ltx/swh_ke_oak/he.k:ka.MM.Cross.title
ltx/swh_redirects_oak/he.k:ka.MM.CrossOde1.text	@ltx/swh_ke_oak/he.k:ka.MM.CrossOde1.text
ltx/swh_redirects_oak/he.k:ka.MM.CrossOde1345678.text	@ltx/swh_ke_oak/he.k:ka.MM.CrossOde1345678.text
ltx/swh_redirects_oak/he.k:ka.MM.CrossOde3.text	@ltx/swh_ke_oak/he.k:ka.MM.CrossOde3.text
ltx/swh_redirects_oak/he.k:ka.MM.CrossOde4.text	@ltx/swh_ke_oak/he.k:ka.MM.CrossOde4.text
ltx/swh_redirects_oak/he.k:ka.MM.CrossOde5.text	@ltx/swh_ke_oak/he.k:ka.MM.CrossOde5.text
ltx/swh_redirects_oak/he.k:ka.MM.CrossOde6.text	@ltx/swh_ke_oak/he.k:ka.MM.CrossOde6.text
ltx/swh_redirects_oak/he.k:ka.MM.CrossOde7.text	@ltx/swh_ke_oak/he.k:ka.MM.CrossOde7.text
ltx/swh_redirects_oak/he.k:ka.MM.CrossOde8.text	@ltx/swh_ke_oak/he.k:ka.MM.CrossOde8.text
ltx/swh_redirects_oak/he.k:ka.MM.CrossOde91.text	@ltx/swh_ke_oak/he.k:ka.MM.CrossOde91.text
ltx/swh_redirects_oak/he.k:ka.MM.CrossOde92.text	@ltx/swh_ke_oak/he.k:ka.MM.CrossOde92.text
ltx/swh_redirects_oak/he.k:ka.MM.Dormition.title	@ltx/swh_ke_oak/he.k:ka.MM.Dormition.title
ltx/swh_redirects_oak/he.k:ka.MM.DormitionOde1.text	@ltx/swh_ke_oak/he.k:ka.MM.DormitionOde1.text
ltx/swh_redirects_oak/he.k:ka.MM.DormitionOde1345678.text	@ltx/swh_ke_oak/he.k:ka.MM.DormitionOde1345678.text
ltx/swh_redirects_oak/he.k:ka.MM.DormitionOde3.text	@ltx/swh_ke_oak/he.k:ka.MM.DormitionOde3.text
ltx/swh_redirects_oak/he.k:ka.MM.DormitionOde4.text	@ltx/swh_ke_oak/he.k:ka.MM.DormitionOde4.text
ltx/swh_redirects_oak/he.k:ka.MM.DormitionOde5.text	@ltx/swh_ke_oak/he.k:ka.MM.DormitionOde5.text
ltx/swh_redirects_oak/he.k:ka.MM.DormitionOde6.text	@ltx/swh_ke_oak/he.k:ka.MM.DormitionOde6.text
ltx/swh_redirects_oak/he.k:ka.MM.DormitionOde7.text	@ltx/swh_ke_oak/he.k:ka.MM.DormitionOde7.text
ltx/swh_redirects_oak/he.k:ka.MM.DormitionOde8.text	@ltx/swh_ke_oak/he.k:ka.MM.DormitionOde8.text
ltx/swh_redirects_oak/he.k:ka.MM.DormitionOde9.text	@ltx/swh_ke_oak/he.k:ka.MM.DormitionOde9.text
ltx/swh_redirects_oak/he.k:ka.MM.Epiphany1.title	@ltx/swh_ke_oak/he.k:ka.MM.Epiphany1.title
ltx/swh_redirects_oak/he.k:ka.MM.Epiphany12.title	@ltx/swh_ke_oak/he.k:ka.MM.Epiphany12.title
ltx/swh_redirects_oak/he.k:ka.MM.Epiphany12Ode1.text	@ltx/swh_ke_oak/he.k:ka.MM.Epiphany12Ode1.text
ltx/swh_redirects_oak/he.k:ka.MM.Epiphany12Ode1345678.text	@ltx/swh_ke_oak/he.k:ka.MM.Epiphany12Ode1345678.text
ltx/swh_redirects_oak/he.k:ka.MM.Epiphany12Ode3.text	@ltx/swh_ke_oak/he.k:ka.MM.Epiphany12Ode3.text
ltx/swh_redirects_oak/he.k:ka.MM.Epiphany12Ode4.text	@ltx/swh_ke_oak/he.k:ka.MM.Epiphany12Ode4.text
ltx/swh_redirects_oak/he.k:ka.MM.Epiphany12Ode5.text	@ltx/swh_ke_oak/he.k:ka.MM.Epiphany12Ode5.text
ltx/swh_redirects_oak/he.k:ka.MM.Epiphany12Ode6.text	@ltx/swh_ke_oak/he.k:ka.MM.Epiphany12Ode6.text
ltx/swh_redirects_oak/he.k:ka.MM.Epiphany12Ode7.text	@ltx/swh_ke_oak/he.k:ka.MM.Epiphany12Ode7.text
ltx/swh_redirects_oak/he.k:ka.MM.Epiphany12Ode8.text	@ltx/swh_ke_oak/he.k:ka.MM.Epiphany12Ode8.text
ltx/swh_redirects_oak/he.k:ka.MM.Epiphany12Ode9.text	@ltx/swh_ke_oak/he.k:ka.MM.Epiphany12Ode9.text
ltx/swh_redirects_oak/he.k:ka.MM.Epiphany1Ode1.text	@ltx/swh_ke_oak/he.k:ka.MM.Epiphany1Ode1.text
ltx/swh_redirects_oak/he.k:ka.MM.Epiphany1Ode1345678.text	@ltx/swh_ke_oak/he.k:ka.MM.Epiphany1Ode1345678.text
ltx/swh_redirects_oak/he.k:ka.MM.Epiphany1Ode3.text	@ltx/swh_ke_oak/he.k:ka.MM.Epiphany1Ode3.text
ltx/swh_redirects_oak/he.k:ka.MM.Epiphany1Ode4.text	@ltx/swh_ke_oak/he.k:ka.MM.Epiphany1Ode4.text
ltx/swh_redirects_oak/he.k:ka.MM.Epiphany1Ode5.text	@ltx/swh_ke_oak/he.k:ka.MM.Epiphany1Ode5.text
ltx/swh_redirects_oak/he.k:ka.MM.Epiphany1Ode6.text	@ltx/swh_ke_oak/he.k:ka.MM.Epiphany1Ode6.text
ltx/swh_redirects_oak/he.k:ka.MM.Epiphany1Ode7.text	@ltx/swh_ke_oak/he.k:ka.MM.Epiphany1Ode7.text
ltx/swh_redirects_oak/he.k:ka.MM.Epiphany1Ode8.text	@ltx/swh_ke_oak/he.k:ka.MM.Epiphany1Ode8.text
ltx/swh_redirects_oak/he.k:ka.MM.Epiphany1Ode9.text	@ltx/swh_ke_oak/he.k:ka.MM.Epiphany1Ode9.text
ltx/swh_redirects_oak/he.k:ka.MM.Epiphany2.title	@ltx/swh_ke_oak/he.k:ka.MM.Epiphany2.title
ltx/swh_redirects_oak/he.k:ka.MM.Epiphany2Ode1.text	@ltx/swh_ke_oak/he.k:ka.MM.Epiphany2Ode1.text
ltx/swh_redirects_oak/he.k:ka.MM.Epiphany2Ode1345678.text	@ltx/swh_ke_oak/he.k:ka.MM.Epiphany2Ode1345678.text
ltx/swh_redirects_oak/he.k:ka.MM.Epiphany2Ode3.text	@ltx/swh_ke_oak/he.k:ka.MM.Epiphany2Ode3.text
ltx/swh_redirects_oak/he.k:ka.MM.Epiphany2Ode4.text	@ltx/swh_ke_oak/he.k:ka.MM.Epiphany2Ode4.text
ltx/swh_redirects_oak/he.k:ka.MM.Epiphany2Ode5.text	@ltx/swh_ke_oak/he.k:ka.MM.Epiphany2Ode5.text
ltx/swh_redirects_oak/he.k:ka.MM.Epiphany2Ode6.text	@ltx/swh_ke_oak/he.k:ka.MM.Epiphany2Ode6.text
ltx/swh_redirects_oak/he.k:ka.MM.Epiphany2Ode7.text	@ltx/swh_ke_oak/he.k:ka.MM.Epiphany2Ode7.text
ltx/swh_redirects_oak/he.k:ka.MM.Epiphany2Ode8.text	@ltx/swh_ke_oak/he.k:ka.MM.Epiphany2Ode8.text
ltx/swh_redirects_oak/he.k:ka.MM.Epiphany2Ode9.text	@ltx/swh_ke_oak/he.k:ka.MM.Epiphany2Ode9.text
ltx/swh_redirects_oak/he.k:ka.MM.Lazarus.title	@ltx/swh_ke_oak/he.k:ka.MM.Lazarus.title
ltx/swh_redirects_oak/he.k:ka.MM.LazarusOde1.text	@ltx/swh_ke_oak/he.k:ka.MM.LazarusOde1.text
ltx/swh_redirects_oak/he.k:ka.MM.LazarusOde1345678.text	@ltx/swh_ke_oak/he.k:ka.MM.LazarusOde1345678.text
ltx/swh_redirects_oak/he.k:ka.MM.LazarusOde3.text	@ltx/swh_ke_oak/he.k:ka.MM.LazarusOde3.text
ltx/swh_redirects_oak/he.k:ka.MM.LazarusOde4.text	@ltx/swh_ke_oak/he.k:ka.MM.LazarusOde4.text
ltx/swh_redirects_oak/he.k:ka.MM.LazarusOde5.text	@ltx/swh_ke_oak/he.k:ka.MM.LazarusOde5.text
ltx/swh_redirects_oak/he.k:ka.MM.LazarusOde6.text	@ltx/swh_ke_oak/he.k:ka.MM.LazarusOde6.text
ltx/swh_redirects_oak/he.k:ka.MM.LazarusOde7.text	@ltx/swh_ke_oak/he.k:ka.MM.LazarusOde7.text
ltx/swh_redirects_oak/he.k:ka.MM.LazarusOde8.text	@ltx/swh_ke_oak/he.k:ka.MM.LazarusOde8.text
ltx/swh_redirects_oak/he.k:ka.MM.LazarusOde9.text	@ltx/swh_ke_oak/he.k:ka.MM.LazarusOde9.text
ltx/swh_redirects_oak/he.k:ka.MM.Lent1.title	@ltx/swh_ke_oak/he.k:ka.MM.Lent1.title
ltx/swh_redirects_oak/he.k:ka.MM.Lent1Ode1.text	@ltx/swh_ke_oak/he.k:ka.MM.Lent1Ode1.text
ltx/swh_redirects_oak/he.k:ka.MM.Lent1Ode1345678.text	@ltx/swh_ke_oak/he.k:ka.MM.Lent1Ode1345678.text
ltx/swh_redirects_oak/he.k:ka.MM.Lent1Ode3.text	@ltx/swh_ke_oak/he.k:ka.MM.Lent1Ode3.text
ltx/swh_redirects_oak/he.k:ka.MM.Lent1Ode4.text	@ltx/swh_ke_oak/he.k:ka.MM.Lent1Ode4.text
ltx/swh_redirects_oak/he.k:ka.MM.Lent1Ode5.text	@ltx/swh_ke_oak/he.k:ka.MM.Lent1Ode5.text
ltx/swh_redirects_oak/he.k:ka.MM.Lent1Ode6.text	@ltx/swh_ke_oak/he.k:ka.MM.Lent1Ode6.text
ltx/swh_redirects_oak/he.k:ka.MM.Lent1Ode7.text	@ltx/swh_ke_oak/he.k:ka.MM.Lent1Ode7.text
ltx/swh_redirects_oak/he.k:ka.MM.Lent1Ode8.text	@ltx/swh_ke_oak/he.k:ka.MM.Lent1Ode8.text
ltx/swh_redirects_oak/he.k:ka.MM.Lent1Ode9.text	@ltx/swh_ke_oak/he.k:ka.MM.Lent1Ode9.text
ltx/swh_redirects_oak/he.k:ka.MM.Lent3.title	@ltx/swh_ke_oak/he.k:ka.MM.Lent3.title
ltx/swh_redirects_oak/he.k:ka.MM.Lent3Ode1.text	@ltx/swh_ke_oak/he.k:ka.MM.Lent3Ode1.text
ltx/swh_redirects_oak/he.k:ka.MM.Lent3Ode1345678.text	@ltx/swh_ke_oak/he.k:ka.MM.Lent3Ode1345678.text
ltx/swh_redirects_oak/he.k:ka.MM.Lent3Ode3.text	@ltx/swh_ke_oak/he.k:ka.MM.Lent3Ode3.text
ltx/swh_redirects_oak/he.k:ka.MM.Lent3Ode4.text	@ltx/swh_ke_oak/he.k:ka.MM.Lent3Ode4.text
ltx/swh_redirects_oak/he.k:ka.MM.Lent3Ode5.text	@ltx/swh_ke_oak/he.k:ka.MM.Lent3Ode5.text
ltx/swh_redirects_oak/he.k:ka.MM.Lent3Ode6.text	@ltx/swh_ke_oak/he.k:ka.MM.Lent3Ode6.text
ltx/swh_redirects_oak/he.k:ka.MM.Lent3Ode7.text	@ltx/swh_ke_oak/he.k:ka.MM.Lent3Ode7.text
ltx/swh_redirects_oak/he.k:ka.MM.Lent3Ode8.text	@ltx/swh_ke_oak/he.k:ka.MM.Lent3Ode8.text
ltx/swh_redirects_oak/he.k:ka.MM.Lent3Ode9.text	@ltx/swh_ke_oak/he.k:ka.MM.Lent3Ode9.text
ltx/swh_redirects_oak/he.k:ka.MM.Meeting.title	@ltx/swh_ke_oak/he.k:ka.MM.Meeting.title
ltx/swh_redirects_oak/he.k:ka.MM.MeetingOde1.text	@ltx/swh_ke_oak/he.k:ka.MM.MeetingOde1.text
ltx/swh_redirects_oak/he.k:ka.MM.MeetingOde1345678.text	@ltx/swh_ke_oak/he.k:ka.MM.MeetingOde1345678.text
ltx/swh_redirects_oak/he.k:ka.MM.MeetingOde3.text	@ltx/swh_ke_oak/he.k:ka.MM.MeetingOde3.text
ltx/swh_redirects_oak/he.k:ka.MM.MeetingOde4.text	@ltx/swh_ke_oak/he.k:ka.MM.MeetingOde4.text
ltx/swh_redirects_oak/he.k:ka.MM.MeetingOde5.text	@ltx/swh_ke_oak/he.k:ka.MM.MeetingOde5.text
ltx/swh_redirects_oak/he.k:ka.MM.MeetingOde6.text	@ltx/swh_ke_oak/he.k:ka.MM.MeetingOde6.text
ltx/swh_redirects_oak/he.k:ka.MM.MeetingOde7.text	@ltx/swh_ke_oak/he.k:ka.MM.MeetingOde7.text
ltx/swh_redirects_oak/he.k:ka.MM.MeetingOde8.text	@ltx/swh_ke_oak/he.k:ka.MM.MeetingOde8.text
ltx/swh_redirects_oak/he.k:ka.MM.MeetingOde9.text	@ltx/swh_ke_oak/he.k:ka.MM.MeetingOde9.text
ltx/swh_redirects_oak/he.k:ka.MM.MidPentecost.title	@ltx/swh_ke_oak/he.k:ka.MM.MidPentecost.title
ltx/swh_redirects_oak/he.k:ka.MM.MidPentecostOde1.text	@ltx/swh_ke_oak/he.k:ka.MM.MidPentecostOde1.text
ltx/swh_redirects_oak/he.k:ka.MM.MidPentecostOde1345678.text	@ltx/swh_ke_oak/he.k:ka.MM.MidPentecostOde1345678.text
ltx/swh_redirects_oak/he.k:ka.MM.MidPentecostOde3.text	@ltx/swh_ke_oak/he.k:ka.MM.MidPentecostOde3.text
ltx/swh_redirects_oak/he.k:ka.MM.MidPentecostOde4.text	@ltx/swh_ke_oak/he.k:ka.MM.MidPentecostOde4.text
ltx/swh_redirects_oak/he.k:ka.MM.MidPentecostOde5.text	@ltx/swh_ke_oak/he.k:ka.MM.MidPentecostOde5.text
ltx/swh_redirects_oak/he.k:ka.MM.MidPentecostOde6.text	@ltx/swh_ke_oak/he.k:ka.MM.MidPentecostOde6.text
ltx/swh_redirects_oak/he.k:ka.MM.MidPentecostOde7.text	@ltx/swh_ke_oak/he.k:ka.MM.MidPentecostOde7.text
ltx/swh_redirects_oak/he.k:ka.MM.MidPentecostOde8.text	@ltx/swh_ke_oak/he.k:ka.MM.MidPentecostOde8.text
ltx/swh_redirects_oak/he.k:ka.MM.MidPentecostOde9.text	@ltx/swh_ke_oak/he.k:ka.MM.MidPentecostOde9.text
ltx/swh_redirects_oak/he.k:ka.MM.PalmSunday.title	@ltx/swh_ke_oak/he.k:ka.MM.PalmSunday.title
ltx/swh_redirects_oak/he.k:ka.MM.PalmSundayOde1.text	@ltx/swh_ke_oak/he.k:ka.MM.PalmSundayOde1.text
ltx/swh_redirects_oak/he.k:ka.MM.PalmSundayOde1345678.text	@ltx/swh_ke_oak/he.k:ka.MM.PalmSundayOde1345678.text
ltx/swh_redirects_oak/he.k:ka.MM.PalmSundayOde3.text	@ltx/swh_ke_oak/he.k:ka.MM.PalmSundayOde3.text
ltx/swh_redirects_oak/he.k:ka.MM.PalmSundayOde4.text	@ltx/swh_ke_oak/he.k:ka.MM.PalmSundayOde4.text
ltx/swh_redirects_oak/he.k:ka.MM.PalmSundayOde5.text	@ltx/swh_ke_oak/he.k:ka.MM.PalmSundayOde5.text
ltx/swh_redirects_oak/he.k:ka.MM.PalmSundayOde6.text	@ltx/swh_ke_oak/he.k:ka.MM.PalmSundayOde6.text
ltx/swh_redirects_oak/he.k:ka.MM.PalmSundayOde7.text	@ltx/swh_ke_oak/he.k:ka.MM.PalmSundayOde7.text
ltx/swh_redirects_oak/he.k:ka.MM.PalmSundayOde8.text	@ltx/swh_ke_oak/he.k:ka.MM.PalmSundayOde8.text
ltx/swh_redirects_oak/he.k:ka.MM.PalmSundayOde9.text	@ltx/swh_ke_oak/he.k:ka.MM.PalmSundayOde9.text
ltx/swh_redirects_oak/he.k:ka.MM.Pascha.title	@ltx/swh_ke_oak/he.k:ka.MM.Pascha.title
ltx/swh_redirects_oak/he.k:ka.MM.PaschaOde1.text	@ltx/swh_ke_oak/he.k:ka.MM.PaschaOde1.text
ltx/swh_redirects_oak/he.k:ka.MM.PaschaOde1345678.text	@ltx/swh_ke_oak/he.k:ka.MM.PaschaOde1345678.text
ltx/swh_redirects_oak/he.k:ka.MM.PaschaOde3.text	@ltx/swh_ke_oak/he.k:ka.MM.PaschaOde3.text
ltx/swh_redirects_oak/he.k:ka.MM.PaschaOde4.text	@ltx/swh_ke_oak/he.k:ka.MM.PaschaOde4.text
ltx/swh_redirects_oak/he.k:ka.MM.PaschaOde5.text	@ltx/swh_ke_oak/he.k:ka.MM.PaschaOde5.text
ltx/swh_redirects_oak/he.k:ka.MM.PaschaOde6.text	@ltx/swh_ke_oak/he.k:ka.MM.PaschaOde6.text
ltx/swh_redirects_oak/he.k:ka.MM.PaschaOde7.text	@ltx/swh_ke_oak/he.k:ka.MM.PaschaOde7.text
ltx/swh_redirects_oak/he.k:ka.MM.PaschaOde8.text	@ltx/swh_ke_oak/he.k:ka.MM.PaschaOde8.text
ltx/swh_redirects_oak/he.k:ka.MM.PaschaOde9.text	@ltx/swh_ke_oak/he.k:ka.MM.PaschaOde9.text
ltx/swh_redirects_oak/he.k:ka.MM.PentSoulSaturday.title	@ltx/swh_ke_oak/he.k:ka.MM.PentSoulSaturday.title
ltx/swh_redirects_oak/he.k:ka.MM.PentSoulSaturdayOde1.text	@ltx/swh_ke_oak/he.k:ka.MM.PentSoulSaturdayOde1.text
ltx/swh_redirects_oak/he.k:ka.MM.PentSoulSaturdayOde1345678.text	@ltx/swh_ke_oak/he.k:ka.MM.PentSoulSaturdayOde1345678.text
ltx/swh_redirects_oak/he.k:ka.MM.PentSoulSaturdayOde3.text	@ltx/swh_ke_oak/he.k:ka.MM.PentSoulSaturdayOde3.text
ltx/swh_redirects_oak/he.k:ka.MM.PentSoulSaturdayOde4.text	@ltx/swh_ke_oak/he.k:ka.MM.PentSoulSaturdayOde4.text
ltx/swh_redirects_oak/he.k:ka.MM.PentSoulSaturdayOde5.text	@ltx/swh_ke_oak/he.k:ka.MM.PentSoulSaturdayOde5.text
ltx/swh_redirects_oak/he.k:ka.MM.PentSoulSaturdayOde6.text	@ltx/swh_ke_oak/he.k:ka.MM.PentSoulSaturdayOde6.text
ltx/swh_redirects_oak/he.k:ka.MM.PentSoulSaturdayOde7.text	@ltx/swh_ke_oak/he.k:ka.MM.PentSoulSaturdayOde7.text
ltx/swh_redirects_oak/he.k:ka.MM.PentSoulSaturdayOde8.text	@ltx/swh_ke_oak/he.k:ka.MM.PentSoulSaturdayOde8.text
ltx/swh_redirects_oak/he.k:ka.MM.PentSoulSaturdayOde9.text	@ltx/swh_ke_oak/he.k:ka.MM.PentSoulSaturdayOde9.text
ltx/swh_redirects_oak/he.k:ka.MM.Pentecost12.title	@ltx/swh_ke_oak/he.k:ka.MM.Pentecost12.title
ltx/swh_redirects_oak/he.k:ka.MM.Pentecost12Ode1.text	@ltx/swh_ke_oak/he.k:ka.MM.Pentecost12Ode1.text
ltx/swh_redirects_oak/he.k:ka.MM.Pentecost12Ode1345678.text	@ltx/swh_ke_oak/he.k:ka.MM.Pentecost12Ode1345678.text
ltx/swh_redirects_oak/he.k:ka.MM.Pentecost12Ode3.text	@ltx/swh_ke_oak/he.k:ka.MM.Pentecost12Ode3.text
ltx/swh_redirects_oak/he.k:ka.MM.Pentecost12Ode4.text	@ltx/swh_ke_oak/he.k:ka.MM.Pentecost12Ode4.text
ltx/swh_redirects_oak/he.k:ka.MM.Pentecost12Ode5.text	@ltx/swh_ke_oak/he.k:ka.MM.Pentecost12Ode5.text
ltx/swh_redirects_oak/he.k:ka.MM.Pentecost12Ode6.text	@ltx/swh_ke_oak/he.k:ka.MM.Pentecost12Ode6.text
ltx/swh_redirects_oak/he.k:ka.MM.Pentecost12Ode7.text	@ltx/swh_ke_oak/he.k:ka.MM.Pentecost12Ode7.text
ltx/swh_redirects_oak/he.k:ka.MM.Pentecost12Ode8.text	@ltx/swh_ke_oak/he.k:ka.MM.Pentecost12Ode8.text
ltx/swh_redirects_oak/he.k:ka.MM.Pentecost12Ode9.text	@ltx/swh_ke_oak/he.k:ka.MM.Pentecost12Ode9.text
ltx/swh_redirects_oak/he.k:ka.MM.Pentecost2.title	@ltx/swh_ke_oak/he.k:ka.MM.Pentecost2.title
ltx/swh_redirects_oak/he.k:ka.MM.Pentecost2Ode1.text	@ltx/swh_ke_oak/he.k:ka.MM.Pentecost2Ode1.text
ltx/swh_redirects_oak/he.k:ka.MM.Pentecost2Ode1345678.text	@ltx/swh_ke_oak/he.k:ka.MM.Pentecost2Ode1345678.text
ltx/swh_redirects_oak/he.k:ka.MM.Pentecost2Ode3.text	@ltx/swh_ke_oak/he.k:ka.MM.Pentecost2Ode3.text
ltx/swh_redirects_oak/he.k:ka.MM.Pentecost2Ode4.text	@ltx/swh_ke_oak/he.k:ka.MM.Pentecost2Ode4.text
ltx/swh_redirects_oak/he.k:ka.MM.Pentecost2Ode5.text	@ltx/swh_ke_oak/he.k:ka.MM.Pentecost2Ode5.text
ltx/swh_redirects_oak/he.k:ka.MM.Pentecost2Ode6.text	@ltx/swh_ke_oak/he.k:ka.MM.Pentecost2Ode6.text
ltx/swh_redirects_oak/he.k:ka.MM.Pentecost2Ode7.text	@ltx/swh_ke_oak/he.k:ka.MM.Pentecost2Ode7.text
ltx/swh_redirects_oak/he.k:ka.MM.Pentecost2Ode8.text	@ltx/swh_ke_oak/he.k:ka.MM.Pentecost2Ode8.text
ltx/swh_redirects_oak/he.k:ka.MM.Pentecost2Ode9.text	@ltx/swh_ke_oak/he.k:ka.MM.Pentecost2Ode9.text
ltx/swh_redirects_oak/he.k:ka.MM.Summer.title	@ltx/swh_ke_oak/he.k:ka.MM.Summer.title
ltx/swh_redirects_oak/he.k:ka.MM.SummerOde1.text	@ltx/swh_ke_oak/he.k:ka.MM.SummerOde1.text
ltx/swh_redirects_oak/he.k:ka.MM.SummerOde1345678.text	@ltx/swh_ke_oak/he.k:ka.MM.SummerOde1345678.text
ltx/swh_redirects_oak/he.k:ka.MM.SummerOde3.text	@ltx/swh_ke_oak/he.k:ka.MM.SummerOde3.text
ltx/swh_redirects_oak/he.k:ka.MM.SummerOde4.text	@ltx/swh_ke_oak/he.k:ka.MM.SummerOde4.text
ltx/swh_redirects_oak/he.k:ka.MM.SummerOde5.text	@ltx/swh_ke_oak/he.k:ka.MM.SummerOde5.text
ltx/swh_redirects_oak/he.k:ka.MM.SummerOde6.text	@ltx/swh_ke_oak/he.k:ka.MM.SummerOde6.text
ltx/swh_redirects_oak/he.k:ka.MM.SummerOde7.text	@ltx/swh_ke_oak/he.k:ka.MM.SummerOde7.text
ltx/swh_redirects_oak/he.k:ka.MM.SummerOde8.text	@ltx/swh_ke_oak/he.k:ka.MM.SummerOde8.text
ltx/swh_redirects_oak/he.k:ka.MM.SummerOde9.text	@ltx/swh_ke_oak/he.k:ka.MM.SummerOde9.text
ltx/swh_redirects_oak/he.k:ka.MM.Theotokos.title	@ltx/swh_ke_oak/he.k:ka.MM.Theotokos.title
ltx/swh_redirects_oak/he.k:ka.MM.TheotokosAkathist.title	@ltx/swh_ke_oak/he.k:ka.MM.TheotokosAkathist.title
ltx/swh_redirects_oak/he.k:ka.MM.TheotokosAkathistOde1.text	@ltx/swh_ke_oak/he.k:ka.MM.TheotokosAkathistOde1.text
ltx/swh_redirects_oak/he.k:ka.MM.TheotokosAkathistOde1345678.text	@ltx/swh_ke_oak/he.k:ka.MM.TheotokosAkathistOde1345678.text
ltx/swh_redirects_oak/he.k:ka.MM.TheotokosAkathistOde3.text	@ltx/swh_ke_oak/he.k:ka.MM.TheotokosAkathistOde3.text
ltx/swh_redirects_oak/he.k:ka.MM.TheotokosAkathistOde4.text	@ltx/swh_ke_oak/he.k:ka.MM.TheotokosAkathistOde4.text
ltx/swh_redirects_oak/he.k:ka.MM.TheotokosAkathistOde5.text	@ltx/swh_ke_oak/he.k:ka.MM.TheotokosAkathistOde5.text
ltx/swh_redirects_oak/he.k:ka.MM.TheotokosAkathistOde6.text	@ltx/swh_ke_oak/he.k:ka.MM.TheotokosAkathistOde6.text
ltx/swh_redirects_oak/he.k:ka.MM.TheotokosAkathistOde7.text	@ltx/swh_ke_oak/he.k:ka.MM.TheotokosAkathistOde7.text
ltx/swh_redirects_oak/he.k:ka.MM.TheotokosAkathistOde8.text	@ltx/swh_ke_oak/he.k:ka.MM.TheotokosAkathistOde8.text
ltx/swh_redirects_oak/he.k:ka.MM.TheotokosAkathistOde9.text	@ltx/swh_ke_oak/he.k:ka.MM.TheotokosAkathistOde9.text
ltx/swh_redirects_oak/he.k:ka.MM.TheotokosDormition.title	@ltx/swh_ke_oak/he.k:ka.MM.TheotokosDormition.title
ltx/swh_redirects_oak/he.k:ka.MM.TheotokosDormitionOde1.text	@ltx/swh_ke_oak/he.k:ka.MM.TheotokosDormitionOde1.text
ltx/swh_redirects_oak/he.k:ka.MM.TheotokosDormitionOde1345678.text	@ltx/swh_ke_oak/he.k:ka.MM.TheotokosDormitionOde1345678.text
ltx/swh_redirects_oak/he.k:ka.MM.TheotokosDormitionOde3.text	@ltx/swh_ke_oak/he.k:ka.MM.TheotokosDormitionOde3.text
ltx/swh_redirects_oak/he.k:ka.MM.TheotokosDormitionOde4.text	@ltx/swh_ke_oak/he.k:ka.MM.TheotokosDormitionOde4.text
ltx/swh_redirects_oak/he.k:ka.MM.TheotokosDormitionOde5.text	@ltx/swh_ke_oak/he.k:ka.MM.TheotokosDormitionOde5.text
ltx/swh_redirects_oak/he.k:ka.MM.TheotokosDormitionOde6.text	@ltx/swh_ke_oak/he.k:ka.MM.TheotokosDormitionOde6.text
ltx/swh_redirects_oak/he.k:ka.MM.TheotokosDormitionOde7.text	@ltx/swh_ke_oak/he.k:ka.MM.TheotokosDormitionOde7.text
ltx/swh_redirects_oak/he.k:ka.MM.TheotokosDormitionOde8.text	@ltx/swh_ke_oak/he.k:ka.MM.TheotokosDormitionOde8.text
ltx/swh_redirects_oak/he.k:ka.MM.TheotokosDormitionOde9.text	@ltx/swh_ke_oak/he.k:ka.MM.TheotokosDormitionOde9.text
ltx/swh_redirects_oak/he.k:ka.MM.TheotokosEntry.title	@ltx/swh_ke_oak/he.k:ka.MM.TheotokosEntry.title
ltx/swh_redirects_oak/he.k:ka.MM.TheotokosEntryOde1.text	@ltx/swh_ke_oak/he.k:ka.MM.TheotokosEntryOde1.text
ltx/swh_redirects_oak/he.k:ka.MM.TheotokosEntryOde1345678.text	@ltx/swh_ke_oak/he.k:ka.MM.TheotokosEntryOde1345678.text
ltx/swh_redirects_oak/he.k:ka.MM.TheotokosEntryOde3.text	@ltx/swh_ke_oak/he.k:ka.MM.TheotokosEntryOde3.text
ltx/swh_redirects_oak/he.k:ka.MM.TheotokosEntryOde4.text	@ltx/swh_ke_oak/he.k:ka.MM.TheotokosEntryOde4.text
ltx/swh_redirects_oak/he.k:ka.MM.TheotokosEntryOde5.text	@ltx/swh_ke_oak/he.k:ka.MM.TheotokosEntryOde5.text
ltx/swh_redirects_oak/he.k:ka.MM.TheotokosEntryOde6.text	@ltx/swh_ke_oak/he.k:ka.MM.TheotokosEntryOde6.text
ltx/swh_redirects_oak/he.k:ka.MM.TheotokosEntryOde7.text	@ltx/swh_ke_oak/he.k:ka.MM.TheotokosEntryOde7.text
ltx/swh_redirects_oak/he.k:ka.MM.TheotokosEntryOde8.text	@ltx/swh_ke_oak/he.k:ka.MM.TheotokosEntryOde8.text
ltx/swh_redirects_oak/he.k:ka.MM.TheotokosEntryOde9.text	@ltx/swh_ke_oak/he.k:ka.MM.TheotokosEntryOde9.text
ltx/swh_redirects_oak/he.k:ka.MM.TheotokosOde1.text	@ltx/swh_ke_oak/he.k:ka.MM.TheotokosOde1.text
ltx/swh_redirects_oak/he.k:ka.MM.TheotokosOde1345678.text	@ltx/swh_ke_oak/he.k:ka.MM.TheotokosOde1345678.text
ltx/swh_redirects_oak/he.k:ka.MM.TheotokosOde3.text	@ltx/swh_ke_oak/he.k:ka.MM.TheotokosOde3.text
ltx/swh_redirects_oak/he.k:ka.MM.TheotokosOde4.text	@ltx/swh_ke_oak/he.k:ka.MM.TheotokosOde4.text
ltx/swh_redirects_oak/he.k:ka.MM.TheotokosOde5.text	@ltx/swh_ke_oak/he.k:ka.MM.TheotokosOde5.text
ltx/swh_redirects_oak/he.k:ka.MM.TheotokosOde6.text	@ltx/swh_ke_oak/he.k:ka.MM.TheotokosOde6.text
ltx/swh_redirects_oak/he.k:ka.MM.TheotokosOde7.text	@ltx/swh_ke_oak/he.k:ka.MM.TheotokosOde7.text
ltx/swh_redirects_oak/he.k:ka.MM.TheotokosOde8.text	@ltx/swh_ke_oak/he.k:ka.MM.TheotokosOde8.text
ltx/swh_redirects_oak/he.k:ka.MM.TheotokosOde9.text	@ltx/swh_ke_oak/he.k:ka.MM.TheotokosOde9.text
ltx/swh_redirects_oak/he.k:ka.MM.Tr_d021.title	@ltx/swh_ke_oak/he.k:ka.MM.Tr_d021.title
ltx/swh_redirects_oak/he.k:ka.MM.Tr_d021Ode1.text	@ltx/swh_ke_oak/he.k:ka.MM.Tr_d021Ode1.text
ltx/swh_redirects_oak/he.k:ka.MM.Tr_d021Ode12345678.text	@ltx/swh_ke_oak/he.k:ka.MM.Tr_d021Ode12345678.text
ltx/swh_redirects_oak/he.k:ka.MM.Tr_d021Ode2.text	@ltx/swh_ke_oak/he.k:ka.MM.Tr_d021Ode2.text
ltx/swh_redirects_oak/he.k:ka.MM.Tr_d021Ode3.text	@ltx/swh_ke_oak/he.k:ka.MM.Tr_d021Ode3.text
ltx/swh_redirects_oak/he.k:ka.MM.Tr_d021Ode4.text	@ltx/swh_ke_oak/he.k:ka.MM.Tr_d021Ode4.text
ltx/swh_redirects_oak/he.k:ka.MM.Tr_d021Ode5.text	@ltx/swh_ke_oak/he.k:ka.MM.Tr_d021Ode5.text
ltx/swh_redirects_oak/he.k:ka.MM.Tr_d021Ode6.text	@ltx/swh_ke_oak/he.k:ka.MM.Tr_d021Ode6.text
ltx/swh_redirects_oak/he.k:ka.MM.Tr_d021Ode7.text	@ltx/swh_ke_oak/he.k:ka.MM.Tr_d021Ode7.text
ltx/swh_redirects_oak/he.k:ka.MM.Tr_d021Ode8.text	@ltx/swh_ke_oak/he.k:ka.MM.Tr_d021Ode8.text
ltx/swh_redirects_oak/he.k:ka.MM.Tr_d021Ode9.text	@ltx/swh_ke_oak/he.k:ka.MM.Tr_d021Ode9.text
ltx/swh_redirects_oak/he.k:ka.MM.Triodion14.title	@ltx/swh_ke_oak/he.k:ka.MM.Triodion14.title
ltx/swh_redirects_oak/he.k:ka.MM.Triodion14Ode1.text	@ltx/swh_ke_oak/he.k:ka.MM.Triodion14Ode1.text
ltx/swh_redirects_oak/he.k:ka.MM.Triodion14Ode1345678.text	@ltx/swh_ke_oak/he.k:ka.MM.Triodion14Ode1345678.text
ltx/swh_redirects_oak/he.k:ka.MM.Triodion14Ode3.text	@ltx/swh_ke_oak/he.k:ka.MM.Triodion14Ode3.text
ltx/swh_redirects_oak/he.k:ka.MM.Triodion14Ode4.text	@ltx/swh_ke_oak/he.k:ka.MM.Triodion14Ode4.text
ltx/swh_redirects_oak/he.k:ka.MM.Triodion14Ode5.text	@ltx/swh_ke_oak/he.k:ka.MM.Triodion14Ode5.text
ltx/swh_redirects_oak/he.k:ka.MM.Triodion14Ode6.text	@ltx/swh_ke_oak/he.k:ka.MM.Triodion14Ode6.text
ltx/swh_redirects_oak/he.k:ka.MM.Triodion14Ode7.text	@ltx/swh_ke_oak/he.k:ka.MM.Triodion14Ode7.text
ltx/swh_redirects_oak/he.k:ka.MM.Triodion14Ode8.text	@ltx/swh_ke_oak/he.k:ka.MM.Triodion14Ode8.text
ltx/swh_redirects_oak/he.k:ka.MM.Triodion14Ode9.text	@ltx/swh_ke_oak/he.k:ka.MM.Triodion14Ode9.text
ltx/swh_redirects_oak/he.k:ka.MM.Triodion2.title	@ltx/swh_ke_oak/he.k:ka.MM.Triodion2.title
ltx/swh_redirects_oak/he.k:ka.MM.Triodion2Ode1.text	@ltx/swh_ke_oak/he.k:ka.MM.Triodion2Ode1.text
ltx/swh_redirects_oak/he.k:ka.MM.Triodion2Ode1345678.text	@ltx/swh_ke_oak/he.k:ka.MM.Triodion2Ode1345678.text
ltx/swh_redirects_oak/he.k:ka.MM.Triodion2Ode3.text	@ltx/swh_ke_oak/he.k:ka.MM.Triodion2Ode3.text
ltx/swh_redirects_oak/he.k:ka.MM.Triodion2Ode4.text	@ltx/swh_ke_oak/he.k:ka.MM.Triodion2Ode4.text
ltx/swh_redirects_oak/he.k:ka.MM.Triodion2Ode5.text	@ltx/swh_ke_oak/he.k:ka.MM.Triodion2Ode5.text
ltx/swh_redirects_oak/he.k:ka.MM.Triodion2Ode6.text	@ltx/swh_ke_oak/he.k:ka.MM.Triodion2Ode6.text
ltx/swh_redirects_oak/he.k:ka.MM.Triodion2Ode7.text	@ltx/swh_ke_oak/he.k:ka.MM.Triodion2Ode7.text
ltx/swh_redirects_oak/he.k:ka.MM.Triodion2Ode8.text	@ltx/swh_ke_oak/he.k:ka.MM.Triodion2Ode8.text
ltx/swh_redirects_oak/he.k:ka.MM.Triodion2Ode9.text	@ltx/swh_ke_oak/he.k:ka.MM.Triodion2Ode9.text
ltx/swh_redirects_oak/he.k:ka.MM.Triodion3.title	@ltx/swh_ke_oak/he.k:ka.MM.Triodion3.title
ltx/swh_redirects_oak/he.k:ka.MM.Triodion3Ode1.text	@ltx/swh_ke_oak/he.k:ka.MM.Triodion3Ode1.text
ltx/swh_redirects_oak/he.k:ka.MM.Triodion3Ode1345678.text	@ltx/swh_ke_oak/he.k:ka.MM.Triodion3Ode1345678.text
ltx/swh_redirects_oak/he.k:ka.MM.Triodion3Ode3.text	@ltx/swh_ke_oak/he.k:ka.MM.Triodion3Ode3.text
ltx/swh_redirects_oak/he.k:ka.MM.Triodion3Ode4.text	@ltx/swh_ke_oak/he.k:ka.MM.Triodion3Ode4.text
ltx/swh_redirects_oak/he.k:ka.MM.Triodion3Ode5.text	@ltx/swh_ke_oak/he.k:ka.MM.Triodion3Ode5.text
ltx/swh_redirects_oak/he.k:ka.MM.Triodion3Ode6.text	@ltx/swh_ke_oak/he.k:ka.MM.Triodion3Ode6.text
ltx/swh_redirects_oak/he.k:ka.MM.Triodion3Ode7.text	@ltx/swh_ke_oak/he.k:ka.MM.Triodion3Ode7.text
ltx/swh_redirects_oak/he.k:ka.MM.Triodion3Ode8.text	@ltx/swh_ke_oak/he.k:ka.MM.Triodion3Ode8.text
ltx/swh_redirects_oak/he.k:ka.MM.Triodion3Ode9.text	@ltx/swh_ke_oak/he.k:ka.MM.Triodion3Ode9.text
