ltx/swh_redirects_oak/tr.d059:trCO.header	@ltx/swh_ke_oak/tr.d059:trCO.header
ltx/swh_redirects_oak/tr.d059:trDA.commemoration.full	@ltx/swh_ke_oak/tr.d059:trDA.commemoration.full
ltx/swh_redirects_oak/tr.d059:trDA.commemoration.short	@ltx/swh_ke_oak/tr.d059:trDA.commemoration.short
ltx/swh_redirects_oak/tr.d059:trDA.insert1	@ltx/swh_ke_oak/tr.d059:trDA.insert1
ltx/swh_redirects_oak/tr.d059:trDA.insert2	@ltx/swh_ke_oak/tr.d059:trDA.insert2
ltx/swh_redirects_oak/tr.d059:trDA.note	@ltx/swh_ke_oak/tr.d059:trDA.note
ltx/swh_redirects_oak/tr.d059:trDA.title	@ltx/swh_ke_oak/tr.d059:trDA.title
ltx/swh_redirects_oak/tr.d059:trHO.commemorations	@ltx/swh_ke_oak/tr.d059:trHO.commemorations
ltx/swh_redirects_oak/tr.d059:trHO.daytitle	@ltx/swh_ke_oak/tr.d059:trHO.daytitle
ltx/swh_redirects_oak/tr.d059:trHO.description1	@ltx/swh_ke_oak/tr.d059:trHO.description1
ltx/swh_redirects_oak/tr.d059:trHO.description2	@ltx/swh_ke_oak/tr.d059:trHO.description2
ltx/swh_redirects_oak/tr.d059:trHO.note1	@ltx/swh_ke_oak/tr.d059:trHO.note1
ltx/swh_redirects_oak/tr.d059:trHO.note2	@ltx/swh_ke_oak/tr.d059:trHO.note2
ltx/swh_redirects_oak/tr.d059:trMA.AposIdiomelon1.incipit	@ltx/swh_ke_oak/tr.d059:trMA.AposIdiomelon1.incipit
ltx/swh_redirects_oak/tr.d059:trMA.AposIdiomelon1.melody	@ltx/swh_ke_oak/tr.d059:trMA.AposIdiomelon1.melody
ltx/swh_redirects_oak/tr.d059:trMA.AposIdiomelon1.mode	@ltx/swh_ke_oak/tr.d059:trMA.AposIdiomelon1.mode
ltx/swh_redirects_oak/tr.d059:trMA.AposIdiomelon1.text	@ltx/swh_ke_oak/tr.d059:trMA.AposIdiomelon1.text
ltx/swh_redirects_oak/tr.d059:trMA.AposMartyric.incipit	@ltx/swh_ke_oak/tr.d059:trMA.AposMartyric.incipit
ltx/swh_redirects_oak/tr.d059:trMA.AposMartyric.melody	@ltx/swh_ke_oak/tr.d059:trMA.AposMartyric.melody
ltx/swh_redirects_oak/tr.d059:trMA.AposMartyric.mode	@ltx/swh_ke_oak/tr.d059:trMA.AposMartyric.mode
ltx/swh_redirects_oak/tr.d059:trMA.AposMartyric.text	@ltx/swh_ke_oak/tr.d059:trMA.AposMartyric.text
ltx/swh_redirects_oak/tr.d059:trMA.AposTheotokion.incipit	@ltx/swh_ke_oak/tr.d059:trMA.AposTheotokion.incipit
ltx/swh_redirects_oak/tr.d059:trMA.AposTheotokion.melody	@ltx/swh_ke_oak/tr.d059:trMA.AposTheotokion.melody
ltx/swh_redirects_oak/tr.d059:trMA.AposTheotokion.mode	@ltx/swh_ke_oak/tr.d059:trMA.AposTheotokion.mode
ltx/swh_redirects_oak/tr.d059:trMA.AposTheotokion.text	@ltx/swh_ke_oak/tr.d059:trMA.AposTheotokion.text
ltx/swh_redirects_oak/tr.d059:trMA.C1.poet	@ltx/swh_ke_oak/tr.d059:trMA.C1.poet
ltx/swh_redirects_oak/tr.d059:trMA.C2.poet	@ltx/swh_ke_oak/tr.d059:trMA.C2.poet
ltx/swh_redirects_oak/tr.d059:trMA.Kathisma21.greekmelody	@ltx/swh_ke_oak/tr.d059:trMA.Kathisma21.greekmelody
ltx/swh_redirects_oak/tr.d059:trMA.Kathisma21.incipit	@ltx/swh_ke_oak/tr.d059:trMA.Kathisma21.incipit
ltx/swh_redirects_oak/tr.d059:trMA.Kathisma21.melody	@ltx/swh_ke_oak/tr.d059:trMA.Kathisma21.melody
ltx/swh_redirects_oak/tr.d059:trMA.Kathisma21.mode	@ltx/swh_ke_oak/tr.d059:trMA.Kathisma21.mode
ltx/swh_redirects_oak/tr.d059:trMA.Kathisma21.text	@ltx/swh_ke_oak/tr.d059:trMA.Kathisma21.text
ltx/swh_redirects_oak/tr.d059:trMA.Kathisma22.incipit	@ltx/swh_ke_oak/tr.d059:trMA.Kathisma22.incipit
ltx/swh_redirects_oak/tr.d059:trMA.Kathisma22.melody	@ltx/swh_ke_oak/tr.d059:trMA.Kathisma22.melody
ltx/swh_redirects_oak/tr.d059:trMA.Kathisma22.mode	@ltx/swh_ke_oak/tr.d059:trMA.Kathisma22.mode
ltx/swh_redirects_oak/tr.d059:trMA.Kathisma22.text	@ltx/swh_ke_oak/tr.d059:trMA.Kathisma22.text
ltx/swh_redirects_oak/tr.d059:trMA.Kathisma31.incipit	@ltx/swh_ke_oak/tr.d059:trMA.Kathisma31.incipit
ltx/swh_redirects_oak/tr.d059:trMA.Kathisma31.melody	@ltx/swh_ke_oak/tr.d059:trMA.Kathisma31.melody
ltx/swh_redirects_oak/tr.d059:trMA.Kathisma31.mode	@ltx/swh_ke_oak/tr.d059:trMA.Kathisma31.mode
ltx/swh_redirects_oak/tr.d059:trMA.Kathisma31.text	@ltx/swh_ke_oak/tr.d059:trMA.Kathisma31.text
ltx/swh_redirects_oak/tr.d059:trMA.Kathisma32.incipit	@ltx/swh_ke_oak/tr.d059:trMA.Kathisma32.incipit
ltx/swh_redirects_oak/tr.d059:trMA.Kathisma32.melody	@ltx/swh_ke_oak/tr.d059:trMA.Kathisma32.melody
ltx/swh_redirects_oak/tr.d059:trMA.Kathisma32.mode	@ltx/swh_ke_oak/tr.d059:trMA.Kathisma32.mode
ltx/swh_redirects_oak/tr.d059:trMA.Kathisma32.text	@ltx/swh_ke_oak/tr.d059:trMA.Kathisma32.text
ltx/swh_redirects_oak/tr.d059:trMA.Ode2C11.greekmelody	@ltx/swh_ke_oak/tr.d059:trMA.Ode2C11.greekmelody
ltx/swh_redirects_oak/tr.d059:trMA.Ode2C11.incipit	@ltx/swh_ke_oak/tr.d059:trMA.Ode2C11.incipit
ltx/swh_redirects_oak/tr.d059:trMA.Ode2C11.melody	@ltx/swh_ke_oak/tr.d059:trMA.Ode2C11.melody
ltx/swh_redirects_oak/tr.d059:trMA.Ode2C11.mode	@ltx/swh_ke_oak/tr.d059:trMA.Ode2C11.mode
ltx/swh_redirects_oak/tr.d059:trMA.Ode2C11.ode	@ltx/swh_ke_oak/tr.d059:trMA.Ode2C11.ode
ltx/swh_redirects_oak/tr.d059:trMA.Ode2C11.text	@ltx/swh_ke_oak/tr.d059:trMA.Ode2C11.text
ltx/swh_redirects_oak/tr.d059:trMA.Ode2C12.incipit	@ltx/swh_ke_oak/tr.d059:trMA.Ode2C12.incipit
ltx/swh_redirects_oak/tr.d059:trMA.Ode2C12.melody	@ltx/swh_ke_oak/tr.d059:trMA.Ode2C12.melody
ltx/swh_redirects_oak/tr.d059:trMA.Ode2C12.mode	@ltx/swh_ke_oak/tr.d059:trMA.Ode2C12.mode
ltx/swh_redirects_oak/tr.d059:trMA.Ode2C12.ode	@ltx/swh_ke_oak/tr.d059:trMA.Ode2C12.ode
ltx/swh_redirects_oak/tr.d059:trMA.Ode2C12.text	@ltx/swh_ke_oak/tr.d059:trMA.Ode2C12.text
ltx/swh_redirects_oak/tr.d059:trMA.Ode2C13.incipit	@ltx/swh_ke_oak/tr.d059:trMA.Ode2C13.incipit
ltx/swh_redirects_oak/tr.d059:trMA.Ode2C13.melody	@ltx/swh_ke_oak/tr.d059:trMA.Ode2C13.melody
ltx/swh_redirects_oak/tr.d059:trMA.Ode2C13.mode	@ltx/swh_ke_oak/tr.d059:trMA.Ode2C13.mode
ltx/swh_redirects_oak/tr.d059:trMA.Ode2C13.ode	@ltx/swh_ke_oak/tr.d059:trMA.Ode2C13.ode
ltx/swh_redirects_oak/tr.d059:trMA.Ode2C13.text	@ltx/swh_ke_oak/tr.d059:trMA.Ode2C13.text
ltx/swh_redirects_oak/tr.d059:trMA.Ode2C1H.greekmelody	@ltx/swh_ke_oak/tr.d059:trMA.Ode2C1H.greekmelody
ltx/swh_redirects_oak/tr.d059:trMA.Ode2C1H.incipit	@ltx/swh_ke_oak/tr.d059:trMA.Ode2C1H.incipit
ltx/swh_redirects_oak/tr.d059:trMA.Ode2C1H.melody	@ltx/swh_ke_oak/tr.d059:trMA.Ode2C1H.melody
ltx/swh_redirects_oak/tr.d059:trMA.Ode2C1H.mode	@ltx/swh_ke_oak/tr.d059:trMA.Ode2C1H.mode
ltx/swh_redirects_oak/tr.d059:trMA.Ode2C1H.ode	@ltx/swh_ke_oak/tr.d059:trMA.Ode2C1H.ode
ltx/swh_redirects_oak/tr.d059:trMA.Ode2C1H.text	@ltx/swh_ke_oak/tr.d059:trMA.Ode2C1H.text
ltx/swh_redirects_oak/tr.d059:trMA.Ode2C1T.incipit	@ltx/swh_ke_oak/tr.d059:trMA.Ode2C1T.incipit
ltx/swh_redirects_oak/tr.d059:trMA.Ode2C1T.melody	@ltx/swh_ke_oak/tr.d059:trMA.Ode2C1T.melody
ltx/swh_redirects_oak/tr.d059:trMA.Ode2C1T.mode	@ltx/swh_ke_oak/tr.d059:trMA.Ode2C1T.mode
ltx/swh_redirects_oak/tr.d059:trMA.Ode2C1T.ode	@ltx/swh_ke_oak/tr.d059:trMA.Ode2C1T.ode
ltx/swh_redirects_oak/tr.d059:trMA.Ode2C1T.text	@ltx/swh_ke_oak/tr.d059:trMA.Ode2C1T.text
ltx/swh_redirects_oak/tr.d059:trMA.Ode2C21.greekmelody	@ltx/swh_ke_oak/tr.d059:trMA.Ode2C21.greekmelody
ltx/swh_redirects_oak/tr.d059:trMA.Ode2C21.incipit	@ltx/swh_ke_oak/tr.d059:trMA.Ode2C21.incipit
ltx/swh_redirects_oak/tr.d059:trMA.Ode2C21.melody	@ltx/swh_ke_oak/tr.d059:trMA.Ode2C21.melody
ltx/swh_redirects_oak/tr.d059:trMA.Ode2C21.mode	@ltx/swh_ke_oak/tr.d059:trMA.Ode2C21.mode
ltx/swh_redirects_oak/tr.d059:trMA.Ode2C21.ode	@ltx/swh_ke_oak/tr.d059:trMA.Ode2C21.ode
ltx/swh_redirects_oak/tr.d059:trMA.Ode2C21.text	@ltx/swh_ke_oak/tr.d059:trMA.Ode2C21.text
ltx/swh_redirects_oak/tr.d059:trMA.Ode2C22.incipit	@ltx/swh_ke_oak/tr.d059:trMA.Ode2C22.incipit
ltx/swh_redirects_oak/tr.d059:trMA.Ode2C22.melody	@ltx/swh_ke_oak/tr.d059:trMA.Ode2C22.melody
ltx/swh_redirects_oak/tr.d059:trMA.Ode2C22.mode	@ltx/swh_ke_oak/tr.d059:trMA.Ode2C22.mode
ltx/swh_redirects_oak/tr.d059:trMA.Ode2C22.ode	@ltx/swh_ke_oak/tr.d059:trMA.Ode2C22.ode
ltx/swh_redirects_oak/tr.d059:trMA.Ode2C22.text	@ltx/swh_ke_oak/tr.d059:trMA.Ode2C22.text
ltx/swh_redirects_oak/tr.d059:trMA.Ode2C2A1.incipit	@ltx/swh_ke_oak/tr.d059:trMA.Ode2C2A1.incipit
ltx/swh_redirects_oak/tr.d059:trMA.Ode2C2A1.melody	@ltx/swh_ke_oak/tr.d059:trMA.Ode2C2A1.melody
ltx/swh_redirects_oak/tr.d059:trMA.Ode2C2A1.mode	@ltx/swh_ke_oak/tr.d059:trMA.Ode2C2A1.mode
ltx/swh_redirects_oak/tr.d059:trMA.Ode2C2A1.ode	@ltx/swh_ke_oak/tr.d059:trMA.Ode2C2A1.ode
ltx/swh_redirects_oak/tr.d059:trMA.Ode2C2A1.text	@ltx/swh_ke_oak/tr.d059:trMA.Ode2C2A1.text
ltx/swh_redirects_oak/tr.d059:trMA.Ode2C2H.greekmelody	@ltx/swh_ke_oak/tr.d059:trMA.Ode2C2H.greekmelody
ltx/swh_redirects_oak/tr.d059:trMA.Ode2C2H.incipit	@ltx/swh_ke_oak/tr.d059:trMA.Ode2C2H.incipit
ltx/swh_redirects_oak/tr.d059:trMA.Ode2C2H.melody	@ltx/swh_ke_oak/tr.d059:trMA.Ode2C2H.melody
ltx/swh_redirects_oak/tr.d059:trMA.Ode2C2H.mode	@ltx/swh_ke_oak/tr.d059:trMA.Ode2C2H.mode
ltx/swh_redirects_oak/tr.d059:trMA.Ode2C2H.ode	@ltx/swh_ke_oak/tr.d059:trMA.Ode2C2H.ode
ltx/swh_redirects_oak/tr.d059:trMA.Ode2C2H.text	@ltx/swh_ke_oak/tr.d059:trMA.Ode2C2H.text
ltx/swh_redirects_oak/tr.d059:trMA.Ode2C2T.incipit	@ltx/swh_ke_oak/tr.d059:trMA.Ode2C2T.incipit
ltx/swh_redirects_oak/tr.d059:trMA.Ode2C2T.melody	@ltx/swh_ke_oak/tr.d059:trMA.Ode2C2T.melody
ltx/swh_redirects_oak/tr.d059:trMA.Ode2C2T.mode	@ltx/swh_ke_oak/tr.d059:trMA.Ode2C2T.mode
ltx/swh_redirects_oak/tr.d059:trMA.Ode2C2T.ode	@ltx/swh_ke_oak/tr.d059:trMA.Ode2C2T.ode
ltx/swh_redirects_oak/tr.d059:trMA.Ode2C2T.text	@ltx/swh_ke_oak/tr.d059:trMA.Ode2C2T.text
ltx/swh_redirects_oak/tr.d059:trMA.Ode2C2Tr.incipit	@ltx/swh_ke_oak/tr.d059:trMA.Ode2C2Tr.incipit
ltx/swh_redirects_oak/tr.d059:trMA.Ode2C2Tr.melody	@ltx/swh_ke_oak/tr.d059:trMA.Ode2C2Tr.melody
ltx/swh_redirects_oak/tr.d059:trMA.Ode2C2Tr.mode	@ltx/swh_ke_oak/tr.d059:trMA.Ode2C2Tr.mode
ltx/swh_redirects_oak/tr.d059:trMA.Ode2C2Tr.ode	@ltx/swh_ke_oak/tr.d059:trMA.Ode2C2Tr.ode
ltx/swh_redirects_oak/tr.d059:trMA.Ode2C2Tr.text	@ltx/swh_ke_oak/tr.d059:trMA.Ode2C2Tr.text
ltx/swh_redirects_oak/tr.d059:trMA.Ode8C11.greekmelody	@ltx/swh_ke_oak/tr.d059:trMA.Ode8C11.greekmelody
ltx/swh_redirects_oak/tr.d059:trMA.Ode8C11.incipit	@ltx/swh_ke_oak/tr.d059:trMA.Ode8C11.incipit
ltx/swh_redirects_oak/tr.d059:trMA.Ode8C11.melody	@ltx/swh_ke_oak/tr.d059:trMA.Ode8C11.melody
ltx/swh_redirects_oak/tr.d059:trMA.Ode8C11.mode	@ltx/swh_ke_oak/tr.d059:trMA.Ode8C11.mode
ltx/swh_redirects_oak/tr.d059:trMA.Ode8C11.ode	@ltx/swh_ke_oak/tr.d059:trMA.Ode8C11.ode
ltx/swh_redirects_oak/tr.d059:trMA.Ode8C11.text	@ltx/swh_ke_oak/tr.d059:trMA.Ode8C11.text
ltx/swh_redirects_oak/tr.d059:trMA.Ode8C12.incipit	@ltx/swh_ke_oak/tr.d059:trMA.Ode8C12.incipit
ltx/swh_redirects_oak/tr.d059:trMA.Ode8C12.melody	@ltx/swh_ke_oak/tr.d059:trMA.Ode8C12.melody
ltx/swh_redirects_oak/tr.d059:trMA.Ode8C12.mode	@ltx/swh_ke_oak/tr.d059:trMA.Ode8C12.mode
ltx/swh_redirects_oak/tr.d059:trMA.Ode8C12.ode	@ltx/swh_ke_oak/tr.d059:trMA.Ode8C12.ode
ltx/swh_redirects_oak/tr.d059:trMA.Ode8C12.text	@ltx/swh_ke_oak/tr.d059:trMA.Ode8C12.text
ltx/swh_redirects_oak/tr.d059:trMA.Ode8C13.incipit	@ltx/swh_ke_oak/tr.d059:trMA.Ode8C13.incipit
ltx/swh_redirects_oak/tr.d059:trMA.Ode8C13.melody	@ltx/swh_ke_oak/tr.d059:trMA.Ode8C13.melody
ltx/swh_redirects_oak/tr.d059:trMA.Ode8C13.mode	@ltx/swh_ke_oak/tr.d059:trMA.Ode8C13.mode
ltx/swh_redirects_oak/tr.d059:trMA.Ode8C13.ode	@ltx/swh_ke_oak/tr.d059:trMA.Ode8C13.ode
ltx/swh_redirects_oak/tr.d059:trMA.Ode8C13.text	@ltx/swh_ke_oak/tr.d059:trMA.Ode8C13.text
ltx/swh_redirects_oak/tr.d059:trMA.Ode8C1T.incipit	@ltx/swh_ke_oak/tr.d059:trMA.Ode8C1T.incipit
ltx/swh_redirects_oak/tr.d059:trMA.Ode8C1T.melody	@ltx/swh_ke_oak/tr.d059:trMA.Ode8C1T.melody
ltx/swh_redirects_oak/tr.d059:trMA.Ode8C1T.mode	@ltx/swh_ke_oak/tr.d059:trMA.Ode8C1T.mode
ltx/swh_redirects_oak/tr.d059:trMA.Ode8C1T.ode	@ltx/swh_ke_oak/tr.d059:trMA.Ode8C1T.ode
ltx/swh_redirects_oak/tr.d059:trMA.Ode8C1T.text	@ltx/swh_ke_oak/tr.d059:trMA.Ode8C1T.text
ltx/swh_redirects_oak/tr.d059:trMA.Ode8C21.greekmelody	@ltx/swh_ke_oak/tr.d059:trMA.Ode8C21.greekmelody
ltx/swh_redirects_oak/tr.d059:trMA.Ode8C21.incipit	@ltx/swh_ke_oak/tr.d059:trMA.Ode8C21.incipit
ltx/swh_redirects_oak/tr.d059:trMA.Ode8C21.melody	@ltx/swh_ke_oak/tr.d059:trMA.Ode8C21.melody
ltx/swh_redirects_oak/tr.d059:trMA.Ode8C21.mode	@ltx/swh_ke_oak/tr.d059:trMA.Ode8C21.mode
ltx/swh_redirects_oak/tr.d059:trMA.Ode8C21.ode	@ltx/swh_ke_oak/tr.d059:trMA.Ode8C21.ode
ltx/swh_redirects_oak/tr.d059:trMA.Ode8C21.text	@ltx/swh_ke_oak/tr.d059:trMA.Ode8C21.text
ltx/swh_redirects_oak/tr.d059:trMA.Ode8C22.incipit	@ltx/swh_ke_oak/tr.d059:trMA.Ode8C22.incipit
ltx/swh_redirects_oak/tr.d059:trMA.Ode8C22.melody	@ltx/swh_ke_oak/tr.d059:trMA.Ode8C22.melody
ltx/swh_redirects_oak/tr.d059:trMA.Ode8C22.mode	@ltx/swh_ke_oak/tr.d059:trMA.Ode8C22.mode
ltx/swh_redirects_oak/tr.d059:trMA.Ode8C22.ode	@ltx/swh_ke_oak/tr.d059:trMA.Ode8C22.ode
ltx/swh_redirects_oak/tr.d059:trMA.Ode8C22.text	@ltx/swh_ke_oak/tr.d059:trMA.Ode8C22.text
ltx/swh_redirects_oak/tr.d059:trMA.Ode8C2A1.incipit	@ltx/swh_ke_oak/tr.d059:trMA.Ode8C2A1.incipit
ltx/swh_redirects_oak/tr.d059:trMA.Ode8C2A1.melody	@ltx/swh_ke_oak/tr.d059:trMA.Ode8C2A1.melody
ltx/swh_redirects_oak/tr.d059:trMA.Ode8C2A1.mode	@ltx/swh_ke_oak/tr.d059:trMA.Ode8C2A1.mode
ltx/swh_redirects_oak/tr.d059:trMA.Ode8C2A1.ode	@ltx/swh_ke_oak/tr.d059:trMA.Ode8C2A1.ode
ltx/swh_redirects_oak/tr.d059:trMA.Ode8C2A1.text	@ltx/swh_ke_oak/tr.d059:trMA.Ode8C2A1.text
ltx/swh_redirects_oak/tr.d059:trMA.Ode8C2H.greekmelody	@ltx/swh_ke_oak/tr.d059:trMA.Ode8C2H.greekmelody
ltx/swh_redirects_oak/tr.d059:trMA.Ode8C2H.incipit	@ltx/swh_ke_oak/tr.d059:trMA.Ode8C2H.incipit
ltx/swh_redirects_oak/tr.d059:trMA.Ode8C2H.melody	@ltx/swh_ke_oak/tr.d059:trMA.Ode8C2H.melody
ltx/swh_redirects_oak/tr.d059:trMA.Ode8C2H.mode	@ltx/swh_ke_oak/tr.d059:trMA.Ode8C2H.mode
ltx/swh_redirects_oak/tr.d059:trMA.Ode8C2H.ode	@ltx/swh_ke_oak/tr.d059:trMA.Ode8C2H.ode
ltx/swh_redirects_oak/tr.d059:trMA.Ode8C2H.text	@ltx/swh_ke_oak/tr.d059:trMA.Ode8C2H.text
ltx/swh_redirects_oak/tr.d059:trMA.Ode8C2T.incipit	@ltx/swh_ke_oak/tr.d059:trMA.Ode8C2T.incipit
ltx/swh_redirects_oak/tr.d059:trMA.Ode8C2T.melody	@ltx/swh_ke_oak/tr.d059:trMA.Ode8C2T.melody
ltx/swh_redirects_oak/tr.d059:trMA.Ode8C2T.mode	@ltx/swh_ke_oak/tr.d059:trMA.Ode8C2T.mode
ltx/swh_redirects_oak/tr.d059:trMA.Ode8C2T.ode	@ltx/swh_ke_oak/tr.d059:trMA.Ode8C2T.ode
ltx/swh_redirects_oak/tr.d059:trMA.Ode8C2T.text	@ltx/swh_ke_oak/tr.d059:trMA.Ode8C2T.text
ltx/swh_redirects_oak/tr.d059:trMA.Ode8C2Tr.incipit	@ltx/swh_ke_oak/tr.d059:trMA.Ode8C2Tr.incipit
ltx/swh_redirects_oak/tr.d059:trMA.Ode8C2Tr.melody	@ltx/swh_ke_oak/tr.d059:trMA.Ode8C2Tr.melody
ltx/swh_redirects_oak/tr.d059:trMA.Ode8C2Tr.mode	@ltx/swh_ke_oak/tr.d059:trMA.Ode8C2Tr.mode
ltx/swh_redirects_oak/tr.d059:trMA.Ode8C2Tr.ode	@ltx/swh_ke_oak/tr.d059:trMA.Ode8C2Tr.ode
ltx/swh_redirects_oak/tr.d059:trMA.Ode8C2Tr.text	@ltx/swh_ke_oak/tr.d059:trMA.Ode8C2Tr.text
ltx/swh_redirects_oak/tr.d059:trMA.Ode9C11.greekmelody	@ltx/swh_ke_oak/tr.d059:trMA.Ode9C11.greekmelody
ltx/swh_redirects_oak/tr.d059:trMA.Ode9C11.incipit	@ltx/swh_ke_oak/tr.d059:trMA.Ode9C11.incipit
ltx/swh_redirects_oak/tr.d059:trMA.Ode9C11.melody	@ltx/swh_ke_oak/tr.d059:trMA.Ode9C11.melody
ltx/swh_redirects_oak/tr.d059:trMA.Ode9C11.mode	@ltx/swh_ke_oak/tr.d059:trMA.Ode9C11.mode
ltx/swh_redirects_oak/tr.d059:trMA.Ode9C11.ode	@ltx/swh_ke_oak/tr.d059:trMA.Ode9C11.ode
ltx/swh_redirects_oak/tr.d059:trMA.Ode9C11.text	@ltx/swh_ke_oak/tr.d059:trMA.Ode9C11.text
ltx/swh_redirects_oak/tr.d059:trMA.Ode9C12.incipit	@ltx/swh_ke_oak/tr.d059:trMA.Ode9C12.incipit
ltx/swh_redirects_oak/tr.d059:trMA.Ode9C12.melody	@ltx/swh_ke_oak/tr.d059:trMA.Ode9C12.melody
ltx/swh_redirects_oak/tr.d059:trMA.Ode9C12.mode	@ltx/swh_ke_oak/tr.d059:trMA.Ode9C12.mode
ltx/swh_redirects_oak/tr.d059:trMA.Ode9C12.ode	@ltx/swh_ke_oak/tr.d059:trMA.Ode9C12.ode
ltx/swh_redirects_oak/tr.d059:trMA.Ode9C12.text	@ltx/swh_ke_oak/tr.d059:trMA.Ode9C12.text
ltx/swh_redirects_oak/tr.d059:trMA.Ode9C13.incipit	@ltx/swh_ke_oak/tr.d059:trMA.Ode9C13.incipit
ltx/swh_redirects_oak/tr.d059:trMA.Ode9C13.melody	@ltx/swh_ke_oak/tr.d059:trMA.Ode9C13.melody
ltx/swh_redirects_oak/tr.d059:trMA.Ode9C13.mode	@ltx/swh_ke_oak/tr.d059:trMA.Ode9C13.mode
ltx/swh_redirects_oak/tr.d059:trMA.Ode9C13.ode	@ltx/swh_ke_oak/tr.d059:trMA.Ode9C13.ode
ltx/swh_redirects_oak/tr.d059:trMA.Ode9C13.text	@ltx/swh_ke_oak/tr.d059:trMA.Ode9C13.text
ltx/swh_redirects_oak/tr.d059:trMA.Ode9C1T.incipit	@ltx/swh_ke_oak/tr.d059:trMA.Ode9C1T.incipit
ltx/swh_redirects_oak/tr.d059:trMA.Ode9C1T.melody	@ltx/swh_ke_oak/tr.d059:trMA.Ode9C1T.melody
ltx/swh_redirects_oak/tr.d059:trMA.Ode9C1T.mode	@ltx/swh_ke_oak/tr.d059:trMA.Ode9C1T.mode
ltx/swh_redirects_oak/tr.d059:trMA.Ode9C1T.ode	@ltx/swh_ke_oak/tr.d059:trMA.Ode9C1T.ode
ltx/swh_redirects_oak/tr.d059:trMA.Ode9C1T.text	@ltx/swh_ke_oak/tr.d059:trMA.Ode9C1T.text
ltx/swh_redirects_oak/tr.d059:trMA.Ode9C21.greekmelody	@ltx/swh_ke_oak/tr.d059:trMA.Ode9C21.greekmelody
ltx/swh_redirects_oak/tr.d059:trMA.Ode9C21.incipit	@ltx/swh_ke_oak/tr.d059:trMA.Ode9C21.incipit
ltx/swh_redirects_oak/tr.d059:trMA.Ode9C21.melody	@ltx/swh_ke_oak/tr.d059:trMA.Ode9C21.melody
ltx/swh_redirects_oak/tr.d059:trMA.Ode9C21.mode	@ltx/swh_ke_oak/tr.d059:trMA.Ode9C21.mode
ltx/swh_redirects_oak/tr.d059:trMA.Ode9C21.ode	@ltx/swh_ke_oak/tr.d059:trMA.Ode9C21.ode
ltx/swh_redirects_oak/tr.d059:trMA.Ode9C21.text	@ltx/swh_ke_oak/tr.d059:trMA.Ode9C21.text
ltx/swh_redirects_oak/tr.d059:trMA.Ode9C22.incipit	@ltx/swh_ke_oak/tr.d059:trMA.Ode9C22.incipit
ltx/swh_redirects_oak/tr.d059:trMA.Ode9C22.melody	@ltx/swh_ke_oak/tr.d059:trMA.Ode9C22.melody
ltx/swh_redirects_oak/tr.d059:trMA.Ode9C22.mode	@ltx/swh_ke_oak/tr.d059:trMA.Ode9C22.mode
ltx/swh_redirects_oak/tr.d059:trMA.Ode9C22.ode	@ltx/swh_ke_oak/tr.d059:trMA.Ode9C22.ode
ltx/swh_redirects_oak/tr.d059:trMA.Ode9C22.text	@ltx/swh_ke_oak/tr.d059:trMA.Ode9C22.text
ltx/swh_redirects_oak/tr.d059:trMA.Ode9C2A1.incipit	@ltx/swh_ke_oak/tr.d059:trMA.Ode9C2A1.incipit
ltx/swh_redirects_oak/tr.d059:trMA.Ode9C2A1.melody	@ltx/swh_ke_oak/tr.d059:trMA.Ode9C2A1.melody
ltx/swh_redirects_oak/tr.d059:trMA.Ode9C2A1.mode	@ltx/swh_ke_oak/tr.d059:trMA.Ode9C2A1.mode
ltx/swh_redirects_oak/tr.d059:trMA.Ode9C2A1.ode	@ltx/swh_ke_oak/tr.d059:trMA.Ode9C2A1.ode
ltx/swh_redirects_oak/tr.d059:trMA.Ode9C2A1.text	@ltx/swh_ke_oak/tr.d059:trMA.Ode9C2A1.text
ltx/swh_redirects_oak/tr.d059:trMA.Ode9C2H.greekmelody	@ltx/swh_ke_oak/tr.d059:trMA.Ode9C2H.greekmelody
ltx/swh_redirects_oak/tr.d059:trMA.Ode9C2H.incipit	@ltx/swh_ke_oak/tr.d059:trMA.Ode9C2H.incipit
ltx/swh_redirects_oak/tr.d059:trMA.Ode9C2H.melody	@ltx/swh_ke_oak/tr.d059:trMA.Ode9C2H.melody
ltx/swh_redirects_oak/tr.d059:trMA.Ode9C2H.mode	@ltx/swh_ke_oak/tr.d059:trMA.Ode9C2H.mode
ltx/swh_redirects_oak/tr.d059:trMA.Ode9C2H.ode	@ltx/swh_ke_oak/tr.d059:trMA.Ode9C2H.ode
ltx/swh_redirects_oak/tr.d059:trMA.Ode9C2H.text	@ltx/swh_ke_oak/tr.d059:trMA.Ode9C2H.text
ltx/swh_redirects_oak/tr.d059:trMA.Ode9C2T.incipit	@ltx/swh_ke_oak/tr.d059:trMA.Ode9C2T.incipit
ltx/swh_redirects_oak/tr.d059:trMA.Ode9C2T.melody	@ltx/swh_ke_oak/tr.d059:trMA.Ode9C2T.melody
ltx/swh_redirects_oak/tr.d059:trMA.Ode9C2T.mode	@ltx/swh_ke_oak/tr.d059:trMA.Ode9C2T.mode
ltx/swh_redirects_oak/tr.d059:trMA.Ode9C2T.ode	@ltx/swh_ke_oak/tr.d059:trMA.Ode9C2T.ode
ltx/swh_redirects_oak/tr.d059:trMA.Ode9C2T.text	@ltx/swh_ke_oak/tr.d059:trMA.Ode9C2T.text
ltx/swh_redirects_oak/tr.d059:trMA.Ode9C2Tr.incipit	@ltx/swh_ke_oak/tr.d059:trMA.Ode9C2Tr.incipit
ltx/swh_redirects_oak/tr.d059:trMA.Ode9C2Tr.melody	@ltx/swh_ke_oak/tr.d059:trMA.Ode9C2Tr.melody
ltx/swh_redirects_oak/tr.d059:trMA.Ode9C2Tr.mode	@ltx/swh_ke_oak/tr.d059:trMA.Ode9C2Tr.mode
ltx/swh_redirects_oak/tr.d059:trMA.Ode9C2Tr.ode	@ltx/swh_ke_oak/tr.d059:trMA.Ode9C2Tr.ode
ltx/swh_redirects_oak/tr.d059:trMA.Ode9C2Tr.text	@ltx/swh_ke_oak/tr.d059:trMA.Ode9C2Tr.text
ltx/swh_redirects_oak/tr.d059:trTE.Troparion.incipit	@ltx/swh_ke_oak/tr.d059:trTE.Troparion.incipit
ltx/swh_redirects_oak/tr.d059:trTE.Troparion.melody	@ltx/swh_ke_oak/tr.d059:trTE.Troparion.melody
ltx/swh_redirects_oak/tr.d059:trTE.Troparion.mode	@ltx/swh_ke_oak/tr.d059:trTE.Troparion.mode
ltx/swh_redirects_oak/tr.d059:trTE.Troparion.text	@ltx/swh_ke_oak/tr.d059:trTE.Troparion.text
ltx/swh_redirects_oak/tr.d059:trVE.AposIdiomelon1.incipit	@ltx/swh_ke_oak/tr.d059:trVE.AposIdiomelon1.incipit
ltx/swh_redirects_oak/tr.d059:trVE.AposIdiomelon1.melody	@ltx/swh_ke_oak/tr.d059:trVE.AposIdiomelon1.melody
ltx/swh_redirects_oak/tr.d059:trVE.AposIdiomelon1.mode	@ltx/swh_ke_oak/tr.d059:trVE.AposIdiomelon1.mode
ltx/swh_redirects_oak/tr.d059:trVE.AposIdiomelon1.text	@ltx/swh_ke_oak/tr.d059:trVE.AposIdiomelon1.text
ltx/swh_redirects_oak/tr.d059:trVE.AposMartyric.incipit	@ltx/swh_ke_oak/tr.d059:trVE.AposMartyric.incipit
ltx/swh_redirects_oak/tr.d059:trVE.AposMartyric.melody	@ltx/swh_ke_oak/tr.d059:trVE.AposMartyric.melody
ltx/swh_redirects_oak/tr.d059:trVE.AposMartyric.mode	@ltx/swh_ke_oak/tr.d059:trVE.AposMartyric.mode
ltx/swh_redirects_oak/tr.d059:trVE.AposMartyric.text	@ltx/swh_ke_oak/tr.d059:trVE.AposMartyric.text
ltx/swh_redirects_oak/tr.d059:trVE.AposTheotokion.incipit	@ltx/swh_ke_oak/tr.d059:trVE.AposTheotokion.incipit
ltx/swh_redirects_oak/tr.d059:trVE.AposTheotokion.melody	@ltx/swh_ke_oak/tr.d059:trVE.AposTheotokion.melody
ltx/swh_redirects_oak/tr.d059:trVE.AposTheotokion.mode	@ltx/swh_ke_oak/tr.d059:trVE.AposTheotokion.mode
ltx/swh_redirects_oak/tr.d059:trVE.AposTheotokion.text	@ltx/swh_ke_oak/tr.d059:trVE.AposTheotokion.text
ltx/swh_redirects_oak/tr.d059:trVE.Stichera01.incipit	@ltx/swh_ke_oak/tr.d059:trVE.Stichera01.incipit
ltx/swh_redirects_oak/tr.d059:trVE.Stichera01.melody	@ltx/swh_ke_oak/tr.d059:trVE.Stichera01.melody
ltx/swh_redirects_oak/tr.d059:trVE.Stichera01.mode	@ltx/swh_ke_oak/tr.d059:trVE.Stichera01.mode
ltx/swh_redirects_oak/tr.d059:trVE.Stichera01.text	@ltx/swh_ke_oak/tr.d059:trVE.Stichera01.text
ltx/swh_redirects_oak/tr.d059:trVE.Stichera02.incipit	@ltx/swh_ke_oak/tr.d059:trVE.Stichera02.incipit
ltx/swh_redirects_oak/tr.d059:trVE.Stichera02.melody	@ltx/swh_ke_oak/tr.d059:trVE.Stichera02.melody
ltx/swh_redirects_oak/tr.d059:trVE.Stichera02.mode	@ltx/swh_ke_oak/tr.d059:trVE.Stichera02.mode
ltx/swh_redirects_oak/tr.d059:trVE.Stichera02.text	@ltx/swh_ke_oak/tr.d059:trVE.Stichera02.text
ltx/swh_redirects_oak/tr.d059:trVE.Stichera03.incipit	@ltx/swh_ke_oak/tr.d059:trVE.Stichera03.incipit
ltx/swh_redirects_oak/tr.d059:trVE.Stichera03.melody	@ltx/swh_ke_oak/tr.d059:trVE.Stichera03.melody
ltx/swh_redirects_oak/tr.d059:trVE.Stichera03.mode	@ltx/swh_ke_oak/tr.d059:trVE.Stichera03.mode
ltx/swh_redirects_oak/tr.d059:trVE.Stichera03.text	@ltx/swh_ke_oak/tr.d059:trVE.Stichera03.text
