ltx/swh_redirects_oak/le.ep.me.m12.d24:lemeH1.Epistle.book_abbr	@ltx/swh_ke_oak/le.ep.me.m12.d24:lemeH1.Epistle.book_abbr
ltx/swh_redirects_oak/le.ep.me.m12.d24:lemeH1.Epistle.book_string	@ltx/swh_ke_oak/le.ep.me.m12.d24:lemeH1.Epistle.book_string
ltx/swh_redirects_oak/le.ep.me.m12.d24:lemeH1.Epistle.chapverse	@ltx/swh_ke_oak/le.ep.me.m12.d24:lemeH1.Epistle.chapverse
ltx/swh_redirects_oak/le.ep.me.m12.d24:lemeH1.Epistle.incipit	@ltx/swh_ke_oak/le.ep.me.m12.d24:lemeH1.Epistle.incipit
ltx/swh_redirects_oak/le.ep.me.m12.d24:lemeH1.Epistle.text	@ltx/swh_ke_oak/le.ep.me.m12.d24:lemeH1.Epistle.text
ltx/swh_redirects_oak/le.ep.me.m12.d24:lemeH1.Epistle.title	@ltx/swh_ke_oak/le.ep.me.m12.d24:lemeH1.Epistle.title
ltx/swh_redirects_oak/le.ep.me.m12.d24:lemeH1.Epistle.title_abbr	@ltx/swh_ke_oak/le.ep.me.m12.d24:lemeH1.Epistle.title_abbr
ltx/swh_redirects_oak/le.ep.me.m12.d24:lemeH1.Epistle.version	@ltx/swh_ke_oak/le.ep.me.m12.d24:lemeH1.Epistle.version
ltx/swh_redirects_oak/le.ep.me.m12.d24:lemeH3.Epistle.book_abbr	@ltx/swh_ke_oak/le.ep.me.m12.d24:lemeH3.Epistle.book_abbr
ltx/swh_redirects_oak/le.ep.me.m12.d24:lemeH3.Epistle.book_string	@ltx/swh_ke_oak/le.ep.me.m12.d24:lemeH3.Epistle.book_string
ltx/swh_redirects_oak/le.ep.me.m12.d24:lemeH3.Epistle.chapverse	@ltx/swh_ke_oak/le.ep.me.m12.d24:lemeH3.Epistle.chapverse
ltx/swh_redirects_oak/le.ep.me.m12.d24:lemeH3.Epistle.incipit	@ltx/swh_ke_oak/le.ep.me.m12.d24:lemeH3.Epistle.incipit
ltx/swh_redirects_oak/le.ep.me.m12.d24:lemeH3.Epistle.text	@ltx/swh_ke_oak/le.ep.me.m12.d24:lemeH3.Epistle.text
ltx/swh_redirects_oak/le.ep.me.m12.d24:lemeH3.Epistle.title	@ltx/swh_ke_oak/le.ep.me.m12.d24:lemeH3.Epistle.title
ltx/swh_redirects_oak/le.ep.me.m12.d24:lemeH3.Epistle.title_abbr	@ltx/swh_ke_oak/le.ep.me.m12.d24:lemeH3.Epistle.title_abbr
ltx/swh_redirects_oak/le.ep.me.m12.d24:lemeH3.Epistle.version	@ltx/swh_ke_oak/le.ep.me.m12.d24:lemeH3.Epistle.version
ltx/swh_redirects_oak/le.ep.me.m12.d24:lemeH6.Epistle.book_abbr	@ltx/swh_ke_oak/le.ep.me.m12.d24:lemeH6.Epistle.book_abbr
ltx/swh_redirects_oak/le.ep.me.m12.d24:lemeH6.Epistle.book_string	@ltx/swh_ke_oak/le.ep.me.m12.d24:lemeH6.Epistle.book_string
ltx/swh_redirects_oak/le.ep.me.m12.d24:lemeH6.Epistle.chapverse	@ltx/swh_ke_oak/le.ep.me.m12.d24:lemeH6.Epistle.chapverse
ltx/swh_redirects_oak/le.ep.me.m12.d24:lemeH6.Epistle.incipit	@ltx/swh_ke_oak/le.ep.me.m12.d24:lemeH6.Epistle.incipit
ltx/swh_redirects_oak/le.ep.me.m12.d24:lemeH6.Epistle.text	@ltx/swh_ke_oak/le.ep.me.m12.d24:lemeH6.Epistle.text
ltx/swh_redirects_oak/le.ep.me.m12.d24:lemeH6.Epistle.title	@ltx/swh_ke_oak/le.ep.me.m12.d24:lemeH6.Epistle.title
ltx/swh_redirects_oak/le.ep.me.m12.d24:lemeH6.Epistle.title_abbr	@ltx/swh_ke_oak/le.ep.me.m12.d24:lemeH6.Epistle.title_abbr
ltx/swh_redirects_oak/le.ep.me.m12.d24:lemeH6.Epistle.version	@ltx/swh_ke_oak/le.ep.me.m12.d24:lemeH6.Epistle.version
ltx/swh_redirects_oak/le.ep.me.m12.d24:lemeH9.Epistle.book_abbr	@ltx/swh_ke_oak/le.ep.me.m12.d24:lemeH9.Epistle.book_abbr
ltx/swh_redirects_oak/le.ep.me.m12.d24:lemeH9.Epistle.book_string	@ltx/swh_ke_oak/le.ep.me.m12.d24:lemeH9.Epistle.book_string
ltx/swh_redirects_oak/le.ep.me.m12.d24:lemeH9.Epistle.chapverse	@ltx/swh_ke_oak/le.ep.me.m12.d24:lemeH9.Epistle.chapverse
ltx/swh_redirects_oak/le.ep.me.m12.d24:lemeH9.Epistle.incipit	@ltx/swh_ke_oak/le.ep.me.m12.d24:lemeH9.Epistle.incipit
ltx/swh_redirects_oak/le.ep.me.m12.d24:lemeH9.Epistle.text	@ltx/swh_ke_oak/le.ep.me.m12.d24:lemeH9.Epistle.text
ltx/swh_redirects_oak/le.ep.me.m12.d24:lemeH9.Epistle.title	@ltx/swh_ke_oak/le.ep.me.m12.d24:lemeH9.Epistle.title
ltx/swh_redirects_oak/le.ep.me.m12.d24:lemeH9.Epistle.title_abbr	@ltx/swh_ke_oak/le.ep.me.m12.d24:lemeH9.Epistle.title_abbr
ltx/swh_redirects_oak/le.ep.me.m12.d24:lemeH9.Epistle.version	@ltx/swh_ke_oak/le.ep.me.m12.d24:lemeH9.Epistle.version
