ltx/swh_redirects_oak/me.m06.d15:meDA.commemoration.first	@ltx/swh_ke_oak/me.m06.d15:meDA.commemoration.first
ltx/swh_redirects_oak/me.m06.d15:meDA.commemoration.first_name	@ltx/swh_ke_oak/me.m06.d15:meDA.commemoration.first_name
ltx/swh_redirects_oak/me.m06.d15:meDA.commemoration.first_short	@ltx/swh_ke_oak/me.m06.d15:meDA.commemoration.first_short
ltx/swh_redirects_oak/me.m06.d15:meDA.commemoration.first_title	@ltx/swh_ke_oak/me.m06.d15:meDA.commemoration.first_title
ltx/swh_redirects_oak/me.m06.d15:meDA.commemoration.full	@ltx/swh_ke_oak/me.m06.d15:meDA.commemoration.full
ltx/swh_redirects_oak/me.m06.d15:meDA.commemoration.second_name	@ltx/swh_ke_oak/me.m06.d15:meDA.commemoration.second_name
ltx/swh_redirects_oak/me.m06.d15:meDA.commemoration.second_title	@ltx/swh_ke_oak/me.m06.d15:meDA.commemoration.second_title
ltx/swh_redirects_oak/me.m06.d15:meDA.date	@ltx/swh_ke_oak/me.m06.d15:meDA.date
ltx/swh_redirects_oak/me.m06.d15:meDA.dismissal	@ltx/swh_ke_oak/me.m06.d15:meDA.dismissal
ltx/swh_redirects_oak/me.m06.d15:meDA.insert1	@ltx/swh_ke_oak/me.m06.d15:meDA.insert1
ltx/swh_redirects_oak/me.m06.d15:meDA.insert2	@ltx/swh_ke_oak/me.m06.d15:meDA.insert2
ltx/swh_redirects_oak/me.m06.d15:meDA.note	@ltx/swh_ke_oak/me.m06.d15:meDA.note
ltx/swh_redirects_oak/me.m06.d15:meHO.commemorations	@ltx/swh_ke_oak/me.m06.d15:meHO.commemorations
ltx/swh_redirects_oak/me.m06.d15:meHO.note1	@ltx/swh_ke_oak/me.m06.d15:meHO.note1
ltx/swh_redirects_oak/me.m06.d15:meHO.note2	@ltx/swh_ke_oak/me.m06.d15:meHO.note2
ltx/swh_redirects_oak/me.m06.d15:meHO.number	@ltx/swh_ke_oak/me.m06.d15:meHO.number
ltx/swh_redirects_oak/me.m06.d15:meHO.rank	@ltx/swh_ke_oak/me.m06.d15:meHO.rank
ltx/swh_redirects_oak/me.m06.d15:meLE.commemoration1	@ltx/swh_ke_oak/me.m06.d15:meLE.commemoration1
ltx/swh_redirects_oak/me.m06.d15:meLE.commemoration2	@ltx/swh_ke_oak/me.m06.d15:meLE.commemoration2
ltx/swh_redirects_oak/me.m06.d15:meLI.Kontakion1.incipit	…
ltx/swh_redirects_oak/me.m06.d15:meLI.Kontakion1.melody	
ltx/swh_redirects_oak/me.m06.d15:meLI.Kontakion1.mode	
ltx/swh_redirects_oak/me.m06.d15:meLI.Kontakion1.text	
ltx/swh_redirects_oak/me.m06.d15:meLI.MM.CommunionHymn.text	@ltx/swh_ke_oak/properties:media.key
ltx/swh_redirects_oak/me.m06.d15:meLI.Megalynarion.text	@ltx/swh_ke_oak/me.m06.d15:meLI.Megalynarion.text
ltx/swh_redirects_oak/me.m06.d15:meMA.C1.acrostic.notice1	@ltx/swh_ke_oak/me.m06.d15:meMA.C1.acrostic.notice1
ltx/swh_redirects_oak/me.m06.d15:meMA.C1.acrostic.text	@ltx/swh_ke_oak/me.m06.d15:meMA.C1.acrostic.text
ltx/swh_redirects_oak/me.m06.d15:meMA.C1.acrostic.title	@ltx/swh_ke_oak/me.m06.d15:meMA.C1.acrostic.title
ltx/swh_redirects_oak/me.m06.d15:meMA.C1.title	@ltx/swh_ke_oak/me.m06.d15:meMA.C1.title
ltx/swh_redirects_oak/me.m06.d15:meMA.C1.verse	@ltx/swh_ke_oak/me.m06.d15:meMA.C1.verse
ltx/swh_redirects_oak/me.m06.d15:meMA.Ode1C11.greekmelody	@ltx/swh_ke_oak/me.m06.d15:meMA.Ode1C11.greekmelody
ltx/swh_redirects_oak/me.m06.d15:meMA.Ode1C11.incipit	@ltx/swh_ke_oak/me.m06.d15:meMA.Ode1C11.incipit
ltx/swh_redirects_oak/me.m06.d15:meMA.Ode1C11.melody	@ltx/swh_ke_oak/me.m06.d15:meMA.Ode1C11.melody
ltx/swh_redirects_oak/me.m06.d15:meMA.Ode1C11.mode	@ltx/swh_ke_oak/me.m06.d15:meMA.Ode1C11.mode
ltx/swh_redirects_oak/me.m06.d15:meMA.Ode1C11.ode	@ltx/swh_ke_oak/me.m06.d15:meMA.Ode1C11.ode
ltx/swh_redirects_oak/me.m06.d15:meMA.Ode1C11.text	@ltx/swh_ke_oak/me.m06.d15:meMA.Ode1C11.text
ltx/swh_redirects_oak/me.m06.d15:meMA.Ode1C12.incipit	@ltx/swh_ke_oak/me.m06.d15:meMA.Ode1C12.incipit
ltx/swh_redirects_oak/me.m06.d15:meMA.Ode1C12.melody	@ltx/swh_ke_oak/me.m06.d15:meMA.Ode1C12.melody
ltx/swh_redirects_oak/me.m06.d15:meMA.Ode1C12.mode	@ltx/swh_ke_oak/me.m06.d15:meMA.Ode1C12.mode
ltx/swh_redirects_oak/me.m06.d15:meMA.Ode1C12.ode	@ltx/swh_ke_oak/me.m06.d15:meMA.Ode1C12.ode
ltx/swh_redirects_oak/me.m06.d15:meMA.Ode1C12.text	@ltx/swh_ke_oak/me.m06.d15:meMA.Ode1C12.text
ltx/swh_redirects_oak/me.m06.d15:meMA.Ode1C13.incipit	@ltx/swh_ke_oak/me.m06.d15:meMA.Ode1C13.incipit
ltx/swh_redirects_oak/me.m06.d15:meMA.Ode1C13.melody	@ltx/swh_ke_oak/me.m06.d15:meMA.Ode1C13.melody
ltx/swh_redirects_oak/me.m06.d15:meMA.Ode1C13.mode	@ltx/swh_ke_oak/me.m06.d15:meMA.Ode1C13.mode
ltx/swh_redirects_oak/me.m06.d15:meMA.Ode1C13.ode	@ltx/swh_ke_oak/me.m06.d15:meMA.Ode1C13.ode
ltx/swh_redirects_oak/me.m06.d15:meMA.Ode1C13.text	@ltx/swh_ke_oak/me.m06.d15:meMA.Ode1C13.text
ltx/swh_redirects_oak/me.m06.d15:meMA.Ode1C1T.incipit	@ltx/swh_ke_oak/me.m06.d15:meMA.Ode1C1T.incipit
ltx/swh_redirects_oak/me.m06.d15:meMA.Ode1C1T.melody	@ltx/swh_ke_oak/me.m06.d15:meMA.Ode1C1T.melody
ltx/swh_redirects_oak/me.m06.d15:meMA.Ode1C1T.mode	@ltx/swh_ke_oak/me.m06.d15:meMA.Ode1C1T.mode
ltx/swh_redirects_oak/me.m06.d15:meMA.Ode1C1T.ode	@ltx/swh_ke_oak/me.m06.d15:meMA.Ode1C1T.ode
ltx/swh_redirects_oak/me.m06.d15:meMA.Ode1C1T.text	@ltx/swh_ke_oak/me.m06.d15:meMA.Ode1C1T.text
ltx/swh_redirects_oak/me.m06.d15:meMA.Ode3C11.greekmelody	@ltx/swh_ke_oak/me.m06.d15:meMA.Ode3C11.greekmelody
ltx/swh_redirects_oak/me.m06.d15:meMA.Ode3C11.incipit	@ltx/swh_ke_oak/me.m06.d15:meMA.Ode3C11.incipit
ltx/swh_redirects_oak/me.m06.d15:meMA.Ode3C11.melody	@ltx/swh_ke_oak/me.m06.d15:meMA.Ode3C11.melody
ltx/swh_redirects_oak/me.m06.d15:meMA.Ode3C11.mode	@ltx/swh_ke_oak/me.m06.d15:meMA.Ode3C11.mode
ltx/swh_redirects_oak/me.m06.d15:meMA.Ode3C11.ode	@ltx/swh_ke_oak/me.m06.d15:meMA.Ode3C11.ode
ltx/swh_redirects_oak/me.m06.d15:meMA.Ode3C11.text	@ltx/swh_ke_oak/me.m06.d15:meMA.Ode3C11.text
ltx/swh_redirects_oak/me.m06.d15:meMA.Ode3C12.incipit	@ltx/swh_ke_oak/me.m06.d15:meMA.Ode3C12.incipit
ltx/swh_redirects_oak/me.m06.d15:meMA.Ode3C12.melody	@ltx/swh_ke_oak/me.m06.d15:meMA.Ode3C12.melody
ltx/swh_redirects_oak/me.m06.d15:meMA.Ode3C12.mode	@ltx/swh_ke_oak/me.m06.d15:meMA.Ode3C12.mode
ltx/swh_redirects_oak/me.m06.d15:meMA.Ode3C12.ode	@ltx/swh_ke_oak/me.m06.d15:meMA.Ode3C12.ode
ltx/swh_redirects_oak/me.m06.d15:meMA.Ode3C12.text	@ltx/swh_ke_oak/me.m06.d15:meMA.Ode3C12.text
ltx/swh_redirects_oak/me.m06.d15:meMA.Ode3C13.incipit	@ltx/swh_ke_oak/me.m06.d15:meMA.Ode3C13.incipit
ltx/swh_redirects_oak/me.m06.d15:meMA.Ode3C13.melody	@ltx/swh_ke_oak/me.m06.d15:meMA.Ode3C13.melody
ltx/swh_redirects_oak/me.m06.d15:meMA.Ode3C13.mode	@ltx/swh_ke_oak/me.m06.d15:meMA.Ode3C13.mode
ltx/swh_redirects_oak/me.m06.d15:meMA.Ode3C13.ode	@ltx/swh_ke_oak/me.m06.d15:meMA.Ode3C13.ode
ltx/swh_redirects_oak/me.m06.d15:meMA.Ode3C13.text	@ltx/swh_ke_oak/me.m06.d15:meMA.Ode3C13.text
ltx/swh_redirects_oak/me.m06.d15:meMA.Ode3C1T.incipit	@ltx/swh_ke_oak/me.m06.d15:meMA.Ode3C1T.incipit
ltx/swh_redirects_oak/me.m06.d15:meMA.Ode3C1T.melody	@ltx/swh_ke_oak/me.m06.d15:meMA.Ode3C1T.melody
ltx/swh_redirects_oak/me.m06.d15:meMA.Ode3C1T.mode	@ltx/swh_ke_oak/me.m06.d15:meMA.Ode3C1T.mode
ltx/swh_redirects_oak/me.m06.d15:meMA.Ode3C1T.ode	@ltx/swh_ke_oak/me.m06.d15:meMA.Ode3C1T.ode
ltx/swh_redirects_oak/me.m06.d15:meMA.Ode3C1T.text	@ltx/swh_ke_oak/me.m06.d15:meMA.Ode3C1T.text
ltx/swh_redirects_oak/me.m06.d15:meMA.Ode3H.greekmelody	@ltx/swh_ke_oak/me.m06.d15:meMA.Ode3H.greekmelody
ltx/swh_redirects_oak/me.m06.d15:meMA.Ode3H.incipit	@ltx/swh_ke_oak/me.m06.d15:meMA.Ode3H.incipit
ltx/swh_redirects_oak/me.m06.d15:meMA.Ode3H.melody	@ltx/swh_ke_oak/me.m06.d15:meMA.Ode3H.melody
ltx/swh_redirects_oak/me.m06.d15:meMA.Ode3H.mode	@ltx/swh_ke_oak/me.m06.d15:meMA.Ode3H.mode
ltx/swh_redirects_oak/me.m06.d15:meMA.Ode3H.ode	@ltx/swh_ke_oak/me.m06.d15:meMA.Ode3H.ode
ltx/swh_redirects_oak/me.m06.d15:meMA.Ode3H.text	@ltx/swh_ke_oak/me.m06.d15:meMA.Ode3H.text
ltx/swh_redirects_oak/me.m06.d15:meMA.Ode3Kathisma1.greekmelody	@ltx/swh_ke_oak/me.m06.d15:meMA.Ode3Kathisma1.greekmelody
ltx/swh_redirects_oak/me.m06.d15:meMA.Ode3Kathisma1.incipit	@ltx/swh_ke_oak/me.m06.d15:meMA.Ode3Kathisma1.incipit
ltx/swh_redirects_oak/me.m06.d15:meMA.Ode3Kathisma1.melody	@ltx/swh_ke_oak/me.m06.d15:meMA.Ode3Kathisma1.melody
ltx/swh_redirects_oak/me.m06.d15:meMA.Ode3Kathisma1.mode	@ltx/swh_ke_oak/me.m06.d15:meMA.Ode3Kathisma1.mode
ltx/swh_redirects_oak/me.m06.d15:meMA.Ode3Kathisma1.text	@ltx/swh_ke_oak/me.m06.d15:meMA.Ode3Kathisma1.text
ltx/swh_redirects_oak/me.m06.d15:meMA.Ode3KathismaSt.incipit	@ltx/swh_ke_oak/me.m06.d15:meMA.Ode3KathismaSt.incipit
ltx/swh_redirects_oak/me.m06.d15:meMA.Ode3KathismaSt.melody	@ltx/swh_ke_oak/me.m06.d15:meMA.Ode3KathismaSt.melody
ltx/swh_redirects_oak/me.m06.d15:meMA.Ode3KathismaSt.mode	@ltx/swh_ke_oak/me.m06.d15:meMA.Ode3KathismaSt.mode
ltx/swh_redirects_oak/me.m06.d15:meMA.Ode3KathismaSt.text	@ltx/swh_ke_oak/me.m06.d15:meMA.Ode3KathismaSt.text
ltx/swh_redirects_oak/me.m06.d15:meMA.Ode3KathismaT.incipit	@ltx/swh_ke_oak/me.m06.d15:meMA.Ode3KathismaT.incipit
ltx/swh_redirects_oak/me.m06.d15:meMA.Ode3KathismaT.melody	@ltx/swh_ke_oak/me.m06.d15:meMA.Ode3KathismaT.melody
ltx/swh_redirects_oak/me.m06.d15:meMA.Ode3KathismaT.mode	@ltx/swh_ke_oak/me.m06.d15:meMA.Ode3KathismaT.mode
ltx/swh_redirects_oak/me.m06.d15:meMA.Ode3KathismaT.text	@ltx/swh_ke_oak/me.m06.d15:meMA.Ode3KathismaT.text
ltx/swh_redirects_oak/me.m06.d15:meMA.Ode4C11.greekmelody	@ltx/swh_ke_oak/me.m06.d15:meMA.Ode4C11.greekmelody
ltx/swh_redirects_oak/me.m06.d15:meMA.Ode4C11.incipit	@ltx/swh_ke_oak/me.m06.d15:meMA.Ode4C11.incipit
ltx/swh_redirects_oak/me.m06.d15:meMA.Ode4C11.melody	@ltx/swh_ke_oak/me.m06.d15:meMA.Ode4C11.melody
ltx/swh_redirects_oak/me.m06.d15:meMA.Ode4C11.mode	@ltx/swh_ke_oak/me.m06.d15:meMA.Ode4C11.mode
ltx/swh_redirects_oak/me.m06.d15:meMA.Ode4C11.ode	@ltx/swh_ke_oak/me.m06.d15:meMA.Ode4C11.ode
ltx/swh_redirects_oak/me.m06.d15:meMA.Ode4C11.text	@ltx/swh_ke_oak/me.m06.d15:meMA.Ode4C11.text
ltx/swh_redirects_oak/me.m06.d15:meMA.Ode4C12.incipit	@ltx/swh_ke_oak/me.m06.d15:meMA.Ode4C12.incipit
ltx/swh_redirects_oak/me.m06.d15:meMA.Ode4C12.melody	@ltx/swh_ke_oak/me.m06.d15:meMA.Ode4C12.melody
ltx/swh_redirects_oak/me.m06.d15:meMA.Ode4C12.mode	@ltx/swh_ke_oak/me.m06.d15:meMA.Ode4C12.mode
ltx/swh_redirects_oak/me.m06.d15:meMA.Ode4C12.ode	@ltx/swh_ke_oak/me.m06.d15:meMA.Ode4C12.ode
ltx/swh_redirects_oak/me.m06.d15:meMA.Ode4C12.text	@ltx/swh_ke_oak/me.m06.d15:meMA.Ode4C12.text
ltx/swh_redirects_oak/me.m06.d15:meMA.Ode4C13.incipit	@ltx/swh_ke_oak/me.m06.d15:meMA.Ode4C13.incipit
ltx/swh_redirects_oak/me.m06.d15:meMA.Ode4C13.melody	@ltx/swh_ke_oak/me.m06.d15:meMA.Ode4C13.melody
ltx/swh_redirects_oak/me.m06.d15:meMA.Ode4C13.mode	@ltx/swh_ke_oak/me.m06.d15:meMA.Ode4C13.mode
ltx/swh_redirects_oak/me.m06.d15:meMA.Ode4C13.ode	@ltx/swh_ke_oak/me.m06.d15:meMA.Ode4C13.ode
ltx/swh_redirects_oak/me.m06.d15:meMA.Ode4C13.text	@ltx/swh_ke_oak/me.m06.d15:meMA.Ode4C13.text
ltx/swh_redirects_oak/me.m06.d15:meMA.Ode4C14.incipit	@ltx/swh_ke_oak/me.m06.d15:meMA.Ode4C14.incipit
ltx/swh_redirects_oak/me.m06.d15:meMA.Ode4C14.melody	@ltx/swh_ke_oak/me.m06.d15:meMA.Ode4C14.melody
ltx/swh_redirects_oak/me.m06.d15:meMA.Ode4C14.mode	@ltx/swh_ke_oak/me.m06.d15:meMA.Ode4C14.mode
ltx/swh_redirects_oak/me.m06.d15:meMA.Ode4C14.ode	@ltx/swh_ke_oak/me.m06.d15:meMA.Ode4C14.ode
ltx/swh_redirects_oak/me.m06.d15:meMA.Ode4C14.text	@ltx/swh_ke_oak/me.m06.d15:meMA.Ode4C14.text
ltx/swh_redirects_oak/me.m06.d15:meMA.Ode4C1T.incipit	@ltx/swh_ke_oak/me.m06.d15:meMA.Ode4C1T.incipit
ltx/swh_redirects_oak/me.m06.d15:meMA.Ode4C1T.melody	@ltx/swh_ke_oak/me.m06.d15:meMA.Ode4C1T.melody
ltx/swh_redirects_oak/me.m06.d15:meMA.Ode4C1T.mode	@ltx/swh_ke_oak/me.m06.d15:meMA.Ode4C1T.mode
ltx/swh_redirects_oak/me.m06.d15:meMA.Ode4C1T.ode	@ltx/swh_ke_oak/me.m06.d15:meMA.Ode4C1T.ode
ltx/swh_redirects_oak/me.m06.d15:meMA.Ode4C1T.text	@ltx/swh_ke_oak/me.m06.d15:meMA.Ode4C1T.text
ltx/swh_redirects_oak/me.m06.d15:meMA.Ode5C11.greekmelody	@ltx/swh_ke_oak/me.m06.d15:meMA.Ode5C11.greekmelody
ltx/swh_redirects_oak/me.m06.d15:meMA.Ode5C11.incipit	@ltx/swh_ke_oak/me.m06.d15:meMA.Ode5C11.incipit
ltx/swh_redirects_oak/me.m06.d15:meMA.Ode5C11.melody	@ltx/swh_ke_oak/me.m06.d15:meMA.Ode5C11.melody
ltx/swh_redirects_oak/me.m06.d15:meMA.Ode5C11.mode	@ltx/swh_ke_oak/me.m06.d15:meMA.Ode5C11.mode
ltx/swh_redirects_oak/me.m06.d15:meMA.Ode5C11.ode	@ltx/swh_ke_oak/me.m06.d15:meMA.Ode5C11.ode
ltx/swh_redirects_oak/me.m06.d15:meMA.Ode5C11.text	@ltx/swh_ke_oak/me.m06.d15:meMA.Ode5C11.text
ltx/swh_redirects_oak/me.m06.d15:meMA.Ode5C12.incipit	@ltx/swh_ke_oak/me.m06.d15:meMA.Ode5C12.incipit
ltx/swh_redirects_oak/me.m06.d15:meMA.Ode5C12.melody	@ltx/swh_ke_oak/me.m06.d15:meMA.Ode5C12.melody
ltx/swh_redirects_oak/me.m06.d15:meMA.Ode5C12.mode	@ltx/swh_ke_oak/me.m06.d15:meMA.Ode5C12.mode
ltx/swh_redirects_oak/me.m06.d15:meMA.Ode5C12.ode	@ltx/swh_ke_oak/me.m06.d15:meMA.Ode5C12.ode
ltx/swh_redirects_oak/me.m06.d15:meMA.Ode5C12.text	@ltx/swh_ke_oak/me.m06.d15:meMA.Ode5C12.text
ltx/swh_redirects_oak/me.m06.d15:meMA.Ode5C13.incipit	@ltx/swh_ke_oak/me.m06.d15:meMA.Ode5C13.incipit
ltx/swh_redirects_oak/me.m06.d15:meMA.Ode5C13.melody	@ltx/swh_ke_oak/me.m06.d15:meMA.Ode5C13.melody
ltx/swh_redirects_oak/me.m06.d15:meMA.Ode5C13.mode	@ltx/swh_ke_oak/me.m06.d15:meMA.Ode5C13.mode
ltx/swh_redirects_oak/me.m06.d15:meMA.Ode5C13.ode	@ltx/swh_ke_oak/me.m06.d15:meMA.Ode5C13.ode
ltx/swh_redirects_oak/me.m06.d15:meMA.Ode5C13.text	@ltx/swh_ke_oak/me.m06.d15:meMA.Ode5C13.text
ltx/swh_redirects_oak/me.m06.d15:meMA.Ode5C1T.incipit	@ltx/swh_ke_oak/me.m06.d15:meMA.Ode5C1T.incipit
ltx/swh_redirects_oak/me.m06.d15:meMA.Ode5C1T.melody	@ltx/swh_ke_oak/me.m06.d15:meMA.Ode5C1T.melody
ltx/swh_redirects_oak/me.m06.d15:meMA.Ode5C1T.mode	@ltx/swh_ke_oak/me.m06.d15:meMA.Ode5C1T.mode
ltx/swh_redirects_oak/me.m06.d15:meMA.Ode5C1T.ode	@ltx/swh_ke_oak/me.m06.d15:meMA.Ode5C1T.ode
ltx/swh_redirects_oak/me.m06.d15:meMA.Ode5C1T.text	@ltx/swh_ke_oak/me.m06.d15:meMA.Ode5C1T.text
ltx/swh_redirects_oak/me.m06.d15:meMA.Ode6C11.greekmelody	@ltx/swh_ke_oak/me.m06.d15:meMA.Ode6C11.greekmelody
ltx/swh_redirects_oak/me.m06.d15:meMA.Ode6C11.incipit	@ltx/swh_ke_oak/me.m06.d15:meMA.Ode6C11.incipit
ltx/swh_redirects_oak/me.m06.d15:meMA.Ode6C11.melody	@ltx/swh_ke_oak/me.m06.d15:meMA.Ode6C11.melody
ltx/swh_redirects_oak/me.m06.d15:meMA.Ode6C11.mode	@ltx/swh_ke_oak/me.m06.d15:meMA.Ode6C11.mode
ltx/swh_redirects_oak/me.m06.d15:meMA.Ode6C11.ode	@ltx/swh_ke_oak/me.m06.d15:meMA.Ode6C11.ode
ltx/swh_redirects_oak/me.m06.d15:meMA.Ode6C11.text	@ltx/swh_ke_oak/me.m06.d15:meMA.Ode6C11.text
ltx/swh_redirects_oak/me.m06.d15:meMA.Ode6C12.incipit	@ltx/swh_ke_oak/me.m06.d15:meMA.Ode6C12.incipit
ltx/swh_redirects_oak/me.m06.d15:meMA.Ode6C12.melody	@ltx/swh_ke_oak/me.m06.d15:meMA.Ode6C12.melody
ltx/swh_redirects_oak/me.m06.d15:meMA.Ode6C12.mode	@ltx/swh_ke_oak/me.m06.d15:meMA.Ode6C12.mode
ltx/swh_redirects_oak/me.m06.d15:meMA.Ode6C12.ode	@ltx/swh_ke_oak/me.m06.d15:meMA.Ode6C12.ode
ltx/swh_redirects_oak/me.m06.d15:meMA.Ode6C12.text	@ltx/swh_ke_oak/me.m06.d15:meMA.Ode6C12.text
ltx/swh_redirects_oak/me.m06.d15:meMA.Ode6C1T.incipit	@ltx/swh_ke_oak/me.m06.d15:meMA.Ode6C1T.incipit
ltx/swh_redirects_oak/me.m06.d15:meMA.Ode6C1T.melody	@ltx/swh_ke_oak/me.m06.d15:meMA.Ode6C1T.melody
ltx/swh_redirects_oak/me.m06.d15:meMA.Ode6C1T.mode	@ltx/swh_ke_oak/me.m06.d15:meMA.Ode6C1T.mode
ltx/swh_redirects_oak/me.m06.d15:meMA.Ode6C1T.ode	@ltx/swh_ke_oak/me.m06.d15:meMA.Ode6C1T.ode
ltx/swh_redirects_oak/me.m06.d15:meMA.Ode6C1T.text	@ltx/swh_ke_oak/me.m06.d15:meMA.Ode6C1T.text
ltx/swh_redirects_oak/me.m06.d15:meMA.Ode6H.greekmelody	@ltx/swh_ke_oak/me.m06.d15:meMA.Ode6H.greekmelody
ltx/swh_redirects_oak/me.m06.d15:meMA.Ode6H.incipit	@ltx/swh_ke_oak/me.m06.d15:meMA.Ode6H.incipit
ltx/swh_redirects_oak/me.m06.d15:meMA.Ode6H.melody	@ltx/swh_ke_oak/me.m06.d15:meMA.Ode6H.melody
ltx/swh_redirects_oak/me.m06.d15:meMA.Ode6H.mode	@ltx/swh_ke_oak/me.m06.d15:meMA.Ode6H.mode
ltx/swh_redirects_oak/me.m06.d15:meMA.Ode6H.ode	@ltx/swh_ke_oak/me.m06.d15:meMA.Ode6H.ode
ltx/swh_redirects_oak/me.m06.d15:meMA.Ode6H.text	@ltx/swh_ke_oak/me.m06.d15:meMA.Ode6H.text
ltx/swh_redirects_oak/me.m06.d15:meMA.Ode7C11.greekmelody	@ltx/swh_ke_oak/me.m06.d15:meMA.Ode7C11.greekmelody
ltx/swh_redirects_oak/me.m06.d15:meMA.Ode7C11.incipit	@ltx/swh_ke_oak/me.m06.d15:meMA.Ode7C11.incipit
ltx/swh_redirects_oak/me.m06.d15:meMA.Ode7C11.melody	@ltx/swh_ke_oak/me.m06.d15:meMA.Ode7C11.melody
ltx/swh_redirects_oak/me.m06.d15:meMA.Ode7C11.mode	@ltx/swh_ke_oak/me.m06.d15:meMA.Ode7C11.mode
ltx/swh_redirects_oak/me.m06.d15:meMA.Ode7C11.ode	@ltx/swh_ke_oak/me.m06.d15:meMA.Ode7C11.ode
ltx/swh_redirects_oak/me.m06.d15:meMA.Ode7C11.text	@ltx/swh_ke_oak/me.m06.d15:meMA.Ode7C11.text
ltx/swh_redirects_oak/me.m06.d15:meMA.Ode7C12.incipit	@ltx/swh_ke_oak/me.m06.d15:meMA.Ode7C12.incipit
ltx/swh_redirects_oak/me.m06.d15:meMA.Ode7C12.melody	@ltx/swh_ke_oak/me.m06.d15:meMA.Ode7C12.melody
ltx/swh_redirects_oak/me.m06.d15:meMA.Ode7C12.mode	@ltx/swh_ke_oak/me.m06.d15:meMA.Ode7C12.mode
ltx/swh_redirects_oak/me.m06.d15:meMA.Ode7C12.ode	@ltx/swh_ke_oak/me.m06.d15:meMA.Ode7C12.ode
ltx/swh_redirects_oak/me.m06.d15:meMA.Ode7C12.text	@ltx/swh_ke_oak/me.m06.d15:meMA.Ode7C12.text
ltx/swh_redirects_oak/me.m06.d15:meMA.Ode7C1T.incipit	@ltx/swh_ke_oak/me.m06.d15:meMA.Ode7C1T.incipit
ltx/swh_redirects_oak/me.m06.d15:meMA.Ode7C1T.melody	@ltx/swh_ke_oak/me.m06.d15:meMA.Ode7C1T.melody
ltx/swh_redirects_oak/me.m06.d15:meMA.Ode7C1T.mode	@ltx/swh_ke_oak/me.m06.d15:meMA.Ode7C1T.mode
ltx/swh_redirects_oak/me.m06.d15:meMA.Ode7C1T.ode	@ltx/swh_ke_oak/me.m06.d15:meMA.Ode7C1T.ode
ltx/swh_redirects_oak/me.m06.d15:meMA.Ode7C1T.text	@ltx/swh_ke_oak/me.m06.d15:meMA.Ode7C1T.text
ltx/swh_redirects_oak/me.m06.d15:meMA.Ode8C11.greekmelody	@ltx/swh_ke_oak/me.m06.d15:meMA.Ode8C11.greekmelody
ltx/swh_redirects_oak/me.m06.d15:meMA.Ode8C11.incipit	@ltx/swh_ke_oak/me.m06.d15:meMA.Ode8C11.incipit
ltx/swh_redirects_oak/me.m06.d15:meMA.Ode8C11.melody	@ltx/swh_ke_oak/me.m06.d15:meMA.Ode8C11.melody
ltx/swh_redirects_oak/me.m06.d15:meMA.Ode8C11.mode	@ltx/swh_ke_oak/me.m06.d15:meMA.Ode8C11.mode
ltx/swh_redirects_oak/me.m06.d15:meMA.Ode8C11.ode	@ltx/swh_ke_oak/me.m06.d15:meMA.Ode8C11.ode
ltx/swh_redirects_oak/me.m06.d15:meMA.Ode8C11.text	@ltx/swh_ke_oak/me.m06.d15:meMA.Ode8C11.text
ltx/swh_redirects_oak/me.m06.d15:meMA.Ode8C12.incipit	@ltx/swh_ke_oak/me.m06.d15:meMA.Ode8C12.incipit
ltx/swh_redirects_oak/me.m06.d15:meMA.Ode8C12.melody	@ltx/swh_ke_oak/me.m06.d15:meMA.Ode8C12.melody
ltx/swh_redirects_oak/me.m06.d15:meMA.Ode8C12.mode	@ltx/swh_ke_oak/me.m06.d15:meMA.Ode8C12.mode
ltx/swh_redirects_oak/me.m06.d15:meMA.Ode8C12.ode	@ltx/swh_ke_oak/me.m06.d15:meMA.Ode8C12.ode
ltx/swh_redirects_oak/me.m06.d15:meMA.Ode8C12.text	@ltx/swh_ke_oak/me.m06.d15:meMA.Ode8C12.text
ltx/swh_redirects_oak/me.m06.d15:meMA.Ode8C13.incipit	@ltx/swh_ke_oak/me.m06.d15:meMA.Ode8C13.incipit
ltx/swh_redirects_oak/me.m06.d15:meMA.Ode8C13.melody	@ltx/swh_ke_oak/me.m06.d15:meMA.Ode8C13.melody
ltx/swh_redirects_oak/me.m06.d15:meMA.Ode8C13.mode	@ltx/swh_ke_oak/me.m06.d15:meMA.Ode8C13.mode
ltx/swh_redirects_oak/me.m06.d15:meMA.Ode8C13.ode	@ltx/swh_ke_oak/me.m06.d15:meMA.Ode8C13.ode
ltx/swh_redirects_oak/me.m06.d15:meMA.Ode8C13.text	@ltx/swh_ke_oak/me.m06.d15:meMA.Ode8C13.text
ltx/swh_redirects_oak/me.m06.d15:meMA.Ode8C1T.incipit	@ltx/swh_ke_oak/me.m06.d15:meMA.Ode8C1T.incipit
ltx/swh_redirects_oak/me.m06.d15:meMA.Ode8C1T.melody	@ltx/swh_ke_oak/me.m06.d15:meMA.Ode8C1T.melody
ltx/swh_redirects_oak/me.m06.d15:meMA.Ode8C1T.mode	@ltx/swh_ke_oak/me.m06.d15:meMA.Ode8C1T.mode
ltx/swh_redirects_oak/me.m06.d15:meMA.Ode8C1T.ode	@ltx/swh_ke_oak/me.m06.d15:meMA.Ode8C1T.ode
ltx/swh_redirects_oak/me.m06.d15:meMA.Ode8C1T.text	@ltx/swh_ke_oak/me.m06.d15:meMA.Ode8C1T.text
ltx/swh_redirects_oak/me.m06.d15:meMA.Ode8H.greekmelody	@ltx/swh_ke_oak/me.m06.d15:meMA.Ode8H.greekmelody
ltx/swh_redirects_oak/me.m06.d15:meMA.Ode8H.incipit	@ltx/swh_ke_oak/me.m06.d15:meMA.Ode8H.incipit
ltx/swh_redirects_oak/me.m06.d15:meMA.Ode8H.melody	@ltx/swh_ke_oak/me.m06.d15:meMA.Ode8H.melody
ltx/swh_redirects_oak/me.m06.d15:meMA.Ode8H.mode	@ltx/swh_ke_oak/me.m06.d15:meMA.Ode8H.mode
ltx/swh_redirects_oak/me.m06.d15:meMA.Ode8H.ode	@ltx/swh_ke_oak/me.m06.d15:meMA.Ode8H.ode
ltx/swh_redirects_oak/me.m06.d15:meMA.Ode8H.text	@ltx/swh_ke_oak/me.m06.d15:meMA.Ode8H.text
ltx/swh_redirects_oak/me.m06.d15:meMA.Ode9C11.greekmelody	@ltx/swh_ke_oak/me.m06.d15:meMA.Ode9C11.greekmelody
ltx/swh_redirects_oak/me.m06.d15:meMA.Ode9C11.incipit	@ltx/swh_ke_oak/me.m06.d15:meMA.Ode9C11.incipit
ltx/swh_redirects_oak/me.m06.d15:meMA.Ode9C11.melody	@ltx/swh_ke_oak/me.m06.d15:meMA.Ode9C11.melody
ltx/swh_redirects_oak/me.m06.d15:meMA.Ode9C11.mode	@ltx/swh_ke_oak/me.m06.d15:meMA.Ode9C11.mode
ltx/swh_redirects_oak/me.m06.d15:meMA.Ode9C11.ode	@ltx/swh_ke_oak/me.m06.d15:meMA.Ode9C11.ode
ltx/swh_redirects_oak/me.m06.d15:meMA.Ode9C11.text	@ltx/swh_ke_oak/me.m06.d15:meMA.Ode9C11.text
ltx/swh_redirects_oak/me.m06.d15:meMA.Ode9C12.incipit	@ltx/swh_ke_oak/me.m06.d15:meMA.Ode9C12.incipit
ltx/swh_redirects_oak/me.m06.d15:meMA.Ode9C12.melody	@ltx/swh_ke_oak/me.m06.d15:meMA.Ode9C12.melody
ltx/swh_redirects_oak/me.m06.d15:meMA.Ode9C12.mode	@ltx/swh_ke_oak/me.m06.d15:meMA.Ode9C12.mode
ltx/swh_redirects_oak/me.m06.d15:meMA.Ode9C12.ode	@ltx/swh_ke_oak/me.m06.d15:meMA.Ode9C12.ode
ltx/swh_redirects_oak/me.m06.d15:meMA.Ode9C12.text	@ltx/swh_ke_oak/me.m06.d15:meMA.Ode9C12.text
ltx/swh_redirects_oak/me.m06.d15:meMA.Ode9C1T.incipit	@ltx/swh_ke_oak/me.m06.d15:meMA.Ode9C1T.incipit
ltx/swh_redirects_oak/me.m06.d15:meMA.Ode9C1T.melody	@ltx/swh_ke_oak/me.m06.d15:meMA.Ode9C1T.melody
ltx/swh_redirects_oak/me.m06.d15:meMA.Ode9C1T.mode	@ltx/swh_ke_oak/me.m06.d15:meMA.Ode9C1T.mode
ltx/swh_redirects_oak/me.m06.d15:meMA.Ode9C1T.ode	@ltx/swh_ke_oak/me.m06.d15:meMA.Ode9C1T.ode
ltx/swh_redirects_oak/me.m06.d15:meMA.Ode9C1T.text	@ltx/swh_ke_oak/me.m06.d15:meMA.Ode9C1T.text
ltx/swh_redirects_oak/me.m06.d15:meMA.Ode9H.greekmelody	@ltx/swh_ke_oak/me.m06.d15:meMA.Ode9H.greekmelody
ltx/swh_redirects_oak/me.m06.d15:meMA.Ode9H.incipit	@ltx/swh_ke_oak/me.m06.d15:meMA.Ode9H.incipit
ltx/swh_redirects_oak/me.m06.d15:meMA.Ode9H.melody	@ltx/swh_ke_oak/me.m06.d15:meMA.Ode9H.melody
ltx/swh_redirects_oak/me.m06.d15:meMA.Ode9H.mode	@ltx/swh_ke_oak/me.m06.d15:meMA.Ode9H.mode
ltx/swh_redirects_oak/me.m06.d15:meMA.Ode9H.ode	@ltx/swh_ke_oak/me.m06.d15:meMA.Ode9H.ode
ltx/swh_redirects_oak/me.m06.d15:meMA.Ode9H.text	@ltx/swh_ke_oak/me.m06.d15:meMA.Ode9H.text
ltx/swh_redirects_oak/me.m06.d15:meVE.Apolytikion1ger.greekmelody	@ltx/swh_ke_oak/me.m06.d15:meVE.Apolytikion1ger.greekmelody
ltx/swh_redirects_oak/me.m06.d15:meVE.Apolytikion1ger.incipit	@ltx/swh_ke_oak/me.m06.d15:meVE.Apolytikion1ger.incipit
ltx/swh_redirects_oak/me.m06.d15:meVE.Apolytikion1ger.melody	@ltx/swh_ke_oak/me.m06.d15:meVE.Apolytikion1ger.melody
ltx/swh_redirects_oak/me.m06.d15:meVE.Apolytikion1ger.mode	@ltx/swh_ke_oak/me.m06.d15:meVE.Apolytikion1ger.mode
ltx/swh_redirects_oak/me.m06.d15:meVE.Apolytikion1ger.poet	@ltx/swh_ke_oak/me.m06.d15:meVE.Apolytikion1ger.poet
ltx/swh_redirects_oak/me.m06.d15:meVE.Apolytikion1ger.text	@ltx/swh_ke_oak/me.m06.d15:meVE.Apolytikion1ger.text
ltx/swh_redirects_oak/me.m06.d15:meVE.SticStavrotheotokion.greekmelody	@ltx/swh_ke_oak/me.m06.d15:meVE.SticStavrotheotokion.greekmelody
ltx/swh_redirects_oak/me.m06.d15:meVE.SticStavrotheotokion.incipit	@ltx/swh_ke_oak/me.m06.d15:meVE.SticStavrotheotokion.incipit
ltx/swh_redirects_oak/me.m06.d15:meVE.SticStavrotheotokion.melody	@ltx/swh_ke_oak/me.m06.d15:meVE.SticStavrotheotokion.melody
ltx/swh_redirects_oak/me.m06.d15:meVE.SticStavrotheotokion.mode	@ltx/swh_ke_oak/me.m06.d15:meVE.SticStavrotheotokion.mode
ltx/swh_redirects_oak/me.m06.d15:meVE.SticStavrotheotokion.text	@ltx/swh_ke_oak/me.m06.d15:meVE.SticStavrotheotokion.text
ltx/swh_redirects_oak/me.m06.d15:meVE.SticTheotokion.greekmelody	@ltx/swh_ke_oak/me.m06.d15:meVE.SticTheotokion.greekmelody
ltx/swh_redirects_oak/me.m06.d15:meVE.SticTheotokion.incipit	@ltx/swh_ke_oak/me.m06.d15:meVE.SticTheotokion.incipit
ltx/swh_redirects_oak/me.m06.d15:meVE.SticTheotokion.melody	@ltx/swh_ke_oak/me.m06.d15:meVE.SticTheotokion.melody
ltx/swh_redirects_oak/me.m06.d15:meVE.SticTheotokion.mode	@ltx/swh_ke_oak/me.m06.d15:meVE.SticTheotokion.mode
ltx/swh_redirects_oak/me.m06.d15:meVE.SticTheotokion.text	@ltx/swh_ke_oak/me.m06.d15:meVE.SticTheotokion.text
ltx/swh_redirects_oak/me.m06.d15:meVE.Stichera01.greekmelody	@ltx/swh_ke_oak/me.m06.d15:meVE.Stichera01.greekmelody
ltx/swh_redirects_oak/me.m06.d15:meVE.Stichera01.incipit	@ltx/swh_ke_oak/me.m06.d15:meVE.Stichera01.incipit
ltx/swh_redirects_oak/me.m06.d15:meVE.Stichera01.melody	@ltx/swh_ke_oak/me.m06.d15:meVE.Stichera01.melody
ltx/swh_redirects_oak/me.m06.d15:meVE.Stichera01.mode	@ltx/swh_ke_oak/me.m06.d15:meVE.Stichera01.mode
ltx/swh_redirects_oak/me.m06.d15:meVE.Stichera01.text	@ltx/swh_ke_oak/me.m06.d15:meVE.Stichera01.text
ltx/swh_redirects_oak/me.m06.d15:meVE.Stichera02.incipit	@ltx/swh_ke_oak/me.m06.d15:meVE.Stichera02.incipit
ltx/swh_redirects_oak/me.m06.d15:meVE.Stichera02.melody	@ltx/swh_ke_oak/me.m06.d15:meVE.Stichera02.melody
ltx/swh_redirects_oak/me.m06.d15:meVE.Stichera02.mode	@ltx/swh_ke_oak/me.m06.d15:meVE.Stichera02.mode
ltx/swh_redirects_oak/me.m06.d15:meVE.Stichera02.text	@ltx/swh_ke_oak/me.m06.d15:meVE.Stichera02.text
ltx/swh_redirects_oak/me.m06.d15:meVE.Stichera03.incipit	@ltx/swh_ke_oak/me.m06.d15:meVE.Stichera03.incipit
ltx/swh_redirects_oak/me.m06.d15:meVE.Stichera03.melody	@ltx/swh_ke_oak/me.m06.d15:meVE.Stichera03.melody
ltx/swh_redirects_oak/me.m06.d15:meVE.Stichera03.mode	@ltx/swh_ke_oak/me.m06.d15:meVE.Stichera03.mode
ltx/swh_redirects_oak/me.m06.d15:meVE.Stichera03.text	@ltx/swh_ke_oak/me.m06.d15:meVE.Stichera03.text
