ltx/swh_redirects_oak/pe.d085:peDA.commemoration.full	@ltx/swh_ke_oak/pe.d085:peDA.commemoration.full
ltx/swh_redirects_oak/pe.d085:peDA.commemoration.short	@ltx/swh_ke_oak/pe.d085:peDA.commemoration.short
ltx/swh_redirects_oak/pe.d085:peDA.dismissal	@ltx/swh_ke_oak/pe.d085:peDA.dismissal
ltx/swh_redirects_oak/pe.d085:peDA.insert1	@ltx/swh_ke_oak/pe.d085:peDA.insert1
ltx/swh_redirects_oak/pe.d085:peDA.insert2	@ltx/swh_ke_oak/pe.d085:peDA.insert2
ltx/swh_redirects_oak/pe.d085:peDA.note	@ltx/swh_ke_oak/pe.d085:peDA.note
ltx/swh_redirects_oak/pe.d085:peHO.commemorations	@ltx/swh_ke_oak/pe.d085:peHO.commemorations
ltx/swh_redirects_oak/pe.d085:peHO.daytitle	@ltx/swh_ke_oak/pe.d085:peHO.daytitle
ltx/swh_redirects_oak/pe.d085:peHO.description1	@ltx/swh_ke_oak/pe.d085:peHO.description1
ltx/swh_redirects_oak/pe.d085:peHO.description2	@ltx/swh_ke_oak/pe.d085:peHO.description2
ltx/swh_redirects_oak/pe.d085:peHO.note1	@ltx/swh_ke_oak/pe.d085:peHO.note1
ltx/swh_redirects_oak/pe.d085:peHO.note2	@ltx/swh_ke_oak/pe.d085:peHO.note2
ltx/swh_redirects_oak/pe.d085:peLI.Kontakion1.incipit	@ltx/swh_ke_oak/pe.d085:peLI.Kontakion1.incipit
ltx/swh_redirects_oak/pe.d085:peLI.Kontakion1.melody	@ltx/swh_ke_oak/pe.d085:peLI.Kontakion1.melody
ltx/swh_redirects_oak/pe.d085:peLI.Kontakion1.mode	@ltx/swh_ke_oak/pe.d085:peLI.Kontakion1.mode
ltx/swh_redirects_oak/pe.d085:peLI.Kontakion1.text	@ltx/swh_ke_oak/pe.d085:peLI.Kontakion1.text
ltx/swh_redirects_oak/pe.d085:peLI.Megalynarion.text	@ltx/swh_ke_oak/pe.d085:peLI.Megalynarion.text
ltx/swh_redirects_oak/pe.d085:peLI.TheotokosHymn.incipit	@ltx/swh_ke_oak/pe.d085:peLI.TheotokosHymn.incipit
ltx/swh_redirects_oak/pe.d085:peLI.TheotokosHymn.mode	@ltx/swh_ke_oak/pe.d085:peLI.TheotokosHymn.mode
ltx/swh_redirects_oak/pe.d085:peLI.TheotokosHymn.text	@ltx/swh_ke_oak/pe.d085:peLI.TheotokosHymn.text
ltx/swh_redirects_oak/pe.d085:peLI.TheotokosHymnVerse.text	@ltx/swh_ke_oak/pe.d085:peLI.TheotokosHymnVerse.text
ltx/swh_redirects_oak/pe.d085:peMA.C1.poet	@ltx/swh_ke_oak/pe.d085:peMA.C1.poet
ltx/swh_redirects_oak/pe.d085:peMA.C1.title	@ltx/swh_ke_oak/pe.d085:peMA.C1.title
ltx/swh_redirects_oak/pe.d085:peMA.C1.verse	@ltx/swh_ke_oak/pe.d085:peMA.C1.verse
ltx/swh_redirects_oak/pe.d085:peMA.Exaposteilarion1.greekmelody	@ltx/swh_ke_oak/pe.d085:peMA.Exaposteilarion1.greekmelody
ltx/swh_redirects_oak/pe.d085:peMA.Exaposteilarion1.incipit	@ltx/swh_ke_oak/pe.d085:peMA.Exaposteilarion1.incipit
ltx/swh_redirects_oak/pe.d085:peMA.Exaposteilarion1.melody	@ltx/swh_ke_oak/pe.d085:peMA.Exaposteilarion1.melody
ltx/swh_redirects_oak/pe.d085:peMA.Exaposteilarion1.mode	@ltx/swh_ke_oak/pe.d085:peMA.Exaposteilarion1.mode
ltx/swh_redirects_oak/pe.d085:peMA.Exaposteilarion1.text	@ltx/swh_ke_oak/pe.d085:peMA.Exaposteilarion1.text
ltx/swh_redirects_oak/pe.d085:peMA.Kathisma11.incipit	@ltx/swh_ke_oak/pe.d085:peMA.Kathisma11.incipit
ltx/swh_redirects_oak/pe.d085:peMA.Kathisma11.melody	@ltx/swh_ke_oak/pe.d085:peMA.Kathisma11.melody
ltx/swh_redirects_oak/pe.d085:peMA.Kathisma11.mode	@ltx/swh_ke_oak/pe.d085:peMA.Kathisma11.mode
ltx/swh_redirects_oak/pe.d085:peMA.Kathisma11.text	@ltx/swh_ke_oak/pe.d085:peMA.Kathisma11.text
ltx/swh_redirects_oak/pe.d085:peMA.Kathisma12.incipit	@ltx/swh_ke_oak/pe.d085:peMA.Kathisma12.incipit
ltx/swh_redirects_oak/pe.d085:peMA.Kathisma12.melody	@ltx/swh_ke_oak/pe.d085:peMA.Kathisma12.melody
ltx/swh_redirects_oak/pe.d085:peMA.Kathisma12.mode	@ltx/swh_ke_oak/pe.d085:peMA.Kathisma12.mode
ltx/swh_redirects_oak/pe.d085:peMA.Kathisma12.text	@ltx/swh_ke_oak/pe.d085:peMA.Kathisma12.text
ltx/swh_redirects_oak/pe.d085:peMA.Kathisma13.incipit	@ltx/swh_ke_oak/pe.d085:peMA.Kathisma13.incipit
ltx/swh_redirects_oak/pe.d085:peMA.Kathisma13.melody	@ltx/swh_ke_oak/pe.d085:peMA.Kathisma13.melody
ltx/swh_redirects_oak/pe.d085:peMA.Kathisma13.mode	@ltx/swh_ke_oak/pe.d085:peMA.Kathisma13.mode
ltx/swh_redirects_oak/pe.d085:peMA.Kathisma13.text	@ltx/swh_ke_oak/pe.d085:peMA.Kathisma13.text
ltx/swh_redirects_oak/pe.d085:peMA.Kathisma21.incipit	@ltx/swh_ke_oak/pe.d085:peMA.Kathisma21.incipit
ltx/swh_redirects_oak/pe.d085:peMA.Kathisma21.melody	@ltx/swh_ke_oak/pe.d085:peMA.Kathisma21.melody
ltx/swh_redirects_oak/pe.d085:peMA.Kathisma21.mode	@ltx/swh_ke_oak/pe.d085:peMA.Kathisma21.mode
ltx/swh_redirects_oak/pe.d085:peMA.Kathisma21.text	@ltx/swh_ke_oak/pe.d085:peMA.Kathisma21.text
ltx/swh_redirects_oak/pe.d085:peMA.Kathisma22.incipit	@ltx/swh_ke_oak/pe.d085:peMA.Kathisma22.incipit
ltx/swh_redirects_oak/pe.d085:peMA.Kathisma22.melody	@ltx/swh_ke_oak/pe.d085:peMA.Kathisma22.melody
ltx/swh_redirects_oak/pe.d085:peMA.Kathisma22.mode	@ltx/swh_ke_oak/pe.d085:peMA.Kathisma22.mode
ltx/swh_redirects_oak/pe.d085:peMA.Kathisma22.text	@ltx/swh_ke_oak/pe.d085:peMA.Kathisma22.text
ltx/swh_redirects_oak/pe.d085:peMA.Kathisma23.incipit	@ltx/swh_ke_oak/pe.d085:peMA.Kathisma23.incipit
ltx/swh_redirects_oak/pe.d085:peMA.Kathisma23.melody	@ltx/swh_ke_oak/pe.d085:peMA.Kathisma23.melody
ltx/swh_redirects_oak/pe.d085:peMA.Kathisma23.mode	@ltx/swh_ke_oak/pe.d085:peMA.Kathisma23.mode
ltx/swh_redirects_oak/pe.d085:peMA.Kathisma23.text	@ltx/swh_ke_oak/pe.d085:peMA.Kathisma23.text
ltx/swh_redirects_oak/pe.d085:peMA.Kontakion1.incipit	@ltx/swh_ke_oak/pe.d085:peMA.Kontakion1.incipit
ltx/swh_redirects_oak/pe.d085:peMA.Kontakion1.melody	@ltx/swh_ke_oak/pe.d085:peMA.Kontakion1.melody
ltx/swh_redirects_oak/pe.d085:peMA.Kontakion1.mode	@ltx/swh_ke_oak/pe.d085:peMA.Kontakion1.mode
ltx/swh_redirects_oak/pe.d085:peMA.Kontakion1.text	@ltx/swh_ke_oak/pe.d085:peMA.Kontakion1.text
ltx/swh_redirects_oak/pe.d085:peMA.Lauds1.incipit	@ltx/swh_ke_oak/pe.d085:peMA.Lauds1.incipit
ltx/swh_redirects_oak/pe.d085:peMA.Lauds1.melody	@ltx/swh_ke_oak/pe.d085:peMA.Lauds1.melody
ltx/swh_redirects_oak/pe.d085:peMA.Lauds1.mode	@ltx/swh_ke_oak/pe.d085:peMA.Lauds1.mode
ltx/swh_redirects_oak/pe.d085:peMA.Lauds1.text	@ltx/swh_ke_oak/pe.d085:peMA.Lauds1.text
ltx/swh_redirects_oak/pe.d085:peMA.Lauds2.incipit	@ltx/swh_ke_oak/pe.d085:peMA.Lauds2.incipit
ltx/swh_redirects_oak/pe.d085:peMA.Lauds2.melody	@ltx/swh_ke_oak/pe.d085:peMA.Lauds2.melody
ltx/swh_redirects_oak/pe.d085:peMA.Lauds2.mode	@ltx/swh_ke_oak/pe.d085:peMA.Lauds2.mode
ltx/swh_redirects_oak/pe.d085:peMA.Lauds2.text	@ltx/swh_ke_oak/pe.d085:peMA.Lauds2.text
ltx/swh_redirects_oak/pe.d085:peMA.Lauds3.incipit	@ltx/swh_ke_oak/pe.d085:peMA.Lauds3.incipit
ltx/swh_redirects_oak/pe.d085:peMA.Lauds3.melody	@ltx/swh_ke_oak/pe.d085:peMA.Lauds3.melody
ltx/swh_redirects_oak/pe.d085:peMA.Lauds3.mode	@ltx/swh_ke_oak/pe.d085:peMA.Lauds3.mode
ltx/swh_redirects_oak/pe.d085:peMA.Lauds3.text	@ltx/swh_ke_oak/pe.d085:peMA.Lauds3.text
ltx/swh_redirects_oak/pe.d085:peMA.Lauds4.incipit	@ltx/swh_ke_oak/pe.d085:peMA.Lauds4.incipit
ltx/swh_redirects_oak/pe.d085:peMA.Lauds4.melody	@ltx/swh_ke_oak/pe.d085:peMA.Lauds4.melody
ltx/swh_redirects_oak/pe.d085:peMA.Lauds4.mode	@ltx/swh_ke_oak/pe.d085:peMA.Lauds4.mode
ltx/swh_redirects_oak/pe.d085:peMA.Lauds4.text	@ltx/swh_ke_oak/pe.d085:peMA.Lauds4.text
ltx/swh_redirects_oak/pe.d085:peMA.LaudsGlory.incipit	@ltx/swh_ke_oak/pe.d085:peMA.LaudsGlory.incipit
ltx/swh_redirects_oak/pe.d085:peMA.LaudsGlory.melody	@ltx/swh_ke_oak/pe.d085:peMA.LaudsGlory.melody
ltx/swh_redirects_oak/pe.d085:peMA.LaudsGlory.mode	@ltx/swh_ke_oak/pe.d085:peMA.LaudsGlory.mode
ltx/swh_redirects_oak/pe.d085:peMA.LaudsGlory.text	@ltx/swh_ke_oak/pe.d085:peMA.LaudsGlory.text
ltx/swh_redirects_oak/pe.d085:peMA.Ode1C11.greekmelody	@ltx/swh_ke_oak/pe.d085:peMA.Ode1C11.greekmelody
ltx/swh_redirects_oak/pe.d085:peMA.Ode1C11.incipit	@ltx/swh_ke_oak/pe.d085:peMA.Ode1C11.incipit
ltx/swh_redirects_oak/pe.d085:peMA.Ode1C11.melody	@ltx/swh_ke_oak/pe.d085:peMA.Ode1C11.melody
ltx/swh_redirects_oak/pe.d085:peMA.Ode1C11.mode	@ltx/swh_ke_oak/pe.d085:peMA.Ode1C11.mode
ltx/swh_redirects_oak/pe.d085:peMA.Ode1C11.ode	@ltx/swh_ke_oak/pe.d085:peMA.Ode1C11.ode
ltx/swh_redirects_oak/pe.d085:peMA.Ode1C11.text	@ltx/swh_ke_oak/pe.d085:peMA.Ode1C11.text
ltx/swh_redirects_oak/pe.d085:peMA.Ode1C12.incipit	@ltx/swh_ke_oak/pe.d085:peMA.Ode1C12.incipit
ltx/swh_redirects_oak/pe.d085:peMA.Ode1C12.melody	@ltx/swh_ke_oak/pe.d085:peMA.Ode1C12.melody
ltx/swh_redirects_oak/pe.d085:peMA.Ode1C12.mode	@ltx/swh_ke_oak/pe.d085:peMA.Ode1C12.mode
ltx/swh_redirects_oak/pe.d085:peMA.Ode1C12.ode	@ltx/swh_ke_oak/pe.d085:peMA.Ode1C12.ode
ltx/swh_redirects_oak/pe.d085:peMA.Ode1C12.text	@ltx/swh_ke_oak/pe.d085:peMA.Ode1C12.text
ltx/swh_redirects_oak/pe.d085:peMA.Ode1C13.incipit	@ltx/swh_ke_oak/pe.d085:peMA.Ode1C13.incipit
ltx/swh_redirects_oak/pe.d085:peMA.Ode1C13.melody	@ltx/swh_ke_oak/pe.d085:peMA.Ode1C13.melody
ltx/swh_redirects_oak/pe.d085:peMA.Ode1C13.mode	@ltx/swh_ke_oak/pe.d085:peMA.Ode1C13.mode
ltx/swh_redirects_oak/pe.d085:peMA.Ode1C13.ode	@ltx/swh_ke_oak/pe.d085:peMA.Ode1C13.ode
ltx/swh_redirects_oak/pe.d085:peMA.Ode1C13.text	@ltx/swh_ke_oak/pe.d085:peMA.Ode1C13.text
ltx/swh_redirects_oak/pe.d085:peMA.Ode1C14.incipit	@ltx/swh_ke_oak/pe.d085:peMA.Ode1C14.incipit
ltx/swh_redirects_oak/pe.d085:peMA.Ode1C14.melody	@ltx/swh_ke_oak/pe.d085:peMA.Ode1C14.melody
ltx/swh_redirects_oak/pe.d085:peMA.Ode1C14.mode	@ltx/swh_ke_oak/pe.d085:peMA.Ode1C14.mode
ltx/swh_redirects_oak/pe.d085:peMA.Ode1C14.ode	@ltx/swh_ke_oak/pe.d085:peMA.Ode1C14.ode
ltx/swh_redirects_oak/pe.d085:peMA.Ode1C14.text	@ltx/swh_ke_oak/pe.d085:peMA.Ode1C14.text
ltx/swh_redirects_oak/pe.d085:peMA.Ode1C15.incipit	@ltx/swh_ke_oak/pe.d085:peMA.Ode1C15.incipit
ltx/swh_redirects_oak/pe.d085:peMA.Ode1C15.melody	@ltx/swh_ke_oak/pe.d085:peMA.Ode1C15.melody
ltx/swh_redirects_oak/pe.d085:peMA.Ode1C15.mode	@ltx/swh_ke_oak/pe.d085:peMA.Ode1C15.mode
ltx/swh_redirects_oak/pe.d085:peMA.Ode1C15.ode	@ltx/swh_ke_oak/pe.d085:peMA.Ode1C15.ode
ltx/swh_redirects_oak/pe.d085:peMA.Ode1C15.text	@ltx/swh_ke_oak/pe.d085:peMA.Ode1C15.text
ltx/swh_redirects_oak/pe.d085:peMA.Ode1C1F1.greekmelody	@ltx/swh_ke_oak/pe.d085:peMA.Ode1C1F1.greekmelody
ltx/swh_redirects_oak/pe.d085:peMA.Ode1C1F1.incipit	@ltx/swh_ke_oak/pe.d085:peMA.Ode1C1F1.incipit
ltx/swh_redirects_oak/pe.d085:peMA.Ode1C1F1.melody	@ltx/swh_ke_oak/pe.d085:peMA.Ode1C1F1.melody
ltx/swh_redirects_oak/pe.d085:peMA.Ode1C1F1.mode	@ltx/swh_ke_oak/pe.d085:peMA.Ode1C1F1.mode
ltx/swh_redirects_oak/pe.d085:peMA.Ode1C1F1.ode	@ltx/swh_ke_oak/pe.d085:peMA.Ode1C1F1.ode
ltx/swh_redirects_oak/pe.d085:peMA.Ode1C1F1.text	@ltx/swh_ke_oak/pe.d085:peMA.Ode1C1F1.text
ltx/swh_redirects_oak/pe.d085:peMA.Ode1C1F2.incipit	@ltx/swh_ke_oak/pe.d085:peMA.Ode1C1F2.incipit
ltx/swh_redirects_oak/pe.d085:peMA.Ode1C1F2.melody	@ltx/swh_ke_oak/pe.d085:peMA.Ode1C1F2.melody
ltx/swh_redirects_oak/pe.d085:peMA.Ode1C1F2.mode	@ltx/swh_ke_oak/pe.d085:peMA.Ode1C1F2.mode
ltx/swh_redirects_oak/pe.d085:peMA.Ode1C1F2.ode	@ltx/swh_ke_oak/pe.d085:peMA.Ode1C1F2.ode
ltx/swh_redirects_oak/pe.d085:peMA.Ode1C1F2.text	@ltx/swh_ke_oak/pe.d085:peMA.Ode1C1F2.text
ltx/swh_redirects_oak/pe.d085:peMA.Ode1C1H.greekmelody	@ltx/swh_ke_oak/pe.d085:peMA.Ode1C1H.greekmelody
ltx/swh_redirects_oak/pe.d085:peMA.Ode1C1H.incipit	@ltx/swh_ke_oak/pe.d085:peMA.Ode1C1H.incipit
ltx/swh_redirects_oak/pe.d085:peMA.Ode1C1H.melody	@ltx/swh_ke_oak/pe.d085:peMA.Ode1C1H.melody
ltx/swh_redirects_oak/pe.d085:peMA.Ode1C1H.mode	@ltx/swh_ke_oak/pe.d085:peMA.Ode1C1H.mode
ltx/swh_redirects_oak/pe.d085:peMA.Ode1C1H.ode	@ltx/swh_ke_oak/pe.d085:peMA.Ode1C1H.ode
ltx/swh_redirects_oak/pe.d085:peMA.Ode1C1H.text	@ltx/swh_ke_oak/pe.d085:peMA.Ode1C1H.text
ltx/swh_redirects_oak/pe.d085:peMA.Ode1C1T.incipit	@ltx/swh_ke_oak/pe.d085:peMA.Ode1C1T.incipit
ltx/swh_redirects_oak/pe.d085:peMA.Ode1C1T.melody	@ltx/swh_ke_oak/pe.d085:peMA.Ode1C1T.melody
ltx/swh_redirects_oak/pe.d085:peMA.Ode1C1T.mode	@ltx/swh_ke_oak/pe.d085:peMA.Ode1C1T.mode
ltx/swh_redirects_oak/pe.d085:peMA.Ode1C1T.ode	@ltx/swh_ke_oak/pe.d085:peMA.Ode1C1T.ode
ltx/swh_redirects_oak/pe.d085:peMA.Ode1C1T.text	@ltx/swh_ke_oak/pe.d085:peMA.Ode1C1T.text
ltx/swh_redirects_oak/pe.d085:peMA.Ode1C1Tr.incipit	@ltx/swh_ke_oak/pe.d085:peMA.Ode1C1Tr.incipit
ltx/swh_redirects_oak/pe.d085:peMA.Ode1C1Tr.melody	@ltx/swh_ke_oak/pe.d085:peMA.Ode1C1Tr.melody
ltx/swh_redirects_oak/pe.d085:peMA.Ode1C1Tr.mode	@ltx/swh_ke_oak/pe.d085:peMA.Ode1C1Tr.mode
ltx/swh_redirects_oak/pe.d085:peMA.Ode1C1Tr.ode	@ltx/swh_ke_oak/pe.d085:peMA.Ode1C1Tr.ode
ltx/swh_redirects_oak/pe.d085:peMA.Ode1C1Tr.text	@ltx/swh_ke_oak/pe.d085:peMA.Ode1C1Tr.text
ltx/swh_redirects_oak/pe.d085:peMA.Ode3C11.greekmelody	@ltx/swh_ke_oak/pe.d085:peMA.Ode3C11.greekmelody
ltx/swh_redirects_oak/pe.d085:peMA.Ode3C11.incipit	@ltx/swh_ke_oak/pe.d085:peMA.Ode3C11.incipit
ltx/swh_redirects_oak/pe.d085:peMA.Ode3C11.melody	@ltx/swh_ke_oak/pe.d085:peMA.Ode3C11.melody
ltx/swh_redirects_oak/pe.d085:peMA.Ode3C11.mode	@ltx/swh_ke_oak/pe.d085:peMA.Ode3C11.mode
ltx/swh_redirects_oak/pe.d085:peMA.Ode3C11.ode	@ltx/swh_ke_oak/pe.d085:peMA.Ode3C11.ode
ltx/swh_redirects_oak/pe.d085:peMA.Ode3C11.text	@ltx/swh_ke_oak/pe.d085:peMA.Ode3C11.text
ltx/swh_redirects_oak/pe.d085:peMA.Ode3C12.incipit	@ltx/swh_ke_oak/pe.d085:peMA.Ode3C12.incipit
ltx/swh_redirects_oak/pe.d085:peMA.Ode3C12.melody	@ltx/swh_ke_oak/pe.d085:peMA.Ode3C12.melody
ltx/swh_redirects_oak/pe.d085:peMA.Ode3C12.mode	@ltx/swh_ke_oak/pe.d085:peMA.Ode3C12.mode
ltx/swh_redirects_oak/pe.d085:peMA.Ode3C12.ode	@ltx/swh_ke_oak/pe.d085:peMA.Ode3C12.ode
ltx/swh_redirects_oak/pe.d085:peMA.Ode3C12.text	@ltx/swh_ke_oak/pe.d085:peMA.Ode3C12.text
ltx/swh_redirects_oak/pe.d085:peMA.Ode3C13.incipit	@ltx/swh_ke_oak/pe.d085:peMA.Ode3C13.incipit
ltx/swh_redirects_oak/pe.d085:peMA.Ode3C13.melody	@ltx/swh_ke_oak/pe.d085:peMA.Ode3C13.melody
ltx/swh_redirects_oak/pe.d085:peMA.Ode3C13.mode	@ltx/swh_ke_oak/pe.d085:peMA.Ode3C13.mode
ltx/swh_redirects_oak/pe.d085:peMA.Ode3C13.ode	@ltx/swh_ke_oak/pe.d085:peMA.Ode3C13.ode
ltx/swh_redirects_oak/pe.d085:peMA.Ode3C13.text	@ltx/swh_ke_oak/pe.d085:peMA.Ode3C13.text
ltx/swh_redirects_oak/pe.d085:peMA.Ode3C14.incipit	@ltx/swh_ke_oak/pe.d085:peMA.Ode3C14.incipit
ltx/swh_redirects_oak/pe.d085:peMA.Ode3C14.melody	@ltx/swh_ke_oak/pe.d085:peMA.Ode3C14.melody
ltx/swh_redirects_oak/pe.d085:peMA.Ode3C14.mode	@ltx/swh_ke_oak/pe.d085:peMA.Ode3C14.mode
ltx/swh_redirects_oak/pe.d085:peMA.Ode3C14.ode	@ltx/swh_ke_oak/pe.d085:peMA.Ode3C14.ode
ltx/swh_redirects_oak/pe.d085:peMA.Ode3C14.text	@ltx/swh_ke_oak/pe.d085:peMA.Ode3C14.text
ltx/swh_redirects_oak/pe.d085:peMA.Ode3C15.incipit	@ltx/swh_ke_oak/pe.d085:peMA.Ode3C15.incipit
ltx/swh_redirects_oak/pe.d085:peMA.Ode3C15.melody	@ltx/swh_ke_oak/pe.d085:peMA.Ode3C15.melody
ltx/swh_redirects_oak/pe.d085:peMA.Ode3C15.mode	@ltx/swh_ke_oak/pe.d085:peMA.Ode3C15.mode
ltx/swh_redirects_oak/pe.d085:peMA.Ode3C15.ode	@ltx/swh_ke_oak/pe.d085:peMA.Ode3C15.ode
ltx/swh_redirects_oak/pe.d085:peMA.Ode3C15.text	@ltx/swh_ke_oak/pe.d085:peMA.Ode3C15.text
ltx/swh_redirects_oak/pe.d085:peMA.Ode3C16.incipit	@ltx/swh_ke_oak/pe.d085:peMA.Ode3C16.incipit
ltx/swh_redirects_oak/pe.d085:peMA.Ode3C16.melody	@ltx/swh_ke_oak/pe.d085:peMA.Ode3C16.melody
ltx/swh_redirects_oak/pe.d085:peMA.Ode3C16.mode	@ltx/swh_ke_oak/pe.d085:peMA.Ode3C16.mode
ltx/swh_redirects_oak/pe.d085:peMA.Ode3C16.ode	@ltx/swh_ke_oak/pe.d085:peMA.Ode3C16.ode
ltx/swh_redirects_oak/pe.d085:peMA.Ode3C16.text	@ltx/swh_ke_oak/pe.d085:peMA.Ode3C16.text
ltx/swh_redirects_oak/pe.d085:peMA.Ode3C17.incipit	@ltx/swh_ke_oak/pe.d085:peMA.Ode3C17.incipit
ltx/swh_redirects_oak/pe.d085:peMA.Ode3C17.melody	@ltx/swh_ke_oak/pe.d085:peMA.Ode3C17.melody
ltx/swh_redirects_oak/pe.d085:peMA.Ode3C17.mode	@ltx/swh_ke_oak/pe.d085:peMA.Ode3C17.mode
ltx/swh_redirects_oak/pe.d085:peMA.Ode3C17.ode	@ltx/swh_ke_oak/pe.d085:peMA.Ode3C17.ode
ltx/swh_redirects_oak/pe.d085:peMA.Ode3C17.text	@ltx/swh_ke_oak/pe.d085:peMA.Ode3C17.text
ltx/swh_redirects_oak/pe.d085:peMA.Ode3C1F1.greekmelody	@ltx/swh_ke_oak/pe.d085:peMA.Ode3C1F1.greekmelody
ltx/swh_redirects_oak/pe.d085:peMA.Ode3C1F1.incipit	@ltx/swh_ke_oak/pe.d085:peMA.Ode3C1F1.incipit
ltx/swh_redirects_oak/pe.d085:peMA.Ode3C1F1.melody	@ltx/swh_ke_oak/pe.d085:peMA.Ode3C1F1.melody
ltx/swh_redirects_oak/pe.d085:peMA.Ode3C1F1.mode	@ltx/swh_ke_oak/pe.d085:peMA.Ode3C1F1.mode
ltx/swh_redirects_oak/pe.d085:peMA.Ode3C1F1.ode	@ltx/swh_ke_oak/pe.d085:peMA.Ode3C1F1.ode
ltx/swh_redirects_oak/pe.d085:peMA.Ode3C1F1.text	@ltx/swh_ke_oak/pe.d085:peMA.Ode3C1F1.text
ltx/swh_redirects_oak/pe.d085:peMA.Ode3C1F2.incipit	@ltx/swh_ke_oak/pe.d085:peMA.Ode3C1F2.incipit
ltx/swh_redirects_oak/pe.d085:peMA.Ode3C1F2.melody	@ltx/swh_ke_oak/pe.d085:peMA.Ode3C1F2.melody
ltx/swh_redirects_oak/pe.d085:peMA.Ode3C1F2.mode	@ltx/swh_ke_oak/pe.d085:peMA.Ode3C1F2.mode
ltx/swh_redirects_oak/pe.d085:peMA.Ode3C1F2.ode	@ltx/swh_ke_oak/pe.d085:peMA.Ode3C1F2.ode
ltx/swh_redirects_oak/pe.d085:peMA.Ode3C1F2.text	@ltx/swh_ke_oak/pe.d085:peMA.Ode3C1F2.text
ltx/swh_redirects_oak/pe.d085:peMA.Ode3C1H.greekmelody	@ltx/swh_ke_oak/pe.d085:peMA.Ode3C1H.greekmelody
ltx/swh_redirects_oak/pe.d085:peMA.Ode3C1H.incipit	@ltx/swh_ke_oak/pe.d085:peMA.Ode3C1H.incipit
ltx/swh_redirects_oak/pe.d085:peMA.Ode3C1H.melody	@ltx/swh_ke_oak/pe.d085:peMA.Ode3C1H.melody
ltx/swh_redirects_oak/pe.d085:peMA.Ode3C1H.mode	@ltx/swh_ke_oak/pe.d085:peMA.Ode3C1H.mode
ltx/swh_redirects_oak/pe.d085:peMA.Ode3C1H.ode	@ltx/swh_ke_oak/pe.d085:peMA.Ode3C1H.ode
ltx/swh_redirects_oak/pe.d085:peMA.Ode3C1H.text	@ltx/swh_ke_oak/pe.d085:peMA.Ode3C1H.text
ltx/swh_redirects_oak/pe.d085:peMA.Ode3C1T.incipit	@ltx/swh_ke_oak/pe.d085:peMA.Ode3C1T.incipit
ltx/swh_redirects_oak/pe.d085:peMA.Ode3C1T.melody	@ltx/swh_ke_oak/pe.d085:peMA.Ode3C1T.melody
ltx/swh_redirects_oak/pe.d085:peMA.Ode3C1T.mode	@ltx/swh_ke_oak/pe.d085:peMA.Ode3C1T.mode
ltx/swh_redirects_oak/pe.d085:peMA.Ode3C1T.ode	@ltx/swh_ke_oak/pe.d085:peMA.Ode3C1T.ode
ltx/swh_redirects_oak/pe.d085:peMA.Ode3C1T.text	@ltx/swh_ke_oak/pe.d085:peMA.Ode3C1T.text
ltx/swh_redirects_oak/pe.d085:peMA.Ode3C1Tr.incipit	@ltx/swh_ke_oak/pe.d085:peMA.Ode3C1Tr.incipit
ltx/swh_redirects_oak/pe.d085:peMA.Ode3C1Tr.melody	@ltx/swh_ke_oak/pe.d085:peMA.Ode3C1Tr.melody
ltx/swh_redirects_oak/pe.d085:peMA.Ode3C1Tr.mode	@ltx/swh_ke_oak/pe.d085:peMA.Ode3C1Tr.mode
ltx/swh_redirects_oak/pe.d085:peMA.Ode3C1Tr.ode	@ltx/swh_ke_oak/pe.d085:peMA.Ode3C1Tr.ode
ltx/swh_redirects_oak/pe.d085:peMA.Ode3C1Tr.text	@ltx/swh_ke_oak/pe.d085:peMA.Ode3C1Tr.text
ltx/swh_redirects_oak/pe.d085:peMA.Ode3Kathisma1.greekmelody	@ltx/swh_ke_oak/pe.d085:peMA.Ode3Kathisma1.greekmelody
ltx/swh_redirects_oak/pe.d085:peMA.Ode3Kathisma1.incipit	@ltx/swh_ke_oak/pe.d085:peMA.Ode3Kathisma1.incipit
ltx/swh_redirects_oak/pe.d085:peMA.Ode3Kathisma1.melody	@ltx/swh_ke_oak/pe.d085:peMA.Ode3Kathisma1.melody
ltx/swh_redirects_oak/pe.d085:peMA.Ode3Kathisma1.mode	@ltx/swh_ke_oak/pe.d085:peMA.Ode3Kathisma1.mode
ltx/swh_redirects_oak/pe.d085:peMA.Ode3Kathisma1.text	@ltx/swh_ke_oak/pe.d085:peMA.Ode3Kathisma1.text
ltx/swh_redirects_oak/pe.d085:peMA.Ode3Kathisma2.incipit	@ltx/swh_ke_oak/pe.d085:peMA.Ode3Kathisma2.incipit
ltx/swh_redirects_oak/pe.d085:peMA.Ode3Kathisma2.melody	@ltx/swh_ke_oak/pe.d085:peMA.Ode3Kathisma2.melody
ltx/swh_redirects_oak/pe.d085:peMA.Ode3Kathisma2.mode	@ltx/swh_ke_oak/pe.d085:peMA.Ode3Kathisma2.mode
ltx/swh_redirects_oak/pe.d085:peMA.Ode3Kathisma2.text	@ltx/swh_ke_oak/pe.d085:peMA.Ode3Kathisma2.text
ltx/swh_redirects_oak/pe.d085:peMA.Ode4C11.greekmelody	@ltx/swh_ke_oak/pe.d085:peMA.Ode4C11.greekmelody
ltx/swh_redirects_oak/pe.d085:peMA.Ode4C11.incipit	@ltx/swh_ke_oak/pe.d085:peMA.Ode4C11.incipit
ltx/swh_redirects_oak/pe.d085:peMA.Ode4C11.melody	@ltx/swh_ke_oak/pe.d085:peMA.Ode4C11.melody
ltx/swh_redirects_oak/pe.d085:peMA.Ode4C11.mode	@ltx/swh_ke_oak/pe.d085:peMA.Ode4C11.mode
ltx/swh_redirects_oak/pe.d085:peMA.Ode4C11.ode	@ltx/swh_ke_oak/pe.d085:peMA.Ode4C11.ode
ltx/swh_redirects_oak/pe.d085:peMA.Ode4C11.text	@ltx/swh_ke_oak/pe.d085:peMA.Ode4C11.text
ltx/swh_redirects_oak/pe.d085:peMA.Ode4C12.incipit	@ltx/swh_ke_oak/pe.d085:peMA.Ode4C12.incipit
ltx/swh_redirects_oak/pe.d085:peMA.Ode4C12.melody	@ltx/swh_ke_oak/pe.d085:peMA.Ode4C12.melody
ltx/swh_redirects_oak/pe.d085:peMA.Ode4C12.mode	@ltx/swh_ke_oak/pe.d085:peMA.Ode4C12.mode
ltx/swh_redirects_oak/pe.d085:peMA.Ode4C12.ode	@ltx/swh_ke_oak/pe.d085:peMA.Ode4C12.ode
ltx/swh_redirects_oak/pe.d085:peMA.Ode4C12.text	@ltx/swh_ke_oak/pe.d085:peMA.Ode4C12.text
ltx/swh_redirects_oak/pe.d085:peMA.Ode4C13.incipit	@ltx/swh_ke_oak/pe.d085:peMA.Ode4C13.incipit
ltx/swh_redirects_oak/pe.d085:peMA.Ode4C13.melody	@ltx/swh_ke_oak/pe.d085:peMA.Ode4C13.melody
ltx/swh_redirects_oak/pe.d085:peMA.Ode4C13.mode	@ltx/swh_ke_oak/pe.d085:peMA.Ode4C13.mode
ltx/swh_redirects_oak/pe.d085:peMA.Ode4C13.ode	@ltx/swh_ke_oak/pe.d085:peMA.Ode4C13.ode
ltx/swh_redirects_oak/pe.d085:peMA.Ode4C13.text	@ltx/swh_ke_oak/pe.d085:peMA.Ode4C13.text
ltx/swh_redirects_oak/pe.d085:peMA.Ode4C14.incipit	@ltx/swh_ke_oak/pe.d085:peMA.Ode4C14.incipit
ltx/swh_redirects_oak/pe.d085:peMA.Ode4C14.melody	@ltx/swh_ke_oak/pe.d085:peMA.Ode4C14.melody
ltx/swh_redirects_oak/pe.d085:peMA.Ode4C14.mode	@ltx/swh_ke_oak/pe.d085:peMA.Ode4C14.mode
ltx/swh_redirects_oak/pe.d085:peMA.Ode4C14.ode	@ltx/swh_ke_oak/pe.d085:peMA.Ode4C14.ode
ltx/swh_redirects_oak/pe.d085:peMA.Ode4C14.text	@ltx/swh_ke_oak/pe.d085:peMA.Ode4C14.text
ltx/swh_redirects_oak/pe.d085:peMA.Ode4C15.incipit	@ltx/swh_ke_oak/pe.d085:peMA.Ode4C15.incipit
ltx/swh_redirects_oak/pe.d085:peMA.Ode4C15.melody	@ltx/swh_ke_oak/pe.d085:peMA.Ode4C15.melody
ltx/swh_redirects_oak/pe.d085:peMA.Ode4C15.mode	@ltx/swh_ke_oak/pe.d085:peMA.Ode4C15.mode
ltx/swh_redirects_oak/pe.d085:peMA.Ode4C15.ode	@ltx/swh_ke_oak/pe.d085:peMA.Ode4C15.ode
ltx/swh_redirects_oak/pe.d085:peMA.Ode4C15.text	@ltx/swh_ke_oak/pe.d085:peMA.Ode4C15.text
ltx/swh_redirects_oak/pe.d085:peMA.Ode4C16.incipit	@ltx/swh_ke_oak/pe.d085:peMA.Ode4C16.incipit
ltx/swh_redirects_oak/pe.d085:peMA.Ode4C16.melody	@ltx/swh_ke_oak/pe.d085:peMA.Ode4C16.melody
ltx/swh_redirects_oak/pe.d085:peMA.Ode4C16.mode	@ltx/swh_ke_oak/pe.d085:peMA.Ode4C16.mode
ltx/swh_redirects_oak/pe.d085:peMA.Ode4C16.ode	@ltx/swh_ke_oak/pe.d085:peMA.Ode4C16.ode
ltx/swh_redirects_oak/pe.d085:peMA.Ode4C16.text	@ltx/swh_ke_oak/pe.d085:peMA.Ode4C16.text
ltx/swh_redirects_oak/pe.d085:peMA.Ode4C17.incipit	@ltx/swh_ke_oak/pe.d085:peMA.Ode4C17.incipit
ltx/swh_redirects_oak/pe.d085:peMA.Ode4C17.melody	@ltx/swh_ke_oak/pe.d085:peMA.Ode4C17.melody
ltx/swh_redirects_oak/pe.d085:peMA.Ode4C17.mode	@ltx/swh_ke_oak/pe.d085:peMA.Ode4C17.mode
ltx/swh_redirects_oak/pe.d085:peMA.Ode4C17.ode	@ltx/swh_ke_oak/pe.d085:peMA.Ode4C17.ode
ltx/swh_redirects_oak/pe.d085:peMA.Ode4C17.text	@ltx/swh_ke_oak/pe.d085:peMA.Ode4C17.text
ltx/swh_redirects_oak/pe.d085:peMA.Ode4C1F1.greekmelody	@ltx/swh_ke_oak/pe.d085:peMA.Ode4C1F1.greekmelody
ltx/swh_redirects_oak/pe.d085:peMA.Ode4C1F1.incipit	@ltx/swh_ke_oak/pe.d085:peMA.Ode4C1F1.incipit
ltx/swh_redirects_oak/pe.d085:peMA.Ode4C1F1.melody	@ltx/swh_ke_oak/pe.d085:peMA.Ode4C1F1.melody
ltx/swh_redirects_oak/pe.d085:peMA.Ode4C1F1.mode	@ltx/swh_ke_oak/pe.d085:peMA.Ode4C1F1.mode
ltx/swh_redirects_oak/pe.d085:peMA.Ode4C1F1.ode	@ltx/swh_ke_oak/pe.d085:peMA.Ode4C1F1.ode
ltx/swh_redirects_oak/pe.d085:peMA.Ode4C1F1.text	@ltx/swh_ke_oak/pe.d085:peMA.Ode4C1F1.text
ltx/swh_redirects_oak/pe.d085:peMA.Ode4C1F2.incipit	@ltx/swh_ke_oak/pe.d085:peMA.Ode4C1F2.incipit
ltx/swh_redirects_oak/pe.d085:peMA.Ode4C1F2.melody	@ltx/swh_ke_oak/pe.d085:peMA.Ode4C1F2.melody
ltx/swh_redirects_oak/pe.d085:peMA.Ode4C1F2.mode	@ltx/swh_ke_oak/pe.d085:peMA.Ode4C1F2.mode
ltx/swh_redirects_oak/pe.d085:peMA.Ode4C1F2.ode	@ltx/swh_ke_oak/pe.d085:peMA.Ode4C1F2.ode
ltx/swh_redirects_oak/pe.d085:peMA.Ode4C1F2.text	@ltx/swh_ke_oak/pe.d085:peMA.Ode4C1F2.text
ltx/swh_redirects_oak/pe.d085:peMA.Ode4C1H.greekmelody	@ltx/swh_ke_oak/pe.d085:peMA.Ode4C1H.greekmelody
ltx/swh_redirects_oak/pe.d085:peMA.Ode4C1H.incipit	@ltx/swh_ke_oak/pe.d085:peMA.Ode4C1H.incipit
ltx/swh_redirects_oak/pe.d085:peMA.Ode4C1H.melody	@ltx/swh_ke_oak/pe.d085:peMA.Ode4C1H.melody
ltx/swh_redirects_oak/pe.d085:peMA.Ode4C1H.mode	@ltx/swh_ke_oak/pe.d085:peMA.Ode4C1H.mode
ltx/swh_redirects_oak/pe.d085:peMA.Ode4C1H.ode	@ltx/swh_ke_oak/pe.d085:peMA.Ode4C1H.ode
ltx/swh_redirects_oak/pe.d085:peMA.Ode4C1H.text	@ltx/swh_ke_oak/pe.d085:peMA.Ode4C1H.text
ltx/swh_redirects_oak/pe.d085:peMA.Ode4C1T.incipit	@ltx/swh_ke_oak/pe.d085:peMA.Ode4C1T.incipit
ltx/swh_redirects_oak/pe.d085:peMA.Ode4C1T.melody	@ltx/swh_ke_oak/pe.d085:peMA.Ode4C1T.melody
ltx/swh_redirects_oak/pe.d085:peMA.Ode4C1T.mode	@ltx/swh_ke_oak/pe.d085:peMA.Ode4C1T.mode
ltx/swh_redirects_oak/pe.d085:peMA.Ode4C1T.ode	@ltx/swh_ke_oak/pe.d085:peMA.Ode4C1T.ode
ltx/swh_redirects_oak/pe.d085:peMA.Ode4C1T.text	@ltx/swh_ke_oak/pe.d085:peMA.Ode4C1T.text
ltx/swh_redirects_oak/pe.d085:peMA.Ode4C1Tr.incipit	@ltx/swh_ke_oak/pe.d085:peMA.Ode4C1Tr.incipit
ltx/swh_redirects_oak/pe.d085:peMA.Ode4C1Tr.melody	@ltx/swh_ke_oak/pe.d085:peMA.Ode4C1Tr.melody
ltx/swh_redirects_oak/pe.d085:peMA.Ode4C1Tr.mode	@ltx/swh_ke_oak/pe.d085:peMA.Ode4C1Tr.mode
ltx/swh_redirects_oak/pe.d085:peMA.Ode4C1Tr.ode	@ltx/swh_ke_oak/pe.d085:peMA.Ode4C1Tr.ode
ltx/swh_redirects_oak/pe.d085:peMA.Ode4C1Tr.text	@ltx/swh_ke_oak/pe.d085:peMA.Ode4C1Tr.text
ltx/swh_redirects_oak/pe.d085:peMA.Ode5C11.greekmelody	@ltx/swh_ke_oak/pe.d085:peMA.Ode5C11.greekmelody
ltx/swh_redirects_oak/pe.d085:peMA.Ode5C11.incipit	@ltx/swh_ke_oak/pe.d085:peMA.Ode5C11.incipit
ltx/swh_redirects_oak/pe.d085:peMA.Ode5C11.melody	@ltx/swh_ke_oak/pe.d085:peMA.Ode5C11.melody
ltx/swh_redirects_oak/pe.d085:peMA.Ode5C11.mode	@ltx/swh_ke_oak/pe.d085:peMA.Ode5C11.mode
ltx/swh_redirects_oak/pe.d085:peMA.Ode5C11.ode	@ltx/swh_ke_oak/pe.d085:peMA.Ode5C11.ode
ltx/swh_redirects_oak/pe.d085:peMA.Ode5C11.text	@ltx/swh_ke_oak/pe.d085:peMA.Ode5C11.text
ltx/swh_redirects_oak/pe.d085:peMA.Ode5C12.incipit	@ltx/swh_ke_oak/pe.d085:peMA.Ode5C12.incipit
ltx/swh_redirects_oak/pe.d085:peMA.Ode5C12.melody	@ltx/swh_ke_oak/pe.d085:peMA.Ode5C12.melody
ltx/swh_redirects_oak/pe.d085:peMA.Ode5C12.mode	@ltx/swh_ke_oak/pe.d085:peMA.Ode5C12.mode
ltx/swh_redirects_oak/pe.d085:peMA.Ode5C12.ode	@ltx/swh_ke_oak/pe.d085:peMA.Ode5C12.ode
ltx/swh_redirects_oak/pe.d085:peMA.Ode5C12.text	@ltx/swh_ke_oak/pe.d085:peMA.Ode5C12.text
ltx/swh_redirects_oak/pe.d085:peMA.Ode5C13.incipit	@ltx/swh_ke_oak/pe.d085:peMA.Ode5C13.incipit
ltx/swh_redirects_oak/pe.d085:peMA.Ode5C13.melody	@ltx/swh_ke_oak/pe.d085:peMA.Ode5C13.melody
ltx/swh_redirects_oak/pe.d085:peMA.Ode5C13.mode	@ltx/swh_ke_oak/pe.d085:peMA.Ode5C13.mode
ltx/swh_redirects_oak/pe.d085:peMA.Ode5C13.ode	@ltx/swh_ke_oak/pe.d085:peMA.Ode5C13.ode
ltx/swh_redirects_oak/pe.d085:peMA.Ode5C13.text	@ltx/swh_ke_oak/pe.d085:peMA.Ode5C13.text
ltx/swh_redirects_oak/pe.d085:peMA.Ode5C14.incipit	@ltx/swh_ke_oak/pe.d085:peMA.Ode5C14.incipit
ltx/swh_redirects_oak/pe.d085:peMA.Ode5C14.melody	@ltx/swh_ke_oak/pe.d085:peMA.Ode5C14.melody
ltx/swh_redirects_oak/pe.d085:peMA.Ode5C14.mode	@ltx/swh_ke_oak/pe.d085:peMA.Ode5C14.mode
ltx/swh_redirects_oak/pe.d085:peMA.Ode5C14.ode	@ltx/swh_ke_oak/pe.d085:peMA.Ode5C14.ode
ltx/swh_redirects_oak/pe.d085:peMA.Ode5C14.text	@ltx/swh_ke_oak/pe.d085:peMA.Ode5C14.text
ltx/swh_redirects_oak/pe.d085:peMA.Ode5C15.incipit	@ltx/swh_ke_oak/pe.d085:peMA.Ode5C15.incipit
ltx/swh_redirects_oak/pe.d085:peMA.Ode5C15.melody	@ltx/swh_ke_oak/pe.d085:peMA.Ode5C15.melody
ltx/swh_redirects_oak/pe.d085:peMA.Ode5C15.mode	@ltx/swh_ke_oak/pe.d085:peMA.Ode5C15.mode
ltx/swh_redirects_oak/pe.d085:peMA.Ode5C15.ode	@ltx/swh_ke_oak/pe.d085:peMA.Ode5C15.ode
ltx/swh_redirects_oak/pe.d085:peMA.Ode5C15.text	@ltx/swh_ke_oak/pe.d085:peMA.Ode5C15.text
ltx/swh_redirects_oak/pe.d085:peMA.Ode5C16.incipit	@ltx/swh_ke_oak/pe.d085:peMA.Ode5C16.incipit
ltx/swh_redirects_oak/pe.d085:peMA.Ode5C16.melody	@ltx/swh_ke_oak/pe.d085:peMA.Ode5C16.melody
ltx/swh_redirects_oak/pe.d085:peMA.Ode5C16.mode	@ltx/swh_ke_oak/pe.d085:peMA.Ode5C16.mode
ltx/swh_redirects_oak/pe.d085:peMA.Ode5C16.ode	@ltx/swh_ke_oak/pe.d085:peMA.Ode5C16.ode
ltx/swh_redirects_oak/pe.d085:peMA.Ode5C16.text	@ltx/swh_ke_oak/pe.d085:peMA.Ode5C16.text
ltx/swh_redirects_oak/pe.d085:peMA.Ode5C17.incipit	@ltx/swh_ke_oak/pe.d085:peMA.Ode5C17.incipit
ltx/swh_redirects_oak/pe.d085:peMA.Ode5C17.melody	@ltx/swh_ke_oak/pe.d085:peMA.Ode5C17.melody
ltx/swh_redirects_oak/pe.d085:peMA.Ode5C17.mode	@ltx/swh_ke_oak/pe.d085:peMA.Ode5C17.mode
ltx/swh_redirects_oak/pe.d085:peMA.Ode5C17.ode	@ltx/swh_ke_oak/pe.d085:peMA.Ode5C17.ode
ltx/swh_redirects_oak/pe.d085:peMA.Ode5C17.text	@ltx/swh_ke_oak/pe.d085:peMA.Ode5C17.text
ltx/swh_redirects_oak/pe.d085:peMA.Ode5C1F1.greekmelody	@ltx/swh_ke_oak/pe.d085:peMA.Ode5C1F1.greekmelody
ltx/swh_redirects_oak/pe.d085:peMA.Ode5C1F1.incipit	@ltx/swh_ke_oak/pe.d085:peMA.Ode5C1F1.incipit
ltx/swh_redirects_oak/pe.d085:peMA.Ode5C1F1.melody	@ltx/swh_ke_oak/pe.d085:peMA.Ode5C1F1.melody
ltx/swh_redirects_oak/pe.d085:peMA.Ode5C1F1.mode	@ltx/swh_ke_oak/pe.d085:peMA.Ode5C1F1.mode
ltx/swh_redirects_oak/pe.d085:peMA.Ode5C1F1.ode	@ltx/swh_ke_oak/pe.d085:peMA.Ode5C1F1.ode
ltx/swh_redirects_oak/pe.d085:peMA.Ode5C1F1.text	@ltx/swh_ke_oak/pe.d085:peMA.Ode5C1F1.text
ltx/swh_redirects_oak/pe.d085:peMA.Ode5C1F2.incipit	@ltx/swh_ke_oak/pe.d085:peMA.Ode5C1F2.incipit
ltx/swh_redirects_oak/pe.d085:peMA.Ode5C1F2.melody	@ltx/swh_ke_oak/pe.d085:peMA.Ode5C1F2.melody
ltx/swh_redirects_oak/pe.d085:peMA.Ode5C1F2.mode	@ltx/swh_ke_oak/pe.d085:peMA.Ode5C1F2.mode
ltx/swh_redirects_oak/pe.d085:peMA.Ode5C1F2.ode	@ltx/swh_ke_oak/pe.d085:peMA.Ode5C1F2.ode
ltx/swh_redirects_oak/pe.d085:peMA.Ode5C1F2.text	@ltx/swh_ke_oak/pe.d085:peMA.Ode5C1F2.text
ltx/swh_redirects_oak/pe.d085:peMA.Ode5C1H.greekmelody	@ltx/swh_ke_oak/pe.d085:peMA.Ode5C1H.greekmelody
ltx/swh_redirects_oak/pe.d085:peMA.Ode5C1H.incipit	@ltx/swh_ke_oak/pe.d085:peMA.Ode5C1H.incipit
ltx/swh_redirects_oak/pe.d085:peMA.Ode5C1H.melody	@ltx/swh_ke_oak/pe.d085:peMA.Ode5C1H.melody
ltx/swh_redirects_oak/pe.d085:peMA.Ode5C1H.mode	@ltx/swh_ke_oak/pe.d085:peMA.Ode5C1H.mode
ltx/swh_redirects_oak/pe.d085:peMA.Ode5C1H.ode	@ltx/swh_ke_oak/pe.d085:peMA.Ode5C1H.ode
ltx/swh_redirects_oak/pe.d085:peMA.Ode5C1H.text	@ltx/swh_ke_oak/pe.d085:peMA.Ode5C1H.text
ltx/swh_redirects_oak/pe.d085:peMA.Ode5C1T.incipit	@ltx/swh_ke_oak/pe.d085:peMA.Ode5C1T.incipit
ltx/swh_redirects_oak/pe.d085:peMA.Ode5C1T.melody	@ltx/swh_ke_oak/pe.d085:peMA.Ode5C1T.melody
ltx/swh_redirects_oak/pe.d085:peMA.Ode5C1T.mode	@ltx/swh_ke_oak/pe.d085:peMA.Ode5C1T.mode
ltx/swh_redirects_oak/pe.d085:peMA.Ode5C1T.ode	@ltx/swh_ke_oak/pe.d085:peMA.Ode5C1T.ode
ltx/swh_redirects_oak/pe.d085:peMA.Ode5C1T.text	@ltx/swh_ke_oak/pe.d085:peMA.Ode5C1T.text
ltx/swh_redirects_oak/pe.d085:peMA.Ode5C1Tr.incipit	@ltx/swh_ke_oak/pe.d085:peMA.Ode5C1Tr.incipit
ltx/swh_redirects_oak/pe.d085:peMA.Ode5C1Tr.melody	@ltx/swh_ke_oak/pe.d085:peMA.Ode5C1Tr.melody
ltx/swh_redirects_oak/pe.d085:peMA.Ode5C1Tr.mode	@ltx/swh_ke_oak/pe.d085:peMA.Ode5C1Tr.mode
ltx/swh_redirects_oak/pe.d085:peMA.Ode5C1Tr.ode	@ltx/swh_ke_oak/pe.d085:peMA.Ode5C1Tr.ode
ltx/swh_redirects_oak/pe.d085:peMA.Ode5C1Tr.text	@ltx/swh_ke_oak/pe.d085:peMA.Ode5C1Tr.text
ltx/swh_redirects_oak/pe.d085:peMA.Ode6C11.greekmelody	@ltx/swh_ke_oak/pe.d085:peMA.Ode6C11.greekmelody
ltx/swh_redirects_oak/pe.d085:peMA.Ode6C11.incipit	@ltx/swh_ke_oak/pe.d085:peMA.Ode6C11.incipit
ltx/swh_redirects_oak/pe.d085:peMA.Ode6C11.melody	@ltx/swh_ke_oak/pe.d085:peMA.Ode6C11.melody
ltx/swh_redirects_oak/pe.d085:peMA.Ode6C11.mode	@ltx/swh_ke_oak/pe.d085:peMA.Ode6C11.mode
ltx/swh_redirects_oak/pe.d085:peMA.Ode6C11.ode	@ltx/swh_ke_oak/pe.d085:peMA.Ode6C11.ode
ltx/swh_redirects_oak/pe.d085:peMA.Ode6C11.text	@ltx/swh_ke_oak/pe.d085:peMA.Ode6C11.text
ltx/swh_redirects_oak/pe.d085:peMA.Ode6C12.incipit	@ltx/swh_ke_oak/pe.d085:peMA.Ode6C12.incipit
ltx/swh_redirects_oak/pe.d085:peMA.Ode6C12.melody	@ltx/swh_ke_oak/pe.d085:peMA.Ode6C12.melody
ltx/swh_redirects_oak/pe.d085:peMA.Ode6C12.mode	@ltx/swh_ke_oak/pe.d085:peMA.Ode6C12.mode
ltx/swh_redirects_oak/pe.d085:peMA.Ode6C12.ode	@ltx/swh_ke_oak/pe.d085:peMA.Ode6C12.ode
ltx/swh_redirects_oak/pe.d085:peMA.Ode6C12.text	@ltx/swh_ke_oak/pe.d085:peMA.Ode6C12.text
ltx/swh_redirects_oak/pe.d085:peMA.Ode6C13.incipit	@ltx/swh_ke_oak/pe.d085:peMA.Ode6C13.incipit
ltx/swh_redirects_oak/pe.d085:peMA.Ode6C13.melody	@ltx/swh_ke_oak/pe.d085:peMA.Ode6C13.melody
ltx/swh_redirects_oak/pe.d085:peMA.Ode6C13.mode	@ltx/swh_ke_oak/pe.d085:peMA.Ode6C13.mode
ltx/swh_redirects_oak/pe.d085:peMA.Ode6C13.ode	@ltx/swh_ke_oak/pe.d085:peMA.Ode6C13.ode
ltx/swh_redirects_oak/pe.d085:peMA.Ode6C13.text	@ltx/swh_ke_oak/pe.d085:peMA.Ode6C13.text
ltx/swh_redirects_oak/pe.d085:peMA.Ode6C14.incipit	@ltx/swh_ke_oak/pe.d085:peMA.Ode6C14.incipit
ltx/swh_redirects_oak/pe.d085:peMA.Ode6C14.melody	@ltx/swh_ke_oak/pe.d085:peMA.Ode6C14.melody
ltx/swh_redirects_oak/pe.d085:peMA.Ode6C14.mode	@ltx/swh_ke_oak/pe.d085:peMA.Ode6C14.mode
ltx/swh_redirects_oak/pe.d085:peMA.Ode6C14.ode	@ltx/swh_ke_oak/pe.d085:peMA.Ode6C14.ode
ltx/swh_redirects_oak/pe.d085:peMA.Ode6C14.text	@ltx/swh_ke_oak/pe.d085:peMA.Ode6C14.text
ltx/swh_redirects_oak/pe.d085:peMA.Ode6C1F1.greekmelody	@ltx/swh_ke_oak/pe.d085:peMA.Ode6C1F1.greekmelody
ltx/swh_redirects_oak/pe.d085:peMA.Ode6C1F1.incipit	@ltx/swh_ke_oak/pe.d085:peMA.Ode6C1F1.incipit
ltx/swh_redirects_oak/pe.d085:peMA.Ode6C1F1.melody	@ltx/swh_ke_oak/pe.d085:peMA.Ode6C1F1.melody
ltx/swh_redirects_oak/pe.d085:peMA.Ode6C1F1.mode	@ltx/swh_ke_oak/pe.d085:peMA.Ode6C1F1.mode
ltx/swh_redirects_oak/pe.d085:peMA.Ode6C1F1.ode	@ltx/swh_ke_oak/pe.d085:peMA.Ode6C1F1.ode
ltx/swh_redirects_oak/pe.d085:peMA.Ode6C1F1.text	@ltx/swh_ke_oak/pe.d085:peMA.Ode6C1F1.text
ltx/swh_redirects_oak/pe.d085:peMA.Ode6C1F2.incipit	@ltx/swh_ke_oak/pe.d085:peMA.Ode6C1F2.incipit
ltx/swh_redirects_oak/pe.d085:peMA.Ode6C1F2.melody	@ltx/swh_ke_oak/pe.d085:peMA.Ode6C1F2.melody
ltx/swh_redirects_oak/pe.d085:peMA.Ode6C1F2.mode	@ltx/swh_ke_oak/pe.d085:peMA.Ode6C1F2.mode
ltx/swh_redirects_oak/pe.d085:peMA.Ode6C1F2.ode	@ltx/swh_ke_oak/pe.d085:peMA.Ode6C1F2.ode
ltx/swh_redirects_oak/pe.d085:peMA.Ode6C1F2.text	@ltx/swh_ke_oak/pe.d085:peMA.Ode6C1F2.text
ltx/swh_redirects_oak/pe.d085:peMA.Ode6C1H.greekmelody	@ltx/swh_ke_oak/pe.d085:peMA.Ode6C1H.greekmelody
ltx/swh_redirects_oak/pe.d085:peMA.Ode6C1H.incipit	@ltx/swh_ke_oak/pe.d085:peMA.Ode6C1H.incipit
ltx/swh_redirects_oak/pe.d085:peMA.Ode6C1H.melody	@ltx/swh_ke_oak/pe.d085:peMA.Ode6C1H.melody
ltx/swh_redirects_oak/pe.d085:peMA.Ode6C1H.mode	@ltx/swh_ke_oak/pe.d085:peMA.Ode6C1H.mode
ltx/swh_redirects_oak/pe.d085:peMA.Ode6C1H.ode	@ltx/swh_ke_oak/pe.d085:peMA.Ode6C1H.ode
ltx/swh_redirects_oak/pe.d085:peMA.Ode6C1H.text	@ltx/swh_ke_oak/pe.d085:peMA.Ode6C1H.text
ltx/swh_redirects_oak/pe.d085:peMA.Ode6C1T.incipit	@ltx/swh_ke_oak/pe.d085:peMA.Ode6C1T.incipit
ltx/swh_redirects_oak/pe.d085:peMA.Ode6C1T.melody	@ltx/swh_ke_oak/pe.d085:peMA.Ode6C1T.melody
ltx/swh_redirects_oak/pe.d085:peMA.Ode6C1T.mode	@ltx/swh_ke_oak/pe.d085:peMA.Ode6C1T.mode
ltx/swh_redirects_oak/pe.d085:peMA.Ode6C1T.ode	@ltx/swh_ke_oak/pe.d085:peMA.Ode6C1T.ode
ltx/swh_redirects_oak/pe.d085:peMA.Ode6C1T.text	@ltx/swh_ke_oak/pe.d085:peMA.Ode6C1T.text
ltx/swh_redirects_oak/pe.d085:peMA.Ode6C1Tr.incipit	@ltx/swh_ke_oak/pe.d085:peMA.Ode6C1Tr.incipit
ltx/swh_redirects_oak/pe.d085:peMA.Ode6C1Tr.melody	@ltx/swh_ke_oak/pe.d085:peMA.Ode6C1Tr.melody
ltx/swh_redirects_oak/pe.d085:peMA.Ode6C1Tr.mode	@ltx/swh_ke_oak/pe.d085:peMA.Ode6C1Tr.mode
ltx/swh_redirects_oak/pe.d085:peMA.Ode6C1Tr.ode	@ltx/swh_ke_oak/pe.d085:peMA.Ode6C1Tr.ode
ltx/swh_redirects_oak/pe.d085:peMA.Ode6C1Tr.text	@ltx/swh_ke_oak/pe.d085:peMA.Ode6C1Tr.text
ltx/swh_redirects_oak/pe.d085:peMA.Ode7C11.greekmelody	@ltx/swh_ke_oak/pe.d085:peMA.Ode7C11.greekmelody
ltx/swh_redirects_oak/pe.d085:peMA.Ode7C11.incipit	@ltx/swh_ke_oak/pe.d085:peMA.Ode7C11.incipit
ltx/swh_redirects_oak/pe.d085:peMA.Ode7C11.melody	@ltx/swh_ke_oak/pe.d085:peMA.Ode7C11.melody
ltx/swh_redirects_oak/pe.d085:peMA.Ode7C11.mode	@ltx/swh_ke_oak/pe.d085:peMA.Ode7C11.mode
ltx/swh_redirects_oak/pe.d085:peMA.Ode7C11.ode	@ltx/swh_ke_oak/pe.d085:peMA.Ode7C11.ode
ltx/swh_redirects_oak/pe.d085:peMA.Ode7C11.text	@ltx/swh_ke_oak/pe.d085:peMA.Ode7C11.text
ltx/swh_redirects_oak/pe.d085:peMA.Ode7C12.incipit	@ltx/swh_ke_oak/pe.d085:peMA.Ode7C12.incipit
ltx/swh_redirects_oak/pe.d085:peMA.Ode7C12.melody	@ltx/swh_ke_oak/pe.d085:peMA.Ode7C12.melody
ltx/swh_redirects_oak/pe.d085:peMA.Ode7C12.mode	@ltx/swh_ke_oak/pe.d085:peMA.Ode7C12.mode
ltx/swh_redirects_oak/pe.d085:peMA.Ode7C12.ode	@ltx/swh_ke_oak/pe.d085:peMA.Ode7C12.ode
ltx/swh_redirects_oak/pe.d085:peMA.Ode7C12.text	@ltx/swh_ke_oak/pe.d085:peMA.Ode7C12.text
ltx/swh_redirects_oak/pe.d085:peMA.Ode7C13.incipit	@ltx/swh_ke_oak/pe.d085:peMA.Ode7C13.incipit
ltx/swh_redirects_oak/pe.d085:peMA.Ode7C13.melody	@ltx/swh_ke_oak/pe.d085:peMA.Ode7C13.melody
ltx/swh_redirects_oak/pe.d085:peMA.Ode7C13.mode	@ltx/swh_ke_oak/pe.d085:peMA.Ode7C13.mode
ltx/swh_redirects_oak/pe.d085:peMA.Ode7C13.ode	@ltx/swh_ke_oak/pe.d085:peMA.Ode7C13.ode
ltx/swh_redirects_oak/pe.d085:peMA.Ode7C13.text	@ltx/swh_ke_oak/pe.d085:peMA.Ode7C13.text
ltx/swh_redirects_oak/pe.d085:peMA.Ode7C14.incipit	@ltx/swh_ke_oak/pe.d085:peMA.Ode7C14.incipit
ltx/swh_redirects_oak/pe.d085:peMA.Ode7C14.melody	@ltx/swh_ke_oak/pe.d085:peMA.Ode7C14.melody
ltx/swh_redirects_oak/pe.d085:peMA.Ode7C14.mode	@ltx/swh_ke_oak/pe.d085:peMA.Ode7C14.mode
ltx/swh_redirects_oak/pe.d085:peMA.Ode7C14.ode	@ltx/swh_ke_oak/pe.d085:peMA.Ode7C14.ode
ltx/swh_redirects_oak/pe.d085:peMA.Ode7C14.text	@ltx/swh_ke_oak/pe.d085:peMA.Ode7C14.text
ltx/swh_redirects_oak/pe.d085:peMA.Ode7C1F1.greekmelody	@ltx/swh_ke_oak/pe.d085:peMA.Ode7C1F1.greekmelody
ltx/swh_redirects_oak/pe.d085:peMA.Ode7C1F1.incipit	@ltx/swh_ke_oak/pe.d085:peMA.Ode7C1F1.incipit
ltx/swh_redirects_oak/pe.d085:peMA.Ode7C1F1.melody	@ltx/swh_ke_oak/pe.d085:peMA.Ode7C1F1.melody
ltx/swh_redirects_oak/pe.d085:peMA.Ode7C1F1.mode	@ltx/swh_ke_oak/pe.d085:peMA.Ode7C1F1.mode
ltx/swh_redirects_oak/pe.d085:peMA.Ode7C1F1.ode	@ltx/swh_ke_oak/pe.d085:peMA.Ode7C1F1.ode
ltx/swh_redirects_oak/pe.d085:peMA.Ode7C1F1.text	@ltx/swh_ke_oak/pe.d085:peMA.Ode7C1F1.text
ltx/swh_redirects_oak/pe.d085:peMA.Ode7C1F2.incipit	@ltx/swh_ke_oak/pe.d085:peMA.Ode7C1F2.incipit
ltx/swh_redirects_oak/pe.d085:peMA.Ode7C1F2.melody	@ltx/swh_ke_oak/pe.d085:peMA.Ode7C1F2.melody
ltx/swh_redirects_oak/pe.d085:peMA.Ode7C1F2.mode	@ltx/swh_ke_oak/pe.d085:peMA.Ode7C1F2.mode
ltx/swh_redirects_oak/pe.d085:peMA.Ode7C1F2.ode	@ltx/swh_ke_oak/pe.d085:peMA.Ode7C1F2.ode
ltx/swh_redirects_oak/pe.d085:peMA.Ode7C1F2.text	@ltx/swh_ke_oak/pe.d085:peMA.Ode7C1F2.text
ltx/swh_redirects_oak/pe.d085:peMA.Ode7C1H.greekmelody	@ltx/swh_ke_oak/pe.d085:peMA.Ode7C1H.greekmelody
ltx/swh_redirects_oak/pe.d085:peMA.Ode7C1H.incipit	@ltx/swh_ke_oak/pe.d085:peMA.Ode7C1H.incipit
ltx/swh_redirects_oak/pe.d085:peMA.Ode7C1H.melody	@ltx/swh_ke_oak/pe.d085:peMA.Ode7C1H.melody
ltx/swh_redirects_oak/pe.d085:peMA.Ode7C1H.mode	@ltx/swh_ke_oak/pe.d085:peMA.Ode7C1H.mode
ltx/swh_redirects_oak/pe.d085:peMA.Ode7C1H.ode	@ltx/swh_ke_oak/pe.d085:peMA.Ode7C1H.ode
ltx/swh_redirects_oak/pe.d085:peMA.Ode7C1H.text	@ltx/swh_ke_oak/pe.d085:peMA.Ode7C1H.text
ltx/swh_redirects_oak/pe.d085:peMA.Ode7C1T.incipit	@ltx/swh_ke_oak/pe.d085:peMA.Ode7C1T.incipit
ltx/swh_redirects_oak/pe.d085:peMA.Ode7C1T.melody	@ltx/swh_ke_oak/pe.d085:peMA.Ode7C1T.melody
ltx/swh_redirects_oak/pe.d085:peMA.Ode7C1T.mode	@ltx/swh_ke_oak/pe.d085:peMA.Ode7C1T.mode
ltx/swh_redirects_oak/pe.d085:peMA.Ode7C1T.ode	@ltx/swh_ke_oak/pe.d085:peMA.Ode7C1T.ode
ltx/swh_redirects_oak/pe.d085:peMA.Ode7C1T.text	@ltx/swh_ke_oak/pe.d085:peMA.Ode7C1T.text
ltx/swh_redirects_oak/pe.d085:peMA.Ode7C1Tr.incipit	@ltx/swh_ke_oak/pe.d085:peMA.Ode7C1Tr.incipit
ltx/swh_redirects_oak/pe.d085:peMA.Ode7C1Tr.melody	@ltx/swh_ke_oak/pe.d085:peMA.Ode7C1Tr.melody
ltx/swh_redirects_oak/pe.d085:peMA.Ode7C1Tr.mode	@ltx/swh_ke_oak/pe.d085:peMA.Ode7C1Tr.mode
ltx/swh_redirects_oak/pe.d085:peMA.Ode7C1Tr.ode	@ltx/swh_ke_oak/pe.d085:peMA.Ode7C1Tr.ode
ltx/swh_redirects_oak/pe.d085:peMA.Ode7C1Tr.text	@ltx/swh_ke_oak/pe.d085:peMA.Ode7C1Tr.text
ltx/swh_redirects_oak/pe.d085:peMA.Ode8C11.greekmelody	@ltx/swh_ke_oak/pe.d085:peMA.Ode8C11.greekmelody
ltx/swh_redirects_oak/pe.d085:peMA.Ode8C11.incipit	@ltx/swh_ke_oak/pe.d085:peMA.Ode8C11.incipit
ltx/swh_redirects_oak/pe.d085:peMA.Ode8C11.melody	@ltx/swh_ke_oak/pe.d085:peMA.Ode8C11.melody
ltx/swh_redirects_oak/pe.d085:peMA.Ode8C11.mode	@ltx/swh_ke_oak/pe.d085:peMA.Ode8C11.mode
ltx/swh_redirects_oak/pe.d085:peMA.Ode8C11.ode	@ltx/swh_ke_oak/pe.d085:peMA.Ode8C11.ode
ltx/swh_redirects_oak/pe.d085:peMA.Ode8C11.text	@ltx/swh_ke_oak/pe.d085:peMA.Ode8C11.text
ltx/swh_redirects_oak/pe.d085:peMA.Ode8C12.incipit	@ltx/swh_ke_oak/pe.d085:peMA.Ode8C12.incipit
ltx/swh_redirects_oak/pe.d085:peMA.Ode8C12.melody	@ltx/swh_ke_oak/pe.d085:peMA.Ode8C12.melody
ltx/swh_redirects_oak/pe.d085:peMA.Ode8C12.mode	@ltx/swh_ke_oak/pe.d085:peMA.Ode8C12.mode
ltx/swh_redirects_oak/pe.d085:peMA.Ode8C12.ode	@ltx/swh_ke_oak/pe.d085:peMA.Ode8C12.ode
ltx/swh_redirects_oak/pe.d085:peMA.Ode8C12.text	@ltx/swh_ke_oak/pe.d085:peMA.Ode8C12.text
ltx/swh_redirects_oak/pe.d085:peMA.Ode8C13.incipit	@ltx/swh_ke_oak/pe.d085:peMA.Ode8C13.incipit
ltx/swh_redirects_oak/pe.d085:peMA.Ode8C13.melody	@ltx/swh_ke_oak/pe.d085:peMA.Ode8C13.melody
ltx/swh_redirects_oak/pe.d085:peMA.Ode8C13.mode	@ltx/swh_ke_oak/pe.d085:peMA.Ode8C13.mode
ltx/swh_redirects_oak/pe.d085:peMA.Ode8C13.ode	@ltx/swh_ke_oak/pe.d085:peMA.Ode8C13.ode
ltx/swh_redirects_oak/pe.d085:peMA.Ode8C13.text	@ltx/swh_ke_oak/pe.d085:peMA.Ode8C13.text
ltx/swh_redirects_oak/pe.d085:peMA.Ode8C14.incipit	@ltx/swh_ke_oak/pe.d085:peMA.Ode8C14.incipit
ltx/swh_redirects_oak/pe.d085:peMA.Ode8C14.melody	@ltx/swh_ke_oak/pe.d085:peMA.Ode8C14.melody
ltx/swh_redirects_oak/pe.d085:peMA.Ode8C14.mode	@ltx/swh_ke_oak/pe.d085:peMA.Ode8C14.mode
ltx/swh_redirects_oak/pe.d085:peMA.Ode8C14.ode	@ltx/swh_ke_oak/pe.d085:peMA.Ode8C14.ode
ltx/swh_redirects_oak/pe.d085:peMA.Ode8C14.text	@ltx/swh_ke_oak/pe.d085:peMA.Ode8C14.text
ltx/swh_redirects_oak/pe.d085:peMA.Ode8C15.incipit	@ltx/swh_ke_oak/pe.d085:peMA.Ode8C15.incipit
ltx/swh_redirects_oak/pe.d085:peMA.Ode8C15.melody	@ltx/swh_ke_oak/pe.d085:peMA.Ode8C15.melody
ltx/swh_redirects_oak/pe.d085:peMA.Ode8C15.mode	@ltx/swh_ke_oak/pe.d085:peMA.Ode8C15.mode
ltx/swh_redirects_oak/pe.d085:peMA.Ode8C15.ode	@ltx/swh_ke_oak/pe.d085:peMA.Ode8C15.ode
ltx/swh_redirects_oak/pe.d085:peMA.Ode8C15.text	@ltx/swh_ke_oak/pe.d085:peMA.Ode8C15.text
ltx/swh_redirects_oak/pe.d085:peMA.Ode8C16.incipit	@ltx/swh_ke_oak/pe.d085:peMA.Ode8C16.incipit
ltx/swh_redirects_oak/pe.d085:peMA.Ode8C16.melody	@ltx/swh_ke_oak/pe.d085:peMA.Ode8C16.melody
ltx/swh_redirects_oak/pe.d085:peMA.Ode8C16.mode	@ltx/swh_ke_oak/pe.d085:peMA.Ode8C16.mode
ltx/swh_redirects_oak/pe.d085:peMA.Ode8C16.ode	@ltx/swh_ke_oak/pe.d085:peMA.Ode8C16.ode
ltx/swh_redirects_oak/pe.d085:peMA.Ode8C16.text	@ltx/swh_ke_oak/pe.d085:peMA.Ode8C16.text
ltx/swh_redirects_oak/pe.d085:peMA.Ode8C17.incipit	@ltx/swh_ke_oak/pe.d085:peMA.Ode8C17.incipit
ltx/swh_redirects_oak/pe.d085:peMA.Ode8C17.melody	@ltx/swh_ke_oak/pe.d085:peMA.Ode8C17.melody
ltx/swh_redirects_oak/pe.d085:peMA.Ode8C17.mode	@ltx/swh_ke_oak/pe.d085:peMA.Ode8C17.mode
ltx/swh_redirects_oak/pe.d085:peMA.Ode8C17.ode	@ltx/swh_ke_oak/pe.d085:peMA.Ode8C17.ode
ltx/swh_redirects_oak/pe.d085:peMA.Ode8C17.text	@ltx/swh_ke_oak/pe.d085:peMA.Ode8C17.text
ltx/swh_redirects_oak/pe.d085:peMA.Ode8C1F1.greekmelody	@ltx/swh_ke_oak/pe.d085:peMA.Ode8C1F1.greekmelody
ltx/swh_redirects_oak/pe.d085:peMA.Ode8C1F1.incipit	@ltx/swh_ke_oak/pe.d085:peMA.Ode8C1F1.incipit
ltx/swh_redirects_oak/pe.d085:peMA.Ode8C1F1.melody	@ltx/swh_ke_oak/pe.d085:peMA.Ode8C1F1.melody
ltx/swh_redirects_oak/pe.d085:peMA.Ode8C1F1.mode	@ltx/swh_ke_oak/pe.d085:peMA.Ode8C1F1.mode
ltx/swh_redirects_oak/pe.d085:peMA.Ode8C1F1.ode	@ltx/swh_ke_oak/pe.d085:peMA.Ode8C1F1.ode
ltx/swh_redirects_oak/pe.d085:peMA.Ode8C1F1.text	@ltx/swh_ke_oak/pe.d085:peMA.Ode8C1F1.text
ltx/swh_redirects_oak/pe.d085:peMA.Ode8C1F2.incipit	@ltx/swh_ke_oak/pe.d085:peMA.Ode8C1F2.incipit
ltx/swh_redirects_oak/pe.d085:peMA.Ode8C1F2.melody	@ltx/swh_ke_oak/pe.d085:peMA.Ode8C1F2.melody
ltx/swh_redirects_oak/pe.d085:peMA.Ode8C1F2.mode	@ltx/swh_ke_oak/pe.d085:peMA.Ode8C1F2.mode
ltx/swh_redirects_oak/pe.d085:peMA.Ode8C1F2.ode	@ltx/swh_ke_oak/pe.d085:peMA.Ode8C1F2.ode
ltx/swh_redirects_oak/pe.d085:peMA.Ode8C1F2.text	@ltx/swh_ke_oak/pe.d085:peMA.Ode8C1F2.text
ltx/swh_redirects_oak/pe.d085:peMA.Ode8C1H.greekmelody	@ltx/swh_ke_oak/pe.d085:peMA.Ode8C1H.greekmelody
ltx/swh_redirects_oak/pe.d085:peMA.Ode8C1H.incipit	@ltx/swh_ke_oak/pe.d085:peMA.Ode8C1H.incipit
ltx/swh_redirects_oak/pe.d085:peMA.Ode8C1H.melody	@ltx/swh_ke_oak/pe.d085:peMA.Ode8C1H.melody
ltx/swh_redirects_oak/pe.d085:peMA.Ode8C1H.mode	@ltx/swh_ke_oak/pe.d085:peMA.Ode8C1H.mode
ltx/swh_redirects_oak/pe.d085:peMA.Ode8C1H.ode	@ltx/swh_ke_oak/pe.d085:peMA.Ode8C1H.ode
ltx/swh_redirects_oak/pe.d085:peMA.Ode8C1H.text	@ltx/swh_ke_oak/pe.d085:peMA.Ode8C1H.text
ltx/swh_redirects_oak/pe.d085:peMA.Ode8C1T.incipit	@ltx/swh_ke_oak/pe.d085:peMA.Ode8C1T.incipit
ltx/swh_redirects_oak/pe.d085:peMA.Ode8C1T.melody	@ltx/swh_ke_oak/pe.d085:peMA.Ode8C1T.melody
ltx/swh_redirects_oak/pe.d085:peMA.Ode8C1T.mode	@ltx/swh_ke_oak/pe.d085:peMA.Ode8C1T.mode
ltx/swh_redirects_oak/pe.d085:peMA.Ode8C1T.ode	@ltx/swh_ke_oak/pe.d085:peMA.Ode8C1T.ode
ltx/swh_redirects_oak/pe.d085:peMA.Ode8C1T.text	@ltx/swh_ke_oak/pe.d085:peMA.Ode8C1T.text
ltx/swh_redirects_oak/pe.d085:peMA.Ode8C1Tr.incipit	@ltx/swh_ke_oak/pe.d085:peMA.Ode8C1Tr.incipit
ltx/swh_redirects_oak/pe.d085:peMA.Ode8C1Tr.melody	@ltx/swh_ke_oak/pe.d085:peMA.Ode8C1Tr.melody
ltx/swh_redirects_oak/pe.d085:peMA.Ode8C1Tr.mode	@ltx/swh_ke_oak/pe.d085:peMA.Ode8C1Tr.mode
ltx/swh_redirects_oak/pe.d085:peMA.Ode8C1Tr.ode	@ltx/swh_ke_oak/pe.d085:peMA.Ode8C1Tr.ode
ltx/swh_redirects_oak/pe.d085:peMA.Ode8C1Tr.text	@ltx/swh_ke_oak/pe.d085:peMA.Ode8C1Tr.text
ltx/swh_redirects_oak/pe.d085:peMA.Ode9C11.greekmelody	@ltx/swh_ke_oak/pe.d085:peMA.Ode9C11.greekmelody
ltx/swh_redirects_oak/pe.d085:peMA.Ode9C11.incipit	@ltx/swh_ke_oak/pe.d085:peMA.Ode9C11.incipit
ltx/swh_redirects_oak/pe.d085:peMA.Ode9C11.melody	@ltx/swh_ke_oak/pe.d085:peMA.Ode9C11.melody
ltx/swh_redirects_oak/pe.d085:peMA.Ode9C11.mode	@ltx/swh_ke_oak/pe.d085:peMA.Ode9C11.mode
ltx/swh_redirects_oak/pe.d085:peMA.Ode9C11.ode	@ltx/swh_ke_oak/pe.d085:peMA.Ode9C11.ode
ltx/swh_redirects_oak/pe.d085:peMA.Ode9C11.text	@ltx/swh_ke_oak/pe.d085:peMA.Ode9C11.text
ltx/swh_redirects_oak/pe.d085:peMA.Ode9C12.incipit	@ltx/swh_ke_oak/pe.d085:peMA.Ode9C12.incipit
ltx/swh_redirects_oak/pe.d085:peMA.Ode9C12.melody	@ltx/swh_ke_oak/pe.d085:peMA.Ode9C12.melody
ltx/swh_redirects_oak/pe.d085:peMA.Ode9C12.mode	@ltx/swh_ke_oak/pe.d085:peMA.Ode9C12.mode
ltx/swh_redirects_oak/pe.d085:peMA.Ode9C12.ode	@ltx/swh_ke_oak/pe.d085:peMA.Ode9C12.ode
ltx/swh_redirects_oak/pe.d085:peMA.Ode9C12.text	@ltx/swh_ke_oak/pe.d085:peMA.Ode9C12.text
ltx/swh_redirects_oak/pe.d085:peMA.Ode9C13.incipit	@ltx/swh_ke_oak/pe.d085:peMA.Ode9C13.incipit
ltx/swh_redirects_oak/pe.d085:peMA.Ode9C13.melody	@ltx/swh_ke_oak/pe.d085:peMA.Ode9C13.melody
ltx/swh_redirects_oak/pe.d085:peMA.Ode9C13.mode	@ltx/swh_ke_oak/pe.d085:peMA.Ode9C13.mode
ltx/swh_redirects_oak/pe.d085:peMA.Ode9C13.ode	@ltx/swh_ke_oak/pe.d085:peMA.Ode9C13.ode
ltx/swh_redirects_oak/pe.d085:peMA.Ode9C13.text	@ltx/swh_ke_oak/pe.d085:peMA.Ode9C13.text
ltx/swh_redirects_oak/pe.d085:peMA.Ode9C14.incipit	@ltx/swh_ke_oak/pe.d085:peMA.Ode9C14.incipit
ltx/swh_redirects_oak/pe.d085:peMA.Ode9C14.melody	@ltx/swh_ke_oak/pe.d085:peMA.Ode9C14.melody
ltx/swh_redirects_oak/pe.d085:peMA.Ode9C14.mode	@ltx/swh_ke_oak/pe.d085:peMA.Ode9C14.mode
ltx/swh_redirects_oak/pe.d085:peMA.Ode9C14.ode	@ltx/swh_ke_oak/pe.d085:peMA.Ode9C14.ode
ltx/swh_redirects_oak/pe.d085:peMA.Ode9C14.text	@ltx/swh_ke_oak/pe.d085:peMA.Ode9C14.text
ltx/swh_redirects_oak/pe.d085:peMA.Ode9C15.incipit	@ltx/swh_ke_oak/pe.d085:peMA.Ode9C15.incipit
ltx/swh_redirects_oak/pe.d085:peMA.Ode9C15.melody	@ltx/swh_ke_oak/pe.d085:peMA.Ode9C15.melody
ltx/swh_redirects_oak/pe.d085:peMA.Ode9C15.mode	@ltx/swh_ke_oak/pe.d085:peMA.Ode9C15.mode
ltx/swh_redirects_oak/pe.d085:peMA.Ode9C15.ode	@ltx/swh_ke_oak/pe.d085:peMA.Ode9C15.ode
ltx/swh_redirects_oak/pe.d085:peMA.Ode9C15.text	@ltx/swh_ke_oak/pe.d085:peMA.Ode9C15.text
ltx/swh_redirects_oak/pe.d085:peMA.Ode9C16.incipit	@ltx/swh_ke_oak/pe.d085:peMA.Ode9C16.incipit
ltx/swh_redirects_oak/pe.d085:peMA.Ode9C16.melody	@ltx/swh_ke_oak/pe.d085:peMA.Ode9C16.melody
ltx/swh_redirects_oak/pe.d085:peMA.Ode9C16.mode	@ltx/swh_ke_oak/pe.d085:peMA.Ode9C16.mode
ltx/swh_redirects_oak/pe.d085:peMA.Ode9C16.ode	@ltx/swh_ke_oak/pe.d085:peMA.Ode9C16.ode
ltx/swh_redirects_oak/pe.d085:peMA.Ode9C16.text	@ltx/swh_ke_oak/pe.d085:peMA.Ode9C16.text
ltx/swh_redirects_oak/pe.d085:peMA.Ode9C17.incipit	@ltx/swh_ke_oak/pe.d085:peMA.Ode9C17.incipit
ltx/swh_redirects_oak/pe.d085:peMA.Ode9C17.melody	@ltx/swh_ke_oak/pe.d085:peMA.Ode9C17.melody
ltx/swh_redirects_oak/pe.d085:peMA.Ode9C17.mode	@ltx/swh_ke_oak/pe.d085:peMA.Ode9C17.mode
ltx/swh_redirects_oak/pe.d085:peMA.Ode9C17.ode	@ltx/swh_ke_oak/pe.d085:peMA.Ode9C17.ode
ltx/swh_redirects_oak/pe.d085:peMA.Ode9C17.text	@ltx/swh_ke_oak/pe.d085:peMA.Ode9C17.text
ltx/swh_redirects_oak/pe.d085:peMA.Ode9C18.incipit	@ltx/swh_ke_oak/pe.d085:peMA.Ode9C18.incipit
ltx/swh_redirects_oak/pe.d085:peMA.Ode9C18.melody	@ltx/swh_ke_oak/pe.d085:peMA.Ode9C18.melody
ltx/swh_redirects_oak/pe.d085:peMA.Ode9C18.mode	@ltx/swh_ke_oak/pe.d085:peMA.Ode9C18.mode
ltx/swh_redirects_oak/pe.d085:peMA.Ode9C18.ode	@ltx/swh_ke_oak/pe.d085:peMA.Ode9C18.ode
ltx/swh_redirects_oak/pe.d085:peMA.Ode9C18.text	@ltx/swh_ke_oak/pe.d085:peMA.Ode9C18.text
ltx/swh_redirects_oak/pe.d085:peMA.Ode9C1F1.greekmelody	@ltx/swh_ke_oak/pe.d085:peMA.Ode9C1F1.greekmelody
ltx/swh_redirects_oak/pe.d085:peMA.Ode9C1F1.incipit	@ltx/swh_ke_oak/pe.d085:peMA.Ode9C1F1.incipit
ltx/swh_redirects_oak/pe.d085:peMA.Ode9C1F1.melody	@ltx/swh_ke_oak/pe.d085:peMA.Ode9C1F1.melody
ltx/swh_redirects_oak/pe.d085:peMA.Ode9C1F1.mode	@ltx/swh_ke_oak/pe.d085:peMA.Ode9C1F1.mode
ltx/swh_redirects_oak/pe.d085:peMA.Ode9C1F1.ode	@ltx/swh_ke_oak/pe.d085:peMA.Ode9C1F1.ode
ltx/swh_redirects_oak/pe.d085:peMA.Ode9C1F1.text	@ltx/swh_ke_oak/pe.d085:peMA.Ode9C1F1.text
ltx/swh_redirects_oak/pe.d085:peMA.Ode9C1F2.incipit	@ltx/swh_ke_oak/pe.d085:peMA.Ode9C1F2.incipit
ltx/swh_redirects_oak/pe.d085:peMA.Ode9C1F2.melody	@ltx/swh_ke_oak/pe.d085:peMA.Ode9C1F2.melody
ltx/swh_redirects_oak/pe.d085:peMA.Ode9C1F2.mode	@ltx/swh_ke_oak/pe.d085:peMA.Ode9C1F2.mode
ltx/swh_redirects_oak/pe.d085:peMA.Ode9C1F2.ode	@ltx/swh_ke_oak/pe.d085:peMA.Ode9C1F2.ode
ltx/swh_redirects_oak/pe.d085:peMA.Ode9C1F2.text	@ltx/swh_ke_oak/pe.d085:peMA.Ode9C1F2.text
ltx/swh_redirects_oak/pe.d085:peMA.Ode9C1H.greekmelody	@ltx/swh_ke_oak/pe.d085:peMA.Ode9C1H.greekmelody
ltx/swh_redirects_oak/pe.d085:peMA.Ode9C1H.incipit	@ltx/swh_ke_oak/pe.d085:peMA.Ode9C1H.incipit
ltx/swh_redirects_oak/pe.d085:peMA.Ode9C1H.melody	@ltx/swh_ke_oak/pe.d085:peMA.Ode9C1H.melody
ltx/swh_redirects_oak/pe.d085:peMA.Ode9C1H.mode	@ltx/swh_ke_oak/pe.d085:peMA.Ode9C1H.mode
ltx/swh_redirects_oak/pe.d085:peMA.Ode9C1H.ode	@ltx/swh_ke_oak/pe.d085:peMA.Ode9C1H.ode
ltx/swh_redirects_oak/pe.d085:peMA.Ode9C1H.text	@ltx/swh_ke_oak/pe.d085:peMA.Ode9C1H.text
ltx/swh_redirects_oak/pe.d085:peMA.Ode9C1T.incipit	@ltx/swh_ke_oak/pe.d085:peMA.Ode9C1T.incipit
ltx/swh_redirects_oak/pe.d085:peMA.Ode9C1T.melody	@ltx/swh_ke_oak/pe.d085:peMA.Ode9C1T.melody
ltx/swh_redirects_oak/pe.d085:peMA.Ode9C1T.mode	@ltx/swh_ke_oak/pe.d085:peMA.Ode9C1T.mode
ltx/swh_redirects_oak/pe.d085:peMA.Ode9C1T.ode	@ltx/swh_ke_oak/pe.d085:peMA.Ode9C1T.ode
ltx/swh_redirects_oak/pe.d085:peMA.Ode9C1T.text	@ltx/swh_ke_oak/pe.d085:peMA.Ode9C1T.text
ltx/swh_redirects_oak/pe.d085:peMA.Ode9C1Tr.incipit	@ltx/swh_ke_oak/pe.d085:peMA.Ode9C1Tr.incipit
ltx/swh_redirects_oak/pe.d085:peMA.Ode9C1Tr.melody	@ltx/swh_ke_oak/pe.d085:peMA.Ode9C1Tr.melody
ltx/swh_redirects_oak/pe.d085:peMA.Ode9C1Tr.mode	@ltx/swh_ke_oak/pe.d085:peMA.Ode9C1Tr.mode
ltx/swh_redirects_oak/pe.d085:peMA.Ode9C1Tr.ode	@ltx/swh_ke_oak/pe.d085:peMA.Ode9C1Tr.ode
ltx/swh_redirects_oak/pe.d085:peMA.Ode9C1Tr.text	@ltx/swh_ke_oak/pe.d085:peMA.Ode9C1Tr.text
ltx/swh_redirects_oak/pe.d085:peMA.Oikos1.text	@ltx/swh_ke_oak/pe.d085:peMA.Oikos1.text
ltx/swh_redirects_oak/pe.d085:peSY.commemoration.couplet1.title	@ltx/swh_ke_oak/pe.d085:peSY.commemoration.couplet1.title
ltx/swh_redirects_oak/pe.d085:peSY.commemoration.couplet1.verse1	@ltx/swh_ke_oak/pe.d085:peSY.commemoration.couplet1.verse1
ltx/swh_redirects_oak/pe.d085:peSY.commemoration.couplet1.verse2	@ltx/swh_ke_oak/pe.d085:peSY.commemoration.couplet1.verse2
ltx/swh_redirects_oak/pe.d085:peSY.commemoration.narration.p01	@ltx/swh_ke_oak/pe.d085:peSY.commemoration.narration.p01
ltx/swh_redirects_oak/pe.d085:peSY.commemoration.narration.p02	@ltx/swh_ke_oak/pe.d085:peSY.commemoration.narration.p02
ltx/swh_redirects_oak/pe.d085:peSY.commemoration.narration.p03	@ltx/swh_ke_oak/pe.d085:peSY.commemoration.narration.p03
ltx/swh_redirects_oak/pe.d085:peSY.commemoration.narration.p04	@ltx/swh_ke_oak/pe.d085:peSY.commemoration.narration.p04
ltx/swh_redirects_oak/pe.d085:peSY.commemoration.narration.p05	@ltx/swh_ke_oak/pe.d085:peSY.commemoration.narration.p05
ltx/swh_redirects_oak/pe.d085:peSY.commemoration.narration.p06	@ltx/swh_ke_oak/pe.d085:peSY.commemoration.narration.p06
ltx/swh_redirects_oak/pe.d085:peSY.commemoration.narration.p07	@ltx/swh_ke_oak/pe.d085:peSY.commemoration.narration.p07
ltx/swh_redirects_oak/pe.d085:peSY.commemoration.text	@ltx/swh_ke_oak/pe.d085:peSY.commemoration.text
ltx/swh_redirects_oak/pe.d085:peSY.lastline	@ltx/swh_ke_oak/pe.d085:peSY.lastline
ltx/swh_redirects_oak/pe.d085:peVE.Apolytikion1.incipit	@ltx/swh_ke_oak/pe.d085:peVE.Apolytikion1.incipit
ltx/swh_redirects_oak/pe.d085:peVE.Apolytikion1.melody	@ltx/swh_ke_oak/pe.d085:peVE.Apolytikion1.melody
ltx/swh_redirects_oak/pe.d085:peVE.Apolytikion1.mode	@ltx/swh_ke_oak/pe.d085:peVE.Apolytikion1.mode
ltx/swh_redirects_oak/pe.d085:peVE.Apolytikion1.text	@ltx/swh_ke_oak/pe.d085:peVE.Apolytikion1.text
ltx/swh_redirects_oak/pe.d085:peVE.Apolytikion2.incipit	@ltx/swh_ke_oak/pe.d085:peVE.Apolytikion2.incipit
ltx/swh_redirects_oak/pe.d085:peVE.Apolytikion2.melody	@ltx/swh_ke_oak/pe.d085:peVE.Apolytikion2.melody
ltx/swh_redirects_oak/pe.d085:peVE.Apolytikion2.mode	@ltx/swh_ke_oak/pe.d085:peVE.Apolytikion2.mode
ltx/swh_redirects_oak/pe.d085:peVE.Apolytikion2.text	@ltx/swh_ke_oak/pe.d085:peVE.Apolytikion2.text
ltx/swh_redirects_oak/pe.d085:peVE.Apolytikion3.incipit	@ltx/swh_ke_oak/pe.d085:peVE.Apolytikion3.incipit
ltx/swh_redirects_oak/pe.d085:peVE.Apolytikion3.melody	@ltx/swh_ke_oak/pe.d085:peVE.Apolytikion3.melody
ltx/swh_redirects_oak/pe.d085:peVE.Apolytikion3.mode	@ltx/swh_ke_oak/pe.d085:peVE.Apolytikion3.mode
ltx/swh_redirects_oak/pe.d085:peVE.Apolytikion3.text	@ltx/swh_ke_oak/pe.d085:peVE.Apolytikion3.text
ltx/swh_redirects_oak/pe.d085:peVE.AposGlory.incipit	@ltx/swh_ke_oak/pe.d085:peVE.AposGlory.incipit
ltx/swh_redirects_oak/pe.d085:peVE.AposGlory.melody	@ltx/swh_ke_oak/pe.d085:peVE.AposGlory.melody
ltx/swh_redirects_oak/pe.d085:peVE.AposGlory.mode	@ltx/swh_ke_oak/pe.d085:peVE.AposGlory.mode
ltx/swh_redirects_oak/pe.d085:peVE.AposGlory.text	@ltx/swh_ke_oak/pe.d085:peVE.AposGlory.text
ltx/swh_redirects_oak/pe.d085:peVE.Lity1.incipit	@ltx/swh_ke_oak/pe.d085:peVE.Lity1.incipit
ltx/swh_redirects_oak/pe.d085:peVE.Lity1.melody	@ltx/swh_ke_oak/pe.d085:peVE.Lity1.melody
ltx/swh_redirects_oak/pe.d085:peVE.Lity1.mode	@ltx/swh_ke_oak/pe.d085:peVE.Lity1.mode
ltx/swh_redirects_oak/pe.d085:peVE.Lity1.text	@ltx/swh_ke_oak/pe.d085:peVE.Lity1.text
ltx/swh_redirects_oak/pe.d085:peVE.Lity2.incipit	@ltx/swh_ke_oak/pe.d085:peVE.Lity2.incipit
ltx/swh_redirects_oak/pe.d085:peVE.Lity2.melody	@ltx/swh_ke_oak/pe.d085:peVE.Lity2.melody
ltx/swh_redirects_oak/pe.d085:peVE.Lity2.mode	@ltx/swh_ke_oak/pe.d085:peVE.Lity2.mode
ltx/swh_redirects_oak/pe.d085:peVE.Lity2.text	@ltx/swh_ke_oak/pe.d085:peVE.Lity2.text
ltx/swh_redirects_oak/pe.d085:peVE.Lity3.incipit	@ltx/swh_ke_oak/pe.d085:peVE.Lity3.incipit
ltx/swh_redirects_oak/pe.d085:peVE.Lity3.melody	@ltx/swh_ke_oak/pe.d085:peVE.Lity3.melody
ltx/swh_redirects_oak/pe.d085:peVE.Lity3.mode	@ltx/swh_ke_oak/pe.d085:peVE.Lity3.mode
ltx/swh_redirects_oak/pe.d085:peVE.Lity3.text	@ltx/swh_ke_oak/pe.d085:peVE.Lity3.text
ltx/swh_redirects_oak/pe.d085:peVE.LityBoth.incipit	@ltx/swh_ke_oak/pe.d085:peVE.LityBoth.incipit
ltx/swh_redirects_oak/pe.d085:peVE.LityBoth.melody	@ltx/swh_ke_oak/pe.d085:peVE.LityBoth.melody
ltx/swh_redirects_oak/pe.d085:peVE.LityBoth.mode	@ltx/swh_ke_oak/pe.d085:peVE.LityBoth.mode
ltx/swh_redirects_oak/pe.d085:peVE.LityBoth.text	@ltx/swh_ke_oak/pe.d085:peVE.LityBoth.text
ltx/swh_redirects_oak/pe.d085:peVE.LityGlory.incipit	@ltx/swh_ke_oak/pe.d085:peVE.LityGlory.incipit
ltx/swh_redirects_oak/pe.d085:peVE.LityGlory.melody	@ltx/swh_ke_oak/pe.d085:peVE.LityGlory.melody
ltx/swh_redirects_oak/pe.d085:peVE.LityGlory.mode	@ltx/swh_ke_oak/pe.d085:peVE.LityGlory.mode
ltx/swh_redirects_oak/pe.d085:peVE.LityGlory.text	@ltx/swh_ke_oak/pe.d085:peVE.LityGlory.text
ltx/swh_redirects_oak/pe.d085:peVE.MM.Stichera8910as567.text	@ltx/swh_ke_oak/pe.d085:peVE.MM.Stichera8910as567.text
ltx/swh_redirects_oak/pe.d085:peVE.MM.Stichera89as56.text	@ltx/swh_ke_oak/pe.d085:peVE.MM.Stichera89as56.text
ltx/swh_redirects_oak/pe.d085:peVE.SticGlory.incipit	@ltx/swh_ke_oak/pe.d085:peVE.SticGlory.incipit
ltx/swh_redirects_oak/pe.d085:peVE.SticGlory.melody	@ltx/swh_ke_oak/pe.d085:peVE.SticGlory.melody
ltx/swh_redirects_oak/pe.d085:peVE.SticGlory.mode	@ltx/swh_ke_oak/pe.d085:peVE.SticGlory.mode
ltx/swh_redirects_oak/pe.d085:peVE.SticGlory.poet	@ltx/swh_ke_oak/pe.d085:peVE.SticGlory.poet
ltx/swh_redirects_oak/pe.d085:peVE.SticGlory.text	@ltx/swh_ke_oak/pe.d085:peVE.SticGlory.text
ltx/swh_redirects_oak/pe.d085:peVE.Stichera08.incipit	@ltx/swh_ke_oak/pe.d085:peVE.Stichera08.incipit
ltx/swh_redirects_oak/pe.d085:peVE.Stichera08.melody	@ltx/swh_ke_oak/pe.d085:peVE.Stichera08.melody
ltx/swh_redirects_oak/pe.d085:peVE.Stichera08.mode	@ltx/swh_ke_oak/pe.d085:peVE.Stichera08.mode
ltx/swh_redirects_oak/pe.d085:peVE.Stichera08.poet	@ltx/swh_ke_oak/pe.d085:peVE.Stichera08.poet
ltx/swh_redirects_oak/pe.d085:peVE.Stichera08.text	@ltx/swh_ke_oak/pe.d085:peVE.Stichera08.text
ltx/swh_redirects_oak/pe.d085:peVE.Stichera09.incipit	@ltx/swh_ke_oak/pe.d085:peVE.Stichera09.incipit
ltx/swh_redirects_oak/pe.d085:peVE.Stichera09.melody	@ltx/swh_ke_oak/pe.d085:peVE.Stichera09.melody
ltx/swh_redirects_oak/pe.d085:peVE.Stichera09.mode	@ltx/swh_ke_oak/pe.d085:peVE.Stichera09.mode
ltx/swh_redirects_oak/pe.d085:peVE.Stichera09.poet	@ltx/swh_ke_oak/pe.d085:peVE.Stichera09.poet
ltx/swh_redirects_oak/pe.d085:peVE.Stichera09.text	@ltx/swh_ke_oak/pe.d085:peVE.Stichera09.text
ltx/swh_redirects_oak/pe.d085:peVE.Stichera10.incipit	@ltx/swh_ke_oak/pe.d085:peVE.Stichera10.incipit
ltx/swh_redirects_oak/pe.d085:peVE.Stichera10.melody	@ltx/swh_ke_oak/pe.d085:peVE.Stichera10.melody
ltx/swh_redirects_oak/pe.d085:peVE.Stichera10.mode	@ltx/swh_ke_oak/pe.d085:peVE.Stichera10.mode
ltx/swh_redirects_oak/pe.d085:peVE.Stichera10.text	@ltx/swh_ke_oak/pe.d085:peVE.Stichera10.text
