ltx/swh_redirects_oak/le.pr.tr.d039:lemcTE.reading1.book_abbr	@ltx/swh_ke_oak/le.pr.tr.d039:lemcTE.reading1.book_abbr
ltx/swh_redirects_oak/le.pr.tr.d039:lemcTE.reading1.book_string	@ltx/swh_ke_oak/le.pr.tr.d039:lemcTE.reading1.book_string
ltx/swh_redirects_oak/le.pr.tr.d039:lemcTE.reading1.chapverse	@ltx/swh_ke_oak/le.pr.tr.d039:lemcTE.reading1.chapverse
ltx/swh_redirects_oak/le.pr.tr.d039:lemcTE.reading1.incipit	@ltx/swh_ke_oak/le.pr.tr.d039:lemcTE.reading1.incipit
ltx/swh_redirects_oak/le.pr.tr.d039:lemcTE.reading1.text	@ltx/swh_ke_oak/le.pr.tr.d039:lemcTE.reading1.text
ltx/swh_redirects_oak/le.pr.tr.d039:lemcTE.reading1.title	@ltx/swh_ke_oak/le.pr.tr.d039:lemcTE.reading1.title
ltx/swh_redirects_oak/le.pr.tr.d039:lemcTE.reading1.title_abbr	@ltx/swh_ke_oak/le.pr.tr.d039:lemcTE.reading1.title_abbr
ltx/swh_redirects_oak/le.pr.tr.d039:lemcTE.reading1.version	@ltx/swh_ke_oak/le.pr.tr.d039:lemcTE.reading1.version
ltx/swh_redirects_oak/le.pr.tr.d039:lemcVE.reading1.book_abbr	@ltx/swh_ke_oak/le.pr.tr.d039:lemcVE.reading1.book_abbr
ltx/swh_redirects_oak/le.pr.tr.d039:lemcVE.reading1.book_string	@ltx/swh_ke_oak/le.pr.tr.d039:lemcVE.reading1.book_string
ltx/swh_redirects_oak/le.pr.tr.d039:lemcVE.reading1.chapverse	@ltx/swh_ke_oak/le.pr.tr.d039:lemcVE.reading1.chapverse
ltx/swh_redirects_oak/le.pr.tr.d039:lemcVE.reading1.incipit	@ltx/swh_ke_oak/le.pr.tr.d039:lemcVE.reading1.incipit
ltx/swh_redirects_oak/le.pr.tr.d039:lemcVE.reading1.text	@ltx/swh_ke_oak/le.pr.tr.d039:lemcVE.reading1.text
ltx/swh_redirects_oak/le.pr.tr.d039:lemcVE.reading1.title	@ltx/swh_ke_oak/le.pr.tr.d039:lemcVE.reading1.title
ltx/swh_redirects_oak/le.pr.tr.d039:lemcVE.reading1.title_abbr	@ltx/swh_ke_oak/le.pr.tr.d039:lemcVE.reading1.title_abbr
ltx/swh_redirects_oak/le.pr.tr.d039:lemcVE.reading1.version	@ltx/swh_ke_oak/le.pr.tr.d039:lemcVE.reading1.version
ltx/swh_redirects_oak/le.pr.tr.d039:lemcVE.reading2.book_abbr	@ltx/swh_ke_oak/le.pr.tr.d039:lemcVE.reading2.book_abbr
ltx/swh_redirects_oak/le.pr.tr.d039:lemcVE.reading2.book_string	@ltx/swh_ke_oak/le.pr.tr.d039:lemcVE.reading2.book_string
ltx/swh_redirects_oak/le.pr.tr.d039:lemcVE.reading2.chapverse	@ltx/swh_ke_oak/le.pr.tr.d039:lemcVE.reading2.chapverse
ltx/swh_redirects_oak/le.pr.tr.d039:lemcVE.reading2.incipit	@ltx/swh_ke_oak/le.pr.tr.d039:lemcVE.reading2.incipit
ltx/swh_redirects_oak/le.pr.tr.d039:lemcVE.reading2.text	@ltx/swh_ke_oak/le.pr.tr.d039:lemcVE.reading2.text
ltx/swh_redirects_oak/le.pr.tr.d039:lemcVE.reading2.title	@ltx/swh_ke_oak/le.pr.tr.d039:lemcVE.reading2.title
ltx/swh_redirects_oak/le.pr.tr.d039:lemcVE.reading2.title_abbr	@ltx/swh_ke_oak/le.pr.tr.d039:lemcVE.reading2.title_abbr
ltx/swh_redirects_oak/le.pr.tr.d039:lemcVE.reading2.version	@ltx/swh_ke_oak/le.pr.tr.d039:lemcVE.reading2.version
