ltx/swh_redirects_oak/tr.d066:trCO.Kathisma11.incipit	@ltx/swh_ke_oak/tr.d066:trCO.Kathisma11.incipit
ltx/swh_redirects_oak/tr.d066:trCO.Kathisma11.melody	@ltx/swh_ke_oak/tr.d066:trCO.Kathisma11.melody
ltx/swh_redirects_oak/tr.d066:trCO.Kathisma11.mode	@ltx/swh_ke_oak/tr.d066:trCO.Kathisma11.mode
ltx/swh_redirects_oak/tr.d066:trCO.Kathisma11.text	@ltx/swh_ke_oak/tr.d066:trCO.Kathisma11.text
ltx/swh_redirects_oak/tr.d066:trCO.Ode2C11.incipit	@ltx/swh_ke_oak/tr.d066:trCO.Ode2C11.incipit
ltx/swh_redirects_oak/tr.d066:trCO.Ode2C11.melody	@ltx/swh_ke_oak/tr.d066:trCO.Ode2C11.melody
ltx/swh_redirects_oak/tr.d066:trCO.Ode2C11.mode	@ltx/swh_ke_oak/tr.d066:trCO.Ode2C11.mode
ltx/swh_redirects_oak/tr.d066:trCO.Ode2C11.ode	@ltx/swh_ke_oak/tr.d066:trCO.Ode2C11.ode
ltx/swh_redirects_oak/tr.d066:trCO.Ode2C11.text	@ltx/swh_ke_oak/tr.d066:trCO.Ode2C11.text
ltx/swh_redirects_oak/tr.d066:trCO.Ode2C12.incipit	@ltx/swh_ke_oak/tr.d066:trCO.Ode2C12.incipit
ltx/swh_redirects_oak/tr.d066:trCO.Ode2C12.melody	@ltx/swh_ke_oak/tr.d066:trCO.Ode2C12.melody
ltx/swh_redirects_oak/tr.d066:trCO.Ode2C12.mode	@ltx/swh_ke_oak/tr.d066:trCO.Ode2C12.mode
ltx/swh_redirects_oak/tr.d066:trCO.Ode2C12.ode	@ltx/swh_ke_oak/tr.d066:trCO.Ode2C12.ode
ltx/swh_redirects_oak/tr.d066:trCO.Ode2C12.text	@ltx/swh_ke_oak/tr.d066:trCO.Ode2C12.text
ltx/swh_redirects_oak/tr.d066:trCO.Ode2C13.incipit	@ltx/swh_ke_oak/tr.d066:trCO.Ode2C13.incipit
ltx/swh_redirects_oak/tr.d066:trCO.Ode2C13.melody	@ltx/swh_ke_oak/tr.d066:trCO.Ode2C13.melody
ltx/swh_redirects_oak/tr.d066:trCO.Ode2C13.mode	@ltx/swh_ke_oak/tr.d066:trCO.Ode2C13.mode
ltx/swh_redirects_oak/tr.d066:trCO.Ode2C13.ode	@ltx/swh_ke_oak/tr.d066:trCO.Ode2C13.ode
ltx/swh_redirects_oak/tr.d066:trCO.Ode2C13.text	@ltx/swh_ke_oak/tr.d066:trCO.Ode2C13.text
ltx/swh_redirects_oak/tr.d066:trCO.Ode2C1H.incipit	@ltx/swh_ke_oak/tr.d066:trCO.Ode2C1H.incipit
ltx/swh_redirects_oak/tr.d066:trCO.Ode2C1H.melody	@ltx/swh_ke_oak/tr.d066:trCO.Ode2C1H.melody
ltx/swh_redirects_oak/tr.d066:trCO.Ode2C1H.mode	@ltx/swh_ke_oak/tr.d066:trCO.Ode2C1H.mode
ltx/swh_redirects_oak/tr.d066:trCO.Ode2C1H.ode	@ltx/swh_ke_oak/tr.d066:trCO.Ode2C1H.ode
ltx/swh_redirects_oak/tr.d066:trCO.Ode2C1H.text	@ltx/swh_ke_oak/tr.d066:trCO.Ode2C1H.text
ltx/swh_redirects_oak/tr.d066:trCO.Ode2C1T.incipit	@ltx/swh_ke_oak/tr.d066:trCO.Ode2C1T.incipit
ltx/swh_redirects_oak/tr.d066:trCO.Ode2C1T.melody	@ltx/swh_ke_oak/tr.d066:trCO.Ode2C1T.melody
ltx/swh_redirects_oak/tr.d066:trCO.Ode2C1T.mode	@ltx/swh_ke_oak/tr.d066:trCO.Ode2C1T.mode
ltx/swh_redirects_oak/tr.d066:trCO.Ode2C1T.ode	@ltx/swh_ke_oak/tr.d066:trCO.Ode2C1T.ode
ltx/swh_redirects_oak/tr.d066:trCO.Ode2C1T.text	@ltx/swh_ke_oak/tr.d066:trCO.Ode2C1T.text
ltx/swh_redirects_oak/tr.d066:trCO.Ode2C21.incipit	@ltx/swh_ke_oak/tr.d066:trCO.Ode2C21.incipit
ltx/swh_redirects_oak/tr.d066:trCO.Ode2C21.melody	@ltx/swh_ke_oak/tr.d066:trCO.Ode2C21.melody
ltx/swh_redirects_oak/tr.d066:trCO.Ode2C21.mode	@ltx/swh_ke_oak/tr.d066:trCO.Ode2C21.mode
ltx/swh_redirects_oak/tr.d066:trCO.Ode2C21.ode	@ltx/swh_ke_oak/tr.d066:trCO.Ode2C21.ode
ltx/swh_redirects_oak/tr.d066:trCO.Ode2C21.text	@ltx/swh_ke_oak/tr.d066:trCO.Ode2C21.text
ltx/swh_redirects_oak/tr.d066:trCO.Ode2C22.incipit	@ltx/swh_ke_oak/tr.d066:trCO.Ode2C22.incipit
ltx/swh_redirects_oak/tr.d066:trCO.Ode2C22.melody	@ltx/swh_ke_oak/tr.d066:trCO.Ode2C22.melody
ltx/swh_redirects_oak/tr.d066:trCO.Ode2C22.mode	@ltx/swh_ke_oak/tr.d066:trCO.Ode2C22.mode
ltx/swh_redirects_oak/tr.d066:trCO.Ode2C22.ode	@ltx/swh_ke_oak/tr.d066:trCO.Ode2C22.ode
ltx/swh_redirects_oak/tr.d066:trCO.Ode2C22.text	@ltx/swh_ke_oak/tr.d066:trCO.Ode2C22.text
ltx/swh_redirects_oak/tr.d066:trCO.Ode2C23.incipit	@ltx/swh_ke_oak/tr.d066:trCO.Ode2C23.incipit
ltx/swh_redirects_oak/tr.d066:trCO.Ode2C23.melody	@ltx/swh_ke_oak/tr.d066:trCO.Ode2C23.melody
ltx/swh_redirects_oak/tr.d066:trCO.Ode2C23.mode	@ltx/swh_ke_oak/tr.d066:trCO.Ode2C23.mode
ltx/swh_redirects_oak/tr.d066:trCO.Ode2C23.ode	@ltx/swh_ke_oak/tr.d066:trCO.Ode2C23.ode
ltx/swh_redirects_oak/tr.d066:trCO.Ode2C23.text	@ltx/swh_ke_oak/tr.d066:trCO.Ode2C23.text
ltx/swh_redirects_oak/tr.d066:trCO.Ode2C24.incipit	@ltx/swh_ke_oak/tr.d066:trCO.Ode2C24.incipit
ltx/swh_redirects_oak/tr.d066:trCO.Ode2C24.melody	@ltx/swh_ke_oak/tr.d066:trCO.Ode2C24.melody
ltx/swh_redirects_oak/tr.d066:trCO.Ode2C24.mode	@ltx/swh_ke_oak/tr.d066:trCO.Ode2C24.mode
ltx/swh_redirects_oak/tr.d066:trCO.Ode2C24.ode	@ltx/swh_ke_oak/tr.d066:trCO.Ode2C24.ode
ltx/swh_redirects_oak/tr.d066:trCO.Ode2C24.text	@ltx/swh_ke_oak/tr.d066:trCO.Ode2C24.text
ltx/swh_redirects_oak/tr.d066:trCO.Ode2C25.incipit	@ltx/swh_ke_oak/tr.d066:trCO.Ode2C25.incipit
ltx/swh_redirects_oak/tr.d066:trCO.Ode2C25.melody	@ltx/swh_ke_oak/tr.d066:trCO.Ode2C25.melody
ltx/swh_redirects_oak/tr.d066:trCO.Ode2C25.mode	@ltx/swh_ke_oak/tr.d066:trCO.Ode2C25.mode
ltx/swh_redirects_oak/tr.d066:trCO.Ode2C25.ode	@ltx/swh_ke_oak/tr.d066:trCO.Ode2C25.ode
ltx/swh_redirects_oak/tr.d066:trCO.Ode2C25.text	@ltx/swh_ke_oak/tr.d066:trCO.Ode2C25.text
ltx/swh_redirects_oak/tr.d066:trCO.Ode2C2H.incipit	@ltx/swh_ke_oak/tr.d066:trCO.Ode2C2H.incipit
ltx/swh_redirects_oak/tr.d066:trCO.Ode2C2H.melody	@ltx/swh_ke_oak/tr.d066:trCO.Ode2C2H.melody
ltx/swh_redirects_oak/tr.d066:trCO.Ode2C2H.mode	@ltx/swh_ke_oak/tr.d066:trCO.Ode2C2H.mode
ltx/swh_redirects_oak/tr.d066:trCO.Ode2C2H.ode	@ltx/swh_ke_oak/tr.d066:trCO.Ode2C2H.ode
ltx/swh_redirects_oak/tr.d066:trCO.Ode2C2H.text	@ltx/swh_ke_oak/tr.d066:trCO.Ode2C2H.text
ltx/swh_redirects_oak/tr.d066:trCO.Ode2C2T.incipit	@ltx/swh_ke_oak/tr.d066:trCO.Ode2C2T.incipit
ltx/swh_redirects_oak/tr.d066:trCO.Ode2C2T.melody	@ltx/swh_ke_oak/tr.d066:trCO.Ode2C2T.melody
ltx/swh_redirects_oak/tr.d066:trCO.Ode2C2T.mode	@ltx/swh_ke_oak/tr.d066:trCO.Ode2C2T.mode
ltx/swh_redirects_oak/tr.d066:trCO.Ode2C2T.ode	@ltx/swh_ke_oak/tr.d066:trCO.Ode2C2T.ode
ltx/swh_redirects_oak/tr.d066:trCO.Ode2C2T.text	@ltx/swh_ke_oak/tr.d066:trCO.Ode2C2T.text
ltx/swh_redirects_oak/tr.d066:trCO.Ode2C2Tr.incipit	@ltx/swh_ke_oak/tr.d066:trCO.Ode2C2Tr.incipit
ltx/swh_redirects_oak/tr.d066:trCO.Ode2C2Tr.melody	@ltx/swh_ke_oak/tr.d066:trCO.Ode2C2Tr.melody
ltx/swh_redirects_oak/tr.d066:trCO.Ode2C2Tr.mode	@ltx/swh_ke_oak/tr.d066:trCO.Ode2C2Tr.mode
ltx/swh_redirects_oak/tr.d066:trCO.Ode2C2Tr.ode	@ltx/swh_ke_oak/tr.d066:trCO.Ode2C2Tr.ode
ltx/swh_redirects_oak/tr.d066:trCO.Ode2C2Tr.text	@ltx/swh_ke_oak/tr.d066:trCO.Ode2C2Tr.text
ltx/swh_redirects_oak/tr.d066:trCO.Ode8C11.incipit	@ltx/swh_ke_oak/tr.d066:trCO.Ode8C11.incipit
ltx/swh_redirects_oak/tr.d066:trCO.Ode8C11.melody	@ltx/swh_ke_oak/tr.d066:trCO.Ode8C11.melody
ltx/swh_redirects_oak/tr.d066:trCO.Ode8C11.mode	@ltx/swh_ke_oak/tr.d066:trCO.Ode8C11.mode
ltx/swh_redirects_oak/tr.d066:trCO.Ode8C11.ode	@ltx/swh_ke_oak/tr.d066:trCO.Ode8C11.ode
ltx/swh_redirects_oak/tr.d066:trCO.Ode8C11.text	@ltx/swh_ke_oak/tr.d066:trCO.Ode8C11.text
ltx/swh_redirects_oak/tr.d066:trCO.Ode8C12.incipit	@ltx/swh_ke_oak/tr.d066:trCO.Ode8C12.incipit
ltx/swh_redirects_oak/tr.d066:trCO.Ode8C12.melody	@ltx/swh_ke_oak/tr.d066:trCO.Ode8C12.melody
ltx/swh_redirects_oak/tr.d066:trCO.Ode8C12.mode	@ltx/swh_ke_oak/tr.d066:trCO.Ode8C12.mode
ltx/swh_redirects_oak/tr.d066:trCO.Ode8C12.ode	@ltx/swh_ke_oak/tr.d066:trCO.Ode8C12.ode
ltx/swh_redirects_oak/tr.d066:trCO.Ode8C12.text	@ltx/swh_ke_oak/tr.d066:trCO.Ode8C12.text
ltx/swh_redirects_oak/tr.d066:trCO.Ode8C13.incipit	@ltx/swh_ke_oak/tr.d066:trCO.Ode8C13.incipit
ltx/swh_redirects_oak/tr.d066:trCO.Ode8C13.melody	@ltx/swh_ke_oak/tr.d066:trCO.Ode8C13.melody
ltx/swh_redirects_oak/tr.d066:trCO.Ode8C13.mode	@ltx/swh_ke_oak/tr.d066:trCO.Ode8C13.mode
ltx/swh_redirects_oak/tr.d066:trCO.Ode8C13.ode	@ltx/swh_ke_oak/tr.d066:trCO.Ode8C13.ode
ltx/swh_redirects_oak/tr.d066:trCO.Ode8C13.text	@ltx/swh_ke_oak/tr.d066:trCO.Ode8C13.text
ltx/swh_redirects_oak/tr.d066:trCO.Ode8C14.incipit	@ltx/swh_ke_oak/tr.d066:trCO.Ode8C14.incipit
ltx/swh_redirects_oak/tr.d066:trCO.Ode8C14.melody	@ltx/swh_ke_oak/tr.d066:trCO.Ode8C14.melody
ltx/swh_redirects_oak/tr.d066:trCO.Ode8C14.mode	@ltx/swh_ke_oak/tr.d066:trCO.Ode8C14.mode
ltx/swh_redirects_oak/tr.d066:trCO.Ode8C14.ode	@ltx/swh_ke_oak/tr.d066:trCO.Ode8C14.ode
ltx/swh_redirects_oak/tr.d066:trCO.Ode8C14.text	@ltx/swh_ke_oak/tr.d066:trCO.Ode8C14.text
ltx/swh_redirects_oak/tr.d066:trCO.Ode8C15.incipit	@ltx/swh_ke_oak/tr.d066:trCO.Ode8C15.incipit
ltx/swh_redirects_oak/tr.d066:trCO.Ode8C15.melody	@ltx/swh_ke_oak/tr.d066:trCO.Ode8C15.melody
ltx/swh_redirects_oak/tr.d066:trCO.Ode8C15.mode	@ltx/swh_ke_oak/tr.d066:trCO.Ode8C15.mode
ltx/swh_redirects_oak/tr.d066:trCO.Ode8C15.ode	@ltx/swh_ke_oak/tr.d066:trCO.Ode8C15.ode
ltx/swh_redirects_oak/tr.d066:trCO.Ode8C15.text	@ltx/swh_ke_oak/tr.d066:trCO.Ode8C15.text
ltx/swh_redirects_oak/tr.d066:trCO.Ode8C16.incipit	@ltx/swh_ke_oak/tr.d066:trCO.Ode8C16.incipit
ltx/swh_redirects_oak/tr.d066:trCO.Ode8C16.melody	@ltx/swh_ke_oak/tr.d066:trCO.Ode8C16.melody
ltx/swh_redirects_oak/tr.d066:trCO.Ode8C16.mode	@ltx/swh_ke_oak/tr.d066:trCO.Ode8C16.mode
ltx/swh_redirects_oak/tr.d066:trCO.Ode8C16.ode	@ltx/swh_ke_oak/tr.d066:trCO.Ode8C16.ode
ltx/swh_redirects_oak/tr.d066:trCO.Ode8C16.text	@ltx/swh_ke_oak/tr.d066:trCO.Ode8C16.text
ltx/swh_redirects_oak/tr.d066:trCO.Ode8C1H.incipit	@ltx/swh_ke_oak/tr.d066:trCO.Ode8C1H.incipit
ltx/swh_redirects_oak/tr.d066:trCO.Ode8C1H.melody	@ltx/swh_ke_oak/tr.d066:trCO.Ode8C1H.melody
ltx/swh_redirects_oak/tr.d066:trCO.Ode8C1H.mode	@ltx/swh_ke_oak/tr.d066:trCO.Ode8C1H.mode
ltx/swh_redirects_oak/tr.d066:trCO.Ode8C1H.ode	@ltx/swh_ke_oak/tr.d066:trCO.Ode8C1H.ode
ltx/swh_redirects_oak/tr.d066:trCO.Ode8C1H.text	@ltx/swh_ke_oak/tr.d066:trCO.Ode8C1H.text
ltx/swh_redirects_oak/tr.d066:trCO.Ode8C1T.incipit	@ltx/swh_ke_oak/tr.d066:trCO.Ode8C1T.incipit
ltx/swh_redirects_oak/tr.d066:trCO.Ode8C1T.melody	@ltx/swh_ke_oak/tr.d066:trCO.Ode8C1T.melody
ltx/swh_redirects_oak/tr.d066:trCO.Ode8C1T.mode	@ltx/swh_ke_oak/tr.d066:trCO.Ode8C1T.mode
ltx/swh_redirects_oak/tr.d066:trCO.Ode8C1T.ode	@ltx/swh_ke_oak/tr.d066:trCO.Ode8C1T.ode
ltx/swh_redirects_oak/tr.d066:trCO.Ode8C1T.text	@ltx/swh_ke_oak/tr.d066:trCO.Ode8C1T.text
ltx/swh_redirects_oak/tr.d066:trCO.Ode8C1Tr.incipit	@ltx/swh_ke_oak/tr.d066:trCO.Ode8C1Tr.incipit
ltx/swh_redirects_oak/tr.d066:trCO.Ode8C1Tr.melody	@ltx/swh_ke_oak/tr.d066:trCO.Ode8C1Tr.melody
ltx/swh_redirects_oak/tr.d066:trCO.Ode8C1Tr.mode	@ltx/swh_ke_oak/tr.d066:trCO.Ode8C1Tr.mode
ltx/swh_redirects_oak/tr.d066:trCO.Ode8C1Tr.ode	@ltx/swh_ke_oak/tr.d066:trCO.Ode8C1Tr.ode
ltx/swh_redirects_oak/tr.d066:trCO.Ode8C1Tr.text	@ltx/swh_ke_oak/tr.d066:trCO.Ode8C1Tr.text
ltx/swh_redirects_oak/tr.d066:trCO.Ode9C11.incipit	@ltx/swh_ke_oak/tr.d066:trCO.Ode9C11.incipit
ltx/swh_redirects_oak/tr.d066:trCO.Ode9C11.melody	@ltx/swh_ke_oak/tr.d066:trCO.Ode9C11.melody
ltx/swh_redirects_oak/tr.d066:trCO.Ode9C11.mode	@ltx/swh_ke_oak/tr.d066:trCO.Ode9C11.mode
ltx/swh_redirects_oak/tr.d066:trCO.Ode9C11.ode	@ltx/swh_ke_oak/tr.d066:trCO.Ode9C11.ode
ltx/swh_redirects_oak/tr.d066:trCO.Ode9C11.text	@ltx/swh_ke_oak/tr.d066:trCO.Ode9C11.text
ltx/swh_redirects_oak/tr.d066:trCO.Ode9C12.incipit	@ltx/swh_ke_oak/tr.d066:trCO.Ode9C12.incipit
ltx/swh_redirects_oak/tr.d066:trCO.Ode9C12.melody	@ltx/swh_ke_oak/tr.d066:trCO.Ode9C12.melody
ltx/swh_redirects_oak/tr.d066:trCO.Ode9C12.mode	@ltx/swh_ke_oak/tr.d066:trCO.Ode9C12.mode
ltx/swh_redirects_oak/tr.d066:trCO.Ode9C12.ode	@ltx/swh_ke_oak/tr.d066:trCO.Ode9C12.ode
ltx/swh_redirects_oak/tr.d066:trCO.Ode9C12.text	@ltx/swh_ke_oak/tr.d066:trCO.Ode9C12.text
ltx/swh_redirects_oak/tr.d066:trCO.Ode9C13.incipit	@ltx/swh_ke_oak/tr.d066:trCO.Ode9C13.incipit
ltx/swh_redirects_oak/tr.d066:trCO.Ode9C13.melody	@ltx/swh_ke_oak/tr.d066:trCO.Ode9C13.melody
ltx/swh_redirects_oak/tr.d066:trCO.Ode9C13.mode	@ltx/swh_ke_oak/tr.d066:trCO.Ode9C13.mode
ltx/swh_redirects_oak/tr.d066:trCO.Ode9C13.ode	@ltx/swh_ke_oak/tr.d066:trCO.Ode9C13.ode
ltx/swh_redirects_oak/tr.d066:trCO.Ode9C13.text	@ltx/swh_ke_oak/tr.d066:trCO.Ode9C13.text
ltx/swh_redirects_oak/tr.d066:trCO.Ode9C14.incipit	@ltx/swh_ke_oak/tr.d066:trCO.Ode9C14.incipit
ltx/swh_redirects_oak/tr.d066:trCO.Ode9C14.melody	@ltx/swh_ke_oak/tr.d066:trCO.Ode9C14.melody
ltx/swh_redirects_oak/tr.d066:trCO.Ode9C14.mode	@ltx/swh_ke_oak/tr.d066:trCO.Ode9C14.mode
ltx/swh_redirects_oak/tr.d066:trCO.Ode9C14.ode	@ltx/swh_ke_oak/tr.d066:trCO.Ode9C14.ode
ltx/swh_redirects_oak/tr.d066:trCO.Ode9C14.text	@ltx/swh_ke_oak/tr.d066:trCO.Ode9C14.text
ltx/swh_redirects_oak/tr.d066:trCO.Ode9C15.incipit	@ltx/swh_ke_oak/tr.d066:trCO.Ode9C15.incipit
ltx/swh_redirects_oak/tr.d066:trCO.Ode9C15.melody	@ltx/swh_ke_oak/tr.d066:trCO.Ode9C15.melody
ltx/swh_redirects_oak/tr.d066:trCO.Ode9C15.mode	@ltx/swh_ke_oak/tr.d066:trCO.Ode9C15.mode
ltx/swh_redirects_oak/tr.d066:trCO.Ode9C15.ode	@ltx/swh_ke_oak/tr.d066:trCO.Ode9C15.ode
ltx/swh_redirects_oak/tr.d066:trCO.Ode9C15.text	@ltx/swh_ke_oak/tr.d066:trCO.Ode9C15.text
ltx/swh_redirects_oak/tr.d066:trCO.Ode9C16.incipit	@ltx/swh_ke_oak/tr.d066:trCO.Ode9C16.incipit
ltx/swh_redirects_oak/tr.d066:trCO.Ode9C16.melody	@ltx/swh_ke_oak/tr.d066:trCO.Ode9C16.melody
ltx/swh_redirects_oak/tr.d066:trCO.Ode9C16.mode	@ltx/swh_ke_oak/tr.d066:trCO.Ode9C16.mode
ltx/swh_redirects_oak/tr.d066:trCO.Ode9C16.ode	@ltx/swh_ke_oak/tr.d066:trCO.Ode9C16.ode
ltx/swh_redirects_oak/tr.d066:trCO.Ode9C16.text	@ltx/swh_ke_oak/tr.d066:trCO.Ode9C16.text
ltx/swh_redirects_oak/tr.d066:trCO.Ode9C17.incipit	@ltx/swh_ke_oak/tr.d066:trCO.Ode9C17.incipit
ltx/swh_redirects_oak/tr.d066:trCO.Ode9C17.melody	@ltx/swh_ke_oak/tr.d066:trCO.Ode9C17.melody
ltx/swh_redirects_oak/tr.d066:trCO.Ode9C17.mode	@ltx/swh_ke_oak/tr.d066:trCO.Ode9C17.mode
ltx/swh_redirects_oak/tr.d066:trCO.Ode9C17.ode	@ltx/swh_ke_oak/tr.d066:trCO.Ode9C17.ode
ltx/swh_redirects_oak/tr.d066:trCO.Ode9C17.text	@ltx/swh_ke_oak/tr.d066:trCO.Ode9C17.text
ltx/swh_redirects_oak/tr.d066:trCO.Ode9C1H.incipit	@ltx/swh_ke_oak/tr.d066:trCO.Ode9C1H.incipit
ltx/swh_redirects_oak/tr.d066:trCO.Ode9C1H.melody	@ltx/swh_ke_oak/tr.d066:trCO.Ode9C1H.melody
ltx/swh_redirects_oak/tr.d066:trCO.Ode9C1H.mode	@ltx/swh_ke_oak/tr.d066:trCO.Ode9C1H.mode
ltx/swh_redirects_oak/tr.d066:trCO.Ode9C1H.ode	@ltx/swh_ke_oak/tr.d066:trCO.Ode9C1H.ode
ltx/swh_redirects_oak/tr.d066:trCO.Ode9C1H.text	@ltx/swh_ke_oak/tr.d066:trCO.Ode9C1H.text
ltx/swh_redirects_oak/tr.d066:trCO.Ode9C1T.incipit	@ltx/swh_ke_oak/tr.d066:trCO.Ode9C1T.incipit
ltx/swh_redirects_oak/tr.d066:trCO.Ode9C1T.melody	@ltx/swh_ke_oak/tr.d066:trCO.Ode9C1T.melody
ltx/swh_redirects_oak/tr.d066:trCO.Ode9C1T.mode	@ltx/swh_ke_oak/tr.d066:trCO.Ode9C1T.mode
ltx/swh_redirects_oak/tr.d066:trCO.Ode9C1T.ode	@ltx/swh_ke_oak/tr.d066:trCO.Ode9C1T.ode
ltx/swh_redirects_oak/tr.d066:trCO.Ode9C1T.text	@ltx/swh_ke_oak/tr.d066:trCO.Ode9C1T.text
ltx/swh_redirects_oak/tr.d066:trCO.Ode9C1Tr.incipit	@ltx/swh_ke_oak/tr.d066:trCO.Ode9C1Tr.incipit
ltx/swh_redirects_oak/tr.d066:trCO.Ode9C1Tr.melody	@ltx/swh_ke_oak/tr.d066:trCO.Ode9C1Tr.melody
ltx/swh_redirects_oak/tr.d066:trCO.Ode9C1Tr.mode	@ltx/swh_ke_oak/tr.d066:trCO.Ode9C1Tr.mode
ltx/swh_redirects_oak/tr.d066:trCO.Ode9C1Tr.ode	@ltx/swh_ke_oak/tr.d066:trCO.Ode9C1Tr.ode
ltx/swh_redirects_oak/tr.d066:trCO.Ode9C1Tr.text	@ltx/swh_ke_oak/tr.d066:trCO.Ode9C1Tr.text
ltx/swh_redirects_oak/tr.d066:trCO.header	@ltx/swh_ke_oak/tr.d066:trCO.header
ltx/swh_redirects_oak/tr.d066:trDA.commemoration.full	@ltx/swh_ke_oak/tr.d066:trDA.commemoration.full
ltx/swh_redirects_oak/tr.d066:trDA.commemoration.short	@ltx/swh_ke_oak/tr.d066:trDA.commemoration.short
ltx/swh_redirects_oak/tr.d066:trDA.dismissal	@ltx/swh_ke_oak/tr.d066:trDA.dismissal
ltx/swh_redirects_oak/tr.d066:trDA.insert1	@ltx/swh_ke_oak/tr.d066:trDA.insert1
ltx/swh_redirects_oak/tr.d066:trDA.insert2	@ltx/swh_ke_oak/tr.d066:trDA.insert2
ltx/swh_redirects_oak/tr.d066:trDA.note	@ltx/swh_ke_oak/tr.d066:trDA.note
ltx/swh_redirects_oak/tr.d066:trDA.title	@ltx/swh_ke_oak/tr.d066:trDA.title
ltx/swh_redirects_oak/tr.d066:trEM.header	@ltx/swh_ke_oak/tr.d066:trEM.header
ltx/swh_redirects_oak/tr.d066:trHO.commemorations	@ltx/swh_ke_oak/tr.d066:trHO.commemorations
ltx/swh_redirects_oak/tr.d066:trHO.daytitle	@ltx/swh_ke_oak/tr.d066:trHO.daytitle
ltx/swh_redirects_oak/tr.d066:trHO.description1	@ltx/swh_ke_oak/tr.d066:trHO.description1
ltx/swh_redirects_oak/tr.d066:trHO.description2	@ltx/swh_ke_oak/tr.d066:trHO.description2
ltx/swh_redirects_oak/tr.d066:trHO.note1	@ltx/swh_ke_oak/tr.d066:trHO.note1
ltx/swh_redirects_oak/tr.d066:trHO.note2	@ltx/swh_ke_oak/tr.d066:trHO.note2
ltx/swh_redirects_oak/tr.d066:trMA.AposGlory.incipit	@ltx/swh_ke_oak/tr.d066:trMA.AposGlory.incipit
ltx/swh_redirects_oak/tr.d066:trMA.AposGlory.melody	@ltx/swh_ke_oak/tr.d066:trMA.AposGlory.melody
ltx/swh_redirects_oak/tr.d066:trMA.AposGlory.mode	@ltx/swh_ke_oak/tr.d066:trMA.AposGlory.mode
ltx/swh_redirects_oak/tr.d066:trMA.AposGlory.text	@ltx/swh_ke_oak/tr.d066:trMA.AposGlory.text
ltx/swh_redirects_oak/tr.d066:trMA.Aposticha1.incipit	@ltx/swh_ke_oak/tr.d066:trMA.Aposticha1.incipit
ltx/swh_redirects_oak/tr.d066:trMA.Aposticha1.melody	@ltx/swh_ke_oak/tr.d066:trMA.Aposticha1.melody
ltx/swh_redirects_oak/tr.d066:trMA.Aposticha1.mode	@ltx/swh_ke_oak/tr.d066:trMA.Aposticha1.mode
ltx/swh_redirects_oak/tr.d066:trMA.Aposticha1.text	@ltx/swh_ke_oak/tr.d066:trMA.Aposticha1.text
ltx/swh_redirects_oak/tr.d066:trMA.Aposticha2.incipit	@ltx/swh_ke_oak/tr.d066:trMA.Aposticha2.incipit
ltx/swh_redirects_oak/tr.d066:trMA.Aposticha2.melody	@ltx/swh_ke_oak/tr.d066:trMA.Aposticha2.melody
ltx/swh_redirects_oak/tr.d066:trMA.Aposticha2.mode	@ltx/swh_ke_oak/tr.d066:trMA.Aposticha2.mode
ltx/swh_redirects_oak/tr.d066:trMA.Aposticha2.text	@ltx/swh_ke_oak/tr.d066:trMA.Aposticha2.text
ltx/swh_redirects_oak/tr.d066:trMA.Aposticha3.incipit	@ltx/swh_ke_oak/tr.d066:trMA.Aposticha3.incipit
ltx/swh_redirects_oak/tr.d066:trMA.Aposticha3.melody	@ltx/swh_ke_oak/tr.d066:trMA.Aposticha3.melody
ltx/swh_redirects_oak/tr.d066:trMA.Aposticha3.mode	@ltx/swh_ke_oak/tr.d066:trMA.Aposticha3.mode
ltx/swh_redirects_oak/tr.d066:trMA.Aposticha3.text	@ltx/swh_ke_oak/tr.d066:trMA.Aposticha3.text
ltx/swh_redirects_oak/tr.d066:trMA.C1.acrostic.notice1	@ltx/swh_ke_oak/tr.d066:trMA.C1.acrostic.notice1
ltx/swh_redirects_oak/tr.d066:trMA.C1.acrostic.text	@ltx/swh_ke_oak/tr.d066:trMA.C1.acrostic.text
ltx/swh_redirects_oak/tr.d066:trMA.C1.acrostic.title	@ltx/swh_ke_oak/tr.d066:trMA.C1.acrostic.title
ltx/swh_redirects_oak/tr.d066:trMA.C1.poet	@ltx/swh_ke_oak/tr.d066:trMA.C1.poet
ltx/swh_redirects_oak/tr.d066:trMA.C1.verse	@ltx/swh_ke_oak/tr.d066:trMA.C1.verse
ltx/swh_redirects_oak/tr.d066:trMA.Exaposteilarion1.greekmelody	@ltx/swh_ke_oak/tr.d066:trMA.Exaposteilarion1.greekmelody
ltx/swh_redirects_oak/tr.d066:trMA.Exaposteilarion1.incipit	@ltx/swh_ke_oak/tr.d066:trMA.Exaposteilarion1.incipit
ltx/swh_redirects_oak/tr.d066:trMA.Exaposteilarion1.melody	@ltx/swh_ke_oak/tr.d066:trMA.Exaposteilarion1.melody
ltx/swh_redirects_oak/tr.d066:trMA.Exaposteilarion1.mode	@ltx/swh_ke_oak/tr.d066:trMA.Exaposteilarion1.mode
ltx/swh_redirects_oak/tr.d066:trMA.Exaposteilarion1.text	@ltx/swh_ke_oak/tr.d066:trMA.Exaposteilarion1.text
ltx/swh_redirects_oak/tr.d066:trMA.Kathisma11.greekmelody	@ltx/swh_ke_oak/tr.d066:trMA.Kathisma11.greekmelody
ltx/swh_redirects_oak/tr.d066:trMA.Kathisma11.incipit	@ltx/swh_ke_oak/tr.d066:trMA.Kathisma11.incipit
ltx/swh_redirects_oak/tr.d066:trMA.Kathisma11.melody	@ltx/swh_ke_oak/tr.d066:trMA.Kathisma11.melody
ltx/swh_redirects_oak/tr.d066:trMA.Kathisma11.mode	@ltx/swh_ke_oak/tr.d066:trMA.Kathisma11.mode
ltx/swh_redirects_oak/tr.d066:trMA.Kathisma11.text	@ltx/swh_ke_oak/tr.d066:trMA.Kathisma11.text
ltx/swh_redirects_oak/tr.d066:trMA.Kathisma21.greekmelody	@ltx/swh_ke_oak/tr.d066:trMA.Kathisma21.greekmelody
ltx/swh_redirects_oak/tr.d066:trMA.Kathisma21.incipit	@ltx/swh_ke_oak/tr.d066:trMA.Kathisma21.incipit
ltx/swh_redirects_oak/tr.d066:trMA.Kathisma21.melody	@ltx/swh_ke_oak/tr.d066:trMA.Kathisma21.melody
ltx/swh_redirects_oak/tr.d066:trMA.Kathisma21.mode	@ltx/swh_ke_oak/tr.d066:trMA.Kathisma21.mode
ltx/swh_redirects_oak/tr.d066:trMA.Kathisma21.text	@ltx/swh_ke_oak/tr.d066:trMA.Kathisma21.text
ltx/swh_redirects_oak/tr.d066:trMA.Kathisma31.greekmelody	@ltx/swh_ke_oak/tr.d066:trMA.Kathisma31.greekmelody
ltx/swh_redirects_oak/tr.d066:trMA.Kathisma31.incipit	@ltx/swh_ke_oak/tr.d066:trMA.Kathisma31.incipit
ltx/swh_redirects_oak/tr.d066:trMA.Kathisma31.melody	@ltx/swh_ke_oak/tr.d066:trMA.Kathisma31.melody
ltx/swh_redirects_oak/tr.d066:trMA.Kathisma31.mode	@ltx/swh_ke_oak/tr.d066:trMA.Kathisma31.mode
ltx/swh_redirects_oak/tr.d066:trMA.Kathisma31.text	@ltx/swh_ke_oak/tr.d066:trMA.Kathisma31.text
ltx/swh_redirects_oak/tr.d066:trMA.Kontakion1.incipit	@ltx/swh_ke_oak/tr.d066:trMA.Kontakion1.incipit
ltx/swh_redirects_oak/tr.d066:trMA.Kontakion1.melody	@ltx/swh_ke_oak/tr.d066:trMA.Kontakion1.melody
ltx/swh_redirects_oak/tr.d066:trMA.Kontakion1.mode	@ltx/swh_ke_oak/tr.d066:trMA.Kontakion1.mode
ltx/swh_redirects_oak/tr.d066:trMA.Kontakion1.text	@ltx/swh_ke_oak/tr.d066:trMA.Kontakion1.text
ltx/swh_redirects_oak/tr.d066:trMA.Lauds1.incipit	@ltx/swh_ke_oak/tr.d066:trMA.Lauds1.incipit
ltx/swh_redirects_oak/tr.d066:trMA.Lauds1.melody	@ltx/swh_ke_oak/tr.d066:trMA.Lauds1.melody
ltx/swh_redirects_oak/tr.d066:trMA.Lauds1.mode	@ltx/swh_ke_oak/tr.d066:trMA.Lauds1.mode
ltx/swh_redirects_oak/tr.d066:trMA.Lauds1.text	@ltx/swh_ke_oak/tr.d066:trMA.Lauds1.text
ltx/swh_redirects_oak/tr.d066:trMA.Lauds2.incipit	@ltx/swh_ke_oak/tr.d066:trMA.Lauds2.incipit
ltx/swh_redirects_oak/tr.d066:trMA.Lauds2.melody	@ltx/swh_ke_oak/tr.d066:trMA.Lauds2.melody
ltx/swh_redirects_oak/tr.d066:trMA.Lauds2.mode	@ltx/swh_ke_oak/tr.d066:trMA.Lauds2.mode
ltx/swh_redirects_oak/tr.d066:trMA.Lauds2.text	@ltx/swh_ke_oak/tr.d066:trMA.Lauds2.text
ltx/swh_redirects_oak/tr.d066:trMA.LaudsGlory.incipit	@ltx/swh_ke_oak/tr.d066:trMA.LaudsGlory.incipit
ltx/swh_redirects_oak/tr.d066:trMA.LaudsGlory.melody	@ltx/swh_ke_oak/tr.d066:trMA.LaudsGlory.melody
ltx/swh_redirects_oak/tr.d066:trMA.LaudsGlory.mode	@ltx/swh_ke_oak/tr.d066:trMA.LaudsGlory.mode
ltx/swh_redirects_oak/tr.d066:trMA.LaudsGlory.text	@ltx/swh_ke_oak/tr.d066:trMA.LaudsGlory.text
ltx/swh_redirects_oak/tr.d066:trMA.MM.Alleluia.text	@ltx/swh_ke_oak/tr.d066:trMA.MM.Alleluia.text
ltx/swh_redirects_oak/tr.d066:trMA.Ode8C11.greekmelody	@ltx/swh_ke_oak/tr.d066:trMA.Ode8C11.greekmelody
ltx/swh_redirects_oak/tr.d066:trMA.Ode8C11.incipit	@ltx/swh_ke_oak/tr.d066:trMA.Ode8C11.incipit
ltx/swh_redirects_oak/tr.d066:trMA.Ode8C11.melody	@ltx/swh_ke_oak/tr.d066:trMA.Ode8C11.melody
ltx/swh_redirects_oak/tr.d066:trMA.Ode8C11.mode	@ltx/swh_ke_oak/tr.d066:trMA.Ode8C11.mode
ltx/swh_redirects_oak/tr.d066:trMA.Ode8C11.ode	@ltx/swh_ke_oak/tr.d066:trMA.Ode8C11.ode
ltx/swh_redirects_oak/tr.d066:trMA.Ode8C11.text	@ltx/swh_ke_oak/tr.d066:trMA.Ode8C11.text
ltx/swh_redirects_oak/tr.d066:trMA.Ode8C12.incipit	@ltx/swh_ke_oak/tr.d066:trMA.Ode8C12.incipit
ltx/swh_redirects_oak/tr.d066:trMA.Ode8C12.melody	@ltx/swh_ke_oak/tr.d066:trMA.Ode8C12.melody
ltx/swh_redirects_oak/tr.d066:trMA.Ode8C12.mode	@ltx/swh_ke_oak/tr.d066:trMA.Ode8C12.mode
ltx/swh_redirects_oak/tr.d066:trMA.Ode8C12.ode	@ltx/swh_ke_oak/tr.d066:trMA.Ode8C12.ode
ltx/swh_redirects_oak/tr.d066:trMA.Ode8C12.text	@ltx/swh_ke_oak/tr.d066:trMA.Ode8C12.text
ltx/swh_redirects_oak/tr.d066:trMA.Ode8C13.incipit	@ltx/swh_ke_oak/tr.d066:trMA.Ode8C13.incipit
ltx/swh_redirects_oak/tr.d066:trMA.Ode8C13.melody	@ltx/swh_ke_oak/tr.d066:trMA.Ode8C13.melody
ltx/swh_redirects_oak/tr.d066:trMA.Ode8C13.mode	@ltx/swh_ke_oak/tr.d066:trMA.Ode8C13.mode
ltx/swh_redirects_oak/tr.d066:trMA.Ode8C13.ode	@ltx/swh_ke_oak/tr.d066:trMA.Ode8C13.ode
ltx/swh_redirects_oak/tr.d066:trMA.Ode8C13.text	@ltx/swh_ke_oak/tr.d066:trMA.Ode8C13.text
ltx/swh_redirects_oak/tr.d066:trMA.Ode8C1H.greekmelody	@ltx/swh_ke_oak/tr.d066:trMA.Ode8C1H.greekmelody
ltx/swh_redirects_oak/tr.d066:trMA.Ode8C1H.incipit	@ltx/swh_ke_oak/tr.d066:trMA.Ode8C1H.incipit
ltx/swh_redirects_oak/tr.d066:trMA.Ode8C1H.melody	@ltx/swh_ke_oak/tr.d066:trMA.Ode8C1H.melody
ltx/swh_redirects_oak/tr.d066:trMA.Ode8C1H.mode	@ltx/swh_ke_oak/tr.d066:trMA.Ode8C1H.mode
ltx/swh_redirects_oak/tr.d066:trMA.Ode8C1H.ode	@ltx/swh_ke_oak/tr.d066:trMA.Ode8C1H.ode
ltx/swh_redirects_oak/tr.d066:trMA.Ode8C1H.text	@ltx/swh_ke_oak/tr.d066:trMA.Ode8C1H.text
ltx/swh_redirects_oak/tr.d066:trMA.Ode8K.incipit	@ltx/swh_ke_oak/tr.d066:trMA.Ode8K.incipit
ltx/swh_redirects_oak/tr.d066:trMA.Ode8K.melody	@ltx/swh_ke_oak/tr.d066:trMA.Ode8K.melody
ltx/swh_redirects_oak/tr.d066:trMA.Ode8K.mode	@ltx/swh_ke_oak/tr.d066:trMA.Ode8K.mode
ltx/swh_redirects_oak/tr.d066:trMA.Ode8K.ode	@ltx/swh_ke_oak/tr.d066:trMA.Ode8K.ode
ltx/swh_redirects_oak/tr.d066:trMA.Ode8K.text	@ltx/swh_ke_oak/tr.d066:trMA.Ode8K.text
ltx/swh_redirects_oak/tr.d066:trMA.Ode9C11.greekmelody	@ltx/swh_ke_oak/tr.d066:trMA.Ode9C11.greekmelody
ltx/swh_redirects_oak/tr.d066:trMA.Ode9C11.incipit	@ltx/swh_ke_oak/tr.d066:trMA.Ode9C11.incipit
ltx/swh_redirects_oak/tr.d066:trMA.Ode9C11.melody	@ltx/swh_ke_oak/tr.d066:trMA.Ode9C11.melody
ltx/swh_redirects_oak/tr.d066:trMA.Ode9C11.mode	@ltx/swh_ke_oak/tr.d066:trMA.Ode9C11.mode
ltx/swh_redirects_oak/tr.d066:trMA.Ode9C11.ode	@ltx/swh_ke_oak/tr.d066:trMA.Ode9C11.ode
ltx/swh_redirects_oak/tr.d066:trMA.Ode9C11.text	@ltx/swh_ke_oak/tr.d066:trMA.Ode9C11.text
ltx/swh_redirects_oak/tr.d066:trMA.Ode9C12.incipit	@ltx/swh_ke_oak/tr.d066:trMA.Ode9C12.incipit
ltx/swh_redirects_oak/tr.d066:trMA.Ode9C12.melody	@ltx/swh_ke_oak/tr.d066:trMA.Ode9C12.melody
ltx/swh_redirects_oak/tr.d066:trMA.Ode9C12.mode	@ltx/swh_ke_oak/tr.d066:trMA.Ode9C12.mode
ltx/swh_redirects_oak/tr.d066:trMA.Ode9C12.ode	@ltx/swh_ke_oak/tr.d066:trMA.Ode9C12.ode
ltx/swh_redirects_oak/tr.d066:trMA.Ode9C12.text	@ltx/swh_ke_oak/tr.d066:trMA.Ode9C12.text
ltx/swh_redirects_oak/tr.d066:trMA.Ode9C1H.greekmelody	@ltx/swh_ke_oak/tr.d066:trMA.Ode9C1H.greekmelody
ltx/swh_redirects_oak/tr.d066:trMA.Ode9C1H.incipit	@ltx/swh_ke_oak/tr.d066:trMA.Ode9C1H.incipit
ltx/swh_redirects_oak/tr.d066:trMA.Ode9C1H.melody	@ltx/swh_ke_oak/tr.d066:trMA.Ode9C1H.melody
ltx/swh_redirects_oak/tr.d066:trMA.Ode9C1H.mode	@ltx/swh_ke_oak/tr.d066:trMA.Ode9C1H.mode
ltx/swh_redirects_oak/tr.d066:trMA.Ode9C1H.ode	@ltx/swh_ke_oak/tr.d066:trMA.Ode9C1H.ode
ltx/swh_redirects_oak/tr.d066:trMA.Ode9C1H.text	@ltx/swh_ke_oak/tr.d066:trMA.Ode9C1H.text
ltx/swh_redirects_oak/tr.d066:trMA.Ode9K.incipit	@ltx/swh_ke_oak/tr.d066:trMA.Ode9K.incipit
ltx/swh_redirects_oak/tr.d066:trMA.Ode9K.melody	@ltx/swh_ke_oak/tr.d066:trMA.Ode9K.melody
ltx/swh_redirects_oak/tr.d066:trMA.Ode9K.mode	@ltx/swh_ke_oak/tr.d066:trMA.Ode9K.mode
ltx/swh_redirects_oak/tr.d066:trMA.Ode9K.ode	@ltx/swh_ke_oak/tr.d066:trMA.Ode9K.ode
ltx/swh_redirects_oak/tr.d066:trMA.Ode9K.text	@ltx/swh_ke_oak/tr.d066:trMA.Ode9K.text
ltx/swh_redirects_oak/tr.d066:trMA.Oikos1.text	@ltx/swh_ke_oak/tr.d066:trMA.Oikos1.text
ltx/swh_redirects_oak/tr.d066:trMA.Troparion.incipit	@ltx/swh_ke_oak/tr.d066:trMA.Troparion.incipit
ltx/swh_redirects_oak/tr.d066:trMA.Troparion.melody	@ltx/swh_ke_oak/tr.d066:trMA.Troparion.melody
ltx/swh_redirects_oak/tr.d066:trMA.Troparion.mode	@ltx/swh_ke_oak/tr.d066:trMA.Troparion.mode
ltx/swh_redirects_oak/tr.d066:trMA.Troparion.text	@ltx/swh_ke_oak/tr.d066:trMA.Troparion.text
ltx/swh_redirects_oak/tr.d066:trSY.commemoration.couplet1.title	@ltx/swh_ke_oak/tr.d066:trSY.commemoration.couplet1.title
ltx/swh_redirects_oak/tr.d066:trSY.commemoration.couplet1.verse1	@ltx/swh_ke_oak/tr.d066:trSY.commemoration.couplet1.verse1
ltx/swh_redirects_oak/tr.d066:trSY.commemoration.couplet1.verse2	@ltx/swh_ke_oak/tr.d066:trSY.commemoration.couplet1.verse2
ltx/swh_redirects_oak/tr.d066:trSY.commemoration.narration.p01	@ltx/swh_ke_oak/tr.d066:trSY.commemoration.narration.p01
ltx/swh_redirects_oak/tr.d066:trSY.commemoration.narration.p02	@ltx/swh_ke_oak/tr.d066:trSY.commemoration.narration.p02
ltx/swh_redirects_oak/tr.d066:trSY.commemoration.narration.p03	@ltx/swh_ke_oak/tr.d066:trSY.commemoration.narration.p03
ltx/swh_redirects_oak/tr.d066:trSY.commemoration.narration.p04	@ltx/swh_ke_oak/tr.d066:trSY.commemoration.narration.p04
ltx/swh_redirects_oak/tr.d066:trSY.commemoration.narration.p05	@ltx/swh_ke_oak/tr.d066:trSY.commemoration.narration.p05
ltx/swh_redirects_oak/tr.d066:trSY.commemoration.narration.p06	@ltx/swh_ke_oak/tr.d066:trSY.commemoration.narration.p06
ltx/swh_redirects_oak/tr.d066:trSY.commemoration.narration.p07	@ltx/swh_ke_oak/tr.d066:trSY.commemoration.narration.p07
ltx/swh_redirects_oak/tr.d066:trSY.commemoration.text	@ltx/swh_ke_oak/tr.d066:trSY.commemoration.text
ltx/swh_redirects_oak/tr.d066:trSY.lastline	@ltx/swh_ke_oak/tr.d066:trSY.lastline
ltx/swh_redirects_oak/tr.d066:trTE.Troparion.incipit	@ltx/swh_ke_oak/tr.d066:trTE.Troparion.incipit
ltx/swh_redirects_oak/tr.d066:trTE.Troparion.melody	@ltx/swh_ke_oak/tr.d066:trTE.Troparion.melody
ltx/swh_redirects_oak/tr.d066:trTE.Troparion.mode	@ltx/swh_ke_oak/tr.d066:trTE.Troparion.mode
ltx/swh_redirects_oak/tr.d066:trTE.Troparion.text	@ltx/swh_ke_oak/tr.d066:trTE.Troparion.text
ltx/swh_redirects_oak/tr.d066:trVE.SticGlory.incipit	@ltx/swh_ke_oak/tr.d066:trVE.SticGlory.incipit
ltx/swh_redirects_oak/tr.d066:trVE.SticGlory.melody	@ltx/swh_ke_oak/tr.d066:trVE.SticGlory.melody
ltx/swh_redirects_oak/tr.d066:trVE.SticGlory.mode	@ltx/swh_ke_oak/tr.d066:trVE.SticGlory.mode
ltx/swh_redirects_oak/tr.d066:trVE.SticGlory.text	@ltx/swh_ke_oak/tr.d066:trVE.SticGlory.text
ltx/swh_redirects_oak/tr.d066:trVE.Stichera01.incipit	@ltx/swh_ke_oak/tr.d066:trVE.Stichera01.incipit
ltx/swh_redirects_oak/tr.d066:trVE.Stichera01.melody	@ltx/swh_ke_oak/tr.d066:trVE.Stichera01.melody
ltx/swh_redirects_oak/tr.d066:trVE.Stichera01.mode	@ltx/swh_ke_oak/tr.d066:trVE.Stichera01.mode
ltx/swh_redirects_oak/tr.d066:trVE.Stichera01.text	@ltx/swh_ke_oak/tr.d066:trVE.Stichera01.text
ltx/swh_redirects_oak/tr.d066:trVE.Stichera02.incipit	@ltx/swh_ke_oak/tr.d066:trVE.Stichera02.incipit
ltx/swh_redirects_oak/tr.d066:trVE.Stichera02.melody	@ltx/swh_ke_oak/tr.d066:trVE.Stichera02.melody
ltx/swh_redirects_oak/tr.d066:trVE.Stichera02.mode	@ltx/swh_ke_oak/tr.d066:trVE.Stichera02.mode
ltx/swh_redirects_oak/tr.d066:trVE.Stichera02.text	@ltx/swh_ke_oak/tr.d066:trVE.Stichera02.text
ltx/swh_redirects_oak/tr.d066:trVE.Stichera03.incipit	@ltx/swh_ke_oak/tr.d066:trVE.Stichera03.incipit
ltx/swh_redirects_oak/tr.d066:trVE.Stichera03.melody	@ltx/swh_ke_oak/tr.d066:trVE.Stichera03.melody
ltx/swh_redirects_oak/tr.d066:trVE.Stichera03.mode	@ltx/swh_ke_oak/tr.d066:trVE.Stichera03.mode
ltx/swh_redirects_oak/tr.d066:trVE.Stichera03.text	@ltx/swh_ke_oak/tr.d066:trVE.Stichera03.text
ltx/swh_redirects_oak/tr.d066:trVE.Stichera04.incipit	@ltx/swh_ke_oak/tr.d066:trVE.Stichera04.incipit
ltx/swh_redirects_oak/tr.d066:trVE.Stichera04.melody	@ltx/swh_ke_oak/tr.d066:trVE.Stichera04.melody
ltx/swh_redirects_oak/tr.d066:trVE.Stichera04.mode	@ltx/swh_ke_oak/tr.d066:trVE.Stichera04.mode
ltx/swh_redirects_oak/tr.d066:trVE.Stichera04.text	@ltx/swh_ke_oak/tr.d066:trVE.Stichera04.text
ltx/swh_redirects_oak/tr.d066:trVE.Stichera05.incipit	@ltx/swh_ke_oak/tr.d066:trVE.Stichera05.incipit
ltx/swh_redirects_oak/tr.d066:trVE.Stichera05.melody	@ltx/swh_ke_oak/tr.d066:trVE.Stichera05.melody
ltx/swh_redirects_oak/tr.d066:trVE.Stichera05.mode	@ltx/swh_ke_oak/tr.d066:trVE.Stichera05.mode
ltx/swh_redirects_oak/tr.d066:trVE.Stichera05.text	@ltx/swh_ke_oak/tr.d066:trVE.Stichera05.text
ltx/swh_redirects_oak/tr.d066:trVE.Stichera06.incipit	@ltx/swh_ke_oak/tr.d066:trVE.Stichera06.incipit
ltx/swh_redirects_oak/tr.d066:trVE.Stichera06.melody	@ltx/swh_ke_oak/tr.d066:trVE.Stichera06.melody
ltx/swh_redirects_oak/tr.d066:trVE.Stichera06.mode	@ltx/swh_ke_oak/tr.d066:trVE.Stichera06.mode
ltx/swh_redirects_oak/tr.d066:trVE.Stichera06.text	@ltx/swh_ke_oak/tr.d066:trVE.Stichera06.text
ltx/swh_redirects_oak/tr.d066:trVL.header	@ltx/swh_ke_oak/tr.d066:trVL.header
