ltx/swh_redirects_oak/sy.m05.d24:syMA.commemoration01.couplet1.title	@ltx/swh_ke_oak/sy.m05.d24:syMA.commemoration01.couplet1.title
ltx/swh_redirects_oak/sy.m05.d24:syMA.commemoration01.couplet1.verse1	@ltx/swh_ke_oak/sy.m05.d24:syMA.commemoration01.couplet1.verse1
ltx/swh_redirects_oak/sy.m05.d24:syMA.commemoration01.couplet1.verse2	@ltx/swh_ke_oak/sy.m05.d24:syMA.commemoration01.couplet1.verse2
ltx/swh_redirects_oak/sy.m05.d24:syMA.commemoration01.narration.p01	@ltx/swh_ke_oak/sy.m05.d24:syMA.commemoration01.narration.p01
ltx/swh_redirects_oak/sy.m05.d24:syMA.commemoration01.narration.p02	@ltx/swh_ke_oak/sy.m05.d24:syMA.commemoration01.narration.p02
ltx/swh_redirects_oak/sy.m05.d24:syMA.commemoration01.narration.p03	@ltx/swh_ke_oak/sy.m05.d24:syMA.commemoration01.narration.p03
ltx/swh_redirects_oak/sy.m05.d24:syMA.commemoration01.single1	@ltx/swh_ke_oak/sy.m05.d24:syMA.commemoration01.single1
ltx/swh_redirects_oak/sy.m05.d24:syMA.commemoration01.text	@ltx/swh_ke_oak/sy.m05.d24:syMA.commemoration01.text
ltx/swh_redirects_oak/sy.m05.d24:syMA.commemoration02.couplet1.title	@ltx/swh_ke_oak/sy.m05.d24:syMA.commemoration02.couplet1.title
ltx/swh_redirects_oak/sy.m05.d24:syMA.commemoration02.couplet1.verse1	@ltx/swh_ke_oak/sy.m05.d24:syMA.commemoration02.couplet1.verse1
ltx/swh_redirects_oak/sy.m05.d24:syMA.commemoration02.couplet1.verse2	@ltx/swh_ke_oak/sy.m05.d24:syMA.commemoration02.couplet1.verse2
ltx/swh_redirects_oak/sy.m05.d24:syMA.commemoration02.couplet2.title	@ltx/swh_ke_oak/sy.m05.d24:syMA.commemoration02.couplet2.title
ltx/swh_redirects_oak/sy.m05.d24:syMA.commemoration02.couplet2.verse1	@ltx/swh_ke_oak/sy.m05.d24:syMA.commemoration02.couplet2.verse1
ltx/swh_redirects_oak/sy.m05.d24:syMA.commemoration02.couplet2.verse2	@ltx/swh_ke_oak/sy.m05.d24:syMA.commemoration02.couplet2.verse2
ltx/swh_redirects_oak/sy.m05.d24:syMA.commemoration02.couplet3.title	@ltx/swh_ke_oak/sy.m05.d24:syMA.commemoration02.couplet3.title
ltx/swh_redirects_oak/sy.m05.d24:syMA.commemoration02.couplet3.verse1	@ltx/swh_ke_oak/sy.m05.d24:syMA.commemoration02.couplet3.verse1
ltx/swh_redirects_oak/sy.m05.d24:syMA.commemoration02.couplet3.verse2	@ltx/swh_ke_oak/sy.m05.d24:syMA.commemoration02.couplet3.verse2
ltx/swh_redirects_oak/sy.m05.d24:syMA.commemoration02.couplet4.title	@ltx/swh_ke_oak/sy.m05.d24:syMA.commemoration02.couplet4.title
ltx/swh_redirects_oak/sy.m05.d24:syMA.commemoration02.couplet4.verse1	@ltx/swh_ke_oak/sy.m05.d24:syMA.commemoration02.couplet4.verse1
ltx/swh_redirects_oak/sy.m05.d24:syMA.commemoration02.couplet4.verse2	@ltx/swh_ke_oak/sy.m05.d24:syMA.commemoration02.couplet4.verse2
ltx/swh_redirects_oak/sy.m05.d24:syMA.commemoration02.couplet5.title	@ltx/swh_ke_oak/sy.m05.d24:syMA.commemoration02.couplet5.title
ltx/swh_redirects_oak/sy.m05.d24:syMA.commemoration02.couplet5.verse1	@ltx/swh_ke_oak/sy.m05.d24:syMA.commemoration02.couplet5.verse1
ltx/swh_redirects_oak/sy.m05.d24:syMA.commemoration02.couplet5.verse2	@ltx/swh_ke_oak/sy.m05.d24:syMA.commemoration02.couplet5.verse2
ltx/swh_redirects_oak/sy.m05.d24:syMA.commemoration02.couplet6.title	@ltx/swh_ke_oak/sy.m05.d24:syMA.commemoration02.couplet6.title
ltx/swh_redirects_oak/sy.m05.d24:syMA.commemoration02.couplet6.verse1	@ltx/swh_ke_oak/sy.m05.d24:syMA.commemoration02.couplet6.verse1
ltx/swh_redirects_oak/sy.m05.d24:syMA.commemoration02.couplet6.verse2	@ltx/swh_ke_oak/sy.m05.d24:syMA.commemoration02.couplet6.verse2
ltx/swh_redirects_oak/sy.m05.d24:syMA.commemoration02.couplet7.title	@ltx/swh_ke_oak/sy.m05.d24:syMA.commemoration02.couplet7.title
ltx/swh_redirects_oak/sy.m05.d24:syMA.commemoration02.couplet7.verse1	@ltx/swh_ke_oak/sy.m05.d24:syMA.commemoration02.couplet7.verse1
ltx/swh_redirects_oak/sy.m05.d24:syMA.commemoration02.couplet7.verse2	@ltx/swh_ke_oak/sy.m05.d24:syMA.commemoration02.couplet7.verse2
ltx/swh_redirects_oak/sy.m05.d24:syMA.commemoration02.couplet8.title	@ltx/swh_ke_oak/sy.m05.d24:syMA.commemoration02.couplet8.title
ltx/swh_redirects_oak/sy.m05.d24:syMA.commemoration02.couplet8.verse1	@ltx/swh_ke_oak/sy.m05.d24:syMA.commemoration02.couplet8.verse1
ltx/swh_redirects_oak/sy.m05.d24:syMA.commemoration02.couplet8.verse2	@ltx/swh_ke_oak/sy.m05.d24:syMA.commemoration02.couplet8.verse2
ltx/swh_redirects_oak/sy.m05.d24:syMA.commemoration02.couplet9.title	@ltx/swh_ke_oak/sy.m05.d24:syMA.commemoration02.couplet9.title
ltx/swh_redirects_oak/sy.m05.d24:syMA.commemoration02.couplet9.verse1	@ltx/swh_ke_oak/sy.m05.d24:syMA.commemoration02.couplet9.verse1
ltx/swh_redirects_oak/sy.m05.d24:syMA.commemoration02.couplet9.verse2	@ltx/swh_ke_oak/sy.m05.d24:syMA.commemoration02.couplet9.verse2
ltx/swh_redirects_oak/sy.m05.d24:syMA.commemoration02.text	@ltx/swh_ke_oak/sy.m05.d24:syMA.commemoration02.text
ltx/swh_redirects_oak/sy.m05.d24:syMA.lastline	@ltx/swh_ke_oak/sy.m05.d24:syMA.lastline
