ltx/swh_redirects_oak/me.m01.d06:meDA.commemoration.first	@ltx/swh_ke_oak/me.m01.d06:meDA.commemoration.first
ltx/swh_redirects_oak/me.m01.d06:meDA.commemoration.first_name	@ltx/swh_ke_oak/me.m01.d06:meDA.commemoration.first_name
ltx/swh_redirects_oak/me.m01.d06:meDA.commemoration.first_short	@ltx/swh_ke_oak/me.m01.d06:meDA.commemoration.first_short
ltx/swh_redirects_oak/me.m01.d06:meDA.commemoration.first_title	@ltx/swh_ke_oak/me.m01.d06:meDA.commemoration.first_title
ltx/swh_redirects_oak/me.m01.d06:meDA.commemoration.full	@ltx/swh_ke_oak/me.m01.d06:meDA.commemoration.full
ltx/swh_redirects_oak/me.m01.d06:meDA.commemoration.second_name	@ltx/swh_ke_oak/me.m01.d06:meDA.commemoration.second_name
ltx/swh_redirects_oak/me.m01.d06:meDA.commemoration.second_title	@ltx/swh_ke_oak/me.m01.d06:meDA.commemoration.second_title
ltx/swh_redirects_oak/me.m01.d06:meDA.date	@ltx/swh_ke_oak/me.m01.d06:meDA.date
ltx/swh_redirects_oak/me.m01.d06:meDA.dismissal	@ltx/swh_ke_oak/me.m01.d06:meDA.dismissal
ltx/swh_redirects_oak/me.m01.d06:meDA.insert1	@ltx/swh_ke_oak/me.m01.d06:meDA.insert1
ltx/swh_redirects_oak/me.m01.d06:meDA.insert2	@ltx/swh_ke_oak/me.m01.d06:meDA.insert2
ltx/swh_redirects_oak/me.m01.d06:meDA.note	@ltx/swh_ke_oak/me.m01.d06:meDA.note
ltx/swh_redirects_oak/me.m01.d06:meGW.Apolytikion.incipit	@ltx/swh_ke_oak/me.m01.d06:meGW.Apolytikion.incipit
ltx/swh_redirects_oak/me.m01.d06:meGW.Apolytikion.mode	@ltx/swh_ke_oak/me.m01.d06:meGW.Apolytikion.mode
ltx/swh_redirects_oak/me.m01.d06:meGW.Apolytikion.text	@ltx/swh_ke_oak/me.m01.d06:meGW.Apolytikion.text
ltx/swh_redirects_oak/me.m01.d06:meGW.Idiomelon1.incipit	@ltx/swh_ke_oak/me.m01.d06:meGW.Idiomelon1.incipit
ltx/swh_redirects_oak/me.m01.d06:meGW.Idiomelon1.mode	@ltx/swh_ke_oak/me.m01.d06:meGW.Idiomelon1.mode
ltx/swh_redirects_oak/me.m01.d06:meGW.Idiomelon1.poet	@ltx/swh_ke_oak/me.m01.d06:meGW.Idiomelon1.poet
ltx/swh_redirects_oak/me.m01.d06:meGW.Idiomelon1.text	@ltx/swh_ke_oak/me.m01.d06:meGW.Idiomelon1.text
ltx/swh_redirects_oak/me.m01.d06:meGW.Idiomelon2.incipit	@ltx/swh_ke_oak/me.m01.d06:meGW.Idiomelon2.incipit
ltx/swh_redirects_oak/me.m01.d06:meGW.Idiomelon2.mode	@ltx/swh_ke_oak/me.m01.d06:meGW.Idiomelon2.mode
ltx/swh_redirects_oak/me.m01.d06:meGW.Idiomelon2.poet	@ltx/swh_ke_oak/me.m01.d06:meGW.Idiomelon2.poet
ltx/swh_redirects_oak/me.m01.d06:meGW.Idiomelon2.text	@ltx/swh_ke_oak/me.m01.d06:meGW.Idiomelon2.text
ltx/swh_redirects_oak/me.m01.d06:meGW.Idiomelon3.incipit	@ltx/swh_ke_oak/me.m01.d06:meGW.Idiomelon3.incipit
ltx/swh_redirects_oak/me.m01.d06:meGW.Idiomelon3.mode	@ltx/swh_ke_oak/me.m01.d06:meGW.Idiomelon3.mode
ltx/swh_redirects_oak/me.m01.d06:meGW.Idiomelon3.poet	@ltx/swh_ke_oak/me.m01.d06:meGW.Idiomelon3.poet
ltx/swh_redirects_oak/me.m01.d06:meGW.Idiomelon3.text	@ltx/swh_ke_oak/me.m01.d06:meGW.Idiomelon3.text
ltx/swh_redirects_oak/me.m01.d06:meGW.Idiomelon4.incipit	@ltx/swh_ke_oak/me.m01.d06:meGW.Idiomelon4.incipit
ltx/swh_redirects_oak/me.m01.d06:meGW.Idiomelon4.mode	@ltx/swh_ke_oak/me.m01.d06:meGW.Idiomelon4.mode
ltx/swh_redirects_oak/me.m01.d06:meGW.Idiomelon4.text	@ltx/swh_ke_oak/me.m01.d06:meGW.Idiomelon4.text
ltx/swh_redirects_oak/me.m01.d06:meGW.IdiomelonGlory.incipit	@ltx/swh_ke_oak/me.m01.d06:meGW.IdiomelonGlory.incipit
ltx/swh_redirects_oak/me.m01.d06:meGW.IdiomelonGlory.mode	@ltx/swh_ke_oak/me.m01.d06:meGW.IdiomelonGlory.mode
ltx/swh_redirects_oak/me.m01.d06:meGW.IdiomelonGlory.poet	@ltx/swh_ke_oak/me.m01.d06:meGW.IdiomelonGlory.poet
ltx/swh_redirects_oak/me.m01.d06:meGW.IdiomelonGlory.text	@ltx/swh_ke_oak/me.m01.d06:meGW.IdiomelonGlory.text
ltx/swh_redirects_oak/me.m01.d06:meGW.Prayer1.text	@ltx/swh_ke_oak/me.m01.d06:meGW.Prayer1.text
ltx/swh_redirects_oak/me.m01.d06:meGW.Prayer2.poet	@ltx/swh_ke_oak/me.m01.d06:meGW.Prayer2.poet
ltx/swh_redirects_oak/me.m01.d06:meGW.Prayer2.text	@ltx/swh_ke_oak/me.m01.d06:meGW.Prayer2.text
ltx/swh_redirects_oak/me.m01.d06:meGW.Prayer31.text	@ltx/swh_ke_oak/me.m01.d06:meGW.Prayer31.text
ltx/swh_redirects_oak/me.m01.d06:meGW.Prayer32.text	@ltx/swh_ke_oak/me.m01.d06:meGW.Prayer32.text
ltx/swh_redirects_oak/me.m01.d06:meGW.Prayer33.text	@ltx/swh_ke_oak/me.m01.d06:meGW.Prayer33.text
ltx/swh_redirects_oak/me.m01.d06:meGW.Prayer34.text	@ltx/swh_ke_oak/me.m01.d06:meGW.Prayer34.text
ltx/swh_redirects_oak/me.m01.d06:meGW.Prayer35.text	@ltx/swh_ke_oak/me.m01.d06:meGW.Prayer35.text
ltx/swh_redirects_oak/me.m01.d06:meGW.Prayer36.text	@ltx/swh_ke_oak/me.m01.d06:meGW.Prayer36.text
ltx/swh_redirects_oak/me.m01.d06:meGW.Prayer37.text	@ltx/swh_ke_oak/me.m01.d06:meGW.Prayer37.text
ltx/swh_redirects_oak/me.m01.d06:meGW.Prayer38.text	@ltx/swh_ke_oak/me.m01.d06:meGW.Prayer38.text
ltx/swh_redirects_oak/me.m01.d06:meGW.Prayer4.text	@ltx/swh_ke_oak/me.m01.d06:meGW.Prayer4.text
ltx/swh_redirects_oak/me.m01.d06:meGW.Prayer5.text	@ltx/swh_ke_oak/me.m01.d06:meGW.Prayer5.text
ltx/swh_redirects_oak/me.m01.d06:meGW.R01	@ltx/swh_ke_oak/me.m01.d06:meGW.R01
ltx/swh_redirects_oak/me.m01.d06:meGW.R02	@ltx/swh_ke_oak/me.m01.d06:meGW.R02
ltx/swh_redirects_oak/me.m01.d06:meGW.R03	@ltx/swh_ke_oak/me.m01.d06:meGW.R03
ltx/swh_redirects_oak/me.m01.d06:meGW.R04	@ltx/swh_ke_oak/me.m01.d06:meGW.R04
ltx/swh_redirects_oak/me.m01.d06:meGW.R05	@ltx/swh_ke_oak/me.m01.d06:meGW.R05
ltx/swh_redirects_oak/me.m01.d06:meGW.R06	@ltx/swh_ke_oak/me.m01.d06:meGW.R06
ltx/swh_redirects_oak/me.m01.d06:meGW.R071	@ltx/swh_ke_oak/me.m01.d06:meGW.R071
ltx/swh_redirects_oak/me.m01.d06:meGW.R072	@ltx/swh_ke_oak/me.m01.d06:meGW.R072
ltx/swh_redirects_oak/me.m01.d06:meGW.R073	@ltx/swh_ke_oak/me.m01.d06:meGW.R073
ltx/swh_redirects_oak/me.m01.d06:meGW.R08	@ltx/swh_ke_oak/me.m01.d06:meGW.R08
ltx/swh_redirects_oak/me.m01.d06:meGW.R09	@ltx/swh_ke_oak/me.m01.d06:meGW.R09
ltx/swh_redirects_oak/me.m01.d06:meGW.title	@ltx/swh_ke_oak/me.m01.d06:meGW.title
ltx/swh_redirects_oak/me.m01.d06:meGW.translator	@ltx/swh_ke_oak/me.m01.d06:meGW.translator
ltx/swh_redirects_oak/me.m01.d06:meHO.commemorations	@ltx/swh_ke_oak/me.m01.d06:meHO.commemorations
ltx/swh_redirects_oak/me.m01.d06:meHO.note1	@ltx/swh_ke_oak/me.m01.d06:meHO.note1
ltx/swh_redirects_oak/me.m01.d06:meHO.note2	@ltx/swh_ke_oak/me.m01.d06:meHO.note2
ltx/swh_redirects_oak/me.m01.d06:meHO.number	@ltx/swh_ke_oak/me.m01.d06:meHO.number
ltx/swh_redirects_oak/me.m01.d06:meHO.rank	@ltx/swh_ke_oak/me.m01.d06:meHO.rank
ltx/swh_redirects_oak/me.m01.d06:meLE.commemoration1	@ltx/swh_ke_oak/me.m01.d06:meLE.commemoration1
ltx/swh_redirects_oak/me.m01.d06:meLE.commemoration2	@ltx/swh_ke_oak/me.m01.d06:meLE.commemoration2
ltx/swh_redirects_oak/me.m01.d06:meLI.Kontakion1.greekmelody	@ltx/swh_ke_oak/me.m01.d06:meMA.Kontakion1.greekmelody
ltx/swh_redirects_oak/me.m01.d06:meLI.Kontakion1.incipit	@ltx/swh_ke_oak/me.m01.d06:meMA.Kontakion1.incipit
ltx/swh_redirects_oak/me.m01.d06:meLI.Kontakion1.melody	@ltx/swh_ke_oak/me.m01.d06:meMA.Kontakion1.melody
ltx/swh_redirects_oak/me.m01.d06:meLI.Kontakion1.mode	@ltx/swh_ke_oak/me.m01.d06:meMA.Kontakion1.mode
ltx/swh_redirects_oak/me.m01.d06:meLI.Kontakion1.text	@ltx/swh_ke_oak/me.m01.d06:meMA.Kontakion1.text
ltx/swh_redirects_oak/me.m01.d06:meLI.MM.CommunionHymn.text	@ltx/swh_ke_oak/properties:media.key
ltx/swh_redirects_oak/me.m01.d06:meLI.MM.EntranceHymn.text	@ltx/swh_ke_oak/me.m01.d06:meLI.MM.EntranceHymn.text
ltx/swh_redirects_oak/me.m01.d06:meLI.MM.EntranceHymnSunday.text	@ltx/swh_ke_oak/me.m01.d06:meLI.MM.EntranceHymnSunday.text
ltx/swh_redirects_oak/me.m01.d06:meLI.Megalynarion.text	@ltx/swh_ke_oak/me.m01.d06:meLI.Megalynarion.text
ltx/swh_redirects_oak/me.m01.d06:meLI.R01	@ltx/swh_ke_oak/me.m01.d06:meLI.R01
ltx/swh_redirects_oak/me.m01.d06:meLI.TheotokosHymn.incipit	@ltx/swh_ke_oak/me.m01.d06:meLI.TheotokosHymn.incipit
ltx/swh_redirects_oak/me.m01.d06:meLI.TheotokosHymn.mode	@ltx/swh_ke_oak/me.m01.d06:meLI.TheotokosHymn.mode
ltx/swh_redirects_oak/me.m01.d06:meLI.TheotokosHymn.text	@ltx/swh_ke_oak/me.m01.d06:meLI.TheotokosHymn.text
ltx/swh_redirects_oak/me.m01.d06:meLI.TheotokosHymnVerse.incipit	@ltx/swh_ke_oak/me.m01.d06:meLI.TheotokosHymnVerse.incipit
ltx/swh_redirects_oak/me.m01.d06:meLI.TheotokosHymnVerse.text	@ltx/swh_ke_oak/me.m01.d06:meLI.TheotokosHymnVerse.text
ltx/swh_redirects_oak/me.m01.d06:meMA.C1.acrostic.notice1	@ltx/swh_ke_oak/me.m01.d06:meMA.C1.acrostic.notice1
ltx/swh_redirects_oak/me.m01.d06:meMA.C1.acrostic.text	@ltx/swh_ke_oak/me.m01.d06:meMA.C1.acrostic.text
ltx/swh_redirects_oak/me.m01.d06:meMA.C1.acrostic.title	@ltx/swh_ke_oak/me.m01.d06:meMA.C1.acrostic.title
ltx/swh_redirects_oak/me.m01.d06:meMA.C1.poet	@ltx/swh_ke_oak/me.m01.d06:meMA.C1.poet
ltx/swh_redirects_oak/me.m01.d06:meMA.C1.title	@ltx/swh_ke_oak/me.m01.d06:meMA.C1.title
ltx/swh_redirects_oak/me.m01.d06:meMA.C1.verse	@ltx/swh_ke_oak/me.m01.d06:meMA.C1.verse
ltx/swh_redirects_oak/me.m01.d06:meMA.C2.acrostic.line1.text	@ltx/swh_ke_oak/me.m01.d06:meMA.C2.acrostic.line1.text
ltx/swh_redirects_oak/me.m01.d06:meMA.C2.acrostic.line2.text	@ltx/swh_ke_oak/me.m01.d06:meMA.C2.acrostic.line2.text
ltx/swh_redirects_oak/me.m01.d06:meMA.C2.acrostic.line3.text	@ltx/swh_ke_oak/me.m01.d06:meMA.C2.acrostic.line3.text
ltx/swh_redirects_oak/me.m01.d06:meMA.C2.acrostic.line4.text	@ltx/swh_ke_oak/me.m01.d06:meMA.C2.acrostic.line4.text
ltx/swh_redirects_oak/me.m01.d06:meMA.C2.acrostic.notice1	@ltx/swh_ke_oak/me.m01.d06:meMA.C2.acrostic.notice1
ltx/swh_redirects_oak/me.m01.d06:meMA.C2.acrostic.text	@ltx/swh_ke_oak/me.m01.d06:meMA.C2.acrostic.text
ltx/swh_redirects_oak/me.m01.d06:meMA.C2.acrostic.title	@ltx/swh_ke_oak/me.m01.d06:meMA.C2.acrostic.title
ltx/swh_redirects_oak/me.m01.d06:meMA.C2.poet	@ltx/swh_ke_oak/me.m01.d06:meMA.C2.poet
ltx/swh_redirects_oak/me.m01.d06:meMA.C2.title	@ltx/swh_ke_oak/me.m01.d06:meMA.C2.title
ltx/swh_redirects_oak/me.m01.d06:meMA.C2.verse	@ltx/swh_ke_oak/me.m01.d06:meMA.C2.verse
ltx/swh_redirects_oak/me.m01.d06:meMA.Exaposteilarion1.greekmelody	@ltx/swh_ke_oak/me.m01.d06:meMA.Exaposteilarion1.greekmelody
ltx/swh_redirects_oak/me.m01.d06:meMA.Exaposteilarion1.incipit	@ltx/swh_ke_oak/me.m01.d06:meMA.Exaposteilarion1.incipit
ltx/swh_redirects_oak/me.m01.d06:meMA.Exaposteilarion1.melody	@ltx/swh_ke_oak/me.m01.d06:meMA.Exaposteilarion1.melody
ltx/swh_redirects_oak/me.m01.d06:meMA.Exaposteilarion1.mode	@ltx/swh_ke_oak/me.m01.d06:meMA.Exaposteilarion1.mode
ltx/swh_redirects_oak/me.m01.d06:meMA.Exaposteilarion1.poet	@ltx/swh_ke_oak/me.m01.d06:meMA.Exaposteilarion1.poet
ltx/swh_redirects_oak/me.m01.d06:meMA.Exaposteilarion1.text	@ltx/swh_ke_oak/me.m01.d06:meMA.Exaposteilarion1.text
ltx/swh_redirects_oak/me.m01.d06:meMA.Hypakoe.incipit	@ltx/swh_ke_oak/me.m01.d06:meMA.Hypakoe.incipit
ltx/swh_redirects_oak/me.m01.d06:meMA.Hypakoe.melody	@ltx/swh_ke_oak/me.m01.d06:meMA.Hypakoe.melody
ltx/swh_redirects_oak/me.m01.d06:meMA.Hypakoe.mode	@ltx/swh_ke_oak/me.m01.d06:meMA.Hypakoe.mode
ltx/swh_redirects_oak/me.m01.d06:meMA.Hypakoe.text	@ltx/swh_ke_oak/me.m01.d06:meMA.Hypakoe.text
ltx/swh_redirects_oak/me.m01.d06:meMA.Kathisma11.greekmelody	@ltx/swh_ke_oak/me.m01.d06:meMA.Kathisma11.greekmelody
ltx/swh_redirects_oak/me.m01.d06:meMA.Kathisma11.incipit	@ltx/swh_ke_oak/me.m01.d06:meMA.Kathisma11.incipit
ltx/swh_redirects_oak/me.m01.d06:meMA.Kathisma11.melody	@ltx/swh_ke_oak/me.m01.d06:meMA.Kathisma11.melody
ltx/swh_redirects_oak/me.m01.d06:meMA.Kathisma11.mode	@ltx/swh_ke_oak/me.m01.d06:meMA.Kathisma11.mode
ltx/swh_redirects_oak/me.m01.d06:meMA.Kathisma11.text	@ltx/swh_ke_oak/me.m01.d06:meMA.Kathisma11.text
ltx/swh_redirects_oak/me.m01.d06:meMA.Kathisma21.greekmelody	@ltx/swh_ke_oak/me.m01.d06:meMA.Kathisma21.greekmelody
ltx/swh_redirects_oak/me.m01.d06:meMA.Kathisma21.incipit	@ltx/swh_ke_oak/me.m01.d06:meMA.Kathisma21.incipit
ltx/swh_redirects_oak/me.m01.d06:meMA.Kathisma21.melody	@ltx/swh_ke_oak/me.m01.d06:meMA.Kathisma21.melody
ltx/swh_redirects_oak/me.m01.d06:meMA.Kathisma21.mode	@ltx/swh_ke_oak/me.m01.d06:meMA.Kathisma21.mode
ltx/swh_redirects_oak/me.m01.d06:meMA.Kathisma21.text	@ltx/swh_ke_oak/me.m01.d06:meMA.Kathisma21.text
ltx/swh_redirects_oak/me.m01.d06:meMA.Kathisma31.greekmelody	@ltx/swh_ke_oak/me.m01.d06:meMA.Kathisma31.greekmelody
ltx/swh_redirects_oak/me.m01.d06:meMA.Kathisma31.incipit	@ltx/swh_ke_oak/me.m01.d06:meMA.Kathisma31.incipit
ltx/swh_redirects_oak/me.m01.d06:meMA.Kathisma31.melody	@ltx/swh_ke_oak/me.m01.d06:meMA.Kathisma31.melody
ltx/swh_redirects_oak/me.m01.d06:meMA.Kathisma31.mode	@ltx/swh_ke_oak/me.m01.d06:meMA.Kathisma31.mode
ltx/swh_redirects_oak/me.m01.d06:meMA.Kathisma31.text	@ltx/swh_ke_oak/me.m01.d06:meMA.Kathisma31.text
ltx/swh_redirects_oak/me.m01.d06:meMA.Kontakion1.greekmelody	@ltx/swh_ke_oak/me.m01.d06:meMA.Kontakion1.greekmelody
ltx/swh_redirects_oak/me.m01.d06:meMA.Kontakion1.incipit	@ltx/swh_ke_oak/me.m01.d06:meMA.Kontakion1.incipit
ltx/swh_redirects_oak/me.m01.d06:meMA.Kontakion1.melody	@ltx/swh_ke_oak/me.m01.d06:meMA.Kontakion1.melody
ltx/swh_redirects_oak/me.m01.d06:meMA.Kontakion1.mode	@ltx/swh_ke_oak/me.m01.d06:meMA.Kontakion1.mode
ltx/swh_redirects_oak/me.m01.d06:meMA.Kontakion1.poet	@ltx/swh_ke_oak/me.m01.d06:meMA.Kontakion1.poet
ltx/swh_redirects_oak/me.m01.d06:meMA.Kontakion1.text	@ltx/swh_ke_oak/me.m01.d06:meMA.Kontakion1.text
ltx/swh_redirects_oak/me.m01.d06:meMA.Lauds1.incipit	@ltx/swh_ke_oak/me.m01.d06:meMA.Lauds1.incipit
ltx/swh_redirects_oak/me.m01.d06:meMA.Lauds1.melody	@ltx/swh_ke_oak/me.m01.d06:meMA.Lauds1.melody
ltx/swh_redirects_oak/me.m01.d06:meMA.Lauds1.mode	@ltx/swh_ke_oak/me.m01.d06:meMA.Lauds1.mode
ltx/swh_redirects_oak/me.m01.d06:meMA.Lauds1.poet	@ltx/swh_ke_oak/me.m01.d06:meMA.Lauds1.poet
ltx/swh_redirects_oak/me.m01.d06:meMA.Lauds1.text	@ltx/swh_ke_oak/me.m01.d06:meMA.Lauds1.text
ltx/swh_redirects_oak/me.m01.d06:meMA.Lauds2.incipit	@ltx/swh_ke_oak/me.m01.d06:meMA.Lauds2.incipit
ltx/swh_redirects_oak/me.m01.d06:meMA.Lauds2.melody	@ltx/swh_ke_oak/me.m01.d06:meMA.Lauds2.melody
ltx/swh_redirects_oak/me.m01.d06:meMA.Lauds2.mode	@ltx/swh_ke_oak/me.m01.d06:meMA.Lauds2.mode
ltx/swh_redirects_oak/me.m01.d06:meMA.Lauds2.text	@ltx/swh_ke_oak/me.m01.d06:meMA.Lauds2.text
ltx/swh_redirects_oak/me.m01.d06:meMA.Lauds3.incipit	@ltx/swh_ke_oak/me.m01.d06:meMA.Lauds3.incipit
ltx/swh_redirects_oak/me.m01.d06:meMA.Lauds3.melody	@ltx/swh_ke_oak/me.m01.d06:meMA.Lauds3.melody
ltx/swh_redirects_oak/me.m01.d06:meMA.Lauds3.mode	@ltx/swh_ke_oak/me.m01.d06:meMA.Lauds3.mode
ltx/swh_redirects_oak/me.m01.d06:meMA.Lauds3.text	@ltx/swh_ke_oak/me.m01.d06:meMA.Lauds3.text
ltx/swh_redirects_oak/me.m01.d06:meMA.Lauds4.incipit	@ltx/swh_ke_oak/me.m01.d06:meMA.Lauds4.incipit
ltx/swh_redirects_oak/me.m01.d06:meMA.Lauds4.melody	@ltx/swh_ke_oak/me.m01.d06:meMA.Lauds4.melody
ltx/swh_redirects_oak/me.m01.d06:meMA.Lauds4.mode	@ltx/swh_ke_oak/me.m01.d06:meMA.Lauds4.mode
ltx/swh_redirects_oak/me.m01.d06:meMA.Lauds4.text	@ltx/swh_ke_oak/me.m01.d06:meMA.Lauds4.text
ltx/swh_redirects_oak/me.m01.d06:meMA.Lauds5.incipit	@ltx/swh_ke_oak/me.m01.d06:meMA.Lauds5.incipit
ltx/swh_redirects_oak/me.m01.d06:meMA.Lauds5.melody	@ltx/swh_ke_oak/me.m01.d06:meMA.Lauds5.melody
ltx/swh_redirects_oak/me.m01.d06:meMA.Lauds5.mode	@ltx/swh_ke_oak/me.m01.d06:meMA.Lauds5.mode
ltx/swh_redirects_oak/me.m01.d06:meMA.Lauds5.poet	@ltx/swh_ke_oak/me.m01.d06:meMA.Lauds5.poet
ltx/swh_redirects_oak/me.m01.d06:meMA.Lauds5.text	@ltx/swh_ke_oak/me.m01.d06:meMA.Lauds5.text
ltx/swh_redirects_oak/me.m01.d06:meMA.LaudsBoth.incipit	@ltx/swh_ke_oak/me.m01.d06:meMA.LaudsBoth.incipit
ltx/swh_redirects_oak/me.m01.d06:meMA.LaudsBoth.melody	@ltx/swh_ke_oak/me.m01.d06:meMA.LaudsBoth.melody
ltx/swh_redirects_oak/me.m01.d06:meMA.LaudsBoth.mode	@ltx/swh_ke_oak/me.m01.d06:meMA.LaudsBoth.mode
ltx/swh_redirects_oak/me.m01.d06:meMA.LaudsBoth.poet	@ltx/swh_ke_oak/me.m01.d06:meMA.LaudsBoth.poet
ltx/swh_redirects_oak/me.m01.d06:meMA.LaudsBoth.text	@ltx/swh_ke_oak/me.m01.d06:meMA.LaudsBoth.text
ltx/swh_redirects_oak/me.m01.d06:meMA.LaudsGlory.incipit	@ltx/swh_ke_oak/me.m01.d06:meMA.LaudsGlory.incipit
ltx/swh_redirects_oak/me.m01.d06:meMA.LaudsGlory.melody	@ltx/swh_ke_oak/me.m01.d06:meMA.LaudsGlory.melody
ltx/swh_redirects_oak/me.m01.d06:meMA.LaudsGlory.mode	@ltx/swh_ke_oak/me.m01.d06:meMA.LaudsGlory.mode
ltx/swh_redirects_oak/me.m01.d06:meMA.LaudsGlory.poet	@ltx/swh_ke_oak/me.m01.d06:meMA.LaudsGlory.poet
ltx/swh_redirects_oak/me.m01.d06:meMA.LaudsGlory.text	@ltx/swh_ke_oak/me.m01.d06:meMA.LaudsGlory.text
ltx/swh_redirects_oak/me.m01.d06:meMA.MM.Lauds1234as5678.text	@ltx/swh_ke_oak/me.m01.d06:meMA.MM.Lauds1234as5678.text
ltx/swh_redirects_oak/me.m01.d06:meMA.Ode1C11.greekmelody	@ltx/swh_ke_oak/me.m01.d06:meMA.Ode1C11.greekmelody
ltx/swh_redirects_oak/me.m01.d06:meMA.Ode1C11.incipit	@ltx/swh_ke_oak/me.m01.d06:meMA.Ode1C11.incipit
ltx/swh_redirects_oak/me.m01.d06:meMA.Ode1C11.melody	@ltx/swh_ke_oak/me.m01.d06:meMA.Ode1C11.melody
ltx/swh_redirects_oak/me.m01.d06:meMA.Ode1C11.mode	@ltx/swh_ke_oak/me.m01.d06:meMA.Ode1C11.mode
ltx/swh_redirects_oak/me.m01.d06:meMA.Ode1C11.ode	@ltx/swh_ke_oak/me.m01.d06:meMA.Ode1C11.ode
ltx/swh_redirects_oak/me.m01.d06:meMA.Ode1C11.text	@ltx/swh_ke_oak/me.m01.d06:meMA.Ode1C11.text
ltx/swh_redirects_oak/me.m01.d06:meMA.Ode1C12.incipit	@ltx/swh_ke_oak/me.m01.d06:meMA.Ode1C12.incipit
ltx/swh_redirects_oak/me.m01.d06:meMA.Ode1C12.melody	@ltx/swh_ke_oak/me.m01.d06:meMA.Ode1C12.melody
ltx/swh_redirects_oak/me.m01.d06:meMA.Ode1C12.mode	@ltx/swh_ke_oak/me.m01.d06:meMA.Ode1C12.mode
ltx/swh_redirects_oak/me.m01.d06:meMA.Ode1C12.ode	@ltx/swh_ke_oak/me.m01.d06:meMA.Ode1C12.ode
ltx/swh_redirects_oak/me.m01.d06:meMA.Ode1C12.text	@ltx/swh_ke_oak/me.m01.d06:meMA.Ode1C12.text
ltx/swh_redirects_oak/me.m01.d06:meMA.Ode1C13.incipit	@ltx/swh_ke_oak/me.m01.d06:meMA.Ode1C13.incipit
ltx/swh_redirects_oak/me.m01.d06:meMA.Ode1C13.melody	@ltx/swh_ke_oak/me.m01.d06:meMA.Ode1C13.melody
ltx/swh_redirects_oak/me.m01.d06:meMA.Ode1C13.mode	@ltx/swh_ke_oak/me.m01.d06:meMA.Ode1C13.mode
ltx/swh_redirects_oak/me.m01.d06:meMA.Ode1C13.ode	@ltx/swh_ke_oak/me.m01.d06:meMA.Ode1C13.ode
ltx/swh_redirects_oak/me.m01.d06:meMA.Ode1C13.text	@ltx/swh_ke_oak/me.m01.d06:meMA.Ode1C13.text
ltx/swh_redirects_oak/me.m01.d06:meMA.Ode1C1H.greekmelody	@ltx/swh_ke_oak/me.m01.d06:meMA.Ode1C1H.greekmelody
ltx/swh_redirects_oak/me.m01.d06:meMA.Ode1C1H.incipit	@ltx/swh_ke_oak/me.m01.d06:meMA.Ode1C1H.incipit
ltx/swh_redirects_oak/me.m01.d06:meMA.Ode1C1H.melody	@ltx/swh_ke_oak/me.m01.d06:meMA.Ode1C1H.melody
ltx/swh_redirects_oak/me.m01.d06:meMA.Ode1C1H.mode	@ltx/swh_ke_oak/me.m01.d06:meMA.Ode1C1H.mode
ltx/swh_redirects_oak/me.m01.d06:meMA.Ode1C1H.ode	@ltx/swh_ke_oak/me.m01.d06:meMA.Ode1C1H.ode
ltx/swh_redirects_oak/me.m01.d06:meMA.Ode1C1H.text	@ltx/swh_ke_oak/me.m01.d06:meMA.Ode1C1H.text
ltx/swh_redirects_oak/me.m01.d06:meMA.Ode1C21.greekmelody	@ltx/swh_ke_oak/me.m01.d06:meMA.Ode1C21.greekmelody
ltx/swh_redirects_oak/me.m01.d06:meMA.Ode1C21.incipit	@ltx/swh_ke_oak/me.m01.d06:meMA.Ode1C21.incipit
ltx/swh_redirects_oak/me.m01.d06:meMA.Ode1C21.melody	@ltx/swh_ke_oak/me.m01.d06:meMA.Ode1C21.melody
ltx/swh_redirects_oak/me.m01.d06:meMA.Ode1C21.mode	@ltx/swh_ke_oak/me.m01.d06:meMA.Ode1C21.mode
ltx/swh_redirects_oak/me.m01.d06:meMA.Ode1C21.ode	@ltx/swh_ke_oak/me.m01.d06:meMA.Ode1C21.ode
ltx/swh_redirects_oak/me.m01.d06:meMA.Ode1C21.text	@ltx/swh_ke_oak/me.m01.d06:meMA.Ode1C21.text
ltx/swh_redirects_oak/me.m01.d06:meMA.Ode1C211.text	@ltx/swh_ke_oak/me.m01.d06:meMA.Ode1C211.text
ltx/swh_redirects_oak/me.m01.d06:meMA.Ode1C212.text	@ltx/swh_ke_oak/me.m01.d06:meMA.Ode1C212.text
ltx/swh_redirects_oak/me.m01.d06:meMA.Ode1C213.text	@ltx/swh_ke_oak/me.m01.d06:meMA.Ode1C213.text
ltx/swh_redirects_oak/me.m01.d06:meMA.Ode1C214.text	@ltx/swh_ke_oak/me.m01.d06:meMA.Ode1C214.text
ltx/swh_redirects_oak/me.m01.d06:meMA.Ode1C215.text	@ltx/swh_ke_oak/me.m01.d06:meMA.Ode1C215.text
ltx/swh_redirects_oak/me.m01.d06:meMA.Ode1C22.incipit	@ltx/swh_ke_oak/me.m01.d06:meMA.Ode1C22.incipit
ltx/swh_redirects_oak/me.m01.d06:meMA.Ode1C22.melody	@ltx/swh_ke_oak/me.m01.d06:meMA.Ode1C22.melody
ltx/swh_redirects_oak/me.m01.d06:meMA.Ode1C22.mode	@ltx/swh_ke_oak/me.m01.d06:meMA.Ode1C22.mode
ltx/swh_redirects_oak/me.m01.d06:meMA.Ode1C22.ode	@ltx/swh_ke_oak/me.m01.d06:meMA.Ode1C22.ode
ltx/swh_redirects_oak/me.m01.d06:meMA.Ode1C22.text	@ltx/swh_ke_oak/me.m01.d06:meMA.Ode1C22.text
ltx/swh_redirects_oak/me.m01.d06:meMA.Ode1C221.text	@ltx/swh_ke_oak/me.m01.d06:meMA.Ode1C221.text
ltx/swh_redirects_oak/me.m01.d06:meMA.Ode1C222.text	@ltx/swh_ke_oak/me.m01.d06:meMA.Ode1C222.text
ltx/swh_redirects_oak/me.m01.d06:meMA.Ode1C223.text	@ltx/swh_ke_oak/me.m01.d06:meMA.Ode1C223.text
ltx/swh_redirects_oak/me.m01.d06:meMA.Ode1C224.text	@ltx/swh_ke_oak/me.m01.d06:meMA.Ode1C224.text
ltx/swh_redirects_oak/me.m01.d06:meMA.Ode1C225.text	@ltx/swh_ke_oak/me.m01.d06:meMA.Ode1C225.text
ltx/swh_redirects_oak/me.m01.d06:meMA.Ode1C2H.greekmelody	@ltx/swh_ke_oak/me.m01.d06:meMA.Ode1C2H.greekmelody
ltx/swh_redirects_oak/me.m01.d06:meMA.Ode1C2H.incipit	@ltx/swh_ke_oak/me.m01.d06:meMA.Ode1C2H.incipit
ltx/swh_redirects_oak/me.m01.d06:meMA.Ode1C2H.melody	@ltx/swh_ke_oak/me.m01.d06:meMA.Ode1C2H.melody
ltx/swh_redirects_oak/me.m01.d06:meMA.Ode1C2H.mode	@ltx/swh_ke_oak/me.m01.d06:meMA.Ode1C2H.mode
ltx/swh_redirects_oak/me.m01.d06:meMA.Ode1C2H.ode	@ltx/swh_ke_oak/me.m01.d06:meMA.Ode1C2H.ode
ltx/swh_redirects_oak/me.m01.d06:meMA.Ode1C2H.text	@ltx/swh_ke_oak/me.m01.d06:meMA.Ode1C2H.text
ltx/swh_redirects_oak/me.m01.d06:meMA.Ode1C2H1.text	@ltx/swh_ke_oak/me.m01.d06:meMA.Ode1C2H1.text
ltx/swh_redirects_oak/me.m01.d06:meMA.Ode1C2H2.text	@ltx/swh_ke_oak/me.m01.d06:meMA.Ode1C2H2.text
ltx/swh_redirects_oak/me.m01.d06:meMA.Ode1C2H3.text	@ltx/swh_ke_oak/me.m01.d06:meMA.Ode1C2H3.text
ltx/swh_redirects_oak/me.m01.d06:meMA.Ode1C2H4.text	@ltx/swh_ke_oak/me.m01.d06:meMA.Ode1C2H4.text
ltx/swh_redirects_oak/me.m01.d06:meMA.Ode1C2H5.text	@ltx/swh_ke_oak/me.m01.d06:meMA.Ode1C2H5.text
ltx/swh_redirects_oak/me.m01.d06:meMA.Ode3C11.greekmelody	@ltx/swh_ke_oak/me.m01.d06:meMA.Ode3C11.greekmelody
ltx/swh_redirects_oak/me.m01.d06:meMA.Ode3C11.incipit	@ltx/swh_ke_oak/me.m01.d06:meMA.Ode3C11.incipit
ltx/swh_redirects_oak/me.m01.d06:meMA.Ode3C11.melody	@ltx/swh_ke_oak/me.m01.d06:meMA.Ode3C11.melody
ltx/swh_redirects_oak/me.m01.d06:meMA.Ode3C11.mode	@ltx/swh_ke_oak/me.m01.d06:meMA.Ode3C11.mode
ltx/swh_redirects_oak/me.m01.d06:meMA.Ode3C11.ode	@ltx/swh_ke_oak/me.m01.d06:meMA.Ode3C11.ode
ltx/swh_redirects_oak/me.m01.d06:meMA.Ode3C11.text	@ltx/swh_ke_oak/me.m01.d06:meMA.Ode3C11.text
ltx/swh_redirects_oak/me.m01.d06:meMA.Ode3C12.incipit	@ltx/swh_ke_oak/me.m01.d06:meMA.Ode3C12.incipit
ltx/swh_redirects_oak/me.m01.d06:meMA.Ode3C12.melody	@ltx/swh_ke_oak/me.m01.d06:meMA.Ode3C12.melody
ltx/swh_redirects_oak/me.m01.d06:meMA.Ode3C12.mode	@ltx/swh_ke_oak/me.m01.d06:meMA.Ode3C12.mode
ltx/swh_redirects_oak/me.m01.d06:meMA.Ode3C12.ode	@ltx/swh_ke_oak/me.m01.d06:meMA.Ode3C12.ode
ltx/swh_redirects_oak/me.m01.d06:meMA.Ode3C12.text	@ltx/swh_ke_oak/me.m01.d06:meMA.Ode3C12.text
ltx/swh_redirects_oak/me.m01.d06:meMA.Ode3C1H.greekmelody	@ltx/swh_ke_oak/me.m01.d06:meMA.Ode3C1H.greekmelody
ltx/swh_redirects_oak/me.m01.d06:meMA.Ode3C1H.incipit	@ltx/swh_ke_oak/me.m01.d06:meMA.Ode3C1H.incipit
ltx/swh_redirects_oak/me.m01.d06:meMA.Ode3C1H.melody	@ltx/swh_ke_oak/me.m01.d06:meMA.Ode3C1H.melody
ltx/swh_redirects_oak/me.m01.d06:meMA.Ode3C1H.mode	@ltx/swh_ke_oak/me.m01.d06:meMA.Ode3C1H.mode
ltx/swh_redirects_oak/me.m01.d06:meMA.Ode3C1H.ode	@ltx/swh_ke_oak/me.m01.d06:meMA.Ode3C1H.ode
ltx/swh_redirects_oak/me.m01.d06:meMA.Ode3C1H.text	@ltx/swh_ke_oak/me.m01.d06:meMA.Ode3C1H.text
ltx/swh_redirects_oak/me.m01.d06:meMA.Ode3C21.greekmelody	@ltx/swh_ke_oak/me.m01.d06:meMA.Ode3C21.greekmelody
ltx/swh_redirects_oak/me.m01.d06:meMA.Ode3C21.incipit	@ltx/swh_ke_oak/me.m01.d06:meMA.Ode3C21.incipit
ltx/swh_redirects_oak/me.m01.d06:meMA.Ode3C21.melody	@ltx/swh_ke_oak/me.m01.d06:meMA.Ode3C21.melody
ltx/swh_redirects_oak/me.m01.d06:meMA.Ode3C21.mode	@ltx/swh_ke_oak/me.m01.d06:meMA.Ode3C21.mode
ltx/swh_redirects_oak/me.m01.d06:meMA.Ode3C21.ode	@ltx/swh_ke_oak/me.m01.d06:meMA.Ode3C21.ode
ltx/swh_redirects_oak/me.m01.d06:meMA.Ode3C21.text	@ltx/swh_ke_oak/me.m01.d06:meMA.Ode3C21.text
ltx/swh_redirects_oak/me.m01.d06:meMA.Ode3C211.text	@ltx/swh_ke_oak/me.m01.d06:meMA.Ode3C211.text
ltx/swh_redirects_oak/me.m01.d06:meMA.Ode3C212.text	@ltx/swh_ke_oak/me.m01.d06:meMA.Ode3C212.text
ltx/swh_redirects_oak/me.m01.d06:meMA.Ode3C213.text	@ltx/swh_ke_oak/me.m01.d06:meMA.Ode3C213.text
ltx/swh_redirects_oak/me.m01.d06:meMA.Ode3C214.text	@ltx/swh_ke_oak/me.m01.d06:meMA.Ode3C214.text
ltx/swh_redirects_oak/me.m01.d06:meMA.Ode3C215.text	@ltx/swh_ke_oak/me.m01.d06:meMA.Ode3C215.text
ltx/swh_redirects_oak/me.m01.d06:meMA.Ode3C22.incipit	@ltx/swh_ke_oak/me.m01.d06:meMA.Ode3C22.incipit
ltx/swh_redirects_oak/me.m01.d06:meMA.Ode3C22.melody	@ltx/swh_ke_oak/me.m01.d06:meMA.Ode3C22.melody
ltx/swh_redirects_oak/me.m01.d06:meMA.Ode3C22.mode	@ltx/swh_ke_oak/me.m01.d06:meMA.Ode3C22.mode
ltx/swh_redirects_oak/me.m01.d06:meMA.Ode3C22.ode	@ltx/swh_ke_oak/me.m01.d06:meMA.Ode3C22.ode
ltx/swh_redirects_oak/me.m01.d06:meMA.Ode3C22.text	@ltx/swh_ke_oak/me.m01.d06:meMA.Ode3C22.text
ltx/swh_redirects_oak/me.m01.d06:meMA.Ode3C221.text	@ltx/swh_ke_oak/me.m01.d06:meMA.Ode3C221.text
ltx/swh_redirects_oak/me.m01.d06:meMA.Ode3C222.text	@ltx/swh_ke_oak/me.m01.d06:meMA.Ode3C222.text
ltx/swh_redirects_oak/me.m01.d06:meMA.Ode3C223.text	@ltx/swh_ke_oak/me.m01.d06:meMA.Ode3C223.text
ltx/swh_redirects_oak/me.m01.d06:meMA.Ode3C224.text	@ltx/swh_ke_oak/me.m01.d06:meMA.Ode3C224.text
ltx/swh_redirects_oak/me.m01.d06:meMA.Ode3C225.text	@ltx/swh_ke_oak/me.m01.d06:meMA.Ode3C225.text
ltx/swh_redirects_oak/me.m01.d06:meMA.Ode3C2H.greekmelody	@ltx/swh_ke_oak/me.m01.d06:meMA.Ode3C2H.greekmelody
ltx/swh_redirects_oak/me.m01.d06:meMA.Ode3C2H.incipit	@ltx/swh_ke_oak/me.m01.d06:meMA.Ode3C2H.incipit
ltx/swh_redirects_oak/me.m01.d06:meMA.Ode3C2H.melody	@ltx/swh_ke_oak/me.m01.d06:meMA.Ode3C2H.melody
ltx/swh_redirects_oak/me.m01.d06:meMA.Ode3C2H.mode	@ltx/swh_ke_oak/me.m01.d06:meMA.Ode3C2H.mode
ltx/swh_redirects_oak/me.m01.d06:meMA.Ode3C2H.ode	@ltx/swh_ke_oak/me.m01.d06:meMA.Ode3C2H.ode
ltx/swh_redirects_oak/me.m01.d06:meMA.Ode3C2H.text	@ltx/swh_ke_oak/me.m01.d06:meMA.Ode3C2H.text
ltx/swh_redirects_oak/me.m01.d06:meMA.Ode3C2H1.text	@ltx/swh_ke_oak/me.m01.d06:meMA.Ode3C2H1.text
ltx/swh_redirects_oak/me.m01.d06:meMA.Ode3C2H2.text	@ltx/swh_ke_oak/me.m01.d06:meMA.Ode3C2H2.text
ltx/swh_redirects_oak/me.m01.d06:meMA.Ode3C2H3.text	@ltx/swh_ke_oak/me.m01.d06:meMA.Ode3C2H3.text
ltx/swh_redirects_oak/me.m01.d06:meMA.Ode3C2H4.text	@ltx/swh_ke_oak/me.m01.d06:meMA.Ode3C2H4.text
ltx/swh_redirects_oak/me.m01.d06:meMA.Ode3C2H5.text	@ltx/swh_ke_oak/me.m01.d06:meMA.Ode3C2H5.text
ltx/swh_redirects_oak/me.m01.d06:meMA.Ode4C11.greekmelody	@ltx/swh_ke_oak/me.m01.d06:meMA.Ode4C11.greekmelody
ltx/swh_redirects_oak/me.m01.d06:meMA.Ode4C11.incipit	@ltx/swh_ke_oak/me.m01.d06:meMA.Ode4C11.incipit
ltx/swh_redirects_oak/me.m01.d06:meMA.Ode4C11.melody	@ltx/swh_ke_oak/me.m01.d06:meMA.Ode4C11.melody
ltx/swh_redirects_oak/me.m01.d06:meMA.Ode4C11.mode	@ltx/swh_ke_oak/me.m01.d06:meMA.Ode4C11.mode
ltx/swh_redirects_oak/me.m01.d06:meMA.Ode4C11.ode	@ltx/swh_ke_oak/me.m01.d06:meMA.Ode4C11.ode
ltx/swh_redirects_oak/me.m01.d06:meMA.Ode4C11.text	@ltx/swh_ke_oak/me.m01.d06:meMA.Ode4C11.text
ltx/swh_redirects_oak/me.m01.d06:meMA.Ode4C12.incipit	@ltx/swh_ke_oak/me.m01.d06:meMA.Ode4C12.incipit
ltx/swh_redirects_oak/me.m01.d06:meMA.Ode4C12.melody	@ltx/swh_ke_oak/me.m01.d06:meMA.Ode4C12.melody
ltx/swh_redirects_oak/me.m01.d06:meMA.Ode4C12.mode	@ltx/swh_ke_oak/me.m01.d06:meMA.Ode4C12.mode
ltx/swh_redirects_oak/me.m01.d06:meMA.Ode4C12.ode	@ltx/swh_ke_oak/me.m01.d06:meMA.Ode4C12.ode
ltx/swh_redirects_oak/me.m01.d06:meMA.Ode4C12.text	@ltx/swh_ke_oak/me.m01.d06:meMA.Ode4C12.text
ltx/swh_redirects_oak/me.m01.d06:meMA.Ode4C13.incipit	@ltx/swh_ke_oak/me.m01.d06:meMA.Ode4C13.incipit
ltx/swh_redirects_oak/me.m01.d06:meMA.Ode4C13.melody	@ltx/swh_ke_oak/me.m01.d06:meMA.Ode4C13.melody
ltx/swh_redirects_oak/me.m01.d06:meMA.Ode4C13.mode	@ltx/swh_ke_oak/me.m01.d06:meMA.Ode4C13.mode
ltx/swh_redirects_oak/me.m01.d06:meMA.Ode4C13.ode	@ltx/swh_ke_oak/me.m01.d06:meMA.Ode4C13.ode
ltx/swh_redirects_oak/me.m01.d06:meMA.Ode4C13.text	@ltx/swh_ke_oak/me.m01.d06:meMA.Ode4C13.text
ltx/swh_redirects_oak/me.m01.d06:meMA.Ode4C1H.greekmelody	@ltx/swh_ke_oak/me.m01.d06:meMA.Ode4C1H.greekmelody
ltx/swh_redirects_oak/me.m01.d06:meMA.Ode4C1H.incipit	@ltx/swh_ke_oak/me.m01.d06:meMA.Ode4C1H.incipit
ltx/swh_redirects_oak/me.m01.d06:meMA.Ode4C1H.melody	@ltx/swh_ke_oak/me.m01.d06:meMA.Ode4C1H.melody
ltx/swh_redirects_oak/me.m01.d06:meMA.Ode4C1H.mode	@ltx/swh_ke_oak/me.m01.d06:meMA.Ode4C1H.mode
ltx/swh_redirects_oak/me.m01.d06:meMA.Ode4C1H.ode	@ltx/swh_ke_oak/me.m01.d06:meMA.Ode4C1H.ode
ltx/swh_redirects_oak/me.m01.d06:meMA.Ode4C1H.text	@ltx/swh_ke_oak/me.m01.d06:meMA.Ode4C1H.text
ltx/swh_redirects_oak/me.m01.d06:meMA.Ode4C21.greekmelody	@ltx/swh_ke_oak/me.m01.d06:meMA.Ode4C21.greekmelody
ltx/swh_redirects_oak/me.m01.d06:meMA.Ode4C21.incipit	@ltx/swh_ke_oak/me.m01.d06:meMA.Ode4C21.incipit
ltx/swh_redirects_oak/me.m01.d06:meMA.Ode4C21.melody	@ltx/swh_ke_oak/me.m01.d06:meMA.Ode4C21.melody
ltx/swh_redirects_oak/me.m01.d06:meMA.Ode4C21.mode	@ltx/swh_ke_oak/me.m01.d06:meMA.Ode4C21.mode
ltx/swh_redirects_oak/me.m01.d06:meMA.Ode4C21.ode	@ltx/swh_ke_oak/me.m01.d06:meMA.Ode4C21.ode
ltx/swh_redirects_oak/me.m01.d06:meMA.Ode4C21.text	@ltx/swh_ke_oak/me.m01.d06:meMA.Ode4C21.text
ltx/swh_redirects_oak/me.m01.d06:meMA.Ode4C211.text	@ltx/swh_ke_oak/me.m01.d06:meMA.Ode4C211.text
ltx/swh_redirects_oak/me.m01.d06:meMA.Ode4C212.text	@ltx/swh_ke_oak/me.m01.d06:meMA.Ode4C212.text
ltx/swh_redirects_oak/me.m01.d06:meMA.Ode4C213.text	@ltx/swh_ke_oak/me.m01.d06:meMA.Ode4C213.text
ltx/swh_redirects_oak/me.m01.d06:meMA.Ode4C214.text	@ltx/swh_ke_oak/me.m01.d06:meMA.Ode4C214.text
ltx/swh_redirects_oak/me.m01.d06:meMA.Ode4C215.text	@ltx/swh_ke_oak/me.m01.d06:meMA.Ode4C215.text
ltx/swh_redirects_oak/me.m01.d06:meMA.Ode4C22.incipit	@ltx/swh_ke_oak/me.m01.d06:meMA.Ode4C22.incipit
ltx/swh_redirects_oak/me.m01.d06:meMA.Ode4C22.melody	@ltx/swh_ke_oak/me.m01.d06:meMA.Ode4C22.melody
ltx/swh_redirects_oak/me.m01.d06:meMA.Ode4C22.mode	@ltx/swh_ke_oak/me.m01.d06:meMA.Ode4C22.mode
ltx/swh_redirects_oak/me.m01.d06:meMA.Ode4C22.ode	@ltx/swh_ke_oak/me.m01.d06:meMA.Ode4C22.ode
ltx/swh_redirects_oak/me.m01.d06:meMA.Ode4C22.text	@ltx/swh_ke_oak/me.m01.d06:meMA.Ode4C22.text
ltx/swh_redirects_oak/me.m01.d06:meMA.Ode4C221.text	@ltx/swh_ke_oak/me.m01.d06:meMA.Ode4C221.text
ltx/swh_redirects_oak/me.m01.d06:meMA.Ode4C222.text	@ltx/swh_ke_oak/me.m01.d06:meMA.Ode4C222.text
ltx/swh_redirects_oak/me.m01.d06:meMA.Ode4C223.text	@ltx/swh_ke_oak/me.m01.d06:meMA.Ode4C223.text
ltx/swh_redirects_oak/me.m01.d06:meMA.Ode4C224.text	@ltx/swh_ke_oak/me.m01.d06:meMA.Ode4C224.text
ltx/swh_redirects_oak/me.m01.d06:meMA.Ode4C225.text	@ltx/swh_ke_oak/me.m01.d06:meMA.Ode4C225.text
ltx/swh_redirects_oak/me.m01.d06:meMA.Ode4C23.incipit	@ltx/swh_ke_oak/me.m01.d06:meMA.Ode4C23.incipit
ltx/swh_redirects_oak/me.m01.d06:meMA.Ode4C23.melody	@ltx/swh_ke_oak/me.m01.d06:meMA.Ode4C23.melody
ltx/swh_redirects_oak/me.m01.d06:meMA.Ode4C23.mode	@ltx/swh_ke_oak/me.m01.d06:meMA.Ode4C23.mode
ltx/swh_redirects_oak/me.m01.d06:meMA.Ode4C23.ode	@ltx/swh_ke_oak/me.m01.d06:meMA.Ode4C23.ode
ltx/swh_redirects_oak/me.m01.d06:meMA.Ode4C23.text	@ltx/swh_ke_oak/me.m01.d06:meMA.Ode4C23.text
ltx/swh_redirects_oak/me.m01.d06:meMA.Ode4C231.text	@ltx/swh_ke_oak/me.m01.d06:meMA.Ode4C231.text
ltx/swh_redirects_oak/me.m01.d06:meMA.Ode4C232.text	@ltx/swh_ke_oak/me.m01.d06:meMA.Ode4C232.text
ltx/swh_redirects_oak/me.m01.d06:meMA.Ode4C233.text	@ltx/swh_ke_oak/me.m01.d06:meMA.Ode4C233.text
ltx/swh_redirects_oak/me.m01.d06:meMA.Ode4C234.text	@ltx/swh_ke_oak/me.m01.d06:meMA.Ode4C234.text
ltx/swh_redirects_oak/me.m01.d06:meMA.Ode4C235.text	@ltx/swh_ke_oak/me.m01.d06:meMA.Ode4C235.text
ltx/swh_redirects_oak/me.m01.d06:meMA.Ode4C2H.greekmelody	@ltx/swh_ke_oak/me.m01.d06:meMA.Ode4C2H.greekmelody
ltx/swh_redirects_oak/me.m01.d06:meMA.Ode4C2H.incipit	@ltx/swh_ke_oak/me.m01.d06:meMA.Ode4C2H.incipit
ltx/swh_redirects_oak/me.m01.d06:meMA.Ode4C2H.melody	@ltx/swh_ke_oak/me.m01.d06:meMA.Ode4C2H.melody
ltx/swh_redirects_oak/me.m01.d06:meMA.Ode4C2H.mode	@ltx/swh_ke_oak/me.m01.d06:meMA.Ode4C2H.mode
ltx/swh_redirects_oak/me.m01.d06:meMA.Ode4C2H.ode	@ltx/swh_ke_oak/me.m01.d06:meMA.Ode4C2H.ode
ltx/swh_redirects_oak/me.m01.d06:meMA.Ode4C2H.text	@ltx/swh_ke_oak/me.m01.d06:meMA.Ode4C2H.text
ltx/swh_redirects_oak/me.m01.d06:meMA.Ode4C2H1.text	@ltx/swh_ke_oak/me.m01.d06:meMA.Ode4C2H1.text
ltx/swh_redirects_oak/me.m01.d06:meMA.Ode4C2H2.text	@ltx/swh_ke_oak/me.m01.d06:meMA.Ode4C2H2.text
ltx/swh_redirects_oak/me.m01.d06:meMA.Ode4C2H3.text	@ltx/swh_ke_oak/me.m01.d06:meMA.Ode4C2H3.text
ltx/swh_redirects_oak/me.m01.d06:meMA.Ode4C2H4.text	@ltx/swh_ke_oak/me.m01.d06:meMA.Ode4C2H4.text
ltx/swh_redirects_oak/me.m01.d06:meMA.Ode4C2H5.text	@ltx/swh_ke_oak/me.m01.d06:meMA.Ode4C2H5.text
ltx/swh_redirects_oak/me.m01.d06:meMA.Ode5C11.greekmelody	@ltx/swh_ke_oak/me.m01.d06:meMA.Ode5C11.greekmelody
ltx/swh_redirects_oak/me.m01.d06:meMA.Ode5C11.incipit	@ltx/swh_ke_oak/me.m01.d06:meMA.Ode5C11.incipit
ltx/swh_redirects_oak/me.m01.d06:meMA.Ode5C11.melody	@ltx/swh_ke_oak/me.m01.d06:meMA.Ode5C11.melody
ltx/swh_redirects_oak/me.m01.d06:meMA.Ode5C11.mode	@ltx/swh_ke_oak/me.m01.d06:meMA.Ode5C11.mode
ltx/swh_redirects_oak/me.m01.d06:meMA.Ode5C11.ode	@ltx/swh_ke_oak/me.m01.d06:meMA.Ode5C11.ode
ltx/swh_redirects_oak/me.m01.d06:meMA.Ode5C11.text	@ltx/swh_ke_oak/me.m01.d06:meMA.Ode5C11.text
ltx/swh_redirects_oak/me.m01.d06:meMA.Ode5C12.incipit	@ltx/swh_ke_oak/me.m01.d06:meMA.Ode5C12.incipit
ltx/swh_redirects_oak/me.m01.d06:meMA.Ode5C12.melody	@ltx/swh_ke_oak/me.m01.d06:meMA.Ode5C12.melody
ltx/swh_redirects_oak/me.m01.d06:meMA.Ode5C12.mode	@ltx/swh_ke_oak/me.m01.d06:meMA.Ode5C12.mode
ltx/swh_redirects_oak/me.m01.d06:meMA.Ode5C12.ode	@ltx/swh_ke_oak/me.m01.d06:meMA.Ode5C12.ode
ltx/swh_redirects_oak/me.m01.d06:meMA.Ode5C12.text	@ltx/swh_ke_oak/me.m01.d06:meMA.Ode5C12.text
ltx/swh_redirects_oak/me.m01.d06:meMA.Ode5C1H.greekmelody	@ltx/swh_ke_oak/me.m01.d06:meMA.Ode5C1H.greekmelody
ltx/swh_redirects_oak/me.m01.d06:meMA.Ode5C1H.incipit	@ltx/swh_ke_oak/me.m01.d06:meMA.Ode5C1H.incipit
ltx/swh_redirects_oak/me.m01.d06:meMA.Ode5C1H.melody	@ltx/swh_ke_oak/me.m01.d06:meMA.Ode5C1H.melody
ltx/swh_redirects_oak/me.m01.d06:meMA.Ode5C1H.mode	@ltx/swh_ke_oak/me.m01.d06:meMA.Ode5C1H.mode
ltx/swh_redirects_oak/me.m01.d06:meMA.Ode5C1H.ode	@ltx/swh_ke_oak/me.m01.d06:meMA.Ode5C1H.ode
ltx/swh_redirects_oak/me.m01.d06:meMA.Ode5C1H.text	@ltx/swh_ke_oak/me.m01.d06:meMA.Ode5C1H.text
ltx/swh_redirects_oak/me.m01.d06:meMA.Ode5C21.greekmelody	@ltx/swh_ke_oak/me.m01.d06:meMA.Ode5C21.greekmelody
ltx/swh_redirects_oak/me.m01.d06:meMA.Ode5C21.incipit	@ltx/swh_ke_oak/me.m01.d06:meMA.Ode5C21.incipit
ltx/swh_redirects_oak/me.m01.d06:meMA.Ode5C21.melody	@ltx/swh_ke_oak/me.m01.d06:meMA.Ode5C21.melody
ltx/swh_redirects_oak/me.m01.d06:meMA.Ode5C21.mode	@ltx/swh_ke_oak/me.m01.d06:meMA.Ode5C21.mode
ltx/swh_redirects_oak/me.m01.d06:meMA.Ode5C21.ode	@ltx/swh_ke_oak/me.m01.d06:meMA.Ode5C21.ode
ltx/swh_redirects_oak/me.m01.d06:meMA.Ode5C21.text	@ltx/swh_ke_oak/me.m01.d06:meMA.Ode5C21.text
ltx/swh_redirects_oak/me.m01.d06:meMA.Ode5C211.text	@ltx/swh_ke_oak/me.m01.d06:meMA.Ode5C211.text
ltx/swh_redirects_oak/me.m01.d06:meMA.Ode5C212.text	@ltx/swh_ke_oak/me.m01.d06:meMA.Ode5C212.text
ltx/swh_redirects_oak/me.m01.d06:meMA.Ode5C213.text	@ltx/swh_ke_oak/me.m01.d06:meMA.Ode5C213.text
ltx/swh_redirects_oak/me.m01.d06:meMA.Ode5C214.text	@ltx/swh_ke_oak/me.m01.d06:meMA.Ode5C214.text
ltx/swh_redirects_oak/me.m01.d06:meMA.Ode5C215.text	@ltx/swh_ke_oak/me.m01.d06:meMA.Ode5C215.text
ltx/swh_redirects_oak/me.m01.d06:meMA.Ode5C22.incipit	@ltx/swh_ke_oak/me.m01.d06:meMA.Ode5C22.incipit
ltx/swh_redirects_oak/me.m01.d06:meMA.Ode5C22.melody	@ltx/swh_ke_oak/me.m01.d06:meMA.Ode5C22.melody
ltx/swh_redirects_oak/me.m01.d06:meMA.Ode5C22.mode	@ltx/swh_ke_oak/me.m01.d06:meMA.Ode5C22.mode
ltx/swh_redirects_oak/me.m01.d06:meMA.Ode5C22.ode	@ltx/swh_ke_oak/me.m01.d06:meMA.Ode5C22.ode
ltx/swh_redirects_oak/me.m01.d06:meMA.Ode5C22.text	@ltx/swh_ke_oak/me.m01.d06:meMA.Ode5C22.text
ltx/swh_redirects_oak/me.m01.d06:meMA.Ode5C221.text	@ltx/swh_ke_oak/me.m01.d06:meMA.Ode5C221.text
ltx/swh_redirects_oak/me.m01.d06:meMA.Ode5C222.text	@ltx/swh_ke_oak/me.m01.d06:meMA.Ode5C222.text
ltx/swh_redirects_oak/me.m01.d06:meMA.Ode5C223.text	@ltx/swh_ke_oak/me.m01.d06:meMA.Ode5C223.text
ltx/swh_redirects_oak/me.m01.d06:meMA.Ode5C224.text	@ltx/swh_ke_oak/me.m01.d06:meMA.Ode5C224.text
ltx/swh_redirects_oak/me.m01.d06:meMA.Ode5C225.text	@ltx/swh_ke_oak/me.m01.d06:meMA.Ode5C225.text
ltx/swh_redirects_oak/me.m01.d06:meMA.Ode5C2H.greekmelody	@ltx/swh_ke_oak/me.m01.d06:meMA.Ode5C2H.greekmelody
ltx/swh_redirects_oak/me.m01.d06:meMA.Ode5C2H.incipit	@ltx/swh_ke_oak/me.m01.d06:meMA.Ode5C2H.incipit
ltx/swh_redirects_oak/me.m01.d06:meMA.Ode5C2H.melody	@ltx/swh_ke_oak/me.m01.d06:meMA.Ode5C2H.melody
ltx/swh_redirects_oak/me.m01.d06:meMA.Ode5C2H.mode	@ltx/swh_ke_oak/me.m01.d06:meMA.Ode5C2H.mode
ltx/swh_redirects_oak/me.m01.d06:meMA.Ode5C2H.ode	@ltx/swh_ke_oak/me.m01.d06:meMA.Ode5C2H.ode
ltx/swh_redirects_oak/me.m01.d06:meMA.Ode5C2H.text	@ltx/swh_ke_oak/me.m01.d06:meMA.Ode5C2H.text
ltx/swh_redirects_oak/me.m01.d06:meMA.Ode5C2H1.text	@ltx/swh_ke_oak/me.m01.d06:meMA.Ode5C2H1.text
ltx/swh_redirects_oak/me.m01.d06:meMA.Ode5C2H2.text	@ltx/swh_ke_oak/me.m01.d06:meMA.Ode5C2H2.text
ltx/swh_redirects_oak/me.m01.d06:meMA.Ode5C2H3.text	@ltx/swh_ke_oak/me.m01.d06:meMA.Ode5C2H3.text
ltx/swh_redirects_oak/me.m01.d06:meMA.Ode5C2H4.text	@ltx/swh_ke_oak/me.m01.d06:meMA.Ode5C2H4.text
ltx/swh_redirects_oak/me.m01.d06:meMA.Ode5C2H5.text	@ltx/swh_ke_oak/me.m01.d06:meMA.Ode5C2H5.text
ltx/swh_redirects_oak/me.m01.d06:meMA.Ode6C11.greekmelody	@ltx/swh_ke_oak/me.m01.d06:meMA.Ode6C11.greekmelody
ltx/swh_redirects_oak/me.m01.d06:meMA.Ode6C11.incipit	@ltx/swh_ke_oak/me.m01.d06:meMA.Ode6C11.incipit
ltx/swh_redirects_oak/me.m01.d06:meMA.Ode6C11.melody	@ltx/swh_ke_oak/me.m01.d06:meMA.Ode6C11.melody
ltx/swh_redirects_oak/me.m01.d06:meMA.Ode6C11.mode	@ltx/swh_ke_oak/me.m01.d06:meMA.Ode6C11.mode
ltx/swh_redirects_oak/me.m01.d06:meMA.Ode6C11.ode	@ltx/swh_ke_oak/me.m01.d06:meMA.Ode6C11.ode
ltx/swh_redirects_oak/me.m01.d06:meMA.Ode6C11.text	@ltx/swh_ke_oak/me.m01.d06:meMA.Ode6C11.text
ltx/swh_redirects_oak/me.m01.d06:meMA.Ode6C12.incipit	@ltx/swh_ke_oak/me.m01.d06:meMA.Ode6C12.incipit
ltx/swh_redirects_oak/me.m01.d06:meMA.Ode6C12.melody	@ltx/swh_ke_oak/me.m01.d06:meMA.Ode6C12.melody
ltx/swh_redirects_oak/me.m01.d06:meMA.Ode6C12.mode	@ltx/swh_ke_oak/me.m01.d06:meMA.Ode6C12.mode
ltx/swh_redirects_oak/me.m01.d06:meMA.Ode6C12.ode	@ltx/swh_ke_oak/me.m01.d06:meMA.Ode6C12.ode
ltx/swh_redirects_oak/me.m01.d06:meMA.Ode6C12.text	@ltx/swh_ke_oak/me.m01.d06:meMA.Ode6C12.text
ltx/swh_redirects_oak/me.m01.d06:meMA.Ode6C1H.greekmelody	@ltx/swh_ke_oak/me.m01.d06:meMA.Ode6C1H.greekmelody
ltx/swh_redirects_oak/me.m01.d06:meMA.Ode6C1H.incipit	@ltx/swh_ke_oak/me.m01.d06:meMA.Ode6C1H.incipit
ltx/swh_redirects_oak/me.m01.d06:meMA.Ode6C1H.melody	@ltx/swh_ke_oak/me.m01.d06:meMA.Ode6C1H.melody
ltx/swh_redirects_oak/me.m01.d06:meMA.Ode6C1H.mode	@ltx/swh_ke_oak/me.m01.d06:meMA.Ode6C1H.mode
ltx/swh_redirects_oak/me.m01.d06:meMA.Ode6C1H.ode	@ltx/swh_ke_oak/me.m01.d06:meMA.Ode6C1H.ode
ltx/swh_redirects_oak/me.m01.d06:meMA.Ode6C1H.text	@ltx/swh_ke_oak/me.m01.d06:meMA.Ode6C1H.text
ltx/swh_redirects_oak/me.m01.d06:meMA.Ode6C21.incipit	@ltx/swh_ke_oak/me.m01.d06:meMA.Ode6C21.incipit
ltx/swh_redirects_oak/me.m01.d06:meMA.Ode6C21.melody	@ltx/swh_ke_oak/me.m01.d06:meMA.Ode6C21.melody
ltx/swh_redirects_oak/me.m01.d06:meMA.Ode6C21.mode	@ltx/swh_ke_oak/me.m01.d06:meMA.Ode6C21.mode
ltx/swh_redirects_oak/me.m01.d06:meMA.Ode6C21.ode	@ltx/swh_ke_oak/me.m01.d06:meMA.Ode6C21.ode
ltx/swh_redirects_oak/me.m01.d06:meMA.Ode6C21.text	@ltx/swh_ke_oak/me.m01.d06:meMA.Ode6C21.text
ltx/swh_redirects_oak/me.m01.d06:meMA.Ode6C211.text	@ltx/swh_ke_oak/me.m01.d06:meMA.Ode6C211.text
ltx/swh_redirects_oak/me.m01.d06:meMA.Ode6C212.text	@ltx/swh_ke_oak/me.m01.d06:meMA.Ode6C212.text
ltx/swh_redirects_oak/me.m01.d06:meMA.Ode6C213.text	@ltx/swh_ke_oak/me.m01.d06:meMA.Ode6C213.text
ltx/swh_redirects_oak/me.m01.d06:meMA.Ode6C214.text	@ltx/swh_ke_oak/me.m01.d06:meMA.Ode6C214.text
ltx/swh_redirects_oak/me.m01.d06:meMA.Ode6C215.text	@ltx/swh_ke_oak/me.m01.d06:meMA.Ode6C215.text
ltx/swh_redirects_oak/me.m01.d06:meMA.Ode6C22.incipit	@ltx/swh_ke_oak/me.m01.d06:meMA.Ode6C22.incipit
ltx/swh_redirects_oak/me.m01.d06:meMA.Ode6C22.melody	@ltx/swh_ke_oak/me.m01.d06:meMA.Ode6C22.melody
ltx/swh_redirects_oak/me.m01.d06:meMA.Ode6C22.mode	@ltx/swh_ke_oak/me.m01.d06:meMA.Ode6C22.mode
ltx/swh_redirects_oak/me.m01.d06:meMA.Ode6C22.ode	@ltx/swh_ke_oak/me.m01.d06:meMA.Ode6C22.ode
ltx/swh_redirects_oak/me.m01.d06:meMA.Ode6C22.text	@ltx/swh_ke_oak/me.m01.d06:meMA.Ode6C22.text
ltx/swh_redirects_oak/me.m01.d06:meMA.Ode6C221.text	@ltx/swh_ke_oak/me.m01.d06:meMA.Ode6C221.text
ltx/swh_redirects_oak/me.m01.d06:meMA.Ode6C222.text	@ltx/swh_ke_oak/me.m01.d06:meMA.Ode6C222.text
ltx/swh_redirects_oak/me.m01.d06:meMA.Ode6C223.text	@ltx/swh_ke_oak/me.m01.d06:meMA.Ode6C223.text
ltx/swh_redirects_oak/me.m01.d06:meMA.Ode6C224.text	@ltx/swh_ke_oak/me.m01.d06:meMA.Ode6C224.text
ltx/swh_redirects_oak/me.m01.d06:meMA.Ode6C225.text	@ltx/swh_ke_oak/me.m01.d06:meMA.Ode6C225.text
ltx/swh_redirects_oak/me.m01.d06:meMA.Ode6C2H.greekmelody	@ltx/swh_ke_oak/me.m01.d06:meMA.Ode6C2H.greekmelody
ltx/swh_redirects_oak/me.m01.d06:meMA.Ode6C2H.incipit	@ltx/swh_ke_oak/me.m01.d06:meMA.Ode6C2H.incipit
ltx/swh_redirects_oak/me.m01.d06:meMA.Ode6C2H.melody	@ltx/swh_ke_oak/me.m01.d06:meMA.Ode6C2H.melody
ltx/swh_redirects_oak/me.m01.d06:meMA.Ode6C2H.mode	@ltx/swh_ke_oak/me.m01.d06:meMA.Ode6C2H.mode
ltx/swh_redirects_oak/me.m01.d06:meMA.Ode6C2H.ode	@ltx/swh_ke_oak/me.m01.d06:meMA.Ode6C2H.ode
ltx/swh_redirects_oak/me.m01.d06:meMA.Ode6C2H.text	@ltx/swh_ke_oak/me.m01.d06:meMA.Ode6C2H.text
ltx/swh_redirects_oak/me.m01.d06:meMA.Ode6C2H1.text	@ltx/swh_ke_oak/me.m01.d06:meMA.Ode6C2H1.text
ltx/swh_redirects_oak/me.m01.d06:meMA.Ode6C2H2.text	@ltx/swh_ke_oak/me.m01.d06:meMA.Ode6C2H2.text
ltx/swh_redirects_oak/me.m01.d06:meMA.Ode6C2H3.text	@ltx/swh_ke_oak/me.m01.d06:meMA.Ode6C2H3.text
ltx/swh_redirects_oak/me.m01.d06:meMA.Ode6C2H4.text	@ltx/swh_ke_oak/me.m01.d06:meMA.Ode6C2H4.text
ltx/swh_redirects_oak/me.m01.d06:meMA.Ode6C2H5.text	@ltx/swh_ke_oak/me.m01.d06:meMA.Ode6C2H5.text
ltx/swh_redirects_oak/me.m01.d06:meMA.Ode7C11.greekmelody	@ltx/swh_ke_oak/me.m01.d06:meMA.Ode7C11.greekmelody
ltx/swh_redirects_oak/me.m01.d06:meMA.Ode7C11.incipit	@ltx/swh_ke_oak/me.m01.d06:meMA.Ode7C11.incipit
ltx/swh_redirects_oak/me.m01.d06:meMA.Ode7C11.melody	@ltx/swh_ke_oak/me.m01.d06:meMA.Ode7C11.melody
ltx/swh_redirects_oak/me.m01.d06:meMA.Ode7C11.mode	@ltx/swh_ke_oak/me.m01.d06:meMA.Ode7C11.mode
ltx/swh_redirects_oak/me.m01.d06:meMA.Ode7C11.ode	@ltx/swh_ke_oak/me.m01.d06:meMA.Ode7C11.ode
ltx/swh_redirects_oak/me.m01.d06:meMA.Ode7C11.text	@ltx/swh_ke_oak/me.m01.d06:meMA.Ode7C11.text
ltx/swh_redirects_oak/me.m01.d06:meMA.Ode7C12.incipit	@ltx/swh_ke_oak/me.m01.d06:meMA.Ode7C12.incipit
ltx/swh_redirects_oak/me.m01.d06:meMA.Ode7C12.melody	@ltx/swh_ke_oak/me.m01.d06:meMA.Ode7C12.melody
ltx/swh_redirects_oak/me.m01.d06:meMA.Ode7C12.mode	@ltx/swh_ke_oak/me.m01.d06:meMA.Ode7C12.mode
ltx/swh_redirects_oak/me.m01.d06:meMA.Ode7C12.ode	@ltx/swh_ke_oak/me.m01.d06:meMA.Ode7C12.ode
ltx/swh_redirects_oak/me.m01.d06:meMA.Ode7C12.text	@ltx/swh_ke_oak/me.m01.d06:meMA.Ode7C12.text
ltx/swh_redirects_oak/me.m01.d06:meMA.Ode7C13.incipit	@ltx/swh_ke_oak/me.m01.d06:meMA.Ode7C13.incipit
ltx/swh_redirects_oak/me.m01.d06:meMA.Ode7C13.melody	@ltx/swh_ke_oak/me.m01.d06:meMA.Ode7C13.melody
ltx/swh_redirects_oak/me.m01.d06:meMA.Ode7C13.mode	@ltx/swh_ke_oak/me.m01.d06:meMA.Ode7C13.mode
ltx/swh_redirects_oak/me.m01.d06:meMA.Ode7C13.ode	@ltx/swh_ke_oak/me.m01.d06:meMA.Ode7C13.ode
ltx/swh_redirects_oak/me.m01.d06:meMA.Ode7C13.text	@ltx/swh_ke_oak/me.m01.d06:meMA.Ode7C13.text
ltx/swh_redirects_oak/me.m01.d06:meMA.Ode7C1H.greekmelody	@ltx/swh_ke_oak/me.m01.d06:meMA.Ode7C1H.greekmelody
ltx/swh_redirects_oak/me.m01.d06:meMA.Ode7C1H.incipit	@ltx/swh_ke_oak/me.m01.d06:meMA.Ode7C1H.incipit
ltx/swh_redirects_oak/me.m01.d06:meMA.Ode7C1H.melody	@ltx/swh_ke_oak/me.m01.d06:meMA.Ode7C1H.melody
ltx/swh_redirects_oak/me.m01.d06:meMA.Ode7C1H.mode	@ltx/swh_ke_oak/me.m01.d06:meMA.Ode7C1H.mode
ltx/swh_redirects_oak/me.m01.d06:meMA.Ode7C1H.ode	@ltx/swh_ke_oak/me.m01.d06:meMA.Ode7C1H.ode
ltx/swh_redirects_oak/me.m01.d06:meMA.Ode7C1H.text	@ltx/swh_ke_oak/me.m01.d06:meMA.Ode7C1H.text
ltx/swh_redirects_oak/me.m01.d06:meMA.Ode7C21.greekmelody	@ltx/swh_ke_oak/me.m01.d06:meMA.Ode7C21.greekmelody
ltx/swh_redirects_oak/me.m01.d06:meMA.Ode7C21.incipit	@ltx/swh_ke_oak/me.m01.d06:meMA.Ode7C21.incipit
ltx/swh_redirects_oak/me.m01.d06:meMA.Ode7C21.melody	@ltx/swh_ke_oak/me.m01.d06:meMA.Ode7C21.melody
ltx/swh_redirects_oak/me.m01.d06:meMA.Ode7C21.mode	@ltx/swh_ke_oak/me.m01.d06:meMA.Ode7C21.mode
ltx/swh_redirects_oak/me.m01.d06:meMA.Ode7C21.ode	@ltx/swh_ke_oak/me.m01.d06:meMA.Ode7C21.ode
ltx/swh_redirects_oak/me.m01.d06:meMA.Ode7C21.text	@ltx/swh_ke_oak/me.m01.d06:meMA.Ode7C21.text
ltx/swh_redirects_oak/me.m01.d06:meMA.Ode7C211.text	@ltx/swh_ke_oak/me.m01.d06:meMA.Ode7C211.text
ltx/swh_redirects_oak/me.m01.d06:meMA.Ode7C212.text	@ltx/swh_ke_oak/me.m01.d06:meMA.Ode7C212.text
ltx/swh_redirects_oak/me.m01.d06:meMA.Ode7C213.text	@ltx/swh_ke_oak/me.m01.d06:meMA.Ode7C213.text
ltx/swh_redirects_oak/me.m01.d06:meMA.Ode7C214.text	@ltx/swh_ke_oak/me.m01.d06:meMA.Ode7C214.text
ltx/swh_redirects_oak/me.m01.d06:meMA.Ode7C215.text	@ltx/swh_ke_oak/me.m01.d06:meMA.Ode7C215.text
ltx/swh_redirects_oak/me.m01.d06:meMA.Ode7C22.incipit	@ltx/swh_ke_oak/me.m01.d06:meMA.Ode7C22.incipit
ltx/swh_redirects_oak/me.m01.d06:meMA.Ode7C22.melody	@ltx/swh_ke_oak/me.m01.d06:meMA.Ode7C22.melody
ltx/swh_redirects_oak/me.m01.d06:meMA.Ode7C22.mode	@ltx/swh_ke_oak/me.m01.d06:meMA.Ode7C22.mode
ltx/swh_redirects_oak/me.m01.d06:meMA.Ode7C22.ode	@ltx/swh_ke_oak/me.m01.d06:meMA.Ode7C22.ode
ltx/swh_redirects_oak/me.m01.d06:meMA.Ode7C22.text	@ltx/swh_ke_oak/me.m01.d06:meMA.Ode7C22.text
ltx/swh_redirects_oak/me.m01.d06:meMA.Ode7C221.text	@ltx/swh_ke_oak/me.m01.d06:meMA.Ode7C221.text
ltx/swh_redirects_oak/me.m01.d06:meMA.Ode7C222.text	@ltx/swh_ke_oak/me.m01.d06:meMA.Ode7C222.text
ltx/swh_redirects_oak/me.m01.d06:meMA.Ode7C223.text	@ltx/swh_ke_oak/me.m01.d06:meMA.Ode7C223.text
ltx/swh_redirects_oak/me.m01.d06:meMA.Ode7C224.text	@ltx/swh_ke_oak/me.m01.d06:meMA.Ode7C224.text
ltx/swh_redirects_oak/me.m01.d06:meMA.Ode7C225.text	@ltx/swh_ke_oak/me.m01.d06:meMA.Ode7C225.text
ltx/swh_redirects_oak/me.m01.d06:meMA.Ode7C23.incipit	@ltx/swh_ke_oak/me.m01.d06:meMA.Ode7C23.incipit
ltx/swh_redirects_oak/me.m01.d06:meMA.Ode7C23.melody	@ltx/swh_ke_oak/me.m01.d06:meMA.Ode7C23.melody
ltx/swh_redirects_oak/me.m01.d06:meMA.Ode7C23.mode	@ltx/swh_ke_oak/me.m01.d06:meMA.Ode7C23.mode
ltx/swh_redirects_oak/me.m01.d06:meMA.Ode7C23.ode	@ltx/swh_ke_oak/me.m01.d06:meMA.Ode7C23.ode
ltx/swh_redirects_oak/me.m01.d06:meMA.Ode7C23.text	@ltx/swh_ke_oak/me.m01.d06:meMA.Ode7C23.text
ltx/swh_redirects_oak/me.m01.d06:meMA.Ode7C231.text	@ltx/swh_ke_oak/me.m01.d06:meMA.Ode7C231.text
ltx/swh_redirects_oak/me.m01.d06:meMA.Ode7C232.text	@ltx/swh_ke_oak/me.m01.d06:meMA.Ode7C232.text
ltx/swh_redirects_oak/me.m01.d06:meMA.Ode7C233.text	@ltx/swh_ke_oak/me.m01.d06:meMA.Ode7C233.text
ltx/swh_redirects_oak/me.m01.d06:meMA.Ode7C234.text	@ltx/swh_ke_oak/me.m01.d06:meMA.Ode7C234.text
ltx/swh_redirects_oak/me.m01.d06:meMA.Ode7C235.text	@ltx/swh_ke_oak/me.m01.d06:meMA.Ode7C235.text
ltx/swh_redirects_oak/me.m01.d06:meMA.Ode7C2H.greekmelody	@ltx/swh_ke_oak/me.m01.d06:meMA.Ode7C2H.greekmelody
ltx/swh_redirects_oak/me.m01.d06:meMA.Ode7C2H.incipit	@ltx/swh_ke_oak/me.m01.d06:meMA.Ode7C2H.incipit
ltx/swh_redirects_oak/me.m01.d06:meMA.Ode7C2H.melody	@ltx/swh_ke_oak/me.m01.d06:meMA.Ode7C2H.melody
ltx/swh_redirects_oak/me.m01.d06:meMA.Ode7C2H.mode	@ltx/swh_ke_oak/me.m01.d06:meMA.Ode7C2H.mode
ltx/swh_redirects_oak/me.m01.d06:meMA.Ode7C2H.ode	@ltx/swh_ke_oak/me.m01.d06:meMA.Ode7C2H.ode
ltx/swh_redirects_oak/me.m01.d06:meMA.Ode7C2H.text	@ltx/swh_ke_oak/me.m01.d06:meMA.Ode7C2H.text
ltx/swh_redirects_oak/me.m01.d06:meMA.Ode7C2H1.text	@ltx/swh_ke_oak/me.m01.d06:meMA.Ode7C2H1.text
ltx/swh_redirects_oak/me.m01.d06:meMA.Ode7C2H2.text	@ltx/swh_ke_oak/me.m01.d06:meMA.Ode7C2H2.text
ltx/swh_redirects_oak/me.m01.d06:meMA.Ode7C2H3.text	@ltx/swh_ke_oak/me.m01.d06:meMA.Ode7C2H3.text
ltx/swh_redirects_oak/me.m01.d06:meMA.Ode7C2H4.text	@ltx/swh_ke_oak/me.m01.d06:meMA.Ode7C2H4.text
ltx/swh_redirects_oak/me.m01.d06:meMA.Ode7C2H5.text	@ltx/swh_ke_oak/me.m01.d06:meMA.Ode7C2H5.text
ltx/swh_redirects_oak/me.m01.d06:meMA.Ode8C11.greekmelody	@ltx/swh_ke_oak/me.m01.d06:meMA.Ode8C11.greekmelody
ltx/swh_redirects_oak/me.m01.d06:meMA.Ode8C11.incipit	@ltx/swh_ke_oak/me.m01.d06:meMA.Ode8C11.incipit
ltx/swh_redirects_oak/me.m01.d06:meMA.Ode8C11.melody	@ltx/swh_ke_oak/me.m01.d06:meMA.Ode8C11.melody
ltx/swh_redirects_oak/me.m01.d06:meMA.Ode8C11.mode	@ltx/swh_ke_oak/me.m01.d06:meMA.Ode8C11.mode
ltx/swh_redirects_oak/me.m01.d06:meMA.Ode8C11.ode	@ltx/swh_ke_oak/me.m01.d06:meMA.Ode8C11.ode
ltx/swh_redirects_oak/me.m01.d06:meMA.Ode8C11.text	@ltx/swh_ke_oak/me.m01.d06:meMA.Ode8C11.text
ltx/swh_redirects_oak/me.m01.d06:meMA.Ode8C12.incipit	@ltx/swh_ke_oak/me.m01.d06:meMA.Ode8C12.incipit
ltx/swh_redirects_oak/me.m01.d06:meMA.Ode8C12.melody	@ltx/swh_ke_oak/me.m01.d06:meMA.Ode8C12.melody
ltx/swh_redirects_oak/me.m01.d06:meMA.Ode8C12.mode	@ltx/swh_ke_oak/me.m01.d06:meMA.Ode8C12.mode
ltx/swh_redirects_oak/me.m01.d06:meMA.Ode8C12.ode	@ltx/swh_ke_oak/me.m01.d06:meMA.Ode8C12.ode
ltx/swh_redirects_oak/me.m01.d06:meMA.Ode8C12.text	@ltx/swh_ke_oak/me.m01.d06:meMA.Ode8C12.text
ltx/swh_redirects_oak/me.m01.d06:meMA.Ode8C13.incipit	@ltx/swh_ke_oak/me.m01.d06:meMA.Ode8C13.incipit
ltx/swh_redirects_oak/me.m01.d06:meMA.Ode8C13.melody	@ltx/swh_ke_oak/me.m01.d06:meMA.Ode8C13.melody
ltx/swh_redirects_oak/me.m01.d06:meMA.Ode8C13.mode	@ltx/swh_ke_oak/me.m01.d06:meMA.Ode8C13.mode
ltx/swh_redirects_oak/me.m01.d06:meMA.Ode8C13.ode	@ltx/swh_ke_oak/me.m01.d06:meMA.Ode8C13.ode
ltx/swh_redirects_oak/me.m01.d06:meMA.Ode8C13.text	@ltx/swh_ke_oak/me.m01.d06:meMA.Ode8C13.text
ltx/swh_redirects_oak/me.m01.d06:meMA.Ode8C1H.greekmelody	@ltx/swh_ke_oak/me.m01.d06:meMA.Ode8C1H.greekmelody
ltx/swh_redirects_oak/me.m01.d06:meMA.Ode8C1H.incipit	@ltx/swh_ke_oak/me.m01.d06:meMA.Ode8C1H.incipit
ltx/swh_redirects_oak/me.m01.d06:meMA.Ode8C1H.melody	@ltx/swh_ke_oak/me.m01.d06:meMA.Ode8C1H.melody
ltx/swh_redirects_oak/me.m01.d06:meMA.Ode8C1H.mode	@ltx/swh_ke_oak/me.m01.d06:meMA.Ode8C1H.mode
ltx/swh_redirects_oak/me.m01.d06:meMA.Ode8C1H.ode	@ltx/swh_ke_oak/me.m01.d06:meMA.Ode8C1H.ode
ltx/swh_redirects_oak/me.m01.d06:meMA.Ode8C1H.text	@ltx/swh_ke_oak/me.m01.d06:meMA.Ode8C1H.text
ltx/swh_redirects_oak/me.m01.d06:meMA.Ode8C21.greekmelody	@ltx/swh_ke_oak/me.m01.d06:meMA.Ode8C21.greekmelody
ltx/swh_redirects_oak/me.m01.d06:meMA.Ode8C21.incipit	@ltx/swh_ke_oak/me.m01.d06:meMA.Ode8C21.incipit
ltx/swh_redirects_oak/me.m01.d06:meMA.Ode8C21.melody	@ltx/swh_ke_oak/me.m01.d06:meMA.Ode8C21.melody
ltx/swh_redirects_oak/me.m01.d06:meMA.Ode8C21.mode	@ltx/swh_ke_oak/me.m01.d06:meMA.Ode8C21.mode
ltx/swh_redirects_oak/me.m01.d06:meMA.Ode8C21.ode	@ltx/swh_ke_oak/me.m01.d06:meMA.Ode8C21.ode
ltx/swh_redirects_oak/me.m01.d06:meMA.Ode8C21.text	@ltx/swh_ke_oak/me.m01.d06:meMA.Ode8C21.text
ltx/swh_redirects_oak/me.m01.d06:meMA.Ode8C211.text	@ltx/swh_ke_oak/me.m01.d06:meMA.Ode8C211.text
ltx/swh_redirects_oak/me.m01.d06:meMA.Ode8C212.text	@ltx/swh_ke_oak/me.m01.d06:meMA.Ode8C212.text
ltx/swh_redirects_oak/me.m01.d06:meMA.Ode8C213.text	@ltx/swh_ke_oak/me.m01.d06:meMA.Ode8C213.text
ltx/swh_redirects_oak/me.m01.d06:meMA.Ode8C214.text	@ltx/swh_ke_oak/me.m01.d06:meMA.Ode8C214.text
ltx/swh_redirects_oak/me.m01.d06:meMA.Ode8C215.text	@ltx/swh_ke_oak/me.m01.d06:meMA.Ode8C215.text
ltx/swh_redirects_oak/me.m01.d06:meMA.Ode8C22.incipit	@ltx/swh_ke_oak/me.m01.d06:meMA.Ode8C22.incipit
ltx/swh_redirects_oak/me.m01.d06:meMA.Ode8C22.melody	@ltx/swh_ke_oak/me.m01.d06:meMA.Ode8C22.melody
ltx/swh_redirects_oak/me.m01.d06:meMA.Ode8C22.mode	@ltx/swh_ke_oak/me.m01.d06:meMA.Ode8C22.mode
ltx/swh_redirects_oak/me.m01.d06:meMA.Ode8C22.ode	@ltx/swh_ke_oak/me.m01.d06:meMA.Ode8C22.ode
ltx/swh_redirects_oak/me.m01.d06:meMA.Ode8C22.text	@ltx/swh_ke_oak/me.m01.d06:meMA.Ode8C22.text
ltx/swh_redirects_oak/me.m01.d06:meMA.Ode8C221.text	@ltx/swh_ke_oak/me.m01.d06:meMA.Ode8C221.text
ltx/swh_redirects_oak/me.m01.d06:meMA.Ode8C222.text	@ltx/swh_ke_oak/me.m01.d06:meMA.Ode8C222.text
ltx/swh_redirects_oak/me.m01.d06:meMA.Ode8C223.text	@ltx/swh_ke_oak/me.m01.d06:meMA.Ode8C223.text
ltx/swh_redirects_oak/me.m01.d06:meMA.Ode8C224.text	@ltx/swh_ke_oak/me.m01.d06:meMA.Ode8C224.text
ltx/swh_redirects_oak/me.m01.d06:meMA.Ode8C225.text	@ltx/swh_ke_oak/me.m01.d06:meMA.Ode8C225.text
ltx/swh_redirects_oak/me.m01.d06:meMA.Ode8C2H.greekmelody	@ltx/swh_ke_oak/me.m01.d06:meMA.Ode8C2H.greekmelody
ltx/swh_redirects_oak/me.m01.d06:meMA.Ode8C2H.incipit	@ltx/swh_ke_oak/me.m01.d06:meMA.Ode8C2H.incipit
ltx/swh_redirects_oak/me.m01.d06:meMA.Ode8C2H.melody	@ltx/swh_ke_oak/me.m01.d06:meMA.Ode8C2H.melody
ltx/swh_redirects_oak/me.m01.d06:meMA.Ode8C2H.mode	@ltx/swh_ke_oak/me.m01.d06:meMA.Ode8C2H.mode
ltx/swh_redirects_oak/me.m01.d06:meMA.Ode8C2H.ode	@ltx/swh_ke_oak/me.m01.d06:meMA.Ode8C2H.ode
ltx/swh_redirects_oak/me.m01.d06:meMA.Ode8C2H.text	@ltx/swh_ke_oak/me.m01.d06:meMA.Ode8C2H.text
ltx/swh_redirects_oak/me.m01.d06:meMA.Ode8C2H1.text	@ltx/swh_ke_oak/me.m01.d06:meMA.Ode8C2H1.text
ltx/swh_redirects_oak/me.m01.d06:meMA.Ode8C2H2.text	@ltx/swh_ke_oak/me.m01.d06:meMA.Ode8C2H2.text
ltx/swh_redirects_oak/me.m01.d06:meMA.Ode8C2H3.text	@ltx/swh_ke_oak/me.m01.d06:meMA.Ode8C2H3.text
ltx/swh_redirects_oak/me.m01.d06:meMA.Ode8C2H4.text	@ltx/swh_ke_oak/me.m01.d06:meMA.Ode8C2H4.text
ltx/swh_redirects_oak/me.m01.d06:meMA.Ode8C2H5.text	@ltx/swh_ke_oak/me.m01.d06:meMA.Ode8C2H5.text
ltx/swh_redirects_oak/me.m01.d06:meMA.Ode9C11.greekmelody	@ltx/swh_ke_oak/me.m01.d06:meMA.Ode9C11.greekmelody
ltx/swh_redirects_oak/me.m01.d06:meMA.Ode9C11.incipit	@ltx/swh_ke_oak/me.m01.d06:meMA.Ode9C11.incipit
ltx/swh_redirects_oak/me.m01.d06:meMA.Ode9C11.melody	@ltx/swh_ke_oak/me.m01.d06:meMA.Ode9C11.melody
ltx/swh_redirects_oak/me.m01.d06:meMA.Ode9C11.mode	@ltx/swh_ke_oak/me.m01.d06:meMA.Ode9C11.mode
ltx/swh_redirects_oak/me.m01.d06:meMA.Ode9C11.ode	@ltx/swh_ke_oak/me.m01.d06:meMA.Ode9C11.ode
ltx/swh_redirects_oak/me.m01.d06:meMA.Ode9C11.text	@ltx/swh_ke_oak/me.m01.d06:meMA.Ode9C11.text
ltx/swh_redirects_oak/me.m01.d06:meMA.Ode9C12.incipit	@ltx/swh_ke_oak/me.m01.d06:meMA.Ode9C12.incipit
ltx/swh_redirects_oak/me.m01.d06:meMA.Ode9C12.melody	@ltx/swh_ke_oak/me.m01.d06:meMA.Ode9C12.melody
ltx/swh_redirects_oak/me.m01.d06:meMA.Ode9C12.mode	@ltx/swh_ke_oak/me.m01.d06:meMA.Ode9C12.mode
ltx/swh_redirects_oak/me.m01.d06:meMA.Ode9C12.ode	@ltx/swh_ke_oak/me.m01.d06:meMA.Ode9C12.ode
ltx/swh_redirects_oak/me.m01.d06:meMA.Ode9C12.text	@ltx/swh_ke_oak/me.m01.d06:meMA.Ode9C12.text
ltx/swh_redirects_oak/me.m01.d06:meMA.Ode9C13.incipit	@ltx/swh_ke_oak/me.m01.d06:meMA.Ode9C13.incipit
ltx/swh_redirects_oak/me.m01.d06:meMA.Ode9C13.melody	@ltx/swh_ke_oak/me.m01.d06:meMA.Ode9C13.melody
ltx/swh_redirects_oak/me.m01.d06:meMA.Ode9C13.mode	@ltx/swh_ke_oak/me.m01.d06:meMA.Ode9C13.mode
ltx/swh_redirects_oak/me.m01.d06:meMA.Ode9C13.ode	@ltx/swh_ke_oak/me.m01.d06:meMA.Ode9C13.ode
ltx/swh_redirects_oak/me.m01.d06:meMA.Ode9C13.text	@ltx/swh_ke_oak/me.m01.d06:meMA.Ode9C13.text
ltx/swh_redirects_oak/me.m01.d06:meMA.Ode9C1H.greekmelody	@ltx/swh_ke_oak/me.m01.d06:meMA.Ode9C1H.greekmelody
ltx/swh_redirects_oak/me.m01.d06:meMA.Ode9C1H.incipit	@ltx/swh_ke_oak/me.m01.d06:meMA.Ode9C1H.incipit
ltx/swh_redirects_oak/me.m01.d06:meMA.Ode9C1H.melody	@ltx/swh_ke_oak/me.m01.d06:meMA.Ode9C1H.melody
ltx/swh_redirects_oak/me.m01.d06:meMA.Ode9C1H.mode	@ltx/swh_ke_oak/me.m01.d06:meMA.Ode9C1H.mode
ltx/swh_redirects_oak/me.m01.d06:meMA.Ode9C1H.ode	@ltx/swh_ke_oak/me.m01.d06:meMA.Ode9C1H.ode
ltx/swh_redirects_oak/me.m01.d06:meMA.Ode9C1H.text	@ltx/swh_ke_oak/me.m01.d06:meMA.Ode9C1H.text
ltx/swh_redirects_oak/me.m01.d06:meMA.Ode9C1M01.incipit	@ltx/swh_ke_oak/me.m01.d06:meMA.Ode9C1M01.incipit
ltx/swh_redirects_oak/me.m01.d06:meMA.Ode9C1M01.text	@ltx/swh_ke_oak/me.m01.d06:meMA.Ode9C1M01.text
ltx/swh_redirects_oak/me.m01.d06:meMA.Ode9C1M02.incipit	@ltx/swh_ke_oak/me.m01.d06:meMA.Ode9C1M02.incipit
ltx/swh_redirects_oak/me.m01.d06:meMA.Ode9C1M02.text	@ltx/swh_ke_oak/me.m01.d06:meMA.Ode9C1M02.text
ltx/swh_redirects_oak/me.m01.d06:meMA.Ode9C1M03.incipit	@ltx/swh_ke_oak/me.m01.d06:meMA.Ode9C1M03.incipit
ltx/swh_redirects_oak/me.m01.d06:meMA.Ode9C1M03.text	@ltx/swh_ke_oak/me.m01.d06:meMA.Ode9C1M03.text
ltx/swh_redirects_oak/me.m01.d06:meMA.Ode9C1M04.incipit	@ltx/swh_ke_oak/me.m01.d06:meMA.Ode9C1M04.incipit
ltx/swh_redirects_oak/me.m01.d06:meMA.Ode9C1M04.text	@ltx/swh_ke_oak/me.m01.d06:meMA.Ode9C1M04.text
ltx/swh_redirects_oak/me.m01.d06:meMA.Ode9C1M05.incipit	@ltx/swh_ke_oak/me.m01.d06:meMA.Ode9C1M05.incipit
ltx/swh_redirects_oak/me.m01.d06:meMA.Ode9C1M05.text	@ltx/swh_ke_oak/me.m01.d06:meMA.Ode9C1M05.text
ltx/swh_redirects_oak/me.m01.d06:meMA.Ode9C1M06.incipit	@ltx/swh_ke_oak/me.m01.d06:meMA.Ode9C1M06.incipit
ltx/swh_redirects_oak/me.m01.d06:meMA.Ode9C1M06.text	@ltx/swh_ke_oak/me.m01.d06:meMA.Ode9C1M06.text
ltx/swh_redirects_oak/me.m01.d06:meMA.Ode9C1M07.incipit	@ltx/swh_ke_oak/me.m01.d06:meMA.Ode9C1M07.incipit
ltx/swh_redirects_oak/me.m01.d06:meMA.Ode9C1M07.text	@ltx/swh_ke_oak/me.m01.d06:meMA.Ode9C1M07.text
ltx/swh_redirects_oak/me.m01.d06:meMA.Ode9C21.greekmelody	@ltx/swh_ke_oak/me.m01.d06:meMA.Ode9C21.greekmelody
ltx/swh_redirects_oak/me.m01.d06:meMA.Ode9C21.incipit	@ltx/swh_ke_oak/me.m01.d06:meMA.Ode9C21.incipit
ltx/swh_redirects_oak/me.m01.d06:meMA.Ode9C21.melody	@ltx/swh_ke_oak/me.m01.d06:meMA.Ode9C21.melody
ltx/swh_redirects_oak/me.m01.d06:meMA.Ode9C21.mode	@ltx/swh_ke_oak/me.m01.d06:meMA.Ode9C21.mode
ltx/swh_redirects_oak/me.m01.d06:meMA.Ode9C21.ode	@ltx/swh_ke_oak/me.m01.d06:meMA.Ode9C21.ode
ltx/swh_redirects_oak/me.m01.d06:meMA.Ode9C21.text	@ltx/swh_ke_oak/me.m01.d06:meMA.Ode9C21.text
ltx/swh_redirects_oak/me.m01.d06:meMA.Ode9C211.text	@ltx/swh_ke_oak/me.m01.d06:meMA.Ode9C211.text
ltx/swh_redirects_oak/me.m01.d06:meMA.Ode9C212.text	@ltx/swh_ke_oak/me.m01.d06:meMA.Ode9C212.text
ltx/swh_redirects_oak/me.m01.d06:meMA.Ode9C213.text	@ltx/swh_ke_oak/me.m01.d06:meMA.Ode9C213.text
ltx/swh_redirects_oak/me.m01.d06:meMA.Ode9C214.text	@ltx/swh_ke_oak/me.m01.d06:meMA.Ode9C214.text
ltx/swh_redirects_oak/me.m01.d06:meMA.Ode9C215.text	@ltx/swh_ke_oak/me.m01.d06:meMA.Ode9C215.text
ltx/swh_redirects_oak/me.m01.d06:meMA.Ode9C22.incipit	@ltx/swh_ke_oak/me.m01.d06:meMA.Ode9C22.incipit
ltx/swh_redirects_oak/me.m01.d06:meMA.Ode9C22.melody	@ltx/swh_ke_oak/me.m01.d06:meMA.Ode9C22.melody
ltx/swh_redirects_oak/me.m01.d06:meMA.Ode9C22.mode	@ltx/swh_ke_oak/me.m01.d06:meMA.Ode9C22.mode
ltx/swh_redirects_oak/me.m01.d06:meMA.Ode9C22.ode	@ltx/swh_ke_oak/me.m01.d06:meMA.Ode9C22.ode
ltx/swh_redirects_oak/me.m01.d06:meMA.Ode9C22.text	@ltx/swh_ke_oak/me.m01.d06:meMA.Ode9C22.text
ltx/swh_redirects_oak/me.m01.d06:meMA.Ode9C221.text	@ltx/swh_ke_oak/me.m01.d06:meMA.Ode9C221.text
ltx/swh_redirects_oak/me.m01.d06:meMA.Ode9C222.text	@ltx/swh_ke_oak/me.m01.d06:meMA.Ode9C222.text
ltx/swh_redirects_oak/me.m01.d06:meMA.Ode9C223.text	@ltx/swh_ke_oak/me.m01.d06:meMA.Ode9C223.text
ltx/swh_redirects_oak/me.m01.d06:meMA.Ode9C224.text	@ltx/swh_ke_oak/me.m01.d06:meMA.Ode9C224.text
ltx/swh_redirects_oak/me.m01.d06:meMA.Ode9C225.text	@ltx/swh_ke_oak/me.m01.d06:meMA.Ode9C225.text
ltx/swh_redirects_oak/me.m01.d06:meMA.Ode9C2H.greekmelody	@ltx/swh_ke_oak/me.m01.d06:meMA.Ode9C2H.greekmelody
ltx/swh_redirects_oak/me.m01.d06:meMA.Ode9C2H.incipit	@ltx/swh_ke_oak/me.m01.d06:meMA.Ode9C2H.incipit
ltx/swh_redirects_oak/me.m01.d06:meMA.Ode9C2H.melody	@ltx/swh_ke_oak/me.m01.d06:meMA.Ode9C2H.melody
ltx/swh_redirects_oak/me.m01.d06:meMA.Ode9C2H.mode	@ltx/swh_ke_oak/me.m01.d06:meMA.Ode9C2H.mode
ltx/swh_redirects_oak/me.m01.d06:meMA.Ode9C2H.ode	@ltx/swh_ke_oak/me.m01.d06:meMA.Ode9C2H.ode
ltx/swh_redirects_oak/me.m01.d06:meMA.Ode9C2H.text	@ltx/swh_ke_oak/me.m01.d06:meMA.Ode9C2H.text
ltx/swh_redirects_oak/me.m01.d06:meMA.Ode9C2H1.text	@ltx/swh_ke_oak/me.m01.d06:meMA.Ode9C2H1.text
ltx/swh_redirects_oak/me.m01.d06:meMA.Ode9C2H2.text	@ltx/swh_ke_oak/me.m01.d06:meMA.Ode9C2H2.text
ltx/swh_redirects_oak/me.m01.d06:meMA.Ode9C2H3.text	@ltx/swh_ke_oak/me.m01.d06:meMA.Ode9C2H3.text
ltx/swh_redirects_oak/me.m01.d06:meMA.Ode9C2H4.text	@ltx/swh_ke_oak/me.m01.d06:meMA.Ode9C2H4.text
ltx/swh_redirects_oak/me.m01.d06:meMA.Ode9C2H5.text	@ltx/swh_ke_oak/me.m01.d06:meMA.Ode9C2H5.text
ltx/swh_redirects_oak/me.m01.d06:meMA.Ode9C2M01.incipit	@ltx/swh_ke_oak/me.m01.d06:meMA.Ode9C2M01.incipit
ltx/swh_redirects_oak/me.m01.d06:meMA.Ode9C2M01.text	@ltx/swh_ke_oak/me.m01.d06:meMA.Ode9C2M01.text
ltx/swh_redirects_oak/me.m01.d06:meMA.Ode9C2M02.incipit	@ltx/swh_ke_oak/me.m01.d06:meMA.Ode9C2M02.incipit
ltx/swh_redirects_oak/me.m01.d06:meMA.Ode9C2M02.text	@ltx/swh_ke_oak/me.m01.d06:meMA.Ode9C2M02.text
ltx/swh_redirects_oak/me.m01.d06:meMA.Ode9C2M03.incipit	@ltx/swh_ke_oak/me.m01.d06:meMA.Ode9C2M03.incipit
ltx/swh_redirects_oak/me.m01.d06:meMA.Ode9C2M03.text	@ltx/swh_ke_oak/me.m01.d06:meMA.Ode9C2M03.text
ltx/swh_redirects_oak/me.m01.d06:meMA.Ode9C2M04.incipit	@ltx/swh_ke_oak/me.m01.d06:meMA.Ode9C2M04.incipit
ltx/swh_redirects_oak/me.m01.d06:meMA.Ode9C2M04.text	@ltx/swh_ke_oak/me.m01.d06:meMA.Ode9C2M04.text
ltx/swh_redirects_oak/me.m01.d06:meMA.Ode9C2M05.incipit	@ltx/swh_ke_oak/me.m01.d06:meMA.Ode9C2M05.incipit
ltx/swh_redirects_oak/me.m01.d06:meMA.Ode9C2M05.text	@ltx/swh_ke_oak/me.m01.d06:meMA.Ode9C2M05.text
ltx/swh_redirects_oak/me.m01.d06:meMA.Ode9C2M06.incipit	@ltx/swh_ke_oak/me.m01.d06:meMA.Ode9C2M06.incipit
ltx/swh_redirects_oak/me.m01.d06:meMA.Ode9C2M06.text	@ltx/swh_ke_oak/me.m01.d06:meMA.Ode9C2M06.text
ltx/swh_redirects_oak/me.m01.d06:meMA.Ode9C2MTh.incipit	@ltx/swh_ke_oak/me.m01.d06:meMA.Ode9C2MTh.incipit
ltx/swh_redirects_oak/me.m01.d06:meMA.Ode9C2MTh.text	@ltx/swh_ke_oak/me.m01.d06:meMA.Ode9C2MTh.text
ltx/swh_redirects_oak/me.m01.d06:meMA.Ode9C2MTr.incipit	@ltx/swh_ke_oak/me.m01.d06:meMA.Ode9C2MTr.incipit
ltx/swh_redirects_oak/me.m01.d06:meMA.Ode9C2MTr.text	@ltx/swh_ke_oak/me.m01.d06:meMA.Ode9C2MTr.text
ltx/swh_redirects_oak/me.m01.d06:meMA.Oikos1.text	@ltx/swh_ke_oak/me.m01.d06:meMA.Oikos1.text
ltx/swh_redirects_oak/me.m01.d06:meMA.PostGospelBoth.incipit	@ltx/swh_ke_oak/me.m01.d06:meMA.PostGospelBoth.incipit
ltx/swh_redirects_oak/me.m01.d06:meMA.PostGospelBoth.melody	@ltx/swh_ke_oak/me.m01.d06:meMA.PostGospelBoth.melody
ltx/swh_redirects_oak/me.m01.d06:meMA.PostGospelBoth.mode	@ltx/swh_ke_oak/me.m01.d06:meMA.PostGospelBoth.mode
ltx/swh_redirects_oak/me.m01.d06:meMA.PostGospelBoth.text	@ltx/swh_ke_oak/me.m01.d06:meMA.PostGospelBoth.text
ltx/swh_redirects_oak/me.m01.d06:meMA.PostGospelGlory.incipit	@ltx/swh_ke_oak/me.m01.d06:meMA.PostGospelGlory.incipit
ltx/swh_redirects_oak/me.m01.d06:meMA.PostGospelGlory.melody	@ltx/swh_ke_oak/me.m01.d06:meMA.PostGospelGlory.melody
ltx/swh_redirects_oak/me.m01.d06:meMA.PostGospelGlory.mode	@ltx/swh_ke_oak/me.m01.d06:meMA.PostGospelGlory.mode
ltx/swh_redirects_oak/me.m01.d06:meMA.PostGospelGlory.text	@ltx/swh_ke_oak/me.m01.d06:meMA.PostGospelGlory.text
ltx/swh_redirects_oak/me.m01.d06:meMA.PostGospelIdiomelon.incipit	@ltx/swh_ke_oak/me.m01.d06:meMA.PostGospelIdiomelon.incipit
ltx/swh_redirects_oak/me.m01.d06:meMA.PostGospelIdiomelon.melody	@ltx/swh_ke_oak/me.m01.d06:meMA.PostGospelIdiomelon.melody
ltx/swh_redirects_oak/me.m01.d06:meMA.PostGospelIdiomelon.mode	@ltx/swh_ke_oak/me.m01.d06:meMA.PostGospelIdiomelon.mode
ltx/swh_redirects_oak/me.m01.d06:meMA.PostGospelIdiomelon.text	@ltx/swh_ke_oak/me.m01.d06:meMA.PostGospelIdiomelon.text
ltx/swh_redirects_oak/me.m01.d06:meVE.Apolytikion1.incipit	@ltx/swh_ke_oak/me.m01.d06:meVE.Apolytikion1.incipit
ltx/swh_redirects_oak/me.m01.d06:meVE.Apolytikion1.melody	@ltx/swh_ke_oak/me.m01.d06:meVE.Apolytikion1.melody
ltx/swh_redirects_oak/me.m01.d06:meVE.Apolytikion1.mode	@ltx/swh_ke_oak/me.m01.d06:meVE.Apolytikion1.mode
ltx/swh_redirects_oak/me.m01.d06:meVE.Apolytikion1.text	@ltx/swh_ke_oak/me.m01.d06:meVE.Apolytikion1.text
ltx/swh_redirects_oak/me.m01.d06:meVE.AposGlory.incipit	@ltx/swh_ke_oak/me.m01.d06:meVE.AposGlory.incipit
ltx/swh_redirects_oak/me.m01.d06:meVE.AposGlory.melody	@ltx/swh_ke_oak/me.m01.d06:meVE.AposGlory.melody
ltx/swh_redirects_oak/me.m01.d06:meVE.AposGlory.mode	@ltx/swh_ke_oak/me.m01.d06:meVE.AposGlory.mode
ltx/swh_redirects_oak/me.m01.d06:meVE.AposGlory.poet	@ltx/swh_ke_oak/me.m01.d06:meVE.AposGlory.poet
ltx/swh_redirects_oak/me.m01.d06:meVE.AposGlory.text	@ltx/swh_ke_oak/me.m01.d06:meVE.AposGlory.text
ltx/swh_redirects_oak/me.m01.d06:meVE.Aposticha1.incipit	@ltx/swh_ke_oak/me.m01.d06:meVE.Aposticha1.incipit
ltx/swh_redirects_oak/me.m01.d06:meVE.Aposticha1.melody	@ltx/swh_ke_oak/me.m01.d06:meVE.Aposticha1.melody
ltx/swh_redirects_oak/me.m01.d06:meVE.Aposticha1.mode	@ltx/swh_ke_oak/me.m01.d06:meVE.Aposticha1.mode
ltx/swh_redirects_oak/me.m01.d06:meVE.Aposticha1.poet	@ltx/swh_ke_oak/me.m01.d06:meVE.Aposticha1.poet
ltx/swh_redirects_oak/me.m01.d06:meVE.Aposticha1.text	@ltx/swh_ke_oak/me.m01.d06:meVE.Aposticha1.text
ltx/swh_redirects_oak/me.m01.d06:meVE.Aposticha2.incipit	@ltx/swh_ke_oak/me.m01.d06:meVE.Aposticha2.incipit
ltx/swh_redirects_oak/me.m01.d06:meVE.Aposticha2.melody	@ltx/swh_ke_oak/me.m01.d06:meVE.Aposticha2.melody
ltx/swh_redirects_oak/me.m01.d06:meVE.Aposticha2.mode	@ltx/swh_ke_oak/me.m01.d06:meVE.Aposticha2.mode
ltx/swh_redirects_oak/me.m01.d06:meVE.Aposticha2.text	@ltx/swh_ke_oak/me.m01.d06:meVE.Aposticha2.text
ltx/swh_redirects_oak/me.m01.d06:meVE.Aposticha3.incipit	@ltx/swh_ke_oak/me.m01.d06:meVE.Aposticha3.incipit
ltx/swh_redirects_oak/me.m01.d06:meVE.Aposticha3.melody	@ltx/swh_ke_oak/me.m01.d06:meVE.Aposticha3.melody
ltx/swh_redirects_oak/me.m01.d06:meVE.Aposticha3.mode	@ltx/swh_ke_oak/me.m01.d06:meVE.Aposticha3.mode
ltx/swh_redirects_oak/me.m01.d06:meVE.Aposticha3.text	@ltx/swh_ke_oak/me.m01.d06:meVE.Aposticha3.text
ltx/swh_redirects_oak/me.m01.d06:meVE.Lity1.incipit	@ltx/swh_ke_oak/me.m01.d06:meVE.Lity1.incipit
ltx/swh_redirects_oak/me.m01.d06:meVE.Lity1.melody	@ltx/swh_ke_oak/me.m01.d06:meVE.Lity1.melody
ltx/swh_redirects_oak/me.m01.d06:meVE.Lity1.mode	@ltx/swh_ke_oak/me.m01.d06:meVE.Lity1.mode
ltx/swh_redirects_oak/me.m01.d06:meVE.Lity1.poet	@ltx/swh_ke_oak/me.m01.d06:meVE.Lity1.poet
ltx/swh_redirects_oak/me.m01.d06:meVE.Lity1.text	@ltx/swh_ke_oak/me.m01.d06:meVE.Lity1.text
ltx/swh_redirects_oak/me.m01.d06:meVE.Lity2.incipit	@ltx/swh_ke_oak/me.m01.d06:meVE.Lity2.incipit
ltx/swh_redirects_oak/me.m01.d06:meVE.Lity2.melody	@ltx/swh_ke_oak/me.m01.d06:meVE.Lity2.melody
ltx/swh_redirects_oak/me.m01.d06:meVE.Lity2.mode	@ltx/swh_ke_oak/me.m01.d06:meVE.Lity2.mode
ltx/swh_redirects_oak/me.m01.d06:meVE.Lity2.text	@ltx/swh_ke_oak/me.m01.d06:meVE.Lity2.text
ltx/swh_redirects_oak/me.m01.d06:meVE.Lity3.incipit	@ltx/swh_ke_oak/me.m01.d06:meVE.Lity3.incipit
ltx/swh_redirects_oak/me.m01.d06:meVE.Lity3.melody	@ltx/swh_ke_oak/me.m01.d06:meVE.Lity3.melody
ltx/swh_redirects_oak/me.m01.d06:meVE.Lity3.mode	@ltx/swh_ke_oak/me.m01.d06:meVE.Lity3.mode
ltx/swh_redirects_oak/me.m01.d06:meVE.Lity3.text	@ltx/swh_ke_oak/me.m01.d06:meVE.Lity3.text
ltx/swh_redirects_oak/me.m01.d06:meVE.Lity4.incipit	@ltx/swh_ke_oak/me.m01.d06:meVE.Lity4.incipit
ltx/swh_redirects_oak/me.m01.d06:meVE.Lity4.melody	@ltx/swh_ke_oak/me.m01.d06:meVE.Lity4.melody
ltx/swh_redirects_oak/me.m01.d06:meVE.Lity4.mode	@ltx/swh_ke_oak/me.m01.d06:meVE.Lity4.mode
ltx/swh_redirects_oak/me.m01.d06:meVE.Lity4.text	@ltx/swh_ke_oak/me.m01.d06:meVE.Lity4.text
ltx/swh_redirects_oak/me.m01.d06:meVE.Lity5.incipit	@ltx/swh_ke_oak/me.m01.d06:meVE.Lity5.incipit
ltx/swh_redirects_oak/me.m01.d06:meVE.Lity5.melody	@ltx/swh_ke_oak/me.m01.d06:meVE.Lity5.melody
ltx/swh_redirects_oak/me.m01.d06:meVE.Lity5.mode	@ltx/swh_ke_oak/me.m01.d06:meVE.Lity5.mode
ltx/swh_redirects_oak/me.m01.d06:meVE.Lity5.text	@ltx/swh_ke_oak/me.m01.d06:meVE.Lity5.text
ltx/swh_redirects_oak/me.m01.d06:meVE.LityBoth.incipit	@ltx/swh_ke_oak/me.m01.d06:meVE.LityBoth.incipit
ltx/swh_redirects_oak/me.m01.d06:meVE.LityBoth.melody	@ltx/swh_ke_oak/me.m01.d06:meVE.LityBoth.melody
ltx/swh_redirects_oak/me.m01.d06:meVE.LityBoth.mode	@ltx/swh_ke_oak/me.m01.d06:meVE.LityBoth.mode
ltx/swh_redirects_oak/me.m01.d06:meVE.LityBoth.poet	@ltx/swh_ke_oak/me.m01.d06:meVE.LityBoth.poet
ltx/swh_redirects_oak/me.m01.d06:meVE.LityBoth.text	@ltx/swh_ke_oak/me.m01.d06:meVE.LityBoth.text
ltx/swh_redirects_oak/me.m01.d06:meVE.LityGlory.incipit	@ltx/swh_ke_oak/me.m01.d06:meVE.LityGlory.incipit
ltx/swh_redirects_oak/me.m01.d06:meVE.LityGlory.melody	@ltx/swh_ke_oak/me.m01.d06:meVE.LityGlory.melody
ltx/swh_redirects_oak/me.m01.d06:meVE.LityGlory.mode	@ltx/swh_ke_oak/me.m01.d06:meVE.LityGlory.mode
ltx/swh_redirects_oak/me.m01.d06:meVE.LityGlory.poet	@ltx/swh_ke_oak/me.m01.d06:meVE.LityGlory.poet
ltx/swh_redirects_oak/me.m01.d06:meVE.LityGlory.text	@ltx/swh_ke_oak/me.m01.d06:meVE.LityGlory.text
ltx/swh_redirects_oak/me.m01.d06:meVE.MM.LityBothasGloryBoth.text	@ltx/swh_ke_oak/properties:media.key
ltx/swh_redirects_oak/me.m01.d06:meVE.MM.Stichera1234as78910.text	@ltx/swh_ke_oak/me.m01.d06:meVE.MM.Stichera1234as78910.text
ltx/swh_redirects_oak/me.m01.d06:meVE.MM.Stichera123as567.text	@ltx/swh_ke_oak/me.m01.d06:meVE.MM.Stichera123as567.text
ltx/swh_redirects_oak/me.m01.d06:meVE.ProphecyTroparion1.incipit	@ltx/swh_ke_oak/me.m01.d06:meVE.ProphecyTroparion1.incipit
ltx/swh_redirects_oak/me.m01.d06:meVE.ProphecyTroparion1.mode	@ltx/swh_ke_oak/me.m01.d06:meVE.ProphecyTroparion1.mode
ltx/swh_redirects_oak/me.m01.d06:meVE.ProphecyTroparion1.text	@ltx/swh_ke_oak/me.m01.d06:meVE.ProphecyTroparion1.text
ltx/swh_redirects_oak/me.m01.d06:meVE.ProphecyTroparion1Refrain.incipit	@ltx/swh_ke_oak/me.m01.d06:meVE.ProphecyTroparion1Refrain.incipit
ltx/swh_redirects_oak/me.m01.d06:meVE.ProphecyTroparion1Refrain.text	@ltx/swh_ke_oak/me.m01.d06:meVE.ProphecyTroparion1Refrain.text
ltx/swh_redirects_oak/me.m01.d06:meVE.ProphecyTroparion2.incipit	@ltx/swh_ke_oak/me.m01.d06:meVE.ProphecyTroparion2.incipit
ltx/swh_redirects_oak/me.m01.d06:meVE.ProphecyTroparion2.mode	@ltx/swh_ke_oak/me.m01.d06:meVE.ProphecyTroparion2.mode
ltx/swh_redirects_oak/me.m01.d06:meVE.ProphecyTroparion2.text	@ltx/swh_ke_oak/me.m01.d06:meVE.ProphecyTroparion2.text
ltx/swh_redirects_oak/me.m01.d06:meVE.ProphecyTroparion2Refrain.incipit	@ltx/swh_ke_oak/me.m01.d06:meVE.ProphecyTroparion2Refrain.incipit
ltx/swh_redirects_oak/me.m01.d06:meVE.ProphecyTroparion2Refrain.text	@ltx/swh_ke_oak/me.m01.d06:meVE.ProphecyTroparion2Refrain.text
ltx/swh_redirects_oak/me.m01.d06:meVE.SticGlory.incipit	@ltx/swh_ke_oak/me.m01.d06:meVE.SticGlory.incipit
ltx/swh_redirects_oak/me.m01.d06:meVE.SticGlory.melody	@ltx/swh_ke_oak/me.m01.d06:meVE.SticGlory.melody
ltx/swh_redirects_oak/me.m01.d06:meVE.SticGlory.mode	@ltx/swh_ke_oak/me.m01.d06:meVE.SticGlory.mode
ltx/swh_redirects_oak/me.m01.d06:meVE.SticGlory.poet	@ltx/swh_ke_oak/me.m01.d06:meVE.SticGlory.poet
ltx/swh_redirects_oak/me.m01.d06:meVE.SticGlory.text	@ltx/swh_ke_oak/me.m01.d06:meVE.SticGlory.text
ltx/swh_redirects_oak/me.m01.d06:meVE.Stichera01.incipit	@ltx/swh_ke_oak/me.m01.d06:meVE.Stichera01.incipit
ltx/swh_redirects_oak/me.m01.d06:meVE.Stichera01.melody	@ltx/swh_ke_oak/me.m01.d06:meVE.Stichera01.melody
ltx/swh_redirects_oak/me.m01.d06:meVE.Stichera01.mode	@ltx/swh_ke_oak/me.m01.d06:meVE.Stichera01.mode
ltx/swh_redirects_oak/me.m01.d06:meVE.Stichera01.poet	@ltx/swh_ke_oak/me.m01.d06:meVE.Stichera01.poet
ltx/swh_redirects_oak/me.m01.d06:meVE.Stichera01.text	@ltx/swh_ke_oak/me.m01.d06:meVE.Stichera01.text
ltx/swh_redirects_oak/me.m01.d06:meVE.Stichera02.incipit	@ltx/swh_ke_oak/me.m01.d06:meVE.Stichera02.incipit
ltx/swh_redirects_oak/me.m01.d06:meVE.Stichera02.melody	@ltx/swh_ke_oak/me.m01.d06:meVE.Stichera02.melody
ltx/swh_redirects_oak/me.m01.d06:meVE.Stichera02.mode	@ltx/swh_ke_oak/me.m01.d06:meVE.Stichera02.mode
ltx/swh_redirects_oak/me.m01.d06:meVE.Stichera02.text	@ltx/swh_ke_oak/me.m01.d06:meVE.Stichera02.text
ltx/swh_redirects_oak/me.m01.d06:meVE.Stichera03.incipit	@ltx/swh_ke_oak/me.m01.d06:meVE.Stichera03.incipit
ltx/swh_redirects_oak/me.m01.d06:meVE.Stichera03.melody	@ltx/swh_ke_oak/me.m01.d06:meVE.Stichera03.melody
ltx/swh_redirects_oak/me.m01.d06:meVE.Stichera03.mode	@ltx/swh_ke_oak/me.m01.d06:meVE.Stichera03.mode
ltx/swh_redirects_oak/me.m01.d06:meVE.Stichera03.text	@ltx/swh_ke_oak/me.m01.d06:meVE.Stichera03.text
ltx/swh_redirects_oak/me.m01.d06:meVE.Stichera04.incipit	@ltx/swh_ke_oak/me.m01.d06:meVE.Stichera04.incipit
ltx/swh_redirects_oak/me.m01.d06:meVE.Stichera04.melody	@ltx/swh_ke_oak/me.m01.d06:meVE.Stichera04.melody
ltx/swh_redirects_oak/me.m01.d06:meVE.Stichera04.mode	@ltx/swh_ke_oak/me.m01.d06:meVE.Stichera04.mode
ltx/swh_redirects_oak/me.m01.d06:meVE.Stichera04.text	@ltx/swh_ke_oak/me.m01.d06:meVE.Stichera04.text
