ltx/swh_redirects_oak/le.go.mc.d011:lemcLI.Gospel.book_abbr	@ltx/swh_ke_oak/le.go.mc.d011:lemcLI.Gospel.book_abbr
ltx/swh_redirects_oak/le.go.mc.d011:lemcLI.Gospel.book_string	@ltx/swh_ke_oak/le.go.mc.d011:lemcLI.Gospel.book_string
ltx/swh_redirects_oak/le.go.mc.d011:lemcLI.Gospel.chapverse	@ltx/swh_ke_oak/le.go.mc.d011:lemcLI.Gospel.chapverse
ltx/swh_redirects_oak/le.go.mc.d011:lemcLI.Gospel.incipit	@ltx/swh_ke_oak/le.go.mc.d011:lemcLI.Gospel.incipit
ltx/swh_redirects_oak/le.go.mc.d011:lemcLI.Gospel.text	@ltx/swh_ke_oak/le.go.mc.d011:lemcLI.Gospel.text
ltx/swh_redirects_oak/le.go.mc.d011:lemcLI.Gospel.title	@ltx/swh_ke_oak/le.go.mc.d011:lemcLI.Gospel.title
ltx/swh_redirects_oak/le.go.mc.d011:lemcLI.Gospel.title_abbr	@ltx/swh_ke_oak/le.go.mc.d011:lemcLI.Gospel.title_abbr
ltx/swh_redirects_oak/le.go.mc.d011:lemcLI.Gospel.version	@ltx/swh_ke_oak/le.go.mc.d011:lemcLI.Gospel.version
