ltx/swh_redirects_oak/he.a.m1:heAU.ChorosAngelikos.greekname	@ltx/swh_ke_oak/he.a.m1:heAU.ChorosAngelikos.greekname
ltx/swh_redirects_oak/he.a.m1:heAU.ChorosAngelikos.incipit	@ltx/swh_ke_oak/he.a.m1:heAU.ChorosAngelikos.incipit
ltx/swh_redirects_oak/he.a.m1:heAU.ChorosAngelikos.mode	@ltx/swh_ke_oak/he.a.m1:heAU.ChorosAngelikos.mode
ltx/swh_redirects_oak/he.a.m1:heAU.ChorosAngelikos.name	@ltx/swh_ke_oak/he.a.m1:heAU.ChorosAngelikos.name
ltx/swh_redirects_oak/he.a.m1:heAU.ChorosAngelikos.notmetered	@ltx/swh_ke_oak/he.a.m1:heAU.ChorosAngelikos.notmetered
ltx/swh_redirects_oak/he.a.m1:heAU.ChorosAngelikos.text	@ltx/swh_ke_oak/he.a.m1:heAU.ChorosAngelikos.text
ltx/swh_redirects_oak/he.a.m1:heAU.NefelinSeFotos.greekname	@ltx/swh_ke_oak/he.a.m1:heAU.NefelinSeFotos.greekname
ltx/swh_redirects_oak/he.a.m1:heAU.NefelinSeFotos.incipit	@ltx/swh_ke_oak/he.a.m1:heAU.NefelinSeFotos.incipit
ltx/swh_redirects_oak/he.a.m1:heAU.NefelinSeFotos.mode	@ltx/swh_ke_oak/he.a.m1:heAU.NefelinSeFotos.mode
ltx/swh_redirects_oak/he.a.m1:heAU.NefelinSeFotos.name	@ltx/swh_ke_oak/he.a.m1:heAU.NefelinSeFotos.name
ltx/swh_redirects_oak/he.a.m1:heAU.NefelinSeFotos.notmetered	@ltx/swh_ke_oak/he.a.m1:heAU.NefelinSeFotos.notmetered
ltx/swh_redirects_oak/he.a.m1:heAU.NefelinSeFotos.text	@ltx/swh_ke_oak/he.a.m1:heAU.NefelinSeFotos.text
ltx/swh_redirects_oak/he.a.m1:heAU.OTouParadoxouThavmatos.greekname	@ltx/swh_ke_oak/he.a.m1:heAU.OTouParadoxouThavmatos.greekname
ltx/swh_redirects_oak/he.a.m1:heAU.OTouParadoxouThavmatos.incipit	@ltx/swh_ke_oak/he.a.m1:heAU.OTouParadoxouThavmatos.incipit
ltx/swh_redirects_oak/he.a.m1:heAU.OTouParadoxouThavmatos.mode	@ltx/swh_ke_oak/he.a.m1:heAU.OTouParadoxouThavmatos.mode
ltx/swh_redirects_oak/he.a.m1:heAU.OTouParadoxouThavmatos.name	@ltx/swh_ke_oak/he.a.m1:heAU.OTouParadoxouThavmatos.name
ltx/swh_redirects_oak/he.a.m1:heAU.OTouParadoxouThavmatos.notmetered	@ltx/swh_ke_oak/he.a.m1:heAU.OTouParadoxouThavmatos.notmetered
ltx/swh_redirects_oak/he.a.m1:heAU.OTouParadoxouThavmatos.text	@ltx/swh_ke_oak/he.a.m1:heAU.OTouParadoxouThavmatos.text
ltx/swh_redirects_oak/he.a.m1:heAU.OtanElthisOTheos.greekname	@ltx/swh_ke_oak/he.a.m1:heAU.OtanElthisOTheos.greekname
ltx/swh_redirects_oak/he.a.m1:heAU.OtanElthisOTheos.incipit	@ltx/swh_ke_oak/he.a.m1:heAU.OtanElthisOTheos.incipit
ltx/swh_redirects_oak/he.a.m1:heAU.OtanElthisOTheos.mode	@ltx/swh_ke_oak/he.a.m1:heAU.OtanElthisOTheos.mode
ltx/swh_redirects_oak/he.a.m1:heAU.OtanElthisOTheos.name	@ltx/swh_ke_oak/he.a.m1:heAU.OtanElthisOTheos.name
ltx/swh_redirects_oak/he.a.m1:heAU.OtanElthisOTheos.notmetered	@ltx/swh_ke_oak/he.a.m1:heAU.OtanElthisOTheos.notmetered
ltx/swh_redirects_oak/he.a.m1:heAU.OtanElthisOTheos.text	@ltx/swh_ke_oak/he.a.m1:heAU.OtanElthisOTheos.text
ltx/swh_redirects_oak/he.a.m1:heAU.PaneffimoiMartyres.greekname	@ltx/swh_ke_oak/he.a.m1:heAU.PaneffimoiMartyres.greekname
ltx/swh_redirects_oak/he.a.m1:heAU.PaneffimoiMartyres.incipit	@ltx/swh_ke_oak/he.a.m1:heAU.PaneffimoiMartyres.incipit
ltx/swh_redirects_oak/he.a.m1:heAU.PaneffimoiMartyres.mode	@ltx/swh_ke_oak/he.a.m1:heAU.PaneffimoiMartyres.mode
ltx/swh_redirects_oak/he.a.m1:heAU.PaneffimoiMartyres.name	@ltx/swh_ke_oak/he.a.m1:heAU.PaneffimoiMartyres.name
ltx/swh_redirects_oak/he.a.m1:heAU.PaneffimoiMartyres.notmetered	@ltx/swh_ke_oak/he.a.m1:heAU.PaneffimoiMartyres.notmetered
ltx/swh_redirects_oak/he.a.m1:heAU.PaneffimoiMartyres.text	@ltx/swh_ke_oak/he.a.m1:heAU.PaneffimoiMartyres.text
ltx/swh_redirects_oak/he.a.m1:heAU.TisErimouPolitis.greekname	@ltx/swh_ke_oak/he.a.m1:heAU.TisErimouPolitis.greekname
ltx/swh_redirects_oak/he.a.m1:heAU.TisErimouPolitis.incipit	@ltx/swh_ke_oak/he.a.m1:heAU.TisErimouPolitis.incipit
ltx/swh_redirects_oak/he.a.m1:heAU.TisErimouPolitis.mode	@ltx/swh_ke_oak/he.a.m1:heAU.TisErimouPolitis.mode
ltx/swh_redirects_oak/he.a.m1:heAU.TisErimouPolitis.name	@ltx/swh_ke_oak/he.a.m1:heAU.TisErimouPolitis.name
ltx/swh_redirects_oak/he.a.m1:heAU.TisErimouPolitis.notmetered	@ltx/swh_ke_oak/he.a.m1:heAU.TisErimouPolitis.notmetered
ltx/swh_redirects_oak/he.a.m1:heAU.TisErimouPolitis.text	@ltx/swh_ke_oak/he.a.m1:heAU.TisErimouPolitis.text
ltx/swh_redirects_oak/he.a.m1:heAU.TonOuranionTagmaton.greekname	@ltx/swh_ke_oak/he.a.m1:heAU.TonOuranionTagmaton.greekname
ltx/swh_redirects_oak/he.a.m1:heAU.TonOuranionTagmaton.incipit	@ltx/swh_ke_oak/he.a.m1:heAU.TonOuranionTagmaton.incipit
ltx/swh_redirects_oak/he.a.m1:heAU.TonOuranionTagmaton.mode	@ltx/swh_ke_oak/he.a.m1:heAU.TonOuranionTagmaton.mode
ltx/swh_redirects_oak/he.a.m1:heAU.TonOuranionTagmaton.name	@ltx/swh_ke_oak/he.a.m1:heAU.TonOuranionTagmaton.name
ltx/swh_redirects_oak/he.a.m1:heAU.TonOuranionTagmaton.notmetered	@ltx/swh_ke_oak/he.a.m1:heAU.TonOuranionTagmaton.notmetered
ltx/swh_redirects_oak/he.a.m1:heAU.TonOuranionTagmaton.text	@ltx/swh_ke_oak/he.a.m1:heAU.TonOuranionTagmaton.text
ltx/swh_redirects_oak/he.a.m1:heAU.TonTafonSouSotir.greekname	@ltx/swh_ke_oak/he.a.m1:heAU.TonTafonSouSotir.greekname
ltx/swh_redirects_oak/he.a.m1:heAU.TonTafonSouSotir.incipit	@ltx/swh_ke_oak/he.a.m1:heAU.TonTafonSouSotir.incipit
ltx/swh_redirects_oak/he.a.m1:heAU.TonTafonSouSotir.mode	@ltx/swh_ke_oak/he.a.m1:heAU.TonTafonSouSotir.mode
ltx/swh_redirects_oak/he.a.m1:heAU.TonTafonSouSotir.name	@ltx/swh_ke_oak/he.a.m1:heAU.TonTafonSouSotir.name
ltx/swh_redirects_oak/he.a.m1:heAU.TonTafonSouSotir.notmetered	@ltx/swh_ke_oak/he.a.m1:heAU.TonTafonSouSotir.notmetered
ltx/swh_redirects_oak/he.a.m1:heAU.TonTafonSouSotir.text	@ltx/swh_ke_oak/he.a.m1:heAU.TonTafonSouSotir.text
ltx/swh_redirects_oak/he.a.m1:heAU.TouLithouSfragisthentos.greekname	@ltx/swh_ke_oak/he.a.m1:heAU.TouLithouSfragisthentos.greekname
ltx/swh_redirects_oak/he.a.m1:heAU.TouLithouSfragisthentos.incipit	@ltx/swh_ke_oak/he.a.m1:heAU.TouLithouSfragisthentos.incipit
ltx/swh_redirects_oak/he.a.m1:heAU.TouLithouSfragisthentos.mode	@ltx/swh_ke_oak/he.a.m1:heAU.TouLithouSfragisthentos.mode
ltx/swh_redirects_oak/he.a.m1:heAU.TouLithouSfragisthentos.name	@ltx/swh_ke_oak/he.a.m1:heAU.TouLithouSfragisthentos.name
ltx/swh_redirects_oak/he.a.m1:heAU.TouLithouSfragisthentos.notmetered	@ltx/swh_ke_oak/he.a.m1:heAU.TouLithouSfragisthentos.notmetered
ltx/swh_redirects_oak/he.a.m1:heAU.TouLithouSfragisthentos.text	@ltx/swh_ke_oak/he.a.m1:heAU.TouLithouSfragisthentos.text
ltx/swh_redirects_oak/he.a.m1:heAU.title	@ltx/swh_ke_oak/he.a.m1:heAU.title
