ltx/swh_redirects_oak/sy.m04.d17:syMA.commemoration01.couplet1.title	@ltx/swh_ke_oak/sy.m04.d17:syMA.commemoration01.couplet1.title
ltx/swh_redirects_oak/sy.m04.d17:syMA.commemoration01.couplet1.verse1	@ltx/swh_ke_oak/sy.m04.d17:syMA.commemoration01.couplet1.verse1
ltx/swh_redirects_oak/sy.m04.d17:syMA.commemoration01.couplet1.verse2	@ltx/swh_ke_oak/sy.m04.d17:syMA.commemoration01.couplet1.verse2
ltx/swh_redirects_oak/sy.m04.d17:syMA.commemoration01.couplet2.title	@ltx/swh_ke_oak/sy.m04.d17:syMA.commemoration01.couplet2.title
ltx/swh_redirects_oak/sy.m04.d17:syMA.commemoration01.couplet2.verse1	@ltx/swh_ke_oak/sy.m04.d17:syMA.commemoration01.couplet2.verse1
ltx/swh_redirects_oak/sy.m04.d17:syMA.commemoration01.couplet2.verse2	@ltx/swh_ke_oak/sy.m04.d17:syMA.commemoration01.couplet2.verse2
ltx/swh_redirects_oak/sy.m04.d17:syMA.commemoration01.couplet3.title	@ltx/swh_ke_oak/sy.m04.d17:syMA.commemoration01.couplet3.title
ltx/swh_redirects_oak/sy.m04.d17:syMA.commemoration01.couplet3.verse1	@ltx/swh_ke_oak/sy.m04.d17:syMA.commemoration01.couplet3.verse1
ltx/swh_redirects_oak/sy.m04.d17:syMA.commemoration01.couplet3.verse2	@ltx/swh_ke_oak/sy.m04.d17:syMA.commemoration01.couplet3.verse2
ltx/swh_redirects_oak/sy.m04.d17:syMA.commemoration01.couplet4.title	@ltx/swh_ke_oak/sy.m04.d17:syMA.commemoration01.couplet4.title
ltx/swh_redirects_oak/sy.m04.d17:syMA.commemoration01.couplet4.verse1	@ltx/swh_ke_oak/sy.m04.d17:syMA.commemoration01.couplet4.verse1
ltx/swh_redirects_oak/sy.m04.d17:syMA.commemoration01.couplet4.verse2	@ltx/swh_ke_oak/sy.m04.d17:syMA.commemoration01.couplet4.verse2
ltx/swh_redirects_oak/sy.m04.d17:syMA.commemoration01.couplet5.title	@ltx/swh_ke_oak/sy.m04.d17:syMA.commemoration01.couplet5.title
ltx/swh_redirects_oak/sy.m04.d17:syMA.commemoration01.couplet5.verse1	@ltx/swh_ke_oak/sy.m04.d17:syMA.commemoration01.couplet5.verse1
ltx/swh_redirects_oak/sy.m04.d17:syMA.commemoration01.couplet5.verse2	@ltx/swh_ke_oak/sy.m04.d17:syMA.commemoration01.couplet5.verse2
ltx/swh_redirects_oak/sy.m04.d17:syMA.commemoration01.couplet6.title	@ltx/swh_ke_oak/sy.m04.d17:syMA.commemoration01.couplet6.title
ltx/swh_redirects_oak/sy.m04.d17:syMA.commemoration01.couplet6.verse1	@ltx/swh_ke_oak/sy.m04.d17:syMA.commemoration01.couplet6.verse1
ltx/swh_redirects_oak/sy.m04.d17:syMA.commemoration01.couplet6.verse2	@ltx/swh_ke_oak/sy.m04.d17:syMA.commemoration01.couplet6.verse2
ltx/swh_redirects_oak/sy.m04.d17:syMA.commemoration01.narration.p01	@ltx/swh_ke_oak/sy.m04.d17:syMA.commemoration01.narration.p01
ltx/swh_redirects_oak/sy.m04.d17:syMA.commemoration01.narration.p02	@ltx/swh_ke_oak/sy.m04.d17:syMA.commemoration01.narration.p02
ltx/swh_redirects_oak/sy.m04.d17:syMA.commemoration01.single1	@ltx/swh_ke_oak/sy.m04.d17:syMA.commemoration01.single1
ltx/swh_redirects_oak/sy.m04.d17:syMA.commemoration01.text	@ltx/swh_ke_oak/sy.m04.d17:syMA.commemoration01.text
ltx/swh_redirects_oak/sy.m04.d17:syMA.commemoration02.couplet1.title	@ltx/swh_ke_oak/sy.m04.d17:syMA.commemoration02.couplet1.title
ltx/swh_redirects_oak/sy.m04.d17:syMA.commemoration02.couplet1.verse1	@ltx/swh_ke_oak/sy.m04.d17:syMA.commemoration02.couplet1.verse1
ltx/swh_redirects_oak/sy.m04.d17:syMA.commemoration02.couplet1.verse2	@ltx/swh_ke_oak/sy.m04.d17:syMA.commemoration02.couplet1.verse2
ltx/swh_redirects_oak/sy.m04.d17:syMA.commemoration02.narration.p01	@ltx/swh_ke_oak/sy.m04.d17:syMA.commemoration02.narration.p01
ltx/swh_redirects_oak/sy.m04.d17:syMA.commemoration02.text	@ltx/swh_ke_oak/sy.m04.d17:syMA.commemoration02.text
ltx/swh_redirects_oak/sy.m04.d17:syMA.commemoration03.couplet1.title	@ltx/swh_ke_oak/sy.m04.d17:syMA.commemoration03.couplet1.title
ltx/swh_redirects_oak/sy.m04.d17:syMA.commemoration03.couplet1.verse1	@ltx/swh_ke_oak/sy.m04.d17:syMA.commemoration03.couplet1.verse1
ltx/swh_redirects_oak/sy.m04.d17:syMA.commemoration03.couplet1.verse2	@ltx/swh_ke_oak/sy.m04.d17:syMA.commemoration03.couplet1.verse2
ltx/swh_redirects_oak/sy.m04.d17:syMA.commemoration03.narration.p01	@ltx/swh_ke_oak/sy.m04.d17:syMA.commemoration03.narration.p01
ltx/swh_redirects_oak/sy.m04.d17:syMA.commemoration03.narration.p02	@ltx/swh_ke_oak/sy.m04.d17:syMA.commemoration03.narration.p02
ltx/swh_redirects_oak/sy.m04.d17:syMA.commemoration03.text	@ltx/swh_ke_oak/sy.m04.d17:syMA.commemoration03.text
ltx/swh_redirects_oak/sy.m04.d17:syMA.commemoration04.couplet1.title	@ltx/swh_ke_oak/sy.m04.d17:syMA.commemoration04.couplet1.title
ltx/swh_redirects_oak/sy.m04.d17:syMA.commemoration04.couplet1.verse1	@ltx/swh_ke_oak/sy.m04.d17:syMA.commemoration04.couplet1.verse1
ltx/swh_redirects_oak/sy.m04.d17:syMA.commemoration04.couplet1.verse2	@ltx/swh_ke_oak/sy.m04.d17:syMA.commemoration04.couplet1.verse2
ltx/swh_redirects_oak/sy.m04.d17:syMA.commemoration04.text	@ltx/swh_ke_oak/sy.m04.d17:syMA.commemoration04.text
ltx/swh_redirects_oak/sy.m04.d17:syMA.lastline	@ltx/swh_ke_oak/sy.m04.d17:syMA.lastline
