ltx/swh_redirects_oak/me.m07.d11:meDA.commemoration.first	@ltx/swh_ke_oak/me.m07.d11:meDA.commemoration.first
ltx/swh_redirects_oak/me.m07.d11:meDA.commemoration.first_name	@ltx/swh_ke_oak/me.m07.d11:meDA.commemoration.first_name
ltx/swh_redirects_oak/me.m07.d11:meDA.commemoration.first_short	@ltx/swh_ke_oak/me.m07.d11:meDA.commemoration.first_short
ltx/swh_redirects_oak/me.m07.d11:meDA.commemoration.first_title	@ltx/swh_ke_oak/me.m07.d11:meDA.commemoration.first_title
ltx/swh_redirects_oak/me.m07.d11:meDA.commemoration.full	@ltx/swh_ke_oak/me.m07.d11:meDA.commemoration.full
ltx/swh_redirects_oak/me.m07.d11:meDA.commemoration.second_name	@ltx/swh_ke_oak/me.m07.d11:meDA.commemoration.second_name
ltx/swh_redirects_oak/me.m07.d11:meDA.commemoration.second_title	@ltx/swh_ke_oak/me.m07.d11:meDA.commemoration.second_title
ltx/swh_redirects_oak/me.m07.d11:meDA.date	@ltx/swh_ke_oak/me.m07.d11:meDA.date
ltx/swh_redirects_oak/me.m07.d11:meDA.insert1	@ltx/swh_ke_oak/me.m07.d11:meDA.insert1
ltx/swh_redirects_oak/me.m07.d11:meDA.insert2	@ltx/swh_ke_oak/me.m07.d11:meDA.insert2
ltx/swh_redirects_oak/me.m07.d11:meDA.note	@ltx/swh_ke_oak/me.m07.d11:meDA.note
ltx/swh_redirects_oak/me.m07.d11:meHO.commemorations	@ltx/swh_ke_oak/me.m07.d11:meHO.commemorations
ltx/swh_redirects_oak/me.m07.d11:meHO.note1	@ltx/swh_ke_oak/me.m07.d11:meHO.note1
ltx/swh_redirects_oak/me.m07.d11:meHO.note2	@ltx/swh_ke_oak/me.m07.d11:meHO.note2
ltx/swh_redirects_oak/me.m07.d11:meHO.number	@ltx/swh_ke_oak/me.m07.d11:meHO.number
ltx/swh_redirects_oak/me.m07.d11:meHO.rank	@ltx/swh_ke_oak/me.m07.d11:meHO.rank
ltx/swh_redirects_oak/me.m07.d11:meLE.commemoration1	@ltx/swh_ke_oak/me.m07.d11:meLE.commemoration1
ltx/swh_redirects_oak/me.m07.d11:meLE.commemoration2	@ltx/swh_ke_oak/me.m07.d11:meLE.commemoration2
ltx/swh_redirects_oak/me.m07.d11:meLI.Kontakion1.incipit	@ltx/swh_ke_oak/me.m07.d11:meMA.Kontakion1.incipit
ltx/swh_redirects_oak/me.m07.d11:meLI.Kontakion1.melody	@ltx/swh_ke_oak/me.m07.d11:meMA.Kontakion1.melody
ltx/swh_redirects_oak/me.m07.d11:meLI.Kontakion1.mode	@ltx/swh_ke_oak/me.m07.d11:meMA.Kontakion1.mode
ltx/swh_redirects_oak/me.m07.d11:meLI.Kontakion1.text	@ltx/swh_ke_oak/me.m07.d11:meMA.Kontakion1.text
ltx/swh_redirects_oak/me.m07.d11:meLI.MM.CommunionHymn.text	@ltx/swh_ke_oak/properties:media.key
ltx/swh_redirects_oak/me.m07.d11:meLI.Megalynarion.text	@ltx/swh_ke_oak/me.m07.d11:meLI.Megalynarion.text
ltx/swh_redirects_oak/me.m07.d11:meMA.C1.poet	@ltx/swh_ke_oak/me.m07.d11:meMA.C1.poet
ltx/swh_redirects_oak/me.m07.d11:meMA.C1.title	@ltx/swh_ke_oak/me.m07.d11:meMA.C1.title
ltx/swh_redirects_oak/me.m07.d11:meMA.C1.verse	@ltx/swh_ke_oak/me.m07.d11:meMA.C1.verse
ltx/swh_redirects_oak/me.m07.d11:meMA.ExapTheotokion.incipit	@ltx/swh_ke_oak/me.m07.d11:meMA.ExapTheotokion.incipit
ltx/swh_redirects_oak/me.m07.d11:meMA.ExapTheotokion.melody	@ltx/swh_ke_oak/me.m07.d11:meMA.ExapTheotokion.melody
ltx/swh_redirects_oak/me.m07.d11:meMA.ExapTheotokion.mode	@ltx/swh_ke_oak/me.m07.d11:meMA.ExapTheotokion.mode
ltx/swh_redirects_oak/me.m07.d11:meMA.ExapTheotokion.text	@ltx/swh_ke_oak/me.m07.d11:meMA.ExapTheotokion.text
ltx/swh_redirects_oak/me.m07.d11:meMA.Exaposteilarion1.greekmelody	@ltx/swh_ke_oak/me.m07.d11:meMA.Exaposteilarion1.greekmelody
ltx/swh_redirects_oak/me.m07.d11:meMA.Exaposteilarion1.incipit	@ltx/swh_ke_oak/me.m07.d11:meMA.Exaposteilarion1.incipit
ltx/swh_redirects_oak/me.m07.d11:meMA.Exaposteilarion1.melody	@ltx/swh_ke_oak/me.m07.d11:meMA.Exaposteilarion1.melody
ltx/swh_redirects_oak/me.m07.d11:meMA.Exaposteilarion1.mode	@ltx/swh_ke_oak/me.m07.d11:meMA.Exaposteilarion1.mode
ltx/swh_redirects_oak/me.m07.d11:meMA.Exaposteilarion1.text	@ltx/swh_ke_oak/me.m07.d11:meMA.Exaposteilarion1.text
ltx/swh_redirects_oak/me.m07.d11:meMA.Kathisma11.greekmelody	@ltx/swh_ke_oak/me.m07.d11:meMA.Kathisma11.greekmelody
ltx/swh_redirects_oak/me.m07.d11:meMA.Kathisma11.incipit	@ltx/swh_ke_oak/me.m07.d11:meMA.Kathisma11.incipit
ltx/swh_redirects_oak/me.m07.d11:meMA.Kathisma11.melody	@ltx/swh_ke_oak/me.m07.d11:meMA.Kathisma11.melody
ltx/swh_redirects_oak/me.m07.d11:meMA.Kathisma11.mode	@ltx/swh_ke_oak/me.m07.d11:meMA.Kathisma11.mode
ltx/swh_redirects_oak/me.m07.d11:meMA.Kathisma11.text	@ltx/swh_ke_oak/me.m07.d11:meMA.Kathisma11.text
ltx/swh_redirects_oak/me.m07.d11:meMA.Kathisma1T.incipit	@ltx/swh_ke_oak/me.m07.d11:meMA.Kathisma1T.incipit
ltx/swh_redirects_oak/me.m07.d11:meMA.Kathisma1T.melody	@ltx/swh_ke_oak/me.m07.d11:meMA.Kathisma1T.melody
ltx/swh_redirects_oak/me.m07.d11:meMA.Kathisma1T.mode	@ltx/swh_ke_oak/me.m07.d11:meMA.Kathisma1T.mode
ltx/swh_redirects_oak/me.m07.d11:meMA.Kathisma1T.text	@ltx/swh_ke_oak/me.m07.d11:meMA.Kathisma1T.text
ltx/swh_redirects_oak/me.m07.d11:meMA.Kathisma21.greekmelody	@ltx/swh_ke_oak/me.m07.d11:meMA.Kathisma21.greekmelody
ltx/swh_redirects_oak/me.m07.d11:meMA.Kathisma21.incipit	@ltx/swh_ke_oak/me.m07.d11:meMA.Kathisma21.incipit
ltx/swh_redirects_oak/me.m07.d11:meMA.Kathisma21.melody	@ltx/swh_ke_oak/me.m07.d11:meMA.Kathisma21.melody
ltx/swh_redirects_oak/me.m07.d11:meMA.Kathisma21.mode	@ltx/swh_ke_oak/me.m07.d11:meMA.Kathisma21.mode
ltx/swh_redirects_oak/me.m07.d11:meMA.Kathisma21.text	@ltx/swh_ke_oak/me.m07.d11:meMA.Kathisma21.text
ltx/swh_redirects_oak/me.m07.d11:meMA.Kathisma2T.incipit	@ltx/swh_ke_oak/me.m07.d11:meMA.Kathisma2T.incipit
ltx/swh_redirects_oak/me.m07.d11:meMA.Kathisma2T.melody	@ltx/swh_ke_oak/me.m07.d11:meMA.Kathisma2T.melody
ltx/swh_redirects_oak/me.m07.d11:meMA.Kathisma2T.mode	@ltx/swh_ke_oak/me.m07.d11:meMA.Kathisma2T.mode
ltx/swh_redirects_oak/me.m07.d11:meMA.Kathisma2T.text	@ltx/swh_ke_oak/me.m07.d11:meMA.Kathisma2T.text
ltx/swh_redirects_oak/me.m07.d11:meMA.Kathisma31.greekmelody	@ltx/swh_ke_oak/me.m07.d11:meMA.Kathisma31.greekmelody
ltx/swh_redirects_oak/me.m07.d11:meMA.Kathisma31.incipit	@ltx/swh_ke_oak/me.m07.d11:meMA.Kathisma31.incipit
ltx/swh_redirects_oak/me.m07.d11:meMA.Kathisma31.melody	@ltx/swh_ke_oak/me.m07.d11:meMA.Kathisma31.melody
ltx/swh_redirects_oak/me.m07.d11:meMA.Kathisma31.mode	@ltx/swh_ke_oak/me.m07.d11:meMA.Kathisma31.mode
ltx/swh_redirects_oak/me.m07.d11:meMA.Kathisma31.text	@ltx/swh_ke_oak/me.m07.d11:meMA.Kathisma31.text
ltx/swh_redirects_oak/me.m07.d11:meMA.Kathisma3T.incipit	@ltx/swh_ke_oak/me.m07.d11:meMA.Kathisma3T.incipit
ltx/swh_redirects_oak/me.m07.d11:meMA.Kathisma3T.melody	@ltx/swh_ke_oak/me.m07.d11:meMA.Kathisma3T.melody
ltx/swh_redirects_oak/me.m07.d11:meMA.Kathisma3T.mode	@ltx/swh_ke_oak/me.m07.d11:meMA.Kathisma3T.mode
ltx/swh_redirects_oak/me.m07.d11:meMA.Kathisma3T.text	@ltx/swh_ke_oak/me.m07.d11:meMA.Kathisma3T.text
ltx/swh_redirects_oak/me.m07.d11:meMA.Kontakion1.incipit	@ltx/swh_ke_oak/me.m07.d11:meMA.Kontakion1.incipit
ltx/swh_redirects_oak/me.m07.d11:meMA.Kontakion1.melody	@ltx/swh_ke_oak/me.m07.d11:meMA.Kontakion1.melody
ltx/swh_redirects_oak/me.m07.d11:meMA.Kontakion1.mode	@ltx/swh_ke_oak/me.m07.d11:meMA.Kontakion1.mode
ltx/swh_redirects_oak/me.m07.d11:meMA.Kontakion1.text	@ltx/swh_ke_oak/me.m07.d11:meMA.Kontakion1.text
ltx/swh_redirects_oak/me.m07.d11:meMA.Lauds1.greekmelody	@ltx/swh_ke_oak/me.m07.d11:meMA.Lauds1.greekmelody
ltx/swh_redirects_oak/me.m07.d11:meMA.Lauds1.incipit	@ltx/swh_ke_oak/me.m07.d11:meMA.Lauds1.incipit
ltx/swh_redirects_oak/me.m07.d11:meMA.Lauds1.melody	@ltx/swh_ke_oak/me.m07.d11:meMA.Lauds1.melody
ltx/swh_redirects_oak/me.m07.d11:meMA.Lauds1.mode	@ltx/swh_ke_oak/me.m07.d11:meMA.Lauds1.mode
ltx/swh_redirects_oak/me.m07.d11:meMA.Lauds1.text	@ltx/swh_ke_oak/me.m07.d11:meMA.Lauds1.text
ltx/swh_redirects_oak/me.m07.d11:meMA.Lauds2.incipit	@ltx/swh_ke_oak/me.m07.d11:meMA.Lauds2.incipit
ltx/swh_redirects_oak/me.m07.d11:meMA.Lauds2.melody	@ltx/swh_ke_oak/me.m07.d11:meMA.Lauds2.melody
ltx/swh_redirects_oak/me.m07.d11:meMA.Lauds2.mode	@ltx/swh_ke_oak/me.m07.d11:meMA.Lauds2.mode
ltx/swh_redirects_oak/me.m07.d11:meMA.Lauds2.text	@ltx/swh_ke_oak/me.m07.d11:meMA.Lauds2.text
ltx/swh_redirects_oak/me.m07.d11:meMA.Lauds3.incipit	@ltx/swh_ke_oak/me.m07.d11:meMA.Lauds3.incipit
ltx/swh_redirects_oak/me.m07.d11:meMA.Lauds3.melody	@ltx/swh_ke_oak/me.m07.d11:meMA.Lauds3.melody
ltx/swh_redirects_oak/me.m07.d11:meMA.Lauds3.mode	@ltx/swh_ke_oak/me.m07.d11:meMA.Lauds3.mode
ltx/swh_redirects_oak/me.m07.d11:meMA.Lauds3.text	@ltx/swh_ke_oak/me.m07.d11:meMA.Lauds3.text
ltx/swh_redirects_oak/me.m07.d11:meMA.LaudsGlory.incipit	@ltx/swh_ke_oak/me.m07.d11:meMA.LaudsGlory.incipit
ltx/swh_redirects_oak/me.m07.d11:meMA.LaudsGlory.melody	@ltx/swh_ke_oak/me.m07.d11:meMA.LaudsGlory.melody
ltx/swh_redirects_oak/me.m07.d11:meMA.LaudsGlory.mode	@ltx/swh_ke_oak/me.m07.d11:meMA.LaudsGlory.mode
ltx/swh_redirects_oak/me.m07.d11:meMA.LaudsGlory.text	@ltx/swh_ke_oak/me.m07.d11:meMA.LaudsGlory.text
ltx/swh_redirects_oak/me.m07.d11:meMA.LaudsTheotokion.incipit	@ltx/swh_ke_oak/me.m07.d11:meMA.LaudsTheotokion.incipit
ltx/swh_redirects_oak/me.m07.d11:meMA.LaudsTheotokion.melody	@ltx/swh_ke_oak/me.m07.d11:meMA.LaudsTheotokion.melody
ltx/swh_redirects_oak/me.m07.d11:meMA.LaudsTheotokion.mode	@ltx/swh_ke_oak/me.m07.d11:meMA.LaudsTheotokion.mode
ltx/swh_redirects_oak/me.m07.d11:meMA.LaudsTheotokion.text	@ltx/swh_ke_oak/me.m07.d11:meMA.LaudsTheotokion.text
ltx/swh_redirects_oak/me.m07.d11:meMA.MM.Lauds1123as5678.text	@ltx/swh_ke_oak/properties:media.key
ltx/swh_redirects_oak/me.m07.d11:meMA.Ode1C11.greekmelody	@ltx/swh_ke_oak/me.m07.d11:meMA.Ode1C11.greekmelody
ltx/swh_redirects_oak/me.m07.d11:meMA.Ode1C11.incipit	@ltx/swh_ke_oak/me.m07.d11:meMA.Ode1C11.incipit
ltx/swh_redirects_oak/me.m07.d11:meMA.Ode1C11.melody	@ltx/swh_ke_oak/me.m07.d11:meMA.Ode1C11.melody
ltx/swh_redirects_oak/me.m07.d11:meMA.Ode1C11.mode	@ltx/swh_ke_oak/me.m07.d11:meMA.Ode1C11.mode
ltx/swh_redirects_oak/me.m07.d11:meMA.Ode1C11.ode	@ltx/swh_ke_oak/me.m07.d11:meMA.Ode1C11.ode
ltx/swh_redirects_oak/me.m07.d11:meMA.Ode1C11.text	@ltx/swh_ke_oak/me.m07.d11:meMA.Ode1C11.text
ltx/swh_redirects_oak/me.m07.d11:meMA.Ode1C12.incipit	@ltx/swh_ke_oak/me.m07.d11:meMA.Ode1C12.incipit
ltx/swh_redirects_oak/me.m07.d11:meMA.Ode1C12.melody	@ltx/swh_ke_oak/me.m07.d11:meMA.Ode1C12.melody
ltx/swh_redirects_oak/me.m07.d11:meMA.Ode1C12.mode	@ltx/swh_ke_oak/me.m07.d11:meMA.Ode1C12.mode
ltx/swh_redirects_oak/me.m07.d11:meMA.Ode1C12.ode	@ltx/swh_ke_oak/me.m07.d11:meMA.Ode1C12.ode
ltx/swh_redirects_oak/me.m07.d11:meMA.Ode1C12.text	@ltx/swh_ke_oak/me.m07.d11:meMA.Ode1C12.text
ltx/swh_redirects_oak/me.m07.d11:meMA.Ode1C13.incipit	@ltx/swh_ke_oak/me.m07.d11:meMA.Ode1C13.incipit
ltx/swh_redirects_oak/me.m07.d11:meMA.Ode1C13.melody	@ltx/swh_ke_oak/me.m07.d11:meMA.Ode1C13.melody
ltx/swh_redirects_oak/me.m07.d11:meMA.Ode1C13.mode	@ltx/swh_ke_oak/me.m07.d11:meMA.Ode1C13.mode
ltx/swh_redirects_oak/me.m07.d11:meMA.Ode1C13.ode	@ltx/swh_ke_oak/me.m07.d11:meMA.Ode1C13.ode
ltx/swh_redirects_oak/me.m07.d11:meMA.Ode1C13.text	@ltx/swh_ke_oak/me.m07.d11:meMA.Ode1C13.text
ltx/swh_redirects_oak/me.m07.d11:meMA.Ode1C1T.incipit	@ltx/swh_ke_oak/me.m07.d11:meMA.Ode1C1T.incipit
ltx/swh_redirects_oak/me.m07.d11:meMA.Ode1C1T.melody	@ltx/swh_ke_oak/me.m07.d11:meMA.Ode1C1T.melody
ltx/swh_redirects_oak/me.m07.d11:meMA.Ode1C1T.mode	@ltx/swh_ke_oak/me.m07.d11:meMA.Ode1C1T.mode
ltx/swh_redirects_oak/me.m07.d11:meMA.Ode1C1T.ode	@ltx/swh_ke_oak/me.m07.d11:meMA.Ode1C1T.ode
ltx/swh_redirects_oak/me.m07.d11:meMA.Ode1C1T.text	@ltx/swh_ke_oak/me.m07.d11:meMA.Ode1C1T.text
ltx/swh_redirects_oak/me.m07.d11:meMA.Ode3C11.greekmelody	@ltx/swh_ke_oak/me.m07.d11:meMA.Ode3C11.greekmelody
ltx/swh_redirects_oak/me.m07.d11:meMA.Ode3C11.incipit	@ltx/swh_ke_oak/me.m07.d11:meMA.Ode3C11.incipit
ltx/swh_redirects_oak/me.m07.d11:meMA.Ode3C11.melody	@ltx/swh_ke_oak/me.m07.d11:meMA.Ode3C11.melody
ltx/swh_redirects_oak/me.m07.d11:meMA.Ode3C11.mode	@ltx/swh_ke_oak/me.m07.d11:meMA.Ode3C11.mode
ltx/swh_redirects_oak/me.m07.d11:meMA.Ode3C11.ode	@ltx/swh_ke_oak/me.m07.d11:meMA.Ode3C11.ode
ltx/swh_redirects_oak/me.m07.d11:meMA.Ode3C11.text	@ltx/swh_ke_oak/me.m07.d11:meMA.Ode3C11.text
ltx/swh_redirects_oak/me.m07.d11:meMA.Ode3C12.incipit	@ltx/swh_ke_oak/me.m07.d11:meMA.Ode3C12.incipit
ltx/swh_redirects_oak/me.m07.d11:meMA.Ode3C12.melody	@ltx/swh_ke_oak/me.m07.d11:meMA.Ode3C12.melody
ltx/swh_redirects_oak/me.m07.d11:meMA.Ode3C12.mode	@ltx/swh_ke_oak/me.m07.d11:meMA.Ode3C12.mode
ltx/swh_redirects_oak/me.m07.d11:meMA.Ode3C12.ode	@ltx/swh_ke_oak/me.m07.d11:meMA.Ode3C12.ode
ltx/swh_redirects_oak/me.m07.d11:meMA.Ode3C12.text	@ltx/swh_ke_oak/me.m07.d11:meMA.Ode3C12.text
ltx/swh_redirects_oak/me.m07.d11:meMA.Ode3C13.incipit	@ltx/swh_ke_oak/me.m07.d11:meMA.Ode3C13.incipit
ltx/swh_redirects_oak/me.m07.d11:meMA.Ode3C13.melody	@ltx/swh_ke_oak/me.m07.d11:meMA.Ode3C13.melody
ltx/swh_redirects_oak/me.m07.d11:meMA.Ode3C13.mode	@ltx/swh_ke_oak/me.m07.d11:meMA.Ode3C13.mode
ltx/swh_redirects_oak/me.m07.d11:meMA.Ode3C13.ode	@ltx/swh_ke_oak/me.m07.d11:meMA.Ode3C13.ode
ltx/swh_redirects_oak/me.m07.d11:meMA.Ode3C13.text	@ltx/swh_ke_oak/me.m07.d11:meMA.Ode3C13.text
ltx/swh_redirects_oak/me.m07.d11:meMA.Ode3C1T.incipit	@ltx/swh_ke_oak/me.m07.d11:meMA.Ode3C1T.incipit
ltx/swh_redirects_oak/me.m07.d11:meMA.Ode3C1T.melody	@ltx/swh_ke_oak/me.m07.d11:meMA.Ode3C1T.melody
ltx/swh_redirects_oak/me.m07.d11:meMA.Ode3C1T.mode	@ltx/swh_ke_oak/me.m07.d11:meMA.Ode3C1T.mode
ltx/swh_redirects_oak/me.m07.d11:meMA.Ode3C1T.ode	@ltx/swh_ke_oak/me.m07.d11:meMA.Ode3C1T.ode
ltx/swh_redirects_oak/me.m07.d11:meMA.Ode3C1T.text	@ltx/swh_ke_oak/me.m07.d11:meMA.Ode3C1T.text
ltx/swh_redirects_oak/me.m07.d11:meMA.Ode3Kathisma1.greekmelody	@ltx/swh_ke_oak/me.m07.d11:meMA.Ode3Kathisma1.greekmelody
ltx/swh_redirects_oak/me.m07.d11:meMA.Ode3Kathisma1.incipit	@ltx/swh_ke_oak/me.m07.d11:meMA.Ode3Kathisma1.incipit
ltx/swh_redirects_oak/me.m07.d11:meMA.Ode3Kathisma1.melody	@ltx/swh_ke_oak/me.m07.d11:meMA.Ode3Kathisma1.melody
ltx/swh_redirects_oak/me.m07.d11:meMA.Ode3Kathisma1.mode	@ltx/swh_ke_oak/me.m07.d11:meMA.Ode3Kathisma1.mode
ltx/swh_redirects_oak/me.m07.d11:meMA.Ode3Kathisma1.text	@ltx/swh_ke_oak/me.m07.d11:meMA.Ode3Kathisma1.text
ltx/swh_redirects_oak/me.m07.d11:meMA.Ode3KathismaT.incipit	@ltx/swh_ke_oak/me.m07.d11:meMA.Ode3KathismaT.incipit
ltx/swh_redirects_oak/me.m07.d11:meMA.Ode3KathismaT.melody	@ltx/swh_ke_oak/me.m07.d11:meMA.Ode3KathismaT.melody
ltx/swh_redirects_oak/me.m07.d11:meMA.Ode3KathismaT.mode	@ltx/swh_ke_oak/me.m07.d11:meMA.Ode3KathismaT.mode
ltx/swh_redirects_oak/me.m07.d11:meMA.Ode3KathismaT.text	@ltx/swh_ke_oak/me.m07.d11:meMA.Ode3KathismaT.text
ltx/swh_redirects_oak/me.m07.d11:meMA.Ode4C11.greekmelody	@ltx/swh_ke_oak/me.m07.d11:meMA.Ode4C11.greekmelody
ltx/swh_redirects_oak/me.m07.d11:meMA.Ode4C11.incipit	@ltx/swh_ke_oak/me.m07.d11:meMA.Ode4C11.incipit
ltx/swh_redirects_oak/me.m07.d11:meMA.Ode4C11.melody	@ltx/swh_ke_oak/me.m07.d11:meMA.Ode4C11.melody
ltx/swh_redirects_oak/me.m07.d11:meMA.Ode4C11.mode	@ltx/swh_ke_oak/me.m07.d11:meMA.Ode4C11.mode
ltx/swh_redirects_oak/me.m07.d11:meMA.Ode4C11.ode	@ltx/swh_ke_oak/me.m07.d11:meMA.Ode4C11.ode
ltx/swh_redirects_oak/me.m07.d11:meMA.Ode4C11.text	@ltx/swh_ke_oak/me.m07.d11:meMA.Ode4C11.text
ltx/swh_redirects_oak/me.m07.d11:meMA.Ode4C12.incipit	@ltx/swh_ke_oak/me.m07.d11:meMA.Ode4C12.incipit
ltx/swh_redirects_oak/me.m07.d11:meMA.Ode4C12.melody	@ltx/swh_ke_oak/me.m07.d11:meMA.Ode4C12.melody
ltx/swh_redirects_oak/me.m07.d11:meMA.Ode4C12.mode	@ltx/swh_ke_oak/me.m07.d11:meMA.Ode4C12.mode
ltx/swh_redirects_oak/me.m07.d11:meMA.Ode4C12.ode	@ltx/swh_ke_oak/me.m07.d11:meMA.Ode4C12.ode
ltx/swh_redirects_oak/me.m07.d11:meMA.Ode4C12.text	@ltx/swh_ke_oak/me.m07.d11:meMA.Ode4C12.text
ltx/swh_redirects_oak/me.m07.d11:meMA.Ode4C13.incipit	@ltx/swh_ke_oak/me.m07.d11:meMA.Ode4C13.incipit
ltx/swh_redirects_oak/me.m07.d11:meMA.Ode4C13.melody	@ltx/swh_ke_oak/me.m07.d11:meMA.Ode4C13.melody
ltx/swh_redirects_oak/me.m07.d11:meMA.Ode4C13.mode	@ltx/swh_ke_oak/me.m07.d11:meMA.Ode4C13.mode
ltx/swh_redirects_oak/me.m07.d11:meMA.Ode4C13.ode	@ltx/swh_ke_oak/me.m07.d11:meMA.Ode4C13.ode
ltx/swh_redirects_oak/me.m07.d11:meMA.Ode4C13.text	@ltx/swh_ke_oak/me.m07.d11:meMA.Ode4C13.text
ltx/swh_redirects_oak/me.m07.d11:meMA.Ode4C1T.incipit	@ltx/swh_ke_oak/me.m07.d11:meMA.Ode4C1T.incipit
ltx/swh_redirects_oak/me.m07.d11:meMA.Ode4C1T.melody	@ltx/swh_ke_oak/me.m07.d11:meMA.Ode4C1T.melody
ltx/swh_redirects_oak/me.m07.d11:meMA.Ode4C1T.mode	@ltx/swh_ke_oak/me.m07.d11:meMA.Ode4C1T.mode
ltx/swh_redirects_oak/me.m07.d11:meMA.Ode4C1T.ode	@ltx/swh_ke_oak/me.m07.d11:meMA.Ode4C1T.ode
ltx/swh_redirects_oak/me.m07.d11:meMA.Ode4C1T.text	@ltx/swh_ke_oak/me.m07.d11:meMA.Ode4C1T.text
ltx/swh_redirects_oak/me.m07.d11:meMA.Ode5C11.greekmelody	@ltx/swh_ke_oak/me.m07.d11:meMA.Ode5C11.greekmelody
ltx/swh_redirects_oak/me.m07.d11:meMA.Ode5C11.incipit	@ltx/swh_ke_oak/me.m07.d11:meMA.Ode5C11.incipit
ltx/swh_redirects_oak/me.m07.d11:meMA.Ode5C11.melody	@ltx/swh_ke_oak/me.m07.d11:meMA.Ode5C11.melody
ltx/swh_redirects_oak/me.m07.d11:meMA.Ode5C11.mode	@ltx/swh_ke_oak/me.m07.d11:meMA.Ode5C11.mode
ltx/swh_redirects_oak/me.m07.d11:meMA.Ode5C11.ode	@ltx/swh_ke_oak/me.m07.d11:meMA.Ode5C11.ode
ltx/swh_redirects_oak/me.m07.d11:meMA.Ode5C11.text	@ltx/swh_ke_oak/me.m07.d11:meMA.Ode5C11.text
ltx/swh_redirects_oak/me.m07.d11:meMA.Ode5C12.incipit	@ltx/swh_ke_oak/me.m07.d11:meMA.Ode5C12.incipit
ltx/swh_redirects_oak/me.m07.d11:meMA.Ode5C12.melody	@ltx/swh_ke_oak/me.m07.d11:meMA.Ode5C12.melody
ltx/swh_redirects_oak/me.m07.d11:meMA.Ode5C12.mode	@ltx/swh_ke_oak/me.m07.d11:meMA.Ode5C12.mode
ltx/swh_redirects_oak/me.m07.d11:meMA.Ode5C12.ode	@ltx/swh_ke_oak/me.m07.d11:meMA.Ode5C12.ode
ltx/swh_redirects_oak/me.m07.d11:meMA.Ode5C12.text	@ltx/swh_ke_oak/me.m07.d11:meMA.Ode5C12.text
ltx/swh_redirects_oak/me.m07.d11:meMA.Ode5C13.incipit	@ltx/swh_ke_oak/me.m07.d11:meMA.Ode5C13.incipit
ltx/swh_redirects_oak/me.m07.d11:meMA.Ode5C13.melody	@ltx/swh_ke_oak/me.m07.d11:meMA.Ode5C13.melody
ltx/swh_redirects_oak/me.m07.d11:meMA.Ode5C13.mode	@ltx/swh_ke_oak/me.m07.d11:meMA.Ode5C13.mode
ltx/swh_redirects_oak/me.m07.d11:meMA.Ode5C13.ode	@ltx/swh_ke_oak/me.m07.d11:meMA.Ode5C13.ode
ltx/swh_redirects_oak/me.m07.d11:meMA.Ode5C13.text	@ltx/swh_ke_oak/me.m07.d11:meMA.Ode5C13.text
ltx/swh_redirects_oak/me.m07.d11:meMA.Ode5C1T.incipit	@ltx/swh_ke_oak/me.m07.d11:meMA.Ode5C1T.incipit
ltx/swh_redirects_oak/me.m07.d11:meMA.Ode5C1T.melody	@ltx/swh_ke_oak/me.m07.d11:meMA.Ode5C1T.melody
ltx/swh_redirects_oak/me.m07.d11:meMA.Ode5C1T.mode	@ltx/swh_ke_oak/me.m07.d11:meMA.Ode5C1T.mode
ltx/swh_redirects_oak/me.m07.d11:meMA.Ode5C1T.ode	@ltx/swh_ke_oak/me.m07.d11:meMA.Ode5C1T.ode
ltx/swh_redirects_oak/me.m07.d11:meMA.Ode5C1T.text	@ltx/swh_ke_oak/me.m07.d11:meMA.Ode5C1T.text
ltx/swh_redirects_oak/me.m07.d11:meMA.Ode6C11.greekmelody	@ltx/swh_ke_oak/me.m07.d11:meMA.Ode6C11.greekmelody
ltx/swh_redirects_oak/me.m07.d11:meMA.Ode6C11.incipit	@ltx/swh_ke_oak/me.m07.d11:meMA.Ode6C11.incipit
ltx/swh_redirects_oak/me.m07.d11:meMA.Ode6C11.melody	@ltx/swh_ke_oak/me.m07.d11:meMA.Ode6C11.melody
ltx/swh_redirects_oak/me.m07.d11:meMA.Ode6C11.mode	@ltx/swh_ke_oak/me.m07.d11:meMA.Ode6C11.mode
ltx/swh_redirects_oak/me.m07.d11:meMA.Ode6C11.ode	@ltx/swh_ke_oak/me.m07.d11:meMA.Ode6C11.ode
ltx/swh_redirects_oak/me.m07.d11:meMA.Ode6C11.text	@ltx/swh_ke_oak/me.m07.d11:meMA.Ode6C11.text
ltx/swh_redirects_oak/me.m07.d11:meMA.Ode6C12.incipit	@ltx/swh_ke_oak/me.m07.d11:meMA.Ode6C12.incipit
ltx/swh_redirects_oak/me.m07.d11:meMA.Ode6C12.melody	@ltx/swh_ke_oak/me.m07.d11:meMA.Ode6C12.melody
ltx/swh_redirects_oak/me.m07.d11:meMA.Ode6C12.mode	@ltx/swh_ke_oak/me.m07.d11:meMA.Ode6C12.mode
ltx/swh_redirects_oak/me.m07.d11:meMA.Ode6C12.ode	@ltx/swh_ke_oak/me.m07.d11:meMA.Ode6C12.ode
ltx/swh_redirects_oak/me.m07.d11:meMA.Ode6C12.text	@ltx/swh_ke_oak/me.m07.d11:meMA.Ode6C12.text
ltx/swh_redirects_oak/me.m07.d11:meMA.Ode6C13.incipit	@ltx/swh_ke_oak/me.m07.d11:meMA.Ode6C13.incipit
ltx/swh_redirects_oak/me.m07.d11:meMA.Ode6C13.melody	@ltx/swh_ke_oak/me.m07.d11:meMA.Ode6C13.melody
ltx/swh_redirects_oak/me.m07.d11:meMA.Ode6C13.mode	@ltx/swh_ke_oak/me.m07.d11:meMA.Ode6C13.mode
ltx/swh_redirects_oak/me.m07.d11:meMA.Ode6C13.ode	@ltx/swh_ke_oak/me.m07.d11:meMA.Ode6C13.ode
ltx/swh_redirects_oak/me.m07.d11:meMA.Ode6C13.text	@ltx/swh_ke_oak/me.m07.d11:meMA.Ode6C13.text
ltx/swh_redirects_oak/me.m07.d11:meMA.Ode6C1T.incipit	@ltx/swh_ke_oak/me.m07.d11:meMA.Ode6C1T.incipit
ltx/swh_redirects_oak/me.m07.d11:meMA.Ode6C1T.melody	@ltx/swh_ke_oak/me.m07.d11:meMA.Ode6C1T.melody
ltx/swh_redirects_oak/me.m07.d11:meMA.Ode6C1T.mode	@ltx/swh_ke_oak/me.m07.d11:meMA.Ode6C1T.mode
ltx/swh_redirects_oak/me.m07.d11:meMA.Ode6C1T.ode	@ltx/swh_ke_oak/me.m07.d11:meMA.Ode6C1T.ode
ltx/swh_redirects_oak/me.m07.d11:meMA.Ode6C1T.text	@ltx/swh_ke_oak/me.m07.d11:meMA.Ode6C1T.text
ltx/swh_redirects_oak/me.m07.d11:meMA.Ode7C11.greekmelody	@ltx/swh_ke_oak/me.m07.d11:meMA.Ode7C11.greekmelody
ltx/swh_redirects_oak/me.m07.d11:meMA.Ode7C11.incipit	@ltx/swh_ke_oak/me.m07.d11:meMA.Ode7C11.incipit
ltx/swh_redirects_oak/me.m07.d11:meMA.Ode7C11.melody	@ltx/swh_ke_oak/me.m07.d11:meMA.Ode7C11.melody
ltx/swh_redirects_oak/me.m07.d11:meMA.Ode7C11.mode	@ltx/swh_ke_oak/me.m07.d11:meMA.Ode7C11.mode
ltx/swh_redirects_oak/me.m07.d11:meMA.Ode7C11.ode	@ltx/swh_ke_oak/me.m07.d11:meMA.Ode7C11.ode
ltx/swh_redirects_oak/me.m07.d11:meMA.Ode7C11.text	@ltx/swh_ke_oak/me.m07.d11:meMA.Ode7C11.text
ltx/swh_redirects_oak/me.m07.d11:meMA.Ode7C12.incipit	@ltx/swh_ke_oak/me.m07.d11:meMA.Ode7C12.incipit
ltx/swh_redirects_oak/me.m07.d11:meMA.Ode7C12.melody	@ltx/swh_ke_oak/me.m07.d11:meMA.Ode7C12.melody
ltx/swh_redirects_oak/me.m07.d11:meMA.Ode7C12.mode	@ltx/swh_ke_oak/me.m07.d11:meMA.Ode7C12.mode
ltx/swh_redirects_oak/me.m07.d11:meMA.Ode7C12.ode	@ltx/swh_ke_oak/me.m07.d11:meMA.Ode7C12.ode
ltx/swh_redirects_oak/me.m07.d11:meMA.Ode7C12.text	@ltx/swh_ke_oak/me.m07.d11:meMA.Ode7C12.text
ltx/swh_redirects_oak/me.m07.d11:meMA.Ode7C13.incipit	@ltx/swh_ke_oak/me.m07.d11:meMA.Ode7C13.incipit
ltx/swh_redirects_oak/me.m07.d11:meMA.Ode7C13.melody	@ltx/swh_ke_oak/me.m07.d11:meMA.Ode7C13.melody
ltx/swh_redirects_oak/me.m07.d11:meMA.Ode7C13.mode	@ltx/swh_ke_oak/me.m07.d11:meMA.Ode7C13.mode
ltx/swh_redirects_oak/me.m07.d11:meMA.Ode7C13.ode	@ltx/swh_ke_oak/me.m07.d11:meMA.Ode7C13.ode
ltx/swh_redirects_oak/me.m07.d11:meMA.Ode7C13.text	@ltx/swh_ke_oak/me.m07.d11:meMA.Ode7C13.text
ltx/swh_redirects_oak/me.m07.d11:meMA.Ode7C1T.incipit	@ltx/swh_ke_oak/me.m07.d11:meMA.Ode7C1T.incipit
ltx/swh_redirects_oak/me.m07.d11:meMA.Ode7C1T.melody	@ltx/swh_ke_oak/me.m07.d11:meMA.Ode7C1T.melody
ltx/swh_redirects_oak/me.m07.d11:meMA.Ode7C1T.mode	@ltx/swh_ke_oak/me.m07.d11:meMA.Ode7C1T.mode
ltx/swh_redirects_oak/me.m07.d11:meMA.Ode7C1T.ode	@ltx/swh_ke_oak/me.m07.d11:meMA.Ode7C1T.ode
ltx/swh_redirects_oak/me.m07.d11:meMA.Ode7C1T.text	@ltx/swh_ke_oak/me.m07.d11:meMA.Ode7C1T.text
ltx/swh_redirects_oak/me.m07.d11:meMA.Ode8C11.greekmelody	@ltx/swh_ke_oak/me.m07.d11:meMA.Ode8C11.greekmelody
ltx/swh_redirects_oak/me.m07.d11:meMA.Ode8C11.incipit	@ltx/swh_ke_oak/me.m07.d11:meMA.Ode8C11.incipit
ltx/swh_redirects_oak/me.m07.d11:meMA.Ode8C11.melody	@ltx/swh_ke_oak/me.m07.d11:meMA.Ode8C11.melody
ltx/swh_redirects_oak/me.m07.d11:meMA.Ode8C11.mode	@ltx/swh_ke_oak/me.m07.d11:meMA.Ode8C11.mode
ltx/swh_redirects_oak/me.m07.d11:meMA.Ode8C11.ode	@ltx/swh_ke_oak/me.m07.d11:meMA.Ode8C11.ode
ltx/swh_redirects_oak/me.m07.d11:meMA.Ode8C11.text	@ltx/swh_ke_oak/me.m07.d11:meMA.Ode8C11.text
ltx/swh_redirects_oak/me.m07.d11:meMA.Ode8C12.incipit	@ltx/swh_ke_oak/me.m07.d11:meMA.Ode8C12.incipit
ltx/swh_redirects_oak/me.m07.d11:meMA.Ode8C12.melody	@ltx/swh_ke_oak/me.m07.d11:meMA.Ode8C12.melody
ltx/swh_redirects_oak/me.m07.d11:meMA.Ode8C12.mode	@ltx/swh_ke_oak/me.m07.d11:meMA.Ode8C12.mode
ltx/swh_redirects_oak/me.m07.d11:meMA.Ode8C12.ode	@ltx/swh_ke_oak/me.m07.d11:meMA.Ode8C12.ode
ltx/swh_redirects_oak/me.m07.d11:meMA.Ode8C12.text	@ltx/swh_ke_oak/me.m07.d11:meMA.Ode8C12.text
ltx/swh_redirects_oak/me.m07.d11:meMA.Ode8C13.incipit	@ltx/swh_ke_oak/me.m07.d11:meMA.Ode8C13.incipit
ltx/swh_redirects_oak/me.m07.d11:meMA.Ode8C13.melody	@ltx/swh_ke_oak/me.m07.d11:meMA.Ode8C13.melody
ltx/swh_redirects_oak/me.m07.d11:meMA.Ode8C13.mode	@ltx/swh_ke_oak/me.m07.d11:meMA.Ode8C13.mode
ltx/swh_redirects_oak/me.m07.d11:meMA.Ode8C13.ode	@ltx/swh_ke_oak/me.m07.d11:meMA.Ode8C13.ode
ltx/swh_redirects_oak/me.m07.d11:meMA.Ode8C13.text	@ltx/swh_ke_oak/me.m07.d11:meMA.Ode8C13.text
ltx/swh_redirects_oak/me.m07.d11:meMA.Ode8C1T.incipit	@ltx/swh_ke_oak/me.m07.d11:meMA.Ode8C1T.incipit
ltx/swh_redirects_oak/me.m07.d11:meMA.Ode8C1T.melody	@ltx/swh_ke_oak/me.m07.d11:meMA.Ode8C1T.melody
ltx/swh_redirects_oak/me.m07.d11:meMA.Ode8C1T.mode	@ltx/swh_ke_oak/me.m07.d11:meMA.Ode8C1T.mode
ltx/swh_redirects_oak/me.m07.d11:meMA.Ode8C1T.ode	@ltx/swh_ke_oak/me.m07.d11:meMA.Ode8C1T.ode
ltx/swh_redirects_oak/me.m07.d11:meMA.Ode8C1T.text	@ltx/swh_ke_oak/me.m07.d11:meMA.Ode8C1T.text
ltx/swh_redirects_oak/me.m07.d11:meMA.Ode9C11.greekmelody	@ltx/swh_ke_oak/me.m07.d11:meMA.Ode9C11.greekmelody
ltx/swh_redirects_oak/me.m07.d11:meMA.Ode9C11.incipit	@ltx/swh_ke_oak/me.m07.d11:meMA.Ode9C11.incipit
ltx/swh_redirects_oak/me.m07.d11:meMA.Ode9C11.melody	@ltx/swh_ke_oak/me.m07.d11:meMA.Ode9C11.melody
ltx/swh_redirects_oak/me.m07.d11:meMA.Ode9C11.mode	@ltx/swh_ke_oak/me.m07.d11:meMA.Ode9C11.mode
ltx/swh_redirects_oak/me.m07.d11:meMA.Ode9C11.ode	@ltx/swh_ke_oak/me.m07.d11:meMA.Ode9C11.ode
ltx/swh_redirects_oak/me.m07.d11:meMA.Ode9C11.text	@ltx/swh_ke_oak/me.m07.d11:meMA.Ode9C11.text
ltx/swh_redirects_oak/me.m07.d11:meMA.Ode9C12.incipit	@ltx/swh_ke_oak/me.m07.d11:meMA.Ode9C12.incipit
ltx/swh_redirects_oak/me.m07.d11:meMA.Ode9C12.melody	@ltx/swh_ke_oak/me.m07.d11:meMA.Ode9C12.melody
ltx/swh_redirects_oak/me.m07.d11:meMA.Ode9C12.mode	@ltx/swh_ke_oak/me.m07.d11:meMA.Ode9C12.mode
ltx/swh_redirects_oak/me.m07.d11:meMA.Ode9C12.ode	@ltx/swh_ke_oak/me.m07.d11:meMA.Ode9C12.ode
ltx/swh_redirects_oak/me.m07.d11:meMA.Ode9C12.text	@ltx/swh_ke_oak/me.m07.d11:meMA.Ode9C12.text
ltx/swh_redirects_oak/me.m07.d11:meMA.Ode9C13.incipit	@ltx/swh_ke_oak/me.m07.d11:meMA.Ode9C13.incipit
ltx/swh_redirects_oak/me.m07.d11:meMA.Ode9C13.melody	@ltx/swh_ke_oak/me.m07.d11:meMA.Ode9C13.melody
ltx/swh_redirects_oak/me.m07.d11:meMA.Ode9C13.mode	@ltx/swh_ke_oak/me.m07.d11:meMA.Ode9C13.mode
ltx/swh_redirects_oak/me.m07.d11:meMA.Ode9C13.ode	@ltx/swh_ke_oak/me.m07.d11:meMA.Ode9C13.ode
ltx/swh_redirects_oak/me.m07.d11:meMA.Ode9C13.text	@ltx/swh_ke_oak/me.m07.d11:meMA.Ode9C13.text
ltx/swh_redirects_oak/me.m07.d11:meMA.Ode9C14.incipit	@ltx/swh_ke_oak/me.m07.d11:meMA.Ode9C14.incipit
ltx/swh_redirects_oak/me.m07.d11:meMA.Ode9C14.melody	@ltx/swh_ke_oak/me.m07.d11:meMA.Ode9C14.melody
ltx/swh_redirects_oak/me.m07.d11:meMA.Ode9C14.mode	@ltx/swh_ke_oak/me.m07.d11:meMA.Ode9C14.mode
ltx/swh_redirects_oak/me.m07.d11:meMA.Ode9C14.ode	@ltx/swh_ke_oak/me.m07.d11:meMA.Ode9C14.ode
ltx/swh_redirects_oak/me.m07.d11:meMA.Ode9C14.text	@ltx/swh_ke_oak/me.m07.d11:meMA.Ode9C14.text
ltx/swh_redirects_oak/me.m07.d11:meMA.Ode9C1T.incipit	@ltx/swh_ke_oak/me.m07.d11:meMA.Ode9C1T.incipit
ltx/swh_redirects_oak/me.m07.d11:meMA.Ode9C1T.melody	@ltx/swh_ke_oak/me.m07.d11:meMA.Ode9C1T.melody
ltx/swh_redirects_oak/me.m07.d11:meMA.Ode9C1T.mode	@ltx/swh_ke_oak/me.m07.d11:meMA.Ode9C1T.mode
ltx/swh_redirects_oak/me.m07.d11:meMA.Ode9C1T.ode	@ltx/swh_ke_oak/me.m07.d11:meMA.Ode9C1T.ode
ltx/swh_redirects_oak/me.m07.d11:meMA.Ode9C1T.text	@ltx/swh_ke_oak/me.m07.d11:meMA.Ode9C1T.text
ltx/swh_redirects_oak/me.m07.d11:meMA.Oikos1.text	@ltx/swh_ke_oak/me.m07.d11:meMA.Oikos1.text
ltx/swh_redirects_oak/me.m07.d11:meMA.PostGospelBoth.incipit	@ltx/swh_ke_oak/me.m07.d11:meMA.PostGospelBoth.incipit
ltx/swh_redirects_oak/me.m07.d11:meMA.PostGospelBoth.melody	@ltx/swh_ke_oak/me.m07.d11:meMA.PostGospelBoth.melody
ltx/swh_redirects_oak/me.m07.d11:meMA.PostGospelBoth.mode	@ltx/swh_ke_oak/me.m07.d11:meMA.PostGospelBoth.mode
ltx/swh_redirects_oak/me.m07.d11:meMA.PostGospelBoth.text	@ltx/swh_ke_oak/me.m07.d11:meMA.PostGospelBoth.text
ltx/swh_redirects_oak/me.m07.d11:meMA.PostGospelGlory.incipit	@ltx/swh_ke_oak/me.m07.d11:meMA.PostGospelGlory.incipit
ltx/swh_redirects_oak/me.m07.d11:meMA.PostGospelGlory.melody	@ltx/swh_ke_oak/me.m07.d11:meMA.PostGospelGlory.melody
ltx/swh_redirects_oak/me.m07.d11:meMA.PostGospelGlory.mode	@ltx/swh_ke_oak/me.m07.d11:meMA.PostGospelGlory.mode
ltx/swh_redirects_oak/me.m07.d11:meMA.PostGospelGlory.text	@ltx/swh_ke_oak/me.m07.d11:meMA.PostGospelGlory.text
ltx/swh_redirects_oak/me.m07.d11:meMA.PostGospelIdiomelon.incipit	@ltx/swh_ke_oak/me.m07.d11:meMA.PostGospelIdiomelon.incipit
ltx/swh_redirects_oak/me.m07.d11:meMA.PostGospelIdiomelon.melody	@ltx/swh_ke_oak/me.m07.d11:meMA.PostGospelIdiomelon.melody
ltx/swh_redirects_oak/me.m07.d11:meMA.PostGospelIdiomelon.mode	@ltx/swh_ke_oak/me.m07.d11:meMA.PostGospelIdiomelon.mode
ltx/swh_redirects_oak/me.m07.d11:meMA.PostGospelIdiomelon.text	@ltx/swh_ke_oak/me.m07.d11:meMA.PostGospelIdiomelon.text
ltx/swh_redirects_oak/me.m07.d11:meTY.note1	@ltx/swh_ke_oak/me.m07.d11:meTY.note1
ltx/swh_redirects_oak/me.m07.d11:meVE.Apolytikion1.greekmelody	@ltx/swh_ke_oak/me.m07.d11:meVE.Apolytikion1.greekmelody
ltx/swh_redirects_oak/me.m07.d11:meVE.Apolytikion1.incipit	@ltx/swh_ke_oak/me.m07.d11:meVE.Apolytikion1.incipit
ltx/swh_redirects_oak/me.m07.d11:meVE.Apolytikion1.melody	@ltx/swh_ke_oak/me.m07.d11:meVE.Apolytikion1.melody
ltx/swh_redirects_oak/me.m07.d11:meVE.Apolytikion1.mode	@ltx/swh_ke_oak/me.m07.d11:meVE.Apolytikion1.mode
ltx/swh_redirects_oak/me.m07.d11:meVE.Apolytikion1.text	@ltx/swh_ke_oak/me.m07.d11:meVE.Apolytikion1.text
ltx/swh_redirects_oak/me.m07.d11:meVE.AposGlory.incipit	@ltx/swh_ke_oak/me.m07.d11:meVE.AposGlory.incipit
ltx/swh_redirects_oak/me.m07.d11:meVE.AposGlory.melody	@ltx/swh_ke_oak/me.m07.d11:meVE.AposGlory.melody
ltx/swh_redirects_oak/me.m07.d11:meVE.AposGlory.mode	@ltx/swh_ke_oak/me.m07.d11:meVE.AposGlory.mode
ltx/swh_redirects_oak/me.m07.d11:meVE.AposGlory.text	@ltx/swh_ke_oak/me.m07.d11:meVE.AposGlory.text
ltx/swh_redirects_oak/me.m07.d11:meVE.AposTheotokion.incipit	@ltx/swh_ke_oak/me.m07.d11:meVE.AposTheotokion.incipit
ltx/swh_redirects_oak/me.m07.d11:meVE.AposTheotokion.melody	@ltx/swh_ke_oak/me.m07.d11:meVE.AposTheotokion.melody
ltx/swh_redirects_oak/me.m07.d11:meVE.AposTheotokion.mode	@ltx/swh_ke_oak/me.m07.d11:meVE.AposTheotokion.mode
ltx/swh_redirects_oak/me.m07.d11:meVE.AposTheotokion.text	@ltx/swh_ke_oak/me.m07.d11:meVE.AposTheotokion.text
ltx/swh_redirects_oak/me.m07.d11:meVE.Aposticha1.greekmelody	@ltx/swh_ke_oak/me.m07.d11:meVE.Aposticha1.greekmelody
ltx/swh_redirects_oak/me.m07.d11:meVE.Aposticha1.incipit	@ltx/swh_ke_oak/me.m07.d11:meVE.Aposticha1.incipit
ltx/swh_redirects_oak/me.m07.d11:meVE.Aposticha1.melody	@ltx/swh_ke_oak/me.m07.d11:meVE.Aposticha1.melody
ltx/swh_redirects_oak/me.m07.d11:meVE.Aposticha1.mode	@ltx/swh_ke_oak/me.m07.d11:meVE.Aposticha1.mode
ltx/swh_redirects_oak/me.m07.d11:meVE.Aposticha1.text	@ltx/swh_ke_oak/me.m07.d11:meVE.Aposticha1.text
ltx/swh_redirects_oak/me.m07.d11:meVE.Aposticha2.incipit	@ltx/swh_ke_oak/me.m07.d11:meVE.Aposticha2.incipit
ltx/swh_redirects_oak/me.m07.d11:meVE.Aposticha2.melody	@ltx/swh_ke_oak/me.m07.d11:meVE.Aposticha2.melody
ltx/swh_redirects_oak/me.m07.d11:meVE.Aposticha2.mode	@ltx/swh_ke_oak/me.m07.d11:meVE.Aposticha2.mode
ltx/swh_redirects_oak/me.m07.d11:meVE.Aposticha2.text	@ltx/swh_ke_oak/me.m07.d11:meVE.Aposticha2.text
ltx/swh_redirects_oak/me.m07.d11:meVE.Aposticha3.incipit	@ltx/swh_ke_oak/me.m07.d11:meVE.Aposticha3.incipit
ltx/swh_redirects_oak/me.m07.d11:meVE.Aposticha3.melody	@ltx/swh_ke_oak/me.m07.d11:meVE.Aposticha3.melody
ltx/swh_redirects_oak/me.m07.d11:meVE.Aposticha3.mode	@ltx/swh_ke_oak/me.m07.d11:meVE.Aposticha3.mode
ltx/swh_redirects_oak/me.m07.d11:meVE.Aposticha3.text	@ltx/swh_ke_oak/me.m07.d11:meVE.Aposticha3.text
ltx/swh_redirects_oak/me.m07.d11:meVE.Lity1.incipit	@ltx/swh_ke_oak/me.m07.d11:meVE.Lity1.incipit
ltx/swh_redirects_oak/me.m07.d11:meVE.Lity1.melody	@ltx/swh_ke_oak/me.m07.d11:meVE.Lity1.melody
ltx/swh_redirects_oak/me.m07.d11:meVE.Lity1.mode	@ltx/swh_ke_oak/me.m07.d11:meVE.Lity1.mode
ltx/swh_redirects_oak/me.m07.d11:meVE.Lity1.text	@ltx/swh_ke_oak/me.m07.d11:meVE.Lity1.text
ltx/swh_redirects_oak/me.m07.d11:meVE.Lity2.incipit	@ltx/swh_ke_oak/me.m07.d11:meVE.Lity2.incipit
ltx/swh_redirects_oak/me.m07.d11:meVE.Lity2.melody	@ltx/swh_ke_oak/me.m07.d11:meVE.Lity2.melody
ltx/swh_redirects_oak/me.m07.d11:meVE.Lity2.mode	@ltx/swh_ke_oak/me.m07.d11:meVE.Lity2.mode
ltx/swh_redirects_oak/me.m07.d11:meVE.Lity2.text	@ltx/swh_ke_oak/me.m07.d11:meVE.Lity2.text
ltx/swh_redirects_oak/me.m07.d11:meVE.Lity3.incipit	@ltx/swh_ke_oak/me.m07.d11:meVE.Lity3.incipit
ltx/swh_redirects_oak/me.m07.d11:meVE.Lity3.melody	@ltx/swh_ke_oak/me.m07.d11:meVE.Lity3.melody
ltx/swh_redirects_oak/me.m07.d11:meVE.Lity3.mode	@ltx/swh_ke_oak/me.m07.d11:meVE.Lity3.mode
ltx/swh_redirects_oak/me.m07.d11:meVE.Lity3.text	@ltx/swh_ke_oak/me.m07.d11:meVE.Lity3.text
ltx/swh_redirects_oak/me.m07.d11:meVE.Lity4.incipit	@ltx/swh_ke_oak/me.m07.d11:meVE.Lity4.incipit
ltx/swh_redirects_oak/me.m07.d11:meVE.Lity4.melody	@ltx/swh_ke_oak/me.m07.d11:meVE.Lity4.melody
ltx/swh_redirects_oak/me.m07.d11:meVE.Lity4.mode	@ltx/swh_ke_oak/me.m07.d11:meVE.Lity4.mode
ltx/swh_redirects_oak/me.m07.d11:meVE.Lity4.text	@ltx/swh_ke_oak/me.m07.d11:meVE.Lity4.text
ltx/swh_redirects_oak/me.m07.d11:meVE.LityBoth.incipit	@ltx/swh_ke_oak/me.m07.d11:meVE.LityBoth.incipit
ltx/swh_redirects_oak/me.m07.d11:meVE.LityBoth.melody	@ltx/swh_ke_oak/me.m07.d11:meVE.LityBoth.melody
ltx/swh_redirects_oak/me.m07.d11:meVE.LityBoth.mode	@ltx/swh_ke_oak/me.m07.d11:meVE.LityBoth.mode
ltx/swh_redirects_oak/me.m07.d11:meVE.LityBoth.text	@ltx/swh_ke_oak/me.m07.d11:meVE.LityBoth.text
ltx/swh_redirects_oak/me.m07.d11:meVE.LityGlory.incipit	@ltx/swh_ke_oak/me.m07.d11:meVE.LityGlory.incipit
ltx/swh_redirects_oak/me.m07.d11:meVE.LityGlory.melody	@ltx/swh_ke_oak/me.m07.d11:meVE.LityGlory.melody
ltx/swh_redirects_oak/me.m07.d11:meVE.LityGlory.mode	@ltx/swh_ke_oak/me.m07.d11:meVE.LityGlory.mode
ltx/swh_redirects_oak/me.m07.d11:meVE.LityGlory.text	@ltx/swh_ke_oak/me.m07.d11:meVE.LityGlory.text
ltx/swh_redirects_oak/me.m07.d11:meVE.SticGlory.incipit	@ltx/swh_ke_oak/me.m07.d11:meVE.SticGlory.incipit
ltx/swh_redirects_oak/me.m07.d11:meVE.SticGlory.melody	@ltx/swh_ke_oak/me.m07.d11:meVE.SticGlory.melody
ltx/swh_redirects_oak/me.m07.d11:meVE.SticGlory.mode	@ltx/swh_ke_oak/me.m07.d11:meVE.SticGlory.mode
ltx/swh_redirects_oak/me.m07.d11:meVE.SticGlory.text	@ltx/swh_ke_oak/me.m07.d11:meVE.SticGlory.text
ltx/swh_redirects_oak/me.m07.d11:meVE.SticTheotokion.incipit	@ltx/swh_ke_oak/me.m07.d11:meVE.SticTheotokion.incipit
ltx/swh_redirects_oak/me.m07.d11:meVE.SticTheotokion.melody	@ltx/swh_ke_oak/me.m07.d11:meVE.SticTheotokion.melody
ltx/swh_redirects_oak/me.m07.d11:meVE.SticTheotokion.mode	@ltx/swh_ke_oak/me.m07.d11:meVE.SticTheotokion.mode
ltx/swh_redirects_oak/me.m07.d11:meVE.SticTheotokion.text	@ltx/swh_ke_oak/me.m07.d11:meVE.SticTheotokion.text
ltx/swh_redirects_oak/me.m07.d11:meVE.Stichera01.greekmelody	@ltx/swh_ke_oak/me.m07.d11:meVE.Stichera01.greekmelody
ltx/swh_redirects_oak/me.m07.d11:meVE.Stichera01.incipit	@ltx/swh_ke_oak/me.m07.d11:meVE.Stichera01.incipit
ltx/swh_redirects_oak/me.m07.d11:meVE.Stichera01.melody	@ltx/swh_ke_oak/me.m07.d11:meVE.Stichera01.melody
ltx/swh_redirects_oak/me.m07.d11:meVE.Stichera01.mode	@ltx/swh_ke_oak/me.m07.d11:meVE.Stichera01.mode
ltx/swh_redirects_oak/me.m07.d11:meVE.Stichera01.text	@ltx/swh_ke_oak/me.m07.d11:meVE.Stichera01.text
ltx/swh_redirects_oak/me.m07.d11:meVE.Stichera02.incipit	@ltx/swh_ke_oak/me.m07.d11:meVE.Stichera02.incipit
ltx/swh_redirects_oak/me.m07.d11:meVE.Stichera02.melody	@ltx/swh_ke_oak/me.m07.d11:meVE.Stichera02.melody
ltx/swh_redirects_oak/me.m07.d11:meVE.Stichera02.mode	@ltx/swh_ke_oak/me.m07.d11:meVE.Stichera02.mode
ltx/swh_redirects_oak/me.m07.d11:meVE.Stichera02.text	@ltx/swh_ke_oak/me.m07.d11:meVE.Stichera02.text
ltx/swh_redirects_oak/me.m07.d11:meVE.Stichera03.incipit	@ltx/swh_ke_oak/me.m07.d11:meVE.Stichera03.incipit
ltx/swh_redirects_oak/me.m07.d11:meVE.Stichera03.melody	@ltx/swh_ke_oak/me.m07.d11:meVE.Stichera03.melody
ltx/swh_redirects_oak/me.m07.d11:meVE.Stichera03.mode	@ltx/swh_ke_oak/me.m07.d11:meVE.Stichera03.mode
ltx/swh_redirects_oak/me.m07.d11:meVE.Stichera03.text	@ltx/swh_ke_oak/me.m07.d11:meVE.Stichera03.text
ltx/swh_redirects_oak/me.m07.d11:meVE.Stichera04.greekmelody	@ltx/swh_ke_oak/me.m07.d11:meVE.Stichera04.greekmelody
ltx/swh_redirects_oak/me.m07.d11:meVE.Stichera04.incipit	@ltx/swh_ke_oak/me.m07.d11:meVE.Stichera04.incipit
ltx/swh_redirects_oak/me.m07.d11:meVE.Stichera04.melody	@ltx/swh_ke_oak/me.m07.d11:meVE.Stichera04.melody
ltx/swh_redirects_oak/me.m07.d11:meVE.Stichera04.mode	@ltx/swh_ke_oak/me.m07.d11:meVE.Stichera04.mode
ltx/swh_redirects_oak/me.m07.d11:meVE.Stichera04.text	@ltx/swh_ke_oak/me.m07.d11:meVE.Stichera04.text
ltx/swh_redirects_oak/me.m07.d11:meVE.Stichera05.incipit	@ltx/swh_ke_oak/me.m07.d11:meVE.Stichera05.incipit
ltx/swh_redirects_oak/me.m07.d11:meVE.Stichera05.melody	@ltx/swh_ke_oak/me.m07.d11:meVE.Stichera05.melody
ltx/swh_redirects_oak/me.m07.d11:meVE.Stichera05.mode	@ltx/swh_ke_oak/me.m07.d11:meVE.Stichera05.mode
ltx/swh_redirects_oak/me.m07.d11:meVE.Stichera05.text	@ltx/swh_ke_oak/me.m07.d11:meVE.Stichera05.text
ltx/swh_redirects_oak/me.m07.d11:meVE.Stichera06.incipit	@ltx/swh_ke_oak/me.m07.d11:meVE.Stichera06.incipit
ltx/swh_redirects_oak/me.m07.d11:meVE.Stichera06.melody	@ltx/swh_ke_oak/me.m07.d11:meVE.Stichera06.melody
ltx/swh_redirects_oak/me.m07.d11:meVE.Stichera06.mode	@ltx/swh_ke_oak/me.m07.d11:meVE.Stichera06.mode
ltx/swh_redirects_oak/me.m07.d11:meVE.Stichera06.text	@ltx/swh_ke_oak/me.m07.d11:meVE.Stichera06.text
