ltx/swh_redirects_oak/ho.ho10:R01	@ltx/swh_ke_oak/ho.ho10:R01
ltx/swh_redirects_oak/ho.ho10:R02	@ltx/swh_ke_oak/ho.ho10:R02
ltx/swh_redirects_oak/ho.ho10:R03	@ltx/swh_ke_oak/ho.ho10:R03
ltx/swh_redirects_oak/ho.ho10:R04	@ltx/swh_ke_oak/ho.ho10:R04
ltx/swh_redirects_oak/ho.ho10:R05	@ltx/swh_ke_oak/ho.ho10:R05
ltx/swh_redirects_oak/ho.ho10:R06	@ltx/swh_ke_oak/ho.ho10:R06
ltx/swh_redirects_oak/ho.ho10:R07	@ltx/swh_ke_oak/ho.ho10:R07
ltx/swh_redirects_oak/ho.ho10:R08	@ltx/swh_ke_oak/ho.ho10:R08
ltx/swh_redirects_oak/ho.ho10:R09	@ltx/swh_ke_oak/ho.ho10:R09
ltx/swh_redirects_oak/ho.ho10:R10	@ltx/swh_ke_oak/ho.ho10:R10
ltx/swh_redirects_oak/ho.ho10:R11	@ltx/swh_ke_oak/ho.ho10:R11
ltx/swh_redirects_oak/ho.ho10:R12	@ltx/swh_ke_oak/ho.ho10:R12
ltx/swh_redirects_oak/ho.ho10:R13	@ltx/swh_ke_oak/ho.ho10:R13
ltx/swh_redirects_oak/ho.ho10:R14	@ltx/swh_ke_oak/ho.ho10:R14
ltx/swh_redirects_oak/ho.ho10:R15	@ltx/swh_ke_oak/ho.ho10:R15
ltx/swh_redirects_oak/ho.ho10:R16	@ltx/swh_ke_oak/ho.ho10:R16
ltx/swh_redirects_oak/ho.ho10:R17	@ltx/swh_ke_oak/ho.ho10:R17
ltx/swh_redirects_oak/ho.ho10:R18	@ltx/swh_ke_oak/ho.ho10:R18
ltx/swh_redirects_oak/ho.ho10:R19	@ltx/swh_ke_oak/ho.ho10:R19
ltx/swh_redirects_oak/ho.ho10:R20	@ltx/swh_ke_oak/ho.ho10:R20
ltx/swh_redirects_oak/ho.ho10:R21	@ltx/swh_ke_oak/ho.ho10:R21
ltx/swh_redirects_oak/ho.ho10:R22	@ltx/swh_ke_oak/ho.ho10:R22
ltx/swh_redirects_oak/ho.ho10:R23	@ltx/swh_ke_oak/ho.ho10:R23
ltx/swh_redirects_oak/ho.ho10:R24	@ltx/swh_ke_oak/ho.ho10:R24
ltx/swh_redirects_oak/ho.ho10:R25	@ltx/swh_ke_oak/ho.ho10:R25
ltx/swh_redirects_oak/ho.ho10:R26	@ltx/swh_ke_oak/ho.ho10:R26
ltx/swh_redirects_oak/ho.ho10:hoVE.FosIlaron.incipit	@ltx/swh_ke_oak/ho.ho10:hoVE.FosIlaron.incipit
ltx/swh_redirects_oak/ho.ho10:hoVE.FosIlaron.text	@ltx/swh_ke_oak/ho.ho10:hoVE.FosIlaron.text
ltx/swh_redirects_oak/ho.ho10:hoVE.FosIlaron.title	@ltx/swh_ke_oak/ho.ho10:hoVE.FosIlaron.title
ltx/swh_redirects_oak/ho.ho10:hoVE.FridayAlleluia.text	@ltx/swh_ke_oak/ho.ho10:hoVE.FridayAlleluia.text
ltx/swh_redirects_oak/ho.ho10:hoVE.FridayAlleluia.title	@ltx/swh_ke_oak/ho.ho10:hoVE.FridayAlleluia.title
ltx/swh_redirects_oak/ho.ho10:hoVE.FridayEvening.title	@ltx/swh_ke_oak/ho.ho10:hoVE.FridayEvening.title
ltx/swh_redirects_oak/ho.ho10:hoVE.LentApolytikion1.incipit	@ltx/swh_ke_oak/ho.ho10:hoVE.LentApolytikion1.incipit
ltx/swh_redirects_oak/ho.ho10:hoVE.LentApolytikion1.mode	@ltx/swh_ke_oak/ho.ho10:hoVE.LentApolytikion1.mode
ltx/swh_redirects_oak/ho.ho10:hoVE.LentApolytikion1.text	@ltx/swh_ke_oak/ho.ho10:hoVE.LentApolytikion1.text
ltx/swh_redirects_oak/ho.ho10:hoVE.LentApolytikion2.incipit	@ltx/swh_ke_oak/ho.ho10:hoVE.LentApolytikion2.incipit
ltx/swh_redirects_oak/ho.ho10:hoVE.LentApolytikion2.mode	@ltx/swh_ke_oak/ho.ho10:hoVE.LentApolytikion2.mode
ltx/swh_redirects_oak/ho.ho10:hoVE.LentApolytikion2.text	@ltx/swh_ke_oak/ho.ho10:hoVE.LentApolytikion2.text
ltx/swh_redirects_oak/ho.ho10:hoVE.LentApolytikion3.incipit	@ltx/swh_ke_oak/ho.ho10:hoVE.LentApolytikion3.incipit
ltx/swh_redirects_oak/ho.ho10:hoVE.LentApolytikion3.mode	@ltx/swh_ke_oak/ho.ho10:hoVE.LentApolytikion3.mode
ltx/swh_redirects_oak/ho.ho10:hoVE.LentApolytikion3.text	@ltx/swh_ke_oak/ho.ho10:hoVE.LentApolytikion3.text
ltx/swh_redirects_oak/ho.ho10:hoVE.LentApolytikion4.incipit	@ltx/swh_ke_oak/ho.ho10:hoVE.LentApolytikion4.incipit
ltx/swh_redirects_oak/ho.ho10:hoVE.LentApolytikion4.mode	@ltx/swh_ke_oak/ho.ho10:hoVE.LentApolytikion4.mode
ltx/swh_redirects_oak/ho.ho10:hoVE.LentApolytikion4.note	@ltx/swh_ke_oak/ho.ho10:hoVE.LentApolytikion4.note
ltx/swh_redirects_oak/ho.ho10:hoVE.LentApolytikion4.text	@ltx/swh_ke_oak/ho.ho10:hoVE.LentApolytikion4.text
ltx/swh_redirects_oak/ho.ho10:hoVE.MM.Anoixantaria.text	@ltx/swh_ke_oak/ho.ho10:hoVE.MM.Anoixantaria.text
ltx/swh_redirects_oak/ho.ho10:hoVE.MM.BrightFridayEveningProkeimenon.text	@ltx/swh_ke_oak/ho.ho10:hoVE.MM.BrightFridayEveningProkeimenon.text
ltx/swh_redirects_oak/ho.ho10:hoVE.MM.BrightMondayEveningProkeimenon.text	@ltx/swh_ke_oak/ho.ho10:hoVE.MM.BrightMondayEveningProkeimenon.text
ltx/swh_redirects_oak/ho.ho10:hoVE.MM.BrightThursdayEveningProkeimenon.text	@ltx/swh_ke_oak/ho.ho10:hoVE.MM.BrightThursdayEveningProkeimenon.text
ltx/swh_redirects_oak/ho.ho10:hoVE.MM.BrightTuesdayEveningProkeimenon.text	@ltx/swh_ke_oak/ho.ho10:hoVE.MM.BrightTuesdayEveningProkeimenon.text
ltx/swh_redirects_oak/ho.ho10:hoVE.MM.BrightWednesdayEveningProkeimenon.text	@ltx/swh_ke_oak/ho.ho10:hoVE.MM.BrightWednesdayEveningProkeimenon.text
ltx/swh_redirects_oak/ho.ho10:hoVE.MM.EasterSundayEveningProkeimenon.text	
ltx/swh_redirects_oak/ho.ho10:hoVE.MM.FridayProkeimenon.text	@ltx/swh_ke_oak/ho.ho10:hoVE.MM.FridayProkeimenon.text
ltx/swh_redirects_oak/ho.ho10:hoVE.MM.GoodFridayProkeimenon.text	@ltx/swh_ke_oak/ho.ho10:hoVE.MM.GoodFridayProkeimenon.text
ltx/swh_redirects_oak/ho.ho10:hoVE.MM.GreatProkeimenonLent1.text	@ltx/swh_ke_oak/ho.ho10:hoVE.MM.GreatProkeimenonLent1.text
ltx/swh_redirects_oak/ho.ho10:hoVE.MM.GreatProkeimenonLent2.text	@ltx/swh_ke_oak/ho.ho10:hoVE.MM.GreatProkeimenonLent2.text
ltx/swh_redirects_oak/ho.ho10:hoVE.MM.GreatProkeimenonOTheosImon.text	@ltx/swh_ke_oak/ho.ho10:hoVE.MM.GreatProkeimenonOTheosImon.text
ltx/swh_redirects_oak/ho.ho10:hoVE.MM.GreatProkeimenonTisTheosMegas.text	@ltx/swh_ke_oak/ho.ho10:hoVE.MM.GreatProkeimenonTisTheosMegas.text
ltx/swh_redirects_oak/ho.ho10:hoVE.MM.Kathisma11.selection01.text	@ltx/swh_ke_oak/ho.ho10:hoVE.MM.Kathisma11.selection01.text
ltx/swh_redirects_oak/ho.ho10:hoVE.MM.Kathisma11.text	@ltx/swh_ke_oak/ho.ho10:hoVE.MM.Kathisma11.text
ltx/swh_redirects_oak/ho.ho10:hoVE.MM.LityKyrieEleison.text	@ltx/swh_ke_oak/ho.ho10:hoVE.MM.LityKyrieEleison.text
ltx/swh_redirects_oak/ho.ho10:hoVE.MM.LoavesHymn1_Theotokos.text	@ltx/swh_ke_oak/ho.ho10:hoVE.MM.LoavesHymn1_Theotokos.text
ltx/swh_redirects_oak/ho.ho10:hoVE.MM.LoavesHymn2_ps33v11.text	@ltx/swh_ke_oak/ho.ho10:hoVE.MM.LoavesHymn2_ps33v11.text
ltx/swh_redirects_oak/ho.ho10:hoVE.MM.MondayProkeimenon.text	@ltx/swh_ke_oak/ho.ho10:hoVE.MM.MondayProkeimenon.text
ltx/swh_redirects_oak/ho.ho10:hoVE.MM.SaturdayProkeimenon.text	@ltx/swh_ke_oak/ho.ho10:hoVE.MM.SaturdayProkeimenon.text
ltx/swh_redirects_oak/ho.ho10:hoVE.MM.SundayProkeimenon.text	@ltx/swh_ke_oak/ho.ho10:hoVE.MM.SundayProkeimenon.text
ltx/swh_redirects_oak/ho.ho10:hoVE.MM.ThursdayProkeimenon.text	@ltx/swh_ke_oak/ho.ho10:hoVE.MM.ThursdayProkeimenon.text
ltx/swh_redirects_oak/ho.ho10:hoVE.MM.TuesdayProkeimenon.text	@ltx/swh_ke_oak/ho.ho10:hoVE.MM.TuesdayProkeimenon.text
ltx/swh_redirects_oak/ho.ho10:hoVE.MM.WednesdayProkeimenon.text	@ltx/swh_ke_oak/ho.ho10:hoVE.MM.WednesdayProkeimenon.text
ltx/swh_redirects_oak/ho.ho10:hoVE.MondayAlleluia.text	@ltx/swh_ke_oak/ho.ho10:hoVE.MondayAlleluia.text
ltx/swh_redirects_oak/ho.ho10:hoVE.MondayAlleluia.title	@ltx/swh_ke_oak/ho.ho10:hoVE.MondayAlleluia.title
ltx/swh_redirects_oak/ho.ho10:hoVE.MondayEvening.title	@ltx/swh_ke_oak/ho.ho10:hoVE.MondayEvening.title
ltx/swh_redirects_oak/ho.ho10:hoVE.Prayer_Kataxioson.incipit	@ltx/swh_ke_oak/ho.ho10:hoVE.Prayer_Kataxioson.incipit
ltx/swh_redirects_oak/ho.ho10:hoVE.Prayer_Kataxioson.text	@ltx/swh_ke_oak/ho.ho10:hoVE.Prayer_Kataxioson.text
ltx/swh_redirects_oak/ho.ho10:hoVE.Ps103.text	@ltx/swh_ke_oak/ho.ho10:hoVE.Ps103.text
ltx/swh_redirects_oak/ho.ho10:hoVE.SaturdayEvening.title	@ltx/swh_ke_oak/ho.ho10:hoVE.SaturdayEvening.title
ltx/swh_redirects_oak/ho.ho10:hoVE.SundayEvening.title	@ltx/swh_ke_oak/ho.ho10:hoVE.SundayEvening.title
ltx/swh_redirects_oak/ho.ho10:hoVE.ThursdayEvening.title	@ltx/swh_ke_oak/ho.ho10:hoVE.ThursdayEvening.title
ltx/swh_redirects_oak/ho.ho10:hoVE.TuesdayEvening.title	@ltx/swh_ke_oak/ho.ho10:hoVE.TuesdayEvening.title
ltx/swh_redirects_oak/ho.ho10:hoVE.TuesdayThursdayAlleluia.text	@ltx/swh_ke_oak/ho.ho10:hoVE.TuesdayThursdayAlleluia.text
ltx/swh_redirects_oak/ho.ho10:hoVE.TuesdayThursdayAlleluia.title	@ltx/swh_ke_oak/ho.ho10:hoVE.TuesdayThursdayAlleluia.title
ltx/swh_redirects_oak/ho.ho10:hoVE.WednesdayAlleluia.text	@ltx/swh_ke_oak/ho.ho10:hoVE.WednesdayAlleluia.text
ltx/swh_redirects_oak/ho.ho10:hoVE.WednesdayAlleluia.title	@ltx/swh_ke_oak/ho.ho10:hoVE.WednesdayAlleluia.title
ltx/swh_redirects_oak/ho.ho10:hoVE.WednesdayEvening.title	@ltx/swh_ke_oak/ho.ho10:hoVE.WednesdayEvening.title
ltx/swh_redirects_oak/ho.ho10:hoVE.title	@ltx/swh_ke_oak/ho.ho10:hoVE.title
