ltx/swh_redirects_oak/oc.m6.d5:ocBK.ModeNaked	@ltx/swh_ke_oak/oc.m6.d5:ocBK.ModeNaked
ltx/swh_redirects_oak/oc.m6.d5:ocLI.Beatitudes1.incipit	@ltx/swh_ke_oak/oc.m6.d5:ocLI.Beatitudes1.incipit
ltx/swh_redirects_oak/oc.m6.d5:ocLI.Beatitudes1.melody	@ltx/swh_ke_oak/oc.m6.d5:ocLI.Beatitudes1.melody
ltx/swh_redirects_oak/oc.m6.d5:ocLI.Beatitudes1.mode	@ltx/swh_ke_oak/oc.m6.d5:ocLI.Beatitudes1.mode
ltx/swh_redirects_oak/oc.m6.d5:ocLI.Beatitudes1.text	@ltx/swh_ke_oak/oc.m6.d5:ocLI.Beatitudes1.text
ltx/swh_redirects_oak/oc.m6.d5:ocLI.Beatitudes2.incipit	@ltx/swh_ke_oak/oc.m6.d5:ocLI.Beatitudes2.incipit
ltx/swh_redirects_oak/oc.m6.d5:ocLI.Beatitudes2.melody	@ltx/swh_ke_oak/oc.m6.d5:ocLI.Beatitudes2.melody
ltx/swh_redirects_oak/oc.m6.d5:ocLI.Beatitudes2.mode	@ltx/swh_ke_oak/oc.m6.d5:ocLI.Beatitudes2.mode
ltx/swh_redirects_oak/oc.m6.d5:ocLI.Beatitudes2.text	@ltx/swh_ke_oak/oc.m6.d5:ocLI.Beatitudes2.text
ltx/swh_redirects_oak/oc.m6.d5:ocLI.Beatitudes3.incipit	@ltx/swh_ke_oak/oc.m6.d5:ocLI.Beatitudes3.incipit
ltx/swh_redirects_oak/oc.m6.d5:ocLI.Beatitudes3.melody	@ltx/swh_ke_oak/oc.m6.d5:ocLI.Beatitudes3.melody
ltx/swh_redirects_oak/oc.m6.d5:ocLI.Beatitudes3.mode	@ltx/swh_ke_oak/oc.m6.d5:ocLI.Beatitudes3.mode
ltx/swh_redirects_oak/oc.m6.d5:ocLI.Beatitudes3.text	@ltx/swh_ke_oak/oc.m6.d5:ocLI.Beatitudes3.text
ltx/swh_redirects_oak/oc.m6.d5:ocLI.Beatitudes4.incipit	@ltx/swh_ke_oak/oc.m6.d5:ocLI.Beatitudes4.incipit
ltx/swh_redirects_oak/oc.m6.d5:ocLI.Beatitudes4.melody	@ltx/swh_ke_oak/oc.m6.d5:ocLI.Beatitudes4.melody
ltx/swh_redirects_oak/oc.m6.d5:ocLI.Beatitudes4.mode	@ltx/swh_ke_oak/oc.m6.d5:ocLI.Beatitudes4.mode
ltx/swh_redirects_oak/oc.m6.d5:ocLI.Beatitudes4.text	@ltx/swh_ke_oak/oc.m6.d5:ocLI.Beatitudes4.text
ltx/swh_redirects_oak/oc.m6.d5:ocLI.BeatitudesT.incipit	@ltx/swh_ke_oak/oc.m6.d5:ocLI.BeatitudesT.incipit
ltx/swh_redirects_oak/oc.m6.d5:ocLI.BeatitudesT.melody	@ltx/swh_ke_oak/oc.m6.d5:ocLI.BeatitudesT.melody
ltx/swh_redirects_oak/oc.m6.d5:ocLI.BeatitudesT.mode	@ltx/swh_ke_oak/oc.m6.d5:ocLI.BeatitudesT.mode
ltx/swh_redirects_oak/oc.m6.d5:ocLI.BeatitudesT.text	@ltx/swh_ke_oak/oc.m6.d5:ocLI.BeatitudesT.text
ltx/swh_redirects_oak/oc.m6.d5:ocLI.BeatitudesTr.incipit	@ltx/swh_ke_oak/oc.m6.d5:ocLI.BeatitudesTr.incipit
ltx/swh_redirects_oak/oc.m6.d5:ocLI.BeatitudesTr.melody	@ltx/swh_ke_oak/oc.m6.d5:ocLI.BeatitudesTr.melody
ltx/swh_redirects_oak/oc.m6.d5:ocLI.BeatitudesTr.mode	@ltx/swh_ke_oak/oc.m6.d5:ocLI.BeatitudesTr.mode
ltx/swh_redirects_oak/oc.m6.d5:ocLI.BeatitudesTr.text	@ltx/swh_ke_oak/oc.m6.d5:ocLI.BeatitudesTr.text
ltx/swh_redirects_oak/oc.m6.d5:ocLI.MM.Beatitudes1234TrTas78910GB.text	@ltx/swh_ke_oak/oc.m6.d5:ocLI.MM.Beatitudes1234TrTas78910GB.text
ltx/swh_redirects_oak/oc.m6.d5:ocMA.ApolTheotokion.incipit	@ltx/swh_ke_oak/oc.m6.d5:ocMA.ApolTheotokion.incipit
ltx/swh_redirects_oak/oc.m6.d5:ocMA.ApolTheotokion.melody	@ltx/swh_ke_oak/oc.m6.d5:ocMA.ApolTheotokion.melody
ltx/swh_redirects_oak/oc.m6.d5:ocMA.ApolTheotokion.mode	@ltx/swh_ke_oak/oc.m6.d5:ocMA.ApolTheotokion.mode
ltx/swh_redirects_oak/oc.m6.d5:ocMA.ApolTheotokion.text	@ltx/swh_ke_oak/oc.m6.d5:ocMA.ApolTheotokion.text
ltx/swh_redirects_oak/oc.m6.d5:ocMA.AposTheotokion.greekmelody	@ltx/swh_ke_oak/oc.m6.d5:ocMA.AposTheotokion.greekmelody
ltx/swh_redirects_oak/oc.m6.d5:ocMA.AposTheotokion.incipit	@ltx/swh_ke_oak/oc.m6.d5:ocMA.AposTheotokion.incipit
ltx/swh_redirects_oak/oc.m6.d5:ocMA.AposTheotokion.melody	@ltx/swh_ke_oak/oc.m6.d5:ocMA.AposTheotokion.melody
ltx/swh_redirects_oak/oc.m6.d5:ocMA.AposTheotokion.mode	@ltx/swh_ke_oak/oc.m6.d5:ocMA.AposTheotokion.mode
ltx/swh_redirects_oak/oc.m6.d5:ocMA.AposTheotokion.text	@ltx/swh_ke_oak/oc.m6.d5:ocMA.AposTheotokion.text
ltx/swh_redirects_oak/oc.m6.d5:ocMA.Aposticha1.incipit	@ltx/swh_ke_oak/oc.m6.d5:ocMA.Aposticha1.incipit
ltx/swh_redirects_oak/oc.m6.d5:ocMA.Aposticha1.melody	@ltx/swh_ke_oak/oc.m6.d5:ocMA.Aposticha1.melody
ltx/swh_redirects_oak/oc.m6.d5:ocMA.Aposticha1.mode	@ltx/swh_ke_oak/oc.m6.d5:ocMA.Aposticha1.mode
ltx/swh_redirects_oak/oc.m6.d5:ocMA.Aposticha1.text	@ltx/swh_ke_oak/oc.m6.d5:ocMA.Aposticha1.text
ltx/swh_redirects_oak/oc.m6.d5:ocMA.Aposticha2.incipit	@ltx/swh_ke_oak/oc.m6.d5:ocMA.Aposticha2.incipit
ltx/swh_redirects_oak/oc.m6.d5:ocMA.Aposticha2.melody	@ltx/swh_ke_oak/oc.m6.d5:ocMA.Aposticha2.melody
ltx/swh_redirects_oak/oc.m6.d5:ocMA.Aposticha2.mode	@ltx/swh_ke_oak/oc.m6.d5:ocMA.Aposticha2.mode
ltx/swh_redirects_oak/oc.m6.d5:ocMA.Aposticha2.text	@ltx/swh_ke_oak/oc.m6.d5:ocMA.Aposticha2.text
ltx/swh_redirects_oak/oc.m6.d5:ocMA.Aposticha3.incipit	@ltx/swh_ke_oak/oc.m6.d5:ocMA.Aposticha3.incipit
ltx/swh_redirects_oak/oc.m6.d5:ocMA.Aposticha3.melody	@ltx/swh_ke_oak/oc.m6.d5:ocMA.Aposticha3.melody
ltx/swh_redirects_oak/oc.m6.d5:ocMA.Aposticha3.mode	@ltx/swh_ke_oak/oc.m6.d5:ocMA.Aposticha3.mode
ltx/swh_redirects_oak/oc.m6.d5:ocMA.Aposticha3.text	@ltx/swh_ke_oak/oc.m6.d5:ocMA.Aposticha3.text
ltx/swh_redirects_oak/oc.m6.d5:ocMA.C2.acrostic.notice1	@ltx/swh_ke_oak/oc.m6.d5:ocMA.C2.acrostic.notice1
ltx/swh_redirects_oak/oc.m6.d5:ocMA.C2.acrostic.text	@ltx/swh_ke_oak/oc.m6.d5:ocMA.C2.acrostic.text
ltx/swh_redirects_oak/oc.m6.d5:ocMA.C2.acrostic.title	@ltx/swh_ke_oak/oc.m6.d5:ocMA.C2.acrostic.title
ltx/swh_redirects_oak/oc.m6.d5:ocMA.CA.notice	@ltx/swh_ke_oak/rubrical:ru.unavailable.octoechos
ltx/swh_redirects_oak/oc.m6.d5:ocMA.Kathisma11.incipit	@ltx/swh_ke_oak/oc.m6.d5:ocMA.Kathisma11.incipit
ltx/swh_redirects_oak/oc.m6.d5:ocMA.Kathisma11.melody	@ltx/swh_ke_oak/oc.m6.d5:ocMA.Kathisma11.melody
ltx/swh_redirects_oak/oc.m6.d5:ocMA.Kathisma11.mode	@ltx/swh_ke_oak/oc.m6.d5:ocMA.Kathisma11.mode
ltx/swh_redirects_oak/oc.m6.d5:ocMA.Kathisma11.text	@ltx/swh_ke_oak/oc.m6.d5:ocMA.Kathisma11.text
ltx/swh_redirects_oak/oc.m6.d5:ocMA.Kathisma12.greekmelody	@ltx/swh_ke_oak/oc.m6.d5:ocMA.Kathisma12.greekmelody
ltx/swh_redirects_oak/oc.m6.d5:ocMA.Kathisma12.incipit	@ltx/swh_ke_oak/oc.m6.d5:ocMA.Kathisma12.incipit
ltx/swh_redirects_oak/oc.m6.d5:ocMA.Kathisma12.melody	@ltx/swh_ke_oak/oc.m6.d5:ocMA.Kathisma12.melody
ltx/swh_redirects_oak/oc.m6.d5:ocMA.Kathisma12.mode	@ltx/swh_ke_oak/oc.m6.d5:ocMA.Kathisma12.mode
ltx/swh_redirects_oak/oc.m6.d5:ocMA.Kathisma12.text	@ltx/swh_ke_oak/oc.m6.d5:ocMA.Kathisma12.text
ltx/swh_redirects_oak/oc.m6.d5:ocMA.Kathisma13.incipit	@ltx/swh_ke_oak/oc.m6.d5:ocMA.Kathisma13.incipit
ltx/swh_redirects_oak/oc.m6.d5:ocMA.Kathisma13.melody	@ltx/swh_ke_oak/oc.m6.d5:ocMA.Kathisma13.melody
ltx/swh_redirects_oak/oc.m6.d5:ocMA.Kathisma13.mode	@ltx/swh_ke_oak/oc.m6.d5:ocMA.Kathisma13.mode
ltx/swh_redirects_oak/oc.m6.d5:ocMA.Kathisma13.text	@ltx/swh_ke_oak/oc.m6.d5:ocMA.Kathisma13.text
ltx/swh_redirects_oak/oc.m6.d5:ocMA.Kathisma21.incipit	@ltx/swh_ke_oak/oc.m6.d5:ocMA.Kathisma21.incipit
ltx/swh_redirects_oak/oc.m6.d5:ocMA.Kathisma21.melody	@ltx/swh_ke_oak/oc.m6.d5:ocMA.Kathisma21.melody
ltx/swh_redirects_oak/oc.m6.d5:ocMA.Kathisma21.mode	@ltx/swh_ke_oak/oc.m6.d5:ocMA.Kathisma21.mode
ltx/swh_redirects_oak/oc.m6.d5:ocMA.Kathisma21.text	@ltx/swh_ke_oak/oc.m6.d5:ocMA.Kathisma21.text
ltx/swh_redirects_oak/oc.m6.d5:ocMA.Kathisma22.incipit	@ltx/swh_ke_oak/oc.m6.d5:ocMA.Kathisma22.incipit
ltx/swh_redirects_oak/oc.m6.d5:ocMA.Kathisma22.melody	@ltx/swh_ke_oak/oc.m6.d5:ocMA.Kathisma22.melody
ltx/swh_redirects_oak/oc.m6.d5:ocMA.Kathisma22.mode	@ltx/swh_ke_oak/oc.m6.d5:ocMA.Kathisma22.mode
ltx/swh_redirects_oak/oc.m6.d5:ocMA.Kathisma22.text	@ltx/swh_ke_oak/oc.m6.d5:ocMA.Kathisma22.text
ltx/swh_redirects_oak/oc.m6.d5:ocMA.Kathisma23.greekmelody	@ltx/swh_ke_oak/oc.m6.d5:ocMA.Kathisma23.greekmelody
ltx/swh_redirects_oak/oc.m6.d5:ocMA.Kathisma23.incipit	@ltx/swh_ke_oak/oc.m6.d5:ocMA.Kathisma23.incipit
ltx/swh_redirects_oak/oc.m6.d5:ocMA.Kathisma23.melody	@ltx/swh_ke_oak/oc.m6.d5:ocMA.Kathisma23.melody
ltx/swh_redirects_oak/oc.m6.d5:ocMA.Kathisma23.mode	@ltx/swh_ke_oak/oc.m6.d5:ocMA.Kathisma23.mode
ltx/swh_redirects_oak/oc.m6.d5:ocMA.Kathisma23.text	@ltx/swh_ke_oak/oc.m6.d5:ocMA.Kathisma23.text
ltx/swh_redirects_oak/oc.m6.d5:ocMA.Kathisma31.incipit	@ltx/swh_ke_oak/oc.m6.d5:ocMA.Kathisma31.incipit
ltx/swh_redirects_oak/oc.m6.d5:ocMA.Kathisma31.melody	@ltx/swh_ke_oak/oc.m6.d5:ocMA.Kathisma31.melody
ltx/swh_redirects_oak/oc.m6.d5:ocMA.Kathisma31.mode	@ltx/swh_ke_oak/oc.m6.d5:ocMA.Kathisma31.mode
ltx/swh_redirects_oak/oc.m6.d5:ocMA.Kathisma31.text	@ltx/swh_ke_oak/oc.m6.d5:ocMA.Kathisma31.text
ltx/swh_redirects_oak/oc.m6.d5:ocMA.Kathisma32.incipit	@ltx/swh_ke_oak/oc.m6.d5:ocMA.Kathisma32.incipit
ltx/swh_redirects_oak/oc.m6.d5:ocMA.Kathisma32.melody	@ltx/swh_ke_oak/oc.m6.d5:ocMA.Kathisma32.melody
ltx/swh_redirects_oak/oc.m6.d5:ocMA.Kathisma32.mode	@ltx/swh_ke_oak/oc.m6.d5:ocMA.Kathisma32.mode
ltx/swh_redirects_oak/oc.m6.d5:ocMA.Kathisma32.text	@ltx/swh_ke_oak/oc.m6.d5:ocMA.Kathisma32.text
ltx/swh_redirects_oak/oc.m6.d5:ocMA.Kathisma33.incipit	@ltx/swh_ke_oak/oc.m6.d5:ocMA.Kathisma33.incipit
ltx/swh_redirects_oak/oc.m6.d5:ocMA.Kathisma33.melody	@ltx/swh_ke_oak/oc.m6.d5:ocMA.Kathisma33.melody
ltx/swh_redirects_oak/oc.m6.d5:ocMA.Kathisma33.mode	@ltx/swh_ke_oak/oc.m6.d5:ocMA.Kathisma33.mode
ltx/swh_redirects_oak/oc.m6.d5:ocMA.Kathisma33.text	@ltx/swh_ke_oak/oc.m6.d5:ocMA.Kathisma33.text
ltx/swh_redirects_oak/oc.m6.d5:ocMA.OdeW1C11.incipit	@ltx/swh_ke_oak/oc.m6.d5:ocMA.OdeW1C11.incipit
ltx/swh_redirects_oak/oc.m6.d5:ocMA.OdeW1C11.melody	@ltx/swh_ke_oak/oc.m6.d5:ocMA.OdeW1C11.melody
ltx/swh_redirects_oak/oc.m6.d5:ocMA.OdeW1C11.mode	@ltx/swh_ke_oak/oc.m6.d5:ocMA.OdeW1C11.mode
ltx/swh_redirects_oak/oc.m6.d5:ocMA.OdeW1C11.ode	@ltx/swh_ke_oak/oc.m6.d5:ocMA.OdeW1C11.ode
ltx/swh_redirects_oak/oc.m6.d5:ocMA.OdeW1C11.text	@ltx/swh_ke_oak/oc.m6.d5:ocMA.OdeW1C11.text
ltx/swh_redirects_oak/oc.m6.d5:ocMA.OdeW1C12.incipit	@ltx/swh_ke_oak/oc.m6.d5:ocMA.OdeW1C12.incipit
ltx/swh_redirects_oak/oc.m6.d5:ocMA.OdeW1C12.melody	@ltx/swh_ke_oak/oc.m6.d5:ocMA.OdeW1C12.melody
ltx/swh_redirects_oak/oc.m6.d5:ocMA.OdeW1C12.mode	@ltx/swh_ke_oak/oc.m6.d5:ocMA.OdeW1C12.mode
ltx/swh_redirects_oak/oc.m6.d5:ocMA.OdeW1C12.ode	@ltx/swh_ke_oak/oc.m6.d5:ocMA.OdeW1C12.ode
ltx/swh_redirects_oak/oc.m6.d5:ocMA.OdeW1C12.text	@ltx/swh_ke_oak/oc.m6.d5:ocMA.OdeW1C12.text
ltx/swh_redirects_oak/oc.m6.d5:ocMA.OdeW1C13.incipit	@ltx/swh_ke_oak/oc.m6.d5:ocMA.OdeW1C13.incipit
ltx/swh_redirects_oak/oc.m6.d5:ocMA.OdeW1C13.melody	@ltx/swh_ke_oak/oc.m6.d5:ocMA.OdeW1C13.melody
ltx/swh_redirects_oak/oc.m6.d5:ocMA.OdeW1C13.mode	@ltx/swh_ke_oak/oc.m6.d5:ocMA.OdeW1C13.mode
ltx/swh_redirects_oak/oc.m6.d5:ocMA.OdeW1C13.ode	@ltx/swh_ke_oak/oc.m6.d5:ocMA.OdeW1C13.ode
ltx/swh_redirects_oak/oc.m6.d5:ocMA.OdeW1C13.text	@ltx/swh_ke_oak/oc.m6.d5:ocMA.OdeW1C13.text
ltx/swh_redirects_oak/oc.m6.d5:ocMA.OdeW1C1H.greekmelody	@ltx/swh_ke_oak/oc.m6.d5:ocMA.OdeW1C1H.greekmelody
ltx/swh_redirects_oak/oc.m6.d5:ocMA.OdeW1C1H.incipit	@ltx/swh_ke_oak/oc.m6.d5:ocMA.OdeW1C1H.incipit
ltx/swh_redirects_oak/oc.m6.d5:ocMA.OdeW1C1H.melody	@ltx/swh_ke_oak/oc.m6.d5:ocMA.OdeW1C1H.melody
ltx/swh_redirects_oak/oc.m6.d5:ocMA.OdeW1C1H.mode	@ltx/swh_ke_oak/oc.m6.d5:ocMA.OdeW1C1H.mode
ltx/swh_redirects_oak/oc.m6.d5:ocMA.OdeW1C1H.ode	@ltx/swh_ke_oak/oc.m6.d5:ocMA.OdeW1C1H.ode
ltx/swh_redirects_oak/oc.m6.d5:ocMA.OdeW1C1H.text	@ltx/swh_ke_oak/oc.m6.d5:ocMA.OdeW1C1H.text
ltx/swh_redirects_oak/oc.m6.d5:ocMA.OdeW1C1T.incipit	@ltx/swh_ke_oak/oc.m6.d5:ocMA.OdeW1C1T.incipit
ltx/swh_redirects_oak/oc.m6.d5:ocMA.OdeW1C1T.melody	@ltx/swh_ke_oak/oc.m6.d5:ocMA.OdeW1C1T.melody
ltx/swh_redirects_oak/oc.m6.d5:ocMA.OdeW1C1T.mode	@ltx/swh_ke_oak/oc.m6.d5:ocMA.OdeW1C1T.mode
ltx/swh_redirects_oak/oc.m6.d5:ocMA.OdeW1C1T.ode	@ltx/swh_ke_oak/oc.m6.d5:ocMA.OdeW1C1T.ode
ltx/swh_redirects_oak/oc.m6.d5:ocMA.OdeW1C1T.text	@ltx/swh_ke_oak/oc.m6.d5:ocMA.OdeW1C1T.text
ltx/swh_redirects_oak/oc.m6.d5:ocMA.OdeW1C21.greekmelody	@ltx/swh_ke_oak/oc.m6.d5:ocMA.OdeW1C21.greekmelody
ltx/swh_redirects_oak/oc.m6.d5:ocMA.OdeW1C21.incipit	@ltx/swh_ke_oak/oc.m6.d5:ocMA.OdeW1C21.incipit
ltx/swh_redirects_oak/oc.m6.d5:ocMA.OdeW1C21.melody	@ltx/swh_ke_oak/oc.m6.d5:ocMA.OdeW1C21.melody
ltx/swh_redirects_oak/oc.m6.d5:ocMA.OdeW1C21.mode	@ltx/swh_ke_oak/oc.m6.d5:ocMA.OdeW1C21.mode
ltx/swh_redirects_oak/oc.m6.d5:ocMA.OdeW1C21.ode	@ltx/swh_ke_oak/oc.m6.d5:ocMA.OdeW1C21.ode
ltx/swh_redirects_oak/oc.m6.d5:ocMA.OdeW1C21.text	@ltx/swh_ke_oak/oc.m6.d5:ocMA.OdeW1C21.text
ltx/swh_redirects_oak/oc.m6.d5:ocMA.OdeW1C22.incipit	@ltx/swh_ke_oak/oc.m6.d5:ocMA.OdeW1C22.incipit
ltx/swh_redirects_oak/oc.m6.d5:ocMA.OdeW1C22.melody	@ltx/swh_ke_oak/oc.m6.d5:ocMA.OdeW1C22.melody
ltx/swh_redirects_oak/oc.m6.d5:ocMA.OdeW1C22.mode	@ltx/swh_ke_oak/oc.m6.d5:ocMA.OdeW1C22.mode
ltx/swh_redirects_oak/oc.m6.d5:ocMA.OdeW1C22.ode	@ltx/swh_ke_oak/oc.m6.d5:ocMA.OdeW1C22.ode
ltx/swh_redirects_oak/oc.m6.d5:ocMA.OdeW1C22.text	@ltx/swh_ke_oak/oc.m6.d5:ocMA.OdeW1C22.text
ltx/swh_redirects_oak/oc.m6.d5:ocMA.OdeW1C23.incipit	@ltx/swh_ke_oak/oc.m6.d5:ocMA.OdeW1C23.incipit
ltx/swh_redirects_oak/oc.m6.d5:ocMA.OdeW1C23.melody	@ltx/swh_ke_oak/oc.m6.d5:ocMA.OdeW1C23.melody
ltx/swh_redirects_oak/oc.m6.d5:ocMA.OdeW1C23.mode	@ltx/swh_ke_oak/oc.m6.d5:ocMA.OdeW1C23.mode
ltx/swh_redirects_oak/oc.m6.d5:ocMA.OdeW1C23.ode	@ltx/swh_ke_oak/oc.m6.d5:ocMA.OdeW1C23.ode
ltx/swh_redirects_oak/oc.m6.d5:ocMA.OdeW1C23.text	@ltx/swh_ke_oak/oc.m6.d5:ocMA.OdeW1C23.text
ltx/swh_redirects_oak/oc.m6.d5:ocMA.OdeW1C2T.incipit	@ltx/swh_ke_oak/oc.m6.d5:ocMA.OdeW1C2T.incipit
ltx/swh_redirects_oak/oc.m6.d5:ocMA.OdeW1C2T.melody	@ltx/swh_ke_oak/oc.m6.d5:ocMA.OdeW1C2T.melody
ltx/swh_redirects_oak/oc.m6.d5:ocMA.OdeW1C2T.mode	@ltx/swh_ke_oak/oc.m6.d5:ocMA.OdeW1C2T.mode
ltx/swh_redirects_oak/oc.m6.d5:ocMA.OdeW1C2T.ode	@ltx/swh_ke_oak/oc.m6.d5:ocMA.OdeW1C2T.ode
ltx/swh_redirects_oak/oc.m6.d5:ocMA.OdeW1C2T.text	@ltx/swh_ke_oak/oc.m6.d5:ocMA.OdeW1C2T.text
ltx/swh_redirects_oak/oc.m6.d5:ocMA.OdeW3C11.incipit	@ltx/swh_ke_oak/oc.m6.d5:ocMA.OdeW3C11.incipit
ltx/swh_redirects_oak/oc.m6.d5:ocMA.OdeW3C11.melody	@ltx/swh_ke_oak/oc.m6.d5:ocMA.OdeW3C11.melody
ltx/swh_redirects_oak/oc.m6.d5:ocMA.OdeW3C11.mode	@ltx/swh_ke_oak/oc.m6.d5:ocMA.OdeW3C11.mode
ltx/swh_redirects_oak/oc.m6.d5:ocMA.OdeW3C11.ode	@ltx/swh_ke_oak/oc.m6.d5:ocMA.OdeW3C11.ode
ltx/swh_redirects_oak/oc.m6.d5:ocMA.OdeW3C11.text	@ltx/swh_ke_oak/oc.m6.d5:ocMA.OdeW3C11.text
ltx/swh_redirects_oak/oc.m6.d5:ocMA.OdeW3C12.incipit	@ltx/swh_ke_oak/oc.m6.d5:ocMA.OdeW3C12.incipit
ltx/swh_redirects_oak/oc.m6.d5:ocMA.OdeW3C12.melody	@ltx/swh_ke_oak/oc.m6.d5:ocMA.OdeW3C12.melody
ltx/swh_redirects_oak/oc.m6.d5:ocMA.OdeW3C12.mode	@ltx/swh_ke_oak/oc.m6.d5:ocMA.OdeW3C12.mode
ltx/swh_redirects_oak/oc.m6.d5:ocMA.OdeW3C12.ode	@ltx/swh_ke_oak/oc.m6.d5:ocMA.OdeW3C12.ode
ltx/swh_redirects_oak/oc.m6.d5:ocMA.OdeW3C12.text	@ltx/swh_ke_oak/oc.m6.d5:ocMA.OdeW3C12.text
ltx/swh_redirects_oak/oc.m6.d5:ocMA.OdeW3C13.incipit	@ltx/swh_ke_oak/oc.m6.d5:ocMA.OdeW3C13.incipit
ltx/swh_redirects_oak/oc.m6.d5:ocMA.OdeW3C13.melody	@ltx/swh_ke_oak/oc.m6.d5:ocMA.OdeW3C13.melody
ltx/swh_redirects_oak/oc.m6.d5:ocMA.OdeW3C13.mode	@ltx/swh_ke_oak/oc.m6.d5:ocMA.OdeW3C13.mode
ltx/swh_redirects_oak/oc.m6.d5:ocMA.OdeW3C13.ode	@ltx/swh_ke_oak/oc.m6.d5:ocMA.OdeW3C13.ode
ltx/swh_redirects_oak/oc.m6.d5:ocMA.OdeW3C13.text	@ltx/swh_ke_oak/oc.m6.d5:ocMA.OdeW3C13.text
ltx/swh_redirects_oak/oc.m6.d5:ocMA.OdeW3C1H.greekmelody	@ltx/swh_ke_oak/oc.m6.d5:ocMA.OdeW3C1H.greekmelody
ltx/swh_redirects_oak/oc.m6.d5:ocMA.OdeW3C1H.incipit	@ltx/swh_ke_oak/oc.m6.d5:ocMA.OdeW3C1H.incipit
ltx/swh_redirects_oak/oc.m6.d5:ocMA.OdeW3C1H.melody	@ltx/swh_ke_oak/oc.m6.d5:ocMA.OdeW3C1H.melody
ltx/swh_redirects_oak/oc.m6.d5:ocMA.OdeW3C1H.mode	@ltx/swh_ke_oak/oc.m6.d5:ocMA.OdeW3C1H.mode
ltx/swh_redirects_oak/oc.m6.d5:ocMA.OdeW3C1H.ode	@ltx/swh_ke_oak/oc.m6.d5:ocMA.OdeW3C1H.ode
ltx/swh_redirects_oak/oc.m6.d5:ocMA.OdeW3C1H.text	@ltx/swh_ke_oak/oc.m6.d5:ocMA.OdeW3C1H.text
ltx/swh_redirects_oak/oc.m6.d5:ocMA.OdeW3C1T.incipit	@ltx/swh_ke_oak/oc.m6.d5:ocMA.OdeW3C1T.incipit
ltx/swh_redirects_oak/oc.m6.d5:ocMA.OdeW3C1T.melody	@ltx/swh_ke_oak/oc.m6.d5:ocMA.OdeW3C1T.melody
ltx/swh_redirects_oak/oc.m6.d5:ocMA.OdeW3C1T.mode	@ltx/swh_ke_oak/oc.m6.d5:ocMA.OdeW3C1T.mode
ltx/swh_redirects_oak/oc.m6.d5:ocMA.OdeW3C1T.ode	@ltx/swh_ke_oak/oc.m6.d5:ocMA.OdeW3C1T.ode
ltx/swh_redirects_oak/oc.m6.d5:ocMA.OdeW3C1T.text	@ltx/swh_ke_oak/oc.m6.d5:ocMA.OdeW3C1T.text
ltx/swh_redirects_oak/oc.m6.d5:ocMA.OdeW3C21.greekmelody	@ltx/swh_ke_oak/oc.m6.d5:ocMA.OdeW3C21.greekmelody
ltx/swh_redirects_oak/oc.m6.d5:ocMA.OdeW3C21.incipit	@ltx/swh_ke_oak/oc.m6.d5:ocMA.OdeW3C21.incipit
ltx/swh_redirects_oak/oc.m6.d5:ocMA.OdeW3C21.melody	@ltx/swh_ke_oak/oc.m6.d5:ocMA.OdeW3C21.melody
ltx/swh_redirects_oak/oc.m6.d5:ocMA.OdeW3C21.mode	@ltx/swh_ke_oak/oc.m6.d5:ocMA.OdeW3C21.mode
ltx/swh_redirects_oak/oc.m6.d5:ocMA.OdeW3C21.ode	@ltx/swh_ke_oak/oc.m6.d5:ocMA.OdeW3C21.ode
ltx/swh_redirects_oak/oc.m6.d5:ocMA.OdeW3C21.text	@ltx/swh_ke_oak/oc.m6.d5:ocMA.OdeW3C21.text
ltx/swh_redirects_oak/oc.m6.d5:ocMA.OdeW3C22.incipit	@ltx/swh_ke_oak/oc.m6.d5:ocMA.OdeW3C22.incipit
ltx/swh_redirects_oak/oc.m6.d5:ocMA.OdeW3C22.melody	@ltx/swh_ke_oak/oc.m6.d5:ocMA.OdeW3C22.melody
ltx/swh_redirects_oak/oc.m6.d5:ocMA.OdeW3C22.mode	@ltx/swh_ke_oak/oc.m6.d5:ocMA.OdeW3C22.mode
ltx/swh_redirects_oak/oc.m6.d5:ocMA.OdeW3C22.ode	@ltx/swh_ke_oak/oc.m6.d5:ocMA.OdeW3C22.ode
ltx/swh_redirects_oak/oc.m6.d5:ocMA.OdeW3C22.text	@ltx/swh_ke_oak/oc.m6.d5:ocMA.OdeW3C22.text
ltx/swh_redirects_oak/oc.m6.d5:ocMA.OdeW3C23.incipit	@ltx/swh_ke_oak/oc.m6.d5:ocMA.OdeW3C23.incipit
ltx/swh_redirects_oak/oc.m6.d5:ocMA.OdeW3C23.melody	@ltx/swh_ke_oak/oc.m6.d5:ocMA.OdeW3C23.melody
ltx/swh_redirects_oak/oc.m6.d5:ocMA.OdeW3C23.mode	@ltx/swh_ke_oak/oc.m6.d5:ocMA.OdeW3C23.mode
ltx/swh_redirects_oak/oc.m6.d5:ocMA.OdeW3C23.ode	@ltx/swh_ke_oak/oc.m6.d5:ocMA.OdeW3C23.ode
ltx/swh_redirects_oak/oc.m6.d5:ocMA.OdeW3C23.text	@ltx/swh_ke_oak/oc.m6.d5:ocMA.OdeW3C23.text
ltx/swh_redirects_oak/oc.m6.d5:ocMA.OdeW3C2T.incipit	@ltx/swh_ke_oak/oc.m6.d5:ocMA.OdeW3C2T.incipit
ltx/swh_redirects_oak/oc.m6.d5:ocMA.OdeW3C2T.melody	@ltx/swh_ke_oak/oc.m6.d5:ocMA.OdeW3C2T.melody
ltx/swh_redirects_oak/oc.m6.d5:ocMA.OdeW3C2T.mode	@ltx/swh_ke_oak/oc.m6.d5:ocMA.OdeW3C2T.mode
ltx/swh_redirects_oak/oc.m6.d5:ocMA.OdeW3C2T.ode	@ltx/swh_ke_oak/oc.m6.d5:ocMA.OdeW3C2T.ode
ltx/swh_redirects_oak/oc.m6.d5:ocMA.OdeW3C2T.text	@ltx/swh_ke_oak/oc.m6.d5:ocMA.OdeW3C2T.text
ltx/swh_redirects_oak/oc.m6.d5:ocMA.OdeW4C11.incipit	@ltx/swh_ke_oak/oc.m6.d5:ocMA.OdeW4C11.incipit
ltx/swh_redirects_oak/oc.m6.d5:ocMA.OdeW4C11.melody	@ltx/swh_ke_oak/oc.m6.d5:ocMA.OdeW4C11.melody
ltx/swh_redirects_oak/oc.m6.d5:ocMA.OdeW4C11.mode	@ltx/swh_ke_oak/oc.m6.d5:ocMA.OdeW4C11.mode
ltx/swh_redirects_oak/oc.m6.d5:ocMA.OdeW4C11.ode	@ltx/swh_ke_oak/oc.m6.d5:ocMA.OdeW4C11.ode
ltx/swh_redirects_oak/oc.m6.d5:ocMA.OdeW4C11.text	@ltx/swh_ke_oak/oc.m6.d5:ocMA.OdeW4C11.text
ltx/swh_redirects_oak/oc.m6.d5:ocMA.OdeW4C12.incipit	@ltx/swh_ke_oak/oc.m6.d5:ocMA.OdeW4C12.incipit
ltx/swh_redirects_oak/oc.m6.d5:ocMA.OdeW4C12.melody	@ltx/swh_ke_oak/oc.m6.d5:ocMA.OdeW4C12.melody
ltx/swh_redirects_oak/oc.m6.d5:ocMA.OdeW4C12.mode	@ltx/swh_ke_oak/oc.m6.d5:ocMA.OdeW4C12.mode
ltx/swh_redirects_oak/oc.m6.d5:ocMA.OdeW4C12.ode	@ltx/swh_ke_oak/oc.m6.d5:ocMA.OdeW4C12.ode
ltx/swh_redirects_oak/oc.m6.d5:ocMA.OdeW4C12.text	@ltx/swh_ke_oak/oc.m6.d5:ocMA.OdeW4C12.text
ltx/swh_redirects_oak/oc.m6.d5:ocMA.OdeW4C13.incipit	@ltx/swh_ke_oak/oc.m6.d5:ocMA.OdeW4C13.incipit
ltx/swh_redirects_oak/oc.m6.d5:ocMA.OdeW4C13.melody	@ltx/swh_ke_oak/oc.m6.d5:ocMA.OdeW4C13.melody
ltx/swh_redirects_oak/oc.m6.d5:ocMA.OdeW4C13.mode	@ltx/swh_ke_oak/oc.m6.d5:ocMA.OdeW4C13.mode
ltx/swh_redirects_oak/oc.m6.d5:ocMA.OdeW4C13.ode	@ltx/swh_ke_oak/oc.m6.d5:ocMA.OdeW4C13.ode
ltx/swh_redirects_oak/oc.m6.d5:ocMA.OdeW4C13.text	@ltx/swh_ke_oak/oc.m6.d5:ocMA.OdeW4C13.text
ltx/swh_redirects_oak/oc.m6.d5:ocMA.OdeW4C1H.greekmelody	@ltx/swh_ke_oak/oc.m6.d5:ocMA.OdeW4C1H.greekmelody
ltx/swh_redirects_oak/oc.m6.d5:ocMA.OdeW4C1H.incipit	@ltx/swh_ke_oak/oc.m6.d5:ocMA.OdeW4C1H.incipit
ltx/swh_redirects_oak/oc.m6.d5:ocMA.OdeW4C1H.melody	@ltx/swh_ke_oak/oc.m6.d5:ocMA.OdeW4C1H.melody
ltx/swh_redirects_oak/oc.m6.d5:ocMA.OdeW4C1H.mode	@ltx/swh_ke_oak/oc.m6.d5:ocMA.OdeW4C1H.mode
ltx/swh_redirects_oak/oc.m6.d5:ocMA.OdeW4C1H.ode	@ltx/swh_ke_oak/oc.m6.d5:ocMA.OdeW4C1H.ode
ltx/swh_redirects_oak/oc.m6.d5:ocMA.OdeW4C1H.text	@ltx/swh_ke_oak/oc.m6.d5:ocMA.OdeW4C1H.text
ltx/swh_redirects_oak/oc.m6.d5:ocMA.OdeW4C1T.incipit	@ltx/swh_ke_oak/oc.m6.d5:ocMA.OdeW4C1T.incipit
ltx/swh_redirects_oak/oc.m6.d5:ocMA.OdeW4C1T.melody	@ltx/swh_ke_oak/oc.m6.d5:ocMA.OdeW4C1T.melody
ltx/swh_redirects_oak/oc.m6.d5:ocMA.OdeW4C1T.mode	@ltx/swh_ke_oak/oc.m6.d5:ocMA.OdeW4C1T.mode
ltx/swh_redirects_oak/oc.m6.d5:ocMA.OdeW4C1T.ode	@ltx/swh_ke_oak/oc.m6.d5:ocMA.OdeW4C1T.ode
ltx/swh_redirects_oak/oc.m6.d5:ocMA.OdeW4C1T.text	@ltx/swh_ke_oak/oc.m6.d5:ocMA.OdeW4C1T.text
ltx/swh_redirects_oak/oc.m6.d5:ocMA.OdeW4C21.greekmelody	@ltx/swh_ke_oak/oc.m6.d5:ocMA.OdeW4C21.greekmelody
ltx/swh_redirects_oak/oc.m6.d5:ocMA.OdeW4C21.incipit	@ltx/swh_ke_oak/oc.m6.d5:ocMA.OdeW4C21.incipit
ltx/swh_redirects_oak/oc.m6.d5:ocMA.OdeW4C21.melody	@ltx/swh_ke_oak/oc.m6.d5:ocMA.OdeW4C21.melody
ltx/swh_redirects_oak/oc.m6.d5:ocMA.OdeW4C21.mode	@ltx/swh_ke_oak/oc.m6.d5:ocMA.OdeW4C21.mode
ltx/swh_redirects_oak/oc.m6.d5:ocMA.OdeW4C21.ode	@ltx/swh_ke_oak/oc.m6.d5:ocMA.OdeW4C21.ode
ltx/swh_redirects_oak/oc.m6.d5:ocMA.OdeW4C21.text	@ltx/swh_ke_oak/oc.m6.d5:ocMA.OdeW4C21.text
ltx/swh_redirects_oak/oc.m6.d5:ocMA.OdeW4C22.incipit	@ltx/swh_ke_oak/oc.m6.d5:ocMA.OdeW4C22.incipit
ltx/swh_redirects_oak/oc.m6.d5:ocMA.OdeW4C22.melody	@ltx/swh_ke_oak/oc.m6.d5:ocMA.OdeW4C22.melody
ltx/swh_redirects_oak/oc.m6.d5:ocMA.OdeW4C22.mode	@ltx/swh_ke_oak/oc.m6.d5:ocMA.OdeW4C22.mode
ltx/swh_redirects_oak/oc.m6.d5:ocMA.OdeW4C22.ode	@ltx/swh_ke_oak/oc.m6.d5:ocMA.OdeW4C22.ode
ltx/swh_redirects_oak/oc.m6.d5:ocMA.OdeW4C22.text	@ltx/swh_ke_oak/oc.m6.d5:ocMA.OdeW4C22.text
ltx/swh_redirects_oak/oc.m6.d5:ocMA.OdeW4C23.incipit	@ltx/swh_ke_oak/oc.m6.d5:ocMA.OdeW4C23.incipit
ltx/swh_redirects_oak/oc.m6.d5:ocMA.OdeW4C23.melody	@ltx/swh_ke_oak/oc.m6.d5:ocMA.OdeW4C23.melody
ltx/swh_redirects_oak/oc.m6.d5:ocMA.OdeW4C23.mode	@ltx/swh_ke_oak/oc.m6.d5:ocMA.OdeW4C23.mode
ltx/swh_redirects_oak/oc.m6.d5:ocMA.OdeW4C23.ode	@ltx/swh_ke_oak/oc.m6.d5:ocMA.OdeW4C23.ode
ltx/swh_redirects_oak/oc.m6.d5:ocMA.OdeW4C23.text	@ltx/swh_ke_oak/oc.m6.d5:ocMA.OdeW4C23.text
ltx/swh_redirects_oak/oc.m6.d5:ocMA.OdeW4C2T.incipit	@ltx/swh_ke_oak/oc.m6.d5:ocMA.OdeW4C2T.incipit
ltx/swh_redirects_oak/oc.m6.d5:ocMA.OdeW4C2T.melody	@ltx/swh_ke_oak/oc.m6.d5:ocMA.OdeW4C2T.melody
ltx/swh_redirects_oak/oc.m6.d5:ocMA.OdeW4C2T.mode	@ltx/swh_ke_oak/oc.m6.d5:ocMA.OdeW4C2T.mode
ltx/swh_redirects_oak/oc.m6.d5:ocMA.OdeW4C2T.ode	@ltx/swh_ke_oak/oc.m6.d5:ocMA.OdeW4C2T.ode
ltx/swh_redirects_oak/oc.m6.d5:ocMA.OdeW4C2T.text	@ltx/swh_ke_oak/oc.m6.d5:ocMA.OdeW4C2T.text
ltx/swh_redirects_oak/oc.m6.d5:ocMA.OdeW5C11.incipit	@ltx/swh_ke_oak/oc.m6.d5:ocMA.OdeW5C11.incipit
ltx/swh_redirects_oak/oc.m6.d5:ocMA.OdeW5C11.melody	@ltx/swh_ke_oak/oc.m6.d5:ocMA.OdeW5C11.melody
ltx/swh_redirects_oak/oc.m6.d5:ocMA.OdeW5C11.mode	@ltx/swh_ke_oak/oc.m6.d5:ocMA.OdeW5C11.mode
ltx/swh_redirects_oak/oc.m6.d5:ocMA.OdeW5C11.ode	@ltx/swh_ke_oak/oc.m6.d5:ocMA.OdeW5C11.ode
ltx/swh_redirects_oak/oc.m6.d5:ocMA.OdeW5C11.text	@ltx/swh_ke_oak/oc.m6.d5:ocMA.OdeW5C11.text
ltx/swh_redirects_oak/oc.m6.d5:ocMA.OdeW5C12.incipit	@ltx/swh_ke_oak/oc.m6.d5:ocMA.OdeW5C12.incipit
ltx/swh_redirects_oak/oc.m6.d5:ocMA.OdeW5C12.melody	@ltx/swh_ke_oak/oc.m6.d5:ocMA.OdeW5C12.melody
ltx/swh_redirects_oak/oc.m6.d5:ocMA.OdeW5C12.mode	@ltx/swh_ke_oak/oc.m6.d5:ocMA.OdeW5C12.mode
ltx/swh_redirects_oak/oc.m6.d5:ocMA.OdeW5C12.ode	@ltx/swh_ke_oak/oc.m6.d5:ocMA.OdeW5C12.ode
ltx/swh_redirects_oak/oc.m6.d5:ocMA.OdeW5C12.text	@ltx/swh_ke_oak/oc.m6.d5:ocMA.OdeW5C12.text
ltx/swh_redirects_oak/oc.m6.d5:ocMA.OdeW5C13.incipit	@ltx/swh_ke_oak/oc.m6.d5:ocMA.OdeW5C13.incipit
ltx/swh_redirects_oak/oc.m6.d5:ocMA.OdeW5C13.melody	@ltx/swh_ke_oak/oc.m6.d5:ocMA.OdeW5C13.melody
ltx/swh_redirects_oak/oc.m6.d5:ocMA.OdeW5C13.mode	@ltx/swh_ke_oak/oc.m6.d5:ocMA.OdeW5C13.mode
ltx/swh_redirects_oak/oc.m6.d5:ocMA.OdeW5C13.ode	@ltx/swh_ke_oak/oc.m6.d5:ocMA.OdeW5C13.ode
ltx/swh_redirects_oak/oc.m6.d5:ocMA.OdeW5C13.text	@ltx/swh_ke_oak/oc.m6.d5:ocMA.OdeW5C13.text
ltx/swh_redirects_oak/oc.m6.d5:ocMA.OdeW5C1H.greekmelody	@ltx/swh_ke_oak/oc.m6.d5:ocMA.OdeW5C1H.greekmelody
ltx/swh_redirects_oak/oc.m6.d5:ocMA.OdeW5C1H.incipit	@ltx/swh_ke_oak/oc.m6.d5:ocMA.OdeW5C1H.incipit
ltx/swh_redirects_oak/oc.m6.d5:ocMA.OdeW5C1H.melody	@ltx/swh_ke_oak/oc.m6.d5:ocMA.OdeW5C1H.melody
ltx/swh_redirects_oak/oc.m6.d5:ocMA.OdeW5C1H.mode	@ltx/swh_ke_oak/oc.m6.d5:ocMA.OdeW5C1H.mode
ltx/swh_redirects_oak/oc.m6.d5:ocMA.OdeW5C1H.ode	@ltx/swh_ke_oak/oc.m6.d5:ocMA.OdeW5C1H.ode
ltx/swh_redirects_oak/oc.m6.d5:ocMA.OdeW5C1H.text	@ltx/swh_ke_oak/oc.m6.d5:ocMA.OdeW5C1H.text
ltx/swh_redirects_oak/oc.m6.d5:ocMA.OdeW5C1T.incipit	@ltx/swh_ke_oak/oc.m6.d5:ocMA.OdeW5C1T.incipit
ltx/swh_redirects_oak/oc.m6.d5:ocMA.OdeW5C1T.melody	@ltx/swh_ke_oak/oc.m6.d5:ocMA.OdeW5C1T.melody
ltx/swh_redirects_oak/oc.m6.d5:ocMA.OdeW5C1T.mode	@ltx/swh_ke_oak/oc.m6.d5:ocMA.OdeW5C1T.mode
ltx/swh_redirects_oak/oc.m6.d5:ocMA.OdeW5C1T.ode	@ltx/swh_ke_oak/oc.m6.d5:ocMA.OdeW5C1T.ode
ltx/swh_redirects_oak/oc.m6.d5:ocMA.OdeW5C1T.text	@ltx/swh_ke_oak/oc.m6.d5:ocMA.OdeW5C1T.text
ltx/swh_redirects_oak/oc.m6.d5:ocMA.OdeW5C21.greekmelody	@ltx/swh_ke_oak/oc.m6.d5:ocMA.OdeW5C21.greekmelody
ltx/swh_redirects_oak/oc.m6.d5:ocMA.OdeW5C21.incipit	@ltx/swh_ke_oak/oc.m6.d5:ocMA.OdeW5C21.incipit
ltx/swh_redirects_oak/oc.m6.d5:ocMA.OdeW5C21.melody	@ltx/swh_ke_oak/oc.m6.d5:ocMA.OdeW5C21.melody
ltx/swh_redirects_oak/oc.m6.d5:ocMA.OdeW5C21.mode	@ltx/swh_ke_oak/oc.m6.d5:ocMA.OdeW5C21.mode
ltx/swh_redirects_oak/oc.m6.d5:ocMA.OdeW5C21.ode	@ltx/swh_ke_oak/oc.m6.d5:ocMA.OdeW5C21.ode
ltx/swh_redirects_oak/oc.m6.d5:ocMA.OdeW5C21.text	@ltx/swh_ke_oak/oc.m6.d5:ocMA.OdeW5C21.text
ltx/swh_redirects_oak/oc.m6.d5:ocMA.OdeW5C22.incipit	@ltx/swh_ke_oak/oc.m6.d5:ocMA.OdeW5C22.incipit
ltx/swh_redirects_oak/oc.m6.d5:ocMA.OdeW5C22.melody	@ltx/swh_ke_oak/oc.m6.d5:ocMA.OdeW5C22.melody
ltx/swh_redirects_oak/oc.m6.d5:ocMA.OdeW5C22.mode	@ltx/swh_ke_oak/oc.m6.d5:ocMA.OdeW5C22.mode
ltx/swh_redirects_oak/oc.m6.d5:ocMA.OdeW5C22.ode	@ltx/swh_ke_oak/oc.m6.d5:ocMA.OdeW5C22.ode
ltx/swh_redirects_oak/oc.m6.d5:ocMA.OdeW5C22.text	@ltx/swh_ke_oak/oc.m6.d5:ocMA.OdeW5C22.text
ltx/swh_redirects_oak/oc.m6.d5:ocMA.OdeW5C23.incipit	@ltx/swh_ke_oak/oc.m6.d5:ocMA.OdeW5C23.incipit
ltx/swh_redirects_oak/oc.m6.d5:ocMA.OdeW5C23.melody	@ltx/swh_ke_oak/oc.m6.d5:ocMA.OdeW5C23.melody
ltx/swh_redirects_oak/oc.m6.d5:ocMA.OdeW5C23.mode	@ltx/swh_ke_oak/oc.m6.d5:ocMA.OdeW5C23.mode
ltx/swh_redirects_oak/oc.m6.d5:ocMA.OdeW5C23.ode	@ltx/swh_ke_oak/oc.m6.d5:ocMA.OdeW5C23.ode
ltx/swh_redirects_oak/oc.m6.d5:ocMA.OdeW5C23.text	@ltx/swh_ke_oak/oc.m6.d5:ocMA.OdeW5C23.text
ltx/swh_redirects_oak/oc.m6.d5:ocMA.OdeW5C2T.incipit	@ltx/swh_ke_oak/oc.m6.d5:ocMA.OdeW5C2T.incipit
ltx/swh_redirects_oak/oc.m6.d5:ocMA.OdeW5C2T.melody	@ltx/swh_ke_oak/oc.m6.d5:ocMA.OdeW5C2T.melody
ltx/swh_redirects_oak/oc.m6.d5:ocMA.OdeW5C2T.mode	@ltx/swh_ke_oak/oc.m6.d5:ocMA.OdeW5C2T.mode
ltx/swh_redirects_oak/oc.m6.d5:ocMA.OdeW5C2T.ode	@ltx/swh_ke_oak/oc.m6.d5:ocMA.OdeW5C2T.ode
ltx/swh_redirects_oak/oc.m6.d5:ocMA.OdeW5C2T.text	@ltx/swh_ke_oak/oc.m6.d5:ocMA.OdeW5C2T.text
ltx/swh_redirects_oak/oc.m6.d5:ocMA.OdeW6C11.incipit	@ltx/swh_ke_oak/oc.m6.d5:ocMA.OdeW6C11.incipit
ltx/swh_redirects_oak/oc.m6.d5:ocMA.OdeW6C11.melody	@ltx/swh_ke_oak/oc.m6.d5:ocMA.OdeW6C11.melody
ltx/swh_redirects_oak/oc.m6.d5:ocMA.OdeW6C11.mode	@ltx/swh_ke_oak/oc.m6.d5:ocMA.OdeW6C11.mode
ltx/swh_redirects_oak/oc.m6.d5:ocMA.OdeW6C11.ode	@ltx/swh_ke_oak/oc.m6.d5:ocMA.OdeW6C11.ode
ltx/swh_redirects_oak/oc.m6.d5:ocMA.OdeW6C11.text	@ltx/swh_ke_oak/oc.m6.d5:ocMA.OdeW6C11.text
ltx/swh_redirects_oak/oc.m6.d5:ocMA.OdeW6C12.incipit	@ltx/swh_ke_oak/oc.m6.d5:ocMA.OdeW6C12.incipit
ltx/swh_redirects_oak/oc.m6.d5:ocMA.OdeW6C12.melody	@ltx/swh_ke_oak/oc.m6.d5:ocMA.OdeW6C12.melody
ltx/swh_redirects_oak/oc.m6.d5:ocMA.OdeW6C12.mode	@ltx/swh_ke_oak/oc.m6.d5:ocMA.OdeW6C12.mode
ltx/swh_redirects_oak/oc.m6.d5:ocMA.OdeW6C12.ode	@ltx/swh_ke_oak/oc.m6.d5:ocMA.OdeW6C12.ode
ltx/swh_redirects_oak/oc.m6.d5:ocMA.OdeW6C12.text	@ltx/swh_ke_oak/oc.m6.d5:ocMA.OdeW6C12.text
ltx/swh_redirects_oak/oc.m6.d5:ocMA.OdeW6C13.incipit	@ltx/swh_ke_oak/oc.m6.d5:ocMA.OdeW6C13.incipit
ltx/swh_redirects_oak/oc.m6.d5:ocMA.OdeW6C13.melody	@ltx/swh_ke_oak/oc.m6.d5:ocMA.OdeW6C13.melody
ltx/swh_redirects_oak/oc.m6.d5:ocMA.OdeW6C13.mode	@ltx/swh_ke_oak/oc.m6.d5:ocMA.OdeW6C13.mode
ltx/swh_redirects_oak/oc.m6.d5:ocMA.OdeW6C13.ode	@ltx/swh_ke_oak/oc.m6.d5:ocMA.OdeW6C13.ode
ltx/swh_redirects_oak/oc.m6.d5:ocMA.OdeW6C13.text	@ltx/swh_ke_oak/oc.m6.d5:ocMA.OdeW6C13.text
ltx/swh_redirects_oak/oc.m6.d5:ocMA.OdeW6C1H.greekmelody	@ltx/swh_ke_oak/oc.m6.d5:ocMA.OdeW6C1H.greekmelody
ltx/swh_redirects_oak/oc.m6.d5:ocMA.OdeW6C1H.incipit	@ltx/swh_ke_oak/oc.m6.d5:ocMA.OdeW6C1H.incipit
ltx/swh_redirects_oak/oc.m6.d5:ocMA.OdeW6C1H.melody	@ltx/swh_ke_oak/oc.m6.d5:ocMA.OdeW6C1H.melody
ltx/swh_redirects_oak/oc.m6.d5:ocMA.OdeW6C1H.mode	@ltx/swh_ke_oak/oc.m6.d5:ocMA.OdeW6C1H.mode
ltx/swh_redirects_oak/oc.m6.d5:ocMA.OdeW6C1H.ode	@ltx/swh_ke_oak/oc.m6.d5:ocMA.OdeW6C1H.ode
ltx/swh_redirects_oak/oc.m6.d5:ocMA.OdeW6C1H.text	@ltx/swh_ke_oak/oc.m6.d5:ocMA.OdeW6C1H.text
ltx/swh_redirects_oak/oc.m6.d5:ocMA.OdeW6C1T.incipit	@ltx/swh_ke_oak/oc.m6.d5:ocMA.OdeW6C1T.incipit
ltx/swh_redirects_oak/oc.m6.d5:ocMA.OdeW6C1T.melody	@ltx/swh_ke_oak/oc.m6.d5:ocMA.OdeW6C1T.melody
ltx/swh_redirects_oak/oc.m6.d5:ocMA.OdeW6C1T.mode	@ltx/swh_ke_oak/oc.m6.d5:ocMA.OdeW6C1T.mode
ltx/swh_redirects_oak/oc.m6.d5:ocMA.OdeW6C1T.ode	@ltx/swh_ke_oak/oc.m6.d5:ocMA.OdeW6C1T.ode
ltx/swh_redirects_oak/oc.m6.d5:ocMA.OdeW6C1T.text	@ltx/swh_ke_oak/oc.m6.d5:ocMA.OdeW6C1T.text
ltx/swh_redirects_oak/oc.m6.d5:ocMA.OdeW6C21.greekmelody	@ltx/swh_ke_oak/oc.m6.d5:ocMA.OdeW6C21.greekmelody
ltx/swh_redirects_oak/oc.m6.d5:ocMA.OdeW6C21.incipit	@ltx/swh_ke_oak/oc.m6.d5:ocMA.OdeW6C21.incipit
ltx/swh_redirects_oak/oc.m6.d5:ocMA.OdeW6C21.melody	@ltx/swh_ke_oak/oc.m6.d5:ocMA.OdeW6C21.melody
ltx/swh_redirects_oak/oc.m6.d5:ocMA.OdeW6C21.mode	@ltx/swh_ke_oak/oc.m6.d5:ocMA.OdeW6C21.mode
ltx/swh_redirects_oak/oc.m6.d5:ocMA.OdeW6C21.ode	@ltx/swh_ke_oak/oc.m6.d5:ocMA.OdeW6C21.ode
ltx/swh_redirects_oak/oc.m6.d5:ocMA.OdeW6C21.text	@ltx/swh_ke_oak/oc.m6.d5:ocMA.OdeW6C21.text
ltx/swh_redirects_oak/oc.m6.d5:ocMA.OdeW6C22.incipit	@ltx/swh_ke_oak/oc.m6.d5:ocMA.OdeW6C22.incipit
ltx/swh_redirects_oak/oc.m6.d5:ocMA.OdeW6C22.melody	@ltx/swh_ke_oak/oc.m6.d5:ocMA.OdeW6C22.melody
ltx/swh_redirects_oak/oc.m6.d5:ocMA.OdeW6C22.mode	@ltx/swh_ke_oak/oc.m6.d5:ocMA.OdeW6C22.mode
ltx/swh_redirects_oak/oc.m6.d5:ocMA.OdeW6C22.ode	@ltx/swh_ke_oak/oc.m6.d5:ocMA.OdeW6C22.ode
ltx/swh_redirects_oak/oc.m6.d5:ocMA.OdeW6C22.text	@ltx/swh_ke_oak/oc.m6.d5:ocMA.OdeW6C22.text
ltx/swh_redirects_oak/oc.m6.d5:ocMA.OdeW6C23.incipit	@ltx/swh_ke_oak/oc.m6.d5:ocMA.OdeW6C23.incipit
ltx/swh_redirects_oak/oc.m6.d5:ocMA.OdeW6C23.melody	@ltx/swh_ke_oak/oc.m6.d5:ocMA.OdeW6C23.melody
ltx/swh_redirects_oak/oc.m6.d5:ocMA.OdeW6C23.mode	@ltx/swh_ke_oak/oc.m6.d5:ocMA.OdeW6C23.mode
ltx/swh_redirects_oak/oc.m6.d5:ocMA.OdeW6C23.ode	@ltx/swh_ke_oak/oc.m6.d5:ocMA.OdeW6C23.ode
ltx/swh_redirects_oak/oc.m6.d5:ocMA.OdeW6C23.text	@ltx/swh_ke_oak/oc.m6.d5:ocMA.OdeW6C23.text
ltx/swh_redirects_oak/oc.m6.d5:ocMA.OdeW6C2T.incipit	@ltx/swh_ke_oak/oc.m6.d5:ocMA.OdeW6C2T.incipit
ltx/swh_redirects_oak/oc.m6.d5:ocMA.OdeW6C2T.melody	@ltx/swh_ke_oak/oc.m6.d5:ocMA.OdeW6C2T.melody
ltx/swh_redirects_oak/oc.m6.d5:ocMA.OdeW6C2T.mode	@ltx/swh_ke_oak/oc.m6.d5:ocMA.OdeW6C2T.mode
ltx/swh_redirects_oak/oc.m6.d5:ocMA.OdeW6C2T.ode	@ltx/swh_ke_oak/oc.m6.d5:ocMA.OdeW6C2T.ode
ltx/swh_redirects_oak/oc.m6.d5:ocMA.OdeW6C2T.text	@ltx/swh_ke_oak/oc.m6.d5:ocMA.OdeW6C2T.text
ltx/swh_redirects_oak/oc.m6.d5:ocMA.OdeW7C11.incipit	@ltx/swh_ke_oak/oc.m6.d5:ocMA.OdeW7C11.incipit
ltx/swh_redirects_oak/oc.m6.d5:ocMA.OdeW7C11.melody	@ltx/swh_ke_oak/oc.m6.d5:ocMA.OdeW7C11.melody
ltx/swh_redirects_oak/oc.m6.d5:ocMA.OdeW7C11.mode	@ltx/swh_ke_oak/oc.m6.d5:ocMA.OdeW7C11.mode
ltx/swh_redirects_oak/oc.m6.d5:ocMA.OdeW7C11.ode	@ltx/swh_ke_oak/oc.m6.d5:ocMA.OdeW7C11.ode
ltx/swh_redirects_oak/oc.m6.d5:ocMA.OdeW7C11.text	@ltx/swh_ke_oak/oc.m6.d5:ocMA.OdeW7C11.text
ltx/swh_redirects_oak/oc.m6.d5:ocMA.OdeW7C12.incipit	@ltx/swh_ke_oak/oc.m6.d5:ocMA.OdeW7C12.incipit
ltx/swh_redirects_oak/oc.m6.d5:ocMA.OdeW7C12.melody	@ltx/swh_ke_oak/oc.m6.d5:ocMA.OdeW7C12.melody
ltx/swh_redirects_oak/oc.m6.d5:ocMA.OdeW7C12.mode	@ltx/swh_ke_oak/oc.m6.d5:ocMA.OdeW7C12.mode
ltx/swh_redirects_oak/oc.m6.d5:ocMA.OdeW7C12.ode	@ltx/swh_ke_oak/oc.m6.d5:ocMA.OdeW7C12.ode
ltx/swh_redirects_oak/oc.m6.d5:ocMA.OdeW7C12.text	@ltx/swh_ke_oak/oc.m6.d5:ocMA.OdeW7C12.text
ltx/swh_redirects_oak/oc.m6.d5:ocMA.OdeW7C13.incipit	@ltx/swh_ke_oak/oc.m6.d5:ocMA.OdeW7C13.incipit
ltx/swh_redirects_oak/oc.m6.d5:ocMA.OdeW7C13.melody	@ltx/swh_ke_oak/oc.m6.d5:ocMA.OdeW7C13.melody
ltx/swh_redirects_oak/oc.m6.d5:ocMA.OdeW7C13.mode	@ltx/swh_ke_oak/oc.m6.d5:ocMA.OdeW7C13.mode
ltx/swh_redirects_oak/oc.m6.d5:ocMA.OdeW7C13.ode	@ltx/swh_ke_oak/oc.m6.d5:ocMA.OdeW7C13.ode
ltx/swh_redirects_oak/oc.m6.d5:ocMA.OdeW7C13.text	@ltx/swh_ke_oak/oc.m6.d5:ocMA.OdeW7C13.text
ltx/swh_redirects_oak/oc.m6.d5:ocMA.OdeW7C1H.greekmelody	@ltx/swh_ke_oak/oc.m6.d5:ocMA.OdeW7C1H.greekmelody
ltx/swh_redirects_oak/oc.m6.d5:ocMA.OdeW7C1H.incipit	@ltx/swh_ke_oak/oc.m6.d5:ocMA.OdeW7C1H.incipit
ltx/swh_redirects_oak/oc.m6.d5:ocMA.OdeW7C1H.melody	@ltx/swh_ke_oak/oc.m6.d5:ocMA.OdeW7C1H.melody
ltx/swh_redirects_oak/oc.m6.d5:ocMA.OdeW7C1H.mode	@ltx/swh_ke_oak/oc.m6.d5:ocMA.OdeW7C1H.mode
ltx/swh_redirects_oak/oc.m6.d5:ocMA.OdeW7C1H.ode	@ltx/swh_ke_oak/oc.m6.d5:ocMA.OdeW7C1H.ode
ltx/swh_redirects_oak/oc.m6.d5:ocMA.OdeW7C1H.text	@ltx/swh_ke_oak/oc.m6.d5:ocMA.OdeW7C1H.text
ltx/swh_redirects_oak/oc.m6.d5:ocMA.OdeW7C1T.incipit	@ltx/swh_ke_oak/oc.m6.d5:ocMA.OdeW7C1T.incipit
ltx/swh_redirects_oak/oc.m6.d5:ocMA.OdeW7C1T.melody	@ltx/swh_ke_oak/oc.m6.d5:ocMA.OdeW7C1T.melody
ltx/swh_redirects_oak/oc.m6.d5:ocMA.OdeW7C1T.mode	@ltx/swh_ke_oak/oc.m6.d5:ocMA.OdeW7C1T.mode
ltx/swh_redirects_oak/oc.m6.d5:ocMA.OdeW7C1T.ode	@ltx/swh_ke_oak/oc.m6.d5:ocMA.OdeW7C1T.ode
ltx/swh_redirects_oak/oc.m6.d5:ocMA.OdeW7C1T.text	@ltx/swh_ke_oak/oc.m6.d5:ocMA.OdeW7C1T.text
ltx/swh_redirects_oak/oc.m6.d5:ocMA.OdeW7C21.greekmelody	@ltx/swh_ke_oak/oc.m6.d5:ocMA.OdeW7C21.greekmelody
ltx/swh_redirects_oak/oc.m6.d5:ocMA.OdeW7C21.incipit	@ltx/swh_ke_oak/oc.m6.d5:ocMA.OdeW7C21.incipit
ltx/swh_redirects_oak/oc.m6.d5:ocMA.OdeW7C21.melody	@ltx/swh_ke_oak/oc.m6.d5:ocMA.OdeW7C21.melody
ltx/swh_redirects_oak/oc.m6.d5:ocMA.OdeW7C21.mode	@ltx/swh_ke_oak/oc.m6.d5:ocMA.OdeW7C21.mode
ltx/swh_redirects_oak/oc.m6.d5:ocMA.OdeW7C21.ode	@ltx/swh_ke_oak/oc.m6.d5:ocMA.OdeW7C21.ode
ltx/swh_redirects_oak/oc.m6.d5:ocMA.OdeW7C21.text	@ltx/swh_ke_oak/oc.m6.d5:ocMA.OdeW7C21.text
ltx/swh_redirects_oak/oc.m6.d5:ocMA.OdeW7C22.incipit	@ltx/swh_ke_oak/oc.m6.d5:ocMA.OdeW7C22.incipit
ltx/swh_redirects_oak/oc.m6.d5:ocMA.OdeW7C22.melody	@ltx/swh_ke_oak/oc.m6.d5:ocMA.OdeW7C22.melody
ltx/swh_redirects_oak/oc.m6.d5:ocMA.OdeW7C22.mode	@ltx/swh_ke_oak/oc.m6.d5:ocMA.OdeW7C22.mode
ltx/swh_redirects_oak/oc.m6.d5:ocMA.OdeW7C22.ode	@ltx/swh_ke_oak/oc.m6.d5:ocMA.OdeW7C22.ode
ltx/swh_redirects_oak/oc.m6.d5:ocMA.OdeW7C22.text	@ltx/swh_ke_oak/oc.m6.d5:ocMA.OdeW7C22.text
ltx/swh_redirects_oak/oc.m6.d5:ocMA.OdeW7C23.incipit	@ltx/swh_ke_oak/oc.m6.d5:ocMA.OdeW7C23.incipit
ltx/swh_redirects_oak/oc.m6.d5:ocMA.OdeW7C23.melody	@ltx/swh_ke_oak/oc.m6.d5:ocMA.OdeW7C23.melody
ltx/swh_redirects_oak/oc.m6.d5:ocMA.OdeW7C23.mode	@ltx/swh_ke_oak/oc.m6.d5:ocMA.OdeW7C23.mode
ltx/swh_redirects_oak/oc.m6.d5:ocMA.OdeW7C23.ode	@ltx/swh_ke_oak/oc.m6.d5:ocMA.OdeW7C23.ode
ltx/swh_redirects_oak/oc.m6.d5:ocMA.OdeW7C23.text	@ltx/swh_ke_oak/oc.m6.d5:ocMA.OdeW7C23.text
ltx/swh_redirects_oak/oc.m6.d5:ocMA.OdeW7C2T.incipit	@ltx/swh_ke_oak/oc.m6.d5:ocMA.OdeW7C2T.incipit
ltx/swh_redirects_oak/oc.m6.d5:ocMA.OdeW7C2T.melody	@ltx/swh_ke_oak/oc.m6.d5:ocMA.OdeW7C2T.melody
ltx/swh_redirects_oak/oc.m6.d5:ocMA.OdeW7C2T.mode	@ltx/swh_ke_oak/oc.m6.d5:ocMA.OdeW7C2T.mode
ltx/swh_redirects_oak/oc.m6.d5:ocMA.OdeW7C2T.ode	@ltx/swh_ke_oak/oc.m6.d5:ocMA.OdeW7C2T.ode
ltx/swh_redirects_oak/oc.m6.d5:ocMA.OdeW7C2T.text	@ltx/swh_ke_oak/oc.m6.d5:ocMA.OdeW7C2T.text
ltx/swh_redirects_oak/oc.m6.d5:ocMA.OdeW8C11.incipit	@ltx/swh_ke_oak/oc.m6.d5:ocMA.OdeW8C11.incipit
ltx/swh_redirects_oak/oc.m6.d5:ocMA.OdeW8C11.melody	@ltx/swh_ke_oak/oc.m6.d5:ocMA.OdeW8C11.melody
ltx/swh_redirects_oak/oc.m6.d5:ocMA.OdeW8C11.mode	@ltx/swh_ke_oak/oc.m6.d5:ocMA.OdeW8C11.mode
ltx/swh_redirects_oak/oc.m6.d5:ocMA.OdeW8C11.ode	@ltx/swh_ke_oak/oc.m6.d5:ocMA.OdeW8C11.ode
ltx/swh_redirects_oak/oc.m6.d5:ocMA.OdeW8C11.text	@ltx/swh_ke_oak/oc.m6.d5:ocMA.OdeW8C11.text
ltx/swh_redirects_oak/oc.m6.d5:ocMA.OdeW8C12.incipit	@ltx/swh_ke_oak/oc.m6.d5:ocMA.OdeW8C12.incipit
ltx/swh_redirects_oak/oc.m6.d5:ocMA.OdeW8C12.melody	@ltx/swh_ke_oak/oc.m6.d5:ocMA.OdeW8C12.melody
ltx/swh_redirects_oak/oc.m6.d5:ocMA.OdeW8C12.mode	@ltx/swh_ke_oak/oc.m6.d5:ocMA.OdeW8C12.mode
ltx/swh_redirects_oak/oc.m6.d5:ocMA.OdeW8C12.ode	@ltx/swh_ke_oak/oc.m6.d5:ocMA.OdeW8C12.ode
ltx/swh_redirects_oak/oc.m6.d5:ocMA.OdeW8C12.text	@ltx/swh_ke_oak/oc.m6.d5:ocMA.OdeW8C12.text
ltx/swh_redirects_oak/oc.m6.d5:ocMA.OdeW8C13.incipit	@ltx/swh_ke_oak/oc.m6.d5:ocMA.OdeW8C13.incipit
ltx/swh_redirects_oak/oc.m6.d5:ocMA.OdeW8C13.melody	@ltx/swh_ke_oak/oc.m6.d5:ocMA.OdeW8C13.melody
ltx/swh_redirects_oak/oc.m6.d5:ocMA.OdeW8C13.mode	@ltx/swh_ke_oak/oc.m6.d5:ocMA.OdeW8C13.mode
ltx/swh_redirects_oak/oc.m6.d5:ocMA.OdeW8C13.ode	@ltx/swh_ke_oak/oc.m6.d5:ocMA.OdeW8C13.ode
ltx/swh_redirects_oak/oc.m6.d5:ocMA.OdeW8C13.text	@ltx/swh_ke_oak/oc.m6.d5:ocMA.OdeW8C13.text
ltx/swh_redirects_oak/oc.m6.d5:ocMA.OdeW8C1H.greekmelody	@ltx/swh_ke_oak/oc.m6.d5:ocMA.OdeW8C1H.greekmelody
ltx/swh_redirects_oak/oc.m6.d5:ocMA.OdeW8C1H.incipit	@ltx/swh_ke_oak/oc.m6.d5:ocMA.OdeW8C1H.incipit
ltx/swh_redirects_oak/oc.m6.d5:ocMA.OdeW8C1H.melody	@ltx/swh_ke_oak/oc.m6.d5:ocMA.OdeW8C1H.melody
ltx/swh_redirects_oak/oc.m6.d5:ocMA.OdeW8C1H.mode	@ltx/swh_ke_oak/oc.m6.d5:ocMA.OdeW8C1H.mode
ltx/swh_redirects_oak/oc.m6.d5:ocMA.OdeW8C1H.ode	@ltx/swh_ke_oak/oc.m6.d5:ocMA.OdeW8C1H.ode
ltx/swh_redirects_oak/oc.m6.d5:ocMA.OdeW8C1H.text	@ltx/swh_ke_oak/oc.m6.d5:ocMA.OdeW8C1H.text
ltx/swh_redirects_oak/oc.m6.d5:ocMA.OdeW8C1T.incipit	@ltx/swh_ke_oak/oc.m6.d5:ocMA.OdeW8C1T.incipit
ltx/swh_redirects_oak/oc.m6.d5:ocMA.OdeW8C1T.melody	@ltx/swh_ke_oak/oc.m6.d5:ocMA.OdeW8C1T.melody
ltx/swh_redirects_oak/oc.m6.d5:ocMA.OdeW8C1T.mode	@ltx/swh_ke_oak/oc.m6.d5:ocMA.OdeW8C1T.mode
ltx/swh_redirects_oak/oc.m6.d5:ocMA.OdeW8C1T.ode	@ltx/swh_ke_oak/oc.m6.d5:ocMA.OdeW8C1T.ode
ltx/swh_redirects_oak/oc.m6.d5:ocMA.OdeW8C1T.text	@ltx/swh_ke_oak/oc.m6.d5:ocMA.OdeW8C1T.text
ltx/swh_redirects_oak/oc.m6.d5:ocMA.OdeW8C21.greekmelody	@ltx/swh_ke_oak/oc.m6.d5:ocMA.OdeW8C21.greekmelody
ltx/swh_redirects_oak/oc.m6.d5:ocMA.OdeW8C21.incipit	@ltx/swh_ke_oak/oc.m6.d5:ocMA.OdeW8C21.incipit
ltx/swh_redirects_oak/oc.m6.d5:ocMA.OdeW8C21.melody	@ltx/swh_ke_oak/oc.m6.d5:ocMA.OdeW8C21.melody
ltx/swh_redirects_oak/oc.m6.d5:ocMA.OdeW8C21.mode	@ltx/swh_ke_oak/oc.m6.d5:ocMA.OdeW8C21.mode
ltx/swh_redirects_oak/oc.m6.d5:ocMA.OdeW8C21.ode	@ltx/swh_ke_oak/oc.m6.d5:ocMA.OdeW8C21.ode
ltx/swh_redirects_oak/oc.m6.d5:ocMA.OdeW8C21.text	@ltx/swh_ke_oak/oc.m6.d5:ocMA.OdeW8C21.text
ltx/swh_redirects_oak/oc.m6.d5:ocMA.OdeW8C22.incipit	@ltx/swh_ke_oak/oc.m6.d5:ocMA.OdeW8C22.incipit
ltx/swh_redirects_oak/oc.m6.d5:ocMA.OdeW8C22.melody	@ltx/swh_ke_oak/oc.m6.d5:ocMA.OdeW8C22.melody
ltx/swh_redirects_oak/oc.m6.d5:ocMA.OdeW8C22.mode	@ltx/swh_ke_oak/oc.m6.d5:ocMA.OdeW8C22.mode
ltx/swh_redirects_oak/oc.m6.d5:ocMA.OdeW8C22.ode	@ltx/swh_ke_oak/oc.m6.d5:ocMA.OdeW8C22.ode
ltx/swh_redirects_oak/oc.m6.d5:ocMA.OdeW8C22.text	@ltx/swh_ke_oak/oc.m6.d5:ocMA.OdeW8C22.text
ltx/swh_redirects_oak/oc.m6.d5:ocMA.OdeW8C23.incipit	@ltx/swh_ke_oak/oc.m6.d5:ocMA.OdeW8C23.incipit
ltx/swh_redirects_oak/oc.m6.d5:ocMA.OdeW8C23.melody	@ltx/swh_ke_oak/oc.m6.d5:ocMA.OdeW8C23.melody
ltx/swh_redirects_oak/oc.m6.d5:ocMA.OdeW8C23.mode	@ltx/swh_ke_oak/oc.m6.d5:ocMA.OdeW8C23.mode
ltx/swh_redirects_oak/oc.m6.d5:ocMA.OdeW8C23.ode	@ltx/swh_ke_oak/oc.m6.d5:ocMA.OdeW8C23.ode
ltx/swh_redirects_oak/oc.m6.d5:ocMA.OdeW8C23.text	@ltx/swh_ke_oak/oc.m6.d5:ocMA.OdeW8C23.text
ltx/swh_redirects_oak/oc.m6.d5:ocMA.OdeW8C2T.incipit	@ltx/swh_ke_oak/oc.m6.d5:ocMA.OdeW8C2T.incipit
ltx/swh_redirects_oak/oc.m6.d5:ocMA.OdeW8C2T.melody	@ltx/swh_ke_oak/oc.m6.d5:ocMA.OdeW8C2T.melody
ltx/swh_redirects_oak/oc.m6.d5:ocMA.OdeW8C2T.mode	@ltx/swh_ke_oak/oc.m6.d5:ocMA.OdeW8C2T.mode
ltx/swh_redirects_oak/oc.m6.d5:ocMA.OdeW8C2T.ode	@ltx/swh_ke_oak/oc.m6.d5:ocMA.OdeW8C2T.ode
ltx/swh_redirects_oak/oc.m6.d5:ocMA.OdeW8C2T.text	@ltx/swh_ke_oak/oc.m6.d5:ocMA.OdeW8C2T.text
ltx/swh_redirects_oak/oc.m6.d5:ocMA.OdeW9C11.incipit	@ltx/swh_ke_oak/oc.m6.d5:ocMA.OdeW9C11.incipit
ltx/swh_redirects_oak/oc.m6.d5:ocMA.OdeW9C11.melody	@ltx/swh_ke_oak/oc.m6.d5:ocMA.OdeW9C11.melody
ltx/swh_redirects_oak/oc.m6.d5:ocMA.OdeW9C11.mode	@ltx/swh_ke_oak/oc.m6.d5:ocMA.OdeW9C11.mode
ltx/swh_redirects_oak/oc.m6.d5:ocMA.OdeW9C11.ode	@ltx/swh_ke_oak/oc.m6.d5:ocMA.OdeW9C11.ode
ltx/swh_redirects_oak/oc.m6.d5:ocMA.OdeW9C11.text	@ltx/swh_ke_oak/oc.m6.d5:ocMA.OdeW9C11.text
ltx/swh_redirects_oak/oc.m6.d5:ocMA.OdeW9C12.incipit	@ltx/swh_ke_oak/oc.m6.d5:ocMA.OdeW9C12.incipit
ltx/swh_redirects_oak/oc.m6.d5:ocMA.OdeW9C12.melody	@ltx/swh_ke_oak/oc.m6.d5:ocMA.OdeW9C12.melody
ltx/swh_redirects_oak/oc.m6.d5:ocMA.OdeW9C12.mode	@ltx/swh_ke_oak/oc.m6.d5:ocMA.OdeW9C12.mode
ltx/swh_redirects_oak/oc.m6.d5:ocMA.OdeW9C12.ode	@ltx/swh_ke_oak/oc.m6.d5:ocMA.OdeW9C12.ode
ltx/swh_redirects_oak/oc.m6.d5:ocMA.OdeW9C12.text	@ltx/swh_ke_oak/oc.m6.d5:ocMA.OdeW9C12.text
ltx/swh_redirects_oak/oc.m6.d5:ocMA.OdeW9C13.incipit	@ltx/swh_ke_oak/oc.m6.d5:ocMA.OdeW9C13.incipit
ltx/swh_redirects_oak/oc.m6.d5:ocMA.OdeW9C13.melody	@ltx/swh_ke_oak/oc.m6.d5:ocMA.OdeW9C13.melody
ltx/swh_redirects_oak/oc.m6.d5:ocMA.OdeW9C13.mode	@ltx/swh_ke_oak/oc.m6.d5:ocMA.OdeW9C13.mode
ltx/swh_redirects_oak/oc.m6.d5:ocMA.OdeW9C13.ode	@ltx/swh_ke_oak/oc.m6.d5:ocMA.OdeW9C13.ode
ltx/swh_redirects_oak/oc.m6.d5:ocMA.OdeW9C13.text	@ltx/swh_ke_oak/oc.m6.d5:ocMA.OdeW9C13.text
ltx/swh_redirects_oak/oc.m6.d5:ocMA.OdeW9C1H.greekmelody	@ltx/swh_ke_oak/oc.m6.d5:ocMA.OdeW9C1H.greekmelody
ltx/swh_redirects_oak/oc.m6.d5:ocMA.OdeW9C1H.incipit	@ltx/swh_ke_oak/oc.m6.d5:ocMA.OdeW9C1H.incipit
ltx/swh_redirects_oak/oc.m6.d5:ocMA.OdeW9C1H.melody	@ltx/swh_ke_oak/oc.m6.d5:ocMA.OdeW9C1H.melody
ltx/swh_redirects_oak/oc.m6.d5:ocMA.OdeW9C1H.mode	@ltx/swh_ke_oak/oc.m6.d5:ocMA.OdeW9C1H.mode
ltx/swh_redirects_oak/oc.m6.d5:ocMA.OdeW9C1H.ode	@ltx/swh_ke_oak/oc.m6.d5:ocMA.OdeW9C1H.ode
ltx/swh_redirects_oak/oc.m6.d5:ocMA.OdeW9C1H.text	@ltx/swh_ke_oak/oc.m6.d5:ocMA.OdeW9C1H.text
ltx/swh_redirects_oak/oc.m6.d5:ocMA.OdeW9C1T.incipit	@ltx/swh_ke_oak/oc.m6.d5:ocMA.OdeW9C1T.incipit
ltx/swh_redirects_oak/oc.m6.d5:ocMA.OdeW9C1T.melody	@ltx/swh_ke_oak/oc.m6.d5:ocMA.OdeW9C1T.melody
ltx/swh_redirects_oak/oc.m6.d5:ocMA.OdeW9C1T.mode	@ltx/swh_ke_oak/oc.m6.d5:ocMA.OdeW9C1T.mode
ltx/swh_redirects_oak/oc.m6.d5:ocMA.OdeW9C1T.ode	@ltx/swh_ke_oak/oc.m6.d5:ocMA.OdeW9C1T.ode
ltx/swh_redirects_oak/oc.m6.d5:ocMA.OdeW9C1T.text	@ltx/swh_ke_oak/oc.m6.d5:ocMA.OdeW9C1T.text
ltx/swh_redirects_oak/oc.m6.d5:ocMA.OdeW9C21.greekmelody	@ltx/swh_ke_oak/oc.m6.d5:ocMA.OdeW9C21.greekmelody
ltx/swh_redirects_oak/oc.m6.d5:ocMA.OdeW9C21.incipit	@ltx/swh_ke_oak/oc.m6.d5:ocMA.OdeW9C21.incipit
ltx/swh_redirects_oak/oc.m6.d5:ocMA.OdeW9C21.melody	@ltx/swh_ke_oak/oc.m6.d5:ocMA.OdeW9C21.melody
ltx/swh_redirects_oak/oc.m6.d5:ocMA.OdeW9C21.mode	@ltx/swh_ke_oak/oc.m6.d5:ocMA.OdeW9C21.mode
ltx/swh_redirects_oak/oc.m6.d5:ocMA.OdeW9C21.ode	@ltx/swh_ke_oak/oc.m6.d5:ocMA.OdeW9C21.ode
ltx/swh_redirects_oak/oc.m6.d5:ocMA.OdeW9C21.text	@ltx/swh_ke_oak/oc.m6.d5:ocMA.OdeW9C21.text
ltx/swh_redirects_oak/oc.m6.d5:ocMA.OdeW9C22.incipit	@ltx/swh_ke_oak/oc.m6.d5:ocMA.OdeW9C22.incipit
ltx/swh_redirects_oak/oc.m6.d5:ocMA.OdeW9C22.melody	@ltx/swh_ke_oak/oc.m6.d5:ocMA.OdeW9C22.melody
ltx/swh_redirects_oak/oc.m6.d5:ocMA.OdeW9C22.mode	@ltx/swh_ke_oak/oc.m6.d5:ocMA.OdeW9C22.mode
ltx/swh_redirects_oak/oc.m6.d5:ocMA.OdeW9C22.ode	@ltx/swh_ke_oak/oc.m6.d5:ocMA.OdeW9C22.ode
ltx/swh_redirects_oak/oc.m6.d5:ocMA.OdeW9C22.text	@ltx/swh_ke_oak/oc.m6.d5:ocMA.OdeW9C22.text
ltx/swh_redirects_oak/oc.m6.d5:ocMA.OdeW9C23.incipit	@ltx/swh_ke_oak/oc.m6.d5:ocMA.OdeW9C23.incipit
ltx/swh_redirects_oak/oc.m6.d5:ocMA.OdeW9C23.melody	@ltx/swh_ke_oak/oc.m6.d5:ocMA.OdeW9C23.melody
ltx/swh_redirects_oak/oc.m6.d5:ocMA.OdeW9C23.mode	@ltx/swh_ke_oak/oc.m6.d5:ocMA.OdeW9C23.mode
ltx/swh_redirects_oak/oc.m6.d5:ocMA.OdeW9C23.ode	@ltx/swh_ke_oak/oc.m6.d5:ocMA.OdeW9C23.ode
ltx/swh_redirects_oak/oc.m6.d5:ocMA.OdeW9C23.text	@ltx/swh_ke_oak/oc.m6.d5:ocMA.OdeW9C23.text
ltx/swh_redirects_oak/oc.m6.d5:ocMA.OdeW9C24.incipit	@ltx/swh_ke_oak/oc.m6.d5:ocMA.OdeW9C24.incipit
ltx/swh_redirects_oak/oc.m6.d5:ocMA.OdeW9C24.melody	@ltx/swh_ke_oak/oc.m6.d5:ocMA.OdeW9C24.melody
ltx/swh_redirects_oak/oc.m6.d5:ocMA.OdeW9C24.mode	@ltx/swh_ke_oak/oc.m6.d5:ocMA.OdeW9C24.mode
ltx/swh_redirects_oak/oc.m6.d5:ocMA.OdeW9C24.ode	@ltx/swh_ke_oak/oc.m6.d5:ocMA.OdeW9C24.ode
ltx/swh_redirects_oak/oc.m6.d5:ocMA.OdeW9C24.text	@ltx/swh_ke_oak/oc.m6.d5:ocMA.OdeW9C24.text
ltx/swh_redirects_oak/oc.m6.d5:ocMA.OdeW9C2T.incipit	@ltx/swh_ke_oak/oc.m6.d5:ocMA.OdeW9C2T.incipit
ltx/swh_redirects_oak/oc.m6.d5:ocMA.OdeW9C2T.melody	@ltx/swh_ke_oak/oc.m6.d5:ocMA.OdeW9C2T.melody
ltx/swh_redirects_oak/oc.m6.d5:ocMA.OdeW9C2T.mode	@ltx/swh_ke_oak/oc.m6.d5:ocMA.OdeW9C2T.mode
ltx/swh_redirects_oak/oc.m6.d5:ocMA.OdeW9C2T.ode	@ltx/swh_ke_oak/oc.m6.d5:ocMA.OdeW9C2T.ode
ltx/swh_redirects_oak/oc.m6.d5:ocMA.OdeW9C2T.text	@ltx/swh_ke_oak/oc.m6.d5:ocMA.OdeW9C2T.text
ltx/swh_redirects_oak/oc.m6.d5:ocVE.ApolTheotokionVM.greekmelody	@ltx/swh_ke_oak/oc.m6.d5:ocVE.ApolTheotokionVM.greekmelody
ltx/swh_redirects_oak/oc.m6.d5:ocVE.ApolTheotokionVM.incipit	@ltx/swh_ke_oak/oc.m6.d5:ocVE.ApolTheotokionVM.incipit
ltx/swh_redirects_oak/oc.m6.d5:ocVE.ApolTheotokionVM.melody	@ltx/swh_ke_oak/oc.m6.d5:ocVE.ApolTheotokionVM.melody
ltx/swh_redirects_oak/oc.m6.d5:ocVE.ApolTheotokionVM.mode	@ltx/swh_ke_oak/oc.m6.d5:ocVE.ApolTheotokionVM.mode
ltx/swh_redirects_oak/oc.m6.d5:ocVE.ApolTheotokionVM.text	@ltx/swh_ke_oak/oc.m6.d5:ocVE.ApolTheotokionVM.text
ltx/swh_redirects_oak/oc.m6.d5:ocVE.AposTheotokion.incipit	@ltx/swh_ke_oak/oc.m6.d5:ocVE.AposTheotokion.incipit
ltx/swh_redirects_oak/oc.m6.d5:ocVE.AposTheotokion.melody	@ltx/swh_ke_oak/oc.m6.d5:ocVE.AposTheotokion.melody
ltx/swh_redirects_oak/oc.m6.d5:ocVE.AposTheotokion.mode	@ltx/swh_ke_oak/oc.m6.d5:ocVE.AposTheotokion.mode
ltx/swh_redirects_oak/oc.m6.d5:ocVE.AposTheotokion.text	@ltx/swh_ke_oak/oc.m6.d5:ocVE.AposTheotokion.text
ltx/swh_redirects_oak/oc.m6.d5:ocVE.Aposticha1.incipit	@ltx/swh_ke_oak/oc.m6.d5:ocVE.Aposticha1.incipit
ltx/swh_redirects_oak/oc.m6.d5:ocVE.Aposticha1.melody	@ltx/swh_ke_oak/oc.m6.d5:ocVE.Aposticha1.melody
ltx/swh_redirects_oak/oc.m6.d5:ocVE.Aposticha1.mode	@ltx/swh_ke_oak/oc.m6.d5:ocVE.Aposticha1.mode
ltx/swh_redirects_oak/oc.m6.d5:ocVE.Aposticha1.text	@ltx/swh_ke_oak/oc.m6.d5:ocVE.Aposticha1.text
ltx/swh_redirects_oak/oc.m6.d5:ocVE.Aposticha2.incipit	@ltx/swh_ke_oak/oc.m6.d5:ocVE.Aposticha2.incipit
ltx/swh_redirects_oak/oc.m6.d5:ocVE.Aposticha2.melody	@ltx/swh_ke_oak/oc.m6.d5:ocVE.Aposticha2.melody
ltx/swh_redirects_oak/oc.m6.d5:ocVE.Aposticha2.mode	@ltx/swh_ke_oak/oc.m6.d5:ocVE.Aposticha2.mode
ltx/swh_redirects_oak/oc.m6.d5:ocVE.Aposticha2.text	@ltx/swh_ke_oak/oc.m6.d5:ocVE.Aposticha2.text
ltx/swh_redirects_oak/oc.m6.d5:ocVE.Aposticha3.incipit	@ltx/swh_ke_oak/oc.m6.d5:ocVE.Aposticha3.incipit
ltx/swh_redirects_oak/oc.m6.d5:ocVE.Aposticha3.melody	@ltx/swh_ke_oak/oc.m6.d5:ocVE.Aposticha3.melody
ltx/swh_redirects_oak/oc.m6.d5:ocVE.Aposticha3.mode	@ltx/swh_ke_oak/oc.m6.d5:ocVE.Aposticha3.mode
ltx/swh_redirects_oak/oc.m6.d5:ocVE.Aposticha3.text	@ltx/swh_ke_oak/oc.m6.d5:ocVE.Aposticha3.text
ltx/swh_redirects_oak/oc.m6.d5:ocVE.SticTheotokion.greekmelody	@ltx/swh_ke_oak/oc.m6.d5:ocVE.SticTheotokion.greekmelody
ltx/swh_redirects_oak/oc.m6.d5:ocVE.SticTheotokion.incipit	@ltx/swh_ke_oak/oc.m6.d5:ocVE.SticTheotokion.incipit
ltx/swh_redirects_oak/oc.m6.d5:ocVE.SticTheotokion.melody	@ltx/swh_ke_oak/oc.m6.d5:ocVE.SticTheotokion.melody
ltx/swh_redirects_oak/oc.m6.d5:ocVE.SticTheotokion.mode	@ltx/swh_ke_oak/oc.m6.d5:ocVE.SticTheotokion.mode
ltx/swh_redirects_oak/oc.m6.d5:ocVE.SticTheotokion.text	@ltx/swh_ke_oak/oc.m6.d5:ocVE.SticTheotokion.text
ltx/swh_redirects_oak/oc.m6.d5:ocVE.Stichera1.greekmelody	@ltx/swh_ke_oak/oc.m6.d5:ocVE.Stichera1.greekmelody
ltx/swh_redirects_oak/oc.m6.d5:ocVE.Stichera1.incipit	@ltx/swh_ke_oak/oc.m6.d5:ocVE.Stichera1.incipit
ltx/swh_redirects_oak/oc.m6.d5:ocVE.Stichera1.melody	@ltx/swh_ke_oak/oc.m6.d5:ocVE.Stichera1.melody
ltx/swh_redirects_oak/oc.m6.d5:ocVE.Stichera1.mode	@ltx/swh_ke_oak/oc.m6.d5:ocVE.Stichera1.mode
ltx/swh_redirects_oak/oc.m6.d5:ocVE.Stichera1.text	@ltx/swh_ke_oak/oc.m6.d5:ocVE.Stichera1.text
ltx/swh_redirects_oak/oc.m6.d5:ocVE.Stichera2.incipit	@ltx/swh_ke_oak/oc.m6.d5:ocVE.Stichera2.incipit
ltx/swh_redirects_oak/oc.m6.d5:ocVE.Stichera2.melody	@ltx/swh_ke_oak/oc.m6.d5:ocVE.Stichera2.melody
ltx/swh_redirects_oak/oc.m6.d5:ocVE.Stichera2.mode	@ltx/swh_ke_oak/oc.m6.d5:ocVE.Stichera2.mode
ltx/swh_redirects_oak/oc.m6.d5:ocVE.Stichera2.text	@ltx/swh_ke_oak/oc.m6.d5:ocVE.Stichera2.text
ltx/swh_redirects_oak/oc.m6.d5:ocVE.Stichera3.incipit	@ltx/swh_ke_oak/oc.m6.d5:ocVE.Stichera3.incipit
ltx/swh_redirects_oak/oc.m6.d5:ocVE.Stichera3.melody	@ltx/swh_ke_oak/oc.m6.d5:ocVE.Stichera3.melody
ltx/swh_redirects_oak/oc.m6.d5:ocVE.Stichera3.mode	@ltx/swh_ke_oak/oc.m6.d5:ocVE.Stichera3.mode
ltx/swh_redirects_oak/oc.m6.d5:ocVE.Stichera3.text	@ltx/swh_ke_oak/oc.m6.d5:ocVE.Stichera3.text
ltx/swh_redirects_oak/oc.m6.d5:ocVE.Stichera4.greekmelody	@ltx/swh_ke_oak/oc.m6.d5:ocVE.Stichera4.greekmelody
ltx/swh_redirects_oak/oc.m6.d5:ocVE.Stichera4.incipit	@ltx/swh_ke_oak/oc.m6.d5:ocVE.Stichera4.incipit
ltx/swh_redirects_oak/oc.m6.d5:ocVE.Stichera4.melody	@ltx/swh_ke_oak/oc.m6.d5:ocVE.Stichera4.melody
ltx/swh_redirects_oak/oc.m6.d5:ocVE.Stichera4.mode	@ltx/swh_ke_oak/oc.m6.d5:ocVE.Stichera4.mode
ltx/swh_redirects_oak/oc.m6.d5:ocVE.Stichera4.text	@ltx/swh_ke_oak/oc.m6.d5:ocVE.Stichera4.text
ltx/swh_redirects_oak/oc.m6.d5:ocVE.Stichera5.incipit	@ltx/swh_ke_oak/oc.m6.d5:ocVE.Stichera5.incipit
ltx/swh_redirects_oak/oc.m6.d5:ocVE.Stichera5.melody	@ltx/swh_ke_oak/oc.m6.d5:ocVE.Stichera5.melody
ltx/swh_redirects_oak/oc.m6.d5:ocVE.Stichera5.mode	@ltx/swh_ke_oak/oc.m6.d5:ocVE.Stichera5.mode
ltx/swh_redirects_oak/oc.m6.d5:ocVE.Stichera5.text	@ltx/swh_ke_oak/oc.m6.d5:ocVE.Stichera5.text
ltx/swh_redirects_oak/oc.m6.d5:ocVE.Stichera6.incipit	@ltx/swh_ke_oak/oc.m6.d5:ocVE.Stichera6.incipit
ltx/swh_redirects_oak/oc.m6.d5:ocVE.Stichera6.melody	@ltx/swh_ke_oak/oc.m6.d5:ocVE.Stichera6.melody
ltx/swh_redirects_oak/oc.m6.d5:ocVE.Stichera6.mode	@ltx/swh_ke_oak/oc.m6.d5:ocVE.Stichera6.mode
ltx/swh_redirects_oak/oc.m6.d5:ocVE.Stichera6.text	@ltx/swh_ke_oak/oc.m6.d5:ocVE.Stichera6.text
ltx/swh_redirects_oak/oc.m6.d5:octrMA.Kathisma11.incipit	@ltx/swh_ke_oak/oc.m6.d5:octrMA.Kathisma11.incipit
ltx/swh_redirects_oak/oc.m6.d5:octrMA.Kathisma11.melody	@ltx/swh_ke_oak/oc.m6.d5:octrMA.Kathisma11.melody
ltx/swh_redirects_oak/oc.m6.d5:octrMA.Kathisma11.mode	@ltx/swh_ke_oak/oc.m6.d5:octrMA.Kathisma11.mode
ltx/swh_redirects_oak/oc.m6.d5:octrMA.Kathisma11.text	@ltx/swh_ke_oak/oc.m6.d5:octrMA.Kathisma11.text
ltx/swh_redirects_oak/oc.m6.d5:octrMA.Kathisma12.incipit	@ltx/swh_ke_oak/oc.m6.d5:octrMA.Kathisma12.incipit
ltx/swh_redirects_oak/oc.m6.d5:octrMA.Kathisma12.melody	@ltx/swh_ke_oak/oc.m6.d5:octrMA.Kathisma12.melody
ltx/swh_redirects_oak/oc.m6.d5:octrMA.Kathisma12.mode	@ltx/swh_ke_oak/oc.m6.d5:octrMA.Kathisma12.mode
ltx/swh_redirects_oak/oc.m6.d5:octrMA.Kathisma12.text	@ltx/swh_ke_oak/oc.m6.d5:octrMA.Kathisma12.text
ltx/swh_redirects_oak/oc.m6.d5:octrMA.Kathisma1T.greekmelody	@ltx/swh_ke_oak/oc.m6.d5:octrMA.Kathisma1T.greekmelody
ltx/swh_redirects_oak/oc.m6.d5:octrMA.Kathisma1T.incipit	@ltx/swh_ke_oak/oc.m6.d5:octrMA.Kathisma1T.incipit
ltx/swh_redirects_oak/oc.m6.d5:octrMA.Kathisma1T.melody	@ltx/swh_ke_oak/oc.m6.d5:octrMA.Kathisma1T.melody
ltx/swh_redirects_oak/oc.m6.d5:octrMA.Kathisma1T.mode	@ltx/swh_ke_oak/oc.m6.d5:octrMA.Kathisma1T.mode
ltx/swh_redirects_oak/oc.m6.d5:octrMA.Kathisma1T.text	@ltx/swh_ke_oak/oc.m6.d5:octrMA.Kathisma1T.text
ltx/swh_redirects_oak/oc.m6.d5:octrMA.Ode7Martyricon.incipit	@ltx/swh_ke_oak/oc.m6.d5:octrMA.Ode7Martyricon.incipit
ltx/swh_redirects_oak/oc.m6.d5:octrMA.Ode7Martyricon.melody	@ltx/swh_ke_oak/oc.m6.d5:octrMA.Ode7Martyricon.melody
ltx/swh_redirects_oak/oc.m6.d5:octrMA.Ode7Martyricon.mode	@ltx/swh_ke_oak/oc.m6.d5:octrMA.Ode7Martyricon.mode
ltx/swh_redirects_oak/oc.m6.d5:octrMA.Ode7Martyricon.text	@ltx/swh_ke_oak/oc.m6.d5:octrMA.Ode7Martyricon.text
ltx/swh_redirects_oak/oc.m6.d5:octrMA.Photogogic.incipit	@ltx/swh_ke_oak/oc.m6.d5:octrMA.Photogogic.incipit
ltx/swh_redirects_oak/oc.m6.d5:octrMA.Photogogic.mode	@ltx/swh_ke_oak/oc.m6.d5:octrMA.Photogogic.mode
ltx/swh_redirects_oak/oc.m6.d5:octrMA.Photogogic.text	@ltx/swh_ke_oak/oc.m6.d5:octrMA.Photogogic.text
ltx/swh_redirects_oak/oc.m6.d5:octrMA.Triadic1.incipit	@ltx/swh_ke_oak/oc.m6.d5:octrMA.Triadic1.incipit
ltx/swh_redirects_oak/oc.m6.d5:octrMA.Triadic1.mode	@ltx/swh_ke_oak/oc.m6.d5:octrMA.Triadic1.mode
ltx/swh_redirects_oak/oc.m6.d5:octrMA.Triadic1.text	@ltx/swh_ke_oak/oc.m6.d5:octrMA.Triadic1.text
ltx/swh_redirects_oak/oc.m6.d5:octrMA.Triadic2.incipit	@ltx/swh_ke_oak/oc.m6.d5:octrMA.Triadic2.incipit
ltx/swh_redirects_oak/oc.m6.d5:octrMA.Triadic2.mode	@ltx/swh_ke_oak/oc.m6.d5:octrMA.Triadic2.mode
ltx/swh_redirects_oak/oc.m6.d5:octrMA.Triadic2.text	@ltx/swh_ke_oak/oc.m6.d5:octrMA.Triadic2.text
ltx/swh_redirects_oak/oc.m6.d5:octrMA.Triadic3.incipit	@ltx/swh_ke_oak/oc.m6.d5:octrMA.Triadic3.incipit
ltx/swh_redirects_oak/oc.m6.d5:octrMA.Triadic3.mode	@ltx/swh_ke_oak/oc.m6.d5:octrMA.Triadic3.mode
ltx/swh_redirects_oak/oc.m6.d5:octrMA.Triadic3.text	@ltx/swh_ke_oak/oc.m6.d5:octrMA.Triadic3.text
