ltx/swh_redirects_oak/le.ep.mc.d325:lemcLI.Epistle.book_abbr	@ltx/swh_ke_oak/le.ep.mc.d325:lemcLI.Epistle.book_abbr
ltx/swh_redirects_oak/le.ep.mc.d325:lemcLI.Epistle.book_string	@ltx/swh_ke_oak/le.ep.mc.d325:lemcLI.Epistle.book_string
ltx/swh_redirects_oak/le.ep.mc.d325:lemcLI.Epistle.chapverse	@ltx/swh_ke_oak/le.ep.mc.d325:lemcLI.Epistle.chapverse
ltx/swh_redirects_oak/le.ep.mc.d325:lemcLI.Epistle.incipit	@ltx/swh_ke_oak/le.ep.mc.d325:lemcLI.Epistle.incipit
ltx/swh_redirects_oak/le.ep.mc.d325:lemcLI.Epistle.pagenumber	@ltx/swh_ke_oak/le.ep.mc.d325:lemcLI.Epistle.pagenumber
ltx/swh_redirects_oak/le.ep.mc.d325:lemcLI.Epistle.text	@ltx/swh_ke_oak/le.ep.mc.d325:lemcLI.Epistle.text
ltx/swh_redirects_oak/le.ep.mc.d325:lemcLI.Epistle.title	@ltx/swh_ke_oak/le.ep.mc.d325:lemcLI.Epistle.title
ltx/swh_redirects_oak/le.ep.mc.d325:lemcLI.Epistle.title_abbr	@ltx/swh_ke_oak/le.ep.mc.d325:lemcLI.Epistle.title_abbr
ltx/swh_redirects_oak/le.ep.mc.d325:lemcLI.Epistle.version	@ltx/swh_ke_oak/le.ep.mc.d325:lemcLI.Epistle.version
