ltx/swh_redirects_oak/le.go.lu.d042:leluLI.Gospel.book_abbr	@ltx/swh_ke_oak/le.go.lu.d042:leluLI.Gospel.book_abbr
ltx/swh_redirects_oak/le.go.lu.d042:leluLI.Gospel.book_string	@ltx/swh_ke_oak/le.go.lu.d042:leluLI.Gospel.book_string
ltx/swh_redirects_oak/le.go.lu.d042:leluLI.Gospel.chapverse	@ltx/swh_ke_oak/le.go.lu.d042:leluLI.Gospel.chapverse
ltx/swh_redirects_oak/le.go.lu.d042:leluLI.Gospel.incipit	@ltx/swh_ke_oak/le.go.lu.d042:leluLI.Gospel.incipit
ltx/swh_redirects_oak/le.go.lu.d042:leluLI.Gospel.pagenumber	@ltx/swh_ke_oak/le.go.lu.d042:leluLI.Gospel.pagenumber
ltx/swh_redirects_oak/le.go.lu.d042:leluLI.Gospel.text	@ltx/swh_ke_oak/le.go.lu.d042:leluLI.Gospel.text
ltx/swh_redirects_oak/le.go.lu.d042:leluLI.Gospel.title	@ltx/swh_ke_oak/le.go.lu.d042:leluLI.Gospel.title
ltx/swh_redirects_oak/le.go.lu.d042:leluLI.Gospel.title_abbr	@ltx/swh_ke_oak/le.go.lu.d042:leluLI.Gospel.title_abbr
ltx/swh_redirects_oak/le.go.lu.d042:leluLI.Gospel.version	@ltx/swh_ke_oak/le.go.lu.d042:leluLI.Gospel.version
