ltx/swh_redirects_oak/le.pr.tr.d071:lemcVE.reading1.book_abbr	@ltx/swh_ke_oak/le.pr.tr.d071:lemcVE.reading1.book_abbr
ltx/swh_redirects_oak/le.pr.tr.d071:lemcVE.reading1.book_string	@ltx/swh_ke_oak/le.pr.tr.d071:lemcVE.reading1.book_string
ltx/swh_redirects_oak/le.pr.tr.d071:lemcVE.reading1.chapverse	@ltx/swh_ke_oak/le.pr.tr.d071:lemcVE.reading1.chapverse
ltx/swh_redirects_oak/le.pr.tr.d071:lemcVE.reading1.incipit	@ltx/swh_ke_oak/le.pr.tr.d071:lemcVE.reading1.incipit
ltx/swh_redirects_oak/le.pr.tr.d071:lemcVE.reading1.text	@ltx/swh_ke_oak/le.pr.tr.d071:lemcVE.reading1.text
ltx/swh_redirects_oak/le.pr.tr.d071:lemcVE.reading1.title	@ltx/swh_ke_oak/le.pr.tr.d071:lemcVE.reading1.title
ltx/swh_redirects_oak/le.pr.tr.d071:lemcVE.reading1.title_abbr	@ltx/swh_ke_oak/le.pr.tr.d071:lemcVE.reading1.title_abbr
ltx/swh_redirects_oak/le.pr.tr.d071:lemcVE.reading1.version	@ltx/swh_ke_oak/le.pr.tr.d071:lemcVE.reading1.version
ltx/swh_redirects_oak/le.pr.tr.d071:lemcVE.reading10.book_abbr	@ltx/swh_ke_oak/le.pr.tr.d071:lemcVE.reading10.book_abbr
ltx/swh_redirects_oak/le.pr.tr.d071:lemcVE.reading10.book_string	@ltx/swh_ke_oak/le.pr.tr.d071:lemcVE.reading10.book_string
ltx/swh_redirects_oak/le.pr.tr.d071:lemcVE.reading10.chapverse	@ltx/swh_ke_oak/le.pr.tr.d071:lemcVE.reading10.chapverse
ltx/swh_redirects_oak/le.pr.tr.d071:lemcVE.reading10.incipit	@ltx/swh_ke_oak/le.pr.tr.d071:lemcVE.reading10.incipit
ltx/swh_redirects_oak/le.pr.tr.d071:lemcVE.reading10.text	@ltx/swh_ke_oak/le.pr.tr.d071:lemcVE.reading10.text
ltx/swh_redirects_oak/le.pr.tr.d071:lemcVE.reading10.title	@ltx/swh_ke_oak/le.pr.tr.d071:lemcVE.reading10.title
ltx/swh_redirects_oak/le.pr.tr.d071:lemcVE.reading10.title_abbr	@ltx/swh_ke_oak/le.pr.tr.d071:lemcVE.reading10.title_abbr
ltx/swh_redirects_oak/le.pr.tr.d071:lemcVE.reading10.version	@ltx/swh_ke_oak/le.pr.tr.d071:lemcVE.reading10.version
ltx/swh_redirects_oak/le.pr.tr.d071:lemcVE.reading11.book_abbr	@ltx/swh_ke_oak/le.pr.tr.d071:lemcVE.reading11.book_abbr
ltx/swh_redirects_oak/le.pr.tr.d071:lemcVE.reading11.book_string	@ltx/swh_ke_oak/le.pr.tr.d071:lemcVE.reading11.book_string
ltx/swh_redirects_oak/le.pr.tr.d071:lemcVE.reading11.chapverse	@ltx/swh_ke_oak/le.pr.tr.d071:lemcVE.reading11.chapverse
ltx/swh_redirects_oak/le.pr.tr.d071:lemcVE.reading11.incipit	@ltx/swh_ke_oak/le.pr.tr.d071:lemcVE.reading11.incipit
ltx/swh_redirects_oak/le.pr.tr.d071:lemcVE.reading11.text	@ltx/swh_ke_oak/le.pr.tr.d071:lemcVE.reading11.text
ltx/swh_redirects_oak/le.pr.tr.d071:lemcVE.reading11.title	@ltx/swh_ke_oak/le.pr.tr.d071:lemcVE.reading11.title
ltx/swh_redirects_oak/le.pr.tr.d071:lemcVE.reading11.title_abbr	@ltx/swh_ke_oak/le.pr.tr.d071:lemcVE.reading11.title_abbr
ltx/swh_redirects_oak/le.pr.tr.d071:lemcVE.reading11.version	@ltx/swh_ke_oak/le.pr.tr.d071:lemcVE.reading11.version
ltx/swh_redirects_oak/le.pr.tr.d071:lemcVE.reading12.book_abbr	@ltx/swh_ke_oak/le.pr.tr.d071:lemcVE.reading12.book_abbr
ltx/swh_redirects_oak/le.pr.tr.d071:lemcVE.reading12.book_string	@ltx/swh_ke_oak/le.pr.tr.d071:lemcVE.reading12.book_string
ltx/swh_redirects_oak/le.pr.tr.d071:lemcVE.reading12.chapverse	@ltx/swh_ke_oak/le.pr.tr.d071:lemcVE.reading12.chapverse
ltx/swh_redirects_oak/le.pr.tr.d071:lemcVE.reading12.incipit	@ltx/swh_ke_oak/le.pr.tr.d071:lemcVE.reading12.incipit
ltx/swh_redirects_oak/le.pr.tr.d071:lemcVE.reading12.text	@ltx/swh_ke_oak/le.pr.tr.d071:lemcVE.reading12.text
ltx/swh_redirects_oak/le.pr.tr.d071:lemcVE.reading12.title	@ltx/swh_ke_oak/le.pr.tr.d071:lemcVE.reading12.title
ltx/swh_redirects_oak/le.pr.tr.d071:lemcVE.reading12.title_abbr	@ltx/swh_ke_oak/le.pr.tr.d071:lemcVE.reading12.title_abbr
ltx/swh_redirects_oak/le.pr.tr.d071:lemcVE.reading12.version	@ltx/swh_ke_oak/le.pr.tr.d071:lemcVE.reading12.version
ltx/swh_redirects_oak/le.pr.tr.d071:lemcVE.reading13.book_abbr	@ltx/swh_ke_oak/le.pr.tr.d071:lemcVE.reading13.book_abbr
ltx/swh_redirects_oak/le.pr.tr.d071:lemcVE.reading13.book_string	@ltx/swh_ke_oak/le.pr.tr.d071:lemcVE.reading13.book_string
ltx/swh_redirects_oak/le.pr.tr.d071:lemcVE.reading13.chapverse	@ltx/swh_ke_oak/le.pr.tr.d071:lemcVE.reading13.chapverse
ltx/swh_redirects_oak/le.pr.tr.d071:lemcVE.reading13.incipit	@ltx/swh_ke_oak/le.pr.tr.d071:lemcVE.reading13.incipit
ltx/swh_redirects_oak/le.pr.tr.d071:lemcVE.reading13.text	@ltx/swh_ke_oak/le.pr.tr.d071:lemcVE.reading13.text
ltx/swh_redirects_oak/le.pr.tr.d071:lemcVE.reading13.title	@ltx/swh_ke_oak/le.pr.tr.d071:lemcVE.reading13.title
ltx/swh_redirects_oak/le.pr.tr.d071:lemcVE.reading13.title_abbr	@ltx/swh_ke_oak/le.pr.tr.d071:lemcVE.reading13.title_abbr
ltx/swh_redirects_oak/le.pr.tr.d071:lemcVE.reading13.version	@ltx/swh_ke_oak/le.pr.tr.d071:lemcVE.reading13.version
ltx/swh_redirects_oak/le.pr.tr.d071:lemcVE.reading14.book_abbr	@ltx/swh_ke_oak/le.pr.tr.d071:lemcVE.reading14.book_abbr
ltx/swh_redirects_oak/le.pr.tr.d071:lemcVE.reading14.book_string	@ltx/swh_ke_oak/le.pr.tr.d071:lemcVE.reading14.book_string
ltx/swh_redirects_oak/le.pr.tr.d071:lemcVE.reading14.chapverse	@ltx/swh_ke_oak/le.pr.tr.d071:lemcVE.reading14.chapverse
ltx/swh_redirects_oak/le.pr.tr.d071:lemcVE.reading14.incipit	@ltx/swh_ke_oak/le.pr.tr.d071:lemcVE.reading14.incipit
ltx/swh_redirects_oak/le.pr.tr.d071:lemcVE.reading14.text	@ltx/swh_ke_oak/le.pr.tr.d071:lemcVE.reading14.text
ltx/swh_redirects_oak/le.pr.tr.d071:lemcVE.reading14.title	@ltx/swh_ke_oak/le.pr.tr.d071:lemcVE.reading14.title
ltx/swh_redirects_oak/le.pr.tr.d071:lemcVE.reading14.title_abbr	@ltx/swh_ke_oak/le.pr.tr.d071:lemcVE.reading14.title_abbr
ltx/swh_redirects_oak/le.pr.tr.d071:lemcVE.reading14.version	@ltx/swh_ke_oak/le.pr.tr.d071:lemcVE.reading14.version
ltx/swh_redirects_oak/le.pr.tr.d071:lemcVE.reading15.book_abbr	@ltx/swh_ke_oak/le.pr.tr.d071:lemcVE.reading15.book_abbr
ltx/swh_redirects_oak/le.pr.tr.d071:lemcVE.reading15.book_string	@ltx/swh_ke_oak/le.pr.tr.d071:lemcVE.reading15.book_string
ltx/swh_redirects_oak/le.pr.tr.d071:lemcVE.reading15.chapverse	@ltx/swh_ke_oak/le.pr.tr.d071:lemcVE.reading15.chapverse
ltx/swh_redirects_oak/le.pr.tr.d071:lemcVE.reading15.incipit	@ltx/swh_ke_oak/le.pr.tr.d071:lemcVE.reading15.incipit
ltx/swh_redirects_oak/le.pr.tr.d071:lemcVE.reading15.text	@ltx/swh_ke_oak/le.pr.tr.d071:lemcVE.reading15.text
ltx/swh_redirects_oak/le.pr.tr.d071:lemcVE.reading15.title	@ltx/swh_ke_oak/le.pr.tr.d071:lemcVE.reading15.title
ltx/swh_redirects_oak/le.pr.tr.d071:lemcVE.reading15.title_abbr	@ltx/swh_ke_oak/le.pr.tr.d071:lemcVE.reading15.title_abbr
ltx/swh_redirects_oak/le.pr.tr.d071:lemcVE.reading15.version	@ltx/swh_ke_oak/le.pr.tr.d071:lemcVE.reading15.version
ltx/swh_redirects_oak/le.pr.tr.d071:lemcVE.reading2.book_abbr	@ltx/swh_ke_oak/le.pr.tr.d071:lemcVE.reading2.book_abbr
ltx/swh_redirects_oak/le.pr.tr.d071:lemcVE.reading2.book_string	@ltx/swh_ke_oak/le.pr.tr.d071:lemcVE.reading2.book_string
ltx/swh_redirects_oak/le.pr.tr.d071:lemcVE.reading2.chapverse	@ltx/swh_ke_oak/le.pr.tr.d071:lemcVE.reading2.chapverse
ltx/swh_redirects_oak/le.pr.tr.d071:lemcVE.reading2.incipit	@ltx/swh_ke_oak/le.pr.tr.d071:lemcVE.reading2.incipit
ltx/swh_redirects_oak/le.pr.tr.d071:lemcVE.reading2.text	@ltx/swh_ke_oak/le.pr.tr.d071:lemcVE.reading2.text
ltx/swh_redirects_oak/le.pr.tr.d071:lemcVE.reading2.title	@ltx/swh_ke_oak/le.pr.tr.d071:lemcVE.reading2.title
ltx/swh_redirects_oak/le.pr.tr.d071:lemcVE.reading2.title_abbr	@ltx/swh_ke_oak/le.pr.tr.d071:lemcVE.reading2.title_abbr
ltx/swh_redirects_oak/le.pr.tr.d071:lemcVE.reading2.version	@ltx/swh_ke_oak/le.pr.tr.d071:lemcVE.reading2.version
ltx/swh_redirects_oak/le.pr.tr.d071:lemcVE.reading3.book_abbr	@ltx/swh_ke_oak/le.pr.tr.d071:lemcVE.reading3.book_abbr
ltx/swh_redirects_oak/le.pr.tr.d071:lemcVE.reading3.book_string	@ltx/swh_ke_oak/le.pr.tr.d071:lemcVE.reading3.book_string
ltx/swh_redirects_oak/le.pr.tr.d071:lemcVE.reading3.chapverse	@ltx/swh_ke_oak/le.pr.tr.d071:lemcVE.reading3.chapverse
ltx/swh_redirects_oak/le.pr.tr.d071:lemcVE.reading3.incipit	@ltx/swh_ke_oak/le.pr.tr.d071:lemcVE.reading3.incipit
ltx/swh_redirects_oak/le.pr.tr.d071:lemcVE.reading3.text	@ltx/swh_ke_oak/le.pr.tr.d071:lemcVE.reading3.text
ltx/swh_redirects_oak/le.pr.tr.d071:lemcVE.reading3.title	@ltx/swh_ke_oak/le.pr.tr.d071:lemcVE.reading3.title
ltx/swh_redirects_oak/le.pr.tr.d071:lemcVE.reading3.title_abbr	@ltx/swh_ke_oak/le.pr.tr.d071:lemcVE.reading3.title_abbr
ltx/swh_redirects_oak/le.pr.tr.d071:lemcVE.reading3.version	@ltx/swh_ke_oak/le.pr.tr.d071:lemcVE.reading3.version
ltx/swh_redirects_oak/le.pr.tr.d071:lemcVE.reading4.book_abbr	@ltx/swh_ke_oak/le.pr.tr.d071:lemcVE.reading4.book_abbr
ltx/swh_redirects_oak/le.pr.tr.d071:lemcVE.reading4.book_string	@ltx/swh_ke_oak/le.pr.tr.d071:lemcVE.reading4.book_string
ltx/swh_redirects_oak/le.pr.tr.d071:lemcVE.reading4.chapverse	@ltx/swh_ke_oak/le.pr.tr.d071:lemcVE.reading4.chapverse
ltx/swh_redirects_oak/le.pr.tr.d071:lemcVE.reading4.incipit	@ltx/swh_ke_oak/le.pr.tr.d071:lemcVE.reading4.incipit
ltx/swh_redirects_oak/le.pr.tr.d071:lemcVE.reading4.text	@ltx/swh_ke_oak/le.pr.tr.d071:lemcVE.reading4.text
ltx/swh_redirects_oak/le.pr.tr.d071:lemcVE.reading4.title	@ltx/swh_ke_oak/le.pr.tr.d071:lemcVE.reading4.title
ltx/swh_redirects_oak/le.pr.tr.d071:lemcVE.reading4.title_abbr	@ltx/swh_ke_oak/le.pr.tr.d071:lemcVE.reading4.title_abbr
ltx/swh_redirects_oak/le.pr.tr.d071:lemcVE.reading4.version	@ltx/swh_ke_oak/le.pr.tr.d071:lemcVE.reading4.version
ltx/swh_redirects_oak/le.pr.tr.d071:lemcVE.reading5.book_abbr	@ltx/swh_ke_oak/le.pr.tr.d071:lemcVE.reading5.book_abbr
ltx/swh_redirects_oak/le.pr.tr.d071:lemcVE.reading5.book_string	@ltx/swh_ke_oak/le.pr.tr.d071:lemcVE.reading5.book_string
ltx/swh_redirects_oak/le.pr.tr.d071:lemcVE.reading5.chapverse	@ltx/swh_ke_oak/le.pr.tr.d071:lemcVE.reading5.chapverse
ltx/swh_redirects_oak/le.pr.tr.d071:lemcVE.reading5.incipit	@ltx/swh_ke_oak/le.pr.tr.d071:lemcVE.reading5.incipit
ltx/swh_redirects_oak/le.pr.tr.d071:lemcVE.reading5.text	@ltx/swh_ke_oak/le.pr.tr.d071:lemcVE.reading5.text
ltx/swh_redirects_oak/le.pr.tr.d071:lemcVE.reading5.title	@ltx/swh_ke_oak/le.pr.tr.d071:lemcVE.reading5.title
ltx/swh_redirects_oak/le.pr.tr.d071:lemcVE.reading5.title_abbr	@ltx/swh_ke_oak/le.pr.tr.d071:lemcVE.reading5.title_abbr
ltx/swh_redirects_oak/le.pr.tr.d071:lemcVE.reading5.version	@ltx/swh_ke_oak/le.pr.tr.d071:lemcVE.reading5.version
ltx/swh_redirects_oak/le.pr.tr.d071:lemcVE.reading6.book_abbr	@ltx/swh_ke_oak/le.pr.tr.d071:lemcVE.reading6.book_abbr
ltx/swh_redirects_oak/le.pr.tr.d071:lemcVE.reading6.book_string	@ltx/swh_ke_oak/le.pr.tr.d071:lemcVE.reading6.book_string
ltx/swh_redirects_oak/le.pr.tr.d071:lemcVE.reading6.chapverse	@ltx/swh_ke_oak/le.pr.tr.d071:lemcVE.reading6.chapverse
ltx/swh_redirects_oak/le.pr.tr.d071:lemcVE.reading6.incipit	@ltx/swh_ke_oak/le.pr.tr.d071:lemcVE.reading6.incipit
ltx/swh_redirects_oak/le.pr.tr.d071:lemcVE.reading6.text	@ltx/swh_ke_oak/le.pr.tr.d071:lemcVE.reading6.text
ltx/swh_redirects_oak/le.pr.tr.d071:lemcVE.reading6.title	@ltx/swh_ke_oak/le.pr.tr.d071:lemcVE.reading6.title
ltx/swh_redirects_oak/le.pr.tr.d071:lemcVE.reading6.title_abbr	@ltx/swh_ke_oak/le.pr.tr.d071:lemcVE.reading6.title_abbr
ltx/swh_redirects_oak/le.pr.tr.d071:lemcVE.reading6.version	@ltx/swh_ke_oak/le.pr.tr.d071:lemcVE.reading6.version
ltx/swh_redirects_oak/le.pr.tr.d071:lemcVE.reading7.book_abbr	@ltx/swh_ke_oak/le.pr.tr.d071:lemcVE.reading7.book_abbr
ltx/swh_redirects_oak/le.pr.tr.d071:lemcVE.reading7.book_string	@ltx/swh_ke_oak/le.pr.tr.d071:lemcVE.reading7.book_string
ltx/swh_redirects_oak/le.pr.tr.d071:lemcVE.reading7.chapverse	@ltx/swh_ke_oak/le.pr.tr.d071:lemcVE.reading7.chapverse
ltx/swh_redirects_oak/le.pr.tr.d071:lemcVE.reading7.incipit	@ltx/swh_ke_oak/le.pr.tr.d071:lemcVE.reading7.incipit
ltx/swh_redirects_oak/le.pr.tr.d071:lemcVE.reading7.text	@ltx/swh_ke_oak/le.pr.tr.d071:lemcVE.reading7.text
ltx/swh_redirects_oak/le.pr.tr.d071:lemcVE.reading7.title	@ltx/swh_ke_oak/le.pr.tr.d071:lemcVE.reading7.title
ltx/swh_redirects_oak/le.pr.tr.d071:lemcVE.reading7.title_abbr	@ltx/swh_ke_oak/le.pr.tr.d071:lemcVE.reading7.title_abbr
ltx/swh_redirects_oak/le.pr.tr.d071:lemcVE.reading7.version	@ltx/swh_ke_oak/le.pr.tr.d071:lemcVE.reading7.version
ltx/swh_redirects_oak/le.pr.tr.d071:lemcVE.reading8.book_abbr	@ltx/swh_ke_oak/le.pr.tr.d071:lemcVE.reading8.book_abbr
ltx/swh_redirects_oak/le.pr.tr.d071:lemcVE.reading8.book_string	@ltx/swh_ke_oak/le.pr.tr.d071:lemcVE.reading8.book_string
ltx/swh_redirects_oak/le.pr.tr.d071:lemcVE.reading8.chapverse	@ltx/swh_ke_oak/le.pr.tr.d071:lemcVE.reading8.chapverse
ltx/swh_redirects_oak/le.pr.tr.d071:lemcVE.reading8.incipit	@ltx/swh_ke_oak/le.pr.tr.d071:lemcVE.reading8.incipit
ltx/swh_redirects_oak/le.pr.tr.d071:lemcVE.reading8.text	@ltx/swh_ke_oak/le.pr.tr.d071:lemcVE.reading8.text
ltx/swh_redirects_oak/le.pr.tr.d071:lemcVE.reading8.title	@ltx/swh_ke_oak/le.pr.tr.d071:lemcVE.reading8.title
ltx/swh_redirects_oak/le.pr.tr.d071:lemcVE.reading8.title_abbr	@ltx/swh_ke_oak/le.pr.tr.d071:lemcVE.reading8.title_abbr
ltx/swh_redirects_oak/le.pr.tr.d071:lemcVE.reading8.version	@ltx/swh_ke_oak/le.pr.tr.d071:lemcVE.reading8.version
ltx/swh_redirects_oak/le.pr.tr.d071:lemcVE.reading9.book_abbr	@ltx/swh_ke_oak/le.pr.tr.d071:lemcVE.reading9.book_abbr
ltx/swh_redirects_oak/le.pr.tr.d071:lemcVE.reading9.book_string	@ltx/swh_ke_oak/le.pr.tr.d071:lemcVE.reading9.book_string
ltx/swh_redirects_oak/le.pr.tr.d071:lemcVE.reading9.chapverse	@ltx/swh_ke_oak/le.pr.tr.d071:lemcVE.reading9.chapverse
ltx/swh_redirects_oak/le.pr.tr.d071:lemcVE.reading9.incipit	@ltx/swh_ke_oak/le.pr.tr.d071:lemcVE.reading9.incipit
ltx/swh_redirects_oak/le.pr.tr.d071:lemcVE.reading9.text	@ltx/swh_ke_oak/le.pr.tr.d071:lemcVE.reading9.text
ltx/swh_redirects_oak/le.pr.tr.d071:lemcVE.reading9.title	@ltx/swh_ke_oak/le.pr.tr.d071:lemcVE.reading9.title
ltx/swh_redirects_oak/le.pr.tr.d071:lemcVE.reading9.title_abbr	@ltx/swh_ke_oak/le.pr.tr.d071:lemcVE.reading9.title_abbr
ltx/swh_redirects_oak/le.pr.tr.d071:lemcVE.reading9.version	@ltx/swh_ke_oak/le.pr.tr.d071:lemcVE.reading9.version
