ltx/swh_redirects_oak/ho.ho14:hoPH.R01	@ltx/swh_ke_oak/ho.ho14:hoPH.R01
ltx/swh_redirects_oak/ho.ho14:hoPH.R02	@ltx/swh_ke_oak/ho.ho14:hoPH.R02
ltx/swh_redirects_oak/ho.ho14:hoPH.R03	@ltx/swh_ke_oak/ho.ho14:hoPH.R03
ltx/swh_redirects_oak/ho.ho14:hoPH.R04	@ltx/swh_ke_oak/ho.ho14:hoPH.R04
ltx/swh_redirects_oak/ho.ho14:hoPH.Troparion1.incipit	@ltx/swh_ke_oak/ho.ho14:hoPH.Troparion1.incipit
ltx/swh_redirects_oak/ho.ho14:hoPH.Troparion1.text	@ltx/swh_ke_oak/ho.ho14:hoPH.Troparion1.text
ltx/swh_redirects_oak/ho.ho14:hoPH.Troparion2.incipit	@ltx/swh_ke_oak/ho.ho14:hoPH.Troparion2.incipit
ltx/swh_redirects_oak/ho.ho14:hoPH.Troparion2.text	@ltx/swh_ke_oak/ho.ho14:hoPH.Troparion2.text
ltx/swh_redirects_oak/ho.ho14:hoPH.Troparion3.incipit	@ltx/swh_ke_oak/ho.ho14:hoPH.Troparion3.incipit
ltx/swh_redirects_oak/ho.ho14:hoPH.Troparion3.text	@ltx/swh_ke_oak/ho.ho14:hoPH.Troparion3.text
ltx/swh_redirects_oak/ho.ho14:hoPH.Troparion4.incipit	@ltx/swh_ke_oak/ho.ho14:hoPH.Troparion4.incipit
ltx/swh_redirects_oak/ho.ho14:hoPH.Troparion4.text	@ltx/swh_ke_oak/ho.ho14:hoPH.Troparion4.text
ltx/swh_redirects_oak/ho.ho14:hoPH.Troparion5.incipit	@ltx/swh_ke_oak/ho.ho14:hoPH.Troparion5.incipit
ltx/swh_redirects_oak/ho.ho14:hoPH.Troparion5.text	@ltx/swh_ke_oak/ho.ho14:hoPH.Troparion5.text
ltx/swh_redirects_oak/ho.ho14:hoPH.Troparion6.incipit	@ltx/swh_ke_oak/ho.ho14:hoPH.Troparion6.incipit
ltx/swh_redirects_oak/ho.ho14:hoPH.Troparion6.text	@ltx/swh_ke_oak/ho.ho14:hoPH.Troparion6.text
ltx/swh_redirects_oak/ho.ho14:hoPH.Troparion7.incipit	@ltx/swh_ke_oak/ho.ho14:hoPH.Troparion7.incipit
ltx/swh_redirects_oak/ho.ho14:hoPH.Troparion7.text	@ltx/swh_ke_oak/ho.ho14:hoPH.Troparion7.text
ltx/swh_redirects_oak/ho.ho14:hoPH.title	@ltx/swh_ke_oak/ho.ho14:hoPH.title
