ltx/swh_redirects_oak/eu.lipresanctified:euPL.Key0100.title	@ltx/swh_ke_oak/eu.lipresanctified:euPL.Key0100.title
ltx/swh_redirects_oak/eu.lipresanctified:euPL.Key0101.text	@ltx/swh_ke_oak/eu.lipresanctified:euPL.Key0101.text
ltx/swh_redirects_oak/eu.lipresanctified:euPL.Key0102.text	@ltx/swh_ke_oak/eu.lipresanctified:euPL.Key0102.text
ltx/swh_redirects_oak/eu.lipresanctified:euPL.Key0103.text	@ltx/swh_ke_oak/eu.lipresanctified:euPL.Key0103.text
ltx/swh_redirects_oak/eu.lipresanctified:euPL.Key0104.title	@ltx/swh_ke_oak/eu.lipresanctified:euPL.Key0104.title
ltx/swh_redirects_oak/eu.lipresanctified:euPL.Key0105.text	@ltx/swh_ke_oak/eu.lipresanctified:euPL.Key0105.text
ltx/swh_redirects_oak/eu.lipresanctified:euPL.Key0106.text	@ltx/swh_ke_oak/eu.lipresanctified:euPL.Key0106.text
ltx/swh_redirects_oak/eu.lipresanctified:euPL.Key0107.text	@ltx/swh_ke_oak/eu.lipresanctified:euPL.Key0107.text
ltx/swh_redirects_oak/eu.lipresanctified:euPL.Key0108.text	@ltx/swh_ke_oak/eu.lipresanctified:euPL.Key0108.text
ltx/swh_redirects_oak/eu.lipresanctified:euPL.Key0200.title	@ltx/swh_ke_oak/eu.lipresanctified:euPL.Key0200.title
ltx/swh_redirects_oak/eu.lipresanctified:euPL.Key0201.text	@ltx/swh_ke_oak/eu.lipresanctified:euPL.Key0201.text
ltx/swh_redirects_oak/eu.lipresanctified:euPL.Key0203.text	@ltx/swh_ke_oak/eu.lipresanctified:euPL.Key0203.text
ltx/swh_redirects_oak/eu.lipresanctified:euPL.Key0203.title	@ltx/swh_ke_oak/eu.lipresanctified:euPL.Key0203.title
ltx/swh_redirects_oak/eu.lipresanctified:euPL.Key0204.text	@ltx/swh_ke_oak/eu.lipresanctified:euPL.Key0204.text
ltx/swh_redirects_oak/eu.lipresanctified:euPL.Key0300.title	@ltx/swh_ke_oak/eu.lipresanctified:euPL.Key0300.title
ltx/swh_redirects_oak/eu.lipresanctified:euPL.Key0306.text	@ltx/swh_ke_oak/eu.lipresanctified:euPL.Key0306.text
ltx/swh_redirects_oak/eu.lipresanctified:euPL.Key0306.title	@ltx/swh_ke_oak/eu.lipresanctified:euPL.Key0306.title
ltx/swh_redirects_oak/eu.lipresanctified:euPL.Key0307.text	@ltx/swh_ke_oak/eu.lipresanctified:euPL.Key0307.text
ltx/swh_redirects_oak/eu.lipresanctified:euPL.Key0400.title	@ltx/swh_ke_oak/eu.lipresanctified:euPL.Key0400.title
ltx/swh_redirects_oak/eu.lipresanctified:euPL.Key0406.text	@ltx/swh_ke_oak/eu.lipresanctified:euPL.Key0406.text
ltx/swh_redirects_oak/eu.lipresanctified:euPL.Key0406.title	@ltx/swh_ke_oak/eu.lipresanctified:euPL.Key0406.title
ltx/swh_redirects_oak/eu.lipresanctified:euPL.Key0407.text	@ltx/swh_ke_oak/eu.lipresanctified:euPL.Key0407.text
ltx/swh_redirects_oak/eu.lipresanctified:euPL.Key0500.title	@ltx/swh_ke_oak/eu.lipresanctified:euPL.Key0500.title
ltx/swh_redirects_oak/eu.lipresanctified:euPL.Key0506.text	@ltx/swh_ke_oak/eu.lipresanctified:euPL.Key0506.text
ltx/swh_redirects_oak/eu.lipresanctified:euPL.Key0506.title	@ltx/swh_ke_oak/eu.lipresanctified:euPL.Key0506.title
ltx/swh_redirects_oak/eu.lipresanctified:euPL.Key0507.text	@ltx/swh_ke_oak/eu.lipresanctified:euPL.Key0507.text
ltx/swh_redirects_oak/eu.lipresanctified:euPL.Key0600.title	@ltx/swh_ke_oak/eu.lipresanctified:euPL.Key0600.title
ltx/swh_redirects_oak/eu.lipresanctified:euPL.Key0700.title	@ltx/swh_ke_oak/eu.lipresanctified:euPL.Key0700.title
ltx/swh_redirects_oak/eu.lipresanctified:euPL.Key0701.text	@ltx/swh_ke_oak/eu.lipresanctified:euPL.Key0701.text
ltx/swh_redirects_oak/eu.lipresanctified:euPL.Key0702.text	@ltx/swh_ke_oak/eu.lipresanctified:euPL.Key0702.text
ltx/swh_redirects_oak/eu.lipresanctified:euPL.Key0800.text	@ltx/swh_ke_oak/eu.lipresanctified:euPL.Key0800.text
ltx/swh_redirects_oak/eu.lipresanctified:euPL.Key0800.title	@ltx/swh_ke_oak/eu.lipresanctified:euPL.Key0800.title
ltx/swh_redirects_oak/eu.lipresanctified:euPL.Key0901.text	@ltx/swh_ke_oak/eu.lipresanctified:euPL.Key0901.text
ltx/swh_redirects_oak/eu.lipresanctified:euPL.Key0901.title	@ltx/swh_ke_oak/eu.lipresanctified:euPL.Key0901.title
ltx/swh_redirects_oak/eu.lipresanctified:euPL.Key0902.text	@ltx/swh_ke_oak/eu.lipresanctified:euPL.Key0902.text
ltx/swh_redirects_oak/eu.lipresanctified:euPL.Key0903.text	@ltx/swh_ke_oak/eu.lipresanctified:euPL.Key0903.text
ltx/swh_redirects_oak/eu.lipresanctified:euPL.Key0903.title	@ltx/swh_ke_oak/eu.lipresanctified:euPL.Key0903.title
ltx/swh_redirects_oak/eu.lipresanctified:euPL.Key0904.text	@ltx/swh_ke_oak/eu.lipresanctified:euPL.Key0904.text
ltx/swh_redirects_oak/eu.lipresanctified:euPL.Key0905.text	@ltx/swh_ke_oak/eu.lipresanctified:euPL.Key0905.text
ltx/swh_redirects_oak/eu.lipresanctified:euPL.Key0905.title	@ltx/swh_ke_oak/eu.lipresanctified:euPL.Key0905.title
ltx/swh_redirects_oak/eu.lipresanctified:euPL.Key0906.text	@ltx/swh_ke_oak/eu.lipresanctified:euPL.Key0906.text
ltx/swh_redirects_oak/eu.lipresanctified:euPL.Key0907.text	@ltx/swh_ke_oak/eu.lipresanctified:euPL.Key0907.text
ltx/swh_redirects_oak/eu.lipresanctified:euPL.Key0907.title	@ltx/swh_ke_oak/eu.lipresanctified:euPL.Key0907.title
ltx/swh_redirects_oak/eu.lipresanctified:euPL.Key0908.text	@ltx/swh_ke_oak/eu.lipresanctified:euPL.Key0908.text
ltx/swh_redirects_oak/eu.lipresanctified:euPL.Key1000.title	@ltx/swh_ke_oak/eu.lipresanctified:euPL.Key1000.title
ltx/swh_redirects_oak/eu.lipresanctified:euPL.Key1001.text	@ltx/swh_ke_oak/eu.lipresanctified:euPL.Key1001.text
ltx/swh_redirects_oak/eu.lipresanctified:euPL.Key1002.text	@ltx/swh_ke_oak/eu.lipresanctified:euPL.Key1002.text
ltx/swh_redirects_oak/eu.lipresanctified:euPL.Key1101.text	@ltx/swh_ke_oak/eu.lipresanctified:euPL.Key1101.text
ltx/swh_redirects_oak/eu.lipresanctified:euPL.Key1102.text	@ltx/swh_ke_oak/eu.lipresanctified:euPL.Key1102.text
ltx/swh_redirects_oak/eu.lipresanctified:euPL.Key1102.title	@ltx/swh_ke_oak/eu.lipresanctified:euPL.Key1102.title
ltx/swh_redirects_oak/eu.lipresanctified:euPL.Key1103.text	@ltx/swh_ke_oak/eu.lipresanctified:euPL.Key1103.text
ltx/swh_redirects_oak/eu.lipresanctified:euPL.Key1103.title	@ltx/swh_ke_oak/eu.lipresanctified:euPL.Key1103.title
ltx/swh_redirects_oak/eu.lipresanctified:euPL.Key1104.text	@ltx/swh_ke_oak/eu.lipresanctified:euPL.Key1104.text
ltx/swh_redirects_oak/eu.lipresanctified:euPL.Key1201.text	@ltx/swh_ke_oak/eu.lipresanctified:euPL.Key1201.text
ltx/swh_redirects_oak/eu.lipresanctified:euPL.Key1201.title	@ltx/swh_ke_oak/eu.lipresanctified:euPL.Key1201.title
ltx/swh_redirects_oak/eu.lipresanctified:euPL.Key1202.text	@ltx/swh_ke_oak/eu.lipresanctified:euPL.Key1202.text
ltx/swh_redirects_oak/eu.lipresanctified:euPL.Key1202.title	@ltx/swh_ke_oak/eu.lipresanctified:euPL.Key1202.title
ltx/swh_redirects_oak/eu.lipresanctified:euPL.Key1203.text	@ltx/swh_ke_oak/eu.lipresanctified:euPL.Key1203.text
ltx/swh_redirects_oak/eu.lipresanctified:euPL.Key1204.text	@ltx/swh_ke_oak/eu.lipresanctified:euPL.Key1204.text
ltx/swh_redirects_oak/eu.lipresanctified:euPL.Key1204.title	@ltx/swh_ke_oak/eu.lipresanctified:euPL.Key1204.title
ltx/swh_redirects_oak/eu.lipresanctified:euPL.Key1205.text	@ltx/swh_ke_oak/eu.lipresanctified:euPL.Key1205.text
ltx/swh_redirects_oak/eu.lipresanctified:euPL.Key1206.text	@ltx/swh_ke_oak/eu.lipresanctified:euPL.Key1206.text
ltx/swh_redirects_oak/eu.lipresanctified:euPL.Key1206.title	@ltx/swh_ke_oak/eu.lipresanctified:euPL.Key1206.title
ltx/swh_redirects_oak/eu.lipresanctified:euPL.Key1207.text	@ltx/swh_ke_oak/eu.lipresanctified:euPL.Key1207.text
ltx/swh_redirects_oak/eu.lipresanctified:euPL.Key1208.text	@ltx/swh_ke_oak/eu.lipresanctified:euPL.Key1208.text
ltx/swh_redirects_oak/eu.lipresanctified:euPL.Key1208.title	@ltx/swh_ke_oak/eu.lipresanctified:euPL.Key1208.title
ltx/swh_redirects_oak/eu.lipresanctified:euPL.title	@ltx/swh_ke_oak/eu.lipresanctified:euPL.title
