ltx/swh_redirects_oak/ty.m01.d11:tyCommemoration.text	@ltx/swh_ke_oak/ty.m01.d11:tyCommemoration.text
ltx/swh_redirects_oak/ty.m01.d11:tyDate.text	@ltx/swh_ke_oak/ty.m01.d11:tyDate.text
ltx/swh_redirects_oak/ty.m01.d11:tyLI.AfterCommunion.text	@ltx/swh_ke_oak/ty.m01.d11:tyLI.AfterCommunion.text
ltx/swh_redirects_oak/ty.m01.d11:tyLI.AmboPrayer.text	@ltx/swh_ke_oak/ty.m01.d11:tyLI.AmboPrayer.text
ltx/swh_redirects_oak/ty.m01.d11:tyLI.Antiphons.text	@ltx/swh_ke_oak/ty.m01.d11:tyLI.Antiphons.text
ltx/swh_redirects_oak/ty.m01.d11:tyLI.Apolytikia.text	@ltx/swh_ke_oak/ty.m01.d11:tyLI.Apolytikia.text
ltx/swh_redirects_oak/ty.m01.d11:tyLI.CommunionHymn.text	@ltx/swh_ke_oak/ty.m01.d11:tyLI.CommunionHymn.text
ltx/swh_redirects_oak/ty.m01.d11:tyLI.Dismissal.text	@ltx/swh_ke_oak/ty.m01.d11:tyLI.Dismissal.text
ltx/swh_redirects_oak/ty.m01.d11:tyLI.EntranceHymn.text	@ltx/swh_ke_oak/ty.m01.d11:tyLI.EntranceHymn.text
ltx/swh_redirects_oak/ty.m01.d11:tyLI.Epistle.text	@ltx/swh_ke_oak/ty.m01.d11:tyLI.Epistle.text
ltx/swh_redirects_oak/ty.m01.d11:tyLI.Gospel.text	@ltx/swh_ke_oak/ty.m01.d11:tyLI.Gospel.text
ltx/swh_redirects_oak/ty.m01.d11:tyLI.Kontakion.text	@ltx/swh_ke_oak/ty.m01.d11:tyLI.Kontakion.text
ltx/swh_redirects_oak/ty.m01.d11:tyLI.Megalynarion.text	@ltx/swh_ke_oak/ty.m01.d11:tyLI.Megalynarion.text
ltx/swh_redirects_oak/ty.m01.d11:tyLI.TheotokosHymn.text	@ltx/swh_ke_oak/ty.m01.d11:tyLI.TheotokosHymn.text
ltx/swh_redirects_oak/ty.m01.d11:tyMA.Anavathmoi.text	@ltx/swh_ke_oak/ty.m01.d11:tyMA.Anavathmoi.text
ltx/swh_redirects_oak/ty.m01.d11:tyMA.Apolytikia.text	@ltx/swh_ke_oak/ty.m01.d11:tyMA.Apolytikia.text
ltx/swh_redirects_oak/ty.m01.d11:tyMA.Canons.text	@ltx/swh_ke_oak/ty.m01.d11:tyMA.Canons.text
ltx/swh_redirects_oak/ty.m01.d11:tyMA.Doxology.text	@ltx/swh_ke_oak/ty.m01.d11:tyMA.Doxology.text
ltx/swh_redirects_oak/ty.m01.d11:tyMA.EndApolytikion.text	@ltx/swh_ke_oak/ty.m01.d11:tyMA.EndApolytikion.text
ltx/swh_redirects_oak/ty.m01.d11:tyMA.Exaposteilaria.text	@ltx/swh_ke_oak/ty.m01.d11:tyMA.Exaposteilaria.text
ltx/swh_redirects_oak/ty.m01.d11:tyMA.Katavasias.text	@ltx/swh_ke_oak/ty.m01.d11:tyMA.Katavasias.text
ltx/swh_redirects_oak/ty.m01.d11:tyMA.Kathismata.text	@ltx/swh_ke_oak/ty.m01.d11:tyMA.Kathismata.text
ltx/swh_redirects_oak/ty.m01.d11:tyMA.KontakionOikos.text	@ltx/swh_ke_oak/ty.m01.d11:tyMA.KontakionOikos.text
ltx/swh_redirects_oak/ty.m01.d11:tyMA.Lauds.text	@ltx/swh_ke_oak/ty.m01.d11:tyMA.Lauds.text
ltx/swh_redirects_oak/ty.m01.d11:tyMA.LaudsBoth.text	@ltx/swh_ke_oak/ty.m01.d11:tyMA.LaudsBoth.text
ltx/swh_redirects_oak/ty.m01.d11:tyMA.LaudsGlory.text	@ltx/swh_ke_oak/ty.m01.d11:tyMA.LaudsGlory.text
ltx/swh_redirects_oak/ty.m01.d11:tyMA.LaudsVerses.text	@ltx/swh_ke_oak/ty.m01.d11:tyMA.LaudsVerses.text
ltx/swh_redirects_oak/ty.m01.d11:tyMA.Magnificat.text	@ltx/swh_ke_oak/ty.m01.d11:tyMA.Magnificat.text
ltx/swh_redirects_oak/ty.m01.d11:tyMA.MatinsGospel.text	@ltx/swh_ke_oak/ty.m01.d11:tyMA.MatinsGospel.text
ltx/swh_redirects_oak/ty.m01.d11:tyMA.MidodeKath.text	
ltx/swh_redirects_oak/ty.m01.d11:tyMA.MidodeKontakion.text	
ltx/swh_redirects_oak/ty.m01.d11:tyMA.Ode9_1.text	@ltx/swh_ke_oak/ty.m01.d11:tyMA.Ode9_1.text
ltx/swh_redirects_oak/ty.m01.d11:tyMA.Ode9_2.text	@ltx/swh_ke_oak/ty.m01.d11:tyMA.Ode9_2.text
ltx/swh_redirects_oak/ty.m01.d11:tyMA.Ode9_3.text	@ltx/swh_ke_oak/ty.m01.d11:tyMA.Ode9_3.text
ltx/swh_redirects_oak/ty.m01.d11:tyMA.Ode9_4.text	@ltx/swh_ke_oak/ty.m01.d11:tyMA.Ode9_4.text
ltx/swh_redirects_oak/ty.m01.d11:tyMA.Ode9_5.text	@ltx/swh_ke_oak/ty.m01.d11:tyMA.Ode9_5.text
ltx/swh_redirects_oak/ty.m01.d11:tyMA.Ode9_6.text	@ltx/swh_ke_oak/ty.m01.d11:tyMA.Ode9_6.text
ltx/swh_redirects_oak/ty.m01.d11:tyMA.Ode9_7.text	@ltx/swh_ke_oak/ty.m01.d11:tyMA.Ode9_7.text
ltx/swh_redirects_oak/ty.m01.d11:tyMA.Ode9_8.text	@ltx/swh_ke_oak/ty.m01.d11:tyMA.Ode9_8.text
ltx/swh_redirects_oak/ty.m01.d11:tyMA.Ode9_Katavasia1.text	@ltx/swh_ke_oak/ty.m01.d11:tyMA.Ode9_Katavasia1.text
ltx/swh_redirects_oak/ty.m01.d11:tyMA.Ode9_Katavasia2.text	@ltx/swh_ke_oak/ty.m01.d11:tyMA.Ode9_Katavasia2.text
ltx/swh_redirects_oak/ty.m01.d11:tyMA.ProkVerse.text	@ltx/swh_ke_oak/ty.m01.d11:tyMA.ProkVerse.text
ltx/swh_redirects_oak/ty.m01.d11:tyMA.Prokeimenon.text	@ltx/swh_ke_oak/ty.m01.d11:tyMA.Prokeimenon.text
ltx/swh_redirects_oak/ty.m01.d11:tyMA.Psalm50.text	@ltx/swh_ke_oak/ty.m01.d11:tyMA.Psalm50.text
ltx/swh_redirects_oak/ty.m01.d11:tyMA.Synaxarion.text	@ltx/swh_ke_oak/ty.m01.d11:tyMA.Synaxarion.text
ltx/swh_redirects_oak/ty.m01.d11:tyMO.Rubric1.text	@ltx/swh_ke_oak/ty.m01.d11:tyMO.Rubric1.text
ltx/swh_redirects_oak/ty.m01.d11:tyNote1.text	@ltx/swh_ke_oak/ty.m01.d11:tyNote1.text
ltx/swh_redirects_oak/ty.m01.d11:tyVE.Apolytikia.text	@ltx/swh_ke_oak/ty.m01.d11:tyVE.Apolytikia.text
ltx/swh_redirects_oak/ty.m01.d11:tyVE.AposBoth.text	@ltx/swh_ke_oak/ty.m01.d11:tyVE.AposBoth.text
ltx/swh_redirects_oak/ty.m01.d11:tyVE.AposGlory.text	@ltx/swh_ke_oak/ty.m01.d11:tyVE.AposGlory.text
ltx/swh_redirects_oak/ty.m01.d11:tyVE.AposGloryBoth.text	
ltx/swh_redirects_oak/ty.m01.d11:tyVE.Aposticha.text	@ltx/swh_ke_oak/ty.m01.d11:tyVE.Aposticha.text
ltx/swh_redirects_oak/ty.m01.d11:tyVE.Dismissal.text	@ltx/swh_ke_oak/ty.m01.d11:tyVE.Dismissal.text
ltx/swh_redirects_oak/ty.m01.d11:tyVE.Entrance.text	@ltx/swh_ke_oak/ty.m01.d11:tyVE.Entrance.text
ltx/swh_redirects_oak/ty.m01.d11:tyVE.Intro.text	@ltx/swh_ke_oak/ty.m01.d11:tyVE.Intro.text
ltx/swh_redirects_oak/ty.m01.d11:tyVE.LIHC.text	@ltx/swh_ke_oak/ty.m01.d11:tyVE.LIHC.text
ltx/swh_redirects_oak/ty.m01.d11:tyVE.Note1.text	@ltx/swh_ke_oak/ty.m01.d11:tyVE.Note1.text
ltx/swh_redirects_oak/ty.m01.d11:tyVE.Note2.text	@ltx/swh_ke_oak/ty.m01.d11:tyVE.Note2.text
ltx/swh_redirects_oak/ty.m01.d11:tyVE.SticBoth.text	@ltx/swh_ke_oak/ty.m01.d11:tyVE.SticBoth.text
ltx/swh_redirects_oak/ty.m01.d11:tyVE.SticGlory.text	@ltx/swh_ke_oak/ty.m01.d11:tyVE.SticGlory.text
ltx/swh_redirects_oak/ty.m01.d11:tyVE.SticGloryBoth.text	
ltx/swh_redirects_oak/ty.m01.d11:tyVE.Stichera.text	@ltx/swh_ke_oak/ty.m01.d11:tyVE.Stichera.text
