ltx/swh_redirects_oak/le.pr.me.r16:leprVE.reading.book_abbr	@ltx/swh_ke_oak/le.pr.me.r16:leprVE.reading.book_abbr
ltx/swh_redirects_oak/le.pr.me.r16:leprVE.reading.book_string	@ltx/swh_ke_oak/le.pr.me.r16:leprVE.reading.book_string
ltx/swh_redirects_oak/le.pr.me.r16:leprVE.reading.chapverse	@ltx/swh_ke_oak/le.pr.me.r16:leprVE.reading.chapverse
ltx/swh_redirects_oak/le.pr.me.r16:leprVE.reading.incipit	@ltx/swh_ke_oak/le.pr.me.r16:leprVE.reading.incipit
ltx/swh_redirects_oak/le.pr.me.r16:leprVE.reading.text	@ltx/swh_ke_oak/le.pr.me.r16:leprVE.reading.text
ltx/swh_redirects_oak/le.pr.me.r16:leprVE.reading.title	@ltx/swh_ke_oak/le.pr.me.r16:leprVE.reading.title
ltx/swh_redirects_oak/le.pr.me.r16:leprVE.reading.title_abbr	@ltx/swh_ke_oak/le.pr.me.r16:leprVE.reading.title_abbr
ltx/swh_redirects_oak/le.pr.me.r16:leprVE.reading.version	@ltx/swh_ke_oak/le.pr.me.r16:leprVE.reading.version
