{
 "Language": "en",
 "Country": "us",
 "Realm": "saas",
 "Description": "English translation of the Orthodox Christian liturgical texts, Scripture taken from the St. Athanasius Academy Septuagint™. Copyright © 2008 by St. Athanasius Academy of Orthodox Theology. Used by permission. All rights reserved., United States",
 "Copyright": "Scripture taken from the St. Athanasius Academy Septuagint™. Copyright © 2008 by St. Athanasius Academy of Orthodox Theology. Used by permission. All rights reserved.",
 "License": "Creative Commons Attribution-NonCommercial-ShareAlike  4.0 International (BY-NC-SA 4.0)",
 "Format": "doxa key = value text files with .dkv extension"
}