{
 "Language": "en",
 "Country": "us",
 "Realm": "net",
 "Description": "English translation of the Orthodox Christian liturgical texts, Scripture and/or notes quoted by permission. Quotations designated (NET) are from the NET Bible® copyright ©1996-2006 by Biblical Studies Press, L.L.C.  All rights reserved., United States",
 "Copyright": "Scripture and/or notes quoted by permission. Quotations designated (NET) are from the NET Bible® copyright ©1996-2006 by Biblical Studies Press, L.L.C.  All rights reserved.",
 "License": "Creative Commons Attribution-NonCommercial-ShareAlike  4.0 International (BY-NC-SA 4.0)",
 "Format": "doxa key = value text files with .dkv extension"
}