{
 "Language": "en",
 "Country": "us",
 "Realm": "dedes",
 "Description": "English translation of the Orthodox Christian liturgical texts, Copyright © 2021 by Fr. Seraphim Dedes, United States",
 "Copyright": "Copyright © 2021 by Fr. Seraphim Dedes",
 "License": "Creative Commons Attribution-NonCommercial-ShareAlike  4.0 International (BY-NC-SA 4.0)",
 "Format": "doxa key = value text files with .dkv extension"
}