{
 "Language": "en",
 "Country": "us",
 "Realm": "boyer",
 "Description": "English translation of the Orthodox Christian liturgical texts, Copyright © 2015 by John Michael Boyer, United States",
 "Copyright": "Copyright © 2015 by John Michael Boyer",
 "License": "Creative Commons Attribution-NonCommercial-ShareAlike  4.0 International (BY-NC-SA 4.0)",
 "Format": "doxa key = value text files with .dkv extension"
}