{
 "Language": "en",
 "Country": "uk",
 "Realm": "ware",
 "Description": "English translation of the Orthodox Christian liturgical texts, © Metropolitan Kallistos Ware, United Kingdom",
 "Copyright": "© Metropolitan Kallistos Ware",
 "License": "Creative Commons Attribution-NonCommercial-ShareAlike  4.0 International (BY-NC-SA 4.0)",
 "Format": "doxa key = value text files with .dkv extension"
}