ltx/en_us_goarch/pdf.covers:Bilingual	Bilingual
ltx/en_us_goarch/pdf.covers:E.text	Text in English
ltx/en_us_goarch/pdf.covers:English	English
ltx/en_us_goarch/pdf.covers:G.text	Text in Greek
ltx/en_us_goarch/pdf.covers:GE.text	Texts in Greek and English
ltx/en_us_goarch/pdf.covers:Greek	Greek
ltx/en_us_goarch/pdf.covers:blank	+
ltx/en_us_goarch/pdf.covers:blank.note	Although the texts of the material found at the beginning of Matins may change during the Pascal season and over time, incorporating improvements and substitutions, we have formatted the document so that the first 12 pages may be saved as a more or less permanent and separate text, allowing the Cantor to download the entire Matins service, but print only the material specific to the day. We shall periodically inform you of any major changes that have taken place within the first part of the service so that you can update the material and thus always have the latest and best of our materials.
ltx/en_us_goarch/pdf.covers:blank.text	This page is intentionally blank.
ltx/en_us_goarch/pdf.covers:logo1.text	DIGITAL CHANT STAND
ltx/en_us_goarch/pdf.covers:logo2.text	OF THE GREEK ORTHODOX ARCHDIOCESE OF AMERICA
ltx/en_us_goarch/pdf.covers:logo_line	_______________________________________________________________________________
ltx/en_us_goarch/pdf.covers:matinsordinary.ascension.link.E	dcs.goarch.org/goa/dcs/p/b/matinsordinary/ascension/en/bk.matinsordinary.ascension.pdf
ltx/en_us_goarch/pdf.covers:matinsordinary.ascension.link.GE	dcs.goarch.org/goa/dcs/p/b/matinsordinary/ascension/gr-en/bk.matinsordinary.ascension.pdf
ltx/en_us_goarch/pdf.covers:matinsordinary.cleanmonday.link.E	dcs.goarch.org/goa/dcs/p/b/matinsordinary/cleanmonday/en/bk.matinsordinary.cleanmonday.pdf
ltx/en_us_goarch/pdf.covers:matinsordinary.cleanmonday.link.GE	dcs.goarch.org/goa/dcs/p/b/matinsordinary/cleanmonday/gr-en/bk.matinsordinary.cleanmonday.pdf
ltx/en_us_goarch/pdf.covers:matinsordinary.lent.link.E	dcs.goarch.org/goa/dcs/p/b/matinsordinary/lent/en/bk.matinsordinary.lent.pdf
ltx/en_us_goarch/pdf.covers:matinsordinary.lent.link.GE	dcs.goarch.org/goa/dcs/p/b/matinsordinary/lent/gr-en/bk.matinsordinary.lent.pdf
ltx/en_us_goarch/pdf.covers:matinsordinary.link.title	Links to Matins Ordinary
ltx/en_us_goarch/pdf.covers:matinsordinary.normal.link.E	dcs.goarch.org/goa/dcs/p/b/matinsordinary/normal/en/bk.matinsordinary.normal.pdf
ltx/en_us_goarch/pdf.covers:matinsordinary.normal.link.GE	dcs.goarch.org/goa/dcs/p/b/matinsordinary/normal/gr-en/bk.matinsordinary.normal.pdf
ltx/en_us_goarch/pdf.covers:matinsordinary.paschal.link.E	dcs.goarch.org/goa/dcs/p/b/matinsordinary/paschal/en/bk.matinsordinary.paschal.pdf
ltx/en_us_goarch/pdf.covers:matinsordinary.paschal.link.GE	dcs.goarch.org/goa/dcs/p/b/matinsordinary/paschal/gr-en/bk.matinsordinary.paschal.pdf
ltx/en_us_goarch/pdf.covers:notice.presanctified.text	This pdf file is intended to be printed once and supplemented with the changeable parts for each day, which are found in the dated services.
ltx/en_us_goarch/pdf.covers:vesperalprayers.link.E	dcs.goarch.org/goa/dcs/p/b/vespersordinary/vesperalprayers/en/bk.vespersordinary.vesperalprayers.pdf
ltx/en_us_goarch/pdf.covers:vesperalprayers.link.GE	dcs.goarch.org/goa/dcs/p/b/vespersordinary/vesperalprayers/gr-en/bk.vespersordinary.vesperalprayers.pdf
ltx/en_us_goarch/pdf.covers:vesperalprayers.link.title	Links to Vesperal Prayers
ltx/en_us_goarch/pdf.covers:vespersordinary.brightweek.link.E	
ltx/en_us_goarch/pdf.covers:vespersordinary.brightweek.link.GE	
ltx/en_us_goarch/pdf.covers:vespersordinary.link.title	Links to Vespers Ordinary
ltx/en_us_goarch/pdf.covers:vespersordinary.normal.link.E	
ltx/en_us_goarch/pdf.covers:vespersordinary.normal.link.GE	
ltx/en_us_goarch/pdf.covers:vespersordinary.paschal.link.E	
ltx/en_us_goarch/pdf.covers:vespersordinary.paschal.link.GE	
ltx/en_us_goarch/pdf.credits:acknowledgements.title	Acknowledgments
ltx/en_us_goarch/pdf.credits:acknowledgements01.text	All rights reserved. The materials contained within this booklet remain the property of all contributing translators. It is published solely for the purpose of providing a source of worship materials to the parishes of the Orthodox Church and may be copied and otherwise reproduced as needed by the parish toward this end; however, it may not be reprinted, reproduced, transmitted, stored in a retrieval system, or translated into any language in any form by any means—electronic, mechanical, recording, or otherwise—for the purpose of sale without the express written permission of the Greek Orthodox Archdiocese of America.
ltx/en_us_goarch/pdf.credits:acknowledgements04.text	This document was produced using the AGES Liturgical Workbench.
ltx/en_us_goarch/pdf.credits:acknowledgements05.text	
ltx/en_us_goarch/pdf.credits:contact.address_1	
ltx/en_us_goarch/pdf.credits:contact.address_2	
ltx/en_us_goarch/pdf.credits:contact.address_3	
ltx/en_us_goarch/pdf.credits:contact.email	dcsinfo@goarch.org
ltx/en_us_goarch/pdf.credits:contact.email.title	Email
ltx/en_us_goarch/pdf.credits:contact.phone	
ltx/en_us_goarch/pdf.credits:disclaimer.title	Disclaimer
ltx/en_us_goarch/pdf.credits:disclaimer01.text	The translation, rubrics, Greek and English texts are for the purposes of worship only and are subject to change without notice at the discretion of the Greek Orthodox Archdiocese of America.
ltx/en_us_goarch/pdf.credits:disclaimer02.text	
ltx/en_us_goarch/pdf.credits:fonts.title	Fonts
ltx/en_us_goarch/pdf.credits:fonts01.text	Font copyright (c) 2010 Google Corporation with Reserved Font Arimo, Tinos and Cousine.
ltx/en_us_goarch/pdf.credits:fonts02.text	Copyright (c) 2012 Red Hat, Inc. with Reserved Font Name Liberation.
ltx/en_us_goarch/pdf.credits:fonts03.text	This Font Software is licensed under the SIL Open Font License, Version 1.1.
ltx/en_us_goarch/pdf.credits:line_break	 
ltx/en_us_goarch/pdf.credits:preface.disclaimer	Disclaimer
ltx/en_us_goarch/pdf.credits:sources.title	Sources
ltx/en_us_goarch/pdf.credits:urls.dcs.goarch.org	https://dcs.goarch.org
ltx/en_us_goarch/pdf.credits:urls.title	GOA DCS Website
ltx/en_us_goarch/website.index.titles:a.html.link	automela
ltx/en_us_goarch/website.index.titles:adv.html.link	Advent
ltx/en_us_goarch/website.index.titles:aff.html.link	Post-Feast
ltx/en_us_goarch/website.index.titles:baptism.html.link	Baptism
ltx/en_us_goarch/website.index.titles:bk.html.link	Book Index
ltx/en_us_goarch/website.index.titles:co.html.link	Evening Compline
ltx/en_us_goarch/website.index.titles:co1.html.link	Pre-Resurrection Service
ltx/en_us_goarch/website.index.titles:co5.html.link	Pre-Resurrection Service - Abridged
ltx/en_us_goarch/website.index.titles:co6.html.link	Paschal Compline
ltx/en_us_goarch/website.index.titles:co7.html.link	Vigil: Great Compline, Lity, End of Vespers
ltx/en_us_goarch/website.index.titles:consecration_liturgy.html.link	Consecration Liturgy
ltx/en_us_goarch/website.index.titles:consecration_relics.html.link	Reception of Relics
ltx/en_us_goarch/website.index.titles:consecration_vespers.html.link	Consecration Vespers
ltx/en_us_goarch/website.index.titles:cu.html.link	Custom Index
ltx/en_us_goarch/website.index.titles:d__.html.link	Day
ltx/en_us_goarch/website.index.titles:d___.html.link	Day
ltx/en_us_goarch/website.index.titles:em.html.link	Matins (in the evening)
ltx/en_us_goarch/website.index.titles:em3.html.link	Lamentations - Complete Text
ltx/en_us_goarch/website.index.titles:eo.html.link	EOTHINA
ltx/en_us_goarch/website.index.titles:ep.html.link	EPISTLES
ltx/en_us_goarch/website.index.titles:eu.html.link	EUCHOLOGION
ltx/en_us_goarch/website.index.titles:file.type.epub	ePub
ltx/en_us_goarch/website.index.titles:file.type.html	View
ltx/en_us_goarch/website.index.titles:file.type.pdf	Print
ltx/en_us_goarch/website.index.titles:funeral.html.link	Funeral
ltx/en_us_goarch/website.index.titles:ga.html.link	General Apolytikia
ltx/en_us_goarch/website.index.titles:gc.html.link	Great Compline
ltx/en_us_goarch/website.index.titles:ge.html.link	Glory. Both now.
ltx/en_us_goarch/website.index.titles:gh.html.link	Great Hours
ltx/en_us_goarch/website.index.titles:go.html.link	GOSPELS
ltx/en_us_goarch/website.index.titles:gw.html.link	Great Water Blessing
ltx/en_us_goarch/website.index.titles:h.html.link	heirmoi
ltx/en_us_goarch/website.index.titles:h1.html.link	First Hour
ltx/en_us_goarch/website.index.titles:h12.html.link	Variable parts for Hours
ltx/en_us_goarch/website.index.titles:h13.html.link	Paschal Hours
ltx/en_us_goarch/website.index.titles:h18.html.link	Consecration Service
ltx/en_us_goarch/website.index.titles:h3.html.link	Third Hour
ltx/en_us_goarch/website.index.titles:h36.html.link	Trithekti (Third and Sixth Hours)
ltx/en_us_goarch/website.index.titles:h6.html.link	Sixth Hour
ltx/en_us_goarch/website.index.titles:h61.html.link	Typika Service (no priest)
ltx/en_us_goarch/website.index.titles:h9.html.link	Ninth Hour
ltx/en_us_goarch/website.index.titles:h91.html.link	Readings for the Day
ltx/en_us_goarch/website.index.titles:h92.html.link	Special Ceremony (at the end of Liturgy)
ltx/en_us_goarch/website.index.titles:h98.html.link	Reception of Relics for Consecration
ltx/en_us_goarch/website.index.titles:he.html.link	HEIRMOLOGION
ltx/en_us_goarch/website.index.titles:hi.html.link	PRIESTS HANDBOOK
ltx/en_us_goarch/website.index.titles:hi00.html.link	Introduction
ltx/en_us_goarch/website.index.titles:hi01.html.link	Vespers
ltx/en_us_goarch/website.index.titles:hi02.html.link	Great Compline
ltx/en_us_goarch/website.index.titles:hi03.html.link	Midnight Office
ltx/en_us_goarch/website.index.titles:hi04.html.link	Matins
ltx/en_us_goarch/website.index.titles:hi05.html.link	Vigil
ltx/en_us_goarch/website.index.titles:hi06.html.link	Liturgy-Preparation
ltx/en_us_goarch/website.index.titles:hi07.html.link	Liturgy-Chrysostom
ltx/en_us_goarch/website.index.titles:hi08.html.link	Liturgy Hymns
ltx/en_us_goarch/website.index.titles:hi09.html.link	Liturgy-Basil
ltx/en_us_goarch/website.index.titles:hi10.html.link	Liturgy-Presanctified
ltx/en_us_goarch/website.index.titles:hi11.html.link	Concelebration
ltx/en_us_goarch/website.index.titles:hi12.html.link	Communion Prayers
ltx/en_us_goarch/website.index.titles:hi13.html.link	Cross Ceremonies
ltx/en_us_goarch/website.index.titles:hi14.html.link	Great Blessing of Waters
ltx/en_us_goarch/website.index.titles:hi15.html.link	Pentecost Kneeling Vespers
ltx/en_us_goarch/website.index.titles:hi16.html.link	Special Services
ltx/en_us_goarch/website.index.titles:hi17.html.link	Various Prayers
ltx/en_us_goarch/website.index.titles:ho.html.link	HOROLOGION
ltx/en_us_goarch/website.index.titles:ho01.html.link	Preliminary Prayers
ltx/en_us_goarch/website.index.titles:ho02.html.link	Midnight Office
ltx/en_us_goarch/website.index.titles:ho03.html.link	Matins
ltx/en_us_goarch/website.index.titles:ho04.html.link	First Hour
ltx/en_us_goarch/website.index.titles:ho05.html.link	Third Hour
ltx/en_us_goarch/website.index.titles:ho06.html.link	Sixth Hour
ltx/en_us_goarch/website.index.titles:ho07.html.link	Typika Service
ltx/en_us_goarch/website.index.titles:ho08.html.link	Lunch Prayers
ltx/en_us_goarch/website.index.titles:ho09.html.link	Ninth Hour
ltx/en_us_goarch/website.index.titles:ho10.html.link	Vespers
ltx/en_us_goarch/website.index.titles:ho11.html.link	Dinner Prayers
ltx/en_us_goarch/website.index.titles:ho12.html.link	Great Compline
ltx/en_us_goarch/website.index.titles:ho13.html.link	Small Compline
ltx/en_us_goarch/website.index.titles:ho14.html.link	Paschal Service
ltx/en_us_goarch/website.index.titles:ho15.html.link	Troparia by Month
ltx/en_us_goarch/website.index.titles:ho16.html.link	Troparia of Triodion
ltx/en_us_goarch/website.index.titles:ho17.html.link	Troparia of Pentecostarion
ltx/en_us_goarch/website.index.titles:ho18.html.link	Resurrectional Hymns
ltx/en_us_goarch/website.index.titles:ho19.html.link	Weekday Apolytikia
ltx/en_us_goarch/website.index.titles:ho20.html.link	Theotokia by Mode and Day
ltx/en_us_goarch/website.index.titles:ho21.html.link	Communion Prayers
ltx/en_us_goarch/website.index.titles:ho22.html.link	Salutation / Akathist to Theotokos
ltx/en_us_goarch/website.index.titles:ho23.html.link	Small Paraklesis
ltx/en_us_goarch/website.index.titles:ho24.html.link	Great Paraklesis
ltx/en_us_goarch/website.index.titles:ho25.html.link	Supplication Canon to Lord Jesus
ltx/en_us_goarch/website.index.titles:ho26.html.link	Supplication Canon to Guardian Angel
ltx/en_us_goarch/website.index.titles:ho27.html.link	Supplication Canon to Angels and Saints
ltx/en_us_goarch/website.index.titles:ho28.html.link	Akathist to the Cross
ltx/en_us_goarch/website.index.titles:ho29.html.link	Canon, Oikoi, and Hymns to the Holy Trinity
ltx/en_us_goarch/website.index.titles:hwk.html.link	Holy Week
ltx/en_us_goarch/website.index.titles:index.books.description1	Links with the label <em>Print</em> open the pdf files of the texts. Use these to print hard copy. For optimal viewing on a device, use the View links.
ltx/en_us_goarch/website.index.titles:index.books.description2	Links with the label <em>View</em> open the html texts of services, which also have links to scores and audio. To print a score that you have opened, use your device’s file print options.
ltx/en_us_goarch/website.index.titles:index.books.title	GOA Digital Chant Stand<br>Sacraments and Services
ltx/en_us_goarch/website.index.titles:index.custom.description1	Links with the label <em>Print</em> open the pdf files of the texts. Use these to print hard copy. For optimal viewing on a device, use the View links.
ltx/en_us_goarch/website.index.titles:index.custom.description2	Links with the label <em>View</em> open the html texts of services, which also have links to scores and audio. To print a score that you have opened, use your device’s file print options.
ltx/en_us_goarch/website.index.titles:index.custom.title	GOA Digital Chant Stand<br>Index of Additional Resources
ltx/en_us_goarch/website.index.titles:index.day.date.format	EEEE, MMM d, yyyy
ltx/en_us_goarch/website.index.titles:index.day.description1	Links with the label <em>Print</em> open the pdf files of the texts. Use these to print hard copy. For optimal viewing on a device, use the View links.
ltx/en_us_goarch/website.index.titles:index.day.description2	Links with the label <em>View</em> open the html texts of services, which also have links to scores and audio. To print a score that you have opened, use your device’s file print options.
ltx/en_us_goarch/website.index.titles:index.day.title	
ltx/en_us_goarch/website.index.titles:index.day.title2.date.prefix	GOA Digital Chant Stand<br>Services for 
ltx/en_us_goarch/website.index.titles:index.day.title2.date.suffix	
ltx/en_us_goarch/website.index.titles:index.description1	
ltx/en_us_goarch/website.index.titles:index.description2	
ltx/en_us_goarch/website.index.titles:index.description3	
ltx/en_us_goarch/website.index.titles:index.title	GOA Digital Chant Stand<br>Calendar Index
ltx/en_us_goarch/website.index.titles:k.html.link	Katavasias
ltx/en_us_goarch/website.index.titles:ka.html.link	KATAVASIAS
ltx/en_us_goarch/website.index.titles:lang.delimiter	-
ltx/en_us_goarch/website.index.titles:lang.en	EN
ltx/en_us_goarch/website.index.titles:lang.gr	GR
ltx/en_us_goarch/website.index.titles:lang.kik	KIK
ltx/en_us_goarch/website.index.titles:lang.swh	SWH
ltx/en_us_goarch/website.index.titles:le.html.link	LECTIONARY
ltx/en_us_goarch/website.index.titles:li.html.link	Divine Liturgy
ltx/en_us_goarch/website.index.titles:li1.html.link	Liturgy - with Typika and Beatitudes
ltx/en_us_goarch/website.index.titles:li2.html.link	Liturgy - Variable Parts
ltx/en_us_goarch/website.index.titles:li3.html.link	Liturgy - Additional Commemoration
ltx/en_us_goarch/website.index.titles:li4.html.link	Liturgy - Additional with Typika and Beatitudes
ltx/en_us_goarch/website.index.titles:li5.html.link	Liturgy - Additional Variable Parts
ltx/en_us_goarch/website.index.titles:li6.html.link	Liturgy - Alternative Commemoration
ltx/en_us_goarch/website.index.titles:li7.html.link	Liturgy - Alternative Variable Parts
ltx/en_us_goarch/website.index.titles:li8.html.link	Liturgy of St James
ltx/en_us_goarch/website.index.titles:li9.html.link	Liturgy - Hierarchical
ltx/en_us_goarch/website.index.titles:lichrysbasil.html.link	Liturgy of Chrysostom/Basil
ltx/en_us_goarch/website.index.titles:lnt.html.link	Lent
ltx/en_us_goarch/website.index.titles:lvt.html.link	Leave-taking
ltx/en_us_goarch/website.index.titles:m_.html.link	Mode
ltx/en_us_goarch/website.index.titles:m__.html.link	Month
ltx/en_us_goarch/website.index.titles:ma.html.link	Matins
ltx/en_us_goarch/website.index.titles:ma1.html.link	Matins - Pascha Odes 1, 3, 9
ltx/en_us_goarch/website.index.titles:ma2.html.link	Matins - Customizable
ltx/en_us_goarch/website.index.titles:ma3.html.link	Matins - Unabridged
ltx/en_us_goarch/website.index.titles:ma4.html.link	Matins - Additional Commemoration
ltx/en_us_goarch/website.index.titles:ma5.html.link	Matins - Alternative Commemoration
ltx/en_us_goarch/website.index.titles:ma6.html.link	Matins - Alternative Unabridged
ltx/en_us_goarch/website.index.titles:ma7.html.link	Matins - (of the Vigil)
ltx/en_us_goarch/website.index.titles:ma8.html.link	Matins - Seminary Chapel
ltx/en_us_goarch/website.index.titles:ma9.html.link	Matins - Hierarchical
ltx/en_us_goarch/website.index.titles:mc.d001	Sunday of the Publican and Pharisee
ltx/en_us_goarch/website.index.titles:mc.d008	Sunday of the Prodigal Son
ltx/en_us_goarch/website.index.titles:mc.d014	Saturday of Souls
ltx/en_us_goarch/website.index.titles:mc.d015	Meatfare Sunday
ltx/en_us_goarch/website.index.titles:mc.d016	Monday of Cheese Week
ltx/en_us_goarch/website.index.titles:mc.d017	Tuesday of Cheese Week
ltx/en_us_goarch/website.index.titles:mc.d018	Wednesday of Cheese Week
ltx/en_us_goarch/website.index.titles:mc.d019	Thursday of Cheese Week
ltx/en_us_goarch/website.index.titles:mc.d020	Friday of Cheese Week
ltx/en_us_goarch/website.index.titles:mc.d021	Saturday of Cheese Week
ltx/en_us_goarch/website.index.titles:mc.d022	Cheesefare Sunday
ltx/en_us_goarch/website.index.titles:mc.d023	Clean Monday
ltx/en_us_goarch/website.index.titles:mc.d024	Tuesday of the First Week
ltx/en_us_goarch/website.index.titles:mc.d025	Wednesday of the First Week
ltx/en_us_goarch/website.index.titles:mc.d026	Thursday of the First Week
ltx/en_us_goarch/website.index.titles:mc.d027	Friday of the First Week
ltx/en_us_goarch/website.index.titles:mc.d028	Saturday of the First Week
ltx/en_us_goarch/website.index.titles:mc.d029	Sunday of Orthodoxy
ltx/en_us_goarch/website.index.titles:mc.d030	Monday of the Second Week
ltx/en_us_goarch/website.index.titles:mc.d031	Tuesday of the Second Week
ltx/en_us_goarch/website.index.titles:mc.d032	Wednesday of the Second Week
ltx/en_us_goarch/website.index.titles:mc.d033	Thursday of the Second Week
ltx/en_us_goarch/website.index.titles:mc.d034	Friday of the Second Week
ltx/en_us_goarch/website.index.titles:mc.d035	Saturday of the Second Week
ltx/en_us_goarch/website.index.titles:mc.d036	Second Sunday of Lent
ltx/en_us_goarch/website.index.titles:mc.d037	Monday of the Third Week
ltx/en_us_goarch/website.index.titles:mc.d038	Tuesday of the Third Week
ltx/en_us_goarch/website.index.titles:mc.d039	Wednesday of the Third Week
ltx/en_us_goarch/website.index.titles:mc.d040	Thursday of the Third Week
ltx/en_us_goarch/website.index.titles:mc.d041	Friday of the Third Week
ltx/en_us_goarch/website.index.titles:mc.d042	Saturday of the Third Week
ltx/en_us_goarch/website.index.titles:mc.d043	Third Sunday of Lent
ltx/en_us_goarch/website.index.titles:mc.d044	Monday of the Fourth Week
ltx/en_us_goarch/website.index.titles:mc.d045	Tuesday of the Fourth Week
ltx/en_us_goarch/website.index.titles:mc.d046	Wednesday of the Fourth Week
ltx/en_us_goarch/website.index.titles:mc.d047	Thursday of the Fourth Week
ltx/en_us_goarch/website.index.titles:mc.d048	Friday of the Fourth Week
ltx/en_us_goarch/website.index.titles:mc.d049	Saturday of the Fourth Week
ltx/en_us_goarch/website.index.titles:mc.d050	Fourth Sunday of Lent
ltx/en_us_goarch/website.index.titles:mc.d051	Monday of the Fifth Week
ltx/en_us_goarch/website.index.titles:mc.d052	Tuesday of the Fifth Week
ltx/en_us_goarch/website.index.titles:mc.d053	Wednesday of the Fifth Week
ltx/en_us_goarch/website.index.titles:mc.d054	Thursday of the Fifth Week
ltx/en_us_goarch/website.index.titles:mc.d055	Friday of the Fifth Week
ltx/en_us_goarch/website.index.titles:mc.d056	Saturday of the Akathist
ltx/en_us_goarch/website.index.titles:mc.d057	Fifth Sunday of Lent
ltx/en_us_goarch/website.index.titles:mc.d058	Monday of the Sixth Week
ltx/en_us_goarch/website.index.titles:mc.d059	Tuesday of the Sixth Week
ltx/en_us_goarch/website.index.titles:mc.d060	Wednesday of the Sixth Week
ltx/en_us_goarch/website.index.titles:mc.d061	Thursday of the Sixth Week
ltx/en_us_goarch/website.index.titles:mc.d062	Friday of the Sixth Week
ltx/en_us_goarch/website.index.titles:mc.d063	Lazarus Saturday
ltx/en_us_goarch/website.index.titles:mc.d064	Palm Sunday
ltx/en_us_goarch/website.index.titles:mc.d065	Holy Monday
ltx/en_us_goarch/website.index.titles:mc.d066	Holy Tuesday
ltx/en_us_goarch/website.index.titles:mc.d067	Holy Wednesday
ltx/en_us_goarch/website.index.titles:mc.d068	Holy Thursday
ltx/en_us_goarch/website.index.titles:mc.d069	Good Friday
ltx/en_us_goarch/website.index.titles:mc.d070	Holy Saturday
ltx/en_us_goarch/website.index.titles:mc.d071	Pascha
ltx/en_us_goarch/website.index.titles:mc.d072	Monday of Bright Week
ltx/en_us_goarch/website.index.titles:mc.d073	Tuesday of Bright Week
ltx/en_us_goarch/website.index.titles:mc.d074	Wednesday of Bright Week
ltx/en_us_goarch/website.index.titles:mc.d075	Thursday of Bright Week
ltx/en_us_goarch/website.index.titles:mc.d076	Friday of Bright Week
ltx/en_us_goarch/website.index.titles:mc.d077	Saturday of Bright Week
ltx/en_us_goarch/website.index.titles:mc.d078	Sunday of Thomas
ltx/en_us_goarch/website.index.titles:mc.d079	Monday of Thomas
ltx/en_us_goarch/website.index.titles:mc.d080	Tuesday of Thomas
ltx/en_us_goarch/website.index.titles:mc.d081	Wednesday of Thomas
ltx/en_us_goarch/website.index.titles:mc.d082	Thursday of Thomas
ltx/en_us_goarch/website.index.titles:mc.d083	Friday of Thomas
ltx/en_us_goarch/website.index.titles:mc.d084	Saturday of Thomas
ltx/en_us_goarch/website.index.titles:mc.d085	Sunday of the Myrrh-bearers
ltx/en_us_goarch/website.index.titles:mc.d086	Monday of the Myrrh-bearers
ltx/en_us_goarch/website.index.titles:mc.d087	Tuesday of the Myrrh-bearers
ltx/en_us_goarch/website.index.titles:mc.d088	Wednesday of the Myrrh-bearers
ltx/en_us_goarch/website.index.titles:mc.d089	Thursday of the Myrrh-bearers
ltx/en_us_goarch/website.index.titles:mc.d090	Friday of the Myrrh-bearers
ltx/en_us_goarch/website.index.titles:mc.d091	Saturday of the Myrrh-bearers
ltx/en_us_goarch/website.index.titles:mc.d092	Sunday of the Paralytic
ltx/en_us_goarch/website.index.titles:mc.d093	Monday of the Paralytic
ltx/en_us_goarch/website.index.titles:mc.d094	Tuesday of the Paralytic
ltx/en_us_goarch/website.index.titles:mc.d095	Wednesday of Mid-Pentecost
ltx/en_us_goarch/website.index.titles:mc.d096	Thursday of Mid-Pentecost
ltx/en_us_goarch/website.index.titles:mc.d097	Friday of Mid-Pentecost
ltx/en_us_goarch/website.index.titles:mc.d098	Saturday of Mid-Pentecost
ltx/en_us_goarch/website.index.titles:mc.d099	Sunday of the Samaritan Woman
ltx/en_us_goarch/website.index.titles:mc.d100	Monday of the Samaritan Woman
ltx/en_us_goarch/website.index.titles:mc.d101	Tuesday of the Samaritan Woman
ltx/en_us_goarch/website.index.titles:mc.d102	Wednesday of the Samaritan Woman
ltx/en_us_goarch/website.index.titles:mc.d103	Thursday of the Samaritan Woman
ltx/en_us_goarch/website.index.titles:mc.d104	Friday of the Samaritan Woman
ltx/en_us_goarch/website.index.titles:mc.d105	Saturday of the Samaritan Woman
ltx/en_us_goarch/website.index.titles:mc.d106	Sunday of the Blindman
ltx/en_us_goarch/website.index.titles:mc.d107	Monday of the Blindman
ltx/en_us_goarch/website.index.titles:mc.d108	Tuesday of the Blindman
ltx/en_us_goarch/website.index.titles:mc.d109	Wednesday of Leave-taking of Pascha
ltx/en_us_goarch/website.index.titles:mc.d110	Thursday of Ascension
ltx/en_us_goarch/website.index.titles:mc.d111	Friday after Ascension
ltx/en_us_goarch/website.index.titles:mc.d112	Saturday after Ascension
ltx/en_us_goarch/website.index.titles:mc.d113	Sunday of the Holy Fathers
ltx/en_us_goarch/website.index.titles:mc.d114	Monday after the Holy Fathers
ltx/en_us_goarch/website.index.titles:mc.d115	Tuesday after the Holy Fathers
ltx/en_us_goarch/website.index.titles:mc.d116	Wednesday after the Holy Fathers
ltx/en_us_goarch/website.index.titles:mc.d117	Thursday after the Holy Fathers
ltx/en_us_goarch/website.index.titles:mc.d118	Friday of Leave-taking of Ascension
ltx/en_us_goarch/website.index.titles:mc.d119	Saturday of the Souls
ltx/en_us_goarch/website.index.titles:mc.d120	Sunday of Pentecost
ltx/en_us_goarch/website.index.titles:mc.d121	Monday of the Holy Spirit
ltx/en_us_goarch/website.index.titles:mc.d122	Tuesday after Pentecost
ltx/en_us_goarch/website.index.titles:mc.d123	Wednesday after Pentecost
ltx/en_us_goarch/website.index.titles:mc.d124	Thursday after Pentecost
ltx/en_us_goarch/website.index.titles:mc.d125	Friday after Pentecost
ltx/en_us_goarch/website.index.titles:mc.d126	Saturday of the Leave-taking of Pentecost
ltx/en_us_goarch/website.index.titles:mc.d127	Sunday of All Saints
ltx/en_us_goarch/website.index.titles:me.html.link	MENAION
ltx/en_us_goarch/website.index.titles:memorial.html.link	Memorial
ltx/en_us_goarch/website.index.titles:mo.html.link	Midnight Office
ltx/en_us_goarch/website.index.titles:mo1.html.link	Daily Typikon
ltx/en_us_goarch/website.index.titles:mo5.html.link	Midnight Office - Alternative Commemoration
ltx/en_us_goarch/website.index.titles:mol.html.link	Moleben
ltx/en_us_goarch/website.index.titles:o.html.link	Other
ltx/en_us_goarch/website.index.titles:oc.html.link	OCTOECHOS
ltx/en_us_goarch/website.index.titles:pas.html.link	Pascha
ltx/en_us_goarch/website.index.titles:pe.html.link	PENTECOSTARION
ltx/en_us_goarch/website.index.titles:pl.html.link	Presanctified Liturgy
ltx/en_us_goarch/website.index.titles:pl1.html.link	Presanctified Liturgy
ltx/en_us_goarch/website.index.titles:pl2.html.link	Presanctified Liturgy - Variable Parts
ltx/en_us_goarch/website.index.titles:pl3.html.link	Holy Unction
ltx/en_us_goarch/website.index.titles:pr.html.link	PROPHECIES
ltx/en_us_goarch/website.index.titles:presanctified.html.link	Presanctified Liturgy
ltx/en_us_goarch/website.index.titles:prf.html.link	Pre-Feast
ltx/en_us_goarch/website.index.titles:ps.html.link	PSALTER
ltx/en_us_goarch/website.index.titles:rds.html.link	Reader Service
ltx/en_us_goarch/website.index.titles:sal.html.link	Salutations
ltx/en_us_goarch/website.index.titles:sat.html.link	Saturday
ltx/en_us_goarch/website.index.titles:se.html.link	Service Index
ltx/en_us_goarch/website.index.titles:sla.html.link	Slava
ltx/en_us_goarch/website.index.titles:sun.html.link	Sunday
ltx/en_us_goarch/website.index.titles:sv.html.link	Small Vespers
ltx/en_us_goarch/website.index.titles:sv3.html.link	Small Vespers with Pre-Sanctified
ltx/en_us_goarch/website.index.titles:sy.html.link	SYNAXARION
ltx/en_us_goarch/website.index.titles:te.html.link	Trithekti
ltx/en_us_goarch/website.index.titles:tr.html.link	TRIODION
ltx/en_us_goarch/website.index.titles:trn.html.link	Triodion
ltx/en_us_goarch/website.index.titles:ty.html.link	Typika
ltx/en_us_goarch/website.index.titles:unction.html.link	Unction
ltx/en_us_goarch/website.index.titles:ve.html.link	Vespers
ltx/en_us_goarch/website.index.titles:ve1.html.link	Vespers - Alt. Version 1
ltx/en_us_goarch/website.index.titles:ve2.html.link	Vespers - Unabridged
ltx/en_us_goarch/website.index.titles:ve3.html.link	Great Vespers and Salutations
ltx/en_us_goarch/website.index.titles:ve4.html.link	Vespers - Additional Commemoration
ltx/en_us_goarch/website.index.titles:ve5.html.link	Vespers - Alternative Commemoration
ltx/en_us_goarch/website.index.titles:ve6.html.link	Vespers - Alternative Unabridged
ltx/en_us_goarch/website.index.titles:ve7.html.link	Vespers - (of the Vigil)
ltx/en_us_goarch/website.index.titles:ve8.html.link	Vespers - Alt. Version 8
ltx/en_us_goarch/website.index.titles:ve9.html.link	Vespers - Hierarchical
ltx/en_us_goarch/website.index.titles:vl.html.link	Vesperal Liturgy
ltx/en_us_goarch/website.index.titles:vl2.html.link	Vesperal Liturgy (Full)
ltx/en_us_goarch/website.index.titles:wedding.html.link	Wedding
ltx/en_us_goarch/website.index.titles:wkd.html.link	Weekday
ltx/en_us_goarch/website.preferences.titles:mc.eothinongospel.position1	Eothinon Gospel (Not EP / GOA)
ltx/en_us_goarch/website.preferences.titles:mc.eothinongospel.position2	Eothinon Gospel (EP / GOA)
ltx/en_us_goarch/website.preferences.titles:mc.kontakion.position1	Principal Kontakion and Synaxarion
ltx/en_us_goarch/website.preferences.titles:mc.kontakion.position12	Kontakia and Synaxarion
ltx/en_us_goarch/website.preferences.titles:mc.kontakion.position2	Secondary Kontakion
ltx/en_us_goarch/website.preferences.titles:mc.magnificat.modeofcanon	Magnificat: Mode of Canon
ltx/en_us_goarch/website.preferences.titles:mc.magnificat.modeofkatavasia	Magnificat: Mode of Katavasia
ltx/en_us_goarch/website.preferences.titles:mc.matins.close	Conclusion, i.e. “Through the prayers…”
ltx/en_us_goarch/website.preferences.titles:mc.matins.dismissal	Dismissal
ltx/en_us_goarch/website.preferences.titles:mc.matins.end.before.dismissal	Litanies and Dismissal
ltx/en_us_goarch/website.preferences.titles:mc.matins.end.no.dismissal	Litanies, End, no Dismissal
ltx/en_us_goarch/website.preferences.titles:mc.matinsordinary	Matins Ordinary
ltx/en_us_goarch/website.preferences.titles:mc.ode1hocanon1	Ode 1: Horologion: Canon-1
ltx/en_us_goarch/website.preferences.titles:mc.ode1katavasia	Ode 1: Katavasia
ltx/en_us_goarch/website.preferences.titles:mc.ode1mecanon1	Ode 1: Menaion: Canon-1
ltx/en_us_goarch/website.preferences.titles:mc.ode1mecanon2	Ode 1: Menaion: Canon-2
ltx/en_us_goarch/website.preferences.titles:mc.ode1mecanon3	Ode 1: Menaion: Canon-3
ltx/en_us_goarch/website.preferences.titles:mc.ode1occanon1	Ode 1: Octoechos: Canon-1
ltx/en_us_goarch/website.preferences.titles:mc.ode1occanon2	Ode 1: Octoechos: Canon-2
ltx/en_us_goarch/website.preferences.titles:mc.ode1occanon3	Ode 1: Octoechos: Canon-3
ltx/en_us_goarch/website.preferences.titles:mc.ode1pacanon1	Ode 1: Pascha: Canon
ltx/en_us_goarch/website.preferences.titles:mc.ode1pecanon1	Ode 1: Pentecostarion: Canon-1
ltx/en_us_goarch/website.preferences.titles:mc.ode1pecanon2	Ode 1: Pentecostarion: Canon-2
ltx/en_us_goarch/website.preferences.titles:mc.ode1trcanon1	Ode 1: Triodion: Canon-1
ltx/en_us_goarch/website.preferences.titles:mc.ode1trcanon2	Ode 1: Triodion: Canon-2
ltx/en_us_goarch/website.preferences.titles:mc.ode1trcanon3	Ode 1: Triodion: Canon-3
ltx/en_us_goarch/website.preferences.titles:mc.ode2trcanon1	Ode 2: Triodion: Canon-1
ltx/en_us_goarch/website.preferences.titles:mc.ode2trcanon2	Ode 2: Triodion: Canon-2
ltx/en_us_goarch/website.preferences.titles:mc.ode2trcanon3	Ode 2: Triodion: Canon-3
ltx/en_us_goarch/website.preferences.titles:mc.ode3.kathisma	Mid-Ode Kathisma or Hypakoe
ltx/en_us_goarch/website.preferences.titles:mc.ode3.litany	Ode 3: Short Litany
ltx/en_us_goarch/website.preferences.titles:mc.ode3hocanon1	Ode 3: Horologion: Canon-1
ltx/en_us_goarch/website.preferences.titles:mc.ode3katavasia	Ode 3: Katavasia
ltx/en_us_goarch/website.preferences.titles:mc.ode3mecanon1	Ode 3: Menaion: Canon-1
ltx/en_us_goarch/website.preferences.titles:mc.ode3mecanon2	Ode 3: Menaion: Canon-2
ltx/en_us_goarch/website.preferences.titles:mc.ode3mecanon3	Ode 3: Menaion: Canon-3
ltx/en_us_goarch/website.preferences.titles:mc.ode3occanon1	Ode 3: Octoechos: Canon-1
ltx/en_us_goarch/website.preferences.titles:mc.ode3occanon2	Ode 3: Octoechos: Canon-2
ltx/en_us_goarch/website.preferences.titles:mc.ode3occanon3	Ode 3: Octoechos: Canon-3
ltx/en_us_goarch/website.preferences.titles:mc.ode3pacanon1	Ode 3: Pascha: Canon
ltx/en_us_goarch/website.preferences.titles:mc.ode3pecanon1	Ode 3: Pentecostarion: Canon-1
ltx/en_us_goarch/website.preferences.titles:mc.ode3pecanon2	Ode 3: Pentecostarion: Canon-2
ltx/en_us_goarch/website.preferences.titles:mc.ode3trcanon1	Ode 3: Triodion: Canon-1
ltx/en_us_goarch/website.preferences.titles:mc.ode3trcanon2	Ode 3: Triodion: Canon-2
ltx/en_us_goarch/website.preferences.titles:mc.ode3trcanon3	Ode 3: Triodion: Canon-3
ltx/en_us_goarch/website.preferences.titles:mc.ode4hocanon1	Ode 4: Horologion: Canon-1
ltx/en_us_goarch/website.preferences.titles:mc.ode4katavasia	Ode 4: Katavasia
ltx/en_us_goarch/website.preferences.titles:mc.ode4mecanon1	Ode 4: Menaion: Canon-1
ltx/en_us_goarch/website.preferences.titles:mc.ode4mecanon2	Ode 4: Menaion: Canon-2
ltx/en_us_goarch/website.preferences.titles:mc.ode4mecanon3	Ode 4: Menaion: Canon-3
ltx/en_us_goarch/website.preferences.titles:mc.ode4occanon1	Ode 4: Octoechos: Canon-1
ltx/en_us_goarch/website.preferences.titles:mc.ode4occanon2	Ode 4: Octoechos: Canon-2
ltx/en_us_goarch/website.preferences.titles:mc.ode4occanon3	Ode 4: Octoechos: Canon-3
ltx/en_us_goarch/website.preferences.titles:mc.ode4pacanon1	Ode 4: Pascha: Canon
ltx/en_us_goarch/website.preferences.titles:mc.ode4pecanon1	Ode 4: Pentecostarion: Canon-1
ltx/en_us_goarch/website.preferences.titles:mc.ode4pecanon2	Ode 4: Pentecostarion: Canon-2
ltx/en_us_goarch/website.preferences.titles:mc.ode4trcanon1	Ode 4: Triodion: Canon-1
ltx/en_us_goarch/website.preferences.titles:mc.ode4trcanon2	Ode 4: Triodion: Canon-2
ltx/en_us_goarch/website.preferences.titles:mc.ode4trcanon3	Ode 4: Triodion: Canon-3
ltx/en_us_goarch/website.preferences.titles:mc.ode5hocanon1	Ode 5: Horologion: Canon-1
ltx/en_us_goarch/website.preferences.titles:mc.ode5katavasia	Ode 5: Katavasia
ltx/en_us_goarch/website.preferences.titles:mc.ode5mecanon1	Ode 5: Menaion: Canon-1
ltx/en_us_goarch/website.preferences.titles:mc.ode5mecanon2	Ode 5: Menaion: Canon-2
ltx/en_us_goarch/website.preferences.titles:mc.ode5mecanon3	Ode 5: Menaion: Canon-3
ltx/en_us_goarch/website.preferences.titles:mc.ode5occanon1	Ode 5: Octoechos: Canon-1
ltx/en_us_goarch/website.preferences.titles:mc.ode5occanon2	Ode 5: Octoechos: Canon-2
ltx/en_us_goarch/website.preferences.titles:mc.ode5occanon3	Ode 5: Octoechos: Canon-3
ltx/en_us_goarch/website.preferences.titles:mc.ode5pacanon1	Ode 5: Pascha: Canon
ltx/en_us_goarch/website.preferences.titles:mc.ode5pecanon1	Ode 5: Pentecostarion: Canon-1
ltx/en_us_goarch/website.preferences.titles:mc.ode5pecanon2	Ode 5: Pentecostarion: Canon-2
ltx/en_us_goarch/website.preferences.titles:mc.ode5trcanon1	Ode 5: Triodion: Canon-1
ltx/en_us_goarch/website.preferences.titles:mc.ode5trcanon2	Ode 5: Triodion: Canon-2
ltx/en_us_goarch/website.preferences.titles:mc.ode5trcanon3	Ode 5: Triodion: Canon-3
ltx/en_us_goarch/website.preferences.titles:mc.ode6.litany	Ode 6: Short Litany
ltx/en_us_goarch/website.preferences.titles:mc.ode6hocanon1	Ode 6: Horologion: Canon-1
ltx/en_us_goarch/website.preferences.titles:mc.ode6katavasia	Ode 6: Katavasia
ltx/en_us_goarch/website.preferences.titles:mc.ode6mecanon1	Ode 6: Menaion: Canon-1
ltx/en_us_goarch/website.preferences.titles:mc.ode6mecanon2	Ode 6: Menaion: Canon-2
ltx/en_us_goarch/website.preferences.titles:mc.ode6mecanon3	Ode 6: Menaion: Canon-3
ltx/en_us_goarch/website.preferences.titles:mc.ode6occanon1	Ode 6: Octoechos: Canon-1
ltx/en_us_goarch/website.preferences.titles:mc.ode6occanon2	Ode 6: Octoechos: Canon-2
ltx/en_us_goarch/website.preferences.titles:mc.ode6occanon3	Ode 6: Octoechos: Canon-3
ltx/en_us_goarch/website.preferences.titles:mc.ode6pacanon1	Ode 6: Pascha: Canon
ltx/en_us_goarch/website.preferences.titles:mc.ode6pecanon1	Ode 6: Pentecostarion: Canon-1
ltx/en_us_goarch/website.preferences.titles:mc.ode6pecanon2	Ode 6: Pentecostarion: Canon-2
ltx/en_us_goarch/website.preferences.titles:mc.ode6trcanon1	Ode 6: Triodion: Canon-1
ltx/en_us_goarch/website.preferences.titles:mc.ode6trcanon2	Ode 6: Triodion: Canon-2
ltx/en_us_goarch/website.preferences.titles:mc.ode6trcanon3	Ode 6: Triodion: Canon-3
ltx/en_us_goarch/website.preferences.titles:mc.ode7hocanon1	Ode 7: Horologion: Canon-1
ltx/en_us_goarch/website.preferences.titles:mc.ode7katavasia	Ode 7: Katavasia
ltx/en_us_goarch/website.preferences.titles:mc.ode7mecanon1	Ode 7: Menaion: Canon-1
ltx/en_us_goarch/website.preferences.titles:mc.ode7mecanon2	Ode 7: Menaion: Canon-2
ltx/en_us_goarch/website.preferences.titles:mc.ode7mecanon3	Ode 7: Menaion: Canon-3
ltx/en_us_goarch/website.preferences.titles:mc.ode7occanon1	Ode 7: Octoechos: Canon-1
ltx/en_us_goarch/website.preferences.titles:mc.ode7occanon2	Ode 7: Octoechos: Canon-2
ltx/en_us_goarch/website.preferences.titles:mc.ode7occanon3	Ode 7: Octoechos: Canon-3
ltx/en_us_goarch/website.preferences.titles:mc.ode7pacanon1	Ode 7: Pascha: Canon
ltx/en_us_goarch/website.preferences.titles:mc.ode7pecanon1	Ode 7: Pentecostarion: Canon-1
ltx/en_us_goarch/website.preferences.titles:mc.ode7pecanon2	Ode 7: Pentecostarion: Canon-2
ltx/en_us_goarch/website.preferences.titles:mc.ode7trcanon1	Ode 7: Triodion: Canon-1
ltx/en_us_goarch/website.preferences.titles:mc.ode7trcanon2	Ode 7: Triodion: Canon-2
ltx/en_us_goarch/website.preferences.titles:mc.ode7trcanon3	Ode 7: Triodion: Canon-3
ltx/en_us_goarch/website.preferences.titles:mc.ode8hocanon1	Ode 8: Horologion: Canon-1
ltx/en_us_goarch/website.preferences.titles:mc.ode8katavasia	Ode 8: Katavasia
ltx/en_us_goarch/website.preferences.titles:mc.ode8mecanon1	Ode 8: Menaion: Canon-1
ltx/en_us_goarch/website.preferences.titles:mc.ode8mecanon2	Ode 8: Menaion: Canon-2
ltx/en_us_goarch/website.preferences.titles:mc.ode8mecanon3	Ode 8: Menaion: Canon-3
ltx/en_us_goarch/website.preferences.titles:mc.ode8occanon1	Ode 8: Octoechos: Canon-1
ltx/en_us_goarch/website.preferences.titles:mc.ode8occanon2	Ode 8: Octoechos: Canon-2
ltx/en_us_goarch/website.preferences.titles:mc.ode8occanon3	Ode 8: Octoechos: Canon-3
ltx/en_us_goarch/website.preferences.titles:mc.ode8pacanon1	Ode 8: Pascha: Canon
ltx/en_us_goarch/website.preferences.titles:mc.ode8pecanon1	Ode 8: Pentecostarion: Canon-1
ltx/en_us_goarch/website.preferences.titles:mc.ode8pecanon2	Ode 8: Pentecostarion: Canon-2
ltx/en_us_goarch/website.preferences.titles:mc.ode8trcanon1	Ode 8: Triodion: Canon-1
ltx/en_us_goarch/website.preferences.titles:mc.ode8trcanon2	Ode 8: Triodion: Canon-2
ltx/en_us_goarch/website.preferences.titles:mc.ode8trcanon3	Ode 8: Triodion: Canon-3
ltx/en_us_goarch/website.preferences.titles:mc.ode9hocanon1	Ode 9: Horologion: Canon-1
ltx/en_us_goarch/website.preferences.titles:mc.ode9katavasia	Ode 9: Katavasia
ltx/en_us_goarch/website.preferences.titles:mc.ode9mecanon1	Ode 9: Menaion: Canon-1
ltx/en_us_goarch/website.preferences.titles:mc.ode9mecanon2	Ode 9: Menaion: Canon-2
ltx/en_us_goarch/website.preferences.titles:mc.ode9mecanon3	Ode 9: Menaion: Canon-3
ltx/en_us_goarch/website.preferences.titles:mc.ode9occanon1	Ode 9: Octoechos: Canon-1
ltx/en_us_goarch/website.preferences.titles:mc.ode9occanon2	Ode 9: Octoechos: Canon-2
ltx/en_us_goarch/website.preferences.titles:mc.ode9occanon3	Ode 9: Octoechos: Canon-3
ltx/en_us_goarch/website.preferences.titles:mc.ode9pacanon1	Ode 9: Pascha: Canon
ltx/en_us_goarch/website.preferences.titles:mc.ode9pecanon1	Ode 9: Pentecostarion: Canon-1
ltx/en_us_goarch/website.preferences.titles:mc.ode9pecanon2	Ode 9: Pentecostarion: Canon-2
ltx/en_us_goarch/website.preferences.titles:mc.ode9trcanon1	Ode 9: Triodion: Canon-1
ltx/en_us_goarch/website.preferences.titles:mc.ode9trcanon2	Ode 9: Triodion: Canon-2
ltx/en_us_goarch/website.preferences.titles:mc.ode9trcanon3	Ode 9: Triodion: Canon-3
ltx/en_us_goarch/website.preferences.titles:mc.odes1345678katavasia	Katavasias Odes 1-8
ltx/en_us_goarch/website.preferences.titles:mc.synaxarion.extended	Extended Synaxarion
ltx/en_us_goarch/website.preferences.titles:mc.tag	
ltx/en_us_goarch/website.preferences.titles:mc.vesperslity	Vespers Lity
ltx/en_us_goarch/website.preferences.titles:mc.vespersstichologia	Vespers Stichologia
