{
 "Language": "en",
 "Country": "uk",
 "Realm": "webbe",
 "Description": "English translation of the Bible, webbe, United Kingdom",
 "Copyright": "Michael Colburn",
 "License": "Creative Commons Attribution-NonCommercial-ShareAlike  4.0 International (BY-NC-SA 4.0)",
 "Format": "doxa key = value text files with .dkv extension"
}