{
 "Language": "en",
 "Country": "uk",
 "Realm": "kjv",
 "Description": "English translation of the Bible, kjv, United Kingdom",
 "Copyright": "King James Version, copyrighted in UK, public domain elsewhere",
 "License": "Creative Commons Attribution-NonCommercial-ShareAlike  4.0 International (BY-NC-SA 4.0)",
 "Format": "doxa key = value text files with .dkv extension"
}