<?xml version="1.0" encoding="utf-8"?>
<!-- Generator: Adobe Illustrator 19.1.0, SVG Export Plug-In . SVG Version: 6.00 Build 0)  -->
<svg version="1.1" id="Layer_1" xmlns="http://www.w3.org/2000/svg" xmlns:xlink="http://www.w3.org/1999/xlink" x="0px" y="0px"
	 viewBox="339.9 -149.9 1106.3 1086.1" style="enable-background:new 339.9 -149.9 1106.3 1086.1;" xml:space="preserve">
<style type="text/css">
	.st0{display:none;}
	.st1{display:inline;fill:#ED1A64;}
	.st2{fill:#FFFFFF;}
</style>
<g class="st0">
	<rect x="595.7" y="105.2" class="st1" width="592.4" height="592.4"/>
	<path class="st1" d="M891.9,401.3"/>
</g>
<path class="st2" d="M666,752.1c-2.3-1.5-3.2-1.7-4.7-1.7c-2.5,0.1-5.9,1.7-8.9,6.4c-5.3,8.1-1.4,13.9,1.9,16.1
	c1.4,0.9,2.5,1.5,3.2,1.7c0.5,0.1,0.7,0,1-0.5l11.2-17.3c0.4-0.6,0.4-0.9,0.2-1.4C669,754.3,667.4,753,666,752.1z"/>
<path class="st2" d="M511.5,511.9c-1.7-5.5-8.2-17.4-31-10.5c-17.6,5.4-25.4,18.9-21.5,31.7c2.8,9,10.9,17.8,30.5,11.8
	C505.9,540,516.1,527,511.5,511.9z"/>
<path class="st2" d="M452.7,448.9c0.2,0.5,0.5,0.6,1,0.5l20.5-2.2c0.7-0.1,1-0.2,1.2-0.7c0.3-1.5,0.3-3.5,0.1-5.2
	c-0.3-2.7-0.6-3.6-1.7-4.7c-1.7-1.9-5-3.5-10.6-2.9c-9.6,1-11.7,7.6-11.3,11.6C452.3,447,452.5,448.2,452.7,448.9z"/>
<path class="st2" d="M497.9,245.8c13,5.5,26.4,2.7,31.5-9.3c1.9-4.4,4-15.4-14-23.1c-14-5.9-26.1-1.6-30.5,8.7
	C481.8,229.3,482.3,239.2,497.9,245.8z"/>
<path class="st2" d="M521.3,158.7c1.9,1.3,6.8,4.7,11.2,7.7l7.1,4.8c6,4,10.3,6.9,11.5,7.6c1.4,0.9,3.8,2.3,4.7,2.3
	c1.6,0,4.2-1.4,7.2-5.9c3.9-5.7,5.3-10.3,4.7-15.7c-0.7-5.7-5-10.3-10.8-14.2c-7.2-4.8-13.8-5-17.7-4.1c-8.5,1.8-13.5,7.8-16.4,12.2
	c-0.8,1.1-2,3.3-2.1,3.9C520.5,157.9,520.7,158.2,521.3,158.7z"/>
<path class="st2" d="M614.4,113.2c3.4-3.4,9.5-12.8-4.4-26.7c-10.8-10.8-23.6-11.2-31.5-3.4c-5.5,5.5-8.7,14.9,3.2,26.8
	C591.8,120,605.2,122.4,614.4,113.2z"/>
<path class="st2" d="M734.3,6.2c0,0.3,0.2,0.5,0.5,0.4l14.1-5.4c0.4-0.1,0.4-0.4,0.2-0.6L735-15.7c-0.2-0.3-0.4-0.6-0.6-0.5
	s-0.2,0.5-0.2,0.9L734.3,6.2z"/>
<path class="st2" d="M808.2-15.5c1.5,0.2,3.5,0,5.2-0.3c2.7-0.5,3.5-1,4.5-2.1c1.7-1.9,3.1-5.3,2-10.8c-1.8-9.5-8.6-11-12.6-10.2
	c-1.7,0.3-2.9,0.6-3.5,1c-0.4,0.2-0.5,0.5-0.4,1l3.9,20.3C807.5-15.9,807.7-15.6,808.2-15.5z"/>
<path class="st2" d="M1026.7,19.9c6.6,2.3,11.4,2.5,16.4,0.5c5.3-2.1,8.6-7.5,10.9-14.1c2.8-8.2,1.2-14.6-0.6-18.2
	c-4-7.7-11-11-16-12.7c-1.3-0.4-3.7-1.1-4.3-1c-0.7,0.1-1,0.3-1.2,1c-0.8,2.2-2.7,7.7-4.5,12.8l-2.8,8.1c-2.3,6.8-4,11.8-4.3,13
	c-0.5,1.6-1.2,4.2-1,5.1C1019.6,15.9,1021.7,18.1,1026.7,19.9z"/>
<path class="st2" d="M1133,76.2c3.8,2.8,14.1,7.4,25.6-8.5c8.9-12.3,7.4-25.1-1.6-31.6c-6.3-4.6-16.1-6.3-26,7.4
	C1122.7,54.9,1122.4,68.5,1133,76.2z"/>
<path class="st2" d="M1316,331.4c-14,1.7-24.2,10.8-22.6,23.8c0.6,4.7,4.2,15.4,23.7,13c15.1-1.9,23.4-11.7,22-22.8
	C1338.2,337.6,1332.8,329.3,1316,331.4z"/>
<path class="st2" d="M1323.6,516.5l-17.3-12.8c-0.3-0.2-0.6-0.2-0.6,0.2l-4.2,14.5c-0.1,0.4,0.1,0.5,0.4,0.5l21.6-1.5
	c0.3,0,0.8,0,0.8-0.2C1324.2,516.9,1323.9,516.6,1323.6,516.5z"/>
<path class="st2" d="M1198.3,695c-0.5-0.5-0.8-0.6-1.3-0.4c-1.3,0.7-2.9,2-4.1,3.2c-1.9,1.9-2.4,2.7-2.6,4.2
	c-0.4,2.5,0.4,6.1,4.4,10c6.8,6.8,13.3,4.3,16.1,1.4c1.2-1.2,2-2.1,2.4-2.7c0.2-0.4,0.1-0.7-0.2-1.1L1198.3,695z"/>
<path class="st2" d="M1048.5,788.2l-11.7,4.3c-0.3,0.1-0.3,0.3-0.2,0.5l11.5,13.7c0.2,0.2,0.3,0.5,0.5,0.5c0.2-0.1,0.2-0.4,0.2-0.7
	l0.2-17.8C1048.9,788.2,1048.8,788.1,1048.5,788.2z"/>
<polygon class="st2" points="1094.9,593.9 1128.6,593.9 1110.9,554.1 "/>
<g>
	<path class="st2" d="M562.4,257.2c8,0,15.7,3.4,21.3,9.3c4.2,4.5,9.2,12.5,9.2,25.4c0,7.1-2.9,12.3-5.5,16.6
		c25,5.6,117.5,15.6,243,26.2c-10.7-124.9-20-210.8-25.5-235c-4.2,2.6-9.4,5.5-16.6,5.5c-12.9,0-20.9-5-25.4-9.2
		c-5.9-5.6-9.3-13.3-9.3-21.3c0-14.8,11.9-30.5,33.9-30.5c9,0,16.1,3.7,21.9,6.8c1.2,0.6,2.4,1.3,3.6,1.9l0.1,0.1l0.1,0.1
		c1.8,0.9,3.6,2,5.4,3.1c1.2,0.7,2.5,1.5,3.9,2.3c10.2,5.8,38.9,9.6,60.5,11.2c3.1,0,6.7,0,11.2,0c6.8,0,56.1-3.6,70.8-11.8
		c1.4-0.8,2.7-1.6,3.9-2.3c1.7-1,3.5-2.1,5.2-3l0.1-0.1l0.1-0.1c1.4-0.7,2.6-1.3,3.9-2c5.7-3,12.8-6.7,21.8-6.7
		c22,0,33.9,15.7,33.9,30.5c0,8-3.4,15.7-9.3,21.3c-4.5,4.2-12.5,9.2-25.4,9.2c-7.2,0-12.3-2.9-16.6-5.5
		c-5.5,24.3-14.9,110.4-25.6,235.7c125.5-10.6,218-20.6,243.1-26.2c-2.6-4.2-5.5-9.4-5.5-16.6c0-12.9,5-20.9,9.2-25.4
		c5.6-5.9,13.3-9.3,21.3-9.3c7,0,14.3,2.7,20,7.9C1191,124,1054.1,23.9,893.9,23.9c-160.3,0-297.1,100.2-351.4,241.3
		C548.2,259.9,555.4,257.2,562.4,257.2z M1114.4,197.2c16.1,0,21.5,7.9,26.6,4.7l1.4,17.3l-2.6-0.2c-4.1-13.4-13.6-17.1-27-17.1
		c-19.9,0-33.7,17.9-32.7,38.2c1,21.7,17.1,35.8,35.8,35.8c14,0,23-3.7,24.8-19.9h3.3l-2.2,17.3c-5.1,3.5-17.5,7.5-27.6,7.5
		c-25.6,0-46.5-16.1-46.5-40.7C1067.9,217.1,1087.4,197.2,1114.4,197.2z M1050.7,202.3c-1-0.3-2.4-0.3-3.2-0.3
		c-0.6,0-1.2-0.2-1.2-0.9c0-0.6,0.7-0.9,2.1-0.9c3.9,0,8.2,0.3,10.1,0.3c2,0,6.2-0.3,9.9-0.3c1.1,0,1.8,0.3,1.8,0.9
		s-0.6,0.9-1.6,0.9s-2.2,0.2-3.6,0.6c-2.3,0.6-4.4,3.4-7.4,7.9l-16.6,23.9c3.2,5,19.6,32.4,22.2,35.6c1.7,2.2,3.2,3.4,5.9,4.3
		c1.7,0.5,2.9,0.6,3.8,0.6c0.7,0,1.3,0.2,1.3,0.8c0,0.7-0.8,1-1.9,1h-3c-2.4,0-10.4,0-18.2-0.2c-2.6-0.1-3.4-0.3-3.4-1
		c0-0.6,0.5-0.9,1.4-1.1c0.5-0.1,0.9-1,0.2-2.3c-5.6-9.9-11.3-19.9-16-27.5l-15,24.2c-1,1.6-1.5,3.1-1.4,4.3c0.1,0.9,1,1.5,1.9,1.7
		c0.6,0.1,1.5,0.2,2.3,0.2c0.6,0,1.2,0.3,1.2,0.9c0,0.7-0.7,0.9-2,0.9h-1.8c-0.6,0-7-0.3-9.5-0.3c-1.9,0-6.9,0.3-8.5,0.3h-1.7
		c-1,0-1.5-0.3-1.5-0.9s0.6-0.9,1.4-0.9c0.7,0,2.2-0.1,3.7-0.5c2.9-0.8,4.9-2.7,8.3-7.6l19.3-27.6l-17.4-28.9
		c-2.4-4-4.9-6.5-8.4-7.6c-1.6-0.5-3.2-0.7-4.3-0.7c-0.6,0-1-0.3-1-1c0-0.6,0.7-0.8,2-0.8c2.4,0,10.6,0.3,15.4,0.3
		c1.4,0,7.1-0.3,10.8-0.3c1.4,0,2,0.2,2,0.9c0,0.7-0.6,0.9-1.5,0.9c-0.6,0-1.9,0.1-2.7,0.4c-0.9,0.3-1.2,1-1.2,1.6s0.4,1.8,1,2.9
		c4.4,8.1,8.9,15.5,12.9,22.4c2.9-4.5,12.2-18.5,13.8-21.4c0.8-1.4,1.1-3,1.1-3.8C1052.4,203.4,1051.7,202.6,1050.7,202.3z
		 M749.3,197.2c16.1,0,21.5,7.9,26.6,4.7l1.4,17.3l-2.6-0.2c-4.1-13.4-13.6-17.1-27-17.1c-19.9,0-33.7,17.9-32.7,38.2
		c1,21.7,17.1,35.8,35.8,35.8c14,0,23-3.7,24.8-19.9h3.3l-2.2,17.3c-5.1,3.5-17.5,7.5-27.6,7.5c-25.6,0-46.5-16.1-46.5-40.7
		C702.8,217.1,722.3,197.2,749.3,197.2z M668.9,276.5c0.8,0,1.2,0,2-0.2c8.7-0.8,9.8-3.3,9.8-10.4V212c0-7.1-1.2-9.4-9.8-10.4
		c-0.8-0.2-1.2-0.2-2-0.2V199l2.4,0.2c6.3,0.4,8.7,0.8,12,0.8h5.9c3.3,0,5.9-0.4,12-0.8l2.6-0.2l-0.2,2.4c-0.8,0-1,0-2,0.2
		c-8.7,1-9.6,3.3-9.6,10.4v53.9c0,7.1,1,9.6,9.6,10.4c1,0.2,1.2,0.2,2,0.2l0.2,2.6l-2.6-0.2c-6.1-0.6-8.7-1-12-1h-5.9
		c-3.3,0-5.7,0.4-12,1l-2.4,0.2V276.5z"/>
	<path class="st2" d="M1255.5,295.6c-1,6.9-3.9,12.7-6.4,17.5c-0.6,1.2-1.3,2.4-1.9,3.6l-0.1,0.1l-0.1,0.1c-1,1.8-2,3.6-3.1,5.3
		l-0.1,0.1c-0.7,1.2-1.5,2.5-2.2,3.8c-3.6,6.4-8.7,26.1-11.2,60.5c0,3.1,0,6.7,0,11.2c0,6.8,3.6,56.1,11.8,70.8
		c0.8,1.4,1.5,2.7,2.3,3.9c1.2,2.1,2.2,3.7,3,5.2l0.1,0.1l0.1,0.1c0.7,1.4,1.3,2.6,2,3.8c2.8,5.3,6.1,11.8,6.6,19.9
		c9-32.3,13.9-66.3,13.9-101.5C1270.2,363.9,1265.1,328.8,1255.5,295.6z"/>
	<path class="st2" d="M1225.9,537.7c-8,0-15.7-3.4-21.3-9.3c-4.2-4.5-9.2-12.5-9.2-25.4c0-7.1,2.9-12.3,5.5-16.6
		c-25.2-5.6-118.4-15.7-244.9-26.4c2.4,110.7,8.2,224.6,14.3,308.8c129.1-26.7,234-119.5,277.8-241.4
		C1242.3,534.2,1234,537.7,1225.9,537.7z M1073.7,622c-1.4,1.6-3.9,0-9.2-4.3l-46.8-40.9v27.8c0,7.1,1.2,9.6,9.8,10.4
		c0.8,0.2,1.2,0.2,2,0.2l0.2,2.6l-2.6-0.2c-6.1-0.6-8.7-1-12-1h-5.9c-3.3,0-5.7,0.4-12,1l-2.6,0.2l0.2-2.6c0.8,0,1.2,0,2-0.2
		c8.7-0.8,9.8-3.3,9.8-10.4v-53.9c0-7.1-1.2-9.4-9.8-10.4c-0.8-0.2-1.2-0.2-2-0.2l-0.2-2.4l2.6,0.2c6.3,0.4,8.7,0.8,12,0.8h5.9
		c3.3,0,5.9-0.4,12-0.8l2.6-0.2l-0.2,2.4c-0.8,0-1.2,0-2,0.2c-8.7,1-9.8,3.3-9.8,10.4V572l26.6-22.6c6.3-5.5,3.9-8.3-3.1-9.1
		c-0.8-0.2-2-0.2-2-0.2l-0.2-2.4l2.6,0.2c6.3,0.4,8.7,0.8,12,0.8h2.4c3.3,0,5.9-0.4,12-0.8l2.6-0.2l-0.2,2.4c0,0-1.2,0-2,0.2
		c-8.7,1-15.7,8.7-20.3,12.6l-19.1,16.5c6.7,6.7,38.3,43.5,39.9,45.2C1070.9,616.7,1074.7,621.2,1073.7,622z M1158.5,610
		c-6.1,2.2-8.5,2.8-11.6,4.1l-5.3,2.4c-3,1.2-5.1,2.8-10.6,5.7l-2.2,1.2l-0.8-2.4c0,0,0.8-0.4,1.8-1c7.5-4.3,7.5-7.1,4.5-13.4
		l-3.1-7.3H1093l-2.6,5.9c-2.8,6.5-2.6,9.3,5.1,13.4c0.8,0.6,1.8,0.8,1.8,0.8l-0.8,2.6l-2.2-1.2c-5.5-2.8-7.9-4.1-10.8-5.3l-0.6-0.2
		c-3.1-1.2-5.5-1.8-11.4-3.7l-2.4-0.8l1-2.2c0,0,1.2,0.4,2,0.6c8.5,2.4,10.2,0.4,13-5.9l21.5-53.1c2.6-6.5-1.2-9.3-8.1-10
		c-0.8-0.2-1.2-0.2-2-0.2v-2.4l2.4,0.2c6.3,0.4,8.7,0.8,12,0.8h5.9c3.3,0,5.9-0.4,12-0.8l2.6-0.2l-0.2,2.4c-0.8,0-1,0-2,0.2
		c-6.7,0.8-10.6,3.7-7.9,9.8l23,52c3,6.5,5.1,8.5,13.4,5.7c0.8-0.2,1.8-0.6,1.8-0.6l1.2,2L1158.5,610z"/>
	<path class="st2" d="M538,481.8c0.6-1.2,1.3-2.4,1.9-3.6l0.1-0.1l0.1-0.1c1-1.8,2-3.6,3-5.3l0.1-0.1c0.7-1.2,1.5-2.5,2.2-3.8
		c8.3-14.7,11.8-64,11.8-70.8c0-4.4,0-8.1,0-11.2c-1.6-21.6-5.5-50.3-11.2-60.5c-0.7-1.3-1.5-2.6-2.2-3.8l-0.1-0.1
		c-1-1.6-2.1-3.5-3-5.2l-0.1-0.1l-0.1-0.1c-0.7-1.4-1.3-2.6-2-3.8c-2.5-4.7-5.5-10.5-6.4-17.4c-9.6,33.2-14.7,68.3-14.7,104.6
		c0,35.2,4.8,69.2,13.9,101.5C531.9,493.7,535.2,487.2,538,481.8z"/>
	<path class="st2" d="M834,459.8c-127.8,10.7-221.9,20.9-247.3,26.6c2.6,4.2,5.5,9.4,5.5,16.6c0,12.9-5,20.9-9.2,25.4
		c-5.6,5.9-13.3,9.3-21.3,9.3s-16.3-3.5-22.2-10.3c44.1,122.9,150.3,216.1,280.7,242C826.2,697.2,831.8,594.6,834,459.8z
		 M748.7,548.6c-1,0-1.9,0-3.1,0.3c-2.9,0.8-3.8,3-3.9,8.9l-1.1,66c0,2.3-0.4,3.2-1.4,3.2c-1.2,0-2.4-1.2-3.6-2.3
		c-6.6-6.3-20-20-30.8-30.7c-11.4-11.3-23-24.4-24.9-26.3h-0.3l1.2,43.9c0.2,8.2,1.6,10.9,3.7,11.6c1.8,0.6,3.8,0.7,5.4,0.7
		c1.1,0,1.8,0.2,1.8,0.8c0,0.8-0.9,1-2.4,1c-6.8,0-11-0.3-13-0.3c-0.9,0-5.9,0.3-11.3,0.3c-1.4,0-2.3-0.1-2.3-1
		c0-0.6,0.6-0.8,1.7-0.8c1.4,0,3.2-0.1,4.7-0.5c2.7-0.8,3.1-3.9,3.2-13l0.8-51.9l0,0c-1.1-5.9-3.7-7.1-6.3-6.3
		c-1.6,0.5-3.6,2.1-4.7,3c-1,0.8-1.5,0.8-1.9,0.3c-0.5-0.7,0.3-1.5,1.5-2.4c4.2-3.4,8.3-6.3,10-7.7c0.9-0.7,3.8-3.5,7.8-6.7
		c1.1-0.9,1.9-1.4,2.5-0.8c0.4,0.5,0.1,1.1-0.9,1.9c-0.8,0.7-1.5,1.2-2.2,2.2c-1.4,2-0.8,4.7,1.3,8.1c4.7,5,17.9,19,30.7,31.7
		c7.1,7.1,21.2,22.2,23,23.8h0.5l-1-47c-0.1-6.4-1-8.4-3.6-9.4c-1.6-0.6-4.1-0.6-5.5-0.6c-1.3,0-1.7-0.3-1.7-0.9
		c0-0.8,1.2-0.9,2.7-0.9c5.4,0,10.5,0.3,12.7,0.3c1.2,0,5.1-0.3,10.2-0.3c1.4,0,2.4,0.1,2.4,0.9C750.6,548.3,750,548.6,748.7,548.6z
		 M785.3,626.7c-6.1-0.6-8.7-1-12-1h-5.9c-3.3,0-5.7,0.4-12,1l-2.4,0.2v-2.6c0.8,0,1.2,0,2-0.2c8.7-0.8,9.8-3.3,9.8-10.4v-53.9
		c0-7.1-1.2-9.4-9.8-10.4c-0.8-0.2-1.2-0.2-2-0.2v-2.4l2.4,0.2c6.3,0.4,8.7,0.8,12,0.8h5.9c3.3,0,5.9-0.4,12-0.8l2.6-0.2l-0.2,2.4
		c-0.8,0-1,0-2,0.2c-8.7,1-9.6,3.3-9.6,10.4v53.9c0,7.1,1,9.6,9.6,10.4c1,0.2,1.2,0.2,2,0.2l0.2,2.6L785.3,626.7z"/>
</g>
<g>
	<path class="st2" d="M893.9-78.7C629.8-78.7,415,136.1,415,400.2c0,235.1,170.3,431.2,394.1,471.4c3.2-20.5,7-52.2,10.7-95.3
		c-176-34.6-309.1-190.1-309.1-376.1c0-211.4,171.9-383.3,383.3-383.3s383.3,171.9,383.3,383.3c0,185-131.7,339.8-306.3,375.5
		c3,40.7,6,73.9,8.7,95.7c223.3-40.5,393.2-236.4,393.2-471.2C1372.8,136.2,1158-78.7,893.9-78.7z M1342.6,347
		c2.1,16.8-6.4,28.4-21.9,30.3c-15.4,1.9-29-7.4-31.1-24.5c-2.4-19.3,11.2-28.9,23.1-30.4C1324.3,320.9,1340.1,326.7,1342.6,347z
		 M445,397.7c0-0.5,0.7-1.2,1-2.9c0.3-2,0.6-4.5,0.7-6.8l1.4-26.9c0.2-4.3-0.4-6-0.3-6.5c0-0.5,0.4-0.5,1.5-0.5
		c1.4,0.1,6.1,0.5,7.9,0.6c0.7,0.1,1.1,0.3,1.1,0.7c0,0.5-0.4,0.7-1.4,0.7h-0.7c-1.8,0-3.8,1.8-4.2,7.8l-0.7,8.5l27.8,1.5
		c6.2,0.3,11.6,0.6,14.5,0.4c1.9-0.1,3.4-0.4,3.8-2.5c0.2-0.9,0.4-2.4,0.5-3.4c0-0.7,0.3-1.1,0.6-1.1c0.5,0,0.7,0.6,0.6,1.3
		c-0.2,4.5-0.7,8.7-0.8,10.6c-0.1,1.6-0.1,5.8-0.2,8.6c0,0.9-0.3,1.3-0.8,1.3c-0.3,0-0.5-0.3-0.5-1.1c0.1-1,0-1.8-0.1-2.5
		c-0.2-1.4-1.7-1.9-3.6-2.2c-2.8-0.5-8.2-0.8-14.4-1.1l-27.8-1.5l-0.3,10.1c-0.1,3.9,0.2,5.6,1.6,6.7c1,0.7,1.8,1.1,2.3,1.3
		s0.8,0.4,0.8,0.8c0,0.5-0.4,0.6-1.1,0.6c-1.1-0.1-7.2-1.7-7.7-1.8C445.4,398.4,445,398.1,445,397.7z M451.5,464.6
		c-0.5,0-0.7-0.4-0.8-1.4c-0.4-3.6-0.6-7.9-0.8-9.3c-0.2-2.3-1-7.4-1.2-9.5c-0.4-4.3-0.5-8.8,1.6-12.7c1.1-2,4.2-5.1,8.8-5.6
		c5-0.5,9.8,1.1,16.1,7.3c6.9-6.8,12.5-12.1,16.2-16.5c3.5-4.2,3.7-7,3.8-8c0.1-0.8,0.1-1.4,0-1.9s0.1-0.8,0.5-0.9
		c0.5-0.1,0.7,0.4,0.8,1.2l0.7,6.4c0.4,3.8,0.2,5.5-0.5,7.4c-1.2,3.1-4.2,6-9,10.3c-3.4,3.1-7.7,6.7-8.6,7.7
		c-0.4,0.4-0.4,0.8-0.3,1.3l0.5,5.9c0,0.3,0.2,0.5,0.6,0.5l0.9-0.1c6.3-0.7,11.6-1.2,14.4-1.9c1.9-0.4,3.4-1,3.4-3
		c0-1,0-2.5-0.1-3.3c-0.1-0.5,0.1-0.8,0.5-0.9c0.5,0,0.7,0.4,0.8,1.3c0.4,3.9,0.7,8.9,0.8,10c0.1,1.3,0.8,5.5,1.1,8.2
		c0.1,0.9-0.1,1.4-0.5,1.4c-0.3,0-0.6-0.2-0.7-1c-0.1-1-0.3-1.8-0.5-2.4c-0.4-1.3-1.9-1.5-3.9-1.6c-2.9,0-8.2,0.5-14.4,1.2
		l-11.9,1.2c-10.3,1.1-12.2,1.3-14.3,1.6c-2.3,0.4-3.3,1-3.5,3.3c-0.1,0.6,0,1.7,0.1,2.7C452.1,464.1,452,464.6,451.5,464.6z
		 M698.5,811.9c0.3-0.8,1.7-2.8,5.6-12.3c0.5-1.2,0.9-1.5,1.5-1.3c0.5,0.2,0.5,0.7,0.4,1.3c-0.5,1.8-1.1,4.4,0,7.4
		c1.3,3.4,6,9.3,14.6,12.8c4.2,1.7,9.9,3.6,17,1.4c5.7-1.9,10.8-6.5,14.6-15.8c6.6-16.4,1.1-32.9-14.9-39.4c-2-0.8-4.6-1.9-6.8-1.8
		c-1.4,0.1-2.1,0.9-2.6,2.2l-2.9,7.2c-1.5,3.8-2.7,6.7-3.6,9c-1,2.6-0.8,4.1,1.5,5.7c0.5,0.4,1.8,1,2.9,1.4c0.7,0.3,1.1,0.6,0.9,1.1
		c-0.2,0.6-0.8,0.5-1.9,0.1c-4-1.6-8.7-3.8-11-4.7c-2.4-1-6.5-2.4-9-3.4c-1-0.4-1.5-0.8-1.2-1.4c0.2-0.5,0.7-0.4,1.2-0.2
		c0.6,0.2,1.2,0.4,2.1,0.6c2.2,0.4,3.5-0.5,4.6-3.2c1-2.3,2.2-5.3,3.8-9.1l3.4-8.4c0.8-2.1,1-2.2,2.1-2.3c6-0.6,13.8,1.6,19.7,4
		c18.7,7.5,31.6,23.1,23.1,44.1c-4.9,12.2-14.7,18.2-23.3,19.6c-9.1,1.5-16.1-0.7-22.5-3.3c-5.3-2.1-11.6-5.7-13-6.7
		c-1.5-1-4-2.5-5.7-3.3C698.4,812.8,698.3,812.5,698.5,811.9z M657,724.4c-1-5.4-3.1-7.3-3.9-8c-0.6-0.5-1-0.9-1.5-1.2
		s-0.6-0.6-0.4-0.9c0.3-0.5,0.8-0.3,1.5,0.1l5.4,3.5c3.2,2.1,4.4,3.3,5.4,5c1.6,2.9,2,7,2.4,13.4c0.2,4.6,0.3,10.2,0.5,11.5
		c0.1,0.5,0.4,0.8,0.8,1.1l4.9,3.3c0.3,0.2,0.5,0.2,0.8-0.2l0.5-0.8c3.4-5.3,6.4-9.8,7.6-12.4c0.9-1.8,1.4-3.2-0.2-4.6
		c-0.8-0.7-2-1.6-2.6-2c-0.5-0.3-0.6-0.6-0.4-0.9c0.3-0.4,0.8-0.3,1.5,0.2c3.3,2.1,7.4,5.1,8.3,5.6c1.1,0.7,4.8,2.9,7.1,4.3
		c0.7,0.5,1,0.9,0.8,1.3c-0.2,0.3-0.5,0.3-1.2-0.1c-0.9-0.6-1.6-0.9-2.2-1.1c-1.3-0.5-2.4,0.6-3.7,2.1c-1.8,2.2-4.8,6.7-8.2,11.9
		l-6.5,10c-5.6,8.7-6.7,10.3-7.7,12.2c-1.1,2-1.3,3.2,0.3,4.8c0.4,0.4,1.3,1.1,2.1,1.6c0.6,0.4,0.9,0.7,0.6,1.1
		c-0.3,0.4-0.7,0.3-1.6-0.3c-3-2-6.5-4.5-7.7-5.2c-1.9-1.3-6.4-3.9-8.1-5c-3.6-2.3-7.2-5.2-8.9-9.3c-0.9-2.1-1.3-6.5,1.2-10.3
		c2.7-4.2,7-6.9,15.8-7.9C658.7,737.7,658.1,730.1,657,724.4z M608.3,703.1c0.4-0.4,0.8-1,1.3-0.6c0.4,0.3,0.3,0.6,0.1,0.9
		c-0.4,0.6-1,1.2-1.4,2c-0.6,1.2-0.6,2.6,1.1,4.5c0.9,0.9,5.9,5.4,7.1,6.5c0.3,0.2,0.5,0.1,0.8-0.2l3.5-4c1.5-1.7,5.7-6.4,6.9-7.9
		c3-3.6,2.8-5.1-2.4-9.7c-1.3-1.2-3.5-3-5.4-3.6c-1.9-0.5-3.4,0-5.6,1.8c-0.6,0.5-0.9,0.6-1.2,0.3c-0.4-0.4-0.1-0.8,0.4-1.3
		c1-1.2,4.5-4.3,5.6-5.1c1.5-1,2-0.6,3.9,1.1c7.7,6.7,10.9,10,13.9,12.7c1.2,1,4.5,3.7,6.6,5.5c0.7,0.6,0.9,1,0.6,1.4
		c-0.2,0.3-0.6,0.2-1.2-0.3c-0.8-0.7-1.5-1.1-2-1.4c-1.2-0.7-2.4,0.2-3.9,1.5c-2.1,1.9-5.6,6-9.7,10.7l-7.8,9c-6.8,7.8-8,9.2-9.3,11
		c-1.4,1.8-1.7,3-0.3,4.8c0.3,0.5,1.1,1.3,1.9,1.9c0.6,0.5,0.8,0.9,0.5,1.2c-0.3,0.4-0.8,0.1-1.5-0.5c-2.7-2.4-5.8-5.3-7.2-6.6
		c-1.6-1.4-11.8-10.3-12.9-11.1c-1.1-0.7-2-1.4-2.5-1.6c-0.3-0.2-0.7-0.3-1-0.5s-0.1-0.5,0.1-0.7c0.3-0.4,1.1-0.8,3.3-3
		c0.5-0.5,2.6-2.6,3.2-3.2c0.3-0.2,0.6-0.4,1-0.1c0.4,0.3,0.2,0.7-0.2,1.1c-0.3,0.4-1,1.3-1.3,2.1c-0.4,1.2-0.5,2.3,1.8,4.8
		c0.8,0.9,6.1,5.6,7.1,6.5c0.3,0.2,0.5,0.2,0.8-0.2l11.3-13c0.3-0.4,0.4-0.6,0.1-0.9c-1.1-1-7-6.1-8.3-7c-1.3-1-2.2-1.5-3.1-1.4
		c-0.7,0.1-1.1,0.2-1.4,0c-0.2-0.2-0.3-0.4,0-0.7s1.2-0.9,3.7-3.4C606.1,705.4,607.9,703.5,608.3,703.1z M570.9,660.9
		c0.3,0.4,0.2,0.6-0.1,0.9c-0.5,0.5-1.1,1.1-1.7,1.8c-0.8,1.1-0.9,2.5,0.5,4.6c0.7,1.1,5.1,6.2,6.2,7.4c0.2,0.3,0.5,0.1,0.8-0.1
		l4-3.5c1.7-1.5,6.5-5.6,7.9-6.9c3.4-3.2,3.5-4.7-1-9.9c-1.2-1.3-3-3.5-4.8-4.3s-3.4-0.5-5.8,1c-0.7,0.4-0.9,0.5-1.3,0.1
		c-0.4-0.4,0.1-0.8,0.6-1.2c1.2-1,5-3.6,6.3-4.3c1.6-0.8,2-0.3,3.7,1.6c6.7,7.7,9.4,11.4,12,14.5c1,1.2,4,4.3,5.8,6.3
		c0.6,0.7,0.7,1.2,0.4,1.5c-0.3,0.2-0.6,0.2-1.1-0.5c-0.7-0.8-1.3-1.3-1.8-1.7c-1.1-0.8-2.4-0.1-4.1,1c-2.4,1.6-6.4,5.1-11.1,9.2
		l-9,7.8c-7.8,6.8-9.2,8-10.8,9.5c-1.7,1.6-2.1,2.7-1,4.7c0.3,0.5,1,1.4,1.6,2.1c0.5,0.6,0.7,1,0.3,1.3c-0.4,0.3-0.8,0-1.4-0.7
		c-2.4-2.7-5-6.1-6.3-7.5c-1.4-1.6-10.3-11.8-11.2-12.8c-0.9-0.9-1.8-1.6-2.2-1.9c-0.3-0.2-0.7-0.4-0.9-0.6
		c-0.2-0.3-0.1-0.5,0.2-0.7c0.4-0.3,1.2-0.6,3.7-2.5c0.6-0.4,2.9-2.3,3.6-2.7c0.3-0.2,0.7-0.3,1,0c0.3,0.4,0.1,0.7-0.3,1.1
		c-0.4,0.3-1.2,1.1-1.6,1.9c-0.6,1.2-0.8,2.2,1.1,5c0.7,1,5.2,6.4,6.1,7.5c0.2,0.3,0.5,0.2,0.8-0.1l13-11.3c0.4-0.3,0.5-0.5,0.3-0.9
		c-1-1.1-6.1-7-7.2-8.1c-1.2-1.1-2-1.8-2.9-1.8c-0.7,0-1.2,0-1.4-0.2s-0.2-0.4,0.1-0.7c0.3-0.3,1.4-0.7,4.1-2.8
		c1.1-0.8,3.3-2.5,3.6-2.8C569.9,661,570.5,660.5,570.9,660.9z M543,587.9c-0.4-2.2-0.9-3.4-1.4-4.1c-0.3-0.4-0.4-0.8,0-1
		c0.4-0.3,0.8-0.1,1.4,1l3.1,5c1.1,1.7,1.7,2.8,2.4,4c1.7,3.3,1.4,5.6,0.7,9.5c-0.7,3.9-6.9,23.6-7.8,25.9l-0.5,1.2l0.2,0.3l5.2-3.3
		c5.3-3.3,9.9-6.2,12.2-7.9c1.5-1.1,2.5-2.4,1.8-4c-0.4-0.9-1.1-2.2-1.5-3c-0.3-0.5-0.3-0.9,0-1c0.4-0.3,0.9,0.1,1.3,0.7
		c2,3.2,4.1,7,5,8.4c0.8,1.3,3.3,4.8,4.7,7.1c0.5,0.7,0.5,1.3,0.1,1.5c-0.3,0.2-0.6,0.1-1-0.6c-0.5-0.9-1.1-1.5-1.5-1.9
		c-1-1-2.4-0.5-4.2,0.3c-2.6,1.2-7.1,4.1-12.4,7.4l-10.1,6.3c-8.8,5.5-10.4,6.5-12.1,7.7c-1.9,1.3-2.5,2.4-1.7,4.5
		c0.2,0.5,0.7,1.5,1.2,2.4c0.4,0.6,0.5,1.1,0.1,1.3c-0.4,0.3-0.8-0.1-1.3-0.9c-1.9-3.1-4-6.8-4.9-8.2c-0.9-1.4-3.3-4.9-4.5-6.9
		c-0.5-0.8-0.6-1.3-0.2-1.5c0.4-0.3,0.7,0,1,0.5c0.4,0.6,0.6,0.9,1.2,1.5c1.3,1.4,2.5,1.2,4.6,0.1c1.9-1,3.5-2,12.3-7.5l2.5-1.6
		l-0.2-0.3c-3.4-0.6-17.2-3.7-20.2-4.1c-2.9-0.4-5.1-0.8-6.1-0.2c-0.6,0.4-0.9,0.9-0.6,1.5c0.2,0.6,0.2,0.9-0.1,1.1
		c-0.4,0.3-0.7,0-1.1-0.6c-0.8-1.2-2.6-4.5-3.5-6c-1.1-1.8-3.3-4.8-4.4-6.6c-0.4-0.6-0.5-1.1-0.1-1.3c0.4-0.3,0.7,0,1.1,0.5
		c0.5,0.8,1.6,2.1,2.7,2.9c1.8,1.4,4.2,2.6,8.2,3.5c2.8,0.7,16.9,4,20.2,4.7c1.4-3.8,6.5-22.7,7.2-26.2
		C542.7,596,543.7,591.8,543,587.9z M516.5,514c6.9,22.6-7.2,36.8-21.1,41.1c-13.4,4.1-33.5,0.5-40.7-23c-6-19.6,1.7-35.2,19.7-40.7
		C492.3,485.8,510.4,494,516.5,514z M513.3,284.3c-0.9,4.3-2,8.5-2.4,10.3c-0.3,1.5-1,5.8-1.6,8.3c-0.2,0.9-0.5,1.4-1,1.3
		c-0.3-0.1-0.5-0.4-0.3-1.2c0.2-1,0.2-1.8,0.2-2.4c0-1.4-1.4-2-3.2-2.7c-2.7-0.9-8-2-14.1-3.3l-5.8-1.2c-0.3-0.1-0.4,0.1-0.5,0.3
		l-5.4,25.4c0,0.2,0,0.4,0.3,0.5l5.8,1.2c6.1,1.3,11.4,2.4,14.3,2.7c1.9,0.2,3.4,0.1,4.1-1.8c0.3-0.9,0.8-2.3,1-3.3
		c0.2-0.7,0.4-1,0.8-0.9c0.5,0.1,0.6,0.7,0.4,1.5c-0.9,4.3-2,8.5-2.4,10.3c-0.3,1.5-1,5.8-1.6,8.4c-0.2,0.9-0.5,1.3-0.9,1.2
		c-0.3-0.1-0.5-0.4-0.3-1.2c0.2-1,0.2-1.8,0.2-2.4c0-1.4-1.4-2-3.2-2.7c-2.7-0.9-8-2-14.1-3.3l-11.7-2.5c-10.1-2.1-12-2.5-14.1-2.9
		c-2.3-0.3-3.5,0-4.4,2.1c-0.2,0.5-0.6,1.6-0.8,2.5c-0.2,0.7-0.4,1.1-0.8,1c-0.5-0.1-0.5-0.6-0.3-1.5c0.8-3.6,1.9-7.7,2.2-9.5
		c0.3-1.6,1-5.8,1.6-8.4c0.2-0.9,0.4-1.4,0.9-1.3c0.5,0.1,0.5,0.5,0.3,1.3c-0.1,0.5-0.2,1.1-0.2,2c0,1.9,1,2.6,3.3,3.3
		c2.1,0.6,4,1,14.1,3.1l1.4,0.3c0.3,0.1,0.5-0.1,0.6-0.3l5.4-25.4c0-0.2,0-0.4-0.4-0.5l-1.4-0.3c-10.1-2.1-12-2.5-14.1-2.9
		c-2.3-0.3-3.5,0-4.4,2.1c-0.2,0.5-0.6,1.6-0.8,2.5c-0.2,0.7-0.4,1.1-0.8,1c-0.5-0.1-0.5-0.6-0.3-1.5c0.8-3.6,1.9-7.7,2.2-9.5
		c0.3-1.6,1-5.8,1.6-8.4c0.2-0.9,0.4-1.4,0.9-1.3s0.5,0.5,0.3,1.3c-0.1,0.5-0.2,1.1-0.2,2c0,1.9,1,2.6,3.3,3.3c2.1,0.6,4,1,14.1,3.1
		l11.7,2.5c6.1,1.3,11.4,2.4,14.3,2.7c1.9,0.2,3.4,0.1,4.1-1.8c0.3-0.9,0.8-2.3,1-3.3c0.2-0.7,0.4-1,0.8-0.9
		C513.4,282.9,513.5,283.5,513.3,284.3z M531.4,240.5c-7.6,17.9-24.1,19.5-35.2,14.8c-10.7-4.5-21.5-17.5-13.6-36.2
		c6.6-15.6,19.8-21.4,34.1-15.3C531,209.8,538.1,224.6,531.4,240.5z M565.8,176.6c-2.8,4.1-6.9,8.7-8.8,11.5c-0.9,1.3-3.1,5-4.6,7.2
		c-0.5,0.7-0.9,1-1.3,0.7c-0.3-0.2-0.3-0.5,0.2-1.2c0.6-0.8,0.9-1.6,1.1-2.2c0.5-1.3-0.5-2.4-2-3.7c-2.2-1.9-6.6-4.9-11.8-8.4
		l-9.9-6.7c-8.6-5.8-10.1-6.8-12-7.9c-2-1.2-3.2-1.3-4.8,0.3c-0.4,0.4-1.1,1.3-1.6,2.1c-0.4,0.6-0.8,0.9-1.2,0.6s-0.2-0.7,0.3-1.6
		c2-3,4.6-6.4,5.6-8c1.2-1.7,3.4-5.4,5.7-8.8c4.7-7,11.1-16.4,21.6-18.2c4.8-0.8,11.3-0.3,18,4.2c7.1,4.8,10.5,11.4,11.6,16.7
		C572.8,157.7,572.8,166.2,565.8,176.6z M614.8,117.6c-13.8,13.8-29.7,9-38.2,0.5c-8.2-8.2-13.4-24.3,1-38.7
		c12-12,26.4-12.4,37.4-1.4C626,89,627,105.4,614.8,117.6z M685.2,60.1l-1.7,1.2c-1.3,0.9-5.7,4-10.1,6.9c-1.5,1-2,1.2-2.3,0.8
		c-0.2-0.3-0.1-0.7,0.3-1.2c0.2-0.3,0.1-0.9-0.8-1.4c-6.9-3.3-13.9-6.6-19.4-9l1.1,19.1c0.1,1.3,0.4,2.3,0.9,2.9
		c0.4,0.5,1.1,0.4,1.7,0.2c0.4-0.2,0.9-0.5,1.4-0.8c0.3-0.2,0.8-0.3,1,0c0.3,0.4,0,0.8-0.8,1.3l-1,0.7c-0.3,0.2-4,2.5-5.3,3.5
		c-1.1,0.7-3.7,2.8-4.6,3.4l-0.9,0.7c-0.6,0.4-1,0.4-1.2,0.1s0-0.7,0.4-1c0.4-0.3,1.2-0.9,1.9-1.7c1.3-1.6,1.6-3.4,1.6-7.4V55.8
		l-20.7-9.2c-2.9-1.3-5.2-1.7-7.5-0.9c-1.1,0.3-2.1,0.9-2.6,1.2c-0.3,0.2-0.7,0.2-0.9-0.2c-0.2-0.3,0.1-0.7,0.8-1.2
		c1.3-0.9,6-3.9,8.6-5.8c0.8-0.5,3.8-2.9,5.8-4.3c0.8-0.5,1.2-0.7,1.5-0.3s0,0.7-0.5,1.1c-0.3,0.2-1,0.8-1.3,1.3
		c-0.4,0.5-0.3,1,0,1.4c0.2,0.3,0.9,0.8,1.7,1.2c5.5,2.8,10.9,5.1,15.7,7.4c-0.1-3.6-0.4-14.9-0.7-17c-0.1-1.1-0.6-2.1-0.9-2.5
		s-1-0.6-1.6-0.3c-0.7,0.2-1.5,0.8-1.9,1.1c-0.3,0.2-0.7,0.4-1,0c-0.2-0.3,0-0.8,0.8-1.3c2.2-1.5,4.6-3,5.7-3.7
		c1.1-0.8,3.3-2.5,5.3-4c0.6-0.4,1.1-0.5,1.4-0.2c0.2,0.3,0,0.7-0.5,1.1c-0.6,0.4-1.1,1-1.8,1.7c-1,1.2-1.1,3.6-1,7.2l0.1,19.5
		c3.7,1.5,23.3,10.2,25.9,11.1c1.8,0.6,3.1,0.6,4.9,0.1c1.1-0.4,1.8-0.8,2.3-1.1c0.4-0.3,0.8-0.4,1-0.1
		C686.1,59.2,685.8,59.6,685.2,60.1z M781.5,16c-2.8,1.1-8.4,3.2-14.6,5.4c-1.4,0.5-2.3,0.8-2.5,0.3s0.1-0.7,0.8-1.1
		c0.5-0.4,0.8-1.3,0-2L752.8,4.7c-0.3-0.3-0.6-0.4-1-0.2l-17.1,6.6c-0.4,0.1-0.5,0.4-0.5,0.9l0.1,12.6c0,2.2,0.3,4.2,0.6,5.1
		c0.5,1.4,1.6,2.1,4,1.2l1.2-0.4c0.9-0.4,1.2-0.3,1.4,0.2c0.2,0.6-0.2,0.9-1,1.3c-2.5,0.9-5.8,2-8.2,2.9c-0.8,0.3-5,2.2-9,3.7
		c-1,0.4-1.5,0.4-1.8-0.2c-0.2-0.5,0.1-0.7,0.7-1c0.7-0.3,1.7-0.8,2.3-1.1c3.4-1.8,3.8-5,3.9-9.4l0.8-55.6c0.1-2.6,0.2-3.6,1-3.9
		c0.7-0.3,1.4,0.2,2.9,1.7c3.5,3.5,27.8,30.1,37.1,39.9c5.6,5.8,8.2,6,10,5.8c1.2-0.2,2.4-0.6,3.3-0.9c0.6-0.2,1-0.3,1.2,0.2
		C785,14.5,784.3,15,781.5,16z M849.1,2.1l-6.3,1.2c-3.7,0.7-5.5,0.7-7.4,0.1c-3.2-1-6.3-3.6-11-8c-3.4-3.1-7.3-7.1-8.4-7.9
		c-0.4-0.3-0.8-0.3-1.3-0.2l-5.8,1c-0.3,0.1-0.5,0.2-0.4,0.6l0.2,0.9c1.2,6.2,2.2,11.5,3.1,14.2c0.6,1.9,1.3,3.3,3.3,3.2
		c1-0.1,2.5-0.2,3.3-0.4c0.5-0.1,0.8,0,0.9,0.4c0.1,0.5-0.3,0.8-1.2,0.9c-3.9,0.8-8.8,1.5-9.8,1.7c-1.3,0.2-5.4,1.3-8.1,1.8
		c-0.9,0.2-1.4,0.1-1.5-0.4c-0.1-0.3,0.2-0.6,1-0.7c1-0.2,1.8-0.5,2.3-0.7c1.3-0.5,1.3-2.1,1.2-4c-0.2-2.9-1.2-8.1-2.4-14.3
		l-2.3-11.7c-2-10.1-2.3-12-2.9-14.1c-0.6-2.2-1.3-3.2-3.6-3.2c-0.6,0-1.7,0.1-2.6,0.3c-0.7,0.1-1.2,0.1-1.3-0.4s0.4-0.7,1.4-0.9
		c3.5-0.7,7.8-1.3,9.2-1.6c2.3-0.4,7.3-1.6,9.4-2c4.2-0.8,8.7-1.3,12.8,0.5c2.1,0.9,5.4,3.8,6.3,8.3c1,4.9-0.2,9.9-5.9,16.6
		c7.4,6.3,13.1,11.4,17.9,14.7c4.5,3.1,7.3,3.1,8.3,3.1c0.8,0,1.4-0.1,1.9-0.2c0.5-0.1,0.8,0,0.9,0.4C850.4,1.7,849.9,1.9,849.1,2.1
		z M904.7-2.2c-0.3,1.2-0.6,1.5-1.7,2c-2.7,1.1-7.8,1.7-12.2,1.8c-9.3,0.2-17.2-1.7-23.4-7c-6.8-5.7-8.7-13.3-8.8-19.9
		c-0.1-4.6,1.2-12.7,7.6-18.7c4.8-4.6,11.2-7.4,21.3-7.6c4.2-0.1,6.7,0.2,9.9,0.5c2.6,0.3,4.8,0.9,6.8,1c0.8,0.1,1,0.4,1,0.8
		c0,0.5-0.2,1.4-0.3,3.7c-0.1,2.2,0,6-0.1,7.3c-0.1,1-0.2,1.6-0.8,1.6c-0.5,0-0.7-0.5-0.7-1.5c-0.1-2.1-1-4.5-2.8-6.2
		c-2.3-2.3-7.6-4.1-13.9-4c-5.9,0.1-9.8,1.7-12.7,4.4c-4.9,4.6-6.1,11.1-5.9,17.7c0.3,16.2,12.7,24,21.8,23.8c6-0.1,9.7-0.8,12.4-4
		c1.1-1.3,2-3.3,2.2-4.5c0.2-1.1,0.3-1.4,0.9-1.4c0.5,0,0.6,0.5,0.6,1C906-10.5,905.3-4.5,904.7-2.2z M988-40.6
		c-0.5-0.1-1.2-0.1-2-0.1c-1.9,0-2.6,1.1-3.1,3.4c-0.5,2.1-0.8,4-2.4,14.2l-1.9,11.8c-1,6.2-1.8,11.5-1.9,14.4c-0.1,1.9,0.1,3.4,2,4
		c0.9,0.3,2.4,0.7,3.4,0.8c0.7,0.1,1,0.4,1,0.7c-0.1,0.5-0.6,0.6-1.4,0.5c-4.4-0.7-8.6-1.6-10.4-1.9c-1.5-0.2-5.8-0.7-8.4-1.1
		c-0.9-0.1-1.4-0.4-1.3-0.9c0.1-0.3,0.4-0.5,1.2-0.4c1,0.2,1.8,0.2,2.5,0.1c1.4-0.1,2-1.5,2.5-3.4c0.8-2.8,1.6-8.1,2.6-14.2l0.9-5.9
		c0-0.3-0.1-0.4-0.3-0.5l-25.6-4.1c-0.2,0-0.4,0-0.5,0.3L944-17c-1,6.2-1.8,11.5-1.9,14.4c-0.1,1.9,0.1,3.4,2,4
		c0.9,0.3,2.4,0.7,3.4,0.8c0.7,0.1,1,0.4,1,0.7c-0.1,0.5-0.6,0.6-1.4,0.5c-4.4-0.7-8.6-1.6-10.4-1.9c-1.5-0.2-5.8-0.7-8.5-1.1
		c-0.9-0.1-1.3-0.4-1.2-0.9c0.1-0.3,0.4-0.5,1.2-0.4c1,0.2,1.8,0.2,2.5,0.1c1.4-0.1,2-1.5,2.5-3.4c0.8-2.8,1.6-8.1,2.6-14.2
		l1.9-11.8c1.6-10.2,1.9-12.1,2.1-14.2c0.2-2.3-0.1-3.5-2.3-4.3c-0.5-0.2-1.6-0.5-2.6-0.6c-0.7-0.1-1.1-0.3-1-0.8s0.6-0.5,1.5-0.4
		c3.6,0.6,7.8,1.4,9.6,1.7c1.6,0.3,5.9,0.7,8.5,1.1c0.9,0.1,1.4,0.4,1.3,0.8c-0.1,0.5-0.5,0.5-1.3,0.4c-0.5-0.1-1.2-0.1-2-0.1
		c-1.9,0-2.6,1.1-3.1,3.4c-0.5,2.1-0.8,4-2.4,14.2l-0.2,1.4c-0.1,0.3,0.1,0.5,0.3,0.5l25.6,4.1c0.2,0,0.4-0.1,0.5-0.4l0.2-1.4
		c1.6-10.2,1.9-12.1,2.1-14.2c0.2-2.3-0.1-3.5-2.3-4.3c-0.5-0.2-1.6-0.5-2.6-0.6c-0.7-0.1-1.1-0.3-1-0.8s0.6-0.5,1.5-0.4
		c3.6,0.6,7.8,1.4,9.6,1.7c1.6,0.3,5.9,0.7,8.5,1.1c0.9,0.1,1.4,0.4,1.3,0.8C989.3-40.6,988.8-40.5,988-40.6z M1063.2,7.3
		c-2.8,8.1-8.3,13.1-13.2,15.5c-4,2-12.2,4.3-24.1,0.2c-4.7-1.6-10.2-4.4-13.4-5.5c-1.5-0.5-5.6-1.7-8.2-2.6
		c-0.8-0.3-1.2-0.6-1.1-1.1c0.1-0.3,0.4-0.4,1.2-0.2c1,0.3,1.8,0.5,2.4,0.5c1.4,0.2,2.2-1.1,3.1-2.9c1.3-2.6,3-7.7,5-13.6l3.9-11.3
		c3.4-9.8,4-11.6,4.6-13.7c0.6-2.2,0.5-3.4-1.5-4.6c-0.5-0.3-1.5-0.7-2.4-1.1c-0.7-0.2-1-0.5-0.9-1c0.2-0.4,0.6-0.4,1.6-0.1
		c3.4,1.2,7.4,2.8,9.2,3.4c2,0.7,6.1,1.9,10,3.2c8,2.8,18.8,6.5,23.2,16.2C1064.7-6.7,1065.9-0.3,1063.2,7.3z M1112.9,5.3
		c-0.2,0.5-0.7,0.4-1.3,0.1c-0.6-0.3-1.1-0.5-1.9-0.7c-1.8-0.5-2.8,0.3-4,2.3c-1.1,1.9-2,3.6-6.7,12.8l-5.4,10.7
		c-3,5.9-5.4,10.7-6.5,13.4c-0.7,1.7-0.8,3,0.9,4.2c0.8,0.6,2.1,1.4,3,1.8c0.7,0.3,0.9,0.7,0.7,1c-0.2,0.4-0.8,0.4-1.5,0
		c-4-2-7.7-4.2-9.3-5c-1.4-0.7-5.3-2.5-7.7-3.7c-0.8-0.4-1.1-0.8-0.9-1.2c0.2-0.3,0.5-0.4,1.2,0c0.9,0.5,1.7,0.7,2.3,0.9
		c1.3,0.4,2.2-0.5,3.3-2.1c1.6-2.4,4-7.2,7-13l5.4-10.7c4.7-9.2,5.5-10.9,6.4-12.9c0.9-2.1,0.8-3.5-0.3-4.4c-0.6-0.5-1.3-1-2.1-1.4
		c-0.6-0.3-0.9-0.6-0.7-1.1c0.2-0.4,0.7-0.2,1.7,0.3c2.3,1.2,6,3.3,7.8,4.2c1.5,0.8,5.2,2.4,7.5,3.6C1112.6,4.6,1113,4.9,1112.9,5.3
		z M1167.8,71.3c-9.1,12.6-25.2,16.1-39.1,6c-15.8-11.5-13.6-27.9-6.5-37.6c6.8-9.4,21.9-17,38.3-5
		C1174.2,44.5,1176.9,58.7,1167.8,71.3z M1189.9,126.6c4.1,4.4,7.1,6.6,11.3,6.5c1.7,0,3.8-0.7,4.9-1.4c0.9-0.6,1.2-0.7,1.6-0.3
		c0.3,0.3,0.1,0.8-0.3,1.1c-0.6,0.6-5.5,4-7.6,5.1c-1.1,0.5-1.5,0.6-2.6,0.1c-2.6-1.2-6.5-4.7-9.5-7.9c-6.3-6.8-10.2-13.9-10.5-22.1
		c-0.3-8.9,4.1-15.3,8.9-19.8c3.4-3.2,10.2-7.6,19-6.9c6.6,0.5,13,3.4,19.9,10.8c2.9,3.1,4.4,5.1,6.2,7.7c1.5,2.1,2.5,4.1,3.8,5.8
		c0.5,0.6,0.4,1,0.1,1.3c-0.4,0.4-1.1,0.8-3,2.3c-1.7,1.4-4.4,4-5.5,4.9c-0.8,0.6-1.3,0.9-1.7,0.5s-0.1-0.9,0.6-1.5
		c1.5-1.5,2.6-3.8,2.8-6.2c0.2-3.3-2.1-8.4-6.3-13c-4-4.3-7.8-6.1-11.8-6.5c-6.7-0.5-12.3,2.9-17.1,7.4
		C1181.1,105.4,1183.7,119.9,1189.9,126.6z M1240,153.2l-4.4,3.1c-1.9,1.3-7.1,4.9-8.6,6c-3.8,2.8-4,4.3,0,9.9
		c1,1.4,2.6,3.8,4.3,4.8c1.7,1,3.3,0.8,5.9-0.4c0.7-0.3,1-0.4,1.3,0c0.3,0.4-0.1,0.8-0.7,1.1c-1.3,0.9-5.4,3.1-6.7,3.6
		c-1.7,0.6-2.1,0.1-3.6-2c-5.9-8.4-8.2-12.4-10.5-15.6c-0.9-1.3-3.5-4.7-5.1-6.9c-0.5-0.7-0.6-1.2-0.2-1.5c0.3-0.2,0.6-0.1,1.1,0.6
		c0.6,0.8,1.2,1.4,1.6,1.8c1,1,2.4,0.4,4.2-0.5c2.5-1.4,6.9-4.4,12-8l9.8-6.9c8.5-5.9,10-7,11.7-8.4c1.8-1.4,2.4-2.5,1.5-4.6
		c-0.2-0.5-0.8-1.5-1.4-2.3c-0.4-0.6-0.6-1-0.2-1.3c0.4-0.3,0.8,0,1.4,0.9c2.1,2.9,4.4,6.6,5.4,8.1c1.2,1.8,9,12.9,9.8,13.9
		c0.9,1,1.6,1.8,2,2.2c0.3,0.2,0.7,0.5,0.8,0.7c0.2,0.3,0,0.5-0.3,0.7c-0.4,0.3-1.3,0.5-3.9,2.1c-0.6,0.3-3.1,1.9-3.9,2.3
		c-0.3,0.1-0.7,0.3-1-0.1c-0.3-0.4-0.1-0.7,0.4-1c0.4-0.3,1.3-1,1.8-1.7c0.7-1.1,1-2.1-0.6-5.1c-0.6-1-4.5-6.9-5.3-8.1
		c-0.2-0.3-0.4-0.3-0.8,0l-14.1,9.9c-0.4,0.3-0.6,0.5-0.3,0.8c0.9,1.2,5.3,7.6,6.3,8.8c1,1.3,1.8,2,2.7,2.1c0.7,0.1,1.2,0.1,1.3,0.4
		c0.2,0.2,0.2,0.5-0.2,0.7c-0.3,0.2-1.4,0.6-4.4,2.4c-1.2,0.7-3.5,2.1-3.9,2.4s-1.1,0.7-1.4,0.2c-0.3-0.4-0.1-0.7,0.2-0.9
		c0.5-0.4,1.2-1,1.8-1.6c0.9-1.1,1.2-2.4,0-4.6c-0.6-1.1-4.4-6.7-5.4-8C1240.6,152.9,1240.4,153,1240,153.2z M1253.2,219.9
		c-3.5-2-5.8-5.1-7.5-8.2c-1.9-3.5-2.9-6.4-3.1-9.6c-0.1-1.2,0.1-1.5,1.4-2.2c3.3-1.8,7-3.4,8-3.9c0.9-0.4,1.7-0.6,1.9-0.1
		c0.3,0.5-0.2,0.9-0.7,1.1c-0.8,0.4-1.9,1.3-2.8,2.2c-3.7,3.7-3.5,8.1-1.5,11.8c2.9,5.4,7.9,6.1,11.1,4.4c2.9-1.6,5.3-4,6.5-11
		l0.7-3.9c1.6-9.3,4.6-13.9,9.5-16.4c6.6-3.5,14.3-0.5,18.7,7.8c2.1,3.9,2.8,6.7,3.2,8.5c0.2,0.6,0.1,1-0.3,1.2
		c-0.8,0.4-2.6,1.1-7.3,3.6c-1.3,0.7-1.9,0.8-2.1,0.3c-0.2-0.4,0-0.8,0.8-1.2c0.5-0.3,2.2-1.6,3.1-3.7c0.7-1.5,1.5-4.2-0.5-8.1
		c-2.4-4.4-6.4-5.8-10-3.9c-2.8,1.5-4.1,4-5.3,10.9l-0.4,2.3c-1.8,10.2-4.4,14.9-10.1,18C1263.2,221.9,1258.3,222.7,1253.2,219.9z
		 M1276.1,275.8c-1.8,0.2-2-0.4-2.9-2.8c-3.5-9.6-4.7-14.1-6.1-17.8c-0.5-1.5-2.2-5.4-3.1-8c-0.3-0.8-0.3-1.3,0.2-1.5
		c0.3-0.1,0.6,0.1,0.9,0.8c0.3,1,0.8,1.7,1.1,2.2c0.7,1.2,2.2,1,4.2,0.6c2.8-0.7,7.8-2.5,13.7-4.6l11.2-4.1
		c9.7-3.5,11.5-4.2,13.5-5.1c2.1-0.9,3-1.8,2.6-4.1c-0.1-0.6-0.4-1.7-0.7-2.6c-0.3-0.7-0.3-1.1,0.2-1.3c0.4-0.2,0.7,0.2,1.1,1.2
		c1.2,3.4,2.5,7.5,3.2,9.3c0.7,2,5.4,14.7,5.9,15.9c0.6,1.2,1.1,2.1,1.4,2.6c0.2,0.3,0.5,0.6,0.6,0.9s-0.1,0.5-0.4,0.6
		c-0.4,0.2-1.3,0.1-4.3,1c-0.7,0.2-3.5,1.1-4.3,1.2c-0.3,0.1-0.8,0.1-0.9-0.4c-0.2-0.4,0.1-0.7,0.7-0.9c0.4-0.2,1.5-0.6,2.2-1.2
		c1-0.9,1.5-1.8,0.7-5.1c-0.3-1.1-2.6-7.9-3-9.2c-0.1-0.3-0.4-0.4-0.8-0.2l-16.2,5.9c-0.4,0.2-0.7,0.3-0.5,0.7
		c0.5,1.4,3.2,8.7,3.8,10.2c0.7,1.5,1.2,2.4,2.1,2.7c0.7,0.3,1.1,0.4,1.2,0.7c0.1,0.3,0,0.5-0.3,0.6c-0.4,0.1-1.5,0.2-4.8,1.2
		c-1.3,0.3-3.9,1.1-4.4,1.3c-0.5,0.2-1.2,0.4-1.4-0.1c-0.2-0.4,0-0.7,0.4-0.8c0.6-0.3,1.4-0.6,2.2-1.1c1.2-0.8,1.8-2,1.2-4.5
		c-0.3-1.3-2.5-7.6-3.1-9.1c-0.1-0.3-0.4-0.3-0.8-0.2l-5,1.8c-2.2,0.8-8.1,2.9-9.9,3.6c-4.4,1.7-4.9,3.1-2.6,9.6
		c0.6,1.7,1.6,4.3,2.9,5.7c1.4,1.4,3,1.7,5.8,1.2c0.7-0.1,1-0.1,1.2,0.4c0.2,0.5-0.3,0.7-1,0.9
		C1282,274.6,1277.4,275.7,1276.1,275.8z M1059.3,763c-0.6,0.2-1.4,0.6-1.9,0.8c-2.8,1.5-3.2,4.1-3.3,7.7l-1.4,45.9
		c-0.1,2.1-0.2,3-0.9,3.2c-0.6,0.2-1.2-0.2-2.3-1.5c-2.8-3-22.5-25.3-30.1-33.5c-4.5-4.9-6.7-5.1-8.2-4.9c-1,0.2-2,0.4-2.8,0.7
		c-0.5,0.2-0.9,0.2-1-0.2c-0.2-0.5,0.3-0.8,2.7-1.7c2.3-0.8,7-2.5,12.1-4.3c1.2-0.4,1.9-0.6,2.1-0.2c0.1,0.4-0.1,0.6-0.7,0.9
		c-0.4,0.3-0.6,1,0,1.7l10,11.7c0.2,0.3,0.5,0.3,0.8,0.2l14.2-5.2c0.3-0.1,0.4-0.3,0.4-0.7l0.1-10.4c0.1-1.8-0.2-3.5-0.5-4.2
		c-0.4-1.2-1.3-1.8-3.3-1.1l-1,0.3c-0.8,0.3-1,0.2-1.1-0.2c-0.2-0.5,0.2-0.8,0.9-1c2-0.7,4.9-1.5,6.8-2.3c0.7-0.3,4.1-1.7,7.5-2.9
		c0.8-0.3,1.3-0.3,1.4,0.2C1060.1,762.6,1059.8,762.9,1059.3,763z M1127.8,775.4c-2,6.3-6.2,11.9-15,17c-3.6,2.1-6,3.1-8.9,4.3
		c-2.4,1-4.6,1.6-6.5,2.4c-0.7,0.3-1.1,0.2-1.3-0.2c-0.3-0.5-0.5-1.3-1.6-3.4c-1-2-2.9-5.2-3.5-6.5c-0.4-0.9-0.6-1.5-0.1-1.8
		s0.9,0.1,1.3,1c1.1,1.8,3.1,3.4,5.4,4.1c3.1,0.9,8.6-0.1,14-3.2c5.1-3,7.7-6.2,9-10c2-6.4-0.1-12.7-3.4-18.4
		c-8.1-14-22.7-14.8-30.6-10.2c-5.2,3-8.1,5.4-8.9,9.5c-0.4,1.7-0.1,3.8,0.2,5c0.4,1,0.4,1.3-0.1,1.6c-0.4,0.2-0.8-0.1-1-0.6
		c-0.4-0.7-2.7-6.2-3.2-8.6c-0.3-1.2-0.2-1.6,0.5-2.6c1.8-2.3,6-5.3,9.8-7.5c8.1-4.7,15.8-6.8,23.9-5.2c8.7,1.7,14,7.4,17.3,13.1
		C1127.7,759.3,1130.5,766.9,1127.8,775.4z M1174.3,750.1c-2,1.6-5.5,4.1-7.1,5.3c-1.3,1-4.4,3.7-6.4,5.3c-0.7,0.5-1.2,0.8-1.5,0.4
		c-0.3-0.4-0.1-0.8,0.4-1.2s0.9-0.8,1.5-1.4c1.2-1.4,1-2.6-0.4-4.6c-1.2-1.8-2.4-3.3-8.8-11.4l-7.4-9.4c-4.1-5.2-7.4-9.4-9.4-11.6
		c-1.3-1.3-2.4-2-4.2-0.9c-0.8,0.5-2.1,1.3-2.9,1.9c-0.6,0.5-1,0.5-1.2,0.2c-0.3-0.4,0-0.9,0.6-1.3c3.5-2.8,7-5.2,8.5-6.4
		c1.2-1,4.5-3.8,6.6-5.4c0.7-0.5,1.2-0.7,1.5-0.3c0.2,0.3,0.1,0.6-0.5,1.1c-0.8,0.6-1.4,1.2-1.8,1.7c-0.9,1-0.5,2.2,0.5,3.9
		c1.5,2.5,4.8,6.7,8.8,11.9l7.4,9.4c6.4,8.1,7.5,9.6,9,11.3s2.8,2.2,4.2,1.6c0.7-0.3,1.5-0.8,2.1-1.3c0.5-0.4,0.9-0.6,1.3-0.1
		C1175.5,748.9,1175.2,749.4,1174.3,750.1z M1225.5,703.2c-2.5,2.5-5.7,5.4-6.7,6.4c-1.6,1.6-5.1,5.4-6.6,6.9c-3,3-6.5,6-10.9,6.8
		c-2.3,0.4-6.6-0.1-9.8-3.3c-3.6-3.6-5.3-8.3-4.4-17.1c-9.7-1.1-17.2-2.1-23.1-2.2c-5.5-0.1-7.8,1.5-8.6,2.1
		c-0.6,0.4-1.1,0.8-1.5,1.2s-0.7,0.4-1,0.2c-0.4-0.4-0.1-0.8,0.4-1.4l4.6-4.6c2.7-2.7,4.1-3.6,6.1-4.2c3.2-1,7.3-0.5,13.6,0.5
		c4.6,0.7,10,1.8,11.4,1.9c0.5,0,0.9-0.2,1.2-0.5l4.3-4.1c0.2-0.2,0.3-0.5,0-0.8l-0.7-0.7c-4.5-4.5-8.3-8.3-10.5-10
		c-1.5-1.2-2.9-2-4.5-0.8c-0.8,0.6-2,1.6-2.5,2.2c-0.4,0.4-0.7,0.4-1,0.2c-0.3-0.3-0.1-0.8,0.5-1.4c2.8-2.8,6.5-6.2,7.2-6.9
		c0.9-0.9,3.8-4.1,5.7-6c0.6-0.6,1.1-0.8,1.4-0.5c0.2,0.2,0.2,0.6-0.4,1.2c-0.7,0.7-1.2,1.4-1.5,1.9c-0.8,1.2,0,2.4,1.2,4
		c1.8,2.3,5.6,6.1,10,10.5l8.5,8.5c7.3,7.3,8.6,8.6,10.3,10.1c1.7,1.5,2.9,1.9,4.8,0.7c0.5-0.3,1.3-1.1,2-1.7
		c0.5-0.5,0.9-0.7,1.3-0.4C1226.4,702.1,1226.2,702.5,1225.5,703.2z M1263.8,655.5c-2.2,2.9-4.9,6.2-6,7.7
		c-1.3,1.7-9.4,12.5-10.2,13.6c-0.7,1.1-1.2,2.1-1.4,2.6c-0.1,0.3-0.2,0.8-0.4,1c-0.2,0.3-0.5,0.2-0.7,0c-0.4-0.3-0.8-1-3.2-3.1
		c-0.5-0.5-2.8-2.4-3.4-3c-0.2-0.3-0.5-0.6-0.2-1c0.3-0.4,0.6-0.3,1.1,0.1c0.4,0.3,1.3,0.9,2.2,1.1c1.3,0.4,2.3,0.3,4.7-2.2
		c0.8-0.8,5.2-6.5,6-7.5c0.2-0.3,0.1-0.5-0.3-0.8l-13.7-10.3c-0.4-0.3-0.6-0.4-0.9-0.1c-0.9,1.2-5.6,7.4-6.4,8.8
		c-0.9,1.4-1.3,2.3-1.1,3.2c0.2,0.7,0.3,1.1,0.1,1.4c-0.2,0.2-0.4,0.3-0.7,0.1c-0.3-0.2-1-1.2-3.6-3.4c-1-0.9-3.1-2.7-3.5-3
		s-1-0.8-0.7-1.3c0.3-0.4,0.6-0.3,0.9-0.1c0.6,0.4,1.3,0.9,2.1,1.3c1.3,0.5,2.7,0.4,4.4-1.4c0.9-0.9,5-6.3,6-7.6
		c0.2-0.3,0-0.5-0.3-0.7l-4.3-3.2c-1.8-1.4-6.8-5.2-8.4-6.3c-3.8-2.7-5.3-2.5-9.5,3.1c-1.1,1.4-2.8,3.7-3.2,5.6
		c-0.4,1.9,0.2,3.4,2.2,5.5c0.5,0.6,0.7,0.8,0.4,1.2c-0.3,0.4-0.8,0.1-1.3-0.3c-1.2-0.9-4.6-4.2-5.5-5.2c-1.1-1.4-0.8-1.9,0.8-4
		c6.2-8.2,9.2-11.6,11.6-14.8c0.9-1.2,3.4-4.8,5-7c0.5-0.7,1-1,1.4-0.7c0.3,0.2,0.3,0.5-0.2,1.2c-0.6,0.8-1,1.5-1.3,2.1
		c-0.6,1.2,0.4,2.4,1.8,3.8c2.1,2,6.4,5.2,11.4,9l9.5,7.2c8.2,6.2,9.8,7.4,11.6,8.6c1.9,1.3,3.1,1.5,4.8,0c0.4-0.4,1.2-1.2,1.8-2
		c0.4-0.6,0.8-0.8,1.2-0.6C1264.6,654.2,1264.4,654.7,1263.8,655.5z M1306.3,584.9c-0.2,0.5-0.7,0.7-2.7,0.7l-42.6-0.9l26.2,34.1
		c0.8,0.9,1.1,1.5,0.8,2.1c-0.3,0.5-1.1,0.6-2.4,0.1l-40.2-13.6c-4.1-1.4-6.2-1.7-7.6-0.2s-2.1,2.7-2.5,3.4
		c-0.3,0.5-0.6,0.9-0.9,0.8c-0.5-0.2-0.3-1.1,0.1-1.9c0.8-1.5,5.2-9.8,6.6-12.1c0.8-1.3,1.2-1.6,1.6-1.4c0.3,0.2,0.4,0.5,0.3,1
		c-0.1,0.4,0.6,1,2.4,1.6l28.5,9.9l0.1-0.2l-20.8-27.2c-2.1-2.8-2.5-3.4-2.2-4c0.3-0.5,1.8-0.5,4.1-0.6c3.5,0,15.2-0.1,17.3,0
		c1.5,0.1,11,0.4,16.6,0.6l0.1-0.2l-22.5-15.4c-1-0.7-1.8-1.1-2.8-1.6c-1.1-0.6-2.1-0.1-2.9,0.8c-0.8,1-1.3,1.8-1.6,2.4
		c-0.2,0.5-0.6,0.8-0.9,0.7c-0.5-0.3-0.4-0.9,0.1-1.8c1.3-2.5,2.9-5.2,3.4-6.3c0.6-1.1,1.9-4.1,2.9-6.1c0.3-0.6,0.7-1,1.2-0.8
		c0.3,0.2,0.2,0.6-0.1,1.2c-0.2,0.5-0.5,0.9-0.7,1.9c-0.5,1.9,1.6,3.6,3.5,4.9l36.4,26.1C1306.2,583.8,1306.6,584.4,1306.3,584.9z
		 M1336.7,525c-4.9,0.6-40.7,4-54.2,5.7c-8,1-9.7,2.9-10.6,4.5c-0.6,1.1-1,2.3-1.3,3.2c-0.2,0.6-0.4,1-0.9,0.8
		c-0.6-0.2-0.6-0.9,0.3-3.9c0.8-2.8,2.5-8.6,4.4-14.9c0.5-1.4,0.8-2.3,1.3-2.2s0.5,0.5,0.4,1.3c0,0.6,0.5,1.4,1.6,1.2l18.6-1.5
		c0.4,0,0.7-0.2,0.8-0.6l5.1-17.6c0.1-0.4,0-0.6-0.4-0.9l-10.1-7.5c-1.7-1.4-3.5-2.3-4.5-2.6c-1.4-0.4-2.7,0-3.4,2.5l-0.3,1.2
		c-0.3,0.9-0.5,1.1-1,1c-0.6-0.2-0.7-0.7-0.4-1.6c0.7-2.5,1.9-5.9,2.6-8.3c0.3-0.9,1.3-5.3,2.4-9.4c0.3-1,0.6-1.5,1.2-1.3
		c0.5,0.1,0.5,0.5,0.4,1.1c-0.2,0.7-0.4,1.8-0.5,2.5c-0.6,3.8,1.7,6,5.2,8.8l43.9,34.1c2,1.6,2.8,2.3,2.5,3.1
		C1339.6,524.5,1338.7,524.8,1336.7,525z M1344.2,413.6c-0.1,2.6-0.9,16.3-0.9,17.9c0,1.3,0,2.1,0.1,2.8c0.1,0.4,0.4,0.8,0.3,1.1
		c0,0.3-0.3,0.5-0.6,0.4c-0.5,0-1.3-0.4-3-0.7c-0.7-0.1-4.7-0.4-5.5-0.6c-0.5-0.1-0.9-0.3-0.9-0.7c0-0.5,0.4-0.6,1.1-0.6
		c0.5,0,1.6,0.1,2.6-0.3c1-0.4,2.1-1.8,2.3-4.4l0.8-10.4c0-0.4-0.2-0.6-0.9-0.7l-17-0.9c-0.4,0-0.6,0-0.6,0.4l-0.4,8.7
		c-0.1,1.2-0.1,2.1-0.1,3.1c0,1.3,0.2,2.3,1.1,3c0.4,0.4,0.7,0.5,0.6,0.9c0,0.3-0.2,0.4-0.6,0.4s-2.1-0.5-4.2-0.8
		c-1.3-0.2-4.5-0.5-4.9-0.5c-0.6,0-1.3-0.1-1.3-0.7c0-0.4,0.5-0.5,1-0.5s1.3-0.1,2.1-0.3c1-0.3,2.2-1.2,2.6-3.3
		c0.3-1.7,0.7-8.9,0.7-10c0-0.3-0.1-0.5-0.6-0.5l-5.5-0.3c-6.5-0.3-11.6-0.6-14.5-0.4c-2,0.1-3.5,0.4-3.9,2.5
		c-0.2,0.9-0.4,2.4-0.4,3.4c0,0.9-0.3,1.1-0.6,1.1c-0.5,0-0.7-0.5-0.6-1.5c0.2-4.3,0.7-8.5,0.7-10.3c0.1-1.8,0.1-6,0.2-8.6
		c0.1-0.9,0.2-1.4,0.8-1.4c0.3,0,0.5,0.3,0.5,1c-0.1,1,0,1.8,0.1,2.5c0.2,1.4,1.7,1.8,3.6,2.2c2.8,0.5,7.9,0.8,14.4,1.1l11.9,0.6
		c10.3,0.5,12.2,0.6,14.4,0.6c2.3,0,3.4-0.5,4-2.7c0.2-0.5,0.3-1.7,0.3-2.6c0-0.7,0.2-1.1,0.6-1.1c0.5,0,0.6,0.6,0.6,1.6
		C1344.7,407.4,1344.3,411.7,1344.2,413.6z"/>
</g>
<g>
	<path class="st2" d="M788.3,92.3c4.3,0,7.4-2.1,11.5-4.7c0.2-0.1,1.3-1.4,2.7-2.3c1.4-0.9,3-1.4,4.7-1.4c1.5,0,2.8,0.4,4,1
		c0.1,0,0.2,0.1,0.3,0.2c1.9,1.1,3.3,2.9,3.9,5c0.2,0.2,0.3,0.4,0.4,0.7c7.7,22.1,20.8,165.4,27.1,238.4c4.7-3.6,9.9-6.8,15.3-9.3
		c-0.7-10.1-1.3-20-1.9-29.8v-0.7c-5.1-79.8-9.6-148.7-23.1-189.6l-2.1-6.3l6.5,1.5c15.9,3.7,33.4,7.2,53.8,7.2
		c22.1,0,41.9-2.4,55.8-6.8l6.3-2l-1.5,6.4c-8,33.3-11.1,74.1-14.4,117.2v0.3c-1,13.2-2.1,26.8-3.3,40.7
		c-1.8,20.7-3.2,41.3-4.3,62.3c5.2,2.5,10.1,5.5,14.6,9c6.2-72.8,19.4-216.8,27.1-239c0.1-0.2,0.2-0.5,0.4-0.7c0.6-2.1,2-3.9,3.9-5
		c0.1-0.1,0.2-0.1,0.3-0.2c1.2-0.6,2.6-1,4-1c1.7,0,3.4,0.5,4.7,1.4c1.4,0.9,2.6,2.2,2.7,2.3c4.1,2.6,7.2,4.7,11.5,4.7
		c14.5,0,21.7-8.8,21.7-17.6c0-8.8-7.3-17.6-21-17.6c-7.4,0-13.3,4.2-19.9,7.3c-2.5,1.3-5.4,3.2-8.8,5.1
		c-18.9,10.7-73.5,13.5-77.2,13.5c-4.6,0-8.5,0-11.6,0.1c-17.7-1.3-52.2-4.9-66.5-12.9c-3.3-1.9-6.3-3.8-8.8-5.1
		c-6.6-3.2-12.5-7.3-19.9-7.3c-13.7,0-21,8.8-21,17.6C766.6,83.4,773.8,92.3,788.3,92.3z"/>
	<path class="st2" d="M572.4,488.7c-0.9-1.4-1.4-3-1.4-4.7c0-1.5,0.4-2.8,1-4c0-0.1,0.1-0.2,0.2-0.3c1.1-1.9,2.9-3.3,5-3.9
		c0.2-0.2,0.4-0.3,0.7-0.4c23.4-8.2,181.8-22.3,249.9-28c-3.4-4.4-6.4-9.1-8.9-14c-24,1.1-49.2,2.8-75.3,5
		c-13.9,1.2-27.5,2.3-40.8,3.3c-43.3,3.3-84.1,6.4-117.4,14.4l-6.1,1.5l1.6-6c4.7-18.1,6.9-35.3,6.9-56c0-19.3-1.9-36.7-5.8-53.4
		l-1.5-6.5l6.3,2.1c37.4,12.4,98.1,16.4,168.4,21.1h0.6c17.8,1.2,36.1,2.4,55,3.8c1.8,0.1,3.7,0.3,5.8,0.4
		c2.4-5.6,5.4-10.9,8.8-15.7c-69.7-5.9-223.9-19.7-246.9-27.8c-0.2-0.1-0.5-0.2-0.7-0.4c-2.1-0.6-3.9-2-5-3.9
		c-0.1-0.1-0.1-0.2-0.2-0.3c-0.6-1.2-1-2.6-1-4c0-1.7,0.5-3.4,1.4-4.7c0.9-1.4,2.2-2.6,2.3-2.7c2.6-4.1,4.7-7.2,4.7-11.5
		c0-14.5-8.8-21.7-17.6-21.7c-8.8,0-17.6,7.3-17.6,21c0,7.4,4.2,13.3,7.3,19.9c1.3,2.5,3.2,5.4,5.1,8.8c8,14.3,11.6,48.8,12.9,66.5
		c0,3.1-0.1,6.9-0.1,11.6c0,3.7-2.8,58.2-13.5,77.2c-1.9,3.3-3.8,6.3-5.1,8.8c-3.2,6.6-7.3,12.5-7.3,19.9c0,13.7,8.8,21,17.6,21
		s17.6-7.2,17.6-21.7c0-4.3-2.1-7.4-4.7-11.5C574.5,491.3,573.3,490.1,572.4,488.7z"/>
	<path class="st2" d="M1236.2,483.9c-1.3-2.5-3.2-5.4-5.1-8.8c-10.7-18.9-13.5-73.5-13.5-77.2c0-4.6,0-8.5-0.1-11.6
		c1.3-17.7,4.9-52.2,12.9-66.5c1.9-3.3,3.8-6.3,5.1-8.8c3.2-6.6,7.3-12.5,7.3-19.9c0-13.7-8.8-21-17.6-21c-8.8,0-17.6,7.2-17.6,21.7
		c0,4.3,2.1,7.4,4.7,11.5c0.1,0.2,1.4,1.3,2.3,2.7c0.9,1.4,1.4,3,1.4,4.7c0,1.5-0.4,2.8-1,4c0,0.1-0.1,0.2-0.2,0.3
		c-1.1,1.9-2.9,3.3-5,3.9c-0.2,0.2-0.4,0.3-0.7,0.4c-23,8-177.3,21.9-246.9,27.8c3.5,4.9,6.4,10.1,8.8,15.7c2.1-0.1,4-0.2,5.9-0.4
		c13.4-0.9,26.5-1.7,39.4-2.6c77.6-4.9,144.4-9.2,184.6-22.5l6.3-2.1l-1.5,6.5c-3.9,16.7-5.8,34.2-5.8,53.4c0,20.6,2.1,37.9,6.9,56
		l1.6,6l-6.1-1.5c-33.4-8-74.1-11.1-117.2-14.4c-13.4-1-27.1-2.1-41-3.3c-26-2.3-51.1-3.9-75.3-5c-2.5,5-5.5,9.7-8.9,14
		c68.1,5.8,226.5,19.9,249.9,28c0.2,0.1,0.5,0.2,0.7,0.4c2.1,0.6,3.9,2,5,3.9c0.1,0.1,0.1,0.2,0.2,0.3c0.6,1.2,1,2.6,1,4
		c0,1.7-0.5,3.4-1.4,4.7c-0.9,1.4-2.2,2.6-2.3,2.7c-2.6,4.1-4.7,7.2-4.7,11.5c0,14.5,8.8,21.7,17.6,21.7c8.8,0,17.6-7.3,17.6-21
		C1243.5,496.4,1239.3,490.4,1236.2,483.9z"/>
	<path class="st2" d="M999.4,900.9c-4.3,0-7.4,2.1-11.5,4.7c-0.2,0.1-1.3,1.4-2.7,2.3s-3,1.4-4.7,1.4c-1.5,0-2.8-0.4-4-1
		c-0.1,0-0.2-0.1-0.3-0.2c-1.9-1.1-3.3-2.9-3.9-5c-0.2-0.2-0.3-0.4-0.4-0.7c-8.9-25.5-24.4-247.8-28.7-438.8
		c-4.4,3.2-9.1,6-14.1,8.3c1.5,77.3,5.1,210.8,9.7,263.5c2,22.6,3.3,44.4,4.6,65.6c2.1,34.1,4.1,66.3,8.4,93.7l0.9,5.6l-5.5-1.4
		c-18.1-4.7-35.4-6.9-56-6.9c-19.3,0-36.7,1.9-53.4,5.8l-5.8,1.4l1.4-5.8c8.6-37,10.3-62,14.1-116.8c1-14.9,2.2-32,3.7-52.2
		c2.3-30.1,6.2-163.3,8.5-243v-1.7c0.1-2.5,0.1-4.9,0.2-7.3c-4.5-2-8.8-4.4-12.8-7.1c-4.7,261.9-22.2,411.2-31,436.5
		c-0.1,0.2-0.2,0.5-0.4,0.7c-0.6,2.1-2,3.9-3.9,5c-0.1,0.1-0.2,0.1-0.3,0.2c-1.2,0.6-2.6,1-4,1c-1.7,0-3.4-0.5-4.7-1.4
		c-1.4-0.9-2.6-2.2-2.7-2.3c-4.1-2.6-7.2-4.7-11.5-4.7c-14.5,0-21.7,8.8-21.7,17.6c0,8.8,7.3,17.6,21,17.6c7.4,0,13.3-4.2,19.9-7.3
		c2.5-1.3,5.4-3.2,8.8-5.1c14.3-8,48.8-11.6,66.5-12.9c3.1,0,6.9,0.1,11.6,0.1c3.7,0,58.2,2.8,77.2,13.5c3.3,1.9,6.3,3.8,8.8,5.1
		c6.6,3.2,12.5,7.3,19.9,7.3c13.7,0,21-8.8,21-17.6C1021.1,909.7,1013.9,900.9,999.4,900.9z"/>
</g>
<g>
	<path class="st2" d="M865.6,316.8c8.8-3.2,18.3-4.9,28.3-4.9c10.2,0,19.9,1.8,28.9,5.1c1-20.1,2.4-39.9,4.1-59.8
		c1.2-13.8,2.2-27.4,3.3-40.6c3.1-41.1,6.1-79.8,13.2-112.5c-14,3.5-32.3,5.4-51.9,5.4c-19.2,0-35.6-2.9-49.2-5.9
		c12.3,42.2,16.6,108.6,21.5,185.2C864.4,298,865,307.3,865.6,316.8z"/>
	<path class="st2" d="M810,395.8c0-8.9,1.4-17.4,3.9-25.4c-1.3-0.1-2.5-0.2-3.7-0.3c-19-1.4-37.5-2.7-55.4-3.9
		c-67.4-4.5-125.7-8.4-164.2-19.6c3.1,15.3,4.6,31.3,4.6,48.8c0,19.2-1.7,35.3-5.6,51.9c32.7-7.1,71.5-10.1,112.5-13.2
		c13.2-1,26.9-2.1,40.9-3.3c25.1-2.2,49.4-3.8,72.7-4.9C812,416.6,810,406.4,810,395.8z"/>
	<path class="st2" d="M1192.5,395.5c0-17.5,1.5-33.5,4.6-48.8c-41.4,12.1-105.7,16.2-180,20.9c-13,0.8-26.2,1.7-39.6,2.6
		c-1.2,0.1-2.4,0.2-3.6,0.2c2.6,8,4,16.6,4,25.4c0,10.7-2,20.8-5.7,30.2c23.4,1.1,47.6,2.7,72.7,4.9c13.9,1.2,27.6,2.3,40.9,3.3
		c41,3.1,79.7,6.1,112.5,13.2C1194.2,430.8,1192.5,414.7,1192.5,395.5z"/>
	<path class="st2" d="M931.3,736.1c-4.7-53.2-8.1-184.7-9.6-261.2c-8.7,3.1-18,4.7-27.8,4.7c-9.3,0-18.3-1.6-26.7-4.4
		c-0.1,1.9-0.1,3.9-0.2,5.9v0.4c-2.3,79.7-6.2,213-8.5,243.3c-1.5,20.2-2.7,37.3-3.7,52.2c-3.7,53-5.4,77.7-13,112.2
		c15.5-3.2,31.7-4.7,49.3-4.7c19.4,0,35.6,1.8,52.4,5.7c-3.8-26.4-5.6-56.8-7.6-88.8C934.6,780.4,933.2,758.6,931.3,736.1z"/>
</g>
<g>
	<path class="st2" d="M893.9,320.1c-41.8,0-75.6,33.9-75.6,75.6c0,41.8,33.9,75.6,75.6,75.6c41.8,0,75.6-33.9,75.6-75.6
		S935.6,320.1,893.9,320.1z M939.1,434.5c-1.1,1.1-2.4,2.6-3.8,4.1c-2.7,3-5.4,6-7.9,8c-1.4,1.2-2.6,1.6-3.8,1.8
		c-0.2,0-0.4,0.1-0.8,0.2c-1.5,0.4-2.1,0.6-2.6,0.6H920h-0.1c-1.3,0-5.2-0.1-9.9-5.4c-1.2-1.4-5.7-7.2-10.4-13.9
		c0.2,14.9,0,15.8-1,16.6c-0.3,0.3-1,1-2,2c-7.4,7.5-12.8,12.8-14.5,14.1c-0.8,0.5-1.8,1.1-3,1.1c-0.9,0-1.7-0.3-2.4-0.9
		c-0.8-0.7-1.2-1.6-1.1-2.6c0-0.6,0.3-1.7,1.4-2.5c0.5-0.5,2-2.5,6.7-9c0.4-0.7,1.8-5,1.5-28.1c-1.2,1.5-2.3,3-3.4,4.4
		c-3.5,4.6-6.3,8.3-9.3,10.7c-6.6,5.3-11.6,7.6-16.9,7.6c-2.2,0-4.2-0.6-5.2-0.9c-0.1,0-0.2-0.1-0.3-0.1l-0.2-0.1l-0.2-0.1
		c-5.7-2.4-6.2-8.7-5.6-12c0.2-1.3,0.7-2.2,1.1-3c0.1-0.3,0.3-0.6,0.4-1c1.1-3.9,3.7-4.3,4.8-4.3c0.8,0,3.4,0.2,4,3.4v0.1v0.2
		c0.1,0.7,0.3,3.3,0.3,4.6c0,2.1,1.3,3.4,2,4c2.3-0.2,5.5-1.4,6.2-1.8c5.1-2.6,10.3-10,14.8-16.6c2.2-3.2,4.3-6.2,6.4-8.6
		c-4.3-5.5-19.6-23-22.4-26.2c-0.4-0.5-0.9-1-1.2-1.2c-0.1,0-0.3,0-0.4,0c-0.9,0-1.5,0.1-1.7,0.2c-1,0.8-1.7,1.2-2.1,1.6
		c-0.9,0.7-0.9,0.7-2.5,2.3l-0.7,0.8l-0.6,0.6l-0.9,0.2l-2.8,0.5l-5.3,1l2.4-4.9c2.7-5.6,12.1-14,21.1-17.2l0.5-0.2h0.5
		c2,0,3.3,1.7,5.1,4.3c0.3,0.4,0.6,0.8,0.8,1.1c2.4,3.1,6.4,8.9,10.4,15c-0.2-4.6-0.3-7.9-0.3-9.6v-15.7c0-13.9,0-16.4-0.2-19.1
		c-0.1-1.8-0.2-2.2-2.7-2.6c-0.6-0.1-2.3-0.2-3.3-0.2c-2.1,0-3.7-1.4-3.7-3.3c0-1,0.4-3.5,4.6-3.5c3.7,0,8.1,0.1,10.8,0.2
		c1.1,0,1.8,0.1,2.1,0.1c1,0,2.7,0,4.7-0.1c2.9-0.1,6.5-0.2,9.7-0.2c17.2,0,24.3,4.8,25,5.4c2.8,2.1,5.8,6,5.8,10.6
		c0,17.3-18.1,26.3-35.9,26.3c-0.8,0-1.5,0-2,0v2.2c0,2.3,0.1,8.6,0.2,15.8c4.4-4.3,8.9-8.6,12.8-11.8c6.7-5.5,11-7.7,14.9-7.7l0,0
		c2.6,0.1,5,1.3,6.6,3.3c2,2.4,2.8,5.9,2.2,9c-0.3,1.9-1,3.6-1.3,4.2v0.1v0.1c-0.8,1.4-2.7,2.8-4.6,2.8c-0.2,0-0.3,0-0.5,0
		c-1.1-0.1-2.1-0.6-2.8-1.4c-0.6-0.7-0.9-1.6-1-2.3l-0.2-0.4c-0.1-0.2-0.3-0.5-0.5-0.9c-1.1-2.3-1.6-2.6-1.8-2.7c-0.9,0-2,0.2-4,1.2
		c-3.2,1.9-11.1,9.2-19.5,19v0.4c5.2,7.6,23.3,28.2,27,30.9c2.1-0.2,5.3-2.9,6.4-4.1l0.7-1.5l2,0.2l2.1,0.2l5.7,0.6L939.1,434.5z"/>
	<path class="st2" d="M922.4,352.3c0-1.7-0.7-4.4-6.6-9.1c-4.3-3.5-9.3-3.9-12.7-3.9h-0.7h-0.5c-1.3,0-2.3,0.1-3.1,0.2v26.9
		c0.5,0,1,0,1.5,0C910.3,366.4,922.4,358.6,922.4,352.3z"/>
</g>
<path class="st2" d="M455.5,724.6c-7.2,5.1-8.5,6.1-9.9,7.2c-1.5,1.2-2,2.2-1.2,4c0.2,0.4,0.7,1.3,1.2,1.9c0.4,0.5,0.5,0.9,0.2,1.1
	c-0.3,0.2-0.7,0-1.2-0.7c-1.8-2.5-3.8-5.6-4.7-6.9c-1.1-1.5-7.8-10.9-8.5-11.7c-0.7-0.8-1.4-1.5-1.7-1.8c-0.2-0.2-0.6-0.4-0.7-0.6
	c-0.2-0.2,0-0.4,0.2-0.6c0.3-0.2,1.1-0.4,3.3-1.8c0.5-0.3,2.6-1.7,3.3-2c0.3-0.1,0.6-0.2,0.9,0.1c0.2,0.3,0.1,0.6-0.4,0.9
	c-0.3,0.2-1.1,0.9-1.5,1.5c-0.6,0.9-0.8,1.8,0.6,4.4c0.5,0.9,3.9,5.9,4.6,6.8c0.2,0.2,0.4,0.2,0.7,0l11.9-8.5
	c0.3-0.2,0.5-0.4,0.3-0.7c-0.7-1-4.6-6.5-5.5-7.5c-0.9-1.1-1.6-1.7-2.3-1.8c-0.6-0.1-1-0.1-1.2-0.3c-0.1-0.2-0.1-0.4,0.1-0.6
	c0.3-0.2,1.2-0.5,3.7-2.1c1-0.6,3-1.8,3.3-2.1c0.4-0.3,0.9-0.6,1.2-0.2c0.2,0.3,0.1,0.6-0.1,0.7c-0.4,0.4-1,0.8-1.6,1.4
	c-0.8,0.9-1,2.1,0.1,4c0.5,1,3.8,5.7,4.7,6.8c0.2,0.2,0.4,0.2,0.7-0.1l3.7-2.7c1.6-1.1,6-4.2,7.3-5.2c3.2-2.4,3.4-3.7-0.1-8.5
	c-0.9-1.2-2.3-3.2-3.7-4s-2.8-0.7-5,0.4c-0.6,0.3-0.8,0.3-1.1,0c-0.3-0.4,0.1-0.6,0.6-1c1.1-0.8,4.6-2.7,5.7-3.1
	c1.5-0.6,1.8-0.1,3,1.7c5.1,7.1,7.1,10.5,9.1,13.3c0.8,1.1,3,3.9,4.4,5.8c0.4,0.6,0.5,1,0.2,1.3c-0.2,0.2-0.5,0.1-0.9-0.5
	c-0.5-0.7-1-1.2-1.4-1.6c-0.9-0.8-2.1-0.3-3.6,0.5c-2.2,1.2-5.9,3.8-10.2,7L455.5,724.6z"/>
<path class="st2" d="M415.5,606c-2.6,7.1-8.1,10.9-13.3,12.9c-3.7,1.4-10.5,2.8-17.3-0.5c-5.1-2.5-9.3-6.8-12.4-14.8
	c-1.3-3.3-1.9-5.4-2.5-8c-0.5-2.2-0.7-4.1-1.2-5.8c-0.2-0.6,0-0.9,0.3-1.1c0.4-0.2,1.1-0.3,3.1-0.9c1.8-0.6,4.8-1.8,5.9-2.1
	c0.8-0.3,1.3-0.3,1.5,0.2c0.2,0.4-0.2,0.7-1,1c-1.7,0.7-3.3,2.1-4.1,4.1c-1.2,2.5-1,7.3,1,12.3c1.8,4.7,4.2,7.3,7.3,8.8
	c5.2,2.5,10.7,1.5,15.9-0.5c12.8-5,15.4-17.3,12.5-24.5c-1.9-4.8-3.6-7.5-6.9-8.7c-1.4-0.5-3.2-0.6-4.3-0.4
	c-0.9,0.2-1.2,0.2-1.4-0.3c-0.1-0.4,0.2-0.6,0.6-0.8c0.6-0.3,5.6-1.5,7.6-1.6c1-0.1,1.4,0,2.1,0.8c1.7,1.8,3.7,5.8,5.1,9.2
	C417,592.6,417.9,599.4,415.5,606z"/>
<path class="st2" d="M362,495.3c-8.7,1.1-10.4,1.3-12.2,1.6c-1.9,0.4-2.8,0.9-3,2.9c-0.1,0.5,0,1.5,0.1,2.3c0.1,0.6,0,1-0.4,1
	c-0.4,0.1-0.6-0.3-0.7-1.2c-0.4-3-0.7-6.7-0.9-8.4c-0.2-1.4-0.8-5-1.1-7.1c-0.1-0.9,0-1.3,0.4-1.3c0.4-0.1,0.6,0.3,0.6,0.9
	c0.1,0.6,0.2,1,0.4,1.6c0.5,1.5,1.5,1.9,3.5,1.7c1.9-0.1,3.5-0.3,12.2-1.4l8-1c8.3-1,11.6-3.1,13.6-6.3c1.8-2.9,1.7-5.5,1.5-7.5
	c-0.3-2.5-1.5-5.5-4.1-7.6c-3.6-2.8-8.8-2.3-14.7-1.5l-7.2,0.9c-8.7,1.1-10.4,1.3-12.2,1.6c-1.9,0.4-2.8,0.9-3,2.9
	c-0.1,0.5,0,1.5,0.1,2.1s0,1-0.4,1c-0.4,0-0.6-0.3-0.7-1.1c-0.4-2.9-0.6-6.6-0.7-6.6c-0.1-0.7-0.7-4.3-1-6.5c-0.1-0.8,0-1.2,0.4-1.3
	c0.4,0,0.6,0.3,0.6,1c0.1,0.6,0.2,1,0.4,1.6c0.5,1.5,1.5,1.9,3.5,1.7c1.9-0.1,3.5-0.3,12.2-1.4l6.2-0.8c6.4-0.8,13.2-1,18,3.3
	c4,3.6,5.2,7.7,5.6,11.4c0.4,3,0.9,8.6-2.4,13.3c-2.3,3.3-6.3,6-14.6,7L362,495.3z"/>
<path class="st2" d="M341.3,361.8c-1-0.3-1.4-0.7-1.4-1.1c0.1-0.5,0.4-0.8,2-1.4l34.3-12L345,327.9c-0.9-0.5-1.3-0.9-1.2-1.4
	c0.1-0.5,0.7-0.8,1.9-0.8l36.2-1.2c3.7-0.1,5.4-0.5,6.1-2.2c0.7-1.6,0.9-2.8,1-3.5c0.1-0.5,0.2-0.9,0.5-0.9c0.5,0.1,0.6,0.8,0.5,1.6
	c-0.2,1.4-1.2,9.4-1.7,11.6c-0.3,1.3-0.5,1.6-0.8,1.6c-0.3,0-0.4-0.3-0.6-0.7c-0.1-0.4-0.8-0.6-2.4-0.6l-25.8,0.6v0.2l24.7,15.5
	c2.6,1.6,3,2,3,2.5c-0.1,0.5-1.3,1-3.1,1.7c-2.8,1.1-12.1,4.6-13.8,5.1c-1.3,0.4-8.9,3-13.5,4.5v0.2l22.6,5.6c1,0.2,1.8,0.4,2.7,0.5
	c1.1,0.1,1.7-0.6,2-1.5c0.3-1,0.5-1.8,0.6-2.4c0-0.5,0.2-0.9,0.5-0.8c0.5,0.1,0.6,0.6,0.5,1.5c-0.3,2.4-0.7,5-0.9,6
	c-0.1,1.1-0.3,3.9-0.5,5.7c-0.1,0.6-0.2,1-0.8,1c-0.3,0-0.4-0.4-0.3-1c0.1-0.5,0.1-0.9,0-1.7c-0.2-1.7-2.4-2.4-4.3-2.9L341.3,361.8z
	"/>
<path class="st2" d="M386.1,228.2c-8.3-3.1-9.8-3.7-11.5-4.2c-1.9-0.6-2.9-0.5-4,1.2c-0.3,0.4-0.7,1.3-1,2.1
	c-0.2,0.6-0.5,0.9-0.8,0.7c-0.4-0.1-0.3-0.6,0-1.4c1.1-2.9,2.5-6.2,3.1-7.8c0.7-1.7,4.7-12.5,5-13.6c0.3-1.1,0.5-2,0.5-2.5
	c0-0.3,0-0.7,0.1-0.9c0.1-0.3,0.3-0.2,0.6-0.1c0.4,0.1,0.9,0.7,3.4,1.8c0.5,0.3,2.9,1.3,3.5,1.6c0.2,0.2,0.5,0.4,0.4,0.8
	s-0.5,0.4-0.9,0.2c-0.4-0.1-1.3-0.4-2.1-0.4c-1.1,0-2,0.3-3.3,2.9c-0.5,0.9-2.7,6.5-3.1,7.6c-0.1,0.3,0,0.4,0.4,0.6l13.7,5.1
	c0.4,0.1,0.6,0.2,0.7-0.2c0.4-1.2,2.8-7.4,3.1-8.7c0.4-1.3,0.5-2.2,0.2-2.9c-0.3-0.5-0.5-0.9-0.4-1.1s0.3-0.3,0.6-0.2
	c0.3,0.1,1.1,0.7,3.8,1.9c1,0.5,3.2,1.4,3.6,1.6s1,0.4,0.8,0.9c-0.1,0.4-0.4,0.4-0.7,0.3c-0.6-0.1-1.3-0.4-2-0.5
	c-1.2-0.1-2.3,0.3-3.3,2.2c-0.5,1-2.6,6.3-3,7.6c-0.1,0.3,0.1,0.4,0.4,0.5l4.3,1.6c1.8,0.7,6.8,2.6,8.4,3.1c3.8,1.3,4.9,0.7,7-4.8
	c0.5-1.4,1.4-3.7,1.3-5.3c-0.1-1.7-1-2.7-3.1-3.9c-0.6-0.3-0.7-0.5-0.6-0.9c0.2-0.4,0.6-0.3,1.1-0.1c1.2,0.5,4.8,2.3,5.8,3
	c1.3,0.9,1.1,1.4,0.3,3.5c-3.1,8.2-4.7,11.7-5.9,14.9c-0.5,1.2-1.6,4.7-2.4,6.9c-0.3,0.7-0.6,1-0.9,0.9c-0.3-0.1-0.4-0.4-0.1-1
	c0.3-0.8,0.4-1.5,0.5-2c0.2-1.2-0.9-1.9-2.4-2.7c-2.2-1.1-6.5-2.7-11.5-4.6L386.1,228.2z"/>
<path class="st2" d="M453.3,131.3c3.8,2.4,5.5,2.6,6.5,1.9c0.8-0.6,1.5-1.5,2-2.3c0.4-0.5,0.7-0.8,0.9-0.6c0.4,0.3,0.2,0.8-0.3,1.4
	c-2.1,3.1-3.5,4.9-4.2,5.9c-0.3,0.4-1.7,2.8-3.4,5.3c-0.4,0.6-0.8,1-1.2,0.7c-0.3-0.2-0.2-0.5,0.1-1c0.4-0.6,1-1.5,1.2-2.3
	c0.5-1.5-0.8-2.6-5-5.5L422,115.2c-1-0.6-1.5-1.2-1.2-1.7c0.4-0.5,1.3-0.5,2.7-0.8c1-0.2,13.8-2.2,25.5-4.5
	c5.5-1.1,16.8-2.9,18.1-3.2l0.2-0.2l-21.9-14.1c-3-1.9-4.2-2.1-5.4-1.3c-0.8,0.5-1.6,1.7-2,2.4c-0.4,0.6-0.7,0.7-1,0.5
	c-0.4-0.3-0.1-0.8,0.4-1.5c1.7-2.5,3.4-4.7,4.1-5.7c0.4-0.5,1.4-2.5,3-4.8c0.4-0.6,0.8-1.1,1.2-0.8c0.3,0.2,0.2,0.6-0.2,1.2
	c-0.3,0.5-0.6,0.9-0.8,1.5c-0.5,1.6,0.2,2.7,2.9,4.5l30,21c1.1,0.7,1.4,1.2,1.1,1.6c-0.4,0.5-1.3,0.8-2.2,0.9
	c-4.9,1.1-15.4,3-23.7,4.7c-8.7,1.7-18.3,3-19.8,3.3l-0.1,0.1L453.3,131.3z"/>
<path class="st2" d="M518.7,19.5c-6-6.4-7.1-7.6-8.5-8.9c-1.4-1.4-2.5-1.7-3.7-1c-0.6,0.3-1.2,0.8-1.7,1.3c-0.4,0.4-0.8,0.6-1.1,0.2
	c-0.2-0.3,0-0.7,0.7-1.3c1.6-1.5,4.4-3.9,5.6-5c1.1-1,3.4-3.5,5-5c0.5-0.5,1-0.8,1.2-0.5c0.3,0.3,0.1,0.7-0.3,1.1
	c-0.4,0.4-0.7,0.8-1.1,1.3c-0.9,1.3-0.6,2.3,0.7,3.9c1.2,1.4,2.3,2.6,8.3,9l7,7.4c3.9,4.1,7,7.4,8.9,9.1c1.2,1,2.2,1.5,3.6,0.5
	c0.7-0.5,1.7-1.3,2.3-1.9c0.5-0.4,0.8-0.5,1-0.3c0.3,0.3,0.1,0.7-0.4,1.2c-2.8,2.6-5.6,5-6.7,6.1c-1,0.9-3.5,3.5-5.2,5.1
	c-0.6,0.5-1,0.7-1.2,0.4c-0.2-0.2-0.1-0.5,0.4-1c0.6-0.6,1.1-1.2,1.4-1.6c0.7-1,0.3-1.9-0.8-3.3c-1.5-2-4.6-5.3-8.4-9.4L518.7,19.5z
	"/>
<path class="st2" d="M612.3-28.2c-7.4-1.3-12.1-6.1-15-10.9c-2-3.4-4.6-9.8-2.4-17.1c1.6-5.4,5.1-10.3,12.5-14.8
	c3.1-1.9,5-2.8,7.5-3.9c2-0.9,3.9-1.4,5.5-2.2c0.6-0.3,0.9-0.2,1.1,0.1c0.2,0.4,0.5,1.1,1.4,2.9c0.9,1.7,2.6,4.4,3.1,5.4
	c0.4,0.8,0.5,1.2,0.1,1.5c-0.4,0.2-0.7-0.1-1.2-0.8c-1-1.5-2.7-2.8-4.7-3.4c-2.7-0.7-7.4,0.3-11.9,3c-4.3,2.6-6.5,5.4-7.4,8.7
	c-1.6,5.5,0.3,10.8,3.2,15.6c7.2,11.8,19.7,12.2,26.3,8.2c4.4-2.7,6.8-4.8,7.4-8.3c0.3-1.5,0-3.3-0.3-4.3c-0.3-0.9-0.4-1.1,0-1.4
	c0.3-0.2,0.7,0.1,0.9,0.5c0.4,0.6,2.4,5.3,2.9,7.3c0.3,1,0.2,1.4-0.4,2.2c-1.5,2-5.1,4.6-8.2,6.6C625.8-29,619.2-27,612.3-28.2z"/>
<path class="st2" d="M719.4-95.9c-0.2,0.1-0.3-0.1-0.3-0.3l0.6-15.2c0-0.2,0-0.6,0.2-0.6c0.2-0.1,0.3,0.2,0.4,0.4l9.4,12
	c0.1,0.1,0.1,0.3-0.2,0.4L719.4-95.9z M731.4-96.8c0.3-0.1,0.5,0,0.7,0.2l8.2,10.2c0.5,0.6,0.3,1.2-0.1,1.4
	c-0.5,0.2-0.7,0.4-0.6,0.8c0.1,0.4,0.8,0.2,1.8-0.1c4.4-1.3,8.5-2.7,10.4-3.3c2-0.7,2.5-0.9,2.3-1.4c-0.1-0.4-0.4-0.4-0.9-0.2
	c-0.7,0.2-1.5,0.4-2.4,0.5c-1.2,0.1-3.1-0.1-6.8-4.4c-6.3-7.2-22.5-26.8-24.8-29.4c-1-1.1-1.5-1.5-2-1.3c-0.6,0.2-0.7,0.9-0.8,2.7
	L713.9-82c-0.2,3.1-0.6,5.3-3.1,6.5c-0.4,0.2-1.2,0.5-1.7,0.7c-0.4,0.1-0.6,0.3-0.5,0.7c0.1,0.4,0.5,0.4,1.2,0.2
	c2.9-0.9,5.8-2.1,6.4-2.3c1.7-0.6,4.1-1.2,5.9-1.7c0.6-0.2,0.9-0.4,0.8-0.9c-0.1-0.3-0.3-0.4-1-0.2l-0.8,0.3c-1.7,0.6-2.4,0-2.8-1
	c-0.2-0.7-0.4-2.1-0.3-3.6l0.4-8.8c0-0.4,0.1-0.5,0.3-0.6L731.4-96.8z"/>
<path class="st2" d="M837.8-122.8c0.8,7.4,1.2,11.4,2.5,12.3c1.1,0.8,2.6,1,7.1,0.6c3.1-0.3,5.3-0.6,6.6-2.3
	c0.6-0.8,1.1-2.5,1.1-3.6c0-0.5,0.1-0.9,0.5-0.9s0.5,0.2,0.6,0.9c0.1,0.6,0.1,5-0.2,6.7c-0.2,1.3-0.5,1.6-3.5,1.9
	c-8.3,0.9-12.1,0.9-16.8,1.4c-1.3,0.1-4.9,0.7-7.2,0.9c-0.7,0.1-1.2-0.1-1.2-0.5c0-0.3,0.2-0.5,0.9-0.6c0.9-0.1,1.5-0.3,2.1-0.4
	c1.1-0.3,1.3-1.6,1.3-3.3c0-2.5-0.4-7-1-12.3l-1-10.1c-0.9-8.8-1.1-10.4-1.4-12.2c-0.3-1.9-0.9-2.8-2.8-3c-0.5-0.1-1.2-0.1-1.9,0
	c-0.6,0.1-1,0-1-0.4c0-0.4,0.4-0.6,1.2-0.6c2.7-0.3,6.4-0.5,7.9-0.6c1.4-0.1,5.6-0.7,7.8-1c0.8-0.1,1.2,0,1.3,0.4
	c0,0.4-0.3,0.6-1,0.6c-0.6,0.1-1.5,0.2-2.2,0.4c-1.5,0.4-1.9,1.5-1.8,3.5c0.1,1.9,0.2,3.5,1.1,12.2L837.8-122.8z"/>
<path class="st2" d="M970.4-129.2c1.7-8.6,2-10.2,2.3-12.1c0.3-2,0-3-1.8-3.7c-0.4-0.2-1.4-0.5-2.2-0.6c-0.6-0.1-0.9-0.3-0.9-0.7
	c0.1-0.4,0.5-0.4,1.4-0.3c3,0.6,6.6,1.5,8.1,1.8c2.3,0.5,5.7,0.9,8.3,1.5c7.1,1.4,9.2,4.3,9.9,5.3c1,1.4,2.1,4.3,1.5,7.3
	c-1.6,8.1-8.6,12.6-16.7,11c-0.3-0.1-0.9-0.2-1.2-0.3c-0.3-0.1-0.7-0.2-0.6-0.6c0.1-0.5,0.5-0.5,1.7-0.3c3.2,0.6,8.3-2.1,9.5-7.9
	c0.4-1.9,0.9-5.7-1.7-9.2c-1.7-2.3-3.9-3.1-5.2-3.3c-0.9-0.2-1.7-0.3-2.3-0.2c-0.3,0.1-0.5,0.4-0.7,1l-4.5,22.7
	c-1,5.2-1.9,9.7-2.1,12.2c-0.1,1.6,0,2.9,1.6,3.5c0.8,0.3,2,0.6,2.8,0.8c0.6,0.1,0.9,0.4,0.8,0.6c-0.1,0.4-0.6,0.5-1.2,0.4
	c-3.8-0.7-7.3-1.6-8.8-1.9c-1.3-0.3-4.9-0.8-7.2-1.2c-0.7-0.1-1.1-0.4-1-0.8c0.1-0.3,0.3-0.4,1-0.3c0.9,0.2,1.6,0.2,2.1,0.2
	c1.2,0,1.7-1.2,2.3-2.8c0.7-2.3,1.6-6.8,2.7-12.1L970.4-129.2z"/>
<path class="st2" d="M1061.6-96.8c-0.2-0.1-0.2-0.3-0.1-0.5l10.1-11.4c0.1-0.2,0.4-0.4,0.5-0.4c0.2,0.1,0.1,0.4,0.1,0.6l-0.3,15.2
	c0,0.2-0.1,0.3-0.4,0.2L1061.6-96.8z M1071.6-89.8c0.3,0.1,0.4,0.3,0.4,0.6l-0.1,13.1c0,0.8-0.5,1.1-1,1.1c-0.6-0.2-0.8-0.1-1,0.2
	c-0.1,0.4,0.5,0.6,1.5,1.1c4.3,1.8,8.2,3.3,10.2,4.1s2.5,0.9,2.7,0.4c0.1-0.4-0.1-0.5-0.5-0.7c-0.6-0.3-1.4-0.6-2.2-1.1
	c-1-0.7-2.3-2.1-2.5-7.7c-0.3-9.6-0.3-35-0.5-38.4c-0.1-1.5-0.2-2.1-0.7-2.3c-0.5-0.2-1.1,0.3-2.4,1.6l-26.7,28.7
	c-2.1,2.3-3.9,3.7-6.5,3.1c-0.4-0.1-1.2-0.4-1.7-0.5c-0.4-0.2-0.7-0.1-0.8,0.2c-0.2,0.4,0.1,0.7,0.8,0.9c2.8,1.1,5.8,2.1,6.4,2.3
	c1.7,0.7,3.9,1.7,5.7,2.4c0.6,0.2,1,0.3,1.1-0.2c0.1-0.3,0-0.5-0.6-0.7l-0.8-0.3c-1.7-0.6-1.9-1.5-1.5-2.5c0.3-0.6,1-1.8,2.1-3
	l5.9-6.6c0.2-0.3,0.4-0.3,0.7-0.2L1071.6-89.8z"/>
<path class="st2" d="M1163.7-74l-7.5-4.3c-2.9-1.7-4.3-2.1-5.7-1.5c-1,0.4-1.6,0.9-1.9,1.2c-0.3,0.3-0.6,0.4-0.9,0.3
	c-0.4-0.2-0.3-0.5,0-1.1c0.5-0.8,4.2-4.7,4.5-5.1c0.5-0.6,0.9-0.8,1.2-0.6c0.4,0.2,0.6,1,1.8,1.9c1.3,1,3.2,2.3,4.8,3.3l19.6,11.9
	c3.2,1.9,4.7,2.2,5.1,2.4c0.3,0.2,0.2,0.5-0.2,1.3c-0.6,1-2.9,4.4-3.6,5.7c-0.3,0.5-0.6,0.7-0.9,0.5c-0.4-0.2-0.3-0.5,0.1-1.3
	l0.3-0.6c0.7-1.3,0.2-3.5-4.1-6.3l-6.2-3.9L1157.5-50c-2.8,4.6-5.2,8.5-6.2,10.7c-0.7,1.5-1.1,2.7,0.3,3.8c0.6,0.5,1.7,1.3,2.4,1.7
	c0.5,0.3,0.7,0.6,0.5,0.9c-0.2,0.3-0.7,0.3-1.2-0.1c-3.3-2-6.3-4-7.7-4.9c-1.1-0.7-4.3-2.4-6.3-3.7c-0.6-0.4-0.9-0.7-0.7-1.1
	c0.2-0.2,0.4-0.3,1,0.1c0.7,0.5,1.4,0.7,1.9,0.9c1.1,0.4,2.1-0.5,3.1-1.8c1.5-1.9,3.9-5.8,6.7-10.4L1163.7-74z"/>
<path class="st2" d="M1244.2-16.5c0.3-0.3,0.6-0.4,0.9-0.3c0.5,0.3,1.4,0.9,2.4,1.9c2.5,2.3,5,7.7-0.5,13.8
	c-3.2,3.5-6.2,4.4-8.4,4.2c-1.3-0.1-2-0.5-3.7-2c-1.1-1-2.3-2.3-2.9-3.4c-0.2-0.4-0.1-0.7,0.3-1.1L1244.2-16.5z M1223.6-3.8
	c-3.6,4-6.6,7.4-8.5,9c-1.3,1.1-2.4,1.8-3.4,1.2c-0.5-0.3-1.1-0.6-1.7-1.2c-0.5-0.5-0.8-0.5-1-0.3c-0.3,0.3-0.1,0.7,0.5,1.2
	c1.7,1.6,4.6,3.9,5.4,4.6c0.6,0.6,3.7,3.6,6.2,5.8c0.6,0.5,1,0.6,1.2,0.3c0.2-0.2,0.1-0.5-0.2-0.8c-0.5-0.5-1.4-1.4-2-2.1
	c-1.1-1.3-0.5-2.5,0.4-3.9c1.4-2,4.5-5.4,8.1-9.4l0.5-0.6c0.2-0.3,0.4-0.2,0.7,0l3.7,3.5c0.3,0.3,0.5,0.5,0.5,1
	c0,1.1-0.7,5.9-1.1,9.8c-0.6,5.5-0.8,9,0.2,11.6c0.6,1.6,1.5,2.8,3.9,5l4.1,3.7c0.5,0.5,0.9,0.6,1.2,0.3c0.2-0.2,0.1-0.5-0.2-0.8
	c-0.3-0.3-0.7-0.7-1.1-1.2c-0.5-0.7-2-2.6-2.2-7.3c-0.1-5,0.3-11.5,0.9-19.7c7.5,0.4,11.5-1.3,14.4-4.5c2.6-2.9,2.8-6.6,2.4-8.5
	c-0.9-3.7-3.5-6.5-6.3-9c-1.3-1.2-4.7-4-6.2-5.3c-0.9-0.8-3.5-3.4-5.8-5.4c-0.6-0.6-1-0.8-1.3-0.5c-0.3,0.3-0.1,0.6,0.4,1
	c0.6,0.5,1.3,1.2,1.6,1.6c1.2,1.6,0.9,2.6-0.4,4.1c-1.2,1.5-2.2,2.7-8.1,9.2L1223.6-3.8z"/>
<path class="st2" d="M1300.9,57.9c6.9-5.4,8.2-6.5,9.6-7.7c1.5-1.3,1.9-2.4,1.3-3.6c-0.3-0.6-0.7-1.2-1.1-1.8
	c-0.4-0.5-0.5-0.8-0.1-1.1c0.3-0.2,0.6,0.1,1.2,0.8c1.4,1.7,3.5,4.7,4.5,6c0.9,1.1,3.2,3.7,4.5,5.4c0.5,0.6,0.7,1,0.4,1.2
	c-0.4,0.3-0.7,0.1-1-0.4c-0.4-0.5-0.7-0.8-1.2-1.3c-1.2-1.1-2.3-0.8-3.9,0.4c-1.5,1.1-2.8,2.1-9.7,7.5l-8,6.3c-4.4,3.5-8,6.3-9.8,8
	c-1.1,1.1-1.7,2.1-0.8,3.6c0.4,0.7,1.1,1.8,1.6,2.5c0.4,0.5,0.4,0.8,0.2,1c-0.3,0.2-0.7,0-1.1-0.5c-2.4-3-4.5-6-5.5-7.2
	c-0.8-1-3.2-3.8-4.6-5.6c-0.5-0.6-0.6-1-0.3-1.3c0.2-0.2,0.5-0.1,0.9,0.4c0.5,0.7,1.1,1.2,1.5,1.5c0.9,0.8,1.9,0.4,3.3-0.5
	c2.1-1.3,5.7-4.1,10.1-7.6L1300.9,57.9z"/>
<path class="st2" d="M1342.4,131.8c-0.1-0.2,0-0.3,0.2-0.4l15.1-2.2c0.2-0.1,0.5-0.1,0.6,0.1s-0.1,0.3-0.3,0.5l-10,11.5
	c-0.1,0.1-0.3,0.2-0.4-0.1L1342.4,131.8z M1345.5,143.5c0.1,0.3,0.1,0.5-0.1,0.7l-8.5,10c-0.5,0.6-1.1,0.5-1.4,0.2
	c-0.3-0.5-0.5-0.6-0.9-0.5c-0.4,0.2,0,0.8,0.4,1.7c2.1,4.1,4.2,7.8,5.2,9.6c1,1.9,1.4,2.3,1.8,2.1c0.3-0.2,0.3-0.5,0-0.9
	c-0.3-0.6-0.7-1.4-1-2.2c-0.3-1.2-0.4-3.1,3.1-7.5c5.9-7.5,22.1-27.1,24.2-29.8c0.9-1.2,1.2-1.7,0.9-2.2c-0.3-0.5-1-0.5-2.8-0.3
	l-38.9,4.9c-3.1,0.4-5.3,0.4-6.9-1.8c-0.3-0.4-0.7-1.1-1-1.5c-0.2-0.4-0.4-0.5-0.7-0.4c-0.4,0.2-0.3,0.6,0,1.2
	c1.5,2.6,3.2,5.3,3.5,5.9c0.9,1.6,1.9,3.8,2.8,5.5c0.3,0.6,0.6,0.8,1,0.6c0.3-0.2,0.3-0.4,0-1l-0.4-0.8c-0.9-1.6-0.5-2.4,0.5-2.9
	c0.6-0.3,2-0.8,3.5-0.9l8.8-1.3c0.4-0.1,0.5,0,0.7,0.2L1345.5,143.5z"/>
<path class="st2" d="M1407.5,216.8c0.4-0.1,0.7-0.1,0.9,0.2c0.3,0.5,0.7,1.5,1.2,2.8c1.1,3.3,0.5,9.2-7.3,11.7
	c-4.5,1.5-7.6,0.7-9.3-0.6c-1-0.8-1.5-1.4-2.2-3.6c-0.4-1.4-0.8-3.1-0.8-4.4c0-0.4,0.2-0.6,0.8-0.8L1407.5,216.8z M1383.3,217.4
	c-5.1,1.6-9.4,3.1-11.8,3.5c-1.7,0.3-3,0.4-3.5-0.6c-0.3-0.5-0.6-1.1-0.9-1.9c-0.2-0.7-0.4-0.8-0.7-0.7c-0.4,0.1-0.4,0.6-0.2,1.3
	c0.7,2.2,2,5.6,2.3,6.7c0.3,0.8,1.4,5,2.5,8.2c0.2,0.7,0.5,1,0.9,0.9c0.3-0.1,0.4-0.4,0.2-0.8c-0.2-0.7-0.5-1.9-0.7-2.8
	c-0.3-1.7,0.8-2.5,2.3-3.1c2.2-1,6.6-2.4,11.7-4.1l0.8-0.3c0.3-0.1,0.5,0,0.6,0.3l1.4,4.8c0.1,0.4,0.2,0.7-0.1,1.1
	c-0.6,1-3.5,4.7-5.8,7.9c-3.2,4.5-5.2,7.4-5.6,10.2c-0.3,1.7-0.1,3.2,0.9,6.2l1.7,5.2c0.2,0.7,0.5,1,0.9,0.9
	c0.3-0.1,0.4-0.4,0.2-0.8c-0.1-0.4-0.3-1-0.3-1.6c-0.1-0.9-0.4-3.3,1.7-7.4c2.4-4.4,6-9.8,10.6-16.7c6.3,4.1,10.6,4.6,14.7,3.3
	c3.7-1.2,5.8-4.3,6.3-6.2c1.1-3.6,0.2-7.4-0.9-10.9c-0.6-1.7-2.1-5.8-2.7-7.7c-0.4-1.2-1.3-4.7-2.3-7.6c-0.3-0.8-0.5-1.2-0.9-1.1
	s-0.4,0.5-0.2,1.1c0.2,0.8,0.5,1.7,0.5,2.2c0.2,1.9-0.5,2.7-2.4,3.4c-1.7,0.7-3.3,1.2-11.6,3.9L1383.3,217.4z"/>
<path class="st2" d="M1400.7,314c4.2-6.2,10.5-8.5,16.1-9.2c3.9-0.5,10.9-0.1,16.6,4.8c4.3,3.7,7.3,8.9,8.3,17.4
	c0.4,3.6,0.5,5.7,0.5,8.4c0,2.2-0.3,4.1-0.3,5.9c0,0.6-0.2,0.9-0.6,1c-0.5,0.1-1.2,0-3.2,0.1c-1.9,0.1-5.1,0.6-6.2,0.6
	c-0.9,0-1.3,0-1.4-0.5s0.4-0.6,1.2-0.7c1.8-0.3,3.7-1.3,5-2.9c1.8-2.2,2.8-6.8,2.1-12.1c-0.6-5-2.3-8.1-4.9-10.4
	c-4.4-3.7-10-4.1-15.6-3.4c-13.7,1.7-19.2,12.9-18.2,20.7c0.6,5.1,1.6,8.2,4.5,10.1c1.2,0.8,3,1.4,4,1.5c0.9,0.1,1.2,0.1,1.2,0.6
	c0.1,0.4-0.3,0.6-0.8,0.6c-0.7,0.1-5.8,0-7.8-0.3c-1-0.2-1.3-0.4-1.9-1.3c-1.2-2.2-2.1-6.5-2.6-10.2
	C1395.9,326.7,1396.8,319.8,1400.7,314z"/>
<path class="st2" d="M1427.1,442.8c0,0.2,0.1,0.4,0.4,0.4h1.2c8.8,0.3,10.4,0.3,12.3,0.2c2-0.1,2.9-0.5,3.4-2.4
	c0.1-0.5,0.2-1.4,0.2-2.3c0-0.6,0.1-1,0.5-1s0.5,0.4,0.5,1.2c-0.1,3.1-0.4,6.8-0.4,8.3c0,1.4,0,5,0,7.3c0,0.8-0.1,1.2-0.6,1.2
	c-0.4,0-0.5-0.4-0.5-1.1c0-0.5,0-1-0.1-1.7c-0.3-1.6-1.2-2.1-3.2-2.2c-1.9-0.2-3.5-0.2-12.3-0.5l-10.2-0.3
	c-5.3-0.1-9.9-0.3-12.4-0.1c-1.6,0.1-2.9,0.4-3.2,2.2c-0.1,0.8-0.3,2.1-0.3,2.9c0,0.6-0.2,0.9-0.5,0.9c-0.4,0-0.6-0.5-0.6-1.2
	c0.1-3.8,0.4-7.4,0.4-9c0-1.3,0-5,0-7.2c0-0.8,0.2-1.2,0.6-1.2c0.3,0,0.5,0.2,0.4,0.9c0,0.9,0.1,1.6,0.2,2.1
	c0.2,1.2,1.5,1.5,3.1,1.8c2.4,0.4,7,0.5,12.3,0.6l5.1,0.1c0.2,0,0.3-0.2,0.4-0.3l0.6-22.1c0-0.2-0.1-0.4-0.3-0.4l-5.1-0.1
	c-5.3-0.1-9.9-0.3-12.4-0.1c-1.6,0.1-2.9,0.4-3.2,2.2c-0.1,0.8-0.3,2.1-0.3,2.9c0,0.6-0.2,0.9-0.5,0.9c-0.4,0-0.6-0.5-0.5-1.2
	c0.1-3.8,0.4-7.4,0.4-9c0-1.3,0-5,0-7.3c0-0.8,0.2-1.2,0.6-1.1c0.3,0,0.5,0.2,0.4,0.9c0,0.9,0.1,1.6,0.2,2.1
	c0.2,1.2,1.5,1.5,3.1,1.8c2.4,0.3,7,0.5,12.3,0.6l10.2,0.3c8.8,0.2,10.4,0.3,12.3,0.2c2-0.1,2.9-0.5,3.4-2.4
	c0.1-0.5,0.2-1.4,0.2-2.3c0-0.6,0.1-1,0.5-1s0.5,0.4,0.5,1.2c-0.1,3.1-0.4,6.8-0.4,8.3c0,1.4,0,5,0,7.3c0,0.8-0.2,1.2-0.6,1.2
	s-0.5-0.4-0.5-1.1c0-0.5,0-1-0.1-1.7c-0.2-1.6-1.2-2.1-3.2-2.2c-1.9-0.2-3.5-0.2-12.3-0.4h-1.2c-0.3,0-0.4,0.2-0.4,0.3L1427.1,442.8
	z"/>
<path class="st2" d="M1408.1,527c0-0.2,0.2-0.2,0.4-0.1l12.7,8.4c0.2,0.1,0.5,0.3,0.4,0.4c0,0.2-0.3,0.2-0.6,0.2l-15.1,1.9
	c-0.2,0-0.3-0.1-0.3-0.4L1408.1,527z M1402.7,537.8c-0.1,0.3-0.2,0.4-0.5,0.5l-13,1.8c-0.7,0.1-1.2-0.4-1.2-0.8
	c0.1-0.6,0-0.8-0.3-0.9c-0.4-0.1-0.5,0.6-0.8,1.6c-1.1,4.5-2.1,8.6-2.5,10.7c-0.5,2.1-0.5,2.6,0,2.7c0.4,0.1,0.5-0.2,0.6-0.6
	c0.2-0.7,0.4-1.5,0.8-2.3c0.6-1.1,1.7-2.6,7.3-3.6c9.4-1.7,34.5-5.5,37.9-6.1c1.4-0.3,2-0.5,2.1-1c0.1-0.6-0.4-1.1-1.9-2.1
	l-32.3-22.2c-2.6-1.8-4.2-3.3-4-5.9c0-0.5,0.2-1.3,0.3-1.8c0.1-0.5,0-0.7-0.3-0.8c-0.4-0.1-0.6,0.2-0.8,1c-0.7,2.9-1.2,6.1-1.3,6.7
	c-0.4,1.8-1.1,4.1-1.5,6c-0.1,0.6-0.1,1,0.3,1.1c0.3,0.1,0.5-0.1,0.6-0.7l0.2-0.8c0.4-1.7,1.2-2.1,2.3-1.9c0.7,0.1,2,0.7,3.3,1.6
	l7.4,4.9c0.3,0.2,0.4,0.3,0.3,0.6L1402.7,537.8z"/>
<path class="st2" d="M1399.7,626.8l3.3-8c1.3-3.1,1.5-4.5,0.7-5.8c-0.6-0.9-1.1-1.4-1.5-1.7s-0.5-0.5-0.4-0.9
	c0.2-0.4,0.5-0.4,1.1-0.1c0.8,0.4,5.2,3.5,5.6,3.8c0.6,0.5,0.9,0.8,0.7,1.1c-0.2,0.4-1,0.7-1.6,2c-0.8,1.5-1.8,3.4-2.6,5.2l-9.2,21
	c-1.5,3.4-1.5,4.9-1.7,5.3c-0.2,0.4-0.5,0.3-1.3-0.1c-1.1-0.5-4.7-2.3-6.1-2.9c-0.5-0.3-0.8-0.5-0.6-0.8c0.2-0.4,0.5-0.4,1.3-0.1
	l0.6,0.2c1.4,0.5,3.5-0.3,5.7-5l3.1-6.6l-21.8-9.6c-4.9-2.2-9.1-4-11.5-4.7c-1.6-0.5-2.9-0.7-3.8,0.8c-0.4,0.7-1.1,1.8-1.4,2.6
	c-0.3,0.6-0.5,0.8-0.8,0.7c-0.4-0.2-0.3-0.7-0.1-1.2c1.5-3.5,3.2-6.8,3.8-8.3c0.5-1.2,1.9-4.6,2.8-6.8c0.3-0.7,0.6-1,1-0.8
	c0.3,0.1,0.3,0.4,0,1c-0.3,0.8-0.5,1.5-0.6,2c-0.3,1.2,0.8,2,2.2,2.8c2.1,1.2,6.3,3.1,11.2,5.2L1399.7,626.8z"/>
<path class="st2" d="M1343.8,704.1c7.3,4.8,8.7,5.7,10.3,6.7c1.7,1,2.7,1.1,4.1-0.3c0.4-0.3,0.9-1.1,1.4-1.8c0.3-0.5,0.6-0.8,1-0.5
	c0.3,0.2,0.2,0.6-0.3,1.3c-1.7,2.6-3.9,5.5-4.7,6.9c-1,1.5-7.4,11.2-7.9,12.1c-0.5,1-0.9,1.8-1.1,2.3c-0.1,0.3-0.2,0.7-0.3,0.9
	c-0.2,0.3-0.4,0.2-0.6,0c-0.3-0.2-0.8-0.9-2.9-2.5c-0.4-0.4-2.5-1.9-3-2.3c-0.2-0.2-0.4-0.5-0.2-0.8c0.2-0.3,0.5-0.3,1,0
	c0.3,0.2,1.2,0.7,1.9,0.9c1.1,0.2,2,0.1,3.9-2.1c0.6-0.8,4.1-5.8,4.7-6.7c0.2-0.2,0.1-0.4-0.3-0.7l-12.2-8.1c-0.3-0.2-0.6-0.3-0.7,0
	c-0.7,1.1-4.4,6.6-5,7.8c-0.7,1.2-1,2-0.8,2.8c0.2,0.6,0.3,0.9,0.1,1.2c-0.1,0.2-0.3,0.3-0.6,0.1c-0.3-0.2-0.9-0.9-3.3-2.7
	c-0.9-0.7-2.8-2.1-3.1-2.3c-0.4-0.3-0.9-0.6-0.6-1c0.2-0.3,0.5-0.3,0.7-0.2c0.5,0.3,1.1,0.7,1.9,1c1.1,0.4,2.3,0.2,3.7-1.5
	c0.7-0.9,3.9-5.6,4.7-6.8c0.2-0.2,0-0.4-0.3-0.6l-3.8-2.5c-1.6-1.1-6.1-4.1-7.5-5c-3.4-2.1-4.6-1.8-7.9,3.1
	c-0.8,1.2-2.2,3.3-2.4,4.9c-0.3,1.6,0.4,2.9,2.1,4.5c0.5,0.4,0.6,0.7,0.4,1c-0.3,0.4-0.6,0.1-1.1-0.2c-1.1-0.7-4.1-3.3-5-4.2
	c-1-1.2-0.7-1.6,0.5-3.4c4.8-7.3,7.3-10.4,9.1-13.2c0.7-1.1,2.6-4.3,3.9-6.2c0.4-0.6,0.8-0.9,1.1-0.7c0.2,0.2,0.3,0.4-0.1,1
	c-0.5,0.7-0.8,1.4-0.9,1.9c-0.5,1.1,0.5,2,1.7,3.2c1.9,1.6,5.7,4.1,10.1,7L1343.8,704.1z"/>
</svg>
