{
  "ID": "",
  "Class": "",
  "Title": "root",
  "Href": "",
  "Pdf": false,
  "PdfHref": "",
  "Children": [
    {
      "ID": "n00",
      "Class": "indexL0",
      "Title": "HEIRMOLOGION",
      "Href": "",
      "Pdf": false,
      "PdfHref": "",
      "Children": [
        {
          "ID": "n01",
          "Class": "indexL1",
          "Title": "General Apolytikia",
          "Href": "",
          "Pdf": false,
          "PdfHref": "",
          "Children": [
            {
              "ID": "n02",
              "Class": "indexL2",
              "Title": "Print",
              "Href": "",
              "Pdf": false,
              "PdfHref": "",
              "Children": [
                {
                  "ID": "n03",
                  "Class": "indexAnchor",
                  "Title": "English",
                  "Href": "p/b/he/ga/en/index.html",
                  "Pdf": true,
                  "PdfHref": "p/b/he/ga/en/bk.he.ga.en.pdf",
                  "Children": null
                },
                {
                  "ID": "n13",
                  "Class": "indexAnchor",
                  "Title": "Greek-English",
                  "Href": "p/b/he/ga/gr-en/index.html",
                  "Pdf": true,
                  "PdfHref": "p/b/he/ga/gr-en/bk.he.ga.gr-en.pdf",
                  "Children": null
                }
              ]
            },
            {
              "ID": "n22",
              "Class": "indexL2",
              "Title": "View",
              "Href": "",
              "Pdf": false,
              "PdfHref": "",
              "Children": [
                {
                  "ID": "n23",
                  "Class": "indexAnchor",
                  "Title": "English",
                  "Href": "h/b/he/ga/en/index.html",
                  "Pdf": false,
                  "PdfHref": "",
                  "Children": null
                },
                {
                  "ID": "n33",
                  "Class": "indexAnchor",
                  "Title": "Greek-English",
                  "Href": "h/b/he/ga/gr-en/index.html",
                  "Pdf": false,
                  "PdfHref": "",
                  "Children": null
                }
              ]
            }
          ]
        }
      ]
    }
  ]
}