{
 "BaseHref": "../../../../../../",
 "Footer": {
  "Enabled": false,
  "Source": "",
  "InsertFacebook": true,
  "FacebookUrl": "https://www.facebook.com/OrthodoxChristianMissionCenter/",
  "InsertOwnerWebsite": true,
  "OwnerWebsiteUrl": "https://ocmc.org"
 },
 "ID": "bk.pb.daily.",
 "Language": "es-en",
 "Links": [
  {
   "Href": "css/jquery.dropdown.css"
  },
  {
   "Href": "css/bootstrap.min.css"
  },
  {
   "Href": "css/bootstrap-table.min.css"
  },
  {
   "Href": "css/app.css"
  },
  {
   "Href": "css/doxa.css"
  }
 ],
 "LmlTemplates": [
  "001: Books/PrayerBook/test/prayerBook/bk.pb.daily.lml"
 ],
 "Navbar": {
  "Simple": true,
  "NavbarSrc": "navbar",
  "NavbarHome": "/",
  "NavbarTitle": "LITURGIA DIGITAL — Recursos del Sacro Arzobispado Ortodoxo de México (Patriarcado Ecuménico)",
  "NavbarLogoSrc": "Sello del Arzobispado - Seal of the Metropolis - small.png",
  "NavbarLogoHeight": "45",
  "NavbarLogoWidth": "45",
  "ShowSecondIconColumn": true,
  "ShowTime": true
 },
 "PathOut": "/Users/Jesse/doxa/projects/doxa-esdcs/websites/test/dcs/h/b/pb/daily/es-en/index.html",
 "Rows": null,
 "Scripts": [
  {
   "MediaType": "application/javascript",
   "Source": "js/jquery-2.0.3.min.js",
   "Defer": false
  },
  {
   "MediaType": "application/javascript",
   "Source": "js/jquery.dropdown.js",
   "Defer": false
  },
  {
   "MediaType": "application/javascript",
   "Source": "js/bootstrap.bundle.min.js",
   "Defer": false
  },
  {
   "MediaType": "application/javascript",
   "Source": "js/app.js",
   "Defer": false
  }
 ],
 "Templates": {
  "Tree": {
   "Name": "accordion.gohtml",
   "ParseName": "accordion.gohtml",
   "Root": {
    "NodeType": 11,
    "Pos": 0,
    "Nodes": null
   },
   "Mode": 0
  }
 },
 "Timestamp": "Mon, 24 Apr 2023 13:49:08 -0600",
 "Title": " not found in database configs site/build/pages/titles/ma",
 "Date": "",
 "Versions": null
}