[
  {
    "BookTitle": "EUCOLOGIO (Sacramentos)",
    "GeneratedDate": "Thu, 20 Feb 2025 13:40:28 -0500",
    "Href": "p/b/eu/baptism/es/index.html",
    "MetaHref": "",
    "Pdf": true,
    "PdfHref": "p/b/eu/baptism/es/bk.eu.baptism.es.pdf",
    "LanguageCodes": "es",
    "LanguageNames": "Español",
    "MediaTitle": "PDF",
    "MediaType": "pdf",
    "MusicMedia": null,
    "SectionTitle": "Bautismo PDF Español",
    "ServiceDay": 0,
    "ServiceMonth": 0,
    "ServiceType": "",
    "ServiceYear": 0,
    "SortOrder": "EUCOLOGIO (Sacramentos)BautismoPDFEspañol",
    "TemplateId": "a-templates/Books/Euchologion/bk.eu.baptism",
    "TitleCodes": [
      "eu",
      "baptism",
      "pdf",
      "es"
    ],
    "Titles": [
      "EUCOLOGIO (Sacramentos)",
      "Bautismo",
      "PDF",
      "Español"
    ],
    "Type": "Book"
  },
  {
    "BookTitle": "EUCOLOGIO (Sacramentos)",
    "GeneratedDate": "Thu, 20 Feb 2025 13:40:29 -0500",
    "Href": "p/b/eu/baptism/es-gr/index.html",
    "MetaHref": "",
    "Pdf": true,
    "PdfHref": "p/b/eu/baptism/es-gr/bk.eu.baptism.es-gr.pdf",
    "LanguageCodes": "es-gr",
    "LanguageNames": "Español-Griego",
    "MediaTitle": "PDF",
    "MediaType": "pdf",
    "MusicMedia": null,
    "SectionTitle": "Bautismo PDF Español-Griego",
    "ServiceDay": 0,
    "ServiceMonth": 0,
    "ServiceType": "",
    "ServiceYear": 0,
    "SortOrder": "EUCOLOGIO (Sacramentos)BautismoPDFEspañol-Griego",
    "TemplateId": "a-templates/Books/Euchologion/bk.eu.baptism",
    "TitleCodes": [
      "eu",
      "baptism",
      "pdf",
      "es-gr"
    ],
    "Titles": [
      "EUCOLOGIO (Sacramentos)",
      "Bautismo",
      "PDF",
      "Español-Griego"
    ],
    "Type": "Book"
  },
  {
    "BookTitle": "EUCOLOGIO (Sacramentos)",
    "GeneratedDate": "Thu, 20 Feb 2025 13:40:28 -0500",
    "Href": "p/b/eu/baptism/es-en/index.html",
    "MetaHref": "",
    "Pdf": true,
    "PdfHref": "p/b/eu/baptism/es-en/bk.eu.baptism.es-en.pdf",
    "LanguageCodes": "es-en",
    "LanguageNames": "Español-Inglés",
    "MediaTitle": "PDF",
    "MediaType": "pdf",
    "MusicMedia": null,
    "SectionTitle": "Bautismo PDF Español-Inglés",
    "ServiceDay": 0,
    "ServiceMonth": 0,
    "ServiceType": "",
    "ServiceYear": 0,
    "SortOrder": "EUCOLOGIO (Sacramentos)BautismoPDFEspañol-Inglés",
    "TemplateId": "a-templates/Books/Euchologion/bk.eu.baptism",
    "TitleCodes": [
      "eu",
      "baptism",
      "pdf",
      "es-en"
    ],
    "Titles": [
      "EUCOLOGIO (Sacramentos)",
      "Bautismo",
      "PDF",
      "Español-Inglés"
    ],
    "Type": "Book"
  },
  {
    "BookTitle": "EUCOLOGIO (Sacramentos)",
    "GeneratedDate": "Thu, 20 Feb 2025 13:40:28 -0500",
    "Href": "p/b/eu/baptism/es-en-gr/index.html",
    "MetaHref": "",
    "Pdf": true,
    "PdfHref": "p/b/eu/baptism/es-en-gr/bk.eu.baptism.es-en-gr.pdf",
    "LanguageCodes": "es-en-gr",
    "LanguageNames": "Español-Inglés-Griego",
    "MediaTitle": "PDF",
    "MediaType": "pdf",
    "MusicMedia": null,
    "SectionTitle": "Bautismo PDF Español-Inglés-Griego",
    "ServiceDay": 0,
    "ServiceMonth": 0,
    "ServiceType": "",
    "ServiceYear": 0,
    "SortOrder": "EUCOLOGIO (Sacramentos)BautismoPDFEspañol-Inglés-Griego",
    "TemplateId": "a-templates/Books/Euchologion/bk.eu.baptism",
    "TitleCodes": [
      "eu",
      "baptism",
      "pdf",
      "es-en-gr"
    ],
    "Titles": [
      "EUCOLOGIO (Sacramentos)",
      "Bautismo",
      "PDF",
      "Español-Inglés-Griego"
    ],
    "Type": "Book"
  },
  {
    "BookTitle": "EUCOLOGIO (Sacramentos)",
    "GeneratedDate": "Thu, 20 Feb 2025 13:40:28 -0500",
    "Href": "h/b/eu/baptism/es/index.html",
    "MetaHref": "",
    "Pdf": false,
    "PdfHref": "",
    "LanguageCodes": "es",
    "LanguageNames": "Español",
    "MediaTitle": "Texto en línea",
    "MediaType": "html",
    "MusicMedia": null,
    "SectionTitle": "Bautismo Texto en línea Español",
    "ServiceDay": 0,
    "ServiceMonth": 0,
    "ServiceType": "",
    "ServiceYear": 0,
    "SortOrder": "EUCOLOGIO (Sacramentos)BautismoTexto en líneaEspañol",
    "TemplateId": "a-templates/Books/Euchologion/bk.eu.baptism",
    "TitleCodes": [
      "eu",
      "baptism",
      "html",
      "es"
    ],
    "Titles": [
      "EUCOLOGIO (Sacramentos)",
      "Bautismo",
      "Texto en línea",
      "Español"
    ],
    "Type": "Book"
  },
  {
    "BookTitle": "EUCOLOGIO (Sacramentos)",
    "GeneratedDate": "Thu, 20 Feb 2025 13:40:28 -0500",
    "Href": "h/b/eu/baptism/es-gr/index.html",
    "MetaHref": "",
    "Pdf": false,
    "PdfHref": "",
    "LanguageCodes": "es-gr",
    "LanguageNames": "Español-Griego",
    "MediaTitle": "Texto en línea",
    "MediaType": "html",
    "MusicMedia": null,
    "SectionTitle": "Bautismo Texto en línea Español-Griego",
    "ServiceDay": 0,
    "ServiceMonth": 0,
    "ServiceType": "",
    "ServiceYear": 0,
    "SortOrder": "EUCOLOGIO (Sacramentos)BautismoTexto en líneaEspañol-Griego",
    "TemplateId": "a-templates/Books/Euchologion/bk.eu.baptism",
    "TitleCodes": [
      "eu",
      "baptism",
      "html",
      "es-gr"
    ],
    "Titles": [
      "EUCOLOGIO (Sacramentos)",
      "Bautismo",
      "Texto en línea",
      "Español-Griego"
    ],
    "Type": "Book"
  },
  {
    "BookTitle": "EUCOLOGIO (Sacramentos)",
    "GeneratedDate": "Thu, 20 Feb 2025 13:40:28 -0500",
    "Href": "h/b/eu/baptism/es-en/index.html",
    "MetaHref": "",
    "Pdf": false,
    "PdfHref": "",
    "LanguageCodes": "es-en",
    "LanguageNames": "Español-Inglés",
    "MediaTitle": "Texto en línea",
    "MediaType": "html",
    "MusicMedia": [
      {
        "DbId": "media/en_redirects_goarch/eu.baptism/euBAP.Key0203/c1231/audio/1",
        "Desc": "euBAP.Key0203",
        "ID": "c1231",
        "Info": "SDedes",
        "Path": "/media/a/dedes/eu/baptism/responses1.mp3",
        "PathPrefix": "https://dcs.goarch.org"
      },
      {
        "DbId": "media/en_redirects_goarch/eu.baptism/euBAP.Key0203/c1231/score/b/1",
        "Desc": "euBAP.Key0203",
        "ID": "c1231",
        "Info": "SDedes",
        "Path": "/media/m/dedes/en/eu/baptism/b/responses.pdf",
        "PathPrefix": "https://dcs.goarch.org/goa/dcs/js/viewer/web/viewer.html?file=https://dcs.goarch.org"
      },
      {
        "DbId": "media/en_redirects_goarch/eu.baptism/euBAP.Key0203/c1231/score/w/1",
        "Desc": "euBAP.Key0203",
        "ID": "c1231",
        "Info": "SDedes",
        "Path": "/media/m/dedes/en/eu/baptism/w/responses.pdf",
        "PathPrefix": "https://dcs.goarch.org/goa/dcs/js/viewer/web/viewer.html?file=https://dcs.goarch.org"
      }
    ],
    "SectionTitle": "Bautismo Texto en línea Español-Inglés",
    "ServiceDay": 0,
    "ServiceMonth": 0,
    "ServiceType": "",
    "ServiceYear": 0,
    "SortOrder": "EUCOLOGIO (Sacramentos)BautismoTexto en líneaEspañol-Inglés",
    "TemplateId": "a-templates/Books/Euchologion/bk.eu.baptism",
    "TitleCodes": [
      "eu",
      "baptism",
      "html",
      "es-en"
    ],
    "Titles": [
      "EUCOLOGIO (Sacramentos)",
      "Bautismo",
      "Texto en línea",
      "Español-Inglés"
    ],
    "Type": "Book"
  },
  {
    "BookTitle": "EUCOLOGIO (Sacramentos)",
    "GeneratedDate": "Thu, 20 Feb 2025 13:40:28 -0500",
    "Href": "h/b/eu/baptism/es-en-gr/index.html",
    "MetaHref": "",
    "Pdf": false,
    "PdfHref": "",
    "LanguageCodes": "es-en-gr",
    "LanguageNames": "Español-Inglés-Griego",
    "MediaTitle": "Texto en línea",
    "MediaType": "html",
    "MusicMedia": [
      {
        "DbId": "media/en_redirects_goarch/eu.baptism/euBAP.Key0203/c1231/audio/1",
        "Desc": "euBAP.Key0203",
        "ID": "c1231",
        "Info": "SDedes",
        "Path": "/media/a/dedes/eu/baptism/responses1.mp3",
        "PathPrefix": "https://dcs.goarch.org"
      },
      {
        "DbId": "media/en_redirects_goarch/eu.baptism/euBAP.Key0203/c1231/score/b/1",
        "Desc": "euBAP.Key0203",
        "ID": "c1231",
        "Info": "SDedes",
        "Path": "/media/m/dedes/en/eu/baptism/b/responses.pdf",
        "PathPrefix": "https://dcs.goarch.org/goa/dcs/js/viewer/web/viewer.html?file=https://dcs.goarch.org"
      },
      {
        "DbId": "media/en_redirects_goarch/eu.baptism/euBAP.Key0203/c1231/score/w/1",
        "Desc": "euBAP.Key0203",
        "ID": "c1231",
        "Info": "SDedes",
        "Path": "/media/m/dedes/en/eu/baptism/w/responses.pdf",
        "PathPrefix": "https://dcs.goarch.org/goa/dcs/js/viewer/web/viewer.html?file=https://dcs.goarch.org"
      }
    ],
    "SectionTitle": "Bautismo Texto en línea Español-Inglés-Griego",
    "ServiceDay": 0,
    "ServiceMonth": 0,
    "ServiceType": "",
    "ServiceYear": 0,
    "SortOrder": "EUCOLOGIO (Sacramentos)BautismoTexto en líneaEspañol-Inglés-Griego",
    "TemplateId": "a-templates/Books/Euchologion/bk.eu.baptism",
    "TitleCodes": [
      "eu",
      "baptism",
      "html",
      "es-en-gr"
    ],
    "Titles": [
      "EUCOLOGIO (Sacramentos)",
      "Bautismo",
      "Texto en línea",
      "Español-Inglés-Griego"
    ],
    "Type": "Book"
  }
]