{
  "Title": "Ibaada",
  "SubTitle": "Mpangilio wa Ibaada kwa Miezi",
  "LangCodes": [
    "EN",
    "EN-SWH",
    "EN-SWH-GR",
    "GR-EN",
    "GR-EN-SWH",
    "GR-SWH",
    "SWH"
  ],
  "LangNames": [
    "Kigiriki-Kingereza",
    "Kigiriki-Kingereza-Swahili",
    "Kigiriki-Swahili",
    "Kingereza",
    "Kingereza-Swahili",
    "Kingereza-Swahili-Kigiriki",
    "Swahili"
  ],
  "MonthYears": [
    {
      "MonthYear": "Juni 2025",
      "MonthNbr": 6,
      "YearNbr": 2025,
      "Days": [
        {
          "BaseHref": "../",
          "DayNbrDow": "08-Jumapili",
          "DayNbr": 8,
          "Description": [
            "Kibonyezo kilichoandikwa 'PDF' kinafungua faili aina ya pdf iliyo na Ibaada.",
            "Kibonyezo kilichoandikwa 'Tazama' kinafungua maandishi ya Ibaada kwenye mtandao, ambayo pia inazo vibonyezo za nyimbo. Kusikiliza nyimbo zilizorekodiwa, teremka hadi mahali utakapo kwenye Ibaada, kisha bonyeza kwenye picha ionyeshayo alama ya muziki."
          ],
          "Href": "indexes/20250608.html",
          "SubTitle": "Ibaada za Jumapili, Juni 8, 2025",
          "Title": "Stendi za Dijitali za Nyimbo",
          "Services": [
            {
              "Title": "Liturghia Takatifu",
              "Languages": [
                {
                  "Title": "Liturghia Takatifu",
                  "Language": "Kingereza",
                  "Media": "PDF",
                  "Href": "p/s/2025/06/08/li/en/index.html",
                  "PDF": true,
                  "PdfHref": "p/s/2025/06/08/li/en/se.m06.d08.li.en.pdf",
                  "Target": "_blank"
                },
                {
                  "Title": "Liturghia Takatifu",
                  "Language": "Kingereza",
                  "Media": "Tazama",
                  "Href": "h/s/2025/06/08/li/en/index.html",
                  "PDF": false,
                  "PdfHref": "",
                  "Target": "_self"
                },
                {
                  "Title": "Liturghia Takatifu",
                  "Language": "Swahili",
                  "Media": "PDF",
                  "Href": "p/s/2025/06/08/li/swh/index.html",
                  "PDF": true,
                  "PdfHref": "p/s/2025/06/08/li/swh/se.m06.d08.li.swh.pdf",
                  "Target": "_blank"
                },
                {
                  "Title": "Liturghia Takatifu",
                  "Language": "Swahili",
                  "Media": "Tazama",
                  "Href": "h/s/2025/06/08/li/swh/index.html",
                  "PDF": false,
                  "PdfHref": "",
                  "Target": "_self"
                },
                {
                  "Title": "Liturghia Takatifu",
                  "Language": "Kigiriki-Kingereza",
                  "Media": "PDF",
                  "Href": "p/s/2025/06/08/li/gr-en/index.html",
                  "PDF": true,
                  "PdfHref": "p/s/2025/06/08/li/gr-en/se.m06.d08.li.gr-en.pdf",
                  "Target": "_blank"
                },
                {
                  "Title": "Liturghia Takatifu",
                  "Language": "Kigiriki-Kingereza",
                  "Media": "Tazama",
                  "Href": "h/s/2025/06/08/li/gr-en/index.html",
                  "PDF": false,
                  "PdfHref": "",
                  "Target": "_self"
                },
                {
                  "Title": "Liturghia Takatifu",
                  "Language": "Kigiriki-Swahili",
                  "Media": "PDF",
                  "Href": "p/s/2025/06/08/li/gr-swh/index.html",
                  "PDF": true,
                  "PdfHref": "p/s/2025/06/08/li/gr-swh/se.m06.d08.li.gr-swh.pdf",
                  "Target": "_blank"
                },
                {
                  "Title": "Liturghia Takatifu",
                  "Language": "Kigiriki-Swahili",
                  "Media": "Tazama",
                  "Href": "h/s/2025/06/08/li/gr-swh/index.html",
                  "PDF": false,
                  "PdfHref": "",
                  "Target": "_self"
                },
                {
                  "Title": "Liturghia Takatifu",
                  "Language": "Kingereza-Swahili",
                  "Media": "PDF",
                  "Href": "p/s/2025/06/08/li/en-swh/index.html",
                  "PDF": true,
                  "PdfHref": "p/s/2025/06/08/li/en-swh/se.m06.d08.li.en-swh.pdf",
                  "Target": "_blank"
                },
                {
                  "Title": "Liturghia Takatifu",
                  "Language": "Kingereza-Swahili",
                  "Media": "Tazama",
                  "Href": "h/s/2025/06/08/li/en-swh/index.html",
                  "PDF": false,
                  "PdfHref": "",
                  "Target": "_self"
                },
                {
                  "Title": "Liturghia Takatifu",
                  "Language": "Kigiriki-Kingereza-Swahili",
                  "Media": "PDF",
                  "Href": "p/s/2025/06/08/li/gr-en-swh/index.html",
                  "PDF": true,
                  "PdfHref": "p/s/2025/06/08/li/gr-en-swh/se.m06.d08.li.gr-en-swh.pdf",
                  "Target": "_blank"
                },
                {
                  "Title": "Liturghia Takatifu",
                  "Language": "Kigiriki-Kingereza-Swahili",
                  "Media": "Tazama",
                  "Href": "h/s/2025/06/08/li/gr-en-swh/index.html",
                  "PDF": false,
                  "PdfHref": "",
                  "Target": "_self"
                },
                {
                  "Title": "Liturghia Takatifu",
                  "Language": "Kingereza-Swahili-Kigiriki",
                  "Media": "PDF",
                  "Href": "p/s/2025/06/08/li/en-swh-gr/index.html",
                  "PDF": true,
                  "PdfHref": "p/s/2025/06/08/li/en-swh-gr/se.m06.d08.li.en-swh-gr.pdf",
                  "Target": "_blank"
                },
                {
                  "Title": "Liturghia Takatifu",
                  "Language": "Kingereza-Swahili-Kigiriki",
                  "Media": "Tazama",
                  "Href": "h/s/2025/06/08/li/en-swh-gr/index.html",
                  "PDF": false,
                  "PdfHref": "",
                  "Target": "_self"
                }
              ]
            }
          ]
        }
      ]
    }
  ]
}