ltx/swh_ke_oak/le.go.mc.d188:lemcLI.Gospel.book	@ltx/swh_ke_oak/bible:Matthew
ltx/swh_ke_oak/le.go.mc.d188:lemcLI.Gospel.chapverse	(22:23-33)
ltx/swh_ke_oak/le.go.mc.d188:lemcLI.Gospel.text	Siku hiyo, baadhi ya Masadukayo wasemao wafu hawafufuki walimwendea Yesu. Basi, wakamwambia, "Mwalimu, Mose alisema mtu aliyeoa akifa bila kuacha watoto, lazima ndugu yake amwoe huyo mama mjane, ili ampatie ndugu yake watoto. Basi, hapa petu palikuwa na ndugu saba. Wa kwanza alioa kisha akafa bila kujaliwa watoto, akamwachia ndugu yake huyo mke wake mjane. Ikawa vivyo hivyo kwa ndugu wa pili, na wa tatu, mpaka wa saba. Baada ya ndugu hao wote kufa, akafa pia yule mama. Je, siku wafu watakapofufuka mama huyo atakuwa mke wa nani miongoni mwa wale ndugu saba? Maana wote saba walikuwa wamemwoa." Yesu akawajibu, "Nyinyi mmekosea kwa sababu hamjui Maandiko Matakatifu wala nguvu ya Mungu. Maana wafu watakapofufuka hawataoa wala kuolewa; watakuwa kama malaika mbinguni. Lakini kuhusu kufufuka kwa wafu, je, hamjasoma yale aliyowaambieni Mungu? Aliwaambia, ''Mimi ni Mungu wa Abrahamu, Mungu wa Isaka na Mungu wa Yakobo!'' Basi, yeye si Mungu wa wafu, bali ni Mungu wa walio hai." Ule umati wa watu uliposikia hivyo ukayastaajabia mafundisho yake.
ltx/swh_ke_oak/le.go.mc.d188:lemcLI.Gospel.title	
ltx/swh_ke_oak/le.go.mc.d188:lemcLI.Gospel.version	
