ltx/swh_ke_oak/le.ep.me.m09.d13:lemeLI.Epistle.book	@ltx/swh_ke_oak/bible:Hebrews
ltx/swh_ke_oak/le.ep.me.m09.d13:lemeLI.Epistle.chapverse	(3:1-4)
ltx/swh_ke_oak/le.ep.me.m09.d13:lemeLI.Epistle.pagenumber	
ltx/swh_ke_oak/le.ep.me.m09.d13:lemeLI.Epistle.text	Ndugu zangu, watu wa Mungu ambao mmeitwa na Mungu, fikirini juu ya Yesu Mtume na Kuhani Mkuu wa imani tunayoiungama. Yeye alikuwa mwaminifu kwa Mungu aliyemteua kufanya kazi yake kama vile Mose alivyokuwa mwaminifu katika nyumba yote ya Mungu. Lakini Yesu anastahili heshima kubwa kuliko Mose maana mjenzi wa nyumba hupata heshima zaidi kuliko hiyo nyumba yenyewe. Kila nyumba hujengwa na mtu fulani, lakini Mungu ndiye mjenzi wa vitu vyote.
ltx/swh_ke_oak/le.ep.me.m09.d13:lemeLI.Epistle.title	
ltx/swh_ke_oak/le.ep.me.m09.d13:lemeLI.Epistle.version	
