ltx/swh_ke_oak/le.go.mc.d010:lemcLI.Gospel.book	@ltx/swh_ke_oak/bible:Mark
ltx/swh_ke_oak/le.go.mc.d010:lemcLI.Gospel.chapverse	(14:10-42)
ltx/swh_ke_oak/le.go.mc.d010:lemcLI.Gospel.text	Kisha Yuda Iskarioti, mmoja wa wale kumi na wawili, alikwenda kwa makuhani wakuu ili kumsaliti Yesu. Makuhani wakuu waliposikia habari hiyo, walifurahi, wakamwahidi kumpa fedha. Basi, Yuda akaanza kutafuta nafasi ya kumsaliti. Siku ya kwanza ya sikukuu ya mikate isiyotiwa chachu, wakati ambapo mwana kondoo wa Pasaka huchinjwa, wanafunzi wake walimwuliza, "Wataka tukuandalie wapi karamu ya Pasaka?" Basi Yesu akawatuma wawili wa wanafunzi wake akiwaambia, "Nendeni mjini, na humo mtakutana na mwanamume mmoja anayebeba mtungi wa maji. Mfuateni mpaka katika nyumba atakayoingia, mkamwambie mwenye nyumba, ''Mwalimu anasema: wapi chumba changu ambamo nitakula Pasaka pamoja na wanafunzi wangu?'' Naye atawaonesha chumba kikubwa ghorofani kilichotayarishwa na kupambwa. Tuandalieni humo." Wanafunzi wakaondoka, wakaenda mjini, wakakuta kila kitu sawa kama Yesu alivyokuwa amewaambia. Wakaandaa karamu ya Pasaka. Ilipokuwa jioni, Yesu alifika pamoja na wanafunzi wake kumi na wawili. Walipokuwa mezani wakila, Yesu alisema, "Kweli nawaambieni, mmoja wenu anayekula pamoja nami, atanisaliti." Hapo wanafunzi wake wakaanza kuhuzunika, wakamwuliza mmoja-mmoja, "Je, ni mimi?" Yesu akawaambia, "Ni mmoja wenu nyinyi kumi na wawili, anayechovya mkate pamoja nami katika bakuli. Kweli Mwana wa Mtu anakwenda zake kama Maandiko Matakatifu yanavyosema juu yake; lakini, ole wake mtu yule anayemsaliti Mwana wa Mtu! Ingalikuwa afadhali kwa mtu huyo kama hangalizaliwa!" Walipokuwa wanakula, Yesu alitwaa mkate, akashukuru, akaumega na kuwapa wanafunzi wake akisema, "Twaeni; huu ni mwili wangu." Kisha akatwaa kikombe cha divai, akamshukuru Mungu, akawapa; wote wakanywa kutoka kikombe hicho. Akawaambia, "Hii ni damu yangu inayothibitisha agano la Mungu, damu inayomwagwa kwa ajili ya watu wengi. Kweli nawaambieni, sitakunywa tena divai ya zabibu mpaka siku ile nitakapoinywa upya katika ufalme wa Mungu." Kisha wakaimba wimbo, wakaondoka, wakaenda katika mlima wa Mizeituni. Yesu akawaambia wanafunzi wake, "Nyinyi nyote mtakuwa na mashaka nami; maana Maandiko Matakatifu yasema: ''Nitampiga mchungaji, nao kondoo watatawanyika.'' Lakini nikisha fufuka, nitawatangulieni kule Galilaya." Petro akamwambia, "Hata kama wote watakuwa na mashaka nawe na kukuacha, mimi sitakukana kamwe!" Yesu akawaambia, "Kweli nakuambia, usiku huu, kabla jogoo hajawika mara mbili, utanikana mara tatu." Lakini Petro akasisitiza, "Hata kama ni lazima nife pamoja nawe, sitakuacha kamwe." Wanafunzi wote pia wakasema vivyo hivyo. Basi, wakafika katika bustani iliyoitwa Gethsemane. Yesu akawaambia wanafunzi wake, "Kaeni hapa wakati mimi nasali." Kisha akawachukua Petro, Yakobo na Yohane; akaanza kufadhaika sana na kuhangaika. Akawaambia, "Nina huzuni kubwa moyoni hata karibu kufa. Kaeni hapa na kukesha." Akaenda mbele kidogo, akajitupa chini kifudifudi, akasali kwamba, kama ingewezekana, asiipitie saa hiyo ya mateso. Akasema, "Baba yangu, kwako mambo yote yanawezekana. Uniondolee kikombe hiki; lakini isiwe kama nitakavyo mimi, bali utakavyo wewe." Kisha akarudi kwa wanafunzi wale watatu, akawakuta wamelala. Basi, akamwuliza Petro, "Simoni, je, umelala? Hukuweza kukesha hata saa moja?" Kisha akawaambia, "Kesheni na kusali ili msije mkaingia katika majaribu. Roho inataka, lakini mwili ni dhaifu." Akaenda kusali tena akirudia maneno yaleyale. Kisha akarudi tena, akawakuta wamelala. Macho yao yalikuwa yamebanwa na usingizi. Hawakujua la kumjibu. Alipowajia mara ya tatu aliwaambia, "Mnalala bado na kupumzika? Sasa imetosha! Saa imefika! Mwana wa Mtu anakabidhiwa kwa watu waovu. Amkeni, twende zetu. Tazameni, yule atakayenisaliti amekaribia."
ltx/swh_ke_oak/le.go.mc.d010:lemcLI.Gospel.title	
ltx/swh_ke_oak/le.go.mc.d010:lemcLI.Gospel.version	
