ltx/swh_ke_oak/le.ep.me.m01.d01:lemeLI.Epistle.book	@ltx/swh_ke_oak/bible:Colossians
ltx/swh_ke_oak/le.ep.me.m01.d01:lemeLI.Epistle.chapverse	(2:8-12)
ltx/swh_ke_oak/le.ep.me.m01.d01:lemeLI.Epistle.pagenumber	
ltx/swh_ke_oak/le.ep.me.m01.d01:lemeLI.Epistle.text	Ndugu zangu, angalieni mtu asiwapotoshe kwa udanganyifu mtupu wa hekima ya kibinadamu, ambayo chanzo chake ni mafundisho ya mapokeo ya watu na ya pepo watawala, na wala si Kristo mwenyewe! Maana, ndani yake Kristo katika ubinadamu wake, umo ukamilifu wote wa Mungu, nanyi mmepewa uhai kamili katika kuungana naye. Yeye yuko juu ya pepo watawala wote na wakuu wote. Katika kuungana na Kristo nyinyi mlitahiriwa, lakini si kwa tohara ifanywayo na watu, bali inayofanywa na Kristo mwenyewe, na ambayo inahusikana na kukombolewa kutoka katika utu wa dhambi. Maana, mlipobatizwa mlizikwa pamoja na Kristo, na katika ubatizo mlifufuliwa pia pamoja naye kwa kuamini katika nguvu ya Mungu ambaye alimfufua Kristo kutoka wafu.
ltx/swh_ke_oak/le.ep.me.m01.d01:lemeLI.Epistle.title	
