ltx/swh_ke_oak/le.go.me.m04.d01:lemeLI.Gospel.book	@ltx/swh_ke_oak/bible:John
ltx/swh_ke_oak/le.go.me.m04.d01:lemeLI.Gospel.chapverse	(8:3-11)
ltx/swh_ke_oak/le.go.me.m04.d01:lemeLI.Gospel.text	Wakati huo waalimu wa sheria na Mafarisayo walimletea Yesu mwanamke mmoja aliyafumaniwa katika uzinzi. Wakamsimamisha katikati yao. Kisha wakamwuliza Yesu, "Mwalimu! Mwanamke huyu alifumaniwa katika uzinzi. Katika sheria yetu Mose alituamuru mwanamke kama huyu apigwe mawe. Basi, wewe wasemaje?" Walisema hivyo kumjaribu, wapate kisa cha kumshtaki. Lakini Yesu akainama chini, akaandika ardhini kwa kidole. Walipozidi kumwuliza, Yesu akainuka, akawaambia, "Mtu asiye na dhambi miongoni mwenu na awe wa kwanza kumpiga jiwe." Kisha akainama tena, akawa anaandika ardhini. Waliposikia hivyo, wakaanza kutoweka mmoja-mmoja, wakitangulia wazee. Yesu akabaki peke yake, na yule mwanamke amesimama palepale. Yesu alipoinuka akamwuliza huyo mwanamke, "Wako wapi wale watu? Je, hakuna hata mmoja aliyekuhukumu?" Huyo mwanamke akamjibu, "Bwana, hakuna hata mmoja!" Naye Yesu akamwambia, "Wala mimi sikuhukumu. Nenda zako; na tangu sasa usitende dhambi tena."
ltx/swh_ke_oak/le.go.me.m04.d01:lemeLI.Gospel.title	
ltx/swh_ke_oak/le.go.me.m04.d01:lemeLI.Gospel.version	
