ltx/swh_ke_oak/le.pr.os:leosCO.Key0300.book	@ltx/swh_ke_oak/bible:Isaiah
ltx/swh_ke_oak/le.pr.os:leosCO.Key0300.chapverse	
ltx/swh_ke_oak/le.pr.os:leosCO.Key0300.title	
ltx/swh_ke_oak/le.pr.os:leosCO.Key0300.version	
ltx/swh_ke_oak/le.pr.os:leosCO.Key0301.text	
ltx/swh_ke_oak/le.pr.os:leosCO.Key0302.text	
ltx/swh_ke_oak/le.pr.os:leosCO.Key0303.text	
ltx/swh_ke_oak/le.pr.os:leosCO.Key0304.text	
ltx/swh_ke_oak/le.pr.os:leosCO.Key0305.text	
ltx/swh_ke_oak/le.pr.os:leosCO.Key0306.text	
ltx/swh_ke_oak/le.pr.os:leosCO.Key0307.text	
ltx/swh_ke_oak/le.pr.os:leosCO.Key0308.text	
ltx/swh_ke_oak/le.pr.os:leosCO.Key0309.text	
ltx/swh_ke_oak/le.pr.os:leosCO.Key0310.text	
ltx/swh_ke_oak/le.pr.os:leosCO.Key0311.text	
ltx/swh_ke_oak/le.pr.os:leosCO.Key0312.text	
ltx/swh_ke_oak/le.pr.os:leosCO.Key0313.text	
ltx/swh_ke_oak/le.pr.os:leosCO.Key0314.text	
ltx/swh_ke_oak/le.pr.os:leosCO.Key0315.text	
ltx/swh_ke_oak/le.pr.os:leosCO.Key0316.text	
ltx/swh_ke_oak/le.pr.os:leosCO.Key0317.text	
ltx/swh_ke_oak/le.pr.os:leosCO.Key0318.text	
ltx/swh_ke_oak/le.pr.os:leosCO.Key0319.text	
ltx/swh_ke_oak/le.pr.os:leosCO.Key0320.text	
ltx/swh_ke_oak/le.pr.os:leosCO.Key0321.text	
ltx/swh_ke_oak/le.pr.os:leosFUN.Key1202.book	@ltx/swh_ke_oak/bible:Genesis
ltx/swh_ke_oak/le.pr.os:leosFUN.Key1202.chapverse	
ltx/swh_ke_oak/le.pr.os:leosFUN.Key1202.text	
ltx/swh_ke_oak/le.pr.os:leosFUN.Key1202.title	
ltx/swh_ke_oak/le.pr.os:leosFUN.Key1202.version	
ltx/swh_ke_oak/le.pr.os:leosH1.me.m12.d24.Verse1.book	@ltx/swh_ke_oak/bible:Habakkuk
ltx/swh_ke_oak/le.pr.os:leosH1.me.m12.d24.Verse1.chapverse	
ltx/swh_ke_oak/le.pr.os:leosH1.me.m12.d24.Verse1.text	
ltx/swh_ke_oak/le.pr.os:leosH1.me.m12.d24.Verse1.version	
ltx/swh_ke_oak/le.pr.os:leosH1.me.m12.d24.Verse2.book	@ltx/swh_ke_oak/bible:Habakkuk
ltx/swh_ke_oak/le.pr.os:leosH1.me.m12.d24.Verse2.chapverse	
ltx/swh_ke_oak/le.pr.os:leosH1.me.m12.d24.Verse2.text	
ltx/swh_ke_oak/le.pr.os:leosH1.me.m12.d24.Verse2.version	
ltx/swh_ke_oak/le.pr.os:leosH9.ho.ho09.Key0001.text	Usituache kwa ajili ya maneno ya vinywa vyetu, kwa ajili ya Jina Lako Takatifu, usibatili agano lako.  Usichukuwe huruma Yako kwetu, kwa ajili ya Abrahamu mpendwa Wako, na Isaka Mmtumishi Wako mtakatifu wa pekee,
ltx/swh_ke_oak/le.pr.os:leosH9.ho.s09.Key0001.book	@ltx/swh_ke_oak/bible:Daniel
ltx/swh_ke_oak/le.pr.os:leosH9.ho.s09.Key0001.chapverse	
ltx/swh_ke_oak/le.pr.os:leosH9.ho.s09.Key0001.text	
ltx/swh_ke_oak/le.pr.os:leosH9.ho.s09.Key0001.version	
ltx/swh_ke_oak/le.pr.os:leosLI.pe.d113.EpistleProkeimenon.book	@ltx/swh_ke_oak/bible:Daniel
ltx/swh_ke_oak/le.pr.os:leosLI.pe.d113.EpistleProkeimenon.chapverse	
ltx/swh_ke_oak/le.pr.os:leosLI.pe.d113.EpistleProkeimenon.text	
ltx/swh_ke_oak/le.pr.os:leosLI.pe.d113.EpistleProkeimenon.title	
ltx/swh_ke_oak/le.pr.os:leosLI.pe.d113.EpistleProkeimenon.version	
ltx/swh_ke_oak/le.pr.os:leosLI.pe.d113.EpistleProkeimenonVerse.text	
ltx/swh_ke_oak/le.pr.os:leosMA.GreatDoxology.v09.book	@ltx/swh_ke_oak/bible:Daniel
ltx/swh_ke_oak/le.pr.os:leosMA.GreatDoxology.v09.chapverse	
ltx/swh_ke_oak/le.pr.os:leosMA.GreatDoxology.v09.text	Wahimidiwa Ee Bwana wa mababa zetu, jina lako linasifiwa na linatukuzwa kwa milele, Amina.
ltx/swh_ke_oak/le.pr.os:leosMA.GreatDoxology.v09.title	
ltx/swh_ke_oak/le.pr.os:leosMA.GreatDoxology.v09.version	
ltx/swh_ke_oak/le.pr.os:leosMA.LentAlleluia.book	@ltx/swh_ke_oak/bible:Isaiah
ltx/swh_ke_oak/le.pr.os:leosMA.LentAlleluia.chapverse	
ltx/swh_ke_oak/le.pr.os:leosMA.LentAlleluia.title	
ltx/swh_ke_oak/le.pr.os:leosMA.LentAlleluia.version	
ltx/swh_ke_oak/le.pr.os:leosMA.LentAlleluiaVerse1.text	Roho yaku itakutafuta makesha ya usiku, Ee Mungu, maana maagizo yako ni nuru nchini.
ltx/swh_ke_oak/le.pr.os:leosMA.LentAlleluiaVerse2.text	Jifunzeni haki enyi mkaao nchini.
ltx/swh_ke_oak/le.pr.os:leosMA.LentAlleluiaVerse3.text	Wivu utawashika watu washenzi na sasa hivi
ltx/swh_ke_oak/le.pr.os:leosMA.LentAlleluiaVerse4.text	Uwazidishie mabaya Ee Bwana, uwazidishie mabaya, waliotukuzika bure duniani.
