ltx/swh_ke_oak/tr.d069:trH1.Idiomelon1.mode	Sauti 8
ltx/swh_ke_oak/tr.d069:trH1.Idiomelon1.text	Siku ya leo pazia la Hekalu lapasuka likiwashutumu wasio jua sheria; na jua linaficha miale yake, kwa kumwona  Bwana akisulubiwa.
ltx/swh_ke_oak/tr.d069:trH1.Idiomelon2.mode	Sauti 8
ltx/swh_ke_oak/tr.d069:trH1.Idiomelon2.text	Kama mwana kondoo umeongozwa machinjoni, Ee Kristo Mfalme; na kama Mwana kondoo asiye ujanja, Ee Mfalme wa wote, ulikongomewa Msalabani na watu wasio jua sheria kwa ajili ya dhambi zetu, Ee Mpenda wanadamu.
ltx/swh_ke_oak/tr.d069:trH1.Idiomelon3.mode	Sauti 8
ltx/swh_ke_oak/tr.d069:trH1.Idiomelon3.text	Kwa kuvumilia wasio jua sheria walio Kushika, Ee Bwana, Ulilia ukisema: “Ingawaje umempiga mchungaji na kutawanyisha kondoo kumi na wawili, wanafunzi Wangu, ningeleta zaidi ya jeshi kumi na mbili la Malaika kusimama nami.  Bali nalivumilia, ili kwamba, kile nilicho watangazia, kupitia kwa Manabii, kitimilike; vitu visivyo tambulikana na kufichika.” Bwana, utukufu Kwako.
ltx/swh_ke_oak/tr.d069:trH1.Kontakion.text	Njooni, nyote tumsifu, Yeye aliyesulubiwa kwa ajili yetu.  Kwa kuwa Mariamu alimtazama Msalabani, na kusema: “Ingawaje Ulivumilia Msalaba, Wewe ni Mwanangu na Mungu wangu.”
ltx/swh_ke_oak/tr.d069:trH1.Troparion.text	Ulipo sulubiwa, Ee Kristo, udhalimu uliondolewa, na nguvu za adui zilitetemeshwa; maana sio Malaika wala mwanadamu, aliyetuokoa, bali ni Wewe, Wewe mwenyewe Bwana; utukufu Kwako.
ltx/swh_ke_oak/tr.d069:trH3.Idiomelon1.mode	Sauti 8
ltx/swh_ke_oak/tr.d069:trH3.Idiomelon1.text	Kwa kuogopa watu wa Yudea, rafiki Yako na mwenzio, Petro, Alikukana; na kwa majonzi, alilia akisema: “Usiache machozi yangu yapite bure; kwa kuwa nalisema, nitakuwa mwaminifu, ili hali sikuwa.  Ee Wewe Mwenye huruma.” Kwa namna hii pia, pokea vile vile toba yetu, na kutuhurumia.
ltx/swh_ke_oak/tr.d069:trH3.Idiomelon2.mode	Sauti 8
ltx/swh_ke_oak/tr.d069:trH3.Idiomelon2.text	Chini ya Msalaba Wako wa thamani, Ee Bwana, askari walipo Kudhihaki, majeshi ya Malaika walipigwa kwa mshangao; kwa ajili Yako, uliyevika nchi kwa maua, ulivaa taji la ufidhuli, na uliye vika mbungu kwa mawingu, ulivaa vazi la dhihaka. Maana kwa ajili ya kitendo hiki huruma Yako ilijulikana, Ee Kristo, Huruma kuu, utukufu Kwako.
ltx/swh_ke_oak/tr.d069:trH3.Idiomelon3.mode	Sauti 5
ltx/swh_ke_oak/tr.d069:trH3.Idiomelon3.text	Ulipoletwa Msalabani, Ee Bwana, Ulilia kwa kusema: “ni kwa kazi yangu ipi mnayotaka kunisulubisha, Ee Watu wa Yudea? Kwa ajili ya kuponya walio pooza? Kwa kufufua wafu wenu walio lala? Nalimponya mwanamke aliyetokwa na damu.  Kwa kazi ipi mnataka kuniua kwayo, Ee watu wa Yudea?”  Bali, mtamtazama, Kristo, Mliye mdunga, Enyi waasi wa sheria.
ltx/swh_ke_oak/tr.d069:trH3.Kontakion.text	Njooni, nyote tumsifu, Yeye aliyesulubiwa kwa ajili yetu.  Kwa kuwa Mariamu alimtizama Msalabani, na kusema: “Ingawaje Ulivumilia Msalaba, Wewe ni Mwanangu na Mungu wangu.”
ltx/swh_ke_oak/tr.d069:trH3.Troparion.text	Watu wa Yudea, Ee Bwana, Walikuhukumu, Wewe uliye Uzima wa wote, kwa kifo; wale ulio, wavukisha Bahari ya Shamu kupitia kwa nguvu ya fimbo, Walikupigilia Msalabani; na wale uliowanyonyesha kwa asali kutoka kwenye jiwe, Walikuletea siki.  Bali, kwa kupenda Kwako ulivumilia, ili utuweke huru kutoka kwenye bonde la adui.  Ee Kristo Mungu wetu, utukufu Kwako.
ltx/swh_ke_oak/tr.d069:trH6.Idiomelon1.mode	Sauti 8
ltx/swh_ke_oak/tr.d069:trH6.Idiomelon1.text	Bwana anena hivi kwa watu wa Yudea. “Watu Wangu, Nimewatenda nini, au ni jinsi gani nimewachosheni? Vipofu wenu naliwapa mwanga; wenye ukoma naliwatakasa; aliye kuwa hajiwezi nilimwinua. Ee watu Wangu, nimewatenda nini?Na Mmenilipa nini kama malipo? Badala ya manna, nyongo; badala ya maji, siki; badala ya Kunipenda, mlinipigilia Msalabani.  Siwezi kustahimili tena.  Nitawaita na kuwakusanya pamoja watu wa mataifa, nao watanitukuza pamoja na Baba, na Roho Mtakatifu, nami nitawapa uzima wa milele.”
ltx/swh_ke_oak/tr.d069:trH6.Idiomelon2.mode	Sauti 8
ltx/swh_ke_oak/tr.d069:trH6.Idiomelon2.text	Enyi wana Sheria wa Israeli, Yudea na Mafarisayo; jamii ya Mitume yawalilia wakisema: “Tazama Hekalu, mlilovunja; tazama Mwana kondoo, mliye msulubisha.  Mlimpeana kwa Kaburi, ili hali kwa nguvu Zake Mwenyewe Alifufuka. Msidanganyike; kwa kuwa ni Yeye, Aliye waokoa katika bahari, na kuwalisha katika jangwa.  Yeye ndiye Uzima, na Nuru, na Amani ya dunia.”
ltx/swh_ke_oak/tr.d069:trH6.Idiomelon3.mode	Sauti 5
ltx/swh_ke_oak/tr.d069:trH6.Idiomelon3.text	Njooni, enyi watu mliounganishwa kwa Kristo; tuone yale Yuda Msaliti aliyopanga na hao makasisi wakosa sheria kinyume kwa Mwokozi wetu.  Leo, wamehukumu kufa lile Neno lisilokufa.  Walimkabidhi kwake Pilato na wakamsulubisha pale mahali pa Fuvu la Kichwa; na Mkombozi wetu alipokuwa akiteseka kwa haya yote, alilia na kusema: “Baba, wasamehe dhambi hii, ili kwamba mataifa nao pia wajue kufufuka kwangu kutoka kwa wafu.”
ltx/swh_ke_oak/tr.d069:trH6.Kontakion.text	Njooni, nyote tumsifu, Yeye aliyesulubiwa kwa ajili yetu.  Kwa kuwa Mariamu alimtazama Msalabani, na kusema: “Ingawaje Ulivumilia Msalaba, Wewe ni Mwanangu na Mungu wangu.”
ltx/swh_ke_oak/tr.d069:trH6.Troparion.text	Ee Kristo Mungu wetu, Umefanya miujiza katikati ya dunia; Ulinyosha Mikono yako safi Msalabani, ukikusanya mataifa yote, yalipolia: “Ee Bwana, utukufu Kwako.”
ltx/swh_ke_oak/tr.d069:trH9.Idiomelon1.mode	Sauti 7
ltx/swh_ke_oak/tr.d069:trH9.Idiomelon1.text	Ilikuwa ajabu kutazama Muumba wa mbingu na nchi ametundikwa Msalabani; kuona jua limetiwa giza, mchana umebadilika kuwa usiku, na Nchi inatoa miili ya wafu ikiinuka kutoka makaburini mwao.  Pamoja nao Tunakuabudu.  Ee Bwana, Utuokoe.
ltx/swh_ke_oak/tr.d069:trH9.Idiomelon2.mode	Sauti 2
ltx/swh_ke_oak/tr.d069:trH9.Idiomelon2.text	Wakati wakosa sheria walipokutundika, Bwana wa utukufu, kwenye msalaba, uliwalilia na kusema: “Ni mewachosheni na nini? Au, nimewatenda nini? Alikuwa nani, Mmenilipa aje, niliye wakomboa kutoka matesoni? Na sasa, mmenilipa aje? Maovu, badala ya baraka; badala ya nguzo la moto, mlinipigilia kwa Msalaba; badala ya wingu, Mlinichimbia kaburi; badala ya maji, Mmlinipa siki ninywe.  Tangu leo ni tawaita Mataifa, na Watanitukuza, pamoja na Baba na Roho Mtakatifu.”
ltx/swh_ke_oak/tr.d069:trH9.Idiomelon3.mode	Sauti 6
ltx/swh_ke_oak/tr.d069:trH9.Kontakion.text	Njooni, sisi sote tupate, Kumsifu, Yeye Aliye sulubiwa kwa ajili yetu.  Kwa kuwa Mariamu Alimtazama Msalabani, na kusema: “Ingawaje umestahimili Msalaba, Wewe ni Mwanangu na Mungu wangu.”
ltx/swh_ke_oak/tr.d069:trH9.Troparion.text	Mwizi alipotazama Mwanzilishi wa Uhai umesongwa Msalabani, alisema: “Ikiwa Yeye aliyetundikwa nasi, hakuwa Mungu mwenye mwili, jua halingeficha mwanga wake, wala nchi haingekuwa na tetemeko.  Bali, Bwana mwenye kuvumilia, nikumbuke katika Ufalme Wako.”
ltx/swh_ke_oak/tr.d069:trHR.title	IBADA YA MASAA BORA YA IJUMAA KUU NA TAKATIFU
ltx/swh_ke_oak/tr.d069:trLI.AfterCommunion.text	Unipokee leo, Ee Mwana wa Mungu, kuwa mshiriki wa karamu yako ya fumbo (sakramenti); sitafunua kamwe fumbo lako kwa maadui wako, wala kukubusu kama Yuda; bali kama yule mnyang'anyi nauungama; unikumbuke, "Ee Bwana, katika ufalme wako."
ltx/swh_ke_oak/tr.d069:trLI.CherubicHymn.mode	Sauti ya 6
ltx/swh_ke_oak/tr.d069:trLI.CherubicHymn.title	Badala ya Wimbo wa Waheruvi.
ltx/swh_ke_oak/tr.d069:trLI.CherubicHymnPart1.text	Unipokee leo, Ee Mwana wa Mungu, kuwa mshiriki wa karamu yako ya fumbo ya jioni (sakramenti); sitafunua kamwe fumbo lako kwa maadui wako, wala kukubusu kama Yuda.
ltx/swh_ke_oak/tr.d069:trLI.CherubicHymnPart2.text	Bali kama yule mnyang’anyi naungama; unikumbuke, “Ee Bwana, katika ufalme wako.”
ltx/swh_ke_oak/tr.d069:trLI.CommunionHymn.text	Unipokee leo, Ee Mwana wa Mungu, kuwa mshiriki wa karamu yako ya fumbo (sakramenti); sitafunua kamwe fumbo lako kwa maadui wako, wala kukubusu kama Yuda; bali kama yule mnyang'anyi nauungama; unikumbuke, "Ee Bwana, katika ufalme wako."
ltx/swh_ke_oak/tr.d069:trMA.Antiphon01.title	Antiphoni ya Kwanza.
ltx/swh_ke_oak/tr.d069:trMA.Antiphon011.mode	Sauti ya 8
ltx/swh_ke_oak/tr.d069:trMA.Antiphon011.text	Viongozi wa watu washauriana pamoja, kinyume cha Bwana, na kinyume cha Yeye aliye Pakwa mafuta.
ltx/swh_ke_oak/tr.d069:trMA.Antiphon012.text	Mashtaka yasio na sheria ya tiwa dhidi yangu Bwana; Ee Bwana, Usiniache.
ltx/swh_ke_oak/tr.d069:trMA.Antiphon013.text	Tuakilishe hisia zetu safi mbele ya Kristo, na kama Rafiki zake, Tumpe nafsi zetu.  Tusiwe kama Yuda tujinyonge na shughuli za humu duniani, bali kutoka kilindini cha nafsi zetu, tumlilie tukisema: “Baba Yetu, Uliye Mbinguni, tuokoe na yule mwovu.”
ltx/swh_ke_oak/tr.d069:trMA.Antiphon01T.text	Ee Maria Mzazi Mungu, kama Bikira ulizaa, na ukabaki Bikira; Ee Mama asiyeolewa, Tuombee kwa Kristo Mungu wetu, atuokoe.
ltx/swh_ke_oak/tr.d069:trMA.Antiphon02.title	Antiphoni ya Pili.
ltx/swh_ke_oak/tr.d069:trMA.Antiphon021.mode	Sauti ya 6.
ltx/swh_ke_oak/tr.d069:trMA.Antiphon021.text	Yuda aliharakisha kwenda kwa waandishi wasiojua sheria akisema: “Mtanipa nini, nami nitamkabidhi kwenu?” Na kwa kutoonekana ulisimama katikati ya wale walio shauriana kwa bei ambayo watasikizana Kukuhusu.  Hifadhi nafsi zetu; Wewe, Unayejua mioyo ya wanadamu.
ltx/swh_ke_oak/tr.d069:trMA.Antiphon022.text	Tuhudumie Mungu kwa upendo mkuu, jinsi alivyofanya Maria wakati wa chakula cha jioni; na wala tusikuze ubahili kama Yuda,  ili kwamba tuwe na Kristo Mungu wetu milele.
ltx/swh_ke_oak/tr.d069:trMA.Antiphon02T.text	Usikome, Ee Bikira, Tunakusihi, ambaye pasipo kuelezeka ulimzaa; ili kwamba atuokoe kutokana kwa hatari, wanaokukimbilia; yeye mwenye huruma.
ltx/swh_ke_oak/tr.d069:trMA.Antiphon03.title	Antiphoni ya Tatu.
ltx/swh_ke_oak/tr.d069:trMA.Antiphon031.mode	Sauti ya 2.
ltx/swh_ke_oak/tr.d069:trMA.Antiphon031.text	Kwa sababu ya kumfufua Lazaro, Ee Bwana Mwenye Huruma, watoto wa Wahebrania walilia wakisema: “Hosanna Kwako;”bali Yuda asiyejua sheria hakutaka kuelewa.
ltx/swh_ke_oak/tr.d069:trMA.Antiphon032.text	Wakati wa chakula cha Jioni, Ee Kristo Mungu wetu, ulitabiria Wanafunzi Wako: “Mmoja wenu Atanisaliti;” bali Yuda asiyejua sheria hakutaka kuelewa.
ltx/swh_ke_oak/tr.d069:trMA.Antiphon033.text	Yohana alipokuuliza, ni nani msaliti Wako, Bwana, Ulimtambua kwa mkate; bali Yuda asiyejua sheria hakutaka kuelewa.
ltx/swh_ke_oak/tr.d069:trMA.Antiphon034.text	Kwa vipande thelethini vya fedha, na busu la udanganyifu, Wayahudi walinuia Kukuua, Bwana; bali Yuda asiyejua sheria hakutaka kuelewa.
ltx/swh_ke_oak/tr.d069:trMA.Antiphon035.text	Wakati wa kutawadha, Wewe, Ee Kristo Mungu wetu, ulifundisha Wanafunzi Wako: “Fanyeni hivyo hivyo mlivyoona;” bali Yuda asiyejua sheria hakutaka kuelewa.
ltx/swh_ke_oak/tr.d069:trMA.Antiphon036.text	“Kesheni mkiomba ili msitiwe majaribuni;” Wewe, Mungu wetu, uliwambia Wanafunzi Wako; bali Yuda asiyejua sheria hakutaka kuelewa.
ltx/swh_ke_oak/tr.d069:trMA.Antiphon03Kathisma.mode	Sauti ya 7.
ltx/swh_ke_oak/tr.d069:trMA.Antiphon03Kathisma.text	Ulipokuwa unawalisha Wanafunzi Wako wakati wa chakula cha Jioni, na ukisha tambua mpango wa msaliti Wako, Ulimkemea Yuda, ukitambua ya kuwa alikuwa mkaidi.  Ulitaka lijulikane kwa wote, ya kuwa Ulijipeana kwa kutaka Kwako, ili unyakuwe ulimwengu kutoka kwa adui.  Ee Bwana mvumilivu, utukufu Kwako.
ltx/swh_ke_oak/tr.d069:trMA.Antiphon03T.text	Ee Mama Mungu, okoa watumishi wako kutoka kwa hatari; kwa kuwa, baada ya Mungu, kwako wewe ndiwe kimbilio letu, kama uta usiovunjika na ulinzi wetu.
ltx/swh_ke_oak/tr.d069:trMA.Antiphon04.title	Antiphoni ya Nne.
ltx/swh_ke_oak/tr.d069:trMA.Antiphon041.mode	Sauti ya 5.
ltx/swh_ke_oak/tr.d069:trMA.Antiphon041.text	Siku ya leo Yuda anamkana Bwana na kujichukulia Shetani; kwa kupofushwa na harara ya ubahili, na katika giza akaanguka kutoka kwenye nuru.  Kwa hivyo, atapataje kuona, aliuza Mwenye Nuru kwa fedha thelathini? Bali Yeye aliyestahimili kwa ajili ya ulimwengu umekuwa pambazuko kwetu.  Kwako tunalia tukisema; “Utukufu Kwako, unayeteseka kwa ajili ya,  na pamoja na ubinadamu.”
ltx/swh_ke_oak/tr.d069:trMA.Antiphon042.text	Siku hii ya leo Yuda anajifanya kuwa na umungu, na anajifarakisha kutoka kwa  neema. Alipokuwa Mwanafunzi alikuwa msaliti, na chini ya sura ya urafiki alisitiri uongo.  Yeye, kwa ujinga alikubali vipande thelathini vya fedha kwa upendo wa Bwana, na kuwa mwongozi wa baraza lisilo na sheria.  Bali sisi, walio na Kristo kama wokovu wetu, Tumtukuze.
ltx/swh_ke_oak/tr.d069:trMA.Antiphon043.text	Kama ndugu katika Kristo tujipatie upendo wa undugu.  Tusikose kuwa na huruma kwa jirani yetu, ili tusihukumiwe kama mtumishi asiye na huruma kuthamini fedha, au kutubu kama Yuda pasipo kufaulu.
ltx/swh_ke_oak/tr.d069:trMA.Antiphon04T.text	Vitu vya utukufu vimeonenwa kila mahala dhidi yako; kwa kuwa umemzaa katika kimwili muumba wa vyote, Ee Maria Mzazi Mungu, Aliye sifiwa sana, Bibi arusi asiyeolewa.
ltx/swh_ke_oak/tr.d069:trMA.Antiphon05.title	Antiphoni ya Tano.
ltx/swh_ke_oak/tr.d069:trMA.Antiphon051.mode	Sauti ya 6.
ltx/swh_ke_oak/tr.d069:trMA.Antiphon051.text	Mwanafunzi wa Mwalimu alipiga bei, na kumuuza Bwana kwa vipande thelathini vya fedha.  Kwa busu la udanganyifu, Akamtoa kwa kifo mikononi ya wasiojua sheria.
ltx/swh_ke_oak/tr.d069:trMA.Antiphon052.text	Leo hii Muumba wa Mbingu na nchi aliwaambia wanafunzi Wake: “Saa imefika, na Yuda, Aliyenisaliti, yu karibu.  Mtu ye yeto asije Akanizuia, Kuniona Msalabani katikati ya wezi wawili; kwa kuwa kama Mwanadamu nateswa, na kama Mpenda wanadamu, Naokoa wale waniaminio.”
ltx/swh_ke_oak/tr.d069:trMA.Antiphon05T.text	Ee Bikira, ambaye nyakati za mwisho pasipo kuelezeka ulishika mimba na kumzaa Muumba wako, okoa wale wanao kutukuza.
ltx/swh_ke_oak/tr.d069:trMA.Antiphon06.title	Antiphoni ya Sita.
ltx/swh_ke_oak/tr.d069:trMA.Antiphon061.mode	Sauti ya 7.
ltx/swh_ke_oak/tr.d069:trMA.Antiphon061.text	Siku ya leo, Yuda yu macho jinsi atakavyo mkabidhi Bwana, Mwokozi wa ulimwengu kabla ya milele, Ambaye kwa mikate mitano aliwashibisha mkutano.  Leo hii, mwasi anamkana Mwalimu; akifanyika Mwanafunzi, anamsaliti Mwalimu.  Alimuuza kwa fedha, Yule, ambaye hushibisha watu kwa manna.
ltx/swh_ke_oak/tr.d069:trMA.Antiphon062.text	Leo hii, watu wa Yudea wanamsulubisha Bwana Msalabani, Aliye kuwa amegawanyisha bahari kwa fimbo, akiwaongoza jangwani.  Leo hii, wanamchoma upande Wake kwa mkuki, Yule, kwa ajili yao aliwapiga Wamisiri kwa tauni; walimpa nyongo anywe, Yeye aliyewainulia chakula cha maana.
ltx/swh_ke_oak/tr.d069:trMA.Antiphon063.text	Ee Bwana, ulipokuja kwa Harara Yako kwa kupenda, Uliwajulisha Wanafunzi Wako; “Kama hamngekesha nami kwa lisaa limoja, mngeniahidi vipi ya kuwa mngekufa pamoja nami? Tazama Yuda, jinsi asivyosinzia, bali anaharakisha Kunisaliti kwa maadui? Inukeni, mkaoombe, ili mstiwe majaribuni, Mnaponiona Msalabani.” Ee Wewe mvumilivu, utukufu Kwako.
ltx/swh_ke_oak/tr.d069:trMA.Antiphon06Kathisma.mode	Sauti ya 7.
ltx/swh_ke_oak/tr.d069:trMA.Antiphon06Kathisma.text	Jinsi gani ulivyofanywa, Ee Yuda, kwa kumsaliti Mwokozi? Je Alikutenga na jamii ya Mitume? Je Alikunyima neema ya uponyaji? Je, alikutenga wakati alipokuwa akiwatawadha wengine? Wewe! umekuwaje msahaulifu wa baraka nyingi! Umehukumiwa kwa kutokuwa na shukrani, kwa kustahimi ukarimu Wake na huruma kuu ikitangazwa.
ltx/swh_ke_oak/tr.d069:trMA.Antiphon06T.text	Salamu! Ee Mzazi Mungu! kwa kuwa ulichukua ndani ya tumbo lako, Yeye, Ambaye Mbingu haziwezi kuchukua.  Salamu Ee Bikira! Tangazo la Manabii, kupitia kwako Emmanueli amejidhahiri kwetu. Salamu! Ee Mamake Yesu, Mungu wetu.
ltx/swh_ke_oak/tr.d069:trMA.Antiphon07.title	Antiphoni ya Saba.
ltx/swh_ke_oak/tr.d069:trMA.Antiphon071.mode	Sauti ya 8.
ltx/swh_ke_oak/tr.d069:trMA.Antiphon071.text	Kwa kuwaruhusu watu wasiojua sheria Kukushika, Ee Bwana, ulipata kutangaza ya kuwa:  “Hata utapiga mchungaji na kutawanyisha kondoo kumi na mbili, Wanafunzi Wangu, hata ninge amuru jeshi kuu la Malaika upande Wangu; bali nalivumilia, ili yasio julikana na vitu vya siri, ambavyo naliwaonyesha maishani mwangu kupitia kwa manabii, vitimizwe.” Ee Bwana, utukufu Kwako.
ltx/swh_ke_oak/tr.d069:trMA.Antiphon072.text	Petro baada ya kukukana mara tatu, hapo hapo akakumbuka maneno Uliyo yasema kwake, hatimae alikuletea machozi ya toba, akisema: “Mungu ni hurumie, na kuniokoa.”
ltx/swh_ke_oak/tr.d069:trMA.Antiphon07T.text	Sisi sote tupate kumsifu Bikira Mtakatifu, kama lango la wokovu; kama paradiso ya kufurahisha; kama wingu la nuru isiyoisha, na kusema, “Salamu!”
ltx/swh_ke_oak/tr.d069:trMA.Antiphon08.title	Antiphoni ya Nane.
ltx/swh_ke_oak/tr.d069:trMA.Antiphon081.mode	Sauti ya 2.
ltx/swh_ke_oak/tr.d069:trMA.Antiphon081.text	Semeni enyi wasio jua sheria; mliyasikia yapi kwa mwokozi wetu? Je hakufundishia mafundisho ya Sheria na Manabii? Imekuwaje basi, mkakaa baraza mkalikabidhi Neno la Mungu kwa Pilato, Aliyekuja kutoka kwa Mungu, Kukomboa nafsi zetu?
ltx/swh_ke_oak/tr.d069:trMA.Antiphon082.text	“Asulubiwe!” walilia wakisema, yeye aliyewatolea Vipawa vya Neema.  Mwenye  haki, aliomba kumpokea mwovu, badala ya Mfadhili; bali Wewe, Ee Kristo, ulinyamaza, ukistahimili ufidhuli wao, ili kwamba upate kuteswa, na kutuokoa, kama Bwana mwenye Upendo.
ltx/swh_ke_oak/tr.d069:trMA.Antiphon08T.text	Kwa kuwa hatuna ujasiri kwa ajili ya vitendo vyetu, Ee Bikira, Mama Mungu, tuombee Kwake, aliyezaliwa nawe; kwa maombi ya Mama ya faa sana, kwa ajili ya Bwana.  Binti Uliye Mtakatifu, usidharau maombi yetu sisi wenye dhambi; kwa kuwa Ndiwe mwenye huruma na uwezo wa kuokoa; na Aliyestahimili mateso kwa ajili yetu.
ltx/swh_ke_oak/tr.d069:trMA.Antiphon09.title	Antiphoni ya Tisa.
ltx/swh_ke_oak/tr.d069:trMA.Antiphon091.mode	Sauti ya 3.
ltx/swh_ke_oak/tr.d069:trMA.Antiphon091.text	Walitenga vipande thelathini vya fedha kama bei ya Yule Asiye na bei, ambaye Kwake, wana wa Israeli walikuwa wametenga bei.  Kesheni mkiomba, ili mstiwe majaribuni! Roho i radhi, bali mwili dhaifu; kwa hivyo, kesheni!
ltx/swh_ke_oak/tr.d069:trMA.Antiphon092.text	Walinipa nyongo, na nilipokuwa na kiu walinipa siki ninywe; bali Wewe, Ee Bwana, niinuwe mara tena, na nita walipa.
ltx/swh_ke_oak/tr.d069:trMA.Antiphon09Kathisma.mode	Sauti ya 8.
ltx/swh_ke_oak/tr.d069:trMA.Antiphon09Kathisma.text	Itakuwaje Yuda, aliyekuwa Mwanafunzi Wako, atafakari Kukusaliti? Msaliti na mtenda maovu kwa udanganyifu akachovya Nawe; na kuenda kwa makuhani, alisema: “Mtanipa nini nami nita mkabidhi,  kwenu, Yeye aliyetunga sheria na kuharibu Sabbato?” Ee Bwana Mstahimilivu, utukufu Kwako.
ltx/swh_ke_oak/tr.d069:trMA.Antiphon09T.text	Sisi, Wayahudi, tunakusifu, Ee Mama Mungu msafi, kwa kuwa ulimzaa Kristo, Mungu wetu, Ambaye, kupitia kwake, aliweka wanadamu kutoka kwa laana.
ltx/swh_ke_oak/tr.d069:trMA.Antiphon10.title	Antiphoni ya kumi.
ltx/swh_ke_oak/tr.d069:trMA.Antiphon101.mode	Sauti ya 6.
ltx/swh_ke_oak/tr.d069:trMA.Antiphon101.text	Yeye Aliyejivika nuru kama vazi, ulisimama uchi hukumuni; na kupokea mapigo kwenye shavu kutoka kwenye mikono Uliyoifanya.  Vile wale wasiona sheria walipokupigilia misumari Msalabani Bwana wa utukufu, papo hapo pasia la hekalu lilipasuka, jua likatiwa giza, kwa kushindwa tamasha ya Mungu ilivyotukanwa, mbele ya wingu lote latetemeka.  Wacha tumwabudu.
ltx/swh_ke_oak/tr.d069:trMA.Antiphon102.text	Mwanafunzi Alimkana; ila mnyang’anyi alisema ghafula; “Nikumbuke, Ee Bwana, katika Ufalme Wako.”
ltx/swh_ke_oak/tr.d069:trMA.Antiphon10T.text	Kidhii amani kwa ulimwengu, Ee Bwana Mwenye Huruma; Wewe, Uliye kwa ajili ya watumishi Wako, kwa wema wako ulichukuwa mwili kutoka kwa Bikira.  Kwa hivyo, kwa sauti moja tunaimba tukimsifu, kama Bwana Mwenye upendo.
ltx/swh_ke_oak/tr.d069:trMA.Antiphon11.title	Antiphoni ya kumi na moja.
ltx/swh_ke_oak/tr.d069:trMA.Antiphon111.mode	Sauti ya 6.
ltx/swh_ke_oak/tr.d069:trMA.Antiphon111.text	Kwa kurudisha fadhili Zako, Ee Kristo, ulizotoa kwa uzao wa Wahebrania, walikuhukumu kusulibishwa, wakikupa siki iliyochanganywa nyongo ili unywe. Warudishie, Ee Bwana kulingana na vitendo vyao, kwa kuwa hawakufahamu hisani Yako.
ltx/swh_ke_oak/tr.d069:trMA.Antiphon112.text	Kwa kusalitiwa kwako, Ee Kristo, uzao wa Wahebrania haukuridhika, bali walitikisa vichwa vyao, wakikufanyia mizaha na kukudhihaki.  Warudishie, Ee Bwana, kulingana na vitendo vyao, walivyovifanya dhidi yako.
ltx/swh_ke_oak/tr.d069:trMA.Antiphon113.text	Sio nchi ilivyotetemeka, au mawe yalipo pasuka; sio pasia la hekalu lililo pasuka, au kufufuka kwa wafu kutoka kaburini havikuwasadikisha Wahebrania. Bali Wewe, warudishie, kulingana na vitendo vyao, walivyovifanya dhidi yako.
ltx/swh_ke_oak/tr.d069:trMA.Antiphon11T.text	Tumejua Mungu akipokea mwili kutoka kwako, Ee Bikira Mzazi Mungu.  Wewe uliye bikira pekee, wewe uliye mbarikiwa pekee; kwa hivyo, tunakusifu, tunakuadhimisha pasipo mwisho.
ltx/swh_ke_oak/tr.d069:trMA.Antiphon12.title	Antiphoni ya kumi na mbili.
ltx/swh_ke_oak/tr.d069:trMA.Antiphon121.mode	Sauti ya 8.
ltx/swh_ke_oak/tr.d069:trMA.Antiphon121.text	Hivi ndivyo asema Bwana kwa watu wa Yudea: “Ee watu Wangu, nimewatenda nini, au nime wachosheni na nini? Kwa vipofu wenu naliwapa kuona; wenye ukoma naliwatakasa; waliopooza nawainua.  Ee watu Wangu; nimewatendea nini, na mmenilipa aje? Badala ya manna, nyongo; badala ya maji, siki; badala ya kunipenda, mlinipigilia Msalabani.  Sitastahimili  tena; Nita leta nchi Kwangu, na watanitukuza, pamoja na Baba, na Mwana, na Roho Mtakatifu; nami nita wakidhi maisha ya milele.”
ltx/swh_ke_oak/tr.d069:trMA.Antiphon122.text	Siku hii ya leo pasia la Hekalu limepasuliwa mara pili, kama lawama kwa wasio jua sheria; na jua likaficha mwangaza wake, likitazama Bwana Msalabani.
ltx/swh_ke_oak/tr.d069:trMA.Antiphon123.text	Jamii ya Mitume wanakuita, “Ee Mtoa Sheria wa Israeli, watu wa Yudea, na Mafarisayo; tazama hekalu, mlilo bomoa; tazama Mwana kondoo, mliye msulubuisha.  Mmemkabidhi kwenye kaburi, bali kwa nguvu Zake mwenyewe Amefufuka.  Msijidanganye, Ee watu wa Yudea, kwa kuwa baharini aliokoa, pia jangwani Aliwalisha.   Yeye ndiye uzima, na Nuru, na Amani ya ulimwengu.”
ltx/swh_ke_oak/tr.d069:trMA.Antiphon12Kathisma.mode	Sauti ya 8.
ltx/swh_ke_oak/tr.d069:trMA.Antiphon12Kathisma.text	Uliposimama mbele ya Kayafa, Ee Mungu, ingawaje ulihukumiwa, Ulikabidhiwa Pilato, Majeshi ya Mbinguni yalishangazwa kwa woga.  Baadaye ukainuliwa juu kwa Msalaba katikati ya wezi wawili, Wewe usiye na dhambi, ulihesabiwa pamoja na wenye dhambi, ili upate kuokoa mwanadamu.  Ee Bwana Mstahimilivu, utukufu Kwako.
ltx/swh_ke_oak/tr.d069:trMA.Antiphon12T.text	Salamu! Lango la Mfalme wa Utukufu, kupitia kwako, yeye tu Aliye Mkuu amepitia, na kuacha limezibwa, kwa ajili ya wokovu wa nafsi.
ltx/swh_ke_oak/tr.d069:trMA.Antiphon13.title	Antiphoni ya kumi na Tatu.
ltx/swh_ke_oak/tr.d069:trMA.Antiphon131.mode	Sauti ya 6.
ltx/swh_ke_oak/tr.d069:trMA.Antiphon131.text	Kusanyiko la watu wa Yudea walitaka kwa Pilato ya kuwa wewe, Ee Bwana, usulibiwe; na pasipo hatia Kwako, walimwachilia Baraba, mfungwa, na kukuhumu Wewe mwenye Haki, wakichukuwa wao wenyewe damu ya makosa.  Warudishie, Ee Bwana, kulingana na matendo yao; kwa kuwa walipanga maovu juu Yako.
ltx/swh_ke_oak/tr.d069:trMA.Antiphon132.text	Makuhani walikupiga kwa makofi yao, na kukupatia na siki ili unywe, ambaye mbele zako vitu vyote vyapagawa na kutetemeka, na kila ulimi wakusifu.  Kama Mpenda wanadamu, alistahimili mateso ya kila kitu, alitaka kutuokoa kutoka kwenye dhambi zetu kwa damu Yake.
ltx/swh_ke_oak/tr.d069:trMA.Antiphon13T.text	Ee Mama Mungu! Kwa neno, pasipokuelezeka ulizaa Neno, Muumba Mwenyewe. Tuombee Kwake, ili kwamba aweze kuokoa nafsi zetu.
ltx/swh_ke_oak/tr.d069:trMA.Antiphon14.title	Antiphoni ya kumi na Nne.
ltx/swh_ke_oak/tr.d069:trMA.Antiphon141.mode	Sauti ya 8.
ltx/swh_ke_oak/tr.d069:trMA.Antiphon141.text	Ee Bwana, uliyechukua mwizi kama msafiri mwenzako, ambaye mikono yake imechafuliwa kwa damu, tunakuomba tuhesabiwe pamoja naye, kama Bwana mwema na mwenye Upendo.
ltx/swh_ke_oak/tr.d069:trMA.Antiphon142.text	Mwizi msalabani alilia kwa sauti ya chini, alipata kuwa na imani kuu.  Kwa ghafula aliokolewa, na kuwa wa kwanza kufungua Malango ya Paradiso, aliingia.  Ee Bwana, Uliye kubali toba yake, utukufu Kwako.
ltx/swh_ke_oak/tr.d069:trMA.Antiphon14T.text	Salamu kwako, ambaye kwake Malaika tulipata furaha ya ulimwengu.  Salamu kwako, uliyemzaa Muumba na Bwana wako.  Salamu kwako, uliye patikana kuwa wa thamani kuwa Mamake Kristo, Mungu wetu.
ltx/swh_ke_oak/tr.d069:trMA.Antiphon15.title	Antifoni ya 15
ltx/swh_ke_oak/tr.d069:trMA.Antiphon151.mode	Sauti ya 6
ltx/swh_ke_oak/tr.d069:trMA.Antiphon1511.text	Leo amesulubishwa Msalabani, Yeye afanyaye dunia kuelea juu ya maji.
ltx/swh_ke_oak/tr.d069:trMA.Antiphon1512.text	Anavalishwa taji ya miiba, Yeye aliye Mfalme wa malaika.
ltx/swh_ke_oak/tr.d069:trMA.Antiphon1513.text	Yeye, anayefunga mbingu na mawingu, anavalishwa jora zambarau la kifalme kwa kuchekelewa.
ltx/swh_ke_oak/tr.d069:trMA.Antiphon1514.text	Yeye, aliye muwachilia Adamu kule Yorodani, amepokea mijeledi.
ltx/swh_ke_oak/tr.d069:trMA.Antiphon1515.text	Alipigiliwa na misumari, Yeye aliye Bwana harusi wa kanisa.
ltx/swh_ke_oak/tr.d069:trMA.Antiphon1516.text	Alidungwa mkuki, Yeye aliye Mwana wa Bikira.
ltx/swh_ke_oak/tr.d069:trMA.Antiphon1517.text	Tuna tukuza mateso Yako, Ee Kristo.
ltx/swh_ke_oak/tr.d069:trMA.Antiphon1518.text	Tuonyeshe pia, ufufuo wako wa utukufu.
ltx/swh_ke_oak/tr.d069:trMA.Antiphon152.mode	Sauti ya 6
ltx/swh_ke_oak/tr.d069:trMA.Antiphon152.text	Kristo, Mungu wetu, Aliye Pasaka yetu, ametolewa kama dhabihu kwetu; kwa hivyo tusifanye sherehe kama watu wa Yudea, bali tujitakase sisi wenyewe kutoka kwa kila uchafu, na kwa uaminifu tumsihi: “Inuka, Ee Bwana, na katika huruma Yako, utuokoe.”
ltx/swh_ke_oak/tr.d069:trMA.Antiphon153.text	Msalaba Wako, Ee Bwana, ni uzima na ufufuo kwa watu Wako; na wanao uamini, tunakusifu Wewe, Bwana wetu Uliye sulibiwa.  Utuhurumie.
ltx/swh_ke_oak/tr.d069:trMA.Antiphon15Kathisma.mode	Sauti ya 8
ltx/swh_ke_oak/tr.d069:trMA.Antiphon15Kathisma.text	Ulitufidia kutokana na laana ya Sheria kwa Damu Yako ya Thamani; Uliyo imwaga milele kwa wanadamu kwa kutundikwa Msalabani na kuchomwa kwa mkuki. Ee Mwokozi wetu, utukufu kwako.
ltx/swh_ke_oak/tr.d069:trMA.Antiphon15T.text	Ulipoonekana ukitundikwa Msalabani, Ee Kristo, Mamako alilia kwa sauti: “Maajabu gani ya fumbo ninayo yaona, Mwanangu? imekuwaje?Mtunga sheria ya Uzima, kwa Mwili wako unatundikwa,  unakufa kwenye Msalaba?”
ltx/swh_ke_oak/tr.d069:trMA.Apolytikion1.mode	Sauti ya 4.
ltx/swh_ke_oak/tr.d069:trMA.Apolytikion1.text	Ulitutolea fidia kutoka kwa laana ya Sheria, Kwa Damu Yako ya Thamani; uliangazia wanadamu uzima, ukikongomewa Msalabani na kuchipuliwa na mkuki.  Ee Mwokozi wetu, utukufu Kwako.
ltx/swh_ke_oak/tr.d069:trMA.AposBoth.mode	Sauti ya 8
ltx/swh_ke_oak/tr.d069:trMA.AposBoth.text	Tayari karamu ya hukumu isha chovya na hakimu wasio stahili, na Yesu anashtakiwa na kutiwa hukumu ya Msalaba.  Viumbe vyote vyaumia, Kuona Bwana Msalabani. Bali Wewe, Uliye teswa Mwilini kwa ajili yangu, Bwana mwenye rehema, utukufu Kwako.
ltx/swh_ke_oak/tr.d069:trMA.AposGlory.mode	Sauti ya 8
ltx/swh_ke_oak/tr.d069:trMA.AposGlory.text	Ee Bwana, ulipoinuliwa juu ya Msalaba, viumbe vyote vilitiwa hofu na tetemeko.  Huku ruhusu ardhi kuwameza hao, walio Kukusulibisha, bali uliruhusu Mauti kuwaachilia wafungwa kwa ajili ya kuzaliwa kwa mwili mpya.  Ee Hakimu wa wahai na wafu, Ulikuja kukidhii uzima, na wala si kifo.  Wewe Bwana mwenye huruma nyingi, utukufu Kwako.
ltx/swh_ke_oak/tr.d069:trMA.Aposticha1.mode	Sauti ya 1
ltx/swh_ke_oak/tr.d069:trMA.Aposticha1.text	Viumbe vyote vilibadilika kwa hofu, Vilipo Kuona, Ee Kristo, ukining’inia Msalabani; jua likatiwa giza, na misingi ya ulimwengu ilitingizika.  Vitu vyote viliteseka pamoja na Muumba wa vyote.  Ee Bwana, Ulistahimili kwa kwa ajili yetu, utukufu Kwako.
ltx/swh_ke_oak/tr.d069:trMA.Aposticha2.text	Watu waovu na wasiojua sheria, ni kwa nini wana wanawaza ubatili? Ni kwa nini wanamhukumu kwa kifo Uzima wa wote? Ee kushangaza kwa ajabu! Muumba wa ulimwengu anasalitiwa mikononi mwa wasio jua sheria; na Yeye, Aliye na huruma, anainuliwa Msalabani, ili kwamba Apate kuleta huru kwa wale, walio katika mateka ya Mauti, waliao: “Ee Bwana mvumilivu, utukufu Kwako.”
ltx/swh_ke_oak/tr.d069:trMA.Aposticha3.mode	Sauti ya 2
ltx/swh_ke_oak/tr.d069:trMA.Aposticha3.text	Leo hii Bikira asiye na Waa alikutazama, Ee Neno la Mungu, likining’inia Msalabani, akiomboleza ndani yake, na kwa uchungu akichomwa moyoni, aliugua kwa majonzi kutoka ndani ya nafsi yake. Akiwa amechoka kwa kujipiga kwenye kifua chake, nywele zikichafuka, alipiga yowe kwa kelele: Ole wangu! Mwanangu wa U Mungu! Ole wangu! Nuru ya ulimwengu! Kwa nini Mwana kondoo wa Mungu, umefifia machoni pangu?” Kwa sababu hii, jeshi la malaika wa mbinguni walishikwa na hofu, wakilia: Ee Bwana asiye eleweka, utukufu kwako.”
ltx/swh_ke_oak/tr.d069:trMA.Aposticha4.mode	Sauti ya 2
ltx/swh_ke_oak/tr.d069:trMA.Aposticha4.text	Kukuona ukining’inia Msalabani Ee Kristo, Mungu, na Muumbaji wa vyote, Yeye kama Bikira aliyekuzaa, alilia kwa uchungu: “Ee mwanangu, ubora wa umbo Lako  umechwea wapi? Siwezi nikastahimili Kukuona umesulubiwa pasipo hatia; harakisha basi na kuinuka, ili nami pia nipate kutazama Kufufuka kwako kutoka kwenye mauti siku ya tatu.”
ltx/swh_ke_oak/tr.d069:trMA.Beatitudes01.mode	Sauti 4.
ltx/swh_ke_oak/tr.d069:trMA.Beatitudes01.text	Kwa ajili ya mti, Adamu alijifarikisha na Paradiso; kwa ajili ya mti wa Msalaba, mwizi aliahidiwa Paradiso; wa kwanza, kwa kuonja, akaasi amri za Muumba; baadaye, aliye sulibiwa Nawe, alikiri, na kukubaliwa katika jamii ya Mungu. Ee Mwokozi; tukumbuke nasi, katika Ufalme Wako.
ltx/swh_ke_oak/tr.d069:trMA.Beatitudes02.text	Waasi wa sheria walinunua Mwanzilishi wa sheria kutoka kwa Mtume.  Na kumleta kwa Pilato kama mvunja sheria, wakisema “Asulibiwe, yeye aliye wapa manna katika jangwa!” bali sisi, tukiiga mwizi mwenye haki, alisema kwa imani: “Tukumbuke nasi, Ee Mwokozi katika Ufalme Wako.”
ltx/swh_ke_oak/tr.d069:trMA.Beatitudes03.text	Mkutano wa Wayudea, wapotovu genge la wauaji, walimpigia kelele Pilato, wakisema, Kristo asulibiwe asiye na hatia, na kuomba wafunguliwe Baraba badala yake.  Bali tunanena maneno ya shukrani kama yule mwizi: “Tukumbuke nasi, Ee Mwokozi, katika Ufalme Wako.”
ltx/swh_ke_oak/tr.d069:trMA.Beatitudes04.text	Wewe mpaji wa uhai, Ee Kristo, ubavuni mwako, mwa furika kama chemichemi kutoka Edeni, akinyunyizia Kanisa Lako, na kulifanya liwe paradiso iishio; na hata kugawanyisha habari njema kwa vipengele vinne vya Injili, chanzo cha maji, inayo nyunyiza ulimwengu, ikiburudisha viumbe, na kufundisha wasio Wayahudi kusujudu Ufalme Wako.
ltx/swh_ke_oak/tr.d069:trMA.Beatitudes05.text	Ulisulubishwa Ee Kristo, kwa ajili yangu, ili ufanyike kuwa chanzo cha msamaha.  Ubavuni mwako ulichomwa na mkuki, ili kwamba ukafanye visima vya uzima vitiririke kwangu. Ulikazwa kwa misumari, ili kwamba nipate kujua maana ya Harara Yako na uzuri wa Nguvu Zako, na kukulilia kwa kusema: “Ee Kristo Mpaji wa uhai, utukufu kwa Msalaba Wako na Harara, Ee Mwokozi.”
ltx/swh_ke_oak/tr.d069:trMA.Beatitudes06.text	Viumbe vyote, Ee Kristo, tazama Kusulibiwa Kwako, kunatetemeka.  Misingi ya dunia ilitingizika kwa hofu ya nguvu Zako;  nuru ya anga ilienda mafichoni; pasia la Hekalu lilipasuka; mwimba ikatingisika; na mawe zikapasuka, mwizi kwa kuamini alilia pamoja nawe akisema, Kwako: “Ee Mwokozi tukumbuke.”
ltx/swh_ke_oak/tr.d069:trMA.Beatitudes07.text	Ee Bwana, Msalabani Ulipasua jora la shtaka dhidi yetu, na kwa kuhesabiwa kati ya wafu, ulifunga uongozi huko, ukawakomboa wote kutokana na kifo na kwa njia hiyo tumeangaziwa. Ee Bwana Mwenye huruma, tunakulilia, “tukumbuke hata nasi katika ufalme wako Ee Mwokozi.”
ltx/swh_ke_oak/tr.d069:trMA.Beatitudes08.text	Ee Kristo Mungu wetu, Uliye inuliwa Msalabani, kama Mungu  ukafungua kamba za mauti, na kuharibu jora la shtaka dhidi, kidhii pia sisi, Ee Bwana, tunao Kuabudu katika imani, toba ya mwizi, tunapokulilia: Tukumbuke pia sisi, Ee Mwokozi, katika Ufalme Wako.”
ltx/swh_ke_oak/tr.d069:trMA.BeatitudesT.text	Tunakutolea kwa maombezi, Ee Kristo, Mamako, Bikira kamili, ambaye, pasipo mbegu ali Kuzaa kimwili, na kubaki bila uharibifu baada ya kuzaa kwake, ili kwamba Upate kukidhii msamaha wa makosa kwao, wanaokulilia wakisema: “Tukumbuke nasi pia, Ee Mwokozi, katika Ufalme Wako.”
ltx/swh_ke_oak/tr.d069:trMA.BeatitudesT.verse	Sasa na sikuzote hata milele na milele. Amina.
ltx/swh_ke_oak/tr.d069:trMA.BeatitudesTr.text	Njooni, enyi nyote waumini, kwa kustahili na kwa akili moja tuombe, tutukuze Mungu mmoja katika Utatu; Baba, Mwana, na Roho Mtakatifu; wa milele pasipo kuchanganyika, mmoja, asiyegawanyika, na asiye haribika, ambaye kupitia kwake, tulikombolewa kutoka kwa moto wa kuadhibiwa.
ltx/swh_ke_oak/tr.d069:trMA.BeatitudesTr.verse	Utukufu kwa Baba na Mwana na Roho
ltx/swh_ke_oak/tr.d069:trMA.Exaposteilarion1.mode	Sauti ya 3.
ltx/swh_ke_oak/tr.d069:trMA.Exaposteilarion1.text	Wewe, Ee Bwana, ambaye kwa siku hiyo hiyo ulimstahilisha mwizi kuingia Paradiso, niangazie nami pia kwa Msalaba, na kuniokoa.
ltx/swh_ke_oak/tr.d069:trMA.Kontakion1.mode	Sauti ya 8.
ltx/swh_ke_oak/tr.d069:trMA.Kontakion1.text	Njooni, sisi sote tumsifu, yeye aliye sulubiwa kwa ajili yetu.  Kwa kuwa Maria alimtazama kwenye msalaba na kusema: “Hata ukivumilia msalaba, wewe ni mwanangu na Mungu wangu.”
ltx/swh_ke_oak/tr.d069:trMA.Lauds1.mode	Sauti ya 3
ltx/swh_ke_oak/tr.d069:trMA.Lauds1.text	“Israeli, Mwanangu mtangulizi, alitenda dhambi mbili; Aliniacha, mimi chanzo cha maji ya Uzima, na kujichimbia kisima kilichovunjika; na akunitundika kwenye Mti, na kuomba Baraba afunguliwe.  Mbingu zilichukizwa kwa kitendo hiki, na jua likaficha miale yake.  Lakini wewe, Ee Israeli, hukuaibika, na Kunikabidhi kwa kifo.  Wasamehe, Ee Baba Mtakatifu, kwa kuwa hawa jui, walilolitenda.”
ltx/swh_ke_oak/tr.d069:trMA.Lauds2.mode	Sauti ya 3
ltx/swh_ke_oak/tr.d069:trMA.Lauds2.text	Kila kiungo cha Mwili Wako Mtakatifu kilistahimili dhuluma kwa ajili yetu.  Kichwa Chako, miiba; Kipaji Chako, kutemewa mate; Shavu Zako, vipigo; Mdomo Wako, kuonja siki; Masio Yako, ukufuru; Mgongo Wako, kupigwa mijeledi; Mikono yako, mwanzi; Mwili Wako wote, ulinyoshwa juu ya Msalaba; Viuongo Vyako vilipigwa na misumari; Ubavuni Mwako, ulichubuliwa.  Ee Mwokozi mwenye Uweza, Ambaye kwa huruma Yako ulistahimili maumivu kwa ajili yetu, na kutuweka huru kutoka taabuni, ukiwa umetuinua, utuhurumie.
ltx/swh_ke_oak/tr.d069:trMA.Lauds3.mode	Sauti ya 3
ltx/swh_ke_oak/tr.d069:trMA.Lauds3.text	Viumbe vyote vinatetemeka, Ee Kristo, Kukuona unasulubiwa.  Kwa hofu ya mamlaka yako, misingi ya nchi ilitikisika.  Kwa kuwa, kwa kuinuliwa leo, kizazi cha Wahebrania kilipotea, pasia la Hekalu likapasuka vipande viwili, makaburi yakafunuliwa, wafu wakainuka kutoka makaburini.  Akida alitetemeka alipoona miujiza, na Mamako akiwa amesimama karibu, aliomboleza kwa kilio cha mama: “Vipi nisilie, na kupiga moyoni mwangu, Kukuona uchi, kama mwanadamu aliye hukumiwa ukining’inia kwenye mti?” Ee Bwana Uliye sulubiwa, na kuzikwa, na kufufuka kwenye mauti, utukufu kwako.
ltx/swh_ke_oak/tr.d069:trMA.LaudsBoth.text	“Naliwapa mgongo Wangu kujeruhiwa, na Sikuficha uso Wangu kutemewa mate; Nalisimama mbele ya kiti cha hukumu cha Pilato, na kuvumilia Msalaba, kwa ajili ya wokovu wa ulimwengu”.
ltx/swh_ke_oak/tr.d069:trMA.LaudsGlory.mode	Sauti ya 6
ltx/swh_ke_oak/tr.d069:trMA.LaudsGlory.text	“Walinivua mimi Mavazi, na kunivalisha kanzu nyekundu; wakaniwekea Kwenye Kichwa Changu taji la miiba, na kunipa mwanzi Mkononi Mwangu wa kuume, ili nipate kuwavunjavunja vipande vipande kama vyombo vya mfinyanzi”.
ltx/swh_ke_oak/tr.d069:trMA.Ode5C11.text	Kwa miguu iliyooshwa, na vile vile kujitakasa kwa kushiriki katika Fumbo Takatifu, watumishi Wako, Ee Kristo, waja kutoka Zayuni mlimani mkuu wa Mizeituni, na kukusifu, Ee Bwana wa huruma.
ltx/swh_ke_oak/tr.d069:trMA.Ode5C12.text	Ulisema: “Tazama, marafiki zangu, ya kuwa msisumbuke; kwa sasa, wakati umefika Kwangu kukabidhiwa kwa kuchinjwa na watu wasio jua sheria.  Nyote mtatawanyika, na Kunikana; bali wale nitakao wakusanya pamoja, watahubiri Mungu wa upendo.”
ltx/swh_ke_oak/tr.d069:trMA.Ode5C1H.mode	Sauti ya 6.
ltx/swh_ke_oak/tr.d069:trMA.Ode5C1H.ode	Odhii ya Tano.
ltx/swh_ke_oak/tr.d069:trMA.Ode5C1H.text	Asubuhi mapema ninakujia, Ee Neno la Mungu, ambaye, kupitia kwa huruma yako kwa mwanadamu ulijitoa kabisa bila kubadilika, na kujitoa kwa harara kwa ukavu.  Ee Bwana wa huruma, kidhii amani kwangu.
ltx/swh_ke_oak/tr.d069:trMA.Ode5K.text	Asubuhi mapema ninakujia, Ee Neno la Mungu, ambaye, kupitia kwa huruma yako kwa mwanadamu ulijitoa kabisa bila kubadilika, na kujitoa kwa harara kwa ukavu. Ee Bwana wa huruma, kidhii amani kwangu,
ltx/swh_ke_oak/tr.d069:trMA.Ode8C11.text	“Vueni usingizi kutoka machoni mwenu, Ee Wanafunzi Wangu”, Yesu akasema. “Kesheni kwa maombi, ili mstiwe majaribuni; haswa wewe Simoni, kwa ajili majaribu huja kwa hodari.  Ee Petro, Nijue, Ninaye barikiwa na viumbe vyote, vikinitukuza milele.”
ltx/swh_ke_oak/tr.d069:trMA.Ode8C12.text	“Ee Bwana,” Petro akalia, “neno mbaya halitanitoka kinywani mwangu.  Hata kama wote watakukana, nitakufa Nawe.  Sio kwa nyama wala damu, bali Babako Aliyenifunulia; Wewe, Ambaye viumbe vyote nina kubariki, na vikikutukuza milele.
ltx/swh_ke_oak/tr.d069:trMA.Ode8C13.text	Vilindi vyote vya hekima ya  utukufu na elimu, haujavitafuta; na mwamba wa Hukumu yangu, Ee Mwanadamu, haujaelewa,” Bwana alisema.  “Usiringe, kwa kuwa u mwili, na mara tatu Utanikana, Ninaye barikiwa na viumbe vyote, vikinitukuza milele.”
ltx/swh_ke_oak/tr.d069:trMA.Ode8C14.text	“Unapinga, Ee Simoni Petro, kile kitu ambacho utatenda, jinsi nilivyo kutabiria hapo mbeleni.  Mjakazi, atakapokukaribia kwa kukushtua utatetemeka,” alisema Bwana.  “ila kwa majonzi utanipata mrahimu, Ninaye barikiwa na viumbe vyote, vikinitukuza milele.”
ltx/swh_ke_oak/tr.d069:trMA.Ode8C1H.ode	Odhii ya Nane.
ltx/swh_ke_oak/tr.d069:trMA.Ode8C1H.text	Wana wa umungu waliweka makaburi ya wale wasiojali Mungu wazi ya wenye dhambi. Na majivuno na wasiojua sheria ya wakuu tupu baraza lililo kinyume cha Kristo, wakiongelea jinsi ya Kumchinja, Yeye ashikaye uzima katika kiganja cha mkono Wake, na Yule ambaye viumbe vyote vinambariki, na kumtukuza milele.
ltx/swh_ke_oak/tr.d069:trMA.Ode8K.text	Wana wenye Umungu walianika ukuu wa uovu.  Na makuhani wenye kiburi wasio jua sheria waliweka baraza dhidi ya Kristo, wakishauriana jinsi ya kumuua, Yeye ashikaye uzima Kiganjani Mwake, anaye barikiwa na viumbe vyote, vikimtukuza milele.”
ltx/swh_ke_oak/tr.d069:trMA.Ode9C11.text	Baraza potovu, lisilo stahili lenye ulaghai, la kuchukiza mno, na lenye kumchinja Mungu lilikujia, Ee Kristo, na Kukokota, kama mtenda dhambi, Muumba wa vyote, Tunayetukuza.
ltx/swh_ke_oak/tr.d069:trMA.Ode9C12.text	Wanadamu wasio mheshimu Mungu, wakidharau Sheria, na wakisoma Manabii bila sababu, pasipo haki walikukokota kama mwana kondoo anaye elekezwa machinjoni, Wewe Bwana wa wote, Tunayetukuza.
ltx/swh_ke_oak/tr.d069:trMA.Ode9C13.text	Makuhani, na waandishi, walikukabidhi kwa mataifa kukutoa Uhai; na wakakupiga sana, kwa wivu na tamaa yao mbaya, Yeye, Ambaye kwa maumbile ni Mpaji wa Uhai; Tunayemtukuza.
ltx/swh_ke_oak/tr.d069:trMA.Ode9C14.text	Kama mbwa wengi walikuzunguka, Ee Mfalme, na Kukupiga sana kwenye shavu kwa mikono yao.  Walikuhoji, na kukuleta ushahidi usio kweli; bali Ulivumilia hayo yote, na kuokoa wote.
ltx/swh_ke_oak/tr.d069:trMA.Ode9C1H.ode	Odhii ya tisa.
ltx/swh_ke_oak/tr.d069:trMA.Ode9C1H.text	Uliye wa thamani kushinda Waheruvi, uliye na utukufu kupita bila kiasi Waserafi, uliyemzaa Mungu neno, umebaki bila kukuharibu uliye Mzazi Mungu kweli tunakutukuza we.
ltx/swh_ke_oak/tr.d069:trMA.Ode9K.text	Uliye wa thamani kushinda Waheruvi, uliye na utukufu kupita bila kiasi Waserafi, uliyemzaa Mungu neno, umebaki bila kukuharibu, uliye Mzazi Mungu kweli tunakutukuza we.
ltx/swh_ke_oak/tr.d069:trMA.Oikos1.text	Mama Bikira, alipoona Mwana kondoo wake akiongozwa kwenye kichinjio, alifuata akiomboleza na wanawake wengine, na kusema: “Unaenda wapi Mwanangu? Kwa nini unasafiri kwa kasi? Je kuna harusi nyingine Kana, na unajiharakisha kwenda, kugeuza maji kuwa divai? Je siwezi nikaja nawe mwanangu? Au kuchelewa nawe? Nisemeze neno; wewe, uliye Neno.  Usinipite kwa kimya, wewe, uliye nihifadhi kwa usafi. Kwa kuwa wewe ni mwanangu na Mungu wangu.”
ltx/swh_ke_oak/tr.d069:trMA.Troparion.mode	Sauti ya 8
ltx/swh_ke_oak/tr.d069:trMA.Troparion.text	Wakati Wanafunzi Wako wa utukufu walipoelimika wakati wa kuosha miguu kabla ya chakula cha Jioni, Yuda mpotovu alitiwa giza na ugonjwa wa tamaa, na Kukukabidhi Wewe, Hakimu Mwenye Haki, kwa hakimu wasiojua sheria.  Tazama, Ee mpenda fedha, yule aliye jitia kitanzi kwa ajili ya fedha.  Toroka kutoka kwa tamaa hii, ambayo ilithubutu kitu kama hicho dhidi ya Mwalimu.  Ee Bwana, Anaye hukumu watu wote kwa haki, utukufu Kwako.
ltx/swh_ke_oak/tr.d069:trSY.commemoration.couplet1.verse1	Wewe ni Mungu uishiye, ingawaje ulikuwa bila uhai Msalabani.
ltx/swh_ke_oak/tr.d069:trSY.commemoration.couplet1.verse2	Ee maiti uchi, wewe ndiwe Neno la Mungu aishiye.
ltx/swh_ke_oak/tr.d069:trSY.commemoration.couplet2.verse1	Mwizi alifungua malango yaliyo fungwa ya Edeni
ltx/swh_ke_oak/tr.d069:trSY.commemoration.couplet2.verse2	Kwa ufunguo, “Nikumbuke.”
ltx/swh_ke_oak/tr.d069:trSY.commemoration.text	Ijumaa kuu tunaadhimisha harara Takatifu, okovu ya kutisha ya Bwana wetu, na Mungu, na mwokozi Yesu Kristo; kutemewa mate, kucharazwa, kupigwa makofi, dhihaka, mizaha, vazi la zambarau la kifalme, misumari, mwanzi, sifongo, siki na zaidi ya yote, Msalaba na mauti, ambayo kwa kupenda alistahimili kwa ajili yetu. Pia tunaadhimisha toba kwa wokovu ya mwizi, ambaye alisulubiwa pamoja Nawe.
ltx/swh_ke_oak/tr.d069:trSY.lastline	Kupitia kwa maajabu Yako na huruma Yako isio na mwisho, Ee Kristo Mungu wetu, tuhurumie. Amina.
ltx/swh_ke_oak/tr.d069:trVE.SticGlory.mode	Sauti ya 6
ltx/swh_ke_oak/tr.d069:trVE.SticGlory.text	Yuda, kweli wa kizazi cha nyoka, aliye kula manna jangwani na kunung’unika kwa Yeye aliyepeana; chakula kingali midomoni mwao, wao, katika kutoshukuru, walimshutumu Mungu.  Tena Aliye, katika kutojali Mungu, akiwa na Mkate wa Mbinguni kinywani mwake, aliwaza kumsaliti Mwokozi.  Ee asiye jali kwa fikira, na mkatili! Alimuuza yeye aliyemlea; na Bwana aliye kuwa rafikiye, anampeana kwa kifo.  Kweli, alikuwa mwana wa wapotevu, na pamoja nao alirithi upotevu wa milele.  Ila komboa nafsi zetu kutoka kwa hiyo hali isio ya utu, Ee Bwana; ambaye pekee kuvumilia kwako hakuelezeki.
ltx/swh_ke_oak/tr.d069:trVE.Stichera01.mode	Sauti ya 2
ltx/swh_ke_oak/tr.d069:trVE.Stichera01.text	Baraza lote la Yudea lilikusanyika, kumkabidhi mwanzilishi na muumbaji wa vitu vyote kwa Pilato.  Ee, wasio haki wala sheria! Ee, wasio amini! ya kwamba wakapate kuandaa hukumu juu yake, atakaye kuja kuhukumu wahai na wafu; kwa kuandaa akateswe, anaye ponya magonjwa yote; Ee Bwana mvumilivu, huruma yako ni kuu.  Utukufu kwako.
ltx/swh_ke_oak/tr.d069:trVE.Stichera02.mode	Sauti ya 2
ltx/swh_ke_oak/tr.d069:trVE.Stichera02.text	Yuda mwasi, Ee Bwana, aliye tumbukiza mkono wake kwenye bakuli moja Nawe wakati wa maakuli, pasipo sheria alinyosha mkono wake kupokea fedha; na baada ya kuhesabu faida ya marhamu, hakusita kukuuza, uliye dhamani kuliko mali.  Aliye nyosha miguu yake kwa kuoshwa, kwa usaliti alimbusu Bwana, ili kumkabidhi, akafungiwa nje ya ushirika wa mitume, akiwa ametupa vipande thelathini za fedha, hakushuhudia kufufuka Kwako siku ya tatu; ambako kupitia kwa huo ufufuo tuhurumie.
ltx/swh_ke_oak/tr.d069:trVE.Stichera03.mode	Sauti ya 2
ltx/swh_ke_oak/tr.d069:trVE.Stichera03.text	Yuda, msaliti mwerevu, ulimbusu kwa udanganyifu na kumsaliti Bwana Mwokozi; alimuuza Bwana wa wafungwa wote kwa wasio na sheria.  Bali kama mwana kondoo akiongozwa kwa mchinjaji, hivyo ndivyo Kondoo wa Mungu aliwafuata; Mwana wa Baba, aliye mwenye huruma pekee.
ltx/swh_ke_oak/tr.d069:trVE.Stichera04.mode	Sauti ya 2
ltx/swh_ke_oak/tr.d069:trVE.Stichera04.text	Yuda mtumwa na mlaghai, mwanafunzi na msaliti, rafiki na ibilisi, alithibitisha kwa vitendo vyake; maana, akimfwata Bwana, kindani aliwaza usaliti wake.  Alikuwa akijisemeza; “nitamkabidhi, na nitafaidika kwa fedha nitakayo kusanya.” Vile vile alikuwa akitaka marhamu yauzwe, na Yesu apate kushikwa kwa udanganyifu; alibusu na kumkabidhi Bwana; na kama mwana kondoo anavyongoozwa kuchinjwa, vivyo hivyo alifuata; mwenye huruma na mwenye upendo.
ltx/swh_ke_oak/tr.d069:trVE.Stichera05.mode	Sauti ya 2
ltx/swh_ke_oak/tr.d069:trVE.Stichera05.text	Mwana kondoo, ambaye Isaya alitangaza, anakuja kuchinjwa kwa kupenda akapeana mgongo wake kwa mijeredi na shavu lake kwa kichapo.  Hakuficha uso wake kwa aibu ya kutemewa mate, na kuhukumiwa kifo kisicho cha heshima.  Yeye asiye na dhambi, kwa kupenda alijipeana kwa wote, ili kwamba apate kuwapa wote ufufuo kutoka mautini.
