ltx/swh_ke_oak/le.go.lu.d038:leluLI.Gospel.book	@ltx/swh_ke_oak/bible:Luke
ltx/swh_ke_oak/le.go.lu.d038:leluLI.Gospel.chapverse	(11:9-13)
ltx/swh_ke_oak/le.go.lu.d038:leluLI.Gospel.text	Bwana aliwaambia wanafunzi wake, "Kwa hiyo, ombeni nanyi mtapewa; tafuteni nanyi mtapata; bisheni mlango nanyi mtafunguliwa. Maana yeyote aombaye hupewa, atafutaye hupata na abishaye mlango hufunguliwa. Mtoto akimwomba baba yake samaki, je, atampa nyoka badala ya samaki? Na kama akimwomba yai, je, atampa nge? Kama nyinyi, ingawa ni waovu, mnajua kuwapa watoto wenu vitu vizuri, hakika baba yenu wa mbinguni atafanya zaidi; atawapa Roho Mtakatifu wale wanaomwomba."
ltx/swh_ke_oak/le.go.lu.d038:leluLI.Gospel.title	
ltx/swh_ke_oak/le.go.lu.d038:leluLI.Gospel.version	
