ltx/swh_ke_oak/le.pr.me.r33:leprVE.reading.book	@ltx/swh_ke_oak/bible:Isaiah
ltx/swh_ke_oak/le.pr.me.r33:leprVE.reading.chapverse	(6:1-12)
ltx/swh_ke_oak/le.pr.me.r33:leprVE.reading.text	Mnamo mwaka aliofariki mfalme Uzia, nilimwona Bwana ameketi katika kiti cha enzi kilicho juu na cha fahari. Pindo la vazi lake lilienea hekaluni kote, na juu yale walikuwa wamekaa malaika. Kila mmoja alikuwa na mabawa sita: mawili ya kufunika uso, mawili ya kufunika mwili na mawili ya kurukia. Waliitana kila mmoja na mwenzake hivi: "Mtakatifu, mtakatifu, mtakatifu ni Mwenyezi-Mungu wa majeshi! Dunia yote imejaa utukufu wake." Sauti yao iliitikisa misingi ya milango ya hekalu, nalo likajaa moshi. Basi, mimi nikasema, "Ole wangu! Mimi nimeangamia, maana, midomo yangu ni najisi, na watu ninaoishi nao ni najisi kama mimi. Hata hivyo, kwa macho yangu mwenyewe, nimemwona Mfalme, Mwenyezi-Mungu wa majeshi." Basi, mmoja wa hao malaika akaruka kunijia, akiwa ameshika mkononi koleo lililokuwa na kaa la moto aliloitwaa madhabahuni. Naye akinigusa nalo mdomoni, akasema: "Tazama, kaa hili limekugusa mdomo; umeondolewa hatia yako, umesamehewa dhambi yako." Kisha nikamsikia Mwenyezi-Mungu akisema, "Nimtume nani? Ni nani atakayekuwa mjumbe wangu?" Nami nikajibu, "Niko hapa! Nitume mimi." Naye akaniambia, "Nenda ukawaambie watu hawa: ''Mtasikiliza sana, lakini hamtaelewa; mtatazama sana, lakini hamtaona.''" Kisha akaniambia, "Zipumbaze akili za watu hawa, masikio yao yasisikie, macho yao yasione; ili wasije wakaona kwa macho yao, wakasikia kwa masikio yao, wakaelewa kwa akili zao, na kunigeukia, nao wakaponywa." Mimi nikauliza, "Bwana, mpaka lini?" Naye akanijibu, "Mpaka hapo miji itakapobaki tupu bila wakazi, nyumba bila watu, na nchi itakapoharibiwa kabisa. Nami Mwenyezi-Mungu nitawapeleka watu mbali, na kuifanya nchi yote kuwa mahame."
ltx/swh_ke_oak/le.pr.me.r33:leprVE.reading.title	
ltx/swh_ke_oak/le.pr.me.r33:leprVE.reading.version	@ltx/swh_ke_oak/properties:version.designation
