ltx/swh_ke_oak/le.go.lu.d110:leluLI.Gospel.book	@ltx/swh_ke_oak/bible:Mark
ltx/swh_ke_oak/le.go.lu.d110:leluLI.Gospel.chapverse	(13:1-8)
ltx/swh_ke_oak/le.go.lu.d110:leluLI.Gospel.text	Wakati Yesu alipokuwa anatoka hekaluni mmoja wa wanafunzi wake alimwambia, "Mwalimu, tazama jinsi mawe haya na majengo haya yalivyo ya ajabu!" Yesu akamwambia, "Je, unayaona majengo haya makubwa? Hakuna hata jiwe moja litakalosalia juu ya lingine; kila kitu kitabomolewa." Yesu alipokuwa ameketi juu ya mlima wa Mizeituni akielekea hekalu, Petro, Yakobo, Yohane na Andrea wakamwuliza kwa faragha, "Tuambie mambo haya yatatukia lini? Ni ishara gani itakayoonesha kwamba mambo haya karibu yatimizwe?" Yesu akaanza kuwaambia, "Jihadharini msije mkadanganywa na mtu. Maana wengi watakuja wakilitumia jina langu, kila mmoja akisema kuwa yeye ni mimi! Nao watawapotosha watu wengi. Mtakaposikia juu ya vita na fununu za vita, msifadhaike. Mambo hayo lazima yatokee, lakini mwisho wenyewe ungali bado. Taifa moja litapigana na taifa lingine; ufalme mmoja utapigana na ufalme mwingine; kila mahali kutakuwa na mitetemeko ya ardhi na njaa. Mambo haya ni kama tu maumivu ya kwanza ya kujifungua mtoto."
ltx/swh_ke_oak/le.go.lu.d110:leluLI.Gospel.title	
ltx/swh_ke_oak/le.go.lu.d110:leluLI.Gospel.version	
