ltx/swh_ke_oak/da.d1:daCommemoration.text	
ltx/swh_ke_oak/da.d1:daDay.text	Jumapili.
ltx/swh_ke_oak/da.d1:daLI.GospelAlleluia.text	@ltx/swh_ke_oak/prayers:pr.Alleluia3.text
ltx/swh_ke_oak/da.d1:daLI.MM.CommunionHymn.text	@ltx/swh_ke_oak/properties:media.key
ltx/swh_ke_oak/da.d1:daVE.OnTheEveningBefore.text	@ltx/swh_ke_oak/template.titles:d.onSaturdayEvening
