ltx/swh_ke_oak/le.go.lu.d022:leluLI.Gospel.book	@ltx/swh_ke_oak/bible:Luke
ltx/swh_ke_oak/le.go.lu.d022:leluLI.Gospel.chapverse	(7:36-50)
ltx/swh_ke_oak/le.go.lu.d022:leluLI.Gospel.text	Wakati huo Mfarisayo mmoja alimwalika Yesu kula chakula nyumbani kwake. Akaingia nyumbani kwa huyo Mfarisayo, akakaa kula chakula. Basi, katika mji ule kulikuwa na mama mmoja mwenye dhambi. Alipopata habari kwamba Yesu yuko nyumbani kwa huyo Mfarisayo, alichukua chupa ya alabasta yenye marashi. Akaja, akasimama karibu na miguu yake Yesu, akilia, na machozi yake yakamdondokea Yesu miguuni. Huyo mwanamke akaipangusa miguu ya Yesu kwa nywele zake. Kisha akaibusu na kuipaka yale marashi. Yule Mfarisayo aliyemwalika Yesu alipoona hayo, akawaza moyoni mwake, "Kama mtu huyu angekuwa kweli nabii angejua huyu mwanamke ni wa namna gani, ya kwamba ni mwenye dhambi." Yesu akamwambia huyo Mfarisayo, "Simoni, ninacho kitu cha kukuambia." Naye Simoni akamwambia, "Ndio Mwalimu, sema." Yesu akasema, "Watu wawili walikuwa wamemkopa mtu fedha: mmoja alikuwa amekopa denari mia tano, na mwingine hamsini. Waliposhindwa kulipa madeni yao, huyo mtu aliwasamehe wote wawili. Sasa ni yupi kati ya hao wawili atampenda zaidi huyo bwana?" Simoni akamjibu, "Ni dhahiri kwamba yule aliyesamehewa deni kubwa zaidi atampenda zaidi yule bwana." Yesu akamwambia, "Sawa." Halafu akamgeukia yule mwanamke na kumwambia Simoni, "Unamwona huyu mwanamke, sivyo? Basi, mimi nilipoingia hapa nyumbani kwako hukunipa maji ya kunawa miguu yangu; lakini mwanamke huyu ameniosha miguu yangu kwa machozi yake na kunipangusa kwa nywele zake. Wewe hukunisalimu kwa kunibusu, lakini huyu mwanamke tangu nilipoingia hapa amekuwa akiibusu miguu yangu. Wewe hukunionesha ukarimu wako kwa kunipaka mafuta kichwani, lakini huyu mwanamke amefanya hivyo kwa kunipaka mafuta miguu yangu. Kwa hiyo nakuambia amesamehewa dhambi zake nyingi kwa kuwa ameonesha upendo mkubwa. Mwenye kusamehewa kidogo, hupenda kidogo." Basi, Yesu akamwambia yule mwanamke, "Umesamehewa dhambi zako." Ndipo wale waliokuwa pamoja naye mezani wakaulizana, "Ni mtu wa namna gani huyu awezaye kusamehe dhambi?" Naye Yesu akamwambia yule mwanamke, "Imani yako imekuokoa; nenda kwa imani."
ltx/swh_ke_oak/le.go.lu.d022:leluLI.Gospel.title	
ltx/swh_ke_oak/le.go.lu.d022:leluLI.Gospel.version	
