ltx/swh_ke_oak/le.pr.me.r75:leprVE.reading.book	@ltx/swh_ke_oak/bible:Isaiah
ltx/swh_ke_oak/le.pr.me.r75:leprVE.reading.chapverse	(60:11-16)
ltx/swh_ke_oak/le.pr.me.r75:leprVE.reading.text	Bwana asema hivi: "Malango yako, Yerusalemu, yakuwa wazi daima; usiku na mchana hayatafungwa, ili watu wakuletee utajiri wa mataifa, pamoja na wafalme wao katika maandamano. Kila ufalme au taifa lisilokutumikia litaangamia; mataifa hayo yatatokomezwa kabisa. Utaletewa fahari ya msitu wa Lebanoni; mbao za miberoshi, mivinje na misunobari, zitumike kupamba mahali pa maskani yangu; nami nitaparembesha hapo ninapokaa. Wazawa wa wale waliokudhulumu, watakuja na kukuinamia kwa heshima. Wote wale waliokudharau, watasujudu mbele ya miguu yako. Watakuita: ''Mji wa Mwenyezi-Mungu,'' ''Siyoni, Mji wa Mtakatifu wa Israeli.'' Wewe ulikuwa umeachwa na kuchukiwa, hakuna aliyependa hata kupitia kwako. Lakini sasa nitakufanya uwe na fahari milele, utakuwa mji wa furaha kizazi hata kizazi. Utaletewa chakula na watu wa mataifa, naam, wafalme watakupatia chakula bora. Hapo utatambua kuwa mimi Mwenyezi-Mungu ni Mwokozi wako; mimi Mwenye Nguvu wa Yakobo ni Mkombozi wako."
ltx/swh_ke_oak/le.pr.me.r75:leprVE.reading.title	
ltx/swh_ke_oak/le.pr.me.r75:leprVE.reading.version	@ltx/swh_ke_oak/properties:version.designation
