ltx/swh_ke_oak/le.go.mc.d225:lemcLI.Gospel.book	@ltx/swh_ke_oak/bible:Matthew
ltx/swh_ke_oak/le.go.mc.d225:lemcLI.Gospel.chapverse	(22:35-46)
ltx/swh_ke_oak/le.go.mc.d225:lemcLI.Gospel.text	Wakati huo mwanasheria fulani alimwuliza Yesu kwa kumjaribu, "Mwalimu, ni amri ipi iliyo kuu katika sheria?" Yesu akamjibu, "''Mpende Bwana Mungu wako kwa moyo wako wote, kwa roho yako yote na kwa akili yako yote.'' Hii ndiyo amri kuu na ya kwanza. Ya pili inafanana na hiyo: ''Mpende jirani yako kama unavyojipenda wewe mwenyewe.'' Sheria yote ya Mose na mafundisho ya manabii vinategemea amri hizi mbili." Mafarisayo walipokusanyika pamoja, Yesu aliwauliza, "Nyinyi mwaonaje juu ya Kristo? Je, ni mwana wa nani?" Wakamjibu, "Wa Daudi." Yesu akawaambia, "Basi, inawezekanaje kwamba kwa nguvu ya Roho Mtakatifu Daudi anamwita yeye Bwana? Maana alisema: ''Bwana alimwambia Bwana wangu: keti upande wangu wa kulia, mpaka niwaweke adui zako chini ya miguu yako.'' Basi, ikiwa Daudi anamwita Kristo ''Bwana,'' anawezaje kuwa mwanawe?" Hakuna mtu yeyote aliyeweza kumjibu neno. Na tangu siku hiyo hakuna aliyethubutu tena kumwuliza swali.
ltx/swh_ke_oak/le.go.mc.d225:lemcLI.Gospel.title	
ltx/swh_ke_oak/le.go.mc.d225:lemcLI.Gospel.version	
