ltx/swh_ke_oak/le.ep.mc.d169:lemcLI.Epistle.book	@ltx/swh_ke_oak/bible:Romans
ltx/swh_ke_oak/le.ep.mc.d169:lemcLI.Epistle.chapverse	(15:1-7)
ltx/swh_ke_oak/le.ep.mc.d169:lemcLI.Epistle.text	Ndugu zangu, sisi tulio imara katika imani tunapaswa kuwasaidi wale walio dhaifu wayakabili matatizo yao. Tusijipendelee sisi wenyewe tu. Kila mmoja wetu anapaswa kumpendeza jirani yake kwa wema ili huyo apate kujijenga katika imani. Maana Kristo hakujipendelea mwenyewe; ila alikuwa kama yasemavyo Maandiko: "Kashfa zote walizokutolea wewe zimenipata mimi." Maana, yote yaliyoandikwa yameandikwa kwa ajili ya kutufundisha sisi ili kutokana na saburi na faraja tupewayo na hayo Maandiko Matakatifu tupate kuwa na matumaini. Mungu aliye msingi wa saburi na faraja yote, awajalieni nyinyi kuwa na msimamo mmoja kufuatana na mfano wake Kristo Yesu, ili nyinyi nyote, kwa nia moja na sauti moja, mumtukuze Mungu, Baba wa Bwana wetu Yesu Kristo. Basi, karibishaneni kwa ajili ya utukufu wa Mungu kama naye Kristo alivyowakaribisheni.
ltx/swh_ke_oak/le.ep.mc.d169:lemcLI.Epistle.title	
ltx/swh_ke_oak/le.ep.mc.d169:lemcLI.Epistle.version	
