ltx/swh_ke_oak/oc.m8.d5:ocLI.Beatitudes1.melody	
ltx/swh_ke_oak/oc.m8.d5:ocLI.Beatitudes1.mode	@ltx/swh_ke_oak/miscellanea:misc.Mode8
ltx/swh_ke_oak/oc.m8.d5:ocLI.Beatitudes1.text	@ltx/swh_ke_oak/oc.m8.d1:ocLI.Beatitudes1.text
ltx/swh_ke_oak/oc.m8.d5:ocLI.Beatitudes2.melody	
ltx/swh_ke_oak/oc.m8.d5:ocLI.Beatitudes2.mode	@ltx/swh_ke_oak/miscellanea:misc.Mode8
ltx/swh_ke_oak/oc.m8.d5:ocLI.Beatitudes2.text	
ltx/swh_ke_oak/oc.m8.d5:ocLI.Beatitudes3.melody	
ltx/swh_ke_oak/oc.m8.d5:ocLI.Beatitudes3.mode	@ltx/swh_ke_oak/miscellanea:misc.Mode8
ltx/swh_ke_oak/oc.m8.d5:ocLI.Beatitudes3.text	
ltx/swh_ke_oak/oc.m8.d5:ocLI.Beatitudes4.melody	
ltx/swh_ke_oak/oc.m8.d5:ocLI.Beatitudes4.mode	@ltx/swh_ke_oak/miscellanea:misc.Mode8
ltx/swh_ke_oak/oc.m8.d5:ocLI.Beatitudes4.text	
ltx/swh_ke_oak/oc.m8.d5:ocLI.BeatitudesBoth.melody	
ltx/swh_ke_oak/oc.m8.d5:ocLI.BeatitudesBoth.mode	@ltx/swh_ke_oak/miscellanea:misc.Mode8
ltx/swh_ke_oak/oc.m8.d5:ocLI.BeatitudesBoth.text	
ltx/swh_ke_oak/oc.m8.d5:ocLI.BeatitudesGlory.melody	
ltx/swh_ke_oak/oc.m8.d5:ocLI.BeatitudesGlory.mode	@ltx/swh_ke_oak/miscellanea:misc.Mode8
ltx/swh_ke_oak/oc.m8.d5:ocLI.BeatitudesGlory.text	
ltx/swh_ke_oak/oc.m8.d5:ocMA.ApolTheotokion.melody	
ltx/swh_ke_oak/oc.m8.d5:ocMA.ApolTheotokion.mode	@ltx/swh_ke_oak/miscellanea:misc.Mode8
ltx/swh_ke_oak/oc.m8.d5:ocMA.ApolTheotokion.text	@ltx/swh_ke_oak/oc.m8.d3:ocMA.ApolTheotokion.text
ltx/swh_ke_oak/oc.m8.d5:ocMA.AposTheotokion.melody	
ltx/swh_ke_oak/oc.m8.d5:ocMA.AposTheotokion.mode	@ltx/swh_ke_oak/miscellanea:misc.Mode8
ltx/swh_ke_oak/oc.m8.d5:ocMA.AposTheotokion.text	
ltx/swh_ke_oak/oc.m8.d5:ocMA.Aposticha1.melody	@ltx/swh_ke_oak/he.a.m8:heAU.KyrieEiKaiKritirio.name
ltx/swh_ke_oak/oc.m8.d5:ocMA.Aposticha1.mode	@ltx/swh_ke_oak/miscellanea:misc.Mode8
ltx/swh_ke_oak/oc.m8.d5:ocMA.Aposticha1.text	@ltx/swh_ke_oak/oc.m8.d5:ocVE.Aposticha1.text
ltx/swh_ke_oak/oc.m8.d5:ocMA.Aposticha2.melody	@ltx/swh_ke_oak/he.a.m8:heAU.KyrieEiKaiKritirio.name
ltx/swh_ke_oak/oc.m8.d5:ocMA.Aposticha2.mode	@ltx/swh_ke_oak/miscellanea:misc.Mode8
ltx/swh_ke_oak/oc.m8.d5:ocMA.Aposticha2.text	@ltx/swh_ke_oak/oc.m8.d5:ocVE.Aposticha2.text
ltx/swh_ke_oak/oc.m8.d5:ocMA.Aposticha3.melody	
ltx/swh_ke_oak/oc.m8.d5:ocMA.Aposticha3.mode	@ltx/swh_ke_oak/miscellanea:misc.Mode8
ltx/swh_ke_oak/oc.m8.d5:ocMA.Aposticha3.text	
ltx/swh_ke_oak/oc.m8.d5:ocMA.C1Acrostic.text	
ltx/swh_ke_oak/oc.m8.d5:ocMA.C1Poet	@ltx/swh_ke_oak/poets:po.Iosif
ltx/swh_ke_oak/oc.m8.d5:ocMA.C2Acrostic.text	
ltx/swh_ke_oak/oc.m8.d5:ocMA.Kathisma11.melody	@ltx/swh_ke_oak/he.a.m8:heAU.TinSofianKaiLogon.name
ltx/swh_ke_oak/oc.m8.d5:ocMA.Kathisma11.mode	@ltx/swh_ke_oak/miscellanea:misc.Mode8
ltx/swh_ke_oak/oc.m8.d5:ocMA.Kathisma11.text	
ltx/swh_ke_oak/oc.m8.d5:ocMA.Kathisma12.melody	@ltx/swh_ke_oak/he.a.m8:heAU.TinSofianKaiLogon.name
ltx/swh_ke_oak/oc.m8.d5:ocMA.Kathisma12.mode	@ltx/swh_ke_oak/miscellanea:misc.Mode8
ltx/swh_ke_oak/oc.m8.d5:ocMA.Kathisma12.text	
ltx/swh_ke_oak/oc.m8.d5:ocMA.Kathisma13.melody	@ltx/swh_ke_oak/he.a.m8:heAU.TinSofianKaiLogon.name
ltx/swh_ke_oak/oc.m8.d5:ocMA.Kathisma13.mode	@ltx/swh_ke_oak/miscellanea:misc.Mode8
ltx/swh_ke_oak/oc.m8.d5:ocMA.Kathisma13.text	
ltx/swh_ke_oak/oc.m8.d5:ocMA.Kathisma21.melody	@ltx/swh_ke_oak/he.a.m8:heAU.ToProstachthen.name
ltx/swh_ke_oak/oc.m8.d5:ocMA.Kathisma21.mode	@ltx/swh_ke_oak/miscellanea:misc.Mode8
ltx/swh_ke_oak/oc.m8.d5:ocMA.Kathisma21.text	
ltx/swh_ke_oak/oc.m8.d5:ocMA.Kathisma22.melody	@ltx/swh_ke_oak/he.a.m8:heAU.ToProstachthen.name
ltx/swh_ke_oak/oc.m8.d5:ocMA.Kathisma22.mode	@ltx/swh_ke_oak/miscellanea:misc.Mode8
ltx/swh_ke_oak/oc.m8.d5:ocMA.Kathisma22.text	
ltx/swh_ke_oak/oc.m8.d5:ocMA.Kathisma23.melody	@ltx/swh_ke_oak/he.a.m8:heAU.AnestisEkNekron.name
ltx/swh_ke_oak/oc.m8.d5:ocMA.Kathisma23.mode	@ltx/swh_ke_oak/miscellanea:misc.Mode8
ltx/swh_ke_oak/oc.m8.d5:ocMA.Kathisma23.text	
ltx/swh_ke_oak/oc.m8.d5:ocMA.Kathisma31.melody	@ltx/swh_ke_oak/he.a.m8:heAU.TinSofianKaiLogon.name
ltx/swh_ke_oak/oc.m8.d5:ocMA.Kathisma31.mode	@ltx/swh_ke_oak/miscellanea:misc.Mode8
ltx/swh_ke_oak/oc.m8.d5:ocMA.Kathisma31.text	
ltx/swh_ke_oak/oc.m8.d5:ocMA.Kathisma32.melody	@ltx/swh_ke_oak/he.a.m8:heAU.TinSofianKaiLogon.name
ltx/swh_ke_oak/oc.m8.d5:ocMA.Kathisma32.mode	@ltx/swh_ke_oak/miscellanea:misc.Mode8
ltx/swh_ke_oak/oc.m8.d5:ocMA.Kathisma32.text	
ltx/swh_ke_oak/oc.m8.d5:ocMA.Kathisma33.melody	
ltx/swh_ke_oak/oc.m8.d5:ocMA.Kathisma33.mode	@ltx/swh_ke_oak/miscellanea:misc.Mode8
ltx/swh_ke_oak/oc.m8.d5:ocMA.Kathisma33.text	
ltx/swh_ke_oak/oc.m8.d5:ocMA.OdeW1C11.melody	@ltx/swh_ke_oak/he.h.m8:heHE.YgranDiodefsas.name
ltx/swh_ke_oak/oc.m8.d5:ocMA.OdeW1C11.mode	@ltx/swh_ke_oak/miscellanea:misc.Mode8
ltx/swh_ke_oak/oc.m8.d5:ocMA.OdeW1C11.ode	@ltx/swh_ke_oak/miscellanea:misc.Ode1
ltx/swh_ke_oak/oc.m8.d5:ocMA.OdeW1C11.text	
ltx/swh_ke_oak/oc.m8.d5:ocMA.OdeW1C12.melody	@ltx/swh_ke_oak/he.h.m8:heHE.YgranDiodefsas.name
ltx/swh_ke_oak/oc.m8.d5:ocMA.OdeW1C12.mode	@ltx/swh_ke_oak/miscellanea:misc.Mode8
ltx/swh_ke_oak/oc.m8.d5:ocMA.OdeW1C12.ode	@ltx/swh_ke_oak/miscellanea:misc.Ode1
ltx/swh_ke_oak/oc.m8.d5:ocMA.OdeW1C12.text	
ltx/swh_ke_oak/oc.m8.d5:ocMA.OdeW1C13.melody	@ltx/swh_ke_oak/he.h.m8:heHE.YgranDiodefsas.name
ltx/swh_ke_oak/oc.m8.d5:ocMA.OdeW1C13.mode	@ltx/swh_ke_oak/miscellanea:misc.Mode8
ltx/swh_ke_oak/oc.m8.d5:ocMA.OdeW1C13.ode	@ltx/swh_ke_oak/miscellanea:misc.Ode1
ltx/swh_ke_oak/oc.m8.d5:ocMA.OdeW1C13.text	
ltx/swh_ke_oak/oc.m8.d5:ocMA.OdeW1C1H.melody	@ltx/swh_ke_oak/miscellanea:misc.Heirmos
ltx/swh_ke_oak/oc.m8.d5:ocMA.OdeW1C1H.mode	@ltx/swh_ke_oak/miscellanea:misc.Mode8
ltx/swh_ke_oak/oc.m8.d5:ocMA.OdeW1C1H.ode	@ltx/swh_ke_oak/miscellanea:misc.Ode1
ltx/swh_ke_oak/oc.m8.d5:ocMA.OdeW1C1H.text	@ltx/swh_ke_oak/he.h.m8:heHE.YgranDiodefsas.text
ltx/swh_ke_oak/oc.m8.d5:ocMA.OdeW1C1T.melody	@ltx/swh_ke_oak/he.h.m8:heHE.YgranDiodefsas.name
ltx/swh_ke_oak/oc.m8.d5:ocMA.OdeW1C1T.mode	@ltx/swh_ke_oak/miscellanea:misc.Mode8
ltx/swh_ke_oak/oc.m8.d5:ocMA.OdeW1C1T.ode	@ltx/swh_ke_oak/miscellanea:misc.Ode1
ltx/swh_ke_oak/oc.m8.d5:ocMA.OdeW1C1T.text	
ltx/swh_ke_oak/oc.m8.d5:ocMA.OdeW1C21.melody	@ltx/swh_ke_oak/he.h.m8:heHE.IKekommeni.name
ltx/swh_ke_oak/oc.m8.d5:ocMA.OdeW1C21.mode	@ltx/swh_ke_oak/miscellanea:misc.Mode8
ltx/swh_ke_oak/oc.m8.d5:ocMA.OdeW1C21.ode	@ltx/swh_ke_oak/miscellanea:misc.Ode1
ltx/swh_ke_oak/oc.m8.d5:ocMA.OdeW1C21.text	
ltx/swh_ke_oak/oc.m8.d5:ocMA.OdeW1C22.melody	@ltx/swh_ke_oak/he.h.m8:heHE.IKekommeni.name
ltx/swh_ke_oak/oc.m8.d5:ocMA.OdeW1C22.mode	@ltx/swh_ke_oak/miscellanea:misc.Mode8
ltx/swh_ke_oak/oc.m8.d5:ocMA.OdeW1C22.ode	@ltx/swh_ke_oak/miscellanea:misc.Ode1
ltx/swh_ke_oak/oc.m8.d5:ocMA.OdeW1C22.text	
ltx/swh_ke_oak/oc.m8.d5:ocMA.OdeW1C23.melody	@ltx/swh_ke_oak/he.h.m8:heHE.IKekommeni.name
ltx/swh_ke_oak/oc.m8.d5:ocMA.OdeW1C23.mode	@ltx/swh_ke_oak/miscellanea:misc.Mode8
ltx/swh_ke_oak/oc.m8.d5:ocMA.OdeW1C23.ode	@ltx/swh_ke_oak/miscellanea:misc.Ode1
ltx/swh_ke_oak/oc.m8.d5:ocMA.OdeW1C23.text	
ltx/swh_ke_oak/oc.m8.d5:ocMA.OdeW1C2T.melody	@ltx/swh_ke_oak/he.h.m8:heHE.IKekommeni.name
ltx/swh_ke_oak/oc.m8.d5:ocMA.OdeW1C2T.mode	@ltx/swh_ke_oak/miscellanea:misc.Mode8
ltx/swh_ke_oak/oc.m8.d5:ocMA.OdeW1C2T.ode	@ltx/swh_ke_oak/miscellanea:misc.Ode1
ltx/swh_ke_oak/oc.m8.d5:ocMA.OdeW1C2T.text	
ltx/swh_ke_oak/oc.m8.d5:ocMA.OdeW3C11.melody	@ltx/swh_ke_oak/he.h.m8:heHE.SyEiToStereoma.name
ltx/swh_ke_oak/oc.m8.d5:ocMA.OdeW3C11.mode	@ltx/swh_ke_oak/miscellanea:misc.Mode8
ltx/swh_ke_oak/oc.m8.d5:ocMA.OdeW3C11.ode	@ltx/swh_ke_oak/miscellanea:misc.Ode3
ltx/swh_ke_oak/oc.m8.d5:ocMA.OdeW3C11.text	
ltx/swh_ke_oak/oc.m8.d5:ocMA.OdeW3C12.melody	@ltx/swh_ke_oak/he.h.m8:heHE.SyEiToStereoma.name
ltx/swh_ke_oak/oc.m8.d5:ocMA.OdeW3C12.mode	@ltx/swh_ke_oak/miscellanea:misc.Mode8
ltx/swh_ke_oak/oc.m8.d5:ocMA.OdeW3C12.ode	@ltx/swh_ke_oak/miscellanea:misc.Ode3
ltx/swh_ke_oak/oc.m8.d5:ocMA.OdeW3C12.text	
ltx/swh_ke_oak/oc.m8.d5:ocMA.OdeW3C13.melody	@ltx/swh_ke_oak/he.h.m8:heHE.SyEiToStereoma.name
ltx/swh_ke_oak/oc.m8.d5:ocMA.OdeW3C13.mode	@ltx/swh_ke_oak/miscellanea:misc.Mode8
ltx/swh_ke_oak/oc.m8.d5:ocMA.OdeW3C13.ode	@ltx/swh_ke_oak/miscellanea:misc.Ode3
ltx/swh_ke_oak/oc.m8.d5:ocMA.OdeW3C13.text	
ltx/swh_ke_oak/oc.m8.d5:ocMA.OdeW3C1H.melody	@ltx/swh_ke_oak/miscellanea:misc.Heirmos
ltx/swh_ke_oak/oc.m8.d5:ocMA.OdeW3C1H.mode	@ltx/swh_ke_oak/miscellanea:misc.Mode8
ltx/swh_ke_oak/oc.m8.d5:ocMA.OdeW3C1H.ode	@ltx/swh_ke_oak/miscellanea:misc.Ode3
ltx/swh_ke_oak/oc.m8.d5:ocMA.OdeW3C1H.text	@ltx/swh_ke_oak/he.h.m8:heHE.SyEiToStereoma.text
ltx/swh_ke_oak/oc.m8.d5:ocMA.OdeW3C1T.melody	@ltx/swh_ke_oak/he.h.m8:heHE.SyEiToStereoma.name
ltx/swh_ke_oak/oc.m8.d5:ocMA.OdeW3C1T.mode	@ltx/swh_ke_oak/miscellanea:misc.Mode8
ltx/swh_ke_oak/oc.m8.d5:ocMA.OdeW3C1T.ode	@ltx/swh_ke_oak/miscellanea:misc.Ode3
ltx/swh_ke_oak/oc.m8.d5:ocMA.OdeW3C1T.text	
ltx/swh_ke_oak/oc.m8.d5:ocMA.OdeW3C21.melody	@ltx/swh_ke_oak/he.h.m8:heHE.SyEiToStereoma.name
ltx/swh_ke_oak/oc.m8.d5:ocMA.OdeW3C21.mode	@ltx/swh_ke_oak/miscellanea:misc.Mode8
ltx/swh_ke_oak/oc.m8.d5:ocMA.OdeW3C21.ode	@ltx/swh_ke_oak/miscellanea:misc.Ode3
ltx/swh_ke_oak/oc.m8.d5:ocMA.OdeW3C21.text	
ltx/swh_ke_oak/oc.m8.d5:ocMA.OdeW3C22.melody	@ltx/swh_ke_oak/he.h.m8:heHE.SyEiToStereoma.name
ltx/swh_ke_oak/oc.m8.d5:ocMA.OdeW3C22.mode	@ltx/swh_ke_oak/miscellanea:misc.Mode8
ltx/swh_ke_oak/oc.m8.d5:ocMA.OdeW3C22.ode	@ltx/swh_ke_oak/miscellanea:misc.Ode3
ltx/swh_ke_oak/oc.m8.d5:ocMA.OdeW3C22.text	
ltx/swh_ke_oak/oc.m8.d5:ocMA.OdeW3C23.melody	@ltx/swh_ke_oak/he.h.m8:heHE.SyEiToStereoma.name
ltx/swh_ke_oak/oc.m8.d5:ocMA.OdeW3C23.mode	@ltx/swh_ke_oak/miscellanea:misc.Mode8
ltx/swh_ke_oak/oc.m8.d5:ocMA.OdeW3C23.ode	@ltx/swh_ke_oak/miscellanea:misc.Ode3
ltx/swh_ke_oak/oc.m8.d5:ocMA.OdeW3C23.text	
ltx/swh_ke_oak/oc.m8.d5:ocMA.OdeW3C2T.melody	@ltx/swh_ke_oak/he.h.m8:heHE.SyEiToStereoma.name
ltx/swh_ke_oak/oc.m8.d5:ocMA.OdeW3C2T.mode	@ltx/swh_ke_oak/miscellanea:misc.Mode8
ltx/swh_ke_oak/oc.m8.d5:ocMA.OdeW3C2T.ode	@ltx/swh_ke_oak/miscellanea:misc.Ode3
ltx/swh_ke_oak/oc.m8.d5:ocMA.OdeW3C2T.text	
ltx/swh_ke_oak/oc.m8.d5:ocMA.OdeW4C11.melody	@ltx/swh_ke_oak/he.h.m8:heHE.EisakikoaKyrie.name
ltx/swh_ke_oak/oc.m8.d5:ocMA.OdeW4C11.mode	@ltx/swh_ke_oak/miscellanea:misc.Mode8
ltx/swh_ke_oak/oc.m8.d5:ocMA.OdeW4C11.ode	@ltx/swh_ke_oak/miscellanea:misc.Ode4
ltx/swh_ke_oak/oc.m8.d5:ocMA.OdeW4C11.text	
ltx/swh_ke_oak/oc.m8.d5:ocMA.OdeW4C12.melody	@ltx/swh_ke_oak/he.h.m8:heHE.EisakikoaKyrie.name
ltx/swh_ke_oak/oc.m8.d5:ocMA.OdeW4C12.mode	@ltx/swh_ke_oak/miscellanea:misc.Mode8
ltx/swh_ke_oak/oc.m8.d5:ocMA.OdeW4C12.ode	@ltx/swh_ke_oak/miscellanea:misc.Ode4
ltx/swh_ke_oak/oc.m8.d5:ocMA.OdeW4C12.text	
ltx/swh_ke_oak/oc.m8.d5:ocMA.OdeW4C13.melody	@ltx/swh_ke_oak/he.h.m8:heHE.EisakikoaKyrie.name
ltx/swh_ke_oak/oc.m8.d5:ocMA.OdeW4C13.mode	@ltx/swh_ke_oak/miscellanea:misc.Mode8
ltx/swh_ke_oak/oc.m8.d5:ocMA.OdeW4C13.ode	@ltx/swh_ke_oak/miscellanea:misc.Ode4
ltx/swh_ke_oak/oc.m8.d5:ocMA.OdeW4C13.text	
ltx/swh_ke_oak/oc.m8.d5:ocMA.OdeW4C1H.melody	@ltx/swh_ke_oak/miscellanea:misc.Heirmos
ltx/swh_ke_oak/oc.m8.d5:ocMA.OdeW4C1H.mode	@ltx/swh_ke_oak/miscellanea:misc.Mode8
ltx/swh_ke_oak/oc.m8.d5:ocMA.OdeW4C1H.ode	@ltx/swh_ke_oak/miscellanea:misc.Ode4
ltx/swh_ke_oak/oc.m8.d5:ocMA.OdeW4C1H.text	@ltx/swh_ke_oak/he.h.m8:heHE.EisakikoaKyrie.text
ltx/swh_ke_oak/oc.m8.d5:ocMA.OdeW4C1T.melody	@ltx/swh_ke_oak/he.h.m8:heHE.EisakikoaKyrie.name
ltx/swh_ke_oak/oc.m8.d5:ocMA.OdeW4C1T.mode	@ltx/swh_ke_oak/miscellanea:misc.Mode8
ltx/swh_ke_oak/oc.m8.d5:ocMA.OdeW4C1T.ode	@ltx/swh_ke_oak/miscellanea:misc.Ode4
ltx/swh_ke_oak/oc.m8.d5:ocMA.OdeW4C1T.text	
ltx/swh_ke_oak/oc.m8.d5:ocMA.OdeW4C21.melody	@ltx/swh_ke_oak/he.h.m8:heHE.EisakikoaKyrie.name
ltx/swh_ke_oak/oc.m8.d5:ocMA.OdeW4C21.mode	@ltx/swh_ke_oak/miscellanea:misc.Mode8
ltx/swh_ke_oak/oc.m8.d5:ocMA.OdeW4C21.ode	@ltx/swh_ke_oak/miscellanea:misc.Ode4
ltx/swh_ke_oak/oc.m8.d5:ocMA.OdeW4C21.text	
ltx/swh_ke_oak/oc.m8.d5:ocMA.OdeW4C22.melody	@ltx/swh_ke_oak/he.h.m8:heHE.EisakikoaKyrie.name
ltx/swh_ke_oak/oc.m8.d5:ocMA.OdeW4C22.mode	@ltx/swh_ke_oak/miscellanea:misc.Mode8
ltx/swh_ke_oak/oc.m8.d5:ocMA.OdeW4C22.ode	@ltx/swh_ke_oak/miscellanea:misc.Ode4
ltx/swh_ke_oak/oc.m8.d5:ocMA.OdeW4C22.text	
ltx/swh_ke_oak/oc.m8.d5:ocMA.OdeW4C23.melody	@ltx/swh_ke_oak/he.h.m8:heHE.EisakikoaKyrie.name
ltx/swh_ke_oak/oc.m8.d5:ocMA.OdeW4C23.mode	@ltx/swh_ke_oak/miscellanea:misc.Mode8
ltx/swh_ke_oak/oc.m8.d5:ocMA.OdeW4C23.ode	@ltx/swh_ke_oak/miscellanea:misc.Ode4
ltx/swh_ke_oak/oc.m8.d5:ocMA.OdeW4C23.text	
ltx/swh_ke_oak/oc.m8.d5:ocMA.OdeW4C2T.melody	@ltx/swh_ke_oak/he.h.m8:heHE.EisakikoaKyrie.name
ltx/swh_ke_oak/oc.m8.d5:ocMA.OdeW4C2T.mode	@ltx/swh_ke_oak/miscellanea:misc.Mode8
ltx/swh_ke_oak/oc.m8.d5:ocMA.OdeW4C2T.ode	@ltx/swh_ke_oak/miscellanea:misc.Ode4
ltx/swh_ke_oak/oc.m8.d5:ocMA.OdeW4C2T.text	
ltx/swh_ke_oak/oc.m8.d5:ocMA.OdeW5C11.melody	@ltx/swh_ke_oak/he.h.m8:heHE.OrthrizontesVoomenSoi.name
ltx/swh_ke_oak/oc.m8.d5:ocMA.OdeW5C11.mode	@ltx/swh_ke_oak/miscellanea:misc.Mode8
ltx/swh_ke_oak/oc.m8.d5:ocMA.OdeW5C11.ode	@ltx/swh_ke_oak/miscellanea:misc.Ode5
ltx/swh_ke_oak/oc.m8.d5:ocMA.OdeW5C11.text	
ltx/swh_ke_oak/oc.m8.d5:ocMA.OdeW5C12.melody	@ltx/swh_ke_oak/he.h.m8:heHE.OrthrizontesVoomenSoi.name
ltx/swh_ke_oak/oc.m8.d5:ocMA.OdeW5C12.mode	@ltx/swh_ke_oak/miscellanea:misc.Mode8
ltx/swh_ke_oak/oc.m8.d5:ocMA.OdeW5C12.ode	@ltx/swh_ke_oak/miscellanea:misc.Ode5
ltx/swh_ke_oak/oc.m8.d5:ocMA.OdeW5C12.text	
ltx/swh_ke_oak/oc.m8.d5:ocMA.OdeW5C13.melody	@ltx/swh_ke_oak/he.h.m8:heHE.OrthrizontesVoomenSoi.name
ltx/swh_ke_oak/oc.m8.d5:ocMA.OdeW5C13.mode	@ltx/swh_ke_oak/miscellanea:misc.Mode8
ltx/swh_ke_oak/oc.m8.d5:ocMA.OdeW5C13.ode	@ltx/swh_ke_oak/miscellanea:misc.Ode5
ltx/swh_ke_oak/oc.m8.d5:ocMA.OdeW5C13.text	
ltx/swh_ke_oak/oc.m8.d5:ocMA.OdeW5C1H.melody	@ltx/swh_ke_oak/miscellanea:misc.Heirmos
ltx/swh_ke_oak/oc.m8.d5:ocMA.OdeW5C1H.mode	@ltx/swh_ke_oak/miscellanea:misc.Mode8
ltx/swh_ke_oak/oc.m8.d5:ocMA.OdeW5C1H.ode	@ltx/swh_ke_oak/miscellanea:misc.Ode5
ltx/swh_ke_oak/oc.m8.d5:ocMA.OdeW5C1H.text	@ltx/swh_ke_oak/he.h.m8:heHE.OrthrizontesVoomenSoi.text
ltx/swh_ke_oak/oc.m8.d5:ocMA.OdeW5C1T.melody	@ltx/swh_ke_oak/he.h.m8:heHE.OrthrizontesVoomenSoi.name
ltx/swh_ke_oak/oc.m8.d5:ocMA.OdeW5C1T.mode	@ltx/swh_ke_oak/miscellanea:misc.Mode8
ltx/swh_ke_oak/oc.m8.d5:ocMA.OdeW5C1T.ode	@ltx/swh_ke_oak/miscellanea:misc.Ode5
ltx/swh_ke_oak/oc.m8.d5:ocMA.OdeW5C1T.text	
ltx/swh_ke_oak/oc.m8.d5:ocMA.OdeW5C21.melody	@ltx/swh_ke_oak/he.h.m8:heHE.OrthrizontesVoomenSoi.name
ltx/swh_ke_oak/oc.m8.d5:ocMA.OdeW5C21.mode	@ltx/swh_ke_oak/miscellanea:misc.Mode8
ltx/swh_ke_oak/oc.m8.d5:ocMA.OdeW5C21.ode	@ltx/swh_ke_oak/miscellanea:misc.Ode5
ltx/swh_ke_oak/oc.m8.d5:ocMA.OdeW5C21.text	
ltx/swh_ke_oak/oc.m8.d5:ocMA.OdeW5C22.melody	@ltx/swh_ke_oak/he.h.m8:heHE.OrthrizontesVoomenSoi.name
ltx/swh_ke_oak/oc.m8.d5:ocMA.OdeW5C22.mode	@ltx/swh_ke_oak/miscellanea:misc.Mode8
ltx/swh_ke_oak/oc.m8.d5:ocMA.OdeW5C22.ode	@ltx/swh_ke_oak/miscellanea:misc.Ode5
ltx/swh_ke_oak/oc.m8.d5:ocMA.OdeW5C22.text	
ltx/swh_ke_oak/oc.m8.d5:ocMA.OdeW5C23.melody	@ltx/swh_ke_oak/he.h.m8:heHE.OrthrizontesVoomenSoi.name
ltx/swh_ke_oak/oc.m8.d5:ocMA.OdeW5C23.mode	@ltx/swh_ke_oak/miscellanea:misc.Mode8
ltx/swh_ke_oak/oc.m8.d5:ocMA.OdeW5C23.ode	@ltx/swh_ke_oak/miscellanea:misc.Ode5
ltx/swh_ke_oak/oc.m8.d5:ocMA.OdeW5C23.text	
ltx/swh_ke_oak/oc.m8.d5:ocMA.OdeW5C2T.melody	@ltx/swh_ke_oak/he.h.m8:heHE.OrthrizontesVoomenSoi.name
ltx/swh_ke_oak/oc.m8.d5:ocMA.OdeW5C2T.mode	@ltx/swh_ke_oak/miscellanea:misc.Mode8
ltx/swh_ke_oak/oc.m8.d5:ocMA.OdeW5C2T.ode	@ltx/swh_ke_oak/miscellanea:misc.Ode5
ltx/swh_ke_oak/oc.m8.d5:ocMA.OdeW5C2T.text	
ltx/swh_ke_oak/oc.m8.d5:ocMA.OdeW6C11.melody	@ltx/swh_ke_oak/he.h.m8:heHE.TinDeisinEkcheo.name
ltx/swh_ke_oak/oc.m8.d5:ocMA.OdeW6C11.mode	@ltx/swh_ke_oak/miscellanea:misc.Mode8
ltx/swh_ke_oak/oc.m8.d5:ocMA.OdeW6C11.ode	@ltx/swh_ke_oak/miscellanea:misc.Ode6
ltx/swh_ke_oak/oc.m8.d5:ocMA.OdeW6C11.text	
ltx/swh_ke_oak/oc.m8.d5:ocMA.OdeW6C12.melody	@ltx/swh_ke_oak/he.h.m8:heHE.TinDeisinEkcheo.name
ltx/swh_ke_oak/oc.m8.d5:ocMA.OdeW6C12.mode	@ltx/swh_ke_oak/miscellanea:misc.Mode8
ltx/swh_ke_oak/oc.m8.d5:ocMA.OdeW6C12.ode	@ltx/swh_ke_oak/miscellanea:misc.Ode6
ltx/swh_ke_oak/oc.m8.d5:ocMA.OdeW6C12.text	
ltx/swh_ke_oak/oc.m8.d5:ocMA.OdeW6C13.melody	@ltx/swh_ke_oak/he.h.m8:heHE.TinDeisinEkcheo.name
ltx/swh_ke_oak/oc.m8.d5:ocMA.OdeW6C13.mode	@ltx/swh_ke_oak/miscellanea:misc.Mode8
ltx/swh_ke_oak/oc.m8.d5:ocMA.OdeW6C13.ode	@ltx/swh_ke_oak/miscellanea:misc.Ode6
ltx/swh_ke_oak/oc.m8.d5:ocMA.OdeW6C13.text	
ltx/swh_ke_oak/oc.m8.d5:ocMA.OdeW6C1H.melody	@ltx/swh_ke_oak/miscellanea:misc.Heirmos
ltx/swh_ke_oak/oc.m8.d5:ocMA.OdeW6C1H.mode	@ltx/swh_ke_oak/miscellanea:misc.Mode8
ltx/swh_ke_oak/oc.m8.d5:ocMA.OdeW6C1H.ode	@ltx/swh_ke_oak/miscellanea:misc.Ode6
ltx/swh_ke_oak/oc.m8.d5:ocMA.OdeW6C1H.text	@ltx/swh_ke_oak/he.h.m8:heHE.TinDeisinEkcheo.text
ltx/swh_ke_oak/oc.m8.d5:ocMA.OdeW6C1T.melody	@ltx/swh_ke_oak/he.h.m8:heHE.TinDeisinEkcheo.name
ltx/swh_ke_oak/oc.m8.d5:ocMA.OdeW6C1T.mode	@ltx/swh_ke_oak/miscellanea:misc.Mode8
ltx/swh_ke_oak/oc.m8.d5:ocMA.OdeW6C1T.ode	@ltx/swh_ke_oak/miscellanea:misc.Ode6
ltx/swh_ke_oak/oc.m8.d5:ocMA.OdeW6C1T.text	
ltx/swh_ke_oak/oc.m8.d5:ocMA.OdeW6C21.melody	@ltx/swh_ke_oak/he.h.m8:heHE.TinDeisinEkcheo.name
ltx/swh_ke_oak/oc.m8.d5:ocMA.OdeW6C21.mode	@ltx/swh_ke_oak/miscellanea:misc.Mode8
ltx/swh_ke_oak/oc.m8.d5:ocMA.OdeW6C21.ode	@ltx/swh_ke_oak/miscellanea:misc.Ode6
ltx/swh_ke_oak/oc.m8.d5:ocMA.OdeW6C21.text	
ltx/swh_ke_oak/oc.m8.d5:ocMA.OdeW6C22.melody	@ltx/swh_ke_oak/he.h.m8:heHE.TinDeisinEkcheo.name
ltx/swh_ke_oak/oc.m8.d5:ocMA.OdeW6C22.mode	@ltx/swh_ke_oak/miscellanea:misc.Mode8
ltx/swh_ke_oak/oc.m8.d5:ocMA.OdeW6C22.ode	@ltx/swh_ke_oak/miscellanea:misc.Ode6
ltx/swh_ke_oak/oc.m8.d5:ocMA.OdeW6C22.text	
ltx/swh_ke_oak/oc.m8.d5:ocMA.OdeW6C23.melody	@ltx/swh_ke_oak/he.h.m8:heHE.TinDeisinEkcheo.name
ltx/swh_ke_oak/oc.m8.d5:ocMA.OdeW6C23.mode	@ltx/swh_ke_oak/miscellanea:misc.Mode8
ltx/swh_ke_oak/oc.m8.d5:ocMA.OdeW6C23.ode	@ltx/swh_ke_oak/miscellanea:misc.Ode6
ltx/swh_ke_oak/oc.m8.d5:ocMA.OdeW6C23.text	
ltx/swh_ke_oak/oc.m8.d5:ocMA.OdeW6C2T.melody	@ltx/swh_ke_oak/he.h.m8:heHE.TinDeisinEkcheo.name
ltx/swh_ke_oak/oc.m8.d5:ocMA.OdeW6C2T.mode	@ltx/swh_ke_oak/miscellanea:misc.Mode8
ltx/swh_ke_oak/oc.m8.d5:ocMA.OdeW6C2T.ode	@ltx/swh_ke_oak/miscellanea:misc.Ode6
ltx/swh_ke_oak/oc.m8.d5:ocMA.OdeW6C2T.text	
ltx/swh_ke_oak/oc.m8.d5:ocMA.OdeW7C11.melody	@ltx/swh_ke_oak/he.h.m8:heHE.PaidesEvraion.name
ltx/swh_ke_oak/oc.m8.d5:ocMA.OdeW7C11.mode	@ltx/swh_ke_oak/miscellanea:misc.Mode8
ltx/swh_ke_oak/oc.m8.d5:ocMA.OdeW7C11.ode	@ltx/swh_ke_oak/miscellanea:misc.Ode7
ltx/swh_ke_oak/oc.m8.d5:ocMA.OdeW7C11.text	
ltx/swh_ke_oak/oc.m8.d5:ocMA.OdeW7C12.melody	@ltx/swh_ke_oak/he.h.m8:heHE.PaidesEvraion.name
ltx/swh_ke_oak/oc.m8.d5:ocMA.OdeW7C12.mode	@ltx/swh_ke_oak/miscellanea:misc.Mode8
ltx/swh_ke_oak/oc.m8.d5:ocMA.OdeW7C12.ode	@ltx/swh_ke_oak/miscellanea:misc.Ode7
ltx/swh_ke_oak/oc.m8.d5:ocMA.OdeW7C12.text	
ltx/swh_ke_oak/oc.m8.d5:ocMA.OdeW7C13.melody	@ltx/swh_ke_oak/he.h.m8:heHE.PaidesEvraion.name
ltx/swh_ke_oak/oc.m8.d5:ocMA.OdeW7C13.mode	@ltx/swh_ke_oak/miscellanea:misc.Mode8
ltx/swh_ke_oak/oc.m8.d5:ocMA.OdeW7C13.ode	@ltx/swh_ke_oak/miscellanea:misc.Ode7
ltx/swh_ke_oak/oc.m8.d5:ocMA.OdeW7C13.text	
ltx/swh_ke_oak/oc.m8.d5:ocMA.OdeW7C1H.melody	@ltx/swh_ke_oak/miscellanea:misc.Heirmos
ltx/swh_ke_oak/oc.m8.d5:ocMA.OdeW7C1H.mode	@ltx/swh_ke_oak/miscellanea:misc.Mode8
ltx/swh_ke_oak/oc.m8.d5:ocMA.OdeW7C1H.ode	@ltx/swh_ke_oak/miscellanea:misc.Ode7
ltx/swh_ke_oak/oc.m8.d5:ocMA.OdeW7C1H.text	@ltx/swh_ke_oak/he.h.m8:heHE.PaidesEvraion.text
ltx/swh_ke_oak/oc.m8.d5:ocMA.OdeW7C1T.melody	@ltx/swh_ke_oak/he.h.m8:heHE.PaidesEvraion.name
ltx/swh_ke_oak/oc.m8.d5:ocMA.OdeW7C1T.mode	@ltx/swh_ke_oak/miscellanea:misc.Mode8
ltx/swh_ke_oak/oc.m8.d5:ocMA.OdeW7C1T.ode	@ltx/swh_ke_oak/miscellanea:misc.Ode7
ltx/swh_ke_oak/oc.m8.d5:ocMA.OdeW7C1T.text	
ltx/swh_ke_oak/oc.m8.d5:ocMA.OdeW7C21.melody	@ltx/swh_ke_oak/he.h.m8:heHE.PaidesEvraion.name
ltx/swh_ke_oak/oc.m8.d5:ocMA.OdeW7C21.mode	@ltx/swh_ke_oak/miscellanea:misc.Mode8
ltx/swh_ke_oak/oc.m8.d5:ocMA.OdeW7C21.ode	@ltx/swh_ke_oak/miscellanea:misc.Ode7
ltx/swh_ke_oak/oc.m8.d5:ocMA.OdeW7C21.text	
ltx/swh_ke_oak/oc.m8.d5:ocMA.OdeW7C22.melody	@ltx/swh_ke_oak/he.h.m8:heHE.PaidesEvraion.name
ltx/swh_ke_oak/oc.m8.d5:ocMA.OdeW7C22.mode	@ltx/swh_ke_oak/miscellanea:misc.Mode8
ltx/swh_ke_oak/oc.m8.d5:ocMA.OdeW7C22.ode	@ltx/swh_ke_oak/miscellanea:misc.Ode7
ltx/swh_ke_oak/oc.m8.d5:ocMA.OdeW7C22.text	
ltx/swh_ke_oak/oc.m8.d5:ocMA.OdeW7C23.melody	@ltx/swh_ke_oak/he.h.m8:heHE.PaidesEvraion.name
ltx/swh_ke_oak/oc.m8.d5:ocMA.OdeW7C23.mode	@ltx/swh_ke_oak/miscellanea:misc.Mode8
ltx/swh_ke_oak/oc.m8.d5:ocMA.OdeW7C23.ode	@ltx/swh_ke_oak/miscellanea:misc.Ode7
ltx/swh_ke_oak/oc.m8.d5:ocMA.OdeW7C23.text	
ltx/swh_ke_oak/oc.m8.d5:ocMA.OdeW7C2T.melody	@ltx/swh_ke_oak/he.h.m8:heHE.PaidesEvraion.name
ltx/swh_ke_oak/oc.m8.d5:ocMA.OdeW7C2T.mode	@ltx/swh_ke_oak/miscellanea:misc.Mode8
ltx/swh_ke_oak/oc.m8.d5:ocMA.OdeW7C2T.ode	@ltx/swh_ke_oak/miscellanea:misc.Ode7
ltx/swh_ke_oak/oc.m8.d5:ocMA.OdeW7C2T.text	
ltx/swh_ke_oak/oc.m8.d5:ocMA.OdeW8C11.melody	@ltx/swh_ke_oak/he.h.m8:heHE.EptaplasiosKaminon.name
ltx/swh_ke_oak/oc.m8.d5:ocMA.OdeW8C11.mode	@ltx/swh_ke_oak/miscellanea:misc.Mode8
ltx/swh_ke_oak/oc.m8.d5:ocMA.OdeW8C11.ode	@ltx/swh_ke_oak/miscellanea:misc.Ode8
ltx/swh_ke_oak/oc.m8.d5:ocMA.OdeW8C11.text	
ltx/swh_ke_oak/oc.m8.d5:ocMA.OdeW8C12.melody	@ltx/swh_ke_oak/he.h.m8:heHE.EptaplasiosKaminon.name
ltx/swh_ke_oak/oc.m8.d5:ocMA.OdeW8C12.mode	@ltx/swh_ke_oak/miscellanea:misc.Mode8
ltx/swh_ke_oak/oc.m8.d5:ocMA.OdeW8C12.ode	@ltx/swh_ke_oak/miscellanea:misc.Ode8
ltx/swh_ke_oak/oc.m8.d5:ocMA.OdeW8C12.text	
ltx/swh_ke_oak/oc.m8.d5:ocMA.OdeW8C1H.melody	@ltx/swh_ke_oak/miscellanea:misc.Heirmos
ltx/swh_ke_oak/oc.m8.d5:ocMA.OdeW8C1H.mode	@ltx/swh_ke_oak/miscellanea:misc.Mode8
ltx/swh_ke_oak/oc.m8.d5:ocMA.OdeW8C1H.ode	@ltx/swh_ke_oak/miscellanea:misc.Ode8
ltx/swh_ke_oak/oc.m8.d5:ocMA.OdeW8C1H.text	@ltx/swh_ke_oak/he.h.m8:heHE.EptaplasiosKaminon.text
ltx/swh_ke_oak/oc.m8.d5:ocMA.OdeW8C1T.melody	@ltx/swh_ke_oak/he.h.m8:heHE.EptaplasiosKaminon.name
ltx/swh_ke_oak/oc.m8.d5:ocMA.OdeW8C1T.mode	@ltx/swh_ke_oak/miscellanea:misc.Mode8
ltx/swh_ke_oak/oc.m8.d5:ocMA.OdeW8C1T.ode	@ltx/swh_ke_oak/miscellanea:misc.Ode8
ltx/swh_ke_oak/oc.m8.d5:ocMA.OdeW8C1T.text	
ltx/swh_ke_oak/oc.m8.d5:ocMA.OdeW8C21.melody	@ltx/swh_ke_oak/he.h.m8:heHE.OiTheorrimonesPaides.name
ltx/swh_ke_oak/oc.m8.d5:ocMA.OdeW8C21.mode	@ltx/swh_ke_oak/miscellanea:misc.Mode8
ltx/swh_ke_oak/oc.m8.d5:ocMA.OdeW8C21.ode	@ltx/swh_ke_oak/miscellanea:misc.Ode8
ltx/swh_ke_oak/oc.m8.d5:ocMA.OdeW8C21.text	
ltx/swh_ke_oak/oc.m8.d5:ocMA.OdeW8C22.melody	@ltx/swh_ke_oak/he.h.m8:heHE.OiTheorrimonesPaides.name
ltx/swh_ke_oak/oc.m8.d5:ocMA.OdeW8C22.mode	@ltx/swh_ke_oak/miscellanea:misc.Mode8
ltx/swh_ke_oak/oc.m8.d5:ocMA.OdeW8C22.ode	@ltx/swh_ke_oak/miscellanea:misc.Ode8
ltx/swh_ke_oak/oc.m8.d5:ocMA.OdeW8C22.text	
ltx/swh_ke_oak/oc.m8.d5:ocMA.OdeW8C23.melody	@ltx/swh_ke_oak/he.h.m8:heHE.OiTheorrimonesPaides.name
ltx/swh_ke_oak/oc.m8.d5:ocMA.OdeW8C23.mode	@ltx/swh_ke_oak/miscellanea:misc.Mode8
ltx/swh_ke_oak/oc.m8.d5:ocMA.OdeW8C23.ode	@ltx/swh_ke_oak/miscellanea:misc.Ode8
ltx/swh_ke_oak/oc.m8.d5:ocMA.OdeW8C23.text	
ltx/swh_ke_oak/oc.m8.d5:ocMA.OdeW8C2T.melody	@ltx/swh_ke_oak/he.h.m8:heHE.OiTheorrimonesPaides.name
ltx/swh_ke_oak/oc.m8.d5:ocMA.OdeW8C2T.mode	@ltx/swh_ke_oak/miscellanea:misc.Mode8
ltx/swh_ke_oak/oc.m8.d5:ocMA.OdeW8C2T.ode	@ltx/swh_ke_oak/miscellanea:misc.Ode8
ltx/swh_ke_oak/oc.m8.d5:ocMA.OdeW8C2T.text	
ltx/swh_ke_oak/oc.m8.d5:ocMA.OdeW9C11.melody	@ltx/swh_ke_oak/he.h.m8:heHE.ExestiEpiTouto.name
ltx/swh_ke_oak/oc.m8.d5:ocMA.OdeW9C11.mode	@ltx/swh_ke_oak/miscellanea:misc.Mode8
ltx/swh_ke_oak/oc.m8.d5:ocMA.OdeW9C11.ode	@ltx/swh_ke_oak/miscellanea:misc.Ode9
ltx/swh_ke_oak/oc.m8.d5:ocMA.OdeW9C11.text	
ltx/swh_ke_oak/oc.m8.d5:ocMA.OdeW9C12.melody	@ltx/swh_ke_oak/he.h.m8:heHE.ExestiEpiTouto.name
ltx/swh_ke_oak/oc.m8.d5:ocMA.OdeW9C12.mode	@ltx/swh_ke_oak/miscellanea:misc.Mode8
ltx/swh_ke_oak/oc.m8.d5:ocMA.OdeW9C12.ode	@ltx/swh_ke_oak/miscellanea:misc.Ode9
ltx/swh_ke_oak/oc.m8.d5:ocMA.OdeW9C12.text	
ltx/swh_ke_oak/oc.m8.d5:ocMA.OdeW9C13.melody	@ltx/swh_ke_oak/he.h.m8:heHE.ExestiEpiTouto.name
ltx/swh_ke_oak/oc.m8.d5:ocMA.OdeW9C13.mode	@ltx/swh_ke_oak/miscellanea:misc.Mode8
ltx/swh_ke_oak/oc.m8.d5:ocMA.OdeW9C13.ode	@ltx/swh_ke_oak/miscellanea:misc.Ode9
ltx/swh_ke_oak/oc.m8.d5:ocMA.OdeW9C13.text	
ltx/swh_ke_oak/oc.m8.d5:ocMA.OdeW9C1H.melody	@ltx/swh_ke_oak/miscellanea:misc.Heirmos
ltx/swh_ke_oak/oc.m8.d5:ocMA.OdeW9C1H.mode	@ltx/swh_ke_oak/miscellanea:misc.Mode8
ltx/swh_ke_oak/oc.m8.d5:ocMA.OdeW9C1H.ode	@ltx/swh_ke_oak/miscellanea:misc.Ode9
ltx/swh_ke_oak/oc.m8.d5:ocMA.OdeW9C1H.text	@ltx/swh_ke_oak/he.h.m8:heHE.ExestiEpiTouto.text
ltx/swh_ke_oak/oc.m8.d5:ocMA.OdeW9C1T.melody	@ltx/swh_ke_oak/he.h.m8:heHE.ExestiEpiTouto.name
ltx/swh_ke_oak/oc.m8.d5:ocMA.OdeW9C1T.mode	@ltx/swh_ke_oak/miscellanea:misc.Mode8
ltx/swh_ke_oak/oc.m8.d5:ocMA.OdeW9C1T.ode	@ltx/swh_ke_oak/miscellanea:misc.Ode9
ltx/swh_ke_oak/oc.m8.d5:ocMA.OdeW9C1T.text	
ltx/swh_ke_oak/oc.m8.d5:ocMA.OdeW9C21.melody	@ltx/swh_ke_oak/he.h.m8:heHE.KyriosTheotokon.name
ltx/swh_ke_oak/oc.m8.d5:ocMA.OdeW9C21.mode	@ltx/swh_ke_oak/miscellanea:misc.Mode8
ltx/swh_ke_oak/oc.m8.d5:ocMA.OdeW9C21.ode	@ltx/swh_ke_oak/miscellanea:misc.Ode9
ltx/swh_ke_oak/oc.m8.d5:ocMA.OdeW9C21.text	
ltx/swh_ke_oak/oc.m8.d5:ocMA.OdeW9C22.melody	@ltx/swh_ke_oak/he.h.m8:heHE.KyriosTheotokon.name
ltx/swh_ke_oak/oc.m8.d5:ocMA.OdeW9C22.mode	@ltx/swh_ke_oak/miscellanea:misc.Mode8
ltx/swh_ke_oak/oc.m8.d5:ocMA.OdeW9C22.ode	@ltx/swh_ke_oak/miscellanea:misc.Ode9
ltx/swh_ke_oak/oc.m8.d5:ocMA.OdeW9C22.text	
ltx/swh_ke_oak/oc.m8.d5:ocMA.OdeW9C23.melody	@ltx/swh_ke_oak/he.h.m8:heHE.KyriosTheotokon.name
ltx/swh_ke_oak/oc.m8.d5:ocMA.OdeW9C23.mode	@ltx/swh_ke_oak/miscellanea:misc.Mode8
ltx/swh_ke_oak/oc.m8.d5:ocMA.OdeW9C23.ode	@ltx/swh_ke_oak/miscellanea:misc.Ode9
ltx/swh_ke_oak/oc.m8.d5:ocMA.OdeW9C23.text	
ltx/swh_ke_oak/oc.m8.d5:ocMA.OdeW9C2T.melody	@ltx/swh_ke_oak/he.h.m8:heHE.KyriosTheotokon.name
ltx/swh_ke_oak/oc.m8.d5:ocMA.OdeW9C2T.mode	@ltx/swh_ke_oak/miscellanea:misc.Mode8
ltx/swh_ke_oak/oc.m8.d5:ocMA.OdeW9C2T.ode	@ltx/swh_ke_oak/miscellanea:misc.Ode9
ltx/swh_ke_oak/oc.m8.d5:ocMA.OdeW9C2T.text	
ltx/swh_ke_oak/oc.m8.d5:ocVE.ApolTheotokionVM.melody	
ltx/swh_ke_oak/oc.m8.d5:ocVE.ApolTheotokionVM.mode	@ltx/swh_ke_oak/miscellanea:misc.Mode8
ltx/swh_ke_oak/oc.m8.d5:ocVE.ApolTheotokionVM.text	@ltx/swh_ke_oak/oc.m8.d5:ocMA.Kathisma33.text
ltx/swh_ke_oak/oc.m8.d5:ocVE.AposTheotokion.melody	@ltx/swh_ke_oak/he.a.m8:heAU.TiYmasKalesomen.name
ltx/swh_ke_oak/oc.m8.d5:ocVE.AposTheotokion.mode	@ltx/swh_ke_oak/miscellanea:misc.Mode8
ltx/swh_ke_oak/oc.m8.d5:ocVE.AposTheotokion.text	
ltx/swh_ke_oak/oc.m8.d5:ocVE.Aposticha1.melody	@ltx/swh_ke_oak/he.a.m8:heAU.KyrieEiKaiKritirio.name
ltx/swh_ke_oak/oc.m8.d5:ocVE.Aposticha1.mode	@ltx/swh_ke_oak/miscellanea:misc.Mode8
ltx/swh_ke_oak/oc.m8.d5:ocVE.Aposticha1.text	
ltx/swh_ke_oak/oc.m8.d5:ocVE.Aposticha2.melody	@ltx/swh_ke_oak/he.a.m8:heAU.KyrieEiKaiKritirio.name
ltx/swh_ke_oak/oc.m8.d5:ocVE.Aposticha2.mode	@ltx/swh_ke_oak/miscellanea:misc.Mode8
ltx/swh_ke_oak/oc.m8.d5:ocVE.Aposticha2.text	
ltx/swh_ke_oak/oc.m8.d5:ocVE.Aposticha3.melody	
ltx/swh_ke_oak/oc.m8.d5:ocVE.Aposticha3.mode	@ltx/swh_ke_oak/miscellanea:misc.Mode8
ltx/swh_ke_oak/oc.m8.d5:ocVE.Aposticha3.text	
ltx/swh_ke_oak/oc.m8.d5:ocVE.SticTheotokion.melody	@ltx/swh_ke_oak/he.a.m8:heAU.KyrieEiKaiKritirio.name
ltx/swh_ke_oak/oc.m8.d5:ocVE.SticTheotokion.mode	@ltx/swh_ke_oak/miscellanea:misc.Mode8
ltx/swh_ke_oak/oc.m8.d5:ocVE.SticTheotokion.text	
ltx/swh_ke_oak/oc.m8.d5:ocVE.Stichera1.melody	@ltx/swh_ke_oak/he.a.m8:heAU.KyrieEiKaiKritirio.name
ltx/swh_ke_oak/oc.m8.d5:ocVE.Stichera1.mode	@ltx/swh_ke_oak/miscellanea:misc.Mode8
ltx/swh_ke_oak/oc.m8.d5:ocVE.Stichera1.text	
ltx/swh_ke_oak/oc.m8.d5:ocVE.Stichera2.melody	@ltx/swh_ke_oak/he.a.m8:heAU.KyrieEiKaiKritirio.name
ltx/swh_ke_oak/oc.m8.d5:ocVE.Stichera2.mode	@ltx/swh_ke_oak/miscellanea:misc.Mode8
ltx/swh_ke_oak/oc.m8.d5:ocVE.Stichera2.text	
ltx/swh_ke_oak/oc.m8.d5:ocVE.Stichera3.melody	@ltx/swh_ke_oak/he.a.m8:heAU.KyrieEiKaiKritirio.name
ltx/swh_ke_oak/oc.m8.d5:ocVE.Stichera3.mode	@ltx/swh_ke_oak/miscellanea:misc.Mode8
ltx/swh_ke_oak/oc.m8.d5:ocVE.Stichera3.text	
ltx/swh_ke_oak/oc.m8.d5:ocVE.Stichera4.melody	@ltx/swh_ke_oak/he.a.m8:heAU.KyrieEiKaiKritirio.name
ltx/swh_ke_oak/oc.m8.d5:ocVE.Stichera4.mode	@ltx/swh_ke_oak/miscellanea:misc.Mode8
ltx/swh_ke_oak/oc.m8.d5:ocVE.Stichera4.text	
ltx/swh_ke_oak/oc.m8.d5:ocVE.Stichera5.melody	@ltx/swh_ke_oak/he.a.m8:heAU.KyrieEiKaiKritirio.name
ltx/swh_ke_oak/oc.m8.d5:ocVE.Stichera5.mode	@ltx/swh_ke_oak/miscellanea:misc.Mode8
ltx/swh_ke_oak/oc.m8.d5:ocVE.Stichera5.text	
ltx/swh_ke_oak/oc.m8.d5:ocVE.Stichera6.melody	@ltx/swh_ke_oak/he.a.m8:heAU.KyrieEiKaiKritirio.name
ltx/swh_ke_oak/oc.m8.d5:ocVE.Stichera6.mode	@ltx/swh_ke_oak/miscellanea:misc.Mode8
ltx/swh_ke_oak/oc.m8.d5:ocVE.Stichera6.text	
ltx/swh_ke_oak/oc.m8.d5:octrMA.Kathisma11.melody	
ltx/swh_ke_oak/oc.m8.d5:octrMA.Kathisma11.mode	@ltx/swh_ke_oak/miscellanea:misc.Mode8
ltx/swh_ke_oak/oc.m8.d5:octrMA.Kathisma11.text	@ltx/swh_ke_oak/pe.d120:peVE.Apolytikion1.text
ltx/swh_ke_oak/oc.m8.d5:octrMA.Kathisma12.melody	@ltx/swh_ke_oak/he.a.m8:heAU.TinSofianKaiLogon.name
ltx/swh_ke_oak/oc.m8.d5:octrMA.Kathisma12.mode	@ltx/swh_ke_oak/miscellanea:misc.Mode8
ltx/swh_ke_oak/oc.m8.d5:octrMA.Kathisma12.text	
ltx/swh_ke_oak/oc.m8.d5:octrMA.Kathisma1T.melody	
ltx/swh_ke_oak/oc.m8.d5:octrMA.Kathisma1T.mode	@ltx/swh_ke_oak/miscellanea:misc.Mode8
ltx/swh_ke_oak/oc.m8.d5:octrMA.Kathisma1T.text	
ltx/swh_ke_oak/oc.m8.d5:octrMA.Ode7Martyricon.melody	
ltx/swh_ke_oak/oc.m8.d5:octrMA.Ode7Martyricon.mode	@ltx/swh_ke_oak/miscellanea:misc.Mode8
ltx/swh_ke_oak/oc.m8.d5:octrMA.Ode7Martyricon.text	
ltx/swh_ke_oak/oc.m8.d5:octrMA.Photogogic.mode	@ltx/swh_ke_oak/miscellanea:misc.Mode8
ltx/swh_ke_oak/oc.m8.d5:octrMA.Photogogic.text	@ltx/swh_ke_oak/oc.m8.d2:octrMA.Photagogic.text
ltx/swh_ke_oak/oc.m8.d5:octrMA.Triadic1.mode	@ltx/swh_ke_oak/miscellanea:misc.Mode8
ltx/swh_ke_oak/oc.m8.d5:octrMA.Triadic1.text	@ltx/swh_ke_oak/oc.m8.d2:octrMA.Triadic1.text
ltx/swh_ke_oak/oc.m8.d5:octrMA.Triadic2.mode	@ltx/swh_ke_oak/miscellanea:misc.Mode8
ltx/swh_ke_oak/oc.m8.d5:octrMA.Triadic2.text	@ltx/swh_ke_oak/oc.m8.d2:octrMA.Triadic2.text
ltx/swh_ke_oak/oc.m8.d5:octrMA.Triadic3.mode	@ltx/swh_ke_oak/miscellanea:misc.Mode8
ltx/swh_ke_oak/oc.m8.d5:octrMA.Triadic3.text	@ltx/swh_ke_oak/oc.m8.d2:octrMA.Triadic3.text
