ltx/swh_ke_oak/le.go.mc.d012:lemcLI.Gospel.book	@ltx/swh_ke_oak/bible:Mark
ltx/swh_ke_oak/le.go.mc.d012:lemcLI.Gospel.chapverse	(15:1-15)
ltx/swh_ke_oak/le.go.mc.d012:lemcLI.Gospel.text	Kulipopambazuka, makuhani wakuu walifanya shauri pamoja na wazee, waalimu wa sheria na Baraza lote, wakamfunga Yesu pingu, wakampeleka na kumkabidhi kwa Pilato. Pilato akamwuliza Yesu, "Je, wewe ni Mfalme wa Wayahudi?" Yesu akajibu, "Wewe umesema." Makuhani wakuu wakamshtaki Yesu mambo mengi. Pilato akamwuliza tena Yesu, "Je, hujibu neno? Tazama wanavyotoa mashtaka mengi juu yako." Lakini Yesu hakujibu neno, hata Pilato akashangaa. Kila wakati wa sikukuu ya Pasaka, Pilato alikuwa na desturi ya kuwafungulia mfungwa mmoja waliyemtaka. Basi, kulikuwa na mtu mmoja aitwaye Baraba, ambaye alikuwa amefungwa pamoja na waasi wengine kwa kusababisha uasi na mauaji. Watu wengi wakamwendea Pilato wakamwomba awafanyie kama kawaida yake. Pilato akawauliza, "Je, mwataka niwafungulieni Mfalme wa Wayahudi?" Alisema hivyo kwa sababu alijua wazi kwamba makuhani wakuu walimkabidhi Yesu kwake kwa sababu ya wivu. Lakini makuhani wakuu wakawachochea watu wamwombe Pilato awafungulie Baraba. Pilato akawauliza tena, "Basi, sasa mwataka nifanye nini na mtu huyu mnayemwita Mfalme wa Wayahudi?" Watu wote wakapaaza sauti tena: "Msulubishe!" Lakini Pilato akawauliza, "Kwa nini! Amefanya ubaya gani?" Lakini wao wakazidi kupaaza sauti, "Msulubishe!" Pilato alitaka kuuridhisha huo umati wa watu; basi, akamwachilia Baraba kutoka gerezani. Akaamuru Yesu apigwe viboko, kisha akamtoa asulubiwe.
ltx/swh_ke_oak/le.go.mc.d012:lemcLI.Gospel.title	
ltx/swh_ke_oak/le.go.mc.d012:lemcLI.Gospel.version	
