ltx/swh_ke_oak/le.ep.mc.d126:lemcLI.Epistle.book	@ltx/swh_ke_oak/bible:Romans
ltx/swh_ke_oak/le.ep.mc.d126:lemcLI.Epistle.chapverse	(1:7-12)
ltx/swh_ke_oak/le.ep.mc.d126:lemcLI.Epistle.text	Ndugu zangu, nawatakieni neema na amani kutoka kwa Mungu Baba yetu na Bwana Yesu Kristo. Awali ya yote, namshukuru Mungu wangu kwa njia ya Yesu Kristo kwa ajili yenu nyote, kwa sababu imani yenu inasikika duniani kote. Mungu, ambaye ninamtumikia kwa moyo wangu wote katika kuhubiri Habari Njema ya Mwanae, ni shahidi wangu kwamba ninawakumbukeni daima katika sala zangu. Namwomba Mungu akipenda, anipatie nafasi nzuri ya kuja kwenu sasa. Kwa maana ninatamani sana kuwaoneni ili nipate kuwagawieni zawadi ya kiroho na kuwaimarisha. Ndiyo kusema, tutaimarishana: imani yenu itaniimarisha mimi, na yangu itawaimarisha nyinyi.
ltx/swh_ke_oak/le.ep.mc.d126:lemcLI.Epistle.title	
ltx/swh_ke_oak/le.ep.mc.d126:lemcLI.Epistle.version	
