ltx/swh_ke_oak/le.pr.me.r85:leprVE.reading.book	@ltx/swh_ke_oak/bible:Micah
ltx/swh_ke_oak/le.pr.me.r85:leprVE.reading.chapverse	(5:1-3)
ltx/swh_ke_oak/le.pr.me.r85:leprVE.reading.text	Mwenyezi-Mungu asema, "Lakini wewe Bethlehemu katika Efratha, wewe ni mdogo tu kati ya jamii za Yuda, lakini kwako kutatoka mtawala atakayetawala juu ya Israeli kwa niaba yangu. Asili yake ni ya zama za kale." Hivyo Mungu atawaacha watu wake kwa maadui, mpaka yule mama mjamzito atakapojifungua. Kisha ndugu zake waliobakia, watarudi na kuungana na Waisraeli wenzao. Huyo mtawala atawachunga watu wake kwa nguvu ya Mwenyezi-Mungu, kwa fahari yake Mwenyezi-Mungu, Mungu wake. Watu wake wataishi kwa usalama, maana atakuwa mkuu mpaka miisho ya dunia."
ltx/swh_ke_oak/le.pr.me.r85:leprVE.reading.title	
ltx/swh_ke_oak/le.pr.me.r85:leprVE.reading.version	@ltx/swh_ke_oak/properties:version.designation
