ltx/swh_ke_oak/le.ep.mc.d307:lemcLI.Epistle.book	@ltx/swh_ke_oak/bible:Timothy2
ltx/swh_ke_oak/le.ep.mc.d307:lemcLI.Epistle.chapverse	(1:1-2; 8-18)
ltx/swh_ke_oak/le.ep.mc.d307:lemcLI.Epistle.pagenumber	
ltx/swh_ke_oak/le.ep.mc.d307:lemcLI.Epistle.text	Mimi Paulo, ambaye Mungu alitaka niwe mtume wa Kristo Yesu ili niutangaze ule uhai tulioahidiwa katika kuungana na Kristo Yesu, nakuandikia wewe mwanangu mpenzi Timotheo. Nakutakia neema, huruma na amani kutoka kwa Mungu Baba na Kristo Yesu Bwana wetu. Basi, usione haya kumshuhudia Bwana wetu, wala usione haya kwa sababu yangu mimi niliye mfungwa kwa ajili yake. Lakini shiriki katika mateso kwa ajili ya Habari Njema, kadiri ya nguvu unayopewa na Mungu. Yeye alituokoa, akatuita tuwe watu wake yeye mwenyewe, si kwa sababu ya mastahili ya matendo yetu, bali kwa sababu ya kusudi lake na neema yake. Alitujalia neema hiyo kwa ajili ya Kristo Yesu kabla ya wakati, lakini imefunuliwa kwetu sasa kwa kuja kwake Mwokozi wetu, Yesu Kristo. Yeye amekomesha nguvu za kifo, na kwa njia ya Habari Njema akadhihirisha uhai usio na kifo. Mimi nimechaguliwa niwe mtume na mwalimu kwa ajili ya kuhubiri Habari Njema, nami nateseka kwa mambo haya kwa sababu hiyo. Lakini niko bado timamu kabisa kwani namjua yule niliyemwamini, tena nina hakika kwamba yeye atakilinda salama kile alichonikabidhi, mpaka siku ile. Shika kwa makini mafundisho yale ya kweli niliyokufundisha na kubaki katika hiyo imani na huo upendo wetu katika kuungana na Kristo Yesu. Jambo lile bora ulilokabidhiwa lilinde kwa nguvu ya Roho Mtakatifu anayeishi ndani yetu. Kama unavyojua, watu wote mkoani Asia wameniacha, miongoni mwao wakiwa Fugelo na Hermogene. Bwana aihurumie jamaa ya Onesiforo, kwa sababu aliniburudisha rohoni mara nyingi, wala hakuona haya kwa kuwa nilikuwa kifungoni, ila mara tu alipofika Roma, alianza kunitafuta kwa bidii mpaka akanipata. Bwana amjalie kupata huruma ya Mungu katika siku ile! Nawe wajua vizuri mengi aliyonifanyia huko Efeso.
ltx/swh_ke_oak/le.ep.mc.d307:lemcLI.Epistle.title	
ltx/swh_ke_oak/le.ep.mc.d307:lemcLI.Epistle.version	
