ltx/swh_ke_oak/le.ep.mc.d042:lemcLI.Epistle.book	@ltx/swh_ke_oak/bible:Hebrews
ltx/swh_ke_oak/le.ep.mc.d042:lemcLI.Epistle.chapverse	(10:32-38)
ltx/swh_ke_oak/le.ep.mc.d042:lemcLI.Epistle.pagenumber	
ltx/swh_ke_oak/le.ep.mc.d042:lemcLI.Epistle.text	Ndugu zangu, kumbukeni yaliyotokea siku zile za kwanza mlipoangaziwa mwanga wa Mungu. Ingawa siku zili mlipatwa na mateso mengi, nyinyi mlistahimili. Mara nyingine mlitukanwa na kufedheheshwa hadharani; mara nyingine mlikuwa radhi kuungana na wale walioteswa namna hiyohiyo. Mlishiriki mateso ya wafungwa na mliponyang''anywa mali yenu mlistahimili kwa furaha, maana mlijua kwamba mnayo mali bora zaidi na ya kudumu milele. Basi, msipoteze uhodari wenu, maana utawapatieni tuzo kubwa. Mnahitaji kuwa na uvumilivu ili muweze kutimiza matakwa ya Mungu na kupokea kile alichoahidi. Maana kama yasemavyo Maandiko: "Bado kidogo tu, na yule anayekuja, atakuja, wala hatakawia. Lakini mtu wangu aliye mwadilifu ataamini na kuishi."
ltx/swh_ke_oak/le.ep.mc.d042:lemcLI.Epistle.title	
ltx/swh_ke_oak/le.ep.mc.d042:lemcLI.Epistle.version	
