ltx/swh_ke_oak/le.go.mc.d029:lemcLI.Gospel.book	@ltx/swh_ke_oak/bible:John
ltx/swh_ke_oak/le.go.mc.d029:lemcLI.Gospel.chapverse	(1:43-51)
ltx/swh_ke_oak/le.go.mc.d029:lemcLI.Gospel.text	Wakati huo Yesu aliamua kwenda Galilaya. Basi, akamkuta Filipo, akamwambia, "Nifuate." Filipo alikuwa mwenyeji wa Bethsaida, mji wa akina Andrea na Petro. Naye Filipo akamkuta Nathanaeli, akamwambia, "Tumemwona yule ambaye Mose aliandika juu yake katika kitabu cha sheria, na ambaye manabii waliandika habari zake, yaani Yesu Mwana wa Yosefu, kutoka Nazareti." Naye Nathanaeli akamwuliza Filipo, "Je, kitu chema chaweza kutoka Nazareti?" Filipo akamwambia, "Njoo uone." Yesu alipomwona Nathanaeli akimjia, alisema juu yake, "Tazameni! Huyo ni Mwisraeli halisi: hamna hila ndani yake." Naye Nathanaeli akamwuliza, "Umepataje kunijua?" Yesu akamwambia, "Ulipokuwa chini ya mtini, hata kabla Filipo hajakuita, nilikuona." Hapo Nathanaeli akamwambia, "Mwalimu, wewe ni Mwana wa Mungu. Wewe ni Mfalme wa Israeli!" Yesu akamwambia, "Je, umeamini kwa kuwa nimekuambia kwamba nilikuona chini ya mtini? Utaona makubwa zaidi kuliko haya." Yesu akaendelea kusema, "Nawaambieni kweli, mtaona mbingu zinafunguka na malaika wa Mungu wakipanda na kushuka juu ya Mwana wa Mtu."
ltx/swh_ke_oak/le.go.mc.d029:lemcLI.Gospel.title	
ltx/swh_ke_oak/le.go.mc.d029:lemcLI.Gospel.version	
