ltx/swh_ke_oak/le.ep.mc.d117:lemcLI.Epistle.book	@ltx/swh_ke_oak/bible:Acts
ltx/swh_ke_oak/le.ep.mc.d117:lemcLI.Epistle.chapverse	(25:13-19)
ltx/swh_ke_oak/le.ep.mc.d117:lemcLI.Epistle.text	Siku hizo mfalme Agripa na Bernike walifika Kaisarea ili kutoa heshima zao kwa Festo. Walikuwa huko siku kadhaa naye Festo akamweleza mfalme kesi ya Paulo: "Kuna mtu mmoja hapa ambaye Felisi alimwacha kizuizini. Nilipokwenda Yerusalemu makuhani wakuu na wazee wa Wayahudi walimshtaki na kuniomba nimhukumu. Lakini mimi niliwajibu kwamba si desturi ya Waroma kumtoa mtu aadhibiwe kabla mshtakiwa hajakutana na washtaki waake ana kwa ana na kupewa fursa ya kujitetea kuhusu hayo mashtaka. Basi, walipofika hapa sikukawia, ila nilifanya kikao mahakamani kesho yake, nikaamuru mtu huyo aletwe. Washtaki wake walisimama lakini hawakutoa mashtaka maovu kama nilivyokuwa ninatazamia. Ila tu walikuwa na mabishano kadhaa pamoja naye kuhusu dini yao na kuhusu mtu mmoja aitwaye Yesu ambaye alikufa, lakini Paulo anashikilia kwamba yu hai."
ltx/swh_ke_oak/le.ep.mc.d117:lemcLI.Epistle.title	
ltx/swh_ke_oak/le.ep.mc.d117:lemcLI.Epistle.version	
