ltx/swh_ke_oak/le.ep.mc.d093:lemcLI.Epistle.book	@ltx/swh_ke_oak/bible:Acts
ltx/swh_ke_oak/le.ep.mc.d093:lemcLI.Epistle.chapverse	(10:1-16)
ltx/swh_ke_oak/le.ep.mc.d093:lemcLI.Epistle.text	Siku hizo kulikuwa na mtu mmoja huko Kaisarea aitwaye Kornelio, jemadari wa kikosi kimoja kiitwacho "Kikosi cha Italia." Alikuwa mtu mwema; naye pamoja na jamaa yake yote walimcha Mungu; alikuwa anafanya mengi kusaidia maskini wa Kiyahudi na alikuwa anasali daima. Yapata saa tisa alasiri, aliona dhahiri katika maono malaika wa Mungu akiingia ndani na kumwambia, "Kornelio!" Kornelio alimkodelea macho huyo malaika kwa hofu, akamwambia, "Kuna nini Mheshimiwa?" Huyo malaika akamwambia, "Mungu amezipokea sala na sadaka zako kwa maskini wala hatazisahau. Sasa, watume watu Yopa wakamwite mtu mmoja aitwaye Simoni, kwa jina lingine Petro. Yeye yumo nyumbani kwa Simoni mtengenezaji wa ngozi ambaye nyumba yake iko karibu na bahari." Huyo malaika aliyesema hayo alipokwisha kwenda zake, Kornelio aliwaita watumishi wawili wa nyumbani na mmoja wa askari zake ambaye alikuwa mcha Mungu, akawaeleza yote yaliyotukia, akawatuma Yopa. Kesho yake, hao watu watatu wakiwa bado safarini, lakini karibu kufika Yopa, Petro alipanda juu ya paa la nyumba yapata saa sita mchana ili kusali. Aliona njaa, akatamani kupata chakula. Chakula kilipokuwa kinatayarishwa, akaota ndoto. Aliona mbingu zimefunguliwa na kitu kama shuka kubwa inateremshwa chini ikiwa imeshikwa pembe zake nne. Ndani ya shuka hiyo kulikuwa na kila aina ya wanyama: wanyama wenye miguu minne, wanyama watambaao na ndege wa angani. Akasikia sauti ikimwambia: "Petro, amka uchinje, ule!" Petro akajibu, "La, Bwana; mimi sijaonja kamwe chochote ambacho ni najisi au kichafu." Ile sauti ikasikika tena ikimwambia: "Usiviite najisi vitu ambavyo Mungu amevitakasa!" Jambo hili lilifanyika mara tatu, kisha ile shuka ikarudishwa juu mbinguni.
ltx/swh_ke_oak/le.ep.mc.d093:lemcLI.Epistle.title	
ltx/swh_ke_oak/le.ep.mc.d093:lemcLI.Epistle.version	
