ltx/swh_ke_oak/le.go.me.m07.d20:lemeLI.Gospel.book	@ltx/swh_ke_oak/bible:Luke
ltx/swh_ke_oak/le.go.me.m07.d20:lemeLI.Gospel.chapverse	(4:22-30)
ltx/swh_ke_oak/le.go.me.m07.d20:lemeLI.Gospel.text	Wakati huo wote walivutiwa sana naye, wakastaajabia maneno mazuri aliyosema. Wakasema, "Je, huyu si mwana wa Yosefu?" Naye akawaambia, "Bila shaka mtaniambia msemo huu: ''Mganga jiponye mwenyewe,'' na pia mtasema: ''Yote tuliyosikia umeyafanya kule Kafarnaumu, yafanye pia hapa kijijini mwako.''" Akaendelea kusema, "Hakika nawaambieni, nabii hatambuliwi kijijini mwake. Lakini, sikilizeni! Kweli kulikuwa na wajane wengi katika nchi ya Israeli nyakati za Elia. Wakati huo mvua iliacha kunyesha kwa muda wa miaka mitatu na nusu; kukawa na njaa kubwa katika nchi yote. Hata hivyo, Elia hakutumwa kwa mjane yeyote ila kwa mwanamke mjane wa Sarefathi katika Sidoni. Tena, katika nchi ya Israeli nyakati za Elisha kulikuwa na wenye ukoma wengi. Hata hivyo, hakuna yeyote aliyetakaswa ila tu Naamani mwenyeji wa Siria." Wote waliokuwa katika lile sunagogi waliposikia hayo walikasirika sana. Wakasimama, wakamtoa nje ya mji wao uliokuwa umejengwa juu ya kilima, wakampeleka mpaka kwenye ukingo wa kilima hicho ili wamtupe chini. Lakini Yesu akapita katikati yao, akaenda zake.
ltx/swh_ke_oak/le.go.me.m07.d20:lemeLI.Gospel.title	
ltx/swh_ke_oak/le.go.me.m07.d20:lemeLI.Gospel.version	
