ltx/swh_ke_oak/le.go.mc.d165:lemcLI.Gospel.book	
ltx/swh_ke_oak/le.go.mc.d165:lemcLI.Gospel.chapverse	(14:34-36; 15:1-11)
ltx/swh_ke_oak/le.go.mc.d165:lemcLI.Gospel.text	Wakati huo Yesu na wanafunzi wake walivuka ziwa, wakafika nchi ya Genesareti. Watu wa huko walipomtambua, wakaeneza habari pote katika sehemu hizo. Basi, wakamletea Yesu wagonjwa wote, wakamwomba awaruhusu waguse tu pindo la vazi lake. Nao wote waliomgusa walipona. Kisha Mafarisayo na waalimu wa sheria wakafika kutoka Yerusalemu, wakamwendea Yesu, wakamwuliza, "Kwa nini wanafunzi wako hawajali mapokeo tuliyopokea kwa wazee wetu? Hawanawi mikono ipasavyo kabla ya kula!" Yesu akawajibu, "Kwa nini nanyi hamjali sheria ya Mungu ila mnapendelea mapokeo yenu wenyewe? Mungu amesema: ''Waheshimu baba yako na mama yako,'' na ''Anayemtukana baba yake au mama yake, lazima auawe.'' Lakini nyinyi mwafundisha ati mtu akiwa na kitu ambacho angeweza kumsaidia nacho baba yake au mama yake, lakini atasema: ''Kitu hiki nimemtolea Mungu,'' basi, hapaswi tena kumheshimu baba yake! Ndivyo mnavyodharau neno la Mungu kwa kufuata mafundisho yenu wenyewe. Enyi wanafiki! Isaya alitabiri sawa kabisa juu yenu: ''Mungu asema: Watu hawa huniheshimu kwa maneno tu, lakini mioyoni mwao wako mbali nami. Kuniabudu kwao hakufai, maana mambo wanayofundisha ni maagizo ya kibinadamu tu.''" Yesu aliuita ule umati wa watu, akawaambia, "Sikilizeni, mkaelewe! Kitu kinachomtia mtu najisi si kile kiingiacho kinywani, bali kile kitokacho kinywani. Hicho ndicho kimtiacho mtu najisi."
ltx/swh_ke_oak/le.go.mc.d165:lemcLI.Gospel.title	
ltx/swh_ke_oak/le.go.mc.d165:lemcLI.Gospel.version	
