ltx/swh_ke_oak/le.pr.me.r56:leprVE.reading.book	@ltx/swh_ke_oak/bible:Judges
ltx/swh_ke_oak/le.pr.me.r56:leprVE.reading.chapverse	(13:2-8, 13-14, 17-18, 21)
ltx/swh_ke_oak/le.pr.me.r56:leprVE.reading.text	Siku hizo kulikuwa na mtu mmoja huko Sora, wa kabila la Dani, jina lake Manoa. Mke wake alikuwa tasa. Siku moja, malaika wa Mwenyezi-Mungu akamtokea huyo mwanamke, akamwambia, "Wewe ni tasa, huna watoto. Lakini utapata mimba na kumzaa mtoto wa kiume. Kwa hiyo uwe mwangalifu, usinywe divai au kileo wala usile kitu chochote kilicho najisi, kwa maana utachukua mimba na kuzaa mtoto wa kiume. Nywele za mtoto huyo kamwe zisinyolewe, maana atakuwa amewekwa wakfu kwa Mungu tangu kuzaliwa kwake. Naye ataanza kuwakomboa Waisraeli mikononi mwa Wafilisti." Mwanamke huyo akaenda kumwambia mume wake, "Mtu wa Mungu ambaye sura yake ilikuwa kama ya malaika wa Mungu alinijia. Sikumwuliza alikotoka wala hakuniambia jina lake. Lakini aliniambia kwamba nitachukua mimba na kuzaa mtoto wa kiume. Aliniamuru nisinywe divai au kileo wala kula chochote kilicho najisi, maana mtoto huyo atakuwa amewekwa wakfu kwa Mungu tangu kuzaliwa kwake mpaka atakapokufa." Kisha Manoa akamwomba Mwenyezi-Mungu, akisema, "Nakuomba ee Mwenyezi-Mungu, umtume tena yule mtu wako uliyemtuma ili atufundishe mambo tunayopaswa kumtendea huyo mtoto atakayezaliwa." Malaika wa Mwenyezi-Mungu akamwambia Manoa, "Mkeo atapaswa kushika yote niliyomwambia: asionje mazao yoyote ya mzabibu, wala asinywe divai au kileo wala kula chochote kilicho najisi. Yote niliyomwamuru, ayafuate." Basi, Manoa akamwambia huyo malaika wa Mwenyezi-Mungu, "Tuambie jina lako ili tukuheshimu wakati maneno yako yatakapotimia." Malaika wa Mwenyezi-Mungu akamjibu, "Kwa nini unataka kujua jina langu, kwa kuwa jina langu ni la ajabu?" Manoa alijua kuwa huyo alikuwa malaika wa Mwenyezi-Mungu. Malaika hakumtokea tena Manoa na mkewe.
ltx/swh_ke_oak/le.pr.me.r56:leprVE.reading.title	
ltx/swh_ke_oak/le.pr.me.r56:leprVE.reading.version	@ltx/swh_ke_oak/properties:version.designation
