ltx/swh_ke_oak/le.ep.me.m09.d08:lemeLI.Epistle.book	@ltx/swh_ke_oak/bible:Philippians
ltx/swh_ke_oak/le.ep.me.m09.d08:lemeLI.Epistle.chapverse	(2:5-11)
ltx/swh_ke_oak/le.ep.me.m09.d08:lemeLI.Epistle.pagenumber	
ltx/swh_ke_oak/le.ep.me.m09.d08:lemeLI.Epistle.text	Ndugu zangu, muwe na msimamo uleule aliokuwa nao Kristo Yesu: Yeye, kwa asili alikuwa daima Mungu; lakini hakufikiri kwamba kule kuwa sawa na Mungu ni kitu cha kung''ang''ania kwa nguvu. Bali, kwa hiari yake mwenyewe, aliachilia hayo yote, akajitwalia hali ya mtumishi, akawa sawa na wanaadamu, akaonekana kama wanaadamu. Alijinyenyekeza na kutii mpaka kufa, hata kufa msalabani. Kwa sababu hiyo Mungu alimkweza juu kabisa, akampa jina lililo kuu kuliko majina yote. Ili kwa heshima ya jina la Yesu, viumbe vyote mbinguni, duniani na kuzimu, vipige magoti mbele yake, na kila mtu akiri kwamba Yesu Kristo ni Bwana, kwa utukufu wa Mungu Baba.
ltx/swh_ke_oak/le.ep.me.m09.d08:lemeLI.Epistle.title	
ltx/swh_ke_oak/le.ep.me.m09.d08:lemeLI.Epistle.version	
