ltx/swh_ke_oak/he.a.m8:heAU.AnestisEkNekron.greekname	Ἀνέστης ἐκ νεκρῶν.
ltx/swh_ke_oak/he.a.m8:heAU.AnestisEkNekron.incipit	
ltx/swh_ke_oak/he.a.m8:heAU.AnestisEkNekron.melody	@ltx/swh_ke_oak/miscellanea:misc.Automelon
ltx/swh_ke_oak/he.a.m8:heAU.AnestisEkNekron.mode	@ltx/swh_ke_oak/miscellanea:misc.Mode8
ltx/swh_ke_oak/he.a.m8:heAU.AnestisEkNekron.name	
ltx/swh_ke_oak/he.a.m8:heAU.AnestisEkNekron.notmetered	
ltx/swh_ke_oak/he.a.m8:heAU.AnestisEkNekron.text	
ltx/swh_ke_oak/he.a.m8:heAU.AvlonPoimenikon.greekname	Αὐλῶν Ποιμενικῶν.
ltx/swh_ke_oak/he.a.m8:heAU.AvlonPoimenikon.incipit	
ltx/swh_ke_oak/he.a.m8:heAU.AvlonPoimenikon.melody	@ltx/swh_ke_oak/miscellanea:misc.Automelon
ltx/swh_ke_oak/he.a.m8:heAU.AvlonPoimenikon.mode	@ltx/swh_ke_oak/miscellanea:misc.Mode8
ltx/swh_ke_oak/he.a.m8:heAU.AvlonPoimenikon.name	
ltx/swh_ke_oak/he.a.m8:heAU.AvlonPoimenikon.notmetered	
ltx/swh_ke_oak/he.a.m8:heAU.AvlonPoimenikon.text	
ltx/swh_ke_oak/he.a.m8:heAU.DefteApantesPistoi.greekname	Δεῦτε ἅπαντες πιστοί.
ltx/swh_ke_oak/he.a.m8:heAU.DefteApantesPistoi.incipit	
ltx/swh_ke_oak/he.a.m8:heAU.DefteApantesPistoi.melody	@ltx/swh_ke_oak/miscellanea:misc.Automelon
ltx/swh_ke_oak/he.a.m8:heAU.DefteApantesPistoi.mode	@ltx/swh_ke_oak/miscellanea:misc.Mode8
ltx/swh_ke_oak/he.a.m8:heAU.DefteApantesPistoi.name	
ltx/swh_ke_oak/he.a.m8:heAU.DefteApantesPistoi.notmetered	
ltx/swh_ke_oak/he.a.m8:heAU.DefteApantesPistoi.text	
ltx/swh_ke_oak/he.a.m8:heAU.KyrieEiKaiKritirio.greekname	Κύριε, εἰ καὶ κριτηρίῳ.
ltx/swh_ke_oak/he.a.m8:heAU.KyrieEiKaiKritirio.incipit	
ltx/swh_ke_oak/he.a.m8:heAU.KyrieEiKaiKritirio.melody	@ltx/swh_ke_oak/miscellanea:misc.Automelon
ltx/swh_ke_oak/he.a.m8:heAU.KyrieEiKaiKritirio.mode	@ltx/swh_ke_oak/miscellanea:misc.Mode8
ltx/swh_ke_oak/he.a.m8:heAU.KyrieEiKaiKritirio.name	
ltx/swh_ke_oak/he.a.m8:heAU.KyrieEiKaiKritirio.notmetered	
ltx/swh_ke_oak/he.a.m8:heAU.KyrieEiKaiKritirio.text	
ltx/swh_ke_oak/he.a.m8:heAU.OAngelosSouKyrie.greekname	Ὁ Ἄγγελός σου Κύριε.
ltx/swh_ke_oak/he.a.m8:heAU.OAngelosSouKyrie.incipit	
ltx/swh_ke_oak/he.a.m8:heAU.OAngelosSouKyrie.melody	@ltx/swh_ke_oak/miscellanea:misc.Automelon
ltx/swh_ke_oak/he.a.m8:heAU.OAngelosSouKyrie.mode	@ltx/swh_ke_oak/miscellanea:misc.Mode8
ltx/swh_ke_oak/he.a.m8:heAU.OAngelosSouKyrie.name	
ltx/swh_ke_oak/he.a.m8:heAU.OAngelosSouKyrie.notmetered	
ltx/swh_ke_oak/he.a.m8:heAU.OAngelosSouKyrie.text	
ltx/swh_ke_oak/he.a.m8:heAU.OEnEdemParadeisos.greekname	Ὁ ἐν Ἐδὲμ Παράδεισος.
ltx/swh_ke_oak/he.a.m8:heAU.OEnEdemParadeisos.incipit	
ltx/swh_ke_oak/he.a.m8:heAU.OEnEdemParadeisos.melody	@ltx/swh_ke_oak/miscellanea:misc.Automelon
ltx/swh_ke_oak/he.a.m8:heAU.OEnEdemParadeisos.mode	@ltx/swh_ke_oak/miscellanea:misc.Mode8
ltx/swh_ke_oak/he.a.m8:heAU.OEnEdemParadeisos.name	
ltx/swh_ke_oak/he.a.m8:heAU.OEnEdemParadeisos.notmetered	
ltx/swh_ke_oak/he.a.m8:heAU.OEnEdemParadeisos.text	
ltx/swh_ke_oak/he.a.m8:heAU.OTouParadoxou.greekname	Ὢ τοῦ παραδόξου.
ltx/swh_ke_oak/he.a.m8:heAU.OTouParadoxou.incipit	
ltx/swh_ke_oak/he.a.m8:heAU.OTouParadoxou.melody	@ltx/swh_ke_oak/miscellanea:misc.Automelon
ltx/swh_ke_oak/he.a.m8:heAU.OTouParadoxou.mode	@ltx/swh_ke_oak/miscellanea:misc.Mode8
ltx/swh_ke_oak/he.a.m8:heAU.OTouParadoxou.name	
ltx/swh_ke_oak/he.a.m8:heAU.OTouParadoxou.notmetered	
ltx/swh_ke_oak/he.a.m8:heAU.OTouParadoxou.text	
ltx/swh_ke_oak/he.a.m8:heAU.OiMartyresSouKyrie.greekname	Οἱ Μάρτυρές σου Κύριε.
ltx/swh_ke_oak/he.a.m8:heAU.OiMartyresSouKyrie.incipit	
ltx/swh_ke_oak/he.a.m8:heAU.OiMartyresSouKyrie.melody	@ltx/swh_ke_oak/miscellanea:misc.Automelon
ltx/swh_ke_oak/he.a.m8:heAU.OiMartyresSouKyrie.mode	@ltx/swh_ke_oak/miscellanea:misc.Mode8
ltx/swh_ke_oak/he.a.m8:heAU.OiMartyresSouKyrie.name	
ltx/swh_ke_oak/he.a.m8:heAU.OiMartyresSouKyrie.notmetered	
ltx/swh_ke_oak/he.a.m8:heAU.OiMartyresSouKyrie.text	
ltx/swh_ke_oak/he.a.m8:heAU.OsAparchas.greekname	Ὡς ἀπαρχάς.
ltx/swh_ke_oak/he.a.m8:heAU.OsAparchas.incipit	
ltx/swh_ke_oak/he.a.m8:heAU.OsAparchas.melody	@ltx/swh_ke_oak/miscellanea:misc.Automelon
ltx/swh_ke_oak/he.a.m8:heAU.OsAparchas.mode	@ltx/swh_ke_oak/miscellanea:misc.Mode8
ltx/swh_ke_oak/he.a.m8:heAU.OsAparchas.name	
ltx/swh_ke_oak/he.a.m8:heAU.OsAparchas.notmetered	
ltx/swh_ke_oak/he.a.m8:heAU.OsAparchas.text	
ltx/swh_ke_oak/he.a.m8:heAU.TiYmasKalesomen.greekname	Τί ὑμᾶς καλέσωμεν.
ltx/swh_ke_oak/he.a.m8:heAU.TiYmasKalesomen.incipit	
ltx/swh_ke_oak/he.a.m8:heAU.TiYmasKalesomen.melody	@ltx/swh_ke_oak/miscellanea:misc.Automelon
ltx/swh_ke_oak/he.a.m8:heAU.TiYmasKalesomen.mode	@ltx/swh_ke_oak/miscellanea:misc.Mode8
ltx/swh_ke_oak/he.a.m8:heAU.TiYmasKalesomen.name	
ltx/swh_ke_oak/he.a.m8:heAU.TiYmasKalesomen.notmetered	
ltx/swh_ke_oak/he.a.m8:heAU.TiYmasKalesomen.text	
ltx/swh_ke_oak/he.a.m8:heAU.TiYpermacho.greekname	Τῇ ὑπερμάχῳ.
ltx/swh_ke_oak/he.a.m8:heAU.TiYpermacho.incipit	
ltx/swh_ke_oak/he.a.m8:heAU.TiYpermacho.melody	@ltx/swh_ke_oak/miscellanea:misc.Automelon
ltx/swh_ke_oak/he.a.m8:heAU.TiYpermacho.mode	@ltx/swh_ke_oak/miscellanea:misc.Mode8
ltx/swh_ke_oak/he.a.m8:heAU.TiYpermacho.name	
ltx/swh_ke_oak/he.a.m8:heAU.TiYpermacho.notmetered	
ltx/swh_ke_oak/he.a.m8:heAU.TiYpermacho.text	
ltx/swh_ke_oak/he.a.m8:heAU.TinSofianKaiLogon.greekname	Τὴν Σοφίαν καὶ Λόγον.
ltx/swh_ke_oak/he.a.m8:heAU.TinSofianKaiLogon.incipit	
ltx/swh_ke_oak/he.a.m8:heAU.TinSofianKaiLogon.melody	@ltx/swh_ke_oak/miscellanea:misc.Automelon
ltx/swh_ke_oak/he.a.m8:heAU.TinSofianKaiLogon.mode	@ltx/swh_ke_oak/miscellanea:misc.Mode8
ltx/swh_ke_oak/he.a.m8:heAU.TinSofianKaiLogon.name	
ltx/swh_ke_oak/he.a.m8:heAU.TinSofianKaiLogon.notmetered	
ltx/swh_ke_oak/he.a.m8:heAU.TinSofianKaiLogon.text	
ltx/swh_ke_oak/he.a.m8:heAU.ToProstachthen.greekname	Τὸ προσταχθέν.
ltx/swh_ke_oak/he.a.m8:heAU.ToProstachthen.incipit	
ltx/swh_ke_oak/he.a.m8:heAU.ToProstachthen.melody	@ltx/swh_ke_oak/miscellanea:misc.Automelon
ltx/swh_ke_oak/he.a.m8:heAU.ToProstachthen.mode	@ltx/swh_ke_oak/miscellanea:misc.Mode8
ltx/swh_ke_oak/he.a.m8:heAU.ToProstachthen.name	
ltx/swh_ke_oak/he.a.m8:heAU.ToProstachthen.notmetered	
ltx/swh_ke_oak/he.a.m8:heAU.ToProstachthen.text	
ltx/swh_ke_oak/he.a.m8:heAU.title	Automela of Mode pl. 4
