ltx/swh_ke_oak/le.go.mc.d133:lemcLI.Gospel.book	@ltx/swh_ke_oak/bible:Matthew
ltx/swh_ke_oak/le.go.mc.d133:lemcLI.Gospel.chapverse	(7:1-8)
ltx/swh_ke_oak/le.go.mc.d133:lemcLI.Gospel.text	Bwana alisema, "Msiwahukumu wengine, msije nanyi mkahukumiwa na Mungu; kwa maana jinsi mnavyowahukumu wengine, ndivyo nanyi mtakavyohukumiwa; na kipimo kilekile mnachotumia kwa wengine ndicho Mungu atakachotumia kwenu. Kwa nini wakiona kibanzi kilicho jichoni mwa ndugu yako, na papo hapo huioni boriti iliyoko jichoni mwako? Au, wawezaje kumwambia ndugu yako, ''Ndugu, ngoja nikuondoe kibanzi jichoni mwako,'' wakati wewe mwenyewe unayo boriti jichoni mwako? Mnafiki wewe! Ondoa kwanza boriti iliyoko jichoni mwako na hapo ndipo utaona sawasawa kiasi cha kuweza kuondoa kibanzi kilichoko jichoni mwa ndugu yako. Msiwape mbwa vitu vitakatifu wasije wakageuka na kuwararua nyinyi; wala msiwatupie nguruwe lulu zenu wasije wakazikanyaga. Ombeni, nanyi mtapewa; tafuteni, nanyi mtapata; bisheni mlango, nanyi mtafunguliwa. Maana, yeyote aombaye hupewa, atafutaye hupata, na abishaye mlango hufunguliwa."
ltx/swh_ke_oak/le.go.mc.d133:lemcLI.Gospel.title	
ltx/swh_ke_oak/le.go.mc.d133:lemcLI.Gospel.version	
