ltx/swh_ke_oak/le.ep.me.m01.d05:lemeH1.Epistle.book	@ltx/swh_ke_oak/bible:Acts
ltx/swh_ke_oak/le.ep.me.m01.d05:lemeH1.Epistle.chapverse	(13:25-33)
ltx/swh_ke_oak/le.ep.me.m01.d05:lemeH1.Epistle.text	"Siku hizo Yohane alipokuwa anamaliza ujumbe wake aliwaambia watu: ''Mnadhani mimi ni nani? Mimi si yule mnayemtazamia. Huyo anakuja baada yangu na mimi sistahili hata kuzifungua kamba za viatu vyake.'' Ndugu, nyinyi mlio watoto wa ukoo wa Abrahamu, na wengine wote mnaomcha Mungu! Ujumbe huu wa wokovu umeletwa kwetu. Kwa maana wenyeji wa Yerusalemu na wakuu wao hawakumtambua yeye kuwa Mwokozi, wala hawakuelewa maneno ya manabii yanayosomwa kila Sabato. Hata hivyo, waliyafanya maneno ya manabii yatimie kwa kumhukumu Yesu adhabu ya kifo. Ingawa hawakumpata na hatia inayostahili auawe, walimwomba Pilato amhukumu auawe. Na baada ya kutekeleza yote yaliyokuwa yameandikwa kumhusu yeye, walimshusha kutoka msalabani, wakamweka kaburini. Lakini Mungu alimfufua kutoka wafu. Naye, kwa siku nyingi, aliwatokea wale waliofuatana naye kutoka Galilaya mpaka Yerusalemu. Hao ndio walio sasa mashahidi wake kwa watu wa Israeli. Nasi tumekuja hapa kuwaleteeni Habari Njema: jambo lile Mungu alilowaahidia babu zetu, amelitimiza sasa kwa ajili yetu sisi wajukuu wao kwa kumfufua Yesu kutoka wafu."
ltx/swh_ke_oak/le.ep.me.m01.d05:lemeH1.Epistle.title	
ltx/swh_ke_oak/le.ep.me.m01.d05:lemeH1.Epistle.version	
ltx/swh_ke_oak/le.ep.me.m01.d05:lemeH3.Epistle.book	@ltx/swh_ke_oak/bible:Acts
ltx/swh_ke_oak/le.ep.me.m01.d05:lemeH3.Epistle.chapverse	(19:1-8)
ltx/swh_ke_oak/le.ep.me.m01.d05:lemeH3.Epistle.text	Siku hizo, wakati Apolo alipokuwa Korintho, Paulo alisafiri sehemu za bara, akafika Efeso ambako aliwakuta wanafunzi kadhaa. Akauliza, "Je, mlipopata kuwa waumini mlipokea Roho Mtakatifu?" Nao wakamjibu, "La! Hata hatujasikia kwamba kuna Roho Mtakatifu." Naye akasema, "Sasa mlipata ubatizo wa namna gani?" Wakamjibu, "Ubatizo wa Yohane." Naye Paulo akasema, "Ubatizo wa Yohane ulikuwa wa kuonesha kwamba watu wametubu. Yohane aliwaambia watu wamwamini yule ambaye alikuwa anakuja baada yake, yaani Yesu." Baada ya kusikia hayo, walibatizwa kwa jina la Bwana Yesu. Basi, Paulo akawawekea mikono, na Roho Mtakatifu akawashukia, wakaanza kusema lugha ngeni na kutangaza ujumbe wa Mungu. Wote jumla walikuwa watu wapatao kumi na wawili. Kwa muda wa miezi mitatu Paulo alikuwa akienda katika sunagogi, akawa na majadiliano ya kuvutia sana juu ya ufalme wa Mungu.
ltx/swh_ke_oak/le.ep.me.m01.d05:lemeH3.Epistle.title	
ltx/swh_ke_oak/le.ep.me.m01.d05:lemeH3.Epistle.version	
ltx/swh_ke_oak/le.ep.me.m01.d05:lemeH6.Epistle.book	@ltx/swh_ke_oak/bible:Romans
ltx/swh_ke_oak/le.ep.me.m01.d05:lemeH6.Epistle.chapverse	(6:3-11)
ltx/swh_ke_oak/le.ep.me.m01.d05:lemeH6.Epistle.text	Ndugu zangu, sisi tuliobatizwa tukaungana na Kristo Yesu, tulibatizwa na kuungana na kifo chake. Tulipobatizwa tuliungana na kifo chake, tukazikwa pamoja naye, ili kama vile Kristo alivyofufuliwa kutoka wafu kwa kitendo kitukufu cha Baba, sisi pia tuweze kuishi maisha mapya. Maana, kama sisi tumeungana naye katika kufa kama yeye, vivyo hivyo tutaungana naye kwa kufufuliwa kutoka wafu kama yeye. Tunajua kwamba utu wetu wa kale ulisulubiwa pamoja na Kristo, ili hali ya dhambi iharibiwe, tusiwe tena watumwa wa dhambi. Kwa maana, mtu aliyekufa, amenasuliwa kutoka dhambi. Basi, ikiwa tumekufa pamoja na Kristo, tunaamini kwamba tutaishi pia pamoja naye. Maana, tunajua kwamba Kristo amekwisha fufuliwa kutoka wafu na hafi tena; kifo hakimtawali tena. Hivyo, kwa kuwa alikufa--mara moja tu--dhambi haina nguvu tena juu yake; na sasa anaishi maisha yake katika umoja na Mungu. Hali kadhalika nanyi lazima mjione kuwa mmekufa kuhusu dhambi, lakini kama mnaoishi katika umoja na Mungu kwa njia ya Kristo Yesu.
ltx/swh_ke_oak/le.ep.me.m01.d05:lemeH6.Epistle.title	
ltx/swh_ke_oak/le.ep.me.m01.d05:lemeH6.Epistle.version	
ltx/swh_ke_oak/le.ep.me.m01.d05:lemeH9.Epistle.book	@ltx/swh_ke_oak/bible:Titus
ltx/swh_ke_oak/le.ep.me.m01.d05:lemeH9.Epistle.chapverse	(2:11-14; 3:4-7)
ltx/swh_ke_oak/le.ep.me.m01.d05:lemeH9.Epistle.text	Mwanangu Tito, neema ya Mungu imedhihirishwa kwa ajili ya wokovu wa watu wote. Neema hiyo yatufunza kuachana na uovu wote na tamaa za kidunia; tuwe na kiasi, tuishi maisha adili ya na kumcha Mungu katika ulimwengu huu wa sasa, tukiwa tunangojea siku ile ya heri tunayoitumainia, wakati utakapotokea utukufu wa Mungu Mkuu na Mwokozi wetu Yesu Kristo. Yeye alijitoa wenyewe kwa ajili yetu ili atukomboe kutoka katika uovu wote na kutufanya watu safi walio wake yeye mwenyewe, watu walio na hamu ya kutenda mema. Lakini wakati wema na upendo wa Mungu, Mwokozi wetu ulipofunuliwa, alituokoa si kwa sababu ya jambo lolote jema tulilotenda sisi, bali kwa sababu ya huruma yake, kwa njia ya Roho Mtakatifu anayetujalia tuzaliwe upya na kuwa na maisha mapya kwa kutuosha kwa maji. Mungu alitumiminia Roho Mtakatifu bila kipimo kwa njia ya Yesu Kristo, Mwokozi wetu, ili kwa neema yake tupate kukubaliwa kuwa waadilifu na kuupokea uhai wa milele tunaotumainia.
ltx/swh_ke_oak/le.ep.me.m01.d05:lemeH9.Epistle.title	
ltx/swh_ke_oak/le.ep.me.m01.d05:lemeH9.Epistle.version	
