ltx/swh_ke_oak/le.ep.mc.d241:lemcLI.Epistle.book	@ltx/swh_ke_oak/bible:Ephesians
ltx/swh_ke_oak/le.ep.mc.d241:lemcLI.Epistle.chapverse	(5:20-25)
ltx/swh_ke_oak/le.ep.mc.d241:lemcLI.Epistle.text	Ndugu zangu, mshukuruni Mungu Baba daima kwa ajili ya yote, kwa jina la Bwana wetu Yesu Kristo. Kila mmoja amstahi mwenzake kwa sababu ya heshima mliyo nayo kwa Kristo. Wake wawatii waume zao kama kumtii Bwana. Maana mume anayo mamlaka juu ya mkewe, kama vile Kristo alivyo na mamlaka juu ya kanisa; naye Kristo mwenyewe hulikomboa kanisa, mwili wake. Kama vile kanisa linavyomtii Kristo, vivyo hivyo, wake wawatii waume zao katika mambo yote. Nanyi waume, wapendeni wake zenu kama Kristo alivyolipenda kanisa, akajitoa mwenyewe sadaka kwa ajili yake.
ltx/swh_ke_oak/le.ep.mc.d241:lemcLI.Epistle.title	
ltx/swh_ke_oak/le.ep.mc.d241:lemcLI.Epistle.version	
