ltx/swh_ke_oak/le.go.mc.d203:lemcLI.Gospel.book	@ltx/swh_ke_oak/bible:Matthew
ltx/swh_ke_oak/le.go.mc.d203:lemcLI.Gospel.chapverse	(20:29-34)
ltx/swh_ke_oak/le.go.mc.d203:lemcLI.Gospel.text	Wakati Yesu alipokuwa anaondoka mjini Yeriko, umati wa watu ulimfuata. Basi, kulikuwa na vipofu viwili wameketi kando ya njia, na waliposikia kwamba Yesu alikuwa anapitia hapo, walipaaza sauti: "Bwana, Mwana wa Daudi, utuhurumie!" Ule umati wa watu ukawakemea na kuwaambia wanyamaze. Lakini wao wakazidi kupaaza sauti: "Bwana, Mwana wa Daudi, utuhurumie!" Yesu akasimama, akawaita na kuwauliza, "Mnataka niwafanyie nini?" Wakamjibu, "Bwana, tunaomba macho yetu yafumbuliwe." Basi, Yesu akawaonea huruma, akawagusa macho yao, na papo hapo wakaweza kuona, wakamfuata.
ltx/swh_ke_oak/le.go.mc.d203:lemcLI.Gospel.title	
ltx/swh_ke_oak/le.go.mc.d203:lemcLI.Gospel.version	
