ltx/swh_ke_oak/le.go.mc.d142:lemcLI.Gospel.book	@ltx/swh_ke_oak/bible:Matthew
ltx/swh_ke_oak/le.go.mc.d142:lemcLI.Gospel.chapverse	(11:2-15)
ltx/swh_ke_oak/le.go.mc.d142:lemcLI.Gospel.text	Wakati huo, Yohane Mbatizaji akiwa gerezani alipata habari juu ya matendo ya Kristo. Basi, Yohane akawatuma wanafunzi wake, wamwulize: "Je, wewe ni yule anayekuja, au tumngoje mwingine?" Yesu akawajibu, "Nendeni mkamwambie Yohane mambo mnayoyasikia na kuyaona: vipofu wanaona, viwete wanatembea, wenye ukoma wanatakaswa, viziwi wanasikia, wafu wanafufuliwa na maskini wanahubiriwa Habari Njema. Heri mtu yule ambaye hana mashaka nami." Basi, hao wajumbe wa Yohane walipokuwa wanakwenda zao, Yesu alianza kuyaambia makundi ya watu habari za Yohane: "Mlikwenda kutazama nini kule jangwani? Je, mlitaka kuona mwanzi unaotikiswa na upepo? Basi, mlikwenda kuona nini? Mlikwenda kumwona mtu aliyevaa mavazi maridadi? Watu wanaovaa mavazi maridadi hukaa katika nyumba za wafalme. Lakini, mlikwenda kuona nini? Nabii? Naam, hakika ni zaidi ya nabii. Huyu ndiye anayesemwa katika Maandiko Matakatifu: ''Tazama, mimi namtuma mjumbe wangu akutangulie, ambaye atakutayarishia njia yako.'' Kweli nawaambieni, miongoni mwa watoto wote wa watu, hajatokea aliye mkuu kuliko Yohane Mbatizaji. Hata hivyo, yule aliye mdogo kabisa katika ufalme wa mbinguni, ni mkubwa kuliko yeye. Tangu wakati wa Yohane Mbatizaji mpaka leo hii, ufalme wa mbinguni unashambuliwa vikali, na watu wakali wanajaribu kuunyakua kwa nguvu. Mafundisho yote ya manabii na sheria mpaka wakati wa Yohane yalibashiri juu ya nyakati hizi. Kama mwaweza kukubali basi, Yohane ndiye Elia ambaye angekuja. Mwenye masikio na asikie!
ltx/swh_ke_oak/le.go.mc.d142:lemcLI.Gospel.title	
ltx/swh_ke_oak/le.go.mc.d142:lemcLI.Gospel.version	
