ltx/swh_ke_oak/le.pr.me.r55:leprVE.reading.book	@ltx/swh_ke_oak/bible:Genesis
ltx/swh_ke_oak/le.pr.me.r55:leprVE.reading.chapverse	(17:15-17; 18:11-14; 21:1-2, 4-8)
ltx/swh_ke_oak/le.pr.me.r55:leprVE.reading.text	Mungu alimwambia Abrahamu, "Kuhusu mkeo, hutamwita tena jina lake Sarai, bali jina lake litakuwa Sara. Nitambariki, naye atakuzalia mtoto wa kiume. Naam, nitambariki Sara, naye atakuwa mama wa mataifa mengi na wafalme wa mataifa watatoka kwake." Abrahamu na Sara walikuwa wakongwe, naye Sara mambo ya kawaida ya wanawake yalikuwa yamekoma kitambo. Kwa hiyo, Sara alicheka kimoyomoyo akisema, "Mimi ni mzee, na mume wangu hali kadhalika. Je, nikiwa mzee hivi, nitaweza kufurahi na kupata watoto?" Hapo Mwenyezi-Mungu akamwuliza Abrahamu, "Kwa nini Sara amecheka na kujiuliza kama kweli itawezekana apate mtoto akiwa mzee? Je, kuna jambo lolote lisilowezekana kwa Mwenyezi-Mungu?" Mwenyezi-Mungu alimkumbuka Sara, akamtendea kama alivyoahidi. Basi, Abrahamu akiwa mzee, Sara akapata mimba, akamzalia mtoto wa kiume, wakati uleule Mungu alioutaja. Isaka alipotimiza umri wa siku nane, Abrahamu akamtahiri kama alivyoamriwa na Mungu. Abrahamu alikuwa na umri wa miaka mia moja wakati mwanawe Isaka alipozaliwa. Naye Sara akasema, "Mungu amenipatia kicheko; yeyote atakayesikia habari hizi, atacheka pamoja nami." Kisha akaongeza, "Ni nani angeweza kumwambia Abrahamu kwamba mimi Sara nitanyonyesha watoto? Tena nimemzalia mtoto wa kiume katika uzee wake!" Isaka akaendelea kukua, na siku alipoachishwa kunyonya, Abrahamu akafanya sherehe kubwa.
ltx/swh_ke_oak/le.pr.me.r55:leprVE.reading.title	
ltx/swh_ke_oak/le.pr.me.r55:leprVE.reading.version	@ltx/swh_ke_oak/properties:version.designation
