ltx/swh_ke_oak/le.ep.mc.d270:lemcLI.Epistle.book	@ltx/swh_ke_oak/bible:Colossians
ltx/swh_ke_oak/le.ep.mc.d270:lemcLI.Epistle.chapverse	(3:17-25; 4:1)
ltx/swh_ke_oak/le.ep.mc.d270:lemcLI.Epistle.pagenumber	
ltx/swh_ke_oak/le.ep.mc.d270:lemcLI.Epistle.text	Ndugu zangu, kila mfanyacho kwa neno au tendo, fanyeni vyote kwa jina la Bwana Yesu na kumshukuru Mungu Baba kwa njia yake. Enyi wake, watiini waume zenu, kwani ndivyo apendavyo Bwana. Nanyi waume, wapendeni wake zenu, na msiwe wakali kwao. Enyi watoto, watiini wazazi wenu daima maana hiyo humpendeza Bwana. Nanyi wazazi, msiwachukize watoto wenu, la sivyo watakata tamaa. Enyi watumwa, watiini wakuu wenu wa kidunia katika mambo yote, na si tu wakati wanapowatazama kwa kuwa mnataka kujipendekeza kwao; ila fanyeni hivyo kwa moyo wote, kwa sababu ya kumcha Bwana. Kila mfanyacho, fanyeni kwa moyo wote, kwa sababu ya Bwana na si kwa ajili ya mtu. Kumbukeni kwamba atawapeni tuzo lile alilowawekea watu wake. Mtumikieni Kristo Bwana! Atendaye mabaya atalipwa kufuatana na ubaya wake; Mungu hana ubaguzi. Nanyi wakuu, watendeeni watumwa wenu kwa uadilifu na haki, mkikumbuka kwamba nanyi pia mnaye Bwana mbinguni.
ltx/swh_ke_oak/le.ep.mc.d270:lemcLI.Epistle.title	
ltx/swh_ke_oak/le.ep.mc.d270:lemcLI.Epistle.version	
