ltx/swh_ke_oak/le.go.lu.d017:leluLI.Gospel.book	@ltx/swh_ke_oak/bible:Luke
ltx/swh_ke_oak/le.go.lu.d017:leluLI.Gospel.chapverse	(6:46-49; 7:1)
ltx/swh_ke_oak/le.go.lu.d017:leluLI.Gospel.text	Bwana alisema, "Mbona mwaniita, ''Bwana, Bwana,'' na huku hamtimizi yale ninayosema? Nitawapeni mfano unaofaa kuonesha alivyo yeyote yule anayekuja kwangu, akasikia maneno yangu na kuyatimiza: Huyo anafanana na mtu ajengaye nyumba, ambaye amechimba chini na kuweka msingi wake juu ya mwamba; kukatokea mafuriko ya mto, mkondo wa maji ukaipiga nyumba ile, lakini haukuweza kuitikisa, kwa sababu ilikuwa imejengwa imara. Lakini yeyote anayesikia maneno yangu asifanye chochote, huyo anafanana na mtu aliyejenga nyumba juu ya udongo, bila msingi. Mafuriko ya mto yakatokea, mkondo wa maji ukaipiga nyumba ile, ikaanguka na kuharibika kabisa!" Baada ya kusema yale aliyotaka watu wasikie, Yesu alikwenda Kafarnaumu.
ltx/swh_ke_oak/le.go.lu.d017:leluLI.Gospel.title	
ltx/swh_ke_oak/le.go.lu.d017:leluLI.Gospel.version	
