ltx/swh_ke_oak/le.ep.mc.d192:lemcLI.Epistle.book	@ltx/swh_ke_oak/bible:Corinthians2
ltx/swh_ke_oak/le.ep.mc.d192:lemcLI.Epistle.chapverse	(2:14-17; 3:1-3)
ltx/swh_ke_oak/le.ep.mc.d192:lemcLI.Epistle.text	Ndugu zangu, shukrani kwa Mungu anayetuongoza daima katika msafara wa ushindi wa Kristo. Yeye hutufanya tuueneze ukweli wa Kristo kama harufu nzuri, kila mahali. Maana sisi ni kama harufu nzuri ya ubani ambayo Kristo anamtolea Mungu, harufu nzuri inayofikia wote, wanaookolewa na wanaopotea. Kwa wale wanaopotea, harufu hiyo ni kifo; lakini kwa wale wanaookolewa, harufu hiyo ni uhai. Nani basi, awezaye kushiriki katika kazi ya namna hiyo? Sisi si kama wengine ambao hufanya biashara na ujumbe wa Mungu; sisi tunahubiri kwa unyofu mbele ya Mungu, kama watu tuliotumwa na Mungu, tukiwa tumeungana na Kristo. Je, tunaanza tena kujipendekeza? Je, tunahitaji barua ya utambulisho kwenu, au kutoka kwenu, kama watu wengine? Nyinyi wenyewe ni barua yetu; barua iliyoandikwa mioyoni mwetu kila mtu aione na kuisoma. Ni dhahiri kwamba nyinyi ni barua ya Kristo aliyoipeleka kwa mikono yetu. Barua yenyewe imeandikwa si kwa wino, bali kwa Roho wa Mungu aliye hai; imeandikwa si juu ya kipande cha jiwe, bali juu ya mioyo ya watu.
ltx/swh_ke_oak/le.ep.mc.d192:lemcLI.Epistle.title	
ltx/swh_ke_oak/le.ep.mc.d192:lemcLI.Epistle.version	
