ltx/swh_ke_oak/le.go.me.m12.dSatBE:lemeLI.Gospel.book	@ltx/swh_ke_oak/bible:Matthew
ltx/swh_ke_oak/le.go.me.m12.dSatBE:lemeLI.Gospel.chapverse	(3:1-6)
ltx/swh_ke_oak/le.go.me.m12.dSatBE:lemeLI.Gospel.text	Siku zile Yohane Mbatizaji alitokea, akaanza kuhubiri katika jangwa la Yudea: "Tubuni, maana ufalme wa mbinguni umekaribia." Huyu Yohane ndiye yule ambaye nabii Isaya alinena juu yake aliposema: "Sauti ya mtu anaita jangwani: ''Mtayarisheni Bwana njia yake, nyosheni barabara zake.''" Yohane alivaa vazi lililoshonwa kwa manyoya ya ngamia, na ukanda wa ngozi kiunoni mwake. Chakula chake kilikuwa nzige na asali ya mwituni. Basi, watu kutoka Yerusalemu, kutoka pande zote za Yudea na sehemu zote za kandokando ya mto Yordani, walimwendea, wakaziungama dhambi zao, naye akawabatiza katika mto Yordani.
ltx/swh_ke_oak/le.go.me.m12.dSatBE:lemeLI.Gospel.title	
ltx/swh_ke_oak/le.go.me.m12.dSatBE:lemeLI.Gospel.version	
