ltx/swh_ke_oak/le.ep.me.m11.d06:lemeLI.Epistle.book	@ltx/swh_ke_oak/bible:Hebrews
ltx/swh_ke_oak/le.ep.me.m11.d06:lemeLI.Epistle.chapverse	(8:1-6)
ltx/swh_ke_oak/le.ep.me.m11.d06:lemeLI.Epistle.pagenumber	
ltx/swh_ke_oak/le.ep.me.m11.d06:lemeLI.Epistle.text	Ndugu zangu, jambo muhimu katika hayo tunayosema ni hili: sisi tunaye kuhani mkuu wa namna hiyo, ambaye anaketi upande wa kulia wa kiti cha enzi cha Mkuu mbinguni. Yeye hutoa huduma ya kuhani mkuu maskani patakatifu, yaani ndani ya ile hema ya kweli iliyojengwa na Bwana, siyo na binadamu. Kila kuhani mku ameteuliwa kumtolea Mungu zawadi na dhabihu, na hivyo kuhani mkuu wetu lazima naye awe na kitu cha kutolea. Kama yeye angekuwa wa hapa duniani, asingekuwa kamwe kuhani, kwani wako makuhani wengine wanaotoa sadaka kufuatana na sheria. Huduma zao za kikuhani ni mfano tu na kivuli cha yale yaliyoko mbinguni. Maana Mose alipokuwa karibu kuitengeneza ile maskani, Mungu alimwambia: "Tengeneza kila kitu na ule mfano uliooneshwa kule mlimani." Lakini sasa Yesu amepewa huduma ya kikuhani iliyo bora kuliko yao, kama vile agano alilothibitisha kati ya watu na Mungu ni bora zaidi, kwani lina msingi wake katika ahadi za mambo yaliyo bora zaidi.
ltx/swh_ke_oak/le.ep.me.m11.d06:lemeLI.Epistle.title	
ltx/swh_ke_oak/le.ep.me.m11.d06:lemeLI.Epistle.version	
