ltx/swh_ke_oak/le.ep.mc.d190:lemcLI.Epistle.book	@ltx/swh_ke_oak/bible:Corinthians1
ltx/swh_ke_oak/le.ep.mc.d190:lemcLI.Epistle.chapverse	(4:9-16)
ltx/swh_ke_oak/le.ep.mc.d190:lemcLI.Epistle.text	Ndugu zangu, nafikiri Mungu ametufanya sisi mitume tuwe watu wa mwisho kabisa, kama watu waliohukumiwa kuuawa, maana tumekuwa tamasha mbele ya ulimwengu wote, mbele ya malaika na watu. Sisi ni wapumbavu kwa ajili ya Kristo, lakini nyinyi ni wenye busara katika kuungana na Kristo! Sisi ni dhaifu, nyinyi ni wenye nguvu. Nyinyi mnaheshimika, sisi tunadharauliwa. Mpaka dakika hii, sisi tuna njaa na kiu, hatuna nguo, twapigwa makofi, hatuna malazi. Tena twataabika na kufanya kazi kwa mikono yetu wenyewe. Tukitukanwa, tunawatakia baraka; tukidhulumiwa, tunavumilia; tukisingiziwa, tunajibu kwa adabu. Mpaka sasa tumetendewa kama uchafu wa dunia; na kwa kila mtu sisi ni takataka! Siandiki mambo haya kwa ajili ya kuwaaibisha nyinyi, bali kwa ajili ya kuwafundisheni watoto wangu wapenzi. Maana hata kama mnao maelfu ya walezi katika maisha yenu ya Kikristo, baba yenu ni mmoja tu, kwani katika kuungana na Kristo mimi ndiye niliyewazaeni kwa kuihubiri Habari Njema. Kwa hiyo, nawasihi: fuateni mfano wangu.
ltx/swh_ke_oak/le.ep.mc.d190:lemcLI.Epistle.title	
ltx/swh_ke_oak/le.ep.mc.d190:lemcLI.Epistle.version	
