ltx/swh_ke_oak/le.ep.mc.d100:lemcLI.Epistle.book	@ltx/swh_ke_oak/bible:Acts
ltx/swh_ke_oak/le.ep.mc.d100:lemcLI.Epistle.chapverse	(12:12-17)
ltx/swh_ke_oak/le.ep.mc.d100:lemcLI.Epistle.text	Siku hizo, Petro alipotambua hivyo alikwenda moja kwa moja mpaka nyumbani kwa Maria mama yake Yohane aitwaye Marko. Humo watu wengi walikuwa wamekusanyika wakisali. Petro alipiga hodi kwenye mlango wa nje na mtumishi mmoja msichana aitwaye Roda, akaenda mlangoni kuitikia. Huyo msichana aliitambua sauti ya Petro akafurahi mno, hata badala ya kuufungua ule mlango, akakimbilia ndani na kuwaambia kwamba Petro alikuwa amesimama nje mlangoni. Wakamwambia yule msichana, "Una wazimu!" Lakini yeye akasisitiza kwamba ilikuwa kweli. Nao wakamwambia, "Huyo ni malaika wake." Wakati huo Petro alikuwa anaendelea kupiga hodi. Mwishowe walifungua mlango, wakamwona, wakashangaa. Petro aliwaashiria kwa mkono wakae kimya, akawaeleza jinsi Bwana alivyomtoa gerezani. Kisha akawaambia watoe taarifa ya jambo hilo kwa Yakobo na wale ndugu wengine, halafu akatoka akaenda mahali pengine.
ltx/swh_ke_oak/le.ep.mc.d100:lemcLI.Epistle.title	
ltx/swh_ke_oak/le.ep.mc.d100:lemcLI.Epistle.version	
