ltx/swh_ke_oak/le.go.ge.hierarch:legeLI.Gospel.book	@ltx/swh_ke_oak/bible:John
ltx/swh_ke_oak/le.go.ge.hierarch:legeLI.Gospel.chapverse	(10:9-16)
ltx/swh_ke_oak/le.go.ge.hierarch:legeLI.Gospel.text	Bwana alisema, "Mimi ni mlango. Anayeingia kwa kupitia kwangu ataokolewa; ataingia na kutoka, na kupata malisho. Mwizi huja kwa shabaha ya kuiba, kuua na kuharibu. Mimi nimekuja mpate kuwa na uhai--uhai kamili. Mimi ni mchungaji mwema. Mchungaji mwema huutoa uhai wake kwa ajili ya kondoo wake. Mtu wa kuajiriwa ambaye si mchungaji, na wala kondoo si mali yake, anapoona mbwamwitu anakuja, huwaacha kondoo na kukimbia, kisha mbwamwitu huwakamata na kuwatawanya. Yeye hajali kitu juu ya kondoo kwa sababu yeye ni mtu wa mshahara tu. Mimi ni mchungaji mwema. Nawajua walio wangu, nao walio wangu wananijua mimi, kama vile Baba anijuavyo, nami nimjuavyo Baba. Mimi nayatoa maisha yangu kwa ajili yao. Tena ninao kondoo wengine ambao hawamo zizini humu. Inanibidi kuwaleta hao pia, nao wataisikia sauti yangu, na kutakuwako kundi moja na mchungaji moja."
ltx/swh_ke_oak/le.go.ge.hierarch:legeLI.Gospel.title	
ltx/swh_ke_oak/le.go.ge.hierarch:legeLI.Gospel.version	
ltx/swh_ke_oak/le.go.ge.hierarch:legeMA.Gospel.book	@ltx/swh_ke_oak/bible:John
ltx/swh_ke_oak/le.go.ge.hierarch:legeMA.Gospel.chapverse	(10:1-9)
ltx/swh_ke_oak/le.go.ge.hierarch:legeMA.Gospel.text	Bwana aliwaambia Wayahudi waliomjia, "Kweli nawaambieni, yeyote yule asiyeingia katika zizi la kondoo kwa kupitia mlangoni, bali hupenya na kuingia kwa njia nyingine, huyo ni mwizi na mnyang''anyi. Lakini anayeingia kwa kupitia mlangoni, huyo ndiye mchungaji wa kondoo. Mngojamlango wa zizi humfungulia, na kondoo husikia sauti yake; naye huwaita kondoo wake kila mmoja kwa jina lake, na kuwaongoza nje. Akisha watoa nje huwatangulia mbele, nao kondoo humfuata, kwani wanaijua sauti yake. Kondoo hao hawawezi kumfuata mgeni, bali watamkimbia kwa sababu hawaijui sauti yake." Yesu aliwaambia mfano huo, lakini wao hawakuelewa alichotaka kuwaambia. Basi, akasema tena, "Kweli nawaambieni, mimi ni mlango wa kondoo. Wale wengine wote waliokuja kabla yangu ni wezi na wanyang''anyi, nao kondoo hawakuwasikiliza. Mimi ni mlango. Anayeingia kwa kupitia kwangu ataokolewa; ataingia na kutoka, na kupata malisho."
ltx/swh_ke_oak/le.go.ge.hierarch:legeMA.Gospel.title	
ltx/swh_ke_oak/le.go.ge.hierarch:legeMA.Gospel.version	
