ltx/swh_ke_oak/le.ep.mc.d288:lemcLI.Epistle.book	@ltx/swh_ke_oak/bible:Ephesians
ltx/swh_ke_oak/le.ep.mc.d288:lemcLI.Epistle.chapverse	(2:14-22)
ltx/swh_ke_oak/le.ep.mc.d288:lemcLI.Epistle.pagenumber	
ltx/swh_ke_oak/le.ep.mc.d288:lemcLI.Epistle.text	Ndugu zangu, Kristo mwenyewe ametuletea amani kwa kuwafanya Wayahudi na watu wa mataifa mengine kuwa jamii moja. Kwa mwili wake yeye mwenyewe aliubomoa ule ukuta uliowatenganisha na kuwafanya maadui. Aliiondoa ile sheria pamoja na amri zake na kanuni zake, ili kutokana na jamii hizo mbili aumbe jamii moja mpya katika umoja naye na hivyo kuleta amani. Kwa mwili wake, Kristo aliuangamiza uadui wao; kwa msalaba wake aliziunganisha jamii hizo kuwa moja na kuzipatanisha na Mungu. Basi, Kristo alikuja akahubiri Habari Njema ya amani kwenu nyinyi watu wa mataifa mengine mliokuwa mbali na Mungu, na pia kwa Wayahudi ambao walikuwa karibu na Mungu. Hivyo, kwa njia yake, sisi sote, Wayahudi na watu wa mataifa mengine, tunaweza kumwendea Baba kwa Roho mmoja. Basi, nyinyi si wageni tena, wala si watu wa nje. Nyinyi ni raia pamoja na watu wa Mungu, na ni watu wa jamaa ya Mungu. Mmejengwa juu ya msingi uliowekwa na mitume na manabii, naye Kristo mwenyewe ndiye jiwe kuuu la msingi. Yeye ndiye mwenye kuliunganisha jengo lote na kulikuza hata liwe hekalu takatifu kwa ajili ya Bwana. Katika kuungana naye, nyinyi pia mnajengwa pamoja na wote wengine, muwe makao ya Mungu kwa njia ya Roho wake.
ltx/swh_ke_oak/le.ep.mc.d288:lemcLI.Epistle.title	
ltx/swh_ke_oak/le.ep.mc.d288:lemcLI.Epistle.version	
