ltx/swh_ke_oak/le.go.me.m02.d11:lemeLI.Gospel.book	@ltx/swh_ke_oak/bible:Matthew
ltx/swh_ke_oak/le.go.me.m02.d11:lemeLI.Gospel.chapverse	(10:1, 5-8)
ltx/swh_ke_oak/le.go.me.m02.d11:lemeLI.Gospel.text	Wakati huo Yesu aliwaita wanafunzi wake kumi na wawili, akawapa uwezo wa kuwafukuza pepo wachafu na kuponya magonjwa na maradhi yote. Yesu aliwatuma hao kumi na wawili na kuwapa maagizo haya: "Msiende kwa watu wa mataifa mengine, wala msiingie katika miji ya Wasamaria. Ila nendeni kwa watu wa Israeli waliopotea kama kondoo. Mnapokwenda hubirini hivi: ''Ufalme wa mbinguni umekaribia.'' Ponyeni wagonjwa, fufueni wafu, takaseni wenye ukoma, toeni pepo. Mmepewa bure, toeni bure."
ltx/swh_ke_oak/le.go.me.m02.d11:lemeLI.Gospel.title	
ltx/swh_ke_oak/le.go.me.m02.d11:lemeLI.Gospel.version	
