ltx/swh_ke_oak/le.pr.me.r34:leprVE.reading.book	@ltx/swh_ke_oak/bible:Isaiah
ltx/swh_ke_oak/le.pr.me.r34:leprVE.reading.chapverse	(19:1-4,
ltx/swh_ke_oak/le.pr.me.r34:leprVE.reading.text	Kauli ya Mungu dhidi ya nchi ya Misri. "Mwenyezi-Mungu amepanda juu ya wingu liendalo kasi na kuja mpaka nchi ya Misri. Sanamu za miungu ya Wamisri zitatetemeka mbele yake, mioyo ya Wamisri itayeyuka kwa hofu. Mimi nitawachochea Wamisri wagongane: ndugu na ndugu yake, jirani na jirani yake, mji mmoja na mji mwingine, mfalme mmoja na mfalme mwingine. Nitawaondolea Wamisri uhodari wao, nitaivuruga mipango yao; watatafuta maoni kwa sanamu na mizimu, wachawi, mizuka na pepo. Nitawatia Wamisri mikononi mwa bwana katili, mfalme mkali ambaye atawatawala. Mimi Bwana Mwenyezi-Mungu wa majeshi, nimenena."
ltx/swh_ke_oak/le.pr.me.r34:leprVE.reading.title	
ltx/swh_ke_oak/le.pr.me.r34:leprVE.reading.version	@ltx/swh_ke_oak/properties:version.designation
