ltx/swh_ke_oak/le.ep.mc.d165:lemcLI.Epistle.book	@ltx/swh_ke_oak/bible:Corinthians1
ltx/swh_ke_oak/le.ep.mc.d165:lemcLI.Epistle.chapverse	(7:12-24)
ltx/swh_ke_oak/le.ep.mc.d165:lemcLI.Epistle.text	Ndugu zangu, ikiwa mwanamume Mkristo anaye mke asiyeamini, na huyo mwanamke akakubali kuendelea kuishi naye, asimpe talaka. Na, kama mwanamke Mkristo anaye mume asiyeamini, na huyo mwanamume akakubali kuendelea kuishi naye, basi, asimpe talaka mumewe. Kwa maana huyo mume asiyeamini hupokelewa kwa Mungu kwa kuungana na mkewe; na huyo mke asiyeamini hupokelewa kwa Mungu kwa kuungana na mumewe. Vinginevyo watoto wao wangekuwa si wa Mungu; kume sasa ni watoto wake Mungu. Hata hivyo, ikiwa yule asiyeamini anataka kumwacha mwenzake aliye Mkristo, basi, na amwache tu. Hapo huyo Mkristo, mume au mke, atakuwa huru. Maana Mungu amewaiteni nyinyi muishi kwa amani. Wewe mama Mkristo, unawezaje kuwa na hakika kwamba hutaweza kumwokoa mume wako? Au wewe mume Mkristo, unawezaje kuwa na hakika kwama hutaweza kumwokoa mkeo? Kwa vyovyote kila mmoja na aishi kufuatana na vipaji alivyogawiwa na Bwana, na kama alivyoitwa na Mungu. Hili ndilo agizo langu kwa makanisa yote. Kama mtu aliitwa akiwa ametahiriwa, basi asijisingizie kwamba hakutahiriwa; na kama alipoitwa hakuwa ametahiriwa, basi na asitahiriwe. Maana kutahiriwa au kutokutahiriwa si kitu; kilicho muhimu ni kuzishika amri za Mungu. Basi, kila mmoja na abaki kama alivyokuwa wakati alipoitwa. Je, wewe ulikuwa mtumwa wakati ulipoitwa? Sawa, usijali; lakini ukipata fursa ya kuwa huru, itumie. Maana yeye aliyeitwa na Bwana akiwa mtumwa huyo huwa mtu huru wa Bwana. Hali kadhalika naye aliyeitwa akiwa mtu huru, huwa mtumwa wa Kristo. Nyote mmenunuliwa kwa bei; kwa hiyo msiwe tena watumwa wa watu. Ndugu zangu, kila mmoja wenu basi, na abaki na Mungu kama alivyokuwa wakati alipoitwa.
ltx/swh_ke_oak/le.ep.mc.d165:lemcLI.Epistle.title	
ltx/swh_ke_oak/le.ep.mc.d165:lemcLI.Epistle.version	
