ltx/swh_ke_oak/le.ep.mc.d332:lemcLI.Epistle.book	@ltx/swh_ke_oak/bible:Hebrews
ltx/swh_ke_oak/le.ep.mc.d332:lemcLI.Epistle.chapverse	(12:25-27, 13:22-25)
ltx/swh_ke_oak/le.ep.mc.d332:lemcLI.Epistle.pagenumber	
ltx/swh_ke_oak/le.ep.mc.d332:lemcLI.Epistle.text	Ndugu zangu, jihadharini msije mkakataa kumsikiliza huyo anayesema nanyi. Kama wale waliokataa kumsikiliza yule aliyewaonya hapa duniani hawakuokoka, sisi tutawezaje kuokoka kama tukikataa kumsikiliza yule anayetuonya kutoka mbinguni? Wakati ule sauti ilitetemesha nchi, lakini sasa ameahidi: "Nitatetemesha nchi tena, lakini si nchi tu bali pia mbingu." Neno hili: "tena" linatuonesha kwamva vitu vyote vilivyoumbwa vitatetemeshwa na kutoweka ili vibaki vile visivyotetemeshwa. Basi, ndugu, nawasihi mpokee kwa utulivu ujumbe huu wa kuwatieni moyo. Hii ni barua fupi tu ambayo nimewaandikieni. Napenda kuwajulisheni kwamba ndugu yetu Timotheo amekwisha funguliwa gerezani. Kama akifika hapa mapema, nitakuja naye nitakapokuja kwenu. Wasalimieni viongozi wenu wote pamoja na watu wa Mungu! Ndugu wa Italia wanawasalimuni. Tunawatakieni nyote neema ya Mungu.
ltx/swh_ke_oak/le.ep.mc.d332:lemcLI.Epistle.title	
ltx/swh_ke_oak/le.ep.mc.d332:lemcLI.Epistle.version	
