ltx/swh_ke_oak/le.ep.mc.d207:lemcLI.Epistle.book	@ltx/swh_ke_oak/bible:Corinthians2
ltx/swh_ke_oak/le.ep.mc.d207:lemcLI.Epistle.chapverse	(9:12-15; 10:1-7)
ltx/swh_ke_oak/le.ep.mc.d207:lemcLI.Epistle.text	Ndugu zangu, huduma hii takatifu mnayoifanya si kwamba itasaidia mahitaji ya watu wa Mungu tu, bali pia itasababisha watu wengi wamshukuru Mungu. Kutokana na uthibitisho unaooneshwa kwa huduma hii yetu, watu watamtukuza Mungu kwa sababu ya uaminifu wenu kwa Habari Njema ya Kristo mnayoiungama, na pia kwa sababu ya ukarimu mnaowapa wao na watu wote. Kwa hiyo watawaombea nyinyi kwa moyo kwa sababu ya neema ya pekee aliyowajalieni Mungu. Tumshukuru Mungu kwa ajili ya zawadi yake isiyo na kifani! Mimi Paulo mwenyewe ambaye naonekana kuwa mpole nikiwa pamoja nanyi, lakini mkali niwapo mbali nanyi, nawasihini kwa huruma na wema wake Kristo. Nawaombeni msinisababishe kuwa mkali wakati nitakapokuja, maana nina hakika naweza kuwa mkali kwa wote wale wanaotudhania kwamba tunaishi kidunia. Kweli tunaishi duniani, lakini hatupigani vita kidunia. Maana, silaha tunazotumia katika vita vyetu si silaha za kidunia, ila ni nguvu ya Mungu yenye kuharibu ngome zote. Tunaharibu hoja zote za uongo na kubomoa kila kizuizi cha majivuno kilichowekwa kuipinga elimu ya Mungu; tunaziteka fikira zote na kuzifanya zimtii Kristo. Mkisha kuwa wakamilifu katika kutii, sisi tuko tayari kuadhibu kila namna ya kutotii. Nyinyi hutazama mambo kwa nje tu. Je, yupo mtu yeyote anayedhani kwamba yeye ni wa Kristo? Sawa! Basi, afikirie vilevile kwamba sisi pia ni wa Kristo kama yeye alivyo wa Kristo.
ltx/swh_ke_oak/le.ep.mc.d207:lemcLI.Epistle.title	
ltx/swh_ke_oak/le.ep.mc.d207:lemcLI.Epistle.version	
