ltx/swh_ke_oak/le.ep.mc.d244:lemcLI.Epistle.book	@ltx/swh_ke_oak/bible:Ephesians
ltx/swh_ke_oak/le.ep.mc.d244:lemcLI.Epistle.chapverse	(6:18-24)
ltx/swh_ke_oak/le.ep.mc.d244:lemcLI.Epistle.text	Ndugu zangu, salini daima, mkiomba msaada wa Mungu. Salini kila wakati kwa nguvu ya Roho. Kesheni bila kuchoka mkisali kwa ajili ya watu wote wa Mungu. Niombeeni nami pia ili niongeapo Mungu anijalie cha kusema, niweze kuwajulisha watu fumbo la injili wa uthabiti. Mimi ni balozi kwa ajili ya injili hiyo ingawa sasa niko kifungoni. Ombeni, basi, ili niweze kuwa hodari katika kuitangaza kama inipasavyo. Tukiko, ndugu yetu mpenzi na mtumishi mwaminifu katika kuungana na Bwana, atawapeni habari zangu zote mpate kujua ninachofanya. Namtuma kwenu awapeni habari zetu mpate kuwa na moyo. Ninawatakieni nyinyi ndugu amani, upendo na imani kutoka kwa Mungu Baba na kutoka kwa Bwana Yesu Kristo. Nawatakia neema ya Mungu wote wanaompenda Bwana wetu Yesu Kristo kwa mapendo yasiyo na mwisho.
ltx/swh_ke_oak/le.ep.mc.d244:lemcLI.Epistle.title	
ltx/swh_ke_oak/le.ep.mc.d244:lemcLI.Epistle.version	
