ltx/swh_ke_oak/le.ep.mc.d143:lemcLI.Epistle.book	@ltx/swh_ke_oak/bible:Romans
ltx/swh_ke_oak/le.ep.mc.d143:lemcLI.Epistle.chapverse	(10:11-21; 11:1-2)
ltx/swh_ke_oak/le.ep.mc.d143:lemcLI.Epistle.text	Ndugu zangu, Maandiko Matakatifu yasema: "Kila anayemwamini hataaibishwa." Jambo hili ni kwa wote, kwani hakuna tofauti kati ya Wayahudi na wasio Wayahudi; Bwana wa wote ni mmoja, naye ni mkarimu sana kwao wote wamwombao. Maana Maandiko Matakatifu yasema: "Kila mtu atakayeomba kwa jina la Bwana, ataokolewa." Basi, watamwombaje yeye ambaye hamwamwamini? Tena, watamwaminije kama hawajapata kusikia habari zake? Na watasikiaje habari zake kama hakuna mhubiri? Na watu watahubirije kama hawakutumwa? Kama yasemavyo Maandiko Matakatifu: "Ni jambo la kupendeza mno kuja kwa wale wanaohubiri Habari Njema!" Lakini wote hawakuipokea hiyo habari njema. Maana Isaya alisema: "Bwana, ni nani aliyeamini ujumbe wetu?" Hivyo basi, imani inatokana na kuusikia ujumbe, na huo ujumbe unatokana na neno la Kristo. Lakini nauliza: je, hawakuusikia huo ujumbe? Naam, waliusikia; kama Maandiko Matakatifu yasemavyo: "Sauti yao imeenea duniani kote; maneno yao yamefika mpaka kingo za ulimwengu." Tena nauliza: je, yawezekana kwamba watu wa Israeli hawakufahamu? Mose mwenyewe ni wa kwanza kujibu: "Nitawafanyeni muwaonee wivu watu ambao si taifa; nitawafanyeni muwe na hasira juu ya taifa la watu wapumbavu." Tena Isaya anathubutu hata kusema: "Wale ambao hawakunitafuta wamenipata; nimejionesha kwao wasiouliza habari zangu." Lakini kuhusu Israeli anasema: "Mchana kutwa niliwanyoshea mikono yangu watu waasi na wasiotii." Basi, nauliza: je, Mungu amewakataa watu wake? Hata kidogo! Mimi binafsi ni Mwisraeli, mzawa wa Abrahamu, wa kabila la Benyamini. Mungu hakuwakataa watu wake aliowateua tangu mwanzo.
ltx/swh_ke_oak/le.ep.mc.d143:lemcLI.Epistle.title	
ltx/swh_ke_oak/le.ep.mc.d143:lemcLI.Epistle.version	
