ltx/swh_ke_oak/le.ep.me.m11.d17:lemeLI.Epistle.book	@ltx/swh_ke_oak/bible:Corinthians1
ltx/swh_ke_oak/le.ep.me.m11.d17:lemeLI.Epistle.chapverse	(12:7-11)
ltx/swh_ke_oak/le.ep.me.m11.d17:lemeLI.Epistle.pagenumber	
ltx/swh_ke_oak/le.ep.me.m11.d17:lemeLI.Epistle.text	Ndugu zangu, kila mtu hupewa mwangaza wa Roho kwa faida ya wote. Roho humpa mmoja ujumbe wa hekima, na mwingine ujumbe wa elimu, apendavyo Roho huyohuyo. Roho huyohuyo humpa mmoja imani, na humpa mwingine kipaji cha kuponya; humpa mmoja kipaji cha kufanya miujiza, mwingine kipaji cha kusema ujumbe wa Mungu, mwingine kipaji cha kubainisha vipaji vitokavyo kwa Roho na visivyo vya Roho; humpa mmoja kipaji cha kusema lugha ngeni, na mwingine kipaji cha kuzifafanua. Hizo zote ni kazi za Roho huyohuyo mmoja, ambaye humpa kila mtu kipaji tofauti, kama apendavyo mwenyewe.
ltx/swh_ke_oak/le.ep.me.m11.d17:lemeLI.Epistle.title	
ltx/swh_ke_oak/le.ep.me.m11.d17:lemeLI.Epistle.version	
