ltx/swh_ke_oak/le.pr.me.r71:leprVE.reading.book	@ltx/swh_ke_oak/bible:Isaiah
ltx/swh_ke_oak/le.pr.me.r71:leprVE.reading.chapverse	(61:1-9)
ltx/swh_ke_oak/le.pr.me.r71:leprVE.reading.text	Bwana Mwenyezi-Mungu amenijaza roho yake, maana Mwenyezi-Mungu amenipaka mafuta, akanituma niwaletee wanaokandamizwa habari njema, niwatibu waliovunjika moyo, niwatangazie mateka kwamba watapata uhuru, na wafungwa kwamba watafunguliwa. Amenituma niutangaze mwaka wake wa neema, na siku ya Mungu wetu ya kulipiza kisasi; niwafariji wote wanaoomboleza; niwape wale wanaoomboleza katika Siyoni taji la maua badala ya majivu, mafuta ya furaha badala ya maombolezo, vazi la sifa badala ya moyo mzito. Nao wataitwa mialoni mathubuti, aliyopanda Mwenyezi-Mungu kuonesha utukufu wake. Watayajenga upya magofu ya zamani, wataisimika miji iliyoharibiwa hapo kwanza; wataitengeneza miji iliyobomolewa, uharibifu wa vizazi vingi vilivyopita. Wageni watakuwa hapo kuwachungia mifugo yenu; watawalimia na kuwatunzia mizabibu yenu. Nanyi mtaitwa: "Makuhani wa Mwenyezi-Mungu,'' mtaitwa: "Watumishi wake Mungu wetu." Mtafaidika kwa utajiri wa mataifa, mtatukuka kwa mali zao. Kwa vile mlipata aibu marudufu, watu wakaona kuwa fedheha ni majaliwa yenu, sasa mtapata eneo maradufu kuwa mali yenu, na furaha yenu itadumu milele. "Mimi Mwenyezi-Mungu napenda haki; nachukia unyang''anyi na uhalifu. Nitawatuza watu wangu kwa uaminifu, nitafanya nao agano la milele. Wazawa wao watakuwa maarufu kati ya mataifa; watajulikana kuwa maarufu kati ya watu wengine. Kila atakayewaona atakiri kwamba wao ni watu aliowabariki Mwenyezi-Mungu." Nitafurahi sana kwa sababu ya Mwenyezi-Mungu, nafsi yangu itashangilia kwa sababu ya Mungu wangu.
ltx/swh_ke_oak/le.pr.me.r71:leprVE.reading.title	
ltx/swh_ke_oak/le.pr.me.r71:leprVE.reading.version	@ltx/swh_ke_oak/properties:version.designation
