ltx/swh_ke_oak/template.titles:bap.html.tab	
ltx/swh_ke_oak/template.titles:bap.pdf.cover	
ltx/swh_ke_oak/template.titles:bap.pdf.header	
ltx/swh_ke_oak/template.titles:cdo.html.tab	
ltx/swh_ke_oak/template.titles:cdo.pdf.cover	
ltx/swh_ke_oak/template.titles:cdo.pdf.header	
ltx/swh_ke_oak/template.titles:chi.html.tab	
ltx/swh_ke_oak/template.titles:chi.pdf.cover	
ltx/swh_ke_oak/template.titles:chi.pdf.header	
ltx/swh_ke_oak/template.titles:clps.additionallitanies.top	
ltx/swh_ke_oak/template.titles:clps.prayers.top	
ltx/swh_ke_oak/template.titles:co.greatcompline.pdf.cover	
ltx/swh_ke_oak/template.titles:co.greatcompline.pdf.header	
ltx/swh_ke_oak/template.titles:co.html.tab	
ltx/swh_ke_oak/template.titles:co.pdf.cover	
ltx/swh_ke_oak/template.titles:co.pdf.header	
ltx/swh_ke_oak/template.titles:co.salutations.pdf.cover	
ltx/swh_ke_oak/template.titles:co.salutations.pdf.header	
ltx/swh_ke_oak/template.titles:co.smallcompline.cover	
ltx/swh_ke_oak/template.titles:co.smallcompline.header	
ltx/swh_ke_oak/template.titles:con.html.tab	
ltx/swh_ke_oak/template.titles:con.pdf.cover	
ltx/swh_ke_oak/template.titles:con.pdf.header	
ltx/swh_ke_oak/template.titles:d	
ltx/swh_ke_oak/template.titles:d.delimiter	
ltx/swh_ke_oak/template.titles:d.of	
ltx/swh_ke_oak/template.titles:d.on	
ltx/swh_ke_oak/template.titles:d.onFridayAfternoon	
ltx/swh_ke_oak/template.titles:d.onFridayEvening	
ltx/swh_ke_oak/template.titles:d.onFridayMorning	
ltx/swh_ke_oak/template.titles:d.onMondayEvening	
ltx/swh_ke_oak/template.titles:d.onMondayMorning	
ltx/swh_ke_oak/template.titles:d.onSaturdayEvening	
ltx/swh_ke_oak/template.titles:d.onSaturdayMorning	
ltx/swh_ke_oak/template.titles:d.onSundayEvening	
ltx/swh_ke_oak/template.titles:d.onSundayMorning	
ltx/swh_ke_oak/template.titles:d.onThursdayEvening	
ltx/swh_ke_oak/template.titles:d.onThursdayMorning	
ltx/swh_ke_oak/template.titles:d.onTuesdayEvening	
ltx/swh_ke_oak/template.titles:d.onTuesdayMorning	
ltx/swh_ke_oak/template.titles:d.onWednesdayEvening	
ltx/swh_ke_oak/template.titles:d.onWednesdayMorning	
ltx/swh_ke_oak/template.titles:d.ontheeveof	
ltx/swh_ke_oak/template.titles:em.html.tab	
ltx/swh_ke_oak/template.titles:em.pdf.cover	
ltx/swh_ke_oak/template.titles:em.pdf.header	
ltx/swh_ke_oak/template.titles:eo	
ltx/swh_ke_oak/template.titles:eu	
ltx/swh_ke_oak/template.titles:fun.html.tab	
ltx/swh_ke_oak/template.titles:fun.pdf.cover	
ltx/swh_ke_oak/template.titles:fun.pdf.header	
ltx/swh_ke_oak/template.titles:gh.html.tab	
ltx/swh_ke_oak/template.titles:gh.pdf.cover	
ltx/swh_ke_oak/template.titles:gh.pdf.header	
ltx/swh_ke_oak/template.titles:gp.html.tab	
ltx/swh_ke_oak/template.titles:gp.pdf.cover	
ltx/swh_ke_oak/template.titles:gp.pdf.header	
ltx/swh_ke_oak/template.titles:h1.html.tab	
ltx/swh_ke_oak/template.titles:h1.pdf.cover	
ltx/swh_ke_oak/template.titles:h1.pdf.header	
ltx/swh_ke_oak/template.titles:h3.html.tab	
ltx/swh_ke_oak/template.titles:h3.pdf.cover	
ltx/swh_ke_oak/template.titles:h3.pdf.header	
ltx/swh_ke_oak/template.titles:h6.html.tab	
ltx/swh_ke_oak/template.titles:h6.pdf.cover	
ltx/swh_ke_oak/template.titles:h6.pdf.header	
ltx/swh_ke_oak/template.titles:h9.html.tab	
ltx/swh_ke_oak/template.titles:h9.pdf.cover	
ltx/swh_ke_oak/template.titles:h9.pdf.header	
ltx/swh_ke_oak/template.titles:he	
ltx/swh_ke_oak/template.titles:hi	
ltx/swh_ke_oak/template.titles:ho	
ltx/swh_ke_oak/template.titles:hw.beforeresurrection	
ltx/swh_ke_oak/template.titles:hw.bridegroomservice	
ltx/swh_ke_oak/template.titles:hw.lamentation	
ltx/swh_ke_oak/template.titles:hw.mergedscores.title	
ltx/swh_ke_oak/template.titles:hw.ofholyfriday	
ltx/swh_ke_oak/template.titles:hw.ofholymonday	
ltx/swh_ke_oak/template.titles:hw.ofholysaturday	
ltx/swh_ke_oak/template.titles:hw.ofholythursday	
ltx/swh_ke_oak/template.titles:hw.ofholytuesday	
ltx/swh_ke_oak/template.titles:hw.ofholywednesday	
ltx/swh_ke_oak/template.titles:hw.palmsunday	
ltx/swh_ke_oak/template.titles:hw.passion	
ltx/swh_ke_oak/template.titles:hw.pdf.cover	
ltx/swh_ke_oak/template.titles:hw.removal	
ltx/swh_ke_oak/template.titles:ka	
ltx/swh_ke_oak/template.titles:le	
ltx/swh_ke_oak/template.titles:li.html.tab	LITURGHIA
ltx/swh_ke_oak/template.titles:li.pdf.cover	
ltx/swh_ke_oak/template.titles:li.pdf.header	
ltx/swh_ke_oak/template.titles:li1.html.tab	LITURGHIA TAKATIFU YA MTAKATIFU YOHANA KRISOSTOMU
ltx/swh_ke_oak/template.titles:li2.html.tab	LITURGIA TAKATIFU YA MTAKATIFU YOHANA KRISOSTOMO
ltx/swh_ke_oak/template.titles:li2.pdf.cover	Liturghia Takatifu ya Mtakatifu Basilio Mkuu
ltx/swh_ke_oak/template.titles:li2.pdf.header	Liturgy of St. Basil
ltx/swh_ke_oak/template.titles:li3.html.tab	
ltx/swh_ke_oak/template.titles:li3.pdf.cover	
ltx/swh_ke_oak/template.titles:li3.pdf.header	
ltx/swh_ke_oak/template.titles:li4.html.tab	
ltx/swh_ke_oak/template.titles:li4.pdf.cover	
ltx/swh_ke_oak/template.titles:li4.pdf.header	
ltx/swh_ke_oak/template.titles:li5.html.tab	
ltx/swh_ke_oak/template.titles:li5.pdf.cover	
ltx/swh_ke_oak/template.titles:li5.pdf.header	
ltx/swh_ke_oak/template.titles:m.mode	
ltx/swh_ke_oak/template.titles:m.month	
ltx/swh_ke_oak/template.titles:ma.html.tab	IBADA YA ASUBUHI
ltx/swh_ke_oak/template.titles:ma.pdf.cover	
ltx/swh_ke_oak/template.titles:ma.pdf.header	
ltx/swh_ke_oak/template.titles:ma2.html.tab	
ltx/swh_ke_oak/template.titles:ma2.pdf.cover	
ltx/swh_ke_oak/template.titles:ma2.pdf.header	
ltx/swh_ke_oak/template.titles:ma3.html.tab	
ltx/swh_ke_oak/template.titles:ma3.pdf.cover	
ltx/swh_ke_oak/template.titles:ma3.pdf.header	
ltx/swh_ke_oak/template.titles:ma4.html.tab	
ltx/swh_ke_oak/template.titles:ma4.pdf.cover	
ltx/swh_ke_oak/template.titles:ma4.pdf.header	
ltx/swh_ke_oak/template.titles:ma5.html.tab	
ltx/swh_ke_oak/template.titles:ma5.pdf.cover	
ltx/swh_ke_oak/template.titles:ma5.pdf.header	
ltx/swh_ke_oak/template.titles:me	
ltx/swh_ke_oak/template.titles:mem.html.tab	
ltx/swh_ke_oak/template.titles:mem.pdf.cover	
ltx/swh_ke_oak/template.titles:mem.pdf.header	
ltx/swh_ke_oak/template.titles:mo.html.tab	
ltx/swh_ke_oak/template.titles:mo.pdf.cover	
ltx/swh_ke_oak/template.titles:mo.pdf.header	
ltx/swh_ke_oak/template.titles:oc	
ltx/swh_ke_oak/template.titles:ord.html.tab	
ltx/swh_ke_oak/template.titles:ord.pdf.cover	
ltx/swh_ke_oak/template.titles:ord.pdf.header	
ltx/swh_ke_oak/template.titles:pa.agape	
ltx/swh_ke_oak/template.titles:pa.brightweek	
ltx/swh_ke_oak/template.titles:pa.easter	
ltx/swh_ke_oak/template.titles:pa.ofbrightweek	
ltx/swh_ke_oak/template.titles:pa.ofpascha	
ltx/swh_ke_oak/template.titles:pa.pascha	
ltx/swh_ke_oak/template.titles:pa.resurrection	
ltx/swh_ke_oak/template.titles:pe	
ltx/swh_ke_oak/template.titles:pen.html.tab	
ltx/swh_ke_oak/template.titles:pen.pdf.cover	
ltx/swh_ke_oak/template.titles:pen.pdf.header	
ltx/swh_ke_oak/template.titles:pl.html.tab	
ltx/swh_ke_oak/template.titles:pl.pdf.cover	
ltx/swh_ke_oak/template.titles:pl.pdf.header	
ltx/swh_ke_oak/template.titles:ps	
ltx/swh_ke_oak/template.titles:sat	
ltx/swh_ke_oak/template.titles:service	
ltx/swh_ke_oak/template.titles:sp.html.tab	
ltx/swh_ke_oak/template.titles:sp.pdf.cover	
ltx/swh_ke_oak/template.titles:sp.pdf.header	
ltx/swh_ke_oak/template.titles:sun	
ltx/swh_ke_oak/template.titles:sv.html.tab	
ltx/swh_ke_oak/template.titles:sv.pdf.cover	
ltx/swh_ke_oak/template.titles:sv.pdf.header	
ltx/swh_ke_oak/template.titles:swb.html.tab	
ltx/swh_ke_oak/template.titles:swb.pdf.cover	
ltx/swh_ke_oak/template.titles:swb.pdf.header	
ltx/swh_ke_oak/template.titles:sy	
ltx/swh_ke_oak/template.titles:tr	
ltx/swh_ke_oak/template.titles:unc.html.tab	
ltx/swh_ke_oak/template.titles:unc.pdf.cover	
ltx/swh_ke_oak/template.titles:unc.pdf.header	
ltx/swh_ke_oak/template.titles:ve.html.tab	MAOMBI YA JIONI (VESPERS)
ltx/swh_ke_oak/template.titles:ve.pdf.cover	
ltx/swh_ke_oak/template.titles:ve.pdf.header	
ltx/swh_ke_oak/template.titles:ve2.html.tab	
ltx/swh_ke_oak/template.titles:ve2.pdf.cover	
ltx/swh_ke_oak/template.titles:ve2.pdf.header	
ltx/swh_ke_oak/template.titles:ve3.html.tab	
ltx/swh_ke_oak/template.titles:ve3.pdf.cover	
ltx/swh_ke_oak/template.titles:ve3.pdf.header	
ltx/swh_ke_oak/template.titles:ve4.html.tab	
ltx/swh_ke_oak/template.titles:ve4.pdf.cover	
ltx/swh_ke_oak/template.titles:ve4.pdf.header	
ltx/swh_ke_oak/template.titles:ve5.html.tab	
ltx/swh_ke_oak/template.titles:ve5.pdf.cover	
ltx/swh_ke_oak/template.titles:ve5.pdf.header	
ltx/swh_ke_oak/template.titles:vl.html.tab	
ltx/swh_ke_oak/template.titles:vl.pdf.cover	
ltx/swh_ke_oak/template.titles:vl.pdf.header	
ltx/swh_ke_oak/template.titles:wed.html.tab	
ltx/swh_ke_oak/template.titles:wed.pdf.cover	
ltx/swh_ke_oak/template.titles:wed.pdf.header	
ltx/swh_ke_oak/template.titles:wkd	
