ltx/swh_ke_oak/le.pr.me.r17:leprVE.reading.book	@ltx/swh_ke_oak/bible:Kings2
ltx/swh_ke_oak/le.pr.me.r17:leprVE.reading.chapverse	(5:9-14)
ltx/swh_ke_oak/le.pr.me.r17:leprVE.reading.text	Naamani alienda na farasi wake na gari lake mpaka mlangoni mwa Elisha. Elisha akamtuma mtumishi wake amwambie, "Nenda ukaogemara saba mtoni Yordani, nawe utapona kabisa." Lakini Naamani alikasirika sana, akaenda zake akisema, "Nilidhani kwamba hakika atanijia na kumwomba Mwenyezi-Mungu, Mungu wake, apitishe mikono yake juu ya mahali ninapougua na kuniponya! Isitoshe, je, mito Abana na Farpari ya huko Damasko si bora kuliko mito yote ya Israeli? Je, nisingeweza kuoga humo na kupona?" Akaondoka na kurudi nyumbani, huku amekasirika sana. Watumishi wake wakamwendea na kumwambia, "Baba yetu kama nabii angekuambia ufanye jambo fulani gumu, je, hungelifanya? Sasa, aliyokuambia tu ni: ''Jioshe, ili upone!''" Basi, Naamani akateremka mtoni Yordani akajitumbukiza humo mara saba, kama alivyoagizwa na Elisha mtu wa Mungu, naye akapona kabisa. Ngozi yake ikawa imara na yenye afya kama mtoto mdogo.
ltx/swh_ke_oak/le.pr.me.r17:leprVE.reading.title	
ltx/swh_ke_oak/le.pr.me.r17:leprVE.reading.version	@ltx/swh_ke_oak/properties:version.designation
