ltx/swh_ke_oak/le.go.mc.d219:lemcLI.Gospel.book	@ltx/swh_ke_oak/bible:Mark
ltx/swh_ke_oak/le.go.mc.d219:lemcLI.Gospel.chapverse	(5:24-34)
ltx/swh_ke_oak/le.go.mc.d219:lemcLI.Gospel.text	Wakati huo watu wengi sana walimfuata, wakawa wanamsonga kila upande. Mmojawapo alikuwa mwanamke mwenye ugonjwa wa kutokwa damu kwa muda wa miaka kumi na miwili. Mwanamke huyo alikuwa amekwisha sumbuka sana kuwaendea waganga wengi. Na ingawa alikuwa amekwisha tumia mali yake yote, hakupata nafuu bali hali yake ilizidi kuwa mbaya. Alikuwa amesikia habari za Yesu, na hivyo akaupenya msongamano wa watu kutoka nyuma, akagusa vazi lake. Alifanya hivyo, maana alijisemea, "Nikigusa tu vazi lake, nitapona." Mara chemchemi ya damu yake ikakauka, akajisikia mwilini mwake kwamba ameponywa ugonjwa wake. Yesu alitambua mara kwamba nguvu imemtoka. Basi akageukia ule umati wa watu, akauliza, "Nani aliyegusa mavazi yangu?" Wanafunzi wake wakamjibu, "Unaona jinsi watu wanavyokusonga; mbona wauliza nani aliyekugusa?" Lakini Yesu akaendelea kutazama amwone huyo aliyefanya hivyo. Hapo huyo mwanamke, akifahamu yaliyompata, akajitokeza akitetemeka kwa hofu, akajitupa chini mbele ya Yesu na kusema ukweli wote. Yesu akamwambia, "Binti, imani yako imekuponya. Nenda kwa amani, upone kabisa ugonjwa wako."
ltx/swh_ke_oak/le.go.mc.d219:lemcLI.Gospel.title	
ltx/swh_ke_oak/le.go.mc.d219:lemcLI.Gospel.version	
