ltx/swh_ke_oak/le.go.me.m09.dSunAC:lemeLI.Gospel.book	@ltx/swh_ke_oak/bible:Mark
ltx/swh_ke_oak/le.go.me.m09.dSunAC:lemeLI.Gospel.chapverse	(8:34-38; 9:1)
ltx/swh_ke_oak/le.go.me.m09.dSunAC:lemeLI.Gospel.text	Bwana alisema, "Kama mtu yeyote anataka kuwa mfuasi wangu, lazima ajikane mwenyewe, auchukue msalaba wake, anifuate. Maana mtu anayetaka kuyaokoa maisha yake mwenyewe, atayapoteza, lakini mtu anayepoteza maisha yake kwa ajili yangu na kwa ajili ya Habari Njema, atayaokoa. Je, kuna faida gani mtu kuupata ulimwengu wote na kuyapoteza maisha yake? Ama mtu atatoa kitu gani badala ya maisha yake? Mtu yeyote katika kizazi hiki kiovu na kisichomjali Mungu, anayenionea aibu mimi na mafundisho yangu, Mwana wa Mtu atamwonea aibu mtu huyo, wakati atakapokuja katika utukufu wa Baba yake pamoja na malaika watakatifu." Yesu akaendelea kuwaambia, "Kweli nawaambieni, wako wengine papa hapa ambao hawatakufa kabla ya kuona ufalme wa Mungu ukija kwa enzi."
ltx/swh_ke_oak/le.go.me.m09.dSunAC:lemeLI.Gospel.title	
ltx/swh_ke_oak/le.go.me.m09.dSunAC:lemeLI.Gospel.version	
