ltx/swh_ke_oak/le.go.lu.d076:leluLI.Gospel.book	@ltx/swh_ke_oak/bible:Luke
ltx/swh_ke_oak/le.go.lu.d076:leluLI.Gospel.chapverse	(12:32-40)
ltx/swh_ke_oak/le.go.lu.d076:leluLI.Gospel.text	Bwana alisema, "Msiogope, enyi kundi dogo! Maana Baba yenu amependa kuwapeni ufalme. Uzeni mali yenu mkawape maskini hizo fedha. Jifanyieni mifuko isiyochakaa, na kujiwekea hazina mbinguni ambako haitapungua. Huko wezi hawakaribii, wala nondo hawaharibu. Pale ilipo hazina yako, ndipo pia utakapokuwa moyo wako. Muwe tayari mmejifunga mkanda kiunoni, na taa zenu ziwe zinawaka; muwe kama watumishi wanaomngojea bwana wao arudi kutoka harusini, ili wamfungulie mara atakapobisha. Heri yao watumishi wale ambao bwana wao atakaporudi atawakuta wanakesha! Nawaambieni hakika, huyo bwana atajifunga mkanda kiunoni, atawaketisha mezani na kuwahudumia. Hata kama atarudi usiku wa manane au alfajiri na kuwakuta wanakesha, heri yao watumishi hao! Jueni kwamba, kama mwenye nyumba angejua saa ambayo mwizi atakuja, angekesha, wala hangeiacha nyumba yake ivunjwe. Nanyi, kadhalika muwe tayari, maana Mwana wa Mtu atakuja saa msiyoitazamia."
ltx/swh_ke_oak/le.go.lu.d076:leluLI.Gospel.title	
ltx/swh_ke_oak/le.go.lu.d076:leluLI.Gospel.version	
