ltx/swh_ke_oak/le.pr.me.r41a:leprVE.reading.book	@ltx/swh_ke_oak/bible:Exodus
ltx/swh_ke_oak/le.pr.me.r41a:leprVE.reading.chapverse	(3:1-8)
ltx/swh_ke_oak/le.pr.me.r41a:leprVE.reading.text	Mose alipeleka kundi hilo upande wa magharibi wa jangwa, akaufikia mlima Horebu, mlima wa Mungu. Basi, malaika wa Mwenyezi-Mungu akamtokea katika mwali wa moto katikati ya kichaka. Mose akaangalia, akashangaa kuona kichaka kinawaka moto na wala hakiungui. Basi, akajisemea, "Hiki ni kioja! Kichaka kuwaka moto na kisiungue? Hebu nitazame vizuri." Mwenyezi-Mungu alipoona kwamba Mose amegeuka kukiangalia kichaka, akamwita pale kichakani, "Mose! Mose!" Mose akaitika, "Naam! Nasikiliza!" Mwenyezi-Mungu akamwambia, "Usije karibu! Vua viatu vyako kwa sababu mahali unaposimama ni mahali patakatifu." Kisha Mungu akamwambia, "Mimi ni Mungu wa baba yako; Mungu wa Abrahamu, Mungu wa Isaka, Mungu wa Yakobo." Mose akaufunika uso wake kwa kuwa aliogopa kumwangalia Mungu. Kisha Mwenyezi-Mungu akamwambia, "Nimeyaona mateso ya watu wangu walioko nchini Misri na nimekisikia kilio chao kinachosababishwa na wanyapara wao. Najua mateso yao, na hivyo, nimeshuka ili niwaokoe mikononi mwa Wamisri. Nitawatoa humo nchini na kuwapeleka katika nchi nzuri na kubwa; nchi inayotiririka maziwa na asali."
ltx/swh_ke_oak/le.pr.me.r41a:leprVE.reading.title	
ltx/swh_ke_oak/le.pr.me.r41a:leprVE.reading.version	@ltx/swh_ke_oak/properties:version.designation
