ltx/swh_ke_oak/le.ep.mc.d234:lemcLI.Epistle.book	@ltx/swh_ke_oak/bible:Ephesians
ltx/swh_ke_oak/le.ep.mc.d234:lemcLI.Epistle.chapverse	(2:19-22; 3:1-7)
ltx/swh_ke_oak/le.ep.mc.d234:lemcLI.Epistle.text	Ndugu zangu, nyinyi si wageni tena, wala si watu wa nje. Nyinyi ni raia pamoja na watu wa Mungu, na ni watu wa jamaa ya Mungu. Mmejengwa juu ya msingi uliowekwa na mitume na manabii, naye Kristo mwenyewe ndiye jiwe kuu la msingi. Yeye ndiye mwenye kuliunganisha jengo lote na kulikuza hata liwe hekalu takatifu kwa ajili ya Bwana. Katika kuungana naye, nyinyi pia mnajengwa pamoja na wote wengine, muwe makao ya Mungu kwa njia ya Roho wake. Kutokana na hayo, mimi Paulo, mfungwa wa Kristo Yesu kwa ajili yenu, namwomba Mungu. Bila shaka mmekwisha sikia kwamba Mungu, kwa neema yake, alinikabidhi kazi hii niifanye kwa faida yenu. Mimi nilijulishwa kwa njia ya ufunuo mpango wake uliofichika. (Nimeandika kwa ufupi juu ya jambo hili, nanyi mkiyasoma maneno yangu mtaweza kujua jinsi ninavyoielewa siri hiyo ya Kristo.) Zamani watu hawakujulishwa siri hiyo; lakini sasa Mungu amewajulisha mitume na manabii wake watakatifu kwa njia ya Roho. Siri yenyewe ni hii: kwa njia ya injili watu wa mataifa mengine wanapata sehemu yao pamoja na Wayahudi katika zile baraka za Mungu; wao ni viungo vya mwili uleule, na wanashiriki ahadi ileile aliyofanya Mungu kwa njia ya Kristo Yesu. Mimi nimefanywa kuwa mtumishi wa injili kwa neema ya pekee aliyonijalia Mungu kwa uwezo wake mkuu.
ltx/swh_ke_oak/le.ep.mc.d234:lemcLI.Epistle.title	
ltx/swh_ke_oak/le.ep.mc.d234:lemcLI.Epistle.version	
