ltx/swh_ke_oak/le.ep.mc.d232:lemcLI.Epistle.book	@ltx/swh_ke_oak/bible:Corinthians2
ltx/swh_ke_oak/le.ep.mc.d232:lemcLI.Epistle.chapverse	(6:1-10)
ltx/swh_ke_oak/le.ep.mc.d232:lemcLI.Epistle.text	Ndugu zangu, tukiwa wafanyakazi pamoja na Mungu, tunawasihi msikubali ile neema mliyopokea kutoka kwa Mungu ipotee bure. Mungu asema hivi: "Wakati wa kufaa nimekusikiliza, wakati wa wokovu nikakusaidia." Basi, sasa ndio wakati wa kufaa; sasa ndiyo siku ya wokovu! Kusudi tusiwe na lawama yoyote katika utumishi wetu, hatupendi kumwekea mtu yeyote kizuizi chochote. Badala yake, tunajionesha kuwa kweli watumishi wa Mungu kwa kila kitu: kwa uvumilivu mwingi wakati wa mateso, shida na taabu. Tumepigwa, tumetiwa gerezani na kuzomewa hadharani; tumefanya kazi tukachoka; tumekesha na kukaa bila kula. Tunajionesha kuwa watumishi wa Mungu kwa usafi wa moyo, elimu, uvumilivu na wema; kwa Roho Mtakatifu, kwa upendo usio na unafiki, kwa ujumbe wa kweli na kwa nguvu ya Mungu. Uadilifu ndiyo silaha yetu kila upande. Tuko tayari kupata heshima na kudharauliwa, kulaumiwa na kusifiwa. Twadhaniwa kuwa waongo, kumbe twasema kweli; kama wasiojulikana, kumbe twajulikana kwa wote; kama waliokufa, lakini mwonavyo, sisi ni hai kabisa. Ingawa tumeadhibiwa, hatukuuawa; ingawa tunayo huzuni, twafurahi daima; ingawa tu maskini, twatajirisha watu wengi; twaonekana kuwa watu tusio na chochote, kumbe tuna kila kitu.
ltx/swh_ke_oak/le.ep.mc.d232:lemcLI.Epistle.title	
ltx/swh_ke_oak/le.ep.mc.d232:lemcLI.Epistle.version	
