ltx/swh_ke_oak/le.go.mc.d159:lemcLI.Gospel.book	@ltx/swh_ke_oak/bible:Matthew
ltx/swh_ke_oak/le.go.mc.d159:lemcLI.Gospel.chapverse	(13:36-43)
ltx/swh_ke_oak/le.go.mc.d159:lemcLI.Gospel.text	Kisha Yesu aliwaaga wale watu, akaingia nyumbani. Wanafunzi wake wakamwendea, wakamwambia, "Tufafanulie ule mfano wa magugu shambani." Yesu akawaambia, "Mpanzi wa zile mbegu nzuri ni Mwana wa Mtu. Lile shamba ni ulimwengu. Zile mbegu nzuri ni watu wale ambao ufalme ni wao. Lakini yale magugu ni wale watu wa yule Mwovu. Adui aliyepanda yale magugu ni Ibilisi. Mavuno ni mwisho wa nyakati na wavunaji ni malaika. Kama vile magugu yanavyokusanywa na kuchomwa moto, ndivyo itakavyokuwa mwishoni mwa nyakati; Mwana wa Mtu atawatuma malaika wake wawakusanye kutoka katika ufalme wake wale wote wenye kusababisha dhambi, na wote wenye kutenda maovu, na kuwatupa katika tanuri ya moto, na huko watalia na kusaga meno. Kisha, wale wema watang''ara kama jua katika ufalme wa Baba yao. Mwenye masikio na asikie!"
ltx/swh_ke_oak/le.go.mc.d159:lemcLI.Gospel.title	
ltx/swh_ke_oak/le.go.mc.d159:lemcLI.Gospel.version	
