ltx/swh_ke_oak/le.ep.mc.d291:lemcLI.Epistle.book	@ltx/swh_ke_oak/bible:Thessalonians2
ltx/swh_ke_oak/le.ep.mc.d291:lemcLI.Epistle.chapverse	(2:1-12)
ltx/swh_ke_oak/le.ep.mc.d291:lemcLI.Epistle.pagenumber	
ltx/swh_ke_oak/le.ep.mc.d291:lemcLI.Epistle.text	Ndugu zanyu, sasa yahusu kuja kwake Bwana wetu Yesu Kristo na kukusanywa kwetu pamoja, tukae naye. Ndugu, tunawaombeni sana msifadhaike upesi moyoni, na wala msitiwe wasiwasi kwa sababu ya madai kwamba siku ya Bwana imekwisha fika. Labda inadhaniwa kwamba jambo hili limetokana na uaguzi fulani, mahubiri au barua inayosemekana kuwa imetoka kwetu. Msikubali kudanganywa na mtu yeyote kwa namna yoyote ile. Maana siku hiyo haitakuja mpaka kwanza ule uasi utokee na yule Mwovu aonekane, ambaye mwisho wake ni kuangamizwa kabisa. Yeye hujikuza yeye mwenyewe juu ya kila kitu wanachokiona watu kuwa ni mungu, au wanachokiabudu; hata ataingia na kuketi ndani ya hekalu la Mungu akijidai kuwa Mungu. Je, hamkumbuki kwamba niliwaambieni haya yote wakati nilipokuwa pamoja nanyi? Lakini kuna kitu kinachomzuia sasa, nanyi mwakijua kitu hicho. Basi, huyo Mwovu ataonekana wakati wake ufaao. Hata hivyo, Mwovu huyo aliyefichika anafanya kazi sasa, lakini hataonekana mpaka yule anayemzuia aondolewe. Hapo ndipo Mwovu atakapotokea; lakini Bwana Yesu anapokuja atamuua kwa pumzi ya kinywa chake na kumwangamiza kwa mng''ao wa kuja kwake. Huyo Mwovu atakuja na nguvu za Shetani na kufanya kila namna ya miujiza na maajabu ya uongo, na kutumia udanganyifu wa kila namna kwa wale walio katika mkumbo wa kupotea. Hao watapotea kwa sababu hawakuupokea na kuupenda ule ukweli ili waokolewe. Ndiyo maana Mungu amewaweka chini ya nguvu ya upotovu, wauamini uongo. Matokeo yake ni kwamba wote wasioamini ukweli, bali wanafurahia dhambi, watahukumiwa.
ltx/swh_ke_oak/le.ep.mc.d291:lemcLI.Epistle.title	
ltx/swh_ke_oak/le.ep.mc.d291:lemcLI.Epistle.version	
