ltx/swh_ke_oak/le.go.mc.d093:lemcLI.Gospel.book	@ltx/swh_ke_oak/bible:John
ltx/swh_ke_oak/le.go.mc.d093:lemcLI.Gospel.chapverse	(6:56-69)
ltx/swh_ke_oak/le.go.mc.d093:lemcLI.Gospel.text	Bwana aliwaambia Wayahudi waliomwamini, "Aulaye mwili wangu na kunywa damu yangu, akaa ndani yangu, nami nakaa ndani yake. Baba aliye hai alinituma, nami naishi kwa sababu yake; vivyo hivyo anilaye mimi ataishi pia kwa sababu yangu. Basi, huu ndio mkate ulioshuka kutoka mbinguni; si kama mana waliyokula baba zenu, wakafa. Aulaye mkate huu atakuwa hai milele." Yesu alisema hayo alipokuwa akifundisha katika sunagogi kule Kafarnaumu. Basi, wengi wa wafuasi wake waliposikia hayo, wakasema, "Haya ni mambo magumu! Nani awezaye kuyasikiliza?" Yesu alijua bila kuambiwa na mtu kwamba wanafunzi wake walikuwa wananung''unika juu ya jambo hilo, akawauliza, "Je, jambo hili linawafanya muwe na mashaka? Itakuwaje basi, mtakapomwona Mwana wa Mtu akipanda kwenda kule alikokuwa kwanza? Roho ndiyo iletayo uhai; mwili hauwezi kitu. Maneno niliyowaambia ni roho na uhai. Hata hivyo, wako baadhi yenu wasioamini." (Yesu alisema hivyo kwani alijua tangu mwanzo ni kina nani wasioamini, na pia ni nani atakayemsaliti). Kisha akasema, "Ndiyo maana niliwaambieni kwamba hakuna awezaye kuja kwangu asipowezeshwa na Baba yangu." Kutokana na hayo, wengi wa wafuasi wake walirudi nyuma, wasiandamane naye tena. Basi, Yesu akawauliza wale kumi na wawili, "Je, nanyi pia mwataka kwenda zenu?" Simoni Petro akamjibu, "Bwana, tutakwenda kwa nani? Wewe unayo maneno ya uhai wa milele. Sisi tunaamini, na tunajua kwamba wewe ndiwe yule Mtakatifu wa Mungu."
ltx/swh_ke_oak/le.go.mc.d093:lemcLI.Gospel.title	
ltx/swh_ke_oak/le.go.mc.d093:lemcLI.Gospel.version	
