ltx/swh_ke_oak/le.go.lu.d052:leluLI.Gospel.book	@ltx/swh_ke_oak/bible:Luke
ltx/swh_ke_oak/le.go.lu.d052:leluLI.Gospel.chapverse	(12:48-59)
ltx/swh_ke_oak/le.go.lu.d052:leluLI.Gospel.text	Bwana alisema, "Aliyepewa vingi atadaiwa vingi; aliyepewa vingi zaidi atadaiwa vingi zaidi. Nimekuja kuwasha moto duniani; laiti ungekuwa umewaka tayari! Ninao ubatizo ambao inanipasa niupokee; jinsi gani ninavyohangaika mpaka ukamilike! Mnadhani nimekuja kuleta amani duniani? Hata kidogo; si amani bali utengano. Na tangu sasa, jamaa ya watu watano itagawanyika; watatu dhidi ya wawili, na wawili dhidi ya watatu. Baba atakuwa dhidi ya mwanawe, mwana dhidi ya baba yake; mama dhidi ya bintiye, binti dhidi ya mama yake; mamamkwe dhidi ya mke wa mwanawe na huyo dhidi ya mamamkwe wake." Yesu akayaambia tena makundi ya watu, "Mnapoona mawingu yakitokea upande wa magharibi, mara mwasema: ''Mvua itanyesha,'' na kweli hunyesha. Mnapoona upepo wa kusi unavuma, mwasema: ''Kutakuwa na joto,'' na ndivyo inavyokuwa. Enyi wanafiki! Mnajua kutabiri hali ya hewa kwa kuangalia hali ya nchi na anga; kwa nini, basi, hamwezi kujua maana ya nyakati hizi? Na kwa nini hamwezi kujiamulia wenyewe jambo la kufanya? Maana kama mshtaki wako anakupeleka mahakamani, ingekuwa afadhali kwako kupatana naye mkiwa bado njiani, ili asije akakupeleka mbele ya hakimu, naye hakimu akakutoa kwa polisi, nao wakakutia ndani. Hakika hutatoka huko, nakuambia, mpaka utakapomaliza kulipa senti ya mwisho."
ltx/swh_ke_oak/le.go.lu.d052:leluLI.Gospel.title	
ltx/swh_ke_oak/le.go.lu.d052:leluLI.Gospel.version	
