ltx/swh_ke_oak/le.ep.mc.d265:lemcLI.Epistle.book	@ltx/swh_ke_oak/bible:Colossians
ltx/swh_ke_oak/le.ep.mc.d265:lemcLI.Epistle.chapverse	(2:1-7)
ltx/swh_ke_oak/le.ep.mc.d265:lemcLI.Epistle.text	Ndugu zangu, napenda mjue jinsi ninavyofanya kazi kwa bidii kwa ajili yenu, kwa ajili ya watu wa Laodikea na kwa ajili ya wote ambao hawajapata kuniona kwa macho. Nafanya hivi kusudi mioyo yao ifarijiwe na kuvutwa pamoja katika upendo, ili wajazwe uthabiti mwingi uletwao na elimu ya kweli. Hapo wataijua siri ya Mungu ambayo ni Kristo mwenyewe. Ndani yake zimefichika hazina zote za hekima na elimu. Basi, nawaambieni, msikubali kudanganywa na mtu yeyote kwa maneno ya uongo hata kama ni ya kuvutia sana. Maana, ingawa mimi niko mbali nanyi kwa mwili, lakini niko pamoja nanyi kwa roho, na ninafurahi kuona uthabiti kamili mnaosimama nao pamoja katika imani yenu kwa Kristo. Maadamu nyinyi mmemkubali Kristo Yesu aliye Bwana, basi, ishini katika muungano naye. Muwe na mizizi ndani yake, mjijenge juu yake na kuwa imara katika imani kama mlivyofundishwa. Muwe na shukrani tele.
ltx/swh_ke_oak/le.ep.mc.d265:lemcLI.Epistle.title	
ltx/swh_ke_oak/le.ep.mc.d265:lemcLI.Epistle.version	
