ltx/swh_ke_oak/le.ep.mc.d301:lemcLI.Epistle.book	@ltx/swh_ke_oak/bible:Galatians
ltx/swh_ke_oak/le.ep.mc.d301:lemcLI.Epistle.chapverse	(3:8-12)
ltx/swh_ke_oak/le.ep.mc.d301:lemcLI.Epistle.pagenumber	
ltx/swh_ke_oak/le.ep.mc.d301:lemcLI.Epistle.text	Ndugu zangu, Maandiko Matakatifu yalionesha kabla kwamba Mungu atawafanya watu wa mataifa kuwa waadilifu kwa njia ya imani. Hivyo Maandiko Matakatifu yalitangulia kumtangazia Abrahamu Habari Njema: "Katika wewe mataifa yote yatabarikiwa." Basi, wale walio na imani wanabarikiwa pamoja na Abrahamu aliyeamini. Lakini wote wanaotegemea tu kutimiza yanayotakiwa na sheria, wako chini ya laana. Maana, Maandiko Matakatifu yasema: "Yeyote asiyeshika na kutimiza yote yaliyoandikwa katika kitabu cha sheria, yuko chini ya laana." Ni dhahiri kwamba sheria haiwezi kumfanya mtu kuwa mwadilifu; maana Maandiko yasema: "Mwadilifu kwa imani ataishi." Lakini sheria haitegemei imani, ila Maandiko yasema: "Mwenye kutimiza yanayotakiwa na sheria ataishi."
ltx/swh_ke_oak/le.ep.mc.d301:lemcLI.Epistle.title	
ltx/swh_ke_oak/le.ep.mc.d301:lemcLI.Epistle.version	
