ltx/swh_ke_oak/oc.m4.d4:ocLI.Beatitudes1.melody	
ltx/swh_ke_oak/oc.m4.d4:ocLI.Beatitudes1.mode	@ltx/swh_ke_oak/miscellanea:misc.Mode4
ltx/swh_ke_oak/oc.m4.d4:ocLI.Beatitudes1.text	@ltx/swh_ke_oak/oc.m4.d1:ocLI.Beatitudes1.text
ltx/swh_ke_oak/oc.m4.d4:ocLI.Beatitudes2.melody	
ltx/swh_ke_oak/oc.m4.d4:ocLI.Beatitudes2.mode	@ltx/swh_ke_oak/miscellanea:misc.Mode4
ltx/swh_ke_oak/oc.m4.d4:ocLI.Beatitudes2.text	
ltx/swh_ke_oak/oc.m4.d4:ocLI.Beatitudes3.melody	
ltx/swh_ke_oak/oc.m4.d4:ocLI.Beatitudes3.mode	@ltx/swh_ke_oak/miscellanea:misc.Mode4
ltx/swh_ke_oak/oc.m4.d4:ocLI.Beatitudes3.text	
ltx/swh_ke_oak/oc.m4.d4:ocLI.Beatitudes4.melody	
ltx/swh_ke_oak/oc.m4.d4:ocLI.Beatitudes4.mode	@ltx/swh_ke_oak/miscellanea:misc.Mode4
ltx/swh_ke_oak/oc.m4.d4:ocLI.Beatitudes4.text	
ltx/swh_ke_oak/oc.m4.d4:ocLI.BeatitudesBoth.melody	
ltx/swh_ke_oak/oc.m4.d4:ocLI.BeatitudesBoth.mode	@ltx/swh_ke_oak/miscellanea:misc.Mode4
ltx/swh_ke_oak/oc.m4.d4:ocLI.BeatitudesBoth.text	
ltx/swh_ke_oak/oc.m4.d4:ocLI.BeatitudesGlory.melody	
ltx/swh_ke_oak/oc.m4.d4:ocLI.BeatitudesGlory.mode	@ltx/swh_ke_oak/miscellanea:misc.Mode4
ltx/swh_ke_oak/oc.m4.d4:ocLI.BeatitudesGlory.text	
ltx/swh_ke_oak/oc.m4.d4:ocMA.ApolTheotokion.melody	
ltx/swh_ke_oak/oc.m4.d4:ocMA.ApolTheotokion.mode	@ltx/swh_ke_oak/miscellanea:misc.Mode4
ltx/swh_ke_oak/oc.m4.d4:ocMA.ApolTheotokion.text	@ltx/swh_ke_oak/oc.m4.d3:ocMA.Kathisma23.text
ltx/swh_ke_oak/oc.m4.d4:ocMA.AposTheotokion.melody	@ltx/swh_ke_oak/he.a.m4:heAU.OsGennaionEnMartysi.name
ltx/swh_ke_oak/oc.m4.d4:ocMA.AposTheotokion.mode	@ltx/swh_ke_oak/miscellanea:misc.Mode4
ltx/swh_ke_oak/oc.m4.d4:ocMA.AposTheotokion.text	
ltx/swh_ke_oak/oc.m4.d4:ocMA.Aposticha1.melody	
ltx/swh_ke_oak/oc.m4.d4:ocMA.Aposticha1.mode	@ltx/swh_ke_oak/miscellanea:misc.Mode4
ltx/swh_ke_oak/oc.m4.d4:ocMA.Aposticha1.text	
ltx/swh_ke_oak/oc.m4.d4:ocMA.Aposticha2.melody	@ltx/swh_ke_oak/miscellanea:misc.Automelon
ltx/swh_ke_oak/oc.m4.d4:ocMA.Aposticha2.mode	@ltx/swh_ke_oak/miscellanea:misc.Mode4
ltx/swh_ke_oak/oc.m4.d4:ocMA.Aposticha2.text	@ltx/swh_ke_oak/he.a.m4:heAU.EdokasSimeiosin.text
ltx/swh_ke_oak/oc.m4.d4:ocMA.Aposticha3.melody	
ltx/swh_ke_oak/oc.m4.d4:ocMA.Aposticha3.mode	@ltx/swh_ke_oak/miscellanea:misc.Mode4
ltx/swh_ke_oak/oc.m4.d4:ocMA.Aposticha3.text	
ltx/swh_ke_oak/oc.m4.d4:ocMA.C1Acrostic.text	
ltx/swh_ke_oak/oc.m4.d4:ocMA.C2Acrostic.text	
ltx/swh_ke_oak/oc.m4.d4:ocMA.Kathisma11.melody	
ltx/swh_ke_oak/oc.m4.d4:ocMA.Kathisma11.mode	@ltx/swh_ke_oak/miscellanea:misc.Mode4
ltx/swh_ke_oak/oc.m4.d4:ocMA.Kathisma11.text	Umetukomboa na laana ya sheria kwa damu yako ya thamani ukikongomewa msalabani, na kuumizwa kwa mkuki na kuvumilia umekuwa chemchemi kwa wanadamu. Ee Mwokozi wetu, utukufu kwako.
ltx/swh_ke_oak/oc.m4.d4:ocMA.Kathisma12.melody	@ltx/swh_ke_oak/miscellanea:misc.Automelon
ltx/swh_ke_oak/oc.m4.d4:ocMA.Kathisma12.mode	@ltx/swh_ke_oak/miscellanea:misc.Mode4
ltx/swh_ke_oak/oc.m4.d4:ocMA.Kathisma12.text	@ltx/swh_ke_oak/he.a.m4:heAU.OYpsotheisEnToStavro.text
ltx/swh_ke_oak/oc.m4.d4:ocMA.Kathisma13.melody	@ltx/swh_ke_oak/he.a.m4:heAU.KateplagiIosif.name
ltx/swh_ke_oak/oc.m4.d4:ocMA.Kathisma13.mode	@ltx/swh_ke_oak/miscellanea:misc.Mode4
ltx/swh_ke_oak/oc.m4.d4:ocMA.Kathisma13.text	
ltx/swh_ke_oak/oc.m4.d4:ocMA.Kathisma21.melody	@ltx/swh_ke_oak/miscellanea:misc.Automelon
ltx/swh_ke_oak/oc.m4.d4:ocMA.Kathisma21.mode	@ltx/swh_ke_oak/miscellanea:misc.Mode4
ltx/swh_ke_oak/oc.m4.d4:ocMA.Kathisma21.text	@ltx/swh_ke_oak/he.a.m4:heAU.TachyProkatalave.text
ltx/swh_ke_oak/oc.m4.d4:ocMA.Kathisma22.melody	@ltx/swh_ke_oak/he.a.m4:heAU.TachyProkatalave.name
ltx/swh_ke_oak/oc.m4.d4:ocMA.Kathisma22.mode	@ltx/swh_ke_oak/miscellanea:misc.Mode4
ltx/swh_ke_oak/oc.m4.d4:ocMA.Kathisma22.text	
ltx/swh_ke_oak/oc.m4.d4:ocMA.Kathisma23.melody	@ltx/swh_ke_oak/he.a.m4:heAU.TachyProkatalave.name
ltx/swh_ke_oak/oc.m4.d4:ocMA.Kathisma23.mode	@ltx/swh_ke_oak/miscellanea:misc.Mode4
ltx/swh_ke_oak/oc.m4.d4:ocMA.Kathisma23.text	
ltx/swh_ke_oak/oc.m4.d4:ocMA.Kathisma31.melody	@ltx/swh_ke_oak/he.a.m4:heAU.OYpsotheisEnToStavro.name
ltx/swh_ke_oak/oc.m4.d4:ocMA.Kathisma31.mode	@ltx/swh_ke_oak/miscellanea:misc.Mode4
ltx/swh_ke_oak/oc.m4.d4:ocMA.Kathisma31.text	
ltx/swh_ke_oak/oc.m4.d4:ocMA.Kathisma32.melody	
ltx/swh_ke_oak/oc.m4.d4:ocMA.Kathisma32.mode	@ltx/swh_ke_oak/miscellanea:misc.Mode4
ltx/swh_ke_oak/oc.m4.d4:ocMA.Kathisma32.text	@ltx/swh_ke_oak/pe.d127:peVE.Apolytikion2.text
ltx/swh_ke_oak/oc.m4.d4:ocMA.Kathisma33.melody	@ltx/swh_ke_oak/he.a.m4:heAU.OYpsotheisEnToStavro.name
ltx/swh_ke_oak/oc.m4.d4:ocMA.Kathisma33.mode	@ltx/swh_ke_oak/miscellanea:misc.Mode4
ltx/swh_ke_oak/oc.m4.d4:ocMA.Kathisma33.text	
ltx/swh_ke_oak/oc.m4.d4:ocMA.OdeW1C11.melody	@ltx/swh_ke_oak/he.h.m4:heHE.ThalassisToErythraion.name
ltx/swh_ke_oak/oc.m4.d4:ocMA.OdeW1C11.mode	@ltx/swh_ke_oak/miscellanea:misc.Mode4
ltx/swh_ke_oak/oc.m4.d4:ocMA.OdeW1C11.ode	@ltx/swh_ke_oak/miscellanea:misc.Ode1
ltx/swh_ke_oak/oc.m4.d4:ocMA.OdeW1C11.text	
ltx/swh_ke_oak/oc.m4.d4:ocMA.OdeW1C12.melody	@ltx/swh_ke_oak/he.h.m4:heHE.ThalassisToErythraion.name
ltx/swh_ke_oak/oc.m4.d4:ocMA.OdeW1C12.mode	@ltx/swh_ke_oak/miscellanea:misc.Mode4
ltx/swh_ke_oak/oc.m4.d4:ocMA.OdeW1C12.ode	@ltx/swh_ke_oak/miscellanea:misc.Ode1
ltx/swh_ke_oak/oc.m4.d4:ocMA.OdeW1C12.text	
ltx/swh_ke_oak/oc.m4.d4:ocMA.OdeW1C13.melody	@ltx/swh_ke_oak/he.h.m4:heHE.ThalassisToErythraion.name
ltx/swh_ke_oak/oc.m4.d4:ocMA.OdeW1C13.mode	@ltx/swh_ke_oak/miscellanea:misc.Mode4
ltx/swh_ke_oak/oc.m4.d4:ocMA.OdeW1C13.ode	@ltx/swh_ke_oak/miscellanea:misc.Ode1
ltx/swh_ke_oak/oc.m4.d4:ocMA.OdeW1C13.text	
ltx/swh_ke_oak/oc.m4.d4:ocMA.OdeW1C14.melody	@ltx/swh_ke_oak/he.h.m4:heHE.ThalassisToErythraion.name
ltx/swh_ke_oak/oc.m4.d4:ocMA.OdeW1C14.mode	@ltx/swh_ke_oak/miscellanea:misc.Mode4
ltx/swh_ke_oak/oc.m4.d4:ocMA.OdeW1C14.ode	@ltx/swh_ke_oak/miscellanea:misc.Ode1
ltx/swh_ke_oak/oc.m4.d4:ocMA.OdeW1C14.text	
ltx/swh_ke_oak/oc.m4.d4:ocMA.OdeW1C1H.melody	@ltx/swh_ke_oak/miscellanea:misc.Heirmos
ltx/swh_ke_oak/oc.m4.d4:ocMA.OdeW1C1H.mode	@ltx/swh_ke_oak/miscellanea:misc.Mode4
ltx/swh_ke_oak/oc.m4.d4:ocMA.OdeW1C1H.ode	@ltx/swh_ke_oak/miscellanea:misc.Ode1
ltx/swh_ke_oak/oc.m4.d4:ocMA.OdeW1C1H.text	@ltx/swh_ke_oak/he.h.m4:heHE.ThalassisToErythraion.text
ltx/swh_ke_oak/oc.m4.d4:ocMA.OdeW1C1T.melody	@ltx/swh_ke_oak/he.h.m4:heHE.ThalassisToErythraion.name
ltx/swh_ke_oak/oc.m4.d4:ocMA.OdeW1C1T.mode	@ltx/swh_ke_oak/miscellanea:misc.Mode4
ltx/swh_ke_oak/oc.m4.d4:ocMA.OdeW1C1T.ode	@ltx/swh_ke_oak/miscellanea:misc.Ode1
ltx/swh_ke_oak/oc.m4.d4:ocMA.OdeW1C1T.text	
ltx/swh_ke_oak/oc.m4.d4:ocMA.OdeW1C21.melody	@ltx/swh_ke_oak/he.h.m4:heHE.ThalassisToErythraion.name
ltx/swh_ke_oak/oc.m4.d4:ocMA.OdeW1C21.mode	@ltx/swh_ke_oak/miscellanea:misc.Mode4
ltx/swh_ke_oak/oc.m4.d4:ocMA.OdeW1C21.ode	@ltx/swh_ke_oak/miscellanea:misc.Ode1
ltx/swh_ke_oak/oc.m4.d4:ocMA.OdeW1C21.text	
ltx/swh_ke_oak/oc.m4.d4:ocMA.OdeW1C22.melody	@ltx/swh_ke_oak/he.h.m4:heHE.ThalassisToErythraion.name
ltx/swh_ke_oak/oc.m4.d4:ocMA.OdeW1C22.mode	@ltx/swh_ke_oak/miscellanea:misc.Mode4
ltx/swh_ke_oak/oc.m4.d4:ocMA.OdeW1C22.ode	@ltx/swh_ke_oak/miscellanea:misc.Ode1
ltx/swh_ke_oak/oc.m4.d4:ocMA.OdeW1C22.text	
ltx/swh_ke_oak/oc.m4.d4:ocMA.OdeW1C23.melody	@ltx/swh_ke_oak/he.h.m4:heHE.ThalassisToErythraion.name
ltx/swh_ke_oak/oc.m4.d4:ocMA.OdeW1C23.mode	@ltx/swh_ke_oak/miscellanea:misc.Mode4
ltx/swh_ke_oak/oc.m4.d4:ocMA.OdeW1C23.ode	@ltx/swh_ke_oak/miscellanea:misc.Ode1
ltx/swh_ke_oak/oc.m4.d4:ocMA.OdeW1C23.text	
ltx/swh_ke_oak/oc.m4.d4:ocMA.OdeW3C11.melody	@ltx/swh_ke_oak/he.h.m4:heHE.EffrainetaiEpiSoi.name
ltx/swh_ke_oak/oc.m4.d4:ocMA.OdeW3C11.mode	@ltx/swh_ke_oak/miscellanea:misc.Mode4
ltx/swh_ke_oak/oc.m4.d4:ocMA.OdeW3C11.ode	@ltx/swh_ke_oak/miscellanea:misc.Ode3
ltx/swh_ke_oak/oc.m4.d4:ocMA.OdeW3C11.text	
ltx/swh_ke_oak/oc.m4.d4:ocMA.OdeW3C12.melody	@ltx/swh_ke_oak/he.h.m4:heHE.EffrainetaiEpiSoi.name
ltx/swh_ke_oak/oc.m4.d4:ocMA.OdeW3C12.mode	@ltx/swh_ke_oak/miscellanea:misc.Mode4
ltx/swh_ke_oak/oc.m4.d4:ocMA.OdeW3C12.ode	@ltx/swh_ke_oak/miscellanea:misc.Ode3
ltx/swh_ke_oak/oc.m4.d4:ocMA.OdeW3C12.text	
ltx/swh_ke_oak/oc.m4.d4:ocMA.OdeW3C13.melody	@ltx/swh_ke_oak/he.h.m4:heHE.EffrainetaiEpiSoi.name
ltx/swh_ke_oak/oc.m4.d4:ocMA.OdeW3C13.mode	@ltx/swh_ke_oak/miscellanea:misc.Mode4
ltx/swh_ke_oak/oc.m4.d4:ocMA.OdeW3C13.ode	@ltx/swh_ke_oak/miscellanea:misc.Ode3
ltx/swh_ke_oak/oc.m4.d4:ocMA.OdeW3C13.text	
ltx/swh_ke_oak/oc.m4.d4:ocMA.OdeW3C14.melody	@ltx/swh_ke_oak/he.h.m4:heHE.EffrainetaiEpiSoi.name
ltx/swh_ke_oak/oc.m4.d4:ocMA.OdeW3C14.mode	@ltx/swh_ke_oak/miscellanea:misc.Mode4
ltx/swh_ke_oak/oc.m4.d4:ocMA.OdeW3C14.ode	@ltx/swh_ke_oak/miscellanea:misc.Ode3
ltx/swh_ke_oak/oc.m4.d4:ocMA.OdeW3C14.text	
ltx/swh_ke_oak/oc.m4.d4:ocMA.OdeW3C1H.melody	@ltx/swh_ke_oak/miscellanea:misc.Heirmos
ltx/swh_ke_oak/oc.m4.d4:ocMA.OdeW3C1H.mode	@ltx/swh_ke_oak/miscellanea:misc.Mode4
ltx/swh_ke_oak/oc.m4.d4:ocMA.OdeW3C1H.ode	@ltx/swh_ke_oak/miscellanea:misc.Ode3
ltx/swh_ke_oak/oc.m4.d4:ocMA.OdeW3C1H.text	@ltx/swh_ke_oak/he.h.m4:heHE.EffrainetaiEpiSoi.text
ltx/swh_ke_oak/oc.m4.d4:ocMA.OdeW3C1T.melody	@ltx/swh_ke_oak/he.h.m4:heHE.EffrainetaiEpiSoi.name
ltx/swh_ke_oak/oc.m4.d4:ocMA.OdeW3C1T.mode	@ltx/swh_ke_oak/miscellanea:misc.Mode4
ltx/swh_ke_oak/oc.m4.d4:ocMA.OdeW3C1T.ode	@ltx/swh_ke_oak/miscellanea:misc.Ode3
ltx/swh_ke_oak/oc.m4.d4:ocMA.OdeW3C1T.text	
ltx/swh_ke_oak/oc.m4.d4:ocMA.OdeW3C21.melody	@ltx/swh_ke_oak/he.h.m4:heHE.OukEnSofia.name
ltx/swh_ke_oak/oc.m4.d4:ocMA.OdeW3C21.mode	@ltx/swh_ke_oak/miscellanea:misc.Mode4
ltx/swh_ke_oak/oc.m4.d4:ocMA.OdeW3C21.ode	@ltx/swh_ke_oak/miscellanea:misc.Ode3
ltx/swh_ke_oak/oc.m4.d4:ocMA.OdeW3C21.text	
ltx/swh_ke_oak/oc.m4.d4:ocMA.OdeW3C22.melody	@ltx/swh_ke_oak/he.h.m4:heHE.OukEnSofia.name
ltx/swh_ke_oak/oc.m4.d4:ocMA.OdeW3C22.mode	@ltx/swh_ke_oak/miscellanea:misc.Mode4
ltx/swh_ke_oak/oc.m4.d4:ocMA.OdeW3C22.ode	@ltx/swh_ke_oak/miscellanea:misc.Ode3
ltx/swh_ke_oak/oc.m4.d4:ocMA.OdeW3C22.text	
ltx/swh_ke_oak/oc.m4.d4:ocMA.OdeW3C23.melody	@ltx/swh_ke_oak/he.h.m4:heHE.OukEnSofia.name
ltx/swh_ke_oak/oc.m4.d4:ocMA.OdeW3C23.mode	@ltx/swh_ke_oak/miscellanea:misc.Mode4
ltx/swh_ke_oak/oc.m4.d4:ocMA.OdeW3C23.ode	@ltx/swh_ke_oak/miscellanea:misc.Ode3
ltx/swh_ke_oak/oc.m4.d4:ocMA.OdeW3C23.text	
ltx/swh_ke_oak/oc.m4.d4:ocMA.OdeW4C11.melody	@ltx/swh_ke_oak/he.h.m4:heHE.EparthentaSeIdousa.name
ltx/swh_ke_oak/oc.m4.d4:ocMA.OdeW4C11.mode	@ltx/swh_ke_oak/miscellanea:misc.Mode4
ltx/swh_ke_oak/oc.m4.d4:ocMA.OdeW4C11.ode	@ltx/swh_ke_oak/miscellanea:misc.Ode4
ltx/swh_ke_oak/oc.m4.d4:ocMA.OdeW4C11.text	
ltx/swh_ke_oak/oc.m4.d4:ocMA.OdeW4C12.melody	@ltx/swh_ke_oak/he.h.m4:heHE.EparthentaSeIdousa.name
ltx/swh_ke_oak/oc.m4.d4:ocMA.OdeW4C12.mode	@ltx/swh_ke_oak/miscellanea:misc.Mode4
ltx/swh_ke_oak/oc.m4.d4:ocMA.OdeW4C12.ode	@ltx/swh_ke_oak/miscellanea:misc.Ode4
ltx/swh_ke_oak/oc.m4.d4:ocMA.OdeW4C12.text	
ltx/swh_ke_oak/oc.m4.d4:ocMA.OdeW4C13.melody	@ltx/swh_ke_oak/he.h.m4:heHE.EparthentaSeIdousa.name
ltx/swh_ke_oak/oc.m4.d4:ocMA.OdeW4C13.mode	@ltx/swh_ke_oak/miscellanea:misc.Mode4
ltx/swh_ke_oak/oc.m4.d4:ocMA.OdeW4C13.ode	@ltx/swh_ke_oak/miscellanea:misc.Ode4
ltx/swh_ke_oak/oc.m4.d4:ocMA.OdeW4C13.text	
ltx/swh_ke_oak/oc.m4.d4:ocMA.OdeW4C14.melody	@ltx/swh_ke_oak/he.h.m4:heHE.EparthentaSeIdousa.name
ltx/swh_ke_oak/oc.m4.d4:ocMA.OdeW4C14.mode	@ltx/swh_ke_oak/miscellanea:misc.Mode4
ltx/swh_ke_oak/oc.m4.d4:ocMA.OdeW4C14.ode	@ltx/swh_ke_oak/miscellanea:misc.Ode4
ltx/swh_ke_oak/oc.m4.d4:ocMA.OdeW4C14.text	
ltx/swh_ke_oak/oc.m4.d4:ocMA.OdeW4C1H.melody	@ltx/swh_ke_oak/miscellanea:misc.Heirmos
ltx/swh_ke_oak/oc.m4.d4:ocMA.OdeW4C1H.mode	@ltx/swh_ke_oak/miscellanea:misc.Mode4
ltx/swh_ke_oak/oc.m4.d4:ocMA.OdeW4C1H.ode	@ltx/swh_ke_oak/miscellanea:misc.Ode4
ltx/swh_ke_oak/oc.m4.d4:ocMA.OdeW4C1H.text	@ltx/swh_ke_oak/he.h.m4:heHE.EparthentaSeIdousa.text
ltx/swh_ke_oak/oc.m4.d4:ocMA.OdeW4C1T.melody	@ltx/swh_ke_oak/he.h.m4:heHE.EparthentaSeIdousa.name
ltx/swh_ke_oak/oc.m4.d4:ocMA.OdeW4C1T.mode	@ltx/swh_ke_oak/miscellanea:misc.Mode4
ltx/swh_ke_oak/oc.m4.d4:ocMA.OdeW4C1T.ode	@ltx/swh_ke_oak/miscellanea:misc.Ode4
ltx/swh_ke_oak/oc.m4.d4:ocMA.OdeW4C1T.text	
ltx/swh_ke_oak/oc.m4.d4:ocMA.OdeW4C21.melody	@ltx/swh_ke_oak/he.h.m4:heHE.EparthentaSeIdousa.name
ltx/swh_ke_oak/oc.m4.d4:ocMA.OdeW4C21.mode	@ltx/swh_ke_oak/miscellanea:misc.Mode4
ltx/swh_ke_oak/oc.m4.d4:ocMA.OdeW4C21.ode	@ltx/swh_ke_oak/miscellanea:misc.Ode4
ltx/swh_ke_oak/oc.m4.d4:ocMA.OdeW4C21.text	
ltx/swh_ke_oak/oc.m4.d4:ocMA.OdeW4C22.melody	@ltx/swh_ke_oak/he.h.m4:heHE.EparthentaSeIdousa.name
ltx/swh_ke_oak/oc.m4.d4:ocMA.OdeW4C22.mode	@ltx/swh_ke_oak/miscellanea:misc.Mode4
ltx/swh_ke_oak/oc.m4.d4:ocMA.OdeW4C22.ode	@ltx/swh_ke_oak/miscellanea:misc.Ode4
ltx/swh_ke_oak/oc.m4.d4:ocMA.OdeW4C22.text	
ltx/swh_ke_oak/oc.m4.d4:ocMA.OdeW4C23.melody	@ltx/swh_ke_oak/he.h.m4:heHE.EparthentaSeIdousa.name
ltx/swh_ke_oak/oc.m4.d4:ocMA.OdeW4C23.mode	@ltx/swh_ke_oak/miscellanea:misc.Mode4
ltx/swh_ke_oak/oc.m4.d4:ocMA.OdeW4C23.ode	@ltx/swh_ke_oak/miscellanea:misc.Ode4
ltx/swh_ke_oak/oc.m4.d4:ocMA.OdeW4C23.text	
ltx/swh_ke_oak/oc.m4.d4:ocMA.OdeW5C11.melody	@ltx/swh_ke_oak/he.h.m4:heHE.SyKyrieMouFos.name
ltx/swh_ke_oak/oc.m4.d4:ocMA.OdeW5C11.mode	@ltx/swh_ke_oak/miscellanea:misc.Mode4
ltx/swh_ke_oak/oc.m4.d4:ocMA.OdeW5C11.ode	@ltx/swh_ke_oak/miscellanea:misc.Ode5
ltx/swh_ke_oak/oc.m4.d4:ocMA.OdeW5C11.text	
ltx/swh_ke_oak/oc.m4.d4:ocMA.OdeW5C12.melody	@ltx/swh_ke_oak/he.h.m4:heHE.SyKyrieMouFos.name
ltx/swh_ke_oak/oc.m4.d4:ocMA.OdeW5C12.mode	@ltx/swh_ke_oak/miscellanea:misc.Mode4
ltx/swh_ke_oak/oc.m4.d4:ocMA.OdeW5C12.ode	@ltx/swh_ke_oak/miscellanea:misc.Ode5
ltx/swh_ke_oak/oc.m4.d4:ocMA.OdeW5C12.text	
ltx/swh_ke_oak/oc.m4.d4:ocMA.OdeW5C13.melody	@ltx/swh_ke_oak/he.h.m4:heHE.SyKyrieMouFos.name
ltx/swh_ke_oak/oc.m4.d4:ocMA.OdeW5C13.mode	@ltx/swh_ke_oak/miscellanea:misc.Mode4
ltx/swh_ke_oak/oc.m4.d4:ocMA.OdeW5C13.ode	@ltx/swh_ke_oak/miscellanea:misc.Ode5
ltx/swh_ke_oak/oc.m4.d4:ocMA.OdeW5C13.text	
ltx/swh_ke_oak/oc.m4.d4:ocMA.OdeW5C14.melody	@ltx/swh_ke_oak/he.h.m4:heHE.SyKyrieMouFos.name
ltx/swh_ke_oak/oc.m4.d4:ocMA.OdeW5C14.mode	@ltx/swh_ke_oak/miscellanea:misc.Mode4
ltx/swh_ke_oak/oc.m4.d4:ocMA.OdeW5C14.ode	@ltx/swh_ke_oak/miscellanea:misc.Ode5
ltx/swh_ke_oak/oc.m4.d4:ocMA.OdeW5C14.text	
ltx/swh_ke_oak/oc.m4.d4:ocMA.OdeW5C1H.melody	@ltx/swh_ke_oak/miscellanea:misc.Heirmos
ltx/swh_ke_oak/oc.m4.d4:ocMA.OdeW5C1H.mode	@ltx/swh_ke_oak/miscellanea:misc.Mode4
ltx/swh_ke_oak/oc.m4.d4:ocMA.OdeW5C1H.ode	@ltx/swh_ke_oak/miscellanea:misc.Ode5
ltx/swh_ke_oak/oc.m4.d4:ocMA.OdeW5C1H.text	@ltx/swh_ke_oak/he.h.m4:heHE.SyKyrieMouFos.text
ltx/swh_ke_oak/oc.m4.d4:ocMA.OdeW5C1T.melody	@ltx/swh_ke_oak/he.h.m4:heHE.SyKyrieMouFos.name
ltx/swh_ke_oak/oc.m4.d4:ocMA.OdeW5C1T.mode	@ltx/swh_ke_oak/miscellanea:misc.Mode4
ltx/swh_ke_oak/oc.m4.d4:ocMA.OdeW5C1T.ode	@ltx/swh_ke_oak/miscellanea:misc.Ode5
ltx/swh_ke_oak/oc.m4.d4:ocMA.OdeW5C1T.text	
ltx/swh_ke_oak/oc.m4.d4:ocMA.OdeW5C21.melody	@ltx/swh_ke_oak/he.h.m4:heHE.AseveisOukOpsontai.name
ltx/swh_ke_oak/oc.m4.d4:ocMA.OdeW5C21.mode	@ltx/swh_ke_oak/miscellanea:misc.Mode4
ltx/swh_ke_oak/oc.m4.d4:ocMA.OdeW5C21.ode	@ltx/swh_ke_oak/miscellanea:misc.Ode5
ltx/swh_ke_oak/oc.m4.d4:ocMA.OdeW5C21.text	
ltx/swh_ke_oak/oc.m4.d4:ocMA.OdeW5C22.melody	@ltx/swh_ke_oak/he.h.m4:heHE.AseveisOukOpsontai.name
ltx/swh_ke_oak/oc.m4.d4:ocMA.OdeW5C22.mode	@ltx/swh_ke_oak/miscellanea:misc.Mode4
ltx/swh_ke_oak/oc.m4.d4:ocMA.OdeW5C22.ode	@ltx/swh_ke_oak/miscellanea:misc.Ode5
ltx/swh_ke_oak/oc.m4.d4:ocMA.OdeW5C22.text	
ltx/swh_ke_oak/oc.m4.d4:ocMA.OdeW5C23.melody	@ltx/swh_ke_oak/he.h.m4:heHE.AseveisOukOpsontai.name
ltx/swh_ke_oak/oc.m4.d4:ocMA.OdeW5C23.mode	@ltx/swh_ke_oak/miscellanea:misc.Mode4
ltx/swh_ke_oak/oc.m4.d4:ocMA.OdeW5C23.ode	@ltx/swh_ke_oak/miscellanea:misc.Ode5
ltx/swh_ke_oak/oc.m4.d4:ocMA.OdeW5C23.text	
ltx/swh_ke_oak/oc.m4.d4:ocMA.OdeW6C11.melody	@ltx/swh_ke_oak/he.h.m4:heHE.ThysoSoiMetaFonis.name
ltx/swh_ke_oak/oc.m4.d4:ocMA.OdeW6C11.mode	@ltx/swh_ke_oak/miscellanea:misc.Mode4
ltx/swh_ke_oak/oc.m4.d4:ocMA.OdeW6C11.ode	@ltx/swh_ke_oak/miscellanea:misc.Ode6
ltx/swh_ke_oak/oc.m4.d4:ocMA.OdeW6C11.text	
ltx/swh_ke_oak/oc.m4.d4:ocMA.OdeW6C12.melody	@ltx/swh_ke_oak/he.h.m4:heHE.ThysoSoiMetaFonis.name
ltx/swh_ke_oak/oc.m4.d4:ocMA.OdeW6C12.mode	@ltx/swh_ke_oak/miscellanea:misc.Mode4
ltx/swh_ke_oak/oc.m4.d4:ocMA.OdeW6C12.ode	@ltx/swh_ke_oak/miscellanea:misc.Ode6
ltx/swh_ke_oak/oc.m4.d4:ocMA.OdeW6C12.text	
ltx/swh_ke_oak/oc.m4.d4:ocMA.OdeW6C13.melody	@ltx/swh_ke_oak/he.h.m4:heHE.ThysoSoiMetaFonis.name
ltx/swh_ke_oak/oc.m4.d4:ocMA.OdeW6C13.mode	@ltx/swh_ke_oak/miscellanea:misc.Mode4
ltx/swh_ke_oak/oc.m4.d4:ocMA.OdeW6C13.ode	@ltx/swh_ke_oak/miscellanea:misc.Ode6
ltx/swh_ke_oak/oc.m4.d4:ocMA.OdeW6C13.text	
ltx/swh_ke_oak/oc.m4.d4:ocMA.OdeW6C14.melody	@ltx/swh_ke_oak/he.h.m4:heHE.ThysoSoiMetaFonis.name
ltx/swh_ke_oak/oc.m4.d4:ocMA.OdeW6C14.mode	@ltx/swh_ke_oak/miscellanea:misc.Mode4
ltx/swh_ke_oak/oc.m4.d4:ocMA.OdeW6C14.ode	@ltx/swh_ke_oak/miscellanea:misc.Ode6
ltx/swh_ke_oak/oc.m4.d4:ocMA.OdeW6C14.text	
ltx/swh_ke_oak/oc.m4.d4:ocMA.OdeW6C1H.melody	@ltx/swh_ke_oak/miscellanea:misc.Heirmos
ltx/swh_ke_oak/oc.m4.d4:ocMA.OdeW6C1H.mode	@ltx/swh_ke_oak/miscellanea:misc.Mode4
ltx/swh_ke_oak/oc.m4.d4:ocMA.OdeW6C1H.ode	@ltx/swh_ke_oak/miscellanea:misc.Ode6
ltx/swh_ke_oak/oc.m4.d4:ocMA.OdeW6C1H.text	@ltx/swh_ke_oak/he.h.m4:heHE.ThysoSoiMetaFonis.text
ltx/swh_ke_oak/oc.m4.d4:ocMA.OdeW6C1T.melody	@ltx/swh_ke_oak/he.h.m4:heHE.ThysoSoiMetaFonis.name
ltx/swh_ke_oak/oc.m4.d4:ocMA.OdeW6C1T.mode	@ltx/swh_ke_oak/miscellanea:misc.Mode4
ltx/swh_ke_oak/oc.m4.d4:ocMA.OdeW6C1T.ode	@ltx/swh_ke_oak/miscellanea:misc.Ode6
ltx/swh_ke_oak/oc.m4.d4:ocMA.OdeW6C1T.text	
ltx/swh_ke_oak/oc.m4.d4:ocMA.OdeW6C21.melody	@ltx/swh_ke_oak/he.h.m4:heHE.ThysoSoiMetaFonis.name
ltx/swh_ke_oak/oc.m4.d4:ocMA.OdeW6C21.mode	@ltx/swh_ke_oak/miscellanea:misc.Mode4
ltx/swh_ke_oak/oc.m4.d4:ocMA.OdeW6C21.ode	@ltx/swh_ke_oak/miscellanea:misc.Ode6
ltx/swh_ke_oak/oc.m4.d4:ocMA.OdeW6C21.text	
ltx/swh_ke_oak/oc.m4.d4:ocMA.OdeW6C22.melody	@ltx/swh_ke_oak/he.h.m4:heHE.ThysoSoiMetaFonis.name
ltx/swh_ke_oak/oc.m4.d4:ocMA.OdeW6C22.mode	@ltx/swh_ke_oak/miscellanea:misc.Mode4
ltx/swh_ke_oak/oc.m4.d4:ocMA.OdeW6C22.ode	@ltx/swh_ke_oak/miscellanea:misc.Ode6
ltx/swh_ke_oak/oc.m4.d4:ocMA.OdeW6C22.text	
ltx/swh_ke_oak/oc.m4.d4:ocMA.OdeW6C23.melody	@ltx/swh_ke_oak/he.h.m4:heHE.ThysoSoiMetaFonis.name
ltx/swh_ke_oak/oc.m4.d4:ocMA.OdeW6C23.mode	@ltx/swh_ke_oak/miscellanea:misc.Mode4
ltx/swh_ke_oak/oc.m4.d4:ocMA.OdeW6C23.ode	@ltx/swh_ke_oak/miscellanea:misc.Ode6
ltx/swh_ke_oak/oc.m4.d4:ocMA.OdeW6C23.text	
ltx/swh_ke_oak/oc.m4.d4:ocMA.OdeW7C11.melody	@ltx/swh_ke_oak/he.h.m4:heHE.EnTiKaminoAvramiaioi.name
ltx/swh_ke_oak/oc.m4.d4:ocMA.OdeW7C11.mode	@ltx/swh_ke_oak/miscellanea:misc.Mode4
ltx/swh_ke_oak/oc.m4.d4:ocMA.OdeW7C11.ode	@ltx/swh_ke_oak/miscellanea:misc.Ode7
ltx/swh_ke_oak/oc.m4.d4:ocMA.OdeW7C11.text	
ltx/swh_ke_oak/oc.m4.d4:ocMA.OdeW7C12.melody	@ltx/swh_ke_oak/he.h.m4:heHE.EnTiKaminoAvramiaioi.name
ltx/swh_ke_oak/oc.m4.d4:ocMA.OdeW7C12.mode	@ltx/swh_ke_oak/miscellanea:misc.Mode4
ltx/swh_ke_oak/oc.m4.d4:ocMA.OdeW7C12.ode	@ltx/swh_ke_oak/miscellanea:misc.Ode7
ltx/swh_ke_oak/oc.m4.d4:ocMA.OdeW7C12.text	
ltx/swh_ke_oak/oc.m4.d4:ocMA.OdeW7C13.melody	@ltx/swh_ke_oak/he.h.m4:heHE.EnTiKaminoAvramiaioi.name
ltx/swh_ke_oak/oc.m4.d4:ocMA.OdeW7C13.mode	@ltx/swh_ke_oak/miscellanea:misc.Mode4
ltx/swh_ke_oak/oc.m4.d4:ocMA.OdeW7C13.ode	@ltx/swh_ke_oak/miscellanea:misc.Ode7
ltx/swh_ke_oak/oc.m4.d4:ocMA.OdeW7C13.text	
ltx/swh_ke_oak/oc.m4.d4:ocMA.OdeW7C14.melody	@ltx/swh_ke_oak/he.h.m4:heHE.EnTiKaminoAvramiaioi.name
ltx/swh_ke_oak/oc.m4.d4:ocMA.OdeW7C14.mode	@ltx/swh_ke_oak/miscellanea:misc.Mode4
ltx/swh_ke_oak/oc.m4.d4:ocMA.OdeW7C14.ode	@ltx/swh_ke_oak/miscellanea:misc.Ode7
ltx/swh_ke_oak/oc.m4.d4:ocMA.OdeW7C14.text	
ltx/swh_ke_oak/oc.m4.d4:ocMA.OdeW7C1H.melody	@ltx/swh_ke_oak/miscellanea:misc.Heirmos
ltx/swh_ke_oak/oc.m4.d4:ocMA.OdeW7C1H.mode	@ltx/swh_ke_oak/miscellanea:misc.Mode4
ltx/swh_ke_oak/oc.m4.d4:ocMA.OdeW7C1H.ode	@ltx/swh_ke_oak/miscellanea:misc.Ode7
ltx/swh_ke_oak/oc.m4.d4:ocMA.OdeW7C1H.text	@ltx/swh_ke_oak/he.h.m4:heHE.EnTiKaminoAvramiaioi.text
ltx/swh_ke_oak/oc.m4.d4:ocMA.OdeW7C1T.melody	@ltx/swh_ke_oak/he.h.m4:heHE.EnTiKaminoAvramiaioi.name
ltx/swh_ke_oak/oc.m4.d4:ocMA.OdeW7C1T.mode	@ltx/swh_ke_oak/miscellanea:misc.Mode4
ltx/swh_ke_oak/oc.m4.d4:ocMA.OdeW7C1T.ode	@ltx/swh_ke_oak/miscellanea:misc.Ode7
ltx/swh_ke_oak/oc.m4.d4:ocMA.OdeW7C1T.text	
ltx/swh_ke_oak/oc.m4.d4:ocMA.OdeW7C21.melody	@ltx/swh_ke_oak/he.h.m4:heHE.EnTiKaminoAvramiaioi.name
ltx/swh_ke_oak/oc.m4.d4:ocMA.OdeW7C21.mode	@ltx/swh_ke_oak/miscellanea:misc.Mode4
ltx/swh_ke_oak/oc.m4.d4:ocMA.OdeW7C21.ode	@ltx/swh_ke_oak/miscellanea:misc.Ode7
ltx/swh_ke_oak/oc.m4.d4:ocMA.OdeW7C21.text	
ltx/swh_ke_oak/oc.m4.d4:ocMA.OdeW7C22.melody	@ltx/swh_ke_oak/he.h.m4:heHE.EnTiKaminoAvramiaioi.name
ltx/swh_ke_oak/oc.m4.d4:ocMA.OdeW7C22.mode	@ltx/swh_ke_oak/miscellanea:misc.Mode4
ltx/swh_ke_oak/oc.m4.d4:ocMA.OdeW7C22.ode	@ltx/swh_ke_oak/miscellanea:misc.Ode7
ltx/swh_ke_oak/oc.m4.d4:ocMA.OdeW7C22.text	
ltx/swh_ke_oak/oc.m4.d4:ocMA.OdeW7C23.melody	@ltx/swh_ke_oak/he.h.m4:heHE.EnTiKaminoAvramiaioi.name
ltx/swh_ke_oak/oc.m4.d4:ocMA.OdeW7C23.mode	@ltx/swh_ke_oak/miscellanea:misc.Mode4
ltx/swh_ke_oak/oc.m4.d4:ocMA.OdeW7C23.ode	@ltx/swh_ke_oak/miscellanea:misc.Ode7
ltx/swh_ke_oak/oc.m4.d4:ocMA.OdeW7C23.text	
ltx/swh_ke_oak/oc.m4.d4:ocMA.OdeW8C11.melody	@ltx/swh_ke_oak/he.h.m4:heHE.CheirasEkpetasasDaniil.name
ltx/swh_ke_oak/oc.m4.d4:ocMA.OdeW8C11.mode	@ltx/swh_ke_oak/miscellanea:misc.Mode4
ltx/swh_ke_oak/oc.m4.d4:ocMA.OdeW8C11.ode	@ltx/swh_ke_oak/miscellanea:misc.Ode8
ltx/swh_ke_oak/oc.m4.d4:ocMA.OdeW8C11.text	
ltx/swh_ke_oak/oc.m4.d4:ocMA.OdeW8C12.melody	@ltx/swh_ke_oak/he.h.m4:heHE.CheirasEkpetasasDaniil.name
ltx/swh_ke_oak/oc.m4.d4:ocMA.OdeW8C12.mode	@ltx/swh_ke_oak/miscellanea:misc.Mode4
ltx/swh_ke_oak/oc.m4.d4:ocMA.OdeW8C12.ode	@ltx/swh_ke_oak/miscellanea:misc.Ode8
ltx/swh_ke_oak/oc.m4.d4:ocMA.OdeW8C12.text	
ltx/swh_ke_oak/oc.m4.d4:ocMA.OdeW8C13.melody	@ltx/swh_ke_oak/he.h.m4:heHE.CheirasEkpetasasDaniil.name
ltx/swh_ke_oak/oc.m4.d4:ocMA.OdeW8C13.mode	@ltx/swh_ke_oak/miscellanea:misc.Mode4
ltx/swh_ke_oak/oc.m4.d4:ocMA.OdeW8C13.ode	@ltx/swh_ke_oak/miscellanea:misc.Ode8
ltx/swh_ke_oak/oc.m4.d4:ocMA.OdeW8C13.text	
ltx/swh_ke_oak/oc.m4.d4:ocMA.OdeW8C14.melody	@ltx/swh_ke_oak/he.h.m4:heHE.CheirasEkpetasasDaniil.name
ltx/swh_ke_oak/oc.m4.d4:ocMA.OdeW8C14.mode	@ltx/swh_ke_oak/miscellanea:misc.Mode4
ltx/swh_ke_oak/oc.m4.d4:ocMA.OdeW8C14.ode	@ltx/swh_ke_oak/miscellanea:misc.Ode8
ltx/swh_ke_oak/oc.m4.d4:ocMA.OdeW8C14.text	
ltx/swh_ke_oak/oc.m4.d4:ocMA.OdeW8C1H.melody	@ltx/swh_ke_oak/miscellanea:misc.Heirmos
ltx/swh_ke_oak/oc.m4.d4:ocMA.OdeW8C1H.mode	@ltx/swh_ke_oak/miscellanea:misc.Mode4
ltx/swh_ke_oak/oc.m4.d4:ocMA.OdeW8C1H.ode	@ltx/swh_ke_oak/miscellanea:misc.Ode8
ltx/swh_ke_oak/oc.m4.d4:ocMA.OdeW8C1H.text	@ltx/swh_ke_oak/he.h.m4:heHE.CheirasEkpetasasDaniil.text
ltx/swh_ke_oak/oc.m4.d4:ocMA.OdeW8C1T.melody	@ltx/swh_ke_oak/he.h.m4:heHE.CheirasEkpetasasDaniil.name
ltx/swh_ke_oak/oc.m4.d4:ocMA.OdeW8C1T.mode	@ltx/swh_ke_oak/miscellanea:misc.Mode4
ltx/swh_ke_oak/oc.m4.d4:ocMA.OdeW8C1T.ode	@ltx/swh_ke_oak/miscellanea:misc.Ode8
ltx/swh_ke_oak/oc.m4.d4:ocMA.OdeW8C1T.text	
ltx/swh_ke_oak/oc.m4.d4:ocMA.OdeW8C21.melody	@ltx/swh_ke_oak/he.h.m4:heHE.CheirasEkpetasasDaniil.name
ltx/swh_ke_oak/oc.m4.d4:ocMA.OdeW8C21.mode	@ltx/swh_ke_oak/miscellanea:misc.Mode4
ltx/swh_ke_oak/oc.m4.d4:ocMA.OdeW8C21.ode	@ltx/swh_ke_oak/miscellanea:misc.Ode8
ltx/swh_ke_oak/oc.m4.d4:ocMA.OdeW8C21.text	
ltx/swh_ke_oak/oc.m4.d4:ocMA.OdeW8C22.melody	@ltx/swh_ke_oak/he.h.m4:heHE.CheirasEkpetasasDaniil.name
ltx/swh_ke_oak/oc.m4.d4:ocMA.OdeW8C22.mode	@ltx/swh_ke_oak/miscellanea:misc.Mode4
ltx/swh_ke_oak/oc.m4.d4:ocMA.OdeW8C22.ode	@ltx/swh_ke_oak/miscellanea:misc.Ode8
ltx/swh_ke_oak/oc.m4.d4:ocMA.OdeW8C22.text	
ltx/swh_ke_oak/oc.m4.d4:ocMA.OdeW8C23.melody	@ltx/swh_ke_oak/he.h.m4:heHE.CheirasEkpetasasDaniil.name
ltx/swh_ke_oak/oc.m4.d4:ocMA.OdeW8C23.mode	@ltx/swh_ke_oak/miscellanea:misc.Mode4
ltx/swh_ke_oak/oc.m4.d4:ocMA.OdeW8C23.ode	@ltx/swh_ke_oak/miscellanea:misc.Ode8
ltx/swh_ke_oak/oc.m4.d4:ocMA.OdeW8C23.text	
ltx/swh_ke_oak/oc.m4.d4:ocMA.OdeW9C11.melody	@ltx/swh_ke_oak/he.h.m4:heHE.LithosAcheirotmitos.name
ltx/swh_ke_oak/oc.m4.d4:ocMA.OdeW9C11.mode	@ltx/swh_ke_oak/miscellanea:misc.Mode4
ltx/swh_ke_oak/oc.m4.d4:ocMA.OdeW9C11.ode	@ltx/swh_ke_oak/miscellanea:misc.Ode9
ltx/swh_ke_oak/oc.m4.d4:ocMA.OdeW9C11.text	
ltx/swh_ke_oak/oc.m4.d4:ocMA.OdeW9C12.melody	@ltx/swh_ke_oak/he.h.m4:heHE.LithosAcheirotmitos.name
ltx/swh_ke_oak/oc.m4.d4:ocMA.OdeW9C12.mode	@ltx/swh_ke_oak/miscellanea:misc.Mode4
ltx/swh_ke_oak/oc.m4.d4:ocMA.OdeW9C12.ode	@ltx/swh_ke_oak/miscellanea:misc.Ode9
ltx/swh_ke_oak/oc.m4.d4:ocMA.OdeW9C12.text	
ltx/swh_ke_oak/oc.m4.d4:ocMA.OdeW9C13.melody	@ltx/swh_ke_oak/he.h.m4:heHE.LithosAcheirotmitos.name
ltx/swh_ke_oak/oc.m4.d4:ocMA.OdeW9C13.mode	@ltx/swh_ke_oak/miscellanea:misc.Mode4
ltx/swh_ke_oak/oc.m4.d4:ocMA.OdeW9C13.ode	@ltx/swh_ke_oak/miscellanea:misc.Ode9
ltx/swh_ke_oak/oc.m4.d4:ocMA.OdeW9C13.text	
ltx/swh_ke_oak/oc.m4.d4:ocMA.OdeW9C14.melody	@ltx/swh_ke_oak/he.h.m4:heHE.LithosAcheirotmitos.name
ltx/swh_ke_oak/oc.m4.d4:ocMA.OdeW9C14.mode	@ltx/swh_ke_oak/miscellanea:misc.Mode4
ltx/swh_ke_oak/oc.m4.d4:ocMA.OdeW9C14.ode	@ltx/swh_ke_oak/miscellanea:misc.Ode9
ltx/swh_ke_oak/oc.m4.d4:ocMA.OdeW9C14.text	
ltx/swh_ke_oak/oc.m4.d4:ocMA.OdeW9C1H.melody	@ltx/swh_ke_oak/miscellanea:misc.Heirmos
ltx/swh_ke_oak/oc.m4.d4:ocMA.OdeW9C1H.mode	@ltx/swh_ke_oak/miscellanea:misc.Mode4
ltx/swh_ke_oak/oc.m4.d4:ocMA.OdeW9C1H.ode	@ltx/swh_ke_oak/miscellanea:misc.Ode9
ltx/swh_ke_oak/oc.m4.d4:ocMA.OdeW9C1H.text	@ltx/swh_ke_oak/he.h.m4:heHE.LithosAcheirotmitos.text
ltx/swh_ke_oak/oc.m4.d4:ocMA.OdeW9C1T.melody	@ltx/swh_ke_oak/he.h.m4:heHE.LithosAcheirotmitos.name
ltx/swh_ke_oak/oc.m4.d4:ocMA.OdeW9C1T.mode	@ltx/swh_ke_oak/miscellanea:misc.Mode4
ltx/swh_ke_oak/oc.m4.d4:ocMA.OdeW9C1T.ode	@ltx/swh_ke_oak/miscellanea:misc.Ode9
ltx/swh_ke_oak/oc.m4.d4:ocMA.OdeW9C1T.text	
ltx/swh_ke_oak/oc.m4.d4:ocMA.OdeW9C21.melody	@ltx/swh_ke_oak/he.h.m4:heHE.LithosAcheirotmitos.name
ltx/swh_ke_oak/oc.m4.d4:ocMA.OdeW9C21.mode	@ltx/swh_ke_oak/miscellanea:misc.Mode4
ltx/swh_ke_oak/oc.m4.d4:ocMA.OdeW9C21.ode	@ltx/swh_ke_oak/miscellanea:misc.Ode9
ltx/swh_ke_oak/oc.m4.d4:ocMA.OdeW9C21.text	
ltx/swh_ke_oak/oc.m4.d4:ocMA.OdeW9C22.melody	@ltx/swh_ke_oak/he.h.m4:heHE.LithosAcheirotmitos.name
ltx/swh_ke_oak/oc.m4.d4:ocMA.OdeW9C22.mode	@ltx/swh_ke_oak/miscellanea:misc.Mode4
ltx/swh_ke_oak/oc.m4.d4:ocMA.OdeW9C22.ode	@ltx/swh_ke_oak/miscellanea:misc.Ode9
ltx/swh_ke_oak/oc.m4.d4:ocMA.OdeW9C22.text	
ltx/swh_ke_oak/oc.m4.d4:ocMA.OdeW9C23.melody	@ltx/swh_ke_oak/he.h.m4:heHE.LithosAcheirotmitos.name
ltx/swh_ke_oak/oc.m4.d4:ocMA.OdeW9C23.mode	@ltx/swh_ke_oak/miscellanea:misc.Mode4
ltx/swh_ke_oak/oc.m4.d4:ocMA.OdeW9C23.ode	@ltx/swh_ke_oak/miscellanea:misc.Ode9
ltx/swh_ke_oak/oc.m4.d4:ocMA.OdeW9C23.text	
ltx/swh_ke_oak/oc.m4.d4:ocVE.ApolTheotokionVM.melody	@ltx/swh_ke_oak/he.a.m4:heAU.TachyProkatalave.name
ltx/swh_ke_oak/oc.m4.d4:ocVE.ApolTheotokionVM.mode	@ltx/swh_ke_oak/miscellanea:misc.Mode4
ltx/swh_ke_oak/oc.m4.d4:ocVE.ApolTheotokionVM.text	@ltx/swh_ke_oak/oc.m4.d6:ocMA.Kathisma23.text
ltx/swh_ke_oak/oc.m4.d4:ocVE.AposTheotokion.melody	@ltx/swh_ke_oak/he.a.m4:heAU.OsGennaionEnMartysi.name
ltx/swh_ke_oak/oc.m4.d4:ocVE.AposTheotokion.mode	@ltx/swh_ke_oak/miscellanea:misc.Mode4
ltx/swh_ke_oak/oc.m4.d4:ocVE.AposTheotokion.text	
ltx/swh_ke_oak/oc.m4.d4:ocVE.Aposticha1.melody	
ltx/swh_ke_oak/oc.m4.d4:ocVE.Aposticha1.mode	@ltx/swh_ke_oak/miscellanea:misc.Mode4
ltx/swh_ke_oak/oc.m4.d4:ocVE.Aposticha1.text	
ltx/swh_ke_oak/oc.m4.d4:ocVE.Aposticha2.melody	
ltx/swh_ke_oak/oc.m4.d4:ocVE.Aposticha2.mode	@ltx/swh_ke_oak/miscellanea:misc.Mode4
ltx/swh_ke_oak/oc.m4.d4:ocVE.Aposticha2.text	
ltx/swh_ke_oak/oc.m4.d4:ocVE.Aposticha3.melody	
ltx/swh_ke_oak/oc.m4.d4:ocVE.Aposticha3.mode	@ltx/swh_ke_oak/miscellanea:misc.Mode4
ltx/swh_ke_oak/oc.m4.d4:ocVE.Aposticha3.text	
ltx/swh_ke_oak/oc.m4.d4:ocVE.SticTheotokion.melody	@ltx/swh_ke_oak/he.a.m4:heAU.EdokasSimeiosin.name
ltx/swh_ke_oak/oc.m4.d4:ocVE.SticTheotokion.mode	@ltx/swh_ke_oak/miscellanea:misc.Mode4
ltx/swh_ke_oak/oc.m4.d4:ocVE.SticTheotokion.text	
ltx/swh_ke_oak/oc.m4.d4:ocVE.Stichera1.melody	@ltx/swh_ke_oak/he.a.m4:heAU.EdokasSimeiosin.name
ltx/swh_ke_oak/oc.m4.d4:ocVE.Stichera1.mode	@ltx/swh_ke_oak/miscellanea:misc.Mode4
ltx/swh_ke_oak/oc.m4.d4:ocVE.Stichera1.text	
ltx/swh_ke_oak/oc.m4.d4:ocVE.Stichera2.melody	@ltx/swh_ke_oak/he.a.m4:heAU.EdokasSimeiosin.name
ltx/swh_ke_oak/oc.m4.d4:ocVE.Stichera2.mode	@ltx/swh_ke_oak/miscellanea:misc.Mode4
ltx/swh_ke_oak/oc.m4.d4:ocVE.Stichera2.text	
ltx/swh_ke_oak/oc.m4.d4:ocVE.Stichera3.melody	@ltx/swh_ke_oak/he.a.m4:heAU.EdokasSimeiosin.name
ltx/swh_ke_oak/oc.m4.d4:ocVE.Stichera3.mode	@ltx/swh_ke_oak/miscellanea:misc.Mode4
ltx/swh_ke_oak/oc.m4.d4:ocVE.Stichera3.text	
ltx/swh_ke_oak/oc.m4.d4:ocVE.Stichera4.melody	@ltx/swh_ke_oak/he.a.m4:heAU.EdokasSimeiosin.name
ltx/swh_ke_oak/oc.m4.d4:ocVE.Stichera4.mode	@ltx/swh_ke_oak/miscellanea:misc.Mode4
ltx/swh_ke_oak/oc.m4.d4:ocVE.Stichera4.text	
ltx/swh_ke_oak/oc.m4.d4:ocVE.Stichera5.melody	@ltx/swh_ke_oak/he.a.m4:heAU.EdokasSimeiosin.name
ltx/swh_ke_oak/oc.m4.d4:ocVE.Stichera5.mode	@ltx/swh_ke_oak/miscellanea:misc.Mode4
ltx/swh_ke_oak/oc.m4.d4:ocVE.Stichera5.text	
ltx/swh_ke_oak/oc.m4.d4:ocVE.Stichera6.melody	@ltx/swh_ke_oak/he.a.m4:heAU.EdokasSimeiosin.name
ltx/swh_ke_oak/oc.m4.d4:ocVE.Stichera6.mode	@ltx/swh_ke_oak/miscellanea:misc.Mode4
ltx/swh_ke_oak/oc.m4.d4:ocVE.Stichera6.text	
ltx/swh_ke_oak/oc.m4.d4:octrMA.Kathisma11.melody	
ltx/swh_ke_oak/oc.m4.d4:octrMA.Kathisma11.mode	@ltx/swh_ke_oak/miscellanea:misc.Mode4
ltx/swh_ke_oak/oc.m4.d4:octrMA.Kathisma11.text	@ltx/swh_ke_oak/oc.m4.d4:ocMA.Kathisma11.text
ltx/swh_ke_oak/oc.m4.d4:octrMA.Kathisma12.melody	@ltx/swh_ke_oak/miscellanea:misc.Automelon
ltx/swh_ke_oak/oc.m4.d4:octrMA.Kathisma12.mode	@ltx/swh_ke_oak/miscellanea:misc.Mode4
ltx/swh_ke_oak/oc.m4.d4:octrMA.Kathisma12.text	@ltx/swh_ke_oak/oc.m4.d4:ocMA.Kathisma21.text
ltx/swh_ke_oak/oc.m4.d4:octrMA.Kathisma1T.melody	@ltx/swh_ke_oak/he.a.m4:heAU.TachyProkatalave.name
ltx/swh_ke_oak/oc.m4.d4:octrMA.Kathisma1T.mode	@ltx/swh_ke_oak/miscellanea:misc.Mode4
ltx/swh_ke_oak/oc.m4.d4:octrMA.Kathisma1T.text	@ltx/swh_ke_oak/oc.m4.d6:ocMA.Kathisma23.text
ltx/swh_ke_oak/oc.m4.d4:octrMA.Ode7Martyricon.melody	@ltx/swh_ke_oak/he.a.m4:heAU.TachyProkatalave.name
ltx/swh_ke_oak/oc.m4.d4:octrMA.Ode7Martyricon.mode	@ltx/swh_ke_oak/miscellanea:misc.Mode4
ltx/swh_ke_oak/oc.m4.d4:octrMA.Ode7Martyricon.text	@ltx/swh_ke_oak/oc.m4.d5:ocMA.Kathisma32.text
ltx/swh_ke_oak/oc.m4.d4:octrMA.Photogogic.mode	@ltx/swh_ke_oak/miscellanea:misc.Mode4
ltx/swh_ke_oak/oc.m4.d4:octrMA.Photogogic.text	@ltx/swh_ke_oak/oc.m4.d2:octrMA.Photagogic.text
ltx/swh_ke_oak/oc.m4.d4:octrMA.Triadic1.mode	@ltx/swh_ke_oak/miscellanea:misc.Mode4
ltx/swh_ke_oak/oc.m4.d4:octrMA.Triadic1.text	@ltx/swh_ke_oak/oc.m4.d2:octrMA.Triadic1.text
ltx/swh_ke_oak/oc.m4.d4:octrMA.Triadic2.mode	@ltx/swh_ke_oak/miscellanea:misc.Mode4
ltx/swh_ke_oak/oc.m4.d4:octrMA.Triadic2.text	@ltx/swh_ke_oak/oc.m4.d2:octrMA.Triadic2.text
ltx/swh_ke_oak/oc.m4.d4:octrMA.Triadic3.mode	@ltx/swh_ke_oak/miscellanea:misc.Mode4
ltx/swh_ke_oak/oc.m4.d4:octrMA.Triadic3.text	@ltx/swh_ke_oak/oc.m4.d2:octrMA.Triadic3.text
