ltx/swh_ke_oak/le.go.mc.d155:lemcLI.Gospel.book	@ltx/swh_ke_oak/bible:Matthew
ltx/swh_ke_oak/le.go.mc.d155:lemcLI.Gospel.chapverse	(8:28-34; 9:1)
ltx/swh_ke_oak/le.go.mc.d155:lemcLI.Gospel.text	Wakati huo Yesu alifika katika nchi ya Wagadara, ng''ambo ya ziwa, na huko watu wawili waliopagawa na pepo wakakutana naye wakitokea makaburini. Watu hawa walikuwa wenye kutisha mno, hata hakuna mtu aliyethubutu kupita njia hiyo. Nao wakaanza kupiga kelele, "Una shauri gani nasi, wewe Mwana wa Mungu? Je, umekuja kututesa kabla ya wakati wake?" Karibu na mahali hapo kulikuwa na nguruwe wengi wakichungwa. Basi, hao pepo wakamsihi, "Ikiwa utatutoa, basi uturuhusu tuwaingie nguruwe wale." Yesu akawaambia, "Haya, nendeni." Hapo wakawatoka watu hao, wakawaingia nguruwe. Kundi lote la nguruwe likaporomoka kwenye ule mteremko mkali, likatumbukia ziwani; nguruwe wote wakafa maji. Wachungaji wa hao nguruwe walikimbia, wakaenda mjini. Huko walitoa habari zote na mambo yaliyowapata wale watu waliokuwa wamepagawa. Basi, watu wote katika mji ule walitoka, wakamwendea Yesu; na walipomwona, wakamsihi aondoke katika nchi yao. Yesu alipanda mashua, akavuka ziwa na kufika katika mji wake.
ltx/swh_ke_oak/le.go.mc.d155:lemcLI.Gospel.title	
ltx/swh_ke_oak/le.go.mc.d155:lemcLI.Gospel.version	
