ltx/swh_ke_oak/le.go.lu.d111:leluLI.Gospel.book	@ltx/swh_ke_oak/bible:Luke
ltx/swh_ke_oak/le.go.lu.d111:leluLI.Gospel.chapverse	(18:2-8)
ltx/swh_ke_oak/le.go.lu.d111:leluLI.Gospel.text	Bwana aliwaambia watu mfano huu: "Katika mji mmoja kulikuwa na hakimu ambaye hawakuwa anamcha Mungu wala kumjali binadamu. Katika mji huohuo, kulikuwa pia na mama mmoja mjane ambaye alimwendea huyo hakimu mara nyingi akimwomba amtetee apate haki yake kutoka kwa adui yake. Kwa muda mrefu huyo hakimu hakupenda kumtetea huyo mjane; lakini, mwishowe akajisemea: ''Ingawa mimi simchi Mungu wala simjali binadamu, lakini kwa vile huyu mjane ananisumbua, nitamtetea; la sivyo ataendelea kufika hapa, na mwisho atanichosha kabisa!''" Basi, Bwana akaendelea kusema, "Sikieni jinsi alivyosema huyo hakimu mbaya. Je, ndio kusema Mungu hatawatetea wale aliowachagua, ambao wanamlilia mchana na usiku? Je, atakawia kuwasikiliza? Nawaambieni atawatetea upesi."
ltx/swh_ke_oak/le.go.lu.d111:leluLI.Gospel.title	
ltx/swh_ke_oak/le.go.lu.d111:leluLI.Gospel.version	
