ltx/swh_ke_oak/le.pr.me.r83a:leprVE.reading.book	@ltx/swh_ke_oak/bible:Joshua
ltx/swh_ke_oak/le.pr.me.r83a:leprVE.reading.chapverse	(5:13-15)
ltx/swh_ke_oak/le.pr.me.r83a:leprVE.reading.text	Siku moja Yoshua alipokuwa karibu na mji wa Yeriko, aliona ghafla mtu mmoja amesimama mbele yake na upanga uliofutwa mkononi mwake. Yoshua akamwendea, akamwuliza, "Je, wewe ni wetu au ni wa adui zetu?" Naye akamjibu, "Wala wenu wala wa adui zenu! Ila mimi ni kamanda wa jeshi la Mwenyezi-Mungu, na sasa nimewasili. Yoshua akainama chini akasujudu, kisha akamwuliza, "Bwana wangu, unataka mimi mtumishi wako nifanye nini?" Huyo kamanda wa jeshi la Mwenyezi-Mungu akamwambia, "Vua viatu vyako kwa maana mahali unaposimama ni patakatifu." Yoshua akafanya hivyo.
ltx/swh_ke_oak/le.pr.me.r83a:leprVE.reading.title	
ltx/swh_ke_oak/le.pr.me.r83a:leprVE.reading.version	@ltx/swh_ke_oak/properties:version.designation
