ltx/swh_ke_oak/le.ep.mc.d128:lemcLI.Epistle.book	@ltx/swh_ke_oak/bible:Romans
ltx/swh_ke_oak/le.ep.mc.d128:lemcLI.Epistle.chapverse	(2:28-29; 3:1-18)
ltx/swh_ke_oak/le.ep.mc.d128:lemcLI.Epistle.text	Ndugu zangu, si kila anayeonekana kwa nje kuwa Myahudi ni Myahudi wa kweli ati kwa kuwa ametahiriwa kimwili. Myahudi wa kweli ni yule aliye Myahudi kwa ndani, yaani yule ambaye ametahiriwa moyoni. Hili ni jambo la Roho, na si jambo la maandishi ya sheria. Mtu wa namna hiyo anapata sifa, si kutoka kwa watu, bali kutoka kwa Mungu. Basi, Myahudi ana nini zaidi kuliko watu wengine? Au kutahiriwa kuna faida gani? Naam, iko faida kwa kila upande. Kwanza, Mungu aliwakabidhi Wayahudi ujumbe wake. Lakini itakuwaje iwapo baadhi yao hawakuwa waaminifu? Je, jambo hilo litaondoa uaminifu wa Mungu? Hata kidogo! Mungu hubaki mwaminifu daima, ingawaje kila binadamu ni mwongo. Kama Maandiko Matakatifu yasemavyo: "Kila usemapo, maneno yako ni ya kweli; na katika hukumu, wewe hushinda." Lakini, ikiwa uovu wetu unathibitisha kwamba Mungu anatenda kwa haki, tutasema nini? Je, tutasema kwamba anakosa haki akituadhibu? (Hapa naongea kibinadamu.) Hata kidogo! Ingekuwa hivyo, Mungu angewezaje kuuhukumu ulimwengu? Labda utasema: "Ikiwa ukosefu wa uaminifu kwa upande wangu unamdhihirisha Mungu kuwa mwaminifu zaidi na hivyo kumpatia utukufu, basi singepaswa kuhukumiwa kuwa mwenye dhambi!" Ni sawa na kusema: Tufanye maovu ili tupate mema! Ndivyo wengine walivyotukashifu kwa kutushtaki kwamba tumefundisha hivyo. Watahukumiwa wanavyostahili! Tuseme nini, basi? Je, sisi Wayahudi ni bora kuliko wengine? Hata kidogo! Kwa maana nimekwisha bainisha hapo mwanzoni kwamba Wayahudi na watu wa mataifa mengine wote wako chini ya utawala wa dhambi. Kama Maandiko Matakatifu yasemavyo: "Hakuna hata mmoja aliye mwadilifu! Hakuna mtu anayeelewa, wala anayemtafuta Mungu. Wote wamepotoka, wote wamekosa; hakuna atendaye mema, hakuna hata mmoja. Makoo yao ni kama kaburi wazi, ndimi zao zimejaa udanganyifu, midomoni mwao mwatoka maneno yenye sumu kama ya nyoka. Vinywa vyao vimejaa laana chungu. Miguu yao iko mbioni kumwaga damu, popote waendapo husabibisha maafa na mateso; njia ya amani hawaijui. Hawajali kabisa kumcha Mungu."
ltx/swh_ke_oak/le.ep.mc.d128:lemcLI.Epistle.title	
ltx/swh_ke_oak/le.ep.mc.d128:lemcLI.Epistle.version	
