ltx/swh_ke_oak/le.go.mc.d096:lemcLI.Gospel.book	@ltx/swh_ke_oak/bible:John
ltx/swh_ke_oak/le.go.mc.d096:lemcLI.Gospel.chapverse	(8:12-20)
ltx/swh_ke_oak/le.go.mc.d096:lemcLI.Gospel.text	Yesu aliwaambia Wayahudi waliomjia, "Mimi ndimi mwanga wa ulimwengu. Anayenifuata mimi hatembei kamwe gizani, bali atakuwa na mwanga wa uhai." Basi, Mafarisayo wakamwambia, "Wewe unajishuhudia mwenyewe; kwa hiyo ushahidi wako si halali." Yesu akawajibu, "Hata kama ninajishuhudia mwenyewe, ushahidi wangu ni wa kweli kwa sababu mimi najua nilikotoka na ninakokwenda. Lakini nyinyi hamjui nilikotoka wala ninakokwenda. Nyinyi mnahukumu kwa fikira za kibinadamu, lakini mimi simhukumu mtu. Hata nikihukumu, hukumu yangu ni halali kwa sababu mimi siko peke yangu; Baba aliyenituma yuko pamoja nami. Imeandikwa katika sheria yenu ya kwamba ushahidi wa watu wawili ni halali. Mimi najishuhudia mwenyewe, naye Baba aliyenituma, ananishuhudia pia." Hapo wakamwuliza, "Baba yako yuko wapi?" Yesu akawajibu, "Nyinyi hamnijui mimi wala hammjui Baba. Kama mngenijua mimi, mngemjua na Baba yangu pia." Yesu alisema maneno hayo kwenye chumba cha hazina alipokuwa anafundisha hekaluni. Wala hakuna mtu aliyemtia nguvuni, kwa sababu saa yake ilikuwa haijafika bado.
ltx/swh_ke_oak/le.go.mc.d096:lemcLI.Gospel.title	
ltx/swh_ke_oak/le.go.mc.d096:lemcLI.Gospel.version	
