ltx/gr_uk_thyateira/bible:Isaiah.c053.007b	ὡς πρόβατον ἐπὶ σφαγὴν ἤχθη,
ltx/gr_uk_thyateira/bible:Isaiah.c053.007c	καὶ ὡς ἀμνὸς ἐναντίον τοῦ κείροντος ἄφωνος, οὕτως οὐκ ἀνοίγει τὸ στόμα αὐτοῦ.
ltx/gr_uk_thyateira/bible:Isaiah.c053.008a	ἐν τῇ ταπεινώσει ἡ κρίσις αὐτοῦ ἤρθη·
ltx/gr_uk_thyateira/bible:Isaiah.c053.008b	τὴν γενεὰν αὐτοῦ τίς διηγήσεται;
ltx/gr_uk_thyateira/bible:Isaiah.c053.008c	ὅτι αἴρεται ἀπὸ τῆς γῆς ἡ ζωὴ αὐτοῦ.
ltx/gr_uk_thyateira/bible:John.c001.029b	ὁ ἀμνὸς τοῦ Θεοῦ ὁ αἴρων τὴν ἁμαρτίαν τοῦ κόσμου,
ltx/gr_uk_thyateira/bible:Luke.c001.046b	Μεγαλύνει ἡ ψυχή μου τὸν Κύριον,
ltx/gr_uk_thyateira/bible:Luke.c001.047	καὶ ἠγαλλίασε τὸ πνεῦμά μου ἐπὶ τῷ Θεῷ τῷ σωτῆρί μου.
ltx/gr_uk_thyateira/bible:Luke.c001.048	Ὅτι ἐπέβλεψεν ἐπὶ τὴν ταπείνωσιν τῆς δούλης αὐτοῦ· ἰδού γάρ, ἀπὸ τοῦ νῦν μακαριοῦσί με πᾶσαι αἱ γενεαί.
ltx/gr_uk_thyateira/bible:Luke.c001.049	Ὅτι ἐποίησέ μοι μεγαλεῖα ὁ Δυνατός, καὶ ἅγιον τὸ ὄνομα αὐτοῦ,
ltx/gr_uk_thyateira/bible:Luke.c001.050	καὶ ἅγιον τὸ ὄνομα αὐτοῦ, καί το ἔλεος αὐτοῦ εἰς γενεάν, καὶ γενεὰν τοῖς φοβουμένοις αὐτόν.
ltx/gr_uk_thyateira/bible:Luke.c001.051	Ἐποίησε κράτος ἐν βραχίονι αὐτοῦ, διεσκόρπισεν ὑπερηφάνους διανοίᾳ καρδίας αὐτῶν.
ltx/gr_uk_thyateira/bible:Luke.c001.052	Καθεῖλε δυνάστας ἀπὸ θρόνων, καὶ ὕψωσε ταπεινούς,
ltx/gr_uk_thyateira/bible:Luke.c001.053	πεινῶντας ἐνέπλησεν ἀγαθῶν, καὶ πλουτοῦντας ἐξαπέστειλε κενούς.
ltx/gr_uk_thyateira/bible:Luke.c001.054	Ἀντελάβετο Ἰσραὴλ παιδὸς αὐτοῦ, μνησθῆναι ἐλέους,
ltx/gr_uk_thyateira/bible:Luke.c001.055	αθὼς ἐλάλησε πρὸς τοὺς Πατέρας ἡμῶν, τῷ Ἀβραάμ, καὶ τῷ σπέρματι αὐτοῦ ἕως αἰῶνος.
ltx/gr_uk_thyateira/bible:Luke.c002.014	Δόξα ἐν ὑψίστοις Θεῷ καὶ ἐπὶ γῆς εἰρήνη, ἐν ἀνθρώποις εὐδοκία.
ltx/gr_uk_thyateira/bible:Luke.c002.029	Νῦν ἀπολύεις τὸν δοῦλόν σου, Δέσποτα, κατὰ τὸ ῥῆμά σου, ἐν εἰρήνῃ·
ltx/gr_uk_thyateira/bible:Luke.c002.030	ὅτι εἶδον οἱ ὀφθαλμοί μου τὸ σωτήριόν σου,
ltx/gr_uk_thyateira/bible:Luke.c002.031	ὃ ἡτοίμασας κατὰ πρόσωπον πάντων τῶν λαῶν·
ltx/gr_uk_thyateira/bible:Luke.c002.032	φῶς εἰς ἀποκάλυψιν ἐθνῶν, καὶ δόξαν λαοῦ σου Ἰσραήλ.
ltx/gr_uk_thyateira/bible:Matthew.c016.024b	εἴ τις θέλει ὀπίσω μου ἐλθεῖν, ἀπαρνησάσθω ἑαυτὸν καὶ ἀράτω τὸν σταυρὸν αὐτοῦ καὶ ἀκολουθείτω μοι.
