ltx/gr_redirects_oak/ho.ho10:hoVE.FosIlaron.title	@ltx/gr_uk_thyateira/ho.ho10:hoVE.FosIlaron.title
ltx/gr_redirects_oak/ho.ho10:hoVE.Kataxioson10.text	@ltx/gr_uk_thyateira/ho.ho10:hoVE.Kataxioson10.text
ltx/gr_redirects_oak/ho.ho10:hoVE.Kataxioson20.text	@ltx/gr_uk_thyateira/ho.ho10:hoVE.Kataxioson20.text
