ltx/en_uk_thyateira/eu.lichrysbasil:euLI.Key0200a.text	The Liturgy of the Catechumens
ltx/en_uk_thyateira/eu.lichrysbasil:euLI.Key0500.title	Entrance with the Holy Gospel
ltx/en_uk_thyateira/eu.lichrysbasil:euLI.Key0706.title	The Homily
