ltx/en_uk_thyateira/exclamations:AndToYouBelong	And to you belong all glory, honour and worship, together with your Father, who has no beginning, and your all-holy Spirit, now and forever, and to the ages of ages.
ltx/en_uk_thyateira/exclamations:AsIsYrMajesty	For as is your majesty so is your mercy.
ltx/en_uk_thyateira/exclamations:ForYoursItIs	For yours it is to have mercy and to save us,
ltx/en_uk_thyateira/exclamations:GiveGlory	and to you we give glory, together with your Father who has no beginning, and your all-holy, good, and life-giving Spirit, now and for ever, and to the ages of ages.
ltx/en_uk_thyateira/exclamations:GiveGloryTrinity	and to you we give glory, to Father, Son and holy Spirit, now and forever, and to the ages of ages.
ltx/en_uk_thyateira/exclamations:GodOfMercy	Because you are a God of mercy and compassion and love for humankind, and to you we give glory, together with your Father who has no beginning, and your all-holy, good and life-giving Spirit, now and for ever, and to the ages of ages.
ltx/en_uk_thyateira/exclamations:HopeOfHopeless	For you are the hope of the hopeless and the rest of those who toil and are heavy laden with iniquities,
ltx/en_uk_thyateira/exclamations:InYouOurLord	in you our Lord, to whom belong all glory might, honour and worship, now and for ever, and to the ages of ages.
ltx/en_uk_thyateira/exclamations:MercAndLove	For you, O God, are merciful and love mankind, and to you we give glory, to the Father and to the Son and to the Holy Spirit, now and for ever, and to the ages of ages.
ltx/en_uk_thyateira/exclamations:MercyAndSaves	For you are our God, a God who has mercy and who saves,
ltx/en_uk_thyateira/exclamations:OGodOurGod	O God, our God,
ltx/en_uk_thyateira/exclamations:OfTheFather	of the Father, the Son and the Holy Spirit, now and for ever and to the ages of ages.
ltx/en_uk_thyateira/exclamations:XCandToYou	Christ our God, and to you we give glory, together with your Father, who has no beginning, and your all-holy, good and life-giving Spirit, now and forever, and to the ages of ages.
